BLOCK SPINFO
   1   SPheno
   2   v4.0.5be

BLOCK SPHENOINFO
   1   2
   2   2

BLOCK MODSEL
   1   0

BLOCK MINPAR
   3    31.257413
   4   -1

BLOCK EXTPAR
   0    1199.8196
   1    1108.7209
   2   -180.16025
   3    3000
   11    3640.2226
   12   -60.807674
   13   -1764.5398
   23   -217.9698
   25    30.392183
   26    997.1538
   31    1428.8651
   32    1428.8651
   33    280.18207
   34    452.64071
   35    452.64071
   36    323.5418
   41    5000
   42    5000
   43    1507.5216
   44    5000
   45    5000
   46    1196.1403
   47    5000
   48    5000
   49    1360.2233

BLOCK SMINPUTS
   1    127.90897
   2    1.1663787e-05
   3    0.1184
   4    91.1876
   5    4.18
   6    173.2
   7    1.777
   8    0
   11    0.00051099893
   12    0
   13    0.10565837
   14    0
   21    0.005
   22    0.0025
   23    0.095
   24    1.27

BLOCK GAUGE Q=  1199.8196
   1    0.35536298
   2    0.66519887
   3    1.219778

BLOCK YU Q=  1199.8196
   1   1    8.3889095e-06
   2   2    0.004261566
   3   3    1.0134476

BLOCK YD Q=  1199.8196
   1   1    0.00051232749
   2   2    0.0097342222
   3   3    0.50806832

BLOCK YE Q=  1199.8196
   1   1    8.9404893e-05
   2   2    0.018486096
   3   3    0.31090573

BLOCK AU Q=  1199.8196
   1   1    0
   2   2    0
   3   3    3640.2227

BLOCK AD Q=  1199.8196
   1   1    0
   2   2    0
   3   3   -60.807677

BLOCK AE Q=  1199.8196
   1   1    0
   2   2    0
   3   3   -1764.5398

BLOCK MSOFT Q=  1199.8196
   1    1108.7209
   2   -180.16025
   3    3000
   21    977138.67
   22    27044.406
   31    1428.8651
   32    1428.8651
   33    280.18207
   34    452.64071
   35    452.64071
   36    323.5418
   41    5000
   42    5000
   43    1507.5216
   44    5000
   45    5000
   46    1196.1403
   47    5000
   48    5000
   49    1360.2233

BLOCK MASS
   6    173.2
   23    91.1876
   24    80.429995
   15    1.777
   25    125.69451
   35    996.71784
   36    997.1538
   37    1001.1202
   1000001    5019.6651
   2000001    5008.8283
   1000002    5019.2358
   2000002    5009.7084
   1000003    5019.6685
   2000003    5008.8337
   1000004    5019.2391
   2000004    5009.7095
   1000005    1327.5046
   2000005    1424.5717
   1000006    946.42675
   2000006    1521.0549
   1000011    1432.0548
   2000011    465.98055
   1000012    1429.5336
   1000013    1432.0501
   2000013    465.96072
   1000014    1429.5288
   1000015    274.11342
   2000015    332.06732
   1000016    267.02997
   1000021    3171.1947
   1000022   -151.74811
   1000023    227.23214
   1000025   -270.26883
   1000035    1104.0439
   1000024    154.27057
   1000037    275.20615

BLOCK ALPHA
      -0.03289074

BLOCK HMIX Q=  1199.8196
   1   -217.9698
   2    30.392183
   3    244.17203
   4    994315.69

BLOCK STOPMIX
   1   1   -0.43427199
   1   2    0.90078179
   2   1   -0.90078179
   2   2   -0.43427199

BLOCK SBOTMIX
   1   1   -0.064522364
   1   2    0.99791626
   2   1   -0.99791626
   2   2   -0.064522364

BLOCK STAUMIX
   1   1   -0.96267587
   1   2    0.27065692
   2   1   -0.27065692
   2   2   -0.96267587

BLOCK NMIX
   1   1   -0.013856923
   1   2   -0.75588974
   1   3   -0.5352981
   1   4    0.37668902
   2   1    0.034476065
   2   2    0.13267975
   2   3   -0.68903348
   2   4   -0.71164623
   3   1   -0.019439204
   3   2    0.64110848
   3   3   -0.4885099
   3   4    0.59157427
   4   1    0.99912037
   4   2   -0.0025882198
   4   3    0.0068473575
   4   4    0.041290566

BLOCK UMIX
   1   1   -0.6940828
   1   2   -0.71989518
   2   1   -0.71989518
   2   2    0.6940828

BLOCK VMIX
   1   1    0.85677474
   1   2    0.51569084
   2   1    0.51569084
   2   2   -0.85677474

BLOCK HIGGSBOUNDSINPUTHIGGSCOUPLINGSFERMIONS
       0, 923.68481,3,36,15,15

BLOCK HIGGSBOUNDSINPUTHIGGSCOUPLINGSBOSONS
       0,4,36,21,21,23

BLOCK SPHENOLOWENERGY
   1    0.00030759382
   2    1.5895356e-06
   3    3.5189377e-05
   4    4.2588351e-15
   5    1.8192113e-10
   6    3.7423653e-08
   7    1.4553974e-13
   8    6.2170628e-09
   9    1.2959278e-06
   10    9.2228038e-05
   11    0.95268032
   12    0.54301544
   13    19.385846
   14    0
   15    0
   16    0.0021613815
   17    2.2817056e-15
   18    2.4752823e-11
   19    8.2791843e-11
   20    7.9847391e-15
   21    3.4137174e-10
   22    3.7922052e-07
   23    0
   24    0
   25    0
   26    0
   27    0
   28    0
   29    0
   30    0
   31    0
   39    0.00018349789
   40    0
   41    0
   42    0

BLOCK FWCOEF Q=  160
   305   4422   0   0   -0.18881911
   305   4422   0   2   -0.1669883
   305   4322   0   2   -0.00035303873
   305   6421   0   0   -0.095227835
   305   6421   0   2   -0.1092093
   305   6321   0   2   -0.00065061584
   3051111   4133   0   0    1.5840813
   3051111   4133   0   2    1.5855939
   3051111   4233   0   2    3.0277521e-05
   3051111   4137   0   0   -4.4067734
   3051111   4137   0   2   -4.398827
   3051111   4237   0   2   -0.00023552773
   3051313   4133   0   0    1.5840813
   3051313   4133   0   2    1.5855919
   3051313   4233   0   2    3.0272019e-05
   3051313   4137   0   0   -4.4067734
   3051313   4137   0   2   -4.398829
   3051313   4237   0   2   -0.00023552407
   3051212   4137   0   0    1.5053501
   3051212   4137   0   2    1.5036383
   3051212   4237   0   2    5.1423084e-05
   3051414   4137   0   0    1.5053501
   3051414   4137   0   2    1.5036383
   3051414   4237   0   2    5.1424164e-05
   3051616   4137   0   0    1.5053501
   3051616   4137   0   2    1.5036447
   3051616   4237   0   2    5.1728627e-05

BLOCK IMFWCOEF Q=  160
   305   4422   0   0    3.8585611e-07
   305   4422   0   2    1.5178849e-05
   305   4322   0   2    5.3412848e-06
   305   6421   0   0    3.3051127e-07
   305   6421   0   2    8.0551467e-06
   305   6321   0   2    2.059645e-06
   3051111   4133   0   2    8.162855e-08
   3051111   4233   0   2    2.6600158e-06
   3051111   4137   0   2    9.0493382e-06
   3051111   4237   0   2   -2.0933415e-05
   3051313   4133   0   2    8.1605869e-08
   3051313   4233   0   2    2.660006e-06
   3051313   4137   0   2    9.0493437e-06
   3051313   4237   0   2   -2.0933438e-05
   3051212   4137   0   2   -1.569369e-06
   3051212   4237   0   2    4.5703711e-06
   3051414   4137   0   2   -1.5693685e-06
   3051414   4237   0   2    4.5703711e-06
   3051616   4137   0   2   -1.4780408e-06
   3051616   4237   0   2    4.5703763e-06

DECAY 23  2.4952


DECAY 24  2.085


DECAY 2000011  0.0023657689
    0.68341369   2    1000023    11
    0.16469408   2    1000025    11
    0.15187297   2    1000022    11

DECAY 1000011  18.344415
    0.33032528   2   -1000037    12
    0.32342421   2   -1000024    12
    0.19571881   2    1000022    11
    0.12712622   2    1000025    11
    0.015950862   2    1000035    11
    0.0074546101   2    1000023    11

DECAY 2000013  0.0062463566
    0.39879711   2    1000023    13
    0.20837131   2   -1000024    14
    0.17361965   2    1000022    13
    0.11561418   2    1000025    13
    0.10359775   2   -1000037    14

DECAY 1000013  18.353722
    0.33015653   2   -1000037    14
    0.3232591   2   -1000024    14
    0.19576767   2    1000022    13
    0.12717879   2    1000025    13
    0.015942424   2    1000035    13
    0.0076900571   2    1000023    13

DECAY 1000015  1.1426104
    0.5683271   2   -1000024    16
    0.41077766   2    1000022    15
    0.020737448   2    1000023    15
    0.00015777063   2    1000025    15

DECAY 2000015  0.27229256
    0.35858857   2    1000023    15
    0.27075627   2   -1000037    16
    0.14719311   2    1000025    15
    0.12219719   2   -1000024    16
    0.10040311   2    1000022    15
    0.00036558507   3    1000016    1   -2
    0.00036513398   3    1000016    3   -4

DECAY 1000012  18.428877
    0.48965141   2    1000024    11
    0.18699251   2    1000022    12
    0.16838533   2    1000037    11
    0.13474209   2    1000025    12
    0.015993475   2    1000035    12
    0.004235193   2    1000023    12

DECAY 1000014  18.438066
    0.48967213   2    1000024    13
    0.18689867   2    1000022    14
    0.16853658   2    1000037    13
    0.13467442   2    1000025    14
    0.015985135   2    1000035    14
    0.0042330666   2    1000023    14

DECAY 1000016  1.179923
    0.74319416   2    1000024    15
    0.25581613   2    1000022    16
    0.00098970547   2    1000023    16

DECAY 2000001  144.4633
    0.98247467   2    1000021    1
    0.017491071   2    1000035    1

DECAY 1000001  209.7207
    0.68214845   2    1000021    1
    0.10854013   2   -1000037    2
    0.10131374   2   -1000024    2
    0.059692465   2    1000022    1
    0.043516657   2    1000025    1
    0.0031084735   2    1000035    1
    0.0016800763   2    1000023    1

DECAY 2000003  144.48263
    0.98234716   2    1000021    3
    0.017488757   2    1000035    3

DECAY 1000003  209.7323
    0.68211239   2    1000021    3
    0.10854055   2   -1000037    4
    0.10131047   2   -1000024    4
    0.059702078   2    1000022    3
    0.043524948   2    1000025    3
    0.0031083059   2    1000035    3
    0.0017012564   2    1000023    3

DECAY 1000005  12.999417
    0.29801623   2   -1000024    6
    0.23009651   2    1000023    5
    0.18657701   2   -1000037    6
    0.17182536   2    1000022    5
    0.097454621   2    1000025    5
    0.010654955   2    1000006   -24
    0.0053753102   2    1000035    5

DECAY 2000005  113.19793
    0.54401541   2    1000006   -24
    0.23465713   2   -1000037    6
    0.10690405   2   -1000024    6
    0.045717445   2    1000022    5
    0.037864827   2    1000025    5
    0.030542693   2    1000023    5
    0.00029514608   2    1000035    5

DECAY 2000002  152.15221
    0.93342851   2    1000021    2
    0.066442741   2    1000035    2

DECAY 1000002  209.72046
    0.68193589   2    1000021    2
    0.15436275   2    1000024    1
    0.060471869   2    1000022    2
    0.055692155   2    1000037    1
    0.042583203   2    1000025    2
    0.0029324448   2    1000035    2
    0.002021696   2    1000023    2

DECAY 2000004  152.15587
    0.93340641   2    1000021    4
    0.066441178   2    1000035    4

DECAY 1000004  209.73199
    0.68189976   2    1000021    4
    0.15437763   2    1000024    3
    0.06046981   2    1000022    4
    0.055710685   2    1000037    3
    0.042583871   2    1000025    4
    0.0029322972   2    1000035    4
    0.0020259517   2    1000023    4

DECAY 1000006  34.001426
    0.28375659   2    1000024    5
    0.26909348   2    1000023    6
    0.19666319   2    1000037    5
    0.1393837   2    1000022    6
    0.11081297   2    1000025    6
    0.00024244065   2    1000022    4

DECAY 2000006  117.01797
    0.3461226   2    1000006    23
    0.17790089   2    1000006    25
    0.13840574   2    1000037    5
    0.13013295   2    1000025    6
    0.11581858   2    1000023    6
    0.048246649   2    1000024    5
    0.036115821   2    1000022    6
    0.0051587028   2    2000005    24
    0.0013950279   2    1000035    6
    0.00070304954   2    1000005    24

DECAY 1000024  6.9646245e-10
    0.50714705   3    1000022   -1    2
    0.16941905   3    1000022   -11    12
    0.16794968   3    1000022   -13    14
    0.14340527   3    1000022   -3    4
    0.012078956   3    1000022   -15    16

DECAY 1000037  0.79613281
    0.80283027   2    1000022    24
    0.19533065   2    1000024    23
    0.0015145445   2    1000016   -15

DECAY 1000022 -1


DECAY 1000023  0.0092179794
    0.12189005   3    1000022    12   -12
    0.090241093   3    1000022    1   -1
    0.090240096   3    1000022    3   -3
    0.088381724   3    1000022    5   -5
    0.070387516   3    1000022    2   -2
    0.070203669   3    1000022    4   -4
    0.066967278   3    1000024    1   -2
    0.066967278   3   -1000024   -1    2
    0.066911315   3    1000024    3   -4
    0.066911315   3   -1000024   -3    4
    0.022926157   3    1000024    15   -16
    0.022926157   3   -1000024   -15    16
    0.022329919   3    1000024    11   -12
    0.022329919   3   -1000024   -11    12
    0.022329912   3    1000024    13   -14
    0.022329912   3   -1000024   -13    14
    0.021260452   3    1000022    15   -15
    0.020350878   3    1000022    13   -13
    0.020350403   3    1000022    11   -11
    0.0037649588   2    1000022    22

DECAY 1000025  1.5817794
    0.49845075   2    1000024   -24
    0.49845075   2   -1000024    24
    0.0026455532   2    1000022    23

DECAY 1000035  17.720947
    0.12216156   2    2000015   -15
    0.12216156   2   -2000015    15
    0.10554087   2    2000013   -13
    0.10554087   2   -2000013    13
    0.10553696   2    2000011   -11
    0.10553696   2   -2000011    11
    0.041615036   2    1000015   -15
    0.041615036   2   -1000015    15
    0.034961733   2    1000016   -16
    0.034961733   2   -1000016    16
    0.026077833   2    1000023    25
    0.024967998   2    1000037   -24
    0.024967998   2   -1000037    24
    0.017429323   2    1000025    25
    0.016736743   2    1000025    23
    0.01465695   2    1000024   -24
    0.01465695   2   -1000024    24
    0.013928005   2    1000023    23
    0.0099589368   2    1000022    25
    0.0090630187   2    1000022    23
    0.0018882255   3    1000023    6   -6
    0.0009944096   3    1000024    5   -6
    0.0009944096   3   -1000024   -5    6
    0.00091719665   3    1000022    6   -6
    0.00085395647   3    1000025    6   -6
    0.00083959533   3    1000037    5   -6
    0.00083959533   3   -1000037   -5    6
    0.000100706   3    1000037    15   -16
    0.000100706   3   -1000037   -15    16

DECAY 1000021  258.51285
    0.16463091   2    1000006   -6
    0.16463091   2   -1000006    6
    0.12354893   2    1000005   -5
    0.12354893   2   -1000005    5
    0.11562185   2    2000005   -5
    0.11562185   2   -2000005    5
    0.095500325   2    2000006   -6
    0.095500325   2   -2000006    6
    0.00054608693   2    1000006   -4
    0.00054608693   2   -1000006    4
    0.00012732385   3    1000035    6   -6

DECAY 25  0.0040380712
    0.57089561   2   -5    5
    0.23603525   2   -24    24
    0.0673233   2    21    21
    0.065826218   2   -15    15
    0.028965854   2    23    23
    0.026607109   2   -4    4
    0.0023537558   2    22    22
    0.0015523581   2    22    23
    0.00022664839   2   -13    13
    0.00021316871   2   -3    3
    5.8938733e-07   2   -1    1
    1.3710782e-07   2   -2    2
    5.0952989e-09   2   -11    11

DECAY 35  33.264593
    0.47595856   2   -5    5
    0.076663633   2   -1000024    1000024
    0.066014167   2   -15    15
    0.058022768   2   -1000024    1000037
    0.058022768   2   -1000037    1000024
    0.049165961   2   -2000015    1000015
    0.049165961   2   -1000015    2000015
    0.032924397   2    1000022    1000022
    0.027544873   2    1000022    1000023
    0.026270791   2    1000023    1000025
    0.024980991   2   -1000015    1000015
    0.022680609   2   -2000015    2000015
    0.015278448   2   -1000037    1000037
    0.013673927   2    1000025    1000025
    0.0014631528   2   -6    6
    0.0012483525   2    1000023    1000023
    0.00049010777   2    1000022    1000025
    0.00020828071   2   -13    13
    0.00014476769   2   -3    3
    3.3361099e-05   2    25    25
    2.8030831e-05   2    21    21
    6.9477787e-06   2   -24    24
    5.157139e-06   2    23    23
    6.1640498e-07   2    22    23
    4.0022427e-07   2   -1    1
    2.2579251e-07   2   -1000011    1000011
    2.2444895e-07   2   -1000013    1000013
    1.7476859e-07   2    22    22
    2.049569e-08   2   -4    4
    4.6794489e-09   2   -11    11
    1.0568127e-13   2   -2    2

DECAY 36  32.511255
    0.46653961   2   -5    5
    0.092230472   2   -1000024    1000024
    0.07471698   2   -2000015    1000015
    0.07471698   2   -1000015    2000015
    0.064709669   2   -15    15
    0.046431968   2   -1000024    1000037
    0.046431968   2   -1000037    1000024
    0.040088723   2    1000022    1000022
    0.027738662   2   -1000037    1000037
    0.0226917   2    1000025    1000025
    0.020852886   2    1000022    1000023
    0.018577786   2    1000023    1000025
    0.0015639863   2   -6    6
    0.0014026215   2    1000023    1000023
    0.00090234788   2    1000022    1000025
    0.00020416197   2   -13    13
    0.00014189728   2   -3    3
    4.8235646e-05   2    21    21
    7.6796347e-06   2    23    25
    8.4943352e-07   2    22    23
    4.0238553e-07   2    22    22
    3.922886e-07   2   -1    1
    1.9159737e-08   2   -4    4
    4.5869154e-09   2   -11    11
    9.8838585e-14   2   -2    2
    2.2469098e-38   2    25    25

DECAY 37  31.620785
    0.45949528   2   -5    6
    0.14072112   2   -2000015    1000016
    0.12334444   2    1000022    1000037
    0.093600987   2    1000024    1000025
    0.073534581   2    1000023    1000024
    0.061860356   2   -15    16
    0.031591836   2    1000023    1000037
    0.014232002   2   -1000015    1000016
    0.00070751903   2   -5    4
    0.00047123009   2    1000025    1000037
    0.00021869966   2   -13    14
    0.00013831999   2   -3    4
    6.1499985e-05   2    1000022    1000024
    8.0423537e-06   2    24    25
    6.3888709e-06   2   -3    2
    5.0524304e-06   2   -5    2
    2.1453058e-06   2   -3    6
    3.8368088e-07   2   -1    2
    8.9620158e-08   2   -1    6
    1.8536881e-08   2   -1    4
    5.115408e-09   2   -11    12
    7.0880595e-11   2    24    35
    4.2095035e-11   2    24    36

DECAY 6  2.43
    1   2    5    24

DECAY 15 -1
