BLOCK DCINFO
   1   SDECAY/HDECAY
   2   1.3b /3.4

BLOCK SPINFO
   1   SOFTSUSY
   2   3.4.0

BLOCK MODSEL
   1   0

BLOCK SMINPUTS
   1    127.90897
   2    1.1663787e-05
   3    0.1184
   4    91.1876
   5    4.18
   6    173.2
   7    1.777

BLOCK MINPAR
   3    8.29

BLOCK EXTPAR
   0   -1
   1    3301.87
   2   -507.84
   3    3696.45
   11   -2977.08
   12   -2622.16
   13    3665.24
   23    358.87
   26    2692.59
   31    1335.63
   32    1335.63
   33    2008.1
   34    1762.99
   35    1762.99
   36    2699.58
   41    2441.91
   42    2441.91
   43    2074.86
   44    2978.89
   45    2978.89
   46    3476.55
   47    2727.82
   48    2727.82
   49    696.36

BLOCK MASS
   24    80.375858
   25    124.23089
   35    2692.7094
   36    2692.5899
   37    2694.18
   5    4.8187603
   1000001    2546.5727
   2000001    2826.7386
   1000002    2545.4701
   2000002    3077.6092
   1000003    2546.5727
   2000003    2826.7386
   1000004    2545.4701
   2000004    3077.6092
   1000005    840.72268
   2000005    2158.74
   1000006    2156.4891
   2000006    3522.3383
   1000011    1342.5113
   2000011    1776.3648
   1000012    1339.8971
   1000013    1342.5113
   2000013    1776.3648
   1000014    1339.8971
   1000015    2014.4954
   2000015    2710.1824
   1000016    2012.6468
   1000021    3703.2597
   1000022   -360.39858
   1000023    377.25504
   1000025   -550.77357
   1000035    3258.3223
   1000024    364.50643
   1000037    551.30156

BLOCK NMIX
   1   1   -0.0068010575
   1   2   -0.26342786
   1   3    0.69758444
   1   4    0.66628482
   2   1   -0.011761479
   2   2   -0.069483194
   2   3   -0.70263569
   2   4    0.70805144
   3   1   -0.0024143869
   3   2    0.96217346
   3   3    0.14024591
   3   4    0.23355403
   4   1    0.99990479
   4   2   -0.00028578134
   4   3   -0.0031814177
   4   4    0.013424341

BLOCK UMIX
   1   1   -0.20306033
   1   2    0.97916623
   2   1   -0.97916623
   2   2   -0.20306033

BLOCK VMIX
   1   1    0.33640721
   1   2    0.94171662
   2   1    0.94171662
   2   2   -0.33640721

BLOCK STOPMIX
   1   1    0.99842564
   1   2    0.056091438
   2   1   -0.056091438
   2   2    0.99842564

BLOCK SBOTMIX
   1   1    0.0033397889
   1   2    0.99999442
   2   1   -0.99999442
   2   2    0.0033397889

BLOCK STAUMIX
   1   1    0.99999992
   1   2   -0.00039999999
   2   1    0.00039999999
   2   2    0.99999992

BLOCK ALPHA
      -0.12613847

BLOCK HMIX Q=  2687.136
   1    363.56248
   2    7.9100495
   3    241.78447
   4    7177318.2

BLOCK GAUGE Q=  2687.136
   1    0.36480278
   2    0.64107662
   3    1.009707

BLOCK AU Q=  2687.136
   1   1    0
   2   2    0
   3   3   -2977.08

BLOCK AD Q=  2687.136
   1   1    0
   2   2    0
   3   3   -2622.16

BLOCK AE Q=  2687.136
   1   1    0
   2   2    0
   3   3    3665.24

BLOCK YU Q=  2687.136
   1   1    0
   2   2    0
   3   3    0.82641688

BLOCK YD Q=  2687.136
   1   1    0
   2   2    0
   3   3    0.10500775

BLOCK YE Q=  2687.136
   1   1    0
   2   2    0
   3   3    0.081217193

BLOCK MSOFT Q=  2687.136
   1    3301.87
   2   -507.84
   3    3696.45
   21    6982874.3
   22    103816.77
   31    1335.63
   32    1335.63
   33    2008.1
   34    1762.99
   35    1762.99
   36    2699.58
   41    2441.91
   42    2441.91
   43    2074.86
   44    2978.89
   45    2978.89
   46    3476.55
   47    2727.82
   48    2727.82
   49    696.35995

BLOCK HIGGSBOUNDSINPUTHIGGSCOUPLINGSFERMIONS
       0, 62.568883,3,36,15,15

BLOCK HIGGSBOUNDSINPUTHIGGSCOUPLINGSBOSONS
       0,4,36,21,21,23

DECAY 6  1.4480393
    1   2    5    24

DECAY 1000021  240.13751
    0.13060575   2    1000005   -5
    0.13060575   2   -1000005    5
    0.063679574   2    2000005   -5
    0.063679574   2   -2000005    5
    0.062694685   2    1000006   -6
    0.062694685   2   -1000006    6
    0.040864542   2    1000002   -2
    0.040864542   2   -1000002    2
    0.040864514   2    1000004   -4
    0.040864514   2   -1000004    4
    0.040801139   2    1000001   -1
    0.040801139   2   -1000001    1
    0.040801139   2    1000003   -3
    0.040801139   2   -1000003    3
    0.025577304   2    2000001   -1
    0.025577304   2   -2000001    1
    0.025577304   2    2000003   -3
    0.025577304   2   -2000003    3
    0.014051998   2    2000002   -2
    0.014051998   2   -2000002    2
    0.014051958   2    2000004   -4
    0.014051958   2   -2000004    4
    0.0004300892   2    2000006   -6
    0.0004300892   2   -2000006    6

DECAY 1000006  50.89394
    0.2818736   2    1000037    5
    0.26687684   2    1000023    6
    0.24165806   2    1000022    6
    0.1769032   2    1000025    6
    0.031848424   2    1000024    5
    0.0008398756   2    1000005    24

DECAY 2000006  135.88385
    0.31430643   2    1000024    5
    0.17281722   2    1000023    6
    0.15585203   2    1000022    6
    0.15500654   2    2000005    24
    0.079637078   2    1000006    23
    0.078415075   2    1000006    25
    0.029148362   2    1000037    5
    0.013846488   2    1000025    6
    0.00096480332   2    1000035    6
    5.9785482e-06   2    1000005    24

DECAY 1000005  0.22233536
    0.45692514   2   -1000024    6
    0.27182565   2    1000022    5
    0.26060003   2    1000023    5
    0.0063339511   2   -1000037    6
    0.0043152295   2    1000025    5

DECAY 2000005  50.909765
    0.48443912   2   -1000024    6
    0.3535808   2   -1000037    6
    0.1405793   2    1000025    5
    0.015499237   2    1000022    5
    0.0050669344   2    1000023    5
    0.00043415257   2    1000005    23
    0.00040045542   2    1000005    25

DECAY 1000002  28.447829
    0.58788759   2    1000037    1
    0.30661818   2    1000025    2
    0.07916755   2    1000024    1
    0.024533068   2    1000022    2
    0.0017936106   2    1000023    2

DECAY 2000002  0.1314788
    0.66041828   3    2    5   -1000005
    0.21287083   3    2   -5    1000005
    0.022672097   3    2   -5    2000005
    0.019571977   3    2   -6    1000006
    0.011738775   3    2    5   -2000005
    0.010086798   3    2    6   -1000006
    0.0072744379   2    1000023    2
    0.0060049227   3    2    24   -1000024
    0.0035839239   3    2    25    1000023
    0.0032712499   3    2    23    1000022
    0.0026641558   3    2   -24    1000024
    0.0026421751   3    2    13   -2000013
    0.0026300058   3    2    11   -2000011
    0.002438653   2    1000022    2
    0.0021528186   3    2   -2    1000002
    0.0021510693   3    2   -1    1000001
    0.0021439959   3    2   -4    1000004
    0.0021072599   3    2   -3    1000003
    0.0017007305   3    2   -12    1000012
    0.0016958628   3    2   -11    1000011
    0.0016817921   3    2   -13    1000013
    0.001678978   3    2   -14    1000014
    0.0016703073   3    2   -11    2000011
    0.0016256614   3    2   -13    2000013
    0.0012828685   3    2    3   -1000003
    0.0012745021   3    2    2   -1000002
    0.0012655273   3    2    1   -1000001
    0.0012646906   3    2    4   -1000004
    0.0012348759   3    2    23    1000023
    0.0010623006   3    2    25    1000022
    0.00092783022   3    2    12   -1000012
    0.0009218977   3    2    14   -1000014
    0.00091497643   3    2    11   -1000011
    0.00091436797   3    2    13   -1000013
    0.0005581052   3    2    24   -1000037
    0.0003308138   3    2   -16    1000016
    0.00032751289   3    2   -15    1000015
    0.0002619662   3    2    23    1000025
    0.00022087972   3    2    16   -1000016
    0.00021960956   3    2    15   -1000015
    0.00017270465   3    2   -24    1000037
    9.4463901e-05   3    2    25    1000025
    7.1165087e-05   3    2    3   -2000003
    7.0684401e-05   3    2    1   -2000001
    4.6492668e-05   3    2   -1    2000001
    4.486655e-05   3    2   -3    2000003
    2.2167073e-05   3    2    15   -2000015
    1.7969437e-05   3    2   -15    2000015
    5.5669813e-09   3    2    36    1000022
    2.4892987e-09   3    2   -37    1000024
    2.142779e-09   3    2    37   -1000024
    1.104893e-10   3    2    35    1000023
    1.0030515e-10   3    2    35    1000022
    7.7084673e-13   3    2    36    1000023

DECAY 1000001  28.383669
    0.63732499   2   -1000037    2
    0.30804839   2    1000025    1
    0.028922764   2   -1000024    2
    0.02412222   2    1000022    1
    0.0015816354   2    1000023    1

DECAY 2000001  0.068709305
    0.76001351   3    1    5   -1000005
    0.20339312   3    1   -5    1000005
    0.008976659   3    1   -5    2000005
    0.0067792856   3    1   -6    1000006
    0.0041260787   3    1    5   -2000005
    0.0031979916   2    1000023    1
    0.0030535893   3    1    6   -1000006
    0.0017622067   3    1    24   -1000024
    0.0010726199   2    1000022    1
    0.00098899269   3    1    25    1000023
    0.00090386593   3    1    23    1000022
    0.00066423318   3    1   -24    1000024
    0.00036583109   3    1    13   -2000013
    0.00036062074   3    1    11   -2000011
    0.00033691216   3    1   -13    1000013
    0.00033583516   3    1   -14    1000014
    0.00033417599   3    1   -12    1000012
    0.00033202199   3    1   -11    1000011
    0.00031566321   3    1    23    1000023
    0.00029055744   3    1    25    1000022
    0.00019362734   3    1   -11    2000011
    0.00019247757   3    1   -13    2000013
    0.00017079201   3    1   -2    1000002
    0.00016743002   3    1   -4    1000004
    0.0001670225   3    1   -3    1000003
    0.00016596005   3    1   -1    1000001
    0.00015786799   3    1    24   -1000037
    0.00015072194   3    1    12   -1000012
    0.00015044542   3    1    14   -1000014
    0.00014926654   3    1    13   -1000013
    0.00014743272   3    1    11   -1000011
    8.9618139e-05   3    1    2   -1000002
    8.9089826e-05   3    1    4   -1000004
    8.7721743e-05   3    1    1   -1000001
    8.7346248e-05   3    1    3   -1000003
    6.5461294e-05   3    1    23    1000025
    3.4005583e-05   3    1   -24    1000037
    3.317018e-05   3    1   -16    1000016
    3.2448298e-05   3    1   -15    1000015
    2.6348687e-05   3    1    25    1000025
    1.9099306e-05   3    1    16   -1000016
    1.8834421e-05   3    1    15   -1000015
    2.2465662e-08   3    1    15   -2000015
    1.5945439e-08   3    1   -15    2000015

DECAY 1000004  28.521592
    0.58783412   2    1000037    3
    0.30659074   2    1000025    4
    0.079227993   2    1000024    3
    0.024552278   2    1000022    4
    0.0017948665   2    1000023    4

DECAY 2000004  0.13169732
    0.66033236   3    4    5   -1000005
    0.21300358   3    4   -5    1000005
    0.022761284   3    4   -5    2000005
    0.019450662   3    4   -6    1000006
    0.011763338   3    4    5   -2000005
    0.010054874   3    4    6   -1000006
    0.0073808047   2    1000023    4
    0.0059932125   3    4    24   -1000024
    0.0035762308   3    4    25    1000023
    0.0032657461   3    4    23    1000022
    0.0026547997   3    4   -24    1000024
    0.0026452323   3    4    13   -2000013
    0.0026446249   3    4    11   -2000011
    0.0024745125   2    1000022    4
    0.0021389958   3    4   -1    1000001
    0.0021317063   3    4   -3    1000003
    0.0021257077   3    4   -2    1000002
    0.0021170515   3    4   -4    1000004
    0.0016960862   3    4   -12    1000012
    0.0016872022   3    4   -11    1000011
    0.0016799128   3    4   -13    1000013
    0.0016784701   3    4   -14    1000014
    0.0016402005   3    4   -11    2000011
    0.0016237233   3    4   -13    2000013
    0.0012696538   3    4    3   -1000003
    0.0012666925   3    4    2   -1000002
    0.0012613773   3    4    1   -1000001
    0.001260542   3    4    4   -1000004
    0.0012335103   3    4    23    1000023
    0.0010601583   3    4    25    1000022
    0.00092636664   3    4    12   -1000012
    0.00091846974   3    4    14   -1000014
    0.00091581213   3    4    13   -1000013
    0.00091080064   3    4    11   -1000011
    0.00055874335   3    4    24   -1000037
    0.00033080401   3    4   -16    1000016
    0.00032721244   3    4   -15    1000015
    0.00026030143   3    4    23    1000025
    0.0002206499   3    4    16   -1000016
    0.00021878958   3    4    15   -1000015
    0.00017247884   3    4   -24    1000037
    9.4254009e-05   3    4    25    1000025
    7.2219391e-05   3    4    3   -2000003
    7.0731889e-05   3    4    1   -2000001
    4.5848315e-05   3    4   -1    2000001
    4.425299e-05   3    4   -3    2000003
    2.2068787e-05   3    4    15   -2000015
    1.7928232e-05   3    4   -15    2000015
    5.5086164e-09   3    4    36    1000022
    2.4646668e-09   3    4   -37    1000024
    2.1059655e-09   3    4    37   -1000024
    1.0283429e-10   3    4    35    1000023
    9.7906323e-11   3    4    35    1000022
    6.8113765e-13   3    4    36    1000023

DECAY 1000003  28.456778
    0.63729445   2   -1000037    4
    0.30803447   2    1000025    3
    0.028946092   2   -1000024    4
    0.024142175   2    1000022    3
    0.0015828128   2    1000023    3

DECAY 2000003  0.06871268
    0.76001984   3    3    5   -1000005
    0.20335402   3    3   -5    1000005
    0.0089698146   3    3   -5    2000005
    0.0067789526   3    3   -6    1000006
    0.0041308242   3    3    5   -2000005
    0.0032299534   2    1000023    3
    0.0030534393   3    3    6   -1000006
    0.0017535337   3    3    24   -1000024
    0.0010834288   2    1000022    3
    0.00098894411   3    3    25    1000023
    0.00090382153   3    3    23    1000022
    0.00066420055   3    3   -24    1000024
    0.00036581312   3    3    13   -2000013
    0.00036411038   3    3    11   -2000011
    0.00033689561   3    3   -13    1000013
    0.00033581866   3    3   -14    1000014
    0.00033415957   3    3   -12    1000012
    0.00033200568   3    3   -11    1000011
    0.00031564771   3    3    23    1000023
    0.00029054317   3    3    25    1000022
    0.00019361783   3    3   -11    2000011
    0.00019246812   3    3   -13    2000013
    0.00017078362   3    3   -2    1000002
    0.00016742179   3    3   -4    1000004
    0.00016697064   3    3   -3    1000003
    0.00016633029   3    3   -1    1000001
    0.00015786024   3    3    24   -1000037
    0.00015071454   3    3    12   -1000012
    0.00015043803   3    3    14   -1000014
    0.0001492592   3    3    13   -1000013
    0.00014671237   3    3    11   -1000011
    8.9389615e-05   3    3    2   -1000002
    8.8301024e-05   3    3    4   -1000004
    8.7529696e-05   3    3    1   -1000001
    8.7343413e-05   3    3    3   -1000003
    6.5458078e-05   3    3    23    1000025
    3.4003913e-05   3    3   -24    1000037
    3.2864385e-05   3    3   -16    1000016
    3.2446704e-05   3    3   -15    1000015
    2.6347393e-05   3    3    25    1000025
    1.9098367e-05   3    3    16   -1000016
    1.8833496e-05   3    3    15   -1000015
    2.2464558e-08   3    3    15   -2000015
    1.5944655e-08   3    3   -15    2000015

DECAY 1000011  11.531385
    0.63079024   2   -1000037    12
    0.30390997   2    1000025    11
    0.033676193   2   -1000024    12
    0.029280742   2    1000022    11
    0.0023428557   2    1000023    11

DECAY 2000011  0.0020326725
    0.58368434   2    1000023    11
    0.19678141   2    1000022    11
    0.076805291   3    11    24   -1000024
    0.035491699   3    11    25    1000023
    0.032504499   3    11    23    1000022
    0.021066847   3    11   -24    1000024
    0.015272505   3    11    5   -1000005
    0.013537843   3    11    23    1000023
    0.012844667   3    11    25    1000022
    0.0050598413   3    11    24   -1000037
    0.0025045845   3    11   -5    1000005
    0.0013278578   3    11    23    1000025
    0.0011355002   3    11    25    1000025
    0.00036744238   3    11   -12    1000012
    0.00036424462   3    11   -14    1000014
    0.0003574752   3    11   -11    1000011
    0.00035232435   3    11   -13    1000013
    0.00020880885   3    11   -24    1000037
    8.4327408e-05   3    11    12   -1000012
    8.4017471e-05   3    11    14   -1000014
    8.2266082e-05   3    11    13   -1000013
    8.2207046e-05   3    11    11   -1000011

DECAY 1000013  11.531384
    0.63079024   2   -1000037    14
    0.30390997   2    1000025    13
    0.033676194   2   -1000024    14
    0.029280742   2    1000022    13
    0.0023428557   2    1000023    13

DECAY 2000013  0.0020326726
    0.58368428   2    1000023    13
    0.1967814   2    1000022    13
    0.076805284   3    13    24   -1000024
    0.035491696   3    13    25    1000023
    0.032504496   3    13    23    1000022
    0.021066845   3    13   -24    1000024
    0.015272503   3    13    5   -1000005
    0.013537841   3    13    23    1000023
    0.012844665   3    13    25    1000022
    0.0050598408   3    13    24   -1000037
    0.0025045843   3    13   -5    1000005
    0.0013278577   3    13    23    1000025
    0.0011355001   3    13    25    1000025
    0.00036744234   3    13   -12    1000012
    0.00036424458   3    13   -14    1000014
    0.00035747517   3    13   -11    1000011
    0.00035232432   3    13   -13    1000013
    0.00020880883   3    13   -24    1000037
    8.406174e-05   3    13    12   -1000012
    8.4017464e-05   3    13    14   -1000014
    8.2703922e-05   3    13    11   -1000011
    8.2128325e-05   3    13    13   -1000013

DECAY 1000015  21.500957
    0.62858439   2   -1000037    16
    0.30290416   2    1000025    15
    0.031247485   2    1000022    15
    0.029538119   2   -1000024    16
    0.0077258396   2    1000023    15

DECAY 2000015  0.68754439
    0.47879487   2   -1000024    16
    0.2482463   2    1000023    15
    0.24422575   2    1000022    15
    0.019008239   2   -1000037    16
    0.00917783   2    1000025    15
    0.00025912065   2    1000016   -24
    0.00015633473   2    1000015    25
    0.00013155132   2    1000015    23

DECAY 1000012  11.615499
    0.57719325   2    1000037    11
    0.30236794   2    1000025    12
    0.091523045   2    1000024    11
    0.027339606   2    1000022    12
    0.0015761625   2    1000023    12

DECAY 1000014  11.615498
    0.57719325   2    1000037    13
    0.30236794   2    1000025    14
    0.091523045   2    1000024    13
    0.027339606   2    1000022    14
    0.0015761625   2    1000023    14

DECAY 1000016  21.561249
    0.57949391   2    1000037    15
    0.30321358   2    1000025    16
    0.091805337   2    1000024    15
    0.024086519   2    1000022    16
    0.0014006612   2    1000023    16

DECAY 1000024  1.5038567e-09
    0.35690224   3    1000022    2   -1
    0.35690224   3    1000022    4   -3
    0.11901224   3    1000022   -11    12
    0.11901224   3    1000022   -13    14
    0.048171039   3    1000022   -15    16

DECAY 1000037  1.8202353
    0.28351691   2    1000022    24
    0.26309635   2    1000024    23
    0.25227363   2    1000023    24
    0.2011131   2    1000024    25

DECAY 1000022 -1


DECAY 1000023  2.3305405e-06
    0.1956235   2    1000022    22
    0.080790761   3    1000022   -1    1
    0.080790761   3    1000022   -3    3
    0.06228442   3    1000022   -2    2
    0.06228442   3    1000022   -4    4
    0.053252134   3    1000024   -2    1
    0.053252134   3   -1000024   -1    2
    0.053252134   3    1000024   -4    3
    0.053252134   3   -1000024   -3    4
    0.037047103   3    1000022   -12    12
    0.037047103   3    1000022   -14    14
    0.037044392   3    1000022   -16    16
    0.036337389   3    1000022   -5    5
    0.018526819   3    1000022   -11    11
    0.018526819   3    1000022   -13    13
    0.017751055   3    1000024   -12    11
    0.017751055   3   -1000024    12   -11
    0.017751055   3    1000024   -14    13
    0.017751055   3   -1000024    14   -13
    0.017390405   3    1000022   -15    15
    0.016146675   3    1000024   -16    15
    0.016146675   3   -1000024    16   -15

DECAY 1000025  1.8297134
    0.30100784   2    1000024   -24
    0.30100784   2   -1000024    24
    0.19338785   2    1000023    23
    0.17507203   2    1000022    25
    0.023398823   2    1000022    23
    0.0061256249   2    1000023    25

DECAY 1000035  50.812573
    0.083835289   2    2000011   -11
    0.083835289   2   -2000011    11
    0.083835289   2    2000013   -13
    0.083835289   2   -2000013    13
    0.049296029   2    1000005   -5
    0.049296029   2   -1000005    5
    0.035767015   2    1000024   -24
    0.035767015   2   -1000024    24
    0.032667138   2    1000023    25
    0.029326192   2    1000012   -12
    0.029326192   2   -1000012    12
    0.029326192   2    1000014   -14
    0.029326192   2   -1000014    14
    0.029220821   2    1000011   -11
    0.029220821   2   -1000011    11
    0.029220821   2    1000013   -13
    0.029220821   2   -1000013    13
    0.026595364   2    1000022    23
    0.016247156   2    1000016   -16
    0.016247156   2   -1000016    16
    0.016177931   2    1000015   -15
    0.016177931   2   -1000015    15
    0.01611834   2    2000015   -15
    0.01611834   2   -2000015    15
    0.011250009   2    1000023    23
    0.011107981   2    1000022    25
    0.0044660531   2    2000005   -5
    0.0044660531   2   -2000005    5
    0.0043488388   2    1000006   -6
    0.0043488388   2   -1000006    6
    0.0035895186   2    1000037   -24
    0.0035895186   2   -1000037    24
    0.003516776   2    2000001   -1
    0.003516776   2   -2000001    1
    0.003516776   2    2000003   -3
    0.003516776   2   -2000003    3
    0.0027608496   2    2000002   -2
    0.0027608496   2   -2000002    2
    0.0027607523   2    2000004   -4
    0.0027607523   2   -2000004    4
    0.002677385   2    1000024   -37
    0.002677385   2   -1000024    37
    0.0026028432   2    1000025    23
    0.0021504033   2    1000001   -1
    0.0021504033   2   -1000001    1
    0.0021504033   2    1000003   -3
    0.0021504033   2   -1000003    3
    0.002143208   2    1000002   -2
    0.002143208   2   -1000002    2
    0.0021432039   2    1000004   -4
    0.0021432039   2   -1000004    4
    0.0020975292   2    1000022    36
    0.0020814446   2    1000023    35
    0.0010338448   2    1000025    25
    0.00067279564   2    1000022    35
    0.00061304829   2    1000023    36
    2.918828e-05   2    1000025    36
    2.8827423e-05   2    1000037   -37
    2.8827423e-05   2   -1000037    37
    6.7349292e-07   2    1000025    35

DECAY 25  0.0040242652
    0.61605643   2    5   -5
    0.19235149   2    24   -24
    0.078009543   2    21    21
    0.06428959   2   -15    15
    0.023661195   2    23    23
    0.02144308   2    4   -4
    0.0022652064   2    22    22
    0.0014472135   2    22    23
    0.00024868383   2    3   -3
    0.00022756711   2   -13    13

DECAY 35  33.915238
    0.24286379   2    1000024   -1000037
    0.24286379   2    1000037   -1000024
    0.13857316   2    1000022    1000025
    0.11170855   2    1000023    1000025
    0.073929075   2    1000024   -1000024
    0.057395145   2    5   -5
    0.052095372   2    6   -6
    0.027315208   2    1000037   -1000037
    0.024465203   2    1000022    1000022
    0.013484301   2    1000025    1000025
    0.010343846   2   -15    15
    0.0038408958   2    1000022    1000023
    0.00087875973   2    1000023    1000023
    0.00010962938   2    25    25
    3.6686696e-05   2   -13    13
    2.7264538e-05   2    24   -24
    2.5743285e-05   2    21    21
    2.2691004e-05   2    3   -3
    1.359782e-05   2    23    23
    2.9788821e-06   2    1000005   -1000005
    1.5097979e-06   2    1000012   -1000012
    1.5097979e-06   2    1000014   -1000014
    5.3154469e-07   2    4   -4
    3.5746924e-07   2    1000011   -1000011
    3.5746924e-07   2    1000013   -1000013
    4.0027566e-08   2    23    22
    2.6304975e-09   2    22    22

DECAY 36  33.926918
    0.25699788   2    1000024   -1000037
    0.25699788   2    1000037   -1000024
    0.16219322   2    1000023    1000025
    0.097765163   2    1000022    1000025
    0.059407372   2    1000024   -1000024
    0.057405109   2    5   -5
    0.052331197   2    6   -6
    0.016204341   2    1000022    1000022
    0.013521943   2    1000037   -1000037
    0.010340847   2   -15    15
    0.0082203074   2    1000022    1000023
    0.0068783804   2    1000025    1000025
    0.0015928082   2    1000023    1000023
    5.5972147e-05   2    21    21
    3.6675991e-05   2   -13    13
    2.7588708e-05   2    23    25
    2.2710066e-05   2    3   -3
    5.3300957e-07   2    4   -4
    6.6838379e-08   2    23    22
    4.9247054e-09   2    22    22

DECAY 37  33.730365
    0.30636857   2    1000037    1000022
    0.28346968   2    1000024    1000025
    0.26892787   2    1000037    1000023
    0.10584537   2    6   -5
    0.023604772   2    1000024    1000023
    0.010407247   2   -15    16
    0.0011912301   2    1000024    1000022
    9.1179247e-05   2    4   -5
    3.6911494e-05   2   -13    14
    2.7820466e-05   2    24    25
    2.2988093e-05   2    4   -3
    1.7431748e-06   2   -1000011    1000012
    1.7431748e-06   2   -1000013    1000014
    1.1417942e-06   2    2   -3
    9.1178252e-07   2    2   -5
    8.2308608e-07   2    1000037    1000025
    3.9637885e-13   2    24    36

DECAY 5 -1


DECAY 15 -1


DECAY 23  2.4952


DECAY 24  2.085
