BLOCK SPINFO
   1   SPheno
   2   v4.0.5be

BLOCK SPHENOINFO
   1   2
   2   2

BLOCK MODSEL
   1   0

BLOCK MINPAR
   3    43.974141
   4    1

BLOCK EXTPAR
   0    1753.3256
   1   -67.910056
   2   -942.85396
   3    3000
   11   -2664.3717
   12    825.13647
   13   -273.55115
   23    809.22391
   25    43.013017
   26    1664.169
   31    244.79118
   32    244.79118
   33    692.30766
   34    349.10801
   35    349.10801
   36    1552.0825
   41    5000
   42    5000
   43    1878.6829
   44    5000
   45    5000
   46    1618.8525
   47    5000
   48    5000
   49    1283.3677

BLOCK SMINPUTS
   1    127.90897
   2    1.1663787e-05
   3    0.1184
   4    91.1876
   5    4.18
   6    173.2
   7    1.777
   8    0
   11    0.00051099893
   12    0
   13    0.10565837
   14    0
   21    0.005
   22    0.0025
   23    0.095
   24    1.27

BLOCK GAUGE Q=  1753.3256
   1    0.35536298
   2    0.66519887
   3    1.219778

BLOCK YU Q=  1753.3256
   1   1    8.3866377e-06
   2   2    0.004260412
   3   3    1.0131732

BLOCK YD Q=  1753.3256
   1   1    0.0007248832
   2   2    0.013772781
   3   3    0.71885699

BLOCK YE Q=  1753.3256
   1   1    0.00012649742
   2   2    0.026155654
   3   3    0.43989508

BLOCK AU Q=  1753.3256
   1   1    0
   2   2    0
   3   3   -2664.3716

BLOCK AD Q=  1753.3256
   1   1    0
   2   2    0
   3   3    825.13654

BLOCK AE Q=  1753.3256
   1   1    0
   2   2    0
   3   3   -273.55115

BLOCK MSOFT Q=  1753.3256
   1   -67.910056
   2   -942.85396
   3    3000
   21    2154978
   22   -612750.35
   31    244.79118
   32    244.79118
   33    692.30766
   34    349.10801
   35    349.10801
   36    1552.0825
   41    5000
   42    5000
   43    1878.6829
   44    5000
   45    5000
   46    1618.8525
   47    5000
   48    5000
   49    1283.3677

BLOCK MASS
   6    173.2
   23    91.1876
   24    80.429995
   15    1.777
   25    121.88501
   35    1664.05
   36    1664.169
   37    1666.8825
   1000001    5037.6202
   2000001    5027.4454
   1000002    5037.1667
   2000002    5028.8414
   1000003    5037.6246
   2000003    5027.4475
   1000004    5037.1692
   2000004    5028.842
   1000005    1313.3466
   2000005    1901.8038
   1000006    1584.9632
   2000006    1939.5723
   1000011    279.27371
   2000011    353.70219
   1000012    267.42397
   1000013    278.74886
   2000013    354.04813
   1000014    267.40045
   1000015    702.67869
   2000015    1547.8743
   1000016    700.42846
   1000021    3204.7701
   1000022   -67.230544
   1000023   -801.18777
   1000025    819.18159
   1000035   -993.94248
   1000024    801.87265
   1000037    994.1766

BLOCK ALPHA
      -0.022843534

BLOCK HMIX Q=  1753.3256
   1    809.22391
   2    43.013017
   3    243.85265
   4    2769458.6

BLOCK STOPMIX
   1   1    0.32567909
   1   2    0.94548037
   2   1   -0.94548037
   2   2    0.32567909

BLOCK SBOTMIX
   1   1    0.036664743
   1   2    0.99932762
   2   1   -0.99932762
   2   2    0.036664743

BLOCK STAUMIX
   1   1    0.99951701
   1   2    0.031076484
   2   1   -0.031076484
   2   2    0.99951701

BLOCK NMIX
   1   1   -0.9984928
   1   2    0.0001224387
   1   3   -0.054788963
   1   4   -0.0032061775
   2   1    0.039517656
   2   2    0.30146035
   2   3   -0.68049531
   2   4   -0.66669794
   3   1    0.036416878
   3   2   -0.032040559
   3   3   -0.70514166
   3   4    0.70740543
   4   1   -0.011148585
   4   2    0.95294021
   4   3    0.19157123
   4   4    0.23469369

BLOCK UMIX
   1   1   -0.26615674
   1   2    0.96392977
   2   1   -0.96392977
   2   2   -0.26615674

BLOCK VMIX
   1   1    0.3272798
   1   2    0.94492747
   2   1    0.94492747
   2   2   -0.3272798

BLOCK HIGGSBOUNDSINPUTHIGGSCOUPLINGSFERMIONS
       0, 1850.1196,3,36,15,15

BLOCK HIGGSBOUNDSINPUTHIGGSCOUPLINGSBOSONS
       0,4,36,21,21,23

BLOCK SPHENOLOWENERGY
   1    0.00029911374
   2    1.5921436e-06
   3    3.5215797e-05
   4    2.8595115e-15
   5    1.2215127e-10
   6    2.5344456e-08
   7    9.5416506e-14
   8    4.0760715e-09
   9    8.5742013e-07
   10    9.3966102e-05
   11    0.97063385
   12    0.54227803
   13    19.358996
   14    0
   15    0
   16    0.0021583548
   17    2.2816731e-15
   18    2.4784422e-11
   19    8.2861571e-11
   20   -6.9871849e-14
   21   -2.9991996e-09
   22   -1.3840769e-07
   23    0
   24    0
   25    0
   26    0
   27    0
   28    0
   29    0
   30    0
   31    0
   39    0.0001072026
   40    0
   41    0
   42    0

BLOCK FWCOEF Q=  160
   305   4422   0   0   -0.18881911
   305   4422   0   2   -0.15973283
   305   4322   0   2   -5.9828429e-06
   305   6421   0   0   -0.095227835
   305   6421   0   2   -0.09340694
   305   6321   0   2   -0.00027487885
   3051111   4133   0   0    1.5979833
   3051111   4133   0   2    1.5986364
   3051111   4233   0   2    0.00018240353
   3051111   4137   0   0   -4.4206754
   3051111   4137   0   2   -4.4154048
   3051111   4237   0   2   -0.0014061685
   3051313   4133   0   0    1.5979833
   3051313   4133   0   2    1.5986289
   3051313   4233   0   2    0.00018239866
   3051313   4137   0   0   -4.4206754
   3051313   4137   0   2   -4.4154124
   3051313   4237   0   2   -0.0014061696
   3051212   4137   0   0    1.5053501
   3051212   4137   0   2    1.5042147
   3051212   4237   0   2    0.00030600957
   3051414   4137   0   0    1.5053501
   3051414   4137   0   2    1.5042147
   3051414   4237   0   2    0.0003060103
   3051616   4137   0   0    1.5053501
   3051616   4137   0   2    1.5042153
   3051616   4237   0   2    0.00030621658

BLOCK IMFWCOEF Q=  160
   305   4422   0   0    3.8587831e-07
   305   4422   0   2   -1.3940798e-05
   305   4322   0   2    5.5112289e-06
   305   6421   0   0    3.3053029e-07
   305   6421   0   2   -1.7025232e-05
   305   6321   0   2    2.0662574e-06
   3051111   4133   0   2   -1.9482406e-06
   3051111   4233   0   2    5.3119478e-06
   3051111   4137   0   2    1.3780113e-05
   3051111   4237   0   2   -4.0983705e-05
   3051313   4133   0   2   -1.9480813e-06
   3051313   4233   0   2    5.3119211e-06
   3051313   4137   0   2    1.3780162e-05
   3051313   4237   0   2   -4.0983785e-05
   3051212   4137   0   2   -2.7767543e-06
   3051212   4237   0   2    8.9192057e-06
   3051414   4137   0   2   -2.7767552e-06
   3051414   4237   0   2    8.9192057e-06
   3051616   4137   0   2   -2.7660005e-06
   3051616   4237   0   2    8.9192432e-06

DECAY 23  2.4952


DECAY 24  2.085


DECAY 1000011  0.3102495
    0.99999869   2    1000022    11

DECAY 2000011  1.6461515
    1   2    1000022    11

DECAY 1000013  0.30953345
    0.99999894   2    1000022    13

DECAY 2000013  1.6480149
    0.99999999   2    1000022    13

DECAY 1000015  0.87933703
    1   2    1000022    15

DECAY 2000015  16.357096
    0.47229813   2    1000022    15
    0.17634303   2   -1000024    16
    0.094690139   2    1000025    15
    0.08838646   2    1000023    15
    0.073771572   2    1000016   -24
    0.039523371   2    1000015    25
    0.036501415   2    1000015    23
    0.012185981   2   -1000037    16
    0.0062999023   2    1000035    15

DECAY 1000012  0.29405308
    1   2    1000022    12

DECAY 1000014  0.29402024
    1   2    1000022    14

DECAY 1000016  0.86181899
    0.99963619   2    1000022    16
    0.00018211616   3    1000014    15   -13
    0.00018169637   3    1000012    15   -11

DECAY 2000001  142.65801
    0.98033448   2    1000021    1
    0.019608652   2    1000022    1

DECAY 1000001  203.18778
    0.69350063   2    1000021    1
    0.18730367   2   -1000037    2
    0.091913877   2    1000035    1
    0.01468739   2   -1000024    2
    0.0089872764   2    1000023    1
    0.0034535282   2    1000022    1
    0.00015363661   2    1000025    1

DECAY 2000003  142.6941
    0.98008808   2    1000021    3
    0.019604098   2    1000022    3
    0.00011733373   2   -1000024    4

DECAY 1000003  203.208
    0.69343388   2    1000021    3
    0.18728617   2   -1000037    4
    0.091908006   2    1000035    3
    0.014693473   2   -1000024    4
    0.009027417   2    1000023    3
    0.0034534675   2    1000022    3
    0.00019759121   2    1000025    3

DECAY 1000005  10.433597
    0.428216   2   -1000024    6
    0.24087974   2    1000023    5
    0.23927679   2    1000025    5
    0.075282351   2    1000022    5
    0.0096357691   2   -1000037    6
    0.006709357   2    1000035    5

DECAY 2000005  65.911435
    0.3448457   2   -1000024    6
    0.19380131   2    1000006   -24
    0.17219367   2   -1000037    6
    0.098427127   2    1000023    5
    0.098339946   2    1000025    5
    0.068356984   2    1000035    5
    0.012965336   2    1000005    25
    0.0065702617   2    1000005    23
    0.0044996702   2    1000022    5

DECAY 2000002  151.22223
    0.92577484   2    1000021    2
    0.074013151   2    1000022    2
    0.00011016032   2    1000023    2

DECAY 1000002  203.18088
    0.69329199   2    1000021    2
    0.17997899   2    1000037    1
    0.091144669   2    1000035    2
    0.022206709   2    1000024    1
    0.0098662672   2    1000023    2
    0.0034438347   2    1000022    2

DECAY 2000004  151.22566
    0.92575378   2    1000021    4
    0.074011468   2    1000022    4
    0.0001152234   2    1000023    4

DECAY 1000004  203.20079
    0.69322498   2    1000021    4
    0.17996751   2    1000037    3
    0.09113618   2    1000035    4
    0.022286927   2    1000024    3
    0.0098691191   2    1000023    4
    0.0034434983   2    1000022    4

DECAY 1000006  34.134378
    0.38125455   2    1000024    5
    0.21633648   2    1000025    6
    0.17752248   2    1000023    6
    0.092461555   2    1000037    5
    0.090271059   2    1000022    6
    0.041332901   2    1000035    6
    0.00031346418   2    1000023    4
    0.00030311919   2    1000005    24
    0.00018694301   2    1000022    4

DECAY 2000006  72.923124
    0.254114   2    1000024    5
    0.20291362   2    1000023    6
    0.19374356   2    1000025    6
    0.10670633   2    1000006    23
    0.10109327   2    1000006    25
    0.077273596   2    1000037    5
    0.041878599   2    1000035    6
    0.012657981   2    1000005    24
    0.0096190609   2    1000022    6

DECAY 1000024  1.5942315
    0.30209642   2    1000022    24
    0.18982698   2    1000014   -13
    0.1873193   2    1000012   -11
    0.12121787   2   -1000013    14
    0.1210923   2   -1000011    12
    0.062877154   2    1000016   -15
    0.0097444916   2   -1000015    16
    0.0037477009   3    1000022   -5    6
    0.0020612298   2   -2000013    14

DECAY 1000037  19.372809
    0.17817561   2   -1000013    14
    0.17806102   2   -1000011    12
    0.17358064   2    1000014   -13
    0.17355371   2    1000012   -11
    0.078545914   2    1000023    24
    0.053066414   2    1000016   -15
    0.051916624   2   -1000015    16
    0.041024582   2    1000024    23
    0.036051073   2    1000025    24
    0.032389782   2    1000024    25
    0.0035509666   2    1000022    24

DECAY 1000022 -1


DECAY 1000023  1.5874436
    0.15008299   2    1000022    25
    0.1340889   2    1000022    23
    0.090522658   2    1000013   -13
    0.090522658   2   -1000013    13
    0.089195021   2    1000011   -11
    0.089195021   2   -1000011    11
    0.068933104   2    1000014   -14
    0.068933104   2   -1000014    14
    0.068930065   2    1000012   -12
    0.068930065   2   -1000012    12
    0.031257156   2    1000015   -15
    0.031257156   2   -1000015    15
    0.0048501911   2    1000016   -16
    0.0048501911   2   -1000016    16
    0.0023114588   2    2000013   -13
    0.0023114588   2   -2000013    13
    0.0012835213   2    2000011   -11
    0.0012835213   2   -2000011    11
    0.0011774846   3    1000022    6   -6

DECAY 1000025  0.75120639
    0.41043505   2    1000022    23
    0.39882313   2    1000022    25
    0.072552283   2    1000015   -15
    0.072552283   2   -1000015    15
    0.0050800233   2    1000014   -14
    0.0050800233   2   -1000014    14
    0.0050798102   2    1000012   -12
    0.0050798102   2   -1000012    12
    0.0048412621   2    2000013   -13
    0.0048412621   2   -2000013    13
    0.0031814879   2    1000013   -13
    0.0031814879   2   -1000013    13
    0.0027482825   3    1000022    6   -6
    0.0024049237   2    2000011   -11
    0.0024049237   2   -2000011    11
    0.00046021567   2    1000016   -16
    0.00046021567   2   -1000016    16
    0.00029699238   2    1000011   -11
    0.00029699238   2   -1000011    11
    0.00013636936   3    1000022    5   -5

DECAY 1000035  21.081825
    0.082094122   2    1000014   -14
    0.082094122   2   -1000014    14
    0.082091869   2    1000012   -12
    0.082091869   2   -1000012    12
    0.078997435   2    1000013   -13
    0.078997435   2   -1000013    13
    0.078937027   2    1000011   -11
    0.078937027   2   -1000011    11
    0.064310095   2    1000024   -24
    0.064310095   2   -1000024    24
    0.06222114   2    1000025    23
    0.036635067   2    1000025    25
    0.028566726   2    1000023    25
    0.024176805   2    1000016   -16
    0.024176805   2   -1000016    16
    0.023752477   2    1000015   -15
    0.023752477   2   -1000015    15
    0.0016743657   2    1000022    25
    0.0014885328   2    1000022    23
    0.00058951777   2    1000023    23

DECAY 1000021  198.2028
    0.16563556   2    1000005   -5
    0.16563556   2   -1000005    5
    0.1242524   2    1000006   -6
    0.1242524   2   -1000006    6
    0.10557706   2    2000006   -6
    0.10557706   2   -2000006    6
    0.10046477   2    2000005   -5
    0.10046477   2   -2000005    5
    0.00397067   2    1000006   -4
    0.00397067   2   -1000006    4

DECAY 25  0.0035284169
    0.6210162   2   -5    5
    0.1791324   2   -24    24
    0.074062803   2    21    21
    0.07095258   2   -15    15
    0.030466824   2   -4    4
    0.02036493   2    23    23
    0.0022956049   2    22    22
    0.0012286547   2    22    23
    0.00024635216   2   -13    13
    0.0002328518   2   -3    3
    6.438102e-07   2   -1    1
    1.5701261e-07   2   -2    2
    5.5384153e-09   2   -11    11

DECAY 35  32.094419
    0.79584983   2   -5    5
    0.16242504   2   -15    15
    0.017811316   2    1000022    1000023
    0.017222886   2    1000022    1000025
    0.0019110814   2    1000023    1000025
    0.0016279332   2   -1000024    1000024
    0.00082773929   2   -6    6
    0.00061643649   2    1000023    1000023
    0.00051986274   2   -13    13
    0.00040706345   2    1000022    1000035
    0.00039455493   2   -3    3
    0.000343724   2    1000022    1000022
    2.6097639e-05   2    21    21
    5.5552537e-06   2    1000025    1000025
    5.1030184e-06   2   -1000015    1000015
    1.0907745e-06   2   -1    1
    9.2527972e-07   2    25    25
    3.9617665e-07   2    23    23
    2.7340616e-07   2   -24    24
    2.4939014e-07   2   -1000011    1000011
    2.2272973e-07   2   -1000013    1000013
    1.7116275e-07   2   -2000013    2000013
    1.5328664e-07   2   -2000011    2000011
    5.7805756e-08   2    22    23
    4.2500977e-08   2   -2000013    1000013
    4.2500977e-08   2   -1000013    2000013
    1.9191072e-08   2   -4    4
    1.1677832e-08   2   -11    11
    1.0233906e-08   2    22    22
    1.0089581e-12   2   -2000011    1000011
    1.0089581e-12   2   -1000011    2000011
    9.8979739e-14   2   -2    2

DECAY 36  31.60263
    0.78042313   2   -5    5
    0.15931394   2   -15    15
    0.018366242   2    1000022    1000023
    0.017275894   2    1000022    1000025
    0.016005414   2   -1000024    1000024
    0.0058829772   2    1000023    1000023
    0.00075362195   2   -6    6
    0.00051004738   2   -13    13
    0.00039453163   2    1000022    1000035
    0.00038688376   2   -3    3
    0.00034947975   2    1000022    1000022
    0.00015962871   2    1000023    1000025
    0.000131855   2    1000025    1000025
    4.3275894e-05   2    21    21
    1.0695679e-06   2   -1    1
    9.0188448e-07   2    22    23
    5.3238901e-07   2    23    25
    4.6154528e-07   2    22    22
    4.096637e-08   2   -2000013    1000013
    4.096637e-08   2   -1000013    2000013
    1.7310263e-08   2   -4    4
    1.145734e-08   2   -11    11
    9.5820359e-13   2   -2000011    1000011
    9.5820359e-13   2   -1000011    2000011
    8.9317755e-14   2   -2    2
    1.3839885e-38   2    25    25

DECAY 37  36.735511
    0.78763103   2   -5    6
    0.17547212   2   -15    16
    0.031284591   2    1000022    1000024
    0.0026901827   2    1000024    1000025
    0.0011761799   2   -5    4
    0.00070250819   2    1000022    1000037
    0.00062035757   2   -13    14
    0.00031737152   2   -3    4
    7.3601298e-05   2    1000023    1000024
    1.475991e-05   2   -3    2
    8.3991452e-06   2   -5    2
    3.8165889e-06   2   -1000015    1000016
    1.8455766e-06   2   -3    6
    8.8033787e-07   2   -1    2
    8.5363656e-07   2   -1000011    1000012
    8.1787784e-07   2   -1000013    1000014
    4.6122249e-07   2    24    25
    1.0275592e-07   2   -2000013    1000014
    6.3566638e-08   2   -1    6
    4.1412954e-08   2   -1    4
    1.4510228e-08   2   -11    12
    6.7466651e-12   2    24    35
    5.443644e-12   2    24    36
    2.4171171e-12   2   -2000011    1000012

DECAY 6  2.43
    1   2    5    24

DECAY 15 -1
