BLOCK SPINFO
   1   SPheno
   2   v4.0.5be

BLOCK SPHENOINFO
   1   2
   2   2

BLOCK MODSEL
   1   0

BLOCK MINPAR
   3    16.363003
   4    1

BLOCK EXTPAR
   0    2894.3956
   1    472.83155
   2    1375.1931
   3    3759.8347
   11    4341.6645
   12    7521.3039
   13    6818.0006
   23    4623.8438
   25    15.593906
   26    2470.4588
   31    2067.6877
   32    2067.6877
   33    796.17341
   34    2563.0099
   35    2563.0099
   36    1028.4161
   41    1378.1552
   42    1378.1552
   43    2674.4673
   44    569.89684
   45    569.89684
   46    2992.9187
   47    4604.0255
   48    4604.0255
   49    1396.7612

BLOCK SMINPUTS
   1    127.90897
   2    1.1663787e-05
   3    0.1184
   4    91.1876
   5    4.18
   6    173.2
   7    1.777
   8    0
   11    0.00051099893
   12    0
   13    0.10565837
   14    0
   21    0.005
   22    0.0025
   23    0.095
   24    1.27

BLOCK GAUGE Q=  2894.3956
   1    0.35536298
   2    0.66519887
   3    1.219778

BLOCK YU Q=  2894.3956
   1   1    8.4015942e-06
   2   2    0.0042680098
   3   3    1.0149801

BLOCK YD Q=  2894.3956
   1   1    0.00026326726
   2   2    0.0050020779
   3   3    0.26107863

BLOCK YE Q=  2894.3956
   1   1    4.5942062e-05
   2   2    0.0094993613
   3   3    0.15976363

BLOCK AU Q=  2894.3956
   1   1    0
   2   2    0
   3   3    4341.6645

BLOCK AD Q=  2894.3956
   1   1    0
   2   2    0
   3   3    7521.3086

BLOCK AE Q=  2894.3956
   1   1    0
   2   2    0
   3   3    6818.0006

BLOCK MSOFT Q=  2894.3956
   1    472.83155
   2    1375.1931
   3    3759.8347
   21   -15285054
   22   -21136453
   31    2067.6877
   32    2067.6877
   33    796.17341
   34    2563.0099
   35    2563.0099
   36    1028.4161
   41    1378.1552
   42    1378.1552
   43    2674.4673
   44    569.89684
   45    569.89684
   46    2992.9187
   47    4604.0255
   48    4604.0255
   49    1396.7612

BLOCK MASS
   6    173.2
   23    91.1876
   24    80.429995
   15    1.777
   25    122.16285
   35    2470.2824
   36    2470.4588
   37    2471.9088
   1000001    1537.429
   2000001    4682.5775
   1000002    1535.3944
   2000002    772.45692
   1000003    1537.428
   2000003    4682.5769
   1000004    1535.3936
   2000004    772.45511
   1000005    1529.5024
   2000005    2772.0862
   1000006    2739.6478
   2000006    3057.8842
   1000011    2079.2776
   2000011    2566.163
   1000012    2077.4167
   1000013    2079.265
   2000013    2566.1518
   1000014    2077.4103
   1000015    794.74219
   2000015    1026.3035
   1000016    809.64501
   1000021    3814.248
   1000022    464.82931
   1000023    1396.4763
   1000025   -4583.3356
   1000035    4583.9952
   1000024    1396.6913
   1000037    4584.4642

BLOCK ALPHA
      -0.061296023

BLOCK HMIX Q=  2894.3956
   1    4623.8438
   2    15.593906
   3    243.2903
   4    6103166.6

BLOCK STOPMIX
   1   1   -0.9483945
   1   2    0.31709284
   2   1   -0.31709284
   2   2   -0.9483945

BLOCK SBOTMIX
   1   1    0.021037797
   1   2    0.99977868
   2   1   -0.99977868
   2   2    0.021037797

BLOCK STAUMIX
   1   1    0.96409471
   1   2    0.26555865
   2   1   -0.26555865
   2   2    0.96409471

BLOCK NMIX
   1   1    0.99995075
   1   2   -0.0001443065
   1   3    0.0098019131
   1   4   -0.0015460642
   2   1   -0.00033666282
   2   2   -0.99980593
   2   3    0.018605563
   2   4   -0.0064665118
   3   1    0.0058360161
   3   2   -0.0085857031
   3   3   -0.70702598
   3   4   -0.70711137
   4   1   -0.008019739
   4   2    0.017730227
   4   3    0.70687483
   4   4   -0.70707093

BLOCK UMIX
   1   1   -0.99965562
   1   2    0.026242142
   2   1    0.026242142
   2   2    0.99965562

BLOCK VMIX
   1   1   -0.99995849
   1   2    0.0091117696
   2   1    0.0091117696
   2   2    0.99995849

BLOCK HIGGSBOUNDSINPUTHIGGSCOUPLINGSFERMIONS
       0, 243.16989,3,36,15,15

BLOCK HIGGSBOUNDSINPUTHIGGSCOUPLINGSBOSONS
       0,4,36,21,21,23

BLOCK SPHENOLOWENERGY
   1    0.00033040876
   2    1.5893507e-06
   3    3.5259996e-05
   4    2.9042086e-15
   5    1.2406453e-10
   6    2.5973595e-08
   7    9.7816964e-14
   8    4.1787386e-09
   9    8.8641247e-07
   10    9.6499348e-05
   11    0.99680132
   12    0.54198505
   13    19.364058
   14    0
   15    0
   16    0.0021573083
   17    2.2816584e-15
   18    2.4805328e-11
   19    8.2915031e-11
   20    8.581839e-16
   21    3.6689649e-11
   22    5.7169106e-08
   23    0
   24    0
   25    0
   26    0
   27    0
   28    0
   29    0
   30    0
   31    0
   39    4.046434e-05
   40    0
   41    0
   42    0

BLOCK FWCOEF Q=  160
   305   4422   0   0   -0.18881911
   305   4422   0   2   -0.19925906
   305   4322   0   2   -0.00021186533
   305   6421   0   0   -0.095227835
   305   6421   0   2   -0.10786674
   305   6321   0   2   -0.00025684105
   3051111   4133   0   0    1.6149916
   3051111   4133   0   2    1.6150122
   3051111   4233   0   2   -4.0943959e-06
   3051111   4137   0   0   -4.4376837
   3051111   4137   0   2   -4.4367395
   3051111   4237   0   2    3.1486553e-05
   3051313   4133   0   0    1.6149916
   3051313   4133   0   2    1.615012
   3051313   4233   0   2   -4.0944131e-06
   3051313   4137   0   0   -4.4376837
   3051313   4137   0   2   -4.4367397
   3051313   4237   0   2    3.1486568e-05
   3051212   4137   0   0    1.5053501
   3051212   4137   0   2    1.5051461
   3051212   4237   0   2   -6.8301436e-06
   3051414   4137   0   0    1.5053501
   3051414   4137   0   2    1.5051461
   3051414   4237   0   2   -6.83014e-06
   3051616   4137   0   0    1.5053501
   3051616   4137   0   2    1.505146
   3051616   4237   0   2   -6.829553e-06

BLOCK IMFWCOEF Q=  160
   305   4422   0   0    3.8577753e-07
   305   4422   0   2    1.8340177e-06
   305   4322   0   2   -6.5155116e-07
   305   6421   0   0    3.3044397e-07
   305   6421   0   2   -1.0010827e-06
   305   6321   0   2   -5.6664284e-07
   3051111   4133   0   2   -5.010315e-07
   3051111   4233   0   2    9.0746523e-08
   3051111   4137   0   2    3.9738465e-06
   3051111   4237   0   2   -6.7194131e-07
   3051313   4133   0   2   -5.0103056e-07
   3051313   4233   0   2    9.0746516e-08
   3051313   4137   0   2    3.9738473e-06
   3051313   4237   0   2   -6.7194134e-07
   3051212   4137   0   2   -8.4478279e-07
   3051212   4237   0   2    1.4561746e-07
   3051414   4137   0   2   -8.4478279e-07
   3051414   4237   0   2    1.4561746e-07
   3051616   4137   0   2   -8.4659362e-07
   3051616   4237   0   2    1.4560976e-07

DECAY 23  2.4952


DECAY 24  2.085


DECAY 1000011  10.622393
    0.51861026   2   -1000024    12
    0.25960776   2    1000023    11
    0.22178197   2    1000022    11

DECAY 2000011  12.060595
    0.99999993   2    1000022    11

DECAY 1000013  10.622161
    0.51860809   2   -1000024    14
    0.25960669   2    1000023    13
    0.22178522   2    1000022    13

DECAY 2000013  12.063014
    0.99979447   2    1000022    13
    0.00020527809   2    1000013    25

DECAY 1000015  0.52643864
    1   2    1000022    15

DECAY 2000015  7.6045983
    0.40517547   2    1000022    15
    0.2932545   2    1000016   -24
    0.15737881   2    1000015    23
    0.14419122   2    1000015    25

DECAY 1000012  10.592018
    0.51841569   2    1000024    11
    0.25916707   2    1000023    12
    0.22241724   2    1000022    12

DECAY 1000014  10.5919
    0.5184146   2    1000024    13
    0.25916651   2    1000023    14
    0.22241888   2    1000022    14

DECAY 1000016  0.45728804
    0.99999725   2    1000022    16

DECAY 1000001  0.79723353
    0.51777337   2   -1000024    2
    0.25968687   2    1000023    1
    0.22253976   2    1000022    1

DECAY 2000001  44.412013
    0.94229643   2    1000021    1
    0.057703494   2    1000022    1

DECAY 1000003  0.79720209
    0.51775826   2   -1000024    4
    0.25969336   2    1000023    3
    0.22254837   2    1000022    3

DECAY 2000003  44.412989
    0.94227461   2    1000021    3
    0.057702222   2    1000022    3

DECAY 1000005  0.70409965
    0.99973994   2    1000022    5
    0.00026006405   2    1000023    5

DECAY 2000005  24.477385
    0.54520944   2   -1000024    6
    0.2772063   2    1000023    5
    0.11896171   2    1000005    25
    0.043693132   2    1000005    23
    0.014929412   2    1000022    5

DECAY 2000002  0.70185484
    1   2    1000022    2

DECAY 1000002  0.78039924
    0.51540178   2    1000024    1
    0.25841437   2    1000023    2
    0.22618386   2    1000022    2

DECAY 2000004  0.70183801
    1   2    1000022    4

DECAY 1000004  0.78038775
    0.51540355   2    1000024    3
    0.25840092   2    1000023    4
    0.2261866   2    1000022    4

DECAY 1000006  21.042524
    0.55940349   2    1000024    5
    0.27497836   2    1000023    6
    0.085700888   2    1000005    24
    0.041130983   2    1000022    6
    0.033838155   2    1000023    4
    0.003101194   3    1000022    24    5
    0.0018447308   2    1000022    4

DECAY 2000006  31.084411
    0.314372   2    2000005    24
    0.20487008   2    1000006    25
    0.19111259   2    1000006    23
    0.18955809   2    1000022    6
    0.059160461   2    1000024    5
    0.029239345   2    1000023    6
    0.011687443   2    1000005    24

DECAY 1000024  5.418565
    0.5001575   2    1000016   -15
    0.48354964   2   -1000015    16
    0.016156419   2   -2000015    16

DECAY 1000037  162.25543
    0.34676515   2   -2000005    6
    0.24167086   2    2000006   -5
    0.065676283   2    1000024    25
    0.05858343   2    1000006   -5
    0.058128066   2    1000024    23
    0.057845552   2    1000023    24
    0.046124604   2   -1000005    6
    0.023611641   2    1000024    35
    0.023515584   2    1000024    36
    0.023509909   2    37    1000023
    0.019249845   2    1000022    24
    0.0084753171   2    37    1000022
    0.0072461339   3    1000024    6   -6
    0.0067378649   2    1000016   -15
    0.0063795687   2   -2000015    16
    0.0043782273   3    1000023   -5    6
    0.0012656068   3    1000022   -5    6
    0.00021442368   2   -1000003    4
    0.00020238788   2   -1000001    2
    0.00017305067   2   -1000015    16

DECAY 1000022 -1


DECAY 1000023  5.416081
    0.24988939   2    1000016   -16
    0.24988939   2   -1000016    16
    0.24195898   2    1000015   -15
    0.24195898   2   -1000015    15
    0.0080804052   2    2000015   -15
    0.0080804052   2   -2000015    15

DECAY 1000025  168.32953
    0.15968375   2    1000006   -6
    0.15968375   2   -1000006    6
    0.13950836   2    2000006   -6
    0.13950836   2   -2000006    6
    0.056173551   2    1000024   -24
    0.056173551   2   -1000024    24
    0.045692254   2    1000023    23
    0.040534958   2    1000023    25
    0.027466915   2    37   -1000024
    0.027466915   2   -37    1000024
    0.024738418   2    1000023    35
    0.021837404   2    1000005   -5
    0.021837404   2   -1000005    5
    0.012147309   2    1000022    23
    0.011153012   2    2000005   -5
    0.011153012   2   -2000005    5
    0.0090046352   2    1000022    25
    0.0061126962   2    1000022    35
    0.0039097435   3    1000024    5   -6
    0.0039097435   3   -1000024   -5    6
    0.0031963723   2    2000015   -15
    0.0031963723   2   -2000015    15
    0.0031729135   2    1000015   -15
    0.0031729135   2   -1000015    15
    0.003038851   3    1000023    6   -6
    0.0026613202   2    1000022    36
    0.0026270221   2    1000023    36
    0.0010052112   3    1000022    6   -6

DECAY 1000035  161.6289
    0.16814836   2    1000006   -6
    0.16814836   2   -1000006    6
    0.1433165   2    2000006   -6
    0.1433165   2   -2000006    6
    0.058937692   2    1000024   -24
    0.058937692   2   -1000024    24
    0.053936919   2    1000023    25
    0.023556286   2    37   -1000024
    0.023556286   2   -37    1000024
    0.022713129   2    1000005   -5
    0.022713129   2   -1000005    5
    0.020136704   2    1000023    35
    0.011986027   2    1000022    25
    0.011647812   2    2000005   -5
    0.011647812   2   -2000005    5
    0.011152117   2    1000023    23
    0.0066950546   2    1000022    23
    0.0049748969   2    1000022    35
    0.0043959434   3    1000024    5   -6
    0.0043959434   3   -1000024   -5    6
    0.0035822438   2    1000022    36
    0.0035658739   3    1000023    6   -6
    0.0035387465   2    1000023    36
    0.0034017929   2    2000015   -15
    0.0034017929   2   -2000015    15
    0.0032373294   2    1000015   -15
    0.0032373294   2   -1000015    15
    0.001063217   3    1000022    6   -6

DECAY 1000021  673.2234
    0.077114539   2    2000004   -4
    0.077114539   2   -2000004    4
    0.077114509   2    2000002   -2
    0.077114509   2   -2000002    2
    0.059046724   2    1000005   -5
    0.059046724   2   -1000005    5
    0.058878702   2    1000004   -4
    0.058878702   2   -1000004    4
    0.058878684   2    1000002   -2
    0.058878684   2   -1000002    2
    0.058818339   2    1000003   -3
    0.058818339   2   -1000003    3
    0.05881831   2    1000001   -1
    0.05881831   2   -1000001    1
    0.021656657   2    1000006   -6
    0.021656657   2   -1000006    6
    0.018668782   2    2000005   -5
    0.018668782   2   -2000005    5
    0.0088833457   2    2000006   -6
    0.0088833457   2   -2000006    6
    0.0021184627   2    1000006   -4
    0.0021184627   2   -1000006    4

DECAY 25  0.003544452
    0.61582061   2   -5    5
    0.18395343   2   -24    24
    0.073924077   2    21    21
    0.070784625   2   -15    15
    0.030408593   2   -4    4
    0.021030994   2    23    23
    0.0023404596   2    22    22
    0.001259361   2    22    23
    0.00024546511   2   -13    13
    0.00023158603   2   -3    3
    6.4031332e-07   2   -1    1
    1.5671256e-07   2   -2    2
    5.5183666e-09   2   -11    11

DECAY 35  12.848863
    0.31152998   2   -5    5
    0.2141336   2   -2000015    1000015
    0.2141336   2   -1000015    2000015
    0.10915161   2   -15    15
    0.082102591   2   -1000015    1000015
    0.057164145   2   -2000015    2000015
    0.0094990342   2   -6    6
    0.00060074406   2   -2000004    1000004
    0.00060074406   2   -1000004    2000004
    0.00038151912   2   -13    13
    0.0003716796   2    25    25
    0.00015533204   2   -3    3
    8.1280157e-05   2    1000022    1000023
    3.1074777e-05   2    1000022    1000022
    1.7543186e-05   2    23    23
    1.3604786e-05   2   -1000004    1000004
    1.3510597e-05   2   -1000002    1000002
    6.8943387e-06   2   -24    24
    2.8464248e-06   2    21    21
    4.295142e-07   2   -1    1
    1.8670237e-07   2   -4    4
    1.4083493e-07   2    22    22
    2.3005575e-08   2    22    23
    8.5692197e-09   2   -11    11
    2.327892e-09   2   -2000002    1000002
    2.327892e-09   2   -1000002    2000002
    9.6547633e-13   2   -2    2

DECAY 36  12.741723
    0.30520745   2   -5    5
    0.28789983   2   -2000015    1000015
    0.28789983   2   -1000015    2000015
    0.10693929   2   -15    15
    0.010046416   2   -6    6
    0.00060586682   2   -2000004    1000004
    0.00060586682   2   -1000004    2000004
    0.00037377211   2   -13    13
    0.00017187413   2    1000022    1000023
    0.00015217151   2   -3    3
    3.8208422e-05   2    1000022    1000022
    3.3079507e-05   2    21    21
    2.5644427e-05   2    23    25
    4.2077448e-07   2   -1    1
    1.7006441e-07   2   -4    4
    7.3122625e-08   2    22    22
    1.8323771e-08   2    22    23
    8.3952109e-09   2   -11    11
    2.3477422e-09   2   -2000002    1000002
    2.3477422e-09   2   -1000002    2000002
    8.7958604e-13   2   -2    2
    2.6709285e-36   2    25    25

DECAY 37  12.892648
    0.52643335   2   -2000015    1000016
    0.32670025   2   -5    6
    0.10266239   2   -15    16
    0.042743019   2   -1000015    1000016
    0.00044219951   2   -5    4
    0.00036294833   2   -13    14
    0.00025125375   2    1000022    1000024
    0.00017511015   2   -1000003    1000004
    0.0001415311   2   -3    4
    4.1105533e-05   2   -3    6
    2.5412533e-05   2    24    25
    9.3682929e-06   2   -1000001    1000004
    6.5969316e-06   2   -3    2
    3.1577574e-06   2   -5    2
    1.8757552e-06   2   -1    6
    3.9177755e-07   2   -1    2
    3.5454748e-08   2   -1    4
    8.4893992e-09   2   -11    12
    9.2003102e-10   2   -1000001    1000002
    3.1735851e-10   2   -1000005    1000004
    4.9198195e-11   2   -1000003    1000002
    1.2013366e-12   2    24    35
    6.7665937e-13   2    24    36
    1.188684e-17   2   -1000005    1000002

DECAY 6  2.43
    1   2    5    24

DECAY 15 -1
