BLOCK DCINFO
   1   SDECAY/HDECAY
   2   1.3b /3.4

BLOCK SPINFO
   1   SOFTSUSY
   2   3.4.0

BLOCK MODSEL
   1   0

BLOCK SMINPUTS
   1    127.90897
   2    1.1663787e-05
   3    0.1184
   4    91.1876
   5    4.18
   6    173.2
   7    1.777

BLOCK MINPAR
   3    11.2

BLOCK EXTPAR
   0   -1
   1   -289.06
   2    785.2
   3    3875.48
   11   -3540.03
   12    853.15
   13   -669.68
   23    2151.88
   26    573.65
   31    3974.56
   32    3974.56
   33    3365.69
   34    1368.47
   35    1368.47
   36    3369.85
   41    3067.97
   42    3067.97
   43    1807.92
   44    2398.84
   45    2398.84
   46    3794.73
   47    2192.58
   48    2192.58
   49    3956.28

BLOCK MASS
   24    80.381761
   25    125.37031
   35    573.83616
   36    573.65
   37    579.14304
   5    4.8187603
   1000001    3162.4617
   2000001    2282.8569
   1000002    3161.5889
   2000002    2489.5165
   1000003    3162.4617
   2000003    2282.8569
   1000004    3161.5889
   2000004    2489.5165
   1000005    1903.4173
   2000005    4034.1351
   1000006    1900.3873
   2000006    3829.3875
   1000011    3982.7829
   2000011    1370.1173
   1000012    3981.6683
   1000013    3982.7829
   2000013    1370.1173
   1000014    3981.6683
   1000015    3366.0298
   2000015    3378.9029
   1000016    3371.4418
   1000021    3886.4285
   1000022   -287.47213
   1000023    822.02336
   1000025   -2180.4218
   1000035    2182.0196
   1000024    822.18798
   1000037    2182.9716

BLOCK NMIX
   1   1    0.99979852
   1   2   -8.9528478e-05
   1   3    0.020061031
   1   4    0.00068876145
   2   1    0.00094046463
   2   2    0.99888453
   2   3   -0.043076206
   2   4    0.019319558
   3   1   -0.014665048
   3   2    0.016810523
   3   3    0.70666912
   3   4    0.7071924
   4   1   -0.013674036
   4   2    0.044125816
   4   3    0.7059467
   4   4   -0.70675681

BLOCK UMIX
   1   1    0.99813695
   1   2   -0.061013418
   2   1    0.061013418
   2   2    0.99813695

BLOCK VMIX
   1   1    0.99962237
   1   2   -0.027479485
   2   1    0.027479485
   2   2    0.99962237

BLOCK STOPMIX
   1   1    0.99883261
   1   2    0.04830554
   2   1   -0.04830554
   2   2    0.99883261

BLOCK SBOTMIX
   1   1    0.99999179
   1   2    0.0040528919
   2   1   -0.0040528919
   2   2    0.99999179

BLOCK STAUMIX
   1   1    0.69350657
   1   2    0.7204503
   2   1   -0.7204503
   2   2    0.69350657

BLOCK ALPHA
      -0.099130347

BLOCK HMIX Q=  2619.688
   1    2179.5913
   2    10.707139
   3    242.9678
   4    663036.89

BLOCK GAUGE Q=  2619.688
   1    0.36424596
   2    0.63720282
   3    1.0086118

BLOCK AU Q=  2619.688
   1   1    0
   2   2    0
   3   3   -3540.03

BLOCK AD Q=  2619.688
   1   1    0
   2   2    0
   3   3    853.15

BLOCK AE Q=  2619.688
   1   1    0
   2   2    0
   3   3   -669.68

BLOCK YU Q=  2619.688
   1   1    0
   2   2    0
   3   3    0.81939909

BLOCK YD Q=  2619.688
   1   1    0
   2   2    0
   3   3    0.13994677

BLOCK YE Q=  2619.688
   1   1    0
   2   2    0
   3   3    0.11074673

BLOCK MSOFT Q=  2619.688
   1   -289.06
   2    785.2
   3    3875.48
   21   -4490665.6
   22   -4728208.5
   31    3974.56
   32    3974.56
   33    3365.69
   34    1368.47
   35    1368.47
   36    3369.85
   41    3067.97
   42    3067.97
   43    1807.92
   44    2398.84
   45    2398.84
   46    3794.73
   47    2192.58
   48    2192.58
   49    3956.28

BLOCK HIGGSBOUNDSINPUTHIGGSCOUPLINGSFERMIONS
       0, 114.64283,3,36,15,15

BLOCK HIGGSBOUNDSINPUTHIGGSCOUPLINGSBOSONS
       0,4,36,21,21,23

DECAY 6  1.43033
    1   2    5    24

DECAY 1000021  231.57224
    0.091116073   2    1000005   -5
    0.091116073   2   -1000005    5
    0.090242897   2    1000006   -6
    0.090242897   2   -1000006    6
    0.067989458   2    2000001   -1
    0.067989458   2   -2000001    1
    0.067989458   2    2000003   -3
    0.067989458   2   -2000003    3
    0.055108982   2    2000002   -2
    0.055108982   2   -2000002    2
    0.055108958   2    2000004   -4
    0.055108958   2   -2000004    4
    0.018130632   2    1000002   -2
    0.018130632   2   -1000002    2
    0.018130594   2    1000004   -4
    0.018130594   2   -1000004    4
    0.018091474   2    1000001   -1
    0.018091474   2   -1000001    1
    0.018091474   2    1000003   -3
    0.018091474   2   -1000003    3

DECAY 1000006  15.325946
    0.6620164   2    1000024    5
    0.32056285   2    1000023    6
    0.017420747   2    1000022    6

DECAY 2000006  143.02556
    0.24373171   2    1000005    24
    0.16281146   2    1000037    5
    0.12688817   2    1000006    25
    0.12563552   2    1000006    23
    0.081756555   2    1000035    6
    0.080316541   2    1000025    6
    0.061711185   2    1000022    6
    0.058897541   2    1000005    37
    0.029590501   2    1000006    36
    0.028610081   2    1000006    35
    3.3296552e-05   2    1000024    5
    1.7426779e-05   2    1000023    6

DECAY 1000005  15.169617
    0.64782699   2   -1000024    6
    0.33455935   2    1000023    5
    0.017613652   2    1000022    5

DECAY 2000005  5.8410802
    0.40086004   2    1000022    5
    0.19246944   2    1000021    5
    0.13388093   2   -1000037    6
    0.06743496   2    1000025    5
    0.067290661   2    1000035    5
    0.054106991   2    1000006   -24
    0.027892666   2    1000005    25
    0.02785982   2    1000005    23
    0.01372862   2    1000006   -37
    0.0069850545   2    1000005    35
    0.0068199702   2    1000005    36
    0.00044704919   2   -1000024    6
    0.00022359587   2    1000023    5
    2.0282316e-07   2    2000006   -24

DECAY 1000002  33.302729
    0.65767937   2    1000024    1
    0.32849112   2    1000023    2
    0.013469601   2    1000022    2
    0.00018095727   2    1000035    2
    0.00015827801   2    1000037    1
    2.0675518e-05   2    1000025    2

DECAY 2000002  5.6859475
    0.99997617   2    1000022    2
    1.2414591e-05   2    1000025    2
    1.0691186e-05   2    1000035    2
    7.231822e-07   2    1000023    2

DECAY 1000001  33.264815
    0.65669379   2   -1000024    2
    0.32873983   2    1000023    1
    0.0135139   2    1000022    1
    0.00078215383   2   -1000037    2
    0.00022977799   2    1000035    1
    4.0547181e-05   2    1000025    1

DECAY 2000001  1.3030966
    0.99999592   2    1000022    1
    1.8348262e-06   2    1000025    1
    1.5479055e-06   2    1000035    1
    6.9367259e-07   2    1000023    1

DECAY 1000004  33.731668
    0.65766201   2    1000024    3
    0.32848247   2    1000023    4
    0.013499576   2    1000022    4
    0.00017896223   2    1000035    4
    0.00015653029   2    1000037    3
    2.044823e-05   2    1000025    4

DECAY 2000004  5.684041
    0.99997697   2    1000022    4
    1.1987578e-05   2    1000025    4
    1.0321747e-05   2    1000035    4
    7.2150217e-07   2    1000023    4

DECAY 1000003  33.693711
    0.6566812   2   -1000024    4
    0.32873384   2    1000023    3
    0.013544083   2    1000022    3
    0.00077352948   2   -1000037    4
    0.00022724903   2    1000035    3
    4.0102201e-05   2    1000025    3

DECAY 2000003  1.2963684
    0.99999616   2    1000022    3
    1.7096842e-06   2    1000025    3
    1.4414432e-06   2    1000035    3
    6.9202012e-07   2    1000023    3

DECAY 1000011  49.37313
    0.59502391   2   -1000024    12
    0.29828923   2    1000023    11
    0.10527797   2    1000022    11
    0.0011871677   2   -1000037    12
    0.000210374   2    1000035    11
    1.1347484e-05   2    1000025    11

DECAY 2000011  6.6073568
    0.9999996   2    1000022    11
    3.9662531e-07   2    1000023    11

DECAY 1000013  49.37313
    0.59502391   2   -1000024    14
    0.29828922   2    1000023    13
    0.10527797   2    1000022    13
    0.0011871677   2   -1000037    14
    0.000210374   2    1000035    13
    1.1347484e-05   2    1000025    13

DECAY 2000013  6.6073567
    0.9999996   2    1000022    13
    3.9662531e-07   2    1000023    13

DECAY 1000015  29.186956
    0.40345666   2   -1000024    16
    0.384644   2    1000022    15
    0.20226252   2    1000023    15
    0.0040805615   2    1000025    15
    0.0034189494   2    1000035    15
    0.0021373107   2   -1000037    16

DECAY 2000015  29.665017
    0.41253648   2   -1000024    16
    0.36050711   2    1000022    15
    0.20684938   2    1000023    15
    0.0084267199   2   -1000037    16
    0.0062478686   2    1000035    15
    0.0054324428   2    1000025    15

DECAY 1000012  49.384741
    0.59645923   2    1000024    11
    0.29747968   2    1000023    12
    0.10528911   2    1000022    12
    0.0004300979   2    1000035    12
    0.00024057251   2    1000037    11
    0.0001013091   2    1000025    12

DECAY 1000014  49.384741
    0.59645923   2    1000024    13
    0.29747968   2    1000023    14
    0.10528911   2    1000022    14
    0.0004300979   2    1000035    14
    0.00024057251   2    1000037    13
    0.0001013091   2    1000025    14

DECAY 1000016  40.764229
    0.59058666   2    1000024    15
    0.29452394   2    1000023    16
    0.10755956   2    1000022    16
    0.0069537443   2    1000037    15
    0.00030434903   2    1000035    16
    7.1750268e-05   2    1000025    16

DECAY 1000024  0.0002163474
    1   2    1000022    24

DECAY 1000037  27.995383
    0.17179679   2    1000024    25
    0.16817695   2    1000024    23
    0.16437096   2    1000023    24
    0.11214045   2    1000023    37
    0.11198146   2    1000024    36
    0.11046237   2    1000024    35
    0.068006344   2   -1000005    6
    0.0461285   2    1000022    37
    0.044198781   2    1000022    24
    0.002737387   2    1000006   -5

DECAY 1000022 -1


DECAY 1000023  0.00021194929
    0.57520436   2    1000022    25
    0.42479564   2    1000022    23

DECAY 1000025  27.728358
    0.16483337   2    1000024   -24
    0.16483337   2   -1000024    24
    0.14713232   2    1000023    23
    0.11221338   2    1000024   -37
    0.11221338   2   -1000024    37
    0.089476663   2    1000023    36
    0.034153239   2    1000022    35
    0.03395888   2    1000006   -6
    0.03395888   2   -1000006    6
    0.026080447   2    1000022    25
    0.022965624   2    1000023    35
    0.02144793   2    1000022    23
    0.020918986   2    1000023    25
    0.01312312   2    1000022    36
    0.0013125058   2    1000005   -5
    0.0013125058   2   -1000005    5
    1.6346543e-05   2    2000011   -11
    1.6346543e-05   2   -2000011    11
    1.6346543e-05   2    2000013   -13
    1.6346543e-05   2   -2000013    13

DECAY 1000035  27.959259
    0.16195862   2    1000024   -24
    0.16195862   2   -1000024    24
    0.15118595   2    1000023    25
    0.11157951   2    1000024   -37
    0.11157951   2   -1000024    37
    0.087054839   2    1000023    35
    0.037468751   2    1000006   -6
    0.037468751   2   -1000006    6
    0.033419103   2    1000022    36
    0.024342499   2    1000022    23
    0.022616335   2    1000022    25
    0.022495386   2    1000023    36
    0.021349577   2    1000023    23
    0.012775251   2    1000022    35
    0.0013453829   2    1000005   -5
    0.0013453829   2   -1000005    5
    1.413183e-05   2    2000011   -11
    1.413183e-05   2   -2000011    11
    1.413183e-05   2    2000013   -13
    1.413183e-05   2   -2000013    13

DECAY 25  0.0045915664
    0.62886423   2    5   -5
    0.19076349   2    24   -24
    0.069608372   2    21    21
    0.063971688   2   -15    15
    0.023924988   2    23    23
    0.018911906   2    4   -4
    0.0020786944   2    22    22
    0.0014055412   2    22    23
    0.00024463876   2    3   -3
    0.00022644866   2   -13    13

DECAY 35  1.2370494
    0.73450672   2    5   -5
    0.1459724   2    6   -6
    0.10873789   2   -15    15
    0.0071865254   2    25    25
    0.0015752149   2    24   -24
    0.00076021796   2    23    23
    0.00060406792   2    21    21
    0.00038484692   2   -13    13
    0.0002682251   2    3   -3
    2.4026238e-06   2    4   -4
    1.1554429e-06   2    22    22
    3.362911e-07   2    23    22
    1.9478138e-16   2    23    36

DECAY 36  1.2807802
    0.71032675   2    5   -5
    0.18161239   2    6   -6
    0.10511749   2   -15    15
    0.0013774504   2    23    25
    0.00092996643   2    21    21
    0.00037201911   2   -13    13
    0.00025948636   2    3   -3
    2.0668777e-06   2    4   -4
    1.851181e-06   2    22    22
    5.3870902e-07   2    23    22

DECAY 37  1.1393312
    0.87709459   2    6   -5
    0.1192995   2   -15    16
    0.0016328851   2    24    25
    0.0012340632   2    4   -5
    0.00042221021   2   -13    14
    0.00028980171   2    4   -3
    1.4610014e-05   2    2   -3
    1.2340265e-05   2    2   -5
    5.7112331e-09   2    24    36

DECAY 5 -1


DECAY 15 -1


DECAY 23  2.4952


DECAY 24  2.085
