BLOCK SPINFO
   1   SPheno
   2   v4.0.5be

BLOCK SPHENOINFO
   1   2
   2   2

BLOCK MODSEL
   1   0

BLOCK MINPAR
   3    39.539699
   4   -1

BLOCK EXTPAR
   0    1318.992
   1   -476.41141
   2    455.95165
   3    3000
   11   -3110.8295
   12   -1039.4353
   13    1048.2229
   23   -1270.8026
   25    38.892457
   26    665.35807
   31    527.64386
   32    527.64386
   33    822.0402
   34    1073.5337
   35    1073.5337
   36    980.40272
   41    5000
   42    5000
   43    1726.4845
   44    5000
   45    5000
   46    1119.0071
   47    5000
   48    5000
   49    1537.9909

BLOCK SMINPUTS
   1    127.90897
   2    1.1663787e-05
   3    0.1184
   4    91.1876
   5    4.18
   6    173.2
   7    1.777
   8    0
   11    0.00051099893
   12    0
   13    0.10565837
   14    0
   21    0.005
   22    0.0025
   23    0.095
   24    1.27

BLOCK GAUGE Q=  1318.992
   1    0.35536298
   2    0.66519887
   3    1.219778

BLOCK YU Q=  1318.992
   1   1    8.3871431e-06
   2   2    0.0042606687
   3   3    1.0132343

BLOCK YD Q=  1318.992
   1   1    0.00065548035
   2   2    0.012454127
   3   3    0.65003111

BLOCK YE Q=  1318.992
   1   1    0.00011438612
   2   2    0.023651421
   3   3    0.39777799

BLOCK AU Q=  1318.992
   1   1    0
   2   2    0
   3   3   -3110.8297

BLOCK AD Q=  1318.992
   1   1    0
   2   2    0
   3   3   -1039.4364

BLOCK AE Q=  1318.992
   1   1    0
   2   2    0
   3   3    1048.2229

BLOCK MSOFT Q=  1318.992
   1   -476.41141
   2    455.95165
   3    3000
   21   -1159273.5
   22   -1609162.3
   31    527.64386
   32    527.64386
   33    822.0402
   34    1073.5337
   35    1073.5337
   36    980.40272
   41    5000
   42    5000
   43    1726.4845
   44    5000
   45    5000
   46    1119.0071
   47    5000
   48    5000
   49    1537.9909

BLOCK MASS
   6    173.2
   23    91.1876
   24    80.429995
   15    1.777
   25    123.39648
   35    665.11159
   36    665.35807
   37    672.64748
   1000001    5021.8189
   2000001    5011.3073
   1000002    5021.3792
   2000002    5012.8651
   1000003    5021.8285
   2000003    5011.3108
   1000004    5021.384
   2000004    5012.8661
   1000005    1516.4236
   2000005    1696.366
   1000006    1010.3168
   2000006    1721.9747
   1000011    536.36821
   2000011    1075.4395
   1000012    530.2388
   1000013    536.33949
   2000013    1075.4398
   1000014    530.23635
   1000015    811.00628
   2000015    988.24408
   1000016    821.18218
   1000021    3176.5207
   1000022   -474.56741
   1000023    481.42219
   1000025   -1268.931
   1000035    1269.3878
   1000024    481.62074
   1000037    1271.4611

BLOCK ALPHA
      -0.026648537

BLOCK HMIX Q=  1318.992
   1   -1270.8026
   2    38.892457
   3    244.12971
   4    442701.35

BLOCK STOPMIX
   1   1    0.23037382
   1   2    0.97310221
   2   1   -0.97310221
   2   2    0.23037382

BLOCK SBOTMIX
   1   1   -0.22021666
   1   2    0.97545098
   2   1   -0.97545098
   2   2   -0.22021666

BLOCK STAUMIX
   1   1   -0.96360385
   1   2    0.2673343
   2   1   -0.2673343
   2   2   -0.96360385

BLOCK NMIX
   1   1    0.99901323
   1   2    0.0013589635
   1   3   -0.041339641
   1   4    0.016179106
   2   1   -0.0011835659
   2   2   -0.99712637
   2   3   -0.071342351
   2   4   -0.025453253
   3   1   -0.040677333
   3   2    0.032454861
   3   3   -0.7052075
   3   4    0.70708869
   4   1    0.01779129
   4   2   -0.068438551
   4   3    0.70419009
   4   4    0.70648139

BLOCK UMIX
   1   1   -0.99491563
   1   2   -0.10071191
   2   1    0.10071191
   2   2   -0.99491563

BLOCK VMIX
   1   1   -0.99935424
   1   2    0.035931931
   2   1    0.035931931
   2   2    0.99935424

BLOCK HIGGSBOUNDSINPUTHIGGSCOUPLINGSFERMIONS
       0, 1512.6232,3,36,15,15

BLOCK HIGGSBOUNDSINPUTHIGGSCOUPLINGSBOSONS
       0,4,36,21,21,23

BLOCK SPHENOLOWENERGY
   1    0.00042974311
   2    1.5915001e-06
   3    3.5252154e-05
   4    3.8092443e-15
   5    1.6246109e-10
   6    1.8542376e-08
   7    1.2892734e-13
   8    5.499065e-09
   9    6.5246999e-07
   10    6.5012431e-05
   11    0.67155352
   12    0.54334348
   13    19.238865
   14    0
   15    0
   16    0.0021727797
   17    2.2818379e-15
   18    2.4795082e-11
   19    8.289356e-11
   20   -9.3383861e-15
   21   -3.9919618e-10
   22   -9.909898e-08
   23    0
   24    0
   25    0
   26    0
   27    0
   28    0
   29    0
   30    0
   31    0
   39    8.843142e-05
   40    0
   41    0
   42    0

BLOCK FWCOEF Q=  160
   305   4422   0   0   -0.18881911
   305   4422   0   2   -0.29994486
   305   4322   0   2   -0.0014968242
   305   6421   0   0   -0.095227835
   305   6421   0   2   -0.18875123
   305   6321   0   2   -0.001407026
   3051111   4133   0   0    1.5876786
   3051111   4133   0   2    1.5885306
   3051111   4233   0   2   -0.00011355627
   3051111   4137   0   0   -4.4103707
   3051111   4137   0   2   -4.408506
   3051111   4237   0   2    0.00089378028
   3051313   4133   0   0    1.5876786
   3051313   4133   0   2    1.588524
   3051313   4233   0   2   -0.00011360506
   3051313   4137   0   0   -4.4103707
   3051313   4137   0   2   -4.4085126
   3051313   4237   0   2    0.0008938265
   3051212   4137   0   0    1.5053501
   3051212   4137   0   2    1.5049713
   3051212   4237   0   2   -0.00019498421
   3051414   4137   0   0    1.5053501
   3051414   4137   0   2    1.5049713
   3051414   4237   0   2   -0.00019497368
   3051616   4137   0   0    1.5053501
   3051616   4137   0   2    1.5049709
   3051616   4237   0   2   -0.00019200865

BLOCK IMFWCOEF Q=  160
   305   4422   0   0    3.8561479e-07
   305   4422   0   2   -2.2328478e-05
   305   4322   0   2   -6.8866246e-06
   305   6421   0   0    3.3030457e-07
   305   6421   0   2    8.0201126e-06
   305   6321   0   2   -2.9655341e-06
   3051111   4133   0   2   -1.6699647e-06
   3051111   4233   0   2    3.7753434e-06
   3051111   4137   0   2    1.0546567e-05
   3051111   4237   0   2   -2.9589774e-05
   3051313   4133   0   2   -1.6700361e-06
   3051313   4233   0   2    3.7753334e-06
   3051313   4137   0   2    1.054649e-05
   3051313   4237   0   2   -2.958981e-05
   3051212   4137   0   2   -1.814623e-06
   3051212   4237   0   2    6.4549158e-06
   3051414   4137   0   2   -1.814623e-06
   3051414   4237   0   2    6.4549158e-06
   3051616   4137   0   2   -1.822215e-06
   3051616   4237   0   2    6.4549176e-06

DECAY 23  2.4952


DECAY 24  2.085


DECAY 1000011  0.29608329
    0.59240241   2   -1000024    12
    0.29994406   2    1000023    11
    0.10765349   2    1000022    11

DECAY 2000011  3.4972039
    0.99999858   2    1000022    11

DECAY 1000013  0.29580985
    0.5923898   2   -1000024    14
    0.299946   2    1000023    13
    0.10766415   2    1000022    13

DECAY 2000013  3.5034256
    0.99822746   2    1000022    13
    0.0017378973   2    1000013    25

DECAY 1000015  4.8300057
    0.58857717   2   -1000024    16
    0.2973979   2    1000023    15
    0.11402493   2    1000022    15

DECAY 2000015  4.9615493
    0.55571288   2    1000022    15
    0.18830374   2    1000016   -24
    0.096027606   2    1000015    23
    0.093524255   2    1000015    25
    0.0440795   2   -1000024    16
    0.022352011   2    1000023    15

DECAY 1000012  0.24040993
    0.59366417   2    1000024    11
    0.2974342   2    1000023    12
    0.10890162   2    1000022    12

DECAY 1000014  0.24039177
    0.59366933   2    1000024    13
    0.29742945   2    1000023    14
    0.10890123   2    1000022    14

DECAY 1000016  5.1200396
    0.6093138   2    1000024    15
    0.30194668   2    1000023    16
    0.088739477   2    1000022    16

DECAY 2000001  144.29927
    0.98096103   2    1000021    1
    0.019004951   2    1000022    1

DECAY 1000001  208.36937
    0.68458651   2    1000021    1
    0.20616107   2   -1000024    2
    0.10349696   2    1000023    1
    0.0032472767   2    1000022    1
    0.0018848523   2   -1000037    2
    0.0004767254   2    1000035    1
    0.0001466001   2    1000025    1

DECAY 2000003  144.32667
    0.98077733   2    1000021    3
    0.019001537   2    1000022    3

DECAY 1000003  208.38565
    0.68453786   2    1000021    3
    0.20614535   2   -1000024    4
    0.10348946   2    1000023    3
    0.0032471543   2    1000022    3
    0.0018923591   2   -1000037    4
    0.00050890694   2    1000035    3
    0.00017890569   2    1000025    3

DECAY 1000005  4.8811263
    0.21144313   2   -1000024    6
    0.20674565   2    1000006   -24
    0.1540238   2    1000022    5
    0.11468092   2    1000025    5
    0.11277184   2    1000035    5
    0.11073492   2    1000023    5
    0.089599742   2   -1000037    6

DECAY 2000005  73.911432
    0.59643139   2    1000006   -24
    0.1493669   2   -1000024    6
    0.090944397   2   -1000037    6
    0.07801021   2    1000023    5
    0.033422266   2    1000006   -37
    0.019166469   2    1000035    5
    0.01900496   2    1000025    5
    0.0060439548   2    1000005    25
    0.0053796457   2    1000005    23
    0.0022298036   2    1000022    5

DECAY 2000002  152.70667
    0.92801572   2    1000021    2
    0.071857605   2    1000022    2
    0.00010625148   2    1000025    2

DECAY 1000002  208.36321
    0.68438693   2    1000021    2
    0.20799193   2    1000024    1
    0.10357816   2    1000023    2
    0.0033478291   2    1000022    2
    0.00039598287   2    1000035    2
    0.00024008442   2    1000037    1

DECAY 2000004  152.70988
    0.92799646   2    1000021    4
    0.071856103   2    1000022    4
    0.00011143406   2    1000025    4

DECAY 1000004  208.37885
    0.68433766   2    1000021    4
    0.20797727   2    1000024    3
    0.10357048   2    1000023    4
    0.0033475826   2    1000022    4
    0.00039977156   2    1000035    4
    0.00030434999   2    1000037    3

DECAY 1000006  1.8420915
    0.65794242   2    1000022    6
    0.23336086   2    1000024    5
    0.10261411   2    1000023    6
    0.0058346126   2    1000023    4
    0.00019163019   2    1000022    4

DECAY 2000006  87.864051
    0.33022307   2    1000006    25
    0.27284325   2    1000006    23
    0.13644041   2    1000024    5
    0.065414752   2    1000023    6
    0.045108525   2    1000035    6
    0.042296686   2    1000025    6
    0.03703418   2    1000037    5
    0.027773293   2    1000006    36
    0.02235188   2    1000006    35
    0.015994962   2    1000005    24
    0.0045189896   2    1000022    6

DECAY 1000024  5.5805704e-11
    0.49471173   3    1000022   -11    12
    0.49433256   3    1000022   -13    14
    0.0050657329   3    1000022   -1    2
    0.0043287363   3    1000022   -3    4
    0.0015563918   3    1000022   -15    16

DECAY 1000037  18.105984
    0.27815081   2    1000006   -5
    0.14036007   2    1000024    25
    0.13689321   2    1000023    24
    0.13606948   2    1000024    23
    0.059655242   2    1000024    36
    0.059055789   2    1000024    35
    0.058182092   2    37    1000023
    0.048820044   2    1000022    24
    0.037325544   2    1000016   -15
    0.017451197   2   -2000015    16
    0.01638922   2    37    1000022
    0.00278908   3    1000024    6   -6
    0.002411835   3    1000023   -5    6
    0.0021186191   2   -1000013    14
    0.0021185209   2   -1000011    12
    0.00090505095   3    1000022   -5    6
    0.00053638704   2    1000014   -13
    0.00041804042   2   -1000015    16
    0.00027233571   2    1000012   -11

DECAY 1000022 -1


DECAY 1000023  5.2359362e-11
    0.51117954   3    1000022    12   -12
    0.21295969   3    1000022    11   -11
    0.21256602   3    1000022    13   -13
    0.056762261   2    1000022    22
    0.0017523836   3    1000022    1   -1
    0.0017486257   3    1000022    3   -3
    0.0013699922   3    1000022    2   -2
    0.00086094451   3    1000022    4   -4
    0.00080053391   3    1000022    15   -15

DECAY 1000025  20.029032
    0.13776559   2    1000006   -6
    0.13776559   2   -1000006    6
    0.12552148   2    1000024   -24
    0.12552148   2   -1000024    24
    0.11681448   2    1000023    25
    0.1031933   2    1000023    23
    0.046544038   2    37   -1000024
    0.046544038   2   -37    1000024
    0.044476095   2    1000023    35
    0.032960808   2    1000022    25
    0.016511937   2    1000015   -15
    0.016511937   2   -1000015    15
    0.012885672   2    1000022    35
    0.0081104653   2    2000015   -15
    0.0081104653   2   -2000015    15
    0.0070355946   2    1000022    23
    0.0033442284   2    1000023    36
    0.0030928751   3    1000024    5   -6
    0.0030928751   3   -1000024   -5    6
    0.0010372091   2    1000022    36
    0.00099290923   3    1000023    6   -6
    0.0003290504   3    1000022    6   -6
    0.00027889382   2    1000014   -14
    0.00027889382   2   -1000014    14
    0.00027889272   2    1000012   -12
    0.00027889272   2   -1000012    12
    0.00013828477   2    1000016   -16
    0.00013828477   2   -1000016    16
    0.00012910448   2    1000013   -13
    0.00012910448   2   -1000013    13

DECAY 1000035  18.657617
    0.13946   2    1000006   -6
    0.13946   2   -1000006    6
    0.13307417   2    1000024   -24
    0.13307417   2   -1000024    24
    0.11159537   2    1000023    25
    0.055217787   2    37   -1000024
    0.055217787   2   -37    1000024
    0.052857938   2    1000023    35
    0.039621262   2    1000022    23
    0.032159139   2    1000022    25
    0.024737093   2    1000023    23
    0.017485455   2    1000015   -15
    0.017485455   2   -1000015    15
    0.015308525   2    1000022    35
    0.0088427838   2    2000015   -15
    0.0088427838   2   -2000015    15
    0.0032280164   2    1000023    36
    0.0026168519   3    1000024    5   -6
    0.0026168519   3   -1000024   -5    6
    0.0010002787   2    1000022    36
    0.00094366294   3    1000023    6   -6
    0.00061989625   2    1000014   -14
    0.00061989625   2   -1000014    14
    0.00061989382   2    1000012   -12
    0.00061989382   2   -1000012    12
    0.00047771326   2    1000013   -13
    0.00047771326   2   -1000013    13
    0.00035092955   2    1000011   -11
    0.00035092955   2   -1000011    11
    0.00031849244   3    1000022    6   -6
    0.00030759021   2    1000016   -16
    0.00030759021   2   -1000016    16

DECAY 1000021  226.4372
    0.15852252   2    1000006   -6
    0.15852252   2   -1000006    6
    0.12395144   2    1000005   -5
    0.12395144   2   -1000005    5
    0.11026782   2    2000006   -6
    0.11026782   2   -2000006    6
    0.10591497   2    2000005   -5
    0.10591497   2   -2000005    5
    0.00068220895   2    1000006   -4
    0.00068220895   2   -1000006    4
    0.00029889503   3    1000037    5   -6
    0.00029889503   3   -1000037   -5    6
    0.00024258038   3    1000025    6   -6
    0.00023441845   3    1000035    6   -6

DECAY 25  0.0039418968
    0.61955397   2   -5    5
    0.18945066   2   -24    24
    0.069938823   2   -15    15
    0.067377614   2    21    21
    0.027532131   2   -4    4
    0.022207884   2    23    23
    0.0021912754   2    22    22
    0.001272588   2    22    23
    0.00024178503   2   -13    13
    0.0002324757   2   -3    3
    6.4278144e-07   2   -1    1
    1.418841e-07   2   -2    2
    5.4356e-09   2   -11    11

DECAY 35  19.601722
    0.90520956   2   -5    5
    0.092927949   2   -15    15
    0.0010399212   2   -6    6
    0.00031207679   2   -3    3
    0.00030406155   2   -13    13
    0.0001044338   2    25    25
    8.7502552e-05   2    21    21
    8.902206e-06   2   -24    24
    4.6721571e-06   2    23    23
    8.6302813e-07   2   -1    1
    3.6772313e-08   2    22    22
    1.1717881e-08   2   -4    4
    6.8322161e-09   2   -11    11
    5.2980291e-09   2    22    23
    6.0430644e-14   2   -2    2

DECAY 36  19.14766
    0.90492297   2   -5    5
    0.09289014   2   -15    15
    0.0014405129   2   -6    6
    0.00031192493   2   -3    3
    0.00030393704   2   -13    13
    0.00012146026   2    21    21
    7.9246757e-06   2    23    25
    8.6260808e-07   2   -1    1
    1.2968505e-07   2    22    22
    1.2099206e-07   2    22    23
    1.1681499e-08   2   -4    4
    6.8294173e-09   2   -11    11
    6.0347176e-14   2   -2    2
    5.6790699e-37   2    25    25

DECAY 37  15.314769
    0.86036982   2   -5    6
    0.13731982   2   -15    16
    0.0014243023   2   -5    4
    0.00048548101   2   -13    14
    0.00036019082   2   -3    4
    1.6543059e-05   2   -3    2
    1.042017e-05   2    24    25
    1.0171057e-05   2   -5    2
    2.1087273e-06   2   -3    6
    1.0002085e-06   2   -1    2
    7.5671673e-08   2   -1    6
    4.6593113e-08   2   -1    4
    1.1355452e-08   2   -11    12
    2.1360241e-09   2    24    35
    1.8092486e-09   2    24    36

DECAY 6  2.43
    1   2    5    24

DECAY 15 -1
