BLOCK DCINFO
   1   SDECAY/HDECAY
   2   1.3b /3.4

BLOCK SPINFO
   1   SOFTSUSY
   2   3.4.0

BLOCK MODSEL
   1   0

BLOCK SMINPUTS
   1    127.90897
   2    1.1663787e-05
   3    0.1184
   4    91.1876
   5    4.18
   6    173.2
   7    1.777

BLOCK MINPAR
   3    34.17

BLOCK EXTPAR
   0   -1
   1    2989.07
   2    3815.08
   3    2638.62
   11   -4130.34
   12   -3487.07
   13    3017.77
   23    753.58
   26    1549.82
   31    1567.58
   32    1567.58
   33    2118.44
   34    3168.81
   35    3168.81
   36    1349.77
   41    2526.91
   42    2526.91
   43    2056.12
   44    3831.71
   45    3831.71
   46    2390.46
   47    722.08
   48    722.08
   49    1849.2

BLOCK MASS
   24    80.38711
   25    127.57701
   35    1549.8249
   36    1549.8198
   37    1552.3527
   5    4.8187603
   1000001    2617.5297
   2000001    852.10768
   1000002    2616.4834
   2000002    3880.3238
   1000003    2617.5297
   2000003    852.10768
   1000004    2616.4834
   2000004    3880.3238
   1000005    1922.7296
   2000005    2111.2445
   1000006    2056.6774
   2000006    2432.9243
   1000011    1580.4864
   2000011    3174.1338
   1000012    1578.2082
   1000013    1580.4864
   2000013    3174.1338
   1000014    1578.2082
   1000015    1346.1068
   2000015    2128.0243
   1000016    2126.0985
   1000021    2734.4804
   1000022    777.30283
   1000023   -780.16985
   1000025    2964.8472
   1000035    3758.9909
   1000024    778.95492
   1000037    3759.1541

BLOCK NMIX
   1   1    0.014884715
   1   2   -0.019105787
   1   3    0.70765191
   1   4   -0.70614601
   2   1   -0.0081506404
   2   2    0.011900534
   2   3    0.70652658
   2   4    0.7075395
   3   1    0.99985508
   3   2    0.0017324557
   3   3   -0.0047683236
   3   4    0.016250385
   4   1   -0.0013511678
   4   2    0.99974514
   4   3    0.0051217693
   4   4   -0.021945319

BLOCK UMIX
   1   1   -0.0072407879
   1   2    0.99997379
   2   1   -0.99997379
   2   2   -0.0072407879

BLOCK VMIX
   1   1   -0.031022738
   1   2    0.99951868
   2   1   -0.99951868
   2   2   -0.031022738

BLOCK STOPMIX
   1   1    0.9294073
   1   2    0.36905565
   2   1   -0.36905565
   2   2    0.9294073

BLOCK SBOTMIX
   1   1    0.086353958
   1   2    0.99626452
   2   1   -0.99626452
   2   2    0.086353958

BLOCK STAUMIX
   1   1    0.015229048
   1   2    0.99988403
   2   1   -0.99988403
   2   2    0.015229048

BLOCK ALPHA
      -0.030366992

BLOCK HMIX Q=  2213.191
   1    766.18326
   2    33.219634
   3    243.30281
   4    2232582.1

BLOCK GAUGE Q=  2213.191
   1    0.36397928
   2    0.63548769
   3    1.0202278

BLOCK AU Q=  2213.191
   1   1    0
   2   2    0
   3   3   -4130.34

BLOCK AD Q=  2213.191
   1   1    0
   2   2    0
   3   3   -3487.07

BLOCK AE Q=  2213.191
   1   1    0
   2   2    0
   3   3    3017.77

BLOCK YU Q=  2213.191
   1   1    0
   2   2    0
   3   3    0.81926692

BLOCK YD Q=  2213.191
   1   1    0
   2   2    0
   3   3    0.44013808

BLOCK YE Q=  2213.191
   1   1    0
   2   2    0
   3   3    0.35276064

BLOCK MSOFT Q=  2213.191
   1    2989.07
   2    3815.08
   3    2638.62
   21    1870266.2
   22   -460259.96
   31    1567.58
   32    1567.58
   33    2118.44
   34    3168.81
   35    3168.81
   36    1349.77
   41    2526.91
   42    2526.91
   43    2056.12
   44    3831.71
   45    3831.71
   46    2390.46
   47    722.07998
   48    722.07998
   49    1849.2

BLOCK HIGGSBOUNDSINPUTHIGGSCOUPLINGSFERMIONS
       0, 1103.5441,3,36,15,15

BLOCK HIGGSBOUNDSINPUTHIGGSCOUPLINGSBOSONS
       0,4,36,21,21,23

DECAY 6  1.4224042
    1   2    5    24

DECAY 1000021  117.53179
    0.18017138   2    2000001   -1
    0.18017138   2   -2000001    1
    0.18017138   2    2000003   -3
    0.18017138   2   -2000003    3
    0.054783923   2    1000005   -5
    0.054783923   2   -1000005    5
    0.035171432   2    2000005   -5
    0.035171432   2   -2000005    5
    0.032239017   2    1000006   -6
    0.032239017   2   -1000006    6
    0.011214027   2    2000006   -6
    0.011214027   2   -2000006    6
    0.0015758583   2    1000002   -2
    0.0015758583   2   -1000002    2
    0.0015757073   2    1000004   -4
    0.0015757073   2   -1000004    4
    0.0015486416   2    1000001   -1
    0.0015486416   2   -1000001    1
    0.0015486416   2    1000003   -3
    0.0015486416   2   -1000003    3

DECAY 1000006  28.107383
    0.37324988   2    1000023    6
    0.33762449   2    1000022    6
    0.28785711   2    1000024    5
    0.0012685216   2    1000005    24

DECAY 2000006  83.928709
    0.27635588   2    1000024    5
    0.19706131   2    2000005    24
    0.15664541   2    1000022    6
    0.14733656   2    1000023    6
    0.13736148   2    1000006    23
    0.079721597   2    1000006    25
    0.00551776   2    1000005    24

DECAY 1000005  10.20165
    0.49171244   2   -1000024    6
    0.25620672   2    1000022    5
    0.25208084   2    1000023    5

DECAY 2000005  26.865245
    0.76826236   2   -1000024    6
    0.1131743   2    1000023    5
    0.11269543   2    1000022    5
    0.0031009742   2    1000005    25
    0.002766926   2    1000005    23

DECAY 1000002  0.019497728
    0.83815493   2    1000024    1
    0.11527724   2    1000022    2
    0.046567827   2    1000023    2

DECAY 2000002  74.908033
    0.9793926   2    1000021    2
    0.020576548   2    1000025    2
    2.3735899e-05   2    1000022    2
    7.1128798e-06   2    1000023    2
    8.8542677e-10   2    1000035    2

DECAY 1000001  0.0065230354
    0.62778499   2    1000022    1
    0.23566657   2    1000023    1
    0.13654844   2   -1000024    2

DECAY 2000001  4.3091742e-06
    0.78207342   2    1000022    1
    0.21792658   2    1000023    1

DECAY 1000004  0.020048714
    0.83815442   2    1000024    3
    0.11527814   2    1000022    4
    0.046567442   2    1000023    4

DECAY 2000004  55.873323
    0.97178215   2    1000021    4
    0.028174685   2    1000025    4
    3.3212553e-05   2    1000022    4
    9.9525937e-06   2    1000023    4
    1.1255615e-09   2    1000035    4

DECAY 1000003  0.0067077704
    0.62778821   2    1000022    3
    0.23566398   2    1000023    3
    0.13654781   2   -1000024    4

DECAY 2000003  3.9830484e-06
    0.78230022   2    1000022    3
    0.21769978   2    1000023    3

DECAY 1000011  0.00098006063
    0.4168113   2    1000022    11
    0.38935915   2   -1000024    12
    0.19382955   2    1000023    11

DECAY 2000011  0.27626848
    0.98459113   2    1000025    11
    0.011856932   2    1000022    11
    0.003551936   2    1000023    11

DECAY 1000013  0.00098006062
    0.4168113   2    1000022    13
    0.38935915   2   -1000024    14
    0.19382955   2    1000023    13

DECAY 2000013  0.27626845
    0.98459113   2    1000025    13
    0.011856934   2    1000022    13
    0.0035519364   2    1000023    13

DECAY 1000015  2.9507782
    0.49969632   2   -1000024    16
    0.25183645   2    1000022    15
    0.24846723   2    1000023    15

DECAY 2000015  4.2589622
    0.46463745   2    1000022    15
    0.46312389   2    1000023    15
    0.036680094   2    1000015    25
    0.03555413   2    1000015    23
    4.4335238e-06   2   -1000024    16

DECAY 1000012  0.010752276
    0.6493211   2    1000024    11
    0.25825575   2    1000022    12
    0.092423155   2    1000023    12

DECAY 1000014  0.010752276
    0.6493211   2    1000024    13
    0.25825575   2    1000022    14
    0.092423156   2    1000023    14

DECAY 1000016  4.2567455
    0.92959799   2    1000024    15
    0.068839831   2   -1000015   -24
    0.0011497125   2    1000022    16
    0.00041246528   2    1000023    16

DECAY 1000024  8.0533006e-12
    0.5999994   3    1000022    2   -1
    0.2000003   3    1000022   -11    12
    0.2000003   3    1000022   -13    14

DECAY 1000037  193.36823
    0.10775708   2   -2000005    6
    0.096126393   2    1000006   -5
    0.060498711   2    1000002   -1
    0.060498709   2    1000004   -3
    0.060464099   2   -1000001    2
    0.060464058   2   -1000003    4
    0.052939997   2    1000012   -11
    0.052939997   2    1000014   -13
    0.052922724   2   -1000011    12
    0.052922724   2   -1000013    14
    0.039771461   2    1000024    25
    0.039151432   2    1000024    23
    0.037991371   2    1000023    24
    0.037842688   2    1000022    24
    0.036089008   2    1000016   -15
    0.036056209   2   -2000015    16
    0.025452414   2    1000022    37
    0.025420706   2    1000024    36
    0.025404107   2    1000024    35
    0.025353861   2    1000023    37
    0.0130448   2    2000006   -5
    0.00083630885   2   -1000005    6
    4.3678112e-05   2    1000025    24
    7.4579131e-06   2   -1000015    16

DECAY 1000022 -1


DECAY 1000023  1.5563428e-10
    0.18806321   3    1000022   -1    1
    0.18806321   3    1000022   -3    3
    0.14482968   3    1000022   -2    2
    0.11084706   2    1000022    22
    0.086480194   3    1000022   -12    12
    0.086480194   3    1000022   -14    14
    0.086480057   3    1000022   -16    16
    0.043246095   3    1000022   -11    11
    0.043246095   3    1000022   -13    13
    0.0066792591   3    1000024   -2    1
    0.0066792591   3   -1000024   -1    2
    0.0022264227   3    1000024   -12    11
    0.0022264227   3   -1000024    12   -11
    0.0022264227   3    1000024   -14    13
    0.0022264227   3   -1000024    14   -13

DECAY 1000025  44.358122
    0.11096141   2    1000015   -15
    0.11096141   2   -1000015    15
    0.047207781   2    2000001   -1
    0.047207781   2   -2000001    1
    0.047207781   2    2000003   -3
    0.047207781   2   -2000003    3
    0.042583544   2    1000024   -24
    0.042583544   2   -1000024    24
    0.03415042   2    1000022    25
    0.033531388   2    1000023    23
    0.022697149   2    1000011   -11
    0.022697149   2   -1000011    11
    0.022697149   2    1000013   -13
    0.022697149   2   -1000013    13
    0.022475467   2    1000012   -12
    0.022475467   2   -1000012    12
    0.022475467   2    1000014   -14
    0.022475467   2   -1000014    14
    0.022294892   2    2000006   -6
    0.022294892   2   -2000006    6
    0.020161664   2    1000024   -37
    0.020161664   2   -1000024    37
    0.019546176   2    1000005   -5
    0.019546176   2   -1000005    5
    0.016244601   2    1000022    35
    0.016218069   2    1000023    36
    0.010423556   2    2000015   -15
    0.010423556   2   -2000015    15
    0.010326847   2    1000023    25
    0.010326341   2    1000016   -16
    0.010326341   2   -1000016    16
    0.010006506   2    1000022    23
    0.0084696922   2    1000006   -6
    0.0084696922   2   -1000006    6
    0.0037652614   2    1000022    36
    0.0037337037   2    1000023    35
    0.0036195249   2    2000005   -5
    0.0036195249   2   -2000005    5
    0.00073097718   2    1000002   -2
    0.00073097718   2   -1000002    2
    0.0007309704   2    1000004   -4
    0.0007309704   2   -1000004    4
    0.00070103098   2    1000001   -1
    0.00070103098   2   -1000001    1
    0.00070103098   2    1000003   -3
    0.00070103098   2   -1000003    3

DECAY 1000035  193.34636
    0.054534455   2    2000005   -5
    0.054534455   2   -2000005    5
    0.047505682   2    1000006   -6
    0.047505682   2   -1000006    6
    0.037936402   2    1000024   -24
    0.037936402   2   -1000024    24
    0.030244667   2    1000002   -2
    0.030244667   2   -1000002    2
    0.030244646   2    1000004   -4
    0.030244646   2   -1000004    4
    0.030231034   2    1000001   -1
    0.030231034   2   -1000001    1
    0.030231034   2    1000003   -3
    0.030231034   2   -1000003    3
    0.028717301   2    1000022    25
    0.028283833   2    1000023    23
    0.026523871   2    1000012   -12
    0.026523871   2   -1000012    12
    0.026523871   2    1000014   -14
    0.026523871   2   -1000014    14
    0.026409185   2    1000011   -11
    0.026409185   2   -1000011    11
    0.026409185   2    1000013   -13
    0.026409185   2   -1000013    13
    0.025353495   2    1000024   -37
    0.025353495   2   -1000024    37
    0.018174091   2    1000022    35
    0.018149451   2    1000023    36
    0.018080339   2    1000016   -16
    0.018080339   2   -1000016    16
    0.017991844   2    2000015   -15
    0.017991844   2   -2000015    15
    0.011000419   2    1000023    25
    0.010903669   2    1000022    23
    0.0073200849   2    1000022    36
    0.0072831163   2    1000023    35
    0.0064178507   2    2000006   -6
    0.0064178507   2   -2000006    6
    0.00042273624   2    1000005   -5
    0.00042273624   2   -1000005    5
    3.9194798e-05   2    1000025    25
    3.7846875e-06   2    1000015   -15
    3.7846875e-06   2   -1000015    15
    5.3495983e-07   2    1000025    23
    2.6873644e-08   2    2000001   -1
    2.6873644e-08   2   -2000001    1
    2.6873644e-08   2    2000003   -3
    2.6873644e-08   2   -2000003    3
    7.7038848e-09   2    2000011   -11
    7.7038848e-09   2   -2000011    11
    7.7038848e-09   2    2000013   -13
    7.7038848e-09   2   -2000013    13

DECAY 25  0.0047848526
    0.58896081   2    5   -5
    0.23166518   2    24   -24
    0.07056236   2    21    21
    0.056169244   2   -15    15
    0.030021517   2    23    23
    0.018425125   2    4   -4
    0.0021487206   2    22    22
    0.0016324792   2    22    23
    0.00021576165   2    3   -3
    0.00019879718   2   -13    13

DECAY 35  24.836533
    0.86273475   2    5   -5
    0.13400722   2   -15    15
    0.0024589332   2    6   -6
    0.00047059166   2   -13    13
    0.00026899342   2    3   -3
    4.05637e-05   2    21    21
    1.3573344e-05   2    25    25
    3.5558636e-06   2    24   -24
    1.7677138e-06   2    23    23
    2.5892433e-08   2    4   -4
    1.7542331e-08   2    23    22
    1.4887715e-08   2    22    22

DECAY 36  24.839308
    0.86268041   2    5   -5
    0.1339948   2   -15    15
    0.0025037625   2    6   -6
    0.00047054561   2   -13    13
    0.00026898495   2    3   -3
    7.7841622e-05   2    21    21
    3.5638272e-06   2    23    25
    4.1810747e-08   2    23    22
    2.5658884e-08   2    4   -4
    2.3306881e-08   2    22    22

DECAY 37  21.679186
    0.84392139   2    6   -5
    0.15377781   2   -15    16
    0.0014238484   2    4   -5
    0.00054001703   2   -13    14
    0.00030317805   2    4   -3
    1.5401591e-05   2    2   -3
    1.4238425e-05   2    2   -5
    4.1134937e-06   2    24    25
    6.3180208e-12   2    24    36

DECAY 5 -1


DECAY 15 -1


DECAY 23  2.4952


DECAY 24  2.085
