BLOCK SPINFO
   1   SPheno
   2   v4.0.5be

BLOCK SPHENOINFO
   1   2
   2   2

BLOCK MODSEL
   1   0

BLOCK MINPAR
   3    26.579853
   4   -1

BLOCK EXTPAR
   0    1320.7662
   1    554.11705
   2   -536.91935
   3    3000
   11    2865.2512
   12    78.954289
   13   -226.84379
   23   -874.00974
   25    25.891319
   26    3109.9059
   31    1446.353
   32    1446.353
   33    787.27747
   34    1232.7631
   35    1232.7631
   36    686.7676
   41    5000
   42    5000
   43    1606.2274
   44    5000
   45    5000
   46    1206.7898
   47    5000
   48    5000
   49    727.05962

BLOCK SMINPUTS
   1    127.90897
   2    1.1663787e-05
   3    0.1184
   4    91.1876
   5    4.18
   6    173.2
   7    1.777
   8    0
   11    0.00051099893
   12    0
   13    0.10565837
   14    0
   21    0.005
   22    0.0025
   23    0.095
   24    1.27

BLOCK GAUGE Q=  1320.7662
   1    0.35536298
   2    0.66519887
   3    1.219778

BLOCK YU Q=  1320.7662
   1   1    8.3906234e-06
   2   2    0.0042624367
   3   3    1.0136547

BLOCK YD Q=  1320.7662
   1   1    0.00043654464
   2   2    0.0082943481
   3   3    0.43291549

BLOCK YE Q=  1320.7662
   1   1    7.6180232e-05
   2   2    0.015751656
   3   3    0.26491694

BLOCK AU Q=  1320.7662
   1   1    0
   2   2    0
   3   3    2865.2512

BLOCK AD Q=  1320.7662
   1   1    0
   2   2    0
   3   3    78.954303

BLOCK AE Q=  1320.7662
   1   1    0
   2   2    0
   3   3   -226.84379

BLOCK MSOFT Q=  1320.7662
   1    554.11705
   2   -536.91935
   3    3000
   21    8908662.8
   22   -699967.33
   31    1446.353
   32    1446.353
   33    787.27747
   34    1232.7631
   35    1232.7631
   36    686.7676
   41    5000
   42    5000
   43    1606.2274
   44    5000
   45    5000
   46    1206.7898
   47    5000
   48    5000
   49    727.05962

BLOCK MASS
   6    173.2
   23    91.1876
   24    80.429995
   15    1.777
   25    123.7495
   35    3109.1806
   36    3109.9059
   37    3110.3344
   1000001    5021.739
   2000001    5011.2971
   1000002    5021.2967
   2000002    5013.1955
   1000003    5021.7427
   2000003    5011.3004
   1000004    5021.2993
   2000004    5013.1965
   1000005    641.28366
   2000005    1568.8253
   1000006    1076.9053
   2000006    1619.8485
   1000011    1451.2535
   2000011    1233.5073
   1000012    1448.7217
   1000013    1451.2569
   2000013    1233.5055
   1000014    1448.7215
   1000015    683.57042
   2000015    802.82968
   1000016    791.86065
   1000021    3178.4881
   1000022    551.95433
   1000023   -561.65533
   1000025    882.21485
   1000035   -888.01375
   1000024    561.28331
   1000037    889.97251

BLOCK ALPHA
      -0.03769663

BLOCK HMIX Q=  1320.7662
   1   -874.00974
   2    25.891319
   3    244.11885
   4    9671514.5

BLOCK STOPMIX
   1   1   -0.32036072
   1   2    0.94729563
   2   1   -0.94729563
   2   2   -0.32036072

BLOCK SBOTMIX
   1   1   -0.036719532
   1   2    0.99932561
   2   1   -0.99932561
   2   2   -0.036719532

BLOCK STAUMIX
   1   1   -0.24393785
   1   2    0.96979087
   2   1   -0.96979087
   2   2   -0.24393785

BLOCK NMIX
   1   1    0.99547761
   1   2    0.0032204396
   1   3   -0.081289294
   1   4   -0.049051017
   2   1    0.0043453775
   2   2    0.98304529
   2   3    0.15304353
   2   4   -0.10089977
   3   1    0.092171884
   3   2   -0.037148442
   3   3    0.70135669
   3   4    0.70584922
   4   1    0.022578404
   4   2   -0.17953158
   4   3    0.69142499
   4   4   -0.69942127

BLOCK UMIX
   1   1   -0.97651957
   1   2   -0.2154287
   2   1   -0.2154287
   2   2    0.97651957

BLOCK VMIX
   1   1    0.98984827
   1   2    0.14212813
   2   1    0.14212813
   2   2   -0.98984827

BLOCK HIGGSBOUNDSINPUTHIGGSCOUPLINGSFERMIONS
       0, 670.36041,3,36,15,15

BLOCK HIGGSBOUNDSINPUTHIGGSCOUPLINGSBOSONS
       0,4,36,21,21,23

BLOCK SPHENOLOWENERGY
   1    0.00030347211
   2    1.591086e-06
   3    3.5208818e-05
   4    2.3369569e-15
   5    9.9831955e-11
   6    2.0889827e-08
   7    7.9278542e-14
   8    3.3867701e-09
   9    7.1804206e-07
   10    9.6490237e-05
   11    0.99670721
   12    0.54264888
   13    19.388094
   14    0
   15    0
   16    0.0021594294
   17    2.28168e-15
   18    2.4763473e-11
   19    8.2818994e-11
   20    5.7546175e-15
   21    2.4602954e-10
   22    9.2946176e-08
   23    0
   24    0
   25    0
   26    0
   27    0
   28    0
   29    0
   30    0
   31    0
   39    7.6636317e-05
   40    0
   41    0
   42    0

BLOCK FWCOEF Q=  160
   305   4422   0   0   -0.18881911
   305   4422   0   2   -0.1672782
   305   4322   0   2    4.8677813e-05
   305   6421   0   0   -0.095227835
   305   6421   0   2   -0.089355486
   305   6321   0   2   -7.8340346e-05
   3051111   4133   0   0    1.5874233
   3051111   4133   0   2    1.5885346
   3051111   4233   0   2    8.1183871e-05
   3051111   4137   0   0   -4.4101155
   3051111   4137   0   2   -4.4041338
   3051111   4237   0   2   -0.00063495558
   3051313   4133   0   0    1.5874233
   3051313   4133   0   2    1.5885331
   3051313   4233   0   2    8.1183656e-05
   3051313   4137   0   0   -4.4101155
   3051313   4137   0   2   -4.4041352
   3051313   4237   0   2   -0.00063495597
   3051212   4137   0   0    1.5053501
   3051212   4137   0   2    1.5040589
   3051212   4237   0   2    0.00013851737
   3051414   4137   0   0    1.5053501
   3051414   4137   0   2    1.5040589
   3051414   4237   0   2    0.00013851739
   3051616   4137   0   0    1.5053501
   3051616   4137   0   2    1.5040597
   3051616   4237   0   2    0.00013852025

BLOCK IMFWCOEF Q=  160
   305   4422   0   0    3.8587835e-07
   305   4422   0   2    1.0565558e-05
   305   4322   0   2    2.9215057e-06
   305   6421   0   0    3.3053032e-07
   305   6421   0   2    9.2313674e-06
   305   6321   0   2    1.2806538e-06
   3051111   4133   0   2    7.5956396e-08
   3051111   4233   0   2    1.7351369e-06
   3051111   4137   0   2    1.3923161e-06
   3051111   4237   0   2   -1.3579018e-05
   3051313   4133   0   2    7.5935132e-08
   3051313   4233   0   2    1.735134e-06
   3051313   4137   0   2    1.3923227e-06
   3051313   4237   0   2   -1.3579026e-05
   3051212   4137   0   2   -6.5640148e-08
   3051212   4237   0   2    2.9623242e-06
   3051414   4137   0   2   -6.5639645e-08
   3051414   4237   0   2    2.9623242e-06
   3051616   4137   0   2   -5.310399e-08
   3051616   4237   0   2    2.96232e-06

DECAY 23  2.4952


DECAY 24  2.085


DECAY 2000011  3.9420143
    0.99660808   2    1000022    11
    0.0031872309   2    1000025    11
    0.00018600797   2    1000035    11

DECAY 1000011  14.936355
    0.5898739   2   -1000024    12
    0.30038936   2    1000023    11
    0.089564823   2    1000022    11
    0.015453013   2   -1000037    12
    0.0046940508   2    1000035    11

DECAY 2000013  3.9450203
    0.99585273   2    1000022    13
    0.0033655421   2    1000025    13
    0.00035699532   2    1000035    13
    0.00033830184   2   -1000037    14

DECAY 1000013  14.939608
    0.58974781   2   -1000024    14
    0.30033348   2    1000023    13
    0.08954793   2    1000022    13
    0.015449772   2   -1000037    14
    0.0047825916   2    1000035    13
    0.00011861429   2    1000025    13

DECAY 1000015  0.49774115
    0.79962939   2    1000022    15
    0.13255783   2   -1000024    16
    0.067812781   2    1000023    15

DECAY 2000015  2.7767247
    0.57047847   2   -1000024    16
    0.29362918   2    1000023    15
    0.11624439   2    1000022    15
    0.019647866   2    1000015    23

DECAY 1000012  14.969008
    0.60296651   2    1000024    11
    0.29603392   2    1000023    12
    0.086975477   2    1000022    12
    0.0066715424   2    1000037    11
    0.0060940913   2    1000035    12
    0.0012584588   2    1000025    12

DECAY 1000014  14.971886
    0.60286605   2    1000024    13
    0.29597695   2    1000023    14
    0.086958738   2    1000022    14
    0.0068471254   2    1000037    13
    0.0060929171   2    1000035    14
    0.0012582163   2    1000025    14

DECAY 1000016  2.8899157
    0.58886399   2    1000024    15
    0.28766292   2    1000023    16
    0.089076368   2    1000022    16
    0.034396717   2    1000015    24

DECAY 2000001  144.04478
    0.98105168   2    1000021    1
    0.018783482   2    1000022    1
    0.00015500185   2    1000025    1

DECAY 1000001  207.64528
    0.68579864   2    1000021    1
    0.19797382   2   -1000024    2
    0.10015847   2    1000023    1
    0.0092694469   2   -1000037    2
    0.003365619   2    1000035    1
    0.0031471334   2    1000022    1
    0.00028686665   2    1000025    1

DECAY 2000003  144.05798
    0.98096418   2    1000021    3
    0.018782082   2    1000022    3
    0.0001769157   2    1000025    3

DECAY 1000003  207.65386
    0.68577215   2    1000021    3
    0.19796591   2   -1000024    4
    0.10015517   2    1000023    3
    0.0092771611   2   -1000037    4
    0.0033802835   2    1000035    3
    0.0031472192   2    1000022    3
    0.00030210225   2    1000025    3

DECAY 1000005  0.030738743
    0.84190897   2    1000022    5
    0.15809103   2    1000023    5

DECAY 2000005  72.493298
    0.526628   2    1000006   -24
    0.20451132   2   -1000037    6
    0.13329021   2   -1000024    6
    0.070552047   2    1000023    5
    0.019636195   2    1000035    5
    0.018846454   2    1000025    5
    0.013858884   2    1000005    23
    0.010251655   2    1000005    25
    0.0024252296   2    1000022    5

DECAY 2000002  152.43487
    0.92835088   2    1000021    2
    0.071026737   2    1000022    2
    0.00058590214   2    1000025    2

DECAY 1000002  207.64034
    0.68559303   2    1000021    2
    0.20340108   2    1000024    1
    0.10046742   2    1000023    2
    0.004034435   2    1000037    1
    0.0033841385   2    1000022    2
    0.0030769195   2    1000035    2

DECAY 2000004  152.43831
    0.92833017   2    1000021    4
    0.071025157   2    1000022    4
    0.00059146174   2    1000025    4

DECAY 1000004  207.64874
    0.68556635   2    1000021    4
    0.20339446   2    1000024    3
    0.10046349   2    1000023    4
    0.0040638125   2    1000037    3
    0.0033840246   2    1000022    4
    0.0030807862   2    1000035    4

DECAY 1000006  6.2653365
    0.29544818   2    1000037    5
    0.22033902   2    1000024    5
    0.14340765   2    1000022    6
    0.12931541   2    1000025    6
    0.10615742   2    1000023    6
    0.091826472   2    1000035    6
    0.0084399003   2    1000023    4
    0.0047739786   2    1000005    24
    0.0002909131   2    1000022    4

DECAY 2000006  75.187366
    0.29432076   2    1000006    23
    0.24254335   2    1000006    25
    0.11323013   2    1000024    5
    0.095430601   2    1000035    6
    0.090002124   2    1000025    6
    0.069077788   2    1000037    5
    0.05822653   2    1000023    6
    0.027572144   2    1000005    24
    0.0095965648   2    1000022    6

DECAY 1000024  2.5267182e-11
    0.39733544   3    1000022   -1    2
    0.36331214   3    1000022   -3    4
    0.10512689   3    1000022   -11    12
    0.10506122   3    1000022   -13    14
    0.02911064   3    1000022   -15    16

DECAY 1000037  6.237585
    0.28952761   2    1000023    24
    0.24204567   2    1000024    23
    0.2264387   2    1000024    25
    0.15025647   2   -1000005    6
    0.072919152   2    1000022    24
    0.011126111   2   -1000015    16
    0.0046145022   2    1000016   -15
    0.0020103665   2   -2000015    16
    0.00081146053   3    1000023   -5    6
    0.00023474417   3    1000022   -5    6

DECAY 1000022 -1


DECAY 1000023  1.547035e-10
    0.70513952   2    1000022    22
    0.064133043   3    1000022    1   -1
    0.064052097   3    1000022    3   -3
    0.050048892   3    1000022    2   -2
    0.0497439   3    1000022    12   -12
    0.038573972   3    1000022    4   -4
    0.011253417   3    1000022    11   -11
    0.011231197   3    1000022    13   -13
    0.004134254   3    1000022    15   -15
    0.0016897041   3    1000022    5   -5

DECAY 1000025  7.6134747
    0.2286887   2    1000023    23
    0.19711225   2    1000024   -24
    0.19711225   2   -1000024    24
    0.16903452   2    1000023    25
    0.070423718   2    1000005   -5
    0.070423718   2   -1000005    5
    0.047358935   2    1000022    25
    0.0060687143   2    1000015   -15
    0.0060687143   2   -1000015    15
    0.0038167067   2    1000022    23
    0.001314296   2    2000015   -15
    0.001314296   2   -2000015    15
    0.00054202519   3    1000024    5   -6
    0.00054202519   3   -1000024   -5    6

DECAY 1000035  7.2056497
    0.25289163   2    1000024   -24
    0.25289163   2   -1000024    24
    0.18944784   2    1000023    25
    0.073717504   2    1000005   -5
    0.073717504   2   -1000005    5
    0.068701549   2    1000022    23
    0.061838313   2    1000022    25
    0.0098265137   2    1000023    23
    0.005316932   2    1000015   -15
    0.005316932   2   -1000015    15
    0.0019693005   2    2000015   -15
    0.0019693005   2   -2000015    15
    0.00077715135   3    1000024    5   -6
    0.00077715135   3   -1000024   -5    6
    0.00041771724   2    1000016   -16
    0.00041771724   2   -1000016    16

DECAY 1000021  268.1517
    0.16147023   2    1000005   -5
    0.16147023   2   -1000005    5
    0.14757158   2    1000006   -6
    0.14757158   2   -1000006    6
    0.10033987   2    2000005   -5
    0.10033987   2   -2000005    5
    0.087331125   2    2000006   -6
    0.087331125   2   -2000006    6
    0.0029848803   2    1000006   -4
    0.0029848803   2   -1000006    4
    0.0001169457   3    1000025    5   -5
    0.00010997015   3    1000035    5   -5

DECAY 25  0.0036916442
    0.59116148   2   -5    5
    0.21016763   2   -24    24
    0.072731413   2    21    21
    0.067763403   2   -15    15
    0.029126341   2   -4    4
    0.02481276   2    23    23
    0.0023732045   2    22    22
    0.0014065214   2    22    23
    0.00023496933   2   -13    13
    0.00022151174   2   -3    3
    6.1245659e-07   2   -1    1
    1.5009722e-07   2   -2    2
    5.2823876e-09   2   -11    11

DECAY 35  91.334439
    0.53214819   2   -5    5
    0.10523453   2   -1000024    1000037
    0.10523453   2   -1000037    1000024
    0.060227511   2    1000022    1000025
    0.052916372   2   -15    15
    0.038705077   2    1000022    1000035
    0.016928753   2   -2000006    1000006
    0.016928753   2   -1000006    2000006
    0.013907767   2    1000023    1000035
    0.013898054   2    1000023    1000025
    0.012847083   2   -1000006    1000006
    0.0091515695   2   -1000024    1000024
    0.0045300991   2    1000022    1000022
    0.0040735729   2    1000025    1000035
    0.0040573155   2   -6    6
    0.0031337095   2    1000022    1000023
    0.0022142895   2    1000035    1000035
    0.0021756305   2   -1000037    1000037
    0.00062349755   2    1000025    1000025
    0.00041817746   2    1000023    1000023
    0.00017500785   2   -13    13
    0.00011303121   2   -2000015    1000015
    0.00011303121   2   -1000015    2000015
    0.00010657843   2   -3    3
    3.5530381e-05   2   -2000015    2000015
    3.3726031e-05   2   -1000015    1000015
    2.9659947e-05   2   -2000005    1000005
    2.9659947e-05   2   -1000005    2000005
    3.6409542e-06   2    25    25
    1.8709259e-06   2    21    21
    1.55742e-06   2   -1000005    1000005
    5.4217699e-07   2    23    23
    2.946265e-07   2   -1    1
    1.8075271e-07   2    22    23
    1.5622907e-07   2   -24    24
    9.6636197e-08   2    22    22
    5.277775e-08   2   -1000011    1000011
    5.2254857e-08   2   -1000013    1000013
    4.9015168e-08   2   -2000013    2000013
    4.8959801e-08   2   -2000011    2000011
    3.8538622e-08   2   -4    4
    4.7990115e-09   2   -2000013    1000013
    4.7990115e-09   2   -1000013    2000013
    3.9305251e-09   2   -11    11
    1.9864202e-13   2   -2    2
    1.1225757e-13   2   -2000011    1000011
    1.1225757e-13   2   -1000011    2000011

DECAY 36  88.40638
    0.51524739   2   -5    5
    0.10660631   2   -1000024    1000037
    0.10660631   2   -1000037    1000024
    0.058095318   2    1000022    1000035
    0.051248999   2   -15    15
    0.042871819   2    1000022    1000025
    0.026781744   2   -2000006    1000006
    0.026781744   2   -1000006    2000006
    0.015468612   2    1000023    1000025
    0.013450448   2    1000023    1000035
    0.011744644   2   -1000024    1000024
    0.0058205158   2    1000022    1000022
    0.004247099   2   -1000037    1000037
    0.0039422231   2    1000035    1000035
    0.003609902   2   -6    6
    0.0028505566   2    1000022    1000023
    0.0027078066   2    1000025    1000035
    0.00081373729   2    1000025    1000025
    0.00045119607   2    1000023    1000023
    0.00016949021   2   -13    13
    0.00015246492   2   -2000015    1000015
    0.00015246492   2   -1000015    2000015
    0.00010321441   2   -3    3
    3.0958278e-05   2   -2000005    1000005
    3.0958278e-05   2   -1000005    2000005
    1.2592861e-05   2    21    21
    9.3573111e-07   2    23    25
    2.8532608e-07   2   -1    1
    1.3532577e-07   2    22    23
    7.3834819e-08   2    22    22
    3.2158634e-08   2   -4    4
    4.9675218e-09   2   -2000013    1000013
    4.9675218e-09   2   -1000013    2000013
    3.8065964e-09   2   -11    11
    1.6576633e-13   2   -2    2
    1.1619079e-13   2   -2000011    1000011
    1.1619079e-13   2   -1000011    2000011
    3.3041556e-38   2    25    25

DECAY 37  89.526595
    0.54755246   2   -5    6
    0.11473344   2    1000022    1000037
    0.11093359   2    1000024    1000035
    0.10633016   2    1000024    1000025
    0.049085747   2   -15    16
    0.030085229   2   -2000005    1000006
    0.027791728   2    1000023    1000037
    0.0060383657   2    1000023    1000024
    0.004498958   2    1000025    1000037
    0.0013229827   2   -1000005    1000006
    0.00080925122   2   -5    4
    0.00027832776   2   -1000015    1000016
    0.00022709487   2    1000035    1000037
    0.00017353563   2   -13    14
    0.00010063643   2   -3    4
    2.3204441e-05   2   -2000015    1000016
    5.7788886e-06   2   -5    2
    4.7143759e-06   2   -3    2
    2.8981453e-06   2   -3    6
    9.2494096e-07   2    24    25
    2.7906895e-07   2   -1    2
    1.9738042e-07   2   -2000013    1000014
    1.9730511e-07   2   -2000011    1000012
    1.2608395e-07   2   -1    6
    1.0638135e-07   2    1000022    1000024
    3.7504815e-08   2   -1000005    2000006
    1.4189931e-08   2   -1    4
    9.3990628e-09   2   -1000013    1000014
    4.0590165e-09   2   -11    12
    2.1984173e-13   2   -1000011    1000012
    3.1104308e-14   2    24    35

DECAY 6  2.43
    1   2    5    24

DECAY 15 -1
