BLOCK SPINFO
   1   SPheno
   2   v4.0.5be

BLOCK SPHENOINFO
   1   2
   2   2

BLOCK MODSEL
   1   0

BLOCK MINPAR
   3    52.005398
   4   -1

BLOCK EXTPAR
   0    4644.009
   1    285.21206
   2   -507.73242
   3    4156.7318
   11    3997.6035
   12   -3657.0504
   13   -6035.5899
   23   -624.3364
   25    51.758081
   26    4070.9421
   31    3956.1844
   32    3956.1844
   33    4236.6806
   34    56.628257
   35    56.628257
   36    3678.8924
   41    1811.3946
   42    1811.3946
   43    4438.1743
   44    2937.2224
   45    2937.2224
   46    4716.2302
   47    643.78697
   48    643.78697
   49    4470.4614

BLOCK SMINPUTS
   1    127.90897
   2    1.1663787e-05
   3    0.1184
   4    91.1876
   5    4.18
   6    173.2
   7    1.777
   8    0
   11    0.00051099893
   12    0
   13    0.10565837
   14    0
   21    0.005
   22    0.0025
   23    0.095
   24    1.27

BLOCK GAUGE Q=  4644.009
   1    0.35536298
   2    0.66519887
   3    1.219778

BLOCK YU Q=  4644.009
   1   1    8.3859369e-06
   2   2    0.0042600559
   3   3    1.0130885

BLOCK YD Q=  4644.009
   1   1    0.00087218779
   2   2    0.016571568
   3   3    0.86493698

BLOCK YE Q=  4644.009
   1   1    0.00015220315
   2   2    0.031470784
   3   3    0.52928681

BLOCK AU Q=  4644.009
   1   1    0
   2   2    0
   3   3    3997.6029

BLOCK AD Q=  4644.009
   1   1    0
   2   2    0
   3   3   -3657.0489

BLOCK AE Q=  4644.009
   1   1    0
   2   2    0
   3   3   -6035.5894

BLOCK MSOFT Q=  4644.009
   1    285.21206
   2   -507.73242
   3    4156.7318
   21    17166496
   22    77262.951
   31    3956.1844
   32    3956.1844
   33    4236.6806
   34    56.628257
   35    56.628257
   36    3678.8924
   41    1811.3946
   42    1811.3946
   43    4438.1743
   44    2937.2224
   45    2937.2224
   46    4716.2302
   47    643.78697
   48    643.78697
   49    4470.4614

BLOCK MASS
   6    173.2
   23    91.1876
   24    80.429995
   15    1.777
   25    124.30581
   35    4065.6634
   36    4070.9421
   37    4066.4318
   1000001    2082.3811
   2000001    1112.9841
   1000002    2080.808
   2000002    3132.3452
   1000003    2082.3628
   2000003    1112.9207
   1000004    2080.7895
   2000004    3132.3444
   1000005    4526.9438
   2000005    4561.8718
   1000006    4518.8963
   2000006    4772.5857
   1000011    3959.0587
   2000011    310.26777
   1000012    3957.879
   1000013    3959.0143
   2000013    309.48007
   1000014    3957.8187
   1000015    3652.5484
   2000015    4219.2238
   1000016    4217.7418
   1000021    4321.359
   1000022    276.30484
   1000023   -509.2954
   1000025    625.1947
   1000035   -651.6187
   1000024    509.62561
   1000037    652.84875

BLOCK ALPHA
      -0.019258694

BLOCK HMIX Q=  4644.009
   1   -624.3364
   2    51.758081
   3    242.79098
   4    16572570

BLOCK STOPMIX
   1   1   -0.97792258
   1   2    0.20896751
   2   1   -0.20896751
   2   2   -0.97792258

BLOCK SBOTMIX
   1   1   -0.97474831
   1   2    0.22330637
   2   1   -0.22330637
   2   2   -0.97474831

BLOCK STAUMIX
   1   1   -0.010541706
   1   2    0.99994443
   2   1   -0.99994443
   2   2   -0.010541706

BLOCK NMIX
   1   1    0.99562868
   1   2    0.0035181008
   1   3   -0.085829496
   1   4   -0.036666712
   2   1    0.015969577
   2   2    0.89689526
   2   3    0.34173581
   2   4   -0.28025079
   3   1    0.086588388
   3   2   -0.047651856
   3   3    0.70057164
   3   4    0.70670441
   4   1    0.031160086
   4   2   -0.4396542
   4   3    0.62052342
   4   4   -0.64860151

BLOCK UMIX
   1   1   -0.87224979
   1   2   -0.48906064
   2   1   -0.48906064
   2   2    0.87224979

BLOCK VMIX
   1   1    0.91485536
   1   2    0.4037817
   2   1    0.4037817
   2   2   -0.91485536

BLOCK HIGGSBOUNDSINPUTHIGGSCOUPLINGSFERMIONS
       0, 2678.8989,3,36,15,15

BLOCK HIGGSBOUNDSINPUTHIGGSCOUPLINGSBOSONS
       0,4,36,21,21,23

BLOCK SPHENOLOWENERGY
   1    0.00032055711
   2    1.5902397e-06
   3    3.5252741e-05
   4    2.9266768e-15
   5    1.2502242e-10
   6    2.606382e-08
   7    1.002498e-13
   8    4.2825983e-09
   9    9.0432281e-07
   10    9.5988608e-05
   11    0.99152558
   12    0.54177345
   13    19.35573
   14    0
   15    0
   16    0.0021566262
   17    2.2816523e-15
   18    2.479963e-11
   19    8.2904252e-11
   20    2.1933515e-15
   21    9.3843355e-11
   22    1.9798271e-08
   23    0
   24    0
   25    0
   26    0
   27    0
   28    0
   29    0
   30    0
   31    0
   39    7.1658908e-05
   40    0
   41    0
   42    0

BLOCK FWCOEF Q=  160
   305   4422   0   0   -0.18881911
   305   4422   0   2   -0.18860947
   305   4322   0   2    3.456069e-05
   305   6421   0   0   -0.095227835
   305   6421   0   2   -0.098406599
   305   6321   0   2   -4.709885e-05
   3051111   4133   0   0    1.6329018
   3051111   4133   0   2    1.6330899
   3051111   4233   0   2    0.00042793987
   3051111   4137   0   0   -4.4555939
   3051111   4137   0   2   -4.4540322
   3051111   4237   0   2   -0.0031395106
   3051313   4133   0   0    1.6329018
   3051313   4133   0   2    1.6330892
   3051313   4233   0   2    0.00042793834
   3051313   4137   0   0   -4.4555939
   3051313   4137   0   2   -4.4540329
   3051313   4237   0   2   -0.0031395128
   3051212   4137   0   0    1.5053501
   3051212   4137   0   2    1.5050185
   3051212   4237   0   2    0.00067794198
   3051414   4137   0   0    1.5053501
   3051414   4137   0   2    1.5050185
   3051414   4237   0   2    0.00067794204
   3051616   4137   0   0    1.5053501
   3051616   4137   0   2    1.5050184
   3051616   4237   0   2    0.0006779591

BLOCK IMFWCOEF Q=  160
   305   4422   0   0    3.8583534e-07
   305   4422   0   2    1.1804678e-05
   305   4322   0   2    2.0430846e-06
   305   6421   0   0    3.3049348e-07
   305   6421   0   2    9.2442945e-06
   305   6321   0   2    1.0561809e-06
   3051111   4133   0   2    6.9972858e-07
   3051111   4233   0   2    8.4009508e-06
   3051111   4137   0   2   -2.8494884e-07
   3051111   4237   0   2   -6.1633824e-05
   3051313   4133   0   2    6.9972053e-07
   3051313   4233   0   2    8.4009287e-06
   3051313   4137   0   2   -2.8492215e-07
   3051313   4237   0   2   -6.1633868e-05
   3051212   4137   0   2    1.6295761e-07
   3051212   4237   0   2    1.3309116e-05
   3051414   4137   0   2    1.6295841e-07
   3051414   4237   0   2    1.3309116e-05
   3051616   4137   0   2    1.6196916e-07
   3051616   4237   0   2    1.3309116e-05

DECAY 23  2.4952


DECAY 24  2.085


DECAY 2000011  0.066182492
    1   2    1000022    11

DECAY 1000011  55.248178
    0.46416877   2   -1000024    12
    0.25008611   2    1000023    11
    0.14278639   2   -1000037    12
    0.089536181   2    1000022    11
    0.053421949   2    1000035    11

DECAY 2000013  0.063464343
    1   2    1000022    13

DECAY 1000013  55.322686
    0.46353809   2   -1000024    14
    0.24990566   2    1000023    13
    0.14259231   2   -1000037    14
    0.089424852   2    1000022    13
    0.053863144   2    1000035    13
    0.00065854117   2    1000025    13

DECAY 1000015  56.537099
    0.32101185   2    1000022    15
    0.25288883   2   -1000037    16
    0.168383   2    1000025    15
    0.12846473   2    1000035    15
    0.086748572   2   -1000024    16
    0.042503014   2    1000023    15

DECAY 2000015  81.712255
    0.33262252   2   -1000024    16
    0.21196973   2    1000023    15
    0.14576922   2    1000035    15
    0.13544682   2    1000025    15
    0.10668551   2   -1000037    16
    0.066471288   2    1000022    15
    0.00052549454   2    1000015    23
    0.00050941767   2    1000015    25

DECAY 1000012  55.269628
    0.51026094   2    1000024    11
    0.24057932   2    1000023    12
    0.097261797   2    1000037    11
    0.087137977   2    1000022    12
    0.062117273   2    1000035    12
    0.002642695   2    1000025    12

DECAY 1000014  55.34291
    0.50990274   2    1000024    13
    0.24025685   2    1000023    14
    0.098146038   2    1000037    13
    0.087021242   2    1000022    14
    0.06203397   2    1000035    14
    0.0026391513   2    1000025    14

DECAY 1000016  81.729367
    0.4359687   2    1000024    15
    0.27905782   2    1000037    15
    0.17407203   2    1000023    16
    0.062869678   2    1000022    16
    0.045063361   2    1000035    16
    0.0019161234   2    1000025    16
    0.0010522977   2    1000015    24

DECAY 2000001  0.54492502
    0.99530559   2    1000022    1
    0.0040123006   2    1000025    1
    0.00048335107   2    1000035    1
    0.00018402042   2    1000023    1

DECAY 1000001  24.142915
    0.5105511   2   -1000024    2
    0.26824057   2    1000023    1
    0.14766034   2   -1000037    2
    0.061232747   2    1000035    1
    0.011064463   2    1000022    1
    0.0012507385   2    1000025    1

DECAY 2000003  0.55065952
    0.98494288   2    1000022    3
    0.006499321   2    1000025    3
    0.0036139285   2   -1000037    4
    0.0023087155   2    1000035    3
    0.0016495235   2   -1000024    4
    0.0009856323   2    1000023    3

DECAY 1000003  24.153034
    0.51033448   2   -1000024    4
    0.26817414   2    1000023    3
    0.1476193   2   -1000037    4
    0.061353045   2    1000035    3
    0.011063075   2    1000022    3
    0.0014409784   2    1000025    3

DECAY 1000005  210.94152
    0.34335365   2   -1000037    6
    0.24482635   2   -1000024    6
    0.14641588   2    1000025    5
    0.12870101   2    1000023    5
    0.11446024   2    1000035    5
    0.013224721   2    1000021    5
    0.009018148   2    1000022    5

DECAY 2000005  141.08
    0.4304274   2   -1000037    6
    0.23474975   2    1000025    5
    0.21012088   2    1000035    5
    0.055505801   2   -1000024    6
    0.027102026   2    1000021    5
    0.026611711   2    1000023    5
    0.015482436   2    1000022    5

DECAY 1000002  24.22779
    0.55914768   2    1000024    1
    0.27045585   2    1000023    2
    0.10019356   2    1000037    1
    0.057950914   2    1000035    2
    0.011926961   2    1000022    2
    0.00032503995   2    1000025    2

DECAY 2000002  6.8828105
    0.9918263   2    1000022    2
    0.007024811   2    1000025    2
    0.00090322602   2    1000035    2
    0.00024566396   2    1000023    2

DECAY 1000004  24.237529
    0.55901478   2    1000024    3
    0.27034658   2    1000023    4
    0.10044208   2    1000037    3
    0.057936696   2    1000035    4
    0.011922092   2    1000022    4
    0.000337774   2    1000025    4

DECAY 2000004  6.8848892
    0.99152632   2    1000022    4
    0.0070985881   2    1000025    4
    0.00096610911   2    1000035    4
    0.0002578011   2    1000023    4
    0.00012579487   2    1000037    3

DECAY 1000006  212.76022
    0.2612136   2    1000024    5
    0.2224403   2    1000037    5
    0.21410537   2    1000025    6
    0.16685663   2    1000035    6
    0.12429026   2    1000023    6
    0.0039115445   2    1000022    6
    0.0037161852   2    1000021    6
    0.0034658072   3    1000022    24    5

DECAY 2000006  218.60681
    0.39787153   2    1000037    5
    0.20871859   2    1000025    6
    0.20410285   2    1000035    6
    0.058952876   2    1000021    6
    0.048117945   2    1000022    6
    0.034925869   2    1000024    5
    0.016840179   2    1000023    6
    0.011944036   2    1000005    24
    0.011790146   2    1000006    25
    0.0063614228   2    1000006    23
    0.00037455725   2    2000005    24

DECAY 1000024  0.025136586
    0.98068055   2    1000022    24
    0.019034978   2   -2000013    14
    0.0002828333   3    1000022   -5    6

DECAY 1000037  2.2154234
    0.57627437   2    1000023    24
    0.18957438   2    1000024    23
    0.1580506   2    1000022    24
    0.074137255   2    1000024    25
    0.0013276111   2   -2000013    14
    0.00062735616   3    1000022   -5    6

DECAY 1000022 -1


DECAY 1000023  0.05239057
    0.55700194   2    1000022    23
    0.42416761   2    1000022    25
    0.0069318832   2    2000013   -13
    0.0069318832   2   -2000013    13
    0.0024632519   2    2000011   -11
    0.0024632519   2   -2000011    11

DECAY 1000025  1.6731166
    0.49521201   2    1000023    23
    0.164517   2    1000022    25
    0.14459506   2    1000024   -24
    0.14459506   2   -1000024    24
    0.03274669   2    1000022    23
    0.0050433683   2    2000013   -13
    0.0050433683   2   -2000013    13
    0.0039984962   2    2000011   -11
    0.0039984962   2   -2000011    11
    0.00024573787   2    1000023    22

DECAY 1000035  3.0312325
    0.36618817   2    1000024   -24
    0.36618817   2   -1000024    24
    0.10870184   2    1000022    23
    0.096223534   2    1000022    25
    0.05811622   2    1000023    25
    0.002324408   2    1000023    23
    0.00080389345   2    2000013   -13
    0.00080389345   2   -2000013    13
    0.0003135722   2    2000011   -11
    0.0003135722   2   -2000011    11

DECAY 1000021  584.23784
    0.095429434   2    2000003   -3
    0.095429434   2   -2000003    3
    0.095427888   2    2000001   -1
    0.095427888   2   -2000001    1
    0.06459208   2    1000004   -4
    0.06459208   2   -1000004    4
    0.064591392   2    1000002   -2
    0.064591392   2   -1000002    2
    0.064533111   2    1000003   -3
    0.064533111   2   -1000003    3
    0.064532427   2    1000001   -1
    0.064532427   2   -1000001    1
    0.024656384   2    2000004   -4
    0.024656384   2   -2000004    4
    0.024656366   2    2000002   -2
    0.024656366   2   -2000002    2
    0.00053775956   3    1000037    5   -6
    0.00053775956   3   -1000037   -5    6
    0.00036586882   3    1000025    6   -6
    0.00031097871   3    1000025    5   -5
    0.00028234619   3    1000035    6   -6
    0.00026257831   3    1000024    5   -6
    0.00026257831   3   -1000024   -5    6
    0.00025540892   3    1000035    5   -5
    0.00014690137   3    1000023    6   -6
    0.00014268356   3    1000023    5   -5

DECAY 25  0.0037886054
    0.58353326   2   -5    5
    0.2173703   2   -24    24
    0.073228691   2    21    21
    0.067057226   2   -15    15
    0.028860319   2   -4    4
    0.02595194   2    23    23
    0.0020300088   2    22    22
    0.0015162052   2    22    23
    0.00023177151   2   -13    13
    0.00021951869   2   -3    3
    6.0694592e-07   2   -1    1
    1.4872607e-07   2   -2    2
    5.2104843e-09   2   -11    11

DECAY 35  213.42955
    0.65560791   2   -5    5
    0.10628651   2   -15    15
    0.055070714   2   -1000024    1000037
    0.055070714   2   -1000037    1000024
    0.02918318   2    1000023    1000025
    0.022319754   2   -1000024    1000024
    0.014194471   2    1000023    1000035
    0.011583787   2   -1000037    1000037
    0.010702964   2    1000023    1000023
    0.0098349005   2    1000022    1000025
    0.0088497342   2    1000025    1000035
    0.0083729943   2    1000035    1000035
    0.0066441413   2    1000022    1000035
    0.0042869041   2    1000022    1000023
    0.00062144297   2    1000025    1000025
    0.00038985866   2   -3    3
    0.00034417872   2   -13    13
    0.00031621408   2   -6    6
    0.0003130485   2    1000022    1000022
    5.0766662e-06   2    21    21
    1.0777133e-06   2   -1    1
    1.7894317e-07   2    25    25
    4.9978292e-08   2    23    23
    3.6790056e-08   2   -2000001    2000001
    3.6711147e-08   2   -2000003    2000003
    2.5163999e-08   2   -1000002    1000002
    2.5149058e-08   2   -1000004    1000004
    1.8101765e-08   2    22    23
    1.0359165e-08   2   -24    24
    7.7292981e-09   2   -11    11
    7.4185964e-09   2   -1000011    1000011
    7.2953084e-09   2   -1000013    1000013
    5.385339e-09   2   -4    4
    3.0230741e-09   2    22    22
    2.3467189e-09   2   -1000001    1000001
    2.3090139e-09   2   -1000003    1000003
    1.0551066e-09   2   -2000003    1000003
    1.0551066e-09   2   -1000003    2000003
    6.4047631e-11   2   -2000013    1000013
    6.4047631e-11   2   -1000013    2000013
    2.9225596e-12   2   -2000001    1000001
    2.9225596e-12   2   -1000001    2000001
    2.7767734e-14   2   -2    2
    1.4980025e-15   2   -2000011    1000011
    1.4980025e-15   2   -1000011    2000011

DECAY 36  195.23074
    0.63629005   2   -5    5
    0.10315407   2   -15    15
    0.057295493   2   -1000024    1000037
    0.057295493   2   -1000037    1000024
    0.027472004   2   -1000024    1000024
    0.027194247   2    1000023    1000025
    0.018322426   2    1000023    1000035
    0.015646296   2   -1000037    1000037
    0.013204027   2    1000023    1000023
    0.011058826   2    1000035    1000035
    0.010405331   2    1000022    1000025
    0.0083104969   2    1000025    1000035
    0.0076225162   2    1000022    1000035
    0.0046733637   2    1000022    1000023
    0.00069631388   2    1000025    1000025
    0.00037844321   2   -3    3
    0.00033787645   2    1000022    1000022
    0.00033401664   2   -13    13
    0.00029916185   2   -6    6
    8.2690924e-06   2    21    21
    1.0461417e-06   2   -1    1
    1.1772864e-07   2    23    25
    6.3234276e-08   2    22    23
    3.5892114e-08   2    22    22
    7.5011099e-09   2   -11    11
    5.079042e-09   2   -4    4
    1.1583444e-09   2   -2000003    1000003
    1.1583444e-09   2   -1000003    2000003
    7.5320237e-11   2   -2000013    1000013
    7.5320237e-11   2   -1000013    2000013
    2.3075325e-11   2    23    35
    3.2085146e-12   2   -2000001    1000001
    3.2085146e-12   2   -1000001    2000001
    2.618968e-14   2   -2    2
    1.7616694e-15   2   -2000011    1000011
    1.7616694e-15   2   -1000011    2000011
    7.2746982e-38   2    25    25

DECAY 37  214.13988
    0.65943779   2   -5    6
    0.10270891   2   -15    16
    0.075158166   2    1000023    1000037
    0.068209718   2    1000024    1000035
    0.057918815   2    1000024    1000025
    0.013766971   2    1000022    1000037
    0.01236772   2    1000025    1000037
    0.0085196025   2    1000022    1000024
    0.00097803786   2   -5    4
    0.00036311256   2   -13    14
    0.00034306613   2   -3    4
    0.00019925215   2    1000035    1000037
    1.6122698e-05   2   -3    2
    6.9841987e-06   2   -5    2
    3.5777988e-06   2    1000023    1000024
    9.5186701e-07   2   -1    2
    8.9498611e-07   2   -3    6
    1.0701159e-07   2    24    25
    5.8037424e-08   2   -2000001    1000002
    5.786866e-08   2   -2000003    1000004
    4.4763492e-08   2   -1    4
    1.7600921e-08   2   -1    6
    8.4932404e-09   2   -11    12
    3.0998689e-09   2   -2000003    1000002
    3.0995887e-09   2   -2000001    1000004
    1.9855913e-09   2   -1000003    1000004
    1.3017397e-10   2   -1000013    1000014
    1.0635856e-10   2   -1000003    1000002
    5.5092139e-12   2   -1000001    1000002
    2.1720333e-12   2   -1000003    2000004
    2.9424079e-13   2   -1000001    1000004
    3.0446146e-15   2   -1000011    1000012
    3.2187037e-16   2   -1000001    2000004
    6.1024475e-19   2   -1000003    2000002
    3.1609872e-20   2   -1000001    2000002

DECAY 6  2.43
    1   2    5    24

DECAY 15 -1
