BLOCK SPINFO
   1   SPheno
   2   v4.0.5be

BLOCK SPHENOINFO
   1   2
   2   2

BLOCK MODSEL
   1   0

BLOCK MINPAR
   3    39.207859
   4    1

BLOCK EXTPAR
   0    3261.7472
   1    63.636127
   2    4451.7861
   3    4073.7079
   11    6719.7836
   12    4059.0377
   13   -5159.4139
   23    266.30877
   25    38.033662
   26    1996.6051
   31    2586.3241
   32    2586.3241
   33    608.96271
   34    3185.4739
   35    3185.4739
   36    4109.5736
   41    2809.5623
   42    2809.5623
   43    4505.9547
   44    2647.4929
   45    2647.4929
   46    2277.3257
   47    2654.1625
   48    2654.1625
   49    1489.1584

BLOCK SMINPUTS
   1    127.90897
   2    1.1663787e-05
   3    0.1184
   4    91.1876
   5    4.18
   6    173.2
   7    1.777
   8    0
   11    0.00051099893
   12    0
   13    0.10565837
   14    0
   21    0.005
   22    0.0025
   23    0.095
   24    1.27

BLOCK GAUGE Q=  3261.7472
   1    0.35536298
   2    0.66519887
   3    1.219778

BLOCK YU Q=  3261.7472
   1   1    8.3872697e-06
   2   2    0.004260733
   3   3    1.0132495

BLOCK YD Q=  3261.7472
   1   1    0.00064101619
   2   2    0.012179308
   3   3    0.6356872

BLOCK YE Q=  3261.7472
   1   1    0.00011186201
   2   2    0.023129516
   3   3    0.38900042

BLOCK AU Q=  3261.7472
   1   1    0
   2   2    0
   3   3    6719.7836

BLOCK AD Q=  3261.7472
   1   1    0
   2   2    0
   3   3    4059.0377

BLOCK AE Q=  3261.7472
   1   1    0
   2   2    0
   3   3   -5159.4139

BLOCK MSOFT Q=  3261.7472
   1    63.636127
   2    4451.7861
   3    4073.7079
   21    3954908.9
   22   -26594.044
   31    2586.3241
   32    2586.3241
   33    608.96271
   34    3185.4739
   35    3185.4739
   36    4109.5736
   41    2809.5623
   42    2809.5623
   43    4505.9547
   44    2647.4929
   45    2647.4929
   46    2277.3257
   47    2654.1625
   48    2654.1625
   49    1489.1584

BLOCK MASS
   6    173.2
   23    91.1876
   24    80.429995
   15    1.777
   25    126.55035
   35    1996.408
   36    1996.6051
   37    1998.1844
   1000001    2978.5039
   2000001    2793.3894
   1000002    2977.4443
   2000002    2787.0022
   1000003    2978.4999
   2000003    2793.3817
   1000004    2977.4403
   2000004    2787.0015
   1000005    1632.7646
   2000005    4557.6307
   1000006    2330.2948
   2000006    4565.5145
   1000011    2614.372
   2000011    3188.9564
   1000012    2612.7667
   1000013    2614.3486
   2000013    3188.9152
   1000014    2612.7438
   1000015    643.16635
   2000015    4090.9175
   1000016    643.51793
   1000021    4123.7775
   1000022    60.683749
   1000023   -273.39026
   1000025    274.56543
   1000035    4404.935
   1000024    269.91216
   1000037    4404.9998

BLOCK ALPHA
      -0.025653835

BLOCK HMIX Q=  3261.7472
   1    266.30877
   2    38.033662
   3    243.14378
   4    3986432

BLOCK STOPMIX
   1   1   -0.061845596
   1   2    0.99808573
   2   1   -0.99808573
   2   2   -0.061845596

BLOCK SBOTMIX
   1   1    0.00072294347
   1   2    0.99999974
   2   1   -0.99999974
   2   2    0.00072294347

BLOCK STAUMIX
   1   1    0.99999862
   1   2    0.0016598259
   2   1   -0.0016598259
   2   2    0.99999862

BLOCK NMIX
   1   1   -0.98378748
   1   2    0.00080659886
   1   3   -0.17399497
   1   4    0.043443072
   2   1   -0.092421754
   2   2    0.011293862
   2   3    0.69951934
   2   4    0.70852195
   3   1   -0.1536892
   3   2   -0.013361742
   3   3    0.69310619
   3   4   -0.70413415
   4   1    0.00021626825
   4   2   -0.99984662
   4   3   -0.0015014053
   4   4    0.017448126

BLOCK UMIX
   1   1   -0.0021179502
   1   2    0.99999776
   2   1    0.99999776
   2   2    0.0021179502

BLOCK VMIX
   1   1   -0.024636094
   1   2    0.99969648
   2   1    0.99969648
   2   2    0.024636094

BLOCK HIGGSBOUNDSINPUTHIGGSCOUPLINGSFERMIONS
       0, 1446.5595,3,36,15,15

BLOCK HIGGSBOUNDSINPUTHIGGSCOUPLINGSBOSONS
       0,4,36,21,21,23

BLOCK SPHENOLOWENERGY
   1    0.00034138728
   2    1.5882699e-06
   3    3.5253823e-05
   4    2.34921e-15
   5    1.0035591e-10
   6    2.10311e-08
   7    7.8528621e-14
   8    3.3547513e-09
   9    7.1234277e-07
   10    9.4478373e-05
   11    0.97592542
   12    0.54219685
   13    19.361876
   14    0
   15    0
   16    0.0021584205
   17    2.2816721e-15
   18    2.4802543e-11
   19    8.290523e-11
   20    1.0862839e-15
   21    4.6440783e-11
   22    1.7555646e-08
   23    0
   24    0
   25    0
   26    0
   27    0
   28    0
   29    0
   30    0
   31    0
   39    6.6591806e-05
   40    0
   41    0
   42    0

BLOCK FWCOEF Q=  160
   305   4422   0   0   -0.18881911
   305   4422   0   2   -0.21152381
   305   4322   0   2   -0.00056094283
   305   6421   0   0   -0.095227835
   305   6421   0   2   -0.11626212
   305   6321   0   2   -0.00048193049
   3051111   4133   0   0    1.6198182
   3051111   4133   0   2    1.6201947
   3051111   4233   0   2    0.00016549633
   3051111   4137   0   0   -4.4425103
   3051111   4137   0   2   -4.4410095
   3051111   4237   0   2   -0.0012365472
   3051313   4133   0   0    1.6198182
   3051313   4133   0   2    1.6201936
   3051313   4233   0   2    0.00016549497
   3051313   4137   0   0   -4.4425103
   3051313   4137   0   2   -4.4410105
   3051313   4237   0   2   -0.0012365468
   3051212   4137   0   0    1.5053501
   3051212   4137   0   2    1.5050254
   3051212   4237   0   2    0.00026780016
   3051414   4137   0   0    1.5053501
   3051414   4137   0   2    1.5050254
   3051414   4237   0   2    0.00026780041
   3051616   4137   0   0    1.5053501
   3051616   4137   0   2    1.5050251
   3051616   4237   0   2    0.00026786976

BLOCK IMFWCOEF Q=  160
   305   4422   0   0    3.8579972e-07
   305   4422   0   2    8.0411241e-06
   305   4322   0   2   -5.5962838e-06
   305   6421   0   0    3.3046297e-07
   305   6421   0   2   -4.1410729e-06
   305   6321   0   2   -3.0169033e-06
   3051111   4133   0   2   -1.0616839e-06
   3051111   4233   0   2    4.2561417e-06
   3051111   4137   0   2    8.6279273e-06
   3051111   4237   0   2   -3.1809665e-05
   3051313   4133   0   2   -1.0616762e-06
   3051313   4233   0   2    4.2561379e-06
   3051313   4137   0   2    8.6279352e-06
   3051313   4237   0   2   -3.1809678e-05
   3051212   4137   0   2   -1.8632435e-06
   3051212   4237   0   2    6.8890596e-06
   3051414   4137   0   2   -1.8632436e-06
   3051414   4237   0   2    6.8890596e-06
   3051616   4137   0   2   -1.8676297e-06
   3051616   4237   0   2    6.8890511e-06

DECAY 23  2.4952


DECAY 24  2.085


DECAY 1000011  3.2842787
    0.96376749   2    1000022    11
    0.031231518   2    1000025    11
    0.0049702281   2    1000023    11

DECAY 2000011  16.004517
    0.96827448   2    1000022    11
    0.023298868   2    1000025    11
    0.0084266062   2    1000023    11

DECAY 1000013  3.311482
    0.95609588   2    1000022    13
    0.034922323   2    1000025    13
    0.0089512837   2    1000023    13

DECAY 2000013  16.071257
    0.96430488   2    1000022    13
    0.02420136   2    1000025    13
    0.0094097463   2    1000023    13
    0.0020816581   2   -1000024    14

DECAY 1000015  2.10093
    0.39230888   2    1000022    15
    0.30386911   2    1000025    15
    0.30380456   2    1000023    15

DECAY 2000015  73.333165
    0.27618526   2    1000022    15
    0.19179853   2    1000016   -37
    0.16647647   2   -1000024    16
    0.095975705   2    1000015    35
    0.095960544   2    1000015    36
    0.086547669   2    1000025    15
    0.083847462   2    1000023    15
    0.001621311   2    1000016   -24
    0.0008104316   2    1000015    23
    0.00077661621   2    1000015    25

DECAY 1000012  3.291032
    0.9671169   2    1000022    12
    0.016150031   2    1000025    12
    0.012581171   2    1000023    12
    0.0041518941   2    1000024    11

DECAY 1000014  3.318219
    0.95918465   2    1000022    14
    0.016017563   2    1000025    14
    0.012477976   2    1000023    14
    0.01231981   2    1000024    13

DECAY 1000016  2.1044215
    0.62610775   2    1000024    15
    0.36630983   2    1000022    16
    0.0042554015   2    1000025    16
    0.0033270174   2    1000023    16

DECAY 2000001  1.5571872
    0.9683791   2    1000022    1
    0.023207934   2    1000025    1
    0.0083985721   2    1000023    1

DECAY 1000001  0.41832065
    0.96989252   2    1000022    1
    0.023759418   2    1000023    1
    0.0060714715   2    1000025    1
    0.00027657095   2   -1000024    2

DECAY 2000003  1.5733187
    0.95860541   2    1000022    3
    0.025431947   2    1000025    3
    0.01082056   2    1000023    3
    0.0051420828   2   -1000024    4

DECAY 1000003  0.42800264
    0.94857031   2    1000022    3
    0.033075431   2    1000023    3
    0.015606168   2    1000025    3
    0.0027408843   2   -1000024    4

DECAY 1000005  25.449987
    0.47636159   2   -1000024    6
    0.23870372   2    1000023    5
    0.23475278   2    1000025    5
    0.050181911   2    1000022    5

DECAY 2000005  257.97464
    0.38394909   2    1000006   -24
    0.357059   2   -1000024    6
    0.069065979   2    1000023    5
    0.067758635   2    1000025    5
    0.04584609   2    1000021    5
    0.03405676   2    1000005    35
    0.034055246   2    1000005    36
    0.006691938   2    1000022    5
    0.0010585871   2    1000006   -37
    0.00033736456   2    1000035    5

DECAY 2000002  6.214284
    0.96840914   2    1000022    2
    0.02319977   2    1000025    2
    0.0083910843   2    1000023    2

DECAY 1000002  0.43556719
    0.91416325   2    1000022    2
    0.049067833   2    1000025    2
    0.035980035   2    1000024    1
    0.00078888529   2    1000023    2

DECAY 2000004  6.2162539
    0.96810181   2    1000022    4
    0.023271403   2    1000025    4
    0.0084679833   2    1000023    4
    0.00015880288   2    1000024    3

DECAY 1000004  0.44524126
    0.8943036   2    1000022    4
    0.054554976   2    1000024    3
    0.049177454   2    1000025    4
    0.0019639684   2    1000023    4

DECAY 1000006  97.042345
    0.47506245   2    1000024    5
    0.23742564   2    1000025    6
    0.2362043   2    1000023    6
    0.051294348   2    1000022    6

DECAY 2000006  282.6216
    0.25919223   2    1000006    25
    0.17600831   2    1000006    23
    0.16469276   2    1000023    6
    0.16102064   2    1000025    6
    0.13045574   2    1000024    5
    0.062292013   2    1000005    37
    0.041280711   2    1000021    6
    0.0033349956   2    1000022    6
    0.00067229142   2    1000037    5
    0.00049388805   2    1000006    36
    0.00047740836   2    1000006    35

DECAY 1000024  0.16878098
    0.99996717   2    1000022    24

DECAY 1000037  201.72896
    0.092057401   2   -1000015    16
    0.091998142   2    1000016   -15
    0.085004741   2    1000004   -3
    0.085004356   2    1000002   -1
    0.084954095   2   -1000003    4
    0.084953755   2   -1000001    2
    0.048246341   2    1000024    25
    0.043721535   2    1000023    24
    0.043614482   2    1000025    24
    0.043545525   2    1000024    23
    0.040357908   2    1000014   -13
    0.040357139   2    1000012   -11
    0.040328391   2   -1000013    14
    0.040327605   2   -1000011    12
    0.030009485   2    1000024    35
    0.030001162   2    1000024    36
    0.02984081   2    37    1000023
    0.02882002   2    37    1000025
    0.0060023371   3    1000024    6   -6
    0.0036324472   3    1000025   -5    6
    0.0036164647   3    1000023   -5    6
    0.0018168337   2    37    1000022
    0.0014739317   2    1000006   -5
    0.00020475974   3    1000024    5   -5

DECAY 1000022 -1


DECAY 1000023  0.22583467
    0.6766774   2    1000022    23
    0.32328761   2    1000022    25

DECAY 1000025  0.13173986
    0.59045283   2    1000022    25
    0.40953869   2    1000022    23

DECAY 1000035  202.27328
    0.045898961   2    1000016   -16
    0.045898961   2   -1000016    16
    0.045879598   2    1000015   -15
    0.045879598   2   -1000015    15
    0.043313377   2    1000024   -24
    0.043313377   2   -1000024    24
    0.042394714   2    1000004   -4
    0.042394714   2   -1000004    4
    0.042394546   2    1000002   -2
    0.042394546   2   -1000002    2
    0.042350499   2    1000003   -3
    0.042350499   2   -1000003    3
    0.042350305   2    1000001   -1
    0.042350305   2   -1000001    1
    0.029896721   2    37   -1000024
    0.029896721   2   -37    1000024
    0.028107757   2    1000025    25
    0.025567419   2    1000023    23
    0.025543698   2    1000023    25
    0.02013441   2    1000014   -14
    0.02013441   2   -1000014    14
    0.020134026   2    1000012   -12
    0.020134026   2   -1000012    12
    0.020098269   2    1000013   -13
    0.020098269   2   -1000013    13
    0.020097878   2    1000011   -11
    0.020097878   2   -1000011    11
    0.01797002   2    1000025    23
    0.017953524   2    1000023    35
    0.015891907   2    1000025    35
    0.012891271   2    1000025    36
    0.011811144   2    1000023    36
    0.0030241117   3    1000024    5   -6
    0.0030241117   3   -1000024   -5    6
    0.0023657514   3    1000025    6   -6
    0.0023552688   3    1000023    6   -6
    0.00092894299   2    1000022    35
    0.00088456782   2    1000022    36
    0.00073117145   2    1000006   -6
    0.00073117145   2   -1000006    6
    0.00010167591   3    1000023    5   -5

DECAY 1000021  399.95353
    0.10850259   2    1000005   -5
    0.10850259   2   -1000005    5
    0.071599722   2    1000006   -6
    0.071599722   2   -1000006    6
    0.045033703   2    2000004   -4
    0.045033703   2   -2000004    4
    0.045033678   2    2000002   -2
    0.045033678   2   -2000002    2
    0.044687266   2    2000003   -3
    0.044687266   2   -2000003    3
    0.044686851   2    2000001   -1
    0.044686851   2   -2000001    1
    0.034966873   2    1000004   -4
    0.034966873   2   -1000004    4
    0.034966683   2    1000002   -2
    0.034966683   2   -1000002    2
    0.03491269   2    1000003   -3
    0.03491269   2   -1000003    3
    0.034912484   2    1000001   -1
    0.034912484   2   -1000001    1
    0.00028454125   2    1000006   -4
    0.00028454125   2   -1000006    4
    0.00020503315   3    1000024    5   -6
    0.00020503315   3   -1000024   -5    6
    0.00013828985   3    1000023    6   -6
    0.00013479039   3    1000025    6   -6

DECAY 25  0.0041173878
    0.54830173   2   -5    5
    0.25287745   2   -24    24
    0.070757985   2    21    21
    0.063271869   2   -15    15
    0.031548203   2    23    23
    0.026908336   2   -4    4
    0.0023267783   2    22    22
    0.0019649612   2    1000022    1000022
    0.001616588   2    22    23
    0.0002194121   2   -13    13
    0.00020597211   2   -3    3
    5.6949174e-07   2   -1    1
    1.3866046e-07   2   -2    2
    4.9326092e-09   2   -11    11

DECAY 35  42.222083
    0.78440916   2   -5    5
    0.15998126   2   -15    15
    0.025561336   2    1000022    1000023
    0.022060263   2    1000022    1000025
    0.0030373758   2    1000022    1000022
    0.0014446773   2    1000023    1000025
    0.0010742421   2   -6    6
    0.00070017309   2    1000025    1000025
    0.00063077977   2    1000023    1000023
    0.00053285828   2   -13    13
    0.0003113474   2   -3    3
    0.00022680918   2   -1000024    1000024
    1.4959292e-05   2    21    21
    7.4451819e-06   2    25    25
    4.2292871e-06   2   -1000015    1000015
    1.0719857e-06   2    23    23
    8.6087708e-07   2   -1    1
    5.6977831e-07   2   -24    24
    1.497944e-08   2   -4    4
    1.1969219e-08   2   -11    11
    8.9788952e-09   2    22    22
    8.3249889e-09   2    22    23
    7.7227324e-14   2   -2    2

DECAY 36  40.355588
    0.78230498   2   -5    5
    0.15955345   2   -15    15
    0.026111883   2    1000022    1000025
    0.023620151   2    1000022    1000023
    0.0032747299   2    1000022    1000022
    0.0013925124   2    1000023    1000025
    0.0010918951   2   -6    6
    0.00087705117   2    1000025    1000025
    0.00064185096   2    1000023    1000023
    0.00053143075   2   -13    13
    0.00031050901   2   -3    3
    0.00025772473   2   -1000024    1000024
    2.9354307e-05   2    21    21
    1.5122965e-06   2    23    25
    8.5855883e-07   2   -1    1
    5.0791342e-08   2    22    22
    2.7308455e-08   2    22    23
    1.4726436e-08   2   -4    4
    1.1937144e-08   2   -11    11
    7.5925961e-14   2   -2    2
    3.1850542e-37   2    25    25

DECAY 37  39.725489
    0.78640771   2   -5    6
    0.15463485   2   -15    16
    0.055067644   2    1000022    1000024
    0.0016274997   2    1000024    1000025
    0.0011686759   2   -5    4
    0.00054668988   2   -13    14
    0.00029691424   2   -3    4
    0.00021885664   2    1000023    1000024
    1.3839431e-05   2   -3    2
    8.3455559e-06   2   -5    2
    4.1338377e-06   2   -1000015    1000016
    2.3388448e-06   2   -3    6
    1.5421532e-06   2    24    25
    8.2391457e-07   2   -1    2
    8.7373261e-08   2   -1    6
    3.9098314e-08   2   -1    4
    1.2787133e-08   2   -11    12
    6.057857e-13   2    24    35
    3.3649503e-13   2    24    36

DECAY 6  2.43
    1   2    5    24

DECAY 15 -1
