BLOCK SPINFO
   1   SPheno
   2   v4.0.5be

BLOCK SPHENOINFO
   1   2
   2   2

BLOCK MODSEL
   1   0

BLOCK MINPAR
   3    50.670588
   4    1

BLOCK EXTPAR
   0    3172.4256
   1   -3009.8476
   2   -1829.0039
   3    3101.3886
   11   -5248.3065
   12   -3159.2561
   13   -1245.7569
   23    422.19551
   25    49.947778
   26    4829.509
   31    2022.3677
   32    2022.3677
   33    3241.7227
   34    1117.3313
   35    1117.3313
   36    4608.2809
   41    4506.5025
   42    4506.5025
   43    3076.4156
   44    3193.3859
   45    3193.3859
   46    3214.126
   47    1131.0435
   48    1131.0435
   49    1705.6591

BLOCK SMINPUTS
   1    127.90897
   2    1.1663787e-05
   3    0.1184
   4    91.1876
   5    4.18
   6    173.2
   7    1.777
   8    0
   11    0.00051099893
   12    0
   13    0.10565837
   14    0
   21    0.005
   22    0.0025
   23    0.095
   24    1.27

BLOCK GAUGE Q=  3172.4256
   1    0.35536298
   2    0.66519887
   3    1.219778

BLOCK YU Q=  3172.4256
   1   1    8.3860524e-06
   2   2    0.0042601146
   3   3    1.0131025

BLOCK YD Q=  3172.4256
   1   1    0.00084169354
   2   2    0.015992177
   3   3    0.83469624

BLOCK YE Q=  3172.4256
   1   1    0.00014688168
   2   2    0.030370472
   3   3    0.51078139

BLOCK AU Q=  3172.4256
   1   1    0
   2   2    0
   3   3   -5248.3064

BLOCK AD Q=  3172.4256
   1   1    0
   2   2    0
   3   3   -3159.2562

BLOCK AE Q=  3172.4256
   1   1    0
   2   2    0
   3   3   -1245.7569

BLOCK MSOFT Q=  3172.4256
   1   -3009.8476
   2   -1829.0039
   3    3101.3886
   21    23610597
   22   -8361.8268
   31    2022.3677
   32    2022.3677
   33    3241.7227
   34    1117.3313
   35    1117.3313
   36    4608.2809
   41    4506.5025
   42    4506.5025
   43    3076.4156
   44    3193.3859
   45    3193.3859
   46    3214.126
   47    1131.0435
   48    1131.0435
   49    1705.6591

BLOCK MASS
   6    173.2
   23    91.1876
   24    80.429995
   15    1.777
   25    125.31521
   35    4825.8588
   36    4829.509
   37    4825.8776
   1000001    4595.8147
   2000001    1331.916
   1000002    4595.1165
   2000002    3305.7268
   1000003    4595.8105
   2000003    1331.9052
   1000004    4595.1125
   2000004    3305.7262
   1000005    1844.8079
   2000005    3142.1626
   1000006    3058.7488
   2000006    3290.3272
   1000011    2041.1578
   2000011    1152.0644
   1000012    2039.1932
   1000013    2041.1313
   2000013    1151.9831
   1000014    2039.1655
   1000015    3246.0547
   2000015    4604.6116
   1000016    3243.4845
   1000021    3316.4167
   1000022   -417.60498
   1000023    421.80698
   1000025   -1893.1399
   1000035   -2972.2791
   1000024    419.70598
   1000037    1893.047

BLOCK ALPHA
      -0.019749782

BLOCK HMIX Q=  3172.4256
   1    422.19551
   2    49.947778
   3    243.17152
   4    23324157

BLOCK STOPMIX
   1   1    0.8072104
   1   2    0.59026381
   2   1   -0.59026381
   2   2    0.8072104

BLOCK SBOTMIX
   1   1    0.0079538083
   1   2    0.99996837
   2   1   -0.99996837
   2   2    0.0079538083

BLOCK STAUMIX
   1   1    0.99999342
   1   2    0.003626275
   2   1   -0.003626275
   2   2    0.99999342

BLOCK NMIX
   1   1   -0.011935051
   1   2    0.037271188
   1   3   -0.70852726
   1   4   -0.70459743
   2   1    0.0093885033
   2   2   -0.024776549
   2   3   -0.7056245
   2   4    0.70809042
   3   1    0.0017210046
   3   2    0.99899744
   3   3    0.008931742
   3   4    0.043833396
   4   1   -0.99988322
   4   2    0.0010419527
   4   3    0.0018471381
   4   4    0.01513452

BLOCK UMIX
   1   1   -0.012656623
   1   2    0.9999199
   2   1   -0.9999199
   2   2   -0.012656623

BLOCK VMIX
   1   1    0.062100619
   1   2    0.99806989
   2   1    0.99806989
   2   2   -0.062100619

BLOCK HIGGSBOUNDSINPUTHIGGSCOUPLINGSFERMIONS
       0, 2494.7806,3,36,15,15

BLOCK HIGGSBOUNDSINPUTHIGGSCOUPLINGSBOSONS
       0,4,36,21,21,23

BLOCK SPHENOLOWENERGY
   1    0.00030168512
   2    1.5929815e-06
   3    3.5245937e-05
   4    2.5895183e-15
   5    1.1062044e-10
   6    2.3107147e-08
   7    8.6470571e-14
   8    3.6939939e-09
   9    7.8194409e-07
   10    9.6293572e-05
   11    0.99467574
   12    0.54191558
   13    19.359513
   14    0
   15    0
   16    0.002157178
   17    2.2816575e-15
   18    2.4801984e-11
   19    8.290207e-11
   20   -3.3432316e-15
   21   -1.4293776e-10
   22   -2.8087509e-08
   23    0
   24    0
   25    0
   26    0
   27    0
   28    0
   29    0
   30    0
   31    0
   39    6.8992685e-05
   40    0
   41    0
   42    0

BLOCK FWCOEF Q=  160
   305   4422   0   0   -0.18881911
   305   4422   0   2   -0.16524639
   305   4322   0   2    0.00029945666
   305   6421   0   0   -0.095227835
   305   6421   0   2   -0.087629086
   305   6321   0   2    5.7396689e-05
   3051111   4133   0   0    1.6193529
   3051111   4133   0   2    1.6196213
   3051111   4233   0   2    0.00058053293
   3051111   4137   0   0   -4.442045
   3051111   4137   0   2   -4.4398691
   3051111   4237   0   2   -0.004342879
   3051313   4133   0   0    1.6193529
   3051313   4133   0   2    1.6196193
   3051313   4233   0   2    0.00058053115
   3051313   4137   0   0   -4.442045
   3051313   4137   0   2   -4.439871
   3051313   4237   0   2   -0.0043428832
   3051212   4137   0   0    1.5053501
   3051212   4137   0   2    1.5048835
   3051212   4237   0   2    0.00094064372
   3051414   4137   0   0    1.5053501
   3051414   4137   0   2    1.5048835
   3051414   4237   0   2    0.00094064375
   3051616   4137   0   0    1.5053501
   3051616   4137   0   2    1.5048838
   3051616   4237   0   2    0.00094065179

BLOCK IMFWCOEF Q=  160
   305   4422   0   0    3.8584884e-07
   305   4422   0   2   -4.9603572e-06
   305   4322   0   2    6.3727836e-06
   305   6421   0   0    3.3050505e-07
   305   6421   0   2   -3.6037233e-05
   305   6321   0   2    2.421228e-06
   3051111   4133   0   2   -1.5759765e-06
   3051111   4233   0   2    1.0888706e-05
   3051111   4137   0   2    1.2668669e-05
   3051111   4237   0   2   -8.145771e-05
   3051313   4133   0   2   -1.5759818e-06
   3051313   4233   0   2    1.0888677e-05
   3051313   4137   0   2    1.266871e-05
   3051313   4237   0   2   -8.1457788e-05
   3051212   4137   0   2   -2.6576055e-06
   3051212   4237   0   2    1.7643293e-05
   3051414   4137   0   2   -2.6576068e-06
   3051414   4237   0   2    1.7643293e-05
   3051616   4137   0   2   -2.6539763e-06
   3051616   4237   0   2    1.7643294e-05

DECAY 23  2.4952


DECAY 24  2.085


DECAY 2000011  0.0010057256
    0.61876525   2    1000022    11
    0.38086473   2    1000023    11
    0.00037001556   2   -1000024    12

DECAY 1000011  0.54064051
    0.64999917   2   -1000037    12
    0.32460535   2    1000025    11
    0.014562512   2    1000022    11
    0.005948636   2    1000023    11
    0.0048843047   2   -1000024    12

DECAY 2000013  0.032816171
    0.48476374   2   -1000024    14
    0.26291213   2    1000022    13
    0.25232413   2    1000023    13

DECAY 1000013  0.57535847
    0.61057383   2   -1000037    14
    0.30491679   2    1000025    13
    0.04368311   2    1000022    13
    0.035298316   2    1000023    13
    0.0045895084   2   -1000024    14
    0.0009384408   2    2000013    25

DECAY 1000015  35.081759
    0.35461195   2   -1000037    16
    0.23364906   2    1000022    15
    0.23122271   2    1000023    15
    0.17730677   2    1000025    15
    0.0030217343   2    1000035    15
    0.00018777499   2   -1000024    16

DECAY 2000015  55.105773
    0.42642174   2   -1000024    16
    0.21412883   2    1000022    15
    0.21244043   2    1000023    15
    0.14283219   2    1000035    15
    0.0020162963   2    1000016   -24
    0.0010223061   2    1000015    25
    0.0010018445   2    1000015    23

DECAY 1000012  0.59859296
    0.57056297   2    1000037    11
    0.28493704   2    1000025    12
    0.10608389   2    1000024    11
    0.026219724   2    1000022    12
    0.012196374   2    1000023    12

DECAY 1000014  0.63272854
    0.53959018   2    1000037    13
    0.26946948   2    1000025    14
    0.15459736   2    1000024    13
    0.024804778   2    1000022    14
    0.011538197   2    1000023    14

DECAY 1000016  35.073471
    0.46705995   2    1000024    15
    0.35258358   2    1000037    15
    0.17626365   2    1000025    16
    0.0029936915   2    1000035    16
    0.00074994332   2    1000022    16
    0.00034918366   2    1000023    16

DECAY 2000001  0.00016966655
    0.55272314   2    1000022    1
    0.35748552   2    1000023    1
    0.089791339   2   -1000024    2

DECAY 1000001  125.39559
    0.66450767   2    1000021    1
    0.22240691   2   -1000037    2
    0.11092583   2    1000025    1
    0.0017510379   2    1000035    1
    0.00024651693   2    1000022    1
    0.00011120871   2    1000023    1

DECAY 2000003  0.011137323
    0.49379972   2   -1000024    4
    0.2560741   2    1000022    3
    0.25012618   2    1000023    3

DECAY 1000003  125.41975
    0.66437634   2    1000021    3
    0.22236371   2   -1000037    4
    0.11090428   2    1000025    3
    0.0017506945   2    1000035    3
    0.00033826769   2    1000022    3
    0.00020221218   2    1000023    3

DECAY 1000005  45.523437
    0.49489135   2   -1000024    6
    0.25395416   2    1000022    5
    0.25115449   2    1000023    5

DECAY 2000005  120.83977
    0.50697164   2   -1000024    6
    0.17466941   2    1000022    5
    0.17320371   2    1000023    5
    0.094135094   2   -1000037    6
    0.046343045   2    1000025    5
    0.0027892267   2    1000005    25
    0.0015424333   2    1000005    23
    0.0003046971   2    1000006   -24

DECAY 2000002  0.27250143
    0.99391605   2    1000035    2
    0.0037367695   2    1000022    2
    0.0023109282   2    1000023    2

DECAY 1000002  125.3626
    0.6641427   2    1000021    2
    0.2215818   2    1000037    1
    0.11106058   2    1000025    2
    0.0017099681   2    1000035    2
    0.0012242616   2    1000024    1
    0.00019600932   2    1000022    2

DECAY 2000004  0.27480491
    0.98557072   2    1000035    4
    0.0057940134   2    1000022    4
    0.0043995182   2    1000023    4
    0.0041884621   2    1000024    3

DECAY 1000004  125.38663
    0.66401178   2    1000021    4
    0.221539   2    1000037    3
    0.11103908   2    1000025    4
    0.0017096365   2    1000035    4
    0.0014068682   2    1000024    3
    0.00020243646   2    1000022    4

DECAY 1000006  117.17196
    0.38557234   2    1000024    5
    0.24698807   2    1000023    6
    0.24263208   2    1000022    6
    0.064926671   2    1000037    5
    0.03157936   2    1000025    6
    0.026486694   3    1000022    24    5
    0.0017519456   2    1000005    24

DECAY 2000006  142.02508
    0.42356432   2    1000024    5
    0.23546558   2    1000023    6
    0.23529494   2    1000022    6
    0.03767535   2    1000006    23
    0.024021495   2    2000005    24
    0.024005408   2    1000037    5
    0.011795907   2    1000025    6
    0.006259736   2    1000006    25
    0.0012063542   2    1000005    24
    0.00071091641   2    1000035    6

DECAY 1000024  2.5890799e-11
    0.595805   3    1000022   -1    2
    0.19861441   3    1000022   -11    12
    0.19444674   3    1000022   -13    14
    0.011133848   3    1000022   -3    4

DECAY 1000037  16.449928
    0.24498807   2    1000024    25
    0.24237359   2    1000023    24
    0.24108935   2    1000024    23
    0.24079228   2    1000022    24
    0.012070413   3    1000024    6   -6
    0.0094424108   3    1000022   -5    6
    0.0090999333   3    1000023   -5    6
    0.00011668447   3    1000024    5   -5

DECAY 1000022 -1


DECAY 1000023  1.2168747e-08
    0.84317777   2    1000022    22
    0.042911724   3    1000022    12   -12
    0.03208785   3    1000022    1   -1
    0.03185055   3    1000022    3   -3
    0.025026161   3    1000022    2   -2
    0.0072414458   3    1000022    11   -11
    0.007157342   3    1000022    13   -13
    0.0041798596   3    1000022    4   -4
    0.0017403172   3    1000024    1   -2
    0.0017403172   3   -1000024   -1    2
    0.00058012675   3    1000024    11   -12
    0.00058012675   3   -1000024   -11    12
    0.00057317367   3    1000024    13   -14
    0.00057317367   3   -1000024   -13    14
    0.00027982412   3    1000024    3   -4
    0.00027982412   3   -1000024   -3    4

DECAY 1000025  18.30959
    0.21867721   2    1000024   -24
    0.21867721   2   -1000024    24
    0.16586992   2    1000023    25
    0.15144103   2    1000023    23
    0.15110276   2    1000022    25
    0.06567602   2    1000022    23
    0.0092249542   3    1000024    5   -6
    0.0092249542   3   -1000024   -5    6
    0.0051003728   3    1000023    6   -6
    0.0048476672   3    1000022    6   -6

DECAY 1000035  42.566317
    0.1266528   2    2000013   -13
    0.1266528   2   -2000013    13
    0.12664648   2    2000011   -11
    0.12664648   2   -2000011    11
    0.045206518   2    1000024   -24
    0.045206518   2   -1000024    24
    0.037340866   2    2000003   -3
    0.037340866   2   -2000003    3
    0.037340563   2    2000001   -1
    0.037340563   2   -2000001    1
    0.02913927   2    1000023    25
    0.028553404   2    1000023    23
    0.026575634   2    1000022    25
    0.022089969   2    1000005   -5
    0.022089969   2   -1000005    5
    0.017314399   2    1000022    23
    0.012332918   2    1000014   -14
    0.012332918   2   -1000014    14
    0.01233232   2    1000012   -12
    0.01233232   2   -1000012    12
    0.012195121   2    1000013   -13
    0.012195121   2   -1000013    13
    0.012194553   2    1000011   -11
    0.012194553   2   -1000011    11
    0.002535113   3    1000024    5   -6
    0.002535113   3   -1000024   -5    6
    0.001718985   3    1000023    6   -6
    0.0016624761   3    1000022    6   -6
    0.00035856115   2    1000025    25
    0.00035727464   2    1000037   -24
    0.00035727464   2   -1000037    24

DECAY 1000021  187.95404
    0.18369713   2    2000003   -3
    0.18369713   2   -2000003    3
    0.18369599   2    2000001   -1
    0.18369599   2   -2000001    1
    0.12452797   2    1000005   -5
    0.12452797   2   -1000005    5
    0.0027346049   2    2000005   -5
    0.0027346049   2   -2000005    5
    0.0018703533   2    1000006   -4
    0.0018703533   2   -1000006    4
    0.0015168119   2    1000006   -6
    0.0015168119   2   -1000006    6
    0.0010746721   3    1000023    6   -6
    0.0010739219   3    1000022    6   -6
    0.00079327621   3    1000024    5   -6
    0.00079327621   3   -1000024   -5    6

DECAY 25  0.0039100397
    0.56694355   2   -5    5
    0.23430902   2   -24    24
    0.072530228   2    21    21
    0.065261046   2   -15    15
    0.02854119   2    23    23
    0.028098067   2   -4    4
    0.0023491193   2    22    22
    0.0015278339   2    22    23
    0.00022630145   2   -13    13
    0.00021291066   2   -3    3
    5.8867568e-07   2   -1    1
    1.4479484e-07   2   -2    2
    5.0875034e-09   2   -11    11

DECAY 35  173.48641
    0.61039709   2   -5    5
    0.13243551   2   -15    15
    0.081030319   2   -1000024    1000037
    0.081030319   2   -1000037    1000024
    0.041943858   2    1000023    1000025
    0.039093818   2    1000022    1000025
    0.0066211201   2    1000023    1000035
    0.0050197044   2    1000022    1000035
    0.00093078226   2   -1000024    1000024
    0.00044502215   2   -6    6
    0.00044083638   2   -13    13
    0.00023505294   2    1000022    1000022
    0.00022790641   2   -3    3
    9.7262995e-05   2    1000023    1000023
    1.618342e-05   2   -1000005    1000005
    1.4195716e-05   2   -1000037    1000037
    9.7861432e-06   2    1000022    1000023
    7.0677973e-06   2    1000025    1000025
    3.2735959e-06   2    21    21
    6.3005989e-07   2   -1    1
    1.1175934e-07   2    25    25
    2.6321212e-08   2    22    23
    2.3254703e-08   2    23    23
    1.209437e-08   2    22    22
    9.8992914e-09   2   -11    11
    7.1755175e-09   2   -1000011    1000011
    7.0580796e-09   2   -1000013    1000013
    6.8216978e-09   2   -2000011    2000011
    6.7423972e-09   2   -2000013    2000013
    5.6073885e-09   2   -4    4
    3.9908132e-09   2   -24    24
    2.3840447e-09   2   -1000001    1000001
    2.3692119e-09   2   -1000003    1000003
    5.6150494e-10   2   -2000013    1000013
    5.6150494e-10   2   -1000013    2000013
    2.889967e-14   2   -2    2
    1.3133692e-14   2   -2000011    1000011
    1.3133692e-14   2   -1000011    2000011

DECAY 36  164.35837
    0.59847773   2   -5    5
    0.12984205   2   -15    15
    0.085631209   2   -1000024    1000037
    0.085631209   2   -1000037    1000024
    0.044653808   2    1000022    1000025
    0.040987467   2    1000023    1000025
    0.0070648598   2    1000022    1000035
    0.0052558754   2    1000023    1000035
    0.00099741144   2   -1000024    1000024
    0.00043219027   2   -13    13
    0.00039251308   2   -6    6
    0.00023671701   2    1000022    1000022
    0.00022340815   2   -3    3
    0.00011476823   2    1000023    1000023
    2.4383011e-05   2   -1000037    1000037
    1.5095614e-05   2    1000022    1000023
    1.2148244e-05   2    1000025    1000025
    6.4521272e-06   2    21    21
    6.1763138e-07   2   -1    1
    6.5016575e-08   2    23    25
    9.7052643e-09   2   -11    11
    4.9048063e-09   2   -4    4
    4.2213074e-09   2    22    23
    1.2482214e-09   2    22    22
    5.9231749e-10   2   -2000013    1000013
    5.9231749e-10   2   -1000013    2000013
    4.3326699e-12   2    23    35
    2.52786e-14   2   -2    2
    1.3854367e-14   2   -2000011    1000011
    1.3854367e-14   2   -1000011    2000011
    1.7129922e-38   2    25    25

DECAY 37  185.34625
    0.62521347   2   -5    6
    0.13369027   2   -15    16
    0.076599355   2    1000022    1000037
    0.076161127   2    1000024    1000025
    0.075735924   2    1000023    1000037
    0.010814547   2    1000024    1000035
    0.00092780846   2   -5    4
    0.00047264261   2   -13    14
    0.00020399207   2   -3    4
    0.00012413284   2    1000023    1000024
    3.8915315e-05   2    1000022    1000024
    9.6041908e-06   2   -3    2
    6.6255086e-06   2   -5    2
    8.4866807e-07   2   -3    6
    5.6593334e-07   2   -1    2
    5.7537899e-08   2    24    25
    2.6794361e-08   2   -1    4
    2.5110311e-08   2   -2000011    1000012
    2.5005961e-08   2   -2000013    1000014
    2.4941706e-08   2   -1    6
    1.105516e-08   2   -11    12
    1.0416191e-09   2   -1000013    1000014
    5.6150821e-11   2   -1000003    2000006
    3.767055e-11   2   -1000003    1000006
    3.2465603e-11   2    1000025    1000037
    7.310528e-13   2   -1000003    1000004
    2.4363097e-14   2   -1000011    1000012
    7.1327909e-15   2   -1000001    2000006
    4.7852578e-15   2   -1000001    1000006
    1.0832385e-16   2   -1000001    1000004
    2.0539331e-19   2   -1000003    1000002
    1.0638142e-20   2   -1000001    1000002

DECAY 6  2.43
    1   2    5    24

DECAY 15 -1
