BLOCK SPINFO
   1   SPheno
   2   v4.0.5be

BLOCK SPHENOINFO
   1   2
   2   2

BLOCK MODSEL
   1   0

BLOCK MINPAR
   3    18.350426
   4   -1

BLOCK EXTPAR
   0    2630.3721
   1   -4958.4994
   2   -668.42477
   3    3514.8006
   11   -5866.0356
   12   -3554.6362
   13    4597.3874
   23   -325.0155
   25    17.604831
   26    929.28123
   31    3766.5536
   32    3766.5536
   33    3493.2867
   34    1828.6531
   35    1828.6531
   36    2468.0485
   41    3905.3057
   42    3905.3057
   43    1595.7243
   44    4668.2226
   45    4668.2226
   46    4097.662
   47    3392.0206
   48    3392.0206
   49    4969.5007

BLOCK SMINPUTS
   1    127.90897
   2    1.1663787e-05
   3    0.1184
   4    91.1876
   5    4.18
   6    173.2
   7    1.777
   8    0
   11    0.00051099893
   12    0
   13    0.10565837
   14    0
   21    0.005
   22    0.0025
   23    0.095
   24    1.27

BLOCK GAUGE Q=  2630.3721
   1    0.35536298
   2    0.66519887
   3    1.219778

BLOCK YU Q=  2630.3721
   1   1    8.3978875e-06
   2   2    0.0042661268
   3   3    1.0145323

BLOCK YD Q=  2630.3721
   1   1    0.00029708598
   2   2    0.0056446337
   3   3    0.2946162

BLOCK YE Q=  2630.3721
   1   1    5.1843676e-05
   2   2    0.010719628
   3   3    0.18028651

BLOCK AU Q=  2630.3721
   1   1    0
   2   2    0
   3   3   -5866.0356

BLOCK AD Q=  2630.3721
   1   1    0
   2   2    0
   3   3   -3554.6364

BLOCK AE Q=  2630.3721
   1   1    0
   2   2    0
   3   3    4597.3874

BLOCK MSOFT Q=  2630.3721
   1   -4958.4994
   2   -668.42477
   3    3514.8006
   21    726921.05
   22   -164929.04
   31    3766.5536
   32    3766.5536
   33    3493.2867
   34    1828.6531
   35    1828.6531
   36    2468.0485
   41    3905.3057
   42    3905.3057
   43    1595.7243
   44    4668.2226
   45    4668.2226
   46    4097.662
   47    3392.0206
   48    3392.0206
   49    4969.5007

BLOCK MASS
   6    173.2
   23    91.1876
   24    80.429995
   15    1.777
   25    126.41037
   35    929.317
   36    929.28123
   37    933.15613
   1000001    3994.6621
   2000001    3484.2651
   1000002    3993.8896
   2000002    4734.5003
   1000003    3994.6614
   2000003    3484.2642
   1000004    3993.889
   2000004    4734.5
   1000005    1697.7642
   2000005    5023.1737
   1000006    1687.0682
   2000006    4101.113
   1000011    3776.9718
   2000011    1821.387
   1000012    3775.7341
   1000013    3776.9692
   2000013    1821.3812
   1000014    3775.7318
   1000015    2463.153
   2000015    3500.9286
   1000016    3499.6863
   1000021    3723.2723
   1000022   -325.54253
   1000023    337.67013
   1000025   -715.55974
   1000035   -4930.3751
   1000024    328.49955
   1000037    715.84901

BLOCK ALPHA
      -0.056009438

BLOCK HMIX Q=  2630.3721
   1   -325.0155
   2    17.604831
   3    243.39098
   4    863563.6

BLOCK STOPMIX
   1   1    0.99820296
   1   2    0.059923649
   2   1   -0.059923649
   2   2    0.99820296

BLOCK SBOTMIX
   1   1   -0.99999998
   1   2    0.00017911955
   2   1   -0.00017911955
   2   2   -0.99999998

BLOCK STAUMIX
   1   1   -0.0029592273
   1   2    0.99999562
   2   1   -0.99999562
   2   2   -0.0029592273

BLOCK NMIX
   1   1   -0.0068742694
   1   2    0.15499562
   1   3    0.70739054
   1   4   -0.68958518
   2   1   -0.0054931568
   2   2    0.052116606
   2   3   -0.70293729
   2   4   -0.70931859
   3   1    0.0015636638
   3   2    0.9865395
   3   3   -0.074003643
   3   4    0.14581095
   4   1    0.99996006
   4   2   -0.00019085743
   4   3    0.0011172099
   4   4   -0.008865146

BLOCK UMIX
   1   1   -0.10538832
   1   2   -0.99443114
   2   1   -0.99443114
   2   2    0.10538832

BLOCK VMIX
   1   1    0.20782623
   1   2    0.97816576
   2   1    0.97816576
   2   2   -0.20782623

BLOCK HIGGSBOUNDSINPUTHIGGSCOUPLINGSFERMIONS
       0, 309.93008,3,36,15,15

BLOCK HIGGSBOUNDSINPUTHIGGSCOUPLINGSBOSONS
       0,4,36,21,21,23

BLOCK SPHENOLOWENERGY
   1    0.00036879951
   2    1.5874252e-06
   3    3.5257614e-05
   4    2.1710557e-15
   5    9.2745101e-11
   6    1.9419062e-08
   7    7.3454977e-14
   8    3.1379964e-09
   9    6.6572245e-07
   10    9.4383789e-05
   11    0.97494841
   12    0.54212131
   13    19.35921
   14    0
   15    0
   16    0.0021581621
   17    2.2816696e-15
   18    2.4809895e-11
   19    8.292186e-11
   20    6.9693301e-16
   21    2.97958e-11
   22    9.7503259e-09
   23    0
   24    0
   25    0
   26    0
   27    0
   28    0
   29    0
   30    0
   31    0
   39    4.5612122e-05
   40    0
   41    0
   42    0

BLOCK FWCOEF Q=  160
   305   4422   0   0   -0.18881911
   305   4422   0   2   -0.23823361
   305   4322   0   2   -0.00088097228
   305   6421   0   0   -0.095227835
   305   6421   0   2   -0.14610621
   305   6321   0   2   -0.00093920064
   3051111   4133   0   0    1.6116667
   3051111   4133   0   2    1.6119964
   3051111   4233   0   2    7.6583162e-05
   3051111   4137   0   0   -4.4343588
   3051111   4137   0   2   -4.433147
   3051111   4237   0   2   -0.00057943317
   3051313   4133   0   0    1.6116667
   3051313   4133   0   2    1.6119962
   3051313   4233   0   2    7.6582341e-05
   3051313   4137   0   0   -4.4343588
   3051313   4137   0   2   -4.4331472
   3051313   4237   0   2   -0.00057943247
   3051212   4137   0   0    1.5053501
   3051212   4137   0   2    1.5051005
   3051212   4237   0   2    0.0001257194
   3051414   4137   0   0    1.5053501
   3051414   4137   0   2    1.5051005
   3051414   4237   0   2    0.00012571957
   3051616   4137   0   0    1.5053501
   3051616   4137   0   2    1.5051007
   3051616   4237   0   2    0.00012576751

BLOCK IMFWCOEF Q=  160
   305   4422   0   0    3.8580834e-07
   305   4422   0   2    1.5835221e-05
   305   4322   0   2   -2.0858869e-06
   305   6421   0   0    3.3047035e-07
   305   6421   0   2    1.2377262e-05
   305   6321   0   2   -8.6927507e-07
   3051111   4133   0   2   -3.4743942e-07
   3051111   4233   0   2    2.2296439e-06
   3051111   4137   0   2    1.5107601e-05
   3051111   4237   0   2   -1.6872005e-05
   3051313   4133   0   2   -3.4744224e-07
   3051313   4233   0   2    2.2296433e-06
   3051313   4137   0   2    1.5107605e-05
   3051313   4237   0   2   -1.6872007e-05
   3051212   4137   0   2   -3.0370461e-06
   3051212   4237   0   2    3.6607164e-06
   3051414   4137   0   2   -3.037046e-06
   3051414   4237   0   2    3.6607164e-06
   3051616   4137   0   2   -3.0342564e-06
   3051616   4237   0   2    3.6607164e-06

DECAY 23  2.4952


DECAY 24  2.085


DECAY 2000011  0.00067896503
    0.59698154   2    1000022    11
    0.37931535   2    1000023    11
    0.0235692   2    1000025    11
    0.00013277072   2   -1000024    12

DECAY 1000011  46.402922
    0.65857574   2   -1000037    12
    0.32465086   2    1000025    11
    0.0080823222   2    1000022    11
    0.0078382854   2   -1000024    12
    0.00085279673   2    1000023    11

DECAY 2000013  0.0084531993
    0.45592653   2   -1000024    14
    0.27893558   2    1000022    13
    0.25740428   2    1000023    13
    0.0039112306   2   -1000037    14
    0.003822376   2    1000025    13

DECAY 1000013  46.411409
    0.65845479   2   -1000037    14
    0.32459217   2    1000025    13
    0.0081725618   2    1000022    13
    0.0078368465   2   -1000024    14
    0.00094309829   2    1000023    13

DECAY 1000015  3.0706771
    0.49599342   2   -1000024    16
    0.25162334   2    1000022    15
    0.24657281   2    1000023    15
    0.0038851412   2   -1000037    16
    0.0019252884   2    1000025    15

DECAY 2000015  45.605552
    0.61365142   2   -1000037    16
    0.30275372   2    1000025    15
    0.031933532   2    1000022    15
    0.024903754   2    1000023    15
    0.0093973618   2    1000015    36
    0.0093973573   2    1000015    35
    0.0072627339   2   -1000024    16
    0.00035666622   2    1000015    23
    0.00034345057   2    1000015    25

DECAY 1000012  46.441051
    0.6364451   2    1000037    11
    0.32316579   2    1000025    12
    0.030446229   2    1000024    11
    0.0088756494   2    1000022    12
    0.0010672363   2    1000023    12

DECAY 1000014  46.449514
    0.63633063   2    1000037    13
    0.32310668   2    1000025    14
    0.030621627   2    1000024    13
    0.0088740265   2    1000022    14
    0.0010670412   2    1000023    14

DECAY 1000016  45.630036
    0.59359258   2    1000037    15
    0.30114938   2    1000025    16
    0.076826272   2    1000024    15
    0.018362637   2    1000015    37
    0.0083524078   2    1000022    16
    0.0010041312   2    1000023    16
    0.00071259349   2    1000015    24

DECAY 2000001  0.00016429952
    0.56807233   2    1000022    1
    0.36863189   2    1000023    1
    0.036171248   2   -1000024    2
    0.02674513   2    1000025    1
    0.00037939749   2   -1000037    2

DECAY 1000001  54.890102
    0.59349599   2   -1000037    2
    0.2919076   2    1000025    1
    0.098972683   2    1000021    1
    0.0077139487   2    1000022    1
    0.0070195668   2   -1000024    2
    0.00089021448   2    1000023    1

DECAY 2000003  0.004488148
    0.47801284   2   -1000024    4
    0.26208979   2    1000022    3
    0.2514388   2    1000023    3
    0.0050138404   2   -1000037    4
    0.0034447312   2    1000025    3

DECAY 1000003  54.893983
    0.59345504   2   -1000037    4
    0.29188714   2    1000025    3
    0.098965225   2    1000021    3
    0.0077361233   2    1000022    3
    0.0070438891   2   -1000024    4
    0.00091255425   2    1000023    3

DECAY 1000005  49.2386
    0.61137252   2   -1000024    6
    0.22997175   2   -1000037    6
    0.10002775   2    1000025    5
    0.031103007   2    1000022    5
    0.02752498   2    1000023    5

DECAY 2000005  105.02509
    0.76650345   2    1000021    5
    0.080774952   2   -1000024    6
    0.040977796   2    1000022    5
    0.040444053   2    1000023    5
    0.03480617   2    1000006   -37
    0.017543006   2    1000005    36
    0.017542062   2    1000005    35
    0.00088497901   2   -1000037    6
    0.00043751597   2    1000025    5

DECAY 1000002  54.90796
    0.57392727   2    1000037    1
    0.29207832   2    1000025    2
    0.098415468   2    1000021    2
    0.027283526   2    1000024    1
    0.0074700842   2    1000022    2
    0.00082532966   2    1000023    2

DECAY 2000002  54.40701
    0.99998464   2    1000021    2

DECAY 1000004  54.911758
    0.57388797   2    1000037    3
    0.29205841   2    1000025    4
    0.09840685   2    1000021    4
    0.027326465   2    1000024    3
    0.0074819567   2    1000022    4
    0.00083834576   2    1000023    4

DECAY 2000004  54.41031
    0.99992232   2    1000021    4

DECAY 1000006  48.3693
    0.32180423   2    1000023    6
    0.30812868   2    1000022    6
    0.20503308   2    1000037    5
    0.10387402   2    1000025    6
    0.058860911   2    1000024    5
    0.0022983227   3    1000022    24    5

DECAY 2000006  390.15206
    0.24527389   2    1000005    24
    0.20604672   2    1000024    5
    0.17826642   2    1000006    25
    0.1230843   2    1000006    23
    0.10699878   2    1000023    6
    0.10207961   2    1000022    6
    0.021351969   2    1000021    6
    0.0057806858   2    1000037    5
    0.0041554863   2    1000005    37
    0.0028369436   2    1000025    6
    0.0020913538   2    1000006    36
    0.0020338497   2    1000006    35

DECAY 1000024  7.0200368e-10
    0.47092689   3    1000022   -1    2
    0.19159462   3    1000022   -3    4
    0.15697753   3    1000022   -11    12
    0.15598349   3    1000022   -13    14
    0.024517476   3    1000022   -15    16

DECAY 1000037  6.0809118
    0.27327224   2    1000022    24
    0.25152089   2    1000023    24
    0.24856959   2    1000024    23
    0.22430929   2    1000024    25
    0.0011259827   3    1000023   -5    6
    0.0011069809   3    1000022   -5    6

DECAY 1000022 -1


DECAY 1000023  1.1968346e-06
    0.25283613   2    1000022    22
    0.14528642   3    1000022    12   -12
    0.1086409   3    1000022    1   -1
    0.10856373   3    1000022    3   -3
    0.08473136   3    1000022    2   -2
    0.073217009   3    1000022    4   -4
    0.024517167   3    1000022    11   -11
    0.024489751   3    1000022    13   -13
    0.02424602   3    1000024    1   -2
    0.02424602   3   -1000024   -1    2
    0.022078502   3    1000024    3   -4
    0.022078502   3   -1000024   -3    4
    0.021369615   3    1000022    5   -5
    0.017900717   3    1000022    15   -15
    0.0080820134   3    1000024    11   -12
    0.0080820134   3   -1000024   -11    12
    0.0080766523   3    1000024    13   -14
    0.0080766523   3   -1000024   -13    14
    0.0067404182   3    1000024    15   -16
    0.0067404182   3   -1000024   -15    16

DECAY 1000025  7.3620266
    0.23508932   2    1000024   -24
    0.23508932   2   -1000024    24
    0.20584533   2    1000023    23
    0.15998063   2    1000022    25
    0.14079306   2    1000023    25
    0.020914943   2    1000022    23
    0.0011056945   3    1000024    5   -6
    0.0011056945   3   -1000024   -5    6

DECAY 1000035  95.726806
    0.096480513   2    2000013   -13
    0.096480513   2   -2000013    13
    0.096480319   2    2000011   -11
    0.096480319   2   -2000011    11
    0.07285922   2    1000015   -15
    0.07285922   2   -1000015    15
    0.031689905   2    1000024   -24
    0.031689905   2   -1000024    24
    0.030134575   2    37   -1000024
    0.030134575   2   -37    1000024
    0.021016141   2    1000023    23
    0.019251248   2    1000022    25
    0.018893319   2    1000023    35
    0.016389493   2    1000023    25
    0.016298663   2    2000006   -6
    0.016298663   2   -2000006    6
    0.015238804   2    1000022    35
    0.014424335   2    1000022    36
    0.011912913   2    1000022    23
    0.011317714   2    1000023    36
    0.010807352   2    2000003   -3
    0.010807352   2   -2000003    3
    0.010807341   2    2000001   -1
    0.010807341   2   -2000001    1
    0.0087984604   2    1000006   -6
    0.0087984604   2   -1000006    6
    0.0083949186   2    1000005   -5
    0.0083949186   2   -1000005    5
    0.0079683516   2    1000016   -16
    0.0079683516   2   -1000016    16
    0.007945593   2    2000015   -15
    0.007945593   2   -2000015    15
    0.005535544   2    1000014   -14
    0.005535544   2   -1000014    14
    0.0055355247   2    1000012   -12
    0.0055355247   2   -1000012    12
    0.0055173652   2    1000013   -13
    0.0055173652   2   -1000013    13
    0.005517344   2    1000011   -11
    0.005517344   2   -1000011    11
    0.0023844822   3    1000024    5   -6
    0.0023844822   3   -1000024   -5    6
    0.0020258203   3    1000023    6   -6
    0.0019455734   3    1000022    6   -6
    0.0018326116   2    1000037   -24
    0.0018326116   2   -1000037    24
    0.001275327   2    1000003   -3
    0.001275327   2   -1000003    3
    0.0012753254   2    1000001   -1
    0.0012753254   2   -1000001    1
    0.0012717467   2    1000002   -2
    0.0012717467   2   -1000002    2
    0.0012717457   2    1000004   -4
    0.0012717457   2   -1000004    4
    0.0011459605   2    1000025    25
    0.0010462963   2    2000002   -2
    0.0010462963   2   -2000002    2
    0.0010462799   2    2000004   -4
    0.0010462799   2   -2000004    4
    0.00058517003   2    1000025    23
    0.00038089692   2    37   -1000037
    0.00038089692   2   -37    1000037
    0.00017390581   2    1000025    35
    0.0001536429   2    1000025    36
    0.00013146168   3    1000037    5   -6
    0.00013146168   3   -1000037   -5    6
    0.00010641331   3    1000025    6   -6

DECAY 1000021  141.59486
    0.24415889   2    1000005   -5
    0.24415889   2   -1000005    5
    0.24199383   2    1000006   -6
    0.24199383   2   -1000006    6
    0.0060095034   2    2000003   -3
    0.0060095034   2   -2000003    3
    0.0060094606   2    2000001   -1
    0.0060094606   2   -2000001    1
    0.00038630262   3    1000023    6   -6
    0.00037800765   3    1000024    5   -6
    0.00037800765   3   -1000024   -5    6
    0.000369314   3    1000022    6   -6
    0.00029074913   3    1000037    3   -4
    0.00029074913   3   -1000037   -3    4
    0.00029074798   3    1000037    1   -2
    0.00029074798   3   -1000037   -1    2
    0.00020916527   3    1000025    4   -4
    0.00020916444   3    1000025    2   -2
    0.00020857572   3    1000025    3   -3
    0.00020857528   3    1000025    1   -1

DECAY 25  0.0042076156
    0.56170402   2   -5    5
    0.24392274   2   -24    24
    0.068797572   2    21    21
    0.064653614   2   -15    15
    0.030350076   2    23    23
    0.026296884   2   -4    4
    0.0022740816   2    22    22
    0.0015652783   2    22    23
    0.00022422245   2   -13    13
    0.00021079543   2   -3    3
    5.8282639e-07   2   -1    1
    1.355098e-07   2   -2    2
    5.0407524e-09   2   -11    11

DECAY 35  5.2436382
    0.8155535   2   -5    5
    0.12623993   2   -15    15
    0.025253114   2   -1000024    1000024
    0.019140682   2   -6    6
    0.0072961085   2    1000022    1000022
    0.0039346527   2    1000022    1000023
    0.00091921642   2    1000023    1000023
    0.00067961318   2    25    25
    0.00043711736   2   -13    13
    0.0003116691   2   -3    3
    0.00011074023   2   -24    24
    7.626163e-05   2    23    23
    4.4561639e-05   2    21    21
    9.1176467e-07   2    22    23
    8.6169909e-07   2   -1    1
    7.5936747e-07   2    22    22
    2.9233256e-07   2   -4    4
    9.8209509e-09   2   -11    11
    1.5073435e-12   2   -2    2

DECAY 36  5.3887234
    0.78606909   2   -5    5
    0.12167296   2   -15    15
    0.051660654   2   -1000024    1000024
    0.020642584   2   -6    6
    0.016276266   2    1000022    1000022
    0.0014265695   2    1000023    1000023
    0.0012714503   2    1000022    1000023
    0.00042129751   2   -13    13
    0.00030039062   2   -3    3
    0.00014422433   2    21    21
    0.00011025897   2    23    25
    1.6780991e-06   2    22    22
    1.4667498e-06   2    22    23
    8.3051644e-07   2   -1    1
    2.6951493e-07   2   -4    4
    9.4655137e-09   2   -11    11
    1.3897163e-12   2   -2    2
    1.7095329e-36   2    25    25

DECAY 37  4.533351
    0.8452755   2   -5    6
    0.138618   2   -15    16
    0.012835214   2    1000023    1000024
    0.001276009   2   -5    4
    0.00098997834   2    1000022    1000024
    0.00049006731   2   -13    14
    0.00031785978   2   -3    4
    0.00013371553   2    24    25
    3.725887e-05   2   -3    6
    1.4652731e-05   2   -3    2
    9.1120481e-06   2   -5    2
    1.6889382e-06   2   -1    6
    8.8105991e-07   2   -1    2
    5.6989925e-08   2   -1    4
    1.1462726e-08   2   -11    12
    2.6117718e-10   2    24    36
    2.4934932e-10   2    24    35

DECAY 6  2.43
    1   2    5    24

DECAY 15 -1
