BLOCK SPINFO
   1   SPheno
   2   v4.0.5be

BLOCK SPHENOINFO
   1   2
   2   2

BLOCK MODSEL
   1   0

BLOCK MINPAR
   3    6.4598567
   4   -1

BLOCK EXTPAR
   0    1418.8318
   1    324.26181
   2    1396.9704
   3    3000
   11    3297.8971
   12    1668.8789
   13   -1615.56
   23   -822.51964
   25    6.1859478
   26    3468.1743
   31    1458.2691
   32    1458.2691
   33    1282.1282
   34    1102.7953
   35    1102.7953
   36    1524.2724
   41    5000
   42    5000
   43    1618.1874
   44    5000
   45    5000
   46    1363.0901
   47    5000
   48    5000
   49    1936.1743

BLOCK SMINPUTS
   1    127.90897
   2    1.1663787e-05
   3    0.1184
   4    91.1876
   5    4.18
   6    173.2
   7    1.777
   8    0
   11    0.00051099893
   12    0
   13    0.10565837
   14    0
   21    0.005
   22    0.0025
   23    0.095
   24    1.27

BLOCK GAUGE Q=  1418.8318
   1    0.35536298
   2    0.66519887
   3    1.219778

BLOCK YU Q=  1418.8318
   1   1    8.4932195e-06
   2   2    0.0043145555
   3   3    1.0260491

BLOCK YD Q=  1418.8318
   1   1    0.00010557446
   2   2    0.0020059147
   3   3    0.10469678

BLOCK YE Q=  1418.8318
   1   1    1.8423515e-05
   2   2    0.0038093985
   3   3    0.064067816

BLOCK AU Q=  1418.8318
   1   1    0
   2   2    0
   3   3    3297.8974

BLOCK AD Q=  1418.8318
   1   1    0
   2   2    0
   3   3    1668.8791

BLOCK AE Q=  1418.8318
   1   1    0
   2   2    0
   3   3   -1615.56

BLOCK MSOFT Q=  1418.8318
   1    324.26181
   2    1396.9704
   3    3000
   21    11013749
   22   -313593.4
   31    1458.2691
   32    1458.2691
   33    1282.1282
   34    1102.7953
   35    1102.7953
   36    1524.2724
   41    5000
   42    5000
   43    1618.1874
   44    5000
   45    5000
   46    1363.0901
   47    5000
   48    5000
   49    1936.1743

BLOCK MASS
   6    173.2
   23    91.1876
   24    80.429995
   15    1.777
   25    122.11329
   35    3468.2993
   36    3468.1743
   37    3469.2641
   1000001    5024.444
   2000001    5015.8716
   1000002    5024.0388
   2000002    5018.0233
   1000003    5024.4446
   2000003    5015.8718
   1000004    5024.0394
   2000004    5018.0242
   1000005    1588.692
   2000005    1962.7387
   1000006    1208.0245
   2000006    1666.4261
   1000011    1470.6459
   2000011    1102.0918
   1000012    1468.2542
   1000013    1470.6461
   2000013    1102.092
   1000014    1468.2542
   1000015    1296.1446
   2000015    1524.3627
   1000016    1293.4948
   1000021    3184.4675
   1000022    325.04897
   1000023    833.04321
   1000025   -837.04007
   1000035    1450.0546
   1000024    833.37766
   1000037    1450.1337

BLOCK ALPHA
      -0.15386188

BLOCK HMIX Q=  1418.8318
   1   -822.51964
   2    6.1859478
   3    244.04875
   4    12028233

BLOCK STOPMIX
   1   1   -0.426632
   1   2    0.90442531
   2   1   -0.90442531
   2   2   -0.426632

BLOCK SBOTMIX
   1   1   -0.99992338
   1   2    0.012379122
   2   1   -0.012379122
   2   2   -0.99992338

BLOCK STAUMIX
   1   1   -0.9999547
   1   2    0.0095188636
   2   1   -0.0095188636
   2   2   -0.9999547

BLOCK NMIX
   1   1   -0.99818606
   1   2    0.00021927645
   1   3    0.058488664
   1   4    0.014269809
   2   1    0.051393174
   2   2    0.074176776
   2   3    0.70525312
   2   4    0.70318886
   3   1   -0.031240032
   3   2    0.028211101
   3   3   -0.70579013
   3   4    0.70716935
   4   1    0.0027205663
   4   2   -0.99684597
   4   3    0.032517673
   4   4    0.072341606

BLOCK UMIX
   1   1   -0.045805066
   1   2   -0.9989504
   2   1    0.9989504
   2   2   -0.045805066

BLOCK VMIX
   1   1   -0.10208525
   1   2    0.99477565
   2   1    0.99477565
   2   2    0.10208525

BLOCK HIGGSBOUNDSINPUTHIGGSCOUPLINGSFERMIONS
       0, 38.26595,3,36,15,15

BLOCK HIGGSBOUNDSINPUTHIGGSCOUPLINGSBOSONS
       0,4,36,21,21,23

BLOCK SPHENOLOWENERGY
   1    0.00031873882
   2    1.5889556e-06
   3    3.5215708e-05
   4    2.41551e-15
   5    1.0318785e-10
   6    2.1601504e-08
   7    8.1475008e-14
   8    3.4806098e-09
   9    7.3827223e-07
   10    9.6790392e-05
   11    0.99980769
   12    0.54312053
   13    19.406085
   14    0
   15    0
   16    0.0021617405
   17    2.2817033e-15
   18    2.4784933e-11
   19    8.2863561e-11
   20   -1.044917e-15
   21   -4.4673569e-11
   22   -1.361214e-08
   23    0
   24    0
   25    0
   26    0
   27    0
   28    0
   29    0
   30    0
   31    0
   39   -0.00018451572
   40    0
   41    0
   42    0

BLOCK FWCOEF Q=  160
   305   4422   0   0   -0.18881911
   305   4422   0   2   -0.18621595
   305   4322   0   2   -5.7729353e-05
   305   6421   0   0   -0.095227835
   305   6421   0   2   -0.097954333
   305   6321   0   2   -0.0001096678
   3051111   4133   0   0    1.5897558
   3051111   4133   0   2    1.5908045
   3051111   4233   0   2    5.8624845e-06
   3051111   4137   0   0   -4.4124479
   3051111   4137   0   2   -4.4071545
   3051111   4237   0   2   -4.5218962e-05
   3051313   4133   0   0    1.5897558
   3051313   4133   0   2    1.5908045
   3051313   4233   0   2    5.8624836e-06
   3051313   4137   0   0   -4.4124479
   3051313   4137   0   2   -4.4071546
   3051313   4237   0   2   -4.5218964e-05
   3051212   4137   0   0    1.5053501
   3051212   4137   0   2    1.5042012
   3051212   4237   0   2    9.8532641e-06
   3051414   4137   0   0    1.5053501
   3051414   4137   0   2    1.5042012
   3051414   4237   0   2    9.8532642e-06
   3051616   4137   0   0    1.5053501
   3051616   4137   0   2    1.5042012
   3051616   4237   0   2    9.8531794e-06

BLOCK IMFWCOEF Q=  160
   305   4422   0   0    3.8583946e-07
   305   4422   0   2   -3.0909272e-06
   305   4322   0   2    6.7370401e-07
   305   6421   0   0    3.3049702e-07
   305   6421   0   2    5.677457e-07
   305   6321   0   2    3.0564521e-07
   3051111   4133   0   2   -1.3351465e-06
   3051111   4233   0   2    1.1867406e-07
   3051111   4137   0   2    1.1121991e-05
   3051111   4237   0   2   -9.1688052e-07
   3051313   4133   0   2   -1.3351461e-06
   3051313   4233   0   2    1.1867404e-07
   3051313   4137   0   2    1.1121991e-05
   3051313   4237   0   2   -9.1688055e-07
   3051212   4137   0   2   -2.3263703e-06
   3051212   4237   0   2    1.9980541e-07
   3051414   4137   0   2   -2.3263703e-06
   3051414   4237   0   2    1.9980541e-07
   3051616   4137   0   2   -2.3275556e-06
   3051616   4237   0   2    1.9980377e-07

DECAY 23  2.4952


DECAY 24  2.085


DECAY 2000011  4.6030183
    0.99920591   2    1000022    11
    0.00058385275   2    1000023    11
    0.00021023623   2    1000025    11

DECAY 1000011  1.7224739
    0.96596639   2    1000022    11
    0.01790341   2    1000023    11
    0.0072677764   2   -1000024    12
    0.0057552968   2   -1000037    12
    0.0028791041   2    1000035    11
    0.0002280229   2    1000025    11

DECAY 2000013  4.603136
    0.99918087   2    1000022    13
    0.00059011428   2    1000023    13
    0.00021637161   2    1000025    13

DECAY 1000013  1.7226968
    0.96584228   2    1000022    13
    0.017957879   2    1000023    13
    0.0072668387   2   -1000024    14
    0.005754641   2   -1000037    14
    0.0028787299   2    1000035    13
    0.00028407643   2    1000025    13

DECAY 1000015  1.4897777
    0.95617508   2    1000022    15
    0.02598801   2    1000023    15
    0.012084837   2    1000025    15
    0.0057520712   2   -1000024    16

DECAY 2000015  7.0953202
    0.97992174   2    1000022    15
    0.0085271795   2   -1000024    16
    0.0056463632   2    1000023    15
    0.0048099371   2    1000025    15
    0.00055555412   2    1000016   -24
    0.00028262591   2    1000015    25
    0.0002515769   2    1000015    23

DECAY 1000012  1.7492401
    0.95088341   2    1000022    12
    0.035379878   2    1000024    11
    0.0044000645   2    1000037    11
    0.0037082134   2    1000023    12
    0.0033935336   2    1000025    12
    0.0022349055   2    1000035    12

DECAY 1000014  1.7494352
    0.95077738   2    1000022    14
    0.0354875   2    1000024    13
    0.0043994993   2    1000037    13
    0.0037078001   2    1000023    14
    0.0033931554   2    1000025    14
    0.0022346635   2    1000035    14

DECAY 1000016  1.5071209
    0.94358715   2    1000022    16
    0.051015627   2    1000024    15
    0.0028242849   2    1000023    16
    0.0025729405   2    1000025    16

DECAY 2000001  143.8524
    0.98069977   2    1000021    1
    0.019233525   2    1000022    1

DECAY 1000001  198.43942
    0.71542504   2    1000021    1
    0.18691167   2   -1000037    2
    0.093154818   2    1000035    1
    0.0035003623   2    1000022    1
    0.00044567238   2    1000023    1
    0.00044227213   2   -1000024    2
    0.00012016937   2    1000025    1

DECAY 2000003  143.85318
    0.98069461   2    1000021    3
    0.019233432   2    1000022    3

DECAY 1000003  198.44163
    0.71541739   2    1000021    3
    0.18690971   2   -1000037    4
    0.093153798   2    1000035    3
    0.0035003307   2    1000022    3
    0.00045103085   2   -1000024    4
    0.00044661891   2    1000023    3
    0.00012111944   2    1000025    3

DECAY 1000005  51.718741
    0.67194422   2    1000006   -24
    0.31645979   2   -1000024    6
    0.00397638   2    1000022    5
    0.003742179   2    1000035    5
    0.0020707166   2    1000023    5
    0.0018067131   2    1000025    5

DECAY 2000005  1.693378
    0.60981113   2    1000022    5
    0.17044019   2   -1000024    6
    0.085260938   2    1000025    5
    0.084981133   2    1000023    5
    0.019947618   2    1000006   -24
    0.012282527   2    1000005    25
    0.0086966501   2    1000005    23
    0.007379797   2    2000006   -24
    0.00079556415   2   -1000037    6
    0.00040445704   2    1000035    5

DECAY 2000002  152.41039
    0.92710222   2    1000021    2
    0.072645856   2    1000022    2
    0.00018364419   2    1000023    2

DECAY 1000002  198.43421
    0.71523124   2    1000021    2
    0.18533717   2    1000037    1
    0.092966127   2    1000035    2
    0.0034829384   2    1000022    2
    0.002196656   2    1000024    1
    0.00073183345   2    1000023    2

DECAY 2000004  152.41393
    0.92708088   2    1000021    4
    0.072644172   2    1000022    4
    0.0001893475   2    1000023    4

DECAY 1000004  198.43635
    0.71522351   2    1000021    4
    0.1853352   2    1000037    3
    0.092965184   2    1000035    4
    0.0034829027   2    1000022    4
    0.0021985419   2    1000024    3
    0.0007361996   2    1000023    4

DECAY 1000006  14.459377
    0.36552979   2    1000024    5
    0.26015813   2    1000023    6
    0.25486124   2    1000025    6
    0.11944129   2    1000022    6

DECAY 2000006  60.416887
    0.38950903   2    1000006    23
    0.22171361   2    1000006    25
    0.14116151   2    1000025    6
    0.14008818   2    1000023    6
    0.079042867   2    1000024    5
    0.014894859   2    1000022    6
    0.00991156   2    1000037    5
    0.0036783894   2    1000035    6

DECAY 1000024  0.43152032
    0.99189625   2    1000022    24
    0.008101774   3    1000022   -5    6

DECAY 1000037  9.0053058
    0.22207482   2    1000024    25
    0.2178361   2    1000025    24
    0.2149451   2    1000023    24
    0.20978969   2    1000024    23
    0.063991128   2    1000006   -5
    0.029296136   2    1000016   -15
    0.02859968   2   -1000015    16
    0.0064113836   3    1000025   -5    6
    0.0033472556   3    1000023   -5    6
    0.0025414613   3    1000024    6   -6
    0.00068168837   2    1000022    24
    0.00019681703   3    1000022   -11    12
    0.00019681691   3    1000022   -13    14

DECAY 1000022 -1


DECAY 1000023  0.40293431
    0.69836179   2    1000022    25
    0.30060096   2    1000022    23
    0.0010317697   3    1000022    6   -6

DECAY 1000025  0.86934407
    0.61459108   2    1000022    25
    0.38455084   2    1000022    23
    0.00084745374   3    1000022    6   -6

DECAY 1000035  11.825778
    0.28137457   2    1000025    25
    0.16063818   2    1000024   -24
    0.16063818   2   -1000024    24
    0.14852299   2    1000023    25
    0.14711783   2    1000025    23
    0.021197683   2    1000023    23
    0.01485286   2    1000006   -6
    0.01485286   2   -1000006    6
    0.011222714   2    1000016   -16
    0.011222714   2   -1000016    16
    0.010802642   2    1000015   -15
    0.010802642   2   -1000015    15
    0.0022097012   3    1000024    5   -6
    0.0022097012   3   -1000024   -5    6
    0.0010018896   3    1000025    6   -6
    0.00056349203   3    1000023    6   -6
    0.00034917085   2    1000022    25
    0.00015217184   3    1000022    12   -12

DECAY 1000021  209.30627
    0.18094093   2    1000006   -6
    0.18094093   2   -1000006    6
    0.12704612   2    1000005   -5
    0.12704612   2   -1000005    5
    0.10473723   2    2000006   -6
    0.10473723   2   -2000006    6
    0.086579445   2    2000005   -5
    0.086579445   2   -2000005    5
    0.00060627007   3    1000037    5   -6
    0.00060627007   3   -1000037   -5    6

DECAY 25  0.0035337281
    0.61713179   2   -5    5
    0.18349382   2   -24    24
    0.073122324   2    21    21
    0.070697177   2   -15    15
    0.030519496   2   -4    4
    0.020957393   2    23    23
    0.0023434061   2    22    22
    0.001256808   2    22    23
    0.00024520217   2   -13    13
    0.00023178397   2   -3    3
    6.4085919e-07   2   -1    1
    1.5728366e-07   2   -2    2
    5.512456e-09   2   -11    11

DECAY 35  33.474421
    0.22814032   2   -1000024    1000037
    0.22814032   2   -1000037    1000024
    0.12107499   2    1000023    1000035
    0.10876212   2   -6    6
    0.10833087   2    1000025    1000035
    0.066420859   2    1000022    1000023
    0.04926109   2   -5    5
    0.037815437   2    1000022    1000025
    0.0096147717   2   -1000006    1000006
    0.0084239904   2   -15    15
    0.0079962468   2   -1000024    1000024
    0.0071486242   2   -2000006    1000006
    0.0071486242   2   -1000006    2000006
    0.0063522374   2   -2000006    2000006
    0.0011111001   2    1000023    1000023
    0.00081372519   2   -1000037    1000037
    0.00080121328   2    1000022    1000022
    0.00063936274   2   -2000015    1000015
    0.00063936274   2   -1000015    2000015
    0.00041170095   2    1000025    1000025
    0.00040730173   2    1000035    1000035
    0.00028278533   2    1000022    1000035
    9.6235404e-05   2    25    25
    3.3084417e-05   2    21    21
    2.9199166e-05   2   -13    13
    1.7676667e-05   2   -3    3
    1.7273952e-05   2    23    23
    1.0121106e-05   2   -1000005    1000005
    7.5137177e-06   2    1000023    1000025
    4.3316507e-06   2   -24    24
    2.8671182e-06   2   -2000011    2000011
    2.8669655e-06   2   -2000013    2000013
    2.7997111e-06   2   -2000015    2000015
    2.6475406e-06   2   -1000011    1000011
    2.6463542e-06   2   -1000013    1000013
    1.7146811e-06   2   -1000015    1000015
    1.3728689e-06   2   -4    4
    9.1306022e-08   2    22    22
    4.8869453e-08   2   -1    1
    4.7141129e-08   2    22    23
    1.3804304e-08   2   -2000013    1000013
    1.3804304e-08   2   -1000013    2000013
    6.5576828e-10   2   -11    11
    7.0766436e-12   2   -2    2
    3.2288459e-13   2   -2000011    1000011
    3.2288459e-13   2   -1000011    2000011

DECAY 36  33.30734
    0.2296314   2   -1000024    1000037
    0.2296314   2   -1000037    1000024
    0.12246346   2    1000025    1000035
    0.10794776   2    1000023    1000035
    0.10142003   2   -6    6
    0.065016825   2    1000022    1000025
    0.047978708   2   -5    5
    0.039545291   2    1000022    1000023
    0.017509789   2   -2000006    1000006
    0.017509789   2   -1000006    2000006
    0.0082072796   2   -15    15
    0.0077200613   2   -1000024    1000024
    0.0010010885   2    1000025    1000025
    0.00077215508   2    1000023    1000023
    0.00071251833   2    1000022    1000022
    0.00064250243   2   -2000015    1000015
    0.00064250243   2   -1000015    2000015
    0.0006071093   2   -1000037    1000037
    0.00053746764   2    1000022    1000035
    0.00030546627   2    1000035    1000035
    8.4540677e-05   2    1000023    1000025
    3.4002497e-05   2    21    21
    3.1750529e-05   2    23    25
    2.8447916e-05   2   -13    13
    1.7221282e-05   2   -3    3
    1.259755e-06   2   -4    4
    6.6275355e-08   2    22    23
    4.7610647e-08   2   -1    1
    4.5983892e-08   2    22    22
    1.3877189e-08   2   -2000013    1000013
    1.3877189e-08   2   -1000013    2000013
    6.3889019e-10   2   -11    11
    6.4937577e-12   2   -2    2
    3.2458889e-13   2   -2000011    1000011
    3.2458889e-13   2   -1000011    2000011
    2.5903661e-39   2    25    25

DECAY 37  32.808177
    0.23766554   2    1000023    1000037
    0.23480902   2    1000024    1000035
    0.23403599   2    1000025    1000037
    0.15026868   2   -5    6
    0.10775904   2    1000022    1000024
    0.020107927   2   -1000005    1000006
    0.0088246262   2   -15    16
    0.0014117113   2    1000024    1000025
    0.0013092832   2   -2000015    1000016
    0.0012719998   2   -1000005    2000006
    0.0010463602   2    1000023    1000024
    0.00083613324   2    1000022    1000037
    0.00031323278   2   -2000005    1000006
    0.00014017435   2   -3    6
    7.6635555e-05   2   -5    4
    3.2279089e-05   2    24    25
    3.1198199e-05   2   -13    14
    1.7913955e-05   2   -3    4
    1.1507714e-05   2   -2000011    1000012
    1.150749e-05   2   -2000013    1000014
    1.134701e-05   2   -1000015    1000016
    6.4279037e-06   2   -1    6
    7.8169814e-07   2   -3    2
    5.4724302e-07   2   -5    2
    6.0817638e-08   2   -1    4
    4.6236936e-08   2   -1    2
    2.7431855e-08   2   -1000013    1000014
    1.5469374e-09   2    1000035    1000037
    7.2972911e-10   2   -11    12
    6.4163347e-13   2   -1000011    1000012
    6.3804929e-14   2    24    36

DECAY 6  2.43
    1   2    5    24

DECAY 15 -1
