BLOCK SPINFO
   1   SPheno
   2   v4.0.5be

BLOCK SPHENOINFO
   1   2
   2   2

BLOCK MODSEL
   1   0

BLOCK MINPAR
   3    8.5414787
   4   -1

BLOCK EXTPAR
   0    1419.5855
   1    1986.548
   2    623.18158
   3    3000
   11   -4069.4269
   12    1683.4689
   13   -1095.3177
   23   -471.70543
   25    8.2154626
   26    4187.9012
   31    1208.4458
   32    1208.4458
   33    696.99918
   34    1646.5869
   35    1646.5869
   36    1756.9135
   41    5000
   42    5000
   43    1529.3077
   44    5000
   45    5000
   46    1478.1899
   47    5000
   48    5000
   49    752.86408

BLOCK SMINPUTS
   1    127.90897
   2    1.1663787e-05
   3    0.1184
   4    91.1876
   5    4.18
   6    173.2
   7    1.777
   8    0
   11    0.00051099893
   12    0
   13    0.10565837
   14    0
   21    0.005
   22    0.0025
   23    0.095
   24    1.27

BLOCK GAUGE Q=  1419.5855
   1    0.35536298
   2    0.66519887
   3    1.219778

BLOCK YU Q=  1419.5855
   1   1    8.4462559e-06
   2   2    0.004290698
   3   3    1.0203756

BLOCK YD Q=  1419.5855
   1   1    0.00013943651
   2   2    0.0026492937
   3   3    0.13827733

BLOCK YE Q=  1419.5855
   1   1    2.4332691e-05
   2   2    0.0050312287
   3   3    0.084616991

BLOCK AU Q=  1419.5855
   1   1    0
   2   2    0
   3   3   -4069.4266

BLOCK AD Q=  1419.5855
   1   1    0
   2   2    0
   3   3    1683.4688

BLOCK AE Q=  1419.5855
   1   1    0
   2   2    0
   3   3   -1095.3177

BLOCK MSOFT Q=  1419.5855
   1    1986.548
   2    623.18158
   3    3000
   21    17005763
   22    78292.181
   31    1208.4458
   32    1208.4458
   33    696.99918
   34    1646.5869
   35    1646.5869
   36    1756.9135
   41    5000
   42    5000
   43    1529.3077
   44    5000
   45    5000
   46    1478.1899
   47    5000
   48    5000
   49    752.86408

BLOCK MASS
   6    173.2
   23    91.1876
   24    80.429995
   15    1.777
   25    121.80156
   35    4187.0504
   36    4187.9012
   37    4188.3203
   1000001    5027.0071
   2000001    5016.2457
   1000002    5026.5913
   2000002    5018.8941
   1000003    5027.0078
   2000003    5016.2461
   1000004    5026.592
   2000004    5018.8949
   1000005    700.28701
   2000005    1486.1251
   1000006    1237.1561
   2000006    1628.9158
   1000011    1217.8663
   2000011    1647.919
   1000012    1214.9979
   1000013    1217.8671
   2000013    1647.92
   1000014    1214.9988
   1000015    713.4289
   2000015    1758.6788
   1000016    708.79196
   1000021    3187.7187
   1000022    467.62311
   1000023   -486.04455
   1000025    674.18403
   1000035    1983.7739
   1000024    472.10242
   1000037    674.71674

BLOCK ALPHA
      -0.11667879

BLOCK HMIX Q=  1419.5855
   1   -471.70543
   2    8.2154626
   3    244.03904
   4    17538517

BLOCK STOPMIX
   1   1    0.62588663
   1   2    0.77991405
   2   1   -0.77991405
   2   2    0.62588663

BLOCK SBOTMIX
   1   1   -0.0075078923
   1   2    0.99997181
   2   1   -0.99997181
   2   2   -0.0075078923

BLOCK STAUMIX
   1   1   -0.99999815
   1   2    0.0019209907
   2   1   -0.0019209907
   2   2   -0.99999815

BLOCK NMIX
   1   1    0.017538206
   1   2   -0.24713124
   1   3   -0.69728969
   1   4   -0.67261106
   2   1    0.014289024
   2   2   -0.055554992
   2   3    0.70342567
   2   4   -0.70845028
   3   1   -0.0067265197
   3   2   -0.96738715
   3   3    0.13773077
   3   4    0.21247847
   4   1   -0.99972146
   4   2    0.0013794678
   4   3   -0.0031052574
   4   4   -0.0233552

BLOCK UMIX
   1   1   -0.19977564
   1   2   -0.97984167
   2   1    0.97984167
   2   2   -0.19977564

BLOCK VMIX
   1   1   -0.3070128
   1   2    0.95170539
   2   1    0.95170539
   2   2    0.3070128

BLOCK HIGGSBOUNDSINPUTHIGGSCOUPLINGSFERMIONS
       0, 67.493827,3,36,15,15

BLOCK HIGGSBOUNDSINPUTHIGGSCOUPLINGSBOSONS
       0,4,36,21,21,23

BLOCK SPHENOLOWENERGY
   1    0.00033796828
   2    1.5902083e-06
   3    3.5283882e-05
   4    2.4777162e-15
   5    1.0584524e-10
   6    2.2158866e-08
   7    8.3553628e-14
   8    3.569409e-09
   9    7.5713972e-07
   10    9.678298e-05
   11    0.99973113
   12    0.54311857
   13    19.406026
   14    0
   15    0
   16    0.0021624255
   17    2.2817103e-15
   18    2.4811852e-11
   19    8.2935348e-11
   20   -1.9923911e-15
   21   -8.5181374e-11
   22   -3.4881945e-08
   23    0
   24    0
   25    0
   26    0
   27    0
   28    0
   29    0
   30    0
   31    0
   39   -7.3186236e-05
   40    0
   41    0
   42    0

BLOCK FWCOEF Q=  160
   305   4422   0   0   -0.18881911
   305   4422   0   2   -0.20926699
   305   4322   0   2   -0.00018246875
   305   6421   0   0   -0.095227835
   305   6421   0   2   -0.1087002
   305   6321   0   2   -0.00013837575
   3051111   4133   0   0    1.589776
   3051111   4133   0   2    1.591331
   3051111   4233   0   2    1.3558733e-05
   3051111   4137   0   0   -4.4124681
   3051111   4137   0   2   -4.4137773
   3051111   4237   0   2   -0.00010440808
   3051313   4133   0   0    1.589776
   3051313   4133   0   2    1.5913309
   3051313   4233   0   2    1.3558731e-05
   3051313   4137   0   0   -4.4124681
   3051313   4137   0   2   -4.4137775
   3051313   4237   0   2   -0.00010440809
   3051212   4137   0   0    1.5053501
   3051212   4137   0   2    1.505657
   3051212   4237   0   2    2.2767751e-05
   3051414   4137   0   0    1.5053501
   3051414   4137   0   2    1.505657
   3051414   4237   0   2    2.2767751e-05
   3051616   4137   0   0    1.5053501
   3051616   4137   0   2    1.505657
   3051616   4237   0   2    2.2768094e-05

BLOCK IMFWCOEF Q=  160
   305   4422   0   0    3.858035e-07
   305   4422   0   2   -8.0370203e-06
   305   4322   0   2   -2.0386892e-06
   305   6421   0   0    3.3046621e-07
   305   6421   0   2    2.7355956e-06
   305   6321   0   2   -8.0926249e-07
   3051111   4133   0   2   -1.3353504e-06
   3051111   4233   0   2    2.6021908e-07
   3051111   4137   0   2    1.1242615e-05
   3051111   4237   0   2   -2.0059959e-06
   3051313   4133   0   2   -1.3353585e-06
   3051313   4233   0   2    2.6021905e-07
   3051313   4137   0   2    1.1242617e-05
   3051313   4237   0   2   -2.005996e-06
   3051212   4137   0   2   -2.0760237e-06
   3051212   4237   0   2    4.3743493e-07
   3051414   4137   0   2   -2.0760237e-06
   3051414   4237   0   2    4.3743493e-07
   3051616   4137   0   2   -2.0768941e-06
   3051616   4237   0   2    4.3744084e-07

DECAY 23  2.4952


DECAY 24  2.085


DECAY 1000011  7.913075
    0.62481232   2   -1000037    12
    0.30721035   2    1000025    11
    0.039042184   2   -1000024    12
    0.027835563   2    1000022    11
    0.001099574   2    1000023    11

DECAY 2000011  0.0038222733
    0.56334213   2    1000022    11
    0.36870173   2    1000023    11
    0.067951795   2    1000025    11

DECAY 1000013  7.9135249
    0.62477788   2   -1000037    14
    0.30719399   2    1000025    13
    0.039040006   2   -1000024    14
    0.027861535   2    1000022    13
    0.0011265887   2    1000023    13

DECAY 2000013  0.0052254722
    0.47736194   2    1000022    13
    0.33518674   2    1000023    13
    0.12847452   2   -1000024    14
    0.051794541   2    1000025    13
    0.0043913607   2   -1000037    14
    0.0027909132   2    1000013    25

DECAY 1000015  0.27109846
    0.29282886   2   -1000024    16
    0.27406287   2    1000022    15
    0.24790521   2   -1000037    16
    0.1246634   2    1000025    15
    0.060539651   2    1000023    15

DECAY 2000015  0.44847713
    0.45894668   2   -1000024    16
    0.23963307   2    1000023    15
    0.23798079   2    1000022    15
    0.018704511   2   -1000037    16
    0.017708192   2    1000016   -24
    0.0095598708   2    1000025    15
    0.008759609   2    1000015    23
    0.0087072879   2    1000015    25

DECAY 1000012  8.0104805
    0.57847582   2    1000037    11
    0.29704992   2    1000025    12
    0.090718997   2    1000024    11
    0.031874547   2    1000022    12
    0.001880718   2    1000023    12

DECAY 1000014  8.0109303
    0.57844559   2    1000037    13
    0.29703379   2    1000025    14
    0.090767211   2    1000024    13
    0.031872793   2    1000022    14
    0.0018806147   2    1000023    14

DECAY 1000016  0.35777836
    0.59512857   2    1000024    15
    0.18296702   2    1000022    16
    0.13861718   2    1000037    15
    0.07351596   2    1000025    16
    0.0097712681   2    1000023    16

DECAY 2000001  142.71946
    0.98603224   2    1000021    1
    0.013957012   2    1000035    1

DECAY 1000001  206.4132
    0.68719545   2    1000021    1
    0.19848472   2   -1000037    2
    0.096501687   2    1000025    1
    0.0084061197   2   -1000024    2
    0.0065976609   2    1000022    1
    0.0024592455   2    1000035    1
    0.00035511365   2    1000023    1

DECAY 2000003  142.72087
    0.98602277   2    1000021    3
    0.013956876   2    1000035    3

DECAY 1000003  206.41577
    0.68718722   2    1000021    3
    0.19848312   2   -1000037    4
    0.096500559   2    1000025    3
    0.0084139245   2   -1000024    4
    0.0065992018   2    1000022    3
    0.0024592154   2    1000035    3
    0.00035675562   2    1000023    3

DECAY 1000005  0.11681362
    0.3507529   2   -1000024    6
    0.34746147   2    1000022    5
    0.30162679   2    1000023    5
    0.00015883634   2    1000025    5

DECAY 2000005  58.158899
    0.37293538   2   -1000024    6
    0.36837895   2    1000006   -24
    0.1774347   2   -1000037    6
    0.06635957   2    1000025    5
    0.0095008238   2    1000022    5
    0.0041512602   2    1000023    5
    0.00074135822   2    1000005    25
    0.00049796209   2    1000005    23

DECAY 2000002  148.98282
    0.94642874   2    1000021    2
    0.053530165   2    1000035    2

DECAY 1000002  206.41179
    0.6869904   2    1000021    2
    0.18723401   2    1000037    1
    0.096972877   2    1000025    2
    0.019851322   2    1000024    1
    0.0062719261   2    1000022    2
    0.0023838622   2    1000035    2
    0.00029560147   2    1000023    2

DECAY 2000004  148.98645
    0.94640583   2    1000021    4
    0.053528877   2    1000035    4

DECAY 1000004  206.4143
    0.68698209   2    1000021    4
    0.18723188   2    1000037    3
    0.096972114   2    1000025    4
    0.019854286   2    1000024    3
    0.0062757986   2    1000022    4
    0.0023838352   2    1000035    4
    0.00029998709   2    1000023    4

DECAY 1000006  31.226307
    0.4552207   2    1000024    5
    0.26892758   2    1000022    6
    0.25228924   2    1000023    6
    0.014170132   2    1000025    6
    0.0090827139   2    1000037    5
    0.00027566473   2    1000005    24

DECAY 2000006  78.920043
    0.3089676   2    1000006    23
    0.17777406   2    1000023    6
    0.14219358   2    1000022    6
    0.1342014   2    1000037    5
    0.078265722   2    1000025    6
    0.073100951   2    1000024    5
    0.060169761   2    2000005    24
    0.024643834   2    1000006    25
    0.0006830921   2    1000005    24

DECAY 1000024  2.3657571e-09
    0.39963356   3    1000022   -1    2
    0.27145311   3    1000022   -3    4
    0.13328836   3    1000022   -11    12
    0.13291897   3    1000022   -13    14
    0.062706004   3    1000022   -15    16

DECAY 1000037  2.7847337
    0.34064281   2    1000023    24
    0.24362878   2    1000022    24
    0.2279115   2    1000024    23
    0.18778849   2    1000024    25

DECAY 1000022 -1


DECAY 1000023  1.1673075e-05
    0.11888506   2    1000022    22
    0.11809561   3    1000022    12   -12
    0.088276304   3    1000022    1   -1
    0.088249432   3    1000022    3   -3
    0.068848669   3    1000022    2   -2
    0.064659378   3    1000022    4   -4
    0.059223869   3    1000024    1   -2
    0.059223869   3   -1000024   -1    2
    0.056877133   3    1000024    3   -4
    0.056877133   3   -1000024   -3    4
    0.048059442   3    1000022    5   -5
    0.019918998   3    1000022    11   -11
    0.01990944   3    1000022    13   -13
    0.019742311   3    1000024    11   -12
    0.019742311   3   -1000024   -11    12
    0.019736751   3    1000024    13   -14
    0.019736751   3   -1000024   -13    14
    0.018261213   3    1000024    15   -16
    0.018261213   3   -1000024   -15    16
    0.01741512   3    1000022    15   -15

DECAY 1000025  3.7494282
    0.24012675   2    1000023    23
    0.23401119   2    1000023    25
    0.195478   2    1000024   -24
    0.195478   2   -1000024    24
    0.1243048   2    1000022    25
    0.010543491   2    1000022    23

DECAY 1000035  21.530604
    0.05908808   2    1000005   -5
    0.05908808   2   -1000005    5
    0.056380357   2    1000006   -6
    0.056380357   2   -1000006    6
    0.051548219   2    1000023    25
    0.049141312   2    1000024   -24
    0.049141312   2   -1000024    24
    0.044240615   2    1000016   -16
    0.044240615   2   -1000016    16
    0.043618672   2    1000015   -15
    0.043618672   2   -1000015    15
    0.036066376   2    1000023    23
    0.027617149   2    1000022    25
    0.022701081   2    1000012   -12
    0.022701081   2   -1000012    12
    0.022701045   2    1000014   -14
    0.022701045   2   -1000014    14
    0.022340415   2    1000011   -11
    0.022340415   2   -1000011    11
    0.022340381   2    1000013   -13
    0.022340381   2   -1000013    13
    0.022223965   2    2000011   -11
    0.022223965   2   -2000011    11
    0.022223836   2    2000013   -13
    0.022223836   2   -2000013    13
    0.019124453   2    1000022    23
    0.017312073   2    2000006   -6
    0.017312073   2   -2000006    6
    0.010600563   2    2000015   -15
    0.010600563   2   -2000015    15
    0.007481461   2    1000037   -24
    0.007481461   2   -1000037    24
    0.0051074404   2    1000025    25
    0.0037725966   2    2000005   -5
    0.0037725966   2   -2000005    5
    0.0017649685   2    1000025    23
    0.0016165955   3    1000024    5   -6
    0.0016165955   3   -1000024   -5    6
    0.0015070453   3    1000023    6   -6
    0.0010792831   3    1000022    6   -6
    0.00023645533   3    1000037    5   -6
    0.00023645533   3   -1000037   -5    6
    0.00014011436   3    1000025    6   -6

DECAY 1000021  261.57082
    0.16338285   2    1000005   -5
    0.16338285   2   -1000005    5
    0.11378383   2    1000006   -6
    0.11378383   2   -1000006    6
    0.11222903   2    2000006   -6
    0.11222903   2   -2000006    6
    0.11047657   2    2000005   -5
    0.11047657   2   -2000005    5

DECAY 25  0.0034850201
    0.62079515   2   -5    5
    0.17967011   2   -24    24
    0.073274333   2    21    21
    0.071066729   2   -15    15
    0.03073967   2   -4    4
    0.020391613   2    23    23
    0.0023477459   2    22    22
    0.001234224   2    22    23
    0.00024649974   2   -13    13
    0.00023312245   2   -3    3
    6.4456058e-07   2   -1    1
    1.584188e-07   2   -2    2
    5.5416312e-09   2   -11    11

DECAY 35  62.993898
    0.20408036   2   -1000024    1000037
    0.20408036   2   -1000037    1000024
    0.1117711   2    1000022    1000025
    0.094254622   2    1000023    1000025
    0.063710581   2   -1000024    1000024
    0.057139165   2   -1000006    1000006
    0.051233743   2   -5    5
    0.037683261   2   -2000006    2000006
    0.03473357   2   -6    6
    0.030468925   2   -1000037    1000037
    0.024666849   2    1000022    1000022
    0.022682823   2    1000022    1000035
    0.01955295   2    1000023    1000035
    0.014883091   2    1000025    1000025
    0.0093017123   2   -15    15
    0.0043653385   2    1000022    1000023
    0.0037495743   2   -2000006    1000006
    0.0037495743   2   -1000006    2000006
    0.0024969757   2   -2000005    1000005
    0.0024969757   2   -1000005    2000005
    0.0013441682   2    1000025    1000035
    0.00080090023   2    1000023    1000023
    0.00028691702   2   -2000015    1000015
    0.00028691702   2   -1000015    2000015
    9.7188711e-05   2    25    25
    3.2701005e-05   2   -13    13
    1.9436416e-05   2   -3    3
    5.4078202e-06   2    21    21
    3.0637584e-06   2    23    23
    2.8222644e-06   2   -2000005    2000005
    1.3391642e-06   2   -1000005    1000005
    1.1116284e-06   2   -1000011    1000011
    1.1111595e-06   2   -1000013    1000013
    1.0023313e-06   2   -1000015    1000015
    6.1401596e-07   2   -24    24
    5.4388589e-07   2   -2000011    2000011
    5.4368691e-07   2   -2000013    2000013
    4.9698246e-07   2   -2000015    2000015
    4.50817e-07   2   -4    4
    1.3734192e-07   2    1000035    1000035
    7.0074725e-08   2    22    23
    5.3736575e-08   2   -1    1
    2.4128915e-08   2    22    22
    2.1795828e-09   2   -2000013    1000013
    2.1795828e-09   2   -1000013    2000013
    7.3437428e-10   2   -11    11
    2.3236999e-12   2   -2    2
    5.0980693e-14   2   -2000011    1000011
    5.0980693e-14   2   -1000011    2000011

DECAY 36  62.730099
    0.21939403   2   -1000024    1000037
    0.21939403   2   -1000037    1000024
    0.13897097   2    1000023    1000025
    0.078020968   2    1000022    1000025
    0.051347181   2   -2000006    1000006
    0.051347181   2   -1000006    2000006
    0.04943548   2   -1000024    1000024
    0.049135834   2   -5    5
    0.033321195   2   -6    6
    0.023682741   2    1000023    1000035
    0.019201207   2    1000022    1000035
    0.0165597   2    1000022    1000022
    0.016398689   2   -1000037    1000037
    0.0089211536   2   -15    15
    0.008748845   2    1000022    1000023
    0.0081973845   2    1000025    1000025
    0.00250638   2   -2000005    1000005
    0.00250638   2   -1000005    2000005
    0.0013627173   2    1000023    1000023
    0.00090318854   2    1000025    1000035
    0.00028806763   2   -2000015    1000015
    0.00028806763   2   -1000015    2000015
    3.1363593e-05   2   -13    13
    1.8641206e-05   2   -3    3
    1.1202923e-05   2    21    21
    6.8309381e-06   2    23    25
    4.3031583e-07   2   -4    4
    7.091572e-08   2    22    23
    5.1537951e-08   2   -1    1
    2.1775153e-09   2   -2000013    1000013
    2.1775153e-09   2   -1000013    2000013
    1.0580988e-09   2    1000035    1000035
    7.886986e-10   2    22    22
    7.0433854e-10   2   -11    11
    2.2181098e-12   2   -2    2
    5.093231e-14   2   -2000011    1000011
    5.093231e-14   2   -1000011    2000011
    1.8086077e-37   2    25    25

DECAY 37  60.516372
    0.26923628   2    1000022    1000037
    0.25524969   2    1000024    1000025
    0.23831095   2    1000023    1000037
    0.087942934   2   -5    6
    0.045859375   2   -2000005    1000006
    0.042545712   2    1000024    1000035
    0.020868363   2    1000023    1000024
    0.020820209   2   -2000005    2000006
    0.01009784   2   -15    16
    0.0028945716   2   -1000005    2000006
    0.0025609875   2   -1000005    1000006
    0.0024202775   2    1000035    1000037
    0.00059778458   2   -2000015    1000016
    0.00038484497   2    1000022    1000024
    7.6839267e-05   2   -5    4
    5.1534906e-05   2   -3    6
    3.5699457e-05   2   -13    14
    1.9083502e-05   2   -3    4
    7.0852018e-06   2    24    25
    4.8227225e-06   2   -1000015    1000016
    4.5468377e-06   2   -1000011    1000012
    4.5461529e-06   2   -1000013    1000014
    2.3623537e-06   2   -1    6
    2.1545072e-06   2    1000025    1000037
    8.7559196e-07   2   -3    2
    5.4870649e-07   2   -5    2
    5.1688641e-08   2   -1    2
    2.3945604e-08   2   -1    4
    4.61014e-09   2   -2000013    1000014
    8.3501401e-10   2   -11    12
    1.0783181e-13   2   -2000011    1000012
    7.4295827e-14   2    24    35

DECAY 6  2.43
    1   2    5    24

DECAY 15 -1
