BLOCK SPINFO
   1   SPheno
   2   v4.0.5be

BLOCK SPHENOINFO
   1   2
   2   2

BLOCK MODSEL
   1   0

BLOCK MINPAR
   3    44.632876
   4   -1

BLOCK EXTPAR
   0    1601.4026
   1    1182.7787
   2    1795.0224
   3    3000
   11    3146.0745
   12   -481.67436
   13   -979.23328
   23   -409.1782
   25    44.382548
   26    853.37432
   31    1919.9555
   32    1919.9555
   33    1560.0956
   34    485.71876
   35    485.71876
   36    639.93442
   41    5000
   42    5000
   43    1408.2093
   44    5000
   45    5000
   46    1886.1204
   47    5000
   48    5000
   49    864.04656

BLOCK SMINPUTS
   1    127.90897
   2    1.1663787e-05
   3    0.1184
   4    91.1876
   5    4.18
   6    173.2
   7    1.777
   8    0
   11    0.00051099893
   12    0
   13    0.10565837
   14    0
   21    0.005
   22    0.0025
   23    0.095
   24    1.27

BLOCK GAUGE Q=  1601.4026
   1    0.35536298
   2    0.66519887
   3    1.219778

BLOCK YU Q=  1601.4026
   1   1    8.3865001e-06
   2   2    0.004260342
   3   3    1.0131566

BLOCK YD Q=  1601.4026
   1   1    0.00074795115
   2   2    0.014211072
   3   3    0.74173317

BLOCK YE Q=  1601.4026
   1   1    0.00013052295
   2   2    0.026988005
   3   3    0.45389385

BLOCK AU Q=  1601.4026
   1   1    0
   2   2    0
   3   3    3146.0745

BLOCK AD Q=  1601.4026
   1   1    0
   2   2    0
   3   3   -481.67436

BLOCK AE Q=  1601.4026
   1   1    0
   2   2    0
   3   3   -979.23329

BLOCK MSOFT Q=  1601.4026
   1    1182.7787
   2    1795.0224
   3    3000
   21    607370.94
   22   -122478.51
   31    1919.9555
   32    1919.9555
   33    1560.0956
   34    485.71876
   35    485.71876
   36    639.93442
   41    5000
   42    5000
   43    1408.2093
   44    5000
   45    5000
   46    1886.1204
   47    5000
   48    5000
   49    864.04656

BLOCK MASS
   6    173.2
   23    91.1876
   24    80.429995
   15    1.777
   25    123.79278
   35    853.21578
   36    853.37432
   37    859.872
   1000001    5030.7392
   2000001    5022.9069
   1000002    5030.2927
   2000002    5023.5099
   1000003    5030.744
   2000003    5022.9131
   1000004    5030.2966
   2000004    5023.5106
   1000005    833.01952
   2000005    1411.0461
   1000006    1364.3511
   2000006    1879.641
   1000011    1931.523
   2000011    503.45894
   1000012    1929.5081
   1000013    1931.513
   2000013    503.41845
   1000014    1929.4978
   1000015    642.2044
   2000015    1569.6666
   1000016    1567.0787
   1000021    3197.573
   1000022    410.4028
   1000023   -415.2261
   1000025    1176.242
   1000035    1834.2014
   1000024    412.94473
   1000037    1834.3748

BLOCK ALPHA
      -0.023033993

BLOCK HMIX Q=  1601.4026
   1   -409.1782
   2    44.382548
   3    243.92728
   4    728247.73

BLOCK STOPMIX
   1   1   -0.95875619
   1   2    0.28422978
   2   1   -0.28422978
   2   2   -0.95875619

BLOCK SBOTMIX
   1   1   -0.040676316
   1   2    0.99917238
   2   1   -0.99917238
   2   2   -0.040676316

BLOCK STAUMIX
   1   1   -0.01452692
   1   2    0.99989448
   2   1   -0.99989448
   2   2   -0.01452692

BLOCK NMIX
   1   1   -0.039512264
   1   2    0.038097996
   1   3    0.7086592
   1   4    0.70341273
   2   1   -0.020000865
   2   2    0.025592249
   2   3   -0.70535667
   2   4    0.70810802
   3   1   -0.99901312
   3   2   -0.0054162324
   3   3   -0.013875996
   3   4   -0.041843954
   4   1    0.0033973118
   4   2   -0.99893155
   4   3    0.0090316373
   4   4    0.045195618

BLOCK UMIX
   1   1   -0.012765178
   1   2   -0.99991852
   2   1    0.99991852
   2   2   -0.012765178

BLOCK VMIX
   1   1   -0.063829495
   1   2    0.99796082
   2   1    0.99796082
   2   2    0.063829495

BLOCK HIGGSBOUNDSINPUTHIGGSCOUPLINGSFERMIONS
       0, 1969.8106,3,36,15,15

BLOCK HIGGSBOUNDSINPUTHIGGSCOUPLINGSBOSONS
       0,4,36,21,21,23

BLOCK SPHENOLOWENERGY
   1    0.0003296227
   2    1.5879592e-06
   3    3.5221994e-05
   4    6.9198847e-15
   5    2.9554515e-10
   6    5.8134033e-08
   7    2.4048309e-13
   8    1.0271192e-08
   9    2.0472477e-06
   10    8.5294885e-05
   11    0.8810635
   12    0.54229044
   13    19.338357
   14    0
   15    0
   16    0.0021588251
   17    2.281691e-15
   18    2.4785203e-11
   19    8.2866101e-11
   20   -3.5374805e-15
   21   -1.5121366e-10
   22   -6.1096892e-08
   23    0
   24    0
   25    0
   26    0
   27    0
   28    0
   29    0
   30    0
   31    0
   39    8.4614336e-05
   40    0
   41    0
   42    0

BLOCK FWCOEF Q=  160
   305   4422   0   0   -0.18881911
   305   4422   0   2   -0.19249993
   305   4322   0   2   -0.00062255586
   305   6421   0   0   -0.095227835
   305   6421   0   2   -0.12609012
   305   6321   0   2   -0.00086134352
   3051111   4133   0   0    1.5947898
   3051111   4133   0   2    1.5960696
   3051111   4233   0   2    3.9711135e-05
   3051111   4137   0   0   -4.4174819
   3051111   4137   0   2   -4.4128186
   3051111   4237   0   2   -0.00030180405
   3051313   4133   0   0    1.5947898
   3051313   4133   0   2    1.5960675
   3051313   4233   0   2    3.9672835e-05
   3051313   4137   0   0   -4.4174819
   3051313   4137   0   2   -4.4128206
   3051313   4237   0   2   -0.00030177332
   3051212   4137   0   0    1.5053501
   3051212   4137   0   2    1.5043377
   3051212   4237   0   2    6.5734502e-05
   3051414   4137   0   0    1.5053501
   3051414   4137   0   2    1.5043377
   3051414   4237   0   2    6.5742303e-05
   3051616   4137   0   0    1.5053501
   3051616   4137   0   2    1.5043377
   3051616   4237   0   2    6.7940948e-05

BLOCK IMFWCOEF Q=  160
   305   4422   0   0    3.8586922e-07
   305   4422   0   2   -2.4375721e-05
   305   4322   0   2    3.4245984e-06
   305   6421   0   0    3.305225e-07
   305   6421   0   2    2.7935733e-06
   305   6321   0   2    1.3958431e-06
   3051111   4133   0   2   -6.7608114e-07
   3051111   4233   0   2    6.2379683e-06
   3051111   4137   0   2    6.3077334e-06
   3051111   4237   0   2   -4.8311232e-05
   3051313   4133   0   2   -6.760729e-07
   3051313   4233   0   2    6.2379246e-06
   3051313   4137   0   2    6.3077446e-06
   3051313   4237   0   2   -4.8311324e-05
   3051212   4137   0   2   -1.3148615e-06
   3051212   4237   0   2    1.0522177e-05
   3051414   4137   0   2   -1.3148616e-06
   3051414   4237   0   2    1.0522177e-05
   3051616   4137   0   2   -1.3178536e-06
   3051616   4237   0   2    1.0522179e-05

DECAY 23  2.4952


DECAY 24  2.085


DECAY 2000011  0.0005480846
    0.81112735   2    1000022    11
    0.18883932   2    1000023    11

DECAY 1000011  1.2296009
    0.79543931   2    1000025    11
    0.13295517   2   -1000037    12
    0.066335544   2    1000035    11
    0.0020520405   2   -1000024    12
    0.0018198841   2    1000022    11
    0.0013980358   2    1000023    11

DECAY 2000013  0.0021116284
    0.40594352   2    1000022    13
    0.36963768   2   -1000024    14
    0.2244188   2    1000023    13

DECAY 1000013  1.2556029
    0.77895519   2    1000025    13
    0.13017646   2   -1000037    14
    0.064949089   2    1000035    13
    0.011988383   2    1000022    13
    0.011457386   2    1000023    13
    0.002009533   2   -1000024    14
    0.00046359094   2    2000013    25

DECAY 1000015  1.8148209
    0.4990474   2   -1000024    16
    0.25676656   2    1000022    15
    0.24418604   2    1000023    15

DECAY 2000015  7.0452697
    0.39728189   2    1000022    15
    0.39374213   2    1000023    15
    0.054922265   2    1000025    15
    0.054473489   2    1000015    35
    0.054441207   2    1000015    36
    0.022768651   2    1000015    25
    0.02235654   2    1000015    23

DECAY 1000012  1.2716223
    0.73596789   2    1000025    12
    0.12305527   2    1000037    11
    0.062091546   2    1000035    12
    0.04955015   2    1000024    11
    0.021341008   2    1000022    12
    0.0079941387   2    1000023    12

DECAY 1000014  1.2970099
    0.72154914   2    1000025    14
    0.12062154   2    1000037    13
    0.068204574   2    1000024    13
    0.060863643   2    1000035    14
    0.020923148   2    1000022    14
    0.0078376121   2    1000023    14

DECAY 1000016  7.0408424
    0.79681758   2    1000024    15
    0.10236466   2    1000015    37
    0.052116329   2    1000025    16
    0.04460773   2    1000015    24
    0.0029791315   2    1000022    16
    0.0011145678   2    1000023    16

DECAY 2000001  142.74643
    0.98244619   2    1000021    1
    0.017514856   2    1000025    1

DECAY 1000001  191.63331
    0.73607022   2    1000021    1
    0.17370169   2   -1000037    2
    0.086789531   2    1000035    1
    0.003071981   2    1000025    1
    0.00023240427   2    1000022    1

DECAY 2000003  142.78678
    0.98217304   2    1000021    3
    0.017509956   2    1000025    3
    0.00013940875   2   -1000024    4
    0.00010028809   2    1000022    3

DECAY 1000003  191.65556
    0.73598736   2    1000021    3
    0.17368182   2   -1000037    4
    0.086779593   2    1000035    3
    0.0030716458   2    1000025    3
    0.0002844944   2    1000022    3
    0.00014862204   2    1000023    3

DECAY 1000005  9.4737346
    0.45157826   2   -1000024    6
    0.27858031   2    1000022    5
    0.26984143   2    1000023    5

DECAY 2000005  36.918228
    0.62800173   2   -1000024    6
    0.17557138   2    1000022    5
    0.17417839   2    1000023    5
    0.011357754   2    1000005    23
    0.010403477   2    1000005    25
    0.00048726241   2    1000025    5

DECAY 2000002  150.32743
    0.93331878   2    1000021    2
    0.066536171   2    1000025    2
    0.00011495775   2    1000022    2

DECAY 1000002  191.62493
    0.73585991   2    1000021    2
    0.17300498   2    1000037    1
    0.086570927   2    1000035    2
    0.0034697332   2    1000025    2
    0.00092913488   2    1000024    1
    0.0001100018   2    1000022    2

DECAY 2000004  150.33102
    0.93329657   2    1000021    4
    0.066534613   2    1000025    4
    0.00012084348   2    1000022    4

DECAY 1000004  191.64701
    0.73577693   2    1000021    4
    0.17298527   2    1000037    3
    0.086561074   2    1000035    4
    0.0034693489   2    1000025    4
    0.0010327685   2    1000024    3
    0.00011461442   2    1000022    4

DECAY 1000006  36.081748
    0.35117829   2    1000024    5
    0.31621762   2    1000023    6
    0.31058878   2    1000022    6
    0.017323406   2    1000005    24
    0.004553458   3    1000022    24    5
    0.00010736121   2    1000025    6

DECAY 2000006  132.85918
    0.2570158   2    1000024    5
    0.21784809   2    2000005    24
    0.13074576   2    1000006    25
    0.12735868   2    1000006    23
    0.12715942   2    1000023    6
    0.12681611   2    1000022    6
    0.010673165   2    1000025    6
    0.0023350542   2    1000005    24

DECAY 1000024  9.8063532e-11
    0.50628322   3    1000022   -1    2
    0.1687622   3    1000022   -11    12
    0.16733923   3    1000022   -13    14
    0.14617681   3    1000022   -3    4
    0.011438539   3    1000022   -15    16

DECAY 1000037  34.58248
    0.13557008   2    1000006   -5
    0.11247938   2    1000024    25
    0.11031622   2    1000023    24
    0.1094703   2    1000024    23
    0.1085787   2    1000022    24
    0.10011094   2   -2000005    6
    0.069829398   2    1000024    36
    0.069752454   2    1000024    35
    0.069750981   2    37    1000022
    0.065673027   2    37    1000023
    0.01697865   2    1000016   -15
    0.016739967   2   -2000015    16
    0.005188272   3    1000024    6   -6
    0.0042607803   3    1000023   -5    6
    0.0039503512   3    1000022   -5    6
    0.00098097492   2    1000025    24
    0.00029215562   2   -1000005    6

DECAY 1000022 -1


DECAY 1000023  2.861177e-08
    0.75794819   2    1000022    22
    0.063326432   3    1000022    12   -12
    0.04735342   3    1000022    1   -1
    0.047140371   3    1000022    3   -3
    0.036931817   3    1000022    2   -2
    0.013732834   3    1000022    4   -4
    0.010685116   3    1000022    11   -11
    0.010612491   3    1000022    13   -13
    0.0030309585   3    1000024    1   -2
    0.0030309585   3   -1000024   -1    2
    0.0010103535   3    1000024    11   -12
    0.0010103535   3   -1000024   -11    12
    0.00099978224   3    1000024    13   -14
    0.00099978224   3   -1000024   -13    14
    0.00088783018   3    1000022    15   -15
    0.00062373997   3    1000024    3   -4
    0.00062373997   3   -1000024   -3    4

DECAY 1000025  14.63214
    0.13448217   2    2000013   -13
    0.13448217   2   -2000013    13
    0.13447235   2    2000011   -11
    0.13447235   2   -2000011    11
    0.099302117   2    1000015   -15
    0.099302117   2   -1000015    15
    0.050104078   2    1000024   -24
    0.050104078   2   -1000024    24
    0.040249443   2    1000023    25
    0.040078038   2    1000023    23
    0.035911884   2    1000022    25
    0.016629585   2    1000005   -5
    0.016629585   2   -1000005    5
    0.010004605   2    1000022    23
    0.0011556997   3    1000024    5   -6
    0.0011556997   3   -1000024   -5    6
    0.0003630661   3    1000023    6   -6
    0.00034302057   3    1000022    5   -5
    0.00033018149   3    1000022    6   -6
    0.00029972135   3    1000023    5   -5

DECAY 1000035  36.368046
    0.10419386   2    1000024   -24
    0.10419386   2   -1000024    24
    0.082117282   2    1000023    25
    0.073420482   2    1000022    25
    0.072860286   2    1000023    23
    0.065611093   2    37   -1000024
    0.065611093   2   -37    1000024
    0.056737965   2    1000006   -6
    0.056737965   2   -1000006    6
    0.055427053   2    2000005   -5
    0.055427053   2   -2000005    5
    0.052520416   2    1000022    35
    0.047692051   2    1000023    35
    0.032016528   2    1000022    23
    0.015500334   2    1000023    36
    0.014461179   2    1000022    36
    0.0081071204   2    1000016   -16
    0.0081071204   2   -1000016    16
    0.0079070469   2    2000015   -15
    0.0079070469   2   -2000015    15
    0.0038840987   3    1000024    5   -6
    0.0038840987   3   -1000024   -5    6
    0.0023420929   3    1000023    6   -6
    0.0022296794   3    1000022    6   -6
    0.00073544713   2    1000025    25
    0.00014655488   2    1000005   -5
    0.00014655488   2   -1000005    5

DECAY 1000021  258.05701
    0.15937478   2    1000005   -5
    0.15937478   2   -1000005    5
    0.13130176   2    1000006   -6
    0.13130176   2   -1000006    6
    0.1188859   2    2000005   -5
    0.1188859   2   -2000005    5
    0.071147295   2    2000006   -6
    0.071147295   2   -2000006    6
    0.019134089   2    1000006   -4
    0.019134089   2   -1000006    4

DECAY 25  0.0039089256
    0.60756911   2   -5    5
    0.19941271   2   -24    24
    0.069207093   2    21    21
    0.068321372   2   -15    15
    0.027898092   2   -4    4
    0.02356358   2    23    23
    0.0022333133   2    22    22
    0.0013326773   2    22    23
    0.00023697448   2   -13    13
    0.0002243075   2   -3    3
    6.201834e-07   2   -1    1
    1.4376912e-07   2   -2    2
    5.327464e-09   2   -11    11

DECAY 35  37.06957
    0.91432723   2   -5    5
    0.084436017   2   -15    15
    0.00058754055   2   -6    6
    0.00029441217   2   -13    13
    0.00023260562   2   -3    3
    7.3315856e-05   2    21    21
    2.0023258e-05   2   -1000024    1000024
    1.0491135e-05   2    1000022    1000022
    6.220388e-06   2    25    25
    5.8372539e-06   2    1000022    1000023
    2.2646493e-06   2    1000023    1000023
    2.0502313e-06   2   -24    24
    1.2985587e-06   2    23    23
    6.4304598e-07   2   -1    1
    2.4379236e-08   2    22    22
    1.1621512e-08   2    22    23
    8.9660629e-09   2   -4    4
    6.6148845e-09   2   -11    11
    4.6239782e-14   2   -2    2

DECAY 36  35.556871
    0.91390848   2   -5    5
    0.084400366   2   -15    15
    0.0006718469   2   -6    6
    0.00029428194   2   -13    13
    0.00024693919   2   -1000024    1000024
    0.00023249131   2   -3    3
    0.00010539052   2    1000022    1000022
    9.9683553e-05   2    21    21
    3.6851956e-05   2    1000023    1000023
    2.0766099e-06   2    23    25
    7.4454834e-07   2    1000022    1000023
    6.4273021e-07   2   -1    1
    1.114813e-07   2    22    22
    7.9928609e-08   2    22    23
    8.5302725e-09   2   -4    4
    6.6119601e-09   2   -11    11
    4.4017565e-14   2   -2    2
    2.9662412e-36   2    25    25

DECAY 37  33.994478
    0.89719127   2   -5    6
    0.100769   2   -15    16
    0.0014126033   2   -5    4
    0.00035625719   2   -13    14
    0.0002313714   2   -3    4
    1.3922357e-05   2    1000023    1000024
    1.0665032e-05   2   -3    2
    1.0087486e-05   2   -5    2
    2.2436139e-06   2    24    25
    1.076111e-06   2   -3    6
    7.8267142e-07   2    1000022    1000024
    6.4184323e-07   2   -1    2
    3.5028332e-08   2   -1    6
    2.9845136e-08   2   -1    4
    8.332893e-09   2   -11    12
    5.1947263e-10   2    24    35
    4.6052841e-10   2    24    36

DECAY 6  2.43
    1   2    5    24

DECAY 15 -1
