BLOCK SPINFO
   1   SPheno
   2   v4.0.5be

BLOCK SPHENOINFO
   1   2
   2   2

BLOCK MODSEL
   1   0

BLOCK MINPAR
   3    36.590164
   4   -1

BLOCK EXTPAR
   0    1366.8611
   1   -52.07285
   2    680.17152
   3    3000
   11   -3227.8102
   12   -942.79806
   13    340.01038
   23   -127.73401
   25    35.749951
   26    786.45371
   31    1313.9572
   32    1313.9572
   33    1559.3977
   34    1466.7212
   35    1466.7212
   36    964.4949
   41    5000
   42    5000
   43    1383.696
   44    5000
   45    5000
   46    1509.5547
   47    5000
   48    5000
   49    1450.3288

BLOCK SMINPUTS
   1    127.90897
   2    1.1663787e-05
   3    0.1184
   4    91.1876
   5    4.18
   6    173.2
   7    1.777
   8    0
   11    0.00051099893
   12    0
   13    0.10565837
   14    0
   21    0.005
   22    0.0025
   23    0.095
   24    1.27

BLOCK GAUGE Q=  1366.8611
   1    0.35536298
   2    0.66519887
   3    1.219778

BLOCK YU Q=  1366.8611
   1   1    8.3876516e-06
   2   2    0.004260927
   3   3    1.0132957

BLOCK YD Q=  1366.8611
   1   1    0.00060255414
   2   2    0.011448529
   3   3    0.5975449

BLOCK YE Q=  1366.8611
   1   1    0.0001051501
   2   2    0.021741707
   3   3    0.36565974

BLOCK AU Q=  1366.8611
   1   1    0
   2   2    0
   3   3   -3227.8101

BLOCK AD Q=  1366.8611
   1   1    0
   2   2    0
   3   3   -942.79805

BLOCK AE Q=  1366.8611
   1   1    0
   2   2    0
   3   3    340.01038

BLOCK MSOFT Q=  1366.8611
   1   -52.07285
   2    680.17152
   3    3000
   21    623157.48
   22    13016.168
   31    1313.9572
   32    1313.9572
   33    1559.3977
   34    1466.7212
   35    1466.7212
   36    964.4949
   41    5000
   42    5000
   43    1383.696
   44    5000
   45    5000
   46    1509.5547
   47    5000
   48    5000
   49    1450.3288

BLOCK MASS
   6    173.2
   23    91.1876
   24    80.429995
   15    1.777
   25    124.25143
   35    786.40753
   36    786.45371
   37    792.02113
   1000001    5024.4085
   2000001    5014.2076
   1000002    5023.9663
   2000002    5015.5368
   1000003    5024.4121
   2000003    5014.2137
   1000004    5023.9699
   2000004    5015.5377
   1000005    1339.8607
   2000005    1441.1587
   1000006    1210.4217
   2000006    1543.5193
   1000011    1318.838
   2000011    1469.0043
   1000012    1316.0885
   1000013    1318.8295
   2000013    1468.9889
   1000014    1316.0803
   1000015    961.58662
   2000015    1561.7866
   1000016    1559.2994
   1000021    3180.1084
   1000022   -45.388867
   1000023    130.6162
   1000025   -147.00097
   1000035    723.84061
   1000024    130.20965
   1000037    724.05191

BLOCK ALPHA
      -0.028295909

BLOCK HMIX Q=  1366.8611
   1   -127.73401
   2    35.749951
   3    244.0754
   4    618509.45

BLOCK STOPMIX
   1   1    0.79959195
   1   2    0.60054368
   2   1   -0.60054368
   2   2    0.79959195

BLOCK SBOTMIX
   1   1   -0.99955929
   1   2    0.029685452
   2   1   -0.029685452
   2   2   -0.99955929

BLOCK STAUMIX
   1   1   -0.0057299164
   1   2    0.99998358
   2   1   -0.99998358
   2   2   -0.0057299164

BLOCK NMIX
   1   1    0.928227
   1   2    0.014893811
   1   3   -0.34861095
   1   4    0.12900856
   2   1   -0.16346981
   2   2   -0.093312003
   2   3   -0.69576529
   2   4   -0.69316748
   3   1    0.33410956
   3   2   -0.067527348
   3   3    0.62775494
   3   4   -0.6998104
   4   1    0.0065614033
   4   2   -0.99323265
   4   3    0.017458629
   4   4    0.11463439

BLOCK UMIX
   1   1   -0.024835444
   1   2   -0.99969155
   2   1    0.99969155
   2   2   -0.024835444

BLOCK VMIX
   1   1   -0.16266999
   1   2    0.98668053
   2   1    0.98668053
   2   2    0.16266999

BLOCK HIGGSBOUNDSINPUTHIGGSCOUPLINGSFERMIONS
       0, 1278.059,3,36,15,15

BLOCK HIGGSBOUNDSINPUTHIGGSCOUPLINGSBOSONS
       0,4,36,21,21,23

BLOCK SPHENOLOWENERGY
   1    0.00043144258
   2    1.5926219e-06
   3    3.5262007e-05
   4    9.9771626e-16
   5    4.2581877e-11
   6    6.6126824e-09
   7    3.3712625e-14
   8    1.4389037e-09
   9    2.2840404e-07
   10    8.433133e-05
   11    0.87111035
   12    0.54290852
   13    19.340257
   14    0
   15    0
   16    0.0021626849
   17    2.2817264e-15
   18    2.4795528e-11
   19    8.2896535e-11
   20   -8.2190546e-15
   21   -3.5138848e-10
   22   -8.5182616e-08
   23    0
   24    0
   25    0
   26    0
   27    0
   28    0
   29    0
   30    0
   31    0
   39    8.1576174e-05
   40    0
   41    0
   42    0

BLOCK FWCOEF Q=  160
   305   4422   0   0   -0.18881911
   305   4422   0   2   -0.3045261
   305   4322   0   2   -0.0013147712
   305   6421   0   0   -0.095227835
   305   6421   0   2   -0.18048904
   305   6321   0   2   -0.0011793616
   3051111   4133   0   0    1.5888699
   3051111   4133   0   2    1.5905796
   3051111   4233   0   2    7.531204e-06
   3051111   4137   0   0   -4.411562
   3051111   4137   0   2   -4.4107463
   3051111   4237   0   2   -5.4999191e-05
   3051313   4133   0   0    1.5888699
   3051313   4133   0   2    1.5905769
   3051313   4233   0   2    7.5100865e-06
   3051313   4137   0   0   -4.411562
   3051313   4137   0   2   -4.410749
   3051313   4237   0   2   -5.4980845e-05
   3051212   4137   0   0    1.5053501
   3051212   4137   0   2    1.5051899
   3051212   4237   0   2    1.1984768e-05
   3051414   4137   0   0    1.5053501
   3051414   4137   0   2    1.5051899
   3051414   4237   0   2    1.198923e-05
   3051616   4137   0   0    1.5053501
   3051616   4137   0   2    1.5051897
   3051616   4237   0   2    1.3247139e-05

BLOCK IMFWCOEF Q=  160
   305   4422   0   0    3.8579739e-07
   305   4422   0   2   -3.0448418e-05
   305   4322   0   2   -7.3871533e-06
   305   6421   0   0    3.3046098e-07
   305   6421   0   2    2.6411885e-06
   305   6321   0   2   -2.657781e-06
   3051111   4133   0   2   -5.5199601e-07
   3051111   4233   0   2    4.155408e-06
   3051111   4137   0   2    5.9641817e-06
   3051111   4237   0   2   -3.248401e-05
   3051313   4133   0   2   -5.520428e-07
   3051313   4233   0   2    4.1553966e-06
   3051313   4137   0   2    5.9641607e-06
   3051313   4237   0   2   -3.2484048e-05
   3051212   4137   0   2   -1.0012337e-06
   3051212   4237   0   2    7.0843032e-06
   3051414   4137   0   2   -1.0012333e-06
   3051414   4237   0   2    7.0843032e-06
   3051616   4137   0   2   -1.0048452e-06
   3051616   4237   0   2    7.0843086e-06

DECAY 23  2.4952


DECAY 24  2.085


DECAY 1000011  10.21217
    0.55447801   2   -1000037    12
    0.2718768   2    1000035    11
    0.14794527   2    1000022    11
    0.018186433   2    1000023    11
    0.0068258729   2    1000025    11
    0.00068760991   2   -1000024    12

DECAY 2000011  7.3494127
    0.86368172   2    1000022    11
    0.10987811   2    1000025    11
    0.026415338   2    1000023    11

DECAY 1000013  10.224169
    0.55381753   2   -1000037    14
    0.27155307   2    1000035    13
    0.14791769   2    1000022    13
    0.018740817   2    1000023    13
    0.0072840982   2    1000025    13
    0.00068679831   2   -1000024    14

DECAY 2000013  7.3765282
    0.86072507   2    1000022    13
    0.11019604   2    1000025    13
    0.027210114   2    1000023    13
    0.0018423181   2   -1000024    14

DECAY 1000015  9.7117663
    0.45928273   2    1000022    15
    0.25377151   2   -1000024    16
    0.15130785   2    1000025    15
    0.13561867   2    1000023    15

DECAY 2000015  18.83742
    0.44961058   2   -1000037    16
    0.22044943   2    1000035    15
    0.12125802   2    1000022    15
    0.1170137   2    1000023    15
    0.090292332   2    1000025    15
    0.00052107594   2    1000015    23
    0.0005163784   2    1000015    25
    0.00033848913   2   -1000024    16

DECAY 1000012  10.264235
    0.53434487   2    1000037    11
    0.27278498   2    1000035    12
    0.13025356   2    1000022    12
    0.03331059   2    1000025    12
    0.029286191   2    1000024    11

DECAY 1000014  10.276213
    0.53371315   2    1000037    13
    0.27246236   2    1000035    14
    0.13010093   2    1000022    14
    0.033271546   2    1000025    14
    0.030432224   2    1000024    13

DECAY 1000016  18.878899
    0.43557406   2    1000037    15
    0.23551305   2    1000024    15
    0.22228751   2    1000035    16
    0.083961736   2    1000022    16
    0.021613599   2    1000025    16
    0.001037214   2    1000015    24

DECAY 2000001  144.2229
    0.9805965   2    1000021    1
    0.016721225   2    1000022    1
    0.0021631211   2    1000025    1
    0.00051810446   2    1000023    1

DECAY 1000001  206.81734
    0.68895025   2    1000021    1
    0.20494411   2   -1000037    2
    0.10139285   2    1000035    1
    0.0024183726   2    1000022    1
    0.001722433   2    1000025    1
    0.0004402502   2    1000023    1
    0.00013173208   2   -1000024    2

DECAY 2000003  144.24958
    0.98041954   2    1000021    3
    0.016729136   2    1000022    3
    0.0021982809   2    1000025    3
    0.00056170528   2    1000023    3

DECAY 1000003  206.83263
    0.68890116   2    1000021    3
    0.20492935   2   -1000037    4
    0.10138545   2    1000035    3
    0.0024258713   2    1000022    3
    0.0017471559   2    1000025    3
    0.00047075574   2    1000023    3
    0.00014025191   2   -1000024    4

DECAY 1000005  47.251675
    0.53378698   2   -1000024    6
    0.13532823   2   -1000037    6
    0.096216698   2    1000023    5
    0.078008465   2    1000025    5
    0.066065854   2    1000006   -24
    0.061767077   2    1000035    5
    0.028826696   2    1000022    5

DECAY 2000005  20.701577
    0.47299492   2   -1000024    6
    0.23637112   2    1000023    5
    0.1985397   2    1000025    5
    0.08952517   2    1000022    5
    0.0011649997   2    1000006   -24
    0.00093616142   2   -1000037    6
    0.00045901993   2    1000035    5

DECAY 2000002  152.75927
    0.92670561   2    1000021    2
    0.063163922   2    1000022    2
    0.0081707736   2    1000025    2
    0.0019566703   2    1000023    2

DECAY 1000002  206.81506
    0.68873511   2    1000021    2
    0.19962726   2    1000037    1
    0.10090834   2    1000035    2
    0.0056512226   2    1000024    1
    0.0034708932   2    1000022    2
    0.0016002833   2    1000023    2

DECAY 2000004  152.76291
    0.92668369   2    1000021    4
    0.063162614   2    1000022    4
    0.0081763691   2    1000025    4
    0.0019623169   2    1000023    4

DECAY 1000004  206.83028
    0.68868595   2    1000021    4
    0.19961276   2    1000037    3
    0.10090111   2    1000035    4
    0.005713852   2    1000024    3
    0.0034707855   2    1000022    4
    0.0016043738   2    1000023    4

DECAY 1000006  43.58178
    0.37816247   2    1000024    5
    0.29117322   2    1000025    6
    0.24967858   2    1000023    6
    0.041329776   2    1000037    5
    0.023769058   2    1000035    6
    0.01502333   2    1000022    6
    0.00035640772   3    1000022    24    5
    0.00034923386   2    1000022    4
    0.00015791993   2    1000023    4

DECAY 2000006  86.152266
    0.23466562   2    1000024    5
    0.1726005   2    1000023    6
    0.16977633   2    1000006    23
    0.15018983   2    1000025    6
    0.12137172   2    1000005    24
    0.059990209   2    1000037    5
    0.038209906   2    1000022    6
    0.031536858   2    1000035    6
    0.021654436   2    1000006    25

DECAY 1000024  0.036903474
    0.99999928   2    1000022    24

DECAY 1000037  6.1329129
    0.25519047   2    1000023    24
    0.25004556   2    1000024    23
    0.237215   2    1000025    24
    0.23194391   2    1000024    25
    0.018366752   2    1000022    24
    0.002610539   3    1000023   -5    6
    0.0024968862   3    1000025   -5    6
    0.0012782334   3    1000024    6   -6
    0.00048363626   3    1000024    5   -5
    0.00025163525   3    1000022   -5    6

DECAY 1000022 -1


DECAY 1000023  0.0023418685
    0.20380845   3    1000022    12   -12
    0.15240846   3    1000022    1   -1
    0.15240729   3    1000022    3   -3
    0.15057335   3    1000022    5   -5
    0.11886885   3    1000022    2   -2
    0.11865743   3    1000022    4   -4
    0.034328449   3    1000022    11   -11
    0.034328239   3    1000022    13   -13
    0.034266509   3    1000022    15   -15
    0.00035297973   2    1000022    22

DECAY 1000025  0.010412431
    0.99875719   2    1000022    23
    0.00014032686   3    1000024    1   -2
    0.00014032686   3   -1000024   -1    2
    0.00013648366   3    1000024    3   -4
    0.00013648366   3   -1000024   -3    4

DECAY 1000035  6.7304016
    0.23541895   2    1000024   -24
    0.23541895   2   -1000024    24
    0.14673212   2    1000025    25
    0.14324258   2    1000025    23
    0.13576919   2    1000023    25
    0.080001962   2    1000023    23
    0.0093945225   2    1000022    25
    0.008298212   2    1000022    23
    0.0021698623   3    1000024    5   -6
    0.0021698623   3   -1000024   -5    6
    0.00041197425   3    1000023    6   -6
    0.00036434183   3    1000025    6   -6
    0.00021548303   3    1000023    5   -5
    0.0001513808   3    1000025    5   -5

DECAY 1000021  251.96593
    0.12638618   2    1000005   -5
    0.12638618   2   -1000005    5
    0.12372862   2    2000006   -6
    0.12372862   2   -2000006    6
    0.11979557   2    1000006   -6
    0.11979557   2   -1000006    6
    0.11792464   2    2000005   -5
    0.11792464   2   -2000005    5
    0.012052654   2    1000006   -4
    0.012052654   2   -1000006    4

DECAY 25  0.0054605269
    0.43264973   2   -5    5
    0.27710571   2    1000022    1000022
    0.14994281   2   -24    24
    0.049862491   2    21    21
    0.04962841   2   -15    15
    0.019976227   2   -4    4
    0.017882226   2    23    23
    0.0016246389   2    22    22
    0.00099267091   2    22    23
    0.00017209844   2   -13    13
    0.00016242709   2   -3    3
    4.4909317e-07   2   -1    1
    1.0294366e-07   2   -2    2
    3.868971e-09   2   -11    11

DECAY 35  17.195031
    0.81230706   2   -5    5
    0.12358101   2   -15    15
    0.021746608   2    1000022    1000023
    0.010145414   2    1000022    1000022
    0.0092151774   2   -1000024    1000024
    0.0071382834   2    1000022    1000025
    0.0069887758   2    1000025    1000025
    0.0052294206   2    1000023    1000025
    0.001394024   2    1000022    1000035
    0.0013622766   2   -6    6
    0.00042566509   2   -13    13
    0.00031225499   2   -3    3
    6.902026e-05   2    21    21
    5.0095463e-05   2    25    25
    2.043027e-05   2    1000023    1000023
    8.395952e-06   2   -24    24
    4.9527475e-06   2    23    23
    8.633144e-07   2   -1    1
    1.494231e-07   2    22    22
    8.7754505e-08   2    22    23
    2.2985825e-08   2   -4    4
    9.5641275e-09   2   -11    11
    1.1854139e-13   2   -2    2

DECAY 36  16.906324
    0.81095873   2   -5    5
    0.12337371   2   -15    15
    0.019088872   2    1000022    1000023
    0.010911035   2    1000022    1000022
    0.010274231   2   -1000024    1000024
    0.0092828793   2    1000025    1000025
    0.0088833074   2    1000022    1000025
    0.004159587   2    1000023    1000025
    0.0016203726   2   -6    6
    0.00057841964   2    1000022    1000035
    0.00042494233   2   -13    13
    0.00031172081   2   -3    3
    0.00010246652   2    21    21
    2.0775439e-05   2    1000023    1000023
    7.9300672e-06   2    23    25
    8.6183755e-07   2   -1    1
    1.0160158e-07   2    22    23
    3.2928158e-08   2    22    22
    2.1774495e-08   2   -4    4
    9.5478876e-09   2   -11    11
    1.1238185e-13   2   -2    2
    3.7508952e-37   2    25    25

DECAY 37  15.183798
    0.79384751   2   -5    6
    0.13966134   2   -15    16
    0.055642422   2    1000022    1000024
    0.0047764383   2    1000023    1000024
    0.0025022391   2    1000022    1000037
    0.0014551879   2    1000024    1000025
    0.0012657508   2   -5    4
    0.00049375731   2   -13    14
    0.000318722   2   -3    4
    1.4673446e-05   2   -3    2
    9.1221416e-06   2    24    25
    9.03881e-06   2   -5    2
    2.753673e-06   2   -3    6
    8.8443904e-07   2   -1    2
    1.0688322e-07   2   -1    6
    4.1671682e-08   2   -1    4
    1.1549035e-08   2   -11    12
    4.9612787e-10   2    24    35
    4.7607256e-10   2    24    36

DECAY 6  2.43
    1   2    5    24

DECAY 15 -1
