BLOCK SPINFO
   1   SPheno
   2   v4.0.5be

BLOCK SPHENOINFO
   1   2
   2   2

BLOCK MODSEL
   1   0

BLOCK MINPAR
   3    21.828672
   4   -1

BLOCK EXTPAR
   0    1516.0474
   1    273.56946
   2    669.86754
   3    3000
   11   -2445.1387
   12   -536.80583
   13    59.496684
   23   -1084.0484
   25    21.105402
   26    2917.2351
   31    1099.7178
   32    1099.7178
   33    553.8071
   34    631.93699
   35    631.93699
   36    704.0628
   41    5000
   42    5000
   43    1936.0454
   44    5000
   45    5000
   46    1197.0413
   47    5000
   48    5000
   49    1188.3346

BLOCK SMINPUTS
   1    127.90897
   2    1.1663787e-05
   3    0.1184
   4    91.1876
   5    4.18
   6    173.2
   7    1.777
   8    0
   11    0.00051099893
   12    0
   13    0.10565837
   14    0
   21    0.005
   22    0.0025
   23    0.095
   24    1.27

BLOCK GAUGE Q=  1516.0474
   1    0.35536298
   2    0.66519887
   3    1.219778

BLOCK YU Q=  1516.0474
   1   1    8.3937782e-06
   2   2    0.0042640393
   3   3    1.0140358

BLOCK YD Q=  1516.0474
   1   1    0.00035598473
   2   2    0.0067637099
   3   3    0.3530253

BLOCK YE Q=  1516.0474
   1   1    6.2121939e-05
   2   2    0.012844847
   3   3    0.21602919

BLOCK AU Q=  1516.0474
   1   1    0
   2   2    0
   3   3   -2445.1386

BLOCK AD Q=  1516.0474
   1   1    0
   2   2    0
   3   3   -536.80579

BLOCK AE Q=  1516.0474
   1   1    0
   2   2    0
   3   3    59.496685

BLOCK MSOFT Q=  1516.0474
   1    273.56946
   2    669.86754
   3    3000
   21    7329415.1
   22   -1143936.2
   31    1099.7178
   32    1099.7178
   33    553.8071
   34    631.93699
   35    631.93699
   36    704.0628
   41    5000
   42    5000
   43    1936.0454
   44    5000
   45    5000
   46    1197.0413
   47    5000
   48    5000
   49    1188.3346

BLOCK MASS
   6    173.2
   23    91.1876
   24    80.429995
   15    1.777
   25    121.06747
   35    2916.6659
   36    2917.2351
   37    2918.1733
   1000001    5028.1823
   2000001    5017.9002
   1000002    5027.7329
   2000002    5019.4662
   1000003    5028.1847
   2000003    5017.9012
   1000004    5027.7344
   2000004    5019.467
   1000005    1187.8294
   2000005    1949.2697
   1000006    1169.3134
   2000006    1965.5979
   1000011    1105.9393
   2000011    633.93538
   1000012    1102.717
   1000013    1105.9422
   2000013    633.93271
   1000014    1102.7166
   1000015    559.13859
   2000015    712.11111
   1000016    561.22375
   1000021    3189.6143
   1000022    272.38366
   1000023    701.4749
   1000025   -1093.2598
   1000035    1098.3145
   1000024    701.64552
   1000037    1099.7241

BLOCK ALPHA
      -0.045915689

BLOCK HMIX Q=  1516.0474
   1   -1084.0484
   2    21.105402
   3    244.02172
   4    8510260.4

BLOCK STOPMIX
   1   1    0.14102314
   1   2    0.9900063
   2   1   -0.9900063
   2   2    0.14102314

BLOCK SBOTMIX
   1   1   -0.023662551
   1   2    0.99972
   2   1   -0.99972
   2   2   -0.023662551

BLOCK STAUMIX
   1   1   -0.97714077
   1   2    0.21259331
   2   1   -0.21259331
   2   2   -0.97714077

BLOCK NMIX
   1   1   -0.99900653
   1   2    0.0013488343
   1   3    0.04358575
   1   4    0.0091882996
   2   1    0.0070658641
   2   2    0.99065625
   2   3    0.11638019
   2   4    0.070752521
   3   1   -0.024237255
   3   2    0.032550982
   3   3   -0.70566093
   3   4    0.70738649
   4   1   -0.036723165
   4   2    0.13243417
   4   3   -0.69756619
   4   4   -0.7032169

BLOCK UMIX
   1   1   -0.9862262
   1   2   -0.16540221
   2   1    0.16540221
   2   2   -0.9862262

BLOCK VMIX
   1   1   -0.99487674
   1   2    0.10109538
   2   1    0.10109538
   2   2    0.99487674

BLOCK HIGGSBOUNDSINPUTHIGGSCOUPLINGSFERMIONS
       0, 445.438,3,36,15,15

BLOCK HIGGSBOUNDSINPUTHIGGSCOUPLINGSBOSONS
       0,4,36,21,21,23

BLOCK SPHENOLOWENERGY
   1    0.00034693389
   2    1.5872658e-06
   3    3.5236417e-05
   4    2.5142912e-15
   5    1.0740783e-10
   6    2.2496394e-08
   7    8.4828051e-14
   8    3.6238571e-09
   9    7.6904319e-07
   10    9.6421334e-05
   11    0.99599547
   12    0.54321612
   13    19.407624
   14    0
   15    0
   16    0.0021635241
   17    2.2817217e-15
   18    2.4782441e-11
   19    8.2865016e-11
   20   -6.5204952e-15
   21   -2.7878777e-10
   22   -1.604613e-07
   23    0
   24    0
   25    0
   26    0
   27    0
   28    0
   29    0
   30    0
   31    0
   39    6.2182503e-05
   40    0
   41    0
   42    0

BLOCK FWCOEF Q=  160
   305   4422   0   0   -0.18881911
   305   4422   0   2   -0.21911564
   305   4322   0   2   -0.0003107871
   305   6421   0   0   -0.095227835
   305   6421   0   2   -0.11566654
   305   6321   0   2   -0.00023955723
   3051111   4133   0   0    1.5922497
   3051111   4133   0   2    1.593159
   3051111   4233   0   2    5.2515913e-05
   3051111   4137   0   0   -4.4149418
   3051111   4137   0   2   -4.4116503
   3051111   4237   0   2   -0.00040804026
   3051313   4133   0   0    1.5922497
   3051313   4133   0   2    1.5931577
   3051313   4233   0   2    5.251581e-05
   3051313   4137   0   0   -4.4149418
   3051313   4137   0   2   -4.4116516
   3051313   4237   0   2   -0.00040804042
   3051212   4137   0   0    1.5053501
   3051212   4137   0   2    1.5046466
   3051212   4237   0   2    8.8908104e-05
   3051414   4137   0   0    1.5053501
   3051414   4137   0   2    1.5046466
   3051414   4237   0   2    8.890811e-05
   3051616   4137   0   0    1.5053501
   3051616   4137   0   2    1.5046466
   3051616   4237   0   2    8.8909109e-05

BLOCK IMFWCOEF Q=  160
   305   4422   0   0    3.8577131e-07
   305   4422   0   2   -1.1161924e-05
   305   4322   0   2   -3.2815293e-06
   305   6421   0   0    3.3043864e-07
   305   6421   0   2    3.7664522e-06
   305   6321   0   2   -1.3002201e-06
   3051111   4133   0   2   -3.2500199e-07
   3051111   4233   0   2    1.1511916e-06
   3051111   4137   0   2    2.6752229e-06
   3051111   4237   0   2   -8.9494486e-06
   3051313   4133   0   2   -3.2502167e-07
   3051313   4233   0   2    1.1511903e-06
   3051313   4137   0   2    2.6752207e-06
   3051313   4237   0   2   -8.9494519e-06
   3051212   4137   0   2   -3.4384905e-07
   3051212   4237   0   2    1.9500567e-06
   3051414   4137   0   2   -3.4384892e-07
   3051414   4237   0   2    1.9500567e-06
   3051616   4137   0   2   -3.446507e-07
   3051616   4237   0   2    1.9500431e-06

DECAY 23  2.4952


DECAY 24  2.085


DECAY 2000011  2.113534
    1   2    1000022    11

DECAY 1000011  6.3173929
    0.53511358   2   -1000024    12
    0.27220537   2    1000023    11
    0.19267375   2    1000022    11

DECAY 2000013  2.1135204
    1   2    1000022    13

DECAY 1000013  6.3185991
    0.53501656   2   -1000024    14
    0.27215913   2    1000023    13
    0.19263851   2    1000022    13
    0.00017830299   2    2000013    25

DECAY 1000015  0.46651823
    1   2    1000022    15

DECAY 2000015  3.1735473
    0.78973377   2    1000022    15
    0.1145786   2    1000016   -24
    0.048387172   2    1000015    23
    0.047236073   2    1000015    25

DECAY 1000012  6.3035388
    0.53986628   2    1000024    11
    0.26578776   2    1000023    12
    0.1943439   2    1000022    12

DECAY 1000014  6.303571
    0.53986906   2    1000024    13
    0.26578605   2    1000023    14
    0.19434282   2    1000022    14

DECAY 1000016  0.41324117
    1   2    1000022    16

DECAY 2000001  143.45595
    0.98058974   2    1000021    1
    0.019374877   2    1000022    1

DECAY 1000001  206.18322
    0.68745492   2    1000021    1
    0.20075381   2   -1000024    2
    0.10102554   2    1000023    1
    0.0053247339   2   -1000037    2
    0.0034285035   2    1000022    1
    0.0018800434   2    1000035    1
    0.0001324534   2    1000025    1

DECAY 2000003  143.46433
    0.98053324   2    1000021    3
    0.01937381   2    1000022    3

DECAY 1000003  206.1893
    0.68743587   2    1000021    3
    0.20074803   2   -1000024    4
    0.10102291   2    1000023    3
    0.0053325475   2   -1000037    4
    0.003428446   2    1000022    3
    0.0018897501   2    1000035    3
    0.00014245195   2    1000025    3

DECAY 1000005  0.74235633
    0.81217699   2    1000022    5
    0.065194204   2   -1000024    6
    0.045981514   2    1000025    5
    0.040023825   2    1000035    5
    0.036623463   2    1000023    5

DECAY 2000005  66.502745
    0.38844904   2    1000006   -24
    0.27924968   2   -1000037    6
    0.18554205   2   -1000024    6
    0.096023247   2    1000023    5
    0.017824581   2    1000035    5
    0.01714181   2    1000025    5
    0.0065989549   2    1000005    25
    0.0051486437   2    1000005    23
    0.0040219913   2    1000022    5

DECAY 2000002  151.97589
    0.92668908   2    1000021    2
    0.073177897   2    1000022    2

DECAY 1000002  206.17596
    0.68725223   2    1000021    2
    0.20427851   2    1000024    1
    0.10153388   2    1000023    2
    0.0033258975   2    1000022    2
    0.0019891082   2    1000037    1
    0.0015426983   2    1000035    2

DECAY 2000004  151.9792
    0.926669   2    1000021    4
    0.073176302   2    1000022    4

DECAY 1000004  206.18187
    0.687233   2    1000021    4
    0.20427332   2    1000024    3
    0.10153102   2    1000023    4
    0.0033258036   2    1000022    4
    0.0020085596   2    1000037    3
    0.00154663   2    1000035    4

DECAY 1000006  3.01919
    0.72648208   2    1000022    6
    0.12003482   2    1000024    5
    0.10120612   2    1000037    5
    0.051229354   2    1000023    6
    0.00097815971   2    1000023    4

DECAY 2000006  72.701954
    0.24168806   2    1000006    25
    0.18293351   2    1000006    23
    0.16954259   2    1000024    5
    0.13752003   2    1000035    6
    0.13114486   2    1000025    6
    0.082059567   2    1000023    6
    0.041098016   2    1000037    5
    0.0098086138   2    1000005    24
    0.0042047604   2    1000022    6

DECAY 1000024  0.79473456
    0.49972459   2    1000016   -15
    0.49213112   2   -1000015    16
    0.008007473   2    1000022    24

DECAY 1000037  6.1801946
    0.27176519   2    1000023    24
    0.26328344   2    1000024    25
    0.26164083   2    1000024    23
    0.11466241   2    1000022    24
    0.048444235   2    1000016   -15
    0.032008156   2   -2000015    16
    0.0037671026   2   -1000015    16
    0.0024798798   3    1000022   -5    6
    0.001586998   3    1000023   -5    6
    0.00017687574   3    1000024    6   -6
    0.00012663883   2   -2000013    14

DECAY 1000022 -1


DECAY 1000023  0.79247105
    0.25061905   2    1000015   -15
    0.25061905   2   -1000015    15
    0.24575122   2    1000016   -16
    0.24575122   2   -1000016    16
    0.0052818008   2    1000022    25
    0.001866199   2    1000022    23

DECAY 1000025  8.749405
    0.22084946   2    1000023    25
    0.20480687   2    1000024   -24
    0.20480687   2   -1000024    24
    0.19405443   2    1000023    23
    0.061604276   2    1000022    25
    0.05885957   2    1000022    23
    0.014870345   2    1000015   -15
    0.014870345   2   -1000015    15
    0.010223335   2    2000015   -15
    0.010223335   2   -2000015    15
    0.0015431212   3    1000024    5   -6
    0.0015431212   3   -1000024   -5    6
    0.00060249407   3    1000022    6   -6
    0.00030877047   2    1000016   -16
    0.00030877047   2   -1000016    16
    0.00012627543   2    2000013   -13
    0.00012627543   2   -2000013    13

DECAY 1000035  6.0547635
    0.26479898   2    1000024   -24
    0.26479898   2   -1000024    24
    0.255   2    1000023    25
    0.072964713   2    1000022    25
    0.035675171   2    1000022    23
    0.020756511   2    1000015   -15
    0.020756511   2   -1000015    15
    0.016808491   2    2000015   -15
    0.016808491   2   -2000015    15
    0.016359224   2    1000023    23
    0.0050390947   2    1000016   -16
    0.0050390947   2   -1000016    16
    0.0015757535   3    1000024    5   -6
    0.0015757535   3   -1000024   -5    6
    0.00074022083   3    1000022    6   -6
    0.00033780164   2    2000013   -13
    0.00033780164   2   -2000013    13
    0.00027330415   2    2000011   -11
    0.00027330415   2   -2000011    11

DECAY 1000021  213.75929
    0.16385527   2    1000005   -5
    0.16385527   2   -1000005    5
    0.15951868   2    1000006   -6
    0.15951868   2   -1000006    6
    0.088562005   2    2000006   -6
    0.088562005   2   -2000006    6
    0.086667685   2    2000005   -5
    0.086667685   2   -2000005    5
    0.00093487971   3    1000025    6   -6
    0.00087842574   3    1000035    6   -6
    0.00023551411   2    1000006   -4
    0.00023551411   2   -1000006    4
    0.00012836615   3    1000037    5   -6
    0.00012836615   3   -1000037   -5    6

DECAY 25  0.0034287972
    0.63089052   2   -5    5
    0.16801939   2   -24    24
    0.074853881   2    21    21
    0.072278008   2   -15    15
    0.031191433   2   -4    4
    0.018789299   2    23    23
    0.0023194514   2    22    22
    0.0011690717   2    22    23
    0.00025066613   2   -13    13
    0.00023745499   2   -3    3
    6.5654057e-07   2   -1    1
    1.6074962e-07   2   -2    2
    5.6353064e-09   2   -11    11

DECAY 35  45.995967
    0.38472976   2   -5    5
    0.15723045   2   -1000024    1000037
    0.15723045   2   -1000037    1000024
    0.087224485   2    1000023    1000025
    0.064594179   2    1000023    1000035
    0.054465854   2   -15    15
    0.026171661   2    1000022    1000025
    0.025499649   2    1000022    1000035
    0.012140737   2   -1000006    1000006
    0.0098918176   2   -1000024    1000024
    0.0065151143   2   -6    6
    0.0048785114   2    1000023    1000023
    0.0030254949   2    1000025    1000035
    0.0023837526   2    1000022    1000023
    0.0017298088   2    1000035    1000035
    0.0015067523   2   -1000037    1000037
    0.00025332386   2    1000022    1000022
    0.00019441221   2   -13    13
    0.00014939009   2    1000025    1000025
    0.00013209262   2   -3    3
    3.1180743e-05   2    25    25
    7.4977814e-06   2   -1000005    1000005
    5.2946743e-06   2    21    21
    2.0485899e-06   2    23    23
    6.4203074e-07   2   -24    24
    4.1184351e-07   2   -1000015    1000015
    3.6521998e-07   2   -1    1
    2.7597091e-07   2   -2000013    2000013
    2.7568375e-07   2   -2000011    2000011
    2.449496e-07   2   -1000011    1000011
    2.4322794e-07   2   -1000013    1000013
    2.2613704e-07   2   -2000015    1000015
    2.2613704e-07   2   -1000015    2000015
    8.9348485e-08   2    22    22
    8.5823302e-08   2    22    23
    6.0229434e-08   2   -4    4
    2.461273e-08   2   -2000013    1000013
    2.461273e-08   2   -1000013    2000013
    5.5245438e-09   2   -2000015    2000015
    4.3664297e-09   2   -11    11
    5.7571606e-13   2   -2000011    1000011
    5.7571606e-13   2   -1000011    2000011
    3.1046301e-13   2   -2    2

DECAY 36  44.711786
    0.38139546   2   -5    5
    0.16060764   2   -1000024    1000037
    0.16060764   2   -1000037    1000024
    0.084673969   2    1000023    1000035
    0.070627698   2    1000023    1000025
    0.05399449   2   -15    15
    0.027506261   2    1000022    1000025
    0.025661106   2    1000022    1000035
    0.011554928   2   -1000024    1000024
    0.0067195728   2   -6    6
    0.0056931444   2    1000023    1000023
    0.0033682305   2    1000035    1000035
    0.0025751856   2   -1000037    1000037
    0.0024815879   2    1000022    1000023
    0.0015156717   2    1000025    1000035
    0.00041569135   2    1000025    1000025
    0.00025999114   2    1000022    1000022
    0.00019273151   2   -13    13
    0.00013094976   2   -3    3
    1.3478336e-05   2    21    21
    3.3620413e-06   2    23    25
    3.6206088e-07   2   -1    1
    3.1819797e-07   2   -2000015    1000015
    3.1819797e-07   2   -1000015    2000015
    9.147545e-08   2    22    23
    6.1254146e-08   2   -4    4
    2.5280356e-08   2   -2000013    1000013
    2.5280356e-08   2   -1000013    2000013
    6.9526424e-09   2    22    22
    4.328675e-09   2   -11    11
    5.9130999e-13   2   -2000011    1000011
    5.9130999e-13   2   -1000011    2000011
    3.1575709e-13   2   -2    2
    6.8085911e-38   2    25    25

DECAY 37  44.353475
    0.37463764   2   -5    6
    0.17107167   2    1000023    1000037
    0.16575138   2    1000024    1000035
    0.16524192   2    1000024    1000025
    0.062695046   2   -15    16
    0.051571975   2    1000022    1000037
    0.0049374037   2    1000022    1000024
    0.0024441393   2    1000025    1000037
    0.00054761711   2   -5    4
    0.00038296579   2   -1000005    1000006
    0.00034405515   2    1000035    1000037
    0.00022164938   2   -13    14
    0.00012620428   2   -3    4
    7.9521147e-06   2   -3    6
    5.9060095e-06   2   -3    2
    3.9105507e-06   2   -5    2
    3.3947196e-06   2    24    25
    1.5781509e-06   2   -1000015    1000016
    1.1234358e-06   2   -2000013    1000014
    1.123032e-06   2   -2000011    1000012
    3.5616112e-07   2   -1    6
    3.5009231e-07   2   -1    2
    3.0745574e-07   2   -2000015    1000016
    2.7159635e-07   2    1000023    1000024
    4.9407043e-08   2   -1000013    1000014
    1.960102e-08   2   -1    4
    5.1844021e-09   2   -11    12
    1.1556293e-12   2   -1000011    1000012
    2.3884314e-13   2    24    35

DECAY 6  2.43
    1   2    5    24

DECAY 15 -1
