BLOCK SPINFO
   1   SPheno
   2   v4.0.5be

BLOCK SPHENOINFO
   1   2
   2   2

BLOCK MODSEL
   1   0

BLOCK MINPAR
   3    33.946334
   4   -1

BLOCK EXTPAR
   0    1124.8233
   1   -527.31054
   2    1543.4665
   3    3000
   11   -2949.6676
   12    1436.5281
   13   -398.99904
   23   -977.49668
   25    33.191663
   26    1759.0714
   31    895.53104
   32    895.53104
   33    1626.8783
   34    1286.6467
   35    1286.6467
   36    1541.649
   41    5000
   42    5000
   43    994.03892
   44    5000
   45    5000
   46    1560.5198
   47    5000
   48    5000
   49    1649.1267

BLOCK SMINPUTS
   1    127.90897
   2    1.1663787e-05
   3    0.1184
   4    91.1876
   5    4.18
   6    173.2
   7    1.777
   8    0
   11    0.00051099893
   12    0
   13    0.10565837
   14    0
   21    0.005
   22    0.0025
   23    0.095
   24    1.27

BLOCK GAUGE Q=  1124.8233
   1    0.35536298
   2    0.66519887
   3    1.219778

BLOCK YU Q=  1124.8233
   1   1    8.3881765e-06
   2   2    0.0042611937
   3   3    1.0133591

BLOCK YD Q=  1124.8233
   1   1    0.00055947003
   2   2    0.010629931
   3   3    0.55481896

BLOCK YE Q=  1124.8233
   1   1    9.7631611e-05
   2   2    0.020187121
   3   3    0.33951416

BLOCK AU Q=  1124.8233
   1   1    0
   2   2    0
   3   3   -2949.6676

BLOCK AD Q=  1124.8233
   1   1    0
   2   2    0
   3   3    1436.5281

BLOCK AE Q=  1124.8233
   1   1    0
   2   2    0
   3   3   -398.99904

BLOCK MSOFT Q=  1124.8233
   1   -527.31054
   2    1543.4665
   3    3000
   21    2147934.6
   22   -950399.72
   31    895.53104
   32    895.53104
   33    1626.8783
   34    1286.6467
   35    1286.6467
   36    1541.649
   41    5000
   42    5000
   43    994.03892
   44    5000
   45    5000
   46    1560.5198
   47    5000
   48    5000
   49    1649.1267

BLOCK MASS
   6    173.2
   23    91.1876
   24    80.429995
   15    1.777
   25    122.55295
   35    1758.7704
   36    1759.0714
   37    1761.4335
   1000001    5010.3129
   2000001    5003.0968
   1000002    5009.8739
   2000002    5004.5104
   1000003    5010.3202
   2000003    5003.1016
   1000004    5009.8784
   2000004    5004.5116
   1000005    897.64623
   2000005    1620.4626
   1000006    840.59393
   2000006    1505.159
   1000011    908.46727
   2000011    1288.9543
   1000012    904.67383
   1000013    908.45792
   2000013    1288.9496
   1000014    904.67129
   1000015    1538.4359
   2000015    1637.8349
   1000016    1632.6125
   1000021    3164.117
   1000022   -527.53461
   1000023    976.87752
   1000025   -986.32261
   1000035    1581.0633
   1000024    978.67812
   1000037    1581.2619

BLOCK ALPHA
      -0.029643518

BLOCK HMIX Q=  1124.8233
   1   -977.49668
   2    33.191663
   3    244.27363
   4    3094332.2

BLOCK STOPMIX
   1   1    0.96313557
   1   2    0.2690165
   2   1   -0.2690165
   2   2    0.96313557

BLOCK SBOTMIX
   1   1   -0.9988877
   1   2    0.047152492
   2   1   -0.047152492
   2   2   -0.9988877

BLOCK STAUMIX
   1   1   -0.17635723
   1   2    0.98432623
   2   1   -0.98432623
   2   2   -0.17635723

BLOCK NMIX
   1   1    0.99735547
   1   2    0.0013840161
   1   3   -0.063548851
   1   4    0.035237801
   2   1   -0.020039522
   2   2   -0.091773275
   2   3   -0.70583215
   2   4   -0.70212325
   3   1    0.06984129
   3   2   -0.022734251
   3   3    0.70382572
   3   4   -0.70656542
   4   1   -0.0016390029
   4   2    0.99551941
   4   3   -0.048906756
   4   4   -0.080910682

BLOCK UMIX
   1   1   -0.070233313
   1   2   -0.99753059
   2   1    0.99753059
   2   2   -0.070233313

BLOCK VMIX
   1   1   -0.115873
   1   2    0.99326404
   2   1    0.99326404
   2   2    0.115873

BLOCK HIGGSBOUNDSINPUTHIGGSCOUPLINGSFERMIONS
       0, 1101.6865,3,36,15,15

BLOCK HIGGSBOUNDSINPUTHIGGSCOUPLINGSBOSONS
       0,4,36,21,21,23

BLOCK SPHENOLOWENERGY
   1    0.00038912107
   2    1.5902627e-06
   3    3.5294461e-05
   4    1.9294016e-15
   5    8.241305e-11
   6    1.6734408e-08
   7    6.4984021e-14
   8    2.7758248e-09
   9    5.7144071e-07
   10    9.3448805e-05
   11    0.96529038
   12    0.54363533
   13    19.405476
   14    0
   15    0
   16    0.0021691148
   17    2.2817807e-15
   18    2.4815476e-11
   19    8.2945261e-11
   20   -3.8731333e-15
   21   -1.6558148e-10
   22   -4.5691063e-08
   23    0
   24    0
   25    0
   26    0
   27    0
   28    0
   29    0
   30    0
   31    0
   39    7.7518752e-05
   40    0
   41    0
   42    0

BLOCK FWCOEF Q=  160
   305   4422   0   0   -0.18881911
   305   4422   0   2   -0.2642039
   305   4322   0   2   -0.00059972569
   305   6421   0   0   -0.095227835
   305   6421   0   2   -0.14530914
   305   6321   0   2   -0.00047444178
   3051111   4133   0   0    1.5818301
   3051111   4133   0   2    1.5835794
   3051111   4233   0   2    0.00011722127
   3051111   4137   0   0   -4.4045222
   3051111   4137   0   2   -4.4069633
   3051111   4237   0   2   -0.00092583616
   3051313   4133   0   0    1.5818301
   3051313   4133   0   2    1.5835763
   3051313   4233   0   2    0.00011721984
   3051313   4137   0   0   -4.4045222
   3051313   4137   0   2   -4.4069663
   3051313   4237   0   2   -0.00092583665
   3051212   4137   0   0    1.5053501
   3051212   4137   0   2    1.5058898
   3051212   4237   0   2    0.00020223536
   3051414   4137   0   0    1.5053501
   3051414   4137   0   2    1.5058898
   3051414   4237   0   2    0.00020223558
   3051616   4137   0   0    1.5053501
   3051616   4137   0   2    1.5058901
   3051616   4237   0   2    0.00020229683

BLOCK IMFWCOEF Q=  160
   305   4422   0   0    3.8566131e-07
   305   4422   0   2   -2.1157784e-05
   305   4322   0   2   -5.7180876e-06
   305   6421   0   0    3.3034442e-07
   305   6421   0   2    2.5527488e-06
   305   6321   0   2   -2.2261762e-06
   3051111   4133   0   2    2.3140419e-08
   3051111   4233   0   2    3.1939183e-06
   3051111   4137   0   2    8.782714e-07
   3051111   4237   0   2   -2.5250736e-05
   3051313   4133   0   2    2.3104579e-08
   3051313   4233   0   2    3.1939109e-06
   3051313   4137   0   2    8.7823617e-07
   3051313   4237   0   2   -2.5250762e-05
   3051212   4137   0   2   -9.3784557e-08
   3051212   4237   0   2    5.5156942e-06
   3051414   4137   0   2   -9.3784882e-08
   3051414   4237   0   2    5.5156942e-06
   3051616   4137   0   2   -8.8495508e-08
   3051616   4237   0   2    5.5156978e-06

DECAY 23  2.4952


DECAY 24  2.085


DECAY 1000011  0.50127535
    1   2    1000022    11

DECAY 2000011  4.4707344
    0.99868083   2    1000022    11
    0.0012137703   2    1000025    11
    0.00010538682   2    1000023    11

DECAY 1000013  0.50127168
    1   2    1000022    13

DECAY 2000013  4.4758594
    0.99753768   2    1000022    13
    0.0014107078   2    1000025    13
    0.00041665284   2   -1000024    14
    0.00031908709   2    1000013    25
    0.00031587004   2    1000023    13

DECAY 1000015  8.4258623
    0.70059289   2    1000022    15
    0.15022299   2   -1000024    16
    0.078671634   2    1000023    15
    0.070512481   2    1000025    15

DECAY 2000015  3.4256749
    0.51652445   2    1000022    15
    0.22986034   2    1000025    15
    0.22311206   2    1000023    15
    0.018943876   2   -1000037    16
    0.0094672143   2    1000035    15
    0.0013496619   2    1000015    23
    0.00074239933   2   -1000024    16

DECAY 1000012  0.48980707
    1   2    1000022    12

DECAY 1000014  0.48980286
    1   2    1000022    14

DECAY 1000016  3.3673808
    0.48338828   2    1000022    16
    0.47802141   2    1000024    15
    0.016113839   2    1000037    15
    0.0081841324   2    1000035    16
    0.0057799723   2    1000023    16
    0.0054098165   2    1000015    24
    0.0031025454   2    1000025    16

DECAY 2000001  144.91298
    0.98115635   2    1000021    1
    0.018749192   2    1000022    1

DECAY 1000001  197.3004
    0.72445006   2    1000021    1
    0.18033887   2   -1000037    2
    0.089863872   2    1000035    1
    0.0033943826   2    1000022    1
    0.0010201562   2   -1000024    2
    0.0008048233   2    1000023    1
    0.0001278287   2    1000025    1

DECAY 2000003  144.93422
    0.98101603   2    1000021    3
    0.018746771   2    1000022    3
    0.00012234925   2    1000025    3

DECAY 1000003  197.31333
    0.72440645   2    1000021    3
    0.18032755   2   -1000037    4
    0.089858273   2    1000035    3
    0.0033943906   2    1000022    3
    0.0010284419   2   -1000024    4
    0.00083102156   2    1000023    3
    0.00015387365   2    1000025    3

DECAY 1000005  0.069275936
    1   2    1000022    5

DECAY 2000005  13.22604
    0.29347571   2   -1000024    6
    0.17320937   2    1000006   -24
    0.15001653   2    1000023    5
    0.14831163   2    1000025    5
    0.10102178   2    1000005    25
    0.078783307   2    1000005    23
    0.055134765   2    1000022    5

DECAY 2000002  153.25534
    0.92870883   2    1000021    2
    0.070935303   2    1000022    2
    0.00032861017   2    1000025    2

DECAY 1000002  197.2948
    0.72423874   2    1000021    2
    0.17878199   2    1000037    1
    0.089749754   2    1000035    2
    0.0035016359   2    1000022    2
    0.0027767443   2    1000024    1
    0.00094018174   2    1000023    2

DECAY 2000004  153.25874
    0.92868862   2    1000021    4
    0.070933752   2    1000022    4
    0.00033403341   2    1000025    4

DECAY 1000004  197.30733
    0.72419481   2    1000021    4
    0.17877108   2    1000037    3
    0.089744228   2    1000035    4
    0.0035014266   2    1000022    4
    0.0028289844   2    1000024    3
    0.00094429293   2    1000023    4

DECAY 1000006  0.085781247
    0.87629178   2    1000022    6
    0.12272926   2    1000022    4
    0.00097896163   3    1000022    24    5

DECAY 2000006  118.5443
    0.36753829   2    1000005    24
    0.24006722   2    1000006    25
    0.20755544   2    1000006    23
    0.077454943   2    1000024    5
    0.043846096   2    1000023    6
    0.042756692   2    1000025    6
    0.020781322   2    1000022    6

DECAY 1000024  1.4119935
    0.55638169   2    1000006   -5
    0.43783616   2    1000022    24
    0.0034054615   3    1000022   -5    6
    0.00092593356   2    1000014   -13
    0.00086734675   2    1000012   -11
    0.00028804986   2   -1000013    14
    0.00028797599   2   -1000011    12

DECAY 1000037  41.088861
    0.21720797   2    1000006   -5
    0.20795392   2   -1000005    6
    0.075648119   2   -1000013    14
    0.075646585   2   -1000011    12
    0.075618883   2    1000014   -13
    0.075618058   2    1000012   -11
    0.069748716   2    1000025    24
    0.067770219   2    1000024    23
    0.065432657   2    1000023    24
    0.064452683   2    1000024    25
    0.0011993467   3    1000025   -5    6
    0.0010549688   2    1000022    24
    0.00098523656   3    1000023   -5    6
    0.00086057973   2    2000006   -5
    0.00067998423   3    1000024    6   -6

DECAY 1000022 -1


DECAY 1000023  1.2413045
    0.46364595   2    1000022    23
    0.35687912   2    1000022    25
    0.087437644   2    1000005   -5
    0.087437644   2   -1000005    5
    0.00076917091   2    1000006   -4
    0.00076917091   2   -1000006    4
    0.00072031459   3    1000022    6   -6
    0.00036106353   2    1000013   -13
    0.00036106353   2   -1000013    13
    0.00033225183   2    1000011   -11
    0.00033225183   2   -1000011    11
    0.00023070182   2    1000014   -14
    0.00023070182   2   -1000014    14
    0.00023068624   2    1000012   -12
    0.00023068624   2   -1000012    12

DECAY 1000025  0.82863064
    0.62048334   2    1000022    25
    0.15869651   2    1000005   -5
    0.15869651   2   -1000005    5
    0.059284152   2    1000022    23
    0.0016889368   3    1000022    6   -6
    0.00023791086   2    1000014   -14
    0.00023791086   2   -1000014    14
    0.00023789672   2    1000012   -12
    0.00023789672   2   -1000012    12

DECAY 1000035  44.127493
    0.10735408   2    1000005   -5
    0.10735408   2   -1000005    5
    0.092102165   2    1000006   -6
    0.092102165   2   -1000006    6
    0.065443648   2    1000024   -24
    0.065443648   2   -1000024    24
    0.064156862   2    1000025    25
    0.060159315   2    1000025    23
    0.056231232   2    1000023    25
    0.03541487   2    1000014   -14
    0.03541487   2   -1000014    14
    0.035414677   2    1000012   -12
    0.035414677   2   -1000012    12
    0.035003054   2    1000013   -13
    0.035003054   2   -1000013    13
    0.035002158   2    1000011   -11
    0.035002158   2   -1000011    11
    0.00369039   2    1000023    23
    0.0010547598   3    1000024    5   -6
    0.0010547598   3   -1000024   -5    6
    0.00077218285   2    1000022    25
    0.00076571263   2    1000022    23
    0.00026749301   3    1000025    6   -6
    0.00026209575   3    1000023    6   -6

DECAY 1000021  286.63452
    0.13817277   2    1000005   -5
    0.13817277   2   -1000005    5
    0.13247426   2    1000006   -6
    0.13247426   2   -1000006    6
    0.10470352   2    2000006   -6
    0.10470352   2   -2000006    6
    0.088882451   2    2000005   -5
    0.088882451   2   -2000005    5
    0.034116644   2    1000006   -4
    0.034116644   2   -1000006    4
    0.00077757247   3    1000024    5   -6
    0.00077757247   3   -1000024   -5    6
    0.00041921987   3    1000023    6   -6
    0.00041142202   3    1000025    6   -6
    0.00022478466   3    1000023    5   -5
    0.00020522399   3    1000025    5   -5
    0.00011264148   3    1000037    5   -6
    0.00011264148   3   -1000037   -5    6

DECAY 25  0.0036018251
    0.61330202   2   -5    5
    0.18903761   2   -24    24
    0.071671873   2    21    21
    0.07010608   2   -15    15
    0.029993893   2   -4    4
    0.021783851   2    23    23
    0.0023413278   2    22    22
    0.0012895304   2    22    23
    0.00024302492   2   -13    13
    0.00022999482   2   -3    3
    6.3591392e-07   2   -1    1
    1.5457338e-07   2   -2    2
    5.4635009e-09   2   -11    11

DECAY 35  31.3134
    0.83138268   2   -5    5
    0.11604928   2   -15    15
    0.028255835   2   -1000006    1000006
    0.016732443   2    1000022    1000023
    0.0039502024   2    1000022    1000025
    0.0026734878   2   -6    6
    0.00037504256   2   -13    13
    0.00030703604   2   -3    3
    0.00025444711   2    1000022    1000022
    8.508113e-06   2    25    25
    7.3224536e-06   2    21    21
    1.5784798e-06   2    23    23
    1.0064315e-06   2   -24    24
    8.4897688e-07   2   -1    1
    1.7081271e-07   2    22    23
    8.6922467e-08   2    22    22
    2.2048934e-08   2   -4    4
    8.4246329e-09   2   -11    11
    1.1368162e-13   2   -2    2

DECAY 36  29.405229
    0.85531249   2   -5    5
    0.11928495   2   -15    15
    0.016629842   2    1000022    1000025
    0.0046607665   2    1000022    1000023
    0.0029196821   2   -6    6
    0.00045056706   2    1000022    1000022
    0.00038550648   2   -13    13
    0.00031558417   2   -3    3
    3.7265059e-05   2    21    21
    2.2294505e-06   2    23    25
    8.7261245e-07   2   -1    1
    1.0986762e-07   2    22    23
    1.0950042e-07   2    22    22
    2.4179782e-08   2   -4    4
    8.6596951e-09   2   -11    11
    1.2469757e-13   2   -2    2
    7.0221456e-38   2    25    25

DECAY 37  27.215401
    0.82420181   2   -5    6
    0.14915297   2   -15    16
    0.024537702   2    1000022    1000024
    0.0012268986   2   -5    4
    0.00052730971   2   -13    14
    0.00032225219   2   -3    4
    1.4996497e-05   2   -3    2
    8.761328e-06   2   -5    2
    3.7701937e-06   2   -3    6
    2.4231173e-06   2    24    25
    8.9473539e-07   2   -1    2
    1.5145203e-07   2   -1    6
    4.2921695e-08   2   -1    4
    1.2333829e-08   2   -11    12
    6.6930974e-12   2    24    35
    3.6750269e-12   2    24    36

DECAY 6  2.43
    1   2    5    24

DECAY 15 -1
