BLOCK SPINFO
   1   SPheno
   2   v4.0.5be

BLOCK SPHENOINFO
   1   2
   2   2

BLOCK MODSEL
   1   0

BLOCK MINPAR
   3    26.586888
   4    1

BLOCK EXTPAR
   0    1730.2917
   1    653.02269
   2   -1092.1217
   3    3000
   11    5295.4805
   12    1298.6382
   13    1374.8075
   23    392.16785
   25    25.576635
   26    4352.8736
   31    1483.4288
   32    1483.4288
   33    1438.5238
   34    812.43878
   35    812.43878
   36    687.20489
   41    5000
   42    5000
   43    1727.6656
   44    5000
   45    5000
   46    1911.824
   47    5000
   48    5000
   49    952.17544

BLOCK SMINPUTS
   1    127.90897
   2    1.1663787e-05
   3    0.1184
   4    91.1876
   5    4.18
   6    173.2
   7    1.777
   8    0
   11    0.00051099893
   12    0
   13    0.10565837
   14    0
   21    0.005
   22    0.0025
   23    0.095
   24    1.27

BLOCK GAUGE Q=  1730.2917
   1    0.35536298
   2    0.66519887
   3    1.219778

BLOCK YU Q=  1730.2917
   1   1    8.3907781e-06
   2   2    0.0042625153
   3   3    1.0136734

BLOCK YD Q=  1730.2917
   1   1    0.00043124681
   2   2    0.0081936893
   3   3    0.4276617

BLOCK YE Q=  1730.2917
   1   1    7.5255721e-05
   2   2    0.015560496
   3   3    0.26170195

BLOCK AU Q=  1730.2917
   1   1    0
   2   2    0
   3   3    5295.4808

BLOCK AD Q=  1730.2917
   1   1    0
   2   2    0
   3   3    1298.6381

BLOCK AE Q=  1730.2917
   1   1    0
   2   2    0
   3   3    1374.8075

BLOCK MSOFT Q=  1730.2917
   1    653.02269
   2   -1092.1217
   3    3000
   21    18725964
   22   -38459.275
   31    1483.4288
   32    1483.4288
   33    1438.5238
   34    812.43878
   35    812.43878
   36    687.20489
   41    5000
   42    5000
   43    1727.6656
   44    5000
   45    5000
   46    1911.824
   47    5000
   48    5000
   49    952.17544

BLOCK MASS
   6    173.2
   23    91.1876
   24    80.429995
   15    1.777
   25    124.00342
   35    4351.7265
   36    4352.8736
   37    4352.8509
   1000001    5040.1889
   2000001    5029.9884
   1000002    5039.7575
   2000002    5032.242
   1000003    5040.1906
   2000003    5029.9906
   1000004    5039.759
   2000004    5032.2425
   1000005    1003.3098
   2000005    1713.5526
   1000006    1530.693
   2000006    1955.9176
   1000011    1494.0911
   2000011    812.71931
   1000012    1491.6734
   1000013    1494.0947
   2000013    812.73442
   1000014    1491.6766
   1000015    694.26677
   2000015    1450.9007
   1000016    1448.3402
   1000021    3211.0254
   1000022   -394.04812
   1000023    396.11977
   1000025    654.15562
   1000035   -1145.8689
   1000024    396.14912
   1000037    1145.9632

BLOCK ALPHA
      -0.037624269

BLOCK HMIX Q=  1730.2917
   1    392.16785
   2    25.576635
   3    243.80248
   4    18947509

BLOCK STOPMIX
   1   1   -0.78162525
   1   2    0.62374832
   2   1   -0.62374832
   2   2   -0.78162525

BLOCK SBOTMIX
   1   1    0.0088086798
   1   2    0.9999612
   2   1   -0.9999612
   2   2    0.0088086798

BLOCK STAUMIX
   1   1    0.0093202935
   1   2    0.99995656
   2   1   -0.99995656
   2   2    0.0093202935

BLOCK NMIX
   1   1    0.028433733
   1   2    0.073128257
   1   3   -0.70828671
   1   4   -0.70155094
   2   1    0.12559818
   2   2    0.03822459
   2   3    0.70215216
   2   4   -0.69981878
   3   1    0.99167183
   3   2   -0.0050321975
   3   3   -0.068574057
   3   4    0.10890019
   4   1    0.0018964511
   4   2   -0.99657705
   4   3   -0.024695748
   4   4   -0.078871463

BLOCK UMIX
   1   1   -0.035045156
   1   2    0.99938573
   2   1   -0.99938573
   2   2   -0.035045156

BLOCK VMIX
   1   1    0.1118299
   1   2    0.99372736
   2   1    0.99372736
   2   2   -0.1118299

BLOCK HIGGSBOUNDSINPUTHIGGSCOUPLINGSFERMIONS
       0, 654.16425,3,36,15,15

BLOCK HIGGSBOUNDSINPUTHIGGSCOUPLINGSBOSONS
       0,4,36,21,21,23

BLOCK SPHENOLOWENERGY
   1    0.00035431613
   2    1.5886592e-06
   3    3.527054e-05
   4    2.7519201e-15
   5    1.175591e-10
   6    2.4621483e-08
   7    9.2322402e-14
   8    3.9440169e-09
   9    8.3696678e-07
   10    9.6552782e-05
   11    0.99735327
   12    0.54291357
   13    19.397703
   14    0
   15    0
   16    0.002162003
   17    2.2817062e-15
   18    2.4804043e-11
   19    8.2917192e-11
   20   -3.408565e-15
   21   -1.4572503e-10
   22   -4.1161261e-08
   23    0
   24    0
   25    0
   26    0
   27    0
   28    0
   29    0
   30    0
   31    0
   39    6.2614341e-05
   40    0
   41    0
   42    0

BLOCK FWCOEF Q=  160
   305   4422   0   0   -0.18881911
   305   4422   0   2   -0.2278851
   305   4322   0   2   -0.00032462894
   305   6421   0   0   -0.095227835
   305   6421   0   2   -0.11885486
   305   6321   0   2   -0.00021302598
   3051111   4133   0   0    1.5970295
   3051111   4133   0   2    1.5982669
   3051111   4233   0   2    0.00014532283
   3051111   4137   0   0   -4.4197216
   3051111   4137   0   2   -4.4198101
   3051111   4237   0   2   -0.0011219053
   3051313   4133   0   0    1.5970295
   3051313   4133   0   2    1.5982657
   3051313   4233   0   2    0.00014532258
   3051313   4137   0   0   -4.4197216
   3051313   4137   0   2   -4.4198113
   3051313   4237   0   2   -0.0011219059
   3051212   4137   0   0    1.5053501
   3051212   4137   0   2    1.5053811
   3051212   4237   0   2    0.000244221
   3051414   4137   0   0    1.5053501
   3051414   4137   0   2    1.5053811
   3051414   4237   0   2    0.000244221
   3051616   4137   0   0    1.5053501
   3051616   4137   0   2    1.5053812
   3051616   4237   0   2    0.00024422188

BLOCK IMFWCOEF Q=  160
   305   4422   0   0    3.857692e-07
   305   4422   0   2   -1.0716817e-05
   305   4322   0   2   -4.6400541e-06
   305   6421   0   0    3.3043683e-07
   305   6421   0   2   -1.7646033e-05
   305   6321   0   2   -2.2218505e-06
   3051111   4133   0   2   -1.6767328e-07
   3051111   4233   0   2    2.7580315e-06
   3051111   4137   0   2    2.5954327e-06
   3051111   4237   0   2   -2.1294602e-05
   3051313   4133   0   2   -1.6770213e-07
   3051313   4233   0   2    2.7580274e-06
   3051313   4137   0   2    2.5954344e-06
   3051313   4237   0   2   -2.1294613e-05
   3051212   4137   0   2   -3.6277057e-07
   3051212   4237   0   2    4.6355032e-06
   3051414   4137   0   2   -3.6277041e-07
   3051414   4237   0   2    4.6355032e-06
   3051616   4137   0   2   -3.6260293e-07
   3051616   4237   0   2    4.6355029e-06

DECAY 23  2.4952


DECAY 24  2.085


DECAY 2000011  0.53735994
    0.92671686   2    1000025    11
    0.06968816   2    1000023    11
    0.0035948816   2    1000022    11

DECAY 1000011  4.6366687
    0.48024803   2   -1000037    12
    0.25516043   2    1000025    11
    0.23840298   2    1000035    11
    0.013598933   2    1000023    11
    0.0095775357   2    1000022    11
    0.0030120875   2   -1000024    12

DECAY 2000013  0.54198738
    0.91895377   2    1000025    13
    0.07116227   2    1000023    13
    0.0056854845   2    1000022    13
    0.0041984749   2   -1000024    14

DECAY 1000013  4.6431144
    0.47958903   2   -1000037    14
    0.25481199   2    1000025    13
    0.23807609   2    1000035    13
    0.014240868   2    1000023    13
    0.010237249   2    1000022    13
    0.0030079154   2   -1000024    14

DECAY 1000015  0.93141557
    0.46293036   2   -1000024    16
    0.25426254   2    1000023    15
    0.23627559   2    1000022    15
    0.046531508   2    1000025    15

DECAY 2000015  5.7036023
    0.31654191   2   -1000037    16
    0.19700826   2    1000025    15
    0.15719747   2    1000035    15
    0.15685139   2    1000023    15
    0.15621218   2    1000022    15
    0.0072230999   2    1000015    25
    0.0070766523   2    1000015    23
    0.0018890372   2   -1000024    16

DECAY 1000012  4.6663201
    0.46668758   2    1000037    11
    0.26252738   2    1000025    12
    0.23527282   2    1000035    12
    0.030411893   2    1000024    11
    0.0040869869   2    1000022    12
    0.0010133367   2    1000023    12

DECAY 1000014  4.6725776
    0.46606944   2    1000037    13
    0.26217691   2    1000025    14
    0.23496115   2    1000035    14
    0.031698994   2    1000024    13
    0.004081525   2    1000022    14
    0.0010119824   2    1000023    14

DECAY 1000016  5.7320035
    0.31835672   2    1000024    15
    0.30718525   2    1000037    15
    0.20155199   2    1000025    16
    0.15487011   2    1000035    16
    0.014041205   2    1000015    24
    0.0032011184   2    1000022    16
    0.00079361006   2    1000023    16

DECAY 2000001  142.08478
    0.98089141   2    1000021    1
    0.01878456   2    1000025    1
    0.0003079884   2    1000023    1

DECAY 1000001  200.9774
    0.6987367   2    1000021    1
    0.19828744   2   -1000037    2
    0.098655832   2    1000035    1
    0.0035195508   2    1000025    1
    0.00050520085   2    1000022    1
    0.00026780361   2   -1000024    2

DECAY 2000003  142.09824
    0.98080009   2    1000021    3
    0.018783005   2    1000025    3
    0.0003309155   2    1000023    3

DECAY 1000003  200.98602
    0.69870758   2    1000021    3
    0.19827912   2   -1000037    4
    0.098651659   2    1000035    3
    0.0035195534   2    1000025    3
    0.00052173034   2    1000022    3
    0.00027662891   2   -1000024    4

DECAY 1000005  5.1603101
    0.45958058   2   -1000024    6
    0.25432435   2    1000022    5
    0.24976851   2    1000023    5
    0.036326559   2    1000025    5

DECAY 2000005  55.714488
    0.54284812   2   -1000024    6
    0.22402635   2    1000006   -24
    0.085897555   2   -1000037    6
    0.050830202   2    1000022    5
    0.049427856   2    1000023    5
    0.041161192   2    1000035    5
    0.0037068006   2    1000025    5
    0.0014431661   2    1000005    25
    0.00065875813   2    1000005    23

DECAY 2000002  150.46921
    0.92779115   2    1000021    2
    0.070985368   2    1000025    2
    0.0011636002   2    1000023    2

DECAY 1000002  200.97479
    0.69852254   2    1000021    2
    0.19603056   2    1000037    1
    0.098513205   2    1000035    2
    0.0031400484   2    1000025    2
    0.0027268322   2    1000024    1
    0.00066659894   2    1000022    2
    0.0004002164   2    1000023    2

DECAY 2000004  150.47279
    0.92776901   2    1000021    4
    0.07098383   2    1000025    4
    0.0011694122   2    1000023    4

DECAY 1000004  200.98333
    0.69849334   2    1000021    4
    0.19602234   2    1000037    3
    0.098509071   2    1000035    4
    0.0031400167   2    1000025    4
    0.0027596694   2    1000024    3
    0.00067098208   2    1000022    4
    0.00040458745   2    1000023    4

DECAY 1000006  46.79031
    0.33069149   2    1000024    5
    0.30757004   2    1000022    6
    0.28945408   2    1000023    6
    0.036215709   2    1000025    6
    0.025006763   2    1000037    5
    0.0096117833   2    1000035    6
    0.00074474118   3    1000022    24    5
    0.00044215921   2    1000005    24
    0.00016456817   2    1000022    4

DECAY 2000006  120.39648
    0.27229441   2    1000006    23
    0.18421678   2    1000024    5
    0.17337452   2    2000005    24
    0.14455593   2    1000023    6
    0.13726094   2    1000022    6
    0.034982224   2    1000037    5
    0.021686262   2    1000006    25
    0.016482454   2    1000035    6
    0.014641733   2    1000025    6
    0.00050475142   2    1000005    24

DECAY 1000024  3.7391382e-11
    0.58765259   3    1000022   -1    2
    0.19589969   3    1000022   -11    12
    0.1923145   3    1000022   -13    14
    0.024133215   3    1000022   -3    4

DECAY 1000037  9.5028266
    0.25144235   2    1000022    24
    0.24767046   2    1000023    24
    0.24738722   2    1000024    23
    0.23815062   2    1000024    25
    0.0050455429   3    1000022   -5    6
    0.004429102   3    1000023   -5    6
    0.0039271289   3    1000024    6   -6
    0.0018655404   2    1000025    24

DECAY 1000022 -1


DECAY 1000023  1.7303669e-09
    0.94870434   2    1000022    22
    0.015122424   3    1000022    12   -12
    0.011307631   3    1000022    1   -1
    0.011035237   3    1000022    3   -3
    0.0088194098   3    1000022    2   -2
    0.0025515855   3    1000022    11   -11
    0.0024555352   3    1000022    13   -13

DECAY 1000025  1.7441548
    0.25441096   2    1000022    23
    0.20226088   2    1000024   -24
    0.20226088   2   -1000024    24
    0.17142954   2    1000023    25
    0.15664275   2    1000022    25
    0.012624019   2    1000023    23
    0.00015206504   3    1000024    5   -6
    0.00015206504   3   -1000024   -5    6

DECAY 1000035  11.225817
    0.21612286   2    1000024   -24
    0.21612286   2   -1000024    24
    0.18450794   2    1000023    25
    0.16647758   2    1000023    23
    0.15604102   2    1000022    25
    0.045493999   2    1000022    23
    0.0045750715   3    1000024    5   -6
    0.0045750715   3   -1000024   -5    6
    0.0017332028   2    1000025    25
    0.0015449261   2    1000025    23
    0.0014274039   3    1000023    6   -6
    0.0012681006   3    1000022    6   -6

DECAY 1000021  233.68948
    0.16558214   2    1000005   -5
    0.16558214   2   -1000005    5
    0.13759599   2    1000006   -6
    0.13759599   2   -1000006    6
    0.10403377   2    2000005   -5
    0.10403377   2   -2000005    5
    0.066684705   2    2000006   -6
    0.066684705   2   -2000006    6
    0.026037724   2    1000006   -4
    0.026037724   2   -1000006    4

DECAY 25  0.0037380462
    0.58848557   2   -5    5
    0.21330198   2   -24    24
    0.072077274   2    21    21
    0.067470169   2   -15    15
    0.029114733   2   -4    4
    0.025311996   2    23    23
    0.002362016   2    22    22
    0.0014208908   2    22    23
    0.00023400064   2   -13    13
    0.00022060143   2   -3    3
    6.0994062e-07   2   -1    1
    1.5003797e-07   2   -2    2
    5.2606068e-09   2   -11    11

DECAY 35  84.961732
    0.28507191   2   -5    5
    0.1769732   2   -1000024    1000037
    0.1769732   2   -1000037    1000024
    0.091490149   2    1000022    1000035
    0.085771143   2    1000023    1000035
    0.069010652   2   -15    15
    0.030758082   2    1000022    1000025
    0.024936904   2    1000023    1000025
    0.013956159   2   -1000006    1000006
    0.0090448364   2   -2000006    2000006
    0.0083538583   2   -2000005    1000005
    0.0083538583   2   -1000005    2000005
    0.005564836   2   -1000024    1000024
    0.0031702614   2   -2000015    1000015
    0.0031702614   2   -1000015    2000015
    0.0018754163   2   -6    6
    0.0010995625   2    1000025    1000035
    0.00083049502   2    1000022    1000022
    0.0007412791   2    1000022    1000023
    0.0006130851   2   -2000006    1000006
    0.0006130851   2   -1000006    2000006
    0.00047426863   2   -1000037    1000037
    0.0003824874   2    1000025    1000025
    0.00023890301   2   -13    13
    0.00023757678   2    1000035    1000035
    0.00013819843   2   -3    3
    0.00010913479   2    1000023    1000023
    3.1247359e-05   2    25    25
    4.5006653e-06   2    21    21
    3.7358882e-06   2   -1000005    1000005
    3.4019598e-06   2   -2000005    2000005
    1.4453522e-06   2   -2000015    2000015
    1.1916085e-06   2   -1000015    1000015
    3.8209123e-07   2   -1    1
    1.186171e-07   2    23    23
    7.5108065e-08   2   -2000011    2000011
    7.4876452e-08   2   -2000013    2000013
    6.4570143e-08   2    22    23
    6.1638563e-08   2   -1000011    1000011
    6.1349988e-08   2   -1000013    1000013
    4.2214462e-08   2    22    22
    2.790668e-08   2   -4    4
    2.2763769e-08   2   -24    24
    5.3649619e-09   2   -11    11
    1.2329072e-09   2   -2000013    1000013
    1.2329072e-09   2   -1000013    2000013
    1.4385048e-13   2   -2    2
    2.8837887e-14   2   -2000011    1000011
    2.8837887e-14   2   -1000011    2000011

DECAY 36  83.49845
    0.27481483   2   -5    5
    0.18022287   2   -1000024    1000037
    0.18022287   2   -1000037    1000024
    0.09204784   2    1000023    1000035
    0.088479406   2    1000022    1000035
    0.066527459   2   -15    15
    0.031177552   2    1000023    1000025
    0.02540027   2    1000022    1000025
    0.012911668   2   -2000006    1000006
    0.012911668   2   -1000006    2000006
    0.0085033117   2   -2000005    1000005
    0.0085033117   2   -1000005    2000005
    0.0055753995   2   -1000024    1000024
    0.0032265905   2   -2000015    1000015
    0.0032265905   2   -1000015    2000015
    0.0019982876   2   -6    6
    0.0010609082   2    1000025    1000035
    0.00077936504   2    1000022    1000023
    0.00075215797   2    1000022    1000022
    0.00054631855   2    1000025    1000025
    0.00040510009   2   -1000037    1000037
    0.00023030637   2   -13    13
    0.00020345738   2    1000035    1000035
    0.00013336253   2    1000023    1000023
    0.00013322124   2   -3    3
    5.1707826e-06   2    21    21
    3.6832823e-07   2   -1    1
    2.8035909e-07   2    23    25
    2.9900906e-08   2   -4    4
    2.2727042e-08   2    22    23
    5.1718991e-09   2   -11    11
    1.2552887e-09   2   -2000013    1000013
    1.2552887e-09   2   -1000013    2000013
    1.0037089e-09   2    22    22
    1.5413745e-13   2   -2    2
    2.9361333e-14   2   -2000011    1000011
    2.9361333e-14   2   -1000011    2000011
    2.6143346e-14   2    23    35
    4.1775911e-40   2    25    25

DECAY 37  83.948112
    0.28321315   2   -5    6
    0.18346818   2    1000022    1000037
    0.18045461   2    1000024    1000035
    0.17802552   2    1000023    1000037
    0.073298187   2   -15    16
    0.054579863   2    1000024    1000025
    0.0097432535   2   -1000005    1000006
    0.0088278022   2   -2000005    2000006
    0.0076592226   2   -1000005    2000006
    0.0066660304   2   -2000005    1000006
    0.0064199717   2   -1000015    1000016
    0.0040617608   2    1000023    1000024
    0.0021631378   2    1000025    1000037
    0.00059942127   2    1000022    1000024
    0.00041620064   2   -5    4
    0.00025913517   2   -13    14
    0.00012846453   2   -3    4
    6.0401298e-06   2   -3    2
    4.1598892e-06   2   -3    6
    2.9721012e-06   2   -5    2
    1.4679707e-06   2   -2000015    1000016
    3.5645646e-07   2   -1    2
    2.9885867e-07   2   -2000011    1000012
    2.9852958e-07   2   -2000013    1000014
    2.7893507e-07   2    24    25
    1.8200349e-07   2   -1    6
    1.8373036e-08   2   -1    4
    6.0611985e-09   2   -11    12
    2.4565998e-09   2   -1000013    1000014
    5.7740943e-10   2    1000035    1000037
    5.7459556e-14   2   -1000011    1000012
    2.9159448e-14   2    24    35

DECAY 6  2.43
    1   2    5    24

DECAY 15 -1
