BLOCK SPINFO
   1   SPheno
   2   v4.0.5be

BLOCK SPHENOINFO
   1   2
   2   2

BLOCK MODSEL
   1   0

BLOCK MINPAR
   3    50.833483
   4   -1

BLOCK EXTPAR
   0    4799.0479
   1    829.82484
   2    3441.8082
   3    3837.9466
   11   -2921.134
   12    4310.9421
   13    7049.4377
   23   -1084.7986
   25    50.941802
   26    3148.5385
   31    2393.1351
   32    2393.1351
   33    4788.1315
   34    3786.9289
   35    3786.9289
   36    2167.0641
   41    67.897449
   42    67.897449
   43    4888.1693
   44    2178.154
   45    2178.154
   46    4573.6706
   47    4270.2442
   48    4270.2442
   49    447.66033

BLOCK SMINPUTS
   1    127.90897
   2    1.1663787e-05
   3    0.1184
   4    91.1876
   5    4.18
   6    173.2
   7    1.777
   8    0
   11    0.00051099893
   12    0
   13    0.10565837
   14    0
   21    0.005
   22    0.0025
   23    0.095
   24    1.27

BLOCK GAUGE Q=  4799.0479
   1    0.35536298
   2    0.66519887
   3    1.219778

BLOCK YU Q=  4799.0479
   1   1    8.3859874e-06
   2   2    0.0042600816
   3   3    1.0130946

BLOCK YD Q=  4799.0479
   1   1    0.00085843766
   2   2    0.016310315
   3   3    0.85130116

BLOCK YE Q=  4799.0479
   1   1    0.00014980365
   2   2    0.030974643
   3   3    0.52094255

BLOCK AU Q=  4799.0479
   1   1    0
   2   2    0
   3   3   -2921.1347

BLOCK AD Q=  4799.0479
   1   1    0
   2   2    0
   3   3    4310.9441

BLOCK AE Q=  4799.0479
   1   1    0
   2   2    0
   3   3    7049.4376

BLOCK MSOFT Q=  4799.0479
   1    829.82484
   2    3441.8082
   3    3837.9466
   21    9473148.3
   22   -787043.77
   31    2393.1351
   32    2393.1351
   33    4788.1315
   34    3786.9289
   35    3786.9289
   36    2167.0641
   41    67.897449
   42    67.897449
   43    4888.1693
   44    2178.154
   45    2178.154
   46    4573.6706
   47    4270.2442
   48    4270.2442
   49    447.66033

BLOCK MASS
   6    173.2
   23    91.1876
   24    80.429995
   15    1.777
   25    121.33926
   35    3147.3799
   36    3148.5385
   37    3147.9921
   1000001    984.49006
   2000001    4422.5787
   1000002    981.29701
   2000002    2414.5213
   1000003    984.46099
   2000003    4422.5596
   1000004    981.26829
   2000004    2414.5209
   1000005    822.59735
   2000005    4960.0452
   1000006    4635.2649
   2000006    4968.6179
   1000011    2436.9579
   2000011    3795.3701
   1000012    2435.3003
   1000013    2436.8888
   2000013    3795.2679
   1000014    2435.2397
   1000015    2122.7531
   2000015    4780.2437
   1000016    4779.0953
   1000021    4077.5595
   1000022    812.5773
   1000023   -1088.1556
   1000025    1089.1222
   1000035    3436.2355
   1000024    1086.1201
   1000037    3436.3707

BLOCK ALPHA
      -0.019712021

BLOCK HMIX Q=  4799.0479
   1   -1084.7986
   2    50.941802
   3    242.77128
   4    9913294.9

BLOCK STOPMIX
   1   1    0.14416065
   1   2    0.9895543
   2   1   -0.9895543
   2   2    0.14416065

BLOCK SBOTMIX
   1   1   -0.0063133326
   1   2    0.99998007
   2   1   -0.99998007
   2   2   -0.0063133326

BLOCK STAUMIX
   1   1   -0.0058313074
   1   2    0.999983
   2   1   -0.999983
   2   2   -0.0058313074

BLOCK NMIX
   1   1    0.99335356
   1   2   -0.0020711455
   1   3   -0.092361248
   1   4   -0.068657283
   2   1   -0.016780735
   2   2    0.012618319
   2   3   -0.70656451
   2   4    0.7073371
   3   1   -0.1138725
   3   2   -0.023588003
   3   3   -0.70155166
   3   4   -0.70306609
   4   1   -0.00041705044
   4   2    0.99963998
   4   3   -0.0078266575
   4   4   -0.025660768

BLOCK UMIX
   1   1   -0.010959593
   1   2   -0.99993994
   2   1    0.99993994
   2   2   -0.010959593

BLOCK VMIX
   1   1   -0.036133264
   1   2    0.99934698
   2   1    0.99934698
   2   2    0.036133264

BLOCK HIGGSBOUNDSINPUTHIGGSCOUPLINGSFERMIONS
       0, 2595.0672,3,36,15,15

BLOCK HIGGSBOUNDSINPUTHIGGSCOUPLINGSBOSONS
       0,4,36,21,21,23

BLOCK SPHENOLOWENERGY
   1    0.00033230229
   2    1.5895446e-06
   3    3.5265043e-05
   4    1.8151942e-15
   5    7.7543643e-11
   6    1.6267366e-08
   7    6.3184022e-14
   8    2.6992442e-09
   9    5.7395907e-07
   10    9.5247424e-05
   11    0.98386942
   12    0.54185562
   13    19.345614
   14    0
   15    0
   16    0.0021569675
   17    2.2816565e-15
   18    2.4807363e-11
   19    8.2925484e-11
   20   -1.7781839e-15
   21   -7.6023435e-11
   22   -1.053401e-08
   23    0
   24    0
   25    0
   26    0
   27    0
   28    0
   29    0
   30    0
   31    0
   39    6.9104927e-05
   40    0
   41    0
   42    0

BLOCK FWCOEF Q=  160
   305   4422   0   0   -0.18881911
   305   4422   0   2   -0.20258142
   305   4322   0   2   -0.00042234769
   305   6421   0   0   -0.095227835
   305   6421   0   2   -0.10547918
   305   6321   0   2   -0.0003058028
   3051111   4133   0   0    1.6340133
   3051111   4133   0   2    1.6343049
   3051111   4233   0   2    0.00035794748
   3051111   4137   0   0   -4.4567054
   3051111   4137   0   2   -4.4563613
   3051111   4237   0   2   -0.0026206693
   3051313   4133   0   0    1.6340133
   3051313   4133   0   2    1.6343038
   3051313   4233   0   2    0.00035794632
   3051313   4137   0   0   -4.4567054
   3051313   4137   0   2   -4.4563624
   3051313   4237   0   2   -0.0026206704
   3051212   4137   0   0    1.5053501
   3051212   4137   0   2    1.5052765
   3051212   4237   0   2    0.00056575383
   3051414   4137   0   0    1.5053501
   3051414   4137   0   2    1.5052765
   3051414   4237   0   2    0.00056575398
   3051616   4137   0   0    1.5053501
   3051616   4137   0   2    1.5052767
   3051616   4237   0   2    0.00056579501

BLOCK IMFWCOEF Q=  160
   305   4422   0   0    3.8579617e-07
   305   4422   0   2   -1.5920992e-05
   305   4322   0   2   -5.3736107e-06
   305   6421   0   0    3.3045993e-07
   305   6421   0   2    1.1768697e-05
   305   6321   0   2   -2.6115942e-06
   3051111   4133   0   2    8.9803948e-07
   3051111   4233   0   2    7.5117808e-06
   3051111   4137   0   2   -5.6782259e-06
   3051111   4237   0   2   -5.5003197e-05
   3051313   4133   0   2    8.9802638e-07
   3051313   4233   0   2    7.5117722e-06
   3051313   4137   0   2   -5.6782338e-06
   3051313   4237   0   2   -5.5003229e-05
   3051212   4137   0   2    1.2380562e-06
   3051212   4237   0   2    1.1874176e-05
   3051414   4137   0   2    1.2380555e-06
   3051414   4237   0   2    1.1874176e-05
   3051616   4137   0   2    1.2420545e-06
   3051616   4237   0   2    1.1874179e-05

DECAY 23  2.4952


DECAY 24  2.085


DECAY 1000011  2.4184205
    0.97903398   2    1000022    11
    0.020243705   2    1000025    11
    0.00068422207   2   -1000024    12

DECAY 2000011  17.344877
    0.98773347   2    1000022    11
    0.012005604   2    1000025    11
    0.00026083959   2    1000023    11

DECAY 1000013  2.4481749
    0.96722121   2    1000022    13
    0.025985833   2    1000025    13
    0.0061170861   2    1000023    13
    0.00067586804   2   -1000024    14

DECAY 2000013  17.468151
    0.98076383   2    1000022    13
    0.013638989   2    1000025    13
    0.0034951709   2   -1000024    14
    0.002002873   2    1000023    13

DECAY 1000015  20.232528
    0.38268691   2    1000022    15
    0.30868839   2   -1000024    16
    0.1549036   2    1000025    15
    0.15372109   2    1000023    15

DECAY 2000015  44.952578
    0.25777425   2    1000023    15
    0.25714382   2    1000025    15
    0.21857838   2   -1000037    16
    0.12767902   2    1000022    15
    0.10919944   2    1000035    15
    0.015076361   2    1000015    25
    0.014514315   2    1000015    23

DECAY 1000012  2.4331929
    0.98739198   2    1000022    12
    0.0073825427   2    1000024    11
    0.0039109911   2    1000025    12
    0.0013144867   2    1000023    12

DECAY 1000014  2.4629287
    0.97543444   2    1000022    14
    0.019403429   2    1000024    13
    0.0038635802   2    1000025    14
    0.0012985519   2    1000023    14

DECAY 1000016  44.929497
    0.51753577   2    1000024    15
    0.21815174   2    1000037    15
    0.12530526   2    1000022    16
    0.10920105   2    1000035    16
    0.029026366   2    1000015    24
    0.00058375436   2    1000025    16
    0.00019606439   2    1000023    16

DECAY 1000001  0.014100432
    1   2    1000022    1

DECAY 2000001  10.151879
    0.77308204   2    1000021    1
    0.22406326   2    1000022    1
    0.0027856053   2    1000025    1

DECAY 1000003  0.014101553
    1   2    1000022    3

DECAY 2000003  10.19295
    0.7698885   2    1000021    3
    0.22317765   2    1000022    3
    0.0037687687   2    1000025    3
    0.0020274175   2   -1000024    4
    0.0010719778   2    1000023    3

DECAY 1000005  0.00039307608
    1   2    1000022    5

DECAY 2000005  250.74324
    0.36460757   2   -1000024    6
    0.16410215   2    1000021    5
    0.12905132   2    1000023    5
    0.12720724   2    1000025    5
    0.056448172   2    1000005    35
    0.056422199   2    1000005    36
    0.047284922   2   -1000037    6
    0.023540774   2    1000035    5
    0.012718279   2    1000006   -24
    0.0077009454   2    1000005    25
    0.006062463   2    1000005    23
    0.0048539746   2    1000022    5

DECAY 1000002  0.013040485
    1   2    1000022    2

DECAY 2000002  4.2289783
    0.98928227   2    1000022    2
    0.010489729   2    1000025    2
    0.00022800401   2    1000023    2

DECAY 1000004  0.013037101
    1   2    1000022    4

DECAY 2000004  4.2300818
    0.98902308   2    1000022    4
    0.010552698   2    1000025    4
    0.00029326175   2    1000023    4
    0.00013095145   2    1000024    3

DECAY 1000006  198.27136
    0.42616514   2    1000024    5
    0.21224981   2    1000023    6
    0.20837671   2    1000025    6
    0.096582815   2    1000021    6
    0.051358908   2    1000022    6
    0.0044609522   2    1000005    37
    0.00033535898   2    1000037    5
    0.00025693148   2    1000005    24
    0.00016928417   2    1000035    6

DECAY 2000006  248.05872
    0.2617374   2    1000024    5
    0.18504147   2    1000023    6
    0.18483165   2    1000025    6
    0.15641739   2    1000021    6
    0.11054958   2    1000005    37
    0.047688074   2    1000037    5
    0.023954969   2    1000035    6
    0.012070771   2    1000005    24
    0.0077400093   2    1000006    25
    0.0066432019   2    1000006    23
    0.0033254805   2    1000022    6

DECAY 1000024  3.8689323
    0.88717654   2   -1000005    6
    0.11225869   2    1000022    24
    0.00023845345   2    1000004   -3
    0.00016354459   2    1000002   -1
    0.00012925519   3    1000022   -5    6

DECAY 1000037  198.36154
    0.1927221   2   -1000003    4
    0.19272013   2   -1000001    2
    0.19271666   2    1000004   -3
    0.19271463   2    1000002   -1
    0.036716469   2    1000024    25
    0.03653686   2    1000025    24
    0.036237873   2    1000023    24
    0.036102602   2    1000024    23
    0.018870122   2    1000014   -13
    0.018868223   2    1000012   -11
    0.018840906   2   -1000013    14
    0.018838743   2   -1000011    12
    0.0031759896   3    1000024    6   -6
    0.0022768076   3    1000023   -5    6
    0.0021474999   3    1000025   -5    6
    0.00022670086   2    1000022    24
    0.00020421846   3    1000024    5   -5

DECAY 1000022 -1


DECAY 1000023  5.3066016
    0.40642663   2    1000005   -5
    0.40642663   2   -1000005    5
    0.10619935   2    1000022    23
    0.080824718   2    1000022    25

DECAY 1000025  4.6831848
    0.45740362   2    1000005   -5
    0.45740362   2   -1000005    5
    0.082147107   2    1000022    25
    0.0025583538   2    1000022    23
    0.00010727674   2    1000004   -4
    0.00010727674   2   -1000004    4
    0.00010464776   2    1000002   -2
    0.00010464776   2   -1000002    2

DECAY 1000035  202.49421
    0.094428013   2    1000004   -4
    0.094428013   2   -1000004    4
    0.094427064   2    1000002   -2
    0.094427064   2   -1000002    2
    0.094346827   2    1000003   -3
    0.094346827   2   -1000003    3
    0.094345821   2    1000001   -1
    0.094345821   2   -1000001    1
    0.035063307   2    1000024   -24
    0.035063307   2   -1000024    24
    0.030164508   2    1000023    25
    0.027887202   2    1000023    23
    0.027669323   2    1000025    25
    0.0092502087   2    1000014   -14
    0.0092502087   2   -1000014    14
    0.0092492807   2    1000012   -12
    0.0092492807   2   -1000012    12
    0.0092167188   2    1000013   -13
    0.0092167188   2   -1000013    13
    0.0092156569   2    1000011   -11
    0.0092156569   2   -1000011    11
    0.007828328   2    1000025    23
    0.0019867443   3    1000024    5   -6
    0.0019867443   3   -1000024   -5    6
    0.0014940517   3    1000023    6   -6
    0.0014078866   3    1000025    6   -6
    0.00015237538   2    1000022    25

DECAY 1000021  642.05583
    0.086499089   2    1000005   -5
    0.086499089   2   -1000005    5
    0.083420232   2    1000004   -4
    0.083420232   2   -1000004    4
    0.083419633   2    1000002   -2
    0.083419633   2   -1000002    2
    0.083353398   2    1000003   -3
    0.083353398   2   -1000003    3
    0.083352788   2    1000001   -1
    0.083352788   2   -1000001    1
    0.039633315   2    2000004   -4
    0.039633315   2   -2000004    4
    0.039633306   2    2000002   -2
    0.039633306   2   -2000002    2
    0.00032513975   3    1000024    5   -6
    0.00032513975   3   -1000024   -5    6
    0.0002293899   3    1000023    5   -5
    0.00022562395   3    1000025    5   -5
    0.00011531956   3    1000023    6   -6
    0.00011517308   3    1000025    6   -6

DECAY 25  0.39669012
    0.49488109   2   -1000002    1000002
    0.49413423   2   -1000004    1000004
    0.0054412951   2   -5    5
    0.0029522416   2    21    21
    0.0014980285   2   -24    24
    0.0006227135   2   -15    15
    0.00026889966   2   -4    4
    0.00016843956   2    23    23
    2.2745245e-05   2    22    22
    6.1071487e-06   2    22    23
    2.159592e-06   2   -13    13
    2.0487995e-06   2   -3    3
    5.6645266e-09   2   -1    1
    1.3858324e-09   2   -2    2
    4.8550461e-11   2   -11    11

DECAY 35  122.8513
    0.86072462   2   -5    5
    0.11863905   2   -15    15
    0.01114672   2    1000022    1000023
    0.007482162   2    1000022    1000025
    0.00059541802   2   -6    6
    0.00038783216   2   -13    13
    0.00032801838   2    1000022    1000022
    0.00029271198   2   -3    3
    0.00013290071   2    1000023    1000025
    0.00010702754   2   -1000024    1000024
    7.1306386e-05   2   -1000005    1000005
    5.9383834e-05   2    1000025    1000025
    1.7584706e-05   2    1000023    1000023
    8.0222594e-06   2    21    21
    2.4281627e-06   2   -2000004    1000004
    2.4281627e-06   2   -1000004    2000004
    8.0932392e-07   2   -1    1
    7.8535832e-07   2    25    25
    1.9056324e-07   2   -1000001    1000001
    1.9026782e-07   2   -1000003    1000003
    1.300191e-07   2   -1000002    1000002
    1.299294e-07   2   -1000004    1000004
    8.8565659e-08   2    23    23
    2.5119595e-08   2   -24    24
    1.154635e-08   2   -4    4
    8.7102893e-09   2   -11    11
    4.2014963e-09   2    22    23
    3.722047e-09   2    22    22
    9.4091606e-12   2   -2000002    1000002
    9.4091606e-12   2   -1000002    2000002
    5.9537641e-14   2   -2    2

DECAY 36  112.61324
    0.85912025   2   -5    5
    0.11841672   2   -15    15
    0.011890909   2    1000022    1000025
    0.0083688556   2    1000022    1000023
    0.00058694055   2   -6    6
    0.00046604342   2    1000022    1000022
    0.00038710387   2   -13    13
    0.00029216026   2   -3    3
    0.00021727281   2   -1000024    1000024
    0.00011455966   2    1000025    1000025
    7.7698976e-05   2    1000023    1000025
    3.9662513e-05   2    1000023    1000023
    1.5492482e-05   2    21    21
    2.649738e-06   2   -2000004    1000004
    2.649738e-06   2   -1000004    2000004
    8.0780164e-07   2   -1    1
    1.6302844e-07   2    23    25
    1.9344166e-08   2    22    23
    1.9140082e-08   2    22    22
    1.1335934e-08   2   -4    4
    8.6940492e-09   2   -11    11
    1.0267768e-11   2   -2000002    1000002
    1.0267768e-11   2   -1000002    2000002
    5.845767e-14   2   -2    2
    2.0370131e-14   2    23    35
    1.0093348e-37   2    25    25

DECAY 37  121.94809
    0.84295151   2   -5    6
    0.13339931   2   -15    16
    0.019011167   2    1000022    1000024
    0.002266409   2   -1000005    1000004
    0.0012496439   2   -5    4
    0.00047161417   2   -13    14
    0.00032144071   2    1000024    1000025
    0.00027490446   2   -3    4
    1.6184498e-05   2   -1000005    1000002
    1.288274e-05   2   -3    2
    1.2686489e-05   2    1000023    1000024
    8.9237467e-06   2   -5    2
    9.6636106e-07   2   -3    6
    7.6266662e-07   2   -1    2
    6.9564074e-07   2   -1000003    2000004
    3.0310688e-07   2   -1000001    1000002
    3.0232197e-07   2   -1000003    1000004
    1.5055513e-07   2    24    25
    3.7216353e-08   2   -1000001    2000004
    3.5870521e-08   2   -1    4
    2.5631958e-08   2   -1    6
    1.6194696e-08   2   -1000003    1000002
    1.6187826e-08   2   -1000001    1000004
    1.1031104e-08   2   -11    12
    3.6549005e-12   2   -1000001    2000002
    1.9544411e-13   2   -1000003    2000002

DECAY 6  2.43
    1   2    5    24

DECAY 15 -1
