BLOCK SPINFO
   1   SPheno
   2   v4.0.5be

BLOCK SPHENOINFO
   1   2
   2   2

BLOCK MODSEL
   1   0

BLOCK MINPAR
   3    42.581355
   4   -1

BLOCK EXTPAR
   0    3004.4985
   1    1923.7671
   2    2582.3392
   3    1652.8277
   11   -4781.4553
   12   -5734.0057
   13   -4463.7758
   23   -994.29494
   25    41.628574
   26    1681.3135
   31    3245.6905
   32    3245.6905
   33    4690.0077
   34    4254.0559
   35    4254.0559
   36    4939.6406
   41    4964.5802
   42    4964.5802
   43    2718.265
   44    4843.8661
   45    4843.8661
   46    3361.569
   47    1080.7062
   48    1080.7062
   49    3268.021

BLOCK SMINPUTS
   1    127.90897
   2    1.1663787e-05
   3    0.1184
   4    91.1876
   5    4.18
   6    173.2
   7    1.777
   8    0
   11    0.00051099893
   12    0
   13    0.10565837
   14    0
   21    0.005
   22    0.0025
   23    0.095
   24    1.27

BLOCK GAUGE Q=  3004.4985
   1    0.35536298
   2    0.66519887
   3    1.219778

BLOCK YU Q=  3004.4985
   1   1    8.3867909e-06
   2   2    0.0042604898
   3   3    1.0131917

BLOCK YD Q=  3004.4985
   1   1    0.0007015645
   2   2    0.013329725
   3   3    0.69573214

BLOCK YE Q=  3004.4985
   1   1    0.00012242814
   2   2    0.025314255
   3   3    0.42574413

BLOCK AU Q=  3004.4985
   1   1    0
   2   2    0
   3   3   -4781.4552

BLOCK AD Q=  3004.4985
   1   1    0
   2   2    0
   3   3   -5734.0056

BLOCK AE Q=  3004.4985
   1   1    0
   2   2    0
   3   3   -4463.7758

BLOCK MSOFT Q=  3004.4985
   1    1923.7671
   2    2582.3392
   3    1652.8277
   21    1879364.9
   22   -863778.5
   31    3245.6905
   32    3245.6905
   33    4690.0077
   34    4254.0559
   35    4254.0559
   36    4939.6406
   41    4964.5802
   42    4964.5802
   43    2718.265
   44    4843.8661
   45    4843.8661
   46    3361.569
   47    1080.7062
   48    1080.7062
   49    3268.021

BLOCK MASS
   6    173.2
   23    91.1876
   24    80.429995
   15    1.777
   25    124.45547
   35    1681.1659
   36    1681.3135
   37    1684.2651
   1000001    5031.6854
   2000001    1213.2117
   1000002    5031.1457
   2000002    4897.1756
   1000003    5031.6817
   2000003    1213.2072
   1000004    5031.1421
   2000004    4897.1752
   1000005    2740.551
   2000005    3278.1433
   1000006    2720.2856
   2000006    3318.4058
   1000011    3263.3891
   2000011    4260.0141
   1000012    3262.0099
   1000013    3263.37
   2000013    4259.9772
   1000014    3261.9912
   1000015    4697.8049
   2000015    4936.0652
   1000016    4696.9238
   1000021    1921.0323
   1000022    1008.418
   1000023   -1012.912
   1000025    1918.2016
   1000035    2639.5238
   1000024    1010.6155
   1000037    2639.5213

BLOCK ALPHA
      -0.023672576

BLOCK HMIX Q=  3004.4985
   1   -994.29494
   2    41.628574
   3    243.21757
   4    2826815.1

BLOCK STOPMIX
   1   1    0.98305471
   1   2    0.18331243
   2   1   -0.18331243
   2   2    0.98305471

BLOCK SBOTMIX
   1   1   -0.99973548
   1   2    0.022999479
   2   1   -0.022999479
   2   2   -0.99973548

BLOCK STAUMIX
   1   1   -0.99960933
   1   2    0.027949682
   2   1   -0.027949682
   2   2   -0.99960933

BLOCK NMIX
   1   1   -0.033783843
   1   2    0.033389349
   1   3    0.70738135
   1   4    0.70523431
   2   1   -0.010935537
   2   2    0.015769326
   2   3   -0.70653616
   2   4    0.70741671
   3   1   -0.99936573
   3   2   -0.0039852902
   3   3   -0.016148263
   3   4   -0.03148793
   4   1    0.0026841478
   4   2   -0.99931006
   4   3    0.012550418
   4   4    0.034852333

BLOCK UMIX
   1   1   -0.017752607
   1   2   -0.99984241
   2   1    0.99984241
   2   2   -0.017752607

BLOCK VMIX
   1   1   -0.04926006
   1   2    0.99878599
   2   1    0.99878599
   2   2    0.04926006

BLOCK HIGGSBOUNDSINPUTHIGGSCOUPLINGSFERMIONS
       0, 1732.9382,3,36,15,15

BLOCK HIGGSBOUNDSINPUTHIGGSCOUPLINGSBOSONS
       0,4,36,21,21,23

BLOCK SPHENOLOWENERGY
   1    0.00036217656
   2    1.5886041e-06
   3    3.5275668e-05
   4    1.13739e-15
   5    4.855898e-11
   6    8.4868371e-09
   7    3.8580122e-14
   8    1.6472073e-09
   9    2.9465208e-07
   10    9.2336951e-05
   11    0.95380535
   12    0.54219529
   13    19.328888
   14    0
   15    0
   16    0.0021592621
   17    2.2816825e-15
   18    2.4811495e-11
   19    8.2934874e-11
   20   -1.7189111e-15
   21   -7.3488434e-11
   22   -1.4120369e-08
   23    0
   24    0
   25    0
   26    0
   27    0
   28    0
   29    0
   30    0
   31    0
   39    7.0649556e-05
   40    0
   41    0
   42    0

BLOCK FWCOEF Q=  160
   305   4422   0   0   -0.18881911
   305   4422   0   2   -0.23525351
   305   4322   0   2   -0.00065810633
   305   6421   0   0   -0.095227835
   305   6421   0   2   -0.12817121
   305   6321   0   2   -0.0004744119
   3051111   4133   0   0    1.6170636
   3051111   4133   0   2    1.6178069
   3051111   4233   0   2    0.00037511152
   3051111   4137   0   0   -4.4397557
   3051111   4137   0   2   -4.4404605
   3051111   4237   0   2   -0.0028189339
   3051313   4133   0   0    1.6170636
   3051313   4133   0   2    1.617806
   3051313   4233   0   2    0.00037510816
   3051313   4137   0   0   -4.4397557
   3051313   4137   0   2   -4.4404614
   3051313   4237   0   2   -0.0028189326
   3051212   4137   0   0    1.5053501
   3051212   4137   0   2    1.5055051
   3051212   4237   0   2    0.00061088072
   3051414   4137   0   0    1.5053501
   3051414   4137   0   2    1.5055051
   3051414   4237   0   2    0.00061088135
   3051616   4137   0   0    1.5053501
   3051616   4137   0   2    1.5055053
   3051616   4237   0   2    0.00061105936

BLOCK IMFWCOEF Q=  160
   305   4422   0   0    3.8575237e-07
   305   4422   0   2   -2.7321e-05
   305   4322   0   2   -6.0011406e-06
   305   6421   0   0    3.3042242e-07
   305   6421   0   2    4.1150966e-05
   305   6321   0   2   -1.3313493e-06
   3051111   4133   0   2    7.0215879e-07
   3051111   4233   0   2    8.6753735e-06
   3051111   4137   0   2   -2.3079322e-06
   3051111   4237   0   2   -6.5182335e-05
   3051313   4133   0   2    7.021471e-07
   3051313   4233   0   2    8.6753656e-06
   3051313   4137   0   2   -2.3079349e-06
   3051313   4237   0   2   -6.5182364e-05
   3051212   4137   0   2    5.391297e-07
   3051212   4237   0   2    1.4125425e-05
   3051414   4137   0   2    5.3912933e-07
   3051414   4237   0   2    1.4125425e-05
   3051616   4137   0   2    5.4229988e-07
   3051616   4237   0   2    1.4125426e-05

DECAY 23  2.4952


DECAY 24  2.085


DECAY 1000011  6.9357213
    0.49512581   2   -1000037    12
    0.25665325   2    1000025    11
    0.24658837   2    1000035    11
    0.0010669996   2   -1000024    12
    0.00039883963   2    1000022    11
    0.00016672671   2    1000023    11

DECAY 2000011  13.611956
    0.99822886   2    1000025    11
    0.0015993231   2    1000022    11
    0.00016743024   2    1000023    11

DECAY 1000013  6.9694276
    0.49270661   2   -1000037    14
    0.25540808   2    1000025    13
    0.24538359   2    1000035    13
    0.0028406935   2    1000022    13
    0.0025992012   2    1000023    13
    0.0010618305   2   -1000024    14

DECAY 2000013  13.70904
    0.99114298   2    1000025    13
    0.0035270347   2   -1000024    14
    0.0033543389   2    1000022    13
    0.0019264597   2    1000023    13

DECAY 1000015  48.597758
    0.39780089   2   -1000037    16
    0.19814076   2    1000035    15
    0.15952954   2    1000022    15
    0.15794717   2    1000023    15
    0.085598947   2    1000025    15
    0.0009826967   2   -1000024    16

DECAY 2000015  50.628431
    0.35263913   2    1000025    15
    0.32186083   2   -1000024    16
    0.16138826   2    1000023    15
    0.16133324   2    1000022    15
    0.00089122148   2    1000016   -24
    0.00067597167   2   -1000037    16
    0.00045630454   2    1000015    25
    0.00041584993   2    1000015    23
    0.00033918967   2    1000035    15

DECAY 1000012  6.9472201
    0.49147717   2    1000037    11
    0.24836365   2    1000025    12
    0.24670122   2    1000035    12
    0.0081970011   2    1000024    11
    0.0044728796   2    1000022    12
    0.00078808267   2    1000023    12

DECAY 1000014  6.9809132
    0.48908114   2    1000037    13
    0.24716052   2    1000025    14
    0.24549845   2    1000035    14
    0.013024352   2    1000024    13
    0.0044512551   2    1000022    14
    0.00078427262   2    1000023    14

DECAY 1000016  48.583392
    0.39747455   2    1000037    15
    0.31887496   2    1000024    15
    0.19949401   2    1000035    16
    0.082951329   2    1000025    16
    0.0010244639   2    1000022    16
    0.00018068682   2    1000023    16

DECAY 2000001  8.3530428e-05
    0.89120418   2    1000022    1
    0.095474776   2    1000023    1
    0.013321049   2   -1000024    2

DECAY 1000001  325.25648
    0.89105888   2    1000021    1
    0.071521923   2   -1000037    2
    0.03575702   2    1000035    1
    0.0015054306   2    1000025    1

DECAY 2000003  0.00088463028
    0.45404602   2   -1000024    4
    0.31556229   2    1000022    3
    0.23039169   2    1000023    3

DECAY 1000003  325.27439
    0.89100873   2    1000021    3
    0.071517858   2   -1000037    4
    0.035754988   2    1000035    3
    0.0015053559   2    1000025    3
    0.00012261216   2    1000022    3

DECAY 1000005  116.95791
    0.4784171   2    1000021    5
    0.35159195   2   -1000024    6
    0.084727919   2    1000022    5
    0.083912361   2    1000023    5
    0.00081265722   2    1000025    5
    0.00053800811   2    1000035    5

DECAY 2000005  164.75981
    0.67712449   2    1000021    5
    0.15613676   2   -1000024    6
    0.078417896   2    1000022    5
    0.078324473   2    1000023    5
    0.0048373835   2    1000025    5
    0.0021752284   2    1000006   -24
    0.0019241695   2    1000005    25
    0.0010043994   2    1000005    23

DECAY 2000002  284.58038
    0.9724485   2    1000021    2
    0.02750693   2    1000025    2

DECAY 1000002  325.23642
    0.89095302   2    1000021    2
    0.071355984   2    1000037    1
    0.035681234   2    1000035    2
    0.0016463361   2    1000025    2
    0.00030445011   2    1000024    1

DECAY 2000004  284.58351
    0.97243743   2    1000021    4
    0.027506627   2    1000025    4

DECAY 1000004  325.25394
    0.89090375   2    1000021    4
    0.071352015   2    1000037    3
    0.035679249   2    1000035    4
    0.0016462478   2    1000025    4
    0.00035463784   2    1000024    3

DECAY 1000006  143.38294
    0.38789917   2    1000021    6
    0.17633551   2    1000021    4
    0.14454912   2    1000024    5
    0.14050309   2    1000022    6
    0.14004824   2    1000023    6
    0.0091828787   3    1000022    24    5
    0.00092063766   2    1000025    6
    0.00053398163   2    1000037    5

DECAY 2000006  282.94724
    0.39087008   2    1000021    6
    0.19085188   2    1000024    5
    0.09862605   2    1000023    6
    0.097449502   2    1000022    6
    0.092091102   2    1000005    24
    0.068562612   2    1000006    25
    0.048585576   2    1000006    23
    0.011589493   2    1000025    6
    0.00091891609   2    1000037    5
    0.00045478669   2    1000035    6

DECAY 1000024  4.4532397e-11
    0.54154669   3    1000022   -1    2
    0.18052164   3    1000022   -11    12
    0.17846042   3    1000022   -13    14
    0.096608674   3    1000022   -3    4
    0.0028625763   3    1000022   -15    16

DECAY 1000037  22.916968
    0.23794843   2    1000024    25
    0.2326755   2    1000023    24
    0.23153404   2    1000024    23
    0.23003918   2    1000022    24
    0.018036318   3    1000023   -5    6
    0.017897849   3    1000022   -5    6
    0.015501374   3    1000024    6   -6
    0.012399197   3    1000024    5   -5
    0.0012748707   2    1000025    24
    0.001272198   3    1000024    15   -15
    0.00064131655   3    1000022   -15    16
    0.00055001003   3    1000023   -15    16
    0.00018770794   3    1000021   -5    6

DECAY 1000022 -1


DECAY 1000023  2.9154622e-08
    0.82934149   2    1000022    22
    0.044161818   3    1000022    12   -12
    0.033022969   3    1000022    1   -1
    0.032852314   3    1000022    3   -3
    0.025755263   3    1000022    2   -2
    0.0080636638   3    1000022    4   -4
    0.0074524396   3    1000022    11   -11
    0.0073916628   3    1000022    13   -13
    0.0030887552   3    1000024    1   -2
    0.0030887552   3   -1000024   -1    2
    0.0010296161   3    1000024    11   -12
    0.0010296161   3   -1000024   -11    12
    0.0010188457   3    1000024    13   -14
    0.0010188457   3   -1000024   -13    14
    0.00065083441   3    1000024    3   -4
    0.00065083441   3   -1000024   -3    4
    0.00032613512   3    1000022    15   -15

DECAY 1000025  7.7705698
    0.14674546   2    1000024   -24
    0.14674546   2   -1000024    24
    0.13329057   2    1000023    23
    0.13251697   2    1000023    25
    0.11920765   2    1000022    25
    0.074322159   2    2000003   -3
    0.074322159   2   -2000003    3
    0.074321269   2    2000001   -1
    0.074321269   2   -2000001    1
    0.013798732   2    1000022    23
    0.0035020909   3    1000024    5   -6
    0.0035020909   3   -1000024   -5    6
    0.0017097357   3    1000023    6   -6
    0.0015686781   3    1000022    6   -6

DECAY 1000035  26.66449
    0.19922724   2    1000024   -24
    0.19922724   2   -1000024    24
    0.18544777   2    1000023    25
    0.16695949   2    1000022    25
    0.16410791   2    1000023    23
    0.036165818   2    1000022    23
    0.012521672   3    1000024    5   -6
    0.012521672   3   -1000024   -5    6
    0.005491664   3    1000023    6   -6
    0.0054794548   3    1000022    5   -5
    0.0049122409   3    1000022    6   -6
    0.0047912296   3    1000023    5   -5
    0.00073670129   2    1000025    25
    0.00057704396   3    1000022    15   -15
    0.00053145874   3    1000024    15   -16
    0.00053145874   3   -1000024   -15    16
    0.00049570127   3    1000023    15   -15
    0.00014724196   3    1000021    5   -5

DECAY 1000021  41.1085
    0.24994382   2    2000003   -3
    0.24994382   2   -2000003    3
    0.24994136   2    2000001   -1
    0.24994136   2   -2000001    1

DECAY 25  0.0038339566
    0.58331761   2   -5    5
    0.21824812   2   -24    24
    0.072455156   2    21    21
    0.067105411   2   -15    15
    0.028514307   2   -4    4
    0.026134955   2    23    23
    0.0023288223   2    22    22
    0.0014425817   2    22    23
    0.00023268028   2   -13    13
    0.00021959672   2   -3    3
    6.0716368e-07   2   -1    1
    1.4694251e-07   2   -2    2
    5.2309177e-09   2   -11    11

DECAY 35  40.697043
    0.85453588   2   -5    5
    0.14372245   2   -15    15
    0.00083431906   2   -6    6
    0.00048508875   2   -13    13
    0.00038495001   2   -3    3
    2.082211e-05   2    21    21
    1.3639009e-05   2    25    25
    1.0644351e-06   2   -1    1
    1.0460264e-06   2    23    23
    7.1141548e-07   2   -24    24
    1.2108265e-08   2   -4    4
    1.0896781e-08   2   -11    11
    7.5613514e-09   2    22    22
    3.6891922e-09   2    22    23
    6.2438084e-14   2   -2    2

DECAY 36  38.87199
    0.85448528   2   -5    5
    0.14371304   2   -15    15
    0.00089204901   2   -6    6
    0.00048505531   2   -13    13
    0.0003849202   2   -3    3
    3.7018407e-05   2    21    21
    1.4484475e-06   2    23    25
    1.0643535e-06   2   -1    1
    6.1165898e-08   2    22    22
    4.2167175e-08   2    22    23
    1.2335797e-08   2   -4    4
    1.0896022e-08   2   -11    11
    6.3631188e-14   2   -2    2
    9.0340073e-37   2    25    25

DECAY 37  37.04791
    0.8329149   2   -5    6
    0.16484669   2   -15    16
    0.001243393   2   -5    4
    0.00058279278   2   -13    14
    0.00038087777   2   -3    4
    1.7715778e-05   2   -3    2
    8.8791162e-06   2   -5    2
    2.0319012e-06   2   -3    6
    1.5309737e-06   2    24    25
    1.0572205e-06   2   -1    2
    6.787942e-08   2   -1    6
    4.9661536e-08   2   -1    4
    1.3631584e-08   2   -11    12
    1.04909e-11   2    24    35
    8.2196368e-12   2    24    36

DECAY 6  2.43
    1   2    5    24

DECAY 15 -1
