BLOCK SPINFO
   1   SPheno
   2   v4.0.5be

BLOCK SPHENOINFO
   1   2
   2   2

BLOCK MODSEL
   1   0

BLOCK MINPAR
   3    29.513015
   4    1

BLOCK EXTPAR
   0    3489.634
   1   -788.88298
   2    1624.3734
   3    3717.3678
   11   -4329.972
   12   -3662.4864
   13    2165.4411
   23    826.32789
   25    28.409672
   26    2767.6384
   31    1046.0888
   32    1046.0888
   33    3322.858
   34    784.38145
   35    784.38145
   36    4830.5018
   41    3518.14
   42    3518.14
   43    3681.4745
   44    461.52495
   45    461.52495
   46    3168.8398
   47    1023.1949
   48    1023.1949
   49    1115.3058

BLOCK SMINPUTS
   1    127.90897
   2    1.1663787e-05
   3    0.1184
   4    91.1876
   5    4.18
   6    173.2
   7    1.777
   8    0
   11    0.00051099893
   12    0
   13    0.10565837
   14    0
   21    0.005
   22    0.0025
   23    0.095
   24    1.27

BLOCK GAUGE Q=  3489.634
   1    0.35536298
   2    0.66519887
   3    1.219778

BLOCK YU Q=  3489.634
   1   1    8.3895646e-06
   2   2    0.0042618988
   3   3    1.0135268

BLOCK YD Q=  3489.634
   1   1    0.00047894527
   2   2    0.0090999601
   3   3    0.47496363

BLOCK YE Q=  3489.634
   1   1    8.3579452e-05
   2   2    0.01728158
   3   3    0.29064774

BLOCK AU Q=  3489.634
   1   1    0
   2   2    0
   3   3   -4329.9762

BLOCK AD Q=  3489.634
   1   1    0
   2   2    0
   3   3   -3662.4892

BLOCK AE Q=  3489.634
   1   1    0
   2   2    0
   3   3    2165.4403

BLOCK MSOFT Q=  3489.634
   1   -788.88298
   2    1624.3734
   3    3717.3678
   21    7020636.9
   22   -448770.94
   31    1046.0888
   32    1046.0888
   33    3322.858
   34    784.38145
   35    784.38145
   36    4830.5018
   41    3518.14
   42    3518.14
   43    3681.4745
   44    461.52495
   45    461.52495
   46    3168.8398
   47    1023.1949
   48    1023.1949
   49    1115.3058

BLOCK MASS
   6    173.2
   23    91.1876
   24    80.429995
   15    1.777
   25    123.58374
   35    2767.128
   36    2767.6384
   37    2768.6084
   1000001    3664.5851
   2000001    1256.6946
   1000002    3663.7159
   2000002    819.04917
   1000003    3664.5833
   2000003    1256.6885
   1000004    3663.7141
   2000004    819.04839
   1000005    1321.4569
   2000005    3766.4786
   1000006    3219.4109
   2000006    3782.5384
   1000011    1078.7166
   2000011    791.65265
   1000012    1075.3963
   1000013    1078.7057
   2000013    791.60438
   1000014    1075.3782
   1000015    3330.9682
   2000015    4828.1872
   1000016    3329.2631
   1000021    3853.4169
   1000022   -756.62486
   1000023    835.52884
   1000025   -850.69811
   1000035    1671.65
   1000024    836.00721
   1000037    1671.7826

BLOCK ALPHA
      -0.033971844

BLOCK HMIX Q=  3489.634
   1    826.32789
   2    28.409672
   3    243.08808
   4    7659822.5

BLOCK STOPMIX
   1   1    0.1611735
   1   2    0.98692609
   2   1   -0.98692609
   2   2    0.1611735

BLOCK SBOTMIX
   1   1    0.0046017289
   1   2    0.99998941
   2   1   -0.99998941
   2   2    0.0046017289

BLOCK STAUMIX
   1   1    0.99999514
   1   2    0.0031170738
   2   1   -0.0031170738
   2   2    0.99999514

BLOCK NMIX
   1   1   -0.94115604
   1   2   -0.0071037508
   1   3   -0.25179184
   1   4   -0.22533466
   2   1   -0.019980505
   2   2   -0.06897653
   2   3    0.70661088
   2   4   -0.70394892
   3   1    0.33737904
   3   2   -0.020319351
   3   3   -0.66043295
   3   4   -0.67051535
   4   1   -0.0012117681
   4   2    0.99738603
   4   3    0.03361921
   4   4   -0.06394827

BLOCK UMIX
   1   1   -0.047616048
   1   2    0.99886571
   2   1    0.99886571
   2   2    0.047616048

BLOCK VMIX
   1   1   -0.090542723
   1   2    0.99589257
   2   1    0.99589257
   2   2    0.090542723

BLOCK HIGGSBOUNDSINPUTHIGGSCOUPLINGSFERMIONS
       0, 807.10945,3,36,15,15

BLOCK HIGGSBOUNDSINPUTHIGGSCOUPLINGSBOSONS
       0,4,36,21,21,23

BLOCK SPHENOLOWENERGY
   1    0.00031874612
   2    1.5908645e-06
   3    3.5260977e-05
   4    2.6523091e-15
   5    1.1330337e-10
   6    2.3701982e-08
   7    8.8985362e-14
   8    3.8014435e-09
   9    8.0577636e-07
   10    9.6203183e-05
   11    0.99374205
   12    0.54193685
   13    19.360189
   14    0
   15    0
   16    0.0021571878
   17    2.2816577e-15
   18    2.4804371e-11
   19    8.2916126e-11
   20   -6.5498449e-16
   21   -2.8050243e-11
   22    1.4676651e-08
   23    0
   24    0
   25    0
   26    0
   27    0
   28    0
   29    0
   30    0
   31    0
   39    6.2149534e-05
   40    0
   41    0
   42    0

BLOCK FWCOEF Q=  160
   305   4422   0   0   -0.18881911
   305   4422   0   2   -0.18549628
   305   4322   0   2    7.201937e-05
   305   6421   0   0   -0.095227835
   305   6421   0   2   -0.10031166
   305   6321   0   2   -9.7064762e-05
   3051111   4133   0   0    1.6218522
   3051111   4133   0   2    1.6222204
   3051111   4233   0   2    0.00013672957
   3051111   4137   0   0   -4.4445443
   3051111   4137   0   2   -4.4437145
   3051111   4237   0   2   -0.0010190203
   3051313   4133   0   0    1.6218522
   3051313   4133   0   2    1.6222195
   3051313   4233   0   2    0.0001367293
   3051313   4137   0   0   -4.4445443
   3051313   4137   0   2   -4.4437155
   3051313   4237   0   2   -0.0010190206
   3051212   4137   0   0    1.5053501
   3051212   4137   0   2    1.5051761
   3051212   4237   0   2    0.00022059061
   3051414   4137   0   0    1.5053501
   3051414   4137   0   2    1.5051761
   3051414   4237   0   2    0.00022059064
   3051616   4137   0   0    1.5053501
   3051616   4137   0   2    1.5051761
   3051616   4237   0   2    0.00022059786

BLOCK IMFWCOEF Q=  160
   305   4422   0   0    3.8584361e-07
   305   4422   0   2    1.2113621e-05
   305   4322   0   2    3.9436921e-06
   305   6421   0   0    3.3050057e-07
   305   6421   0   2   -5.227853e-06
   305   6321   0   2    1.7088069e-06
   3051111   4133   0   2    1.9096408e-07
   3051111   4233   0   2    2.8925039e-06
   3051111   4137   0   2   -1.2521771e-06
   3051111   4237   0   2   -2.1558858e-05
   3051313   4133   0   2    1.9095152e-07
   3051313   4233   0   2    2.8925012e-06
   3051313   4137   0   2   -1.2521862e-06
   3051313   4237   0   2   -2.1558866e-05
   3051212   4137   0   2    3.7097042e-07
   3051212   4237   0   2    4.6669148e-06
   3051414   4137   0   2    3.7097026e-07
   3051414   4237   0   2    4.6669148e-06
   3051616   4137   0   2    3.7042837e-07
   3051616   4237   0   2    4.6669148e-06

DECAY 23  2.4952


DECAY 24  2.085


DECAY 2000011  0.026384383
    1   2    1000022    11

DECAY 1000011  0.34419591
    0.92559116   2    1000022    11
    0.050425251   2    1000025    11
    0.014006592   2    1000023    11
    0.0099769439   2   -1000024    12

DECAY 2000013  0.026315558
    1   2    1000022    13

DECAY 1000013  0.34597525
    0.92109759   2    1000022    13
    0.051310723   2    1000025    13
    0.015410352   2    1000023    13
    0.0099249293   2   -1000024    14
    0.0022564034   2    2000013    25

DECAY 1000015  33.335331
    0.49110938   2   -1000037    16
    0.24464934   2    1000035    15
    0.11263611   2    1000022    15
    0.076131893   2    1000023    15
    0.073620792   2    1000025    15
    0.0018524946   2   -1000024    16

DECAY 2000015  38.522197
    0.54319723   2    1000022    15
    0.19761131   2   -1000024    16
    0.15384374   2    1000025    15
    0.099122137   2    1000023    15
    0.0027749709   2    1000016   -24
    0.0013818247   2    1000015    23
    0.0013353675   2    1000015    25
    0.00048892843   2   -1000037    16
    0.00024450067   2    1000035    15

DECAY 1000012  0.3379068
    0.87765803   2    1000022    12
    0.078907514   2    1000025    12
    0.035954391   2    1000024    11
    0.0074800655   2    1000023    12

DECAY 1000014  0.33887212
    0.8750853   2    1000022    14
    0.078672537   2    1000025    14
    0.038784298   2    1000024    13
    0.0074578658   2    1000023    14

DECAY 1000016  33.336271
    0.48788487   2    1000037    15
    0.24490457   2    1000035    16
    0.15331612   2    1000024    15
    0.097135306   2    1000022    16
    0.015447224   2    1000025    16
    0.0013119086   2    1000023    16

DECAY 2000001  0.27610047
    0.91477751   2    1000022    1
    0.084896982   2    1000025    1
    0.00031906705   2    1000023    1

DECAY 1000001  30.852221
    0.65419395   2   -1000037    2
    0.32629692   2    1000035    1
    0.012342561   2    1000022    1
    0.0030251204   2    1000025    1
    0.002130368   2   -1000024    2
    0.0020110663   2    1000023    1

DECAY 2000003  0.27737429
    0.91074451   2    1000022    3
    0.085466267   2    1000025    3
    0.0023141375   2   -1000024    4
    0.0014750881   2    1000023    3

DECAY 1000003  30.858927
    0.65405136   2   -1000037    4
    0.32622584   2    1000035    3
    0.012351188   2    1000022    3
    0.0031006614   2    1000025    3
    0.0021680428   2   -1000024    4
    0.0020981497   2    1000023    3

DECAY 1000005  4.3644351
    0.43889365   2   -1000024    6
    0.24464652   2    1000023    5
    0.20977029   2    1000025    5
    0.10668954   2    1000022    5

DECAY 2000005  135.6073
    0.50625924   2   -1000024    6
    0.16149289   2   -1000037    6
    0.1317414   2    1000006   -24
    0.078575829   2    1000035    5
    0.05668958   2    1000023    5
    0.049818242   2    1000025    5
    0.01004306   2    1000022    5
    0.0034706213   2    1000005    25
    0.0019091379   2    1000005    23

DECAY 2000002  0.034830079
    1   2    1000022    2

DECAY 1000002  30.894719
    0.6490948   2    1000037    1
    0.32540782   2    1000035    2
    0.014600304   2    1000022    2
    0.0076905752   2    1000024    1
    0.002467963   2    1000023    2
    0.00073853442   2    1000025    2

DECAY 2000004  0.034824685
    1   2    1000022    4

DECAY 1000004  30.901289
    0.64895647   2    1000037    3
    0.32533843   2    1000035    4
    0.014599124   2    1000022    4
    0.0078634955   2    1000024    3
    0.0024864353   2    1000023    4
    0.00075566014   2    1000025    4

DECAY 1000006  119.41722
    0.47461329   2    1000024    5
    0.23667422   2    1000023    6
    0.22384971   2    1000025    6
    0.06457029   2    1000022    6

DECAY 2000006  140.71939
    0.24388391   2    1000023    6
    0.21386462   2    1000025    6
    0.15496353   2    1000037    5
    0.11124387   2    1000024    5
    0.088125784   2    1000006    25
    0.079545809   2    1000035    6
    0.066565071   2    1000006    23
    0.038162173   2    1000022    6
    0.0036452329   2    1000005    24

DECAY 1000024  0.023380753
    0.33305181   3    1000022   -1    2
    0.33290515   3    1000022   -3    4
    0.11097138   3    1000022   -11    12
    0.1109711   3    1000022   -13    14
    0.11093632   3    1000022   -15    16
    0.0011332237   2   -2000013    14

DECAY 1000037  24.181422
    0.14534168   2    1000024    25
    0.14246791   2    1000023    24
    0.14217979   2    1000024    23
    0.12566033   2    1000025    24
    0.10371874   2    1000014   -13
    0.10371369   2    1000012   -11
    0.1034279   2   -1000013    14
    0.10342492   2   -1000011    12
    0.019753131   2    1000022    24
    0.0035790579   3    1000024    6   -6
    0.0034526466   3    1000023   -5    6
    0.0026985488   3    1000025   -5    6
    0.00047271246   3    1000022   -5    6
    0.00010150554   2   -1000005    6

DECAY 1000022 -1


DECAY 1000023  0.0036198898
    0.1996622   3    1000022    12   -12
    0.14941561   3    1000022    1   -1
    0.14941441   3    1000022    3   -3
    0.14699161   3    1000022    5   -5
    0.11653235   3    1000022    2   -2
    0.11627484   3    1000022    4   -4
    0.033663088   3    1000022    11   -11
    0.033662784   3    1000022    13   -13
    0.033557496   3    1000022    15   -15
    0.0060002807   2    2000013   -13
    0.0060002807   2   -2000013    13
    0.0024213217   2    2000011   -11
    0.0024213217   2   -2000011    11
    0.0019783942   2    1000022    22
    0.00053111876   2    2000004   -4
    0.00053111876   2   -2000004    4
    0.00047088845   2    2000002   -2
    0.00047088845   2   -2000002    2

DECAY 1000025  0.024767964
    0.17739368   2    2000013   -13
    0.17739368   2   -2000013    13
    0.17635954   2    2000011   -11
    0.17635954   2   -2000011    11
    0.06996982   2    2000004   -4
    0.06996982   2   -2000004    4
    0.069831696   2    2000002   -2
    0.069831696   2   -2000002    2
    0.012551801   2    1000022    23

DECAY 1000035  26.718172
    0.12977428   2    1000024   -24
    0.12977428   2   -1000024    24
    0.11946286   2    1000023    25
    0.10418775   2    1000025    23
    0.091800158   2    1000025    25
    0.047123265   2    1000014   -14
    0.047123265   2   -1000014    14
    0.047121021   2    1000012   -12
    0.047121021   2   -1000012    12
    0.046590671   2    1000013   -13
    0.046590671   2   -1000013    13
    0.046589281   2    1000011   -11
    0.046589281   2   -1000011    11
    0.015843705   2    1000022    23
    0.01407748   2    1000022    25
    0.011528139   2    1000023    23
    0.0030707186   3    1000024    5   -6
    0.0030707186   3   -1000024   -5    6
    0.0012978972   3    1000023    6   -6
    0.00095788706   3    1000025    6   -6
    0.00018953415   3    1000022    6   -6

DECAY 1000021  493.2804
    0.10540438   2    2000004   -4
    0.10540438   2   -2000004    4
    0.10540436   2    2000002   -2
    0.10540436   2   -2000002    2
    0.092329959   2    2000003   -3
    0.092329959   2   -2000003    3
    0.092329744   2    2000001   -1
    0.092329744   2   -2000001    1
    0.090018772   2    1000005   -5
    0.090018772   2   -1000005    5
    0.0092474239   2    1000006   -6
    0.0092474239   2   -1000006    6
    0.0010662854   2    1000002   -2
    0.0010662854   2   -1000002    2
    0.0010662825   2    1000004   -4
    0.0010662825   2   -1000004    4
    0.0010568011   2    1000003   -3
    0.0010568011   2   -1000003    3
    0.001056781   2    1000001   -1
    0.001056781   2   -1000001    1
    0.00035746019   3    1000023    6   -6
    0.00031850611   3    1000025    6   -6
    0.00022996049   2    2000005   -5
    0.00022996049   2   -2000005    5
    0.0001685691   2    1000006   -4
    0.0001685691   2   -1000006    4
    0.00010626007   3    1000035    6   -6

DECAY 25  0.0037043683
    0.59506821   2   -5    5
    0.20573089   2   -24    24
    0.073105695   2    21    21
    0.068341398   2   -15    15
    0.02936365   2   -4    4
    0.024207783   2    23    23
    0.0023431111   2    22    22
    0.0013779462   2    22    23
    0.0002371297   2   -13    13
    0.00022341121   2   -3    3
    6.1770865e-07   2   -1    1
    1.5132277e-07   2   -2    2
    5.3309582e-09   2   -11    11

DECAY 35  40.726857
    0.59848728   2   -5    5
    0.12611555   2   -15    15
    0.072016174   2   -1000024    1000037
    0.072016174   2   -1000037    1000024
    0.045410665   2    1000025    1000035
    0.025672076   2    1000022    1000023
    0.014053317   2    1000022    1000035
    0.012163027   2    1000023    1000035
    0.0087164471   2    1000022    1000022
    0.0084863484   2    1000025    1000025
    0.0055131841   2    1000022    1000025
    0.0048853358   2    1000023    1000025
    0.0027002399   2   -6    6
    0.00251932   2   -1000024    1000024
    0.00052561433   2    1000023    1000023
    0.00047527496   2   -13    13
    0.00021408765   2   -3    3
    1.1500921e-05   2   -1000005    1000005
    7.1373137e-06   2    21    21
    4.5251617e-06   2    25    25
    1.2476372e-06   2   -1000002    1000002
    1.2469849e-06   2   -1000004    1000004
    1.1298581e-06   2    23    23
    5.9184538e-07   2   -1    1
    3.7997811e-07   2   -24    24
    1.7953913e-07   2   -2000013    2000013
    1.7921879e-07   2   -2000011    2000011
    1.4605687e-07   2   -1000011    1000011
    1.4420563e-07   2   -1000013    1000013
    1.0003511e-07   2    22    23
    5.0582788e-08   2    22    22
    3.9795987e-08   2   -1000001    1000001
    3.9701718e-08   2   -1000003    1000003
    3.0464793e-08   2   -4    4
    1.5948961e-08   2   -2000013    1000013
    1.5948961e-08   2   -1000013    2000013
    1.0674638e-08   2   -11    11
    3.730908e-13   2   -2000011    1000011
    3.730908e-13   2   -1000011    2000011
    1.5703219e-13   2   -2    2

DECAY 36  39.608589
    0.59207151   2   -5    5
    0.12476531   2   -15    15
    0.0731793   2   -1000024    1000037
    0.0731793   2   -1000037    1000024
    0.061114321   2    1000023    1000035
    0.019849763   2    1000022    1000023
    0.012092306   2    1000025    1000025
    0.011491292   2    1000022    1000022
    0.0089636266   2    1000025    1000035
    0.0074426327   2    1000022    1000025
    0.0043107165   2   -1000024    1000024
    0.0039233103   2    1000023    1000025
    0.0034003744   2    1000022    1000035
    0.0025558625   2   -6    6
    0.00095734316   2    1000023    1000023
    0.00047015573   2   -13    13
    0.00021178921   2   -3    3
    1.824123e-05   2    21    21
    1.7908778e-06   2    23    25
    5.8549189e-07   2   -1    1
    2.5458695e-07   2    22    23
    1.4035004e-07   2    22    22
    2.823039e-08   2   -4    4
    1.6425706e-08   2   -2000013    1000013
    1.6425706e-08   2   -1000013    2000013
    1.0559712e-08   2   -11    11
    3.8419883e-13   2   -2000011    1000011
    3.8419883e-13   2   -1000011    2000011
    1.4550713e-13   2   -2    2
    1.0714514e-38   2    25    25

DECAY 37  40.872621
    0.61009325   2   -5    6
    0.11799167   2   -15    16
    0.072745175   2    1000023    1000037
    0.072048983   2    1000024    1000035
    0.053959322   2    1000025    1000037
    0.047621325   2    1000022    1000024
    0.017298174   2    1000022    1000037
    0.0065133804   2    1000024    1000025
    0.00090056223   2   -5    4
    0.00041714274   2   -13    14
    0.00019347664   2    1000023    1000024
    0.00019343083   2   -3    4
    9.0496947e-06   2   -3    2
    6.4309438e-06   2   -5    2
    4.6816566e-06   2   -3    6
    1.7385991e-06   2    24    25
    7.0205926e-07   2   -2000013    1000014
    7.0163426e-07   2   -2000011    1000012
    5.3655282e-07   2   -1    2
    2.0161697e-07   2   -1    6
    3.0185394e-08   2   -1000013    1000014
    2.6879215e-08   2   -1    4
    9.7570121e-09   2   -11    12
    2.3723382e-11   2   -1000005    1000004
    5.0552267e-12   2   -1000003    1000004
    7.0602691e-13   2   -1000011    1000012
    2.3683487e-13   2    24    35
    7.4908114e-16   2   -1000001    1000004
    1.4202939e-18   2   -1000003    1000002
    8.885716e-19   2   -1000005    1000002
    7.3564894e-20   2   -1000001    1000002

DECAY 6  2.43
    1   2    5    24

DECAY 15 -1
