BLOCK SPINFO
   1   SPheno
   2   v4.0.5be

BLOCK SPHENOINFO
   1   2
   2   2

BLOCK MODSEL
   1   0

BLOCK MINPAR
   3    9.7250468
   4    1

BLOCK EXTPAR
   0    2727.1146
   1   -976.60152
   2   -1592.5388
   3    3273.1935
   11    3754.9573
   12    2173.1306
   13    4881.7248
   23    2253.0248
   25    9.2678184
   26    3036.0799
   31    3603.1298
   32    3603.1298
   33    3694.3189
   34    2112.7676
   35    2112.7676
   36    2055.4196
   41    791.6767
   42    791.6767
   43    2611.4591
   44    2157.8676
   45    2157.8676
   46    2693.8562
   47    4867.3913
   48    4867.3913
   49    4129.1997

BLOCK SMINPUTS
   1    127.90897
   2    1.1663787e-05
   3    0.1184
   4    91.1876
   5    4.18
   6    173.2
   7    1.777
   8    0
   11    0.00051099893
   12    0
   13    0.10565837
   14    0
   21    0.005
   22    0.0025
   23    0.095
   24    1.27

BLOCK GAUGE Q=  2727.1146
   1    0.35536298
   2    0.66519887
   3    1.219778

BLOCK YU Q=  2727.1146
   1   1    8.4330383e-06
   2   2    0.0042839834
   3   3    1.0187788

BLOCK YD Q=  2727.1146
   1   1    0.00015705141
   2   2    0.0029839768
   3   3    0.15574578

BLOCK YE Q=  2727.1146
   1   1    2.7406619e-05
   2   2    0.0056668196
   3   3    0.095306584

BLOCK AU Q=  2727.1146
   1   1    0
   2   2    0
   3   3    3754.9573

BLOCK AD Q=  2727.1146
   1   1    0
   2   2    0
   3   3    2173.1306

BLOCK AE Q=  2727.1146
   1   1    0
   2   2    0
   3   3    4881.7248

BLOCK MSOFT Q=  2727.1146
   1   -976.60152
   2   -1592.5388
   3    3273.1935
   21    3939906
   22   -4875595.5
   31    3603.1298
   32    3603.1298
   33    3694.3189
   34    2112.7676
   35    2112.7676
   36    2055.4196
   41    791.6767
   42    791.6767
   43    2611.4591
   44    2157.8676
   45    2157.8676
   46    2693.8562
   47    4867.3913
   48    4867.3913
   49    4129.1997

BLOCK MASS
   6    173.2
   23    91.1876
   24    80.429995
   15    1.777
   25    121.12299
   35    3036.2019
   36    3036.0799
   37    3037.3956
   1000001    998.35402
   2000001    4928.7615
   1000002    995.19006
   2000002    2273.1026
   1000003    998.35442
   2000003    4928.7613
   1000004    995.19065
   2000004    2273.1027
   1000005    2711.3975
   2000005    4202.7891
   1000006    2640.8047
   2000006    2816.2453
   1000011    3610.2545
   2000011    2124.1319
   1000012    3609.0183
   1000013    3610.2536
   2000013    2124.1312
   1000014    3609.0174
   1000015    2067.1886
   2000015    3701.1484
   1000016    3699.9344
   1000021    3387.7278
   1000022   -970.30516
   1000023   -1604.5
   1000025    2263.7779
   1000035   -2266.4361
   1000024    1604.7307
   1000037    2267.4057

BLOCK ALPHA
      -0.10271471

BLOCK HMIX Q=  2727.1146
   1    2253.0248
   2    9.2678184
   3    243.3687
   4    9217781.3

BLOCK STOPMIX
   1   1   -0.7744096
   1   2    0.63268457
   2   1   -0.63268457
   2   2   -0.7744096

BLOCK SBOTMIX
   1   1    0.99999352
   1   2    0.0036000624
   2   1   -0.0036000624
   2   2    0.99999352

BLOCK STAUMIX
   1   1    0.00301162
   1   2    0.99999547
   2   1   -0.99999547
   2   2    0.00301162

BLOCK NMIX
   1   1   -0.9997039
   1   2    0.00066426738
   1   3   -0.023005639
   1   4   -0.0078995348
   2   1    0.0023963245
   2   2    0.99730293
   2   3   -0.061724732
   2   4   -0.039638065
   3   1    0.010666802
   3   2   -0.015664066
   3   3   -0.70679658
   3   4    0.70716296
   4   1    0.021738912
   4   2   -0.071701164
   4   3   -0.70434323
   4   4   -0.70589445

BLOCK UMIX
   1   1   -0.99606019
   1   2    0.088679689
   2   1   -0.088679689
   2   2   -0.99606019

BLOCK VMIX
   1   1    0.99834612
   1   2    0.057489323
   2   1    0.057489323
   2   2   -0.99834612

BLOCK HIGGSBOUNDSINPUTHIGGSCOUPLINGSFERMIONS
       0, 85.892458,3,36,15,15

BLOCK HIGGSBOUNDSINPUTHIGGSCOUPLINGSBOSONS
       0,4,36,21,21,23

BLOCK SPHENOLOWENERGY
   1    0.00032824723
   2    1.5896796e-06
   3    3.5260362e-05
   4    2.6619223e-15
   5    1.1371431e-10
   6    2.3805464e-08
   7    8.9617552e-14
   8    3.8284593e-09
   9    8.1206681e-07
   10    9.674222e-05
   11    0.9993101
   12    0.54224373
   13    19.374502
   14    0
   15    0
   16    0.0021584821
   17    2.2816703e-15
   18    2.4802941e-11
   19    8.291523e-11
   20   -3.9840474e-16
   21   -1.703306e-11
   22   -4.5650321e-09
   23    0
   24    0
   25    0
   26    0
   27    0
   28    0
   29    0
   30    0
   31    0
   39   -3.8270306e-05
   40    0
   41    0
   42    0

BLOCK FWCOEF Q=  160
   305   4422   0   0   -0.18881911
   305   4422   0   2   -0.1972369
   305   4322   0   2   -0.00018550221
   305   6421   0   0   -0.095227835
   305   6421   0   2   -0.10484216
   305   6321   0   2   -0.00020291089
   3051111   4133   0   0    1.6128285
   3051111   4133   0   2    1.6131521
   3051111   4233   0   2    7.7761592e-06
   3051111   4137   0   0   -4.4355205
   3051111   4137   0   2   -4.434611
   3051111   4237   0   2   -5.8631453e-05
   3051313   4133   0   0    1.6128285
   3051313   4133   0   2    1.6131521
   3051313   4233   0   2    7.7761573e-06
   3051313   4137   0   0   -4.4355205
   3051313   4137   0   2   -4.434611
   3051313   4237   0   2   -5.8631454e-05
   3051212   4137   0   0    1.5053501
   3051212   4137   0   2    1.5051547
   3051212   4237   0   2    1.2717609e-05
   3051414   4137   0   0    1.5053501
   3051414   4137   0   2    1.5051547
   3051414   4237   0   2    1.2717609e-05
   3051616   4137   0   0    1.5053501
   3051616   4137   0   2    1.5051547
   3051616   4237   0   2    1.2717672e-05

BLOCK IMFWCOEF Q=  160
   305   4422   0   0    3.8580305e-07
   305   4422   0   2   -1.2871532e-06
   305   4322   0   2   -1.1560567e-06
   305   6421   0   0    3.3046583e-07
   305   6421   0   2   -2.9094353e-06
   305   6321   0   2   -7.5259645e-07
   3051111   4133   0   2    1.0515935e-06
   3051111   4233   0   2    1.8058337e-07
   3051111   4137   0   2   -6.0994741e-06
   3051111   4237   0   2   -1.3622335e-06
   3051313   4133   0   2    1.0515929e-06
   3051313   4233   0   2    1.8058336e-07
   3051313   4137   0   2   -6.0994744e-06
   3051313   4237   0   2   -1.3622335e-06
   3051212   4137   0   2    1.3582781e-06
   3051212   4237   0   2    2.9548065e-07
   3051414   4137   0   2    1.3582781e-06
   3051414   4237   0   2    2.9548065e-07
   3051616   4137   0   2    1.3583325e-06
   3051616   4237   0   2    2.9548067e-07

DECAY 23  2.4952


DECAY 24  2.085


DECAY 2000011  6.6795636
    0.99999831   2    1000022    11

DECAY 1000011  34.511735
    0.58828245   2   -1000024    12
    0.29567501   2    1000023    11
    0.1127598   2    1000022    11
    0.0026556109   2   -1000037    12
    0.00061029862   2    1000035    11

DECAY 2000013  6.6795616
    0.99999787   2    1000022    13

DECAY 1000013  34.512859
    0.588263   2   -1000024    14
    0.29566538   2    1000023    13
    0.11275612   2    1000022    13
    0.002655522   2   -1000037    14
    0.00062245946   2    1000035    13

DECAY 1000015  6.3115983
    0.99983135   2    1000022    15
    0.00011229932   2   -1000024    16

DECAY 2000015  36.532409
    0.58337734   2   -1000024    16
    0.29324968   2    1000023    15
    0.11003696   2    1000022    15
    0.0041922461   2    1000035    15
    0.0036038692   2    1000025    15
    0.0027635669   2   -1000037    16
    0.0013885432   2    1000015    25
    0.0013877997   2    1000015    23

DECAY 1000012  34.517948
    0.59047774   2    1000024    11
    0.29390794   2    1000023    12
    0.11325092   2    1000022    12
    0.0011716482   2    1000035    12
    0.0011144897   2    1000037    11

DECAY 1000014  34.518782
    0.59046355   2    1000024    13
    0.29390069   2    1000023    14
    0.11324815   2    1000022    14
    0.0011716189   2    1000035    14
    0.0011387206   2    1000037    13

DECAY 1000016  36.539883
    0.58572042   2    1000024    15
    0.29148672   2    1000023    16
    0.11051046   2    1000022    16
    0.0082222731   2    1000037    15
    0.002772951   2    1000015    24
    0.0012075645   2    1000035    16

DECAY 1000001  0.0004306174
    1   2    1000022    1

DECAY 2000001  110.82282
    0.97706205   2    1000021    1
    0.022928755   2    1000022    1

DECAY 1000003  0.00043061408
    1   2    1000022    3

DECAY 2000003  110.82397
    0.9770517   2    1000021    3
    0.022928519   2    1000022    3

DECAY 1000005  19.887622
    0.48662777   2   -1000024    6
    0.25192095   2    1000023    5
    0.24052887   2   -1000037    6
    0.014605026   2    1000022    5
    0.003282817   2    1000035    5
    0.0030345718   2    1000025    5

DECAY 2000005  45.170525
    0.90093506   2    1000021    5
    0.04653663   2    1000022    5
    0.022376703   2   -1000037    6
    0.011314013   2    1000025    5
    0.011245493   2    1000035    5
    0.0030143159   2    1000005    25
    0.0019183327   2    1000006   -24
    0.0014332724   2    1000005    23
    0.00096526236   2    2000006   -24
    0.00017581141   2   -1000024    6

DECAY 1000002  0.00033603778
    1   2    1000022    2

DECAY 2000002  3.3928564
    0.9999978   2    1000022    2

DECAY 1000004  0.0003354903
    1   2    1000022    4

DECAY 2000004  3.3928577
    0.99999647   2    1000022    4

DECAY 1000006  17.535672
    0.36248925   2    1000024    5
    0.18115748   2    1000023    6
    0.13772764   2    1000025    6
    0.12623746   2    1000035    6
    0.11007164   2    1000022    6
    0.081283033   2    1000037    5
    0.0010334937   3    1000022    24    5

DECAY 2000006  20.835014
    0.22216139   2    1000037    5
    0.17239385   2    1000024    5
    0.14394036   2    1000022    6
    0.1234473   2    1000035    6
    0.11700059   2    1000025    6
    0.095979185   2    1000006    23
    0.087706745   2    1000023    6
    0.030068177   2    1000005    24
    0.0073024022   2    1000006    25

DECAY 1000024  31.798178
    0.25153793   2    1000002   -1
    0.25153755   2    1000004   -3
    0.24839818   2   -1000001    2
    0.24839812   2   -1000003    4
    0.00012391951   2    1000022    24

DECAY 1000037  10.358773
    0.2800667   2    1000023    24
    0.27987795   2    1000024    25
    0.25745558   2    1000024    23
    0.1219419   2    1000022    24
    0.014845451   2   -1000003    4
    0.014770791   2   -1000001    2
    0.0078883836   3    1000023   -5    6
    0.0062643063   2    1000004   -3
    0.0062267011   2    1000002   -1
    0.0059250014   3    1000022   -5    6
    0.0041731139   3    1000024    6   -6
    0.0005570438   2   -1000015    16

DECAY 1000022 -1


DECAY 1000023  31.787669
    0.12559202   2    1000002   -2
    0.12559202   2   -1000002    2
    0.12559145   2    1000004   -4
    0.12559145   2   -1000004    4
    0.12438074   2    1000001   -1
    0.12438074   2   -1000001    1
    0.12438065   2    1000003   -3
    0.12438065   2   -1000003    3

DECAY 1000025  14.773193
    0.28779   2    1000023    25
    0.18024407   2    1000024   -24
    0.18024407   2   -1000024    24
    0.17369692   2    1000023    23
    0.096141275   2    1000022    25
    0.069782814   2    1000022    23
    0.0032989496   3    1000024    5   -6
    0.0032989496   3   -1000024   -5    6
    0.0022061512   3    1000022    6   -6
    0.0014939783   3    1000023    6   -6
    0.00021568356   2    1000003   -3
    0.00021568356   2   -1000003    3
    0.00020253318   2    1000001   -1
    0.00020253318   2   -1000001    1
    0.0001916729   2    1000015   -15
    0.0001916729   2   -1000015    15
    0.00015190297   2    1000004   -4
    0.00015190297   2   -1000004    4
    0.0001247518   2    1000002   -2
    0.0001247518   2   -1000002    2

DECAY 1000035  9.8723838
    0.28163244   2    1000023    25
    0.26185561   2    1000024   -24
    0.26185561   2   -1000024    24
    0.094618564   2    1000022    25
    0.024837692   2    1000022    23
    0.01228079   2    1000023    23
    0.0087808301   3    1000024    5   -6
    0.0087808301   3   -1000024   -5    6
    0.0056426418   2    1000003   -3
    0.0056426418   2   -1000003    3
    0.0056231096   2    1000001   -1
    0.0056231096   2   -1000001    1
    0.0045857542   2    1000004   -4
    0.0045857542   2   -1000004    4
    0.0045437421   2    1000002   -2
    0.0045437421   2   -1000002    2
    0.0024572924   3    1000022    6   -6
    0.0014913761   3    1000023    6   -6
    0.00029657414   2    1000015   -15
    0.00029657414   2   -1000015    15

DECAY 1000021  433.56548
    0.096544105   2    1000002   -2
    0.096544105   2   -1000002    2
    0.09654408   2    1000004   -4
    0.09654408   2   -1000004    4
    0.096427997   2    1000001   -1
    0.096427997   2   -1000001    1
    0.096427983   2    1000003   -3
    0.096427983   2   -1000003    3
    0.034954213   2    2000002   -2
    0.034954213   2   -2000002    2
    0.034954195   2    2000004   -4
    0.034954195   2   -2000004    4
    0.021844861   2    1000006   -6
    0.021844861   2   -1000006    6
    0.014938475   2    1000005   -5
    0.014938475   2   -1000005    5
    0.0071923138   2    2000006   -6
    0.0071923138   2   -2000006    6

DECAY 25  0.0034332631
    0.63004277   2   -5    5
    0.1688702   2   -24    24
    0.074885083   2    21    21
    0.07215093   2   -15    15
    0.03115652   2   -4    4
    0.018905504   2    23    23
    0.0023270027   2    22    22
    0.0011741531   2    22    23
    0.00025025145   2   -13    13
    0.00023676411   2   -3    3
    6.5463032e-07   2   -1    1
    1.6057023e-07   2   -2    2
    5.6259841e-09   2   -11    11

DECAY 35  4.1376934
    0.63250327   2   -5    5
    0.22686379   2   -6    6
    0.13613317   2   -15    15
    0.0016221259   2    1000022    1000023
    0.00087851143   2    25    25
    0.00047114068   2   -13    13
    0.00041213928   2    1000022    1000022
    0.0002381637   2   -3    3
    0.00013410365   2   -1000001    1000001
    0.0001340969   2   -1000003    1000003
    0.00013265733   2   -2000004    1000004
    0.00013265733   2   -1000004    2000004
    9.1550023e-05   2   -1000002    1000002
    9.1434658e-05   2   -1000004    1000004
    8.2326563e-05   2    23    23
    5.1036555e-05   2    21    21
    2.4469205e-05   2   -24    24
    1.7914363e-06   2   -4    4
    6.5853122e-07   2   -1    1
    5.1127651e-07   2    22    22
    3.8807565e-07   2    22    23
    1.0581466e-08   2   -11    11
    5.1405209e-10   2   -2000002    1000002
    5.1405209e-10   2   -1000002    2000002
    9.2259069e-12   2   -2    2

DECAY 36  4.0503645
    0.63159717   2   -5    5
    0.2260912   2   -6    6
    0.1359354   2   -15    15
    0.0044678787   2    1000022    1000023
    0.00062264969   2    1000022    1000022
    0.00047045581   2   -13    13
    0.00023783886   2   -3    3
    0.00016339887   2    21    21
    0.00013793467   2    23    25
    0.00013543463   2   -2000004    1000004
    0.00013543463   2   -1000004    2000004
    1.73126e-06   2   -4    4
    1.5789927e-06   2    22    23
    1.2220585e-06   2    22    22
    6.5763253e-07   2   -1    1
    1.0566088e-08   2   -11    11
    5.248142e-10   2   -2000002    1000002
    5.248142e-10   2   -1000002    2000002
    8.917646e-12   2   -2    2
    6.6808309e-35   2    25    25

DECAY 37  4.432951
    0.86227424   2   -5    6
    0.12959464   2   -15    16
    0.0055893529   2    1000022    1000024
    0.00085490919   2   -5    4
    0.00045816331   2   -13    14
    0.00040616678   2   -3    6
    0.00020833894   2   -3    4
    0.00019763489   2   -1000001    1000002
    0.00019727765   2   -1000003    1000004
    0.00012627144   2    24    25
    3.4925626e-05   2   -1000003    2000004
    1.8614769e-05   2   -1    6
    1.0568127e-05   2   -1000003    1000002
    1.055454e-05   2   -1000001    1000004
    9.5891969e-06   2   -3    2
    6.1048937e-06   2   -5    2
    1.8685013e-06   2   -1000001    2000004
    5.6806168e-07   2   -1    2
    1.9665166e-07   2   -1    4
    1.0716487e-08   2   -11    12
    1.8349996e-10   2   -1000001    2000002
    9.8125663e-12   2   -1000003    2000002
    1.2106061e-12   2    24    36
    7.4424525e-13   2    24    35

DECAY 6  2.43
    1   2    5    24

DECAY 15 -1
