BLOCK SPINFO
   1   SPheno
   2   v4.0.5be

BLOCK SPHENOINFO
   1   2
   2   2

BLOCK MODSEL
   1   0

BLOCK MINPAR
   3    15.766206
   4    1

BLOCK EXTPAR
   0    2692.6866
   1    922.48788
   2   -4058.7812
   3    3870.5608
   11   -6580.1633
   12   -6309.3973
   13    4912.8258
   23    1676.9569
   25    15.103139
   26    2212.9675
   31    3219.5205
   32    3219.5205
   33    3853.9726
   34    1890.9011
   35    1890.9011
   36    1492.4367
   41    1939.9682
   42    1939.9682
   43    1546.9145
   44    4506.1087
   45    4506.1087
   46    4363.6394
   47    1265.9953
   48    1265.9953
   49    2982.2401

BLOCK SMINPUTS
   1    127.90897
   2    1.1663787e-05
   3    0.1184
   4    91.1876
   5    4.18
   6    173.2
   7    1.777
   8    0
   11    0.00051099893
   12    0
   13    0.10565837
   14    0
   21    0.005
   22    0.0025
   23    0.095
   24    1.27

BLOCK GAUGE Q=  2692.6866
   1    0.35536298
   2    0.66519887
   3    1.219778

BLOCK YU Q=  2692.6866
   1   1    8.4027304e-06
   2   2    0.004268587
   3   3    1.0151173

BLOCK YD Q=  2692.6866
   1   1    0.00025501627
   2   2    0.0048453091
   3   3    0.25289623

BLOCK YE Q=  2692.6866
   1   1    4.4502204e-05
   2   2    0.0092016443
   3   3    0.15475652

BLOCK AU Q=  2692.6866
   1   1    0
   2   2    0
   3   3   -6580.1641

BLOCK AD Q=  2692.6866
   1   1    0
   2   2    0
   3   3   -6309.3917

BLOCK AE Q=  2692.6866
   1   1    0
   2   2    0
   3   3    4912.8258

BLOCK MSOFT Q=  2692.6866
   1    922.48788
   2   -4058.7812
   3    3870.5608
   21    1985725.2
   22   -2938246.6
   31    3219.5205
   32    3219.5205
   33    3853.9726
   34    1890.9011
   35    1890.9011
   36    1492.4367
   41    1939.9682
   42    1939.9682
   43    1546.9145
   44    4506.1087
   45    4506.1087
   46    4363.6394
   47    1265.9953
   48    1265.9953
   49    2982.2401

BLOCK MASS
   6    173.2
   23    91.1876
   24    80.429995
   15    1.777
   25    124.96308
   35    2212.988
   36    2212.9675
   37    2214.6622
   1000001    2062.5212
   2000001    1365.1267
   1000002    2061.0037
   2000002    4582.4318
   1000003    2062.5211
   2000003    1365.126
   1000004    2061.0036
   2000004    4582.4313
   1000005    1674.7133
   2000005    3074.8024
   1000006    1662.1908
   2000006    4362.051
   1000011    3241.697
   2000011    1886.5316
   1000012    3240.3379
   1000013    3241.6947
   2000013    1886.5283
   1000014    3240.3355
   1000015    1487.1154
   2000015    3873.0506
   1000016    3871.8645
   1000021    3905.1522
   1000022    916.79147
   1000023   -1691.2284
   1000025    1693.4751
   1000035   -3992.681
   1000024    1691.6073
   1000037    3992.7324

BLOCK ALPHA
      -0.063628303

BLOCK HMIX Q=  2692.6866
   1    1676.9569
   2    15.103139
   3    243.37834
   4    4897224.9

BLOCK STOPMIX
   1   1    0.99827431
   1   2    0.058723048
   2   1   -0.058723048
   2   2    0.99827431

BLOCK SBOTMIX
   1   1    0.99995423
   1   2    0.0095678842
   2   1   -0.0095678842
   2   2    0.99995423

BLOCK STAUMIX
   1   1    0.0027721142
   1   2    0.99999616
   2   1   -0.99999616
   2   2    0.0027721142

BLOCK NMIX
   1   1   -0.9990324
   1   2   -0.00040521219
   1   3   -0.037861049
   1   4    0.022374828
   2   1    0.01095806
   2   2    0.02187335
   2   3   -0.70704763
   2   4   -0.70674262
   3   1    0.042592665
   3   2   -0.010323004
   3   3   -0.70610449
   3   4    0.70675013
   4   1    0.0002048853
   4   2   -0.99970737
   4   3   -0.0081634276
   4   4   -0.022770343

BLOCK UMIX
   1   1   -0.011744821
   1   2    0.99993103
   2   1   -0.99993103
   2   2   -0.011744821

BLOCK VMIX
   1   1    0.032663265
   1   2    0.99946641
   2   1    0.99946641
   2   2   -0.032663265

BLOCK HIGGSBOUNDSINPUTHIGGSCOUPLINGSFERMIONS
       0, 228.1048,3,36,15,15

BLOCK HIGGSBOUNDSINPUTHIGGSCOUPLINGSBOSONS
       0,4,36,21,21,23

BLOCK SPHENOLOWENERGY
   1    0.00032448629
   2    1.5900767e-06
   3    3.5260438e-05
   4    2.3884219e-15
   5    1.0203062e-10
   6    2.135624e-08
   7    7.997199e-14
   8    3.4163994e-09
   9    7.24559e-07
   10    9.6551662e-05
   11    0.99734171
   12    0.5418147
   13    19.358077
   14    0
   15    0
   16    0.0021567446
   17    2.2816527e-15
   18    2.4811329e-11
   19    8.2921813e-11
   20   -3.5347558e-16
   21   -1.5112198e-11
   22   -4.5083174e-09
   23    0
   24    0
   25    0
   26    0
   27    0
   28    0
   29    0
   30    0
   31    0
   39    2.8500169e-05
   40    0
   41    0
   42    0

BLOCK FWCOEF Q=  160
   305   4422   0   0   -0.18881911
   305   4422   0   2   -0.1919175
   305   4322   0   2   -6.9499588e-05
   305   6421   0   0   -0.095227835
   305   6421   0   2   -0.10529959
   305   6321   0   2   -0.00020682714
   3051111   4133   0   0    1.6124479
   3051111   4133   0   2    1.612667
   3051111   4233   0   2    8.9844929e-05
   3051111   4137   0   0   -4.43514
   3051111   4137   0   2   -4.4342698
   3051111   4237   0   2   -0.00067941449
   3051313   4133   0   0    1.6124479
   3051313   4133   0   2    1.6126669
   3051313   4233   0   2    8.9844889e-05
   3051313   4137   0   0   -4.43514
   3051313   4137   0   2   -4.4342699
   3051313   4237   0   2   -0.00067941451
   3051212   4137   0   0    1.5053501
   3051212   4137   0   2    1.5051616
   3051212   4237   0   2    0.00014738773
   3051414   4137   0   0    1.5053501
   3051414   4137   0   2    1.5051616
   3051414   4237   0   2    0.00014738773
   3051616   4137   0   0    1.5053501
   3051616   4137   0   2    1.5051618
   3051616   4237   0   2    0.00014738903

BLOCK IMFWCOEF Q=  160
   305   4422   0   0    3.8586001e-07
   305   4422   0   2   -5.3786062e-07
   305   4322   0   2    2.4974235e-06
   305   6421   0   0    3.3051462e-07
   305   6421   0   2   -1.4677165e-05
   305   6321   0   2    1.0637408e-06
   3051111   4133   0   2   -1.5775641e-06
   3051111   4233   0   2    1.7849612e-06
   3051111   4137   0   2    1.6214089e-05
   3051111   4237   0   2   -1.3497647e-05
   3051313   4133   0   2   -1.5775627e-06
   3051313   4233   0   2    1.7849608e-06
   3051313   4137   0   2    1.621409e-05
   3051313   4237   0   2   -1.3497647e-05
   3051212   4137   0   2   -3.5117032e-06
   3051212   4237   0   2    2.928089e-06
   3051414   4137   0   2   -3.5117033e-06
   3051414   4237   0   2    2.928089e-06
   3051616   4137   0   2   -3.5093468e-06
   3051616   4237   0   2    2.9280887e-06

DECAY 23  2.4952


DECAY 24  2.085


DECAY 2000011  5.5205571
    0.99987458   2    1000022    11
    0.00011747254   2    1000025    11

DECAY 1000011  3.4543626
    0.99737693   2    1000022    11
    0.001682182   2    1000023    11
    0.00060343468   2   -1000024    12
    0.00033744658   2    1000025    11

DECAY 2000013  5.5207807
    0.99983053   2    1000022    13
    0.00012832333   2    1000025    13

DECAY 1000013  3.45773
    0.99640663   2    1000022    13
    0.002098653   2    1000023    13
    0.00075332888   2    1000025    13
    0.00060284595   2   -1000024    14
    0.00013854287   2    2000013    25

DECAY 1000015  2.8665155
    1   2    1000022    15

DECAY 2000015  6.6422562
    0.65269243   2    1000022    15
    0.092218923   2    1000023    15
    0.090942007   2    1000025    15
    0.067547249   2    1000015    36
    0.067450085   2    1000015    35
    0.014601621   2    1000015    25
    0.014133531   2    1000015    23
    0.00041415287   2   -1000024    16

DECAY 1000012  3.4592004
    0.99240079   2    1000022    12
    0.0046558158   2    1000024    11
    0.002383278   2    1000025    12
    0.00056011749   2    1000023    12

DECAY 1000014  3.4620856
    0.99157275   2    1000022    14
    0.0054863106   2    1000024    13
    0.0023812874   2    1000025    14
    0.00055964966   2    1000023    14

DECAY 1000016  6.6431673
    0.65008778   2    1000022    16
    0.18538616   2    1000024    15
    0.13401452   2    1000015    37
    0.028244895   2    1000015    24
    0.0018355706   2    1000025    16
    0.00043107729   2    1000023    16

DECAY 2000001  0.22924937
    1   2    1000022    1

DECAY 1000001  0.18511921
    0.99478731   2    1000022    1
    0.0020899759   2    1000023    1
    0.0016705102   2    1000025    1
    0.0014495855   2   -1000024    2

DECAY 2000003  0.22924889
    1   2    1000022    3

DECAY 1000003  0.18547609
    0.99287733   2    1000022    3
    0.0023630484   2    1000023    3
    0.0019422259   2    1000025    3
    0.0018728009   2   -1000024    4
    0.00094459161   2    2000003    25

DECAY 1000005  0.11605117
    1   2    1000022    5

DECAY 2000005  6.790311
    0.27858908   2   -1000024    6
    0.20975604   2    1000022    5
    0.14002952   2    1000023    5
    0.13990543   2    1000025    5
    0.093719683   2    1000006   -24
    0.091932873   2    1000005    25
    0.046067373   2    1000005    23

DECAY 1000002  0.1881866
    0.98608671   2    1000022    2
    0.010955776   2    1000024    1
    0.002919364   2    1000023    2

DECAY 2000002  36.533747
    0.74196319   2    1000021    2
    0.25763288   2    1000022    2
    0.0003788301   2    1000025    2

DECAY 1000004  0.18836992
    0.98512851   2    1000022    4
    0.011490455   2    1000024    3
    0.0031332521   2    1000023    4
    0.00024778071   2    1000025    4

DECAY 2000004  36.53628
    0.74190901   2    1000021    4
    0.25761493   2    1000022    4
    0.00039577562   2    1000025    4

DECAY 1000006  0.15198316
    0.9811698   2    1000022    6
    0.01882919   3    1000022    24    5

DECAY 2000006  425.36353
    0.2832644   2    1000005    24
    0.20707567   2    1000006    25
    0.15148372   2    1000024    5
    0.14218696   2    1000006    23
    0.076060646   2    1000025    6
    0.075867016   2    1000023    6
    0.028033564   2    1000021    6
    0.02065453   2    1000022    6
    0.0075981845   2    1000005    37
    0.0039101182   2    1000006    35
    0.003859615   2    1000006    36

DECAY 1000024  1.1566524
    0.95741163   2    1000022    24
    0.020994321   3    1000022   -5    6
    0.017980944   2   -1000015    16
    0.0034875405   2    1000006   -5
    0.000124604   2   -2000003    4

DECAY 1000037  230.70344
    0.15639601   2    1000006   -5
    0.153752   2   -1000005    6
    0.12283875   2    1000004   -3
    0.12283874   2    1000002   -1
    0.12282143   2   -1000001    2
    0.12282139   2   -1000003    4
    0.033355159   2    1000024    25
    0.031164913   2    1000024    23
    0.030832992   2    1000025    24
    0.02976366   2    1000023    24
    0.0088677603   2    1000014   -13
    0.008867709   2    1000012   -11
    0.0088472901   2   -1000013    14
    0.0088472422   2   -1000011    12
    0.0077617942   2    1000024    36
    0.0077162994   2    1000024    35
    0.0075884641   2    37    1000025
    0.0059554257   2    37    1000023
    0.0034883767   3    1000024    6   -6
    0.0026236032   3    1000023   -5    6
    0.0021344028   3    1000025   -5    6
    0.00027054684   2    1000016   -15
    0.00026559622   2   -2000015    16

DECAY 1000022 -1


DECAY 1000023  1.8614012
    0.57504209   2    1000022    23
    0.40863563   2    1000022    25
    0.0055777548   2    1000015   -15
    0.0055777548   2   -1000015    15
    0.0043729654   3    1000022    6   -6
    0.00032798732   2    1000005   -5
    0.00032798732   2   -1000005    5

DECAY 1000025  1.0869042
    0.90300804   2    1000022    25
    0.065234644   2    1000022    23
    0.010022981   2    1000015   -15
    0.010022981   2   -1000015    15
    0.0090269124   3    1000022    6   -6
    0.00069055386   2    1000005   -5
    0.00069055386   2   -1000005    5
    0.00035692858   2    2000003   -3
    0.00035692858   2   -2000003    3
    0.00029046039   2    2000001   -1
    0.00029046039   2   -2000001    1

DECAY 1000035  238.75693
    0.076463741   2    1000006   -6
    0.076463741   2   -1000006    6
    0.074924852   2    1000005   -5
    0.074924852   2   -1000005    5
    0.059370076   2    1000004   -4
    0.059370076   2   -1000004    4
    0.059370051   2    1000002   -2
    0.059370051   2   -1000002    2
    0.059315194   2    1000003   -3
    0.059315194   2   -1000003    3
    0.059315189   2    1000001   -1
    0.059315189   2   -1000001    1
    0.034297715   2    1000025    25
    0.031080875   2    1000024   -24
    0.031080875   2   -1000024    24
    0.026591196   2    1000023    25
    0.023945284   2    1000025    23
    0.0073924862   2    1000023    35
    0.0057344037   2    37   -1000024
    0.0057344037   2   -37    1000024
    0.0056529424   2    1000025    35
    0.0053483212   2    1000023    23
    0.0042868451   2    1000014   -14
    0.0042868451   2   -1000014    14
    0.0042868206   2    1000012   -12
    0.0042868206   2   -1000012    12
    0.004271104   2    1000013   -13
    0.004271104   2   -1000013    13
    0.004271081   2    1000011   -11
    0.004271081   2   -1000011    11
    0.0030704647   3    1000024    5   -6
    0.0030704647   3   -1000024   -5    6
    0.0023304701   3    1000025    6   -6
    0.0020013754   3    1000023    6   -6
    0.00013069646   2    1000016   -16
    0.00013069646   2   -1000016    16
    0.00012810328   2    2000015   -15
    0.00012810328   2   -2000015    15
    0.00010393836   2    1000025    36

DECAY 1000021  589.23999
    0.07557864   2    2000003   -3
    0.07557864   2   -2000003    3
    0.075578618   2    2000001   -1
    0.075578618   2   -2000001    1
    0.065322328   2    1000005   -5
    0.065322328   2   -1000005    5
    0.064862007   2    1000006   -6
    0.064862007   2   -1000006    6
    0.051054799   2    1000004   -4
    0.051054799   2   -1000004    4
    0.051054799   2    1000002   -2
    0.051054799   2   -1000002    2
    0.050996748   2    1000003   -3
    0.050996748   2   -1000003    3
    0.050996743   2    1000001   -1
    0.050996743   2   -1000001    1
    0.014168553   2    2000005   -5
    0.014168553   2   -2000005    5
    0.00018648801   3    1000024    5   -6
    0.00018648801   3   -1000024   -5    6
    0.00015331152   3    1000023    6   -6
    0.00015002886   3    1000025    6   -6

DECAY 25  0.0038777112
    0.57391532   2   -5    5
    0.22768936   2   -24    24
    0.072272643   2    21    21
    0.06605377   2   -15    15
    0.028242844   2   -4    4
    0.027542605   2    23    23
    0.0023444334   2    22    22
    0.001493873   2    22    23
    0.00022907515   2   -13    13
    0.00021533282   2   -3    3
    5.9537224e-07   2   -1    1
    1.4554208e-07   2   -2    2
    5.1498641e-09   2   -11    11

DECAY 35  6.6477709
    0.78871238   2   -5    5
    0.16296144   2   -15    15
    0.047095841   2   -6    6
    0.00055901017   2   -13    13
    0.00025647887   2   -3    3
    0.00018234021   2    25    25
    0.00017524083   2    1000022    1000022
    3.1178084e-05   2    23    23
    1.4304174e-05   2   -24    24
    1.0349837e-05   2    21    21
    7.0903776e-07   2   -1    1
    6.4962251e-07   2   -4    4
    5.3862505e-08   2    22    22
    1.3932862e-08   2    22    23
    1.255627e-08   2   -11    11
    3.3490816e-12   2   -2    2

DECAY 36  6.4655175
    0.7903015   2   -5    5
    0.16328483   2   -15    15
    0.044780774   2   -6    6
    0.0006833629   2    1000022    1000022
    0.00056011956   2   -13    13
    0.00025700593   2   -3    3
    8.6258594e-05   2    21    21
    4.4444535e-05   2    23    25
    7.1049546e-07   2   -1    1
    6.0193623e-07   2   -4    4
    2.5870885e-07   2    22    22
    1.1595196e-07   2    22    23
    1.2581138e-08   2   -11    11
    3.1034705e-12   2   -2    2
    1.1815616e-38   2    25    25

DECAY 37  6.9169276
    0.83874221   2   -5    6
    0.15916356   2   -15    16
    0.0011686813   2   -5    4
    0.00056270032   2   -13    14
    0.00022368884   2   -3    4
    7.4618748e-05   2   -3    6
    4.1688234e-05   2    24    25
    1.0408596e-05   2   -3    2
    8.3455857e-06   2   -5    2
    3.407354e-06   2   -1    6
    6.1870648e-07   2   -1    2
    6.011076e-08   2   -1    4
    1.3161619e-08   2   -11    12
    2.7504965e-12   2    24    36
    2.5878559e-12   2    24    35

DECAY 6  2.43
    1   2    5    24

DECAY 15 -1
