# SUSY Les Houches Accord 2 - MSSM spectrum + Decays
# SPheno v4.0.5be
# W. Porod, Comput. Phys. Commun. 153 (2003) 275-315, hep-ph/0301101;
# W. Porod, F.~Staub, Comput. Phys. Commun. 183 (2012) 2458
#                     arXiv:1104.1573 [hep-ph] 
# in case of problems send email to porod@physik.uni-wuerzburg.de
# Created: 07.09.2021,  16:16
Block SPINFO         # Program information
     1   SPheno      # spectrum calculator
     2   v4.0.5be    # version number
#
Block SPhenoINFO     # SPheno specific information
    1      2         # using 2-loop RGEs
    2      2         # using pole masses for boundary conditions at mZ
Block MODSEL  # Model selection
    1    0    # general MSSM
Block MINPAR  # Input parameters
    3    1.87220737E+01  # tanb at m_Z    
    4   -1.00000000E+00  # Sign(mu)
Block EXTPAR  # non-universal input parameters
    0    2.35832681E+03  # scale for input parameters
    1    2.26983645E+02  # M_1
    2    4.55552256E+02  # M_2
    3    3.18429963E+03  # M_3
   11    5.93568444E+03  # A_t
   12    4.70039232E+02  # A_b
   13   -1.99504338E+03  # A_tau
   23   -2.80841035E+02  # mu
   25    1.79230749E+01  # tan(beta)
   26    3.30755075E+03  # m_A, pole mass
   31    1.00000000E+04  # M_L11
   32    1.00000000E+04  # M_L22
   33    1.00000000E+04  # M_L33
   34    1.00000000E+04  # M_E11
   35    1.00000000E+04  # M_E22
   36    1.00000000E+04  # M_E33
   41    1.00000000E+04  # M_Q11
   42    1.00000000E+04  # M_Q22
   43    2.45271689E+03  # M_Q33
   44    1.00000000E+04  # M_U11
   45    1.00000000E+04  # M_U22
   46    2.34090271E+03  # M_U33
   47    1.00000000E+04  # M_D11
   48    1.00000000E+04  # M_D22
   49    3.08428165E+03  # M_D33
Block SMINPUTS  # SM parameters
         1     1.27908970E+02  # alpha_em^-1(MZ)^MSbar
         2     1.16637870E-05  # G_mu [GeV^-2]
         3     1.18400000E-01  # alpha_s(MZ)^MSbar
         4     9.11876000E+01  # m_Z(pole)
         5     4.18000000E+00  # m_b(m_b), MSbar
         6     1.73200000E+02  # m_t(pole)
         7     1.77700000E+00  # m_tau(pole)
         8     0.00000000E+00  # m_nu_3
        11     5.10998930E-04  # m_e(pole)
        12     0.00000000E+00  # m_nu_1
        13     1.05658372E-01  # m_muon(pole)
        14     0.00000000E+00  # m_nu_2
        21     5.00000000E-03  # m_d(2 GeV), MSbar
        22     2.50000000E-03  # m_u(2 GeV), MSbar
        23     9.50000000E-02  # m_s(2 GeV), MSbar
        24     1.27000000E+00  # m_c(m_c), MSbar
Block gauge Q=  2.35832681E+03  # (SUSY scale)
   1    3.55362975E-01  # g'(Q)^DRbar
   2    6.65198874E-01  # g(Q)^DRbar
   3    1.21977796E+00  # g3(Q)^DRbar
Block Yu Q=  2.35832681E+03  # (SUSY scale)
  1  1     8.39741214E-06   # Y_u(Q)^DRbar
  2  2     4.26588537E-03   # Y_c(Q)^DRbar
  3  3     1.01447484E+00   # Y_t(Q)^DRbar
Block Yd Q=  2.35832681E+03  # (SUSY scale)
  1  1     3.02439308E-04   # Y_d(Q)^DRbar
  2  2     5.74634686E-03   # Y_s(Q)^DRbar
  3  3     2.99925023E-01   # Y_b(Q)^DRbar
Block Ye Q=  2.35832681E+03  # (SUSY scale)
  1  1     5.27778709E-05   # Y_e(Q)^DRbar
  2  2     1.09127898E-02   # Y_mu(Q)^DRbar
  3  3     1.83535172E-01   # Y_tau(Q)^DRbar
Block Au Q=  2.35832681E+03  # (SUSY scale)
  1  1     0.00000000E+00   # A_u(Q)^DRbar
  2  2     0.00000000E+00   # A_c(Q)^DRbar
  3  3     5.93568536E+03   # A_t(Q)^DRbar
Block Ad Q=  2.35832681E+03  # (SUSY scale)
  1  1     0.00000000E+00   # A_d(Q)^DRbar
  2  2     0.00000000E+00   # A_s(Q)^DRbar
  3  3     4.70039279E+02   # A_b(Q)^DRbar
Block Ae Q=  2.35832681E+03  # (SUSY scale)
  1  1     0.00000000E+00   # A_e(Q)^DRbar
  2  2     0.00000000E+00   # A_mu(Q)^DRbar
  3  3    -1.99504335E+03   # A_tau(Q)^DRbar
Block MSOFT Q=  2.35832681E+03  # soft SUSY breaking masses at Q
   1    2.26983645E+02  # M_1
   2    4.55552256E+02  # M_2
   3    3.18429963E+03  # M_3
  21    1.07466107E+07  # M^2_(H,d)
  22    8.88066655E+04  # M^2_(H,u)
  31    1.00000000E+04  # M_(L,11)
  32    1.00000000E+04  # M_(L,22)
  33    1.00000000E+04  # M_(L,33)
  34    1.00000000E+04  # M_(E,11)
  35    1.00000000E+04  # M_(E,22)
  36    1.00000000E+04  # M_(E,33)
  41    1.00000000E+04  # M_(Q,11)
  42    1.00000000E+04  # M_(Q,22)
  43    2.45271689E+03  # M_(Q,33)
  44    1.00000000E+04  # M_(U,11)
  45    1.00000000E+04  # M_(U,22)
  46    2.34090271E+03  # M_(U,33)
  47    1.00000000E+04  # M_(D,11)
  48    1.00000000E+04  # M_(D,22)
  49    3.08428165E+03  # M_(D,33)
Block MASS  # Mass spectrum
#   PDG code      mass          particle
         6     1.73200000E+02  # m_t(pole)
        23     9.11876000E+01  # m_Z(pole)
        24     8.04299946E+01  # W+
        15     1.77700000E+00  # m_tau(pole)
        25     1.28812110E+02  # h0
        35     3.30706119E+03  # H0
        36     3.30755075E+03  # A0
        37     3.30834258E+03  # H+
   1000001     1.00922075E+04  # ~d_L
   2000001     1.00674546E+04  # ~d_R
   1000002     1.00918471E+04  # ~u_L
   2000002     1.00706739E+04  # ~u_R
   1000003     1.00922107E+04  # ~s_L
   2000003     1.00674587E+04  # ~s_R
   1000004     1.00918503E+04  # ~c_L
   2000004     1.00706761E+04  # ~c_R
   1000005     2.46048416E+03  # ~b_1
   2000005     3.16869441E+03  # ~b_2
   1000006     2.17437621E+03  # ~t_1
   2000006     2.55783949E+03  # ~t_2
   1000011     1.00213504E+04  # ~e_L-
   2000011     1.00087026E+04  # ~e_R-
   1000012     1.00205933E+04  # ~nu_eL
   1000013     1.00213606E+04  # ~mu_L-
   2000013     1.00087225E+04  # ~mu_R-
   1000014     1.00206035E+04  # ~nu_muL
   1000015     1.00144673E+04  # ~tau_1-
   2000015     1.00243166E+04  # ~tau_2-
   1000016     1.00235505E+04  # ~nu_tauL
   1000021     3.56659980E+03  # ~g
   1000022     2.17985160E+02  # ~chi_10
   1000023     2.89028829E+02  # ~chi_20
   1000025     2.94096738E+02  # ~chi_30
   1000035     5.15574578E+02  # ~chi_40
   1000024     2.79600186E+02  # ~chi_1+
   1000037     5.15679958E+02  # ~chi_2+
# Higgs mixing
Block alpha # Effective Higgs mixing angle
          -5.34752742E-02   # alpha
Block Hmix Q=  2.35832681E+03  # Higgs mixing parameters
   1   -2.80841035E+02  # mu
   2    1.79230749E+01  # tan[beta](Q)
   3    2.43459594E+02  # v(Q)
   4    1.09398920E+07  # m^2_A(Q)
Block stopmix # stop mixing matrix
   1  1    -5.27156406E-01   # Re[R_st(1,1)]
   1  2     8.49768276E-01   # Re[R_st(1,2)]
   2  1    -8.49768276E-01   # Re[R_st(2,1)]
   2  2    -5.27156406E-01   # Re[R_st(2,2)]
Block sbotmix # sbottom mixing matrix
   1  1    -9.99995537E-01   # Re[R_sb(1,1)]
   1  2     2.98758469E-03   # Re[R_sb(1,2)]
   2  1    -2.98758469E-03   # Re[R_sb(2,1)]
   2  2    -9.99995537E-01   # Re[R_sb(2,2)]
Block staumix # stau mixing matrix
   1  1    -2.72786976E-02   # Re[R_sta(1,1)]
   1  2     9.99627867E-01   # Re[R_sta(1,2)]
   2  1    -9.99627867E-01   # Re[R_sta(2,1)]
   2  2    -2.72786976E-02   # Re[R_sta(2,2)]
Block Nmix # neutralino mixing matrix
   1  1    -8.94319783E-01   # Re[N(1,1)]
   1  2     6.93239508E-02   # Re[N(1,2)]
   1  3     3.56127301E-01   # Re[N(1,3)]
   1  4     2.61838999E-01   # Re[N(1,4)]
   2  1    -4.41600490E-01   # Re[N(2,1)]
   2  2    -2.25849877E-01   # Re[N(2,2)]
   2  3    -6.12381850E-01   # Re[N(2,3)]
   2  4    -6.15604834E-01   # Re[N(2,4)]
   3  1     6.34880011E-02   # Re[N(3,1)]
   3  2    -7.69207023E-02   # Re[N(3,2)]
   3  3     6.96710353E-01   # Re[N(3,3)]
   3  4    -7.10385221E-01   # Re[N(3,4)]
   4  1    -3.39176502E-02   # Re[N(4,1)]
   4  2     9.68642983E-01   # Re[N(4,2)]
   4  3    -1.12944675E-01   # Re[N(4,3)]
   4  4    -2.18686682E-01   # Re[N(4,4)]
Block Umix # chargino mixing matrix
   1  1    -1.60088552E-01   # Re[U(1,1)]
   1  2    -9.87102657E-01   # Re[U(1,2)]
   2  1     9.87102657E-01   # Re[U(2,1)]
   2  2    -1.60088552E-01   # Re[U(2,2)]
Block Vmix # chargino mixing matrix
   1  1    -3.08990288E-01   # Re[V(1,1)]
   1  2     9.51065193E-01   # Re[V(1,2)]
   2  1     9.51065193E-01   # Re[V(2,1)]
   2  2     3.08990288E-01   # Re[V(2,2)]
DECAY        23     2.49520000E+00   # Z
DECAY        24     2.08500000E+00   # W
DECAY   2000011     5.02349193E+01   # ~e^-_R
#    BR                NDA      ID1      ID2
     7.99926592E-01    2     1000022        11   # BR(~e^-_R -> chi^0_1 e^-)
     1.94899638E-01    2     1000023        11   # BR(~e^-_R -> chi^0_2 e^-)
     4.02819206E-03    2     1000025        11   # BR(~e^-_R -> chi^0_3 e^-)
     1.14556630E-03    2     1000035        11   # BR(~e^-_R -> chi^0_4 e^-)
DECAY   1000011     1.44224509E+02   # ~e^-_L
#    BR                NDA      ID1      ID2
     5.09725213E-02    2     1000022        11   # BR(~e^-_L -> chi^0_1 e^-)
     6.51034312E-02    2     1000023        11   # BR(~e^-_L -> chi^0_2 e^-)
     5.64628935E-04    2     1000025        11   # BR(~e^-_L -> chi^0_3 e^-)
     2.74861527E-01    2     1000035        11   # BR(~e^-_L -> chi^0_4 e^-)
     1.56518070E-02    2    -1000024        12   # BR(~e^-_L -> chi^-_1 nu_e)
     5.92846085E-01    2    -1000037        12   # BR(~e^-_L -> chi^-_2 nu_e)
#    BR                NDA      ID1      ID2       ID3
DECAY   2000013     5.02823651E+01   # ~mu^-_R
#    BR                NDA      ID1      ID2
     7.99233142E-01    2     1000022        13   # BR(~mu^-_R -> chi^0_1 mu^-)
     1.94892668E-01    2     1000023        13   # BR(~mu^-_R -> chi^0_2 mu^-)
     4.25290982E-03    2     1000025        13   # BR(~mu^-_R -> chi^0_3 mu^-)
     1.15047129E-03    2     1000035        13   # BR(~mu^-_R -> chi^0_4 mu^-)
     4.58787108E-04    2    -1000024        14   # BR(~mu^-_R -> chi^-_1 nu_mu)
DECAY   1000013     1.44248360E+02   # ~mu^-_L
#    BR                NDA      ID1      ID2
     5.09849990E-02    2     1000022        13   # BR(~mu^-_L -> chi^0_1 mu^-)
     6.51543565E-02    2     1000023        13   # BR(~mu^-_L -> chi^0_2 mu^-)
     6.44291916E-04    2     1000025        13   # BR(~mu^-_L -> chi^0_3 mu^-)
     2.74818448E-01    2     1000035        13   # BR(~mu^-_L -> chi^0_4 mu^-)
     1.56492350E-02    2    -1000024        14   # BR(~mu^-_L -> chi^-_1 nu_mu)
     5.92748669E-01    2    -1000037        14   # BR(~mu^-_L -> chi^-_2 nu_mu)
#    BR                NDA      ID1      ID2       ID3
DECAY   1000015     6.37301514E+01   # ~tau^-_1
#    BR                NDA      ID1      ID2
     6.46726719E-01    2     1000022        15   # BR(~tau^-_1 -> chi^0_1 tau^-)
     1.93045310E-01    2     1000023        15   # BR(~tau^-_1 -> chi^0_2 tau^-)
     5.30685493E-02    2     1000025        15   # BR(~tau^-_1 -> chi^0_3 tau^-)
     1.06991147E-03    2     1000035        15   # BR(~tau^-_1 -> chi^0_4 tau^-)
     1.05681175E-01    2    -1000024        16   # BR(~tau^-_1 -> chi^-_1 nu_tau)
     4.08335279E-04    2    -1000037        16   # BR(~tau^-_1 -> chi^-_2 nu_tau)
DECAY   2000015     1.50908060E+02   # ~tau^-_2
#    BR                NDA      ID1      ID2
     5.33207688E-02    2     1000022        15   # BR(~tau^-_2 -> chi^0_1 tau^-)
     7.89456176E-02    2     1000023        15   # BR(~tau^-_2 -> chi^0_2 tau^-)
     2.25907981E-02    2     1000025        15   # BR(~tau^-_2 -> chi^0_3 tau^-)
     2.63825691E-01    2     1000035        15   # BR(~tau^-_2 -> chi^0_4 tau^-)
     1.35958434E-02    2    -1000024        16   # BR(~tau^-_2 -> chi^-_1 nu_tau)
     5.67721281E-01    2    -1000037        16   # BR(~tau^-_2 -> chi^-_2 nu_tau)
#    BR                NDA      ID1      ID2       ID3
DECAY   1000012     1.44229449E+02   # ~nu_e
#    BR                NDA      ID1      ID2
     9.14420532E-02    2     1000022        12   # BR(~nu_e -> chi^0_1 nu_e)
     3.75030034E-03    2     1000025        12   # BR(~nu_e -> chi^0_3 nu_e)
     2.96186657E-01    2     1000035        12   # BR(~nu_e -> chi^0_4 nu_e)
     5.83023187E-02    2     1000024        11   # BR(~nu_e -> chi^+_1 e^-)
     5.50287760E-01    2     1000037        11   # BR(~nu_e -> chi^+_2 e^-)
#    BR                NDA      ID1      ID2       ID3
DECAY   1000014     1.44253298E+02   # ~nu_mu
#    BR                NDA      ID1      ID2
     9.14270285E-02    2     1000022        14   # BR(~nu_mu -> chi^0_1 nu_mu)
     3.74968414E-03    2     1000025        14   # BR(~nu_mu -> chi^0_3 nu_mu)
     2.96137994E-01    2     1000035        14   # BR(~nu_mu -> chi^0_4 nu_mu)
     5.84528489E-02    2     1000024        13   # BR(~nu_mu -> chi^+_1 mu^-)
     5.50201539E-01    2     1000037        13   # BR(~nu_mu -> chi^+_2 mu^-)
#    BR                NDA      ID1      ID2       ID3
DECAY   1000016     1.50978557E+02   # ~nu_tau
#    BR                NDA      ID1      ID2
     8.73801998E-02    2     1000022        16   # BR(~nu_tau -> chi^0_1 nu_tau)
     3.58371375E-03    2     1000025        16   # BR(~nu_tau -> chi^0_3 nu_tau)
     2.83030783E-01    2     1000035        16   # BR(~nu_tau -> chi^0_4 nu_tau)
     9.89971362E-02    2     1000024        15   # BR(~nu_tau -> chi^+_1 tau^-)
     5.26978630E-01    2     1000037        15   # BR(~nu_tau -> chi^+_2 tau^-)
#    BR                NDA      ID1      ID2       ID3
DECAY   2000001     6.13318930E+02   # ~d_R
#    BR                NDA      ID1      ID2
     7.32274449E-03    2     1000022         1   # BR(~d_R -> chi^0_1 d)
     1.78418920E-03    2     1000023         1   # BR(~d_R -> chi^0_2 d)
     9.90845659E-01    2     1000021         1   # BR(~d_R -> ~g d)
DECAY   1000001     7.44048272E+02   # ~d_L
#    BR                NDA      ID1      ID2
     3.11641052E-03    2     1000022         1   # BR(~d_L -> chi^0_1 d)
     1.29171907E-03    2     1000023         1   # BR(~d_L -> chi^0_2 d)
     4.63934852E-04    2     1000025         1   # BR(~d_L -> chi^0_3 d)
     5.64215507E-02    2     1000035         1   # BR(~d_L -> chi^0_4 d)
     3.05542646E-03    2    -1000024         2   # BR(~d_L -> chi^-_1 u)
     1.15736968E-01    2    -1000037         2   # BR(~d_L -> chi^-_2 u)
     8.19913990E-01    2     1000021         1   # BR(~d_L -> ~g d)
DECAY   2000003     6.13332491E+02   # ~s_R
#    BR                NDA      ID1      ID2
     7.32394827E-03    2     1000022         3   # BR(~s_R -> chi^0_1 s)
     1.78817614E-03    2     1000023         3   # BR(~s_R -> chi^0_2 s)
     9.90824387E-01    2     1000021         3   # BR(~s_R -> ~g s)
DECAY   1000003     7.44058865E+02   # ~s_L
#    BR                NDA      ID1      ID2
     3.11749313E-03    2     1000022         3   # BR(~s_L -> chi^0_1 s)
     1.29502800E-03    2     1000023         3   # BR(~s_L -> chi^0_2 s)
     4.68234085E-04    2     1000025         3   # BR(~s_L -> chi^0_3 s)
     5.64208778E-02    2     1000035         3   # BR(~s_L -> chi^0_4 s)
     3.05981686E-03    2    -1000024         4   # BR(~s_L -> chi^-_1 c)
     1.15735826E-01    2    -1000037         4   # BR(~s_L -> chi^-_2 c)
     8.19902724E-01    2     1000021         3   # BR(~s_L -> ~g s)
DECAY   1000005     1.09023947E+02   # ~b_1
#    BR                NDA      ID1      ID2
     1.02268879E-02    2     1000022         5   # BR(~b_1 -> chi^0_1 b)
     1.68269636E-02    2     1000023         5   # BR(~b_1 -> chi^0_2 b)
     1.97680286E-02    2     1000025         5   # BR(~b_1 -> chi^0_3 b)
     8.66849279E-02    2     1000035         5   # BR(~b_1 -> chi^0_4 b)
     4.06620351E-01    2    -1000024         6   # BR(~b_1 -> chi^-_1 t)
     2.20026911E-01    2    -1000037         6   # BR(~b_1 -> chi^-_2 t)
     2.39845931E-01    2     1000006       -24   # BR(~b_1 -> ~t_1 W^-)
DECAY   2000005     1.29018395E+01   # ~b_2
#    BR                NDA      ID1      ID2
     1.63081850E-01    2     1000022         5   # BR(~b_2 -> chi^0_1 b)
     1.88383360E-01    2     1000023         5   # BR(~b_2 -> chi^0_2 b)
     2.10537548E-01    2     1000025         5   # BR(~b_2 -> chi^0_3 b)
     5.90620975E-03    2     1000035         5   # BR(~b_2 -> chi^0_4 b)
     4.18274494E-01    2    -1000024         6   # BR(~b_2 -> chi^-_1 t)
     1.15046072E-02    2    -1000037         6   # BR(~b_2 -> chi^-_2 t)
     6.10265205E-04    2     1000006       -24   # BR(~b_2 -> ~t_1 W^-)
     4.45332454E-04    2     2000006       -24   # BR(~b_2 -> ~t_2 W^-)
     4.56921071E-04    2     1000005        23   # BR(~b_2 -> ~b_1 Z)
     7.99411683E-04    2     1000005        25   # BR(~b_2 -> ~b_1 h^0)
DECAY   2000002     6.30475448E+02   # ~u_R
#    BR                NDA      ID1      ID2
     2.85030249E-02    2     1000022         2   # BR(~u_R -> chi^0_1 u)
     6.94473502E-03    2     1000023         2   # BR(~u_R -> chi^0_2 u)
     1.43533937E-04    2     1000025         2   # BR(~u_R -> chi^0_3 u)
     9.64367885E-01    2     1000021         2   # BR(~u_R -> ~g u)
DECAY   1000002     7.44034392E+02   # ~u_L
#    BR                NDA      ID1      ID2
     4.82382868E-04    2     1000022         2   # BR(~u_L -> chi^0_1 u)
     5.52594139E-03    2     1000023         2   # BR(~u_L -> chi^0_2 u)
     2.56596871E-04    2     1000025         2   # BR(~u_L -> chi^0_3 u)
     5.50307432E-02    2     1000035         2   # BR(~u_L -> chi^0_4 u)
     1.13824146E-02    2     1000024         1   # BR(~u_L -> chi^+_1 d)
     1.07438632E-01    2     1000037         1   # BR(~u_L -> chi^+_2 d)
     8.19883289E-01    2     1000021         2   # BR(~u_L -> ~g u)
DECAY   2000004     6.30482909E+02   # ~c_R
#    BR                NDA      ID1      ID2
     2.85030875E-02    2     1000022         4   # BR(~c_R -> chi^0_1 c)
     6.94684394E-03    2     1000023         4   # BR(~c_R -> chi^0_2 c)
     1.46445187E-04    2     1000025         4   # BR(~c_R -> chi^0_3 c)
     9.64356756E-01    2     1000021         4   # BR(~c_R -> ~g c)
DECAY   1000004     7.44044955E+02   # ~c_L
#    BR                NDA      ID1      ID2
     4.82712650E-04    2     1000022         4   # BR(~c_L -> chi^0_1 c)
     5.52772071E-03    2     1000023         4   # BR(~c_L -> chi^0_2 c)
     2.59066711E-04    2     1000025         4   # BR(~c_L -> chi^0_3 c)
     5.50302143E-02    2     1000035         4   # BR(~c_L -> chi^0_4 c)
     1.13909019E-02    2     1000024         3   # BR(~c_L -> chi^+_1 s)
     1.07437367E-01    2     1000037         3   # BR(~c_L -> chi^+_2 s)
     8.19872017E-01    2     1000021         4   # BR(~c_L -> ~g c)
DECAY   1000006     8.47240456E+01   # ~t_1
#    BR                NDA      ID1      ID2
     3.64108412E-02    2     1000022         6   # BR(~t_1 -> chi^0_1 t)
     2.05753722E-01    2     1000023         6   # BR(~t_1 -> chi^0_2 t)
     2.40772608E-01    2     1000025         6   # BR(~t_1 -> chi^0_3 t)
     9.09603256E-02    2     1000035         6   # BR(~t_1 -> chi^0_4 t)
     2.61983221E-01    2     1000024         5   # BR(~t_1 -> chi^+_1 b)
     1.63919056E-01    2     1000037         5   # BR(~t_1 -> chi^+_2 b)
#    BR                NDA      ID1      ID2       ID3
     1.91995020E-04    3     1000022        24         5   # BR(~t_1 -> chi^0_1 W^+ b)
DECAY   2000006     1.22523024E+02   # ~t_2
#    BR                NDA      ID1      ID2
     6.37078281E-02    2     1000022         6   # BR(~t_2 -> chi^0_1 t)
     1.61154689E-01    2     1000023         6   # BR(~t_2 -> chi^0_2 t)
     2.18651908E-01    2     1000025         6   # BR(~t_2 -> chi^0_3 t)
     4.08104462E-02    2     1000035         6   # BR(~t_2 -> chi^0_4 t)
     2.15008572E-01    2     1000024         5   # BR(~t_2 -> chi^+_1 b)
     5.36269803E-02    2     1000037         5   # BR(~t_2 -> chi^+_2 b)
     4.99672093E-03    2     1000005        24   # BR(~t_2 -> ~b_1 W^+)
     1.82213955E-01    2     1000006        23   # BR(~t_2 -> ~t_1 Z)
     5.98289008E-02    2     1000006        25   # BR(~t_2 -> ~t_1 h^0)
DECAY   1000024     3.15504279E-04   # chi^+_1
#    BR                NDA      ID1      ID2       ID3
     3.33642376E-01    3     1000022        -1         2   # BR(chi^+_1 -> chi^0_1 d_bar u)
     3.33137048E-01    3     1000022        -3         4   # BR(chi^+_1 -> chi^0_1 s_bar c)
     1.11213602E-01    3     1000022       -11        12   # BR(chi^+_1 -> chi^0_1 e^+ nu_e)
     1.11213083E-01    3     1000022       -13        14   # BR(chi^+_1 -> chi^0_1 mu^+ nu_mu)
     1.10793891E-01    3     1000022       -15        16   # BR(chi^+_1 -> chi^0_1 tau^+ nu_tau)
DECAY   1000037     3.16834363E+00   # chi^+_2
#    BR                NDA      ID1      ID2
     1.33823167E-02    2     1000022        24   # BR(chi^+_2 -> chi^0_1 W^+)
     2.45012686E-01    2     1000023        24   # BR(chi^+_2 -> chi^0_2 W^+)
     3.13996503E-01    2     1000025        24   # BR(chi^+_2 -> chi^0_3 W^+)
     2.39738162E-01    2     1000024        23   # BR(chi^+_2 -> chi^+_1 Z)
     1.87729480E-01    2     1000024        25   # BR(chi^+_2 -> chi^+_1 h^0)
#    BR                NDA      ID1      ID2       ID3
DECAY   1000022     0.00000000E+00   # chi^0_1
DECAY   1000023     3.17781507E-05   # chi^0_2
#    BR                NDA      ID1      ID2
     3.31409757E-03    2     1000022        22   # BR(chi^0_2 -> chi^0_1 photon)
#    BR                NDA      ID1      ID2       ID3
     1.18102774E-01    3     1000022         2        -2   # BR(chi^0_2 -> chi^0_1 u u_bar)
     1.17752485E-01    3     1000022         4        -4   # BR(chi^0_2 -> chi^0_1 c c_bar)
     1.51408454E-01    3     1000022         1        -1   # BR(chi^0_2 -> chi^0_1 d d_bar)
     1.51406561E-01    3     1000022         3        -3   # BR(chi^0_2 -> chi^0_1 s s_bar)
     1.47873682E-01    3     1000022         5        -5   # BR(chi^0_2 -> chi^0_1 b b_bar)
     3.41375143E-02    3     1000022        11       -11   # BR(chi^0_2 -> chi^0_1 e^- e^+)
     3.41368626E-02    3     1000022        13       -13   # BR(chi^0_2 -> chi^0_1 mu^- mu^+)
     3.39385084E-02    3     1000022        15       -15   # BR(chi^0_2 -> chi^0_1 tau^- tau^+)
     2.02470004E-01    3     1000022        12       -12   # BR(chi^0_2 -> chi^0_1 nu_e nu_bar_e)
     9.53553368E-04    3     1000024         1        -2   # BR(chi^0_2 -> chi^+_1 d u_bar)
     9.53553368E-04    3    -1000024        -1         2   # BR(chi^0_2 -> chi^-_1 d_bar u)
     8.72716782E-04    3     1000024         3        -4   # BR(chi^0_2 -> chi^+_1 s c_bar)
     8.72716782E-04    3    -1000024        -3         4   # BR(chi^0_2 -> chi^-_1 s_bar c)
     3.17849945E-04    3     1000024        11       -12   # BR(chi^0_2 -> chi^+_1 e^- nu_bar_e)
     3.17849945E-04    3    -1000024       -11        12   # BR(chi^0_2 -> chi^-_1 e^+ nu_e)
     3.17650896E-04    3     1000024        13       -14   # BR(chi^0_2 -> chi^+_1 mu^- nu_bar_mu)
     3.17650896E-04    3    -1000024       -13        14   # BR(chi^0_2 -> chi^-_1 mu^+ nu_mu)
     2.67757303E-04    3     1000024        15       -16   # BR(chi^0_2 -> chi^+_1 tau^- nu_bar_tau)
     2.67757303E-04    3    -1000024       -15        16   # BR(chi^0_2 -> chi^-_1 tau^+ nu_tau)
DECAY   1000025     3.16374330E-03   # chi^0_3
#    BR                NDA      ID1      ID2
     2.82383288E-03    2     1000022        22   # BR(chi^0_3 -> chi^0_1 photon)
#    BR                NDA      ID1      ID2       ID3
     1.18559663E-01    3     1000022         2        -2   # BR(chi^0_3 -> chi^0_1 u u_bar)
     1.18268615E-01    3     1000022         4        -4   # BR(chi^0_3 -> chi^0_1 c c_bar)
     1.52016458E-01    3     1000022         1        -1   # BR(chi^0_3 -> chi^0_1 d d_bar)
     1.52014875E-01    3     1000022         3        -3   # BR(chi^0_3 -> chi^0_1 s s_bar)
     1.48747131E-01    3     1000022         5        -5   # BR(chi^0_3 -> chi^0_1 b b_bar)
     3.43057188E-02    3     1000022        11       -11   # BR(chi^0_3 -> chi^0_1 e^- e^+)
     3.43051142E-02    3     1000022        13       -13   # BR(chi^0_3 -> chi^0_1 mu^- mu^+)
     3.41243661E-02    3     1000022        15       -15   # BR(chi^0_3 -> chi^0_1 tau^- tau^+)
     2.03292496E-01    3     1000022        12       -12   # BR(chi^0_3 -> chi^0_1 nu_e nu_bar_e)
     2.60772026E-04    3     1000024         1        -2   # BR(chi^0_3 -> chi^+_1 d u_bar)
     2.60772026E-04    3    -1000024        -1         2   # BR(chi^0_3 -> chi^-_1 d_bar u)
     2.51205275E-04    3     1000024         3        -4   # BR(chi^0_3 -> chi^+_1 s c_bar)
     2.51205275E-04    3    -1000024        -3         4   # BR(chi^0_3 -> chi^-_1 s_bar c)
DECAY   1000035     3.95891476E+00   # chi^0_4
#    BR                NDA      ID1      ID2
     2.09700132E-01    2     1000024       -24   # BR(chi^0_4 -> chi^+_1 W^-)
     2.09700132E-01    2    -1000024        24   # BR(chi^0_4 -> chi^-_1 W^+)
     2.09154331E-03    2     1000022        23   # BR(chi^0_4 -> chi^0_1 Z)
     1.93436220E-02    2     1000023        23   # BR(chi^0_4 -> chi^0_2 Z)
     2.37099305E-01    2     1000025        23   # BR(chi^0_4 -> chi^0_3 Z)
     6.20554238E-03    2     1000022        25   # BR(chi^0_4 -> chi^0_1 h^0)
     1.25833270E-01    2     1000023        25   # BR(chi^0_4 -> chi^0_2 h^0)
     1.89859839E-01    2     1000025        25   # BR(chi^0_4 -> chi^0_3 h^0)
#    BR                NDA      ID1      ID2       ID3
DECAY   1000021     1.01196668E+02   # ~g
#    BR                NDA      ID1      ID2
     1.54065642E-04    2     1000006        -4   # BR(~g -> ~t_1 c_bar)
     1.54065642E-04    2    -1000006         4   # BR(~g -> ~t^*_1 c)
     2.33289037E-01    2     1000006        -6   # BR(~g -> ~t_1 t_bar)
     2.33289037E-01    2    -1000006         6   # BR(~g -> ~t^*_1 t)
     1.00043319E-01    2     2000006        -6   # BR(~g -> ~t_2 t_bar)
     1.00043319E-01    2    -2000006         6   # BR(~g -> ~t^*_2 t)
     1.43270721E-01    2     1000005        -5   # BR(~g -> ~b_1 b_bar)
     1.43270721E-01    2    -1000005         5   # BR(~g -> ~b^*_1 b)
     2.31502164E-02    2     2000005        -5   # BR(~g -> ~b_2 b_bar)
     2.31502164E-02    2    -2000005         5   # BR(~g -> ~b^*_2 b)
#    BR                NDA      ID1      ID2       ID3
DECAY        25     3.96553766E-03   # Gamma(h0)
     2.60129249E-03   2        22        22   # BR(h0 -> photon photon)
     2.02492297E-03   2        22        23   # BR(h0 -> photon Z)
     4.28885330E-02   2        23        23   # BR(h0 -> Z Z)
     3.29993863E-01   2       -24        24   # BR(h0 -> W W)
     7.70794282E-02   2        21        21   # BR(h0 -> gluon gluon)
     4.22566160E-09   2       -11        11   # BR(h0 -> Electron electron)
     1.87966700E-04   2       -13        13   # BR(h0 -> Muon muon)
     5.42015536E-02   2       -15        15   # BR(h0 -> Tau tau)
     1.19417952E-07   2        -2         2   # BR(h0 -> Up up)
     2.31798266E-02   2        -4         4   # BR(h0 -> Charm charm)
     4.86479097E-07   2        -1         1   # BR(h0 -> Down down)
     1.75948210E-04   2        -3         3   # BR(h0 -> Strange strange)
     4.67666055E-01   2        -5         5   # BR(h0 -> Bottom bottom)
DECAY        35     5.55380409E+01   # Gamma(HH)
     3.41338066E-08   2        22        22   # BR(HH -> photon photon)
     1.40802012E-07   2        22        23   # BR(HH -> photon Z)
     1.54806026E-06   2        23        23   # BR(HH -> Z Z)
     4.12105713E-07   2       -24        24   # BR(HH -> W W)
     8.23509183E-07   2        21        21   # BR(HH -> gluon gluon)
     2.70810430E-09   2       -11        11   # BR(HH -> Electron electron)
     1.20582069E-04   2       -13        13   # BR(HH -> Muon muon)
     3.48260936E-02   2       -15        15   # BR(HH -> Tau tau)
     3.69761829E-13   2        -2         2   # BR(HH -> Up up)
     7.17313273E-08   2        -4         4   # BR(HH -> Charm charm)
     5.55469353E-03   2        -6         6   # BR(HH -> Top top)
     1.97896755E-07   2        -1         1   # BR(HH -> Down down)
     7.15833239E-05   2        -3         3   # BR(HH -> Strange strange)
     2.00451540E-01   2        -5         5   # BR(HH -> Bottom bottom)
     5.77550249E-02   2  -1000024   1000024   # BR(HH -> Chargino1 chargino1)
     1.92999046E-01   2  -1000024   1000037   # BR(HH -> Chargino1 chargino2)
     1.92999046E-01   2  -1000037   1000024   # BR(HH -> Chargino2 chargino1)
     1.70964166E-02   2  -1000037   1000037   # BR(HH -> Chargino2 chargino2)
     2.16338180E-02   2   1000022   1000022   # BR(HH -> neutralino1 neutralino1)
     3.02135977E-02   2   1000022   1000023   # BR(HH -> neutralino1 neutralino2)
     2.51010301E-02   2   1000022   1000025   # BR(HH -> neutralino1 neutralino3)
     1.93001623E-02   2   1000022   1000035   # BR(HH -> neutralino1 neutralino4)
     3.20553033E-05   2   1000023   1000023   # BR(HH -> neutralino2 neutralino2)
     9.73665034E-04   2   1000023   1000025   # BR(HH -> neutralino2 neutralino3)
     8.58736377E-02   2   1000023   1000035   # BR(HH -> neutralino2 neutralino4)
     2.62091589E-03   2   1000025   1000025   # BR(HH -> neutralino3 neutralino3)
     1.03157738E-01   2   1000025   1000035   # BR(HH -> neutralino3 neutralino4)
     9.20655135E-03   2   1000035   1000035   # BR(HH -> neutralino4 neutralino4)
     9.57050457E-06   2        25        25   # BR(HH -> h0 h0)
DECAY        36     5.49296347E+01   # Gamma(A0)
     7.93183680E-09   2        22        22   # BR(A0 -> photon photon)
     1.02002094E-07   2        22        23   # BR(A0 -> photon Z)
     9.64712579E-06   2        21        21   # BR(A0 -> gluon gluon)
     2.61317285E-09   2       -11        11   # BR(A0 -> Electron electron)
     1.16355256E-04   2       -13        13   # BR(A0 -> Muon muon)
     3.36053642E-02   2       -15        15   # BR(A0 -> Tau tau)
     3.45793518E-13   2        -2         2   # BR(A0 -> Up up)
     6.70788283E-08   2        -4         4   # BR(A0 -> Charm charm)
     5.25992175E-03   2        -6         6   # BR(A0 -> Top top)
     1.90955372E-07   2        -1         1   # BR(A0 -> Down down)
     6.90727069E-05   2        -3         3   # BR(A0 -> Strange strange)
     1.93421319E-01   2        -5         5   # BR(A0 -> Bottom bottom)
     5.35608337E-02   2  -1000024   1000024   # BR(A0 -> Chargino1 chargino1)
     1.99950436E-01   2  -1000024   1000037   # BR(A0 -> Chargino1 chargino2)
     1.99950436E-01   2  -1000037   1000024   # BR(A0 -> Chargino2 chargino1)
     1.25865196E-02   2  -1000037   1000037   # BR(A0 -> Chargino2 chargino2)
     1.89882122E-02   2   1000022   1000022   # BR(A0 -> neutralino1 neutralino1)
     2.52574371E-02   2   1000022   1000023   # BR(A0 -> neutralino1 neutralino2)
     3.23309378E-02   2   1000022   1000025   # BR(A0 -> neutralino1 neutralino3)
     1.83898110E-02   2   1000022   1000035   # BR(A0 -> neutralino1 neutralino4)
     2.69604833E-05   2   1000023   1000023   # BR(A0 -> neutralino2 neutralino2)
     7.22499584E-04   2   1000023   1000025   # BR(A0 -> neutralino2 neutralino3)
     7.37978959E-02   2   1000023   1000035   # BR(A0 -> neutralino2 neutralino4)
     3.40161447E-03   2   1000025   1000025   # BR(A0 -> neutralino3 neutralino3)
     1.21657559E-01   2   1000025   1000035   # BR(A0 -> neutralino3 neutralino4)
     6.89405012E-03   2   1000035   1000035   # BR(A0 -> neutralino4 neutralino4)
     2.74608517E-06   2        23        25   # BR(A0 -> Z h0)
     1.25929969E-39   2        25        25   # BR(A0 -> h0 h0)
DECAY        37     5.83022862E+01   # Gamma(Hp)
     3.28922404E-09   2       -11        12   # BR(Hp -> Electron nu_e)
     1.40624601E-04   2       -13        14   # BR(Hp -> Muon nu_mu)
     3.97766386E-02   2       -15        16   # BR(Hp -> Tau nu_tau)
     2.08398749E-07   2        -1         2   # BR(Hp -> Down up)
     3.52184909E-06   2        -3         2   # BR(Hp -> Strange up)
     2.44433749E-06   2        -5         2   # BR(Hp -> Bottom up)
     1.35096423E-08   2        -1         4   # BR(Hp -> Down charm)
     7.51896913E-05   2        -3         4   # BR(Hp -> Strange charm)
     3.42294849E-04   2        -5         4   # BR(Hp -> Bottom charm)
     4.12565695E-07   2        -1         6   # BR(Hp -> Down top)
     9.10675951E-06   2        -3         6   # BR(Hp -> Strange top)
     2.37115971E-01   2        -5         6   # BR(Hp -> Bottom top)
     5.29587175E-02   2   1000022   1000024   # BR(Hp -> neutralino1 chargino1)
     4.16936721E-02   2   1000022   1000037   # BR(Hp -> neutralino1 chargino2)
     2.46962056E-02   2   1000023   1000024   # BR(Hp -> neutralino2 chargino1)
     1.90318146E-01   2   1000023   1000037   # BR(Hp -> neutralino2 chargino2)
     1.27029002E-02   2   1000024   1000025   # BR(Hp -> chargino1 neutralino3)
     1.99824238E-01   2   1000025   1000037   # BR(Hp -> neutralino3 chargino2)
     2.00324263E-01   2   1000024   1000035   # BR(Hp -> chargino1 neutralino4)
     1.28377572E-05   2   1000035   1000037   # BR(Hp -> neutralino4 chargino2)
     2.59042016E-06   2        24        25   # BR(Hp -> W h0)
     8.06694191E-14   2        24        35   # BR(Hp -> W HH)
DECAY         6     2.43000000E+00   # top
#    BR                NDA      ID1      ID2
     1.00000000E+00    2           5        24   # BR(t -> b W)
Block HiggsBoundsInputHiggsCouplingsFermions
# ScalarNormEffCoupSq PseudoSNormEffCoupSq NP IP1 IP2 IP2
    9.20591405E-01    0.00000000E+00        3  25   5   5  # h0-b-b eff. coupling^2, normalised to SM
    3.21316022E+02    0.00000000E+00        3  35   5   5  # H0-b-b eff. coupling^2, normalised to SM
    0.00000000E+00    3.21236614E+02        3  36   5   5  # A0-b-b eff. coupling^2, normalised to SM
#
    1.00024720E+00    0.00000000E+00        3  25   6   6  # h0-t-t eff. coupling^2, normalised to SM
    2.86577359E-03    0.00000000E+00        3  35   6   6  # H0-t-t eff. coupling^2, normalised to SM
    0.00000000E+00    3.11297018E-03        3  36   6   6  # A0-t-t eff. coupling^2, normalised to SM
#
    9.20591405E-01    0.00000000E+00        3  25  15  15  # h0-tau-tau eff. coupling^2, normalised to SM
    3.21316022E+02    0.00000000E+00        3  35  15  15  # H0-tau-tau eff. coupling^2, normalised to SM
    0.00000000E+00    3.21236614E+02        3  36  15  15  # A0-tau-tau eff. coupling^2, normalised to SM
#
Block HiggsBoundsInputHiggsCouplingsBosons
    9.99994888E-01        3  25  24  24  # h0-W-W eff. coupling^2, normalised to SM
    5.11182466E-06        3  35  24  24  # H0-W-W eff. coupling^2, normalised to SM
    0.00000000E+00        3  36  24  24  # A0-W-W eff. coupling^2, normalised to SM
#
    9.99994888E-01        3  25  23  23  # h0-Z-Z eff. coupling^2, normalised to SM
    5.11182466E-06        3  35  23  23  # H0-Z-Z eff. coupling^2, normalised to SM
    0.00000000E+00        3  36  23  23  # A0-Z-Z eff. coupling^2, normalised to SM
#
    1.25407251E+00        3  25  21  21  # h0-g-g eff. coupling^2, normalised to SM
    8.94729395E-04        3  35  21  21  # H0-g-g eff. coupling^2, normalised to SM
    9.63628415E-02        3  36  21  21  # A0-g-g eff. coupling^2, normalised to SM
#
    0.00000000E+00        3  25  25  23  # h0-h0-Z eff. coupling^2, normalised to SM
    0.00000000E+00        3  35  25  23  # H0-h0-Z eff. coupling^2, normalised to SM
    5.11182466E-06        3  36  25  23  # A0-h0-Z eff. coupling^2, normalised to SM
    0.00000000E+00        3  35  35  23  # H0-H0-Z eff. coupling^2, normalised to SM
    9.99994888E-01        3  36  35  23  # A0-H0-Z eff. coupling^2, normalised to SM
    0.00000000E+00        3  36  36  23  # A0-A0-Z eff. coupling^2, normalised to SM
#
    0.00000000E+00        4  25  21  21  23  # h0-g-g-Z eff. coupling^2, normalised to SM
    0.00000000E+00        4  35  21  21  23  # H0-g-g-Z eff. coupling^2, normalised to SM
    0.00000000E+00        4  36  21  21  23  # A0-g-g-Z eff. coupling^2, normalised to SM
Block SPhenoLowEnergy  # low energy observables
    1    3.11650036E-04   # BR(b -> s gamma)
    2    1.59076172E-06   # BR(b -> s mu+ mu-)
    3    3.52354804E-05   # BR(b -> s nu nu)
    4    2.89661543E-15   # BR(Bd -> e+ e-)
    5    1.23739964E-10   # BR(Bd -> mu+ mu-)
    6    2.58944297E-08   # BR(Bd -> tau+ tau-)
    7    9.81452867E-14   # BR(Bs -> e+ e-)
    8    4.19275809E-09   # BR(Bs -> mu+ mu-)
    9    8.88996630E-07   # BR(Bs -> tau+ tau-)
   10    9.66321435E-05   # BR(B_u -> tau nu)
   11    9.98173047E-01   # BR(B_u -> tau nu)/BR(B_u -> tau nu)_SM
   12    5.42339205E-01   # |Delta(M_Bd)| [ps^-1] 
   13    1.93774437E+01   # |Delta(M_Bs)| [ps^-1] 
   14    0.00000000E+00   # neutron EDM according to the chiral quark model
   15    0.00000000E+00   # neutron EDM according to the relativistic quark-parton model
   16    2.15873284E-03   # epsilon_K
   17    2.28167261E-15   # Delta(M_K)
   18    2.47938575E-11   # BR(K^0 -> pi^0 nu nu)
   19    8.28886639E-11   # BR(K^+ -> pi^+ nu nu)
   20   -1.78491994E-16   # Delta(g-2)_electron/2
   21   -7.63110673E-12   # Delta(g-2)_muon/2
   22   -2.15983426E-09   # Delta(g-2)_tau/2
   23    0.00000000E+00   # electric dipole moment of the electron
   24    0.00000000E+00   # electric dipole moment of the muon
   25    0.00000000E+00   # electric dipole moment of the tau
   26    0.00000000E+00   # Br(mu -> e gamma)
   27    0.00000000E+00   # Br(tau -> e gamma)
   28    0.00000000E+00   # Br(tau -> mu gamma)
   29    0.00000000E+00   # Br(mu -> 3 e)
   30    0.00000000E+00   # Br(tau -> 3 e)
   31    0.00000000E+00   # Br(tau -> 3 mu)
   39    4.46145286E-05   # Delta(rho_parameter)
   40    0.00000000E+00   # BR(Z -> e mu)
   41    0.00000000E+00   # BR(Z -> e tau)
   42    0.00000000E+00   # BR(Z -> mu tau)
Block FWCOEF Q=  1.60000000E+02  # Wilson coefficients at scale Q
#    id        order  M        value         comment
     0305 4422   00   0    -1.88819110E-01   # C7
     0305 4422   00   2    -1.77719573E-01   # C7
     0305 4322   00   2    -5.96490571E-05   # C7'
     0305 6421   00   0    -9.52278348E-02   # C8
     0305 6421   00   2    -9.32460600E-02   # C8
     0305 6321   00   2    -1.13536026E-04   # C8'
 03051111 4133   00   0     1.60783026E+00   # C9 e+e-
 03051111 4133   00   2     1.60832034E+00   # C9 e+e-
 03051111 4233   00   2     8.56018358E-05   # C9' e+e-
 03051111 4137   00   0    -4.43052236E+00   # C10 e+e-
 03051111 4137   00   2    -4.42719113E+00   # C10 e+e-
 03051111 4237   00   2    -6.50440448E-04   # C10' e+e-
 03051313 4133   00   0     1.60783026E+00   # C9 mu+mu-
 03051313 4133   00   2     1.60832030E+00   # C9 mu+mu-
 03051313 4233   00   2     8.56018200E-05   # C9' mu+mu-
 03051313 4137   00   0    -4.43052236E+00   # C10 mu+mu-
 03051313 4137   00   2    -4.42719117E+00   # C10 mu+mu-
 03051313 4237   00   2    -6.50440455E-04   # C10' mu+mu-
 03051212 4137   00   0     1.50535012E+00   # C11 nu_1 nu_1
 03051212 4137   00   2     1.50462867E+00   # C11 nu_1 nu_1
 03051212 4237   00   2     1.41247588E-04   # C11' nu_1 nu_1
 03051414 4137   00   0     1.50535012E+00   # C11 nu_2 nu_2
 03051414 4137   00   2     1.50462867E+00   # C11 nu_2 nu_2
 03051414 4237   00   2     1.41247590E-04   # C11' nu_2 nu_2
 03051616 4137   00   0     1.50535012E+00   # C11 nu_3 nu_3
 03051616 4137   00   2     1.50462867E+00   # C11 nu_3 nu_3
 03051616 4237   00   2     1.41248200E-04   # C11' nu_3 nu_3
Block IMFWCOEF Q=  1.60000000E+02  # Im(Wilson coefficients) at scale Q
#    id        order  M        value         comment
     0305 4422   00   0     3.85837209E-07   # C7
     0305 4422   00   2    -8.63732532E-06   # C7
     0305 4322   00   2     8.95522711E-07   # C7'
     0305 6421   00   0     3.30495087E-07   # C8
     0305 6421   00   2     3.96917156E-06   # C8
     0305 6321   00   2     5.23684605E-07   # C8'
 03051111 4133   00   2     3.23532921E-07   # C9 e+e-
 03051111 4233   00   2     1.66069019E-06   # C9' e+e-
 03051111 4137   00   2     6.42939138E-06   # C10 e+e-
 03051111 4237   00   2    -1.26204300E-05   # C10' e+e-
 03051313 4133   00   2     3.23532093E-07   # C9 mu+mu-
 03051313 4233   00   2     1.66069009E-06   # C9' mu+mu-
 03051313 4137   00   2     6.42939236E-06   # C10 mu+mu-
 03051313 4237   00   2    -1.26204303E-05   # C10' mu+mu-
 03051212 4137   00   2    -1.36103699E-06   # C11 nu_1 nu_1
 03051212 4237   00   2     2.74061387E-06   # C11' nu_1 nu_1
 03051414 4137   00   2    -1.36103695E-06   # C11 nu_2 nu_2
 03051414 4237   00   2     2.74061387E-06   # C11' nu_2 nu_2
 03051616 4137   00   2    -1.36102401E-06   # C11 nu_3 nu_3
 03051616 4237   00   2     2.74061387E-06   # C11' nu_3 nu_3
