BLOCK SPINFO
   1   SPheno
   2   v4.0.5be

BLOCK SPHENOINFO
   1   2
   2   2

BLOCK MODSEL
   1   0

BLOCK MINPAR
   3    51.960295
   4   -1

BLOCK EXTPAR
   0    1508.3525
   1    1945.2577
   2    409.07596
   3    3000
   11   -4788.1212
   12   -1992.3416
   13   -1148.1555
   23   -626.42491
   25    51.681754
   26    826.34088
   31    1848.0892
   32    1848.0892
   33    1194.1633
   34    1440.8031
   35    1440.8031
   36    1116.5155
   41    5000
   42    5000
   43    1797.7251
   44    5000
   45    5000
   46    1432.2465
   47    5000
   48    5000
   49    1010.5067

BLOCK SMINPUTS
   1    127.90897
   2    1.1663787e-05
   3    0.1184
   4    91.1876
   5    4.18
   6    173.2
   7    1.777
   8    0
   11    0.00051099893
   12    0
   13    0.10565837
   14    0
   21    0.005
   22    0.0025
   23    0.095
   24    1.27

BLOCK GAUGE Q=  1508.3525
   1    0.35536298
   2    0.66519887
   3    1.219778

BLOCK YU Q=  1508.3525
   1   1    8.3859415e-06
   2   2    0.0042600583
   3   3    1.0130891

BLOCK YD Q=  1508.3525
   1   1    0.00087090207
   2   2    0.016547139
   3   3    0.86366195

BLOCK YE Q=  1508.3525
   1   1    0.00015197878
   2   2    0.031424392
   3   3    0.52850657

BLOCK AU Q=  1508.3525
   1   1    0
   2   2    0
   3   3   -4788.1213

BLOCK AD Q=  1508.3525
   1   1    0
   2   2    0
   3   3   -1992.3417

BLOCK AE Q=  1508.3525
   1   1    0
   2   2    0
   3   3   -1148.1555

BLOCK MSOFT Q=  1508.3525
   1    1945.2577
   2    409.07596
   3    3000
   21    358009.89
   22   -353282.46
   31    1848.0892
   32    1848.0892
   33    1194.1633
   34    1440.8031
   35    1440.8031
   36    1116.5155
   41    5000
   42    5000
   43    1797.7251
   44    5000
   45    5000
   46    1432.2465
   47    5000
   48    5000
   49    1010.5067

BLOCK MASS
   6    173.2
   23    91.1876
   24    80.429995
   15    1.777
   25    121.26106
   35    826.23577
   36    826.34088
   37    833.12568
   1000001    5032.3428
   2000001    5021.5264
   1000002    5031.911
   2000002    5022.3359
   1000003    5032.3504
   2000003    5021.5347
   1000004    5031.9167
   2000004    5022.3366
   1000005    988.08263
   2000005    1738.0213
   1000006    1247.8558
   2000006    1823.2292
   1000011    1853.0486
   2000011    1448.2613
   1000012    1851.0175
   1000013    1853.0333
   2000013    1448.2233
   1000014    1850.9997
   1000015    1104.9923
   2000015    1198.8222
   1000016    1189.3986
   1000021    3195.4346
   1000022    425.15433
   1000023   -633.47493
   1000025    643.48489
   1000035    1936.147
   1000024    425.57867
   1000037    648.01559

BLOCK ALPHA
      -0.019334405

BLOCK HMIX Q=  1508.3525
   1   -626.42491
   2    51.681754
   3    243.96425
   4    682839.25

BLOCK STOPMIX
   1   1    0.40553148
   1   2    0.91408108
   2   1   -0.91408108
   2   2    0.40553148

BLOCK SBOTMIX
   1   1   -0.032006846
   1   2    0.99948765
   2   1   -0.99948765
   2   2   -0.032006846

BLOCK STAUMIX
   1   1   -0.26889865
   1   2    0.96316848
   2   1   -0.96316848
   2   2   -0.26889865

BLOCK NMIX
   1   1   -0.0043157146
   1   2    0.96414985
   1   3    0.22121958
   1   4    0.14648669
   2   1   -0.012588388
   2   2    0.05387762
   2   3   -0.70394684
   2   4    0.70809433
   3   1    0.023745396
   3   2    0.25982784
   3   3   -0.67487391
   3   4   -0.69026868
   4   1   -0.99962946
   4   2    0.0013309803
   4   3   -0.0081213223
   4   4   -0.025946278

BLOCK UMIX
   1   1   -0.95157866
   1   2   -0.30740535
   2   1    0.30740535
   2   2   -0.95157866

BLOCK VMIX
   1   1   -0.97908812
   1   2    0.2034366
   2   1    0.2034366
   2   2    0.97908812

BLOCK HIGGSBOUNDSINPUTHIGGSCOUPLINGSFERMIONS
       0, 2671.0037,3,36,15,15

BLOCK HIGGSBOUNDSINPUTHIGGSCOUPLINGSBOSONS
       0,4,36,21,21,23

BLOCK SPHENOLOWENERGY
   1    0.00045905355
   2    1.5979847e-06
   3    3.5283482e-05
   4    1.9814401e-14
   5    8.4538343e-10
   6    1.1554882e-07
   7    6.6226008e-13
   8    2.825709e-08
   9    3.9699029e-06
   10    5.9265412e-05
   11    0.61218902
   12    0.54270411
   13    19.046335
   14    0
   15    0
   16    0.0021753959
   17    2.2818676e-15
   18    2.4820939e-11
   19    8.2952383e-11
   20   -6.9713215e-15
   21   -2.980418e-10
   22   -1.4434367e-07
   23    0
   24    0
   25    0
   26    0
   27    0
   28    0
   29    0
   30    0
   31    0
   39    9.6367961e-05
   40    0
   41    0
   42    0

BLOCK FWCOEF Q=  160
   305   4422   0   0   -0.18881911
   305   4422   0   2   -0.33079378
   305   4322   0   2   -0.0015736688
   305   6421   0   0   -0.095227835
   305   6421   0   2   -0.19877384
   305   6321   0   2   -0.0012882506
   3051111   4133   0   0    1.5929012
   3051111   4133   0   2    1.5942213
   3051111   4233   0   2    9.4095498e-05
   3051111   4137   0   0   -4.4155932
   3051111   4137   0   2   -4.4168947
   3051111   4237   0   2   -0.00072720583
   3051313   4133   0   0    1.5929012
   3051313   4133   0   2    1.5942168
   3051313   4233   0   2    9.4023299e-05
   3051313   4137   0   0   -4.4155932
   3051313   4137   0   2   -4.4168993
   3051313   4237   0   2   -0.00072714169
   3051212   4137   0   0    1.5053501
   3051212   4137   0   2    1.5056536
   3051212   4237   0   2    0.0001584542
   3051414   4137   0   0    1.5053501
   3051414   4137   0   2    1.5056536
   3051414   4237   0   2    0.00015846948
   3051616   4137   0   0    1.5053501
   3051616   4137   0   2    1.5056546
   3051616   4237   0   2    0.00016277607

BLOCK IMFWCOEF Q=  160
   305   4422   0   0    3.8555958e-07
   305   4422   0   2   -4.4545473e-05
   305   4322   0   2   -1.3090237e-05
   305   6421   0   0    3.3025728e-07
   305   6421   0   2    1.6215519e-05
   305   6321   0   2   -5.7422744e-06
   3051111   4133   0   2   -2.0302305e-06
   3051111   4233   0   2    9.2838875e-06
   3051111   4137   0   2    2.2864945e-05
   3051111   4237   0   2   -7.2188526e-05
   3051313   4133   0   2   -2.0303069e-06
   3051313   4233   0   2    9.2838511e-06
   3051313   4137   0   2    2.2864936e-05
   3051313   4237   0   2   -7.2188633e-05
   3051212   4137   0   2   -4.6313477e-06
   3051212   4237   0   2    1.5729352e-05
   3051414   4137   0   2   -4.6313468e-06
   3051414   4237   0   2    1.5729352e-05
   3051616   4137   0   2   -4.6141918e-06
   3051616   4237   0   2    1.5729356e-05

DECAY 23  2.4952


DECAY 24  2.085


DECAY 2000011  0.0035111456
    0.75279076   2    1000025    11
    0.21484153   2    1000023    11
    0.032242971   2    1000022    11
    0.00010978421   2   -1000037    12

DECAY 1000011  21.696164
    0.61088529   2   -1000024    12
    0.3121377   2    1000022    11
    0.054734374   2   -1000037    12
    0.021590722   2    1000025    11
    0.00065190328   2    1000023    11

DECAY 2000013  0.040962995
    0.40229257   2   -1000037    14
    0.26829759   2    1000025    13
    0.24347411   2    1000023    13
    0.054787983   2   -1000024    14
    0.031147749   2    1000022    13

DECAY 1000013  21.7252
    0.61006269   2   -1000024    14
    0.31179124   2    1000022    13
    0.054660519   2   -1000037    14
    0.022151472   2    1000025    13
    0.0012985637   2    1000023    13

DECAY 1000015  6.689734
    0.26081749   2   -1000037    16
    0.25438731   2   -1000024    16
    0.19723809   2    1000023    15
    0.153924   2    1000025    15
    0.1336331   2    1000022    15

DECAY 2000015  14.130452
    0.41299395   2   -1000024    16
    0.22720259   2    1000022    15
    0.13994668   2    1000025    15
    0.12642233   2    1000023    15
    0.093310849   2   -1000037    16
    0.00012359816   2    1000015    23

DECAY 1000012  21.767722
    0.64372642   2    1000024    11
    0.31368085   2    1000022    12
    0.023851951   2    1000037    11
    0.017669297   2    1000025    12
    0.0010714816   2    1000023    12

DECAY 1000014  21.795898
    0.64302868   2    1000024    13
    0.31327169   2    1000022    14
    0.024983355   2    1000037    13
    0.017646194   2    1000025    14
    0.0010700808   2    1000023    14

DECAY 1000016  15.176483
    0.53444474   2    1000024    15
    0.24512201   2    1000022    16
    0.20885288   2    1000037    15
    0.010540532   2    1000025    16
    0.00065009317   2    1000023    16
    0.00038974536   2    1000015    24

DECAY 2000001  142.38527
    0.98572506   2    1000021    1
    0.014259785   2    1000035    1

DECAY 1000001  207.38351
    0.68220605   2    1000021    1
    0.19067081   2   -1000024    2
    0.098029888   2    1000022    1
    0.019522189   2   -1000037    2
    0.0067516482   2    1000025    1
    0.0024934448   2    1000035    1
    0.00032597443   2    1000023    1

DECAY 2000003  142.43899
    0.98535936   2    1000021    3
    0.014254455   2    1000035    3
    0.00016814591   2   -1000037    4

DECAY 1000003  207.41265
    0.68211402   2    1000021    3
    0.19064462   2   -1000024    4
    0.098022638   2    1000022    3
    0.019527655   2   -1000037    4
    0.0068087766   2    1000025    3
    0.0024931069   2    1000035    3
    0.00038918346   2    1000023    3

DECAY 1000005  9.5342087
    0.34841452   2   -1000037    6
    0.26368394   2    1000023    5
    0.22949903   2    1000025    5
    0.10051791   2   -1000024    6
    0.057884596   2    1000022    5

DECAY 2000005  130.99432
    0.48858951   2    1000006   -24
    0.20492725   2   -1000037    6
    0.095432818   2   -1000024    6
    0.073699523   2    1000023    5
    0.070395454   2    1000025    5
    0.055282638   2    1000022    5
    0.007449706   2    1000005    25
    0.0042231028   2    1000005    23

DECAY 2000002  148.56875
    0.94526573   2    1000021    2
    0.054680122   2    1000035    2

DECAY 1000002  207.38042
    0.68199949   2    1000021    2
    0.2018397   2    1000024    1
    0.097710643   2    1000022    2
    0.0085496197   2    1000037    1
    0.0072050904   2    1000025    2
    0.0024196568   2    1000035    2
    0.00027580153   2    1000023    2

DECAY 2000004  148.57227
    0.94524339   2    1000021    4
    0.054678843   2    1000035    4

DECAY 1000004  207.40926
    0.68190719   2    1000021    4
    0.20182416   2    1000024    3
    0.097697325   2    1000022    4
    0.0086638265   2    1000037    3
    0.0072081589   2    1000025    4
    0.002419327   2    1000035    4
    0.0002800123   2    1000023    4

DECAY 1000006  27.843646
    0.39918028   2    1000037    5
    0.2072225   2    1000023    6
    0.16186491   2    1000025    6
    0.15081494   2    1000024    5
    0.06725199   2    1000022    6
    0.01319522   2    1000022    4
    0.00035624893   2    1000005    24

DECAY 2000006  142.43419
    0.28720794   2    1000006    23
    0.21056465   2    1000006    25
    0.16317083   2    1000037    5
    0.11460143   2    1000025    6
    0.10127125   2    1000023    6
    0.073096094   2    1000024    5
    0.031026717   2    1000022    6
    0.0098001166   2    1000005    37
    0.0085999449   2    1000005    24
    0.00066103704   2    2000005    24

DECAY 1000024  2.1084103e-13
    0.93333337   2    1000022    211
    0.038247924   3    1000022   -11    12
    0.028418705   3    1000022   -13    14

DECAY 1000037  2.404374
    0.36461118   2    1000022    24
    0.34688049   2    1000024    23
    0.28840059   2    1000024    25

DECAY 1000022 -1


DECAY 1000023  4.3325131
    0.27428611   2    1000022    23
    0.26465026   2    1000024   -24
    0.26465026   2   -1000024    24
    0.19622364   2    1000022    25
    0.00013345513   2    1000022    22

DECAY 1000025  2.5549461
    0.35631022   2    1000024   -24
    0.35631022   2   -1000024    24
    0.26937994   2    1000022    25
    0.017860756   2    1000022    23

DECAY 1000035  23.916012
    0.087253978   2    1000015   -15
    0.087253978   2   -1000015    15
    0.064983845   2    1000006   -6
    0.064983845   2   -1000006    6
    0.052920186   2    1000037   -24
    0.052920186   2   -1000037    24
    0.042889   2    1000023    23
    0.041161369   2    1000023    25
    0.039437438   2    2000013   -13
    0.039437438   2   -2000013    13
    0.039432154   2    2000011   -11
    0.039432154   2   -2000011    11
    0.037982323   2    1000025    25
    0.036951555   2    1000005   -5
    0.036951555   2   -1000005    5
    0.028381319   2    37   -1000037
    0.028381319   2   -37    1000037
    0.025250093   2    1000025    35
    0.025178517   2    1000023    35
    0.023535881   2    2000015   -15
    0.023535881   2   -2000015    15
    0.01979481   2    1000016   -16
    0.01979481   2   -1000016    16
    0.011288587   2    1000025    23
    0.0046596227   2    1000023    36
    0.003856119   2    1000025    36
    0.002692062   2    37   -1000024
    0.002692062   2   -37    1000024
    0.0021618798   2    1000022    35
    0.0016157481   3    1000037    5   -6
    0.0016157481   3   -1000037   -5    6
    0.0014912676   3    1000023    6   -6
    0.0014104545   3    1000025    6   -6
    0.0010935052   2    1000024   -24
    0.0010935052   2   -1000024    24
    0.00068107919   2    1000022    36
    0.00066907579   2    2000005   -5
    0.00066907579   2   -2000005    5
    0.00065641038   2    1000022    25
    0.00037784781   2    1000014   -14
    0.00037784781   2   -1000014    14
    0.00037769383   2    1000012   -12
    0.00037769383   2   -1000012    12
    0.00035870666   2    1000022    23
    0.00035682613   2    1000013   -13
    0.00035682613   2   -1000013    13
    0.00035669859   2    1000011   -11
    0.00035669859   2   -1000011    11
    0.00017980924   3    1000024    5   -6
    0.00017980924   3   -1000024   -5    6
    0.00015001973   3    1000022    6   -6

DECAY 1000021  239.95666
    0.16122991   2    1000005   -5
    0.16122991   2   -1000005    5
    0.12801894   2    1000006   -6
    0.12801894   2   -1000006    6
    0.099859109   2    2000006   -6
    0.099859109   2   -2000006    6
    0.09770188   2    2000005   -5
    0.09770188   2   -2000005    5
    0.01305854   2    1000006   -4
    0.01305854   2   -1000006    4

DECAY 25  0.0034565083
    0.6316521   2   -5    5
    0.17039921   2   -24    24
    0.072352398   2    21    21
    0.071618222   2   -15    15
    0.030843442   2   -4    4
    0.019129699   2    23    23
    0.0023369702   2    22    22
    0.0011830012   2    22    23
    0.0002485376   2   -13    13
    0.00023560354   2   -3    3
    6.5141987e-07   2   -1    1
    1.5895517e-07   2   -2    2
    5.5874518e-09   2   -11    11

DECAY 35  34.602873
    0.8785439   2   -5    5
    0.11989602   2   -15    15
    0.00042883843   2   -13    13
    0.00034617755   2   -3    3
    0.00029052554   2   -6    6
    0.00028490204   2   -1000024    1000024
    0.00014551887   2    1000022    1000022
    5.9782708e-05   2    21    21
    3.2305666e-06   2    25    25
    9.5730844e-07   2   -1    1
    5.6516479e-08   2    22    23
    4.2020645e-08   2   -24    24
    2.5851822e-08   2    23    23
    9.6352867e-09   2   -11    11
    8.7439905e-09   2    22    22
    4.2784617e-09   2   -4    4
    2.2071315e-14   2   -2    2

DECAY 36  33.712736
    0.87336483   2   -5    5
    0.11918775   2   -15    15
    0.004117108   2   -1000024    1000024
    0.0020774664   2    1000022    1000022
    0.0004262583   2   -13    13
    0.00039724411   2   -6    6
    0.00034406852   2   -3    3
    8.2786208e-05   2    21    21
    1.1348043e-06   2    22    23
    9.5147632e-07   2   -1    1
    3.4621785e-07   2    22    22
    4.1252825e-08   2    23    25
    9.577305e-09   2   -11    11
    4.8444557e-09   2   -4    4
    2.5040923e-14   2   -2    2
    6.9974782e-40   2    25    25

DECAY 37  27.525631
    0.83425661   2   -5    6
    0.16342106   2   -15    16
    0.0013202399   2   -5    4
    0.00057775661   2   -13    14
    0.00039427849   2   -3    4
    1.8166255e-05   2   -3    2
    9.4279162e-06   2   -5    2
    1.2031008e-06   2   -3    6
    1.0949437e-06   2   -1    2
    5.2321484e-08   2    24    25
    5.0608211e-08   2   -1    4
    3.0909499e-08   2   -1    6
    1.6980957e-08   2    1000022    1000024
    1.3513787e-08   2   -11    12
    7.619732e-10   2    24    35
    7.0564272e-10   2    24    36

DECAY 6  2.43
    1   2    5    24

DECAY 15 -1
