BLOCK SPINFO
   1   SPheno
   2   v4.0.5be

BLOCK SPHENOINFO
   1   2
   2   2

BLOCK MODSEL
   1   0

BLOCK MINPAR
   3    44.266282
   4   -1

BLOCK EXTPAR
   0    1268.2724
   1   -1481.3492
   2   -435.55335
   3    3000
   11   -2584.7261
   12    581.41266
   13   -715.91658
   23   -511.53383
   25    43.663037
   26    3421.2038
   31    936.50982
   32    936.50982
   33    599.86465
   34    1604.9403
   35    1604.9403
   36    1018.0001
   41    5000
   42    5000
   43    1363.4149
   44    5000
   45    5000
   46    1320.9097
   47    5000
   48    5000
   49    1965.1989

BLOCK SMINPUTS
   1    127.90897
   2    1.1663787e-05
   3    0.1184
   4    91.1876
   5    4.18
   6    173.2
   7    1.777
   8    0
   11    0.00051099893
   12    0
   13    0.10565837
   14    0
   21    0.005
   22    0.0025
   23    0.095
   24    1.27

BLOCK GAUGE Q=  1268.2724
   1    0.35536298
   2    0.66519887
   3    1.219778

BLOCK YU Q=  1268.2724
   1   1    8.3865708e-06
   2   2    0.004260378
   3   3    1.0131651

BLOCK YD Q=  1268.2724
   1   1    0.00073583189
   2   2    0.013980806
   3   3    0.72971465

BLOCK YE Q=  1268.2724
   1   1    0.00012840805
   2   2    0.026550711
   3   3    0.44653928

BLOCK AU Q=  1268.2724
   1   1    0
   2   2    0
   3   3   -2584.726

BLOCK AD Q=  1268.2724
   1   1    0
   2   2    0
   3   3    581.41267

BLOCK AE Q=  1268.2724
   1   1    0
   2   2    0
   3   3   -715.91658

BLOCK MSOFT Q=  1268.2724
   1   -1481.3492
   2   -435.55335
   3    3000
   21    11442182
   22   -232333.09
   31    936.50982
   32    936.50982
   33    599.86465
   34    1604.9403
   35    1604.9403
   36    1018.0001
   41    5000
   42    5000
   43    1363.4149
   44    5000
   45    5000
   46    1320.9097
   47    5000
   48    5000
   49    1965.1989

BLOCK MASS
   6    173.2
   23    91.1876
   24    80.429995
   15    1.777
   25    122.82899
   35    3418.4718
   36    3421.2038
   37    3419.849
   1000001    5019.0183
   2000001    5008.2331
   1000002    5018.5703
   2000002    5010.3218
   1000003    5019.0269
   2000003    5008.2463
   1000004    5018.5779
   2000004    5010.3229
   1000005    1313.9325
   2000005    1979.1316
   1000006    1131.8012
   2000006    1421.1991
   1000011    944.20876
   2000011    1606.8753
   1000012    940.45019
   1000013    944.22282
   2000013    1606.8875
   1000014    940.46604
   1000015    618.36807
   2000015    1029.8236
   1000016    614.55585
   1000021    3172.2883
   1000022   -428.34746
   1000023    520.65761
   1000025   -553.60527
   1000035   -1481.2775
   1000024    429.57723
   1000037    556.90891

BLOCK ALPHA
      -0.022645795

BLOCK HMIX Q=  1268.2724
   1   -511.53383
   2    43.663037
   3    244.17177
   4    11704635

BLOCK STOPMIX
   1   1    0.61631355
   1   2    0.78750086
   2   1   -0.78750086
   2   2    0.61631355

BLOCK SBOTMIX
   1   1   -0.99968447
   1   2    0.025118833
   2   1   -0.025118833
   2   2   -0.99968447

BLOCK STAUMIX
   1   1   -0.99838115
   1   2    0.05687774
   2   1   -0.05687774
   2   2   -0.99838115

BLOCK NMIX
   1   1   -0.014859475
   1   2    0.84091195
   1   3    0.41597958
   1   4   -0.34584286
   2   1    0.015305439
   2   2   -0.056589363
   2   3    0.70366292
   2   4    0.70811149
   3   1   -0.029948986
   3   2   -0.53819804
   3   3    0.57589844
   3   4   -0.61464373
   4   1    0.99932377
   4   2   -0.0027587157
   4   3    0.012667509
   4   4   -0.034408224

BLOCK UMIX
   1   1   -0.81862966
   1   2   -0.57432175
   2   1   -0.57432175
   2   2    0.81862966

BLOCK VMIX
   1   1    0.87812827
   1   2    0.47842526
   2   1    0.47842526
   2   2   -0.87812827

BLOCK HIGGSBOUNDSINPUTHIGGSCOUPLINGSFERMIONS
       0, 1906.4608,3,36,15,15

BLOCK HIGGSBOUNDSINPUTHIGGSCOUPLINGSBOSONS
       0,4,36,21,21,23

BLOCK SPHENOLOWENERGY
   1    0.00039129134
   2    1.5855294e-06
   3    3.5191548e-05
   4    1.8707775e-15
   5    7.9916072e-11
   6    1.6654352e-08
   7    6.3122351e-14
   8    2.6965395e-09
   9    5.6952887e-07
   10    9.5520622e-05
   11    0.98669145
   12    0.54380891
   13    19.421124
   14    0
   15    0
   16    0.0021682769
   17    2.2817708e-15
   18    2.4771658e-11
   19    8.2831557e-11
   20    1.7276286e-14
   21    7.3871598e-10
   22    3.2031683e-07
   23    0
   24    0
   25    0
   26    0
   27    0
   28    0
   29    0
   30    0
   31    0
   39    8.4792885e-05
   40    0
   41    0
   42    0

BLOCK FWCOEF Q=  160
   305   4422   0   0   -0.18881911
   305   4422   0   2   -0.26931791
   305   4322   0   2   -0.00046998979
   305   6421   0   0   -0.095227835
   305   6421   0   2   -0.13752608
   305   6321   0   2   -0.00026715245
   3051111   4133   0   0    1.5864065
   3051111   4133   0   2    1.5874493
   3051111   4233   0   2    0.00026114658
   3051111   4137   0   0   -4.4090986
   3051111   4137   0   2   -4.4014458
   3051111   4237   0   2   -0.0020485657
   3051313   4133   0   0    1.5864065
   3051313   4133   0   2    1.5874437
   3051313   4233   0   2    0.00026114506
   3051313   4137   0   0   -4.4090986
   3051313   4137   0   2   -4.4014514
   3051313   4237   0   2   -0.0020485701
   3051212   4137   0   0    1.5053501
   3051212   4137   0   2    1.5037025
   3051212   4237   0   2    0.00044702509
   3051414   4137   0   0    1.5053501
   3051414   4137   0   2    1.5037025
   3051414   4237   0   2    0.00044702515
   3051616   4137   0   0    1.5053501
   3051616   4137   0   2    1.5037027
   3051616   4237   0   2    0.00044704196

BLOCK IMFWCOEF Q=  160
   305   4422   0   0    3.8571476e-07
   305   4422   0   2    2.6294483e-05
   305   4322   0   2   -6.6621702e-06
   305   6421   0   0    3.303902e-07
   305   6421   0   2    1.5710591e-05
   305   6321   0   2   -2.4895731e-06
   3051111   4133   0   2   -2.2978732e-06
   3051111   4233   0   2    5.3267872e-06
   3051111   4137   0   2    1.7933902e-05
   3051111   4237   0   2   -4.179703e-05
   3051313   4133   0   2   -2.2979793e-06
   3051313   4233   0   2    5.326766e-06
   3051313   4137   0   2    1.7934112e-05
   3051313   4237   0   2   -4.1797114e-05
   3051212   4137   0   2   -3.486433e-06
   3051212   4237   0   2    9.1206824e-06
   3051414   4137   0   2   -3.4864305e-06
   3051414   4237   0   2    9.1206824e-06
   3051616   4137   0   2   -3.4831853e-06
   3051616   4237   0   2    9.120687e-06

DECAY 23  2.4952


DECAY 24  2.085


DECAY 1000011  7.0420828
    0.49743215   2   -1000024    12
    0.2582776   2    1000022    11
    0.16556275   2   -1000037    12
    0.078057565   2    1000025    11
    0.00066993768   2    1000023    11

DECAY 2000011  0.19062064
    0.95446935   2    1000035    11
    0.029508215   2    1000025    11
    0.0080708781   2    1000022    11
    0.007949244   2    1000023    11

DECAY 1000013  7.0488355
    0.49697075   2   -1000024    14
    0.25824489   2    1000022    13
    0.16541186   2   -1000037    14
    0.078252867   2    1000025    13
    0.0011196398   2    1000023    13

DECAY 2000013  0.22759565
    0.79955009   2    1000035    13
    0.051372503   2   -1000037    14
    0.050223   2    1000025    13
    0.045928287   2    1000023    13
    0.028158419   2   -1000024    14
    0.021545253   2    1000022    13
    0.0032224448   2    1000013    25

DECAY 1000015  1.9014089
    0.53978448   2   -1000024    16
    0.34498045   2    1000022    15
    0.053763512   2    1000023    15
    0.03144634   2    1000025    15
    0.030025222   2   -1000037    16

DECAY 2000015  5.6896563
    0.26955666   2   -1000037    16
    0.19920811   2    1000023    15
    0.13425576   2    1000025    15
    0.12445031   2   -1000024    16
    0.10612069   2    1000016   -24
    0.065583111   2    1000022    15
    0.050818971   2    1000015    23
    0.050006391   2    1000015    25

DECAY 1000012  7.1606828
    0.5583051   2    1000024    11
    0.26163516   2    1000022    12
    0.11157727   2    1000037    11
    0.067316277   2    1000025    12
    0.0011661849   2    1000023    12

DECAY 1000014  7.1674005
    0.55817746   2    1000024    13
    0.26139896   2    1000022    14
    0.11200172   2    1000037    13
    0.067256722   2    1000025    14
    0.0011651463   2    1000023    14

DECAY 1000016  1.9304964
    0.67010126   2    1000024    15
    0.26693086   2    1000022    16
    0.048920231   2    1000037    15
    0.013579469   2    1000025    16
    0.00046817922   2    1000023    16

DECAY 2000001  144.06748
    0.98383453   2    1000021    1
    0.016139078   2    1000035    1

DECAY 1000001  208.54614
    0.68503871   2    1000021    1
    0.13990665   2   -1000024    2
    0.074284847   2    1000022    1
    0.068171023   2   -1000037    2
    0.029350996   2    1000025    1
    0.0028829438   2    1000035    1
    0.00036483656   2    1000023    1

DECAY 2000003  144.10689
    0.98357509   2    1000021    3
    0.016134741   2    1000035    3

DECAY 1000003  208.56798
    0.68497129   2    1000021    3
    0.13989413   2   -1000024    4
    0.074293131   2    1000022    3
    0.068170618   2   -1000037    4
    0.029378158   2    1000025    3
    0.002882661   2    1000035    3
    0.00041001269   2    1000023    3

DECAY 1000005  48.365205
    0.35077625   2   -1000037    6
    0.20199868   2   -1000024    6
    0.15003834   2    1000006   -24
    0.1105759   2    1000022    5
    0.10123593   2    1000023    5
    0.085374899   2    1000025    5

DECAY 2000005  37.621197
    0.32254101   2   -1000037    6
    0.23976172   2    1000023    5
    0.16169692   2    1000025    5
    0.15396913   2   -1000024    6
    0.08191874   2    1000022    5
    0.010772638   2    1000005    25
    0.01009279   2    1000006   -24
    0.0075059011   2    1000005    23
    0.0060349658   2    2000006   -24
    0.0057061861   2    1000035    5

DECAY 2000002  151.27675
    0.93838694   2    1000021    2
    0.061515279   2    1000035    2

DECAY 1000002  208.54165
    0.68482958   2    1000021    2
    0.16097149   2    1000024    1
    0.073350496   2    1000022    2
    0.047302893   2    1000037    1
    0.030535492   2    1000025    2
    0.0027093133   2    1000035    2
    0.00030073636   2    1000023    2

DECAY 2000004  151.28034
    0.93836501   2    1000021    4
    0.061513828   2    1000035    4

DECAY 1000004  208.56331
    0.684762   2    1000021    4
    0.16098532   2    1000024    3
    0.073344033   2    1000022    4
    0.047359093   2    1000037    3
    0.030535529   2    1000025    4
    0.0027090475   2    1000035    4
    0.00030497332   2    1000023    4

DECAY 1000006  25.235925
    0.48326029   2    1000037    5
    0.21948425   2    1000025    6
    0.20785273   2    1000023    6
    0.043941475   2    1000024    5
    0.027057298   2    1000022    6
    0.017936376   2    1000022    4
    0.00040487553   3    1000022    24    5

DECAY 2000006  60.285438
    0.26469608   2    1000024    5
    0.19974404   2    1000023    6
    0.1593507   2    1000006    23
    0.14173158   2    1000022    6
    0.10387686   2    1000037    5
    0.0972643   2    1000025    6
    0.017801875   2    1000005    24
    0.015534561   2    1000006    25

DECAY 1000024  1.9297104e-11
    0.60251236   3    1000022   -1    2
    0.20235575   3    1000022   -11    12
    0.19513189   3    1000022   -13    14

DECAY 1000037  1.334923
    0.76673532   2    1000022    24
    0.20207011   2    1000024    23
    0.03113   2    1000024    25

DECAY 1000022 -1


DECAY 1000023  0.31273675
    0.67775621   2    1000022    23
    0.1605713   2    1000024   -24
    0.1605713   2   -1000024    24
    0.001095278   2    1000022    22

DECAY 1000025  2.2920501
    0.49139971   2    1000024   -24
    0.49139971   2   -1000024    24
    0.015485265   2    1000022    25
    0.0016532495   2    1000022    23

DECAY 1000035  12.784301
    0.077457076   2    2000015   -15
    0.077457076   2   -2000015    15
    0.065456028   2    1000037   -24
    0.065456028   2   -1000037    24
    0.065151126   2    1000023    23
    0.054842783   2    1000023    25
    0.051390604   2    1000025    25
    0.050325759   2    1000016   -16
    0.050325759   2   -1000016    16
    0.049447805   2    1000015   -15
    0.049447805   2   -1000015    15
    0.040002203   2    1000006   -6
    0.040002203   2   -1000006    6
    0.02616287   2    1000012   -12
    0.02616287   2   -1000012    12
    0.026161679   2    1000014   -14
    0.026161679   2   -1000014    14
    0.025351169   2    1000011   -11
    0.025351169   2   -1000011    11
    0.025350165   2    1000013   -13
    0.025350165   2   -1000013    13
    0.012441984   2    1000024   -24
    0.012441984   2   -1000024    24
    0.010689876   2    1000025    23
    0.0099542987   2    1000022    25
    0.0029486224   2    1000022    23
    0.0015607434   3    1000037    5   -6
    0.0015607434   3   -1000037   -5    6
    0.0012443517   3    1000023    6   -6
    0.0011356792   2    1000005   -5
    0.0011356792   2   -1000005    5
    0.00097524074   3    1000025    6   -6
    0.00039226405   3    1000022    6   -6
    0.00033853476   3    1000024    5   -6
    0.00033853476   3   -1000024   -5    6

DECAY 1000021  242.72216
    0.13963715   2    2000006   -6
    0.13963715   2   -2000006    6
    0.13277685   2    1000005   -5
    0.13277685   2   -1000005    5
    0.12935743   2    1000006   -6
    0.12935743   2   -1000006    6
    0.072141895   2    2000005   -5
    0.072141895   2   -2000005    5
    0.025951414   2    1000006   -4
    0.025951414   2   -1000006    4

DECAY 25  0.0036054774
    0.60515231   2   -5    5
    0.19468031   2   -24    24
    0.073648426   2    21    21
    0.069808435   2   -15    15
    0.030007961   2   -4    4
    0.022560033   2    23    23
    0.0023503875   2    22    22
    0.0013210508   2    22    23
    0.00024203681   2   -13    13
    0.00022826207   2   -3    3
    6.3112289e-07   2   -1    1
    1.5464488e-07   2   -2    2
    5.4412863e-09   2   -11    11

DECAY 35  145.63381
    0.58560779   2   -5    5
    0.10518183   2   -15    15
    0.059588986   2   -1000024    1000037
    0.059588986   2   -1000037    1000024
    0.038621877   2   -1000024    1000024
    0.034025588   2    1000022    1000023
    0.019950685   2   -1000037    1000037
    0.019065041   2    1000022    1000022
    0.012971207   2    1000023    1000025
    0.012397066   2    1000025    1000025
    0.011304387   2   -1000006    1000006
    0.010323024   2    1000023    1000035
    0.0097481504   2    1000022    1000025
    0.0079155548   2   -2000006    2000006
    0.0049489879   2    1000025    1000035
    0.0019326513   2    1000022    1000035
    0.0017966288   2   -2000015    1000015
    0.0017966288   2   -1000015    2000015
    0.00082519085   2   -2000006    1000006
    0.00082519085   2   -1000006    2000006
    0.00057955511   2   -6    6
    0.000381153   2    1000023    1000023
    0.00034991987   2   -13    13
    0.00020512451   2   -3    3
    2.6139079e-05   2   -1000015    1000015
    2.1178205e-05   2   -2000015    2000015
    7.8265177e-06   2    21    21
    6.0724774e-06   2   -1000005    1000005
    5.546063e-06   2    25    25
    8.8917951e-07   2    1000035    1000035
    5.6715812e-07   2   -1    1
    1.7297464e-07   2    23    23
    4.4165178e-08   2   -24    24
    3.6097944e-08   2    22    23
    2.3090143e-08   2   -1000011    1000011
    2.2837967e-08   2   -1000013    1000013
    8.750395e-09   2    22    22
    7.8586561e-09   2   -11    11
    6.1300842e-09   2   -2000011    2000011
    6.0690883e-09   2   -2000013    2000013
    5.5762941e-09   2   -4    4
    1.226596e-09   2   -2000013    1000013
    1.226596e-09   2   -1000013    2000013
    2.8739843e-14   2   -2    2
    2.8690429e-14   2   -2000011    1000011
    2.8690429e-14   2   -1000011    2000011

DECAY 36  137.27509
    0.56918998   2   -5    5
    0.10223449   2   -15    15
    0.057797937   2   -1000024    1000037
    0.057797937   2   -1000037    1000024
    0.046555038   2   -1000024    1000024
    0.030402875   2    1000022    1000023
    0.02659613   2   -1000037    1000037
    0.023073944   2    1000022    1000022
    0.016111788   2    1000025    1000025
    0.012471273   2    1000022    1000025
    0.011602671   2    1000023    1000025
    0.011198492   2   -2000006    1000006
    0.011198492   2   -1000006    2000006
    0.0082650085   2    1000025    1000035
    0.0071755231   2    1000023    1000035
    0.0028364296   2    1000022    1000035
    0.0019299683   2   -2000015    1000015
    0.0019299683   2   -1000015    2000015
    0.00067139344   2   -6    6
    0.00040637495   2    1000023    1000023
    0.00034010916   2   -13    13
    0.00019935626   2   -3    3
    8.8728364e-06   2    21    21
    4.9037851e-06   2    1000035    1000035
    5.512089e-07   2   -1    1
    3.3210845e-07   2    23    25
    9.2071462e-08   2    22    23
    5.084473e-08   2    22    22
    7.6382734e-09   2   -11    11
    6.3786635e-09   2   -4    4
    1.2920612e-09   2   -2000013    1000013
    1.2920612e-09   2   -1000013    2000013
    1.217639e-12   2    23    35
    3.2878488e-14   2   -2    2
    3.0221439e-14   2   -2000011    1000011
    3.0221439e-14   2   -1000011    2000011
    3.8536991e-37   2    25    25

DECAY 37  133.83184
    0.56936093   2   -5    6
    0.10037207   2    1000022    1000037
    0.10013568   2   -15    16
    0.093825546   2    1000024    1000025
    0.073854855   2    1000023    1000024
    0.021883041   2    1000023    1000037
    0.0137071   2    1000035    1000037
    0.010322613   2   -1000005    1000006
    0.0046776586   2    1000024    1000035
    0.0040191258   2   -1000005    2000006
    0.0039504876   2   -2000015    1000016
    0.0024215654   2   -2000005    1000006
    0.00084369926   2   -5    4
    0.00035401532   2   -13    14
    0.00020304697   2   -3    4
    3.6988739e-05   2    1000025    1000037
    1.270168e-05   2   -1000015    1000016
    9.5240318e-06   2   -3    2
    6.024883e-06   2   -5    2
    1.1286815e-06   2    1000022    1000024
    1.024628e-06   2   -3    6
    5.6360333e-07   2   -1    2
    3.404094e-07   2    24    25
    9.8601416e-08   2   -1000011    1000012
    9.8216221e-08   2   -1000013    1000014
    3.3164255e-08   2   -1    6
    2.666211e-08   2   -1    4
    8.2804551e-09   2   -11    12
    2.6946634e-09   2   -2000013    1000014
    6.3030233e-14   2   -2000011    1000012
    5.0405493e-14   2    24    35

DECAY 6  2.43
    1   2    5    24

DECAY 15 -1
