BLOCK SPINFO
   1   SPheno
   2   v4.0.5be

BLOCK SPHENOINFO
   1   2
   2   2

BLOCK MODSEL
   1   0

BLOCK MINPAR
   3    13.083893
   4    1

BLOCK EXTPAR
   0    2220.4925
   1   -914.4459
   2    555.11688
   3    3253.082
   11    3663.2847
   12    6267.4079
   13   -3803.326
   23    416.57763
   25    12.507092
   26    3415.2559
   31    1013.8121
   32    1013.8121
   33    3601.9418
   34    601.7863
   35    601.7863
   36    1700.0531
   41    4883.7419
   42    4883.7419
   43    3185.3043
   44    580.25585
   45    580.25585
   46    1482.2843
   47    3101.488
   48    3101.488
   49    2387.5527

BLOCK SMINPUTS
   1    127.90897
   2    1.1663787e-05
   3    0.1184
   4    91.1876
   5    4.18
   6    173.2
   7    1.777
   8    0
   11    0.00051099893
   12    0
   13    0.10565837
   14    0
   21    0.005
   22    0.0025
   23    0.095
   24    1.27

BLOCK GAUGE Q=  2220.4925
   1    0.35536298
   2    0.66519887
   3    1.219778

BLOCK YU Q=  2220.4925
   1   1    8.411129e-06
   2   2    0.0042728535
   3   3    1.0161319

BLOCK YD Q=  2220.4925
   1   1    0.00021139313
   2   2    0.0040164696
   3   3    0.20963575

BLOCK YE Q=  2220.4925
   1   1    3.6889648e-05
   2   2    0.0076276092
   3   3    0.12828384

BLOCK AU Q=  2220.4925
   1   1    0
   2   2    0
   3   3    3663.2847

BLOCK AD Q=  2220.4925
   1   1    0
   2   2    0
   3   3    6267.4082

BLOCK AE Q=  2220.4925
   1   1    0
   2   2    0
   3   3   -3803.326

BLOCK MSOFT Q=  2220.4925
   1   -914.4459
   2    555.11688
   3    3253.082
   21    11399085
   22   -75045.138
   31    1013.8121
   32    1013.8121
   33    3601.9418
   34    601.7863
   35    601.7863
   36    1700.0531
   41    4883.7419
   42    4883.7419
   43    3185.3043
   44    580.25585
   45    580.25585
   46    1482.2843
   47    3101.488
   48    3101.488
   49    2387.5527

BLOCK MASS
   6    173.2
   23    91.1876
   24    80.429995
   15    1.777
   25    123.60876
   35    3414.8379
   36    3415.2559
   37    3416.0364
   1000001    4938.8472
   2000001    3181.1437
   1000002    4938.3548
   2000002    667.27948
   1000003    4938.847
   2000003    3181.1437
   1000004    4938.3546
   2000004    667.2815
   1000005    2474.9978
   2000005    3240.6084
   1000006    1517.735
   2000006    3248.648
   1000011    1014.9129
   2000011    630.81714
   1000012    1011.5017
   1000013    1014.912
   2000013    630.81386
   1000014    1011.5006
   1000015    1710.9466
   2000015    3607.4831
   1000016    3606.2222
   1000021    3412.7805
   1000022    406.23903
   1000023   -425.20102
   1000025    611.45059
   1000035   -897.52435
   1000024    408.34003
   1000037    611.8169

BLOCK ALPHA
      -0.076437764

BLOCK HMIX Q=  2220.4925
   1    416.57763
   2    12.507092
   3    243.57913
   4    11663973

BLOCK STOPMIX
   1   1   -0.064533042
   1   2    0.99791557
   2   1   -0.99791557
   2   2   -0.064533042

BLOCK SBOTMIX
   1   1   -0.00056354216
   1   2    0.99999984
   2   1   -0.99999984
   2   2   -0.00056354216

BLOCK STAUMIX
   1   1    0.0015882393
   1   2    0.99999874
   2   1   -0.99999874
   2   2    0.0015882393

BLOCK NMIX
   1   1   -0.024360277
   1   2   -0.307854
   1   3    0.68512518
   1   4   -0.65972416
   2   1    0.061303685
   2   2    0.050832334
   2   3    0.70429422
   2   4    0.70542724
   3   1    0.0079113939
   3   2   -0.95006965
   3   3   -0.18423881
   3   4    0.25171637
   4   1    0.99779048
   4   2   -0.0031061058
   4   3   -0.025083829
   4   4   -0.06144354

BLOCK UMIX
   1   1   -0.26230305
   1   2    0.96498555
   2   1    0.96498555
   2   2    0.26230305

BLOCK VMIX
   1   1   -0.35882525
   1   2    0.93340476
   2   1    0.93340476
   2   2    0.35882525

BLOCK HIGGSBOUNDSINPUTHIGGSCOUPLINGSFERMIONS
       0, 156.42735,3,36,15,15

BLOCK HIGGSBOUNDSINPUTHIGGSCOUPLINGSBOSONS
       0,4,36,21,21,23

BLOCK SPHENOLOWENERGY
   1    0.00032925577
   2    1.5874077e-06
   3    3.5213123e-05
   4    2.5374967e-15
   5    1.0839901e-10
   6    2.2693462e-08
   7    8.5402657e-14
   8    3.6483998e-09
   9    7.7390263e-07
   10    9.6718334e-05
   11    0.99906337
   12    0.54277262
   13    19.393302
   14    0
   15    0
   16    0.0021607585
   17    2.2816938e-15
   18    2.4773645e-11
   19    8.283902e-11
   20    1.8963519e-15
   21    8.1064841e-11
   22    9.11497e-09
   23    0
   24    0
   25    0
   26    0
   27    0
   28    0
   29    0
   30    0
   31    0
   39    1.4059801e-05
   40    0
   41    0
   42    0

BLOCK FWCOEF Q=  160
   305   4422   0   0   -0.18881911
   305   4422   0   2   -0.19875614
   305   4322   0   2   -0.00016277698
   305   6421   0   0   -0.095227835
   305   6421   0   2   -0.10440284
   305   6321   0   2   -0.00016350268
   3051111   4133   0   0    1.6056324
   3051111   4133   0   2    1.6060785
   3051111   4233   0   2    1.9456583e-05
   3051111   4137   0   0   -4.4283245
   3051111   4137   0   2   -4.4227377
   3051111   4237   0   2   -0.00014827576
   3051313   4133   0   0    1.6056324
   3051313   4133   0   2    1.6060781
   3051313   4233   0   2    1.9456572e-05
   3051313   4137   0   0   -4.4283245
   3051313   4137   0   2   -4.4227381
   3051313   4237   0   2   -0.00014827578
   3051212   4137   0   0    1.5053501
   3051212   4137   0   2    1.5041473
   3051212   4237   0   2    3.2215077e-05
   3051414   4137   0   0    1.5053501
   3051414   4137   0   2    1.5041473
   3051414   4237   0   2    3.2215078e-05
   3051616   4137   0   0    1.5053501
   3051616   4137   0   2    1.5041461
   3051616   4237   0   2    3.2215243e-05

BLOCK IMFWCOEF Q=  160
   305   4422   0   0    3.8581173e-07
   305   4422   0   2    4.1195621e-06
   305   4322   0   2   -1.0969958e-06
   305   6421   0   0    3.3047326e-07
   305   6421   0   2   -7.8113456e-07
   305   6321   0   2   -5.2374102e-07
   3051111   4133   0   2   -7.4852085e-07
   3051111   4233   0   2    4.0868466e-07
   3051111   4137   0   2    5.5150115e-06
   3051111   4237   0   2   -3.1154554e-06
   3051313   4133   0   2   -7.4852333e-07
   3051313   4233   0   2    4.0868452e-07
   3051313   4137   0   2    5.5150171e-06
   3051313   4237   0   2   -3.1154558e-06
   3051212   4137   0   2   -9.9901068e-07
   3051212   4237   0   2    6.7687881e-07
   3051414   4137   0   2   -9.9901054e-07
   3051414   4237   0   2    6.7687881e-07
   3051616   4137   0   2   -1.0192228e-06
   3051616   4237   0   2    6.7687946e-07

DECAY 23  2.4952


DECAY 24  2.085


DECAY 2000011  0.004191749
    0.84611489   2    1000023    11
    0.15371082   2    1000022    11
    0.00017299796   2    1000025    11

DECAY 1000011  5.8306597
    0.57825389   2   -1000037    12
    0.27814971   2    1000025    11
    0.074108632   2   -1000024    12
    0.055629052   2    1000022    11
    0.010220422   2    1000035    11
    0.0036383007   2    1000023    11

DECAY 2000013  0.0046469259
    0.78631326   2    1000023    13
    0.16395871   2    1000022    13
    0.049513902   2   -1000024    14
    0.00017607912   2    1000025    13

DECAY 1000013  5.8315021
    0.57816873   2   -1000037    14
    0.27811185   2    1000025    13
    0.074097814   2   -1000024    14
    0.055687232   2    1000022    13
    0.010218799   2    1000035    13
    0.0037057965   2    1000023    13

DECAY 1000015  5.517142
    0.81504961   2    1000035    15
    0.084476118   2   -1000024    16
    0.04945834   2    1000023    15
    0.043478408   2    1000022    15
    0.004996209   2   -1000037    16
    0.0025413168   2    1000025    15

DECAY 2000015  50.235425
    0.55538053   2   -1000037    16
    0.26756001   2    1000025    15
    0.078132233   2    1000035    15
    0.042421911   2    1000022    15
    0.042293467   2   -1000024    16
    0.013492057   2    1000023    15
    0.00037194562   2    1000015    23
    0.00034785321   2    1000015    25

DECAY 1000012  5.8873638
    0.52990168   2    1000037    11
    0.27732641   2    1000025    12
    0.13653094   2    1000024    11
    0.046242082   2    1000022    12
    0.0098312855   2    1000035    12
    0.0001676026   2    1000023    12

DECAY 1000014  5.8881387
    0.52983614   2    1000037    13
    0.27728889   2    1000025    14
    0.13664166   2    1000024    13
    0.046235906   2    1000022    14
    0.0098298181   2    1000035    14
    0.00016758019   2    1000023    14

DECAY 1000016  50.25896
    0.52062632   2    1000037    15
    0.27131367   2    1000025    16
    0.10056888   2    1000024    15
    0.079885506   2    1000035    16
    0.026762261   2    1000022    16
    0.00074295603   2    1000015    24
    0.00010041666   2    1000023    16

DECAY 2000001  1.5054395
    0.99497388   2    1000035    1
    0.0042774794   2    1000023    1
    0.00067828444   2    1000022    1

DECAY 1000001  170.39083
    0.62463562   2    1000021    1
    0.23036768   2   -1000037    2
    0.11198609   2    1000025    1
    0.017316977   2   -1000024    2
    0.011594441   2    1000022    1
    0.0038989142   2    1000035    1
    0.00020027968   2    1000023    1

DECAY 2000003  1.5074038
    0.99367774   2    1000035    3
    0.0045950199   2    1000023    3
    0.00098419701   2    1000022    3
    0.00061011201   2   -1000024    4

DECAY 1000003  170.39414
    0.62462337   2    1000021    3
    0.23036455   2   -1000037    4
    0.11198422   2    1000025    3
    0.017325647   2   -1000024    4
    0.011598508   2    1000022    3
    0.0038988439   2    1000035    3
    0.00020480975   2    1000023    3

DECAY 1000005  5.099025
    0.36981465   2   -1000024    6
    0.2037287   2    1000035    5
    0.19921365   2    1000023    5
    0.18856315   2    1000022    5
    0.025796421   2   -1000037    6
    0.012882774   2    1000025    5

DECAY 2000005  152.65452
    0.37634493   2   -1000024    6
    0.29940695   2    1000006   -24
    0.21655401   2   -1000037    6
    0.079258963   2    1000025    5
    0.016782969   2    1000022    5
    0.0090360319   2    1000023    5
    0.0026129897   2    1000035    5

DECAY 2000002  0.002328321
    0.84853289   2    1000023    2
    0.1504372   2    1000022    2
    0.0010297644   2    1000025    2

DECAY 1000002  170.38299
    0.62437444   2    1000021    2
    0.21552316   2    1000037    1
    0.11131715   2    1000025    2
    0.032404639   2    1000024    1
    0.012266052   2    1000022    2
    0.0036353226   2    1000035    2
    0.00047924147   2    1000023    2

DECAY 2000004  0.0025002721
    0.80823455   2    1000023    4
    0.15719622   2    1000022    4
    0.033117068   2    1000024    3
    0.0011353105   2    1000025    4
    0.00031684943   2    1000037    3

DECAY 1000004  170.38623
    0.62436208   2    1000021    4
    0.21551967   2    1000037    3
    0.11131569   2    1000025    4
    0.032412533   2    1000024    3
    0.012270313   2    1000022    4
    0.0036352923   2    1000035    4
    0.00048438854   2    1000023    4

DECAY 1000006  53.001523
    0.42517551   2    1000024    5
    0.24395817   2    1000023    6
    0.2105376   2    1000022    6
    0.065200125   2    1000037    5
    0.031669639   2    1000025    6
    0.02345513   2    1000035    6

DECAY 2000006  162.13339
    0.19673129   2    1000023    6
    0.19609515   2    1000006    25
    0.18407869   2    1000022    6
    0.14185743   2    1000006    23
    0.13289273   2    1000037    5
    0.093437535   2    1000025    6
    0.050334961   2    1000024    5
    0.0045689132   2    1000035    6

DECAY 1000024  1.4901818e-11
    0.58720048   3    1000022   -1    2
    0.19598988   3    1000022   -11    12
    0.19241118   3    1000022   -13    14
    0.024398456   3    1000022   -3    4

DECAY 1000037  3.7246723
    0.34834645   2    1000023    24
    0.25273245   2    1000022    24
    0.23163863   2    1000024    23
    0.16726462   2    1000024    25

DECAY 1000022 -1


DECAY 1000023  1.9638841e-05
    0.097274695   3    1000024    1   -2
    0.097274695   3   -1000024   -1    2
    0.094745992   3    1000024    3   -4
    0.094745992   3   -1000024   -3    4
    0.077303573   3    1000022    12   -12
    0.074020955   2    1000022    22
    0.057802489   3    1000022    1   -1
    0.057785907   3    1000022    3   -3
    0.045082472   3    1000022    2   -2
    0.042491186   3    1000022    4   -4
    0.032601013   3    1000022    5   -5
    0.032420961   3    1000024    11   -12
    0.032420961   3   -1000024   -11    12
    0.032416995   3    1000024    13   -14
    0.032416995   3   -1000024   -13    14
    0.030816653   3    1000024    15   -16
    0.030816653   3   -1000024   -15    16
    0.013037333   3    1000022    11   -11
    0.013031562   3    1000022    13   -13
    0.01149292   3    1000022    15   -15

DECAY 1000025  4.3863145
    0.29407357   2    1000023    23
    0.22023791   2    1000024   -24
    0.22023791   2   -1000024    24
    0.13319357   2    1000022    25
    0.12614391   2    1000023    25
    0.0060548256   2    1000022    23

DECAY 1000035  7.1838643
    0.083347935   2    2000002   -2
    0.083347935   2   -2000002    2
    0.083346645   2    2000004   -4
    0.083346645   2   -2000004    4
    0.080015734   2    2000013   -13
    0.080015734   2   -2000013    13
    0.080014129   2    2000011   -11
    0.080014129   2   -2000011    11
    0.070019513   2    1000024   -24
    0.070019513   2   -1000024    24
    0.069852168   2    1000022    25
    0.05979178   2    1000022    23
    0.05384138   2    1000023    25
    0.011024217   2    1000023    23
    0.0027162147   2    1000025    25
    0.0025239122   2    1000037   -24
    0.0025239122   2   -1000037    24
    0.0024114333   2    1000025    23
    0.00082252903   3    1000024    5   -6
    0.00082252903   3   -1000024   -5    6

DECAY 1000021  281.55338
    0.16594043   2    2000002   -2
    0.16594043   2   -2000002    2
    0.16594035   2    2000004   -4
    0.16594035   2   -2000004    4
    0.11713865   2    1000006   -6
    0.11713865   2   -1000006    6
    0.040316485   2    1000005   -5
    0.040316485   2   -1000005    5
    0.0030851687   2    2000001   -1
    0.0030851687   2   -2000001    1
    0.0030851679   2    2000003   -3
    0.0030851679   2   -2000003    3
    0.0017348165   2    2000005   -5
    0.0017348165   2   -2000005    5
    0.0014081144   3    1000023    6   -6
    0.0013097753   3    1000022    6   -6
    0.00070887911   3    1000025    6   -6
    0.00047222183   3    1000037    5   -6
    0.00047222183   3   -1000037   -5    6
    0.00022026524   3    1000035    4   -4
    0.00022026453   3    1000035    2   -2
    0.00018181051   3    1000024    5   -6
    0.00018181051   3   -1000024   -5    6

DECAY 25  0.003702911
    0.59411429   2   -5    5
    0.20636938   2   -24    24
    0.073360357   2    21    21
    0.068270211   2   -15    15
    0.029393658   2   -4    4
    0.024295191   2    23    23
    0.0023507259   2    22    22
    0.0013852651   2    22    23
    0.00023685188   2   -13    13
    0.00022329717   2   -3    3
    6.1739421e-07   2   -1    1
    1.5147732e-07   2   -2    2
    5.3247113e-09   2   -11    11

DECAY 35  49.89371
    0.21090488   2   -1000024    1000037
    0.21090488   2   -1000037    1000024
    0.13641672   2    1000023    1000025
    0.11895411   2   -5    5
    0.067789634   2    1000022    1000025
    0.067464536   2   -1000024    1000024
    0.035763171   2    1000023    1000035
    0.028363925   2   -1000037    1000037
    0.026798858   2    1000022    1000035
    0.023771762   2   -15    15
    0.022939484   2    1000022    1000022
    0.015626821   2    1000022    1000023
    0.014882401   2    1000025    1000025
    0.014284057   2   -6    6
    0.0040190062   2    1000025    1000035
    0.00070612377   2   -1000006    1000006
    0.00016161206   2    1000023    1000023
    8.3712004e-05   2   -13    13
    6.9192188e-05   2    1000035    1000035
    4.73926e-05   2   -3    3
    2.620525e-05   2    25    25
    4.1454283e-06   2   -1000002    1000002
    4.1431403e-06   2   -1000004    1000004
    3.522238e-06   2    23    23
    9.005215e-07   2   -24    24
    7.3452348e-07   2   -2000011    2000011
    7.340709e-07   2   -2000013    2000013
    6.990488e-07   2    21    21
    5.528876e-07   2   -1000011    1000011
    5.5216573e-07   2   -1000013    1000013
    2.0113528e-07   2    22    23
    1.959382e-07   2   -4    4
    1.3102853e-07   2   -1    1
    1.0333395e-07   2    22    22
    9.7790729e-08   2   -1000015    1000015
    3.1434202e-09   2   -2000013    1000013
    3.1434202e-09   2   -1000013    2000013
    1.8800578e-09   2   -11    11
    1.0100804e-12   2   -2    2
    7.3525144e-14   2   -2000011    1000011
    7.3525144e-14   2   -1000011    2000011

DECAY 36  49.527031
    0.19122872   2   -1000024    1000037
    0.19122872   2   -1000037    1000024
    0.11496702   2   -5    5
    0.097927034   2    1000022    1000025
    0.093119504   2    1000023    1000025
    0.089606946   2   -1000024    1000024
    0.049489942   2   -1000037    1000037
    0.032720227   2    1000022    1000022
    0.032315663   2    1000022    1000035
    0.030578943   2    1000023    1000035
    0.025501386   2    1000025    1000025
    0.022975282   2   -15    15
    0.013446283   2   -6    6
    0.010455066   2    1000022    1000023
    0.0041234393   2    1000025    1000035
    0.00012733278   2    1000023    1000023
    8.0907542e-05   2   -13    13
    4.580393e-05   2   -3    3
    4.4387674e-05   2    1000035    1000035
    1.0353276e-05   2    21    21
    6.4022625e-06   2    23    25
    1.8902632e-07   2    22    23
    1.8237712e-07   2   -4    4
    1.3191937e-07   2    22    22
    1.2663625e-07   2   -1    1
    3.1705512e-09   2   -2000013    1000013
    3.1705512e-09   2   -1000013    2000013
    1.8170716e-09   2   -11    11
    9.4020858e-13   2   -2    2
    7.4159521e-14   2   -2000011    1000011
    7.4159521e-14   2   -1000011    2000011
    1.3050547e-37   2    25    25

DECAY 37  49.804827
    0.2705502   2    1000022    1000037
    0.24779321   2    1000024    1000025
    0.22003657   2    1000023    1000037
    0.13307598   2   -5    6
    0.057264775   2    1000024    1000035
    0.038555152   2    1000023    1000024
    0.023481202   2   -15    16
    0.0081172954   2    1000035    1000037
    0.00078120355   2    1000022    1000024
    0.00017422243   2   -5    4
    8.3014418e-05   2   -13    14
    4.3406934e-05   2   -3    4
    2.2257132e-05   2   -3    6
    6.3739866e-06   2    24    25
    4.9353507e-06   2    1000025    1000037
    2.8896234e-06   2   -2000011    1000012
    2.8889854e-06   2   -2000013    1000014
    2.026765e-06   2   -3    2
    1.2441257e-06   2   -5    2
    1.0178714e-06   2   -1    6
    1.199018e-07   2   -1    2
    1.4897241e-08   2   -1    4
    6.0679827e-09   2   -1000013    1000014
    1.9417159e-09   2   -11    12
    1.3977856e-12   2   -1000005    1000004
    1.4193001e-13   2   -1000011    1000012
    6.7590788e-14   2    24    35
    5.2354837e-20   2   -1000005    1000002

DECAY 6  2.43
    1   2    5    24

DECAY 15 -1
