BLOCK DCINFO
   1   SDECAY/HDECAY
   2   1.3b /3.4

BLOCK SPINFO
   1   SOFTSUSY
   2   3.4.0

BLOCK MODSEL
   1   0

BLOCK SMINPUTS
   1    127.90897
   2    1.1663787e-05
   3    0.1184
   4    91.1876
   5    4.18
   6    173.2
   7    1.777

BLOCK MINPAR
   3    9.43

BLOCK EXTPAR
   0   -1
   1   -314.15
   2    2606.06
   3    3916.03
   11    4284.15
   12   -1858.24
   13    273.97
   23   -265.84
   26    1969.26
   31    3016.24
   32    3016.24
   33    2479.08
   34    3782.73
   35    3782.73
   36    2819.36
   41    3118.34
   42    3118.34
   43    3918.45
   44    2686.08
   45    2686.08
   46    3773.93
   47    400.85
   48    400.85
   49    1660.76

BLOCK MASS
   24    80.398209
   25    125.14476
   35    1969.3967
   36    1969.2598
   37    1971.2748
   5    4.8187603
   1000001    3287.9961
   2000001    830.64854
   1000002    3287.1796
   2000002    2841.8395
   1000003    3287.9961
   2000003    830.64854
   1000004    3287.1796
   2000004    2841.8395
   1000005    1858.9921
   2000005    4016.3515
   1000006    3798.5092
   2000006    4041.082
   1000011    3037.6709
   2000011    3789.7299
   1000012    3036.3374
   1000013    3037.6709
   2000013    3789.7299
   1000014    3036.3374
   1000015    2505.2056
   2000015    2826.1393
   1000016    2503.661
   1000021    4013.1685
   1000022   -258.5212
   1000023    280.39112
   1000025   -333.4365
   1000035    2638.7657
   1000024    280.59778
   1000037    2638.9315

BLOCK NMIX
   1   1   -0.54836445
   1   2   -0.017208014
   1   3    0.60969239
   1   4   -0.57207999
   2   1    0.046609051
   2   2    0.020599134
   2   3    0.70563939
   2   4    0.70673639
   3   1    0.83493941
   3   2   -0.011899939
   3   3    0.36103765
   3   4   -0.4151944
   4   1   -0.00046083966
   4   2    0.99956888
   4   3    0.00025246968
   4   4   -0.029355961

BLOCK UMIX
   1   1   -0.00035448336
   1   2    0.99999994
   2   1   -0.99999994
   2   2   -0.00035448336

BLOCK VMIX
   1   1    0.041510803
   1   2   -0.99913805
   2   1   -0.99913805
   2   2   -0.041510803

BLOCK STOPMIX
   1   1   -0.3031975
   1   2    0.95292774
   2   1   -0.95292774
   2   2   -0.3031975

BLOCK SBOTMIX
   1   1   -6.094275e-05
   1   2    1
   2   1   -1
   2   2   -6.094275e-05

BLOCK STAUMIX
   1   1    0.99999623
   1   2   -0.0027448107
   2   1    0.0027448107
   2   2    0.99999623

BLOCK ALPHA
      -0.11192195

BLOCK HMIX Q=  3846.227
   1   -270.20154
   2    8.9511002
   3    242.11856
   4    3728935.9

BLOCK GAUGE Q=  3846.227
   1    0.36585403
   2    0.63743467
   3    1.0007556

BLOCK AU Q=  3846.227
   1   1    0
   2   2    0
   3   3    4284.15

BLOCK AD Q=  3846.227
   1   1    0
   2   2    0
   3   3   -1858.24

BLOCK AE Q=  3846.227
   1   1    0
   2   2    0
   3   3    273.97

BLOCK YU Q=  3846.227
   1   1    0
   2   2    0
   3   3    0.82983441

BLOCK YD Q=  3846.227
   1   1    0
   2   2    0
   3   3    0.1198914

BLOCK YE Q=  3846.227
   1   1    0
   2   2    0
   3   3    0.091705743

BLOCK MSOFT Q=  3846.227
   1   -314.15
   2    2606.06
   3    3916.03
   21    3651816.9
   22    248496.14
   31    3016.24
   32    3016.24
   33    2479.08
   34    3782.73
   35    3782.73
   36    2819.36
   41    3118.34
   42    3118.34
   43    3918.45
   44    2686.08
   45    2686.08
   46    3773.93
   47    400.84985
   48    400.84985
   49    1660.76

BLOCK HIGGSBOUNDSINPUTHIGGSCOUPLINGSFERMIONS
       0, 80.122195,3,36,15,15

BLOCK HIGGSBOUNDSINPUTHIGGSCOUPLINGSBOSONS
       0,4,36,21,21,23

DECAY 6  1.4306403
    1   2    5    24

DECAY 1000021  263.66399
    0.13523751   2    2000001   -1
    0.13523751   2   -2000001    1
    0.13523751   2    2000003   -3
    0.13523751   2   -2000003    3
    0.090814758   2    1000005   -5
    0.090814758   2   -1000005    5
    0.03669046   2    2000002   -2
    0.03669046   2   -2000002    2
    0.036690436   2    2000004   -4
    0.036690436   2   -2000004    4
    0.015985508   2    1000002   -2
    0.015985508   2   -1000002    2
    0.015985476   2    1000004   -4
    0.015985476   2   -1000004    4
    0.015953139   2    1000001   -1
    0.015953139   2   -1000001    1
    0.015953139   2    1000003   -3
    0.015953139   2   -1000003    3
    0.0014520682   2    1000006   -6
    0.0014520682   2   -1000006    6

DECAY 1000006  106.23065
    0.4312788   2    1000024    5
    0.24285333   2    1000023    6
    0.20575019   2    1000022    6
    0.10554505   2    1000025    6
    0.0097185275   2    1000037    5
    0.0048540488   2    1000035    6
    4.83045e-08   2    1000005    24

DECAY 2000006  82.097625
    0.33039532   2    1000023    6
    0.18915734   2    1000022    6
    0.16810867   2    1000025    6
    0.11460709   2    1000037    5
    0.086869738   2    1000024    5
    0.057494683   2    1000035    6
    0.027236279   2    1000006    23
    0.025293372   2    1000006    25
    0.00083667901   2    1000005    37
    8.2871194e-07   2    1000005    24

DECAY 1000005  2.0448999
    0.3831917   2    1000025    5
    0.24833984   2    1000022    5
    0.24375334   2   -1000024    6
    0.12471512   2    1000023    5

DECAY 2000005  75.260782
    0.72002252   2   -1000024    6
    0.13960331   2   -1000037    6
    0.069623319   2    1000035    5
    0.046687449   2    1000006   -24
    0.008231312   2    1000025    5
    0.007554049   2    1000023    5
    0.0072689189   2    1000022    5
    0.0005037012   2    1000005    36
    0.00050354186   2    1000005    35
    1.3781907e-06   2    1000005    25
    4.9963915e-07   2    1000005    23

DECAY 1000002  5.6017669
    0.60353973   2    1000037    1
    0.3021124   2    1000035    2
    0.050013236   2    1000025    2
    0.034397179   2    1000022    2
    0.0079321954   2    1000024    1
    0.0020052578   2    1000023    2

DECAY 2000002  6.5288101
    0.69485596   2    1000025    2
    0.30296152   2    1000022    2
    0.0021825178   2    1000023    2
    4.3639581e-09   2    1000035    2

DECAY 1000001  5.5687691
    0.60938474   2   -1000037    2
    0.3046199   2    1000035    1
    0.067828127   2    1000025    1
    0.017850597   2    1000022    1
    0.00031605255   2    1000023    1
    5.8201158e-07   2   -1000024    2

DECAY 2000001  0.38314318
    0.66521635   2    1000025    1
    0.33247153   2    1000022    1
    0.0023121186   2    1000023    1

DECAY 1000004  5.5677215
    0.60218051   2    1000037    3
    0.30143302   2    1000035    4
    0.051085928   2    1000025    4
    0.035147417   2    1000022    4
    0.0081043425   2    1000024    3
    0.0020487776   2    1000023    4

DECAY 2000004  6.5647102
    0.69477865   2    1000025    4
    0.30303851   2    1000022    4
    0.0021828337   2    1000023    4
    4.1326616e-09   2    1000035    4

DECAY 1000003  5.5340029
    0.60813777   2   -1000037    4
    0.30399957   2    1000035    3
    0.069295772   2    1000025    3
    0.018243321   2    1000022    3
    0.00032297171   2    1000023    3
    5.9475251e-07   2   -1000024    4

DECAY 2000003  0.36252244
    0.66513394   2    1000025    3
    0.33255358   2    1000022    3
    0.0023124799   2    1000023    3

DECAY 1000011  6.1931166
    0.42255843   2    1000025    11
    0.23857517   2   -1000037    12
    0.21528276   2    1000022    11
    0.11921381   2    1000035    11
    0.0043693405   2    1000023    11
    4.8975827e-07   2   -1000024    12

DECAY 2000011  19.909094
    0.69581278   2    1000025    11
    0.30200893   2    1000022    11
    0.0021782378   2    1000023    11
    5.7140173e-08   2    1000035    11

DECAY 1000013  6.1931165
    0.42255843   2    1000025    13
    0.23857517   2   -1000037    14
    0.21528276   2    1000022    13
    0.11921381   2    1000035    13
    0.0043693405   2    1000023    13
    4.8975828e-07   2   -1000024    14

DECAY 2000013  19.909094
    0.69581278   2    1000025    13
    0.30200893   2    1000022    13
    0.0021782378   2    1000023    13
    5.7140172e-08   2    1000035    13

DECAY 1000015  3.6565661
    0.59735182   2    1000025    15
    0.34094577   2    1000022    15
    0.061702395   2    1000023    15
    8.8162422e-09   2   -1000024    16

DECAY 2000015  15.61401
    0.65740471   2    1000025    15
    0.29594158   2    1000022    15
    0.029689326   2   -1000024    16
    0.016838581   2    1000023    15
    6.1615443e-05   2    1000016   -24
    3.3450223e-05   2    1000015    25
    3.047802e-05   2    1000015    23
    1.7421293e-07   2   -1000037    16
    9.0153178e-08   2    1000035    15

DECAY 1000012  6.2027972
    0.46575282   2    1000025    12
    0.23640479   2    1000037    11
    0.17260745   2    1000022    12
    0.11845883   2    1000035    12
    0.0067024989   2    1000024    11
    7.360881e-05   2    1000023    12

DECAY 1000014  6.2027972
    0.46575282   2    1000025    14
    0.23640478   2    1000037    13
    0.17260745   2    1000022    14
    0.11845883   2    1000035    14
    0.006702499   2    1000024    13
    7.3608811e-05   2    1000023    14

DECAY 1000016  3.6744547
    0.64086975   2    1000025    16
    0.23860997   2    1000022    16
    0.12041865   2    1000024    15
    0.00010163089   2    1000023    16

DECAY 1000024  4.0539222e-06
    0.33450897   3    1000022    2   -1
    0.33450897   3    1000022    4   -3
    0.11150162   3    1000022   -11    12
    0.11150162   3    1000022   -13    14
    0.10797882   3    1000022   -15    16
    1.0643109e-11   3    1000023   -11    12
    1.0643109e-11   3    1000023   -13    14

DECAY 1000037  24.047763
    0.21004107   2    1000024    25
    0.20526055   2    1000024    23
    0.19936542   2    1000023    24
    0.13511007   2    1000022    24
    0.063538491   2    1000025    24
    0.044585994   2    1000024    35
    0.044576441   2    1000024    36
    0.044240129   2    1000023    37
    0.033033977   2    1000022    37
    0.011502356   2    1000025    37
    0.0044177183   2    1000016   -15
    0.0043277848   2   -1000015    16
    5.3351061e-09   2   -1000005    6

DECAY 1000022 -1


DECAY 1000023  3.0931873e-06
    0.15934361   3    1000022   -1    1
    0.15934361   3    1000022   -3    3
    0.12267989   3    1000022   -2    2
    0.12267989   3    1000022   -4    4
    0.10250145   3    1000022   -5    5
    0.073344953   3    1000022   -16    16
    0.07334485   3    1000022   -12    12
    0.07334485   3    1000022   -14    14
    0.036672984   3    1000022   -11    11
    0.036672984   3    1000022   -13    13
    0.035295298   3    1000022   -15    15
    0.0047756302   2    1000022    22

DECAY 1000025  0.00044978186
    0.1186648   3    1000024   -2    1
    0.1186648   3   -1000024   -1    2
    0.1186648   3    1000024   -4    3
    0.1186648   3   -1000024   -3    4
    0.042335188   3    1000023   -1    1
    0.042335188   3    1000023   -3    3
    0.039556276   3    1000024   -12    11
    0.039556276   3   -1000024    12   -11
    0.039556276   3    1000024   -14    13
    0.039556276   3   -1000024    14   -13
    0.039338101   3    1000024   -16    15
    0.039338101   3   -1000024    16   -15
    0.039218661   3    1000023   -5    5
    0.032590104   3    1000023   -2    2
    0.032590104   3    1000023   -4    4
    0.019485284   3    1000023   -12    12
    0.019485284   3    1000023   -14    14
    0.019485221   3    1000023   -16    16
    0.0097446579   3    1000023   -11    11
    0.0097446579   3    1000023   -13    13
    0.0096582241   3    1000023   -15    15
    0.0019985122   2    1000022    22
    0.0014113018   3    1000022   -1    1
    0.0014113018   3    1000022   -3    3
    0.0013577785   3    1000022   -5    5
    0.0010639219   3    1000022   -2    2
    0.0010639219   3    1000022   -4    4
    0.00063760856   3    1000022   -12    12
    0.00063760856   3    1000022   -14    14
    0.00063557833   3    1000022   -16    16
    0.00055722704   2    1000023    22
    0.0003343763   3    1000022   -15    15
    0.00032889983   3    1000022   -11    11
    0.00032889983   3    1000022   -13    13

DECAY 1000035  24.033667
    0.19899483   2    1000024   -24
    0.19899483   2   -1000024    24
    0.10461377   2    1000023    23
    0.10396226   2    1000023    25
    0.074050084   2    1000022    25
    0.066396192   2    1000022    23
    0.044360163   2    1000024   -37
    0.044360163   2   -1000024    37
    0.036144892   2    1000023    35
    0.034411996   2    1000025    23
    0.031873951   2    1000025    25
    0.026391017   2    1000022    36
    0.0098339829   2    1000025    36
    0.0083554439   2    1000023    36
    0.0067993417   2    1000022    35
    0.0022082676   2    1000016   -16
    0.0022082676   2   -1000016    16
    0.0021568761   2    1000015   -15
    0.0021568761   2   -1000015    15
    0.0017267189   2    1000025    35
    1.6815945e-08   2    2000001   -1
    1.6815945e-08   2   -2000001    1
    1.6815945e-08   2    2000003   -3
    1.6815945e-08   2   -2000003    3
    7.9658805e-09   2    1000005   -5
    7.9658805e-09   2   -1000005    5

DECAY 25  0.0040673211
    0.59519243   2    5   -5
    0.20964655   2    24   -24
    0.078749656   2    21    21
    0.064452331   2   -15    15
    0.026262436   2    23    23
    0.021340176   2    4   -4
    0.0023231315   2    22    22
    0.0015561854   2    22    23
    0.00024897001   2    3   -3
    0.00022813545   2   -13    13

DECAY 35  5.5251516
    0.34662434   2    5   -5
    0.18929664   2    6   -6
    0.18522982   2    1000023    1000025
    0.066081157   2    1000022    1000023
    0.060913356   2    1000022    1000022
    0.059509781   2   -15    15
    0.051743334   2    1000025    1000025
    0.03454188   2    1000022    1000025
    0.0045237322   2    1000024   -1000024
    0.00073384876   2    25    25
    0.00021016823   2   -13    13
    0.00019538243   2    24   -24
    0.0001419074   2    3   -3
    0.00011709271   2    21    21
    9.7308326e-05   2    23    23
    3.0607324e-05   2    1000023    1000023
    3.6257082e-06   2    2000001   -2000001
    3.6257082e-06   2    2000003   -2000003
    1.9566845e-06   2    4   -4
    2.6456436e-07   2    22    22
    1.7257328e-07   2    23    22

DECAY 36  5.5345202
    0.34618742   2    5   -5
    0.19079638   2    6   -6
    0.10696858   2    1000023    1000025
    0.099634919   2    1000022    1000022
    0.098002857   2    1000025    1000025
    0.059413939   2   -15    15
    0.054757621   2    1000022    1000025
    0.038426776   2    1000022    1000023
    0.0049343707   2    1000024   -1000024
    0.00030499436   2    21    21
    0.00020982908   2   -13    13
    0.00019664322   2    23    25
    0.00014180461   2    3   -3
    2.118968e-05   2    1000023    1000023
    1.94797e-06   2    4   -4
    4.1476843e-07   2    22    22
    3.2244407e-07   2    23    22

DECAY 37  5.4662893
    0.53343082   2    6   -5
    0.26514095   2    1000024    1000025
    0.13713591   2    1000024    1000022
    0.060217105   2   -15    16
    0.0029257076   2    1000024    1000023
    0.00058076677   2    4   -5
    0.00021266558   2   -13    14
    0.00020000689   2    24    25
    0.00014308564   2    4   -3
    7.1734367e-06   2    2   -3
    5.8076208e-06   2    2   -5
    7.9891724e-12   2    24    36

DECAY 5 -1


DECAY 15 -1


DECAY 23  2.4952


DECAY 24  2.085
