BLOCK DCINFO
   1   SDECAY/HDECAY
   2   1.3b /3.4

BLOCK SPINFO
   1   SOFTSUSY
   2   3.4.0

BLOCK MODSEL
   1   0

BLOCK SMINPUTS
   1    127.90897
   2    1.1663787e-05
   3    0.1184
   4    91.1876
   5    4.18
   6    173.2
   7    1.777

BLOCK MINPAR
   3    24.47

BLOCK EXTPAR
   0   -1
   1    1669.1
   2   -1696.76
   3    1957.4
   11   -2359.26
   12    3930.35
   13    103.95
   23   -900.41
   26    3530.47
   31    1666.35
   32    1666.35
   33    3144.89
   34    2341.57
   35    2341.57
   36    3932.86
   41    3629.09
   42    3629.09
   43    1469.9
   44    3037.52
   45    3037.52
   46    1326.63
   47    1920.92
   48    1920.92
   49    2164.64

BLOCK MASS
   24    80.392
   25    124.31272
   35    3530.4835
   36    3530.47
   37    3531.4018
   5    4.8187603
   1000001    3656.4467
   2000001    1968.7186
   1000002    3655.7184
   2000002    3062.8574
   1000003    3656.4467
   2000003    1968.7186
   1000004    3655.7184
   2000004    3062.8574
   1000005    1519.7015
   2000005    2213.4072
   1000006    1292.9557
   2000006    1580.6429
   1000011    1677.2883
   2000011    2345.7034
   1000012    1675.0984
   1000013    1677.2883
   2000013    2345.7034
   1000014    1675.0984
   1000015    3151.2843
   2000015    3937.5605
   1000016    3150.005
   1000021    2087.9757
   1000022   -918.72601
   1000023    921.38296
   1000025    1674.1725
   1000035   -1738.449
   1000024    919.32761
   1000037    1738.6201

BLOCK NMIX
   1   1    0.012642259
   1   2    0.069757148
   1   3    0.70645841
   1   4   -0.70419502
   2   1   -0.040432044
   2   2   -0.020122064
   2   3    0.70660926
   2   4    0.70616125
   3   1    0.99910192
   3   2   -0.00082306408
   3   3    0.019625289
   3   4    0.037543494
   4   1   -0.0008754498
   4   2    0.9973607
   4   3   -0.035138676
   4   4    0.063530635

BLOCK UMIX
   1   1    0.049689853
   1   2    0.9987647
   2   1   -0.9987647
   2   2    0.049689853

BLOCK VMIX
   1   1   -0.089846522
   1   2   -0.99595562
   2   1    0.99595562
   2   2   -0.089846522

BLOCK STOPMIX
   1   1    0.45492563
   1   2    0.89052944
   2   1   -0.89052944
   2   2    0.45492563

BLOCK SBOTMIX
   1   1    0.99969832
   1   2   -0.024561657
   2   1    0.024561657
   2   2    0.99969832

BLOCK STAUMIX
   1   1    0.99997535
   1   2   -0.0070210678
   2   1    0.0070210678
   2   2    0.99997535

BLOCK ALPHA
      -0.042209445

BLOCK HMIX Q=  1392.966
   1   -912.45734
   2    23.735715
   3    243.74209
   4    12690912

BLOCK GAUGE Q=  1392.966
   1    0.36243187
   2    0.6360007
   3    1.0339696

BLOCK AU Q=  1392.966
   1   1    0
   2   2    0
   3   3   -2359.26

BLOCK AD Q=  1392.966
   1   1    0
   2   2    0
   3   3    3930.35

BLOCK AE Q=  1392.966
   1   1    0
   2   2    0
   3   3    103.95

BLOCK YU Q=  1392.966
   1   1    0
   2   2    0
   3   3    0.83679641

BLOCK YD Q=  1392.966
   1   1    0
   2   2    0
   3   3    0.35829507

BLOCK YE Q=  1392.966
   1   1    0
   2   2    0
   3   3    0.24737699

BLOCK MSOFT Q=  1392.966
   1    1669.1
   2   -1696.76
   3    1957.4
   21    11639381
   22   -787881.15
   31    1666.35
   32    1666.35
   33    3144.89
   34    2341.57
   35    2341.57
   36    3932.86
   41    3629.09
   42    3629.09
   43    1469.9
   44    3037.52
   45    3037.52
   46    1326.63
   47    1920.92
   48    1920.92
   49    2164.64

BLOCK HIGGSBOUNDSINPUTHIGGSCOUPLINGSFERMIONS
       0, 563.38417,3,36,15,15

BLOCK HIGGSBOUNDSINPUTHIGGSCOUPLINGSBOSONS
       0,4,36,21,21,23

DECAY 6  1.4244854
    1   2    5    24

DECAY 1000021  32.533867
    0.19480675   2    1000006   -6
    0.19480675   2   -1000006    6
    0.14771362   2    2000006   -6
    0.14771362   2   -2000006    6
    0.1443643   2    1000005   -5
    0.1443643   2   -1000005    5
    0.0065576632   2    2000001   -1
    0.0065576632   2   -2000001    1
    0.0065576632   2    2000003   -3
    0.0065576632   2   -2000003    3

DECAY 1000006  7.0249002
    0.48504834   2    1000024    5
    0.33994566   2    1000022    6
    0.17500601   2    1000023    6

DECAY 2000006  21.968321
    0.29183155   2    1000006    23
    0.23944418   2    1000023    6
    0.17863293   2    1000024    5
    0.17840169   2    1000022    6
    0.11168965   2    1000006    25

DECAY 1000005  17.081717
    0.45491044   2    1000006   -24
    0.45320577   2   -1000024    6
    0.046478296   2    1000022    5
    0.045405496   2    1000023    5

DECAY 2000005  10.701905
    0.35697285   2   -1000024    6
    0.18034142   2    1000023    5
    0.17966428   2    1000022    5
    0.14241452   2    1000021    5
    0.034633634   2    2000006   -24
    0.032579626   2    1000005    25
    0.028147982   2    1000005    23
    0.022242478   2    1000006   -24
    0.022026065   2    1000025    5
    0.00064041638   2   -1000037    6
    0.00033673217   2    1000035    5

DECAY 1000002  141.31846
    0.81642235   2    1000021    2
    0.11948912   2    1000037    1
    0.059900107   2    1000035    2
    0.0022422367   2    1000025    2
    0.0014201386   2    1000024    1
    0.00045808919   2    1000022    2
    6.7951583e-05   2    1000023    2

DECAY 2000002  64.387736
    0.94749106   2    1000021    2
    0.052351478   2    1000025    2
    0.00014339135   2    1000023    2
    1.4034982e-05   2    1000022    2
    3.758835e-08   2    1000035    2

DECAY 1000001  141.34841
    0.81672691   2    1000021    1
    0.12019068   2   -1000037    2
    0.059953321   2    1000035    1
    0.0022819297   2    1000025    1
    0.00043439317   2   -1000024    2
    0.00039915546   2    1000022    1
    1.3609068e-05   2    1000023    1

DECAY 2000001  0.089230828
    0.98629958   2    1000025    1
    0.012476252   2    1000023    1
    0.0012236871   2    1000022    1
    4.8347131e-07   2    1000035    1

DECAY 1000004  120.97612
    0.77808742   2    1000021    4
    0.14443505   2    1000037    3
    0.072405571   2    1000035    4
    0.0027113252   2    1000025    4
    0.0017225711   2    1000024    3
    0.00055564479   2    1000022    4
    8.2421901e-05   2    1000023    4

DECAY 2000004  53.275512
    0.9342534   2    1000021    4
    0.065548291   2    1000025    4
    0.00018058867   2    1000023    4
    1.7676085e-05   2    1000022    4
    4.7026999e-08   2    1000035    4

DECAY 1000003  120.99184
    0.77844219   2    1000021    3
    0.1452948   2   -1000037    4
    0.072475816   2    1000035    3
    0.0027595468   2    1000025    3
    0.00052694275   2   -1000024    4
    0.00048419864   2    1000022    3
    1.6508428e-05   2    1000023    3

DECAY 2000003  0.0887175
    0.98589055   2    1000025    3
    0.01284871   2    1000023    3
    0.0012602577   2    1000022    3
    4.791046e-07   2    1000035    3

DECAY 1000011  0.042055871
    0.46570293   2    1000022    11
    0.38782854   2   -1000024    12
    0.14575393   2    1000023    11
    0.00071460366   2    1000025    11

DECAY 2000011  2.9613183
    0.99468454   2    1000025    11
    0.0048405704   2    1000023    11
    0.00047424924   2    1000022    11
    6.4463842e-07   2    1000035    11

DECAY 1000013  0.042055853
    0.46570312   2    1000022    13
    0.3878287   2   -1000024    14
    0.14575399   2    1000023    13
    0.00071419221   2    1000025    13

DECAY 2000013  2.9613182
    0.99468454   2    1000025    13
    0.0048405705   2    1000023    13
    0.00047424925   2    1000022    13
    6.4463842e-07   2    1000035    13

DECAY 1000015  23.795981
    0.51421476   2   -1000037    16
    0.2562774   2    1000035    15
    0.088748521   2    1000025    15
    0.070152303   2    1000022    15
    0.068156261   2    1000023    15
    0.0024507563   2   -1000024    16

DECAY 2000015  22.55835
    0.61123003   2    1000025    15
    0.18914982   2   -1000024    16
    0.096128834   2    1000023    15
    0.094742426   2    1000022    15
    0.0038144712   2    1000016   -24
    0.0020406821   2    1000015    25
    0.0019460923   2    1000015    23
    0.000631537   2   -1000037    16
    0.00031611121   2    1000035    15

DECAY 1000012  0.066059306
    0.80436964   2    1000024    11
    0.1951671   2    1000022    12
    0.00042275304   2    1000023    12
    4.0511865e-05   2    1000025    12

DECAY 1000014  0.066059305
    0.80436963   2    1000024    13
    0.1951671   2    1000022    14
    0.00042275304   2    1000023    14
    4.0511865e-05   2    1000025    14

DECAY 1000016  23.801281
    0.51101507   2    1000037    15
    0.25642446   2    1000035    16
    0.14168452   2    1000024    15
    0.089127943   2    1000025    16
    0.001744218   2    1000022    16
    3.7929773e-06   2    1000023    16

DECAY 1000024  4.0757022e-13
    0.77728313   2    1000022    211
    0.11293125   3    1000022   -11    12
    0.097275082   3    1000022   -13    14
    0.012492284   3    1000022    211    111
    9.1273344e-06   4    1000022    211    111    111
    9.1273344e-06   4    1000022    211    211   -211

DECAY 1000037  15.421806
    0.21600987   2    1000024    25
    0.21073676   2    1000024    23
    0.20610652   2    1000022    24
    0.20556588   2    1000023    24
    0.084747389   2    1000006   -5
    0.039470988   2   -1000005    6
    0.028384424   2    2000006   -5
    0.002315503   2    1000012   -11
    0.002315503   2    1000014   -13
    0.0021735823   2   -1000011    12
    0.0021735823   2   -1000013    14

DECAY 1000022 -1


DECAY 1000023  1.7720379e-10
    0.11238145   3    1000022   -1    1
    0.11238145   3    1000022   -3    3
    0.086612435   3    1000022   -2    2
    0.081016595   3    1000024   -2    1
    0.081016595   3   -1000024   -1    2
    0.051558225   3    1000022   -16    16
    0.051558178   3    1000022   -12    12
    0.051558178   3    1000022   -14    14
    0.050012511   2    1000022    22
    0.027005292   3    1000024   -12    11
    0.027005292   3   -1000024    12   -11
    0.027005292   3    1000024   -14    13
    0.027005292   3   -1000024    14   -13
    0.025788274   3    1000022   -11    11
    0.025788274   3    1000022   -13    13
    0.00013674168   3    1000024   -16    15
    0.00013674168   3   -1000024    16   -15

DECAY 1000025  4.6106524
    0.19054426   2    1000024   -24
    0.19054426   2   -1000024    24
    0.17847826   2    1000023    25
    0.17723683   2    1000022    23
    0.11131925   2    1000006   -6
    0.11131925   2   -1000006    6
    0.018019124   2    1000023    23
    0.017613965   2    1000022    25
    0.0024623986   2    1000005   -5
    0.0024623986   2   -1000005    5

DECAY 1000035  15.342993
    0.20689621   2    1000024   -24
    0.20689621   2   -1000024    24
    0.20026081   2    1000022    25
    0.19487251   2    1000023    23
    0.037740224   2    1000005   -5
    0.037740224   2   -1000005    5
    0.037083242   2    1000006   -6
    0.037083242   2   -1000006    6
    0.016564239   2    1000022    23
    0.015885254   2    1000023    25
    0.0011620957   2    1000012   -12
    0.0011620957   2   -1000012    12
    0.0011620957   2    1000014   -14
    0.0011620957   2   -1000014    14
    0.0010823646   2    1000011   -11
    0.0010823646   2   -1000011    11
    0.0010823646   2    1000013   -13
    0.0010823646   2   -1000013    13

DECAY 25  0.0036705248
    0.57754655   2    5   -5
    0.21229569   2    24   -24
    0.085345054   2    21    21
    0.070444952   2   -15    15
    0.026212087   2    23    23
    0.02352413   2    4   -4
    0.0025101178   2    22    22
    0.0015995003   2    22    23
    0.00027258469   2    3   -3
    0.00024933791   2   -13    13

DECAY 35  55.171049
    0.38144373   2    5   -5
    0.12279495   2    1000024   -1000037
    0.12279495   2    1000037   -1000024
    0.088571559   2    1000023    1000035
    0.07258711   2   -15    15
    0.049342591   2    1000006   -1000006
    0.037228085   2    2000006   -2000006
    0.034094734   2    1000022    1000035
    0.023330637   2    1000006   -2000006
    0.023330637   2    2000006   -1000006
    0.022360085   2    1000022    1000025
    0.012830914   2    1000023    1000025
    0.0045193714   2    6   -6
    0.0025898007   2    1000024   -1000024
    0.0006130125   2    1000022    1000022
    0.00051993364   2    1000022    1000023
    0.00046145735   2    1000005   -1000005
    0.00025044584   2   -13    13
    0.00018267319   2    3   -3
    0.00010312884   2    1000025    1000035
    2.5059712e-05   2    21    21
    8.6379577e-06   2    25    25
    5.8612937e-06   2    1000037   -1000037
    2.9717386e-06   2    1000035    1000035
    2.7617356e-06   2    24   -24
    2.2297296e-06   2    1000025    1000025
    1.3783058e-06   2    23    23
    4.2333009e-07   2    1000023    1000023
    2.6063198e-07   2    1000012   -1000012
    2.6063198e-07   2    1000014   -1000014
    1.3654651e-07   2    22    22
    7.9175606e-08   2    1000011   -1000011
    7.9175606e-08   2    1000013   -1000013
    4.5847995e-08   2    4   -4
    1.9213855e-09   2    23    22

DECAY 36  55.235073
    0.38101707   2    5   -5
    0.12167216   2    1000024   -1000037
    0.12167216   2    1000037   -1000024
    0.087900925   2    1000022    1000035
    0.072503412   2   -15    15
    0.067608497   2    1000006   -2000006
    0.067608497   2   -1000006    2000006
    0.034142449   2    1000023    1000035
    0.022490006   2    1000023    1000025
    0.012777473   2    1000022    1000025
    0.0045196529   2    6   -6
    0.0038957676   2    1000024   -1000024
    0.00099369691   2    1000022    1000022
    0.00032208384   2    1000022    1000023
    0.00026571031   2    1000037   -1000037
    0.00025015684   2   -13    13
    0.00018248507   2    3   -3
    0.00013374529   2    1000035    1000035
    1.7876917e-05   2    21    21
    1.6032941e-05   2    1000025    1000025
    6.6629873e-06   2    1000025    1000035
    2.7976477e-06   2    23    25
    4.9094945e-07   2    1000023    1000023
    1.1990678e-07   2    22    22
    4.5993058e-08   2    4   -4
    1.5947132e-08   2    23    22

DECAY 37  63.6484
    0.37979976   2    6   -5
    0.13714999   2    1000006   -1000005
    0.10760711   2    1000037    1000022
    0.1068512   2    1000024    1000035
    0.10624377   2    1000037    1000023
    0.062936197   2   -15    16
    0.044838499   2    1000006   -2000005
    0.030321249   2    1000024    1000025
    0.021553058   2    2000006   -1000005
    0.0014572243   2    1000024    1000023
    0.00063255997   2    4   -5
    0.0002171473   2   -13    14
    0.00015601796   2    4   -3
    0.00012367492   2    1000024    1000022
    9.532214e-05   2    1000037    1000025
    7.9245737e-06   2    2   -3
    6.3255937e-06   2    2   -5
    2.4308601e-06   2    24    25
    2.7124259e-07   2   -1000011    1000012
    2.7124259e-07   2   -1000013    1000014
    1.8466036e-10   2    1000037    1000035
    1.4523053e-14   2    24    36

DECAY 5 -1


DECAY 15 -1


DECAY 23  2.4952


DECAY 24  2.085
