BLOCK SPINFO
   1   SPheno
   2   v4.0.5be

BLOCK SPHENOINFO
   1   2
   2   2

BLOCK MODSEL
   1   0

BLOCK MINPAR
   3    54.677695
   4    1

BLOCK EXTPAR
   0    1390.7168
   1    700.89847
   2    624.09805
   3    3000
   11   -3148.0919
   12    1564.2943
   13    983.87553
   23    411.24573
   25    54.447962
   26    1360.4671
   31    1447.4641
   32    1447.4641
   33    1245.1817
   34    1014.0487
   35    1014.0487
   36    1120.4276
   41    5000
   42    5000
   43    1163.0965
   44    5000
   45    5000
   46    1830.8465
   47    5000
   48    5000
   49    1256.8048

BLOCK SMINPUTS
   1    127.90897
   2    1.1663787e-05
   3    0.1184
   4    91.1876
   5    4.18
   6    173.2
   7    1.777
   8    0
   11    0.00051099893
   12    0
   13    0.10565837
   14    0
   21    0.005
   22    0.0025
   23    0.095
   24    1.27

BLOCK GAUGE Q=  1390.7168
   1    0.35536298
   2    0.66519887
   3    1.219778

BLOCK YU Q=  1390.7168
   1   1    8.3857861e-06
   2   2    0.0042599793
   3   3    1.0130703

BLOCK YD Q=  1390.7168
   1   1    0.00091749911
   2   2    0.017432483
   3   3    0.90987162

BLOCK YE Q=  1390.7168
   1   1    0.00016011031
   2   2    0.033105733
   3   3    0.55678397

BLOCK AU Q=  1390.7168
   1   1    0
   2   2    0
   3   3   -3148.092

BLOCK AD Q=  1390.7168
   1   1    0
   2   2    0
   3   3    1564.2941

BLOCK AE Q=  1390.7168
   1   1    0
   2   2    0
   3   3    983.87554

BLOCK MSOFT Q=  1390.7168
   1    700.89847
   2    624.09805
   3    3000
   21    1787860.2
   22   -155854.29
   31    1447.4641
   32    1447.4641
   33    1245.1817
   34    1014.0487
   35    1014.0487
   36    1120.4276
   41    5000
   42    5000
   43    1163.0965
   44    5000
   45    5000
   46    1830.8465
   47    5000
   48    5000
   49    1256.8048

BLOCK MASS
   6    173.2
   23    91.1876
   24    80.429995
   15    1.777
   25    124.17539
   35    1359.2244
   36    1360.4671
   37    1363.3771
   1000001    5025.2437
   2000001    5014.9576
   1000002    5024.799
   2000002    5016.1045
   1000003    5025.2517
   2000003    5014.9698
   1000004    5024.8061
   2000004    5016.1054
   1000005    1108.6688
   2000005    1225.4874
   1000006    1072.4664
   2000006    1803.4067
   1000011    1451.856
   2000011    1018.6641
   1000012    1449.3255
   1000013    1451.8375
   2000013    1018.6149
   1000014    1449.3042
   1000015    1109.2164
   2000015    1245.2323
   1000016    1240.4081
   1000021    3183.4516
   1000022    399.11773
   1000023   -419.79021
   1000025    670.04652
   1000035    706.3272
   1000024    405.69597
   1000037    672.60721

BLOCK ALPHA
      -0.018551797

BLOCK HMIX Q=  1390.7168
   1    411.24573
   2    54.447962
   3    244.06351
   4    1850870.7

BLOCK STOPMIX
   1   1    0.97579677
   1   2    0.21867937
   2   1   -0.21867937
   2   2    0.97579677

BLOCK SBOTMIX
   1   1    0.98387808
   1   2    0.1788405
   2   1   -0.1788405
   2   2    0.98387808

BLOCK STAUMIX
   1   1    0.12111638
   1   2    0.99263831
   2   1   -0.99263831
   2   2    0.12111638

BLOCK NMIX
   1   1   -0.10097316
   1   2    0.21610559
   1   3   -0.69995332
   1   4    0.67317765
   2   1   -0.02734587
   2   2    0.052449609
   2   3    0.70236144
   2   4    0.70935862
   3   1    0.21009579
   3   2    0.95762208
   3   3    0.10502859
   3   4   -0.16669944
   4   1   -0.9720681
   4   2    0.18305016
   4   3    0.075648899
   4   4   -0.12591068

BLOCK UMIX
   1   1   -0.17285049
   1   2    0.98494807
   2   1    0.98494807
   2   2    0.17285049

BLOCK VMIX
   1   1   -0.27471209
   1   2    0.96152653
   2   1    0.96152653
   2   2    0.27471209

BLOCK HIGGSBOUNDSINPUTHIGGSCOUPLINGSFERMIONS
       0, 2964.5805,3,36,15,15

BLOCK HIGGSBOUNDSINPUTHIGGSCOUPLINGSBOSONS
       0,4,36,21,21,23

BLOCK SPHENOLOWENERGY
   1    0.0002658165
   2    1.6033964e-06
   3    3.5261834e-05
   4    5.6037817e-15
   5    2.393409e-10
   6    4.7440313e-08
   7    1.8662026e-13
   8    7.9709312e-09
   9    1.6044041e-06
   10    9.0837191e-05
   11    0.93831341
   12    0.54214262
   13    19.330518
   14    0
   15    0
   16    0.0021580797
   17    2.2816759e-15
   18    2.4797443e-11
   19    8.2899945e-11
   20    1.1717428e-14
   21    5.0094509e-10
   22    1.6893346e-07
   23    0
   24    0
   25    0
   26    0
   27    0
   28    0
   29    0
   30    0
   31    0
   39    8.2613596e-05
   40    0
   41    0
   42    0

BLOCK FWCOEF Q=  160
   305   4422   0   0   -0.18881911
   305   4422   0   2   -0.11533602
   305   4322   0   2    0.00011477412
   305   6421   0   0   -0.095227835
   305   6421   0   2   -0.075757295
   305   6321   0   2   -0.00032141149
   3051111   4133   0   0    1.590078
   3051111   4133   0   2    1.5915467
   3051111   4233   0   2    0.00030116076
   3051111   4137   0   0   -4.4127701
   3051111   4137   0   2   -4.4120222
   3051111   4237   0   2   -0.0023472673
   3051313   4133   0   0    1.590078
   3051313   4133   0   2    1.591542
   3051313   4233   0   2    0.00030114073
   3051313   4137   0   0   -4.4127701
   3051313   4137   0   2   -4.4120269
   3051313   4237   0   2   -0.0023472622
   3051212   4137   0   0    1.5053501
   3051212   4137   0   2    1.5052059
   3051212   4237   0   2    0.00051177564
   3051414   4137   0   0    1.5053501
   3051414   4137   0   2    1.5052059
   3051414   4237   0   2    0.00051177913
   3051616   4137   0   0    1.5053501
   3051616   4137   0   2    1.5052061
   3051616   4237   0   2    0.00051276158

BLOCK IMFWCOEF Q=  160
   305   4422   0   0    3.858865e-07
   305   4422   0   2    5.1013088e-05
   305   4322   0   2    9.5560103e-06
   305   6421   0   0    3.3053731e-07
   305   6421   0   2   -3.0167387e-06
   305   6321   0   2    3.3423302e-06
   3051111   4133   0   2   -4.1725184e-07
   3051111   4233   0   2    9.5947971e-06
   3051111   4137   0   2    5.8525828e-06
   3051111   4237   0   2   -7.4889594e-05
   3051313   4133   0   2   -4.1733562e-07
   3051313   4233   0   2    9.5947267e-06
   3051313   4137   0   2    5.8525707e-06
   3051313   4237   0   2   -7.488979e-05
   3051212   4137   0   2   -9.5025379e-07
   3051212   4237   0   2    1.6328251e-05
   3051414   4137   0   2   -9.5025325e-07
   3051414   4237   0   2    1.6328251e-05
   3051616   4137   0   2   -9.4786008e-07
   3051616   4237   0   2    1.6328251e-05

DECAY 23  2.4952


DECAY 24  2.085


DECAY 2000011  1.4165946
    0.92040645   2    1000035    11
    0.051334533   2    1000025    11
    0.026396501   2    1000022    11
    0.0018622644   2    1000023    11

DECAY 1000011  13.075105
    0.58491763   2   -1000037    12
    0.34649233   2    1000025    11
    0.032196896   2    1000035    11
    0.024822   2   -1000024    12
    0.010983395   2    1000022    11
    0.00058774565   2    1000023    11

DECAY 2000013  1.4472046
    0.90076031   2    1000035    13
    0.050292602   2    1000025    13
    0.031221074   2    1000022    13
    0.010539472   2   -1000024    14
    0.007040695   2    1000023    13
    0.00014584467   2   -1000037    14

DECAY 1000013  13.102068
    0.58369836   2   -1000037    14
    0.34578702   2    1000025    13
    0.032137682   2    1000035    13
    0.024770497   2   -1000024    14
    0.01197187   2    1000022    13
    0.0015874993   2    1000023    13

DECAY 1000015  12.313851
    0.41912043   2   -1000024    16
    0.22585402   2    1000022    15
    0.19747562   2    1000023    15
    0.14830555   2    1000035    15
    0.0090568598   2    1000025    15
    0.00018752425   2   -1000037    16

DECAY 2000015  15.117494
    0.36025158   2   -1000037    16
    0.21405864   2    1000025    15
    0.20117623   2    1000023    15
    0.19226073   2    1000022    15
    0.025024158   2    1000035    15
    0.002980616   2   -1000024    16
    0.0022549359   2    1000015    23
    0.0019931108   2    1000015    25

DECAY 1000012  13.149159
    0.55226838   2    1000037    11
    0.21434646   2    1000025    12
    0.13913825   2    1000035    12
    0.062199061   2    1000024    11
    0.030216941   2    1000022    12
    0.0018309133   2    1000023    12

DECAY 1000014  13.175385
    0.55119712   2    1000037    13
    0.21391326   2    1000025    14
    0.13885673   2    1000035    14
    0.06404945   2    1000024    13
    0.030156208   2    1000022    14
    0.0018272323   2    1000023    14

DECAY 1000016  15.321762
    0.42891151   2    1000024    15
    0.33603374   2    1000037    15
    0.12772717   2    1000025    16
    0.080266536   2    1000035    16
    0.020883798   2    1000022    16
    0.0049209121   2    1000015    24
    0.0012563427   2    1000023    16

DECAY 2000001  143.79374
    0.98128363   2    1000021    1
    0.017675809   2    1000035    1
    0.0008290515   2    1000025    1
    0.00019629426   2    1000022    1

DECAY 1000001  206.90403
    0.68714691   2    1000021    1
    0.20005364   2   -1000037    2
    0.087334073   2    1000025    1
    0.013029424   2    1000035    1
    0.0063049689   2   -1000024    2
    0.0057844424   2    1000022    1
    0.00034654286   2    1000023    1

DECAY 2000003  143.85465
    0.98087691   2    1000021    3
    0.01766953   2    1000035    3
    0.00083093797   2    1000025    3
    0.00029788302   2    1000022    3
    0.00020179791   2   -1000024    4
    0.00011687119   2    1000023    3

DECAY 1000003  206.93664
    0.68704263   2    1000021    3
    0.20002311   2   -1000037    4
    0.087322025   2    1000025    3
    0.013028201   2    1000035    3
    0.0063119644   2   -1000024    4
    0.0058543592   2    1000022    3
    0.00041771141   2    1000023    3

DECAY 1000005  34.313021
    0.41593026   2   -1000024    6
    0.21665517   2    1000022    5
    0.18943652   2    1000023    5
    0.12630814   2   -1000037    6
    0.046032822   2    1000025    5
    0.0056370978   2    1000035    5

DECAY 2000005  32.052214
    0.46075922   2   -1000024    6
    0.24648463   2    1000023    5
    0.22981749   2    1000022    5
    0.028179992   2   -1000037    6
    0.013402268   2    1000035    5
    0.011088583   2    1000025    5
    0.0093859049   2    1000006   -24
    0.00088191409   2    1000005    23

DECAY 2000002  151.98901
    0.92915814   2    1000021    2
    0.066907427   2    1000035    2
    0.0031381418   2    1000025    2
    0.00074194516   2    1000022    2

DECAY 1000002  206.89959
    0.68693778   2    1000021    2
    0.19063842   2    1000037    1
    0.10210679   2    1000025    2
    0.015924937   2    1000024    1
    0.0041432696   2    1000022    2
    0.00023863168   2    1000023    2

DECAY 2000004  151.99262
    0.92913633   2    1000021    4
    0.066906042   2    1000035    4
    0.0031383821   2    1000025    4
    0.0007472532   2    1000022    4

DECAY 1000004  206.93204
    0.68683336   2    1000021    4
    0.19061306   2    1000037    3
    0.10209118   2    1000025    4
    0.01606262   2    1000024    3
    0.0041465367   2    1000022    4
    0.00024294148   2    1000023    4

DECAY 1000006  32.730603
    0.43815535   2    1000024    5
    0.21158285   2    1000023    6
    0.20881766   2    1000022    6
    0.082108057   2    1000037    5
    0.05436044   2    1000025    6
    0.0025635204   3    1000022    24    5
    0.0018874251   2    1000022    4
    0.00041953259   2    1000035    6
    0.00010516547   2    1000023    4

DECAY 2000006  165.76692
    0.26258505   2    1000005    24
    0.17641889   2    1000006    25
    0.16931455   2    1000024    5
    0.14433566   2    1000006    23
    0.097987949   2    1000023    6
    0.083687954   2    1000022    6
    0.027352635   2    1000037    5
    0.021621543   2    1000035    6
    0.011126624   2    1000025    6
    0.0055691436   2    2000005    24

DECAY 1000024  1.6914568e-08
    0.36528744   3    1000022   -1    2
    0.30494587   3    1000022   -3    4
    0.12179897   3    1000022   -11    12
    0.12164459   3    1000022   -13    14
    0.086323129   3    1000022   -15    16

DECAY 1000037  4.565802
    0.30605298   2    1000023    24
    0.24581338   2    1000024    23
    0.24398436   2    1000022    24
    0.20365711   2    1000024    25
    0.00027730605   3    1000022   -5    6
    0.00019082701   3    1000023   -5    6

DECAY 1000022 -1


DECAY 1000023  1.7337046e-05
    0.14110457   3    1000022    12   -12
    0.10550008   3    1000022    1   -1
    0.10547477   3    1000022    3   -3
    0.1018301   2    1000022    22
    0.082281661   3    1000022    2   -2
    0.078295631   3    1000022    4   -4
    0.067090631   3    1000022    5   -5
    0.042391619   3    1000024    1   -2
    0.042391619   3   -1000024   -1    2
    0.040747377   3    1000024    3   -4
    0.040747377   3   -1000024   -3    4
    0.0238065   3    1000022    11   -11
    0.023798747   3    1000022    13   -13
    0.021726239   3    1000022    15   -15
    0.014131103   3    1000024    11   -12
    0.014131103   3   -1000024   -11    12
    0.01412749   3    1000024    13   -14
    0.01412749   3   -1000024   -13    14
    0.013147947   3    1000024    15   -16
    0.013147947   3   -1000024   -15    16

DECAY 1000025  5.1601459
    0.27605831   2    1000024   -24
    0.27605831   2   -1000024    24
    0.19118281   2    1000023    23
    0.13029127   2    1000023    25
    0.11676881   2    1000022    25
    0.0091154963   2    1000022    23
    0.00023682998   3    1000024    5   -6
    0.00023682998   3   -1000024   -5    6

DECAY 1000035  1.9964134
    0.37214377   2    1000023    23
    0.26144678   2    1000023    25
    0.2332751   2    1000022    25
    0.055780053   2    1000024   -24
    0.055780053   2   -1000024    24
    0.021306336   2    1000022    23
    0.00010273296   3    1000024    5   -6
    0.00010273296   3   -1000024   -5    6

DECAY 1000021  290.79779
    0.12497056   2    1000005   -5
    0.12497056   2   -1000005    5
    0.1205775   2    1000006   -6
    0.1205775   2   -1000006    6
    0.11768582   2    2000005   -5
    0.11768582   2   -2000005    5
    0.079469832   2    2000006   -6
    0.079469832   2   -2000006    6
    0.057197607   2    1000006   -4
    0.057197607   2   -1000006    4

DECAY 25  0.0038369494
    0.59153597   2   -5    5
    0.21166463   2   -24    24
    0.071007875   2    21    21
    0.067959728   2   -15    15
    0.028448765   2   -4    4
    0.02520469   2    23    23
    0.0023133542   2    22    22
    0.0014071465   2    22    23
    0.00023566477   2   -13    13
    0.00022141475   2   -3    3
    6.1218698e-07   2   -1    1
    1.4660559e-07   2   -2    2
    5.2980179e-09   2   -11    11

DECAY 35  64.545385
    0.7314041   2   -5    5
    0.1413412   2   -15    15
    0.035412567   2   -1000024    1000037
    0.035412567   2   -1000037    1000024
    0.0216449   2    1000023    1000025
    0.0096605462   2    1000023    1000035
    0.0076253326   2    1000022    1000025
    0.0076176174   2   -1000024    1000024
    0.0036617909   2    1000022    1000022
    0.0029845029   2    1000022    1000035
    0.0017775793   2    1000022    1000023
    0.00048406423   2   -13    13
    0.00027708578   2   -3    3
    0.00020400192   2    1000023    1000023
    0.0001982058   2   -1000037    1000037
    0.00017717925   2   -6    6
    7.6231407e-05   2    1000025    1000025
    3.089176e-05   2    21    21
    4.1499115e-06   2    1000025    1000035
    3.1655191e-06   2    25    25
    7.6602807e-07   2   -1    1
    6.4092252e-07   2    23    23
    5.8664753e-07   2   -24    24
    2.3232488e-07   2    22    23
    7.9836758e-08   2    22    22
    1.0874466e-08   2   -11    11
    3.7592183e-09   2   -4    4
    1.9386877e-14   2   -2    2

DECAY 36  61.157298
    0.72639335   2   -5    5
    0.14038957   2   -15    15
    0.03369572   2   -1000024    1000037
    0.03369572   2   -1000037    1000024
    0.019834378   2    1000022    1000025
    0.012890777   2   -1000024    1000024
    0.0092765991   2    1000022    1000035
    0.0087253299   2    1000023    1000025
    0.0062550261   2    1000022    1000022
    0.003201563   2    1000023    1000035
    0.0021913101   2   -1000037    1000037
    0.0010786783   2    1000022    1000023
    0.00080879641   2    1000025    1000025
    0.00048080245   2   -13    13
    0.00031923193   2    1000023    1000023
    0.00027518356   2   -3    3
    0.00026841295   2    1000025    1000035
    0.00017031064   2   -6    6
    4.6761799e-05   2    21    21
    9.1150564e-07   2    23    25
    7.6076941e-07   2   -1    1
    5.286944e-07   2    22    23
    2.6767279e-07   2    22    22
    1.0801193e-08   2   -11    11
    3.4616898e-09   2   -4    4
    5.3200575e-14   2    23    35
    1.7853862e-14   2   -2    2
    7.9032857e-39   2    25    25

DECAY 37  66.161145
    0.75260552   2   -5    6
    0.12320474   2   -15    16
    0.041827919   2    1000024    1000025
    0.038280019   2    1000022    1000037
    0.034188615   2    1000023    1000037
    0.0048267759   2    1000024    1000035
    0.0030048254   2    1000023    1000024
    0.0011341426   2   -5    4
    0.00043557392   2   -13    14
    0.00024774914   2   -3    4
    0.00020531337   2    1000035    1000037
    1.2521801e-05   2    1000025    1000037
    1.1492498e-05   2   -3    2
    8.0989597e-06   2   -5    2
    4.3215904e-06   2    1000022    1000024
    8.5074437e-07   2    24    25
    7.66899e-07   2   -3    6
    6.8709777e-07   2   -1    2
    3.1957397e-08   2   -1    4
    1.8936766e-08   2   -1    6
    1.0188119e-08   2   -11    12
    2.5347291e-11   2    24    35
    4.285482e-12   2    24    36

DECAY 6  2.43
    1   2    5    24

DECAY 15 -1
