BLOCK SPINFO
   1   SPheno
   2   v4.0.5be

BLOCK SPHENOINFO
   1   2
   2   2

BLOCK MODSEL
   1   0

BLOCK MINPAR
   3    40.395256
   4   -1

BLOCK EXTPAR
   0    1319.3897
   1    471.95406
   2    1929.3204
   3    3000
   11   -3980.3231
   12    708.06843
   13   -724.85825
   23   -284.47224
   25    39.613499
   26    1484.2144
   31    849.66296
   32    849.66296
   33    554.32074
   34    966.63476
   35    966.63476
   36    952.35123
   41    5000
   42    5000
   43    1982.0639
   44    5000
   45    5000
   46    1015.5319
   47    5000
   48    5000
   49    1356.379

BLOCK SMINPUTS
   1    127.90897
   2    1.1663787e-05
   3    0.1184
   4    91.1876
   5    4.18
   6    173.2
   7    1.777
   8    0
   11    0.00051099893
   12    0
   13    0.10565837
   14    0
   21    0.005
   22    0.0025
   23    0.095
   24    1.27

BLOCK GAUGE Q=  1319.3897
   1    0.35536298
   2    0.66519887
   3    1.219778

BLOCK YU Q=  1319.3897
   1   1    8.3870432e-06
   2   2    0.004260618
   3   3    1.0132222

BLOCK YD Q=  1319.3897
   1   1    0.00066762461
   2   2    0.012684868
   3   3    0.66207441

BLOCK YE Q=  1319.3897
   1   1    0.00011650538
   2   2    0.024089617
   3   3    0.40514772

BLOCK AU Q=  1319.3897
   1   1    0
   2   2    0
   3   3   -3980.3228

BLOCK AD Q=  1319.3897
   1   1    0
   2   2    0
   3   3    708.06837

BLOCK AE Q=  1319.3897
   1   1    0
   2   2    0
   3   3   -724.85825

BLOCK MSOFT Q=  1319.3897
   1    471.95406
   2    1929.3204
   3    3000
   21    2137140.3
   22   -89404.014
   31    849.66296
   32    849.66296
   33    554.32074
   34    966.63476
   35    966.63476
   36    952.35123
   41    5000
   42    5000
   43    1982.0639
   44    5000
   45    5000
   46    1015.5319
   47    5000
   48    5000
   49    1356.379

BLOCK MASS
   6    173.2
   23    91.1876
   24    80.429995
   15    1.777
   25    122.43457
   35    1484.0487
   36    1484.2144
   37    1487.118
   1000001    5019.3394
   2000001    5012.9394
   1000002    5018.9112
   2000002    5014.3069
   1000003    5019.3442
   2000003    5012.947
   1000004    5018.9158
   2000004    5014.3079
   1000005    1336.1116
   2000005    1960.7811
   1000006    874.19625
   2000006    1991.3026
   1000011    864.00408
   2000011    969.54104
   1000012    860.04276
   1000013    863.98792
   2000013    969.5224
   1000014    860.03116
   1000015    566.83219
   2000015    949.47289
   1000016    562.22948
   1000021    3182.1701
   1000022    283.74936
   1000023   -294.35658
   1000025    476.80883
   1000035    1970.1115
   1000024    291.04841
   1000037    1970.2931

BLOCK ALPHA
      -0.02496152

BLOCK HMIX Q=  1319.3897
   1   -284.47224
   2    39.613499
   3    244.10995
   4    2202892.5

BLOCK STOPMIX
   1   1    0.18404798
   1   2    0.98291726
   2   1   -0.98291726
   2   2    0.18404798

BLOCK SBOTMIX
   1   1   -0.013379605
   1   2    0.99991049
   2   1   -0.99991049
   2   2   -0.013379605

BLOCK STAUMIX
   1   1   -0.9995125
   1   2    0.031221216
   2   1   -0.031221216
   2   2   -0.9995125

BLOCK NMIX
   1   1    0.16260415
   1   2   -0.031747665
   1   3   -0.70646732
   1   4   -0.68808132
   2   1    0.042843157
   2   2   -0.025682795
   2   3    0.70248354
   2   4   -0.70994489
   3   1   -0.98576001
   3   2   -0.0076224181
   3   3   -0.085996168
   3   4   -0.14430444
   4   1    0.0012523219
   4   2   -0.99913682
   4   3    0.0050468017
   4   4    0.041213868

BLOCK UMIX
   1   1   -0.0071495489
   1   2   -0.99997444
   2   1    0.99997444
   2   2   -0.0071495489

BLOCK VMIX
   1   1   -0.058319593
   1   2    0.99829796
   2   1    0.99829796
   2   2    0.058319593

BLOCK HIGGSBOUNDSINPUTHIGGSCOUPLINGSFERMIONS
       0, 1569.2293,3,36,15,15

BLOCK HIGGSBOUNDSINPUTHIGGSCOUPLINGSBOSONS
       0,4,36,21,21,23

BLOCK SPHENOLOWENERGY
   1    0.00041630443
   2    1.5933496e-06
   3    3.5310887e-05
   4    1.039089e-15
   5    4.4360637e-11
   6    7.6551809e-09
   7    3.5000384e-14
   8    1.4942877e-09
   9    2.6232838e-07
   10    9.1671018e-05
   11    0.94692652
   12    0.54367656
   13    19.3965
   14    0
   15    0
   16    0.0021673356
   17    2.2817649e-15
   18    2.4829935e-11
   19    8.2980045e-11
   20   -7.5107082e-15
   21   -3.2112107e-10
   22   -1.2353759e-07
   23    0
   24    0
   25    0
   26    0
   27    0
   28    0
   29    0
   30    0
   31    0
   39    8.4924051e-05
   40    0
   41    0
   42    0

BLOCK FWCOEF Q=  160
   305   4422   0   0   -0.18881911
   305   4422   0   2   -0.29225715
   305   4322   0   2   -0.00097001394
   305   6421   0   0   -0.095227835
   305   6421   0   2   -0.16205416
   305   6321   0   2   -0.00071309909
   3051111   4133   0   0    1.5877082
   3051111   4133   0   2    1.589876
   3051111   4233   0   2    0.00014343398
   3051111   4137   0   0   -4.4104003
   3051111   4137   0   2   -4.4144666
   3051111   4237   0   2   -0.0011222411
   3051313   4133   0   0    1.5877082
   3051313   4133   0   2    1.5898697
   3051313   4233   0   2    0.00014342953
   3051313   4137   0   0   -4.4104003
   3051313   4137   0   2   -4.4144729
   3051313   4237   0   2   -0.0011222403
   3051212   4137   0   0    1.5053501
   3051212   4137   0   2    1.506242
   3051212   4237   0   2    0.00024480891
   3051414   4137   0   0    1.5053501
   3051414   4137   0   2    1.506242
   3051414   4237   0   2    0.00024480969
   3051616   4137   0   0    1.5053501
   3051616   4137   0   2    1.5062418
   3051616   4237   0   2    0.00024502936

BLOCK IMFWCOEF Q=  160
   305   4422   0   0    3.8574825e-07
   305   4422   0   2   -1.9351693e-05
   305   4322   0   2   -1.0813787e-05
   305   6421   0   0    3.3041889e-07
   305   6421   0   2    5.423442e-06
   305   6321   0   2   -4.7137677e-06
   3051111   4133   0   2   -2.4972754e-07
   3051111   4233   0   2    4.5886954e-06
   3051111   4137   0   2    2.5159518e-06
   3051111   4237   0   2   -3.5951679e-05
   3051313   4133   0   2   -2.4981241e-07
   3051313   4233   0   2    4.5886802e-06
   3051313   4137   0   2    2.5158686e-06
   3051313   4237   0   2   -3.595173e-05
   3051212   4137   0   2   -4.8269576e-07
   3051212   4237   0   2    7.842698e-06
   3051414   4137   0   2   -4.8269627e-07
   3051414   4237   0   2    7.842698e-06
   3051616   4137   0   2   -4.8828282e-07
   3051616   4237   0   2    7.8426973e-06

DECAY 23  2.4952


DECAY 24  2.085


DECAY 1000011  0.53447499
    0.9821792   2    1000025    11
    0.0172055   2    1000022    11
    0.00057169074   2   -1000024    12

DECAY 2000011  2.8359826
    0.95943016   2    1000025    11
    0.037971161   2    1000022    11
    0.0025986048   2    1000023    11

DECAY 1000013  0.54229196
    0.9680404   2    1000025    13
    0.024261454   2    1000022    13
    0.0071347108   2    1000023    13
    0.00056343406   2   -1000024    14

DECAY 2000013  2.8543952
    0.95321503   2    1000025    13
    0.039362489   2    1000022    13
    0.00417624   2    1000023    13
    0.0032462427   2   -1000024    14

DECAY 1000015  1.0777761
    0.49098448   2    1000022    15
    0.44989059   2    1000023    15
    0.057406826   2    1000025    15
    0.0017181032   2   -1000024    16

DECAY 2000015  8.0731129
    0.32308317   2    1000025    15
    0.31471997   2   -1000024    16
    0.17008385   2    1000022    15
    0.15646296   2    1000023    15
    0.017945506   2    1000016   -24
    0.0091733747   2    1000015    25
    0.0085311671   2    1000015    23

DECAY 1000012  0.55861342
    0.87568015   2    1000025    12
    0.075715747   2    1000022    12
    0.036143474   2    1000024    11
    0.01246063   2    1000023    12

DECAY 1000014  0.56638044
    0.86363925   2    1000025    14
    0.074675926   2    1000022    14
    0.049395328   2    1000024    13
    0.012289498   2    1000023    14

DECAY 1000016  1.0685609
    0.92984462   2    1000024    15
    0.049178067   2    1000025    16
    0.018098538   2    1000022    16
    0.0028787745   2    1000023    16

DECAY 2000001  143.79498
    0.98088055   2    1000021    1
    0.018572026   2    1000025    1
    0.00051146604   2    1000022    1

DECAY 1000001  189.83702
    0.74649307   2    1000021    1
    0.16654326   2   -1000037    2
    0.083174887   2    1000035    1
    0.0032223763   2    1000025    1
    0.00042621597   2    1000022    1
    0.00012837114   2    1000023    1

DECAY 2000003  143.82756
    0.98066383   2    1000021    3
    0.018568654   2    1000025    3
    0.00056652805   2    1000022    3
    0.00011081483   2   -1000024    4

DECAY 1000003  189.85532
    0.74642378   2    1000021    3
    0.16652751   2   -1000037    4
    0.08316701   2    1000035    3
    0.0032226811   2    1000025    3
    0.00046802957   2    1000022    3
    0.00016972011   2    1000023    3

DECAY 1000005  21.310599
    0.47684653   2   -1000024    6
    0.25050631   2    1000022    5
    0.24398761   2    1000023    5
    0.028577221   2    1000025    5

DECAY 2000005  142.84421
    0.61963722   2    1000006   -24
    0.26288848   2   -1000024    6
    0.05730153   2    1000022    5
    0.0565736   2    1000023    5
    0.0023798638   2    1000025    5
    0.00074163104   2    1000005    25
    0.00047767317   2    1000005    23

DECAY 2000002  152.18794
    0.92772174   2    1000021    2
    0.070211055   2    1000025    2
    0.0019329919   2    1000022    2
    0.00013412733   2    1000023    2

DECAY 1000002  189.83061
    0.74628343   2    1000021    2
    0.16596643   2    1000037    1
    0.083091215   2    1000035    2
    0.003833837   2    1000025    2
    0.00078651706   2    1000024    1

DECAY 2000004  152.19157
    0.92769984   2    1000021    4
    0.07020964   2    1000025    4
    0.0019385367   2    1000022    4
    0.00014007812   2    1000023    4

DECAY 1000004  189.84881
    0.74621406   2    1000021    4
    0.16595079   2    1000037    3
    0.083083391   2    1000035    4
    0.0038336648   2    1000025    4
    0.0008702658   2    1000024    3

DECAY 1000006  26.958884
    0.51941461   2    1000024    5
    0.22450066   2    1000023    6
    0.2171834   2    1000022    6
    0.038915621   2    1000025    6

DECAY 2000006  157.86379
    0.35776704   2    1000006    25
    0.28960619   2    1000006    23
    0.12198533   2    1000023    6
    0.1129569   2    1000022    6
    0.10701366   2    1000024    5
    0.0096680613   2    1000025    6
    0.00095531201   2    1000005    24

DECAY 1000024  2.5636597e-08
    0.35955916   3    1000022   -1    2
    0.31040675   3    1000022   -3    4
    0.11986049   3    1000022   -11    12
    0.11973632   3    1000022   -13    14
    0.090437278   3    1000022   -15    16

DECAY 1000037  57.626444
    0.12655405   2    1000016   -15
    0.12644726   2   -1000015    16
    0.098272625   2    1000014   -13
    0.098271364   2    1000012   -11
    0.098175324   2   -1000013    14
    0.098173575   2   -1000011    12
    0.073270106   2    1000023    24
    0.073267286   2    1000024    25
    0.072672145   2    1000024    23
    0.068233401   2    1000022    24
    0.01215418   2    1000024    36
    0.012145332   2    1000024    35
    0.012117104   2    37    1000022
    0.011044558   2    37    1000023
    0.0046315034   3    1000024    6   -6
    0.0040951652   2    1000025    24
    0.0036295399   3    1000023   -5    6
    0.0033428121   3    1000022   -5    6
    0.0027083029   2    1000006   -5
    0.00045358399   3    1000024    5   -5
    0.00018002575   3    1000025   -5    6
    0.0001122587   2   -2000015    16

DECAY 1000022 -1


DECAY 1000023  5.4201785e-07
    0.33029324   2    1000022    22
    0.16301107   3    1000022    12   -12
    0.12187424   3    1000022    1   -1
    0.12176089   3    1000022    3   -3
    0.095051061   3    1000022    2   -2
    0.078497027   3    1000022    4   -4
    0.027500757   3    1000022    11   -11
    0.027461696   3    1000022    13   -13
    0.018611832   3    1000022    15   -15
    0.011393718   3    1000022    5   -5
    0.0010167758   3    1000024    1   -2
    0.0010167758   3   -1000024   -1    2
    0.00049850513   3    1000024    3   -4
    0.00049850513   3   -1000024   -3    4
    0.00033893723   3    1000024    11   -12
    0.00033893723   3   -1000024   -11    12
    0.00033722443   3    1000024    13   -14
    0.00033722443   3   -1000024   -13    14

DECAY 1000025  1.0192968
    0.28927154   2    1000023    23
    0.19579717   2    1000024   -24
    0.19579717   2   -1000024    24
    0.16327657   2    1000023    25
    0.13776342   2    1000022    25
    0.018057925   2    1000022    23

DECAY 1000035  58.772893
    0.071561127   2    1000024   -24
    0.071561127   2   -1000024    24
    0.06222027   2    1000016   -16
    0.06222027   2   -1000016    16
    0.061798139   2    1000015   -15
    0.061798139   2   -1000015    15
    0.049748958   2    1000023    25
    0.048314832   2    1000014   -14
    0.048314832   2   -1000014    14
    0.048314218   2    1000012   -12
    0.048314218   2   -1000012    12
    0.047976583   2    1000013   -13
    0.047976583   2   -1000013    13
    0.047975721   2    1000011   -11
    0.047975721   2   -1000011    11
    0.044602329   2    1000023    23
    0.041546014   2    1000022    25
    0.025598354   2    1000022    23
    0.01175018   2    37   -1000024
    0.01175018   2   -37    1000024
    0.009994523   2    1000022    35
    0.0089405247   2    1000023    35
    0.0028933149   3    1000024    5   -6
    0.0028933149   3   -1000024   -5    6
    0.002840233   2    1000025    25
    0.0020456867   2    1000023    36
    0.0020189262   2    1000022    36
    0.0016197162   3    1000023    6   -6
    0.0014986712   3    1000022    6   -6
    0.0012670185   2    1000006   -6
    0.0012670185   2   -1000006    6
    0.0011264973   2    1000025    23

DECAY 1000021  214.61396
    0.17951118   2    1000006   -6
    0.17951118   2   -1000006    6
    0.14890448   2    1000005   -5
    0.14890448   2   -1000005    5
    0.085913504   2    2000006   -6
    0.085913504   2   -2000006    6
    0.084433675   2    2000005   -5
    0.084433675   2   -2000005    5
    0.0010227788   2    1000006   -4
    0.0010227788   2   -1000006    4
    0.00010369465   3    1000035    5   -5

DECAY 25  0.0035977479
    0.61598036   2   -5    5
    0.18678778   2   -24    24
    0.071444787   2    21    21
    0.070285774   2   -15    15
    0.029946682   2   -4    4
    0.021472981   2    23    23
    0.0023341819   2    22    22
    0.0012723671   2    22    23
    0.00024375408   2   -13    13
    0.00023053732   2   -3    3
    6.3741231e-07   2   -1    1
    1.5433025e-07   2   -2    2
    5.479896e-09   2   -11    11

DECAY 35  33.643742
    0.82711241   2   -5    5
    0.13182764   2   -15    15
    0.019699951   2    1000023    1000025
    0.015492653   2    1000022    1000025
    0.0019183795   2    1000022    1000022
    0.0011449467   2   -6    6
    0.0010261883   2   -1000024    1000024
    0.00046514334   2   -13    13
    0.00033697253   2   -3    3
    0.00031137037   2    1000023    1000023
    0.00029723929   2    1000022    1000023
    0.00028853292   2    1000025    1000025
    4.7837002e-05   2   -1000015    1000015
    2.3070691e-05   2    21    21
    4.0605842e-06   2    25    25
    1.0359809e-06   2    23    23
    9.3169565e-07   2   -1    1
    8.4031435e-07   2   -24    24
    2.7536095e-08   2    22    22
    2.3352882e-08   2    22    23
    1.4304137e-08   2   -4    4
    1.0449126e-08   2   -11    11
    7.3751016e-14   2   -2    2

DECAY 36  32.414839
    0.82558635   2   -5    5
    0.13158356   2   -15    15
    0.019384643   2    1000022    1000025
    0.016834906   2    1000023    1000025
    0.0021024824   2    1000022    1000022
    0.0012375116   2   -6    6
    0.0012331388   2   -1000024    1000024
    0.00046427299   2   -13    13
    0.00043082779   2    1000025    1000025
    0.00042038038   2    1000023    1000023
    0.00033899658   2    1000022    1000023
    0.00033633679   2   -3    3
    4.4158678e-05   2    21    21
    1.4297627e-06   2    23    25
    9.2993816e-07   2   -1    1
    2.7884043e-08   2    22    22
    2.4135881e-08   2    22    23
    1.4585854e-08   2   -4    4
    1.0429584e-08   2   -11    11
    7.5219464e-14   2   -2    2
    1.4284579e-36   2    25    25

DECAY 37  31.353622
    0.80207497   2   -5    6
    0.15477924   2   -15    16
    0.040503551   2    1000024    1000025
    0.0012024011   2   -5    4
    0.00054720105   2   -13    14
    0.00049535981   2    1000022    1000024
    0.00032661269   2   -3    4
    2.2223196e-05   2    1000023    1000024
    1.9952307e-05   2   -1000015    1000016
    1.5167423e-05   2   -3    2
    8.5863939e-06   2   -5    2
    2.199352e-06   2   -3    6
    1.4908695e-06   2    24    25
    9.0653585e-07   2   -1    2
    7.9331842e-08   2   -1    6
    4.2716961e-08   2   -1    4
    1.279909e-08   2   -11    12
    1.180604e-11   2    24    35
    8.9451061e-12   2    24    36

DECAY 6  2.43
    1   2    5    24

DECAY 15 -1
