BLOCK SPINFO
   1   SPheno
   2   v4.0.5be

BLOCK SPHENOINFO
   1   2
   2   2

BLOCK MODSEL
   1   0

BLOCK MINPAR
   3    15.896946
   4    1

BLOCK EXTPAR
   0    1865.8964
   1    589.45202
   2   -554.73132
   3    3000
   11   -3506.3372
   12    802.96977
   13   -1047.7803
   23    1860.7869
   25    15.276309
   26    4789.0284
   31    587.06525
   32    587.06525
   33    1901.8758
   34    1371.1508
   35    1371.1508
   36    965.90451
   41    5000
   42    5000
   43    1829.2975
   44    5000
   45    5000
   46    1860.8288
   47    5000
   48    5000
   49    681.61221

BLOCK SMINPUTS
   1    127.90897
   2    1.1663787e-05
   3    0.1184
   4    91.1876
   5    4.18
   6    173.2
   7    1.777
   8    0
   11    0.00051099893
   12    0
   13    0.10565837
   14    0
   21    0.005
   22    0.0025
   23    0.095
   24    1.27

BLOCK GAUGE Q=  1865.8964
   1    0.35536298
   2    0.66519887
   3    1.219778

BLOCK YU Q=  1865.8964
   1   1    8.402317e-06
   2   2    0.004268377
   3   3    1.0150674

BLOCK YD Q=  1865.8964
   1   1    0.00025792756
   2   2    0.0049006237
   3   3    0.25578332

BLOCK YE Q=  1865.8964
   1   1    4.5010246e-05
   2   2    0.0093066913
   3   3    0.15652324

BLOCK AU Q=  1865.8964
   1   1    0
   2   2    0
   3   3   -3506.3372

BLOCK AD Q=  1865.8964
   1   1    0
   2   2    0
   3   3    802.96976

BLOCK AE Q=  1865.8964
   1   1    0
   2   2    0
   3   3   -1047.7803

BLOCK MSOFT Q=  1865.8964
   1    589.45202
   2   -554.73132
   3    3000
   21    19342667
   22   -3309464.8
   31    587.06525
   32    587.06525
   33    1901.8758
   34    1371.1508
   35    1371.1508
   36    965.90451
   41    5000
   42    5000
   43    1829.2975
   44    5000
   45    5000
   46    1860.8288
   47    5000
   48    5000
   49    681.61221

BLOCK MASS
   6    173.2
   23    91.1876
   24    80.429995
   15    1.777
   25    123.32749
   35    4788.317
   36    4789.0284
   37    4789.2389
   1000001    5041.8037
   2000001    5030.6468
   1000002    5041.3494
   2000002    5034.097
   1000003    5041.8056
   2000003    5030.6463
   1000004    5041.3501
   2000004    5034.0974
   1000005    729.19095
   2000005    1871.0588
   1000006    1737.284
   2000006    2004.0301
   1000011    605.28868
   2000011    1367.2698
   1000012    599.8338
   1000013    605.29183
   2000013    1367.2769
   1000014    599.8422
   1000015    962.76727
   2000015    1909.7632
   1000016    1907.4821
   1000021    3214.6965
   1000022    586.45753
   1000023   -589.44891
   1000025    1866.3451
   1000035   -1868.1411
   1000024    589.61236
   1000037    1869.161

BLOCK ALPHA
      -0.062875418

BLOCK HMIX Q=  1865.8964
   1    1860.7869
   2    15.276309
   3    243.78093
   4    22934793

BLOCK STOPMIX
   1   1    0.71913982
   1   2    0.6948654
   2   1   -0.6948654
   2   2    0.71913982

BLOCK SBOTMIX
   1   1    0.018964746
   1   2    0.99982015
   2   1   -0.99982015
   2   2    0.018964746

BLOCK STAUMIX
   1   1    0.018746587
   1   2    0.99982427
   2   1   -0.99982427
   2   2    0.018746587

BLOCK NMIX
   1   1   -0.99958141
   1   2   -0.00085361934
   1   3   -0.0270511
   1   4    0.010223094
   2   1    0.00025939789
   2   2    0.99891384
   2   3   -0.045272264
   2   4   -0.011022402
   3   1    0.026366078
   3   2   -0.024217301
   3   3   -0.70632257
   3   4    0.70698428
   4   1    0.011906509
   4   2   -0.039798646
   4   3   -0.70592286
   4   4   -0.70706946

BLOCK UMIX
   1   1   -0.99795191
   1   2    0.063968636
   2   1   -0.063968636
   2   2   -0.99795191

BLOCK VMIX
   1   1    0.99987894
   1   2    0.015559902
   2   1    0.015559902
   2   2   -0.99987894

BLOCK HIGGSBOUNDSINPUTHIGGSCOUPLINGSFERMIONS
       0, 233.36563,3,36,15,15

BLOCK HIGGSBOUNDSINPUTHIGGSCOUPLINGSBOSONS
       0,4,36,21,21,23

BLOCK SPHENOLOWENERGY
   1    0.0003114353
   2    1.5908171e-06
   3    3.5238774e-05
   4    2.3083936e-15
   5    9.8611944e-11
   6    2.0642175e-08
   7    7.7609101e-14
   8    3.315458e-09
   9    7.0320259e-07
   10    9.6755486e-05
   11    0.99944713
   12    0.54211675
   13    19.369996
   14    0
   15    0
   16    0.0021577889
   17    2.2816629e-15
   18    2.4799685e-11
   19    8.2897945e-11
   20   -2.1030562e-15
   21   -8.9901011e-11
   22   -1.7723501e-08
   23    0
   24    0
   25    0
   26    0
   27    0
   28    0
   29    0
   30    0
   31    0
   39    3.6651638e-05
   40    0
   41    0
   42    0

BLOCK FWCOEF Q=  160
   305   4422   0   0   -0.18881911
   305   4422   0   2   -0.17802156
   305   4322   0   2    4.6985919e-05
   305   6421   0   0   -0.095227835
   305   6421   0   2   -0.091298331
   305   6321   0   2   -3.2223137e-05
   3051111   4133   0   0    1.5995236
   3051111   4133   0   2    1.5997399
   3051111   4233   0   2    3.8158064e-05
   3051111   4137   0   0   -4.4222157
   3051111   4137   0   2   -4.4191002
   3051111   4237   0   2   -0.00029256603
   3051313   4133   0   0    1.5995236
   3051313   4133   0   2    1.5997393
   3051313   4233   0   2    3.815805e-05
   3051313   4137   0   0   -4.4222157
   3051313   4137   0   2   -4.4191009
   3051313   4237   0   2   -0.00029256607
   3051212   4137   0   0    1.5053501
   3051212   4137   0   2    1.5046964
   3051212   4237   0   2    6.3645959e-05
   3051414   4137   0   0    1.5053501
   3051414   4137   0   2    1.5046964
   3051414   4237   0   2    6.3645959e-05
   3051616   4137   0   0    1.5053501
   3051616   4137   0   2    1.504695
   3051616   4237   0   2    6.3646287e-05

BLOCK IMFWCOEF Q=  160
   305   4422   0   0    3.85864e-07
   305   4422   0   2   -2.383316e-06
   305   4322   0   2    1.8308978e-06
   305   6421   0   0    3.3051803e-07
   305   6421   0   2   -9.1504844e-06
   305   6321   0   2    7.8493156e-07
   3051111   4133   0   2   -2.601819e-06
   3051111   4233   0   2    7.3277273e-07
   3051111   4137   0   2    1.761808e-05
   3051111   4237   0   2   -5.6203534e-06
   3051313   4133   0   2   -2.6018568e-06
   3051313   4233   0   2    7.3277251e-07
   3051313   4137   0   2    1.761813e-05
   3051313   4237   0   2   -5.6203542e-06
   3051212   4137   0   2   -3.3875085e-06
   3051212   4237   0   2    1.2226825e-06
   3051414   4137   0   2   -3.3875081e-06
   3051414   4237   0   2    1.2226825e-06
   3051616   4137   0   2   -3.4126225e-06
   3051616   4237   0   2    1.2226868e-06

DECAY 23  2.4952


DECAY 24  2.085


DECAY 1000011  0.023825581
    0.58220124   2   -1000024    12
    0.29777714   2    1000023    11
    0.12002128   2    1000022    11

DECAY 2000011  4.5708751
    0.99999992   2    1000022    11

DECAY 1000013  0.023834439
    0.58221283   2   -1000024    14
    0.29777176   2    1000023    13
    0.12001509   2    1000022    13

DECAY 2000013  4.5726518
    0.99962149   2    1000022    13
    0.00037635048   2    1000013    25

DECAY 1000015  1.9176161
    0.99704676   2    1000022    15
    0.0019670875   2   -1000024    16
    0.00098615238   2    1000023    15

DECAY 2000015  23.217181
    0.58967967   2   -1000024    16
    0.29558603   2    1000023    15
    0.085015868   2    1000022    15
    0.014984384   2    1000015    25
    0.014648525   2    1000015    23

DECAY 1000012  0.010590595
    0.56915232   2    1000024    11
    0.29302173   2    1000023    12
    0.13782595   2    1000022    12

DECAY 1000014  0.010606858
    0.5691784   2    1000024    13
    0.29303788   2    1000023    14
    0.13778372   2    1000022    14

DECAY 1000016  23.225074
    0.59143934   2    1000024    15
    0.29502987   2    1000023    16
    0.08424544   2    1000022    16
    0.029220211   2    1000015    24

DECAY 2000001  141.73208
    0.98072261   2    1000021    1
    0.019264989   2    1000022    1

DECAY 1000001  205.55633
    0.68185471   2    1000021    1
    0.20919274   2   -1000024    2
    0.10479003   2    1000023    1
    0.0032967471   2    1000022    1
    0.00065735261   2   -1000037    2
    0.0001412023   2    1000035    1

DECAY 2000003  141.7356
    0.98069792   2    1000021    3
    0.01926452   2    1000022    3

DECAY 1000003  205.5597
    0.68184448   2    1000021    3
    0.20918936   2   -1000024    4
    0.10478837   2    1000023    3
    0.0032967025   2    1000022    3
    0.0006639864   2   -1000037    4
    0.00014553628   2    1000035    3

DECAY 1000005  0.051489701
    0.9858105   2    1000022    5
    0.014189504   2    1000023    5

DECAY 2000005  24.363219
    0.53265255   2   -1000024    6
    0.27342901   2    1000023    5
    0.12639262   2    1000006   -24
    0.039080115   2    1000005    25
    0.019833585   2    1000005    23
    0.0086115225   2    1000022    5

DECAY 2000002  150.29518
    0.92723139   2    1000021    2
    0.072722033   2    1000022    2

DECAY 1000002  205.54598
    0.68165921   2    1000021    2
    0.20999201   2    1000024    1
    0.10480472   2    1000023    2
    0.0033604478   2    1000022    2
    0.00011405865   2    1000035    2

DECAY 2000004  150.29788
    0.92721464   2    1000021    4
    0.072720723   2    1000022    4

DECAY 1000004  205.54915
    0.68164876   2    1000021    4
    0.20998886   2    1000024    3
    0.10480311   2    1000023    4
    0.0033603971   2    1000022    4
    0.00011735515   2    1000035    4

DECAY 1000006  10.952855
    0.53994838   2    1000024    5
    0.26363132   2    1000023    6
    0.15090303   2    1000022    6
    0.033498618   2    1000005    24
    0.011195692   2    1000023    4
    0.00045043125   3    1000022    24    5
    0.00035982278   2    1000022    4

DECAY 2000006  25.531244
    0.34072359   2    1000006    23
    0.29233663   2    1000024    5
    0.14368347   2    1000023    6
    0.11034134   2    2000005    24
    0.073357411   2    1000022    6
    0.024149364   2    1000005    24
    0.014830443   2    1000037    5
    0.00057775213   2    1000006    25

DECAY 1000024  4.5831111e-12
    0.5018469   3    1000022   -11    12
    0.49793158   3    1000022   -13    14

DECAY 1000037  16.013479
    0.23240221   2    1000024    25
    0.21949727   2    1000023    24
    0.21812206   2    1000024    23
    0.16763575   2   -1000005    6
    0.084856908   2    1000022    24
    0.035500109   2    1000006   -5
    0.015130348   2   -1000015    16
    0.011648525   3    1000024    6   -6
    0.0080723265   3    1000023   -5    6
    0.003092366   3    1000022   -5    6
    0.0016845161   2   -1000011    12
    0.001684512   2   -1000013    14
    0.00033875774   3    1000024    5   -5
    0.00018069693   2    1000014   -13
    0.00010008909   2    1000012   -11

DECAY 1000022 -1


DECAY 1000023  9.7610122e-12
    0.67990691   3    1000022    12   -12
    0.15931186   3    1000022    11   -11
    0.15733364   3    1000022    13   -13
    0.0033779855   2    1000022    22

DECAY 1000025  17.573714
    0.20284701   2    1000023    25
    0.19864885   2    1000024   -24
    0.19864885   2   -1000024    24
    0.14602878   2    1000023    23
    0.074031249   2    1000005   -5
    0.074031249   2   -1000005    5
    0.057544233   2    1000022    25
    0.0130725   2    1000022    23
    0.0070080765   2    1000015   -15
    0.0070080765   2   -1000015    15
    0.0064849524   3    1000024    5   -6
    0.0064849524   3   -1000024   -5    6
    0.0046480929   3    1000023    6   -6
    0.0019530418   3    1000022    6   -6
    0.00027571325   2    1000012   -12
    0.00027571325   2   -1000012    12
    0.00027571147   2    1000014   -14
    0.00027571147   2   -1000014    14

DECAY 1000035  15.978017
    0.22042559   2    1000024   -24
    0.22042559   2   -1000024    24
    0.17326164   2    1000023    25
    0.081376398   2    1000005   -5
    0.081376398   2   -1000005    5
    0.070853268   2    1000022    23
    0.059508616   2    1000023    23
    0.049514923   2    1000022    25
    0.0091616327   3    1000024    5   -6
    0.0091616327   3   -1000024   -5    6
    0.0076229085   2    1000015   -15
    0.0076229085   2   -1000015    15
    0.0045849285   3    1000023    6   -6
    0.0021323604   3    1000022    6   -6
    0.00044103299   2    1000012   -12
    0.00044103299   2   -1000012    12
    0.00044103015   2    1000014   -14
    0.00044103015   2   -1000014    14
    0.00027065208   2    1000013   -13
    0.00027065208   2   -1000013    13
    0.00023046582   2    1000011   -11
    0.00023046582   2   -1000011    11
    0.00010675551   3    1000023    5   -5

DECAY 1000021  210.66185
    0.20318383   2    1000005   -5
    0.20318383   2   -1000005    5
    0.098763121   2    2000005   -5
    0.098763121   2   -2000005    5
    0.09860869   2    2000006   -6
    0.09860869   2   -2000006    6
    0.095714318   2    1000006   -6
    0.095714318   2   -1000006    6
    0.0023230428   2    1000006   -4
    0.0023230428   2   -1000006    4
    0.0010675819   3    1000025    6   -6
    0.00098778115   3    1000035    6   -6
    0.00025059257   3    1000037    5   -6
    0.00025059257   3   -1000037   -5    6

DECAY 25  0.0036594682
    0.59776947   2   -5    5
    0.20254871   2   -24    24
    0.073591685   2    21    21
    0.068592537   2   -15    15
    0.02961645   2   -4    4
    0.023710146   2    23    23
    0.00234643   2    22    22
    0.0013614529   2    22    23
    0.00023788899   2   -13    13
    0.00022444646   2   -3    3
    6.2057132e-07   2   -1    1
    1.5262554e-07   2   -2    2
    5.3480291e-09   2   -11    11

DECAY 35  74.486625
    0.17905787   2   -1000024    1000037
    0.17905787   2   -1000037    1000024
    0.14404573   2   -1000006    1000006
    0.10983272   2   -2000006    2000006
    0.10940698   2   -5    5
    0.090529615   2    1000022    1000035
    0.087450304   2    1000022    1000025
    0.032247647   2    1000023    1000035
    0.030878251   2   -15    15
    0.019918483   2    1000023    1000025
    0.0081148806   2   -6    6
    0.0021328877   2   -1000024    1000024
    0.0017387932   2   -2000005    1000005
    0.0017387932   2   -1000005    2000005
    0.0010658985   2    1000022    1000022
    0.00065235315   2    1000022    1000023
    0.00059038339   2    1000025    1000035
    0.00048105936   2   -2000015    1000015
    0.00048105936   2   -1000015    2000015
    0.0001603364   2    1000035    1000035
    0.00010079662   2   -13    13
    8.8752273e-05   2    1000023    1000023
    8.431591e-05   2    1000025    1000025
    5.7167475e-05   2   -3    3
    5.0524548e-05   2   -1000037    1000037
    6.8865136e-06   2   -2000006    1000006
    6.8865136e-06   2   -1000006    2000006
    5.6276731e-06   2   -2000005    2000005
    4.9248383e-06   2    25    25
    3.2010744e-06   2    21    21
    2.7982362e-06   2   -1000005    1000005
    1.6598077e-06   2   -1000015    1000015
    5.1836553e-07   2    23    23
    2.8722599e-07   2   -1000011    1000011
    2.8607717e-07   2   -1000013    1000013
    1.861737e-07   2   -2000015    2000015
    1.5804384e-07   2   -1    1
    1.5744412e-07   2   -2000013    2000013
    1.5714191e-07   2   -2000011    2000011
    1.4519522e-07   2   -4    4
    8.969204e-08   2   -24    24
    3.1011994e-08   2   -2000013    1000013
    3.1011994e-08   2   -1000013    2000013
    2.3395656e-08   2    22    23
    1.6163195e-08   2    22    22
    2.2635161e-09   2   -11    11
    7.4849316e-13   2   -2    2
    7.2538577e-13   2   -2000011    1000011
    7.2538577e-13   2   -1000011    2000011

DECAY 36  74.052478
    0.18017237   2   -1000024    1000037
    0.18017237   2   -1000037    1000024
    0.12855464   2   -2000006    1000006
    0.12855464   2   -1000006    2000006
    0.10525681   2   -5    5
    0.091277904   2    1000022    1000025
    0.087814524   2    1000022    1000035
    0.032498897   2    1000023    1000025
    0.029712367   2   -15    15
    0.019991751   2    1000023    1000035
    0.0065445529   2   -6    6
    0.0021349259   2   -1000024    1000024
    0.0017527778   2   -2000005    1000005
    0.0017527778   2   -1000005    2000005
    0.0010667545   2    1000022    1000022
    0.00063059756   2    1000022    1000023
    0.00048466833   2   -2000015    1000015
    0.00048466833   2   -1000015    2000015
    0.00031788264   2    1000035    1000035
    0.00027685206   2    1000025    1000025
    0.00024022633   2    1000025    1000035
    0.00010437054   2    1000023    1000023
    9.6987067e-05   2   -13    13
    5.5010112e-05   2   -3    3
    4.3880016e-05   2   -1000037    1000037
    5.0643942e-06   2    21    21
    1.3645672e-06   2    23    25
    1.5207932e-07   2   -1    1
    1.1635964e-07   2   -4    4
    3.1065529e-08   2   -2000013    1000013
    3.1065529e-08   2   -1000013    2000013
    2.1438357e-08   2    22    23
    2.1779652e-09   2   -11    11
    1.4705768e-09   2    22    22
    7.2662591e-13   2   -2000011    1000011
    7.2662591e-13   2   -1000011    2000011
    5.9984938e-13   2   -2    2
    1.8840803e-35   2    25    25

DECAY 37  69.343366
    0.19375059   2    1000022    1000037
    0.19278754   2    1000024    1000035
    0.1923983   2    1000024    1000025
    0.14918148   2   -5    6
    0.090937599   2   -2000005    1000006
    0.082480696   2   -2000005    2000006
    0.056107699   2    1000023    1000037
    0.034904737   2   -15    16
    0.0032452251   2   -1000005    1000006
    0.0013759573   2    1000023    1000024
    0.0010364192   2   -1000015    1000016
    0.00090861233   2   -1000005    2000006
    0.00035111721   2    1000025    1000037
    0.0002062692   2   -5    4
    0.00012340066   2   -13    14
    0.00012300132   2    1000035    1000037
    5.7581745e-05   2   -3    4
    1.4729848e-05   2   -3    6
    2.7047424e-06   2   -3    2
    1.4729732e-06   2   -5    2
    1.4577818e-06   2    24    25
    1.2123518e-06   2   -1000011    1000012
    1.2106177e-06   2   -1000013    1000014
    6.7164101e-07   2   -1    6
    1.5937949e-07   2   -1    2
    6.7489899e-08   2   -2000013    1000014
    5.9548792e-08   2   -2000015    1000016
    1.3595565e-08   2   -1    4
    2.8863542e-09   2   -11    12
    9.8678596e-11   2    1000022    1000024
    1.5786087e-12   2   -2000011    1000012

DECAY 6  2.43
    1   2    5    24

DECAY 15 -1
