BLOCK SPINFO
   1   SPheno
   2   v4.0.5be

BLOCK SPHENOINFO
   1   2
   2   2

BLOCK MODSEL
   1   0

BLOCK MINPAR
   3    54.481565
   4   -1

BLOCK EXTPAR
   0    1154.3556
   1   -678.54406
   2   -803.79292
   3    3000
   11    2361.3621
   12   -885.18981
   13   -1992.8337
   23   -169.13318
   25    54.640403
   26    562.42804
   31    1393.5012
   32    1393.5012
   33    360.28695
   34    1929.5296
   35    1929.5296
   36    293.5073
   41    5000
   42    5000
   43    1550.2268
   44    5000
   45    5000
   46    1039.1517
   47    5000
   48    5000
   49    1859.4937

BLOCK SMINPUTS
   1    127.90897
   2    1.1663787e-05
   3    0.1184
   4    91.1876
   5    4.18
   6    173.2
   7    1.777
   8    0
   11    0.00051099893
   12    0
   13    0.10565837
   14    0
   21    0.005
   22    0.0025
   23    0.095
   24    1.27

BLOCK GAUGE Q=  1154.3556
   1    0.35536298
   2    0.66519887
   3    1.219778

BLOCK YU Q=  1154.3556
   1   1    8.3857762e-06
   2   2    0.0042599743
   3   3    1.0130691

BLOCK YD Q=  1154.3556
   1   1    0.00092074085
   2   2    0.017494076
   3   3    0.9130864

BLOCK YE Q=  1154.3556
   1   1    0.00016067601
   2   2    0.033222703
   3   3    0.55875121

BLOCK AU Q=  1154.3556
   1   1    0
   2   2    0
   3   3    2361.3621

BLOCK AD Q=  1154.3556
   1   1    0
   2   2    0
   3   3   -885.18979

BLOCK AE Q=  1154.3556
   1   1    0
   2   2    0
   3   3   -1992.8337

BLOCK MSOFT Q=  1154.3556
   1   -678.54406
   2   -803.79292
   3    3000
   21    341386.02
   22    3647.5099
   31    1393.5012
   32    1393.5012
   33    360.28695
   34    1929.5296
   35    1929.5296
   36    293.5073
   41    5000
   42    5000
   43    1550.2268
   44    5000
   45    5000
   46    1039.1517
   47    5000
   48    5000
   49    1859.4937

BLOCK MASS
   6    173.2
   23    91.1876
   24    80.429995
   15    1.777
   25    122.3148
   35    561.92705
   36    562.42804
   37    573.00842
   1000001    5014.4368
   2000001    5004.6544
   1000002    5013.9914
   2000002    5005.6967
   1000003    5014.4477
   2000003    5004.6747
   1000004    5014.0021
   2000004    5005.6979
   1000005    1487.0275
   2000005    1831.8665
   1000006    874.26883
   2000006    1524.173
   1000011    1398.4948
   2000011    1932.498
   1000012    1395.8758
   1000013    1398.4814
   2000013    1932.4727
   1000014    1395.8627
   1000015    232.91205
   2000015    352.22879
   1000016    338.84955
   1000021    3165.2568
   1000022   -162.74612
   1000023    174.40957
   1000025   -680.56567
   1000035   -845.71865
   1000024    167.96486
   1000037    845.81911

BLOCK ALPHA
      -0.019850171

BLOCK HMIX Q=  1154.3556
   1   -169.13318
   2    54.640403
   3    244.23998
   4    316325.3

BLOCK STOPMIX
   1   1   -0.24696521
   1   2    0.96902435
   2   1   -0.96902435
   2   2   -0.24696521

BLOCK SBOTMIX
   1   1   -0.99978943
   1   2    0.020520598
   2   1   -0.020520598
   2   2   -0.99978943

BLOCK STAUMIX
   1   1   -0.19061548
   1   2    0.98166478
   2   1   -0.98166478
   2   2   -0.19061548

BLOCK NMIX
   1   1   -0.061462695
   1   2    0.083752472
   1   3    0.71757799
   1   4   -0.68868693
   2   1    0.037022967
   2   2   -0.055887297
   2   3    0.69590492
   2   4    0.71499807
   3   1    0.99696696
   3   2    0.037297149
   3   3    0.017730623
   3   4   -0.065965305
   4   1   -0.030141512
   4   2    0.99421882
   4   3   -0.021995145
   4   4    0.10068091

BLOCK UMIX
   1   1   -0.030781193
   1   2   -0.99952615
   2   1   -0.99952615
   2   2    0.030781193

BLOCK VMIX
   1   1    0.14088125
   1   2    0.9900265
   2   1    0.9900265
   2   2   -0.14088125

BLOCK HIGGSBOUNDSINPUTHIGGSCOUPLINGSFERMIONS
       0, 2985.5737,3,36,15,15

BLOCK HIGGSBOUNDSINPUTHIGGSCOUPLINGSBOSONS
       0,4,36,21,21,23

BLOCK SPHENOLOWENERGY
   1    0.00033488774
   2    1.5861357e-06
   3    3.5190381e-05
   4    9.1141508e-14
   5    3.8908109e-09
   6    6.6173454e-07
   7    3.217105e-12
   8    1.3734326e-07
   9    2.3796619e-05
   10    6.0278389e-05
   11    0.62265268
   12    0.54281943
   13    19.320853
   14    0
   15    0
   16    0.0021619889
   17    2.2817623e-15
   18    2.4746143e-11
   19    8.2778861e-11
   20    1.4361899e-14
   21    6.1401274e-10
   22    4.5351839e-07
   23    0
   24    0
   25    0
   26    0
   27    0
   28    0
   29    0
   30    0
   31    0
   39    0.00016794105
   40    0
   41    0
   42    0

BLOCK FWCOEF Q=  160
   305   4422   0   0   -0.18881911
   305   4422   0   2   -0.19403746
   305   4322   0   2   -0.00099369815
   305   6421   0   0   -0.095227835
   305   6421   0   2   -0.1441039
   305   6321   0   2   -0.0013239783
   3051111   4133   0   0    1.5833616
   3051111   4133   0   2    1.585718
   3051111   4233   0   2   -0.00036902827
   3051111   4137   0   0   -4.4060537
   3051111   4137   0   2   -4.3981143
   3051111   4237   0   2    0.0029255202
   3051313   4133   0   0    1.5833616
   3051313   4133   0   2    1.5857121
   3051313   4233   0   2   -0.00036932097
   3051313   4137   0   0   -4.4060537
   3051313   4137   0   2   -4.3981201
   3051313   4237   0   2    0.0029258012
   3051212   4137   0   0    1.5053501
   3051212   4137   0   2    1.5036269
   3051212   4237   0   2   -0.00063883033
   3051414   4137   0   0    1.5053501
   3051414   4137   0   2    1.5036269
   3051414   4237   0   2   -0.00063876696
   3051616   4137   0   0    1.5053501
   3051616   4137   0   2    1.5036492
   3051616   4237   0   2   -0.00062090737

BLOCK IMFWCOEF Q=  160
   305   4422   0   0    3.8585362e-07
   305   4422   0   2    2.607498e-05
   305   4322   0   2    5.9291768e-06
   305   6421   0   0    3.3050915e-07
   305   6421   0   2    1.3222961e-05
   305   6321   0   2    2.0745803e-06
   3051111   4133   0   2    3.1674111e-07
   3051111   4233   0   2    6.7098946e-06
   3051111   4137   0   2   -1.6182512e-06
   3051111   4237   0   2   -5.2851944e-05
   3051313   4133   0   2    3.1668584e-07
   3051313   4233   0   2    6.7098489e-06
   3051313   4137   0   2   -1.6182715e-06
   3051313   4237   0   2   -5.285211e-05
   3051212   4137   0   2    5.1831163e-07
   3051212   4237   0   2    1.1540931e-05
   3051414   4137   0   2    5.183117e-07
   3051414   4237   0   2    1.1540931e-05
   3051616   4137   0   2    5.0426155e-07
   3051616   4237   0   2    1.1540964e-05

DECAY 23  2.4952


DECAY 24  2.085


DECAY 1000011  8.5154664
    0.58094945   2   -1000037    12
    0.27824045   2    1000035    11
    0.13674234   2    1000025    11
    0.0018237368   2    1000022    11
    0.0013305642   2   -1000024    12
    0.00091345373   2    1000023    11

DECAY 2000011  7.4608009
    0.9926248   2    1000025    11
    0.0048471356   2    1000022    11
    0.0017550618   2    1000023    11
    0.00077287093   2    1000035    11

DECAY 1000013  8.5450203
    0.57892192   2   -1000037    14
    0.27726995   2    1000035    13
    0.1362672   2    1000025    13
    0.003618121   2    1000022    13
    0.0025968591   2    1000023    13
    0.0013259489   2   -1000024    14

DECAY 2000013  7.5442841
    0.98162175   2    1000025    13
    0.0076487325   2    1000022    13
    0.0055347371   2   -1000024    14
    0.0044152428   2    1000023    13
    0.00076607323   2    1000035    13

DECAY 1000015  0.66542392
    0.48900346   2   -1000024    16
    0.31298507   2    1000022    15
    0.19801147   2    1000023    15

DECAY 2000015  1.3413668
    0.49399055   2    1000022    15
    0.46487535   2    1000023    15
    0.023254313   2   -1000024    16
    0.017879242   2    1000015    23

DECAY 1000012  8.5637747
    0.56323435   2    1000037    11
    0.29336208   2    1000035    12
    0.10227464   2    1000025    12
    0.027660116   2    1000024    11
    0.0094885041   2    1000022    12
    0.0039803031   2    1000023    12

DECAY 1000014  8.5932751
    0.56128486   2    1000037    13
    0.29234586   2    1000035    14
    0.10192139   2    1000025    14
    0.03102546   2    1000024    13
    0.0094558367   2    1000022    14
    0.0039665993   2    1000023    14

DECAY 1000016  1.2814856
    0.95755636   2    1000024    15
    0.029480244   2    1000015    24
    0.0093629559   2    1000022    16
    0.003600438   2    1000023    16

DECAY 2000001  144.9003
    0.98141968   2    1000021    1
    0.018463571   2    1000025    1

DECAY 1000001  206.41387
    0.69388504   2    1000021    1
    0.20166634   2   -1000037    2
    0.1008467   2    1000035    1
    0.002026089   2    1000025    1
    0.00095706686   2    1000022    1
    0.00041660545   2    1000023    1
    0.00020216795   2   -1000024    2

DECAY 2000003  144.96306
    0.98100937   2    1000021    3
    0.018455721   2    1000025    3
    0.00020952701   2   -1000024    4
    0.00018066526   2    1000022    3
    0.00012790377   2    1000023    3

DECAY 1000003  206.44734
    0.69377805   2    1000021    3
    0.2016343   2   -1000037    4
    0.10083065   2    1000035    3
    0.0020258097   2    1000025    3
    0.0010326935   2    1000022    3
    0.00048778524   2    1000023    3
    0.00021070981   2   -1000024    4

DECAY 1000005  98.939537
    0.37563936   2    1000006   -24
    0.2847497   2   -1000024    6
    0.12632807   2    1000022    5
    0.1174029   2    1000023    5
    0.064287416   2   -1000037    6
    0.030229449   2    1000035    5
    0.00083389093   2    1000025    5
    0.00052921048   2    1000006   -37

DECAY 2000005  60.929109
    0.48096714   2   -1000024    6
    0.25193351   2    1000022    5
    0.23770325   2    1000023    5
    0.013272369   2    1000006   -37
    0.012571423   2    1000025    5
    0.00080227359   2    1000006   -24
    0.00071066779   2    2000006   -24
    0.00063960996   2   -1000037    6
    0.00054827359   2    1000005    25
    0.00051350105   2    1000005    23
    0.00033797566   2    1000035    5

DECAY 2000002  153.08752
    0.92964212   2    1000021    2
    0.069920166   2    1000025    2
    0.00027526521   2    1000022    2

DECAY 1000002  206.41143
    0.69366826   2    1000021    2
    0.19783392   2    1000037    1
    0.098683659   2    1000035    2
    0.0047543761   2    1000025    2
    0.004235025   2    1000024    1
    0.00056557572   2    1000022    2
    0.00025917798   2    1000023    2

DECAY 2000004  153.09119
    0.92962027   2    1000021    4
    0.069918537   2    1000025    4
    0.00028084712   2    1000022    4
    0.00010586559   2    1000023    4

DECAY 1000004  206.44481
    0.69356123   2    1000021    4
    0.19780254   2    1000037    3
    0.098667988   2    1000035    4
    0.0047536564   2    1000025    4
    0.004381339   2    1000024    3
    0.0005696372   2    1000022    4
    0.00026360971   2    1000023    4

DECAY 1000006  32.900582
    0.5099488   2    1000024    5
    0.25030952   2    1000023    6
    0.23794066   2    1000022    6
    0.0017842437   2    1000025    6

DECAY 2000006  101.38903
    0.23549715   2    1000024    5
    0.19907868   2    1000006    23
    0.18819891   2    1000006    25
    0.14378829   2    1000023    6
    0.13232212   2    1000022    6
    0.065081835   2    1000037    5
    0.02966389   2    1000035    6
    0.0057783757   2    1000025    6
    0.00034222319   2    1000006    36
    0.00024852502   2    1000006    35

DECAY 1000024  1.3977632e-08
    0.37803133   3    1000022   -1    2
    0.28417901   3    1000022   -3    4
    0.12601757   3    1000022   -11    12
    0.12576124   3    1000022   -13    14
    0.086010853   3    1000022   -15    16

DECAY 1000037  14.411938
    0.17851769   2    1000016   -15
    0.17163134   2   -2000015    16
    0.13205255   2    1000023    24
    0.12826551   2    1000024    23
    0.12403376   2    1000022    24
    0.12223637   2    1000024    25
    0.034012544   2    37    1000022
    0.033064696   2    1000024    36
    0.03274659   2    1000024    35
    0.029250763   2    37    1000023
    0.0060171146   2   -1000015    16
    0.0036477822   2    1000025    24
    0.0017163028   3    1000023   -5    6
    0.0015828473   3    1000022   -5    6
    0.0011886424   3    1000024    6   -6

DECAY 1000022 -1


DECAY 1000023  7.6274678e-07
    0.20195413   2    1000022    22
    0.1805307   3    1000022    12   -12
    0.13493243   3    1000022    1   -1
    0.13482876   3    1000022    3   -3
    0.10523569   3    1000022    2   -2
    0.089851571   3    1000022    4   -4
    0.033492814   3    1000022    15   -15
    0.030449869   3    1000022    11   -11
    0.030413718   3    1000022    13   -13
    0.022260047   3    1000022    5   -5
    0.0065118358   3    1000024    1   -2
    0.0065118358   3   -1000024   -1    2
    0.0053952272   3    1000024    3   -4
    0.0053952272   3   -1000024   -3    4
    0.0021706834   3    1000024    11   -12
    0.0021706834   3   -1000024   -11    12
    0.0021677681   3    1000024    13   -14
    0.0021677681   3   -1000024   -13    14
    0.001779616   3    1000024    15   -16
    0.001779616   3   -1000024   -15    16

DECAY 1000025  5.5010407
    0.23416091   2    1000015   -15
    0.23416091   2   -1000015    15
    0.092439323   2    1000024   -24
    0.092439323   2   -1000024    24
    0.057967357   2    1000023    23
    0.052070066   2    2000015   -15
    0.052070066   2   -2000015    15
    0.044230081   2    1000023    25
    0.042977004   2    1000022    25
    0.037782753   2    1000016   -16
    0.037782753   2   -1000016    16
    0.017950521   2    1000022    23
    0.001123351   3    1000024    5   -6
    0.001123351   3   -1000024   -5    6
    0.00068207061   3    1000022    5   -5
    0.0005617054   3    1000023    5   -5

DECAY 1000035  15.197613
    0.12220406   2    1000024   -24
    0.12220406   2   -1000024    24
    0.091927261   2    1000023    23
    0.088094869   2    1000016   -16
    0.088094869   2   -1000016    16
    0.080578643   2    1000023    25
    0.078669799   2    1000022    25
    0.078049216   2    2000015   -15
    0.078049216   2   -2000015    15
    0.035158174   2    1000022    23
    0.029533726   2    37   -1000024
    0.029533726   2   -37    1000024
    0.028038131   2    1000023    35
    0.027408501   2    1000022    35
    0.0062939087   2    1000022    36
    0.0047973959   2    1000023    36
    0.0027744374   2    1000015   -15
    0.0027744374   2   -1000015    15
    0.0017835047   3    1000024    5   -6
    0.0017835047   3   -1000024   -5    6
    0.0012819626   2    1000025    25
    0.00044475425   3    1000023    6   -6
    0.00042734582   3    1000022    6   -6

DECAY 1000021  234.55945
    0.1799404   2    1000006   -6
    0.1799404   2   -1000006    6
    0.12130449   2    1000005   -5
    0.12130449   2   -1000005    5
    0.1095706   2    2000006   -6
    0.1095706   2   -2000006    6
    0.088321155   2    2000005   -5
    0.088321155   2   -2000005    5
    0.00078312049   2    1000006   -4
    0.00078312049   2   -1000006    4

DECAY 25  0.0040510277
    0.65029751   2   -5    5
    0.16369626   2   -24    24
    0.073084441   2   -15    15
    0.063766612   2    21    21
    0.026715936   2   -4    4
    0.018772756   2    23    23
    0.0020587222   2    22    22
    0.0011184696   2    22    23
    0.00025131279   2   -13    13
    0.00023717972   2   -3    3
    6.557711e-07   2   -1    1
    1.3768138e-07   2   -2    2
    5.6498283e-09   2   -11    11

DECAY 35  33.835004
    0.8863655   2   -5    5
    0.1104263   2   -15    15
    0.0015055651   2   -1000024    1000024
    0.00052091067   2    1000022    1000022
    0.00034543133   2   -13    13
    0.00025397553   2   -3    3
    0.00019654372   2    1000023    1000023
    0.00017515869   2   -6    6
    0.00013968647   2    21    21
    5.1556624e-05   2    1000022    1000023
    1.3097247e-05   2    25    25
    3.6540447e-06   2   -24    24
    1.7764481e-06   2    23    23
    7.0214273e-07   2   -1    1
    1.2459058e-07   2    22    23
    8.5110874e-09   2    22    22
    7.7621686e-09   2   -11    11
    3.6066062e-09   2   -4    4
    1.860011e-14   2   -2    2

DECAY 36  33.799794
    0.88520746   2   -5    5
    0.11025191   2   -15    15
    0.0023753311   2   -1000024    1000024
    0.00084284106   2    1000022    1000022
    0.00034498822   2   -13    13
    0.0002943233   2    1000023    1000023
    0.00025361581   2   -3    3
    0.00024430399   2   -6    6
    0.00015834171   2    21    21
    2.2856476e-05   2    1000022    1000023
    3.0526778e-06   2    23    25
    7.0114816e-07   2   -1    1
    1.8155381e-07   2    22    22
    8.157087e-08   2    22    23
    7.7522091e-09   2   -11    11
    3.0212205e-09   2   -4    4
    1.5568046e-14   2   -2    2
    5.1110883e-38   2    25    25

DECAY 37  28.433664
    0.87778823   2   -5    6
    0.11962294   2   -15    16
    0.0015321692   2   -5    4
    0.00042291762   2   -13    14
    0.00029353094   2   -3    4
    0.00028114077   2    1000023    1000024
    2.9093247e-05   2    1000022    1000024
    1.3448995e-05   2   -3    2
    1.0941373e-05   2   -5    2
    3.9520539e-06   2    24    25
    8.1430984e-07   2   -1    2
    7.3943344e-07   2   -3    6
    3.7395211e-08   2   -1    4
    1.7710526e-08   2   -1    6
    9.8920877e-09   2   -11    12
    7.8593837e-09   2    24    35
    6.2385143e-09   2    24    36

DECAY 6  2.43
    1   2    5    24

DECAY 15 -1
