BLOCK SPINFO
   1   SPheno
   2   v4.0.5be

BLOCK SPHENOINFO
   1   2
   2   2

BLOCK MODSEL
   1   0

BLOCK MINPAR
   3    19.911329
   4    1

BLOCK EXTPAR
   0    4118.9084
   1   -606.70084
   2    585.53941
   3    3537.1724
   11    3790.549
   12   -6939.1241
   13    1301.5408
   23    2795.3953
   25    18.962995
   26    3411.188
   31    2223.5365
   32    2223.5365
   33    4767.8689
   34    3076.6042
   35    3076.6042
   36    725.28522
   41    3712.5724
   42    3712.5724
   43    4406.0123
   44    4582.1483
   45    4582.1483
   46    3688.3734
   47    755.94948
   48    755.94948
   49    1842.0618

BLOCK SMINPUTS
   1    127.90897
   2    1.1663787e-05
   3    0.1184
   4    91.1876
   5    4.18
   6    173.2
   7    1.777
   8    0
   11    0.00051099893
   12    0
   13    0.10565837
   14    0
   21    0.005
   22    0.0025
   23    0.095
   24    1.27

BLOCK GAUGE Q=  4118.9084
   1    0.35536298
   2    0.66519887
   3    1.219778

BLOCK YU Q=  4118.9084
   1   1    8.3960221e-06
   2   2    0.0042651792
   3   3    1.0143069

BLOCK YD Q=  4118.9084
   1   1    0.00031993426
   2   2    0.0060787509
   3   3    0.31727453

BLOCK YE Q=  4118.9084
   1   1    5.5830868e-05
   2   2    0.011544053
   3   3    0.19415198

BLOCK AU Q=  4118.9084
   1   1    0
   2   2    0
   3   3    3790.5484

BLOCK AD Q=  4118.9084
   1   1    0
   2   2    0
   3   3   -6939.0859

BLOCK AE Q=  4118.9084
   1   1    0
   2   2    0
   3   3    1301.5409

BLOCK MSOFT Q=  4118.9084
   1   -606.70084
   2    585.53941
   3    3537.1724
   21    3727182
   22   -7516469
   31    2223.5365
   32    2223.5365
   33    4767.8689
   34    3076.6042
   35    3076.6042
   36    725.28522
   41    3712.5724
   42    3712.5724
   43    4406.0123
   44    4582.1483
   45    4582.1483
   46    3688.3734
   47    755.94948
   48    755.94948
   49    1842.0618

BLOCK MASS
   6    173.2
   23    91.1876
   24    80.429995
   15    1.777
   25    122.44397
   35    3411.027
   36    3411.188
   37    3412.3029
   1000001    3861.1747
   2000001    1104.7566
   1000002    3860.3505
   2000002    4687.1092
   1000003    3861.1739
   2000003    1104.755
   1000004    3860.3497
   2000004    4687.1085
   1000005    2051.8927
   2000005    4491.0899
   1000006    3773.1562
   2000006    4496.3434
   1000011    2224.5126
   2000011    3087.2483
   1000012    2222.7508
   1000013    2224.506
   2000013    3087.2371
   1000014    2222.7465
   1000015    758.64014
   2000015    4774.2098
   1000016    4773.0963
   1000021    3792.2702
   1000022   -599.312
   1000023    624.47826
   1000025   -2813.729
   1000035    2814.5399
   1000024    624.61713
   1000037    2815.2547

BLOCK ALPHA
      -0.05028266

BLOCK HMIX Q=  4118.9084
   1    2795.3953
   2    18.962995
   3    242.92231
   4    11636203

BLOCK STOPMIX
   1   1   -0.075775095
   1   2    0.99712493
   2   1   -0.99712493
   2   2   -0.075775095

BLOCK SBOTMIX
   1   1    0.0069843215
   1   2    0.99997561
   2   1   -0.99997561
   2   2    0.0069843215

BLOCK STAUMIX
   1   1    0.0041777517
   1   2    0.99999127
   2   1   -0.99999127
   2   2    0.0041777517

BLOCK NMIX
   1   1    0.99986097
   1   2    0.00013466466
   1   3    0.016450604
   1   4    0.0027213973
   2   1   -0.00032620628
   2   2   -0.99954078
   2   3    0.029291686
   2   4   -0.0077541734
   3   1   -0.01355558
   3   2    0.015231665
   3   3    0.70680031
   3   4    0.7071192
   4   1    0.009704965
   4   2   -0.026195701
   4   3   -0.70661496
   4   4    0.70704661

BLOCK UMIX
   1   1   -0.99914212
   1   2    0.04141297
   2   1    0.04141297
   2   2    0.99914212

BLOCK VMIX
   1   1   -0.99993981
   1   2    0.010971776
   2   1    0.010971776
   2   2    0.99993981

BLOCK HIGGSBOUNDSINPUTHIGGSCOUPLINGSFERMIONS
       0, 359.59517,3,36,15,15

BLOCK HIGGSBOUNDSINPUTHIGGSCOUPLINGSBOSONS
       0,4,36,21,21,23

BLOCK SPHENOLOWENERGY
   1    0.00032657768
   2    1.5895264e-06
   3    3.5254713e-05
   4    2.7238345e-15
   5    1.1635916e-10
   6    2.4360878e-08
   7    9.1564634e-14
   8    3.9116398e-09
   9    8.2977655e-07
   10    9.6580789e-05
   11    0.99764258
   12    0.54198637
   13    19.364426
   14    0
   15    0
   16    0.0021572605
   17    2.2816578e-15
   18    2.4800706e-11
   19    8.290604e-11
   20    1.1427496e-15
   21    4.8856072e-11
   22    6.1703981e-09
   23    0
   24    0
   25    0
   26    0
   27    0
   28    0
   29    0
   30    0
   31    0
   39    4.5664507e-05
   40    0
   41    0
   42    0

BLOCK FWCOEF Q=  160
   305   4422   0   0   -0.18881911
   305   4422   0   2   -0.19539362
   305   4322   0   2   -0.00013480252
   305   6421   0   0   -0.095227835
   305   6421   0   2   -0.10339045
   305   6321   0   2   -0.00016448079
   3051111   4133   0   0    1.6273925
   3051111   4133   0   2    1.6274763
   3051111   4233   0   2    3.4459986e-05
   3051111   4137   0   0   -4.4500846
   3051111   4137   0   2   -4.4486055
   3051111   4237   0   2   -0.00025511392
   3051313   4133   0   0    1.6273925
   3051313   4133   0   2    1.6274761
   3051313   4233   0   2    3.4459967e-05
   3051313   4137   0   0   -4.4500846
   3051313   4137   0   2   -4.4486058
   3051313   4237   0   2   -0.00025511394
   3051212   4137   0   0    1.5053501
   3051212   4137   0   2    1.505036
   3051212   4237   0   2    5.5157272e-05
   3051414   4137   0   0    1.5053501
   3051414   4137   0   2    1.505036
   3051414   4237   0   2    5.5157274e-05
   3051616   4137   0   0    1.5053501
   3051616   4137   0   2    1.5050354
   3051616   4237   0   2    5.5157899e-05

BLOCK IMFWCOEF Q=  160
   305   4422   0   0    3.8579687e-07
   305   4422   0   2    4.9971211e-06
   305   4322   0   2   -4.9856887e-07
   305   6421   0   0    3.3046053e-07
   305   6421   0   2   -4.6952373e-06
   305   6321   0   2   -4.2679082e-07
   3051111   4133   0   2   -2.955315e-08
   3051111   4233   0   2    7.6428223e-07
   3051111   4137   0   2    1.4692243e-06
   3051111   4237   0   2   -5.6572021e-06
   3051313   4133   0   2   -2.9556135e-08
   3051313   4233   0   2    7.6428211e-07
   3051313   4137   0   2    1.4692281e-06
   3051313   4237   0   2   -5.6572025e-06
   3051212   4137   0   2   -2.1418202e-07
   3051212   4237   0   2    1.2231202e-06
   3051414   4137   0   2   -2.1418187e-07
   3051414   4237   0   2    1.2231202e-06
   3051616   4137   0   2   -2.2442327e-07
   3051616   4237   0   2    1.2231186e-06

DECAY 23  2.4952


DECAY 24  2.085


DECAY 1000011  27.29592
    0.60770528   2   -1000024    12
    0.30422436   2    1000023    11
    0.088070352   2    1000022    11

DECAY 2000011  14.361309
    0.9999913   2    1000022    11

DECAY 1000013  27.295816
    0.60770516   2   -1000024    14
    0.30422445   2    1000023    13
    0.088070395   2    1000022    13

DECAY 2000013  14.363328
    0.99984666   2    1000022    13
    0.00011087104   2    1000013    25

DECAY 1000015  0.53877223
    0.99948931   2    1000022    15
    0.00034009096   2   -1000024    16
    0.00017059968   2    1000023    15

DECAY 2000015  69.488148
    0.58321773   2   -1000024    16
    0.29198985   2    1000023    15
    0.083634255   2    1000022    15
    0.011019213   2    1000035    15
    0.010979633   2    1000025    15
    0.0086015101   2    1000015    23
    0.0081824289   2    1000015    25
    0.00095814645   2    1000015    36
    0.00094955684   2    1000015    35
    0.0004676691   2   -1000037    16

DECAY 1000012  27.28522
    0.60826729   2    1000024    11
    0.30380817   2    1000023    12
    0.087924544   2    1000022    12

DECAY 1000014  27.285157
    0.6082674   2    1000024    13
    0.30380808   2    1000023    14
    0.087924523   2    1000022    14

DECAY 1000016  69.528633
    0.58381649   2    1000024    15
    0.29153632   2    1000023    16
    0.083471548   2    1000022    16
    0.021887188   2    1000037    15
    0.017185152   2    1000015    24
    0.0019117362   2    1000015    37
    0.00012660127   2    1000035    16

DECAY 2000001  0.30708791
    0.99999989   2    1000022    1

DECAY 1000001  49.190593
    0.65417234   2   -1000024    2
    0.32731702   2    1000023    1
    0.010415484   2    1000022    1
    0.0077522656   2    1000021    1
    0.00025998664   2   -1000037    2

DECAY 2000003  0.30708766
    0.99999675   2    1000022    3

DECAY 1000003  49.192177
    0.65415094   2   -1000024    4
    0.32730644   2    1000023    3
    0.010415161   2    1000022    3
    0.0077518195   2    1000021    3
    0.0002663005   2   -1000037    4

DECAY 1000005  0.97534772
    0.98384935   2    1000022    5
    0.0107002   2   -1000024    6
    0.0054504518   2    1000023    5

DECAY 2000005  135.03722
    0.28008821   2   -1000024    6
    0.25016615   2   -1000037    6
    0.21619769   2    1000021    5
    0.14064262   2    1000023    5
    0.065443032   2    1000006   -24
    0.012858854   2    1000005    25
    0.012319756   2    1000035    5
    0.012305824   2    1000025    5
    0.0055015621   2    1000005    23
    0.0044763158   2    1000022    5

DECAY 1000002  49.21371
    0.6547547   2    1000024    1
    0.32716196   2    1000023    2
    0.010439686   2    1000022    2
    0.0075675745   2    1000021    2

DECAY 2000002  54.259001
    0.813376   2    1000021    2
    0.18660204   2    1000022    2

DECAY 1000004  49.214537
    0.65474364   2    1000024    3
    0.3271563   2    1000023    4
    0.010439505   2    1000022    4
    0.0075656482   2    1000021    4

DECAY 2000004  54.260269
    0.81335486   2    1000021    4
    0.18659763   2    1000022    4

DECAY 1000006  38.44446
    0.39315508   2    1000037    5
    0.20629988   2    1000022    6
    0.19876312   2    1000035    6
    0.19740523   2    1000025    6
    0.0028552637   2    1000024    5
    0.0014193856   2    1000023    6

DECAY 2000006  138.39954
    0.27424978   2    1000024    5
    0.21303219   2    1000021    6
    0.13654731   2    1000023    6
    0.12073309   2    1000025    6
    0.12046159   2    1000035    6
    0.062297489   2    1000006    25
    0.032228961   2    1000006    23
    0.025005315   2    1000037    5
    0.010737781   2    1000005    24
    0.0047064986   2    1000022    6

DECAY 1000024  1.2354336e-11
    0.42689694   3    1000022   -1    2
    0.42144117   3    1000022   -3    4
    0.10321376   3    1000022   -15    16
    0.024227003   3    1000022   -13    14
    0.024218421   3    1000022   -11    12

DECAY 1000037  23.86925
    0.26825928   2    1000024    25
    0.25053028   2    1000023    24
    0.25023827   2    1000024    23
    0.077090163   2   -1000005    6
    0.076901751   2    1000022    24
    0.037923879   2   -1000015    16
    0.021144798   3    1000024    6   -6
    0.013384758   3    1000023   -5    6
    0.0040516061   3    1000022   -5    6
    0.00012563465   2   -1000013    14
    0.00012563215   2   -1000011    12

DECAY 1000022 -1


DECAY 1000023  1.2928142e-11
    0.19439247   2    1000022    22
    0.14573947   3    1000022    1   -1
    0.14571368   3    1000022    3   -3
    0.11617897   3    1000022    2   -2
    0.11257033   3    1000022    4   -4
    0.098233152   3    1000022    5   -5
    0.051184859   3    1000022    15   -15
    0.046759082   3    1000022    13   -13
    0.04675825   3    1000022    11   -11
    0.042469744   3    1000022    12   -12

DECAY 1000025  25.780527
    0.23213548   2    1000024   -24
    0.23213548   2   -1000024    24
    0.17350215   2    1000023    23
    0.1527547   2    1000023    25
    0.043119184   2    1000022    25
    0.035882541   2    1000005   -5
    0.035882541   2   -1000005    5
    0.024112628   2    1000022    23
    0.017609575   2    1000015   -15
    0.017609575   2   -1000015    15
    0.012107922   3    1000024    5   -6
    0.012107922   3   -1000024   -5    6
    0.0083816858   3    1000023    6   -6
    0.0023480546   3    1000022    6   -6

DECAY 1000035  24.544843
    0.24360121   2    1000024   -24
    0.24360121   2   -1000024    24
    0.19596318   2    1000023    25
    0.06158302   2    1000023    23
    0.05542318   2    1000022    25
    0.04942604   2    1000022    23
    0.03771907   2    1000005   -5
    0.03771907   2   -1000005    5
    0.01846724   2    1000015   -15
    0.01846724   2   -1000015    15
    0.012802414   3    1000024    5   -6
    0.012802414   3   -1000024   -5    6
    0.0094029107   3    1000023    6   -6
    0.0026177169   3    1000022    6   -6

DECAY 1000021  245.00663
    0.19184593   2    2000003   -3
    0.19184593   2   -2000003    3
    0.19184582   2    2000001   -1
    0.19184582   2   -2000001    1
    0.11457716   2    1000005   -5
    0.11457716   2   -1000005    5
    0.0004511158   3    1000024    3   -4
    0.0004511158   3   -1000024   -3    4
    0.00045111456   3    1000024    1   -2
    0.00045111456   3   -1000024   -1    2
    0.00022592158   3    1000023    4   -4
    0.00022592097   3    1000023    2   -2
    0.00022520829   3    1000023    3   -3
    0.00022520765   3    1000023    1   -1
    0.00013743684   3    1000022    6   -6
    0.00012390532   3    1000024    5   -6
    0.00012390532   3   -1000024   -5    6

DECAY 25  0.0035706134
    0.61114132   2   -5    5
    0.18840346   2   -24    24
    0.07430833   2    21    21
    0.070137199   2   -15    15
    0.030250921   2   -4    4
    0.021662848   2    23    23
    0.0023372159   2    22    22
    0.0012850049   2    22    23
    0.00024328298   2   -13    13
    0.00022962079   2   -3    3
    6.3487898e-07   2   -1    1
    1.5589833e-07   2   -2    2
    5.4693058e-09   2   -11    11

DECAY 35  15.268119
    0.706557   2   -5    5
    0.18105741   2   -15    15
    0.029165868   2   -1000024    1000037
    0.029165868   2   -1000037    1000024
    0.029053648   2    1000022    1000025
    0.01485189   2   -6    6
    0.0034093908   2    1000023    1000035
    0.0027085652   2   -1000024    1000024
    0.0013532581   2    1000022    1000022
    0.00088111647   2    1000022    1000023
    0.00068327491   2    1000022    1000035
    0.00064776711   2   -13    13
    0.00024404308   2   -3    3
    0.00011055793   2    1000023    1000023
    6.6072054e-05   2    25    25
    3.3848719e-05   2    1000023    1000025
    4.9104512e-06   2    23    23
    2.3898553e-06   2    21    21
    1.2571981e-06   2   -24    24
    6.7474402e-07   2   -1    1
    2.5107778e-07   2   -1000001    1000001
    2.5076239e-07   2   -1000003    1000003
    2.1541685e-07   2   -1000015    1000015
    1.9943686e-07   2    22    23
    1.9930087e-07   2   -4    4
    6.2833499e-08   2    22    22
    1.454782e-08   2   -11    11
    1.0272687e-12   2   -2    2

DECAY 36  14.936171
    0.70439754   2   -5    5
    0.18050618   2   -15    15
    0.029846591   2   -1000024    1000037
    0.029846591   2   -1000037    1000024
    0.029386635   2    1000022    1000035
    0.014758618   2   -6    6
    0.0036909855   2    1000023    1000025
    0.0033039923   2   -1000024    1000024
    0.0016508063   2    1000022    1000022
    0.00079825185   2    1000022    1000023
    0.00072976609   2    1000022    1000025
    0.00064578691   2   -13    13
    0.00024329945   2   -3    3
    0.00012507745   2    1000023    1000023
    3.1234413e-05   2    1000023    1000035
    2.8083196e-05   2    21    21
    9.0465636e-06   2    23    25
    6.7269268e-07   2   -1    1
    4.4956842e-07   2    22    23
    1.9587789e-07   2   -4    4
    1.8584002e-07   2    22    22
    1.4503482e-08   2   -11    11
    1.0096816e-12   2   -2    2
    1.1492255e-36   2    25    25

DECAY 37  14.839783
    0.71706333   2   -5    6
    0.18231222   2   -15    16
    0.031395586   2    1000024    1000025
    0.031038432   2    1000024    1000035
    0.030796006   2    1000022    1000037
    0.0037160602   2    1000023    1000037
    0.0017107434   2    1000023    1000024
    0.0010300192   2   -5    4
    0.00064453869   2   -13    14
    0.00023111917   2   -3    4
    3.2472978e-05   2   -3    6
    1.0827387e-05   2   -3    2
    9.1186637e-06   2    24    25
    7.3553968e-06   2   -5    2
    1.4736383e-06   2   -1    6
    6.4058095e-07   2   -1    2
    4.3408164e-08   2   -1    4
    1.5075827e-08   2   -11    12
    2.0731751e-10   2    1000022    1000024
    3.1025854e-13   2    24    35
    1.5809901e-13   2    24    36

DECAY 6  2.43
    1   2    5    24

DECAY 15 -1
