BLOCK SPINFO
   1   SPheno
   2   v4.0.5be

BLOCK SPHENOINFO
   1   2
   2   2

BLOCK MODSEL
   1   0

BLOCK MINPAR
   3    33.236229
   4    1

BLOCK EXTPAR
   0    1671.5974
   1    24.644986
   2    1916.2574
   3    3000
   11    3303.2996
   12    1234.7569
   13    260.97005
   23    869.33856
   25    32.097859
   26    2615.3047
   31    584.67479
   32    584.67479
   33    1582.0855
   34    1502.1253
   35    1502.1253
   36    1000.4485
   41    5000
   42    5000
   43    1659.434
   44    5000
   45    5000
   46    1718.7898
   47    5000
   48    5000
   49    1244.492

BLOCK SMINPUTS
   1    127.90897
   2    1.1663787e-05
   3    0.1184
   4    91.1876
   5    4.18
   6    173.2
   7    1.777
   8    0
   11    0.00051099893
   12    0
   13    0.10565837
   14    0
   21    0.005
   22    0.0025
   23    0.095
   24    1.27

BLOCK GAUGE Q=  1671.5974
   1    0.35536298
   2    0.66519887
   3    1.219778

BLOCK YU Q=  1671.5974
   1   1    8.3884401e-06
   2   2    0.0042613276
   3   3    1.013391

BLOCK YD Q=  1671.5974
   1   1    0.00054105015
   2   2    0.010279953
   3   3    0.5365522

BLOCK YE Q=  1671.5974
   1   1    9.4417207e-05
   2   2    0.019522484
   3   3    0.32833606

BLOCK AU Q=  1671.5974
   1   1    0
   2   2    0
   3   3    3303.2996

BLOCK AD Q=  1671.5974
   1   1    0
   2   2    0
   3   3    1234.7568

BLOCK AE Q=  1671.5974
   1   1    0
   2   2    0
   3   3    260.97005

BLOCK MSOFT Q=  1671.5974
   1    24.644986
   2    1916.2574
   3    3000
   21    6074007.8
   22   -688109.77
   31    584.67479
   32    584.67479
   33    1582.0855
   34    1502.1253
   35    1502.1253
   36    1000.4485
   41    5000
   42    5000
   43    1659.434
   44    5000
   45    5000
   46    1718.7898
   47    5000
   48    5000
   49    1244.492

BLOCK MASS
   6    173.2
   23    91.1876
   24    80.429995
   15    1.777
   25    123.50222
   35    2615.1124
   36    2615.3047
   37    2616.9773
   1000001    5032.9855
   2000001    5025.139
   1000002    5032.5417
   2000002    5026.7834
   1000003    5032.9891
   2000003    5025.1402
   1000004    5032.5435
   2000004    5026.7841
   1000005    1273.0472
   2000005    1678.521
   1000006    1538.7879
   2000006    1815.8693
   1000011    610.0351
   2000011    1503.5387
   1000012    604.5344
   1000013    610.02638
   2000013    1503.5286
   1000014    604.5334
   1000015    997.75965
   2000015    1596.0988
   1000016    1593.192
   1000021    3199.7515
   1000022    24.262722
   1000023    877.71831
   1000025   -880.86257
   1000035    1956.0834
   1000024    877.50588
   1000037    1956.2269

BLOCK ALPHA
      -0.03019658

BLOCK HMIX Q=  1671.5974
   1    869.33856
   2    32.097859
   3    243.88124
   4    6839818.7

BLOCK STOPMIX
   1   1   -0.72474189
   1   2    0.68902046
   2   1   -0.68902046
   2   2   -0.72474189

BLOCK SBOTMIX
   1   1    0.04030221
   1   2    0.99918754
   2   1   -0.99918754
   2   2    0.04030221

BLOCK STAUMIX
   1   1    0.032413913
   1   2    0.99947453
   2   1   -0.99947453
   2   2    0.032413913

BLOCK NMIX
   1   1    0.99870511
   1   2   -0.00013671084
   1   3    0.050793437
   1   4   -0.0028473402
   2   1    0.037932129
   2   2    0.052743906
   2   3   -0.70615887
   2   4    0.70506658
   3   1   -0.033878716
   3   2    0.019104972
   3   3    0.70582788
   3   4    0.70731481
   4   1    0.0012188222
   4   2   -0.99842529
   4   3   -0.023805186
   4   4    0.050781551

BLOCK UMIX
   1   1   -0.033802339
   1   2    0.99942854
   2   1    0.99942854
   2   2    0.033802339

BLOCK VMIX
   1   1   -0.072017124
   1   2    0.9974034
   2   1    0.9974034
   2   2    0.072017124

BLOCK HIGGSBOUNDSINPUTHIGGSCOUPLINGSFERMIONS
       0, 1030.2725,3,36,15,15

BLOCK HIGGSBOUNDSINPUTHIGGSCOUPLINGSBOSONS
       0,4,36,21,21,23

BLOCK SPHENOLOWENERGY
   1    0.0003481908
   2    1.5868539e-06
   3    3.5227784e-05
   4    3.0543527e-15
   5    1.3047883e-10
   6    2.7329203e-08
   7    1.0237063e-13
   8    4.3732815e-09
   9    9.281112e-07
   10    9.5582731e-05
   11    0.98733301
   12    0.54325676
   13    19.405715
   14    0
   15    0
   16    0.0021645256
   17    2.2817326e-15
   18    2.4788357e-11
   19    8.2873931e-11
   20    4.9767323e-15
   21    2.1276971e-10
   22    4.2083159e-08
   23    0
   24    0
   25    0
   26    0
   27    0
   28    0
   29    0
   30    0
   31    0
   39    8.0673136e-05
   40    0
   41    0
   42    0

BLOCK FWCOEF Q=  160
   305   4422   0   0   -0.18881911
   305   4422   0   2   -0.22035082
   305   4322   0   2   -0.000303474
   305   6421   0   0   -0.095227835
   305   6421   0   2   -0.11707626
   305   6321   0   2   -0.00026906593
   3051111   4133   0   0    1.595957
   3051111   4133   0   2    1.5969406
   3051111   4233   0   2    0.00014365583
   3051111   4137   0   0   -4.4186491
   3051111   4137   0   2   -4.4145844
   3051111   4237   0   2   -0.001110465
   3051313   4133   0   0    1.595957
   3051313   4133   0   2    1.5969375
   3051313   4233   0   2    0.00014365524
   3051313   4137   0   0   -4.4186491
   3051313   4137   0   2   -4.4145875
   3051313   4237   0   2   -0.0011104662
   3051212   4137   0   0    1.5053501
   3051212   4137   0   2    1.5044682
   3051212   4237   0   2    0.00024177873
   3051414   4137   0   0    1.5053501
   3051414   4137   0   2    1.5044682
   3051414   4237   0   2    0.00024177878
   3051616   4137   0   0    1.5053501
   3051616   4137   0   2    1.5044687
   3051616   4237   0   2    0.00024179445

BLOCK IMFWCOEF Q=  160
   305   4422   0   0    3.8572897e-07
   305   4422   0   2    1.5965253e-05
   305   4322   0   2   -2.6591655e-06
   305   6421   0   0    3.3040237e-07
   305   6421   0   2   -3.5384862e-06
   305   6321   0   2   -1.2443274e-06
   3051111   4133   0   2   -7.3039964e-07
   3051111   4233   0   2    3.1452338e-06
   3051111   4137   0   2    6.4387467e-06
   3051111   4237   0   2   -2.432338e-05
   3051313   4133   0   2   -7.3038052e-07
   3051313   4233   0   2    3.1452274e-06
   3051313   4137   0   2    6.4387644e-06
   3051313   4237   0   2   -2.4323405e-05
   3051212   4137   0   2   -1.3475577e-06
   3051212   4237   0   2    5.2959319e-06
   3051414   4137   0   2   -1.3475589e-06
   3051414   4237   0   2    5.2959319e-06
   3051616   4137   0   2   -1.3380764e-06
   3051616   4237   0   2    5.2959707e-06

DECAY 23  2.4952


DECAY 24  2.085


DECAY 1000011  0.76151105
    0.99999999   2    1000022    11

DECAY 2000011  7.539721
    0.99887738   2    1000022    11
    0.00062652319   2    1000023    11
    0.00049607699   2    1000025    11

DECAY 1000013  0.76151202
    0.99999999   2    1000022    13

DECAY 2000013  7.5511443
    0.99736345   2    1000022    13
    0.00095282094   2    1000023    13
    0.000819835   2    1000025    13
    0.00065564316   2   -1000024    14
    0.0002082485   2    1000013    25

DECAY 1000015  5.2186507
    0.95837033   2    1000022    15
    0.021087701   2   -1000024    16
    0.010586025   2    1000023    15
    0.0099559403   2    1000025    15

DECAY 2000015  4.2917071
    0.46702424   2    1000022    15
    0.19689298   2    1000023    15
    0.19313786   2    1000025    15
    0.073705626   2    1000015    23
    0.068734603   2    1000015    25
    0.00050468723   2   -1000024    16

DECAY 1000012  0.75537459
    1   2    1000022    12

DECAY 1000014  0.75537333
    1   2    1000022    14

DECAY 1000016  4.3257596
    0.46147254   2    1000022    16
    0.39086425   2    1000024    15
    0.14575196   2    1000015    24
    0.0010816546   2    1000025    16
    0.00082959076   2    1000023    16

DECAY 2000001  143.01745
    0.98038712   2    1000021    1
    0.019564797   2    1000022    1

DECAY 1000001  189.65136
    0.74362113   2    1000021    1
    0.16816939   2   -1000037    2
    0.08395684   2    1000035    1
    0.0036999303   2    1000022    1
    0.00025094769   2   -1000024    2
    0.00023232365   2    1000023    1

DECAY 2000003  143.03737
    0.98025141   2    1000021    3
    0.019562267   2    1000022    3

DECAY 1000003  189.66343
    0.74357583   2    1000021    3
    0.16815895   2   -1000037    4
    0.08395163   2    1000035    3
    0.0036998412   2    1000022    3
    0.00025988814   2   -1000024    4
    0.00025838779   2    1000023    3

DECAY 1000005  4.3762358
    0.37689152   2   -1000024    6
    0.22937251   2    1000023    5
    0.22459361   2    1000025    5
    0.16914236   2    1000022    5

DECAY 2000005  26.958769
    0.64018408   2   -1000024    6
    0.13891585   2    1000006   -24
    0.093857938   2    1000023    5
    0.093762602   2    1000025    5
    0.01747083   2    1000005    25
    0.008956599   2    1000022    5
    0.0068520985   2    1000005    23

DECAY 2000002  151.6069
    0.92597045   2    1000021    2
    0.073849487   2    1000022    2
    0.00010014149   2    1000023    2

DECAY 1000002  189.64131
    0.74341707   2    1000021    2
    0.16747216   2    1000037    1
    0.083875656   2    1000035    2
    0.003688441   2    1000022    2
    0.0011391904   2    1000024    1
    0.00038872289   2    1000023    2

DECAY 2000004  151.61032
    0.92594962   2    1000021    4
    0.073847823   2    1000022    4
    0.0001057409   2    1000023    4

DECAY 1000004  189.65309
    0.74337157   2    1000021    4
    0.16746191   2    1000037    3
    0.083870516   2    1000035    4
    0.0036882126   2    1000022    4
    0.0011913543   2    1000024    3
    0.00039317039   2    1000023    4

DECAY 1000006  25.697628
    0.32077579   2    1000024    5
    0.30551445   2    1000023    6
    0.304621   2    1000025    6
    0.065002569   2    1000022    6
    0.0022365826   2    1000005    24
    0.0015050774   2    1000022    4
    0.00017389048   3    1000022    24    5

DECAY 2000006  49.588337
    0.30852496   2    1000024    5
    0.19299363   2    1000006    23
    0.1906689   2    1000025    6
    0.19016716   2    1000023    6
    0.063908853   2    2000005    24
    0.044994255   2    1000022    6
    0.0080490351   2    1000005    24
    0.00069320746   2    1000006    25

DECAY 1000024  0.6160993
    0.96223575   2    1000022    24
    0.014126269   3    1000022   -5    6
    0.010467058   2    1000014   -13
    0.0089749106   2    1000012   -11
    0.0019125361   2   -1000013    14
    0.0019124338   2   -1000011    12
    0.00037090709   3    1000022   -15    16

DECAY 1000037  50.644581
    0.1383995   2   -1000013    14
    0.13839865   2   -1000011    12
    0.13837219   2    1000014   -13
    0.13837199   2    1000012   -11
    0.083483565   2    1000024    25
    0.08102905   2    1000025    24
    0.080175228   2    1000024    23
    0.079659207   2    1000023    24
    0.047263613   2    1000006   -5
    0.0247799   2   -2000005    6
    0.019178041   2    1000016   -15
    0.018978813   2   -2000015    16
    0.0036006471   2    2000006   -5
    0.0031306304   3    1000024    6   -6
    0.0025971753   3    1000023   -5    6
    0.0024027878   3    1000025   -5    6
    0.00011670483   2    1000022    24

DECAY 1000022 -1


DECAY 1000023  0.57549894
    0.51182384   2    1000022    25
    0.45790128   2    1000022    23
    0.0055534669   2    1000013   -13
    0.0055534669   2   -1000013    13
    0.0052023579   3    1000022    6   -6
    0.0047809067   2    1000011   -11
    0.0047809067   2   -1000011    11
    0.00097824275   2    1000014   -14
    0.00097824275   2   -1000014    14
    0.00097823692   2    1000012   -12
    0.00097823692   2   -1000012    12
    0.00039738439   3    1000022    15   -15

DECAY 1000025  0.60449827
    0.55102984   2    1000022    23
    0.43623857   2    1000022    25
    0.0057794081   3    1000022    6   -6
    0.0012421196   2    1000014   -14
    0.0012421196   2   -1000014    14
    0.0012421123   2    1000012   -12
    0.0012421123   2   -1000012    12
    0.0007461922   2    1000013   -13
    0.0007461922   2   -1000013    13
    0.00038518227   3    1000022    15   -15

DECAY 1000035  53.593225
    0.076518521   2    1000024   -24
    0.076518521   2   -1000024    24
    0.069857734   2    1000023    25
    0.067521019   2    1000025    23
    0.065592172   2    1000014   -14
    0.065592172   2   -1000014    14
    0.065592126   2    1000012   -12
    0.065592126   2   -1000012    12
    0.065169352   2    1000013   -13
    0.065169352   2   -1000013    13
    0.065168902   2    1000011   -11
    0.065168902   2   -1000011    11
    0.062264943   2    1000025    25
    0.01903794   2    1000006   -6
    0.01903794   2   -1000006    6
    0.016711685   2    2000005   -5
    0.016711685   2   -2000005    5
    0.0090851338   2    1000016   -16
    0.0090851338   2   -1000016    16
    0.0089325276   2    2000015   -15
    0.0089325276   2   -2000015    15
    0.0088113724   2    1000023    23
    0.0028210678   3    1000024    5   -6
    0.0028210678   3   -1000024   -5    6
    0.0010857677   3    1000023    6   -6
    0.00097118911   3    1000025    6   -6

DECAY 1000021  227.17795
    0.14764771   2    1000005   -5
    0.14764771   2   -1000005    5
    0.14011743   2    1000006   -6
    0.14011743   2   -1000006    6
    0.10954542   2    2000005   -5
    0.10954542   2   -2000005    5
    0.080256579   2    2000006   -6
    0.080256579   2   -2000006    6
    0.022286258   2    1000006   -4
    0.022286258   2   -1000006    4

DECAY 25  0.0036974343
    0.59526422   2   -5    5
    0.20430637   2   -24    24
    0.07307901   2    21    21
    0.068597555   2   -15    15
    0.02941925   2   -4    4
    0.024000588   2    23    23
    0.0023391793   2    22    22
    0.0013704379   2    22    23
    0.0011604369   2    1000022    1000022
    0.00023794427   2   -13    13
    0.00022423103   2   -3    3
    6.1997679e-07   2   -1    1
    1.5160903e-07   2   -2    2
    5.3492726e-09   2   -11    11

DECAY 35  30.169682
    0.70149367   2   -5    5
    0.2130378   2   -15    15
    0.042272929   2    1000022    1000025
    0.037812246   2    1000022    1000023
    0.001637934   2   -1000024    1000024
    0.001201022   2   -6    6
    0.00079452131   2   -13    13
    0.00049600329   2    1000022    1000022
    0.00038301205   2   -3    3
    0.00021754738   2    1000025    1000025
    0.00017818602   2    1000023    1000023
    0.00017269038   2   -2000015    1000015
    0.00017269038   2   -1000015    2000015
    9.807566e-05   2    1000022    1000035
    1.9798209e-05   2    25    25
    3.3158781e-06   2   -1000015    1000015
    2.5127521e-06   2    21    21
    1.7977052e-06   2    23    23
    1.0589881e-06   2   -1    1
    6.5295666e-07   2   -24    24
    2.7641389e-07   2   -1000011    1000011
    2.743544e-07   2   -1000013    1000013
    4.8668897e-08   2    22    23
    3.2581524e-08   2    1000023    1000025
    2.4862775e-08   2   -4    4
    2.0752486e-08   2    22    22
    1.9259502e-08   2   -2000013    1000013
    1.9259502e-08   2   -1000013    2000013
    1.7845154e-08   2   -11    11
    4.5048577e-13   2   -2000011    1000011
    4.5048577e-13   2   -1000011    2000011
    1.2816668e-13   2   -2    2

DECAY 36  29.420002
    0.69839404   2   -5    5
    0.2120735   2   -15    15
    0.044330773   2    1000022    1000023
    0.037858382   2    1000022    1000025
    0.0031757768   2   -1000024    1000024
    0.00127807   2   -6    6
    0.00079091815   2   -13    13
    0.00051244354   2    1000022    1000022
    0.00038127509   2   -3    3
    0.00036801936   2    1000023    1000023
    0.00035568012   2    1000025    1000025
    0.00017833997   2   -2000015    1000015
    0.00017833997   2   -1000015    2000015
    9.7995109e-05   2    1000022    1000035
    2.1207021e-05   2    21    21
    2.7498089e-06   2    23    25
    1.1579463e-06   2    1000023    1000025
    1.0541886e-06   2   -1    1
    1.1676117e-07   2    22    22
    7.628464e-08   2    22    23
    2.5392973e-08   2   -4    4
    1.9560998e-08   2   -2000013    1000013
    1.9560998e-08   2   -1000013    2000013
    1.7764315e-08   2   -11    11
    4.5753321e-13   2   -2000011    1000011
    4.5753321e-13   2   -1000011    2000011
    1.3089365e-13   2   -2    2
    2.0789256e-36   2    25    25

DECAY 37  28.563662
    0.70850509   2   -5    6
    0.20239728   2   -15    16
    0.085660874   2    1000022    1000024
    0.0010465338   2   -5    4
    0.00071554679   2   -13    14
    0.00039013509   2   -1000015    1000016
    0.00037398038   2   -3    4
    0.00034264819   2    1000023    1000024
    0.00032559827   2    1000024    1000025
    0.00020560658   2    1000022    1000037
    1.7486881e-05   2   -3    2
    7.473332e-06   2   -5    2
    5.2652535e-06   2   -3    6
    2.8400466e-06   2    24    25
    1.1443048e-06   2   -1000011    1000012
    1.1412562e-06   2   -1000013    1000014
    1.0379104e-06   2   -1    2
    2.1618873e-07   2   -1    6
    5.0374825e-08   2   -1    4
    4.1017675e-08   2   -2000013    1000014
    1.6736714e-08   2   -11    12
    1.0748791e-12   2    24    35
    9.5942398e-13   2   -2000011    1000012
    6.2382069e-13   2    24    36

DECAY 6  2.43
    1   2    5    24

DECAY 15 -1
