BLOCK SPINFO
   1   SPheno
   2   v4.0.5be

BLOCK SPHENOINFO
   1   2
   2   2

BLOCK MODSEL
   1   0

BLOCK MINPAR
   3    50.970842
   4    1

BLOCK EXTPAR
   0    3472.9257
   1   -3045.6743
   2   -4162.2052
   3    3645.6492
   11   -2628.8912
   12    3193.4157
   13    1454.1523
   23    202.86617
   25    50.365921
   26    3769.5848
   31    4895.3326
   32    4895.3326
   33    859.71566
   34    4364.0484
   35    4364.0484
   36    261.04584
   41    2299.51
   42    2299.51
   43    2894.4704
   44    4539.0247
   45    4539.0247
   46    3922.3788
   47    3303.354
   48    3303.354
   49    4096.5186

BLOCK SMINPUTS
   1    127.90897
   2    1.1663787e-05
   3    0.1184
   4    91.1876
   5    4.18
   6    173.2
   7    1.777
   8    0
   11    0.00051099893
   12    0
   13    0.10565837
   14    0
   21    0.005
   22    0.0025
   23    0.095
   24    1.27

BLOCK GAUGE Q=  3472.9257
   1    0.35536298
   2    0.66519887
   3    1.219778

BLOCK YU Q=  3472.9257
   1   1    8.3860246e-06
   2   2    0.0042601005
   3   3    1.0130991

BLOCK YD Q=  3472.9257
   1   1    0.00084873704
   2   2    0.016126004
   3   3    0.84168119

BLOCK YE Q=  3472.9257
   1   1    0.00014811082
   2   2    0.03062462
   3   3    0.51505573

BLOCK AU Q=  3472.9257
   1   1    0
   2   2    0
   3   3   -2628.8923

BLOCK AD Q=  3472.9257
   1   1    0
   2   2    0
   3   3    3193.4173

BLOCK AE Q=  3472.9257
   1   1    0
   2   2    0
   3   3    1454.152

BLOCK MSOFT Q=  3472.9257
   1   -3045.6743
   2   -4162.2052
   3    3645.6492
   21    14397070
   22    149177.03
   31    4895.3326
   32    4895.3326
   33    859.71566
   34    4364.0484
   35    4364.0484
   36    261.04584
   41    2299.51
   42    2299.51
   43    2894.4704
   44    4539.0247
   45    4539.0247
   46    3922.3788
   47    3303.354
   48    3303.354
   49    4096.5186

BLOCK MASS
   6    173.2
   23    91.1876
   24    80.429995
   15    1.777
   25    120.67137
   35    3768.5018
   36    3769.5848
   37    3769.6401
   1000001    2493.7446
   2000001    3437.1937
   1000002    2492.45
   2000002    4636.1054
   1000003    2493.7365
   2000003    3437.1811
   1000004    2492.442
   2000004    4636.1048
   1000005    3027.2987
   2000005    4170.0414
   1000006    3026.157
   2000006    3985.6535
   1000011    4917.4284
   2000011    4371.4201
   1000012    4916.3523
   1000013    4917.3977
   2000013    4371.3591
   1000014    4916.3237
   1000015    247.66601
   2000015    906.14528
   1000016    900.33815
   1000021    3802.6525
   1000022   -215.27871
   1000023    217.25683
   1000025   -3026.5409
   1000035   -4118.9315
   1000024    216.42411
   1000037    4118.9972

BLOCK ALPHA
      -0.019646996

BLOCK HMIX Q=  3472.9257
   1    202.86617
   2    50.365921
   3    243.11411
   4    14209770

BLOCK STOPMIX
   1   1    0.99845961
   1   2    0.055483341
   2   1   -0.055483341
   2   2    0.99845961

BLOCK SBOTMIX
   1   1    0.99999854
   1   2    0.0017095645
   2   1   -0.0017095645
   2   2    0.99999854

BLOCK STAUMIX
   1   1    0.020075209
   1   2    0.99979847
   2   1   -0.99979847
   2   2    0.020075209

BLOCK NMIX
   1   1   -0.010899555
   1   2    0.01376628
   1   3   -0.70870121
   1   4   -0.70529022
   2   1    0.0098326909
   2   2   -0.012980038
   2   3   -0.70550806
   2   4    0.7085148
   3   1    0.99989189
   3   2    0.0011295803
   3   3   -0.00078705964
   3   4   -0.014639416
   4   1    0.00085193621
   4   2   -0.99982035
   4   3   -0.00059965502
   4   4   -0.018925708

BLOCK UMIX
   1   1   -0.00084857374
   1   2    0.99999964
   2   1   -0.99999964
   2   2   -0.00084857374

BLOCK VMIX
   1   1    0.02675649
   1   2    0.99964198
   2   1    0.99964198
   2   2   -0.02675649

BLOCK HIGGSBOUNDSINPUTHIGGSCOUPLINGSFERMIONS
       0, 2536.726,3,36,15,15

BLOCK HIGGSBOUNDSINPUTHIGGSCOUPLINGSBOSONS
       0,4,36,21,21,23

BLOCK SPHENOLOWENERGY
   1    0.00031397975
   2    1.5912472e-06
   3    3.5252765e-05
   4    2.820067e-15
   5    1.2046909e-10
   6    2.516768e-08
   7    9.4279571e-14
   8    4.0275901e-09
   9    8.5268661e-07
   10    9.5859061e-05
   11    0.9901874
   12    0.54191957
   13    19.357122
   14    0
   15    0
   16    0.0021572162
   17    2.2816584e-15
   18    2.4802349e-11
   19    8.2906485e-11
   20   -1.0091038e-15
   21   -4.3141654e-11
   22   -3.3224752e-08
   23    0
   24    0
   25    0
   26    0
   27    0
   28    0
   29    0
   30    0
   31    0
   39    7.1980913e-05
   40    0
   41    0
   42    0

BLOCK FWCOEF Q=  160
   305   4422   0   0   -0.18881911
   305   4422   0   2   -0.18008506
   305   4322   0   2    0.00019648457
   305   6421   0   0   -0.095227835
   305   6421   0   2   -0.096218396
   305   6321   0   2   -1.0261214e-05
   3051111   4133   0   0    1.6225767
   3051111   4133   0   2    1.6230197
   3051111   4233   0   2    0.00047937857
   3051111   4137   0   0   -4.4452688
   3051111   4137   0   2   -4.443756
   3051111   4237   0   2   -0.0035675718
   3051313   4133   0   0    1.6225767
   3051313   4133   0   2    1.6230192
   3051313   4233   0   2    0.00047937746
   3051313   4137   0   0   -4.4452688
   3051313   4137   0   2   -4.4437565
   3051313   4237   0   2   -0.0035675736
   3051212   4137   0   0    1.5053501
   3051212   4137   0   2    1.5050229
   3051212   4237   0   2    0.000772157
   3051414   4137   0   0    1.5053501
   3051414   4137   0   2    1.5050229
   3051414   4237   0   2    0.00077215707
   3051616   4137   0   0    1.5053501
   3051616   4137   0   2    1.5050222
   3051616   4237   0   2    0.00077217739

BLOCK IMFWCOEF Q=  160
   305   4422   0   0    3.8582524e-07
   305   4422   0   2   -6.9998153e-06
   305   4322   0   2    5.083757e-06
   305   6421   0   0    3.3048484e-07
   305   6421   0   2   -1.2457639e-05
   305   6321   0   2    1.9176693e-06
   3051111   4133   0   2   -6.8539615e-07
   3051111   4233   0   2    9.3615624e-06
   3051111   4137   0   2    6.4595853e-06
   3051111   4237   0   2   -6.9673411e-05
   3051313   4133   0   2   -6.8539426e-07
   3051313   4233   0   2    9.3615488e-06
   3051313   4137   0   2    6.4595894e-06
   3051313   4237   0   2   -6.9673449e-05
   3051212   4137   0   2   -1.3933771e-06
   3051212   4237   0   2    1.5079952e-05
   3051414   4137   0   2   -1.3933774e-06
   3051414   4237   0   2    1.5079952e-05
   3051616   4137   0   2   -1.409908e-06
   3051616   4237   0   2    1.5079952e-05

DECAY 23  2.4952


DECAY 24  2.085


DECAY 2000011  5.9576823
    0.99920877   2    1000025    11
    0.00043603124   2    1000022    11
    0.00035484651   2    1000023    11

DECAY 1000011  8.1743905
    0.47144565   2   -1000037    12
    0.29276719   2    1000025    11
    0.23545918   2    1000035    11
    0.00016656637   2    1000022    11
    0.00015761339   2    1000023    11

DECAY 2000013  6.1196149
    0.97270485   2    1000025    13
    0.0132627   2   -1000024    14
    0.0070859631   2    1000022    13
    0.0069464572   2    1000023    13

DECAY 1000013  8.2653736
    0.46622585   2   -1000037    14
    0.28953827   2    1000025    13
    0.2328522   2    1000035    13
    0.0057185798   2    1000022    13
    0.0056594078   2    1000023    13

DECAY 1000015  0.14651883
    0.49827521   2   -1000024    16
    0.26663202   2    1000022    15
    0.23509277   2    1000023    15

DECAY 2000015  4.4123452
    0.48421693   2    1000022    15
    0.47976085   2    1000023    15
    0.018057168   2    1000015    25
    0.017617894   2    1000015    23
    0.00034715056   2   -1000024    16

DECAY 1000012  8.1836661
    0.46950336   2    1000037    11
    0.28975394   2    1000025    12
    0.23508466   2    1000035    12
    0.0037716533   2    1000024    11
    0.0010107829   2    1000022    12
    0.00087560899   2    1000023    12

DECAY 1000014  8.274641
    0.46431323   2    1000037    13
    0.28656252   2    1000025    14
    0.23248592   2    1000035    14
    0.014772692   2    1000024    13
    0.00099966401   2    1000022    14
    0.00086597708   2    1000023    14

DECAY 1000016  4.3795198
    0.9644151   2    1000024    15
    0.035009443   2    1000015    24
    0.00030865479   2    1000022    16
    0.00026679839   2    1000023    16

DECAY 1000001  0.0050644416
    0.53026424   2    1000022    1
    0.46666064   2    1000023    1
    0.0030751156   2   -1000024    2

DECAY 2000001  0.097351999
    0.99478167   2    1000025    1
    0.0025755393   2    1000022    1
    0.0021404002   2    1000023    1
    0.00050197813   2   -1000024    2

DECAY 1000003  0.018623388
    0.48601429   2    1000022    3
    0.46556443   2    1000023    3
    0.048421274   2   -1000024    4

DECAY 2000003  0.13254667
    0.73060094   2    1000025    3
    0.1330964   2   -1000024    4
    0.068560626   2    1000022    3
    0.06763234   2    1000023    3
    0.00010969725   2    1000003    25

DECAY 1000005  102.97145
    0.58981401   2   -1000024    6
    0.20604964   2    1000022    5
    0.20413636   2    1000023    5

DECAY 2000005  126.60662
    0.46011173   2   -1000024    6
    0.2318984   2    1000022    5
    0.22981412   2    1000023    5
    0.073755697   2    1000021    5
    0.0041175565   2    1000025    5
    0.00012330542   2    1000005    25
    0.00011952736   2    1000006   -24

DECAY 1000002  0.018380798
    0.84365839   2    1000024    1
    0.082222412   2    1000022    2
    0.074119199   2    1000023    2

DECAY 2000002  42.595541
    0.91993157   2    1000021    2
    0.080016275   2    1000025    2

DECAY 1000004  0.031933107
    0.88225771   2    1000024    3
    0.061141997   2    1000022    4
    0.056600289   2    1000023    4

DECAY 2000004  42.598754
    0.91985951   2    1000021    4
    0.080010136   2    1000025    4

DECAY 1000006  109.24953
    0.38601188   2    1000024    5
    0.27856873   2    1000023    6
    0.27606777   2    1000022    6
    0.059304393   3    1000022    24    5

DECAY 2000006  186.12072
    0.43480947   2    1000024    5
    0.21778567   2    1000023    6
    0.21585486   2    1000022    6
    0.053381279   2    1000005    24
    0.039539184   2    1000006    25
    0.026609084   2    1000006    23
    0.0081978227   2    1000025    6
    0.0038226321   2    1000021    6

DECAY 1000024  4.5746061e-12
    0.60493331   3    1000022   -1    2
    0.20166818   3    1000022   -11    12
    0.19339851   3    1000022   -13    14

DECAY 1000037  180.22659
    0.12115733   2    1000004   -3
    0.12115643   2    1000002   -1
    0.12109848   2   -1000003    4
    0.12109763   2   -1000001    2
    0.091146891   2    1000016   -15
    0.091059253   2   -2000015    16
    0.063971319   2    1000006   -5
    0.062392635   2   -1000005    6
    0.04996764   2    1000024    25
    0.047050316   2    1000023    24
    0.046842536   2    1000024    23
    0.046619312   2    1000022    24
    0.0054299769   3    1000024    6   -6
    0.0033100241   3    1000022   -5    6
    0.0033086548   3    1000023   -5    6
    0.0010936167   2    1000024    35
    0.0010855568   2    1000024    36
    0.0010787037   2    37    1000023
    0.0010405532   2    37    1000022

DECAY 1000022 -1


DECAY 1000023  1.0941145e-09
    0.93398152   2    1000022    22
    0.019311378   3    1000022    12   -12
    0.014439597   3    1000022    1   -1
    0.014058631   3    1000022    3   -3
    0.011262211   3    1000022    2   -2
    0.0032588514   3    1000022    11   -11
    0.0031245313   3    1000022    13   -13
    0.00017156384   3    1000024    1   -2
    0.00017156384   3   -1000024   -1    2

DECAY 1000025  30.417941
    0.24649741   2    1000015   -15
    0.24649741   2   -1000015    15
    0.065963277   2    1000024   -24
    0.065963277   2   -1000024    24
    0.052070988   2    2000015   -15
    0.052070988   2   -2000015    15
    0.051691225   2    1000016   -16
    0.051691225   2   -1000016    16
    0.036925427   2    1000023    25
    0.036469465   2    1000023    23
    0.033779073   2    1000022    25
    0.02914414   2    1000022    23
    0.0041004661   3    1000024    5   -6
    0.0041004661   3   -1000024   -5    6
    0.0027634217   3    1000023    6   -6
    0.0027119141   3    1000022    6   -6
    0.0021841475   2    1000004   -4
    0.0021841475   2   -1000004    4
    0.0021841007   2    1000002   -2
    0.0021841007   2   -1000002    2
    0.002120115   2    1000003   -3
    0.002120115   2   -1000003    3
    0.002120057   2    1000001   -1
    0.002120057   2   -1000001    1
    0.00015908192   3    1000022    5   -5
    0.00015566352   3    1000023    5   -5

DECAY 1000035  181.6699
    0.060097425   2    1000004   -4
    0.060097425   2   -1000004    4
    0.060096968   2    1000002   -2
    0.060096968   2   -1000002    2
    0.060061729   2    1000003   -3
    0.060061729   2   -1000003    3
    0.060061279   2    1000001   -1
    0.060061279   2   -1000001    1
    0.046472628   2    1000024   -24
    0.046472628   2   -1000024    24
    0.045267757   2    1000016   -16
    0.045267757   2   -1000016    16
    0.045109712   2    2000015   -15
    0.045109712   2   -2000015    15
    0.031958478   2    1000006   -6
    0.031958478   2   -1000006    6
    0.031646949   2    1000005   -5
    0.031646949   2   -1000005    5
    0.028706816   2    1000023    25
    0.026269098   2    1000022    25
    0.024832944   2    1000023    23
    0.021679374   2    1000022    23
    0.0035766189   3    1000024    5   -6
    0.0035766189   3   -1000024   -5    6
    0.0028026982   3    1000023    6   -6
    0.0027621318   3    1000022    6   -6
    0.0010224034   2    37   -1000024
    0.0010224034   2   -37    1000024
    0.00090455625   2    1000022    35
    0.00082718143   2    1000023    35
    0.00019624698   2    1000023    36
    0.00018675439   2    1000022    36

DECAY 1000021  183.93938
    0.099543669   2    1000004   -4
    0.099543669   2   -1000004    4
    0.099542736   2    1000002   -2
    0.099542736   2   -1000002    2
    0.099387952   2    1000003   -3
    0.099387952   2   -1000003    3
    0.099386981   2    1000001   -1
    0.099386981   2   -1000001    1
    0.04103442   2    1000005   -5
    0.04103442   2   -1000005    5
    0.039216774   2    1000006   -6
    0.039216774   2   -1000006    6
    0.010244506   2    2000003   -3
    0.010244506   2   -2000003    3
    0.010243835   2    2000001   -1
    0.010243835   2   -2000001    1
    0.00068884081   3    1000024    5   -6
    0.00068884081   3   -1000024   -5    6
    0.00046739023   3    1000023    6   -6
    0.00046337023   3    1000022    6   -6
    0.00022614513   3    1000022    5   -5
    0.00022407231   3    1000023    5   -5

DECAY 25  0.0033881346
    0.63625409   2   -5    5
    0.16245995   2   -24    24
    0.075038782   2    21    21
    0.072776231   2   -15    15
    0.031502107   2   -4    4
    0.018024169   2    23    23
    0.0023147141   2    22    22
    0.0011376198   2    22    23
    0.00025243866   2   -13    13
    0.00023907327   2   -3    3
    6.6101426e-07   2   -1    1
    1.6235228e-07   2   -2    2
    5.6751618e-09   2   -11    11

DECAY 35  116.7703
    0.81504024   2   -5    5
    0.15542567   2   -15    15
    0.011801536   2   -2000015    1000015
    0.011801536   2   -1000015    2000015
    0.0025825273   2    1000023    1000025
    0.0016852831   2    1000022    1000025
    0.00056618784   2   -13    13
    0.00044548187   2   -6    6
    0.00030208366   2   -3    3
    0.00019410981   2   -1000024    1000024
    5.2230479e-05   2    1000022    1000022
    4.2100079e-05   2    1000023    1000023
    2.9017648e-05   2   -1000015    1000015
    2.3537363e-05   2   -2000015    2000015
    7.0691688e-06   2    21    21
    8.3514948e-07   2   -1    1
    3.639861e-07   2    25    25
    7.0079276e-08   2    23    23
    1.5880472e-08   2   -24    24
    1.2715407e-08   2   -11    11
    8.3492334e-09   2    22    22
    8.0277548e-09   2    1000022    1000023
    6.8034929e-09   2    22    23
    6.0345381e-09   2   -4    4
    3.1106165e-14   2   -2    2

DECAY 36  107.47922
    0.8129959   2   -5    5
    0.15503946   2   -15    15
    0.012846924   2   -2000015    1000015
    0.012846924   2   -1000015    2000015
    0.0028400872   2    1000022    1000025
    0.001809573   2    1000023    1000025
    0.00056478411   2   -13    13
    0.00042557859   2   -6    6
    0.00030132088   2   -3    3
    0.00021293717   2   -1000024    1000024
    5.3106367e-05   2    1000022    1000022
    5.0098044e-05   2    1000023    1000023
    1.204229e-05   2    21    21
    8.3303576e-07   2   -1    1
    2.3964974e-07   2    1000022    1000023
    1.5094026e-07   2    23    25
    1.2683852e-08   2   -11    11
    9.2231662e-09   2    22    22
    6.9052251e-09   2    22    23
    5.7142169e-09   2   -4    4
    2.9455685e-14   2   -2    2
    1.5232391e-14   2    23    35
    1.9537479e-39   2    25    25

DECAY 37  121.15463
    0.80929734   2   -5    6
    0.1616586   2   -15    16
    0.022791756   2   -1000015    1000016
    0.0041565509   2    1000024    1000025
    0.0011998289   2   -5    4
    0.00057152071   2   -13    14
    0.00027100535   2   -3    4
    1.2725478e-05   2   -3    2
    1.2606513e-05   2   -2000015    1000016
    1.0134748e-05   2    1000023    1000024
    8.5680157e-06   2   -5    2
    7.3342573e-06   2    1000022    1000024
    1.0614036e-06   2   -3    6
    7.5193121e-07   2   -1    2
    1.3396129e-07   2    24    25
    3.5480552e-08   2   -1    4
    3.0185224e-08   2   -1    6
    1.3367929e-08   2   -11    12
    2.1479385e-14   2    24    35

DECAY 6  2.43
    1   2    5    24

DECAY 15 -1
