BLOCK SPINFO
   1   SPheno
   2   v4.0.5be

BLOCK SPHENOINFO
   1   2
   2   2

BLOCK MODSEL
   1   0

BLOCK MINPAR
   3    7.0953238
   4   -1

BLOCK EXTPAR
   0    3076.141
   1    523.31052
   2   -1689.7098
   3    3325.9606
   11   -6097.1054
   12   -5857.533
   13    630.27846
   23   -4887.0029
   25    6.7609187
   26    3103.4537
   31    1113.08
   32    1113.08
   33    3119.9753
   34    3320.2888
   35    3320.2888
   36    1485.2815
   41    3490.8178
   42    3490.8178
   43    3959.7071
   44    3329.6128
   45    3329.6128
   46    2251.9967
   47    1205.992
   48    1205.992
   49    3434.8385

BLOCK SMINPUTS
   1    127.90897
   2    1.1663787e-05
   3    0.1184
   4    91.1876
   5    4.18
   6    173.2
   7    1.777
   8    0
   11    0.00051099893
   12    0
   13    0.10565837
   14    0
   21    0.005
   22    0.0025
   23    0.095
   24    1.27

BLOCK GAUGE Q=  3076.141
   1    0.35536298
   2    0.66519887
   3    1.219778

BLOCK YU Q=  3076.141
   1   1    8.4755886e-06
   2   2    0.004305599
   3   3    1.0239192

BLOCK YD Q=  3076.141
   1   1    0.00011514785
   2   2    0.0021878091
   3   3    0.11419058

BLOCK YE Q=  3076.141
   1   1    2.0094142e-05
   2   2    0.0041548312
   3   3    0.069877426

BLOCK AU Q=  3076.141
   1   1    0
   2   2    0
   3   3   -6097.1052

BLOCK AD Q=  3076.141
   1   1    0
   2   2    0
   3   3   -5857.5334

BLOCK AE Q=  3076.141
   1   1    0
   2   2    0
   3   3    630.27846

BLOCK MSOFT Q=  3076.141
   1    523.31052
   2   -1689.7098
   3    3325.9606
   21   -14532789
   22   -23542018
   31    1113.08
   32    1113.08
   33    3119.9753
   34    3320.2888
   35    3320.2888
   36    1485.2815
   41    3490.8178
   42    3490.8178
   43    3959.7071
   44    3329.6128
   45    3329.6128
   46    2251.9967
   47    1205.992
   48    1205.992
   49    3434.8385

BLOCK MASS
   6    173.2
   23    91.1876
   24    80.429995
   15    1.777
   25    122.01251
   35    3103.3466
   36    3103.4537
   37    3104.7029
   1000001    3608.0091
   2000001    1382.0576
   1000002    3607.1822
   2000002    3439.2859
   1000003    3608.0088
   2000003    1382.0569
   1000004    3607.182
   2000004    3439.2858
   1000005    3540.7477
   2000005    4011.3337
   1000006    2353.7059
   2000006    4020.3168
   1000011    1139.5306
   2000011    3325.0104
   1000012    1136.5605
   1000013    1139.5283
   2000013    3325.0086
   1000014    1136.559
   1000015    1490.3945
   2000015    3129.9296
   1000016    3128.5084
   1000021    3510.0547
   1000022    520.01757
   1000023   -1740.0744
   1000025    4854.9761
   1000035   -4855.9087
   1000024    1740.1169
   1000037    4856.2701

BLOCK ALPHA
      -0.1403706

BLOCK HMIX Q=  3076.141
   1   -4887.0029
   2    6.7609187
   3    243.23473
   4    9631424.9

BLOCK STOPMIX
   1   1    0.071895926
   1   2    0.99741214
   2   1   -0.99741214
   2   2    0.071895926

BLOCK SBOTMIX
   1   1   -0.017193586
   1   2    0.99985218
   2   1   -0.99985218
   2   2   -0.017193586

BLOCK STAUMIX
   1   1   -0.0078801675
   1   2    0.99996895
   2   1   -0.99996895
   2   2   -0.0078801675

BLOCK NMIX
   1   1    0.99995799
   1   2   -4.0870402e-05
   1   3   -0.0091615137
   1   4    0.00027682273
   2   1    0.00021333071
   2   2    0.9997902
   2   3    0.018562834
   2   4   -0.0086563023
   3   1    0.0062817669
   3   2   -0.0070064444
   3   3    0.70703758
   3   4    0.70711337
   4   1    0.0066712465
   4   2   -0.019247441
   4   3    0.70687294
   4   4   -0.70704715

BLOCK UMIX
   1   1   -0.99965631
   1   2   -0.026215767
   2   1   -0.026215767
   2   2    0.99965631

BLOCK VMIX
   1   1    0.99992511
   1   2    0.012238569
   2   1    0.012238569
   2   2   -0.99992511

BLOCK HIGGSBOUNDSINPUTHIGGSCOUPLINGSFERMIONS
       0, 45.710022,3,36,15,15

BLOCK HIGGSBOUNDSINPUTHIGGSCOUPLINGSBOSONS
       0,4,36,21,21,23

BLOCK SPHENOLOWENERGY
   1    0.0003276909
   2    1.5898312e-06
   3    3.5264434e-05
   4    2.5849789e-15
   5    1.1042738e-10
   6    2.3117481e-08
   7    8.7206201e-14
   8    3.7254465e-09
   9    7.9022024e-07
   10    9.6774086e-05
   11    0.99963926
   12    0.54214559
   13    19.371152
   14    0
   15    0
   16    0.0021580236
   17    2.2816655e-15
   18    2.4812377e-11
   19    8.2925422e-11
   20    1.3877912e-16
   21    5.9330685e-12
   22    1.0532812e-09
   23    0
   24    0
   25    0
   26    0
   27    0
   28    0
   29    0
   30    0
   31    0
   39   -0.00015146272
   40    0
   41    0
   42    0

BLOCK FWCOEF Q=  160
   305   4422   0   0   -0.18881911
   305   4422   0   2   -0.19662925
   305   4322   0   2   -0.00015732532
   305   6421   0   0   -0.095227835
   305   6421   0   2   -0.10433781
   305   6321   0   2   -0.00018231408
   3051111   4133   0   0    1.6170389
   3051111   4133   0   2    1.6170325
   3051111   4233   0   2    3.0048304e-06
   3051111   4137   0   0   -4.439731
   3051111   4137   0   2   -4.4392148
   3051111   4237   0   2   -2.3324669e-05
   3051313   4133   0   0    1.6170389
   3051313   4133   0   2    1.6170325
   3051313   4233   0   2    3.0048301e-06
   3051313   4137   0   0   -4.439731
   3051313   4137   0   2   -4.4392149
   3051313   4237   0   2   -2.3324669e-05
   3051212   4137   0   0    1.5053501
   3051212   4137   0   2    1.5052413
   3051212   4237   0   2    5.0576468e-06
   3051414   4137   0   0    1.5053501
   3051414   4137   0   2    1.5052413
   3051414   4237   0   2    5.0576469e-06
   3051616   4137   0   0    1.5053501
   3051616   4137   0   2    1.5052413
   3051616   4237   0   2    5.0572259e-06

BLOCK IMFWCOEF Q=  160
   305   4422   0   0    3.8580032e-07
   305   4422   0   2    2.3674144e-07
   305   4322   0   2   -6.4534571e-07
   305   6421   0   0    3.3046348e-07
   305   6421   0   2    3.1821348e-06
   305   6321   0   2   -4.2846953e-07
   3051111   4133   0   2   -1.8042127e-06
   3051111   4233   0   2    7.5486063e-08
   3051111   4137   0   2    1.3702427e-05
   3051111   4237   0   2   -5.8041522e-07
   3051313   4133   0   2   -1.8042122e-06
   3051313   4233   0   2    7.5486062e-08
   3051313   4137   0   2    1.3702427e-05
   3051313   4237   0   2   -5.8041522e-07
   3051212   4137   0   2   -2.9123844e-06
   3051212   4237   0   2    1.2583417e-07
   3051414   4137   0   2   -2.9123844e-06
   3051414   4237   0   2    1.2583417e-07
   3051616   4137   0   2   -2.9120761e-06
   3051616   4237   0   2    1.2582637e-07

DECAY 23  2.4952


DECAY 24  2.085


DECAY 1000011  0.89710695
    1   2    1000022    11

DECAY 2000011  15.89833
    0.99999997   2    1000022    11

DECAY 1000013  0.89710315
    1   2    1000022    13

DECAY 2000013  15.899387
    0.99993294   2    1000022    13

DECAY 1000015  5.775591
    1   2    1000022    15

DECAY 2000015  24.022222
    0.54707978   2   -1000024    16
    0.27369059   2    1000023    15
    0.15474542   2    1000022    15
    0.012401424   2    1000015    23
    0.012082784   2    1000015    25

DECAY 1000012  0.89258026
    1   2    1000022    12

DECAY 1000014  0.89257779
    1   2    1000022    14

DECAY 1000016  24.009102
    0.54703784   2    1000024    15
    0.27339442   2    1000023    16
    0.15477475   2    1000022    16
    0.024792995   2    1000015    24

DECAY 2000001  0.56853511
    1   2    1000022    1

DECAY 1000001  29.33903
    0.63707832   2   -1000024    2
    0.31860972   2    1000023    1
    0.027847253   2    1000021    1
    0.016464684   2    1000022    1

DECAY 2000003  0.5685346
    1   2    1000022    3

DECAY 1000003  29.339272
    0.6370726   2   -1000024    4
    0.31860705   2    1000023    3
    0.027846829   2    1000021    3
    0.016464548   2    1000022    3

DECAY 1000005  1.9951158
    0.94858443   2    1000022    5
    0.041122747   2    1000021    5
    0.0041849596   2   -1000024    6
    0.0039926869   2    1000006   -24
    0.0021151737   2    1000023    5

DECAY 2000005  116.55319
    0.54686683   2    1000006   -24
    0.1980389   2   -1000024    6
    0.14918554   2    1000021    5
    0.099745948   2    1000023    5
    0.0046440298   2    1000022    5
    0.0009524642   2    1000005    25
    0.00056629331   2    1000005    23

DECAY 2000002  7.3327397
    0.99999997   2    1000022    2

DECAY 1000002  29.32235
    0.63746022   2    1000024    1
    0.31867777   2    1000023    2
    0.027407177   2    1000021    2
    0.016454841   2    1000022    2

DECAY 2000004  7.3327372
    0.99999995   2    1000022    4

DECAY 1000004  29.322253
    0.63746222   2    1000024    3
    0.31867864   2    1000023    4
    0.027404204   2    1000021    4
    0.016454889   2    1000022    4

DECAY 1000006  4.6990709
    0.99620298   2    1000022    6
    0.002555943   2    1000024    5
    0.0012275117   2    1000023    6

DECAY 2000006  131.47197
    0.36313607   2    1000006    25
    0.24430814   2    1000006    23
    0.17731324   2    1000024    5
    0.12144067   2    1000021    6
    0.088326171   2    1000023    6
    0.0044059695   2    1000022    6
    0.001069739   2    1000005    24

DECAY 1000024  10.029618
    0.25103725   2    1000014   -13
    0.25103622   2    1000012   -11
    0.24895279   2   -1000013    14
    0.24895126   2   -1000011    12

DECAY 1000037  146.28837
    0.60543363   2    1000006   -5
    0.10211587   2   -2000005    6
    0.084265124   2    1000024    25
    0.073709788   2    1000024    23
    0.073663377   2    1000023    24
    0.021592424   2    1000022    24
    0.009456438   3    1000024    6   -6
    0.0077924856   2    37    1000022
    0.0044713997   2    37    1000023
    0.0038432834   3    1000023   -5    6
    0.0029972977   2   -1000005    6
    0.0026498519   2    1000024    35
    0.0025968824   2    1000024    36
    0.0016999898   2    2000006   -5
    0.0013868793   3    1000022   -5    6
    0.0013167606   2   -1000015    16
    0.00055870761   2    1000016   -15

DECAY 1000022 -1


DECAY 1000023  10.028896
    0.125453   2    1000014   -14
    0.125453   2   -1000014    14
    0.12545249   2    1000012   -12
    0.12545249   2   -1000012    12
    0.12453492   2    1000013   -13
    0.12453492   2   -1000013    13
    0.12453416   2    1000011   -11
    0.12453416   2   -1000011    11

DECAY 1000025  150.10265
    0.29928543   2    1000006   -6
    0.29928543   2   -1000006    6
    0.071903478   2    1000024   -24
    0.071903478   2   -1000024    24
    0.063660667   2    1000023    23
    0.047448995   2    2000006   -6
    0.047448995   2   -2000006    6
    0.041318323   2    1000023    25
    0.011159772   2    1000022    23
    0.0088887421   2    1000022    25
    0.0059698902   2    1000022    35
    0.0055525178   3    1000024    5   -6
    0.0055525178   3   -1000024   -5    6
    0.0043160474   2    1000023    35
    0.0030723482   3    1000023    6   -6
    0.0022594473   2    37   -1000024
    0.0022594473   2   -37    1000024
    0.001579329   2    1000022    36
    0.0013760438   2    1000005   -5
    0.0013760438   2   -1000005    5
    0.001161458   3    1000022    6   -6
    0.00064598307   2    1000015   -15
    0.00064598307   2   -1000015    15
    0.00063677866   2    2000005   -5
    0.00063677866   2   -2000005    5
    0.00026896444   2    2000015   -15
    0.00026896444   2   -2000015    15

DECAY 1000035  147.93859
    0.30500188   2    1000006   -6
    0.30500188   2   -1000006    6
    0.073971224   2    1000023    25
    0.073262894   2    1000024   -24
    0.073262894   2   -1000024    24
    0.04842932   2    2000006   -6
    0.04842932   2   -2000006    6
    0.015925537   2    1000022    25
    0.010034604   2    1000022    23
    0.0085541602   2    1000023    23
    0.0045834327   3    1000023    6   -6
    0.0043391603   2    37   -1000024
    0.0043391603   2   -37    1000024
    0.0041077296   3    1000024    5   -6
    0.0041077296   3   -1000024   -5    6
    0.003426265   2    1000022    35
    0.0029089613   2    1000022    36
    0.0025735182   2    1000023    35
    0.001393561   2    1000005   -5
    0.001393561   2   -1000005    5
    0.0013460016   3    1000022    6   -6
    0.00065677479   2    2000005   -5
    0.00065677479   2   -2000005    5
    0.00065443173   2    1000015   -15
    0.00065443173   2   -1000015    15
    0.00027930214   2    2000015   -15
    0.00027930214   2   -2000015    15

DECAY 1000021  179.32158
    0.20683431   2    2000003   -3
    0.20683431   2   -2000003    3
    0.20683423   2    2000001   -1
    0.20683423   2   -2000001    1
    0.084869847   2    1000006   -6
    0.084869847   2   -1000006    6
    0.00046159274   2    2000002   -2
    0.00046159274   2   -2000002    2
    0.00046152095   2    2000004   -4
    0.00046152095   2   -2000004    4
    0.00011386474   3    1000024    3   -4
    0.00011386474   3   -1000024   -3    4
    0.0001138646   3    1000024    1   -2
    0.0001138646   3   -1000024   -1    2
    0.00010186801   3    1000023    4   -4
    0.00010186792   3    1000023    2   -2
    0.00010151676   3    1000023    3   -3
    0.00010151666   3    1000023    1   -1

DECAY 25  0.0035230907
    0.61755896   2   -5    5
    0.18198581   2   -24    24
    0.074392845   2    21    21
    0.070753517   2   -15    15
    0.030503436   2   -4    4
    0.020742783   2    23    23
    0.0023353566   2    22    22
    0.0012489048   2    22    23
    0.00024540958   2   -13    13
    0.00023217557   2   -3    3
    6.419428e-07   2   -1    1
    1.5720084e-07   2   -2    2
    5.5171203e-09   2   -11    11

DECAY 35  4.7859369
    0.52958056   2   -6    6
    0.39977427   2   -5    5
    0.067440122   2   -15    15
    0.0016611243   2    25    25
    0.00048919863   2    1000022    1000023
    0.0002377099   2   -13    13
    0.00018638276   2   -3    3
    0.00015371517   2    23    23
    0.00011006816   2    21    21
    9.3168205e-05   2    1000022    1000022
    4.440148e-05   2   -24    24
    2.4133947e-05   2   -1000011    1000011
    2.4113296e-05   2   -1000013    1000013
    6.9759854e-06   2   -4    4
    5.7671411e-06   2   -1000015    1000015
    4.7039165e-06   2   -1000001    1000001
    4.7007738e-06   2   -1000003    1000003
    6.6140643e-07   2    22    22
    5.1534711e-07   2   -1    1
    1.3337224e-07   2    22    23
    5.338755e-09   2   -11    11
    3.5961589e-11   2   -2    2

DECAY 36  4.7353011
    0.53828483   2   -6    6
    0.39392124   2   -5    5
    0.06645337   2   -15    15
    0.00032951893   2    1000022    1000023
    0.00025904226   2    23    25
    0.00023423315   2   -13    13
    0.00021733882   2    21    21
    0.00018365605   2   -3    3
    0.00010834891   2    1000022    1000022
    6.9993346e-06   2   -4    4
    7.5231068e-07   2    22    22
    5.0780853e-07   2   -1    1
    1.5643077e-07   2    22    23
    5.2607108e-09   2   -11    11
    3.6083109e-11   2   -2    2
    6.977768e-35   2    25    25

DECAY 37  4.5936276
    0.92882376   2   -5    6
    0.06804621   2   -15    16
    0.00085043781   2    1000022    1000024
    0.00075078056   2   -3    6
    0.00059356698   2   -5    4
    0.00026751073   2    24    25
    0.00024056763   2   -13    14
    0.00018196818   2   -3    4
    9.8764719e-05   2   -1000011    1000012
    9.8734593e-05   2   -1000013    1000014
    3.4422333e-05   2   -1    6
    8.2114406e-06   2   -3    2
    4.2386064e-06   2   -5    2
    4.8638017e-07   2   -1    2
    3.3721849e-07   2   -1    4
    5.626902e-09   2   -11    12
    1.3600923e-12   2    24    35
    9.0163355e-13   2    24    36

DECAY 6  2.43
    1   2    5    24

DECAY 15 -1
