BLOCK DCINFO
   1   SDECAY/HDECAY
   2   1.3b /3.4

BLOCK SPINFO
   1   SOFTSUSY
   2   3.4.0

BLOCK MODSEL
   1   0

BLOCK SMINPUTS
   1    127.90897
   2    1.1663787e-05
   3    0.1184
   4    91.1876
   5    4.18
   6    173.2
   7    1.777

BLOCK MINPAR
   3    22.32

BLOCK EXTPAR
   0   -1
   1    2202
   2   -387.26
   3    2078.53
   11   -1580.32
   12    3245.56
   13    1200.66
   23   -477.52
   26    1203.84
   31    1181.09
   32    1181.09
   33    1971.45
   34    762.26
   35    762.26
   36    1358.31
   41    3973.66
   42    3973.66
   43    3725.96
   44    2670.15
   45    2670.15
   46    3007.84
   47    3029.92
   48    3029.92
   49    2756.67

BLOCK MASS
   24    80.3852
   25    124.02496
   35    1203.886
   36    1203.84
   37    1206.739
   5    4.8187603
   1000001    4034.4986
   2000001    3098.3031
   1000002    4033.8487
   2000002    2749.8858
   1000003    4034.4986
   2000003    3098.3031
   1000004    4033.8487
   2000004    2749.8858
   1000005    2824.3265
   2000005    3759.9515
   1000006    3031.3772
   2000006    3763.5978
   1000011    1187.4316
   2000011    791.46471
   1000012    1184.4373
   1000013    1187.4316
   2000013    791.46471
   1000014    1184.4373
   1000015    1372.1809
   2000015    1975.6044
   1000016    1973.6241
   1000021    2342.4552
   1000022   -385.21219
   1000023    498.14959
   1000025   -526.33591
   1000035    2159.5829
   1000024    385.91721
   1000037    528.91134

BLOCK NMIX
   1   1    0.0052095684
   1   2    0.88605581
   1   3    0.36342599
   1   4   -0.28774904
   2   1   -0.017664491
   2   2   -0.058750614
   2   3    0.70383365
   2   4    0.70771076
   3   1    0.010925621
   3   2   -0.45984026
   3   3    0.61034806
   3   4   -0.64490528
   4   1    0.9997707
   4   2   -0.0006298723
   4   3    0.0038720273
   4   4    0.021051216

BLOCK UMIX
   1   1    0.86315569
   1   2    0.50493788
   2   1   -0.50493788
   2   2    0.86315569

BLOCK VMIX
   1   1   -0.91627536
   1   2   -0.40054895
   2   1    0.40054895
   2   2   -0.91627536

BLOCK STOPMIX
   1   1    0.049930011
   1   2    0.99875272
   2   1   -0.99875272
   2   2    0.049930011

BLOCK SBOTMIX
   1   1   -0.0052771214
   1   2    0.99998608
   2   1   -0.99998608
   2   2   -0.0052771214

BLOCK STAUMIX
   1   1   -0.010402249
   1   2    0.99994589
   2   1   -0.99994589
   2   2   -0.010402249

BLOCK ALPHA
      -0.047513746

BLOCK HMIX Q=  3350.121
   1   -486.21612
   2    21.392951
   3    241.41126
   4    1529016.9

BLOCK GAUGE Q=  3350.121
   1    0.36597295
   2    0.64195379
   3    1.0114356

BLOCK AU Q=  3350.121
   1   1    0
   2   2    0
   3   3   -1580.32

BLOCK AD Q=  3350.121
   1   1    0
   2   2    0
   3   3    3245.56

BLOCK AE Q=  3350.121
   1   1    0
   2   2    0
   3   3    1200.66

BLOCK YU Q=  3350.121
   1   1    0
   2   2    0
   3   3    0.82473751

BLOCK YD Q=  3350.121
   1   1    0
   2   2    0
   3   3    0.30235325

BLOCK YE Q=  3350.121
   1   1    0
   2   2    0
   3   3    0.22120005

BLOCK MSOFT Q=  3350.121
   1    2202
   2   -387.26
   3    2078.53
   21    1253001.9
   22    35381.784
   31    1181.09
   32    1181.09
   33    1971.45
   34    762.26
   35    762.26
   36    1358.31
   41    3973.66
   42    3973.66
   43    3725.96
   44    2670.15
   45    2670.15
   46    3007.84
   47    3029.92
   48    3029.92
   49    2756.67

BLOCK HIGGSBOUNDSINPUTHIGGSCOUPLINGSFERMIONS
       0, 457.65834,3,36,15,15

BLOCK HIGGSBOUNDSINPUTHIGGSCOUPLINGSBOSONS
       0,4,36,21,21,23

DECAY 6  1.4515835
    1   2    5    24

DECAY 1000021  0.044872462
    0.1604681   3    1000023    6   -6
    0.15649385   3    1000037    5   -6
    0.15649385   3   -1000037    6   -5
    0.11768476   3    1000025    6   -6
    0.070880254   3    1000024    5   -6
    0.070880254   3   -1000024    6   -5
    0.048607641   3    1000022    6   -6
    0.032925482   3    1000023    5   -5
    0.0264174   3    1000025    5   -5
    0.022803425   3    1000022    5   -5
    0.018072269   3    1000024    1   -2
    0.018072269   3   -1000024    2   -1
    0.018072269   3    1000024    3   -4
    0.018072269   3   -1000024    4   -3
    0.0089834411   3    1000022    2   -2
    0.0089834411   3    1000022    4   -4
    0.008935069   3    1000022    1   -1
    0.008935069   3    1000022    3   -3
    0.0037894652   3    1000037    1   -2
    0.0037894652   3   -1000037    2   -1
    0.0037894652   3    1000037    3   -4
    0.0037894652   3   -1000037    4   -3
    0.0027144409   2    1000023    21
    0.0019644202   2    1000025    21
    0.0019345616   3    1000025    1   -1
    0.0019345616   3    1000025    3   -3
    0.0019063968   3    1000025    2   -2
    0.0019063968   3    1000025    4   -4
    0.00037389593   2    1000022    21
    8.943751e-05   3    1000023    2   -2
    8.943751e-05   3    1000023    4   -4
    5.4764649e-05   3    1000023    1   -1
    5.4764649e-05   3    1000023    3   -3
    1.6150248e-05   3    1000035    2   -2
    1.6150248e-05   3    1000035    4   -4
    3.0033443e-06   3    1000035    5   -5
    1.2605324e-06   3    1000035    1   -1
    1.2605324e-06   3    1000035    3   -3
    1.1984426e-07   2    1000035    21

DECAY 1000006  105.15684
    0.31773211   2    1000037    5
    0.24903276   2    1000021    6
    0.18259429   2    1000023    6
    0.15798557   2    1000025    6
    0.050177292   2    1000024    5
    0.026095405   2    1000022    6
    0.016382547   2    1000035    6
    2.0966657e-08   2    1000005    24

DECAY 2000006  179.46919
    0.41837001   2    1000021    6
    0.15847736   2    1000024    5
    0.13775885   2    1000023    6
    0.12667785   2    1000025    6
    0.091786234   2    1000022    6
    0.046493602   2    1000037    5
    0.010210641   2    1000006    23
    0.0083153318   2    1000006    25
    0.0014785983   2    1000035    6
    0.00043151812   2    1000005    24

DECAY 1000005  24.831439
    0.60126176   2    1000021    5
    0.14040607   2   -1000037    6
    0.096113216   2    1000023    5
    0.070941573   2    1000025    5
    0.052327949   2   -1000024    6
    0.027339074   2    1000022    5
    0.011610355   2    1000035    5

DECAY 2000005  180.83233
    0.42248068   2    1000021    5
    0.27046573   2   -1000037    6
    0.16603333   2   -1000024    6
    0.070063665   2    1000022    5
    0.031195331   2    1000025    5
    0.019564086   2    1000006   -24
    0.018351697   2    1000023    5
    0.0013914757   2    1000035    5
    0.00023600133   2    1000005    25
    0.00021800701   2    1000005    23

DECAY 1000002  172.79865
    0.72783806   2    1000021    2
    0.15178594   2    1000024    1
    0.071132756   2    1000022    2
    0.028553675   2    1000037    1
    0.018652949   2    1000025    2
    0.0016920481   2    1000035    2
    0.00034456445   2    1000023    2

DECAY 2000002  15.632216
    0.93990566   2    1000021    2
    0.059923913   2    1000035    2
    0.00011602354   2    1000023    2
    4.4043905e-05   2    1000025    2
    1.0360036e-05   2    1000022    2

DECAY 1000001  172.81789
    0.7281129   2    1000021    1
    0.13470497   2   -1000024    2
    0.070819767   2    1000022    1
    0.045378979   2   -1000037    2
    0.018994112   2    1000025    1
    0.0017151653   2    1000035    1
    0.00027411555   2    1000023    1

DECAY 2000001  40.829509
    0.98843573   2    1000021    1
    0.011545582   2    1000035    1
    1.2722319e-05   2    1000023    1
    4.8377852e-06   2    1000025    1
    1.1294525e-06   2    1000022    1

DECAY 1000004  145.04253
    0.66305294   2    1000021    4
    0.18794354   2    1000024    3
    0.088077834   2    1000022    4
    0.035335439   2    1000037    3
    0.023083419   2    1000025    4
    0.0020803797   2    1000035    4
    0.00042645215   2    1000023    4

DECAY 2000004  12.19392
    0.92135469   2    1000021    4
    0.078416299   2    1000035    4
    0.00015590746   2    1000023    4
    5.91726e-05   2    1000025    4
    1.3932731e-05   2    1000022    4

DECAY 1000003  145.04374
    0.66337206   2    1000021    3
    0.16681016   2   -1000024    4
    0.087699017   2    1000022    3
    0.056162487   2   -1000037    4
    0.02350796   2    1000025    3
    0.0021090212   2    1000035    3
    0.0003392945   2    1000023    3

DECAY 2000003  31.345248
    0.98450891   2    1000021    3
    0.015465634   2    1000035    3
    1.7330901e-05   2    1000023    3
    6.5890803e-06   2    1000025    3
    1.5397132e-06   2    1000022    3

DECAY 1000011  11.139076
    0.52085117   2   -1000024    12
    0.27650847   2    1000022    11
    0.14318087   2   -1000037    12
    0.058054188   2    1000025    11
    0.0014052965   2    1000023    11

DECAY 2000011  0.00070319299
    0.68246401   2    1000023    11
    0.22273803   2    1000025    11
    0.09479796   2    1000022    11

DECAY 1000013  11.139076
    0.52085118   2   -1000024    14
    0.27650846   2    1000022    13
    0.14318088   2   -1000037    14
    0.058054187   2    1000025    13
    0.0014052965   2    1000023    13

DECAY 2000013  0.00070319292
    0.68246401   2    1000023    13
    0.22273803   2    1000025    13
    0.094797963   2    1000022    13

DECAY 1000015  2.0312321
    0.34268897   2   -1000037    16
    0.24570703   2    1000023    15
    0.17274629   2    1000025    15
    0.15722307   2   -1000024    16
    0.081634638   2    1000022    15

DECAY 2000015  23.872869
    0.46563788   2   -1000024    16
    0.25688308   2    1000022    15
    0.15089275   2   -1000037    16
    0.087024167   2    1000025    15
    0.036497591   2    1000023    15
    0.0015375551   2    1000015    25
    0.0015269803   2    1000015    23

DECAY 1000012  11.226996
    0.58017231   2    1000024    11
    0.26968535   2    1000022    12
    0.088944757   2    1000037    11
    0.060503232   2    1000025    12
    0.0006943532   2    1000023    12

DECAY 1000014  11.226996
    0.5801723   2    1000024    13
    0.26968536   2    1000022    14
    0.088944756   2    1000037    13
    0.060503232   2    1000025    14
    0.00069435321   2    1000023    14

DECAY 1000016  23.930167
    0.54396501   2    1000024    15
    0.2439475   2    1000022    16
    0.14506389   2    1000037    15
    0.063364349   2    1000025    16
    0.0029569112   2   -1000015   -24
    0.00070235159   2    1000023    16

DECAY 1000024  7.3110591e-13
    0.70177936   2    1000022    211
    0.13913325   3    1000022   -11    12
    0.12474218   3    1000022   -13    14
    0.034202727   3    1000022    211    111
    7.1240195e-05   4    1000022    211    111    111
    7.1240195e-05   4    1000022    211    211   -211

DECAY 1000037  0.97442381
    0.46775698   2    1000022    24
    0.38726616   2    1000024    23
    0.14497687   2    1000024    25

DECAY 1000022 -1


DECAY 1000023  0.49253534
    0.38272667   2    1000024   -24
    0.38272667   2   -1000024    24
    0.23454666   2    1000022    23

DECAY 1000025  1.0846524
    0.43023222   2    1000024   -24
    0.43023222   2   -1000024    24
    0.13156803   2    1000022    25
    0.0079675346   2    1000022    23

DECAY 1000035  34.845329
    0.12370133   2    2000011   -11
    0.12370133   2   -2000011    11
    0.12370133   2    2000013   -13
    0.12370133   2   -2000013    13
    0.058684739   2    1000015   -15
    0.058684739   2   -1000015    15
    0.028364906   2    1000037   -24
    0.028364906   2   -1000037    24
    0.026878231   2    1000023    25
    0.020218586   2    1000012   -12
    0.020218586   2   -1000012    12
    0.020218586   2    1000014   -14
    0.020218586   2   -1000014    14
    0.020041823   2    1000011   -11
    0.020041823   2   -1000011    11
    0.020041823   2    1000013   -13
    0.020041823   2   -1000013    13
    0.019900284   2    1000025    23
    0.015733507   2    1000023    35
    0.013933691   2    1000037   -37
    0.013933691   2   -1000037    37
    0.011978735   2    1000025    36
    0.011904933   2    1000023    23
    0.0094860654   2    1000025    25
    0.0072282743   2    1000024   -24
    0.0072282743   2   -1000024    24
    0.0047642377   2    1000022    23
    0.0047549549   2    1000024   -37
    0.0047549549   2   -1000024    37
    0.0038655391   2    1000022    36
    0.0030427729   2    1000022    25
    0.003038688   2    1000023    36
    0.0020862413   2    1000025    35
    0.001123264   2    1000016   -16
    0.001123264   2   -1000016    16
    0.0011030778   2    1000022    35
    0.0010955317   2    2000015   -15
    0.0010955317   2   -2000015    15

DECAY 25  0.0039204153
    0.61005173   2    5   -5
    0.19275232   2    24   -24
    0.079527352   2    21    21
    0.067737842   2   -15    15
    0.023660197   2    23    23
    0.021982282   2    4   -4
    0.0023279743   2    22    22
    0.001458315   2    22    23
    0.00026226789   2    3   -3
    0.00023972162   2   -13    13

DECAY 35  15.794851
    0.45084354   2    5   -5
    0.12489104   2    1000024   -1000037
    0.12489104   2    1000037   -1000024
    0.086960535   2    1000022    1000023
    0.071295057   2   -15    15
    0.058052968   2    1000024   -1000024
    0.027929385   2    1000022    1000022
    0.023422635   2    1000023    1000025
    0.010882414   2    1000022    1000025
    0.0073765171   2    6   -6
    0.0073566541   2    1000037   -1000037
    0.0053699003   2    1000025    1000025
    0.00024893604   2   -13    13
    0.0001898242   2    3   -3
    0.0001507808   2    1000023    1000023
    7.743825e-05   2    25    25
    2.7240565e-05   2    21    21
    2.2382026e-05   2    24   -24
    1.1091701e-05   2    23    23
    5.2313354e-07   2    22    22
    8.0415383e-08   2    4   -4
    1.532085e-08   2    23    22

DECAY 36  15.722216
    0.45297869   2    5   -5
    0.11402189   2    1000024   -1000024
    0.078733282   2    1000024   -1000037
    0.078733282   2    1000037   -1000024
    0.071627786   2   -15    15
    0.05517869   2    1000022    1000022
    0.041748613   2    1000037   -1000037
    0.033314154   2    1000022    1000023
    0.031565207   2    1000022    1000025
    0.027971181   2    1000025    1000025
    0.0076310601   2    6   -6
    0.0055492527   2    1000023    1000025
    0.00039761036   2    1000023    1000023
    0.00025009576   2   -13    13
    0.00019073891   2    3   -3
    8.5047615e-05   2    21    21
    2.2360011e-05   2    23    25
    9.301497e-07   2    22    22
    7.8792218e-08   2    4   -4
    4.6834984e-08   2    23    22

DECAY 37  15.70339
    0.46091722   2    6   -5
    0.16271596   2    1000037    1000022
    0.1477919   2    1000024    1000025
    0.1325964   2    1000024    1000023
    0.071886352   2   -15    16
    0.022659744   2    1000037    1000023
    0.00077216136   2    4   -5
    0.00025099856   2   -13    14
    0.00018785881   2    4   -3
    0.00017644574   2    1000037    1000025
    2.2643977e-05   2    24    25
    9.5403695e-06   2    2   -3
    7.7215608e-06   2    2   -5
    5.0536519e-06   2    1000024    1000022
    1.7113259e-11   2    24    36

DECAY 5 -1


DECAY 15 -1


DECAY 23  2.4952


DECAY 24  2.085
