BLOCK SPINFO
   1   SPheno
   2   v4.0.5be

BLOCK SPHENOINFO
   1   2
   2   2

BLOCK MODSEL
   1   0

BLOCK MINPAR
   3    20.427134
   4   -1

BLOCK EXTPAR
   0    1655.1731
   1    44.078579
   2   -286.67391
   3    3000
   11   -3744.1403
   12   -605.67627
   13   -1562.0697
   23   -165.28473
   25    19.705636
   26    2560.3754
   31    1862.2219
   32    1862.2219
   33    1618.4382
   34    1104.4952
   35    1104.4952
   36    1491.4401
   41    5000
   42    5000
   43    1748.7423
   44    5000
   45    5000
   46    1636.0091
   47    5000
   48    5000
   49    1071.6134

BLOCK SMINPUTS
   1    127.90897
   2    1.1663787e-05
   3    0.1184
   4    91.1876
   5    4.18
   6    173.2
   7    1.777
   8    0
   11    0.00051099893
   12    0
   13    0.10565837
   14    0
   21    0.005
   22    0.0025
   23    0.095
   24    1.27

BLOCK GAUGE Q=  1655.1731
   1    0.35536298
   2    0.66519887
   3    1.219778

BLOCK YU Q=  1655.1731
   1   1    8.3951611e-06
   2   2    0.0042647418
   3   3    1.0142029

BLOCK YD Q=  1655.1731
   1   1    0.00033242964
   2   2    0.0063161631
   3   3    0.32966603

BLOCK YE Q=  1655.1731
   1   1    5.8011403e-05
   2   2    0.011994918
   3   3    0.20173479

BLOCK AU Q=  1655.1731
   1   1    0
   2   2    0
   3   3   -3744.1406

BLOCK AD Q=  1655.1731
   1   1    0
   2   2    0
   3   3   -605.67632

BLOCK AE Q=  1655.1731
   1   1    0
   2   2    0
   3   3   -1562.0698

BLOCK MSOFT Q=  1655.1731
   1    44.078579
   2   -286.67391
   3    3000
   21    6517043.5
   22    44632.497
   31    1862.2219
   32    1862.2219
   33    1618.4382
   34    1104.4952
   35    1104.4952
   36    1491.4401
   41    5000
   42    5000
   43    1748.7423
   44    5000
   45    5000
   46    1636.0091
   47    5000
   48    5000
   49    1071.6134

BLOCK MASS
   6    173.2
   23    91.1876
   24    80.429995
   15    1.777
   25    125.44513
   35    2559.859
   36    2560.3754
   37    2561.4376
   1000001    5036.3262
   2000001    5025.3907
   1000002    5035.8739
   2000002    5026.6271
   1000003    5036.3272
   2000003    5025.3919
   1000004    5035.8748
   2000004    5026.6277
   1000005    1095.3936
   2000005    1743.1956
   1000006    1490.7489
   2000006    1837.7327
   1000011    1865.9859
   2000011    1107.3169
   1000012    1863.928
   1000013    1865.9834
   2000013    1107.3108
   1000014    1863.9255
   1000015    1492.6613
   2000015    1621.0828
   1000016    1618.7736
   1000021    3201.0516
   1000022    42.292243
   1000023   -153.35062
   1000025    182.34864
   1000035   -335.86935
   1000024    154.01663
   1000037    336.46622

BLOCK ALPHA
      -0.049098724

BLOCK HMIX Q=  1655.1731
   1   -165.28473
   2    19.705636
   3    243.87515
   4    6555522

BLOCK STOPMIX
   1   1    0.53685665
   1   2    0.84367348
   2   1   -0.84367348
   2   2    0.53685665

BLOCK SBOTMIX
   1   1   -0.0032471365
   1   2    0.99999473
   2   1   -0.99999473
   2   2   -0.0032471365

BLOCK STAUMIX
   1   1   -0.0076950251
   1   2    0.99997039
   2   1   -0.99997039
   2   2   -0.0076950251

BLOCK NMIX
   1   1    0.96399759
   1   2    0.0097036549
   1   3   -0.26045361
   1   4   -0.052710466
   2   1   -0.14762762
   2   2   -0.34347584
   2   3   -0.68561271
   2   4    0.62463241
   3   1    0.21784049
   3   2   -0.11215187
   3   3    0.65799477
   3   4    0.71204661
   4   1   -0.038213174
   4   2    0.93239055
   4   3   -0.17071034
   4   4    0.31629984

BLOCK UMIX
   1   1   -0.2424793
   1   2   -0.97015658
   2   1   -0.97015658
   2   2    0.2424793

BLOCK VMIX
   1   1    0.45191593
   1   2    0.89206053
   2   1    0.89206053
   2   2   -0.45191593

BLOCK HIGGSBOUNDSINPUTHIGGSCOUPLINGSFERMIONS
       0, 388.31209,3,36,15,15

BLOCK HIGGSBOUNDSINPUTHIGGSCOUPLINGSBOSONS
       0,4,36,21,21,23

BLOCK SPHENOLOWENERGY
   1    0.00035489248
   2    1.586187e-06
   3    3.5220823e-05
   4    2.101427e-15
   5    8.9770676e-11
   6    1.8798748e-08
   7    7.0949258e-14
   8    3.0309534e-09
   9    6.4309739e-07
   10    9.642154e-05
   11    0.99599759
   12    0.54288548
   13    19.395722
   14    0
   15    0
   16    0.0021613689
   17    2.2816998e-15
   18    2.4788502e-11
   19    8.287101e-11
   20    2.7835003e-15
   21    1.1900317e-10
   22    4.1262947e-08
   23    0
   24    0
   25    0
   26    0
   27    0
   28    0
   29    0
   30    0
   31    0
   39    6.0495847e-05
   40    0
   41    0
   42    0

BLOCK FWCOEF Q=  160
   305   4422   0   0   -0.18881911
   305   4422   0   2   -0.22797757
   305   4322   0   2   -0.00036637332
   305   6421   0   0   -0.095227835
   305   6421   0   2   -0.12099707
   305   6321   0   2   -0.00028851493
   3051111   4133   0   0    1.5953443
   3051111   4133   0   2    1.596187
   3051111   4233   0   2    6.685791e-05
   3051111   4137   0   0   -4.4180364
   3051111   4137   0   2   -4.4131964
   3051111   4237   0   2   -0.00051685165
   3051313   4133   0   0    1.5953443
   3051313   4133   0   2    1.5961864
   3051313   4233   0   2    6.6857805e-05
   3051313   4137   0   0   -4.4180364
   3051313   4137   0   2   -4.413197
   3051313   4237   0   2   -0.00051685179
   3051212   4137   0   0    1.5053501
   3051212   4137   0   2    1.5043144
   3051212   4237   0   2    0.00011254112
   3051414   4137   0   0    1.5053501
   3051414   4137   0   2    1.5043144
   3051414   4237   0   2    0.00011254112
   3051616   4137   0   0    1.5053501
   3051616   4137   0   2    1.5043149
   3051616   4237   0   2    0.00011254298

BLOCK IMFWCOEF Q=  160
   305   4422   0   0    3.8580864e-07
   305   4422   0   2    8.9657732e-06
   305   4322   0   2   -3.6930839e-06
   305   6421   0   0    3.3047062e-07
   305   6421   0   2    9.397153e-06
   305   6321   0   2   -1.4751255e-06
   3051111   4133   0   2   -1.6066425e-06
   3051111   4233   0   2    1.4253863e-06
   3051111   4137   0   2    2.0900784e-05
   3051111   4237   0   2   -1.1024912e-05
   3051313   4133   0   2   -1.606648e-06
   3051313   4233   0   2    1.425385e-06
   3051313   4137   0   2    2.0900798e-05
   3051313   4237   0   2   -1.1024915e-05
   3051212   4137   0   2   -4.2130891e-06
   3051212   4237   0   2    2.4006545e-06
   3051414   4137   0   2   -4.2130887e-06
   3051414   4237   0   2    2.4006545e-06
   3051616   4137   0   2   -4.2045018e-06
   3051616   4237   0   2    2.4006492e-06

DECAY 23  2.4952


DECAY 24  2.085


DECAY 2000011  5.5286305
    0.93248697   2    1000022    11
    0.045201853   2    1000025    11
    0.021099573   2    1000023    11
    0.0012115882   2    1000035    11

DECAY 1000011  25.523895
    0.56698019   2   -1000037    12
    0.25056752   2    1000035    11
    0.088496403   2    1000022    11
    0.056624706   2    1000023    11
    0.03732555   2   -1000024    12

DECAY 2000013  5.534643
    0.93150762   2    1000022    13
    0.045386931   2    1000025    13
    0.021335359   2    1000023    13
    0.0012240051   2    1000035    13
    0.00051834596   2   -1000024    14

DECAY 1000013  25.529124
    0.56686322   2   -1000037    14
    0.25052149   2    1000035    13
    0.088492332   2    1000022    13
    0.056710096   2    1000023    13
    0.037317855   2   -1000024    14

DECAY 1000015  9.8308651
    0.7167113   2    1000022    15
    0.11468677   2   -1000024    16
    0.086107205   2    1000025    15
    0.073624056   2    1000023    15
    0.0052565982   2   -1000037    16
    0.0036140749   2    1000035    15

DECAY 2000015  23.052236
    0.53412302   2   -1000037    16
    0.23759634   2    1000035    15
    0.088697186   2    1000022    15
    0.080162307   2    1000023    15
    0.035077171   2   -1000024    16
    0.024336663   2    1000025    15

DECAY 1000012  25.577183
    0.47777496   2    1000037    11
    0.27259403   2    1000035    12
    0.12923318   2    1000024    11
    0.081809356   2    1000022    12
    0.022156091   2    1000023    12
    0.016432384   2    1000025    12

DECAY 1000014  25.582393
    0.47768853   2    1000037    13
    0.27253811   2    1000035    14
    0.12940021   2    1000024    13
    0.081792589   2    1000022    14
    0.02215155   2    1000023    14
    0.016429016   2    1000025    14

DECAY 1000016  23.113959
    0.45221765   2    1000037    15
    0.25627234   2    1000035    16
    0.17601329   2    1000024    15
    0.078594572   2    1000022    16
    0.021198137   2    1000023    16
    0.015692671   2    1000025    16

DECAY 2000001  142.88803
    0.98037071   2    1000021    1
    0.018244269   2    1000022    1
    0.00092936089   2    1000025    1
    0.00042716818   2    1000023    1

DECAY 1000001  207.87078
    0.6793687   2    1000021    1
    0.1989536   2   -1000037    2
    0.093231736   2    1000035    1
    0.012516711   2   -1000024    2
    0.010709036   2    1000023    1
    0.0027968687   2    1000022    1
    0.0024233554   2    1000025    1

DECAY 2000003  142.89609
    0.98031627   2    1000021    3
    0.018245132   2    1000022    3
    0.00094132736   2    1000025    3
    0.00044020337   2    1000023    3

DECAY 1000003  207.87668
    0.67934987   2    1000021    3
    0.19894977   2   -1000037    4
    0.093229657   2    1000035    3
    0.012523309   2   -1000024    4
    0.010717733   2    1000023    3
    0.0027980905   2    1000022    3
    0.0024315664   2    1000025    3

DECAY 1000005  5.0019764
    0.40717376   2   -1000024    6
    0.21719922   2    1000023    5
    0.19856322   2    1000025    5
    0.14590913   2    1000022    5
    0.020267657   2   -1000037    6
    0.010887016   2    1000035    5

DECAY 2000005  76.79849
    0.36552899   2   -1000024    6
    0.2665725   2   -1000037    6
    0.22318443   2    1000006   -24
    0.08307711   2    1000035    5
    0.03254122   2    1000023    5
    0.023071591   2    1000025    5
    0.0058837265   2    1000022    5

DECAY 2000002  151.43368
    0.92589602   2    1000021    2
    0.06887579   2    1000022    2
    0.0035084039   2    1000025    2
    0.0016125108   2    1000023    2
    0.00010727927   2    1000035    2

DECAY 1000002  207.86749
    0.67915296   2    1000021    2
    0.1681992   2    1000037    1
    0.090542494   2    1000035    2
    0.043473477   2    1000024    1
    0.01455244   2    1000023    2
    0.0035070546   2    1000022    2
    0.00057236533   2    1000025    2

DECAY 2000004  151.43731
    0.92587385   2    1000021    4
    0.06887417   2    1000022    4
    0.003514399   2    1000025    4
    0.0016171465   2    1000023    4
    0.00010846673   2    1000035    4

DECAY 1000004  207.87333
    0.67913407   2    1000021    4
    0.16819563   2    1000037    3
    0.090540802   2    1000035    4
    0.043490272   2    1000024    3
    0.014555453   2    1000023    4
    0.0035069806   2    1000022    4
    0.000576784   2    1000025    4

DECAY 1000006  56.33994
    0.23673628   2    1000037    5
    0.22052824   2    1000025    6
    0.2019147   2    1000024    5
    0.16644493   2    1000023    6
    0.12772281   2    1000035    6
    0.046394292   2    1000022    6
    0.00016180452   2    1000023    4

DECAY 2000006  88.678933
    0.25173154   2    1000024    5
    0.23993589   2    1000025    6
    0.2007853   2    1000023    6
    0.17526353   2    1000006    23
    0.050531759   2    1000006    25
    0.039273992   2    1000035    6
    0.026720727   2    1000037    5
    0.010712286   2    1000022    6
    0.0049509884   2    2000005    24

DECAY 1000024  0.038596743
    0.99999952   2    1000022    24

DECAY 1000037  2.1236674
    0.40420512   2    1000023    24
    0.23576528   2    1000024    23
    0.19260304   2    1000025    24
    0.13338815   2    1000024    25
    0.034015653   2    1000022    24

DECAY 1000022 -1


DECAY 1000023  0.040183658
    0.99994296   2    1000022    23

DECAY 1000025  0.049914287
    0.67141563   2    1000022    23
    0.32682591   2    1000022    25
    0.00020018456   3    1000023    12   -12
    0.00014965017   3    1000023    1   -1
    0.0001496323   3    1000023    3   -3
    0.00012748032   3    1000024    1   -2
    0.00012748032   3   -1000024   -1    2
    0.0001262609   3    1000024    3   -4
    0.0001262609   3   -1000024   -3    4
    0.00011899764   3    1000023    5   -5
    0.0001167185   3    1000023    2   -2
    0.00011386033   3    1000023    4   -4

DECAY 1000035  3.0395398
    0.29372479   2    1000024   -24
    0.29372479   2   -1000024    24
    0.22183619   2    1000025    23
    0.078309819   2    1000023    25
    0.070520418   2    1000025    25
    0.016797341   2    1000023    23
    0.015658786   2    1000022    23
    0.0093825381   2    1000022    25

DECAY 1000021  220.73072
    0.16731052   2    1000005   -5
    0.16731052   2   -1000005    5
    0.11496987   2    1000006   -6
    0.11496987   2   -1000006    6
    0.11002646   2    2000006   -6
    0.11002646   2   -2000006    6
    0.10620358   2    2000005   -5
    0.10620358   2   -2000005    5
    0.0013662686   2    1000006   -4
    0.0013662686   2   -1000006    4

DECAY 25  0.0041199793
    0.54088759   2   -5    5
    0.22540961   2   -24    24
    0.068529504   2    21    21
    0.062325767   2   -15    15
    0.044480847   2    1000022    1000022
    0.027527325   2    23    23
    0.026663976   2   -4    4
    0.0022754689   2    22    22
    0.0014798103   2    22    23
    0.0002161489   2   -13    13
    0.00020324329   2   -3    3
    5.6194665e-07   2   -1    1
    1.3740415e-07   2   -2    2
    4.8592619e-09   2   -11    11

DECAY 35  48.297036
    0.25801554   2   -5    5
    0.15734008   2   -1000024    1000037
    0.15734008   2   -1000037    1000024
    0.10122362   2    1000025    1000035
    0.087770331   2   -1000024    1000024
    0.066036138   2    1000023    1000035
    0.045631498   2   -15    15
    0.035707063   2    1000022    1000023
    0.017740681   2    1000022    1000025
    0.017528729   2   -1000037    1000037
    0.015386655   2    1000023    1000023
    0.011016518   2    1000025    1000025
    0.010246997   2    1000035    1000035
    0.0076236837   2    1000022    1000022
    0.0054677471   2    1000022    1000035
    0.0051561006   2   -6    6
    0.0004960355   2    1000023    1000025
    0.00015770569   2   -13    13
    9.6757381e-05   2   -3    3
    1.2254363e-05   2    25    25
    2.5684655e-06   2    23    23
    1.0537464e-06   2    21    21
    9.6074695e-07   2   -24    24
    2.6750778e-07   2   -1    1
    2.2046519e-07   2    22    23
    2.1047586e-07   2   -1000005    1000005
    1.6992467e-07   2   -1000011    1000011
    1.6949246e-07   2   -1000013    1000013
    9.2837795e-08   2    22    22
    6.6506668e-08   2   -4    4
    3.5421546e-09   2   -11    11
    3.4284664e-13   2   -2    2

DECAY 36  47.592146
    0.24930799   2   -5    5
    0.14930395   2   -1000024    1000037
    0.14930395   2   -1000037    1000024
    0.0996272   2   -1000024    1000024
    0.083190012   2    1000025    1000035
    0.08091557   2    1000023    1000035
    0.044091891   2   -15    15
    0.041403077   2    1000022    1000023
    0.028066929   2   -1000037    1000037
    0.018866937   2    1000023    1000023
    0.015779433   2    1000035    1000035
    0.014055488   2    1000022    1000025
    0.0092108141   2    1000025    1000025
    0.0074353418   2    1000022    1000022
    0.0050208978   2   -6    6
    0.0041179557   2    1000022    1000035
    0.00015238434   2   -13    13
    9.3490276e-05   2   -3    3
    3.9752896e-05   2    1000023    1000025
    1.2366127e-05   2    21    21
    3.8450336e-06   2    23    25
    2.5847504e-07   2   -1    1
    2.4902369e-07   2    22    23
    1.4399246e-07   2    22    22
    6.3553842e-08   2   -4    4
    3.4226287e-09   2   -11    11
    3.276483e-13   2   -2    2
    1.1677531e-40   2    25    25

DECAY 37  47.560414
    0.25355234   2   -5    6
    0.23480693   2    1000023    1000037
    0.18702719   2    1000024    1000035
    0.16911902   2    1000025    1000037
    0.08013116   2    1000022    1000024
    0.044941558   2   -15    16
    0.013523716   2    1000024    1000025
    0.009743086   2    1000022    1000037
    0.0064742033   2    1000023    1000024
    0.00036865247   2   -5    4
    0.0001588845   2   -13    14
    8.8234026e-05   2   -3    4
    4.6335926e-05   2    1000035    1000037
    7.4777687e-06   2   -3    6
    4.1220602e-06   2   -3    2
    3.8557189e-06   2    24    25
    2.6325588e-06   2   -5    2
    3.3700357e-07   2   -1    6
    2.4466272e-07   2   -1    2
    1.4493049e-08   2   -1    4
    3.7163249e-09   2   -11    12
    2.8054817e-13   2    24    35
    3.8713798e-14   2    24    36

DECAY 6  2.43
    1   2    5    24

DECAY 15 -1
