BLOCK SPINFO
   1   SPheno
   2   v4.0.5be

BLOCK SPHENOINFO
   1   2
   2   2

BLOCK MODSEL
   1   0

BLOCK MINPAR
   3    29.137202
   4    1

BLOCK EXTPAR
   0    3779.7464
   1    3469.3346
   2    3293.7998
   3    3315.0094
   11   -1829.0742
   12   -7675.4645
   13   -7377.0124
   23    128.37702
   25    28.018092
   26    2784.7892
   31    3383.5376
   32    3383.5376
   33    1460.4336
   34    1431.1474
   35    1431.1474
   36    1261.7693
   41    2016.8045
   42    2016.8045
   43    2709.0762
   44    4828.5486
   45    4828.5486
   46    4948.4206
   47    3796.0779
   48    3796.0779
   49    2602.0437

BLOCK SMINPUTS
   1    127.90897
   2    1.1663787e-05
   3    0.1184
   4    91.1876
   5    4.18
   6    173.2
   7    1.777
   8    0
   11    0.00051099893
   12    0
   13    0.10565837
   14    0
   21    0.005
   22    0.0025
   23    0.095
   24    1.27

BLOCK GAUGE Q=  3779.7464
   1    0.35536298
   2    0.66519887
   3    1.219778

BLOCK YU Q=  3779.7464
   1   1    8.3897107e-06
   2   2    0.004261973
   3   3    1.0135444

BLOCK YD Q=  3779.7464
   1   1    0.00047235203
   2   2    0.0089746885
   3   3    0.4684252

BLOCK YE Q=  3779.7464
   1   1    8.2428883e-05
   2   2    0.017043679
   3   3    0.28664664

BLOCK AU Q=  3779.7464
   1   1    0
   2   2    0
   3   3   -1829.0742

BLOCK AD Q=  3779.7464
   1   1    0
   2   2    0
   3   3   -7675.4653

BLOCK AE Q=  3779.7464
   1   1    0
   2   2    0
   3   3   -7377.0124

BLOCK MSOFT Q=  3779.7464
   1    3469.3346
   2    3293.7998
   3    3315.0094
   21    7900194
   22    144455.71
   31    3383.5376
   32    3383.5376
   33    1460.4336
   34    1431.1474
   35    1431.1474
   36    1261.7693
   41    2016.8045
   42    2016.8045
   43    2709.0762
   44    4828.5486
   45    4828.5486
   46    4948.4206
   47    3796.0779
   48    3796.0779
   49    2602.0437

BLOCK MASS
   6    173.2
   23    91.1876
   24    80.429995
   15    1.777
   25    120.27464
   35    2784.0492
   36    2784.7892
   37    2785.5691
   1000001    2236.3355
   2000001    3910.7014
   1000002    2234.8899
   2000002    4916.7805
   1000003    2236.3322
   2000003    3910.6973
   1000004    2234.8866
   2000004    4916.7798
   1000005    2735.369
   2000005    2862.087
   1000006    2863.6446
   2000006    4988.9162
   1000011    3413.0087
   2000011    1459.2164
   1000012    3411.6446
   1000013    3412.9968
   2000013    1459.1744
   1000014    3411.6327
   1000015    1258.596
   2000015    1493.9206
   1000016    1491.3381
   1000021    3510.2832
   1000022    141.56877
   1000023   -144.03409
   1000025    3256.158
   1000035    3424.6633
   1000024    142.88171
   1000037    3256.2375

BLOCK ALPHA
      -0.03440521

BLOCK HMIX Q=  3779.7464
   1    128.37702
   2    28.018092
   3    243.02755
   4    7755051.1

BLOCK STOPMIX
   1   1    0.99985929
   1   2    0.016774764
   2   1   -0.016774764
   2   2    0.99985929

BLOCK SBOTMIX
   1   1    0.035003141
   1   2    0.9993872
   2   1   -0.9993872
   2   2    0.035003141

BLOCK STAUMIX
   1   1    0.030147455
   1   2    0.99954546
   2   1   -0.99954546
   2   2    0.030147455

BLOCK NMIX
   1   1   -0.009756685
   1   2    0.018241517
   1   3   -0.71009236
   1   4    0.70380458
   2   1   -0.0084196565
   2   2    0.015822369
   2   3    0.7041055
   2   4    0.70986915
   3   1    0.0061550769
   3   2    0.99969133
   3   3    0.0018071959
   3   4   -0.024001773
   4   1   -0.99989801
   4   2    0.0058425772
   4   3    0.0010110476
   4   4   -0.012992712

BLOCK UMIX
   1   1   -0.0025662518
   1   2    0.99999671
   2   1    0.99999671
   2   2    0.0025662518

BLOCK VMIX
   1   1   -0.034073624
   1   2    0.99941932
   2   1    0.99941932
   2   2    0.034073624

BLOCK HIGGSBOUNDSINPUTHIGGSCOUPLINGSFERMIONS
       0, 785.01345,3,36,15,15

BLOCK HIGGSBOUNDSINPUTHIGGSCOUPLINGSBOSONS
       0,4,36,21,21,23

BLOCK SPHENOLOWENERGY
   1    0.00032234006
   2    1.5905792e-06
   3    3.5263931e-05
   4    2.6982081e-15
   5    1.1526426e-10
   6    2.4122555e-08
   7    9.0400335e-14
   8    3.8618956e-09
   9    8.1894098e-07
   10    9.6166851e-05
   11    0.99336676
   12    0.54189301
   13    19.358607
   14    0
   15    0
   16    0.0021569813
   17    2.2816555e-15
   18    2.480577e-11
   19    8.2921458e-11
   20    8.5955186e-16
   21    3.6747023e-11
   22    2.0070489e-08
   23    0
   24    0
   25    0
   26    0
   27    0
   28    0
   29    0
   30    0
   31    0
   39    6.4878905e-05
   40    0
   41    0
   42    0

BLOCK FWCOEF Q=  160
   305   4422   0   0   -0.18881911
   305   4422   0   2   -0.18971778
   305   4322   0   2   -1.752855e-06
   305   6421   0   0   -0.095227835
   305   6421   0   2   -0.10281962
   305   6321   0   2   -0.000139755
   3051111   4133   0   0    1.6246379
   3051111   4133   0   2    1.62508
   3051111   4233   0   2    0.00021877989
   3051111   4137   0   0   -4.44733
   3051111   4137   0   2   -4.4468388
   3051111   4237   0   2   -0.0016230885
   3051313   4133   0   0    1.6246379
   3051313   4133   0   2    1.6250798
   3051313   4233   0   2    0.00021877952
   3051313   4137   0   0   -4.44733
   3051313   4137   0   2   -4.446839
   3051313   4237   0   2   -0.0016230889
   3051212   4137   0   0    1.5053501
   3051212   4137   0   2    1.5052447
   3051212   4237   0   2    0.00035113527
   3051414   4137   0   0    1.5053501
   3051414   4137   0   2    1.5052447
   3051414   4237   0   2    0.00035113529
   3051616   4137   0   0    1.5053501
   3051616   4137   0   2    1.5052437
   3051616   4237   0   2    0.00035114213

BLOCK IMFWCOEF Q=  160
   305   4422   0   0    3.8582249e-07
   305   4422   0   2    1.683395e-05
   305   4322   0   2    2.6268988e-06
   305   6421   0   0    3.3048248e-07
   305   6421   0   2   -5.0180062e-06
   305   6321   0   2    9.4338453e-07
   3051111   4133   0   2    8.8269733e-07
   3051111   4233   0   2    4.3433631e-06
   3051111   4137   0   2   -4.2723262e-06
   3051111   4237   0   2   -3.2225582e-05
   3051313   4133   0   2    8.8269471e-07
   3051313   4233   0   2    4.3433586e-06
   3051313   4137   0   2   -4.2723274e-06
   3051313   4237   0   2   -3.2225591e-05
   3051212   4137   0   2    9.3963484e-07
   3051212   4237   0   2    6.9716078e-06
   3051414   4137   0   2    9.3963468e-07
   3051414   4237   0   2    6.9716078e-06
   3051616   4137   0   2    9.2169972e-07
   3051616   4237   0   2    6.9716097e-06

DECAY 23  2.4952


DECAY 24  2.085


DECAY 2000011  0.0011949604
    0.57322221   2    1000022    11
    0.42661588   2    1000023    11
    0.00016191399   2   -1000024    12

DECAY 1000011  0.36857686
    0.65671417   2   -1000037    12
    0.33064595   2    1000025    11
    0.0068960154   2    1000022    11
    0.005208915   2    1000023    11
    0.00053495522   2   -1000024    12

DECAY 2000013  0.017738064
    0.46632265   2   -1000024    14
    0.27382616   2    1000022    13
    0.25985119   2    1000023    13

DECAY 1000013  0.38818977
    0.62344388   2   -1000037    14
    0.31389483   2    1000025    13
    0.032078781   2    1000022    13
    0.030045312   2    1000023    13
    0.00050792534   2   -1000024    14

DECAY 1000015  4.0097238
    0.49967426   2   -1000024    16
    0.25317248   2    1000022    15
    0.24715325   2    1000023    15

DECAY 2000015  2.4398605
    0.49448529   2    1000022    15
    0.48876411   2    1000023    15
    0.0081033393   2    1000015    25
    0.0080720279   2    1000015    23
    0.00057523731   2   -1000024    16

DECAY 1000012  0.40521189
    0.58677664   2    1000037    11
    0.29191152   2    1000025    12
    0.085749646   2    1000024    11
    0.020314777   2    1000022    12
    0.015247423   2    1000023    12

DECAY 1000014  0.42480607
    0.55963004   2    1000037    13
    0.2784066   2    1000025    14
    0.12804158   2    1000024    13
    0.019377691   2    1000022    14
    0.014544085   2    1000023    14

DECAY 1000016  2.454661
    0.98103804   2    1000024    15
    0.016433655   2    1000015    24
    0.0014446062   2    1000022    16
    0.0010836997   2    1000023    16

DECAY 1000001  0.0069649715
    0.56031197   2    1000022    1
    0.42122483   2    1000023    1
    0.018463196   2   -1000024    2

DECAY 2000001  11.772286
    0.98988865   2    1000021    1
    0.010077031   2    1000035    1

DECAY 1000003  0.011309983
    0.50309249   2    1000022    3
    0.41475292   2    1000023    3
    0.082154593   2   -1000024    4

DECAY 2000003  11.784533
    0.98884138   2    1000021    3
    0.010066408   2    1000035    3
    0.00053033162   2   -1000024    4
    0.00028501418   2    1000022    3
    0.00027600881   2    1000023    3

DECAY 1000005  23.701529
    0.49886813   2   -1000024    6
    0.25325602   2    1000022    5
    0.24787585   2    1000023    5

DECAY 2000005  70.10094
    0.82248989   2   -1000024    6
    0.08929116   2    1000022    5
    0.088143874   2    1000023    5

DECAY 1000002  0.027324353
    0.82948202   2    1000024    1
    0.097275074   2    1000022    2
    0.073242905   2    1000023    2

DECAY 2000002  96.204703
    0.96973267   2    1000021    2
    0.030247043   2    1000035    2

DECAY 1000004  0.031666287
    0.82759557   2    1000024    3
    0.096463753   2    1000022    4
    0.075940675   2    1000023    4

DECAY 2000004  96.208118
    0.96969693   2    1000021    4
    0.03024594   2    1000035    4

DECAY 1000006  72.053794
    0.40431728   2    1000023    6
    0.39754359   2    1000022    6
    0.17380886   2    1000024    5
    0.024196441   3    1000022    24    5

DECAY 2000006  320.67061
    0.31675467   2    1000024    5
    0.30910658   2    1000021    6
    0.15950699   2    1000023    6
    0.15679098   2    1000022    6
    0.022307062   2    2000005    24
    0.014334617   2    1000006    25
    0.011138814   2    1000006    23
    0.0097119616   2    1000035    6
    0.00021280493   2    1000037    5
    0.00010451535   2    1000025    6

DECAY 1000024  3.0066252e-12
    0.60378103   3    1000022   -1    2
    0.20127414   3    1000022   -11    12
    0.19494483   3    1000022   -13    14

DECAY 1000037  101.09373
    0.11885568   2    1000004   -3
    0.11885505   2    1000002   -1
    0.1187188   2   -1000003    4
    0.11871829   2   -1000001    2
    0.088431907   2    1000016   -15
    0.088297023   2   -2000015    16
    0.07103416   2    1000024    25
    0.067937065   2    1000023    24
    0.067359256   2    1000024    23
    0.066780307   2    1000022    24
    0.021767114   2    1000006   -5
    0.019074208   2   -2000005    6
    0.00653216   3    1000024    6   -6
    0.0049605977   2    37    1000023
    0.0048248876   2    37    1000022
    0.0048068452   2    1000024    35
    0.0047885028   2    1000024    36
    0.0040712698   3    1000023   -5    6
    0.0040623403   3    1000022   -5    6

DECAY 1000022 -1


DECAY 1000023  1.6745669e-09
    0.86699333   2    1000022    22
    0.037481793   3    1000022    12   -12
    0.028026828   3    1000022    1   -1
    0.027548011   3    1000022    3   -3
    0.0218592   3    1000022    2   -2
    0.0063251638   3    1000022    11   -11
    0.0061558053   3    1000022    13   -13
    0.0016966429   3    1000024    1   -2
    0.0016966429   3   -1000024   -1    2
    0.00056560449   3    1000024    11   -12
    0.00056560449   3   -1000024   -11    12
    0.0005426857   3    1000024    13   -14
    0.0005426857   3   -1000024   -13    14

DECAY 1000025  101.67305
    0.067555542   2    1000024   -24
    0.067555542   2   -1000024    24
    0.059244442   2    1000004   -4
    0.059244442   2   -1000004    4
    0.059244196   2    1000002   -2
    0.059244196   2   -1000002    2
    0.058849361   2    1000003   -3
    0.058849361   2   -1000003    3
    0.058849044   2    1000001   -1
    0.058849044   2   -1000001    1
    0.044156889   2    2000015   -15
    0.044156889   2   -2000015    15
    0.043696946   2    1000016   -16
    0.043696946   2   -1000016    16
    0.040115431   2    1000022    25
    0.038511428   2    1000023    23
    0.0356121   2    1000023    25
    0.027992174   2    1000022    23
    0.010890285   2    2000005   -5
    0.010890285   2   -2000005    5
    0.0094057991   2    1000006   -6
    0.0094057991   2   -1000006    6
    0.0047779671   2    37   -1000024
    0.0047779671   2   -37    1000024
    0.004098832   3    1000024    5   -6
    0.004098832   3   -1000024   -5    6
    0.0034139628   2    1000023    35
    0.0032072978   3    1000023    6   -6
    0.0031770058   3    1000022    6   -6
    0.0030173603   2    1000022    35
    0.0017749877   2    1000022    36
    0.0014988433   2    1000023    36

DECAY 1000035  54.949089
    0.11702809   2    1000015   -15
    0.11702809   2   -1000015    15
    0.10486617   2    2000013   -13
    0.10486617   2   -2000013    13
    0.10486349   2    2000011   -11
    0.10486349   2   -2000011    11
    0.040163815   2    1000024   -24
    0.040163815   2   -1000024    24
    0.026266029   2    1000016   -16
    0.026266029   2   -1000016    16
    0.025177124   2    2000015   -15
    0.025177124   2   -2000015    15
    0.024419535   2    1000023    23
    0.022845761   2    1000022    25
    0.020279844   2    1000023    25
    0.017569575   2    1000022    23
    0.0068326883   2    1000005   -5
    0.0068326883   2   -1000005    5
    0.0045781995   2    1000003   -3
    0.0045781995   2   -1000003    3
    0.004578179   2    1000001   -1
    0.004578179   2   -1000001    1
    0.0042191363   2    37   -1000024
    0.0042191363   2   -37    1000024
    0.0040225991   2    1000004   -4
    0.0040225991   2   -1000004    4
    0.0040225739   2    1000002   -2
    0.0040225739   2   -1000002    2
    0.0029773493   2    1000023    35
    0.0026315452   2    1000022    35
    0.0021252353   3    1000024    5   -6
    0.0021252353   3   -1000024   -5    6
    0.001838344   2    1000022    36
    0.0017547327   3    1000023    6   -6
    0.0017375881   3    1000022    6   -6
    0.0015576338   2    1000023    36
    0.0012696588   2    2000005   -5
    0.0012696588   2   -2000005    5
    0.0011393841   2    1000006   -6
    0.0011393841   2   -1000006    6

DECAY 1000021  185.75723
    0.098897577   2    1000004   -4
    0.098897577   2   -1000004    4
    0.09889721   2    1000002   -2
    0.09889721   2   -1000002    2
    0.098723207   2    1000003   -3
    0.098723207   2   -1000003    3
    0.0987228   2    1000001   -1
    0.0987228   2   -1000001    1
    0.043128386   2    1000005   -5
    0.043128386   2   -1000005    5
    0.031442207   2    2000005   -5
    0.031442207   2   -2000005    5
    0.030058167   2    1000006   -6
    0.030058167   2   -1000006    6

DECAY 25  0.0033576979
    0.64218999   2   -5    5
    0.15654526   2   -24    24
    0.075004209   2    21    21
    0.073409878   2   -15    15
    0.031707222   2   -4    4
    0.017231542   2    23    23
    0.0023127528   2    22    22
    0.0011023938   2    22    23
    0.00025461347   2   -13    13
    0.00024130237   2   -3    3
    6.6717753e-07   2   -1    1
    1.6341073e-07   2   -2    2
    5.7240602e-09   2   -11    11

DECAY 35  38.150987
    0.6861288   2   -5    5
    0.12920248   2   -15    15
    0.089267787   2   -2000015    1000015
    0.089267787   2   -1000015    2000015
    0.0034519462   2   -6    6
    0.00097596466   2   -1000015    1000015
    0.0007004086   2   -1000024    1000024
    0.0004412561   2   -13    13
    0.00026173929   2   -3    3
    0.00015298152   2    1000022    1000022
    0.00013113759   2    1000023    1000023
    6.470129e-06   2    21    21
    6.1706733e-06   2    25    25
    2.727408e-06   2    1000022    1000023
    1.1489772e-06   2    23    23
    7.2362357e-07   2   -1    1
    3.8324073e-07   2   -24    24
    4.6412916e-08   2   -4    4
    1.5933909e-08   2    22    22
    1.1502356e-08   2    22    23
    9.910594e-09   2   -11    11
    2.3925763e-13   2   -2    2

DECAY 36  36.707892
    0.67938533   2   -5    5
    0.12793581   2   -15    15
    0.093797967   2   -2000015    1000015
    0.093797967   2   -1000015    2000015
    0.0033185335   2   -6    6
    0.00074178767   2   -1000024    1000024
    0.00043692622   2   -13    13
    0.00025916219   2   -3    3
    0.00018376673   2    1000022    1000022
    0.00011969619   2    1000023    1000023
    2.0108245e-05   2    21    21
    1.8487782e-06   2    23    25
    7.1649945e-07   2   -1    1
    2.4412342e-07   2    1000022    1000023
    5.0577873e-08   2    22    22
    4.3885362e-08   2   -4    4
    2.5927808e-08   2    22    23
    9.8133239e-09   2   -11    11
    2.2623278e-13   2   -2    2
    9.9921333e-39   2    25    25

DECAY 37  37.535528
    0.68428891   2   -5    6
    0.18789424   2   -1000015    1000016
    0.12599759   2   -15    16
    0.0010100497   2   -5    4
    0.00044544653   2   -13    14
    0.00024028835   2   -3    4
    6.107834e-05   2    1000023    1000024
    3.5897779e-05   2    1000022    1000024
    1.1242945e-05   2   -3    2
    7.2127976e-06   2   -5    2
    5.2933802e-06   2   -3    6
    1.8108478e-06   2    24    25
    6.6662227e-07   2   -1    2
    2.2649569e-07   2   -1    6
    3.3177592e-08   2   -1    4
    1.0419041e-08   2   -11    12
    2.940986e-13   2    24    35

DECAY 6  2.43
    1   2    5    24

DECAY 15 -1
