BLOCK DCINFO
   1   SDECAY/HDECAY
   2   1.3b /3.4

BLOCK SPINFO
   1   SOFTSUSY
   2   3.4.0

BLOCK MODSEL
   1   0

BLOCK SMINPUTS
   1    127.90897
   2    1.1663787e-05
   3    0.1184
   4    91.1876
   5    4.18
   6    173.2
   7    1.777

BLOCK MINPAR
   3    47.94

BLOCK EXTPAR
   0   -1
   1    3476.73
   2    2444.84
   3    2757.27
   11    3050.3
   12    841.22
   13    3891.59
   23   -244.04
   26    3957.16
   31    3201.1
   32    3201.1
   33    475.31
   34    2084.18
   35    2084.18
   36    3319.36
   41    3659.17
   42    3659.17
   43    2540.3
   44    3913.98
   45    3913.98
   46    2242.98
   47    2637.23
   48    2637.23
   49    1095.51

BLOCK MASS
   24    80.39656
   25    125.47827
   35    3957.1626
   36    3957.1604
   37    3958.3471
   5    4.8187603
   1000001    3724.9574
   2000001    2721.303
   1000002    3724.2503
   2000002    3968.6738
   1000003    3724.9574
   2000003    2721.303
   1000004    3724.2503
   2000004    3968.6738
   1000005    1193.4413
   2000005    2600.7337
   1000006    2264.8945
   2000006    2623.7591
   1000011    3216.6659
   2000011    2089.4019
   1000012    3215.3552
   1000013    3216.6659
   2000013    2089.4019
   1000014    3215.3552
   1000015    545.45467
   2000015    3316.4521
   1000016    539.45357
   1000021    2921.3508
   1000022    255.97418
   1000023   -258.71062
   1000025    2488.7702
   1000035    3450.8671
   1000024    257.57772
   1000037    2488.9459

BLOCK NMIX
   1   1   -0.0095798128
   1   2    0.024304266
   1   3    0.70892849
   1   4    0.70479637
   2   1   -0.0086364204
   2   2    0.020810483
   2   3   -0.70527539
   2   4    0.7085753
   3   1    0.0015497476
   3   2    0.99948734
   3   3   -0.0025533736
   3   4   -0.031877009
   4   1    0.99991562
   4   2   -0.0011364906
   4   3    0.00070436399
   4   4    0.012921863

BLOCK UMIX
   1   1    0.0036184285
   1   2    0.99999345
   2   1   -0.99999345
   2   2    0.0036184285

BLOCK VMIX
   1   1    0.045139118
   1   2   -0.99898071
   2   1   -0.99898071
   2   2   -0.045139118

BLOCK STOPMIX
   1   1   -0.24322311
   1   2    0.96997037
   2   1   -0.96997037
   2   2   -0.24322311

BLOCK SBOTMIX
   1   1   -0.0056988576
   1   2    0.99998376
   2   1   -0.99998376
   2   2   -0.0056988576

BLOCK STAUMIX
   1   1    0.99999705
   1   2   -0.0024289898
   2   1    0.0024289898
   2   2    0.99999705

BLOCK ALPHA
      -0.021136698

BLOCK HMIX Q=  2387.442
   1   -250.73195
   2    47.369703
   3    243.20169
   4    15573949

BLOCK GAUGE Q=  2387.442
   1    0.36439474
   2    0.63729426
   3    1.0152165

BLOCK AU Q=  2387.442
   1   1    0
   2   2    0
   3   3    3050.3

BLOCK AD Q=  2387.442
   1   1    0
   2   2    0
   3   3    841.22001

BLOCK AE Q=  2387.442
   1   1    0
   2   2    0
   3   3    3891.59

BLOCK YU Q=  2387.442
   1   1    0
   2   2    0
   3   3    0.83939859

BLOCK YD Q=  2387.442
   1   1    0
   2   2    0
   3   3    0.67084016

BLOCK YE Q=  2387.442
   1   1    0
   2   2    0
   3   3    0.45806358

BLOCK MSOFT Q=  2387.442
   1    3476.73
   2    2444.84
   3    2757.27
   21    15794612
   22    49313.047
   31    3201.1
   32    3201.1
   33    475.31
   34    2084.18
   35    2084.18
   36    3319.36
   41    3659.17
   42    3659.17
   43    2540.3
   44    3913.98
   45    3913.98
   46    2242.98
   47    2637.23
   48    2637.23
   49    1095.51

BLOCK HIGGSBOUNDSINPUTHIGGSCOUPLINGSFERMIONS
       0, 2243.8888,3,36,15,15

BLOCK HIGGSBOUNDSINPUTHIGGSCOUPLINGSBOSONS
       0,4,36,21,21,23

DECAY 6  1.4300833
    1   2    5    24

DECAY 1000021  55.310077
    0.357733   2    1000005   -5
    0.357733   2   -1000005    5
    0.090952302   2    1000006   -6
    0.090952302   2   -1000006    6
    0.022775254   2    2000005   -5
    0.022775254   2   -2000005    5
    0.012123453   2    2000006   -6
    0.012123453   2   -2000006    6
    0.0082079962   2    2000001   -1
    0.0082079962   2   -2000001    1
    0.0082079962   2    2000003   -3
    0.0082079962   2   -2000003    3

DECAY 1000006  59.93475
    0.49567344   2    1000024    5
    0.2527281   2    1000022    6
    0.25151154   2    1000023    6
    8.6927792e-05   2    1000005    24

DECAY 2000006  70.366588
    0.34724267   2    1000024    5
    0.2591414   2    1000023    6
    0.25355928   2    1000022    6
    0.068923814   2    1000006    23
    0.065951191   2    1000006    25
    0.0027492016   2    1000037    5
    0.0024324361   2    1000005    24

DECAY 1000005  18.973202
    0.48799312   2   -1000024    6
    0.2576742   2    1000022    5
    0.25433269   2    1000023    5

DECAY 2000005  66.844398
    0.52883465   2   -1000024    6
    0.17174271   2    1000022    5
    0.16998255   2    1000023    5
    0.12552673   2    1000006   -24
    0.0014552874   2    1000005    25
    0.0013456297   2    1000005    23
    0.0011124513   2    1000025    5

DECAY 1000002  52.515997
    0.74364668   2    1000021    2
    0.169767   2    1000037    1
    0.085038953   2    1000025    2
    0.0011020466   2    1000024    1
    0.00020934609   2    1000035    2
    0.00013666026   2    1000022    2
    9.9316581e-05   2    1000023    2

DECAY 2000002  59.581048
    0.99070064   2    1000021    2
    0.009274597   2    1000035    2
    1.3589828e-05   2    1000022    2
    1.1043236e-05   2    1000023    2
    1.3391097e-07   2    1000025    2

DECAY 1000001  52.541648
    0.7443279   2    1000021    1
    0.17016402   2   -1000037    2
    0.084964752   2    1000025    1
    0.00021530474   2    1000035    1
    0.00018461559   2    1000022    1
    0.00013632949   2    1000023    1
    7.0795859e-06   2   -1000024    2

DECAY 2000001  0.098666414
    0.64411989   3    1    5   -1000005
    0.338636   3    1   -5    1000005
    0.0058878191   3    1    6   -1000006
    0.0049028842   3    1   -6    1000006
    0.0014203403   2    1000022    1
    0.0011539495   2    1000023    1
    0.00096848559   3    1    24   -1000024
    0.0006114644   3    1   -15    1000015
    0.00060028532   3    1   -16    1000016
    0.00033884884   3    1    23    1000023
    0.00031197039   3    1    25    1000022
    0.00022646004   3    1    23    1000022
    0.00021296001   3    1    25    1000023
    0.00020101065   3    1   -24    1000024
    0.00015833149   3    1    15   -1000015
    0.00014856119   3    1    16   -1000016
    2.4059859e-05   3    1   -5    2000005
    1.9953092e-05   3    1    5   -2000005
    1.8994305e-05   3    1    11   -2000011
    1.8958832e-05   3    1    13   -2000013
    9.424889e-06   3    1   -13    2000013
    9.340159e-06   3    1   -11    2000011
    2.1689245e-09   3    1   -24    1000037
    2.164769e-09   3    1    24   -1000037
    1.2376045e-09   3    1    25    1000025
    1.1175029e-11   3    1    23    1000025

DECAY 1000004  44.022811
    0.68456024   2    1000021    4
    0.2088854   2    1000037    3
    0.10463419   2    1000025    4
    0.001379471   2    1000024    3
    0.00024531976   2    1000035    4
    0.00017106417   2    1000022    4
    0.00012431718   2    1000023    4

DECAY 2000004  46.105281
    0.98794248   2    1000021    4
    0.012024001   2    1000035    4
    1.8395415e-05   2    1000022    4
    1.4948069e-05   2    1000023    4
    1.7870832e-07   2    1000025    4

DECAY 1000003  44.034196
    0.68534648   2    1000021    3
    0.20942288   2   -1000037    4
    0.10456756   2    1000025    3
    0.0002523887   2    1000035    3
    0.00023114422   2    1000022    3
    0.00017068566   2    1000023    3
    8.863762e-06   2   -1000024    4

DECAY 2000003  0.09863823
    0.64393897   3    3    5   -1000005
    0.3387429   3    3   -5    1000005
    0.0058869669   3    3    6   -1000006
    0.0049046906   3    3   -6    1000006
    0.0014601187   2    1000022    3
    0.0011862466   2    1000023    3
    0.00096870148   3    3    24   -1000024
    0.00061163912   3    3   -15    1000015
    0.00060045684   3    3   -16    1000016
    0.00033894566   3    3    23    1000023
    0.00031205953   3    3    25    1000022
    0.00022652475   3    3    23    1000022
    0.00021302085   3    3    25    1000023
    0.00020106808   3    3   -24    1000024
    0.00015837673   3    3    15   -1000015
    0.00014860364   3    3    16   -1000016
    2.4018071e-05   3    3   -5    2000005
    1.9958793e-05   3    3    5   -2000005
    1.8999733e-05   3    3    11   -2000011
    1.8964249e-05   3    3    13   -2000013
    9.4275819e-06   3    3   -13    2000013
    9.3428278e-06   3    3   -11    2000011
    2.1678207e-09   3    3   -24    1000037
    2.1656917e-09   3    3    24   -1000037
    1.2508335e-09   3    3    25    1000025
    1.1180249e-11   3    3    23    1000025

DECAY 1000011  6.2884394
    0.66554412   2   -1000037    12
    0.33316533   2    1000025    11
    0.00072322406   2    1000022    11
    0.00051390979   2    1000023    11
    5.342269e-05   2   -1000024    12

DECAY 2000011  0.0027611641
    0.35596949   2    1000022    11
    0.28912241   2    1000023    11
    0.1068064   3    11    24   -1000024
    0.051873048   3    11   -16    1000016
    0.051101635   3    11   -15    1000015
    0.033503622   3    11    23    1000023
    0.032138618   3    11    25    1000022
    0.021901994   3    11    23    1000022
    0.021297177   3    11    25    1000023
    0.011908021   3    11   -24    1000024
    0.0077217431   3    11    15   -1000015
    0.0075232761   3    11    16   -1000016
    0.0074298372   3    11    5   -1000005
    0.0017027239   3    11   -5    1000005

DECAY 1000013  6.2884394
    0.66554412   2   -1000037    14
    0.33316532   2    1000025    13
    0.00072322406   2    1000022    13
    0.00051390979   2    1000023    13
    5.342269e-05   2   -1000024    14

DECAY 2000013  0.0027574913
    0.35644362   2    1000022    13
    0.2895075   2    1000023    13
    0.10694866   3    13    24   -1000024
    0.051361903   3    13   -16    1000016
    0.050393631   3    13   -15    1000015
    0.033548247   3    13    23    1000023
    0.032181425   3    13    25    1000022
    0.021931166   3    13    23    1000022
    0.021325543   3    13    25    1000023
    0.011923882   3    13   -24    1000024
    0.007732028   3    13    15   -1000015
    0.0075332966   3    13    16   -1000016
    0.0074397333   3    13    5   -1000005
    0.0017293618   3    13   -5    1000005

DECAY 1000015  1.3772152
    0.505758   2    1000022    15
    0.49418641   2    1000023    15
    5.5594814e-05   2   -1000024    16

DECAY 2000015  27.612498
    0.49530823   2   -1000024    16
    0.24898808   2    1000022    15
    0.24644755   2    1000023    15
    0.0044864866   2    1000016   -24
    0.0024540302   2    1000015    25
    0.002308317   2    1000015    23
    4.6836472e-06   2   -1000037    16
    2.6303718e-06   2    1000025    15

DECAY 1000012  6.3187903
    0.65913022   2    1000037    11
    0.32945379   2    1000025    12
    0.008270262   2    1000024    11
    0.0018003466   2    1000022    12
    0.0013453728   2    1000023    12

DECAY 1000014  6.3187902
    0.65913022   2    1000037    13
    0.3294538   2    1000025    14
    0.0082702621   2    1000024    13
    0.0018003466   2    1000022    14
    0.0013453728   2    1000023    14

DECAY 1000016  1.350034
    0.99850577   2    1000024    15
    0.00085964881   2    1000022    16
    0.00063457709   2    1000023    16

DECAY 1000024  6.9725008e-12
    0.59999991   3    1000022    2   -1
    0.20000004   3    1000022   -11    12
    0.20000004   3    1000022   -13    14

DECAY 1000037  37.730267
    0.24156489   2    1000016   -15
    0.24151337   2   -1000015    16
    0.13112687   2    1000024    25
    0.13048867   2    1000024    23
    0.12725495   2    1000023    24
    0.12591349   2    1000022    24
    0.0021361285   2    1000006   -5
    1.6326962e-06   2   -1000005    6

DECAY 1000022 -1


DECAY 1000023  1.4262046e-10
    0.23391728   2    1000022    22
    0.16249427   3    1000022   -1    1
    0.16249427   3    1000022   -3    3
    0.12517025   3    1000022   -2    2
    0.074667174   3    1000022   -16    16
    0.074664051   3    1000022   -12    12
    0.074664051   3    1000022   -14    14
    0.037339772   3    1000022   -11    11
    0.037339772   3    1000022   -13    13
    0.0051747361   3    1000024   -2    1
    0.0051747361   3   -1000024   -1    2
    0.0017249126   3    1000024   -12    11
    0.0017249126   3   -1000024    12   -11
    0.0017249126   3    1000024   -14    13
    0.0017249126   3   -1000024    14   -13

DECAY 1000025  37.690929
    0.12719917   2    1000024   -24
    0.12719917   2   -1000024    24
    0.1209661   2    1000015   -15
    0.1209661   2   -1000015    15
    0.1208047   2    1000016   -16
    0.1208047   2   -1000016    16
    0.075835586   2    1000023    23
    0.075564327   2    1000022    25
    0.054826066   2    1000023    25
    0.054534879   2    1000022    23
    0.00064859154   2    1000006   -6
    0.00064859154   2   -1000006    6
    9.4222512e-07   2    1000005   -5
    9.4222512e-07   2   -1000005    5
    3.6503653e-08   2    2000011   -11
    3.6503653e-08   2   -2000011    11
    3.6503653e-08   2    2000013   -13
    3.6503653e-08   2   -2000013    13

DECAY 1000035  46.970119
    0.08051192   2    1000006   -6
    0.08051192   2   -1000006    6
    0.077851943   2    2000011   -11
    0.077851943   2   -2000011    11
    0.077851943   2    2000013   -13
    0.077851943   2   -2000013    13
    0.050131904   2    1000005   -5
    0.050131904   2   -1000005    5
    0.046353543   2    1000016   -16
    0.046353543   2   -1000016    16
    0.04593587   2    1000015   -15
    0.04593587   2   -1000015    15
    0.044432479   2    1000024   -24
    0.044432479   2   -1000024    24
    0.026464581   2    1000022    25
    0.025829984   2    1000023    23
    0.021584825   2    1000023    25
    0.02056068   2    1000022    23
    0.0090637078   2    2000001   -1
    0.0090637078   2   -2000001    1
    0.0090637078   2    2000003   -3
    0.0090637078   2   -2000003    3
    0.0037157649   2    2000006   -6
    0.0037157649   2   -2000006    6
    0.003055745   2    2000005   -5
    0.003055745   2   -2000005    5
    0.0011320844   2    2000015   -15
    0.0011320844   2   -2000015    15
    0.00084653507   2    1000012   -12
    0.00084653507   2   -1000012    12
    0.00084653507   2    1000014   -14
    0.00084653507   2   -1000014    14
    0.00083083511   2    1000011   -11
    0.00083083511   2   -1000011    11
    0.00083083511   2    1000013   -13
    0.00083083511   2   -1000013    13
    0.00022078537   2    1000037   -24
    0.00022078537   2   -1000037    24
    0.00020234669   2    1000025    25
    5.3098698e-06   2    1000025    23

DECAY 25  0.0039456794
    0.57314517   2    5   -5
    0.2241306   2    24   -24
    0.081876698   2    21    21
    0.066018575   2   -15    15
    0.028217589   2    23    23
    0.022048393   2    4   -4
    0.0024221458   2    22    22
    0.0016522767   2    22    23
    0.00025488711   2    3   -3
    0.00023366038   2   -13    13

DECAY 35  151.45911
    0.71812695   2    5   -5
    0.13143064   2   -15    15
    0.03924084   2    1000024   -1000037
    0.03924084   2    1000037   -1000024
    0.021364894   2    1000023    1000025
    0.017859665   2    1000022    1000025
    0.0091225052   2    1000015   -2000015
    0.0091225052   2    2000015   -1000015
    0.0055952347   2    1000005   -2000005
    0.0055952347   2    2000005   -1000005
    0.0010913761   2    1000023    1000035
    0.00045620277   2    6   -6
    0.00044151832   2    1000024   -1000024
    0.00043891996   2   -13    13
    0.00042236654   2    1000022    1000035
    0.00027551556   2    3   -3
    9.8042884e-05   2    1000022    1000022
    6.6549055e-05   2    1000023    1000023
    7.5720869e-06   2    21    21
    1.16012e-06   2    1000015   -1000015
    4.2726187e-07   2    25    25
    3.9967074e-07   2    1000022    1000023
    3.9517342e-07   2    1000005   -1000005
    1.1302036e-07   2    24   -24
    6.4960451e-08   2    1000016   -1000016
    5.6416107e-08   2    23    23
    4.748721e-09   2    23    22
    4.6209594e-09   2    4   -4
    4.2562909e-09   2    22    22

DECAY 36  151.46176
    0.71812321   2    5   -5
    0.13142852   2   -15    15
    0.039237956   2    1000024   -1000037
    0.039237956   2    1000037   -1000024
    0.021571858   2    1000022    1000025
    0.017650453   2    1000023    1000025
    0.0091225117   2    1000015   -2000015
    0.0091225117   2   -1000015    2000015
    0.005595823   2    1000005   -2000005
    0.005595823   2   -1000005    2000005
    0.0011035975   2    1000022    1000035
    0.00045712813   2    6   -6
    0.00044609355   2    1000024   -1000024
    0.00043891257   2   -13    13
    0.00041229599   2    1000023    1000035
    0.00027551954   2    3   -3
    9.1674813e-05   2    1000022    1000022
    7.3705507e-05   2    1000023    1000023
    1.2959027e-05   2    21    21
    1.3577627e-06   2    1000022    1000023
    1.1467387e-07   2    23    25
    1.0058365e-08   2    23    22
    4.6509382e-09   2    4   -4
    1.8932555e-09   2    22    22

DECAY 37  160.1627
    0.71490622   2    6   -5
    0.12432586   2   -15    16
    0.037435733   2    1000037    1000022
    0.037256482   2    1000024    1000025
    0.0370186   2    1000037    1000023
    0.027734692   2    2000006   -1000005
    0.017844483   2   -2000015    1000016
    0.0014270264   2    1000024    1000035
    0.0012018978   2    4   -5
    0.00041519283   2   -13    14
    0.00025673607   2    4   -3
    8.5721014e-05   2    1000006   -1000005
    4.0392392e-05   2    1000024    1000023
    2.4957047e-05   2    1000024    1000022
    1.3043304e-05   2    2   -3
    1.2018969e-05   2    2   -5
    8.3852056e-07   2   -1000015    1000016
    1.0858065e-07   2    24    25
    1.9332801e-14   2    24    36

DECAY 5 -1


DECAY 15 -1


DECAY 23  2.4952


DECAY 24  2.085
