BLOCK SPINFO
   1   SPheno
   2   v4.0.5be

BLOCK SPHENOINFO
   1   2
   2   2

BLOCK MODSEL
   1   0

BLOCK MINPAR
   3    27.45135
   4    1

BLOCK EXTPAR
   0    1488.0903
   1    191.15579
   2    1255.6134
   3    3000
   11   -2420.9631
   12    108.00867
   13    14.081044
   23    960.35088
   25    26.57658
   26    403.39101
   31    604.86103
   32    604.86103
   33    1364.6295
   34    1421.1054
   35    1421.1054
   36    595.23305
   41    5000
   42    5000
   43    1671.8471
   44    5000
   45    5000
   46    1367.2576
   47    5000
   48    5000
   49    1087.8075

BLOCK SMINPUTS
   1    127.90897
   2    1.1663787e-05
   3    0.1184
   4    91.1876
   5    4.18
   6    173.2
   7    1.777
   8    0
   11    0.00051099893
   12    0
   13    0.10565837
   14    0
   21    0.005
   22    0.0025
   23    0.095
   24    1.27

BLOCK GAUGE Q=  1488.0903
   1    0.35536298
   2    0.66519887
   3    1.219778

BLOCK YU Q=  1488.0903
   1   1    8.3903053e-06
   2   2    0.0042622751
   3   3    1.0136163

BLOCK YD Q=  1488.0903
   1   1    0.0004480816
   2   2    0.0085135504
   3   3    0.44435654

BLOCK YE Q=  1488.0903
   1   1    7.8193516e-05
   2   2    0.016167939
   3   3    0.27191814

BLOCK AU Q=  1488.0903
   1   1    0
   2   2    0
   3   3   -2420.963

BLOCK AD Q=  1488.0903
   1   1    0
   2   2    0
   3   3    108.00868

BLOCK AE Q=  1488.0903
   1   1    0
   2   2    0
   3   3    14.081044

BLOCK MSOFT Q=  1488.0903
   1    191.15579
   2    1255.6134
   3    3000
   21   -769381.07
   22   -902961.95
   31    604.86103
   32    604.86103
   33    1364.6295
   34    1421.1054
   35    1421.1054
   36    595.23305
   41    5000
   42    5000
   43    1671.8471
   44    5000
   45    5000
   46    1367.2576
   47    5000
   48    5000
   49    1087.8075

BLOCK MASS
   6    173.2
   23    91.1876
   24    80.429995
   15    1.777
   25    121.14366
   35    403.40553
   36    403.39101
   37    412.55537
   1000001    5026.3756
   2000001    5017.3874
   1000002    5025.9318
   2000002    5018.9272
   1000003    5026.3787
   2000003    5017.3889
   1000004    5025.9336
   2000004    5018.928
   1000005    1073.7302
   2000005    1668.4463
   1000006    1298.5112
   2000006    1705.3474
   1000011    624.70012
   2000011    1422.7799
   1000012    619.2845
   1000013    624.69499
   2000013    1422.775
   1000014    619.28481
   1000015    595.24175
   2000015    1375.2877
   1000016    1372.1063
   1000021    3186.7542
   1000022    190.07649
   1000023    956.24323
   1000025   -967.64865
   1000035    1297.7775
   1000024    956.77572
   1000037    1297.9244

BLOCK ALPHA
      -0.04123055

BLOCK HMIX Q=  1488.0903
   1    960.35088
   2    26.57658
   3    244.0297
   4    162724.31

BLOCK STOPMIX
   1   1    0.30426858
   1   2    0.95258628
   2   1   -0.95258628
   2   2    0.30426858

BLOCK SBOTMIX
   1   1    0.033562136
   1   2    0.99943663
   2   1   -0.99943663
   2   2    0.033562136

BLOCK STAUMIX
   1   1    0.029816648
   1   2    0.99955538
   2   1   -0.99955538
   2   2    0.029816648

BLOCK NMIX
   1   1    0.99874454
   1   2   -0.00098768118
   1   3    0.04873121
   1   4   -0.011560059
   2   1    0.042290644
   2   2    0.17239454
   2   3   -0.69889295
   2   4    0.69284939
   3   1   -0.026222246
   3   2    0.023915287
   3   3    0.70575768
   3   4    0.70756382
   4   1    0.0057651148
   4   2   -0.98473712
   4   3   -0.10526166
   4   4    0.13849022

BLOCK UMIX
   1   1   -0.14921442
   1   2    0.98880486
   2   1    0.98880486
   2   2    0.14921442

BLOCK VMIX
   1   1   -0.19634291
   1   2    0.98053529
   2   1    0.98053529
   2   2    0.19634291

BLOCK HIGGSBOUNDSINPUTHIGGSCOUPLINGSFERMIONS
       0, 706.31463,3,36,15,15

BLOCK HIGGSBOUNDSINPUTHIGGSCOUPLINGSBOSONS
       0,4,36,21,21,23

BLOCK SPHENOLOWENERGY
   1    0.00039507281
   2    1.5885181e-06
   3    3.5264068e-05
   4    3.1117036e-15
   5    1.3292426e-10
   6    2.7577809e-08
   7    1.0423368e-13
   8    4.4527282e-09
   9    9.365651e-07
   10    7.7707945e-05
   11    0.80269332
   12    0.54250024
   13    19.318898
   14    0
   15    0
   16    0.0021596573
   17    2.2817103e-15
   18    2.4799406e-11
   19    8.2905757e-11
   20    7.0179934e-15
   21    3.0003924e-10
   22    5.3924126e-08
   23    0
   24    0
   25    0
   26    0
   27    0
   28    0
   29    0
   30    0
   31    0
   39    7.8197984e-05
   40    0
   41    0
   42    0

BLOCK FWCOEF Q=  160
   305   4422   0   0   -0.18881911
   305   4422   0   2   -0.25884825
   305   4322   0   2   -0.0017964247
   305   6421   0   0   -0.095227835
   305   6421   0   2   -0.18611609
   305   6321   0   2   -0.001999646
   3051111   4133   0   0    1.5916884
   3051111   4133   0   2    1.5930177
   3051111   4233   0   2   -0.0001687729
   3051111   4137   0   0   -4.4143805
   3051111   4137   0   2   -4.41375
   3051111   4237   0   2    0.0013186501
   3051313   4133   0   0    1.5916884
   3051313   4133   0   2    1.593015
   3051313   4233   0   2   -0.00016882515
   3051313   4137   0   0   -4.4143805
   3051313   4137   0   2   -4.4137526
   3051313   4237   0   2    0.0013187017
   3051212   4137   0   0    1.5053501
   3051212   4137   0   2    1.5052216
   3051212   4237   0   2   -0.00028741606
   3051414   4137   0   0    1.5053501
   3051414   4137   0   2    1.5052216
   3051414   4237   0   2   -0.00028740469
   3051616   4137   0   0    1.5053501
   3051616   4137   0   2    1.5052221
   3051616   4237   0   2   -0.00028419962

BLOCK IMFWCOEF Q=  160
   305   4422   0   0    3.8586921e-07
   305   4422   0   2    1.5055734e-05
   305   4322   0   2    4.0858545e-06
   305   6421   0   0    3.305225e-07
   305   6421   0   2   -2.3101713e-06
   305   6321   0   2    1.5588073e-06
   3051111   4133   0   2   -1.2353973e-07
   3051111   4233   0   2    1.9451723e-06
   3051111   4137   0   2    7.2113263e-07
   3051111   4237   0   2   -1.513621e-05
   3051313   4133   0   2   -1.2356698e-07
   3051313   4233   0   2    1.9451697e-06
   3051313   4137   0   2    7.2110651e-07
   3051313   4237   0   2   -1.513622e-05
   3051212   4137   0   2   -1.8222615e-08
   3051212   4237   0   2    3.2987295e-06
   3051414   4137   0   2   -1.8222825e-08
   3051414   4237   0   2    3.2987295e-06
   3051616   4137   0   2   -9.8957222e-09
   3051616   4237   0   2    3.2987528e-06

DECAY 23  2.4952


DECAY 24  2.085


DECAY 1000011  0.6421448
    0.99999999   2    1000022    11

DECAY 2000011  6.8840083
    0.9992344   2    1000022    11
    0.00055835488   2    1000023    11
    0.0002062634   2    1000025    11

DECAY 1000013  0.64214414
    0.99999999   2    1000022    13

DECAY 2000013  6.8896761
    0.99841108   2    1000022    13
    0.0007156842   2    1000023    13
    0.00036066415   2    1000025    13
    0.00031507477   2   -1000024    14
    0.00019451985   2    1000013    25

DECAY 1000015  2.4077594
    1   2    1000022    15

DECAY 2000015  3.3118952
    0.49992976   2    1000022    15
    0.12438278   2    1000015    23
    0.11841561   2    1000015    25
    0.096125544   2    1000023    15
    0.078082089   2    1000025    15
    0.042849315   2   -1000037    16
    0.021328672   2    1000035    15
    0.018294603   2   -1000024    16
    0.00031480005   2    1000015    35
    0.00027683753   2    1000015    36

DECAY 1000012  0.63901239
    1   2    1000022    12

DECAY 1000014  0.63901285
    1   2    1000022    14

DECAY 1000016  3.3572528
    0.49446206   2    1000022    16
    0.24440317   2    1000015    24
    0.19123167   2    1000024    15
    0.038533406   2    1000037    15
    0.019503305   2    1000035    16
    0.010677957   2    1000023    16
    0.00065368014   2    1000025    16
    0.00053475894   2    1000015    37

DECAY 2000001  143.75288
    0.98057302   2    1000021    1
    0.019381369   2    1000022    1

DECAY 1000001  200.50466
    0.70769386   2    1000021    1
    0.18795198   2   -1000037    2
    0.093401846   2    1000035    1
    0.0045638238   2   -1000024    2
    0.003518914   2    1000022    1
    0.0027859334   2    1000023    1

DECAY 2000003  143.76642
    0.98048177   2    1000021    3
    0.019379668   2    1000022    3

DECAY 1000003  200.51342
    0.70766456   2    1000021    3
    0.18794426   2   -1000037    4
    0.093398198   2    1000035    3
    0.0045716752   2   -1000024    4
    0.0035188477   2    1000022    3
    0.0028021614   2    1000023    3
    0.00010029105   2    1000025    3

DECAY 1000005  0.74014439
    0.77964066   2    1000022    5
    0.12081906   2    1000023    5
    0.09954028   2    1000025    5

DECAY 2000005  38.252011
    0.43499819   2    1000006   -24
    0.35862099   2   -1000024    6
    0.067923637   2   -1000037    6
    0.039441447   2    1000023    5
    0.037822831   2    1000025    5
    0.029621259   2    1000035    5
    0.015926577   2    1000005    25
    0.0090022714   2    1000005    23
    0.0060879072   2    1000022    5
    0.00028301508   2    1000005    35
    0.0002718753   2    1000005    36

DECAY 2000002  152.2945
    0.92662877   2    1000021    2
    0.073199949   2    1000022    2
    0.00012224199   2    1000023    2

DECAY 1000002  200.49758
    0.70748835   2    1000021    2
    0.18480691   2    1000037    1
    0.093005886   2    1000035    2
    0.0079015793   2    1000024    1
    0.0034414222   2    1000022    2
    0.0033179493   2    1000023    2

DECAY 2000004  152.29789
    0.92660832   2    1000021    4
    0.073198325   2    1000022    4
    0.00012755487   2    1000023    4

DECAY 1000004  200.50612
    0.70745886   2    1000021    4
    0.18479984   2    1000037    3
    0.093002138   2    1000035    4
    0.0079339614   2    1000024    3
    0.0034412776   2    1000022    4
    0.0033218228   2    1000023    4

DECAY 1000006  11.177604
    0.47713394   2    1000024    5
    0.22266044   2    1000022    6
    0.15937204   2    1000023    6
    0.14045201   2    1000025    6
    0.00035731557   2    1000005    24

DECAY 2000006  44.689851
    0.21753607   2    1000006    23
    0.21692783   2    1000006    25
    0.18545835   2    1000025    6
    0.17102729   2    1000023    6
    0.073956619   2    1000024    5
    0.063123016   2    1000037    5
    0.035642093   2    1000035    6
    0.016538473   2    1000005    24
    0.010674537   2    1000022    6
    0.0054716737   2    1000006    36
    0.0035469618   2    1000006    35

DECAY 1000024  1.475918
    0.44122646   2    1000022    24
    0.2560583   2    37    1000022
    0.17886394   2   -1000015    16
    0.037697229   2    1000014   -13
    0.037137415   2    1000012   -11
    0.020909409   2   -1000013    14
    0.020908899   2   -1000011    12
    0.0071916408   3    1000022   -5    6

DECAY 1000037  20.936886
    0.15749868   2   -1000013    14
    0.15749712   2   -1000011    12
    0.15649196   2    1000014   -13
    0.15649016   2    1000012   -11
    0.1023346   2    1000025    24
    0.091889516   2    1000023    24
    0.08958148   2    1000024    23
    0.085323809   2    1000024    25
    0.0011807085   2    1000022    24
    0.00040717824   3    1000023   -5    6
    0.00033778527   3    1000025   -5    6
    0.00032048384   3    1000024    5   -5
    0.00030453418   2   -1000005    6
    0.0001686785   2   -1000015    16

DECAY 1000022 -1


DECAY 1000023  1.4299508
    0.29610625   2    1000022    25
    0.18892068   2    1000022    35
    0.12649214   2    1000022    23
    0.093178585   2    1000015   -15
    0.093178585   2   -1000015    15
    0.081276093   2    1000022    36
    0.018666598   2    1000013   -13
    0.018666598   2   -1000013    13
    0.018385329   2    1000011   -11
    0.018385329   2   -1000011    11
    0.011132374   2    1000012   -12
    0.011132374   2   -1000012    12
    0.011132357   2    1000014   -14
    0.011132357   2   -1000014    14
    0.0021336719   3    1000022    6   -6

DECAY 1000025  1.5752046
    0.31860657   2    1000022    23
    0.23802129   2    1000022    25
    0.19994184   2    1000022    35
    0.086841638   2    1000015   -15
    0.086841638   2   -1000015    15
    0.064023647   2    1000022    36
    0.0022054766   3    1000022    6   -6
    0.00067778177   2    1000012   -12
    0.00067778177   2   -1000012    12
    0.00067778081   2    1000014   -14
    0.00067778081   2   -1000014    14
    0.00031567993   2    1000013   -13
    0.00031567993   2   -1000013    13

DECAY 1000035  22.587198
    0.094542952   2    1000025    23
    0.085800479   2    1000024   -24
    0.085800479   2   -1000024    24
    0.077476818   2    1000023    25
    0.073591234   2    1000012   -12
    0.073591234   2   -1000012    12
    0.073591189   2    1000014   -14
    0.073591189   2   -1000014    14
    0.071926999   2    1000013   -13
    0.071926999   2   -1000013    13
    0.071925422   2    1000011   -11
    0.071925422   2   -1000011    11
    0.069915078   2    1000025    25
    0.0017304932   2    1000023    23
    0.00063305684   2    1000022    25
    0.00038577966   2    1000022    23
    0.00035532978   3    1000024    5   -6
    0.00035532978   3   -1000024   -5    6
    0.00016612669   2    1000005   -5
    0.00016612669   2   -1000005    5
    0.00014510052   3    1000023    5   -5
    0.00013641067   3    1000025    5   -5

DECAY 1000021  236.70082
    0.15655129   2    1000005   -5
    0.15655129   2   -1000005    5
    0.12796487   2    1000006   -6
    0.12796487   2   -1000006    6
    0.11002492   2    2000006   -6
    0.11002492   2   -2000006    6
    0.10501584   2    2000005   -5
    0.10501584   2   -2000005    5
    0.00028437743   3    1000024    5   -6
    0.00028437743   3   -1000024   -5    6

DECAY 25  0.0040873418
    0.67247229   2   -5    5
    0.14217903   2   -24    24
    0.07805452   2   -15    15
    0.061970061   2    21    21
    0.02593319   2   -4    4
    0.015923963   2    23    23
    0.0019539452   2    22    22
    0.00098803604   2    22    23
    0.00027230909   2   -13    13
    0.00025181348   2   -3    3
    6.9622628e-07   2   -1    1
    1.3364929e-07   2   -2    2
    6.1218703e-09   2   -11    11

DECAY 35  4.7834611
    0.85192822   2   -5    5
    0.14569353   2   -15    15
    0.00093592506   2   -6    6
    0.00052899817   2   -13    13
    0.00034147213   2   -3    3
    0.00024607706   2    21    21
    0.00018602917   2    25    25
    8.4527195e-05   2   -24    24
    3.8888293e-05   2    23    23
    1.5002151e-05   2    1000022    1000022
    9.4403095e-07   2   -1    1
    2.1238681e-07   2    22    22
    9.2519004e-08   2   -4    4
    7.2539038e-08   2    22    23
    1.1888278e-08   2   -11    11
    4.7724561e-13   2   -2    2

DECAY 36  4.7478501
    0.8506745   2   -5    5
    0.14545182   2   -15    15
    0.0025507945   2   -6    6
    0.00052807785   2   -13    13
    0.00034088433   2   -3    3
    0.00024195962   2    21    21
    0.0001465235   2    1000022    1000022
    6.4216885e-05   2    23    25
    9.424059e-07   2   -1    1
    1.6694299e-07   2    22    22
    6.8226024e-08   2   -4    4
    3.368572e-08   2    22    23
    1.1867591e-08   2   -11    11
    3.5150165e-13   2   -2    2
    1.136287e-34   2    25    25

DECAY 37  3.4200065
    0.8152817   2   -5    6
    0.1817867   2   -15    16
    0.0017137552   2   -5    4
    0.00064270422   2   -13    14
    0.0004309531   2   -3    4
    0.00010241152   2    24    25
    1.9637281e-05   2   -3    2
    1.2238208e-05   2   -5    2
    8.2194024e-06   2   -3    6
    1.1951236e-06   2   -1    2
    3.5756932e-07   2   -1    6
    5.9094235e-08   2   -1    4
    2.5080284e-08   2    24    36
    2.4882432e-08   2    24    35
    1.503292e-08   2   -11    12

DECAY 6  2.43
    1   2    5    24

DECAY 15 -1
