BLOCK SPINFO
   1   SPheno
   2   v4.0.5be

BLOCK SPHENOINFO
   1   2
   2   2

BLOCK MODSEL
   1   0

BLOCK MINPAR
   3    46.108339
   4    1

BLOCK EXTPAR
   0    1527.8677
   1   -70.476202
   2   -467.62302
   3    3000
   11    3558.43
   12    1873.5764
   13   -1073.1517
   23    100.47608
   25    45.216681
   26    3894.6736
   31    546.00252
   32    546.00252
   33    1167.4389
   34    1227.9917
   35    1227.9917
   36    1400.2002
   41    5000
   42    5000
   43    1275.9144
   44    5000
   45    5000
   46    1939.1855
   47    5000
   48    5000
   49    1797.4015

BLOCK SMINPUTS
   1    127.90897
   2    1.1663787e-05
   3    0.1184
   4    91.1876
   5    4.18
   6    173.2
   7    1.777
   8    0
   11    0.00051099893
   12    0
   13    0.10565837
   14    0
   21    0.005
   22    0.0025
   23    0.095
   24    1.27

BLOCK GAUGE Q=  1527.8677
   1    0.35536298
   2    0.66519887
   3    1.219778

BLOCK YU Q=  1527.8677
   1   1    8.3864223e-06
   2   2    0.0042603025
   3   3    1.0131472

BLOCK YD Q=  1527.8677
   1   1    0.0007620012
   2   2    0.014478023
   3   3    0.75566641

BLOCK YE Q=  1527.8677
   1   1    0.00013297478
   2   2    0.027494967
   3   3    0.46242012

BLOCK AU Q=  1527.8677
   1   1    0
   2   2    0
   3   3    3558.4302

BLOCK AD Q=  1527.8677
   1   1    0
   2   2    0
   3   3    1873.5762

BLOCK AE Q=  1527.8677
   1   1    0
   2   2    0
   3   3   -1073.1517

BLOCK MSOFT Q=  1527.8677
   1   -70.476202
   2   -467.62302
   3    3000
   21    15191157
   22    60640.721
   31    546.00252
   32    546.00252
   33    1167.4389
   34    1227.9917
   35    1227.9917
   36    1400.2002
   41    5000
   42    5000
   43    1275.9144
   44    5000
   45    5000
   46    1939.1855
   47    5000
   48    5000
   49    1797.4015

BLOCK MASS
   6    173.2
   23    91.1876
   24    80.429995
   15    1.777
   25    126.13784
   35    3891.4408
   36    3894.6736
   37    3892.9109
   1000001    5030.682
   2000001    5019.7188
   1000002    5030.2379
   2000002    5022.7459
   1000003    5030.6878
   2000003    5019.7294
   1000004    5030.2437
   2000004    5022.7466
   1000005    1267.6881
   2000005    1840.3167
   1000006    1217.2865
   2000006    1917.6913
   1000011    560.24114
   2000011    1224.2508
   1000012    554.21275
   1000013    560.27942
   2000013    1224.2807
   1000014    554.25194
   1000015    1178.8319
   2000015    1403.8891
   1000016    1175.9087
   1000021    3192.4628
   1000022   -57.130748
   1000023    119.09771
   1000025   -119.88316
   1000035   -507.50202
   1000024    106.10286
   1000037    507.80329

BLOCK ALPHA
      -0.021715369

BLOCK HMIX Q=  1527.8677
   1    100.47608
   2    45.216681
   3    243.95186
   4    15168482

BLOCK STOPMIX
   1   1   -0.96844038
   1   2    0.24924532
   2   1   -0.24924532
   2   2   -0.96844038

BLOCK SBOTMIX
   1   1    0.99999703
   1   2    0.002435597
   2   1   -0.002435597
   2   2    0.99999703

BLOCK STAUMIX
   1   1    0.99985524
   1   2    0.017014766
   2   1   -0.017014766
   2   2    0.99985524

BLOCK NMIX
   1   1   -0.82031252
   1   2    0.045817939
   1   3   -0.50712821
   1   4   -0.26040173
   2   1   -0.54552159
   2   2   -0.12985707
   2   3    0.55534902
   2   4    0.61410977
   3   1   -0.17092573
   3   2    0.098423695
   3   3    0.65836726
   3   4   -0.72639502
   4   1   -0.016672224
   4   2    0.98557122
   4   3    0.03099992
   4   4    0.16556089

BLOCK UMIX
   1   1   -0.044307786
   1   2    0.99901793
   2   1   -0.99901793
   2   2   -0.044307786

BLOCK VMIX
   1   1    0.23547703
   1   2    0.97187992
   2   1    0.97187992
   2   2   -0.23547703

BLOCK HIGGSBOUNDSINPUTHIGGSCOUPLINGSFERMIONS
       0, 2044.5482,3,36,15,15

BLOCK HIGGSBOUNDSINPUTHIGGSCOUPLINGSBOSONS
       0,4,36,21,21,23

BLOCK SPHENOLOWENERGY
   1    0.0003699907
   2    1.5861775e-06
   3    3.5220751e-05
   4    2.4191563e-15
   5    1.0334422e-10
   6    2.1662861e-08
   7    8.0996304e-14
   8    3.4601803e-09
   9    7.349382e-07
   10    9.5996995e-05
   11    0.99161221
   12    0.54281903
   13    19.391852
   14    0
   15    0
   16    0.0021612345
   17    2.2816989e-15
   18    2.4770797e-11
   19    8.2836833e-11
   20   -2.7759901e-14
   21   -1.1873596e-09
   22   -1.8361204e-07
   23    0
   24    0
   25    0
   26    0
   27    0
   28    0
   29    0
   30    0
   31    0
   39    9.9062844e-05
   40    0
   41    0
   42    0

BLOCK FWCOEF Q=  160
   305   4422   0   0   -0.18881911
   305   4422   0   2   -0.24645616
   305   4322   0   2   -0.00039312761
   305   6421   0   0   -0.095227835
   305   6421   0   2   -0.12455333
   305   6321   0   2   -0.00022507644
   3051111   4133   0   0    1.593135
   3051111   4133   0   2    1.59431
   3051111   4233   0   2    0.00036550796
   3051111   4137   0   0   -4.4158271
   3051111   4137   0   2   -4.4109921
   3051111   4237   0   2   -0.0028379372
   3051313   4133   0   0    1.593135
   3051313   4133   0   2    1.5943037
   3051313   4233   0   2    0.00036550554
   3051313   4137   0   0   -4.4158271
   3051313   4137   0   2   -4.4109983
   3051313   4237   0   2   -0.0028379453
   3051212   4137   0   0    1.5053501
   3051212   4137   0   2    1.5043334
   3051212   4237   0   2    0.00061832086
   3051414   4137   0   0    1.5053501
   3051414   4137   0   2    1.5043334
   3051414   4237   0   2    0.0006183209
   3051616   4137   0   0    1.5053501
   3051616   4137   0   2    1.5043326
   3051616   4237   0   2    0.00061833422

BLOCK IMFWCOEF Q=  160
   305   4422   0   0    3.8579816e-07
   305   4422   0   2   -3.3380639e-05
   305   4322   0   2   -5.6403403e-06
   305   6421   0   0    3.3046164e-07
   305   6421   0   2   -1.9355674e-05
   305   6321   0   2   -2.1406423e-06
   3051111   4133   0   2   -8.2540711e-07
   3051111   4233   0   2    7.1115308e-06
   3051111   4137   0   2    3.015677e-06
   3051111   4237   0   2   -5.5224661e-05
   3051313   4133   0   2   -8.2598521e-07
   3051313   4233   0   2    7.1114926e-06
   3051313   4137   0   2    3.0161116e-06
   3051313   4237   0   2   -5.522481e-05
   3051212   4137   0   2   -1.808448e-08
   3051212   4237   0   2    1.2032195e-05
   3051414   4137   0   2   -1.8083593e-08
   3051414   4237   0   2    1.2032195e-05
   3051616   4137   0   2   -3.3025424e-08
   3051616   4237   0   2    1.2032221e-05

DECAY 23  2.4952


DECAY 24  2.085


DECAY 1000011  1.0123975
    0.39410657   2    1000023    11
    0.36730551   2    1000022    11
    0.1548004   2   -1000037    12
    0.074785503   2    1000035    11
    0.0088897673   2   -1000024    12
    0.00011224122   2    1000025    11

DECAY 2000011  6.0949524
    0.67619146   2    1000022    11
    0.29469257   2    1000023    11
    0.028923496   2    1000025    11
    0.00019240481   2    1000035    11

DECAY 1000013  1.0205795
    0.39329511   2    1000023    13
    0.36646828   2    1000022    13
    0.1537631   2   -1000037    14
    0.074284374   2    1000035    13
    0.00881919   2   -1000024    14
    0.0033699293   2    1000025    13

DECAY 2000013  6.1314069
    0.67295624   2    1000022    13
    0.29385713   2    1000023    13
    0.030029242   2    1000025    13
    0.0029522659   2   -1000024    14
    0.00019325202   2    1000035    13

DECAY 1000015  16.808682
    0.4081626   2   -1000037    16
    0.19535801   2    1000035    15
    0.14288209   2    1000023    15
    0.1262738   2    1000022    15
    0.12541062   2    1000025    15
    0.0019128751   2   -1000024    16

DECAY 2000015  18.827146
    0.32982395   2    1000022    15
    0.31221486   2   -1000024    16
    0.20733065   2    1000023    15
    0.14765028   2    1000025    15
    0.001132775   2   -1000037    16
    0.00063377296   2    1000035    15
    0.00062930883   2    1000016   -24
    0.00030129106   2    1000015    25
    0.00028311196   2    1000015    23

DECAY 1000012  1.1298038
    0.49518814   2    1000022    12
    0.22221336   2    1000024    11
    0.10502699   2    1000037    11
    0.070623812   2    1000025    12
    0.055668546   2    1000035    12
    0.051279145   2    1000023    12

DECAY 1000014  1.1378844
    0.49170784   2    1000022    14
    0.22744419   2    1000024    13
    0.10444212   2    1000037    13
    0.070128211   2    1000025    14
    0.055358355   2    1000035    14
    0.050919286   2    1000023    14

DECAY 1000016  16.86514
    0.38402725   2    1000037    15
    0.32476298   2    1000024    15
    0.20097608   2    1000035    16
    0.071566058   2    1000022    16
    0.010819572   2    1000025    16
    0.0078480567   2    1000023    16

DECAY 2000001  143.32106
    0.9804561   2    1000021    1
    0.0131547   2    1000022    1
    0.0058126674   2    1000023    1
    0.00057080005   2    1000025    1

DECAY 1000001  207.45621
    0.68284773   2    1000021    1
    0.20872985   2   -1000037    2
    0.10218972   2    1000035    1
    0.0039293603   2    1000022    1
    0.0017704483   2    1000025    1
    0.00041870413   2   -1000024    2
    0.00011418657   2    1000023    1

DECAY 2000003  143.36387
    0.98017095   2    1000021    3
    0.013188236   2    1000022    3
    0.0058558027   2    1000023    3
    0.00063367296   2    1000025    3
    0.00014559537   2   -1000024    4

DECAY 1000003  207.47961
    0.68277363   2    1000021    3
    0.20870705   2   -1000037    4
    0.10217842   2    1000035    3
    0.0039548462   2    1000022    3
    0.0018139074   2    1000025    3
    0.00042691823   2   -1000024    4
    0.0001452364   2    1000023    3

DECAY 1000005  50.640679
    0.45799885   2   -1000024    6
    0.17982417   2   -1000037    6
    0.12277721   2    1000025    5
    0.086199244   2    1000023    5
    0.077079706   2    1000022    5
    0.076120816   2    1000035    5

DECAY 2000005  42.191344
    0.48247089   2   -1000024    6
    0.21385908   2    1000025    5
    0.15888521   2    1000023    5
    0.14316349   2    1000022    5
    0.00089554591   2   -1000037    6
    0.00045292702   2    1000035    5
    0.00013434286   2    1000005    25

DECAY 2000002  152.04549
    0.92626872   2    1000021    2
    0.049629047   2    1000022    2
    0.021929312   2    1000023    2
    0.0021528291   2    1000025    2

DECAY 1000002  207.45431
    0.68263113   2    1000021    2
    0.19752738   2    1000037    1
    0.10095743   2    1000035    2
    0.011825514   2    1000024    1
    0.0054933092   2    1000023    2
    0.0010724955   2    1000022    2
    0.00049274148   2    1000025    2

DECAY 2000004  152.04913
    0.92624668   2    1000021    4
    0.049628671   2    1000022    4
    0.021933273   2    1000023    4
    0.0021590674   2    1000025    4

DECAY 1000004  207.47763
    0.68255699   2    1000021    4
    0.1975056   2    1000037    3
    0.1009464   2    1000035    4
    0.011924739   2    1000024    3
    0.0054959985   2    1000023    4
    0.0010729691   2    1000022    4
    0.00049730186   2    1000025    4

DECAY 1000006  49.270975
    0.33524317   2    1000024    5
    0.26974593   2    1000025    6
    0.17817857   2    1000023    6
    0.10796654   2    1000037    5
    0.054101344   2    1000035    6
    0.049571709   2    1000022    6
    0.0024667461   2    1000023    4
    0.0022376203   3    1000022    24    5
    0.00048837124   2    1000022    4

DECAY 2000006  191.27321
    0.27151339   2    1000005    24
    0.17280474   2    1000024    5
    0.15788909   2    1000006    25
    0.15142908   2    1000006    23
    0.099466811   2    1000025    6
    0.085197041   2    1000023    6
    0.026536667   2    1000037    5
    0.021969359   2    1000022    6
    0.013193817   2    1000035    6

DECAY 1000024  0.00024221929
    0.3335858   3    1000022   -1    2
    0.33264352   3    1000022   -3    4
    0.11147851   3    1000022   -11    12
    0.11147753   3    1000022   -13    14
    0.11081464   3    1000022   -15    16

DECAY 1000037  4.1122173
    0.2649108   2    1000025    24
    0.25238429   2    1000024    23
    0.24440395   2    1000023    24
    0.21760216   2    1000024    25
    0.01864075   2    1000022    24
    0.00087919956   3    1000025   -5    6
    0.00086223029   3    1000023   -5    6

DECAY 1000022 -1


DECAY 1000023  3.2457179e-05
    0.1933486   3    1000022    12   -12
    0.14238502   3    1000022    1   -1
    0.14238234   3    1000022    3   -3
    0.14064438   3    1000022    5   -5
    0.11109875   3    1000022    2   -2
    0.11063453   3    1000022    4   -4
    0.031780026   3    1000022    15   -15
    0.029901482   3    1000022    13   -13
    0.029893105   3    1000022    11   -11
    0.010118424   3    1000024    1   -2
    0.010118424   3   -1000024   -1    2
    0.0096576882   3    1000024    3   -4
    0.0096576882   3   -1000024   -3    4
    0.0087283723   2    1000022    22
    0.003370949   3    1000024    11   -12
    0.003370949   3   -1000024   -11    12
    0.0033698586   3    1000024    13   -14
    0.0033698586   3   -1000024   -13    14
    0.0030847742   3    1000024    15   -16
    0.0030847742   3   -1000024   -15    16

DECAY 1000025  0.00060339681
    0.2045035   3    1000022    12   -12
    0.15228762   3    1000022    1   -1
    0.15228442   3    1000022    3   -3
    0.14713653   3    1000022    5   -5
    0.11877565   3    1000022    2   -2
    0.11823901   3    1000022    4   -4
    0.034316269   3    1000022    13   -13
    0.034314939   3    1000022    11   -11
    0.034220434   3    1000022    15   -15
    0.0020204284   2    1000022    22
    0.00032395681   3    1000024    1   -2
    0.00032395681   3   -1000024   -1    2
    0.00031072841   3    1000024    3   -4
    0.00031072841   3   -1000024   -3    4
    0.00010811032   3    1000024    11   -12
    0.00010811032   3   -1000024   -11    12
    0.00010807963   3    1000024    13   -14
    0.00010807963   3   -1000024   -13    14

DECAY 1000035  4.6770467
    0.24294611   2    1000024   -24
    0.24294611   2   -1000024    24
    0.1655783   2    1000025    23
    0.15229156   2    1000025    25
    0.1195237   2    1000023    25
    0.059800393   2    1000023    23
    0.0073366965   2    1000022    25
    0.0069921116   2    1000022    23
    0.0011680313   3    1000024    5   -6
    0.0011680313   3   -1000024   -5    6

DECAY 1000021  248.60489
    0.14711103   2    1000006   -6
    0.14711103   2   -1000006    6
    0.13484241   2    1000005   -5
    0.13484241   2   -1000005    5
    0.084731474   2    2000005   -5
    0.084731474   2   -2000005    5
    0.070933168   2    2000006   -6
    0.070933168   2   -2000006    6
    0.062292756   2    1000006   -4
    0.062292756   2   -1000006    4

DECAY 25  0.0060215693
    0.37105132   2   -5    5
    0.33121862   2    1000022    1000022
    0.16572474   2   -24    24
    0.047408179   2    21    21
    0.042775053   2   -15    15
    0.020512883   2    23    23
    0.018389094   2   -4    4
    0.001567614   2    22    22
    0.0010642834   2    22    23
    0.00014821212   2   -13    13
    0.00013950816   2   -3    3
    3.8572561e-07   2   -1    1
    9.4761155e-08   2   -2    2
    3.3319636e-09   2   -11    11

DECAY 35  152.06509
    0.49612528   2   -5    5
    0.10632006   2   -15    15
    0.09500521   2   -1000024    1000037
    0.09500521   2   -1000037    1000024
    0.042132883   2    1000023    1000035
    0.029706317   2    1000025    1000035
    0.027967546   2    1000022    1000035
    0.027293237   2   -2000005    1000005
    0.027293237   2   -1000005    2000005
    0.01417052   2    1000022    1000022
    0.012623599   2   -1000024    1000024
    0.005198189   2    1000023    1000025
    0.00406225   2    1000022    1000023
    0.0032877979   2    1000023    1000023
    0.0030855087   2   -2000015    1000015
    0.0030855087   2   -1000015    2000015
    0.0025844569   2    1000022    1000025
    0.0020314329   2    1000025    1000025
    0.00055216326   2   -2000006    1000006
    0.00055216326   2   -1000006    2000006
    0.00047821786   2   -1000037    1000037
    0.00038364467   2   -6    6
    0.00035197961   2   -13    13
    0.00024591459   2    1000035    1000035
    0.00021813962   2   -3    3
    0.00018464433   2   -1000006    1000006
    3.8658623e-05   2   -2000006    2000006
    5.3264733e-06   2    21    21
    3.5879459e-06   2   -2000015    2000015
    3.565762e-06   2   -1000015    1000015
    1.7328635e-06   2   -1000005    1000005
    7.1748736e-07   2    25    25
    6.030963e-07   2   -1    1
    2.8287478e-07   2   -2000005    2000005
    5.8340856e-08   2    23    23
    4.7351549e-08   2    22    23
    2.9576828e-08   2    22    22
    2.0525275e-08   2   -1000011    1000011
    2.0312697e-08   2   -1000013    1000013
    1.2725896e-08   2   -24    24
    1.0731911e-08   2   -2000011    2000011
    1.0596103e-08   2   -2000013    2000013
    7.904597e-09   2   -11    11
    5.7037198e-09   2   -4    4
    5.3135797e-11   2   -2000013    1000013
    5.3135797e-11   2   -1000013    2000013
    2.9402374e-14   2   -2    2
    1.2428526e-15   2   -2000011    1000011
    1.2428526e-15   2   -1000011    2000011

DECAY 36  143.53096
    0.47634167   2   -5    5
    0.1020838   2   -15    15
    0.10091813   2   -1000024    1000037
    0.10091813   2   -1000037    1000024
    0.048232387   2    1000023    1000035
    0.028947703   2   -2000005    1000005
    0.028947703   2   -1000005    2000005
    0.028866   2    1000022    1000035
    0.028851654   2    1000025    1000035
    0.014354821   2    1000022    1000022
    0.013208187   2   -1000024    1000024
    0.0055269505   2    1000023    1000025
    0.0050984605   2    1000022    1000023
    0.0038520343   2    1000023    1000023
    0.0032721996   2   -2000015    1000015
    0.0032721996   2   -1000015    2000015
    0.0024053167   2    1000022    1000025
    0.0019587947   2    1000025    1000025
    0.00075409102   2   -2000006    1000006
    0.00075409102   2   -1000006    2000006
    0.00037072558   2   -6    6
    0.00033794721   2   -13    13
    0.00033523323   2   -1000037    1000037
    0.0002094316   2   -3    3
    0.00017459657   2    1000035    1000035
    7.0108953e-06   2    21    21
    5.7901945e-07   2   -1    1
    1.2683767e-07   2    23    25
    1.2254653e-08   2    22    23
    7.589508e-09   2   -11    11
    5.4893907e-09   2   -4    4
    2.0878316e-10   2    22    22
    5.5936504e-11   2   -2000013    1000013
    5.5936504e-11   2   -1000013    2000013
    2.7026516e-12   2    23    35
    2.8298441e-14   2   -2    2
    1.3083606e-15   2   -2000011    1000011
    1.3083606e-15   2   -1000011    2000011
    2.3439536e-38   2    25    25

DECAY 37  153.42596
    0.49545445   2   -5    6
    0.10787726   2   -15    16
    0.095703942   2    1000024    1000035
    0.085985022   2    1000023    1000037
    0.058879261   2    1000025    1000037
    0.056011004   2    1000022    1000037
    0.055395876   2   -2000005    1000006
    0.017711579   2    1000024    1000025
    0.016841692   2    1000022    1000024
    0.0061255613   2   -2000015    1000016
    0.0015507476   2   -2000005    2000006
    0.00081795959   2   -1000005    2000006
    0.00073434362   2   -5    4
    0.00038138451   2   -13    14
    0.00028254663   2    1000023    1000024
    0.00019590519   2   -3    4
    3.2893825e-05   2   -1000005    1000006
    9.2021962e-06   2   -3    2
    5.2439706e-06   2   -5    2
    2.2374468e-06   2   -1000015    1000016
    9.4519121e-07   2   -3    6
    5.436401e-07   2   -1    2
    1.1853954e-07   2    24    25
    7.9891626e-08   2   -1000011    1000012
    7.9595868e-08   2   -1000013    1000014
    5.5178007e-08   2    1000035    1000037
    2.9972526e-08   2   -1    6
    2.5735335e-08   2   -1    4
    8.9206234e-09   2   -11    12
    1.0699959e-10   2   -2000013    1000014
    6.0943858e-14   2    24    35
    2.5028291e-15   2   -2000011    1000012

DECAY 6  2.43
    1   2    5    24

DECAY 15 -1
