BLOCK SPINFO
   1   SPheno
   2   v4.0.5be

BLOCK SPHENOINFO
   1   2
   2   2

BLOCK MODSEL
   1   0

BLOCK MINPAR
   3    38.605039
   4   -1

BLOCK EXTPAR
   0    1406.6635
   1    379.59532
   2    362.69626
   3    3000
   11    3569.0963
   12    675.7825
   13    706.63069
   23   -569.99968
   25    38.085345
   26    1844.5499
   31    1293.1388
   32    1293.1388
   33    1090.3465
   34    445.23047
   35    445.23047
   36    1749.2503
   41    5000
   42    5000
   43    1711.6507
   44    5000
   45    5000
   46    1295.8483
   47    5000
   48    5000
   49    1663.6914

BLOCK SMINPUTS
   1    127.90897
   2    1.1663787e-05
   3    0.1184
   4    91.1876
   5    4.18
   6    173.2
   7    1.777
   8    0
   11    0.00051099893
   12    0
   13    0.10565837
   14    0
   21    0.005
   22    0.0025
   23    0.095
   24    1.27

BLOCK GAUGE Q=  1406.6635
   1    0.35536298
   2    0.66519887
   3    1.219778

BLOCK YU Q=  1406.6635
   1   1    8.3872618e-06
   2   2    0.004260729
   3   3    1.0132486

BLOCK YD Q=  1406.6635
   1   1    0.00064188665
   2   2    0.012195846
   3   3    0.63655042

BLOCK YE Q=  1406.6635
   1   1    0.00011201392
   2   2    0.023160925
   3   3    0.38952866

BLOCK AU Q=  1406.6635
   1   1    0
   2   2    0
   3   3    3569.0963

BLOCK AD Q=  1406.6635
   1   1    0
   2   2    0
   3   3    675.78252

BLOCK AE Q=  1406.6635
   1   1    0
   2   2    0
   3   3    706.63069

BLOCK MSOFT Q=  1406.6635
   1    379.59532
   2    362.69626
   3    3000
   21    3159380.2
   22   -261992.12
   31    1293.1388
   32    1293.1388
   33    1090.3465
   34    445.23047
   35    445.23047
   36    1749.2503
   41    5000
   42    5000
   43    1711.6507
   44    5000
   45    5000
   46    1295.8483
   47    5000
   48    5000
   49    1663.6914

BLOCK MASS
   6    173.2
   23    91.1876
   24    80.429995
   15    1.777
   25    125.80068
   35    1843.2055
   36    1844.5499
   37    1846.0938
   1000001    5027.0683
   2000001    5016.4636
   1000002    5026.6299
   2000002    5017.4783
   1000003    5027.073
   2000003    5016.4693
   1000004    5026.6337
   2000004    5017.4791
   1000005    1644.4989
   2000005    1685.8609
   1000006    1144.698
   2000006    1728.5802
   1000011    1295.9385
   2000011    454.15448
   1000012    1293.1768
   1000013    1295.9315
   2000013    454.12494
   1000014    1293.168
   1000015    1089.9011
   2000015    1747.5582
   1000016    1087.1534
   1000021    3184.3593
   1000022    369.95511
   1000023    382.20062
   1000025   -579.64146
   1000035    595.51732
   1000024    377.36469
   1000037    594.47903

BLOCK ALPHA
      -0.02607536

BLOCK HMIX Q=  1406.6635
   1   -569.99968
   2    38.085345
   3    244.03162
   4    3402364.3

BLOCK STOPMIX
   1   1   -0.34138297
   1   2    0.93992429
   2   1   -0.93992429
   2   2   -0.34138297

BLOCK SBOTMIX
   1   1   -0.68398802
   1   2    0.72949324
   2   1   -0.72949324
   2   2   -0.68398802

BLOCK STAUMIX
   1   1   -0.99977775
   1   2    0.021082113
   2   1   -0.021082113
   2   2   -0.99977775

BLOCK NMIX
   1   1    0.74548055
   1   2   -0.60582623
   1   3   -0.23579948
   1   4   -0.14707802
   2   1   -0.65099548
   2   2   -0.75128519
   2   3   -0.091599552
   2   4   -0.058180465
   3   1    0.033823334
   3   2   -0.060226622
   3   3    0.70310562
   3   4   -0.70772257
   4   1   -0.13899504
   4   2    0.25478991
   4   3   -0.664568
   4   4   -0.68855781

BLOCK UMIX
   1   1   -0.94876764
   1   2   -0.31597463
   2   1    0.31597463
   2   2   -0.94876764

BLOCK VMIX
   1   1   -0.9798334
   1   2    0.1998162
   2   1    0.1998162
   2   2    0.9798334

BLOCK HIGGSBOUNDSINPUTHIGGSCOUPLINGSFERMIONS
       0, 1450.4935,3,36,15,15

BLOCK HIGGSBOUNDSINPUTHIGGSCOUPLINGSBOSONS
       0,4,36,21,21,23

BLOCK SPHENOLOWENERGY
   1    0.0002954841
   2    1.5913654e-06
   3    3.5182017e-05
   4    3.4307539e-15
   5    1.4655047e-10
   6    3.0246935e-08
   7    1.1718946e-13
   8    5.0060756e-09
   9    1.046869e-06
   10    9.5051969e-05
   11    0.98185044
   12    0.54251209
   13    19.379018
   14    0
   15    0
   16    0.0021589879
   17    2.2816779e-15
   18    2.4759093e-11
   19    8.2802664e-11
   20   -1.1325449e-14
   21   -4.8421044e-10
   22   -1.6660016e-07
   23    0
   24    0
   25    0
   26    0
   27    0
   28    0
   29    0
   30    0
   31    0
   39    8.5793108e-05
   40    0
   41    0
   42    0

BLOCK FWCOEF Q=  160
   305   4422   0   0   -0.18881911
   305   4422   0   2   -0.15576583
   305   4322   0   2   -2.3338228e-06
   305   6421   0   0   -0.095227835
   305   6421   0   2   -0.089195855
   305   6321   0   2   -0.00021272889
   3051111   4133   0   0    1.5899584
   3051111   4133   0   2    1.590786
   3051111   4233   0   2    0.0001524558
   3051111   4137   0   0   -4.4126505
   3051111   4137   0   2   -4.404039
   3051111   4237   0   2   -0.0011888922
   3051313   4133   0   0    1.5899584
   3051313   4133   0   2    1.5907826
   3051313   4233   0   2    0.00015245323
   3051313   4137   0   0   -4.4126505
   3051313   4137   0   2   -4.4040424
   3051313   4237   0   2   -0.0011888934
   3051212   4137   0   0    1.5053501
   3051212   4137   0   2    1.5034913
   3051212   4237   0   2    0.00025921502
   3051414   4137   0   0    1.5053501
   3051414   4137   0   2    1.5034913
   3051414   4237   0   2    0.00025921533
   3051616   4137   0   0    1.5053501
   3051616   4137   0   2    1.5034917
   3051616   4237   0   2    0.00025930423

BLOCK IMFWCOEF Q=  160
   305   4422   0   0    3.8588835e-07
   305   4422   0   2   -2.4473212e-05
   305   4322   0   2    4.6884411e-06
   305   6421   0   0    3.3053889e-07
   305   6421   0   2    4.2207773e-06
   305   6321   0   2    2.1344113e-06
   3051111   4133   0   2   -1.2319355e-06
   3051111   4233   0   2    4.0949134e-06
   3051111   4137   0   2    1.2623608e-05
   3051111   4237   0   2   -3.1963713e-05
   3051313   4133   0   2   -1.2319383e-06
   3051313   4233   0   2    4.0948938e-06
   3051313   4137   0   2    1.2623654e-05
   3051313   4237   0   2   -3.1963761e-05
   3051212   4137   0   2   -2.4015409e-06
   3051212   4237   0   2    6.9691452e-06
   3051414   4137   0   2   -2.4015401e-06
   3051414   4237   0   2    6.9691452e-06
   3051616   4137   0   2   -2.3946884e-06
   3051616   4237   0   2    6.9691427e-06

DECAY 23  2.4952


DECAY 24  2.085


DECAY 2000011  0.22586017
    0.63549824   2    1000022    11
    0.36450176   2    1000023    11

DECAY 1000011  15.384866
    0.55909216   2   -1000024    12
    0.37333491   2    1000023    11
    0.046154213   2   -1000037    12
    0.013477454   2    1000022    11
    0.0075195986   2    1000035    11
    0.00042166764   2    1000025    11

DECAY 2000013  0.22580316
    0.63544641   2    1000022    13
    0.36434835   2    1000023    13
    0.00020524698   2   -1000024    14

DECAY 1000013  15.394824
    0.55872635   2   -1000024    14
    0.37309706   2    1000023    13
    0.04612384   2   -1000037    14
    0.013510852   2    1000022    13
    0.0077612727   2    1000035    13
    0.00070551   2    1000025    13

DECAY 1000015  13.608936
    0.4954168   2   -1000024    16
    0.32938637   2    1000023    15
    0.061424908   2    1000025    15
    0.056780938   2    1000035    15
    0.032193858   2   -1000037    16
    0.024797126   2    1000022    15

DECAY 2000015  17.052726
    0.27332798   2    1000022    15
    0.22289865   2   -1000037    16
    0.1997878   2    1000023    15
    0.12226788   2    1000025    15
    0.11714938   2    1000035    15
    0.022319717   2   -1000024    16
    0.02129141   2    1000016   -24
    0.010491876   2    1000015    25
    0.010465301   2    1000015    23

DECAY 1000012  15.444379
    0.59227137   2    1000024    11
    0.31322664   2    1000022    12
    0.04998122   2    1000023    12
    0.024772907   2    1000035    12
    0.018305221   2    1000037    11
    0.0014426385   2    1000025    12

DECAY 1000014  15.453114
    0.59200639   2    1000024    13
    0.3130467   2    1000022    14
    0.049952499   2    1000023    14
    0.024758556   2    1000035    14
    0.018794052   2    1000037    13
    0.0014418035   2    1000025    14

DECAY 1000016  13.639833
    0.53991084   2    1000024    15
    0.2765147   2    1000022    16
    0.11999055   2    1000037    15
    0.043873581   2    1000023    16
    0.018608661   2    1000035    16
    0.0011016782   2    1000025    16

DECAY 2000001  143.9191
    0.98076341   2    1000021    1
    0.010697382   2    1000022    1
    0.0081515575   2    1000023    1
    0.0003655591   2    1000035    1

DECAY 1000001  208.4823
    0.68233518   2    1000021    1
    0.18892531   2   -1000024    2
    0.057269445   2    1000022    1
    0.042349995   2    1000023    1
    0.020603963   2   -1000037    2
    0.0080624979   2    1000035    1
    0.00045360907   2    1000025    1

DECAY 2000003  143.94853
    0.98056705   2    1000021    3
    0.010700866   2    1000022    3
    0.0081507521   2    1000023    3
    0.00040962802   2    1000035    3

DECAY 1000003  208.49907
    0.68228266   2    1000021    3
    0.18891059   2   -1000024    4
    0.057268814   2    1000022    3
    0.042347222   2    1000023    3
    0.020610506   2   -1000037    4
    0.0080923934   2    1000035    3
    0.00048781375   2    1000025    3

DECAY 1000005  58.065675
    0.37369884   2    1000006   -24
    0.21222741   2   -1000037    6
    0.17037959   2   -1000024    6
    0.080341043   2    1000022    5
    0.079824073   2    1000025    5
    0.052000609   2    1000035    5
    0.03152844   2    1000023    5

DECAY 2000005  71.267231
    0.42900403   2    1000006   -24
    0.32081831   2   -1000037    6
    0.091285817   2    1000035    5
    0.079351432   2    1000025    5
    0.050330685   2   -1000024    6
    0.019267866   2    1000023    5
    0.0099418584   2    1000022    5

DECAY 2000002  152.33224
    0.92729037   2    1000021    2
    0.040434607   2    1000022    2
    0.030811793   2    1000023    2
    0.0013813109   2    1000035    2

DECAY 1000002  208.479
    0.68212696   2    1000021    2
    0.20148517   2    1000024    1
    0.078891533   2    1000023    2
    0.023494249   2    1000022    2
    0.0082391742   2    1000037    1
    0.0054593561   2    1000035    2
    0.00030356124   2    1000025    2

DECAY 2000004  152.33579
    0.92726891   2    1000021    4
    0.04043391   2    1000022    4
    0.030811117   2    1000023    4
    0.0013867725   2    1000035    4

DECAY 1000004  208.4956
    0.68207427   2    1000021    4
    0.20147632   2    1000024    3
    0.078885326   2    1000023    4
    0.023492573   2    1000022    4
    0.0083007701   2    1000037    3
    0.005462958   2    1000035    4
    0.00030777852   2    1000025    4

DECAY 1000006  27.577334
    0.43946634   2    1000037    5
    0.25968909   2    1000035    6
    0.23624927   2    1000025    6
    0.032753867   2    1000023    6
    0.022043772   2    1000022    6
    0.0045997245   2    1000023    4
    0.0037815951   2    1000024    5
    0.0013905578   2    1000022    4

DECAY 2000006  113.38634
    0.27173364   2    1000006    23
    0.21645852   2    1000006    25
    0.13775673   2    1000024    5
    0.11731848   2    1000025    6
    0.095059793   2    1000035    6
    0.086887712   2    1000037    5
    0.043978606   2    1000023    6
    0.030535441   2    1000022    6
    0.00027107982   2    1000005    24

DECAY 1000024  4.4238124e-08
    0.35840979   3    1000022   -1    2
    0.31073431   3    1000022   -3    4
    0.11990965   3    1000022   -11    12
    0.11978918   3    1000022   -13    14
    0.091157071   3    1000022   -15    16

DECAY 1000037  2.4356259
    0.41786217   2    1000023    24
    0.31083781   2    1000024    23
    0.25426076   2    1000024    25
    0.016785188   2    1000022    24
    0.00020332211   2   -2000013    14

DECAY 1000022 -1


DECAY 1000023  5.5255002e-09
    0.1621956   3    1000024    11   -12
    0.1621956   3   -1000024   -11    12
    0.16181504   3    1000024    13   -14
    0.16181504   3   -1000024   -13    14
    0.08515126   3    1000024    15   -16
    0.08515126   3   -1000024   -15    16
    0.055823654   2    1000022    22
    0.03212926   2    1000024   -211
    0.03212926   2   -1000024    211
    0.028240913   3    1000022    13   -13
    0.028190021   3    1000022    11   -11
    0.0041973005   3    1000022    12   -12
    0.00088292371   3    1000022    15   -15

DECAY 1000025  4.4947185
    0.27352708   2    1000022    23
    0.23358667   2    1000024   -24
    0.23358667   2   -1000024    24
    0.19248172   2    1000022    25
    0.037039606   2    1000023    23
    0.029310223   2    1000023    25
    0.00010611691   2    2000013   -13
    0.00010611691   2   -2000013    13

DECAY 1000035  2.5013357
    0.3265383   2    1000024   -24
    0.3265383   2   -1000024    24
    0.26927692   2    1000022    25
    0.041676297   2    1000023    25
    0.024472506   2    1000022    23
    0.0030836174   2    1000023    23
    0.0021227442   2    2000013   -13
    0.0021227442   2   -2000013    13
    0.0020230005   2    2000011   -11
    0.0020230005   2   -2000011    11

DECAY 1000021  221.81505
    0.17379768   2    1000006   -6
    0.17379768   2   -1000006    6
    0.11465797   2    1000005   -5
    0.11465797   2   -1000005    5
    0.10965532   2    2000005   -5
    0.10965532   2   -2000005    5
    0.094943703   2    2000006   -6
    0.094943703   2   -2000006    6
    0.0068315095   2    1000006   -4
    0.0068315095   2   -1000006    4

DECAY 25  0.0040245634
    0.56496793   2   -5    5
    0.23945413   2   -24    24
    0.069716877   2    21    21
    0.064627862   2   -15    15
    0.029446207   2    23    23
    0.02747382   2   -4    4
    0.0023269812   2    22    22
    0.0015504083   2    22    23
    0.00022399305   2   -13    13
    0.000211061   2   -3    3
    5.8356012e-07   2   -1    1
    1.4157688e-07   2   -2    2
    5.035599e-09   2   -11    11

DECAY 35  78.032869
    0.69808847   2   -5    5
    0.067018898   2   -15    15
    0.062839442   2   -1000024    1000037
    0.062839442   2   -1000037    1000024
    0.039893034   2    1000022    1000025
    0.025382218   2    1000022    1000035
    0.013905334   2   -1000024    1000024
    0.009543717   2    1000022    1000022
    0.0054571875   2    1000025    1000035
    0.0041024416   2    1000035    1000035
    0.0029035238   2   -1000037    1000037
    0.0028962444   2    1000023    1000025
    0.0017657609   2    1000023    1000035
    0.0015223588   2    1000022    1000023
    0.0010847505   2   -6    6
    0.00027518875   2    1000025    1000025
    0.00023129164   2   -13    13
    0.0001664032   2   -3    3
    6.0354837e-05   2    1000023    1000023
    1.9421855e-05   2    21    21
    2.6150471e-06   2    25    25
    6.1239641e-07   2    23    23
    4.6000449e-07   2   -1    1
    3.6505024e-07   2   -24    24
    2.1655991e-07   2    22    23
    8.5939562e-08   2    22    22
    7.1381218e-08   2   -1000011    1000011
    7.0602873e-08   2   -1000013    1000013
    1.1734122e-08   2   -4    4
    5.1954749e-09   2   -11    11
    2.3517092e-09   2   -2000013    1000013
    2.3517092e-09   2   -1000013    2000013
    6.0491664e-14   2   -2    2
    5.5006667e-14   2   -2000011    1000011
    5.5006667e-14   2   -1000011    2000011

DECAY 36  74.182808
    0.68680058   2   -5    5
    0.06593284   2   -15    15
    0.064804785   2   -1000024    1000037
    0.064804785   2   -1000037    1000024
    0.035569882   2    1000022    1000025
    0.031719543   2    1000022    1000035
    0.016139146   2   -1000024    1000024
    0.011043891   2    1000022    1000022
    0.0065462464   2    1000035    1000035
    0.0043095805   2   -1000037    1000037
    0.0036908128   2    1000025    1000035
    0.0025251399   2    1000023    1000025
    0.0022598498   2    1000023    1000035
    0.0017799283   2    1000022    1000023
    0.0010538512   2   -6    6
    0.00052658733   2    1000025    1000025
    0.00022754154   2   -13    13
    0.00016369534   2   -3    3
    7.1393105e-05   2    1000023    1000023
    2.8504116e-05   2    21    21
    8.5900231e-07   2    23    25
    4.5251875e-07   2   -1    1
    7.7506981e-08   2    22    23
    1.0977891e-08   2   -4    4
    5.6733456e-09   2    22    22
    5.1112209e-09   2   -11    11
    2.4595671e-09   2   -2000013    1000013
    2.4595671e-09   2   -1000013    2000013
    6.5000543e-14   2    23    35
    5.752891e-14   2   -2000011    1000011
    5.752891e-14   2   -1000011    2000011
    5.6598215e-14   2   -2    2
    2.3337137e-39   2    25    25

DECAY 37  77.044732
    0.69114491   2   -5    6
    0.071415668   2   -15    16
    0.066833557   2    1000024    1000025
    0.064702512   2    1000024    1000035
    0.057093026   2    1000022    1000037
    0.033390857   2    1000023    1000037
    0.0086072841   2    1000023    1000024
    0.0040217803   2    1000025    1000037
    0.0010295428   2   -5    4
    0.00098691117   2    1000035    1000037
    0.00035261071   2    1000022    1000024
    0.00025248017   2   -13    14
    0.00015194479   2   -3    4
    7.3520026e-06   2   -5    2
    7.0753843e-06   2   -3    2
    1.1633038e-06   2   -3    6
    8.3057817e-07   2    24    25
    4.214242e-07   2   -1    2
    4.3208642e-08   2   -1    6
    1.9966671e-08   2   -1    4
    5.9055375e-09   2   -11    12
    4.7403277e-09   2   -1000013    1000014
    3.5475941e-12   2    24    35
    1.5491682e-13   2    24    36
    1.108726e-13   2   -1000011    1000012

DECAY 6  2.43
    1   2    5    24

DECAY 15 -1
