BLOCK SPINFO
   1   SPheno
   2   v4.0.5be

BLOCK SPHENOINFO
   1   2
   2   2

BLOCK MODSEL
   1   0

BLOCK MINPAR
   3    41.497406
   4    1

BLOCK EXTPAR
   0    2312.5515
   1   -1054.0603
   2   -2126.6578
   3    2143.9204
   11    6062.598
   12   -2745.1301
   13   -7188.1019
   23    3559.251
   25    39.990083
   26    2161.1733
   31    4843.4008
   32    4843.4008
   33    1061.6537
   34    1928.247
   35    1928.247
   36    4950.2542
   41    2694.8648
   42    2694.8648
   43    1164.8725
   44    2603.9859
   45    2603.9859
   46    4047.1533
   47    928.74588
   48    928.74588
   49    4325.3857

BLOCK SMINPUTS
   1    127.90897
   2    1.1663787e-05
   3    0.1184
   4    91.1876
   5    4.18
   6    173.2
   7    1.777
   8    0
   11    0.00051099893
   12    0
   13    0.10565837
   14    0
   21    0.005
   22    0.0025
   23    0.095
   24    1.27

BLOCK GAUGE Q=  2312.5515
   1    0.35536298
   2    0.66519887
   3    1.219778

BLOCK YU Q=  2312.5515
   1   1    8.3869931e-06
   2   2    0.0042605925
   3   3    1.0132161

BLOCK YD Q=  2312.5515
   1   1    0.00067396733
   2   2    0.012805379
   3   3    0.6683644

BLOCK YE Q=  2312.5515
   1   1    0.00011761223
   2   2    0.024318479
   3   3    0.4089968

BLOCK AU Q=  2312.5515
   1   1    0
   2   2    0
   3   3    6062.5982

BLOCK AD Q=  2312.5515
   1   1    0
   2   2    0
   3   3   -2745.1298

BLOCK AE Q=  2312.5515
   1   1    0
   2   2    0
   3   3   -7188.1019

BLOCK MSOFT Q=  2312.5515
   1   -1054.0603
   2   -2126.6578
   3    2143.9204
   21   -8153075.7
   22   -12946519
   31    4843.4008
   32    4843.4008
   33    1061.6537
   34    1928.247
   35    1928.247
   36    4950.2542
   41    2694.8648
   42    2694.8648
   43    1164.8725
   44    2603.9859
   45    2603.9859
   46    4047.1533
   47    928.74588
   48    928.74588
   49    4325.3857

BLOCK MASS
   6    173.2
   23    91.1876
   24    80.429995
   15    1.777
   25    126.62883
   35    2160.5653
   36    2161.1733
   37    2162.6473
   1000001    2772.4106
   2000001    1055.4854
   1000002    2771.1689
   2000002    2672.275
   1000003    2772.4097
   2000003    1055.4807
   1000004    2771.1675
   2000004    2672.275
   1000005    1345.3849
   2000005    4363.57
   1000006    1332.9035
   2000006    4012.2142
   1000011    4852.9528
   2000011    1928.894
   1000012    4851.9171
   1000013    4852.9417
   2000013    1928.9243
   1000014    4851.912
   1000015    1123.4083
   2000015    4936.3289
   1000016    1121.6201
   1000021    2314.2285
   1000022   -1051.8179
   1000023   -2151.9249
   1000025    3549.1119
   1000035   -3550.6445
   1000024    2152.1335
   1000037    3550.9766

BLOCK ALPHA
      -0.024124413

BLOCK HMIX Q=  2312.5515
   1    3559.251
   2    39.990083
   3    243.57429
   4    4670670

BLOCK STOPMIX
   1   1   -0.99819305
   1   2    0.060088479
   2   1   -0.060088479
   2   2   -0.99819305

BLOCK SBOTMIX
   1   1    0.9999415
   1   2    0.010816454
   2   1   -0.010816454
   2   2    0.9999415

BLOCK STAUMIX
   1   1    0.99993933
   1   2    0.011014868
   2   1   -0.011014868
   2   2    0.99993933

BLOCK NMIX
   1   1   -0.99990136
   1   2    0.0003120143
   1   3   -0.013489878
   1   4   -0.0038973867
   2   1    0.00086601455
   2   2    0.9991677
   2   3   -0.035064445
   2   4   -0.020824065
   3   1    0.0067781105
   3   2   -0.010077104
   3   3   -0.70694942
   3   4    0.70715983
   4   1    0.012270738
   4   2   -0.039525455
   4   3   -0.70626555
   4   4   -0.70673626

BLOCK UMIX
   1   1   -0.99876013
   1   2    0.049781621
   2   1   -0.049781621
   2   2   -0.99876013

BLOCK VMIX
   1   1    0.99955703
   1   2    0.029761531
   2   1    0.029761531
   2   2   -0.99955703

BLOCK HIGGSBOUNDSINPUTHIGGSCOUPLINGSFERMIONS
       0, 1599.2068,3,36,15,15

BLOCK HIGGSBOUNDSINPUTHIGGSCOUPLINGSBOSONS
       0,4,36,21,21,23

BLOCK SPHENOLOWENERGY
   1    0.00034593409
   2    1.5890588e-06
   3    3.5276961e-05
   4    7.0494641e-15
   5    3.0114099e-10
   6    6.2807857e-08
   7    2.4151517e-13
   8    1.0317372e-08
   9    2.1798515e-06
   10    9.2591017e-05
   11    0.95642975
   12    0.54246076
   13    19.376758
   14    0
   15    0
   16    0.0021601579
   17    2.2816904e-15
   18    2.4814303e-11
   19    8.2939986e-11
   20   -8.3244715e-16
   21   -3.5588837e-11
   22   -3.2030146e-08
   23    0
   24    0
   25    0
   26    0
   27    0
   28    0
   29    0
   30    0
   31    0
   39    8.0095748e-05
   40    0
   41    0
   42    0

BLOCK FWCOEF Q=  160
   305   4422   0   0   -0.18881911
   305   4422   0   2   -0.21455867
   305   4322   0   2   -0.00034395613
   305   6421   0   0   -0.095227835
   305   6421   0   2   -0.12608098
   305   6321   0   2   -0.00065330517
   3051111   4133   0   0    1.6077349
   3051111   4133   0   2    1.6081459
   3051111   4233   0   2    0.00036785793
   3051111   4137   0   0   -4.430427
   3051111   4137   0   2   -4.431266
   3051111   4237   0   2   -0.0028032991
   3051313   4133   0   0    1.6077349
   3051313   4133   0   2    1.6081454
   3051313   4233   0   2    0.00036785652
   3051313   4137   0   0   -4.430427
   3051313   4137   0   2   -4.4312664
   3051313   4237   0   2   -0.0028032988
   3051212   4137   0   0    1.5053501
   3051212   4137   0   2    1.5055348
   3051212   4237   0   2    0.00060877361
   3051414   4137   0   0    1.5053501
   3051414   4137   0   2    1.5055348
   3051414   4237   0   2    0.00060877383
   3051616   4137   0   0    1.5053501
   3051616   4137   0   2    1.5055284
   3051616   4237   0   2    0.00060883666

BLOCK IMFWCOEF Q=  160
   305   4422   0   0    3.8553745e-07
   305   4422   0   2    7.7333761e-06
   305   4322   0   2   -2.3503121e-06
   305   6421   0   0    3.3023832e-07
   305   6421   0   2   -0.00010187742
   305   6321   0   2   -6.8247573e-06
   3051111   4133   0   2    1.7430619e-06
   3051111   4233   0   2    7.7769906e-06
   3051111   4137   0   2   -9.3537684e-07
   3051111   4237   0   2   -5.9256961e-05
   3051313   4133   0   2    1.7430557e-06
   3051313   4233   0   2    7.776984e-06
   3051313   4137   0   2   -9.3537947e-07
   3051313   4237   0   2   -5.9256974e-05
   3051212   4137   0   2    2.4834804e-07
   3051212   4237   0   2    1.2868431e-05
   3051414   4137   0   2    2.4834791e-07
   3051414   4237   0   2    1.2868431e-05
   3051616   4137   0   2    1.342958e-07
   3051616   4237   0   2    1.2868431e-05

DECAY 23  2.4952


DECAY 24  2.085


DECAY 2000011  4.7841883
    1   2    1000022    11

DECAY 1000011  46.834739
    0.58720168   2   -1000024    12
    0.2941406   2    1000023    11
    0.11805861   2    1000022    11
    0.00048792807   2   -1000037    12
    0.00010706065   2    1000035    11

DECAY 2000013  4.7843922
    1   2    1000022    13

DECAY 1000013  46.859831
    0.58688457   2   -1000024    14
    0.29398269   2    1000023    13
    0.11799527   2    1000022    13
    0.0004876605   2   -1000037    14
    0.00027546553   2    2000013    25
    0.00023825704   2    1000035    13
    0.00013587193   2    1000025    13

DECAY 1000015  0.02152322
    1   2    1000022    15

DECAY 2000015  96.962111
    0.2555194   2    1000016   -37
    0.23303434   2    1000022    15
    0.1278631   2    1000015    35
    0.12778524   2    1000015    36
    0.087270574   2    1000016   -24
    0.045847732   2    1000015    25
    0.043595639   2    1000015    23
    0.03941493   2   -1000037    16
    0.019772613   2    1000025    15
    0.019727435   2    1000035    15
    0.00011299542   2   -1000024    16

DECAY 1000012  46.837972
    0.58785005   2    1000024    11
    0.29345205   2    1000023    12
    0.11829637   2    1000022    12
    0.00020886408   2    1000035    12
    0.00017417802   2    1000037    11

DECAY 1000014  46.850262
    0.58769665   2    1000024    13
    0.29337447   2    1000023    14
    0.11826519   2    1000022    14
    0.00043618151   2    1000037    13
    0.00020880807   2    1000035    14

DECAY 1000016  0.020509766
    1   2    1000022    16

DECAY 2000001  2.8330682e-05
    1   2    1000022    1

DECAY 1000001  26.173916
    0.76870066   2    1000021    1
    0.14689864   2   -1000024    2
    0.073529783   2    1000023    1
    0.010870249   2    1000022    1

DECAY 2000003  2.8219431e-05
    1   2    1000022    3

DECAY 1000003  26.180149
    0.76851495   2    1000021    3
    0.14686274   2   -1000024    4
    0.073512121   2    1000023    3
    0.010867698   2    1000022    3
    0.00024249056   2    2000003    25

DECAY 1000005  0.028917025
    1   2    1000022    5

DECAY 2000005  225.1811
    0.79010099   2    1000021    5
    0.053689788   2    1000005    25
    0.037526147   2    1000006   -37
    0.021784724   2    1000006   -24
    0.019196925   2   -1000037    6
    0.018684071   2    1000005    35
    0.018642138   2    1000005    36
    0.010862872   2    1000005    23
    0.0098636672   2    1000025    5
    0.0098185418   2    1000035    5
    0.0096057684   2    1000022    5
    0.00014959932   2   -1000024    6

DECAY 2000002  17.44622
    0.75576514   2    1000021    2
    0.24423483   2    1000022    2

DECAY 1000002  26.068979
    0.76827442   2    1000021    2
    0.14725814   2    1000024    1
    0.073637789   2    1000023    2
    0.010829654   2    1000022    2

DECAY 2000004  17.446101
    0.75576364   2    1000021    4
    0.24423632   2    1000022    4

DECAY 1000004  26.068748
    0.76827311   2    1000021    4
    0.14725915   2    1000024    3
    0.073638006   2    1000023    4
    0.010829732   2    1000022    4

DECAY 1000006  0.015415774
    0.95905706   2    1000022    6
    0.038315116   2    1000022    4
    0.0025132859   3    1000022    24    5

DECAY 2000006  468.44802
    0.30120628   2    1000021    6
    0.2363968   2    1000005    24
    0.16977323   2    1000006    25
    0.11855811   2    1000006    23
    0.070802826   2    1000005    37
    0.035960775   2    1000006    36
    0.035362649   2    1000006    35
    0.016464015   2    1000022    6
    0.0082035819   2    1000037    5
    0.0036470407   2    1000025    6
    0.0036111849   2    1000035    6

DECAY 1000024  31.509365
    0.34365312   2    1000006   -5
    0.33797264   2   -1000005    6
    0.15948388   2    1000016   -15
    0.15881217   2   -1000015    16

DECAY 1000037  142.14295
    0.55739574   2   -1000005    6
    0.24514026   2    1000006   -5
    0.046309491   2    1000023    24
    0.045314655   2    1000024    23
    0.045015704   2    1000024    25
    0.033686685   2    1000016   -15
    0.015956665   2    1000022    24
    0.0043192133   2    37    1000022
    0.0025832307   3    1000024    6   -6
    0.0024278461   3    1000023   -5    6
    0.00095956192   3    1000022   -5    6
    0.00016476175   2   -1000015    16
    0.00012662148   2   -1000003    4
    0.00012462963   3    1000021   -5    6
    0.00012461898   2   -1000001    2
    0.00010134626   2   -2000003    4

DECAY 1000022 -1


DECAY 1000023  31.264239
    0.16896437   2    1000005   -5
    0.16896437   2   -1000005    5
    0.1667633   2    1000006   -6
    0.1667633   2   -1000006    6
    0.080234018   2    1000015   -15
    0.080234018   2   -1000015    15
    0.080146871   2    1000016   -16
    0.080146871   2   -1000016    16
    0.0038594203   2    1000006   -4
    0.0038594203   2   -1000006    4

DECAY 1000025  149.14704
    0.26501526   2    1000006   -6
    0.26501526   2   -1000006    6
    0.11622729   2    1000005   -5
    0.11622729   2   -1000005    5
    0.044493012   2    1000023    25
    0.043250838   2    1000024   -24
    0.043250838   2   -1000024    24
    0.04050392   2    1000023    23
    0.016016069   2    1000015   -15
    0.016016069   2   -1000015    15
    0.011995314   2    1000022    25
    0.011711628   2    1000022    23
    0.0037610193   2    1000022    35
    0.0019348322   3    1000024    5   -6
    0.0019348322   3   -1000024   -5    6
    0.0013577651   3    1000023    6   -6
    0.00057108267   3    1000022    6   -6
    0.00039340223   2    1000022    36

DECAY 1000035  141.66503
    0.27964682   2    1000006   -6
    0.27964682   2   -1000006    6
    0.1223073   2    1000005   -5
    0.1223073   2   -1000005    5
    0.0448415   2    1000024   -24
    0.0448415   2   -1000024    24
    0.042363985   2    1000023    25
    0.016865351   2    1000015   -15
    0.016865351   2   -1000015    15
    0.01144406   2    1000022    25
    0.0043535567   2    1000022    35
    0.0037489151   2    1000022    23
    0.0027648618   2    1000023    23
    0.002447899   3    1000024    5   -6
    0.002447899   3   -1000024   -5    6
    0.001309239   3    1000023    6   -6
    0.00058392483   3    1000022    6   -6
    0.00037551956   2    1000022    36

DECAY 1000021  147.78117
    0.14537381   2    2000003   -3
    0.14537381   2   -2000003    3
    0.14537314   2    2000001   -1
    0.14537314   2   -2000001    1
    0.10535035   2    1000006   -6
    0.10535035   2   -1000006    6
    0.10156596   2    1000005   -5
    0.10156596   2   -1000005    5
    0.0023171033   2    1000006   -4
    0.0023171033   2   -1000006    4

DECAY 25  0.004096532
    0.5463011   2   -5    5
    0.25621811   2   -24    24
    0.070955701   2    21    21
    0.063017407   2   -15    15
    0.032012573   2    23    23
    0.027085036   2   -4    4
    0.0023485601   2    22    22
    0.0016373806   2    22    23
    0.00021856159   2   -13    13
    0.00020486804   2   -3    3
    5.6643718e-07   2   -1    1
    1.3957103e-07   2   -2    2
    4.9134874e-09   2   -11    11

DECAY 35  23.866989
    0.75160169   2   -5    5
    0.24700682   2   -15    15
    0.00097889569   2   -13    13
    0.00019645176   2   -3    3
    0.00017347453   2   -1000015    1000015
    3.2524121e-05   2   -6    6
    4.56985e-06   2    21    21
    4.2074233e-06   2    25    25
    5.4290536e-07   2   -1    1
    3.9514013e-07   2    1000022    1000022
    9.650382e-08   2    23    23
    4.5811156e-08   2   -24    24
    3.3339604e-08   2   -1000001    1000001
    3.3180711e-08   2   -1000003    1000003
    2.1987751e-08   2   -11    11
    3.7212477e-09   2    22    22
    6.5989436e-10   2    22    23
    4.7743723e-10   2   -4    4
    2.4769788e-15   2   -2    2

DECAY 36  23.075873
    0.75160696   2   -5    5
    0.24702445   2   -15    15
    0.00097898352   2   -13    13
    0.0001964177   2   -3    3
    0.00016269716   2   -6    6
    2.1400837e-05   2    21    21
    8.3035804e-06   2    1000022    1000022
    5.4281087e-07   2   -1    1
    1.3741666e-07   2    23    25
    5.2141337e-08   2    22    22
    2.9954373e-08   2    22    23
    2.1989674e-08   2   -11    11
    2.1451884e-09   2   -4    4
    1.1112256e-14   2   -2    2
    2.2271616e-36   2    25    25

DECAY 37  20.140406
    0.62761679   2   -5    6
    0.36978926   2   -15    16
    0.0013073379   2   -13    14
    0.00092934788   2   -5    4
    0.00022093781   2   -3    4
    0.00011445305   2   -1000015    1000016
    1.0307086e-05   2   -3    2
    6.636505e-06   2   -5    2
    3.9285662e-06   2   -3    6
    6.1329256e-07   2   -1    2
    1.6533097e-07   2   -1    6
    1.5796084e-07   2    24    25
    3.057877e-08   2   -11    12
    3.0051899e-08   2   -1    4
    2.6429972e-12   2    24    35
    4.7015343e-13   2    24    36

DECAY 6  2.43
    1   2    5    24

DECAY 15 -1
