# SUSY Les Houches Accord 2 - MSSM spectrum + Decays
# SPheno v4.0.5be
# W. Porod, Comput. Phys. Commun. 153 (2003) 275-315, hep-ph/0301101;
# W. Porod, F.~Staub, Comput. Phys. Commun. 183 (2012) 2458
#                     arXiv:1104.1573 [hep-ph] 
# in case of problems send email to porod@physik.uni-wuerzburg.de
# Created: 07.09.2021,  15:30
Block SPINFO         # Program information
     1   SPheno      # spectrum calculator
     2   v4.0.5be    # version number
#
Block SPhenoINFO     # SPheno specific information
    1      2         # using 2-loop RGEs
    2      2         # using pole masses for boundary conditions at mZ
Block MODSEL  # Model selection
    1    0    # general MSSM
Block MINPAR  # Input parameters
    3    3.39658796E+01  # tanb at m_Z    
    4   -1.00000000E+00  # Sign(mu)
Block EXTPAR  # non-universal input parameters
    0    3.29734915E+03  # scale for input parameters
    1    2.15378582E+02  # M_1
    2   -1.19246132E+03  # M_2
    3    3.16079410E+03  # M_3
   11   -6.14056658E+03  # A_t
   12   -1.74215429E+03  # A_b
   13    3.05285074E+02  # A_tau
   23   -2.53130786E+02  # mu
   25    3.29073807E+01  # tan(beta)
   26    6.38642618E+02  # m_A, pole mass
   31    1.00000000E+04  # M_L11
   32    1.00000000E+04  # M_L22
   33    1.00000000E+04  # M_L33
   34    1.00000000E+04  # M_E11
   35    1.00000000E+04  # M_E22
   36    1.00000000E+04  # M_E33
   41    1.00000000E+04  # M_Q11
   42    1.00000000E+04  # M_Q22
   43    4.24707945E+03  # M_Q33
   44    1.00000000E+04  # M_U11
   45    1.00000000E+04  # M_U22
   46    2.49476183E+03  # M_U33
   47    1.00000000E+04  # M_D11
   48    1.00000000E+04  # M_D22
   49    3.44296232E+03  # M_D33
Block SMINPUTS  # SM parameters
         1     1.27908970E+02  # alpha_em^-1(MZ)^MSbar
         2     1.16637870E-05  # G_mu [GeV^-2]
         3     1.18400000E-01  # alpha_s(MZ)^MSbar
         4     9.11876000E+01  # m_Z(pole)
         5     4.18000000E+00  # m_b(m_b), MSbar
         6     1.73200000E+02  # m_t(pole)
         7     1.77700000E+00  # m_tau(pole)
         8     0.00000000E+00  # m_nu_3
        11     5.10998930E-04  # m_e(pole)
        12     0.00000000E+00  # m_nu_1
        13     1.05658372E-01  # m_muon(pole)
        14     0.00000000E+00  # m_nu_2
        21     5.00000000E-03  # m_d(2 GeV), MSbar
        22     2.50000000E-03  # m_u(2 GeV), MSbar
        23     9.50000000E-02  # m_s(2 GeV), MSbar
        24     1.27000000E+00  # m_c(m_c), MSbar
Block gauge Q=  3.29734915E+03  # (SUSY scale)
   1    3.55362975E-01  # g'(Q)^DRbar
   2    6.65198874E-01  # g(Q)^DRbar
   3    1.21977796E+00  # g3(Q)^DRbar
Block Yu Q=  3.29734915E+03  # (SUSY scale)
  1  1     8.38824251E-06   # Y_u(Q)^DRbar
  2  2     4.26122720E-03   # Y_c(Q)^DRbar
  3  3     1.01336707E+00   # Y_t(Q)^DRbar
Block Yd Q=  3.29734915E+03  # (SUSY scale)
  1  1     5.54682598E-04   # Y_d(Q)^DRbar
  2  2     1.05389694E-02   # Y_s(Q)^DRbar
  3  3     5.50071325E-01   # Y_b(Q)^DRbar
Block Ye Q=  3.29734915E+03  # (SUSY scale)
  1  1     9.67961695E-05   # Y_e(Q)^DRbar
  2  2     2.00143779E-02   # Y_mu(Q)^DRbar
  3  3     3.36608911E-01   # Y_tau(Q)^DRbar
Block Au Q=  3.29734915E+03  # (SUSY scale)
  1  1     0.00000000E+00   # A_u(Q)^DRbar
  2  2     0.00000000E+00   # A_c(Q)^DRbar
  3  3    -6.14056648E+03   # A_t(Q)^DRbar
Block Ad Q=  3.29734915E+03  # (SUSY scale)
  1  1     0.00000000E+00   # A_d(Q)^DRbar
  2  2     0.00000000E+00   # A_s(Q)^DRbar
  3  3    -1.74215431E+03   # A_b(Q)^DRbar
Block Ae Q=  3.29734915E+03  # (SUSY scale)
  1  1     0.00000000E+00   # A_e(Q)^DRbar
  2  2     0.00000000E+00   # A_mu(Q)^DRbar
  3  3     3.05285076E+02   # A_tau(Q)^DRbar
Block MSOFT Q=  3.29734915E+03  # soft SUSY breaking masses at Q
   1    2.15378582E+02  # M_1
   2   -1.19246132E+03  # M_2
   3    3.16079410E+03  # M_3
  21    2.04429374E+05  # M^2_(H,d)
  22    7.28412607E+04  # M^2_(H,u)
  31    1.00000000E+04  # M_(L,11)
  32    1.00000000E+04  # M_(L,22)
  33    1.00000000E+04  # M_(L,33)
  34    1.00000000E+04  # M_(E,11)
  35    1.00000000E+04  # M_(E,22)
  36    1.00000000E+04  # M_(E,33)
  41    1.00000000E+04  # M_(Q,11)
  42    1.00000000E+04  # M_(Q,22)
  43    4.24707945E+03  # M_(Q,33)
  44    1.00000000E+04  # M_(U,11)
  45    1.00000000E+04  # M_(U,22)
  46    2.49476183E+03  # M_(U,33)
  47    1.00000000E+04  # M_(D,11)
  48    1.00000000E+04  # M_(D,22)
  49    3.44296232E+03  # M_(D,33)
Block MASS  # Mass spectrum
#   PDG code      mass          particle
         6     1.73200000E+02  # m_t(pole)
        23     9.11876000E+01  # m_Z(pole)
        24     8.04299946E+01  # W+
        15     1.77700000E+00  # m_tau(pole)
        25     1.27484762E+02  # h0
        35     6.38692013E+02  # H0
        36     6.38642618E+02  # A0
        37     6.48030303E+02  # H+
   1000001     1.01023600E+04  # ~d_L
   2000001     1.00782091E+04  # ~d_R
   1000002     1.01019996E+04  # ~u_L
   2000002     1.00816314E+04  # ~u_R
   1000003     1.01023644E+04  # ~s_L
   2000003     1.00782166E+04  # ~s_R
   1000004     1.01020040E+04  # ~c_L
   2000004     1.00816327E+04  # ~c_R
   1000005     3.53657652E+03  # ~b_1
   2000005     4.27217660E+03  # ~b_2
   1000006     2.53941919E+03  # ~t_1
   2000006     4.28149534E+03  # ~t_2
   1000011     1.00208200E+04  # ~e_L-
   2000011     1.00086355E+04  # ~e_R-
   1000012     1.00200595E+04  # ~nu_eL
   1000013     1.00208395E+04  # ~mu_L-
   2000013     1.00086731E+04  # ~mu_R-
   1000014     1.00200788E+04  # ~nu_muL
   1000015     1.00192928E+04  # ~tau_1-
   2000015     1.00264118E+04  # ~tau_2-
   1000016     1.00255618E+04  # ~nu_tauL
   1000021     3.61600748E+03  # ~g
   1000022     2.03188830E+02  # ~chi_10
   1000023     2.60600614E+02  # ~chi_20
   1000025     2.79148109E+02  # ~chi_30
   1000035     1.28065517E+03  # ~chi_40
   1000024     2.60405288E+02  # ~chi_1+
   1000037     1.27979029E+03  # ~chi_2+
# Higgs mixing
Block alpha # Effective Higgs mixing angle
          -3.13382921E-02   # alpha
Block Hmix Q=  3.29734915E+03  # Higgs mixing parameters
   1   -2.53130786E+02  # mu
   2    3.29073807E+01  # tan[beta](Q)
   3    2.43129179E+02  # v(Q)
   4    4.07864394E+05  # m^2_A(Q)
Block stopmix # stop mixing matrix
   1  1     7.23291649E-02   # Re[R_st(1,1)]
   1  2     9.97380816E-01   # Re[R_st(1,2)]
   2  1    -9.97380816E-01   # Re[R_st(2,1)]
   2  2     7.23291649E-02   # Re[R_st(2,2)]
Block sbotmix # sbottom mixing matrix
   1  1    -2.39328417E-03   # Re[R_sb(1,1)]
   1  2     9.99997136E-01   # Re[R_sb(1,2)]
   2  1    -9.99997136E-01   # Re[R_sb(2,1)]
   2  2    -2.39328417E-03   # Re[R_sb(2,2)]
Block staumix # stau mixing matrix
   1  1    -1.09692084E-01   # Re[R_sta(1,1)]
   1  2     9.93965616E-01   # Re[R_sta(1,2)]
   2  1    -9.93965616E-01   # Re[R_sta(2,1)]
   2  2    -1.09692084E-01   # Re[R_sta(2,2)]
Block Nmix # neutralino mixing matrix
   1  1     8.86867240E-01   # Re[N(1,1)]
   1  2     1.46834119E-02   # Re[N(1,2)]
   1  3    -3.66610293E-01   # Re[N(1,3)]
   1  4    -2.80798485E-01   # Re[N(1,4)]
   2  1     6.80458681E-02   # Re[N(2,1)]
   2  2     5.69322446E-02   # Re[N(2,2)]
   2  3     7.05467874E-01   # Re[N(2,3)]
   2  4    -7.03166806E-01   # Re[N(2,4)]
   3  1     4.56981528E-01   # Re[N(3,1)]
   3  2    -3.25305082E-02   # Re[N(3,2)]
   3  3     6.06369757E-01   # Re[N(3,3)]
   3  4     6.49942587E-01   # Re[N(3,4)]
   4  1     2.03499898E-03   # Re[N(4,1)]
   4  2    -9.97739887E-01   # Re[N(4,2)]
   4  3     1.50893669E-02   # Re[N(4,3)]
   4  4    -6.54468243E-02   # Re[N(4,4)]
Block Umix # chargino mixing matrix
   1  1    -2.13345825E-02   # Re[U(1,1)]
   1  2    -9.99772392E-01   # Re[U(1,2)]
   2  1    -9.99772392E-01   # Re[U(2,1)]
   2  2     2.13345825E-02   # Re[U(2,2)]
Block Vmix # chargino mixing matrix
   1  1     9.25866363E-02   # Re[V(1,1)]
   1  2     9.95704632E-01   # Re[V(1,2)]
   2  1     9.95704632E-01   # Re[V(2,1)]
   2  2    -9.25866363E-02   # Re[V(2,2)]
DECAY        23     2.49520000E+00   # Z
DECAY        24     2.08500000E+00   # W
DECAY   2000011     5.02404884E+01   # ~e^-_R
#    BR                NDA      ID1      ID2
     7.86655685E-01    2     1000022        11   # BR(~e^-_R -> chi^0_1 e^-)
     4.62851527E-03    2     1000023        11   # BR(~e^-_R -> chi^0_2 e^-)
     2.08711752E-01    2     1000025        11   # BR(~e^-_R -> chi^0_3 e^-)
DECAY   1000011     1.40623786E+02   # ~e^-_L
#    BR                NDA      ID1      ID2
     7.47755304E-02    2     1000022        11   # BR(~e^-_L -> chi^0_1 e^-)
     2.72566872E-03    2     1000023        11   # BR(~e^-_L -> chi^0_2 e^-)
     1.40216301E-02    2     1000025        11   # BR(~e^-_L -> chi^0_3 e^-)
     3.01461492E-01    2     1000035        11   # BR(~e^-_L -> chi^0_4 e^-)
     2.85140677E-04    2    -1000024        12   # BR(~e^-_L -> chi^-_1 nu_e)
     6.06730538E-01    2    -1000037        12   # BR(~e^-_L -> chi^-_2 nu_e)
#    BR                NDA      ID1      ID2       ID3
DECAY   2000013     5.03999777E+01   # ~mu^-_R
#    BR                NDA      ID1      ID2
     7.84381817E-01    2     1000022        13   # BR(~mu^-_R -> chi^0_1 mu^-)
     5.40041459E-03    2     1000023        13   # BR(~mu^-_R -> chi^0_2 mu^-)
     2.08633024E-01    2     1000025        13   # BR(~mu^-_R -> chi^0_3 mu^-)
     1.57969993E-03    2    -1000024        14   # BR(~mu^-_R -> chi^-_1 nu_mu)
DECAY   1000013     1.40703824E+02   # ~mu^-_L
#    BR                NDA      ID1      ID2
     7.48093564E-02    2     1000022        13   # BR(~mu^-_L -> chi^0_1 mu^-)
     3.00620255E-03    2     1000023        13   # BR(~mu^-_L -> chi^0_2 mu^-)
     1.42220381E-02    2     1000025        13   # BR(~mu^-_L -> chi^0_3 mu^-)
     3.01290758E-01    2     1000035        13   # BR(~mu^-_L -> chi^0_4 mu^-)
     2.84979034E-04    2    -1000024        14   # BR(~mu^-_L -> chi^-_1 nu_mu)
     6.06386665E-01    2    -1000037        14   # BR(~mu^-_L -> chi^-_2 nu_mu)
#    BR                NDA      ID1      ID2       ID3
DECAY   1000015     9.62280123E+01   # ~tau^-_1
#    BR                NDA      ID1      ID2
     4.51064299E-01    2     1000022        15   # BR(~tau^-_1 -> chi^0_1 tau^-)
     1.20124474E-01    2     1000023        15   # BR(~tau^-_1 -> chi^0_2 tau^-)
     1.82200155E-01    2     1000025        15   # BR(~tau^-_1 -> chi^0_3 tau^-)
     4.31076294E-03    2     1000035        15   # BR(~tau^-_1 -> chi^0_4 tau^-)
     2.33618858E-01    2    -1000024        16   # BR(~tau^-_1 -> chi^-_1 nu_tau)
     8.68145029E-03    2    -1000037        16   # BR(~tau^-_1 -> chi^-_2 nu_tau)
DECAY   2000015     1.62450837E+02   # ~tau^-_2
#    BR                NDA      ID1      ID2
     7.84718742E-02    2     1000022        15   # BR(~tau^-_2 -> chi^0_1 tau^-)
     7.08818849E-02    2     1000023        15   # BR(~tau^-_2 -> chi^0_2 tau^-)
     7.09522835E-02    2     1000025        15   # BR(~tau^-_2 -> chi^0_3 tau^-)
     2.58618969E-01    2     1000035        15   # BR(~tau^-_2 -> chi^0_4 tau^-)
     6.37930746E-04    2    -1000024        16   # BR(~tau^-_2 -> chi^-_1 nu_tau)
     5.20437058E-01    2    -1000037        16   # BR(~tau^-_2 -> chi^-_2 nu_tau)
#    BR                NDA      ID1      ID2       ID3
DECAY   1000012     1.40627800E+02   # ~nu_e
#    BR                NDA      ID1      ID2
     6.60478146E-02    2     1000022        12   # BR(~nu_e -> chi^0_1 nu_e)
     1.32658899E-04    2     1000023        12   # BR(~nu_e -> chi^0_2 nu_e)
     2.39672934E-02    2     1000025        12   # BR(~nu_e -> chi^0_3 nu_e)
     3.02745105E-01    2     1000035        12   # BR(~nu_e -> chi^0_4 nu_e)
     5.36961463E-03    2     1000024        11   # BR(~nu_e -> chi^+_1 e^-)
     6.01737513E-01    2     1000037        11   # BR(~nu_e -> chi^+_2 e^-)
#    BR                NDA      ID1      ID2       ID3
DECAY   1000014     1.40707828E+02   # ~nu_mu
#    BR                NDA      ID1      ID2
     6.60103769E-02    2     1000022        14   # BR(~nu_mu -> chi^0_1 nu_mu)
     1.32583705E-04    2     1000023        14   # BR(~nu_mu -> chi^0_2 nu_mu)
     2.39537081E-02    2     1000025        14   # BR(~nu_mu -> chi^0_3 nu_mu)
     3.02573539E-01    2     1000035        14   # BR(~nu_mu -> chi^0_4 nu_mu)
     5.93303332E-03    2     1000024        13   # BR(~nu_mu -> chi^+_1 mu^-)
     6.01396759E-01    2     1000037        13   # BR(~nu_mu -> chi^+_2 mu^-)
#    BR                NDA      ID1      ID2       ID3
DECAY   1000016     1.63277915E+02   # ~nu_tau
#    BR                NDA      ID1      ID2
     5.69168687E-02    2     1000022        16   # BR(~nu_tau -> chi^0_1 nu_tau)
     1.14319203E-04    2     1000023        16   # BR(~nu_tau -> chi^0_2 nu_tau)
     2.06538913E-02    2     1000025        16   # BR(~nu_tau -> chi^0_3 nu_tau)
     2.60900621E-01    2     1000035        16   # BR(~nu_tau -> chi^0_4 nu_tau)
     1.42785648E-01    2     1000024        15   # BR(~nu_tau -> chi^+_1 tau^-)
     5.18628652E-01    2     1000037        15   # BR(~nu_tau -> chi^+_2 tau^-)
#    BR                NDA      ID1      ID2       ID3
DECAY   2000001     6.09494458E+02   # ~d_R
#    BR                NDA      ID1      ID2
     7.25505147E-03    2     1000022         1   # BR(~d_R -> chi^0_1 d)
     1.92492863E-03    2     1000025         1   # BR(~d_R -> chi^0_3 d)
     9.90777144E-01    2     1000021         1   # BR(~d_R -> ~g d)
DECAY   1000001     7.36737953E+02   # ~d_L
#    BR                NDA      ID1      ID2
     1.23742669E-03    2     1000022         1   # BR(~d_L -> chi^0_1 d)
     1.21096805E-04    2     1000023         1   # BR(~d_L -> chi^0_2 d)
     7.81926921E-04    2     1000025         1   # BR(~d_L -> chi^0_3 d)
     5.82091628E-02    2     1000035         1   # BR(~d_L -> chi^0_4 d)
     1.16813409E-01    2    -1000037         2   # BR(~d_L -> chi^-_2 u)
     8.22782108E-01    2     1000021         1   # BR(~d_L -> ~g d)
DECAY   2000003     6.09539533E+02   # ~s_R
#    BR                NDA      ID1      ID2
     7.25941355E-03    2     1000022         3   # BR(~s_R -> chi^0_1 s)
     1.93816288E-03    2     1000025         3   # BR(~s_R -> chi^0_3 s)
     9.90705050E-01    2     1000021         3   # BR(~s_R -> ~g s)
DECAY   1000003     7.36764306E+02   # ~s_L
#    BR                NDA      ID1      ID2
     1.24144074E-03    2     1000022         3   # BR(~s_L -> chi^0_1 s)
     1.36109947E-04    2     1000023         3   # BR(~s_L -> chi^0_2 s)
     7.92991518E-04    2     1000025         3   # BR(~s_L -> chi^0_3 s)
     5.82071140E-02    2     1000035         3   # BR(~s_L -> chi^0_4 s)
     1.16809326E-01    2    -1000037         4   # BR(~s_L -> chi^-_2 c)
     8.22753245E-01    2     1000021         3   # BR(~s_L -> ~g s)
DECAY   1000005     4.39713510E+01   # ~b_1
#    BR                NDA      ID1      ID2
     1.00071869E-01    2     1000022         5   # BR(~b_1 -> chi^0_1 b)
     2.38576468E-01    2     1000023         5   # BR(~b_1 -> chi^0_2 b)
     1.84720040E-01    2     1000025         5   # BR(~b_1 -> chi^0_3 b)
     4.76410596E-01    2    -1000024         6   # BR(~b_1 -> chi^-_1 t)
     1.23394161E-04    2    -1000037         6   # BR(~b_1 -> chi^-_2 t)
DECAY   2000005     2.62343122E+02   # ~b_2
#    BR                NDA      ID1      ID2
     1.45133655E-02    2     1000022         5   # BR(~b_2 -> chi^0_1 b)
     4.85620172E-02    2     1000023         5   # BR(~b_2 -> chi^0_2 b)
     3.67232306E-02    2     1000025         5   # BR(~b_2 -> chi^0_3 b)
     5.91708693E-02    2     1000035         5   # BR(~b_2 -> chi^0_4 b)
     3.26319068E-01    2    -1000024         6   # BR(~b_2 -> chi^-_1 t)
     1.21510657E-01    2    -1000037         6   # BR(~b_2 -> chi^-_2 t)
     1.03378523E-01    2     1000021         5   # BR(~b_2 -> ~g b)
     2.85126904E-01    2     1000006       -24   # BR(~b_2 -> ~t_1 W^-)
     2.08769068E-03    2     1000006       -37   # BR(~b_2 -> ~t_1 H^-)
     1.27869400E-03    2     1000005        36   # BR(~b_2 -> ~b_1 A^0)
     1.27862727E-03    2     1000005        35   # BR(~b_2 -> ~b_1 H^0)
DECAY   2000002     6.26691693E+02   # ~u_R
#    BR                NDA      ID1      ID2
     2.82334004E-02    2     1000022         2   # BR(~u_R -> chi^0_1 u)
     1.66119968E-04    2     1000023         2   # BR(~u_R -> chi^0_2 u)
     7.49083049E-03    2     1000025         2   # BR(~u_R -> chi^0_3 u)
     9.64109505E-01    2     1000021         2   # BR(~u_R -> ~g u)
DECAY   1000002     7.36722956E+02   # ~u_L
#    BR                NDA      ID1      ID2
     1.79676725E-03    2     1000022         2   # BR(~u_L -> chi^0_1 u)
     2.87374408E-04    2     1000023         2   # BR(~u_L -> chi^0_2 u)
     1.43779694E-04    2     1000025         2   # BR(~u_L -> chi^0_3 u)
     5.81236319E-02    2     1000035         2   # BR(~u_L -> chi^0_4 u)
     1.03345307E-03    2     1000024         1   # BR(~u_L -> chi^+_1 d)
     1.15862744E-01    2     1000037         1   # BR(~u_L -> chi^+_2 d)
     8.22752250E-01    2     1000021         2   # BR(~u_L -> ~g u)
DECAY   2000004     6.26699061E+02   # ~c_R
#    BR                NDA      ID1      ID2
     2.82335276E-02    2     1000022         4   # BR(~c_R -> chi^0_1 c)
     1.68987211E-04    2     1000023         4   # BR(~c_R -> chi^0_2 c)
     7.49319626E-03    2     1000025         4   # BR(~c_R -> chi^0_3 c)
     9.64098319E-01    2     1000021         4   # BR(~c_R -> ~g c)
DECAY   1000004     7.36749276E+02   # ~c_L
#    BR                NDA      ID1      ID2
     1.79709430E-03    2     1000022         4   # BR(~c_L -> chi^0_1 c)
     2.89810456E-04    2     1000023         4   # BR(~c_L -> chi^0_2 c)
     1.45863510E-04    2     1000025         4   # BR(~c_L -> chi^0_3 c)
     5.81215982E-02    2     1000035         4   # BR(~c_L -> chi^0_4 c)
     1.06357641E-03    2     1000024         3   # BR(~c_L -> chi^+_1 s)
     1.15858672E-01    2     1000037         3   # BR(~c_L -> chi^+_2 s)
     8.22723385E-01    2     1000021         4   # BR(~c_L -> ~g c)
DECAY   1000006     1.05856007E+02   # ~t_1
#    BR                NDA      ID1      ID2
     8.20276315E-02    2     1000022         6   # BR(~t_1 -> chi^0_1 t)
     2.34083967E-01    2     1000023         6   # BR(~t_1 -> chi^0_2 t)
     2.06160713E-01    2     1000025         6   # BR(~t_1 -> chi^0_3 t)
     2.59467971E-03    2     1000035         6   # BR(~t_1 -> chi^0_4 t)
     4.69811800E-01    2     1000024         5   # BR(~t_1 -> chi^+_1 b)
     5.31726451E-03    2     1000037         5   # BR(~t_1 -> chi^+_2 b)
#    BR                NDA      ID1      ID2       ID3
DECAY   2000006     2.81209820E+02   # ~t_2
#    BR                NDA      ID1      ID2
     2.38417125E-02    2     1000022         6   # BR(~t_2 -> chi^0_1 t)
     1.52945167E-01    2     1000023         6   # BR(~t_2 -> chi^0_2 t)
     1.33797827E-01    2     1000025         6   # BR(~t_2 -> chi^0_3 t)
     5.43296748E-02    2     1000035         6   # BR(~t_2 -> chi^0_4 t)
     9.58821672E-02    2     1000024         5   # BR(~t_2 -> chi^+_1 b)
     1.07415074E-01    2     1000037         5   # BR(~t_2 -> chi^+_2 b)
     9.15281951E-02    2     1000021         6   # BR(~t_2 -> ~g t)
     2.41031336E-03    2     1000005        37   # BR(~t_2 -> ~b_1 H^+)
     1.33996835E-01    2     1000006        23   # BR(~t_2 -> ~t_1 Z)
     9.84125221E-04    2     1000006        36   # BR(~t_2 -> ~t_1 A^0)
     2.01844847E-01    2     1000006        25   # BR(~t_2 -> ~t_1 h^0)
     9.89975329E-04    2     1000006        35   # BR(~t_2 -> ~t_1 H^0)
DECAY   1000024     1.99256688E-04   # chi^+_1
#    BR                NDA      ID1      ID2       ID3
     3.33673672E-01    3     1000022        -1         2   # BR(chi^+_1 -> chi^0_1 d_bar u)
     3.33050160E-01    3     1000022        -3         4   # BR(chi^+_1 -> chi^0_1 s_bar c)
     1.11223930E-01    3     1000022       -11        12   # BR(chi^+_1 -> chi^0_1 e^+ nu_e)
     1.11223764E-01    3     1000022       -13        14   # BR(chi^+_1 -> chi^0_1 mu^+ nu_mu)
     1.10828474E-01    3     1000022       -15        16   # BR(chi^+_1 -> chi^0_1 tau^+ nu_tau)
DECAY   1000037     1.73410140E+01   # chi^+_2
#    BR                NDA      ID1      ID2
     3.21492363E-02    2     1000022        24   # BR(chi^+_2 -> chi^0_1 W^+)
     1.63700327E-01    2     1000023        24   # BR(chi^+_2 -> chi^0_2 W^+)
     1.30370757E-01    2     1000025        24   # BR(chi^+_2 -> chi^0_3 W^+)
     2.20601213E-02    2          37   1000022   # BR(chi^+_2 -> H^+ chi^0_1)
     8.81772790E-02    2          37   1000023   # BR(chi^+_2 -> H^+ chi^0_2)
     6.08147619E-02    2          37   1000025   # BR(chi^+_2 -> H^+ chi^0_3)
     1.61675021E-01    2     1000024        23   # BR(chi^+_2 -> chi^+_1 Z)
     8.41634874E-02    2     1000024        36   # BR(chi^+_2 -> chi^+_1 A^0)
     1.60959144E-01    2     1000024        25   # BR(chi^+_2 -> chi^+_1 h^0)
     8.37574442E-02    2     1000024        35   # BR(chi^+_2 -> chi^+_1 H^0)
#    BR                NDA      ID1      ID2       ID3
     4.39642954E-03    3     1000024         6        -6   # BR(chi^+_2 -> chi^+_1 t t_bar)
     7.94658263E-04    3     1000022        -5         6   # BR(chi^+_2 -> chi^0_1 b_bar t)
     3.80015588E-03    3     1000023        -5         6   # BR(chi^+_2 -> chi^0_2 b_bar t)
     3.17919697E-03    3     1000025        -5         6   # BR(chi^+_2 -> chi^0_3 b_bar t)
DECAY   1000022     0.00000000E+00   # chi^0_1
DECAY   1000023     5.01785996E-04   # chi^0_2
#    BR                NDA      ID1      ID2
     7.35222779E-03    2     1000022        22   # BR(chi^0_2 -> chi^0_1 photon)
#    BR                NDA      ID1      ID2       ID3
     1.18736096E-01    3     1000022         2        -2   # BR(chi^0_2 -> chi^0_1 u u_bar)
     1.18098210E-01    3     1000022         4        -4   # BR(chi^0_2 -> chi^0_1 c c_bar)
     1.52242673E-01    3     1000022         1        -1   # BR(chi^0_2 -> chi^0_1 d d_bar)
     1.52238809E-01    3     1000022         3        -3   # BR(chi^0_2 -> chi^0_1 s s_bar)
     1.45066070E-01    3     1000022         5        -5   # BR(chi^0_2 -> chi^0_1 b b_bar)
     3.43559609E-02    3     1000022        11       -11   # BR(chi^0_2 -> chi^0_1 e^- e^+)
     3.43545649E-02    3     1000022        13       -13   # BR(chi^0_2 -> chi^0_1 mu^- mu^+)
     3.39639217E-02    3     1000022        15       -15   # BR(chi^0_2 -> chi^0_1 tau^- tau^+)
     2.03591466E-01    3     1000022        12       -12   # BR(chi^0_2 -> chi^0_1 nu_e nu_bar_e)
DECAY   1000025     3.61924206E-05   # chi^0_3
#    BR                NDA      ID1      ID2
     3.55386492E-03    2     1000022        22   # BR(chi^0_3 -> chi^0_1 photon)
     2.10248157E-02    2     1000023        22   # BR(chi^0_3 -> chi^0_2 photon)
#    BR                NDA      ID1      ID2       ID3
     8.34253903E-02    3     1000022         2        -2   # BR(chi^0_3 -> chi^0_1 u u_bar)
     8.32247890E-02    3     1000022         4        -4   # BR(chi^0_3 -> chi^0_1 c c_bar)
     1.06940515E-01    3     1000022         1        -1   # BR(chi^0_3 -> chi^0_1 d d_bar)
     1.06939285E-01    3     1000022         3        -3   # BR(chi^0_3 -> chi^0_1 s s_bar)
     1.04900660E-01    3     1000022         5        -5   # BR(chi^0_3 -> chi^0_1 b b_bar)
     2.41118270E-02    3     1000022        11       -11   # BR(chi^0_3 -> chi^0_1 e^- e^+)
     2.41113376E-02    3     1000022        13       -13   # BR(chi^0_3 -> chi^0_1 mu^- mu^+)
     2.39662406E-02    3     1000022        15       -15   # BR(chi^0_3 -> chi^0_1 tau^- tau^+)
     1.43050616E-01    3     1000022        12       -12   # BR(chi^0_3 -> chi^0_1 nu_e nu_bar_e)
     1.84072800E-02    3     1000023         2        -2   # BR(chi^0_3 -> chi^0_2 u u_bar)
     1.73016632E-02    3     1000023         4        -4   # BR(chi^0_3 -> chi^0_2 c c_bar)
     2.36018461E-02    3     1000023         1        -1   # BR(chi^0_3 -> chi^0_2 d d_bar)
     2.35947595E-02    3     1000023         3        -3   # BR(chi^0_3 -> chi^0_2 s s_bar)
     1.29449106E-02    3     1000023         5        -5   # BR(chi^0_3 -> chi^0_2 b b_bar)
     5.32631027E-03    3     1000023        11       -11   # BR(chi^0_3 -> chi^0_2 e^- e^+)
     5.32378600E-03    3     1000023        13       -13   # BR(chi^0_3 -> chi^0_2 mu^- mu^+)
     4.66468111E-03    3     1000023        15       -15   # BR(chi^0_3 -> chi^0_2 tau^- tau^+)
     3.15624904E-02    3     1000023        12       -12   # BR(chi^0_3 -> chi^0_2 nu_e nu_bar_e)
     2.22735100E-02    3     1000024         1        -2   # BR(chi^0_3 -> chi^+_1 d u_bar)
     2.22735100E-02    3    -1000024        -1         2   # BR(chi^0_3 -> chi^-_1 d_bar u)
     2.17804565E-02    3     1000024         3        -4   # BR(chi^0_3 -> chi^+_1 s c_bar)
     2.17804565E-02    3    -1000024        -3         4   # BR(chi^0_3 -> chi^-_1 s_bar c)
     7.42452422E-03    3     1000024        11       -12   # BR(chi^0_3 -> chi^+_1 e^- nu_bar_e)
     7.42452422E-03    3    -1000024       -11        12   # BR(chi^0_3 -> chi^-_1 e^+ nu_e)
     7.42444744E-03    3     1000024        13       -14   # BR(chi^0_3 -> chi^+_1 mu^- nu_bar_mu)
     7.42444744E-03    3    -1000024       -13        14   # BR(chi^0_3 -> chi^-_1 mu^+ nu_mu)
     7.10852820E-03    3     1000024        15       -16   # BR(chi^0_3 -> chi^+_1 tau^- nu_bar_tau)
     7.10852820E-03    3    -1000024       -15        16   # BR(chi^0_3 -> chi^-_1 tau^+ nu_tau)
DECAY   1000035     1.86250488E+01   # chi^0_4
#    BR                NDA      ID1      ID2
     1.52865230E-01    2     1000024       -24   # BR(chi^0_4 -> chi^+_1 W^-)
     1.52865230E-01    2    -1000024        24   # BR(chi^0_4 -> chi^-_1 W^+)
     8.18399788E-02    2          37  -1000024   # BR(chi^0_4 -> H^+ chi^-_1)
     8.18399788E-02    2         -37   1000024   # BR(chi^0_4 -> H^- chi^+_1)
     2.04175436E-02    2     1000022        23   # BR(chi^0_4 -> chi^0_1 Z)
     4.25685982E-02    2     1000023        23   # BR(chi^0_4 -> chi^0_2 Z)
     8.92012959E-02    2     1000025        23   # BR(chi^0_4 -> chi^0_3 Z)
     6.02024749E-03    2     1000022        36   # BR(chi^0_4 -> chi^0_1 A^0)
     2.08892102E-02    2     1000023        36   # BR(chi^0_4 -> chi^0_2 A^0)
     1.28119343E-02    2     1000025        36   # BR(chi^0_4 -> chi^0_3 A^0)
     1.73985121E-02    2     1000022        25   # BR(chi^0_4 -> chi^0_1 h^0)
     1.07764495E-01    2     1000023        25   # BR(chi^0_4 -> chi^0_2 h^0)
     7.85494838E-02    2     1000025        25   # BR(chi^0_4 -> chi^0_3 h^0)
     1.59536002E-02    2     1000022        35   # BR(chi^0_4 -> chi^0_1 H^0)
     5.74404541E-02    2     1000023        35   # BR(chi^0_4 -> chi^0_2 H^0)
     4.95281303E-02    2     1000025        35   # BR(chi^0_4 -> chi^0_3 H^0)
#    BR                NDA      ID1      ID2       ID3
     3.82441722E-04    3     1000022         6        -6   # BR(chi^0_4 -> chi^0_1 t t_bar)
     1.88546075E-03    3     1000023         6        -6   # BR(chi^0_4 -> chi^0_2 t t_bar)
     1.44728947E-03    3     1000025         6        -6   # BR(chi^0_4 -> chi^0_3 t t_bar)
     4.15058755E-03    3     1000024         5        -6   # BR(chi^0_4 -> chi^+_1 b t_bar)
     4.15058755E-03    3    -1000024        -5         6   # BR(chi^0_4 -> chi^-_1 b_bar t)
DECAY   1000021     2.69451425E+01   # ~g
#    BR                NDA      ID1      ID2
     3.89387473E-04    2     1000006        -4   # BR(~g -> ~t_1 c_bar)
     3.89387473E-04    2    -1000006         4   # BR(~g -> ~t^*_1 c)
     4.91870609E-01    2     1000006        -6   # BR(~g -> ~t_1 t_bar)
     4.91870609E-01    2    -1000006         6   # BR(~g -> ~t^*_1 t)
     3.74559241E-03    2     1000005        -5   # BR(~g -> ~b_1 b_bar)
     3.74559241E-03    2    -1000005         5   # BR(~g -> ~b^*_1 b)
#    BR                NDA      ID1      ID2       ID3
     2.01084888E-04    3     1000022         6        -6   # BR(~g -> chi^0_1 t t_bar)
     1.09138491E-04    3     1000022         5        -5   # BR(~g -> chi^0_1 b b_bar)
     1.20683938E-03    3     1000023         6        -6   # BR(~g -> chi^0_2 t t_bar)
     3.59190773E-04    3     1000023         5        -5   # BR(~g -> chi^0_2 b b_bar)
     1.03059040E-03    3     1000025         6        -6   # BR(~g -> chi^0_3 t t_bar)
     2.71206396E-04    3     1000025         5        -5   # BR(~g -> chi^0_3 b b_bar)
     3.13218681E-04    3     1000035         6        -6   # BR(~g -> chi^0_4 t t_bar)
     3.53589059E-04    3     1000035         5        -5   # BR(~g -> chi^0_4 b b_bar)
     1.59836944E-03    3     1000024         5        -6   # BR(~g -> chi^+_1 b t_bar)
     1.59836944E-03    3    -1000024        -5         6   # BR(~g -> chi^-_1 b_bar t)
     3.51598128E-04    3     1000037         5        -6   # BR(~g -> chi^+_2 b t_bar)
     3.51598128E-04    3    -1000037        -5         6   # BR(~g -> chi^-_2 b_bar t)
DECAY        25     4.23883363E-03   # Gamma(h0)
     2.33629591E-03   2        22        22   # BR(h0 -> photon photon)
     1.70107894E-03   2        22        23   # BR(h0 -> photon Z)
     3.42982966E-02   2        23        23   # BR(h0 -> Z Z)
     2.70171030E-01   2       -24        24   # BR(h0 -> W W)
     6.98548440E-02   2        21        21   # BR(h0 -> gluon gluon)
     4.81797637E-09   2       -11        11   # BR(h0 -> Electron electron)
     2.14313480E-04   2       -13        13   # BR(h0 -> Muon muon)
     6.17966123E-02   2       -15        15   # BR(h0 -> Tau tau)
     1.20693779E-07   2        -2         2   # BR(h0 -> Up up)
     2.34249677E-02   2        -4         4   # BR(h0 -> Charm charm)
     5.56054147E-07   2        -1         1   # BR(h0 -> Down down)
     2.01112022E-04   2        -3         3   # BR(h0 -> Strange strange)
     5.36000767E-01   2        -5         5   # BR(h0 -> Bottom bottom)
DECAY        35     1.12098599E+01   # Gamma(HH)
     1.72393275E-07   2        22        22   # BR(HH -> photon photon)
     1.17725795E-07   2        22        23   # BR(HH -> photon Z)
     1.37971858E-05   2        23        23   # BR(HH -> Z Z)
     2.68772431E-05   2       -24        24   # BR(HH -> W W)
     1.11671054E-04   2        21        21   # BR(HH -> gluon gluon)
     9.67622532E-09   2       -11        11   # BR(HH -> Electron electron)
     4.30627171E-04   2       -13        13   # BR(HH -> Muon muon)
     1.24335870E-01   2       -15        15   # BR(HH -> Tau tau)
     1.42689286E-13   2        -2         2   # BR(HH -> Up up)
     2.76677915E-08   2        -4         4   # BR(HH -> Charm charm)
     1.41761712E-03   2        -6         6   # BR(HH -> Top top)
     8.76490680E-07   2        -1         1   # BR(HH -> Down down)
     3.17009635E-04   2        -3         3   # BR(HH -> Strange strange)
     8.40105298E-01   2        -5         5   # BR(HH -> Bottom bottom)
     1.06817630E-03   2  -1000024   1000024   # BR(HH -> Chargino1 chargino1)
     6.78467017E-03   2   1000022   1000022   # BR(HH -> neutralino1 neutralino1)
     1.66055496E-02   2   1000022   1000023   # BR(HH -> neutralino1 neutralino2)
     1.92120627E-03   2   1000022   1000025   # BR(HH -> neutralino1 neutralino3)
     3.45952516E-05   2   1000023   1000023   # BR(HH -> neutralino2 neutralino2)
     4.47666415E-03   2   1000023   1000025   # BR(HH -> neutralino2 neutralino3)
     2.19550110E-03   2   1000025   1000025   # BR(HH -> neutralino3 neutralino3)
     1.53665109E-04   2        25        25   # BR(HH -> h0 h0)
DECAY        36     1.10479541E+01   # Gamma(A0)
     2.28160147E-07   2        22        22   # BR(A0 -> photon photon)
     1.01872421E-07   2        22        23   # BR(A0 -> photon Z)
     1.53083863E-04   2        21        21   # BR(A0 -> gluon gluon)
     9.65082255E-09   2       -11        11   # BR(A0 -> Electron electron)
     4.29496724E-04   2       -13        13   # BR(A0 -> Muon muon)
     1.24013437E-01   2       -15        15   # BR(A0 -> Tau tau)
     1.26358702E-13   2        -2         2   # BR(A0 -> Up up)
     2.44973828E-08   2        -4         4   # BR(A0 -> Charm charm)
     1.80785489E-03   2        -6         6   # BR(A0 -> Top top)
     8.74198808E-07   2        -1         1   # BR(A0 -> Down down)
     3.16180739E-04   2        -3         3   # BR(A0 -> Strange strange)
     8.37964302E-01   2        -5         5   # BR(A0 -> Bottom bottom)
     2.94139667E-03   2  -1000024   1000024   # BR(A0 -> Chargino1 chargino1)
     1.03811880E-02   2   1000022   1000022   # BR(A0 -> neutralino1 neutralino1)
     9.45214375E-03   2   1000022   1000023   # BR(A0 -> neutralino1 neutralino2)
     3.64415886E-03   2   1000022   1000025   # BR(A0 -> neutralino1 neutralino3)
     1.04449905E-04   2   1000023   1000023   # BR(A0 -> neutralino2 neutralino2)
     1.72453208E-03   2   1000023   1000025   # BR(A0 -> neutralino2 neutralino3)
     7.04334947E-03   2   1000025   1000025   # BR(A0 -> neutralino3 neutralino3)
     2.31869502E-05   2        23        25   # BR(A0 -> Z h0)
     3.71015170E-38   2        25        25   # BR(A0 -> h0 h0)
DECAY        37     1.04944179E+01   # Gamma(Hp)
     1.17810326E-08   2       -11        12   # BR(Hp -> Electron nu_e)
     5.03675913E-04   2       -13        14   # BR(Hp -> Muon nu_mu)
     1.42466154E-01   2       -15        16   # BR(Hp -> Tau nu_tau)
     9.29758133E-07   2        -1         2   # BR(Hp -> Down up)
     1.53805703E-05   2        -3         2   # BR(Hp -> Strange up)
     9.75591413E-06   2        -5         2   # BR(Hp -> Bottom up)
     4.40628019E-08   2        -1         4   # BR(Hp -> Down charm)
     3.35085079E-04   2        -3         4   # BR(Hp -> Strange charm)
     1.36616706E-03   2        -5         4   # BR(Hp -> Bottom charm)
     1.43211723E-07   2        -1         6   # BR(Hp -> Down top)
     3.54433615E-06   2        -3         6   # BR(Hp -> Strange top)
     8.17671343E-01   2        -5         6   # BR(Hp -> Bottom top)
     3.30626206E-02   2   1000022   1000024   # BR(Hp -> neutralino1 chargino1)
     6.00711762E-04   2   1000023   1000024   # BR(Hp -> neutralino2 chargino1)
     3.93836844E-03   2   1000024   1000025   # BR(Hp -> chargino1 neutralino3)
     2.60457723E-05   2        24        25   # BR(Hp -> W h0)
     9.08852865E-09   2        24        35   # BR(Hp -> W HH)
     9.33118104E-09   2        24        36   # BR(Hp -> W A0)
DECAY         6     2.43000000E+00   # top
#    BR                NDA      ID1      ID2
     1.00000000E+00    2           5        24   # BR(t -> b W)
Block HiggsBoundsInputHiggsCouplingsFermions
# ScalarNormEffCoupSq PseudoSNormEffCoupSq NP IP1 IP2 IP2
    1.06413314E+00    0.00000000E+00        3  25   5   5  # h0-b-b eff. coupling^2, normalised to SM
    1.08283157E+03    0.00000000E+00        3  35   5   5  # H0-b-b eff. coupling^2, normalised to SM
    0.00000000E+00    1.08289570E+03        3  36   5   5  # A0-b-b eff. coupling^2, normalised to SM
#
    9.99940776E-01    0.00000000E+00        3  25   6   6  # h0-t-t eff. coupling^2, normalised to SM
    9.82673707E-04    0.00000000E+00        3  35   6   6  # H0-t-t eff. coupling^2, normalised to SM
    0.00000000E+00    9.23449965E-04        3  36   6   6  # A0-t-t eff. coupling^2, normalised to SM
#
    1.06413314E+00    0.00000000E+00        3  25  15  15  # h0-tau-tau eff. coupling^2, normalised to SM
    1.08283157E+03    0.00000000E+00        3  35  15  15  # H0-tau-tau eff. coupling^2, normalised to SM
    0.00000000E+00    1.08289570E+03        3  36  15  15  # A0-tau-tau eff. coupling^2, normalised to SM
#
Block HiggsBoundsInputHiggsCouplingsBosons
    9.99999080E-01        3  25  24  24  # h0-W-W eff. coupling^2, normalised to SM
    9.20297285E-07        3  35  24  24  # H0-W-W eff. coupling^2, normalised to SM
    0.00000000E+00        3  36  24  24  # A0-W-W eff. coupling^2, normalised to SM
#
    9.99999080E-01        3  25  23  23  # h0-Z-Z eff. coupling^2, normalised to SM
    9.20297285E-07        3  35  23  23  # H0-Z-Z eff. coupling^2, normalised to SM
    0.00000000E+00        3  36  23  23  # A0-Z-Z eff. coupling^2, normalised to SM
#
    1.25436370E+00        3  25  21  21  # h0-g-g eff. coupling^2, normalised to SM
    2.64769379E-02        3  35  21  21  # H0-g-g eff. coupling^2, normalised to SM
    1.47709724E-01        3  36  21  21  # A0-g-g eff. coupling^2, normalised to SM
#
    0.00000000E+00        3  25  25  23  # h0-h0-Z eff. coupling^2, normalised to SM
    0.00000000E+00        3  35  25  23  # H0-h0-Z eff. coupling^2, normalised to SM
    9.20297285E-07        3  36  25  23  # A0-h0-Z eff. coupling^2, normalised to SM
    0.00000000E+00        3  35  35  23  # H0-H0-Z eff. coupling^2, normalised to SM
    9.99999080E-01        3  36  35  23  # A0-H0-Z eff. coupling^2, normalised to SM
    0.00000000E+00        3  36  36  23  # A0-A0-Z eff. coupling^2, normalised to SM
#
    0.00000000E+00        4  25  21  21  23  # h0-g-g-Z eff. coupling^2, normalised to SM
    0.00000000E+00        4  35  21  21  23  # H0-g-g-Z eff. coupling^2, normalised to SM
    0.00000000E+00        4  36  21  21  23  # A0-g-g-Z eff. coupling^2, normalised to SM
Block SPhenoLowEnergy  # low energy observables
    1    4.02893085E-04   # BR(b -> s gamma)
    2    1.58848537E-06   # BR(b -> s mu+ mu-)
    3    3.52520875E-05   # BR(b -> s nu nu)
    4    1.27545771E-15   # BR(Bd -> e+ e-)
    5    5.44823051E-11   # BR(Bd -> mu+ mu-)
    6    1.11842853E-08   # BR(Bd -> tau+ tau-)
    7    4.33003242E-14   # BR(Bs -> e+ e-)
    8    1.84966637E-09   # BR(Bs -> mu+ mu-)
    9    3.85134500E-07   # BR(Bs -> tau+ tau-)
   10    8.06614978E-05   # BR(B_u -> tau nu)
   11    8.33202391E-01   # BR(B_u -> tau nu)/BR(B_u -> tau nu)_SM
   12    5.42152476E-01   # |Delta(M_Bd)| [ps^-1] 
   13    1.92956306E+01   # |Delta(M_Bs)| [ps^-1] 
   14    0.00000000E+00   # neutron EDM according to the chiral quark model
   15    0.00000000E+00   # neutron EDM according to the relativistic quark-parton model
   16    2.15895394E-03   # epsilon_K
   17    2.28169369E-15   # Delta(M_K)
   18    2.48041705E-11   # BR(K^0 -> pi^0 nu nu)
   19    8.29122926E-11   # BR(K^+ -> pi^+ nu nu)
   20    3.04621164E-16   # Delta(g-2)_electron/2
   21    1.30235365E-11   # Delta(g-2)_muon/2
   22    3.68600111E-09   # Delta(g-2)_tau/2
   23    0.00000000E+00   # electric dipole moment of the electron
   24    0.00000000E+00   # electric dipole moment of the muon
   25    0.00000000E+00   # electric dipole moment of the tau
   26    0.00000000E+00   # Br(mu -> e gamma)
   27    0.00000000E+00   # Br(tau -> e gamma)
   28    0.00000000E+00   # Br(tau -> mu gamma)
   29    0.00000000E+00   # Br(mu -> 3 e)
   30    0.00000000E+00   # Br(tau -> 3 e)
   31    0.00000000E+00   # Br(tau -> 3 mu)
   39    6.56657895E-05   # Delta(rho_parameter)
   40    0.00000000E+00   # BR(Z -> e mu)
   41    0.00000000E+00   # BR(Z -> e tau)
   42    0.00000000E+00   # BR(Z -> mu tau)
Block FWCOEF Q=  1.60000000E+02  # Wilson coefficients at scale Q
#    id        order  M        value         comment
     0305 4422   00   0    -1.88819110E-01   # C7
     0305 4422   00   2    -2.71650382E-01   # C7
     0305 4322   00   2    -1.37871679E-03   # C7'
     0305 6421   00   0    -9.52278348E-02   # C8
     0305 6421   00   2    -1.76009833E-01   # C8
     0305 6321   00   2    -1.44191753E-03   # C8'
 03051111 4133   00   0     1.62001113E+00   # C9 e+e-
 03051111 4133   00   2     1.62026972E+00   # C9 e+e-
 03051111 4233   00   2     4.93035903E-06   # C9' e+e-
 03051111 4137   00   0    -4.44270323E+00   # C10 e+e-
 03051111 4137   00   2    -4.44097864E+00   # C10 e+e-
 03051111 4237   00   2    -3.54670906E-05   # C10' e+e-
 03051313 4133   00   0     1.62001113E+00   # C9 mu+mu-
 03051313 4133   00   2     1.62026955E+00   # C9 mu+mu-
 03051313 4233   00   2     4.89993256E-06   # C9' mu+mu-
 03051313 4137   00   0    -4.44270323E+00   # C10 mu+mu-
 03051313 4137   00   2    -4.44097881E+00   # C10 mu+mu-
 03051313 4237   00   2    -3.54368342E-05   # C10' mu+mu-
 03051212 4137   00   0     1.50535012E+00   # C11 nu_1 nu_1
 03051212 4137   00   2     1.50497790E+00   # C11 nu_1 nu_1
 03051212 4237   00   2     7.68004775E-06   # C11' nu_1 nu_1
 03051414 4137   00   0     1.50535012E+00   # C11 nu_2 nu_2
 03051414 4137   00   2     1.50497790E+00   # C11 nu_2 nu_2
 03051414 4237   00   2     7.68663050E-06   # C11' nu_2 nu_2
 03051616 4137   00   0     1.50535012E+00   # C11 nu_3 nu_3
 03051616 4137   00   2     1.50497790E+00   # C11 nu_3 nu_3
 03051616 4237   00   2     9.54169171E-06   # C11' nu_3 nu_3
Block IMFWCOEF Q=  1.60000000E+02  # Im(Wilson coefficients) at scale Q
#    id        order  M        value         comment
     0305 4422   00   0     3.85805624E-07   # C7
     0305 4422   00   2     4.11365376E-06   # C7
     0305 4322   00   2    -2.23475526E-06   # C7'
     0305 6421   00   0     3.30468032E-07   # C8
     0305 6421   00   2     1.16769442E-05   # C8
     0305 6321   00   2    -9.26599417E-07   # C8'
 03051111 4133   00   2    -7.09493858E-07   # C9 e+e-
 03051111 4233   00   2     4.87855324E-06   # C9' e+e-
 03051111 4137   00   2     7.65545529E-06   # C10 e+e-
 03051111 4237   00   2    -3.64503771E-05   # C10' e+e-
 03051313 4133   00   2    -7.09495350E-07   # C9 mu+mu-
 03051313 4233   00   2     4.87855241E-06   # C9' mu+mu-
 03051313 4137   00   2     7.65545752E-06   # C10 mu+mu-
 03051313 4237   00   2    -3.64503796E-05   # C10' mu+mu-
 03051212 4137   00   2    -1.63525711E-06   # C11 nu_1 nu_1
 03051212 4237   00   2     7.89377686E-06   # C11' nu_1 nu_1
 03051414 4137   00   2    -1.63525703E-06   # C11 nu_2 nu_2
 03051414 4237   00   2     7.89377686E-06   # C11' nu_2 nu_2
 03051616 4137   00   2    -1.63523325E-06   # C11 nu_3 nu_3
 03051616 4237   00   2     7.89377684E-06   # C11' nu_3 nu_3
