BLOCK SPINFO
   1   SPheno
   2   v4.0.5be

BLOCK SPHENOINFO
   1   2
   2   2

BLOCK MODSEL
   1   0

BLOCK MINPAR
   3    33.885628
   4    1

BLOCK EXTPAR
   0    3816.3263
   1    1151.4678
   2   -3845.6979
   3    2663.5452
   11   -6182.0694
   12   -787.36212
   13    6317.3589
   23    4014.5058
   25    32.606458
   26    2370.7602
   31    2358.3535
   32    2358.3535
   33    3456.6719
   34    2646.3728
   35    2646.3728
   36    2411.1421
   41    2074.2751
   42    2074.2751
   43    3056.98
   44    2116.5914
   45    2116.5914
   46    4624.8219
   47    885.85412
   48    885.85412
   49    3650.4003

BLOCK SMINPUTS
   1    127.90897
   2    1.1663787e-05
   3    0.1184
   4    91.1876
   5    4.18
   6    173.2
   7    1.777
   8    0
   11    0.00051099893
   12    0
   13    0.10565837
   14    0
   21    0.005
   22    0.0025
   23    0.095
   24    1.27

BLOCK GAUGE Q=  3816.3263
   1    0.35536298
   2    0.66519887
   3    1.219778

BLOCK YU Q=  3816.3263
   1   1    8.3883143e-06
   2   2    0.0042612637
   3   3    1.0133757

BLOCK YD Q=  3816.3263
   1   1    0.00054961498
   2   2    0.010442685
   3   3    0.54504584

BLOCK YE Q=  3816.3263
   1   1    9.5911834e-05
   2   2    0.019831525
   3   3    0.33353363

BLOCK AU Q=  3816.3263
   1   1    0
   2   2    0
   3   3   -6182.0693

BLOCK AD Q=  3816.3263
   1   1    0
   2   2    0
   3   3   -787.36218

BLOCK AE Q=  3816.3263
   1   1    0
   2   2    0
   3   3    6317.3589

BLOCK MSOFT Q=  3816.3263
   1    1151.4678
   2   -3845.6979
   3    2663.5452
   21   -10566147
   22   -15933816
   31    2358.3535
   32    2358.3535
   33    3456.6719
   34    2646.3728
   35    2646.3728
   36    2411.1421
   41    2074.2751
   42    2074.2751
   43    3056.98
   44    2116.5914
   45    2116.5914
   46    4624.8219
   47    885.85412
   48    885.85412
   49    3650.4003

BLOCK MASS
   6    173.2
   23    91.1876
   24    80.429995
   15    1.777
   25    124.83874
   35    2370.6744
   36    2370.7602
   37    2372.3187
   1000001    2274.545
   2000001    1142.3766
   1000002    2273.2001
   2000002    2269.3553
   1000003    2274.5443
   2000003    1142.3721
   1000004    2273.1994
   2000004    2269.3547
   1000005    3181.0345
   2000005    3734.7934
   1000006    3174.4567
   2000006    4587.9809
   1000011    2395.9641
   2000011    2654.2569
   1000012    2394.2698
   1000013    2395.9229
   2000013    2654.2409
   1000014    2394.2544
   1000015    2405.976
   2000015    3479.5213
   1000016    3476.912
   1000021    2839.1122
   1000022    1136.0364
   1000023   -3778.4377
   1000025    3999.204
   1000035   -4011.1323
   1000024    3778.5061
   1000037    4011.5604

BLOCK ALPHA
      -0.029580043

BLOCK HMIX Q=  3816.3263
   1    4014.5058
   2    32.606458
   3    242.98646
   4    5620503.8

BLOCK STOPMIX
   1   1    0.99688065
   1   2    0.078923831
   2   1   -0.078923831
   2   2    0.99688065

BLOCK SBOTMIX
   1   1    0.99822387
   1   2    0.059574369
   2   1   -0.059574369
   2   2    0.99822387

BLOCK STAUMIX
   1   1    0.032699123
   1   2    0.99946524
   2   1   -0.99946524
   2   2    0.032699123

BLOCK NMIX
   1   1   -0.99991957
   1   2   -7.0726325e-05
   1   3   -0.012092603
   1   4    0.0038230926
   2   1   -0.0013600987
   2   2   -0.97296994
   2   3    0.16818465
   2   4    0.15824526
   3   1    0.011254056
   3   2   -0.0072202744
   3   3   -0.7069891
   3   4    0.70709804
   4   1   -0.0056875699
   4   2    0.23081887
   4   3    0.68682902
   4   4    0.68917065

BLOCK UMIX
   1   1   -0.97288641
   1   2    0.23128344
   2   1   -0.23128344
   2   2   -0.97288641

BLOCK VMIX
   1   1    0.9761537
   1   2    0.21708052
   2   1    0.21708052
   2   2   -0.9761537

BLOCK HIGGSBOUNDSINPUTHIGGSCOUPLINGSFERMIONS
       0, 1063.1811,3,36,15,15

BLOCK HIGGSBOUNDSINPUTHIGGSCOUPLINGSBOSONS
       0,4,36,21,21,23

BLOCK SPHENOLOWENERGY
   1    0.0003236356
   2    1.5900961e-06
   3    3.5259372e-05
   4    2.1086194e-15
   5    9.0077506e-11
   6    1.8838005e-08
   7    7.0329831e-14
   8    3.0044786e-09
   9    6.3670593e-07
   10    9.5958535e-05
   11    0.99121493
   12    0.54161704
   13    19.346982
   14    0
   15    0
   16    0.0021561665
   17    2.2816478e-15
   18    2.4807495e-11
   19    8.291539e-11
   20   -4.0106342e-16
   21   -1.7146243e-11
   22   -5.7319216e-09
   23    0
   24    0
   25    0
   26    0
   27    0
   28    0
   29    0
   30    0
   31    0
   39    6.3613522e-05
   40    0
   41    0
   42    0

BLOCK FWCOEF Q=  160
   305   4422   0   0   -0.18881911
   305   4422   0   2   -0.19074829
   305   4322   0   2    5.9518427e-06
   305   6421   0   0   -0.095227835
   305   6421   0   2   -0.10528696
   305   6321   0   2   -0.00020032688
   3051111   4133   0   0    1.6251305
   3051111   4133   0   2    1.6251881
   3051111   4233   0   2    0.00020650073
   3051111   4137   0   0   -4.4478226
   3051111   4137   0   2   -4.4468788
   3051111   4237   0   2   -0.0015340943
   3051313   4133   0   0    1.6251305
   3051313   4133   0   2    1.6251876
   3051313   4233   0   2    0.00020650028
   3051313   4137   0   0   -4.4478226
   3051313   4137   0   2   -4.4468793
   3051313   4237   0   2   -0.0015340942
   3051212   4137   0   0    1.5053501
   3051212   4137   0   2    1.5051462
   3051212   4237   0   2    0.00033184643
   3051414   4137   0   0    1.5053501
   3051414   4137   0   2    1.5051462
   3051414   4237   0   2    0.00033184651
   3051616   4137   0   0    1.5053501
   3051616   4137   0   2    1.5051464
   3051616   4237   0   2    0.00033186788

BLOCK IMFWCOEF Q=  160
   305   4422   0   0    3.8588839e-07
   305   4422   0   2    8.6886443e-06
   305   4322   0   2    3.5265256e-06
   305   6421   0   0    3.3053893e-07
   305   6421   0   2   -4.3847928e-05
   305   6321   0   2    7.9359912e-07
   3051111   4133   0   2   -9.0461683e-07
   3051111   4233   0   2    4.4445592e-06
   3051111   4137   0   2    1.0220124e-05
   3051111   4237   0   2   -3.3012893e-05
   3051313   4133   0   2   -9.0461097e-07
   3051313   4233   0   2    4.4445574e-06
   3051313   4137   0   2    1.0220129e-05
   3051313   4237   0   2   -3.3012899e-05
   3051212   4137   0   2   -2.2056623e-06
   3051212   4237   0   2    7.1411542e-06
   3051414   4137   0   2   -2.2056623e-06
   3051414   4237   0   2    7.1411542e-06
   3051616   4137   0   2   -2.2021976e-06
   3051616   4237   0   2    7.1411538e-06

DECAY 23  2.4952


DECAY 24  2.085


DECAY 1000011  1.8087623
    1   2    1000022    11

DECAY 2000011  8.8965392
    0.99999999   2    1000022    11

DECAY 1000013  1.8086969
    1   2    1000022    13

DECAY 2000013  8.9002859
    0.99956784   2    1000022    13
    0.00043215486   2    1000013    25

DECAY 1000015  7.2950177
    1   2    1000022    15

DECAY 2000015  8.0501001
    0.43444422   2    1000022    15
    0.29830313   2    1000015    25
    0.26725266   2    1000015    23

DECAY 1000012  1.8050429
    1   2    1000022    12

DECAY 1000014  1.8050178
    1   2    1000022    14

DECAY 1000016  7.774747
    0.55185842   2    1000015    24
    0.44802901   2    1000022    16

DECAY 2000001  7.8111671e-05
    1   2    1000022    1

DECAY 1000001  0.17867809
    0.99991158   2    1000022    1

DECAY 2000003  7.7964058e-05
    1   2    1000022    3

DECAY 1000003  0.18436579
    0.96906533   2    1000022    3
    0.030934673   2    2000003    25

DECAY 1000005  10.756667
    0.96721461   2    1000021    5
    0.032785392   2    1000022    5

DECAY 2000005  61.446323
    0.85447008   2    1000021    5
    0.055407538   2    1000005    25
    0.04215667   2    1000006   -24
    0.027712725   2    1000022    5
    0.020252991   2    1000005    23

DECAY 2000002  2.84566
    1   2    1000022    2

DECAY 1000002  0.17869989
    1   2    1000022    2

DECAY 2000004  2.8456543
    1   2    1000022    4

DECAY 1000004  0.17869959
    1   2    1000022    4

DECAY 1000006  9.6157419
    0.94823667   2    1000021    6
    0.039982298   2    1000022    6
    0.0076015753   3    1000022    24    5
    0.0040081731   2    1000021    4
    0.00013463614   2    1000022    4

DECAY 2000006  285.28737
    0.47399701   2    1000021    6
    0.19916836   2    1000005    24
    0.15665844   2    1000006    25
    0.10032054   2    1000006    23
    0.03127521   2    1000022    6
    0.016897612   2    1000037    5
    0.0094310182   2    1000025    6
    0.0083589303   2    1000035    6
    0.002428238   2    1000024    5
    0.0012717944   2    1000023    6
    0.00019284871   2    2000005    24

DECAY 1000024  109.97214
    0.17600665   2    1000004   -3
    0.17600421   2    1000002   -1
    0.17459425   2   -1000003    4
    0.17459328   2   -1000001    2
    0.051618646   2    1000014   -13
    0.051615248   2    1000012   -11
    0.051175313   2   -1000013    14
    0.051172946   2   -1000011    12
    0.047354321   2   -1000005    6
    0.03650545   2    1000006   -5
    0.0034278496   2    1000016   -15
    0.0032776399   2   -2000015    16
    0.0011664652   2   -1000015    16
    0.0010226917   2    1000022    24
    0.00034778798   2    37    1000022

DECAY 1000037  37.091228
    0.40823883   2   -1000005    6
    0.14883379   2    1000006   -5
    0.070336949   2    1000022    24
    0.044962641   2   -1000015    16
    0.044186183   2    1000023    24
    0.035193995   2   -1000003    4
    0.035170045   2   -1000001    2
    0.032561859   2    1000024    25
    0.031673913   2    1000024    23
    0.031171728   2    1000004   -3
    0.031018293   2    1000002   -1
    0.020313063   2    37    1000022
    0.011453915   2   -2000005    6
    0.010537651   2   -1000013    14
    0.010537249   2   -1000011    12
    0.0094636972   2    1000014   -13
    0.0092973843   2    1000012   -11
    0.0084222883   2    1000016   -15
    0.0042864653   3    1000022   -5    6
    0.0017829991   2   -2000015    16
    0.00028129003   2   -2000003    4
    0.00012658851   2   -2000013    14

DECAY 1000022 -1


DECAY 1000023  108.13106
    0.088956602   2    1000002   -2
    0.088956602   2   -1000002    2
    0.088956563   2    1000004   -4
    0.088956563   2   -1000004    4
    0.088750196   2    1000003   -3
    0.088750196   2   -1000003    3
    0.088748778   2    1000001   -1
    0.088748778   2   -1000001    1
    0.026066356   2    1000013   -13
    0.026066356   2   -1000013    13
    0.026063732   2    1000011   -11
    0.026063732   2   -1000011    11
    0.026035884   2    1000014   -14
    0.026035884   2   -1000014    14
    0.026035435   2    1000012   -12
    0.026035435   2   -1000012    12
    0.0196878   2    1000005   -5
    0.0196878   2   -1000005    5
    0.01553468   2    1000006   -6
    0.01553468   2   -1000006    6
    0.0017068729   2    1000016   -16
    0.0017068729   2   -1000016    16
    0.0016961995   2    2000015   -15
    0.0016961995   2   -2000015    15
    0.00089049735   2    1000022    23
    0.00071409715   2    1000022    25
    0.00062025136   2    1000015   -15
    0.00062025136   2   -1000015    15
    0.00037946855   2    1000022    35

DECAY 1000025  33.415955
    0.25482515   2    1000006   -6
    0.25482515   2   -1000006    6
    0.071459   2    1000005   -5
    0.071459   2   -1000005    5
    0.060181798   2    1000022    25
    0.052416146   2    1000023    23
    0.044388905   2    1000023    25
    0.032725002   2    1000024   -24
    0.032725002   2   -1000024    24
    0.026919021   2    1000015   -15
    0.026919021   2   -1000015    15
    0.020945395   2    1000022    35
    0.017308629   2    1000022    23
    0.0086673044   2    2000005   -5
    0.0086673044   2   -2000005    5
    0.0039147117   2    2000015   -15
    0.0039147117   2   -2000015    15
    0.0033548873   3    1000022    6   -6
    0.0029342243   2    1000022    36
    0.00017489691   2    2000003   -3
    0.00017489691   2   -2000003    3
    0.00011986012   2    1000003   -3
    0.00011986012   2   -1000003    3

DECAY 1000035  42.605796
    0.21731806   2    1000006   -6
    0.21731806   2   -1000006    6
    0.056759607   2    1000005   -5
    0.056759607   2   -1000005    5
    0.048043987   2    1000022    23
    0.046001609   2    1000024   -24
    0.046001609   2   -1000024    24
    0.040158145   2    1000022    25
    0.028011478   2    1000023    25
    0.019519576   2    1000015   -15
    0.019519576   2   -1000015    15
    0.017438547   2    1000022    35
    0.015443253   2    1000003   -3
    0.015443253   2   -1000003    3
    0.015377047   2    1000001   -1
    0.015377047   2   -1000001    1
    0.015138204   2    1000004   -4
    0.015138204   2   -1000004    4
    0.015126265   2    1000002   -2
    0.015126265   2   -1000002    2
    0.0071997466   2    2000005   -5
    0.0071997466   2   -2000005    5
    0.0046951612   2    1000014   -14
    0.0046951612   2   -1000014    14
    0.0046950944   2    1000012   -12
    0.0046950944   2   -1000012    12
    0.0045192378   2    1000013   -13
    0.0045192378   2   -1000013    13
    0.0044472813   2    1000011   -11
    0.0044472813   2   -1000011    11
    0.0037519673   2    2000015   -15
    0.0037519673   2   -2000015    15
    0.0024345389   3    1000022    6   -6
    0.0019556493   2    1000022    36
    0.00070045925   2    1000016   -16
    0.00070045925   2   -1000016    16
    0.00012418192   2    2000003   -3
    0.00012418192   2   -2000003    3

DECAY 1000021  183.1877
    0.16111591   2    2000003   -3
    0.16111591   2   -2000003    3
    0.16111542   2    2000001   -1
    0.16111542   2   -2000001    1
    0.029907374   2    2000002   -2
    0.029907374   2   -2000002    2
    0.029907366   2    2000004   -4
    0.029907366   2   -2000004    4
    0.029549531   2    1000004   -4
    0.029549531   2   -1000004    4
    0.029549525   2    1000002   -2
    0.029549525   2   -1000002    2
    0.029424782   2    1000003   -3
    0.029424782   2   -1000003    3
    0.029424719   2    1000001   -1
    0.029424719   2   -1000001    1

DECAY 25  0.003857911
    0.57534327   2   -5    5
    0.22587791   2   -24    24
    0.072640971   2    21    21
    0.066195601   2   -15    15
    0.028411099   2   -4    4
    0.027256126   2    23    23
    0.0023449319   2    22    22
    0.0014843145   2    22    23
    0.00022954347   2   -13    13
    0.00021548819   2   -3    3
    5.9579874e-07   2   -1    1
    1.464099e-07   2   -2    2
    5.1603933e-09   2   -11    11

DECAY 35  21.871871
    0.78197138   2   -5    5
    0.21455048   2   -15    15
    0.002615311   2   -6    6
    0.00070660341   2   -13    13
    0.00013672086   2   -3    3
    1.2871952e-05   2    21    21
    4.4490375e-06   2    25    25
    8.3468235e-07   2    23    23
    4.6601393e-07   2    1000022    1000022
    3.7805354e-07   2   -1    1
    3.4745745e-07   2   -24    24
    6.4769221e-08   2   -1000001    1000001
    6.4434663e-08   2   -1000003    1000003
    1.5871083e-08   2   -11    11
    7.9236096e-09   2   -4    4
    6.7864241e-09   2    22    22
    5.2925278e-09   2    22    23
    4.0773382e-14   2   -2    2

DECAY 36  21.026875
    0.78236849   2   -5    5
    0.21465148   2   -15    15
    0.0020923992   2   -6    6
    0.00070693683   2   -13    13
    0.00013681878   2   -3    3
    3.325831e-05   2    21    21
    8.8910312e-06   2    1000022    1000022
    1.2353272e-06   2    23    25
    3.78324e-07   2   -1    1
    5.7503112e-08   2    22    22
    3.1580038e-08   2    22    23
    1.5878567e-08   2   -11    11
    4.4722591e-09   2   -4    4
    2.3003562e-14   2   -2    2
    1.0551422e-36   2    25    25

DECAY 37  25.829158
    0.78705543   2   -5    6
    0.21090597   2   -15    16
    0.0011641171   2   -5    4
    0.00074562821   2   -13    14
    0.00010914875   2   -3    4
    8.3129989e-06   2   -5    2
    5.0964193e-06   2   -3    2
    4.746294e-06   2   -3    6
    1.0086565e-06   2    24    25
    3.0266768e-07   2   -1    2
    2.1032764e-07   2   -1    6
    1.7440321e-08   2   -11    12
    1.6026389e-08   2   -1    4
    6.3323021e-13   2    24    35
    4.8448615e-13   2    24    36

DECAY 6  2.43
    1   2    5    24

DECAY 15 -1
