BLOCK SPINFO
   1   SPheno
   2   v4.0.5be

BLOCK SPHENOINFO
   1   2
   2   2

BLOCK MODSEL
   1   0

BLOCK MINPAR
   3    55.354368
   4   -1

BLOCK EXTPAR
   0    3977.4879
   1   -145.05064
   2    1209.7697
   3    4000
   11    7652.8968
   12    970.19914
   13    1460.4737
   23   -1991.648
   25    58.696674
   26    2000
   31    152.85534
   32    152.85534
   33    2000
   34    501.30514
   35    501.30514
   36    2000
   41    4000
   42    4000
   43    4000
   44    4000
   45    4000
   46    4000
   47    4000
   48    4000
   49    4000

BLOCK SMINPUTS
   1    127.90897
   2    1.1663787e-05
   3    0.1184
   4    91.1876
   5    4.18
   6    173.2
   7    1.777
   8    0
   11    0.00051099893
   12    0
   13    0.10565837
   14    0
   21    0.005
   22    0.0025
   23    0.095
   24    1.27

BLOCK GAUGE Q=  3977.4879
   1    0.35536298
   2    0.66519887
   3    1.219778

BLOCK YU Q=  3977.4879
   1   1    8.3855888e-06
   2   2    0.0042598791
   3   3    1.0130465

BLOCK YD Q=  3977.4879
   1   1    0.00098907063
   2   2    0.018792342
   3   3    0.98084814

BLOCK YE Q=  3977.4879
   1   1    0.00017260006
   2   2    0.035688218
   3   3    0.60021711

BLOCK AU Q=  3977.4879
   1   1    0
   2   2    0
   3   3    7652.8968

BLOCK AD Q=  3977.4879
   1   1    0
   2   2    0
   3   3    970.19913

BLOCK AE Q=  3977.4879
   1   1    0
   2   2    0
   3   3    1460.4737

BLOCK MSOFT Q=  3977.4879
   1   -145.05064
   2    1209.7697
   3    4000
   21    1292537.3
   22   -3701619.7
   31    152.85534
   32    152.85534
   33    2000
   34    501.30514
   35    501.30514
   36    2000
   41    4000
   42    4000
   43    4000
   44    4000
   45    4000
   46    4000
   47    4000
   48    4000
   49    4000

BLOCK MASS
   6    173.2
   23    91.1876
   24    80.429995
   15    1.777
   25    128.24046
   35    1996.9019
   36    2000
   37    2000.0939
   1000001    4156.3733
   2000001    4143.3195
   1000002    4155.6233
   2000002    4143.8517
   1000003    4156.4022
   2000003    4143.2402
   1000004    4155.6063
   2000004    4143.851
   1000005    3950.4195
   2000005    4043.1398
   1000006    3861.3985
   2000006    4097.0673
   1000011    247.73195
   2000011    511.06756
   1000012    235.21629
   1000013    246.87163
   2000013    511.29809
   1000014    235.1457
   1000015    1934.6677
   2000015    2036.8508
   1000016    1994.7505
   1000021    4249.4366
   1000022   -141.86363
   1000023    1251.354
   1000025   -1990.7534
   1000035    1994.0215
   1000024    1251.4669
   1000037    1994.6911
   1000039    1e-09

BLOCK ALPHA
      -0.018184724

BLOCK HMIX Q=  3977.4879
   1   -1991.648
   2    58.696674
   3    242.91688
   4    4000000

BLOCK STOPMIX
   1   1   -0.67814122
   1   2    0.73493162
   2   1   -0.73493162
   2   2   -0.67814122

BLOCK SBOTMIX
   1   1   -0.74282561
   1   2    0.66948496
   2   1   -0.66948496
   2   2   -0.74282561

BLOCK STAUMIX
   1   1   -0.6333575
   1   2    0.77385934
   2   1   -0.77385934
   2   2   -0.6333575

BLOCK NMIX
   1   1   -0.99974648
   1   2   -3.2779027e-05
   1   3    0.02242326
   1   4   -0.0020402871
   2   1    0.0012781039
   2   2    0.99739185
   2   3    0.061828894
   2   4    0.037216299
   3   1   -0.017293194
   3   2    0.017442354
   3   3   -0.70665391
   3   4    0.70713292
   4   1   -0.014362392
   4   2    0.070037574
   4   3   -0.70449602
   4   4   -0.7060976

BLOCK UMIX
   1   1   -0.99600269
   1   2   -0.089323231
   2   1    0.089323231
   2   2   -0.99600269

BLOCK VMIX
   1   1   -0.99850794
   1   2    0.05460665
   2   1    0.05460665
   2   2    0.99850794

BLOCK HIGGSBOUNDSINPUTHIGGSCOUPLINGSFERMIONS
       0, 3445.2996,3,36,15,15

BLOCK HIGGSBOUNDSINPUTHIGGSCOUPLINGSBOSONS
       0,4,36,21,21,23

BLOCK SPHENOLOWENERGY
   1    0.00032340134
   2    1.5898501e-06
   3    3.5252792e-05
   4    5.5696491e-15
   5    2.3788512e-10
   6    4.7302157e-08
   7    1.9606731e-13
   8    8.374415e-09
   9    1.6857237e-06
   10    9.4048678e-05
   11    0.97148683
   12    0.54152734
   13    19.369116
   14    0
   15    0
   16    0.0021561488
   17    2.281652e-15
   18    2.4802457e-11
   19    8.290691e-11
   20    1.1361967e-13
   21    4.9128711e-09
   22   -3.7966255e-08
   23    0
   24    0
   25    0
   26    0
   27    0
   28    0
   29    0
   30    0
   31    0
   39    0.00010116121
   40    0
   41    0
   42    0

BLOCK FWCOEF Q=  160
   305   4422   0   0   -0.18881911
   305   4422   0   2   -0.19084242
   305   4322   0   2   -4.7122389e-05
   305   6421   0   0   -0.095227835
   305   6421   0   2   -0.10391908
   305   6321   0   2   -0.00018598354
   3051111   4133   0   0    1.6278153
   3051111   4133   0   2    1.6278692
   3051111   4233   0   2    0.00057197191
   3051111   4137   0   0   -4.4505074
   3051111   4137   0   2   -4.4489677
   3051111   4237   0   2   -0.0042269963
   3051313   4133   0   0    1.6278153
   3051313   4133   0   2    1.6278658
   3051313   4233   0   2    0.00057196463
   3051313   4137   0   0   -4.4505074
   3051313   4137   0   2   -4.4489711
   3051313   4237   0   2   -0.0042269959
   3051212   4137   0   0    1.5053501
   3051212   4137   0   2    1.5050288
   3051212   4237   0   2    0.00091380586
   3051414   4137   0   0    1.5053501
   3051414   4137   0   2    1.5050288
   3051414   4237   0   2    0.00091380706
   3051616   4137   0   0    1.5053501
   3051616   4137   0   2    1.5050291
   3051616   4237   0   2    0.00091414541

BLOCK IMFWCOEF Q=  160
   305   4422   0   0    3.8590888e-07
   305   4422   0   2   -2.0170984e-05
   305   4322   0   2    3.6364548e-06
   305   6421   0   0    3.3055648e-07
   305   6421   0   2    9.4733561e-06
   305   6321   0   2    2.3144051e-06
   3051111   4133   0   2   -1.0493933e-06
   3051111   4233   0   2    1.3126677e-05
   3051111   4137   0   2    6.7315485e-06
   3051111   4237   0   2   -9.7015996e-05
   3051313   4133   0   2   -1.0490106e-06
   3051313   4233   0   2    1.3126646e-05
   3051313   4137   0   2    6.7312576e-06
   3051313   4237   0   2   -9.7016089e-05
   3051212   4137   0   2   -1.2463318e-06
   3051212   4237   0   2    2.0973227e-05
   3051414   4137   0   2   -1.2463112e-06
   3051414   4237   0   2    2.0973227e-05
   3051616   4137   0   2   -1.2410906e-06
   3051616   4237   0   2    2.0973227e-05

DECAY 23  2.4952


DECAY 24  2.085


DECAY 1000011  0.14050549
    0.99999622   2    1000022    11

DECAY 2000011  2.186337
    0.99999929   2    1000022    11

DECAY 1000013  0.13906566
    0.99999724   2    1000022    13

DECAY 2000013  2.2526028
    0.97116857   2    1000022    13
    0.028831415   2    1000013    25

DECAY 1000015  11.012189
    0.62227954   2    1000022    15
    0.25134979   2   -1000024    16
    0.12636785   2    1000023    15

DECAY 2000015  10.981041
    0.49679909   2    1000022    15
    0.32775506   2   -1000024    16
    0.16639775   2    1000023    15
    0.0054046419   2    1000015    23
    0.0013162781   2    1000025    15
    0.0011911378   2    1000035    15
    0.0011166907   2   -1000037    16

DECAY 1000012  0.11953333
    0.99999999   2    1000022    12

DECAY 1000014  0.11941543
    0.99999999   2    1000022    14

DECAY 1000016  12.169412
    0.53261342   2    1000024    15
    0.2636153   2    1000023    16
    0.20369746   2    1000022    16

DECAY 2000001  2.3087837
    0.99905198   2    1000022    1
    0.00060605426   2    1000039    1
    0.00018756739   2    1000025    1
    0.00013225417   2    1000035    1

DECAY 1000001  45.870812
    0.65431383   2   -1000024    2
    0.32793224   2    1000023    1
    0.012606296   2    1000022    1
    0.0037702157   2   -1000037    2
    0.0012461688   2    1000035    1
    0.00010026092   2    1000025    1

DECAY 2000003  2.3431127
    0.98440214   2    1000022    3
    0.0072733404   2   -1000037    4
    0.0038444811   2    1000025    3
    0.0037605102   2    1000035    3
    0.0005971178   2    1000039    3

DECAY 1000003  45.889452
    0.65405422   2   -1000024    4
    0.32780429   2    1000023    3
    0.012601582   2    1000022    3
    0.0037882821   2   -1000037    4
    0.0014322767   2    1000035    3
    0.0002883771   2    1000025    3

DECAY 1000005  109.48997
    0.34895618   2   -1000037    6
    0.1887753   2    1000025    5
    0.1808438   2    1000035    5
    0.17558121   2   -1000024    6
    0.089104949   2    1000023    5
    0.01605133   2    1000022    5
    0.00067716453   2    1000006   -24

DECAY 2000005  116.05187
    0.43468812   2   -1000037    6
    0.19943619   2    1000035    5
    0.19428684   2    1000025    5
    0.081115383   2   -1000024    6
    0.041944055   2    1000023    5
    0.039084678   2    1000006   -24
    0.0094075568   2    1000022    5

DECAY 2000002  9.2317475
    0.99954751   2    1000022    2
    0.00017736881   2    1000025    2
    0.00015166653   2    1000039    2
    0.00012210231   2    1000035    2

DECAY 1000002  45.906175
    0.65693714   2    1000024    1
    0.32789606   2    1000023    2
    0.01260358   2    1000022    2
    0.0014084447   2    1000037    1
    0.0010750417   2    1000035    2

DECAY 2000004  9.2335124
    0.99935604   2    1000022    4
    0.00022519069   2    1000025    4
    0.00016984372   2    1000035    4
    0.00015163735   2    1000039    4

DECAY 1000004  45.924099
    0.65668128   2    1000024    3
    0.3277661   2    1000023    4
    0.012598606   2    1000022    4
    0.0017802884   2    1000037    3
    0.0010843487   2    1000035    4

DECAY 1000006  111.82185
    0.37930061   2    1000037    5
    0.20977959   2    1000035    6
    0.19701941   2    1000025    6
    0.094356302   2    1000024    5
    0.046304751   2    1000023    6
    0.043846268   2    1000022    6
    0.027321378   2    1000023    4
    0.0010837056   2    1000022    4
    0.00097926527   3    1000022    24    5

DECAY 2000006  131.89898
    0.34224345   2    1000037    5
    0.17708041   2    1000025    6
    0.16454989   2    1000035    6
    0.14250776   2    1000024    5
    0.069497325   2    1000023    6
    0.048179835   2    1000006    23
    0.033756987   2    1000022    6
    0.021478985   2    1000005    24
    0.00069540733   2    1000006    25

DECAY 1000024  20.316558
    0.25157347   2    1000014   -13
    0.25155704   2    1000012   -11
    0.24843804   2   -1000013    14
    0.2482976   2   -1000011    12
    0.00012171714   2    1000022    24

DECAY 1000037  11.860078
    0.29104127   2    1000024    25
    0.28700316   2    1000023    24
    0.27106019   2    1000024    23
    0.11282077   2    1000022    24
    0.0059950562   3    1000023   -5    6
    0.0057802207   3    1000024    6   -6
    0.0057268057   2   -1000013    14
    0.0057255618   2   -1000011    12
    0.0048358125   3    1000022   -5    6
    0.0042023652   2    1000014   -13
    0.0021464918   2    1000012   -11
    0.0018451311   2   -2000013    14
    0.0010617828   2   -1000015    16
    0.0003842563   3    1000022   -15    16
    0.0001720258   3    1000024    15   -15

DECAY 1000022  5.2932276e-11
    0.96726799   2    1000039    22
    0.03273201   2    1000039    23

DECAY 1000023  20.319498
    0.12530015   2    1000014   -14
    0.12530015   2   -1000014    14
    0.12529464   2    1000012   -12
    0.12529464   2   -1000012    12
    0.12470781   2    1000013   -13
    0.12470781   2   -1000013    13
    0.12463475   2    1000011   -11
    0.12463475   2   -1000011    11

DECAY 1000025  14.76915
    0.24136743   2    1000023    25
    0.22384169   2    1000024   -24
    0.22384169   2   -1000024    24
    0.2013355   2    1000023    23
    0.049651334   2    1000022    25
    0.037160132   2    1000022    23
    0.0059069153   3    1000024    5   -6
    0.0059069153   3   -1000024   -5    6
    0.0023299189   3    1000022    6   -6
    0.0019220693   3    1000023    6   -6
    0.00084611452   2    1000013   -13
    0.00084611452   2   -1000013    13
    0.00083237323   2    2000013   -13
    0.00083237323   2   -2000013    13
    0.00069997529   2    1000015   -15
    0.00069997529   2   -1000015    15
    0.00054812854   3    1000022    5   -5
    0.00023146988   3    1000022    15   -15
    0.00020531788   2    1000014   -14
    0.00020531788   2   -1000014    14
    0.00020531439   2    1000012   -12
    0.00020531439   2   -1000012    12

DECAY 1000035  11.212773
    0.29238363   2    1000023    25
    0.2595458   2    1000024   -24
    0.2595458   2   -1000024    24
    0.070460817   2    1000022    23
    0.060810741   2    1000022    25
    0.016337351   2    1000023    23
    0.006499908   3    1000024    5   -6
    0.006499908   3   -1000024   -5    6
    0.0028905503   3    1000022    6   -6
    0.0025603548   2    1000013   -13
    0.0025603548   2   -1000013    13
    0.0023146199   3    1000023    6   -6
    0.0022981745   2    1000014   -14
    0.0022981745   2   -1000014    14
    0.0022981355   2    1000012   -12
    0.0022981355   2   -1000012    12
    0.001475593   2    1000011   -11
    0.001475593   2   -1000011    11
    0.0010565062   2    2000013   -13
    0.0010565062   2   -2000013    13
    0.00096759469   2    1000015   -15
    0.00096759469   2   -1000015    15
    0.00074739127   3    1000022    5   -5
    0.00032786541   3    1000022    15   -15

DECAY 1000021  12.019499
    0.20985648   2    1000006   -6
    0.20985648   2   -1000006    6
    0.097849881   2    1000005   -5
    0.097849881   2   -1000005    5
    0.045982938   2    2000005   -5
    0.045982938   2   -2000005    5
    0.035841317   2    1000006   -4
    0.035841317   2   -1000006    4
    0.012746816   2    2000003   -3
    0.012746816   2   -2000003    3
    0.012728034   2    2000001   -1
    0.012728034   2   -2000001    1
    0.012602275   2    2000002   -2
    0.012602275   2   -2000002    2
    0.012601563   2    2000004   -4
    0.012601563   2   -2000004    4
    0.0099795035   2    1000004   -4
    0.0099795035   2   -1000004    4
    0.0099768175   2    1000002   -2
    0.0099768175   2   -1000002    2
    0.0098196798   2    1000001   -1
    0.0098196798   2   -1000001    1
    0.0098136402   2    1000003   -3
    0.0098136402   2   -1000003    3
    0.00768014   3    1000025    6   -6
    0.0071209781   3    1000035    6   -6
    0.0062908476   3    1000037    5   -6
    0.0062908476   3   -1000037   -5    6
    0.003542834   3    1000023    6   -6
    0.0033265693   3    1000024    5   -6
    0.0033265693   3   -1000024   -5    6
    0.0017362498   3    1000022    6   -6
    0.00055260166   2    1000035    21
    0.00040064335   2    1000025    21
    0.00013210616   2    1000039    21

DECAY 25  0.0043927271
    0.52391366   2   -5    5
    0.28134196   2   -24    24
    0.068902533   2    21    21
    0.059865622   2   -15    15
    0.036204665   2    23    23
    0.025365813   2   -4    4
    0.0022663007   2    22    22
    0.0017372754   2    22    23
    0.00020601875   2   -13    13
    0.00019547917   2   -3    3
    5.4047435e-07   2   -1    1
    1.3070632e-07   2   -2    2
    4.62459e-09   2   -11    11

DECAY 35  179.87265
    0.94653811   2   -5    5
    0.052676745   2   -15    15
    0.00036254149   2   -6    6
    0.00021995647   2   -3    3
    0.00010129892   2   -13    13
    6.2886253e-05   2    1000022    1000023
    2.5272225e-05   2    21    21
    1.1881142e-05   2    1000022    1000022
    6.0775164e-07   2   -1    1
    1.5558793e-07   2    23    23
    1.3904164e-07   2    25    25
    8.2668241e-08   2   -24    24
    3.695986e-08   2   -2000013    1000013
    3.695986e-08   2   -1000013    2000013
    2.4269953e-08   2   -1000011    1000011
    1.8232467e-08   2   -2000013    2000013
    1.8075416e-08   2   -1000013    1000013
    1.3742062e-08   2   -2000011    2000011
    9.2759092e-09   2    22    22
    5.6435248e-09   2    22    23
    4.8742201e-09   2   -4    4
    2.2781427e-09   2   -11    11
    8.7354376e-13   2   -2000011    1000011
    8.7354376e-13   2   -1000011    2000011
    2.5128366e-14   2   -2    2

DECAY 36  156.0943
    0.94655317   2   -5    5
    0.05266939   2   -15    15
    0.00035134888   2   -6    6
    0.00021992785   2   -3    3
    0.00010126607   2   -13    13
    5.3784183e-05   2    1000022    1000023
    3.5990034e-05   2    21    21
    1.4100466e-05   2    1000022    1000022
    6.0767338e-07   2   -1    1
    2.4275119e-07   2    23    25
    4.9687734e-08   2    22    23
    4.1747178e-08   2   -2000013    1000013
    4.1747178e-08   2   -1000013    2000013
    3.6289479e-08   2    22    22
    4.5638375e-09   2   -4    4
    2.2773995e-09   2   -11    11
    2.0064419e-12   2    23    35
    9.7645166e-13   2   -2000011    1000011
    9.7645166e-13   2   -1000011    2000011
    2.3531288e-14   2   -2    2
    1.8520457e-36   2    25    25

DECAY 37  193.45254
    0.93471963   2   -5    6
    0.063354079   2   -15    16
    0.0013912064   2   -5    4
    0.00022397948   2   -13    14
    0.00018880955   2   -3    4
    0.00010208273   2    1000022    1000024
    9.9346538e-06   2   -5    2
    8.8011101e-06   2   -3    2
    5.2349819e-07   2   -1    2
    4.7297512e-07   2   -3    6
    1.9617707e-07   2    24    25
    8.8153733e-08   2   -1000011    1000012
    7.95823e-08   2   -1000013    1000014
    7.5133168e-08   2   -2000013    1000014
    2.4414139e-08   2   -1    4
    9.0388305e-09   2   -1    6
    5.2389034e-09   2   -11    12
    2.3297069e-12   2    24    35
    1.7632351e-12   2   -2000011    1000012

DECAY 6  2.43
    1   2    5    24

DECAY 15 -1


DECAY 1000039 -1
