BLOCK SPINFO
   1   SPheno
   2   v4.0.5be

BLOCK SPHENOINFO
   1   2
   2   2

BLOCK MODSEL
   1   0

BLOCK MINPAR
   3    10.999776
   4   -1

BLOCK EXTPAR
   0    4160.4172
   1   -4473.9843
   2   -2870.575
   3    4818.439
   11   -2838.561
   12   -672.69214
   13    3199.5544
   23   -496.58134
   25    10.457497
   26    799.15654
   31    2090.7744
   32    2090.7744
   33    3962.3504
   34    2592.4411
   35    2592.4411
   36    1259.0499
   41    3586.075
   42    3586.075
   43    4078.3812
   44    1171.5962
   45    1171.5962
   46    3991.2198
   47    4065.6172
   48    4065.6172
   49    2573.2467

BLOCK SMINPUTS
   1    127.90897
   2    1.1663787e-05
   3    0.1184
   4    91.1876
   5    4.18
   6    173.2
   7    1.777
   8    0
   11    0.00051099893
   12    0
   13    0.10565837
   14    0
   21    0.005
   22    0.0025
   23    0.095
   24    1.27

BLOCK GAUGE Q=  4160.4172
   1    0.35536298
   2    0.66519887
   3    1.219778

BLOCK YU Q=  4160.4172
   1   1    8.422619e-06
   2   2    0.0042786904
   3   3    1.01752

BLOCK YD Q=  4160.4172
   1   1    0.00017699261
   2   2    0.0033628596
   3   3    0.17552121

BLOCK YE Q=  4160.4172
   1   1    3.0886505e-05
   2   2    0.0063863497
   3   3    0.1074079

BLOCK AU Q=  4160.4172
   1   1    0
   2   2    0
   3   3   -2838.562

BLOCK AD Q=  4160.4172
   1   1    0
   2   2    0
   3   3   -672.69207

BLOCK AE Q=  4160.4172
   1   1    0
   2   2    0
   3   3    3199.554

BLOCK MSOFT Q=  4160.4172
   1   -4473.9843
   2   -2870.575
   3    4818.439
   21    254198.22
   22    64100.435
   31    2090.7744
   32    2090.7744
   33    3962.3504
   34    2592.4411
   35    2592.4411
   36    1259.0499
   41    3586.075
   42    3586.075
   43    4078.3812
   44    1171.5962
   45    1171.5962
   46    3991.2198
   47    4065.6172
   48    4065.6172
   49    2573.2467

BLOCK MASS
   6    173.2
   23    91.1876
   24    80.429995
   15    1.777
   25    120.55582
   35    799.34359
   36    799.15654
   37    803.37444
   1000001    3781.5045
   2000001    4226.9256
   1000002    3780.6637
   2000002    1452.3364
   1000003    3781.5038
   2000003    4226.925
   1000004    3780.6631
   2000004    1452.3353
   1000005    2760.1644
   2000005    4225.811
   1000006    4079.3879
   2000006    4243.0559
   1000011    2137.1936
   2000011    2605.4245
   1000012    2135.3219
   1000013    2137.1917
   2000013    2605.4213
   1000014    2135.3202
   1000015    1273.2733
   2000015    3987.4703
   1000016    3986.2517
   1000021    4899.2981
   1000022   -498.35686
   1000023    500.88033
   1000025   -2902.1259
   1000035   -4392.8891
   1000024    499.27772
   1000037    2902.3308

BLOCK ALPHA
      -0.093988904

BLOCK HMIX Q=  4160.4172
   1   -496.58134
   2    10.457497
   3    242.92764
   4    638651.18

BLOCK STOPMIX
   1   1    0.31428464
   1   2    0.9493288
   2   1   -0.9493288
   2   2    0.31428464

BLOCK SBOTMIX
   1   1   -0.0010071113
   1   2    0.99999949
   2   1   -0.99999949
   2   2   -0.0010071113

BLOCK STAUMIX
   1   1   -0.0010448494
   1   2    0.99999945
   2   1   -0.99999945
   2   2   -0.0010448494

BLOCK NMIX
   1   1   -0.0087778805
   1   2    0.025112667
   1   3    0.7078586
   1   4   -0.70585303
   2   1    0.0057800876
   2   2   -0.014725222
   2   3    0.7063124
   2   4    0.7077235
   3   1    0.00078456296
   3   2    0.99957606
   3   3   -0.0073777159
   3   4    0.028154238
   4   1    0.99994446
   4   2   -0.00047870788
   4   3    0.0021368577
   4   4   -0.010309259

BLOCK UMIX
   1   1   -0.010439541
   1   2   -0.99994551
   2   1   -0.99994551
   2   2    0.010439541

BLOCK VMIX
   1   1    0.039848132
   1   2    0.99920575
   2   1    0.99920575
   2   2   -0.039848132

BLOCK HIGGSBOUNDSINPUTHIGGSCOUPLINGSFERMIONS
       0, 109.35924,3,36,15,15

BLOCK HIGGSBOUNDSINPUTHIGGSCOUPLINGSBOSONS
       0,4,36,21,21,23

BLOCK SPHENOLOWENERGY
   1    0.00037177056
   2    1.5882445e-06
   3    3.5275564e-05
   4    2.4877231e-15
   5    1.0627272e-10
   6    2.2247856e-08
   7    8.3968889e-14
   8    3.5871487e-09
   9    7.6088897e-07
   10    9.5632146e-05
   11    0.98784346
   12    0.54258292
   13    19.381556
   14    0
   15    0
   16    0.0021599261
   17    2.2816868e-15
   18    2.4816436e-11
   19    8.2941474e-11
   20    4.6906521e-16
   21    2.0053933e-11
   22    3.0546345e-09
   23    0
   24    0
   25    0
   26    0
   27    0
   28    0
   29    0
   30    0
   31    0
   39   -1.3774909e-05
   40    0
   41    0
   42    0

BLOCK FWCOEF Q=  160
   305   4422   0   0   -0.18881911
   305   4422   0   2   -0.24003193
   305   4322   0   2   -0.0010093605
   305   6421   0   0   -0.095227835
   305   6421   0   2   -0.15255228
   305   6321   0   2   -0.0011269674
   3051111   4133   0   0    1.6275965
   3051111   4133   0   2    1.6279323
   3051111   4233   0   2   -1.7907469e-06
   3051111   4137   0   0   -4.4502887
   3051111   4137   0   2   -4.4508765
   3051111   4237   0   2    1.348494e-05
   3051313   4133   0   0    1.6275965
   3051313   4133   0   2    1.6279323
   3051313   4233   0   2   -1.7909198e-06
   3051313   4137   0   0   -4.4502887
   3051313   4137   0   2   -4.4508766
   3051313   4237   0   2    1.3485106e-05
   3051212   4137   0   0    1.5053501
   3051212   4137   0   2    1.5054784
   3051212   4237   0   2   -2.9150689e-06
   3051414   4137   0   0    1.5053501
   3051414   4137   0   2    1.5054784
   3051414   4237   0   2   -2.9150318e-06
   3051616   4137   0   0    1.5053501
   3051616   4137   0   2    1.5054786
   3051616   4237   0   2   -2.9046187e-06

BLOCK IMFWCOEF Q=  160
   305   4422   0   0    3.858197e-07
   305   4422   0   2    1.4435771e-06
   305   4322   0   2   -6.5111677e-07
   305   6421   0   0    3.3048009e-07
   305   6421   0   2    2.3224749e-06
   305   6321   0   2   -2.5851464e-07
   3051111   4133   0   2   -5.2949139e-07
   3051111   4233   0   2    3.6163444e-07
   3051111   4137   0   2    4.1647468e-06
   3051111   4237   0   2   -2.6699575e-06
   3051313   4133   0   2   -5.2949118e-07
   3051313   4233   0   2    3.6163442e-07
   3051313   4137   0   2    4.1647472e-06
   3051313   4237   0   2   -2.6699576e-06
   3051212   4137   0   2   -8.7830143e-07
   3051212   4237   0   2    5.7723272e-07
   3051414   4137   0   2   -8.7830145e-07
   3051414   4237   0   2    5.7723272e-07
   3051616   4137   0   2   -8.7542793e-07
   3051616   4237   0   2    5.7723221e-07

DECAY 23  2.4952


DECAY 24  2.085


DECAY 1000011  0.0064792491
    0.54152289   2    1000022    11
    0.28285831   2   -1000024    12
    0.1756188   2    1000023    11

DECAY 2000011  0.001341974
    0.69767651   2    1000022    11
    0.30228909   2    1000023    11

DECAY 1000013  0.0080289093
    0.53378378   2    1000022    13
    0.23795265   2    1000023    13
    0.22826357   2   -1000024    14

DECAY 2000013  0.00527664
    0.37171647   2   -1000024    14
    0.36376315   2    1000022    13
    0.26224111   2    1000023    13
    0.0022792639   2    1000013    25

DECAY 1000015  0.41896194
    0.49951488   2   -1000024    16
    0.25159498   2    1000022    15
    0.24889013   2    1000023    15

DECAY 2000015  13.055768
    0.5943969   2   -1000037    16
    0.2973215   2    1000025    15
    0.034565421   2    1000022    15
    0.034058394   2    1000023    15
    0.018421662   2    1000015    35
    0.018409546   2    1000015    36
    0.0013034164   2    1000015    23
    0.0012483542   2    1000015    25
    0.00027479834   2   -1000024    16

DECAY 1000012  0.036799436
    0.72483266   2    1000024    11
    0.20279953   2    1000022    12
    0.072367808   2    1000023    12

DECAY 1000014  0.038347213
    0.73593928   2    1000024    13
    0.19461391   2    1000022    14
    0.069446817   2    1000023    14

DECAY 1000016  13.079821
    0.59143148   2    1000037    15
    0.29577938   2    1000025    16
    0.071885262   2    1000024    15
    0.036736768   2    1000015    37
    0.0026003506   2    1000015    24
    0.0011544461   2    1000022    16
    0.00041230659   2    1000023    16

DECAY 1000001  8.4482993
    0.66530906   2   -1000037    2
    0.33245041   2    1000025    1
    0.00135381   2    1000022    1
    0.00047212516   2    1000023    1
    0.00041458809   2   -1000024    2

DECAY 2000001  0.00025898486
    0.68766171   2    1000022    1
    0.30086851   2    1000023    1
    0.0098887059   2   -1000024    2
    0.0015673896   2    1000025    1

DECAY 1000003  8.4504491
    0.66513845   2   -1000037    4
    0.33236543   2    1000025    3
    0.0014020475   2    1000022    3
    0.00057152892   2   -1000024    4
    0.00052034457   2    1000023    3

DECAY 2000003  0.0021042255
    0.43936819   2   -1000024    4
    0.30422838   2    1000022    3
    0.25559581   2    1000023    3
    0.00059407268   2    1000003    25
    0.00019977662   2    1000025    3

DECAY 1000005  3.1518656
    0.49782129   2   -1000024    6
    0.25178277   2    1000022    5
    0.25039594   2    1000023    5

DECAY 2000005  103.32644
    0.81483859   2   -1000024    6
    0.10092087   2   -1000037    6
    0.050195466   2    1000025    5
    0.012335174   2    1000022    5
    0.012200741   2    1000023    5
    0.0090432695   2    1000006   -24
    0.00017223548   2    1000005    36
    0.00017192091   2    1000005    35

DECAY 2000002  0.00027863331
    0.6981112   2    1000022    2
    0.30188309   2    1000023    2

DECAY 1000002  8.4729669
    0.66139946   2    1000037    1
    0.3311716   2    1000025    2
    0.0060216989   2    1000024    1
    0.0010516623   2    1000022    2
    0.00035558119   2    1000023    2

DECAY 2000004  0.0011005888
    0.37313125   2    1000024    3
    0.36339562   2    1000022    4
    0.26347313   2    1000023    4

DECAY 1000004  8.4751175
    0.6612309   2    1000037    3
    0.33108645   2    1000025    4
    0.0061167581   2    1000024    3
    0.0011296107   2    1000022    4
    0.0004340694   2    1000023    4

DECAY 1000006  154.08041
    0.4694842   2    1000024    5
    0.26050205   2    1000023    6
    0.25799681   2    1000022    6
    0.0078609931   2    1000037    5
    0.0038377589   2    1000025    6
    0.00031212372   3    1000022    24    5

DECAY 2000006  112.81906
    0.38087179   2    1000023    6
    0.3808144   2    1000022    6
    0.10663692   2    1000024    5
    0.080979326   2    1000037    5
    0.03969403   2    1000025    6
    0.0055039242   2    1000006    25
    0.0050844614   2    1000006    23
    0.00033470429   2    1000005    37

DECAY 1000024  1.539073e-12
    0.60754179   3    1000022   -1    2
    0.20255154   3    1000022   -11    12
    0.18990667   3    1000022   -13    14

DECAY 1000037  58.909866
    0.1144558   2    1000024    25
    0.10952143   2    1000023    24
    0.10924114   2    1000024    23
    0.10911054   2    1000022    24
    0.098317583   2    37    1000022
    0.085625471   2    1000024    35
    0.085571328   2    1000024    36
    0.085289388   2    37    1000023
    0.045555749   2    1000014   -13
    0.045555578   2    1000012   -11
    0.045434594   2   -1000013    14
    0.045434406   2   -1000011    12
    0.0095024548   3    1000024    6   -6
    0.0061073088   3    1000023   -5    6
    0.0052719301   3    1000022   -5    6

DECAY 1000022 -1


DECAY 1000023  3.6475582e-09
    0.92850198   2    1000022    22
    0.019689316   3    1000022    12   -12
    0.014722629   3    1000022    1   -1
    0.014482447   3    1000022    3   -3
    0.011482851   3    1000022    2   -2
    0.00332263   3    1000022    11   -11
    0.0032376392   3    1000022    13   -13
    0.0013600573   3    1000024    1   -2
    0.0013600573   3   -1000024   -1    2
    0.0004533803   3    1000024    11   -12
    0.0004533803   3   -1000024   -11    12
    0.0004437295   3    1000024    13   -14
    0.0004437295   3   -1000024   -13    14

DECAY 1000025  62.035316
    0.10410999   2    1000024   -24
    0.10410999   2   -1000024    24
    0.093172635   2    37   -1000024
    0.093172635   2   -37    1000024
    0.080589493   2    1000022    25
    0.07743237   2    1000023    23
    0.070346586   2    1000023    35
    0.055600723   2    1000023    25
    0.04832901   2    1000022    35
    0.033215762   2    1000022    36
    0.026327741   2    1000022    23
    0.022502564   2    1000023    36
    0.021619436   2    1000014   -14
    0.021619436   2   -1000014    14
    0.021619354   2    1000012   -12
    0.021619354   2   -1000012    12
    0.021566161   2    1000013   -13
    0.021566161   2   -1000013    13
    0.021566071   2    1000011   -11
    0.021566071   2   -1000011    11
    0.0052613468   3    1000024    5   -6
    0.0052613468   3   -1000024   -5    6
    0.0041162248   3    1000022    6   -6
    0.0036945621   3    1000023    6   -6

DECAY 1000035  124.53407
    0.09373177   2    2000004   -4
    0.09373177   2   -2000004    4
    0.093731718   2    2000002   -2
    0.093731718   2   -2000002    2
    0.074347759   2    1000015   -15
    0.074347759   2   -1000015    15
    0.037234903   2    2000013   -13
    0.037234903   2   -2000013    13
    0.037234805   2    2000011   -11
    0.037234805   2   -2000011    11
    0.024522113   2    1000024   -24
    0.024522113   2   -1000024    24
    0.021535782   2    37   -1000024
    0.021535782   2   -37    1000024
    0.017269461   2    1000023    23
    0.01602144   2    1000022    25
    0.015133034   2    1000023    35
    0.012944211   2    1000014   -14
    0.012944211   2   -1000014    14
    0.012944198   2    1000012   -12
    0.012944198   2   -1000012    12
    0.012883903   2    1000013   -13
    0.012883903   2   -1000013    13
    0.012883889   2    1000011   -11
    0.012883889   2   -1000011    11
    0.011048347   2    1000023    25
    0.010818767   2    1000005   -5
    0.010818767   2   -1000005    5
    0.010402992   2    1000022    35
    0.0094829823   2    1000022    36
    0.0074034709   2    1000022    23
    0.0064288723   2    1000023    36
    0.0016414692   3    1000022    6   -6
    0.0016401817   2    1000006   -6
    0.0016401817   2   -1000006    6
    0.0015548632   3    1000023    6   -6
    0.0014768087   3    1000024    5   -6
    0.0014768087   3   -1000024   -5    6
    0.00069186117   2    1000016   -16
    0.00069186117   2   -1000016    16
    0.00068543866   2    2000015   -15
    0.00068543866   2   -2000015    15
    0.00049794246   2    1000003   -3
    0.00049794246   2   -1000003    3
    0.00049794144   2    1000001   -1
    0.00049794144   2   -1000001    1
    0.00049386957   2    1000002   -2
    0.00049386957   2   -1000002    2
    0.00049386855   2    1000004   -4
    0.00049386855   2   -1000004    4
    0.0001623268   2    2000003   -3
    0.0001623268   2   -2000003    3
    0.00016232569   2    2000001   -1
    0.00016232569   2   -2000001    1

DECAY 1000021  454.01662
    0.13287167   2    2000004   -4
    0.13287167   2   -2000004    4
    0.13287163   2    2000002   -2
    0.13287163   2   -2000002    2
    0.074415357   2    1000005   -5
    0.074415357   2   -1000005    5
    0.026133677   2    1000004   -4
    0.026133677   2   -1000004    4
    0.026133665   2    1000002   -2
    0.026133665   2   -1000002    2
    0.026099479   2    1000003   -3
    0.026099479   2   -1000003    3
    0.026099452   2    1000001   -1
    0.026099452   2   -1000001    1
    0.01272118   2    1000006   -6
    0.01272118   2   -1000006    6
    0.011294538   2    2000006   -6
    0.011294538   2   -2000006    6
    0.010469117   2    2000005   -5
    0.010469117   2   -2000005    5
    0.010437372   2    2000003   -3
    0.010437372   2   -2000003    3
    0.010437355   2    2000001   -1
    0.010437355   2   -2000001    1

DECAY 25  0.0035563242
    0.6514783   2   -5    5
    0.15271767   2   -24    24
    0.074269451   2   -15    15
    0.070879573   2    21    21
    0.02997145   2   -4    4
    0.016904339   2    23    23
    0.0022054652   2    22    22
    0.0010709672   2    22    23
    0.0002576605   2   -13    13
    0.00024429049   2   -3    3
    6.7543735e-07   2   -1    1
    1.5446402e-07   2   -2    2
    5.7925575e-09   2   -11    11

DECAY 35  1.8673508
    0.75068541   2   -5    5
    0.12890931   2   -6    6
    0.11274844   2   -15    15
    0.0053126597   2    25    25
    0.00094541439   2   -24    24
    0.00056528416   2    23    23
    0.00039279073   2   -13    13
    0.00028379751   2   -3    3
    0.00015311066   2    21    21
    2.265083e-06   2   -4    4
    7.8462941e-07   2   -1    1
    5.5908387e-07   2    22    22
    1.6566787e-07   2    22    23
    8.8254399e-09   2   -11    11
    1.1680791e-11   2   -2    2

DECAY 36  1.8677025
    0.73982685   2   -5    5
    0.1470655   2   -6    6
    0.11110717   2   -15    15
    0.00088823206   2    23    25
    0.00044134948   2    21    21
    0.00038706473   2   -13    13
    0.00027966777   2   -3    3
    2.085694e-06   2   -4    4
    1.0241973e-06   2    22    22
    7.7321159e-07   2   -1    1
    2.7833792e-07   2    22    23
    8.696787e-09   2   -11    11
    1.075682e-11   2   -2    2
    6.0160883e-35   2    25    25

DECAY 37  1.6550237
    0.87941978   2   -5    6
    0.11745534   2   -15    16
    0.0011295855   2   -5    4
    0.0010291309   2    24    25
    0.00041525032   2   -13    14
    0.00027776994   2   -3    4
    0.00024046181   2   -3    6
    1.2681553e-05   2   -3    2
    1.1011899e-05   2   -1    6
    8.0664184e-06   2   -5    2
    7.6414719e-07   2   -1    2
    1.4505449e-07   2   -1    4
    9.7127484e-09   2   -11    12
    1.0917302e-09   2    24    36
    8.7037623e-10   2    24    35

DECAY 6  2.43
    1   2    5    24

DECAY 15 -1
