BLOCK SPINFO
   1   SPheno
   2   v4.0.5be

BLOCK SPHENOINFO
   1   2
   2   2

BLOCK MODSEL
   1   0

BLOCK MINPAR
   3    26.716105
   4    1

BLOCK EXTPAR
   0    1406.8853
   1   -1652.1919
   2   -1555.8906
   3    3000
   11    3039.5509
   12    1420.3647
   13    1490.7327
   23    375.72226
   25    25.792104
   26    573.83808
   31    1663.5621
   32    1663.5621
   33    1520.9516
   34    1083.0124
   35    1083.0124
   36    908.48652
   41    5000
   42    5000
   43    1679.4928
   44    5000
   45    5000
   46    1282.0375
   47    5000
   48    5000
   49    1717.9825

BLOCK SMINPUTS
   1    127.90897
   2    1.1663787e-05
   3    0.1184
   4    91.1876
   5    4.18
   6    173.2
   7    1.777
   8    0
   11    0.00051099893
   12    0
   13    0.10565837
   14    0
   21    0.005
   22    0.0025
   23    0.095
   24    1.27

BLOCK GAUGE Q=  1406.8853
   1    0.35536298
   2    0.66519887
   3    1.219778

BLOCK YU Q=  1406.8853
   1   1    8.3906716e-06
   2   2    0.0042624612
   3   3    1.0136605

BLOCK YD Q=  1406.8853
   1   1    0.0004348743
   2   2    0.0082626118
   3   3    0.43125904

BLOCK YE Q=  1406.8853
   1   1    7.5888746e-05
   2   2    0.015691386
   3   3    0.2639033

BLOCK AU Q=  1406.8853
   1   1    0
   2   2    0
   3   3    3039.5509

BLOCK AD Q=  1406.8853
   1   1    0
   2   2    0
   3   3    1420.3646

BLOCK AE Q=  1406.8853
   1   1    0
   2   2    0
   3   3    1490.7328

BLOCK MSOFT Q=  1406.8853
   1   -1652.1919
   2   -1555.8906
   3    3000
   21    179416.74
   22   -95410.526
   31    1663.5621
   32    1663.5621
   33    1520.9516
   34    1083.0124
   35    1083.0124
   36    908.48652
   41    5000
   42    5000
   43    1679.4928
   44    5000
   45    5000
   46    1282.0375
   47    5000
   48    5000
   49    1717.9825

BLOCK MASS
   6    173.2
   23    91.1876
   24    80.429995
   15    1.777
   25    123.36353
   35    573.87906
   36    573.83808
   37    580.31256
   1000001    5023.1942
   2000001    5015.1656
   1000002    5022.7556
   2000002    5016.0418
   1000003    5023.1964
   2000003    5015.1684
   1000004    5022.7576
   2000004    5016.0426
   1000005    1657.0935
   2000005    1732.4754
   1000006    1160.0174
   2000006    1706.2901
   1000011    1675.1465
   2000011    1090.6998
   1000012    1672.894
   1000013    1675.1432
   2000013    1090.6913
   1000014    1672.8903
   1000015    913.58646
   2000015    1531.8474
   1000016    1529.2628
   1000021    3182.4444
   1000022   -378.66457
   1000023    385.04125
   1000025   -1602.8332
   1000035   -1646.0896
   1000024    381.70988
   1000037    1603.1116

BLOCK ALPHA
      -0.040056252

BLOCK HMIX Q=  1406.8853
   1    375.72226
   2    25.792104
   3    244.05737
   4    329290.15

BLOCK STOPMIX
   1   1   -0.31068529
   1   2    0.95051284
   2   1   -0.95051284
   2   2   -0.31068529

BLOCK SBOTMIX
   1   1    0.99747564
   1   2    0.071009473
   2   1   -0.071009473
   2   2    0.99747564

BLOCK STAUMIX
   1   1    0.0095398292
   1   2    0.99995449
   2   1   -0.99995449
   2   2    0.0095398292

BLOCK NMIX
   1   1   -0.024137467
   1   2    0.044282627
   1   3   -0.70962637
   1   4   -0.70277084
   2   1    0.016291628
   2   2   -0.029755237
   2   3   -0.70447746
   2   4    0.70891517
   3   1    0.036684775
   3   2    0.99795893
   3   3    0.010271396
   3   4    0.05125129
   4   1   -0.99890249
   4   2    0.035094784
   4   3    0.0060349256
   4   4    0.030426025

BLOCK UMIX
   1   1   -0.014925244
   1   2    0.99988861
   2   1   -0.99988861
   2   2   -0.014925244

BLOCK VMIX
   1   1    0.074226864
   1   2    0.99724138
   2   1    0.99724138
   2   2   -0.074226864

BLOCK HIGGSBOUNDSINPUTHIGGSCOUPLINGSFERMIONS
       0, 665.23264,3,36,15,15

BLOCK HIGGSBOUNDSINPUTHIGGSCOUPLINGSBOSONS
       0,4,36,21,21,23

BLOCK SPHENOLOWENERGY
   1    0.00041791402
   2    1.5899459e-06
   3    3.5242787e-05
   4    2.2856971e-15
   5    9.7641104e-11
   6    2.0365302e-08
   7    7.6066033e-14
   8    3.2494905e-09
   9    6.8640271e-07
   10    8.3395078e-05
   11    0.86143923
   12    0.54366788
   13    19.37743
   14    0
   15    0
   16    0.0021661099
   17    2.2817613e-15
   18    2.4783966e-11
   19    8.2869859e-11
   20   -3.528563e-15
   21   -1.5085634e-10
   22   -4.510905e-08
   23    0
   24    0
   25    0
   26    0
   27    0
   28    0
   29    0
   30    0
   31    0
   39    7.6688784e-05
   40    0
   41    0
   42    0

BLOCK FWCOEF Q=  160
   305   4422   0   0   -0.18881911
   305   4422   0   2   -0.28739354
   305   4322   0   2   -0.0015401265
   305   6421   0   0   -0.095227835
   305   6421   0   2   -0.18387127
   305   6321   0   2   -0.0015536814
   3051111   4133   0   0    1.5896746
   3051111   4133   0   2    1.5917303
   3051111   4233   0   2   -7.1467827e-05
   3051111   4137   0   0   -4.4123667
   3051111   4137   0   2   -4.409704
   3051111   4237   0   2    0.00056179193
   3051313   4133   0   0    1.5896746
   3051313   4133   0   2    1.5917292
   3051313   4233   0   2   -7.1483873e-05
   3051313   4137   0   0   -4.4123667
   3051313   4137   0   2   -4.4097051
   3051313   4237   0   2    0.00056180725
   3051212   4137   0   0    1.5053501
   3051212   4137   0   2    1.5047742
   3051212   4237   0   2   -0.00012249879
   3051414   4137   0   0    1.5053501
   3051414   4137   0   2    1.5047742
   3051414   4237   0   2   -0.00012249533
   3051616   4137   0   0    1.5053501
   3051616   4137   0   2    1.5047741
   3051616   4237   0   2   -0.00012152173

BLOCK IMFWCOEF Q=  160
   305   4422   0   0    3.8578016e-07
   305   4422   0   2   -8.3678867e-06
   305   4322   0   2   -3.2860768e-06
   305   6421   0   0    3.3044622e-07
   305   6421   0   2   -7.642811e-06
   305   6321   0   2   -1.2905705e-06
   3051111   4133   0   2    4.7727974e-07
   3051111   4233   0   2    1.8789366e-06
   3051111   4137   0   2   -2.9475654e-06
   3051111   4237   0   2   -1.4656444e-05
   3051313   4133   0   2    4.7727122e-07
   3051313   4233   0   2    1.8789329e-06
   3051313   4137   0   2   -2.9475726e-06
   3051313   4237   0   2   -1.4656453e-05
   3051212   4137   0   2    7.1435487e-07
   3051212   4237   0   2    3.1958765e-06
   3051414   4137   0   2    7.1435481e-07
   3051414   4237   0   2    3.1958765e-06
   3051616   4137   0   2    7.1332202e-07
   3051616   4237   0   2    3.195877e-06

DECAY 23  2.4952


DECAY 24  2.085


DECAY 2000011  0.0035844563
    0.68900028   2    1000022    11
    0.31097287   2    1000023    11

DECAY 1000011  0.17348118
    0.60186376   2   -1000037    12
    0.3140207   2    1000025    11
    0.037703047   2    1000022    11
    0.017020155   2   -1000024    12
    0.016898653   2    1000023    11
    0.012493661   2    1000035    11

DECAY 2000013  0.011809924
    0.38528413   2    1000022    13
    0.34827747   2   -1000024    14
    0.2664384   2    1000023    13

DECAY 1000013  0.18095607
    0.57695057   2   -1000037    14
    0.30102241   2    1000025    13
    0.056703904   2    1000022    13
    0.036390361   2    1000023    13
    0.01631705   2   -1000024    14
    0.01197474   2    1000035    13
    0.00064058455   2    2000013    25

DECAY 1000015  1.7278601
    0.49934152   2   -1000024    16
    0.2547231   2    1000022    15
    0.24593538   2    1000023    15

DECAY 2000015  2.4098093
    0.39229661   2    1000022    15
    0.38544685   2    1000023    15
    0.098985381   2    1000015    36
    0.098957276   2    1000015    35
    0.011926111   2    1000015    23
    0.011776855   2    1000015    25
    0.00061091034   2   -1000024    16

DECAY 1000012  0.25187666
    0.3879914   2    1000037    11
    0.28946482   2    1000024    11
    0.18818018   2    1000025    12
    0.086029731   2    1000022    12
    0.038778577   2    1000023    12
    0.0095552843   2    1000035    12

DECAY 1000014  0.25922386
    0.37695552   2    1000037    13
    0.30966378   2    1000024    13
    0.18282812   2    1000025    14
    0.083591161   2    1000022    14
    0.037679372   2    1000023    14
    0.009281943   2    1000035    14

DECAY 1000016  2.4413884
    0.78983409   2    1000024    15
    0.17517222   2    1000015    37
    0.023474286   2    1000015    24
    0.0079421702   2    1000022    16
    0.0035772398   2    1000023    16

DECAY 2000001  143.4743
    0.98445934   2    1000021    1
    0.015502865   2    1000035    1

DECAY 1000001  196.15898
    0.72431359   2    1000021    1
    0.18180442   2   -1000037    2
    0.089377113   2    1000025    1
    0.0040733448   2    1000035    1
    0.00026304785   2    1000022    1
    0.00011884046   2    1000023    1

DECAY 2000003  143.48802
    0.98436723   2    1000021    3
    0.015501398   2    1000035    3

DECAY 1000003  196.16775
    0.72428233   2    1000021    3
    0.18179645   2   -1000037    4
    0.089373173   2    1000025    3
    0.0040731662   2    1000035    3
    0.00028030248   2    1000022    3
    0.00013584676   2    1000023    3

DECAY 1000005  72.65766
    0.52090325   2    1000006   -24
    0.40258859   2   -1000024    6
    0.03884484   2    1000022    5
    0.03725645   2    1000023    5
    0.00040618935   2    1000025    5

DECAY 2000005  11.953976
    0.49123746   2   -1000024    6
    0.24258185   2    1000023    5
    0.2418814   2    1000022    5
    0.023446776   2    1000006   -24
    0.00076708933   2    1000035    5

DECAY 2000002  150.25673
    0.94062895   2    1000021    2
    0.059227671   2    1000035    2

DECAY 1000002  196.15
    0.72411385   2    1000021    2
    0.18082836   2    1000037    1
    0.091740841   2    1000025    2
    0.0018307169   2    1000035    2
    0.0012277554   2    1000024    1
    0.00017815045   2    1000022    2

DECAY 2000004  150.26034
    0.94060654   2    1000021    4
    0.059226251   2    1000035    4

DECAY 1000004  196.15869
    0.72408252   2    1000021    4
    0.18082046   2    1000037    3
    0.091736815   2    1000025    4
    0.0018306449   2    1000035    4
    0.0012619785   2    1000024    3
    0.0001826642   2    1000022    4

DECAY 1000006  37.130904
    0.48016259   2    1000024    5
    0.26020778   2    1000023    6
    0.25960341   2    1000022    6

DECAY 2000006  77.476686
    0.28319924   2    1000006    23
    0.24180703   2    1000006    25
    0.19082058   2    1000023    6
    0.187069   2    1000022    6
    0.094531268   2    1000024    5
    0.0025728827   2    1000037    5

DECAY 1000024  7.9119672e-10
    0.46449366   3    1000022   -1    2
    0.19937783   3    1000022   -3    4
    0.15483424   3    1000022   -11    12
    0.15390992   3    1000022   -13    14
    0.027384354   3    1000022   -15    16

DECAY 1000037  24.64356
    0.1368019   2    1000023    24
    0.13582803   2    1000024    23
    0.13490074   2    1000024    25
    0.13486105   2    1000022    24
    0.10968591   2    1000024    36
    0.1095444   2    1000024    35
    0.10846459   2    37    1000023
    0.10192072   2    37    1000022
    0.007983726   2    1000006   -5
    0.0057876603   3    1000024    6   -6
    0.0049820567   3    1000022   -5    6
    0.0045590312   3    1000023   -5    6
    0.0023070965   2    1000016   -15
    0.0021633533   2   -2000015    16
    0.00020483288   3    1000024    5   -5

DECAY 1000022 -1


DECAY 1000023  7.5609469e-08
    0.6226142   2    1000022    22
    0.096285938   3    1000022    12   -12
    0.072000058   3    1000022    1   -1
    0.071814188   3    1000022    3   -3
    0.056153605   3    1000022    2   -2
    0.032657359   3    1000022    4   -4
    0.016248247   3    1000022    11   -11
    0.016182425   3    1000022    13   -13
    0.004715409   3    1000022    15   -15
    0.0025272886   3    1000024    1   -2
    0.0025272886   3   -1000024   -1    2
    0.001251519   3    1000024    3   -4
    0.001251519   3   -1000024   -3    4
    0.00084243453   3    1000024    11   -12
    0.00084243453   3   -1000024   -11    12
    0.00083822806   3    1000024    13   -14
    0.00083822806   3   -1000024   -13    14
    0.00020481609   3    1000024    15   -16
    0.00020481609   3   -1000024   -15    16

DECAY 1000025  25.915829
    0.13607637   2    1000024   -24
    0.13607637   2   -1000024    24
    0.10078211   2    1000023    25
    0.099423906   2    37   -1000024
    0.099423906   2   -37    1000024
    0.086296641   2    1000023    23
    0.083681676   2    1000022    25
    0.078981916   2    1000022    35
    0.066798288   2    1000023    35
    0.037744872   2    1000022    23
    0.024928958   2    1000023    36
    0.02197783   2    1000022    36
    0.0049882132   2    1000006   -6
    0.0049882132   2   -1000006    6
    0.0047185171   3    1000024    5   -6
    0.0047185171   3   -1000024   -5    6
    0.0018433442   3    1000023    6   -6
    0.0016695527   3    1000022    6   -6
    0.0010567247   2    2000015   -15
    0.0010567247   2   -2000015    15
    0.0010481381   2    1000016   -16
    0.0010481381   2   -1000016    16
    0.00010814778   3    1000022    5   -5
    0.00010515831   3    1000023    5   -5

DECAY 1000035  19.808944
    0.099730067   2    1000015   -15
    0.099730067   2   -1000015    15
    0.066101184   2    1000006   -6
    0.066101184   2   -1000006    6
    0.065552323   2    2000013   -13
    0.065552323   2   -2000013    13
    0.065550739   2    2000011   -11
    0.065550739   2   -2000011    11
    0.048004363   2    1000024   -24
    0.048004363   2   -1000024    24
    0.045458732   2    1000023    25
    0.043344479   2    1000023    23
    0.037743569   2    1000022    25
    0.03615238   2    1000022    35
    0.032703588   2    37   -1000024
    0.032703588   2   -37    1000024
    0.030579514   2    1000023    35
    0.019116738   2    1000022    23
    0.01190148   2    1000023    36
    0.010482261   2    1000022    36
    0.0019456245   3    1000024    5   -6
    0.0019456245   3   -1000024   -5    6
    0.0011262145   3    1000023    6   -6
    0.0011087445   2    1000016   -16
    0.0011087445   2   -1000016    16
    0.0010268896   3    1000022    6   -6
    0.00081705595   2    2000015   -15
    0.00081705595   2   -2000015    15

DECAY 1000021  216.55252
    0.17543988   2    1000006   -6
    0.17543988   2   -1000006    6
    0.11548904   2    1000005   -5
    0.11548904   2   -1000005    5
    0.10774448   2    2000005   -5
    0.10774448   2   -2000005    5
    0.10016226   2    2000006   -6
    0.10016226   2   -2000006    6
    0.00081391597   2    1000006   -4
    0.00081391597   2   -1000006    4
    0.00023063639   3    1000025    6   -6
    0.00016792886   3    1000037    5   -6
    0.00016792886   3   -1000037   -5    6

DECAY 25  0.0039913861
    0.62172328   2   -5    5
    0.18643243   2   -24    24
    0.072179301   2   -15    15
    0.066662679   2    21    21
    0.027260389   2   -4    4
    0.021839513   2    23    23
    0.0021616914   2    22    22
    0.0012531181   2    22    23
    0.00025041417   2   -13    13
    0.00023638449   2   -3    3
    6.5357766e-07   2   -1    1
    1.4048411e-07   2   -2    2
    5.629611e-09   2   -11    11

DECAY 35  5.4019582
    0.84333094   2   -5    5
    0.15155011   2   -15    15
    0.0033981416   2   -6    6
    0.00056388411   2    25    25
    0.00052705228   2   -13    13
    0.00039270812   2   -3    3
    0.00012208716   2    21    21
    7.639176e-05   2   -24    24
    3.7413248e-05   2    23    23
    1.0857719e-06   2   -1    1
    9.664069e-08   2   -4    4
    6.5107413e-08   2    22    22
    1.5718918e-08   2    22    23
    1.1843291e-08   2   -11    11
    4.9848276e-13   2   -2    2

DECAY 36  5.3310735
    0.842741   2   -5    5
    0.15142679   2   -15    15
    0.0046665225   2   -6    6
    0.00052660105   2   -13    13
    0.00039237236   2   -3    3
    0.00018064815   2    21    21
    6.4524132e-05   2    23    25
    1.0848434e-06   2   -1    1
    2.4858674e-07   2    22    22
    1.0707645e-07   2    22    23
    8.4048525e-08   2   -4    4
    1.183315e-08   2   -11    11
    4.3390158e-13   2   -2    2
    1.1692296e-36   2    25    25

DECAY 37  4.4649927
    0.81188758   2   -5    6
    0.18551323   2   -15    16
    0.0013988174   2   -5    4
    0.00065586728   2   -13    14
    0.00042094375   2   -3    4
    8.1694789e-05   2    24    25
    1.9285644e-05   2   -3    2
    1.0875552e-05   2   -3    6
    9.9890908e-06   2   -5    2
    1.1679653e-06   2   -1    2
    4.7546769e-07   2   -1    6
    5.8569727e-08   2   -1    4
    1.5340805e-08   2   -11    12
    3.4253476e-09   2    24    36
    3.3184917e-09   2    24    35

DECAY 6  2.43
    1   2    5    24

DECAY 15 -1
