BLOCK SPINFO
   1   SPheno
   2   v4.0.5be

BLOCK SPHENOINFO
   1   2
   2   2

BLOCK MODSEL
   1   0

BLOCK MINPAR
   3    57.324765
   4   -1

BLOCK EXTPAR
   0    1535.0574
   1   -1548.5117
   2    383.05096
   3    3000
   11   -3908.1927
   12    606.99275
   13   -614.90368
   23   -563.11154
   25    57.693813
   26    2241.391
   31    412.57531
   32    412.57531
   33    1781.5822
   34    386.03598
   35    386.03598
   36    828.0485
   41    5000
   42    5000
   43    1513.9755
   44    5000
   45    5000
   46    1696.405
   47    5000
   48    5000
   49    939.88767

BLOCK SMINPUTS
   1    127.90897
   2    1.1663787e-05
   3    0.1184
   4    91.1876
   5    4.18
   6    173.2
   7    1.777
   8    0
   11    0.00051099893
   12    0
   13    0.10565837
   14    0
   21    0.005
   22    0.0025
   23    0.095
   24    1.27

BLOCK GAUGE Q=  1535.0574
   1    0.35536298
   2    0.66519887
   3    1.219778

BLOCK YU Q=  1535.0574
   1   1    8.3856315e-06
   2   2    0.0042599008
   3   3    1.0130516

BLOCK YD Q=  1535.0574
   1   1    0.00097217682
   2   2    0.01847136
   3   3    0.96409477

BLOCK YE Q=  1535.0574
   1   1    0.00016965196
   2   2    0.035078646
   3   3    0.58996511

BLOCK AU Q=  1535.0574
   1   1    0
   2   2    0
   3   3   -3908.1927

BLOCK AD Q=  1535.0574
   1   1    0
   2   2    0
   3   3    606.99272

BLOCK AE Q=  1535.0574
   1   1    0
   2   2    0
   3   3   -614.90368

BLOCK MSOFT Q=  1535.0574
   1   -1548.5117
   2    383.05096
   3    3000
   21    4866591.6
   22   -274439.67
   31    412.57531
   32    412.57531
   33    1781.5822
   34    386.03598
   35    386.03598
   36    828.0485
   41    5000
   42    5000
   43    1513.9755
   44    5000
   45    5000
   46    1696.405
   47    5000
   48    5000
   49    939.88767

BLOCK MASS
   6    173.2
   23    91.1876
   24    80.429995
   15    1.777
   25    124.7924
   35    2238.5341
   36    2241.391
   37    2240.9821
   1000001    5032.3453
   2000001    5021.5341
   1000002    5031.9046
   2000002    5022.3828
   1000003    5032.3542
   2000003    5021.545
   1000004    5031.9116
   2000004    5022.3835
   1000005    905.87463
   2000005    1485.6664
   1000006    1361.6067
   2000006    1730.6035
   1000011    422.38692
   2000011    404.71957
   1000012    414.5529
   1000013    423.0671
   2000013    403.96386
   1000014    414.53678
   1000015    825.58501
   2000015    1781.0203
   1000016    1778.5669
   1000021    3194.6451
   1000022    392.75467
   1000023   -568.18393
   1000025    583.48587
   1000035   -1540.6036
   1000024    393.21957
   1000037    586.96889

BLOCK ALPHA
      -0.017502021

BLOCK HMIX Q=  1535.0574
   1   -563.11154
   2    57.693813
   3    243.93955
   4    5023833.8

BLOCK STOPMIX
   1   1    0.834274
   1   2    0.55135006
   2   1   -0.55135006
   2   2    0.834274

BLOCK SBOTMIX
   1   1   -0.058486515
   1   2    0.9982882
   2   1   -0.9982882
   2   2   -0.058486515

BLOCK STAUMIX
   1   1   -0.021936745
   1   2    0.99975936
   2   1   -0.99975936
   2   2   -0.021936745

BLOCK NMIX
   1   1    0.0038501792
   1   2    0.95119051
   1   3    0.2548777
   1   4    0.17395157
   2   1    0.032313876
   2   2    0.059169634
   2   3   -0.70389396
   2   4    0.70709834
   3   1    0.013867048
   3   2   -0.30287568
   3   3    0.66288189
   3   4    0.68458866
   4   1   -0.99937415
   4   2    0.0013751232
   4   3   -0.012579875
   4   4    0.03303273

BLOCK UMIX
   1   1   -0.93504001
   1   2   -0.35454221
   2   1    0.35454221
   2   2   -0.93504001

BLOCK VMIX
   1   1   -0.9703143
   1   2    0.24184739
   2   1    0.24184739
   2   2    0.9703143

BLOCK HIGGSBOUNDSINPUTHIGGSCOUPLINGSFERMIONS
       0, 3328.576,3,36,15,15

BLOCK HIGGSBOUNDSINPUTHIGGSCOUPLINGSBOSONS
       0,4,36,21,21,23

BLOCK SPHENOLOWENERGY
   1    0.00041757814
   2    1.5910126e-06
   3    3.5261744e-05
   4    2.6168064e-15
   5    1.115976e-10
   6    1.2513043e-08
   7    8.7048028e-14
   8    3.7125668e-09
   9    4.3215895e-07
   10    9.0723831e-05
   11    0.93714244
   12    0.54327202
   13    19.301933
   14    0
   15    0
   16    0.0021698802
   17    2.2817905e-15
   18    2.4803031e-11
   19    8.2911755e-11
   20   -2.3175225e-14
   21   -9.9016805e-10
   22   -1.0497986e-07
   23    0
   24    0
   25    0
   26    0
   27    0
   28    0
   29    0
   30    0
   31    0
   39    9.9674853e-05
   40    0
   41    0
   42    0

BLOCK FWCOEF Q=  160
   305   4422   0   0   -0.18881911
   305   4422   0   2   -0.29553287
   305   4322   0   2   -0.00084422195
   305   6421   0   0   -0.095227835
   305   6421   0   2   -0.15640332
   305   6321   0   2   -0.00049378406
   3051111   4133   0   0    1.5937619
   3051111   4133   0   2    1.5948832
   3051111   4233   0   2    0.00049405538
   3051111   4137   0   0   -4.416454
   3051111   4137   0   2   -4.4156209
   3051111   4237   0   2   -0.003834334
   3051313   4133   0   0    1.5937619
   3051313   4133   0   2    1.5948708
   3051313   4233   0   2    0.00049404685
   3051313   4137   0   0   -4.416454
   3051313   4137   0   2   -4.4156332
   3051313   4237   0   2   -0.0038343464
   3051212   4137   0   0    1.5053501
   3051212   4137   0   2    1.5052178
   3051212   4237   0   2    0.00083531722
   3051414   4137   0   0    1.5053501
   3051414   4137   0   2    1.5052178
   3051414   4237   0   2    0.00083531798
   3051616   4137   0   0    1.5053501
   3051616   4137   0   2    1.505215
   3051616   4237   0   2    0.00083553077

BLOCK IMFWCOEF Q=  160
   305   4422   0   0    3.8561685e-07
   305   4422   0   2   -5.0891534e-05
   305   4322   0   2   -1.1615811e-05
   305   6421   0   0    3.3030633e-07
   305   6421   0   2    1.5686843e-05
   305   6321   0   2   -4.3840059e-06
   3051111   4133   0   2   -2.6323946e-06
   3051111   4233   0   2    1.1031739e-05
   3051111   4137   0   2    1.4174742e-05
   3051111   4237   0   2   -8.5647725e-05
   3051313   4133   0   2   -2.6329636e-06
   3051313   4233   0   2    1.1031652e-05
   3051313   4137   0   2    1.4174932e-05
   3051313   4237   0   2   -8.564801e-05
   3051212   4137   0   2   -2.230712e-06
   3051212   4237   0   2    1.865849e-05
   3051414   4137   0   2   -2.2307102e-06
   3051414   4237   0   2    1.865849e-05
   3051616   4137   0   2   -2.2823504e-06
   3051616   4237   0   2    1.8658484e-05

DECAY 23  2.4952


DECAY 24  2.085


DECAY 2000011  1.0243748e-07
    0.99910752   2    1000022    11
    0.00089247757   2   -1000024    12

DECAY 1000011  0.088764173
    0.65114792   2   -1000024    12
    0.3488515   2    1000022    11

DECAY 2000013  5.4307966e-06
    0.63056869   2   -1000024    14
    0.36943131   2    1000022    13

DECAY 1000013  0.092653049
    0.65119078   2   -1000024    14
    0.34880837   2    1000022    13

DECAY 1000015  3.3422908
    0.35869691   2   -1000037    16
    0.23480879   2    1000023    15
    0.18526037   2    1000025    15
    0.14576431   2   -1000024    16
    0.075469623   2    1000022    15

DECAY 2000015  31.972145
    0.38206943   2   -1000024    16
    0.22134658   2    1000022    15
    0.15564524   2    1000023    15
    0.15424677   2    1000025    15
    0.054107767   2   -1000037    16
    0.014379862   2    1000015    25
    0.013777322   2    1000015    23
    0.0044270253   2    1000035    15

DECAY 1000012  0.051783329
    0.66715001   2    1000024    11
    0.33284999   2    1000022    12

DECAY 1000014  0.051728378
    0.66726367   2    1000024    13
    0.33273633   2    1000022    14

DECAY 1000016  32.023832
    0.4602694   2    1000024    15
    0.28957003   2    1000037    15
    0.19926503   2    1000022    16
    0.027441125   2    1000015    24
    0.018741795   2    1000025    16
    0.0043664684   2    1000035    16
    0.00034615434   2    1000023    16

DECAY 2000001  142.7492
    0.98387881   2    1000021    1
    0.016095952   2    1000035    1

DECAY 1000001  207.67637
    0.68170006   2    1000021    1
    0.18422874   2   -1000024    2
    0.095189368   2    1000022    1
    0.026088816   2   -1000037    2
    0.009678781   2    1000025    1
    0.0028174123   2    1000035    1
    0.00029682286   2    1000023    1

DECAY 2000003  142.81661
    0.98342238   2    1000021    3
    0.016088433   2    1000035    3
    0.00020300056   2   -1000037    4
    0.00013521843   2    1000023    3
    0.00010573215   2    1000025    3

DECAY 1000003  207.7124
    0.6815863   2    1000021    3
    0.18419756   2   -1000024    4
    0.095183568   2    1000022    3
    0.026092409   2   -1000037    4
    0.0097472398   2    1000025    3
    0.0028169515   2    1000035    3
    0.00037596464   2    1000023    3

DECAY 1000005  11.382054
    0.30887888   2   -1000037    6
    0.26772922   2    1000023    5
    0.21575899   2    1000025    5
    0.13046998   2   -1000024    6
    0.07716292   2    1000022    5

DECAY 2000005  62.883673
    0.35704682   2   -1000037    6
    0.15843543   2    1000023    5
    0.15794805   2   -1000024    6
    0.14767334   2    1000025    5
    0.10048238   2    1000022    5
    0.044467566   2    1000006   -24
    0.01953708   2    1000005    25
    0.014409334   2    1000005    23

DECAY 2000002  149.74283
    0.93851717   2    1000021    2
    0.061391493   2    1000035    2

DECAY 1000002  207.67292
    0.68149049   2    1000021    2
    0.19837649   2    1000024    1
    0.095457202   2    1000022    2
    0.012138981   2    1000037    1
    0.0093673224   2    1000025    2
    0.0027313685   2    1000035    2
    0.000438146   2    1000023    2

DECAY 2000004  149.74637
    0.93849505   2    1000021    4
    0.061390042   2    1000035    4

DECAY 1000004  207.70865
    0.68137646   2    1000021    4
    0.19836304   2    1000024    3
    0.095441149   2    1000022    4
    0.012276378   2    1000037    3
    0.009369738   2    1000025    4
    0.0027309131   2    1000035    4
    0.00044232772   2    1000023    4

DECAY 1000006  47.040553
    0.28014095   2    1000037    5
    0.25920565   2    1000024    5
    0.17271681   2    1000023    6
    0.13156626   2    1000025    6
    0.10786584   2    1000022    6
    0.032407703   2    1000022    4
    0.014328311   2    1000005    24
    0.0016461311   3    1000022    24    5
    0.0001223412   2    1000023    4

DECAY 2000006  103.28459
    0.27963753   2    1000037    5
    0.18148441   2    1000006    23
    0.15848676   2    2000005    24
    0.15804179   2    1000025    6
    0.13852848   2    1000023    6
    0.047208639   2    1000006    25
    0.017547174   2    1000024    5
    0.013374557   2    1000005    24
    0.0054740916   2    1000022    6
    0.00021656574   2    1000035    6

DECAY 1000024  2.8400065e-13
    0.89687063   2    1000022    211
    0.058022702   3    1000022   -11    12
    0.045106672   3    1000022   -13    14

DECAY 1000037  2.1427569
    0.34365567   2    1000022    24
    0.31566558   2    1000024    23
    0.23345225   2    1000024    25
    0.035234977   2   -1000011    12
    0.034991454   2   -1000013    14
    0.018459532   2    1000014   -13
    0.017715122   2    1000012   -11
    0.00081216157   2   -2000013    14

DECAY 1000022 -1


DECAY 1000023  3.6969211
    0.28533077   2    1000022    23
    0.27325193   2    1000024   -24
    0.27325193   2   -1000024    24
    0.16470297   2    1000022    25
    0.00057780756   2    1000013   -13
    0.00057780756   2   -1000013    13
    0.00039545219   2    1000011   -11
    0.00039545219   2   -1000011    11
    0.00032630585   2    2000013   -13
    0.00032630585   2   -2000013    13
    0.00014562035   2    1000022    22
    0.00012994105   2    1000014   -14
    0.00012994105   2   -1000014    14
    0.00012991804   2    1000012   -12
    0.00012991804   2   -1000012    12

DECAY 1000025  2.2814617
    0.33367269   2    1000024   -24
    0.33367269   2   -1000024    24
    0.21837222   2    1000022    25
    0.01522174   2    1000022    23
    0.013291669   2    1000014   -14
    0.013291669   2   -1000014    14
    0.013289562   2    1000012   -12
    0.013289562   2   -1000012    12
    0.011365036   2    1000013   -13
    0.011365036   2   -1000013    13
    0.011131676   2    1000011   -11
    0.011131676   2   -1000011    11
    0.00040657536   2    2000013   -13
    0.00040657536   2   -2000013    13

DECAY 1000035  29.744422
    0.11270537   2    2000013   -13
    0.11270537   2   -2000013    13
    0.11264294   2    2000011   -11
    0.11264294   2   -2000011    11
    0.06601675   2    1000015   -15
    0.06601675   2   -1000015    15
    0.030281493   2    1000037   -24
    0.030281493   2   -1000037    24
    0.028100305   2    1000014   -14
    0.028100305   2   -1000014    14
    0.028099964   2    1000012   -12
    0.028099964   2   -1000012    12
    0.027646536   2    1000011   -11
    0.027646536   2   -1000011    11
    0.027632123   2    1000013   -13
    0.027632123   2   -1000013    13
    0.027180427   2    1000023    25
    0.02545101   2    1000025    23
    0.022406364   2    1000025    25
    0.018370419   2    1000005   -5
    0.018370419   2   -1000005    5
    0.0057311017   2    1000023    23
    0.0035794582   2    1000024   -24
    0.0035794582   2   -1000024    24
    0.0027564699   2    1000022    23
    0.002478646   2    1000022    25
    0.00071959149   3    1000037    5   -6
    0.00071959149   3   -1000037   -5    6
    0.00052818056   2    1000006   -6
    0.00052818056   2   -1000006    6
    0.0004300257   3    1000023    6   -6
    0.00035531392   3    1000025    6   -6
    0.00012995997   3    1000024    5   -6
    0.00012995997   3   -1000024   -5    6

DECAY 1000021  268.46764
    0.14898014   2    1000005   -5
    0.14898014   2   -1000005    5
    0.10813215   2    2000005   -5
    0.10813215   2   -2000005    5
    0.10344707   2    1000006   -6
    0.10344707   2   -1000006    6
    0.099924454   2    2000006   -6
    0.099924454   2   -2000006    6
    0.039393108   2    1000006   -4
    0.039393108   2   -1000006    4

DECAY 25  0.0038467733
    0.57683222   2   -5    5
    0.2254264   2   -24    24
    0.071525647   2    21    21
    0.066330676   2   -15    15
    0.02843503   2   -4    4
    0.027176596   2    23    23
    0.0023432258   2    22    22
    0.0014830637   2    22    23
    0.00022965293   2   -13    13
    0.00021673808   2   -3    3
    5.992599e-07   2   -1    1
    1.4653276e-07   2   -2    2
    5.1627572e-09   2   -11    11

DECAY 35  139.14902
    0.7338886   2   -5    5
    0.10149191   2   -15    15
    0.046082414   2   -1000024    1000037
    0.046082414   2   -1000037    1000024
    0.025067005   2    1000022    1000023
    0.016559119   2    1000022    1000025
    0.011879147   2   -1000024    1000024
    0.0058744695   2    1000022    1000022
    0.0035644544   2   -1000037    1000037
    0.0030932158   2    1000025    1000025
    0.0029061884   2    1000023    1000025
    0.0020195144   2    1000025    1000035
    0.00028945733   2    1000022    1000035
    0.00028502056   2    1000023    1000035
    0.00026710385   2   -13    13
    0.00025720764   2   -6    6
    0.00025057956   2   -3    3
    7.8520381e-05   2    1000023    1000023
    4.6618994e-05   2   -1000005    1000005
    9.0915045e-06   2    21    21
    6.6006092e-06   2   -1000015    1000015
    6.9290323e-07   2   -1    1
    1.3500231e-07   2    25    25
    1.2318419e-07   2    22    23
    6.5931888e-08   2    23    23
    4.5922457e-08   2    22    22
    2.9760072e-08   2   -24    24
    2.954729e-08   2   -2000013    2000013
    2.4470681e-08   2   -2000011    2000011
    1.5991032e-08   2   -1000011    1000011
    1.175253e-08   2   -1000013    1000013
    5.9996145e-09   2   -11    11
    2.5857256e-09   2   -2000013    1000013
    2.5857256e-09   2   -1000013    2000013
    1.9966494e-09   2   -4    4
    6.6486896e-14   2   -2000011    1000011
    6.6486896e-14   2   -1000011    2000011
    1.0289747e-14   2   -2    2

DECAY 36  129.03785
    0.7222809   2   -5    5
    0.099884915   2   -15    15
    0.048868029   2   -1000024    1000037
    0.048868029   2   -1000037    1000024
    0.024204297   2    1000022    1000023
    0.020058154   2    1000022    1000025
    0.013791881   2   -1000024    1000024
    0.0068089576   2    1000022    1000022
    0.0047228397   2   -1000037    1000037
    0.0042487025   2    1000025    1000025
    0.0025217539   2    1000023    1000035
    0.002443436   2    1000023    1000025
    0.00029350375   2   -6    6
    0.00026283641   2   -13    13
    0.00024670574   2    1000025    1000035
    0.00024658677   2   -3    3
    0.00012219973   2    1000023    1000023
    0.00010787361   2    1000022    1000035
    1.7561372e-05   2    21    21
    6.8186202e-07   2   -1    1
    9.9344911e-08   2    23    25
    3.390245e-08   2    22    23
    5.903773e-09   2   -11    11
    3.6176812e-09   2   -2000013    1000013
    3.6176812e-09   2   -1000013    2000013
    2.3066138e-09   2   -4    4
    2.0135078e-09   2    22    22
    1.6191498e-12   2    23    35
    8.461785e-14   2   -2000011    1000011
    8.461785e-14   2   -1000011    2000011
    1.1888621e-14   2   -2    2
    9.2348191e-41   2    25    25

DECAY 37  120.32313
    0.68670601   2   -5    6
    0.12239644   2   -15    16
    0.064207102   2    1000022    1000037
    0.059840183   2    1000024    1000025
    0.05818324   2    1000023    1000024
    0.0037356487   2    1000023    1000037
    0.0025590512   2    1000035    1000037
    0.0010201516   2   -5    4
    0.00043451193   2    1000024    1000035
    0.00043271535   2   -13    14
    0.00026164749   2   -3    4
    0.00020185247   2    1000025    1000037
    1.2213145e-05   2   -3    2
    7.2849372e-06   2   -5    2
    7.2655858e-07   2   -1    2
    7.1165391e-07   2   -3    6
    1.1950015e-07   2    1000022    1000024
    1.1673124e-07   2   -2000013    1000014
    1.1096689e-07   2   -2000011    1000012
    1.066006e-07   2    24    25
    3.3953177e-08   2   -1    4
    1.5026032e-08   2   -1    6
    1.0121257e-08   2   -11    12
    1.3324306e-09   2   -1000013    1000014
    9.9408794e-13   2    24    35
    2.9541232e-14   2   -1000011    1000012

DECAY 6  2.43
    1   2    5    24

DECAY 15 -1
