BLOCK SPINFO
   1   SPheno
   2   v4.0.5be

BLOCK SPHENOINFO
   1   2
   2   2

BLOCK MODSEL
   1   0

BLOCK MINPAR
   3    56.187669
   4   -1

BLOCK EXTPAR
   0    4073.5207
   1    149.28573
   2   -393.42821
   3    4000
   11   -3907.3484
   12   -1922.3861
   13    433.45524
   23   -378.85994
   25    56.187158
   26    2000
   31    904.77955
   32    904.77955
   33    2000
   34    241.22953
   35    241.22953
   36    2000
   41    4000
   42    4000
   43    4000
   44    4000
   45    4000
   46    4000
   47    4000
   48    4000
   49    4000

BLOCK SMINPUTS
   1    127.90897
   2    1.1663787e-05
   3    0.1184
   4    91.1876
   5    4.18
   6    173.2
   7    1.777
   8    0
   11    0.00051099893
   12    0
   13    0.10565837
   14    0
   21    0.005
   22    0.0025
   23    0.095
   24    1.27

BLOCK GAUGE Q=  4073.5207
   1    0.35536298
   2    0.66519887
   3    1.219778

BLOCK YU Q=  4073.5207
   1   1    8.3856999e-06
   2   2    0.0042599356
   3   3    1.0130599

BLOCK YD Q=  4073.5207
   1   1    0.00094679647
   2   2    0.017989133
   3   3    0.93892542

BLOCK YE Q=  4073.5207
   1   1    0.00016522291
   2   2    0.034162857
   3   3    0.57456306

BLOCK AU Q=  4073.5207
   1   1    0
   2   2    0
   3   3   -3907.3509

BLOCK AD Q=  4073.5207
   1   1    0
   2   2    0
   3   3   -1922.3859

BLOCK AE Q=  4073.5207
   1   1    0
   2   2    0
   3   3    433.45514

BLOCK MSOFT Q=  4073.5207
   1    149.28573
   2   -393.42821
   3    4000
   21    4419623.2
   22    234113.71
   31    904.77955
   32    904.77955
   33    2000
   34    241.22953
   35    241.22953
   36    2000
   41    4000
   42    4000
   43    4000
   44    4000
   45    4000
   46    4000
   47    4000
   48    4000
   49    4000

BLOCK MASS
   6    173.2
   23    91.1876
   24    80.429995
   15    1.777
   25    124.55213
   35    1997.5558
   36    2000
   37    1999.8239
   1000001    4155.2329
   2000001    4143.6147
   1000002    4154.4595
   2000002    4143.2661
   1000003    4155.223
   2000003    4143.5926
   1000004    4154.4485
   2000004    4143.2652
   1000005    4081.1629
   2000005    4092.0936
   1000006    4004.957
   2000006    4143.2582
   1000011    906.21082
   2000011    273.72183
   1000012    902.34782
   1000013    906.15043
   2000013    273.33624
   1000014    902.27999
   1000015    1964.5078
   2000015    1989.5488
   1000016    1983.0242
   1000021    4249.0141
   1000022    144.25987
   1000023   -348.99833
   1000025    397.97772
   1000035   -466.88424
   1000024    350.25335
   1000037    467.80056
   1000039    1e-09

BLOCK ALPHA
      -0.017923625

BLOCK HMIX Q=  4073.5207
   1   -378.85994
   2    56.187158
   3    242.92049
   4    4000000

BLOCK STOPMIX
   1   1    0.64860719
   1   2    0.76112333
   2   1   -0.76112333
   2   2    0.64860719

BLOCK SBOTMIX
   1   1   -0.84457059
   1   2    0.53544423
   2   1   -0.53544423
   2   2   -0.84457059

BLOCK STAUMIX
   1   1   -0.44421034
   1   2    0.89592253
   2   1   -0.89592253
   2   2   -0.44421034

BLOCK NMIX
   1   1    0.99087345
   1   2    0.0061988473
   1   3   -0.12692385
   1   4   -0.044963587
   2   1   -0.047532552
   2   2   -0.61469946
   2   3   -0.58698606
   2   4    0.52472144
   3   1    0.12132597
   3   2   -0.067979849
   3   3    0.6933859
   3   4    0.70701821
   4   1   -0.034503328
   4   2    0.78580206
   4   3   -0.39818802
   4   4    0.47198617

BLOCK UMIX
   1   1   -0.56298401
   1   2   -0.82646779
   2   1   -0.82646779
   2   2    0.56298401

BLOCK VMIX
   1   1    0.66988647
   1   2    0.74246355
   2   1    0.74246355
   2   2   -0.66988647

BLOCK HIGGSBOUNDSINPUTHIGGSCOUPLINGSFERMIONS
       0, 3156.9967,3,36,15,15

BLOCK HIGGSBOUNDSINPUTHIGGSCOUPLINGSBOSONS
       0,4,36,21,21,23

BLOCK SPHENOLOWENERGY
   1    0.00034199601
   2    1.5879312e-06
   3    3.5248803e-05
   4    1.0357044e-15
   5    4.4225488e-11
   6    8.2023919e-09
   7    3.5482082e-14
   8    1.5152169e-09
   9    2.8829224e-07
   10    9.2432359e-05
   11    0.95479088
   12    0.54181597
   13    19.318365
   14    0
   15    0
   16    0.0021571355
   17    2.2816618e-15
   18    2.4798682e-11
   19    8.2899114e-11
   20   -1.9133675e-14
   21   -8.231801e-10
   22    5.3122916e-08
   23    0
   24    0
   25    0
   26    0
   27    0
   28    0
   29    0
   30    0
   31    0
   39    7.5110012e-05
   40    0
   41    0
   42    0

BLOCK FWCOEF Q=  160
   305   4422   0   0   -0.18881911
   305   4422   0   2   -0.21257924
   305   4322   0   2   -0.00049007695
   305   6421   0   0   -0.095227835
   305   6421   0   2   -0.11548955
   305   6321   0   2   -0.00041855008
   3051111   4133   0   0    1.6285212
   3051111   4133   0   2    1.6286479
   3051111   4233   0   2    0.00043920054
   3051111   4137   0   0   -4.4512133
   3051111   4137   0   2   -4.4492059
   3051111   4237   0   2   -0.0032416423
   3051313   4133   0   0    1.6285212
   3051313   4133   0   2    1.6286452
   3051313   4233   0   2    0.00043919388
   3051313   4137   0   0   -4.4512133
   3051313   4137   0   2   -4.4492086
   3051313   4237   0   2   -0.0032416428
   3051212   4137   0   0    1.5053501
   3051212   4137   0   2    1.5049358
   3051212   4237   0   2    0.00070067722
   3051414   4137   0   0    1.5053501
   3051414   4137   0   2    1.5049358
   3051414   4237   0   2    0.00070067826
   3051616   4137   0   0    1.5053501
   3051616   4137   0   2    1.5049345
   3051616   4237   0   2    0.0007009691

BLOCK IMFWCOEF Q=  160
   305   4422   0   0    3.8580014e-07
   305   4422   0   2    9.447609e-06
   305   4322   0   2   -4.2495014e-06
   305   6421   0   0    3.3046333e-07
   305   6421   0   2    1.0833731e-05
   305   6321   0   2   -1.8156603e-06
   3051111   4133   0   2   -8.6032728e-07
   3051111   4233   0   2    1.053522e-05
   3051111   4137   0   2    5.7021947e-06
   3051111   4237   0   2   -7.7769619e-05
   3051313   4133   0   2   -8.603232e-07
   3051313   4233   0   2    1.0535186e-05
   3051313   4137   0   2    5.702243e-06
   3051313   4237   0   2   -7.7769714e-05
   3051212   4137   0   2   -8.7912019e-07
   3051212   4237   0   2    1.6809809e-05
   3051414   4137   0   2   -8.7911883e-07
   3051414   4237   0   2    1.6809809e-05
   3051616   4137   0   2   -9.0226232e-07
   3051616   4237   0   2    1.6809811e-05

DECAY 23  2.4952


DECAY 24  2.085


DECAY 2000011  0.70438719
    1   2    1000022    11

DECAY 1000011  8.3008461
    0.35319701   2   -1000037    12
    0.22039338   2   -1000024    12
    0.15267872   2    1000035    11
    0.14280791   2    1000023    11
    0.13091974   2    1000022    11

DECAY 2000013  0.70192798
    1   2    1000022    13

DECAY 1000013  8.3153363
    0.35252389   2   -1000037    14
    0.21998436   2   -1000024    14
    0.15260238   2    1000035    13
    0.14317726   2    1000023    13
    0.13072053   2    1000022    13
    0.00079556574   2    1000025    13
    0.0001959298   2    2000013    25

DECAY 1000015  34.839426
    0.36829086   2   -1000024    16
    0.25652619   2    1000022    15
    0.21729773   2    1000023    15
    0.14641409   2    1000025    15
    0.0093952776   2    1000035    15
    0.0020748834   2   -1000037    16

DECAY 2000015  37.126427
    0.38515801   2   -1000037    16
    0.21492626   2    1000035    15
    0.17607232   2    1000025    15
    0.11240151   2    1000023    15
    0.095903704   2    1000022    15
    0.015537208   2   -1000024    16

DECAY 1000012  8.3653762
    0.30738356   2    1000024    11
    0.27988865   2    1000037    11
    0.16467168   2    1000035    12
    0.12338119   2    1000022    12
    0.11924284   2    1000023    12
    0.0054320031   2    1000025    12

DECAY 1000014  8.3780028
    0.30810869   2    1000024    13
    0.27984226   2    1000037    13
    0.16439306   2    1000035    14
    0.12318501   2    1000022    14
    0.11904788   2    1000023    14
    0.0054230149   2    1000025    14

DECAY 1000016  38.353382
    0.40926705   2    1000024    15
    0.31986773   2    1000037    15
    0.13132853   2    1000035    16
    0.074213239   2    1000023    16
    0.061626106   2    1000022    16
    0.0036964117   2    1000025    16

DECAY 2000001  2.3086235
    0.9814573   2    1000022    1
    0.014494347   2    1000025    1
    0.0022428331   2    1000023    1
    0.0011677651   2    1000035    1
    0.00060631227   2    1000039    1

DECAY 1000001  54.269775
    0.44878991   2   -1000037    2
    0.21060522   2   -1000024    2
    0.2060614   2    1000035    1
    0.1221168   2    1000023    1
    0.0097446367   2    1000022    1
    0.0026558883   2    1000025    1

DECAY 2000003  2.3608715
    0.9599129   2    1000022    3
    0.019491342   2    1000025    3
    0.0076081421   2   -1000024    4
    0.0060206952   2    1000023    3
    0.0034906419   2   -1000037    4
    0.0028834013   2    1000035    3
    0.00059287828   2    1000039    3

DECAY 1000003  54.297316
    0.44857348   2   -1000037    4
    0.21051264   2   -1000024    4
    0.20603221   2    1000035    3
    0.12222154   2    1000023    3
    0.0097475685   2    1000022    3
    0.0028864214   2    1000025    3

DECAY 1000005  186.9655
    0.39742748   2   -1000024    6
    0.21397982   2    1000023    5
    0.16552839   2    1000025    5
    0.15313247   2   -1000037    6
    0.046879074   2    1000035    5
    0.023045833   2    1000022    5

DECAY 2000005  161.0808
    0.33651935   2   -1000037    6
    0.22877216   2    1000025    5
    0.18447755   2   -1000024    6
    0.15136309   2    1000035    5
    0.094086952   2    1000023    5
    0.0046240699   2    1000022    5
    0.00014867269   2    1000006   -24

DECAY 2000002  9.2289329
    0.98196516   2    1000022    2
    0.014486708   2    1000025    2
    0.0022331139   2    1000023    2
    0.0011634171   2    1000035    2
    0.00015160561   2    1000039    2

DECAY 1000002  54.317695
    0.36180428   2    1000037    1
    0.29786144   2    1000024    1
    0.19950086   2    1000035    2
    0.12889302   2    1000023    2
    0.011203519   2    1000022    2
    0.00071077938   2    1000025    2

DECAY 2000004  9.2318642
    0.98165323   2    1000022    4
    0.014561749   2    1000025    4
    0.0022763482   2    1000023    4
    0.0011981998   2    1000035    4
    0.00015155726   2    1000039    4

DECAY 1000004  54.345212
    0.3617719   2    1000037    3
    0.29804011   2    1000024    3
    0.19940507   2    1000035    4
    0.12883498   2    1000023    4
    0.011197871   2    1000022    4
    0.00072397404   2    1000025    4

DECAY 1000006  183.06557
    0.34638571   2    1000037    5
    0.19807062   2    1000025    6
    0.19402567   2    1000035    6
    0.14303636   2    1000024    5
    0.073538938   2    1000023    6
    0.034654434   2    1000022    6
    0.0078322628   2    1000023    4
    0.001768213   3    1000022    24    5
    0.00068140004   2    1000022    4

DECAY 2000006  195.96683
    0.42815575   2    1000024    5
    0.23147841   2    1000025    6
    0.19879764   2    1000023    6
    0.068048222   2    1000037    5
    0.052381375   2    1000035    6
    0.017372736   2    1000022    6
    0.003617183   2    1000006    23
    0.00014159361   2    1000006    25

DECAY 1000024  0.083970558
    0.99489766   2    1000022    24
    0.0050562672   2   -2000013    14

DECAY 1000037  1.3330502
    0.74035518   2    1000023    24
    0.13220424   2    1000024    23
    0.12557732   2    1000022    24
    0.00056007801   2   -2000013    14
    0.00035725498   3    1000025   -1    2
    0.00035690096   3    1000025   -3    4
    0.00022700832   3    1000022   -5    6
    0.00011899374   3    1000025   -11    12
    0.00011897917   3    1000025   -13    14
    0.00011883937   3    1000025   -15    16

DECAY 1000022  5.7043009e-11
    0.9651101   2    1000039    22
    0.034884019   2    1000039    23

DECAY 1000023  0.15514471
    0.60687859   2    1000022    23
    0.38278303   2    1000022    25
    0.0032581608   2    2000013   -13
    0.0032581608   2   -2000013    13
    0.0018913051   2    2000011   -11
    0.0018913051   2   -2000011    11

DECAY 1000025  0.21382773
    0.67853122   2    1000022    25
    0.23363233   2    1000022    23
    0.022123903   2    2000013   -13
    0.022123903   2   -2000013    13
    0.019112932   2    2000011   -11
    0.019112932   2   -2000011    11
    0.00064055469   3    1000023    12   -12
    0.00047840204   3    1000023    1   -1
    0.0004783843   3    1000023    3   -3
    0.00044547792   3    1000023    5   -5
    0.00037313945   3    1000023    2   -2
    0.00037019281   3    1000023    4   -4
    0.00035810572   3    1000024    1   -2
    0.00035810572   3   -1000024   -1    2
    0.00035702062   3    1000024    3   -4
    0.00035702062   3   -1000024   -3    4
    0.00011950399   3    1000024    11   -12
    0.00011950399   3   -1000024   -11    12
    0.00011948058   3    1000024    13   -14
    0.00011948058   3   -1000024   -13    14
    0.00011866163   3    1000024    15   -16
    0.00011866163   3   -1000024   -15    16
    0.00010782474   3    1000023    11   -11
    0.0001077668   3    1000023    13   -13
    0.00010660611   3    1000023    15   -15
    0.00010191881   2    1000023    22

DECAY 1000035  2.1932923
    0.44043806   2    1000024   -24
    0.44043806   2   -1000024    24
    0.06470658   2    1000022    23
    0.051026403   2    1000022    25
    0.00044458427   2    2000013   -13
    0.00044458427   2   -2000013    13
    0.00035951675   2    1000023    23
    0.00031886427   3    1000025    12   -12
    0.00027421951   2    2000011   -11
    0.00027421951   2   -2000011    11
    0.00023887043   3    1000025    1   -1
    0.00023886716   3    1000025    3   -3
    0.00023205598   3    1000025    5   -5
    0.00018627797   3    1000025    2   -2
    0.00018565872   3    1000025    4   -4

DECAY 1000021  5.9221223
    0.070774395   3    1000025    6   -6
    0.065134908   2    1000005   -5
    0.065134908   2   -1000005    5
    0.06051658   3    1000023    6   -6
    0.056455538   3    1000024    5   -6
    0.056455538   3   -1000024   -5    6
    0.054423419   2    2000005   -5
    0.054423419   2   -2000005    5
    0.028114666   2    1000006   -4
    0.028114666   2   -1000006    4
    0.027329131   2    1000006   -6
    0.027329131   2   -1000006    6
    0.025658096   2    2000002   -2
    0.025658096   2   -2000002    2
    0.025656704   2    2000004   -4
    0.025656704   2   -2000004    4
    0.02550186   2    2000003   -3
    0.02550186   2   -2000003    3
    0.025491313   2    2000001   -1
    0.025491313   2   -2000001    1
    0.020571445   2    1000004   -4
    0.020571445   2   -1000004    4
    0.020568544   2    1000002   -2
    0.020568544   2   -1000002    2
    0.020241379   2    1000003   -3
    0.020241379   2   -1000003    3
    0.020237147   2    1000001   -1
    0.020237147   2   -1000001    1
    0.014378529   3    1000035    6   -6
    0.0089013532   3    1000037    5   -6
    0.0089013532   3   -1000037   -5    6
    0.0041225432   3    1000022    6   -6
    0.00075126712   2    1000025    21
    0.00031099631   2    1000035    21
    0.00029848006   2    1000023    21
    0.00026798849   2    1000039    21

DECAY 25  0.0038476309
    0.58190359   2   -5    5
    0.2197161   2   -24    24
    0.072381289   2    21    21
    0.066945604   2   -15    15
    0.028470085   2   -4    4
    0.026361625   2    23    23
    0.0023150504   2    22    22
    0.0014544563   2    22    23
    0.0002327538   2   -13    13
    0.00021868943   2   -3    3
    6.0465436e-07   2   -1    1
    1.467144e-07   2   -2    2
    5.2325747e-09   2   -11    11

DECAY 35  115.33844
    0.68239399   2   -5    5
    0.11636099   2   -15    15
    0.037287748   2   -1000024    1000024
    0.033345835   2   -1000024    1000037
    0.033345835   2   -1000037    1000024
    0.023406475   2    1000025    1000035
    0.017357657   2   -1000037    1000037
    0.014710853   2    1000023    1000023
    0.010500492   2    1000035    1000035
    0.0095606298   2    1000022    1000023
    0.0087913267   2    1000023    1000025
    0.0077457885   2    1000022    1000025
    0.0016338715   2    1000023    1000035
    0.0010665911   2    1000025    1000025
    0.00088813473   2    1000022    1000035
    0.00064280915   2    1000022    1000022
    0.00042194025   2   -13    13
    0.00027039503   2   -3    3
    0.00025013506   2   -6    6
    1.5352651e-05   2    21    21
    1.7035589e-06   2    25    25
    7.4760646e-07   2   -1    1
    2.7060183e-07   2    23    23
    1.4371083e-07   2   -24    24
    7.2551995e-08   2    22    23
    2.3349066e-08   2   -1000011    1000011
    2.2825595e-08   2   -1000013    1000013
    1.566332e-08   2   -2000011    2000011
    1.5470146e-08   2   -2000013    2000013
    1.3787205e-08   2    22    22
    9.4776978e-09   2   -11    11
    3.5061498e-09   2   -4    4
    1.7148439e-09   2   -2000013    1000013
    1.7148439e-09   2   -1000013    2000013
    4.0111735e-14   2   -2000011    1000011
    4.0111735e-14   2   -1000011    2000011
    1.8076525e-14   2   -2    2

DECAY 36  107.64521
    0.66988005   2   -5    5
    0.11423693   2   -15    15
    0.047441612   2   -1000024    1000024
    0.028549037   2   -1000024    1000037
    0.028549037   2   -1000037    1000024
    0.025669495   2   -1000037    1000037
    0.01960884   2    1000025    1000035
    0.018874562   2    1000023    1000023
    0.015330344   2    1000035    1000035
    0.010186834   2    1000022    1000023
    0.0081809767   2    1000022    1000025
    0.0074193765   2    1000023    1000025
    0.0021224896   2    1000023    1000035
    0.0012515289   2    1000025    1000025
    0.0010589205   2    1000022    1000035
    0.00068637856   2    1000022    1000022
    0.00041423669   2   -13    13
    0.00026542327   2   -3    3
    0.00025004212   2   -6    6
    2.2459326e-05   2    21    21
    7.3386093e-07   2   -1    1
    3.9248441e-07   2    23    25
    1.7584288e-07   2    22    23
    1.0131622e-07   2    22    22
    9.3046897e-09   2   -11    11
    3.3894368e-09   2   -4    4
    1.8190498e-09   2   -2000013    1000013
    1.8190498e-09   2   -1000013    2000013
    8.8939451e-13   2    23    35
    4.2547719e-14   2   -2000011    1000011
    4.2547719e-14   2   -1000011    2000011
    1.7477677e-14   2   -2    2
    3.1865914e-37   2    25    25

DECAY 37  110.19742
    0.6744616   2   -5    6
    0.11457694   2   -15    16
    0.069606783   2    1000023    1000037
    0.056870746   2    1000024    1000035
    0.03718526   2    1000025    1000037
    0.023116497   2    1000024    1000025
    0.020134174   2    1000022    1000024
    0.0021266552   2    1000022    1000037
    0.0010036508   2   -5    4
    0.00040507073   2   -13    14
    0.00025469925   2   -3    4
    0.0001728401   2    1000023    1000024
    6.4062823e-05   2    1000035    1000037
    1.1872423e-05   2   -3    2
    7.1671055e-06   2   -5    2
    7.0764699e-07   2   -3    6
    7.0679264e-07   2   -1    2
    3.8383241e-07   2    24    25
    6.4846317e-08   2   -2000011    1000012
    6.4558425e-08   2   -2000013    1000014
    3.2991637e-08   2   -1    4
    1.5386256e-08   2   -1    6
    9.4746465e-09   2   -11    12
    3.4421368e-09   2   -1000013    1000014
    7.4085614e-13   2    24    35
    8.0504765e-14   2   -1000011    1000012

DECAY 6  2.43
    1   2    5    24

DECAY 15 -1


DECAY 1000039 -1
