BLOCK SPINFO
   1   SPheno
   2   v4.0.5be

BLOCK SPHENOINFO
   1   2
   2   2

BLOCK MODSEL
   1   0

BLOCK MINPAR
   3    28.662798
   4    1

BLOCK EXTPAR
   0    3070.7755
   1   -939.24872
   2   -3852.952
   3    3443.4644
   11   -6798.7958
   12   -7632.4688
   13    5363.0405
   23    2287.1033
   25    27.562623
   26    4597.0879
   31    4687.666
   32    4687.666
   33    1639.2515
   34    3885.7175
   35    3885.7175
   36    4603.8877
   41    4793.5863
   42    4793.5863
   43    1872.7272
   44    1851.0539
   45    1851.0539
   46    4635.7345
   47    1625.8091
   48    1625.8091
   49    2407.5081

BLOCK SMINPUTS
   1    127.90897
   2    1.1663787e-05
   3    0.1184
   4    91.1876
   5    4.18
   6    173.2
   7    1.777
   8    0
   11    0.00051099893
   12    0
   13    0.10565837
   14    0
   21    0.005
   22    0.0025
   23    0.095
   24    1.27

BLOCK GAUGE Q=  3070.7755
   1    0.35536298
   2    0.66519887
   3    1.219778

BLOCK YU Q=  3070.7755
   1   1    8.3898885e-06
   2   2    0.0042620634
   3   3    1.0135659

BLOCK YD Q=  3070.7755
   1   1    0.00046468321
   2   2    0.008828981
   3   3    0.46082013

BLOCK YE Q=  3070.7755
   1   1    8.1090618e-05
   2   2    0.016766968
   3   3    0.28199282

BLOCK AU Q=  3070.7755
   1   1    0
   2   2    0
   3   3   -6798.7959

BLOCK AD Q=  3070.7755
   1   1    0
   2   2    0
   3   3   -7632.4596

BLOCK AE Q=  3070.7755
   1   1    0
   2   2    0
   3   3    5363.0406

BLOCK MSOFT Q=  3070.7755
   1   -939.24872
   2   -3852.952
   3    3443.4644
   21    15942465
   22   -5311945.2
   31    4687.666
   32    4687.666
   33    1639.2515
   34    3885.7175
   35    3885.7175
   36    4603.8877
   41    4793.5863
   42    4793.5863
   43    1872.7272
   44    1851.0539
   45    1851.0539
   46    4635.7345
   47    1625.8091
   48    1625.8091
   49    2407.5081

BLOCK MASS
   6    173.2
   23    91.1876
   24    80.429995
   15    1.777
   25    125.7975
   35    4596.9848
   36    4597.0879
   37    4598.3863
   1000001    4884.7761
   2000001    1775.6222
   1000002    4884.1154
   2000002    1995.4666
   1000003    4884.775
   2000003    1775.6233
   1000004    4884.1144
   2000004    1995.4672
   1000005    2048.6987
   2000005    2536.3516
   1000006    2040.5001
   2000006    4621.2504
   1000011    4705.1205
   2000011    3889.2087
   1000012    4704.0426
   1000013    4705.1141
   2000013    3889.1993
   1000014    4704.0366
   1000015    1674.7178
   2000015    4603.5674
   1000016    1672.6352
   1000021    3597.5561
   1000022   -934.43204
   1000023   -2297.7811
   1000025    2299.3233
   1000035   -3881.2051
   1000024    2297.7716
   1000037    3881.4203

BLOCK ALPHA
      -0.034906981

BLOCK HMIX Q=  3070.7755
   1    2287.1033
   2    27.562623
   3    243.23876
   4    21133218

BLOCK STOPMIX
   1   1    0.99843662
   1   2    0.055895668
   2   1   -0.055895668
   2   2    0.99843662

BLOCK SBOTMIX
   1   1    0.99842663
   1   2    0.056073685
   2   1   -0.056073685
   2   2    0.99842663

BLOCK STAUMIX
   1   1    0.99998583
   1   2    0.0053235006
   2   1   -0.0053235006
   2   2    0.99998583

BLOCK NMIX
   1   1   -0.99971528
   1   2    0.00018280889
   1   3   -0.022358293
   1   4   -0.008332235
   2   1    0.021698818
   2   2    0.033440711
   2   3   -0.70670844
   2   4   -0.70638095
   3   1    0.0099151904
   3   2   -0.0093230979
   3   3   -0.7069458
   3   4    0.70713677
   4   1   -0.00045069845
   4   2    0.9993972
   4   3    0.017056277
   4   4    0.030234335

BLOCK UMIX
   1   1   -0.024361054
   1   2    0.99970322
   2   1   -0.99970322
   2   2   -0.024361054

BLOCK VMIX
   1   1    0.043194109
   1   2    0.9990667
   2   1    0.9990667
   2   2   -0.043194109

BLOCK HIGGSBOUNDSINPUTHIGGSCOUPLINGSFERMIONS
       0, 759.69818,3,36,15,15

BLOCK HIGGSBOUNDSINPUTHIGGSCOUPLINGSBOSONS
       0,4,36,21,21,23

BLOCK SPHENOLOWENERGY
   1    0.00031344069
   2    1.5916712e-06
   3    3.5262347e-05
   4    2.0834279e-15
   5    8.9001528e-11
   6    1.8623607e-08
   7    6.9664414e-14
   8    2.9760571e-09
   9    6.3100033e-07
   10    9.6641801e-05
   11    0.99827281
   12    0.54165841
   13    19.352867
   14    0
   15    0
   16    0.0021562668
   17    2.2816477e-15
   18    2.4811439e-11
   19    8.2927442e-11
   20   -5.085662e-16
   21   -2.1742751e-11
   22   -1.200339e-08
   23    0
   24    0
   25    0
   26    0
   27    0
   28    0
   29    0
   30    0
   31    0
   39    5.6689576e-05
   40    0
   41    0
   42    0

BLOCK FWCOEF Q=  160
   305   4422   0   0   -0.18881911
   305   4422   0   2   -0.17996508
   305   4322   0   2    7.0416336e-05
   305   6421   0   0   -0.095227835
   305   6421   0   2   -0.094167082
   305   6321   0   2   -5.241614e-05
   3051111   4133   0   0    1.617338
   3051111   4133   0   2    1.6175282
   3051111   4233   0   2    0.00026617315
   3051111   4137   0   0   -4.4400301
   3051111   4137   0   2   -4.4393985
   3051111   4237   0   2   -0.0019977818
   3051313   4133   0   0    1.617338
   3051313   4133   0   2    1.617528
   3051313   4233   0   2    0.00026617305
   3051313   4137   0   0   -4.4400301
   3051313   4137   0   2   -4.4393987
   3051313   4237   0   2   -0.001997782
   3051212   4137   0   0    1.5053501
   3051212   4137   0   2    1.5052142
   3051212   4237   0   2    0.00043290584
   3051414   4137   0   0    1.5053501
   3051414   4137   0   2    1.5052142
   3051414   4237   0   2    0.00043290585
   3051616   4137   0   0    1.5053501
   3051616   4137   0   2    1.5052131
   3051616   4237   0   2    0.00043290693

BLOCK IMFWCOEF Q=  160
   305   4422   0   0    3.8588558e-07
   305   4422   0   2    5.0471647e-06
   305   4322   0   2    2.3930655e-06
   305   6421   0   0    3.3053652e-07
   305   6421   0   2   -3.3130651e-05
   305   6321   0   2    5.8538935e-07
   3051111   4133   0   2   -6.7842718e-07
   3051111   4233   0   2    4.9380381e-06
   3051111   4137   0   2    8.0303948e-06
   3051111   4237   0   2   -3.7062823e-05
   3051313   4133   0   2   -6.7842674e-07
   3051313   4233   0   2    4.9380366e-06
   3051313   4137   0   2    8.0303969e-06
   3051313   4237   0   2   -3.7062827e-05
   3051212   4137   0   2   -1.7237784e-06
   3051212   4237   0   2    8.0312633e-06
   3051414   4137   0   2   -1.7237786e-06
   3051414   4237   0   2    8.0312633e-06
   3051616   4137   0   2   -1.7428087e-06
   3051616   4237   0   2    8.0312646e-06

DECAY 23  2.4952


DECAY 24  2.085


DECAY 2000011  17.345652
    0.99972834   2    1000022    11
    0.00022477439   2    1000023    11

DECAY 1000011  11.821661
    0.46072275   2    1000022    11
    0.35740396   2   -1000037    12
    0.17859088   2    1000035    11
    0.0020601633   2    1000023    11
    0.0012057784   2   -1000024    12

DECAY 2000013  17.364024
    0.99866813   2    1000022    13
    0.00053049391   2   -1000024    14
    0.00048965589   2    1000023    13
    0.00031172441   2    1000025    13

DECAY 1000013  11.837796
    0.46009506   2    1000022    13
    0.35691222   2   -1000037    14
    0.17834526   2    1000035    13
    0.0027010898   2    1000023    13
    0.0012041312   2   -1000024    14
    0.00066015042   2    1000025    13

DECAY 1000015  0.99758454
    1   2    1000022    15

DECAY 2000015  31.961903
    0.66497011   2    1000022    15
    0.1283106   2   -1000024    16
    0.064322642   2    1000023    15
    0.064213329   2    1000025    15
    0.038437573   2    1000016   -24
    0.020518137   2    1000015    25
    0.019188823   2    1000015    23

DECAY 1000012  11.824799
    0.46110854   2    1000022    12
    0.3560762   2    1000037    11
    0.1783261   2    1000035    12
    0.0037878118   2    1000024    11
    0.00048457054   2    1000023    12
    0.00021678671   2    1000025    12

DECAY 1000014  11.839959
    0.46051743   2    1000022    14
    0.35561603   2    1000037    13
    0.1780956   2    1000035    14
    0.0050704862   2    1000024    13
    0.00048394869   2    1000023    14
    0.0002165085   2    1000025    14

DECAY 1000016  0.9943677
    1   2    1000022    16

DECAY 2000001  0.51797321
    1   2    1000022    1

DECAY 1000001  90.156364
    0.89550116   2    1000021    1
    0.064770501   2   -1000037    2
    0.032382923   2    1000035    1
    0.0070293213   2    1000022    1
    0.00017165103   2   -1000024    2
    0.00012657954   2    1000023    1

DECAY 2000003  0.51797445
    1   2    1000022    3

DECAY 1000003  90.162606
    0.89543803   2    1000021    3
    0.064765877   2   -1000037    4
    0.032380632   2    1000035    3
    0.0070288712   2    1000022    3
    0.00018345838   2   -1000024    4
    0.00015193991   2    1000023    3

DECAY 1000005  0.1912174
    1   2    1000022    5

DECAY 2000005  5.6254143
    0.32066201   2    1000005    25
    0.26081235   2    1000006   -24
    0.18622439   2    1000022    5
    0.12303407   2    1000005    23
    0.048380747   2   -1000024    6
    0.03053554   2    1000023    5
    0.030350894   2    1000025    5

DECAY 2000002  2.7145978
    1   2    1000022    2

DECAY 1000002  90.112354
    0.89524285   2    1000021    2
    0.064650923   2    1000037    1
    0.032353953   2    1000035    2
    0.007002835   2    1000022    2
    0.00053988812   2    1000024    1
    0.00020129629   2    1000023    2

DECAY 2000004  2.7145958
    1   2    1000022    4

DECAY 1000004  90.117819
    0.89518673   2    1000021    4
    0.064646889   2    1000037    3
    0.032351877   2    1000035    4
    0.0070024079   2    1000022    4
    0.0005906628   2    1000024    3
    0.00020723352   2    1000023    4

DECAY 1000006  0.27618786
    0.65757199   2    1000022    6
    0.30242624   2    1000022    4
    0.039985686   3    1000022    24    5

DECAY 2000006  417.01895
    0.25968655   2    1000005    24
    0.19888684   2    1000006    25
    0.13108252   2    1000021    6
    0.1305471   2    1000006    23
    0.12819821   2    1000024    5
    0.064253712   2    1000025    6
    0.064119044   2    1000023    6
    0.022686326   2    1000022    6
    0.00053840908   2    2000005    24

DECAY 1000024  4.7943818
    0.48133585   2   -1000005    6
    0.28575353   2    1000022    24
    0.13598146   2    1000006   -5
    0.084544114   2    1000016   -15
    0.011857536   3    1000022   -5    6
    0.00032842626   2   -1000015    16
    0.0001808137   2   -2000003    4

DECAY 1000037  103.72139
    0.25946125   2    1000006   -5
    0.25212249   2   -1000005    6
    0.10902739   2    1000016   -15
    0.10901307   2   -1000015    16
    0.067250632   2    1000024    25
    0.064272166   2    1000024    23
    0.064104674   2    1000025    24
    0.062414733   2    1000023    24
    0.0045926588   3    1000024    6   -6
    0.0036988672   3    1000023   -5    6
    0.0031244848   3    1000025   -5    6
    0.00084653558   2   -2000005    6

DECAY 1000022 -1


DECAY 1000023  4.8787421
    0.25469975   2    1000006   -6
    0.25469975   2   -1000006    6
    0.22549998   2    1000022    25
    0.063221383   2    1000005   -5
    0.063221383   2   -1000005    5
    0.048617372   2    1000022    23
    0.041404156   2    1000015   -15
    0.041404156   2   -1000015    15
    0.0062871039   3    1000022    6   -6
    0.00011891544   2    2000003   -3
    0.00011891544   2   -2000003    3
    0.00010935221   2    1000016   -16
    0.00010935221   2   -1000016    16

DECAY 1000025  6.0551045
    0.21417248   2    1000006   -6
    0.21417248   2   -1000006    6
    0.20943658   2    1000022    25
    0.18812467   2    1000022    23
    0.0510516   2    1000005   -5
    0.0510516   2   -1000005    5
    0.033080303   2    1000015   -15
    0.033080303   2   -1000015    15
    0.0055023683   3    1000022    6   -6

DECAY 1000035  112.2925
    0.12197825   2    1000006   -6
    0.12197825   2   -1000006    6
    0.11805112   2    1000005   -5
    0.11805112   2   -1000005    5
    0.066585698   2    1000025    25
    0.061015401   2    1000024   -24
    0.061015401   2   -1000024    24
    0.057749193   2    1000023    25
    0.054396343   2    1000025    23
    0.050398452   2    1000016   -16
    0.050398452   2   -1000016    16
    0.050289888   2    1000015   -15
    0.050289888   2   -1000015    15
    0.0042198523   2    1000023    23
    0.0039202871   3    1000024    5   -6
    0.0039202871   3   -1000024   -5    6
    0.0025847315   3    1000025    6   -6
    0.0022853101   3    1000023    6   -6
    0.00039626636   2    2000005   -5
    0.00039626636   2   -2000005    5

DECAY 1000021  370.6627
    0.082184107   2    2000001   -1
    0.082184107   2   -2000001    1
    0.082184044   2    2000003   -3
    0.082184044   2   -2000003    3
    0.068853629   2    2000002   -2
    0.068853629   2   -2000002    2
    0.068853577   2    2000004   -4
    0.068853577   2   -2000004    4
    0.065559528   2    1000005   -5
    0.065559528   2   -1000005    5
    0.064831754   2    1000006   -6
    0.064831754   2   -1000006    6
    0.036354241   2    2000005   -5
    0.036354241   2   -2000005    5
    0.031115858   2    1000006   -4
    0.031115858   2   -1000006    4

DECAY 25  0.0039739461
    0.55931279   2   -5    5
    0.2424242   2   -24    24
    0.071941423   2    21    21
    0.064436922   2   -15    15
    0.029809602   2    23    23
    0.027719663   2   -4    4
    0.0023519266   2    22    22
    0.0015692191   2    22    23
    0.00022348337   2   -13    13
    0.00021004055   2   -3    3
    5.8073988e-07   2   -1    1
    1.4284348e-07   2   -2    2
    5.0241444e-09   2   -11    11

DECAY 35  48.983601
    0.49517673   2   -5    5
    0.15328792   2   -2000005    1000005
    0.15328792   2   -1000005    2000005
    0.13235906   2   -15    15
    0.03181171   2    1000022    1000025
    0.020428375   2    1000022    1000023
    0.005383382   2   -6    6
    0.0043107977   2   -1000005    1000005
    0.0031212725   2   -1000006    1000006
    0.00049151274   2   -13    13
    0.00020021521   2   -3    3
    8.5492078e-05   2    1000022    1000022
    3.5279443e-05   2    21    21
    9.2498518e-06   2   -1000015    1000015
    5.5435792e-06   2    25    25
    1.8374945e-06   2   -1000024    1000024
    9.8410944e-07   2    1000023    1000025
    5.5352926e-07   2   -1    1
    4.153747e-07   2   -1000002    1000002
    4.1520626e-07   2   -1000004    1000004
    2.7933253e-07   2    23    23
    2.5625247e-07   2    1000023    1000023
    1.807674e-07   2    22    23
    6.8245138e-08   2    1000025    1000025
    6.4604239e-08   2   -4    4
    5.0481065e-08   2   -24    24
    3.1552209e-08   2    22    22
    2.213202e-08   2   -1000001    1000001
    2.2088212e-08   2   -1000003    1000003
    1.1037569e-08   2   -11    11
    3.3322107e-13   2   -2    2

DECAY 36  47.116476
    0.48709113   2   -5    5
    0.16153252   2   -2000005    1000005
    0.16153252   2   -1000005    2000005
    0.13003892   2   -15    15
    0.033250174   2    1000022    1000023
    0.021115405   2    1000022    1000025
    0.0044581878   2   -6    6
    0.00048287813   2   -13    13
    0.00019671123   2   -3    3
    0.00015986856   2   -1000024    1000024
    0.00010115614   2    1000022    1000022
    2.1123503e-05   2    1000023    1000023
    8.9688641e-06   2    21    21
    8.9563633e-06   2    1000025    1000025
    7.2090148e-07   2    23    25
    5.4384082e-07   2   -1    1
    6.2531463e-08   2    22    22
    5.9287537e-08   2    22    23
    5.2613553e-08   2   -4    4
    1.9493182e-08   2    1000023    1000025
    1.0843666e-08   2   -11    11
    2.7141248e-13   2   -2    2
    2.2794543e-36   2    25    25

DECAY 37  50.267789
    0.53646094   2   -5    6
    0.26023191   2   -2000005    1000006
    0.15029627   2   -15    16
    0.051072162   2    1000022    1000024
    0.00079015704   2   -5    4
    0.00053135078   2   -13    14
    0.00038453617   2   -1000005    1000006
    0.00018285985   2   -3    4
    1.5706901e-05   2    1000024    1000025
    9.1270837e-06   2    1000023    1000024
    8.6025694e-06   2   -3    2
    6.2639553e-06   2   -3    6
    5.6425351e-06   2   -5    2
    2.9652272e-06   2   -1000015    1000016
    6.7646015e-07   2    24    25
    5.0708772e-07   2   -1    2
    2.7477321e-07   2   -1    6
    2.6294638e-08   2   -1    4
    1.242835e-08   2   -11    12
    9.4082438e-09   2   -1000005    1000004
    6.0058924e-11   2   -1000003    1000006
    6.7720005e-12   2   -2000005    1000004
    1.8348599e-12   2   -1000003    1000004
    1.465122e-13   2    24    35
    9.9959779e-14   2    24    36
    7.6279797e-15   2   -1000001    1000006
    3.5239058e-16   2   -1000005    1000002
    2.7183596e-16   2   -1000001    1000004
    5.1551395e-19   2   -1000003    1000002
    2.5364888e-19   2   -2000005    1000002
    2.6696146e-20   2   -1000001    1000002

DECAY 6  2.43
    1   2    5    24

DECAY 15 -1
