BLOCK SPINFO
   1   SPheno
   2   v4.0.5be

BLOCK SPHENOINFO
   1   2
   2   2

BLOCK MODSEL
   1   0

BLOCK MINPAR
   3    32.309127
   4   -1

BLOCK EXTPAR
   0    1287.9466
   1    81.424075
   2    1099.5585
   3    3000
   11    3760.1856
   12   -1189.3231
   13   -253.91339
   23   -747.04901
   25    31.621899
   26    2215.6464
   31    893.44948
   32    893.44948
   33    1767.5793
   34    214.61341
   35    214.61341
   36    1871.4788
   41    5000
   42    5000
   43    1576.4556
   44    5000
   45    5000
   46    1248.7323
   47    5000
   48    5000
   49    1766.1835

BLOCK SMINPUTS
   1    127.90897
   2    1.1663787e-05
   3    0.1184
   4    91.1876
   5    4.18
   6    173.2
   7    1.777
   8    0
   11    0.00051099893
   12    0
   13    0.10565837
   14    0
   21    0.005
   22    0.0025
   23    0.095
   24    1.27

BLOCK GAUGE Q=  1287.9466
   1    0.35536298
   2    0.66519887
   3    1.219778

BLOCK YU Q=  1287.9466
   1   1    8.3885635e-06
   2   2    0.0042613903
   3   3    1.0134059

BLOCK YD Q=  1287.9466
   1   1    0.00053303508
   2   2    0.010127667
   3   3    0.52860377

BLOCK YE Q=  1287.9466
   1   1    9.3018519e-05
   2   2    0.01923328
   3   3    0.32347212

BLOCK AU Q=  1287.9466
   1   1    0
   2   2    0
   3   3    3760.1857

BLOCK AD Q=  1287.9466
   1   1    0
   2   2    0
   3   3   -1189.3233

BLOCK AE Q=  1287.9466
   1   1    0
   2   2    0
   3   3   -253.91338

BLOCK MSOFT Q=  1287.9466
   1    81.424075
   2    1099.5585
   3    3000
   21    4389569.3
   22   -495058.85
   31    893.44948
   32    893.44948
   33    1767.5793
   34    214.61341
   35    214.61341
   36    1871.4788
   41    5000
   42    5000
   43    1576.4556
   44    5000
   45    5000
   46    1248.7323
   47    5000
   48    5000
   49    1766.1835

BLOCK MASS
   6    173.2
   23    91.1876
   24    80.429995
   15    1.777
   25    124.42334
   35    2214.6919
   36    2215.6464
   37    2216.7757
   1000001    5021.1829
   2000001    5012.1177
   1000002    5020.7574
   2000002    5013.2733
   1000003    5021.1873
   2000003    5012.1218
   1000004    5020.7606
   2000004    5013.2743
   1000005    1511.2911
   2000005    1768.9678
   1000006    1035.9751
   2000006    1601.2031
   1000011    905.75113
   2000011    225.81355
   1000012    901.97468
   1000013    905.75261
   2000013    225.78943
   1000014    901.96995
   1000015    1771.0885
   2000015    1872.9351
   1000016    1770.2644
   1000021    3176.9204
   1000022    81.025803
   1000023    749.9545
   1000025   -757.66888
   1000035    1148.6126
   1000024    750.03291
   1000037    1148.6931

BLOCK ALPHA
      -0.031125663

BLOCK HMIX Q=  1287.9466
   1   -747.04901
   2    31.621899
   3    244.12207
   4    4909088.8

BLOCK STOPMIX
   1   1   -0.41460957
   1   2    0.9099994
   2   1   -0.9099994
   2   2   -0.41460957

BLOCK SBOTMIX
   1   1   -0.9966518
   1   2    0.081763072
   2   1   -0.081763072
   2   2   -0.9966518

BLOCK STAUMIX
   1   1   -0.99395834
   1   2    0.10975803
   2   1   -0.10975803
   2   2   -0.99395834

BLOCK NMIX
   1   1   -0.99820663
   1   2    4.5225621e-05
   1   3    0.059704458
   1   4    0.0043463392
   2   1    0.045064166
   2   2    0.13552832
   2   3    0.70258221
   2   4    0.69712232
   3   1   -0.039096989
   3   2    0.030554041
   3   3   -0.70517981
   3   4    0.70729012
   4   1    0.0049154239
   4   2   -0.99030224
   4   3    0.074397889
   4   4    0.11722743

BLOCK UMIX
   1   1   -0.10461333
   1   2   -0.99451297
   2   1    0.99451297
   2   2   -0.10461333

BLOCK VMIX
   1   1   -0.16515047
   1   2    0.98626838
   2   1    0.98626838
   2   2    0.16515047

BLOCK HIGGSBOUNDSINPUTHIGGSCOUPLINGSFERMIONS
       0, 999.94449,3,36,15,15

BLOCK HIGGSBOUNDSINPUTHIGGSCOUPLINGSBOSONS
       0,4,36,21,21,23

BLOCK SPHENOLOWENERGY
   1    0.00029276685
   2    1.5931748e-06
   3    3.5206786e-05
   4    2.6962938e-15
   5    1.1518073e-10
   6    2.3997857e-08
   7    9.1631106e-14
   8    3.9144139e-09
   9    8.2636179e-07
   10    9.5987517e-05
   11    0.9915143
   12    0.54247038
   13    19.379871
   14    0
   15    0
   16    0.0021587081
   17    2.2816736e-15
   18    2.4781988e-11
   19    8.2855188e-11
   20   -1.3865862e-14
   21   -5.9339704e-10
   22   -5.7660225e-08
   23    0
   24    0
   25    0
   26    0
   27    0
   28    0
   29    0
   30    0
   31    0
   39    7.7667025e-05
   40    0
   41    0
   42    0

BLOCK FWCOEF Q=  160
   305   4422   0   0   -0.18881911
   305   4422   0   2   -0.1532016
   305   4322   0   2    4.6388787e-05
   305   6421   0   0   -0.095227835
   305   6421   0   2   -0.084668049
   305   6321   0   2   -0.00014071657
   3051111   4133   0   0    1.586643
   3051111   4133   0   2    1.5876536
   3051111   4233   0   2    0.00011996735
   3051111   4137   0   0   -4.4093351
   3051111   4137   0   2   -4.4031899
   3051111   4237   0   2   -0.00094108851
   3051313   4133   0   0    1.586643
   3051313   4133   0   2    1.5876503
   3051313   4233   0   2    0.00011996638
   3051313   4137   0   0   -4.4093351
   3051313   4137   0   2   -4.4031932
   3051313   4237   0   2   -0.0009410896
   3051212   4137   0   0    1.5053501
   3051212   4137   0   2    1.5040184
   3051212   4237   0   2    0.00020532651
   3051414   4137   0   0    1.5053501
   3051414   4137   0   2    1.5040184
   3051414   4237   0   2    0.00020532659
   3051616   4137   0   0    1.5053501
   3051616   4137   0   2    1.5040185
   3051616   4237   0   2    0.00020535016

BLOCK IMFWCOEF Q=  160
   305   4422   0   0    3.8589708e-07
   305   4422   0   2   -1.9051054e-05
   305   4322   0   2    4.357057e-06
   305   6421   0   0    3.3054637e-07
   305   6421   0   2    1.394458e-06
   305   6321   0   2    1.9866999e-06
   3051111   4133   0   2   -1.932586e-06
   3051111   4233   0   2    2.8606096e-06
   3051111   4137   0   2    1.5243215e-05
   3051111   4237   0   2   -2.2451619e-05
   3051313   4133   0   2   -1.9325448e-06
   3051313   4233   0   2    2.8605992e-06
   3051313   4137   0   2    1.5243259e-05
   3051313   4237   0   2   -2.2451646e-05
   3051212   4137   0   2   -3.1526053e-06
   3051212   4237   0   2    4.8986128e-06
   3051414   4137   0   2   -3.1526056e-06
   3051414   4237   0   2    4.8986128e-06
   3051616   4137   0   2   -3.1502538e-06
   3051616   4237   0   2    4.8986294e-06

DECAY 23  2.4952


DECAY 24  2.085


DECAY 2000011  0.85818541
    1   2    1000022    11

DECAY 1000011  1.1341214
    0.98351767   2    1000022    11
    0.0088527704   2    1000023    11
    0.0075998887   2   -1000024    12

DECAY 2000013  0.85804508
    1   2    1000022    13

DECAY 1000013  1.1368487
    0.98118028   2    1000022    13
    0.0091197664   2    1000023    13
    0.0075817781   2   -1000024    14
    0.0018258787   2    2000013    25
    0.00029229348   2    1000025    13

DECAY 1000015  12.768142
    0.39596364   2   -1000037    16
    0.19575248   2    1000035    15
    0.18303286   2    1000022    15
    0.11127849   2    1000023    15
    0.093685889   2    1000025    15
    0.020286639   2   -1000024    16

DECAY 2000015  14.755338
    0.62569523   2    1000022    15
    0.17342588   2   -1000024    16
    0.09467641   2    1000025    15
    0.08831839   2    1000023    15
    0.011093847   2   -1000037    16
    0.0055400729   2    1000035    15
    0.0010617212   2    1000016   -24
    0.00018844746   2    1000015    23

DECAY 1000012  1.1372288
    0.97693995   2    1000022    12
    0.018127613   2    1000024    11
    0.0041319002   2    1000023    12
    0.0008005329   2    1000025    12

DECAY 1000014  1.1378508
    0.97640058   2    1000022    14
    0.01866994   2    1000024    13
    0.0041294259   2    1000023    14
    0.00080005087   2    1000025    14

DECAY 1000016  12.696009
    0.40117139   2    1000037    15
    0.21593499   2    1000024    15
    0.20285382   2    1000035    16
    0.17382348   2    1000022    16
    0.0051328017   2    1000023    16
    0.0010835138   2    1000025    16

DECAY 2000001  144.38487
    0.9806325   2    1000021    1
    0.019300807   2    1000022    1

DECAY 1000001  202.82802
    0.70272693   2    1000021    1
    0.1935715   2   -1000037    2
    0.096139121   2    1000035    1
    0.0034428317   2    1000022    1
    0.0022797405   2   -1000024    2
    0.0016933521   2    1000023    1
    0.0001465243   2    1000025    1

DECAY 2000003  144.40479
    0.98050024   2    1000021    3
    0.019298412   2    1000022    3

DECAY 1000003  202.84004
    0.70268758   2    1000021    3
    0.19356048   2   -1000037    4
    0.096133771   2    1000035    3
    0.0034428103   2    1000022    3
    0.0022878988   2   -1000024    4
    0.0017170271   2    1000023    3
    0.00017043575   2    1000025    3

DECAY 1000005  81.64903
    0.69941137   2    1000006   -24
    0.19365948   2   -1000024    6
    0.03065196   2   -1000037    6
    0.030319136   2    1000023    5
    0.028445715   2    1000025    5
    0.014062425   2    1000035    5
    0.0034499195   2    1000022    5

DECAY 2000005  15.867583
    0.41164759   2   -1000024    6
    0.20760915   2    1000025    5
    0.20110494   2    1000023    5
    0.075881107   2    1000006   -24
    0.060801055   2    1000022    5
    0.012692642   2    1000005    23
    0.011647944   2    1000005    25
    0.0089368696   2   -1000037    6
    0.0052341542   2    2000006   -24
    0.0044445542   2    1000035    5

DECAY 2000002  152.8967
    0.92682731   2    1000021    2
    0.072922109   2    1000022    2
    0.00014211818   2    1000023    2
    0.00010687162   2    1000025    2

DECAY 1000002  202.82363
    0.70252362   2    1000021    2
    0.19035979   2    1000037    1
    0.095791985   2    1000035    2
    0.0056813345   2    1000024    1
    0.003439112   2    1000022    2
    0.0021462468   2    1000023    2

DECAY 2000004  152.9002
    0.92680637   2    1000021    4
    0.072920445   2    1000022    4
    0.00014762155   2    1000023    4
    0.00011252299   2    1000025    4

DECAY 1000004  202.83544
    0.70248407   2    1000021    4
    0.19034933   2    1000037    3
    0.095786604   2    1000035    4
    0.0057286418   2    1000024    3
    0.0034389136   2    1000022    4
    0.0021502608   2    1000023    4

DECAY 1000006  10.125889
    0.36365845   2    1000024    5
    0.23226201   2    1000023    6
    0.22805183   2    1000025    6
    0.17534509   2    1000022    6
    0.00058539876   2    1000022    4

DECAY 2000006  91.384965
    0.41021784   2    1000006    23
    0.24498886   2    1000006    25
    0.10513774   2    1000024    5
    0.096292225   2    1000023    6
    0.095424635   2    1000025    6
    0.023030879   2    1000037    5
    0.013150843   2    1000035    6
    0.0088399134   2    1000022    6
    0.0029170711   2    1000005    24

DECAY 1000024  0.49805185
    0.98482321   2    1000022    24
    0.010612229   3    1000022   -5    6
    0.0045323121   2   -2000013    14

DECAY 1000037  10.184897
    0.18391198   2    1000025    24
    0.17378949   2    1000023    24
    0.16764219   2    1000024    25
    0.16646872   2    1000024    23
    0.070996738   2    1000014   -13
    0.070993474   2    1000012   -11
    0.070250457   2   -1000011    12
    0.070249699   2   -1000013    14
    0.021242217   2    1000006   -5
    0.0019266925   2    1000022    24
    0.0012693692   3    1000025   -5    6
    0.001069589   3    1000023   -5    6
    0.00011954581   3    1000024    6   -6

DECAY 1000022 -1


DECAY 1000023  0.47462652
    0.51997242   2    1000022    25
    0.44602745   2    1000022    23
    0.0090421157   2    2000013   -13
    0.0090421157   2   -2000013    13
    0.0066661245   2    2000011   -11
    0.0066661245   2   -2000011    11
    0.0025264237   3    1000022    6   -6

DECAY 1000025  0.59809278
    0.49205585   2    1000022    23
    0.48544495   2    1000022    25
    0.0059654697   2    2000013   -13
    0.0059654697   2   -2000013    13
    0.0040390507   2    2000011   -11
    0.0040390507   2   -2000011    11
    0.0024474171   3    1000022    6   -6

DECAY 1000035  11.797577
    0.16181048   2    1000025    25
    0.15510978   2    1000025    23
    0.14569902   2    1000024   -24
    0.14569902   2   -1000024    24
    0.13698319   2    1000023    25
    0.0310446   2    1000014   -14
    0.0310446   2   -1000014    14
    0.031043554   2    1000012   -12
    0.031043554   2   -1000012    12
    0.029892446   2    1000013   -13
    0.029892446   2   -1000013    13
    0.029892398   2    1000011   -11
    0.029892398   2   -1000011    11
    0.0076693246   2    1000023    23
    0.00082575018   2    1000022    25
    0.00079244966   3    1000024    5   -6
    0.00079244966   3   -1000024   -5    6
    0.00066739657   2    1000022    23

DECAY 1000021  232.68557
    0.17604469   2    1000006   -6
    0.17604469   2   -1000006    6
    0.12102761   2    1000005   -5
    0.12102761   2   -1000005    5
    0.099817281   2    2000006   -6
    0.099817281   2   -2000006    6
    0.09613176   2    2000005   -5
    0.09613176   2   -2000005    5
    0.0067249766   2    1000006   -4
    0.0067249766   2   -1000006    4
    0.00012496834   3    1000035    6   -6
    0.00011809595   3    1000037    5   -6
    0.00011809595   3   -1000037   -5    6

DECAY 25  0.0038207868
    0.58555721   2   -5    5
    0.21825342   2   -24    24
    0.069878883   2    21    21
    0.0672541   2   -15    15
    0.028697014   2   -4    4
    0.02611879   2    23    23
    0.0023389014   2    22    22
    0.0014479614   2    22    23
    0.00023301846   2   -13    13
    0.0002199411   2   -3    3
    6.0811374e-07   2   -1    1
    1.4788459e-07   2   -2    2
    5.2385151e-09   2   -11    11

DECAY 35  63.044315
    0.73711317   2   -5    5
    0.068749629   2   -15    15
    0.046748607   2   -1000024    1000037
    0.046748607   2   -1000037    1000024
    0.034765498   2    1000025    1000035
    0.017082458   2    1000022    1000023
    0.01513238   2    1000022    1000025
    0.013131765   2   -1000006    1000006
    0.011729494   2    1000023    1000035
    0.004014012   2   -1000024    1000024
    0.0026682945   2   -6    6
    0.00099617641   2    1000023    1000023
    0.00027573976   2    1000022    1000022
    0.00025580917   2    1000023    1000025
    0.00022418759   2   -13    13
    0.00016677398   2   -3    3
    0.00014363219   2    1000025    1000025
    2.7855869e-05   2    21    21
    1.3770611e-05   2    25    25
    8.2980129e-06   2    1000022    1000035
    1.3681181e-06   2    23    23
    6.2699222e-07   2   -24    24
    4.6102509e-07   2   -1    1
    1.3779099e-07   2    22    23
    1.1753044e-07   2   -1000011    1000011
    1.1624749e-07   2   -1000013    1000013
    1.0917594e-07   2   -2000011    2000011
    1.0903437e-07   2   -2000013    2000013
    2.8043454e-08   2   -4    4
    2.668161e-08   2    22    22
    1.1713484e-08   2   -2000013    1000013
    1.1713484e-08   2   -1000013    2000013
    5.0355874e-09   2   -11    11
    2.7399198e-13   2   -2000011    1000011
    2.7399198e-13   2   -1000011    2000011
    1.4458472e-13   2   -2    2

DECAY 36  59.487144
    0.74094841   2   -5    5
    0.06908164   2   -15    15
    0.047577821   2   -1000024    1000037
    0.047577821   2   -1000037    1000024
    0.03542714   2    1000023    1000035
    0.017203533   2    1000022    1000025
    0.016967894   2    1000022    1000023
    0.012655418   2    1000025    1000035
    0.0071044176   2   -1000024    1000024
    0.0025179225   2   -6    6
    0.0016882137   2    1000023    1000023
    0.00031890258   2    1000025    1000025
    0.0002911043   2    1000022    1000022
    0.00022526204   2   -13    13
    0.00019969496   2    1000023    1000025
    0.0001675722   2   -3    3
    2.5730721e-05   2    21    21
    1.8555398e-05   2    1000022    1000035
    2.0135799e-06   2    23    25
    4.6323194e-07   2   -1    1
    3.5416335e-07   2    22    23
    5.4275504e-08   2    22    22
    2.6760801e-08   2   -4    4
    1.2323554e-08   2   -2000013    1000013
    1.2323554e-08   2   -1000013    2000013
    5.0597443e-09   2   -11    11
    2.8824897e-13   2   -2000011    1000011
    2.8824897e-13   2   -1000011    2000011
    1.3799187e-13   2   -2    2
    4.2525047e-38   2    25    25

DECAY 37  62.16069
    0.74414638   2   -5    6
    0.074447706   2   -15    16
    0.04957924   2    1000023    1000037
    0.048158002   2    1000024    1000035
    0.046994377   2    1000025    1000037
    0.033468548   2    1000022    1000024
    0.0013895131   2    1000024    1000025
    0.0011039484   2   -5    4
    0.00026319937   2   -13    14
    0.00024810709   2    1000023    1000024
    0.0001539343   2   -3    4
    2.6409985e-05   2    1000022    1000037
    7.8833335e-06   2   -5    2
    7.1836368e-06   2   -3    2
    2.1966641e-06   2   -3    6
    1.9321615e-06   2    24    25
    4.3481847e-07   2   -2000011    1000012
    4.3460842e-07   2   -2000013    1000014
    4.268963e-07   2   -1    2
    9.0391905e-08   2   -1    6
    2.2816077e-08   2   -1000013    1000014
    2.0696624e-08   2   -1    4
    6.1562607e-09   2   -11    12
    8.6004225e-13   2    24    35
    5.3365792e-13   2   -1000011    1000012
    4.0231701e-14   2    24    36

DECAY 6  2.43
    1   2    5    24

DECAY 15 -1
