BLOCK DCINFO
   1   SDECAY/HDECAY
   2   1.3b /3.4

BLOCK SPINFO
   1   SOFTSUSY
   2   3.4.0

BLOCK MODSEL
   1   0

BLOCK SMINPUTS
   1    127.90897
   2    1.1663787e-05
   3    0.1184
   4    91.1876
   5    4.18
   6    173.2
   7    1.777

BLOCK MINPAR
   3    22.43

BLOCK EXTPAR
   0   -1
   1    705.42
   2   -2215.42
   3    2491.14
   11   -3469.16
   12   -1871.42
   13    3273.29
   23    1571.12
   26    2758.99
   31    3150.57
   32    3150.57
   33    1509.72
   34    1966
   35    1966
   36    1594.1
   41    3505.6
   42    3505.6
   43    2620.91
   44    2648.72
   45    2648.72
   46    1007.87
   47    1632.82
   48    1632.82
   49    663.24

BLOCK MASS
   24    80.394603
   25    127.08267
   35    2758.9991
   36    2758.99
   37    2760.2193
   5    4.8187603
   1000001    3541.0965
   2000001    1687.8566
   1000002    3540.3607
   2000002    2695.9079
   1000003    3541.0965
   2000003    1687.8566
   1000004    3540.3607
   2000004    2695.9079
   1000005    720.25473
   2000005    2655.8154
   1000006    1070.1552
   2000006    2667.3928
   1000011    3157.9197
   2000011    1968.0304
   1000012    3156.6139
   1000013    3157.9197
   2000013    1968.0304
   1000014    3156.6139
   1000015    1520.4884
   2000015    1600.3444
   1000016    1521.979
   1000021    2591.9534
   1000022    702.76771
   1000023   -1589.0814
   1000025    1594.0003
   1000035   -2263.9554
   1000024    1589.6411
   1000037    2264.1254

BLOCK NMIX
   1   1    0.99918608
   1   2    0.00052734265
   1   3    0.036341806
   1   4   -0.017497497
   2   1   -0.013298505
   2   2   -0.076495687
   2   3    0.70577625
   2   4    0.7041672
   3   1   -0.038070411
   3   2    0.014891328
   3   3    0.70615817
   3   4   -0.70687306
   4   1   -0.00098025408
   4   2    0.99695857
   4   3    0.043586607
   4   4    0.064597729

BLOCK UMIX
   1   1   -0.06062578
   1   2    0.99816057
   2   1   -0.99816057
   2   2   -0.06062578

BLOCK VMIX
   1   1    0.090306245
   1   2    0.99591404
   2   1    0.99591404
   2   2   -0.090306245

BLOCK STOPMIX
   1   1    0.087102472
   1   2    0.99619936
   2   1   -0.99619936
   2   2    0.087102472

BLOCK SBOTMIX
   1   1    0.011532666
   1   2    0.9999335
   2   1   -0.9999335
   2   2    0.011532666

BLOCK STAUMIX
   1   1    0.9767443
   1   2    0.2144075
   2   1   -0.2144075
   2   2    0.9767443

BLOCK ALPHA
      -0.046260758

BLOCK HMIX Q=  1619.072
   1    1588.5631
   2    21.64948
   3    243.61109
   4    8315203.9

BLOCK GAUGE Q=  1619.072
   1    0.36295825
   2    0.6344393
   3    1.0274307

BLOCK AU Q=  1619.072
   1   1    0
   2   2    0
   3   3   -3469.16

BLOCK AD Q=  1619.072
   1   1    0
   2   2    0
   3   3   -1871.42

BLOCK AE Q=  1619.072
   1   1    0
   2   2    0
   3   3    3273.29

BLOCK YU Q=  1619.072
   1   1    0
   2   2    0
   3   3    0.82820846

BLOCK YD Q=  1619.072
   1   1    0
   2   2    0
   3   3    0.26308329

BLOCK YE Q=  1619.072
   1   1    0
   2   2    0
   3   3    0.21070319

BLOCK MSOFT Q=  1619.072
   1    705.42
   2   -2215.42
   3    2491.14
   21    5039150.2
   22   -2543811.7
   31    3150.57
   32    3150.57
   33    1509.72
   34    1966
   35    1966
   36    1594.1
   41    3505.6
   42    3505.6
   43    2620.91
   44    2648.72
   45    2648.72
   46    1007.87
   47    1632.82
   48    1632.82
   49    663.23999

BLOCK HIGGSBOUNDSINPUTHIGGSCOUPLINGSFERMIONS
       0, 468.69997,3,36,15,15

BLOCK HIGGSBOUNDSINPUTHIGGSCOUPLINGSBOSONS
       0,4,36,21,21,23

DECAY 6  1.4173851
    1   2    5    24

DECAY 1000021  108.9494
    0.19669932   2    1000005   -5
    0.19669932   2   -1000005    5
    0.15506608   2    1000006   -6
    0.15506608   2   -1000006    6
    0.0741173   2    2000001   -1
    0.0741173   2   -2000001    1
    0.0741173   2    2000003   -3
    0.0741173   2   -2000003    3

DECAY 1000006  0.66359328
    0.99982632   2    1000022    6
    0.00017367977   2    1000005    24

DECAY 2000006  73.437879
    0.36515006   2    1000006    23
    0.35399128   2    1000006    25
    0.10302664   2    1000025    6
    0.097936574   2    1000023    6
    0.025623938   2    1000024    5
    0.021906839   2    1000037    5
    0.01678046   2    1000005    24
    0.01084607   2    1000035    6
    0.0047381465   2    1000022    6

DECAY 1000005  0.00089894857
    1   2    1000022    5

DECAY 2000005  71.70267
    0.71823946   2    1000006   -24
    0.20041487   2   -1000024    6
    0.021646554   2   -1000037    6
    0.011020824   2    1000035    5
    0.010776291   2    1000023    5
    0.010464978   2    1000025    5
    0.0093325715   2    1000005    25
    0.0087891971   2    1000005    23
    0.0046611303   2    1000021    5
    0.0046541274   2    1000022    5

DECAY 1000002  71.885183
    0.79232068   2    1000021    2
    0.13231039   2    1000037    1
    0.066282766   2    1000035    2
    0.0063533601   2    1000022    2
    0.0019708137   2    1000024    1
    0.00075497937   2    1000023    2
    7.0177136e-06   2    1000025    2

DECAY 2000002  6.3672572
    0.81836776   2    1000022    2
    0.18097705   2    1000021    2
    0.00058344963   2    1000025    2
    7.1658879e-05   2    1000023    2
    8.1508537e-08   2    1000035    2

DECAY 1000001  71.92373
    0.79282112   2    1000021    1
    0.1329403   2   -1000037    2
    0.066348621   2    1000035    1
    0.0062815997   2    1000022    1
    0.00088812582   2   -1000024    2
    0.00066110826   2    1000023    1
    5.91202e-05   2    1000025    1

DECAY 2000001  0.67261684
    0.99997001   2    1000022    1
    2.6434914e-05   2    1000025    1
    3.5546443e-06   2    1000023    1

DECAY 1000004  58.111721
    0.73457369   2    1000021    4
    0.16901949   2    1000037    3
    0.084672853   2    1000035    4
    0.0082173241   2    1000022    4
    0.002536088   2    1000024    3
    0.000971528   2    1000023    4
    9.0302617e-06   2    1000025    4

DECAY 2000004  6.3149443
    0.8625693   2    1000022    4
    0.13674595   2    1000021    4
    0.00060977176   2    1000025    4
    7.4897965e-05   2    1000023    4
    8.3040913e-08   2    1000035    4

DECAY 1000003  58.132137
    0.73517491   2    1000021    3
    0.16985603   2   -1000037    4
    0.084773041   2    1000035    3
    0.0081259716   2    1000022    3
    0.0011430681   2   -1000024    4
    0.00085088744   2    1000023    3
    7.6088653e-05   2    1000025    3

DECAY 2000003  0.67066068
    0.99997182   2    1000022    3
    2.4834905e-05   2    1000025    3
    3.3462565e-06   2    1000023    3

DECAY 1000011  12.756602
    0.46641689   2   -1000037    12
    0.29312642   2    1000022    11
    0.23245928   2    1000035    11
    0.0040613854   2   -1000024    12
    0.0039099114   2    1000023    11
    2.6119003e-05   2    1000025    11

DECAY 2000011  7.8419595
    0.99974622   2    1000022    11
    0.00022559891   2    1000025    11
    2.8178354e-05   2    1000023    11

DECAY 1000013  12.756602
    0.46641689   2   -1000037    14
    0.29312642   2    1000022    13
    0.23245928   2    1000035    13
    0.0040613854   2   -1000024    14
    0.0039099114   2    1000023    13
    2.6119003e-05   2    1000025    13

DECAY 2000013  7.8419594
    0.99974622   2    1000022    13
    0.0002255989   2    1000025    13
    2.8178353e-05   2    1000023    13

DECAY 1000015  1.4198934
    1   2    1000022    15

DECAY 2000015  5.2512809
    0.99992608   2    1000022    15
    4.1894126e-05   2   -1000024    16
    2.1948913e-05   2    1000023    15
    1.0075337e-05   2    1000025    15

DECAY 1000012  12.757347
    0.46328858   2    1000037    11
    0.29188378   2    1000022    12
    0.23246562   2    1000035    12
    0.0090021485   2    1000024    11
    0.0026204254   2    1000023    12
    0.00073944715   2    1000025    12

DECAY 1000014  12.757347
    0.46328858   2    1000037    13
    0.29188378   2    1000022    14
    0.23246562   2    1000035    14
    0.0090021485   2    1000024    13
    0.0026204254   2    1000023    14
    0.00073944715   2    1000025    14

DECAY 1000016  1.2303583
    1   2    1000022    16

DECAY 1000024  12.617715
    0.75077489   2    1000006   -5
    0.16631535   2   -1000005    6
    0.082440132   2    1000022    24
    0.00040759155   2    1000016   -15
    6.2031365e-05   2   -1000015    16

DECAY 1000037  17.415805
    0.17231232   2    1000024    25
    0.16397826   2    1000023    24
    0.15911685   2    1000024    23
    0.15519235   2    1000016   -15
    0.15352583   2    1000025    24
    0.14781159   2   -1000015    16
    0.039273439   2    1000006   -5
    0.0071171329   2   -2000015    16
    0.0014281268   2    1000022    24
    0.00024410324   2   -1000005    6

DECAY 1000022 -1


DECAY 1000023  11.634486
    0.36505702   2    1000006   -6
    0.36505702   2   -1000006    6
    0.089069679   2    1000005   -5
    0.089069679   2   -1000005    5
    0.081595293   2    1000022    23
    0.0096514639   2    1000022    25
    0.00024105763   2    1000015   -15
    0.00024105763   2   -1000015    15
    8.8683305e-06   2    1000016   -16
    8.8683305e-06   2   -1000016    16

DECAY 1000025  13.032782
    0.37965628   2    1000006   -6
    0.37965628   2   -1000006    6
    0.079687654   2    1000005   -5
    0.079687654   2   -1000005    5
    0.071586401   2    1000022    25
    0.0092982387   2    1000022    23
    0.00021117864   2    1000015   -15
    0.00021117864   2   -1000015    15
    2.5686724e-06   2    1000016   -16
    2.5686724e-06   2   -1000016    16

DECAY 1000035  17.170942
    0.16808352   2    1000023    25
    0.15746904   2    1000025    23
    0.1533003   2    1000024   -24
    0.1533003   2   -1000024    24
    0.07888994   2    1000016   -16
    0.07888994   2   -1000016    16
    0.074698444   2    1000015   -15
    0.074698444   2   -1000015    15
    0.019733539   2    1000006   -6
    0.019733539   2   -1000006    6
    0.0062741724   2    1000023    23
    0.0059510976   2    1000025    25
    0.0036089657   2    2000015   -15
    0.0036089657   2   -2000015    15
    0.0011696394   2    1000022    23
    0.00033707971   2    1000022    25
    0.00012644868   2    1000005   -5
    0.00012644868   2   -1000005    5
    2.1780976e-08   2    2000001   -1
    2.1780976e-08   2   -2000001    1
    2.1780976e-08   2    2000003   -3
    2.1780976e-08   2   -2000003    3
    1.9823245e-08   2    2000011   -11
    1.9823245e-08   2   -2000011    11
    1.9823245e-08   2    2000013   -13
    1.9823245e-08   2   -2000013    13

DECAY 25  0.004875423
    0.61221027   2    5   -5
    0.21552127   2    24   -24
    0.068247802   2    21    21
    0.054208934   2   -15    15
    0.027772729   2    23    23
    0.018026644   2    4   -4
    0.0020750209   2    22    22
    0.0015368389   2    22    23
    0.00020863332   2    3   -3
    0.00019185615   2   -13    13

DECAY 35  18.964689
    0.75679457   2    5   -5
    0.15336486   2   -15    15
    0.045888999   2    1000022    1000023
    0.017349091   2    1000006   -1000006
    0.012746347   2    1000022    1000025
    0.012689544   2    6   -6
    0.00052292511   2   -13    13
    0.00028285893   2    1000022    1000022
    0.00025725544   2    3   -3
    5.1499102e-05   2    1000005   -1000005
    2.4537971e-05   2    21    21
    2.1556562e-05   2    25    25
    3.7777366e-06   2    24   -24
    1.8842366e-06   2    23    23
    1.6092799e-07   2    22    22
    1.2938806e-07   2    4   -4
    6.6922078e-09   2    23    22

DECAY 36  18.62762
    0.77055217   2    5   -5
    0.15614119   2   -15    15
    0.045581255   2    1000022    1000025
    0.013449347   2    1000022    1000023
    0.012996246   2    6   -6
    0.00053239072   2   -13    13
    0.00042514273   2    1000022    1000022
    0.00026195183   2    3   -3
    5.6117408e-05   2    21    21
    3.8933345e-06   2    23    25
    1.3235586e-07   2    4   -4
    1.2237803e-07   2    22    22
    4.6977831e-08   2    23    22

DECAY 37  15.488916
    0.73663406   2    6   -5
    0.18786561   2   -15    16
    0.072594099   2    1000024    1000022
    0.0012145959   2    4   -5
    0.00070821606   2    1000006   -1000005
    0.00064056068   2   -13    14
    0.00031027109   2    4   -3
    1.5755622e-05   2    2   -3
    1.214594e-05   2    2   -5
    4.6920347e-06   2    24    25
    2.3844433e-13   2    24    36

DECAY 5 -1


DECAY 15 -1


DECAY 23  2.4952


DECAY 24  2.085
