BLOCK SPINFO
   1   SPheno
   2   v4.0.5be

BLOCK SPHENOINFO
   1   2
   2   2

BLOCK MODSEL
   1   0

BLOCK MINPAR
   3    49.150295
   4    1

BLOCK EXTPAR
   0    3353.3505
   1   -152.27689
   2    2742.2471
   3    3964.6557
   11    7474.2438
   12    3412.5367
   13   -727.39551
   23    4817.641
   25    47.443693
   26    2756.2302
   31    4448.7925
   32    4448.7925
   33    4898.6349
   34    505.23571
   35    505.23571
   36    829.30911
   41    3121.2267
   42    3121.2267
   43    3384.0882
   44    2676.7676
   45    2676.7676
   46    3281.1278
   47    1719.636
   48    1719.636
   49    4664.9597

BLOCK SMINPUTS
   1    127.90897
   2    1.1663787e-05
   3    0.1184
   4    91.1876
   5    4.18
   6    173.2
   7    1.777
   8    0
   11    0.00051099893
   12    0
   13    0.10565837
   14    0
   21    0.005
   22    0.0025
   23    0.095
   24    1.27

BLOCK GAUGE Q=  3353.3505
   1    0.35536298
   2    0.66519887
   3    1.219778

BLOCK YU Q=  3353.3505
   1   1    8.3862344e-06
   2   2    0.0042602071
   3   3    1.0131245

BLOCK YD Q=  3353.3505
   1   1    0.00079951337
   2   2    0.015190754
   3   3    0.79286673

BLOCK YE Q=  3353.3505
   1   1    0.00013952093
   2   2    0.028848503
   3   3    0.48518437

BLOCK AU Q=  3353.3505
   1   1    0
   2   2    0
   3   3    7474.2441

BLOCK AD Q=  3353.3505
   1   1    0
   2   2    0
   3   3    3412.5353

BLOCK AE Q=  3353.3505
   1   1    0
   2   2    0
   3   3   -727.39552

BLOCK MSOFT Q=  3353.3505
   1   -152.27689
   2    2742.2471
   3    3964.6557
   21   -15585978
   22   -22999002
   31    4448.7925
   32    4448.7925
   33    4898.6349
   34    505.23571
   35    505.23571
   36    829.30911
   41    3121.2267
   42    3121.2267
   43    3384.0882
   44    2676.7676
   45    2676.7676
   46    3281.1278
   47    1719.636
   48    1719.636
   49    4664.9597

BLOCK MASS
   6    173.2
   23    91.1876
   24    80.429995
   15    1.777
   25    126.84866
   35    2755.7773
   36    2756.2302
   37    2757.6262
   1000001    3285.9683
   2000001    1893.1067
   1000002    3285.0253
   2000002    2820.8213
   1000003    3285.9659
   2000003    1893.0995
   1000004    3285.0223
   2000004    2820.8212
   1000005    3450.1728
   2000005    4752.2838
   1000006    3187.0324
   2000006    3528.3481
   1000011    4461.914
   2000011    537.98452
   1000012    4460.8114
   1000013    4461.893
   2000013    537.78039
   1000014    4460.7816
   1000015    828.37998
   2000015    4904.8116
   1000016    4902.4374
   1000021    4050.6345
   1000022   -150.23737
   1000023    2796.6038
   1000025   -4771.7986
   1000035    4772.8887
   1000024    2796.59
   1000037    4773.306

BLOCK ALPHA
      -0.020370248

BLOCK HMIX Q=  3353.3505
   1    4817.641
   2    47.443693
   3    243.10037
   4    7596805.1

BLOCK STOPMIX
   1   1   -0.48966919
   1   2    0.8719083
   2   1   -0.8719083
   2   2   -0.48966919

BLOCK SBOTMIX
   1   1    0.99965721
   1   2    0.026181396
   2   1   -0.026181396
   2   2    0.99965721

BLOCK STAUMIX
   1   1    0.018081478
   1   2    0.99983652
   2   1   -0.99983652
   2   2    0.018081478

BLOCK NMIX
   1   1    0.99995656
   1   2    1.3091806e-05
   1   3    0.009318654
   1   4    0.00018602082
   2   1   -0.00020901232
   2   2   -0.99961054
   2   3    0.024113215
   2   4   -0.014045519
   3   1    0.0067205866
   3   2   -0.0071215348
   3   3   -0.70704043
   3   4   -0.70710533
   4   1   -0.0064546198
   4   2    0.02698242
   4   3    0.70670047
   4   4   -0.7069687

BLOCK UMIX
   1   1   -0.9994156
   1   2    0.034182801
   2   1    0.034182801
   2   2    0.9994156

BLOCK VMIX
   1   1   -0.9998017
   1   2    0.019914092
   2   1    0.019914092
   2   2    0.9998017

BLOCK HIGGSBOUNDSINPUTHIGGSCOUPLINGSFERMIONS
       0, 2250.904,3,36,15,15

BLOCK HIGGSBOUNDSINPUTHIGGSCOUPLINGSBOSONS
       0,4,36,21,21,23

BLOCK SPHENOLOWENERGY
   1    0.0003332497
   2    1.5890895e-06
   3    3.5259692e-05
   4    6.673432e-15
   5    2.8508099e-10
   6    5.9652309e-08
   7    2.2532677e-13
   8    9.6259377e-09
   9    2.0408626e-06
   10    9.2638112e-05
   11    0.95691623
   12    0.54257141
   13    19.363805
   14    0
   15    0
   16    0.0021605974
   17    2.2816938e-15
   18    2.4806629e-11
   19    8.2916681e-11
   20    5.6748612e-16
   21    2.4255008e-11
   22    7.4858631e-09
   23    0
   24    0
   25    0
   26    0
   27    0
   28    0
   29    0
   30    0
   31    0
   39    7.0046218e-05
   40    0
   41    0
   42    0

BLOCK FWCOEF Q=  160
   305   4422   0   0   -0.18881911
   305   4422   0   2   -0.20253139
   305   4322   0   2   -0.00028632973
   305   6421   0   0   -0.095227835
   305   6421   0   2   -0.10981071
   305   6321   0   2   -0.0003018059
   3051111   4133   0   0    1.6212028
   3051111   4133   0   2    1.6212155
   3051111   4233   0   2    0.00018063384
   3051111   4137   0   0   -4.4438949
   3051111   4137   0   2   -4.4429725
   3051111   4237   0   2   -0.0013483564
   3051313   4133   0   0    1.6212028
   3051313   4133   0   2    1.6212148
   3051313   4233   0   2    0.00018063279
   3051313   4137   0   0   -4.4438949
   3051313   4137   0   2   -4.4429732
   3051313   4237   0   2   -0.001348356
   3051212   4137   0   0    1.5053501
   3051212   4137   0   2    1.5051515
   3051212   4237   0   2    0.00029193315
   3051414   4137   0   0    1.5053501
   3051414   4137   0   2    1.5051515
   3051414   4237   0   2    0.00029193333
   3051616   4137   0   0    1.5053501
   3051616   4137   0   2    1.5051515
   3051616   4237   0   2    0.00029198377

BLOCK IMFWCOEF Q=  160
   305   4422   0   0    3.8543739e-07
   305   4422   0   2    9.1594319e-06
   305   4322   0   2   -2.4515171e-06
   305   6421   0   0    3.3015261e-07
   305   6421   0   2   -7.2488056e-06
   305   6321   0   2   -1.9589638e-06
   3051111   4133   0   2   -7.2842697e-07
   3051111   4233   0   2    4.4003974e-06
   3051111   4137   0   2    6.4417766e-06
   3051111   4237   0   2   -3.2846104e-05
   3051313   4133   0   2   -7.2842212e-07
   3051313   4233   0   2    4.4003936e-06
   3051313   4137   0   2    6.4417813e-06
   3051313   4237   0   2   -3.2846112e-05
   3051212   4137   0   2   -1.37455e-06
   3051212   4237   0   2    7.1114711e-06
   3051414   4137   0   2   -1.37455e-06
   3051414   4237   0   2    7.1114711e-06
   3051616   4137   0   2   -1.3744776e-06
   3051616   4237   0   2    7.1114704e-06

DECAY 23  2.4952


DECAY 24  2.085


DECAY 2000011  2.2977968
    1   2    1000022    11

DECAY 1000011  27.290563
    0.52995752   2   -1000024    12
    0.26513797   2    1000023    11
    0.20490448   2    1000022    11

DECAY 2000013  2.2966301
    1   2    1000022    13

DECAY 1000013  27.332594
    0.52913361   2   -1000024    14
    0.2647263   2    1000023    13
    0.20458865   2    1000022    13
    0.0015506483   2    2000013    25

DECAY 1000015  3.8926103
    1   2    1000022    15

DECAY 2000015  58.715044
    0.33415434   2   -1000024    16
    0.20463764   2    1000015    23
    0.1839963   2    1000015    25
    0.16727693   2    1000023    15
    0.10480189   2    1000022    15
    0.0020175437   2    1000015    35
    0.0019979621   2    1000015    36
    0.00056041985   2    1000025    15
    0.00055236766   2    1000035    15

DECAY 1000012  27.277324
    0.530154   2    1000024    11
    0.26491306   2    1000023    12
    0.20493295   2    1000022    12

DECAY 1000014  27.276818
    0.5301522   2    1000024    13
    0.26491161   2    1000023    14
    0.20493537   2    1000022    14

DECAY 1000016  59.902485
    0.40077701   2    1000015    24
    0.32791544   2    1000024    15
    0.16376012   2    1000023    16
    0.10259746   2    1000022    16
    0.0039128834   2    1000015    37
    0.0010360737   2    1000037    15

DECAY 2000001  1.0435461
    1   2    1000022    1

DECAY 1000001  3.7506636
    0.58544903   2   -1000024    2
    0.29280167   2    1000023    1
    0.12174134   2    1000022    1

DECAY 2000003  1.0435427
    1   2    1000022    3

DECAY 1000003  3.7613745
    0.58377392   2   -1000024    4
    0.29196544   2    1000023    3
    0.12139492   2    1000022    3
    0.0028657203   2    2000003    25

DECAY 1000005  23.904
    0.76350242   2    1000006   -24
    0.14109746   2   -1000024    6
    0.074861192   2    1000023    5
    0.020538931   2    1000022    5

DECAY 2000005  52.652952
    0.53270375   2    1000021    5
    0.26443443   2    1000005    25
    0.064885844   2    2000006   -24
    0.050182214   2    1000022    5
    0.049864063   2    1000005    23
    0.037821679   2    1000006   -24

DECAY 2000002  6.2631447
    1   2    1000022    2

DECAY 1000002  3.7416167
    0.58537941   2    1000024    1
    0.29258433   2    1000023    2
    0.12203627   2    1000022    2

DECAY 2000004  6.2631412
    1   2    1000022    4

DECAY 1000004  3.7415755
    0.58537963   2    1000024    3
    0.29258288   2    1000023    4
    0.12203745   2    1000022    4

DECAY 1000006  6.0293877
    0.90466682   2    1000022    6
    0.0528484   2    1000024    5
    0.022730626   2    1000023    6
    0.0099354476   2    1000023    4
    0.0059336448   2    1000022    4
    0.0033118013   3    1000022    24    5
    0.00057031023   3   -1000015    16    5

DECAY 2000006  29.760466
    0.51103437   2    1000006    23
    0.24584434   2    1000006    25
    0.1135208   2    1000024    5
    0.075557141   2    1000022    6
    0.054043353   2    1000023    6

DECAY 1000024  0.021207511
    0.89309753   2   -1000015    16
    0.031484699   2    1000022    24
    0.01652166   3    1000022   -5    6
    0.016461728   3    1000022   -3    4
    0.016460932   3    1000022   -1    2
    0.009213405   3    1000022   -13    14
    0.0092124176   3    1000022   -11    12
    0.0060523464   3    1000022   -15    16
    0.0011829676   2   -2000013    14
    0.00031142561   2   -2000003    4

DECAY 1000037  137.80063
    0.29840119   2    1000006   -5
    0.24009113   2   -1000005    6
    0.15199349   2    2000006   -5
    0.076055969   2   -1000015    16
    0.069259378   2    1000024    25
    0.05964777   2    1000023    24
    0.059303019   2    1000024    23
    0.023231824   2    1000022    24
    0.0095764875   2    37    1000022
    0.0057491521   3    1000024    6   -6
    0.0038282974   3    1000023   -5    6
    0.0016140149   3    1000022   -5    6
    0.00027919736   2   -2000013    14
    0.00021332634   3    1000024    5   -5
    0.00016919752   2   -2000003    4
    0.0001530599   2   -1000003    4
    0.00014792508   2   -1000001    2
    0.00011626069   2    1000004   -3

DECAY 1000022 -1


DECAY 1000023  0.02131136
    0.44328046   2    1000015   -15
    0.44328046   2   -1000015    15
    0.01921534   2    1000022    25
    0.017892014   2    1000022    23
    0.012097732   3    1000022    12   -12
    0.0095323593   3    1000022    6   -6
    0.008200324   3    1000022    4   -4
    0.0082002662   3    1000022    2   -2
    0.0081818696   3    1000022    3   -3
    0.0081811347   3    1000022    1   -1
    0.0081327755   3    1000022    5   -5
    0.0045831797   3    1000022    13   -13
    0.0045824075   3    1000022    11   -11
    0.0030824961   3    1000022    15   -15
    0.0005991424   2    2000013   -13
    0.0005991424   2   -2000013    13
    0.00015562428   2    2000003   -3
    0.00015562428   2   -2000003    3

DECAY 1000025  142.85831
    0.13809801   2    1000006   -6
    0.13809801   2   -1000006    6
    0.11933422   2    2000006   -6
    0.11933422   2   -2000006    6
    0.071318775   2    1000005   -5
    0.071318775   2   -1000005    5
    0.058054315   2    1000023    25
    0.057385534   2    1000024   -24
    0.057385534   2   -1000024    24
    0.053459249   2    1000023    23
    0.036763499   2    1000015   -15
    0.036763499   2   -1000015    15
    0.010757082   2    1000022    23
    0.010679267   2    1000022    25
    0.005294302   2    1000022    35
    0.0040311074   2    1000022    36
    0.0036819475   3    1000024    5   -6
    0.0036819475   3   -1000024   -5    6
    0.0024347338   3    1000023    6   -6
    0.0012954889   3    1000022    6   -6
    0.00013843642   2    2000013   -13
    0.00013843642   2   -2000013    13
    0.00011070355   3    1000023    5   -5

DECAY 1000035  136.67045
    0.14781415   2    1000006   -6
    0.14781415   2   -1000006    6
    0.12174552   2    2000006   -6
    0.12174552   2   -2000006    6
    0.074531877   2    1000005   -5
    0.074531877   2   -1000005    5
    0.065718572   2    1000023    25
    0.05927333   2    1000024   -24
    0.05927333   2   -1000024    24
    0.038363074   2    1000015   -15
    0.038363074   2   -1000015    15
    0.012175768   2    1000022    23
    0.012108379   2    1000022    25
    0.0050939764   2    1000022    35
    0.004579118   2    1000022    36
    0.003887105   2    1000023    23
    0.0038632991   3    1000024    5   -6
    0.0038632991   3   -1000024   -5    6
    0.0027335503   3    1000023    6   -6
    0.0013171043   3    1000022    6   -6
    0.00014430395   2    2000013   -13
    0.00014430395   2   -2000013    13
    0.00010723077   3    1000023    5   -5

DECAY 1000021  301.69226
    0.12138438   2    2000003   -3
    0.12138438   2   -2000003    3
    0.12138386   2    2000001   -1
    0.12138386   2   -2000001    1
    0.052711353   2    2000002   -2
    0.052711353   2   -2000002    2
    0.052711344   2    2000004   -4
    0.052711344   2   -2000004    4
    0.033792593   2    1000006   -6
    0.033792593   2   -1000006    6
    0.023282173   2    1000004   -4
    0.023282173   2   -1000004    4
    0.023282037   2    1000002   -2
    0.023282037   2   -1000002    2
    0.023230822   2    1000003   -3
    0.023230822   2   -1000003    3
    0.023230694   2    1000001   -1
    0.023230694   2   -1000001    1
    0.014967012   2    1000005   -5
    0.014967012   2   -1000005    5
    0.0076892172   2    2000006   -6
    0.0076892172   2   -2000006    6
    0.0023295134   2    1000006   -4
    0.0023295134   2   -1000006    4

DECAY 25  0.0041251572
    0.54209135   2   -5    5
    0.26022705   2   -24    24
    0.071078585   2    21    21
    0.062625034   2   -15    15
    0.032648532   2    23    23
    0.026905986   2   -4    4
    0.0023457452   2    22    22
    0.0016562489   2    22    23
    0.00021721069   2   -13    13
    0.0002035532   2   -3    3
    5.6280297e-07   2   -1    1
    1.3864743e-07   2   -2    2
    4.8831184e-09   2   -11    11

DECAY 35  53.568654
    0.70442587   2   -5    5
    0.29429338   2   -15    15
    0.001032309   2   -13    13
    0.00015864601   2   -3    3
    6.0920095e-05   2   -6    6
    9.4699732e-06   2    1000022    1000022
    8.3963409e-06   2    25    25
    5.7470007e-06   2   -1000015    1000015
    4.6157186e-06   2    21    21
    4.3854658e-07   2   -1    1
    6.158147e-08   2    23    23
    4.5402494e-08   2   -1000011    1000011
    4.396836e-08   2   -1000013    1000013
    2.3185617e-08   2   -11    11
    2.0825642e-08   2   -24    24
    5.1341768e-09   2    22    23
    4.8725555e-09   2    22    22
    1.2341583e-09   2   -4    4
    6.3603548e-15   2   -2    2

DECAY 36  51.1767
    0.70444469   2   -5    5
    0.29432709   2   -15    15
    0.0010324262   2   -13    13
    0.0001586299   2   -3    3
    1.470293e-05   2   -6    6
    1.184077e-05   2    21    21
    1.0027634e-05   2    1000022    1000022
    4.3850161e-07   2   -1    1
    9.9079074e-08   2    23    25
    2.3188364e-08   2   -11    11
    1.8409175e-08   2    22    22
    4.5122505e-09   2    22    23
    4.3945391e-10   2   -4    4
    2.2635011e-15   2   -2    2
    4.5270187e-35   2    25    25

DECAY 37  38.642794
    0.65283056   2   -5    6
    0.34475795   2   -15    16
    0.0012188426   2   -13    14
    0.00096682698   2   -5    4
    0.00020644192   2   -3    4
    9.6592461e-06   2   -3    2
    6.9041429e-06   2   -5    2
    1.9759301e-06   2   -3    6
    5.7312608e-07   2   -1    2
    1.3151327e-07   2    24    25
    7.6637939e-08   2   -1    6
    2.8508855e-08   2   -11    12
    2.7440753e-08   2   -1    4
    7.6092874e-13   2    24    35
    1.8673853e-13   2    24    36

DECAY 6  2.43
    1   2    5    24

DECAY 15 -1
