BLOCK SPINFO
   1   SPheno
   2   v4.0.5be

BLOCK SPHENOINFO
   1   2
   2   2

BLOCK MODSEL
   1   0

BLOCK MINPAR
   3    13.093347
   4   -1

BLOCK EXTPAR
   0    3501.4936
   1   -948.51634
   2   -3888.5148
   3    2692.009
   11   -6617.9598
   12   -6291.5979
   13   -1117.4063
   23   -3201.4822
   25    12.48587
   26    3695.2679
   31    3599.0774
   32    3599.0774
   33    1823.1423
   34    4310.8788
   35    4310.8788
   36    3106.0017
   41    3393.9078
   42    3393.9078
   43    3982.349
   44    2551.9011
   45    2551.9011
   46    2998.7792
   47    2260.4995
   48    2260.4995
   49    4211.6238

BLOCK SMINPUTS
   1    127.90897
   2    1.1663787e-05
   3    0.1184
   4    91.1876
   5    4.18
   6    173.2
   7    1.777
   8    0
   11    0.00051099893
   12    0
   13    0.10565837
   14    0
   21    0.005
   22    0.0025
   23    0.095
   24    1.27

BLOCK GAUGE Q=  3501.4936
   1    0.35536298
   2    0.66519887
   3    1.219778

BLOCK YU Q=  3501.4936
   1   1    8.4112199e-06
   2   2    0.0042728997
   3   3    1.0161429

BLOCK YD Q=  3501.4936
   1   1    0.00021103673
   2   2    0.004009698
   3   3    0.20928231

BLOCK YE Q=  3501.4936
   1   1    3.6827453e-05
   2   2    0.0076147493
   3   3    0.12806756

BLOCK AU Q=  3501.4936
   1   1    0
   2   2    0
   3   3   -6617.9597

BLOCK AD Q=  3501.4936
   1   1    0
   2   2    0
   3   3   -6291.5981

BLOCK AE Q=  3501.4936
   1   1    0
   2   2    0
   3   3   -1117.4063

BLOCK MSOFT Q=  3501.4936
   1   -948.51634
   2   -3888.5148
   3    2692.009
   21    3117141.5
   22   -9996642.2
   31    3599.0774
   32    3599.0774
   33    1823.1423
   34    4310.8788
   35    4310.8788
   36    3106.0017
   41    3393.9078
   42    3393.9078
   43    3982.349
   44    2551.9011
   45    2551.9011
   46    2998.7792
   47    2260.4995
   48    2260.4995
   49    4211.6238

BLOCK MASS
   6    173.2
   23    91.1876
   24    80.429995
   15    1.777
   25    124.4972
   35    3695.2303
   36    3695.2679
   37    3696.4304
   1000001    3520.4963
   2000001    2400.5591
   1000002    3519.6256
   2000002    2679.7721
   1000003    3520.4958
   2000003    2400.5583
   1000004    3519.625
   2000004    2679.7722
   1000005    4024.4614
   2000005    4285.6252
   1000006    3034.5541
   2000006    4040.283
   1000011    3627.4193
   2000011    4315.9867
   1000012    3626.1499
   1000013    3627.4173
   2000013    4315.9824
   1000014    3626.1483
   1000015    1860.695
   2000015    3109.9413
   1000016    1858.8555
   1000021    2941.616
   1000022   -940.87625
   1000023   -3206.4278
   1000025    3210.6882
   1000035   -3883.6636
   1000024    3206.4328
   1000037    3883.7861

BLOCK ALPHA
      -0.076368457

BLOCK HMIX Q=  3501.4936
   1   -3201.4822
   2    12.48587
   3    243.07202
   4    13655005

BLOCK STOPMIX
   1   1    0.12588611
   1   2    0.9920447
   2   1   -0.9920447
   2   2    0.12588611

BLOCK SBOTMIX
   1   1   -0.99944401
   1   2    0.033341813
   2   1   -0.033341813
   2   2   -0.99944401

BLOCK STAUMIX
   1   1   -0.99993933
   1   2    0.011015698
   2   1   -0.011015698
   2   2   -0.99993933

BLOCK NMIX
   1   1    0.99986335
   1   2   -0.00016391551
   1   3   -0.015550305
   1   4    0.0056075259
   2   1    0.014926471
   2   2    0.083647672
   2   3    0.70494989
   2   4   -0.70414908
   3   1    0.0070288445
   3   2   -0.0070541381
   3   3    0.70701418
   3   4    0.70712926
   4   1   -0.0010387554
   4   2    0.99647041
   4   3   -0.054173802
   4   4    0.064115841

BLOCK UMIX
   1   1   -0.076329713
   1   2   -0.99708263
   2   1   -0.99708263
   2   2    0.076329713

BLOCK VMIX
   1   1    0.09040833
   1   2    0.99590478
   2   1    0.99590478
   2   2   -0.09040833

BLOCK HIGGSBOUNDSINPUTHIGGSCOUPLINGSFERMIONS
       0, 155.89696,3,36,15,15

BLOCK HIGGSBOUNDSINPUTHIGGSCOUPLINGSBOSONS
       0,4,36,21,21,23

BLOCK SPHENOLOWENERGY
   1    0.00032841665
   2    1.5895929e-06
   3    3.5260048e-05
   4    2.5728081e-15
   5    1.099075e-10
   6    2.3011685e-08
   7    8.696207e-14
   8    3.7150188e-09
   9    7.8810947e-07
   10    9.6719632e-05
   11    0.99907677
   12    0.54210583
   13    19.369438
   14    0
   15    0
   16    0.0021578208
   17    2.2816635e-15
   18    2.4809214e-11
   19    8.2917783e-11
   20    2.659689e-16
   21    1.1370959e-11
   22    5.1964217e-09
   23    0
   24    0
   25    0
   26    0
   27    0
   28    0
   29    0
   30    0
   31    0
   39    3.5154167e-07
   40    0
   41    0
   42    0

BLOCK FWCOEF Q=  160
   305   4422   0   0   -0.18881911
   305   4422   0   2   -0.19782059
   305   4322   0   2   -0.0001920455
   305   6421   0   0   -0.095227835
   305   6421   0   2   -0.10370696
   305   6321   0   2   -0.00017547718
   3051111   4133   0   0    1.6216102
   3051111   4133   0   2    1.6217048
   3051111   4233   0   2    2.8161106e-05
   3051111   4137   0   0   -4.4443023
   3051111   4137   0   2   -4.4433725
   3051111   4237   0   2   -0.00021077481
   3051313   4133   0   0    1.6216102
   3051313   4133   0   2    1.6217047
   3051313   4233   0   2    2.8161103e-05
   3051313   4137   0   0   -4.4443023
   3051313   4137   0   2   -4.4433726
   3051313   4237   0   2   -0.00021077481
   3051212   4137   0   0    1.5053501
   3051212   4137   0   2    1.5051494
   3051212   4237   0   2    4.5630467e-05
   3051414   4137   0   0    1.5053501
   3051414   4137   0   2    1.5051494
   3051414   4237   0   2    4.5630467e-05
   3051616   4137   0   0    1.5053501
   3051616   4137   0   2    1.5051491
   3051616   4237   0   2    4.5630655e-05

BLOCK IMFWCOEF Q=  160
   305   4422   0   0    3.857831e-07
   305   4422   0   2   -8.1436128e-08
   305   4322   0   2   -1.8104995e-06
   305   6421   0   0    3.3044874e-07
   305   6421   0   2    9.0794402e-06
   305   6321   0   2   -9.7645376e-07
   3051111   4133   0   2   -1.6638696e-06
   3051111   4233   0   2    5.5901156e-07
   3051111   4137   0   2    1.3839821e-05
   3051111   4237   0   2   -4.1825416e-06
   3051313   4133   0   2   -1.663869e-06
   3051313   4233   0   2    5.5901153e-07
   3051313   4137   0   2    1.3839821e-05
   3051313   4237   0   2   -4.1825417e-06
   3051212   4137   0   2   -2.985428e-06
   3051212   4237   0   2    9.0547315e-07
   3051414   4137   0   2   -2.985428e-06
   3051414   4237   0   2    9.0547315e-07
   3051616   4137   0   2   -2.9909622e-06
   3051616   4237   0   2    9.0547469e-07

DECAY 23  2.4952


DECAY 24  2.085


DECAY 1000011  3.9759182
    0.99614943   2    1000022    11
    0.0022369548   2   -1000024    12
    0.0016115596   2    1000023    11

DECAY 2000011  19.669845
    0.99993977   2    1000022    11

DECAY 1000013  3.976114
    0.99609989   2    1000022    13
    0.0022368261   2   -1000024    14
    0.001636563   2    1000023    13

DECAY 2000013  19.672205
    0.99981873   2    1000022    13

DECAY 1000015  1.2943975
    1   2    1000022    15

DECAY 2000015  14.195899
    0.90812984   2    1000022    15
    0.046144289   2    1000016   -24
    0.022949309   2    1000015    23
    0.022776559   2    1000015    25

DECAY 1000012  3.9805303
    0.99576808   2    1000022    12
    0.0031178491   2    1000024    11
    0.001092212   2    1000023    12

DECAY 1000014  3.9807252
    0.99571881   2    1000022    14
    0.0031671811   2    1000024    13
    0.0010921515   2    1000023    14

DECAY 1000016  1.2922722
    1   2    1000022    16

DECAY 2000001  0.95981872
    1   2    1000022    1

DECAY 1000001  25.747423
    0.98319924   2    1000021    1
    0.016481077   2    1000022    1
    0.00020377161   2   -1000024    2
    0.00011471146   2    1000023    1

DECAY 2000003  0.95981834
    1   2    1000022    3

DECAY 1000003  25.747693
    0.98318733   2    1000021    3
    0.016480911   2    1000022    3
    0.00020505173   2   -1000024    4
    0.00011535141   2    1000023    3

DECAY 1000005  136.20093
    0.50578318   2    1000021    5
    0.40978198   2    1000006   -24
    0.076538019   2   -1000024    6
    0.0037382638   2    1000022    5
    0.00185233   2    1000023    5
    0.0016981581   2    1000025    5
    0.00060806986   2    1000035    5

DECAY 2000005  98.560933
    0.96014146   2    1000021    5
    0.021933213   2    1000022    5
    0.0075575391   2   -1000024    6
    0.0036530778   2    1000025    5
    0.0035903102   2    1000023    5
    0.001179202   2    1000006   -24
    0.00078763602   2    1000005    25
    0.00068951714   2    2000006   -24
    0.00040951482   2    1000005    23

DECAY 2000002  4.5986411
    1   2    1000022    2

DECAY 1000002  25.683998
    0.98312865   2    1000021    2
    0.016455722   2    1000022    2
    0.00028513248   2    1000024    1
    0.00012992351   2    1000023    2

DECAY 2000004  4.5986386
    1   2    1000022    4

DECAY 1000004  25.683938
    0.98312584   2    1000021    4
    0.01645575   2    1000022    4
    0.00028636251   2    1000024    3
    0.00013071827   2    1000023    4

DECAY 1000006  5.4182543
    0.99919268   2    1000022    6
    0.00045847475   3    1000022    24    5
    0.00022953828   2    1000021    4

DECAY 2000006  150.58584
    0.44451198   2    1000021    6
    0.27661964   2    1000006    25
    0.19003872   2    1000006    23
    0.039436791   2    1000023    6
    0.038211214   2    1000025    6
    0.005667604   2    1000024    5
    0.0042279766   2    1000022    6
    0.001286071   2    1000037    5

DECAY 1000024  3.7908031
    0.61559601   2    1000022    24
    0.2725305   2    1000006   -5
    0.073981054   2    1000016   -15
    0.027194682   3    1000022   -5    6
    0.010076783   2   -1000015    16
    0.00047784959   2   -2000015    16

DECAY 1000037  46.924106
    0.21490291   2   -1000015    16
    0.21478297   2    1000016   -15
    0.10708985   2    1000024    25
    0.098574048   2    1000023    24
    0.092750654   2    1000024    23
    0.092371471   2    1000025    24
    0.034629711   2    1000004   -3
    0.034629609   2    1000002   -1
    0.034553889   2   -1000001    2
    0.03455366   2   -1000003    4
    0.011414869   2    1000006   -5
    0.0059452207   2    1000014   -13
    0.0059451537   2    1000012   -11
    0.0059027271   2   -1000013    14
    0.0059026395   2   -1000011    12
    0.0020675623   3    1000025   -5    6
    0.0018170493   3    1000024    6   -6
    0.0016621894   3    1000023   -5    6
    0.00035077118   2    1000022    24

DECAY 1000022 -1


DECAY 1000023  2.7380932
    0.64251857   2    1000022    25
    0.15405298   2    1000022    23
    0.085862554   3    1000022    6   -6
    0.05157646   2    1000015   -15
    0.05157646   2   -1000015    15
    0.0065052124   2    1000016   -16
    0.0065052124   2   -1000016    16
    0.00033414657   2    2000015   -15
    0.00033414657   2   -2000015    15
    0.00010847024   2    2000004   -4
    0.00010847024   2   -2000004    4

DECAY 1000025  3.8025216
    0.50704495   2    1000022    23
    0.34292215   2    1000022    25
    0.03421853   2    1000006   -6
    0.03421853   2   -1000006    6
    0.030344742   2    1000015   -15
    0.030344742   2   -1000015    15
    0.019927368   3    1000022    6   -6
    0.00026391232   2    2000015   -15
    0.00026391232   2   -2000015    15

DECAY 1000035  50.890602
    0.099219214   2    1000016   -16
    0.099219214   2   -1000016    16
    0.09886282   2    1000015   -15
    0.09886282   2   -1000015    15
    0.098084885   2    1000023    25
    0.089220924   2    1000025    23
    0.089039118   2    1000024   -24
    0.089039118   2   -1000024    24
    0.073273158   2    1000025    25
    0.015967739   2    1000004   -4
    0.015967739   2   -1000004    4
    0.015967705   2    1000002   -2
    0.015967705   2   -1000002    2
    0.015907003   2    1000003   -3
    0.015907003   2   -1000003    3
    0.015906951   2    1000001   -1
    0.015906951   2   -1000001    1
    0.0053816559   2    1000006   -6
    0.0053816559   2   -1000006    6
    0.0027446509   2    1000014   -14
    0.0027446509   2   -1000014    14
    0.0027446198   2    1000012   -12
    0.0027446198   2   -1000012    12
    0.002712541   2    1000013   -13
    0.002712541   2   -1000013    13
    0.0027124968   2    1000011   -11
    0.0027124968   2   -1000011    11
    0.0014753003   3    1000024    5   -6
    0.0014753003   3   -1000024   -5    6
    0.00062779584   2    1000023    23
    0.00058249517   3    1000023    6   -6
    0.00043382731   3    1000025    6   -6
    0.00021348166   2    1000022    25

DECAY 1000021  24.482261
    0.19841549   2    2000003   -3
    0.19841549   2   -2000003    3
    0.19841496   2    2000001   -1
    0.19841496   2   -2000001    1
    0.051454638   2    2000002   -2
    0.051454638   2   -2000002    2
    0.05145402   2    2000004   -4
    0.05145402   2   -2000004    4
    0.00044720868   3    1000022    6   -6

DECAY 25  0.0038058119
    0.58000747   2   -5    5
    0.2208389   2   -24    24
    0.073019027   2    21    21
    0.066710947   2   -15    15
    0.028696996   2   -4    4
    0.026467271   2    23    23
    0.0023501845   2    22    22
    0.0014590336   2    22    23
    0.00023136076   2   -13    13
    0.00021805574   2   -3    3
    6.0290255e-07   2   -1    1
    1.4788383e-07   2   -2    2
    5.2012531e-09   2   -11    11

DECAY 35  9.822594
    0.7725917   2   -5    5
    0.13917013   2   -15    15
    0.087050479   2   -6    6
    0.00047310631   2   -13    13
    0.00036648632   2   -3    3
    0.00019799106   2    25    25
    0.00011860211   2    1000022    1000022
    1.7356726e-05   2    23    23
    5.4471339e-06   2    21    21
    4.0271249e-06   2   -24    24
    1.2546457e-06   2   -4    4
    1.0133991e-06   2   -1    1
    5.9640204e-08   2    22    22
    1.6669101e-08   2   -1000015    1000015
    1.2651908e-08   2    22    23
    1.0624964e-08   2   -11    11
    6.4677451e-12   2   -2    2

DECAY 36  9.5690512
    0.77021099   2   -5    5
    0.13874255   2   -15    15
    0.089933417   2   -6    6
    0.00047165045   2   -13    13
    0.00036536116   2   -3    3
    0.00018476741   2    1000022    1000022
    5.4190603e-05   2    21    21
    3.4598712e-05   2    23    25
    1.2831367e-06   2   -4    4
    1.0102869e-06   2   -1    1
    1.3871908e-07   2    22    22
    3.2723908e-08   2    22    23
    1.0592268e-08   2   -11    11
    6.6147923e-12   2   -2    2
    2.1913305e-35   2    25    25

DECAY 37  9.2233585
    0.86041902   2   -5    6
    0.13740106   2   -15    16
    0.0011423448   2   -5    4
    0.00048576169   2   -13    14
    0.00035411236   2   -3    4
    0.00012902163   2   -3    6
    3.5944164e-05   2    24    25
    1.6570865e-05   2   -3    2
    8.1575069e-06   2   -5    2
    5.8934449e-06   2   -1    6
    1.0211893e-06   2   -1000015    1000016
    9.7965173e-07   2   -1    2
    9.960315e-08   2   -1    4
    1.1362016e-08   2   -11    12
    3.6758465e-13   2    24    35
    3.1339558e-13   2    24    36

DECAY 6  2.43
    1   2    5    24

DECAY 15 -1
