BLOCK SPINFO
   1   SPheno
   2   v4.0.5be

BLOCK SPHENOINFO
   1   2
   2   2

BLOCK MODSEL
   1   0

BLOCK MINPAR
   3    11.230959
   4   -1

BLOCK EXTPAR
   0    1506.9216
   1   -20.276272
   2   -806.95451
   3    3000
   11    3973.1244
   12    1497.7048
   13   -1985.9754
   23   -1388.459
   25    10.765034
   26    4994.7102
   31    1076.726
   32    1076.726
   33    1567.3038
   34    1515.9892
   35    1515.9892
   36    1602.2736
   41    5000
   42    5000
   43    1599.7009
   44    5000
   45    5000
   46    1542.3983
   47    5000
   48    5000
   49    1319.3064

BLOCK SMINPUTS
   1    127.90897
   2    1.1663787e-05
   3    0.1184
   4    91.1876
   5    4.18
   6    173.2
   7    1.777
   8    0
   11    0.00051099893
   12    0
   13    0.10565837
   14    0
   21    0.005
   22    0.0025
   23    0.095
   24    1.27

BLOCK GAUGE Q=  1506.9216
   1    0.35536298
   2    0.66519887
   3    1.219778

BLOCK YU Q=  1506.9216
   1   1    8.4204695e-06
   2   2    0.0042775985
   3   3    1.0172603

BLOCK YD Q=  1506.9216
   1   1    0.00018215117
   2   2    0.0034608722
   3   3    0.18063688

BLOCK YE Q=  1506.9216
   1   1    3.1786711e-05
   2   2    0.0065724837
   3   3    0.11053836

BLOCK AU Q=  1506.9216
   1   1    0
   2   2    0
   3   3    3973.1244

BLOCK AD Q=  1506.9216
   1   1    0
   2   2    0
   3   3    1497.7048

BLOCK AE Q=  1506.9216
   1   1    0
   2   2    0
   3   3   -1985.9754

BLOCK MSOFT Q=  1506.9216
   1   -20.276272
   2   -806.95451
   3    3000
   21    22725768
   22   -1635879.1
   31    1076.726
   32    1076.726
   33    1567.3038
   34    1515.9892
   35    1515.9892
   36    1602.2736
   41    5000
   42    5000
   43    1599.7009
   44    5000
   45    5000
   46    1542.3983
   47    5000
   48    5000
   49    1319.3064

BLOCK MASS
   6    173.2
   23    91.1876
   24    80.429995
   15    1.777
   25    124.05234
   35    4994.0865
   36    4994.7102
   37    4994.8967
   1000001    5029.6345
   2000001    5019.059
   1000002    5029.2127
   2000002    5023.6789
   1000003    5029.6358
   2000003    5019.0595
   1000004    5029.2136
   2000004    5023.6797
   1000005    1336.1638
   2000005    1574.4395
   1000006    1321.5785
   2000006    1718.2578
   1000011    1090.9628
   2000011    1508.7162
   1000012    1087.8132
   1000013    1090.9656
   2000013    1508.7218
   1000014    1087.8172
   1000015    1575.6161
   2000015    1599.7095
   1000016    1575.8452
   1000021    3190.4113
   1000022   -19.496091
   1000023   -841.63383
   1000025    1395.0981
   1000035   -1399.454
   1000024    841.77899
   1000037    1401.131

BLOCK ALPHA
      -0.088905186

BLOCK HMIX Q=  1506.9216
   1   -1388.459
   2    10.765034
   3    243.97556
   4    24947130

BLOCK STOPMIX
   1   1   -0.62706686
   1   2    0.77896544
   2   1   -0.77896544
   2   2   -0.62706686

BLOCK SBOTMIX
   1   1   -0.061395819
   1   2    0.9981135
   2   1   -0.9981135
   2   2   -0.061395819

BLOCK STAUMIX
   1   1   -0.94689659
   1   2    0.32153825
   2   1   -0.32153825
   2   2   -0.94689659

BLOCK NMIX
   1   1    0.99947986
   1   2   -0.00070713539
   1   3   -0.032032102
   1   4    0.0036689939
   2   1   -0.0038875063
   2   2   -0.99386622
   2   3   -0.092416507
   2   4    0.060613682
   3   1    0.020018208
   3   2   -0.022596327
   3   3    0.70614494
   3   4    0.7074235
   4   1   -0.02498351
   4   2    0.10825363
   4   3   -0.70127916
   4   4    0.70417648

BLOCK UMIX
   1   1   -0.99129483
   1   2   -0.13166078
   2   1   -0.13166078
   2   2    0.99129483

BLOCK VMIX
   1   1    0.99621859
   1   2    0.086882214
   2   1    0.086882214
   2   2   -0.99621859

BLOCK HIGGSBOUNDSINPUTHIGGSCOUPLINGSFERMIONS
       0, 115.88596,3,36,15,15

BLOCK HIGGSBOUNDSINPUTHIGGSCOUPLINGSBOSONS
       0,4,36,21,21,23

BLOCK SPHENOLOWENERGY
   1    0.00031257458
   2    1.5914631e-06
   3    3.525247e-05
   4    2.3435578e-15
   5    1.0011413e-10
   6    2.0957503e-08
   7    7.9254908e-14
   8    3.385767e-09
   9    7.1813717e-07
   10    9.6784361e-05
   11    0.99974539
   12    0.54241771
   13    19.38096
   14    0
   15    0
   16    0.0021588595
   17    2.2816738e-15
   18    2.4795023e-11
   19    8.2893698e-11
   20    2.2192319e-15
   21    9.4879868e-11
   22    1.9841992e-08
   23    0
   24    0
   25    0
   26    0
   27    0
   28    0
   29    0
   30    0
   31    0
   39   -1.9632148e-05
   40    0
   41    0
   42    0

BLOCK FWCOEF Q=  160
   305   4422   0   0   -0.18881911
   305   4422   0   2   -0.17946255
   305   4322   0   2    2.6456994e-05
   305   6421   0   0   -0.095227835
   305   6421   0   2   -0.091839169
   305   6321   0   2   -2.9325269e-05
   3051111   4133   0   0    1.5919087
   3051111   4133   0   2    1.5927148
   3051111   4233   0   2    1.89449e-05
   3051111   4137   0   0   -4.4146008
   3051111   4137   0   2   -4.4128668
   3051111   4237   0   2   -0.0001467065
   3051313   4133   0   0    1.5919087
   3051313   4133   0   2    1.5927144
   3051313   4233   0   2    1.8944895e-05
   3051313   4137   0   0   -4.4146008
   3051313   4137   0   2   -4.4128671
   3051313   4237   0   2   -0.00014670651
   3051212   4137   0   0    1.5053501
   3051212   4137   0   2    1.504987
   3051212   4237   0   2    3.1960956e-05
   3051414   4137   0   0    1.5053501
   3051414   4137   0   2    1.504987
   3051414   4237   0   2    3.1960956e-05
   3051616   4137   0   0    1.5053501
   3051616   4137   0   2    1.5049869
   3051616   4237   0   2    3.196177e-05

BLOCK IMFWCOEF Q=  160
   305   4422   0   0    3.8586046e-07
   305   4422   0   2    3.8156301e-06
   305   4322   0   2    1.3813989e-06
   305   6421   0   0    3.30515e-07
   305   6421   0   2    6.0162975e-06
   305   6321   0   2    7.2745682e-07
   3051111   4133   0   2   -5.5937465e-07
   3051111   4233   0   2    3.6163231e-07
   3051111   4137   0   2    4.4873538e-06
   3051111   4237   0   2   -2.8016322e-06
   3051313   4133   0   2   -5.5938361e-07
   3051313   4233   0   2    3.6163223e-07
   3051313   4137   0   2    4.4873588e-06
   3051313   4237   0   2   -2.8016324e-06
   3051212   4137   0   2   -7.2412654e-07
   3051212   4237   0   2    6.1036915e-07
   3051414   4137   0   2   -7.2412649e-07
   3051414   4237   0   2    6.1036915e-07
   3051616   4137   0   2   -7.2714309e-07
   3051616   4237   0   2    6.1038336e-07

DECAY 23  2.4952


DECAY 24  2.085


DECAY 1000011  3.6904178
    0.4187172   2   -1000024    12
    0.36974174   2    1000022    11
    0.21154106   2    1000023    11

DECAY 2000011  7.5705452
    0.99997221   2    1000022    11

DECAY 1000013  3.6904658
    0.41871924   2   -1000024    14
    0.36973814   2    1000022    13
    0.21154262   2    1000023    13

DECAY 2000013  7.5708882
    0.99993076   2    1000022    13

DECAY 1000015  12.152854
    0.52118807   2   -1000024    16
    0.2631937   2    1000023    15
    0.21412492   2    1000022    15
    0.00065143658   2    1000025    15
    0.00058501707   2    1000035    15
    0.00025685091   2   -1000037    16

DECAY 2000015  8.430995
    0.87622273   2    1000022    15
    0.077570615   2   -1000024    16
    0.039281831   2    1000023    15
    0.003561926   2   -1000037    16
    0.0018717832   2    1000035    15
    0.0014908605   2    1000025    15

DECAY 1000012  3.6563037
    0.41836882   2    1000024    11
    0.37408922   2    1000022    12
    0.20754197   2    1000023    12

DECAY 1000014  3.6563675
    0.41837236   2    1000024    13
    0.37408405   2    1000022    14
    0.20754359   2    1000023    14

DECAY 1000016  12.528197
    0.56148265   2    1000024    15
    0.27821497   2    1000023    16
    0.15821009   2    1000022    16
    0.0016979549   2    1000037    15
    0.00036564393   2    1000035    16

DECAY 2000001  143.49829
    0.98047646   2    1000021    1
    0.019506194   2    1000022    1

DECAY 1000001  205.14599
    0.69120278   2    1000021    1
    0.20037117   2   -1000024    2
    0.10056777   2    1000023    1
    0.0034455185   2    1000022    1
    0.0031831282   2   -1000037    2
    0.0011666912   2    1000035    1

DECAY 2000003  143.50037
    0.98046258   2    1000021    3
    0.019505922   2    1000022    3

DECAY 1000003  205.14871
    0.69119423   2    1000021    3
    0.20036858   2   -1000024    4
    0.10056652   2    1000023    3
    0.0034454796   2    1000022    3
    0.0031906749   2   -1000037    4
    0.0011691118   2    1000035    3

DECAY 1000005  0.80303417
    0.93196402   2    1000022    5
    0.043266005   2   -1000024    6
    0.02476997   2    1000023    5

DECAY 2000005  33.141731
    0.68874885   2    1000006   -24
    0.19268156   2   -1000024    6
    0.1045253   2    1000023    5
    0.0066120618   2    1000022    5
    0.0033094501   2    1000005    25
    0.0025942235   2    1000005    23
    0.00080682459   2    1000035    5
    0.00072172834   2    1000025    5

DECAY 2000002  152.39417
    0.92639695   2    1000021    2
    0.073537777   2    1000022    2

DECAY 1000002  205.14089
    0.69100589   2    1000021    2
    0.20235271   2    1000024    1
    0.10084144   2    1000023    2
    0.0033909934   2    1000022    2
    0.0013860199   2    1000037    1
    0.00098965198   2    1000035    2

DECAY 2000004  152.3973
    0.92637803   2    1000021    4
    0.073536266   2    1000022    4

DECAY 1000004  205.1435
    0.69099722   2    1000021    4
    0.20235026   2    1000024    3
    0.1008402   2    1000023    4
    0.0033909504   2    1000022    4
    0.0013908774   2    1000037    3
    0.00099338521   2    1000035    4

DECAY 1000006  5.0544325
    0.43126988   2    1000024    5
    0.35960167   2    1000022    6
    0.20803584   2    1000023    6
    0.00064222138   2    1000023    4
    0.00039220144   3    1000022    24    5

DECAY 2000006  44.505263
    0.5802835   2    1000006    23
    0.11011891   2    2000005    24
    0.094320685   2    1000024    5
    0.048248573   2    1000023    6
    0.041804491   2    1000037    5
    0.040487843   2    1000006    25
    0.03571543   2    1000022    6
    0.019692319   2    1000035    6
    0.019101758   2    1000025    6
    0.010226489   2    1000005    24

DECAY 1000024  0.0062865458
    0.93039336   2    1000022    24
    0.024944187   3    1000022   -11    12
    0.024943833   3    1000022   -13    14
    0.015805352   3    1000022   -5    6
    0.0038935558   3    1000022   -15    16

DECAY 1000037  10.279379
    0.30598313   2    1000023    24
    0.28135179   2    1000024    23
    0.27894054   2    1000024    25
    0.092135939   2    1000022    24
    0.029127019   2    1000006   -5
    0.0027248867   3    1000022   -5    6
    0.0026628222   3    1000023   -5    6
    0.0023813714   3    1000024    6   -6
    0.0016122639   2   -1000011    12
    0.0016122382   2   -1000013    14
    0.00072360309   2    1000014   -13
    0.00071459886   2    1000012   -11

DECAY 1000022 -1


DECAY 1000023  0.0053549091
    0.64435274   2    1000022    25
    0.28380089   2    1000022    23
    0.034055726   3    1000022    12   -12
    0.015580068   3    1000022    11   -11
    0.015579945   3    1000022    13   -13
    0.0031085497   3    1000022    6   -6
    0.0024818061   3    1000022    15   -15
    0.00089167136   3    1000022    5   -5
    0.00012327676   2    1000022    22

DECAY 1000025  11.687849
    0.24669709   2    1000023    23
    0.24638681   2    1000024   -24
    0.24638681   2   -1000024    24
    0.17009157   2    1000023    25
    0.050234939   2    1000022    23
    0.031352715   2    1000022    25
    0.0030696011   3    1000024    5   -6
    0.0030696011   3   -1000024   -5    6
    0.0013263723   3    1000022    6   -6
    0.00038778394   2    1000005   -5
    0.00038778394   2   -1000005    5
    0.00036387045   3    1000023    6   -6

DECAY 1000035  9.8023019
    0.30128691   2    1000024   -24
    0.30128691   2   -1000024    24
    0.28005931   2    1000023    25
    0.052799921   2    1000022    25
    0.03758264   2    1000022    23
    0.012557122   2    1000023    23
    0.0032557216   3    1000024    5   -6
    0.0032557216   3   -1000024   -5    6
    0.0015986591   3    1000022    6   -6
    0.00072776682   2    1000012   -12
    0.00072776682   2   -1000012    12
    0.00072775068   2    1000014   -14
    0.00072775068   2   -1000014    14
    0.00062975919   3    1000023    6   -6
    0.00050263441   2    1000005   -5
    0.00050263441   2   -1000005    5
    0.00044017666   2    1000013   -13
    0.00044017666   2   -1000013    13
    0.00043550659   2    1000011   -11
    0.00043550659   2   -1000011    11

DECAY 1000021  232.17523
    0.15713822   2    1000006   -6
    0.15713822   2   -1000006    6
    0.13834052   2    1000005   -5
    0.13834052   2   -1000005    5
    0.11632872   2    2000005   -5
    0.11632872   2   -2000005    5
    0.086951826   2    2000006   -6
    0.086951826   2   -2000006    6
    0.00069693414   3    1000025    6   -6
    0.00061419551   3    1000035    6   -6
    0.00028593343   3    1000037    5   -6
    0.00028593343   3   -1000037   -5    6
    0.00022283187   2    1000006   -4
    0.00022283187   2   -1000006    4

DECAY 25  0.0037538366
    0.58628444   2   -5    5
    0.21352147   2   -24    24
    0.071794997   2    21    21
    0.067419391   2   -15    15
    0.029058712   2   -4    4
    0.025362998   2    23    23
    0.0023615042   2    22    22
    0.0023187528   2    1000022    1000022
    0.0014227643   2    22    23
    0.0002338343   2   -13    13
    0.00022037094   2   -3    3
    6.0930293e-07   2   -1    1
    1.497493e-07   2   -2    2
    5.2568668e-09   2   -11    11

DECAY 35  77.729227
    0.21013444   2   -1000024    1000037
    0.21013444   2   -1000037    1000024
    0.13275295   2    1000023    1000025
    0.12175186   2   -5    5
    0.072993593   2    1000023    1000035
    0.059390306   2   -1000006    1000006
    0.055522729   2   -2000006    2000006
    0.037631568   2    1000022    1000025
    0.025369882   2    1000022    1000035
    0.023905137   2   -6    6
    0.01645414   2   -15    15
    0.0063855637   2   -1000024    1000024
    0.0040611957   2   -2000006    1000006
    0.0040611957   2   -1000006    2000006
    0.0031649601   2    1000023    1000023
    0.0031489193   2   -2000005    1000005
    0.0031489193   2   -1000005    2000005
    0.002706063   2    1000025    1000035
    0.0016644579   2    1000035    1000035
    0.0014307309   2    1000022    1000023
    0.0014123359   2   -1000037    1000037
    0.00093889365   2   -2000015    1000015
    0.00093889365   2   -1000015    2000015
    0.00020430882   2    1000025    1000025
    0.00019112256   2   -2000015    2000015
    0.00016585786   2   -1000015    1000015
    0.00014089026   2    1000022    1000022
    5.8144738e-05   2   -1000005    1000005
    5.7491103e-05   2   -13    13
    3.2948465e-05   2   -3    3
    3.2201026e-05   2   -2000005    2000005
    2.7140639e-06   2    25    25
    2.277122e-06   2    21    21
    1.8870623e-06   2    23    23
    4.8833504e-07   2   -1000011    1000011
    4.8752483e-07   2   -1000013    1000013
    3.1251971e-07   2   -24    24
    2.8891452e-07   2   -4    4
    2.784198e-07   2   -2000013    2000013
    2.7827151e-07   2   -2000011    2000011
    9.6722826e-08   2    22    23
    9.1085856e-08   2   -1    1
    7.6360199e-08   2    22    22
    1.5023601e-08   2   -2000013    1000013
    1.5023601e-08   2   -1000013    2000013
    1.2910308e-09   2   -11    11
    1.4890129e-12   2   -2    2
    3.5140652e-13   2   -2000011    1000011
    3.5140652e-13   2   -1000011    2000011

DECAY 36  77.130889
    0.2094046   2   -1000024    1000037
    0.2094046   2   -1000037    1000024
    0.12904456   2    1000023    1000035
    0.11734345   2   -5    5
    0.076404649   2    1000023    1000025
    0.062523196   2   -2000006    1000006
    0.062523196   2   -1000006    2000006
    0.036906368   2    1000022    1000035
    0.026363499   2    1000022    1000025
    0.021255781   2   -6    6
    0.015859086   2   -15    15
    0.008987377   2   -1000024    1000024
    0.0044590727   2    1000023    1000023
    0.003656913   2   -1000037    1000037
    0.0034935101   2    1000035    1000035
    0.0032177792   2   -2000005    1000005
    0.0032177792   2   -1000005    2000005
    0.0016841226   2    1000022    1000023
    0.0015427904   2    1000025    1000035
    0.0011257174   2   -2000015    1000015
    0.0011257174   2   -1000015    2000015
    0.00020866669   2    1000025    1000025
    0.00014733934   2    1000022    1000022
    5.541218e-05   2   -13    13
    3.1755646e-05   2   -3    3
    7.2451234e-06   2    21    21
    5.2636912e-06   2    23    25
    2.5463897e-07   2   -4    4
    1.0324789e-07   2    22    23
    8.7788409e-08   2   -1    1
    7.8292561e-08   2    22    22
    1.5057891e-08   2   -2000013    1000013
    1.5057891e-08   2   -1000013    2000013
    1.2443191e-09   2   -11    11
    1.3123786e-12   2   -2    2
    3.5220562e-13   2   -2000011    1000011
    3.5220562e-13   2   -1000011    2000011
    2.0583786e-36   2    25    25

DECAY 37  74.107947
    0.22618686   2    1000023    1000037
    0.22238865   2    1000024    1000035
    0.22116788   2    1000024    1000025
    0.15112726   2   -5    6
    0.064586936   2    1000022    1000037
    0.056756883   2   -2000005    1000006
    0.024669286   2   -2000005    2000006
    0.017001641   2   -15    16
    0.0066288768   2   -1000005    2000006
    0.0032424975   2    1000022    1000024
    0.0025984397   2    1000025    1000037
    0.0022697563   2   -2000015    1000016
    0.00072555191   2   -1000005    1000006
    0.00024377012   2    1000035    1000037
    0.00019477805   2   -5    4
    7.5917075e-05   2   -1000015    1000016
    6.0106842e-05   2   -13    14
    3.2428687e-05   2   -3    4
    2.8561164e-05   2   -3    6
    5.4802414e-06   2    24    25
    2.0122485e-06   2   -1000011    1000012
    2.0110543e-06   2   -1000013    1000014
    1.5154521e-06   2   -3    2
    1.3909132e-06   2   -5    2
    1.3077395e-06   2   -1    6
    8.9259409e-08   2   -1    2
    6.6410593e-08   2    1000023    1000024
    3.2065143e-08   2   -2000013    1000014
    1.6094088e-08   2   -1    4
    1.4059053e-09   2   -11    12
    7.5001057e-13   2   -2000011    1000012

DECAY 6  2.43
    1   2    5    24

DECAY 15 -1
