BLOCK DCINFO
   1   SDECAY/HDECAY
   2   1.3b /3.4

BLOCK SPINFO
   1   SOFTSUSY
   2   3.4.0

BLOCK MODSEL
   1   0

BLOCK SMINPUTS
   1    127.90897
   2    1.1663787e-05
   3    0.1184
   4    91.1876
   5    4.18
   6    173.2
   7    1.777

BLOCK MINPAR
   3    16.09

BLOCK EXTPAR
   0   -1
   1    580.27
   2    1920.42
   3    1874.74
   11   -2718.37
   12    932.1
   13   -3447.35
   23    1363.46
   26    2305.86
   31    1308.88
   32    1308.88
   33    3722.7
   34    677.51
   35    677.51
   36    2787.01
   41    3158.64
   42    3158.64
   43    525.26
   44    2788.62
   45    2788.62
   46    2678.77
   47    3173.74
   48    3173.74
   49    2455.28

BLOCK MASS
   24    80.393934
   25    125.59267
   35    2305.8916
   36    2305.86
   37    2307.3657
   5    4.8187603
   1000001    3179.6196
   2000001    3191.6132
   1000002    3178.771
   2000002    2809.6306
   1000003    3179.6196
   2000003    3191.6132
   1000004    3178.771
   2000004    2809.6306
   1000005    620.88263
   2000005    2479.0108
   1000006    613.53993
   2000006    2694.4268
   1000011    1318.043
   2000011    678.80029
   1000012    1315.3632
   1000013    1318.043
   2000013    678.80029
   1000014    1315.3632
   1000015    2791.0089
   2000015    3727.2976
   1000016    3726.086
   1000021    2017.6665
   1000022    580.98614
   1000023    1376.3597
   1000025   -1383.3257
   1000035    1948.3877
   1000024    1376.3634
   1000037    1948.5535

BLOCK NMIX
   1   1    0.99904727
   1   2   -0.0013969724
   1   3    0.039293411
   1   4   -0.018937343
   2   1   -0.041113594
   2   2   -0.1087364
   2   3    0.70360824
   2   4   -0.70101464
   3   1   -0.014354228
   3   2    0.016232868
   3   3    0.70647174
   3   4    0.70740946
   4   1   -0.0028592278
   4   2    0.99393709
   4   3    0.065491728
   4   4   -0.088270726

BLOCK UMIX
   1   1   -0.091218479
   1   2    0.9958309
   2   1   -0.9958309
   2   2   -0.091218479

BLOCK VMIX
   1   1   -0.12303264
   1   2    0.99240262
   2   1   -0.99240262
   2   2   -0.12303264

BLOCK STOPMIX
   1   1    0.99823564
   1   2    0.059376856
   2   1   -0.059376856
   2   2    0.99823564

BLOCK SBOTMIX
   1   1    0.99996747
   1   2    0.0080661603
   2   1   -0.0080661603
   2   2    0.99996747

BLOCK STAUMIX
   1   1    0.00733386
   1   2    0.99997311
   2   1   -0.99997311
   2   2    0.00733386

BLOCK ALPHA
      -0.064442913

BLOCK HMIX Q=  1181.962
   1    1376.9888
   2    15.54995
   3    244.26525
   4    5751512.3

BLOCK GAUGE Q=  1181.962
   1    0.362006
   2    0.63577665
   3    1.038446

BLOCK AU Q=  1181.962
   1   1    0
   2   2    0
   3   3   -2718.37

BLOCK AD Q=  1181.962
   1   1    0
   2   2    0
   3   3    932.1

BLOCK AE Q=  1181.962
   1   1    0
   2   2    0
   3   3   -3447.35

BLOCK YU Q=  1181.962
   1   1    0
   2   2    0
   3   3    0.83995212

BLOCK YD Q=  1181.962
   1   1    0
   2   2    0
   3   3    0.20963333

BLOCK YE Q=  1181.962
   1   1    0
   2   2    0
   3   3    0.16144953

BLOCK MSOFT Q=  1181.962
   1    580.27
   2    1920.42
   3    1874.74
   21    3354833.5
   22   -2006389.1
   31    1308.88
   32    1308.88
   33    3722.7
   34    677.51
   35    677.51
   36    2787.01
   41    3158.64
   42    3158.64
   43    525.25999
   44    2788.62
   45    2788.62
   46    2678.77
   47    3173.74
   48    3173.74
   49    2455.28

BLOCK HIGGSBOUNDSINPUTHIGGSCOUPLINGSFERMIONS
       0, 241.80094,3,36,15,15

BLOCK HIGGSBOUNDSINPUTHIGGSCOUPLINGSBOSONS
       0,4,36,21,21,23

DECAY 6  1.4233965
    1   2    5    24

DECAY 1000021  67.621124
    0.25213989   2    1000005   -5
    0.25213989   2   -1000005    5
    0.24786011   2    1000006   -6
    0.24786011   2   -1000006    6

DECAY 1000006  2.3772263e-09
    0.99088257   2    1000022    4
    0.007639404   2    1000022    2
    0.00050180329   4    2   -1    1000022    5
    0.00047946634   4    4   -3    1000022    5
    0.00017024462   4   -11    12    1000022    5
    0.00016994596   4   -13    14    1000022    5
    0.00015656482   4   -15    16    1000022    5

DECAY 2000006  147.79551
    0.24567296   2    1000005    24
    0.18752233   2    1000021    6
    0.13567927   2    1000024    5
    0.12885667   2    1000006    25
    0.12638198   2    1000006    23
    0.068163954   2    1000023    6
    0.067613288   2    1000025    6
    0.037654194   2    1000022    6
    0.0016321467   2    1000037    5
    0.00082315878   2    1000035    6
    5.4535225e-08   2    2000005    24

DECAY 1000005  0.0013812519
    1   2    1000022    5

DECAY 2000005  20.534124
    0.78685454   2    1000021    5
    0.062416336   2    1000022    5
    0.049249928   2   -1000024    6
    0.025012894   2    1000025    5
    0.024964097   2    1000023    5
    0.024661281   2    1000006   -24
    0.013877549   2    1000005    25
    0.012661645   2    1000005    23
    0.00019607946   2   -1000037    6
    0.00010565052   2    1000035    5

DECAY 1000002  94.760985
    0.84138426   2    1000021    2
    0.10029672   2    1000037    1
    0.050258818   2    1000035    2
    0.0042824708   2    1000022    2
    0.0025970599   2    1000024    1
    0.0011650908   2    1000023    2
    1.5581493e-05   2    1000025    2

DECAY 2000002  52.058277
    0.89049026   2    1000021    2
    0.10937775   2    1000022    2
    0.00011748528   2    1000023    2
    1.4230393e-05   2    1000025    2
    2.6769169e-07   2    1000035    2

DECAY 1000001  94.804307
    0.84183023   2    1000021    1
    0.10103621   2   -1000037    2
    0.0503913   2    1000035    1
    0.0044099061   2    1000022    1
    0.001427686   2   -1000024    2
    0.00087398868   2    1000023    1
    3.0688432e-05   2    1000025    1

DECAY 2000001  82.57985
    0.9799296   2    1000021    1
    0.020043233   2    1000022    1
    2.4163442e-05   2    1000023    1
    2.9319157e-06   2    1000025    1
    6.9787582e-08   2    1000035    1

DECAY 1000004  80.360813
    0.80685975   2    1000021    4
    0.12207829   2    1000037    3
    0.061173663   2    1000035    4
    0.005264317   2    1000022    4
    0.003178823   2    1000024    3
    0.0014260798   2    1000023    4
    1.9070975e-05   2    1000025    4

DECAY 2000004  43.661645
    0.86344964   2    1000021    4
    0.13638679   2    1000022    4
    0.00014560791   2    1000023    4
    1.7635435e-05   2    1000025    4
    3.2851985e-07   2    1000035    4

DECAY 1000003  80.387762
    0.80738688   2    1000021    3
    0.12299367   2   -1000037    4
    0.061342679   2    1000035    3
    0.0054215971   2    1000022    3
    0.001747706   2   -1000024    4
    0.0010698963   2    1000023    3
    3.7565603e-05   2    1000025    3

DECAY 2000003  67.537028
    0.97441972   2    1000021    3
    0.025545805   2    1000022    3
    3.0666834e-05   2    1000023    3
    3.7208459e-06   2    1000025    3
    8.8084636e-08   2    1000035    3

DECAY 1000011  1.1077572
    1   2    1000022    11

DECAY 2000011  0.25265909
    1   2    1000022    11

DECAY 1000013  1.1077572
    1   2    1000022    13

DECAY 2000013  0.25265891
    1   2    1000022    13

DECAY 1000015  14.963848
    0.88856773   2    1000022    15
    0.055225448   2   -1000024    16
    0.028511696   2    1000023    15
    0.027542099   2    1000025    15
    9.9128465e-05   2   -1000037    16
    5.3902503e-05   2    1000035    15

DECAY 2000015  30.052699
    0.52246661   2   -1000037    16
    0.25957791   2    1000035    15
    0.15293097   2    1000022    15
    0.030116323   2    1000023    15
    0.023923008   2    1000025    15
    0.0059404365   2   -1000024    16
    0.0025659669   2    1000015    25
    0.0024787766   2    1000015    23

DECAY 1000012  1.1142228
    1   2    1000022    12

DECAY 1000014  1.1142228
    1   2    1000022    14

DECAY 1000016  30.061392
    0.5184527   2    1000037    15
    0.26076435   2    1000035    16
    0.15427647   2    1000022    16
    0.058765679   2    1000024    15
    0.0048142915   2   -1000015   -24
    0.002705842   2    1000023    16
    0.00022066528   2    1000025    16

DECAY 1000024  21.229792
    0.88512923   2   -1000005    6
    0.074739116   2    1000006   -5
    0.040042522   2    1000022    24
    2.9643517e-05   2    1000012   -11
    2.9643517e-05   2    1000014   -13
    1.4924406e-05   2   -1000011    12
    1.4924406e-05   2   -1000013    14

DECAY 1000037  58.6508
    0.31316941   2    1000006   -5
    0.30799546   2   -1000005    6
    0.059128244   2    1000023    24
    0.056759557   2    1000024    23
    0.054684809   2    1000025    24
    0.052264194   2    1000024    25
    0.038980301   2   -1000011    12
    0.038980301   2   -1000013    14
    0.038978115   2    1000012   -11
    0.038978115   2    1000014   -13
    8.1498511e-05   2    1000022    24

DECAY 1000022 -1


DECAY 1000023  22.207073
    0.45076948   2    1000006   -6
    0.45076948   2   -1000006    6
    0.036983933   2    1000022    25
    0.028192531   2    1000005   -5
    0.028192531   2   -1000005    5
    0.0043792173   2    1000022    23
    0.00015642245   2    2000011   -11
    0.00015642245   2   -2000011    11
    0.00015642245   2    2000013   -13
    0.00015642245   2   -2000013    13
    1.4969673e-05   2    1000011   -11
    1.4969673e-05   2   -1000011    11
    1.4969673e-05   2    1000013   -13
    1.4969673e-05   2   -1000013    13
    6.814482e-06   2    1000012   -12
    6.814482e-06   2   -1000012    12
    6.814482e-06   2    1000014   -14
    6.814482e-06   2   -1000014    14

DECAY 1000025  19.920032
    0.44843446   2    1000006   -6
    0.44843446   2   -1000006    6
    0.039610047   2    1000022    23
    0.029070832   2    1000005   -5
    0.029070832   2   -1000005    5
    0.0052899894   2    1000022    25
    2.1502139e-05   2    2000011   -11
    2.1502139e-05   2   -2000011    11
    2.1502139e-05   2    2000013   -13
    2.1502139e-05   2   -2000013    13
    7.6393302e-07   2    1000012   -12
    7.6393302e-07   2   -1000012    12
    7.6393302e-07   2    1000014   -14
    7.6393302e-07   2   -1000014    14
    7.7022238e-08   2    1000011   -11
    7.7022238e-08   2   -1000011    11
    7.7022238e-08   2    1000013   -13
    7.7022238e-08   2   -1000013    13

DECAY 1000035  58.32246
    0.16085737   2    1000005   -5
    0.16085737   2   -1000005    5
    0.15140615   2    1000006   -6
    0.15140615   2   -1000006    6
    0.056317365   2    1000025    23
    0.054283797   2    1000024   -24
    0.054283797   2   -1000024    24
    0.051342691   2    1000023    25
    0.019716588   2    1000012   -12
    0.019716588   2   -1000012    12
    0.019716588   2    1000014   -14
    0.019716588   2   -1000014    14
    0.019454245   2    1000011   -11
    0.019454245   2   -1000011    11
    0.019454245   2    1000013   -13
    0.019454245   2   -1000013    13
    0.0013204266   2    1000023    23
    0.0011140194   2    1000025    25
    0.00010024941   2    1000022    25
    2.5087714e-05   2    1000022    23
    5.4967343e-07   2    2000011   -11
    5.4967343e-07   2   -2000011    11
    5.4967343e-07   2    2000013   -13
    5.4967343e-07   2   -2000013    13

DECAY 25  0.0044272291
    0.61592591   2    5   -5
    0.20231769   2    24   -24
    0.073369029   2    21    21
    0.059124208   2   -15    15
    0.025506822   2    23    23
    0.019664034   2    4   -4
    0.0021675232   2    22    22
    0.0014873658   2    22    23
    0.00022816865   2    3   -3
    0.00020924753   2   -13    13

DECAY 35  8.7076544
    0.7046059   2    5   -5
    0.12969653   2   -15    15
    0.078163033   2    1000022    1000025
    0.045716183   2    6   -6
    0.020621133   2    1000006   -1000006
    0.019693722   2    1000022    1000023
    0.00060078766   2    1000022    1000022
    0.00044069386   2   -13    13
    0.00027836587   2    3   -3
    0.00010662345   2    25    25
    3.3771984e-05   2    21    21
    2.2319918e-05   2    24   -24
    1.1125237e-05   2    23    23
    3.1412982e-06   2    1000005   -1000005
    2.9838385e-06   2    2000011   -2000011
    2.9838385e-06   2    2000013   -2000013
    4.6893136e-07   2    4   -4
    2.133242e-07   2    22    22
    2.6564558e-08   2    23    22

DECAY 36  8.5448436
    0.71813938   2    5   -5
    0.13217006   2   -15    15
    0.081719374   2    1000022    1000023
    0.046979634   2    6   -6
    0.019180043   2    1000022    1000025
    0.00092917565   2    1000022    1000022
    0.00044909783   2   -13    13
    0.0002837576   2    3   -3
    0.00012579913   2    21    21
    2.2984984e-05   2    23    25
    4.7894929e-07   2    4   -4
    1.134289e-07   2    23    22
    1.0855845e-07   2    22    22

DECAY 37  7.8586369
    0.72488054   2    6   -5
    0.14380483   2   -15    16
    0.11018246   2    1000024    1000022
    0.019150223   2    1000006   -1000005
    0.0011373691   2    4   -5
    0.00048863138   2   -13    14
    0.00030408362   2    4   -3
    2.5067862e-05   2    24    25
    1.5423658e-05   2    2   -3
    1.1373661e-05   2    2   -5
    1.295304e-12   2    24    36

DECAY 5 -1


DECAY 15 -1


DECAY 23  2.4952


DECAY 24  2.085
