BLOCK DCINFO
   1   SDECAY/HDECAY
   2   1.3b /3.4

BLOCK SPINFO
   1   SOFTSUSY
   2   3.4.0

BLOCK MODSEL
   1   0

BLOCK SMINPUTS
   1    127.90897
   2    1.1663787e-05
   3    0.1184
   4    91.1876
   5    4.18
   6    173.2
   7    1.777

BLOCK MINPAR
   3    25.52

BLOCK EXTPAR
   0   -1
   1    2533.83
   2   -1942.29
   3    2825.98
   11    2521.45
   12    3328.03
   13   -3028.51
   23    315.82
   26    2683.04
   31    3456.1
   32    3456.1
   33    2983.77
   34    3573.38
   35    3573.38
   36    1132.53
   41    3715.01
   42    3715.01
   43    2395.06
   44    2996.58
   45    2996.58
   46    1975.69
   47    3222.1
   48    3222.1
   49    701.47

BLOCK MASS
   24    80.403593
   25    124.18357
   35    2683.0498
   36    2683.04
   37    2684.6206
   5    4.8187603
   1000001    3772.4779
   2000001    3284.3043
   1000002    3771.7798
   2000002    3064.2565
   1000003    3772.4779
   2000003    3284.3043
   1000004    3771.7798
   2000004    3064.2565
   1000005    818.44461
   2000005    2456.4718
   1000006    2004.5277
   2000006    2472.3068
   1000011    3464.315
   2000011    3580.3592
   1000012    3463.0728
   1000013    3464.315
   2000013    3580.3592
   1000014    3463.0728
   1000015    1148.4624
   2000015    2991.5297
   1000016    2990.1388
   1000021    2969.4471
   1000022   -327.95529
   1000023    330.57106
   1000025   -1997.52
   1000035    2522.0021
   1000024    329.53572
   1000037    1997.6873

BLOCK NMIX
   1   1   -0.010444173
   1   2   -0.032125658
   1   3    0.70844929
   1   4    0.70495281
   2   1   -0.014760977
   2   2   -0.025201012
   2   3   -0.70573772
   2   4    0.70787096
   3   1   -0.00039009984
   3   2    0.99916603
   3   3    0.0049772869
   3   4    0.040525601
   4   1    0.99983643
   4   2   -0.00031779496
   4   3   -0.0030167631
   4   4    0.017830242

BLOCK UMIX
   1   1   -0.0070518346
   1   2    0.99997514
   2   1   -0.99997514
   2   2   -0.0070518346

BLOCK VMIX
   1   1    0.05735509
   1   2    0.99835384
   2   1    0.99835384
   2   2   -0.05735509

BLOCK STOPMIX
   1   1   -0.17172789
   1   2    0.98514442
   2   1   -0.98514442
   2   2   -0.17172789

BLOCK SBOTMIX
   1   1    0.001848354
   1   2    0.99999829
   2   1   -0.99999829
   2   2    0.001848354

BLOCK STAUMIX
   1   1    0.0025072114
   1   2    0.99999686
   2   1   -0.99999686
   2   2    0.0025072114

BLOCK ALPHA
      -0.040813338

BLOCK HMIX Q=  2176.573
   1    320.93506
   2    24.570602
   3    243.11912
   4    7097160.1

BLOCK GAUGE Q=  2176.573
   1    0.36401549
   2    0.63689873
   3    1.017084

BLOCK AU Q=  2176.573
   1   1    0
   2   2    0
   3   3    2521.45

BLOCK AD Q=  2176.573
   1   1    0
   2   2    0
   3   3    3328.03

BLOCK AE Q=  2176.573
   1   1    0
   2   2    0
   3   3   -3028.51

BLOCK YU Q=  2176.573
   1   1    0
   2   2    0
   3   3    0.84341399

BLOCK YD Q=  2176.573
   1   1    0
   2   2    0
   3   3    0.32102584

BLOCK YE Q=  2176.573
   1   1    0
   2   2    0
   3   3    0.24900896

BLOCK MSOFT Q=  2176.573
   1    2533.83
   2   -1942.29
   3    2825.98
   21    7103048.8
   22   -19494.124
   31    3456.1
   32    3456.1
   33    2983.77
   34    3573.38
   35    3573.38
   36    1132.53
   41    3715.01
   42    3715.01
   43    2395.06
   44    2996.58
   45    2996.58
   46    1975.69
   47    3222.1
   48    3222.1
   49    701.46998

BLOCK HIGGSBOUNDSINPUTHIGGSCOUPLINGSFERMIONS
       0, 603.7145,3,36,15,15

BLOCK HIGGSBOUNDSINPUTHIGGSCOUPLINGSBOSONS
       0,4,36,21,21,23

DECAY 6  1.4279969
    1   2    5    24

DECAY 1000021  77.730121
    0.31610929   2    1000005   -5
    0.31610929   2   -1000005    5
    0.11650795   2    1000006   -6
    0.11650795   2   -1000006    6
    0.037541787   2    2000005   -5
    0.037541787   2   -2000005    5
    0.029840974   2    2000006   -6
    0.029840974   2   -2000006    6

DECAY 1000006  53.01955
    0.49960793   2    1000024    5
    0.25319813   2    1000023    6
    0.24718836   2    1000022    6
    5.4828424e-06   2    1000005    24
    9.2934003e-08   2    1000037    5

DECAY 2000006  52.600715
    0.315607   2    1000022    6
    0.31518225   2    1000023    6
    0.10083395   2    1000024    5
    0.10037137   2    1000006    23
    0.10020146   2    1000006    25
    0.045377384   2    1000037    5
    0.022008742   2    1000025    6
    0.00041784387   2    1000005    24

DECAY 1000005  2.2074063
    0.46602917   2   -1000024    6
    0.26887277   2    1000022    5
    0.26509806   2    1000023    5

DECAY 2000005  50.97935
    0.64858179   2   -1000024    6
    0.19011998   2    1000006   -24
    0.04799632   2    1000022    5
    0.047541323   2    1000023    5
    0.043013962   2   -1000037    6
    0.022275922   2    1000025    5
    0.0002473613   2    1000005    25
    0.0002233447   2    1000005    23

DECAY 1000002  62.084905
    0.62992979   2    1000021    2
    0.24352348   2    1000037    1
    0.12195752   2    1000025    2
    0.0026269846   2    1000035    2
    0.0015138438   2    1000024    1
    0.00026783575   2    1000022    2
    0.00018054815   2    1000023    2

DECAY 2000002  1.5554784
    0.52451983   2    1000021    2
    0.47407072   2    1000035    2
    0.00093897261   2    1000023    2
    0.00047024576   2    1000022    2
    2.2513183e-07   2    1000025    2

DECAY 1000001  62.1025
    0.63062812   2    1000021    1
    0.24436172   2   -1000037    2
    0.1220171   2    1000025    1
    0.0026458842   2    1000035    1
    0.00020897617   2    1000022    1
    0.00011531675   2    1000023    1
    2.2882483e-05   2   -1000024    2

DECAY 2000001  8.1676486
    0.9611953   2    1000021    1
    0.038732832   2    1000035    1
    4.7875983e-05   2    1000023    1
    2.3975538e-05   2    1000022    1
    1.3723405e-08   2    1000025    1

DECAY 1000004  53.78533
    0.55628267   2    1000021    4
    0.29198529   2    1000037    3
    0.14622752   2    1000025    4
    0.0031281715   2    1000035    4
    0.0018333344   2    1000024    3
    0.00032436435   2    1000022    4
    0.00021865067   2    1000023    4

DECAY 2000004  1.8926207
    0.30742028   3    4    5   -1000005
    0.23144626   3    4   -5    1000005
    0.076100825   3    4    6   -1000006
    0.072946469   3    4    15   -1000015
    0.072587179   3    4   -15    1000015
    0.071414202   3    4   -6    1000006
    0.031666672   3    4    24   -1000024
    0.030836078   3    4   -24    1000024
    0.020602649   3    4    23    1000022
    0.019830703   3    4    25    1000023
    0.012994151   3    4   -5    2000005
    0.012462613   3    4    5   -2000005
    0.010458514   3    4    23    1000023
    0.0098054511   3    4    25    1000022
    0.0092860654   3    4   -6    2000006
    0.00892202   3    4    6   -2000006
    0.00080749721   2    1000023    4
    0.00040440838   2    1000022    4
    2.6729074e-06   3    4    24   -1000037
    2.65135e-06   3    4   -24    1000037
    2.5952373e-06   3    4    23    1000025
    3.5031319e-08   3    4    25    1000025
    9.9391281e-10   3    4    36    1000022
    9.7658235e-10   3    4    37   -1000024
    8.2805814e-10   3    4    35    1000023
    6.5443645e-10   3    4   -37    1000024
    6.9237327e-11   3    4    16   -1000016
    6.1972268e-11   3    4    15   -2000015
    4.7249826e-11   3    4   -16    1000016
    4.3975001e-11   3    4   -15    2000015
    3.6491727e-11   3    4    35    1000022
    2.967314e-11   3    4    36    1000023

DECAY 1000003  53.787707
    0.55703395   2    1000021    3
    0.29306011   2   -1000037    4
    0.14633395   2    1000025    3
    0.0031514496   2    1000035    3
    0.00025314152   2    1000022    3
    0.00013968578   2    1000023    3
    2.7718235e-05   2   -1000024    4

DECAY 2000003  6.3305411
    0.94874637   2    1000021    3
    0.051156232   2    1000035    3
    6.488522e-05   2    1000023    3
    3.2494047e-05   2    1000022    3
    1.8361887e-08   2    1000025    3

DECAY 1000011  19.714708
    0.6317574   2   -1000037    12
    0.31527961   2    1000025    11
    0.051095406   2    1000035    11
    0.0010106104   2    1000022    11
    0.00078771988   2    1000023    11
    6.9247976e-05   2   -1000024    12

DECAY 2000011  4.7960995
    0.99873455   2    1000035    11
    0.00084300927   2    1000023    11
    0.00042215114   2    1000022    11
    2.8411569e-07   2    1000025    11

DECAY 1000013  19.714708
    0.6317574   2   -1000037    14
    0.31527961   2    1000025    13
    0.051095406   2    1000035    13
    0.0010106104   2    1000022    13
    0.00078771988   2    1000023    13
    6.9247976e-05   2   -1000024    14

DECAY 2000013  4.7960994
    0.99873455   2    1000035    13
    0.00084300927   2    1000023    13
    0.00042215115   2    1000022    13
    2.8411569e-07   2    1000025    13

DECAY 1000015  2.3880457
    0.49959709   2   -1000024    16
    0.25147253   2    1000022    15
    0.24893038   2    1000023    15

DECAY 2000015  15.139617
    0.48950545   2   -1000037    16
    0.24431299   2    1000025    15
    0.12050594   2    1000022    15
    0.11936355   2    1000023    15
    0.021761684   2    1000035    15
    0.0022850591   2    1000015    25
    0.0022079713   2    1000015    23
    5.7365384e-05   2   -1000024    16

DECAY 1000012  19.72686
    0.62864727   2    1000037    11
    0.31502841   2    1000025    12
    0.051076554   2    1000035    12
    0.004576334   2    1000024    11
    0.00047596411   2    1000022    12
    0.00019546697   2    1000023    12

DECAY 1000014  19.72686
    0.62864727   2    1000037    13
    0.31502841   2    1000025    14
    0.051076554   2    1000035    14
    0.004576334   2    1000024    13
    0.00047596411   2    1000022    14
    0.00019546697   2    1000023    14

DECAY 1000016  15.148728
    0.48666456   2    1000037    15
    0.24390363   2    1000025    16
    0.24271872   2    1000024    15
    0.021687851   2    1000035    16
    0.0042749756   2   -1000015   -24
    0.00053186147   2    1000022    16
    0.00021840079   2    1000023    16

DECAY 1000024  6.4840709e-12
    0.60000001   3    1000022    2   -1
    0.2   3    1000022   -11    12
    0.2   3    1000022   -13    14

DECAY 1000037  15.43999
    0.25449265   2    1000024    23
    0.25107215   2    1000024    25
    0.24820086   2    1000023    24
    0.24623105   2    1000022    24
    3.2731446e-06   2   -1000005    6
    1.4613921e-08   2   -1000015    16

DECAY 1000022 -1


DECAY 1000023  1.1038295e-10
    0.21331473   2    1000022    22
    0.16764032   3    1000022   -1    1
    0.16764032   3    1000022   -3    3
    0.1291425   3    1000022   -2    2
    0.077013739   3    1000022   -16    16
    0.077013727   3    1000022   -12    12
    0.077013727   3    1000022   -14    14
    0.038515548   3    1000022   -11    11
    0.038515548   3    1000022   -13    13
    0.0042569547   3    1000024   -2    1
    0.0042569547   3   -1000024   -1    2
    0.0014189845   3    1000024   -12    11
    0.0014189845   3   -1000024    12   -11
    0.0014189845   3    1000024   -14    13
    0.0014189845   3   -1000024    14   -13

DECAY 1000025  15.438837
    0.2478814   2    1000024   -24
    0.2478814   2   -1000024    24
    0.15816962   2    1000023    23
    0.15527702   2    1000022    25
    0.096215182   2    1000022    23
    0.094572162   2    1000023    25
    1.5813292e-06   2    1000005   -5
    1.5813292e-06   2   -1000005    5
    2.9776737e-08   2    1000015   -15
    2.9776737e-08   2   -1000015    15

DECAY 1000035  20.558953
    0.20309905   2    1000015   -15
    0.20309905   2   -1000015    15
    0.086252779   2    1000005   -5
    0.086252779   2   -1000005    5
    0.075564312   2    1000024   -24
    0.075564312   2   -1000024    24
    0.054952097   2    1000023    25
    0.054923142   2    1000006   -6
    0.054923142   2   -1000006    6
    0.051556739   2    1000022    23
    0.027374098   2    1000022    25
    0.026276675   2    1000023    23
    7.0783427e-05   2    2000005   -5
    7.0783427e-05   2   -2000005    5
    6.7583247e-06   2    1000025    23
    6.7029993e-06   2    1000037   -24
    6.7029993e-06   2   -1000037    24
    9.542532e-08   2    1000025    25

DECAY 25  0.0040036786
    0.6160363   2    5   -5
    0.19155904   2    24   -24
    0.078362078   2    21    21
    0.064639258   2   -15    15
    0.023640429   2    23    23
    0.021548606   2    4   -4
    0.0022856272   2    22    22
    0.0014498381   2    22    23
    0.00025003039   2    3   -3
    0.0002288003   2   -13    13

DECAY 35  25.676954
    0.64125798   2    5   -5
    0.13273759   2   -15    15
    0.071605098   2    1000024   -1000037
    0.071605098   2    1000037   -1000024
    0.04844769   2    1000023    1000025
    0.023327797   2    1000022    1000025
    0.0071131277   2    6   -6
    0.0026790358   2    1000024   -1000024
    0.00046774798   2   -13    13
    0.0003089306   2    1000022    1000022
    0.00028412903   2    3   -3
    0.00011053256   2    1000023    1000023
    1.80018e-05   2    25    25
    1.162338e-05   2    1000022    1000023
    8.7923331e-06   2    21    21
    8.3802798e-06   2    1000005   -1000005
    4.5144512e-06   2    24   -24
    2.251491e-06   2    23    23
    1.6003215e-06   2    1000015   -1000015
    7.2584829e-08   2    4   -4
    5.6824561e-09   2    23    22
    3.8290274e-09   2    22    22

DECAY 36  25.681504
    0.64118398   2    5   -5
    0.13271529   2   -15    15
    0.071557794   2    1000024   -1000037
    0.071557794   2    1000037   -1000024
    0.048850981   2    1000022    1000025
    0.022954734   2    1000023    1000025
    0.0071428033   2    6   -6
    0.002794093   2    1000024   -1000024
    0.0004676686   2   -13    13
    0.00028411413   2    3   -3
    0.00027928329   2    1000022    1000022
    0.00013857996   2    1000023    1000023
    4.4093271e-05   2    21    21
    2.4096233e-05   2    1000022    1000023
    4.5693243e-06   2    23    25
    7.2752929e-08   2    4   -4
    3.4685382e-08   2    23    22
    1.0869344e-08   2    22    22

DECAY 37  25.12449
    0.64018526   2    6   -5
    0.13573752   2   -15    16
    0.074206898   2    1000037    1000022
    0.073617392   2    1000024    1000025
    0.073307238   2    1000037    1000023
    0.0010660848   2    4   -5
    0.00068472404   2    1000024    1000023
    0.00047831848   2   -13    14
    0.00040072526   2    1000024    1000022
    0.00028597042   2    4   -3
    1.4525154e-05   2    2   -3
    1.0660831e-05   2    2   -5
    4.6825731e-06   2    24    25
    5.1640834e-13   2    24    36

DECAY 5 -1


DECAY 15 -1


DECAY 23  2.4952


DECAY 24  2.085
