BLOCK SPINFO
   1   SPheno
   2   v4.0.5be

BLOCK SPHENOINFO
   1   2
   2   2

BLOCK MODSEL
   1   0

BLOCK MINPAR
   3    14.979296
   4   -1

BLOCK EXTPAR
   0    2626.1273
   1   -1311.6954
   2   -1564.5252
   3    2710.5642
   11   -2773.9734
   12    3723.0651
   13    7252.1125
   23   -1214.1882
   25    14.337538
   26    4227.9828
   31    1754.7735
   32    1754.7735
   33    2213.4697
   34    4947.1208
   35    4947.1208
   36    1909.2147
   41    1790.8721
   42    1790.8721
   43    2100.8327
   44    1807.0642
   45    1807.0642
   46    3085.0635
   47    2471.035
   48    2471.035
   49    4430.963

BLOCK SMINPUTS
   1    127.90897
   2    1.1663787e-05
   3    0.1184
   4    91.1876
   5    4.18
   6    173.2
   7    1.777
   8    0
   11    0.00051099893
   12    0
   13    0.10565837
   14    0
   21    0.005
   22    0.0025
   23    0.095
   24    1.27

BLOCK GAUGE Q=  2626.1273
   1    0.35536298
   2    0.66519887
   3    1.219778

BLOCK YU Q=  2626.1273
   1   1    8.4047409e-06
   2   2    0.0042696084
   3   3    1.0153602

BLOCK YD Q=  2626.1273
   1   1    0.00024214704
   2   2    0.0046007938
   3   3    0.24013399

BLOCK YE Q=  2626.1273
   1   1    4.2256429e-05
   2   2    0.0087372894
   3   3    0.14694683

BLOCK AU Q=  2626.1273
   1   1    0
   2   2    0
   3   3   -2773.9756

BLOCK AD Q=  2626.1273
   1   1    0
   2   2    0
   3   3    3723.0673

BLOCK AE Q=  2626.1273
   1   1    0
   2   2    0
   3   3    7252.1101

BLOCK MSOFT Q=  2626.1273
   1   -1311.6954
   2   -1564.5252
   3    2710.5642
   21    16304924
   22   -1308955.2
   31    1754.7735
   32    1754.7735
   33    2213.4697
   34    4947.1208
   35    4947.1208
   36    1909.2147
   41    1790.8721
   42    1790.8721
   43    2100.8327
   44    1807.0642
   45    1807.0642
   46    3085.0635
   47    2471.035
   48    2471.035
   49    4430.963

BLOCK MASS
   6    173.2
   23    91.1876
   24    80.429995
   15    1.777
   25    120.33941
   35    4227.3935
   36    4227.9828
   37    4228.4547
   1000001    1930.3579
   2000001    2576.4
   1000002    1928.6917
   2000002    1923.7528
   1000003    1930.3573
   2000003    2576.3993
   1000004    1928.6913
   2000004    1923.7526
   1000005    2212.1948
   2000005    4486.0533
   1000006    2208.6976
   2000006    3122.4484
   1000011    1767.9764
   2000011    4954.1709
   1000012    1765.811
   1000013    1767.9772
   2000013    4954.1685
   1000014    1765.8118
   1000015    1921.7909
   2000015    2223.4352
   1000016    2221.2637
   1000021    2807.0879
   1000022   -1208.153
   1000023    1230.4534
   1000025   -1313.483
   1000035   -1594.2523
   1000024    1221.0291
   1000037    1594.3813

BLOCK ALPHA
      -0.066753592

BLOCK HMIX Q=  2626.1273
   1   -1214.1882
   2    14.337538
   3    243.41645
   4    17875838

BLOCK STOPMIX
   1   1    0.99691976
   1   2    0.078428303
   2   1   -0.078428303
   2   2    0.99691976

BLOCK SBOTMIX
   1   1   -0.99999501
   1   2    0.0031578513
   2   1   -0.0031578513
   2   2   -0.99999501

BLOCK STAUMIX
   1   1   -0.035142726
   1   2    0.9993823
   2   1   -0.9993823
   2   2   -0.035142726

BLOCK NMIX
   1   1   -0.32749245
   1   2    0.14499139
   1   3    0.66506112
   1   4   -0.65530137
   2   1    0.011391019
   2   2   -0.018454151
   2   3    0.7065667
   2   4    0.70731406
   3   1    0.94455499
   3   2    0.072273869
   3   3    0.21984508
   3   4   -0.23293882
   4   1    0.020851903
   4   2   -0.98661716
   4   3    0.10062475
   4   4   -0.12659554

BLOCK UMIX
   1   1   -0.14111542
   1   2   -0.98999315
   2   1   -0.98999315
   2   2    0.14111542

BLOCK VMIX
   1   1    0.17753709
   1   2    0.98411411
   2   1    0.98411411
   2   2   -0.17753709

BLOCK HIGGSBOUNDSINPUTHIGGSCOUPLINGSFERMIONS
       0, 205.56501,3,36,15,15

BLOCK HIGGSBOUNDSINPUTHIGGSCOUPLINGSBOSONS
       0,4,36,21,21,23

BLOCK SPHENOLOWENERGY
   1    0.00032915197
   2    1.5885578e-06
   3    3.5238217e-05
   4    2.5094065e-15
   5    1.0719904e-10
   6    2.2443585e-08
   7    8.471207e-14
   8    3.6188984e-09
   9    7.6768508e-07
   10    9.6728448e-05
   11    0.99916784
   12    0.54221715
   13    19.373528
   14    0
   15    0
   16    0.0021583709
   17    2.2816693e-15
   18    2.4794722e-11
   19    8.2881793e-11
   20    1.3789608e-15
   21    5.8955482e-11
   22    1.4213103e-08
   23    0
   24    0
   25    0
   26    0
   27    0
   28    0
   29    0
   30    0
   31    0
   39    2.4612202e-05
   40    0
   41    0
   42    0

BLOCK FWCOEF Q=  160
   305   4422   0   0   -0.18881911
   305   4422   0   2   -0.19904055
   305   4322   0   2   -0.00021746075
   305   6421   0   0   -0.095227835
   305   6421   0   2   -0.10302466
   305   6321   0   2   -0.00016237569
   3051111   4133   0   0    1.6115582
   3051111   4133   0   2    1.6118534
   3051111   4233   0   2    4.2614101e-05
   3051111   4137   0   0   -4.4342503
   3051111   4137   0   2   -4.4311571
   3051111   4237   0   2   -0.00032295937
   3051313   4133   0   0    1.6115582
   3051313   4133   0   2    1.6118532
   3051313   4233   0   2    4.2614094e-05
   3051313   4137   0   0   -4.4342503
   3051313   4137   0   2   -4.4311573
   3051313   4237   0   2   -0.0003229594
   3051212   4137   0   0    1.5053501
   3051212   4137   0   2    1.5046842
   3051212   4237   0   2    7.0074797e-05
   3051414   4137   0   0    1.5053501
   3051414   4137   0   2    1.5046842
   3051414   4237   0   2    7.0074797e-05
   3051616   4137   0   0    1.5053501
   3051616   4137   0   2    1.5046844
   3051616   4237   0   2    7.0074907e-05

BLOCK IMFWCOEF Q=  160
   305   4422   0   0    3.8580521e-07
   305   4422   0   2    7.2565681e-06
   305   4322   0   2   -2.6601712e-06
   305   6421   0   0    3.3046767e-07
   305   6421   0   2    1.0726801e-05
   305   6321   0   2   -1.2123877e-06
   3051111   4133   0   2   -1.8570328e-06
   3051111   4233   0   2    8.1840217e-07
   3051111   4137   0   2    1.6342976e-05
   3051111   4237   0   2   -6.2017593e-06
   3051313   4133   0   2   -1.8570352e-06
   3051313   4233   0   2    8.1840209e-07
   3051313   4137   0   2    1.6342986e-05
   3051313   4237   0   2   -6.2017599e-06
   3051212   4137   0   2   -3.4472345e-06
   3051212   4237   0   2    1.3456393e-06
   3051414   4137   0   2   -3.4472349e-06
   3051414   4237   0   2    1.3456393e-06
   3051616   4137   0   2   -3.4426398e-06
   3051616   4237   0   2    1.3456393e-06

DECAY 23  2.4952


DECAY 24  2.085


DECAY 1000011  1.3974377
    0.38062583   2   -1000037    12
    0.37202515   2    1000025    11
    0.1850335   2    1000035    11
    0.060668685   2   -1000024    12
    0.0014203182   2    1000022    11
    0.00022651245   2    1000023    11

DECAY 2000011  21.569772
    0.88997418   2    1000025    11
    0.10949073   2    1000022    11
    0.00040324448   2    1000035    11
    0.00013184481   2    1000023    11

DECAY 1000013  1.3981671
    0.38043043   2   -1000037    14
    0.37185172   2    1000025    13
    0.18493874   2    1000035    13
    0.060637161   2   -1000024    14
    0.0016607325   2    1000022    13
    0.00048121971   2    1000023    13

DECAY 2000013  21.583206
    0.88943412   2    1000025    13
    0.10955899   2    1000022    13
    0.00040582867   2    1000035    13
    0.00030141844   2   -1000024    14
    0.00028498482   2    1000023    13

DECAY 1000015  3.4205388
    0.71613043   2    1000025    15
    0.15413543   2    1000022    15
    0.08786853   2   -1000024    16
    0.041749472   2    1000023    15
    0.00010977957   2    1000035    15

DECAY 2000015  8.8695521
    0.51091975   2   -1000037    16
    0.24835151   2    1000035    15
    0.15928249   2    1000025    15
    0.02615224   2    1000023    15
    0.021662608   2    1000022    15
    0.019139346   2   -1000024    16
    0.0072824833   2    1000015    23
    0.0072095764   2    1000015    25

DECAY 1000012  1.4278571
    0.35983769   2    1000037    11
    0.20301097   2    1000025    12
    0.18520598   2    1000035    12
    0.15763134   2    1000022    12
    0.093446532   2    1000024    11
    0.00086748939   2    1000023    12

DECAY 1000014  1.4285812
    0.35966052   2    1000037    13
    0.20290864   2    1000025    14
    0.18511376   2    1000035    14
    0.15755178   2    1000022    14
    0.093898241   2    1000024    13
    0.00086705166   2    1000023    14

DECAY 1000016  8.9015134
    0.50057154   2    1000037    15
    0.25706655   2    1000035    16
    0.086824433   2    1000025    16
    0.084774196   2    1000024    15
    0.055749741   2    1000022    16
    0.014695763   2    1000015    24
    0.00031777566   2    1000023    16

DECAY 1000001  2.799862
    0.60078542   2   -1000037    2
    0.3008062   2    1000035    1
    0.046412652   2    1000022    1
    0.043494123   2   -1000024    2
    0.0080527269   2    1000025    1
    0.00044888172   2    1000023    1

DECAY 2000001  0.79714456
    0.88178408   2    1000025    1
    0.11777408   2    1000022    1
    0.00029878474   2    1000035    1
    0.00014062745   2    1000023    1

DECAY 1000003  2.8003681
    0.60067481   2   -1000037    4
    0.30075081   2    1000035    3
    0.046452305   2    1000022    3
    0.043567219   2   -1000024    4
    0.0080551868   2    1000025    3
    0.00049966159   2    1000023    3

DECAY 2000003  0.79848713
    0.88033533   2    1000025    3
    0.1179421   2    1000022    3
    0.00080065832   2   -1000024    4
    0.00054340605   2    1000023    3
    0.00030349268   2    1000035    3

DECAY 1000005  29.087758
    0.70136784   2   -1000024    6
    0.17282864   2   -1000037    6
    0.075973275   2    1000035    5
    0.025999015   2    1000022    5
    0.020825803   2    1000023    5
    0.0030054328   2    1000025    5

DECAY 2000005  142.58909
    0.91938384   2    1000021    5
    0.030168957   2   -1000024    6
    0.015417751   2    1000023    5
    0.015276129   2    1000022    5
    0.014587289   2    1000025    5
    0.0018525931   2    1000006   -24
    0.0014448557   2    1000005    25
    0.00092862697   2    1000005    23
    0.00061637199   2   -1000037    6
    0.00031998263   2    1000035    5

DECAY 2000002  1.2616053
    0.86576023   2    1000025    2
    0.13394024   2    1000022    2
    0.00015427618   2    1000023    2
    0.00014526033   2    1000035    2

DECAY 1000002  2.8288772
    0.58272617   2    1000037    1
    0.29084999   2    1000035    2
    0.067921442   2    1000024    1
    0.049894781   2    1000025    2
    0.0083229143   2    1000022    2
    0.00028470549   2    1000023    2

DECAY 2000004  1.2620873
    0.86542417   2    1000025    4
    0.13398606   2    1000022    4
    0.00025116722   2    1000023    4
    0.00019090177   2    1000024    3
    0.00014598513   2    1000035    4

DECAY 1000004  2.8293961
    0.58261923   2    1000037    3
    0.29079077   2    1000035    4
    0.068008355   2    1000024    3
    0.049890884   2    1000025    4
    0.0083622714   2    1000022    4
    0.0003284924   2    1000023    4

DECAY 1000006  28.534641
    0.36075423   2    1000023    6
    0.31477682   2    1000022    6
    0.15750391   2    1000037    5
    0.069972609   2    1000035    6
    0.052417558   2    1000025    6
    0.042811235   2    1000024    5
    0.0013369356   3    1000022    24    5
    0.0004123561   2    1000022    4

DECAY 2000006  137.69226
    0.32732756   2    1000024    5
    0.16645005   2    1000023    6
    0.15564056   2    1000022    6
    0.11294378   2    1000005    24
    0.083082387   2    1000006    25
    0.056473147   2    1000006    23
    0.049624631   2    1000021    6
    0.042322119   2    1000025    6
    0.0040642167   2    1000037    5
    0.0020715536   2    1000035    6

DECAY 1000024  1.3837506e-06
    0.3419426   3    1000022   -1    2
    0.3260975   3    1000022   -3    4
    0.11399016   3    1000022   -11    12
    0.11395246   3    1000022   -13    14
    0.10401728   3    1000022   -15    16

DECAY 1000037  9.2454597
    0.24150824   2    1000024    23
    0.23897153   2    1000024    25
    0.23626721   2    1000023    24
    0.23445865   2    1000022    24
    0.046400878   2    1000025    24
    0.0011714909   3    1000023   -5    6
    0.0011107656   3    1000022   -5    6

DECAY 1000022 -1


DECAY 1000023  1.9045994e-05
    0.18412382   3    1000022    12   -12
    0.13767329   3    1000022    1   -1
    0.13764497   3    1000022    3   -3
    0.13763642   2    1000022    22
    0.1073775   3    1000022    2   -2
    0.10290565   3    1000022    4   -4
    0.091894125   3    1000022    5   -5
    0.03106988   3    1000022    11   -11
    0.031059809   3    1000022    13   -13
    0.02837608   3    1000022    15   -15
    0.0017885071   3    1000024    1   -2
    0.0017885071   3   -1000024   -1    2
    0.001636672   3    1000024    3   -4
    0.001636672   3   -1000024   -3    4
    0.00059617534   3    1000024    11   -12
    0.00059617534   3   -1000024   -11    12
    0.00059580094   3    1000024    13   -14
    0.00059580094   3   -1000024   -13    14
    0.00050207784   3    1000024    15   -16
    0.00050207784   3   -1000024   -15    16

DECAY 1000025  0.55581607
    0.49443965   2    1000024   -24
    0.49443965   2   -1000024    24
    0.0021792604   3    1000023    12   -12
    0.0016298033   3    1000023    1   -1
    0.0016297908   3    1000023    3   -3
    0.0016040099   3    1000023    5   -5
    0.0012710949   3    1000023    2   -2
    0.0012687816   3    1000023    4   -4
    0.00036776394   3    1000023    11   -11
    0.00036775918   3    1000023    13   -13
    0.00036642136   3    1000023    15   -15
    0.00026158632   2    1000022    23
    0.00017324533   2    1000023    22

DECAY 1000035  11.693395
    0.21876461   2    1000023    23
    0.21824136   2    1000024   -24
    0.21824136   2   -1000024    24
    0.15999919   2    1000022    25
    0.15324038   2    1000023    25
    0.02670834   2    1000025    25
    0.0025224348   2    1000022    23
    0.00099001666   3    1000024    5   -6
    0.00099001666   3   -1000024   -5    6
    0.00024250636   2    1000025    23

DECAY 1000021  170.36546
    0.068586668   2    2000002   -2
    0.068586668   2   -2000002    2
    0.068586655   2    2000004   -4
    0.068586655   2   -2000004    4
    0.067963542   2    1000004   -4
    0.067963542   2   -1000004    4
    0.067963535   2    1000002   -2
    0.067963535   2   -1000002    2
    0.067753667   2    1000003   -3
    0.067753667   2   -1000003    3
    0.067753592   2    1000001   -1
    0.067753592   2   -1000001    1
    0.035017614   2    1000005   -5
    0.035017614   2   -1000005    5
    0.032469099   2    1000006   -6
    0.032469099   2   -1000006    6
    0.011606745   2    1000006   -4
    0.011606745   2   -1000006    4
    0.0060574751   2    2000003   -3
    0.0060574751   2   -2000003    3
    0.0060574384   2    2000001   -1
    0.0060574384   2   -2000001    1

DECAY 25  0.0033553542
    0.64063536   2   -5    5
    0.15784336   2   -24    24
    0.075208706   2    21    21
    0.073260644   2   -15    15
    0.031730627   2   -4    4
    0.01739674   2    23    23
    0.0023184795   2    22    22
    0.0011102508   2    22    23
    0.00025410333   2   -13    13
    0.00024089384   2   -3    3
    6.660487e-07   2   -1    1
    1.6353129e-07   2   -2    2
    5.7125906e-09   2   -11    11

DECAY 35  49.689846
    0.21746576   2   -5    5
    0.20403576   2   -1000024    1000037
    0.20403576   2   -1000037    1000024
    0.14652187   2    1000023    1000035
    0.054090758   2    1000022    1000035
    0.039861985   2   -15    15
    0.032763493   2    1000023    1000025
    0.016322947   2   -6    6
    0.01368126   2    1000022    1000022
    0.01225322   2    1000022    1000023
    0.01200115   2   -2000015    1000015
    0.01200115   2   -1000015    2000015
    0.01145531   2   -1000024    1000024
    0.010134591   2    1000022    1000025
    0.0056122988   2    1000025    1000035
    0.0035775471   2   -1000037    1000037
    0.0018767244   2    1000035    1000035
    0.0017612131   2    1000025    1000025
    0.00013835195   2   -13    13
    0.00013541682   2    1000023    1000023
    0.00012888503   2   -1000015    1000015
    9.5181333e-05   2   -3    3
    2.4181474e-05   2    25    25
    5.6558286e-06   2   -2000004    1000004
    5.6558286e-06   2   -1000004    2000004
    2.1272909e-06   2   -1000001    1000001
    2.1268396e-06   2   -1000003    1000003
    1.9446044e-06   2    23    23
    1.4532141e-06   2   -1000002    1000002
    1.4326684e-06   2   -1000004    1000004
    4.7536559e-07   2    21    21
    3.8551388e-07   2   -24    24
    3.1551992e-07   2   -1000011    1000011
    3.15152e-07   2   -1000013    1000013
    2.6316789e-07   2   -1    1
    2.6153145e-07   2   -2000004    2000004
    2.5362705e-07   2   -2000002    2000002
    2.4521477e-07   2   -4    4
    1.3185655e-07   2    22    23
    8.2595308e-08   2    22    22
    3.1069894e-09   2   -11    11
    2.1916653e-11   2   -2000002    1000002
    2.1916653e-11   2   -1000002    2000002
    1.2638824e-12   2   -2    2

DECAY 36  49.184718
    0.21173958   2   -5    5
    0.19741067   2   -1000024    1000037
    0.19741067   2   -1000037    1000024
    0.12336344   2    1000022    1000035
    0.064508014   2    1000023    1000035
    0.038813201   2   -15    15
    0.02646592   2    1000022    1000022
    0.021191251   2   -1000024    1000024
    0.020529789   2    1000022    1000025
    0.01634643   2    1000023    1000025
    0.015634357   2   -6    6
    0.01435333   2    1000025    1000035
    0.012218926   2   -2000015    1000015
    0.012218926   2   -1000015    2000015
    0.011417117   2   -1000037    1000037
    0.0060975522   2    1000022    1000023
    0.0059769483   2    1000035    1000035
    0.0038939803   2    1000025    1000025
    0.0001563935   2    1000023    1000023
    0.00013471016   2   -13    13
    9.2670311e-05   2   -3    3
    9.4873964e-06   2    21    21
    5.7096356e-06   2   -2000004    1000004
    5.7096356e-06   2   -1000004    2000004
    4.4096715e-06   2    23    25
    2.5622183e-07   2   -1    1
    2.3496969e-07   2   -4    4
    1.9293584e-07   2    22    23
    1.2655243e-07   2    22    22
    3.0251569e-09   2   -11    11
    2.2124897e-11   2   -2000002    1000002
    2.2124897e-11   2   -1000002    2000002
    1.2111417e-12   2   -2    2
    5.5285775e-37   2    25    25

DECAY 37  49.325015
    0.22957467   2   -5    6
    0.20633389   2    1000024    1000035
    0.20616277   2    1000023    1000037
    0.19268268   2    1000022    1000037
    0.069102477   2    1000024    1000025
    0.038467382   2   -15    16
    0.024602869   2   -1000015    1000016
    0.02215544   2    1000025    1000037
    0.0062928417   2    1000023    1000024
    0.0040350985   2    1000022    1000024
    0.000319099   2   -5    4
    0.00013599588   2   -13    14
    8.7714423e-05   2   -3    4
    2.0855639e-05   2   -3    6
    4.3999773e-06   2    24    25
    4.1153263e-06   2   -3    2
    3.3902376e-06   2   -1000001    1000002
    3.3809309e-06   2   -1000003    1000004
    2.2786938e-06   2   -5    2
    2.2480589e-06   2    1000035    1000037
    1.5754675e-06   2   -1000003    2000004
    1.249969e-06   2   -1000011    1000012
    1.2494489e-06   2   -1000013    1000014
    9.5054895e-07   2   -1    6
    6.2656042e-07   2   -1000003    1000006
    2.4290525e-07   2   -1    2
    1.8127004e-07   2   -1000003    1000002
    1.8089904e-07   2   -1000001    1000004
    8.4286631e-08   2   -1000001    2000004
    2.8737165e-08   2   -1000001    1000006
    2.0046624e-08   2   -1    4
    7.9417254e-09   2   -1000005    1000004
    3.1809578e-09   2   -11    12
    1.8487776e-09   2   -1000005    2000004
    5.675003e-11   2   -1000005    1000002
    8.277528e-12   2   -1000001    2000002
    4.426365e-13   2   -1000003    2000002
    3.7150936e-14   2    24    35
    6.9246986e-17   2   -1000005    2000002

DECAY 6  2.43
    1   2    5    24

DECAY 15 -1
