BLOCK SPINFO
   1   SPheno
   2   v4.0.5be

BLOCK SPHENOINFO
   1   2
   2   2

BLOCK MODSEL
   1   0

BLOCK MINPAR
   3    43.374129
   4    1

BLOCK EXTPAR
   0    2412.5361
   1   -4994.766
   2    1577.6903
   3    1842.6834
   11    4972.9137
   12   -2121.78
   13   -2686.5796
   23    500.66807
   25    42.252097
   26    1884.9023
   31    2918.9027
   32    2918.9027
   33    2189.968
   34    3148.5128
   35    3148.5128
   36    1154.7144
   41    3702.7857
   42    3702.7857
   43    2027.8212
   44    3821.5703
   45    3821.5703
   46    2900.7438
   47    4340.1268
   48    4340.1268
   49    3345.1155

BLOCK SMINPUTS
   1    127.90897
   2    1.1663787e-05
   3    0.1184
   4    91.1876
   5    4.18
   6    173.2
   7    1.777
   8    0
   11    0.00051099893
   12    0
   13    0.10565837
   14    0
   21    0.005
   22    0.0025
   23    0.095
   24    1.27

BLOCK GAUGE Q=  2412.5361
   1    0.35536298
   2    0.66519887
   3    1.219778

BLOCK YU Q=  2412.5361
   1   1    8.38672e-06
   2   2    0.0042604538
   3   3    1.0131831

BLOCK YD Q=  2412.5361
   1   1    0.00071206668
   2   2    0.013529267
   3   3    0.70614702

BLOCK YE Q=  2412.5361
   1   1    0.00012426084
   2   2    0.025693201
   3   3    0.43211738

BLOCK AU Q=  2412.5361
   1   1    0
   2   2    0
   3   3    4972.9137

BLOCK AD Q=  2412.5361
   1   1    0
   2   2    0
   3   3   -2121.78

BLOCK AE Q=  2412.5361
   1   1    0
   2   2    0
   3   3   -2686.5797

BLOCK MSOFT Q=  2412.5361
   1   -4994.766
   2    1577.6903
   3    1842.6834
   21    3379032.1
   22   -182413.16
   31    2918.9027
   32    2918.9027
   33    2189.968
   34    3148.5128
   35    3148.5128
   36    1154.7144
   41    3702.7857
   42    3702.7857
   43    2027.8212
   44    3821.5703
   45    3821.5703
   46    2900.7438
   47    4340.1268
   48    4340.1268
   49    3345.1155

BLOCK MASS
   6    173.2
   23    91.1876
   24    80.429995
   15    1.777
   25    126.66079
   35    1884.7125
   36    1884.9023
   37    1887.1667
   1000001    3759.7846
   2000001    4387.2096
   1000002    3759.0785
   2000002    3868.1469
   1000003    3759.7824
   2000003    4387.2053
   1000004    3759.0764
   2000004    3868.1465
   1000005    2070.2765
   2000005    3378.3793
   1000006    2046.8812
   2000006    2843.5116
   1000011    2927.0005
   2000011    3153.9346
   1000012    2925.5392
   1000013    2926.9816
   2000013    3153.8996
   1000014    2925.521
   1000015    1130.9509
   2000015    2191.4051
   1000016    2188.7397
   1000021    2110.2618
   1000022    507.92047
   1000023   -511.52165
   1000025    1628.9433
   1000035   -4958.2254
   1000024    509.01171
   1000037    1629.0327

BLOCK ALPHA
      -0.023217566

BLOCK HMIX Q=  2412.5361
   1    500.66807
   2    42.252097
   3    243.45164
   4    3552856.7

BLOCK STOPMIX
   1   1   -0.98572254
   1   2    0.16837778
   2   1   -0.16837778
   2   2   -0.98572254

BLOCK SBOTMIX
   1   1    0.99997925
   1   2    0.0064423056
   2   1   -0.0064423056
   2   2    0.99997925

BLOCK STAUMIX
   1   1    0.012366164
   1   2    0.99992354
   2   1   -0.99992354
   2   2    0.012366164

BLOCK NMIX
   1   1   -0.0057734165
   1   2   -0.051134729
   1   3    0.70781152
   1   4   -0.70452449
   2   1   -0.0068037057
   2   2   -0.025851686
   2   3   -0.70617244
   2   4   -0.70753507
   3   1   -0.00031795576
   3   2    0.9983571
   3   3    0.01796741
   3   4   -0.054407397
   4   1    0.99996014
   4   2   -0.00015368208
   4   3   -0.00071241432
   4   4   -0.0088990276

BLOCK UMIX
   1   1   -0.025451734
   1   2    0.99967605
   2   1    0.99967605
   2   2    0.025451734

BLOCK VMIX
   1   1   -0.077021092
   1   2    0.99702946
   2   1    0.99702946
   2   2    0.077021092

BLOCK HIGGSBOUNDSINPUTHIGGSCOUPLINGSFERMIONS
       0, 1785.2397,3,36,15,15

BLOCK HIGGSBOUNDSINPUTHIGGSCOUPLINGSBOSONS
       0,4,36,21,21,23

BLOCK SPHENOLOWENERGY
   1    0.00036716349
   2    1.5866616e-06
   3    3.5236182e-05
   4    2.237157e-15
   5    9.5567976e-11
   6    1.9959539e-08
   7    7.4307381e-14
   8    3.1743777e-09
   9    6.7153058e-07
   10    9.3273478e-05
   11    0.96347932
   12    0.54248469
   13    19.368283
   14    0
   15    0
   16    0.0021601169
   17    2.2816904e-15
   18    2.4799614e-11
   19    8.2894602e-11
   20    2.6425924e-15
   21    1.1297812e-10
   22    4.3173614e-08
   23    0
   24    0
   25    0
   26    0
   27    0
   28    0
   29    0
   30    0
   31    0
   39    7.5089465e-05
   40    0
   41    0
   42    0

BLOCK FWCOEF Q=  160
   305   4422   0   0   -0.18881911
   305   4422   0   2   -0.23984071
   305   4322   0   2   -0.00064568937
   305   6421   0   0   -0.095227835
   305   6421   0   2   -0.1342001
   305   6321   0   2   -0.00054919534
   3051111   4133   0   0    1.6093179
   3051111   4133   0   2    1.6098516
   3051111   4233   0   2    0.00044516209
   3051111   4137   0   0   -4.43201
   3051111   4137   0   2   -4.4288386
   3051111   4237   0   2   -0.0033766716
   3051313   4133   0   0    1.6093179
   3051313   4133   0   2    1.6098505
   3051313   4233   0   2    0.00044515916
   3051313   4137   0   0   -4.43201
   3051313   4137   0   2   -4.4288397
   3051313   4237   0   2   -0.0033766723
   3051212   4137   0   0    1.5053501
   3051212   4137   0   2    1.5046672
   3051212   4237   0   2    0.00073302584
   3051414   4137   0   0    1.5053501
   3051414   4137   0   2    1.5046672
   3051414   4237   0   2    0.00073302628
   3051616   4137   0   0    1.5053501
   3051616   4137   0   2    1.5046671
   3051616   4237   0   2    0.0007331514

BLOCK IMFWCOEF Q=  160
   305   4422   0   0    3.8576067e-07
   305   4422   0   2    4.7548546e-05
   305   4322   0   2   -6.798255e-06
   305   6421   0   0    3.3042953e-07
   305   6421   0   2   -2.4717386e-05
   305   6321   0   2   -3.8608202e-06
   3051111   4133   0   2   -1.6051585e-06
   3051111   4233   0   2    9.6297491e-06
   3051111   4137   0   2    1.7612587e-05
   3051111   4237   0   2   -7.3059692e-05
   3051313   4133   0   2   -1.6051574e-06
   3051313   4233   0   2    9.6297337e-06
   3051313   4137   0   2    1.761261e-05
   3051313   4237   0   2   -7.3059742e-05
   3051212   4137   0   2   -3.7209674e-06
   3051212   4237   0   2    1.5860185e-05
   3051414   4137   0   2   -3.7209675e-06
   3051414   4237   0   2    1.5860185e-05
   3051616   4137   0   2   -3.7231664e-06
   3051616   4237   0   2    1.5860186e-05

DECAY 23  2.4952


DECAY 24  2.085


DECAY 1000011  18.446669
    0.66506937   2   -1000037    12
    0.33157762   2    1000025    11
    0.0019313414   2    1000022    11
    0.00085094114   2   -1000024    12
    0.00057072492   2    1000023    11

DECAY 2000011  0.0011993827
    0.58026062   2    1000023    11
    0.41825386   2    1000022    11
    0.00076575285   2   -1000024    12
    0.00071832365   2    1000025    11

DECAY 1000013  18.482476
    0.66376897   2   -1000037    14
    0.33092965   2    1000025    13
    0.0029077035   2    1000022    13
    0.0015443916   2    1000023    13
    0.00084928643   2   -1000024    14

DECAY 2000013  0.079816653
    0.4919437   2   -1000024    14
    0.25406401   2    1000023    13
    0.25295866   2    1000022    13
    0.00075203549   2    1000013    25
    0.00018072431   2   -1000037    14
    0.00010086611   2    1000025    13

DECAY 1000015  5.340423
    0.50033807   2   -1000024    16
    0.25164879   2    1000022    15
    0.24801314   2    1000023    15

DECAY 2000015  13.509695
    0.28570879   2   -1000037    16
    0.27169319   2    1000022    15
    0.26943304   2    1000023    15
    0.14251856   2    1000025    15
    0.01580577   2    1000015    23
    0.014452869   2    1000015    25
    0.00038778884   2   -1000024    16

DECAY 1000012  18.476145
    0.65957546   2    1000037    11
    0.33081178   2    1000025    12
    0.0077758756   2    1000024    11
    0.0015135908   2    1000022    12
    0.00032329604   2    1000023    12

DECAY 1000014  18.511943
    0.65828926   2    1000037    13
    0.33016632   2    1000025    14
    0.0097110922   2    1000024    13
    0.0015106533   2    1000022    14
    0.0003226686   2    1000023    14

DECAY 1000016  13.545315
    0.54423683   2    1000024    15
    0.28143281   2    1000037    15
    0.14112736   2    1000025    16
    0.031419234   2    1000015    24
    0.0014700126   2    1000022    16
    0.000313757   2    1000023    16

DECAY 1000001  172.02035
    0.80945268   2    1000021    1
    0.12686321   2   -1000037    2
    0.063274723   2    1000025    1
    0.00023290397   2    1000022    1
    0.00012011118   2   -1000024    2

DECAY 2000001  204.59301
    0.99999865   2    1000021    1

DECAY 1000003  172.03453
    0.80938456   2    1000021    3
    0.12685263   2   -1000037    4
    0.063269454   2    1000025    3
    0.00027120433   2    1000022    3
    0.00012765517   2   -1000024    4

DECAY 2000003  204.6236
    0.99984699   2    1000021    3

DECAY 1000005  58.534522
    0.62289005   2   -1000024    6
    0.15567282   2    1000022    5
    0.15430289   2    1000023    5
    0.044602   2   -1000037    6
    0.02253224   2    1000025    5

DECAY 2000005  163.67531
    0.60587389   2    1000021    5
    0.19437193   2   -1000024    6
    0.097942781   2    1000022    5
    0.097508471   2    1000023    5
    0.0016864238   2    1000005    25
    0.0016293321   2    1000006   -24
    0.0008037689   2    1000005    23
    0.00011915161   2   -1000037    6

DECAY 1000002  171.9903
    0.80916236   2    1000021    2
    0.1261688   2    1000037    1
    0.063248557   2    1000025    2
    0.0011001194   2    1000024    1
    0.00025228907   2    1000022    2

DECAY 2000002  150.62798
    0.99999559   2    1000021    2

DECAY 1000004  172.00441
    0.80909418   2    1000021    4
    0.12615836   2    1000037    3
    0.063243312   2    1000025    4
    0.0011764481   2    1000024    3
    0.00025603723   2    1000022    4

DECAY 2000004  150.63056
    0.9999777   2    1000021    4

DECAY 1000006  58.631408
    0.31140554   2    1000023    6
    0.30738688   2    1000022    6
    0.30483432   2    1000024    5
    0.04156155   2    1000037    5
    0.020397694   2    1000025    6
    0.01440885   3    1000022    24    5

DECAY 2000006  260.84387
    0.20782164   2    1000024    5
    0.17851028   2    1000021    6
    0.17349848   2    1000005    24
    0.14311161   2    1000006    25
    0.10325907   2    1000023    6
    0.10306547   2    1000022    6
    0.090542773   2    1000006    23
    0.00011913703   2    1000037    5

DECAY 1000024  1.4221006e-12
    0.6651635   2    1000022    211
    0.17127559   3    1000022   -11    12
    0.16356091   3    1000022   -13    14

DECAY 1000037  14.525937
    0.24538833   2    1000023    24
    0.24532265   2    1000024    25
    0.2423748   2    1000024    23
    0.24235751   2    1000022    24
    0.0091373667   3    1000024    6   -6
    0.007595363   3    1000022   -5    6
    0.0072283771   3    1000023   -5    6
    0.00049753937   3    1000024    5   -5

DECAY 1000022 -1


DECAY 1000023  1.2088236e-08
    0.8325408   2    1000022    22
    0.034999728   3    1000022    12   -12
    0.026171509   3    1000022    1   -1
    0.02596078   3    1000022    3   -3
    0.020411921   3    1000022    2   -2
    0.01156698   3    1000024    1   -2
    0.01156698   3   -1000024   -1    2
    0.0059062905   3    1000022    11   -11
    0.0058314975   3    1000022    13   -13
    0.0038557115   3    1000024    11   -12
    0.0038557115   3   -1000024   -11    12
    0.0038218981   3    1000024    13   -14
    0.0038218981   3   -1000024   -13    14
    0.003225866   3    1000024    3   -4
    0.003225866   3   -1000024   -3    4
    0.0027643204   3    1000022    4   -4
    0.0002360468   3    1000024    15   -16
    0.0002360468   3   -1000024   -15    16

DECAY 1000025  16.39896
    0.21624069   2    1000024   -24
    0.21624069   2   -1000024    24
    0.17327892   2    1000023    23
    0.17259412   2    1000022    25
    0.15950194   2    1000023    25
    0.043591867   2    1000022    23
    0.0059949253   3    1000024    5   -6
    0.0059949253   3   -1000024   -5    6
    0.0031198974   3    1000022    6   -6
    0.0029074985   3    1000023    6   -6
    0.00021852357   3    1000023    5   -5
    0.00021386264   3    1000022    5   -5

DECAY 1000035  114.85593
    0.097442083   2    1000015   -15
    0.097442083   2   -1000015    15
    0.06355286   2    2000006   -6
    0.06355286   2   -2000006    6
    0.038442077   2    2000013   -13
    0.038442077   2   -2000013    13
    0.038440919   2    2000011   -11
    0.038440919   2   -2000011    11
    0.027812741   2    1000024   -24
    0.027812741   2   -1000024    24
    0.022147597   2    2000004   -4
    0.022147597   2   -2000004    4
    0.022147589   2    2000002   -2
    0.022147589   2   -2000002    2
    0.019490249   2    37   -1000024
    0.019490249   2   -37    1000024
    0.017584867   2    1000016   -16
    0.017584867   2   -1000016    16
    0.017553352   2    2000015   -15
    0.017553352   2   -2000015    15
    0.016965099   2    1000022    25
    0.01605386   2    1000022    23
    0.015590834   2    1000023    25
    0.012773615   2    1000023    35
    0.011737185   2    1000023    23
    0.01167731   2    1000022    35
    0.011526867   2    1000014   -14
    0.011526867   2   -1000014    14
    0.011526714   2    1000012   -12
    0.011526714   2   -1000012    12
    0.01150133   2    1000013   -13
    0.01150133   2   -1000013    13
    0.011501171   2    1000011   -11
    0.011501171   2   -1000011    11
    0.010375093   2    2000005   -5
    0.010375093   2   -2000005    5
    0.0088488081   2    1000006   -6
    0.0088488081   2   -1000006    6
    0.0079145479   2    1000022    36
    0.0071525717   2    1000023    36
    0.0061710807   2    1000005   -5
    0.0061710807   2   -1000005    5
    0.0021534671   3    1000024    5   -6
    0.0021534671   3   -1000024   -5    6
    0.001703287   2    2000003   -3
    0.001703287   2   -2000003    3
    0.001703263   2    2000001   -1
    0.001703263   2   -2000001    1
    0.001693245   3    1000022    6   -6
    0.0016746973   3    1000023    6   -6
    0.0016351027   2    1000003   -3
    0.0016351027   2   -1000003    3
    0.0016350975   2    1000001   -1
    0.0016350975   2   -1000001    1
    0.0016311218   2    1000004   -4
    0.0016311218   2   -1000004    4
    0.0016311189   2    1000002   -2
    0.0016311189   2   -1000002    2

DECAY 1000021  0.40770569
    0.25812029   3    1000023    6   -6
    0.25397544   3    1000022    6   -6
    0.1259928   3    1000024    5   -6
    0.1259928   3   -1000024   -5    6
    0.10721081   2    1000005   -5
    0.10721081   2   -1000005    5
    0.0050008028   2    1000023    21
    0.0040223569   2    1000022    21
    0.0030372639   3    1000022    5   -5
    0.0030095857   3    1000023    5   -5
    0.0020829889   3    1000037    5   -6
    0.0020829889   3   -1000037   -5    6
    0.0018607805   3    1000025    6   -6

DECAY 25  0.0041273443
    0.54771382   2   -5    5
    0.25513919   2   -24    24
    0.070694845   2    21    21
    0.063312268   2   -15    15
    0.031897053   2    23    23
    0.026856235   2   -4    4
    0.0023317337   2    22    22
    0.0016285744   2    22    23
    0.0002195443   2   -13    13
    0.00020602531   2   -3    3
    5.69639e-07   2   -1    1
    1.3839156e-07   2   -2    2
    4.9355799e-09   2   -11    11

DECAY 35  43.651254
    0.81988978   2   -5    5
    0.17667494   2   -15    15
    0.001369907   2   -1000024    1000024
    0.0006968403   2   -6    6
    0.00060202208   2   -13    13
    0.00035067773   2   -3    3
    0.00026475412   2    1000022    1000022
    6.2966732e-05   2    1000022    1000023
    5.9994227e-05   2    1000023    1000023
    1.7247624e-05   2    21    21
    8.1905002e-06   2    25    25
    1.0234643e-06   2    23    23
    9.6961427e-07   2   -1    1
    5.9087869e-07   2   -24    24
    4.5127384e-08   2    22    23
    3.5745283e-08   2    22    22
    1.3523036e-08   2   -11    11
    9.6360178e-09   2   -4    4
    4.9674502e-14   2   -2    2

DECAY 36  41.89987
    0.81917833   2   -5    5
    0.17652292   2   -15    15
    0.0020462818   2   -1000024    1000024
    0.00073151929   2   -6    6
    0.00060150116   2   -13    13
    0.00041948157   2    1000022    1000022
    0.00035036926   2   -3    3
    7.9537353e-05   2    1000023    1000023
    3.6715005e-05   2    1000022    1000023
    3.0781267e-05   2    21    21
    1.4230403e-06   2    23    25
    9.6876164e-07   2   -1    1
    9.6235405e-08   2    22    22
    4.8947566e-08   2    22    23
    1.3511324e-08   2   -11    11
    9.7329564e-09   2   -4    4
    5.0173045e-14   2   -2    2
    3.2335486e-37   2    25    25

DECAY 37  39.716957
    0.81841144   2   -5    6
    0.17876832   2   -15    16
    0.0012181437   2   -5    4
    0.00063201052   2   -13    14
    0.00046799829   2    1000023    1000024
    0.00034967933   2   -3    4
    0.00012282878   2    1000022    1000024
    1.6287724e-05   2   -3    2
    8.6988082e-06   2   -5    2
    1.9874383e-06   2   -3    6
    1.5091368e-06   2    24    25
    9.7047058e-07   2   -1    2
    6.77791e-08   2   -1    6
    4.5698597e-08   2   -1    4
    1.4782792e-08   2   -11    12
    3.0486894e-12   2    24    35
    2.0387097e-12   2    24    36

DECAY 6  2.43
    1   2    5    24

DECAY 15 -1
