BLOCK SPINFO
   1   SPheno
   2   v4.0.5be

BLOCK SPHENOINFO
   1   2
   2   2

BLOCK MODSEL
   1   0

BLOCK MINPAR
   3    50.978574
   4    1

BLOCK EXTPAR
   0    1645.5638
   1    1771.1526
   2    1359.606
   3    3000
   11    2794.4691
   12    1564.5182
   13    662.61608
   23    440.39055
   25    49.971002
   26    1702.1183
   31    1868.0203
   32    1868.0203
   33    1982.4173
   34    461.65477
   35    461.65477
   36    1718.1563
   41    5000
   42    5000
   43    1951.7688
   44    5000
   45    5000
   46    1404.7288
   47    5000
   48    5000
   49    809.51384

BLOCK SMINPUTS
   1    127.90897
   2    1.1663787e-05
   3    0.1184
   4    91.1876
   5    4.18
   6    173.2
   7    1.777
   8    0
   11    0.00051099893
   12    0
   13    0.10565837
   14    0
   21    0.005
   22    0.0025
   23    0.095
   24    1.27

BLOCK GAUGE Q=  1645.5638
   1    0.35536298
   2    0.66519887
   3    1.219778

BLOCK YU Q=  1645.5638
   1   1    8.3860508e-06
   2   2    0.0042601138
   3   3    1.0131023

BLOCK YD Q=  1645.5638
   1   1    0.00084208474
   2   2    0.01599961
   3   3    0.83508419

BLOCK YE Q=  1645.5638
   1   1    0.00014694994
   2   2    0.030384588
   3   3    0.51101878

BLOCK AU Q=  1645.5638
   1   1    0
   2   2    0
   3   3    2794.4676

BLOCK AD Q=  1645.5638
   1   1    0
   2   2    0
   3   3    1564.5147

BLOCK AE Q=  1645.5638
   1   1    0
   2   2    0
   3   3    662.61631

BLOCK MSOFT Q=  1645.5638
   1    1771.1526
   2    1359.606
   3    3000
   21    2757014.2
   22   -150023.95
   31    1868.0203
   32    1868.0203
   33    1982.4173
   34    461.65477
   35    461.65477
   36    1718.1563
   41    5000
   42    5000
   43    1951.7688
   44    5000
   45    5000
   46    1404.7288
   47    5000
   48    5000
   49    809.51384

BLOCK MASS
   6    173.2
   23    91.1876
   24    80.429995
   15    1.777
   25    122.42446
   35    1701.8311
   36    1702.1183
   37    1704.9165
   1000001    5033.0499
   2000001    5023.9517
   1000002    5032.5969
   2000002    5024.35
   1000003    5033.0551
   2000003    5023.9582
   1000004    5032.6012
   2000004    5024.3506
   1000005    795.31919
   2000005    1963.8815
   1000006    1361.1673
   2000006    1989.3809
   1000011    1876.9841
   2000011    482.13246
   1000012    1874.919
   1000013    1876.9688
   2000013    482.06371
   1000014    1874.9032
   1000015    1715.1459
   2000015    1985.8611
   1000016    1983.509
   1000021    3201.2024
   1000022    442.94616
   1000023   -448.6188
   1000025    1415.9435
   1000035    1764.8489
   1000024    445.33414
   1000037    1416.0021

BLOCK ALPHA
      -0.019806958

BLOCK HMIX Q=  1645.5638
   1    440.39055
   2    49.971002
   3    243.90864
   4    2897206.7

BLOCK STOPMIX
   1   1   -0.20173136
   1   2    0.97944089
   2   1   -0.97944089
   2   2   -0.20173136

BLOCK SBOTMIX
   1   1    0.012108297
   1   2    0.99992669
   2   1   -0.99992669
   2   2    0.012108297

BLOCK STAUMIX
   1   1    0.038250593
   1   2    0.99926818
   2   1   -0.99926818
   2   2    0.038250593

BLOCK NMIX
   1   1   -0.024259502
   1   2    0.058523369
   1   3   -0.70855564
   1   4    0.70280538
   2   1   -0.014002218
   2   2    0.029724946
   2   3    0.70531745
   2   4    0.7081297
   3   1    0.0081173189
   3   2    0.99782372
   3   3    0.020499262
   3   4   -0.062142689
   4   1   -0.99957467
   4   2    0.0062663556
   4   3    0.0074827798
   4   4   -0.027481216

BLOCK UMIX
   1   1   -0.029176787
   1   2    0.99957427
   2   1    0.99957427
   2   2    0.029176787

BLOCK VMIX
   1   1   -0.088406957
   1   2    0.99608444
   2   1    0.99608444
   2   2    0.088406957

BLOCK HIGGSBOUNDSINPUTHIGGSCOUPLINGSFERMIONS
       0, 2497.1011,3,36,15,15

BLOCK HIGGSBOUNDSINPUTHIGGSCOUPLINGSBOSONS
       0,4,36,21,21,23

BLOCK SPHENOLOWENERGY
   1    0.0003626363
   2    1.5854194e-06
   3    3.5204169e-05
   4    2.417715e-15
   5    1.0328069e-10
   6    2.1542745e-08
   7    8.0086406e-14
   8    3.4212355e-09
   9    7.2255684e-07
   10    9.0864415e-05
   11    0.93859462
   12    0.5435172
   13    19.394774
   14    0
   15    0
   16    0.002165806
   17    2.2817503e-15
   18    2.477103e-11
   19    8.2832887e-11
   20    5.3409717e-15
   21    2.2829141e-10
   22    7.4512131e-08
   23    0
   24    0
   25    0
   26    0
   27    0
   28    0
   29    0
   30    0
   31    0
   39    8.3133684e-05
   40    0
   41    0
   42    0

BLOCK FWCOEF Q=  160
   305   4422   0   0   -0.18881911
   305   4422   0   2   -0.23587523
   305   4322   0   2   -0.00051400773
   305   6421   0   0   -0.095227835
   305   6421   0   2   -0.12811496
   305   6321   0   2   -0.00046520418
   3051111   4133   0   0    1.5959618
   3051111   4133   0   2    1.5972825
   3051111   4233   0   2    0.00021191981
   3051111   4137   0   0   -4.4186539
   3051111   4137   0   2   -4.4122883
   3051111   4237   0   2   -0.0016357481
   3051313   4133   0   0    1.5959618
   3051313   4133   0   2    1.5972793
   3051313   4233   0   2    0.00021191143
   3051313   4137   0   0   -4.4186539
   3051313   4137   0   2   -4.4122915
   3051313   4237   0   2   -0.001635749
   3051212   4137   0   0    1.5053501
   3051212   4137   0   2    1.5039686
   3051212   4237   0   2    0.00035617419
   3051414   4137   0   0    1.5053501
   3051414   4137   0   2    1.5039686
   3051414   4237   0   2    0.00035617536
   3051616   4137   0   0    1.5053501
   3051616   4137   0   2    1.5039686
   3051616   4237   0   2    0.00035650525

BLOCK IMFWCOEF Q=  160
   305   4422   0   0    3.8574505e-07
   305   4422   0   2    2.3579942e-05
   305   4322   0   2   -3.7792269e-06
   305   6421   0   0    3.3041615e-07
   305   6421   0   2   -3.6064435e-06
   305   6321   0   2   -1.6012013e-06
   3051111   4133   0   2   -6.5259847e-07
   3051111   4233   0   2    6.3942902e-06
   3051111   4137   0   2    5.6797646e-06
   3051111   4237   0   2   -4.9434155e-05
   3051313   4133   0   2   -6.5258973e-07
   3051313   4233   0   2    6.3942377e-06
   3051313   4137   0   2    5.6797844e-06
   3051313   4237   0   2   -4.9434268e-05
   3051212   4137   0   2   -1.1575744e-06
   3051212   4237   0   2    1.0763935e-05
   3051414   4137   0   2   -1.1575746e-06
   3051414   4237   0   2    1.0763935e-05
   3051616   4137   0   2   -1.1573071e-06
   3051616   4237   0   2    1.0763934e-05

DECAY 23  2.4952


DECAY 24  2.085


DECAY 2000011  4.3234969e-05
    0.80203166   2    1000022    11
    0.19786516   2    1000023    11
    0.00010318522   2   -1000024    12

DECAY 1000011  4.6681338
    0.65657743   2   -1000037    12
    0.33006161   2    1000025    11
    0.0066224815   2    1000035    11
    0.0032763668   2    1000022    11
    0.0026834911   2   -1000024    12
    0.00077861436   2    1000023    11

DECAY 2000013  0.00041979032
    0.45277774   2   -1000024    14
    0.33830565   2    1000022    13
    0.20891661   2    1000023    13

DECAY 1000013  4.6994547
    0.65216825   2   -1000037    14
    0.32784585   2    1000025    13
    0.0065766548   2    1000035    13
    0.0065383818   2    1000022    13
    0.0040177404   2    1000023    13
    0.0026655795   2   -1000024    14
    0.00018754595   2    2000013    25

DECAY 1000015  15.517393
    0.49970966   2   -1000024    16
    0.2531663   2    1000022    15
    0.24708199   2    1000023    15

DECAY 2000015  15.86348
    0.29376674   2    1000022    15
    0.29269969   2    1000023    15
    0.26613142   2   -1000037    16
    0.13385423   2    1000025    15
    0.006810842   2    1000035    15
    0.0033813444   2    1000015    25
    0.0033556864   2    1000015    23

DECAY 1000012  4.7202503
    0.64034786   2    1000037    11
    0.31857648   2    1000025    12
    0.024332504   2    1000024    11
    0.0079642636   2    1000022    12
    0.0066279946   2    1000035    12
    0.0021508976   2    1000023    12

DECAY 1000014  4.7506369
    0.63621968   2    1000037    13
    0.31652196   2    1000025    14
    0.03062418   2    1000024    13
    0.0079132393   2    1000022    14
    0.0065838219   2    1000035    14
    0.0021371174   2    1000023    14

DECAY 1000016  15.917051
    0.5909562   2    1000024    15
    0.26188072   2    1000037    15
    0.13020049   2    1000025    16
    0.0069480794   2    1000035    16
    0.0068007749   2    1000015    24
    0.0025301749   2    1000022    16
    0.00068355458   2    1000023    16

DECAY 2000001  142.0715
    0.98482503   2    1000021    1
    0.015157632   2    1000035    1

DECAY 1000001  197.77377
    0.71223783   2    1000021    1
    0.18980216   2   -1000037    2
    0.094296521   2    1000025    1
    0.0029254283   2    1000035    1
    0.00043571993   2    1000022    1
    0.00018773435   2   -1000024    2
    0.000114607   2    1000023    1

DECAY 2000003  142.12241
    0.98447705   2    1000021    3
    0.015152242   2    1000035    3
    0.00017705599   2   -1000024    4
    0.00010041631   2    1000022    3

DECAY 1000003  197.80134
    0.7121413   2    1000021    3
    0.18977603   2   -1000037    4
    0.094283559   2    1000025    3
    0.0029250311   2    1000035    3
    0.00049953346   2    1000022    3
    0.00019667727   2   -1000024    4
    0.00017786103   2    1000023    3

DECAY 1000005  9.3036069
    0.44238442   2   -1000024    6
    0.28360579   2    1000022    5
    0.27400979   2    1000023    5

DECAY 2000005  95.048531
    0.36984674   2   -1000024    6
    0.30102369   2    1000006   -24
    0.12977937   2    1000022    5
    0.12829476   2    1000023    5
    0.042617741   2   -1000037    6
    0.020868934   2    1000025    5
    0.0051557711   2    1000005    25
    0.0022970101   2    1000005    23
    0.00011597504   2    1000035    5

DECAY 2000002  148.58122
    0.94195612   2    1000021    2
    0.057981335   2    1000035    2

DECAY 1000002  197.76569
    0.71202863   2    1000021    2
    0.18846406   2    1000037    1
    0.094836916   2    1000025    2
    0.0025407627   2    1000035    2
    0.0017238835   2    1000024    1
    0.00032399807   2    1000022    2

DECAY 2000004  148.5848
    0.9419335   2    1000021    4
    0.057979956   2    1000035    4

DECAY 1000004  197.79307
    0.71193196   2    1000021    4
    0.18843828   2    1000037    3
    0.094823923   2    1000025    4
    0.0025404175   2    1000035    4
    0.0018507335   2    1000024    3
    0.00032841719   2    1000022    4

DECAY 1000006  42.842155
    0.49528271   2    1000024    5
    0.25470037   2    1000023    6
    0.24991138   2    1000022    6

DECAY 2000006  101.08037
    0.26008336   2    1000024    5
    0.17706697   2    1000023    6
    0.17643699   2    1000022    6
    0.17377868   2    1000006    25
    0.15056856   2    1000006    23
    0.038006736   2    1000037    5
    0.019521966   2    1000025    6
    0.0043850899   2    1000005    24
    0.00015163484   2    1000035    6

DECAY 1000024  7.005626e-11
    0.52156363   3    1000022   -1    2
    0.17386157   3    1000022   -11    12
    0.17224424   3    1000022   -13    14
    0.12530937   3    1000022   -3    4
    0.0070211887   3    1000022   -15    16

DECAY 1000037  12.440459
    0.24690458   2    1000023    24
    0.24649738   2    1000024    25
    0.2429986   2    1000024    23
    0.24196192   2    1000022    24
    0.0070333375   3    1000024    6   -6
    0.006397576   3    1000022   -5    6
    0.0062581569   3    1000023   -5    6
    0.00095482307   2    1000006   -5
    0.00044759948   3    1000024    5   -5
    0.00043539858   2   -1000005    6

DECAY 1000022 -1


DECAY 1000023  5.4484663e-08
    0.6770626   2    1000022    22
    0.074710124   3    1000022    12   -12
    0.055866308   3    1000022    1   -1
    0.055684092   3    1000022    3   -3
    0.043570745   3    1000022    2   -2
    0.02176162   3    1000022    4   -4
    0.012605752   3    1000022    11   -11
    0.012552161   3    1000022    13   -13
    0.009815505   3    1000024    1   -2
    0.009815505   3   -1000024   -1    2
    0.0047620317   3    1000024    3   -4
    0.0047620317   3   -1000024   -3    4
    0.003271876   3    1000024    11   -12
    0.003271876   3   -1000024   -11    12
    0.003256373   3    1000024    13   -14
    0.003256373   3   -1000024   -13    14
    0.0024538617   3    1000022    15   -15
    0.00076058114   3    1000024    15   -16
    0.00076058114   3   -1000024   -15    16

DECAY 1000025  14.072967
    0.2188531   2    1000024   -24
    0.2188531   2   -1000024    24
    0.17241872   2    1000023    23
    0.16988517   2    1000022    25
    0.16075573   2    1000023    25
    0.043216007   2    1000022    23
    0.0050596583   3    1000024    5   -6
    0.0050596583   3   -1000024   -5    6
    0.002534376   3    1000022    6   -6
    0.0023919566   3    1000023    6   -6
    0.00021528937   3    1000023    5   -5
    0.00021343418   3    1000022    5   -5
    0.00018808699   2    1000005   -5
    0.00018808699   2   -1000005    5

DECAY 1000035  24.185057
    0.15686121   2    2000013   -13
    0.15686121   2   -2000013    13
    0.15685398   2    2000011   -11
    0.15685398   2   -2000011    11
    0.048100024   2    1000024   -24
    0.048100024   2   -1000024    24
    0.038905347   2    1000023    23
    0.038759129   2    1000005   -5
    0.038759129   2   -1000005    5
    0.035632479   2    1000006   -6
    0.035632479   2   -1000006    6
    0.034637207   2    1000022    25
    0.03274457   2    1000023    25
    0.012546045   2    1000022    23
    0.0016963542   3    1000024    5   -6
    0.0016963542   3   -1000024   -5    6
    0.00098053031   3    1000022    6   -6
    0.00093945556   3    1000023    6   -6
    0.00067546812   2    1000037   -24
    0.00067546812   2   -1000037    24
    0.00065110581   2    1000025    25
    0.00056268754   2    1000015   -15
    0.00056268754   2   -1000015    15
    0.00012353387   3    1000023    5   -5
    0.0001206792   3    1000022    5   -5

DECAY 1000021  221.89176
    0.18795988   2    1000005   -5
    0.18795988   2   -1000005    5
    0.15050071   2    1000006   -6
    0.15050071   2   -1000006    6
    0.083050675   2    2000005   -5
    0.083050675   2   -2000005    5
    0.074409235   2    2000006   -6
    0.074409235   2   -2000006    6
    0.003966838   2    1000006   -4
    0.003966838   2   -1000006    4

DECAY 25  0.0035967534
    0.61356914   2   -5    5
    0.18663019   2   -24    24
    0.073440263   2    21    21
    0.070793219   2   -15    15
    0.030048272   2   -4    4
    0.021450468   2    23    23
    0.0023168734   2    22    22
    0.0012734539   2    22    23
    0.00024566143   2   -13    13
    0.00023165729   2   -3    3
    6.4051005e-07   2   -1    1
    1.5485409e-07   2   -2    2
    5.5227785e-09   2   -11    11

DECAY 35  46.610132
    0.78948952   2   -5    5
    0.20672074   2   -15    15
    0.0016195841   2   -1000024    1000024
    0.00073087396   2   -13    13
    0.00050952503   2    1000022    1000022
    0.00040844032   2   -3    3
    0.00025589414   2   -6    6
    0.00014050068   2    1000023    1000023
    9.4180511e-05   2    1000022    1000023
    1.8186129e-05   2    21    21
    9.5751623e-06   2    25    25
    1.1292947e-06   2   -1    1
    9.5708601e-07   2    23    23
    6.3966684e-07   2   -24    24
    7.1438551e-08   2   -1000011    1000011
    7.0263856e-08   2   -1000013    1000013
    5.7304068e-08   2    22    23
    3.2446153e-08   2    22    22
    1.6417901e-08   2   -11    11
    5.1032229e-09   2   -4    4
    2.6314942e-14   2   -2    2

DECAY 36  44.712589
    0.78867968   2   -5    5
    0.20650797   2   -15    15
    0.0023614792   2   -1000024    1000024
    0.00077901865   2    1000022    1000022
    0.00073012109   2   -13    13
    0.00040800794   2   -3    3
    0.00025481434   2   -6    6
    0.00018550786   2    1000023    1000023
    5.6312523e-05   2    1000022    1000023
    3.4457851e-05   2    21    21
    1.321076e-06   2    23    25
    1.128099e-06   2   -1    1
    1.0754171e-07   2    22    22
    5.29276e-08   2    22    23
    1.6400967e-08   2   -11    11
    4.8686192e-09   2   -4    4
    2.5101222e-14   2   -2    2
    3.0298543e-38   2    25    25

DECAY 37  44.266905
    0.7971091   2   -5    6
    0.20016765   2   -15    16
    0.0011900763   2   -5    4
    0.00070766516   2   -13    14
    0.00039482654   2   -3    4
    0.00036197699   2    1000023    1000024
    3.7841559e-05   2    1000022    1000024
    1.836768e-05   2   -3    2
    8.4983798e-06   2   -5    2
    1.4472073e-06   2   -3    6
    1.3436912e-06   2    24    25
    1.0958035e-06   2   -1    2
    5.1201083e-08   2   -1    4
    4.011743e-08   2   -1    6
    1.6552362e-08   2   -11    12
    8.5878362e-12   2    24    35
    5.2693316e-12   2    24    36

DECAY 6  2.43
    1   2    5    24

DECAY 15 -1
