BLOCK SPINFO
   1   SPheno
   2   v4.0.5be

BLOCK SPHENOINFO
   1   2
   2   2

BLOCK MODSEL
   1   0

BLOCK MINPAR
   3    22.092371
   4    1

BLOCK EXTPAR
   0    3662.9558
   1    2677.3826
   2    989.15872
   3    2166.006
   11   -1693.3974
   12    3601.9584
   13    3592.1791
   23    584.77881
   25    21.141403
   26    4886.108
   31    1370.9371
   32    1370.9371
   33    3729.3693
   34    3496.666
   35    3496.666
   36    3126.3829
   41    3147.5291
   42    3147.5291
   43    3408.4237
   44    4285.3215
   45    4285.3215
   46    3858.8228
   47    851.66427
   48    851.66427
   49    4238.4874

BLOCK SMINPUTS
   1    127.90897
   2    1.1663787e-05
   3    0.1184
   4    91.1876
   5    4.18
   6    173.2
   7    1.777
   8    0
   11    0.00051099893
   12    0
   13    0.10565837
   14    0
   21    0.005
   22    0.0025
   23    0.095
   24    1.27

BLOCK GAUGE Q=  3662.9558
   1    0.35536298
   2    0.66519887
   3    1.219778

BLOCK YU Q=  3662.9558
   1   1    8.3937463e-06
   2   2    0.0042640231
   3   3    1.014032

BLOCK YD Q=  3662.9558
   1   1    0.0003565906
   2   2    0.0067752213
   3   3    0.35362613

BLOCK YE Q=  3662.9558
   1   1    6.2227667e-05
   2   2    0.012866708
   3   3    0.21639686

BLOCK AU Q=  3662.9558
   1   1    0
   2   2    0
   3   3   -1693.3976

BLOCK AD Q=  3662.9558
   1   1    0
   2   2    0
   3   3    3601.9587

BLOCK AE Q=  3662.9558
   1   1    0
   2   2    0
   3   3    3592.1789

BLOCK MSOFT Q=  3662.9558
   1    2677.3826
   2    989.15872
   3    2166.006
   21    23486854
   22    4342.479
   31    1370.9371
   32    1370.9371
   33    3729.3693
   34    3496.666
   35    3496.666
   36    3126.3829
   41    3147.5291
   42    3147.5291
   43    3408.4237
   44    4285.3215
   45    4285.3215
   46    3858.8228
   47    851.66427
   48    851.66427
   49    4238.4874

BLOCK MASS
   6    173.2
   23    91.1876
   24    80.429995
   15    1.777
   25    120.99605
   35    4885.1563
   36    4886.108
   37    4886.0707
   1000001    3238.5766
   2000001    1069.8029
   1000002    3237.573
   2000002    4351.1151
   1000003    3238.5752
   2000003    1069.7986
   1000004    3237.5717
   2000004    4351.1143
   1000005    3461.8578
   2000005    4297.4306
   1000006    3460.6505
   2000006    3877.0876
   1000011    1385.9761
   2000011    3507.1309
   1000012    1383.2638
   1000013    1385.9644
   2000013    3507.1186
   1000014    1383.252
   1000015    3134.3457
   2000015    3736.7357
   1000016    3735.4452
   1000021    2443.1495
   1000022    575.71982
   1000023   -585.7566
   1000025    1041.2357
   1000035    2651.5627
   1000024    577.9357
   1000037    1041.3961

BLOCK ALPHA
      -0.045277892

BLOCK HMIX Q=  3662.9558
   1    584.77881
   2    21.141403
   3    243.03442
   4    23874052

BLOCK STOPMIX
   1   1    0.99623062
   1   2    0.086744124
   2   1   -0.086744124
   2   2    0.99623062

BLOCK SBOTMIX
   1   1    0.99999502
   1   2    0.0031572754
   2   1   -0.0031572754
   2   2    0.99999502

BLOCK STAUMIX
   1   1    0.0038066573
   1   2    0.99999275
   2   1   -0.99999275
   2   2    0.0038066573

BLOCK NMIX
   1   1    0.015581109
   1   2   -0.12893922
   1   3    0.70556307
   1   4   -0.69664386
   2   1    0.0092217681
   2   2   -0.033231934
   2   3   -0.70534806
   2   4   -0.70802169
   3   1    0.0031912833
   3   2    0.99109515
   3   3    0.068137439
   3   4   -0.11435694
   4   1   -0.99983099
   4   2    0.00084753529
   4   3    0.0047071405
   4   4   -0.017751641

BLOCK UMIX
   1   1   -0.096878786
   1   2    0.99529619
   2   1    0.99529619
   2   2    0.096878786

BLOCK VMIX
   1   1   -0.16266847
   1   2    0.98668078
   2   1    0.98668078
   2   2    0.16266847

BLOCK HIGGSBOUNDSINPUTHIGGSCOUPLINGSFERMIONS
       0, 446.95892,3,36,15,15

BLOCK HIGGSBOUNDSINPUTHIGGSCOUPLINGSBOSONS
       0,4,36,21,21,23

BLOCK SPHENOLOWENERGY
   1    0.00031853905
   2    1.5902659e-06
   3    3.5247602e-05
   4    2.6176113e-15
   5    1.1182135e-10
   6    2.3406229e-08
   7    8.8105317e-14
   8    3.7638554e-09
   9    7.9827055e-07
   10    9.6688087e-05
   11    0.99875092
   12    0.54205913
   13    19.367622
   14    0
   15    0
   16    0.002157604
   17    2.2816613e-15
   18    2.4794632e-11
   19    8.2893512e-11
   20    3.2665818e-15
   21    1.3966273e-10
   22    1.2860418e-08
   23    0
   24    0
   25    0
   26    0
   27    0
   28    0
   29    0
   30    0
   31    0
   39    5.3130491e-05
   40    0
   41    0
   42    0

BLOCK FWCOEF Q=  160
   305   4422   0   0   -0.18881911
   305   4422   0   2   -0.18616512
   305   4322   0   2    5.8489941e-05
   305   6421   0   0   -0.095227835
   305   6421   0   2   -0.097224245
   305   6321   0   2   -4.1451835e-05
   3051111   4133   0   0    1.6233478
   3051111   4133   0   2    1.6237316
   3051111   4233   0   2    8.7053972e-05
   3051111   4137   0   0   -4.4460399
   3051111   4137   0   2   -4.4438536
   3051111   4237   0   2   -0.00065017362
   3051313   4133   0   0    1.6233478
   3051313   4133   0   2    1.6237312
   3051313   4233   0   2    8.7053934e-05
   3051313   4137   0   0   -4.4460399
   3051313   4137   0   2   -4.443854
   3051313   4237   0   2   -0.00065017377
   3051212   4137   0   0    1.5053501
   3051212   4137   0   2    1.5048875
   3051212   4237   0   2    0.00014069585
   3051414   4137   0   0    1.5053501
   3051414   4137   0   2    1.5048875
   3051414   4237   0   2    0.00014069585
   3051616   4137   0   0    1.5053501
   3051616   4137   0   2    1.5048873
   3051616   4237   0   2    0.00014069664

BLOCK IMFWCOEF Q=  160
   305   4422   0   0    3.8582642e-07
   305   4422   0   2    1.1643404e-05
   305   4322   0   2    2.0592097e-06
   305   6421   0   0    3.3048584e-07
   305   6421   0   2   -2.8665547e-06
   305   6321   0   2    6.4815309e-07
   3051111   4133   0   2    2.695339e-07
   3051111   4233   0   2    1.6551591e-06
   3051111   4137   0   2   -1.4298714e-06
   3051111   4237   0   2   -1.2358634e-05
   3051313   4133   0   2    2.6949994e-07
   3051313   4233   0   2    1.6551585e-06
   3051313   4137   0   2   -1.4298449e-06
   3051313   4237   0   2   -1.2358637e-05
   3051212   4137   0   2    4.9916595e-07
   3051212   4237   0   2    2.6743777e-06
   3051414   4137   0   2    4.9916559e-07
   3051414   4237   0   2    2.6743777e-06
   3051616   4137   0   2    4.9552163e-07
   3051616   4237   0   2    2.6743867e-06

DECAY 23  2.4952


DECAY 24  2.085


DECAY 1000011  3.5746624
    0.64104485   2   -1000037    12
    0.31917155   2    1000025    11
    0.021862427   2   -1000024    12
    0.016998688   2    1000022    11
    0.00092248827   2    1000023    11

DECAY 2000011  3.238486
    0.99826569   2    1000035    11
    0.0012508274   2    1000022    11
    0.00043732862   2    1000023    11

DECAY 1000013  3.5775726
    0.64048988   2   -1000037    14
    0.31889666   2    1000025    13
    0.021844303   2   -1000024    14
    0.017419064   2    1000022    13
    0.0013500879   2    1000023    13

DECAY 2000013  3.260388
    0.99153774   2    1000035    13
    0.0033215264   2   -1000024    14
    0.0029122509   2    1000022    13
    0.0020999999   2    1000023    13

DECAY 1000015  6.7215515
    0.40248693   2   -1000024    16
    0.20309237   2    1000022    15
    0.20130502   2    1000023    15
    0.1893635   2    1000035    15
    0.0024975111   2   -1000037    16
    0.0012546674   2    1000025    15

DECAY 2000015  46.524456
    0.59596536   2   -1000037    16
    0.29680557   2    1000025    15
    0.040285072   2    1000022    15
    0.035721473   2    1000023    15
    0.024782964   2    1000035    15
    0.0061623171   2   -1000024    16
    0.00013904403   2    1000015    23
    0.00013819528   2    1000015    25

DECAY 1000012  3.6481303
    0.60984412   2    1000037    11
    0.30684627   2    1000025    12
    0.060178854   2    1000024    11
    0.021494065   2    1000022    12
    0.0016366943   2    1000023    12

DECAY 1000014  3.6510291
    0.60933037   2    1000037    13
    0.30658638   2    1000025    14
    0.060971219   2    1000024    13
    0.021476663   2    1000022    14
    0.0016353687   2    1000023    14

DECAY 1000016  46.551214
    0.58556029   2    1000037    15
    0.29410034   2    1000025    16
    0.088347986   2    1000024    15
    0.02488147   2    1000035    16
    0.0063421985   2    1000022    16
    0.00048929359   2    1000023    16
    0.00027842484   2    1000015    24

DECAY 2000001  0.00010077644
    0.73281724   2    1000022    1
    0.25367357   2    1000023    1
    0.013340638   2   -1000024    2
    0.00016785901   2    1000025    1

DECAY 1000001  81.959175
    0.57911088   2    1000021    1
    0.27700729   2   -1000037    2
    0.1371892   2    1000025    1
    0.0030601048   2   -1000024    2
    0.0028296797   2    1000022    1
    0.00060487811   2    1000035    1
    0.00019796029   2    1000023    1

DECAY 2000003  0.0010671623
    0.45478351   2   -1000024    4
    0.29847475   2    1000022    3
    0.24669079   2    1000023    3

DECAY 1000003  81.96292
    0.57908284   2    1000021    3
    0.27699482   2   -1000037    4
    0.13718299   2    1000025    3
    0.0030729402   2   -1000024    4
    0.002846337   2    1000022    3
    0.00060484831   2    1000035    3
    0.00021470462   2    1000023    3

DECAY 1000005  181.39936
    0.37952627   2    1000021    5
    0.35799676   2   -1000024    6
    0.14754316   2   -1000037    6
    0.068343608   2    1000025    5
    0.023755567   2    1000022    5
    0.022375297   2    1000023    5
    0.00045934439   2    1000035    5

DECAY 2000005  176.91239
    0.87824312   2    1000021    5
    0.057473661   2   -1000024    6
    0.028973614   2    1000023    5
    0.028969804   2    1000022    5
    0.0052007073   2    1000035    5
    0.00056409472   2   -1000037    6
    0.00027995622   2    1000025    5
    0.00012933245   2    1000006   -24
    0.00010093258   2    1000005    25

DECAY 1000002  81.918909
    0.57826769   2    1000021    2
    0.2722429   2    1000037    1
    0.1375095   2    1000025    2
    0.0086288196   2    1000024    1
    0.0025965944   2    1000022    2
    0.00059208127   2    1000035    2
    0.00016241419   2    1000023    2

DECAY 2000002  164.86356
    0.97669743   2    1000021    2
    0.023283387   2    1000035    2

DECAY 1000004  81.922521
    0.57823952   2    1000021    4
    0.27223103   2    1000037    3
    0.13750353   2    1000025    4
    0.0086618241   2    1000024    3
    0.0026029418   2    1000022    4
    0.00059204903   2    1000035    4
    0.00016910067   2    1000023    4

DECAY 2000004  164.86644
    0.97667947   2    1000021    4
    0.023282963   2    1000035    4

DECAY 1000006  183.34427
    0.37635786   2    1000021    6
    0.18184035   2    1000023    6
    0.17921051   2    1000022    6
    0.12740953   2    1000037    5
    0.069012903   2    1000025    6
    0.05704352   2    1000024    5
    0.0086482667   3    1000022    24    5
    0.00047423137   2    1000035    6

DECAY 2000006  266.36915
    0.40633949   2    1000021    6
    0.2701564   2    1000024    5
    0.14164159   2    1000023    6
    0.13575829   2    1000022    6
    0.012207066   2    1000037    5
    0.0091683156   2    1000035    6
    0.0088108625   2    1000005    24
    0.0060759752   2    1000025    6
    0.0055052955   2    1000006    25
    0.0043367212   2    1000006    23

DECAY 1000024  4.7945922e-11
    0.53957492   3    1000022   -1    2
    0.17988483   3    1000022   -11    12
    0.17786442   3    1000022   -13    14
    0.099485919   3    1000022   -3    4
    0.0031899095   3    1000022   -15    16

DECAY 1000037  8.5898104
    0.26644902   2    1000023    24
    0.2488609   2    1000022    24
    0.24765194   2    1000024    23
    0.23240356   2    1000024    25
    0.0021062033   3    1000022   -5    6
    0.0018580068   3    1000023   -5    6
    0.00066921279   3    1000024    6   -6

DECAY 1000022 -1


DECAY 1000023  7.4405109e-07
    0.31751084   2    1000022    22
    0.093729944   3    1000022    12   -12
    0.070087019   3    1000022    1   -1
    0.070014287   3    1000022    3   -3
    0.054662221   3    1000022    2   -2
    0.054206974   3    1000024    1   -2
    0.054206974   3   -1000024   -1    2
    0.047689817   3    1000024    3   -4
    0.047689817   3   -1000024   -3    4
    0.044133355   3    1000022    4   -4
    0.018069231   3    1000024    11   -12
    0.018069231   3   -1000024   -11    12
    0.018052855   3    1000024    13   -14
    0.018052855   3   -1000024   -13    14
    0.015816268   3    1000022    11   -11
    0.01579042   3    1000022    13   -13
    0.014117923   3    1000024    15   -16
    0.014117923   3   -1000024   -15    16
    0.0099416777   3    1000022    15   -15
    0.0040403706   3    1000022    5   -5

DECAY 1000025  10.141358
    0.21620492   2    1000024   -24
    0.21620492   2   -1000024    24
    0.21206971   2    1000023    23
    0.179558   2    1000022    25
    0.15882946   2    1000023    25
    0.013290854   2    1000022    23
    0.0017888556   3    1000024    5   -6
    0.0017888556   3   -1000024   -5    6
    0.00014045629   3    1000022    6   -6
    0.00010256869   3    1000023    6   -6

DECAY 1000035  21.411238
    0.082077457   2    1000024   -24
    0.082077457   2   -1000024    24
    0.072668478   2    2000003   -3
    0.072668478   2   -2000003    3
    0.072668249   2    2000001   -1
    0.072668249   2   -2000001    1
    0.06446756   2    1000023    23
    0.057376921   2    1000022    25
    0.050063675   2    1000023    25
    0.041323383   2    1000014   -14
    0.041323383   2   -1000014    14
    0.041322858   2    1000012   -12
    0.041322858   2   -1000012    12
    0.040941487   2    1000013   -13
    0.040941487   2   -1000013    13
    0.040940962   2    1000011   -11
    0.040940962   2   -1000011    11
    0.021002525   2    1000022    23
    0.0036203302   3    1000024    5   -6
    0.0036203302   3   -1000024   -5    6
    0.003448686   2    1000037   -24
    0.003448686   2   -1000037    24
    0.0028860489   2    1000025    25
    0.0026401704   3    1000022    6   -6
    0.0025117939   3    1000023    6   -6
    0.0005256687   2    1000025    23
    0.00014522201   3    1000037    5   -6
    0.00014522201   3   -1000037   -5    6

DECAY 1000021  94.57611
    0.24976791   2    2000003   -3
    0.24976791   2   -2000003    3
    0.24976694   2    2000001   -1
    0.24976694   2   -2000001    1
    0.00013419403   3    1000024    5   -6
    0.00013419403   3   -1000024   -5    6
    0.00012005088   3    1000023    6   -6
    0.00011506361   3    1000022    6   -6

DECAY 25  0.003418903
    0.63163023   2   -5    5
    0.16713216   2   -24    24
    0.075008306   2    21    21
    0.072281528   2   -15    15
    0.031304329   2   -4    4
    0.018663328   2    23    23
    0.0023266477   2    22    22
    0.0011645678   2    22    23
    0.00025075332   2   -13    13
    0.00023733431   2   -3    3
    6.562061e-07   2   -1    1
    1.6133188e-07   2   -2    2
    5.6372684e-09   2   -11    11

DECAY 35  85.62766
    0.28011352   2   -5    5
    0.20112593   2   -1000024    1000037
    0.20112593   2   -1000037    1000024
    0.11649003   2    1000023    1000025
    0.084338542   2    1000022    1000025
    0.056968883   2   -15    15
    0.020018189   2    1000023    1000035
    0.012405395   2   -1000024    1000024
    0.011346401   2    1000022    1000035
    0.0043163269   2    1000022    1000022
    0.0042486564   2   -6    6
    0.0034366665   2   -1000037    1000037
    0.0017132499   2    1000025    1000025
    0.0015813707   2    1000022    1000023
    0.00035645517   2    1000023    1000023
    0.00020242116   2   -13    13
    0.0001070081   2    1000025    1000035
    0.0001005652   2   -3    3
    2.1417804e-06   2    25    25
    5.5030369e-07   2    21    21
    3.2508762e-07   2    23    23
    2.7802665e-07   2   -1    1
    1.0867291e-07   2   -1000011    1000011
    1.0840719e-07   2   -1000013    1000013
    5.6966682e-08   2   -4    4
    5.6010981e-08   2    22    23
    5.5081442e-08   2   -24    24
    2.6548269e-08   2   -1000001    1000001
    2.6513083e-08   2   -1000003    1000003
    2.536527e-08   2    22    22
    4.545591e-09   2   -11    11
    6.3705976e-10   2   -2000003    1000003
    6.3705976e-10   2   -1000003    2000003
    2.1387572e-10   2   -2000013    1000013
    2.1387572e-10   2   -1000013    2000013
    1.7646639e-12   2   -2000001    1000001
    1.7646639e-12   2   -1000001    2000001
    2.9362386e-13   2   -2    2
    5.0025706e-15   2   -2000011    1000011
    5.0025706e-15   2   -1000011    2000011

DECAY 36  84.139414
    0.27065307   2   -5    5
    0.20249532   2   -1000024    1000037
    0.20249532   2   -1000037    1000024
    0.11348316   2    1000022    1000025
    0.089244004   2    1000023    1000025
    0.055046197   2   -15    15
    0.020213452   2    1000022    1000035
    0.014933989   2   -1000024    1000024
    0.011517488   2    1000023    1000035
    0.0056643281   2   -1000037    1000037
    0.0055626033   2    1000022    1000022
    0.0038331458   2   -6    6
    0.0028149661   2    1000025    1000025
    0.0011127085   2    1000022    1000023
    0.00032099695   2    1000023    1000023
    0.00030992023   2    1000025    1000035
    0.00019559085   2   -13    13
    9.7171139e-05   2   -3    3
    5.2322983e-06   2    21    21
    8.8921954e-07   2    23    25
    2.6864169e-07   2   -1    1
    7.9261917e-08   2    22    23
    5.2392067e-08   2    22    22
    5.1181481e-08   2   -4    4
    4.3922021e-09   2   -11    11
    6.4886072e-10   2   -2000003    1000003
    6.4886072e-10   2   -1000003    2000003
    2.2328454e-10   2   -2000013    1000013
    2.2328454e-10   2   -1000013    2000013
    1.7973527e-12   2   -2000001    1000001
    1.7973527e-12   2   -1000001    2000001
    2.6381196e-13   2   -2    2
    5.2226435e-15   2   -2000011    1000011
    5.2226435e-15   2   -1000011    2000011
    1.9901981e-38   2    25    25

DECAY 37  85.913043
    0.28780991   2   -5    6
    0.21042161   2    1000022    1000037
    0.2069053   2    1000024    1000025
    0.20314677   2    1000023    1000037
    0.05551121   2   -15    16
    0.030775675   2    1000024    1000035
    0.004157881   2    1000023    1000024
    0.00042091298   2   -5    4
    0.00041270375   2    1000035    1000037
    0.00019625186   2   -13    14
    0.00013361066   2    1000022    1000024
    9.2146907e-05   2   -3    4
    6.3692882e-06   2   -3    6
    4.3364499e-06   2   -3    2
    3.0057518e-06   2   -5    2
    8.7104539e-07   2    24    25
    4.2562266e-07   2   -1000011    1000012
    4.2525123e-07   2   -1000013    1000014
    2.8581132e-07   2   -1    6
    2.5552808e-07   2   -1    2
    1.8470739e-08   2    1000025    1000037
    1.4598724e-08   2   -1    4
    4.5903514e-09   2   -11    12
    1.2017443e-09   2   -1000003    1000004
    4.6646268e-10   2   -2000013    1000014
    6.4371667e-11   2   -1000003    1000002
    2.1544025e-11   2   -1000003    2000006
    3.3344953e-12   2   -1000001    1000002
    2.9433217e-12   2   -1000003    1000006
    1.7809153e-13   2   -1000001    1000004
    1.091063e-14   2   -2000011    1000012
    2.7370711e-15   2   -1000001    2000006
    3.7393574e-16   2   -1000001    1000006

DECAY 6  2.43
    1   2    5    24

DECAY 15 -1
