BLOCK SPINFO
   1   SPheno
   2   v4.0.5be

BLOCK SPHENOINFO
   1   2
   2   2

BLOCK MODSEL
   1   0

BLOCK MINPAR
   3    13.911704
   4    1

BLOCK EXTPAR
   0    3730.1433
   1   -460.26992
   2    2243.0999
   3    4802.0912
   11    5878.1643
   12    2608.2889
   13    5428.8363
   23    3985.2685
   25    13.226472
   26    4608.5049
   31    4913.9181
   32    4913.9181
   33    842.17558
   34    2467.5067
   35    2467.5067
   36    4150.3374
   41    2749.7293
   42    2749.7293
   43    4344.2438
   44    2103.3745
   45    2103.3745
   46    2993.2208
   47    3293.946
   48    3293.946
   49    4256.7829

BLOCK SMINPUTS
   1    127.90897
   2    1.1663787e-05
   3    0.1184
   4    91.1876
   5    4.18
   6    173.2
   7    1.777
   8    0
   11    0.00051099893
   12    0
   13    0.10565837
   14    0
   21    0.005
   22    0.0025
   23    0.095
   24    1.27

BLOCK GAUGE Q=  3730.1433
   1    0.35536298
   2    0.66519887
   3    1.219778

BLOCK YU Q=  3730.1433
   1   1    8.4083016e-06
   2   2    0.0042714172
   3   3    1.0157904

BLOCK YD Q=  3730.1433
   1   1    0.00022347686
   2   2    0.0042460603
   3   3    0.22161902

BLOCK YE Q=  3730.1433
   1   1    3.8998346e-05
   2   2    0.0080636211
   3   3    0.13561684

BLOCK AU Q=  3730.1433
   1   1    0
   2   2    0
   3   3    5878.1643

BLOCK AD Q=  3730.1433
   1   1    0
   2   2    0
   3   3    2608.289

BLOCK AE Q=  3730.1433
   1   1    0
   2   2    0
   3   3    5428.8363

BLOCK MSOFT Q=  3730.1433
   1   -460.26992
   2    2243.0999
   3    4802.0912
   21    5032141.1
   22   -15577624
   31    4913.9181
   32    4913.9181
   33    842.17558
   34    2467.5067
   35    2467.5067
   36    4150.3374
   41    2749.7293
   42    2749.7293
   43    4344.2438
   44    2103.3745
   45    2103.3745
   46    2993.2208
   47    3293.946
   48    3293.946
   49    4256.7829

BLOCK MASS
   6    173.2
   23    91.1876
   24    80.429995
   15    1.777
   25    123.87359
   35    4608.469
   36    4608.5049
   37    4609.4883
   1000001    2926.3106
   2000001    3441.8691
   1000002    2925.2351
   2000002    2268.8228
   1000003    2926.3102
   2000003    3441.8685
   1000004    2925.2349
   2000004    2268.8233
   1000005    4390.1119
   2000005    4454.9034
   1000006    3119.1139
   2000006    4460.8723
   1000011    4927.5686
   2000011    2467.8469
   1000012    4926.5245
   1000013    4927.5663
   2000013    2467.8456
   1000014    4926.522
   1000015    898.10898
   2000015    4151.0536
   1000016    895.28454
   1000021    4813.7774
   1000022   -456.51739
   1000023    2292.8541
   1000025   -3978.8249
   1000035    3980.7292
   1000024    2292.8957
   1000037    3981.2076

BLOCK ALPHA
      -0.071839779

BLOCK HMIX Q=  3730.1433
   1    3985.2685
   2    13.226472
   3    243.02835
   4    21238318

BLOCK STOPMIX
   1   1   -0.076702332
   1   2    0.99705404
   2   1   -0.99705404
   2   2   -0.076702332

BLOCK SBOTMIX
   1   1    0.18037062
   1   2    0.98359872
   2   1   -0.98359872
   2   2    0.18037062

BLOCK STAUMIX
   1   1    0.9999866
   1   2    0.0051773859
   2   1   -0.0051773859
   2   2    0.9999866

BLOCK NMIX
   1   1    0.99993604
   1   2    7.7166463e-08
   1   3    0.011298008
   1   4    0.00051338406
   2   1   -0.00032238584
   2   2   -0.99940759
   2   3    0.029355911
   2   4   -0.017961163
   3   1    0.0083512714
   3   2   -0.0080615266
   3   3   -0.70700203
   3   4   -0.70711626
   4   1   -0.0076197689
   4   2    0.03345876
   4   3    0.70651166
   4   4   -0.70686896

BLOCK UMIX
   1   1   -0.99913181
   1   2    0.041660782
   2   1    0.041660782
   2   2    0.99913181

BLOCK VMIX
   1   1   -0.99967257
   1   2    0.025588074
   2   1    0.025588074
   2   2    0.99967257

BLOCK HIGGSBOUNDSINPUTHIGGSCOUPLINGSFERMIONS
       0, 174.93957,3,36,15,15

BLOCK HIGGSBOUNDSINPUTHIGGSCOUPLINGSBOSONS
       0,4,36,21,21,23

BLOCK SPHENOLOWENERGY
   1    0.00032426765
   2    1.5900432e-06
   3    3.526015e-05
   4    2.8203765e-15
   5    1.204833e-10
   6    2.5223567e-08
   7    9.4944435e-14
   8    4.056024e-09
   9    8.6037292e-07
   10    9.6744924e-05
   11    0.99933802
   12    0.54195484
   13    19.364151
   14    0
   15    0
   16    0.0021570858
   17    2.2816558e-15
   18    2.4805127e-11
   19    8.2915282e-11
   20    2.429734e-16
   21    1.0387796e-11
   22    3.6010827e-09
   23    0
   24    0
   25    0
   26    0
   27    0
   28    0
   29    0
   30    0
   31    0
   39    6.8915268e-06
   40    0
   41    0
   42    0

BLOCK FWCOEF Q=  160
   305   4422   0   0   -0.18881911
   305   4422   0   2   -0.19315616
   305   4322   0   2   -9.2905341e-05
   305   6421   0   0   -0.095227835
   305   6421   0   2   -0.10033178
   305   6321   0   2   -0.00010563398
   3051111   4133   0   0    1.6238285
   3051111   4133   0   2    1.6238762
   3051111   4233   0   2    1.2312352e-05
   3051111   4137   0   0   -4.4465206
   3051111   4137   0   2   -4.4455944
   3051111   4237   0   2   -9.1618976e-05
   3051313   4133   0   0    1.6238285
   3051313   4133   0   2    1.6238762
   3051313   4233   0   2    1.231235e-05
   3051313   4137   0   0   -4.4465206
   3051313   4137   0   2   -4.4455945
   3051313   4237   0   2   -9.1618978e-05
   3051212   4137   0   0    1.5053501
   3051212   4137   0   2    1.5051505
   3051212   4237   0   2    1.9824826e-05
   3051414   4137   0   0    1.5053501
   3051414   4137   0   2    1.5051505
   3051414   4237   0   2    1.9824826e-05
   3051616   4137   0   0    1.5053501
   3051616   4137   0   2    1.5051504
   3051616   4237   0   2    1.9825033e-05

BLOCK IMFWCOEF Q=  160
   305   4422   0   0    3.8578592e-07
   305   4422   0   2    1.8198512e-06
   305   4322   0   2   -5.293898e-07
   305   6421   0   0    3.3045116e-07
   305   6421   0   2   -4.2810399e-07
   305   6321   0   2   -3.6341047e-07
   3051111   4133   0   2   -3.5249821e-07
   3051111   4233   0   2    2.640984e-07
   3051111   4137   0   2    3.1008709e-06
   3051111   4237   0   2   -1.9649484e-06
   3051313   4133   0   2   -3.5249813e-07
   3051313   4233   0   2    2.6409839e-07
   3051313   4137   0   2    3.1008712e-06
   3051313   4237   0   2   -1.9649485e-06
   3051212   4137   0   2   -6.5703848e-07
   3051212   4237   0   2    4.2518003e-07
   3051414   4137   0   2   -6.5703848e-07
   3051414   4237   0   2    4.2518003e-07
   3051616   4137   0   2   -6.585667e-07
   3051616   4237   0   2    4.2518271e-07

DECAY 23  2.4952


DECAY 24  2.085


DECAY 2000011  11.564416
    1   2    1000022    11

DECAY 1000011  45.977651
    0.57811944   2   -1000024    12
    0.28932481   2    1000023    11
    0.13230843   2    1000022    11
    0.00019742083   2   -1000037    12

DECAY 2000013  11.564409
    0.99999998   2    1000022    13

DECAY 1000013  45.979934
    0.57809016   2   -1000024    14
    0.28931022   2    1000023    13
    0.13230182   2    1000022    13
    0.00019741023   2   -1000037    14

DECAY 1000015  0.62057411
    1   2    1000022    15

DECAY 2000015  22.605659
    0.90034405   2    1000022    15
    0.049960019   2    1000016   -24
    0.024946969   2    1000015    23
    0.02386404   2    1000015    25
    0.00043186867   2   -1000037    16
    0.00022253413   2    1000025    15
    0.00021763246   2    1000035    15

DECAY 1000012  45.974263
    0.57852982   2    1000024    11
    0.28901775   2    1000023    12
    0.1322891   2    1000022    12

DECAY 1000014  45.974989
    0.5785202   2    1000024    13
    0.28901288   2    1000023    14
    0.13228694   2    1000022    14

DECAY 1000016  0.61574361
    1   2    1000022    16

DECAY 1000001  6.1388306
    0.62433449   2   -1000024    2
    0.31233979   2    1000023    1
    0.063325726   2    1000022    1

DECAY 2000001  1.8543185
    0.99999963   2    1000022    1

DECAY 1000003  6.13881
    0.6243336   2   -1000024    4
    0.31234045   2    1000023    3
    0.063325947   2    1000022    3

DECAY 2000003  1.8545401
    0.99988003   2    1000022    3
    0.00011940535   2    1000003    25

DECAY 1000005  5.0829585
    0.46408724   2    1000022    5
    0.26163986   2    1000006   -24
    0.14980801   2   -1000024    6
    0.075564553   2    1000023    5
    0.022924148   2   -1000037    6
    0.013230657   2    1000025    5
    0.012745533   2    1000035    5

DECAY 2000005  79.802042
    0.56525536   2    1000006   -24
    0.2530326   2   -1000024    6
    0.12765986   2    1000023    5
    0.043611962   2   -1000037    6
    0.0081373676   2    1000022    5
    0.0011672304   2    1000035    5
    0.0011356217   2    1000025    5

DECAY 2000002  4.6641113
    1   2    1000022    2

DECAY 1000002  6.1277004
    0.62445221   2    1000024    1
    0.31213258   2    1000023    2
    0.063415214   2    1000022    2

DECAY 2000004  4.6641085
    1   2    1000022    4

DECAY 1000004  6.1276925
    0.6244527   2    1000024    3
    0.31213171   2    1000023    4
    0.063415262   2    1000022    4

DECAY 1000006  6.6006702
    0.9979663   2    1000022    6
    0.001250799   2    1000024    5
    0.0006012776   2    1000023    6
    0.00010085209   3    1000022    24    5

DECAY 2000006  94.99293
    0.37456636   2    1000006    25
    0.2464672   2    1000006    23
    0.22372278   2    1000024    5
    0.11087152   2    1000023    6
    0.017726856   2    1000035    6
    0.017650448   2    1000025    6
    0.0069746003   2    1000022    6
    0.0020202345   2    1000037    5

DECAY 1000024  14.467702
    0.50080591   2    1000016   -15
    0.49910665   2   -1000015    16

DECAY 1000037  46.818455
    0.38899508   2    1000006   -5
    0.18571608   2    1000024    25
    0.16445516   2    1000023    24
    0.16275077   2    1000024    23
    0.056270025   2    1000022    24
    0.014216585   2    1000016   -15
    0.013544781   3    1000024    6   -6
    0.0086215828   3    1000023   -5    6
    0.003652395   3    1000022   -5    6
    0.00055591246   2   -1000015    16
    0.00042149324   2   -1000003    4
    0.0004118906   2   -1000001    2
    0.00016531229   2    1000004   -3
    0.00015567783   2    1000002   -1

DECAY 1000022 -1


DECAY 1000023  14.467824
    0.25014828   2    1000016   -16
    0.25014828   2   -1000016    16
    0.24979273   2    1000015   -15
    0.24979273   2   -1000015    15

DECAY 1000025  50.17205
    0.17246274   2    1000006   -6
    0.17246274   2   -1000006    6
    0.15262919   2    1000024   -24
    0.15262919   2   -1000024    24
    0.14302183   2    1000023    23
    0.12358521   2    1000023    25
    0.026118765   2    1000022    25
    0.023871482   2    1000022    23
    0.0065296275   2    1000015   -15
    0.0065296275   2   -1000015    15
    0.006472111   3    1000024    5   -6
    0.006472111   3   -1000024   -5    6
    0.0041934338   3    1000023    6   -6
    0.0027550627   3    1000022    6   -6

DECAY 1000035  46.15742
    0.18833737   2    1000006   -6
    0.18833737   2   -1000006    6
    0.17870648   2    1000023    25
    0.16211141   2    1000024   -24
    0.16211141   2   -1000024    24
    0.037861407   2    1000022    25
    0.031128255   2    1000022    23
    0.0090133543   2    1000023    23
    0.0086094904   3    1000024    5   -6
    0.0086094904   3   -1000024   -5    6
    0.0072265646   2    1000015   -15
    0.0072265646   2   -1000015    15
    0.0058956735   3    1000023    6   -6
    0.0031186211   3    1000022    6   -6
    0.00024096406   2    1000016   -16
    0.00024096406   2   -1000016    16
    0.0001506755   2    1000003   -3
    0.0001506755   2   -1000003    3
    0.00014580218   2    1000001   -1
    0.00014580218   2   -1000001    1
    0.00012905685   2    1000004   -4
    0.00012905685   2   -1000004    4
    0.0001241613   2    1000002   -2
    0.0001241613   2   -1000002    2

DECAY 1000021  525.13287
    0.082088067   2    2000002   -2
    0.082088067   2   -2000002    2
    0.082088044   2    2000004   -4
    0.082088044   2   -2000004    4
    0.053970823   2    1000002   -2
    0.053970823   2   -1000002    2
    0.053970822   2    1000004   -4
    0.053970822   2   -1000004    4
    0.053924369   2    1000003   -3
    0.053924369   2   -1000003    3
    0.053924351   2    1000001   -1
    0.053924351   2   -1000001    1
    0.046375962   2    1000006   -6
    0.046375962   2   -1000006    6
    0.032410606   2    2000003   -3
    0.032410606   2   -2000003    3
    0.032410582   2    2000001   -1
    0.032410582   2   -2000001    1
    0.0038274635   2    1000005   -5
    0.0038274635   2   -1000005    5
    0.0028072919   2    2000005   -5
    0.0028072919   2   -2000005    5
    0.0021957899   2    2000006   -6
    0.0021957899   2   -2000006    6

DECAY 25  0.0037284085
    0.58944178   2   -5    5
    0.2108933   2   -24    24
    0.073498216   2    21    21
    0.067771561   2   -15    15
    0.029221735   2   -4    4
    0.024960816   2    23    23
    0.0023484902   2    22    22
    0.0014067935   2    22    23
    0.00023503776   2   -13    13
    0.00022150138   2   -3    3
    6.1242945e-07   2   -1    1
    1.5059004e-07   2   -2    2
    5.2839243e-09   2   -11    11

DECAY 35  9.875924
    0.72821755   2   -5    5
    0.19839637   2   -15    15
    0.051186055   2   -6    6
    0.016294317   2    1000022    1000035
    0.0036642273   2    1000022    1000025
    0.00084915853   2    1000022    1000023
    0.00064448287   2   -13    13
    0.00026969282   2   -3    3
    0.00019243564   2    25    25
    0.0001209911   2    1000022    1000022
    8.0998221e-05   2   -1000024    1000024
    4.0466546e-05   2    1000023    1000023
    8.5995744e-06   2    23    23
    5.9785965e-06   2   -1000004    1000004
    5.9651488e-06   2   -1000002    1000002
    5.8309809e-06   2   -1000015    1000015
    4.9038225e-06   2    21    21
    1.5499423e-06   2   -24    24
    7.457177e-07   2   -1    1
    3.9670323e-07   2   -4    4
    6.0096993e-08   2    22    23
    3.8815267e-08   2    22    22
    1.4472677e-08   2   -11    11
    2.0430372e-12   2   -2    2

DECAY 36  9.6479361
    0.72524712   2   -5    5
    0.19759345   2   -15    15
    0.052019838   2   -6    6
    0.016857167   2    1000022    1000025
    0.0036814951   2    1000022    1000035
    0.0018378723   2   -1000024    1000024
    0.00091828381   2    1000023    1000023
    0.00074168357   2    1000022    1000023
    0.0006418611   2   -13    13
    0.00026860136   2   -3    3
    0.00012737816   2    1000022    1000022
    4.1623652e-05   2    21    21
    2.192168e-05   2    23    25
    7.4269922e-07   2   -1    1
    4.1282201e-07   2    22    23
    4.0132066e-07   2   -4    4
    1.3281912e-07   2    22    22
    1.4413801e-08   2   -11    11
    2.0667066e-12   2   -2    2
    4.2837457e-43   2    25    25

DECAY 37  9.9301301
    0.79680515   2   -5    6
    0.17966101   2   -15    16
    0.019855818   2    1000022    1000037
    0.001565609   2    1000022    1000024
    0.0010485971   2   -5    4
    0.00063516556   2   -13    14
    0.00025176985   2   -3    4
    0.00012937749   2   -3    6
    2.131797e-05   2    24    25
    1.1794226e-05   2   -3    2
    7.4880511e-06   2   -5    2
    5.9166799e-06   2   -1    6
    6.955521e-07   2   -1    2
    1.8543415e-07   2   -1000015    1000016
    8.6509463e-08   2   -1    4
    1.4856588e-08   2   -11    12
    5.9831906e-11   2    1000023    1000024
    1.5090341e-13   2    24    35

DECAY 6  2.43
    1   2    5    24

DECAY 15 -1
