BLOCK SPINFO
   1   SPheno
   2   v4.0.5be

BLOCK SPHENOINFO
   1   2
   2   2

BLOCK MODSEL
   1   0

BLOCK MINPAR
   3    24.607231
   4   -1

BLOCK EXTPAR
   0    1431.6759
   1    89.110858
   2    493.10169
   3    3000
   11    3456.0258
   12    974.61683
   13   -788.2287
   23   -1807.4743
   25    23.998286
   26    2038.1332
   31    1727.8738
   32    1727.8738
   33    338.07384
   34    1135.6039
   35    1135.6039
   36    1137.0162
   41    5000
   42    5000
   43    1625.224
   44    5000
   45    5000
   46    1367.0019
   47    5000
   48    5000
   49    1580.8817

BLOCK SMINPUTS
   1    127.90897
   2    1.1663787e-05
   3    0.1184
   4    91.1876
   5    4.18
   6    173.2
   7    1.777
   8    0
   11    0.00051099893
   12    0
   13    0.10565837
   14    0
   21    0.005
   22    0.0025
   23    0.095
   24    1.27

BLOCK GAUGE Q=  1431.6759
   1    0.35536298
   2    0.66519887
   3    1.219778

BLOCK YU Q=  1431.6759
   1   1    8.3916481e-06
   2   2    0.0042629572
   3   3    1.0137785

BLOCK YD Q=  1431.6759
   1   1    0.00040467627
   2   2    0.0076888491
   3   3    0.40131205

BLOCK YE Q=  1431.6759
   1   1    7.0618968e-05
   2   2    0.014601763
   3   3    0.24557763

BLOCK AU Q=  1431.6759
   1   1    0
   2   2    0
   3   3    3456.0258

BLOCK AD Q=  1431.6759
   1   1    0
   2   2    0
   3   3    974.61687

BLOCK AE Q=  1431.6759
   1   1    0
   2   2    0
   3   3   -788.2287

BLOCK MSOFT Q=  1431.6759
   1    89.110858
   2    493.10169
   3    3000
   21    914746.75
   22   -3200318.5
   31    1727.8738
   32    1727.8738
   33    338.07384
   34    1135.6039
   35    1135.6039
   36    1137.0162
   41    5000
   42    5000
   43    1625.224
   44    5000
   45    5000
   46    1367.0019
   47    5000
   48    5000
   49    1580.8817

BLOCK MASS
   6    173.2
   23    91.1876
   24    80.429995
   15    1.777
   25    124.60846
   35    2037.6072
   36    2038.1332
   37    2040.4153
   1000001    5026.8516
   2000001    5016.3763
   1000002    5026.4129
   2000002    5017.8469
   1000003    5026.8571
   2000003    5016.375
   1000004    5026.4146
   2000004    5017.8477
   1000005    1538.176
   2000005    1641.8915
   1000006    1222.7957
   2000006    1676.2373
   1000011    1731.9918
   2000011    1137.4011
   1000012    1729.8295
   1000013    1731.9918
   2000013    1137.3923
   1000014    1729.826
   1000015    342.05457
   2000015    1138.3835
   1000016    340.1542
   1000021    3183.8757
   1000022    89.279325
   1000023    524.15554
   1000025   -1796.7757
   1000035    1798.3558
   1000024    524.33475
   1000037    1798.9518

BLOCK ALPHA
      -0.040881995

BLOCK HMIX Q=  1431.6759
   1   -1807.4743
   2    23.998286
   3    244.03698
   4    4153986.8

BLOCK STOPMIX
   1   1   -0.44364696
   1   2    0.89620164
   2   1   -0.89620164
   2   2   -0.44364696

BLOCK SBOTMIX
   1   1   -0.68201072
   1   2    0.73134218
   2   1   -0.73134218
   2   2   -0.68201072

BLOCK STAUMIX
   1   1   -0.99803277
   1   2    0.062694497
   2   1   -0.062694497
   2   2   -0.99803277

BLOCK NMIX
   1   1   -0.99969088
   1   2   -0.00040166803
   1   3    0.024859088
   1   4   -1.4234541e-05
   2   1   -0.00075636146
   2   2   -0.99885476
   2   3   -0.046562127
   2   4   -0.010980182
   3   1    0.017588471
   3   2   -0.025174575
   3   3    0.70649646
   3   4   -0.70704995
   4   1   -0.017555893
   4   2    0.040684734
   4   3   -0.70574552
   4   4   -0.70707836

BLOCK UMIX
   1   1   -0.99783408
   1   2   -0.065781031
   2   1    0.065781031
   2   2   -0.99783408

BLOCK VMIX
   1   1   -0.99987882
   1   2    0.015567651
   2   1    0.015567651
   2   2    0.99987882

BLOCK HIGGSBOUNDSINPUTHIGGSCOUPLINGSFERMIONS
       0, 575.91773,3,36,15,15

BLOCK HIGGSBOUNDSINPUTHIGGSCOUPLINGSBOSONS
       0,4,36,21,21,23

BLOCK SPHENOLOWENERGY
   1    0.00031644371
   2    1.5894511e-06
   3    3.5224779e-05
   4    2.4166982e-15
   5    1.0323797e-10
   6    2.1577329e-08
   7    8.2181064e-14
   8    3.5107506e-09
   9    7.4345319e-07
   10    9.6221645e-05
   11    0.99393276
   12    0.54209144
   13    19.367536
   14    0
   15    0
   16    0.0021576323
   17    2.2816622e-15
   18    2.47865e-11
   19    8.286913e-11
   20   -3.4579577e-15
   21   -1.4783871e-10
   22   -1.8461327e-07
   23    0
   24    0
   25    0
   26    0
   27    0
   28    0
   29    0
   30    0
   31    0
   39    7.1816273e-05
   40    0
   41    0
   42    0

BLOCK FWCOEF Q=  160
   305   4422   0   0   -0.18881911
   305   4422   0   2   -0.18283872
   305   4322   0   2   -0.00011861314
   305   6421   0   0   -0.095227835
   305   6421   0   2   -0.098490305
   305   6321   0   2   -0.00021858424
   3051111   4133   0   0    1.590262
   3051111   4133   0   2    1.5905203
   3051111   4233   0   2    5.1936522e-05
   3051111   4137   0   0   -4.4129542
   3051111   4137   0   2   -4.4085292
   3051111   4237   0   2   -0.00040489718
   3051313   4133   0   0    1.590262
   3051313   4133   0   2    1.5905193
   3051313   4233   0   2    5.193628e-05
   3051313   4137   0   0   -4.4129542
   3051313   4137   0   2   -4.4085302
   3051313   4237   0   2   -0.0004048972
   3051212   4137   0   0    1.5053501
   3051212   4137   0   2    1.5043977
   3051212   4237   0   2    8.8266268e-05
   3051414   4137   0   0    1.5053501
   3051414   4137   0   2    1.5043977
   3051414   4237   0   2    8.8266305e-05
   3051616   4137   0   0    1.5053501
   3051616   4137   0   2    1.5043988
   3051616   4237   0   2    8.8273766e-05

BLOCK IMFWCOEF Q=  160
   305   4422   0   0    3.8589482e-07
   305   4422   0   2   -1.2436515e-05
   305   4322   0   2    1.9295842e-06
   305   6421   0   0    3.3054444e-07
   305   6421   0   2    5.9785143e-06
   305   6321   0   2    1.2240269e-06
   3051111   4133   0   2   -8.4026085e-07
   3051111   4233   0   2    1.4081287e-06
   3051111   4137   0   2    9.7914427e-06
   3051111   4237   0   2   -1.0988117e-05
   3051313   4133   0   2   -8.4026059e-07
   3051313   4233   0   2    1.4081274e-06
   3051313   4137   0   2    9.7914514e-06
   3051313   4237   0   2   -1.0988121e-05
   3051212   4137   0   2   -1.9068801e-06
   3051212   4237   0   2    2.3954709e-06
   3051414   4137   0   2   -1.90688e-06
   3051414   4237   0   2    2.3954709e-06
   3051616   4137   0   2   -1.8871242e-06
   3051616   4237   0   2    2.3954183e-06

DECAY 23  2.4952


DECAY 24  2.085


DECAY 2000011  5.6413305
    0.99999964   2    1000022    11

DECAY 1000011  20.973405
    0.59722029   2   -1000024    12
    0.29950479   2    1000023    11
    0.10327493   2    1000022    11

DECAY 2000013  5.6413081
    0.9999962   2    1000022    13

DECAY 1000013  20.975642
    0.59715659   2   -1000024    14
    0.2994735   2    1000023    13
    0.10326412   2    1000022    13
    0.00010578571   2    2000013    25

DECAY 1000015  0.37885657
    1   2    1000022    15

DECAY 2000015  11.467482
    0.49063274   2    1000022    15
    0.25479685   2    1000016   -24
    0.12761753   2    1000015    25
    0.12575497   2    1000015    23
    0.00079657576   2   -1000024    16
    0.00040133304   2    1000023    15

DECAY 1000012  20.972374
    0.59864888   2    1000024    11
    0.29851128   2    1000023    12
    0.10283983   2    1000022    12

DECAY 1000014  20.972342
    0.59864936   2    1000024    13
    0.29851087   2    1000023    14
    0.10283977   2    1000022    14

DECAY 1000016  0.3696589
    1   2    1000022    16

DECAY 2000001  143.99781
    0.98056607   2    1000021    1
    0.019424618   2    1000022    1

DECAY 1000001  207.87764
    0.68448991   2    1000021    1
    0.20736534   2   -1000024    2
    0.10386844   2    1000023    1
    0.0033557199   2    1000022    1
    0.00070030336   2   -1000037    2
    0.00015537756   2    1000035    1

DECAY 2000003  144.00662
    0.98050514   2    1000021    3
    0.01942345   2    1000022    3

DECAY 1000003  207.88414
    0.6844712   2    1000021    3
    0.20735905   2   -1000024    4
    0.10386536   2    1000023    3
    0.003355636   2    1000022    3
    0.00070695874   2   -1000037    4
    0.0001661115   2    1000035    3

DECAY 1000005  18.643731
    0.54726929   2    1000006   -24
    0.27542187   2   -1000024    6
    0.14331717   2    1000023    5
    0.033991675   2    1000022    5

DECAY 2000005  35.449136
    0.74585766   2    1000006   -24
    0.15739697   2   -1000024    6
    0.081486308   2    1000023    5
    0.013168624   2    1000022    5
    0.0020904345   2    1000005    23

DECAY 2000002  152.54943
    0.92660111   2    1000021    2
    0.073364381   2    1000022    2

DECAY 1000002  207.86949
    0.68429691   2    1000021    2
    0.20820526   2    1000024    1
    0.10391908   2    1000023    2
    0.0033859802   2    1000022    2
    0.00011415965   2    1000035    2

DECAY 2000004  152.5522
    0.92658438   2    1000021    4
    0.073363046   2    1000022    4

DECAY 1000004  207.87549
    0.68427769   2    1000021    4
    0.20819944   2    1000024    3
    0.1039161   2    1000023    4
    0.003385883   2    1000022    4
    0.00011748862   2    1000035    4

DECAY 1000006  3.9930974
    0.52653398   2    1000022    6
    0.32090257   2    1000024    5
    0.14926751   2    1000023    6
    0.002975348   2    1000023    4
    0.00014093171   2    1000022    4

DECAY 2000006  55.083364
    0.44195945   2    1000006    23
    0.22924078   2    1000006    25
    0.17950636   2    1000024    5
    0.086870698   2    1000023    6
    0.045937771   2    1000005    24
    0.016484944   2    1000022    6

DECAY 1000024  1.5315107
    0.50530679   2    1000016   -15
    0.49464712   2   -1000015    16

DECAY 1000037  29.72621
    0.45365909   2    1000006   -5
    0.12435957   2    1000024    25
    0.11618659   2    1000023    24
    0.1158722   2    1000024    23
    0.080566042   2   -1000005    6
    0.040816199   2    1000022    24
    0.033674482   2    1000016   -15
    0.0132348   2   -2000015    16
    0.0097670062   2    2000006   -5
    0.0059563677   3    1000024    6   -6
    0.0037580152   3    1000023   -5    6
    0.0015281569   3    1000022   -5    6
    0.00044815211   2   -1000015    16

DECAY 1000022 -1


DECAY 1000023  1.5294156
    0.25194233   2    1000016   -16
    0.25194233   2   -1000016    16
    0.24802974   2    1000015   -15
    0.24802974   2   -1000015    15

DECAY 1000025  27.437626
    0.19837919   2    1000006   -6
    0.19837919   2   -1000006    6
    0.12644644   2    1000024   -24
    0.12644644   2   -1000024    24
    0.11761202   2    1000023    25
    0.091543856   2    1000023    23
    0.024163979   2    1000022    25
    0.022012496   2    1000022    23
    0.018031288   2    1000015   -15
    0.018031288   2   -1000015    15
    0.010395636   2    1000005   -5
    0.010395636   2   -1000005    5
    0.0071317844   2    2000015   -15
    0.0071317844   2   -2000015    15
    0.0049146699   3    1000024    5   -6
    0.0049146699   3   -1000024   -5    6
    0.0046512369   2    2000005   -5
    0.0046512369   2   -2000005    5
    0.002921629   3    1000023    6   -6
    0.0012883771   3    1000022    6   -6
    0.00016011622   2    1000016   -16
    0.00016011622   2   -1000016    16

DECAY 1000035  25.75141
    0.22129746   2    1000006   -6
    0.22129746   2   -1000006    6
    0.13424321   2    1000024   -24
    0.13424321   2   -1000024    24
    0.10625869   2    1000023    25
    0.037277856   2    1000023    23
    0.023519994   2    1000022    23
    0.021892936   2    1000022    25
    0.019195702   2    1000015   -15
    0.019195702   2   -1000015    15
    0.010882947   2    1000005   -5
    0.010882947   2   -1000005    5
    0.0076468462   2    2000015   -15
    0.0076468462   2   -2000015    15
    0.0051670768   2    2000005   -5
    0.0051670768   2   -2000005    5
    0.0045152479   3    1000024    5   -6
    0.0045152479   3   -1000024   -5    6
    0.0028795386   3    1000023    6   -6
    0.0012989413   3    1000022    6   -6
    0.00035813323   2    1000016   -16
    0.00035813323   2   -1000016    16

DECAY 1000021  225.23249
    0.16721808   2    1000006   -6
    0.16721808   2   -1000006    6
    0.12336893   2    1000005   -5
    0.12336893   2   -1000005    5
    0.11233156   2    2000005   -5
    0.11233156   2   -2000005    5
    0.095970669   2    2000006   -6
    0.095970669   2   -2000006    6
    0.00050476796   2    1000006   -4
    0.00050476796   2   -1000006    4
    0.00026719163   3    1000037    5   -6
    0.00026719163   3   -1000037   -5    6
    0.00019218026   3    1000035    6   -6
    0.00019000094   3    1000025    6   -6

DECAY 25  0.0038673413
    0.58430671   2   -5    5
    0.219906   2   -24    24
    0.07027157   2    21    21
    0.066533389   2   -15    15
    0.028330216   2   -4    4
    0.0264141   2    23    23
    0.0023368821   2    22    22
    0.0014521168   2    22    23
    0.00023071697   2   -13    13
    0.00021754319   2   -3    3
    6.0148271e-07   2   -1    1
    1.4599352e-07   2   -2    2
    5.1867781e-09   2   -11    11

DECAY 35  40.67325
    0.92498917   2   -5    5
    0.054322726   2   -15    15
    0.0087633375   2   -6    6
    0.0033855177   2   -2000015    1000015
    0.0033855177   2   -1000015    2000015
    0.0014961895   2    1000022    1000025
    0.0012554883   2   -1000024    1000024
    0.00079932785   2    1000022    1000035
    0.00062648471   2    1000023    1000023
    0.00043050398   2    1000022    1000023
    0.00020080707   2   -13    13
    0.00014805548   2   -3    3
    7.9970941e-05   2   -1000015    1000015
    6.5693207e-05   2    1000022    1000022
    3.2313677e-05   2    21    21
    1.1327645e-05   2    25    25
    3.5009476e-06   2    23    23
    1.807102e-06   2   -24    24
    4.0926138e-07   2   -1    1
    8.0369453e-08   2   -4    4
    7.8428495e-08   2    22    23
    3.500662e-08   2    22    22
    4.5105401e-09   2   -11    11
    4.1430075e-13   2   -2    2

DECAY 36  39.06918
    0.92457161   2   -5    5
    0.054297241   2   -15    15
    0.0081881504   2   -6    6
    0.0035811606   2   -2000015    1000015
    0.0035811606   2   -1000015    2000015
    0.0016421189   2   -1000024    1000024
    0.0015500791   2    1000022    1000035
    0.00084678462   2    1000022    1000025
    0.00081933413   2    1000023    1000023
    0.00045948765   2    1000022    1000023
    0.0002007137   2   -13    13
    0.0001479801   2   -3    3
    6.8839713e-05   2    1000022    1000022
    3.9773537e-05   2    21    21
    4.9409294e-06   2    23    25
    4.0905327e-07   2   -1    1
    1.0613222e-07   2    22    23
    7.2465777e-08   2   -4    4
    2.8080488e-08   2    22    22
    4.5084488e-09   2   -11    11
    3.7358919e-13   2   -2    2
    2.051186e-35   2    25    25

DECAY 37  40.197298
    0.92657318   2   -5    6
    0.061467006   2   -15    16
    0.0069515938   2   -2000015    1000016
    0.0023403117   2    1000022    1000037
    0.0013737243   2   -5    4
    0.00088310933   2    1000022    1000024
    0.00021730799   2   -13    14
    0.00013720953   2   -3    4
    2.982343e-05   2   -1000015    1000016
    9.8098129e-06   2   -5    2
    6.3954029e-06   2   -3    2
    5.0701949e-06   2   -3    6
    4.8251263e-06   2    24    25
    3.8042668e-07   2   -1    2
    2.2334243e-07   2   -1    6
    1.9742949e-08   2   -1    4
    5.0828565e-09   2   -11    12
    7.5964235e-10   2    1000023    1000024
    5.9082611e-12   2    24    35
    2.0950998e-12   2    24    36

DECAY 6  2.43
    1   2    5    24

DECAY 15 -1
