BLOCK SPINFO
   1   SPheno
   2   v4.0.5be

BLOCK SPHENOINFO
   1   2
   2   2

BLOCK MODSEL
   1   0

BLOCK MINPAR
   3    43.987326
   4    1

BLOCK EXTPAR
   0    2685.1284
   1    937.1835
   2    2650.8055
   3    2377.8331
   11   -5581.8854
   12    5048.4267
   13   -3501.7836
   23    1292.1564
   25    42.819075
   26    3684.4911
   31    4986.5591
   32    4986.5591
   33    4647.8172
   34    1558.5599
   35    1558.5599
   36    4203.1579
   41    2639.2229
   42    2639.2229
   43    1662.9067
   44    3926.361
   45    3926.361
   46    4058.3843
   47    4727.0439
   48    4727.0439
   49    778.89199

BLOCK SMINPUTS
   1    127.90897
   2    1.1663787e-05
   3    0.1184
   4    91.1876
   5    4.18
   6    173.2
   7    1.777
   8    0
   11    0.00051099893
   12    0
   13    0.10565837
   14    0
   21    0.005
   22    0.0025
   23    0.095
   24    1.27

BLOCK GAUGE Q=  2685.1284
   1    0.35536298
   2    0.66519887
   3    1.219778

BLOCK YU Q=  2685.1284
   1   1    8.3866583e-06
   2   2    0.0042604224
   3   3    1.0131757

BLOCK YD Q=  2685.1284
   1   1    0.00072161654
   2   2    0.013710714
   3   3    0.71561749

BLOCK YE Q=  2685.1284
   1   1    0.00012592736
   2   2    0.026037785
   3   3    0.43791271

BLOCK AU Q=  2685.1284
   1   1    0
   2   2    0
   3   3   -5581.8853

BLOCK AD Q=  2685.1284
   1   1    0
   2   2    0
   3   3    5048.4381

BLOCK AE Q=  2685.1284
   1   1    0
   2   2    0
   3   3   -3501.7834

BLOCK MSOFT Q=  2685.1284
   1    937.1835
   2    2650.8055
   3    2377.8331
   21    12072856
   22   -1735395.6
   31    4986.5591
   32    4986.5591
   33    4647.8172
   34    1558.5599
   35    1558.5599
   36    4203.1579
   41    2639.2229
   42    2639.2229
   43    1662.9067
   44    3926.361
   45    3926.361
   46    4058.3843
   47    4727.0439
   48    4727.0439
   49    778.89199

BLOCK MASS
   6    173.2
   23    91.1876
   24    80.429995
   15    1.777
   25    125.50657
   35    3683.2714
   36    3684.4911
   37    3684.7046
   1000001    2746.9612
   2000001    4778.0045
   1000002    2745.8285
   2000002    3985.7344
   1000003    2746.9598
   2000003    4777.9997
   1000004    2745.8272
   2000004    3985.734
   1000005    946.05366
   2000005    1795.7463
   1000006    1785.1527
   2000006    4038.8222
   1000011    4998.3597
   2000011    1556.6055
   1000012    4997.324
   1000013    4998.3468
   2000013    1556.6207
   1000014    4997.311
   1000015    4201.3239
   2000015    4657.7417
   1000016    4656.3877
   1000021    2597.6446
   1000022    932.2101
   1000023    1302.5617
   1000025   -1303.7409
   1000035    2672.9609
   1000024    1300.887
   1000037    2673.1851

BLOCK ALPHA
      -0.022767633

BLOCK HMIX Q=  2685.1284
   1    1292.1564
   2    42.819075
   3    243.37652
   4    13575475

BLOCK STOPMIX
   1   1    0.99813602
   1   2    0.061028632
   2   1   -0.061028632
   2   2    0.99813602

BLOCK SBOTMIX
   1   1    0.040946379
   1   2    0.99916134
   2   1   -0.99916134
   2   2    0.040946379

BLOCK STAUMIX
   1   1    0.026148397
   1   2    0.99965807
   2   1   -0.99965807
   2   2    0.026148397

BLOCK NMIX
   1   1   -0.9961303
   1   2    0.0024530172
   1   3   -0.070919584
   1   4    0.051853833
   2   1   -0.08684738
   2   2   -0.041850798
   2   3    0.7037657
   2   4   -0.7038607
   3   1   -0.01345158
   3   2    0.013823863
   3   3    0.70660391
   3   4    0.70734635
   4   1   -0.0010061353
   4   2    0.99902522
   4   3    0.019878504
   4   4   -0.039400996

BLOCK UMIX
   1   1   -0.028178113
   1   2    0.99960292
   2   1    0.99960292
   2   2    0.028178113

BLOCK VMIX
   1   1   -0.055859995
   1   2    0.99843861
   2   1    0.99843861
   2   2    0.055859995

BLOCK HIGGSBOUNDSINPUTHIGGSCOUPLINGSFERMIONS
       0, 1833.4732,3,36,15,15

BLOCK HIGGSBOUNDSINPUTHIGGSCOUPLINGSBOSONS
       0,4,36,21,21,23

BLOCK SPHENOLOWENERGY
   1    0.00029339398
   2    1.5972965e-06
   3    3.529695e-05
   4    1.782499e-15
   5    7.6146373e-11
   6    1.5942746e-08
   7    5.9566371e-14
   8    2.5446753e-09
   9    5.3985763e-07
   10    9.6258511e-05
   11    0.99431357
   12    0.5417073
   13    19.352596
   14    0
   15    0
   16    0.0021564699
   17    2.2816504e-15
   18    2.482184e-11
   19    8.2960957e-11
   20    7.8505798e-16
   21    3.355519e-11
   22    1.3207529e-08
   23    0
   24    0
   25    0
   26    0
   27    0
   28    0
   29    0
   30    0
   31    0
   39    6.829172e-05
   40    0
   41    0
   42    0

BLOCK FWCOEF Q=  160
   305   4422   0   0   -0.18881911
   305   4422   0   2   -0.152491
   305   4322   0   2    0.00046818455
   305   6421   0   0   -0.095227835
   305   6421   0   2   -0.089985875
   305   6321   0   2    7.8300667e-05
   3051111   4133   0   0    1.6131341
   3051111   4133   0   2    1.6140416
   3051111   4233   0   2    0.00082809956
   3051111   4137   0   0   -4.4358262
   3051111   4137   0   2   -4.43876
   3051111   4237   0   2   -0.006248128
   3051313   4133   0   0    1.6131341
   3051313   4133   0   2    1.6140411
   3051313   4233   0   2    0.00082809767
   3051313   4137   0   0   -4.4358262
   3051313   4137   0   2   -4.4387605
   3051313   4237   0   2   -0.0062481307
   3051212   4137   0   0    1.5053501
   3051212   4137   0   2    1.5059885
   3051212   4237   0   2    0.0013552073
   3051414   4137   0   0    1.5053501
   3051414   4137   0   2    1.5059885
   3051414   4237   0   2    0.0013552073
   3051616   4137   0   0    1.5053501
   3051616   4137   0   2    1.5059884
   3051616   4237   0   2    0.0013552194

BLOCK IMFWCOEF Q=  160
   305   4422   0   0    3.8589079e-07
   305   4422   0   2    0.00014046588
   305   4322   0   2    9.9882611e-06
   305   6421   0   0    3.3054099e-07
   305   6421   0   2   -0.0001525798
   305   6321   0   2    3.5480609e-06
   3051111   4133   0   2    3.8469471e-06
   3051111   4233   0   2    1.5396891e-05
   3051111   4137   0   2   -1.8166809e-05
   3051111   4237   0   2   -0.00011617594
   3051313   4133   0   2    3.846935e-06
   3051313   4233   0   2    1.5396861e-05
   3051313   4137   0   2   -1.8166812e-05
   3051313   4237   0   2   -0.000116176
   3051212   4137   0   2    3.9769753e-06
   3051212   4237   0   2    2.5198346e-05
   3051414   4137   0   2    3.9769749e-06
   3051414   4237   0   2    2.5198346e-05
   3051616   4137   0   2    3.9752244e-06
   3051616   4237   0   2    2.5198346e-05

DECAY 23  2.4952


DECAY 24  2.085


DECAY 2000011  3.1977436
    0.99830273   2    1000022    11
    0.0016578167   2    1000023    11

DECAY 1000011  39.525675
    0.56702624   2   -1000037    12
    0.2829189   2    1000035    11
    0.14549948   2    1000022    11
    0.0037658455   2    1000023    11
    0.00076821422   2   -1000024    12

DECAY 2000013  3.2016643
    0.99712443   2    1000022    13
    0.0019483666   2    1000023    13
    0.00059596376   2   -1000024    14
    0.00033123973   2    1000025    13

DECAY 1000013  39.586036
    0.56615783   2   -1000037    14
    0.28248597   2    1000035    13
    0.14528519   2    1000022    13
    0.0044928471   2    1000023    13
    0.00076704028   2   -1000024    14
    0.00075981147   2    1000025    13

DECAY 1000015  45.284232
    0.42020955   2    1000022    15
    0.2895552   2   -1000024    16
    0.1460554   2    1000023    15
    0.14415474   2    1000025    15

DECAY 2000015  48.440042
    0.3804755   2   -1000037    16
    0.18991441   2    1000035    15
    0.15723172   2    1000023    15
    0.15586098   2    1000025    15
    0.11063751   2    1000022    15
    0.0029528802   2    1000015    23
    0.0028405454   2    1000015    25

DECAY 1000012  39.533192
    0.56529355   2    1000037    11
    0.28332168   2    1000035    12
    0.14814385   2    1000022    12
    0.0030176339   2    1000024    11
    0.0002133062   2    1000025    12

DECAY 1000014  39.591502
    0.56445788   2    1000037    13
    0.28290248   2    1000035    14
    0.14792523   2    1000022    14
    0.0044914485   2    1000024    13
    0.00021299133   2    1000025    14

DECAY 1000016  48.467369
    0.37907985   2    1000037    15
    0.31352663   2    1000024    15
    0.18992824   2    1000035    16
    0.11136304   2    1000022    16
    0.0059362676   2    1000015    24
    0.00015854198   2    1000025    16

DECAY 1000001  2.851868
    0.85039579   2    1000021    1
    0.10735218   2    1000022    1
    0.023793268   2   -1000037    2
    0.011958532   2    1000035    1
    0.0040513488   2   -1000024    2
    0.0017764623   2    1000023    1
    0.00067242246   2    1000025    1

DECAY 2000001  189.61173
    0.98698929   2    1000021    1
    0.012917142   2    1000022    1

DECAY 1000003  2.8585566
    0.84838992   2    1000021    3
    0.10711486   2    1000022    3
    0.023732614   2   -1000037    4
    0.01193011   2    1000035    3
    0.0042488735   2   -1000024    4
    0.0028385703   2    1000023    3
    0.001745056   2    1000025    3

DECAY 2000003  189.6422
    0.98682806   2    1000021    3
    0.012915486   2    1000022    3
    0.00013090175   2    1000023    3

DECAY 1000005  0.00038851564
    1   2    1000022    5

DECAY 2000005  15.851835
    0.47973215   2   -1000024    6
    0.17514805   2    1000005    25
    0.12920448   2    1000025    5
    0.12849863   2    1000023    5
    0.076957418   2    1000005    23
    0.010459283   2    1000022    5

DECAY 1000002  2.8489321
    0.83908721   2    1000021    2
    0.10161574   2    1000022    2
    0.023057115   2    1000037    1
    0.015929459   2    1000024    1
    0.011608349   2    1000035    2
    0.0083697182   2    1000023    2
    0.00033241469   2    1000025    2

DECAY 2000002  112.05126
    0.9290765   2    1000021    2
    0.070434018   2    1000022    2
    0.00047799395   2    1000023    2

DECAY 1000004  2.8555112
    0.83710021   2    1000021    4
    0.10138242   2    1000022    4
    0.023003191   2    1000037    3
    0.018046827   2    1000024    3
    0.01157915   2    1000035    4
    0.008452565   2    1000023    4
    0.00043564444   2    1000025    4

DECAY 2000004  112.05343
    0.92905743   2    1000021    4
    0.07043264   2    1000022    4
    0.00048308672   2    1000023    4

DECAY 1000006  13.528795
    0.29932417   2    1000024    5
    0.25701909   2    1000025    6
    0.25057185   2    1000023    6
    0.17507228   2    1000005    24
    0.017615514   2    1000022    6
    0.00039450961   3    1000022    24    5

DECAY 2000006  439.36082
    0.24393732   2    1000021    6
    0.19548628   2    2000005    24
    0.14938511   2    1000024    5
    0.14323252   2    1000006    25
    0.098333241   2    1000006    23
    0.075158679   2    1000025    6
    0.074938604   2    1000023    6
    0.018176757   2    1000022    6
    0.00054370896   2    1000037    5
    0.00053712431   2    1000005    24
    0.00027064931   2    1000035    6

DECAY 1000024  4.8740193
    0.87145694   2   -1000005    6
    0.12796278   2    1000022    24
    0.0005802397   3    1000022   -5    6

DECAY 1000037  44.068699
    0.24179496   2    1000006   -5
    0.23030548   2   -2000005    6
    0.12885339   2    1000024    25
    0.12817632   2    1000025    24
    0.12735196   2    1000024    23
    0.12627265   2    1000023    24
    0.0069496906   3    1000024    6   -6
    0.0050786648   3    1000023   -5    6
    0.0048297576   3    1000025   -5    6
    0.0002475075   2    1000022    24

DECAY 1000022 -1


DECAY 1000023  4.9921971
    0.4412194   2    1000005   -5
    0.4412194   2   -1000005    5
    0.11414981   2    1000022    25
    0.0034093659   2    1000022    23

DECAY 1000025  5.7055666
    0.3905505   2    1000005   -5
    0.3905505   2   -1000005    5
    0.12589537   2    1000022    23
    0.09299771   2    1000022    25

DECAY 1000035  48.272299
    0.11707139   2    1000024   -24
    0.11707139   2   -1000024    24
    0.1100259   2    2000005   -5
    0.1100259   2   -2000005    5
    0.10582547   2    1000023    25
    0.10545173   2    1000006   -6
    0.10545173   2   -1000006    6
    0.10527984   2    1000025    23
    0.097292121   2    1000025    25
    0.011336292   2    1000023    23
    0.004636611   3    1000024    5   -6
    0.004636611   3   -1000024   -5    6
    0.0028749976   3    1000023    6   -6
    0.0026527168   3    1000025    6   -6
    0.00020014267   2    1000022    25

DECAY 1000021  99.287405
    0.29121554   2    1000005   -5
    0.29121554   2   -1000005    5
    0.10560431   2    2000005   -5
    0.10560431   2   -2000005    5
    0.10292231   2    1000006   -6
    0.10292231   2   -1000006    6
    0.00011221642   3    1000025    5   -5
    0.00011214631   3    1000023    5   -5

DECAY 25  0.0039394701
    0.56471077   2   -5    5
    0.23725446   2   -24    24
    0.071766825   2    21    21
    0.064997314   2   -15    15
    0.029008752   2    23    23
    0.027930547   2   -4    4
    0.0023501278   2    22    22
    0.0015430759   2    22    23
    0.00022543642   2   -13    13
    0.00021196046   2   -3    3
    5.8604759e-07   2   -1    1
    1.4393118e-07   2   -2    2
    5.068055e-09   2   -11    11

DECAY 35  130.40613
    0.35331552   2   -5    5
    0.24995529   2   -2000005    1000005
    0.24995529   2   -1000005    2000005
    0.11972582   2   -15    15
    0.013505075   2    1000022    1000025
    0.0078800378   2    1000022    1000023
    0.0026171675   2   -1000005    1000005
    0.0010051149   2   -2000005    2000005
    0.00049754318   2   -6    6
    0.00041809756   2   -13    13
    0.00035785454   2   -1000006    1000006
    0.00026359291   2   -1000024    1000024
    0.00020750157   2    1000022    1000022
    0.00020333006   2   -3    3
    4.1174345e-05   2    21    21
    2.5428445e-05   2    1000023    1000025
    1.962319e-05   2    1000025    1000025
    4.1183083e-06   2    1000022    1000035
    8.8238922e-07   2    25    25
    6.7270803e-07   2    1000023    1000023
    5.6203899e-07   2   -1    1
    1.1353095e-07   2    22    23
    9.1975985e-08   2    23    23
    4.3189277e-08   2    22    22
    2.1424151e-08   2   -24    24
    9.9730696e-09   2   -1000011    1000011
    9.848618e-09   2   -1000013    1000013
    9.3896191e-09   2   -11    11
    6.78816e-09   2   -4    4
    3.4998971e-14   2   -2    2

DECAY 36  125.42528
    0.33747937   2   -5    5
    0.26198828   2   -2000005    1000005
    0.26198828   2   -1000005    2000005
    0.11432652   2   -15    15
    0.014021177   2    1000022    1000023
    0.0082074474   2    1000022    1000025
    0.00056403735   2   -1000024    1000024
    0.00039923975   2   -13    13
    0.00039085671   2   -6    6
    0.00031085603   2    1000022    1000022
    0.00019414883   2   -3    3
    6.9835637e-05   2    1000022    1000035
    3.6775036e-05   2    1000025    1000025
    1.4274611e-05   2    1000023    1000025
    6.6250089e-06   2    21    21
    1.5104511e-06   2    1000023    1000023
    5.3665818e-07   2   -1    1
    1.8528093e-07   2    23    25
    2.2784939e-08   2    22    22
    1.3545749e-08   2    22    23
    8.966087e-09   2   -11    11
    5.2251052e-09   2   -4    4
    2.6939961e-14   2   -2    2
    2.3652532e-14   2    23    35
    6.8337026e-38   2    25    25

DECAY 37  137.79188
    0.47366238   2   -1000005    1000006
    0.40060711   2   -5    6
    0.10347359   2   -15    16
    0.020296747   2    1000022    1000024
    0.00059343939   2   -5    4
    0.00036581598   2   -13    14
    0.00028203771   2   -1000005    1000004
    0.00021936047   2    1000023    1000024
    0.0001748758   2   -3    4
    0.00016482114   2   -2000005    1000006
    7.5758576e-05   2    1000024    1000025
    6.7870155e-05   2    1000022    1000037
    8.2093696e-06   2   -3    2
    4.2377692e-06   2   -5    2
    2.0140419e-06   2   -1000005    1000002
    1.0207175e-06   2   -3    6
    4.8496816e-07   2   -1    2
    1.6875107e-07   2    24    25
    3.4885393e-08   2   -1    6
    2.3018612e-08   2   -1    4
    8.5564738e-09   2   -11    12
    5.9758605e-14   2    24    35

DECAY 6  2.43
    1   2    5    24

DECAY 15 -1
