BLOCK SPINFO
   1   SPheno
   2   v4.0.5be

BLOCK SPHENOINFO
   1   2
   2   2

BLOCK MODSEL
   1   0

BLOCK MINPAR
   3    41.010378
   4    1

BLOCK EXTPAR
   0    1219.3784
   1   -458.65188
   2    475.47128
   3    3000
   11   -2310.1246
   12   -88.316224
   13   -1532.9726
   23    533.67247
   25    40.229815
   26    2719.1885
   31    993.37276
   32    993.37276
   33    467.33603
   34    1140.4003
   35    1140.4003
   36    1430.8718
   41    5000
   42    5000
   43    1214.5511
   44    5000
   45    5000
   46    1400.3747
   47    5000
   48    5000
   49    1732.9038

BLOCK SMINPUTS
   1    127.90897
   2    1.1663787e-05
   3    0.1184
   4    91.1876
   5    4.18
   6    173.2
   7    1.777
   8    0
   11    0.00051099893
   12    0
   13    0.10565837
   14    0
   21    0.005
   22    0.0025
   23    0.095
   24    1.27

BLOCK GAUGE Q=  1219.3784
   1    0.35536298
   2    0.66519887
   3    1.219778

BLOCK YU Q=  1219.3784
   1   1    8.386962e-06
   2   2    0.0042605767
   3   3    1.0132124

BLOCK YD Q=  1219.3784
   1   1    0.00067800509
   2   2    0.012882097
   3   3    0.67236859

BLOCK YE Q=  1219.3784
   1   1    0.00011831685
   2   2    0.024464171
   3   3    0.41144711

BLOCK AU Q=  1219.3784
   1   1    0
   2   2    0
   3   3   -2310.1245

BLOCK AD Q=  1219.3784
   1   1    0
   2   2    0
   3   3   -88.316229

BLOCK AE Q=  1219.3784
   1   1    0
   2   2    0
   3   3   -1532.9726

BLOCK MSOFT Q=  1219.3784
   1   -458.65188
   2    475.47128
   3    3000
   21    7133354.6
   22   -264957.35
   31    993.37276
   32    993.37276
   33    467.33603
   34    1140.4003
   35    1140.4003
   36    1430.8718
   41    5000
   42    5000
   43    1214.5511
   44    5000
   45    5000
   46    1400.3747
   47    5000
   48    5000
   49    1732.9038

BLOCK MASS
   6    173.2
   23    91.1876
   24    80.429995
   15    1.777
   25    122.20197
   35    2717.486
   36    2719.1885
   37    2719.2472
   1000001    5016.956
   2000001    5006.4187
   1000002    5016.5059
   2000002    5008.3078
   1000003    5016.9625
   2000003    5006.4281
   1000004    5016.5116
   2000004    5008.3089
   1000005    1146.9418
   2000005    1721.701
   1000006    1073.5516
   2000006    1385.0137
   1000011    998.7096
   2000011    1140.976
   1000012    995.15851
   1000013    998.69977
   2000013    1140.9802
   1000014    995.15791
   1000015    483.50512
   2000015    1431.8343
   1000016    477.63234
   1000021    3168.1697
   1000022   -450.14445
   1000023    462.33856
   1000025   -552.25917
   1000035    582.6344
   1000024    463.32429
   1000037    584.54647

BLOCK ALPHA
      -0.024449761

BLOCK HMIX Q=  1219.3784
   1    533.67247
   2    40.229815
   3    244.21128
   4    7393986.2

BLOCK STOPMIX
   1   1    0.88075135
   1   2    0.47357899
   2   1   -0.47357899
   2   2    0.88075135

BLOCK SBOTMIX
   1   1    0.99955416
   1   2    0.029857652
   2   1   -0.029857652
   2   2    0.99955416

BLOCK STAUMIX
   1   1    0.99971365
   1   2    0.023929283
   2   1   -0.023929283
   2   2    0.99971365

BLOCK NMIX
   1   1   -0.949009
   1   2   -0.016419124
   1   3   -0.24263732
   1   4   -0.20059777
   2   1   -0.019209906
   2   2   -0.80371155
   2   3    0.45049602
   2   4   -0.38824227
   3   1    0.31361793
   3   2   -0.050487774
   3   3   -0.66186344
   3   4   -0.67899306
   4   1    0.025626179
   4   2   -0.59264589
   4   3   -0.54782959
   4   4    0.58991262

BLOCK UMIX
   1   1   -0.77768051
   1   2    0.6286597
   2   1    0.6286597
   2   2    0.77768051

BLOCK VMIX
   1   1   -0.8398415
   1   2    0.5428317
   2   1    0.5428317
   2   2    0.8398415

BLOCK HIGGSBOUNDSINPUTHIGGSCOUPLINGSFERMIONS
       0, 1618.438,3,36,15,15

BLOCK HIGGSBOUNDSINPUTHIGGSCOUPLINGSBOSONS
       0,4,36,21,21,23

BLOCK SPHENOLOWENERGY
   1    0.00027047113
   2    1.6002562e-06
   3    3.52275e-05
   4    2.6347646e-15
   5    1.1255269e-10
   6    2.348426e-08
   7    8.8556968e-14
   8    3.7831038e-09
   9    7.9990285e-07
   10    9.5870209e-05
   11    0.99030255
   12    0.54258955
   13    19.381237
   14    0
   15    0
   16    0.0021592779
   17    2.2816795e-15
   18    2.4773875e-11
   19    8.2843765e-11
   20    1.3265988e-14
   21    5.6717216e-10
   22    2.4002348e-07
   23    0
   24    0
   25    0
   26    0
   27    0
   28    0
   29    0
   30    0
   31    0
   39    8.6858395e-05
   40    0
   41    0
   42    0

BLOCK FWCOEF Q=  160
   305   4422   0   0   -0.18881911
   305   4422   0   2   -0.1238311
   305   4322   0   2    0.00023068121
   305   6421   0   0   -0.095227835
   305   6421   0   2   -0.071568674
   305   6321   0   2   -5.8043935e-05
   3051111   4133   0   0    1.5848965
   3051111   4133   0   2    1.5864686
   3051111   4233   0   2    0.00020547519
   3051111   4137   0   0   -4.4075886
   3051111   4137   0   2   -4.403429
   3051111   4237   0   2   -0.0016150447
   3051313   4133   0   0    1.5848965
   3051313   4133   0   2    1.5864642
   3051313   4233   0   2    0.00020547356
   3051313   4137   0   0   -4.4075886
   3051313   4137   0   2   -4.4034333
   3051313   4237   0   2   -0.0016150479
   3051212   4137   0   0    1.5053501
   3051212   4137   0   2    1.5044664
   3051212   4237   0   2    0.00035253985
   3051414   4137   0   0    1.5053501
   3051414   4137   0   2    1.5044664
   3051414   4237   0   2    0.00035253994
   3051616   4137   0   0    1.5053501
   3051616   4137   0   2    1.5044673
   3051616   4237   0   2    0.00035256723

BLOCK IMFWCOEF Q=  160
   305   4422   0   0    3.8587863e-07
   305   4422   0   2    3.2938122e-05
   305   4322   0   2    6.690438e-06
   305   6421   0   0    3.3053057e-07
   305   6421   0   2   -1.1693873e-06
   305   6321   0   2    2.2535383e-06
   3051111   4133   0   2   -5.6202519e-07
   3051111   4233   0   2    4.4949455e-06
   3051111   4137   0   2    5.5264075e-06
   3051111   4237   0   2   -3.5347327e-05
   3051313   4133   0   2   -5.6213694e-07
   3051313   4233   0   2    4.4949253e-06
   3051313   4137   0   2    5.5264374e-06
   3051313   4237   0   2   -3.5347394e-05
   3051212   4137   0   2   -7.9515597e-07
   3051212   4237   0   2    7.715808e-06
   3051414   4137   0   2   -7.9515372e-07
   3051414   4237   0   2    7.715808e-06
   3051616   4137   0   2   -7.8027788e-07
   3051616   4237   0   2    7.7158026e-06

DECAY 23  2.4952


DECAY 24  2.085


DECAY 1000011  8.0091264
    0.40886558   2   -1000024    12
    0.22448172   2    1000023    11
    0.18750237   2   -1000037    12
    0.095471197   2    1000022    11
    0.080054845   2    1000035    11
    0.0036242811   2    1000025    11

DECAY 2000011  4.0151538
    0.91677731   2    1000022    11
    0.082342128   2    1000025    11
    0.0005124242   2    1000035    11
    0.00036808626   2    1000023    11

DECAY 1000013  8.0149387
    0.40856065   2   -1000024    14
    0.22449856   2    1000023    13
    0.18736071   2   -1000037    14
    0.095456073   2    1000022    13
    0.080189596   2    1000035    13
    0.0039344088   2    1000025    13

DECAY 2000013  4.0317854
    0.91314078   2    1000022    13
    0.082870549   2    1000025    13
    0.0011084908   2   -1000037    14
    0.0010630713   2    1000035    13
    0.00092871555   2   -1000024    14
    0.00084434175   2    1000023    13

DECAY 1000015  0.042430059
    0.41482566   2   -1000024    16
    0.29958854   2    1000022    15
    0.28558553   2    1000023    15

DECAY 2000015  14.377637
    0.37994746   2    1000022    15
    0.14972994   2   -1000037    16
    0.1441688   2    1000025    15
    0.096264317   2   -1000024    16
    0.074628698   2    1000035    15
    0.055095487   2    1000016   -24
    0.049641258   2    1000023    15
    0.027168583   2    1000015    23
    0.023355456   2    1000015    25

DECAY 1000012  8.0558313
    0.47053926   2    1000024    11
    0.21048959   2    1000023    12
    0.13746489   2    1000037    11
    0.086345813   2    1000035    12
    0.0827819   2    1000022    12
    0.012378542   2    1000025    12

DECAY 1000014  8.0617624
    0.47054553   2    1000024    13
    0.21033447   2    1000023    14
    0.13774757   2    1000037    13
    0.086282126   2    1000035    14
    0.082720894   2    1000022    14
    0.012369415   2    1000025    14

DECAY 1000016  0.022859986
    0.49353018   2    1000024    15
    0.27656791   2    1000022    16
    0.22990191   2    1000023    16

DECAY 2000001  144.79074
    0.98102169   2    1000021    1
    0.017105623   2    1000022    1
    0.0018528819   2    1000025    1

DECAY 1000001  208.69912
    0.68587206   2    1000021    1
    0.12581008   2   -1000024    2
    0.081378885   2   -1000037    2
    0.066620928   2    1000023    1
    0.036726738   2    1000035    1
    0.0024236331   2    1000022    1
    0.0011676689   2    1000025    1

DECAY 2000003  144.82394
    0.98080364   2    1000021    3
    0.017108322   2    1000022    3
    0.0019011176   2    1000025    3

DECAY 1000003  208.71778
    0.68581394   2    1000021    3
    0.12580143   2   -1000024    4
    0.081377754   2   -1000037    4
    0.06663083   2    1000023    3
    0.036746637   2    1000035    3
    0.0024280021   2    1000022    3
    0.0012014021   2    1000025    3

DECAY 1000005  28.922686
    0.40939481   2   -1000037    6
    0.25604059   2   -1000024    6
    0.13237148   2    1000023    5
    0.092152644   2    1000025    5
    0.090878573   2    1000035    5
    0.019161911   2    1000022    5

DECAY 2000005  26.99058
    0.279817   2   -1000037    6
    0.2079697   2    1000025    5
    0.17780911   2   -1000024    6
    0.1413492   2    1000035    5
    0.093032119   2    1000023    5
    0.054582113   2    1000022    5
    0.019821621   2    1000006   -24
    0.015109926   2    1000005    25
    0.0094753845   2    1000005    23
    0.001033824   2    2000006   -24

DECAY 2000002  153.23513
    0.92824449   2    1000021    2
    0.064677026   2    1000022    2
    0.0070053581   2    1000025    2

DECAY 1000002  208.69476
    0.68566156   2    1000021    2
    0.14671573   2    1000024    1
    0.067759942   2    1000023    2
    0.060670809   2    1000037    1
    0.035610093   2    1000035    2
    0.0035788948   2    1000022    2

DECAY 2000004  153.23872
    0.92822313   2    1000021    4
    0.064676002   2    1000022    4
    0.0070104804   2    1000025    4

DECAY 1000004  208.71327
    0.68560329   2    1000021    4
    0.1467336   2    1000024    3
    0.067755256   2    1000023    4
    0.060712103   2    1000037    3
    0.035609954   2    1000035    4
    0.0035789211   2    1000022    4

DECAY 1000006  24.670053
    0.40268425   2    1000024    5
    0.18430163   2    1000025    6
    0.17267573   2    1000023    6
    0.10184225   2    1000035    6
    0.093756317   2    1000037    5
    0.027324643   2    1000023    4
    0.015809677   2    1000022    6
    0.0014763112   2    1000022    4
    0.00012918675   3    1000022    24    5

DECAY 2000006  66.123136
    0.2561477   2    1000037    5
    0.15824683   2    1000005    24
    0.15256804   2    1000035    6
    0.13197725   2    1000006    23
    0.12884286   2    1000025    6
    0.066221236   2    1000006    25
    0.054512269   2    1000022    6
    0.029121897   2    1000024    5
    0.022361928   2    1000023    6

DECAY 1000024  5.0920524e-08
    0.3754245   3    1000022   -1    2
    0.35880071   3    1000022   -3    4
    0.1206531   3    1000022   -11    12
    0.120615   3    1000022   -13    14
    0.024468059   3    1000022   -15    16

DECAY 1000037  1.21936
    0.33232869   2    1000022    24
    0.28120189   2    1000023    24
    0.18590416   2    1000024    23
    0.12036389   2    1000016   -15
    0.080116826   2   -1000015    16

DECAY 1000022 -1


DECAY 1000023  4.3208168e-08
    0.40651491   2    1000022    22
    0.11308648   3    1000022    1   -1
    0.11300702   3    1000022    3   -3
    0.10277388   3    1000022    12   -12
    0.088208501   3    1000022    2   -2
    0.076344936   3    1000022    4   -4
    0.02843847   3    1000022    15   -15
    0.024462522   3    1000022    11   -11
    0.024436167   3    1000022    13   -13
    0.022727123   3    1000022    5   -5

DECAY 1000025  1.173113
    0.44033143   2    1000024   -24
    0.44033143   2   -1000024    24
    0.019595625   2    1000015   -15
    0.019595625   2   -1000015    15
    0.014721074   3    1000023    12   -12
    0.011001336   3    1000023    1   -1
    0.011001279   3    1000023    3   -3
    0.010902403   3    1000023    5   -5
    0.008580163   3    1000023    2   -2
    0.0085697556   3    1000023    4   -4
    0.0031275613   2    1000016   -16
    0.0031275613   2   -1000016    16
    0.0024841324   3    1000023    11   -11
    0.0024841265   3    1000023    13   -13
    0.0024773352   3    1000023    15   -15
    0.0012668016   2    1000022    23
    0.0004017671   2    1000023    22

DECAY 1000035  1.4070751
    0.27607006   2    1000022    23
    0.24027635   2    1000024   -24
    0.24027635   2   -1000024    24
    0.0747828   2    1000022    25
    0.047699807   2    1000015   -15
    0.047699807   2   -1000015    15
    0.036034632   2    1000016   -16
    0.036034632   2   -1000016    16
    0.0010621227   2    1000023    23

DECAY 1000021  275.69004
    0.12839584   2    1000005   -5
    0.12839584   2   -1000005    5
    0.12356425   2    2000006   -6
    0.12356425   2   -2000006    6
    0.11947055   2    1000006   -6
    0.11947055   2   -1000006    6
    0.084474245   2    2000005   -5
    0.084474245   2   -2000005    5
    0.043985216   2    1000006   -4
    0.043985216   2   -1000006    4

DECAY 25  0.0035585495
    0.61642682   2   -5    5
    0.18402553   2   -24    24
    0.073672175   2    21    21
    0.07046301   2   -15    15
    0.030291529   2   -4    4
    0.021055919   2    23    23
    0.0023292117   2    22    22
    0.0012602091   2    22    23
    0.0002442658   2   -13    13
    0.00023053432   2   -3    3
    6.3740322e-07   2   -1    1
    1.5610827e-07   2   -2    2
    5.4914052e-09   2   -11    11

DECAY 35  93.394385
    0.5042283   2   -5    5
    0.11897424   2   -15    15
    0.066064702   2   -1000024    1000037
    0.066064702   2   -1000037    1000024
    0.048739369   2   -1000024    1000024
    0.026608752   2    1000025    1000035
    0.025676398   2   -1000037    1000037
    0.025031204   2    1000022    1000025
    0.022646738   2    1000022    1000022
    0.018724784   2    1000022    1000023
    0.016812059   2    1000035    1000035
    0.010302445   2   -1000006    1000006
    0.0102092   2   -2000015    1000015
    0.0102092   2   -1000015    2000015
    0.0071858686   2    1000023    1000025
    0.006101467   2    1000022    1000035
    0.0042133499   2    1000025    1000025
    0.0030729105   2    1000023    1000023
    0.0029373798   2   -2000006    1000006
    0.0029373798   2   -1000006    2000006
    0.0020908683   2    1000023    1000035
    0.00055911698   2   -6    6
    0.00037729943   2   -13    13
    0.00019644551   2   -3    3
    2.9305713e-05   2   -1000015    1000015
    3.2303431e-06   2    21    21
    1.2875651e-06   2    25    25
    5.4309629e-07   2   -1    1
    3.3324184e-07   2   -1000005    1000005
    2.2789921e-07   2    23    23
    9.7955726e-08   2    22    23
    8.7534264e-08   2    22    22
    7.8547039e-08   2   -24    24
    4.3010465e-08   2   -1000011    1000011
    4.2343177e-08   2   -1000013    1000013
    2.2167422e-08   2   -2000011    2000011
    2.2147845e-08   2   -2000013    2000013
    1.2295609e-08   2   -4    4
    8.474146e-09   2   -11    11
    2.4913153e-09   2   -2000013    1000013
    2.4913153e-09   2   -1000013    2000013
    6.3391091e-14   2   -2    2
    5.8284794e-14   2   -2000011    1000011
    5.8284794e-14   2   -1000011    2000011

DECAY 36  89.707522
    0.4889956   2   -5    5
    0.11541325   2   -15    15
    0.06131544   2   -1000024    1000024
    0.058513139   2   -1000024    1000037
    0.058513139   2   -1000037    1000024
    0.036858808   2   -1000037    1000037
    0.028631311   2    1000022    1000022
    0.023612883   2    1000035    1000035
    0.022005153   2    1000025    1000035
    0.019769906   2    1000022    1000025
    0.017385807   2    1000022    1000023
    0.010652231   2   -2000015    1000015
    0.010652231   2   -1000015    2000015
    0.010002147   2   -2000006    1000006
    0.010002147   2   -1000006    2000006
    0.0083347679   2    1000022    1000035
    0.0077840306   2    1000023    1000025
    0.0047387316   2    1000025    1000025
    0.0033132853   2    1000023    1000023
    0.0024674955   2    1000023    1000035
    0.00046750645   2   -6    6
    0.00036599695   2   -13    13
    0.00019054134   2   -3    3
    1.3309166e-05   2    21    21
    5.267741e-07   2   -1    1
    3.6232341e-07   2    23    25
    1.5073155e-07   2    22    23
    8.3113781e-08   2    22    22
    1.0794156e-08   2   -4    4
    8.2203007e-09   2   -11    11
    2.5509386e-09   2   -2000013    1000013
    2.5509386e-09   2   -1000013    2000013
    1.751525e-13   2    23    35
    5.966669e-14   2   -2000011    1000011
    5.966669e-14   2   -1000011    2000011
    5.5655462e-14   2   -2    2
    5.8690815e-37   2    25    25

DECAY 37  94.222336
    0.54268323   2   -5    6
    0.10871331   2    1000022    1000037
    0.09706832   2   -15    16
    0.095615327   2    1000024    1000035
    0.050013863   2    1000024    1000025
    0.039460181   2    1000025    1000037
    0.036442081   2    1000023    1000024
    0.020313737   2   -2000015    1000016
    0.0053115264   2    1000023    1000037
    0.0028110507   2   -1000005    1000006
    0.00080418627   2   -5    4
    0.00034317122   2   -13    14
    0.00018944283   2    1000035    1000037
    0.0001780638   2   -3    4
    1.8957697e-05   2    1000022    1000024
    1.6984117e-05   2   -1000015    1000016
    8.3303027e-06   2   -3    2
    5.7427204e-06   2   -5    2
    1.2351073e-06   2   -3    6
    4.9386156e-07   2   -1    2
    3.4524596e-07   2    24    25
    1.6749003e-07   2   -1000011    1000012
    1.6655345e-07   2   -1000013    1000014
    4.4587458e-08   2   -1    6
    2.3445678e-08   2   -1    4
    8.0268105e-09   2   -11    12
    5.2778497e-09   2   -2000013    1000014
    2.448413e-13   2    24    35
    1.2347163e-13   2   -2000011    1000012

DECAY 6  2.43
    1   2    5    24

DECAY 15 -1
