BLOCK SPINFO
   1   SPheno
   2   v4.0.5be

BLOCK SPHENOINFO
   1   2
   2   2

BLOCK MODSEL
   1   0

BLOCK MINPAR
   3    15.346054
   4   -1

BLOCK EXTPAR
   0    2426.9025
   1    1838.2863
   2    1599.8896
   3    2301.6021
   11   -6421.1968
   12    4100.1895
   13   -6918.4595
   23   -876.04045
   25    14.715026
   26    1085.6639
   31    2367.374
   32    2367.374
   33    2269.2774
   34    2735.3308
   35    2735.3308
   36    986.20426
   41    3919.8329
   42    3919.8329
   43    2510.3942
   44    965.9923
   45    965.9923
   46    2430.5921
   47    3242.3045
   48    3242.3045
   49    1878.5239

BLOCK SMINPUTS
   1    127.90897
   2    1.1663787e-05
   3    0.1184
   4    91.1876
   5    4.18
   6    173.2
   7    1.777
   8    0
   11    0.00051099893
   12    0
   13    0.10565837
   14    0
   21    0.005
   22    0.0025
   23    0.095
   24    1.27

BLOCK GAUGE Q=  2426.9025
   1    0.35536298
   2    0.66519887
   3    1.219778

BLOCK YU Q=  2426.9025
   1   1    8.4037104e-06
   2   2    0.0042690849
   3   3    1.0152357

BLOCK YD Q=  2426.9025
   1   1    0.00024849197
   2   2    0.0047213474
   3   3    0.24642617

BLOCK YE Q=  2426.9025
   1   1    4.3363666e-05
   2   2    0.0089662307
   3   3    0.15079725

BLOCK AU Q=  2426.9025
   1   1    0
   2   2    0
   3   3   -6421.1967

BLOCK AD Q=  2426.9025
   1   1    0
   2   2    0
   3   3    4100.1894

BLOCK AE Q=  2426.9025
   1   1    0
   2   2    0
   3   3   -6918.4595

BLOCK MSOFT Q=  2426.9025
   1    1838.2863
   2    1599.8896
   3    2301.6021
   21    367969.39
   22   -678900.34
   31    2367.374
   32    2367.374
   33    2269.2774
   34    2735.3308
   35    2735.3308
   36    986.20426
   41    3919.8329
   42    3919.8329
   43    2510.3942
   44    965.9923
   45    965.9923
   46    2430.5921
   47    3242.3045
   48    3242.3045
   49    1878.5239

BLOCK MASS
   6    173.2
   23    91.1876
   24    80.429995
   15    1.777
   25    124.37579
   35    1085.7104
   36    1085.6639
   37    1088.7363
   1000001    3982.9962
   2000001    3304.9347
   1000002    3982.34
   2000002    1116.5451
   1000003    3982.9957
   2000003    3304.9341
   1000004    3982.3395
   2000004    1116.5452
   1000005    1982.1092
   2000005    2512.1833
   1000006    2248.8125
   2000006    2619.096
   1000011    2379.4094
   2000011    2741.4678
   1000012    2377.7324
   1000013    2379.4071
   2000013    2741.4638
   1000014    2377.7303
   1000015    994.86893
   2000015    2276.3952
   1000016    2274.6571
   1000021    2507.7221
   1000022    884.75901
   1000023   -891.75104
   1000025    1650.7041
   1000035    1811.1504
   1000024    887.7076
   1000037    1650.8626

BLOCK ALPHA
      -0.066171948

BLOCK HMIX Q=  2426.9025
   1   -876.04045
   2    14.715026
   3    243.43891
   4    1178666.1

BLOCK STOPMIX
   1   1    0.55732417
   1   2    0.83029499
   2   1   -0.83029499
   2   2    0.55732417

BLOCK SBOTMIX
   1   1   -0.015113276
   1   2    0.99988579
   2   1   -0.99988579
   2   2   -0.015113276

BLOCK STAUMIX
   1   1   -0.002519789
   1   2    0.99999682
   2   1   -0.99999682
   2   2   -0.002519789

BLOCK NMIX
   1   1   -0.031639139
   1   2    0.068292501
   1   3    0.7072134
   1   4    0.70298244
   2   1   -0.012362448
   2   2    0.023626277
   2   3   -0.70615578
   2   4    0.70755423
   3   1    0.015799797
   3   2    0.99729669
   3   3   -0.031510286
   3   4   -0.064473156
   4   1    0.999298
   4   2   -0.013313636
   4   3    0.0141536
   4   4    0.032030009

BLOCK UMIX
   1   1   -0.045122692
   1   2   -0.99898145
   2   1    0.99898145
   2   2   -0.045122692

BLOCK VMIX
   1   1   -0.092231194
   1   2    0.99573762
   2   1    0.99573762
   2   2    0.092231194

BLOCK HIGGSBOUNDSINPUTHIGGSCOUPLINGSFERMIONS
       0, 216.53199,3,36,15,15

BLOCK HIGGSBOUNDSINPUTHIGGSCOUPLINGSBOSONS
       0,4,36,21,21,23

BLOCK SPHENOLOWENERGY
   1    0.00036849309
   2    1.5898439e-06
   3    3.5304822e-05
   4    2.2706354e-15
   5    9.6999033e-11
   6    2.0309733e-08
   7    7.6911376e-14
   8    3.2856537e-09
   9    6.9704751e-07
   10    9.5441319e-05
   11    0.98587229
   12    0.54267504
   13    19.383739
   14    0
   15    0
   16    0.0021608301
   17    2.281696e-15
   18    2.483548e-11
   19    8.2987797e-11
   20   -9.9236793e-16
   21   -4.2426835e-11
   22   -1.1931708e-08
   23    0
   24    0
   25    0
   26    0
   27    0
   28    0
   29    0
   30    0
   31    0
   39    5.7834351e-05
   40    0
   41    0
   42    0

BLOCK FWCOEF Q=  160
   305   4422   0   0   -0.18881911
   305   4422   0   2   -0.23909087
   305   4322   0   2   -0.00086254371
   305   6421   0   0   -0.095227835
   305   6421   0   2   -0.14208096
   305   6321   0   2   -0.00083961927
   3051111   4133   0   0    1.6087899
   3051111   4133   0   2    1.6097978
   3051111   4233   0   2    4.5002782e-05
   3051111   4137   0   0   -4.431482
   3051111   4137   0   2   -4.4349259
   3051111   4237   0   2   -0.00034089827
   3051313   4133   0   0    1.6087899
   3051313   4133   0   2    1.6097975
   3051313   4233   0   2    4.5002542e-05
   3051313   4137   0   0   -4.431482
   3051313   4137   0   2   -4.4349261
   3051313   4237   0   2   -0.00034089808
   3051212   4137   0   0    1.5053501
   3051212   4137   0   2    1.5061058
   3051212   4237   0   2    7.401301e-05
   3051414   4137   0   0    1.5053501
   3051414   4137   0   2    1.5061058
   3051414   4237   0   2    7.4013059e-05
   3051616   4137   0   0    1.5053501
   3051616   4137   0   2    1.5061057
   3051616   4237   0   2    7.4026987e-05

BLOCK IMFWCOEF Q=  160
   305   4422   0   0    3.8578418e-07
   305   4422   0   2   -1.8896739e-05
   305   4322   0   2   -4.5421683e-06
   305   6421   0   0    3.3044966e-07
   305   6421   0   2    2.2162166e-05
   305   6321   0   2   -2.070985e-06
   3051111   4133   0   2   -1.1272918e-06
   3051111   4233   0   2    1.288621e-06
   3051111   4137   0   2    1.1794458e-05
   3051111   4237   0   2   -9.774071e-06
   3051313   4133   0   2   -1.1272979e-06
   3051313   4233   0   2    1.2886207e-06
   3051313   4137   0   2    1.1794455e-05
   3051313   4237   0   2   -9.7740717e-06
   3051212   4137   0   2   -2.4199577e-06
   3051212   4237   0   2    2.1220629e-06
   3051414   4137   0   2   -2.4199577e-06
   3051414   4237   0   2    2.1220629e-06
   3051616   4137   0   2   -2.4206127e-06
   3051616   4237   0   2    2.122063e-06

DECAY 23  2.4952


DECAY 24  2.085


DECAY 1000011  9.0292237
    0.62269264   2   -1000037    12
    0.31568414   2    1000025    11
    0.055600261   2    1000035    11
    0.0034999241   2   -1000024    12
    0.0022747372   2    1000022    11
    0.00024830356   2    1000023    11

DECAY 2000011  4.3826218
    0.99677202   2    1000035    11
    0.0025250471   2    1000022    11
    0.00038409102   2    1000023    11
    0.00031881892   2    1000025    11

DECAY 1000013  9.0319977
    0.62249851   2   -1000037    14
    0.31558579   2    1000025    13
    0.055582853   2    1000035    13
    0.0034988435   2   -1000024    14
    0.0024305657   2    1000022    13
    0.0004034357   2    1000023    13

DECAY 2000013  4.389667
    0.9951663   2    1000035    13
    0.0029219637   2    1000022    13
    0.00079874082   2   -1000024    14
    0.00078169878   2    1000023    13
    0.00031871033   2    1000025    13

DECAY 1000015  0.037480139
    0.49836519   2   -1000024    16
    0.27011908   2    1000022    15
    0.23151573   2    1000023    15

DECAY 2000015  11.860275
    0.37897334   2   -1000037    16
    0.19214887   2    1000025    15
    0.16465575   2    1000015    36
    0.16459954   2    1000015    35
    0.032857094   2    1000022    15
    0.03122171   2    1000023    15
    0.03083524   2    1000035    15
    0.002411228   2   -1000024    16
    0.0011696758   2    1000015    25
    0.001127564   2    1000015    23

DECAY 1000012  9.0612603
    0.61442086   2    1000037    11
    0.30308716   2    1000025    12
    0.060936166   2    1000035    12
    0.014553985   2    1000024    11
    0.006222351   2    1000022    12
    0.00077947608   2    1000023    12

DECAY 1000014  9.064035
    0.6142303   2    1000037    13
    0.3029931   2    1000025    14
    0.060917154   2    1000035    14
    0.01485978   2    1000024    13
    0.006220437   2    1000022    14
    0.00077923631   2    1000023    14

DECAY 1000016  11.852387
    0.37520524   2    1000037    15
    0.32597828   2    1000015    37
    0.18508823   2    1000025    16
    0.072625554   2    1000024    15
    0.033880118   2    1000035    16
    0.0044162647   2    1000022    16
    0.0022533988   2    1000015    24
    0.00055291814   2    1000023    16

DECAY 2000001  47.857775
    0.98110824   2    1000021    1
    0.018847866   2    1000035    1

DECAY 1000001  151.0016
    0.75854294   2    1000021    1
    0.15894818   2   -1000037    2
    0.078766253   2    1000025    1
    0.0026723115   2    1000035    1
    0.00057344438   2    1000022    1
    0.00042697034   2   -1000024    2

DECAY 2000003  47.860233
    0.98105667   2    1000021    3
    0.01884689   2    1000035    3

DECAY 1000003  151.00449
    0.75852803   2    1000021    3
    0.15894516   2   -1000037    4
    0.078764729   2    1000025    3
    0.0026722608   2    1000035    3
    0.00057870884   2    1000022    3
    0.00043550545   2   -1000024    4

DECAY 1000005  3.0454292
    0.48706997   2   -1000024    6
    0.25420193   2    1000022    5
    0.24884669   2    1000023    5
    0.0098697992   2    1000035    5

DECAY 2000005  74.75171
    0.51551567   2   -1000024    6
    0.30334886   2    1000006   -24
    0.098551999   2   -1000037    6
    0.047257851   2    1000025    5
    0.016101143   2    1000022    5
    0.0155749   2    1000023    5
    0.0015404643   2    1000005    25
    0.0012538262   2    1000035    5
    0.00084671249   2    1000005    23

DECAY 2000002  0.00039554805
    0.87366314   2    1000022    2
    0.12633633   2    1000023    2

DECAY 1000002  150.97421
    0.75822718   2    1000021    2
    0.15789864   2    1000037    1
    0.079650569   2    1000025    2
    0.001979727   2    1000035    2
    0.0017838682   2    1000024    1
    0.00041193605   2    1000022    2

DECAY 2000004  0.00050268327
    0.74045407   2    1000022    4
    0.15147083   2    1000023    4
    0.10807511   2    1000024    3

DECAY 1000004  150.97702
    0.75821221   2    1000021    4
    0.15789567   2    1000037    3
    0.079649101   2    1000025    4
    0.0019796923   2    1000035    4
    0.0017943552   2    1000024    3
    0.0004161855   2    1000022    4

DECAY 1000006  57.670983
    0.43249482   2    1000024    5
    0.2727072   2    1000022    6
    0.26546115   2    1000023    6
    0.014007575   2    1000037    5
    0.0076444295   2    1000025    6
    0.0073899038   2    1000035    6
    0.00019148116   3    1000022    24    5

DECAY 2000006  93.860027
    0.23021226   2    1000006    23
    0.2275978   2    1000023    6
    0.21787979   2    1000022    6
    0.13227174   2    1000024    5
    0.073122591   2    1000037    5
    0.060128776   2    1000006    25
    0.037625639   2    1000025    6
    0.013125433   2    2000005    24
    0.0064751527   2    1000035    6
    0.0015608153   2    1000005    24

DECAY 1000024  2.2368542e-10
    0.47155844   3    1000022   -1    2
    0.19080138   3    1000022   -3    4
    0.15718766   3    1000022   -11    12
    0.15618607   3    1000022   -13    14
    0.024266455   3    1000022   -15    16

DECAY 1000037  11.608354
    0.25025373   2    1000023    24
    0.24600378   2    1000024    25
    0.24403493   2    1000024    23
    0.24304475   2    1000022    24
    0.0067521272   3    1000023   -5    6
    0.0050500068   3    1000022   -5    6
    0.0047153177   3    1000024    6   -6
    0.0001045349   3    1000024    5   -5

DECAY 1000022 -1


DECAY 1000023  1.4103156e-07
    0.62941572   2    1000022    22
    0.082768091   3    1000022    12   -12
    0.061891985   3    1000022    1   -1
    0.061759113   3    1000022    3   -3
    0.048270427   3    1000022    2   -2
    0.030858109   3    1000022    4   -4
    0.013967243   3    1000022    11   -11
    0.013920073   3    1000022    13   -13
    0.010753326   3    1000024    1   -2
    0.010753326   3   -1000024   -1    2
    0.0066905096   3    1000024    3   -4
    0.0066905096   3   -1000024   -3    4
    0.0051244126   3    1000022    15   -15
    0.0035844688   3    1000024    11   -12
    0.0035844688   3   -1000024   -11    12
    0.0035722998   3    1000024    13   -14
    0.0035722998   3   -1000024   -13    14
    0.0014118094   3    1000024    15   -16
    0.0014118094   3   -1000024   -15    16

DECAY 1000025  14.636327
    0.22591565   2    1000023    25
    0.19939445   2    1000024   -24
    0.19939445   2   -1000024    24
    0.17434734   2    1000023    23
    0.16916522   2    1000022    25
    0.020473214   2    1000022    23
    0.0038946348   3    1000024    5   -6
    0.0038946348   3   -1000024   -5    6
    0.0018626735   3    1000023    6   -6
    0.0013700646   3    1000022    6   -6

DECAY 1000035  18.794451
    0.12389051   2    2000002   -2
    0.12389051   2   -2000002    2
    0.12389016   2    2000004   -4
    0.12389016   2   -2000004    4
    0.11788169   2    1000015   -15
    0.11788169   2   -1000015    15
    0.059672403   2    1000023    25
    0.050842926   2    1000024   -24
    0.050842926   2   -1000024    24
    0.050511334   2    1000023    23
    0.044679262   2    1000022    25
    0.0075182935   2    1000022    23
    0.0011267588   3    1000024    5   -6
    0.0011267588   3   -1000024   -5    6
    0.00078746218   3    1000023    6   -6
    0.00055411039   3    1000022    6   -6
    0.00034669564   2    1000025    25
    0.00028723522   2    1000037   -24
    0.00028723522   2   -1000037    24

DECAY 1000021  107.06213
    0.22283982   2    2000002   -2
    0.22283982   2   -2000002    2
    0.22283977   2    2000004   -4
    0.22283977   2   -2000004    4
    0.048829875   2    1000005   -5
    0.048829875   2   -1000005    5
    0.0036690506   2    1000006   -6
    0.0036690506   2   -1000006    6
    0.00082913399   3    1000024    5   -6
    0.00082913399   3   -1000024   -5    6
    0.00049128862   3    1000023    6   -6
    0.00047111564   3    1000022    6   -6
    0.00029277304   2    1000006   -4
    0.00029277304   2   -1000006    4
    0.00010092471   3    1000037    5   -6
    0.00010092471   3   -1000037   -5    6

DECAY 25  0.003855327
    0.58785619   2   -5    5
    0.2152063   2   -24    24
    0.071345297   2    21    21
    0.067478661   2   -15    15
    0.028191358   2   -4    4
    0.02572963   2    23    23
    0.0023128234   2    22    22
    0.0014241527   2    22    23
    0.00023405985   2   -13    13
    0.00022076479   2   -3    3
    6.103921e-07   2   -1    1
    1.4527841e-07   2   -2    2
    5.2619331e-09   2   -11    11

DECAY 35  4.033116
    0.82498394   2   -5    5
    0.12863131   2   -15    15
    0.044788377   2   -6    6
    0.00060140284   2    25    25
    0.00044770726   2   -13    13
    0.00032461136   2   -3    3
    0.00010217272   2   -24    24
    8.3695587e-05   2    23    23
    3.5085689e-05   2    21    21
    8.97532e-07   2   -1    1
    6.7610776e-07   2   -4    4
    9.4529576e-08   2    22    22
    2.4088926e-08   2    22    23
    1.0058404e-08   2   -11    11
    3.4859609e-12   2   -2    2

DECAY 36  3.9806907
    0.82037458   2   -5    5
    0.12790762   2   -15    15
    0.050651316   2   -6    6
    0.00044518134   2   -13    13
    0.00032278071   2   -3    3
    0.0001761215   2    21    21
    0.00012013621   2    23    25
    8.9246981e-07   2   -1    1
    6.8244971e-07   2   -4    4
    4.5184329e-07   2    22    22
    2.2389049e-07   2    22    23
    1.0001649e-08   2   -11    11
    3.5201427e-12   2   -2    2
    7.7028444e-34   2    25    25

DECAY 37  3.5670912
    0.85395814   2   -5    6
    0.1437458   2   -15    16
    0.0012231921   2   -5    4
    0.00050819505   2   -13    14
    0.00032207122   2   -3    4
    0.00013592128   2    24    25
    7.8528616e-05   2   -3    6
    1.4861138e-05   2   -3    2
    8.7348671e-06   2   -5    2
    3.5810908e-06   2   -1    6
    8.9181562e-07   2   -1    2
    7.534942e-08   2   -1    4
    1.1886735e-08   2   -11    12
    1.041814e-10   2    24    36
    9.6543148e-11   2    24    35

DECAY 6  2.43
    1   2    5    24

DECAY 15 -1
