#
#                              ======================
#                              | THE SUSYHIT OUTPUT |
#                              ======================
#
#
#              ------------------------------------------------------
#              |     This is the output of the SUSY-HIT package     |
#              |  created by A.Djouadi, M.Muehlleitner and M.Spira. |
#              |  In case of problems with SUSY-HIT email to        |
#              |           margarete.muehlleitner@cern.ch           |
#              |           michael.spira@psi.ch                     |
#              |           abdelhak.djouadi@cern.ch                 |
#              ------------------------------------------------------
#
#              ------------------------------------------------------
#              |  SUSY Les Houches Accord - MSSM Spectrum + Decays  |
#              |              based on the decay programs           |
#              |                                                    |
#              |                     SDECAY 1.3b                    |
#              |                                                    |
#              |  Authors: M.Muhlleitner, A.Djouadi and Y.Mambrini  |
#              |  Ref.:    Comput.Phys.Commun.168(2005)46           |
#              |           [hep-ph/0311167]                         |
#              |                                                    |
#              |                     HDECAY 3.4                     |
#              |                                                    |
#              |  By: A.Djouadi,J.Kalinowski,M.Muhlleitner,M.Spira  |
#              |  Ref.:    Comput.Phys.Commun.108(1998)56           |
#              |           [hep-ph/9704448]                         |
#              |                                                    |
#              |                                                    |
#              |  If not stated otherwise all DRbar couplings and   |
#              |  soft SUSY breaking masses are given at the scale  |
#              |  Q=  0.25253150E+04
#              |                                                    |
#              ------------------------------------------------------
#
#
BLOCK DCINFO  # Decay Program information
     1   SDECAY/HDECAY # decay calculator
     2   1.3b  /3.4    # version number
#
BLOCK SPINFO  # Spectrum calculator information
     1     SOFTSUSY    # spectrum calculator               
     2     3.4.0       # version number                    
#
BLOCK MODSEL  # Model selection
     1     0   #  nonUniversal                                     
#
BLOCK SMINPUTS  # Standard Model inputs
         1     1.27908970E+02   # alpha_em^-1(M_Z)^MSbar
         2     1.16637870E-05   # G_F [GeV^-2]
         3     1.18400000E-01   # alpha_S(M_Z)^MSbar
         4     9.11876000E+01   # M_Z pole mass
         5     4.18000000E+00   # mb(mb)^MSbar
         6     1.73200000E+02   # mt pole mass
         7     1.77700000E+00   # mtau pole mass
#
BLOCK MINPAR  # Input parameters - minimal models
         3     4.53900000E+01   # tanb                
#
BLOCK EXTPAR  # Input parameters - non-minimal models
         0    -1.00000000E+00   # Set                 
         1     3.28264000E+03   # M_1(MX)             
         2     5.75760000E+02   # M_2(MX)             
         3     2.47189000E+03   # M_3(MX)             
        11     2.27703000E+03   # At(MX)              
        12    -4.62650000E+02   # Ab(MX)              
        13    -8.63160000E+02   # Atau(MX)            
        23     3.17800000E+02   # mu(MX)              
        26     1.77972000E+03   # mA(pole)            
        31     3.82790000E+02   # meL(MX)             
        32     3.82790000E+02   # mmuL(MX)            
        33     3.24009000E+03   # mtauL(MX)           
        34     3.14660000E+02   # meR(MX)             
        35     3.14660000E+02   # mmuR(MX)            
        36     1.34595000E+03   # mtauR(MX)           
        41     3.33065000E+03   # mqL1(MX)            
        42     3.33065000E+03   # mqL2(MX)            
        43     2.63624000E+03   # mqL3(MX)            
        44     2.15650000E+02   # muR(MX)             
        45     2.15650000E+02   # mcR(MX)             
        46     2.41512000E+03   # mtR(MX)             
        47     6.80220000E+02   # mdR(MX)             
        48     6.80220000E+02   # msR(MX)             
        49     3.89465000E+03   # mbR(MX)             
#
BLOCK MASS  # Mass Spectrum
# PDG code           mass       particle
        24     8.03879066E+01   # W+
        25     1.24054317E+02   # h
        35     1.77972683E+03   # H
        36     1.77972000E+03   # A
        37     1.78176942E+03   # H+
         5     4.81876030E+00   # b-quark pole mass calculated from mb(mb)_Msbar
   1000001     3.39666537E+03   # ~d_L
   2000001     8.54411736E+02   # ~d_R
   1000002     3.39587933E+03   # ~u_L
   2000002     5.31912414E+02   # ~u_R
   1000003     3.39666537E+03   # ~s_L
   2000003     8.54411736E+02   # ~s_R
   1000004     3.39587933E+03   # ~c_L
   2000004     5.31912414E+02   # ~c_R
   1000005     2.68816470E+03   # ~b_1
   2000005     3.92917881E+03   # ~b_2
   1000006     2.45123154E+03   # ~t_1
   2000006     2.70368951E+03   # ~t_2
   1000011     4.06439169E+02   # ~e_L
   2000011     3.44519756E+02   # ~e_R
   1000012     3.98183813E+02   # ~nu_eL
   1000013     4.06439169E+02   # ~mu_L
   2000013     3.44519756E+02   # ~mu_R
   1000014     3.98183813E+02   # ~nu_muL
   1000015     1.34110039E+03   # ~tau_1
   2000015     3.24258894E+03   # ~tau_2
   1000016     3.24126998E+03   # ~nu_tauL
   1000021     2.62232914E+03   # ~g
   1000022     3.21454812E+02   # ~chi_10
   1000023    -3.36450859E+02   # ~chi_20
   1000025     6.15232428E+02   # ~chi_30
   1000035     3.23782587E+03   # ~chi_40
   1000024     3.25073892E+02   # ~chi_1+
   1000037     6.15596490E+02   # ~chi_2+
#
BLOCK NMIX  # Neutralino Mixing Matrix
  1  1     1.07386555E-02   # N_11
  1  2    -1.96456643E-01   # N_12
  1  3     7.05000953E-01   # N_13
  1  4    -6.81368567E-01   # N_14
  2  1    -8.66517833E-03   # N_21
  2  2     5.88757319E-02   # N_22
  2  3     7.02222455E-01   # N_23
  2  4     7.09466128E-01   # N_24
  3  1     3.12580585E-03   # N_31
  3  2     9.78743195E-01   # N_32
  3  3     9.92675820E-02   # N_33
  3  4    -1.79437828E-01   # N_34
  4  1     9.99899908E-01   # N_41
  4  2    -4.39556264E-04   # N_42
  4  3    -1.79635057E-03   # N_43
  4  4     1.40269246E-02   # N_44
#
BLOCK UMIX  # Chargino Mixing Matrix U
  1  1    -1.42095566E-01   # U_11
  1  2     9.89852944E-01   # U_12
  2  1    -9.89852944E-01   # U_21
  2  2    -1.42095566E-01   # U_22
#
BLOCK VMIX  # Chargino Mixing Matrix V
  1  1    -2.56911941E-01   # V_11
  1  2     9.66434816E-01   # V_12
  2  1    -9.66434816E-01   # V_21
  2  2    -2.56911941E-01   # V_22
#
BLOCK STOPMIX  # Stop Mixing Matrix
  1  1    -2.30151367E-01   # cos(theta_t)
  1  2     9.73154843E-01   # sin(theta_t)
  2  1    -9.73154843E-01   # -sin(theta_t)
  2  2    -2.30151367E-01   # cos(theta_t)
#
BLOCK SBOTMIX  # Sbottom Mixing Matrix
  1  1     9.99991806E-01   # cos(theta_b)
  1  2     4.04820119E-03   # sin(theta_b)
  2  1    -4.04820119E-03   # -sin(theta_b)
  2  2     9.99991806E-01   # cos(theta_b)
#
BLOCK STAUMIX  # Stau Mixing Matrix
  1  1     3.20864467E-03   # cos(theta_tau)
  1  2     9.99994852E-01   # sin(theta_tau)
  2  1    -9.99994852E-01   # -sin(theta_tau)
  2  2     3.20864467E-03   # cos(theta_tau)
#
BLOCK ALPHA  # Higgs mixing
          -2.26453621E-02   # Mixing angle in the neutral Higgs boson sector
#
BLOCK HMIX Q=  2.52531500E+03  # DRbar Higgs Parameters
         1     3.25214295E+02   # mu(Q)MSSM           
         2     4.45307457E+01   # tan                 
         3     2.41977125E+02   # higgs               
         4     3.42879781E+06   # mA^2(Q)MSSM         
#
BLOCK GAUGE Q=  2.52531500E+03  # The gauge couplings
     1     3.65428532E-01   # gprime(Q) DRbar
     2     6.41291395E-01   # g(Q) DRbar
     3     1.01901501E+00   # g3(Q) DRbar
#
BLOCK AU Q=  2.52531500E+03  # The trilinear couplings
  1  1     0.00000000E+00   # A_u(Q) DRbar
  2  2     0.00000000E+00   # A_c(Q) DRbar
  3  3     2.27703001E+03   # A_t(Q) DRbar
#
BLOCK AD Q=  2.52531500E+03  # The trilinear couplings
  1  1     0.00000000E+00   # A_d(Q) DRbar
  2  2     0.00000000E+00   # A_s(Q) DRbar
  3  3    -4.62649993E+02   # A_b(Q) DRbar
#
BLOCK AE Q=  2.52531500E+03  # The trilinear couplings
  1  1     0.00000000E+00   # A_e(Q) DRbar
  2  2     0.00000000E+00   # A_mu(Q) DRbar
  3  3    -8.63159997E+02   # A_tau(Q) DRbar
#
BLOCK Yu Q=  2.52531500E+03  # The Yukawa couplings
  1  1     0.00000000E+00   # y_u(Q) DRbar
  2  2     0.00000000E+00   # y_c(Q) DRbar
  3  3     8.37496475E-01   # y_t(Q) DRbar
#
BLOCK Yd Q=  2.52531500E+03  # The Yukawa couplings
  1  1     0.00000000E+00   # y_d(Q) DRbar
  2  2     0.00000000E+00   # y_s(Q) DRbar
  3  3     5.85355984E-01   # y_b(Q) DRbar
#
BLOCK Ye Q=  2.52531500E+03  # The Yukawa couplings
  1  1     0.00000000E+00   # y_e(Q) DRbar
  2  2     0.00000000E+00   # y_mu(Q) DRbar
  3  3     4.62412706E-01   # y_tau(Q) DRbar
#
BLOCK MSOFT Q=  2.52531500E+03  # The soft SUSY breaking masses at the scale Q
         1     3.28264000E+03   # M_1(Q)              
         2     5.75760000E+02   # M_2(Q)              
         3     2.47189000E+03   # M_3(Q)              
        21     3.18685363E+06   # mH1^2(Q)            
        22     4.41178358E+04   # mH2^2(Q)            
        31     3.82790000E+02   # meL(Q)              
        32     3.82790000E+02   # mmuL(Q)             
        33     3.24009000E+03   # mtauL(Q)            
        34     3.14660000E+02   # meR(Q)              
        35     3.14660000E+02   # mmuR(Q)             
        36     1.34595000E+03   # mtauR(Q)            
        41     3.33065000E+03   # mqL1(Q)             
        42     3.33065000E+03   # mqL2(Q)             
        43     2.63623999E+03   # mqL3(Q)             
        44     2.15649933E+02   # muR(Q)              
        45     2.15649933E+02   # mcR(Q)              
        46     2.41511999E+03   # mtR(Q)              
        47     6.80219979E+02   # mdR(Q)              
        48     6.80219979E+02   # msR(Q)              
        49     3.89464999E+03   # mbR(Q)              
#
Block HiggsBoundsInputHiggsCouplingsFermions
# ScalarNormEffCoupSq PseudoSNormEffCoupSq NP   IP1 IP2 IP2
    1.01723944E+00    0.00000000E+00        3  25   5   5  # h0-b-b eff. coupling^2, normalised to SM
    1.98297007E+03    0.00000000E+00        3  35   5   5  # H0-b-b eff. coupling^2, normalised to SM
    0.00000000E+00    1.98298731E+03        3  36   5   5  # A0-b-b eff. coupling^2, normalised to SM
#
    9.99991306E-01    0.00000000E+00        3  25   6   6  # h0-t-t eff. coupling^2, normalised to SM
    5.12983334E-04    0.00000000E+00        3  35   6   6  # H0-t-t eff. coupling^2, normalised to SM
    0.00000000E+00    5.04289661E-04        3  36   6   6  # A0-t-t eff. coupling^2, normalised to SM
#
    1.01723944E+00    0.00000000E+00        3  25  15  15  # h0-tau-tau eff. coupling^2, normalised to SM
    1.98297007E+03    0.00000000E+00        3  35  15  15  # H0-tau-tau eff. coupling^2, normalised to SM
    0.00000000E+00    1.98298731E+03        3  36  15  15  # A0-tau-tau eff. coupling^2, normalised to SM
#
Block HiggsBoundsInputHiggsCouplingsBosons
    9.99999963E-01        3  25  24  24  # h0-W-W eff. coupling^2, normalised to SM
    3.71491464E-08        3  35  24  24  # H0-W-W eff. coupling^2, normalised to SM
    0.00000000E+00        3  36  24  24  # A0-W-W eff. coupling^2, normalised to SM
#
    9.99999963E-01        3  25  23  23  # h0-Z-Z eff. coupling^2, normalised to SM
    3.71491464E-08        3  35  23  23  # H0-Z-Z eff. coupling^2, normalised to SM
    0.00000000E+00        3  36  23  23  # A0-Z-Z eff. coupling^2, normalised to SM
#
    8.86311518E-01        3  25  21  21  # h0-g-g eff. coupling^2, normalised to SM
    1.08569253E-09        3  35  21  21  # H0-g-g eff. coupling^2, normalised to SM
    2.67679356E-09        3  36  21  21  # A0-g-g eff. coupling^2, normalised to SM
#
    0.00000000E+00        3  25  25  23  # h0-h0-Z eff. coupling^2, normalised to SM
    0.00000000E+00        3  35  25  23  # H0-h0-Z eff. coupling^2, normalised to SM
    3.71491464E-08        3  36  25  23  # A0-h0-Z eff. coupling^2, normalised to SM
    0.00000000E+00        3  35  35  23  # H0-H0-Z eff. coupling^2, normalised to SM
    9.99999963E-01        3  36  35  23  # A0-H0-Z eff. coupling^2, normalised to SM
    0.00000000E+00        3  36  36  23  # A0-A0-Z eff. coupling^2, normalised to SM
#
    0.00000000E+00        4  25  21  21  23  # h0-g-g-Z eff. coupling^2, normalised to SM
    0.00000000E+00        4  35  21  21  23  # H0-g-g-Z eff. coupling^2, normalised to SM
    0.00000000E+00        4  36  21  21  23  # A0-g-g-Z eff. coupling^2, normalised to SM
#
#
#
#                             =================
#                             |The decay table|
#                             =================
#
# - The QCD corrections to the decays gluino -> squark  + quark
#                                     squark -> gaugino + quark_prime
#                                     squark -> squark_prime + Higgs
#                                     squark -> gluino  + quark
#   are included.
#
# - The multi-body decays for the inos, stops and sbottoms are included.
#
# - The loop induced decays for the gluino, neutralinos and stops
#   are included.
#
# - The SUSY decays of the top quark are included.
#
#
#         PDG            Width
DECAY         6     1.44846775E+00   # top decays
#          BR         NDA      ID1       ID2
     1.00000000E+00    2           5        24   # BR(t ->  b    W+)
#
#         PDG            Width
DECAY   1000021     1.70897620E+02   # gluino decays
#          BR         NDA      ID1       ID2
     1.16237654E-01    2     2000001        -1   # BR(~g -> ~d_R  db)
     1.16237654E-01    2    -2000001         1   # BR(~g -> ~d_R* d )
     1.33762349E-01    2     2000002        -2   # BR(~g -> ~u_R  ub)
     1.33762349E-01    2    -2000002         2   # BR(~g -> ~u_R* u )
     1.16237654E-01    2     2000003        -3   # BR(~g -> ~s_R  sb)
     1.16237654E-01    2    -2000003         3   # BR(~g -> ~s_R* s )
     1.33762344E-01    2     2000004        -4   # BR(~g -> ~c_R  cb)
     1.33762344E-01    2    -2000004         4   # BR(~g -> ~c_R* c )
#
#         PDG            Width
DECAY   1000006     6.54374977E+01   # stop1 decays
#          BR         NDA      ID1       ID2
     2.17399236E-01    2     1000022         6   # BR(~t_1 -> ~chi_10 t )
     2.43059225E-01    2     1000023         6   # BR(~t_1 -> ~chi_20 t )
     4.10682329E-02    2     1000025         6   # BR(~t_1 -> ~chi_30 t )
     4.17156237E-01    2     1000024         5   # BR(~t_1 -> ~chi_1+ b )
     8.13170686E-02    2     1000037         5   # BR(~t_1 -> ~chi_2+ b )
#
#         PDG            Width
DECAY   2000006     8.70494122E+01   # stop2 decays
#          BR         NDA      ID1       ID2
     2.10049299E-01    2     1000022         6   # BR(~t_2 -> ~chi_10 t )
     2.16421062E-01    2     1000023         6   # BR(~t_2 -> ~chi_20 t )
     1.00814379E-01    2     1000025         6   # BR(~t_2 -> ~chi_30 t )
     2.62818765E-01    2     1000024         5   # BR(~t_2 -> ~chi_1+ b )
     1.73931485E-01    2     1000037         5   # BR(~t_2 -> ~chi_2+ b )
     1.89925526E-02    2     1000006        25   # BR(~t_2 -> ~t_1    h )
     1.69724576E-02    2     1000006        23   # BR(~t_2 -> ~t_1    Z )
#
#         PDG            Width
DECAY   1000005     8.64249972E+01   # sbottom1 decays
#          BR         NDA      ID1       ID2
     1.07424616E-01    2     1000022         5   # BR(~b_1 -> ~chi_10 b )
     1.01690298E-01    2     1000023         5   # BR(~b_1 -> ~chi_20 b )
     1.11104213E-01    2     1000025         5   # BR(~b_1 -> ~chi_30 b )
     3.94014273E-01    2    -1000024         6   # BR(~b_1 -> ~chi_1- t )
     2.51757014E-01    2    -1000037         6   # BR(~b_1 -> ~chi_2- t )
     4.00223479E-03    2     1000021         5   # BR(~b_1 -> ~g      b )
     3.00073513E-02    2     1000006       -24   # BR(~b_1 -> ~t_1    W-)
#
#         PDG            Width
DECAY   2000005     1.19700106E+02   # sbottom2 decays
#          BR         NDA      ID1       ID2
     1.09533761E-01    2     1000022         5   # BR(~b_2 -> ~chi_10 b )
     1.08789059E-01    2     1000023         5   # BR(~b_2 -> ~chi_20 b )
     2.22980533E-03    2     1000025         5   # BR(~b_2 -> ~chi_30 b )
     1.99611501E-03    2     1000035         5   # BR(~b_2 -> ~chi_40 b )
     2.15144430E-01    2    -1000024         6   # BR(~b_2 -> ~chi_1- t )
     4.55164104E-03    2    -1000037         6   # BR(~b_2 -> ~chi_2- t )
     5.56133820E-01    2     1000021         5   # BR(~b_2 -> ~g      b )
     4.32451902E-04    2     1000005        25   # BR(~b_2 -> ~b_1    h )
     4.03903632E-04    2     1000005        23   # BR(~b_2 -> ~b_1    Z )
     6.31640598E-05    2     1000006       -24   # BR(~b_2 -> ~t_1    W-)
     7.21847658E-04    2     2000006       -24   # BR(~b_2 -> ~t_2    W-)
#
#         PDG            Width
DECAY   1000002     7.85272538E+01   # sup_L decays
#          BR         NDA      ID1       ID2
     6.26289972E-03    2     1000022         2   # BR(~u_L -> ~chi_10 u)
     5.41807123E-04    2     1000023         2   # BR(~u_L -> ~chi_20 u)
     1.51628697E-01    2     1000025         2   # BR(~u_L -> ~chi_30 u)
     5.44582923E-05    2     1000035         2   # BR(~u_L -> ~chi_40 u)
     2.18644444E-02    2     1000024         1   # BR(~u_L -> ~chi_1+ d)
     2.95296492E-01    2     1000037         1   # BR(~u_L -> ~chi_2+ d)
     5.24351201E-01    2     1000021         2   # BR(~u_L -> ~g      u)
#
#         PDG            Width
DECAY   2000002     9.85032725E-05   # sup_R decays
#           BR         NDA      ID1       ID2
     6.29816649E-01    2     1000022         2   # BR(~u_R -> ~chi_10 u)
     3.66558356E-01    2     1000023         2   # BR(~u_R -> ~chi_20 u)
#           BR         NDA      ID1       ID2       ID3
     5.64539620E-05    3        2       -11        1000011   # BR(~u_R -> u  e+  ~e_L-)
     3.19522379E-06    3        2       11        -1000011   # BR(~u_R -> u  e-  ~e_L+)
     2.21413964E-05    3        2       -11        2000011   # BR(~u_R -> u  e+  ~e_R-)
     1.27904380E-03    3        2       11        -2000011   # BR(~u_R -> u  e-  ~e_R+)
     5.16226504E-05    3        2       -12        1000012   # BR(~u_R -> u  nu_eb  ~nu_eL)
     3.23867413E-08    3        2       12        -1000012   # BR(~u_R -> u  nu_e  ~nu_eL*)
     5.57697208E-05    3        2       -13        1000013   # BR(~u_R -> u  mu+  ~mu_L-)
     3.19014782E-06    3        2       13        -1000013   # BR(~u_R -> u  mu-  ~mu_L+)
     2.23525569E-05    3        2       -13        2000013   # BR(~u_R -> u  mu+  ~mu_R-)
     1.26544019E-03    3        2       13        -2000013   # BR(~u_R -> u  mu-  ~mu_R+)
     5.11851015E-05    3        2       -14        1000014   # BR(~u_R -> u  nu_mub  ~nu_muL)
     3.23359815E-08    3        2       14        -1000014   # BR(~u_R -> u  nu_mu  ~nu_muL*)
     1.53111664E-04    3        2       23        1000022   # BR(~u_R -> u  Z  ~chi_10)
     3.75165201E-05    3        2       25        1000022   # BR(~u_R -> u  h  ~chi_10)
     8.91259730E-05    3        2       23        1000023   # BR(~u_R -> u  Z  ~chi_20)
     2.30256310E-05    3        2       25        1000023   # BR(~u_R -> u  h  ~chi_20)
     9.50851658E-06    3        2       -24        1000024   # BR(~u_R -> u  W-  ~chi_1+)
     5.02247273E-04    3        2       24        -1000024   # BR(~u_R -> u  W+  ~chi_1-)
#
#         PDG            Width
DECAY   1000001     7.85459039E+01   # sdown_L decays
#          BR         NDA      ID1       ID2
     6.52854351E-03    2     1000022         1   # BR(~d_L -> ~chi_10 d)
     6.05933559E-04    2     1000023         1   # BR(~d_L -> ~chi_20 d)
     1.51265900E-01    2     1000025         1   # BR(~d_L -> ~chi_30 d)
     5.54632831E-05    2     1000035         1   # BR(~d_L -> ~chi_40 d)
     6.68859119E-03    2    -1000024         2   # BR(~d_L -> ~chi_1- u)
     3.09790414E-01    2    -1000037         2   # BR(~d_L -> ~chi_2- u)
     5.25065155E-01    2     1000021         1   # BR(~d_L -> ~g      d)
#
#         PDG            Width
DECAY   2000001     3.81610194E-04   # sdown_R decays
#           BR         NDA      ID1       ID2
     1.16499981E-01    2     1000022         1   # BR(~d_R -> ~chi_10 d)
     7.34949973E-02    2     1000023         1   # BR(~d_R -> ~chi_20 d)
#           BR         NDA      ID1       ID2       ID3
     2.58247819E-02    3        1       -2        2000002   # BR(~d_R -> d  ub  ~u_R)
     3.71635774E-01    3        1       2        -2000002   # BR(~d_R -> d  u  ~u_R*)
     2.59398207E-02    3        1       -4        2000004   # BR(~d_R -> d  cb  ~c_R)
     3.69565599E-01    3        1       4        -2000004   # BR(~d_R -> d  c  ~c_R*)
     7.51132974E-04    3        1       -11        1000011   # BR(~d_R -> d  e+  ~e_L-)
     1.85084154E-04    3        1       11        -1000011   # BR(~d_R -> d  e-  ~e_L+)
     1.31070922E-04    3        1       -11        2000011   # BR(~d_R -> d  e+  ~e_R-)
     3.98600463E-03    3        1       11        -2000011   # BR(~d_R -> d  e-  ~e_R+)
     7.49429665E-04    3        1       -12        1000012   # BR(~d_R -> d  nu_eb  ~nu_eL)
     1.84892860E-04    3        1       12        -1000012   # BR(~d_R -> d  nu_e  ~nu_eL*)
     7.51028155E-04    3        1       -13        1000013   # BR(~d_R -> d  mu+  ~mu_L-)
     1.84575782E-04    3        1       13        -1000013   # BR(~d_R -> d  mu-  ~mu_L+)
     1.31526885E-04    3        1       -13        2000013   # BR(~d_R -> d  mu+  ~mu_R-)
     3.99779676E-03    3        1       13        -2000013   # BR(~d_R -> d  mu-  ~mu_R+)
     7.40913121E-04    3        1       -14        1000014   # BR(~d_R -> d  nu_mub  ~nu_muL)
     1.87943092E-04    3        1       14        -1000014   # BR(~d_R -> d  nu_mu  ~nu_muL*)
     3.22816324E-04    3        1       23        1000022   # BR(~d_R -> d  Z  ~chi_10)
     6.97256006E-04    3        1       25        1000022   # BR(~d_R -> d  h  ~chi_10)
     7.88998838E-04    3        1       23        1000023   # BR(~d_R -> d  Z  ~chi_20)
     2.87439910E-04    3        1       25        1000023   # BR(~d_R -> d  h  ~chi_20)
     6.68404576E-08    3        1       23        1000025   # BR(~d_R -> d  Z  ~chi_30)
     2.71376398E-06    3        1       25        1000025   # BR(~d_R -> d  h  ~chi_30)
     5.06930902E-04    3        1       -24        1000024   # BR(~d_R -> d  W-  ~chi_1+)
     2.44312132E-03    3        1       24        -1000024   # BR(~d_R -> d  W+  ~chi_1-)
     3.29341307E-06    3        1       -24        1000037   # BR(~d_R -> d  W-  ~chi_2+)
     5.00930014E-06    3        1       24        -1000037   # BR(~d_R -> d  W+  ~chi_2-)
#
#         PDG            Width
DECAY   1000004     6.95878086E+01   # scharm_L decays
#          BR         NDA      ID1       ID2
     7.41105032E-03    2     1000022         4   # BR(~c_L -> ~chi_10 c)
     6.41071605E-04    2     1000023         4   # BR(~c_L -> ~chi_20 c)
     1.79104430E-01    2     1000025         4   # BR(~c_L -> ~chi_30 c)
     5.92475170E-05    2     1000035         4   # BR(~c_L -> ~chi_40 c)
     2.58721578E-02    2     1000024         3   # BR(~c_L -> ~chi_1+ s)
     3.48804836E-01    2     1000037         3   # BR(~c_L -> ~chi_2+ s)
     4.38107206E-01    2     1000021         4   # BR(~c_L -> ~g      c)
#
#         PDG            Width
DECAY   2000004     9.26618584E-05   # scharm_R decays
#           BR         NDA      ID1       ID2
     6.29866926E-01    2     1000022         4   # BR(~c_R -> ~chi_10 c)
     3.66291178E-01    2     1000023         4   # BR(~c_R -> ~chi_20 c)
#           BR         NDA      ID1       ID2       ID3
     5.94786258E-05    3        4       -11        1000011   # BR(~c_R -> c  e+  ~e_L-)
     3.39859361E-06    3        4       11        -1000011   # BR(~c_R -> c  e-  ~e_L+)
     2.32868198E-05    3        4       -11        2000011   # BR(~c_R -> c  e+  ~e_R-)
     1.35201260E-03    3        4       11        -2000011   # BR(~c_R -> c  e-  ~e_R+)
     5.52978333E-05    3        4       -12        1000012   # BR(~c_R -> c  nu_eb  ~nu_eL)
     3.43463865E-08    3        4       12        -1000012   # BR(~c_R -> c  nu_e  ~nu_eL*)
     5.90275232E-05    3        4       -13        1000013   # BR(~c_R -> c  mu+  ~mu_L-)
     3.40733507E-06    3        4       13        -1000013   # BR(~c_R -> c  mu-  ~mu_L+)
     2.38998012E-05    3        4       -13        2000013   # BR(~c_R -> c  mu+  ~mu_R-)
     1.34618496E-03    3        4       13        -2000013   # BR(~c_R -> c  mu-  ~mu_R+)
     5.45251313E-05    3        4       -14        1000014   # BR(~c_R -> c  nu_mub  ~nu_muL)
     3.41942203E-08    3        4       14        -1000014   # BR(~c_R -> c  nu_mu  ~nu_muL*)
     1.61911279E-04    3        4       23        1000022   # BR(~c_R -> c  Z  ~chi_10)
     3.96657272E-05    3        4       25        1000022   # BR(~c_R -> c  h  ~chi_10)
     9.49452142E-05    3        4       23        1000023   # BR(~c_R -> c  Z  ~chi_20)
     2.43444286E-05    3        4       25        1000023   # BR(~c_R -> c  h  ~chi_20)
     1.00725370E-05    3        4       -24        1000024   # BR(~c_R -> c  W-  ~chi_1+)
     5.30369246E-04    3        4       24        -1000024   # BR(~c_R -> c  W+  ~chi_1-)
#
#         PDG            Width
DECAY   1000003     6.95848513E+01   # sstrange_L decays
#          BR         NDA      ID1       ID2
     7.72751317E-03    2     1000022         3   # BR(~s_L -> ~chi_10 s)
     7.17143382E-04    2     1000023         3   # BR(~s_L -> ~chi_20 s)
     1.78725012E-01    2     1000025         3   # BR(~s_L -> ~chi_30 s)
     6.03730049E-05    2     1000035         3   # BR(~s_L -> ~chi_40 s)
     7.91676448E-03    2    -1000024         4   # BR(~s_L -> ~chi_1- c)
     3.66025428E-01    2    -1000037         4   # BR(~s_L -> ~chi_2- c)
     4.38827766E-01    2     1000021         3   # BR(~s_L -> ~g      s)
#
#         PDG            Width
DECAY   2000003     3.78917189E-04   # sstrange_R decays
#           BR         NDA      ID1       ID2
     1.13129723E-01    2     1000022         3   # BR(~s_R -> ~chi_10 s)
     7.13590153E-02    2     1000023         3   # BR(~s_R -> ~chi_20 s)
#           BR         NDA      ID1       ID2       ID3
     2.60083213E-02    3        3       -2        2000002   # BR(~s_R -> s  ub  ~u_R)
     3.74197856E-01    3        3       2        -2000002   # BR(~s_R -> s  u  ~u_R*)
     2.60009318E-02    3        3       -4        2000004   # BR(~s_R -> s  cb  ~c_R)
     3.72139359E-01    3        3       4        -2000004   # BR(~s_R -> s  c  ~c_R*)
     7.56471356E-04    3        3       -11        1000011   # BR(~s_R -> s  e+  ~e_L-)
     1.86352063E-04    3        3       11        -1000011   # BR(~s_R -> s  e-  ~e_L+)
     1.34385563E-04    3        3       -11        2000011   # BR(~s_R -> s  e+  ~e_R-)
     4.01433359E-03    3        3       11        -2000011   # BR(~s_R -> s  e-  ~e_R+)
     7.52380752E-04    3        3       -12        1000012   # BR(~s_R -> s  nu_eb  ~nu_eL)
     1.86164687E-04    3        3       12        -1000012   # BR(~s_R -> s  nu_e  ~nu_eL*)
     7.48474886E-04    3        3       -13        1000013   # BR(~s_R -> s  mu+  ~mu_L-)
     1.85887581E-04    3        3       13        -1000013   # BR(~s_R -> s  mu-  ~mu_L+)
     1.32229420E-04    3        3       -13        2000013   # BR(~s_R -> s  mu+  ~mu_R-)
     4.02620953E-03    3        3       13        -2000013   # BR(~s_R -> s  mu-  ~mu_R+)
     7.58714590E-04    3        3       -14        1000014   # BR(~s_R -> s  nu_mub  ~nu_muL)
     1.89278824E-04    3        3       14        -1000014   # BR(~s_R -> s  nu_mu  ~nu_muL*)
     3.25084223E-04    3        3       23        1000022   # BR(~s_R -> s  Z  ~chi_10)
     7.02211479E-04    3        3       25        1000022   # BR(~s_R -> s  h  ~chi_10)
     7.94606337E-04    3        3       23        1000023   # BR(~s_R -> s  Z  ~chi_20)
     2.89482776E-04    3        3       25        1000023   # BR(~s_R -> s  h  ~chi_20)
     6.71888231E-08    3        3       23        1000025   # BR(~s_R -> s  Z  ~chi_30)
     2.75838634E-06    3        3       25        1000025   # BR(~s_R -> s  h  ~chi_30)
     5.10269804E-04    3        3       -24        1000024   # BR(~s_R -> s  W-  ~chi_1+)
     2.46109183E-03    3        3       24        -1000024   # BR(~s_R -> s  W+  ~chi_1-)
     3.29887383E-06    3        3       -24        1000037   # BR(~s_R -> s  W-  ~chi_2+)
     5.03935966E-06    3        3       24        -1000037   # BR(~s_R -> s  W+  ~chi_2-)
#
#         PDG            Width
DECAY   1000011     1.76423054E-02   # selectron_L decays
#          BR         NDA      ID1       ID2
     4.78775070E-01    2     1000022        11   # BR(~e_L -> ~chi_10 e-)
     2.71618449E-02    2     1000023        11   # BR(~e_L -> ~chi_20 e-)
     4.94063085E-01    2    -1000024        12   # BR(~e_L -> ~chi_1- nu_e)
#
#         PDG            Width
DECAY   2000011     3.82998521E-06   # selectron_R decays
#          BR         NDA      ID1       ID2
     9.23093039E-01    2     1000022        11   # BR(~e_R -> ~chi_10 e-)
     7.69069614E-02    2     1000023        11   # BR(~e_R -> ~chi_20 e-)
#
#         PDG            Width
DECAY   1000013     1.76422966E-02   # smuon_L decays
#          BR         NDA      ID1       ID2
     4.78774848E-01    2     1000022        13   # BR(~mu_L -> ~chi_10 mu-)
     2.71618213E-02    2     1000023        13   # BR(~mu_L -> ~chi_20 mu-)
     4.94063331E-01    2    -1000024        14   # BR(~mu_L -> ~chi_1- nu_mu)
#
#         PDG            Width
DECAY   2000013     3.82991965E-06   # smuon_R decays
#          BR         NDA      ID1       ID2
     9.23098473E-01    2     1000022        13   # BR(~mu_R -> ~chi_10 mu-)
     7.69015271E-02    2     1000023        13   # BR(~mu_R -> ~chi_20 mu-)
#
#         PDG            Width
DECAY   1000015     1.00522899E+01   # stau_1 decays
#          BR         NDA      ID1       ID2
     2.51112197E-01    2     1000022        15   # BR(~tau_1 -> ~chi_10  tau-)
     2.45638791E-01    2     1000023        15   # BR(~tau_1 -> ~chi_20  tau-)
     3.27758335E-03    2     1000025        15   # BR(~tau_1 -> ~chi_30  tau-)
     4.93268371E-01    2    -1000024        16   # BR(~tau_1 -> ~chi_1-  nu_tau)
     6.70305745E-03    2    -1000037        16   # BR(~tau_1 -> ~chi_2-  nu_tau)
#
#         PDG            Width
DECAY   2000015     5.09298186E+01   # stau_2 decays
#          BR         NDA      ID1       ID2
     1.40985503E-01    2     1000022        15   # BR(~tau_2 -> ~chi_10  tau-)
     1.31508156E-01    2     1000023        15   # BR(~tau_2 -> ~chi_20  tau-)
     2.35344693E-01    2     1000025        15   # BR(~tau_2 -> ~chi_30  tau-)
     6.70167526E-07    2     1000035        15   # BR(~tau_2 -> ~chi_40  tau-)
     9.97769732E-03    2    -1000024        16   # BR(~tau_2 -> ~chi_1-  nu_tau)
     4.74572223E-01    2    -1000037        16   # BR(~tau_2 -> ~chi_2-  nu_tau)
     1.26509525E-03    2     1000015        25   # BR(~tau_2 -> ~tau_1   h)
     2.53566808E-03    2     1000015        35   # BR(~tau_2 -> ~tau_1   H)
     2.53623504E-03    2     1000015        36   # BR(~tau_2 -> ~tau_1   A)
     1.27405947E-03    2     1000015        23   # BR(~tau_2 -> ~tau_1   Z)
#
#         PDG            Width
DECAY   1000012     3.25666338E-02   # snu_eL decays
#          BR         NDA      ID1       ID2
     2.48949218E-01    2     1000022        12   # BR(~nu_eL -> ~chi_10 nu_e)
     1.66643524E-02    2     1000023        12   # BR(~nu_eL -> ~chi_20 nu_e)
     7.34386430E-01    2     1000024        11   # BR(~nu_eL -> ~chi_1+ e-)
#
#         PDG            Width
DECAY   1000014     3.25666035E-02   # snu_muL decays
#          BR         NDA      ID1       ID2
     2.48949449E-01    2     1000022        14   # BR(~nu_muL -> ~chi_10 nu_mu)
     1.66643679E-02    2     1000023        14   # BR(~nu_muL -> ~chi_20 nu_mu)
     7.34386183E-01    2     1000024        13   # BR(~nu_muL -> ~chi_1+ mu-)
#
#         PDG            Width
DECAY   1000016     5.09545112E+01   # snu_tauL decays
#          BR         NDA      ID1       ID2
     1.04696807E-02    2     1000022        16   # BR(~nu_tauL -> ~chi_10 nu_tau)
     1.03695040E-03    2     1000023        16   # BR(~nu_tauL -> ~chi_20 nu_tau)
     2.30795398E-01    2     1000025        16   # BR(~nu_tauL -> ~chi_30 nu_tau)
     3.81717885E-07    2     1000035        16   # BR(~nu_tauL -> ~chi_40 nu_tau)
     2.93468708E-01    2     1000024        15   # BR(~nu_tauL -> ~chi_1+ tau-)
     4.56753729E-01    2     1000037        15   # BR(~nu_tauL -> ~chi_2+ tau-)
     5.00328814E-03    2    -1000015       -37   # BR(~nu_tauL -> ~tau_1+ H-)
     2.47186469E-03    2    -1000015       -24   # BR(~nu_tauL -> ~tau_1+ W-)
#
#         PDG            Width
DECAY   1000024     7.45305237E-10   # chargino1+ decays
#           BR         NDA      ID1       ID2       ID3
     3.60374822E-01    3     1000022         2        -1   # BR(~chi_1+ -> ~chi_10 u    db)
     3.60374822E-01    3     1000022         4        -3   # BR(~chi_1+ -> ~chi_10 c    sb)
     1.21170484E-01    3     1000022       -11        12   # BR(~chi_1+ -> ~chi_10 e+   nu_e)
     1.21170484E-01    3     1000022       -13        14   # BR(~chi_1+ -> ~chi_10 mu+  nu_mu)
     3.69093868E-02    3     1000022       -15        16   # BR(~chi_1+ -> ~chi_10 tau+ nu_tau)
#
#         PDG            Width
DECAY   1000037     7.11139845E+00   # chargino2+ decays
#          BR         NDA      ID1       ID2
     1.11884549E-01    2     1000012       -11   # BR(~chi_2+ -> ~nu_eL   e+  )
     1.11884549E-01    2     1000014       -13   # BR(~chi_2+ -> ~nu_muL mu+ )
     1.10404596E-01    2    -1000011        12   # BR(~chi_2+ -> ~e_L+    nu_e)
     1.10404596E-01    2    -1000013        14   # BR(~chi_2+ -> ~mu_L+   nu_mu)
     1.44600882E-01    2     1000024        23   # BR(~chi_2+ -> ~chi_1+  Z )
     1.43844513E-01    2     1000022        24   # BR(~chi_2+ -> ~chi_10  W+)
     1.40969432E-01    2     1000023        24   # BR(~chi_2+ -> ~chi_20  W+)
     1.26006884E-01    2     1000024        25   # BR(~chi_2+ -> ~chi_1+  h )
#
#         PDG            Width
DECAY   1000022     0.00000000E+00   # neutralino1 decays
#
#         PDG            Width
DECAY   1000023     1.55214042E-06   # neutralino2 decays
#          BR         NDA      ID1       ID2
     3.09426603E-01    2     1000022        22   # BR(~chi_20 -> ~chi_10 gam)
#           BR         NDA      ID1       ID2       ID3
     5.38069531E-02    3     1000022        -2         2   # BR(~chi_20 -> ~chi_10 ub      u)
     6.98130910E-02    3     1000022        -1         1   # BR(~chi_20 -> ~chi_10 db      d)
     5.38069531E-02    3     1000022        -4         4   # BR(~chi_20 -> ~chi_10 cb      c)
     6.98130910E-02    3     1000022        -3         3   # BR(~chi_20 -> ~chi_10 sb      s)
     2.39120727E-02    3     1000022        -5         5   # BR(~chi_20 -> ~chi_10 bb      b)
     1.59804829E-02    3     1000022       -11        11   # BR(~chi_20 -> ~chi_10 e+      e-)
     1.59804829E-02    3     1000022       -13        13   # BR(~chi_20 -> ~chi_10 mu+     mu-)
     1.48378222E-02    3     1000022       -15        15   # BR(~chi_20 -> ~chi_10 tau+    tau-)
     3.21335527E-02    3     1000022       -12        12   # BR(~chi_20 -> ~chi_10 nu_eb   nu_e)
     3.21335527E-02    3     1000022       -14        14   # BR(~chi_20 -> ~chi_10 nu_mub  nu_mu)
     3.20290106E-02    3     1000022       -16        16   # BR(~chi_20 -> ~chi_10 nu_taub nu_tau)
     4.66108650E-02    3     1000024        -2         1   # BR(~chi_20 -> ~chi_1+ ub      d)
     4.66108650E-02    3    -1000024        -1         2   # BR(~chi_20 -> ~chi_1- db      u)
     4.66108650E-02    3     1000024        -4         3   # BR(~chi_20 -> ~chi_1+ cb      s)
     4.66108650E-02    3    -1000024        -3         4   # BR(~chi_20 -> ~chi_1- sb      c)
     1.55594078E-02    3     1000024       -12        11   # BR(~chi_20 -> ~chi_1+ nu_eb   e-)
     1.55594078E-02    3    -1000024        12       -11   # BR(~chi_20 -> ~chi_1- nu_e    e+)
     1.55594078E-02    3     1000024       -14        13   # BR(~chi_20 -> ~chi_1+ nu_mub  mu-)
     1.55594078E-02    3    -1000024        14       -13   # BR(~chi_20 -> ~chi_1- nu_mu   mu+)
     1.38226204E-02    3     1000024       -16        15   # BR(~chi_20 -> ~chi_1+ nu_taub tau-)
     1.38226204E-02    3    -1000024        16       -15   # BR(~chi_20 -> ~chi_1- nu_tau  tau+)
#
#         PDG            Width
DECAY   1000025     7.11226611E+00   # neutralino3 decays
#          BR         NDA      ID1       ID2
     1.25237389E-02    2     1000022        23   # BR(~chi_30 -> ~chi_10   Z )
     1.21996432E-01    2     1000023        23   # BR(~chi_30 -> ~chi_20   Z )
     1.51970825E-01    2     1000024       -24   # BR(~chi_30 -> ~chi_1+   W-)
     1.51970825E-01    2    -1000024        24   # BR(~chi_30 -> ~chi_1-   W+)
     1.09259684E-01    2     1000022        25   # BR(~chi_30 -> ~chi_10   h )
     8.03859665E-03    2     1000023        25   # BR(~chi_30 -> ~chi_20   h )
     2.06024508E-07    2     2000002        -2   # BR(~chi_30 -> ~u_R      ub)
     2.06024508E-07    2    -2000002         2   # BR(~chi_30 -> ~u_R*     u )
     2.05994233E-07    2     2000004        -4   # BR(~chi_30 -> ~c_R      cb)
     2.05994233E-07    2    -2000004         4   # BR(~chi_30 -> ~c_R*     c )
     5.40290964E-02    2     1000011       -11   # BR(~chi_30 -> ~e_L-     e+)
     5.40290964E-02    2    -1000011        11   # BR(~chi_30 -> ~e_L+     e-)
     1.05795888E-06    2     2000011       -11   # BR(~chi_30 -> ~e_R-     e+)
     1.05795888E-06    2    -2000011        11   # BR(~chi_30 -> ~e_R+     e-)
     5.40290964E-02    2     1000013       -13   # BR(~chi_30 -> ~mu_L-    mu+)
     5.40290964E-02    2    -1000013        13   # BR(~chi_30 -> ~mu_L+    mu-)
     1.05795888E-06    2     2000013       -13   # BR(~chi_30 -> ~mu_R-    mu+)
     1.05795888E-06    2    -2000013        13   # BR(~chi_30 -> ~mu_R+    mu-)
     5.70296144E-02    2     1000012       -12   # BR(~chi_30 -> ~nu_eL    nu_eb)
     5.70296144E-02    2    -1000012        12   # BR(~chi_30 -> ~nu_eL*   nu_e )
     5.70296144E-02    2     1000014       -14   # BR(~chi_30 -> ~nu_muL   nu_mub)
     5.70296144E-02    2    -1000014        14   # BR(~chi_30 -> ~nu_muL*  nu_mu )
#
#         PDG            Width
DECAY   1000035     1.29817413E+02   # neutralino4 decays
#          BR         NDA      ID1       ID2
     5.68828776E-03    2     1000022        23   # BR(~chi_40 -> ~chi_10   Z )
     1.03643257E-02    2     1000023        23   # BR(~chi_40 -> ~chi_20   Z )
     4.17728922E-04    2     1000025        23   # BR(~chi_40 -> ~chi_30   Z )
     1.46358580E-02    2     1000024       -24   # BR(~chi_40 -> ~chi_1+   W-)
     1.46358580E-02    2    -1000024        24   # BR(~chi_40 -> ~chi_1-   W+)
     1.36576585E-03    2     1000037       -24   # BR(~chi_40 -> ~chi_2+   W-)
     1.36576585E-03    2    -1000037        24   # BR(~chi_40 -> ~chi_2-   W+)
     9.48250920E-03    2     1000022        25   # BR(~chi_40 -> ~chi_10   h )
     4.84588383E-03    2     1000022        35   # BR(~chi_40 -> ~chi_10   H )
     2.96894240E-03    2     1000022        36   # BR(~chi_40 -> ~chi_10   A )
     6.28468722E-03    2     1000023        25   # BR(~chi_40 -> ~chi_20   h )
     2.90380415E-03    2     1000023        35   # BR(~chi_40 -> ~chi_20   H )
     4.85195464E-03    2     1000023        36   # BR(~chi_40 -> ~chi_20   A )
     9.55805985E-04    2     1000025        25   # BR(~chi_40 -> ~chi_30   h )
     1.10781358E-04    2     1000025        35   # BR(~chi_40 -> ~chi_30   H )
     4.21192266E-05    2     1000025        36   # BR(~chi_40 -> ~chi_30   A )
     7.66509259E-03    2     1000024       -37   # BR(~chi_40 -> ~chi_1+   H-)
     7.66509259E-03    2    -1000024        37   # BR(~chi_40 -> ~chi_1-   H+)
     1.55924264E-04    2     1000037       -37   # BR(~chi_40 -> ~chi_2+   H-)
     1.55924264E-04    2    -1000037        37   # BR(~chi_40 -> ~chi_2-   H+)
     7.97684515E-02    2     2000002        -2   # BR(~chi_40 -> ~u_R      ub)
     7.97684515E-02    2    -2000002         2   # BR(~chi_40 -> ~u_R*     u )
     1.82676496E-02    2     2000001        -1   # BR(~chi_40 -> ~d_R      db)
     1.82676496E-02    2    -2000001         1   # BR(~chi_40 -> ~d_R*     d )
     7.97684503E-02    2     2000004        -4   # BR(~chi_40 -> ~c_R      cb)
     7.97684503E-02    2    -2000004         4   # BR(~chi_40 -> ~c_R*     c )
     1.82676496E-02    2     2000003        -3   # BR(~chi_40 -> ~s _R      sb)
     1.82676496E-02    2    -2000003         3   # BR(~chi_40 -> ~s _R*     s )
     1.53990029E-02    2     1000006        -6   # BR(~chi_40 -> ~t_1      tb)
     1.53990029E-02    2    -1000006         6   # BR(~chi_40 -> ~t_1*     t )
     5.17849632E-04    2     2000006        -6   # BR(~chi_40 -> ~t_2      tb)
     5.17849632E-04    2    -2000006         6   # BR(~chi_40 -> ~t_2*     t )
     5.35306930E-04    2     1000005        -5   # BR(~chi_40 -> ~b_1      bb)
     5.35306930E-04    2    -1000005         5   # BR(~chi_40 -> ~b_1*     b )
     1.60192674E-02    2     1000011       -11   # BR(~chi_40 -> ~e_L-     e+)
     1.60192674E-02    2    -1000011        11   # BR(~chi_40 -> ~e_L+     e-)
     6.47557640E-02    2     2000011       -11   # BR(~chi_40 -> ~e_R-     e+)
     6.47557640E-02    2    -2000011        11   # BR(~chi_40 -> ~e_R+     e-)
     1.60192674E-02    2     1000013       -13   # BR(~chi_40 -> ~mu_L-    mu+)
     1.60192674E-02    2    -1000013        13   # BR(~chi_40 -> ~mu_L+    mu-)
     6.47557640E-02    2     2000013       -13   # BR(~chi_40 -> ~mu_R-    mu+)
     6.47557640E-02    2    -2000013        13   # BR(~chi_40 -> ~mu_R+    mu-)
     4.54655777E-02    2     1000015       -15   # BR(~chi_40 -> ~tau_1-   tau+)
     4.54655777E-02    2    -1000015        15   # BR(~chi_40 -> ~tau_1+   tau-)
     1.60894717E-02    2     1000012       -12   # BR(~chi_40 -> ~nu_eL    nu_eb)
     1.60894717E-02    2    -1000012        12   # BR(~chi_40 -> ~nu_eL*   nu_e )
     1.60894717E-02    2     1000014       -14   # BR(~chi_40 -> ~nu_muL   nu_mub)
     1.60894717E-02    2    -1000014        14   # BR(~chi_40 -> ~nu_muL*  nu_mu )
#
#         PDG            Width
DECAY        25     4.03352253E-03   # h decays
#          BR         NDA      ID1       ID2
     6.21523414E-01    2           5        -5   # BR(h -> b       bb     )
     6.47518906E-02    2         -15        15   # BR(h -> tau+    tau-   )
     2.28962947E-04    2         -13        13   # BR(h -> mu+     mu-    )
     2.50309947E-04    2           3        -3   # BR(h -> s       sb     )
     2.13713518E-02    2           4        -4   # BR(h -> c       cb     )
     7.72359315E-02    2          21        21   # BR(h -> g       g      )
     2.25278747E-03    2          22        22   # BR(h -> gam     gam    )
     1.42138240E-03    2          22        23   # BR(h -> Z       gam    )
     1.87881062E-01    2          24       -24   # BR(h -> W+      W-     )
     2.30829068E-02    2          23        23   # BR(h -> Z       Z      )
#
#         PDG            Width
DECAY        35     6.33527827E+01   # H decays
#          BR         NDA      ID1       ID2
     6.27440673E-01    2           5        -5   # BR(H -> b       bb     )
     1.13805224E-01    2         -15        15   # BR(H -> tau+    tau-   )
     3.54183992E-04    2         -13        13   # BR(H -> mu+     mu-    )
     2.44461296E-04    2           3        -3   # BR(H -> s       sb     )
     6.35354410E-09    2           4        -4   # BR(H -> c       cb     )
     6.10613309E-04    2           6        -6   # BR(H -> t       tb     )
     2.78887478E-05    2          21        21   # BR(H -> g       g      )
     5.21203917E-08    2          22        22   # BR(H -> gam     gam    )
     1.31218978E-08    2          23        22   # BR(H -> Z       gam    )
     1.05339712E-06    2          24       -24   # BR(H -> W+      W-     )
     5.24281706E-07    2          23        23   # BR(H -> Z       Z      )
     3.36459323E-06    2          25        25   # BR(H -> h       h      )
     1.21227946E-02    2     1000024  -1000024   # BR(H -> ~chi_1+ ~chi_1-)
     1.55229481E-03    2     1000037  -1000037   # BR(H -> ~chi_2+ ~chi_2-)
     7.91309973E-02    2     1000024  -1000037   # BR(H -> ~chi_1+ ~chi_2-)
     7.91309973E-02    2     1000037  -1000024   # BR(H -> ~chi_2+ ~chi_1-)
     3.75445068E-03    2     1000022   1000022   # BR(H -> ~chi_10 ~chi_10)
     3.93333894E-04    2     1000023   1000023   # BR(H -> ~chi_20 ~chi_20)
     7.77226810E-04    2     1000025   1000025   # BR(H -> ~chi_30 ~chi_30)
     1.13859460E-03    2     1000022   1000023   # BR(H -> ~chi_10 ~chi_20)
     3.09310457E-02    2     1000022   1000025   # BR(H -> ~chi_10 ~chi_30)
     4.85789114E-02    2     1000023   1000025   # BR(H -> ~chi_20 ~chi_30)
     8.68403636E-08    2     2000002  -2000002   # BR(H -> ~u_R    ~u_R*  )
     8.68403636E-08    2     2000004  -2000004   # BR(H -> ~c_R    ~c_R*  )
     7.56763520E-09    2     2000001  -2000001   # BR(H -> ~d_R    ~d_R*  )
     7.56763520E-09    2     2000003  -2000003   # BR(H -> ~s_R    ~s_R*  )
     1.11799679E-07    2     1000011  -1000011   # BR(H -> ~e_L-   ~e_L+  )
     7.49058389E-08    2     2000011  -2000011   # BR(H -> ~e_R-   ~e_R+  )
     1.11799679E-07    2     1000013  -1000013   # BR(H -> ~mu_L-  ~mu_L+ )
     7.49058389E-08    2     2000013  -2000013   # BR(H -> ~mu_R-  ~mu_R+ )
     3.65773510E-07    2     1000012  -1000012   # BR(H -> ~nu_eL  ~nu_eL*   )
     3.65773510E-07    2     1000014  -1000014   # BR(H -> ~nu_muL ~nu_muL*  )
#
#         PDG            Width
DECAY        36     6.33495552E+01   # A decays
#          BR         NDA      ID1       ID2
     6.27490020E-01    2           5        -5   # BR(A -> b       bb     )
     1.13812036E-01    2         -15        15   # BR(A -> tau+    tau-   )
     3.54203987E-04    2         -13        13   # BR(A -> mu+     mu-    )
     2.44483930E-04    2           3        -3   # BR(A -> s       sb     )
     6.30358726E-09    2           4        -4   # BR(A -> c       cb     )
     6.16604814E-04    2           6        -6   # BR(A -> t       tb     )
     4.37919119E-05    2          21        21   # BR(A -> g       g      )
     1.28660677E-07    2          22        22   # BR(A -> gam     gam    )
     2.38403466E-08    2          23        22   # BR(A -> Z       gam    )
     1.06053236E-06    2          23        25   # BR(A -> Z       h      )
     1.46889768E-02    2     1000024  -1000024   # BR(A -> ~chi_1+ ~chi_1-)
     3.51890691E-03    2     1000037  -1000037   # BR(A -> ~chi_2+ ~chi_2-)
     7.68363045E-02    2     1000024  -1000037   # BR(A -> ~chi_1+ ~chi_2-)
     7.68363045E-02    2     1000037  -1000024   # BR(A -> ~chi_2+ ~chi_1-)
     4.71164629E-03    2     1000022   1000022   # BR(A -> ~chi_10 ~chi_10)
     4.18982474E-04    2     1000023   1000023   # BR(A -> ~chi_20 ~chi_20)
     1.75296976E-03    2     1000025   1000025   # BR(A -> ~chi_30 ~chi_30)
     8.26646505E-04    2     1000022   1000023   # BR(A -> ~chi_10 ~chi_20)
     4.53072589E-02    2     1000022   1000025   # BR(A -> ~chi_10 ~chi_30)
     3.25396429E-02    2     1000023   1000025   # BR(A -> ~chi_20 ~chi_30)
#
#         PDG            Width
DECAY        37     6.10746830E+01   # H+ decays
#          BR         NDA      ID1       ID2
     1.03682794E-03    2           4        -5   # BR(H+ -> c       bb     )
     1.18187178E-01    2         -15        16   # BR(H+ -> tau+    nu_tau )
     3.67820232E-04    2         -13        14   # BR(H+ -> mu+     nu_mu  )
     1.03682463E-05    2           2        -5   # BR(H+ -> u       bb     )
     1.26737962E-05    2           2        -3   # BR(H+ -> u       sb     )
     2.49464941E-04    2           4        -3   # BR(H+ -> c       sb     )
     6.14333794E-01    2           6        -5   # BR(H+ -> t       bb     )
     1.10586454E-06    2          24        25   # BR(H+ -> W+      h      )
     7.78137195E-13    2          24        36   # BR(H+ -> W+      A      )
     2.38012749E-04    2     1000024   1000022   # BR(H+ -> ~chi_1+ ~chi_10)
     4.07347181E-03    2     1000024   1000023   # BR(H+ -> ~chi_1+ ~chi_20)
     8.67957643E-02    2     1000024   1000025   # BR(H+ -> ~chi_1+ ~chi_30)
     9.10847473E-02    2     1000037   1000022   # BR(H+ -> ~chi_2+ ~chi_10)
     8.36078525E-02    2     1000037   1000023   # BR(H+ -> ~chi_2+ ~chi_20)
     1.21773308E-08    2     1000037   1000025   # BR(H+ -> ~chi_2+ ~chi_30)
     4.52832815E-07    2    -1000011   1000012   # BR(H+ -> ~e_L+   ~nu_eL )
     4.52832815E-07    2    -1000013   1000014   # BR(H+ -> ~mu_L+  ~nu_muL)

DECAY         5   0.000000e+00 # b decays
DECAY        15   0.000000e+00 # tau decays
DECAY        23     2.49520000E+00   # Z
DECAY        24     2.08500000E+00   # W
