BLOCK SPINFO
   1   SPheno
   2   v4.0.5be

BLOCK SPHENOINFO
   1   2
   2   2

BLOCK MODSEL
   1   0

BLOCK MINPAR
   3    55.723847
   4    1

BLOCK EXTPAR
   0    1371.2603
   1   -649.51756
   2   -1525.1372
   3    3000
   11    3090.4666
   12    1239.7946
   13   -415.62931
   23    1846.8695
   25    54.209551
   26    1444.9491
   31    1557.5296
   32    1557.5296
   33    1220.9099
   34    1673.3366
   35    1673.3366
   36    1343.7485
   41    5000
   42    5000
   43    1961.232
   44    5000
   45    5000
   46    1027.2236
   47    5000
   48    5000
   49    1460.3912

BLOCK SMINPUTS
   1    127.90897
   2    1.1663787e-05
   3    0.1184
   4    91.1876
   5    4.18
   6    173.2
   7    1.777
   8    0
   11    0.00051099893
   12    0
   13    0.10565837
   14    0
   21    0.005
   22    0.0025
   23    0.095
   24    1.27

BLOCK GAUGE Q=  1371.2603
   1    0.35536298
   2    0.66519887
   3    1.219778

BLOCK YU Q=  1371.2603
   1   1    8.3857986e-06
   2   2    0.0042599857
   3   3    1.0130718

BLOCK YD Q=  1371.2603
   1   1    0.00091348303
   2   2    0.017356178
   3   3    0.90588892

BLOCK YE Q=  1371.2603
   1   1    0.00015940947
   2   2    0.032960823
   3   3    0.55434681

BLOCK AU Q=  1371.2603
   1   1    0
   2   2    0
   3   3    3090.4667

BLOCK AD Q=  1371.2603
   1   1    0
   2   2    0
   3   3    1239.7943

BLOCK AE Q=  1371.2603
   1   1    0
   2   2    0
   3   3   -415.62932

BLOCK MSOFT Q=  1371.2603
   1   -649.51756
   2   -1525.1372
   3    3000
   21   -1310321.4
   22   -3381543
   31    1557.5296
   32    1557.5296
   33    1220.9099
   34    1673.3366
   35    1673.3366
   36    1343.7485
   41    5000
   42    5000
   43    1961.232
   44    5000
   45    5000
   46    1027.2236
   47    5000
   48    5000
   49    1460.3912

BLOCK MASS
   6    173.2
   23    91.1876
   24    80.429995
   15    1.777
   25    123.01108
   35    1444.5107
   36    1444.9491
   37    1447.6702
   1000001    5020.8073
   2000001    5012.989
   1000002    5020.3659
   2000002    5014.1865
   1000003    5020.8303
   2000003    5012.9803
   1000004    5020.3711
   2000004    5014.1874
   1000005    1452.6721
   2000005    1957.3829
   1000006    950.61524
   2000006    1978.0397
   1000011    1568.461
   2000011    1676.1587
   1000012    1566.0984
   1000013    1568.351
   2000013    1676.2154
   1000014    1566.086
   1000015    1193.0021
   2000015    1365.1237
   1000016    1225.8426
   1000021    3181.3884
   1000022   -650.75566
   1000023   -1563.744
   1000025    1835.2449
   1000035   -1845.3332
   1000024    1563.8796
   1000037    1846.0896

BLOCK ALPHA
      -0.018149567

BLOCK HMIX Q=  1371.2603
   1    1846.8695
   2    54.209551
   3    244.09742
   4    2087877.9

BLOCK STOPMIX
   1   1   -0.15942915
   1   2    0.98720937
   2   1   -0.98720937
   2   2   -0.15942915

BLOCK SBOTMIX
   1   1    0.072176072
   1   2    0.99739191
   2   1   -0.99739191
   2   2    0.072176072

BLOCK STAUMIX
   1   1    0.89922139
   1   2    0.43749388
   2   1   -0.43749388
   2   2    0.89922139

BLOCK NMIX
   1   1   -0.99954852
   1   2    0.00086978261
   1   3   -0.028361758
   1   4   -0.0098798329
   2   1   -0.0061266997
   2   2   -0.98220058
   2   3    0.14372866
   2   4    0.12077483
   3   1    0.013044621
   3   2   -0.016513189
   3   3   -0.7066179
   3   4    0.70728234
   4   1   -0.026363959
   4   2    0.18710581
   4   3    0.69226356
   4   4    0.69646789

BLOCK UMIX
   1   1   -0.97691452
   1   2    0.21363057
   2   1   -0.21363057
   2   2   -0.97691452

BLOCK VMIX
   1   1    0.98342852
   1   2    0.18129631
   2   1    0.18129631
   2   2   -0.98342852

BLOCK HIGGSBOUNDSINPUTHIGGSCOUPLINGSFERMIONS
       0, 2938.6754,3,36,15,15

BLOCK HIGGSBOUNDSINPUTHIGGSCOUPLINGSBOSONS
       0,4,36,21,21,23

BLOCK SPHENOLOWENERGY
   1    0.00036820544
   2    1.5873198e-06
   3    3.5251746e-05
   4    8.3899224e-15
   5    3.5839956e-10
   6    7.4552837e-08
   7    2.8408922e-13
   8    1.2136003e-08
   9    2.5581577e-06
   10    7.8550464e-05
   11    0.81139622
   12    0.54447817
   13    19.365713
   14    0
   15    0
   16    0.0021825707
   17    2.2819249e-15
   18    2.4793992e-11
   19    8.2892785e-11
   20   -6.0213046e-15
   21   -2.5742383e-10
   22   -9.0872946e-08
   23    0
   24    0
   25    0
   26    0
   27    0
   28    0
   29    0
   30    0
   31    0
   39    8.3465557e-05
   40    0
   41    0
   42    0

BLOCK FWCOEF Q=  160
   305   4422   0   0   -0.18881911
   305   4422   0   2   -0.23974681
   305   4322   0   2   -0.00063840316
   305   6421   0   0   -0.095227835
   305   6421   0   2   -0.13880102
   305   6321   0   2   -0.00062131172
   3051111   4133   0   0    1.5895652
   3051111   4133   0   2    1.5901573
   3051111   4233   0   2    9.2066521e-05
   3051111   4137   0   0   -4.4122573
   3051111   4137   0   2   -4.410527
   3051111   4237   0   2   -0.00071789219
   3051313   4133   0   0    1.5895652
   3051313   4133   0   2    1.5901516
   3051313   4233   0   2    9.2052617e-05
   3051313   4137   0   0   -4.4122573
   3051313   4137   0   2   -4.4105327
   3051313   4237   0   2   -0.00071788268
   3051212   4137   0   0    1.5053501
   3051212   4137   0   2    1.5049766
   3051212   4237   0   2    0.00015653805
   3051414   4137   0   0    1.5053501
   3051414   4137   0   2    1.5049766
   3051414   4237   0   2    0.00015654084
   3051616   4137   0   0    1.5053501
   3051616   4137   0   2    1.5049765
   3051616   4237   0   2    0.00015732683

BLOCK IMFWCOEF Q=  160
   305   4422   0   0    3.8542061e-07
   305   4422   0   2   -4.898634e-06
   305   4322   0   2   -4.6094736e-06
   305   6421   0   0    3.3013824e-07
   305   6421   0   2   -2.0066673e-05
   305   6321   0   2   -2.77014e-06
   3051111   4133   0   2    2.8073239e-07
   3051111   4233   0   2    5.4505563e-06
   3051111   4137   0   2   -1.6791829e-06
   3051111   4237   0   2   -4.2610135e-05
   3051313   4133   0   2    2.8070162e-07
   3051313   4233   0   2    5.4505373e-06
   3051313   4137   0   2   -1.6792075e-06
   3051313   4237   0   2   -4.2610194e-05
   3051212   4137   0   2    4.295757e-07
   3051212   4237   0   2    9.2913791e-06
   3051414   4137   0   2    4.2957555e-07
   3051414   4237   0   2    9.2913791e-06
   3051616   4137   0   2    4.2754383e-07
   3051616   4237   0   2    9.2913784e-06

DECAY 23  2.4952


DECAY 24  2.085


DECAY 1000011  1.3453768
    0.99948696   2    1000022    11
    0.00033328774   2   -1000024    12
    0.00017974941   2    1000023    11

DECAY 2000011  6.0690012
    0.99999912   2    1000022    11

DECAY 1000013  1.3451908
    0.99951104   2    1000022    13
    0.0003175567   2   -1000024    14
    0.00017140019   2    1000023    13

DECAY 2000013  6.0694124
    0.99999248   2    1000022    13

DECAY 1000015  1.2031856
    1   2    1000022    15

DECAY 2000015  6.3252408
    0.54620436   2    1000022    15
    0.20667327   2    1000016   -24
    0.17008017   2    1000015    23
    0.077042195   2    1000015    25

DECAY 1000012  1.3499077
    0.99987664   2    1000022    12

DECAY 1000014  1.3498862
    0.99987798   2    1000022    14

DECAY 1000016  0.79616877
    0.99992243   2    1000022    16

DECAY 2000001  143.84917
    0.98119722   2    1000021    1
    0.018788723   2    1000022    1

DECAY 1000001  196.50354
    0.72242197   2    1000021    1
    0.17502742   2   -1000024    2
    0.08827022   2    1000023    1
    0.0076771529   2   -1000037    2
    0.0034780156   2    1000022    1
    0.0030951074   2    1000035    1

DECAY 2000003  143.89321
    0.98089061   2    1000021    3
    0.018783098   2    1000022    3
    0.00014887428   2   -1000037    4

DECAY 1000003  196.53019
    0.72233622   2    1000021    3
    0.17500497   2   -1000024    4
    0.088261372   2    1000023    3
    0.007682947   2   -1000037    4
    0.0034776792   2    1000022    3
    0.0031494784   2    1000035    3

DECAY 1000005  0.59395182
    0.91654668   2    1000022    5
    0.083453323   2    1000006   -24

DECAY 2000005  67.285326
    0.84642232   2    1000006   -24
    0.087659676   2    1000005    25
    0.022763667   2   -1000024    6
    0.016929104   2    1000005    23
    0.016589054   2    1000023    5
    0.0034937432   2    1000025    5
    0.0031652877   2    1000022    5
    0.0029771478   2    1000035    5

DECAY 2000002  152.09039
    0.92884944   2    1000021    2
    0.071100665   2    1000022    2

DECAY 1000002  196.49217
    0.72222984   2    1000021    2
    0.17735733   2    1000024    1
    0.088657265   2    1000023    2
    0.0055288907   2    1000037    1
    0.003410569   2    1000022    2
    0.0027991113   2    1000035    2

DECAY 2000004  152.09313
    0.92883288   2    1000021    4
    0.071099387   2    1000022    4

DECAY 1000004  196.51662
    0.72214243   2    1000021    4
    0.17734127   2    1000024    3
    0.088646499   2    1000023    4
    0.0056371198   2    1000037    3
    0.0034101486   2    1000022    4
    0.0028020677   2    1000035    4

DECAY 1000006  0.44642569
    0.99360438   2    1000022    6
    0.006394744   2    1000022    4

DECAY 2000006  69.350507
    0.47880842   2    1000006    25
    0.42209194   2    1000006    23
    0.036337255   2    1000005    24
    0.033399552   2    1000024    5
    0.017420367   2    1000023    6
    0.0077829531   2    1000037    5
    0.0041595174   2    1000022    6

DECAY 1000024  3.7257462
    0.41019734   2    1000006   -5
    0.29533198   2   -1000015    16
    0.27378991   2    1000016   -15
    0.012267725   2    1000022    24
    0.0074795633   2   -2000015    16
    0.00040781548   3    1000022   -5    6
    0.00026185011   3    1000022   -13    14
    0.00026139096   3    1000022   -11    12

DECAY 1000037  43.861369
    0.64305268   2    1000006   -5
    0.13812734   2   -1000005    6
    0.051541767   2    1000023    24
    0.040340531   2    1000016   -15
    0.035191217   2    1000024    23
    0.03306456   2    1000024    25
    0.027727734   2    1000022    24
    0.025929766   2   -2000015    16
    0.0016914166   2   -1000015    16
    0.00092454083   3    1000022   -5    6
    0.00065463776   2   -1000013    14
    0.00065416125   2   -1000011    12
    0.00051277389   2    1000014   -13
    0.00047851532   2    1000012   -11

DECAY 1000022 -1


DECAY 1000023  4.1434014
    0.15635425   2    1000006   -6
    0.15635425   2   -1000006    6
    0.1372611   2    1000015   -15
    0.1372611   2   -1000015    15
    0.11827146   2    1000016   -16
    0.11827146   2   -1000016    16
    0.07375329   2    1000006   -4
    0.07375329   2   -1000006    4
    0.0071117688   2    1000022    25
    0.0056627822   2    1000005   -5
    0.0056627822   2   -1000005    5
    0.0039750571   2    2000015   -15
    0.0039750571   2   -2000015    15
    0.0014932782   2    1000022    23
    0.00035791859   3    1000022    12   -12
    0.00017294496   3    1000022    13   -13
    0.00017254892   3    1000022    11   -11
    0.00010502703   3    1000022    6   -6

DECAY 1000025  45.133509
    0.3044911   2    1000006   -6
    0.3044911   2   -1000006    6
    0.069288533   2    1000005   -5
    0.069288533   2   -1000005    5
    0.038638177   2    1000023    23
    0.037465543   2    1000023    25
    0.032839444   2    1000024   -24
    0.032839444   2   -1000024    24
    0.022901015   2    1000022    23
    0.021119642   2    1000022    25
    0.02029047   2    1000015   -15
    0.02029047   2   -1000015    15
    0.012618153   2    2000015   -15
    0.012618153   2   -2000015    15
    0.00048878615   3    1000022    6   -6
    0.00012548561   3    1000022    5   -5

DECAY 1000035  41.007342
    0.31691378   2    1000006   -6
    0.31691378   2   -1000006    6
    0.074844065   2    1000005   -5
    0.074844065   2   -1000005    5
    0.039133894   2    1000024   -24
    0.039133894   2   -1000024    24
    0.035655376   2    1000023    25
    0.020816361   2    1000022    25
    0.018848468   2    1000015   -15
    0.018848468   2   -1000015    15
    0.016209341   2    2000015   -15
    0.016209341   2   -2000015    15
    0.0057303354   2    1000022    23
    0.0012513496   2    1000016   -16
    0.0012513496   2   -1000016    16
    0.00051388595   3    1000022    6   -6
    0.00031595206   2    1000023    23
    0.00031372403   2    1000014   -14
    0.00031372403   2   -1000014    14
    0.00031369839   2    1000012   -12
    0.00031369839   2   -1000012    12
    0.00024649544   2    1000013   -13
    0.00024649544   2   -1000013    13
    0.0002284137   2    1000011   -11
    0.0002284137   2   -1000011    11
    0.00014593444   3    1000022    5   -5

DECAY 1000021  216.07721
    0.18738915   2    1000006   -6
    0.18738915   2   -1000006    6
    0.13644744   2    1000005   -5
    0.13644744   2   -1000005    5
    0.084207506   2    2000005   -5
    0.084207506   2   -2000005    5
    0.076956466   2    2000006   -6
    0.076956466   2   -2000006    6
    0.013920463   2    1000006   -4
    0.013920463   2   -1000006    4
    0.00052928268   3    1000037    5   -6
    0.00052928268   3   -1000037   -5    6
    0.00049138615   3    1000025    6   -6
    0.00037225206   3    1000035    6   -6

DECAY 25  0.0036560593
    0.60499498   2   -5    5
    0.19585939   2   -24    24
    0.072385573   2    21    21
    0.07008224   2   -15    15
    0.029763159   2   -4    4
    0.022780615   2    23    23
    0.0023369501   2    22    22
    0.0013240388   2    22    23
    0.00024306895   2   -13    13
    0.00022919616   2   -3    3
    6.3370591e-07   2   -1    1
    1.5338333e-07   2   -2    2
    5.4644825e-09   2   -11    11

DECAY 35  21.640142
    0.67513555   2   -5    5
    0.32284376   2   -15    15
    0.0011499027   2   -13    13
    0.00067259027   2   -3    3
    0.00010535958   2   -6    6
    6.57865e-05   2    25    25
    1.320041e-05   2    21    21
    9.3670888e-06   2    1000022    1000022
    1.859478e-06   2   -1    1
    1.4045747e-06   2    23    23
    1.1828232e-06   2   -24    24
    2.5831978e-08   2   -11    11
    6.8830037e-09   2    22    22
    4.9923806e-09   2    22    23
    2.9964321e-09   2   -4    4
    1.5478784e-14   2   -2    2

DECAY 36  20.92232
    0.67519977   2   -5    5
    0.32277065   2   -15    15
    0.0011496319   2   -13    13
    0.0006723934   2   -3    3
    0.00011638212   2   -6    6
    4.9285325e-05   2    1000022    1000022
    3.7926843e-05   2    21    21
    1.9380436e-06   2    23    25
    1.8589338e-06   2   -1    1
    8.6001235e-08   2    22    22
    4.7192887e-08   2    22    23
    2.582592e-08   2   -11    11
    2.5983028e-09   2   -4    4
    1.3435961e-14   2   -2    2
    2.5787677e-36   2    25    25

DECAY 37  22.537364
    0.59818182   2   -5    6
    0.39888057   2   -15    16
    0.0014101885   2   -13    14
    0.0008978555   2   -5    4
    0.00059006411   2   -3    4
    2.7393005e-05   2   -3    2
    6.4116225e-06   2   -5    2
    2.081366e-06   2   -3    6
    1.8145106e-06   2    24    25
    1.6387816e-06   2   -1    2
    7.6385689e-08   2   -1    4
    5.6616278e-08   2   -1    6
    3.2984455e-08   2   -11    12
    1.8982089e-11   2    24    35
    8.9958107e-12   2    24    36

DECAY 6  2.43
    1   2    5    24

DECAY 15 -1
