BLOCK SPINFO
   1   SPheno
   2   v4.0.5be

BLOCK SPHENOINFO
   1   2
   2   2

BLOCK MODSEL
   1   0

BLOCK MINPAR
   3    6.3017503
   4   -1

BLOCK EXTPAR
   0    1433.3075
   1   -50.988882
   2   -136.0897
   3    3000
   11    3175.2039
   12    185.93736
   13   -886.09871
   23   -1933.1318
   25    6.0315677
   26    1356.482
   31    1220.929
   32    1220.929
   33    1484.1032
   34    1728.4653
   35    1728.4653
   36    1377.0504
   41    5000
   42    5000
   43    1132.1388
   44    5000
   45    5000
   46    1953.1999
   47    5000
   48    5000
   49    1794.6518

BLOCK SMINPUTS
   1    127.90897
   2    1.1663787e-05
   3    0.1184
   4    91.1876
   5    4.18
   6    173.2
   7    1.777
   8    0
   11    0.00051099893
   12    0
   13    0.10565837
   14    0
   21    0.005
   22    0.0025
   23    0.095
   24    1.27

BLOCK GAUGE Q=  1433.3075
   1    0.35536298
   2    0.66519887
   3    1.219778

BLOCK YU Q=  1433.3075
   1   1    8.4988248e-06
   2   2    0.004317403
   3   3    1.0267263

BLOCK YD Q=  1433.3075
   1   1    0.00010300761
   2   2    0.0019571447
   3   3    0.10215128

BLOCK YE Q=  1433.3075
   1   1    1.7975582e-05
   2   2    0.0037167802
   3   3    0.062510129

BLOCK AU Q=  1433.3075
   1   1    0
   2   2    0
   3   3    3175.2041

BLOCK AD Q=  1433.3075
   1   1    0
   2   2    0
   3   3    185.93738

BLOCK AE Q=  1433.3075
   1   1    0
   2   2    0
   3   3   -886.09871

BLOCK MSOFT Q=  1433.3075
   1   -50.988882
   2   -136.0897
   3    3000
   21   -1969754.4
   22   -3653878.6
   31    1220.929
   32    1220.929
   33    1484.1032
   34    1728.4653
   35    1728.4653
   36    1377.0504
   41    5000
   42    5000
   43    1132.1388
   44    5000
   45    5000
   46    1953.1999
   47    5000
   48    5000
   49    1794.6518

BLOCK MASS
   6    173.2
   23    91.1876
   24    80.429995
   15    1.777
   25    121.93805
   35    1356.4447
   36    1356.482
   37    1359.0769
   1000001    5027.122
   2000001    5016.2977
   1000002    5026.7123
   2000002    5017.6561
   1000003    5027.1227
   2000003    5016.2976
   1000004    5026.7128
   2000004    5017.6569
   1000005    1107.0843
   2000005    1817.76
   1000006    1060.959
   2000006    1936.3335
   1000011    1223.5037
   2000011    1730.7088
   1000012    1220.7376
   1000013    1223.5031
   2000013    1730.7086
   1000014    1220.7374
   1000015    1378.6769
   2000015    1487.4611
   1000016    1484.7097
   1000021    3186.5701
   1000022   -50.495429
   1000023   -146.32533
   1000025    1924.7629
   1000035   -1925.8421
   1000024    146.51313
   1000037    1926.5364

BLOCK ALPHA
      -0.15937685

BLOCK HMIX Q=  1433.3075
   1   -1933.1318
   2    6.0315677
   3    244.04448
   4    1840043.3

BLOCK STOPMIX
   1   1   -0.97808094
   1   2    0.20822506
   2   1   -0.20822506
   2   2   -0.97808094

BLOCK SBOTMIX
   1   1   -0.99988264
   1   2    0.015319929
   2   1   -0.015319929
   2   2   -0.99988264

BLOCK STAUMIX
   1   1   -0.06196876
   1   2    0.99807809
   2   1   -0.99807809
   2   2   -0.06196876

BLOCK NMIX
   1   1    0.99969474
   1   2   -0.0075225051
   1   3   -0.023061913
   1   4    0.0046894275
   2   1    0.0085157447
   2   2    0.99906335
   2   3    0.041216571
   2   4   -0.01005517
   3   1    0.012812616
   3   2   -0.022135192
   3   3    0.70644867
   3   4    0.70730202
   4   1    0.019332605
   4   2   -0.03641257
   4   3    0.70618667
   4   4   -0.70682442

BLOCK UMIX
   1   1   -0.99828795
   1   2   -0.058490765
   2   1   -0.058490765
   2   2    0.99828795

BLOCK VMIX
   1   1    0.99989759
   1   2    0.014311383
   2   1    0.014311383
   2   2   -0.99989759

BLOCK HIGGSBOUNDSINPUTHIGGSCOUPLINGSFERMIONS
       0, 36.379808,3,36,15,15

BLOCK HIGGSBOUNDSINPUTHIGGSCOUPLINGSBOSONS
       0,4,36,21,21,23

BLOCK SPHENOLOWENERGY
   1    0.00033814943
   2    1.5891279e-06
   3    3.526863e-05
   4    2.3923746e-15
   5    1.0219953e-10
   6    2.1394607e-08
   7    8.0764449e-14
   8    3.4502547e-09
   9    7.3183626e-07
   10    9.6696278e-05
   11    0.99883553
   12    0.54306481
   13    19.403688
   14    0
   15    0
   16    0.0021614985
   17    2.2817016e-15
   18    2.4812108e-11
   19    8.2932383e-11
   20    1.0635877e-15
   21    4.5471663e-11
   22    9.2967943e-09
   23    0
   24    0
   25    0
   26    0
   27    0
   28    0
   29    0
   30    0
   31    0
   39   -0.0001103657
   40    0
   41    0
   42    0

BLOCK FWCOEF Q=  160
   305   4422   0   0   -0.18881911
   305   4422   0   2   -0.20630902
   305   4322   0   2   -0.00040046542
   305   6421   0   0   -0.095227835
   305   6421   0   2   -0.11901494
   305   6321   0   2   -0.00050255564
   3051111   4133   0   0    1.5901168
   3051111   4133   0   2    1.5906692
   3051111   4233   0   2    2.7100585e-06
   3051111   4137   0   0   -4.4128089
   3051111   4137   0   2   -4.4125819
   3051111   4237   0   2   -2.0474409e-05
   3051313   4133   0   0    1.5901168
   3051313   4133   0   2    1.5906692
   3051313   4233   0   2    2.7100553e-06
   3051313   4137   0   0   -4.4128089
   3051313   4137   0   2   -4.4125819
   3051313   4237   0   2   -2.0474407e-05
   3051212   4137   0   0    1.5053501
   3051212   4137   0   2    1.5053311
   3051212   4237   0   2    4.4556795e-06
   3051414   4137   0   0    1.5053501
   3051414   4137   0   2    1.5053311
   3051414   4237   0   2    4.4556801e-06
   3051616   4137   0   0    1.5053501
   3051616   4137   0   2    1.5053302
   3051616   4237   0   2    4.4561451e-06

BLOCK IMFWCOEF Q=  160
   305   4422   0   0    3.8584477e-07
   305   4422   0   2    1.4386894e-06
   305   4322   0   2    4.3551949e-07
   305   6421   0   0    3.3050157e-07
   305   6421   0   2    2.8748852e-06
   305   6321   0   2    2.5469776e-07
   3051111   4133   0   2    5.892836e-07
   3051111   4233   0   2    1.0509906e-07
   3051111   4137   0   2    7.2703619e-06
   3051111   4237   0   2   -8.0902717e-07
   3051313   4133   0   2    5.892829e-07
   3051313   4233   0   2    1.0509906e-07
   3051313   4137   0   2    7.2703626e-06
   3051313   4237   0   2   -8.0902719e-07
   3051212   4137   0   2   -1.0390545e-06
   3051212   4237   0   2    1.7624294e-07
   3051414   4137   0   2   -1.0390545e-06
   3051414   4237   0   2    1.7624294e-07
   3051616   4137   0   2   -1.0561102e-06
   3051616   4237   0   2    1.7624806e-07

DECAY 23  2.4952


DECAY 24  2.085


DECAY 1000011  17.186219
    0.60677015   2   -1000024    12
    0.30665296   2    1000023    11
    0.086576886   2    1000022    11

DECAY 2000011  8.676703
    0.99992835   2    1000022    11

DECAY 1000013  17.186211
    0.60677013   2   -1000024    14
    0.30665298   2    1000023    13
    0.086576893   2    1000022    13

DECAY 2000013  8.6768447
    0.99991191   2    1000022    13

DECAY 1000015  6.9671482
    0.9883135   2    1000022    15
    0.0077238276   2   -1000024    16
    0.0039626704   2    1000023    15

DECAY 2000015  21.011345
    0.60631797   2   -1000024    16
    0.30642991   2    1000023    15
    0.087159767   2    1000022    15

DECAY 1000012  17.170003
    0.60784556   2    1000024    11
    0.30068142   2    1000023    12
    0.091473015   2    1000022    12

DECAY 1000014  17.170002
    0.60784558   2    1000024    13
    0.30068141   2    1000023    14
    0.091473011   2    1000022    14

DECAY 1000016  21.071399
    0.60813966   2    1000024    15
    0.30081211   2    1000023    16
    0.090755182   2    1000022    16
    0.00029304985   2    1000015    24

DECAY 2000001  143.66839
    0.98051356   2    1000021    1
    0.019477394   2    1000022    1

DECAY 1000001  208.91165
    0.67969249   2    1000021    1
    0.210748   2   -1000024    2
    0.10521808   2    1000023    1
    0.003645485   2    1000022    1
    0.00052747392   2   -1000037    2
    0.00012248431   2    1000035    1

DECAY 2000003  143.66894
    0.98050977   2    1000021    3
    0.019477321   2    1000022    3

DECAY 1000003  208.91337
    0.67968725   2    1000021    3
    0.21074627   2   -1000024    4
    0.10521723   2    1000023    3
    0.0036454565   2    1000022    3
    0.00053399251   2   -1000037    4
    0.0001231465   2    1000035    3

DECAY 1000005  13.741684
    0.64711524   2   -1000024    6
    0.34068202   2    1000023    5
    0.012202738   2    1000022    5

DECAY 2000005  1.5209015
    0.66540249   2    1000022    5
    0.16980639   2    1000006   -24
    0.08768533   2    1000005    25
    0.076438596   2    1000005    23
    0.00040673137   2   -1000024    6
    0.00026045856   2    1000023    5

DECAY 2000002  152.21157
    0.92640921   2    1000021    2
    0.073556668   2    1000022    2

DECAY 1000002  208.90605
    0.67950654   2    1000021    2
    0.21141656   2    1000024    1
    0.10585303   2    1000023    2
    0.0030780836   2    1000022    2

DECAY 2000004  152.21429
    0.92639275   2    1000021    4
    0.073555352   2    1000022    4

DECAY 1000004  208.90768
    0.6795012   2    1000021    4
    0.21141493   2    1000024    3
    0.1058522   2    1000023    4
    0.0030780596   2    1000022    4

DECAY 1000006  13.022352
    0.66629284   2    1000024    5
    0.31608877   2    1000023    6
    0.017351314   2    1000022    6
    0.00026699216   3    1000022    24    5

DECAY 2000006  140.7018
    0.45710771   2    1000005    24
    0.26267512   2    1000006    25
    0.24511551   2    1000006    23
    0.028837953   2    1000022    6
    0.0041704123   2    1000024    5
    0.002067253   2    1000023    6

DECAY 1000024  0.00018805915
    0.99996952   2    1000022    24

DECAY 1000037  46.014262
    0.57277541   2   -1000005    6
    0.095328579   2    1000024    25
    0.094864105   2    1000023    24
    0.093840852   2    1000024    23
    0.031540317   2    1000006   -5
    0.02756034   2    1000022    24
    0.025150118   2    37    1000023
    0.020667248   2    1000024    35
    0.020599847   2    1000024    36
    0.0065769935   2    37    1000022
    0.0051279459   3    1000024    6   -6
    0.0033698551   3    1000023   -5    6
    0.0013153047   3    1000022   -5    6
    0.00035535488   2   -1000015    16
    0.00027328675   2    1000016   -15
    0.0002244592   2   -1000013    14
    0.00022445892   2   -1000011    12
    0.00012386291   2   -2000015    16

DECAY 1000022 -1


DECAY 1000023  3.7257862e-07
    0.95999345   2    1000022    23
    0.017724449   3    1000022    12   -12
    0.0068874411   3    1000022    13   -13
    0.0068873008   3    1000022    11   -11
    0.0044675078   3    1000022    5   -5
    0.0032036018   3    1000022    15   -15
    0.00076617655   2    1000022    22

DECAY 1000025  44.985742
    0.28971812   2    1000006   -6
    0.28971812   2   -1000006    6
    0.096268134   2    1000024   -24
    0.096268134   2   -1000024    24
    0.069631717   2    1000023    23
    0.036624619   2    1000023    25
    0.020795034   2    37   -1000024
    0.020795034   2   -37    1000024
    0.020699033   2    1000022    23
    0.019562902   2    1000023    35
    0.0099258717   2    1000022    25
    0.0054354166   2    1000023    36
    0.0050373687   2    1000022    35
    0.0037115029   3    1000024    5   -6
    0.0037115029   3   -1000024   -5    6
    0.003041143   2    1000005   -5
    0.003041143   2   -1000005    5
    0.0022446503   3    1000023    6   -6
    0.0021028764   2    1000022    36
    0.00065620155   3    1000022    6   -6
    0.00019358975   2    1000015   -15
    0.00019358975   2   -1000015    15
    0.00014363405   2    2000015   -15
    0.00014363405   2   -2000015    15

DECAY 1000035  44.554261
    0.2917554   2    1000006   -6
    0.2917554   2   -1000006    6
    0.097254596   2    1000024   -24
    0.097254596   2   -1000024    24
    0.07037432   2    1000023    25
    0.025967344   2    1000023    23
    0.025590819   2    37   -1000024
    0.025590819   2   -37    1000024
    0.019078577   2    1000022    25
    0.01074938   2    1000023    36
    0.010301532   2    1000023    35
    0.0091608325   2    1000022    23
    0.0041562032   2    1000022    36
    0.0037532295   3    1000024    5   -6
    0.0037532295   3   -1000024   -5    6
    0.0031936445   2    1000005   -5
    0.0031936445   2   -1000005    5
    0.0026526098   2    1000022    35
    0.0024517226   3    1000023    6   -6
    0.00067447222   3    1000022    6   -6
    0.00019676536   2    1000015   -15
    0.00019676536   2   -1000015    15
    0.00015572653   2    2000015   -15
    0.00015572653   2   -2000015    15

DECAY 1000021  228.89651
    0.17082955   2    1000006   -6
    0.17082955   2   -1000006    6
    0.15931536   2    1000005   -5
    0.15931536   2   -1000005    5
    0.09375136   2    2000005   -5
    0.09375136   2   -2000005    5
    0.075820178   2    2000006   -6
    0.075820178   2   -2000006    6
    0.00016906778   3    1000025    6   -6
    0.00016554581   3    1000035    6   -6

DECAY 25  0.0035813796
    0.624393   2   -5    5
    0.17753607   2   -24    24
    0.071753477   2    21    21
    0.071202812   2   -15    15
    0.030058554   2   -4    4
    0.020205125   2    23    23
    0.0023178726   2    22    22
    0.0012307898   2    22    23
    0.00082095432   2    1000022    1000022
    0.00024696311   2   -13    13
    0.00023356823   2   -3    3
    6.4579122e-07   2   -1    1
    1.5490856e-07   2   -2    2
    5.5520465e-09   2   -11    11

DECAY 35  2.8232864
    0.62893425   2   -6    6
    0.30435934   2   -5    5
    0.039378758   2   -15    15
    0.011627154   2   -1000024    1000024
    0.0057122593   2    1000023    1000023
    0.0038583232   2    25    25
    0.0034886698   2    1000022    1000023
    0.0008325518   2    23    23
    0.0007641648   2   -24    24
    0.00052820914   2    1000022    1000022
    0.00027536846   2    21    21
    0.00013648676   2   -13    13
    9.2899683e-05   2   -3    3
    7.8171524e-06   2   -4    4
    1.9238531e-06   2    22    22
    1.5602919e-06   2    22    23
    2.5683181e-07   2   -1    1
    3.0661692e-09   2   -11    11
    4.0302155e-11   2   -2    2

DECAY 36  2.8178071
    0.63381986   2   -6    6
    0.29990616   2   -5    5
    0.038800454   2   -15    15
    0.014021933   2   -1000024    1000024
    0.0068893337   2    1000023    1000023
    0.0040482344   2    1000022    1000023
    0.0011224126   2    23    25
    0.00059907366   2    1000022    1000022
    0.00055343911   2    21    21
    0.00013448125   2   -13    13
    9.1533032e-05   2   -3    3
    7.3399173e-06   2   -4    4
    2.9060068e-06   2    22    22
    2.5823914e-06   2    22    23
    2.5305347e-07   2   -1    1
    3.0211101e-09   2   -11    11
    3.7844491e-11   2   -2    2
    2.6756942e-36   2    25    25

DECAY 37  2.3973693
    0.94325284   2   -5    6
    0.045022076   2   -15    16
    0.0087190644   2    1000022    1000024
    0.0013311535   2    24    25
    0.0008533556   2   -3    6
    0.00050778654   2   -5    4
    0.00015916954   2   -13    14
    0.00010601776   2   -3    4
    3.9132393e-05   2   -1    6
    4.5502006e-06   2   -3    2
    3.6260383e-06   2   -5    2
    5.7121212e-07   2    1000023    1000024
    3.7972331e-07   2   -1    4
    2.7219486e-07   2   -1    2
    3.7229922e-09   2   -11    12
    7.1628254e-11   2    24    35
    6.6701899e-11   2    24    36

DECAY 6  2.43
    1   2    5    24

DECAY 15 -1
