BLOCK DCINFO
   1   SDECAY/HDECAY
   2   1.3b /3.4

BLOCK SPINFO
   1   SOFTSUSY
   2   3.4.0

BLOCK MODSEL
   1   0

BLOCK SMINPUTS
   1    127.90897
   2    1.1663787e-05
   3    0.1184
   4    91.1876
   5    4.18
   6    173.2
   7    1.777

BLOCK MINPAR
   3    17.84

BLOCK EXTPAR
   0   -1
   1    510.85
   2   -1258.06
   3    2865.75
   11    4085.45
   12   -3649.45
   13    2367.92
   23   -491.36
   26    3036.53
   31    1445.32
   32    1445.32
   33    2508.88
   34    2360.04
   35    2360.04
   36    2843.49
   41    3960.39
   42    3960.39
   43    3044.33
   44    2270.72
   45    2270.72
   46    3291.82
   47    1332.99
   48    1332.99
   49    2866.36

BLOCK MASS
   24    80.399213
   25    127.12476
   35    3036.553
   36    3036.53
   37    3037.7665
   5    4.8187603
   1000001    4040.0472
   2000001    1496.865
   1000002    4039.4146
   2000002    2394.3729
   1000003    4040.0472
   2000003    1496.865
   1000004    4039.4146
   2000004    2394.3729
   1000005    2968.824
   2000005    3110.611
   1000006    3080.3491
   2000006    3324.2744
   1000011    1460.3398
   2000011    2364.3853
   1000012    1457.8958
   1000013    1460.3398
   2000013    2364.3853
   1000014    1457.8958
   1000015    2516.1303
   2000015    2845.0324
   1000016    2514.6099
   1000021    3041.0442
   1000022    480.14938
   1000023   -508.21806
   1000025    539.07949
   1000035   -1307.9263
   1000024    509.09718
   1000037    1308.1

BLOCK NMIX
   1   1   -0.74769916
   1   2   -0.018878396
   1   3    0.48569633
   1   4    0.4524253
   2   1    0.032117462
   2   2    0.073809911
   2   3    0.70689616
   2   4   -0.70272212
   3   1    0.66325798
   3   2   -0.02212781
   3   3    0.51321417
   3   4    0.54425217
   4   1   -0.001815223
   4   2    0.99684806
   4   3   -0.031750545
   4   4    0.072681116

BLOCK UMIX
   1   1    0.044937914
   1   2    0.99898978
   2   1   -0.99898978
   2   2    0.044937914

BLOCK VMIX
   1   1   -0.10290655
   1   2   -0.99469103
   2   1    0.99469103
   2   2   -0.10290655

BLOCK STOPMIX
   1   1    0.93454955
   1   2   -0.35583301
   2   1    0.35583301
   2   2    0.93454955

BLOCK SBOTMIX
   1   1   -0.01261435
   1   2    0.99992044
   2   1   -0.99992044
   2   2   -0.01261435

BLOCK STAUMIX
   1   1    0.99993895
   1   2   -0.011049718
   2   1    0.011049718
   2   2    0.99993895

BLOCK ALPHA
      -0.058791835

BLOCK HMIX Q=  3165.851
   1   -500.03603
   2    17.032953
   3    241.77181
   4    9425613.6

BLOCK GAUGE Q=  3165.851
   1    0.36530035
   2    0.63826885
   3    1.0093329

BLOCK AU Q=  3165.851
   1   1    0
   2   2    0
   3   3    4085.45

BLOCK AD Q=  3165.851
   1   1    0
   2   2    0
   3   3   -3649.45

BLOCK AE Q=  3165.851
   1   1    0
   2   2    0
   3   3    2367.92

BLOCK YU Q=  3165.851
   1   1    0
   2   2    0
   3   3    0.83664185

BLOCK YD Q=  3165.851
   1   1    0
   2   2    0
   3   3    0.2348228

BLOCK YE Q=  3165.851
   1   1    0
   2   2    0
   3   3    0.17638188

BLOCK MSOFT Q=  3165.851
   1    510.85
   2   -1258.06
   3    2865.75
   21    8955374.9
   22   -11033.723
   31    1445.32
   32    1445.32
   33    2508.88
   34    2360.04
   35    2360.04
   36    2843.49
   41    3960.39
   42    3960.39
   43    3044.33
   44    2270.72
   45    2270.72
   46    3291.82
   47    1332.99
   48    1332.99
   49    2866.36

BLOCK HIGGSBOUNDSINPUTHIGGSCOUPLINGSFERMIONS
       0, 290.12148,3,36,15,15

BLOCK HIGGSBOUNDSINPUTHIGGSCOUPLINGSBOSONS
       0,4,36,21,21,23

DECAY 6  1.4343424
    1   2    5    24

DECAY 1000021  90.50761
    0.19944281   2    2000001   -1
    0.19944281   2   -2000001    1
    0.19944281   2    2000003   -3
    0.19944281   2   -2000003    3
    0.050181573   2    2000002   -2
    0.050181573   2   -2000002    2
    0.050181456   2    2000004   -4
    0.050181456   2   -2000004    4
    0.0007513443   2    1000005   -5
    0.0007513443   2   -1000005    5

DECAY 1000006  72.308269
    0.28003639   2    1000023    6
    0.2161343   2    1000025    6
    0.18034717   2    1000037    5
    0.140955   2    1000024    5
    0.092955713   2    1000035    6
    0.089567208   2    1000022    6
    4.212121e-06   2    1000005    24

DECAY 2000006  107.15803
    0.33905688   2    1000024    5
    0.19900569   2    1000023    6
    0.14387744   2    1000022    6
    0.1158204   2    1000025    6
    0.048424042   2    1000021    6
    0.041664184   2    2000005    24
    0.04138608   2    1000037    5
    0.02763743   2    1000006    23
    0.022096489   2    1000006    25
    0.020998179   2    1000035    6
    3.3183604e-05   2    1000005    24

DECAY 1000005  7.7696193
    0.39244846   2   -1000024    6
    0.2172256   2    1000022    5
    0.19834028   2    1000023    5
    0.19193501   2    1000025    5
    3.4793364e-05   2   -1000037    6
    1.5850144e-05   2    1000035    5

DECAY 2000005  70.329548
    0.57319646   2   -1000024    6
    0.24832903   2   -1000037    6
    0.12084817   2    1000035    5
    0.023654447   2    1000023    5
    0.016199869   2    1000025    5
    0.013084472   2    1000022    5
    0.0046726395   2    1000021    5
    7.9200678e-06   2    1000005    25
    6.9898936e-06   2    1000005    23

DECAY 1000002  97.572082
    0.60669743   2    1000021    2
    0.25519729   2    1000037    1
    0.12807149   2    1000035    2
    0.0040655788   2    1000022    2
    0.0032892108   2    1000024    1
    0.0016865258   2    1000025    2
    0.00099247526   2    1000023    2

DECAY 2000002  5.0983879
    0.56437914   2    1000022    2
    0.43458804   2    1000025    2
    0.0010310298   2    1000023    2
    1.7872617e-06   2    1000035    2

DECAY 1000001  97.589966
    0.60717838   2    1000021    1
    0.25742066   2   -1000037    2
    0.12825597   2    1000035    1
    0.0034192757   2    1000025    1
    0.0023869876   2    1000022    1
    0.00071149427   2    1000023    1
    0.00062722893   2   -1000024    2

DECAY 2000001  0.70356363
    0.5738477   2    1000022    1
    0.42512208   2    1000025    1
    0.0010299743   2    1000023    1
    2.4237524e-07   2    1000035    1

DECAY 1000004  80.978432
    0.50599768   2    1000021    4
    0.32050632   2    1000037    3
    0.16084708   2    1000035    4
    0.0051257732   2    1000022    4
    0.0041463405   2    1000024    3
    0.002125694   2    1000025    4
    0.0012511078   2    1000023    4

DECAY 2000004  5.1552006
    0.56445209   2    1000022    4
    0.43451512   2    1000025    4
    0.0010310161   2    1000023    4
    1.7777722e-06   2    1000035    4

DECAY 1000003  80.975636
    0.50650996   2    1000021    3
    0.32336802   2   -1000037    4
    0.16111342   2    1000035    3
    0.0043105714   2    1000025    3
    0.0030100942   2    1000022    3
    0.000897097   2    1000023    3
    0.00079084629   2   -1000024    4

DECAY 2000003  0.69227597
    0.57393548   2    1000022    3
    0.42503432   2    1000025    3
    0.0010299598   2    1000023    3
    2.3512213e-07   2    1000035    3

DECAY 1000011  2.2523022
    0.41725945   2    1000022    11
    0.25048504   2    1000025    11
    0.20483209   2   -1000037    12
    0.10198442   2    1000035    11
    0.017249796   2    1000023    11
    0.0081892028   2   -1000024    12

DECAY 2000011  11.426527
    0.56459641   2    1000022    11
    0.43437085   2    1000025    11
    0.0010310015   2    1000023    11
    1.7435547e-06   2    1000035    11

DECAY 1000013  2.2523021
    0.41725946   2    1000022    13
    0.25048505   2    1000025    13
    0.2048321   2   -1000037    14
    0.1019844   2    1000035    13
    0.017249797   2    1000023    13
    0.0081892031   2   -1000024    14

DECAY 2000013  11.426527
    0.56459641   2    1000022    13
    0.43437085   2    1000025    13
    0.0010310015   2    1000023    13
    1.7435547e-06   2    1000035    13

DECAY 1000015  20.849713
    0.51955492   2   -1000037    16
    0.25822244   2    1000035    15
    0.10779507   2    1000022    15
    0.074046835   2    1000025    15
    0.038309233   2    1000023    15
    0.0020715012   2   -1000024    16

DECAY 2000015  17.491761
    0.47704027   2    1000022    15
    0.37877543   2    1000025    15
    0.093784136   2   -1000024    16
    0.047774361   2    1000023    15
    0.00096277024   2    1000016   -24
    0.00050871937   2    1000015    25
    0.00047654034   2    1000015    23
    0.00045104096   2   -1000037    16
    0.00022672856   2    1000035    15

DECAY 1000012  2.2750622
    0.34536029   2    1000022    12
    0.31232474   2    1000025    12
    0.1952735   2    1000037    11
    0.098480765   2    1000035    12
    0.042403766   2    1000024    11
    0.0061569404   2    1000023    12

DECAY 1000014  2.2750621
    0.34536031   2    1000022    14
    0.31232476   2    1000025    14
    0.19527346   2    1000037    13
    0.098480771   2    1000035    14
    0.042403767   2    1000024    13
    0.0061569407   2    1000023    14

DECAY 1000016  20.864362
    0.51425573   2    1000037    15
    0.25878744   2    1000035    16
    0.077963872   2    1000024    15
    0.075870036   2    1000022    16
    0.071742508   2    1000025    16
    0.0013804137   2    1000023    16

DECAY 1000024  1.0639662e-05
    0.33404352   3    1000022    2   -1
    0.33404352   3    1000022    4   -3
    0.11131336   3    1000022   -11    12
    0.11131336   3    1000022   -13    14
    0.1092862   3    1000022   -15    16
    1.9886462e-08   3    1000023    2   -1
    6.6290154e-09   3    1000023   -11    12
    6.6290154e-09   3    1000023   -13    14

DECAY 1000037  10.729671
    0.25453716   2    1000024    23
    0.24966434   2    1000024    25
    0.24794644   2    1000023    24
    0.13219125   2    1000025    24
    0.11566082   2    1000022    24

DECAY 1000022 -1


DECAY 1000023  7.3163329e-06
    0.15660917   3    1000022   -1    1
    0.15660917   3    1000022   -3    3
    0.12078812   3    1000022   -5    5
    0.12062467   3    1000022   -2    2
    0.12062467   3    1000022   -4    4
    0.071986081   3    1000022   -16    16
    0.071975047   3    1000022   -12    12
    0.071975047   3    1000022   -14    14
    0.03598314   3    1000022   -11    11
    0.03598314   3    1000022   -13    13
    0.035157053   3    1000022   -15    15
    0.0016846823   2    1000022    22

DECAY 1000025  4.9116351e-05
    0.11040189   3    1000024   -2    1
    0.11040189   3   -1000024   -1    2
    0.11040189   3    1000024   -4    3
    0.11040189   3   -1000024   -3    4
    0.048050837   3    1000023   -1    1
    0.048050837   3    1000023   -3    3
    0.038781905   3    1000023   -5    5
    0.037007567   3    1000023   -2    2
    0.037007567   3    1000023   -4    4
    0.036810806   3    1000024   -12    11
    0.036810806   3   -1000024    12   -11
    0.036810806   3    1000024   -14    13
    0.036810806   3   -1000024    14   -13
    0.036170315   3    1000024   -16    15
    0.036170315   3   -1000024    16   -15
    0.025442318   2    1000022    22
    0.02209282   3    1000023   -12    12
    0.02209282   3    1000023   -14    14
    0.022089825   3    1000023   -16    16
    0.011050283   3    1000023   -11    11
    0.011050283   3    1000023   -13    13
    0.010829398   3    1000023   -15    15
    0.0046848027   2    1000023    22
    8.3727661e-05   3    1000022   -5    5
    8.3725564e-05   3    1000022   -1    1
    8.3725564e-05   3    1000022   -3    3
    7.3854698e-05   3    1000022   -2    2
    7.3854698e-05   3    1000022   -4    4
    5.1369257e-05   3    1000022   -12    12
    5.1369257e-05   3    1000022   -14    14
    4.2987253e-05   3    1000022   -16    16
    1.4674442e-05   3    1000022   -15    15
    9.0224272e-06   3    1000022   -11    11
    9.0224272e-06   3    1000022   -13    13

DECAY 1000035  10.724883
    0.24928941   2    1000024   -24
    0.24928941   2   -1000024    24
    0.21552924   2    1000023    25
    0.11832278   2    1000025    23
    0.10053427   2    1000022    23
    0.034377815   2    1000023    23
    0.016886648   2    1000022    25
    0.015770418   2    1000025    25

DECAY 25  0.0043052886
    0.55911475   2    5   -5
    0.24499405   2    24   -24
    0.077877728   2    21    21
    0.061432631   2   -15    15
    0.031609956   2    23    23
    0.020419119   2    4   -4
    0.0023508369   2    22    22
    0.0017468897   2    22    23
    0.00023660644   2    3   -3
    0.00021743394   2   -13    13

DECAY 35  40.1054
    0.2630348   2    5   -5
    0.1974665   2    1000024   -1000037
    0.1974665   2    1000037   -1000024
    0.070710873   2    1000025    1000035
    0.069772332   2    1000023    1000035
    0.057776045   2    1000022    1000035
    0.044830919   2   -15    15
    0.024193602   2    1000022    1000023
    0.022108615   2    1000025    1000025
    0.020853716   2    1000022    1000022
    0.014550287   2    1000023    1000025
    0.010564526   2    6   -6
    0.0053717299   2    1000024   -1000024
    0.00076072715   2    1000023    1000023
    0.00015669454   2   -13    13
    0.00012509971   2    1000037   -1000037
    0.00010613482   2    3   -3
    6.3007628e-05   2    1000035    1000035
    5.7760493e-05   2    1000022    1000025
    1.8267761e-05   2    25    25
    5.0090947e-06   2    24   -24
    2.4990736e-06   2    23    23
    2.2314737e-06   2    21    21
    7.1410759e-07   2    1000012   -1000012
    7.1410759e-07   2    1000014   -1000014
    2.1536353e-07   2    1000011   -1000011
    2.1536353e-07   2    1000013   -1000013
    1.0747093e-07   2    4   -4
    9.6948074e-08   2    22    22
    2.8283877e-08   2    2000001   -2000001
    2.8283877e-08   2    2000003   -2000003
    4.1976842e-09   2    23    22

DECAY 36  40.099847
    0.26309926   2    5   -5
    0.1964004   2    1000024   -1000037
    0.1964004   2    1000037   -1000024
    0.1276737   2    1000023    1000035
    0.044837643   2   -15    15
    0.037765008   2    1000025    1000035
    0.032118944   2    1000022    1000035
    0.026214598   2    1000022    1000023
    0.019711532   2    1000025    1000025
    0.018612214   2    1000022    1000022
    0.017195226   2    1000023    1000025
    0.010601845   2    6   -6
    0.006704884   2    1000024   -1000024
    0.0010827861   2    1000023    1000023
    0.00083665873   2    1000037   -1000037
    0.00041998701   2    1000035    1000035
    0.00015671784   2   -13    13
    0.00010617635   2    3   -3
    3.232342e-05   2    1000022    1000025
    2.4335443e-05   2    21    21
    5.0751183e-06   2    23    25
    1.6122841e-07   2    22    22
    1.0793052e-07   2    4   -4
    2.3487936e-08   2    23    22

DECAY 37  40.041356
    0.27255724   2    6   -5
    0.20105143   2    1000037    1000023
    0.19871724   2    1000024    1000035
    0.10838951   2    1000037    1000025
    0.089849244   2    1000037    1000022
    0.05783152   2    1000024    1000022
    0.044921426   2   -15    16
    0.025360593   2    1000024    1000025
    0.00060221698   2    1000024    1000023
    0.00044123834   2    4   -5
    0.00015701068   2   -13    14
    0.00010479582   2    4   -3
    5.318903e-06   2    2   -3
    5.0918587e-06   2    24    25
    4.4123766e-06   2    2   -5
    8.5745859e-07   2   -1000011    1000012
    8.5745859e-07   2   -1000013    1000014
    9.5342329e-10   2    1000037    1000035
    9.4989726e-14   2    24    36

DECAY 5 -1


DECAY 15 -1


DECAY 23  2.4952


DECAY 24  2.085
