BLOCK SPINFO
   1   SPheno
   2   v4.0.5be

BLOCK SPHENOINFO
   1   2
   2   2

BLOCK MODSEL
   1   0

BLOCK MINPAR
   3    45.148922
   4   -1

BLOCK EXTPAR
   0    1245.3852
   1   -236.11801
   2   -849.44929
   3    3000
   11   -3454.1723
   12   -848.6006
   13    1641.1615
   23   -285.79232
   25    44.542884
   26    1084.9481
   31    1845.7268
   32    1845.7268
   33    683.6257
   34    1919.2569
   35    1919.2569
   36    1962.3638
   41    5000
   42    5000
   43    1533.4642
   44    5000
   45    5000
   46    1203.626
   47    5000
   48    5000
   49    1257.8845

BLOCK SMINPUTS
   1    127.90897
   2    1.1663787e-05
   3    0.1184
   4    91.1876
   5    4.18
   6    173.2
   7    1.777
   8    0
   11    0.00051099893
   12    0
   13    0.10565837
   14    0
   21    0.005
   22    0.0025
   23    0.095
   24    1.27

BLOCK GAUGE Q=  1245.3852
   1    0.35536298
   2    0.66519887
   3    1.219778

BLOCK YU Q=  1245.3852
   1   1    8.3864848e-06
   2   2    0.0042603343
   3   3    1.0131547

BLOCK YD Q=  1245.3852
   1   1    0.00075065183
   2   2    0.014262385
   3   3    0.74441139

BLOCK YE Q=  1245.3852
   1   1    0.00013099423
   2   2    0.027085453
   3   3    0.45553276

BLOCK AU Q=  1245.3852
   1   1    0
   2   2    0
   3   3   -3454.1722

BLOCK AD Q=  1245.3852
   1   1    0
   2   2    0
   3   3   -848.60055

BLOCK AE Q=  1245.3852
   1   1    0
   2   2    0
   3   3    1641.1615

BLOCK MSOFT Q=  1245.3852
   1   -236.11801
   2   -849.44929
   3    3000
   21    1130045.7
   22   -60929.079
   31    1845.7268
   32    1845.7268
   33    683.6257
   34    1919.2569
   35    1919.2569
   36    1962.3638
   41    5000
   42    5000
   43    1533.4642
   44    5000
   45    5000
   46    1203.626
   47    5000
   48    5000
   49    1257.8845

BLOCK MASS
   6    173.2
   23    91.1876
   24    80.429995
   15    1.777
   25    123.54125
   35    1084.7613
   36    1084.9481
   37    1089.5192
   1000001    5019.4172
   2000001    5009.7137
   1000002    5018.9825
   2000002    5010.9954
   1000003    5019.4239
   2000003    5009.7249
   1000004    5018.9889
   2000004    5010.9964
   1000005    1212.4404
   2000005    1466.2183
   1000006    1007.6896
   2000006    1539.149
   1000011    1850.4893
   2000011    1921.734
   1000012    1848.441
   1000013    1850.4774
   2000013    1921.716
   1000014    1848.4308
   1000015    691.92491
   2000015    1954.8032
   1000016    687.14933
   1000021    3173.1387
   1000022   -222.23764
   1000023    293.9728
   1000025   -301.26438
   1000035   -895.49747
   1000024    287.41369
   1000037    895.63017

BLOCK ALPHA
      -0.022596424

BLOCK HMIX Q=  1245.3852
   1   -285.79232
   2    44.542884
   3    244.15997
   4    1177112.3

BLOCK STOPMIX
   1   1    0.38664354
   1   2    0.92222924
   2   1   -0.92222924
   2   2    0.38664354

BLOCK SBOTMIX
   1   1   -0.040896028
   1   2    0.99916341
   2   1   -0.99916341
   2   2   -0.040896028

BLOCK STAUMIX
   1   1   -0.99996989
   1   2    0.0077605378
   2   1   -0.0077605378
   2   2   -0.99996989

BLOCK NMIX
   1   1    0.88925979
   1   2   -0.034115376
   1   3   -0.36023616
   1   4    0.27979113
   2   1    0.058458868
   2   2   -0.047035027
   2   3    0.70020338
   2   4    0.70998978
   3   1    0.45359577
   3   2    0.088517688
   3   3    0.61545706
   3   4   -0.6384576
   4   1    0.0071041385
   4   2   -0.99437843
   4   3    0.034025621
   4   4   -0.10001661

BLOCK UMIX
   1   1   -0.048160394
   1   2   -0.99883961
   2   1   -0.99883961
   2   2    0.048160394

BLOCK VMIX
   1   1    0.14146324
   1   2    0.98994351
   2   1    0.98994351
   2   2   -0.14146324

BLOCK HIGGSBOUNDSINPUTHIGGSCOUPLINGSFERMIONS
       0, 1984.0685,3,36,15,15

BLOCK HIGGSBOUNDSINPUTHIGGSCOUPLINGSBOSONS
       0,4,36,21,21,23

BLOCK SPHENOLOWENERGY
   1    0.0004361599
   2    1.5912386e-06
   3    3.521656e-05
   4    2.4944413e-15
   5    1.0638403e-10
   6    1.2069292e-08
   7    8.3958871e-14
   8    3.5809879e-09
   9    4.2227799e-07
   10    8.4798761e-05
   11    0.87593874
   12    0.54337745
   13    19.326094
   14    0
   15    0
   16    0.0021674645
   17    2.2817723e-15
   18    2.4796866e-11
   19    8.2887353e-11
   20    6.7346816e-15
   21    2.8792542e-10
   22    1.8278909e-07
   23    0
   24    0
   25    0
   26    0
   27    0
   28    0
   29    0
   30    0
   31    0
   39    8.4447216e-05
   40    0
   41    0
   42    0

BLOCK FWCOEF Q=  160
   305   4422   0   0   -0.18881911
   305   4422   0   2   -0.31142004
   305   4322   0   2   -0.0010933366
   305   6421   0   0   -0.095227835
   305   6421   0   2   -0.17613871
   305   6321   0   2   -0.00088866953
   3051111   4133   0   0    1.585778
   3051111   4133   0   2    1.5870048
   3051111   4233   0   2    0.0001025667
   3051111   4137   0   0   -4.4084701
   3051111   4137   0   2   -4.4032784
   3051111   4237   0   2   -0.00080212052
   3051313   4133   0   0    1.585778
   3051313   4133   0   2    1.5870014
   3051313   4233   0   2    0.00010254936
   3051313   4137   0   0   -4.4084701
   3051313   4137   0   2   -4.4032818
   3051313   4237   0   2   -0.00080210787
   3051212   4137   0   0    1.5053501
   3051212   4137   0   2    1.504226
   3051212   4237   0   2    0.00017505172
   3051414   4137   0   0    1.5053501
   3051414   4137   0   2    1.504226
   3051414   4237   0   2    0.00017505526
   3051616   4137   0   0    1.5053501
   3051616   4137   0   2    1.5042259
   3051616   4237   0   2    0.00017605115

BLOCK IMFWCOEF Q=  160
   305   4422   0   0    3.8573545e-07
   305   4422   0   2    2.2545747e-05
   305   4322   0   2   -9.2604576e-06
   305   6421   0   0    3.3040792e-07
   305   6421   0   2    2.0593793e-05
   305   6321   0   2   -3.6759647e-06
   3051111   4133   0   2   -3.127742e-06
   3051111   4233   0   2    5.7759035e-06
   3051111   4137   0   2    2.6357329e-05
   3051111   4237   0   2   -4.5373859e-05
   3051313   4133   0   2   -3.1277167e-06
   3051313   4233   0   2    5.775884e-06
   3051313   4137   0   2    2.6357379e-05
   3051313   4237   0   2   -4.5373923e-05
   3051212   4137   0   2   -5.5803972e-06
   3051212   4237   0   2    9.9024718e-06
   3051414   4137   0   2   -5.580397e-06
   3051414   4237   0   2    9.9024718e-06
   3051616   4137   0   2   -5.5826162e-06
   3051616   4237   0   2    9.9024503e-06

DECAY 23  2.4952


DECAY 24  2.085


DECAY 1000011  16.638137
    0.57276659   2   -1000037    12
    0.28171946   2    1000035    11
    0.092456178   2    1000022    11
    0.050778916   2    1000025    11
    0.0021626425   2   -1000024    12
    0.0001162099   2    1000023    11

DECAY 2000011  9.3549762
    0.79454383   2    1000022    11
    0.20205989   2    1000025    11
    0.0033642867   2    1000023    11

DECAY 1000013  16.663616
    0.57188266   2   -1000037    14
    0.28128571   2    1000035    13
    0.092518359   2    1000022    13
    0.051282915   2    1000025    13
    0.0021593205   2   -1000024    14
    0.0008710304   2    1000023    13

DECAY 2000013  9.4084507
    0.79039711   2    1000022    13
    0.2019832   2    1000025    13
    0.0047389967   2    1000023    13
    0.0028425974   2   -1000024    14

DECAY 1000015  2.6599566
    0.35310593   2    1000023    15
    0.34922508   2    1000025    15
    0.29318687   2    1000022    15
    0.0044821279   2   -1000024    16

DECAY 2000015  29.966081
    0.28584836   2    1000022    15
    0.25689183   2   -1000024    16
    0.16183628   2    1000025    15
    0.12741963   2    1000023    15
    0.076823475   2    1000016   -37
    0.038440995   2    1000015    35
    0.038432753   2    1000015    36
    0.0068258536   2    1000016   -24
    0.003385236   2    1000015    23
    0.0031939096   2    1000015    25
    0.0005947058   2   -1000037    16
    0.00030697017   2    1000035    15

DECAY 1000012  16.673997
    0.56001751   2    1000037    11
    0.28473569   2    1000035    12
    0.12287349   2    1000022    12
    0.018596411   2    1000024    11
    0.010937331   2    1000025    12
    0.0028395651   2    1000023    12

DECAY 1000014  16.699473
    0.55915864   2    1000037    13
    0.28429781   2    1000035    14
    0.12268532   2    1000022    14
    0.020102442   2    1000024    13
    0.010920578   2    1000025    14
    0.0028352158   2    1000023    14

DECAY 1000016  2.6945125
    0.74476935   2    1000024    15
    0.23331591   2    1000022    16
    0.017325659   2    1000025    16
    0.0045890801   2    1000023    16

DECAY 2000001  144.57503
    0.98074306   2    1000021    1
    0.015238049   2    1000022    1
    0.0039517443   2    1000025    1

DECAY 1000001  205.64296
    0.69441642   2    1000021    1
    0.20093697   2   -1000037    2
    0.099828496   2    1000035    1
    0.0039642752   2    1000022    1
    0.00049510822   2   -1000024    2
    0.00035223048   2    1000023    1

DECAY 2000003  144.61636
    0.98047079   2    1000021    3
    0.015251802   2    1000022    3
    0.0040031907   2    1000025    3
    0.00013894365   2   -1000024    4
    0.00013389797   2    1000023    3

DECAY 1000003  205.66567
    0.69434312   2    1000021    3
    0.20091526   2   -1000037    4
    0.099817726   2    1000035    3
    0.0039765758   2    1000022    3
    0.00050362971   2   -1000024    4
    0.00040014919   2    1000023    3

DECAY 1000005  23.844507
    0.47402015   2   -1000024    6
    0.24216744   2    1000023    5
    0.18955331   2    1000025    5
    0.093949391   2    1000022    5
    0.00029184831   2    1000006   -24

DECAY 2000005  94.259545
    0.47527312   2    1000006   -24
    0.27868291   2   -1000024    6
    0.07808907   2    1000023    5
    0.060357237   2    1000025    5
    0.057399085   2   -1000037    6
    0.026814262   2    1000035    5
    0.022131374   2    1000022    5
    0.00076569284   2    1000005    25
    0.00048725212   2    1000005    23

DECAY 2000002  153.06316
    0.92722795   2    1000021    2
    0.057586737   2    1000022    2
    0.014933723   2    1000025    2
    0.00024813133   2    1000023    2

DECAY 1000002  205.63997
    0.69420622   2    1000021    2
    0.19735717   2    1000037    1
    0.099313482   2    1000035    2
    0.0042717222   2    1000024    1
    0.0030566405   2    1000025    2
    0.0016516477   2    1000022    2
    0.00014311422   2    1000023    2

DECAY 2000004  153.0668
    0.92720622   2    1000021    4
    0.057586304   2    1000022    4
    0.014938134   2    1000025    4
    0.00025404589   2    1000023    4

DECAY 1000004  205.66258
    0.69413285   2    1000021    4
    0.19733598   2    1000037    3
    0.099302756   2    1000035    4
    0.0043688648   2    1000024    3
    0.0030598812   2    1000025    4
    0.0016521535   2    1000022    4
    0.00014751191   2    1000023    4

DECAY 1000006  30.567803
    0.4834801   2    1000024    5
    0.23502398   2    1000023    6
    0.2127674   2    1000025    6
    0.064236345   2    1000022    6
    0.0043417942   2    1000037    5
    0.00012298881   2    1000022    4

DECAY 2000006  106.45674
    0.26371458   2    1000006    23
    0.20310971   2    1000006    25
    0.18612972   2    1000024    5
    0.14404253   2    1000023    6
    0.1061098   2    1000025    6
    0.0392995   2    1000022    6
    0.038480809   2    1000037    5
    0.017466186   2    1000035    6
    0.0016471747   2    1000005    24

DECAY 1000024  0.0018863395
    0.33347002   3    1000022   -1    2
    0.33306962   3    1000022   -3    4
    0.11117022   3    1000022   -11    12
    0.11116976   3    1000022   -13    14
    0.11112039   3    1000022   -15    16

DECAY 1000037  9.0211948
    0.2134142   2    1000023    24
    0.21105037   2    1000024    23
    0.20591476   2    1000024    25
    0.19574263   2    1000025    24
    0.072499974   2    1000016   -15
    0.070820303   2   -1000015    16
    0.022942944   2    1000022    24
    0.0027394731   3    1000023   -5    6
    0.0023332992   3    1000025   -5    6
    0.0017569481   3    1000024    6   -6
    0.00038874063   3    1000024    5   -5
    0.0003643041   3    1000022   -5    6

DECAY 1000022 -1


DECAY 1000023  0.0021475989
    0.20360929   3    1000022    12   -12
    0.15214266   3    1000022    1   -1
    0.15214073   3    1000022    3   -3
    0.14957651   3    1000022    5   -5
    0.11865932   3    1000022    2   -2
    0.11830086   3    1000022    4   -4
    0.034473946   3    1000022    15   -15
    0.03432717   3    1000022    11   -11
    0.034326705   3    1000022    13   -13
    0.00242877   2    1000022    22

DECAY 1000025  4.8119558e-05
    0.18812417   3    1000022    12   -12
    0.14912726   3    1000022    5   -5
    0.13895759   3    1000022    1   -1
    0.13895719   3    1000022    3   -3
    0.10846511   3    1000022    2   -2
    0.10830187   3    1000022    4   -4
    0.031773529   3    1000022    15   -15
    0.030609733   3    1000022    13   -13
    0.030607484   3    1000022    11   -11
    0.011605478   3    1000024    1   -2
    0.011605478   3   -1000024   -1    2
    0.011139558   3    1000024    3   -4
    0.011139558   3   -1000024   -3    4
    0.0048540762   2    1000022    22
    0.0038684152   3    1000024    11   -12
    0.0038684152   3   -1000024   -11    12
    0.0038673251   3    1000024    13   -14
    0.0038673251   3   -1000024   -13    14
    0.0035785639   3    1000024    15   -16
    0.0035785639   3   -1000024   -15    16
    0.0012141938   2    1000023    22
    0.00022973035   3    1000023    12   -12
    0.00017182064   3    1000023    1   -1
    0.00017148154   3    1000023    3   -3
    0.00013400454   3    1000023    2   -2

DECAY 1000035  10.195064
    0.19453438   2    1000024   -24
    0.19453438   2   -1000024    24
    0.15687204   2    1000023    23
    0.13742051   2    1000023    25
    0.13091975   2    1000025    25
    0.032564885   2    1000016   -16
    0.032564885   2   -1000016    16
    0.031570836   2    1000025    23
    0.030838634   2    1000015   -15
    0.030838634   2   -1000015    15
    0.015194084   2    1000022    25
    0.0049803605   2    1000022    23
    0.003020183   3    1000024    5   -6
    0.003020183   3   -1000024   -5    6
    0.00041305469   3    1000023    6   -6
    0.00035724008   3    1000025    6   -6

DECAY 1000021  260.98323
    0.13282422   2    1000006   -6
    0.13282422   2   -1000006    6
    0.13127033   2    1000005   -5
    0.13127033   2   -1000005    5
    0.11562037   2    2000006   -6
    0.11562037   2   -2000006    6
    0.1112768   2    2000005   -5
    0.1112768   2   -2000005    5
    0.0088267853   2    1000006   -4
    0.0088267853   2   -1000006    4
    0.00018218455   3    1000035    6   -6

DECAY 25  0.0037793122
    0.60352069   2   -5    5
    0.20072647   2   -24    24
    0.069946795   2    21    21
    0.069346415   2   -15    15
    0.028736798   2   -4    4
    0.023598655   2    23    23
    0.0023102798   2    22    22
    0.0013466804   2    22    23
    0.00024006685   2   -13    13
    0.00022637332   2   -3    3
    6.2589952e-07   2   -1    1
    1.4809181e-07   2   -2    2
    5.3969888e-09   2   -11    11

DECAY 35  36.660135
    0.82970071   2   -5    5
    0.13794166   2   -15    15
    0.012050829   2    1000022    1000023
    0.0062524272   2    1000022    1000022
    0.0051081425   2    1000022    1000025
    0.0033178895   2   -1000024    1000024
    0.0025538285   2    1000023    1000025
    0.0012216414   2    1000025    1000025
    0.00056754486   2   -6    6
    0.00047190732   2    1000023    1000023
    0.00044503493   2   -13    13
    0.00030298761   2   -3    3
    4.0888844e-05   2    21    21
    1.0067466e-05   2    1000022    1000035
    9.9867887e-06   2    25    25
    1.8847365e-06   2   -24    24
    1.5422864e-06   2    23    23
    8.3773492e-07   2   -1    1
    1.0291852e-07   2    22    23
    7.1687198e-08   2    22    22
    9.9983689e-09   2   -11    11
    6.5786348e-09   2   -4    4
    3.391618e-14   2   -2    2

DECAY 36  35.631949
    0.82663423   2   -5    5
    0.13743627   2   -15    15
    0.0087121533   2    1000022    1000023
    0.0082868876   2    1000022    1000022
    0.0074698287   2    1000022    1000025
    0.0048353596   2   -1000024    1000024
    0.0019642942   2    1000025    1000025
    0.0017985514   2    1000023    1000025
    0.00080121234   2    1000022    1000035
    0.0006290221   2   -6    6
    0.000621333   2    1000023    1000023
    0.00044337448   2   -13    13
    0.00030184744   2   -3    3
    6.223547e-05   2    21    21
    2.2513843e-06   2    23    25
    8.3458189e-07   2   -1    1
    1.8977707e-07   2    22    22
    1.043746e-07   2    22    23
    9.9610599e-09   2   -11    11
    6.5292301e-09   2   -4    4
    3.3657016e-14   2   -2    2
    2.8271911e-37   2    25    25

DECAY 37  31.97151
    0.82457827   2   -5    6
    0.13891838   2   -15    16
    0.023630867   2    1000022    1000024
    0.0089659879   2    1000024    1000025
    0.0012896208   2    1000022    1000037
    0.0012616433   2   -5    4
    0.0005196947   2    1000023    1000024
    0.00049112832   2   -13    14
    0.00031581092   2   -3    4
    1.4605575e-05   2   -3    2
    9.0094569e-06   2   -5    2
    2.5548181e-06   2    24    25
    1.449936e-06   2   -3    6
    8.7655146e-07   2   -1    2
    4.6248093e-08   2   -1    6
    4.0862728e-08   2   -1    4
    1.1487543e-08   2   -11    12
    1.0340287e-10   2    24    35
    8.464475e-11   2    24    36

DECAY 6  2.43
    1   2    5    24

DECAY 15 -1
