BLOCK SPINFO
   1   SPheno
   2   v4.0.5be

BLOCK SPHENOINFO
   1   2
   2   2

BLOCK MODSEL
   1   0

BLOCK MINPAR
   3    33.181597
   4   -1

BLOCK EXTPAR
   0    1377.7573
   1   -1017.8404
   2    1788.6558
   3    3000
   11   -2881.6872
   12    452.30767
   13    354.00256
   23   -132.98883
   25    32.324048
   26    1889.7221
   31    863.24051
   32    863.24051
   33    916.6514
   34    303.00914
   35    303.00914
   36    1949.7092
   41    5000
   42    5000
   43    1994.2686
   44    5000
   45    5000
   46    1034.179
   47    5000
   48    5000
   49    1734.7634

BLOCK SMINPUTS
   1    127.90897
   2    1.1663787e-05
   3    0.1184
   4    91.1876
   5    4.18
   6    173.2
   7    1.777
   8    0
   11    0.00051099893
   12    0
   13    0.10565837
   14    0
   21    0.005
   22    0.0025
   23    0.095
   24    1.27

BLOCK GAUGE Q=  1377.7573
   1    0.35536298
   2    0.66519887
   3    1.219778

BLOCK YU Q=  1377.7573
   1   1    8.3883834e-06
   2   2    0.0042612988
   3   3    1.0133841

BLOCK YD Q=  1377.7573
   1   1    0.00054485918
   2   2    0.010352324
   3   3    0.54032957

BLOCK YE Q=  1377.7573
   1   1    9.5081911e-05
   2   2    0.019659923
   3   3    0.33064757

BLOCK AU Q=  1377.7573
   1   1    0
   2   2    0
   3   3   -2881.6872

BLOCK AD Q=  1377.7573
   1   1    0
   2   2    0
   3   3    452.30767

BLOCK AE Q=  1377.7573
   1   1    0
   2   2    0
   3   3    354.00256

BLOCK MSOFT Q=  1377.7573
   1   -1017.8404
   2    1788.6558
   3    3000
   21    3553212.5
   22   -20714.895
   31    863.24051
   32    863.24051
   33    916.6514
   34    303.00914
   35    303.00914
   36    1949.7092
   41    5000
   42    5000
   43    1994.2686
   44    5000
   45    5000
   46    1034.179
   47    5000
   48    5000
   49    1734.7634

BLOCK MASS
   6    173.2
   23    91.1876
   24    80.429995
   15    1.777
   25    122.44249
   35    1889.6267
   36    1889.7221
   37    1891.9968
   1000001    5020.8901
   2000001    5013.8674
   1000002    5020.4477
   2000002    5014.7652
   1000003    5020.8932
   2000003    5013.8725
   1000004    5020.4508
   2000004    5014.7662
   1000005    1743.0713
   2000005    1994.9316
   1000006    942.95892
   2000006    2013.0411
   1000011    878.94151
   2000011    322.40827
   1000012    874.97082
   1000013    878.93574
   2000013    322.38174
   1000014    874.96489
   1000015    929.93329
   2000015    1950.3634
   1000016    926.15513
   1000021    3183.6587
   1000022    136.37783
   1000023   -138.30864
   1000025   -1014.5842
   1000035    1833.0249
   1000024    138.47883
   1000037    1833.1723

BLOCK ALPHA
      -0.030321957

BLOCK HMIX Q=  1377.7573
   1   -132.98883
   2    32.324048
   3    244.08839
   4    3571049.4

BLOCK STOPMIX
   1   1    0.13443253
   1   2    0.99092275
   2   1   -0.99092275
   2   2    0.13443253

BLOCK SBOTMIX
   1   1   -0.011943078
   1   2    0.99992868
   2   1   -0.99992868
   2   2   -0.011943078

BLOCK STAUMIX
   1   1   -0.99999624
   1   2    0.0027407698
   2   1   -0.0027407698
   2   2   -0.99999624

BLOCK NMIX
   1   1   -0.026511479
   1   2   -0.031968945
   1   3   -0.709673
   1   4   -0.70330602
   2   1    0.037229159
   2   2    0.029555167
   2   3   -0.70448969
   2   4    0.70812058
   3   1   -0.99895479
   3   2    0.0012668024
   3   3   -0.0074195633
   3   4    0.045085259
   4   1    0.00068302785
   4   2   -0.99905099
   4   3    0.0018585514
   4   4    0.04351098

BLOCK UMIX
   1   1   -0.0026379764
   1   2   -0.99999652
   2   1    0.99999652
   2   2   -0.0026379764

BLOCK VMIX
   1   1   -0.061584507
   1   2    0.99810187
   2   1    0.99810187
   2   2    0.061584507

BLOCK HIGGSBOUNDSINPUTHIGGSCOUPLINGSFERMIONS
       0, 1044.8441,3,36,15,15

BLOCK HIGGSBOUNDSINPUTHIGGSCOUPLINGSBOSONS
       0,4,36,21,21,23

BLOCK SPHENOLOWENERGY
   1    0.00038110618
   2    1.5889852e-06
   3    3.5271048e-05
   4    1.6695912e-15
   5    7.1321561e-11
   6    1.4843866e-08
   7    5.612481e-14
   8    2.3976008e-09
   9    5.0562671e-07
   10    9.4977182e-05
   11    0.98107793
   12    0.54350356
   13    19.410841
   14    0
   15    0
   16    0.0021643055
   17    2.2817312e-15
   18    2.4802524e-11
   19    8.2914942e-11
   20   -3.4336743e-15
   21   -1.4677852e-10
   22   -5.110571e-08
   23    0
   24    0
   25    0
   26    0
   27    0
   28    0
   29    0
   30    0
   31    0
   39    7.4159941e-05
   40    0
   41    0
   42    0

BLOCK FWCOEF Q=  160
   305   4422   0   0   -0.18881911
   305   4422   0   2   -0.25682102
   305   4322   0   2   -0.00064272703
   305   6421   0   0   -0.095227835
   305   6421   0   2   -0.1367149
   305   6321   0   2   -0.00046861628
   3051111   4133   0   0    1.5890689
   3051111   4133   0   2    1.5912276
   3051111   4233   0   2    0.00010213799
   3051111   4137   0   0   -4.411761
   3051111   4137   0   2   -4.4119181
   3051111   4237   0   2   -0.00079726633
   3051313   4133   0   0    1.5890689
   3051313   4133   0   2    1.5912238
   3051313   4233   0   2    0.00010213673
   3051313   4137   0   0   -4.411761
   3051313   4137   0   2   -4.4119219
   3051313   4237   0   2   -0.00079726708
   3051212   4137   0   0    1.5053501
   3051212   4137   0   2    1.5053892
   3051212   4237   0   2    0.00017386996
   3051414   4137   0   0    1.5053501
   3051414   4137   0   2    1.5053892
   3051414   4237   0   2    0.00017387011
   3051616   4137   0   0    1.5053501
   3051616   4137   0   2    1.5053892
   3051616   4237   0   2    0.00017391346

BLOCK IMFWCOEF Q=  160
   305   4422   0   0    3.8580294e-07
   305   4422   0   2   -1.3606032e-05
   305   4322   0   2   -6.9552219e-06
   305   6421   0   0    3.3046573e-07
   305   6421   0   2    2.6055704e-06
   305   6321   0   2   -2.6624576e-06
   3051111   4133   0   2    2.7828771e-07
   3051111   4233   0   2    2.7838337e-06
   3051111   4137   0   2   -1.5466191e-06
   3051111   4237   0   2   -2.1754465e-05
   3051313   4133   0   2    2.7824591e-07
   3051313   4233   0   2    2.7838241e-06
   3051313   4137   0   2   -1.5466633e-06
   3051313   4237   0   2   -2.1754491e-05
   3051212   4137   0   2    4.0157018e-07
   3051212   4237   0   2    4.7442633e-06
   3051414   4137   0   2    4.0157003e-07
   3051414   4237   0   2    4.7442633e-06
   3051616   4137   0   2    4.0185305e-07
   3051616   4237   0   2    4.7442632e-06

DECAY 23  2.4952


DECAY 24  2.085


DECAY 2000011  0.0022626404
    0.66071869   2    1000023    11
    0.33926418   2    1000022    11

DECAY 1000011  0.016888015
    0.5326385   2    1000023    11
    0.4643278   2    1000022    11
    0.0030335237   2   -1000024    12

DECAY 2000013  0.0055792185
    0.41485486   2    1000023    13
    0.29683117   2   -1000024    14
    0.28831397   2    1000022    13

DECAY 1000013  0.023384755
    0.52106074   2    1000023    13
    0.47397249   2    1000022    13
    0.0027759725   2    2000013    25
    0.0021907359   2   -1000024    14

DECAY 1000015  1.9533337
    0.50372538   2    1000022    15
    0.49621047   2    1000023    15

DECAY 2000015  13.657277
    0.38095587   2    1000025    15
    0.30750207   2   -1000024    16
    0.15537366   2    1000022    15
    0.15361354   2    1000023    15
    0.0012765228   2    1000016   -24
    0.00064614513   2    1000015    25
    0.00063176184   2    1000015    23

DECAY 1000012  0.029286566
    0.94862712   2    1000024    11
    0.039691472   2    1000022    12
    0.011681404   2    1000023    12

DECAY 1000014  0.035685662
    0.95783954   2    1000024    13
    0.032573818   2    1000022    14
    0.0095866419   2    1000023    14

DECAY 1000016  1.9576435
    0.99918211   2    1000024    15
    0.00063189294   2    1000022    16
    0.00018599837   2    1000023    16

DECAY 2000001  143.53936
    0.98205944   2    1000021    1
    0.017899463   2    1000025    1

DECAY 1000001  192.15032
    0.737419   2    1000021    1
    0.17278368   2   -1000037    2
    0.086253808   2    1000035    1
    0.0033961359   2    1000025    1

DECAY 2000003  143.56117
    0.98191386   2    1000021    3
    0.017896768   2    1000025    3

DECAY 1000003  192.16315
    0.7373714   2    1000021    3
    0.17277233   2   -1000037    4
    0.086248131   2    1000035    3
    0.0033959141   2    1000025    3
    0.00011327444   2    1000022    3

DECAY 1000005  20.225172
    0.4843506   2   -1000024    6
    0.2491915   2    1000022    5
    0.24531884   2    1000023    5
    0.020979197   2    1000025    5
    0.00015986585   2    1000006   -24

DECAY 2000005  96.733306
    0.46791434   2    1000006   -24
    0.40942775   2   -1000024    6
    0.059800842   2    1000022    5
    0.058941514   2    1000023    5
    0.002196515   2    1000035    5
    0.001610241   2    1000025    5

DECAY 2000002  151.36026
    0.93193309   2    1000021    2
    0.067912569   2    1000025    2
    0.00010239206   2    1000023    2

DECAY 1000002  192.14271
    0.73720846   2    1000021    2
    0.17211189   2    1000037    1
    0.086202959   2    1000035    2
    0.0033005489   2    1000025    2
    0.00087119841   2    1000024    1
    0.00015458756   2    1000022    2
    0.00015035301   2    1000023    2

DECAY 2000004  151.36391
    0.93191085   2    1000021    4
    0.067910948   2    1000025    4
    0.00010838268   2    1000023    4

DECAY 1000004  192.15548
    0.73716079   2    1000021    4
    0.17210062   2    1000037    3
    0.086197325   2    1000035    4
    0.0033003508   2    1000025    4
    0.00092660899   2    1000024    3
    0.00015923829   2    1000022    4
    0.00015506786   2    1000023    4

DECAY 1000006  35.268714
    0.52016741   2    1000024    5
    0.24128557   2    1000023    6
    0.23855587   2    1000022    6

DECAY 2000006  105.93284
    0.28580079   2    1000006    25
    0.2183904   2    1000006    23
    0.19025389   2    1000023    6
    0.18744969   2    1000022    6
    0.11076104   2    1000024    5
    0.0048896876   2    1000037    5
    0.0016038847   2    1000025    6
    0.00075065341   2    1000035    6

DECAY 1000024  4.1185694e-12
    0.60323791   3    1000022   -1    2
    0.20109313   3    1000022   -11    12
    0.19551458   3    1000022   -13    14
    0.0001543885   3    1000022   -3    4

DECAY 1000037  44.346822
    0.10807891   2    1000014   -13
    0.10807804   2    1000012   -11
    0.10790806   2   -1000013    14
    0.10790721   2   -1000011    12
    0.10053595   2    1000016   -15
    0.10035101   2   -1000015    16
    0.088993455   2    1000024    25
    0.088709301   2    1000023    24
    0.087925717   2    1000024    23
    0.087443379   2    1000022    24
    0.0048326239   3    1000024    6   -6
    0.0040288864   3    1000023   -5    6
    0.0039399878   3    1000022   -5    6
    0.00057718299   3    1000024    5   -5
    0.00050138013   2    1000006   -5

DECAY 1000022 -1


DECAY 1000023  7.3689625e-10
    0.91459055   2    1000022    22
    0.025131   3    1000022    12   -12
    0.018791003   3    1000022    1   -1
    0.018271011   3    1000022    3   -3
    0.014656144   3    1000022    2   -2
    0.0042401058   3    1000022    11   -11
    0.0040574925   3    1000022    13   -13

DECAY 1000025  11.552248
    0.1779682   2    2000013   -13
    0.1779682   2   -2000013    13
    0.17796158   2    2000011   -11
    0.17796158   2   -2000011    11
    0.060881713   2    1000024   -24
    0.060881713   2   -1000024    24
    0.040066906   2    1000022    23
    0.036356585   2    1000023    25
    0.031735588   2    1000022    25
    0.020860828   2    1000023    23
    0.0036328041   2    1000014   -14
    0.0036328041   2   -1000014    14
    0.0036325187   2    1000012   -12
    0.0036325187   2   -1000012    12
    0.003410987   2    1000013   -13
    0.003410987   2   -1000013    13
    0.0034107207   2    1000011   -11
    0.0034107207   2   -1000011    11
    0.0015373019   2    1000016   -16
    0.0015373019   2   -1000016    16
    0.0014004143   2    1000015   -15
    0.0014004143   2   -1000015    15
    0.0011141438   3    1000024    5   -6
    0.0011141438   3   -1000024   -5    6
    0.00053677478   3    1000023    6   -6
    0.00052021775   3    1000022    6   -6

DECAY 1000035  44.85091
    0.087392825   2    1000024   -24
    0.087392825   2   -1000024    24
    0.054406307   2    1000023    25
    0.05356348   2    1000014   -14
    0.05356348   2   -1000014    14
    0.053563052   2    1000012   -12
    0.053563052   2   -1000012    12
    0.053198518   2    1000013   -13
    0.053198518   2   -1000013    13
    0.0531981   2    1000011   -11
    0.0531981   2   -1000011    11
    0.049824075   2    1000016   -16
    0.049824075   2   -1000016    16
    0.04947252   2    1000015   -15
    0.04947252   2   -1000015    15
    0.047432405   2    1000023    23
    0.047383897   2    1000022    25
    0.039439627   2    1000022    23
    0.0029662434   3    1000024    5   -6
    0.0029662434   3   -1000024   -5    6
    0.0018601197   3    1000023    6   -6
    0.0018208437   3    1000022    6   -6
    0.00029599312   3    1000022    5   -5
    0.00028435671   3    1000023    5   -5
    0.0002321706   2    1000006   -6
    0.0002321706   2   -1000006    6

DECAY 1000021  192.65147
    0.19697453   2    1000006   -6
    0.19697453   2   -1000006    6
    0.11993463   2    1000005   -5
    0.11993463   2   -1000005    5
    0.091721407   2    2000006   -6
    0.091721407   2   -2000006    6
    0.090209208   2    2000005   -5
    0.090209208   2   -2000005    5
    0.00053869797   2    1000006   -4
    0.00053869797   2   -1000006    4
    0.00043060978   3    1000037    5   -6
    0.00043060978   3   -1000037   -5    6
    0.00022587432   3    1000025    6   -6

DECAY 25  0.0035893149
    0.61321117   2   -5    5
    0.18739116   2   -24    24
    0.073427371   2    21    21
    0.070296112   2   -15    15
    0.030061093   2   -4    4
    0.021545808   2    23    23
    0.0023142847   2    22    22
    0.0012779513   2    22    23
    0.00024384183   2   -13    13
    0.00023040882   2   -3    3
    6.3705719e-07   2   -1    1
    1.5491991e-07   2   -2    2
    5.481869e-09   2   -11    11

DECAY 35  29.156327
    0.81816881   2   -5    5
    0.13847969   2   -15    15
    0.022189434   2    1000022    1000025
    0.015620526   2    1000023    1000025
    0.0024803244   2   -6    6
    0.0020864501   2   -1000024    1000024
    0.00048274799   2   -13    13
    0.00031636015   2   -3    3
    0.00010351483   2    1000022    1000022
    3.1584846e-05   2    1000023    1000023
    1.4420441e-05   2    21    21
    1.3139092e-05   2    25    25
    6.2316611e-06   2    1000022    1000023
    2.0953156e-06   2    23    23
    1.2051752e-06   2   -24    24
    8.7465734e-07   2   -1    1
    2.7270152e-07   2   -1000011    1000011
    2.708514e-07   2   -1000013    1000013
    1.7965947e-07   2   -2000011    2000011
    1.7873031e-07   2   -2000013    2000013
    4.7595395e-08   2   -1000015    1000015
    3.2740433e-08   2   -4    4
    2.059051e-08   2    22    22
    1.6471131e-08   2    22    23
    1.0843782e-08   2   -11    11
    8.5727182e-10   2   -2000013    1000013
    8.5727182e-10   2   -1000013    2000013
    1.6879823e-13   2   -2    2
    2.0051717e-14   2   -2000011    1000011
    2.0051717e-14   2   -1000011    2000011

DECAY 36  28.260009
    0.81700473   2   -5    5
    0.1382828   2   -15    15
    0.022633681   2    1000023    1000025
    0.016376898   2    1000022    1000025
    0.002534704   2   -6    6
    0.0021845502   2   -1000024    1000024
    0.00048206035   2   -13    13
    0.00031590533   2   -3    3
    9.6617702e-05   2    1000022    1000022
    3.7552603e-05   2    1000023    1000023
    3.6482806e-05   2    21    21
    1.0175417e-05   2    1000022    1000023
    2.8884038e-06   2    23    25
    8.734e-07   2   -1    1
    3.2241644e-08   2   -4    4
    1.7465734e-08   2    22    23
    1.5409503e-08   2    22    22
    1.0828363e-08   2   -11    11
    8.7799526e-10   2   -2000013    1000013
    8.7799526e-10   2   -1000013    2000013
    1.6624294e-13   2   -2    2
    2.0536399e-14   2   -2000011    1000011
    2.0536399e-14   2   -1000011    2000011
    1.5515448e-38   2    25    25

DECAY 37  28.351087
    0.81110148   2   -5    6
    0.14693999   2   -15    16
    0.038656098   2    1000024    1000025
    0.0012050207   2   -5    4
    0.00073124607   2    1000023    1000024
    0.00051948586   2   -13    14
    0.00051640426   2    1000022    1000024
    0.00029805795   2   -3    4
    1.3882721e-05   2   -3    2
    8.6050957e-06   2   -5    2
    3.9780053e-06   2   -3    6
    2.8942308e-06   2    24    25
    8.2703925e-07   2   -1    2
    7.3351894e-07   2   -2000011    1000012
    7.3216003e-07   2   -2000013    1000014
    3.470181e-07   2   -1000015    1000016
    1.6252566e-07   2   -1    6
    3.9913071e-08   2   -1    4
    1.2150828e-08   2   -11    12
    1.6857853e-09   2   -1000013    1000014
    3.5876122e-12   2    24    35
    2.922132e-12   2    24    36
    3.9429192e-14   2   -1000011    1000012

DECAY 6  2.43
    1   2    5    24

DECAY 15 -1
