BLOCK SPINFO
   1   SPheno
   2   v4.0.5be

BLOCK SPHENOINFO
   1   2
   2   2

BLOCK MODSEL
   1   0

BLOCK MINPAR
   3    27.130753
   4   -1

BLOCK EXTPAR
   0    1472.4032
   1   -211.84366
   2   -1809.089
   3    3000
   11   -2358.5258
   12    1537.2999
   13   -810.55961
   23   -1625.2086
   25    26.417228
   26    1705.7505
   31    1019.6857
   32    1019.6857
   33    1598.1039
   34    417.73103
   35    417.73103
   36    793.92433
   41    5000
   42    5000
   43    1571.0669
   44    5000
   45    5000
   46    1401.4284
   47    5000
   48    5000
   49    1549.6701

BLOCK SMINPUTS
   1    127.90897
   2    1.1663787e-05
   3    0.1184
   4    91.1876
   5    4.18
   6    173.2
   7    1.777
   8    0
   11    0.00051099893
   12    0
   13    0.10565837
   14    0
   21    0.005
   22    0.0025
   23    0.095
   24    1.27

BLOCK GAUGE Q=  1472.4032
   1    0.35536298
   2    0.66519887
   3    1.219778

BLOCK YU Q=  1472.4032
   1   1    8.3903771e-06
   2   2    0.0042623116
   3   3    1.013625

BLOCK YD Q=  1472.4032
   1   1    0.00044539873
   2   2    0.0084625758
   3   3    0.44169597

BLOCK YE Q=  1472.4032
   1   1    7.7725335e-05
   2   2    0.016071134
   3   3    0.27029004

BLOCK AU Q=  1472.4032
   1   1    0
   2   2    0
   3   3   -2358.5257

BLOCK AD Q=  1472.4032
   1   1    0
   2   2    0
   3   3    1537.2997

BLOCK AE Q=  1472.4032
   1   1    0
   2   2    0
   3   3   -810.55961

BLOCK MSOFT Q=  1472.4032
   1   -211.84366
   2   -1809.089
   3    3000
   21    281927.96
   22   -2609945.1
   31    1019.6857
   32    1019.6857
   33    1598.1039
   34    417.73103
   35    417.73103
   36    793.92433
   41    5000
   42    5000
   43    1571.0669
   44    5000
   45    5000
   46    1401.4284
   47    5000
   48    5000
   49    1549.6701

BLOCK MASS
   6    173.2
   23    91.1876
   24    80.429995
   15    1.777
   25    120.29186
   35    1705.595
   36    1705.7505
   37    1708.2721
   1000001    5023.2694
   2000001    5016.2136
   1000002    5022.821
   2000002    5017.1854
   1000003    5023.2772
   2000003    5016.2111
   1000004    5022.8231
   2000004    5017.1862
   1000005    1522.4317
   2000005    1609.6753
   1000006    1333.3509
   2000006    1625.957
   1000011    1033.836
   2000011    426.21598
   1000012    1030.4106
   1000013    1033.8412
   2000013    426.17268
   1000014    1030.4041
   1000015    795.38176
   2000015    1609.8293
   1000016    1606.5129
   1000021    3183.1512
   1000022   -210.73827
   1000023   -1608.0012
   1000025    1620.4642
   1000035   -1855.4752
   1000024    1607.8262
   1000037    1855.7005

BLOCK ALPHA
      -0.037268159

BLOCK HMIX Q=  1472.4032
   1   -1625.2086
   2    26.417228
   3    244.05582
   4    2909584.6

BLOCK STOPMIX
   1   1    0.41846219
   1   2    0.90823422
   2   1   -0.90823422
   2   2    0.41846219

BLOCK SBOTMIX
   1   1   -0.62467577
   1   2    0.78088423
   2   1   -0.78088423
   2   2   -0.62467577

BLOCK STAUMIX
   1   1   -0.038587742
   1   2    0.99925522
   2   1   -0.99925522
   2   2   -0.038587742

BLOCK NMIX
   1   1    0.99959464
   1   2   -0.00022954114
   1   3   -0.028100763
   1   4    0.0045654953
   2   1    0.022540528
   2   2    0.24038456
   2   3    0.68878264
   2   4   -0.68358296
   3   1    0.016632684
   3   2   -0.015420578
   3   3    0.7066743
   3   4    0.70717536
   4   1   -0.0050821025
   4   2    0.97055521
   4   3   -0.15937458
   4   4    0.180545

BLOCK UMIX
   1   1   -0.21822296
   1   2   -0.97589894
   2   1   -0.97589894
   2   2    0.21822296

BLOCK VMIX
   1   1    0.24841371
   1   2    0.96865403
   2   1    0.96865403
   2   2   -0.24841371

BLOCK HIGGSBOUNDSINPUTHIGGSCOUPLINGSFERMIONS
       0, 697.86994,3,36,15,15

BLOCK HIGGSBOUNDSINPUTHIGGSCOUPLINGSBOSONS
       0,4,36,21,21,23

BLOCK SPHENOLOWENERGY
   1    0.00035593064
   2    1.5869194e-06
   3    3.5239267e-05
   4    2.1750262e-15
   5    9.2913267e-11
   6    1.936785e-08
   7    7.3717918e-14
   8    3.1491827e-09
   9    6.6527953e-07
   10    9.4887271e-05
   11    0.98014919
   12    0.54295348
   13    19.388164
   14    0
   15    0
   16    0.0021630234
   17    2.2817179e-15
   18    2.4798512e-11
   19    8.2896953e-11
   20    6.3318507e-15
   21    2.7072981e-10
   22    3.3040399e-08
   23    0
   24    0
   25    0
   26    0
   27    0
   28    0
   29    0
   30    0
   31    0
   39    6.9722222e-05
   40    0
   41    0
   42    0

BLOCK FWCOEF Q=  160
   305   4422   0   0   -0.18881911
   305   4422   0   2   -0.22742847
   305   4322   0   2   -0.00045949047
   305   6421   0   0   -0.095227835
   305   6421   0   2   -0.12715194
   305   6321   0   2   -0.00043748369
   3051111   4133   0   0    1.5913089
   3051111   4133   0   2    1.5918629
   3051111   4233   0   2    5.3505213e-05
   3051111   4137   0   0   -4.414001
   3051111   4137   0   2   -4.4110383
   3051111   4237   0   2   -0.00041659973
   3051313   4133   0   0    1.5913089
   3051313   4133   0   2    1.5918612
   3051313   4233   0   2    5.3504606e-05
   3051313   4137   0   0   -4.414001
   3051313   4137   0   2   -4.4110401
   3051313   4237   0   2   -0.00041659963
   3051212   4137   0   0    1.5053501
   3051212   4137   0   2    1.5047074
   3051212   4237   0   2    9.0792354e-05
   3051414   4137   0   0    1.5053501
   3051414   4137   0   2    1.5047074
   3051414   4237   0   2    9.0792454e-05
   3051616   4137   0   0    1.5053501
   3051616   4137   0   2    1.5047077
   3051616   4237   0   2    9.0821356e-05

BLOCK IMFWCOEF Q=  160
   305   4422   0   0    3.8573846e-07
   305   4422   0   2    4.0651143e-06
   305   4322   0   2   -2.8465756e-06
   305   6421   0   0    3.304105e-07
   305   6421   0   2    1.261105e-05
   305   6321   0   2   -1.1436955e-06
   3051111   4133   0   2   -1.1659305e-06
   3051111   4233   0   2    1.7153293e-06
   3051111   4137   0   2    9.791806e-06
   3051111   4237   0   2   -1.3370117e-05
   3051313   4133   0   2   -1.1659175e-06
   3051313   4233   0   2    1.7153268e-06
   3051313   4137   0   2    9.7918166e-06
   3051313   4237   0   2   -1.3370124e-05
   3051212   4137   0   2   -2.0764252e-06
   3051212   4237   0   2    2.914042e-06
   3051414   4137   0   2   -2.0764253e-06
   3051414   4237   0   2    2.914042e-06
   3051616   4137   0   2   -2.0719125e-06
   3051616   4237   0   2    2.9140511e-06

DECAY 23  2.4952


DECAY 24  2.085


DECAY 2000011  1.2214743
    1   2    1000022    11

DECAY 1000011  1.1909909
    0.99999989   2    1000022    11

DECAY 2000013  1.221191
    1   2    1000022    13

DECAY 1000013  1.1963165
    0.99555712   2    1000022    13
    0.0044428804   2    2000013    25

DECAY 1000015  3.4511597
    1   2    1000022    15

DECAY 2000015  3.6989574
    0.52885927   2    1000022    15
    0.2412481   2    1000015    23
    0.22989074   2    1000015    25

DECAY 1000012  1.1884009
    1   2    1000022    12

DECAY 1000014  1.1883922
    1   2    1000022    14

DECAY 1000016  3.7271068
    0.52299995   2    1000022    16
    0.4768795   2    1000015    24

DECAY 2000001  144.05937
    0.98063139   2    1000021    1
    0.019355749   2    1000022    1

DECAY 1000001  192.36568
    0.73819726   2    1000021    1
    0.16325061   2   -1000037    2
    0.080890682   2    1000035    1
    0.0088188458   2   -1000024    2
    0.0051730882   2    1000023    1
    0.003638296   2    1000022    1

DECAY 2000003  144.07053
    0.98055353   2    1000021    3
    0.019354278   2    1000022    3

DECAY 1000003  192.37379
    0.73817031   2    1000021    3
    0.16324466   2   -1000037    4
    0.080888157   2    1000035    3
    0.0088255252   2   -1000024    4
    0.0051870777   2    1000023    3
    0.0036381775   2    1000022    3

DECAY 1000005  2.2075154
    0.69573521   2    1000006   -24
    0.30426479   2    1000022    5

DECAY 2000005  8.5759135
    0.95552093   2    1000006   -24
    0.044479072   2    1000022    5

DECAY 2000002  152.53327
    0.92681617   2    1000021    2
    0.073136067   2    1000022    2

DECAY 1000002  192.35302
    0.73800306   2    1000021    2
    0.16082287   2    1000037    1
    0.080583099   2    1000035    2
    0.011427127   2    1000024    1
    0.0055300393   2    1000023    2
    0.00361949   2    1000022    2

DECAY 2000004  152.5362
    0.92679852   2    1000021    4
    0.073134663   2    1000022    4

DECAY 1000004  192.36039
    0.73797559   2    1000021    4
    0.16081817   2    1000037    3
    0.080580215   2    1000035    4
    0.011455122   2    1000024    3
    0.0055334382   2    1000023    4
    0.0036193525   2    1000022    4

DECAY 1000006  2.2864542
    0.99909583   2    1000022    6
    0.00045081704   3    1000022    24    5
    0.00040839659   2    1000022    4

DECAY 2000006  11.80565
    0.53861152   2    1000006    23
    0.35715646   2    1000006    25
    0.066495491   2    1000022    6
    0.037260484   2    1000005    24
    0.00047603646   2    1000024    5

DECAY 1000024  5.5789825
    0.59060401   2    1000006   -5
    0.18688634   2    1000022    24
    0.11849117   2   -1000015    16
    0.027428825   2    1000014   -13
    0.027182333   2    1000012   -11
    0.02078238   2   -1000011    12
    0.020782087   2   -1000013    14
    0.0071562261   3    1000022   -5    6
    0.00060955421   2   -2000013    14

DECAY 1000037  26.909192
    0.13748185   2   -1000011    12
    0.13748061   2   -1000013    14
    0.13626124   2    1000014   -13
    0.13625593   2    1000012   -11
    0.12018402   2    1000006   -5
    0.083353108   2    1000023    24
    0.052109456   2    1000024    23
    0.049282398   2    1000024    25
    0.049207486   2    1000025    24
    0.026232508   2    2000006   -5
    0.018326684   2   -2000005    6
    0.018000654   2    1000016   -15
    0.017796657   2   -2000015    16
    0.014648399   2   -1000005    6
    0.0026810734   2    1000022    24
    0.0005249646   2   -1000015    16

DECAY 1000022 -1


DECAY 1000023  7.3158732
    0.33710478   2    1000006   -6
    0.33710478   2   -1000006    6
    0.086891017   2    1000022    25
    0.048500772   2    1000022    23
    0.045348629   2    1000015   -15
    0.045348629   2   -1000015    15
    0.010698845   2    1000013   -13
    0.010698845   2   -1000013    13
    0.010607244   2    1000011   -11
    0.010607244   2   -1000011    11
    0.0087610479   2    1000014   -14
    0.0087610479   2   -1000014    14
    0.0087608955   2    1000012   -12
    0.0087608955   2   -1000012    12
    0.0086842092   2    1000005   -5
    0.0086842092   2   -1000005    5
    0.0029765015   3    1000022    6   -6
    0.00047418403   2    2000013   -13
    0.00047418403   2   -2000013    13
    0.00024252629   2    2000011   -11
    0.00024252629   2   -2000011    11
    0.00013257683   3    1000022    5   -5

DECAY 1000025  8.4094509
    0.37190096   2    1000006   -6
    0.37190096   2   -1000006    6
    0.087393482   2    1000022    23
    0.069676287   2    1000022    25
    0.040186755   2    1000015   -15
    0.040186755   2   -1000015    15
    0.0071140548   2    1000005   -5
    0.0071140548   2   -1000005    5
    0.002703546   3    1000022    6   -6
    0.00033030039   2    2000013   -13
    0.00033030039   2   -2000013    13
    0.00013026391   2    2000005   -5
    0.00013026391   2   -2000005    5
    0.00011604358   2    2000011   -11
    0.00011604358   2   -2000011    11

DECAY 1000035  30.54861
    0.065737354   2    1000025    23
    0.062911182   2    1000006   -6
    0.062911182   2   -1000006    6
    0.060737859   2    1000024   -24
    0.060737859   2   -1000024    24
    0.060565052   2    1000014   -14
    0.060565052   2   -1000014    14
    0.060564378   2    1000012   -12
    0.060564378   2   -1000012    12
    0.059536754   2    1000013   -13
    0.059536754   2   -1000013    13
    0.059535295   2    1000011   -11
    0.059535295   2   -1000011    11
    0.042378008   2    1000023    25
    0.041280401   2    1000025    25
    0.018249556   2    2000005   -5
    0.018249556   2   -2000005    5
    0.01513972   2    2000006   -6
    0.01513972   2   -2000006    6
    0.010695578   2    1000005   -5
    0.010695578   2   -1000005    5
    0.0079359941   2    1000016   -16
    0.0079359941   2   -1000016    16
    0.0077790613   2    2000015   -15
    0.0077790613   2   -2000015    15
    0.0014375864   2    1000022    25
    0.00091520732   2    1000022    23
    0.00026167109   2    1000015   -15
    0.00026167109   2   -1000015    15
    0.00024128022   2    1000023    23

DECAY 1000021  223.82717
    0.12859288   2    1000006   -6
    0.12859288   2   -1000006    6
    0.12742145   2    2000006   -6
    0.12742145   2   -2000006    6
    0.12561352   2    1000005   -5
    0.12561352   2   -1000005    5
    0.11619365   2    2000005   -5
    0.11619365   2   -2000005    5
    0.00075783836   2    1000006   -4
    0.00075783836   2   -1000006    4
    0.00072899332   3    1000023    6   -6
    0.00064429562   3    1000025    6   -6
    0.00043878536   3    1000024    5   -6
    0.00043878536   3   -1000024   -5    6
    0.00016540793   3    1000023    5   -5
    0.00015646432   3    1000025    5   -5

DECAY 25  0.0034060427
    0.64612468   2   -5    5
    0.15463391   2   -24    24
    0.073594582   2   -15    15
    0.073536365   2    21    21
    0.031220631   2   -4    4
    0.017026958   2    23    23
    0.0022752368   2    22    22
    0.0010893801   2    22    23
    0.0002553235   2   -13    13
    0.00024209253   2   -3    3
    6.6936411e-07   2   -1    1
    1.6090251e-07   2   -2    2
    5.7400217e-09   2   -11    11

DECAY 35  29.053492
    0.89624575   2   -5    5
    0.097745056   2   -15    15
    0.0051882672   2   -6    6
    0.00034523144   2   -13    13
    0.00023101672   2   -3    3
    9.9174403e-05   2    25    25
    9.0515619e-05   2    1000022    1000022
    2.4704104e-05   2   -1000015    1000015
    1.6039748e-05   2    21    21
    7.5106695e-06   2    23    23
    5.0039177e-06   2   -24    24
    6.387731e-07   2   -1    1
    4.1897113e-07   2   -1000011    1000011
    4.1146376e-07   2   -1000013    1000013
    9.6169828e-08   2   -2000013    1000013
    9.6169828e-08   2   -1000013    2000013
    3.8229007e-08   2   -4    4
    2.0351299e-08   2    22    23
    7.7550598e-09   2   -11    11
    5.1261803e-09   2    22    22
    2.2496369e-12   2   -2000011    1000011
    2.2496369e-12   2   -1000011    2000011
    1.9701332e-13   2   -2    2

DECAY 36  28.042892
    0.89591646   2   -5    5
    0.097706321   2   -15    15
    0.0056431062   2   -6    6
    0.00034510176   2   -13    13
    0.00023091754   2   -3    3
    0.00010243799   2    1000022    1000022
    4.4418767e-05   2    21    21
    1.030735e-05   2    23    25
    6.384984e-07   2   -1    1
    9.7800064e-08   2   -2000013    1000013
    9.7800064e-08   2   -1000013    2000013
    4.0334951e-08   2   -4    4
    3.7792573e-08   2    22    22
    1.0987941e-08   2    22    23
    7.7521595e-09   2   -11    11
    2.287507e-12   2   -2000011    1000011
    2.287507e-12   2   -1000011    2000011
    2.0788424e-13   2   -2    2
    1.4859171e-35   2    25    25

DECAY 37  25.30054
    0.89864082   2   -5    6
    0.099390643   2   -15    16
    0.0013369512   2   -5    4
    0.00035138192   2   -13    14
    0.00024102212   2   -3    4
    1.1498398e-05   2    24    25
    1.1210767e-05   2   -3    2
    9.5472181e-06   2   -5    2
    5.7536921e-06   2   -3    6
    6.6886341e-07   2   -1    2
    2.4786366e-07   2   -1    6
    2.1218487e-07   2   -1000013    1000014
    3.3323705e-08   2   -1    4
    8.2188596e-09   2   -11    12
    7.389349e-12   2    24    35
    5.4794873e-12   2    24    36
    4.9628545e-12   2   -1000011    1000012

DECAY 6  2.43
    1   2    5    24

DECAY 15 -1
