BLOCK SPINFO
   1   SPheno
   2   v4.0.5be

BLOCK SPHENOINFO
   1   2
   2   2

BLOCK MODSEL
   1   0

BLOCK MINPAR
   3    9.0473976
   4   -1

BLOCK EXTPAR
   0    3804.9922
   1   -1367.168
   2   -4563.9843
   3    3992.0661
   11    5610.1557
   12   -3688.2449
   13   -674.24855
   23   -941.78797
   25    8.5857415
   26    4058.9198
   31    3821.6474
   32    3821.6474
   33    3973.4441
   34    1960.3083
   35    1960.3083
   36    3300.2125
   41    1452.3871
   42    1452.3871
   43    3140.5733
   44    2903.3713
   45    2903.3713
   46    4411.2815
   47    4100.8116
   48    4100.8116
   49    2107.7315

BLOCK SMINPUTS
   1    127.90897
   2    1.1663787e-05
   3    0.1184
   4    91.1876
   5    4.18
   6    173.2
   7    1.777
   8    0
   11    0.00051099893
   12    0
   13    0.10565837
   14    0
   21    0.005
   22    0.0025
   23    0.095
   24    1.27

BLOCK GAUGE Q=  3804.9922
   1    0.35536298
   2    0.66519887
   3    1.219778

BLOCK YU Q=  3804.9922
   1   1    8.4410508e-06
   2   2    0.0042880538
   3   3    1.0197467

BLOCK YD Q=  3804.9922
   1   1    0.00014563125
   2   2    0.0027669937
   3   3    0.14442056

BLOCK YE Q=  3804.9922
   1   1    2.5413718e-05
   2   2    0.0052547508
   3   3    0.088376263

BLOCK AU Q=  3804.9922
   1   1    0
   2   2    0
   3   3    5610.1557

BLOCK AD Q=  3804.9922
   1   1    0
   2   2    0
   3   3   -3688.245

BLOCK AE Q=  3804.9922
   1   1    0
   2   2    0
   3   3   -674.24855

BLOCK MSOFT Q=  3804.9922
   1   -1367.168
   2   -4563.9843
   3    3992.0661
   21    15150257
   22   -481106.26
   31    3821.6474
   32    3821.6474
   33    3973.4441
   34    1960.3083
   35    1960.3083
   36    3300.2125
   41    1452.3871
   42    1452.3871
   43    3140.5733
   44    2903.3713
   45    2903.3713
   46    4411.2815
   47    4100.8116
   48    4100.8116
   49    2107.7315

BLOCK MASS
   6    173.2
   23    91.1876
   24    80.429995
   15    1.777
   25    123.41357
   35    4058.9985
   36    4058.9198
   37    4060.0232
   1000001    1721.6386
   2000001    4233.664
   1000002    1719.8428
   2000002    3065.3323
   1000003    1721.6378
   2000003    4233.6636
   1000004    1719.8421
   2000004    3065.3317
   1000005    2295.2381
   2000005    3289.9223
   1000006    3281.6242
   2000006    4411.8293
   1000011    3852.2204
   2000011    1975.1176
   1000012    3851.0024
   1000013    3852.2192
   2000013    1975.1142
   1000014    3851.0012
   1000015    3308.852
   2000015    4003.148
   1000016    4001.9514
   1000021    4099.0823
   1000022   -956.31125
   1000023    961.28207
   1000025   -1354.6714
   1000035   -4506.1182
   1000024    959.72627
   1000037    4506.1725

BLOCK ALPHA
      -0.11023381

BLOCK HMIX Q=  3804.9922
   1   -941.78797
   2    8.5857415
   3    242.99939
   4    16474830

BLOCK STOPMIX
   1   1   -0.99607724
   1   2    0.088488045
   2   1   -0.088488045
   2   2   -0.99607724

BLOCK SBOTMIX
   1   1   -0.0017767508
   1   2    0.99999842
   2   1   -0.99999842
   2   2   -0.0017767508

BLOCK STAUMIX
   1   1   -0.0026372464
   1   2    0.99999652
   2   1   -0.99999652
   2   2   -0.0026372464

BLOCK NMIX
   1   1   -0.087281643
   1   2    0.017224721
   1   3    0.70551301
   1   4   -0.70309076
   2   1    0.011814252
   2   2   -0.0089747696
   2   3    0.70665484
   2   4    0.70740287
   3   1   -0.99611358
   3   2   -0.001876863
   3   3   -0.053435872
   3   4    0.069991531
   4   1   -0.00026018617
   4   2    0.9998096
   4   3   -0.0059116175
   4   4    0.018594225

BLOCK UMIX
   1   1   -0.0083592039
   1   2   -0.99996506
   2   1   -0.99996506
   2   2    0.0083592039

BLOCK VMIX
   1   1    0.026296775
   1   2    0.99965418
   2   1    0.99965418
   2   2   -0.026296775

BLOCK HIGGSBOUNDSINPUTHIGGSCOUPLINGSFERMIONS
       0, 73.714957,3,36,15,15

BLOCK HIGGSBOUNDSINPUTHIGGSCOUPLINGSBOSONS
       0,4,36,21,21,23

BLOCK SPHENOLOWENERGY
   1    0.00032255759
   2    1.5908037e-06
   3    3.5269851e-05
   4    2.5608598e-15
   5    1.0939702e-10
   6    2.2900825e-08
   7    8.6606799e-14
   8    3.6998394e-09
   9    7.8475459e-07
   10    9.6779443e-05
   11    0.99969459
   12    0.54197648
   13    19.365105
   14    0
   15    0
   16    0.0021572469
   17    2.2816576e-15
   18    2.4810043e-11
   19    8.2931206e-11
   20    1.6601069e-16
   21    7.09741e-12
   22    2.1915968e-09
   23    0
   24    0
   25    0
   26    0
   27    0
   28    0
   29    0
   30    0
   31    0
   39   -7.9209542e-05
   40    0
   41    0
   42    0

BLOCK FWCOEF Q=  160
   305   4422   0   0   -0.18881911
   305   4422   0   2   -0.19100228
   305   4322   0   2   -3.1314891e-05
   305   6421   0   0   -0.095227835
   305   6421   0   2   -0.099645485
   305   6321   0   2   -7.9936583e-05
   3051111   4133   0   0    1.6244705
   3051111   4133   0   2    1.6248906
   3051111   4233   0   2    2.0829805e-05
   3051111   4137   0   0   -4.4471626
   3051111   4137   0   2   -4.447198
   3051111   4237   0   2   -0.00015430772
   3051313   4133   0   0    1.6244705
   3051313   4133   0   2    1.6248906
   3051313   4233   0   2    2.0829803e-05
   3051313   4137   0   0   -4.4471626
   3051313   4137   0   2   -4.447198
   3051313   4237   0   2   -0.00015430773
   3051212   4137   0   0    1.5053501
   3051212   4137   0   2    1.505358
   3051212   4237   0   2    3.3383274e-05
   3051414   4137   0   0    1.5053501
   3051414   4137   0   2    1.505358
   3051414   4237   0   2    3.3383274e-05
   3051616   4137   0   0    1.5053501
   3051616   4137   0   2    1.505358
   3051616   4237   0   2    3.3383293e-05

BLOCK IMFWCOEF Q=  160
   305   4422   0   0    3.8583134e-07
   305   4422   0   2    1.4171681e-06
   305   4322   0   2    8.4784078e-07
   305   6421   0   0    3.3049006e-07
   305   6421   0   2    3.4153028e-06
   305   6321   0   2    4.6024487e-07
   3051111   4133   0   2    7.1617506e-07
   3051111   4233   0   2    3.9498507e-07
   3051111   4137   0   2   -3.680206e-06
   3051111   4237   0   2   -2.9265106e-06
   3051313   4133   0   2    7.161749e-07
   3051313   4233   0   2    3.9498504e-07
   3051313   4137   0   2   -3.6802061e-06
   3051313   4237   0   2   -2.9265107e-06
   3051212   4137   0   2    8.0046565e-07
   3051212   4237   0   2    6.3312836e-07
   3051414   4137   0   2    8.0046564e-07
   3051414   4237   0   2    6.3312836e-07
   3051616   4137   0   2    8.0081977e-07
   3051616   4237   0   2    6.3312839e-07

DECAY 23  2.4952


DECAY 24  2.085


DECAY 2000011  2.8068718
    0.98392591   2    1000025    11
    0.015786685   2    1000022    11
    0.00028739871   2    1000023    11

DECAY 1000011  3.728501
    0.99595066   2    1000025    11
    0.0034618834   2    1000022    11
    0.00055909026   2   -1000024    12

DECAY 2000013  2.8081162
    0.98348242   2    1000025    13
    0.015892525   2    1000022    13
    0.00039960494   2    1000023    13
    0.00022544746   2   -1000024    14

DECAY 1000013  3.7304065
    0.99544273   2    1000025    13
    0.0037087087   2    1000022    13
    0.00055880446   2   -1000024    14
    0.00027744048   2    1000023    13

DECAY 1000015  12.400962
    0.92174933   2    1000025    15
    0.034785943   2   -1000024    16
    0.025963535   2    1000022    15
    0.017501193   2    1000023    15

DECAY 2000015  4.5172073
    0.87262137   2    1000025    15
    0.063777649   2    1000022    15
    0.061121456   2    1000023    15
    0.0010405585   2    1000015    23
    0.00099445009   2    1000015    25
    0.0004445136   2   -1000024    16

DECAY 1000012  3.7445229
    0.97731305   2    1000025    12
    0.01624983   2    1000022    12
    0.0055070887   2    1000024    11
    0.00093003192   2    1000023    12

DECAY 1000014  3.7463815
    0.9768277   2    1000025    14
    0.016241762   2    1000022    14
    0.0060009684   2    1000024    13
    0.00092957014   2    1000023    14

DECAY 1000016  4.5337634
    0.85644783   2    1000025    16
    0.12658722   2    1000024    15
    0.014083132   2    1000022    16
    0.002075703   2    1000015    24
    0.0008061113   2    1000023    16

DECAY 1000001  0.03869266
    0.87506486   2    1000025    1
    0.10054225   2    1000022    1
    0.013002626   2   -1000024    2
    0.011390261   2    1000023    1

DECAY 2000001  3.2142987
    0.58788222   2    1000025    1
    0.40697958   2    1000021    1
    0.005045113   2    1000022    1

DECAY 1000003  0.039114754
    0.86561987   2    1000025    3
    0.10105355   2    1000022    3
    0.020479665   2   -1000024    4
    0.012846912   2    1000023    3

DECAY 2000003  3.2154599
    0.58767025   2    1000025    3
    0.40682987   2    1000021    3
    0.005132972   2    1000022    3
    0.00018237521   2    1000023    3
    0.00018045398   2   -1000024    4

DECAY 1000005  1.831649
    0.34752675   2   -1000024    6
    0.29524097   2    1000025    5
    0.18067371   2    1000022    5
    0.17655857   2    1000023    5

DECAY 2000005  58.013933
    0.97451343   2   -1000024    6
    0.010033634   2    1000022    5
    0.0098569249   2    1000023    5
    0.0053526038   2    1000025    5
    0.00015542532   2    1000005    25

DECAY 1000002  0.040190159
    0.87201183   2    1000025    2
    0.12352974   2    1000024    1
    0.0042040609   2    1000023    2
    0.00025436529   2    1000022    2

DECAY 2000002  4.4415206
    0.99025818   2    1000025    2
    0.0095669264   2    1000022    2
    0.00017488936   2    1000023    2

DECAY 1000004  0.040612328
    0.86296852   2    1000025    4
    0.12528705   2    1000024    3
    0.0078357295   2    1000023    4
    0.0039087017   2    1000022    4

DECAY 2000004  4.4433386
    0.98985188   2    1000025    4
    0.0096652791   2    1000022    4
    0.00027757073   2    1000023    4
    0.00020516656   2    1000024    3

DECAY 1000006  59.102419
    0.4810517   2    1000023    6
    0.4786707   2    1000022    6
    0.029790972   2    1000024    5
    0.007750164   2    1000025    6
    0.002568363   3    1000022    24    5
    0.00016809842   2    1000005    24

DECAY 2000006  270.10294
    0.3032009   2    1000024    5
    0.1521822   2    1000023    6
    0.15007386   2    1000022    6
    0.14701472   2    2000005    24
    0.12039271   2    1000006    25
    0.074164595   2    1000006    23
    0.031242539   2    1000025    6
    0.021726403   2    1000021    6

DECAY 1000024  1.4724756e-09
    0.44146643   3    1000022   -1    2
    0.22638441   3    1000022   -3    4
    0.14715648   3    1000022   -11    12
    0.14645683   3    1000022   -13    14
    0.038535844   3    1000022   -15    16

DECAY 1000037  251.0724
    0.17285704   2    1000004   -3
    0.17285699   2    1000002   -1
    0.17284132   2   -1000003    4
    0.17284131   2   -1000001    2
    0.051457035   2    1000006   -5
    0.050701294   2   -2000005    6
    0.042821153   2    1000024    25
    0.041056055   2    1000023    24
    0.04102425   2    1000024    23
    0.040519369   2    1000022    24
    0.0057399601   2    1000014   -13
    0.0057399406   2    1000012   -11
    0.0057238635   2   -1000013    14
    0.0057238443   2   -1000011    12
    0.0050288152   3    1000024    6   -6
    0.0035235831   2    1000016   -15
    0.0035100878   2   -2000015    16
    0.0030237578   3    1000023   -5    6
    0.0024458558   3    1000022   -5    6
    0.00051661171   2    1000025    24

DECAY 1000022 -1


DECAY 1000023  3.9056761e-08
    0.80109926   2    1000022    22
    0.054247016   3    1000022    12   -12
    0.040564422   3    1000022    1   -1
    0.040392559   3    1000022    3   -3
    0.031636988   3    1000022    2   -2
    0.012543319   3    1000022    4   -4
    0.0091543144   3    1000022    11   -11
    0.0090932208   3    1000022    13   -13
    0.00090229642   3    1000022    15   -15
    0.0001097736   3    1000024    1   -2
    0.0001097736   3   -1000024   -1    2

DECAY 1000025  3.7122839
    0.23083232   2    1000024   -24
    0.23083232   2   -1000024    24
    0.22821069   2    1000023    23
    0.18378283   2    1000022    25
    0.12031775   2    1000023    25
    0.0040887957   2    1000022    23
    0.00094139511   3    1000024    5   -6
    0.00094139511   3   -1000024   -5    6

DECAY 1000035  254.36186
    0.085327716   2    1000004   -4
    0.085327716   2   -1000004    4
    0.085327674   2    1000002   -2
    0.085327674   2   -1000002    2
    0.085282721   2    1000003   -3
    0.085282721   2   -1000003    3
    0.085282694   2    1000001   -1
    0.085282694   2   -1000001    1
    0.040537195   2    1000024   -24
    0.040537195   2   -1000024    24
    0.032830749   2    1000022    25
    0.031982262   2    1000023    23
    0.025591693   2    1000006   -6
    0.025591693   2   -1000006    6
    0.025496004   2    2000005   -5
    0.025496004   2   -2000005    5
    0.021373687   2    1000023    25
    0.0084516381   2    1000022    23
    0.00283413   2    1000014   -14
    0.00283413   2   -1000014    14
    0.0028341203   2    1000012   -12
    0.0028341203   2   -1000012    12
    0.0028228541   2    1000013   -13
    0.0028228541   2   -1000013    13
    0.0028228446   2    1000011   -11
    0.0028228446   2   -1000011    11
    0.0025812194   3    1000024    5   -6
    0.0025812194   3   -1000024   -5    6
    0.0024070612   3    1000022    6   -6
    0.0019608597   3    1000023    6   -6
    0.0017397202   2    1000016   -16
    0.0017397202   2   -1000016    16
    0.0017310012   2    2000015   -15
    0.0017310012   2   -2000015    15
    0.00043881134   2    1000025    25

DECAY 1000021  465.27115
    0.088523313   2    1000004   -4
    0.088523313   2   -1000004    4
    0.088523288   2    1000002   -2
    0.088523288   2   -1000002    2
    0.088444307   2    1000003   -3
    0.088444307   2   -1000003    3
    0.088444273   2    1000001   -1
    0.088444273   2   -1000001    1
    0.061444993   2    1000005   -5
    0.061444993   2   -1000005    5
    0.025333103   2    2000004   -4
    0.025333103   2   -2000004    4
    0.025333091   2    2000002   -2
    0.025333091   2   -2000002    2
    0.017189032   2    1000006   -6
    0.017189032   2   -1000006    6
    0.016509084   2    2000005   -5
    0.016509084   2   -2000005    5
    0.00011293713   3    1000024    5   -6
    0.00011293713   3   -1000024   -5    6
    0.00011133752   3    1000023    6   -6
    0.00011043821   3    1000022    6   -6

DECAY 25  0.0036761027
    0.5966365   2   -5    5
    0.20352625   2   -24    24
    0.073765867   2    21    21
    0.068492   2   -15    15
    0.029536622   2   -4    4
    0.023866114   2    23    23
    0.0023467654   2    22    22
    0.0013674144   2    22    23
    0.00023755128   2   -13    13
    0.00022413278   2   -3    3
    6.1970432e-07   2   -1    1
    1.5221439e-07   2   -2    2
    5.3404369e-09   2   -11    11

DECAY 35  9.9358899
    0.39139227   2   -5    5
    0.23361387   2    1000023    1000025
    0.19761563   2   -6    6
    0.10068139   2    1000022    1000025
    0.068424313   2   -15    15
    0.00316063   2    1000022    1000022
    0.0019649076   2    1000022    1000023
    0.0014972941   2   -1000024    1000024
    0.00059909016   2    1000025    1000025
    0.00033416052   2    1000023    1000023
    0.00023735064   2   -13    13
    0.00014791317   2   -3    3
    0.00014348147   2    25    25
    3.9348423e-05   2   -1000001    1000001
    3.9346517e-05   2   -1000003    1000003
    2.6853928e-05   2   -1000002    1000002
    2.6836802e-05   2   -1000004    1000004
    2.3594222e-05   2    23    23
    2.0551497e-05   2    21    21
    4.8997147e-06   2   -24    24
    2.8930216e-06   2   -4    4
    1.3295834e-06   2   -1000011    1000011
    1.3288659e-06   2   -1000013    1000013
    4.0890963e-07   2   -1    1
    2.2714318e-07   2    22    22
    7.7367732e-08   2    22    23
    5.3302316e-09   2   -11    11
    1.4913883e-11   2   -2    2

DECAY 36  9.6643473
    0.39116058   2   -5    5
    0.23523998   2    1000022    1000025
    0.18757245   2   -6    6
    0.10535946   2    1000023    1000025
    0.068387279   2   -15    15
    0.006434669   2    1000022    1000022
    0.0022491654   2   -1000024    1000024
    0.0020644654   2    1000025    1000025
    0.00073960945   2    1000022    1000023
    0.00028079728   2    1000023    1000023
    0.00023722179   2   -13    13
    0.00014782689   2   -3    3
    7.0776252e-05   2    21    21
    5.1968745e-05   2    23    25
    2.7335217e-06   2   -4    4
    4.3870767e-07   2    22    22
    4.0867519e-07   2   -1    1
    1.6508493e-07   2    22    23
    5.3273388e-09   2   -11    11
    1.4091842e-11   2   -2    2
    7.8611688e-40   2    25    25

DECAY 37  9.8538914
    0.58733228   2   -5    6
    0.34189073   2    1000024    1000025
    0.067447125   2   -15    16
    0.0015095699   2    1000022    1000024
    0.0005858012   2   -5    4
    0.00027434078   2   -3    6
    0.00023844959   2   -13    14
    0.00019616336   2   -1000005    1000004
    0.00017945332   2    1000023    1000024
    0.00013799612   2   -3    4
    6.2715251e-05   2   -1000001    1000002
    6.2604704e-05   2   -1000003    1000004
    5.1028068e-05   2    24    25
    1.2573263e-05   2   -1    6
    6.3704867e-06   2   -3    2
    4.1831974e-06   2   -5    2
    3.3535751e-06   2   -1000003    1000002
    3.3494071e-06   2   -1000001    1000004
    1.4008093e-06   2   -1000005    1000002
    3.7613402e-07   2   -1    2
    1.3220165e-07   2   -1    4
    5.5773607e-09   2   -11    12
    2.2607806e-13   2    24    36
    1.5616077e-13   2    24    35

DECAY 6  2.43
    1   2    5    24

DECAY 15 -1
