BLOCK SPINFO
   1   SPheno
   2   v4.0.5be

BLOCK SPHENOINFO
   1   2
   2   2

BLOCK MODSEL
   1   0

BLOCK MINPAR
   3    56.162974
   4   -1

BLOCK EXTPAR
   0    1407.2256
   1    296.27509
   2    623.5507
   3    3000
   11    4397.3765
   12    1301.5711
   13    1978.7186
   23   -434.40503
   25    58.123378
   26    817.22726
   31    442.07029
   32    442.07029
   33    316.10866
   34    818.57316
   35    818.57316
   36    992.89744
   41    5000
   42    5000
   43    1185.68
   44    5000
   45    5000
   46    1961.2767
   47    5000
   48    5000
   49    1743.395

BLOCK SMINPUTS
   1    127.90897
   2    1.1663787e-05
   3    0.1184
   4    91.1876
   5    4.18
   6    173.2
   7    1.777
   8    0
   11    0.00051099893
   12    0
   13    0.10565837
   14    0
   21    0.005
   22    0.0025
   23    0.095
   24    1.27

BLOCK GAUGE Q=  1407.2256
   1    0.35536298
   2    0.66519887
   3    1.219778

BLOCK YU Q=  1407.2256
   1   1    8.3856129e-06
   2   2    0.0042598914
   3   3    1.0130494

BLOCK YD Q=  1407.2256
   1   1    0.00097941309
   2   2    0.018608849
   3   3    0.97127089

BLOCK YE Q=  1407.2256
   1   1    0.00017091475
   2   2    0.035339749
   3   3    0.59435644

BLOCK AU Q=  1407.2256
   1   1    0
   2   2    0
   3   3    4397.3768

BLOCK AD Q=  1407.2256
   1   1    0
   2   2    0
   3   3    1301.5715

BLOCK AE Q=  1407.2256
   1   1    0
   2   2    0
   3   3    1978.7185

BLOCK MSOFT Q=  1407.2256
   1    296.27509
   2    623.5507
   3    3000
   21    658371.9
   22   -142050.81
   31    442.07029
   32    442.07029
   33    316.10866
   34    818.57316
   35    818.57316
   36    992.89744
   41    5000
   42    5000
   43    1185.68
   44    5000
   45    5000
   46    1961.2767
   47    5000
   48    5000
   49    1743.395

BLOCK MASS
   6    173.2
   23    91.1876
   24    80.429995
   15    1.777
   25    125.49799
   35    816.56387
   36    817.22726
   37    828.23104
   1000001    5028.419
   2000001    5017.979
   1000002    5028.0012
   2000002    5019.6615
   1000003    5028.4282
   2000003    5017.9926
   1000004    5028.0092
   2000004    5019.6623
   1000005    1113.2794
   2000005    1706.0839
   1000006    1038.8102
   2000006    1906.3
   1000011    457.06424
   2000011    819.73211
   1000012    449.96455
   1000013    457.02082
   2000013    819.70086
   1000014    449.9361
   1000015    308.88326
   2000015    965.45994
   1000016    302.66228
   1000021    3189.3222
   1000022    289.39588
   1000023    428.98109
   1000025   -439.50071
   1000035    663.44481
   1000024    425.02276
   1000037    663.57383

BLOCK ALPHA
      -0.018615593

BLOCK HMIX Q=  1407.2256
   1   -434.40503
   2    58.123378
   3    244.01448
   4    667860.4

BLOCK STOPMIX
   1   1   -0.96401251
   1   2    0.26585689
   2   1   -0.26585689
   2   2   -0.96401251

BLOCK SBOTMIX
   1   1   -0.99866064
   1   2    0.051739065
   2   1   -0.051739065
   2   2   -0.99866064

BLOCK STAUMIX
   1   1   -0.99851413
   1   2    0.054493346
   2   1   -0.054493346
   2   2   -0.99851413

BLOCK NMIX
   1   1    0.97562883
   1   2   -0.02551403
   1   3   -0.1822517
   1   4   -0.11950622
   2   1   -0.21374467
   2   2   -0.23902591
   2   3   -0.67509293
   2   4   -0.66440151
   3   1   -0.043054634
   3   2    0.053465818
   3   3   -0.70247244
   3   4    0.70839267
   4   1   -0.024655626
   4   2    0.96920434
   4   3   -0.13253801
   4   4   -0.20607941

BLOCK UMIX
   1   1   -0.18702134
   1   2   -0.98235585
   2   1    0.98235585
   2   2   -0.18702134

BLOCK VMIX
   1   1   -0.29065426
   1   2    0.95682815
   2   1    0.95682815
   2   2    0.29065426

BLOCK HIGGSBOUNDSINPUTHIGGSCOUPLINGSFERMIONS
       0, 3378.3271,3,36,15,15

BLOCK HIGGSBOUNDSINPUTHIGGSCOUPLINGSBOSONS
       0,4,36,21,21,23

BLOCK SPHENOLOWENERGY
   1    0.00029626614
   2    1.5926823e-06
   3    3.521467e-05
   4    3.9225144e-14
   5    1.6746804e-09
   6    2.9474525e-07
   7    1.3829909e-12
   8    5.9047693e-08
   9    1.0569396e-05
   10    8.129396e-05
   11    0.83973548
   12    0.54161251
   13    19.37669
   14    0
   15    0
   16    0.0021574367
   17    2.2816901e-15
   18    2.478688e-11
   19    8.2867451e-11
   20   -3.9145591e-14
   21   -1.6737781e-09
   22   -7.0942009e-07
   23    0
   24    0
   25    0
   26    0
   27    0
   28    0
   29    0
   30    0
   31    0
   39    0.00024499046
   40    0
   41    0
   42    0

BLOCK FWCOEF Q=  160
   305   4422   0   0   -0.18881911
   305   4422   0   2   -0.15251402
   305   4322   0   2   -0.00045955187
   305   6421   0   0   -0.095227835
   305   6421   0   2   -0.10325073
   305   6321   0   2   -0.00078997795
   3051111   4133   0   0    1.5906416
   3051111   4133   0   2    1.5913658
   3051111   4233   0   2    0.00012067688
   3051111   4137   0   0   -4.4133337
   3051111   4137   0   2   -4.407862
   3051111   4237   0   2   -0.00093414118
   3051313   4133   0   0    1.5906416
   3051313   4133   0   2    1.5913553
   3051313   4233   0   2    0.00012056105
   3051313   4137   0   0   -4.4133337
   3051313   4137   0   2   -4.4078725
   3051313   4237   0   2   -0.00093405101
   3051212   4137   0   0    1.5053501
   3051212   4137   0   2    1.5041872
   3051212   4237   0   2    0.00020364139
   3051414   4137   0   0    1.5053501
   3051414   4137   0   2    1.5041872
   3051414   4237   0   2    0.00020366535
   3051616   4137   0   0    1.5053501
   3051616   4137   0   2    1.5041862
   3051616   4237   0   2    0.00021041825

BLOCK IMFWCOEF Q=  160
   305   4422   0   0    3.8590689e-07
   305   4422   0   2   -5.5866244e-05
   305   4322   0   2    6.8018658e-06
   305   6421   0   0    3.3055478e-07
   305   6421   0   2    3.1780593e-06
   305   6321   0   2    3.1253923e-06
   3051111   4133   0   2   -2.6231862e-06
   3051111   4233   0   2    1.1656224e-05
   3051111   4137   0   2    1.6372558e-05
   3051111   4237   0   2   -9.091512e-05
   3051313   4133   0   2   -2.6230712e-06
   3051313   4233   0   2    1.1656121e-05
   3051313   4137   0   2    1.6372716e-05
   3051313   4237   0   2   -9.0915476e-05
   3051212   4137   0   2   -3.0002031e-06
   3051212   4237   0   2    1.9819758e-05
   3051414   4137   0   2   -3.0002056e-06
   3051414   4237   0   2    1.9819758e-05
   3051616   4137   0   2   -3.0205796e-06
   3051616   4237   0   2    1.9819769e-05

DECAY 23  2.4952


DECAY 24  2.085


DECAY 1000011  0.18356713
    0.96651165   2    1000022    11
    0.019397826   2    1000023    11
    0.014032557   2   -1000024    12

DECAY 2000011  3.1075616
    0.96672753   2    1000022    11
    0.031929024   2    1000023    11
    0.00124747   2    1000025    11

DECAY 1000013  0.18372714
    0.96604286   2    1000022    13
    0.01974324   2    1000023    13
    0.013984968   2   -1000024    14
    0.00022876233   2    1000025    13

DECAY 2000013  3.1303572
    0.95979846   2    1000022    13
    0.033254186   2    1000023    13
    0.003356345   2   -1000024    14
    0.0028676094   2    1000025    13
    0.00058765725   2    1000013    25
    0.00010870468   2    1000035    13

DECAY 1000015  0.005872037
    0.99999736   2    1000022    15

DECAY 2000015  15.134169
    0.27388677   2   -1000024    16
    0.261456   2    1000022    15
    0.14065682   2    1000025    15
    0.13881774   2    1000023    15
    0.085630576   2    1000016   -24
    0.046355029   2    1000015    25
    0.041749795   2    1000015    23
    0.0075926272   2   -1000037    16
    0.0038546436   2    1000035    15

DECAY 1000012  0.20769656
    0.97993008   2    1000022    12
    0.01871894   2    1000024    11
    0.001233157   2    1000023    12
    0.00011782068   2    1000025    12

DECAY 1000014  0.207769
    0.97935178   2    1000022    14
    0.019301519   2    1000024    13
    0.0012295408   2    1000023    14
    0.00011715485   2    1000025    14

DECAY 1000016  0.0029274202
    1   2    1000022    16

DECAY 2000001  143.49655
    0.98061292   2    1000021    1
    0.018459731   2    1000022    1
    0.00087925872   2    1000023    1

DECAY 1000001  206.66035
    0.68615619   2    1000021    1
    0.19956559   2   -1000037    2
    0.098012293   2    1000035    1
    0.007385196   2   -1000024    2
    0.0042627414   2    1000023    1
    0.0042236119   2    1000022    1
    0.00039437762   2    1000025    1

DECAY 2000003  143.56589
    0.98014919   2    1000021    3
    0.018458793   2    1000022    3
    0.00098667649   2    1000023    3
    0.00022905078   2   -1000024    4
    0.00015262735   2    1000025    3

DECAY 1000003  206.69726
    0.68603834   2    1000021    3
    0.19953109   2   -1000037    4
    0.097997808   2    1000035    3
    0.0073917932   2   -1000024    4
    0.0043370634   2    1000023    3
    0.0042283819   2    1000022    3
    0.00047552448   2    1000025    3

DECAY 1000005  36.189385
    0.38348832   2   -1000024    6
    0.20227537   2    1000025    5
    0.19676246   2    1000023    5
    0.13788938   2   -1000037    6
    0.055666744   2    1000035    5
    0.02391773   2    1000022    5

DECAY 2000005  59.827391
    0.44035319   2   -1000024    6
    0.23144882   2    1000025    5
    0.21265098   2    1000023    5
    0.034202956   2    1000006   -24
    0.028544833   2    1000022    5
    0.018725639   2   -1000037    6
    0.013747225   2    1000005    23
    0.010807845   2    1000005    25
    0.0095185061   2    1000035    5

DECAY 2000002  152.02061
    0.92678004   2    1000021    2
    0.069722244   2    1000022    2
    0.0033198431   2    1000023    2
    0.00013460139   2    1000025    2

DECAY 1000002  206.66003
    0.6859468   2    1000021    2
    0.18931191   2    1000037    1
    0.096243864   2    1000035    2
    0.017836408   2    1000024    1
    0.008102747   2    1000023    2
    0.0023370685   2    1000022    2
    0.00022120281   2    1000025    2

DECAY 2000004  152.0242
    0.9267583   2    1000021    4
    0.069720761   2    1000022    4
    0.0033249628   2    1000023    4
    0.00014048591   2    1000025    4

DECAY 1000004  206.69672
    0.68582876   2    1000021    4
    0.18928424   2    1000037    3
    0.096227314   2    1000035    4
    0.017992274   2    1000024    3
    0.008105124   2    1000023    4
    0.0023367827   2    1000022    4
    0.00022550065   2    1000025    4

DECAY 1000006  31.367689
    0.38846263   2    1000024    5
    0.22182032   2    1000025    6
    0.19233512   2    1000023    6
    0.11707424   2    1000037    5
    0.069964291   2    1000035    6
    0.0059691468   2    1000022    6
    0.0030229687   2    1000023    4
    0.0010696451   2    1000022    4
    0.00028164738   3    1000022    24    5

DECAY 2000006  273.53299
    0.34182982   2    1000005    24
    0.19411501   2    1000006    25
    0.19312995   2    1000006    23
    0.12980463   2    1000024    5
    0.062924162   2    1000025    6
    0.057991697   2    1000023    6
    0.016686314   2    1000022    6
    0.0016591112   2    1000037    5
    0.00085945604   2    1000035    6
    0.00057071545   2    1000006    36
    0.00040940358   2    1000006    35

DECAY 1000024  0.52100944
    0.73816807   2    1000016   -15
    0.21783713   2    1000022    24
    0.04398682   2   -1000015    16

DECAY 1000037  10.434004
    0.16602016   2    1000016   -15
    0.16220699   2   -1000015    16
    0.11647692   2    1000025    24
    0.094864569   2    1000023    24
    0.08821957   2    1000024    23
    0.074808076   2    1000014   -13
    0.074783004   2    1000012   -11
    0.074641822   2   -1000013    14
    0.074616223   2   -1000011    12
    0.073248377   2    1000024    25

DECAY 1000022 -1


DECAY 1000023  0.47478889
    0.39295193   2    1000015   -15
    0.39295193   2   -1000015    15
    0.1745834   2    1000022    25
    0.023866361   2    1000022    23
    0.0078161764   2    1000016   -16
    0.0078161764   2   -1000016    16

DECAY 1000025  0.83864132
    0.38170646   2    1000022    23
    0.23065732   2    1000015   -15
    0.23065732   2   -1000015    15
    0.15322392   2    1000022    25
    0.0018641259   2    1000016   -16
    0.0018641259   2   -1000016    16

DECAY 1000035  11.371987
    0.10622582   2    1000025    23
    0.086466297   2    1000024   -24
    0.086466297   2   -1000024    24
    0.077699696   2    1000016   -16
    0.077699696   2   -1000016    16
    0.07768403   2    1000025    25
    0.072744651   2    1000015   -15
    0.072744651   2   -1000015    15
    0.063403354   2    1000023    25
    0.036140696   2    1000014   -14
    0.036140696   2   -1000014    14
    0.036132913   2    1000012   -12
    0.036132913   2   -1000012    12
    0.032406935   2    1000013   -13
    0.032406935   2   -1000013    13
    0.032391892   2    1000011   -11
    0.032391892   2   -1000011    11
    0.004601167   2    1000023    23

DECAY 1000021  266.07956
    0.15043321   2    1000006   -6
    0.15043321   2   -1000006    6
    0.13684332   2    1000005   -5
    0.13684332   2   -1000005    5
    0.090362585   2    2000005   -5
    0.090362585   2   -2000005    5
    0.066619611   2    2000006   -6
    0.066619611   2   -2000006    6
    0.055651766   2    1000006   -4
    0.055651766   2   -1000006    4

DECAY 25  0.0042880513
    0.59718801   2   -5    5
    0.21777251   2   -24    24
    0.065159321   2   -15    15
    0.063492903   2    21    21
    0.026622246   2    23    23
    0.025730399   2   -4    4
    0.0021724794   2    22    22
    0.0014195114   2    22    23
    0.00022596987   2   -13    13
    0.00021591332   2   -3    3
    5.9697114e-07   2   -1    1
    1.3259367e-07   2   -2    2
    5.080031e-09   2   -11    11

DECAY 35  69.558878
    0.94028603   2   -5    5
    0.053484058   2   -15    15
    0.0027278099   2    1000022    1000025
    0.0014872599   2   -1000015    1000015
    0.00085076309   2    1000022    1000023
    0.00034363259   2    1000022    1000022
    0.00033718652   2   -6    6
    0.00019482397   2   -13    13
    0.00018755231   2   -3    3
    8.8815762e-05   2    21    21
    8.6184896e-06   2    25    25
    1.6020914e-06   2   -24    24
    9.7551855e-07   2    23    23
    5.1846002e-07   2   -1    1
    1.0972174e-08   2    22    22
    4.7219814e-09   2   -4    4
    4.3773929e-09   2   -11    11
    8.8980931e-10   2    22    23
    2.4349412e-14   2   -2    2

DECAY 36  65.48137
    0.9406363   2   -5    5
    0.053539741   2   -15    15
    0.0035856386   2    1000022    1000023
    0.00070877206   2    1000022    1000022
    0.00065749756   2    1000022    1000025
    0.00037872325   2   -6    6
    0.00019500476   2   -13    13
    0.00018760854   2   -3    3
    0.00010816006   2    21    21
    1.6129845e-06   2    23    25
    5.1861552e-07   2   -1    1
    2.2590565e-07   2    22    23
    1.9188959e-07   2    22    22
    4.3814527e-09   2   -11    11
    4.3431184e-09   2   -4    4
    2.2422472e-14   2   -2    2
    3.1080624e-37   2    25    25

DECAY 37  66.024921
    0.91361969   2   -5    6
    0.079128933   2   -15    16
    0.0044902964   2    1000022    1000024
    0.0014477627   2   -5    4
    0.00082476736   2   -1000015    1000016
    0.0002797514   2   -13    14
    0.00018710163   2   -3    4
    1.0338565e-05   2   -5    2
    8.6199524e-06   2   -3    2
    1.6850614e-06   2    24    25
    5.1890505e-07   2   -1    2
    4.8999445e-07   2   -3    6
    2.3945351e-08   2   -1    4
    1.0969215e-08   2   -1    6
    6.5434145e-09   2   -11    12
    4.4192701e-09   2    24    35
    3.2974064e-09   2    24    36

DECAY 6  2.43
    1   2    5    24

DECAY 15 -1
