BLOCK SPINFO
   1   SPheno
   2   v4.0.5be

BLOCK SPHENOINFO
   1   2
   2   2

BLOCK MODSEL
   1   0

BLOCK MINPAR
   3    41.788418
   4    1

BLOCK EXTPAR
   0    1643.3782
   1    1671.0399
   2   -1664.2028
   3    3000
   11   -4433.4604
   12    1697.8219
   13    1605.3262
   23    212.80864
   25    41.008102
   26    3648.2309
   31    1448.2548
   32    1448.2548
   33    1682.8111
   34    420.80411
   35    420.80411
   36    1981.9206
   41    5000
   42    5000
   43    1680.9142
   44    5000
   45    5000
   46    1716.6518
   47    5000
   48    5000
   49    1249.9605

BLOCK SMINPUTS
   1    127.90897
   2    1.1663787e-05
   3    0.1184
   4    91.1876
   5    4.18
   6    173.2
   7    1.777
   8    0
   11    0.00051099893
   12    0
   13    0.10565837
   14    0
   21    0.005
   22    0.0025
   23    0.095
   24    1.27

BLOCK GAUGE Q=  1643.3782
   1    0.35536298
   2    0.66519887
   3    1.219778

BLOCK YU Q=  1643.3782
   1   1    8.3868646e-06
   2   2    0.0042605272
   3   3    1.0132006

BLOCK YD Q=  1643.3782
   1   1    0.00069111378
   2   2    0.013131162
   3   3    0.68536831

BLOCK YE Q=  1643.3782
   1   1    0.00012060441
   2   2    0.024937167
   3   3    0.41940212

BLOCK AU Q=  1643.3782
   1   1    0
   2   2    0
   3   3   -4433.4602

BLOCK AD Q=  1643.3782
   1   1    0
   2   2    0
   3   3    1697.822

BLOCK AE Q=  1643.3782
   1   1    0
   2   2    0
   3   3    1605.3262

BLOCK MSOFT Q=  1643.3782
   1    1671.0399
   2   -1664.2028
   3    3000
   21    13327001
   22    818.60991
   31    1448.2548
   32    1448.2548
   33    1682.8111
   34    420.80411
   35    420.80411
   36    1981.9206
   41    5000
   42    5000
   43    1680.9142
   44    5000
   45    5000
   46    1716.6518
   47    5000
   48    5000
   49    1249.9605

BLOCK MASS
   6    173.2
   23    91.1876
   24    80.429995
   15    1.777
   25    123.42178
   35    3646.2381
   36    3648.2309
   37    3647.6359
   1000001    5034.0542
   2000001    5025.4011
   1000002    5033.616
   2000002    5026.794
   1000003    5034.0579
   2000003    5025.4072
   1000004    5033.6196
   2000004    5026.7946
   1000005    1289.0868
   2000005    1677.1326
   1000006    1472.638
   2000006    1833.9143
   1000011    1465.041
   2000011    434.07933
   1000012    1462.5197
   1000013    1465.0429
   2000013    434.10758
   1000014    1462.5213
   1000015    1697.8887
   2000015    1986.2522
   1000016    1695.6572
   1000021    3200.8811
   1000022   -211.02527
   1000023    212.68041
   1000025    1666.4224
   1000035   -1713.969
   1000024    211.82564
   1000037    1714.1679

BLOCK ALPHA
      -0.02396765

BLOCK HMIX Q=  1643.3782
   1    212.80864
   2    41.008102
   3    243.88179
   4    13309589

BLOCK STOPMIX
   1   1    0.68368691
   1   2    0.72977545
   2   1   -0.72977545
   2   2    0.68368691

BLOCK SBOTMIX
   1   1    0.014372413
   1   2    0.99989671
   2   1   -0.99989671
   2   2    0.014372413

BLOCK STAUMIX
   1   1    0.99993287
   1   2    0.011587129
   2   1   -0.011587129
   2   2    0.99993287

BLOCK NMIX
   1   1   -0.0162712
   1   2   -0.036201861
   1   3    0.70846237
   1   4    0.70463163
   2   1    0.022178002
   2   2    0.029807693
   2   3    0.70572146
   2   4   -0.70751457
   3   1    0.99962142
   3   2   -0.00061336914
   3   3   -0.0041225767
   3   4    0.027196516
   4   1   -0.00063768753
   4   2    0.99889967
   4   3    0.0046142765
   4   4    0.046666383

BLOCK UMIX
   1   1   -0.0065289075
   1   2    0.99997869
   2   1   -0.99997869
   2   2   -0.0065289075

BLOCK VMIX
   1   1    0.066005574
   1   2    0.99781925
   2   1    0.99781925
   2   2   -0.066005574

BLOCK HIGGSBOUNDSINPUTHIGGSCOUPLINGSFERMIONS
       0, 1681.6644,3,36,15,15

BLOCK HIGGSBOUNDSINPUTHIGGSCOUPLINGSBOSONS
       0,4,36,21,21,23

BLOCK SPHENOLOWENERGY
   1    0.00026600097
   2    1.6026101e-06
   3    3.5250385e-05
   4    3.0385751e-15
   5    1.2980294e-10
   6    2.7082136e-08
   7    1.0179765e-13
   8    4.3487427e-09
   9    9.1944182e-07
   10    9.6195595e-05
   11    0.99366367
   12    0.54242966
   13    19.376331
   14    0
   15    0
   16    0.0021590226
   17    2.2816763e-15
   18    2.4819128e-11
   19    8.2939369e-11
   20   -4.311927e-15
   21   -1.8435436e-10
   22   -4.7453884e-08
   23    0
   24    0
   25    0
   26    0
   27    0
   28    0
   29    0
   30    0
   31    0
   39    8.2148281e-05
   40    0
   41    0
   42    0

BLOCK FWCOEF Q=  160
   305   4422   0   0   -0.18881911
   305   4422   0   2   -0.11954134
   305   4322   0   2    0.00038184951
   305   6421   0   0   -0.095227835
   305   6421   0   2   -0.063174602
   305   6321   0   2    7.3161923e-05
   3051111   4133   0   0    1.5956053
   3051111   4133   0   2    1.5966334
   3051111   4233   0   2    0.00033255539
   3051111   4137   0   0   -4.4182974
   3051111   4137   0   2   -4.4164991
   3051111   4237   0   2   -0.0025742336
   3051313   4133   0   0    1.5956053
   3051313   4133   0   2    1.5966303
   3051313   4233   0   2    0.00033255375
   3051313   4137   0   0   -4.4182974
   3051313   4137   0   2   -4.4165022
   3051313   4237   0   2   -0.002574237
   3051212   4137   0   0    1.5053501
   3051212   4137   0   2    1.5049635
   3051212   4237   0   2    0.00056056588
   3051414   4137   0   0    1.5053501
   3051414   4137   0   2    1.5049635
   3051414   4237   0   2    0.00056056592
   3051616   4137   0   0    1.5053501
   3051616   4137   0   2    1.5049636
   3051616   4237   0   2    0.00056057631

BLOCK IMFWCOEF Q=  160
   305   4422   0   0    3.8585591e-07
   305   4422   0   2   -1.3382899e-05
   305   4322   0   2    8.4064679e-06
   305   6421   0   0    3.305111e-07
   305   6421   0   2   -2.5154504e-05
   305   6321   0   2    3.4161054e-06
   3051111   4133   0   2   -3.1149797e-06
   3051111   4233   0   2    6.4850252e-06
   3051111   4137   0   2    2.5243228e-05
   3051111   4237   0   2   -5.0205163e-05
   3051313   4133   0   2   -3.1149506e-06
   3051313   4233   0   2    6.4849994e-06
   3051313   4137   0   2    2.5243272e-05
   3051313   4237   0   2   -5.0205228e-05
   3051212   4137   0   2   -5.4008452e-06
   3051212   4237   0   2    1.0932686e-05
   3051414   4137   0   2   -5.4008457e-06
   3051414   4237   0   2    1.0932686e-05
   3051616   4137   0   2   -5.399824e-06
   3051616   4237   0   2    1.0932685e-05

DECAY 23  2.4952


DECAY 24  2.085


DECAY 2000011  0.00095645673
    0.64779702   2    1000023    11
    0.35212675   2    1000022    11

DECAY 1000011  0.023713051
    0.52558592   2    1000022    11
    0.45218972   2    1000023    11
    0.022224188   2   -1000024    12

DECAY 2000013  0.0071907173
    0.43353596   2   -1000024    14
    0.30092608   2    1000023    13
    0.26553796   2    1000022    13

DECAY 1000013  0.041259476
    0.51348816   2    1000022    13
    0.46955305   2    1000023    13
    0.012772921   2   -1000024    14
    0.0041858688   2    2000013    25

DECAY 1000015  5.7915478
    0.50213594   2    1000022    15
    0.49689009   2    1000023    15
    0.00049532535   2    1000025    15
    0.00047864251   2   -1000024    16

DECAY 2000015  14.489879
    0.46864562   2   -1000024    16
    0.23530507   2    1000022    15
    0.23394226   2    1000023    15
    0.060343135   2    1000025    15
    0.00087378461   2    1000016   -24
    0.00044964841   2    1000015    25
    0.00041139397   2    1000015    23

DECAY 1000012  0.060423472
    0.8897727   2    1000024    11
    0.077301646   2    1000022    12
    0.032925657   2    1000023    12

DECAY 1000014  0.077766214
    0.91435453   2    1000024    13
    0.060062579   2    1000022    14
    0.025582895   2    1000023    14

DECAY 1000016  5.8233785
    0.99823132   2    1000024    15
    0.00094009578   2    1000022    16
    0.00042809459   2    1000025    16
    0.00040049166   2    1000023    16

DECAY 2000001  142.32779
    0.98438051   2    1000021    1
    0.015603953   2    1000025    1

DECAY 1000001  193.52321
    0.72861999   2    1000021    1
    0.17895881   2   -1000037    2
    0.089312145   2    1000035    1
    0.0028962417   2    1000025    1
    0.00012667395   2    1000022    1

DECAY 2000003  142.36269
    0.98414366   2    1000021    3
    0.015600159   2    1000025    3
    0.00012065584   2   -1000024    4

DECAY 1000003  193.54262
    0.7285489   2    1000021    3
    0.17894109   2   -1000037    4
    0.089303288   2    1000035    3
    0.0028959557   2    1000025    3
    0.00017116274   2    1000022    3
    0.0001205563   2    1000023    3

DECAY 1000005  22.361186
    0.48994162   2   -1000024    6
    0.25629041   2    1000022    5
    0.25376797   2    1000023    5

DECAY 2000005  61.527053
    0.52501508   2   -1000024    6
    0.22730141   2    1000006   -24
    0.12386674   2    1000022    5
    0.12296279   2    1000023    5
    0.0005148682   2    1000005    25
    0.00033851399   2    1000005    23

DECAY 2000002  149.14523
    0.94035578   2    1000021    2
    0.059587448   2    1000025    2

DECAY 1000002  193.51587
    0.72841201   2    1000021    2
    0.17816984   2    1000037    1
    0.08926308   2    1000035    2
    0.0028563334   2    1000025    2
    0.00099431947   2    1000024    1
    0.00017441243   2    1000022    2
    0.00012999978   2    1000023    2

DECAY 2000004  149.14885
    0.94033299   2    1000021    4
    0.059586018   2    1000025    4

DECAY 1000004  193.53519
    0.72834087   2    1000021    4
    0.17815224   2    1000037    3
    0.089254244   2    1000035    4
    0.0028560545   2    1000025    4
    0.0010828763   2    1000024    3
    0.00017904344   2    1000022    4
    0.00013467287   2    1000023    4

DECAY 1000006  46.869706
    0.43157735   2    1000024    5
    0.28527547   2    1000023    6
    0.28143448   2    1000022    6
    0.001593946   3    1000022    24    5

DECAY 2000006  92.2302
    0.29792078   2    1000024    5
    0.2296603   2    1000006    23
    0.20098483   2    1000023    6
    0.20066139   2    1000022    6
    0.067134525   2    2000005    24
    0.0017983263   2    1000006    25
    0.0012133716   2    1000037    5
    0.00062647274   2    1000005    24

DECAY 1000024  7.5854148e-13
    0.60987706   3    1000022   -1    2
    0.20334269   3    1000022   -11    12
    0.18678025   3    1000022   -13    14

DECAY 1000037  18.061387
    0.20327106   2    1000024    25
    0.19989574   2    1000023    24
    0.19850902   2    1000022    24
    0.19832784   2    1000024    23
    0.049098563   2    1000006   -5
    0.030784503   2    1000012   -11
    0.030784147   2    1000014   -13
    0.030349577   2   -1000011    12
    0.030349157   2   -1000013    14
    0.011426686   3    1000024    6   -6
    0.008141472   3    1000022   -5    6
    0.0081328467   3    1000023   -5    6
    0.00057364638   3    1000024    5   -5
    0.00019119149   2    1000016   -15
    0.00014923483   2   -1000015    16

DECAY 1000022 -1


DECAY 1000023  6.2345202e-10
    0.9519426   2    1000022    22
    0.013891825   3    1000022    12   -12
    0.010386925   3    1000022    1   -1
    0.0099980574   3    1000022    3   -3
    0.0081015128   3    1000022    2   -2
    0.0023441787   3    1000022    11   -11
    0.002207926   3    1000022    13   -13
    0.00034299748   3    1000024    1   -2
    0.00034299748   3   -1000024   -1    2
    0.00011435639   3    1000024    11   -12
    0.00011435639   3   -1000024   -11    12
    0.00010613499   3    1000024    13   -14
    0.00010613499   3   -1000024   -13    14

DECAY 1000025  20.311152
    0.17896376   2    2000011   -11
    0.17896376   2   -2000011    11
    0.17896037   2    2000013   -13
    0.17896037   2   -2000013    13
    0.055807485   2    1000024   -24
    0.055807485   2   -1000024    24
    0.036096326   2    1000022    23
    0.033603873   2    1000023    25
    0.030279213   2    1000022    25
    0.019727886   2    1000023    23
    0.011062918   2    1000005   -5
    0.011062918   2   -1000005    5
    0.0027241663   2    1000012   -12
    0.0027241663   2   -1000012    12
    0.0027241261   2    1000014   -14
    0.0027241261   2   -1000014    14
    0.0026492978   2    1000011   -11
    0.0026492978   2   -1000011    11
    0.0026492531   2    1000013   -13
    0.0026492531   2   -1000013    13
    0.0019067411   3    1000024    5   -6
    0.0019067411   3   -1000024   -5    6
    0.0013998273   2    1000006   -6
    0.0013998273   2   -1000006    6
    0.0011765707   3    1000023    6   -6
    0.0011486426   3    1000022    6   -6

DECAY 1000035  18.844812
    0.19102336   2    1000024   -24
    0.19102336   2   -1000024    24
    0.12887701   2    1000023    25
    0.11578526   2    1000022    25
    0.11440528   2    1000023    23
    0.07630549   2    1000022    23
    0.019450354   2    1000006   -6
    0.019450354   2   -1000006    6
    0.014774327   2    1000012   -12
    0.014774327   2   -1000012    12
    0.014774153   2    1000014   -14
    0.014774153   2   -1000014    14
    0.014482753   2    1000011   -11
    0.014482753   2   -1000011    11
    0.014482549   2    1000013   -13
    0.014482549   2   -1000013    13
    0.0074750421   3    1000024    5   -6
    0.0074750421   3   -1000024   -5    6
    0.0046440419   3    1000023    6   -6
    0.0045258853   3    1000022    6   -6
    0.001075128   2    2000005   -5
    0.001075128   2   -2000005    5

DECAY 1000021  229.53517
    0.14485497   2    1000005   -5
    0.14485497   2   -1000005    5
    0.11053356   2    1000006   -6
    0.11053356   2   -1000006    6
    0.10863271   2    2000005   -5
    0.10863271   2   -2000005    5
    0.10756797   2    2000006   -6
    0.10756797   2   -2000006    6
    0.028005982   2    1000006   -4
    0.028005982   2   -1000006    4
    0.00020162179   3    1000025    6   -6
    0.00015354232   3    1000035    5   -5
    0.00013972397   3    1000035    6   -6

DECAY 25  0.0036642502
    0.59643816   2   -5    5
    0.20436659   2   -24    24
    0.072971741   2    21    21
    0.068528958   2   -15    15
    0.029532927   2   -4    4
    0.023968636   2    23    23
    0.0023565149   2    22    22
    0.0013737666   2    22    23
    0.00023769533   2   -13    13
    0.00022423305   2   -3    3
    6.199816e-07   2   -1    1
    1.5219462e-07   2   -2    2
    5.343675e-09   2   -11    11

DECAY 35  110.85803
    0.55555867   2   -5    5
    0.11007996   2   -15    15
    0.082572651   2   -1000024    1000037
    0.082572651   2   -1000037    1000024
    0.041978454   2    1000023    1000025
    0.040838979   2    1000022    1000025
    0.029583051   2   -2000005    1000005
    0.029583051   2   -1000005    2000005
    0.013418213   2    1000022    1000035
    0.01050875   2    1000023    1000035
    0.0012627318   2   -1000024    1000024
    0.00063253569   2   -6    6
    0.00056231063   2   -1000006    1000006
    0.00038232236   2   -13    13
    0.000224338   2   -3    3
    0.0001215678   2    1000022    1000022
    4.7692824e-05   2    1000023    1000023
    3.648794e-05   2   -1000005    1000005
    1.1361904e-05   2   -2000005    2000005
    5.0244428e-06   2    1000022    1000023
    4.6864316e-06   2    21    21
    2.4757325e-06   2   -1000015    1000015
    2.4007484e-06   2    1000025    1000035
    2.137283e-06   2   -2000006    1000006
    2.137283e-06   2   -1000006    2000006
    2.1136802e-06   2    25    25
    1.3748522e-06   2   -1000037    1000037
    6.8716649e-07   2    1000025    1000025
    6.2020756e-07   2   -1    1
    1.3224347e-07   2    23    23
    5.4185436e-08   2    1000035    1000035
    3.1183534e-08   2   -24    24
    2.3998808e-08   2   -1000011    1000011
    2.3741206e-08   2   -1000013    1000013
    2.3139679e-08   2   -2000011    2000011
    2.2948976e-08   2   -2000013    2000013
    2.1281578e-08   2    22    23
    1.0094883e-08   2   -4    4
    8.586122e-09   2   -11    11
    8.4971612e-09   2    22    22
    3.2667911e-10   2   -2000013    1000013
    3.2667911e-10   2   -1000013    2000013
    5.2041985e-14   2   -2    2
    7.6410657e-15   2   -2000011    1000011
    7.6410657e-15   2   -1000011    2000011

DECAY 36  105.77238
    0.54162108   2   -5    5
    0.10731937   2   -15    15
    0.086639254   2   -1000024    1000037
    0.086639254   2   -1000037    1000024
    0.044593664   2    1000022    1000025
    0.042306109   2    1000023    1000025
    0.03106088   2   -2000005    1000005
    0.03106088   2   -1000005    2000005
    0.013926143   2    1000023    1000035
    0.011181274   2    1000022    1000035
    0.0013291383   2   -1000024    1000024
    0.00059027536   2   -6    6
    0.00047139119   2   -2000006    1000006
    0.00047139119   2   -1000006    2000006
    0.00037273747   2   -13    13
    0.00021870129   2   -3    3
    0.0001175014   2    1000022    1000022
    5.5839372e-05   2    1000023    1000023
    9.5241762e-06   2    21    21
    8.3976594e-06   2    1000022    1000023
    3.4690229e-06   2   -1000037    1000037
    1.7369102e-06   2    1000025    1000025
    6.8159457e-07   2    1000035    1000035
    6.0462099e-07   2   -1    1
    4.0877592e-07   2    1000025    1000035
    2.6610857e-07   2    23    25
    9.3904094e-09   2   -4    4
    8.3709212e-09   2   -11    11
    4.8361379e-09   2    22    23
    2.0285972e-09   2    22    22
    3.4172038e-10   2   -2000013    1000013
    3.4172038e-10   2   -1000013    2000013
    3.2639613e-13   2    23    35
    4.8410961e-14   2   -2    2
    7.9928752e-15   2   -2000011    1000011
    7.9928752e-15   2   -1000011    2000011
    9.560891e-38   2    25    25

DECAY 37  117.28966
    0.56960456   2   -5    6
    0.10860728   2   -15    16
    0.079050514   2    1000022    1000037
    0.078247008   2    1000024    1000025
    0.077908097   2    1000023    1000037
    0.037259735   2   -1000005    1000006
    0.024466793   2   -1000005    2000006
    0.022525603   2    1000024    1000035
    0.00084387045   2   -5    4
    0.00038396541   2   -13    14
    0.00030943539   2    1000023    1000024
    0.00026379696   2   -2000005    1000006
    0.00019511518   2   -3    4
    0.00019269443   2    1000022    1000024
    0.00012053374   2   -2000005    2000006
    9.1584112e-06   2   -3    2
    6.0261053e-06   2   -5    2
    2.6426508e-06   2    1000035    1000037
    1.2711125e-06   2   -3    6
    8.7275444e-07   2   -1000015    1000016
    5.4128037e-07   2   -1    2
    2.3996085e-07   2    24    25
    8.5987532e-08   2   -2000011    1000012
    8.5734246e-08   2   -2000013    1000014
    4.4991789e-08   2   -1    6
    2.5743867e-08   2   -1    4
    8.9809909e-09   2   -11    12
    6.0850892e-10   2   -1000013    1000014
    3.7470294e-13   2    1000025    1000037
    6.1943931e-14   2    24    35
    1.4232799e-14   2   -1000011    1000012

DECAY 6  2.43
    1   2    5    24

DECAY 15 -1
