BLOCK SPINFO
   1   SPheno
   2   v4.0.5be

BLOCK SPHENOINFO
   1   2
   2   2

BLOCK MODSEL
   1   0

BLOCK MINPAR
   3    12.670035
   4    1

BLOCK EXTPAR
   0    2775.8134
   1    822.82249
   2    2449.3828
   3    4321.7295
   11    6308.1773
   12   -2049.266
   13   -2818.1636
   23    1205.8628
   25    12.064809
   26    2968.3062
   31    3499.2555
   32    3499.2555
   33    3886.3306
   34    1519.0083
   35    1519.0083
   36    3490.4908
   41    2428.1892
   42    2428.1892
   43    3441.5043
   44    727.70175
   45    727.70175
   46    2222.6984
   47    1724.5795
   48    1724.5795
   49    769.02897

BLOCK SMINPUTS
   1    127.90897
   2    1.1663787e-05
   3    0.1184
   4    91.1876
   5    4.18
   6    173.2
   7    1.777
   8    0
   11    0.00051099893
   12    0
   13    0.10565837
   14    0
   21    0.005
   22    0.0025
   23    0.095
   24    1.27

BLOCK GAUGE Q=  2775.8134
   1    0.35536298
   2    0.66519887
   3    1.219778

BLOCK YU Q=  2775.8134
   1   1    8.4131233e-06
   2   2    0.0042738666
   3   3    1.0163729

BLOCK YD Q=  2775.8134
   1   1    0.00020396608
   2   2    0.0038753555
   3   3    0.20227044

BLOCK YE Q=  2775.8134
   1   1    3.5593572e-05
   2   2    0.0073596219
   3   3    0.12377673

BLOCK AU Q=  2775.8134
   1   1    0
   2   2    0
   3   3    6308.1775

BLOCK AD Q=  2775.8134
   1   1    0
   2   2    0
   3   3   -2049.266

BLOCK AE Q=  2775.8134
   1   1    0
   2   2    0
   3   3   -2818.1636

BLOCK MSOFT Q=  2775.8134
   1    822.82249
   2    2449.3828
   3    4321.7295
   21    7187065.5
   22   -1297215.4
   31    3499.2555
   32    3499.2555
   33    3886.3306
   34    1519.0083
   35    1519.0083
   36    3490.4908
   41    2428.1892
   42    2428.1892
   43    3441.5043
   44    727.70175
   45    727.70175
   46    2222.6984
   47    1724.5795
   48    1724.5795
   49    769.02897

BLOCK MASS
   6    173.2
   23    91.1876
   24    80.429995
   15    1.777
   25    125.88217
   35    2968.2939
   36    2968.3062
   37    2969.6456
   1000001    2552.4415
   2000001    1818.6622
   1000002    2551.1983
   2000002    825.34432
   1000003    2552.441
   2000003    1818.6615
   1000004    2551.1979
   2000004    825.34437
   1000005    860.51629
   2000005    3478.9823
   1000006    2203.2903
   2000006    3497.1062
   1000011    3513.7344
   2000011    1521.4892
   1000012    3512.4573
   1000013    3513.7328
   2000013    1521.4857
   1000014    3512.4557
   1000015    3492.4221
   2000015    3898.9423
   1000016    3897.7081
   1000021    4253.2463
   1000022    806.23357
   1000023    1222.2943
   1000025   -1222.8324
   1000035    2484.3827
   1000024    1220.1762
   1000037    2484.5693

BLOCK ALPHA
      -0.078968431

BLOCK HMIX Q=  2775.8134
   1    1205.8628
   2    12.064809
   3    243.30257
   4    8810841.6

BLOCK STOPMIX
   1   1   -0.12323662
   1   2    0.99237732
   2   1   -0.99237732
   2   2   -0.12323662

BLOCK SBOTMIX
   1   1    0.0029656899
   1   2    0.9999956
   2   1   -0.9999956
   2   2    0.0029656899

BLOCK STAUMIX
   1   1    0.010351731
   1   2    0.99994642
   2   1   -0.99994642
   2   2    0.010351731

BLOCK NMIX
   1   1   -0.99648188
   1   2    0.0024228067
   1   3   -0.068485442
   1   4    0.048246641
   2   1   -0.082572265
   2   2   -0.046321422
   2   3    0.703845
   2   4   -0.70401588
   3   1   -0.014289966
   3   2    0.01361644
   3   3    0.70666465
   3   4    0.70727326
   4   1   -0.0012174266
   4   2    0.99883084
   4   3    0.023173865
   4   4   -0.042408034

BLOCK UMIX
   1   1   -0.032733064
   1   2    0.99946413
   2   1    0.99946413
   2   2    0.032733064

BLOCK VMIX
   1   1   -0.059930445
   1   2    0.99820255
   2   1    0.99820255
   2   2    0.059930445

BLOCK HIGGSBOUNDSINPUTHIGGSCOUPLINGSFERMIONS
       0, 145.55961,3,36,15,15

BLOCK HIGGSBOUNDSINPUTHIGGSCOUPLINGSBOSONS
       0,4,36,21,21,23

BLOCK SPHENOLOWENERGY
   1    0.00032986618
   2    1.5889884e-06
   3    3.524935e-05
   4    2.6991527e-15
   5    1.1530476e-10
   6    2.413923e-08
   7    9.0774825e-14
   8    3.8778984e-09
   9    8.2258227e-07
   10    9.668649e-05
   11    0.99873442
   12    0.54229875
   13    19.376184
   14    0
   15    0
   16    0.0021587689
   17    2.2816733e-15
   18    2.4800212e-11
   19    8.2898266e-11
   20    3.9488746e-16
   21    1.6882453e-11
   22    4.8568289e-09
   23    0
   24    0
   25    0
   26    0
   27    0
   28    0
   29    0
   30    0
   31    0
   39    1.6533309e-06
   40    0
   41    0
   42    0

BLOCK FWCOEF Q=  160
   305   4422   0   0   -0.18881911
   305   4422   0   2   -0.19911957
   305   4322   0   2   -0.0002245699
   305   6421   0   0   -0.095227835
   305   6421   0   2   -0.10592556
   305   6321   0   2   -0.00022322198
   3051111   4133   0   0    1.6134754
   3051111   4133   0   2    1.61374
   3051111   4233   0   2    2.2521481e-05
   3051111   4137   0   0   -4.4361675
   3051111   4137   0   2   -4.43418
   3051111   4237   0   2   -0.00016977005
   3051313   4133   0   0    1.6134754
   3051313   4133   0   2    1.61374
   3051313   4233   0   2    2.2521474e-05
   3051313   4137   0   0   -4.4361675
   3051313   4137   0   2   -4.4341801
   3051313   4237   0   2   -0.00016977005
   3051212   4137   0   0    1.5053501
   3051212   4137   0   2    1.5049206
   3051212   4237   0   2    3.6819528e-05
   3051414   4137   0   0    1.5053501
   3051414   4137   0   2    1.5049206
   3051414   4237   0   2    3.6819528e-05
   3051616   4137   0   0    1.5053501
   3051616   4137   0   2    1.5049206
   3051616   4237   0   2    3.6819724e-05

BLOCK IMFWCOEF Q=  160
   305   4422   0   0    3.8579263e-07
   305   4422   0   2    4.5168731e-06
   305   4322   0   2   -1.707052e-06
   305   6421   0   0    3.304569e-07
   305   6421   0   2   -1.141961e-06
   305   6321   0   2   -9.6310162e-07
   3051111   4133   0   2   -1.3268853e-06
   3051111   4233   0   2    4.7519709e-07
   3051111   4137   0   2    1.0869784e-05
   3051111   4237   0   2   -3.5828367e-06
   3051313   4133   0   2   -1.3268848e-06
   3051313   4233   0   2    4.7519701e-07
   3051313   4137   0   2    1.0869785e-05
   3051313   4237   0   2   -3.5828368e-06
   3051212   4137   0   2   -2.3296532e-06
   3051212   4237   0   2    7.7704301e-07
   3051414   4137   0   2   -2.3296532e-06
   3051414   4237   0   2    7.7704301e-07
   3051616   4137   0   2   -2.3293016e-06
   3051616   4237   0   2    7.7704311e-07

DECAY 23  2.4952


DECAY 24  2.085


DECAY 2000011  3.9333969
    0.99828374   2    1000022    11
    0.001666505   2    1000023    11

DECAY 1000011  15.599977
    0.49518086   2   -1000037    12
    0.24985535   2    1000022    11
    0.24702906   2    1000035    11
    0.0062643256   2    1000023    11
    0.0016429917   2   -1000024    12

DECAY 2000013  3.9337906
    0.99817873   2    1000022    13
    0.0016924009   2    1000023    13

DECAY 1000013  15.603054
    0.49508208   2   -1000037    14
    0.24980697   2    1000022    13
    0.24697984   2    1000035    13
    0.0063559277   2    1000023    13
    0.0016426665   2   -1000024    14
    0.00012100792   2    1000025    13

DECAY 1000015  17.355181
    0.90019233   2    1000022    15
    0.047391387   2   -1000024    16
    0.028720465   2    1000023    15
    0.023683791   2    1000025    15

DECAY 2000015  23.680242
    0.51073603   2   -1000037    16
    0.25477719   2    1000035    15
    0.18662136   2    1000022    15
    0.025022633   2    1000023    15
    0.020442939   2    1000025    15
    0.0011192866   2   -1000024    16
    0.00065189799   2    1000015    23
    0.00062866929   2    1000015    25

DECAY 1000012  15.606901
    0.49281534   2    1000037    11
    0.25421976   2    1000022    12
    0.2471137   2    1000035    12
    0.0055019949   2    1000024    11
    0.00034547033   2    1000025    12

DECAY 1000014  15.609796
    0.4927229   2    1000037    13
    0.25417247   2    1000022    14
    0.2470673   2    1000035    14
    0.0056881958   2    1000024    13
    0.00034540601   2    1000025    14

DECAY 1000016  23.689651
    0.50865784   2    1000037    15
    0.25502111   2    1000035    16
    0.18975625   2    1000022    16
    0.044981492   2    1000024    15
    0.0013146055   2    1000015    24
    0.00026582206   2    1000025    16

DECAY 2000001  0.65301942
    0.99671617   2    1000022    1
    0.0031874657   2    1000023    1

DECAY 1000001  0.41015777
    0.71817385   2    1000022    1
    0.15068781   2   -1000037    2
    0.075690154   2    1000035    1
    0.034934556   2   -1000024    2
    0.016264918   2    1000023    1
    0.0042484361   2    1000025    1

DECAY 2000003  0.65334615
    0.99621901   2    1000022    3
    0.0033097752   2    1000023    3
    0.00025119382   2   -1000024    4
    0.00022001659   2    1000025    3

DECAY 1000003  0.41118261
    0.71639038   2    1000022    3
    0.15027945   2   -1000037    4
    0.075500211   2    1000035    3
    0.036175828   2   -1000024    4
    0.01676793   2    1000023    3
    0.0047864828   2    1000025    3

DECAY 1000005  0.0070594022
    1   2    1000022    5

DECAY 2000005  161.31755
    0.57581503   2    1000006   -24
    0.33704246   2   -1000024    6
    0.046153527   2   -1000037    6
    0.022756606   2    1000035    5
    0.0067562104   2    1000025    5
    0.0067529197   2    1000023    5
    0.0028153849   2    1000022    5
    0.0012632099   2    1000005    25
    0.00064465548   2    1000005    23

DECAY 2000002  0.0038345465
    1   2    1000022    2

DECAY 1000002  0.44172721
    0.63095819   2    1000022    2
    0.13462974   2    1000037    1
    0.10862312   2    1000024    1
    0.067743363   2    1000035    2
    0.056196757   2    1000023    2
    0.0018488329   2    1000025    2

DECAY 2000004  0.0038236325
    1   2    1000022    4

DECAY 1000004  0.44271643
    0.6295529   2    1000022    4
    0.13432679   2    1000037    3
    0.10939826   2    1000024    3
    0.067576908   2    1000035    4
    0.05667913   2    1000023    4
    0.0024647138   2    1000025    4

DECAY 1000006  46.373046
    0.45642227   2    1000024    5
    0.23536485   2    1000023    6
    0.23379017   2    1000025    6
    0.074409567   2    1000022    6

DECAY 2000006  180.9177
    0.35173124   2    1000006    25
    0.26174883   2    1000006    23
    0.15108438   2    1000025    6
    0.14913322   2    1000023    6
    0.04003154   2    1000037    5
    0.020322171   2    1000035    6
    0.019955032   2    1000024    5
    0.0048406289   2    1000022    6
    0.0011529562   2    1000005    24

DECAY 1000024  1.0905658
    0.67724456   2    1000022    24
    0.31849135   2   -1000005    6
    0.0040852273   3    1000022   -5    6
    0.00017881879   2    2000004   -3

DECAY 1000037  22.324981
    0.25542686   2    1000024    25
    0.23827773   2    1000025    24
    0.23697523   2    1000023    24
    0.23600521   2    1000024    23
    0.012796767   3    1000024    6   -6
    0.0095576646   3    1000023   -5    6
    0.0074308199   3    1000025   -5    6
    0.003066641   2    1000006   -5
    0.00028044794   2    1000022    24

DECAY 1000022 -1


DECAY 1000023  1.0872432
    0.5987205   2    1000022    25
    0.17416017   2    1000005   -5
    0.17416017   2   -1000005    5
    0.022261175   2    1000022    23
    0.0076834214   2    2000004   -4
    0.0076834214   2   -2000004    4
    0.0075998644   2    2000002   -2
    0.0075998644   2   -2000002    2
    0.0001305386   3    1000022    6   -6

DECAY 1000025  1.6786299
    0.4859617   2    1000022    23
    0.28701587   2    1000022    25
    0.11311396   2    1000005   -5
    0.11311396   2   -1000005    5
    0.00020729811   2    2000004   -4
    0.00020729811   2   -2000004    4
    0.00014770785   2    2000002   -2
    0.00014770785   2   -2000002    2

DECAY 1000035  25.657258
    0.2054791   2    1000024   -24
    0.2054791   2   -1000024    24
    0.20457584   2    1000023    25
    0.19150915   2    1000025    23
    0.14998448   2    1000025    25
    0.016354619   2    1000023    23
    0.0079650095   3    1000024    5   -6
    0.0079650095   3   -1000024   -5    6
    0.0046884183   3    1000023    6   -6
    0.0035106387   3    1000025    6   -6
    0.00099972832   2    1000006   -6
    0.00099972832   2   -1000006    6
    0.00029725043   2    1000022    25

DECAY 1000021  818.4915
    0.071224456   2    2000002   -2
    0.071224456   2   -2000002    2
    0.071224455   2    2000004   -4
    0.071224455   2   -2000004    4
    0.070739233   2    1000005   -5
    0.070739233   2   -1000005    5
    0.051355398   2    2000003   -3
    0.051355398   2   -2000003    3
    0.05135538   2    2000001   -1
    0.05135538   2   -2000001    1
    0.042216857   2    1000006   -6
    0.042216857   2   -1000006    6
    0.03152209   2    1000004   -4
    0.03152209   2   -1000004    4
    0.031522082   2    1000002   -2
    0.031522082   2   -1000002    2
    0.031487568   2    1000003   -3
    0.031487568   2   -1000003    3
    0.031487553   2    1000001   -1
    0.031487553   2   -1000001    1
    0.008423327   2    2000005   -5
    0.008423327   2   -2000005    5
    0.0074117715   2    2000006   -6
    0.0074117715   2   -2000006    6

DECAY 25  0.0039955957
    0.55887383   2   -5    5
    0.2432373   2   -24    24
    0.071525945   2    21    21
    0.064428308   2   -15    15
    0.029958791   2    23    23
    0.027620833   2   -4    4
    0.0023485863   2    22    22
    0.0015722497   2    22    23
    0.00022345211   2   -13    13
    0.00020998142   2   -3    3
    5.805772e-07   2   -1    1
    1.4233429e-07   2   -2    2
    5.0234408e-09   2   -11    11

DECAY 35  8.0942666
    0.55601033   2   -5    5
    0.17634322   2    1000022    1000025
    0.12239064   2   -15    15
    0.069842902   2   -6    6
    0.069817079   2    1000022    1000023
    0.0021836379   2   -1000024    1000024
    0.0021583165   2    1000022    1000022
    0.00042622312   2   -13    13
    0.00022425618   2   -3    3
    0.00021583168   2    25    25
    0.00016032435   2    1000025    1000025
    0.0001147723   2    1000023    1000025
    2.9048186e-05   2   -1000002    1000002
    2.9036385e-05   2   -1000004    1000004
    2.7482348e-05   2    23    23
    9.8935635e-06   2    21    21
    8.4150897e-06   2   -24    24
    4.1605429e-06   2   -1000005    1000005
    2.7621853e-06   2    1000023    1000023
    7.9796659e-07   2   -4    4
    6.2007872e-07   2   -1    1
    1.3562913e-07   2    22    22
    1.0165503e-07   2    22    23
    9.5727634e-09   2   -11    11
    4.1127209e-12   2   -2    2

DECAY 36  8.0111644
    0.54860218   2   -5    5
    0.17824181   2    1000022    1000023
    0.12075869   2   -15    15
    0.070265692   2    1000022    1000025
    0.069345097   2   -6    6
    0.007666308   2   -1000024    1000024
    0.0039448363   2    1000022    1000022
    0.00042053746   2   -13    13
    0.00034840535   2    1000025    1000025
    0.00022126742   2   -3    3
    6.6292581e-05   2    21    21
    6.0707053e-05   2    1000023    1000025
    4.4795374e-05   2    23    25
    1.1265455e-05   2    1000023    1000023
    7.7922042e-07   2   -4    4
    6.1181443e-07   2   -1    1
    4.5408308e-07   2    22    22
    2.6393927e-07   2    22    23
    9.4450656e-09   2   -11    11
    4.0162159e-12   2   -2    2
    1.8642176e-36   2    25    25

DECAY 37  8.0312028
    0.62760883   2   -5    6
    0.24872442   2    1000022    1000024
    0.1187066   2   -15    16
    0.0022044228   2    1000023    1000024
    0.0011377377   2    1000024    1000025
    0.00079581951   2   -5    4
    0.00041967022   2   -13    14
    0.00020622913   2   -3    4
    0.00012962193   2   -3    6
    4.4772855e-05   2    24    25
    9.6039219e-06   2   -3    2
    5.9311355e-06   2   -1    6
    5.68296e-06   2   -5    2
    5.6911582e-07   2   -1    2
    8.0795484e-08   2   -1    4
    9.8161302e-09   2   -11    12
    2.141594e-11   2   -1000005    1000004
    5.9819693e-12   2   -1000003    1000004
    7.6498993e-13   2    24    35
    7.3083313e-13   2    24    36
    8.8664779e-16   2   -1000001    1000004
    1.6806681e-18   2   -1000003    1000002
    8.0214505e-19   2   -1000005    1000002
    8.7074922e-20   2   -1000001    1000002

DECAY 6  2.43
    1   2    5    24

DECAY 15 -1
