BLOCK SPINFO
   1   SPheno
   2   v4.0.5be

BLOCK SPHENOINFO
   1   2
   2   2

BLOCK MODSEL
   1   0

BLOCK MINPAR
   3    24.520002
   4   -1

BLOCK EXTPAR
   0    1862.4728
   1   -293.07674
   2    2197.242
   3    2096.5261
   11    2436.7513
   12   -5401.5475
   13   -835.08428
   23   -3216.7662
   25    23.746732
   26    3195.0164
   31    2268.0355
   32    2268.0355
   33    2627.2493
   34    1846.5756
   35    1846.5756
   36    2850.244
   41    2914.8652
   42    2914.8652
   43    2496.3202
   44    3778.3806
   45    3778.3806
   46    1259.7608
   47    3165.1164
   48    3165.1164
   49    3537.8665

BLOCK SMINPUTS
   1    127.90897
   2    1.1663787e-05
   3    0.1184
   4    91.1876
   5    4.18
   6    173.2
   7    1.777
   8    0
   11    0.00051099893
   12    0
   13    0.10565837
   14    0
   21    0.005
   22    0.0025
   23    0.095
   24    1.27

BLOCK GAUGE Q=  1862.4728
   1    0.35536298
   2    0.66519887
   3    1.219778

BLOCK YU Q=  1862.4728
   1   1    8.391803e-06
   2   2    0.0042630359
   3   3    1.0137972

BLOCK YD Q=  1862.4728
   1   1    0.00040044178
   2   2    0.0076083938
   3   3    0.39711276

BLOCK YE Q=  1862.4728
   1   1    6.9880019e-05
   2   2    0.014448972
   3   3    0.24300793

BLOCK AU Q=  1862.4728
   1   1    0
   2   2    0
   3   3    2436.7513

BLOCK AD Q=  1862.4728
   1   1    0
   2   2    0
   3   3   -5401.5473

BLOCK AE Q=  1862.4728
   1   1    0
   2   2    0
   3   3   -835.08428

BLOCK MSOFT Q=  1862.4728
   1   -293.07674
   2    2197.242
   3    2096.5261
   21   -214755.67
   22   -10267687
   31    2268.0355
   32    2268.0355
   33    2627.2493
   34    1846.5756
   35    1846.5756
   36    2850.244
   41    2914.8652
   42    2914.8652
   43    2496.3202
   44    3778.3806
   45    3778.3806
   46    1259.7608
   47    3165.1164
   48    3165.1164
   49    3537.8665

BLOCK MASS
   6    173.2
   23    91.1876
   24    80.429995
   15    1.777
   25    120.32311
   35    3194.8192
   36    3195.0164
   37    3195.9958
   1000001    2969.532
   2000001    3205.4387
   1000002    2968.6155
   2000002    3817.6621
   1000003    2969.5301
   2000003    3205.4388
   1000004    2968.6156
   2000004    3817.6622
   1000005    2557.9985
   2000005    3576.5162
   1000006    1350.8376
   2000006    2567.892
   1000011    2283.1248
   2000011    1844.1338
   1000012    2281.3682
   1000013    2283.1252
   2000013    1844.1167
   1000014    2281.3615
   1000015    2636.5786
   2000015    2850.6177
   1000016    2637.7411
   1000021    2308.7161
   1000022   -293.26323
   1000023    2239.1919
   1000025   -3199.1966
   1000035    3201.2038
   1000024    2239.3052
   1000037    3201.8814

BLOCK ALPHA
      -0.04080356

BLOCK HMIX Q=  1862.4728
   1   -3216.7662
   2    23.746732
   3    243.83632
   4    10208130

BLOCK STOPMIX
   1   1   -0.076966687
   1   2    0.99703367
   2   1   -0.99703367
   2   2   -0.076966687

BLOCK SBOTMIX
   1   1   -0.99944688
   1   2    0.033255553
   2   1   -0.033255553
   2   2   -0.99944688

BLOCK STAUMIX
   1   1   -0.99394371
   1   2    0.10989045
   2   1   -0.10989045
   2   2   -0.99394371

BLOCK NMIX
   1   1   -0.99989498
   1   2   -9.7368136e-05
   1   3    0.014352986
   1   4   -0.0020002937
   2   1    0.00047740948
   2   2    0.99859837
   2   3    0.044109031
   2   4    0.029248344
   3   1   -0.011563395
   3   2    0.01052146
   3   3   -0.70694381
   3   4    0.70709691
   4   1   -0.0087223184
   4   2    0.051870893
   4   3   -0.705747
   4   4   -0.70650867

BLOCK UMIX
   1   1   -0.99800302
   1   2   -0.063166213
   2   1    0.063166213
   2   2   -0.99800302

BLOCK VMIX
   1   1   -0.99911308
   1   2    0.042107744
   2   1    0.042107744
   2   2    0.99911308

BLOCK HIGGSBOUNDSINPUTHIGGSCOUPLINGSFERMIONS
       0, 563.90729,3,36,15,15

BLOCK HIGGSBOUNDSINPUTHIGGSCOUPLINGSBOSONS
       0,4,36,21,21,23

BLOCK SPHENOLOWENERGY
   1    0.00032032662
   2    1.5899272e-06
   3    3.5247402e-05
   4    2.3896609e-15
   5    1.0208342e-10
   6    2.1359567e-08
   7    8.0734511e-14
   8    3.4489698e-09
   9    7.3119706e-07
   10    9.653561e-05
   11    0.9971759
   12    0.54198181
   13    19.364018
   14    0
   15    0
   16    0.0021573466
   17    2.2816588e-15
   18    2.4798371e-11
   19    8.2896948e-11
   20   -9.8192379e-16
   21   -4.1979938e-11
   22   -1.1645657e-08
   23    0
   24    0
   25    0
   26    0
   27    0
   28    0
   29    0
   30    0
   31    0
   39    6.3425979e-05
   40    0
   41    0
   42    0

BLOCK FWCOEF Q=  160
   305   4422   0   0   -0.18881911
   305   4422   0   2   -0.18839671
   305   4322   0   2   -1.2564181e-05
   305   6421   0   0   -0.095227835
   305   6421   0   2   -0.098056636
   305   6321   0   2   -7.5559275e-05
   3051111   4133   0   0    1.5996011
   3051111   4133   0   2    1.5996167
   3051111   4233   0   2    1.2257101e-06
   3051111   4137   0   0   -4.4222932
   3051111   4137   0   2   -4.4201202
   3051111   4237   0   2   -9.5267268e-06
   3051313   4133   0   0    1.5996011
   3051313   4133   0   2    1.5996159
   3051313   4233   0   2    1.2256694e-06
   3051313   4137   0   0   -4.4222932
   3051313   4137   0   2   -4.4201209
   3051313   4237   0   2   -9.5267097e-06
   3051212   4137   0   0    1.5053501
   3051212   4137   0   2    1.5048776
   3051212   4237   0   2    2.0732308e-06
   3051414   4137   0   0    1.5053501
   3051414   4137   0   2    1.5048776
   3051414   4237   0   2    2.073238e-06
   3051616   4137   0   0    1.5053501
   3051616   4137   0   2    1.5048776
   3051616   4237   0   2    2.0752767e-06

BLOCK IMFWCOEF Q=  160
   305   4422   0   0    3.8587047e-07
   305   4422   0   2   -1.5976854e-06
   305   4322   0   2    1.6776734e-06
   305   6421   0   0    3.3052357e-07
   305   6421   0   2    2.5799529e-06
   305   6321   0   2    1.1960795e-06
   3051111   4133   0   2   -8.4861247e-07
   3051111   4233   0   2    2.6045326e-07
   3051111   4137   0   2    6.9478233e-06
   3051111   4237   0   2   -2.0087078e-06
   3051313   4133   0   2   -8.4860866e-07
   3051313   4233   0   2    2.6045315e-07
   3051313   4137   0   2    6.9478272e-06
   3051313   4237   0   2   -2.0087081e-06
   3051212   4137   0   2   -1.5044869e-06
   3051212   4237   0   2    4.3702911e-07
   3051414   4137   0   2   -1.5044869e-06
   3051414   4237   0   2    4.3702911e-07
   3051616   4137   0   2   -1.5043362e-06
   3051616   4237   0   2    4.3702891e-07

DECAY 23  2.4952


DECAY 24  2.085


DECAY 2000011  8.8015165
    1   2    1000022    11

DECAY 1000011  2.8180374
    0.98456446   2    1000022    11
    0.010266919   2   -1000024    12
    0.0051685945   2    1000023    11

DECAY 2000013  8.8014281
    1   2    1000022    13

DECAY 1000013  2.8211803
    0.98346847   2    1000022    13
    0.010255665   2   -1000024    14
    0.0051629564   2    1000023    13
    0.0011129117   2    2000013    25

DECAY 1000015  6.0343178
    0.5565165   2    1000022    15
    0.2953747   2   -1000024    16
    0.14810881   2    1000023    15

DECAY 2000015  14.820232
    0.93669891   2    1000022    15
    0.030286335   2    1000016   -24
    0.016026465   2    1000015    25
    0.014177008   2    1000015    23
    0.0018676693   2   -1000024    16
    0.0009436101   2    1000023    15

DECAY 1000012  2.8104314
    0.98569954   2    1000022    12
    0.0095215802   2    1000024    11
    0.0047788755   2    1000023    12

DECAY 1000014  2.8104103
    0.98570385   2    1000022    14
    0.0095187266   2    1000024    13
    0.0047774211   2    1000023    14

DECAY 1000016  5.9425098
    0.54356781   2    1000022    16
    0.30446352   2    1000024    15
    0.15196867   2    1000023    16

DECAY 1000001  44.347656
    0.82692549   2    1000021    1
    0.10923435   2   -1000024    2
    0.054687646   2    1000023    1
    0.0091525069   2    1000022    1

DECAY 2000001  60.355939
    0.97085007   2    1000021    1
    0.029149915   2    1000022    1

DECAY 1000003  44.347446
    0.82692562   2    1000021    3
    0.10923408   2   -1000024    4
    0.054687733   2    1000023    3
    0.00915256   2    1000022    3

DECAY 2000003  60.35618
    0.97084634   2    1000021    3
    0.029149812   2    1000022    3

DECAY 1000005  33.934866
    0.73927966   2    1000006   -24
    0.20427791   2    1000021    5
    0.027851552   2   -1000024    6
    0.018136526   2    1000023    5
    0.010454351   2    1000022    5

DECAY 2000005  106.76171
    0.89984267   2    1000021    5
    0.036097739   2    2000006   -24
    0.018537387   2    1000005    23
    0.018391819   2    1000022    5
    0.017810742   2    1000005    25
    0.003933141   2   -1000037    6
    0.0021002928   2    1000025    5
    0.0020814447   2    1000035    5
    0.001200905   2    1000006   -24

DECAY 1000002  44.265442
    0.82664308   2    1000021    2
    0.10946849   2    1000024    1
    0.054701797   2    1000023    2
    0.0091866366   2    1000022    2

DECAY 2000002  129.65717
    0.93503204   2    1000021    2
    0.064966738   2    1000022    2

DECAY 1000004  44.265346
    0.82664274   2    1000021    4
    0.10946885   2    1000024    3
    0.054701753   2    1000023    4
    0.0091866526   2    1000022    4

DECAY 2000004  129.65733
    0.93503025   2    1000021    4
    0.064966637   2    1000022    4

DECAY 1000006  2.623054
    0.99999597   2    1000022    6

DECAY 2000006  39.278987
    0.46933541   2    1000006    25
    0.32375579   2    1000006    23
    0.15119265   2    1000021    6
    0.033169571   2    1000024    5
    0.012965953   2    1000023    6
    0.0095806354   2    1000022    6

DECAY 1000024  0.011542874
    0.24166033   3    1000022   -13    14
    0.24165533   3    1000022   -11    12
    0.20147914   2    1000022    24
    0.18114721   2    1000006   -5
    0.071357757   3    1000022   -15    16
    0.03921267   3    1000022   -5    6
    0.0116606   3    1000022   -3    4
    0.011660482   3    1000022   -1    2
    0.00016647422   2   -2000013    14

DECAY 1000037  96.841551
    0.6835958   2    1000006   -5
    0.12635393   2   -1000005    6
    0.050110997   2    1000024    25
    0.045043645   2    1000023    24
    0.043628981   2    1000024    23
    0.023547588   2    1000022    24
    0.019890403   2    2000006   -5
    0.0020256567   2    1000016   -15
    0.0017058972   3    1000024    6   -6
    0.0014673203   3    1000023   -5    6
    0.0011913554   3    1000022   -5    6
    0.00085362521   2   -2000015    16
    0.0001402977   2   -1000011    12
    0.0001402976   2   -1000013    14

DECAY 1000022 -1


DECAY 1000023  0.012775541
    0.25117033   3    1000022    12   -12
    0.13595101   2    1000022    23
    0.11960693   2    1000006   -6
    0.11960693   2   -1000006    6
    0.1086297   3    1000022    13   -13
    0.10862962   3    1000022    11   -11
    0.070234674   2    1000022    25
    0.032400338   3    1000022    15   -15
    0.01886912   3    1000022    6   -6
    0.013637623   3    1000022    5   -5
    0.0052775206   3    1000022    4   -4
    0.0052775199   3    1000022    2   -2
    0.0052552993   3    1000022    3   -3
    0.0052551803   3    1000022    1   -1

DECAY 1000025  100.5202
    0.32231381   2    1000006   -6
    0.32231381   2   -1000006    6
    0.062927409   2    2000006   -6
    0.062927409   2   -2000006    6
    0.055234321   2    1000023    25
    0.042763902   2    1000024   -24
    0.042763902   2   -1000024    24
    0.040081107   2    1000023    23
    0.012729479   2    1000022    25
    0.0097218669   2    1000005   -5
    0.0097218669   2   -1000005    5
    0.008242728   2    1000022    23
    0.0018332679   3    1000024    5   -6
    0.0018332679   3   -1000024   -5    6
    0.00095141505   2    1000015   -15
    0.00095141505   2   -1000015    15
    0.00091373295   3    1000022    6   -6
    0.00082000088   3    1000023    6   -6
    0.00040167941   2    2000015   -15
    0.00040167941   2   -2000015    15

DECAY 1000035  95.555337
    0.34057423   2    1000006   -6
    0.34057423   2   -1000006    6
    0.064573891   2    2000006   -6
    0.064573891   2   -2000006    6
    0.049047778   2    1000023    25
    0.041845858   2    1000024   -24
    0.041845858   2   -1000024    24
    0.015179586   2    1000022    23
    0.011372356   2    1000022    25
    0.010286545   2    1000005   -5
    0.010286545   2   -1000005    5
    0.0017262187   2    1000023    23
    0.0014905386   3    1000024    5   -6
    0.0014905386   3   -1000024   -5    6
    0.00099663826   2    1000015   -15
    0.00099663826   2   -1000015    15
    0.00090093426   3    1000022    6   -6
    0.00072435143   3    1000023    6   -6
    0.00043534729   2    2000015   -15
    0.00043534729   2   -2000015    15

DECAY 1000021  30.307552
    0.49991239   2    1000006   -6
    0.49991239   2   -1000006    6

DECAY 25  0.0033556472
    0.64111625   2   -5    5
    0.15752971   2   -24    24
    0.075225316   2    21    21
    0.07314875   2   -15    15
    0.031705002   2   -4    4
    0.017356561   2    23    23
    0.0023146527   2    22    22
    0.0011086165   2    22    23
    0.0002537091   2   -13    13
    0.0002405913   2   -3    3
    6.6521006e-07   2   -1    1
    1.6339899e-07   2   -2    2
    5.7037276e-09   2   -11    11

DECAY 35  38.099712
    0.87274652   2   -5    5
    0.087931005   2   -15    15
    0.023762271   2   -1000006    1000006
    0.014738487   2   -6    6
    0.00030064079   2   -13    13
    0.00027932523   2   -3    3
    0.00016411196   2    1000022    1000023
    3.3801197e-05   2    1000022    1000022
    3.150853e-05   2    25    25
    1.0958412e-05   2    21    21
    7.7206482e-07   2   -1    1
    3.0409616e-07   2    23    23
    1.3303497e-07   2   -4    4
    8.4602033e-08   2   -24    24
    5.0836295e-08   2    22    22
    1.6043856e-08   2    22    23
    6.7520898e-09   2   -11    11
    6.8578439e-13   2   -2    2

DECAY 36  35.822258
    0.89542169   2   -5    5
    0.090224725   2   -15    15
    0.013594352   2   -6    6
    0.00030848386   2   -13    13
    0.00028658949   2   -3    3
    0.00010009302   2    1000022    1000023
    3.8010435e-05   2    1000022    1000022
    2.4482391e-05   2    21    21
    7.9213889e-07   2   -1    1
    5.517548e-07   2    23    25
    1.1833824e-07   2   -4    4
    5.5312784e-08   2    22    23
    5.2787785e-08   2    22    22
    6.9282336e-09   2   -11    11
    6.100618e-13   2   -2    2
    2.7054265e-36   2    25    25

DECAY 37  39.850566
    0.90137368   2   -5    6
    0.096429065   2   -15    16
    0.0013291147   2   -5    4
    0.00034091114   2   -13    14
    0.00024946092   2   -3    4
    0.00024720424   2    1000022    1000024
    1.168948e-05   2   -3    2
    9.4912497e-06   2   -5    2
    7.8072486e-06   2   -3    6
    6.9177327e-07   2   -1    2
    4.9671039e-07   2    24    25
    3.4111485e-07   2   -1    6
    3.5444796e-08   2   -1    4
    7.9739471e-09   2   -11    12
    7.7018772e-14   2    24    35

DECAY 6  2.43
    1   2    5    24

DECAY 15 -1
