# SUSY Les Houches Accord 2 - MSSM spectrum + Decays
# SPheno v4.0.5be
# W. Porod, Comput. Phys. Commun. 153 (2003) 275-315, hep-ph/0301101;
# W. Porod, F.~Staub, Comput. Phys. Commun. 183 (2012) 2458
#                     arXiv:1104.1573 [hep-ph] 
# in case of problems send email to porod@physik.uni-wuerzburg.de
# Created: 07.09.2021,  17:29
Block SPINFO         # Program information
     1   SPheno      # spectrum calculator
     2   v4.0.5be    # version number
#
Block SPhenoINFO     # SPheno specific information
    1      2         # using 2-loop RGEs
    2      2         # using pole masses for boundary conditions at mZ
Block MODSEL  # Model selection
    1    0    # general MSSM
Block MINPAR  # Input parameters
    3    1.34783172E+01  # tanb at m_Z    
    4    1.00000000E+00  # Sign(mu)
Block EXTPAR  # non-universal input parameters
    0    3.60064193E+03  # scale for input parameters
    1    2.18192127E+02  # M_1
    2    4.24829718E+02  # M_2
    3    2.81398413E+03  # M_3
   11    5.61598918E+03  # A_t
   12    2.17663658E+02  # A_b
   13    4.82310996E+02  # A_tau
   23    2.36931553E+02  # mu
   25    1.28270437E+01  # tan(beta)
   26    2.52215608E+03  # m_A, pole mass
   31    1.00000000E+04  # M_L11
   32    1.00000000E+04  # M_L22
   33    1.00000000E+04  # M_L33
   34    1.00000000E+04  # M_E11
   35    1.00000000E+04  # M_E22
   36    1.00000000E+04  # M_E33
   41    1.00000000E+04  # M_Q11
   42    1.00000000E+04  # M_Q22
   43    2.56639015E+03  # M_Q33
   44    1.00000000E+04  # M_U11
   45    1.00000000E+04  # M_U22
   46    4.88921318E+03  # M_U33
   47    1.00000000E+04  # M_D11
   48    1.00000000E+04  # M_D22
   49    3.45857376E+03  # M_D33
Block SMINPUTS  # SM parameters
         1     1.27908970E+02  # alpha_em^-1(MZ)^MSbar
         2     1.16637870E-05  # G_mu [GeV^-2]
         3     1.18400000E-01  # alpha_s(MZ)^MSbar
         4     9.11876000E+01  # m_Z(pole)
         5     4.18000000E+00  # m_b(m_b), MSbar
         6     1.73200000E+02  # m_t(pole)
         7     1.77700000E+00  # m_tau(pole)
         8     0.00000000E+00  # m_nu_3
        11     5.10998930E-04  # m_e(pole)
        12     0.00000000E+00  # m_nu_1
        13     1.05658372E-01  # m_muon(pole)
        14     0.00000000E+00  # m_nu_2
        21     5.00000000E-03  # m_d(2 GeV), MSbar
        22     2.50000000E-03  # m_u(2 GeV), MSbar
        23     9.50000000E-02  # m_s(2 GeV), MSbar
        24     1.27000000E+00  # m_c(m_c), MSbar
Block gauge Q=  3.60064193E+03  # (SUSY scale)
   1    3.55362975E-01  # g'(Q)^DRbar
   2    6.65198874E-01  # g(Q)^DRbar
   3    1.21977796E+00  # g3(Q)^DRbar
Block Yu Q=  3.60064193E+03  # (SUSY scale)
  1  1     8.40981283E-06   # Y_u(Q)^DRbar
  2  2     4.27218492E-03   # Y_c(Q)^DRbar
  3  3     1.01597294E+00   # Y_t(Q)^DRbar
Block Yd Q=  3.60064193E+03  # (SUSY scale)
  1  1     2.16766992E-04   # Y_d(Q)^DRbar
  2  2     4.11857286E-03   # Y_s(Q)^DRbar
  3  3     2.14964932E-01   # Y_b(Q)^DRbar
Block Ye Q=  3.60064193E+03  # (SUSY scale)
  1  1     3.78274253E-05   # Y_e(Q)^DRbar
  2  2     7.82151183E-03   # Y_mu(Q)^DRbar
  3  3     1.31544962E-01   # Y_tau(Q)^DRbar
Block Au Q=  3.60064193E+03  # (SUSY scale)
  1  1     0.00000000E+00   # A_u(Q)^DRbar
  2  2     0.00000000E+00   # A_c(Q)^DRbar
  3  3     5.61598918E+03   # A_t(Q)^DRbar
Block Ad Q=  3.60064193E+03  # (SUSY scale)
  1  1     0.00000000E+00   # A_d(Q)^DRbar
  2  2     0.00000000E+00   # A_s(Q)^DRbar
  3  3     2.17663658E+02   # A_b(Q)^DRbar
Block Ae Q=  3.60064193E+03  # (SUSY scale)
  1  1     0.00000000E+00   # A_e(Q)^DRbar
  2  2     0.00000000E+00   # A_mu(Q)^DRbar
  3  3     4.82310994E+02   # A_tau(Q)^DRbar
Block MSOFT Q=  3.60064193E+03  # soft SUSY breaking masses at Q
   1    2.18192127E+02  # M_1
   2    4.24829718E+02  # M_2
   3    2.81398413E+03  # M_3
  21    6.25192161E+06  # M^2_(H,d)
  22    1.31139774E+05  # M^2_(H,u)
  31    1.00000000E+04  # M_(L,11)
  32    1.00000000E+04  # M_(L,22)
  33    1.00000000E+04  # M_(L,33)
  34    1.00000000E+04  # M_(E,11)
  35    1.00000000E+04  # M_(E,22)
  36    1.00000000E+04  # M_(E,33)
  41    1.00000000E+04  # M_(Q,11)
  42    1.00000000E+04  # M_(Q,22)
  43    2.56639015E+03  # M_(Q,33)
  44    1.00000000E+04  # M_(U,11)
  45    1.00000000E+04  # M_(U,22)
  46    4.88921318E+03  # M_(U,33)
  47    1.00000000E+04  # M_(D,11)
  48    1.00000000E+04  # M_(D,22)
  49    3.45857376E+03  # M_(D,33)
Block MASS  # Mass spectrum
#   PDG code      mass          particle
         6     1.73200000E+02  # m_t(pole)
        23     9.11876000E+01  # m_Z(pole)
        24     8.04299946E+01  # W+
        15     1.77700000E+00  # m_tau(pole)
        25     1.27439078E+02  # h0
        35     2.52188634E+03  # H0
        36     2.52215608E+03  # A0
        37     2.52364099E+03  # H+
   1000001     1.01095951E+04  # ~d_L
   2000001     1.00844842E+04  # ~d_R
   1000002     1.01092331E+04  # ~u_L
   2000002     1.00878302E+04  # ~u_R
   1000003     1.01095959E+04  # ~s_L
   2000003     1.00844849E+04  # ~s_R
   1000004     1.01092340E+04  # ~c_L
   2000004     1.00878311E+04  # ~c_R
   1000005     2.67059762E+03  # ~b_1
   2000005     3.55349088E+03  # ~b_2
   1000006     2.66729834E+03  # ~t_1
   2000006     4.86058200E+03  # ~t_2
   1000011     1.00215261E+04  # ~e_L-
   2000011     1.00087509E+04  # ~e_R-
   1000012     1.00207595E+04  # ~nu_eL
   1000013     1.00215282E+04  # ~mu_L-
   2000013     1.00087549E+04  # ~mu_R-
   1000014     1.00207616E+04  # ~nu_muL
   1000015     1.00099069E+04  # ~tau_1-
   2000015     1.00221254E+04  # ~tau_2-
   1000016     1.00213540E+04  # ~nu_tauL
   1000021     3.25866173E+03  # ~g
   1000022     1.94180510E+02  # ~chi_10
   1000023     2.52172088E+02  # ~chi_20
   1000025     2.57713021E+02  # ~chi_30
   1000035     4.82945247E+02  # ~chi_40
   1000024     2.34572026E+02  # ~chi_1+
   1000037     4.83060485E+02  # ~chi_2+
# Higgs mixing
Block alpha # Effective Higgs mixing angle
          -7.43443462E-02   # alpha
Block Hmix Q=  3.60064193E+03  # Higgs mixing parameters
   1    2.36931553E+02  # mu
   2    1.28270437E+01  # tan[beta](Q)
   3    2.43042059E+02  # v(Q)
   4    6.36127129E+06  # m^2_A(Q)
Block stopmix # stop mixing matrix
   1  1    -9.98994433E-01   # Re[R_st(1,1)]
   1  2     4.48343942E-02   # Re[R_st(1,2)]
   2  1    -4.48343942E-02   # Re[R_st(2,1)]
   2  2    -9.98994433E-01   # Re[R_st(2,2)]
Block sbotmix # sbottom mixing matrix
   1  1     9.99999334E-01   # Re[R_sb(1,1)]
   1  2     1.15410623E-03   # Re[R_sb(1,2)]
   2  1    -1.15410623E-03   # Re[R_sb(2,1)]
   2  2     9.99999334E-01   # Re[R_sb(2,2)]
Block staumix # stau mixing matrix
   1  1     1.85640256E-02   # Re[R_sta(1,1)]
   1  2     9.99827674E-01   # Re[R_sta(1,2)]
   2  1    -9.99827674E-01   # Re[R_sta(2,1)]
   2  2     1.85640256E-02   # Re[R_sta(2,2)]
Block Nmix # neutralino mixing matrix
   1  1     7.57403088E-01   # Re[N(1,1)]
   1  2    -1.32735862E-01   # Re[N(1,2)]
   1  3     4.95436103E-01   # Re[N(1,3)]
   1  4    -4.04060418E-01   # Re[N(1,4)]
   2  1     6.09077193E-02   # Re[N(2,1)]
   2  2    -7.50997649E-02   # Re[N(2,2)]
   2  3    -6.94613547E-01   # Re[N(2,3)]
   2  4    -7.12855031E-01   # Re[N(2,4)]
   3  1    -6.48809772E-01   # Re[N(3,1)]
   3  2    -2.22770473E-01   # Re[N(3,2)]
   3  3     5.04887817E-01   # Re[N(3,3)]
   3  4    -5.23934621E-01   # Re[N(3,4)]
   4  1    -4.09474174E-02   # Re[N(4,1)]
   4  2     9.62867869E-01   # Re[N(4,2)]
   4  3     1.30932734E-01   # Re[N(4,3)]
   4  4    -2.32519668E-01   # Re[N(4,4)]
Block Umix # chargino mixing matrix
   1  1    -1.83800268E-01   # Re[U(1,1)]
   1  2     9.82963611E-01   # Re[U(1,2)]
   2  1     9.82963611E-01   # Re[U(2,1)]
   2  2     1.83800268E-01   # Re[U(2,2)]
Block Vmix # chargino mixing matrix
   1  1    -3.27456988E-01   # Re[V(1,1)]
   1  2     9.44866086E-01   # Re[V(1,2)]
   2  1     9.44866086E-01   # Re[V(2,1)]
   2  2     3.27456988E-01   # Re[V(2,2)]
DECAY        23     2.49520000E+00   # Z
DECAY        24     2.08500000E+00   # W
DECAY   2000011     5.02399129E+01   # ~e^-_R
#    BR                NDA      ID1      ID2
     5.73802771E-01    2     1000022        11   # BR(~e^-_R -> chi^0_1 e^-)
     3.70876180E-03    2     1000023        11   # BR(~e^-_R -> chi^0_2 e^-)
     4.20817894E-01    2     1000025        11   # BR(~e^-_R -> chi^0_3 e^-)
     1.67056691E-03    2     1000035        11   # BR(~e^-_R -> chi^0_4 e^-)
DECAY   1000011     1.44317051E+02   # ~e^-_L
#    BR                NDA      ID1      ID2
     2.25767874E-02    2     1000022        11   # BR(~e^-_L -> chi^0_1 e^-)
     5.52975564E-04    2     1000023        11   # BR(~e^-_L -> chi^0_2 e^-)
     9.89569327E-02    2     1000025        11   # BR(~e^-_L -> chi^0_3 e^-)
     2.69384477E-01    2     1000035        11   # BR(~e^-_L -> chi^0_4 e^-)
     2.06284046E-02    2    -1000024        12   # BR(~e^-_L -> chi^-_1 nu_e)
     5.87900423E-01    2    -1000037        12   # BR(~e^-_L -> chi^-_2 nu_e)
#    BR                NDA      ID1      ID2       ID3
DECAY   2000013     5.02642654E+01   # ~mu^-_R
#    BR                NDA      ID1      ID2
     5.73584434E-01    2     1000022        13   # BR(~mu^-_R -> chi^0_1 mu^-)
     3.82374406E-03    2     1000023        13   # BR(~mu^-_R -> chi^0_2 mu^-)
     4.20675880E-01    2     1000025        13   # BR(~mu^-_R -> chi^0_3 mu^-)
     1.67389355E-03    2     1000035        13   # BR(~mu^-_R -> chi^0_4 mu^-)
     2.33899840E-04    2    -1000024        14   # BR(~mu^-_R -> chi^-_1 nu_mu)
DECAY   1000013     1.44329263E+02   # ~mu^-_L
#    BR                NDA      ID1      ID2
     2.25956091E-02    2     1000022        13   # BR(~mu^-_L -> chi^0_1 mu^-)
     5.93649945E-04    2     1000023        13   # BR(~mu^-_L -> chi^0_2 mu^-)
     9.89700915E-02    2     1000025        13   # BR(~mu^-_L -> chi^0_3 mu^-)
     2.69363183E-01    2     1000035        13   # BR(~mu^-_L -> chi^0_4 mu^-)
     2.06266634E-02    2    -1000024        14   # BR(~mu^-_L -> chi^-_1 nu_mu)
     5.87850803E-01    2    -1000037        14   # BR(~mu^-_L -> chi^-_2 nu_mu)
#    BR                NDA      ID1      ID2       ID3
DECAY   1000015     5.71611187E+01   # ~tau^-_1
#    BR                NDA      ID1      ID2
     5.21143222E-01    2     1000022        15   # BR(~tau^-_1 -> chi^0_1 tau^-)
     3.17118555E-02    2     1000023        15   # BR(~tau^-_1 -> chi^0_2 tau^-)
     3.84714343E-01    2     1000025        15   # BR(~tau^-_1 -> chi^0_3 tau^-)
     1.70383154E-03    2     1000035        15   # BR(~tau^-_1 -> chi^0_4 tau^-)
     6.02244533E-02    2    -1000024        16   # BR(~tau^-_1 -> chi^-_1 nu_tau)
     5.02294463E-04    2    -1000037        16   # BR(~tau^-_1 -> chi^-_2 nu_tau)
DECAY   2000015     1.47739841E+02   # ~tau^-_2
#    BR                NDA      ID1      ID2
     2.70181345E-02    2     1000022        15   # BR(~tau^-_2 -> chi^0_1 tau^-)
     1.20251893E-02    2     1000023        15   # BR(~tau^-_2 -> chi^0_2 tau^-)
     1.02824322E-01    2     1000025        15   # BR(~tau^-_2 -> chi^0_3 tau^-)
     2.63865498E-01    2     1000035        15   # BR(~tau^-_2 -> chi^0_4 tau^-)
     1.93613832E-02    2    -1000024        16   # BR(~tau^-_2 -> chi^-_1 nu_tau)
     5.74905473E-01    2    -1000037        16   # BR(~tau^-_2 -> chi^-_2 nu_tau)
#    BR                NDA      ID1      ID2       ID3
DECAY   1000012     1.44322009E+02   # ~nu_e
#    BR                NDA      ID1      ID2
     8.81798992E-02    2     1000022        12   # BR(~nu_e -> chi^0_1 nu_e)
     3.53632074E-03    2     1000023        12   # BR(~nu_e -> chi^0_2 nu_e)
     4.68056342E-03    2     1000025        12   # BR(~nu_e -> chi^0_3 nu_e)
     2.94983048E-01    2     1000035        12   # BR(~nu_e -> chi^0_4 nu_e)
     6.54686948E-02    2     1000024        11   # BR(~nu_e -> chi^+_1 e^-)
     5.43151473E-01    2     1000037        11   # BR(~nu_e -> chi^+_2 e^-)
#    BR                NDA      ID1      ID2       ID3
DECAY   1000014     1.44334220E+02   # ~nu_mu
#    BR                NDA      ID1      ID2
     8.81724573E-02    2     1000022        14   # BR(~nu_mu -> chi^0_1 nu_mu)
     3.53602230E-03    2     1000023        14   # BR(~nu_mu -> chi^0_2 nu_mu)
     4.68016841E-03    2     1000025        14   # BR(~nu_mu -> chi^0_3 nu_mu)
     2.94958154E-01    2     1000035        14   # BR(~nu_mu -> chi^0_4 nu_mu)
     6.55447188E-02    2     1000024        13   # BR(~nu_mu -> chi^+_1 mu^-)
     5.43108479E-01    2     1000037        13   # BR(~nu_mu -> chi^+_2 mu^-)
#    BR                NDA      ID1      ID2       ID3
DECAY   1000016     1.47776340E+02   # ~nu_tau
#    BR                NDA      ID1      ID2
     8.61237756E-02    2     1000022        16   # BR(~nu_tau -> chi^0_1 nu_tau)
     3.45386324E-03    2     1000023        16   # BR(~nu_tau -> chi^0_2 nu_tau)
     4.57142529E-03    2     1000025        16   # BR(~nu_tau -> chi^0_3 nu_tau)
     2.88104952E-01    2     1000035        16   # BR(~nu_tau -> chi^0_4 nu_tau)
     8.64734597E-02    2     1000024        15   # BR(~nu_tau -> chi^+_1 tau^-)
     5.31272524E-01    2     1000037        15   # BR(~nu_tau -> chi^+_2 tau^-)
#    BR                NDA      ID1      ID2       ID3
DECAY   2000001     6.44072983E+02   # ~d_R
#    BR                NDA      ID1      ID2
     5.01086775E-03    2     1000022         1   # BR(~d_R -> chi^0_1 d)
     3.67492395E-03    2     1000025         1   # BR(~d_R -> chi^0_3 d)
     9.91267209E-01    2     1000021         1   # BR(~d_R -> ~g d)
DECAY   1000001     7.75093046E+02   # ~d_L
#    BR                NDA      ID1      ID2
     4.10833032E-03    2     1000022         1   # BR(~d_L -> chi^0_1 d)
     4.23543493E-04    2     1000023         1   # BR(~d_L -> chi^0_2 d)
     6.59311242E-04    2     1000025         1   # BR(~d_L -> chi^0_3 d)
     5.37879436E-02    2     1000035         1   # BR(~d_L -> chi^0_4 d)
     3.87469575E-03    2    -1000024         2   # BR(~d_L -> chi^-_1 u)
     1.10433940E-01    2    -1000037         2   # BR(~d_L -> chi^-_2 u)
     8.26712236E-01    2     1000021         1   # BR(~d_L -> ~g d)
DECAY   2000003     6.44079828E+02   # ~s_R
#    BR                NDA      ID1      ID2
     5.01210707E-03    2     1000022         3   # BR(~s_R -> chi^0_1 s)
     3.67622671E-03    2     1000025         3   # BR(~s_R -> chi^0_3 s)
     9.91256776E-01    2     1000021         3   # BR(~s_R -> ~g s)
DECAY   1000003     7.75100194E+02   # ~s_L
#    BR                NDA      ID1      ID2
     4.10936923E-03    2     1000022         3   # BR(~s_L -> chi^0_1 s)
     4.25654836E-04    2     1000023         3   # BR(~s_L -> chi^0_2 s)
     6.60422580E-04    2     1000025         3   # BR(~s_L -> chi^0_3 s)
     5.37875270E-02    2     1000035         3   # BR(~s_L -> chi^0_4 s)
     3.87888207E-03    2    -1000024         4   # BR(~s_L -> chi^-_1 c)
     1.10433438E-01    2    -1000037         4   # BR(~s_L -> chi^-_2 c)
     8.26704706E-01    2     1000021         3   # BR(~s_L -> ~g s)
DECAY   1000005     8.92844330E+01   # ~b_1
#    BR                NDA      ID1      ID2
     1.60400848E-02    2     1000022         5   # BR(~b_1 -> chi^0_1 b)
     1.39789463E-02    2     1000023         5   # BR(~b_1 -> chi^0_2 b)
     8.35485998E-03    2     1000025         5   # BR(~b_1 -> chi^0_3 b)
     1.16374607E-01    2     1000035         5   # BR(~b_1 -> chi^0_4 b)
     5.42464112E-01    2    -1000024         6   # BR(~b_1 -> chi^-_1 t)
     3.02787390E-01    2    -1000037         6   # BR(~b_1 -> chi^-_2 t)
DECAY   2000005     1.55260377E+01   # ~b_2
#    BR                NDA      ID1      ID2
     1.23904015E-01    2     1000022         5   # BR(~b_2 -> chi^0_1 b)
     1.01048923E-01    2     1000023         5   # BR(~b_2 -> chi^0_2 b)
     1.06381072E-01    2     1000025         5   # BR(~b_2 -> chi^0_3 b)
     3.81525840E-03    2     1000035         5   # BR(~b_2 -> chi^0_4 b)
     2.00315642E-01    2    -1000024         6   # BR(~b_2 -> chi^-_1 t)
     7.07924564E-03    2    -1000037         6   # BR(~b_2 -> chi^-_2 t)
     4.56960823E-01    2     1000021         5   # BR(~b_2 -> ~g b)
     2.14774183E-04    2     1000006       -24   # BR(~b_2 -> ~t_1 W^-)
     1.06176254E-04    2     1000005        23   # BR(~b_2 -> ~b_1 Z)
     1.74069848E-04    2     1000005        25   # BR(~b_2 -> ~b_1 h^0)
DECAY   2000002     6.61264667E+02   # ~u_R
#    BR                NDA      ID1      ID2
     1.95288502E-02    2     1000022         2   # BR(~u_R -> chi^0_1 u)
     1.26225238E-04    2     1000023         2   # BR(~u_R -> chi^0_2 u)
     1.43222787E-02    2     1000025         2   # BR(~u_R -> chi^0_3 u)
     9.65965786E-01    2     1000021         2   # BR(~u_R -> ~g u)
DECAY   1000002     7.75079662E+02   # ~u_L
#    BR                NDA      ID1      ID2
     2.36717759E-04    2     1000023         2   # BR(~u_L -> chi^0_2 u)
     6.56191526E-03    2     1000025         2   # BR(~u_L -> chi^0_3 u)
     5.21820467E-02    2     1000035         2   # BR(~u_L -> chi^0_4 u)
     1.22983311E-02    2     1000024         1   # BR(~u_L -> chi^+_1 d)
     1.02037548E-01    2     1000037         1   # BR(~u_L -> chi^+_2 d)
     8.26683179E-01    2     1000021         2   # BR(~u_L -> ~g u)
DECAY   2000004     6.61272037E+02   # ~c_R
#    BR                NDA      ID1      ID2
     1.95295358E-02    2     1000022         4   # BR(~c_R -> chi^0_1 c)
     1.29034865E-04    2     1000023         4   # BR(~c_R -> chi^0_2 c)
     1.43236405E-02    2     1000025         4   # BR(~c_R -> chi^0_3 c)
     9.65955100E-01    2     1000021         4   # BR(~c_R -> ~g c)
DECAY   1000004     7.75086790E+02   # ~c_L
#    BR                NDA      ID1      ID2
     2.39118840E-04    2     1000023         4   # BR(~c_L -> chi^0_2 c)
     6.56315227E-03    2     1000025         4   # BR(~c_L -> chi^0_3 c)
     5.21818274E-02    2     1000035         4   # BR(~c_L -> chi^0_4 c)
     1.23024549E-02    2     1000024         3   # BR(~c_L -> chi^+_1 s)
     1.02036767E-01    2     1000037         3   # BR(~c_L -> chi^+_2 s)
     8.26675644E-01    2     1000021         4   # BR(~c_L -> ~g c)
DECAY   1000006     8.95219880E+01   # ~t_1
#    BR                NDA      ID1      ID2
     9.27507214E-02    2     1000022         6   # BR(~t_1 -> chi^0_1 t)
     3.01413498E-01    2     1000023         6   # BR(~t_1 -> chi^0_2 t)
     1.78574242E-01    2     1000025         6   # BR(~t_1 -> chi^0_3 t)
     1.49769097E-01    2     1000035         6   # BR(~t_1 -> chi^0_4 t)
     4.37775750E-02    2     1000024         5   # BR(~t_1 -> chi^+_1 b)
     2.30002122E-01    2     1000037         5   # BR(~t_1 -> chi^+_2 b)
#    BR                NDA      ID1      ID2       ID3
     3.71271068E-03    3     1000022        24         5   # BR(~t_1 -> chi^0_1 W^+ b)
DECAY   2000006     4.50632253E+02   # ~t_2
#    BR                NDA      ID1      ID2
     5.15129607E-02    2     1000022         6   # BR(~t_2 -> chi^0_1 t)
     1.12390799E-01    2     1000023         6   # BR(~t_2 -> chi^0_2 t)
     6.99304015E-02    2     1000025         6   # BR(~t_2 -> chi^0_3 t)
     9.77940882E-03    2     1000035         6   # BR(~t_2 -> chi^0_4 t)
     2.00466818E-01    2     1000024         5   # BR(~t_2 -> chi^+_1 b)
     1.94639080E-02    2     1000037         5   # BR(~t_2 -> chi^+_2 b)
     2.57868966E-01    2     1000021         6   # BR(~t_2 -> ~g t)
     1.18320641E-01    2     1000005        24   # BR(~t_2 -> ~b_1 W^+)
     5.91941313E-02    2     1000006        23   # BR(~t_2 -> ~t_1 Z)
     1.01071919E-01    2     1000006        25   # BR(~t_2 -> ~t_1 h^0)
DECAY   1000024     6.49097991E-05   # chi^+_1
#    BR                NDA      ID1      ID2       ID3
     3.34180863E-01    3     1000022        -1         2   # BR(chi^+_1 -> chi^0_1 d_bar u)
     3.32699554E-01    3     1000022        -3         4   # BR(chi^+_1 -> chi^0_1 s_bar c)
     1.11393701E-01    3     1000022       -11        12   # BR(chi^+_1 -> chi^0_1 e^+ nu_e)
     1.11393064E-01    3     1000022       -13        14   # BR(chi^+_1 -> chi^0_1 mu^+ nu_mu)
     1.10332818E-01    3     1000022       -15        16   # BR(chi^+_1 -> chi^0_1 tau^+ nu_tau)
DECAY   1000037     3.78352999E+00   # chi^+_2
#    BR                NDA      ID1      ID2
     5.94309102E-02    2     1000022        24   # BR(chi^+_2 -> chi^0_1 W^+)
     3.13637870E-01    2     1000023        24   # BR(chi^+_2 -> chi^0_2 W^+)
     1.98633993E-01    2     1000025        24   # BR(chi^+_2 -> chi^0_3 W^+)
     2.45448114E-01    2     1000024        23   # BR(chi^+_2 -> chi^+_1 Z)
     1.82665238E-01    2     1000024        25   # BR(chi^+_2 -> chi^+_1 h^0)
#    BR                NDA      ID1      ID2       ID3
DECAY   1000022     0.00000000E+00   # chi^0_1
DECAY   1000023     1.02229098E-03   # chi^0_2
#    BR                NDA      ID1      ID2
     8.70311926E-03    2     1000022        22   # BR(chi^0_2 -> chi^0_1 photon)
#    BR                NDA      ID1      ID2       ID3
     1.17099540E-01    3     1000022         2        -2   # BR(chi^0_2 -> chi^0_1 u u_bar)
     1.16486017E-01    3     1000022         4        -4   # BR(chi^0_2 -> chi^0_1 c c_bar)
     1.50144166E-01    3     1000022         1        -1   # BR(chi^0_2 -> chi^0_1 d d_bar)
     1.50140445E-01    3     1000022         3        -3   # BR(chi^0_2 -> chi^0_1 s s_bar)
     1.43124833E-01    3     1000022         5        -5   # BR(chi^0_2 -> chi^0_1 b b_bar)
     3.38832373E-02    3     1000022        11       -11   # BR(chi^0_2 -> chi^0_1 e^- e^+)
     3.38818815E-02    3     1000022        13       -13   # BR(chi^0_2 -> chi^0_1 mu^- mu^+)
     3.35024067E-02    3     1000022        15       -15   # BR(chi^0_2 -> chi^0_1 tau^- tau^+)
     2.00788547E-01    3     1000022        12       -12   # BR(chi^0_2 -> chi^0_1 nu_e nu_bar_e)
     2.06912338E-03    3     1000024         1        -2   # BR(chi^0_2 -> chi^+_1 d u_bar)
     2.06912338E-03    3    -1000024        -1         2   # BR(chi^0_2 -> chi^-_1 d_bar u)
     2.01758524E-03    3     1000024         3        -4   # BR(chi^0_2 -> chi^+_1 s c_bar)
     2.01758524E-03    3    -1000024        -3         4   # BR(chi^0_2 -> chi^-_1 s_bar c)
     6.89708794E-04    3     1000024        11       -12   # BR(chi^0_2 -> chi^+_1 e^- nu_bar_e)
     6.89708794E-04    3    -1000024       -11        12   # BR(chi^0_2 -> chi^-_1 e^+ nu_e)
     6.89625250E-04    3     1000024        13       -14   # BR(chi^0_2 -> chi^+_1 mu^- nu_bar_mu)
     6.89625250E-04    3    -1000024       -13        14   # BR(chi^0_2 -> chi^-_1 mu^+ nu_mu)
     6.56860514E-04    3     1000024        15       -16   # BR(chi^0_2 -> chi^+_1 tau^- nu_bar_tau)
     6.56860514E-04    3    -1000024       -15        16   # BR(chi^0_2 -> chi^-_1 tau^+ nu_tau)
DECAY   1000025     1.79662188E-05   # chi^0_3
#    BR                NDA      ID1      ID2
     4.93933991E-03    2     1000022        22   # BR(chi^0_3 -> chi^0_1 photon)
     1.04733274E-03    2     1000023        22   # BR(chi^0_3 -> chi^0_2 photon)
#    BR                NDA      ID1      ID2       ID3
     4.29972784E-02    3     1000022         2        -2   # BR(chi^0_3 -> chi^0_1 u u_bar)
     4.28309888E-02    3     1000022         4        -4   # BR(chi^0_3 -> chi^0_1 c c_bar)
     5.51169287E-02    3     1000022         1        -1   # BR(chi^0_3 -> chi^0_1 d d_bar)
     5.51159383E-02    3     1000022         3        -3   # BR(chi^0_3 -> chi^0_1 s s_bar)
     5.34262709E-02    3     1000022         5        -5   # BR(chi^0_3 -> chi^0_1 b b_bar)
     1.24176555E-02    3     1000022        11       -11   # BR(chi^0_3 -> chi^0_1 e^- e^+)
     1.24173473E-02    3     1000022        13       -13   # BR(chi^0_3 -> chi^0_1 mu^- mu^+)
     1.23308727E-02    3     1000022        15       -15   # BR(chi^0_3 -> chi^0_1 tau^- tau^+)
     7.37155128E-02    3     1000022        12       -12   # BR(chi^0_3 -> chi^0_1 nu_e nu_bar_e)
     1.04761081E-04    3     1000023        12       -12   # BR(chi^0_3 -> chi^0_2 nu_e nu_bar_e)
     1.06395434E-01    3     1000024         1        -2   # BR(chi^0_3 -> chi^+_1 d u_bar)
     1.06395434E-01    3    -1000024        -1         2   # BR(chi^0_3 -> chi^-_1 d_bar u)
     1.04857757E-01    3     1000024         3        -4   # BR(chi^0_3 -> chi^+_1 s c_bar)
     1.04857757E-01    3    -1000024        -3         4   # BR(chi^0_3 -> chi^-_1 s_bar c)
     3.54648959E-02    3     1000024        11       -12   # BR(chi^0_3 -> chi^+_1 e^- nu_bar_e)
     3.54648959E-02    3    -1000024       -11        12   # BR(chi^0_3 -> chi^-_1 e^+ nu_e)
     3.54645817E-02    3     1000024        13       -14   # BR(chi^0_3 -> chi^+_1 mu^- nu_bar_mu)
     3.54645817E-02    3    -1000024       -13        14   # BR(chi^0_3 -> chi^-_1 mu^+ nu_mu)
     3.44445627E-02    3     1000024        15       -16   # BR(chi^0_3 -> chi^+_1 tau^- nu_bar_tau)
     3.44445627E-02    3    -1000024       -15        16   # BR(chi^0_3 -> chi^-_1 tau^+ nu_tau)
DECAY   1000035     4.37944094E+00   # chi^0_4
#    BR                NDA      ID1      ID2
     2.27635703E-01    2     1000024       -24   # BR(chi^0_4 -> chi^+_1 W^-)
     2.27635703E-01    2    -1000024        24   # BR(chi^0_4 -> chi^-_1 W^+)
     4.82829708E-03    2     1000022        23   # BR(chi^0_4 -> chi^0_1 Z)
     2.61313564E-01    2     1000023        23   # BR(chi^0_4 -> chi^0_2 Z)
     1.17947654E-02    2     1000025        23   # BR(chi^0_4 -> chi^0_3 Z)
     3.12578776E-02    2     1000022        25   # BR(chi^0_4 -> chi^0_1 h^0)
     1.26514127E-01    2     1000023        25   # BR(chi^0_4 -> chi^0_2 h^0)
     1.08760805E-01    2     1000025        25   # BR(chi^0_4 -> chi^0_3 h^0)
#    BR                NDA      ID1      ID2       ID3
     1.16715459E-04    3     1000024         5        -6   # BR(chi^0_4 -> chi^+_1 b t_bar)
     1.16715459E-04    3    -1000024        -5         6   # BR(chi^0_4 -> chi^-_1 b_bar t)
DECAY   1000021     2.08680081E+01   # ~g
#    BR                NDA      ID1      ID2
     2.49563563E-01    2     1000006        -6   # BR(~g -> ~t_1 t_bar)
     2.49563563E-01    2    -1000006         6   # BR(~g -> ~t^*_1 t)
     2.49170364E-01    2     1000005        -5   # BR(~g -> ~b_1 b_bar)
     2.49170364E-01    2    -1000005         5   # BR(~g -> ~b^*_1 b)
     1.61784935E-04    2     1000023        21   # BR(~g -> chi^0_2 g)
#    BR                NDA      ID1      ID2       ID3
     1.57205636E-04    3     1000022         6        -6   # BR(~g -> chi^0_1 t t_bar)
     1.42422955E-04    3     1000022         5        -5   # BR(~g -> chi^0_1 b b_bar)
     3.54019027E-04    3     1000023         6        -6   # BR(~g -> chi^0_2 t t_bar)
     1.11142765E-04    3     1000023         5        -5   # BR(~g -> chi^0_2 b b_bar)
     2.40431891E-04    3     1000025         6        -6   # BR(~g -> chi^0_3 t t_bar)
     1.22324788E-04    3     1000025         5        -5   # BR(~g -> chi^0_3 b b_bar)
     4.35964599E-04    3     1000024         5        -6   # BR(~g -> chi^+_1 b t_bar)
     4.35964599E-04    3    -1000024        -5         6   # BR(~g -> chi^-_1 b_bar t)
DECAY        25     3.75328083E-03   # Gamma(h0)
     2.65189328E-03   2        22        22   # BR(h0 -> photon photon)
     1.92181285E-03   2        22        23   # BR(h0 -> photon Z)
     3.85244416E-02   2        23        23   # BR(h0 -> Z Z)
     3.03714749E-01   2       -24        24   # BR(h0 -> W W)
     7.93731139E-02   2        21        21   # BR(h0 -> gluon gluon)
     4.44048240E-09   2       -11        11   # BR(h0 -> Electron electron)
     1.97521760E-04   2       -13        13   # BR(h0 -> Muon muon)
     5.69553716E-02   2       -15        15   # BR(h0 -> Tau tau)
     1.25298997E-07   2        -2         2   # BR(h0 -> Up up)
     2.43205621E-02   2        -4         4   # BR(h0 -> Charm charm)
     5.12177129E-07   2        -1         1   # BR(h0 -> Down down)
     1.85242349E-04   2        -3         3   # BR(h0 -> Strange strange)
     4.92154650E-01   2        -5         5   # BR(h0 -> Bottom bottom)
DECAY        35     3.70738750E+01   # Gamma(HH)
     1.60729164E-07   2        22        22   # BR(HH -> photon photon)
     2.99437168E-07   2        22        23   # BR(HH -> photon Z)
     7.89022471E-06   2        23        23   # BR(HH -> Z Z)
     3.01301937E-06   2       -24        24   # BR(HH -> W W)
     1.69607604E-06   2        21        21   # BR(HH -> gluon gluon)
     1.64057807E-09   2       -11        11   # BR(HH -> Electron electron)
     7.30420483E-05   2       -13        13   # BR(HH -> Muon muon)
     2.10948468E-02   2       -15        15   # BR(HH -> Tau tau)
     8.08006628E-13   2        -2         2   # BR(HH -> Up up)
     1.56738275E-07   2        -4         4   # BR(HH -> Charm charm)
     1.14171003E-02   2        -6         6   # BR(HH -> Top top)
     1.22871441E-07   2        -1         1   # BR(HH -> Down down)
     4.44424684E-05   2        -3         3   # BR(HH -> Strange strange)
     1.13312927E-01   2        -5         5   # BR(HH -> Bottom bottom)
     5.95410803E-02   2  -1000024   1000024   # BR(HH -> Chargino1 chargino1)
     2.23024816E-01   2  -1000024   1000037   # BR(HH -> Chargino1 chargino2)
     2.23024816E-01   2  -1000037   1000024   # BR(HH -> Chargino2 chargino1)
     1.27045899E-02   2  -1000037   1000037   # BR(HH -> Chargino2 chargino2)
     3.90766497E-02   2   1000022   1000022   # BR(HH -> neutralino1 neutralino1)
     3.28143371E-02   2   1000022   1000023   # BR(HH -> neutralino1 neutralino2)
     6.75240285E-03   2   1000022   1000025   # BR(HH -> neutralino1 neutralino3)
     4.42685550E-02   2   1000022   1000035   # BR(HH -> neutralino1 neutralino4)
     3.69053856E-03   2   1000023   1000023   # BR(HH -> neutralino2 neutralino2)
     6.33787183E-03   2   1000023   1000025   # BR(HH -> neutralino2 neutralino3)
     1.47088299E-01   2   1000023   1000035   # BR(HH -> neutralino2 neutralino4)
     1.86683626E-03   2   1000025   1000025   # BR(HH -> neutralino3 neutralino3)
     4.65787289E-02   2   1000025   1000035   # BR(HH -> neutralino3 neutralino4)
     7.23208663E-03   2   1000035   1000035   # BR(HH -> neutralino4 neutralino4)
     4.26934077E-05   2        25        25   # BR(HH -> h0 h0)
DECAY        36     3.68706008E+01   # Gamma(A0)
     1.97019697E-07   2        22        22   # BR(A0 -> photon photon)
     2.92878536E-07   2        22        23   # BR(A0 -> photon Z)
     1.56801465E-05   2        21        21   # BR(A0 -> gluon gluon)
     1.58660899E-09   2       -11        11   # BR(A0 -> Electron electron)
     7.06392909E-05   2       -13        13   # BR(A0 -> Muon muon)
     2.04009652E-02   2       -15        15   # BR(A0 -> Tau tau)
     7.66513239E-13   2        -2         2   # BR(A0 -> Up up)
     1.48678799E-07   2        -4         4   # BR(A0 -> Charm charm)
     1.10498308E-02   2        -6         6   # BR(A0 -> Top top)
     1.18827629E-07   2        -1         1   # BR(A0 -> Down down)
     4.29798708E-05   2        -3         3   # BR(A0 -> Strange strange)
     1.09584726E-01   2        -5         5   # BR(A0 -> Bottom bottom)
     7.28632447E-02   2  -1000024   1000024   # BR(A0 -> Chargino1 chargino1)
     2.11633105E-01   2  -1000024   1000037   # BR(A0 -> Chargino1 chargino2)
     2.11633105E-01   2  -1000037   1000024   # BR(A0 -> Chargino2 chargino1)
     2.51095212E-02   2  -1000037   1000037   # BR(A0 -> Chargino2 chargino2)
     5.13715950E-02   2   1000022   1000022   # BR(A0 -> neutralino1 neutralino1)
     2.12175995E-02   2   1000022   1000023   # BR(A0 -> neutralino1 neutralino2)
     9.83683988E-03   2   1000022   1000025   # BR(A0 -> neutralino1 neutralino3)
     5.72893424E-02   2   1000022   1000035   # BR(A0 -> neutralino1 neutralino4)
     2.83676434E-03   2   1000023   1000023   # BR(A0 -> neutralino2 neutralino2)
     5.59594951E-03   2   1000023   1000025   # BR(A0 -> neutralino2 neutralino3)
     1.03392148E-01   2   1000023   1000035   # BR(A0 -> neutralino2 neutralino4)
     2.66905601E-03   2   1000025   1000025   # BR(A0 -> neutralino3 neutralino3)
     6.94583738E-02   2   1000025   1000035   # BR(A0 -> neutralino3 neutralino4)
     1.39161654E-02   2   1000035   1000035   # BR(A0 -> neutralino4 neutralino4)
     1.16096088E-05   2        23        25   # BR(A0 -> Z h0)
     3.72858218E-38   2        25        25   # BR(A0 -> h0 h0)
DECAY        37     3.80245584E+01   # Gamma(Hp)
     1.99386341E-09   2       -11        12   # BR(Hp -> Electron nu_e)
     8.52438882E-05   2       -13        14   # BR(Hp -> Muon nu_mu)
     2.41118120E-02   2       -15        16   # BR(Hp -> Tau nu_tau)
     1.29812581E-07   2        -1         2   # BR(Hp -> Down up)
     2.18678688E-06   2        -3         2   # BR(Hp -> Strange up)
     1.36790824E-06   2        -5         2   # BR(Hp -> Bottom up)
     1.48050062E-08   2        -1         4   # BR(Hp -> Down charm)
     4.69694726E-05   2        -3         4   # BR(Hp -> Strange charm)
     1.91556356E-04   2        -5         4   # BR(Hp -> Bottom charm)
     9.55167140E-07   2        -1         6   # BR(Hp -> Down top)
     2.08947354E-05   2        -3         6   # BR(Hp -> Strange top)
     1.43735531E-01   2        -5         6   # BR(Hp -> Bottom top)
     3.56568418E-02   2   1000022   1000024   # BR(Hp -> neutralino1 chargino1)
     1.20867585E-01   2   1000022   1000037   # BR(Hp -> neutralino1 chargino2)
     1.63493159E-02   2   1000023   1000024   # BR(Hp -> neutralino2 chargino1)
     2.26489543E-01   2   1000023   1000037   # BR(Hp -> neutralino2 chargino2)
     5.67720088E-02   2   1000024   1000025   # BR(Hp -> chargino1 neutralino3)
     1.47715928E-01   2   1000025   1000037   # BR(Hp -> neutralino3 chargino2)
     2.27906428E-01   2   1000024   1000035   # BR(Hp -> chargino1 neutralino4)
     3.43992502E-05   2   1000035   1000037   # BR(Hp -> neutralino4 chargino2)
     1.12872710E-05   2        24        25   # BR(Hp -> W h0)
     5.95287771E-13   2        24        35   # BR(Hp -> W HH)
     2.58413623E-13   2        24        36   # BR(Hp -> W A0)
DECAY         6     2.43000000E+00   # top
#    BR                NDA      ID1      ID2
     1.00000000E+00    2           5        24   # BR(t -> b W)
Block HiggsBoundsInputHiggsCouplingsFermions
# ScalarNormEffCoupSq PseudoSNormEffCoupSq NP IP1 IP2 IP2
    9.13230349E-01    0.00000000E+00        3  25   5   5  # h0-b-b eff. coupling^2, normalised to SM
    1.64619820E+02    0.00000000E+00        3  35   5   5  # H0-b-b eff. coupling^2, normalised to SM
    0.00000000E+00    1.64533050E+02        3  36   5   5  # A0-b-b eff. coupling^2, normalised to SM
#
    1.00052737E+00    0.00000000E+00        3  25   6   6  # h0-t-t eff. coupling^2, normalised to SM
    5.55043712E-03    0.00000000E+00        3  35   6   6  # H0-t-t eff. coupling^2, normalised to SM
    0.00000000E+00    6.07780625E-03        3  36   6   6  # A0-t-t eff. coupling^2, normalised to SM
#
    9.13230349E-01    0.00000000E+00        3  25  15  15  # h0-tau-tau eff. coupling^2, normalised to SM
    1.64619820E+02    0.00000000E+00        3  35  15  15  # H0-tau-tau eff. coupling^2, normalised to SM
    0.00000000E+00    1.64533050E+02        3  36  15  15  # A0-tau-tau eff. coupling^2, normalised to SM
#
Block HiggsBoundsInputHiggsCouplingsBosons
    9.99988038E-01        3  25  24  24  # h0-W-W eff. coupling^2, normalised to SM
    1.19616666E-05        3  35  24  24  # H0-W-W eff. coupling^2, normalised to SM
    0.00000000E+00        3  36  24  24  # A0-W-W eff. coupling^2, normalised to SM
#
    9.99988038E-01        3  25  23  23  # h0-Z-Z eff. coupling^2, normalised to SM
    1.19616666E-05        3  35  23  23  # H0-Z-Z eff. coupling^2, normalised to SM
    0.00000000E+00        3  36  23  23  # A0-Z-Z eff. coupling^2, normalised to SM
#
    1.26867640E+00        3  25  21  21  # h0-g-g eff. coupling^2, normalised to SM
    2.64838486E-03        3  35  21  21  # H0-g-g eff. coupling^2, normalised to SM
    1.07581795E-01        3  36  21  21  # A0-g-g eff. coupling^2, normalised to SM
#
    0.00000000E+00        3  25  25  23  # h0-h0-Z eff. coupling^2, normalised to SM
    0.00000000E+00        3  35  25  23  # H0-h0-Z eff. coupling^2, normalised to SM
    1.19616666E-05        3  36  25  23  # A0-h0-Z eff. coupling^2, normalised to SM
    0.00000000E+00        3  35  35  23  # H0-H0-Z eff. coupling^2, normalised to SM
    9.99988038E-01        3  36  35  23  # A0-H0-Z eff. coupling^2, normalised to SM
    0.00000000E+00        3  36  36  23  # A0-A0-Z eff. coupling^2, normalised to SM
#
    0.00000000E+00        4  25  21  21  23  # h0-g-g-Z eff. coupling^2, normalised to SM
    0.00000000E+00        4  35  21  21  23  # H0-g-g-Z eff. coupling^2, normalised to SM
    0.00000000E+00        4  36  21  21  23  # A0-g-g-Z eff. coupling^2, normalised to SM
Block SPhenoLowEnergy  # low energy observables
    1    3.32153958E-04   # BR(b -> s gamma)
    2    1.58897597E-06   # BR(b -> s mu+ mu-)
    3    3.52537996E-05   # BR(b -> s nu nu)
    4    2.45116338E-15   # BR(Bd -> e+ e-)
    5    1.04710938E-10   # BR(Bd -> mu+ mu-)
    6    2.19214688E-08   # BR(Bd -> tau+ tau-)
    7    8.23205848E-14   # BR(Bs -> e+ e-)
    8    3.51673352E-09   # BR(Bs -> mu+ mu-)
    9    7.45975288E-07   # BR(Bs -> tau+ tau-)
   10    9.66315904E-05   # BR(B_u -> tau nu)
   11    9.98167333E-01   # BR(B_u -> tau nu)/BR(B_u -> tau nu)_SM
   12    5.42004747E-01   # |Delta(M_Bd)| [ps^-1] 
   13    1.93654291E+01   # |Delta(M_Bs)| [ps^-1] 
   14    0.00000000E+00   # neutron EDM according to the chiral quark model
   15    0.00000000E+00   # neutron EDM according to the relativistic quark-parton model
   16    2.15737605E-03   # epsilon_K
   17    2.28165890E-15   # Delta(M_K)
   18    2.48011098E-11   # BR(K^0 -> pi^0 nu nu)
   19    8.29073427E-11   # BR(K^+ -> pi^+ nu nu)
   20    7.88586343E-17   # Delta(g-2)_electron/2
   21    3.37145600E-12   # Delta(g-2)_muon/2
   22    9.53858985E-10   # Delta(g-2)_tau/2
   23    0.00000000E+00   # electric dipole moment of the electron
   24    0.00000000E+00   # electric dipole moment of the muon
   25    0.00000000E+00   # electric dipole moment of the tau
   26    0.00000000E+00   # Br(mu -> e gamma)
   27    0.00000000E+00   # Br(tau -> e gamma)
   28    0.00000000E+00   # Br(tau -> mu gamma)
   29    0.00000000E+00   # Br(mu -> 3 e)
   30    0.00000000E+00   # Br(tau -> 3 e)
   31    0.00000000E+00   # Br(tau -> 3 mu)
   39    1.85745452E-05   # Delta(rho_parameter)
   40    0.00000000E+00   # BR(Z -> e mu)
   41    0.00000000E+00   # BR(Z -> e tau)
   42    0.00000000E+00   # BR(Z -> mu tau)
Block FWCOEF Q=  1.60000000E+02  # Wilson coefficients at scale Q
#    id        order  M        value         comment
     0305 4422   00   0    -1.88819110E-01   # C7
     0305 4422   00   2    -2.01289272E-01   # C7
     0305 4322   00   2    -1.87123034E-04   # C7'
     0305 6421   00   0    -9.52278348E-02   # C8
     0305 6421   00   2    -1.09004548E-01   # C8
     0305 6321   00   2    -2.38569803E-04   # C8'
 03051111 4133   00   0     1.62258930E+00   # C9 e+e-
 03051111 4133   00   2     1.62288329E+00   # C9 e+e-
 03051111 4233   00   2     5.89428143E-05   # C9' e+e-
 03051111 4137   00   0    -4.44528140E+00   # C10 e+e-
 03051111 4137   00   2    -4.44373440E+00   # C10 e+e-
 03051111 4237   00   2    -4.38085524E-04   # C10' e+e-
 03051313 4133   00   0     1.62258930E+00   # C9 mu+mu-
 03051313 4133   00   2     1.62288328E+00   # C9 mu+mu-
 03051313 4233   00   2     5.89428051E-05   # C9' mu+mu-
 03051313 4137   00   0    -4.44528140E+00   # C10 mu+mu-
 03051313 4137   00   2    -4.44373441E+00   # C10 mu+mu-
 03051313 4237   00   2    -4.38085522E-04   # C10' mu+mu-
 03051212 4137   00   0     1.50535012E+00   # C11 nu_1 nu_1
 03051212 4137   00   2     1.50501790E+00   # C11 nu_1 nu_1
 03051212 4237   00   2     9.48170944E-05   # C11' nu_1 nu_1
 03051414 4137   00   0     1.50535012E+00   # C11 nu_2 nu_2
 03051414 4137   00   2     1.50501790E+00   # C11 nu_2 nu_2
 03051414 4237   00   2     9.48170960E-05   # C11' nu_2 nu_2
 03051616 4137   00   0     1.50535012E+00   # C11 nu_3 nu_3
 03051616 4137   00   2     1.50501790E+00   # C11 nu_3 nu_3
 03051616 4237   00   2     9.48175407E-05   # C11' nu_3 nu_3
Block IMFWCOEF Q=  1.60000000E+02  # Im(Wilson coefficients) at scale Q
#    id        order  M        value         comment
     0305 4422   00   0     3.85818363E-07   # C7
     0305 4422   00   2     8.19375452E-06   # C7
     0305 4322   00   2    -1.89921755E-07   # C7'
     0305 6421   00   0     3.30478944E-07   # C8
     0305 6421   00   2    -5.85349550E-06   # C8
     0305 6321   00   2    -2.43413527E-07   # C8'
 03051111 4133   00   2     1.45240568E-06   # C9 e+e-
 03051111 4233   00   2     1.16198370E-06   # C9' e+e-
 03051111 4137   00   2     1.70308475E-06   # C10 e+e-
 03051111 4237   00   2    -8.63808376E-06   # C10' e+e-
 03051313 4133   00   2     1.45240498E-06   # C9 mu+mu-
 03051313 4233   00   2     1.16198366E-06   # C9' mu+mu-
 03051313 4137   00   2     1.70308548E-06   # C10 mu+mu-
 03051313 4237   00   2    -8.63808386E-06   # C10' mu+mu-
 03051212 4137   00   2    -3.21879092E-07   # C11 nu_1 nu_1
 03051212 4237   00   2     1.86958632E-06   # C11' nu_1 nu_1
 03051414 4137   00   2    -3.21879056E-07   # C11 nu_2 nu_2
 03051414 4237   00   2     1.86958632E-06   # C11' nu_2 nu_2
 03051616 4137   00   2    -3.21868981E-07   # C11 nu_3 nu_3
 03051616 4237   00   2     1.86958632E-06   # C11' nu_3 nu_3
