BLOCK SPINFO
   1   SPheno
   2   v4.0.5be

BLOCK SPHENOINFO
   1   2
   2   2

BLOCK MODSEL
   1   0

BLOCK MINPAR
   3    18.648826
   4   -1

BLOCK EXTPAR
   0    1233.3664
   1    625.59582
   2   -606.76567
   3    3000
   11   -3836.2059
   12    1635.9255
   13   -1617.3958
   23   -600.10682
   25    18.025607
   26    2229.0171
   31    1694.7429
   32    1694.7429
   33    1707.8383
   34    1590.3349
   35    1590.3349
   36    1240.5339
   41    5000
   42    5000
   43    1234.9996
   44    5000
   45    5000
   46    1500.0214
   47    5000
   48    5000
   49    1374.6309

BLOCK SMINPUTS
   1    127.90897
   2    1.1663787e-05
   3    0.1184
   4    91.1876
   5    4.18
   6    173.2
   7    1.777
   8    0
   11    0.00051099893
   12    0
   13    0.10565837
   14    0
   21    0.005
   22    0.0025
   23    0.095
   24    1.27

BLOCK GAUGE Q=  1233.3664
   1    0.35536298
   2    0.66519887
   3    1.219778

BLOCK YU Q=  1233.3664
   1   1    8.3972643e-06
   2   2    0.0042658103
   3   3    1.014457

BLOCK YD Q=  1233.3664
   1   1    0.00030416411
   2   2    0.0057791182
   3   3    0.30163549

BLOCK YE Q=  1233.3664
   1   1    5.3078862e-05
   2   2    0.010975025
   3   3    0.18458187

BLOCK AU Q=  1233.3664
   1   1    0
   2   2    0
   3   3   -3836.2054

BLOCK AD Q=  1233.3664
   1   1    0
   2   2    0
   3   3    1635.9253

BLOCK AE Q=  1233.3664
   1   1    0
   2   2    0
   3   3   -1617.3959

BLOCK MSOFT Q=  1233.3664
   1    625.59582
   2   -606.76567
   3    3000
   21    4600503.9
   22   -319190.07
   31    1694.7429
   32    1694.7429
   33    1707.8383
   34    1590.3349
   35    1590.3349
   36    1240.5339
   41    5000
   42    5000
   43    1234.9996
   44    5000
   45    5000
   46    1500.0214
   47    5000
   48    5000
   49    1374.6309

BLOCK MASS
   6    173.2
   23    91.1876
   24    80.429995
   15    1.777
   25    121.89496
   35    2228.3964
   36    2229.0171
   37    2230.2804
   1000001    5019.9746
   2000001    5009.7353
   1000002    5019.5487
   2000002    5011.1903
   1000003    5019.9763
   2000003    5009.737
   1000004    5019.5503
   2000004    5011.1914
   1000005    1161.5722
   2000005    1353.2646
   1000006    1024.4649
   2000006    1484.8655
   1000011    1699.1504
   2000011    1592.4562
   1000012    1696.9786
   1000013    1699.1499
   2000013    1592.4522
   1000014    1696.9771
   1000015    1242.3846
   2000015    1711.9315
   1000016    1709.7279
   1000021    3173.4999
   1000022   -564.12717
   1000023    587.08817
   1000025    649.76473
   1000035   -686.35762
   1000024    565.09353
   1000037    686.9342

BLOCK ALPHA
      -0.053778922

BLOCK HMIX Q=  1233.3664
   1   -600.10682
   2    18.025607
   3    244.16847
   4    4968517

BLOCK STOPMIX
   1   1    0.86067705
   1   2    0.50915126
   2   1   -0.50915126
   2   2    0.86067705

BLOCK SBOTMIX
   1   1   -0.99804659
   1   2    0.062474098
   2   1   -0.062474098
   2   2   -0.99804659

BLOCK STAUMIX
   1   1   -0.01199129
   1   2    0.9999281
   2   1   -0.9999281
   2   2   -0.01199129

BLOCK NMIX
   1   1    0.021344496
   1   2    0.60153378
   1   3    0.58319375
   1   4   -0.54551495
   2   1   -0.57938371
   2   2   -0.034976522
   2   3    0.58608489
   2   4    0.56532792
   3   1    0.81461937
   3   2   -0.025024914
   3   3    0.39369888
   3   4    0.42517082
   4   1    0.015944165
   4   2   -0.79768885
   4   3    0.40173465
   4   4   -0.449497

BLOCK UMIX
   1   1   -0.57105898
   1   2   -0.82090904
   2   1   -0.82090904
   2   2    0.57105898

BLOCK VMIX
   1   1    0.63937348
   1   2    0.76889632
   2   1    0.76889632
   2   2   -0.63937348

BLOCK HIGGSBOUNDSINPUTHIGGSCOUPLINGSFERMIONS
       0, 324.92251,3,36,15,15

BLOCK HIGGSBOUNDSINPUTHIGGSCOUPLINGSBOSONS
       0,4,36,21,21,23

BLOCK SPHENOLOWENERGY
   1    0.0003645701
   2    1.5867241e-06
   3    3.5235091e-05
   4    2.416336e-15
   5    1.0322318e-10
   6    2.1611865e-08
   7    8.1534927e-14
   8    3.4831712e-09
   9    7.3891452e-07
   10    9.6310332e-05
   11    0.99484885
   12    0.54332097
   13    19.41086
   14    0
   15    0
   16    0.0021644178
   17    2.2817309e-15
   18    2.4809567e-11
   19    8.2918427e-11
   20    2.8793225e-15
   21    1.230998e-10
   22    3.4851129e-08
   23    0
   24    0
   25    0
   26    0
   27    0
   28    0
   29    0
   30    0
   31    0
   39    6.6543645e-05
   40    0
   41    0
   42    0

BLOCK FWCOEF Q=  160
   305   4422   0   0   -0.18881911
   305   4422   0   2   -0.23814773
   305   4322   0   2   -0.00039825194
   305   6421   0   0   -0.095227835
   305   6421   0   2   -0.12885476
   305   6321   0   2   -0.00033221951
   3051111   4133   0   0    1.5848582
   3051111   4133   0   2    1.5859158
   3051111   4233   0   2    5.0499702e-05
   3051111   4137   0   0   -4.4075503
   3051111   4137   0   2   -4.4041277
   3051111   4237   0   2   -0.00039648913
   3051313   4133   0   0    1.5848582
   3051313   4133   0   2    1.5859152
   3051313   4233   0   2    5.0499623e-05
   3051313   4137   0   0   -4.4075503
   3051313   4137   0   2   -4.4041283
   3051313   4237   0   2   -0.00039648921
   3051212   4137   0   0    1.5053501
   3051212   4137   0   2    1.5046182
   3051212   4237   0   2    8.6545674e-05
   3051414   4137   0   0    1.5053501
   3051414   4137   0   2    1.5046182
   3051414   4237   0   2    8.6545683e-05
   3051616   4137   0   0    1.5053501
   3051616   4137   0   2    1.5046182
   3051616   4237   0   2    8.6548111e-05

BLOCK IMFWCOEF Q=  160
   305   4422   0   0    3.8576004e-07
   305   4422   0   2    1.1787526e-05
   305   4322   0   2   -3.6263999e-06
   305   6421   0   0    3.3042899e-07
   305   6421   0   2    1.126374e-05
   305   6321   0   2   -1.4877125e-06
   3051111   4133   0   2   -3.2232708e-06
   3051111   4233   0   2    1.1352183e-06
   3051111   4137   0   2    2.9040413e-05
   3051111   4237   0   2   -8.9202697e-06
   3051313   4133   0   2   -3.2232703e-06
   3051313   4233   0   2    1.1352176e-06
   3051313   4137   0   2    2.9040424e-05
   3051313   4237   0   2   -8.9202719e-06
   3051212   4137   0   2   -6.0491179e-06
   3051212   4237   0   2    1.9471353e-06
   3051414   4137   0   2   -6.0491177e-06
   3051414   4237   0   2    1.9471353e-06
   3051616   4137   0   2   -6.0493136e-06
   3051616   4237   0   2    1.9471353e-06

DECAY 23  2.4952


DECAY 24  2.085


DECAY 2000011  5.6985963
    0.64735061   2    1000025    11
    0.3519235   2    1000023    11
    0.00048922233   2    1000022    11
    0.00023665155   2    1000035    11

DECAY 1000011  18.004278
    0.39180527   2   -1000037    12
    0.21430879   2   -1000024    12
    0.18116626   2    1000035    11
    0.1235515   2    1000022    11
    0.050938579   2    1000025    11
    0.038229601   2    1000023    11

DECAY 2000013  5.7041499
    0.6467885   2    1000025    13
    0.35175184   2    1000023    13
    0.00066271632   2    1000022    13
    0.00034443344   2   -1000024    14
    0.00030798022   2    1000035    13
    0.00014452502   2   -1000037    14

DECAY 1000013  18.007371
    0.3917378   2   -1000037    14
    0.2142719   2   -1000024    14
    0.18116036   2    1000035    13
    0.12359137   2    1000022    13
    0.05095548   2    1000025    13
    0.0382831   2    1000023    13

DECAY 1000015  4.440689
    0.50630747   2    1000025    15
    0.32542542   2    1000023    15
    0.085279069   2   -1000024    16
    0.043589401   2    1000022    15
    0.026216619   2   -1000037    16
    0.013182025   2    1000035    15

DECAY 2000015  19.157593
    0.37482307   2   -1000037    16
    0.20170068   2   -1000024    16
    0.18017282   2    1000035    15
    0.13282565   2    1000022    15
    0.055907635   2    1000025    15
    0.052053508   2    1000023    15
    0.001280409   2    1000015    23
    0.0012362183   2    1000015    25

DECAY 1000012  18.0449
    0.34217385   2    1000037    11
    0.2675324   2    1000024    11
    0.18821727   2    1000035    12
    0.11405236   2    1000022    12
    0.063846382   2    1000025    12
    0.024177738   2    1000023    12

DECAY 1000014  18.047967
    0.34216704   2    1000037    13
    0.26760609   2    1000024    13
    0.188185   2    1000035    14
    0.11403283   2    1000022    14
    0.063835439   2    1000025    14
    0.024173597   2    1000023    14

DECAY 1000016  19.204422
    0.33978966   2    1000037    15
    0.28633292   2    1000024    15
    0.17921889   2    1000035    16
    0.10837024   2    1000022    16
    0.060751143   2    1000025    16
    0.022981186   2    1000023    16
    0.0025559554   2    1000015    24

DECAY 2000001  144.45926
    0.98124504   2    1000021    1
    0.012419534   2    1000025    1
    0.006321994   2    1000023    1

DECAY 1000001  207.58957
    0.68797599   2    1000021    1
    0.13813397   2   -1000037    2
    0.067672805   2   -1000024    2
    0.065684276   2    1000035    1
    0.03707446   2    1000022    1
    0.0029769219   2    1000025    1
    0.00048158545   2    1000023    1

DECAY 2000003  144.46588
    0.98120128   2    1000021    3
    0.012422407   2    1000025    3
    0.0063293886   2    1000023    3

DECAY 1000003  207.59476
    0.68795963   2    1000021    3
    0.13813409   2   -1000037    4
    0.067676096   2   -1000024    4
    0.065685137   2    1000035    3
    0.037078868   2    1000022    3
    0.0029792475   2    1000025    3
    0.00048692885   2    1000023    3

DECAY 1000005  24.087913
    0.33135444   2   -1000024    6
    0.32637961   2   -1000037    6
    0.18980883   2    1000006   -24
    0.065120143   2    1000022    5
    0.060785122   2    1000035    5
    0.018740449   2    1000023    5
    0.0078113999   2    1000025    5

DECAY 2000005  4.0870399
    0.23585091   2   -1000024    6
    0.16449973   2    1000023    5
    0.16078782   2   -1000037    6
    0.13939135   2    1000025    5
    0.11314525   2    1000022    5
    0.084456047   2    1000006   -24
    0.076176176   2    1000035    5
    0.01575612   2    1000005    25
    0.0099365931   2    1000005    23

DECAY 2000002  152.74207
    0.92902684   2    1000021    2
    0.046998762   2    1000025    2
    0.023923926   2    1000023    2

DECAY 1000002  207.58722
    0.68777002   2    1000021    2
    0.12117452   2    1000037    1
    0.084825772   2    1000024    1
    0.064750547   2    1000035    2
    0.038020484   2    1000022    2
    0.0019760657   2    1000023    2
    0.0014825914   2    1000025    2

DECAY 2000004  152.74564
    0.92900545   2    1000021    4
    0.046999789   2    1000025    4
    0.023927021   2    1000023    4

DECAY 1000004  207.59232
    0.68775358   2    1000021    4
    0.12117663   2    1000037    3
    0.084834218   2    1000024    3
    0.064750616   2    1000035    4
    0.038022135   2    1000022    4
    0.0019787488   2    1000023    4
    0.001484078   2    1000025    4

DECAY 1000006  10.665328
    0.35766685   2    1000037    5
    0.24279074   2    1000023    6
    0.18176297   2    1000022    6
    0.12835733   2    1000035    6
    0.045221538   2    1000025    6
    0.042985589   2    1000024    5
    0.00097952216   2    1000022    4
    0.00018805778   3    1000022    24    5

DECAY 2000006  115.2442
    0.2646266   2    1000005    24
    0.25094669   2    1000006    23
    0.15064711   2    1000024    5
    0.10006461   2    1000006    25
    0.090006792   2    1000022    6
    0.058445867   2    1000025    6
    0.05399329   2    1000023    6
    0.015986144   2    1000035    6
    0.015235811   2    1000037    5

DECAY 1000024  3.6437339e-12
    0.60658402   3    1000022   -1    2
    0.2024727   3    1000022   -11    12
    0.19094328   3    1000022   -13    14

DECAY 1000037  1.5648057
    0.76506162   2    1000022    24
    0.1618728   2    1000024    23
    0.073042157   2    1000023    24

DECAY 1000022 -1


DECAY 1000023  1.6600828e-05
    0.11512465   3    1000022    12   -12
    0.10221129   2    1000022    22
    0.086196364   3    1000022    1   -1
    0.086179663   3    1000022    3   -3
    0.067228367   3    1000022    2   -2
    0.064587327   3    1000022    4   -4
    0.061039423   3    1000024    1   -2
    0.061039423   3   -1000024   -1    2
    0.060055705   3    1000024    3   -4
    0.060055705   3   -1000024   -3    4
    0.059023237   3    1000022    5   -5
    0.020316648   3    1000024    11   -12
    0.020316648   3   -1000024   -11    12
    0.020316433   3    1000024    13   -14
    0.020316433   3   -1000024   -13    14
    0.019666165   3    1000024    15   -16
    0.019666165   3   -1000024   -15    16
    0.019415256   3    1000022    11   -11
    0.019409354   3    1000022    13   -13
    0.017835736   3    1000022    15   -15

DECAY 1000025  0.037554542
    0.26901341   2    1000024   -24
    0.26901341   2   -1000024    24
    0.093201513   3    1000022    12   -12
    0.069618325   3    1000022    1   -1
    0.069617843   3    1000022    3   -3
    0.068620739   3    1000022    5   -5
    0.05429647   3    1000022    2   -2
    0.054208829   3    1000022    4   -4
    0.015729615   3    1000022    11   -11
    0.01572944   3    1000022    13   -13
    0.015681403   3    1000022    15   -15
    0.0052527177   2    1000022    22

DECAY 1000035  2.9960564
    0.40957377   2    1000024   -24
    0.40957377   2   -1000024    24
    0.17922441   2    1000023    23
    0.0013830755   2    1000022    25
    0.00020867906   2    1000022    23

DECAY 1000021  265.82948
    0.1325638   2    1000005   -5
    0.1325638   2   -1000005    5
    0.12658655   2    1000006   -6
    0.12658655   2   -1000006    6
    0.12068021   2    2000006   -6
    0.12068021   2   -2000006    6
    0.11822223   2    2000005   -5
    0.11822223   2   -2000005    5
    0.0018463695   2    1000006   -4
    0.0018463695   2   -1000006    4

DECAY 25  0.0035086064
    0.62153956   2   -5    5
    0.18034518   2   -24    24
    0.071829961   2    21    21
    0.071108563   2   -15    15
    0.030580948   2   -4    4
    0.020506936   2    23    23
    0.0023639262   2    22    22
    0.0012443242   2    22    23
    0.00024663538   2   -13    13
    0.000233156   2   -3    3
    6.4465336e-07   2   -1    1
    1.5760064e-07   2   -2    2
    5.5446793e-09   2   -11    11

DECAY 35  35.154276
    0.27360109   2   -5    5
    0.11928711   2   -1000024    1000037
    0.11928711   2   -1000037    1000024
    0.092336139   2   -1000024    1000024
    0.068688945   2    1000022    1000023
    0.052371623   2   -1000006    1000006
    0.05189388   2    1000025    1000035
    0.048323425   2   -1000037    1000037
    0.046201658   2   -15    15
    0.04060637   2    1000022    1000022
    0.027420447   2    1000035    1000035
    0.026465101   2    1000023    1000035
    0.0098121345   2    1000025    1000025
    0.0085547581   2    1000023    1000023
    0.0080126063   2   -6    6
    0.0055113401   2    1000023    1000025
    0.0011895646   2    1000022    1000035
    0.00016019508   2   -13    13
    0.00015232194   2    1000022    1000025
    9.9939361e-05   2   -3    3
    1.0260381e-05   2    21    21
    8.7052855e-06   2    25    25
    3.1556949e-06   2    23    23
    1.4336065e-06   2   -24    24
    2.7631637e-07   2   -1    1
    2.0758687e-07   2    22    23
    1.3352591e-07   2    22    22
    8.1384654e-08   2   -4    4
    3.5982287e-09   2   -11    11
    4.1952094e-13   2   -2    2

DECAY 36  32.969886
    0.28268489   2   -5    5
    0.15516635   2   -1000024    1000024
    0.10367893   2   -1000037    1000037
    0.072773211   2   -1000024    1000037
    0.072773211   2   -1000037    1000024
    0.069368161   2    1000022    1000022
    0.057521243   2    1000035    1000035
    0.049167056   2    1000022    1000023
    0.04770988   2   -15    15
    0.035219767   2    1000025    1000035
    0.013342169   2    1000023    1000035
    0.012478309   2    1000025    1000025
    0.010205633   2    1000023    1000023
    0.0086278645   2   -6    6
    0.0069463939   2    1000023    1000025
    0.0019138169   2    1000022    1000035
    0.00016542409   2   -13    13
    0.00013037658   2    1000022    1000025
    0.00010319827   2   -3    3
    1.8385637e-05   2    21    21
    4.6821344e-06   2    23    25
    4.266782e-07   2    22    23
    2.8532584e-07   2   -1    1
    2.4200317e-07   2    22    22
    8.8245836e-08   2   -4    4
    3.715672e-09   2   -11    11
    4.54924e-13   2   -2    2
    4.0743196e-37   2    25    25

DECAY 37  32.351916
    0.27918182   2   -5    6
    0.21695869   2    1000022    1000037
    0.19352272   2    1000024    1000035
    0.13801239   2    1000023    1000024
    0.086642223   2    1000025    1000037
    0.047946554   2   -15    16
    0.036279452   2    1000023    1000037
    0.00055302299   2    1000024    1000025
    0.00040293564   2   -5    4
    0.00016950828   2   -13    14
    0.00013050163   2    1000022    1000024
    9.8411013e-05   2   -3    4
    7.7121804e-05   2    1000035    1000037
    1.1570379e-05   2   -3    6
    4.7851668e-06   2    24    25
    4.5885819e-06   2   -3    2
    2.877376e-06   2   -5    2
    5.2405448e-07   2   -1    6
    2.7285032e-07   2   -1    2
    1.7514243e-08   2   -1    4
    3.9648163e-09   2   -11    12
    9.983509e-13   2    24    35
    1.3540079e-13   2    24    36

DECAY 6  2.43
    1   2    5    24

DECAY 15 -1
