BLOCK SPINFO
   1   SPheno
   2   v4.0.5be

BLOCK SPHENOINFO
   1   2
   2   2

BLOCK MODSEL
   1   0

BLOCK MINPAR
   3    45.429161
   4   -1

BLOCK EXTPAR
   0    1401.3019
   1    302.53704
   2   -101.52923
   3    3000
   11    5039.62
   12   -1648.0838
   13   -1120.9749
   23   -210.75939
   25    44.901297
   26    4037.0172
   31    1435.6808
   32    1435.6808
   33    1899.1567
   34    783.85519
   35    783.85519
   36    1412.4309
   41    5000
   42    5000
   43    1837.8227
   44    5000
   45    5000
   46    1280.9306
   47    5000
   48    5000
   49    1387.0452

BLOCK SMINPUTS
   1    127.90897
   2    1.1663787e-05
   3    0.1184
   4    91.1876
   5    4.18
   6    173.2
   7    1.777
   8    0
   11    0.00051099893
   12    0
   13    0.10565837
   14    0
   21    0.005
   22    0.0025
   23    0.095
   24    1.27

BLOCK GAUGE Q=  1401.3019
   1    0.35536298
   2    0.66519887
   3    1.219778

BLOCK YU Q=  1401.3019
   1   1    8.3864512e-06
   2   2    0.0042603172
   3   3    1.0131507

BLOCK YD Q=  1401.3019
   1   1    0.00075668889
   2   2    0.014377089
   3   3    0.75039826

BLOCK YE Q=  1401.3019
   1   1    0.00013204774
   2   2    0.027303285
   3   3    0.45919635

BLOCK AU Q=  1401.3019
   1   1    0
   2   2    0
   3   3    5039.6202

BLOCK AD Q=  1401.3019
   1   1    0
   2   2    0
   3   3   -1648.0838

BLOCK AE Q=  1401.3019
   1   1    0
   2   2    0
   3   3   -1120.9749

BLOCK MSOFT Q=  1401.3019
   1    302.53704
   2   -101.52923
   3    3000
   21    16275199
   22    48524.333
   31    1435.6808
   32    1435.6808
   33    1899.1567
   34    783.85519
   35    783.85519
   36    1412.4309
   41    5000
   42    5000
   43    1837.8227
   44    5000
   45    5000
   46    1280.9306
   47    5000
   48    5000
   49    1387.0452

BLOCK MASS
   6    173.2
   23    91.1876
   24    80.429995
   15    1.777
   25    121.34439
   35    4031.8252
   36    4037.0172
   37    4033.4025
   1000001    5029.2054
   2000001    5018.0079
   1000002    5028.7803
   2000002    5020.8345
   1000003    5029.2121
   2000003    5018.0199
   1000004    5028.7869
   2000004    5020.8353
   1000005    1429.3564
   2000005    1781.0055
   1000006    1054.8537
   2000006    1861.535
   1000011    1440.9598
   2000011    778.65166
   1000012    1438.4563
   1000013    1440.9756
   2000013    778.71799
   1000014    1438.4719
   1000015    1420.0275
   2000015    1907.8307
   1000016    1905.7982
   1000021    3189.1353
   1000022   -93.544672
   1000023    214.2631
   1000025   -243.57181
   1000035    314.67804
   1000024    94.576414
   1000037    251.05836

BLOCK ALPHA
      -0.022056725

BLOCK HMIX Q=  1401.3019
   1   -210.75939
   2    44.901297
   3    244.03975
   4    16297508

BLOCK STOPMIX
   1   1   -0.34456396
   1   2    0.93876284
   2   1   -0.93876284
   2   2   -0.34456396

BLOCK SBOTMIX
   1   1   -0.017325101
   1   2    0.99984991
   2   1   -0.99984991
   2   2   -0.017325101

BLOCK STAUMIX
   1   1   -0.0091720641
   1   2    0.99995794
   2   1   -0.99995794
   2   2   -0.0091720641

BLOCK NMIX
   1   1    0.02218778
   1   2    0.89133982
   1   3    0.41278239
   1   4   -0.18609599
   2   1    0.32470939
   2   2    0.16023184
   2   3   -0.66014416
   2   4   -0.65810277
   3   1    0.056382014
   3   2   -0.42100537
   3   3    0.60072702
   3   4   -0.67727587
   4   1    0.94387106
   4   2   -0.050926982
   4   3    0.18151429
   4   4    0.27123131

BLOCK UMIX
   1   1   -0.83254668
   1   2   -0.55395489
   2   1   -0.55395489
   2   2    0.83254668

BLOCK VMIX
   1   1    0.96747808
   1   2    0.25295488
   2   1    0.25295488
   2   2   -0.96747808

BLOCK HIGGSBOUNDSINPUTHIGGSCOUPLINGSFERMIONS
       0, 2016.1264,3,36,15,15

BLOCK HIGGSBOUNDSINPUTHIGGSCOUPLINGSBOSONS
       0,4,36,21,21,23

BLOCK SPHENOLOWENERGY
   1    0.00025480304
   2    1.6055574e-06
   3    3.5227988e-05
   4    4.9641877e-15
   5    2.1205497e-10
   6    4.3836821e-08
   7    1.7064635e-13
   8    7.2896782e-09
   9    1.5267537e-06
   10    9.6262567e-05
   11    0.99435547
   12    0.54262484
   13    19.393805
   14    0
   15    0
   16    0.0021596561
   17    2.2816827e-15
   18    2.4787148e-11
   19    8.2870348e-11
   20    6.6478108e-15
   21    2.8422258e-10
   22    5.6081992e-08
   23    0
   24    0
   25    0
   26    0
   27    0
   28    0
   29    0
   30    0
   31    0
   39    8.2097972e-05
   40    0
   41    0
   42    0

BLOCK FWCOEF Q=  160
   305   4422   0   0   -0.18881911
   305   4422   0   2   -0.10489171
   305   4322   0   2    0.00048857309
   305   6421   0   0   -0.095227835
   305   6421   0   2   -0.053720671
   305   6321   0   2    0.00015960428
   3051111   4133   0   0    1.5900241
   3051111   4133   0   2    1.5912546
   3051111   4233   0   2    0.00034905305
   3051111   4137   0   0   -4.4127162
   3051111   4137   0   2   -4.4086221
   3051111   4237   0   2   -0.0027246773
   3051313   4133   0   0    1.5900241
   3051313   4133   0   2    1.5912498
   3051313   4233   0   2    0.00034905098
   3051313   4137   0   0   -4.4127162
   3051313   4137   0   2   -4.4086269
   3051313   4237   0   2   -0.0027246821
   3051212   4137   0   0    1.5053501
   3051212   4137   0   2    1.5044871
   3051212   4237   0   2    0.00059406163
   3051414   4137   0   0    1.5053501
   3051414   4137   0   2    1.5044871
   3051414   4237   0   2    0.00059406167
   3051616   4137   0   0    1.5053501
   3051616   4137   0   2    1.5044859
   3051616   4237   0   2    0.00059407227

BLOCK IMFWCOEF Q=  160
   305   4422   0   0    3.8586968e-07
   305   4422   0   2    1.3477577e-05
   305   4322   0   2    1.0062701e-05
   305   6421   0   0    3.305229e-07
   305   6421   0   2    1.6304118e-05
   305   6321   0   2    4.6252058e-06
   3051111   4133   0   2   -4.0211333e-07
   3051111   4233   0   2    6.7776449e-06
   3051111   4137   0   2    2.0882493e-05
   3051111   4237   0   2   -5.2912018e-05
   3051313   4133   0   2   -4.0230429e-07
   3051313   4233   0   2    6.7776117e-06
   3051313   4137   0   2    2.0882668e-05
   3051313   4237   0   2   -5.2912108e-05
   3051212   4137   0   2   -4.0239866e-06
   3051212   4237   0   2    1.153643e-05
   3051414   4137   0   2   -4.0239786e-06
   3051414   4237   0   2    1.153643e-05
   3051616   4137   0   2   -4.0465135e-06
   3051616   4237   0   2    1.1536438e-05

DECAY 23  2.4952


DECAY 24  2.085


DECAY 2000011  2.8043968
    0.8700608   2    1000035    11
    0.12566246   2    1000023    11
    0.0036095151   2    1000025    11
    0.00066714278   2    1000022    11

DECAY 1000011  20.278675
    0.4298459   2   -1000024    12
    0.25299287   2    1000022    11
    0.18047573   2   -1000037    12
    0.05828537   2    1000035    11
    0.045095588   2    1000025    11
    0.033304543   2    1000023    11

DECAY 2000013  2.8245431
    0.86407797   2    1000035    13
    0.12630472   2    1000023    13
    0.0047847209   2    1000025    13
    0.0022755264   2   -1000037    14
    0.0013391037   2    1000022    13
    0.0012179607   2   -1000024    14

DECAY 1000013  20.299498
    0.42940977   2   -1000024    14
    0.25291417   2    1000022    13
    0.18029284   2   -1000037    14
    0.058257896   2    1000035    13
    0.045408184   2    1000025    13
    0.03370932   2    1000023    13

DECAY 1000015  17.872035
    0.33086915   2    1000035    15
    0.21297744   2   -1000037    16
    0.17902377   2    1000023    15
    0.11290049   2    1000025    15
    0.10545693   2   -1000024    16
    0.058772214   2    1000022    15

DECAY 2000015  34.992629
    0.32822584   2   -1000024    16
    0.23205097   2    1000022    15
    0.14493134   2   -1000037    16
    0.12316661   2    1000023    15
    0.1164458   2    1000025    15
    0.05423391   2    1000035    15
    0.0004770962   2    1000015    23
    0.00046843953   2    1000015    25

DECAY 1000012  20.353754
    0.57730411   2    1000024    11
    0.23857928   2    1000022    12
    0.086916126   2    1000035    12
    0.059728597   2    1000025    12
    0.037419799   2    1000037    11

DECAY 1000014  20.374373
    0.57704448   2    1000024    13
    0.23834045   2    1000022    14
    0.086829294   2    1000035    14
    0.059668873   2    1000025    14
    0.038064856   2    1000037    13

DECAY 1000016  35.044835
    0.51551581   2    1000024    15
    0.18425504   2    1000022    16
    0.18229437   2    1000037    15
    0.069805029   2    1000035    16
    0.04713532   2    1000025    16
    0.00095356398   2    1000015    24

DECAY 2000001  143.52085
    0.98062357   2    1000021    1
    0.017253671   2    1000035    1
    0.0020507826   2    1000023    1

DECAY 1000001  208.88625
    0.67934357   2    1000021    1
    0.14680222   2   -1000024    2
    0.083391199   2    1000022    1
    0.064714894   2   -1000037    2
    0.019597531   2    1000025    1
    0.0050430826   2    1000035    1
    0.0011074992   2    1000023    1

DECAY 2000003  143.56312
    0.98034361   2    1000021    3
    0.017253316   2    1000035    3
    0.0021124236   2    1000023    3
    0.00011336775   2    1000025    3

DECAY 1000003  208.9094
    0.67927166   2    1000021    3
    0.14678668   2   -1000024    4
    0.083398884   2    1000022    3
    0.064715937   2   -1000037    4
    0.019630837   2    1000025    3
    0.0050457564   2    1000035    3
    0.0011502419   2    1000023    3

DECAY 1000005  30.860898
    0.31999121   2   -1000037    6
    0.21881005   2    1000023    5
    0.17372885   2    1000025    5
    0.16024761   2   -1000024    6
    0.091766261   2    1000022    5
    0.035254492   2    1000035    5
    0.00020151743   2    1000006   -24

DECAY 2000005  199.82906
    0.61248088   2    1000006   -24
    0.1879251   2   -1000037    6
    0.062514305   2   -1000024    6
    0.046858664   2    1000022    5
    0.042635521   2    1000023    5
    0.042255651   2    1000025    5
    0.0050547427   2    1000035    5
    0.00015808064   2    1000005    25
    0.0001170633   2    1000005    23

DECAY 2000002  152.16369
    0.9268578   2    1000021    2
    0.065131874   2    1000035    2
    0.0077409324   2    1000023    2
    0.00023314252   2    1000025    2

DECAY 1000002  208.88672
    0.67913016   2    1000021    2
    0.19822579   2    1000024    1
    0.084875571   2    1000022    2
    0.017812506   2    1000025    2
    0.013493034   2    1000037    1
    0.0050200128   2    1000023    2
    0.0014429219   2    1000035    2

DECAY 2000004  152.16733
    0.92683582   2    1000021    4
    0.065131206   2    1000035    4
    0.0077458794   2    1000023    4
    0.00023857441   2    1000025    4

DECAY 1000004  208.90979
    0.67905819   2    1000021    4
    0.19823443   2    1000024    3
    0.084866602   2    1000022    4
    0.017814514   2    1000025    4
    0.013559651   2    1000037    3
    0.0050232218   2    1000023    4
    0.0014433966   2    1000035    4

DECAY 1000006  41.235582
    0.35730335   2    1000037    5
    0.20520205   2    1000023    6
    0.17255703   2    1000025    6
    0.1172629   2    1000024    5
    0.091375605   2    1000035    6
    0.051286802   2    1000022    6
    0.0047235584   2    1000022    4
    0.00026165559   2    1000023    4

DECAY 2000006  204.7229
    0.34374449   2    1000006    23
    0.26657582   2    1000006    25
    0.10289143   2    1000037    5
    0.1003049   2    1000025    6
    0.078556094   2    1000023    6
    0.075276437   2    1000024    5
    0.025203481   2    1000022    6
    0.0070743805   2    1000035    6
    0.00037156039   2    1000005    24

DECAY 1000024  8.7033841e-12
    0.60544252   3    1000022   -1    2
    0.2023558   3    1000022   -11    12
    0.19220168   3    1000022   -13    14

DECAY 1000037  0.98327498
    0.56780231   2    1000022    24
    0.30378259   2    1000024    23
    0.1283435   2    1000024    25

DECAY 1000022 -1


DECAY 1000023  0.68122172
    0.49674822   2    1000022    23
    0.25160163   2    1000024   -24
    0.25160163   2   -1000024    24

DECAY 1000025  1.4664513
    0.44254513   2    1000024   -24
    0.44254513   2   -1000024    24
    0.076825291   2    1000022    25
    0.038045341   2    1000022    23

DECAY 1000035  0.54335682
    0.27808347   2    1000024   -24
    0.27808347   2   -1000024    24
    0.26280016   2    1000022    23
    0.16770347   2    1000022    25
    0.010989016   2    1000023    23
    0.00032645071   3    1000025    12   -12
    0.0002448805   3    1000025    1   -1
    0.00024487734   3    1000025    3   -3
    0.00023966345   3    1000025    5   -5
    0.00019097086   3    1000025    2   -2
    0.00019038048   3    1000025    4   -4
    0.00010960371   3    1000037    1   -2
    0.00010960371   3   -1000037   -1    2
    0.00010945426   3    1000037    3   -4
    0.00010945426   3   -1000037   -3    4

DECAY 1000021  226.20968
    0.17836082   2    1000006   -6
    0.17836082   2   -1000006    6
    0.13325918   2    1000005   -5
    0.13325918   2   -1000005    5
    0.098786178   2    2000005   -5
    0.098786178   2   -2000005    5
    0.080687172   2    2000006   -6
    0.080687172   2   -2000006    6
    0.0087995539   2    1000006   -4
    0.0087995539   2   -1000006    4

DECAY 25  0.0034312963
    0.62823969   2   -5    5
    0.17328726   2   -24    24
    0.072369468   2   -15    15
    0.071193901   2    21    21
    0.031237554   2   -4    4
    0.019486576   2    23    23
    0.0024430235   2    22    22
    0.0012532162   2    22    23
    0.00025103878   2   -13    13
    0.00023744556   2   -3    3
    6.565143e-07   2   -1    1
    1.6098659e-07   2   -2    2
    5.6436811e-09   2   -11    11

DECAY 35  204.68754
    0.60057995   2   -5    5
    0.084028526   2   -15    15
    0.055019929   2   -1000024    1000037
    0.055019929   2   -1000037    1000024
    0.04472718   2   -1000024    1000024
    0.028743262   2    1000022    1000023
    0.023737866   2   -2000005    1000005
    0.023737866   2   -1000005    2000005
    0.020549746   2    1000022    1000022
    0.013115823   2    1000025    1000035
    0.011245514   2    1000023    1000035
    0.010492755   2    1000025    1000025
    0.0095687151   2    1000022    1000025
    0.0071109872   2    1000023    1000025
    0.0053840861   2   -1000037    1000037
    0.0017919667   2   -2000015    1000015
    0.0017919667   2   -1000015    2000015
    0.0014706563   2    1000035    1000035
    0.00044631385   2   -6    6
    0.00039900997   2    1000022    1000035
    0.0002897496   2   -13    13
    0.00017317267   2   -3    3
    0.00016498722   2   -2000006    1000006
    0.00016498722   2   -1000006    2000006
    0.00011032577   2   -1000006    1000006
    6.7628285e-05   2   -2000006    2000006
    4.2684511e-05   2   -1000005    1000005
    1.5371985e-05   2   -2000005    2000005
    5.1119111e-06   2    21    21
    1.0058137e-06   2    25    25
    9.0354059e-07   2    1000023    1000023
    9.031256e-07   2   -1000015    1000015
    4.7873463e-07   2   -1    1
    3.3230557e-07   2   -2000015    2000015
    1.1327456e-07   2    23    23
    2.8239104e-08   2    22    23
    2.3706592e-08   2   -24    24
    1.1093972e-08   2   -2000011    2000011
    1.0986777e-08   2   -2000013    2000013
    9.4235304e-09   2   -1000011    1000011
    9.3032499e-09   2   -1000013    1000013
    6.5069676e-09   2   -11    11
    5.6486165e-09   2   -4    4
    5.1320292e-09   2    22    22
    1.5699111e-10   2   -2000013    1000013
    1.5699111e-10   2   -1000013    2000013
    2.9116939e-14   2   -2    2
    3.6720456e-15   2   -2000011    1000011
    3.6720456e-15   2   -1000011    2000011

DECAY 36  187.83886
    0.57543131   2   -5    5
    0.080509985   2   -15    15
    0.058331434   2   -1000024    1000037
    0.058331434   2   -1000037    1000024
    0.050510104   2   -1000024    1000024
    0.028577416   2    1000022    1000023
    0.025945565   2   -2000005    1000005
    0.025945565   2   -1000005    2000005
    0.023315235   2    1000022    1000022
    0.01487939   2    1000025    1000035
    0.012823801   2    1000025    1000025
    0.011951815   2    1000022    1000025
    0.011419304   2    1000023    1000035
    0.0075714861   2   -1000037    1000037
    0.0070254243   2    1000023    1000025
    0.0019560937   2   -2000015    1000015
    0.0019560937   2   -1000015    2000015
    0.001438622   2    1000035    1000035
    0.0006241458   2    1000022    1000035
    0.00041324221   2   -6    6
    0.00029475451   2   -2000006    1000006
    0.00029475451   2   -1000006    2000006
    0.00027761502   2   -13    13
    0.00016590134   2   -3    3
    7.7456886e-06   2    21    21
    9.1259127e-07   2    1000023    1000023
    4.5863346e-07   2   -1    1
    2.6355676e-07   2    23    25
    8.2743328e-08   2    22    23
    3.9615145e-08   2    22    22
    6.2344777e-09   2   -11    11
    5.1659661e-09   2   -4    4
    1.7063603e-10   2   -2000013    1000013
    1.7063603e-10   2   -1000013    2000013
    2.2076551e-11   2    23    35
    2.6629498e-14   2   -2    2
    3.9911944e-15   2   -2000011    1000011
    3.9911944e-15   2   -1000011    2000011
    5.3315122e-40   2    25    25

DECAY 37  203.24573
    0.59601883   2   -5    6
    0.093036532   2    1000022    1000037
    0.081905847   2   -15    16
    0.075151704   2    1000023    1000024
    0.068677538   2    1000024    1000025
    0.043260632   2   -1000005    2000006
    0.021178125   2    1000035    1000037
    0.0089045156   2   -1000005    1000006
    0.0044952414   2    1000023    1000037
    0.0036158202   2   -1000015    1000016
    0.0018541879   2    1000025    1000037
    0.00088376822   2   -5    4
    0.00028956632   2   -13    14
    0.00027610175   2   -2000005    1000006
    0.00022534193   2    1000024    1000035
    0.00015490418   2   -3    4
    3.9643484e-05   2   -2000005    2000006
    1.6291444e-05   2    1000022    1000024
    7.2790695e-06   2   -3    2
    6.3110162e-06   2   -5    2
    7.5546776e-07   2   -3    6
    4.2968267e-07   2   -1    2
    2.536308e-07   2   -2000015    1000016
    2.4300581e-07   2    24    25
    4.3874412e-08   2   -2000011    1000012
    4.3722813e-08   2   -2000013    1000014
    2.4063917e-08   2   -1    6
    2.0351824e-08   2   -1    4
    6.7729863e-09   2   -11    12
    3.1012141e-10   2   -1000013    1000014
    6.5404244e-14   2    24    35
    7.2535419e-15   2   -1000011    1000012

DECAY 6  2.43
    1   2    5    24

DECAY 15 -1
