BLOCK SPINFO
   1   SPheno
   2   v4.0.5be

BLOCK SPHENOINFO
   1   2
   2   2

BLOCK MODSEL
   1   0

BLOCK MINPAR
   3    28.766276
   4   -1

BLOCK EXTPAR
   0    1464.8132
   1   -1660.9412
   2    479.12677
   3    3000
   11    3918.0781
   12   -13.721055
   13   -1680.9925
   23   -218.80752
   25    27.859609
   26    2115.1651
   31    1280.2654
   32    1280.2654
   33    1455.3475
   34    754.0991
   35    754.0991
   36    1693.5217
   41    5000
   42    5000
   43    1378.8299
   44    5000
   45    5000
   46    1743.2144
   47    5000
   48    5000
   49    1233.9747

BLOCK SMINPUTS
   1    127.90897
   2    1.1663787e-05
   3    0.1184
   4    91.1876
   5    4.18
   6    173.2
   7    1.777
   8    0
   11    0.00051099893
   12    0
   13    0.10565837
   14    0
   21    0.005
   22    0.0025
   23    0.095
   24    1.27

BLOCK GAUGE Q=  1464.8132
   1    0.35536298
   2    0.66519887
   3    1.219778

BLOCK YU Q=  1464.8132
   1   1    8.3897716e-06
   2   2    0.004262004
   3   3    1.0135518

BLOCK YD Q=  1464.8132
   1   1    0.0004696836
   2   2    0.0089239884
   3   3    0.46577895

BLOCK YE Q=  1464.8132
   1   1    8.1963223e-05
   2   2    0.016947395
   3   3    0.2850273

BLOCK AU Q=  1464.8132
   1   1    0
   2   2    0
   3   3    3918.0781

BLOCK AD Q=  1464.8132
   1   1    0
   2   2    0
   3   3   -13.721055

BLOCK AE Q=  1464.8132
   1   1    0
   2   2    0
   3   3   -1680.9925

BLOCK MSOFT Q=  1464.8132
   1   -1660.9412
   2    479.12677
   3    3000
   21    4446765.1
   22    26862.321
   31    1280.2654
   32    1280.2654
   33    1455.3475
   34    754.0991
   35    754.0991
   36    1693.5217
   41    5000
   42    5000
   43    1378.8299
   44    5000
   45    5000
   46    1743.2144
   47    5000
   48    5000
   49    1233.9747

BLOCK MASS
   6    173.2
   23    91.1876
   24    80.429995
   15    1.777
   25    126.09801
   35    2114.5305
   36    2115.1651
   37    2116.5213
   1000001    5029.8458
   2000001    5019.1728
   1000002    5029.4105
   2000002    5019.9286
   1000003    5029.8479
   2000003    5019.1758
   1000004    5029.4125
   2000004    5019.9294
   1000005    1234.8833
   2000005    1345.1156
   1000006    1241.3317
   2000006    1728.5289
   1000011    1285.0278
   2000011    765.14391
   1000012    1282.245
   1000013    1285.023
   2000013    765.12999
   1000014    1282.2401
   1000015    1458.622
   2000015    1697.3604
   1000016    1456.1609
   1000021    3189.4339
   1000022    213.20915
   1000023   -225.89218
   1000025    523.14491
   1000035   -1656.0145
   1000024    217.06378
   1000037    523.49186

BLOCK ALPHA
      -0.03493017

BLOCK HMIX Q=  1464.8132
   1   -218.80752
   2    27.859609
   3    243.98212
   4    4473923.4

BLOCK STOPMIX
   1   1   -0.90257765
   1   2    0.43052711
   2   1   -0.43052711
   2   2   -0.90257765

BLOCK SBOTMIX
   1   1   -0.05382091
   1   2    0.9985506
   2   1   -0.9985506
   2   2   -0.05382091

BLOCK STAUMIX
   1   1   -0.9999472
   1   2    0.010275836
   2   1   -0.010275836
   2   2   -0.9999472

BLOCK NMIX
   1   1    0.015400409
   1   2    0.17895882
   1   3    0.71095422
   1   4    0.67991225
   2   1   -0.022589645
   2   2   -0.081304541
   2   3    0.69955341
   2   4   -0.70958038
   3   1   -0.0036712632
   3   2    0.98049086
   3   3   -0.071749878
   3   4   -0.18296489
   4   1    0.99961946
   4   2   -0.00099341774
   4   3    0.0045920124
   4   4   -0.027182152

BLOCK UMIX
   1   1   -0.10287109
   1   2   -0.9946947
   2   1    0.9946947
   2   2   -0.10287109

BLOCK VMIX
   1   1   -0.26147547
   1   2    0.96521012
   2   1    0.96521012
   2   2    0.26147547

BLOCK HIGGSBOUNDSINPUTHIGGSCOUPLINGSFERMIONS
       0, 776.15779,3,36,15,15

BLOCK HIGGSBOUNDSINPUTHIGGSCOUPLINGSBOSONS
       0,4,36,21,21,23

BLOCK SPHENOLOWENERGY
   1    0.00030030097
   2    1.5909876e-06
   3    3.5195218e-05
   4    3.0988704e-15
   5    1.3237913e-10
   6    2.7647633e-08
   7    1.0532319e-13
   8    4.4993658e-09
   9    9.5211465e-07
   10    9.5886766e-05
   11    0.99047358
   12    0.54263928
   13    19.385446
   14    0
   15    0
   16    0.0021598902
   17    2.2816855e-15
   18    2.4770821e-11
   19    8.2830147e-11
   20   -7.7434621e-15
   21   -3.3106092e-10
   22   -8.0389095e-08
   23    0
   24    0
   25    0
   26    0
   27    0
   28    0
   29    0
   30    0
   31    0
   39    7.8499803e-05
   40    0
   41    0
   42    0

BLOCK FWCOEF Q=  160
   305   4422   0   0   -0.18881911
   305   4422   0   2   -0.16218836
   305   4322   0   2   -3.1252982e-05
   305   6421   0   0   -0.095227835
   305   6421   0   2   -0.091028164
   305   6321   0   2   -0.00019070183
   3051111   4133   0   0    1.5911538
   3051111   4133   0   2    1.5920279
   3051111   4233   0   2    0.00011926332
   3051111   4137   0   0   -4.4138459
   3051111   4137   0   2   -4.4065074
   3051111   4237   0   2   -0.00092782203
   3051313   4133   0   0    1.5911538
   3051313   4133   0   2    1.5920264
   3051313   4233   0   2    0.00011926267
   3051313   4137   0   0   -4.4138459
   3051313   4137   0   2   -4.4065089
   3051313   4237   0   2   -0.00092782274
   3051212   4137   0   0    1.5053501
   3051212   4137   0   2    1.5037713
   3051212   4237   0   2    0.00020224763
   3051414   4137   0   0    1.5053501
   3051414   4137   0   2    1.5037713
   3051414   4237   0   2    0.00020224769
   3051616   4137   0   0    1.5053501
   3051616   4137   0   2    1.5037711
   3051616   4237   0   2    0.00020226408

BLOCK IMFWCOEF Q=  160
   305   4422   0   0    3.8584842e-07
   305   4422   0   2   -2.5538518e-05
   305   4322   0   2    3.2866997e-06
   305   6421   0   0    3.3050469e-07
   305   6421   0   2    3.027553e-06
   305   6321   0   2    1.4725194e-06
   3051111   4133   0   2   -1.4877356e-06
   3051111   4233   0   2    2.7387451e-06
   3051111   4137   0   2    1.3982612e-05
   3051111   4237   0   2   -2.1322176e-05
   3051313   4133   0   2   -1.4877424e-06
   3051313   4233   0   2    2.7387385e-06
   3051313   4137   0   2    1.3982643e-05
   3051313   4237   0   2   -2.1322193e-05
   3051212   4137   0   2   -2.660047e-06
   3051212   4237   0   2    4.6478186e-06
   3051414   4137   0   2   -2.6600465e-06
   3051414   4237   0   2    4.6478186e-06
   3051616   4137   0   2   -2.6645263e-06
   3051616   4237   0   2    4.6478179e-06

DECAY 23  2.4952


DECAY 24  2.085


DECAY 2000011  0.0024253561
    0.6740491   2    1000023    11
    0.31985667   2    1000022    11
    0.0060588287   2    1000025    11

DECAY 1000011  11.901872
    0.65416477   2   -1000037    12
    0.31670467   2    1000025    11
    0.015747115   2    1000022    11
    0.0094923346   2   -1000024    12
    0.0038911154   2    1000023    11

DECAY 2000013  0.0097648094
    0.37454725   2   -1000024    14
    0.35001384   2    1000023    13
    0.27194089   2    1000022    13
    0.0021576192   2    1000025    13
    0.0013404024   2   -1000037    14

DECAY 1000013  11.90877
    0.65378152   2   -1000037    14
    0.31652119   2    1000025    13
    0.016032768   2    1000022    13
    0.0094867972   2   -1000024    14
    0.0041721484   2    1000023    13

DECAY 1000015  16.960203
    0.56795409   2   -1000037    16
    0.27544575   2    1000025    15
    0.080559217   2    1000022    15
    0.067714679   2    1000023    15
    0.0083262603   2   -1000024    16

DECAY 2000015  5.3351812
    0.48975876   2   -1000024    16
    0.25008071   2    1000022    15
    0.24440864   2    1000023    15
    0.006760861   2   -1000037    16
    0.0036965229   2    1000035    15
    0.003308072   2    1000025    15
    0.0010144545   2    1000016   -24
    0.00050773099   2    1000015    25
    0.00046424886   2    1000015    23

DECAY 1000012  11.996503
    0.60872216   2    1000037    11
    0.31549926   2    1000025    12
    0.060695517   2    1000024    11
    0.012965643   2    1000022    12
    0.0021174233   2    1000023    12

DECAY 1000014  12.003316
    0.60837663   2    1000037    13
    0.315318   2    1000025    14
    0.061230936   2    1000024    13
    0.012958228   2    1000022    14
    0.0021162122   2    1000023    14

DECAY 1000016  17.038663
    0.53248774   2    1000037    15
    0.2754015   2    1000025    16
    0.17989348   2    1000024    15
    0.010499803   2    1000022    16
    0.001717479   2    1000023    16

DECAY 2000001  143.05121
    0.98444077   2    1000021    1
    0.015544077   2    1000035    1

DECAY 1000001  207.50276
    0.68402211   2    1000021    1
    0.20657779   2   -1000037    2
    0.1004969   2    1000025    1
    0.0033011986   2    1000022    1
    0.0027175578   2    1000035    1
    0.0022497358   2   -1000024    2
    0.00063470453   2    1000023    1

DECAY 2000003  143.06732
    0.98433209   2    1000021    3
    0.015542341   2    1000035    3

DECAY 1000003  207.51272
    0.68399028   2    1000021    3
    0.20656855   2   -1000037    4
    0.10049231   2    1000025    3
    0.0033203308   2    1000022    3
    0.0027174295   2    1000035    3
    0.0022577518   2   -1000024    4
    0.00065333901   2    1000023    3

DECAY 1000005  9.8335221
    0.48951123   2   -1000024    6
    0.2646789   2    1000022    5
    0.24520792   2    1000023    5
    0.00047700913   2   -1000037    6
    0.00012494883   2    1000025    5

DECAY 2000005  44.383471
    0.5258452   2   -1000024    6
    0.22879618   2   -1000037    6
    0.093399098   2    1000025    5
    0.065147923   2    1000022    5
    0.061829762   2    1000023    5
    0.024944787   2    1000006   -24

DECAY 2000002  149.80899
    0.94055841   2    1000021    2
    0.059384889   2    1000035    2

DECAY 1000002  207.50126
    0.68380858   2    1000021    2
    0.19449644   2    1000037    1
    0.1002209   2    1000025    2
    0.014533664   2    1000024    1
    0.0035095616   2    1000022    2
    0.0026572419   2    1000035    2
    0.00077360653   2    1000023    2

DECAY 2000004  149.81261
    0.94053575   2    1000021    4
    0.059383451   2    1000035    4

DECAY 1000004  207.51116
    0.68377667   2    1000021    4
    0.19448764   2    1000037    3
    0.10021645   2    1000025    4
    0.014570729   2    1000024    3
    0.0035134238   2    1000022    4
    0.0026571229   2    1000035    4
    0.00077795907   2    1000023    4

DECAY 1000006  40.075224
    0.28691675   2    1000023    6
    0.25140106   2    1000022    6
    0.20107046   2    1000037    5
    0.14152596   2    1000024    5
    0.11727204   2    1000025    6
    0.0012151501   3    1000022    24    5
    0.00049108363   2    1000022    4
    0.00010749136   2    1000023    4

DECAY 2000006  148.55771
    0.25048552   2    2000005    24
    0.21471161   2    1000024    5
    0.19198161   2    1000006    23
    0.11496109   2    1000023    6
    0.11266819   2    1000006    25
    0.11202012   2    1000022    6
    0.0014300787   2    1000005    24
    0.0013964214   2    1000025    6
    0.00034535478   2    1000037    5

DECAY 1000024  9.8544183e-10
    0.42067451   3    1000022   -1    2
    0.24942791   3    1000022   -3    4
    0.14025744   3    1000022   -11    12
    0.13973293   3    1000022   -13    14
    0.049907221   3    1000022   -15    16

DECAY 1000037  3.8434806
    0.29138182   2    1000023    24
    0.25279932   2    1000022    24
    0.24635032   2    1000024    23
    0.20850928   2    1000024    25
    0.00050157372   3    1000023   -5    6
    0.00045333951   3    1000022   -5    6

DECAY 1000022 -1


DECAY 1000023  1.5641506e-06
    0.17925693   2    1000022    22
    0.13319617   3    1000022    12   -12
    0.099592072   3    1000022    1   -1
    0.099527441   3    1000022    3   -3
    0.07767416   3    1000022    2   -2
    0.067970538   3    1000022    4   -4
    0.045250449   3    1000024    1   -2
    0.045250449   3   -1000024   -1    2
    0.040914202   3    1000024    3   -4
    0.040914202   3   -1000024   -3    4
    0.023469941   3    1000022    5   -5
    0.022471572   3    1000022    11   -11
    0.022449068   3    1000022    13   -13
    0.016893408   3    1000022    15   -15
    0.015083964   3    1000024    11   -12
    0.015083964   3   -1000024   -11    12
    0.015073361   3    1000024    13   -14
    0.015073361   3   -1000024   -13    14
    0.012427375   3    1000024    15   -16
    0.012427375   3   -1000024   -15    16

DECAY 1000025  4.6321292
    0.22273938   2    1000024   -24
    0.22273938   2   -1000024    24
    0.20292288   2    1000023    23
    0.18033784   2    1000023    25
    0.13453345   2    1000022    25
    0.035978722   2    1000022    23
    0.00036156709   3    1000024    5   -6
    0.00036156709   3   -1000024   -5    6

DECAY 1000035  17.73932
    0.14497689   2    2000013   -13
    0.14497689   2   -2000013    13
    0.14497401   2    2000011   -11
    0.14497401   2   -2000011    11
    0.060173463   2    1000024   -24
    0.060173463   2   -1000024    24
    0.040066358   2    1000023    25
    0.039265891   2    1000022    23
    0.032081932   2    1000022    25
    0.02132824   2    1000023    23
    0.015648761   2    1000006   -6
    0.015648761   2   -1000006    6
    0.01532737   2    1000005   -5
    0.01532737   2   -1000005    5
    0.0094311965   2    1000014   -14
    0.0094311965   2   -1000014    14
    0.0094309789   2    1000012   -12
    0.0094309789   2   -1000012    12
    0.0092398763   2    1000013   -13
    0.0092398763   2   -1000013    13
    0.0092396699   2    1000011   -11
    0.0092396699   2   -1000011    11
    0.0030249683   2    1000016   -16
    0.0030249683   2   -1000016    16
    0.0029351399   2    1000015   -15
    0.0029351399   2   -1000015    15
    0.0023345103   2    2000005   -5
    0.0023345103   2   -2000005    5
    0.0023302553   2    1000037   -24
    0.0023302553   2   -1000037    24
    0.0018045706   3    1000024    5   -6
    0.0018045706   3   -1000024   -5    6
    0.0017991707   2    1000025    23
    0.0015357989   2    1000025    25
    0.0009381962   3    1000023    6   -6
    0.00085456906   3    1000022    6   -6

DECAY 1000021  255.93713
    0.14577045   2    1000006   -6
    0.14577045   2   -1000006    6
    0.13332684   2    1000005   -5
    0.13332684   2   -1000005    5
    0.12461732   2    2000005   -5
    0.12461732   2   -2000005    5
    0.08076783   2    2000006   -6
    0.08076783   2   -2000006    6
    0.015381696   2    1000006   -4
    0.015381696   2   -1000006    4

DECAY 25  0.0040450301
    0.55814861   2   -5    5
    0.24569083   2   -24    24
    0.069844883   2    21    21
    0.064202913   2   -15    15
    0.030387513   2    23    23
    0.027373688   2   -4    4
    0.0023378584   2    22    22
    0.0015809645   2    22    23
    0.00022265967   2   -13    13
    0.00020935342   2   -3    3
    5.7883981e-07   2   -1    1
    1.4105996e-07   2   -2    2
    5.0056231e-09   2   -11    11

DECAY 35  50.547556
    0.4727921   2   -5    5
    0.13550469   2   -1000024    1000037
    0.13550469   2   -1000037    1000024
    0.070407148   2    1000022    1000025
    0.069534393   2    1000023    1000025
    0.069153815   2   -15    15
    0.02538831   2   -1000024    1000024
    0.0059669145   2    1000022    1000022
    0.0047322628   2    1000022    1000035
    0.0034390939   2   -1000037    1000037
    0.0023036483   2   -6    6
    0.0017267455   2    1000025    1000025
    0.0015203241   2    1000023    1000035
    0.00085499206   2    1000022    1000023
    0.00075691087   2    1000023    1000023
    0.0002390983   2   -13    13
    0.00015561973   2   -3    3
    8.5164184e-06   2    25    25
    7.5090505e-06   2    21    21
    1.4508183e-06   2    23    23
    7.1020569e-07   2   -24    24
    4.3022848e-07   2   -1    1
    2.2197825e-07   2    22    23
    1.3807595e-07   2   -1000011    1000011
    1.3735885e-07   2   -1000013    1000013
    8.2843776e-08   2    22    22
    2.9294678e-08   2   -4    4
    5.3705984e-09   2   -11    11
    4.1575491e-10   2   -2000013    1000013
    4.1575491e-10   2   -1000013    2000013
    1.5102245e-13   2   -2    2
    9.7245599e-15   2   -2000011    1000011
    9.7245599e-15   2   -1000011    2000011

DECAY 36  49.261967
    0.46226369   2   -5    5
    0.13946152   2   -1000024    1000037
    0.13946152   2   -1000037    1000024
    0.073711745   2    1000023    1000025
    0.070192349   2    1000022    1000025
    0.067614754   2   -15    15
    0.025682365   2   -1000024    1000024
    0.0055821478   2    1000022    1000022
    0.0047182124   2    1000023    1000035
    0.003190615   2   -1000037    1000037
    0.0022365558   2   -6    6
    0.0017568396   2    1000022    1000035
    0.0016193328   2    1000025    1000025
    0.0011631514   2    1000022    1000023
    0.00093719849   2    1000023    1000023
    0.00023377758   2   -13    13
    0.00015215067   2   -3    3
    1.9473153e-05   2    21    21
    2.0370529e-06   2    23    25
    4.2063821e-07   2   -1    1
    1.0280287e-07   2    22    23
    2.7638525e-08   2   -4    4
    8.5622012e-09   2    22    22
    5.2510914e-09   2   -11    11
    4.2511618e-10   2   -2000013    1000013
    4.2511618e-10   2   -1000013    2000013
    1.4249405e-13   2   -2    2
    9.9435061e-15   2   -2000011    1000011
    9.9435061e-15   2   -1000011    2000011
    7.687997e-39   2    25    25

DECAY 37  49.855643
    0.46788349   2   -5    6
    0.15832394   2    1000022    1000037
    0.14587427   2    1000024    1000025
    0.1417758   2    1000023    1000037
    0.070253913   2   -15    16
    0.0072849706   2    1000023    1000024
    0.006340397   2    1000024    1000035
    0.0011631433   2    1000022    1000024
    0.00069273843   2   -5    4
    0.00024837284   2   -13    14
    0.00014163379   2   -3    4
    6.6054304e-06   2   -3    2
    4.9468689e-06   2   -5    2
    3.1785403e-06   2   -3    6
    2.0192484e-06   2    24    25
    3.9287917e-07   2   -1    2
    1.362704e-07   2   -1    6
    2.4328749e-08   2    1000025    1000037
    1.95266e-08   2   -1    4
    5.8094666e-09   2   -11    12
    8.3904467e-10   2   -1000013    1000014
    8.5347211e-13   2    24    35
    1.2525446e-13   2    24    36
    1.9624976e-14   2   -1000011    1000012

DECAY 6  2.43
    1   2    5    24

DECAY 15 -1
