BLOCK SPINFO
   1   SPheno
   2   v4.0.5be

BLOCK SPHENOINFO
   1   2
   2   2

BLOCK MODSEL
   1   0

BLOCK MINPAR
   3    12.601744
   4    1

BLOCK EXTPAR
   0    1376.9383
   1    898.26076
   2   -3666.5994
   3    3988.2207
   11    5308.3863
   12    3450.1279
   13    4681.5981
   23    530.32718
   25    12.06971
   26    1296.6042
   31    3207.7978
   32    3207.7978
   33    2773.4056
   34    4245.2274
   35    4245.2274
   36    4643.2915
   41    2937.8623
   42    2937.8623
   43    2394.2005
   44    3101.3668
   45    3101.3668
   46    1138.8029
   47    4526.2605
   48    4526.2605
   49    1758.6183

BLOCK SMINPUTS
   1    127.90897
   2    1.1663787e-05
   3    0.1184
   4    91.1876
   5    4.18
   6    173.2
   7    1.777
   8    0
   11    0.00051099893
   12    0
   13    0.10565837
   14    0
   21    0.005
   22    0.0025
   23    0.095
   24    1.27

BLOCK GAUGE Q=  1376.9383
   1    0.35536298
   2    0.66519887
   3    1.219778

BLOCK YU Q=  1376.9383
   1   1    8.4131e-06
   2   2    0.0042738548
   3   3    1.0163701

BLOCK YD Q=  1376.9383
   1   1    0.00020404837
   2   2    0.0038769189
   3   3    0.20235204

BLOCK YE Q=  1376.9383
   1   1    3.5607932e-05
   2   2    0.007362591
   3   3    0.12382667

BLOCK AU Q=  1376.9383
   1   1    0
   2   2    0
   3   3    5308.3864

BLOCK AD Q=  1376.9383
   1   1    0
   2   2    0
   3   3    3450.1278

BLOCK AE Q=  1376.9383
   1   1    0
   2   2    0
   3   3    4681.5981

BLOCK MSOFT Q=  1376.9383
   1    898.26076
   2   -3666.5994
   3    3988.2207
   21    1457671.2
   22   -176854.43
   31    3207.7978
   32    3207.7978
   33    2773.4056
   34    4245.2274
   35    4245.2274
   36    4643.2915
   41    2937.8623
   42    2937.8623
   43    2394.2005
   44    3101.3668
   45    3101.3668
   46    1138.8029
   47    4526.2605
   48    4526.2605
   49    1758.6183

BLOCK MASS
   6    173.2
   23    91.1876
   24    80.429995
   15    1.777
   25    122.30612
   35    1296.6136
   36    1296.6042
   37    1299.1969
   1000001    2950.4442
   2000001    4543.7237
   1000002    2949.5935
   2000002    3102.6052
   1000003    2950.4443
   2000003    4543.7237
   1000004    2949.5936
   2000004    3102.6051
   1000005    1699.4172
   2000005    2305.5662
   1000006    810.33462
   2000006    2339.7236
   1000011    3208.1537
   2000011    4257.0869
   1000012    3206.8874
   1000013    3208.154
   2000013    4257.0867
   1000014    3206.8871
   1000015    2772.0621
   2000015    4654.2379
   1000016    2770.28
   1000021    3917.5584
   1000022    538.54352
   1000023   -539.64452
   1000025    904.66883
   1000035   -3641.8928
   1000024    540.64452
   1000037    3641.977

BLOCK ALPHA
      -0.080056332

BLOCK HMIX Q=  1376.9383
   1    530.32718
   2    12.06971
   3    243.9501
   4    1681182.4

BLOCK STOPMIX
   1   1   -0.17516844
   1   2    0.98453848
   2   1   -0.98453848
   2   2   -0.17516844

BLOCK SBOTMIX
   1   1    0.0024260022
   1   2    0.99999706
   2   1   -0.99999706
   2   2    0.0024260022

BLOCK STAUMIX
   1   1    0.99999998
   1   2    0.00021493507
   2   1   -0.00021493507
   2   2    0.99999998

BLOCK NMIX
   1   1    0.093914413
   1   2    0.014325001
   1   3    0.7049048
   1   4   -0.70291116
   2   1   -0.020308713
   2   2   -0.016445724
   2   3    0.70738621
   2   4    0.70634399
   3   1    0.9953731
   3   2   -0.001490183
   3   3   -0.052075279
   3   4    0.080736262
   4   1   -0.00019607442
   4   2    0.99976103
   4   3    0.001458463
   4   4    0.021811066

BLOCK UMIX
   1   1   -0.0020665037
   1   2    0.99999786
   2   1   -0.99999786
   2   2   -0.0020665037

BLOCK VMIX
   1   1    0.030860164
   1   2    0.99952371
   2   1    0.99952371
   2   2   -0.030860164

BLOCK HIGGSBOUNDSINPUTHIGGSCOUPLINGSFERMIONS
       0, 145.67789,3,36,15,15

BLOCK HIGGSBOUNDSINPUTHIGGSCOUPLINGSBOSONS
       0,4,36,21,21,23

BLOCK SPHENOLOWENERGY
   1    0.00035333672
   2    1.5893944e-06
   3    3.5286029e-05
   4    2.6449122e-15
   5    1.1298767e-10
   6    2.3654046e-08
   7    8.8945508e-14
   8    3.7997499e-09
   9    8.0599951e-07
   10    9.6202318e-05
   11    0.99373312
   12    0.54316928
   13    19.405342
   14    0
   15    0
   16    0.0021630145
   17    2.2837212e-15
   18    2.4818601e-11
   19    8.2954106e-11
   20   -4.4222154e-16
   21   -1.8906312e-11
   22   -5.9103372e-09
   23    0
   24    0
   25    0
   26    0
   27    0
   28    0
   29    0
   30    0
   31    0
   39    1.5910149e-05
   40    0
   41    0
   42    0

BLOCK FWCOEF Q=  160
   305   4422   0   0   -0.18881911
   305   4422   0   2   -0.22349012
   305   4322   0   2   -0.00065014388
   305   6421   0   0   -0.095227835
   305   6421   0   2   -0.12886042
   305   6321   0   2   -0.00064077
   3051111   4133   0   0    1.5887153
   3051111   4133   0   2    1.5901709
   3051111   4233   0   2    9.5017425e-06
   3051111   4137   0   0   -4.4114074
   3051111   4137   0   2   -4.4130211
   3051111   4237   0   2   -7.3753184e-05
   3051313   4133   0   0    1.5887153
   3051313   4133   0   2    1.5901708
   3051313   4233   0   2    9.5016863e-06
   3051313   4137   0   0   -4.4114074
   3051313   4137   0   2   -4.4130212
   3051313   4237   0   2   -7.375314e-05
   3051212   4137   0   0    1.5053501
   3051212   4137   0   2    1.5057026
   3051212   4237   0   2    1.6084581e-05
   3051414   4137   0   0    1.5053501
   3051414   4137   0   2    1.5057026
   3051414   4237   0   2    1.6084593e-05
   3051616   4137   0   0    1.5053501
   3051616   4137   0   2    1.5057025
   3051616   4237   0   2    1.6087866e-05

BLOCK IMFWCOEF Q=  160
   305   4422   0   0    3.8579039e-07
   305   4422   0   2   -1.3225786e-06
   305   4322   0   2   -3.5733142e-06
   305   6421   0   0    3.3045498e-07
   305   6421   0   2   -2.5010669e-06
   305   6321   0   2   -1.670267e-06
   3051111   4133   0   2    1.0119874e-06
   3051111   4233   0   2    4.0978541e-07
   3051111   4137   0   2   -6.8152879e-06
   3051111   4237   0   2   -3.198586e-06
   3051313   4133   0   2    1.0119861e-06
   3051313   4233   0   2    4.0978536e-07
   3051313   4137   0   2   -6.8152891e-06
   3051313   4237   0   2   -3.1985862e-06
   3051212   4137   0   2    1.4937619e-06
   3051212   4237   0   2    6.9759215e-07
   3051414   4137   0   2    1.4937619e-06
   3051414   4237   0   2    6.9759215e-07
   3051616   4137   0   2    1.4931948e-06
   3051616   4237   0   2    6.9759177e-07

DECAY 23  2.4952


DECAY 24  2.085


DECAY 1000011  3.4295834
    0.98089501   2    1000025    11
    0.016175411   2    1000022    11
    0.0028963832   2    1000023    11

DECAY 2000011  19.513119
    0.99020085   2    1000025    11
    0.0093614258   2    1000022    11
    0.00043771067   2    1000023    11

DECAY 1000013  3.4328499
    0.97996403   2    1000025    13
    0.016633033   2    1000022    13
    0.0033697731   2    1000023    13

DECAY 2000013  19.522021
    0.98974985   2    1000025    13
    0.0094702834   2    1000022    13
    0.00055143694   2    1000023    13
    0.0002276527   2   -1000024    14

DECAY 1000015  3.5768662
    0.76619102   2    1000025    15
    0.12193535   2    1000022    15
    0.11184561   2    1000023    15

DECAY 2000015  25.766219
    0.83271478   2    1000025    15
    0.05362509   2   -1000024    16
    0.034438119   2    1000022    15
    0.027200283   2    1000023    15
    0.025973382   2    1000016   -37
    0.012990732   2    1000015    36
    0.012988521   2    1000015    35

DECAY 1000012  3.4431033
    0.98753257   2    1000025    12
    0.0073714595   2    1000024    11
    0.0049747467   2    1000022    12
    0.00012122777   2    1000023    12

DECAY 1000014  3.4463678
    0.98659701   2    1000025    14
    0.0083118427   2    1000024    13
    0.0049700339   2    1000022    14
    0.00012111293   2    1000023    14

DECAY 1000016  3.585476
    0.77174546   2    1000025    16
    0.2241102   2    1000024    15
    0.0040457608   2    1000022    16

DECAY 1000001  0.34271684
    0.99366085   2    1000025    1
    0.0058297974   2    1000023    1
    0.0003023066   2   -1000024    2
    0.00020704478   2    1000022    1

DECAY 2000001  25.960501
    0.90983355   2    1000021    1
    0.089289206   2    1000025    1
    0.00083786302   2    1000022    1

DECAY 1000003  0.34453902
    0.98841159   2    1000025    3
    0.0069925437   2    1000023    3
    0.0032042379   2   -1000024    4
    0.0013916269   2    1000022    3

DECAY 2000003  25.963138
    0.90974105   2    1000021    3
    0.089280272   2    1000025    3
    0.00086298171   2    1000022    3

DECAY 1000005  2.6971213
    0.40347885   2   -1000024    6
    0.20892859   2    1000022    5
    0.20780069   2    1000023    5
    0.17969017   2    1000025    5
    0.00010170838   2    1000006   -24

DECAY 2000005  218.19349
    0.78533703   2    1000006   -24
    0.19131565   2   -1000024    6
    0.01455588   2    1000006   -37
    0.003854368   2    1000023    5
    0.003821016   2    1000022    5
    0.0010826753   2    1000025    5

DECAY 1000002  0.36882336
    0.89242703   2    1000025    2
    0.062628649   2    1000024    1
    0.031709102   2    1000022    2
    0.013235224   2    1000023    2

DECAY 2000002  5.8071883
    0.98963861   2    1000025    2
    0.0098986234   2    1000022    2
    0.00046277   2    1000023    2

DECAY 1000004  0.37064566
    0.88805198   2    1000025    4
    0.064537866   2    1000024    3
    0.032890659   2    1000022    4
    0.014519492   2    1000023    4

DECAY 2000004  5.8093047
    0.98927919   2    1000025    4
    0.0099849037   2    1000022    4
    0.00055359272   2    1000023    4
    0.0001823102   2    1000024    3

DECAY 1000006  9.1982476
    0.54589218   2    1000024    5
    0.23154372   2    1000023    6
    0.22256419   2    1000022    6

DECAY 2000006  229.54317
    0.40764916   2    1000006    25
    0.38229589   2    1000006    23
    0.091456516   2    1000022    6
    0.091367997   2    1000023    6
    0.011724443   2    1000024    5
    0.0076069836   2    1000006    36
    0.0065214736   2    1000006    35
    0.0013552405   2    1000025    6

DECAY 1000024  1.3014509e-11
    0.57514191   3    1000022   -1    2
    0.19172353   3    1000022   -11    12
    0.18826331   3    1000022   -13    14
    0.025304615   3    1000022   -3    4
    0.01203253   3    1000023   -1    2
    0.0040123517   3    1000023   -11    12
    0.0035217477   3    1000023   -13    14

DECAY 1000037  121.8842
    0.13916985   2   -2000005    6
    0.1340041   2    2000006   -5
    0.062477242   2    1000024    25
    0.060265793   2    1000024    23
    0.060195977   2    1000023    24
    0.059760409   2    1000022    24
    0.052392724   2    1000024    36
    0.052301537   2    1000024    35
    0.052029342   2    37    1000022
    0.047005905   2    37    1000023
    0.04666839   2    1000002   -1
    0.046668376   2    1000004   -3
    0.046609988   2   -1000001    2
    0.046609883   2   -1000003    4
    0.02333369   2    1000016   -15
    0.023273353   2   -1000015    16
    0.0066317091   2    1000014   -13
    0.0066316998   2    1000012   -11
    0.0066018525   2   -1000011    12
    0.0066018431   2   -1000013    14
    0.0059947888   3    1000024    6   -6
    0.0059008882   2    1000006   -5
    0.0042182516   3    1000023   -5    6
    0.0037459666   3    1000022   -5    6
    0.00056285865   2    1000025    24
    0.0003040883   2    37    1000025

DECAY 1000022 -1


DECAY 1000023  2.8516202e-10
    0.98692704   2    1000022    22
    0.0039228321   3    1000022    12   -12
    0.0029327173   3    1000022    1   -1
    0.0026898797   3    1000022    3   -3
    0.0022876502   3    1000022    2   -2
    0.00066198846   3    1000022    11   -11
    0.00057789323   3    1000022    13   -13

DECAY 1000025  2.6914231
    0.23863463   2    1000023    23
    0.21584479   2    1000024   -24
    0.21584479   2   -1000024    24
    0.18191659   2    1000022    25
    0.13533553   2    1000023    25
    0.010948143   2    1000022    23
    0.00071724801   3    1000024    5   -6
    0.00071724801   3   -1000024   -5    6

DECAY 1000035  123.98077
    0.069608942   2    2000005   -5
    0.069608942   2   -2000005    5
    0.066660004   2    2000006   -6
    0.066660004   2   -2000006    6
    0.05936347   2    1000024   -24
    0.05936347   2   -1000024    24
    0.047735124   2    1000022    25
    0.046128828   2    37   -1000024
    0.046128828   2   -37    1000024
    0.037731147   2    1000023    35
    0.034853151   2    1000023    25
    0.033215455   2    1000022    23
    0.027161939   2    1000022    35
    0.025637279   2    1000023    23
    0.022944318   2    1000002   -2
    0.022944318   2   -1000002    2
    0.022944299   2    1000004   -4
    0.022944299   2   -1000004    4
    0.02289707   2    1000001   -1
    0.02289707   2   -1000001    1
    0.022897067   2    1000003   -3
    0.022897067   2   -1000003    3
    0.018929998   2    1000022    36
    0.013671074   2    1000023    36
    0.011475678   2    1000016   -16
    0.011475678   2   -1000016    16
    0.011430324   2    1000015   -15
    0.011430324   2   -1000015    15
    0.0045128071   3    1000024    5   -6
    0.0045128071   3   -1000024   -5    6
    0.0032608969   2    1000014   -14
    0.0032608969   2   -1000014    14
    0.0032608922   2    1000012   -12
    0.0032608922   2   -1000012    12
    0.0032504208   3    1000022    6   -6
    0.0032417757   2    1000011   -11
    0.0032417757   2   -1000011    11
    0.003241771   2    1000013   -13
    0.003241771   2   -1000013    13
    0.003018105   3    1000023    6   -6
    0.002950401   2    1000006   -6
    0.002950401   2   -1000006    6
    0.00050410758   2    1000025    25
    0.00036983608   2    1000025    23
    0.00016298314   2    1000025    35

DECAY 1000021  400.44574
    0.13685629   2    1000006   -6
    0.13685629   2   -1000006    6
    0.095422159   2    1000005   -5
    0.095422159   2   -1000005    5
    0.061861513   2    2000005   -5
    0.061861513   2   -2000005    5
    0.056892707   2    2000006   -6
    0.056892707   2   -2000006    6
    0.0271609   2    1000002   -2
    0.0271609   2   -1000002    2
    0.027160877   2    1000004   -4
    0.027160877   2   -1000004    4
    0.027119898   2    1000001   -1
    0.027119898   2   -1000001    1
    0.027119895   2    1000003   -3
    0.027119895   2   -1000003    3
    0.020120159   2    2000002   -2
    0.020120159   2   -2000002    2
    0.020120146   2    2000004   -4
    0.020120146   2   -2000004    4
    0.00028928902   3    1000025    6   -6

DECAY 25  0.003606578
    0.62097591   2   -5    5
    0.18369215   2   -24    24
    0.070913619   2   -15    15
    0.069220309   2    21    21
    0.03006381   2   -4    4
    0.021062189   2    23    23
    0.0023400388   2    22    22
    0.0012528788   2    22    23
    0.00024596088   2   -13    13
    0.00023233648   2   -3    3
    6.4238454e-07   2   -1    1
    1.5493525e-07   2   -2    2
    5.52951e-09   2   -11    11

DECAY 35  2.9020157
    0.75934115   2   -5    5
    0.14547923   2   -15    15
    0.091308475   2   -6    6
    0.0008791276   2    1000022    1000023
    0.00084741422   2    25    25
    0.00067961954   2   -1000024    1000024
    0.00050511241   2   -13    13
    0.00032522031   2   -3    3
    0.00031788863   2    1000022    1000022
    0.00013132267   2    23    23
    0.00012805445   2   -24    24
    3.9466424e-05   2    21    21
    1.5316996e-05   2    1000023    1000023
    1.4017419e-06   2   -4    4
    8.9922348e-07   2   -1    1
    2.4263002e-07   2    22    22
    4.4151839e-08   2    22    23
    1.1347474e-08   2   -11    11
    7.2277062e-12   2   -2    2

DECAY 36  2.8660633
    0.75455089   2   -5    5
    0.14454037   2   -15    15
    0.096032625   2   -6    6
    0.0020372246   2   -1000024    1000024
    0.0013184097   2    1000022    1000022
    0.00050184836   2   -13    13
    0.00032311993   2   -3    3
    0.00023926849   2    21    21
    0.00023885676   2    1000022    1000023
    0.00018036588   2    23    25
    3.3978591e-05   2    1000023    1000023
    1.3567018e-06   2   -4    4
    8.9341585e-07   2   -1    1
    5.7011548e-07   2    22    22
    2.1386263e-07   2    22    23
    1.1274147e-08   2   -11    11
    6.996417e-12   2   -2    2
    3.4606633e-38   2    25    25

DECAY 37  2.8217182
    0.84796044   2   -5    6
    0.14622327   2   -15    16
    0.0030595671   2    1000022    1000024
    0.0010955993   2   -5    4
    0.00051695303   2   -13    14
    0.00045795776   2    1000023    1000024
    0.00029674051   2   -3    4
    0.00018496055   2    24    25
    0.00017409314   2   -3    6
    1.3681507e-05   2   -3    2
    7.9654597e-06   2   -1    6
    7.8237045e-06   2   -5    2
    8.1902477e-07   2   -1    2
    1.1282158e-07   2   -1    4
    1.2091585e-08   2   -11    12
    5.6409828e-11   2    24    36
    5.5397949e-11   2    24    35

DECAY 6  2.43
    1   2    5    24

DECAY 15 -1
