BLOCK SPINFO
   1   SPheno
   2   v4.0.5be

BLOCK SPHENOINFO
   1   2
   2   2

BLOCK MODSEL
   1   0

BLOCK MINPAR
   3    46.518776
   4   -1

BLOCK EXTPAR
   0    1724.8819
   1    272.64783
   2   -1025.8787
   3    3000
   11   -3914.7087
   12    1562.6747
   13    101.81641
   23   -1126.3274
   25    46.835484
   26    1339.0957
   31    1845.0894
   32    1845.0894
   33    868.0894
   34    254.19864
   35    254.19864
   36    1609.4055
   41    5000
   42    5000
   43    1636.882
   44    5000
   45    5000
   46    1888.7979
   47    5000
   48    5000
   49    920.99809

BLOCK SMINPUTS
   1    127.90897
   2    1.1663787e-05
   3    0.1184
   4    91.1876
   5    4.18
   6    173.2
   7    1.777
   8    0
   11    0.00051099893
   12    0
   13    0.10565837
   14    0
   21    0.005
   22    0.0025
   23    0.095
   24    1.27

BLOCK GAUGE Q=  1724.8819
   1    0.35536298
   2    0.66519887
   3    1.219778

BLOCK YU Q=  1724.8819
   1   1    8.3862831e-06
   2   2    0.0042602318
   3   3    1.0131303

BLOCK YD Q=  1724.8819
   1   1    0.00078926851
   2   2    0.014996102
   3   3    0.78270704

BLOCK YE Q=  1724.8819
   1   1    0.00013773313
   2   2    0.028478842
   3   3    0.47896728

BLOCK AU Q=  1724.8819
   1   1    0
   2   2    0
   3   3   -3914.709

BLOCK AD Q=  1724.8819
   1   1    0
   2   2    0
   3   3    1562.6757

BLOCK AE Q=  1724.8819
   1   1    0
   2   2    0
   3   3    101.81641

BLOCK MSOFT Q=  1724.8819
   1    272.64783
   2   -1025.8787
   3    3000
   21    665984
   22   -1222647.5
   31    1845.0894
   32    1845.0894
   33    868.0894
   34    254.19864
   35    254.19864
   36    1609.4055
   41    5000
   42    5000
   43    1636.882
   44    5000
   45    5000
   46    1888.7979
   47    5000
   48    5000
   49    920.99809

BLOCK MASS
   6    173.2
   23    91.1876
   24    80.429995
   15    1.777
   25    124.54079
   35    1338.6308
   36    1339.0957
   37    1342.9914
   1000001    5038.1705
   2000001    5028.2569
   1000002    5037.719
   2000002    5028.9836
   1000003    5038.1803
   2000003    5028.2568
   1000004    5037.7225
   2000004    5028.9842
   1000005    918.37642
   2000005    1641.7773
   1000006    1551.4753
   2000006    1917.6699
   1000011    1850.9618
   2000011    273.5628
   1000012    1848.8959
   1000013    1850.9508
   2000013    273.49516
   1000014    1848.882
   1000015    873.80854
   2000015    1605.088
   1000016    874.19367
   1000021    3206.8051
   1000022    270.30248
   1000023   -1032.0889
   1000025    1119.7483
   1000035   -1155.3206
   1000024    1032.4442
   1000037    1155.5822

BLOCK ALPHA
      -0.021831315

BLOCK HMIX Q=  1724.8819
   1   -1126.3274
   2    46.835484
   3    243.83503
   4    1793177.4

BLOCK STOPMIX
   1   1    0.88572819
   1   2    0.46420424
   2   1   -0.46420424
   2   2    0.88572819

BLOCK SBOTMIX
   1   1   -0.090587016
   1   2    0.99588854
   2   1   -0.99588854
   2   2   -0.090587016

BLOCK STAUMIX
   1   1   -0.9985046
   1   2    0.054667679
   2   1   -0.054667679
   2   2   -0.9985046

BLOCK NMIX
   1   1    0.99908026
   1   2    0.00056544705
   1   3   -0.041827888
   1   4   -0.0094201191
   2   1    0.011993522
   2   2    0.85996432
   2   3    0.37581324
   2   4   -0.3450825
   3   1    0.03622688
   3   2   -0.025148951
   3   3    0.70570263
   3   4    0.70713431
   4   1    0.01955503
   4   2   -0.50973383
   4   3    0.59916494
   4   4   -0.61708216

BLOCK UMIX
   1   1   -0.83037228
   1   2   -0.557209
   2   1   -0.557209
   2   2    0.83037228

BLOCK VMIX
   1   1    0.85734977
   1   2    0.51473427
   2   1    0.51473427
   2   2   -0.85734977

BLOCK HIGGSBOUNDSINPUTHIGGSCOUPLINGSFERMIONS
       0, 2193.5626,3,36,15,15

BLOCK HIGGSBOUNDSINPUTHIGGSCOUPLINGSBOSONS
       0,4,36,21,21,23

BLOCK SPHENOLOWENERGY
   1    0.00039228847
   2    1.5874922e-06
   3    3.5238847e-05
   4    3.0028349e-15
   5    1.2806431e-10
   6    1.4474097e-08
   7    9.7964275e-14
   8    4.1782592e-09
   9    4.8965392e-07
   10    8.4412614e-05
   11    0.87194998
   12    0.54279848
   13    19.215611
   14    0
   15    0
   16    0.0021683369
   17    2.2817787e-15
   18    2.4803878e-11
   19    8.2906627e-11
   20    4.0615659e-15
   21    1.7357087e-10
   22    7.5301518e-08
   23    0
   24    0
   25    0
   26    0
   27    0
   28    0
   29    0
   30    0
   31    0
   39    7.6152121e-05
   40    0
   41    0
   42    0

BLOCK FWCOEF Q=  160
   305   4422   0   0   -0.18881911
   305   4422   0   2   -0.26627832
   305   4322   0   2   -0.00082125985
   305   6421   0   0   -0.095227835
   305   6421   0   2   -0.15131793
   305   6321   0   2   -0.00068307602
   3051111   4133   0   0    1.5975346
   3051111   4133   0   2    1.598081
   3051111   4233   0   2    0.00022937773
   3051111   4137   0   0   -4.4202267
   3051111   4137   0   2   -4.4172447
   3051111   4237   0   2   -0.0017700813
   3051313   4133   0   0    1.5975346
   3051313   4133   0   2    1.598078
   3051313   4233   0   2    0.00022936611
   3051313   4137   0   0   -4.4202267
   3051313   4137   0   2   -4.4172476
   3051313   4237   0   2   -0.0017700758
   3051212   4137   0   0    1.5053501
   3051212   4137   0   2    1.5047103
   3051212   4237   0   2    0.00038526683
   3051414   4137   0   0    1.5053501
   3051414   4137   0   2    1.5047103
   3051414   4237   0   2    0.00038526893
   3051616   4137   0   0    1.5053501
   3051616   4137   0   2    1.5047104
   3051616   4237   0   2    0.00038586248

BLOCK IMFWCOEF Q=  160
   305   4422   0   0    3.8559469e-07
   305   4422   0   2    1.4110237e-05
   305   4322   0   2   -6.8987936e-06
   305   6421   0   0    3.3028735e-07
   305   6421   0   2    3.1790856e-05
   305   6321   0   2   -2.7769039e-06
   3051111   4133   0   2   -2.1479824e-06
   3051111   4233   0   2    7.3866348e-06
   3051111   4137   0   2    1.8445284e-05
   3051111   4237   0   2   -5.7048296e-05
   3051313   4133   0   2   -2.1479593e-06
   3051313   4233   0   2    7.3866011e-06
   3051313   4137   0   2    1.8445318e-05
   3051313   4237   0   2   -5.7048372e-05
   3051212   4137   0   2   -3.8431951e-06
   3051212   4237   0   2    1.241707e-05
   3051414   4137   0   2   -3.843195e-06
   3051414   4237   0   2    1.241707e-05
   3051616   4137   0   2   -3.8414148e-06
   3051616   4237   0   2    1.2417048e-05

DECAY 23  2.4952


DECAY 24  2.085


DECAY 2000011  0.0007702589
    1   2    1000022    11

DECAY 1000011  13.103631
    0.40687631   2   -1000024    12
    0.22159756   2    1000023    11
    0.16999927   2    1000022    11
    0.14376869   2   -1000037    12
    0.057749744   2    1000035    11

DECAY 2000013  0.00073870576
    1   2    1000022    13

DECAY 1000013  13.120833
    0.40633612   2   -1000024    14
    0.22145707   2    1000023    13
    0.16977909   2    1000022    13
    0.14357718   2   -1000037    14
    0.057976292   2    1000035    13
    0.00046405624   2    1000025    13
    0.00041003285   2    2000013    25

DECAY 1000015  0.91892726
    1   2    1000022    15

DECAY 2000015  16.92807
    0.4477143   2    1000022    15
    0.16945058   2    1000016   -24
    0.084087003   2    1000015    23
    0.076244456   2   -1000037    16
    0.073234723   2    1000015    25
    0.057298292   2    1000025    15
    0.039528928   2    1000035    15
    0.036197557   2   -1000024    16
    0.016244161   2    1000023    15

DECAY 1000012  13.116797
    0.43195056   2    1000024    11
    0.21420222   2    1000023    12
    0.16890526   2    1000022    12
    0.12207641   2    1000037    11
    0.062372887   2    1000035    12
    0.0004926587   2    1000025    12

DECAY 1000014  13.128559
    0.43188638   2    1000024    13
    0.21400582   2    1000023    14
    0.16875257   2    1000022    14
    0.12254753   2    1000037    13
    0.062315347   2    1000035    14
    0.00049220512   2    1000025    14

DECAY 1000016  0.89463865
    1   2    1000022    16

DECAY 2000001  142.4845
    0.98041415   2    1000021    1
    0.019552349   2    1000022    1

DECAY 1000001  202.08453
    0.69636595   2    1000021    1
    0.13888491   2   -1000024    2
    0.074115127   2    1000023    1
    0.061160094   2   -1000037    2
    0.025943339   2    1000035    1
    0.0034314195   2    1000022    1

DECAY 2000003  142.52501
    0.98013534   2    1000021    3
    0.019547065   2    1000022    3

DECAY 1000003  202.10764
    0.69629135   2    1000021    3
    0.13887138   2   -1000024    4
    0.074121278   2    1000023    3
    0.061159337   2   -1000037    4
    0.02597623   2    1000035    3
    0.0034312276   2    1000022    3
    0.00014919464   2    1000025    3

DECAY 1000005  0.46384027
    1   2    1000022    5

DECAY 2000005  29.02271
    0.3016552   2   -1000037    6
    0.15902027   2   -1000024    6
    0.13343929   2    1000005    23
    0.11180993   2    1000005    25
    0.09879837   2    1000025    5
    0.093811561   2    1000023    5
    0.08502444   2    1000035    5
    0.0092784693   2    1000006   -24
    0.0071624756   2    1000022    5

DECAY 2000002  150.93328
    0.92603417   2    1000021    2
    0.073842267   2    1000022    2

DECAY 1000002  202.07595
    0.69616309   2    1000021    2
    0.14804658   2    1000024    1
    0.074850312   2    1000023    2
    0.052187987   2    1000037    1
    0.025242213   2    1000035    2
    0.0034751541   2    1000022    2

DECAY 2000004  150.93654
    0.92601406   2    1000021    4
    0.073840664   2    1000022    4

DECAY 1000004  202.09826
    0.69608775   2    1000021    4
    0.14806197   2    1000024    3
    0.074843149   2    1000023    4
    0.05225118   2    1000037    3
    0.025242445   2    1000035    4
    0.0034747734   2    1000022    4

DECAY 1000006  18.711926
    0.27402247   2    1000037    5
    0.23349796   2    1000005    24
    0.12127104   2    1000025    6
    0.11114807   2    1000024    5
    0.098986663   2    1000035    6
    0.079782583   2    1000023    6
    0.049321837   2    1000022    6
    0.02799917   2    1000023    4
    0.0036305617   2    1000022    4
    0.00033964676   3    1000022    24    5

DECAY 2000006  85.486849
    0.19978434   2    2000005    24
    0.1774954   2    1000006    23
    0.12782801   2    1000024    5
    0.11134531   2    1000025    6
    0.098309864   2    1000006    25
    0.083636178   2    1000037    5
    0.06428434   2    1000023    6
    0.055795038   2    1000035    6
    0.044932174   2    1000005    24
    0.036589356   2    1000022    6

DECAY 1000024  0.76386993
    0.43106341   2    1000016   -15
    0.34679354   2   -1000015    16
    0.21409851   2    1000022    24
    0.0050411783   3    1000022   -5    6
    0.0029270703   2   -2000013    14

DECAY 1000037  4.7088511
    0.32803971   2   -1000005    6
    0.31301882   2    1000023    24
    0.12211869   2    1000016   -15
    0.12167444   2    1000022    24
    0.057072597   2    1000024    23
    0.054320852   2   -1000015    16
    0.002480754   3    1000022   -5    6
    0.0012164868   2   -2000013    14

DECAY 1000022 -1


DECAY 1000023  1.1120412
    0.15107009   2    1000015   -15
    0.15107009   2   -1000015    15
    0.13025013   2    1000005   -5
    0.13025013   2   -1000005    5
    0.11881708   2    1000016   -16
    0.11881708   2   -1000016    16
    0.099144371   2    1000022    23
    0.096631622   2    1000022    25
    0.0012043852   2    2000013   -13
    0.0012043852   2   -2000013    13
    0.00079534267   3    1000022    6   -6
    0.00028995031   2    2000011   -11
    0.00028995031   2   -2000011    11

DECAY 1000025  3.3531804
    0.32234618   2    1000005   -5
    0.32234618   2   -1000005    5
    0.14141764   2    1000022    25
    0.062808277   2    1000022    23
    0.057596961   2    1000015   -15
    0.057596961   2   -1000015    15
    0.0083609702   2    1000024   -24
    0.0083609702   2   -1000024    24
    0.0021603964   2    2000013   -13
    0.0021603964   2   -2000013    13
    0.0021571146   3    1000023    12   -12
    0.0016132798   3    1000023    1   -1
    0.00161327   3    1000023    3   -3
    0.0015593337   3    1000023    5   -5
    0.0015488087   3    1000022    6   -6
    0.0012582303   3    1000023    2   -2
    0.0012564232   3    1000023    4   -4
    0.00097354923   2    2000011   -11
    0.00097354923   2   -2000011    11
    0.00036406742   3    1000023    11   -11
    0.00036406179   3    1000023    13   -13
    0.0003616831   3    1000023    15   -15
    0.00022194082   2    1000016   -16
    0.00022194082   2   -1000016    16
    0.0001619307   2    1000023    22
    0.00013628284   3    1000022    5   -5

DECAY 1000035  5.4388048
    0.17651533   2    1000024   -24
    0.17651533   2   -1000024    24
    0.17094793   2    1000005   -5
    0.17094793   2   -1000005    5
    0.0784045   2    1000022    23
    0.076275054   2    1000022    25
    0.050533018   2    1000015   -15
    0.050533018   2   -1000015    15
    0.023113165   2    1000016   -16
    0.023113165   2   -1000016    16
    0.00096878736   3    1000022    6   -6
    0.00073017263   2    2000013   -13
    0.00073017263   2   -2000013    13
    0.00018184579   2    2000011   -11
    0.00018184579   2   -2000011    11
    0.0001670256   2    1000023    23

DECAY 1000021  243.97071
    0.16401726   2    1000005   -5
    0.16401726   2   -1000005    5
    0.1058528   2    2000005   -5
    0.1058528   2   -2000005    5
    0.1007001   2    1000006   -6
    0.1007001   2   -1000006    6
    0.090860357   2    2000006   -6
    0.090860357   2   -2000006    6
    0.037908612   2    1000006   -4
    0.037908612   2   -1000006    4
    0.00030238629   3    1000025    5   -5
    0.00017396103   3    1000035    5   -5
    0.00015658526   3    1000023    5   -5
    0.00013247032   3    1000037    5   -6
    0.00013247032   3   -1000037   -5    6
    0.00013111996   3    1000024    5   -6
    0.00013111996   3   -1000024   -5    6

DECAY 25  0.003889159
    0.58747359   2   -5    5
    0.21710867   2   -24    24
    0.069819139   2    21    21
    0.067291919   2   -15    15
    0.028076038   2   -4    4
    0.026042887   2    23    23
    0.002297234   2    22    22
    0.0014370947   2    22    23
    0.0002329698   2   -13    13
    0.00021969322   2   -3    3
    6.074333e-07   2   -1    1
    1.4468351e-07   2   -2    2
    5.2374247e-09   2   -11    11

DECAY 35  75.225541
    0.90073142   2   -5    5
    0.097508766   2   -15    15
    0.00060812631   2   -6    6
    0.0005319356   2    1000022    1000023
    0.000301178   2   -13    13
    0.00021766545   2   -3    3
    5.2019082e-05   2    1000022    1000022
    3.8132773e-05   2    21    21
    8.2838447e-06   2    25    25
    8.5197271e-07   2    23    23
    7.960742e-07   2   -24    24
    6.0195401e-07   2   -1    1
    7.4799873e-08   2   -1000011    1000011
    7.3465738e-08   2   -1000013    1000013
    3.2544083e-08   2    22    23
    2.8207778e-08   2    22    22
    6.7659736e-09   2   -11    11
    4.323654e-09   2   -4    4
    2.2275939e-14   2   -2    2

DECAY 36  70.77176
    0.90105854   2   -5    5
    0.097542452   2   -15    15
    0.00068563229   2   -6    6
    0.00030126021   2   -13    13
    0.00021772304   2   -3    3
    8.2477993e-05   2    1000022    1000023
    6.5028407e-05   2    1000022    1000022
    4.502764e-05   2    21    21
    1.2211651e-06   2    23    25
    6.0211352e-07   2   -1    1
    2.0576597e-08   2    22    22
    6.7678213e-09   2   -11    11
    4.611753e-09   2   -4    4
    4.4176696e-09   2    22    23
    2.3762849e-14   2   -2    2
    3.7265768e-36   2    25    25

DECAY 37  59.436517
    0.89943827   2   -5    6
    0.097784593   2   -15    16
    0.0013563703   2   -5    4
    0.00080039488   2    1000022    1000024
    0.00034570441   2   -13    14
    0.00025015708   2   -3    4
    1.160181e-05   2   -3    2
    9.685898e-06   2   -5    2
    1.4717996e-06   2    24    25
    9.8246364e-07   2   -3    6
    6.9460758e-07   2   -1    2
    3.2390097e-08   2   -1    4
    2.8685778e-08   2   -1    6
    8.0860622e-09   2   -11    12
    3.601588e-11   2    24    35
    2.0499748e-11   2    24    36

DECAY 6  2.43
    1   2    5    24

DECAY 15 -1
