BLOCK SPINFO
   1   SPheno
   2   v4.0.5be

BLOCK SPHENOINFO
   1   2
   2   2

BLOCK MODSEL
   1   0

BLOCK MINPAR
   3    25.399057
   4    1

BLOCK EXTPAR
   0    1127.413
   1   -521.19241
   2    964.60855
   3    3000
   11   -2792.7016
   12    1270.2094
   13    1423.4293
   23    1631.9898
   25    24.618873
   26    387.80063
   31    1206.4731
   32    1206.4731
   33    812.39031
   34    1408.9774
   35    1408.9774
   36    1169.9388
   41    5000
   42    5000
   43    1726.0482
   44    5000
   45    5000
   46    907.167
   47    5000
   48    5000
   49    1736.3822

BLOCK SMINPUTS
   1    127.90897
   2    1.1663787e-05
   3    0.1184
   4    91.1876
   5    4.18
   6    173.2
   7    1.777
   8    0
   11    0.00051099893
   12    0
   13    0.10565837
   14    0
   21    0.005
   22    0.0025
   23    0.095
   24    1.27

BLOCK GAUGE Q=  1127.413
   1    0.35536298
   2    0.66519887
   3    1.219778

BLOCK YU Q=  1127.413
   1   1    8.3912861e-06
   2   2    0.0042627733
   3   3    1.0137348

BLOCK YD Q=  1127.413
   1   1    0.00041512314
   2   2    0.0078873397
   3   3    0.41167208

BLOCK YE Q=  1127.413
   1   1    7.2442024e-05
   2   2    0.014978713
   3   3    0.25191731

BLOCK AU Q=  1127.413
   1   1    0
   2   2    0
   3   3   -2792.7019

BLOCK AD Q=  1127.413
   1   1    0
   2   2    0
   3   3    1270.209

BLOCK AE Q=  1127.413
   1   1    0
   2   2    0
   3   3    1423.4293

BLOCK MSOFT Q=  1127.413
   1   -521.19241
   2    964.60855
   3    3000
   21   -2512352.3
   22   -2671673.2
   31    1206.4731
   32    1206.4731
   33    812.39031
   34    1408.9774
   35    1408.9774
   36    1169.9388
   41    5000
   42    5000
   43    1726.0482
   44    5000
   45    5000
   46    907.167
   47    5000
   48    5000
   49    1736.3822

BLOCK MASS
   6    173.2
   23    91.1876
   24    80.429995
   15    1.777
   25    122.26647
   35    387.29252
   36    387.80063
   37    396.84719
   1000001    5012.8714
   2000001    5003.5662
   1000002    5012.4337
   2000002    5004.9483
   1000003    5012.8767
   2000003    5003.5666
   1000004    5012.436
   2000004    5004.9494
   1000005    1667.0531
   2000005    1731.5897
   1000006    744.401
   2000006    1707.4938
   1000011    1214.1058
   2000011    1411.2788
   1000012    1211.1981
   1000013    1214.0882
   2000013    1411.285
   1000014    1211.1961
   1000015    817.92015
   2000015    1170.7293
   1000016    818.52682
   1000021    3164.7692
   1000022   -522.06935
   1000023    1001.4831
   1000025   -1622.9776
   1000035    1626.4028
   1000024    1001.6204
   1000037    1627.7352

BLOCK ALPHA
      -0.045710743

BLOCK HMIX Q=  1127.413
   1    1631.9898
   2    24.618873
   3    244.26408
   4    150389.33

BLOCK STOPMIX
   1   1    0.17806796
   1   2    0.98401819
   2   1   -0.98401819
   2   2    0.17806796

BLOCK SBOTMIX
   1   1    0.89013705
   1   2    0.45569292
   2   1   -0.45569292
   2   2    0.89013705

BLOCK STAUMIX
   1   1    0.9946277
   1   2    0.1035168
   2   1   -0.1035168
   2   2    0.9946277

BLOCK NMIX
   1   1    0.99949813
   1   2    0.00032618808
   1   3    0.030528441
   1   4    0.0084491682
   2   1    0.0016538818
   2   2    0.99563219
   2   3   -0.078685869
   2   4    0.050222907
   3   1   -0.027553562
   3   2    0.020177702
   3   3    0.70614635
   3   4    0.70724182
   4   1   -0.015541764
   4   2    0.091155338
   4   3    0.70301769
   4   4   -0.70513494

BLOCK UMIX
   1   1   -0.9936313
   1   2    0.11268023
   2   1    0.11268023
   2   2    0.9936313

BLOCK VMIX
   1   1   -0.99735606
   1   2    0.072669796
   2   1    0.072669796
   2   2    0.99735606

BLOCK HIGGSBOUNDSINPUTHIGGSCOUPLINGSFERMIONS
       0, 606.08892,3,36,15,15

BLOCK HIGGSBOUNDSINPUTHIGGSCOUPLINGSBOSONS
       0,4,36,21,21,23

BLOCK SPHENOLOWENERGY
   1    0.00039919158
   2    1.589233e-06
   3    3.5275161e-05
   4    3.0878573e-15
   5    1.3190376e-10
   6    2.7261533e-08
   7    1.0363971e-13
   8    4.4272939e-09
   9    9.2773393e-07
   10    8.11659e-05
   11    0.83841267
   12    0.54229569
   13    19.325775
   14    0
   15    0
   16    0.0021587269
   17    2.2816979e-15
   18    2.48095e-11
   19    8.2928388e-11
   20    3.1889995e-15
   21    1.3633708e-10
   22    3.3635389e-08
   23    0
   24    0
   25    0
   26    0
   27    0
   28    0
   29    0
   30    0
   31    0
   39    7.3708584e-05
   40    0
   41    0
   42    0

BLOCK FWCOEF Q=  160
   305   4422   0   0   -0.18881911
   305   4422   0   2   -0.26399277
   305   4322   0   2   -0.0018572755
   305   6421   0   0   -0.095227835
   305   6421   0   2   -0.18593419
   305   6321   0   2   -0.0020209795
   3051111   4133   0   0    1.5817461
   3051111   4133   0   2    1.5826752
   3051111   4233   0   2   -0.00017087392
   3051111   4137   0   0   -4.4044382
   3051111   4137   0   2   -4.4048907
   3051111   4237   0   2    0.001354884
   3051313   4133   0   0    1.5817461
   3051313   4133   0   2    1.5826734
   3051313   4233   0   2   -0.00017091649
   3051313   4137   0   0   -4.4044382
   3051313   4137   0   2   -4.4048925
   3051313   4237   0   2    0.0013549264
   3051212   4137   0   0    1.5053501
   3051212   4137   0   2    1.5054582
   3051212   4237   0   2   -0.00029597077
   3051414   4137   0   0    1.5053501
   3051414   4137   0   2    1.5054582
   3051414   4237   0   2   -0.00029596147
   3051616   4137   0   0    1.5053501
   3051616   4137   0   2    1.5054582
   3051616   4237   0   2   -0.00029334168

BLOCK IMFWCOEF Q=  160
   305   4422   0   0    3.8589187e-07
   305   4422   0   2    1.1947528e-05
   305   4322   0   2    3.8752377e-06
   305   6421   0   0    3.3054191e-07
   305   6421   0   2   -2.6573054e-06
   305   6321   0   2    1.8241261e-06
   3051111   4133   0   2   -7.8115635e-07
   3051111   4233   0   2    1.274977e-06
   3051111   4137   0   2    6.5652101e-06
   3051111   4237   0   2   -1.008026e-05
   3051313   4133   0   2   -7.8117135e-07
   3051313   4233   0   2    1.2749759e-06
   3051313   4137   0   2    6.5651957e-06
   3051313   4237   0   2   -1.0080264e-05
   3051212   4137   0   2   -1.2812448e-06
   3051212   4237   0   2    2.2018969e-06
   3051414   4137   0   2   -1.2812448e-06
   3051414   4237   0   2    2.2018969e-06
   3051616   4137   0   2   -1.2810556e-06
   3051616   4237   0   2    2.2018951e-06

DECAY 23  2.4952


DECAY 24  2.085


DECAY 1000011  2.6319547
    0.40900267   2   -1000024    12
    0.38506668   2    1000022    11
    0.20593065   2    1000023    11

DECAY 2000011  5.2778701
    0.99999909   2    1000022    11

DECAY 1000013  2.6317093
    0.40898438   2   -1000024    14
    0.38509334   2    1000022    13
    0.20592227   2    1000023    13

DECAY 2000013  5.278797
    0.99983134   2    1000022    13
    0.00016220187   2    1000013    25

DECAY 1000015  0.37584937
    1   2    1000022    15

DECAY 2000015  6.4837684
    0.57613473   2    1000022    15
    0.22186309   2    1000016   -24
    0.10758866   2    1000015    23
    0.093780584   2    1000015    25
    0.00041677278   2   -1000024    16
    0.00021616087   2    1000023    15

DECAY 1000012  2.5941104
    0.40858393   2    1000024    11
    0.38794985   2    1000022    12
    0.20346622   2    1000023    12

DECAY 1000014  2.5940867
    0.40858291   2    1000024    13
    0.38795219   2    1000022    14
    0.2034649   2    1000023    14

DECAY 1000016  0.36099376
    1   2    1000022    16

DECAY 2000001  144.88555
    0.98114034   2    1000021    1
    0.01884398   2    1000022    1

DECAY 1000001  204.72728
    0.69908992   2    1000021    1
    0.19615791   2   -1000024    2
    0.098418353   2    1000023    1
    0.0033282125   2    1000022    1
    0.0021900853   2   -1000037    2
    0.00076114128   2    1000035    1

DECAY 2000003  144.89548
    0.98107334   2    1000021    3
    0.018842727   2    1000022    3

DECAY 1000003  204.73432
    0.69906857   2    1000021    3
    0.1961514   2   -1000024    4
    0.098415259   2    1000023    3
    0.0033281291   2    1000022    3
    0.0021971095   2   -1000037    4
    0.0007730791   2    1000035    3

DECAY 1000005  64.91819
    0.61786597   2    1000006   -24
    0.26601323   2    1000006   -37
    0.071101177   2   -1000024    6
    0.038997231   2    1000023    5
    0.0058372795   2    1000022    5
    0.00010338344   2    1000025    5

DECAY 2000005  17.105338
    0.72817817   2    1000006   -24
    0.14456982   2    1000006   -37
    0.055848844   2   -1000024    6
    0.035409903   2    1000022    5
    0.030543764   2    1000023    5
    0.0027397733   2    1000035    5
    0.0027097238   2    1000025    5

DECAY 2000002  153.23006
    0.92864969   2    1000021    2
    0.071291689   2    1000022    2

DECAY 1000002  204.71918
    0.69889472   2    1000021    2
    0.19761901   2    1000024    1
    0.098528736   2    1000023    2
    0.0033525273   2    1000022    2
    0.00091089136   2    1000037    1
    0.00067398272   2    1000035    2

DECAY 2000004  153.23302
    0.92863216   2    1000021    4
    0.071290322   2    1000022    4

DECAY 1000004  204.7258
    0.69887298   2    1000021    4
    0.19761307   2    1000024    3
    0.098525596   2    1000023    4
    0.0033524204   2    1000022    4
    0.00093474581   2    1000037    3
    0.00067750407   2    1000035    4

DECAY 1000006  0.25249452
    0.99993633   2    1000022    6

DECAY 2000006  89.744395
    0.38620533   2    1000006    25
    0.30309031   2    1000006    23
    0.11242504   2    1000006    36
    0.096712757   2    1000006    35
    0.066933866   2    1000024    5
    0.030766166   2    1000023    6
    0.0031633305   2    1000022    6
    0.00070319345   2    1000037    5

DECAY 1000024  1.1975072
    0.405181   2    1000016   -15
    0.40272057   2   -1000015    16
    0.18238387   2    1000006   -5
    0.0084269509   2    37    1000022
    0.0011336292   2    1000022    24

DECAY 1000037  48.207899
    0.61696907   2    1000006   -5
    0.065802033   2    1000023    24
    0.064994064   2    1000024    25
    0.06316385   2    1000024    23
    0.04368647   2    1000024    36
    0.043305169   2    37    1000023
    0.041985926   2    1000024    35
    0.021902772   2    1000022    24
    0.016762802   2    37    1000022
    0.01217174   2    1000016   -15
    0.0051577204   2   -2000015    16
    0.0010047966   3    1000023   -5    6
    0.00084620535   3    1000024    6   -6
    0.00069329773   3    1000022   -5    6
    0.00044400593   2   -1000015    16
    0.00037143518   2   -1000013    14
    0.00037140818   2   -1000011    12
    0.0001711295   2    1000014   -13
    0.00015633648   2    1000012   -11

DECAY 1000022 -1


DECAY 1000023  1.1649933
    0.20844153   2    1000015   -15
    0.20844153   2   -1000015    15
    0.20634212   2    1000016   -16
    0.20634212   2   -1000016    16
    0.078780382   2    1000006   -6
    0.078780382   2   -1000006    6
    0.0086772548   2    1000022    35
    0.0014355261   2    1000022    25
    0.00094772863   2    1000022    23
    0.00066841814   2    1000006   -4
    0.00066841814   2   -1000006    4
    0.00033107476   2    1000022    36

DECAY 1000025  55.933246
    0.30509281   2    1000006   -6
    0.30509281   2   -1000006    6
    0.056715184   2    1000024   -24
    0.056715184   2   -1000024    24
    0.052751584   2    1000023    23
    0.045710234   2    1000023    25
    0.04214678   2    37   -1000024
    0.04214678   2   -37    1000024
    0.041830872   2    1000023    35
    0.013728793   2    1000022    35
    0.012785467   2    1000022    25
    0.0049907688   2    1000015   -15
    0.0049907688   2   -1000015    15
    0.0045833376   2    1000022    23
    0.0027546848   2    1000022    36
    0.0021504844   2    2000015   -15
    0.0021504844   2   -2000015    15
    0.0012302587   2    1000023    36
    0.00087468483   3    1000024    5   -6
    0.00087468483   3   -1000024   -5    6
    0.00030050732   3    1000022    6   -6
    0.00017427918   3    1000023    6   -6

DECAY 1000035  51.24065
    0.31969282   2    1000006   -6
    0.31969282   2   -1000006    6
    0.058541886   2    1000023    25
    0.055962687   2    1000024   -24
    0.055962687   2   -1000024    24
    0.040148828   2    37   -1000024
    0.040148828   2   -37    1000024
    0.037332097   2    1000023    35
    0.016763558   2    1000022    25
    0.015612762   2    1000022    23
    0.012244933   2    1000022    35
    0.005487774   2    1000015   -15
    0.005487774   2   -1000015    15
    0.0034950183   2    1000022    36
    0.0027877111   2    1000023    23
    0.0024267763   2    2000015   -15
    0.0024267763   2   -2000015    15
    0.0015793466   2    1000023    36
    0.00095128872   3    1000024    5   -6
    0.00095128872   3   -1000024   -5    6
    0.00038527989   2    1000016   -16
    0.00038527989   2   -1000016    16
    0.00034861137   3    1000022    6   -6
    0.00021831679   3    1000023    6   -6
    0.00013708341   2    1000014   -14
    0.00013708341   2   -1000014    14
    0.0001370823   2    1000012   -12
    0.0001370823   2   -1000012    12
    0.00010084891   2    1000013   -13
    0.00010084891   2   -1000013    13

DECAY 1000021  225.18077
    0.17804321   2    1000006   -6
    0.17804321   2   -1000006    6
    0.1097761   2    2000006   -6
    0.1097761   2   -2000006    6
    0.10826657   2    1000005   -5
    0.10826657   2   -1000005    5
    0.10241826   2    2000005   -5
    0.10241826   2   -2000005    5
    0.00069463881   3    1000035    6   -6
    0.00066552129   3    1000025    6   -6
    0.00060199152   3    1000037    5   -6
    0.00060199152   3   -1000037   -5    6
    0.00011005732   2    1000006   -4
    0.00011005732   2   -1000006    4

DECAY 25  0.0044210693
    0.66942696   2   -5    5
    0.14918522   2   -24    24
    0.07891104   2   -15    15
    0.057581227   2    21    21
    0.024371595   2   -4    4
    0.017091872   2    23    23
    0.0018887876   2    22    22
    0.0010199134   2    22    23
    0.00027237477   2   -13    13
    0.00025018813   2   -3    3
    6.9172812e-07   2   -1    1
    1.255995e-07   2   -2    2
    6.1233293e-09   2   -11    11

DECAY 35  3.901916
    0.84246204   2   -5    5
    0.1550475   2   -15    15
    0.00078776604   2   -6    6
    0.00051980689   2   -13    13
    0.00033495758   2   -3    3
    0.00032991558   2    25    25
    0.00028948073   2    21    21
    0.00015566654   2   -24    24
    7.1432664e-05   2    23    23
    9.2600369e-07   2   -1    1
    2.6331443e-07   2    22    22
    1.5545035e-07   2   -4    4
    7.782696e-08   2    22    23
    1.1681863e-08   2   -11    11
    8.0194793e-13   2   -2    2

DECAY 36  3.8814362
    0.84145711   2   -5    5
    0.15483743   2   -15    15
    0.0024791859   2   -6    6
    0.00051906404   2   -13    13
    0.00033442966   2   -3    3
    0.00025658231   2    21    21
    0.00011493342   2    23    25
    9.245441e-07   2   -1    1
    1.8227581e-07   2    22    22
    1.0916526e-07   2   -4    4
    3.4979005e-08   2    22    23
    1.166516e-08   2   -11    11
    5.6258865e-13   2   -2    2
    2.8403217e-34   2    25    25

DECAY 37  2.7751971
    0.81245276   2   -5    6
    0.18447722   2   -15    16
    0.0017638006   2   -5    4
    0.00065221844   2   -13    14
    0.00042268497   2   -3    4
    0.0001868014   2    24    25
    1.9246131e-05   2   -3    2
    1.2595609e-05   2   -5    2
    1.0880596e-05   2   -3    6
    1.1718988e-06   2   -1    2
    4.8067353e-07   2   -1    6
    5.9879578e-08   2   -1    4
    3.7989713e-08   2    24    35
    2.8940372e-08   2    24    36
    1.5255459e-08   2   -11    12

DECAY 6  2.43
    1   2    5    24

DECAY 15 -1
