BLOCK SPINFO
   1   SPheno
   2   v4.0.5be

BLOCK SPHENOINFO
   1   2
   2   2

BLOCK MODSEL
   1   0

BLOCK MINPAR
   3    34.673873
   4    1

BLOCK EXTPAR
   0    1409.3316
   1   -437.33886
   2   -165.23052
   3    3000
   11   -4755.809
   12   -342.07002
   13    1083.2983
   23    144.05498
   25    33.82679
   26    3948.5404
   31    1647.1294
   32    1647.1294
   33    1869.9389
   34    835.59016
   35    835.59016
   36    293.06227
   41    5000
   42    5000
   43    1436.6079
   44    5000
   45    5000
   46    1627.5358
   47    5000
   48    5000
   49    937.61893

BLOCK SMINPUTS
   1    127.90897
   2    1.1663787e-05
   3    0.1184
   4    91.1876
   5    4.18
   6    173.2
   7    1.777
   8    0
   11    0.00051099893
   12    0
   13    0.10565837
   14    0
   21    0.005
   22    0.0025
   23    0.095
   24    1.27

BLOCK GAUGE Q=  1409.3316
   1    0.35536298
   2    0.66519887
   3    1.219778

BLOCK YU Q=  1409.3316
   1   1    8.388035e-06
   2   2    0.0042611218
   3   3    1.013342

BLOCK YD Q=  1409.3316
   1   1    0.00057016594
   2   2    0.010833153
   3   3    0.56542594

BLOCK YE Q=  1409.3316
   1   1    9.9498125e-05
   2   2    0.020573057
   3   3    0.34600497

BLOCK AU Q=  1409.3316
   1   1    0
   2   2    0
   3   3   -4755.8092

BLOCK AD Q=  1409.3316
   1   1    0
   2   2    0
   3   3   -342.07002

BLOCK AE Q=  1409.3316
   1   1    0
   2   2    0
   3   3    1083.2983

BLOCK MSOFT Q=  1409.3316
   1   -437.33886
   2   -165.23052
   3    3000
   21    15524065
   22    48141.71
   31    1647.1294
   32    1647.1294
   33    1869.9389
   34    835.59016
   35    835.59016
   36    293.06227
   41    5000
   42    5000
   43    1436.6079
   44    5000
   45    5000
   46    1627.5358
   47    5000
   48    5000
   49    937.61893

BLOCK MASS
   6    173.2
   23    91.1876
   24    80.429995
   15    1.777
   25    120.18252
   35    3946.6861
   36    3948.5404
   37    3947.8581
   1000001    5028.9821
   2000001    5017.8798
   1000002    5028.5525
   2000002    5020.3273
   1000003    5028.9858
   2000003    5017.8862
   1000004    5028.5562
   2000004    5020.3281
   1000005    930.56875
   2000005    1385.9804
   1000006    1199.2959
   2000006    1656.1514
   1000011    1652.0797
   2000011    833.22401
   1000012    1649.8381
   1000013    1652.0857
   2000013    833.25409
   1000014    1649.844
   1000015    318.35451
   2000015    1876.8942
   1000016    1874.8673
   1000021    3189.0486
   1000022   -110.66176
   1000023    161.29975
   1000025   -226.19397
   1000035   -440.5723
   1000024    117.755
   1000037    232.60989

BLOCK ALPHA
      -0.028873603

BLOCK HMIX Q=  1409.3316
   1    144.05498
   2    33.82679
   3    244.02859
   4    15590971

BLOCK STOPMIX
   1   1    0.79705824
   1   2    0.60390245
   2   1   -0.60390245
   2   2    0.79705824

BLOCK SBOTMIX
   1   1    0.010421817
   1   2    0.99994569
   2   1   -0.99994569
   2   2    0.010421817

BLOCK STAUMIX
   1   1    0.0020433296
   1   2    0.99999791
   2   1   -0.99999791
   2   2    0.0020433296

BLOCK NMIX
   1   1    0.063297323
   1   2   -0.54843557
   1   3    0.67516071
   1   4    0.48925442
   2   1    0.054417291
   2   2   -0.17674471
   2   3   -0.66979935
   2   4    0.71914456
   3   1   -0.098553215
   3   2   -0.81648751
   3   3   -0.30687088
   3   4   -0.47902576
   4   1    0.99162466
   4   2   -0.036440196
   4   3   -0.03683885
   4   4   -0.11830275

BLOCK UMIX
   1   1   -0.46223274
   1   2    0.88675864
   2   1   -0.88675864
   2   2   -0.46223274

BLOCK VMIX
   1   1    0.73591509
   1   2    0.67707384
   2   1    0.67707384
   2   2   -0.73591509

BLOCK HIGGSBOUNDSINPUTHIGGSCOUPLINGSFERMIONS
       0, 1144.2517,3,36,15,15

BLOCK HIGGSBOUNDSINPUTHIGGSCOUPLINGSBOSONS
       0,4,36,21,21,23

BLOCK SPHENOLOWENERGY
   1    0.0002607843
   2    1.6046757e-06
   3    3.5257001e-05
   4    3.1696517e-15
   5    1.3540298e-10
   6    2.8289633e-08
   7    1.0638225e-13
   8    4.5446156e-09
   9    9.621195e-07
   10    9.6428886e-05
   11    0.99607348
   12    0.54255664
   13    19.382786
   14    0
   15    0
   16    0.0021595606
   17    2.2816814e-15
   18    2.482384e-11
   19    8.2951141e-11
   20   -5.2547942e-15
   21   -2.2468007e-10
   22   -4.7545402e-08
   23    0
   24    0
   25    0
   26    0
   27    0
   28    0
   29    0
   30    0
   31    0
   39    0.00011273361
   40    0
   41    0
   42    0

BLOCK FWCOEF Q=  160
   305   4422   0   0   -0.18881911
   305   4422   0   2   -0.11339183
   305   4322   0   2    0.00036894795
   305   6421   0   0   -0.095227835
   305   6421   0   2   -0.056775782
   305   6321   0   2    9.2082142e-05
   3051111   4133   0   0    1.5899145
   3051111   4133   0   2    1.5911563
   3051111   4233   0   2    0.00024111639
   3051111   4137   0   0   -4.4126066
   3051111   4137   0   2   -4.4113047
   3051111   4237   0   2   -0.0018824965
   3051313   4133   0   0    1.5899145
   3051313   4133   0   2    1.5911541
   3051313   4233   0   2    0.00024111566
   3051313   4137   0   0   -4.4126066
   3051313   4137   0   2   -4.4113069
   3051313   4237   0   2   -0.0018824982
   3051212   4137   0   0    1.5053501
   3051212   4137   0   2    1.5050979
   3051212   4237   0   2    0.00041045019
   3051414   4137   0   0    1.5053501
   3051414   4137   0   2    1.5050979
   3051414   4237   0   2    0.00041045021
   3051616   4137   0   0    1.5053501
   3051616   4137   0   2    1.5051007
   3051616   4237   0   2    0.00041045422

BLOCK IMFWCOEF Q=  160
   305   4422   0   0    3.8584861e-07
   305   4422   0   2   -1.6247312e-05
   305   4322   0   2    7.9604725e-06
   305   6421   0   0    3.3050486e-07
   305   6421   0   2   -2.0398797e-05
   305   6321   0   2    3.4860359e-06
   3051111   4133   0   2   -2.4933742e-06
   3051111   4233   0   2    4.6326558e-06
   3051111   4137   0   2    3.9852489e-05
   3051111   4237   0   2   -3.6173026e-05
   3051313   4133   0   2   -2.4934574e-06
   3051313   4233   0   2    4.6326441e-06
   3051313   4137   0   2    3.9852604e-05
   3051313   4237   0   2   -3.6173057e-05
   3051212   4137   0   2   -8.1107889e-06
   3051212   4237   0   2    7.8869991e-06
   3051414   4137   0   2   -8.1107851e-06
   3051414   4237   0   2    7.8869991e-06
   3051616   4137   0   2   -8.1220454e-06
   3051616   4237   0   2    7.8870045e-06

DECAY 23  2.4952


DECAY 24  2.085


DECAY 2000011  2.1991921
    0.97155098   2    1000035    11
    0.015865464   2    1000025    11
    0.0073606816   2    1000022    11
    0.0052227997   2    1000023    11

DECAY 1000011  22.942865
    0.47888957   2   -1000037    12
    0.23052917   2    1000025    11
    0.13406454   2   -1000024    12
    0.083186979   2    1000022    11
    0.066549044   2    1000035    11
    0.0067807026   2    1000023    11

DECAY 2000013  2.2125401
    0.96578144   2    1000035    13
    0.01602643   2    1000025    13
    0.0087112992   2    1000022    13
    0.0065097874   2    1000023    13
    0.0023949841   2   -1000024    14
    0.00057605484   2   -1000037    14

DECAY 1000013  22.956679
    0.47860327   2   -1000037    14
    0.23044641   2    1000025    13
    0.13398436   2   -1000024    14
    0.083410891   2    1000022    13
    0.066510004   2    1000035    13
    0.0070433743   2    1000023    13

DECAY 1000015  0.96513251
    0.4621804   2   -1000024    16
    0.28290728   2    1000022    15
    0.19742601   2    1000023    15
    0.035923988   2   -1000037    16
    0.021562322   2    1000025    15

DECAY 2000015  30.734154
    0.41029593   2   -1000037    16
    0.21070079   2    1000025    15
    0.13620298   2    1000022    15
    0.11349395   2   -1000024    16
    0.070184505   2    1000023    15
    0.058590573   2    1000035    15
    0.0002777905   2    1000015    23
    0.00025347237   2    1000015    25

DECAY 1000012  23.009965
    0.33835911   2    1000024    11
    0.27796546   2    1000037    11
    0.17727583   2    1000025    12
    0.10603065   2    1000022    12
    0.087254733   2    1000035    12
    0.013114225   2    1000023    12

DECAY 1000014  23.023718
    0.3386281   2    1000024    13
    0.27792412   2    1000037    13
    0.17717062   2    1000025    14
    0.1059677   2    1000022    14
    0.087203022   2    1000035    14
    0.013106441   2    1000023    14

DECAY 1000016  30.788345
    0.40122427   2    1000024    15
    0.26824138   2    1000037    15
    0.15186398   2    1000025    16
    0.090235104   2    1000022    16
    0.076695207   2    1000035    16
    0.011186413   2    1000023    16
    0.00055364744   2    1000015    24

DECAY 2000001  143.49604
    0.98077254   2    1000021    1
    0.018902321   2    1000035    1
    0.00018887127   2    1000025    1

DECAY 1000001  208.76025
    0.67969197   2    1000021    1
    0.16604126   2   -1000037    2
    0.067406612   2    1000025    1
    0.045259577   2   -1000024    2
    0.033184661   2    1000022    1
    0.0047379842   2    1000035    1
    0.0036779388   2    1000023    1

DECAY 2000003  143.52004
    0.98061321   2    1000021    3
    0.018899295   2    1000035    3
    0.00019647425   2    1000025    3
    0.00011530393   2    1000022    3

DECAY 1000003  208.77418
    0.67964844   2    1000021    3
    0.16603502   2   -1000037    4
    0.067407427   2    1000025    3
    0.045260556   2   -1000024    4
    0.033208007   2    1000022    3
    0.0047377468   2    1000035    3
    0.0037028071   2    1000023    3

DECAY 1000005  11.146935
    0.38010985   2   -1000024    6
    0.23892394   2    1000022    5
    0.22305016   2    1000023    5
    0.087220881   2   -1000037    6
    0.042756635   2    1000025    5
    0.027938531   2    1000035    5

DECAY 2000005  66.435771
    0.3586257   2   -1000037    6
    0.21909658   2   -1000024    6
    0.20159692   2    1000006   -24
    0.087178841   2    1000022    5
    0.067926947   2    1000025    5
    0.061360498   2    1000023    5
    0.0035555127   2    1000035    5
    0.00042886571   2    1000005    25
    0.0002301306   2    1000005    23

DECAY 2000002  152.03324
    0.92737414   2    1000021    2
    0.071399445   2    1000035    2
    0.0007133325   2    1000025    2
    0.00029516443   2    1000022    2
    0.00021791756   2    1000023    2

DECAY 1000002  208.76033
    0.67947744   2    1000021    2
    0.11471167   2    1000024    1
    0.096792074   2    1000037    1
    0.073453041   2    1000025    2
    0.030562663   2    1000022    2
    0.0029527044   2    1000023    2
    0.0020504119   2    1000035    2

DECAY 2000004  152.03688
    0.92735209   2    1000021    4
    0.071397891   2    1000035    4
    0.00071604359   2    1000025    4
    0.00029801047   2    1000022    4
    0.00022406962   2    1000023    4

DECAY 1000004  208.7742
    0.67943385   2    1000021    4
    0.11474819   2    1000024    3
    0.096797638   2    1000037    3
    0.073450174   2    1000025    4
    0.030562737   2    1000022    4
    0.0029570046   2    1000023    4
    0.0020503985   2    1000035    4

DECAY 1000006  44.586472
    0.34589863   2    1000037    5
    0.22638975   2    1000025    6
    0.22211029   2    1000023    6
    0.084123368   2    1000024    5
    0.077476748   2    1000022    6
    0.032776797   2    1000035    6
    0.0091914262   2    1000022    4
    0.0010618917   3    1000022    24    5
    0.00087187917   2    1000023    4

DECAY 2000006  135.14912
    0.26776117   2    1000006    23
    0.19502057   2    2000005    24
    0.19346684   2    1000024    5
    0.1434429   2    1000023    6
    0.095705269   2    1000022    6
    0.034177387   2    1000006    25
    0.030203904   2    1000037    5
    0.029229135   2    1000025    6
    0.010708323   2    1000035    6
    0.00028451095   2    1000005    24

DECAY 1000024  1.1189275e-07
    0.36057066   3    1000022   -1    2
    0.30865248   3    1000022   -3    4
    0.12031938   3    1000022   -11    12
    0.1201872   3    1000022   -13    14
    0.09027028   3    1000022   -15    16

DECAY 1000037  0.48993235
    0.80541573   2    1000022    24
    0.19134701   2    1000024    23
    0.0010765779   3    1000023   -1    2
    0.0010755923   3    1000023   -3    4
    0.00036483871   3    1000023   -15    16
    0.00035898345   3    1000023   -13    14
    0.00035898284   3    1000023   -11    12

DECAY 1000022 -1


DECAY 1000023  0.00086930122
    0.14428018   3    1000022    12   -12
    0.10782373   3    1000022    1   -1
    0.10781995   3    1000022    3   -3
    0.10198039   3    1000022    5   -5
    0.084102975   3    1000022    2   -2
    0.083481129   3    1000022    4   -4
    0.048552467   3    1000024    1   -2
    0.048552467   3   -1000024   -1    2
    0.048368036   3    1000024    3   -4
    0.048368036   3   -1000024   -3    4
    0.025011093   3    1000022    15   -15
    0.024322517   3    1000022    11   -11
    0.024321682   3    1000022    13   -13
    0.01620297   3    1000024    15   -16
    0.01620297   3   -1000024   -15    16
    0.016191362   3    1000024    11   -12
    0.016191362   3   -1000024   -11    12
    0.016191313   3    1000024    13   -14
    0.016191313   3   -1000024   -13    14
    0.005844051   2    1000022    22

DECAY 1000025  1.2607721
    0.49880045   2    1000024   -24
    0.49880045   2   -1000024    24
    0.0012489724   2    1000022    23
    0.00022952172   3    1000023    12   -12
    0.00017180722   3    1000023    1   -1
    0.00017180414   3    1000023    3   -3
    0.00016737544   3    1000023    5   -5
    0.00013396417   3    1000023    2   -2
    0.00013344052   3    1000023    4   -4

DECAY 1000035  1.7783574
    0.14171585   2    1000023    23
    0.13970255   2    1000015   -15
    0.13970255   2   -1000015    15
    0.1313483   2    1000037   -24
    0.1313483   2   -1000037    24
    0.11605912   2    1000023    25
    0.09164139   2    1000025    25
    0.027036066   2    1000022    25
    0.024795812   2    1000024   -24
    0.024795812   2   -1000024    24
    0.016109074   2    1000025    23
    0.015578328   2    1000022    23

DECAY 1000021  278.63122
    0.14176487   2    1000005   -5
    0.14176487   2   -1000005    5
    0.11145238   2    2000005   -5
    0.11145238   2   -2000005    5
    0.10958473   2    1000006   -6
    0.10958473   2   -1000006    6
    0.10291506   2    2000006   -6
    0.10291506   2   -2000006    6
    0.034175827   2    1000006   -4
    0.034175827   2   -1000006    4

DECAY 25  0.0033134027
    0.64342811   2   -5    5
    0.15693798   2   -24    24
    0.073443701   2   -15    15
    0.073100555   2    21    21
    0.031895   2   -4    4
    0.017243317   2    23    23
    0.0023421308   2    22    22
    0.0011112112   2    22    23
    0.00025511646   2   -13    13
    0.00024204545   2   -3    3
    6.6923229e-07   2   -1    1
    1.6437786e-07   2   -2    2
    5.7353693e-09   2   -11    11

DECAY 35  111.0003
    0.43259188   2   -5    5
    0.13262181   2   -1000024    1000024
    0.084099963   2   -15    15
    0.062402224   2   -1000024    1000037
    0.062402224   2   -1000037    1000024
    0.049498821   2    1000022    1000022
    0.044431552   2    1000023    1000025
    0.031737594   2   -1000037    1000037
    0.019705456   2    1000023    1000035
    0.018543881   2    1000022    1000035
    0.018535637   2    1000025    1000025
    0.013271107   2    1000022    1000025
    0.0086488389   2    1000022    1000023
    0.0067606322   2    1000025    1000035
    0.0054554841   2    1000023    1000023
    0.002487179   2   -2000015    1000015
    0.002487179   2   -1000015    2000015
    0.0012559397   2   -2000005    1000005
    0.0012559397   2   -1000005    2000005
    0.0010988459   2   -6    6
    0.00029446698   2   -13    13
    0.00017163053   2   -3    3
    0.00011937703   2    1000035    1000035
    8.5892559e-05   2   -1000006    1000006
    2.2755426e-05   2   -2000006    2000006
    3.7350268e-06   2   -2000006    1000006
    3.7350268e-06   2   -1000006    2000006
    2.5945871e-06   2    21    21
    1.6603319e-06   2    25    25
    4.7449298e-07   2   -1    1
    4.4650093e-07   2   -2000005    2000005
    2.4621282e-07   2   -1000005    1000005
    1.4948541e-07   2    23    23
    1.2213365e-07   2    22    23
    5.5331813e-08   2   -1000015    1000015
    3.9709246e-08   2    22    22
    3.2071913e-08   2   -24    24
    2.9920509e-08   2   -1000011    1000011
    2.9701984e-08   2   -1000013    1000013
    2.8092013e-08   2   -2000011    2000011
    2.7930279e-08   2   -2000013    2000013
    2.3556158e-08   2   -2000015    2000015
    1.5674703e-08   2   -4    4
    6.6129208e-09   2   -11    11
    1.2747031e-10   2   -2000013    1000013
    1.2747031e-10   2   -1000013    2000013
    8.0800181e-14   2   -2    2
    2.9815445e-15   2   -2000011    1000011
    2.9815445e-15   2   -1000011    2000011

DECAY 36  106.45148
    0.41524781   2   -5    5
    0.13144093   2   -1000024    1000024
    0.080732843   2   -15    15
    0.071997769   2   -1000024    1000037
    0.071997769   2   -1000037    1000024
    0.050177487   2    1000023    1000025
    0.047772922   2    1000022    1000022
    0.026229051   2   -1000037    1000037
    0.022659536   2    1000023    1000035
    0.01838122   2    1000022    1000035
    0.016405239   2    1000025    1000025
    0.013676483   2    1000022    1000025
    0.011405863   2    1000022    1000023
    0.0064906343   2    1000023    1000023
    0.0059093219   2    1000025    1000035
    0.002593026   2   -2000015    1000015
    0.002593026   2   -1000015    2000015
    0.0013097939   2   -2000005    1000005
    0.0013097939   2   -1000005    2000005
    0.0010143583   2   -6    6
    0.00028267715   2   -13    13
    0.0001647509   2   -3    3
    8.9105495e-05   2    1000035    1000035
    5.5291694e-05   2   -2000006    1000006
    5.5291694e-05   2   -1000006    2000006
    7.1233098e-06   2    21    21
    4.554745e-07   2   -1    1
    3.2442627e-07   2    23    25
    7.82737e-08   2    22    23
    1.4413298e-08   2   -4    4
    8.9298258e-09   2    22    22
    6.3482111e-09   2   -11    11
    1.3275459e-10   2   -2000013    1000013
    1.3275459e-10   2   -1000013    2000013
    2.2624336e-13   2    23    35
    7.4299756e-14   2   -2    2
    3.1051436e-15   2   -2000011    1000011
    3.1051436e-15   2   -1000011    2000011
    2.3382549e-40   2    25    25

DECAY 37  113.61054
    0.44458169   2   -5    6
    0.16823379   2    1000022    1000037
    0.13157704   2    1000024    1000025
    0.083549329   2   -15    16
    0.078272433   2    1000023    1000037
    0.050222739   2    1000023    1000024
    0.023465607   2    1000024    1000035
    0.011233135   2    1000035    1000037
    0.0048621601   2   -1000015    1000016
    0.0018459988   2   -1000005    2000006
    0.00093233586   2   -1000005    1000006
    0.00065793777   2   -5    4
    0.00029537662   2   -13    14
    0.00015156743   2   -3    4
    3.3271596e-05   2   -2000005    1000006
    2.9579856e-05   2   -2000005    2000006
    2.2198169e-05   2    1000022    1000024
    1.9067554e-05   2    1000025    1000037
    7.1201693e-06   2   -3    2
    4.698354e-06   2   -5    2
    1.8047952e-06   2   -3    6
    4.2046636e-07   2   -1    2
    3.0393361e-07   2    24    25
    1.079619e-07   2   -2000011    1000012
    1.0773988e-07   2   -2000013    1000014
    7.2423693e-08   2   -1    6
    7.2244287e-08   2   -2000015    1000016
    2.0356231e-08   2   -1    4
    6.9088898e-09   2   -11    12
    2.4576956e-10   2   -1000013    1000014
    2.6492492e-14   2    24    35
    5.7484989e-15   2   -1000011    1000012

DECAY 6  2.43
    1   2    5    24

DECAY 15 -1
