BLOCK SPINFO
   1   SPheno
   2   v4.0.5be

BLOCK SPHENOINFO
   1   2
   2   2

BLOCK MODSEL
   1   0

BLOCK MINPAR
   3    7.0531181
   4    1

BLOCK EXTPAR
   0    2200.2912
   1   -613.51634
   2   -2299.0364
   3    2509.5419
   11    7301.7716
   12   -4961.7367
   13    433.99905
   23    2663.341
   25    6.7248931
   26    2446.8755
   31    673.85399
   32    673.85399
   33    2986.3204
   34    1700.2769
   35    1700.2769
   36    650.8175
   41    2509.1915
   42    2509.1915
   43    1236.0005
   44    3640.786
   45    3640.786
   46    3601.0194
   47    3555.4702
   48    3555.4702
   49    2623.8636

BLOCK SMINPUTS
   1    127.90897
   2    1.1663787e-05
   3    0.1184
   4    91.1876
   5    4.18
   6    173.2
   7    1.777
   8    0
   11    0.00051099893
   12    0
   13    0.10565837
   14    0
   21    0.005
   22    0.0025
   23    0.095
   24    1.27

BLOCK GAUGE Q=  2200.2912
   1    0.35536298
   2    0.66519887
   3    1.219778

BLOCK YU Q=  2200.2912
   1   1    8.4765632e-06
   2   2    0.0043060941
   3   3    1.0240369

BLOCK YD Q=  2200.2912
   1   1    0.00011454745
   2   2    0.0021764016
   3   3    0.11359518

BLOCK YE Q=  2200.2912
   1   1    1.9989368e-05
   2   2    0.0041331673
   3   3    0.069513075

BLOCK AU Q=  2200.2912
   1   1    0
   2   2    0
   3   3    7301.7719

BLOCK AD Q=  2200.2912
   1   1    0
   2   2    0
   3   3   -4961.7365

BLOCK AE Q=  2200.2912
   1   1    0
   2   2    0
   3   3    433.99904

BLOCK MSOFT Q=  2200.2912
   1   -613.51634
   2   -2299.0364
   3    2509.5419
   21   -1330378.7
   22   -7251536.3
   31    673.85399
   32    673.85399
   33    2986.3204
   34    1700.2769
   35    1700.2769
   36    650.8175
   41    2509.1915
   42    2509.1915
   43    1236.0005
   44    3640.786
   45    3640.786
   46    3601.0194
   47    3555.4702
   48    3555.4702
   49    2623.8636

BLOCK MASS
   6    173.2
   23    91.1876
   24    80.429995
   15    1.777
   25    121.98608
   35    2445.9871
   36    2446.8755
   37    2448.0278
   1000001    2604.9801
   2000001    3606.2881
   1000002    2603.9002
   2000002    3693.9285
   1000003    2604.9802
   2000003    3606.288
   1000004    2603.9005
   2000004    3693.9283
   1000005    1397.4996
   2000005    2697.5888
   1000006    1368.0954
   2000006    3538.7013
   1000011    713.36221
   2000011    1697.6311
   1000012    709.0612
   1000013    713.36027
   2000013    1697.6302
   1000014    709.06033
   1000015    642.93023
   2000015    2999.7088
   1000016    2998.3396
   1000021    2686.447
   1000022   -610.91605
   1000023   -2299.2714
   1000025    2661.1697
   1000035   -2666.1755
   1000024    2299.4901
   1000037    2666.9163

BLOCK ALPHA
      -0.14113683

BLOCK HMIX Q=  2200.2912
   1    2663.341
   2    6.7248931
   3    243.62622
   4    5987199.6

BLOCK STOPMIX
   1   1   -0.99528143
   1   2    0.097030329
   2   1   -0.097030329
   2   2   -0.99528143

BLOCK SBOTMIX
   1   1    0.99996708
   1   2    0.0081138586
   2   1   -0.0081138586
   2   2    0.99996708

BLOCK STAUMIX
   1   1    0.003543473
   1   2    0.99999372
   2   1   -0.99999372
   2   2    0.003543473

BLOCK NMIX
   1   1   -0.99986123
   1   2    1.8437667e-06
   1   3   -0.016582308
   1   4   -0.0015936478
   2   1   -0.0017603287
   2   2   -0.99190194
   2   3    0.098305583
   2   4    0.080395547
   3   1    0.010595586
   3   2   -0.012755146
   3   3   -0.70684523
   3   4    0.70717386
   4   1   -0.012733713
   4   2    0.12636391
   4   3    0.70030769
   4   4    0.70245224

BLOCK UMIX
   1   1   -0.98951954
   1   2    0.14439901
   2   1   -0.14439901
   2   2   -0.98951954

BLOCK VMIX
   1   1    0.9928748
   1   2    0.11916223
   2   1    0.11916223
   2   2   -0.9928748

BLOCK HIGGSBOUNDSINPUTHIGGSCOUPLINGSFERMIONS
       0, 45.224187,3,36,15,15

BLOCK HIGGSBOUNDSINPUTHIGGSCOUPLINGSBOSONS
       0,4,36,21,21,23

BLOCK SPHENOLOWENERGY
   1    0.00033309802
   2    1.5909355e-06
   3    3.5296149e-05
   4    2.7024655e-15
   5    1.1544627e-10
   6    2.4168134e-08
   7    9.058137e-14
   8    3.8696336e-09
   9    8.2080572e-07
   10    9.675255e-05
   11    0.9994168
   12    0.54238069
   13    19.379843
   14    0
   15    0
   16    0.0021592037
   17    2.2816778e-15
   18    2.4827489e-11
   19    8.2971851e-11
   20   -9.4005638e-16
   21   -4.0190388e-11
   22   -4.324236e-09
   23    0
   24    0
   25    0
   26    0
   27    0
   28    0
   29    0
   30    0
   31    0
   39   -0.00013700802
   40    0
   41    0
   42    0

BLOCK FWCOEF Q=  160
   305   4422   0   0   -0.18881911
   305   4422   0   2   -0.20181667
   305   4322   0   2   -0.00023763136
   305   6421   0   0   -0.095227835
   305   6421   0   2   -0.11145204
   305   6321   0   2   -0.00029408279
   3051111   4133   0   0    1.6052743
   3051111   4133   0   2    1.6059045
   3051111   4233   0   2    1.8044301e-05
   3051111   4137   0   0   -4.4279665
   3051111   4137   0   2   -4.4305757
   3051111   4237   0   2   -0.00013754812
   3051313   4133   0   0    1.6052743
   3051313   4133   0   2    1.6059044
   3051313   4233   0   2    1.80443e-05
   3051313   4137   0   0   -4.4279665
   3051313   4137   0   2   -4.4305758
   3051313   4237   0   2   -0.00013754812
   3051212   4137   0   0    1.5053501
   3051212   4137   0   2    1.5059166
   3051212   4237   0   2    2.98855e-05
   3051414   4137   0   0    1.5053501
   3051414   4137   0   2    1.5059166
   3051414   4237   0   2    2.98855e-05
   3051616   4137   0   0    1.5053501
   3051616   4137   0   2    1.5059239
   3051616   4237   0   2    2.9885668e-05

BLOCK IMFWCOEF Q=  160
   305   4422   0   0    3.8578757e-07
   305   4422   0   2    5.8435988e-06
   305   4322   0   2   -1.1419998e-06
   305   6421   0   0    3.3045256e-07
   305   6421   0   2   -2.8742657e-05
   305   6321   0   2   -1.2542233e-06
   3051111   4133   0   2    1.0779706e-06
   3051111   4233   0   2    3.5232625e-07
   3051111   4137   0   2    1.6246698e-06
   3051111   4237   0   2   -2.6862935e-06
   3051313   4133   0   2    1.0779695e-06
   3051313   4233   0   2    3.5232624e-07
   3051313   4137   0   2    1.6246674e-06
   3051313   4237   0   2   -2.6862935e-06
   3051212   4137   0   2   -3.5822492e-07
   3051212   4237   0   2    5.8366161e-07
   3051414   4137   0   2   -3.5822505e-07
   3051414   4237   0   2    5.8366161e-07
   3051616   4137   0   2   -2.2795369e-07
   3051616   4237   0   2    5.8366397e-07

DECAY 23  2.4952


DECAY 24  2.085


DECAY 1000011  0.063670833
    0.99999996   2    1000022    11

DECAY 2000011  6.4619388
    1   2    1000022    11

DECAY 1000013  0.063668757
    0.99999996   2    1000022    13

DECAY 2000013  6.4625017
    0.99991212   2    1000022    13

DECAY 1000015  0.03040453
    1   2    1000022    15

DECAY 2000015  10.318367
    0.42605833   2   -1000024    16
    0.33543231   2    1000022    15
    0.21461077   2    1000023    15
    0.0098086516   2    1000015    25
    0.0096730187   2    1000015    23
    0.0023556197   2   -1000037    16
    0.0014237924   2    1000035    15
    0.0006375072   2    1000025    15

DECAY 1000012  0.059121626
    1   2    1000022    12

DECAY 1000014  0.05912072
    1   2    1000022    14

DECAY 1000016  10.311289
    0.42811221   2    1000024    15
    0.33547935   2    1000022    16
    0.21328512   2    1000023    16
    0.019344154   2    1000015    24
    0.0027654254   2    1000037    15
    0.00099418851   2    1000035    16

DECAY 1000001  1.969504
    0.55576318   2   -1000024    2
    0.27941961   2    1000023    1
    0.16481722   2    1000022    1

DECAY 2000001  58.286675
    0.9674187   2    1000021    1
    0.032579297   2    1000022    1

DECAY 1000003  1.9694852
    0.55575888   2   -1000024    4
    0.2794223   2    1000023    3
    0.16481882   2    1000022    3

DECAY 2000003  58.286846
    0.96741564   2    1000021    3
    0.032579201   2    1000022    3

DECAY 1000005  0.1277873
    1   2    1000022    5

DECAY 2000005  2.2805224
    0.59409984   2    1000022    5
    0.16913074   2    1000005    25
    0.15558511   2    1000006   -24
    0.074881622   2    1000005    23
    0.0058100261   2    1000021    5
    0.0002060983   2   -1000024    6
    0.00010935832   2    1000025    5

DECAY 1000002  1.9671131
    0.5567123   2    1000024    1
    0.27836132   2    1000023    2
    0.16492638   2    1000022    2

DECAY 2000002  72.511002
    0.89239632   2    1000021    2
    0.10759636   2    1000022    2

DECAY 1000004  1.967113
    0.55671341   2    1000024    3
    0.2783603   2    1000023    4
    0.16492629   2    1000022    4

DECAY 2000004  72.511527
    0.8923884   2    1000021    4
    0.10759554   2    1000022    4

DECAY 1000006  0.12337167
    0.97645798   2    1000022    6
    0.019901439   3    1000022    24    5
    0.0014973083   3   -1000013    14    5
    0.0014972893   3   -1000011    12    5
    0.0003224286   3    1000014   -13    5
    0.0003224257   3    1000012   -11    5

DECAY 2000006  454.24552
    0.37479135   2    1000005    24
    0.24904511   2    1000006    25
    0.18983789   2    1000006    23
    0.11107824   2    1000021    6
    0.030073817   2    1000037    5
    0.016149191   2    1000022    6
    0.014449324   2    1000025    6
    0.01433302   2    1000035    6
    0.00017034553   2    1000024    5

DECAY 1000024  58.510802
    0.22437833   2   -1000005    6
    0.2192529   2    1000006   -5
    0.13963854   2    1000014   -13
    0.13963838   2    1000012   -11
    0.13834193   2   -1000013    14
    0.13834177   2   -1000011    12
    0.00032834208   2    1000022    24

DECAY 1000037  50.578776
    0.8311211   2   -1000005    6
    0.043111632   2    1000023    24
    0.033778313   2    1000024    23
    0.033006339   2    1000024    25
    0.029499968   2    1000022    24
    0.0110099   2    1000006   -5
    0.0041714911   2   -1000013    14
    0.0041714876   2   -1000011    12
    0.002853663   2    1000014   -13
    0.0028460604   2    1000012   -11
    0.0021797265   2   -1000015    16
    0.0017695494   3    1000022   -5    6
    0.00036883507   3    1000023   -5    6

DECAY 1000022 -1


DECAY 1000023  56.498113
    0.1063952   2    1000006   -6
    0.1063952   2   -1000006    6
    0.10517125   2    1000005   -5
    0.10517125   2   -1000005    5
    0.072107306   2    1000013   -13
    0.072107306   2   -1000013    13
    0.072107156   2    1000011   -11
    0.072107156   2   -1000011    11
    0.07201834   2    1000014   -14
    0.07201834   2   -1000014    14
    0.072018303   2    1000012   -12
    0.072018303   2   -1000012    12
    0.00015680771   2    1000022    25
    0.00013294909   2    1000022    23

DECAY 1000025  54.794316
    0.39568103   2    1000006   -6
    0.39568103   2   -1000006    6
    0.055762286   2    1000023    25
    0.03316203   2    1000023    23
    0.030973156   2    1000024   -24
    0.030973156   2   -1000024    24
    0.027812339   2    1000022    25
    0.016448941   2    1000022    23
    0.0049250103   2    1000005   -5
    0.0049250103   2   -1000005    5
    0.0010902307   3    1000022    6   -6
    0.0010446885   2    1000015   -15
    0.0010446885   2   -1000015    15
    0.00014355624   3    1000024    5   -6
    0.00014355624   3   -1000024   -5    6

DECAY 1000035  51.968782
    0.42130638   2    1000006   -6
    0.42130638   2   -1000006    6
    0.032313756   2    1000024   -24
    0.032313756   2   -1000024    24
    0.032122182   2    1000023    25
    0.01637984   2    1000022    25
    0.011640954   2    1000022    23
    0.0079457045   2    1000005   -5
    0.0079457045   2   -1000005    5
    0.0017290021   2    1000014   -14
    0.0017290021   2   -1000014    14
    0.0017290015   2    1000012   -12
    0.0017290015   2   -1000012    12
    0.0013948489   2    1000013   -13
    0.0013948489   2   -1000013    13
    0.0013911748   2    1000011   -11
    0.0013911748   2   -1000011    11
    0.001081192   2    1000015   -15
    0.001081192   2   -1000015    15
    0.0008624331   3    1000022    6   -6
    0.00036769534   3    1000024    5   -6
    0.00036769534   3   -1000024   -5    6
    0.00034764153   2    1000023    23

DECAY 1000021  88.364237
    0.25405869   2    1000006   -6
    0.25405869   2   -1000006    6
    0.23935897   2    1000005   -5
    0.23935897   2   -1000005    5
    0.0016474736   2    1000002   -2
    0.0016474736   2   -1000002    2
    0.001647276   2    1000004   -4
    0.001647276   2   -1000004    4
    0.0016053084   2    1000001   -1
    0.0016053084   2   -1000001    1
    0.0016053023   2    1000003   -3
    0.0016053023   2   -1000003    3

DECAY 25  0.0035093717
    0.61802166   2   -5    5
    0.18215732   2   -24    24
    0.073628662   2    21    21
    0.070801631   2   -15    15
    0.03056026   2   -4    4
    0.020751223   2    23    23
    0.0023485126   2    22    22
    0.0012522581   2    22    23
    0.00024556964   2   -13    13
    0.00023209489   2   -3    3
    6.4171905e-07   2   -1    1
    1.5749383e-07   2   -2    2
    5.5207189e-09   2   -11    11

DECAY 35  2.5671112
    0.49317587   2   -6    6
    0.41056874   2   -5    5
    0.093865548   2   -15    15
    0.00041325734   2    25    25
    0.00038900395   2    1000022    1000022
    0.00031977995   2   -13    13
    0.00029560265   2    21    21
    0.00017932248   2   -3    3
    0.00011099848   2    23    23
    6.9126027e-05   2   -1000011    1000011
    6.9059568e-05   2   -1000013    1000013
    4.4226642e-05   2   -24    24
    3.5233335e-05   2   -1000015    1000015
    7.2739088e-06   2   -4    4
    2.0123167e-06   2    22    22
    1.2505344e-06   2    22    23
    8.6414936e-07   2   -2000013    1000013
    8.6414936e-07   2   -1000013    2000013
    4.9581284e-07   2   -1    1
    7.1825452e-09   2   -11    11
    3.7502258e-11   2   -2    2
    2.0212503e-11   2   -2000011    1000011
    2.0212503e-11   2   -1000011    2000011

DECAY 36  2.6174925
    0.51468675   2   -6    6
    0.39375275   2   -5    5
    0.090021653   2   -15    15
    0.00048427699   2    1000022    1000022
    0.00040655896   2    21    21
    0.00030667681   2   -13    13
    0.00017195881   2   -3    3
    0.00015723013   2    23    25
    7.3651004e-06   2   -4    4
    1.8600317e-06   2    22    22
    8.4767162e-07   2   -2000013    1000013
    8.4767162e-07   2   -1000013    2000013
    7.4049967e-07   2    22    23
    4.7545134e-07   2   -1    1
    6.8882165e-09   2   -11    11
    3.7976259e-11   2   -2    2
    1.9827036e-11   2   -2000011    1000011
    1.9827036e-11   2   -1000011    2000011
    2.329369e-34   2    25    25

DECAY 37  3.2265554
    0.92217656   2   -5    6
    0.075480469   2   -15    16
    0.00087201149   2   -3    6
    0.0004550399   2   -5    4
    0.0002668505   2   -13    14
    0.00021604901   2   -1000011    1000012
    0.00021597487   2   -1000013    1000014
    0.00013769764   2   -3    4
    0.00012785179   2    24    25
    3.9985686e-05   2   -1    6
    6.0670998e-06   2   -3    2
    3.2493683e-06   2   -5    2
    1.4421462e-06   2   -2000013    1000014
    3.8350649e-07   2   -1    4
    3.6038335e-07   2   -1    2
    6.241661e-09   2   -11    12
    3.3732094e-11   2   -2000011    1000012
    1.4927556e-11   2    24    35
    8.5730558e-13   2    24    36

DECAY 6  2.43
    1   2    5    24

DECAY 15 -1
