BLOCK SPINFO
   1   SPheno
   2   v4.0.5be

BLOCK SPHENOINFO
   1   2
   2   2

BLOCK MODSEL
   1   0

BLOCK MINPAR
   3    13.389842
   4   -1

BLOCK EXTPAR
   0    3170.2132
   1    863.85355
   2   -4430.0626
   3    3433.7752
   11   -5901.0778
   12    4991.5595
   13    7371.4432
   23   -871.33888
   25    12.787266
   26    1829.357
   31    2052.5266
   32    2052.5266
   33    2780.5304
   34    4980.0838
   35    4980.0838
   36    3963.7313
   41    4555.7576
   42    4555.7576
   43    4344.8823
   44    1529.9558
   45    1529.9558
   46    2208.1821
   47    698.11326
   48    698.11326
   49    2379.6332

BLOCK SMINPUTS
   1    127.90897
   2    1.1663787e-05
   3    0.1184
   4    91.1876
   5    4.18
   6    173.2
   7    1.777
   8    0
   11    0.00051099893
   12    0
   13    0.10565837
   14    0
   21    0.005
   22    0.0025
   23    0.095
   24    1.27

BLOCK GAUGE Q=  3170.2132
   1    0.35536298
   2    0.66519887
   3    1.219778

BLOCK YU Q=  3170.2132
   1   1    8.4099711e-06
   2   2    0.0042722653
   3   3    1.0159921

BLOCK YD Q=  3170.2132
   1   1    0.00021609885
   2   2    0.0041058782
   3   3    0.21430235

BLOCK YE Q=  3170.2132
   1   1    3.771083e-05
   2   2    0.0077974036
   3   3    0.1311395

BLOCK AU Q=  3170.2132
   1   1    0
   2   2    0
   3   3   -5901.0777

BLOCK AD Q=  3170.2132
   1   1    0
   2   2    0
   3   3    4991.5594

BLOCK AE Q=  3170.2132
   1   1    0
   2   2    0
   3   3    7371.4433

BLOCK MSOFT Q=  3170.2132
   1    863.85355
   2   -4430.0626
   3    3433.7752
   21    2497663.2
   22   -689336.93
   31    2052.5266
   32    2052.5266
   33    2780.5304
   34    4980.0838
   35    4980.0838
   36    3963.7313
   41    4555.7576
   42    4555.7576
   43    4344.8823
   44    1529.9558
   45    1529.9558
   46    2208.1821
   47    698.11326
   48    698.11326
   49    2379.6332

BLOCK MASS
   6    173.2
   23    91.1876
   24    80.429995
   15    1.777
   25    124.23951
   35    1829.4019
   36    1829.357
   37    1831.3368
   1000001    4661.8893
   2000001    949.18533
   1000002    4661.2109
   2000002    1691.5353
   1000003    4661.8887
   2000003    949.18449
   1000004    4661.2103
   2000004    1691.5349
   1000005    2519.3876
   2000005    4402.4287
   1000006    2279.0314
   2000006    4409.8785
   1000011    2076.4933
   2000011    4987.1848
   1000012    2074.5986
   1000013    2076.4916
   2000013    4987.1815
   1000014    2074.5963
   1000015    2803.4401
   2000015    3967.5892
   1000016    2801.9162
   1000021    3622.5022
   1000022    837.43168
   1000023   -888.8098
   1000025    906.24243
   1000035   -4433.2185
   1000024    888.82273
   1000037    4433.4146

BLOCK ALPHA
      -0.075079796

BLOCK HMIX Q=  3170.2132
   1   -871.33888
   2    12.787266
   3    243.18809
   4    3346547.2

BLOCK STOPMIX
   1   1    0.057976908
   1   2    0.99831792
   2   1   -0.99831792
   2   2    0.057976908

BLOCK SBOTMIX
   1   1   -0.002788171
   1   2    0.99999611
   2   1   -0.99999611
   2   2   -0.002788171

BLOCK STAUMIX
   1   1   -0.9999913
   1   2    0.0041703028
   2   1   -0.0041703028
   2   2   -0.9999913

BLOCK NMIX
   1   1    0.86611194
   1   2    0.0045614088
   1   3   -0.36524005
   1   4   -0.34121696
   2   1   -0.019555536
   2   2   -0.01630997
   2   3   -0.70692038
   2   4    0.7068346
   3   1    0.49946738
   3   2   -0.008209299
   3   3    0.60567264
   3   4    0.61937516
   4   1   -0.00016939372
   4   2    0.99982288
   4   3   -0.0048925596
   4   4    0.018172736

BLOCK UMIX
   1   1   -0.0069096217
   1   2   -0.99997613
   2   1   -0.99997613
   2   2    0.0069096217

BLOCK VMIX
   1   1    0.025673825
   1   2    0.99967037
   2   1    0.99967037
   2   2   -0.025673825

BLOCK HIGGSBOUNDSINPUTHIGGSCOUPLINGSFERMIONS
       0, 163.51418,3,36,15,15

BLOCK HIGGSBOUNDSINPUTHIGGSCOUPLINGSBOSONS
       0,4,36,21,21,23

BLOCK SPHENOLOWENERGY
   1    0.00034008731
   2    1.5887281e-06
   3    3.5262349e-05
   4    2.42531e-15
   5    1.0360654e-10
   6    2.1691834e-08
   7    8.190432e-14
   8    3.4989516e-09
   9    7.4225257e-07
   10    9.6459663e-05
   11    0.99639139
   12    0.54241523
   13    19.379175
   14    0
   15    0
   16    0.0021592418
   17    2.2816784e-15
   18    2.4810224e-11
   19    8.2922538e-11
   20    3.1854611e-16
   21    1.3618876e-11
   22    3.5493701e-09
   23    0
   24    0
   25    0
   26    0
   27    0
   28    0
   29    0
   30    0
   31    0
   39    1.0074367e-05
   40    0
   41    0
   42    0

BLOCK FWCOEF Q=  160
   305   4422   0   0   -0.18881911
   305   4422   0   2   -0.20968659
   305   4322   0   2   -0.0004080309
   305   6421   0   0   -0.095227835
   305   6421   0   2   -0.11654954
   305   6321   0   2   -0.00041685039
   3051111   4133   0   0    1.6181391
   3051111   4133   0   2    1.6185134
   3051111   4233   0   2    2.2838817e-05
   3051111   4137   0   0   -4.4408312
   3051111   4137   0   2   -4.4401277
   3051111   4237   0   2   -0.0001717837
   3051313   4133   0   0    1.6181391
   3051313   4133   0   2    1.6185132
   3051313   4233   0   2    2.2838793e-05
   3051313   4137   0   0   -4.4408312
   3051313   4137   0   2   -4.4401279
   3051313   4237   0   2   -0.00017178369
   3051212   4137   0   0    1.5053501
   3051212   4137   0   2    1.5051981
   3051212   4237   0   2    3.7218371e-05
   3051414   4137   0   0    1.5053501
   3051414   4137   0   2    1.5051981
   3051414   4237   0   2    3.7218376e-05
   3051616   4137   0   0    1.5053501
   3051616   4137   0   2    1.5051981
   3051616   4237   0   2    3.7219698e-05

BLOCK IMFWCOEF Q=  160
   305   4422   0   0    3.8580458e-07
   305   4422   0   2    2.9798258e-07
   305   4322   0   2   -2.1831752e-06
   305   6421   0   0    3.3046714e-07
   305   6421   0   2    5.8475175e-06
   305   6321   0   2   -1.0544863e-06
   3051111   4133   0   2   -1.3644796e-06
   3051111   4233   0   2    5.8474115e-07
   3051111   4137   0   2    1.0981935e-05
   3051111   4237   0   2   -4.393815e-06
   3051313   4133   0   2   -1.3644784e-06
   3051313   4233   0   2    5.8474112e-07
   3051313   4137   0   2    1.0981936e-05
   3051313   4237   0   2   -4.3938152e-06
   3051212   4137   0   2   -2.3730978e-06
   3051212   4237   0   2    9.5195086e-07
   3051414   4137   0   2   -2.3730978e-06
   3051414   4237   0   2    9.5195086e-07
   3051616   4137   0   2   -2.3722731e-06
   3051616   4237   0   2    9.519503e-07

DECAY 23  2.4952


DECAY 24  2.085


DECAY 1000011  1.8046986
    0.77528206   2    1000022    11
    0.2219764   2    1000025    11
    0.0024189193   2    1000023    11
    0.00032261115   2   -1000024    12

DECAY 2000011  23.607054
    0.7520099   2    1000022    11
    0.24760953   2    1000025    11
    0.00038056175   2    1000023    11

DECAY 1000013  1.8063721
    0.77469174   2    1000022    13
    0.22210561   2    1000025    13
    0.0028803423   2    1000023    13
    0.00032231177   2   -1000024    14

DECAY 2000013  23.618423
    0.7516796   2    1000022    13
    0.24757768   2    1000025    13
    0.0005000296   2    1000023    13
    0.00023942923   2   -1000024    14

DECAY 1000015  3.68139
    0.63685719   2    1000022    15
    0.25549515   2    1000025    15
    0.10732344   2    1000023    15
    0.00032422425   2   -1000024    16

DECAY 2000015  20.756818
    0.66539587   2    1000022    15
    0.2370635   2    1000025    15
    0.058977398   2   -1000024    16
    0.029806438   2    1000023    15
    0.0044520675   2    1000016   -24
    0.0022140444   2    1000015    23
    0.0020906773   2    1000015    25

DECAY 1000012  1.8033794
    0.7446398   2    1000022    12
    0.25079459   2    1000025    12
    0.004449581   2    1000024    11
    0.00011602487   2    1000023    12

DECAY 1000014  1.8050479
    0.74395   2    1000022    14
    0.25056222   2    1000025    14
    0.0053718567   2    1000024    13
    0.00011591738   2    1000023    14

DECAY 1000016  3.683373
    0.5828012   2    1000022    16
    0.21405148   2    1000024    15
    0.20305423   2    1000025    16

DECAY 2000001  0.020559885
    0.9495612   2    1000022    1
    0.050288325   2    1000025    1
    0.00014982577   2    1000023    1

DECAY 1000001  58.940867
    0.98001768   2    1000021    1
    0.0073034819   2    1000022    1
    0.0063653237   2   -1000037    2
    0.0031872047   2    1000035    1
    0.0030422115   2    1000025    1

DECAY 2000003  0.020570189
    0.94921002   2    1000022    3
    0.050289603   2    1000025    3
    0.00026578073   2    1000023    3
    0.00023459736   2   -1000024    4

DECAY 1000003  58.943889
    0.97996656   2    1000021    3
    0.0073064167   2    1000022    3
    0.0063648538   2   -1000037    4
    0.0031870249   2    1000035    3
    0.0030510327   2    1000025    3

DECAY 1000005  4.6068455
    0.37783563   2   -1000024    6
    0.23501826   2    1000022    5
    0.1956364   2    1000025    5
    0.1915094   2    1000023    5

DECAY 2000005  203.58423
    0.40691904   2   -1000024    6
    0.37508601   2    1000006   -24
    0.17800547   2    1000021    5
    0.014349417   2    1000006   -37
    0.009098809   2    1000023    5
    0.0075053802   2    1000025    5
    0.0043931799   2    1000022    5
    0.001890338   2    1000005    35
    0.0018882744   2    1000005    36
    0.00052823169   2    1000005    25
    0.00033585239   2    1000005    23

DECAY 2000002  2.0946421
    0.77094684   2    1000022    2
    0.22869175   2    1000025    2
    0.00036140851   2    1000023    2

DECAY 1000002  58.903913
    0.97962   2    1000021    2
    0.0082247415   2    1000022    2
    0.0063294954   2    1000037    1
    0.0031708376   2    1000035    2
    0.0021017774   2    1000025    2
    0.00042644917   2    1000024    1
    0.00012670102   2    1000023    2

DECAY 2000004  2.0952792
    0.77072116   2    1000022    4
    0.22868768   2    1000025    4
    0.00043764547   2    1000023    4
    0.00015351645   2    1000024    3

DECAY 1000004  58.90685
    0.97956922   2    1000021    4
    0.0082274977   2    1000022    4
    0.0063291497   2    1000037    3
    0.0031705959   2    1000035    4
    0.0021118412   2    1000025    4
    0.00045099806   2    1000024    3
    0.0001400349   2    1000023    4

DECAY 1000006  69.956018
    0.47819765   2    1000024    5
    0.23413476   2    1000023    6
    0.19268075   2    1000025    6
    0.09500846   2    1000022    6

DECAY 2000006  222.08903
    0.25632256   2    1000006    25
    0.18743319   2    1000023    6
    0.17273713   2    1000006    23
    0.15718158   2    1000021    6
    0.14695804   2    1000025    6
    0.043294465   2    1000022    6
    0.018732509   2    1000024    5
    0.0066917199   2    1000006    36
    0.0064330631   2    1000006    35
    0.0035953725   2    1000005    37
    0.00062037484   2    1000005    24

DECAY 1000024  0.00015397778
    0.33381635   3    1000022   -1    2
    0.33300291   3    1000022   -3    4
    0.11126695   3    1000022   -11    12
    0.11126649   3    1000022   -13    14
    0.11064731   3    1000022   -15    16

DECAY 1000037  127.93213
    0.092983875   2    1000014   -13
    0.09298376   2    1000012   -11
    0.092945421   2   -1000013    14
    0.092945336   2   -1000011    12
    0.08033362   2    1000024    25
    0.072681782   2    1000023    24
    0.07235282   2    1000024    23
    0.054980832   2    1000016   -15
    0.054933412   2   -1000015    16
    0.054828073   2    37    1000023
    0.05460926   2    1000025    24
    0.047648092   2    1000024    35
    0.047522147   2    1000024    36
    0.034877486   2    37    1000025
    0.017842492   2    1000022    24
    0.012635918   2    37    1000022
    0.010165346   3    1000024    6   -6
    0.0048052577   3    1000023   -5    6
    0.0041600993   3    1000025   -5    6
    0.0023356936   2    1000006   -5
    0.0013182419   3    1000022   -5    6

DECAY 1000022 -1


DECAY 1000023  0.00040777695
    0.20264082   3    1000022    12   -12
    0.15152467   3    1000022    1   -1
    0.15152024   3    1000022    3   -3
    0.14207536   3    1000022    5   -5
    0.11818797   3    1000022    2   -2
    0.11735668   3    1000022    4   -4
    0.034193415   3    1000022    11   -11
    0.034191587   3    1000022    13   -13
    0.033681165   3    1000022    15   -15
    0.014628079   2    1000022    22

DECAY 1000025  9.371579e-06
    0.12133487   2    1000023    22
    0.091701857   3    1000023    12   -12
    0.068575201   3    1000023    1   -1
    0.068552383   3    1000023    3   -3
    0.060486837   3    1000024    1   -2
    0.060486837   3   -1000024   -1    2
    0.058938094   3    1000024    3   -4
    0.058938094   3   -1000024   -3    4
    0.053479427   3    1000023    2   -2
    0.049853205   3    1000023    4   -4
    0.034444052   3    1000023    5   -5
    0.022403161   3    1000022    12   -12
    0.020162682   3    1000024    11   -12
    0.020162682   3   -1000024   -11    12
    0.020162377   3    1000024    13   -14
    0.020162377   3   -1000024   -13    14
    0.019159189   3    1000024    15   -16
    0.019159189   3   -1000024   -15    16
    0.016734943   3    1000022    5   -5
    0.015901967   3    1000022    3   -3
    0.015898598   3    1000022    1   -1
    0.015475488   3    1000023    11   -11
    0.015467175   3    1000023    13   -13
    0.013389671   3    1000022    4   -4
    0.013377946   3    1000022    2   -2
    0.01331453   3    1000023    15   -15
    0.0035956157   3    1000022    15   -15
    0.0035100912   3    1000022    13   -13
    0.0035098406   3    1000022    11   -11
    0.0016616214   2    1000022    22

DECAY 1000035  132.59661
    0.069722463   2    1000024   -24
    0.069722463   2   -1000024    24
    0.05834791   2    1000023    25
    0.052881007   2    37   -1000024
    0.052881007   2   -37    1000024
    0.044874047   2    1000014   -14
    0.044874047   2   -1000014    14
    0.044873992   2    1000012   -12
    0.044873992   2   -1000012    12
    0.044811832   2    1000013   -13
    0.044811832   2   -1000013    13
    0.04481179   2    1000011   -11
    0.04481179   2   -1000011    11
    0.03978616   2    1000025    23
    0.032841338   2    1000025    25
    0.030760282   2    1000025    35
    0.03067236   2    1000023    35
    0.026532018   2    1000016   -16
    0.026532018   2   -1000016    16
    0.026483409   2    1000015   -15
    0.026483409   2   -1000015    15
    0.017424251   2    1000023    23
    0.015376593   2    1000023    36
    0.01279676   2    1000022    23
    0.010730596   2    1000022    35
    0.010338949   2    1000022    25
    0.008135541   2    1000025    36
    0.0049699844   3    1000024    5   -6
    0.0049699844   3   -1000024   -5    6
    0.003843713   3    1000023    6   -6
    0.0031276577   2    1000022    36
    0.0025701151   3    1000025    6   -6
    0.0011326235   2    1000006   -6
    0.0011326235   2   -1000006    6
    0.00089438228   3    1000022    6   -6

DECAY 1000021  384.0561
    0.12108634   2    2000003   -3
    0.12108634   2   -2000003    3
    0.12108631   2    2000001   -1
    0.12108631   2   -2000001    1
    0.085357174   2    2000004   -4
    0.085357174   2   -2000004    4
    0.08535716   2    2000002   -2
    0.08535716   2   -2000002    2
    0.049778405   2    1000006   -6
    0.049778405   2   -1000006    6
    0.037213035   2    1000005   -5
    0.037213035   2   -1000005    5

DECAY 25  0.0038027453
    0.58636946   2   -5    5
    0.21503587   2   -24    24
    0.072665509   2    21    21
    0.067387926   2   -15    15
    0.028688855   2   -4    4
    0.025639112   2    23    23
    0.0023320364   2    22    22
    0.0014264027   2    22    23
    0.00023372966   2   -13    13
    0.00022033233   2   -3    3
    6.0919653e-07   2   -1    1
    1.4784275e-07   2   -2    2
    5.2545118e-09   2   -11    11

DECAY 35  5.5426761
    0.73810556   2   -5    5
    0.12662274   2   -15    15
    0.074573794   2   -6    6
    0.032809195   2    1000022    1000023
    0.018628037   2    1000023    1000025
    0.0068369052   2    1000022    1000022
    0.00086740464   2    1000025    1000025
    0.00055313954   2    25    25
    0.00044190167   2   -13    13
    0.0002976035   2   -3    3
    7.6281246e-05   2    23    23
    6.4106658e-05   2    1000022    1000025
    5.3887498e-05   2   -1000024    1000024
    4.5964933e-05   2   -24    24
    1.5733874e-05   2    21    21
    2.0519489e-06   2   -1000001    1000001
    2.0506246e-06   2   -1000003    1000003
    1.6261205e-06   2    1000023    1000023
    1.0331956e-06   2   -4    4
    8.2283486e-07   2   -1    1
    1.1019302e-07   2    22    22
    3.836844e-08   2    22    23
    9.9263714e-09   2   -11    11
    5.3266924e-12   2   -2    2

DECAY 36  5.4178074
    0.73760127   2   -5    5
    0.12653516   2   -15    15
    0.076514776   2   -6    6
    0.033407492   2    1000022    1000022
    0.016502624   2    1000025    1000025
    0.0056486774   2    1000022    1000023
    0.0017285986   2    1000023    1000025
    0.00063765082   2   -1000024    1000024
    0.00044159413   2   -13    13
    0.00043354056   2    1000022    1000025
    0.00029739725   2   -3    3
    0.0001211585   2    21    21
    0.00010377163   2    23    25
    2.4031739e-05   2    1000023    1000023
    1.0193995e-06   2   -4    4
    8.2226395e-07   2   -1    1
    3.0883726e-07   2    22    22
    1.0084671e-07   2    22    23
    9.9194652e-09   2   -11    11
    5.2559475e-12   2   -2    2
    1.7147843e-36   2    25    25

DECAY 37  5.1986949
    0.80717187   2   -5    6
    0.1263047   2   -15    16
    0.044238375   2    1000022    1000024
    0.020126614   2    1000024    1000025
    0.0010823311   2   -5    4
    0.00044653272   2   -13    14
    0.00028167861   2   -3    4
    0.00011553806   2   -3    6
    0.00010868486   2    24    25
    9.6723406e-05   2    1000023    1000024
    1.3067064e-05   2   -3    2
    7.7289542e-06   2   -5    2
    5.2803787e-06   2   -1    6
    7.7876863e-07   2   -1    2
    8.4968797e-08   2   -1    4
    1.0444447e-08   2   -11    12
    7.9574475e-12   2    24    36
    7.0952203e-12   2    24    35

DECAY 6  2.43
    1   2    5    24

DECAY 15 -1
