BLOCK SPINFO
   1   SPheno
   2   v4.0.5be

BLOCK SPHENOINFO
   1   2
   2   2

BLOCK MODSEL
   1   0

BLOCK MINPAR
   3    19.074198
   4   -1

BLOCK EXTPAR
   0    1262.5105
   1    303.77767
   2   -841.49865
   3    3000
   11    4020.7307
   12    1977.1982
   13    794.53652
   23   -1187.3316
   25    18.41338
   26    1922.3804
   31    1797.9794
   32    1797.9794
   33    292.16122
   34    1353.3178
   35    1353.3178
   36    942.84144
   41    5000
   42    5000
   43    1460.4444
   44    5000
   45    5000
   46    1330.8902
   47    5000
   48    5000
   49    1633.0147

BLOCK SMINPUTS
   1    127.90897
   2    1.1663787e-05
   3    0.1184
   4    91.1876
   5    4.18
   6    173.2
   7    1.777
   8    0
   11    0.00051099893
   12    0
   13    0.10565837
   14    0
   21    0.005
   22    0.0025
   23    0.095
   24    1.27

BLOCK GAUGE Q=  1262.5105
   1    0.35536298
   2    0.66519887
   3    1.219778

BLOCK YU Q=  1262.5105
   1   1    8.3967274e-06
   2   2    0.0042655375
   3   3    1.0143921

BLOCK YD Q=  1262.5105
   1   1    0.00031068752
   2   2    0.005903063
   3   3    0.30810467

BLOCK YE Q=  1262.5105
   1   1    5.4217245e-05
   2   2    0.011210407
   3   3    0.1885406

BLOCK AU Q=  1262.5105
   1   1    0
   2   2    0
   3   3    4020.7307

BLOCK AD Q=  1262.5105
   1   1    0
   2   2    0
   3   3    1977.1982

BLOCK AE Q=  1262.5105
   1   1    0
   2   2    0
   3   3    794.53651

BLOCK MSOFT Q=  1262.5105
   1    303.77767
   2   -841.49865
   3    3000
   21    2277954.7
   22   -1325358.1
   31    1797.9794
   32    1797.9794
   33    292.16122
   34    1353.3178
   35    1353.3178
   36    942.84144
   41    5000
   42    5000
   43    1460.4444
   44    5000
   45    5000
   46    1330.8902
   47    5000
   48    5000
   49    1633.0147

BLOCK MASS
   6    173.2
   23    91.1876
   24    80.429995
   15    1.777
   25    122.62831
   35    1922.019
   36    1922.3804
   37    1924.524
   1000001    5021.2653
   2000001    5011.5059
   1000002    5020.8496
   2000002    5013.0322
   1000003    5021.2677
   2000003    5011.5068
   1000004    5020.851
   2000004    5013.0332
   1000005    1383.2509
   2000005    1633.2943
   1000006    1039.2517
   2000006    1533.7312
   1000011    1803.0984
   2000011    1355.028
   1000012    1801.0527
   1000013    1803.0975
   2000013    1355.0244
   1000014    1801.0508
   1000015    312.11455
   2000015    944.79948
   1000016    305.74246
   1000021    3175.6246
   1000022    303.88138
   1000023   -870.74922
   1000025    1191.7161
   1000035   -1199.3795
   1000024    870.94627
   1000037    1201.4953

BLOCK ALPHA
      -0.052931027

BLOCK HMIX Q=  1262.5105
   1   -1187.3316
   2    18.41338
   3    244.14893
   4    3695546.5

BLOCK STOPMIX
   1   1   -0.57512534
   1   2    0.8180653
   2   1   -0.8180653
   2   2   -0.57512534

BLOCK SBOTMIX
   1   1   -0.99535319
   1   2    0.096291319
   2   1   -0.096291319
   2   2   -0.99535319

BLOCK STAUMIX
   1   1   -0.99857663
   1   2    0.053335835
   2   1   -0.053335835
   2   2   -0.99857663

BLOCK NMIX
   1   1    0.99919376
   1   2    0.00029768009
   1   3   -0.039399936
   1   4   -0.0077061271
   2   1   -0.0045389527
   2   2   -0.98372584
   2   3   -0.14363567
   2   4    0.1078502
   3   1    0.033283623
   3   2   -0.025608117
   3   3    0.70552202
   3   4    0.70744265
   4   1   -0.021986958
   4   2    0.17784153
   4   3   -0.6928601
   4   4    0.69845104

BLOCK UMIX
   1   1   -0.97847063
   1   2   -0.20638611
   2   1   -0.20638611
   2   2    0.97847063

BLOCK VMIX
   1   1    0.98773251
   1   2    0.15615536
   2   1    0.15615536
   2   2   -0.98773251

BLOCK HIGGSBOUNDSINPUTHIGGSCOUPLINGSFERMIONS
       0, 339.05256,3,36,15,15

BLOCK HIGGSBOUNDSINPUTHIGGSCOUPLINGSBOSONS
       0,4,36,21,21,23

BLOCK SPHENOLOWENERGY
   1    0.00031008023
   2    1.5923045e-06
   3    3.525978e-05
   4    2.3758061e-15
   5    1.0149152e-10
   6    2.1235706e-08
   7    8.0605184e-14
   8    3.4434434e-09
   9    7.3001788e-07
   10    9.6398279e-05
   11    0.99575732
   12    0.54240053
   13    19.378863
   14    0
   15    0
   16    0.0021586112
   17    2.2816719e-15
   18    2.4797603e-11
   19    8.290041e-11
   20    2.4969727e-15
   21    1.0675272e-10
   22   -2.6422509e-08
   23    0
   24    0
   25    0
   26    0
   27    0
   28    0
   29    0
   30    0
   31    0
   39    6.3292224e-05
   40    0
   41    0
   42    0

BLOCK FWCOEF Q=  160
   305   4422   0   0   -0.18881911
   305   4422   0   2   -0.17467743
   305   4322   0   2   -8.7714592e-05
   305   6421   0   0   -0.095227835
   305   6421   0   2   -0.095888364
   305   6321   0   2   -0.00023156991
   3051111   4133   0   0    1.5856949
   3051111   4133   0   2    1.5868354
   3051111   4233   0   2    3.8491163e-05
   3051111   4137   0   0   -4.408387
   3051111   4137   0   2   -4.4073965
   3051111   4237   0   2   -0.00030184184
   3051313   4133   0   0    1.5856949
   3051313   4133   0   2    1.5868348
   3051313   4233   0   2    3.8491054e-05
   3051313   4137   0   0   -4.408387
   3051313   4137   0   2   -4.4073971
   3051313   4237   0   2   -0.00030184186
   3051212   4137   0   0    1.5053501
   3051212   4137   0   2    1.5051444
   3051212   4237   0   2    6.5869927e-05
   3051414   4137   0   0    1.5053501
   3051414   4137   0   2    1.5051444
   3051414   4237   0   2    6.5869943e-05
   3051616   4137   0   0    1.5053501
   3051616   4137   0   2    1.5051443
   3051616   4237   0   2    6.5873352e-05

BLOCK IMFWCOEF Q=  160
   305   4422   0   0    3.8588653e-07
   305   4422   0   2    7.7035349e-06
   305   4322   0   2    2.8528057e-06
   305   6421   0   0    3.3053733e-07
   305   6421   0   2    9.2747051e-06
   305   6321   0   2    1.4195541e-06
   3051111   4133   0   2   -3.3711808e-07
   3051111   4233   0   2    9.9489284e-07
   3051111   4137   0   2    4.7886495e-06
   3051111   4237   0   2   -7.811322e-06
   3051313   4133   0   2   -3.3712446e-07
   3051313   4233   0   2    9.948922e-07
   3051313   4137   0   2    4.7886471e-06
   3051313   4237   0   2   -7.8113237e-06
   3051212   4137   0   2   -8.6646367e-07
   3051212   4237   0   2    1.7046914e-06
   3051414   4137   0   2   -8.6646361e-07
   3051414   4237   0   2    1.7046914e-06
   3051616   4137   0   2   -8.6821447e-07
   3051616   4237   0   2    1.7046727e-06

DECAY 23  2.4952


DECAY 24  2.085


DECAY 2000011  6.131586
    0.99990383   2    1000022    11

DECAY 1000011  15.884923
    0.56233644   2   -1000024    12
    0.28567797   2    1000023    11
    0.13453476   2    1000022    11
    0.013156559   2   -1000037    12
    0.0042845524   2    1000035    11

DECAY 2000013  6.1319553
    0.99984115   2    1000022    13

DECAY 1000013  15.88676
    0.5622708   2   -1000024    14
    0.28564821   2    1000023    13
    0.13451954   2    1000022    13
    0.01315501   2   -1000037    14
    0.0043262725   2    1000035    13

DECAY 1000015  0.00098950836
    0.99998227   2    1000022    15

DECAY 2000015  5.9759223
    0.63585494   2    1000022    15
    0.19019242   2    1000016   -24
    0.092572231   2    1000015    23
    0.081377849   2    1000015    25

DECAY 1000012  15.903479
    0.57092402   2    1000024    11
    0.28183445   2    1000023    12
    0.13390846   2    1000022    12
    0.0074871607   2    1000037    11
    0.0055493195   2    1000035    12
    0.00029658574   2    1000025    12

DECAY 1000014  15.904882
    0.57087907   2    1000024    13
    0.28180892   2    1000023    14
    0.13389648   2    1000022    14
    0.0075701701   2    1000037    13
    0.0055488049   2    1000035    14
    0.00029655825   2    1000025    14

DECAY 1000016  5.6422055e-05
    1   2    1000022    16

DECAY 2000001  144.45684
    0.98077691   2    1000021    1
    0.019195173   2    1000022    1

DECAY 1000001  205.63017
    0.69394752   2    1000021    1
    0.19360744   2   -1000024    2
    0.097688366   2    1000023    1
    0.0081378257   2   -1000037    2
    0.0033665596   2    1000022    1
    0.0031570918   2    1000035    1

DECAY 2000003  144.4631
    0.98073503   2    1000021    3
    0.019194382   2    1000022    3

DECAY 1000003  205.63516
    0.69393188   2    1000021    3
    0.19360297   2   -1000024    4
    0.09768638   2    1000023    3
    0.0081453668   2   -1000037    4
    0.0033665056   2    1000022    3
    0.0031642155   2    1000035    3
    0.00010268298   2    1000025    3

DECAY 1000005  51.489729
    0.86885466   2    1000006   -24
    0.070664585   2   -1000024    6
    0.042447929   2    1000023    5
    0.010946362   2   -1000037    6
    0.0038312615   2    1000022    5
    0.0016569294   2    1000025    5
    0.0015982716   2    1000035    5

DECAY 2000005  4.6464479
    0.4006242   2    1000006   -24
    0.17849146   2    1000022    5
    0.16877944   2   -1000037    6
    0.073458844   2    1000025    5
    0.07305532   2    1000035    5
    0.053402625   2    1000005    23
    0.049951073   2    1000005    25
    0.0013375202   2    2000006   -24
    0.0008084435   2   -1000024    6

DECAY 2000002  152.94988
    0.92735535   2    1000021    2
    0.072539604   2    1000022    2

DECAY 1000002  205.62691
    0.69374787   2    1000021    2
    0.1972748   2    1000024    1
    0.098002382   2    1000023    2
    0.004658297   2    1000037    1
    0.0033889333   2    1000022    2
    0.0028906495   2    1000035    2

DECAY 2000004  152.95315
    0.92733579   2    1000021    4
    0.072538056   2    1000022    4

DECAY 1000004  205.63173
    0.69373206   2    1000021    4
    0.1972709   2    1000024    3
    0.09800022   2    1000023    4
    0.0046725644   2    1000037    3
    0.003388855   2    1000022    4
    0.0028943859   2    1000035    4

DECAY 1000006  1.6444404
    0.71037563   2    1000022    6
    0.28729788   2    1000024    5
    0.0014544795   2    1000023    4
    0.00044893434   2    1000022    4
    0.00017989503   3    1000022    24    5
    0.00017219718   3    1000016   -15    5

DECAY 2000006  64.071731
    0.63580094   2    1000006    23
    0.10522998   2    1000006    25
    0.099533345   2    1000005    24
    0.044105458   2    1000024    5
    0.035657269   2    1000037    5
    0.024581717   2    1000023    6
    0.019187159   2    1000022    6
    0.018109091   2    1000035    6
    0.017795045   2    1000025    6

DECAY 1000024  5.6941371
    0.50695768   2    1000016   -15
    0.49136578   2   -1000015    16
    0.0016477163   2    1000022    24

DECAY 1000037  8.6868857
    0.26470029   2    1000023    24
    0.20960049   2    1000024    23
    0.19545467   2    1000024    25
    0.16089188   2    1000006   -5
    0.086081801   2    1000022    24
    0.053794419   2    1000016   -15
    0.019373528   2   -1000015    16
    0.0073520858   2   -2000015    16
    0.0019087019   3    1000022   -5    6
    0.0008364158   3    1000023   -5    6

DECAY 1000022 -1


DECAY 1000023  5.7011076
    0.2498236   2    1000015   -15
    0.2498236   2   -1000015    15
    0.24878498   2    1000016   -16
    0.24878498   2   -1000016    16
    0.001618177   2    1000022    25
    0.0011562889   2    1000022    23

DECAY 1000025  8.2447681
    0.24779111   2    1000023    23
    0.21607748   2    1000024   -24
    0.21607748   2   -1000024    24
    0.17870563   2    1000023    25
    0.058445925   2    1000022    25
    0.028788164   2    1000022    23
    0.021723638   2    1000015   -15
    0.021723638   2   -1000015    15
    0.0036330589   2    2000015   -15
    0.0036330589   2   -2000015    15
    0.00098224004   3    1000022    6   -6
    0.00065217325   3    1000024    5   -6
    0.00065217325   3   -1000024   -5    6
    0.00052261891   2    1000016   -16
    0.00052261891   2   -1000016    16

DECAY 1000035  7.5511453
    0.26632725   2    1000024   -24
    0.26632725   2   -1000024    24
    0.22178248   2    1000023    25
    0.077724087   2    1000022    25
    0.068705517   2    1000022    23
    0.030168311   2    1000015   -15
    0.030168311   2   -1000015    15
    0.010984371   2    1000016   -16
    0.010984371   2   -1000016    16
    0.0053189662   2    1000023    23
    0.0042047815   2    2000015   -15
    0.0042047815   2   -2000015    15
    0.0012417254   3    1000022    6   -6
    0.00092164118   3    1000024    5   -6
    0.00092164118   3   -1000024   -5    6

DECAY 1000021  245.18831
    0.1701971   2    1000006   -6
    0.1701971   2   -1000006    6
    0.12592646   2    1000005   -5
    0.12592646   2   -1000005    5
    0.10361565   2    2000005   -5
    0.10361565   2   -2000005    5
    0.097428942   2    2000006   -6
    0.097428942   2   -2000006    6
    0.0016708939   3    1000023    6   -6
    0.00092845247   2    1000006   -4
    0.00092845247   2   -1000006    4
    0.00077114099   3    1000025    6   -6
    0.00063417425   3    1000035    6   -6
    0.00030782781   3    1000037    5   -6
    0.00030782781   3   -1000037   -5    6

DECAY 25  0.0036313639
    0.61517225   2   -5    5
    0.18906729   2   -24    24
    0.070467654   2   -15    15
    0.069549432   2    21    21
    0.029812688   2   -4    4
    0.021820595   2    23    23
    0.0023459535   2    22    22
    0.0012883975   2    22    23
    0.00024422834   2   -13    13
    0.00023071791   2   -3    3
    6.3791051e-07   2   -1    1
    1.536396e-07   2   -2    2
    5.4905561e-09   2   -11    11

DECAY 35  19.250896
    0.84085487   2   -5    5
    0.08554631   2   -15    15
    0.021448423   2   -6    6
    0.020944379   2    1000022    1000035
    0.014130989   2    1000022    1000025
    0.0037460428   2   -2000015    1000015
    0.0037460428   2   -1000015    2000015
    0.0033888133   2    1000022    1000023
    0.003369076   2   -1000024    1000024
    0.0016676127   2    1000023    1000023
    0.00029624628   2    1000022    1000022
    0.00026683754   2   -13    13
    0.00025289185   2    25    25
    0.0001733771   2   -3    3
    6.9621336e-05   2   -1000015    1000015
    4.0443306e-05   2    21    21
    2.7027009e-05   2    23    23
    1.5170273e-05   2   -24    24
    8.161913e-06   2   -2000015    2000015
    4.8300199e-07   2    22    23
    4.7927943e-07   2   -1    1
    2.4963017e-07   2    22    22
    2.0146416e-07   2   -4    4
    5.9938548e-09   2   -11    11
    1.0383954e-12   2   -2    2

DECAY 36  19.22384
    0.82560212   2   -5    5
    0.083960665   2   -15    15
    0.022750214   2    1000022    1000025
    0.020034213   2   -6    6
    0.015797384   2   -1000024    1000024
    0.012982527   2    1000022    1000035
    0.0078287935   2    1000023    1000023
    0.0038001097   2   -2000015    1000015
    0.0038001097   2   -1000015    2000015
    0.002605062   2    1000022    1000023
    0.00031561788   2    1000022    1000022
    0.00026191376   2   -13    13
    0.00017017777   2   -3    3
    5.2034822e-05   2    21    21
    3.6272187e-05   2    23    25
    1.6956154e-06   2    22    23
    4.7043491e-07   2   -1    1
    4.2646114e-07   2    22    22
    1.8295056e-07   2   -4    4
    5.8832453e-09   2   -11    11
    9.4298031e-13   2   -2    2
    9.9080307e-42   2    25    25

DECAY 37  18.427235
    0.87244807   2   -5    6
    0.075988962   2   -15    16
    0.035541177   2    1000022    1000037
    0.007907237   2   -2000015    1000016
    0.0062637212   2    1000022    1000024
    0.0012820988   2   -5    4
    0.00026864838   2   -13    14
    0.00016555037   2   -3    4
    6.1293286e-05   2   -1000015    1000016
    3.8026434e-05   2    24    25
    1.6995772e-05   2   -3    6
    9.1555115e-06   2   -5    2
    7.7062381e-06   2   -3    2
    7.6843916e-07   2   -1    6
    4.5873266e-07   2   -1    2
    1.0128442e-07   2    1000023    1000024
    2.8402133e-08   2   -1    4
    6.2837135e-09   2   -11    12
    7.2802425e-12   2    24    35
    3.3411254e-12   2    24    36

DECAY 6  2.43
    1   2    5    24

DECAY 15 -1
