BLOCK SPINFO
   1   SPheno
   2   v4.0.5be

BLOCK SPHENOINFO
   1   2
   2   2

BLOCK MODSEL
   1   0

BLOCK MINPAR
   3    38.185258
   4   -1

BLOCK EXTPAR
   0    3773.9889
   1   -338.32273
   2   -1514.1314
   3    3601.6041
   11    4089.2309
   12   -2551.5507
   13   -135.26301
   23   -384.11629
   25    37.170987
   26    159.79278
   31    1823.5726
   32    1823.5726
   33    4749.5393
   34    4975.5041
   35    4975.5041
   36    3291.2674
   41    4318.3697
   42    4318.3697
   43    3376.4298
   44    3350.5538
   45    3350.5538
   46    4063.4424
   47    1388.8083
   48    1388.8083
   49    207.47886

BLOCK SMINPUTS
   1    127.90897
   2    1.1663787e-05
   3    0.1184
   4    91.1876
   5    4.18
   6    173.2
   7    1.777
   8    0
   11    0.00051099893
   12    0
   13    0.10565837
   14    0
   21    0.005
   22    0.0025
   23    0.095
   24    1.27

BLOCK GAUGE Q=  3773.9889
   1    0.35536298
   2    0.66519887
   3    1.219778

BLOCK YU Q=  3773.9889
   1   1    8.3874057e-06
   2   2    0.0042608021
   3   3    1.013266

BLOCK YD Q=  3773.9889
   1   1    0.00062648689
   2   2    0.011903251
   3   3    0.62127869

BLOCK YE Q=  3773.9889
   1   1    0.00010932654
   2   2    0.022605262
   3   3    0.38018332

BLOCK AU Q=  3773.9889
   1   1    0
   2   2    0
   3   3    4089.2309

BLOCK AD Q=  3773.9889
   1   1    0
   2   2    0
   3   3   -2551.5507

BLOCK AE Q=  3773.9889
   1   1    0
   2   2    0
   3   3   -135.26301

BLOCK MSOFT Q=  3773.9889
   1   -338.32273
   2   -1514.1314
   3    3601.6041
   21   -14320.902
   22    120389.63
   31    1823.5726
   32    1823.5726
   33    4749.5393
   34    4975.5041
   35    4975.5041
   36    3291.2674
   41    4318.3697
   42    4318.3697
   43    3376.4298
   44    3350.5538
   45    3350.5538
   46    4063.4424
   47    1388.8083
   48    1388.8083
   49    207.47886

BLOCK MASS
   6    173.2
   23    91.1876
   24    80.429995
   15    1.777
   25    124.02145
   35    160.06097
   36    159.79278
   37    186.07101
   1000001    4441.5313
   2000001    1613.0477
   1000002    4440.8044
   2000002    3493.17
   1000003    4441.528
   2000003    1613.0383
   1000004    4440.8011
   2000004    3493.1692
   1000005    689.64831
   2000005    3483.3167
   1000006    3476.8376
   2000006    4096.5366
   1000011    1839.1669
   2000011    4982.0682
   1000012    1837.0416
   1000013    1839.1461
   2000013    4982.0382
   1000014    1837.0228
   1000015    3287.0451
   2000015    4754.7888
   1000016    4753.7186
   1000021    3819.2705
   1000022   -320.14174
   1000023    392.67641
   1000025   -402.30748
   1000035   -1567.9308
   1000024    388.67409
   1000037    1567.9974

BLOCK ALPHA
      -0.085622305

BLOCK HMIX Q=  3773.9889
   1   -384.11629
   2    37.170987
   3    243.00523
   4    25533.733

BLOCK STOPMIX
   1   1   -0.9936544
   1   2    0.1124764
   2   1   -0.1124764
   2   2   -0.9936544

BLOCK SBOTMIX
   1   1   -0.002423845
   1   2    0.99999706
   2   1   -0.99999706
   2   2   -0.002423845

BLOCK STAUMIX
   1   1   -0.0021460574
   1   2    0.9999977
   2   1   -0.9999977
   2   2   -0.0021460574

BLOCK NMIX
   1   1    0.89999818
   1   2   -0.018338158
   1   3   -0.33477312
   1   4    0.2785569
   2   1   -0.041721508
   2   2    0.028178886
   2   3   -0.70354064
   2   4   -0.70886941
   3   1    0.43388767
   3   2    0.045392782
   3   3    0.62668887
   3   4   -0.6457105
   4   1    0.0020186173
   4   2   -0.9984033
   4   3    0.01478489
   4   4   -0.054480956

BLOCK UMIX
   1   1   -0.0209551
   1   2   -0.99978042
   2   1   -0.99978042
   2   2    0.0209551

BLOCK VMIX
   1   1    0.077161164
   1   2    0.99701863
   2   1    0.99701863
   2   2   -0.077161164

BLOCK HIGGSBOUNDSINPUTHIGGSCOUPLINGSFERMIONS
       0, 1381.6823,3,36,15,15

BLOCK HIGGSBOUNDSINPUTHIGGSCOUPLINGSBOSONS
       0,4,36,21,21,23

BLOCK SPHENOLOWENERGY
   1    0.00056554614
   2    1.6239188e-06
   3    3.5264604e-05
   4    3.6477019e-15
   5    1.5582052e-10
   6    3.2318249e-08
   7    1.2792706e-13
   8    5.4648448e-09
   9    1.1476137e-06
   10    3.3369133e-06
   11    0.034469037
   12    0.54129074
   13    18.959434
   14    0
   15    0
   16    0.0021576983
   17    2.281956e-15
   18    2.4804316e-11
   19    8.2916123e-11
   20    3.1319467e-15
   21    1.3390453e-10
   22    1.3913827e-08
   23    0
   24    0
   25    0
   26    0
   27    0
   28    0
   29    0
   30    0
   31    0
   39    7.1843382e-05
   40    0
   41    0
   42    0

BLOCK FWCOEF Q=  160
   305   4422   0   0   -0.18881911
   305   4422   0   2   -0.41480634
   305   4322   0   2   -0.0040621134
   305   6421   0   0   -0.095227835
   305   6421   0   2   -0.29591865
   305   6321   0   2   -0.0035350868
   3051111   4133   0   0    1.6249145
   3051111   4133   0   2    1.6252946
   3051111   4233   0   2   -0.00088416812
   3051111   4137   0   0   -4.4476066
   3051111   4137   0   2   -4.4468377
   3051111   4237   0   2    0.0065653224
   3051313   4133   0   0    1.6249145
   3051313   4133   0   2    1.6252938
   3051313   4233   0   2   -0.00088619318
   3051313   4137   0   0   -4.4476066
   3051313   4137   0   2   -4.4468386
   3051313   4237   0   2    0.0065673541
   3051212   4137   0   0    1.5053501
   3051212   4137   0   2    1.505189
   3051212   4237   0   2   -0.0014202369
   3051414   4137   0   0    1.5053501
   3051414   4137   0   2    1.505189
   3051414   4237   0   2   -0.0014197972
   3051616   4137   0   0    1.5053501
   3051616   4137   0   2    1.5051889
   3051616   4237   0   2   -0.0012958831

BLOCK IMFWCOEF Q=  160
   305   4422   0   0    3.8583239e-07
   305   4422   0   2    7.2713191e-06
   305   4322   0   2    1.6807236e-06
   305   6421   0   0    3.3049096e-07
   305   6421   0   2    1.6385805e-05
   305   6321   0   2    9.3056941e-07
   3051111   4133   0   2    2.4993184e-07
   3051111   4233   0   2    5.2633912e-06
   3051111   4137   0   2   -1.3877362e-06
   3051111   4237   0   2   -3.9045553e-05
   3051313   4133   0   2    2.4991275e-07
   3051313   4233   0   2    5.263388e-06
   3051313   4137   0   2   -1.387723e-06
   3051313   4237   0   2   -3.904557e-05
   3051212   4137   0   2    3.9334242e-07
   3051212   4237   0   2    8.4464752e-06
   3051414   4137   0   2    3.9334221e-07
   3051414   4237   0   2    8.4464752e-06
   3051616   4137   0   2    3.9119402e-07
   3051616   4237   0   2    8.4464783e-06

DECAY 23  2.4952


DECAY 24  2.085


DECAY 1000011  4.0069695
    0.40628464   2    1000022    11
    0.3013219   2   -1000037    12
    0.14998956   2    1000035    11
    0.14072068   2    1000025    11
    0.00161932   2   -1000024    12

DECAY 2000011  24.804149
    0.81073533   2    1000022    11
    0.18752627   2    1000025    11
    0.0017350138   2    1000023    11

DECAY 1000013  4.0237607
    0.40507315   2    1000022    13
    0.300025   2   -1000037    14
    0.149344   2    1000035    13
    0.14178674   2    1000025    13
    0.0021585689   2    1000023    13
    0.001612541   2   -1000024    14

DECAY 2000013  24.904183
    0.8077   2    1000022    13
    0.18756009   2    1000025    13
    0.0027221466   2    1000023    13
    0.0020081241   2   -1000024    14

DECAY 1000015  34.547147
    0.41027222   2    1000022    15
    0.26592263   2   -1000024    16
    0.19139192   2    1000025    15
    0.13233976   2    1000023    15

DECAY 2000015  69.34983
    0.47923432   2   -1000037    16
    0.23847912   2    1000035    15
    0.099306052   2    1000025    15
    0.096304655   2    1000023    15
    0.08567667   2    1000022    15
    0.00034355125   2    1000015    23
    0.00031235256   2    1000015    25
    0.00023179066   2   -1000024    16

DECAY 1000012  4.0353216
    0.46934626   2    1000022    12
    0.29355937   2    1000037    11
    0.14757304   2    1000035    12
    0.063101765   2    1000025    12
    0.021771806   2    1000024    11
    0.0046477568   2    1000023    12

DECAY 1000014  4.0521135
    0.46739591   2    1000022    14
    0.29230805   2    1000037    13
    0.14694387   2    1000035    14
    0.062839499   2    1000025    14
    0.02588424   2    1000024    13
    0.0046284401   2    1000023    14

DECAY 1000016  69.361323
    0.47640116   2    1000037    15
    0.23934787   2    1000035    16
    0.19790481   2    1000024    15
    0.074474616   2    1000022    16
    0.010331487   2    1000025    16
    0.00075786814   2    1000023    16
    0.00068658929   2    1000015    24

DECAY 2000001  0.8236209
    0.81725925   2    1000022    1
    0.1810361   2    1000025    1
    0.0016910659   2    1000023    1

DECAY 1000001  69.372968
    0.43168547   2   -1000037    2
    0.34313206   2    1000021    1
    0.21540876   2    1000035    1
    0.0088962382   2    1000022    1
    0.00035199358   2    1000023    1
    0.00028176213   2    1000025    1
    0.00024371268   2   -1000024    2

DECAY 2000003  0.83165711
    0.80992296   2    1000022    3
    0.18116579   2    1000025    3
    0.004848597   2   -1000024    4
    0.0040626298   2    1000023    3

DECAY 1000003  69.386609
    0.4316002   2   -1000037    4
    0.34306142   2    1000021    3
    0.21536619   2    1000035    3
    0.0089144455   2    1000022    3
    0.00043959592   2    1000023    3
    0.00035121619   2    1000025    3
    0.00026628688   2   -1000024    4

DECAY 1000005  4.489898
    0.40053563   2   -1000024    6
    0.26650507   2    1000023    5
    0.20754617   2    1000025    5
    0.12541313   2    1000022    5

DECAY 2000005  138.83648
    0.49422544   2   -1000024    6
    0.14305315   2   -1000037    6
    0.093111186   2    1000023    5
    0.073847706   2    1000025    5
    0.070070301   2    1000035    5
    0.050458377   2    1000005    35
    0.049909681   2    1000005    36
    0.024579952   2    1000022    5
    0.00053841229   2    1000005    23
    0.0002057993   2    1000005    25

DECAY 2000002  7.6560937
    0.81150525   2    1000022    2
    0.18676305   2    1000025    2
    0.0017290541   2    1000023    2

DECAY 1000002  69.365048
    0.42924251   2    1000037    1
    0.34247777   2    1000021    2
    0.21506807   2    1000035    2
    0.0056173645   2    1000022    2
    0.0041701205   2    1000025    2
    0.0033047374   2    1000024    1
    0.00011943092   2    1000023    2

DECAY 2000004  7.6585454
    0.81125806   2    1000022    4
    0.18676937   2    1000025    4
    0.0018092677   2    1000023    4
    0.00015972475   2    1000024    3

DECAY 1000004  69.378576
    0.42915839   2    1000037    3
    0.34240685   2    1000021    4
    0.21502582   2    1000035    4
    0.0056180298   2    1000022    4
    0.0041788076   2    1000025    4
    0.0034811783   2    1000024    3
    0.00013084736   2    1000023    4

DECAY 1000006  140.75422
    0.24841395   2    1000023    6
    0.20024104   2    1000025    6
    0.1955107   2    1000024    5
    0.13190287   2    1000037    5
    0.098802513   2    1000005    37
    0.065592999   2    1000035    6
    0.047985196   2    1000022    6
    0.0094903344   3    1000022    24    5
    0.0010429332   2    1000005    24
    0.00099635887   2    1000022    4

DECAY 2000006  206.41753
    0.38814544   2    1000024    5
    0.19754106   2    1000023    6
    0.17726842   2    1000025    6
    0.060509791   2    1000022    6
    0.059339468   2    2000005    24
    0.052969328   2    1000006    25
    0.029949483   2    1000006    23
    0.023440884   2    1000021    6
    0.0066705313   2    1000037    5
    0.0033144145   2    1000035    6
    0.00047131255   2    2000005    37
    0.00024496418   2    1000006    36
    0.00011604625   2    1000005    37

DECAY 1000024  0.0029064761
    0.33340199   3    1000022   -1    2
    0.33307102   3    1000022   -3    4
    0.11124294   3    1000022   -15    16
    0.11114228   3    1000022   -13    14
    0.11114177   3    1000022   -11    12

DECAY 1000037  27.291306
    0.13311446   2    1000024    25
    0.12646686   2    1000023    24
    0.12592148   2    1000024    23
    0.11944537   2    1000024    36
    0.11772426   2    37    1000023
    0.11241777   2    1000024    35
    0.1102294   2    1000025    24
    0.099786363   2    37    1000025
    0.026764615   2    37    1000022
    0.015957775   2    1000022    24
    0.0045483906   3    1000024    6   -6
    0.0038228767   3    1000023   -5    6
    0.0031455329   3    1000025   -5    6
    0.00047816032   3    1000022   -5    6
    0.00014533386   2   -1000005    6

DECAY 1000022 -1


DECAY 1000023  0.0024224821
    0.2022126   3    1000022    12   -12
    0.15474632   3    1000022    5   -5
    0.1511936   3    1000022    1   -1
    0.15119318   3    1000022    3   -3
    0.11792025   3    1000022    2   -2
    0.11757715   3    1000022    4   -4
    0.034386734   3    1000022    15   -15
    0.034121239   3    1000022    13   -13
    0.034120192   3    1000022    11   -11
    0.0025277859   2    1000022    22

DECAY 1000025  5.8338809e-05
    0.38316879   3    1000022    5   -5
    0.12623227   3    1000022    12   -12
    0.094051227   3    1000022    3   -3
    0.093950976   3    1000022    1   -1
    0.073464111   3    1000022    2   -2
    0.073400989   3    1000022    4   -4
    0.052480856   3    1000022    15   -15
    0.021093292   3    1000022    13   -13
    0.020981418   3    1000022    11   -11
    0.0090896062   3    1000024    1   -2
    0.0090896062   3   -1000024   -1    2
    0.0087131597   3    1000024    3   -4
    0.0087131597   3   -1000024   -3    4
    0.0030298012   3    1000024    11   -12
    0.0030298012   3   -1000024   -11    12
    0.003028912   3    1000024    13   -14
    0.003028912   3   -1000024   -13    14
    0.0027934295   3    1000024    15   -16
    0.0027934295   3   -1000024   -15    16
    0.0026833731   2    1000023    22
    0.0020135289   2    1000022    22
    0.00079083642   3    1000023    12   -12
    0.00059139357   3    1000023    1   -1
    0.00059072774   3    1000023    3   -3
    0.00046123013   3    1000023    2   -2
    0.00036551585   3    1000023    4   -4
    0.00013346059   3    1000023    11   -11
    0.00013322478   3    1000023    13   -13

DECAY 1000035  29.224235
    0.11910944   2    1000024   -24
    0.11910944   2   -1000024    24
    0.11643301   2    37   -1000024
    0.11643301   2   -37    1000024
    0.098468321   2    1000023    35
    0.089296105   2    1000023    23
    0.086031709   2    1000025    25
    0.070711456   2    1000023    25
    0.055643835   2    1000025    35
    0.028249973   2    1000023    36
    0.02470851   2    1000025    23
    0.024684065   2    1000025    36
    0.014928862   2    1000022    35
    0.012561566   2    1000022    25
    0.007763923   2    1000022    36
    0.0041483342   2    1000022    23
    0.0038051382   3    1000024    5   -6
    0.0038051382   3   -1000024   -5    6
    0.0019665697   3    1000023    6   -6
    0.0016812499   3    1000025    6   -6
    0.00026309237   3    1000022    6   -6

DECAY 1000021  272.78733
    0.19392314   2    1000005   -5
    0.19392314   2   -1000005    5
    0.13988386   2    2000003   -3
    0.13988386   2   -2000003    3
    0.13988315   2    2000001   -1
    0.13988315   2   -2000001    1
    0.0059260509   2    1000006   -6
    0.0059260509   2   -1000006    6
    0.0058607171   2    2000005   -5
    0.0058607171   2   -2000005    5
    0.0055376296   2    2000002   -2
    0.0055376296   2   -2000002    2
    0.0055376163   2    2000004   -4
    0.0055376163   2   -2000004    4
    0.0028130542   2    1000006   -4
    0.0028130542   2   -1000006    4
    0.00022200159   3    1000023    6   -6
    0.00022144267   3    1000024    5   -6
    0.00022144267   3   -1000024   -5    6
    0.00019738899   3    1000025    6   -6

DECAY 25  0.035021661
    0.87691448   2   -5    5
    0.087265535   2   -15    15
    0.022730404   2   -24    24
    0.006271269   2    21    21
    0.0030924405   2   -4    4
    0.0026983375   2    23    23
    0.00031038066   2   -13    13
    0.00030715694   2   -3    3
    0.00025769245   2    22    22
    0.00015143131   2    22    23
    8.4920528e-07   2   -1    1
    1.5936343e-08   2   -2    2
    6.9777201e-09   2   -11    11

DECAY 35  5.4853321
    0.90831026   2   -5    5
    0.090283541   2   -15    15
    0.00072673033   2    21    21
    0.00032396687   2   -13    13
    0.00031218421   2   -3    3
    3.9787419e-05   2   -24    24
    2.223448e-06   2    23    23
    8.6308333e-07   2   -1    1
    2.1076892e-07   2    22    22
    1.9694661e-07   2   -4    4
    2.6164214e-08   2    22    23
    7.2825911e-09   2   -11    11
    1.0140997e-12   2   -2    2

DECAY 36  5.5777703
    0.90838828   2   -5    5
    0.090228714   2   -15    15
    0.00074630464   2    21    21
    0.00032359421   2   -13    13
    0.0003118819   2   -3    3
    8.6224732e-07   2   -1    1
    2.9678537e-07   2    22    22
    3.1099362e-08   2    23    25
    1.6080825e-08   2   -4    4
    1.5272068e-08   2    22    23
    7.2742048e-09   2   -11    11
    8.315563e-14   2   -2    2

DECAY 37  0.64202352
    0.84495879   2   -15    16
    0.13730374   2   -5    6
    0.011793977   2   -5    4
    0.0029877719   2   -13    14
    0.0026919505   2   -3    4
    0.00012094117   2   -3    2
    8.4229e-05   2   -5    2
    2.2684973e-05   2    24    36
    2.1496968e-05   2    24    35
    7.4692662e-06   2   -1    2
    6.1794245e-06   2    24    25
    3.5167893e-07   2   -3    6
    3.411968e-07   2   -1    4
    6.9884341e-08   2   -11    12
    1.3072317e-08   2   -1    6

DECAY 6  2.43
    1   2    5    24

DECAY 15 -1
