BLOCK SPINFO
   1   SPheno
   2   v4.0.5be

BLOCK SPHENOINFO
   1   2
   2   2

BLOCK MODSEL
   1   0

BLOCK MINPAR
   3    45.768842
   4    1

BLOCK EXTPAR
   0    1445.667
   1   -146.6612
   2    1139.409
   3    3000
   11   -4124.1821
   12   -1818.0667
   13    597.90805
   23    1079.7558
   25    45.109107
   26    1414.3854
   31    1689.9956
   32    1689.9956
   33    215.44391
   34    1349.768
   35    1349.768
   36    1411.5094
   41    5000
   42    5000
   43    1720.0524
   44    5000
   45    5000
   46    1348.6331
   47    5000
   48    5000
   49    1568.6687

BLOCK SMINPUTS
   1    127.90897
   2    1.1663787e-05
   3    0.1184
   4    91.1876
   5    4.18
   6    173.2
   7    1.777
   8    0
   11    0.00051099893
   12    0
   13    0.10565837
   14    0
   21    0.005
   22    0.0025
   23    0.095
   24    1.27

BLOCK GAUGE Q=  1445.667
   1    0.35536298
   2    0.66519887
   3    1.219778

BLOCK YU Q=  1445.667
   1   1    8.3864321e-06
   2   2    0.0042603075
   3   3    1.0131484

BLOCK YD Q=  1445.667
   1   1    0.00076018924
   2   2    0.014443595
   3   3    0.75386951

BLOCK YE Q=  1445.667
   1   1    0.00013265858
   2   2    0.027429587
   3   3    0.46132053

BLOCK AU Q=  1445.667
   1   1    0
   2   2    0
   3   3   -4124.1819

BLOCK AD Q=  1445.667
   1   1    0
   2   2    0
   3   3   -1818.0674

BLOCK AE Q=  1445.667
   1   1    0
   2   2    0
   3   3    597.90805

BLOCK MSOFT Q=  1445.667
   1   -146.6612
   2    1139.409
   3    3000
   21    865439.35
   22   -1140888.9
   31    1689.9956
   32    1689.9956
   33    215.44391
   34    1349.768
   35    1349.768
   36    1411.5094
   41    5000
   42    5000
   43    1720.0524
   44    5000
   45    5000
   46    1348.6331
   47    5000
   48    5000
   49    1568.6687

BLOCK MASS
   6    173.2
   23    91.1876
   24    80.429995
   15    1.777
   25    122.70277
   35    1414.0063
   36    1414.3854
   37    1418.0908
   1000001    5027.2022
   2000001    5017.9186
   1000002    5026.7713
   2000002    5019.4027
   1000003    5027.2106
   2000003    5017.9214
   1000004    5026.7754
   2000004    5019.4035
   1000005    1565.5509
   2000005    1687.7969
   1000006    1192.9666
   2000006    1751.8956
   1000011    1697.428
   2000011    1351.5778
   1000012    1695.2373
   1000013    1697.4211
   2000013    1351.5448
   1000014    1695.2223
   1000015    238.71398
   2000015    1407.5241
   1000016    242.62346
   1000021    3187.313
   1000022   -146.43923
   1000023    1056.4747
   1000025   -1085.4394
   1000035    1208.4244
   1000024    1057.6343
   1000037    1208.8193

BLOCK ALPHA
      -0.022271122

BLOCK HMIX Q=  1445.667
   1    1079.7558
   2    45.109107
   3    244.02003
   4    2000485.9

BLOCK STOPMIX
   1   1    0.3791473
   1   2    0.92533633
   2   1   -0.92533633
   2   2    0.3791473

BLOCK SBOTMIX
   1   1    0.27716585
   1   2    0.96082209
   2   1   -0.96082209
   2   2    0.27716585

BLOCK STAUMIX
   1   1    0.99879355
   1   2    0.049106543
   2   1   -0.049106543
   2   2    0.99879355

BLOCK NMIX
   1   1    0.99910786
   1   2    0.00016727462
   1   3    0.041988689
   1   4    0.0045166188
   2   1   -0.024118998
   2   2   -0.43804637
   2   3    0.64315847
   2   4   -0.62759926
   3   1    0.032855469
   3   2   -0.02421946
   3   3   -0.70559142
   3   4   -0.70744235
   4   1    0.011057573
   4   2   -0.89862604
   4   3   -0.29449087
   4   4    0.3249986

BLOCK UMIX
   1   1   -0.40040084
   1   2    0.91634009
   2   1    0.91634009
   2   2    0.40040084

BLOCK VMIX
   1   1   -0.44425651
   1   2    0.89589964
   2   1    0.89589964
   2   2    0.44425651

BLOCK HIGGSBOUNDSINPUTHIGGSCOUPLINGSFERMIONS
       0, 2034.8316,3,36,15,15

BLOCK HIGGSBOUNDSINPUTHIGGSCOUPLINGSBOSONS
       0,4,36,21,21,23

BLOCK SPHENOLOWENERGY
   1    0.00027608805
   2    1.601687e-06
   3    3.5295439e-05
   4    4.0333869e-15
   5    1.7227707e-10
   6    3.4651563e-08
   7    1.3505999e-13
   8    5.768963e-09
   9    1.177446e-06
   10    9.3718754e-05
   11    0.96807885
   12    0.54193615
   13    19.340543
   14    0
   15    0
   16    0.0021571644
   17    2.281663e-15
   18    2.4822727e-11
   19    8.295993e-11
   20    5.0600388e-15
   21    2.1632371e-10
   22   -5.2069791e-08
   23    0
   24    0
   25    0
   26    0
   27    0
   28    0
   29    0
   30    0
   31    0
   39    9.1409946e-05
   40    0
   41    0
   42    0

BLOCK FWCOEF Q=  160
   305   4422   0   0   -0.18881911
   305   4422   0   2   -0.13108599
   305   4322   0   2    0.00015016482
   305   6421   0   0   -0.095227835
   305   6421   0   2   -0.075812236
   305   6321   0   2   -0.00023888423
   3051111   4133   0   0    1.5911483
   3051111   4133   0   2    1.5925311
   3051111   4233   0   2    0.00019504206
   3051111   4137   0   0   -4.4138404
   3051111   4137   0   2   -4.4163941
   3051111   4237   0   2   -0.0015194032
   3051313   4133   0   0    1.5911483
   3051313   4133   0   2    1.5925273
   3051313   4233   0   2    0.00019503401
   3051313   4137   0   0   -4.4138404
   3051313   4137   0   2   -4.416398
   3051313   4237   0   2   -0.0015193995
   3051212   4137   0   0    1.5053501
   3051212   4137   0   2    1.5059162
   3051212   4237   0   2    0.00033118912
   3051414   4137   0   0    1.5053501
   3051414   4137   0   2    1.5059162
   3051414   4237   0   2    0.00033119063
   3051616   4137   0   0    1.5053501
   3051616   4137   0   2    1.5059154
   3051616   4237   0   2    0.00033161371

BLOCK IMFWCOEF Q=  160
   305   4422   0   0    3.8592894e-07
   305   4422   0   2    3.0667449e-05
   305   4322   0   2    9.7713902e-06
   305   6421   0   0    3.3057366e-07
   305   6421   0   2   -7.9091709e-06
   305   6321   0   2    4.3749951e-06
   3051111   4133   0   2   -1.025662e-06
   3051111   4233   0   2    6.2958683e-06
   3051111   4137   0   2    9.419444e-06
   3051111   4237   0   2   -4.9092922e-05
   3051313   4133   0   2   -1.0257118e-06
   3051313   4233   0   2    6.2958488e-06
   3051313   4137   0   2    9.4194095e-06
   3051313   4237   0   2   -4.909298e-05
   3051212   4137   0   2   -1.8959424e-06
   3051212   4237   0   2    1.0701064e-05
   3051414   4137   0   2   -1.8959424e-06
   3051414   4237   0   2    1.0701064e-05
   3051616   4137   0   2   -1.9101618e-06
   3051616   4237   0   2    1.0701018e-05

DECAY 23  2.4952


DECAY 24  2.085


DECAY 2000011  6.6224031
    0.99976512   2    1000022    11
    0.00013954921   2    1000025    11

DECAY 1000011  8.0608703
    0.37807512   2   -1000037    12
    0.26029272   2    1000022    11
    0.17965852   2    1000035    11
    0.11122692   2   -1000024    12
    0.070732308   2    1000023    11

DECAY 2000013  6.6275571
    0.99896722   2    1000022    13
    0.00038512854   2   -1000024    14
    0.0003310564   2    1000025    13
    0.00028131304   2    1000023    13

DECAY 1000013  8.0714453
    0.3775719   2   -1000037    14
    0.25995609   2    1000022    13
    0.17948703   2    1000035    13
    0.11107959   2   -1000024    14
    0.071125799   2    1000023    13
    0.00056193924   2    1000025    13
    0.00021765448   2    2000013    25

DECAY 1000015  0.11948102
    1   2    1000022    15

DECAY 2000015  16.679027
    0.41322226   2    1000022    15
    0.24790207   2    1000016   -24
    0.12364021   2    1000015    23
    0.097885188   2    1000015    25
    0.053269921   2   -1000024    16
    0.029495168   2    1000025    15
    0.026413738   2    1000023    15
    0.0053154653   2   -1000037    16
    0.0028559663   2    1000035    15

DECAY 1000012  8.0714909
    0.3585387   2    1000037    11
    0.25927942   2    1000022    12
    0.18298821   2    1000035    12
    0.13612196   2    1000024    11
    0.062510166   2    1000023    12
    0.00056155392   2    1000025    12

DECAY 1000014  8.0801486
    0.35826226   2    1000037    13
    0.25899924   2    1000022    14
    0.18278384   2    1000035    14
    0.13695249   2    1000024    13
    0.062441232   2    1000023    14
    0.00056093347   2    1000025    14

DECAY 1000016  0.12286991
    0.99999999   2    1000022    16

DECAY 2000001  143.74498
    0.98054642   2    1000021    1
    0.019421269   2    1000022    1

DECAY 1000001  201.83521
    0.70312358   2    1000021    1
    0.16343486   2   -1000037    2
    0.078939695   2    1000035    1
    0.032109343   2   -1000024    2
    0.018844468   2    1000023    1
    0.003457816   2    1000022    1

DECAY 2000003  143.78303
    0.98028898   2    1000021    3
    0.019416395   2    1000022    3
    0.00011105554   2   -1000024    4

DECAY 1000003  201.85678
    0.7030528   2    1000021    3
    0.16341943   2   -1000037    4
    0.078939397   2    1000035    3
    0.03211245   2   -1000024    4
    0.018881413   2    1000023    3
    0.0034576336   2    1000022    3
    0.00013686989   2    1000025    3

DECAY 1000005  12.314993
    0.34449856   2   -1000024    6
    0.21678322   2    1000023    5
    0.1884697   2    1000025    5
    0.16050409   2    1000006   -24
    0.078579206   2    1000022    5
    0.0059404207   2   -1000037    6
    0.0052248071   2    1000035    5

DECAY 2000005  75.239583
    0.69375107   2    1000006   -24
    0.11492461   2   -1000024    6
    0.078426735   2   -1000037    6
    0.04444496   2    1000025    5
    0.036573972   2    1000023    5
    0.028277113   2    1000035    5
    0.0023634803   2    1000022    5
    0.0012380544   2    1000005    23

DECAY 2000002  152.29142
    0.92653348   2    1000021    2
    0.073347229   2    1000022    2

DECAY 1000002  201.83053
    0.70291758   2    1000021    2
    0.15621181   2    1000037    1
    0.078244267   2    1000035    2
    0.039525501   2    1000024    1
    0.019596595   2    1000023    2
    0.003470626   2    1000022    2

DECAY 2000004  152.29473
    0.92651346   2    1000021    4
    0.073345634   2    1000022    4

DECAY 1000004  201.85152
    0.70284629   2    1000021    4
    0.15621046   2    1000037    3
    0.078237113   2    1000035    4
    0.039600412   2    1000024    3
    0.019597746   2    1000023    4
    0.0034702675   2    1000022    4

DECAY 1000006  3.1970097
    0.66838342   2    1000022    6
    0.32618032   2    1000024    5
    0.0038257732   2    1000022    4
    0.0011324188   2    1000023    4
    0.00021893212   3   -1000015    16    5
    0.00017788311   3    1000016   -15    5

DECAY 2000006  89.839601
    0.37070238   2    1000006    23
    0.29748237   2    1000006    25
    0.080205609   2    1000025    6
    0.064873321   2    1000024    5
    0.064104042   2    1000037    5
    0.054284315   2    1000023    6
    0.043818212   2    1000035    6
    0.016052165   2    1000005    24
    0.0084775811   2    1000022    6

DECAY 1000024  3.8795501
    0.64963774   2    1000016   -15
    0.20088484   2   -1000015    16
    0.14603091   2    1000022    24
    0.0033867825   3    1000022   -5    6

DECAY 1000037  11.261913
    0.38215502   2    1000016   -15
    0.35467304   2   -1000015    16
    0.097029487   2    1000025    24
    0.074686074   2    1000023    24
    0.051423009   2    1000024    23
    0.024543682   2    1000024    25
    0.014976053   2    1000022    24
    0.00035129453   3    1000022   -5    6
    0.0001279639   2    1000006   -5

DECAY 1000022 -1


DECAY 1000023  4.0681537
    0.32382092   2    1000015   -15
    0.32382092   2   -1000015    15
    0.092700136   2    1000016   -16
    0.092700136   2   -1000016    16
    0.083354295   2    1000022    23
    0.082383548   2    1000022    25
    0.0010406993   3    1000022    6   -6
    0.00011906904   3    1000022    5   -5

DECAY 1000025  2.7662617
    0.37243132   2    1000015   -15
    0.37243132   2   -1000015    15
    0.14510786   2    1000022    25
    0.10458112   2    1000022    23
    0.0023137508   3    1000022    6   -6
    0.0013599617   2    1000016   -16
    0.0013599617   2   -1000016    16
    0.00022532262   3    1000022    5   -5
    0.0001091845   3    1000022    15   -15

DECAY 1000035  11.108006
    0.18821383   2    1000015   -15
    0.18821383   2   -1000015    15
    0.1804124   2    1000016   -16
    0.1804124   2   -1000016    16
    0.10492595   2    1000025    23
    0.055663795   2    1000024   -24
    0.055663795   2   -1000024    24
    0.022490259   2    1000023    25
    0.0099339365   2    1000022    23
    0.0094375539   2    1000022    25
    0.0042038922   2    1000025    25
    0.00020600099   2    1000023    23
    0.00016105173   3    1000022    6   -6

DECAY 1000021  223.25503
    0.1422691   2    1000006   -6
    0.1422691   2   -1000006    6
    0.12141446   2    1000005   -5
    0.12141446   2   -1000005    5
    0.11368328   2    2000006   -6
    0.11368328   2   -2000006    6
    0.1096223   2    2000005   -5
    0.1096223   2   -2000005    5
    0.011829649   2    1000006   -4
    0.011829649   2   -1000006    4
    0.0011450341   3    1000023    6   -6
    0.00090017517   3    1000025    6   -6

DECAY 25  0.0036706327
    0.61456554   2   -5    5
    0.188587   2   -24    24
    0.070970185   2   -15    15
    0.07064362   2    21    21
    0.02935728   2   -4    4
    0.021798058   2    23    23
    0.0023174266   2    22    22
    0.0012833601   2    22    23
    0.00024576568   2   -13    13
    0.00023097053   2   -3    3
    6.3860707e-07   2   -1    1
    1.5129175e-07   2   -2    2
    5.5251177e-09   2   -11    11

DECAY 35  42.575806
    0.79169401   2   -5    5
    0.20041354   2   -15    15
    0.003925739   2    1000022    1000023
    0.001823942   2    1000022    1000025
    0.00063607888   2   -6    6
    0.00056149866   2   -13    13
    0.00034295546   2    1000022    1000035
    0.00029157937   2   -3    3
    0.00011961808   2    1000022    1000022
    0.00010524143   2   -1000015    1000015
    4.3703834e-05   2    21    21
    3.5151836e-05   2    25    25
    2.8512686e-06   2    23    23
    2.4728207e-06   2   -24    24
    8.0606244e-07   2   -1    1
    5.7923448e-08   2    22    23
    5.7565297e-08   2    22    22
    1.298879e-08   2   -4    4
    1.2613864e-08   2   -11    11
    6.6959394e-14   2   -2    2

DECAY 36  40.504789
    0.791689   2   -5    5
    0.20040528   2   -15    15
    0.0040317099   2    1000022    1000025
    0.0021775582   2    1000022    1000023
    0.00056143354   2   -13    13
    0.00054423341   2   -6    6
    0.00029153156   2   -3    3
    0.00013009699   2    1000022    1000022
    0.00010891506   2    1000022    1000035
    5.5372466e-05   2    21    21
    4.0090245e-06   2    23    25
    8.0592986e-07   2   -1    1
    2.7456664e-08   2    22    22
    1.2612394e-08   2   -11    11
    1.073097e-08   2   -4    4
    5.3903015e-09   2    22    23
    5.5309125e-14   2   -2    2
    2.4326252e-35   2    25    25

DECAY 37  45.914543
    0.86247435   2   -5    6
    0.12938615   2   -15    16
    0.0056379977   2    1000022    1000024
    0.0012967313   2   -5    4
    0.00045742734   2   -13    14
    0.00043327807   2    1000022    1000037
    0.00024641872   2   -3    4
    4.1377961e-05   2   -1000015    1000016
    1.1436462e-05   2   -3    2
    9.2600117e-06   2   -5    2
    3.5753443e-06   2    24    25
    1.2333302e-06   2   -3    6
    6.831047e-07   2   -1    2
    4.0368671e-08   2   -1    6
    3.198906e-08   2   -1    4
    1.0699273e-08   2   -11    12
    3.3629847e-11   2    24    35
    2.0667278e-11   2    24    36

DECAY 6  2.43
    1   2    5    24

DECAY 15 -1
