BLOCK SPINFO
   1   SPheno
   2   v4.0.5be

BLOCK SPHENOINFO
   1   2
   2   2

BLOCK MODSEL
   1   0

BLOCK MINPAR
   3    25.83289
   4   -1

BLOCK EXTPAR
   0    4053.8035
   1   -1928.7712
   2   -445.91248
   3    4000
   11   -5872.68
   12   -1795.5946
   13    657.70662
   23   -500.71312
   25    24.797723
   26    2000
   31    1853.0194
   32    1853.0194
   33    1633.3656
   34    983.95897
   35    983.95897
   36    1583.637
   41    4000
   42    4000
   43    4000
   44    4000
   45    4000
   46    4000
   47    4000
   48    4000
   49    4000

BLOCK SMINPUTS
   1    127.90897
   2    1.1663787e-05
   3    0.1184
   4    91.1876
   5    4.18
   6    173.2
   7    1.777
   8    0
   11    0.00051099893
   12    0
   13    0.10565837
   14    0
   21    0.005
   22    0.0025
   23    0.095
   24    1.27

BLOCK GAUGE Q=  4053.8035
   1    0.35536298
   2    0.66519887
   3    1.219778

BLOCK YU Q=  4053.8035
   1   1    8.3911867e-06
   2   2    0.0042627229
   3   3    1.0137228

BLOCK YD Q=  4053.8035
   1   1    0.00041813395
   2   2    0.0079445451
   3   3    0.41465786

BLOCK YE Q=  4053.8035
   1   1    7.2967433e-05
   2   2    0.015087351
   3   3    0.25374442

BLOCK AU Q=  4053.8035
   1   1    0
   2   2    0
   3   3   -5872.6859

BLOCK AD Q=  4053.8035
   1   1    0
   2   2    0
   3   3   -1795.5935

BLOCK AE Q=  4053.8035
   1   1    0
   2   2    0
   3   3    657.70634

BLOCK MSOFT Q=  4053.8035
   1   -1928.7712
   2   -445.91248
   3    4000
   21    3834270.1
   22    117605.71
   31    1853.0194
   32    1853.0194
   33    1633.3656
   34    983.95897
   35    983.95897
   36    1583.637
   41    4000
   42    4000
   43    4000
   44    4000
   45    4000
   46    4000
   47    4000
   48    4000
   49    4000

BLOCK MASS
   6    173.2
   23    91.1876
   24    80.429995
   15    1.777
   25    126.09108
   35    1999.6047
   36    2000
   37    2001.5178
   1000001    4155.3519
   2000001    4143.9551
   1000002    4154.586
   2000002    4143.9062
   1000003    4155.3499
   2000003    4143.9509
   1000004    4154.5837
   2000004    4143.9053
   1000005    4086.4293
   2000005    4134.1482
   1000006    3951.5899
   2000006    4158.661
   1000011    1858.3488
   2000011    1012.3542
   1000012    1856.2741
   1000013    1858.3389
   2000013    1012.3216
   1000014    1856.2631
   1000015    1594.6741
   2000015    1636.4228
   1000016    1632.776
   1000021    4248.9404
   1000022   -431.71462
   1000023    508.91916
   1000025   -552.74434
   1000035   -1894.6943
   1000024    432.8413
   1000037    554.63145
   1000039    1e-09

BLOCK ALPHA
      -0.038941373

BLOCK HMIX Q=  4053.8035
   1   -500.71312
   2    24.797723
   3    242.91761
   4    4000000

BLOCK STOPMIX
   1   1    0.59353284
   1   2    0.80480977
   2   1   -0.80480977
   2   2    0.59353284

BLOCK SBOTMIX
   1   1   -0.99834953
   1   2    0.057430035
   2   1   -0.057430035
   2   2   -0.99834953

BLOCK STAUMIX
   1   1   -0.17700208
   1   2    0.98421048
   2   1   -0.98421048
   2   2   -0.17700208

BLOCK NMIX
   1   1   -0.012734982
   1   2    0.79079091
   1   3    0.46404474
   1   4   -0.39893614
   2   1    0.012504427
   2   2   -0.055368887
   2   3    0.70362232
   2   4    0.7083033
   3   1   -0.019860596
   3   2   -0.60957545
   3   3    0.53806809
   3   4   -0.58181274
   4   1    0.99964345
   4   2   -0.0013439471
   4   3    0.007800342
   4   4   -0.025501612

BLOCK UMIX
   1   1   -0.76616851
   1   2   -0.64263973
   2   1   -0.64263973
   2   2    0.76616851

BLOCK VMIX
   1   1    0.83239456
   1   2    0.55418345
   2   1    0.55418345
   2   2   -0.83239456

BLOCK HIGGSBOUNDSINPUTHIGGSCOUPLINGSFERMIONS
       0, 614.92706,3,36,15,15

BLOCK HIGGSBOUNDSINPUTHIGGSCOUPLINGSBOSONS
       0,4,36,21,21,23

BLOCK SPHENOLOWENERGY
   1    0.00033902011
   2    1.5882989e-06
   3    3.5253137e-05
   4    2.1196745e-15
   5    9.0550339e-11
   6    1.8970622e-08
   7    7.1833056e-14
   8    3.0687142e-09
   9    6.5139913e-07
   10    9.5750664e-05
   11    0.9890677
   12    0.5419555
   13    19.35836
   14    0
   15    0
   16    0.0021572481
   17    2.2816587e-15
   18    2.4802452e-11
   19    8.2906047e-11
   20    2.5937915e-15
   21    1.108932e-10
   22    3.5064133e-08
   23    0
   24    0
   25    0
   26    0
   27    0
   28    0
   29    0
   30    0
   31    0
   39    5.6735149e-05
   40    0
   41    0
   42    0

BLOCK FWCOEF Q=  160
   305   4422   0   0   -0.18881911
   305   4422   0   2   -0.20883426
   305   4322   0   2   -0.0003993027
   305   6421   0   0   -0.095227835
   305   6421   0   2   -0.11466902
   305   6321   0   2   -0.00038686042
   3051111   4133   0   0    1.6269876
   3051111   4133   0   2    1.6271151
   3051111   4233   0   2    0.00013290742
   3051111   4137   0   0   -4.4496797
   3051111   4137   0   2   -4.4480281
   3051111   4237   0   2   -0.00098330796
   3051313   4133   0   0    1.6269876
   3051313   4133   0   2    1.6271147
   3051313   4233   0   2    0.00013290711
   3051313   4137   0   0   -4.4496797
   3051313   4137   0   2   -4.4480286
   3051313   4237   0   2   -0.00098330796
   3051212   4137   0   0    1.5053501
   3051212   4137   0   2    1.5050084
   3051212   4237   0   2    0.00021261392
   3051414   4137   0   0    1.5053501
   3051414   4137   0   2    1.5050084
   3051414   4237   0   2    0.00021261397
   3051616   4137   0   0    1.5053501
   3051616   4137   0   2    1.5050086
   3051616   4237   0   2    0.00021262766

BLOCK IMFWCOEF Q=  160
   305   4422   0   0    3.8580708e-07
   305   4422   0   2    5.1801052e-06
   305   4322   0   2   -2.5911776e-06
   305   6421   0   0    3.3046928e-07
   305   6421   0   2    7.8077441e-06
   305   6321   0   2   -1.1973376e-06
   3051111   4133   0   2   -8.7351091e-07
   3051111   4233   0   2    2.9556915e-06
   3051111   4137   0   2    8.820415e-06
   3051111   4237   0   2   -2.186923e-05
   3051313   4133   0   2   -8.7351862e-07
   3051313   4233   0   2    2.95569e-06
   3051313   4137   0   2    8.8204267e-06
   3051313   4237   0   2   -2.1869233e-05
   3051212   4137   0   2   -1.6296821e-06
   3051212   4237   0   2    4.7286333e-06
   3051414   4137   0   2   -1.6296818e-06
   3051414   4237   0   2    4.7286333e-06
   3051616   4137   0   2   -1.6259762e-06
   3051616   4237   0   2    4.7286332e-06

DECAY 23  2.4952


DECAY 24  2.085


DECAY 2000011  0.0019861387
    0.4976807   2    1000025    11
    0.27803235   2    1000022    11
    0.22364305   2    1000023    11
    0.0006134872   2    1000039    11

DECAY 1000011  21.325607
    0.40277258   2   -1000024    12
    0.26288125   2   -1000037    12
    0.21098847   2    1000022    11
    0.12257851   2    1000025    11
    0.00077799188   2    1000023    11

DECAY 2000013  0.0071502553
    0.23933278   2    1000023    13
    0.22970388   2    1000025    13
    0.18432436   2   -1000037    14
    0.17681746   2   -1000024    14
    0.16965114   2    1000022    13
    0.00017038192   2    1000039    13

DECAY 1000013  21.332883
    0.40263259   2   -1000024    14
    0.26278966   2   -1000037    14
    0.21099139   2    1000022    13
    0.12263044   2    1000025    13
    0.00094480055   2    1000023    13

DECAY 1000015  3.9209433
    0.436368   2   -1000024    16
    0.23321153   2    1000022    15
    0.19660893   2    1000023    15
    0.083658143   2   -1000037    16
    0.050150388   2    1000025    15

DECAY 2000015  19.078899
    0.32985683   2   -1000024    16
    0.27693788   2   -1000037    16
    0.19239008   2    1000022    15
    0.15321723   2    1000025    15
    0.047597097   2    1000023    15

DECAY 1000012  21.399059
    0.47312943   2    1000024    11
    0.2173277   2    1000022    12
    0.19451954   2    1000037    11
    0.11376482   2    1000025    12
    0.0012573298   2    1000023    12

DECAY 1000014  21.406092
    0.47311506   2    1000024    13
    0.2172547   2    1000022    14
    0.19464566   2    1000037    13
    0.11372649   2    1000025    14
    0.0012569067   2    1000023    14

DECAY 1000016  19.76885
    0.47306355   2    1000024    15
    0.22349201   2    1000037    15
    0.20006086   2    1000022    16
    0.10224174   2    1000025    16
    0.0011409036   2    1000023    16

DECAY 2000001  1.4493532
    0.99791169   2    1000035    1
    0.00096617009   2    1000039    1
    0.00061020605   2    1000025    1
    0.00025538724   2    1000022    1
    0.00024689535   2    1000023    1

DECAY 1000001  53.750517
    0.39086876   2   -1000024    2
    0.27113138   2   -1000037    2
    0.20941735   2    1000022    1
    0.12059319   2    1000025    1
    0.006867619   2    1000035    1
    0.0010952941   2    1000023    1

DECAY 2000003  1.4594192
    0.99102685   2    1000035    3
    0.0020186023   2   -1000037    4
    0.0019527392   2    1000023    3
    0.0015990893   2    1000025    3
    0.001440487   2   -1000024    4
    0.0010027344   2    1000022    3
    0.00095950127   2    1000039    3

DECAY 1000003  53.756994
    0.39082951   2   -1000024    4
    0.2711176   2   -1000037    4
    0.20941246   2    1000022    3
    0.12060559   2    1000025    3
    0.0068667878   2    1000035    3
    0.0011416484   2    1000023    3

DECAY 1000005  148.93379
    0.46354011   2   -1000037    6
    0.31047561   2   -1000024    6
    0.09822328   2    1000022    5
    0.064984007   2    1000025    5
    0.044905752   2    1000023    5
    0.015472618   2    1000006   -24
    0.0023898566   2    1000035    5

DECAY 2000005  29.262262
    0.32272228   2   -1000037    6
    0.23473405   2    1000023    5
    0.15679575   2   -1000024    6
    0.15525102   2    1000025    5
    0.080319196   2    1000022    5
    0.049240835   2    1000035    5
    0.00088958463   2    1000006   -24

DECAY 2000002  5.7929594
    0.99865461   2    1000035    2
    0.00060788719   2    1000025    2
    0.00025348337   2    1000022    2
    0.00024230335   2    1000023    2
    0.00024171395   2    1000039    2

DECAY 1000002  53.797251
    0.46087157   2    1000024    1
    0.20680917   2    1000022    2
    0.20141359   2    1000037    1
    0.12329293   2    1000025    2
    0.0066550138   2    1000035    2
    0.00093135969   2    1000023    2

DECAY 2000004  5.7958571
    0.99815438   2    1000035    4
    0.0006920298   2    1000025    4
    0.00036799786   2    1000023    4
    0.00029361699   2    1000022    4
    0.00024159276   2    1000039    4
    0.00017272457   2    1000037    3

DECAY 1000004  53.803717
    0.46085489   2    1000024    3
    0.20678863   2    1000022    4
    0.20144411   2    1000037    3
    0.12328693   2    1000025    4
    0.0066542222   2    1000035    4
    0.00094485299   2    1000023    4

DECAY 1000006  156.07707
    0.40751748   2    1000037    5
    0.25575412   2    1000025    6
    0.23787889   2    1000023    6
    0.032615473   2    1000022    6
    0.024592831   2    1000035    6
    0.019801789   2    1000024    5
    0.01167952   3    1000022    24    5
    0.010107401   2    1000022    4

DECAY 2000006  162.63724
    0.3249591   2    1000024    5
    0.26624992   2    1000023    6
    0.19875941   2    1000022    6
    0.119479   2    1000025    6
    0.052522612   2    1000037    5
    0.022744445   2    1000006    23
    0.011763757   2    1000035    6
    0.0035130479   2    1000006    25

DECAY 1000024  2.1696478e-08
    0.99948095   2    1000039    24
    0.00031391892   3    1000022   -1    2
    0.00010478269   3    1000022   -11    12
    0.00010034689   3    1000022   -13    14

DECAY 1000037  1.2844
    0.81782272   2    1000022    24
    0.18202077   2    1000024    23

DECAY 1000022  1.1447679e-08
    0.727857   2    1000039    23
    0.1960477   2    1000039    22
    0.076095303   2    1000039    25

DECAY 1000023  0.014331892
    0.12201085   3    1000022    12   -12
    0.091216644   3    1000022    1   -1
    0.091215722   3    1000022    3   -3
    0.089306591   3    1000022    5   -5
    0.071145617   3    1000022    2   -2
    0.070975548   3    1000022    4   -4
    0.065256936   3    1000024    1   -2
    0.065256936   3   -1000024   -1    2
    0.065214779   3    1000024    3   -4
    0.065214779   3   -1000024   -3    4
    0.021753869   3    1000024    11   -12
    0.021753869   3   -1000024   -11    12
    0.021753807   3    1000024    13   -14
    0.021753807   3   -1000024   -13    14
    0.021708562   3    1000024    15   -16
    0.021708562   3   -1000024   -15    16
    0.020582619   3    1000022    11   -11
    0.020582384   3    1000022    13   -13
    0.020491587   3    1000022    15   -15
    0.011095403   2    1000022    22

DECAY 1000025  2.3477684
    0.49959653   2    1000024   -24
    0.49959653   2   -1000024    24
    0.00062180498   2    1000022    23

DECAY 1000035  16.69222
    0.1454897   2    2000013   -13
    0.1454897   2   -2000013    13
    0.14548219   2    2000011   -11
    0.14548219   2   -2000011    11
    0.06168426   2    1000023    23
    0.058215995   2    1000037   -24
    0.058215995   2   -1000037    24
    0.048653411   2    1000023    25
    0.04317789   2    1000025    25
    0.023675374   2    1000015   -15
    0.023675374   2   -1000015    15
    0.020113796   2    1000024   -24
    0.020113796   2   -1000024    24
    0.014526243   2    1000022    25
    0.012075898   2    1000025    23
    0.0050919068   2    1000022    23
    0.0049963192   2    2000015   -15
    0.0049963192   2   -2000015    15
    0.0047425823   2    1000016   -16
    0.0047425823   2   -1000016    16
    0.0019677221   3    1000037    5   -6
    0.0019677221   3   -1000037   -5    6
    0.0015136894   3    1000023    6   -6
    0.0011872458   3    1000025    6   -6
    0.00067000333   3    1000024    5   -6
    0.00067000333   3   -1000024   -5    6
    0.00045297345   3    1000022    6   -6
    0.00011545447   2    1000014   -14
    0.00011545447   2   -1000014    14
    0.00011538847   2    1000012   -12
    0.00011538847   2   -1000012    12
    0.00010239659   2    1000013   -13
    0.00010239659   2   -1000013    13
    0.00010234233   2    1000011   -11
    0.00010234233   2   -1000011    11

DECAY 1000021  5.6075111
    0.072429918   2    1000006   -6
    0.072429918   2   -1000006    6
    0.06378352   3    1000023    6   -6
    0.063303981   2    1000005   -5
    0.063303981   2   -1000005    5
    0.047454348   3    1000022    6   -6
    0.033342882   3    1000024    5   -6
    0.033342882   3   -1000024   -5    6
    0.031707363   2    2000005   -5
    0.031707363   2   -2000005    5
    0.030568328   2    1000006   -4
    0.030568328   2   -1000006    4
    0.026738053   2    2000002   -2
    0.026738053   2   -2000002    2
    0.026736579   2    2000004   -4
    0.026736579   2   -2000004    4
    0.026715593   2    2000003   -3
    0.026715593   2   -2000003    3
    0.026713478   2    2000001   -1
    0.026713478   2   -2000001    1
    0.026627158   3    1000025    6   -6
    0.02163204   2    1000002   -2
    0.02163204   2   -1000002    2
    0.021631167   2    1000004   -4
    0.021631167   2   -1000004    4
    0.02128703   2    1000003   -3
    0.02128703   2   -1000003    3
    0.021286141   2    1000001   -1
    0.021286141   2   -1000001    1
    0.0053307615   3    1000037    5   -6
    0.0053307615   3   -1000037   -5    6
    0.0017048057   3    1000035    6   -6
    0.00067590506   2    1000023    21
    0.0004587339   2    1000025    21
    0.00028299951   2    1000039    21
    0.0001646143   2    1000022    21

DECAY 25  0.0040448025
    0.55691559   2   -5    5
    0.24552882   2   -24    24
    0.071347199   2    21    21
    0.064201421   2   -15    15
    0.030363419   2    23    23
    0.027291464   2   -4    4
    0.0023353036   2    22    22
    0.0015841728   2    22    23
    0.00022265694   2   -13    13
    0.00020923068   2   -3    3
    5.7850123e-07   2   -1    1
    1.4063585e-07   2   -2    2
    5.0055621e-09   2   -11    11

DECAY 35  38.886082
    0.42459837   2   -5    5
    0.10943986   2   -1000024    1000037
    0.10943986   2   -1000037    1000024
    0.078064192   2   -1000024    1000024
    0.074066055   2   -15    15
    0.064308415   2    1000022    1000023
    0.037773088   2    1000022    1000022
    0.035345195   2   -1000037    1000037
    0.032821959   2    1000023    1000025
    0.021743269   2    1000025    1000025
    0.0081821183   2    1000022    1000025
    0.0031688261   2   -6    6
    0.00059289892   2    1000023    1000023
    0.00025628728   2   -13    13
    0.00016672048   2   -3    3
    2.1369221e-05   2    25    25
    5.7753825e-06   2    21    21
    3.0790102e-06   2    23    23
    1.6327932e-06   2   -24    24
    4.6095416e-07   2   -1    1
    3.0243802e-07   2    22    23
    1.033118e-07   2    22    22
    5.7899521e-08   2   -1000011    1000011
    5.7644445e-08   2   -1000013    1000013
    4.3625972e-08   2   -4    4
    5.7567826e-09   2   -11    11
    2.2491382e-13   2   -2    2

DECAY 36  38.144297
    0.41632278   2   -5    5
    0.10810434   2   -1000024    1000024
    0.084167977   2   -1000024    1000037
    0.084167977   2   -1000037    1000024
    0.072623449   2   -15    15
    0.062327478   2   -1000037    1000037
    0.052716811   2    1000022    1000022
    0.043835446   2    1000022    1000023
    0.03689499   2    1000025    1000025
    0.021446012   2    1000023    1000025
    0.013098013   2    1000022    1000025
    0.0031608398   2   -6    6
    0.00069330446   2    1000023    1000023
    0.00025129513   2   -13    13
    0.00016346874   2   -3    3
    2.0466936e-05   2    21    21
    4.2354857e-06   2    23    25
    4.5196355e-07   2   -1    1
    3.9983677e-07   2    22    23
    2.123494e-07   2    22    22
    4.2126631e-08   2   -4    4
    5.6446574e-09   2   -11    11
    2.172125e-13   2   -2    2
    4.6461702e-35   2    25    25

DECAY 37  37.364636
    0.41118733   2   -5    6
    0.17965229   2    1000022    1000037
    0.1659545   2    1000024    1000025
    0.12287495   2    1000023    1000024
    0.071489048   2   -15    16
    0.047747294   2    1000023    1000037
    0.00060719277   2   -5    4
    0.00025273953   2   -13    14
    0.00015286593   2   -3    4
    6.0124278e-05   2    1000025    1000037
    7.123798e-06   2   -3    2
    4.8937345e-06   2   -3    6
    4.3399403e-06   2    24    25
    4.3359846e-06   2   -5    2
    4.2408682e-07   2   -1    2
    3.0492526e-07   2    1000022    1000024
    2.1420716e-07   2   -1    6
    2.1684989e-08   2   -1    4
    5.9116038e-09   2   -11    12
    9.3308838e-13   2    24    35
    2.9338611e-13   2    24    36

DECAY 6  2.43
    1   2    5    24

DECAY 15 -1


DECAY 1000039 -1
