BLOCK SPINFO
   1   SPheno
   2   v4.0.5be

BLOCK SPHENOINFO
   1   2
   2   2

BLOCK MODSEL
   1   0

BLOCK MINPAR
   3    44.97676
   4   -1

BLOCK EXTPAR
   0    1686.7967
   1   -167.61418
   2    1435.0752
   3    3000
   11    2755.8241
   12   -1378.9654
   13    1645.63
   23   -877.15623
   25    45.761273
   26    1415.5004
   31    629.7379
   32    629.7379
   33    1555.9532
   34    1520.1944
   35    1520.1944
   36    559.7517
   41    5000
   42    5000
   43    1579.8506
   44    5000
   45    5000
   46    1829.1331
   47    5000
   48    5000
   49    978.313

BLOCK SMINPUTS
   1    127.90897
   2    1.1663787e-05
   3    0.1184
   4    91.1876
   5    4.18
   6    173.2
   7    1.777
   8    0
   11    0.00051099893
   12    0
   13    0.10565837
   14    0
   21    0.005
   22    0.0025
   23    0.095
   24    1.27

BLOCK GAUGE Q=  1686.7967
   1    0.35536298
   2    0.66519887
   3    1.219778

BLOCK YU Q=  1686.7967
   1   1    8.3863738e-06
   2   2    0.0042602779
   3   3    1.0131413

BLOCK YD Q=  1686.7967
   1   1    0.00077117432
   2   2    0.014652312
   3   3    0.76476328

BLOCK YE Q=  1686.7967
   1   1    0.00013457556
   2   2    0.027825957
   3   3    0.46798683

BLOCK AU Q=  1686.7967
   1   1    0
   2   2    0
   3   3    2755.8241

BLOCK AD Q=  1686.7967
   1   1    0
   2   2    0
   3   3   -1378.9653

BLOCK AE Q=  1686.7967
   1   1    0
   2   2    0
   3   3    1645.63

BLOCK MSOFT Q=  1686.7967
   1   -167.61418
   2    1435.0752
   3    3000
   21    1406235.5
   22   -710295.32
   31    629.7379
   32    629.7379
   33    1555.9532
   34    1520.1944
   35    1520.1944
   36    559.7517
   41    5000
   42    5000
   43    1579.8506
   44    5000
   45    5000
   46    1829.1331
   47    5000
   48    5000
   49    978.313

BLOCK MASS
   6    173.2
   23    91.1876
   24    80.429995
   15    1.777
   25    122.4731
   35    1414.7129
   36    1415.5004
   37    1419.6098
   1000001    5034.7698
   2000001    5025.7253
   1000002    5034.3157
   2000002    5027.0292
   1000003    5034.777
   2000003    5025.7279
   1000004    5034.3193
   2000004    5027.0298
   1000005    949.64515
   2000005    1587.3542
   1000006    1533.1635
   2000006    1855.825
   1000011    652.13571
   2000011    1522.6505
   1000012    646.90422
   1000013    652.11613
   2000013    1522.6286
   1000014    646.89601
   1000015    551.31727
   2000015    1563.406
   1000016    1560.2161
   1000021    3201.749
   1000022   -166.48447
   1000023    870.98307
   1000025   -877.31199
   1000035    1477.8673
   1000024    871.49278
   1000037    1478.015

BLOCK ALPHA
      -0.022390951

BLOCK HMIX Q=  1686.7967
   1   -877.15623
   2    45.761273
   3    243.88003
   4    2003641.4

BLOCK STOPMIX
   1   1   -0.92161401
   1   2    0.38810774
   2   1   -0.38810774
   2   2   -0.92161401

BLOCK SBOTMIX
   1   1   -0.089153492
   1   2    0.9960179
   2   1   -0.9960179
   2   2   -0.089153492

BLOCK STAUMIX
   1   1   -0.032660843
   1   2    0.99946649
   2   1   -0.99946649
   2   2   -0.032660843

BLOCK NMIX
   1   1   -0.99853643
   1   2   -0.0006414612
   1   3    0.052878611
   1   4   -0.011332788
   2   1    0.029331637
   2   2    0.090649498
   2   3    0.70549603
   2   4    0.70228034
   3   1   -0.045384975
   3   2    0.02438744
   3   3   -0.70517863
   3   4    0.70715526
   4   1    0.0022023226
   4   2   -0.995584
   4   3    0.046928677
   4   4    0.081273238

BLOCK UMIX
   1   1   -0.066472404
   1   2   -0.99778826
   2   1    0.99778826
   2   2   -0.066472404

BLOCK VMIX
   1   1   -0.11515674
   1   2    0.99334733
   2   1    0.99334733
   2   2    0.11515674

BLOCK HIGGSBOUNDSINPUTHIGGSCOUPLINGSFERMIONS
       0, 2094.0941,3,36,15,15

BLOCK HIGGSBOUNDSINPUTHIGGSCOUPLINGSBOSONS
       0,4,36,21,21,23

BLOCK SPHENOLOWENERGY
   1    0.00031782961
   2    1.5891837e-06
   3    3.5219044e-05
   4    4.3452438e-15
   5    1.8560068e-10
   6    3.7502347e-08
   7    1.5063564e-13
   8    6.4343345e-09
   9    1.316676e-06
   10    9.2680902e-05
   11    0.95735824
   12    0.54216585
   13    19.362371
   14    0
   15    0
   16    0.0021580025
   17    2.2816719e-15
   18    2.4781167e-11
   19    8.2857289e-11
   20   -7.2473239e-15
   21   -3.0981698e-10
   22   -8.101385e-08
   23    0
   24    0
   25    0
   26    0
   27    0
   28    0
   29    0
   30    0
   31    0
   39    9.0955287e-05
   40    0
   41    0
   42    0

BLOCK FWCOEF Q=  160
   305   4422   0   0   -0.18881911
   305   4422   0   2   -0.18227464
   305   4322   0   2   -0.00025507539
   305   6421   0   0   -0.095227835
   305   6421   0   2   -0.10654046
   305   6321   0   2   -0.00041695937
   3051111   4133   0   0    1.5966953
   3051111   4133   0   2    1.5975522
   3051111   4233   0   2    0.00017077118
   3051111   4137   0   0   -4.4193874
   3051111   4137   0   2   -4.4144601
   3051111   4237   0   2   -0.0013169768
   3051313   4133   0   0    1.5966953
   3051313   4133   0   2    1.5975466
   3051313   4233   0   2    0.00017076241
   3051313   4137   0   0   -4.4193874
   3051313   4137   0   2   -4.4144657
   3051313   4237   0   2   -0.0013169747
   3051212   4137   0   0    1.5053501
   3051212   4137   0   2    1.5042833
   3051212   4237   0   2    0.00028669867
   3051414   4137   0   0    1.5053501
   3051414   4137   0   2    1.5042833
   3051414   4237   0   2    0.00028670026
   3051616   4137   0   0    1.5053501
   3051616   4137   0   2    1.5042839
   3051616   4237   0   2    0.00028715179

BLOCK IMFWCOEF Q=  160
   305   4422   0   0    3.8588749e-07
   305   4422   0   2   -2.434063e-05
   305   4322   0   2    2.5800922e-06
   305   6421   0   0    3.3053815e-07
   305   6421   0   2    4.93482e-06
   305   6321   0   2    1.2731543e-06
   3051111   4133   0   2   -5.811559e-07
   3051111   4233   0   2    5.9681233e-06
   3051111   4137   0   2    4.8370515e-06
   3051111   4237   0   2   -4.6109101e-05
   3051313   4133   0   2   -5.811278e-07
   3051313   4233   0   2    5.9680987e-06
   3051313   4137   0   2    4.8370825e-06
   3051313   4237   0   2   -4.6109195e-05
   3051212   4137   0   2   -9.4716324e-07
   3051212   4237   0   2    1.0037941e-05
   3051414   4137   0   2   -9.4716419e-07
   3051414   4237   0   2    1.0037941e-05
   3051616   4137   0   2   -9.4080804e-07
   3051616   4237   0   2    1.0037973e-05

DECAY 23  2.4952


DECAY 24  2.085


DECAY 1000011  0.71551071
    0.99999999   2    1000022    11

DECAY 2000011  7.4570934
    0.99865729   2    1000022    11
    0.00094308315   2    1000025    11
    0.00039956937   2    1000023    11

DECAY 1000013  0.715507
    0.99999999   2    1000022    13

DECAY 2000013  7.4812291
    0.9954291   2    1000022    13
    0.0016354878   2    1000025    13
    0.0014111974   2   -1000024    14
    0.0011044309   2    1000023    13
    0.00041969504   2    1000013    25

DECAY 1000015  2.2889476
    1   2    1000022    15

DECAY 2000015  7.3321943
    0.26335659   2    1000022    15
    0.22351926   2    1000023    15
    0.21779936   2    1000025    15
    0.13700135   2    1000015    25
    0.12496063   2    1000015    23
    0.021139924   2   -1000037    16
    0.010534691   2    1000035    15
    0.001688205   2   -1000024    16

DECAY 1000012  0.70476647
    1   2    1000022    12

DECAY 1000014  0.70475499
    1   2    1000022    14

DECAY 1000016  7.2636322
    0.45317507   2    1000024    15
    0.26230798   2    1000022    16
    0.25139189   2    1000015    24
    0.019639028   2    1000037    15
    0.0099218133   2    1000035    16
    0.0025185954   2    1000023    16
    0.0010456262   2    1000025    16

DECAY 2000001  142.834
    0.98040166   2    1000021    1
    0.019543543   2    1000022    1

DECAY 1000001  197.23376
    0.71476373   2    1000021    1
    0.18682334   2   -1000037    2
    0.093076198   2    1000035    1
    0.0035191594   2    1000022    1
    0.00093431205   2   -1000024    2
    0.00077174454   2    1000023    1
    0.00011151045   2    1000025    1

DECAY 2000003  142.87454
    0.98012545   2    1000021    3
    0.019538427   2    1000022    3
    0.00014071627   2   -1000024    4
    0.00010824876   2    1000025    3

DECAY 1000003  197.25649
    0.71468515   2    1000021    3
    0.1868023   2   -1000037    4
    0.093065845   2    1000035    3
    0.0035190623   2    1000022    3
    0.00094274507   2   -1000024    4
    0.00082258281   2    1000023    3
    0.00016232334   2    1000025    3

DECAY 1000005  0.81425385
    0.68171494   2    1000022    5
    0.17348574   2    1000023    5
    0.14479932   2    1000025    5

DECAY 2000005  28.458016
    0.52225573   2   -1000024    6
    0.15681712   2    1000025    5
    0.15681132   2    1000023    5
    0.096571857   2    1000005    23
    0.055659284   2    1000005    25
    0.0075432682   2    1000022    5
    0.0043414228   2    1000035    5

DECAY 2000002  151.37001
    0.92601105   2    1000021    2
    0.073785016   2    1000022    2
    0.00014359921   2    1000025    2

DECAY 1000002  197.22532
    0.71455476   2    1000021    2
    0.18514895   2    1000037    1
    0.092922089   2    1000035    2
    0.0035701377   2    1000022    2
    0.002804183   2    1000024    1
    0.00097179558   2    1000023    2

DECAY 2000004  151.37342
    0.92599019   2    1000021    4
    0.073783353   2    1000022    4
    0.00014922699   2    1000025    4

DECAY 1000004  197.24756
    0.71447577   2    1000021    4
    0.18512864   2    1000037    3
    0.092911761   2    1000035    4
    0.0035697383   2    1000022    4
    0.0029057259   2    1000024    3
    0.00097595094   2    1000023    4

DECAY 1000006  27.644718
    0.30069482   2    1000024    5
    0.26901948   2    1000025    6
    0.26281804   2    1000023    6
    0.1360122   2    1000005    24
    0.02573019   2    1000022    6
    0.002694232   2    1000022    4
    0.0023358325   2    1000037    5
    0.00036525234   2    1000023    4
    0.00032994211   3    1000022    24    5

DECAY 2000006  73.897468
    0.30525816   2    1000024    5
    0.14754346   2    2000005    24
    0.14272533   2    1000023    6
    0.14063144   2    1000025    6
    0.10623167   2    1000006    23
    0.081564809   2    1000006    25
    0.045707334   2    1000022    6
    0.0279692   2    1000005    24
    0.001503984   2    1000037    5
    0.00086461564   2    1000035    6

DECAY 1000024  1.3077862
    0.52264434   2   -1000015    16
    0.44944892   2    1000022    24
    0.008869129   2    1000014   -13
    0.0078415339   2    1000012   -11
    0.0061639885   3    1000022   -5    6
    0.0025100686   2   -1000013    14
    0.0025096851   2   -1000011    12

DECAY 1000037  27.430671
    0.15313463   2   -1000013    14
    0.15313018   2   -1000011    12
    0.15294814   2    1000014   -13
    0.15294495   2    1000012   -11
    0.098158389   2    1000025    24
    0.095093188   2    1000023    24
    0.094511836   2    1000024    23
    0.094451303   2    1000024    25
    0.0017378957   3    1000025   -5    6
    0.0016361171   3    1000023   -5    6
    0.0010707696   3    1000024    6   -6
    0.00075950448   2    1000022    24
    0.0001954728   3    1000024    5   -5

DECAY 1000022 -1


DECAY 1000023  1.4675027
    0.28431511   2    1000022    23
    0.23327951   2    1000015   -15
    0.23327951   2   -1000015    15
    0.22903109   2    1000022    25
    0.0032891465   2    1000013   -13
    0.0032891465   2   -1000013    13
    0.0028506187   2    1000011   -11
    0.0028506187   2   -1000011    11
    0.0014762609   2    1000014   -14
    0.0014762609   2   -1000014    14
    0.0014761687   2    1000012   -12
    0.0014761687   2   -1000012    12
    0.0014462916   3    1000022    6   -6
    0.00045381072   3    1000022    5   -5

DECAY 1000025  1.2591827
    0.29840437   2    1000022    25
    0.27656014   2    1000015   -15
    0.27656014   2   -1000015    15
    0.14183543   2    1000022    23
    0.0019961001   3    1000022    6   -6
    0.00075508974   2    1000014   -14
    0.00075508974   2   -1000014    14
    0.00075504406   2    1000012   -12
    0.00075504406   2   -1000012    12
    0.0005393934   3    1000022    5   -5
    0.00053435912   2    1000013   -13
    0.00053435912   2   -1000013    13

DECAY 1000035  29.952562
    0.089398821   2    1000025    25
    0.087761733   2    1000024   -24
    0.087761733   2   -1000024    24
    0.084254335   2    1000025    23
    0.080288683   2    1000023    25
    0.070503015   2    1000014   -14
    0.070503015   2   -1000014    14
    0.070502167   2    1000012   -12
    0.070502167   2   -1000012    12
    0.06963319   2    1000013   -13
    0.06963319   2   -1000013    13
    0.069630556   2    1000011   -11
    0.069630556   2   -1000011    11
    0.0060367696   2    1000023    23
    0.0011385267   3    1000024    5   -6
    0.0011385267   3   -1000024   -5    6
    0.00040954884   2    1000022    23
    0.00039936897   2    1000022    25
    0.00028549374   3    1000025    6   -6
    0.00027422628   3    1000023    6   -6

DECAY 1000021  251.89501
    0.15655454   2    1000005   -5
    0.15655454   2   -1000005    5
    0.12263485   2    1000006   -6
    0.12263485   2   -1000006    6
    0.10694007   2    2000005   -5
    0.10694007   2   -2000005    5
    0.072990304   2    2000006   -6
    0.072990304   2   -2000006    6
    0.039655716   2    1000006   -4
    0.039655716   2   -1000006    4
    0.00071638642   3    1000024    5   -6
    0.00071638642   3   -1000024   -5    6
    0.00030292657   3    1000037    5   -6
    0.00030292657   3   -1000037   -5    6
    0.0002952734   3    1000035    6   -6

DECAY 25  0.0036293715
    0.61702683   2   -5    5
    0.18595249   2   -24    24
    0.072069713   2    21    21
    0.069755004   2   -15    15
    0.029762404   2   -4    4
    0.021393665   2    23    23
    0.0023015836   2    22    22
    0.0012667674   2    22    23
    0.00024170652   2   -13    13
    0.00022904972   2   -3    3
    6.33297e-07   2   -1    1
    1.5338063e-07   2   -2    2
    5.43386e-09   2   -11    11

DECAY 35  89.034403
    0.93711798   2   -5    5
    0.05520261   2   -15    15
    0.0043535363   2    1000022    1000023
    0.0022840098   2    1000022    1000025
    0.00048043611   2   -6    6
    0.00016605769   2   -13    13
    0.00015664613   2   -3    3
    0.00012097204   2   -1000015    1000015
    8.7711735e-05   2    1000022    1000022
    2.8397362e-05   2    21    21
    4.3302802e-07   2   -1    1
    4.1033276e-07   2    25    25
    1.9514059e-07   2    23    23
    1.6912349e-07   2   -24    24
    4.7840367e-08   2   -1000011    1000011
    4.7187971e-08   2   -1000013    1000013
    7.4720084e-09   2    22    22
    7.2440613e-09   2    22    23
    5.9105053e-09   2   -4    4
    3.7304316e-09   2   -11    11
    3.0480607e-14   2   -2    2

DECAY 36  82.245941
    0.93666929   2   -5    5
    0.055176069   2   -15    15
    0.0044717178   2    1000022    1000025
    0.0026503432   2    1000022    1000023
    0.00055452964   2   -6    6
    0.00016598117   2   -13    13
    0.00015655943   2   -3    3
    0.00010254402   2    1000022    1000022
    5.2122816e-05   2    21    21
    4.327887e-07   2   -1    1
    2.8283154e-07   2    23    25
    5.7341818e-08   2    22    22
    5.6993326e-08   2    22    23
    6.4459679e-09   2   -4    4
    3.7287082e-09   2   -11    11
    3.3256418e-14   2   -2    2
    8.2709502e-37   2    25    25

DECAY 37  85.857142
    0.92417929   2   -5    6
    0.066890283   2   -15    16
    0.0071348922   2    1000022    1000024
    0.0013899053   2   -5    4
    0.0002364816   2   -13    14
    0.00015039869   2   -3    4
    9.925371e-06   2   -5    2
    6.9802249e-06   2   -3    2
    7.0353321e-07   2   -3    6
    4.1717253e-07   2   -1    2
    2.7413378e-07   2    24    25
    1.9859689e-07   2   -1000011    1000012
    1.9762773e-07   2   -1000013    1000014
    2.2380488e-08   2   -1    6
    1.9514733e-08   2   -1    4
    5.5313293e-09   2   -11    12
    4.4530718e-11   2    24    35
    1.8537365e-11   2    24    36

DECAY 6  2.43
    1   2    5    24

DECAY 15 -1
