BLOCK SPINFO
   1   SPheno
   2   v4.0.5be

BLOCK SPHENOINFO
   1   2
   2   2

BLOCK MODSEL
   1   0

BLOCK MINPAR
   3    25.109374
   4   -1

BLOCK EXTPAR
   0    3274.1483
   1    1576.4767
   2   -4545.9932
   3    2465.8452
   11   -4968.2982
   12    4135.0743
   13   -7210.2581
   23   -587.22828
   25    24.127079
   26    2704.7672
   31    607.6313
   32    607.6313
   33    4694.4341
   34    3988.201
   35    3988.201
   36    2518.0511
   41    2275.5359
   42    2275.5359
   43    4849.427
   44    3147.7991
   45    3147.7991
   46    2104.4101
   47    4300.1289
   48    4300.1289
   49    4560.292

BLOCK SMINPUTS
   1    127.90897
   2    1.1663787e-05
   3    0.1184
   4    91.1876
   5    4.18
   6    173.2
   7    1.777
   8    0
   11    0.00051099893
   12    0
   13    0.10565837
   14    0
   21    0.005
   22    0.0025
   23    0.095
   24    1.27

BLOCK GAUGE Q=  3274.1483
   1    0.35536298
   2    0.66519887
   3    1.219778

BLOCK YU Q=  3274.1483
   1   1    8.3915707e-06
   2   2    0.0042629179
   3   3    1.0137691

BLOCK YD Q=  3274.1483
   1   1    0.00040684431
   2   2    0.007730042
   3   3    0.40346207

BLOCK YE Q=  3274.1483
   1   1    7.0997308e-05
   2   2    0.014679992
   3   3    0.24689331

BLOCK AU Q=  3274.1483
   1   1    0
   2   2    0
   3   3   -4968.3041

BLOCK AD Q=  3274.1483
   1   1    0
   2   2    0
   3   3    4135.0763

BLOCK AE Q=  3274.1483
   1   1    0
   2   2    0
   3   3   -7210.2547

BLOCK MSOFT Q=  3274.1483
   1    1576.4767
   2   -4545.9932
   3    2465.8452
   21    6853266.4
   22   -302362.37
   31    607.6313
   32    607.6313
   33    4694.4341
   34    3988.201
   35    3988.201
   36    2518.0511
   41    2275.5359
   42    2275.5359
   43    4849.427
   44    3147.7991
   45    3147.7991
   46    2104.4101
   47    4300.1289
   48    4300.1289
   49    4560.292

BLOCK MASS
   6    173.2
   23    91.1876
   24    80.429995
   15    1.777
   25    123.19539
   35    2704.7226
   36    2704.7672
   37    2706.1649
   1000001    2427.7231
   2000001    4364.8678
   1000002    2426.4604
   2000002    3234.8587
   1000003    2427.7209
   2000003    4364.8648
   1000004    2426.4584
   2000004    3234.8581
   1000005    4616.9218
   2000005    4894.2586
   1000006    2188.436
   2000006    4898.497
   1000011    657.51788
   2000011    3993.2206
   1000012    652.46829
   1000013    657.49722
   2000013    3993.2073
   1000014    652.45594
   1000015    2521.8896
   2000015    4712.2292
   1000016    4711.151
   1000021    2719.649
   1000022    601.61307
   1000023   -601.991
   1000025    1562.6991
   1000035   -4508.4897
   1000024    602.25289
   1000037    4508.5621

BLOCK ALPHA
      -0.039937639

BLOCK HMIX Q=  3274.1483
   1   -587.22828
   2    24.127079
   3    243.15915
   4    7315765.9

BLOCK STOPMIX
   1   1    0.036745031
   1   2    0.99932467
   2   1   -0.99932467
   2   2    0.036745031

BLOCK SBOTMIX
   1   1   -0.01587293
   1   2    0.99987402
   2   1   -0.99987402
   2   2   -0.01587293

BLOCK STAUMIX
   1   1   -0.00079280225
   1   2    0.99999969
   2   1   -0.99999969
   2   2   -0.00079280225

BLOCK NMIX
   1   1    0.03183927
   1   2    0.010192469
   1   3   -0.70706151
   1   4   -0.70636138
   2   1    0.015304376
   2   2    0.014408506
   2   3    0.70704902
   2   4   -0.70685208
   3   1   -0.99937581
   3   2    0.00040392429
   3   3   -0.011698259
   3   4   -0.033331225
   4   1    0.00014138383
   4   2   -0.99984416
   4   3    0.0029765566
   4   4   -0.017400424

BLOCK UMIX
   1   1   -0.0042096584
   1   2   -0.99999114
   2   1   -0.99999114
   2   2    0.0042096584

BLOCK VMIX
   1   1    0.024607042
   1   2    0.9996972
   2   1    0.9996972
   2   2   -0.024607042

BLOCK HIGGSBOUNDSINPUTHIGGSCOUPLINGSFERMIONS
       0, 582.11595,3,36,15,15

BLOCK HIGGSBOUNDSINPUTHIGGSCOUPLINGSBOSONS
       0,4,36,21,21,23

BLOCK SPHENOLOWENERGY
   1    0.00033815008
   2    1.5883405e-06
   3    3.5250153e-05
   4    2.2097985e-15
   5    9.4400346e-11
   6    1.977425e-08
   7    7.4526538e-14
   8    3.1837802e-09
   9    6.7573014e-07
   10    9.6258154e-05
   11    0.99430988
   12    0.54256821
   13    19.383416
   14    0
   15    0
   16    0.0021599302
   17    2.2816856e-15
   18    2.4802295e-11
   19    8.2894487e-11
   20    5.7058929e-16
   21    2.4392932e-11
   22    6.3392802e-09
   23    0
   24    0
   25    0
   26    0
   27    0
   28    0
   29    0
   30    0
   31    0
   39    5.5963561e-05
   40    0
   41    0
   42    0

BLOCK FWCOEF Q=  160
   305   4422   0   0   -0.18881911
   305   4422   0   2   -0.20870341
   305   4322   0   2   -0.0006591827
   305   6421   0   0   -0.095227835
   305   6421   0   2   -0.11130896
   305   6321   0   2   -0.00049900321
   3051111   4133   0   0    1.6194949
   3051111   4133   0   2    1.6198853
   3051111   4233   0   2    7.0170123e-05
   3051111   4137   0   0   -4.4421871
   3051111   4137   0   2   -4.4402981
   3051111   4237   0   2   -0.0005247281
   3051313   4133   0   0    1.6194949
   3051313   4133   0   2    1.6198839
   3051313   4233   0   2    7.0170028e-05
   3051313   4137   0   0   -4.4421871
   3051313   4137   0   2   -4.4402995
   3051313   4237   0   2   -0.00052472818
   3051212   4137   0   0    1.5053501
   3051212   4137   0   2    1.5049407
   3051212   4237   0   2    0.00011364979
   3051414   4137   0   0    1.5053501
   3051414   4137   0   2    1.5049407
   3051414   4237   0   2    0.00011364981
   3051616   4137   0   0    1.5053501
   3051616   4137   0   2    1.504941
   3051616   4237   0   2    0.00011365395

BLOCK IMFWCOEF Q=  160
   305   4422   0   0    3.8580284e-07
   305   4422   0   2    1.3518348e-06
   305   4322   0   2   -9.1459471e-06
   305   6421   0   0    3.3046565e-07
   305   6421   0   2    9.2110138e-06
   305   6321   0   2   -5.4409272e-06
   3051111   4133   0   2   -2.578971e-06
   3051111   4233   0   2    1.5914928e-06
   3051111   4137   0   2    2.0545794e-05
   3051111   4237   0   2   -1.1902403e-05
   3051313   4133   0   2   -2.5789461e-06
   3051313   4233   0   2    1.5914923e-06
   3051313   4137   0   2    2.0545816e-05
   3051313   4237   0   2   -1.1902406e-05
   3051212   4137   0   2   -4.455448e-06
   3051212   4237   0   2    2.5779169e-06
   3051414   4137   0   2   -4.4554482e-06
   3051414   4237   0   2    2.5779169e-06
   3051616   4137   0   2   -4.4508664e-06
   3051616   4237   0   2    2.577917e-06

DECAY 23  2.4952


DECAY 24  2.085


DECAY 1000011  9.8064605e-05
    0.57890325   2    1000022    11
    0.39391707   2    1000023    11
    0.027125338   2   -1000024    12

DECAY 2000011  14.39545
    0.99833861   2    1000025    11
    0.001349555   2    1000022    11
    0.00031180603   2    1000023    11

DECAY 1000013  0.00017215483
    0.54543544   2    1000022    13
    0.43909306   2    1000023    13
    0.015440809   2   -1000024    14

DECAY 2000013  14.428247
    0.99606367   2    1000025    13
    0.0019130642   2    1000022    13
    0.0011331746   2   -1000024    14
    0.00087760374   2    1000023    13

DECAY 1000015  10.255838
    0.4682984   2    1000025    15
    0.26515451   2   -1000024    16
    0.13372085   2    1000022    15
    0.13282623   2    1000023    15

DECAY 2000015  10.692435
    0.43738849   2    1000025    15
    0.25992395   2    1000022    15
    0.25947996   2    1000023    15
    0.027749085   2   -1000037    16
    0.013877125   2    1000035    15
    0.00076566623   2    1000015    25
    0.00075817327   2    1000015    23

DECAY 1000012  8.164475e-05
    0.93308641   2    1000024    11
    0.036683511   2    1000022    12
    0.030230076   2    1000023    12

DECAY 1000014  0.00014257439
    0.9616994   2    1000024    13
    0.020997271   2    1000022    14
    0.017303327   2    1000023    14

DECAY 1000016  10.699024
    0.51893298   2    1000024    15
    0.43822408   2    1000025    16
    0.027435067   2    1000037    15
    0.013733385   2    1000035    16
    0.0015144912   2    1000015    24

DECAY 1000001  0.11842507
    0.98464966   2    1000025    1
    0.010878098   2    1000023    1
    0.0028165497   2   -1000024    2
    0.0016556907   2    1000022    1

DECAY 2000001  130.80094
    0.98583456   2    1000021    1
    0.014142851   2    1000025    1

DECAY 1000003  0.12173182
    0.95789982   2    1000025    3
    0.020993936   2    1000023    3
    0.012022698   2    1000022    3
    0.0090835443   2   -1000024    4

DECAY 2000003  130.81063
    0.98575925   2    1000021    3
    0.014141793   2    1000025    3

DECAY 1000005  186.2872
    0.83414317   2    1000021    5
    0.077384389   2   -1000024    6
    0.038802324   2    1000022    5
    0.038787135   2    1000023    5
    0.010826057   2    1000025    5

DECAY 2000005  353.73285
    0.52181945   2    1000021    5
    0.27346602   2   -1000024    6
    0.15565118   2    1000006   -24
    0.021728232   2    1000023    5
    0.021722066   2    1000022    5
    0.002556606   2   -1000037    6
    0.0015768874   2    1000025    5
    0.0013957027   2    1000035    5

DECAY 1000002  0.13184776
    0.87466935   2    1000025    2
    0.086435461   2    1000024    1
    0.020942734   2    1000023    2
    0.017952455   2    1000022    2

DECAY 2000002  26.194771
    0.83779857   2    1000021    2
    0.16188067   2    1000025    2
    0.00026056406   2    1000022    2

DECAY 1000004  0.13515214
    0.85327856   2    1000025    4
    0.10305958   2    1000024    3
    0.023291434   2    1000023    4
    0.020370423   2    1000022    4

DECAY 2000004  26.196804
    0.83772814   2    1000021    4
    0.16186803   2    1000025    4
    0.00028127903   2    1000022    4

DECAY 1000006  76.740496
    0.49664945   2    1000024    5
    0.24417716   2    1000023    6
    0.24390617   2    1000022    6
    0.015266584   2    1000025    6

DECAY 2000006  366.15868
    0.50056237   2    1000021    6
    0.13239512   2    1000023    6
    0.132129   2    1000022    6
    0.11067051   2    1000006    25
    0.075362628   2    1000006    23
    0.0427058   2    1000024    5
    0.0027391519   2    1000037    5
    0.0018606374   2    1000025    6
    0.0011797904   2    1000035    6
    0.00016543775   2    1000006    36
    0.00016221552   2    1000006    35

DECAY 1000024  2.1924867e-13
    0.85228938   2    1000022    211
    0.076672523   3    1000022   -11    12
    0.067178837   3    1000022   -13    14
    0.002648205   3    1000023   -11    12
    0.0012110509   3    1000023   -13    14

DECAY 1000037  252.21609
    0.11903499   2    1000004   -3
    0.11903482   2    1000002   -1
    0.11900388   2   -1000003    4
    0.11900374   2   -1000001    2
    0.075374054   2    1000014   -13
    0.075373932   2    1000012   -11
    0.075368341   2   -1000013    14
    0.075368135   2   -1000011    12
    0.040063259   2    1000024    25
    0.036501626   2    1000023    24
    0.036469698   2    1000024    23
    0.036455574   2    1000022    24
    0.016066487   2    37    1000023
    0.015048769   2    1000024    35
    0.01503155   2    1000024    36
    0.015017283   2    37    1000022
    0.0048759351   3    1000024    6   -6
    0.0029061585   3    1000022   -5    6
    0.0027768762   3    1000023   -5    6
    0.00075952631   2    1000006   -5
    0.00017325632   3    1000021   -3    4
    0.00010263604   3    1000021   -1    2

DECAY 1000022 -1


DECAY 1000023  1.2277995e-11
    0.9931789   2    1000022    22
    0.0062818776   2    1000022    111
    0.00044308828   3    1000022    12   -12

DECAY 1000025  9.9744602
    0.099747534   2    1000024   -24
    0.099747534   2   -1000024    24
    0.085730844   2    1000023    25
    0.082324762   2    1000023    23
    0.072776547   2    1000022    25
    0.067102189   2    1000014   -14
    0.067102189   2   -1000014    14
    0.067101117   2    1000012   -12
    0.067101117   2   -1000012    12
    0.066461944   2    1000013   -13
    0.066461944   2   -1000013    13
    0.066460131   2    1000011   -11
    0.066460131   2   -1000011    11
    0.018963434   2    1000022    23
    0.0021318317   3    1000024    5   -6
    0.0021318317   3   -1000024   -5    6
    0.0011558661   3    1000023    6   -6
    0.0010283578   3    1000022    6   -6

DECAY 1000035  254.8761
    0.058908212   2    1000004   -4
    0.058908212   2   -1000004    4
    0.058908119   2    1000002   -2
    0.058908119   2   -1000002    2
    0.058864133   2    1000003   -3
    0.058864133   2   -1000003    3
    0.058864047   2    1000001   -1
    0.058864047   2   -1000001    1
    0.037309658   2    1000014   -14
    0.037309658   2   -1000014    14
    0.037309597   2    1000012   -12
    0.037309597   2   -1000012    12
    0.037273636   2    1000013   -13
    0.037273636   2   -1000013    13
    0.037273534   2    1000011   -11
    0.037273534   2   -1000011    11
    0.036112149   2    1000024   -24
    0.036112149   2   -1000024    24
    0.026456722   2    1000023    25
    0.024026977   2    1000022    23
    0.02252489   2    1000022    25
    0.01589062   2    37   -1000024
    0.01589062   2   -37    1000024
    0.012049827   2    1000023    23
    0.011683455   2    1000022    35
    0.009958633   2    1000023    35
    0.0049511236   2    1000023    36
    0.0041967765   2    1000022    36
    0.0025731656   3    1000024    5   -6
    0.0025731656   3   -1000024   -5    6
    0.0020703563   3    1000023    6   -6
    0.0019992571   3    1000022    6   -6
    0.000377046   2    1000006   -6
    0.000377046   2   -1000006    6
    0.00012080563   3    1000021    1   -1
    0.00012080512   3    1000021    3   -3
    0.00012049899   3    1000021    2   -2
    0.00012049851   3    1000021    4   -4

DECAY 1000021  22.670986
    0.20528666   2    1000006   -6
    0.20528666   2   -1000006    6
    0.073876635   2    1000004   -4
    0.073876635   2   -1000004    4
    0.073876272   2    1000002   -2
    0.073876272   2   -1000002    2
    0.073278299   2    1000003   -3
    0.073278299   2   -1000003    3
    0.073277284   2    1000001   -1
    0.073277284   2   -1000001    1
    0.00013153431   3    1000024    5   -6
    0.00013153431   3   -1000024   -5    6

DECAY 25  0.003659951
    0.60060375   2   -5    5
    0.1996302   2   -24    24
    0.073729276   2    21    21
    0.068954354   2   -15    15
    0.029629381   2   -4    4
    0.023306081   2    23    23
    0.0023361108   2    22    22
    0.0013451019   2    22    23
    0.0002392037   2   -13    13
    0.00022576597   2   -3    3
    6.2422115e-07   2   -1    1
    1.526931e-07   2   -2    2
    5.3775883e-09   2   -11    11

DECAY 35  24.271091
    0.80214204   2   -5    5
    0.14614839   2   -15    15
    0.029076315   2    1000022    1000025
    0.014154487   2    1000023    1000025
    0.007073904   2   -6    6
    0.00054516691   2   -13    13
    0.0004282887   2   -1000024    1000024
    0.00033608862   2   -3    3
    3.1214633e-05   2    1000022    1000023
    2.2921097e-05   2    25    25
    1.5398771e-05   2    1000022    1000022
    9.6535313e-06   2    1000023    1000023
    5.9664332e-06   2    21    21
    3.0795629e-06   2    23    23
    1.0682074e-06   2   -24    24
    9.2931033e-07   2   -1    1
    5.8024706e-07   2   -1000011    1000011
    5.7843675e-07   2   -1000013    1000013
    1.0132136e-07   2   -4    4
    1.5257383e-08   2    22    22
    1.3211969e-08   2    22    23
    1.2244471e-08   2   -11    11
    5.2237884e-13   2   -2    2

DECAY 36  23.443548
    0.80076376   2   -5    5
    0.14589739   2   -15    15
    0.030096435   2    1000023    1000025
    0.014666232   2    1000022    1000025
    0.0070423941   2   -6    6
    0.00056117182   2   -1000024    1000024
    0.00054422771   2   -13    13
    0.00033550947   2   -3    3
    2.7751994e-05   2    21    21
    2.5590512e-05   2    1000022    1000023
    2.3038608e-05   2    1000022    1000022
    1.0498111e-05   2    1000023    1000023
    4.8458997e-06   2    23    25
    9.2771079e-07   2   -1    1
    9.9166496e-08   2   -4    4
    7.7082913e-08   2    22    22
    3.7552697e-08   2    22    23
    1.2223449e-08   2   -11    11
    5.1128482e-13   2   -2    2
    9.3076346e-40   2    25    25

DECAY 37  23.205868
    0.80520949   2   -5    6
    0.14703589   2   -15    16
    0.045190531   2    1000024    1000025
    0.0011838133   2   -5    4
    0.00051982443   2   -13    14
    0.00036650988   2    1000023    1000024
    0.00031652577   2   -3    4
    0.00013213405   2    1000022    1000024
    1.4803419e-05   2   -3    2
    1.0944208e-05   2   -3    6
    8.4536485e-06   2   -5    2
    4.9069258e-06   2    24    25
    2.3801818e-06   2   -1000011    1000012
    2.3775282e-06   2   -1000013    1000014
    8.7814335e-07   2   -1    2
    4.8052215e-07   2   -1    6
    4.5360043e-08   2   -1    4
    1.2158748e-08   2   -11    12
    3.6611177e-13   2    24    35
    3.1280786e-13   2    24    36

DECAY 6  2.43
    1   2    5    24

DECAY 15 -1
