BLOCK SPINFO
   1   SPheno
   2   v4.0.5be

BLOCK SPHENOINFO
   1   2
   2   2

BLOCK MODSEL
   1   0

BLOCK MINPAR
   3    22.563098
   4    1

BLOCK EXTPAR
   0    1552.3884
   1    373.58278
   2    1146.6784
   3    3000
   11    4263.9312
   12    879.52948
   13    513.73124
   23    167.07837
   25    21.706757
   26    4601.4235
   31    883.14876
   32    883.14876
   33    672.7462
   34    1351.1058
   35    1351.1058
   36    510.81397
   41    5000
   42    5000
   43    1454.0265
   44    5000
   45    5000
   46    1817.1841
   47    5000
   48    5000
   49    1030.0789

BLOCK SMINPUTS
   1    127.90897
   2    1.1663787e-05
   3    0.1184
   4    91.1876
   5    4.18
   6    173.2
   7    1.777
   8    0
   11    0.00051099893
   12    0
   13    0.10565837
   14    0
   21    0.005
   22    0.0025
   23    0.095
   24    1.27

BLOCK GAUGE Q=  1552.3884
   1    0.35536298
   2    0.66519887
   3    1.219778

BLOCK YU Q=  1552.3884
   1   1    8.3932646e-06
   2   2    0.0042637784
   3   3    1.0139738

BLOCK YD Q=  1552.3884
   1   1    0.00036610537
   2   2    0.006956002
   3   3    0.3630618

BLOCK YE Q=  1552.3884
   1   1    6.3888064e-05
   2   2    0.013210025
   3   3    0.2221709

BLOCK AU Q=  1552.3884
   1   1    0
   2   2    0
   3   3    4263.9312

BLOCK AD Q=  1552.3884
   1   1    0
   2   2    0
   3   3    879.52947

BLOCK AE Q=  1552.3884
   1   1    0
   2   2    0
   3   3    513.73124

BLOCK MSOFT Q=  1552.3884
   1    373.58278
   2    1146.6784
   3    3000
   21    21032512
   22    93219.076
   31    883.14876
   32    883.14876
   33    672.7462
   34    1351.1058
   35    1351.1058
   36    510.81397
   41    5000
   42    5000
   43    1454.0265
   44    5000
   45    5000
   46    1817.1841
   47    5000
   48    5000
   49    1030.0789

BLOCK MASS
   6    173.2
   23    91.1876
   24    80.429995
   15    1.777
   25    125.19772
   35    4600.4208
   36    4601.4235
   37    4601.4507
   1000001    5031.718
   2000001    5021.7812
   1000002    5031.2883
   2000002    5025.5192
   1000003    5031.7197
   2000003    5021.784
   1000004    5031.2901
   2000004    5025.5199
   1000005    1047.5606
   2000005    1441.4028
   1000006    1331.8934
   2000006    1809.3865
   1000011    904.26345
   2000011    1345.747
   1000012    900.44961
   1000013    904.27441
   2000013    1345.7608
   1000014    900.46121
   1000015    508.11699
   2000015    703.40341
   1000016    698.53513
   1000021    3196.1554
   1000022    165.29784
   1000023   -176.44104
   1000025    378.52733
   1000035    1189.7612
   1000024    172.1298
   1000037    1189.8987

BLOCK ALPHA
      -0.044338632

BLOCK HMIX Q=  1552.3884
   1    167.07837
   2    21.706757
   3    243.92829
   4    21173098

BLOCK STOPMIX
   1   1   -0.89374773
   1   2    0.44856995
   2   1   -0.44856995
   2   2   -0.89374773

BLOCK SBOTMIX
   1   1    0.0056252877
   1   2    0.99998418
   2   1   -0.99998418
   2   2    0.0056252877

BLOCK STAUMIX
   1   1    0.02408228
   1   2    0.99970998
   2   1   -0.99970998
   2   2    0.02408228

BLOCK NMIX
   1   1   -0.15223521
   1   2    0.055623229
   1   3   -0.71225551
   1   4    0.68295138
   2   1   -0.054687894
   2   2    0.039981123
   2   3    0.69818939
   2   4    0.71270072
   3   1    0.98682228
   3   2    0.014770422
   3   3   -0.071134995
   3   4    0.14458017
   4   1    0.0039311483
   4   2   -0.99754168
   4   3   -0.01278568
   4   4    0.068787147

BLOCK UMIX
   1   1   -0.018060026
   1   2    0.9998369
   2   1    0.9998369
   2   2    0.018060026

BLOCK VMIX
   1   1   -0.097192799
   1   2    0.99526557
   2   1    0.99526557
   2   2    0.097192799

BLOCK HIGGSBOUNDSINPUTHIGGSCOUPLINGSFERMIONS
       0, 471.18328,3,36,15,15

BLOCK HIGGSBOUNDSINPUTHIGGSCOUPLINGSBOSONS
       0,4,36,21,21,23

BLOCK SPHENOLOWENERGY
   1    0.00034722648
   2    1.5863625e-06
   3    3.5216052e-05
   4    2.4455006e-15
   5    1.0446915e-10
   6    2.1878475e-08
   7    8.2121738e-14
   8    3.5082428e-09
   9    7.4443605e-07
   10    9.6661922e-05
   11    0.99848064
   12    0.54290915
   13    19.397976
   14    0
   15    0
   16    0.0021615117
   17    2.281701e-15
   18    2.4786526e-11
   19    8.286688e-11
   20    5.908701e-15
   21    2.5263103e-10
   22    1.2513187e-07
   23    0
   24    0
   25    0
   26    0
   27    0
   28    0
   29    0
   30    0
   31    0
   39    6.3017903e-05
   40    0
   41    0
   42    0

BLOCK FWCOEF Q=  160
   305   4422   0   0   -0.18881911
   305   4422   0   2   -0.22028214
   305   4322   0   2   -0.00021628474
   305   6421   0   0   -0.095227835
   305   6421   0   2   -0.11316609
   305   6321   0   2   -0.00015016941
   3051111   4133   0   0    1.5931015
   3051111   4133   0   2    1.5941017
   3051111   4233   0   2    9.4338211e-05
   3051111   4137   0   0   -4.4157936
   3051111   4137   0   2   -4.4105336
   3051111   4237   0   2   -0.00073190365
   3051313   4133   0   0    1.5931015
   3051313   4133   0   2    1.5941005
   3051313   4233   0   2    9.433809e-05
   3051313   4137   0   0   -4.4157936
   3051313   4137   0   2   -4.4105349
   3051313   4237   0   2   -0.00073190403
   3051212   4137   0   0    1.5053501
   3051212   4137   0   2    1.5042146
   3051212   4237   0   2    0.00015945943
   3051414   4137   0   0    1.5053501
   3051414   4137   0   2    1.5042146
   3051414   4237   0   2    0.00015945943
   3051616   4137   0   0    1.5053501
   3051616   4137   0   2    1.5042143
   3051616   4237   0   2    0.00015945963

BLOCK IMFWCOEF Q=  160
   305   4422   0   0    3.8580337e-07
   305   4422   0   2    1.8128325e-05
   305   4322   0   2   -2.8001552e-06
   305   6421   0   0    3.304661e-07
   305   6421   0   2   -2.0228201e-06
   305   6321   0   2   -1.2393688e-06
   3051111   4133   0   2   -1.8018392e-06
   3051111   4233   0   2    1.7918136e-06
   3051111   4137   0   2    1.3770748e-05
   3051111   4237   0   2   -1.3903606e-05
   3051313   4133   0   2   -1.8018463e-06
   3051313   4233   0   2    1.7918116e-06
   3051313   4137   0   2    1.377078e-05
   3051313   4237   0   2   -1.3903613e-05
   3051212   4137   0   2   -2.8024753e-06
   3051212   4237   0   2    3.0291819e-06
   3051414   4137   0   2   -2.8024769e-06
   3051414   4237   0   2    3.0291819e-06
   3051616   4137   0   2   -2.8095822e-06
   3051616   4237   0   2    3.0291786e-06

DECAY 23  2.4952


DECAY 24  2.085


DECAY 1000011  0.80051297
    0.99338502   2    1000025    11
    0.0030691354   2    1000022    11
    0.0030125846   2   -1000024    12
    0.00053325452   2    1000023    11

DECAY 2000011  5.755681
    0.97019351   2    1000025    11
    0.026411749   2    1000022    11
    0.0033938604   2    1000023    11

DECAY 1000013  0.80344511
    0.98979445   2    1000025    13
    0.0049101129   2    1000022    13
    0.0030016322   2   -1000024    14
    0.0022938035   2    1000023    13

DECAY 2000013  5.7648172
    0.96867293   2    1000025    13
    0.026768872   2    1000022    13
    0.0037701555   2    1000023    13
    0.000783882   2   -1000024    14

DECAY 1000015  1.3298319
    0.37056255   2    1000025    15
    0.29453185   2   -1000024    16
    0.19032888   2    1000022    15
    0.14457672   2    1000023    15

DECAY 2000015  1.0808766
    0.42774102   2    1000025    15
    0.28549951   2    1000022    15
    0.27664548   2    1000023    15
    0.004846673   2    1000015    25
    0.004759689   2    1000015    23
    0.00050761924   2   -1000024    16

DECAY 1000012  0.86180237
    0.8184464   2    1000025    12
    0.080652715   2    1000024    11
    0.080539069   2    1000022    12
    0.020361812   2    1000023    12

DECAY 1000014  0.86472104
    0.81570345   2    1000025    14
    0.083734752   2    1000024    13
    0.080268406   2    1000022    14
    0.020293389   2    1000023    14

DECAY 1000016  1.1332169
    0.57866076   2    1000024    15
    0.35543825   2    1000025    16
    0.045347431   2    1000022    16
    0.011386334   2    1000023    16
    0.0091672166   2    1000015    24

DECAY 2000001  143.06562
    0.98062044   2    1000021    1
    0.018867453   2    1000025    1
    0.00045322986   2    1000022    1

DECAY 1000001  201.25121
    0.70224179   2    1000021    1
    0.19610311   2   -1000037    2
    0.097741606   2    1000035    1
    0.0028188283   2    1000025    1
    0.00075164485   2    1000022    1
    0.00027140588   2    1000023    1

DECAY 2000003  143.07552
    0.98055455   2    1000021    3
    0.018866326   2    1000025    3
    0.00047025382   2    1000022    3

DECAY 1000003  201.25805
    0.70221883   2    1000021    3
    0.1960966   2   -1000037    4
    0.097738329   2    1000035    3
    0.0028188538   2    1000025    3
    0.00076376802   2    1000022    3
    0.00028306751   2    1000023    3

DECAY 1000005  5.4942966
    0.44565986   2   -1000024    6
    0.24411916   2    1000022    5
    0.23007529   2    1000023    5
    0.080145686   2    1000025    5

DECAY 2000005  34.713904
    0.79289341   2   -1000024    6
    0.05485112   2    1000022    5
    0.052019166   2    1000023    5
    0.045715865   2    1000006   -24
    0.031101889   2   -1000037    6
    0.018501606   2    1000035    5
    0.004637323   2    1000025    5
    0.00019000011   2    1000005    25

DECAY 2000002  151.78048
    0.92687778   2    1000021    2
    0.071190679   2    1000025    2
    0.0017099249   2    1000022    2
    0.00022059625   2    1000023    2

DECAY 1000002  201.24766
    0.70203198   2    1000021    2
    0.19429691   2    1000037    1
    0.097459052   2    1000035    2
    0.0039481996   2    1000025    2
    0.0020741797   2    1000024    1
    0.00010039743   2    1000023    2

DECAY 2000004  151.78411
    0.92685565   2    1000021    4
    0.071189232   2    1000025    4
    0.0017154536   2    1000022    4
    0.0002266571   2    1000023    4

DECAY 1000004  201.25444
    0.70200894   2    1000021    4
    0.19429046   2    1000037    3
    0.097455848   2    1000035    4
    0.0039482519   2    1000025    4
    0.0020980434   2    1000024    3
    0.00010497461   2    1000023    4

DECAY 1000006  32.941872
    0.38801253   2    1000023    6
    0.34350766   2    1000022    6
    0.20330819   2    1000024    5
    0.050629631   2    1000025    6
    0.013254785   2    1000037    5
    0.0011662135   3    1000022    24    5

DECAY 2000006  153.45344
    0.23933563   2    2000005    24
    0.20570906   2    1000024    5
    0.19174615   2    1000006    23
    0.12036656   2    1000023    6
    0.11534623   2    1000022    6
    0.10442478   2    1000006    25
    0.017956482   2    1000025    6
    0.0032980595   2    1000037    5
    0.0017687797   2    1000035    6

DECAY 1000024  1.7956956e-08
    0.36311169   3    1000022   -1    2
    0.30706329   3    1000022   -3    4
    0.12104927   3    1000022   -11    12
    0.12090497   3    1000022   -13    14
    0.087870782   3    1000022   -15    16

DECAY 1000037  18.848836
    0.14099774   2    1000023    24
    0.1378932   2    1000024    23
    0.13765064   2    1000024    25
    0.12801334   2    1000022    24
    0.11821334   2    1000016   -15
    0.11752178   2   -2000015    16
    0.050262988   2    1000012   -11
    0.050259506   2    1000014   -13
    0.049578251   2   -1000011    12
    0.049574964   2   -1000013    14
    0.0094208854   2    1000025    24
    0.0036479479   3    1000024    6   -6
    0.0033197416   3    1000023   -5    6
    0.0032645609   3    1000022   -5    6
    0.00019664239   3    1000025   -5    6
    0.00012386398   3    1000024    5   -5

DECAY 1000022 -1


DECAY 1000023  6.0164906e-07
    0.24152335   2    1000022    22
    0.18010093   3    1000022    12   -12
    0.1346497   3    1000022    1   -1
    0.13453625   3    1000022    3   -3
    0.10501498   3    1000022    2   -2
    0.088310006   3    1000022    4   -4
    0.030384986   3    1000022    11   -11
    0.030344918   3    1000022    13   -13
    0.021084101   3    1000022    15   -15
    0.017372699   3    1000022    5   -5
    0.0033731573   3    1000024    1   -2
    0.0033731573   3   -1000024   -1    2
    0.0022222318   3    1000024    3   -4
    0.0022222318   3   -1000024   -3    4
    0.0011244514   3    1000024    11   -12
    0.0011244514   3   -1000024   -11    12
    0.0011210931   3    1000024    13   -14
    0.0011210931   3   -1000024   -13    14
    0.00049810024   3    1000024    15   -16
    0.00049810024   3   -1000024   -15    16

DECAY 1000025  0.92624847
    0.26850498   2    1000023    23
    0.22134623   2    1000024   -24
    0.22134623   2   -1000024    24
    0.13383988   2    1000022    25
    0.12604481   2    1000023    25
    0.028867932   2    1000022    23

DECAY 1000035  19.476807
    0.13436186   2    1000024   -24
    0.13436186   2   -1000024    24
    0.092908873   2    1000023    23
    0.083075029   2    1000022    25
    0.077633052   2    1000023    25
    0.057685665   2    1000016   -16
    0.057685665   2   -1000016    16
    0.056345775   2    2000015   -15
    0.056345775   2   -2000015    15
    0.03999217   2    1000022    23
    0.024517525   2    1000012   -12
    0.024517525   2   -1000012    12
    0.024515831   2    1000014   -14
    0.024515831   2   -1000014    14
    0.023761646   2    1000011   -11
    0.023761646   2   -1000011    11
    0.023760064   2    1000013   -13
    0.023760064   2   -1000013    13
    0.0068833246   2    1000025    25
    0.0025685682   3    1000024    5   -6
    0.0025685682   3   -1000024   -5    6
    0.0017674834   2    1000025    23
    0.0012921681   3    1000023    6   -6
    0.0012384513   3    1000022    6   -6

DECAY 1000021  258.06672
    0.14602701   2    1000005   -5
    0.14602701   2   -1000005    5
    0.13807096   2    1000006   -6
    0.13807096   2   -1000006    6
    0.11632475   2    2000005   -5
    0.11632475   2   -2000005    5
    0.073553267   2    2000006   -6
    0.073553267   2   -2000006    6
    0.025554171   2    1000006   -4
    0.025554171   2   -1000006    4
    0.00079482364   3    1000035    6   -6

DECAY 25  0.003894287
    0.57000587   2   -5    5
    0.23237922   2   -24    24
    0.071162406   2    21    21
    0.065642045   2   -15    15
    0.028240669   2    23    23
    0.028239303   2   -4    4
    0.0023665626   2    22    22
    0.001521495   2    22    23
    0.0002275981   2   -13    13
    0.00021409387   2   -3    3
    5.9194759e-07   2   -1    1
    1.4552324e-07   2   -2    2
    5.1166555e-09   2   -11    11

DECAY 35  83.576747
    0.2634759   2   -5    5
    0.19560889   2   -1000024    1000037
    0.19560889   2   -1000037    1000024
    0.10660855   2    1000023    1000035
    0.089979119   2    1000022    1000035
    0.057468183   2   -15    15
    0.031952818   2    1000023    1000025
    0.026024275   2    1000022    1000025
    0.0044994038   2   -1000024    1000024
    0.0038903064   2   -6    6
    0.0037918292   2    1000022    1000022
    0.0033942076   2   -1000006    1000006
    0.0033906501   2   -2000005    1000005
    0.0033906501   2   -1000005    2000005
    0.003053608   2   -2000006    2000006
    0.0019230283   2   -2000006    1000006
    0.0019230283   2   -1000006    2000006
    0.0011774078   2    1000023    1000023
    0.00077354833   2    1000025    1000035
    0.00055785459   2    1000022    1000023
    0.00040112313   2    1000025    1000025
    0.0003458518   2   -2000015    1000015
    0.0003458518   2   -1000015    2000015
    0.00019747775   2   -13    13
    0.00010912684   2   -3    3
    6.074735e-05   2   -1000037    1000037
    3.0822534e-05   2    1000035    1000035
    7.7233525e-06   2    25    25
    1.8232918e-06   2   -2000015    2000015
    1.6699025e-06   2   -2000005    2000005
    1.4694513e-06   2    21    21
    9.2045563e-07   2   -1000015    1000015
    8.067793e-07   2   -1000005    1000005
    3.4542096e-07   2    23    23
    3.0170679e-07   2   -1    1
    1.264951e-07   2   -1000011    1000011
    1.261745e-07   2   -1000013    1000013
    7.1736573e-08   2   -2000011    2000011
    7.1522345e-08   2   -2000013    2000013
    6.2374291e-08   2   -24    24
    5.3313038e-08   2   -4    4
    2.1286528e-08   2    22    23
    1.1734294e-08   2    22    22
    4.4346751e-09   2   -11    11
    2.2438365e-10   2   -2000013    1000013
    2.2438365e-10   2   -1000013    2000013
    2.7480325e-13   2   -2    2
    5.24836e-15   2   -2000011    1000011
    5.24836e-15   2   -1000011    2000011

DECAY 36  82.192121
    0.25404525   2   -5    5
    0.19879303   2   -1000024    1000037
    0.19879303   2   -1000037    1000024
    0.11230181   2    1000022    1000035
    0.087004248   2    1000023    1000035
    0.055411651   2   -15    15
    0.031565226   2    1000022    1000025
    0.026948921   2    1000023    1000025
    0.0053189892   2   -2000006    1000006
    0.0053189892   2   -1000006    2000006
    0.0047551991   2   -1000024    1000024
    0.0045913426   2    1000022    1000022
    0.0036737011   2   -6    6
    0.0034484144   2   -2000005    1000005
    0.0034484144   2   -1000005    2000005
    0.0013215547   2    1000025    1000035
    0.0010038345   2    1000023    1000023
    0.00060989883   2    1000025    1000025
    0.00035295479   2   -2000015    1000015
    0.00035295479   2   -1000015    2000015
    0.00031184365   2    1000022    1000023
    0.00021706388   2   -1000037    1000037
    0.00019041042   2   -13    13
    0.00010946368   2    1000035    1000035
    0.00010521828   2   -3    3
    5.291823e-06   2    21    21
    8.7328087e-07   2    23    25
    2.9089787e-07   2   -1    1
    5.020603e-08   2   -4    4
    4.2528745e-08   2    22    23
    3.7049592e-08   2    22    22
    4.2759596e-09   2   -11    11
    2.268607e-10   2   -2000013    1000013
    2.268607e-10   2   -1000013    2000013
    2.5879725e-13   2   -2    2
    1.3550126e-14   2    23    35
    5.3062955e-15   2   -2000011    1000011
    5.3062955e-15   2   -1000011    2000011
    1.7640446e-38   2    25    25

DECAY 37  83.218426
    0.26901232   2   -5    6
    0.20235155   2    1000022    1000037
    0.19670799   2    1000024    1000035
    0.19253926   2    1000023    1000037
    0.06544858   2    1000024    1000025
    0.05629478   2   -15    16
    0.0053829609   2   -2000005    2000006
    0.0052105623   2   -1000005    1000006
    0.0021066509   2    1000025    1000037
    0.0018514412   2   -1000005    2000006
    0.0011326492   2   -2000005    1000006
    0.00069579656   2   -1000015    1000016
    0.00039327698   2   -5    4
    0.00032745542   2    1000022    1000024
    0.0002263657   2    1000023    1000024
    0.00019902207   2   -13    14
    0.00010132669   2   -3    4
    5.9943441e-06   2   -3    6
    4.7658529e-06   2   -3    2
    2.8084024e-06   2   -5    2
    2.0149052e-06   2   -2000015    1000016
    8.6275345e-07   2    24    25
    4.9910894e-07   2   -1000011    1000012
    4.9865738e-07   2   -1000013    1000014
    2.8103688e-07   2   -1    2
    2.6799173e-07   2   -1    6
    1.5626598e-08   2   -1    4
    4.6551468e-09   2   -11    12
    1.8148764e-09   2    1000035    1000037
    4.5944228e-10   2   -2000013    1000014
    1.8961672e-14   2    24    35
    1.074652e-14   2   -2000011    1000012

DECAY 6  2.43
    1   2    5    24

DECAY 15 -1
