BLOCK SPINFO
   1   SPheno
   2   v4.0.5be

BLOCK SPHENOINFO
   1   2
   2   2

BLOCK MODSEL
   1   0

BLOCK MINPAR
   3    20.11673
   4   -1

BLOCK EXTPAR
   0    3217.6131
   1    66.07114
   2   -2457.5106
   3    4265.021
   11    3786.2056
   12    2921.9398
   13   -7594.1828
   23   -2323.1595
   25    19.287857
   26    3769.1535
   31    2031.7222
   32    2031.7222
   33    1487.9756
   34    4385.5107
   35    4385.5107
   36    4265.4983
   41    2015.9321
   42    2015.9321
   43    2298.0729
   44    4748.0396
   45    4748.0396
   46    4177.8241
   47    3825.4079
   48    3825.4079
   49    3958.6403

BLOCK SMINPUTS
   1    127.90897
   2    1.1663787e-05
   3    0.1184
   4    91.1876
   5    4.18
   6    173.2
   7    1.777
   8    0
   11    0.00051099893
   12    0
   13    0.10565837
   14    0
   21    0.005
   22    0.0025
   23    0.095
   24    1.27

BLOCK GAUGE Q=  3217.6131
   1    0.35536298
   2    0.66519887
   3    1.219778

BLOCK YU Q=  3217.6131
   1   1    8.3956332e-06
   2   2    0.0042649817
   3   3    1.0142599

BLOCK YD Q=  3217.6131
   1   1    0.00032540009
   2   2    0.0061826018
   3   3    0.32269493

BLOCK YE Q=  3217.6131
   1   1    5.6784696e-05
   2   2    0.011741274
   3   3    0.19746892

BLOCK AU Q=  3217.6131
   1   1    0
   2   2    0
   3   3    3786.2056

BLOCK AD Q=  3217.6131
   1   1    0
   2   2    0
   3   3    2921.9397

BLOCK AE Q=  3217.6131
   1   1    0
   2   2    0
   3   3   -7594.1827

BLOCK MSOFT Q=  3217.6131
   1    66.07114
   2   -2457.5106
   3    4265.021
   21    8670483.5
   22   -5273399.5
   31    2031.7222
   32    2031.7222
   33    1487.9756
   34    4385.5107
   35    4385.5107
   36    4265.4983
   41    2015.9321
   42    2015.9321
   43    2298.0729
   44    4748.0396
   45    4748.0396
   46    4177.8241
   47    3825.4079
   48    3825.4079
   49    3958.6403

BLOCK MASS
   6    173.2
   23    91.1876
   24    80.429995
   15    1.777
   25    122.18199
   35    3769.1037
   36    3769.1535
   37    3770.4057
   1000001    2179.8691
   2000001    3941.9312
   1000002    2178.3911
   2000002    4844.6475
   1000003    2179.8685
   2000003    3941.9288
   1000004    2178.3907
   2000004    4844.647
   1000005    2447.8178
   2000005    4065.5623
   1000006    2445.9351
   2000006    4232.7509
   1000011    2060.4354
   2000011    4388.3882
   1000012    2058.5077
   1000013    2060.4336
   2000013    4388.3792
   1000014    2058.5063
   1000015    1524.9202
   2000015    4262.7165
   1000016    1522.5725
   1000021    4349.1577
   1000022    66.301397
   1000023   -2308.7283
   1000025    2334.5541
   1000035   -2464.3538
   1000024    2309.3532
   1000037    2464.5296

BLOCK ALPHA
      -0.04974983

BLOCK HMIX Q=  3217.6131
   1   -2323.1595
   2    19.287857
   3    243.19432
   4    14206518

BLOCK STOPMIX
   1   1   -0.99896378
   1   2    0.04551217
   2   1   -0.04551217
   2   2   -0.99896378

BLOCK SBOTMIX
   1   1   -0.99992096
   1   2    0.012572981
   2   1   -0.012572981
   2   2   -0.99992096

BLOCK STAUMIX
   1   1   -0.99999106
   1   2    0.0042288332
   2   1   -0.0042288332
   2   2   -0.99999106

BLOCK NMIX
   1   1    0.99982254
   1   2   -4.7778231e-05
   1   3   -0.018831381
   1   4    0.00051633697
   2   1    0.012770339
   2   2    0.37219557
   2   3    0.65916375
   2   4   -0.65330737
   3   1    0.012947268
   3   2   -0.010961245
   3   3    0.70683273
   3   4    0.70717728
   4   1   -0.0049169561
   4   2    0.9280896
   4   3   -0.25600003
   4   4    0.27035071

BLOCK UMIX
   1   1   -0.38938488
   1   2   -0.92107514
   2   1   -0.92107514
   2   2    0.38938488

BLOCK VMIX
   1   1    0.40963906
   1   2    0.91224768
   2   1    0.91224768
   2   2   -0.40963906

BLOCK HIGGSBOUNDSINPUTHIGGSCOUPLINGSFERMIONS
       0, 372.02141,3,36,15,15

BLOCK HIGGSBOUNDSINPUTHIGGSCOUPLINGSBOSONS
       0,4,36,21,21,23

BLOCK SPHENOLOWENERGY
   1    0.00032261462
   2    1.5903674e-06
   3    3.5261723e-05
   4    2.4024799e-15
   5    1.0263117e-10
   6    2.1481993e-08
   7    8.1402281e-14
   8    3.477501e-09
   9    7.37504e-07
   10    9.6657995e-05
   11    0.99844009
   12    0.54179264
   13    19.35796
   14    0
   15    0
   16    0.0021566216
   17    2.2816512e-15
   18    2.4804618e-11
   19    8.2917211e-11
   20    8.8265959e-16
   21    3.7736396e-11
   22    1.1796775e-08
   23    0
   24    0
   25    0
   26    0
   27    0
   28    0
   29    0
   30    0
   31    0
   39    4.816255e-05
   40    0
   41    0
   42    0

BLOCK FWCOEF Q=  160
   305   4422   0   0   -0.18881911
   305   4422   0   2   -0.19103282
   305   4322   0   2   -4.265836e-05
   305   6421   0   0   -0.095227835
   305   6421   0   2   -0.099801816
   305   6321   0   2   -8.9457914e-05
   3051111   4133   0   0    1.6187697
   3051111   4133   0   2    1.6189972
   3051111   4233   0   2    5.9172019e-05
   3051111   4137   0   0   -4.4414618
   3051111   4137   0   2   -4.4407009
   3051111   4237   0   2   -0.00044305855
   3051313   4133   0   0    1.6187697
   3051313   4133   0   2    1.618997
   3051313   4233   0   2    5.9172e-05
   3051313   4137   0   0   -4.4414618
   3051313   4137   0   2   -4.4407011
   3051313   4237   0   2   -0.00044305859
   3051212   4137   0   0    1.5053501
   3051212   4137   0   2    1.5051871
   3051212   4237   0   2    9.5976893e-05
   3051414   4137   0   0    1.5053501
   3051414   4137   0   2    1.5051871
   3051414   4237   0   2    9.5976895e-05
   3051616   4137   0   0    1.5053501
   3051616   4137   0   2    1.505187
   3051616   4237   0   2    9.5977424e-05

BLOCK IMFWCOEF Q=  160
   305   4422   0   0    3.8585137e-07
   305   4422   0   2    3.345684e-06
   305   4322   0   2    8.19954e-07
   305   6421   0   0    3.3050722e-07
   305   6421   0   2    5.7973394e-06
   305   6321   0   2    5.0255055e-07
   3051111   4133   0   2    3.5606434e-07
   3051111   4233   0   2    1.1844982e-06
   3051111   4137   0   2   -1.7434841e-06
   3051111   4237   0   2   -8.8693607e-06
   3051313   4133   0   2    3.5606236e-07
   3051313   4233   0   2    1.184498e-06
   3051313   4137   0   2   -1.7434837e-06
   3051313   4237   0   2   -8.8693616e-06
   3051212   4137   0   2    4.1102877e-07
   3051212   4237   0   2    1.9213117e-06
   3051414   4137   0   2    4.1102862e-07
   3051414   4237   0   2    1.9213117e-06
   3051616   4137   0   2    4.0815642e-07
   3051616   4237   0   2    1.9213118e-06

DECAY 23  2.4952


DECAY 24  2.085


DECAY 1000011  2.5814981
    1   2    1000022    11

DECAY 2000011  22.036192
    0.99981706   2    1000022    11

DECAY 1000013  2.5814979
    1   2    1000022    13

DECAY 2000013  22.049849
    0.99919592   2    1000022    13
    0.0002421074   2   -1000024    14
    0.00022635939   2    1000025    13
    0.00020933886   2    1000023    13

DECAY 1000015  1.9080327
    1   2    1000022    15

DECAY 2000015  25.883988
    0.82679868   2    1000022    15
    0.053449433   2   -1000024    16
    0.031363224   2    1000025    15
    0.027476624   2    1000023    15
    0.024139349   2    1000016   -24
    0.012047648   2    1000015    23
    0.011555307   2    1000015    25
    0.0091731485   2   -1000037    16
    0.0039965914   2    1000035    15

DECAY 1000012  2.5800522
    0.99997813   2    1000022    12

DECAY 1000014  2.5800505
    0.99997813   2    1000022    14

DECAY 1000016  1.9050108
    1   2    1000022    16

DECAY 1000001  0.3037438
    1   2    1000022    1

DECAY 2000001  2.1990642
    0.99984622   2    1000022    1

DECAY 1000003  0.3037443
    1   2    1000022    3

DECAY 2000003  2.2019474
    0.99853692   2    1000022    3
    0.00049821188   2   -1000024    4
    0.00035730092   2    1000025    3
    0.0003256248   2    1000023    3
    0.00016328969   2    1000003    25

DECAY 1000005  0.41240234
    0.83665622   2    1000022    5
    0.11324001   2    1000023    5
    0.050103777   2    1000025    5

DECAY 2000005  13.617819
    0.23527605   2   -1000024    6
    0.16650053   2    1000022    5
    0.13894947   2    1000025    5
    0.13704195   2    1000006   -24
    0.12086411   2    1000023    5
    0.072318207   2    1000005    25
    0.068394905   2    1000005    23
    0.042202496   2   -1000037    6
    0.018452281   2    1000035    5

DECAY 1000002  0.30321144
    1   2    1000022    2

DECAY 2000002  25.218987
    0.57122375   2    1000021    2
    0.42868636   2    1000022    2

DECAY 1000004  0.30321114
    1   2    1000022    4

DECAY 2000004  25.220961
    0.57117545   2    1000021    4
    0.42865269   2    1000022    4

DECAY 1000006  0.52390481
    0.66375517   2    1000022    6
    0.19827408   2    1000024    5
    0.13080523   3    1000022    24    5
    0.0035090566   3   -1000015    16    5
    0.0027757036   3    1000016   -15    5
    0.00023213614   3   -1000013    14    5
    0.00023213268   3   -1000011    12    5
    0.00020748577   3    1000014   -13    5
    0.00020747192   3    1000012   -11    5

DECAY 2000006  163.8479
    0.21086225   2    1000024    5
    0.19166028   2    1000005    24
    0.14758366   2    1000006    25
    0.12633732   2    1000025    6
    0.10729222   2    1000023    6
    0.095779987   2    1000006    23
    0.057332754   2    1000022    6
    0.044008653   2    1000037    5
    0.019142843   2    1000035    6

DECAY 1000024  3.110212
    0.40585966   2    1000022    24
    0.25398307   2    1000016   -15
    0.15854257   2   -1000015    16
    0.023184545   2    1000014   -13
    0.023147029   2    1000012   -11
    0.020612891   2   -1000013    14
    0.020612616   2   -1000011    12
    0.019990294   2    1000004   -3
    0.019980868   2    1000002   -1
    0.018749528   3    1000022   -5    6
    0.017668936   2   -1000003    4
    0.017660248   2   -1000001    2

DECAY 1000037  18.48565
    0.18959771   2    1000016   -15
    0.18941235   2   -1000015    16
    0.070760519   2   -1000001    2
    0.070758829   2   -1000003    4
    0.070089797   2    1000004   -3
    0.07008873   2    1000002   -1
    0.064482869   2    1000023    24
    0.045118589   2   -1000013    14
    0.045118231   2   -1000011    12
    0.044645386   2    1000014   -13
    0.044642767   2    1000012   -11
    0.035556401   2    1000024    23
    0.023139683   2    1000025    24
    0.021078418   2    1000024    25
    0.014536711   2    1000022    24
    0.00068558837   3    1000022   -5    6
    0.00028687846   2    1000006   -5

DECAY 1000022 -1


DECAY 1000023  2.9528688
    0.24317647   2    1000022    25
    0.20628616   2    1000022    23
    0.12058292   2    1000015   -15
    0.12058292   2   -1000015    15
    0.073348977   2    1000016   -16
    0.073348977   2   -1000016    16
    0.014842814   3    1000022    6   -6
    0.010257968   2    1000013   -13
    0.010257968   2   -1000013    13
    0.010238935   2    1000011   -11
    0.010238935   2   -1000011    11
    0.0096549124   2    1000014   -14
    0.0096549124   2   -1000014    14
    0.009654812   2    1000012   -12
    0.009654812   2   -1000012    12
    0.0087143881   2    1000002   -2
    0.0087143881   2   -1000002    2
    0.0087134611   2    1000004   -4
    0.0087134611   2   -1000004    4
    0.0083220309   2    1000003   -3
    0.0083220309   2   -1000003    3
    0.0083177059   2    1000001   -1
    0.0083177059   2   -1000001    1

DECAY 1000025  1.8532573
    0.43588895   2    1000022    23
    0.37459705   2    1000022    25
    0.080222743   2    1000015   -15
    0.080222743   2   -1000015    15
    0.027881898   3    1000022    6   -6
    0.00029260439   2    1000016   -16
    0.00029260439   2   -1000016    16
    0.00010786314   3    1000022    5   -5

DECAY 1000035  21.835726
    0.08893355   2    1000024   -24
    0.08893355   2   -1000024    24
    0.082244632   2    1000016   -16
    0.082244632   2   -1000016    16
    0.082064079   2    1000015   -15
    0.082064079   2   -1000015    15
    0.049245072   2    1000025    23
    0.030616619   2    1000004   -4
    0.030616619   2   -1000004    4
    0.030615836   2    1000002   -2
    0.030615836   2   -1000002    2
    0.030434693   2    1000003   -3
    0.030434693   2   -1000003    3
    0.030434104   2    1000001   -1
    0.030434104   2   -1000001    1
    0.020145442   2    1000023    25
    0.019655458   2    1000014   -14
    0.019655458   2   -1000014    14
    0.019655336   2    1000012   -12
    0.019655336   2   -1000012    12
    0.019267449   2    1000013   -13
    0.019267449   2   -1000013    13
    0.019266302   2    1000011   -11
    0.019266302   2   -1000011    11
    0.012505981   2    1000025    25
    0.0058360932   2    1000022    25
    0.0050997739   2    1000022    23
    0.0004914639   3    1000022    6   -6
    0.00012539809   2    1000005   -5
    0.00012539809   2   -1000005    5

DECAY 1000021  420.84243
    0.085832806   2    1000004   -4
    0.085832806   2   -1000004    4
    0.085832794   2    1000002   -2
    0.085832794   2   -1000002    2
    0.085754803   2    1000003   -3
    0.085754803   2   -1000003    3
    0.085754773   2    1000001   -1
    0.085754773   2   -1000001    1
    0.072097724   2    1000006   -6
    0.072097724   2   -1000006    6
    0.071401581   2    1000005   -5
    0.071401581   2   -1000005    5
    0.0048733396   2    2000003   -3
    0.0048733396   2   -2000003    3
    0.0048732862   2    2000001   -1
    0.0048732862   2   -2000001    1
    0.0024332904   2    2000005   -5
    0.0024332904   2   -2000005    5
    0.00043048197   3    1000023    6   -6
    0.00028658796   3    1000025    6   -6
    0.00025363705   3    1000024    5   -6
    0.00025363705   3   -1000024   -5    6
    0.00013923912   3    1000022    6   -6
    0.00012568427   3    1000037    5   -6
    0.00012568427   3   -1000037   -5    6

DECAY 25  0.0035444227
    0.61529385   2   -5    5
    0.18434794   2   -24    24
    0.074347112   2    21    21
    0.070443477   2   -15    15
    0.030411596   2   -4    4
    0.021084271   2    23    23
    0.0023340318   2    22    22
    0.0012615313   2    22    23
    0.00024431988   2   -13    13
    0.00023107039   2   -3    3
    6.388859e-07   2   -1    1
    1.5672729e-07   2   -2    2
    5.4926199e-09   2   -11    11

DECAY 35  31.907881
    0.82287769   2   -5    5
    0.10657683   2   -15    15
    0.028134322   2    1000022    1000025
    0.023245522   2    1000022    1000023
    0.016581136   2   -6    6
    0.0018105465   2    1000022    1000035
    0.00036280855   2   -13    13
    0.00029824399   2   -3    3
    9.4238225e-05   2    1000022    1000022
    6.9096196e-06   2   -1000015    1000015
    4.0850378e-06   2    21    21
    3.2534342e-06   2    25    25
    1.8080626e-06   2    23    23
    8.2440274e-07   2   -1    1
    4.0964179e-07   2   -24    24
    2.2157675e-07   2   -4    4
    2.7943161e-08   2    22    23
    9.2190407e-09   2    22    22
    8.1479184e-09   2   -11    11
    1.1421853e-12   2   -2    2

DECAY 36  30.766687
    0.8220645   2   -5    5
    0.10647528   2   -15    15
    0.02733698   2    1000022    1000023
    0.025633951   2    1000022    1000025
    0.015496785   2   -6    6
    0.0022073577   2    1000022    1000035
    0.00036246165   2   -13    13
    0.00029794742   2   -3    3
    9.8271449e-05   2    1000022    1000022
    2.168035e-05   2    21    21
    3.7146374e-06   2    23    25
    8.2358772e-07   2   -1    1
    2.0541527e-07   2   -4    4
    1.7880846e-08   2    22    22
    1.3142668e-08   2    22    23
    8.1401269e-09   2   -11    11
    1.0588368e-12   2   -2    2
    2.0564409e-38   2    25    25

DECAY 37  31.986315
    0.84928124   2   -5    6
    0.095396833   2   -15    16
    0.049487048   2    1000022    1000024
    0.0039401629   2    1000022    1000037
    0.0012431863   2   -5    4
    0.00033726178   2   -13    14
    0.00026998246   2   -3    4
    1.638208e-05   2   -3    6
    1.2671058e-05   2   -3    2
    8.877631e-06   2   -5    2
    3.5779779e-06   2    24    25
    1.2487484e-06   2   -1000015    1000016
    7.485964e-07   2   -1    2
    7.3294121e-07   2   -1    6
    4.1732253e-08   2   -1    4
    7.888588e-09   2   -11    12
    1.5925329e-13   2    24    35
    1.3108314e-13   2    24    36

DECAY 6  2.43
    1   2    5    24

DECAY 15 -1
