BLOCK SPINFO
   1   SPheno
   2   v4.0.5be

BLOCK SPHENOINFO
   1   2
   2   2

BLOCK MODSEL
   1   0

BLOCK MINPAR
   3    36.590754
   4    1

BLOCK EXTPAR
   0    3768.2138
   1    154.65527
   2    4867.3808
   3    2918.9972
   11   -3175.506
   12    1262.9026
   13   -1021.8868
   23    158.15858
   25    35.478093
   26    987.95673
   31    2372.8454
   32    2372.8454
   33    2322.9129
   34    4879.8621
   35    4879.8621
   36    2538.0389
   41    3189.7911
   42    3189.7911
   43    3324.1116
   44    4270.959
   45    4270.959
   46    4119.2741
   47    3790.9608
   48    3790.9608
   49    1500.0561

BLOCK SMINPUTS
   1    127.90897
   2    1.1663787e-05
   3    0.1184
   4    91.1876
   5    4.18
   6    173.2
   7    1.777
   8    0
   11    0.00051099893
   12    0
   13    0.10565837
   14    0
   21    0.005
   22    0.0025
   23    0.095
   24    1.27

BLOCK GAUGE Q=  3768.2138
   1    0.35536298
   2    0.66519887
   3    1.219778

BLOCK YU Q=  3768.2138
   1   1    8.3877021e-06
   2   2    0.0042609526
   3   3    1.0133018

BLOCK YD Q=  3768.2138
   1   1    0.00059797567
   2   2    0.011361538
   3   3    0.59300449

BLOCK YE Q=  3768.2138
   1   1    0.00010435113
   2   2    0.021576504
   3   3    0.36288129

BLOCK AU Q=  3768.2138
   1   1    0
   2   2    0
   3   3   -3175.5075

BLOCK AD Q=  3768.2138
   1   1    0
   2   2    0
   3   3    1262.9024

BLOCK AE Q=  3768.2138
   1   1    0
   2   2    0
   3   3   -1021.8866

BLOCK MSOFT Q=  3768.2138
   1    154.65527
   2    4867.3808
   3    2918.9972
   21    987863.35
   22    226769.5
   31    2372.8454
   32    2372.8454
   33    2322.9129
   34    4879.8621
   35    4879.8621
   36    2538.0389
   41    3189.7911
   42    3189.7911
   43    3324.1116
   44    4270.959
   45    4270.959
   46    4119.2741
   47    3790.9608
   48    3790.9608
   49    1500.0561

BLOCK MASS
   6    173.2
   23    91.1876
   24    80.429995
   15    1.777
   25    121.42409
   35    987.8901
   36    987.95673
   37    991.74831
   1000001    3344.2276
   2000001    3888.0112
   1000002    3343.2884
   2000002    4357.0512
   1000003    3344.2238
   2000003    3888.0048
   1000004    3343.2846
   2000004    4357.0504
   1000005    1671.3598
   2000005    3432.4942
   1000006    3428.5062
   2000006    4141.5806
   1000011    2408.2363
   2000011    4885.0028
   1000012    2406.5008
   1000013    2408.216
   2000013    4884.9716
   1000014    2406.4806
   1000015    2352.196
   2000015    2530.343
   1000016    2350.7176
   1000021    3194.4839
   1000022    132.1671
   1000023   -178.85216
   1000025    198.6998
   1000035    4787.2034
   1000024    175.44573
   1000037    4787.2483

BLOCK ALPHA
      -0.02797051

BLOCK HMIX Q=  3768.2138
   1    158.15858
   2    35.478093
   3    243.01339
   4    976058.5

BLOCK STOPMIX
   1   1    0.99620166
   1   2    0.087076192
   2   1   -0.087076192
   2   2    0.99620166

BLOCK SBOTMIX
   1   1    0.001016161
   1   2    0.99999948
   2   1   -0.99999948
   2   2    0.001016161

BLOCK STAUMIX
   1   1    0.99991087
   1   2    0.013351415
   2   1   -0.013351415
   2   2    0.99991087

BLOCK NMIX
   1   1    0.79572722
   1   2   -0.0063439305
   1   3    0.48081203
   1   4   -0.36823598
   2   1    0.091879447
   2   2   -0.010866478
   2   3   -0.69687907
   2   4   -0.71119592
   3   1   -0.59864542
   3   2   -0.010371832
   3   3    0.53214505
   3   4   -0.59861318
   4   1    0.00016262727
   4   2   -0.99986704
   4   3   -0.00099706848
   4   4    0.016275138

BLOCK UMIX
   1   1   -0.0014105765
   1   2    0.99999901
   2   1    0.99999901
   2   2    0.0014105765

BLOCK VMIX
   1   1   -0.023021101
   1   2    0.99973498
   2   1    0.99973498
   2   2    0.023021101

BLOCK HIGGSBOUNDSINPUTHIGGSCOUPLINGSFERMIONS
       0, 1258.6951,3,36,15,15

BLOCK HIGGSBOUNDSINPUTHIGGSCOUPLINGSBOSONS
       0,4,36,21,21,23

BLOCK SPHENOLOWENERGY
   1    0.00034655959
   2    1.5886559e-06
   3    3.5269674e-05
   4    2.9699607e-15
   5    1.2687245e-10
   6    2.6506984e-08
   7    9.9047644e-14
   8    4.2312854e-09
   9    8.9591644e-07
   10    8.9251635e-05
   11    0.92193522
   12    0.54192858
   13    19.325259
   14    0
   15    0
   16    0.002157424
   17    2.2816688e-15
   18    2.4809396e-11
   19    8.2930038e-11
   20    1.0739235e-15
   21    4.5913281e-11
   22    1.3016945e-08
   23    0
   24    0
   25    0
   26    0
   27    0
   28    0
   29    0
   30    0
   31    0
   39    6.7043087e-05
   40    0
   41    0
   42    0

BLOCK FWCOEF Q=  160
   305   4422   0   0   -0.18881911
   305   4422   0   2   -0.21308109
   305   4322   0   2   -0.00048036514
   305   6421   0   0   -0.095227835
   305   6421   0   2   -0.13346996
   305   6321   0   2   -0.00075710705
   3051111   4133   0   0    1.624794
   3051111   4133   0   2    1.6253958
   3051111   4233   0   2    0.00012381838
   3051111   4137   0   0   -4.4474861
   3051111   4137   0   2   -4.4475352
   3051111   4237   0   2   -0.00091670334
   3051313   4133   0   0    1.624794
   3051313   4133   0   2    1.6253952
   3051313   4233   0   2    0.00012380819
   3051313   4137   0   0   -4.4474861
   3051313   4137   0   2   -4.4475358
   3051313   4237   0   2   -0.00091669424
   3051212   4137   0   0    1.5053501
   3051212   4137   0   2    1.5053608
   3051212   4237   0   2    0.0001983074
   3051414   4137   0   0    1.5053501
   3051414   4137   0   2    1.5053608
   3051414   4237   0   2    0.00019830956
   3051616   4137   0   0    1.5053501
   3051616   4137   0   2    1.5053608
   3051616   4237   0   2    0.00019891862

BLOCK IMFWCOEF Q=  160
   305   4422   0   0    3.8582415e-07
   305   4422   0   2    1.3827608e-05
   305   4322   0   2    4.2040885e-06
   305   6421   0   0    3.3048391e-07
   305   6421   0   2   -1.2174567e-05
   305   6321   0   2    1.4873385e-06
   3051111   4133   0   2    7.878644e-07
   3051111   4233   0   2    5.4171827e-06
   3051111   4137   0   2   -4.2303103e-06
   3051111   4237   0   2   -4.0174629e-05
   3051313   4133   0   2    7.8786082e-07
   3051313   4233   0   2    5.4171794e-06
   3051313   4137   0   2   -4.2303142e-06
   3051313   4237   0   2   -4.0174645e-05
   3051212   4137   0   2    9.1646639e-07
   3051212   4237   0   2    8.6909181e-06
   3051414   4137   0   2    9.1646608e-07
   3051414   4237   0   2    8.6909181e-06
   3051616   4137   0   2    9.1629311e-07
   3051616   4237   0   2    8.6909177e-06

DECAY 23  2.4952


DECAY 24  2.085


DECAY 1000011  3.0027988
    0.61526973   2    1000022    11
    0.37961718   2    1000025    11
    0.0050991974   2    1000023    11

DECAY 2000011  24.492973
    0.63360734   2    1000022    11
    0.35795538   2    1000025    11
    0.0084372426   2    1000023    11

DECAY 1000013  3.0248405
    0.6124758   2    1000022    13
    0.37890698   2    1000025    13
    0.0086034296   2    1000023    13

DECAY 2000013  24.583085
    0.63170552   2    1000022    13
    0.35716043   2    1000025    13
    0.0092976385   2    1000023    13
    0.0018356756   2   -1000024    14

DECAY 1000015  9.0289677
    0.36159609   2    1000022    15
    0.32829707   2    1000023    15
    0.30993541   2    1000025    15
    0.00017141816   2   -1000024    16

DECAY 2000015  25.747035
    0.36826016   2    1000022    15
    0.25492786   2   -1000024    16
    0.24825464   2    1000025    15
    0.12828696   2    1000023    15
    0.00014004173   2    1000016   -24

DECAY 1000012  3.0089545
    0.65130759   2    1000022    12
    0.33248797   2    1000025    12
    0.012512567   2    1000023    12
    0.0036918745   2    1000024    11

DECAY 1000014  3.0309799
    0.64656919   2    1000022    14
    0.33006901   2    1000025    14
    0.012421534   2    1000023    14
    0.010940259   2    1000024    13

DECAY 1000016  9.0277707
    0.67576324   2    1000024    15
    0.21198712   2    1000022    16
    0.10817804   2    1000025    16
    0.004071592   2    1000023    16

DECAY 1000001  2.49115
    0.81218396   2    1000021    1
    0.12909758   2    1000022    1
    0.054334991   2    1000025    1
    0.0043600883   2    1000023    1

DECAY 2000001  34.565829
    0.93741237   2    1000021    1
    0.03967059   2    1000022    1
    0.022387968   2    1000025    1
    0.00052827202   2    1000023    1

DECAY 1000003  2.5007683
    0.80902051   2    1000021    3
    0.12939004   2    1000022    3
    0.05508903   2    1000025    3
    0.0059970216   2    1000023    3
    0.00050339561   2   -1000024    4

DECAY 2000003  34.585163
    0.93687395   2    1000021    3
    0.039714738   2    1000022    3
    0.022456532   2    1000025    3
    0.00066720193   2    1000023    3
    0.00028752121   2   -1000024    4

DECAY 1000005  23.538782
    0.4751925   2   -1000024    6
    0.23604605   2    1000023    5
    0.1504503   2    1000025    5
    0.13831115   2    1000022    5

DECAY 2000005  100.62392
    0.68925897   2   -1000024    6
    0.11539513   2    1000023    5
    0.068573956   2    1000025    5
    0.058205386   2    1000022    5
    0.0482459   2    1000021    5
    0.010071181   2    1000005    36
    0.010071019   2    1000005    35
    0.00011604822   2    1000005    25

DECAY 1000002  2.4837512
    0.8048639   2    1000021    2
    0.10820638   2    1000022    2
    0.080496995   2    1000025    2
    0.006254857   2    1000024    1
    0.0001778644   2    1000023    2

DECAY 2000002  83.255038
    0.88344319   2    1000021    2
    0.073864019   2    1000022    2
    0.041709513   2    1000025    2
    0.00098327741   2    1000023    2

DECAY 1000004  2.4932759
    0.80171339   2    1000021    4
    0.1078585   2    1000022    4
    0.08036132   2    1000025    4
    0.0096460138   2    1000024    3
    0.00042077915   2    1000023    4

DECAY 2000004  83.258027
    0.88340974   2    1000021    4
    0.07386388   2    1000022    4
    0.041714776   2    1000025    4
    0.00099276502   2    1000023    4

DECAY 1000006  102.10491
    0.34531067   2    1000023    6
    0.23901327   2    1000024    5
    0.23446553   2    1000025    6
    0.10404737   2    1000022    6
    0.034184867   2    1000021    6
    0.022726255   3    1000022    24    5
    0.020122363   2    1000005    37
    0.00012150579   2    1000005    24

DECAY 2000006  251.74105
    0.33213685   2    1000024    5
    0.20271626   2    1000021    6
    0.16796615   2    1000023    6
    0.13778602   2    1000025    6
    0.063856407   2    1000022    6
    0.043821794   2    2000005    24
    0.029735035   2    1000006    25
    0.021960865   2    1000006    23

DECAY 1000024  6.7095915e-05
    0.33406038   3    1000022   -1    2
    0.33278706   3    1000022   -3    4
    0.11135449   3    1000022   -11    12
    0.11135372   3    1000022   -13    14
    0.11044436   3    1000022   -15    16

DECAY 1000037  248.66293
    0.066676966   2    1000004   -3
    0.066676683   2    1000002   -1
    0.066640795   2   -1000003    4
    0.066640544   2   -1000001    2
    0.059458896   2    1000006   -5
    0.059125919   2   -2000005    6
    0.048774888   2    1000016   -15
    0.048752001   2   -1000015    16
    0.047298372   2    1000014   -13
    0.047297837   2    1000012   -11
    0.047277194   2   -1000013    14
    0.047276656   2   -1000011    12
    0.042464672   2    1000024    25
    0.040112596   2    1000023    24
    0.039741904   2    1000024    23
    0.038645799   2    1000024    35
    0.038644201   2    1000024    36
    0.037864627   2    37    1000023
    0.029039695   2    1000025    24
    0.021887319   2    37    1000025
    0.01786194   2    37    1000022
    0.010336746   2    1000022    24
    0.0051651998   3    1000024    6   -6
    0.0030598534   3    1000023   -5    6
    0.0022306672   3    1000025   -5    6
    0.00079986532   3    1000022   -5    6
    0.00023937824   2    2000006   -5

DECAY 1000022 -1


DECAY 1000023  0.00023587943
    0.2036708   3    1000022    12   -12
    0.15228696   3    1000022    1   -1
    0.15228062   3    1000022    3   -3
    0.1409731   3    1000022    5   -5
    0.11877358   3    1000022    2   -2
    0.11773197   3    1000022    4   -4
    0.034363246   3    1000022    11   -11
    0.034361032   3    1000022    13   -13
    0.033755407   3    1000022    15   -15
    0.011791271   2    1000022    22

DECAY 1000025  2.3554306e-05
    0.077279896   3    1000024    1   -2
    0.077279896   3   -1000024   -1    2
    0.076173235   3    1000024    3   -4
    0.076173235   3   -1000024   -3    4
    0.055385574   3    1000022    12   -12
    0.052594105   3    1000023    12   -12
    0.041497982   3    1000022    5   -5
    0.041147106   3    1000022    1   -1
    0.041146646   3    1000022    3   -3
    0.039331227   3    1000023    1   -1
    0.039320947   3    1000023    3   -3
    0.032176012   3    1000022    2   -2
    0.032057515   3    1000022    4   -4
    0.030674215   3    1000023    2   -2
    0.029061711   3    1000023    4   -4
    0.02575963   3    1000024    11   -12
    0.02575963   3   -1000024   -11    12
    0.025759356   3    1000024    13   -14
    0.025759356   3   -1000024   -13    14
    0.025019183   3    1000024    15   -16
    0.025019183   3   -1000024   -15    16
    0.023480971   2    1000023    22
    0.023476379   3    1000023    5   -5
    0.0091823692   3    1000022    13   -13
    0.0091823446   3    1000022    11   -11
    0.0091078164   3    1000022    15   -15
    0.0088765544   3    1000023    11   -11
    0.0088729046   3    1000023    13   -13
    0.0079157866   3    1000023    15   -15
    0.0055292339   2    1000022    22

DECAY 1000035  249.41221
    0.039658087   2    1000024   -24
    0.039658087   2   -1000024    24
    0.038504781   2    37   -1000024
    0.038504781   2   -37    1000024
    0.033243666   2    1000004   -4
    0.033243666   2   -1000004    4
    0.033243543   2    1000002   -2
    0.033243543   2   -1000002    2
    0.033211972   2    1000003   -3
    0.033211972   2   -1000003    3
    0.033211829   2    1000001   -1
    0.033211829   2   -1000001    1
    0.02991166   2    2000005   -5
    0.02991166   2   -2000005    5
    0.029205102   2    1000006   -6
    0.029205102   2   -1000006    6
    0.024324337   2    1000016   -16
    0.024324337   2   -1000016    16
    0.024291592   2    1000015   -15
    0.024291592   2   -1000015    15
    0.023587947   2    1000014   -14
    0.023587947   2   -1000014    14
    0.02358768   2    1000012   -12
    0.02358768   2   -1000012    12
    0.023556748   2    1000013   -13
    0.023556748   2   -1000013    13
    0.02355648   2    1000011   -11
    0.02355648   2   -1000011    11
    0.022435958   2    1000023    23
    0.021611039   2    1000023    25
    0.021423918   2    1000023    35
    0.017463793   2    1000025    25
    0.01634289   2    1000023    36
    0.012634517   2    1000025    23
    0.011171283   2    1000025    35
    0.010667111   2    1000025    36
    0.0090482591   2    1000022    35
    0.008772622   2    1000022    36
    0.0062430604   2    1000022    25
    0.0045392283   2    1000022    23
    0.0030512778   3    1000024    5   -6
    0.0030512778   3   -1000024   -5    6
    0.0025723618   3    1000023    6   -6
    0.0018723392   3    1000025    6   -6
    0.00067121388   3    1000022    6   -6
    0.00011388579   2    2000006   -6
    0.00011388579   2   -2000006    6

DECAY 1000021  50.36384
    0.49513507   2    1000005   -5
    0.49513507   2   -1000005    5
    0.0023833555   3    1000024    5   -6
    0.0023833555   3   -1000024   -5    6
    0.0018854503   3    1000023    6   -6
    0.0013987361   3    1000025    6   -6
    0.0005383066   3    1000022    6   -6
    0.00039602568   3    1000023    5   -5
    0.00023521751   3    1000025    5   -5
    0.00020093232   3    1000022    5   -5

DECAY 25  0.0035740983
    0.63447542   2   -5    5
    0.16787697   2   -24    24
    0.072575975   2   -15    15
    0.072243259   2    21    21
    0.030009561   2   -4    4
    0.018908511   2    23    23
    0.0022576998   2    22    22
    0.0011620679   2    22    23
    0.00025171736   2   -13    13
    0.00023800047   2   -3    3
    6.5804579e-07   2   -1    1
    1.5465776e-07   2   -2    2
    5.6589354e-09   2   -11    11

DECAY 35  21.094571
    0.81444632   2   -5    5
    0.13363738   2   -15    15
    0.015100492   2    1000023    1000025
    0.014926436   2    1000022    1000022
    0.010713015   2    1000022    1000023
    0.0080461215   2    1000025    1000025
    0.0013379718   2   -6    6
    0.00062769849   2    1000023    1000023
    0.00046234855   2   -13    13
    0.00030890048   2   -3    3
    0.00017754241   2   -1000024    1000024
    0.00012778907   2    1000022    1000025
    4.8458837e-05   2    21    21
    2.9138055e-05   2    25    25
    5.4487797e-06   2   -24    24
    4.0049291e-06   2    23    23
    8.5400736e-07   2   -1    1
    3.0542697e-08   2    22    22
    2.0929514e-08   2   -4    4
    1.9233866e-08   2    22    23
    1.0387635e-08   2   -11    11
    1.0792412e-13   2   -2    2

DECAY 36  20.477927
    0.81303336   2   -5    5
    0.13340442   2   -15    15
    0.017995706   2    1000022    1000022
    0.012455517   2    1000023    1000025
    0.0110573   2    1000025    1000025
    0.0087677271   2    1000022    1000023
    0.0014567033   2   -6    6
    0.00064669794   2    1000023    1000023
    0.00046153633   2   -13    13
    0.00030835516   2   -3    3
    0.0002051208   2   -1000024    1000024
    0.00012174073   2    1000022    1000025
    7.8753838e-05   2    21    21
    6.0348225e-06   2    23    25
    8.5249996e-07   2   -1    1
    9.6403296e-08   2    22    22
    4.491965e-08   2    22    23
    1.9849327e-08   2   -4    4
    1.0369381e-08   2   -11    11
    1.0236171e-13   2   -2    2
    1.5225504e-37   2    25    25

DECAY 37  19.214149
    0.80512237   2   -5    6
    0.13820246   2   -15    16
    0.027734044   2    1000024    1000025
    0.026604514   2    1000022    1000024
    0.0012421793   2   -5    4
    0.0004885978   2   -13    14
    0.00029942431   2   -3    4
    0.00027344151   2    1000023    1000024
    1.3829162e-05   2   -3    2
    8.8704681e-06   2   -5    2
    6.5487128e-06   2    24    25
    2.7387055e-06   2   -3    6
    8.3075982e-07   2   -1    2
    1.0664019e-07   2   -1    6
    3.9289562e-08   2   -1    4
    1.1428354e-08   2   -11    12
    6.03291e-11   2    24    35
    5.5299857e-11   2    24    36

DECAY 6  2.43
    1   2    5    24

DECAY 15 -1
