BLOCK SPINFO
   1   SPheno
   2   v4.0.5be

BLOCK SPHENOINFO
   1   2
   2   2

BLOCK MODSEL
   1   0

BLOCK MINPAR
   3    42.350637
   4   -1

BLOCK EXTPAR
   0    1203.8951
   1    1022.7225
   2    374.08871
   3    3000
   11    3806.2891
   12   -405.35213
   13   -1811.0674
   23   -435.8987
   25    42.069341
   26    4149.0984
   31    645.50128
   32    645.50128
   33    1069.6348
   34    934.2791
   35    934.2791
   36    738.39146
   41    5000
   42    5000
   43    1039.1665
   44    5000
   45    5000
   46    1700.8956
   47    5000
   48    5000
   49    1677.0356

BLOCK SMINPUTS
   1    127.90897
   2    1.1663787e-05
   3    0.1184
   4    91.1876
   5    4.18
   6    173.2
   7    1.777
   8    0
   11    0.00051099893
   12    0
   13    0.10565837
   14    0
   21    0.005
   22    0.0025
   23    0.095
   24    1.27

BLOCK GAUGE Q=  1203.8951
   1    0.35536298
   2    0.66519887
   3    1.219778

BLOCK YU Q=  1203.8951
   1   1    8.3867405e-06
   2   2    0.0042604642
   3   3    1.0131856

BLOCK YD Q=  1203.8951
   1   1    0.00070898846
   2   2    0.013470781
   3   3    0.70309438

BLOCK YE Q=  1203.8951
   1   1    0.00012372367
   2   2    0.025582131
   3   3    0.43024936

BLOCK AU Q=  1203.8951
   1   1    0
   2   2    0
   3   3    3806.2893

BLOCK AD Q=  1203.8951
   1   1    0
   2   2    0
   3   3   -405.35222

BLOCK AE Q=  1203.8951
   1   1    0
   2   2    0
   3   3   -1811.0674

BLOCK MSOFT Q=  1203.8951
   1    1022.7225
   2    374.08871
   3    3000
   21    16929268
   22   -118799.55
   31    645.50128
   32    645.50128
   33    1069.6348
   34    934.2791
   35    934.2791
   36    738.39146
   41    5000
   42    5000
   43    1039.1665
   44    5000
   45    5000
   46    1700.8956
   47    5000
   48    5000
   49    1677.0356

BLOCK MASS
   6    173.2
   23    91.1876
   24    80.429995
   15    1.777
   25    125.21514
   35    4144.1588
   36    4149.0984
   37    4145.5814
   1000001    5018.2943
   2000001    5007.2755
   1000002    5017.8724
   2000002    5010.7664
   1000003    5018.3031
   2000003    5007.2901
   1000004    5017.8806
   2000004    5010.7675
   1000005    977.48663
   2000005    1708.9182
   1000006    881.62099
   2000006    1643.9755
   1000011    658.77869
   2000011    929.93849
   1000012    653.68625
   1000013    658.83096
   2000013    930.02282
   1000014    653.7452
   1000015    766.87014
   2000015    1090.6134
   1000016    1086.4106
   1000021    3172.1139
   1000022    362.51006
   1000023   -444.2553
   1000025    478.81189
   1000035    1021.8592
   1000024    364.61106
   1000037    482.55704

BLOCK ALPHA
      -0.023647753

BLOCK HMIX Q=  1203.8951
   1   -435.8987
   2    42.069341
   3    244.19006
   4    17215018

BLOCK STOPMIX
   1   1   -0.94883298
   1   2    0.31577838
   2   1   -0.31577838
   2   2   -0.94883298

BLOCK SBOTMIX
   1   1   -0.99959896
   1   2    0.028318231
   2   1   -0.028318231
   2   2   -0.99959896

BLOCK STAUMIX
   1   1   -0.048936307
   1   2    0.9988019
   2   1   -0.9988019
   2   2   -0.048936307

BLOCK NMIX
   1   1    0.023340729
   1   2   -0.81343499
   1   3   -0.45124912
   1   4   -0.36626896
   2   1    0.021600166
   2   2   -0.070042048
   2   3    0.70220269
   2   4   -0.70819413
   3   1    0.047269774
   3   2    0.57738316
   3   3   -0.55029732
   3   4   -0.6013045
   4   1   -0.99837579
   4   2    0.0068047383
   4   3   -0.021411997
   4   4   -0.052354659

BLOCK UMIX
   1   1   -0.78595248
   1   2   -0.6182869
   2   1    0.6182869
   2   2   -0.78595248

BLOCK VMIX
   1   1   -0.86437453
   1   2    0.50284856
   2   1    0.50284856
   2   2    0.86437453

BLOCK HIGGSBOUNDSINPUTHIGGSCOUPLINGSFERMIONS
       0, 1769.8295,3,36,15,15

BLOCK HIGGSBOUNDSINPUTHIGGSCOUPLINGSBOSONS
       0,4,36,21,21,23

BLOCK SPHENOLOWENERGY
   1    0.00026677703
   2    1.5996638e-06
   3    3.5194322e-05
   4    2.9347716e-15
   5    1.2536791e-10
   6    2.6112603e-08
   7    1.000281e-13
   8    4.2731215e-09
   9    9.0176783e-07
   10    9.641041e-05
   11    0.99588263
   12    0.54232956
   13    19.377519
   14    0
   15    0
   16    0.0021583083
   17    2.2816688e-15
   18    2.4773253e-11
   19    8.2835827e-11
   20   -2.7500532e-14
   21   -1.1761654e-09
   22   -2.0828555e-07
   23    0
   24    0
   25    0
   26    0
   27    0
   28    0
   29    0
   30    0
   31    0
   39    9.3064743e-05
   40    0
   41    0
   42    0

BLOCK FWCOEF Q=  160
   305   4422   0   0   -0.18881911
   305   4422   0   2   -0.12037046
   305   4322   0   2    0.00021310191
   305   6421   0   0   -0.095227835
   305   6421   0   2   -0.064360343
   305   6321   0   2    3.0300903e-05
   3051111   4133   0   0    1.5844878
   3051111   4133   0   2    1.5854445
   3051111   4233   0   2    0.00030301787
   3051111   4137   0   0   -4.4071799
   3051111   4137   0   2   -4.3997322
   3051111   4237   0   2   -0.0023840526
   3051313   4133   0   0    1.5844878
   3051313   4133   0   2    1.5854387
   3051313   4233   0   2    0.0003030159
   3051313   4137   0   0   -4.4071799
   3051313   4137   0   2   -4.3997379
   3051313   4237   0   2   -0.0023840587
   3051212   4137   0   0    1.5053501
   3051212   4137   0   2    1.503765
   3051212   4237   0   2    0.00052045958
   3051414   4137   0   0    1.5053501
   3051414   4137   0   2    1.503765
   3051414   4237   0   2    0.0005204596
   3051616   4137   0   0    1.5053501
   3051616   4137   0   2    1.5037643
   3051616   4237   0   2    0.0005204665

BLOCK IMFWCOEF Q=  160
   305   4422   0   0    3.8589544e-07
   305   4422   0   2   -4.4771855e-05
   305   4322   0   2    5.0548002e-06
   305   6421   0   0    3.3054497e-07
   305   6421   0   2    1.0765082e-06
   305   6321   0   2    2.2280105e-06
   3051111   4133   0   2   -2.5402228e-06
   3051111   4233   0   2    5.8669615e-06
   3051111   4137   0   2    1.6959645e-05
   3051111   4237   0   2   -4.6166057e-05
   3051313   4133   0   2   -2.5407371e-06
   3051313   4233   0   2    5.8669296e-06
   3051313   4137   0   2    1.6960273e-05
   3051313   4237   0   2   -4.6166169e-05
   3051212   4137   0   2   -2.9303363e-06
   3051212   4237   0   2    1.0078454e-05
   3051414   4137   0   2   -2.9303308e-06
   3051414   4237   0   2    1.0078454e-05
   3051616   4137   0   2   -2.9442359e-06
   3051616   4237   0   2    1.007845e-05

DECAY 23  2.4952


DECAY 24  2.085


DECAY 1000011  3.3456219
    0.51648061   2   -1000024    12
    0.27027394   2    1000022    11
    0.14231908   2   -1000037    12
    0.070044515   2    1000025    11
    0.00088184509   2    1000023    11

DECAY 2000011  0.0087682465
    0.6430795   2    1000025    11
    0.20879326   2    1000022    11
    0.14810618   2    1000023    11

DECAY 1000013  3.3491981
    0.51604208   2   -1000024    14
    0.27030167   2    1000022    13
    0.14223063   2   -1000037    14
    0.070169342   2    1000025    13
    0.001256272   2    1000023    13

DECAY 2000013  0.023979876
    0.31783095   2    1000025    13
    0.20245959   2    1000023    13
    0.16657664   2   -1000037    14
    0.15032197   2    1000022    13
    0.13839242   2   -1000024    14
    0.024418425   2    1000013    25

DECAY 1000015  2.6543093
    0.29258162   2   -1000024    16
    0.22903914   2    1000023    15
    0.21157024   2   -1000037    16
    0.15794218   2    1000022    15
    0.10886681   2    1000025    15

DECAY 2000015  13.631097
    0.32579848   2   -1000024    16
    0.2167396   2    1000022    15
    0.18800583   2   -1000037    16
    0.14727065   2    1000025    15
    0.10312032   2    1000023    15
    0.0087977591   2    1000015    23
    0.0087838784   2    1000015    25
    0.001483483   2    1000035    15

DECAY 1000012  3.4817064
    0.58746699   2    1000024    11
    0.27028949   2    1000022    12
    0.086536313   2    1000037    11
    0.054114544   2    1000025    12
    0.0015926649   2    1000023    12

DECAY 1000014  3.4853611
    0.5874517   2    1000024    13
    0.27007368   2    1000022    14
    0.086797744   2    1000037    13
    0.054085252   2    1000025    14
    0.001591631   2    1000023    14

DECAY 1000016  13.788381
    0.496212   2    1000024    15
    0.22808496   2    1000037    15
    0.18681603   2    1000022    16
    0.068640033   2    1000025    16
    0.017300927   2    1000015    24
    0.0016007744   2    1000023    16
    0.0013452786   2    1000035    16

DECAY 2000001  144.22793
    0.98219336   2    1000021    1
    0.017744084   2    1000035    1

DECAY 1000001  208.82882
    0.68385021   2    1000021    1
    0.12930243   2   -1000024    2
    0.079379804   2   -1000037    2
    0.069967656   2    1000022    1
    0.033620046   2    1000025    1
    0.003311294   2    1000035    1
    0.00056856118   2    1000023    1

DECAY 2000003  144.26495
    0.98195182   2    1000021    3
    0.017739642   2    1000035    3

DECAY 1000003  208.84943
    0.68378712   2    1000021    3
    0.12929201   2   -1000024    4
    0.079378546   2   -1000037    4
    0.069978324   2    1000022    3
    0.033642495   2    1000025    3
    0.0033110101   2    1000035    3
    0.00061049165   2    1000023    3

DECAY 1000005  26.568836
    0.40675325   2   -1000037    6
    0.22825368   2   -1000024    6
    0.13956575   2    1000022    5
    0.11232537   2    1000023    5
    0.090666433   2    1000025    5
    0.022435517   2    1000006   -24

DECAY 2000005  31.100899
    0.28953597   2   -1000037    6
    0.23266713   2    1000023    5
    0.17229856   2   -1000024    6
    0.1443459   2    1000025    5
    0.093528714   2    1000022    5
    0.030667787   2    1000006   -24
    0.01299164   2    1000005    23
    0.012800134   2    1000035    5
    0.011164176   2    1000005    25

DECAY 2000002  152.30419
    0.9324978   2    1000021    2
    0.067267664   2    1000035    2
    0.00016118098   2    1000025    2

DECAY 1000002  208.82874
    0.68363996   2    1000021    2
    0.15637999   2    1000024    1
    0.068546214   2    1000022    2
    0.052501034   2    1000037    1
    0.035635865   2    1000025    2
    0.0028407412   2    1000035    2
    0.00045620077   2    1000023    2

DECAY 2000004  152.3078
    0.93247602   2    1000021    4
    0.067266115   2    1000035    4
    0.00016539175   2    1000025    4

DECAY 1000004  208.84921
    0.68357674   2    1000021    4
    0.15639767   2    1000024    3
    0.068540728   2    1000022    4
    0.052548395   2    1000037    3
    0.035635543   2    1000025    4
    0.0028404877   2    1000035    4
    0.00046043583   2    1000023    4

DECAY 1000006  21.574641
    0.24839438   2    1000037    5
    0.23973347   2    1000025    6
    0.22422805   2    1000023    6
    0.17876559   2    1000024    5
    0.0734139   2    1000022    6
    0.034742174   2    1000022    4
    0.00053503368   3    1000022    24    5
    0.00018739653   2    1000023    4

DECAY 2000006  225.95389
    0.35181707   2    1000005    24
    0.21208061   2    1000006    23
    0.17933261   2    1000006    25
    0.067326284   2    1000037    5
    0.061973519   2    1000023    6
    0.060375136   2    1000024    5
    0.03190462   2    1000025    6
    0.029752593   2    1000022    6
    0.0054375673   2    1000035    6

DECAY 1000024  2.3156274e-11
    0.59254644   3    1000022   -1    2
    0.20094397   3    1000022   -11    12
    0.19664719   3    1000022   -13    14
    0.0098623988   3    1000022   -3    4

DECAY 1000037  0.44449228
    0.6082998   2    1000022    24
    0.39107335   2    1000024    23
    0.00020435006   3    1000023   -1    2
    0.00020336565   3    1000023   -3    4

DECAY 1000022 -1


DECAY 1000023  0.27482011
    0.15859294   3    1000024    1   -2
    0.15859294   3   -1000024   -1    2
    0.15853756   3    1000024    3   -4
    0.15853756   3   -1000024   -3    4
    0.052872465   3    1000024    15   -16
    0.052872465   3   -1000024   -15    16
    0.052869683   3    1000024    11   -12
    0.052869683   3   -1000024   -11    12
    0.052869654   3    1000024    13   -14
    0.052869654   3   -1000024   -13    14
    0.0096809384   3    1000022    12   -12
    0.0072250147   3    1000022    1   -1
    0.0072249564   3    1000022    3   -3
    0.0071241731   3    1000022    5   -5
    0.0056351597   3    1000022    2   -2
    0.005624339   3    1000022    4   -4
    0.0016383907   3    1000022    15   -15
    0.0016274411   3    1000022    13   -13
    0.0016273895   3    1000022    11   -11
    0.0011075791   2    1000022    22

DECAY 1000025  0.55513512
    0.4970581   2    1000024   -24
    0.4970581   2   -1000024    24
    0.0056069527   2    1000022    23

DECAY 1000035  5.9490489
    0.091341312   2    1000023    25
    0.091100362   2    1000023    23
    0.08477234   2    1000037   -24
    0.08477234   2   -1000037    24
    0.081926463   2    1000015   -15
    0.081926463   2   -1000015    15
    0.073474103   2    1000025    25
    0.038495485   2    1000012   -12
    0.038495485   2   -1000012    12
    0.038485865   2    1000014   -14
    0.038485865   2   -1000014    14
    0.03579175   2    1000011   -11
    0.03579175   2   -1000011    11
    0.03578379   2    1000013   -13
    0.03578379   2   -1000013    13
    0.014329427   2    1000024   -24
    0.014329427   2   -1000024    24
    0.013095386   2    1000022    25
    0.012698088   2    2000011   -11
    0.012698088   2   -2000011    11
    0.012675934   2    2000013   -13
    0.012675934   2   -2000013    13
    0.011655766   2    1000025    23
    0.0037687602   2    1000022    23
    0.0009778443   3    1000023    6   -6
    0.00089650205   3    1000037    5   -6
    0.00089650205   3   -1000037   -5    6
    0.00079077793   3    1000025    6   -6
    0.00046931186   3    1000024    5   -6
    0.00046931186   3   -1000024   -5    6
    0.00029492699   3    1000022    6   -6
    0.00028503462   2    1000005   -5
    0.00028503462   2   -1000005    5

DECAY 1000021  289.59215
    0.14771306   2    1000006   -6
    0.14771306   2   -1000006    6
    0.13281103   2    1000005   -5
    0.13281103   2   -1000005    5
    0.081651583   2    2000005   -5
    0.081651583   2   -2000005    5
    0.078756992   2    2000006   -6
    0.078756992   2   -2000006    6
    0.058965071   2    1000006   -4
    0.058965071   2   -1000006    4

DECAY 25  0.0038866044
    0.57085464   2   -5    5
    0.23326413   2   -24    24
    0.068787978   2    21    21
    0.065977075   2   -15    15
    0.028395113   2   -4    4
    0.028357953   2    23    23
    0.0023872641   2    22    22
    0.001530822   2    22    23
    0.0002286774   2   -13    13
    0.00021559943   2   -3    3
    5.9610994e-07   2   -1    1
    1.4632659e-07   2   -2    2
    5.1409154e-09   2   -11    11

DECAY 35  205.02659
    0.64961507   2   -5    5
    0.06720399   2   -15    15
    0.047451636   2   -1000024    1000037
    0.047451636   2   -1000037    1000024
    0.042287215   2   -1000024    1000024
    0.024928105   2    1000022    1000023
    0.02177481   2   -1000037    1000037
    0.020946358   2    1000022    1000022
    0.01328044   2    1000025    1000025
    0.012200698   2    1000023    1000025
    0.010396082   2    1000023    1000035
    0.0073468656   2    1000025    1000035
    0.007110733   2    1000022    1000025
    0.0062178976   2   -2000015    1000015
    0.0062178976   2   -1000015    2000015
    0.0030083702   2    1000022    1000035
    0.0025438308   2   -2000005    1000005
    0.0025438308   2   -1000005    2000005
    0.0019443478   2   -2000006    1000006
    0.0019443478   2   -1000006    2000006
    0.0012268628   2   -1000006    1000006
    0.00070920103   2   -2000006    2000006
    0.00061798655   2   -6    6
    0.00049771208   2    1000023    1000023
    0.00022298406   2   -13    13
    0.000153692   2   -3    3
    6.4021219e-05   2   -1000015    1000015
    5.742905e-05   2   -2000015    2000015
    1.5397245e-05   2    1000035    1000035
    1.1261598e-05   2   -1000005    1000005
    4.3609851e-06   2    21    21
    3.6014201e-06   2   -2000005    2000005
    4.9928188e-07   2    25    25
    4.2487237e-07   2   -1    1
    8.17187e-08   2    23    23
    6.3321767e-08   2    22    23
    1.9591843e-08   2    22    22
    1.6777171e-08   2   -1000011    1000011
    1.6571095e-08   2   -1000013    1000013
    1.6570573e-08   2   -24    24
    1.0196994e-08   2   -2000011    2000011
    1.0133035e-08   2   -2000013    2000013
    6.9799999e-09   2   -4    4
    5.0075944e-09   2   -11    11
    7.3705146e-10   2   -2000013    1000013
    7.3705146e-10   2   -1000013    2000013
    3.5975351e-14   2   -2    2
    1.7240973e-14   2   -2000011    1000011
    1.7240973e-14   2   -1000011    2000011

DECAY 36  188.42065
    0.62679829   2   -5    5
    0.064826214   2   -15    15
    0.053491205   2   -1000024    1000037
    0.053491205   2   -1000037    1000024
    0.044270532   2   -1000024    1000024
    0.02912385   2    1000022    1000023
    0.021946179   2   -1000037    1000037
    0.021798236   2    1000022    1000022
    0.013770275   2    1000025    1000025
    0.013594193   2    1000023    1000025
    0.011113148   2    1000023    1000035
    0.008124804   2    1000025    1000035
    0.0071279327   2    1000022    1000025
    0.006825769   2   -2000015    1000015
    0.006825769   2   -1000015    2000015
    0.0033721412   2    1000022    1000035
    0.0031895157   2   -2000006    1000006
    0.0031895157   2   -1000006    2000006
    0.0027751299   2   -2000005    1000005
    0.0027751299   2   -1000005    2000005
    0.00062489406   2    1000023    1000023
    0.00055627223   2   -6    6
    0.0002150877   2   -13    13
    0.00014825026   2   -3    3
    1.7594698e-05   2    1000035    1000035
    8.2303682e-06   2    21    21
    4.0982895e-07   2   -1    1
    1.9567863e-07   2    23    25
    1.7129843e-08   2    22    23
    6.2298845e-09   2   -4    4
    4.8302864e-09   2   -11    11
    7.9231784e-10   2   -2000013    1000013
    7.9231784e-10   2   -1000013    2000013
    6.235523e-10   2    22    22
    1.7153459e-11   2    23    35
    3.2108958e-14   2   -2    2
    1.8532396e-14   2   -2000011    1000011
    1.8532396e-14   2   -1000011    2000011
    1.0033554e-39   2    25    25

DECAY 37  206.36836
    0.64765112   2   -5    6
    0.082708764   2    1000022    1000037
    0.076573995   2    1000024    1000025
    0.072053914   2   -15    16
    0.057362957   2    1000023    1000024
    0.020541702   2    1000023    1000037
    0.014330375   2    1000035    1000037
    0.012447462   2   -1000015    1000016
    0.0058091026   2   -2000005    1000006
    0.0053968816   2    1000024    1000035
    0.0033132623   2   -1000005    2000006
    0.00096038247   2   -5    4
    0.00039264053   2   -1000005    1000006
    0.00025473623   2   -13    14
    0.00013763538   2   -3    4
    3.0302348e-05   2   -2000015    1000016
    1.5634844e-05   2    1000025    1000037
    6.8581209e-06   2   -5    2
    6.4694542e-06   2   -3    2
    4.1150889e-06   2    1000022    1000024
    8.1446798e-07   2   -3    6
    3.8173633e-07   2   -1    2
    1.7826323e-07   2    24    25
    1.3538611e-07   2   -2000005    2000006
    6.5440792e-08   2   -1000011    1000012
    6.5152476e-08   2   -1000013    1000014
    2.7945434e-08   2   -1    6
    1.8145957e-08   2   -1    4
    5.9583068e-09   2   -11    12
    1.5315935e-09   2   -2000013    1000014
    3.8437851e-14   2    24    35
    3.5827905e-14   2   -2000011    1000012

DECAY 6  2.43
    1   2    5    24

DECAY 15 -1
