# SUSY Les Houches Accord 2 - MSSM spectrum + Decays
# SPheno v4.0.5be
# W. Porod, Comput. Phys. Commun. 153 (2003) 275-315, hep-ph/0301101;
# W. Porod, F.~Staub, Comput. Phys. Commun. 183 (2012) 2458
#                     arXiv:1104.1573 [hep-ph] 
# in case of problems send email to porod@physik.uni-wuerzburg.de
# Created: 07.09.2021,  15:57
Block SPINFO         # Program information
     1   SPheno      # spectrum calculator
     2   v4.0.5be    # version number
#
Block SPhenoINFO     # SPheno specific information
    1      2         # using 2-loop RGEs
    2      2         # using pole masses for boundary conditions at mZ
Block MODSEL  # Model selection
    1    0    # general MSSM
Block MINPAR  # Input parameters
    3    2.65202802E+01  # tanb at m_Z    
    4    1.00000000E+00  # Sign(mu)
Block EXTPAR  # non-universal input parameters
    0    3.10596206E+03  # scale for input parameters
    1    2.40635248E+02  # M_1
    2    6.40152666E+02  # M_2
    3    3.25600466E+03  # M_3
   11   -1.49856655E+03  # A_t
   12    3.60641206E+02  # A_b
   13   -1.06724033E+03  # A_tau
   23    2.87414242E+02  # mu
   25    2.55090428E+01  # tan(beta)
   26    4.90457388E+03  # m_A, pole mass
   31    1.00000000E+04  # M_L11
   32    1.00000000E+04  # M_L22
   33    1.00000000E+04  # M_L33
   34    1.00000000E+04  # M_E11
   35    1.00000000E+04  # M_E22
   36    1.00000000E+04  # M_E33
   41    1.00000000E+04  # M_Q11
   42    1.00000000E+04  # M_Q22
   43    2.73932044E+03  # M_Q33
   44    1.00000000E+04  # M_U11
   45    1.00000000E+04  # M_U22
   46    3.32246540E+03  # M_U33
   47    1.00000000E+04  # M_D11
   48    1.00000000E+04  # M_D22
   49    3.10969187E+03  # M_D33
Block SMINPUTS  # SM parameters
         1     1.27908970E+02  # alpha_em^-1(MZ)^MSbar
         2     1.16637870E-05  # G_mu [GeV^-2]
         3     1.18400000E-01  # alpha_s(MZ)^MSbar
         4     9.11876000E+01  # m_Z(pole)
         5     4.18000000E+00  # m_b(m_b), MSbar
         6     1.73200000E+02  # m_t(pole)
         7     1.77700000E+00  # m_tau(pole)
         8     0.00000000E+00  # m_nu_3
        11     5.10998930E-04  # m_e(pole)
        12     0.00000000E+00  # m_nu_1
        13     1.05658372E-01  # m_muon(pole)
        14     0.00000000E+00  # m_nu_2
        21     5.00000000E-03  # m_d(2 GeV), MSbar
        22     2.50000000E-03  # m_u(2 GeV), MSbar
        23     9.50000000E-02  # m_s(2 GeV), MSbar
        24     1.27000000E+00  # m_c(m_c), MSbar
Block gauge Q=  3.10596206E+03  # (SUSY scale)
   1    3.55362975E-01  # g'(Q)^DRbar
   2    6.65198874E-01  # g(Q)^DRbar
   3    1.21977796E+00  # g3(Q)^DRbar
Block Yu Q=  3.10596206E+03  # (SUSY scale)
  1  1     8.39081213E-06   # Y_u(Q)^DRbar
  2  2     4.26253256E-03   # Y_c(Q)^DRbar
  3  3     1.01367750E+00   # Y_t(Q)^DRbar
Block Yd Q=  3.10596206E+03  # (SUSY scale)
  1  1     4.30108878E-04   # Y_d(Q)^DRbar
  2  2     8.17206869E-03   # Y_s(Q)^DRbar
  3  3     4.26533231E-01   # Y_b(Q)^DRbar
Block Ye Q=  3.10596206E+03  # (SUSY scale)
  1  1     7.50571444E-05   # Y_e(Q)^DRbar
  2  2     1.55194370E-02   # Y_mu(Q)^DRbar
  3  3     2.61011399E-01   # Y_tau(Q)^DRbar
Block Au Q=  3.10596206E+03  # (SUSY scale)
  1  1     0.00000000E+00   # A_u(Q)^DRbar
  2  2     0.00000000E+00   # A_c(Q)^DRbar
  3  3    -1.49856678E+03   # A_t(Q)^DRbar
Block Ad Q=  3.10596206E+03  # (SUSY scale)
  1  1     0.00000000E+00   # A_d(Q)^DRbar
  2  2     0.00000000E+00   # A_s(Q)^DRbar
  3  3     3.60641174E+02   # A_b(Q)^DRbar
Block Ae Q=  3.10596206E+03  # (SUSY scale)
  1  1     0.00000000E+00   # A_e(Q)^DRbar
  2  2     0.00000000E+00   # A_mu(Q)^DRbar
  3  3    -1.06724028E+03   # A_tau(Q)^DRbar
Block MSOFT Q=  3.10596206E+03  # soft SUSY breaking masses at Q
   1    2.40635248E+02  # M_1
   2    6.40152666E+02  # M_2
   3    3.25600466E+03  # M_3
  21    2.38312423E+07  # M^2_(H,d)
  22    1.65632566E+05  # M^2_(H,u)
  31    1.00000000E+04  # M_(L,11)
  32    1.00000000E+04  # M_(L,22)
  33    1.00000000E+04  # M_(L,33)
  34    1.00000000E+04  # M_(E,11)
  35    1.00000000E+04  # M_(E,22)
  36    1.00000000E+04  # M_(E,33)
  41    1.00000000E+04  # M_(Q,11)
  42    1.00000000E+04  # M_(Q,22)
  43    2.73932044E+03  # M_(Q,33)
  44    1.00000000E+04  # M_(U,11)
  45    1.00000000E+04  # M_(U,22)
  46    3.32246540E+03  # M_(U,33)
  47    1.00000000E+04  # M_(D,11)
  48    1.00000000E+04  # M_(D,22)
  49    3.10969187E+03  # M_(D,33)
Block MASS  # Mass spectrum
#   PDG code      mass          particle
         6     1.73200000E+02  # m_t(pole)
        23     9.11876000E+01  # m_Z(pole)
        24     8.04299946E+01  # W+
        15     1.77700000E+00  # m_tau(pole)
        25     1.21867172E+02  # h0
        35     4.90355934E+03  # H0
        36     4.90457388E+03  # A0
        37     4.90447030E+03  # H+
   1000001     1.00991185E+04  # ~d_L
   2000001     1.00744101E+04  # ~d_R
   1000002     1.00987469E+04  # ~u_L
   2000002     1.00778781E+04  # ~u_R
   1000003     1.00991220E+04  # ~s_L
   2000003     1.00744155E+04  # ~s_R
   1000004     1.00987505E+04  # ~c_L
   2000004     1.00778796E+04  # ~c_R
   1000005     2.84559453E+03  # ~b_1
   2000005     3.21680159E+03  # ~b_2
   1000006     2.84541155E+03  # ~t_1
   2000006     3.39037082E+03  # ~t_2
   1000011     1.00213603E+04  # ~e_L-
   2000011     1.00085467E+04  # ~e_R-
   1000012     1.00205899E+04  # ~nu_eL
   1000013     1.00213746E+04  # ~mu_L-
   2000013     1.00085743E+04  # ~mu_R-
   1000014     1.00206041E+04  # ~nu_muL
   1000015     1.00163786E+04  # ~tau_1-
   2000015     1.00254683E+04  # ~tau_2-
   1000016     1.00246352E+04  # ~nu_tauL
   1000021     3.67738144E+03  # ~g
   1000022     2.28082637E+02  # ~chi_10
   1000023     3.02663793E+02  # ~chi_20
   1000025     3.05918446E+02  # ~chi_30
   1000035     7.06136172E+02  # ~chi_40
   1000024     2.92570173E+02  # ~chi_1+
   1000037     7.06183580E+02  # ~chi_2+
# Higgs mixing
Block alpha # Effective Higgs mixing angle
          -3.77270279E-02   # alpha
Block Hmix Q=  3.10596206E+03  # Higgs mixing parameters
   1    2.87414242E+02  # mu
   2    2.55090428E+01  # tan[beta](Q)
   3    2.43229214E+02  # v(Q)
   4    2.40548449E+07  # m^2_A(Q)
Block stopmix # stop mixing matrix
   1  1     9.97705193E-01   # Re[R_st(1,1)]
   1  2     6.77078059E-02   # Re[R_st(1,2)]
   2  1    -6.77078059E-02   # Re[R_st(2,1)]
   2  2     9.97705193E-01   # Re[R_st(2,2)]
Block sbotmix # sbottom mixing matrix
   1  1     9.99976717E-01   # Re[R_sb(1,1)]
   1  2     6.82394044E-03   # Re[R_sb(1,2)]
   2  1    -6.82394044E-03   # Re[R_sb(2,1)]
   2  2     9.99976717E-01   # Re[R_sb(2,2)]
Block staumix # stau mixing matrix
   1  1     8.27688311E-02   # Re[R_sta(1,1)]
   1  2     9.96568774E-01   # Re[R_sta(1,2)]
   2  1    -9.96568774E-01   # Re[R_sta(2,1)]
   2  2     8.27688311E-02   # Re[R_sta(2,2)]
Block Nmix # neutralino mixing matrix
   1  1     8.85789956E-01   # Re[N(1,1)]
   1  2    -5.15158344E-02   # Re[N(1,2)]
   1  3     3.63304582E-01   # Re[N(1,3)]
   1  4    -2.84133866E-01   # Re[N(1,4)]
   2  1     5.54313679E-02   # Re[N(2,1)]
   2  2    -5.56880438E-02   # Re[N(2,2)]
   2  3    -6.98968149E-01   # Re[N(2,3)]
   2  4    -7.10823278E-01   # Re[N(2,4)]
   3  1    -4.60550480E-01   # Re[N(3,1)]
   3  2    -1.35871658E-01   # Re[N(3,2)]
   3  3     6.12683353E-01   # Re[N(3,3)]
   3  4    -6.27735021E-01   # Re[N(3,4)]
   4  1    -1.40275719E-02   # Re[N(4,1)]
   4  2     9.87817723E-01   # Re[N(4,2)]
   4  3     6.38154907E-02   # Re[N(4,3)]
   4  4    -1.41233697E-01   # Re[N(4,4)]
Block Umix # chargino mixing matrix
   1  1    -9.01458371E-02   # Re[U(1,1)]
   1  2     9.95928576E-01   # Re[U(1,2)]
   2  1     9.95928576E-01   # Re[U(2,1)]
   2  2     9.01458371E-02   # Re[U(2,2)]
Block Vmix # chargino mixing matrix
   1  1    -1.99714998E-01   # Re[V(1,1)]
   1  2     9.79854030E-01   # Re[V(1,2)]
   2  1     9.79854030E-01   # Re[V(2,1)]
   2  2     1.99714998E-01   # Re[V(2,2)]
DECAY        23     2.49520000E+00   # Z
DECAY        24     2.08500000E+00   # W
DECAY   2000011     5.02280181E+01   # ~e^-_R
#    BR                NDA      ID1      ID2
     7.84765273E-01    2     1000022        11   # BR(~e^-_R -> chi^0_1 e^-)
     3.07077167E-03    2     1000023        11   # BR(~e^-_R -> chi^0_2 e^-)
     2.11968877E-01    2     1000025        11   # BR(~e^-_R -> chi^0_3 e^-)
     1.95056419E-04    2     1000035        11   # BR(~e^-_R -> chi^0_4 e^-)
DECAY   1000011     1.43608078E+02   # ~e^-_L
#    BR                NDA      ID1      ID2
     5.45620303E-02    2     1000022        11   # BR(~e^-_L -> chi^0_1 e^-)
     2.08463632E-04    2     1000023        11   # BR(~e^-_L -> chi^0_2 e^-)
     4.47153847E-02    2     1000025        11   # BR(~e^-_L -> chi^0_3 e^-)
     2.92258279E-01    2     1000035        11   # BR(~e^-_L -> chi^0_4 e^-)
     4.98346801E-03    2    -1000024        12   # BR(~e^-_L -> chi^-_1 nu_e)
     6.03272374E-01    2    -1000037        12   # BR(~e^-_L -> chi^-_2 nu_e)
#    BR                NDA      ID1      ID2       ID3
DECAY   2000013     5.03238993E+01   # ~mu^-_R
#    BR                NDA      ID1      ID2
     7.83397879E-01    2     1000022        13   # BR(~mu^-_R -> chi^0_1 mu^-)
     3.52964947E-03    2     1000023        13   # BR(~mu^-_R -> chi^0_2 mu^-)
     2.11922664E-01    2     1000025        13   # BR(~mu^-_R -> chi^0_3 mu^-)
     1.98527679E-04    2     1000035        13   # BR(~mu^-_R -> chi^0_4 mu^-)
     9.43612869E-04    2    -1000024        14   # BR(~mu^-_R -> chi^-_1 nu_mu)
DECAY   1000013     1.43656220E+02   # ~mu^-_L
#    BR                NDA      ID1      ID2
     5.45878976E-02    2     1000022        13   # BR(~mu^-_L -> chi^0_1 mu^-)
     3.71397795E-04    2     1000023        13   # BR(~mu^-_L -> chi^0_2 mu^-)
     4.48256992E-02    2     1000025        13   # BR(~mu^-_L -> chi^0_3 mu^-)
     2.92162114E-01    2     1000035        13   # BR(~mu^-_L -> chi^0_4 mu^-)
     4.98180511E-03    2    -1000024        14   # BR(~mu^-_L -> chi^-_1 nu_mu)
     6.03071087E-01    2    -1000037        14   # BR(~mu^-_L -> chi^-_2 nu_mu)
#    BR                NDA      ID1      ID2       ID3
DECAY   1000015     7.79236552E+01   # ~tau^-_1
#    BR                NDA      ID1      ID2
     5.36293876E-01    2     1000022        15   # BR(~tau^-_1 -> chi^0_1 tau^-)
     8.38471737E-02    2     1000023        15   # BR(~tau^-_1 -> chi^0_2 tau^-)
     1.98154274E-01    2     1000025        15   # BR(~tau^-_1 -> chi^0_3 tau^-)
     1.25830645E-03    2     1000035        15   # BR(~tau^-_1 -> chi^0_4 tau^-)
     1.77952387E-01    2    -1000024        16   # BR(~tau^-_1 -> chi^-_1 nu_tau)
     2.49398296E-03    2    -1000037        16   # BR(~tau^-_1 -> chi^-_2 nu_tau)
DECAY   2000015     1.56678458E+02   # ~tau^-_2
#    BR                NDA      ID1      ID2
     5.79398864E-02    2     1000022        15   # BR(~tau^-_2 -> chi^0_1 tau^-)
     4.40240236E-02    2     1000023        15   # BR(~tau^-_2 -> chi^0_2 tau^-)
     7.54179091E-02    2     1000025        15   # BR(~tau^-_2 -> chi^0_3 tau^-)
     2.68125695E-01    2     1000035        15   # BR(~tau^-_2 -> chi^0_4 tau^-)
     1.85866395E-03    2    -1000024        16   # BR(~tau^-_2 -> chi^-_1 nu_tau)
     5.52633822E-01    2    -1000037        16   # BR(~tau^-_2 -> chi^-_2 nu_tau)
#    BR                NDA      ID1      ID2       ID3
DECAY   1000012     1.43612887E+02   # ~nu_e
#    BR                NDA      ID1      ID2
     8.44721062E-02    2     1000022        12   # BR(~nu_e -> chi^0_1 nu_e)
     2.23056404E-03    2     1000023        12   # BR(~nu_e -> chi^0_2 nu_e)
     3.72024784E-03    2     1000025        12   # BR(~nu_e -> chi^0_3 nu_e)
     3.01229237E-01    2     1000035        12   # BR(~nu_e -> chi^0_4 nu_e)
     2.44575967E-02    2     1000024        11   # BR(~nu_e -> chi^+_1 e^-)
     5.83890248E-01    2     1000037        11   # BR(~nu_e -> chi^+_2 e^-)
#    BR                NDA      ID1      ID2       ID3
DECAY   1000014     1.43661023E+02   # ~nu_mu
#    BR                NDA      ID1      ID2
     8.44439223E-02    2     1000022        14   # BR(~nu_mu -> chi^0_1 nu_mu)
     2.22981983E-03    2     1000023        14   # BR(~nu_mu -> chi^0_2 nu_mu)
     3.71900660E-03    2     1000025        14   # BR(~nu_mu -> chi^0_3 nu_mu)
     3.01128741E-01    2     1000035        14   # BR(~nu_mu -> chi^0_4 nu_mu)
     2.47803678E-02    2     1000024        13   # BR(~nu_mu -> chi^+_1 mu^-)
     5.83698143E-01    2     1000037        13   # BR(~nu_mu -> chi^+_2 mu^-)
#    BR                NDA      ID1      ID2       ID3
DECAY   1000016     1.57234680E+02   # ~nu_tau
#    BR                NDA      ID1      ID2
     7.71852020E-02    2     1000022        16   # BR(~nu_tau -> chi^0_1 nu_tau)
     2.03814790E-03    2     1000023        16   # BR(~nu_tau -> chi^0_2 nu_tau)
     3.39932655E-03    2     1000025        16   # BR(~nu_tau -> chi^0_3 nu_tau)
     2.75245977E-01    2     1000035        16   # BR(~nu_tau -> chi^0_4 nu_tau)
     1.07909792E-01    2     1000024        15   # BR(~nu_tau -> chi^+_1 tau^-)
     5.34221555E-01    2     1000037        15   # BR(~nu_tau -> chi^+_2 tau^-)
#    BR                NDA      ID1      ID2       ID3
DECAY   2000001     6.03033601E+02   # ~d_R
#    BR                NDA      ID1      ID2
     7.31066300E-03    2     1000022         1   # BR(~d_R -> chi^0_1 d)
     1.97468744E-03    2     1000025         1   # BR(~d_R -> chi^0_3 d)
     9.90684134E-01    2     1000021         1   # BR(~d_R -> ~g d)
DECAY   1000001     7.33256180E+02   # ~d_L
#    BR                NDA      ID1      ID2
     2.65171233E-03    2     1000022         1   # BR(~d_L -> chi^0_1 d)
     2.60108814E-04    2     1000023         1   # BR(~d_L -> chi^0_2 d)
     1.75553692E-04    2     1000025         1   # BR(~d_L -> chi^0_3 d)
     5.88737021E-02    2     1000035         1   # BR(~d_L -> chi^0_4 d)
     9.83610099E-04    2    -1000024         2   # BR(~d_L -> chi^-_1 u)
     1.19085767E-01    2    -1000037         2   # BR(~d_L -> chi^-_2 u)
     8.17969546E-01    2     1000021         1   # BR(~d_L -> ~g d)
DECAY   2000003     6.03060770E+02   # ~s_R
#    BR                NDA      ID1      ID2
     7.31325567E-03    2     1000022         3   # BR(~s_R -> chi^0_1 s)
     1.98289303E-03    2     1000025         3   # BR(~s_R -> chi^0_3 s)
     9.90640359E-01    2     1000021         3   # BR(~s_R -> ~g s)
DECAY   1000003     7.33273562E+02   # ~s_L
#    BR                NDA      ID1      ID2
     2.65405629E-03    2     1000022         3   # BR(~s_L -> chi^0_1 s)
     2.69001871E-04    2     1000023         3   # BR(~s_L -> chi^0_2 s)
     1.82386752E-04    2     1000025         3   # BR(~s_L -> chi^0_3 s)
     5.88724012E-02    2     1000035         3   # BR(~s_L -> chi^0_4 s)
     9.88357698E-04    2    -1000024         4   # BR(~s_L -> chi^-_1 c)
     1.19083184E-01    2    -1000037         4   # BR(~s_L -> chi^-_2 c)
     8.17950612E-01    2     1000021         3   # BR(~s_L -> ~g s)
DECAY   1000005     1.00045155E+02   # ~b_1
#    BR                NDA      ID1      ID2
     1.91130253E-02    2     1000022         5   # BR(~b_1 -> chi^0_1 b)
     4.96023053E-02    2     1000023         5   # BR(~b_1 -> chi^0_2 b)
     3.80061851E-02    2     1000025         5   # BR(~b_1 -> chi^0_3 b)
     1.08411312E-01    2     1000035         5   # BR(~b_1 -> chi^0_4 b)
     5.43650432E-01    2    -1000024         6   # BR(~b_1 -> chi^-_1 t)
     2.41216741E-01    2    -1000037         6   # BR(~b_1 -> chi^-_2 t)
DECAY   2000005     2.46239707E+01   # ~b_2
#    BR                NDA      ID1      ID2
     1.17066916E-01    2     1000022         5   # BR(~b_2 -> chi^0_1 b)
     2.27571344E-01    2     1000023         5   # BR(~b_2 -> chi^0_2 b)
     1.89982824E-01    2     1000025         5   # BR(~b_2 -> chi^0_3 b)
     2.19093054E-03    2     1000035         5   # BR(~b_2 -> chi^0_4 b)
     4.57895393E-01    2    -1000024         6   # BR(~b_2 -> chi^-_1 t)
     4.33093082E-03    2    -1000037         6   # BR(~b_2 -> chi^-_2 t)
     4.08496440E-04    2     1000006       -24   # BR(~b_2 -> ~t_1 W^-)
     2.00559606E-04    2     1000005        23   # BR(~b_2 -> ~b_1 Z)
     3.52605487E-04    2     1000005        25   # BR(~b_2 -> ~b_1 h^0)
DECAY   2000002     6.20226493E+02   # ~u_R
#    BR                NDA      ID1      ID2
     2.84418116E-02    2     1000022         2   # BR(~u_R -> chi^0_1 u)
     1.11293096E-04    2     1000023         2   # BR(~u_R -> chi^0_2 u)
     7.68235745E-03    2     1000025         2   # BR(~u_R -> chi^0_3 u)
     9.63757468E-01    2     1000021         2   # BR(~u_R -> ~g u)
DECAY   1000002     7.33240713E+02   # ~u_L
#    BR                NDA      ID1      ID2
     6.83270872E-04    2     1000022         2   # BR(~u_L -> chi^0_1 u)
     1.27028258E-04    2     1000023         2   # BR(~u_L -> chi^0_2 u)
     2.87260165E-03    2     1000025         2   # BR(~u_L -> chi^0_3 u)
     5.82802386E-02    2     1000035         2   # BR(~u_L -> chi^0_4 u)
     4.82781500E-03    2     1000024         1   # BR(~u_L -> chi^+_1 d)
     1.15270747E-01    2     1000037         1   # BR(~u_L -> chi^+_2 d)
     8.17938299E-01    2     1000021         2   # BR(~u_L -> ~g u)
DECAY   2000004     6.20233880E+02   # ~c_R
#    BR                NDA      ID1      ID2
     2.84419482E-02    2     1000022         4   # BR(~c_R -> chi^0_1 c)
     1.14253695E-04    2     1000023         4   # BR(~c_R -> chi^0_2 c)
     7.68457917E-03    2     1000025         4   # BR(~c_R -> chi^0_3 c)
     9.63746171E-01    2     1000021         4   # BR(~c_R -> ~g c)
DECAY   1000004     7.33258075E+02   # ~c_L
#    BR                NDA      ID1      ID2
     6.83656613E-04    2     1000022         4   # BR(~c_L -> chi^0_1 c)
     1.29535822E-04    2     1000023         4   # BR(~c_L -> chi^0_2 c)
     2.87449136E-03    2     1000025         4   # BR(~c_L -> chi^0_3 c)
     5.82789788E-02    2     1000035         4   # BR(~c_L -> chi^0_4 c)
     4.84577036E-03    2     1000024         3   # BR(~c_L -> chi^+_1 s)
     1.15268207E-01    2     1000037         3   # BR(~c_L -> chi^+_2 s)
     8.17919360E-01    2     1000021         4   # BR(~c_L -> ~g c)
DECAY   1000006     1.00718584E+02   # ~t_1
#    BR                NDA      ID1      ID2
     1.89188125E-04    2     1000022         4   # BR(~t_1 -> chi^0_1 c)
     5.26623625E-02    2     1000022         6   # BR(~t_1 -> chi^0_1 t)
     2.84730869E-01    2     1000023         6   # BR(~t_1 -> chi^0_2 t)
     2.22668656E-01    2     1000025         6   # BR(~t_1 -> chi^0_3 t)
     1.12597737E-01    2     1000035         6   # BR(~t_1 -> chi^0_4 t)
     1.20766559E-01    2     1000024         5   # BR(~t_1 -> chi^+_1 b)
     2.01319746E-01    2     1000037         5   # BR(~t_1 -> chi^+_2 b)
#    BR                NDA      ID1      ID2       ID3
     5.03002799E-03    3     1000022        24         5   # BR(~t_1 -> chi^0_1 W^+ b)
DECAY   2000006     1.49664742E+02   # ~t_2
#    BR                NDA      ID1      ID2
     7.10437915E-02    2     1000022         6   # BR(~t_2 -> chi^0_1 t)
     2.27650885E-01    2     1000023         6   # BR(~t_2 -> chi^0_2 t)
     1.92021373E-01    2     1000025         6   # BR(~t_2 -> chi^0_3 t)
     1.25767839E-02    2     1000035         6   # BR(~t_2 -> chi^0_4 t)
     4.28498064E-01    2     1000024         5   # BR(~t_2 -> chi^+_1 b)
     2.49836719E-02    2     1000037         5   # BR(~t_2 -> chi^+_2 b)
     2.02798115E-02    2     1000005        24   # BR(~t_2 -> ~b_1 W^+)
     1.00065326E-02    2     1000006        23   # BR(~t_2 -> ~t_1 Z)
     1.29390606E-02    2     1000006        25   # BR(~t_2 -> ~t_1 h^0)
DECAY   1000024     4.34261549E-04   # chi^+_1
#    BR                NDA      ID1      ID2       ID3
     3.33605783E-01    3     1000022        -1         2   # BR(chi^+_1 -> chi^0_1 d_bar u)
     3.33168318E-01    3     1000022        -3         4   # BR(chi^+_1 -> chi^0_1 s_bar c)
     1.11201871E-01    3     1000022       -11        12   # BR(chi^+_1 -> chi^0_1 e^+ nu_e)
     1.11201368E-01    3     1000022       -13        14   # BR(chi^+_1 -> chi^0_1 mu^+ nu_mu)
     1.10822659E-01    3     1000022       -15        16   # BR(chi^+_1 -> chi^0_1 tau^+ nu_tau)
DECAY   1000037     6.05731036E+00   # chi^+_2
#    BR                NDA      ID1      ID2
     2.50383764E-02    2     1000022        24   # BR(chi^+_2 -> chi^0_1 W^+)
     2.69755924E-01    2     1000023        24   # BR(chi^+_2 -> chi^0_2 W^+)
     2.29127481E-01    2     1000025        24   # BR(chi^+_2 -> chi^0_3 W^+)
     2.48514770E-01    2     1000024        23   # BR(chi^+_2 -> chi^+_1 Z)
     2.24792280E-01    2     1000024        25   # BR(chi^+_2 -> chi^+_1 h^0)
#    BR                NDA      ID1      ID2       ID3
     1.97091266E-04    3     1000024         6        -6   # BR(chi^+_2 -> chi^+_1 t t_bar)
     1.89778967E-04    3     1000022        -5         6   # BR(chi^+_2 -> chi^0_1 b_bar t)
     1.23722897E-03    3     1000023        -5         6   # BR(chi^+_2 -> chi^0_2 b_bar t)
     1.14682562E-03    3     1000025        -5         6   # BR(chi^+_2 -> chi^0_3 b_bar t)
DECAY   1000022     0.00000000E+00   # chi^0_1
DECAY   1000023     2.99355063E-03   # chi^0_2
#    BR                NDA      ID1      ID2
     2.99818540E-03    2     1000022        22   # BR(chi^0_2 -> chi^0_1 photon)
#    BR                NDA      ID1      ID2       ID3
     1.18716793E-01    3     1000022         2        -2   # BR(chi^0_2 -> chi^0_1 u u_bar)
     1.18405793E-01    3     1000022         4        -4   # BR(chi^0_2 -> chi^0_1 c c_bar)
     1.52218139E-01    3     1000022         1        -1   # BR(chi^0_2 -> chi^0_1 d d_bar)
     1.52216450E-01    3     1000022         3        -3   # BR(chi^0_2 -> chi^0_1 s s_bar)
     1.48753582E-01    3     1000022         5        -5   # BR(chi^0_2 -> chi^0_1 b b_bar)
     3.43511933E-02    3     1000022        11       -11   # BR(chi^0_2 -> chi^0_1 e^- e^+)
     3.43505502E-02    3     1000022        13       -13   # BR(chi^0_2 -> chi^0_1 mu^- mu^+)
     3.41577319E-02    3     1000022        15       -15   # BR(chi^0_2 -> chi^0_1 tau^- tau^+)
     2.03561404E-01    3     1000022        12       -12   # BR(chi^0_2 -> chi^0_1 nu_e nu_bar_e)
DECAY   1000025     4.15492645E-05   # chi^0_3
#    BR                NDA      ID1      ID2
     2.35979936E-03    2     1000022        22   # BR(chi^0_3 -> chi^0_1 photon)
     1.26247239E-04    2     1000023        22   # BR(chi^0_3 -> chi^0_2 photon)
#    BR                NDA      ID1      ID2       ID3
     1.15988447E-01    3     1000022         2        -2   # BR(chi^0_3 -> chi^0_1 u u_bar)
     1.15768890E-01    3     1000022         4        -4   # BR(chi^0_3 -> chi^0_1 c c_bar)
     1.48690869E-01    3     1000022         1        -1   # BR(chi^0_3 -> chi^0_1 d d_bar)
     1.48689723E-01    3     1000022         3        -3   # BR(chi^0_3 -> chi^0_1 s s_bar)
     1.46997785E-01    3     1000022         5        -5   # BR(chi^0_3 -> chi^0_1 b b_bar)
     3.35248325E-02    3     1000022        11       -11   # BR(chi^0_3 -> chi^0_1 e^- e^+)
     3.35245681E-02    3     1000022        13       -13   # BR(chi^0_3 -> chi^0_1 mu^- mu^+)
     3.34400108E-02    3     1000022        15       -15   # BR(chi^0_3 -> chi^0_1 tau^- tau^+)
     1.98859328E-01    3     1000022        12       -12   # BR(chi^0_3 -> chi^0_1 nu_e nu_bar_e)
     3.75795185E-03    3     1000024         1        -2   # BR(chi^0_3 -> chi^+_1 d u_bar)
     3.75795185E-03    3    -1000024        -1         2   # BR(chi^0_3 -> chi^-_1 d_bar u)
     3.59499129E-03    3     1000024         3        -4   # BR(chi^0_3 -> chi^+_1 s c_bar)
     3.59499129E-03    3    -1000024        -3         4   # BR(chi^0_3 -> chi^-_1 s_bar c)
     1.25264699E-03    3     1000024        11       -12   # BR(chi^0_3 -> chi^+_1 e^- nu_bar_e)
     1.25264699E-03    3    -1000024       -11        12   # BR(chi^0_3 -> chi^-_1 e^+ nu_e)
     1.25225684E-03    3     1000024        13       -14   # BR(chi^0_3 -> chi^+_1 mu^- nu_bar_mu)
     1.25225684E-03    3    -1000024       -13        14   # BR(chi^0_3 -> chi^-_1 mu^+ nu_mu)
     1.14882970E-03    3     1000024        15       -16   # BR(chi^0_3 -> chi^+_1 tau^- nu_bar_tau)
     1.14882970E-03    3    -1000024       -15        16   # BR(chi^0_3 -> chi^-_1 tau^+ nu_tau)
DECAY   1000035     7.02518985E+00   # chi^0_4
#    BR                NDA      ID1      ID2
     2.21241937E-01    2     1000024       -24   # BR(chi^0_4 -> chi^+_1 W^-)
     2.21241937E-01    2    -1000024        24   # BR(chi^0_4 -> chi^-_1 W^+)
     3.65161258E-03    2     1000022        23   # BR(chi^0_4 -> chi^0_1 Z)
     2.06777752E-01    2     1000023        23   # BR(chi^0_4 -> chi^0_2 Z)
     2.38324181E-02    2     1000025        23   # BR(chi^0_4 -> chi^0_3 Z)
     1.59504313E-02    2     1000022        25   # BR(chi^0_4 -> chi^0_1 h^0)
     1.53580129E-01    2     1000023        25   # BR(chi^0_4 -> chi^0_2 h^0)
     1.51269494E-01    2     1000025        25   # BR(chi^0_4 -> chi^0_3 h^0)
#    BR                NDA      ID1      ID2       ID3
     1.19375158E-03    3     1000024         5        -6   # BR(chi^0_4 -> chi^+_1 b t_bar)
     1.19375158E-03    3    -1000024        -5         6   # BR(chi^0_4 -> chi^-_1 b_bar t)
DECAY   1000021     4.47725760E+01   # ~g
#    BR                NDA      ID1      ID2
     2.67397921E-02    2     1000006        -4   # BR(~g -> ~t_1 c_bar)
     2.67397921E-02    2    -1000006         4   # BR(~g -> ~t^*_1 c)
     1.86387993E-01    2     1000006        -6   # BR(~g -> ~t_1 t_bar)
     1.86387993E-01    2    -1000006         6   # BR(~g -> ~t^*_1 t)
     2.39761770E-02    2     2000006        -6   # BR(~g -> ~t_2 t_bar)
     2.39761770E-02    2    -2000006         6   # BR(~g -> ~t^*_2 t)
     1.95664282E-01    2     1000005        -5   # BR(~g -> ~b_1 b_bar)
     1.95664282E-01    2    -1000005         5   # BR(~g -> ~b^*_1 b)
     6.70271702E-02    2     2000005        -5   # BR(~g -> ~b_2 b_bar)
     6.70271702E-02    2    -2000005         5   # BR(~g -> ~b^*_2 b)
     1.73739210E-04    2     1000023        21   # BR(~g -> chi^0_2 g)
     1.24231496E-04    2     1000025        21   # BR(~g -> chi^0_3 g)
#    BR                NDA      ID1      ID2       ID3
DECAY        25     3.06160166E-03   # Gamma(h0)
     2.67920380E-03   2        22        22   # BR(h0 -> photon photon)
     1.41767431E-03   2        22        23   # BR(h0 -> photon Z)
     2.34146412E-02   2        23        23   # BR(h0 -> Z Z)
     2.06032364E-01   2       -24        24   # BR(h0 -> W W)
     8.55303499E-02   2        21        21   # BR(h0 -> gluon gluon)
     5.23174246E-09   2       -11        11   # BR(h0 -> Electron electron)
     2.32715479E-04   2       -13        13   # BR(h0 -> Muon muon)
     6.70959544E-02   2       -15        15   # BR(h0 -> Tau tau)
     1.49636940E-07   2        -2         2   # BR(h0 -> Up up)
     2.90406928E-02   2        -4         4   # BR(h0 -> Charm charm)
     6.08291384E-07   2        -1         1   # BR(h0 -> Down down)
     2.20004081E-04   2        -3         3   # BR(h0 -> Strange strange)
     5.84335637E-01   2        -5         5   # BR(h0 -> Bottom bottom)
DECAY        35     9.70321207E+01   # Gamma(HH)
     1.75654518E-08   2        22        22   # BR(HH -> photon photon)
     4.47179813E-08   2        22        23   # BR(HH -> photon Z)
     2.11455101E-07   2        23        23   # BR(HH -> Z Z)
     3.56881140E-08   2       -24        24   # BR(HH -> W W)
     1.05551962E-06   2        21        21   # BR(HH -> gluon gluon)
     4.54820193E-09   2       -11        11   # BR(HH -> Electron electron)
     2.02539583E-04   2       -13        13   # BR(HH -> Muon muon)
     5.85003864E-02   2       -15        15   # BR(HH -> Tau tau)
     1.53768768E-13   2        -2         2   # BR(HH -> Up up)
     2.98330577E-08   2        -4         4   # BR(HH -> Charm charm)
     2.10556366E-03   2        -6         6   # BR(HH -> Top top)
     3.13140311E-07   2        -1         1   # BR(HH -> Down down)
     1.13267915E-04   2        -3         3   # BR(HH -> Strange strange)
     2.84701203E-01   2        -5         5   # BR(HH -> Bottom bottom)
     1.84104980E-02   2  -1000024   1000024   # BR(HH -> Chargino1 chargino1)
     1.87871328E-01   2  -1000024   1000037   # BR(HH -> Chargino1 chargino2)
     1.87871328E-01   2  -1000037   1000024   # BR(HH -> Chargino2 chargino1)
     3.11498868E-03   2  -1000037   1000037   # BR(HH -> Chargino2 chargino2)
     1.60465457E-02   2   1000022   1000022   # BR(HH -> neutralino1 neutralino1)
     2.48994470E-02   2   1000022   1000023   # BR(HH -> neutralino1 neutralino2)
     1.34339490E-02   2   1000022   1000025   # BR(HH -> neutralino1 neutralino3)
     2.25938037E-02   2   1000022   1000035   # BR(HH -> neutralino1 neutralino4)
     1.66918580E-03   2   1000023   1000023   # BR(HH -> neutralino2 neutralino2)
     3.82523991E-03   2   1000023   1000025   # BR(HH -> neutralino2 neutralino3)
     1.06174362E-01   2   1000023   1000035   # BR(HH -> neutralino2 neutralino4)
     1.85923214E-03   2   1000025   1000025   # BR(HH -> neutralino3 neutralino3)
     6.49801655E-02   2   1000025   1000035   # BR(HH -> neutralino3 neutralino4)
     1.62411391E-03   2   1000035   1000035   # BR(HH -> neutralino4 neutralino4)
     1.13965713E-06   2        25        25   # BR(HH -> h0 h0)
DECAY        36     9.51025118E+01   # Gamma(A0)
     4.68068821E-08   2        22        22   # BR(A0 -> photon photon)
     7.26316330E-08   2        22        23   # BR(A0 -> photon Z)
     5.16408894E-06   2        21        21   # BR(A0 -> gluon gluon)
     4.37312873E-09   2       -11        11   # BR(A0 -> Electron electron)
     1.94743586E-04   2       -13        13   # BR(A0 -> Muon muon)
     5.62486704E-02   2       -15        15   # BR(A0 -> Tau tau)
     1.38787269E-13   2        -2         2   # BR(A0 -> Up up)
     2.69258060E-08   2        -4         4   # BR(A0 -> Charm charm)
     1.90525514E-03   2        -6         6   # BR(A0 -> Top top)
     3.01080091E-07   2        -1         1   # BR(A0 -> Down down)
     1.08905004E-04   2        -3         3   # BR(A0 -> Strange strange)
     2.73735461E-01   2        -5         5   # BR(A0 -> Bottom bottom)
     2.04087977E-02   2  -1000024   1000024   # BR(A0 -> Chargino1 chargino1)
     1.90130214E-01   2  -1000024   1000037   # BR(A0 -> Chargino1 chargino2)
     1.90130214E-01   2  -1000037   1000024   # BR(A0 -> Chargino2 chargino1)
     4.75144551E-03   2  -1000037   1000037   # BR(A0 -> Chargino2 chargino2)
     1.86212141E-02   2   1000022   1000022   # BR(A0 -> neutralino1 neutralino1)
     2.09491720E-02   2   1000022   1000023   # BR(A0 -> neutralino1 neutralino2)
     1.62829716E-02   2   1000022   1000025   # BR(A0 -> neutralino1 neutralino3)
     2.60734755E-02   2   1000022   1000035   # BR(A0 -> neutralino1 neutralino4)
     1.48174217E-03   2   1000023   1000023   # BR(A0 -> neutralino2 neutralino2)
     3.72175106E-03   2   1000023   1000025   # BR(A0 -> neutralino2 neutralino3)
     9.03410041E-02   2   1000023   1000035   # BR(A0 -> neutralino2 neutralino4)
     2.24802787E-03   2   1000025   1000025   # BR(A0 -> neutralino3 neutralino3)
     8.01997596E-02   2   1000025   1000035   # BR(A0 -> neutralino3 neutralino4)
     2.46097699E-03   2   1000035   1000035   # BR(A0 -> neutralino4 neutralino4)
     5.82799423E-07   2        23        25   # BR(A0 -> Z h0)
     1.24197171E-14   2        23        35   # BR(A0 -> Z HH)
     7.34902324E-39   2        25        25   # BR(A0 -> h0 h0)
DECAY        37     1.05311142E+02   # Gamma(Hp)
     5.41669857E-09   2       -11        12   # BR(Hp -> Electron nu_e)
     2.31580782E-04   2       -13        14   # BR(Hp -> Muon nu_mu)
     6.55042424E-02   2       -15        16   # BR(Hp -> Tau nu_tau)
     3.25077162E-07   2        -1         2   # BR(Hp -> Down up)
     5.51698496E-06   2        -3         2   # BR(Hp -> Strange up)
     3.48258046E-06   2        -5         2   # BR(Hp -> Bottom up)
     1.67410020E-08   2        -1         4   # BR(Hp -> Down charm)
     1.17188981E-04   2        -3         4   # BR(Hp -> Strange charm)
     4.87686023E-04   2        -5         4   # BR(Hp -> Bottom charm)
     1.62366605E-07   2        -1         6   # BR(Hp -> Down top)
     3.71526308E-06   2        -3         6   # BR(Hp -> Strange top)
     3.30882366E-01   2        -5         6   # BR(Hp -> Bottom top)
     3.91011512E-02   2   1000022   1000024   # BR(Hp -> neutralino1 chargino1)
     4.67938825E-02   2   1000022   1000037   # BR(Hp -> neutralino1 chargino2)
     3.20402681E-03   2   1000023   1000024   # BR(Hp -> neutralino2 chargino1)
     1.75339928E-01   2   1000023   1000037   # BR(Hp -> neutralino2 chargino2)
     1.99222707E-02   2   1000024   1000025   # BR(Hp -> chargino1 neutralino3)
     1.42116139E-01   2   1000025   1000037   # BR(Hp -> neutralino3 chargino2)
     1.76285114E-01   2   1000024   1000035   # BR(Hp -> chargino1 neutralino4)
     6.72744281E-07   2   1000035   1000037   # BR(Hp -> neutralino4 chargino2)
     5.26392652E-07   2        24        25   # BR(Hp -> W h0)
DECAY         6     2.43000000E+00   # top
#    BR                NDA      ID1      ID2
     1.00000000E+00    2           5        24   # BR(t -> b W)
Block HiggsBoundsInputHiggsCouplingsFermions
# ScalarNormEffCoupSq PseudoSNormEffCoupSq NP IP1 IP2 IP2
    9.27159295E-01    0.00000000E+00        3  25   5   5  # h0-b-b eff. coupling^2, normalised to SM
    6.50784105E+02    0.00000000E+00        3  35   5   5  # H0-b-b eff. coupling^2, normalised to SM
    0.00000000E+00    6.50711265E+02        3  36   5   5  # A0-b-b eff. coupling^2, normalised to SM
#
    1.00011194E+00    0.00000000E+00        3  25   6   6  # h0-t-t eff. coupling^2, normalised to SM
    1.42483978E-03    0.00000000E+00        3  35   6   6  # H0-t-t eff. coupling^2, normalised to SM
    0.00000000E+00    1.53677991E-03        3  36   6   6  # A0-t-t eff. coupling^2, normalised to SM
#
    9.27159295E-01    0.00000000E+00        3  25  15  15  # h0-tau-tau eff. coupling^2, normalised to SM
    6.50784105E+02    0.00000000E+00        3  35  15  15  # H0-tau-tau eff. coupling^2, normalised to SM
    0.00000000E+00    6.50711265E+02        3  36  15  15  # A0-tau-tau eff. coupling^2, normalised to SM
#
Block HiggsBoundsInputHiggsCouplingsBosons
    9.99997884E-01        3  25  24  24  # h0-W-W eff. coupling^2, normalised to SM
    2.11613211E-06        3  35  24  24  # H0-W-W eff. coupling^2, normalised to SM
    0.00000000E+00        3  36  24  24  # A0-W-W eff. coupling^2, normalised to SM
#
    9.99997884E-01        3  25  23  23  # h0-Z-Z eff. coupling^2, normalised to SM
    2.11613211E-06        3  35  23  23  # H0-Z-Z eff. coupling^2, normalised to SM
    0.00000000E+00        3  36  23  23  # A0-Z-Z eff. coupling^2, normalised to SM
#
    1.26726594E+00        3  25  21  21  # h0-g-g eff. coupling^2, normalised to SM
    1.08011213E-03        3  35  21  21  # H0-g-g eff. coupling^2, normalised to SM
    9.39170351E-02        3  36  21  21  # A0-g-g eff. coupling^2, normalised to SM
#
    0.00000000E+00        3  25  25  23  # h0-h0-Z eff. coupling^2, normalised to SM
    0.00000000E+00        3  35  25  23  # H0-h0-Z eff. coupling^2, normalised to SM
    2.11613211E-06        3  36  25  23  # A0-h0-Z eff. coupling^2, normalised to SM
    0.00000000E+00        3  35  35  23  # H0-H0-Z eff. coupling^2, normalised to SM
    9.99997884E-01        3  36  35  23  # A0-H0-Z eff. coupling^2, normalised to SM
    0.00000000E+00        3  36  36  23  # A0-A0-Z eff. coupling^2, normalised to SM
#
    0.00000000E+00        4  25  21  21  23  # h0-g-g-Z eff. coupling^2, normalised to SM
    0.00000000E+00        4  35  21  21  23  # H0-g-g-Z eff. coupling^2, normalised to SM
    0.00000000E+00        4  36  21  21  23  # A0-g-g-Z eff. coupling^2, normalised to SM
Block SPhenoLowEnergy  # low energy observables
    1    3.15643235E-04   # BR(b -> s gamma)
    2    1.59034167E-06   # BR(b -> s mu+ mu-)
    3    3.52392303E-05   # BR(b -> s nu nu)
    4    2.65163576E-15   # BR(Bd -> e+ e-)
    5    1.13274779E-10   # BR(Bd -> mu+ mu-)
    6    2.37076818E-08   # BR(Bd -> tau+ tau-)
    7    8.91283839E-14   # BR(Bs -> e+ e-)
    8    3.80755887E-09   # BR(Bs -> mu+ mu-)
    9    8.07447160E-07   # BR(Bs -> tau+ tau-)
   10    9.66389775E-05   # BR(B_u -> tau nu)
   11    9.98243640E-01   # BR(B_u -> tau nu)/BR(B_u -> tau nu)_SM
   12    5.42130540E-01   # |Delta(M_Bd)| [ps^-1] 
   13    1.93698079E+01   # |Delta(M_Bs)| [ps^-1] 
   14    0.00000000E+00   # neutron EDM according to the chiral quark model
   15    0.00000000E+00   # neutron EDM according to the relativistic quark-parton model
   16    2.15792272E-03   # epsilon_K
   17    2.28166438E-15   # Delta(M_K)
   18    2.47883476E-11   # BR(K^0 -> pi^0 nu nu)
   19    8.28776630E-11   # BR(K^+ -> pi^+ nu nu)
   20    2.42334988E-16   # Delta(g-2)_electron/2
   21    1.03606383E-11   # Delta(g-2)_muon/2
   22    2.93547791E-09   # Delta(g-2)_tau/2
   23    0.00000000E+00   # electric dipole moment of the electron
   24    0.00000000E+00   # electric dipole moment of the muon
   25    0.00000000E+00   # electric dipole moment of the tau
   26    0.00000000E+00   # Br(mu -> e gamma)
   27    0.00000000E+00   # Br(tau -> e gamma)
   28    0.00000000E+00   # Br(tau -> mu gamma)
   29    0.00000000E+00   # Br(mu -> 3 e)
   30    0.00000000E+00   # Br(tau -> 3 e)
   31    0.00000000E+00   # Br(tau -> 3 mu)
   39    6.18551963E-05   # Delta(rho_parameter)
   40    0.00000000E+00   # BR(Z -> e mu)
   41    0.00000000E+00   # BR(Z -> e tau)
   42    0.00000000E+00   # BR(Z -> mu tau)
Block FWCOEF Q=  1.60000000E+02  # Wilson coefficients at scale Q
#    id        order  M        value         comment
     0305 4422   00   0    -1.88819110E-01   # C7
     0305 4422   00   2    -1.82588490E-01   # C7
     0305 4322   00   2    -1.22654232E-05   # C7'
     0305 6421   00   0    -9.52278348E-02   # C8
     0305 6421   00   2    -9.56883525E-02   # C8
     0305 6321   00   2    -7.02154057E-05   # C8'
 03051111 4133   00   0     1.61768138E+00   # C9 e+e-
 03051111 4133   00   2     1.61816248E+00   # C9 e+e-
 03051111 4233   00   2     1.75948193E-04   # C9' e+e-
 03051111 4137   00   0    -4.44037348E+00   # C10 e+e-
 03051111 4137   00   2    -4.43743218E+00   # C10 e+e-
 03051111 4237   00   2    -1.31820161E-03   # C10' e+e-
 03051313 4133   00   0     1.61768138E+00   # C9 mu+mu-
 03051313 4133   00   2     1.61816243E+00   # C9 mu+mu-
 03051313 4233   00   2     1.75948159E-04   # C9' mu+mu-
 03051313 4137   00   0    -4.44037348E+00   # C10 mu+mu-
 03051313 4137   00   2    -4.43743224E+00   # C10 mu+mu-
 03051313 4237   00   2    -1.31820167E-03   # C10' mu+mu-
 03051212 4137   00   0     1.50535012E+00   # C11 nu_1 nu_1
 03051212 4137   00   2     1.50471449E+00   # C11 nu_1 nu_1
 03051212 4237   00   2     2.85622186E-04   # C11' nu_1 nu_1
 03051414 4137   00   0     1.50535012E+00   # C11 nu_2 nu_2
 03051414 4137   00   2     1.50471449E+00   # C11 nu_2 nu_2
 03051414 4237   00   2     2.85622188E-04   # C11' nu_2 nu_2
 03051616 4137   00   0     1.50535012E+00   # C11 nu_3 nu_3
 03051616 4137   00   2     1.50471449E+00   # C11 nu_3 nu_3
 03051616 4237   00   2     2.85622781E-04   # C11' nu_3 nu_3
Block IMFWCOEF Q=  1.60000000E+02  # Im(Wilson coefficients) at scale Q
#    id        order  M        value         comment
     0305 4422   00   0     3.85825058E-07   # C7
     0305 4422   00   2     1.11815724E-05   # C7
     0305 4322   00   2     8.23847943E-07   # C7'
     0305 6421   00   0     3.30484679E-07   # C8
     0305 6421   00   2    -3.46234887E-06   # C8
     0305 6321   00   2     1.30629722E-07   # C8'
 03051111 4133   00   2     7.19482596E-07   # C9 e+e-
 03051111 4233   00   2     3.28333933E-06   # C9' e+e-
 03051111 4137   00   2     1.63498878E-07   # C10 e+e-
 03051111 4237   00   2    -2.46000644E-05   # C10' e+e-
 03051313 4133   00   2     7.19480831E-07   # C9 mu+mu-
 03051313 4233   00   2     3.28333890E-06   # C9' mu+mu-
 03051313 4137   00   2     1.63500644E-07   # C10 mu+mu-
 03051313 4237   00   2    -2.46000656E-05   # C10' mu+mu-
 03051212 4137   00   2    -5.57568443E-09   # C11 nu_1 nu_1
 03051212 4237   00   2     5.33023553E-06   # C11' nu_1 nu_1
 03051414 4137   00   2    -5.57559862E-09   # C11 nu_2 nu_2
 03051414 4237   00   2     5.33023553E-06   # C11' nu_2 nu_2
 03051616 4137   00   2    -5.55140296E-09   # C11 nu_3 nu_3
 03051616 4237   00   2     5.33023552E-06   # C11' nu_3 nu_3
