BLOCK SPINFO
   1   SPheno
   2   v4.0.5be

BLOCK SPHENOINFO
   1   2
   2   2

BLOCK MODSEL
   1   0

BLOCK MINPAR
   3    15.521496
   4    1

BLOCK EXTPAR
   0    4103.3813
   1   -483.55885
   2    785.30143
   3    4000
   11   -2319.2477
   12    1624.5498
   13    51.056595
   23    494.45776
   25    14.788725
   26    2000
   31    887.32358
   32    887.32358
   33    410.87965
   34    1567.6803
   35    1567.6803
   36    1531.2372
   41    4000
   42    4000
   43    4000
   44    4000
   45    4000
   46    4000
   47    4000
   48    4000
   49    4000

BLOCK SMINPUTS
   1    127.90897
   2    1.1663787e-05
   3    0.1184
   4    91.1876
   5    4.18
   6    173.2
   7    1.777
   8    0
   11    0.00051099893
   12    0
   13    0.10565837
   14    0
   21    0.005
   22    0.0025
   23    0.095
   24    1.27

BLOCK GAUGE Q=  4103.3813
   1    0.35536298
   2    0.66519887
   3    1.219778

BLOCK YU Q=  4103.3813
   1   1    8.4035184e-06
   2   2    0.0042689873
   3   3    1.0152125

BLOCK YD Q=  4103.3813
   1   1    0.00024973082
   2   2    0.0047448855
   3   3    0.24765472

BLOCK YE Q=  4103.3813
   1   1    4.3579854e-05
   2   2    0.0090109316
   3   3    0.15154904

BLOCK AU Q=  4103.3813
   1   1    0
   2   2    0
   3   3   -2319.2482

BLOCK AD Q=  4103.3813
   1   1    0
   2   2    0
   3   3    1624.5496

BLOCK AE Q=  4103.3813
   1   1    0
   2   2    0
   3   3    51.056592

BLOCK MSOFT Q=  4103.3813
   1   -483.55885
   2    785.30143
   3    4000
   21    3749524.8
   22    158285.68
   31    887.32358
   32    887.32358
   33    410.87965
   34    1567.6803
   35    1567.6803
   36    1531.2372
   41    4000
   42    4000
   43    4000
   44    4000
   45    4000
   46    4000
   47    4000
   48    4000
   49    4000

BLOCK MASS
   6    173.2
   23    91.1876
   24    80.429995
   15    1.777
   25    121.85043
   35    1999.8062
   36    2000
   37    2001.7669
   1000001    4155.2765
   2000001    4142.8814
   1000002    4154.5131
   2000002    4144.7889
   1000003    4155.2756
   2000003    4142.88
   1000004    4154.5121
   2000004    4144.788
   1000005    4121.4551
   2000005    4139.5883
   1000006    4055.9325
   2000006    4151.3852
   1000011    903.60913
   2000011    1569.2048
   1000012    899.72819
   1000013    903.60302
   2000013    1569.1974
   1000014    899.72286
   1000015    440.35937
   2000015    1530.8091
   1000016    433.41137
   1000021    4249.0659
   1000022   -458.34764
   1000023    493.54296
   1000025   -522.75381
   1000035    830.46699
   1000024    494.34949
   1000037    830.6942
   1000039    1e-09

BLOCK ALPHA
      -0.064705514

BLOCK HMIX Q=  4103.3813
   1    494.45776
   2    14.788725
   3    242.93057
   4    4000000

BLOCK STOPMIX
   1   1    0.54644153
   1   2    0.83749726
   2   1   -0.83749726
   2   2    0.54644153

BLOCK SBOTMIX
   1   1    0.99615139
   1   2    0.087649336
   2   1   -0.087649336
   2   2    0.99615139

BLOCK STAUMIX
   1   1    0.9999809
   1   2    0.0061802773
   2   1   -0.0061802773
   2   2    0.9999809

BLOCK NMIX
   1   1    0.85133285
   1   2    0.020290033
   1   3    0.38997847
   1   4    0.3503391
   2   1   -0.033259507
   2   2   -0.18027311
   2   3    0.70106819
   2   4   -0.68912902
   3   1   -0.52354171
   3   2    0.034118777
   3   3    0.5885559
   3   4    0.61509506
   4   1    0.0055013025
   4   2   -0.98281526
   4   3   -0.10011063
   4   4    0.15498957

BLOCK UMIX
   1   1   -0.14202032
   1   2    0.98986374
   2   1    0.98986374
   2   2    0.14202032

BLOCK VMIX
   1   1   -0.21998192
   1   2    0.97550395
   2   1    0.97550395
   2   2    0.21998192

BLOCK HIGGSBOUNDSINPUTHIGGSCOUPLINGSFERMIONS
       0, 218.70639,3,36,15,15

BLOCK HIGGSBOUNDSINPUTHIGGSCOUPLINGSBOSONS
       0,4,36,21,21,23

BLOCK SPHENOLOWENERGY
   1    0.00033063354
   2    1.5891471e-06
   3    3.5255419e-05
   4    2.6288295e-15
   5    1.123006e-10
   6    2.3508289e-08
   7    8.8498841e-14
   8    3.7806673e-09
   9    8.0188939e-07
   10    9.6442977e-05
   11    0.99621903
   12    0.54201812
   13    19.364802
   14    0
   15    0
   16    0.0021574353
   17    2.28166e-15
   18    2.4800655e-11
   19    8.2906778e-11
   20    1.546262e-15
   21    6.6105698e-11
   22    5.8934176e-09
   23    0
   24    0
   25    0
   26    0
   27    0
   28    0
   29    0
   30    0
   31    0
   39    3.6708653e-05
   40    0
   41    0
   42    0

BLOCK FWCOEF Q=  160
   305   4422   0   0   -0.18881911
   305   4422   0   2   -0.19878708
   305   4322   0   2   -0.00019770484
   305   6421   0   0   -0.095227835
   305   6421   0   2   -0.1103763
   305   6321   0   2   -0.00029892236
   3051111   4133   0   0    1.6271771
   3051111   4133   0   2    1.6274062
   3051111   4233   0   2    2.9829283e-05
   3051111   4137   0   0   -4.4498692
   3051111   4137   0   2   -4.4484331
   3051111   4237   0   2   -0.0002205707
   3051313   4133   0   0    1.6271771
   3051313   4133   0   2    1.627406
   3051313   4233   0   2    2.9829244e-05
   3051313   4137   0   0   -4.4498692
   3051313   4137   0   2   -4.4484333
   3051313   4237   0   2   -0.0002205707
   3051212   4137   0   0    1.5053501
   3051212   4137   0   2    1.5050506
   3051212   4237   0   2    4.7690485e-05
   3051414   4137   0   0    1.5053501
   3051414   4137   0   2    1.5050506
   3051414   4237   0   2    4.7690491e-05
   3051616   4137   0   0    1.5053501
   3051616   4137   0   2    1.5050506
   3051616   4237   0   2    4.7692289e-05

BLOCK IMFWCOEF Q=  160
   305   4422   0   0    3.858254e-07
   305   4422   0   2    4.45925e-06
   305   4322   0   2    1.0269181e-06
   305   6421   0   0    3.3048497e-07
   305   6421   0   2   -4.8325878e-07
   305   6321   0   2    3.9490127e-07
   3051111   4133   0   2   -1.6636629e-07
   3051111   4233   0   2    7.4430431e-07
   3051111   4137   0   2    4.9742673e-07
   3051111   4237   0   2   -5.5047357e-06
   3051313   4133   0   2   -1.6637085e-07
   3051313   4233   0   2    7.4430416e-07
   3051313   4137   0   2    4.9742902e-07
   3051313   4237   0   2   -5.5047362e-06
   3051212   4137   0   2    8.9809479e-08
   3051212   4237   0   2    1.190201e-06
   3051414   4137   0   2    8.9809553e-08
   3051414   4237   0   2    1.190201e-06
   3051616   4137   0   2    9.0371703e-08
   3051616   4237   0   2    1.190201e-06

DECAY 23  2.4952


DECAY 24  2.085


DECAY 1000011  1.0360236
    0.47796893   2    1000022    11
    0.18044941   2   -1000037    12
    0.10247441   2    1000025    11
    0.088941789   2    1000035    11
    0.076034221   2   -1000024    12
    0.074130563   2    1000023    11

DECAY 2000011  6.4963812
    0.73595885   2    1000022    11
    0.26293032   2    1000025    11
    0.0010901116   2    1000023    11

DECAY 1000013  1.0366664
    0.47778536   2    1000022    13
    0.18030971   2   -1000037    14
    0.10262276   2    1000025    13
    0.088873698   2    1000035    13
    0.075985684   2   -1000024    14
    0.074422124   2    1000023    13

DECAY 2000013  6.5005034
    0.73553647   2    1000022    13
    0.26286901   2    1000025    13
    0.0012450607   2    1000023    13
    0.00031000119   2   -1000024    14

DECAY 1000015  6.0542262e-08
    0.3134021   2    1000039    15
    0.24734985   3    1000016    1   -2
    0.21033736   3    1000016    3   -4
    0.082450214   3    1000016    11   -12
    0.082355108   3    1000016    13   -14
    0.064100078   3    1000016    15   -16

DECAY 2000015  7.5233089
    0.62515632   2    1000022    15
    0.24445601   2    1000025    15
    0.072516086   2   -1000024    16
    0.037281836   2    1000023    15
    0.0095427139   2    1000016   -24
    0.0047161266   2    1000015    23
    0.0043384572   2    1000015    25
    0.0013197294   2   -1000037    16
    0.00067143819   2    1000035    15

DECAY 1000012  1.0674515
    0.38405561   2    1000022    12
    0.17499306   2    1000024    11
    0.16030961   2    1000025    12
    0.15375852   2    1000037    11
    0.079000251   2    1000035    12
    0.047882307   2    1000023    12

DECAY 1000014  1.0680945
    0.38381895   2    1000022    14
    0.1755307   2    1000024    13
    0.16021022   2    1000025    14
    0.15364532   2    1000037    13
    0.078941464   2    1000035    14
    0.047852711   2    1000023    14

DECAY 1000016  1.7524844e-08
    1   2    1000039    16

DECAY 2000001  2.2534584
    0.72579955   2    1000022    1
    0.27244451   2    1000025    1
    0.0011044855   2    1000023    1
    0.00062060545   2    1000039    1

DECAY 1000001  51.203346
    0.64514819   2   -1000037    2
    0.31864533   2    1000035    1
    0.014004067   2   -1000024    2
    0.010553878   2    1000023    1
    0.0060098992   2    1000022    1
    0.0056109018   2    1000025    1

DECAY 2000003  2.2570502
    0.72476571   2    1000022    3
    0.27228612   2    1000025    3
    0.0014943454   2    1000023    3
    0.00078277548   2   -1000024    4
    0.0006196168   2    1000039    3

DECAY 1000003  51.206595
    0.6451085   2   -1000037    4
    0.31862538   2    1000035    3
    0.014030281   2   -1000024    4
    0.01057051   2    1000023    3
    0.006014891   2    1000022    3
    0.0056227127   2    1000025    3

DECAY 1000005  136.32394
    0.57299709   2   -1000024    6
    0.26516167   2   -1000037    6
    0.11686996   2    1000035    5
    0.022863765   2    1000023    5
    0.012292578   2    1000025    5
    0.0098049377   2    1000022    5

DECAY 2000005  13.01625
    0.38965363   2   -1000024    6
    0.20017031   2    1000025    5
    0.17161307   2    1000023    5
    0.16103274   2    1000022    5
    0.052537039   2   -1000037    6
    0.024874872   2    1000035    5
    0.00010701649   2    1000039    5

DECAY 2000002  9.0139719
    0.72613883   2    1000022    2
    0.27257311   2    1000025    2
    0.0011039161   2    1000023    2
    0.00015550649   2    1000039    2

DECAY 1000002  51.249461
    0.62586789   2    1000037    1
    0.31702387   2    1000035    2
    0.033562405   2    1000024    1
    0.012023421   2    1000023    2
    0.010287211   2    1000022    2
    0.0012075249   2    1000025    2

DECAY 2000004  9.016881
    0.72592476   2    1000022    4
    0.2725454   2    1000025    4
    0.0011805241   2    1000023    4
    0.00015545609   2    1000039    4
    0.00015411297   2    1000024    3

DECAY 1000004  51.252708
    0.62582877   2    1000037    3
    0.3170044   2    1000035    4
    0.03359472   2    1000024    3
    0.012036153   2    1000023    4
    0.010290045   2    1000022    4
    0.0012182373   2    1000025    4

DECAY 1000006  159.38934
    0.41508183   2    1000024    5
    0.262274   2    1000023    6
    0.23925116   2    1000025    6
    0.058632603   2    1000022    6
    0.013217727   2    1000037    5
    0.010202014   2    1000035    6
    0.00090846085   3    1000022    24    5
    0.00022867628   2    1000023    4
    0.00019569329   2    1000022    4

DECAY 2000006  148.953
    0.2414319   2    1000023    6
    0.22674122   2    1000037    5
    0.17050053   2    1000025    6
    0.12386011   2    1000035    6
    0.1202111   2    1000022    6
    0.11716272   2    1000024    5

DECAY 1000024  0.013896573
    0.85722762   2    1000016   -15
    0.13732247   2   -1000015    16
    0.00181172   3    1000022   -1    2
    0.0018016829   3    1000022   -3    4
    0.00063132916   3    1000022   -15    16
    0.00060199803   3    1000022   -11    12
    0.00060198172   3    1000022   -13    14

DECAY 1000037  10.128306
    0.18276958   2   -1000015    16
    0.18208469   2    1000016   -15
    0.15865521   2    1000023    24
    0.15470433   2    1000024    23
    0.14120153   2    1000024    25
    0.1151715   2    1000025    24
    0.064348053   2    1000022    24
    0.00052953823   3    1000023   -5    6
    0.00024646693   3    1000022   -5    6
    0.00020715544   3    1000025   -5    6

DECAY 1000022  0.006998113
    0.30490443   2    1000016   -16
    0.30490443   2   -1000016    16
    0.19509424   2    1000015   -15
    0.19509424   2   -1000015    15

DECAY 1000023  0.011530907
    0.36746465   2    1000015   -15
    0.36746465   2   -1000015    15
    0.13025405   2    1000016   -16
    0.13025405   2   -1000016    16
    0.00092799391   3    1000022    12   -12
    0.00068518485   3    1000022    1   -1
    0.00068513084   3    1000022    3   -3
    0.00058828973   3    1000022    5   -5
    0.00053439704   3    1000022    2   -2
    0.00052568609   3    1000022    4   -4
    0.00015909535   3    1000022    15   -15
    0.00015394675   3    1000022    11   -11
    0.000153928   3    1000022    13   -13
    0.0001476935   2    1000022    22

DECAY 1000025  0.0412637
    0.26829716   2    1000016   -16
    0.26829716   2   -1000016    16
    0.22962484   2    1000015   -15
    0.22962484   2   -1000015    15
    0.00046577987   3    1000024    1   -2
    0.00046577987   3   -1000024   -1    2
    0.00046146726   3    1000024    3   -4
    0.00046146726   3   -1000024   -3    4
    0.00025878724   3    1000023    12   -12
    0.00019402705   3    1000023    1   -1
    0.00019400432   3    1000023    3   -3
    0.00015547374   3    1000024    11   -12
    0.00015547374   3   -1000024   -11    12
    0.00015546684   3    1000024    13   -14
    0.00015546684   3   -1000024   -13    14
    0.0001545684   3    1000023    5   -5
    0.00015132442   3    1000023    2   -2
    0.0001509255   3    1000024    15   -16
    0.0001509255   3   -1000024   -15    16
    0.00014768545   3    1000023    4   -4
    0.0001157752   2    1000023    22

DECAY 1000035  11.287275
    0.14463482   2    1000024   -24
    0.14463482   2   -1000024    24
    0.11883594   2    1000023    25
    0.10081997   2    1000025    23
    0.083304304   2    1000016   -16
    0.083304304   2   -1000016    16
    0.080353513   2    1000015   -15
    0.080353513   2   -1000015    15
    0.062933613   2    1000025    25
    0.05450961   2    1000022    23
    0.038409842   2    1000022    25
    0.0068663606   2    1000023    23
    0.0004739667   3    1000024    5   -6
    0.0004739667   3   -1000024   -5    6

DECAY 1000021  4.2582906
    0.070491543   3    1000023    6   -6
    0.051365392   2    1000005   -5
    0.051365392   2   -1000005    5
    0.050957243   3    1000025    6   -6
    0.038441148   2    2000005   -5
    0.038441148   2   -2000005    5
    0.035975333   2    2000003   -3
    0.035975333   2   -2000003    3
    0.035974417   2    2000001   -1
    0.035974417   2   -2000001    1
    0.034760652   3    1000035    6   -6
    0.034709304   2    2000002   -2
    0.034709304   2   -2000002    2
    0.034707378   2    2000004   -4
    0.034707378   2   -2000004    4
    0.033731748   3    1000022    6   -6
    0.028603765   2    1000002   -2
    0.028603765   2   -1000002    2
    0.028601829   2    1000004   -4
    0.028601829   2   -1000004    4
    0.028149405   2    1000003   -3
    0.028149405   2   -1000003    3
    0.028148849   2    1000001   -1
    0.028148849   2   -1000001    1
    0.027916127   3    1000037    5   -6
    0.027916127   3   -1000037   -5    6
    0.014985066   3    1000024    5   -6
    0.014985066   3   -1000024   -5    6
    0.0092187716   2    1000006   -6
    0.0092187716   2   -1000006    6
    0.0070718922   2    1000006   -4
    0.0070718922   2   -1000006    4
    0.00091040156   2    1000023    21
    0.00075864584   2    1000025    21
    0.0003727217   2    1000039    21
    0.00024853033   2    1000022    21

DECAY 25  0.0035281441
    0.62145818   2   -5    5
    0.17845186   2   -24    24
    0.074060026   2    21    21
    0.071230515   2   -15    15
    0.03049878   2   -4    4
    0.020273377   2    23    23
    0.0023183165   2    22    22
    0.0012277413   2    22    23
    0.00024700737   2   -13    13
    0.00023338878   2   -3    3
    6.4529636e-07   2   -1    1
    1.5717754e-07   2   -2    2
    5.5530428e-09   2   -11    11

DECAY 35  23.94714
    0.23648022   2   -5    5
    0.19792606   2   -1000024    1000037
    0.19792606   2   -1000037    1000024
    0.088355105   2    1000025    1000035
    0.059632917   2    1000023    1000035
    0.049732033   2    1000022    1000035
    0.045853101   2   -15    15
    0.035188873   2    1000022    1000023
    0.022714148   2   -1000024    1000024
    0.018826484   2    1000025    1000025
    0.017376674   2    1000022    1000022
    0.013142543   2   -6    6
    0.0061486845   2    1000023    1000023
    0.0058857501   2    1000023    1000025
    0.0026982737   2   -1000037    1000037
    0.0013781935   2    1000035    1000035
    0.00038144743   2    1000022    1000025
    0.00015350046   2   -13    13
    8.934955e-05   2   -3    3
    5.9545713e-05   2    25    25
    1.0786015e-05   2    23    23
    6.672625e-06   2   -2000015    1000015
    6.672625e-06   2   -1000015    2000015
    5.7189764e-06   2   -24    24
    2.6086488e-06   2    21    21
    1.3098697e-06   2   -1000015    1000015
    1.0661764e-06   2   -1000011    1000011
    1.0647482e-06   2   -1000013    1000013
    4.9164752e-07   2    22    23
    2.4702184e-07   2   -1    1
    2.4300958e-07   2    22    22
    1.8043902e-07   2   -4    4
    3.4479705e-09   2   -11    11
    9.3024632e-13   2   -2    2

DECAY 36  23.730063
    0.23193612   2   -5    5
    0.18897006   2   -1000024    1000037
    0.18897006   2   -1000037    1000024
    0.12804639   2    1000023    1000035
    0.044971279   2   -15    15
    0.040988926   2    1000025    1000035
    0.03540747   2   -1000024    1000024
    0.031733446   2    1000022    1000023
    0.022950795   2    1000022    1000035
    0.01979838   2    1000025    1000025
    0.017545741   2    1000022    1000022
    0.012818721   2   -6    6
    0.011289767   2   -1000037    1000037
    0.010440939   2    1000023    1000023
    0.0077855273   2    1000023    1000025
    0.0057246234   2    1000035    1000035
    0.00032822737   2    1000022    1000025
    0.00015054974   2   -13    13
    8.7631364e-05   2   -3    3
    2.5710989e-05   2    21    21
    1.4694867e-05   2    23    25
    6.7123336e-06   2   -2000015    1000015
    6.7123336e-06   2   -1000015    2000015
    6.9507575e-07   2    22    23
    4.0110556e-07   2    22    22
    2.4227164e-07   2   -1    1
    1.7044606e-07   2   -4    4
    3.3816879e-09   2   -11    11
    8.7881629e-13   2   -2    2
    1.4622271e-39   2    25    25

DECAY 37  23.515834
    0.24281   2   -5    6
    0.21752015   2    1000023    1000037
    0.20838288   2    1000024    1000035
    0.12957621   2    1000025    1000037
    0.077797352   2    1000022    1000024
    0.072710983   2    1000022    1000037
    0.04101239   2   -15    16
    0.0087126322   2    1000024    1000025
    0.00083870212   2    1000023    1000024
    0.00033982957   2   -5    4
    0.00014499357   2   -13    14
    8.0332426e-05   2   -3    4
    2.0672896e-05   2   -3    6
    1.4889451e-05   2    24    25
    1.4661672e-05   2   -2000015    1000016
    7.2007344e-06   2   -1000015    1000016
    4.2887114e-06   2   -1000011    1000012
    4.2866576e-06   2   -1000013    1000014
    3.7359643e-06   2   -3    2
    2.4267329e-06   2   -5    2
    9.4278334e-07   2   -1    6
    2.2238417e-07   2   -1    2
    1.9586564e-07   2    1000035    1000037
    1.9025652e-08   2   -1    4
    3.3914146e-09   2   -11    12
    1.6763734e-12   2    24    35
    9.9631621e-13   2    24    36

DECAY 6  2.43
    1   2    5    24

DECAY 15 -1


DECAY 1000039 -1
