BLOCK SPINFO
   1   SPheno
   2   v4.0.5be

BLOCK SPHENOINFO
   1   2
   2   2

BLOCK MODSEL
   1   0

BLOCK MINPAR
   3    55.739037
   4   -1

BLOCK EXTPAR
   0    1452.2548
   1    208.16399
   2    996.36973
   3    3000
   11   -3207.9557
   12    9.3991242
   13    762.26684
   23   -1404.2422
   25    56.412916
   26    3781.8223
   31    170.89904
   32    170.89904
   33    1195.6444
   34    880.42121
   35    880.42121
   36    840.42843
   41    5000
   42    5000
   43    1782.0693
   44    5000
   45    5000
   46    1223.6467
   47    5000
   48    5000
   49    1633.1707

BLOCK SMINPUTS
   1    127.90897
   2    1.1663787e-05
   3    0.1184
   4    91.1876
   5    4.18
   6    173.2
   7    1.777
   8    0
   11    0.00051099893
   12    0
   13    0.10565837
   14    0
   21    0.005
   22    0.0025
   23    0.095
   24    1.27

BLOCK GAUGE Q=  1452.2548
   1    0.35536298
   2    0.66519887
   3    1.219778

BLOCK YU Q=  1452.2548
   1   1    8.3856893e-06
   2   2    0.0042599302
   3   3    1.0130586

BLOCK YD Q=  1452.2548
   1   1    0.00095059946
   2   2    0.01806139
   3   3    0.94269679

BLOCK YE Q=  1452.2548
   1   1    0.00016588656
   2   2    0.034300079
   3   3    0.5768709

BLOCK AU Q=  1452.2548
   1   1    0
   2   2    0
   3   3   -3207.9558

BLOCK AD Q=  1452.2548
   1   1    0
   2   2    0
   3   3    9.3991317

BLOCK AE Q=  1452.2548
   1   1    0
   2   2    0
   3   3    762.26684

BLOCK MSOFT Q=  1452.2548
   1    208.16399
   2    996.36973
   3    3000
   21    12431475
   22   -1953979.3
   31    170.89904
   32    170.89904
   33    1195.6444
   34    880.42121
   35    880.42121
   36    840.42843
   41    5000
   42    5000
   43    1782.0693
   44    5000
   45    5000
   46    1223.6467
   47    5000
   48    5000
   49    1633.1707

BLOCK MASS
   6    173.2
   23    91.1876
   24    80.429995
   15    1.777
   25    123.17966
   35    3777.1595
   36    3781.8223
   37    3778.3439
   1000001    5025.0229
   2000001    5015.2375
   1000002    5024.5813
   2000002    5018.1809
   1000003    5025.0491
   2000003    5015.2444
   1000004    5024.5928
   2000004    5018.1818
   1000005    1647.4915
   2000005    1812.7067
   1000006    1159.5338
   2000006    1818.8723
   1000011    228.65703
   2000011    875.12501
   1000012    214.21418
   1000013    228.62969
   2000013    875.27092
   1000014    214.44983
   1000015    847.21379
   2000015    1224.5684
   1000016    1211.2106
   1000021    3184.1027
   1000022    207.18584
   1000023    1031.2385
   1000025   -1401.1699
   1000035    1406.9817
   1000024    1031.3883
   1000037    1408.4331

BLOCK ALPHA
      -0.017968076

BLOCK HMIX Q=  1452.2548
   1   -1404.2422
   2    56.412916
   3    244.05486
   4    14302180

BLOCK STOPMIX
   1   1    0.23549689
   1   2    0.9718751
   2   1   -0.9718751
   2   2    0.23549689

BLOCK SBOTMIX
   1   1   -0.41358878
   1   2    0.91046379
   2   1   -0.91046379
   2   2   -0.41358878

BLOCK STAUMIX
   1   1   -0.17816532
   1   2    0.98400057
   2   1   -0.98400057
   2   2   -0.17816532

BLOCK NMIX
   1   1   -0.99945323
   1   2    0.00062098133
   1   3    0.032746979
   1   4    0.0045263966
   2   1    0.0047262811
   2   2    0.99008951
   2   3    0.11419261
   2   4    0.081611681
   3   1   -0.019921367
   3   2    0.023243162
   3   3   -0.70621985
   3   4    0.70733048
   4   1   -0.025962279
   4   2    0.13849955
   4   3   -0.69795502
   4   4   -0.70214146

BLOCK UMIX
   1   1   -0.98570367
   1   2   -0.1684882
   2   1    0.1684882
   2   2   -0.98570367

BLOCK VMIX
   1   1   -0.99246097
   1   2    0.12256113
   2   1    0.12256113
   2   2    0.99246097

BLOCK HIGGSBOUNDSINPUTHIGGSCOUPLINGSFERMIONS
       0, 3182.4171,3,36,15,15

BLOCK HIGGSBOUNDSINPUTHIGGSCOUPLINGSBOSONS
       0,4,36,21,21,23

BLOCK SPHENOLOWENERGY
   1    0.00038797002
   2    1.5888904e-06
   3    3.5269033e-05
   4    1.5158939e-15
   5    6.4722903e-11
   6    1.1560734e-08
   7    5.1385569e-14
   8    2.1940725e-09
   9    3.9985066e-07
   10    9.3839686e-05
   11    0.96932803
   12    0.54456163
   13    19.407181
   14    0
   15    0
   16    0.0021844283
   17    2.2819363e-15
   18    2.4804762e-11
   19    8.2918222e-11
   20   -5.364284e-14
   21   -2.3088137e-09
   22   -1.5320641e-07
   23    0
   24    0
   25    0
   26    0
   27    0
   28    0
   29    0
   30    0
   31    0
   39    0.00014888626
   40    0
   41    0
   42    0

BLOCK FWCOEF Q=  160
   305   4422   0   0   -0.18881911
   305   4422   0   2   -0.26413627
   305   4322   0   2   -0.00060245861
   305   6421   0   0   -0.095227835
   305   6421   0   2   -0.14089173
   305   6321   0   2   -0.00033906131
   3051111   4133   0   0    1.5917154
   3051111   4133   0   2    1.5926859
   3051111   4233   0   2    0.00038847191
   3051111   4137   0   0   -4.4144075
   3051111   4137   0   2   -4.4144141
   3051111   4237   0   2   -0.0030265642
   3051313   4133   0   0    1.5917154
   3051313   4133   0   2    1.5926707
   3051313   4233   0   2    0.00038846901
   3051313   4137   0   0   -4.4144075
   3051313   4137   0   2   -4.4144293
   3051313   4237   0   2   -0.003026572
   3051212   4137   0   0    1.5053501
   3051212   4137   0   2    1.505365
   3051212   4237   0   2    0.00065963011
   3051414   4137   0   0    1.5053501
   3051414   4137   0   2    1.505365
   3051414   4237   0   2    0.00065963022
   3051616   4137   0   0    1.5053501
   3051616   4137   0   2    1.5053665
   3051616   4237   0   2    0.0006596614

BLOCK IMFWCOEF Q=  160
   305   4422   0   0    3.8542479e-07
   305   4422   0   2   -3.0728416e-05
   305   4322   0   2   -9.3040802e-06
   305   6421   0   0    3.3014183e-07
   305   6421   0   2    1.0456471e-05
   305   6321   0   2   -4.1052906e-06
   3051111   4133   0   2   -8.2702344e-07
   3051111   4233   0   2    7.8350515e-06
   3051111   4137   0   2    4.8700914e-06
   3051111   4237   0   2   -6.1049815e-05
   3051313   4133   0   2   -8.2725803e-07
   3051313   4233   0   2    7.8350103e-06
   3051313   4137   0   2    4.8698854e-06
   3051313   4237   0   2   -6.1049963e-05
   3051212   4137   0   2   -8.439048e-07
   3051212   4237   0   2    1.3305644e-05
   3051414   4137   0   2   -8.4395135e-07
   3051414   4237   0   2    1.3305644e-05
   3051616   4137   0   2   -8.1882449e-07
   3051616   4237   0   2    1.3305664e-05

DECAY 23  2.4952


DECAY 24  2.085


DECAY 1000011  0.00917124
    0.99988268   2    1000022    11

DECAY 2000011  3.913786
    0.99999986   2    1000022    11

DECAY 1000013  0.0091496202
    0.99989268   2    1000022    13

DECAY 2000013  3.9385715
    0.99391705   2    1000022    13
    0.0060829521   2    1000013    25

DECAY 1000015  3.6989959
    1   2    1000022    15

DECAY 2000015  7.60599
    0.32590468   2    1000015    23
    0.30742094   2    1000015    25
    0.20444269   2    1000022    15
    0.10665136   2   -1000024    16
    0.055580234   2    1000023    15

DECAY 1000012  0.0011223513
    1   2    1000022    12

DECAY 1000014  0.0011962642
    1   2    1000022    14

DECAY 1000016  7.373877
    0.64172852   2    1000015    24
    0.19467415   2    1000022    16
    0.110235   2    1000024    15
    0.053362329   2    1000023    16

DECAY 2000001  143.84379
    0.98060307   2    1000021    1
    0.019377767   2    1000022    1

DECAY 1000001  203.53489
    0.69802532   2    1000021    1
    0.19374936   2   -1000024    2
    0.097575079   2    1000023    1
    0.0052384924   2   -1000037    2
    0.0034544085   2    1000022    1
    0.0018908158   2    1000035    1

DECAY 2000003  143.89972
    0.98022693   2    1000021    3
    0.019370504   2    1000022    3
    0.00018646752   2   -1000037    4
    0.00010465333   2    1000035    3
    0.00010244816   2    1000025    3

DECAY 1000003  203.56721
    0.69792789   2    1000021    3
    0.19371984   2   -1000024    4
    0.097562114   2    1000023    3
    0.0052452168   2   -1000037    4
    0.0034540491   2    1000022    3
    0.0019566096   2    1000035    3
    0.00013428271   2    1000025    3

DECAY 1000005  10.106508
    0.3517311   2    1000006   -24
    0.1872617   2   -1000024    6
    0.10934422   2    1000025    5
    0.10366688   2    1000023    5
    0.098184589   2    1000022    5
    0.09578534   2    1000035    5
    0.054026171   2   -1000037    6

DECAY 2000005  58.314702
    0.64329153   2    1000006   -24
    0.12122719   2   -1000037    6
    0.074796805   2   -1000024    6
    0.045782387   2    1000035    5
    0.044900131   2    1000025    5
    0.043482187   2    1000023    5
    0.01503019   2    1000005    23
    0.0080263784   2    1000005    25
    0.0034632072   2    1000022    5

DECAY 2000002  152.52657
    0.92678983   2    1000021    2
    0.073141837   2    1000022    2

DECAY 1000002  203.5266
    0.69782778   2    1000021    2
    0.19640259   2    1000024    1
    0.097901282   2    1000023    2
    0.0034063685   2    1000022    2
    0.002772021   2    1000037    1
    0.0016541092   2    1000035    2

DECAY 2000004  152.52967
    0.92677113   2    1000021    4
    0.073140349   2    1000022    4

DECAY 1000004  203.55711
    0.69772874   2    1000021    4
    0.19637788   2    1000024    3
    0.097886891   2    1000023    4
    0.0034058655   2    1000022    4
    0.0029033631   2    1000037    3
    0.0016576242   2    1000035    4

DECAY 1000006  2.3020715
    0.96107349   2    1000022    6
    0.034194347   2    1000024    5
    0.0025647586   2    1000023    4
    0.0017620147   2    1000022    4
    0.00016048094   3    1000022    24    5

DECAY 2000006  72.440288
    0.36249637   2    1000006    25
    0.30034923   2    1000006    23
    0.091874303   2    1000024    5
    0.07288167   2    1000037    5
    0.046523045   2    1000035    6
    0.04329256   2    1000025    6
    0.040467609   2    1000023    6
    0.03637739   2    1000005    24
    0.0057378212   2    1000022    6

DECAY 1000024  16.227186
    0.25229485   2    1000012   -11
    0.25226316   2    1000014   -13
    0.24575907   2   -1000013    14
    0.245753   2   -1000011    12
    0.0030191263   2   -1000015    16
    0.0008665675   2    1000022    24

DECAY 1000037  13.464731
    0.31036665   2    1000006   -5
    0.15471205   2    1000023    24
    0.13714213   2    1000024    23
    0.13666481   2    1000024    25
    0.12336073   2   -1000015    16
    0.069460554   2    1000022    24
    0.02335307   2    1000016   -15
    0.012390412   2   -1000013    14
    0.012390251   2   -1000011    12
    0.0077346389   2    1000014   -13
    0.0065996388   2    1000012   -11
    0.0027745943   2   -2000015    16
    0.0018480889   3    1000022   -5    6
    0.00070518448   3    1000023   -5    6
    0.00044810011   2   -2000013    14

DECAY 1000022 -1


DECAY 1000023  16.250707
    0.12470361   2    1000012   -12
    0.12470361   2   -1000012    12
    0.12467886   2    1000014   -14
    0.12467886   2   -1000014    14
    0.12441471   2    1000013   -13
    0.12441471   2   -1000013    13
    0.12440333   2    1000011   -11
    0.12440333   2   -1000011    11
    0.0014648792   2    1000015   -15
    0.0014648792   2   -1000015    15
    0.00040553355   2    1000022    25
    0.00023271584   2    1000022    23

DECAY 1000025  15.691385
    0.13551912   2    1000006   -6
    0.13551912   2   -1000006    6
    0.13256408   2    1000024   -24
    0.13256408   2   -1000024    24
    0.12985153   2    1000023    25
    0.11924765   2    1000023    23
    0.058482152   2    1000015   -15
    0.058482152   2   -1000015    15
    0.03883808   2    1000022    23
    0.037004611   2    1000022    25
    0.0083721278   2    2000015   -15
    0.0083721278   2   -2000015    15
    0.00096763377   3    1000022    6   -6
    0.00079411559   3    1000024    5   -6
    0.00079411559   3   -1000024   -5    6
    0.00052341163   2    1000013   -13
    0.00052341163   2   -1000013    13
    0.0002269449   2    2000013   -13
    0.0002269449   2   -2000013    13
    0.00021522348   2    1000012   -12
    0.00021522348   2   -1000012    12
    0.0002152008   2    1000014   -14
    0.0002152008   2   -1000014    14

DECAY 1000035  12.484571
    0.16546569   2    1000006   -6
    0.16546569   2   -1000006    6
    0.14510226   2    1000023    25
    0.12283567   2    1000024   -24
    0.12283567   2   -1000024    24
    0.069270912   2    1000015   -15
    0.069270912   2   -1000015    15
    0.042637909   2    1000022    25
    0.027622637   2    1000022    23
    0.011642851   2    2000015   -15
    0.011642851   2   -2000015    15
    0.0054942805   2    1000012   -12
    0.0054942805   2   -1000012    12
    0.0054937065   2    1000014   -14
    0.0054937065   2   -1000014    14
    0.0042611124   2    1000013   -13
    0.0042611124   2   -1000013    13
    0.0040840504   2    1000023    23
    0.0036516201   2    1000011   -11
    0.0036516201   2   -1000011    11
    0.0011160506   3    1000022    6   -6
    0.0007962375   3    1000024    5   -6
    0.0007962375   3   -1000024   -5    6
    0.00038603687   2    1000016   -16
    0.00038603687   2   -1000016    16
    0.00031320413   2    2000013   -13
    0.00031320413   2   -2000013    13

DECAY 1000021  208.273
    0.16032073   2    1000006   -6
    0.16032073   2   -1000006    6
    0.12165972   2    1000005   -5
    0.12165972   2   -1000005    5
    0.10977322   2    2000006   -6
    0.10977322   2   -2000006    6
    0.10306363   2    2000005   -5
    0.10306363   2   -2000005    5
    0.0045896366   2    1000006   -4
    0.0045896366   2   -1000006    4
    0.00024331897   3    1000037    5   -6
    0.00024331897   3   -1000037   -5    6
    0.00019906843   3    1000025    6   -6
    0.00018197148   3    1000035    6   -6
    0.00010711067   3    1000023    6   -6

DECAY 25  0.0036358489
    0.59991538   2   -5    5
    0.20060918   2   -24    24
    0.073107631   2    21    21
    0.06903581   2   -15    15
    0.029781461   2   -4    4
    0.023412914   2    23    23
    0.0023254047   2    22    22
    0.0013450345   2    22    23
    0.00024029468   2   -13    13
    0.00022610273   2   -3    3
    6.2515405e-07   2   -1    1
    1.5347641e-07   2   -2    2
    5.402319e-09   2   -11    11

DECAY 35  242.90078
    0.72193252   2   -5    5
    0.076282613   2   -15    15
    0.037156659   2   -1000024    1000037
    0.037156659   2   -1000037    1000024
    0.028523792   2   -2000006    1000006
    0.028523792   2   -1000006    2000006
    0.022441714   2    1000023    1000025
    0.013683993   2    1000023    1000035
    0.0093138221   2   -1000006    1000006
    0.0067317027   2    1000022    1000025
    0.006292715   2    1000022    1000035
    0.0031496621   2   -2000006    2000006
    0.0019608279   2   -1000024    1000024
    0.0013404888   2   -2000015    1000015
    0.0013404888   2   -1000015    2000015
    0.00097187993   2    1000023    1000023
    0.00067286732   2    1000025    1000035
    0.00045538793   2   -1000037    1000037
    0.00044197981   2    1000022    1000023
    0.00040391294   2    1000035    1000035
    0.00026746546   2   -6    6
    0.0002335393   2   -3    3
    0.00022342629   2   -13    13
    0.00021301018   2   -1000015    1000015
    0.00018779091   2   -2000015    2000015
    3.5198157e-05   2    1000022    1000022
    2.1496234e-05   2    1000025    1000025
    1.5287269e-05   2    21    21
    9.9507236e-06   2    25    25
    6.7101195e-06   2   -1000005    1000005
    3.8478555e-06   2   -2000005    1000005
    3.8478555e-06   2   -1000005    2000005
    6.4592622e-07   2   -1    1
    8.2063427e-08   2    22    23
    5.0521309e-08   2    22    22
    3.1227781e-08   2    23    23
    9.4042261e-09   2   -1000011    1000011
    8.894735e-09   2   -1000013    1000013
    7.2199139e-09   2   -2000013    1000013
    7.2199139e-09   2   -1000013    2000013
    7.0570434e-09   2   -24    24
    5.5735764e-09   2   -2000013    2000013
    5.4053628e-09   2   -2000011    2000011
    5.017541e-09   2   -11    11
    1.4552257e-09   2   -4    4
    1.6895754e-13   2   -2000011    1000011
    1.6895754e-13   2   -1000011    2000011
    7.4970103e-15   2   -2    2

DECAY 36  222.49946
    0.70318314   2   -5    5
    0.074276593   2   -15    15
    0.040074104   2   -1000024    1000037
    0.040074104   2   -1000037    1000024
    0.038862602   2   -2000006    1000006
    0.038862602   2   -1000006    2000006
    0.023087991   2    1000023    1000035
    0.015992268   2    1000023    1000025
    0.007194363   2    1000022    1000025
    0.0070440918   2    1000022    1000035
    0.0028140497   2   -1000024    1000024
    0.0016825391   2   -2000015    1000015
    0.0016825391   2   -1000015    2000015
    0.0013943145   2    1000023    1000023
    0.0010209688   2   -1000037    1000037
    0.0009335748   2    1000035    1000035
    0.00049603986   2    1000022    1000023
    0.00041679833   2   -6    6
    0.00034239876   2    1000025    1000035
    0.00022743002   2   -3    3
    0.00021751881   2   -13    13
    5.6751934e-05   2    1000025    1000025
    3.8582627e-05   2    1000022    1000022
    8.1621925e-06   2   -2000005    1000005
    8.1621925e-06   2   -1000005    2000005
    7.5715649e-06   2    21    21
    6.2903194e-07   2   -1    1
    6.7926554e-08   2    23    25
    1.1495342e-08   2    22    23
    7.8138309e-09   2   -2000013    1000013
    7.8138309e-09   2   -1000013    2000013
    4.8848841e-09   2   -11    11
    2.2079615e-09   2   -4    4
    2.1640529e-09   2    22    22
    1.0885047e-11   2    23    35
    1.8276618e-13   2   -2000011    1000011
    1.8276618e-13   2   -1000011    2000011
    1.1378288e-14   2   -2    2
    1.1941682e-37   2    25    25

DECAY 37  200.14333
    0.66690606   2   -5    6
    0.11729368   2   -15    16
    0.046967235   2    1000023    1000037
    0.045956464   2    1000024    1000035
    0.045591051   2    1000024    1000025
    0.04210267   2   -2000005    1000006
    0.015381771   2    1000022    1000037
    0.011628213   2   -1000005    1000006
    0.003628357   2   -1000015    1000016
    0.0010833048   2    1000022    1000024
    0.00098894756   2   -5    4
    0.00075173535   2    1000025    1000037
    0.00043607507   2   -2000005    2000006
    0.00042707539   2   -1000005    2000006
    0.00041467491   2   -13    14
    0.00025675734   2   -3    4
    0.00011579422   2   -2000015    1000016
    4.932706e-05   2    1000035    1000037
    1.2056867e-05   2   -3    2
    7.0621054e-06   2   -5    2
    7.164231e-07   2   -3    6
    7.1330674e-07   2   -1    2
    7.5334576e-08   2    24    25
    4.4813821e-08   2   -1000011    1000012
    4.3936007e-08   2   -1000013    1000014
    3.353759e-08   2   -1    4
    2.6805814e-08   2    1000023    1000024
    1.8000764e-08   2   -2000013    1000014
    1.5334309e-08   2   -1    6
    9.6992893e-09   2   -11    12
    4.2113469e-13   2   -2000011    1000012
    1.5861567e-14   2    24    35

DECAY 6  2.43
    1   2    5    24

DECAY 15 -1
