BLOCK SPINFO
   1   SPheno
   2   v4.0.5be

BLOCK SPHENOINFO
   1   2
   2   2

BLOCK MODSEL
   1   0

BLOCK MINPAR
   3    30.403274
   4    1

BLOCK EXTPAR
   0    3851.6099
   1   -1098.9927
   2   -3642.5772
   3    3877.5046
   11   -6505.0493
   12    532.68584
   13    6041.1494
   23    4120.0166
   25    29.161715
   26    1061.7361
   31    2583.378
   32    2583.378
   33    3471.7829
   34    4607.5724
   35    4607.5724
   36    2492.799
   41    1525.9227
   42    1525.9227
   43    3944.4395
   44    751.1159
   45    751.1159
   46    3621.5427
   47    3598.6395
   48    3598.6395
   49    992.23508

BLOCK SMINPUTS
   1    127.90897
   2    1.1663787e-05
   3    0.1184
   4    91.1876
   5    4.18
   6    173.2
   7    1.777
   8    0
   11    0.00051099893
   12    0
   13    0.10565837
   14    0
   21    0.005
   22    0.0025
   23    0.095
   24    1.27

BLOCK GAUGE Q=  3851.6099
   1    0.35536298
   2    0.66519887
   3    1.219778

BLOCK YU Q=  3851.6099
   1   1    8.3893003e-06
   2   2    0.0042617646
   3   3    1.0134949

BLOCK YD Q=  3851.6099
   1   1    0.00049160812
   2   2    0.0093405542
   3   3    0.48752121

BLOCK YE Q=  3851.6099
   1   1    8.5789211e-05
   2   2    0.017738488
   3   3    0.29833219

BLOCK AU Q=  3851.6099
   1   1    0
   2   2    0
   3   3   -6505.0492

BLOCK AD Q=  3851.6099
   1   1    0
   2   2    0
   3   3    532.68587

BLOCK AE Q=  3851.6099
   1   1    0
   2   2    0
   3   3    6041.1494

BLOCK MSOFT Q=  3851.6099
   1   -1098.9927
   2   -3642.5772
   3    3877.5046
   21   -15938327
   22   -16716757
   31    2583.378
   32    2583.378
   33    3471.7829
   34    4607.5724
   35    4607.5724
   36    2492.799
   41    1525.9227
   42    1525.9227
   43    3944.4395
   44    751.1159
   45    751.1159
   46    3621.5427
   47    3598.6395
   48    3598.6395
   49    992.23508

BLOCK MASS
   6    173.2
   23    91.1876
   24    80.429995
   15    1.777
   25    124.97938
   35    1061.6687
   36    1061.7361
   37    1064.4491
   1000001    1795.3545
   2000001    3745.8413
   1000002    1793.6305
   2000002    1081.7129
   1000003    1795.3525
   2000003    3745.84
   1000004    1793.629
   2000004    1081.7118
   1000005    1264.2569
   2000005    4040.4054
   1000006    3641.5537
   2000006    4073.7828
   1000011    2622.3458
   2000011    4610.2987
   1000012    2620.7702
   1000013    2622.3422
   2000013    4610.2797
   1000014    2620.769
   1000015    2479.0423
   2000015    3492.1551
   1000016    3489.8277
   1000021    3995.9016
   1000022   -1079.6979
   1000023   -3602.3734
   1000025    4098.8083
   1000035   -4104.1447
   1000024    3602.4497
   1000037    4104.43

BLOCK ALPHA
      -0.033342523

BLOCK HMIX Q=  3851.6099
   1    4120.0166
   2    29.161715
   3    242.98098
   4    1127283.6

BLOCK STOPMIX
   1   1    0.28289979
   1   2    0.95914947
   2   1   -0.95914947
   2   2    0.28289979

BLOCK SBOTMIX
   1   1    0.013224076
   1   2    0.99991256
   2   1   -0.99991256
   2   2    0.013224076

BLOCK STAUMIX
   1   1    0.032845215
   1   2    0.99946045
   2   1   -0.99946045
   2   2    0.032845215

BLOCK NMIX
   1   1   -0.99993031
   1   2    5.4292693e-05
   1   3   -0.011511941
   1   4   -0.0026169467
   2   1   -0.0010851591
   2   2   -0.99509706
   2   3    0.074877446
   2   4    0.064606701
   3   1    0.0062888972
   3   2   -0.0072992264
   3   3   -0.70703408
   3   4    0.70711384
   4   1   -0.0099321871
   4   2    0.098633431
   4   3    0.70310999
   4   4    0.70413716

BLOCK UMIX
   1   1   -0.99425998
   1   2    0.10699105
   2   1   -0.10699105
   2   2   -0.99425998

BLOCK VMIX
   1   1    0.99571877
   1   2    0.092434519
   2   1    0.092434519
   2   2   -0.99571877

BLOCK HIGGSBOUNDSINPUTHIGGSCOUPLINGSFERMIONS
       0, 850.4056,3,36,15,15

BLOCK HIGGSBOUNDSINPUTHIGGSCOUPLINGSBOSONS
       0,4,36,21,21,23

BLOCK SPHENOLOWENERGY
   1    0.00034767446
   2    1.5879872e-06
   3    3.5259872e-05
   4    2.0837501e-15
   5    8.9015224e-11
   6    1.8621617e-08
   7    6.9664387e-14
   8    2.976054e-09
   9    6.3086e-07
   10    9.3353759e-05
   11    0.9643086
   12    0.54163915
   13    19.335909
   14    0
   15    0
   16    0.0021563032
   17    2.2816534e-15
   18    2.4807759e-11
   19    8.2913746e-11
   20   -7.2083119e-16
   21   -3.0817497e-11
   22   -7.976257e-09
   23    0
   24    0
   25    0
   26    0
   27    0
   28    0
   29    0
   30    0
   31    0
   39    6.0328789e-05
   40    0
   41    0
   42    0

BLOCK FWCOEF Q=  160
   305   4422   0   0   -0.18881911
   305   4422   0   2   -0.21528854
   305   4322   0   2   -0.00047177201
   305   6421   0   0   -0.095227835
   305   6421   0   2   -0.13114919
   305   6321   0   2   -0.00066433235
   3051111   4133   0   0    1.6253334
   3051111   4133   0   2    1.6253514
   3051111   4233   0   2    2.4004252e-05
   3051111   4137   0   0   -4.4480255
   3051111   4137   0   2   -4.4470756
   3051111   4237   0   2   -0.00017742962
   3051313   4133   0   0    1.6253334
   3051313   4133   0   2    1.625351
   3051313   4233   0   2    2.4000496e-05
   3051313   4137   0   0   -4.4480255
   3051313   4137   0   2   -4.447076
   3051313   4237   0   2   -0.00017742599
   3051212   4137   0   0    1.5053501
   3051212   4137   0   2    1.5051452
   3051212   4237   0   2    3.8377908e-05
   3051414   4137   0   0    1.5053501
   3051414   4137   0   2    1.5051452
   3051414   4237   0   2    3.8378715e-05
   3051616   4137   0   0    1.5053501
   3051616   4137   0   2    1.5051454
   3051616   4237   0   2    3.8606064e-05

BLOCK IMFWCOEF Q=  160
   305   4422   0   0    3.858871e-07
   305   4422   0   2    4.9746686e-06
   305   4322   0   2    3.1687936e-06
   305   6421   0   0    3.3053782e-07
   305   6421   0   2   -1.7633516e-05
   305   6321   0   2    1.8609932e-06
   3051111   4133   0   2   -1.5417214e-06
   3051111   4233   0   2    2.4344353e-06
   3051111   4137   0   2    1.2512841e-05
   3051111   4237   0   2   -1.8049687e-05
   3051313   4133   0   2   -1.541717e-06
   3051313   4233   0   2    2.4344348e-06
   3051313   4137   0   2    1.2512846e-05
   3051313   4237   0   2   -1.8049688e-05
   3051212   4137   0   2   -2.69573e-06
   3051212   4237   0   2    3.9041979e-06
   3051414   4137   0   2   -2.6957301e-06
   3051414   4237   0   2    3.9041979e-06
   3051616   4137   0   2   -2.6933274e-06
   3051616   4237   0   2    3.9041983e-06

DECAY 23  2.4952


DECAY 24  2.085


DECAY 1000011  2.2711326
    1   2    1000022    11

DECAY 2000011  20.690977
    0.99999309   2    1000022    11

DECAY 1000013  2.2711286
    1   2    1000022    13

DECAY 2000013  20.701226
    0.9994931   2    1000022    13
    0.00037535667   2    1000013    25

DECAY 1000015  8.1734596
    1   2    1000022    15

DECAY 2000015  7.3827782
    0.48705604   2    1000022    15
    0.25801518   2    1000015    25
    0.25492878   2    1000015    23

DECAY 1000012  2.2695761
    1   2    1000022    12

DECAY 1000014  2.2695742
    1   2    1000022    14

DECAY 1000016  7.3416338
    0.51156847   2    1000015    24
    0.48830443   2    1000022    16

DECAY 1000001  0.10215425
    1   2    1000022    1

DECAY 2000001  1.7579807
    0.99999522   2    1000022    1

DECAY 1000003  0.10215398
    1   2    1000022    3

DECAY 2000003  1.7610033
    0.99827874   2    1000022    3
    0.0017143329   2    1000003    25

DECAY 1000005  0.051710876
    1   2    1000022    5

DECAY 2000005  37.068245
    0.60174742   2    1000006   -24
    0.23878694   2    1000005    25
    0.077539048   2    1000005    23
    0.033063729   2   -1000024    6
    0.020017956   2    1000023    5
    0.0131197   2    1000022    5
    0.0058487245   2    1000005    36
    0.0057772558   2    1000005    35
    0.0040992265   2    1000021    5

DECAY 2000002  3.3377597e-05
    1   2    1000022    2

DECAY 1000002  0.10170974
    1   2    1000022    2

DECAY 2000004  2.3854927e-05
    1   2    1000022    4

DECAY 1000004  0.10171031
    0.99998831   2    1000022    4

DECAY 1000006  6.780544
    0.91921155   2    1000022    6
    0.046036216   2    1000005    24
    0.031035199   2    1000005    37
    0.0025421592   2    1000022    4
    0.0010415105   3    1000022    24    5

DECAY 2000006  37.254753
    0.40337943   2    1000006    25
    0.34439382   2    1000006    23
    0.14637184   2    1000005    24
    0.045600661   2    1000024    5
    0.0288846   2    1000022    6
    0.023166575   2    1000023    6
    0.0082030777   2    1000005    37

DECAY 1000024  120.89365
    0.22067291   2    1000004   -3
    0.22067221   2    1000002   -1
    0.21974784   2   -1000003    4
    0.21974722   2   -1000001    2
    0.028817293   2    1000014   -13
    0.028817017   2    1000012   -11
    0.028655165   2   -1000013    14
    0.028654987   2   -1000011    12
    0.0025462355   2   -1000005    6
    0.00049292615   2    1000016   -15
    0.00046937819   2   -2000015    16
    0.0002755388   2    37    1000022
    0.0002362271   2   -1000015    16
    0.00017985897   2    1000022    24

DECAY 1000037  46.341348
    0.5094646   2   -1000005    6
    0.11879169   2    1000006   -5
    0.068821913   2    1000024    25
    0.064536803   2    1000023    24
    0.057879044   2    1000024    23
    0.056332761   2    1000022    24
    0.04497389   2    37    1000022
    0.030750505   2   -1000015    16
    0.0087850209   2   -1000003    4
    0.0087546873   2   -1000001    2
    0.0066897867   2    1000004   -3
    0.0065408773   2    1000002   -1
    0.0062135788   2    1000016   -15
    0.0039093627   3    1000022   -5    6
    0.0015629034   2   -1000013    14
    0.0015628974   2   -1000011    12
    0.0012646815   2    1000014   -13
    0.001168488   2    1000012   -11
    0.0009789267   3    1000023   -5    6
    0.00043926386   2   -2000015    16
    0.00037669195   3    1000024    6   -6
    0.00013831479   2    2000006   -5

DECAY 1000022 -1


DECAY 1000023  120.906
    0.11022453   2    1000004   -4
    0.11022453   2   -1000004    4
    0.1102245   2    1000002   -2
    0.1102245   2   -1000002    2
    0.10999974   2    1000003   -3
    0.10999974   2   -1000003    3
    0.10999932   2    1000001   -1
    0.10999932   2   -1000001    1
    0.014370649   2    1000014   -14
    0.014370649   2   -1000014    14
    0.014370619   2    1000012   -12
    0.014370619   2   -1000012    12
    0.014365428   2    1000013   -13
    0.014365428   2   -1000013    13
    0.014365213   2    1000011   -11
    0.014365213   2   -1000011    11
    0.0012458865   2    1000005   -5
    0.0012458865   2   -1000005    5
    0.00024535996   2    1000016   -16
    0.00024535996   2   -1000016    16
    0.00023590319   2    2000015   -15
    0.00023590319   2   -2000015    15
    0.00023430342   2    1000022    35
    0.00012592272   2    1000022    25
    0.00011679257   2    1000015   -15
    0.00011679257   2   -1000015    15

DECAY 1000025  49.957154
    0.23810593   2    1000005   -5
    0.23810593   2   -1000005    5
    0.074157385   2    1000023    25
    0.062995257   2    1000006   -6
    0.062995257   2   -1000006    6
    0.056391904   2    1000023    23
    0.053088677   2    1000024   -24
    0.053088677   2   -1000024    24
    0.040762125   2    1000022    25
    0.037750548   2    1000022    23
    0.031330174   2    1000022    35
    0.014585574   2    1000015   -15
    0.014585574   2   -1000015    15
    0.01115259   2    1000022    36
    0.0029737207   3    1000022    6   -6
    0.0027319972   2    2000015   -15
    0.0027319972   2   -2000015    15
    0.00067670634   3    1000024    5   -6
    0.00067670634   3   -1000024   -5    6
    0.00023159451   2    2000005   -5
    0.00023159451   2   -2000005    5

DECAY 1000035  47.312971
    0.24824808   2    1000005   -5
    0.24824808   2   -1000005    5
    0.070181315   2    1000006   -6
    0.070181315   2   -1000006    6
    0.067179656   2    1000023    25
    0.059077131   2    1000024   -24
    0.059077131   2   -1000024    24
    0.03733365   2    1000022    25
    0.037233005   2    1000022    35
    0.01567965   2    1000022    23
    0.01509094   2    1000015   -15
    0.01509094   2   -1000015    15
    0.01012364   2    1000022    36
    0.0038480725   2    1000003   -3
    0.0038480725   2   -1000003    3
    0.0037753237   2    1000001   -1
    0.0037753237   2   -1000001    1
    0.0035326077   2    1000004   -4
    0.0035326077   2   -1000004    4
    0.0035169941   2    1000002   -2
    0.0035169941   2   -1000002    2
    0.0030583255   2    2000015   -15
    0.0030583255   2   -2000015    15
    0.0030222976   3    1000022    6   -6
    0.00099494199   3    1000024    5   -6
    0.00099494199   3   -1000024   -5    6
    0.00072337122   2    1000014   -14
    0.00072337122   2   -1000014    14
    0.00072337029   2    1000012   -12
    0.00072337029   2   -1000012    12
    0.00062920888   2    1000013   -13
    0.00062920888   2   -1000013    13
    0.00058223752   2    1000011   -11
    0.00058223752   2   -1000011    11
    0.00032270615   2    1000023    23
    0.0002890987   2    2000005   -5
    0.0002890987   2   -2000005    5
    0.00015820075   2    1000016   -16
    0.00015820075   2   -1000016    16

DECAY 1000021  606.25701
    0.083775207   2    2000004   -4
    0.083775207   2   -2000004    4
    0.083775181   2    2000002   -2
    0.083775181   2   -2000002    2
    0.078991406   2    1000005   -5
    0.078991406   2   -1000005    5
    0.062199861   2    1000004   -4
    0.062199861   2   -1000004    4
    0.062199812   2    1000002   -2
    0.062199812   2   -1000002    2
    0.062139527   2    1000003   -3
    0.062139527   2   -1000003    3
    0.062139459   2    1000001   -1
    0.062139459   2   -1000001    1
    0.001792817   2    1000006   -6
    0.001792817   2   -1000006    6
    0.0014339424   2    2000003   -3
    0.0014339424   2   -2000003    3
    0.0014339285   2    2000001   -1
    0.0014339285   2   -2000001    1
    0.00011432533   2    1000006   -4
    0.00011432533   2   -1000006    4

DECAY 25  0.0039245562
    0.57722826   2   -5    5
    0.22535777   2   -24    24
    0.071226324   2    21    21
    0.066729191   2   -15    15
    0.027945631   2   -4    4
    0.027269369   2    23    23
    0.0023182469   2    22    22
    0.0014773357   2    22    23
    0.00023135335   2   -13    13
    0.00021577324   2   -3    3
    5.9658568e-07   2   -1    1
    1.44011e-07   2   -2    2
    5.2010802e-09   2   -11    11

DECAY 35  7.7500731
    0.75986251   2   -5    5
    0.23537057   2   -15    15
    0.0036443673   2   -6    6
    0.00079681307   2   -13    13
    0.00026093754   2   -3    3
    4.187895e-05   2    21    21
    8.9551147e-06   2   -24    24
    7.1438344e-06   2    23    23
    6.0328936e-06   2    25    25
    7.2128219e-07   2   -1    1
    3.6316754e-08   2    22    22
    1.7901683e-08   2   -11    11
    1.6841739e-08   2    22    23
    1.7374892e-09   2   -4    4
    9.0916922e-15   2   -2    2

DECAY 36  7.5728494
    0.76011232   2   -5    5
    0.23542837   2   -15    15
    0.0032916424   2   -6    6
    0.0007970007   2   -13    13
    0.00026101752   2   -3    3
    9.8274676e-05   2    21    21
    1.042649e-05   2    23    25
    7.2150313e-07   2   -1    1
    1.4532841e-07   2    22    22
    5.376481e-08   2    22    23
    1.7905889e-08   2   -11    11
    4.1003228e-09   2   -4    4
    2.1339915e-14   2   -2    2
    9.9733905e-36   2    25    25

DECAY 37  8.3678796
    0.76260885   2   -5    6
    0.23514908   2   -15    16
    0.0011614597   2   -5    4
    0.00083133998   2   -13    14
    0.00021200945   2   -3    4
    9.7985002e-06   2   -3    2
    9.5607333e-06   2    24    25
    8.5895522e-06   2   -3    6
    8.2940412e-06   2   -5    2
    5.8785555e-07   2   -1    2
    3.8040595e-07   2   -1    6
    3.0743699e-08   2   -1    4
    1.9445129e-08   2   -11    12
    2.6958384e-11   2    24    35
    2.3846308e-11   2    24    36

DECAY 6  2.43
    1   2    5    24

DECAY 15 -1
