BLOCK SPINFO
   1   SPheno
   2   v4.0.5be

BLOCK SPHENOINFO
   1   2
   2   2

BLOCK MODSEL
   1   0

BLOCK MINPAR
   3    48.87586
   4   -1

BLOCK EXTPAR
   0    1562.4695
   1   -1671.0029
   2   -226.9614
   3    3000
   11   -4911.628
   12   -1099.5258
   13   -168.22657
   23   -304.47663
   25    48.395209
   26    1797.6683
   31    1655.9755
   32    1655.9755
   33    1891.3741
   34    793.77468
   35    793.77468
   36    848.08127
   41    5000
   42    5000
   43    1479.2728
   44    5000
   45    5000
   46    1859.4211
   47    5000
   48    5000
   49    1240.2857

BLOCK SMINPUTS
   1    127.90897
   2    1.1663787e-05
   3    0.1184
   4    91.1876
   5    4.18
   6    173.2
   7    1.777
   8    0
   11    0.00051099893
   12    0
   13    0.10565837
   14    0
   21    0.005
   22    0.0025
   23    0.095
   24    1.27

BLOCK GAUGE Q=  1562.4695
   1    0.35536298
   2    0.66519887
   3    1.219778

BLOCK YU Q=  1562.4695
   1   1    8.3861619e-06
   2   2    0.0042601702
   3   3    1.0131157

BLOCK YD Q=  1562.4695
   1   1    0.00081554111
   2   2    0.015495281
   3   3    0.80876122

BLOCK YE Q=  1562.4695
   1   1    0.00014231789
   2   2    0.029426825
   3   3    0.49491079

BLOCK AU Q=  1562.4695
   1   1    0
   2   2    0
   3   3   -4911.6281

BLOCK AD Q=  1562.4695
   1   1    0
   2   2    0
   3   3   -1099.5258

BLOCK AE Q=  1562.4695
   1   1    0
   2   2    0
   3   3   -168.22657

BLOCK MSOFT Q=  1562.4695
   1   -1671.0029
   2   -226.9614
   3    3000
   21    3238052.7
   22   -44545.994
   31    1655.9755
   32    1655.9755
   33    1891.3741
   34    793.77468
   35    793.77468
   36    848.08127
   41    5000
   42    5000
   43    1479.2728
   44    5000
   45    5000
   46    1859.4211
   47    5000
   48    5000
   49    1240.2857

BLOCK MASS
   6    173.2
   23    91.1876
   24    80.429995
   15    1.777
   25    122.12271
   35    1796.241
   36    1797.6683
   37    1799.2793
   1000001    5034.9813
   2000001    5024.0146
   1000002    5034.5464
   2000002    5024.5665
   1000003    5034.9861
   2000003    5024.022
   1000004    5034.5508
   2000004    5024.5672
   1000005    1245.6389
   2000005    1447.0481
   1000006    1326.526
   2000006    1840.3791
   1000011    1659.9162
   2000011    806.68922
   1000012    1657.6945
   1000013    1659.9001
   2000013    806.63733
   1000014    1657.678
   1000015    846.43558
   2000015    1891.1464
   1000016    1889.086
   1000021    3198.3053
   1000022   -214.20329
   1000023    311.89889
   1000025   -342.77152
   1000035   -1663.5712
   1000024    216.30429
   1000037    347.55611

BLOCK ALPHA
      -0.02058154

BLOCK HMIX Q=  1562.4695
   1   -304.47663
   2    48.395209
   3    243.91621
   4    3231611.4

BLOCK STOPMIX
   1   1    0.89379545
   1   2    0.44847485
   2   1   -0.44847485
   2   2    0.89379545

BLOCK SBOTMIX
   1   1   -0.057191942
   1   2    0.9983632
   2   1   -0.9983632
   2   2   -0.057191942

BLOCK STAUMIX
   1   1   -0.0090435358
   1   2    0.99995911
   2   1   -0.99995911
   2   2   -0.0090435358

BLOCK NMIX
   1   1   -0.009581022
   1   2    0.84319907
   1   3    0.43919134
   1   4   -0.30989433
   2   1   -0.015445971
   2   2    0.10174156
   2   3   -0.69664497
   2   4   -0.70999708
   3   1   -0.021429594
   3   2   -0.52788371
   3   3    0.56724362
   3   4   -0.63175489
   4   1    0.99960512
   4   2   -0.0016627845
   4   3    0.0056055581
   4   4   -0.027484803

BLOCK UMIX
   1   1   -0.80245175
   1   2   -0.59671701
   2   1   -0.59671701
   2   2    0.80245175

BLOCK VMIX
   1   1    0.90587385
   1   2    0.42354759
   2   1    0.42354759
   2   2   -0.90587385

BLOCK HIGGSBOUNDSINPUTHIGGSCOUPLINGSFERMIONS
       0, 2342.0962,3,36,15,15

BLOCK HIGGSBOUNDSINPUTHIGGSCOUPLINGSBOSONS
       0,4,36,21,21,23

BLOCK SPHENOLOWENERGY
   1    0.00041605973
   2    1.5903598e-06
   3    3.5253837e-05
   4    1.5964488e-15
   5    6.8084182e-11
   6    7.6498104e-09
   7    5.2920829e-14
   8    2.2571005e-09
   9    2.6361318e-07
   10    9.136911e-05
   11    0.94380793
   12    0.54260816
   13    19.301844
   14    0
   15    0
   16    0.0021635092
   17    2.281726e-15
   18    2.4817665e-11
   19    8.2938132e-11
   20    7.0360395e-15
   21    3.0080867e-10
   22    6.719711e-08
   23    0
   24    0
   25    0
   26    0
   27    0
   28    0
   29    0
   30    0
   31    0
   39    9.8744066e-05
   40    0
   41    0
   42    0

BLOCK FWCOEF Q=  160
   305   4422   0   0   -0.18881911
   305   4422   0   2   -0.29213824
   305   4322   0   2   -0.00083124232
   305   6421   0   0   -0.095227835
   305   6421   0   2   -0.16149583
   305   6321   0   2   -0.00058539949
   3051111   4133   0   0    1.5940471
   3051111   4133   0   2    1.5950285
   3051111   4233   0   2    0.00040817401
   3051111   4137   0   0   -4.4167392
   3051111   4137   0   2   -4.4151894
   3051111   4237   0   2   -0.0031670039
   3051313   4133   0   0    1.5940471
   3051313   4133   0   2    1.5950248
   3051313   4233   0   2    0.00040816755
   3051313   4137   0   0   -4.4167392
   3051313   4137   0   2   -4.4151931
   3051313   4237   0   2   -0.0031670064
   3051212   4137   0   0    1.5053501
   3051212   4137   0   2    1.5050425
   3051212   4237   0   2    0.00068988837
   3051414   4137   0   0    1.5053501
   3051414   4137   0   2    1.5050425
   3051414   4237   0   2    0.00068988923
   3051616   4137   0   0    1.5053501
   3051616   4137   0   2    1.505042
   3051616   4237   0   2    0.00069013144

BLOCK IMFWCOEF Q=  160
   305   4422   0   0    3.8572082e-07
   305   4422   0   2    2.4368024e-05
   305   4322   0   2   -9.9062588e-06
   305   6421   0   0    3.303954e-07
   305   6421   0   2    3.1559004e-05
   305   6321   0   2   -4.288341e-06
   3051111   4133   0   2   -2.2751276e-06
   3051111   4233   0   2    9.5403576e-06
   3051111   4137   0   2    3.2396655e-05
   3051111   4237   0   2   -7.4052569e-05
   3051313   4133   0   2   -2.2751772e-06
   3051313   4233   0   2    9.5403136e-06
   3051313   4137   0   2    3.2396751e-05
   3051313   4237   0   2   -7.4052684e-05
   3051212   4137   0   2   -6.5052351e-06
   3051212   4237   0   2    1.6131327e-05
   3051414   4137   0   2   -6.505233e-06
   3051414   4237   0   2    1.6131327e-05
   3051616   4137   0   2   -6.5150904e-06
   3051616   4237   0   2    1.6131327e-05

DECAY 23  2.4952


DECAY 24  2.085


DECAY 2000011  0.0022713788
    0.55032425   2    1000025    11
    0.30802094   2    1000023    11
    0.14154976   2    1000022    11

DECAY 1000011  20.820597
    0.43679408   2   -1000024    12
    0.23833171   2    1000022    11
    0.22846699   2   -1000037    12
    0.093552864   2    1000025    11
    0.0028543507   2    1000023    11

DECAY 2000013  0.022667087
    0.26179444   2   -1000037    14
    0.24604687   2    1000023    13
    0.18819886   2   -1000024    14
    0.18761149   2    1000025    13
    0.11634834   2    1000022    13

DECAY 1000013  20.847416
    0.43622766   2   -1000024    14
    0.23827875   2    1000022    13
    0.22817048   2   -1000037    14
    0.093835617   2    1000025    13
    0.0034700759   2    1000023    13

DECAY 1000015  6.2559358
    0.28815034   2   -1000037    16
    0.23843548   2    1000023    15
    0.21201667   2   -1000024    16
    0.14620181   2    1000025    15
    0.1151957   2    1000022    15

DECAY 2000015  33.0456
    0.31283845   2   -1000024    16
    0.22311807   2    1000022    15
    0.17050079   2   -1000037    16
    0.15371943   2    1000025    15
    0.13049477   2    1000023    15
    0.0036557978   2    1000035    15
    0.0028739112   2    1000015    23
    0.0027987735   2    1000015    25

DECAY 1000012  20.907918
    0.55352224   2    1000024    11
    0.24282211   2    1000022    12
    0.11444189   2    1000037    11
    0.085285302   2    1000025    12
    0.0039284502   2    1000023    12

DECAY 1000014  20.934324
    0.55328701   2    1000024    13
    0.24251324   2    1000022    14
    0.11509958   2    1000037    13
    0.085176722   2    1000025    14
    0.0039234501   2    1000023    14

DECAY 1000016  33.113452
    0.49777512   2    1000024    15
    0.25127368   2    1000037    15
    0.17608693   2    1000022    16
    0.06263317   2    1000025    16
    0.0057249155   2    1000015    24
    0.0036316062   2    1000035    16
    0.0028745844   2    1000023    16

DECAY 2000001  142.49247
    0.9843915   2    1000021    1
    0.015592158   2    1000035    1

DECAY 1000001  208.07936
    0.67959385   2    1000021    1
    0.13666107   2   -1000024    2
    0.075755617   2    1000022    1
    0.07512599   2   -1000037    2
    0.028980998   2    1000025    1
    0.0027283341   2    1000035    1
    0.0011541367   2    1000023    1

DECAY 2000003  142.54075
    0.98406346   2    1000021    3
    0.015586915   2    1000035    3
    0.00010737732   2   -1000037    4

DECAY 1000003  208.10553
    0.67951078   2    1000021    3
    0.13664554   2   -1000024    4
    0.075768323   2    1000022    3
    0.075123761   2   -1000037    4
    0.029014109   2    1000025    3
    0.0027279975   2    1000035    3
    0.0012094936   2    1000023    3

DECAY 1000005  28.030478
    0.27854819   2   -1000037    6
    0.24402311   2    1000023    5
    0.20892292   2   -1000024    6
    0.14954117   2    1000025    5
    0.1189646   2    1000022    5

DECAY 2000005  63.891104
    0.41692135   2   -1000037    6
    0.17671884   2   -1000024    6
    0.13234869   2    1000023    5
    0.11536676   2    1000022    5
    0.11375752   2    1000025    5
    0.043124914   2    1000006   -24
    0.0011152049   2    1000005    25
    0.00064670923   2    1000005    23

DECAY 2000002  149.2231
    0.94037581   2    1000021    2
    0.059565297   2    1000035    2

DECAY 1000002  208.07841
    0.67937941   2    1000021    2
    0.17414335   2    1000024    1
    0.0751387   2    1000022    2
    0.037846341   2    1000037    1
    0.029828662   2    1000025    2
    0.0026279411   2    1000035    2
    0.0010355908   2    1000023    2

DECAY 2000004  149.2267
    0.94035315   2    1000021    4
    0.059563857   2    1000035    4

DECAY 1000004  208.10447
    0.67929625   2    1000021    4
    0.17416256   2    1000024    3
    0.075130195   2    1000022    4
    0.037915158   2    1000037    3
    0.029828379   2    1000025    4
    0.0026276217   2    1000035    4
    0.0010398361   2    1000023    4

DECAY 1000006  52.565839
    0.33879806   2    1000037    5
    0.22754112   2    1000025    6
    0.20064673   2    1000023    6
    0.14539605   2    1000024    5
    0.059026267   2    1000022    6
    0.025763544   2    1000022    4
    0.002492592   3    1000022    24    5
    0.00033546566   2    1000023    4

DECAY 2000006  176.53016
    0.25113519   2    2000005    24
    0.20379131   2    1000006    23
    0.12527375   2    1000006    25
    0.10914294   2    1000037    5
    0.10792371   2    1000023    6
    0.095648972   2    1000024    5
    0.05830854   2    1000025    6
    0.046265025   2    1000022    6
    0.0024438953   2    1000005    24

DECAY 1000024  4.5665394e-11
    0.60176786   3    1000022   -1    2
    0.20096427   3    1000022   -11    12
    0.19583366   3    1000022   -13    14
    0.0014342132   3    1000022   -3    4

DECAY 1000037  1.0954592
    0.72186745   2    1000022    24
    0.23020306   2    1000024    23
    0.047874524   2    1000024    25

DECAY 1000022 -1


DECAY 1000023  0.56241181
    0.7040933   2    1000022    23
    0.14781196   2    1000024   -24
    0.14781196   2   -1000024    24
    0.000281476   2    1000022    22

DECAY 1000025  1.9235126
    0.48355615   2    1000024   -24
    0.48355615   2   -1000024    24
    0.026608651   2    1000022    25
    0.006232091   2    1000022    23

DECAY 1000035  20.056782
    0.12181702   2    2000013   -13
    0.12181702   2   -2000013    13
    0.12180736   2    2000011   -11
    0.12180736   2   -2000011    11
    0.11435984   2    1000015   -15
    0.11435984   2   -1000015    15
    0.04824219   2    1000037   -24
    0.04824219   2   -1000037    24
    0.038607981   2    1000023    23
    0.033581202   2    1000023    25
    0.032417101   2    1000025    25
    0.013848658   2    1000025    23
    0.013310154   2    1000005   -5
    0.013310154   2   -1000005    5
    0.0068752231   2    1000024   -24
    0.0068752231   2   -1000024    24
    0.0065040557   2    1000006   -6
    0.0065040557   2   -1000006    6
    0.0049201836   2    1000022    25
    0.0027298526   2    1000022    23
    0.0014905838   3    1000037    5   -6
    0.0014905838   3   -1000037   -5    6
    0.0010862004   2    2000005   -5
    0.0010862004   2   -2000005    5
    0.0010371771   3    1000023    6   -6
    0.00090284658   3    1000025    6   -6
    0.00025291217   3    1000024    5   -6
    0.00025291217   3   -1000024   -5    6
    0.00018069663   3    1000022    6   -6

DECAY 1000021  256.12972
    0.13304169   2    1000005   -5
    0.13304169   2   -1000005    5
    0.11684654   2    2000005   -5
    0.11684654   2   -2000005    5
    0.1132849   2    1000006   -6
    0.1132849   2   -1000006    6
    0.092960395   2    2000006   -6
    0.092960395   2   -2000006    6
    0.043751719   2    1000006   -4
    0.043751719   2   -1000006    4

DECAY 25  0.0035393048
    0.61801678   2   -5    5
    0.18339764   2   -24    24
    0.07243932   2    21    21
    0.070804553   2   -15    15
    0.030289991   2   -4    4
    0.020950408   2    23    23
    0.0023580105   2    22    22
    0.0012649104   2    22    23
    0.00024563726   2   -13    13
    0.00023195111   2   -3    3
    6.4132217e-07   2   -1    1
    1.5610013e-07   2   -2    2
    5.5222379e-09   2   -11    11

DECAY 35  85.583871
    0.65745677   2   -5    5
    0.10658576   2   -15    15
    0.051438368   2   -1000024    1000037
    0.051438368   2   -1000037    1000024
    0.041612984   2   -1000024    1000024
    0.026973223   2    1000022    1000023
    0.020022813   2    1000022    1000022
    0.012891749   2    1000023    1000025
    0.012437315   2   -1000037    1000037
    0.010173824   2    1000025    1000025
    0.0070933883   2    1000022    1000025
    0.00090044821   2    1000023    1000023
    0.00037041015   2   -13    13
    0.000350086   2   -6    6
    0.0002393113   2   -3    3
    1.3383801e-05   2    21    21
    6.6168309e-07   2   -1    1
    3.8220093e-07   2    25    25
    2.533711e-07   2    23    23
    1.5673693e-07   2   -24    24
    1.2677662e-07   2    22    23
    1.2638155e-07   2   -1000015    1000015
    2.3562265e-08   2    22    22
    2.2171201e-08   2   -1000011    1000011
    2.1840305e-08   2   -1000013    1000013
    8.320523e-09   2   -11    11
    4.2145898e-09   2   -4    4
    2.1729476e-14   2   -2    2

DECAY 36  81.171068
    0.64623772   2   -5    5
    0.10477097   2   -15    15
    0.049718969   2   -1000024    1000037
    0.049718969   2   -1000037    1000024
    0.048597765   2   -1000024    1000024
    0.023872514   2    1000022    1000023
    0.023496347   2    1000022    1000022
    0.017573221   2   -1000037    1000037
    0.013662817   2    1000025    1000025
    0.011214443   2    1000023    1000025
    0.0091402523   2    1000022    1000025
    0.00099266604   2    1000023    1000023
    0.00037898268   2   -6    6
    0.00036410216   2   -13    13
    0.00023521022   2   -3    3
    2.3641013e-05   2    21    21
    6.5034394e-07   2   -1    1
    3.5563096e-07   2    23    25
    2.5610702e-07   2    22    23
    1.3404947e-07   2    22    22
    8.1788176e-09   2   -11    11
    4.4046498e-09   2   -4    4
    8.0142248e-14   2    23    35
    2.2714037e-14   2   -2    2
    7.6035952e-39   2    25    25

DECAY 37  77.058157
    0.62664155   2   -5    6
    0.11154842   2   -15    16
    0.094014758   2    1000022    1000037
    0.081225184   2    1000024    1000025
    0.066227638   2    1000023    1000024
    0.018518855   2    1000023    1000037
    0.00093432593   2   -5    4
    0.000394364   2   -13    14
    0.00023757939   2   -3    4
    0.00023751686   2    1000025    1000037
    1.1059848e-05   2   -3    2
    6.6720557e-06   2   -5    2
    9.1994453e-07   2   -3    6
    6.5947015e-07   2   -1    2
    3.7629142e-07   2    24    25
    4.8355223e-08   2    1000022    1000024
    3.0854125e-08   2   -1    4
    2.6348178e-08   2   -1    6
    9.2242149e-09   2   -11    12
    4.5684985e-12   2    24    35
    1.9155138e-13   2    24    36

DECAY 6  2.43
    1   2    5    24

DECAY 15 -1
