BLOCK SPINFO
   1   SPheno
   2   v4.0.5be

BLOCK SPHENOINFO
   1   2
   2   2

BLOCK MODSEL
   1   0

BLOCK MINPAR
   3    24.599383
   4   -1

BLOCK EXTPAR
   0    2419.7625
   1   -2710.7824
   2    1259.17
   3    4054.6591
   11    2384.6315
   12    7305.7499
   13   -2275.1466
   23   -172.52233
   25    23.674487
   26    3995.7175
   31    4539.2716
   32    4539.2716
   33    4585.319
   34    4898.8542
   35    4898.8542
   36    1994.412
   41    4643.1326
   42    4643.1326
   43    1127.4026
   44    3440.1284
   45    3440.1284
   46    4790.1965
   47    3272.4088
   48    3272.4088
   49    3548.8782

BLOCK SMINPUTS
   1    127.90897
   2    1.1663787e-05
   3    0.1184
   4    91.1876
   5    4.18
   6    173.2
   7    1.777
   8    0
   11    0.00051099893
   12    0
   13    0.10565837
   14    0
   21    0.005
   22    0.0025
   23    0.095
   24    1.27

BLOCK GAUGE Q=  2419.7625
   1    0.35536298
   2    0.66519887
   3    1.219778

BLOCK YU Q=  2419.7625
   1   1    8.3918484e-06
   2   2    0.004263059
   3   3    1.0138027

BLOCK YD Q=  2419.7625
   1   1    0.00039922567
   2   2    0.0075852878
   3   3    0.39590677

BLOCK YE Q=  2419.7625
   1   1    6.9667799e-05
   2   2    0.014405091
   3   3    0.24226994

BLOCK AU Q=  2419.7625
   1   1    0
   2   2    0
   3   3    2384.6315

BLOCK AD Q=  2419.7625
   1   1    0
   2   2    0
   3   3    7305.7517

BLOCK AE Q=  2419.7625
   1   1    0
   2   2    0
   3   3   -2275.1466

BLOCK MSOFT Q=  2419.7625
   1   -2710.7824
   2    1259.17
   3    4054.6591
   21    15965783
   22   -175391.4
   31    4539.2716
   32    4539.2716
   33    4585.319
   34    4898.8542
   35    4898.8542
   36    1994.412
   41    4643.1326
   42    4643.1326
   43    1127.4026
   44    3440.1284
   45    3440.1284
   46    4790.1965
   47    3272.4088
   48    3272.4088
   49    3548.8782

BLOCK MASS
   6    173.2
   23    91.1876
   24    80.429995
   15    1.777
   25    120.81512
   35    3994.8905
   36    3995.7175
   37    3996.1346
   1000001    4710.9864
   2000001    3347.0099
   1000002    4710.3891
   2000002    3518.1011
   1000003    4710.9858
   2000003    3347.0095
   1000004    4710.3886
   2000004    3518.101
   1000005    1208.5592
   2000005    3619.0277
   1000006    1212.6347
   2000006    4828.5364
   1000011    4549.1169
   2000011    4902.045
   1000012    4547.9926
   1000013    4549.1167
   2000013    4902.0437
   1000014    4547.9925
   1000015    2003.1759
   2000015    4594.4909
   1000016    4593.8943
   1000021    4177.3367
   1000022    184.23412
   1000023   -188.46157
   1000025    1315.619
   1000035   -2714.4044
   1000024    186.36057
   1000037    1315.6738

BLOCK ALPHA
      -0.040684338

BLOCK HMIX Q=  2419.7625
   1   -172.52233
   2    23.674487
   3    243.5144
   4    15965758

BLOCK STOPMIX
   1   1   -0.99987947
   1   2    0.015525664
   2   1   -0.015525664
   2   2   -0.99987947

BLOCK SBOTMIX
   1   1   -0.99999725
   1   2    0.0023447969
   2   1   -0.0023447969
   2   2   -0.99999725

BLOCK STAUMIX
   1   1   -0.00020026447
   1   2    0.99999998
   2   1   -0.99999998
   2   2   -0.00020026447

BLOCK NMIX
   1   1    0.0099375392
   1   2    0.048086512
   1   3    0.71089412
   1   4    0.70158284
   2   1    0.0125795
   2   2    0.04016822
   2   3   -0.70327166
   2   4    0.70967404
   3   1   -0.00066898461
   3   2    0.99803512
   3   3   -0.0059463705
   3   4   -0.062370596
   4   1   -0.99987127
   4   2    0.0003155282
   4   3   -0.0017785186
   4   4    0.015943129

BLOCK UMIX
   1   1   -0.0084441114
   1   2   -0.99996435
   2   1    0.99996435
   2   2   -0.0084441114

BLOCK VMIX
   1   1   -0.088344229
   1   2    0.99609001
   2   1    0.99609001
   2   2    0.088344229

BLOCK HIGGSBOUNDSINPUTHIGGSCOUPLINGSFERMIONS
       0, 560.48135,3,36,15,15

BLOCK HIGGSBOUNDSINPUTHIGGSCOUPLINGSBOSONS
       0,4,36,21,21,23

BLOCK SPHENOLOWENERGY
   1    0.00032321332
   2    1.5897297e-06
   3    3.5248941e-05
   4    2.5677309e-15
   5    1.0969052e-10
   6    2.2960692e-08
   7    8.6835676e-14
   8    3.7096161e-09
   9    7.867689e-07
   10    9.6591138e-05
   11    0.99774947
   12    0.54186851
   13    19.36033
   14    0
   15    0
   16    0.0021569286
   17    2.2816544e-15
   18    2.4797088e-11
   19    8.289753e-11
   20   -9.4364455e-16
   21   -4.0343974e-11
   22   -1.2649919e-08
   23    0
   24    0
   25    0
   26    0
   27    0
   28    0
   29    0
   30    0
   31    0
   39    6.4743854e-05
   40    0
   41    0
   42    0

BLOCK FWCOEF Q=  160
   305   4422   0   0   -0.18881911
   305   4422   0   2   -0.19186167
   305   4322   0   2   -8.1302331e-05
   305   6421   0   0   -0.095227835
   305   6421   0   2   -0.099799285
   305   6321   0   2   -0.0001012477
   3051111   4133   0   0    1.608852
   3051111   4133   0   2    1.6091414
   3051111   4233   0   2    0.00014431287
   3051111   4137   0   0   -4.4315441
   3051111   4137   0   2   -4.4295433
   3051111   4237   0   2   -0.00109592
   3051313   4133   0   0    1.608852
   3051313   4133   0   2    1.6091413
   3051313   4233   0   2    0.0001443128
   3051313   4137   0   0   -4.4315441
   3051313   4137   0   2   -4.4295434
   3051313   4237   0   2   -0.0010959201
   3051212   4137   0   0    1.5053501
   3051212   4137   0   2    1.5049199
   3051212   4237   0   2    0.00023793302
   3051414   4137   0   0    1.5053501
   3051414   4137   0   2    1.5049199
   3051414   4237   0   2    0.00023793303
   3051616   4137   0   0    1.5053501
   3051616   4137   0   2    1.5049199
   3051616   4237   0   2    0.00023793395

BLOCK IMFWCOEF Q=  160
   305   4422   0   0    3.8582566e-07
   305   4422   0   2   -1.5753226e-05
   305   4322   0   2   -2.6542942e-08
   305   6421   0   0    3.3048519e-07
   305   6421   0   2   -6.1064928e-07
   305   6321   0   2    8.0115818e-08
   3051111   4133   0   2    3.8446445e-07
   3051111   4233   0   2    2.7449418e-06
   3051111   4137   0   2    7.3255704e-07
   3051111   4237   0   2   -2.0846062e-05
   3051313   4133   0   2    3.8446074e-07
   3051313   4233   0   2    2.7449409e-06
   3051313   4137   0   2    7.3256085e-07
   3051313   4237   0   2   -2.0846065e-05
   3051212   4137   0   2   -8.364993e-08
   3051212   4237   0   2    4.5258474e-06
   3051414   4137   0   2   -8.3649817e-08
   3051414   4237   0   2    4.5258474e-06
   3051616   4137   0   2   -8.3734491e-08
   3051616   4237   0   2    4.5258474e-06

DECAY 23  2.4952


DECAY 24  2.085


DECAY 1000011  52.830176
    0.63646469   2   -1000037    12
    0.31678343   2    1000025    11
    0.044790566   2    1000035    11
    0.0010770379   2    1000022    11
    0.00083040829   2    1000023    11

DECAY 2000011  11.845399
    0.99946627   2    1000035    11
    0.00032809647   2    1000023    11
    0.00020478812   2    1000022    11

DECAY 1000013  52.848889
    0.63623929   2   -1000037    14
    0.31667125   2    1000025    13
    0.044774702   2    1000035    13
    0.0012556475   2    1000022    13
    0.0010052583   2    1000023    13

DECAY 2000013  11.885748
    0.99607269   2    1000035    13
    0.0016975619   2   -1000024    14
    0.001166571   2    1000023    13
    0.0010620866   2    1000022    13

DECAY 1000015  4.5999921
    0.49970518   2   -1000024    16
    0.25287345   2    1000022    15
    0.24740574   2    1000023    15

DECAY 2000015  58.940615
    0.57824169   2   -1000037    16
    0.28780656   2    1000025    15
    0.04682593   2    1000022    15
    0.045621104   2    1000023    15
    0.04143376   2    1000035    15

DECAY 1000012  52.847555
    0.63112162   2    1000037    11
    0.31702618   2    1000025    12
    0.044846137   2    1000035    12
    0.0058928494   2    1000024    11
    0.00069088511   2    1000022    12
    0.00042232517   2    1000023    12

DECAY 1000014  52.866264
    0.63089826   2    1000037    13
    0.31691398   2    1000025    14
    0.044830262   2    1000035    14
    0.0062446872   2    1000024    13
    0.00069064059   2    1000022    14
    0.0004221757   2    1000023    14

DECAY 1000016  58.965893
    0.57342627   2    1000037    15
    0.28804224   2    1000025    16
    0.096003098   2    1000024    15
    0.041496769   2    1000035    16
    0.00062548872   2    1000022    16
    0.00038235071   2    1000023    16

DECAY 2000001  0.21937233
    0.99772562   2    1000035    1
    0.0013631724   2    1000023    1
    0.00086040094   2    1000022    1

DECAY 1000001  70.170857
    0.50236896   2   -1000037    2
    0.25027946   2    1000025    1
    0.24205849   2    1000021    1
    0.0041951612   2    1000035    1
    0.00063209373   2    1000022    1
    0.00042383739   2    1000023    1

DECAY 2000003  0.22696579
    0.96434425   2    1000035    3
    0.016774233   2   -1000024    4
    0.0095905026   2    1000023    3
    0.0092870938   2    1000022    3

DECAY 1000003  70.177871
    0.50231882   2   -1000037    4
    0.2502544   2    1000025    3
    0.24203379   2    1000021    3
    0.0041947403   2    1000035    3
    0.00067063826   2    1000022    3
    0.00046157189   2    1000023    3

DECAY 1000005  25.965632
    0.86097638   2   -1000024    6
    0.070433037   2    1000022    5
    0.068590578   2    1000023    5

DECAY 2000005  23.056771
    0.48459238   2   -1000024    6
    0.24599871   2    1000022    5
    0.24084566   2    1000023    5
    0.016764201   2    1000035    5
    0.0053675907   2    1000006   -24
    0.0036571845   2    1000005    25
    0.0026896777   2    1000005    23

DECAY 2000002  1.2884662
    0.99843973   2    1000035    2
    0.00095938184   2    1000023    2
    0.00059886796   2    1000022    2

DECAY 1000002  70.179037
    0.49834098   2    1000037    1
    0.25008839   2    1000025    2
    0.24154821   2    1000021    2
    0.0045972519   2    1000024    1
    0.0041634656   2    1000035    2
    0.00073208219   2    1000022    2
    0.00052961981   2    1000023    2

DECAY 2000004  1.2909884
    0.99648635   2    1000035    4
    0.0014509461   2    1000023    4
    0.0010800566   2    1000022    4
    0.0009721096   2    1000024    3

DECAY 1000004  70.185987
    0.49829155   2    1000037    3
    0.25006366   2    1000025    4
    0.2415229   2    1000021    4
    0.0046731639   2    1000024    3
    0.0041630564   2    1000035    4
    0.0007439122   2    1000022    4
    0.00054174498   2    1000023    4

DECAY 1000006  26.245868
    0.43341792   2    1000023    6
    0.4243984   2    1000022    6
    0.13896188   2    1000024    5
    0.0028519519   3    1000022    24    5
    0.00021477748   2    1000022    4
    0.00015506855   2    1000023    4

DECAY 2000006  258.8318
    0.37794863   2    1000024    5
    0.19115805   2    1000023    6
    0.18688267   2    1000022    6
    0.090020388   2    1000021    6
    0.058690158   2    1000005    24
    0.043681752   2    1000006    25
    0.029289975   2    1000006    23
    0.019338083   2    1000035    6
    0.0019984305   2    1000037    5
    0.00099183057   2    1000025    6

DECAY 1000024  3.6826542e-11
    0.54911582   3    1000022   -1    2
    0.1830449   3    1000022   -11    12
    0.18081413   3    1000022   -13    14
    0.08526351   3    1000022   -3    4
    0.0017616451   3    1000022   -15    16

DECAY 1000037  12.005682
    0.24115877   2    1000023    24
    0.23708841   2    1000024    23
    0.23562262   2    1000022    24
    0.22965749   2    1000024    25
    0.032639077   2    1000006   -5
    0.01071317   3    1000024    6   -6
    0.0067999195   3    1000023   -5    6
    0.006318378   3    1000022   -5    6

DECAY 1000022 -1


DECAY 1000023  1.1475005e-08
    0.73397058   2    1000022    22
    0.070999176   3    1000022    12   -12
    0.053091059   3    1000022    1   -1
    0.052764637   3    1000022    3   -3
    0.04140693   3    1000022    2   -2
    0.011981313   3    1000022    11   -11
    0.011865379   3    1000022    13   -13
    0.010003353   3    1000022    4   -4
    0.003867104   3    1000024    1   -2
    0.003867104   3   -1000024   -1    2
    0.0012890848   3    1000024    11   -12
    0.0012890848   3   -1000024   -11    12
    0.0012713204   3    1000024    13   -14
    0.0012713204   3   -1000024   -13    14
    0.00044269276   3    1000024    3   -4
    0.00044269276   3   -1000024   -3    4
    0.00017054579   3    1000022    15   -15

DECAY 1000025  12.853836
    0.22387371   2    1000024   -24
    0.22387371   2   -1000024    24
    0.15313402   2    1000023    25
    0.13348289   2    1000023    23
    0.12623686   2    1000022    25
    0.08911342   2    1000022    23
    0.016407087   2    1000005   -5
    0.016407087   2   -1000005    5
    0.0059751112   3    1000024    5   -6
    0.0059751112   3   -1000024   -5    6
    0.0028102097   3    1000023    6   -6
    0.0027003124   3    1000022    6   -6

DECAY 1000035  11.688664
    0.14727704   2    1000024   -24
    0.14727704   2   -1000024    24
    0.12095747   2    1000015   -15
    0.12095747   2   -1000015    15
    0.090324099   2    1000023    25
    0.089022898   2    1000022    23
    0.074857728   2    1000022    25
    0.058132834   2    1000023    23
    0.031355828   2    1000005   -5
    0.031355828   2   -1000005    5
    0.030369675   2    1000006   -6
    0.030369675   2   -1000006    6
    0.0077297408   3    1000024    5   -6
    0.0077297408   3   -1000024   -5    6
    0.0054939463   3    1000023    6   -6
    0.0053406702   3    1000022    6   -6
    0.00029870111   2    1000037   -24
    0.00029870111   2   -1000037    24
    0.00026475115   2    1000025    23
    0.00025373885   2    1000025    25

DECAY 1000021  315.46712
    0.16474377   2    1000006   -6
    0.16474377   2   -1000006    6
    0.16454502   2    1000005   -5
    0.16454502   2   -1000005    5
    0.07316595   2    1000006   -4
    0.07316595   2   -1000006    4
    0.02512148   2    2000003   -3
    0.02512148   2   -2000003    3
    0.02512146   2    2000001   -1
    0.02512146   2   -2000001    1
    0.016563691   2    2000002   -2
    0.016563691   2   -2000002    2
    0.01656367   2    2000004   -4
    0.01656367   2   -2000004    4
    0.012193147   2    2000005   -5
    0.012193147   2   -2000005    5
    0.00091090228   3    1000037    5   -6
    0.00091090228   3   -1000037   -5    6
    0.00046920293   3    1000025    5   -5
    0.00044076122   3    1000025    6   -6
    0.00013602941   3    1000023    6   -6
    0.00013562396   3    1000024    5   -6
    0.00013562396   3   -1000024   -5    6
    0.00013301423   3    1000022    6   -6
    0.00011118164   3    1000037    3   -4
    0.00011118164   3   -1000037   -3    4
    0.00011118152   3    1000037    1   -2
    0.00011118152   3   -1000037   -1    2

DECAY 25  0.003403577
    0.63392915   2   -5    5
    0.1644288   2   -24    24
    0.075455179   2    21    21
    0.072539675   2   -15    15
    0.031402919   2   -4    4
    0.018295053   2    23    23
    0.0023130592   2    22    22
    0.0011454686   2    22    23
    0.00025160075   2   -13    13
    0.00023827194   2   -3    3
    6.5879868e-07   2   -1    1
    1.6184049e-07   2   -2    2
    5.6563225e-09   2   -11    11

DECAY 35  70.729801
    0.3507733   2   -5    5
    0.18426636   2   -1000024    1000037
    0.18426636   2   -1000037    1000024
    0.098384995   2    1000022    1000025
    0.086777526   2    1000023    1000025
    0.067567712   2   -15    15
    0.011541816   2    1000022    1000035
    0.0076793957   2    1000023    1000035
    0.0038115531   2   -1000024    1000024
    0.0037403734   2   -6    6
    0.00048800975   2    1000022    1000022
    0.00024901002   2    1000023    1000023
    0.00023340855   2   -13    13
    0.00013771551   2   -3    3
    3.3215125e-05   2   -1000037    1000037
    1.6552146e-05   2    1000025    1000025
    1.2627838e-05   2   -1000006    1000006
    1.1178195e-05   2   -1000005    1000005
    3.8562504e-06   2    1000022    1000023
    2.335346e-06   2    25    25
    1.1195692e-06   2    21    21
    5.9885484e-07   2    1000025    1000035
    4.2746203e-07   2    23    23
    3.8073904e-07   2   -1    1
    9.0421648e-08   2   -24    24
    4.9354083e-08   2   -4    4
    2.1284141e-08   2    22    23
    8.3450061e-09   2    22    22
    5.2417466e-09   2   -11    11
    6.2393239e-10   2   -1000015    1000015
    2.5438143e-13   2   -2    2

DECAY 36  69.400374
    0.34157859   2   -5    5
    0.18788437   2   -1000024    1000037
    0.18788437   2   -1000037    1000024
    0.098007404   2    1000023    1000025
    0.090781725   2    1000022    1000025
    0.065799491   2   -15    15
    0.011528844   2    1000023    1000035
    0.0080799983   2    1000022    1000035
    0.0038537603   2   -1000024    1000024
    0.0034713292   2   -6    6
    0.00042686556   2    1000022    1000022
    0.00030155295   2    1000023    1000023
    0.00022730015   2   -13    13
    0.00013410809   2   -3    3
    1.7306699e-05   2    1000022    1000023
    9.2825616e-06   2   -1000037    1000037
    7.693025e-06   2    21    21
    4.6487571e-06   2    1000025    1000025
    9.1793244e-07   2    23    25
    3.7076439e-07   2   -1    1
    4.5435719e-08   2   -4    4
    8.6742072e-09   2    22    23
    5.1045594e-09   2   -11    11
    3.8826184e-09   2    1000025    1000035
    6.5829057e-10   2    22    22
    2.3419113e-13   2   -2    2
    3.766037e-41   2    25    25

DECAY 37  71.858866
    0.3635849   2   -5    6
    0.18550507   2    1000022    1000037
    0.18211658   2    1000024    1000025
    0.18047226   2    1000023    1000037
    0.067298212   2   -15    16
    0.018899051   2    1000024    1000035
    0.00072876617   2    1000023    1000024
    0.00053421679   2   -5    4
    0.00047949152   2    1000022    1000024
    0.00023792313   2   -13    14
    0.00012559296   2   -3    4
    5.8991978e-06   2   -3    2
    5.2004012e-06   2   -3    6
    3.8148582e-06   2   -5    2
    9.148337e-07   2   -1000005    1000006
    8.8711571e-07   2    24    25
    6.1463498e-07   2    1000035    1000037
    3.483695e-07   2   -1    2
    2.299363e-07   2   -1    6
    1.8416597e-08   2   -1    4
    5.5650468e-09   2   -11    12
    2.4875057e-11   2    1000025    1000037
    5.648826e-14   2    24    35

DECAY 6  2.43
    1   2    5    24

DECAY 15 -1
