BLOCK SPINFO
   1   SPheno
   2   v4.0.5be

BLOCK SPHENOINFO
   1   2
   2   2

BLOCK MODSEL
   1   0

BLOCK MINPAR
   3    34.111617
   4    1

BLOCK EXTPAR
   0    1653.2618
   1    314.52944
   2    310.50958
   3    3000
   11   -4916.5662
   12    1134.1365
   13    1264.0728
   23    1165.0345
   25    33.181442
   26    2321.6625
   31    1827.9406
   32    1827.9406
   33    1410.7071
   34    1331.0676
   35    1331.0676
   36    1932.302
   41    5000
   42    5000
   43    1989.1222
   44    5000
   45    5000
   46    1472.8715
   47    5000
   48    5000
   49    981.03813

BLOCK SMINPUTS
   1    127.90897
   2    1.1663787e-05
   3    0.1184
   4    91.1876
   5    4.18
   6    173.2
   7    1.777
   8    0
   11    0.00051099893
   12    0
   13    0.10565837
   14    0
   21    0.005
   22    0.0025
   23    0.095
   24    1.27

BLOCK GAUGE Q=  1653.2618
   1    0.35536298
   2    0.66519887
   3    1.219778

BLOCK YU Q=  1653.2618
   1   1    8.3881789e-06
   2   2    0.0042611949
   3   3    1.0133594

BLOCK YD Q=  1653.2618
   1   1    0.00055929789
   2   2    0.01062666
   3   3    0.55464825

BLOCK YE Q=  1653.2618
   1   1    9.7601571e-05
   2   2    0.02018091
   3   3    0.3394097

BLOCK AU Q=  1653.2618
   1   1    0
   2   2    0
   3   3   -4916.5657

BLOCK AD Q=  1653.2618
   1   1    0
   2   2    0
   3   3    1134.1369

BLOCK AE Q=  1653.2618
   1   1    0
   2   2    0
   3   3    1264.0729

BLOCK MSOFT Q=  1653.2618
   1    314.52944
   2    310.50958
   3    3000
   21    4065988.8
   22   -1319467.6
   31    1827.9406
   32    1827.9406
   33    1410.7071
   34    1331.0676
   35    1331.0676
   36    1932.302
   41    5000
   42    5000
   43    1989.1222
   44    5000
   45    5000
   46    1472.8715
   47    5000
   48    5000
   49    981.03813

BLOCK MASS
   6    173.2
   23    91.1876
   24    80.429995
   15    1.777
   25    122.05757
   35    2320.8064
   36    2321.6625
   37    2322.5351
   1000001    5037.0906
   2000001    5026.2349
   1000002    5036.651
   2000002    5027.4204
   1000003    5037.0946
   2000003    5026.2352
   1000004    5036.6527
   2000004    5027.4209
   1000005    1004.2528
   2000005    1964.4605
   1000006    1348.7598
   2000006    2026.5095
   1000011    1831.6233
   2000011    1334.0613
   1000012    1829.5714
   1000013    1831.6182
   2000013    1334.0462
   1000014    1829.5635
   1000015    1411.4181
   2000015    1931.4055
   1000016    1409.8235
   1000021    3205.1361
   1000022    313.79646
   1000023    333.22064
   1000025   -1173.4171
   1000035    1175.1645
   1000024    333.34456
   1000037    1176.7252

BLOCK ALPHA
      -0.02951092

BLOCK HMIX Q=  1653.2618
   1    1165.0345
   2    33.181442
   3    243.87711
   4    5390117

BLOCK STOPMIX
   1   1    0.32202336
   1   2    0.94673173
   2   1   -0.94673173
   2   2    0.32202336

BLOCK SBOTMIX
   1   1    0.02758311
   1   2    0.99961951
   2   1   -0.99961951
   2   2    0.02758311

BLOCK STAUMIX
   1   1    0.99926815
   1   2    0.038251388
   2   1   -0.038251388
   2   2    0.99926815

BLOCK NMIX
   1   1   -0.99701185
   1   2    0.060362125
   1   3   -0.046136533
   1   4    0.013971275
   2   1    0.063851873
   2   2    0.99517635
   2   3   -0.071089623
   2   4    0.022208866
   3   1    0.020560981
   3   2   -0.035933195
   3   3   -0.70556485
   3   4   -0.70743502
   4   1   -0.038308572
   4   2    0.068478093
   4   3    0.70355948
   4   4   -0.70629121

BLOCK UMIX
   1   1   -0.99455075
   1   2    0.10425355
   2   1    0.10425355
   2   2    0.99455075

BLOCK VMIX
   1   1   -0.99946759
   1   2    0.032627135
   2   1    0.032627135
   2   2    0.99946759

BLOCK HIGGSBOUNDSINPUTHIGGSCOUPLINGSFERMIONS
       0, 1101.0081,3,36,15,15

BLOCK HIGGSBOUNDSINPUTHIGGSCOUPLINGSBOSONS
       0,4,36,21,21,23

BLOCK SPHENOLOWENERGY
   1    0.00028507548
   2    1.5979587e-06
   3    3.5271921e-05
   4    2.4328845e-15
   5    1.0392854e-10
   6    2.1668396e-08
   7    8.1548822e-14
   8    3.4837142e-09
   9    7.360639e-07
   10    9.6051081e-05
   11    0.9921709
   12    0.54203164
   13    19.361465
   14    0
   15    0
   16    0.0021573577
   17    2.2816598e-15
   18    2.4819041e-11
   19    8.2944592e-11
   20    4.068876e-15
   21    1.7395844e-10
   22    7.0029243e-08
   23    0
   24    0
   25    0
   26    0
   27    0
   28    0
   29    0
   30    0
   31    0
   39    9.0062772e-05
   40    0
   41    0
   42    0

BLOCK FWCOEF Q=  160
   305   4422   0   0   -0.18881911
   305   4422   0   2   -0.14448516
   305   4322   0   2    0.00024209771
   305   6421   0   0   -0.095227835
   305   6421   0   2   -0.07616679
   305   6321   0   2   -3.9487602e-05
   3051111   4133   0   0    1.5955911
   3051111   4133   0   2    1.596489
   3051111   4233   0   2    0.00017981935
   3051111   4137   0   0   -4.4182832
   3051111   4137   0   2   -4.4184729
   3051111   4237   0   2   -0.0013919809
   3051313   4133   0   0    1.5955911
   3051313   4133   0   2    1.596487
   3051313   4233   0   2    0.00017981864
   3051313   4137   0   0   -4.4182832
   3051313   4137   0   2   -4.4184749
   3051313   4237   0   2   -0.0013919814
   3051212   4137   0   0    1.5053501
   3051212   4137   0   2    1.5054127
   3051212   4237   0   2    0.00030310777
   3051414   4137   0   0    1.5053501
   3051414   4137   0   2    1.5054127
   3051414   4237   0   2    0.00030310786
   3051616   4137   0   0    1.5053501
   3051616   4137   0   2    1.5054136
   3051616   4237   0   2    0.00030313095

BLOCK IMFWCOEF Q=  160
   305   4422   0   0    3.8591177e-07
   305   4422   0   2    2.549328e-05
   305   4322   0   2    7.6629702e-06
   305   6421   0   0    3.3055895e-07
   305   6421   0   2   -1.3676362e-05
   305   6321   0   2    3.5556171e-06
   3051111   4133   0   2   -2.3601411e-06
   3051111   4233   0   2    3.9621637e-06
   3051111   4137   0   2    2.7400505e-05
   3051111   4237   0   2   -3.0680612e-05
   3051313   4133   0   2   -2.3601767e-06
   3051313   4233   0   2    3.9621579e-06
   3051313   4137   0   2    2.740052e-05
   3051313   4237   0   2   -3.0680628e-05
   3051212   4137   0   2   -5.5898828e-06
   3051212   4237   0   2    6.6808294e-06
   3051414   4137   0   2   -5.5898819e-06
   3051414   4237   0   2    6.6808294e-06
   3051616   4137   0   2   -5.5743123e-06
   3051616   4237   0   2    6.6808226e-06

DECAY 23  2.4952


DECAY 24  2.085


DECAY 2000011  5.9709129
    0.99586924   2    1000022    11
    0.0040237562   2    1000023    11

DECAY 1000011  24.657365
    0.60467225   2   -1000024    12
    0.32384077   2    1000023    11
    0.068704214   2    1000022    11
    0.0024511135   2   -1000037    12
    0.00026090819   2    1000035    11

DECAY 2000013  5.972072
    0.99566536   2    1000022    13
    0.0040309738   2    1000023    13
    0.00012769021   2    1000035    13

DECAY 1000013  24.663864
    0.60451105   2   -1000024    14
    0.32375723   2    1000023    13
    0.068687119   2    1000022    13
    0.0024504421   2   -1000037    14
    0.00036397581   2    1000035    13
    0.00017486533   2    1000025    13

DECAY 1000015  18.466317
    0.59490803   2   -1000024    16
    0.31922425   2    1000023    15
    0.069010921   2    1000022    15
    0.0082785752   2    1000025    15
    0.0081287536   2    1000035    15
    0.0004494783   2   -1000037    16

DECAY 2000015  14.091549
    0.64789687   2    1000022    15
    0.12460805   2   -1000037    16
    0.062924336   2    1000035    15
    0.062812458   2    1000025    15
    0.05001654   2    1000016   -24
    0.024507673   2    1000015    23
    0.024100741   2    1000015    25
    0.0028739512   2    1000023    15
    0.00025938152   2   -1000024    16

DECAY 1000012  24.692528
    0.6090194   2    1000024    11
    0.28157346   2    1000023    12
    0.10802939   2    1000022    12
    0.00089027591   2    1000035    12
    0.00024875669   2    1000025    12
    0.00023871047   2    1000037    11

DECAY 1000014  24.697596
    0.60889743   2    1000024    13
    0.28151429   2    1000023    14
    0.1080067   2    1000022    14
    0.00089007847   2    1000035    14
    0.00044280768   2    1000037    13
    0.00024870154   2    1000025    14

DECAY 1000016  18.462264
    0.60017621   2    1000024    15
    0.27673088   2    1000023    16
    0.10676749   2    1000022    16
    0.016007918   2    1000037    15
    0.00024765217   2    1000035    16

DECAY 2000001  142.46678
    0.98046   2    1000021    1
    0.01942673   2    1000022    1

DECAY 1000001  207.37909
    0.67900765   2    1000021    1
    0.2096474   2   -1000024    2
    0.10257166   2    1000023    1
    0.0060040235   2    1000022    1
    0.0020772283   2   -1000037    2
    0.00054205979   2    1000035    1
    0.00014997547   2    1000025    1

DECAY 2000003  142.48695
    0.98032139   2    1000021    3
    0.019424146   2    1000022    3

DECAY 1000003  207.39129
    0.67896973   2    1000021    3
    0.20963521   2   -1000024    4
    0.10256598   2    1000023    3
    0.0060037898   2    1000022    3
    0.0020849769   2   -1000037    4
    0.00056611581   2    1000035    3
    0.00017419754   2    1000025    3

DECAY 1000005  0.59921553
    0.78466461   2    1000022    5
    0.140929   2   -1000024    6
    0.074406391   2    1000023    5

DECAY 2000005  124.63099
    0.61676332   2    1000006   -24
    0.13157841   2   -1000037    6
    0.12654218   2   -1000024    6
    0.06345246   2    1000023    5
    0.019987153   2    1000035    5
    0.019986559   2    1000025    5
    0.011634595   2    1000005    25
    0.0062462684   2    1000005    23
    0.003809056   2    1000022    5

DECAY 2000002  150.94388
    0.92621333   2    1000021    2
    0.073360416   2    1000022    2
    0.00030059013   2    1000023    2

DECAY 1000002  207.37402
    0.67880374   2    1000021    2
    0.21171181   2    1000024    1
    0.10736144   2    1000023    2
    0.0014565135   2    1000022    2
    0.00036334988   2    1000035    2
    0.00020356815   2    1000037    1

DECAY 2000004  150.94712
    0.92619341   2    1000021    4
    0.073358838   2    1000022    4
    0.00030058965   2    1000023    4
    0.0001029206   2    1000035    4

DECAY 1000004  207.38588
    0.67876548   2    1000021    4
    0.21170036   2    1000024    3
    0.10735532   2    1000023    4
    0.0014564323   2    1000022    4
    0.00036725252   2    1000035    4
    0.00025166505   2    1000037    3
    0.00010349423   2    1000025    4

DECAY 1000006  6.1434126
    0.38817888   2    1000022    6
    0.23314295   2    1000024    5
    0.23154294   2    1000037    5
    0.11373549   2    1000023    6
    0.021395813   2    1000023    4
    0.0073560974   2    1000025    6
    0.0025903668   2    1000035    6
    0.0017410397   2    1000005    24
    0.00029425936   2    1000022    4

DECAY 2000006  137.39056
    0.321751   2    1000006    23
    0.31001795   2    1000006    25
    0.10717638   2    1000024    5
    0.0730451   2    1000035    6
    0.068781768   2    1000025    6
    0.053206781   2    1000023    6
    0.050830932   2    1000037    5
    0.011943621   2    1000005    24
    0.0032464745   2    1000022    6

DECAY 1000024  5.8357818e-08
    0.33697914   3    1000022   -1    2
    0.33014508   3    1000022   -3    4
    0.11240944   3    1000022   -11    12
    0.11240818   3    1000022   -13    14
    0.10805815   3    1000022   -15    16

DECAY 1000037  8.6031371
    0.31629927   2    1000023    24
    0.2964   2    1000024    25
    0.29405847   2    1000024    23
    0.076719812   2    1000022    24
    0.0065580192   3    1000024    6   -6
    0.0064287799   3    1000023   -5    6
    0.0033469266   3    1000022   -5    6
    0.00013479345   3    1000024    5   -5

DECAY 1000022 -1


DECAY 1000023  8.2988619e-11
    0.24791973   2    1000022    22
    0.15524975   3    1000022    1   -1
    0.15520919   3    1000022    3   -3
    0.11896645   3    1000022    2   -2
    0.11347683   3    1000022    5   -5
    0.11263695   3    1000022    4   -4
    0.060167808   3    1000022    12   -12
    0.012543511   3    1000022    15   -15
    0.011915699   3    1000022    13   -13
    0.01191409   3    1000022    11   -11

DECAY 1000025  11.015623
    0.23330766   2    1000024   -24
    0.23330766   2   -1000024    24
    0.17023923   2    1000023    23
    0.15196267   2    1000023    25
    0.072717102   2    1000022    23
    0.056946821   2    1000022    25
    0.034767197   2    1000005   -5
    0.034767197   2   -1000005    5
    0.0048003983   3    1000024    5   -6
    0.0048003983   3   -1000024   -5    6
    0.0016303074   3    1000023    6   -6
    0.00064240805   3    1000022    6   -6

DECAY 1000035  9.2909388
    0.27416506   2    1000024   -24
    0.27416506   2   -1000024    24
    0.20031885   2    1000023    25
    0.075051444   2    1000022    25
    0.055110593   2    1000023    23
    0.041592798   2    1000005   -5
    0.041592798   2   -1000005    5
    0.024560595   2    1000022    23
    0.0053110291   3    1000024    5   -6
    0.0053110291   3   -1000024   -5    6
    0.0019869182   3    1000023    6   -6
    0.00074032516   3    1000022    6   -6

DECAY 1000021  212.61115
    0.18142575   2    1000005   -5
    0.18142575   2   -1000005    5
    0.13881746   2    1000006   -6
    0.13881746   2   -1000006    6
    0.08857808   2    2000006   -6
    0.08857808   2   -2000006    6
    0.086989067   2    2000005   -5
    0.086989067   2   -2000005    5
    0.0037451704   2    1000006   -4
    0.0037451704   2   -1000006    4
    0.00016653883   3    1000025    5   -5
    0.000163945   3    1000035    5   -5
    0.00013307124   3    1000037    5   -6
    0.00013307124   3   -1000037   -5    6

DECAY 25  0.0035303683
    0.61844308   2   -5    5
    0.18252856   2   -24    24
    0.072646019   2    21    21
    0.071118835   2   -15    15
    0.030356135   2   -4    4
    0.020823638   2    23    23
    0.0023495476   2    22    22
    0.0012538513   2    22    23
    0.0002466532   2   -13    13
    0.00023286721   2   -3    3
    6.4385333e-07   2   -1    1
    1.5644121e-07   2   -2    2
    5.5450782e-09   2   -11    11

DECAY 35  46.890811
    0.52254434   2   -5    5
    0.12342033   2   -15    15
    0.10545333   2   -1000024    1000037
    0.10545333   2   -1000037    1000024
    0.075872021   2    1000022    1000025
    0.045627035   2    1000022    1000035
    0.0076691643   2    1000023    1000025
    0.0045774518   2    1000023    1000035
    0.0039349454   2   -1000024    1000024
    0.0026776008   2    1000022    1000022
    0.0013941707   2   -6    6
    0.00054142067   2    1000022    1000023
    0.00042357531   2   -13    13
    0.00022640552   2   -3    3
    7.7282494e-05   2   -1000005    1000005
    6.1226668e-05   2    25    25
    2.7368736e-05   2    1000023    1000023
    1.4552646e-05   2    21    21
    2.5414918e-06   2    23    23
    1.0900861e-06   2   -24    24
    6.2588409e-07   2   -1    1
    1.1685058e-07   2    22    23
    3.0013592e-08   2   -4    4
    2.9588515e-08   2    22    22
    9.5139969e-09   2   -11    11
    1.5475274e-13   2   -2    2

DECAY 36  45.536201
    0.51441692   2   -5    5
    0.12149017   2   -15    15
    0.10834603   2   -1000024    1000037
    0.10834603   2   -1000037    1000024
    0.076855704   2    1000022    1000035
    0.047935534   2    1000022    1000025
    0.007768381   2    1000023    1000035
    0.0048093282   2    1000023    1000025
    0.0045138788   2   -1000024    1000024
    0.0030716793   2    1000022    1000022
    0.0011265176   2   -6    6
    0.00062216893   2    1000022    1000023
    0.00041695077   2   -13    13
    0.00022285474   2   -3    3
    3.1505281e-05   2    1000023    1000023
    2.1578262e-05   2    21    21
    3.6969873e-06   2    23    25
    6.1607022e-07   2   -1    1
    2.6974505e-07   2    22    23
    1.4781327e-07   2    22    22
    2.4749894e-08   2   -4    4
    9.3652158e-09   2   -11    11
    1.2761868e-13   2   -2    2
    2.9405679e-35   2    25    25

DECAY 37  51.919182
    0.57710964   2   -5    6
    0.10409601   2   -15    16
    0.095893957   2    1000024    1000025
    0.095479578   2    1000024    1000035
    0.076361931   2    1000022    1000037
    0.047473124   2    1000023    1000037
    0.0020849698   2    1000023    1000024
    0.00085497858   2   -5    4
    0.00036801672   2   -13    14
    0.00018590451   2   -3    4
    7.0726349e-05   2    1000022    1000024
    8.6805012e-06   2   -3    2
    6.1054308e-06   2   -5    2
    3.2495466e-06   2    24    25
    2.4819364e-06   2   -3    6
    5.1544653e-07   2   -1    2
    1.013039e-07   2   -1    6
    2.4930008e-08   2   -1    4
    8.6079494e-09   2   -11    12
    4.0467554e-13   2    24    35

DECAY 6  2.43
    1   2    5    24

DECAY 15 -1
