BLOCK SPINFO
   1   SPheno
   2   v4.0.5be

BLOCK SPHENOINFO
   1   2
   2   2

BLOCK MODSEL
   1   0

BLOCK MINPAR
   3    19.881658
   4    1

BLOCK EXTPAR
   0    4799.5038
   1    383.02179
   2    2432.1078
   3    3841.7
   11    6730.9525
   12    7860.4799
   13   -5761.8731
   23    1614.855
   25    18.914284
   26    1551.9135
   31    3777.3105
   32    3777.3105
   33    2681.3958
   34    609.21384
   35    609.21384
   36    1379.1175
   41    2083.0633
   42    2083.0633
   43    4769.963
   44    4796.656
   45    4796.656
   46    4780.4393
   47    2283.4939
   48    2283.4939
   49    2879.1264

BLOCK SMINPUTS
   1    127.90897
   2    1.1663787e-05
   3    0.1184
   4    91.1876
   5    4.18
   6    173.2
   7    1.777
   8    0
   11    0.00051099893
   12    0
   13    0.10565837
   14    0
   21    0.005
   22    0.0025
   23    0.095
   24    1.27

BLOCK GAUGE Q=  4799.5038
   1    0.35536298
   2    0.66519887
   3    1.219778

BLOCK YU Q=  4799.5038
   1   1    8.3960822e-06
   2   2    0.0042652097
   3   3    1.0143142

BLOCK YD Q=  4799.5038
   1   1    0.00031911471
   2   2    0.0060631795
   3   3    0.3164618

BLOCK YE Q=  4799.5038
   1   1    5.568785e-05
   2   2    0.011514481
   3   3    0.19365463

BLOCK AU Q=  4799.5038
   1   1    0
   2   2    0
   3   3    6730.9525

BLOCK AD Q=  4799.5038
   1   1    0
   2   2    0
   3   3    7860.4799

BLOCK AE Q=  4799.5038
   1   1    0
   2   2    0
   3   3   -5761.8731

BLOCK MSOFT Q=  4799.5038
   1    383.02179
   2    2432.1078
   3    3841.7
   21   -249773.2
   22   -2243231.7
   31    3777.3105
   32    3777.3105
   33    2681.3958
   34    609.21384
   35    609.21384
   36    1379.1175
   41    2083.0633
   42    2083.0633
   43    4769.963
   44    4796.656
   45    4796.656
   46    4780.4393
   47    2283.4939
   48    2283.4939
   49    2879.1264

BLOCK MASS
   6    173.2
   23    91.1876
   24    80.429995
   15    1.777
   25    125.25449
   35    1551.9395
   36    1551.9135
   37    1554.0952
   1000001    2363.2304
   2000001    2518.1864
   1000002    2361.8946
   2000002    4920.9231
   1000003    2363.2287
   2000003    2518.1851
   1000004    2361.8933
   2000004    4920.9223
   1000005    3074.7429
   2000005    4837.4595
   1000006    4707.8908
   2000006    4892.8995
   1000011    3791.1799
   2000011    681.08925
   1000012    3789.9471
   1000013    3791.1751
   2000013    681.06669
   1000014    3789.9422
   1000015    1399.4732
   2000015    2695.0149
   1000016    2693.2674
   1000021    4055.0051
   1000022    375.27505
   1000023    1634.6549
   1000025   -1638.6479
   1000035    2449.2121
   1000024    1634.2662
   1000037    2449.4383

BLOCK ALPHA
      -0.050770746

BLOCK HMIX Q=  4799.5038
   1    1614.855
   2    18.914284
   3    242.74642
   4    2408435.5

BLOCK STOPMIX
   1   1   -0.55312872
   1   2    0.8330958
   2   1   -0.8330958
   2   2   -0.55312872

BLOCK SBOTMIX
   1   1    0.0032356226
   1   2    0.99999476
   2   1   -0.99999476
   2   2    0.0032356226

BLOCK STAUMIX
   1   1    0.012274771
   1   2    0.99992466
   2   1   -0.99992466
   2   2    0.012274771

BLOCK NMIX
   1   1    0.9995481
   1   2   -0.00033928736
   1   3    0.028950001
   1   4   -0.0080860492
   2   1    0.026163968
   2   2    0.069560042
   2   3   -0.70575178
   2   4    0.7045504
   3   1   -0.014743464
   3   2    0.012775687
   3   3    0.70672654
   3   4    0.7072178
   4   1    0.0012957194
   4   2   -0.9974959
   4   3   -0.040173628
   4   4    0.058192212

BLOCK UMIX
   1   1   -0.057060683
   1   2    0.99837071
   2   1    0.99837071
   2   2    0.057060683

BLOCK VMIX
   1   1   -0.082557609
   1   2    0.99658629
   2   1    0.99658629
   2   2    0.082557609

BLOCK HIGGSBOUNDSINPUTHIGGSCOUPLINGSFERMIONS
       0, 357.75012,3,36,15,15

BLOCK HIGGSBOUNDSINPUTHIGGSCOUPLINGSBOSONS
       0,4,36,21,21,23

BLOCK SPHENOLOWENERGY
   1    0.00034128931
   2    1.5883762e-06
   3    3.5258456e-05
   4    2.6418032e-15
   5    1.128549e-10
   6    2.3628987e-08
   7    8.8594741e-14
   8    3.7847668e-09
   9    8.0292327e-07
   10    9.5703892e-05
   11    0.98858456
   12    0.54199526
   13    19.360321
   14    0
   15    0
   16    0.0021573372
   17    2.2816596e-15
   18    2.4804439e-11
   19    8.2911921e-11
   20    4.9627704e-16
   21    2.1216577e-11
   22    9.885859e-09
   23    0
   24    0
   25    0
   26    0
   27    0
   28    0
   29    0
   30    0
   31    0
   39    4.5699551e-05
   40    0
   41    0
   42    0

BLOCK FWCOEF Q=  160
   305   4422   0   0   -0.18881911
   305   4422   0   2   -0.21012299
   305   4322   0   2   -0.00045205468
   305   6421   0   0   -0.095227835
   305   6421   0   2   -0.12034578
   305   6321   0   2   -0.00051662156
   3051111   4133   0   0    1.6327142
   3051111   4133   0   2    1.6328336
   3051111   4233   0   2    6.0568646e-05
   3051111   4137   0   0   -4.4554063
   3051111   4137   0   2   -4.4543183
   3051111   4237   0   2   -0.00044456148
   3051313   4133   0   0    1.6327142
   3051313   4133   0   2    1.6328335
   3051313   4233   0   2    6.056843e-05
   3051313   4137   0   0   -4.4554063
   3051313   4137   0   2   -4.4543184
   3051313   4237   0   2   -0.00044456134
   3051212   4137   0   0    1.5053501
   3051212   4137   0   2    1.5051174
   3051212   4237   0   2    9.6002092e-05
   3051414   4137   0   0    1.5053501
   3051414   4137   0   2    1.5051174
   3051414   4237   0   2    9.6002133e-05
   3051616   4137   0   0    1.5053501
   3051616   4137   0   2    1.5051173
   3051616   4237   0   2    9.601387e-05

BLOCK IMFWCOEF Q=  160
   305   4422   0   0    3.8579714e-07
   305   4422   0   2    7.509198e-06
   305   4322   0   2   -1.2830902e-06
   305   6421   0   0    3.3046076e-07
   305   6421   0   2   -3.3752073e-06
   305   6321   0   2   -8.6603097e-07
   3051111   4133   0   2   -5.7440013e-07
   3051111   4233   0   2    1.5927154e-06
   3051111   4137   0   2    5.5585696e-06
   3051111   4237   0   2   -1.1690844e-05
   3051313   4133   0   2   -5.7439933e-07
   3051313   4233   0   2    1.592715e-06
   3051313   4137   0   2    5.558571e-06
   3051313   4237   0   2   -1.1690845e-05
   3051212   4137   0   2   -1.1606209e-06
   3051212   4237   0   2    2.5246026e-06
   3051414   4137   0   2   -1.1606209e-06
   3051414   4237   0   2    2.5246026e-06
   3051616   4137   0   2   -1.1621539e-06
   3051616   4237   0   2    2.5246033e-06

DECAY 23  2.4952


DECAY 24  2.085


DECAY 2000011  1.6582215
    1   2    1000022    11

DECAY 1000011  21.727279
    0.5196145   2   -1000037    12
    0.25906087   2    1000035    11
    0.21444514   2    1000022    11
    0.0035520481   2    1000023    11
    0.0033152402   2   -1000024    12

DECAY 2000013  1.6580708
    1   2    1000022    13

DECAY 1000013  21.734686
    0.5194349   2   -1000037    14
    0.25897161   2    1000035    13
    0.21437216   2    1000022    13
    0.0037026575   2    1000023    13
    0.0033141025   2   -1000024    14
    0.00016414444   2    1000025    13

DECAY 1000015  6.0522843
    1   2    1000022    15

DECAY 2000015  5.9330551
    0.54770835   2    1000022    15
    0.12061993   2   -1000037    16
    0.072654177   2    1000023    15
    0.067387137   2    1000025    15
    0.065332757   2    1000015    23
    0.061469219   2    1000015    25
    0.06025489   2    1000035    15
    0.0045735408   2   -1000024    16

DECAY 1000012  21.731715
    0.51700231   2    1000037    11
    0.25940152   2    1000035    12
    0.21487432   2    1000022    12
    0.0069342074   2    1000024    11
    0.0015712208   2    1000023    12
    0.00021642548   2    1000025    12

DECAY 1000014  21.738241
    0.51684508   2    1000037    13
    0.25932234   2    1000035    14
    0.21480953   2    1000022    14
    0.0072357685   2    1000024    13
    0.0015707452   2    1000023    14
    0.00021635997   2    1000025    14

DECAY 1000016  5.966049
    0.54546469   2    1000022    16
    0.14471906   2    1000024    15
    0.12975758   2    1000015    24
    0.11800498   2    1000037    15
    0.059268517   2    1000035    16
    0.0024490084   2    1000023    16
    0.00033616429   2    1000025    16

DECAY 1000001  0.34535487
    0.91016516   2    1000022    1
    0.053396394   2   -1000024    2
    0.034510692   2    1000023    1
    0.0019277556   2    1000025    1

DECAY 2000001  1.3433455
    0.99968192   2    1000022    1
    0.0002404936   2    1000023    1

DECAY 1000003  0.34604544
    0.90835189   2    1000022    3
    0.053938941   2   -1000024    4
    0.035114054   2    1000023    3
    0.002595111   2    1000025    3

DECAY 2000003  1.3445973
    0.9987517   2    1000022    3
    0.00046814017   2    1000023    3
    0.00045739625   2   -1000024    4
    0.00030301748   2    1000025    3

DECAY 1000005  7.915446
    0.39188724   2   -1000024    6
    0.21099525   2    1000022    5
    0.19861224   2    1000023    5
    0.1981293   2    1000025    5
    0.00024653792   2   -1000037    6
    0.0001294324   2    1000035    5

DECAY 2000005  163.794
    0.46929436   2   -1000024    6
    0.20608709   2    1000021    5
    0.14667869   2   -1000037    6
    0.071632612   2    1000035    5
    0.023405451   2    1000023    5
    0.023063673   2    1000025    5
    0.021937971   2    1000005    36
    0.021921905   2    1000005    35
    0.010234228   2    1000006   -24
    0.0041245865   2    1000022    5
    0.0011005027   2    1000005    25
    0.00051892628   2    1000005    23

DECAY 1000002  0.36608266
    0.85157765   2    1000022    2
    0.10517333   2    1000024    1
    0.042461955   2    1000023    2
    0.00078706128   2    1000025    2

DECAY 2000002  50.875788
    0.78654187   2    1000021    2
    0.21330378   2    1000022    2
    0.00011703251   2    1000023    2

DECAY 1000004  0.36677185
    0.84997663   2    1000022    4
    0.10624138   2    1000024    3
    0.042684417   2    1000023    4
    0.001097572   2    1000025    4

DECAY 2000004  50.878698
    0.78649433   2    1000021    4
    0.21329151   2    1000022    4
    0.00013079555   2    1000023    4

DECAY 1000006  165.53069
    0.30186142   2    1000024    5
    0.22725321   2    1000025    6
    0.22127482   2    1000023    6
    0.11077459   2    1000021    6
    0.057360422   2    1000037    5
    0.043438095   2    1000022    6
    0.029172646   2    1000035    6
    0.0078910017   2    1000005    37
    0.00071511918   3    1000022    24    5
    0.00025809664   2    1000005    24

DECAY 2000006  189.0582
    0.2290591   2    1000021    6
    0.20877669   2    1000023    6
    0.20557637   2    1000025    6
    0.17676532   2    1000024    5
    0.074091347   2    1000037    5
    0.038093568   2    1000035    6
    0.029938869   2    1000005    37
    0.020942534   2    1000022    6
    0.012039956   2    1000006    23
    0.0040396723   2    1000006    25
    0.00067658003   2    1000005    24

DECAY 1000024  1.2164609
    0.93464634   2    1000022    24
    0.035696457   2   -1000015    16
    0.028413028   3    1000022   -5    6
    0.0012058701   2   -2000013    14

DECAY 1000037  18.205567
    0.25119668   2    1000024    25
    0.23630119   2    1000025    24
    0.23092795   2    1000024    23
    0.22875112   2    1000023    24
    0.008696473   2    1000004   -3
    0.0086962417   2    1000002   -1
    0.0084677965   2   -1000001    2
    0.0084671214   2   -1000003    4
    0.0064767429   3    1000024    6   -6
    0.0061797785   3    1000023   -5    6
    0.0053077357   3    1000025   -5    6
    0.00036083985   2    1000022    24

DECAY 1000022 -1


DECAY 1000023  1.1467836
    0.69568605   2    1000022    25
    0.24027395   2    1000022    23
    0.019124876   2    1000015   -15
    0.019124876   2   -1000015    15
    0.017434121   3    1000022    6   -6
    0.0023133923   2    2000013   -13
    0.0023133923   2   -2000013    13
    0.0016742034   2    2000011   -11
    0.0016742034   2   -2000011    11
    0.00034781709   3    1000022    5   -5

DECAY 1000025  1.6008902
    0.54771692   2    1000022    23
    0.40977391   2    1000022    25
    0.013973176   2    1000015   -15
    0.013973176   2   -1000015    15
    0.011782711   3    1000022    6   -6
    0.00084382468   2    2000013   -13
    0.00084382468   2   -2000013    13
    0.00038253893   2    2000011   -11
    0.00038253893   2   -2000011    11
    0.00028827722   3    1000022    5   -5

DECAY 1000035  21.80806
    0.20300797   2    1000023    25
    0.19500396   2    1000024   -24
    0.19500396   2   -1000024    24
    0.19019795   2    1000025    23
    0.16742651   2    1000025    25
    0.006363048   2    1000023    23
    0.0050920371   3    1000024    5   -6
    0.0050920371   3   -1000024   -5    6
    0.0036166996   2    1000002   -2
    0.0036166996   2   -1000002    2
    0.0036163768   2    1000004   -4
    0.0036163768   2   -1000004    4
    0.0035122174   2    1000003   -3
    0.0035122174   2   -1000003    3
    0.0035120798   2    1000001   -1
    0.0035120798   2   -1000001    1
    0.0021597084   3    1000023    6   -6
    0.001713493   3    1000025    6   -6
    0.00016338289   2    1000022    25
    0.00010248   2    1000022    23

DECAY 1000021  322.25937
    0.08130242   2    1000004   -4
    0.08130242   2   -1000004    4
    0.081302344   2    1000002   -2
    0.081302344   2   -1000002    2
    0.081208027   2    1000003   -3
    0.081208027   2   -1000003    3
    0.081207901   2    1000001   -1
    0.081207901   2   -1000001    1
    0.070287866   2    2000003   -3
    0.070287866   2   -2000003    3
    0.070287778   2    2000001   -1
    0.070287778   2   -2000001    1
    0.033643275   2    1000005   -5
    0.033643275   2   -1000005    5
    0.00013758467   3    1000037    1   -2
    0.00013758467   3   -1000037   -1    2
    0.00013758392   3    1000037    3   -4
    0.00013758392   3   -1000037   -3    4
    0.00013567582   3    1000025    6   -6
    0.00013535939   3    1000024    5   -6
    0.00013535939   3   -1000024   -5    6
    0.00013410848   3    1000023    6   -6

DECAY 25  0.0039468177
    0.57156446   2   -5    5
    0.23065461   2   -24    24
    0.071694852   2    21    21
    0.065910994   2   -15    15
    0.028062475   2    23    23
    0.027840409   2   -4    4
    0.0023219846   2    22    22
    0.0015063674   2    22    23
    0.00022857449   2   -13    13
    0.00021452795   2   -3    3
    5.9314835e-07   2   -1    1
    1.4346741e-07   2   -2    2
    5.1386051e-09   2   -11    11

DECAY 35  8.2078978
    0.81568617   2   -5    5
    0.16801376   2   -15    15
    0.014854299   2   -6    6
    0.00057608536   2   -13    13
    0.0002946607   2   -3    3
    0.00027404693   2    25    25
    0.00023099299   2    1000022    1000022
    2.9109669e-05   2    23    23
    2.2176877e-05   2   -24    24
    1.3334853e-05   2    21    21
    2.143353e-06   2   -1000011    1000011
    2.1373066e-06   2   -1000013    1000013
    8.1474625e-07   2   -1    1
    2.0717127e-07   2   -4    4
    3.2244953e-08   2    22    22
    1.9045821e-08   2    22    23
    1.294119e-08   2   -11    11
    1.0681125e-12   2   -2    2

DECAY 36  8.0184063
    0.81524609   2   -5    5
    0.16792161   2   -15    15
    0.015511315   2   -6    6
    0.00057576617   2   -13    13
    0.00033087412   2    1000022    1000022
    0.00029449921   2   -3    3
    7.9212995e-05   2    21    21
    3.9438061e-05   2    23    25
    8.1430016e-07   2   -1    1
    2.0479374e-07   2   -4    4
    1.2800549e-07   2    22    22
    3.4299337e-08   2    22    23
    1.2934021e-08   2   -11    11
    1.0559462e-12   2   -2    2
    6.9673941e-39   2    25    25

DECAY 37  7.3660279
    0.83103235   2   -5    6
    0.16677995   2   -15    16
    0.0012120227   2   -5    4
    0.00058962779   2   -13    14
    0.00028650865   2   -3    4
    4.3217586e-05   2    24    25
    3.2063039e-05   2   -3    6
    1.3299708e-05   2   -3    2
    8.6550988e-06   2   -5    2
    1.4516296e-06   2   -1    6
    7.9431503e-07   2   -1    2
    5.0315046e-08   2   -1    4
    1.3791456e-08   2   -11    12
    9.1239101e-12   2    24    36
    8.593188e-12   2    24    35

DECAY 6  2.43
    1   2    5    24

DECAY 15 -1
