BLOCK SPINFO
   1   SPheno
   2   v4.0.5be

BLOCK SPHENOINFO
   1   2
   2   2

BLOCK MODSEL
   1   0

BLOCK MINPAR
   3    18.447818
   4    1

BLOCK EXTPAR
   0    1346.0969
   1   -492.39092
   2   -1198.2739
   3    3000
   11    3400.1248
   12    1517.2094
   13    458.34901
   23    804.91827
   25    17.739062
   26    972.67293
   31    1517.5383
   32    1517.5383
   33    981.4351
   34    1802.2217
   35    1802.2217
   36    528.72737
   41    5000
   42    5000
   43    1984.2948
   44    5000
   45    5000
   46    1017.4375
   47    5000
   48    5000
   49    918.48123

BLOCK SMINPUTS
   1    127.90897
   2    1.1663787e-05
   3    0.1184
   4    91.1876
   5    4.18
   6    173.2
   7    1.777
   8    0
   11    0.00051099893
   12    0
   13    0.10565837
   14    0
   21    0.005
   22    0.0025
   23    0.095
   24    1.27

BLOCK GAUGE Q=  1346.0969
   1    0.35536298
   2    0.66519887
   3    1.219778

BLOCK YU Q=  1346.0969
   1   1    8.3976839e-06
   2   2    0.0042660234
   3   3    1.0145077

BLOCK YD Q=  1346.0969
   1   1    0.00029934391
   2   2    0.0056875343
   3   3    0.29685536

BLOCK YE Q=  1346.0969
   1   1    5.2237701e-05
   2   2    0.0108011
   3   3    0.18165673

BLOCK AU Q=  1346.0969
   1   1    0
   2   2    0
   3   3    3400.125

BLOCK AD Q=  1346.0969
   1   1    0
   2   2    0
   3   3    1517.209

BLOCK AE Q=  1346.0969
   1   1    0
   2   2    0
   3   3    458.34901

BLOCK MSOFT Q=  1346.0969
   1   -492.39092
   2   -1198.2739
   3    3000
   21    276088.74
   22   -629185.35
   31    1517.5383
   32    1517.5383
   33    981.4351
   34    1802.2217
   35    1802.2217
   36    528.72737
   41    5000
   42    5000
   43    1984.2948
   44    5000
   45    5000
   46    1017.4375
   47    5000
   48    5000
   49    918.48123

BLOCK MASS
   6    173.2
   23    91.1876
   24    80.429995
   15    1.777
   25    124.10056
   35    972.67098
   36    972.67293
   37    976.29921
   1000001    5021.986
   2000001    5013.144
   1000002    5021.5542
   2000002    5014.247
   1000003    5021.9876
   2000003    5013.1451
   1000004    5021.5554
   2000004    5014.2479
   1000005    866.65539
   2000005    1966.9523
   1000006    909.15088
   2000006    1993.043
   1000011    1525.638
   2000011    1805.1484
   1000012    1523.2401
   1000013    1525.6356
   2000013    1805.1455
   1000014    1523.2384
   1000015    534.59826
   2000015    994.10663
   1000016    990.1673
   1000021    3183.6274
   1000022   -490.14315
   1000023   -807.8274
   1000025    814.86375
   1000035   -1249.5328
   1000024    807.43154
   1000037    1249.672

BLOCK ALPHA
      -0.055380461

BLOCK HMIX Q=  1346.0969
   1    804.91827
   2    17.739062
   3    244.09444
   4    946092.64

BLOCK STOPMIX
   1   1   -0.16773825
   1   2    0.98583157
   2   1   -0.98583157
   2   2   -0.16773825

BLOCK SBOTMIX
   1   1    0.0080220392
   1   2    0.99996782
   2   1   -0.99996782
   2   2    0.0080220392

BLOCK STAUMIX
   1   1    0.034763578
   1   2    0.99939556
   2   1   -0.99939556
   2   2    0.034763578

BLOCK NMIX
   1   1   -0.99506311
   1   2    0.0047406849
   1   3   -0.086004106
   1   4   -0.049297239
   2   1    0.095643346
   2   2    0.12082619
   2   3   -0.70053743
   2   4   -0.69677879
   3   1    0.025767988
   3   2   -0.028784998
   3   3   -0.70540256
   3   4    0.70775325
   4   1    0.0061448632
   4   2   -0.99224492
   4   3   -0.065252014
   4   4   -0.10561456

BLOCK UMIX
   1   1   -0.092135254
   1   2    0.9957465
   2   1   -0.9957465
   2   2   -0.092135254

BLOCK VMIX
   1   1    0.14923908
   1   2    0.98880114
   2   1    0.98880114
   2   2   -0.14923908

BLOCK HIGGSBOUNDSINPUTHIGGSCOUPLINGSFERMIONS
       0, 314.67433,3,36,15,15

BLOCK HIGGSBOUNDSINPUTHIGGSCOUPLINGSBOSONS
       0,4,36,21,21,23

BLOCK SPHENOLOWENERGY
   1    0.00037278432
   2    1.5870319e-06
   3    3.5241485e-05
   4    2.7466722e-15
   5    1.173347e-10
   6    2.4563227e-08
   7    9.2124771e-14
   8    3.9355665e-09
   9    8.347562e-07
   10    9.4339184e-05
   11    0.97448765
   12    0.54384226
   13    19.42209
   14    0
   15    0
   16    0.0021669256
   17    2.2817584e-15
   18    2.4783794e-11
   19    8.2869568e-11
   20   -2.9817226e-15
   21   -1.2747799e-10
   22   -6.0858881e-08
   23    0
   24    0
   25    0
   26    0
   27    0
   28    0
   29    0
   30    0
   31    0
   39    6.2051829e-05
   40    0
   41    0
   42    0

BLOCK FWCOEF Q=  160
   305   4422   0   0   -0.18881911
   305   4422   0   2   -0.24333048
   305   4322   0   2   -0.0008255034
   305   6421   0   0   -0.095227835
   305   6421   0   2   -0.14613991
   305   6321   0   2   -0.00086682204
   3051111   4133   0   0    1.5879706
   3051111   4133   0   2    1.5893724
   3051111   4233   0   2    2.1510137e-06
   3051111   4137   0   0   -4.4106627
   3051111   4137   0   2   -4.4078885
   3051111   4237   0   2   -1.5110695e-05
   3051313   4133   0   0    1.5879706
   3051313   4133   0   2    1.5893717
   3051313   4233   0   2    2.1503343e-06
   3051313   4137   0   0   -4.4106627
   3051313   4137   0   2   -4.4078893
   3051313   4237   0   2   -1.5110125e-05
   3051212   4137   0   0    1.5053501
   3051212   4137   0   2    1.5047514
   3051212   4237   0   2    3.2903202e-06
   3051414   4137   0   0    1.5053501
   3051414   4137   0   2    1.5047514
   3051414   4237   0   2    3.2904626e-06
   3051616   4137   0   0    1.5053501
   3051616   4137   0   2    1.5047513
   3051616   4237   0   2    3.3303618e-06

BLOCK IMFWCOEF Q=  160
   305   4422   0   0    3.8576696e-07
   305   4422   0   2   -4.4429146e-06
   305   4322   0   2   -2.5792066e-06
   305   6421   0   0    3.3043492e-07
   305   6421   0   2   -6.2080044e-06
   305   6321   0   2   -1.1971299e-06
   3051111   4133   0   2    3.0528556e-07
   3051111   4233   0   2    8.0702449e-07
   3051111   4137   0   2   -1.7966389e-06
   3051111   4237   0   2   -6.2999624e-06
   3051313   4133   0   2    3.0527883e-07
   3051313   4233   0   2    8.0702404e-07
   3051313   4137   0   2   -1.7966438e-06
   3051313   4237   0   2   -6.2999639e-06
   3051212   4137   0   2    4.9719398e-07
   3051212   4237   0   2    1.3741431e-06
   3051414   4137   0   2    4.9719397e-07
   3051414   4237   0   2    1.3741431e-06
   3051616   4137   0   2    4.9408403e-07
   3051616   4237   0   2    1.3741389e-06

DECAY 23  2.4952


DECAY 24  2.085


DECAY 1000011  3.8151984
    0.39289449   2    1000022    11
    0.37791438   2   -1000037    12
    0.18656047   2    1000035    11
    0.026940844   2    1000023    11
    0.015486997   2   -1000024    12
    0.00020282368   2    1000025    11

DECAY 2000011  7.762422
    0.99265987   2    1000022    11
    0.0068362667   2    1000023    11
    0.0004918807   2    1000025    11

DECAY 1000013  3.8169853
    0.39271532   2    1000022    13
    0.37773201   2   -1000037    14
    0.18647105   2    1000035    13
    0.027163366   2    1000023    13
    0.015479685   2   -1000024    14
    0.00043856815   2    1000025    13

DECAY 2000013  7.7678475
    0.99196769   2    1000022    13
    0.0070008953   2    1000023    13
    0.00066171758   2    1000025    13
    0.00034219735   2   -1000024    14

DECAY 1000015  0.067523594
    1   2    1000022    15

DECAY 2000015  1.062334
    0.65704852   2    1000022    15
    0.12771942   2    1000015    23
    0.12747595   2    1000015    25
    0.047827381   2    1000023    15
    0.033415871   2    1000025    15
    0.0065128552   2   -1000024    16

DECAY 1000012  3.8395242
    0.40365479   2    1000022    12
    0.36498227   2    1000037    11
    0.18515212   2    1000035    12
    0.040213497   2    1000024    11
    0.0043863392   2    1000023    12
    0.0016109854   2    1000025    12

DECAY 1000014  3.8413167
    0.40346576   2    1000022    14
    0.36480863   2    1000037    13
    0.18506382   2    1000035    14
    0.040667269   2    1000024    13
    0.0043842798   2    1000023    14
    0.001610229   2    1000025    14

DECAY 1000016  1.0821496
    0.66028595   2    1000022    16
    0.24913311   2    1000015    24
    0.087631665   2    1000024    15
    0.0021897215   2    1000023    16
    0.00075954959   2    1000025    16

DECAY 2000001  143.6373
    0.98089168   2    1000021    1
    0.018926189   2    1000022    1
    0.0001691362   2    1000023    1

DECAY 1000001  200.90349
    0.70587703   2    1000021    1
    0.1919982   2   -1000037    2
    0.095538291   2    1000035    1
    0.0035728163   2    1000022    1
    0.0017726562   2   -1000024    2
    0.0011248072   2    1000023    1
    0.00011619866   2    1000025    1

DECAY 2000003  143.64351
    0.98085002   2    1000021    3
    0.018925536   2    1000022    3
    0.00017955836   2    1000023    3

DECAY 1000003  200.90846
    0.7058604   2    1000021    3
    0.19199373   2   -1000037    4
    0.09553603   2    1000035    3
    0.0035728451   2    1000022    3
    0.0017809871   2   -1000024    4
    0.0011322474   2    1000023    3
    0.00012376419   2    1000025    3

DECAY 1000005  0.25018958
    0.90743791   2    1000022    5
    0.052048548   2    1000023    5
    0.040513541   2    1000025    5

DECAY 2000005  112.84384
    0.62155998   2    1000006   -24
    0.23422647   2   -1000024    6
    0.058979779   2   -1000037    6
    0.027002972   2    1000035    5
    0.025225878   2    1000006   -37
    0.010898933   2    1000023    5
    0.010512588   2    1000025    5
    0.0034010907   2    1000005    36
    0.0033968688   2    1000005    35
    0.0024001494   2    1000022    5
    0.0016318051   2    1000005    25
    0.00076349018   2    1000005    23

DECAY 2000002  151.98855
    0.92775038   2    1000021    2
    0.071561384   2    1000022    2
    0.00063941695   2    1000023    2

DECAY 1000002  200.8984
    0.7056711   2    1000021    2
    0.18931338   2    1000037    1
    0.095109856   2    1000035    2
    0.0046506277   2    1000024    1
    0.0032099264   2    1000022    2
    0.0019840484   2    1000023    2

DECAY 2000004  151.99203
    0.9277294   2    1000021    4
    0.071559785   2    1000022    4
    0.00064489317   2    1000023    4

DECAY 1000004  200.90326
    0.70565436   2    1000021    4
    0.18930897   2    1000037    3
    0.095107631   2    1000035    4
    0.0046656173   2    1000024    3
    0.0032098697   2    1000022    4
    0.0019881866   2    1000023    4

DECAY 1000006  1.774009
    0.53744724   2    1000022    6
    0.46255051   2    1000024    5

DECAY 2000006  119.88665
    0.3373633   2    1000006    25
    0.30140661   2    1000006    23
    0.11167665   2    1000025    6
    0.1106514   2    1000023    6
    0.055368467   2    1000037    5
    0.0258067   2    1000035    6
    0.020747332   2    1000024    5
    0.013965669   2    1000006    36
    0.012369766   2    1000006    35
    0.0068907214   2    1000005    37
    0.0022681471   2    1000022    6
    0.0014852517   2    1000005    24

DECAY 1000024  0.56618384
    0.8479077   2    1000022    24
    0.14969153   2   -1000015    16
    0.0023985122   3    1000022   -5    6

DECAY 1000037  9.2027713
    0.22777513   2    1000023    24
    0.20363502   2    1000024    23
    0.20192118   2    1000025    24
    0.1994083   2    1000024    25
    0.081036437   2    1000016   -15
    0.079945845   2   -2000015    16
    0.0022727697   3    1000023   -5    6
    0.0015332123   3    1000025   -5    6
    0.0013750534   2    1000006   -5
    0.00051792945   2   -1000005    6
    0.0004095325   3    1000024    6   -6

DECAY 1000022 -1


DECAY 1000023  0.46127381
    0.72113802   2    1000022    25
    0.10297124   2    1000015   -15
    0.10297124   2   -1000015    15
    0.072869887   2    1000022    23

DECAY 1000025  1.0002299
    0.48179231   2    1000022    23
    0.4319767   2    1000022    25
    0.043097867   2    1000015   -15
    0.043097867   2   -1000015    15

DECAY 1000035  11.710311
    0.19126862   2    1000025    25
    0.17670511   2    1000024   -24
    0.17670511   2   -1000024    24
    0.16647467   2    1000025    23
    0.14800032   2    1000023    25
    0.032216067   2    1000016   -16
    0.032216067   2   -1000016    16
    0.030967622   2    2000015   -15
    0.030967622   2   -2000015    15
    0.0091956045   2    1000023    23
    0.0019555835   3    1000024    5   -6
    0.0019555835   3   -1000024   -5    6
    0.00032216979   2    1000006   -6
    0.00032216979   2   -1000006    6
    0.00020960663   2    1000005   -5
    0.00020960663   2   -1000005    5

DECAY 1000021  233.00914
    0.17713518   2    1000006   -6
    0.17713518   2   -1000006    6
    0.17334624   2    1000005   -5
    0.17334624   2   -1000005    5
    0.077305714   2    2000005   -5
    0.077305714   2   -2000005    5
    0.069920455   2    2000006   -6
    0.069920455   2   -2000006    6
    0.0021030831   3    1000025    6   -6
    0.0020721576   3    1000023    6   -6
    0.00012146487   3    1000024    5   -6
    0.00012146487   3   -1000024   -5    6

DECAY 25  0.003851269
    0.59464457   2   -5    5
    0.20919661   2   -24    24
    0.070088253   2    21    21
    0.068642273   2   -15    15
    0.028401048   2   -4    4
    0.024873378   2    23    23
    0.0023004606   2    22    22
    0.0013899123   2    22    23
    0.00023820684   2   -13    13
    0.00022451361   2   -3    3
    6.2075686e-07   2   -1    1
    1.4636026e-07   2   -2    2
    5.3551657e-09   2   -11    11

DECAY 35  3.7678875
    0.80841105   2   -5    5
    0.16983673   2   -15    15
    0.019598045   2   -6    6
    0.00092486758   2    25    25
    0.00060006422   2   -13    13
    0.00041226984   2   -3    3
    0.00010530414   2   -24    24
    7.6099628e-05   2    23    23
    3.3952084e-05   2    21    21
    1.1398715e-06   2   -1    1
    4.0135606e-07   2   -4    4
    5.20247e-08   2    22    22
    1.3843051e-08   2    22    23
    1.3481772e-08   2   -11    11
    2.0698824e-12   2   -2    2

DECAY 36  3.7104242
    0.80723095   2   -5    5
    0.16956945   2   -15    15
    0.021904927   2   -6    6
    0.00059908782   2   -13    13
    0.00041159151   2   -3    3
    0.00016840407   2    21    21
    0.00011335333   2    23    25
    1.1379957e-06   2   -1    1
    4.3389852e-07   2    22    22
    3.8796306e-07   2   -4    4
    2.5981481e-07   2    22    23
    1.3459834e-08   2   -11    11
    2.0018488e-12   2   -2    2
    1.3098632e-34   2    25    25

DECAY 37  3.5483291
    0.81028824   2   -5    6
    0.18725856   2   -15    16
    0.0012016564   2   -5    4
    0.00066202978   2   -13    14
    0.00038961229   2   -3    4
    0.0001206756   2    24    25
    4.9270231e-05   2   -3    6
    1.7970311e-05   2   -3    2
    8.5810883e-06   2   -5    2
    2.2351712e-06   2   -1    6
    1.080076e-06   2   -1    2
    7.1365197e-08   2   -1    4
    1.5484946e-08   2   -11    12
    2.4027797e-10   2    24    35
    2.3963346e-10   2    24    36

DECAY 6  2.43
    1   2    5    24

DECAY 15 -1
