BLOCK SPINFO
   1   SPheno
   2   v4.0.5be

BLOCK SPHENOINFO
   1   2
   2   2

BLOCK MODSEL
   1   0

BLOCK MINPAR
   3    33.888244
   4   -1

BLOCK EXTPAR
   0    1514.1649
   1   -75.548497
   2   -471.08608
   3    3000
   11   -2462.0037
   12   -59.301367
   13   -1030.0481
   23   -105.18557
   25    33.01952
   26    4134.588
   31    557.87743
   32    557.87743
   33    1109.8035
   34    1864.8524
   35    1864.8524
   36    1790.5854
   41    5000
   42    5000
   43    1511.109
   44    5000
   45    5000
   46    1562.3421
   47    5000
   48    5000
   49    887.7393

BLOCK SMINPUTS
   1    127.90897
   2    1.1663787e-05
   3    0.1184
   4    91.1876
   5    4.18
   6    173.2
   7    1.777
   8    0
   11    0.00051099893
   12    0
   13    0.10565837
   14    0
   21    0.005
   22    0.0025
   23    0.095
   24    1.27

BLOCK GAUGE Q=  1514.1649
   1    0.35536298
   2    0.66519887
   3    1.219778

BLOCK YU Q=  1514.1649
   1   1    8.3882163e-06
   2   2    0.0042612139
   3   3    1.0133639

BLOCK YD Q=  1514.1649
   1   1    0.00055657107
   2   2    0.01057485
   3   3    0.5519441

BLOCK YE Q=  1514.1649
   1   1    9.7125722e-05
   2   2    0.020082519
   3   3    0.33775493

BLOCK AU Q=  1514.1649
   1   1    0
   2   2    0
   3   3   -2462.0036

BLOCK AD Q=  1514.1649
   1   1    0
   2   2    0
   3   3   -59.301366

BLOCK AE Q=  1514.1649
   1   1    0
   2   2    0
   3   3   -1030.0481

BLOCK MSOFT Q=  1514.1649
   1   -75.548497
   2   -471.08608
   3    3000
   21    17023698
   22    50156.71
   31    557.87743
   32    557.87743
   33    1109.8035
   34    1864.8524
   35    1864.8524
   36    1790.5854
   41    5000
   42    5000
   43    1511.109
   44    5000
   45    5000
   46    1562.3421
   47    5000
   48    5000
   49    887.7393

BLOCK MASS
   6    173.2
   23    91.1876
   24    80.429995
   15    1.777
   25    122.64935
   35    4132.7309
   36    4134.588
   37    4133.9063
   1000001    5028.9261
   2000001    5017.9584
   1000002    5028.4702
   2000002    5021.2601
   1000003    5028.9299
   2000003    5017.965
   1000004    5028.474
   2000004    5021.2609
   1000005    881.16795
   2000005    1508.7695
   1000006    1404.3503
   2000006    1632.5666
   1000011    572.88535
   2000011    1862.5966
   1000012    566.88699
   1000013    572.91551
   2000013    1862.6106
   1000014    566.92029
   1000015    1121.7264
   2000015    1792.306
   1000016    1118.5622
   1000021    3189.3053
   1000022   -59.166321
   1000023    120.90419
   1000025   -124.27963
   1000035   -511.58933
   1000024    107.73039
   1000037    511.83323

BLOCK ALPHA
      -0.029544228

BLOCK HMIX Q=  1514.1649
   1   -105.18557
   2    33.01952
   3    243.99627
   4    17094818

BLOCK STOPMIX
   1   1    0.74537057
   1   2    0.66665037
   2   1   -0.66665037
   2   2    0.74537057

BLOCK SBOTMIX
   1   1   -0.0053118933
   1   2    0.99998589
   2   1   -0.99998589
   2   2   -0.0053118933

BLOCK STAUMIX
   1   1   -0.99999743
   1   2    0.0022663152
   2   1   -0.0022663152
   2   2   -0.99999743

BLOCK NMIX
   1   1    0.8095978
   1   2   -0.054139277
   1   3   -0.51127702
   1   4    0.28322457
   2   1   -0.15909302
   2   2    0.092166931
   2   3   -0.66345147
   2   4   -0.72527706
   3   1   -0.56475029
   3   2   -0.13368771
   3   3   -0.54482231
   3   4    0.60527131
   4   1   -0.017260754
   4   2    0.985242
   4   3   -0.039957626
   4   4    0.16554052

BLOCK UMIX
   1   1   -0.056539569
   1   2   -0.99840036
   2   1   -0.99840036
   2   2    0.056539569

BLOCK VMIX
   1   1    0.23465461
   1   2    0.97207881
   2   1    0.97207881
   2   2   -0.23465461

BLOCK HIGGSBOUNDSINPUTHIGGSCOUPLINGSFERMIONS
       0, 1090.2887,3,36,15,15

BLOCK HIGGSBOUNDSINPUTHIGGSCOUPLINGSBOSONS
       0,4,36,21,21,23

BLOCK SPHENOLOWENERGY
   1    0.00036334527
   2    1.5847097e-06
   3    3.5190529e-05
   4    1.9548877e-15
   5    8.3511052e-11
   6    1.7506018e-08
   7    6.6080253e-14
   8    2.8229621e-09
   9    5.9958935e-07
   10    9.6415836e-05
   11    0.99593867
   12    0.54302441
   13    19.400193
   14    0
   15    0
   16    0.0021619553
   17    2.2817058e-15
   18    2.4767336e-11
   19    8.2821834e-11
   20    1.899754e-14
   21    8.1242119e-10
   22    1.3526504e-07
   23    0
   24    0
   25    0
   26    0
   27    0
   28    0
   29    0
   30    0
   31    0
   39    8.6123027e-05
   40    0
   41    0
   42    0

BLOCK FWCOEF Q=  160
   305   4422   0   0   -0.18881911
   305   4422   0   2   -0.23915419
   305   4322   0   2   -0.0003274079
   305   6421   0   0   -0.095227835
   305   6421   0   2   -0.12048968
   305   6321   0   2   -0.00018278683
   3051111   4133   0   0    1.5924556
   3051111   4133   0   2    1.5934338
   3051111   4233   0   2    0.00017426128
   3051111   4137   0   0   -4.4151477
   3051111   4137   0   2   -4.407338
   3051111   4237   0   2   -0.0013536372
   3051313   4133   0   0    1.5924556
   3051313   4133   0   2    1.5934297
   3051313   4233   0   2    0.00017426081
   3051313   4137   0   0   -4.4151477
   3051313   4137   0   2   -4.4073421
   3051313   4237   0   2   -0.001353639
   3051212   4137   0   0    1.5053501
   3051212   4137   0   2    1.5036749
   3051212   4237   0   2    0.00029495977
   3051414   4137   0   0    1.5053501
   3051414   4137   0   2    1.5036749
   3051414   4237   0   2    0.00029495978
   3051616   4137   0   0    1.5053501
   3051616   4137   0   2    1.5036743
   3051616   4237   0   2    0.0002949649

BLOCK IMFWCOEF Q=  160
   305   4422   0   0    3.8580925e-07
   305   4422   0   2    1.8483205e-05
   305   4322   0   2   -4.5710995e-06
   305   6421   0   0    3.3047113e-07
   305   6421   0   2    1.3401153e-05
   305   6321   0   2   -1.5538997e-06
   3051111   4133   0   2   -2.2909816e-06
   3051111   4233   0   2    3.402687e-06
   3051111   4137   0   2    1.4926215e-05
   3051111   4237   0   2   -2.6436968e-05
   3051313   4133   0   2   -2.2911908e-06
   3051313   4233   0   2    3.4026798e-06
   3051313   4137   0   2    1.4926514e-05
   3051313   4237   0   2   -2.6437003e-05
   3051212   4137   0   2   -2.7467625e-06
   3051212   4237   0   2    5.7606884e-06
   3051414   4137   0   2   -2.7467611e-06
   3051414   4237   0   2    5.7606883e-06
   3051616   4137   0   2   -2.7580173e-06
   3051616   4237   0   2    5.7607284e-06

DECAY 23  2.4952


DECAY 24  2.085


DECAY 1000011  1.1057354
    0.39255854   2    1000025    11
    0.31954075   2    1000022    11
    0.18510744   2   -1000037    12
    0.089119035   2    1000035    11
    0.013566976   2   -1000024    12
    0.00010724743   2    1000023    11

DECAY 2000011  9.317579
    0.65702512   2    1000022    11
    0.31751007   2    1000025    11
    0.025208975   2    1000023    11
    0.00025580525   2    1000035    11

DECAY 1000013  1.1103154
    0.39208335   2    1000025    13
    0.31929797   2    1000022    13
    0.18450718   2   -1000037    14
    0.088829316   2    1000035    13
    0.013511829   2   -1000024    14
    0.0017703412   2    1000023    13

DECAY 2000013  9.347346
    0.65535493   2    1000022    13
    0.31697153   2    1000025    13
    0.025826642   2    1000023    13
    0.0015830665   2   -1000024    14
    0.0002571736   2    1000035    13

DECAY 1000015  13.265472
    0.46513365   2   -1000037    16
    0.22253435   2    1000035    15
    0.12434302   2    1000025    15
    0.10315732   2    1000022    15
    0.082399875   2    1000023    15
    0.0024317797   2   -1000024    16

DECAY 2000015  17.043621
    0.40747263   2    1000022    15
    0.23717828   2    1000025    15
    0.23606287   2   -1000024    16
    0.11751512   2    1000023    15
    0.00074901782   2   -1000037    16
    0.00050644628   2    1000035    15
    0.00026261124   2    1000016   -24
    0.00012900727   2    1000015    23
    0.00012401472   2    1000015    25

DECAY 1000012  1.2145973
    0.47596488   2    1000022    12
    0.21018729   2    1000024    11
    0.13258851   2    1000037    11
    0.069967026   2    1000035    12
    0.058742294   2    1000023    12
    0.052550007   2    1000025    12

DECAY 1000014  1.2191375
    0.47422143   2    1000022    14
    0.21287004   2    1000024    13
    0.13224044   2    1000037    13
    0.069782462   2    1000035    14
    0.058527625   2    1000023    14
    0.052358003   2    1000025    14

DECAY 1000016  13.32795
    0.43680733   2    1000037    15
    0.22847105   2    1000035    16
    0.22623181   2    1000024    15
    0.086993646   2    1000022    16
    0.011324326   2    1000023    16
    0.010171837   2    1000025    16

DECAY 2000001  143.5143
    0.98049082   2    1000021    1
    0.01279127   2    1000022    1
    0.0062183949   2    1000025    1
    0.00049359991   2    1000023    1

DECAY 1000001  207.60742
    0.68329015   2    1000021    1
    0.20817596   2   -1000037    2
    0.10199788   2    1000035    1
    0.0041917603   2    1000022    1
    0.0015463422   2    1000023    1
    0.00068103878   2   -1000024    2
    0.00011686016   2    1000025    1

DECAY 2000003  143.53723
    0.98033895   2    1000021    3
    0.012809513   2    1000022    3
    0.0062404017   2    1000025    3
    0.00052762085   2    1000023    3

DECAY 1000003  207.62083
    0.68324793   2    1000021    3
    0.20816316   2   -1000037    4
    0.10199146   2    1000035    3
    0.0042055367   2    1000022    3
    0.0015698689   2    1000023    3
    0.00068925387   2   -1000024    4
    0.00013278444   2    1000025    3

DECAY 1000005  10.420851
    0.45683014   2   -1000024    6
    0.21773745   2    1000023    5
    0.16464407   2    1000022    5
    0.16004764   2    1000025    5
    0.0004521611   2   -1000037    6
    0.00028853218   2    1000035    5

DECAY 2000005  55.330318
    0.50726824   2   -1000024    6
    0.21599618   2   -1000037    6
    0.092055871   2    1000035    5
    0.073695036   2    1000023    5
    0.048658757   2    1000025    5
    0.047408111   2    1000022    5
    0.014504289   2    1000006   -24
    0.0002487848   2    1000005    25
    0.00016472315   2    1000005    23

DECAY 2000002  152.26458
    0.92640105   2    1000021    2
    0.04825628   2    1000022    2
    0.023459377   2    1000025    2
    0.0018618056   2    1000023    2

DECAY 1000002  207.60349
    0.68307442   2    1000021    2
    0.19732917   2    1000037    1
    0.10072536   2    1000035    2
    0.011730035   2    1000024    1
    0.0058431987   2    1000025    2
    0.00086386494   2    1000022    2
    0.0004339529   2    1000023    2

DECAY 2000004  152.26822
    0.92637903   2    1000021    4
    0.048256084   2    1000022    4
    0.023463166   2    1000025    4
    0.0018680229   2    1000023    4

DECAY 1000004  207.61683
    0.68303215   2    1000021    4
    0.19731682   2    1000037    3
    0.10071917   2    1000035    4
    0.0117828   2    1000024    3
    0.005846032   2    1000025    4
    0.00086451127   2    1000022    4
    0.00043852349   2    1000023    4

DECAY 1000006  51.325037
    0.24794137   2    1000024    5
    0.24467235   2    1000023    6
    0.22776199   2    1000025    6
    0.16817503   2    1000037    5
    0.083432173   2    1000035    6
    0.02662576   2    1000022    6
    0.000917527   3    1000022    24    5
    0.00023395654   2    1000022    4
    0.00012353214   2    1000005    24
    0.00011630413   2    1000023    4

DECAY 2000006  73.102779
    0.36884992   2    1000024    5
    0.26311288   2    1000023    6
    0.15365189   2    1000025    6
    0.08250755   2    1000022    6
    0.067634772   2    1000006    23
    0.024537539   2    2000005    24
    0.02343797   2    1000037    5
    0.014788073   2    1000035    6
    0.0013020293   2    1000006    25
    0.00017738242   2    1000005    24

DECAY 1000024  0.00025324391
    0.33364504   3    1000022   -1    2
    0.33268771   3    1000022   -3    4
    0.11147056   3    1000022   -11    12
    0.11146937   3    1000022   -13    14
    0.11072732   3    1000022   -15    16

DECAY 1000037  4.2904927
    0.26287545   2    1000023    24
    0.25026116   2    1000024    23
    0.24057275   2    1000025    24
    0.22047091   2    1000024    25
    0.023808868   2    1000022    24
    0.00092828574   3    1000023   -5    6
    0.0007738699   3    1000025   -5    6

DECAY 1000022 -1


DECAY 1000023  0.00060830527
    0.20435375   3    1000022    12   -12
    0.1522482   3    1000022    1   -1
    0.15224485   3    1000022    3   -3
    0.14775834   3    1000022    5   -5
    0.11874453   3    1000022    2   -2
    0.11818651   3    1000022    4   -4
    0.034341756   3    1000022    11   -11
    0.034341692   3    1000022    13   -13
    0.034095359   3    1000022    15   -15
    0.0021726146   2    1000022    22
    0.00025828993   3    1000024    1   -2
    0.00025828993   3   -1000024   -1    2
    0.00024676558   3    1000024    3   -4
    0.00024676558   3   -1000024   -3    4

DECAY 1000025  3.8929876e-05
    0.1721114   3    1000022    12   -12
    0.1293443   3    1000022    5   -5
    0.12654554   3    1000022    1   -1
    0.12654347   3    1000022    3   -3
    0.098743805   3    1000022    2   -2
    0.098388382   3    1000022    4   -4
    0.028049615   3    1000022    15   -15
    0.026885954   3    1000024    1   -2
    0.026885954   3   -1000024   -1    2
    0.026871761   3    1000022    13   -13
    0.026868123   3    1000022    11   -11
    0.026127549   3    1000024    3   -4
    0.026127549   3   -1000024   -3    4
    0.0089581609   3    1000024    11   -12
    0.0089581609   3   -1000024   -11    12
    0.0089569614   3    1000024    13   -14
    0.0089569614   3   -1000024   -13    14
    0.0084848311   3    1000024    15   -16
    0.0084848311   3   -1000024   -15    16
    0.0076290998   2    1000022    22

DECAY 1000035  4.8160932
    0.24307339   2    1000024   -24
    0.24307339   2   -1000024    24
    0.17868969   2    1000023    23
    0.13654099   2    1000023    25
    0.12695201   2    1000025    25
    0.050725767   2    1000025    23
    0.011949405   2    1000022    25
    0.0064770525   2    1000022    23
    0.0011480885   3    1000024    5   -6
    0.0011480885   3   -1000024   -5    6

DECAY 1000021  264.02162
    0.15253166   2    1000005   -5
    0.15253166   2   -1000005    5
    0.11122656   2    2000006   -6
    0.11122656   2   -2000006    6
    0.10770929   2    2000005   -5
    0.10770929   2   -2000005    5
    0.10049389   2    1000006   -6
    0.10049389   2   -1000006    6
    0.027943025   2    1000006   -4
    0.027943025   2   -1000006    4

DECAY 25  0.0044678656
    0.48813588   2   -5    5
    0.19683971   2    1000022    1000022
    0.15402616   2   -24    24
    0.059657605   2    21    21
    0.056055689   2   -15    15
    0.024177547   2   -4    4
    0.017784022   2    23    23
    0.0018951309   2    22    22
    0.0010495436   2    22    23
    0.00019458514   2   -13    13
    0.00018348811   2   -3    3
    5.0732641e-07   2   -1    1
    1.245985e-07   2   -2    2
    4.3745152e-09   2   -11    11

DECAY 35  116.27014
    0.4437784   2   -5    5
    0.13255882   2   -1000024    1000037
    0.13255882   2   -1000037    1000024
    0.082725301   2   -15    15
    0.066373536   2    1000023    1000035
    0.036525633   2    1000025    1000035
    0.036113208   2    1000022    1000035
    0.018815395   2    1000022    1000022
    0.0173164   2   -1000024    1000024
    0.0078222331   2    1000022    1000023
    0.0068734267   2    1000023    1000025
    0.0044734256   2    1000023    1000023
    0.0031549749   2    1000022    1000025
    0.0025072964   2    1000025    1000025
    0.0017914062   2   -2000015    1000015
    0.0017914062   2   -1000015    2000015
    0.0012364045   2   -6    6
    0.00096804983   2   -2000006    2000006
    0.00095078072   2   -1000006    1000006
    0.00069460946   2   -1000037    1000037
    0.00036778888   2    1000035    1000035
    0.00029151027   2   -13    13
    0.00016532789   2   -3    3
    6.2966869e-05   2   -2000005    1000005
    6.2966869e-05   2   -1000005    2000005
    6.8721036e-06   2   -2000006    1000006
    6.8721036e-06   2   -1000006    2000006
    2.9694916e-06   2    21    21
    1.6343929e-06   2    25    25
    4.5708708e-07   2   -1    1
    1.9027156e-07   2   -1000005    1000005
    1.7594491e-07   2    23    23
    4.6909719e-08   2   -1000011    1000011
    4.6648135e-08   2   -1000013    1000013
    3.5790085e-08   2   -24    24
    2.8373679e-08   2   -1000015    1000015
    2.7469993e-08   2   -2000005    2000005
    2.7372792e-08   2   -2000015    2000015
    2.2837408e-08   2    22    23
    1.6073499e-08   2   -4    4
    1.3565975e-08   2   -2000011    2000011
    1.3472617e-08   2   -2000013    2000013
    6.7498404e-09   2    22    22
    6.546458e-09   2   -11    11
    6.2790287e-11   2   -2000013    1000013
    6.2790287e-11   2   -1000013    2000013
    8.2851038e-14   2   -2    2
    1.4686714e-15   2   -2000011    1000011
    1.4686714e-15   2   -1000011    2000011

DECAY 36  111.71455
    0.4274151   2   -5    5
    0.13748214   2   -1000024    1000037
    0.13748214   2   -1000037    1000024
    0.079677401   2   -15    15
    0.06029149   2    1000023    1000035
    0.044252899   2    1000025    1000035
    0.039827155   2    1000022    1000035
    0.020973521   2    1000022    1000022
    0.018586651   2   -1000024    1000024
    0.0070324338   2    1000023    1000025
    0.0065350009   2    1000022    1000023
    0.0041011948   2    1000023    1000023
    0.00391691   2    1000022    1000025
    0.0029907349   2    1000025    1000025
    0.001864477   2   -2000015    1000015
    0.001864477   2   -1000015    2000015
    0.0012642675   2   -1000037    1000037
    0.0011703107   2   -6    6
    0.0010173118   2   -2000006    1000006
    0.0010173118   2   -1000006    2000006
    0.00065848281   2    1000035    1000035
    0.0002807712   2   -13    13
    0.00015922877   2   -3    3
    6.5560882e-05   2   -2000005    1000005
    6.5560882e-05   2   -1000005    2000005
    6.5122969e-06   2    21    21
    4.4022117e-07   2   -1    1
    4.0086579e-07   2    23    25
    5.7692669e-08   2    22    23
    3.9509194e-08   2    22    22
    1.5103881e-08   2   -4    4
    6.3052674e-09   2   -11    11
    6.5071544e-11   2   -2000013    1000013
    6.5071544e-11   2   -1000013    2000013
    2.1724384e-13   2    23    35
    7.7855381e-14   2   -2    2
    1.5220302e-15   2   -2000011    1000011
    1.5220302e-15   2   -1000011    2000011
    6.3844624e-39   2    25    25

DECAY 37  115.55885
    0.44260043   2   -5    6
    0.13544619   2    1000024    1000035
    0.12312942   2    1000023    1000037
    0.083860232   2    1000025    1000037
    0.082158195   2   -15    16
    0.077137714   2    1000022    1000037
    0.024966575   2    1000024    1000025
    0.023636973   2    1000022    1000024
    0.0036080287   2   -2000015    1000016
    0.00067524771   2    1000023    1000024
    0.00066720926   2   -2000005    2000006
    0.0006549836   2   -5    4
    0.00056322193   2   -2000005    1000006
    0.00042463297   2   -1000005    2000006
    0.00029045846   2   -13    14
    0.00015249778   2   -3    4
    1.2642486e-05   2   -1000005    1000006
    7.1674064e-06   2   -3    2
    4.677258e-06   2   -5    2
    1.9214223e-06   2   -3    6
    4.2312663e-07   2   -1    2
    3.8746441e-07   2    24    25
    2.7406215e-07   2    1000035    1000037
    1.8534845e-07   2   -1000011    1000012
    1.8497929e-07   2   -1000013    1000014
    7.7700526e-08   2   -1    6
    2.0538598e-08   2   -1    4
    1.9511535e-08   2   -1000015    1000016
    6.7938535e-09   2   -11    12
    1.2694464e-10   2   -2000013    1000014
    2.6430302e-14   2    24    35
    2.9692724e-15   2   -2000011    1000012

DECAY 6  2.43
    1   2    5    24

DECAY 15 -1
