BLOCK SPINFO
   1   SPheno
   2   v4.0.5be

BLOCK SPHENOINFO
   1   2
   2   2

BLOCK MODSEL
   1   0

BLOCK MINPAR
   3    46.10841
   4    1

BLOCK EXTPAR
   0    1377.096
   1    76.247647
   2    425.36671
   3    3000
   11    3027.5493
   12   -664.61826
   13    1106.7187
   23    103.82872
   25    45.24914
   26    820.33864
   31    317.31427
   32    317.31427
   33    1679.4463
   34    1597.4406
   35    1597.4406
   36    1482.1751
   41    5000
   42    5000
   43    1747.0798
   44    5000
   45    5000
   46    1200.2677
   47    5000
   48    5000
   49    1859.7418

BLOCK SMINPUTS
   1    127.90897
   2    1.1663787e-05
   3    0.1184
   4    91.1876
   5    4.18
   6    173.2
   7    1.777
   8    0
   11    0.00051099893
   12    0
   13    0.10565837
   14    0
   21    0.005
   22    0.0025
   23    0.095
   24    1.27

BLOCK GAUGE Q=  1377.096
   1    0.35536298
   2    0.66519887
   3    1.219778

BLOCK YU Q=  1377.096
   1   1    8.3864194e-06
   2   2    0.004260301
   3   3    1.0131468

BLOCK YD Q=  1377.096
   1   1    0.00076254794
   2   2    0.014488411
   3   3    0.7562086

BLOCK YE Q=  1377.096
   1   1    0.00013307019
   2   2    0.027514695
   3   3    0.46275191

BLOCK AU Q=  1377.096
   1   1    0
   2   2    0
   3   3    3027.5493

BLOCK AD Q=  1377.096
   1   1    0
   2   2    0
   3   3   -664.61825

BLOCK AE Q=  1377.096
   1   1    0
   2   2    0
   3   3    1106.7187

BLOCK MSOFT Q=  1377.096
   1    76.247647
   2    425.36671
   3    3000
   21    701565.57
   22    43116.626
   31    317.31427
   32    317.31427
   33    1679.4463
   34    1597.4406
   35    1597.4406
   36    1482.1751
   41    5000
   42    5000
   43    1747.0798
   44    5000
   45    5000
   46    1200.2677
   47    5000
   48    5000
   49    1859.7418

BLOCK MASS
   6    173.2
   23    91.1876
   24    80.429995
   15    1.777
   25    124.93623
   35    819.92519
   36    820.33864
   37    825.85253
   1000001    5024.9454
   2000001    5014.2631
   1000002    5024.5033
   2000002    5015.9173
   1000003    5024.9508
   2000003    5014.2729
   1000004    5024.5087
   2000004    5015.9183
   1000005    1714.7957
   2000005    1867.6701
   1000006    1081.1173
   2000006    1754.1051
   1000011    330.4183
   2000011    1598.8643
   1000012    320.31218
   1000013    330.38908
   2000013    1598.8436
   1000014    320.28279
   1000015    1475.6709
   2000015    1679.6829
   1000016    1677.5342
   1000021    3181.9019
   1000022    59.297999
   1000023   -120.51204
   1000025    123.24921
   1000035    462.90999
   1000024    106.3917
   1000037    463.15987

BLOCK ALPHA
      -0.022529387

BLOCK HMIX Q=  1377.096
   1    103.82872
   2    45.24914
   3    244.05172
   4    672955.48

BLOCK STOPMIX
   1   1   -0.25132426
   1   2    0.96790295
   2   1   -0.96790295
   2   2   -0.25132426

BLOCK SBOTMIX
   1   1    0.99979207
   1   2    0.020391786
   2   1   -0.020391786
   2   2    0.99979207

BLOCK STAUMIX
   1   1    0.010182789
   1   2    0.99994815
   2   1   -0.99994815
   2   2    0.010182789

BLOCK NMIX
   1   1   -0.80003754
   1   2    0.060922778
   1   3   -0.52216511
   1   4    0.28908813
   2   1   -0.16175427
   2   2    0.10044872
   2   3    0.66126211
   2   4    0.72558806
   3   1   -0.57732901
   3   2   -0.14930539
   3   3    0.53658907
   3   4   -0.59705216
   4   1    0.021603268
   4   2   -0.98178733
   4   3   -0.046348588
   4   4    0.18297196

BLOCK UMIX
   1   1   -0.06559481
   1   2    0.99784634
   2   1    0.99784634
   2   2    0.06559481

BLOCK VMIX
   1   1   -0.25923343
   1   2    0.9658147
   2   1    0.9658147
   2   2    0.25923343

BLOCK HIGGSBOUNDSINPUTHIGGSCOUPLINGSFERMIONS
       0, 2047.4846,3,36,15,15

BLOCK HIGGSBOUNDSINPUTHIGGSCOUPLINGSBOSONS
       0,4,36,21,21,23

BLOCK SPHENOLOWENERGY
   1    0.00040693855
   2    1.5849816e-06
   3    3.5161247e-05
   4    1.3111239e-15
   5    5.5986331e-11
   6    1.0350071e-08
   7    4.3444677e-14
   8    1.8551145e-09
   9    3.4364176e-07
   10    7.9553127e-05
   11    0.82175335
   12    0.54338121
   13    19.34873
   14    0
   15    0
   16    0.0021643189
   17    2.2817489e-15
   18    2.4742475e-11
   19    8.2764229e-11
   20    4.0578577e-14
   21    1.7350252e-09
   22    1.1953763e-07
   23    0
   24    0
   25    0
   26    0
   27    0
   28    0
   29    0
   30    0
   31    0
   39    0.0001172288
   40    0
   41    0
   42    0

BLOCK FWCOEF Q=  160
   305   4422   0   0   -0.18881911
   305   4422   0   2   -0.27979186
   305   4322   0   2   -0.0011175536
   305   6421   0   0   -0.095227835
   305   6421   0   2   -0.16575592
   305   6321   0   2   -0.0010862017
   3051111   4133   0   0    1.5894104
   3051111   4133   0   2    1.5905402
   3051111   4233   0   2   -3.713628e-05
   3051111   4137   0   0   -4.4121025
   3051111   4137   0   2   -4.4013611
   3051111   4237   0   2    0.00029657899
   3051313   4133   0   0    1.5894104
   3051313   4133   0   2    1.590529
   3051313   4233   0   2   -3.7181541e-05
   3051313   4137   0   0   -4.4121025
   3051313   4137   0   2   -4.4013723
   3051313   4237   0   2    0.00029661634
   3051212   4137   0   0    1.5053501
   3051212   4137   0   2    1.5030352
   3051212   4237   0   2   -6.4683102e-05
   3051414   4137   0   0    1.5053501
   3051414   4137   0   2    1.5030352
   3051414   4237   0   2   -6.4673553e-05
   3051616   4137   0   0    1.5053501
   3051616   4137   0   2    1.5030336
   3051616   4237   0   2   -6.1979864e-05

BLOCK IMFWCOEF Q=  160
   305   4422   0   0    3.8579731e-07
   305   4422   0   2    2.8251962e-05
   305   4322   0   2   -4.7795884e-06
   305   6421   0   0    3.3046091e-07
   305   6421   0   2   -2.5147814e-06
   305   6321   0   2   -1.9806787e-06
   3051111   4133   0   2   -1.8515095e-06
   3051111   4233   0   2    5.3105018e-06
   3051111   4137   0   2    1.0339979e-05
   3051111   4237   0   2   -4.146449e-05
   3051313   4133   0   2   -1.8515039e-06
   3051313   4233   0   2    5.3104769e-06
   3051313   4137   0   2    1.034018e-05
   3051313   4237   0   2   -4.1464606e-05
   3051212   4137   0   2   -1.7436155e-06
   3051212   4237   0   2    9.0417689e-06
   3051414   4137   0   2   -1.743617e-06
   3051414   4237   0   2    9.0417689e-06
   3051616   4137   0   2   -1.7728294e-06
   3051616   4237   0   2    9.0418159e-06

DECAY 23  2.4952


DECAY 24  2.085


DECAY 1000011  0.41902676
    0.53889791   2    1000025    11
    0.4365925   2    1000022    11
    0.02399509   2   -1000024    12
    0.00051406527   2    1000023    11

DECAY 2000011  7.9848624
    0.64220527   2    1000022    11
    0.33137425   2    1000025    11
    0.026026275   2    1000023    11
    0.00039413523   2    1000035    11

DECAY 1000013  0.42293725
    0.53632737   2    1000025    13
    0.43552538   2    1000022    13
    0.023770156   2   -1000024    14
    0.0043766552   2    1000023    13

DECAY 2000013  8.0325111
    0.63920228   2    1000022    13
    0.33025743   2    1000025    13
    0.027167653   2    1000023    13
    0.0029586045   2   -1000024    14
    0.00039719957   2    1000035    13

DECAY 1000015  19.799757
    0.32683228   2    1000022    15
    0.31343483   2   -1000024    16
    0.21271543   2    1000025    15
    0.14586979   2    1000023    15
    0.0006707612   2   -1000037    16
    0.0004769153   2    1000035    15

DECAY 2000015  28.192513
    0.44619577   2   -1000037    16
    0.21145226   2    1000035    15
    0.12707705   2    1000025    15
    0.11054139   2    1000023    15
    0.10285102   2    1000022    15
    0.0017819139   2   -1000024    16

DECAY 1000012  0.52571351
    0.59641072   2    1000022    12
    0.28530135   2    1000024    11
    0.069007195   2    1000023    12
    0.049280733   2    1000025    12

DECAY 1000014  0.5294402
    0.59215057   2    1000022    14
    0.29041216   2    1000024    13
    0.068511023   2    1000023    14
    0.048926238   2    1000025    14

DECAY 1000016  28.241842
    0.41717775   2    1000037    15
    0.28476895   2    1000024    15
    0.22017765   2    1000035    16
    0.062187545   2    1000022    16
    0.0090349454   2    1000023    16
    0.0065479635   2    1000025    16
    0.00010519227   2    1000015    24

DECAY 2000001  144.01341
    0.98057259   2    1000021    1
    0.012438536   2    1000022    1
    0.0064713634   2    1000025    1
    0.00050819011   2    1000023    1

DECAY 1000001  208.2724
    0.68337418   2    1000021    1
    0.20789752   2   -1000037    2
    0.10142187   2    1000035    1
    0.0043917871   2    1000022    1
    0.0017722027   2    1000023    1
    0.00091302418   2   -1000024    2
    0.0002294074   2    1000025    1

DECAY 2000003  144.05615
    0.98028868   2    1000021    3
    0.012474381   2    1000022    3
    0.0065111454   2    1000025    3
    0.00057135346   2    1000023    3
    0.00014460521   2   -1000024    4

DECAY 1000003  208.29576
    0.68330026   2    1000021    3
    0.20787502   2   -1000037    4
    0.10141083   2    1000035    3
    0.0044186837   2    1000022    3
    0.001815887   2    1000023    3
    0.00092103878   2   -1000024    4
    0.00025827368   2    1000025    3

DECAY 1000005  119.22607
    0.38735127   2    1000006   -24
    0.26674416   2   -1000024    6
    0.12694577   2   -1000037    6
    0.071386987   2    1000023    5
    0.052990109   2    1000035    5
    0.048171745   2    1000022    5
    0.046409955   2    1000025    5

DECAY 2000005  42.93356
    0.4803986   2   -1000024    6
    0.21678164   2    1000023    5
    0.15036135   2    1000025    5
    0.14696764   2    1000022    5
    0.0030250555   2   -1000037    6
    0.0015240454   2    1000035    5
    0.00078384581   2    1000006   -24

DECAY 2000002  152.58228
    0.92663327   2    1000021    2
    0.046975085   2    1000022    2
    0.024439393   2    1000025    2
    0.0019185725   2    1000023    2

DECAY 1000002  208.26946
    0.68316271   2    1000021    2
    0.19474944   2    1000037    1
    0.099836964   2    1000035    2
    0.014259412   2    1000024    1
    0.0067411872   2    1000025    2
    0.00070586296   2    1000022    2
    0.00054442418   2    1000023    2

DECAY 2000004  152.58594
    0.92661132   2    1000021    4
    0.046974951   2    1000022    4
    0.024443044   2    1000025    4
    0.0019247657   2    1000023    4

DECAY 1000004  208.29275
    0.68308874   2    1000021    4
    0.19472831   2    1000037    3
    0.0998262   2    1000035    4
    0.014357765   2    1000024    3
    0.0067435368   2    1000025    4
    0.0007065127   2    1000022    4
    0.00054894291   2    1000023    4

DECAY 1000006  43.159954
    0.41688809   2    1000024    5
    0.23899009   2    1000023    6
    0.20165247   2    1000025    6
    0.057463112   2    1000037    5
    0.055693328   2    1000022    6
    0.029293148   2    1000035    6

DECAY 2000006  125.18552
    0.20099535   2    1000006    23
    0.19834933   2    1000006    25
    0.19471385   2    1000024    5
    0.15397145   2    1000023    6
    0.096164844   2    1000025    6
    0.075105146   2    1000037    5
    0.046814447   2    1000035    6
    0.033885577   2    1000022    6

DECAY 1000024  8.5330031e-05
    0.33396577   3    1000022   -1    2
    0.33287956   3    1000022   -3    4
    0.11120138   3    1000022   -13    14
    0.11120059   3    1000022   -11    12
    0.11075269   3    1000022   -15    16

DECAY 1000037  5.7475786
    0.17972331   2    1000023    24
    0.16179458   2    1000024    23
    0.15177573   2    1000025    24
    0.14019491   2    1000024    25
    0.090085293   2    1000014   -13
    0.090054739   2    1000012   -11
    0.08519328   2   -1000013    14
    0.085162061   2   -1000011    12
    0.015198764   2    1000022    24
    0.00038444814   3    1000023   -5    6
    0.00033304701   3    1000025   -5    6

DECAY 1000022 -1


DECAY 1000023  0.00060743942
    0.20415637   3    1000022    12   -12
    0.15091331   3    1000022    1   -1
    0.15091008   3    1000022    3   -3
    0.14559689   3    1000022    5   -5
    0.11770357   3    1000022    2   -2
    0.1171638   3    1000022    4   -4
    0.034065982   3    1000022    13   -13
    0.034060744   3    1000022    11   -11
    0.033855225   3    1000022    15   -15
    0.0052186255   2    1000022    22
    0.0010810254   3    1000024    1   -2
    0.0010810254   3   -1000024   -1    2
    0.0010392225   3    1000024    3   -4
    0.0010392225   3   -1000024   -3    4
    0.00036160843   3    1000024    11   -12
    0.00036160843   3   -1000024   -11    12
    0.00036150869   3    1000024    13   -14
    0.00036150869   3   -1000024   -13    14
    0.00033433878   3    1000024    15   -16
    0.00033433878   3   -1000024   -15    16

DECAY 1000025  3.1549136e-05
    0.19847127   3    1000022    12   -12
    0.14136414   3    1000022    1   -1
    0.1413615   3    1000022    3   -3
    0.13936815   3    1000022    5   -5
    0.11030663   3    1000022    2   -2
    0.10981908   3    1000022    4   -4
    0.031471586   3    1000022    15   -15
    0.026668281   3    1000022    13   -13
    0.026641447   3    1000022    11   -11
    0.01196401   3    1000024    1   -2
    0.01196401   3   -1000024   -1    2
    0.011635973   3    1000024    3   -4
    0.011635973   3   -1000024   -3    4
    0.0039786728   3    1000024    11   -12
    0.0039786728   3   -1000024   -11    12
    0.0039786275   3    1000024    13   -14
    0.0039786275   3   -1000024   -13    14
    0.0038242062   2    1000022    22
    0.0037730974   3    1000024    15   -16
    0.0037730974   3   -1000024   -15    16

DECAY 1000035  6.1862121
    0.1609628   2    1000024   -24
    0.1609628   2   -1000024    24
    0.12515548   2    1000023    23
    0.095385465   2    1000023    25
    0.085574787   2    1000025    25
    0.044155658   2    1000014   -14
    0.044155658   2   -1000014    14
    0.044140775   2    1000012   -12
    0.044140775   2   -1000012    12
    0.037313549   2    1000013   -13
    0.037313549   2   -1000013    13
    0.037299756   2    1000011   -11
    0.037299756   2   -1000011    11
    0.033090148   2    1000025    23
    0.0078326172   2    1000022    25
    0.0043800187   2    1000022    23
    0.00039240664   3    1000024    5   -6
    0.00039240664   3   -1000024   -5    6

DECAY 1000021  208.39544
    0.18719616   2    1000006   -6
    0.18719616   2   -1000006    6
    0.11375653   2    1000005   -5
    0.11375653   2   -1000005    5
    0.10081786   2    2000006   -6
    0.10081786   2   -2000006    6
    0.097103741   2    2000005   -5
    0.097103741   2   -2000005    5
    0.000999854   2    1000006   -4
    0.000999854   2   -1000006    4

DECAY 25  0.0053889772
    0.44240731   2   -5    5
    0.24851295   2    1000022    1000022
    0.16337419   2   -24    24
    0.051321014   2    21    21
    0.051116685   2   -15    15
    0.020399305   2   -4    4
    0.019752154   2    23    23
    0.0016972489   2    22    22
    0.0010737014   2    22    23
    0.00017827027   2   -13    13
    0.00016661342   2   -3    3
    4.6066805e-07   2   -1    1
    1.0512268e-07   2   -2    2
    4.0077152e-09   2   -11    11

DECAY 35  30.944821
    0.68723072   2   -5    5
    0.118119   2   -15    15
    0.048310908   2   -1000024    1000037
    0.048310908   2   -1000037    1000024
    0.028130514   2    1000023    1000035
    0.014548923   2   -1000024    1000024
    0.01453243   2    1000022    1000022
    0.012803412   2    1000022    1000035
    0.0099337882   2    1000025    1000035
    0.0051369781   2    1000022    1000023
    0.004839947   2    1000023    1000025
    0.0032240663   2    1000023    1000023
    0.0021357218   2    1000022    1000025
    0.0015022881   2    1000025    1000025
    0.00044484049   2   -13    13
    0.00042384478   2   -6    6
    0.0002804255   2   -3    3
    5.767235e-05   2    21    21
    2.3316334e-05   2    25    25
    3.9395813e-06   2   -24    24
    2.4074218e-06   2    23    23
    7.7531474e-07   2   -1    1
    3.2220043e-07   2   -1000011    1000011
    3.1893724e-07   2   -1000013    1000013
    2.4345877e-07   2    22    23
    7.1433149e-08   2    22    22
    9.9948454e-09   2   -11    11
    7.4727967e-09   2   -4    4
    3.8535079e-14   2   -2    2

DECAY 36  30.111599
    0.68307703   2   -5    5
    0.11740846   2   -15    15
    0.048804748   2   -1000024    1000037
    0.048804748   2   -1000037    1000024
    0.017842581   2    1000025    1000035
    0.016979147   2    1000022    1000035
    0.01696347   2    1000023    1000035
    0.016244754   2   -1000024    1000024
    0.016040069   2    1000022    1000022
    0.0045445294   2    1000023    1000025
    0.0042677715   2    1000022    1000023
    0.0032607548   2    1000023    1000023
    0.002609474   2    1000022    1000025
    0.0018580409   2    1000025    1000025
    0.00048930004   2   -6    6
    0.00044212998   2   -13    13
    0.00027871506   2   -3    3
    7.8590342e-05   2    21    21
    3.8445053e-06   2    23    25
    7.7058577e-07   2   -1    1
    6.5266746e-07   2    22    23
    4.0274461e-07   2    22    22
    9.9339423e-09   2   -11    11
    7.0355582e-09   2   -4    4
    3.6292181e-14   2   -2    2
    1.9709521e-40   2    25    25

DECAY 37  28.236126
    0.66406244   2   -5    6
    0.12435096   2   -15    16
    0.054717047   2    1000024    1000035
    0.048836391   2    1000023    1000037
    0.034018244   2    1000022    1000037
    0.032700346   2    1000025    1000037
    0.020822188   2    1000024    1000025
    0.017885495   2    1000022    1000024
    0.0010521506   2   -5    4
    0.00080903293   2    1000023    1000024
    0.00043962881   2   -13    14
    0.00027678888   2   -3    4
    1.2751187e-05   2   -3    2
    7.5134739e-06   2   -5    2
    4.2266862e-06   2    24    25
    1.3731829e-06   2   -1000011    1000012
    1.3681199e-06   2   -1000013    1000014
    1.1966623e-06   2   -3    6
    7.6807549e-07   2   -1    2
    3.7876604e-08   2   -1    6
    3.5657149e-08   2   -1    4
    1.0282964e-08   2   -11    12
    3.5022119e-10   2    24    35
    2.4405013e-10   2    24    36

DECAY 6  2.43
    1   2    5    24

DECAY 15 -1
