BLOCK SPINFO
   1   SPheno
   2   v4.0.5be

BLOCK SPHENOINFO
   1   2
   2   2

BLOCK MODSEL
   1   0

BLOCK MINPAR
   3    19.390522
   4   -1

BLOCK EXTPAR
   0    1511.2316
   1    370.16511
   2    359.99216
   3    3000
   11   -2916.6132
   12   -1278.2859
   13    1711.5319
   23   -1732.1753
   25    18.74856
   26    3460.0447
   31    1978.0491
   32    1978.0491
   33    800.43432
   34    1473.4139
   35    1473.4139
   36    1267.4465
   41    5000
   42    5000
   43    1461.6954
   44    5000
   45    5000
   46    1589.4765
   47    5000
   48    5000
   49    901.90282

BLOCK SMINPUTS
   1    127.90897
   2    1.1663787e-05
   3    0.1184
   4    91.1876
   5    4.18
   6    173.2
   7    1.777
   8    0
   11    0.00051099893
   12    0
   13    0.10565837
   14    0
   21    0.005
   22    0.0025
   23    0.095
   24    1.27

BLOCK GAUGE Q=  1511.2316
   1    0.35536298
   2    0.66519887
   3    1.219778

BLOCK YU Q=  1511.2316
   1   1    8.3962899e-06
   2   2    0.0042653153
   3   3    1.0143393

BLOCK YD Q=  1511.2316
   1   1    0.00031632651
   2   2    0.0060102037
   3   3    0.31369678

BLOCK YE Q=  1511.2316
   1   1    5.520129e-05
   2   2    0.011413876
   3   3    0.19196262

BLOCK AU Q=  1511.2316
   1   1    0
   2   2    0
   3   3   -2916.6132

BLOCK AD Q=  1511.2316
   1   1    0
   2   2    0
   3   3   -1278.2861

BLOCK AE Q=  1511.2316
   1   1    0
   2   2    0
   3   3    1711.5319

BLOCK MSOFT Q=  1511.2316
   1    370.16511
   2    359.99216
   3    3000
   21    8994012.8
   22   -2933001.6
   31    1978.0491
   32    1978.0491
   33    800.43432
   34    1473.4139
   35    1473.4139
   36    1267.4465
   41    5000
   42    5000
   43    1461.6954
   44    5000
   45    5000
   46    1589.4765
   47    5000
   48    5000
   49    901.90282

BLOCK MASS
   6    173.2
   23    91.1876
   24    80.429995
   15    1.777
   25    122.34784
   35    3462.4258
   36    3460.0447
   37    3460.2141
   1000001    5028.5182
   2000001    5017.7063
   1000002    5028.0668
   2000002    5019.9969
   1000003    5028.5215
   2000003    5017.706
   1000004    5028.0681
   2000004    5019.9977
   1000005    877.35653
   2000005    1469.0333
   1000006    1377.5995
   2000006    1657.8265
   1000011    1983.2802
   2000011    1472.9524
   1000012    1981.3087
   1000013    1983.2817
   2000013    1472.9537
   1000014    1981.3085
   1000015    805.43323
   2000015    1268.4347
   1000016    803.6957
   1000021    3188.3609
   1000022    371.12431
   1000023    387.82754
   1000025   -1730.7699
   1000035    1731.2102
   1000024    388.00919
   1000037    1732.4367

BLOCK ALPHA
      -0.051638877

BLOCK HMIX Q=  1511.2316
   1   -1732.1753
   2    18.74856
   3    244.01707
   4    11971909

BLOCK STOPMIX
   1   1    0.83625779
   1   2    0.54833649
   2   1   -0.54833649
   2   2    0.83625779

BLOCK SBOTMIX
   1   1   -0.065200266
   1   2    0.9978722
   2   1   -0.9978722
   2   2   -0.065200266

BLOCK STAUMIX
   1   1   -0.99800455
   1   2    0.063142015
   2   1   -0.063142015
   2   2   -0.99800455

BLOCK NMIX
   1   1   -0.99944391
   1   2    0.018129507
   1   3    0.027582543
   1   4    0.0047321336
   2   1    0.019446192
   2   2    0.99868112
   2   3    0.046811107
   2   4    0.0081597478
   3   1   -0.015642735
   3   2    0.02763278
   3   3   -0.70630061
   3   4    0.70719953
   4   1   -0.02211378
   4   2    0.039290789
   4   3   -0.7058239
   4   4   -0.70695109

BLOCK UMIX
   1   1   -0.99776182
   1   2   -0.066868219
   2   1    0.066868219
   2   2   -0.99776182

BLOCK VMIX
   1   1   -0.99993195
   1   2    0.011665953
   2   1    0.011665953
   2   2    0.99993195

BLOCK HIGGSBOUNDSINPUTHIGGSCOUPLINGSFERMIONS
       0, 351.50851,3,36,15,15

BLOCK HIGGSBOUNDSINPUTHIGGSCOUPLINGSBOSONS
       0,4,36,21,21,23

BLOCK SPHENOLOWENERGY
   1    0.00034152595
   2    1.5882048e-06
   3    3.5251764e-05
   4    2.5994289e-15
   5    1.1104479e-10
   6    2.3255555e-08
   7    8.7875959e-14
   8    3.7540628e-09
   9    7.9657815e-07
   10    9.6576424e-05
   11    0.99759749
   12    0.54277173
   13    19.392381
   14    0
   15    0
   16    0.0021615481
   17    2.2817014e-15
   18    2.4796704e-11
   19    8.2897031e-11
   20   -2.2478457e-15
   21   -9.6103412e-11
   22   -8.9704188e-08
   23    0
   24    0
   25    0
   26    0
   27    0
   28    0
   29    0
   30    0
   31    0
   39    5.1534035e-05
   40    0
   41    0
   42    0

BLOCK FWCOEF Q=  160
   305   4422   0   0   -0.18881911
   305   4422   0   2   -0.21286452
   305   4322   0   2   -0.00023734148
   305   6421   0   0   -0.095227835
   305   6421   0   2   -0.11253377
   305   6321   0   2   -0.00018406624
   3051111   4133   0   0    1.5921
   3051111   4133   0   2    1.5927037
   3051111   4233   0   2    4.7657436e-05
   3051111   4137   0   0   -4.4147921
   3051111   4137   0   2   -4.4129952
   3051111   4237   0   2   -0.00037001575
   3051313   4133   0   0    1.5921
   3051313   4133   0   2    1.5927032
   3051313   4233   0   2    4.7657398e-05
   3051313   4137   0   0   -4.4147921
   3051313   4137   0   2   -4.4129957
   3051313   4237   0   2   -0.00037001582
   3051212   4137   0   0    1.5053501
   3051212   4137   0   2    1.5049732
   3051212   4237   0   2    8.0630189e-05
   3051414   4137   0   0    1.5053501
   3051414   4137   0   2    1.5049732
   3051414   4237   0   2    8.0630191e-05
   3051616   4137   0   0    1.5053501
   3051616   4137   0   2    1.5049753
   3051616   4237   0   2    8.0629811e-05

BLOCK IMFWCOEF Q=  160
   305   4422   0   0    3.8575321e-07
   305   4422   0   2   -1.1923506e-05
   305   4322   0   2   -2.5331527e-06
   305   6421   0   0    3.3042314e-07
   305   6421   0   2    6.777119e-06
   305   6321   0   2   -1.0162215e-06
   3051111   4133   0   2   -1.03669e-07
   3051111   4233   0   2    9.7903357e-07
   3051111   4137   0   2    7.7258011e-06
   3051111   4237   0   2   -7.6052465e-06
   3051313   4133   0   2   -1.0367897e-07
   3051313   4233   0   2    9.7903308e-07
   3051313   4137   0   2    7.7258068e-06
   3051313   4237   0   2   -7.6052478e-06
   3051212   4137   0   2   -1.4187278e-06
   3051212   4237   0   2    1.6572822e-06
   3051414   4137   0   2   -1.4187275e-06
   3051414   4237   0   2    1.6572822e-06
   3051616   4137   0   2   -1.3818238e-06
   3051616   4237   0   2    1.6572648e-06

DECAY 23  2.4952


DECAY 24  2.085


DECAY 2000011  6.4863919
    0.99962627   2    1000022    11
    0.00037372642   2    1000023    11

DECAY 1000011  26.465104
    0.60743407   2   -1000024    12
    0.31066338   2    1000023    11
    0.08171584   2    1000022    11
    0.00016562954   2   -1000037    12

DECAY 2000013  6.4864244
    0.99962288   2    1000022    13
    0.00037484037   2    1000023    13

DECAY 1000013  26.466282
    0.60740755   2   -1000024    14
    0.31065022   2    1000023    13
    0.081712404   2    1000022    13
    0.00016562386   2   -1000037    14

DECAY 1000015  6.8777872
    0.60427498   2   -1000024    16
    0.30930451   2    1000023    15
    0.086420509   2    1000022    15

DECAY 2000015  7.5564624
    0.70191982   2    1000022    15
    0.14975033   2    1000016   -24
    0.072874262   2    1000015    23
    0.071628751   2    1000015    25
    0.0023230283   2   -1000024    16
    0.0015038048   2    1000023    15

DECAY 1000012  26.481344
    0.60900255   2    1000024    11
    0.29747584   2    1000023    12
    0.093444586   2    1000022    12

DECAY 1000014  26.481645
    0.60899636   2    1000024    13
    0.29747241   2    1000023    14
    0.093443509   2    1000022    14

DECAY 1000016  6.8633547
    0.60650322   2    1000024    15
    0.29626422   2    1000023    16
    0.097232559   2    1000022    16

DECAY 2000001  143.57154
    0.98070398   2    1000021    1
    0.019277514   2    1000022    1

DECAY 1000001  208.17753
    0.68175796   2    1000021    1
    0.20917323   2   -1000024    2
    0.10405523   2    1000023    1
    0.0040442522   2    1000022    1
    0.00073846635   2   -1000037    2
    0.00015439123   2    1000035    1

DECAY 2000003  143.5771
    0.98066582   2    1000021    3
    0.019276786   2    1000022    3

DECAY 1000003  208.18213
    0.68174453   2    1000021    3
    0.20916872   2   -1000024    4
    0.10405304   2    1000023    3
    0.0040441787   2    1000022    3
    0.0007452709   2   -1000037    4
    0.00016108625   2    1000035    3

DECAY 1000005  0.39738528
    0.8391396   2    1000022    5
    0.1027183   2   -1000024    6
    0.0581421   2    1000023    5

DECAY 2000005  18.971942
    0.5625036   2   -1000024    6
    0.2900382   2    1000023    5
    0.061657884   2    1000005    23
    0.059569387   2    1000005    25
    0.014926483   2    1000006   -24
    0.011304446   2    1000022    5

DECAY 2000002  152.12613
    0.92712265   2    1000021    2
    0.072807838   2    1000022    2

DECAY 1000002  208.16905
    0.68155994   2    1000021    2
    0.21007337   2    1000024    1
    0.1055031   2    1000023    2
    0.0026868365   2    1000022    2
    0.00010323688   2    1000035    2

DECAY 2000004  152.12897
    0.92710547   2    1000021    4
    0.072806479   2    1000022    4

DECAY 1000004  208.17335
    0.6815462   2    1000021    4
    0.21006916   2    1000024    3
    0.10550093   2    1000023    4
    0.0026867815   2    1000022    4
    0.00010663752   2    1000035    4

DECAY 1000006  13.098872
    0.56219699   2    1000024    5
    0.27121414   2    1000023    6
    0.081359729   2    1000005    24
    0.070245838   2    1000022    6
    0.01431179   2    1000023    4
    0.00036941175   2    1000022    4
    0.00030052744   3    1000022    24    5

DECAY 2000006  26.343202
    0.3096805   2    1000006    23
    0.25829206   2    2000005    24
    0.14099398   2    1000024    5
    0.085703959   2    1000022    6
    0.081289688   2    1000006    25
    0.068888021   2    1000023    6
    0.055151792   2    1000005    24

DECAY 1000024  2.6210034e-09
    0.33588655   3    1000022   -1    2
    0.32677411   3    1000022   -3    4
    0.1138098   3    1000022   -15    16
    0.11176558   3    1000022   -11    12
    0.1117639   3    1000022   -13    14

DECAY 1000037  21.476211
    0.16661704   2    1000024    25
    0.16555711   2    1000023    24
    0.1616675   2    1000024    23
    0.14625195   2   -1000005    6
    0.13893667   2   -2000005    6
    0.11939131   2    1000006   -5
    0.048998263   2    1000022    24
    0.018163284   2    1000016   -15
    0.013195012   2    2000006   -5
    0.0070585616   3    1000024    6   -6
    0.0064972013   2   -2000015    16
    0.0056553481   3    1000023   -5    6
    0.0014833936   3    1000022   -5    6
    0.0005143118   2   -1000015    16

DECAY 1000022 -1


DECAY 1000023  2.6156186e-11
    0.36657062   3    1000022    12   -12
    0.32748384   3    1000022    15   -15
    0.089154297   2    1000022    22
    0.058710662   3    1000022    5   -5
    0.043564493   3    1000022    1   -1
    0.043548482   3    1000022    3   -3
    0.03367268   3    1000022    2   -2
    0.03121204   3    1000022    4   -4
    0.0030424564   3    1000022    11   -11
    0.0030404234   3    1000022    13   -13

DECAY 1000025  27.712339
    0.17545405   2    1000006   -6
    0.17545405   2   -1000006    6
    0.12595868   2    1000024   -24
    0.12595868   2   -1000024    24
    0.10448552   2    1000023    25
    0.082574605   2    1000023    23
    0.049983912   2    1000005   -5
    0.049983912   2   -1000005    5
    0.032234395   2    1000022    25
    0.028912096   2    1000022    23
    0.0072836364   2    2000005   -5
    0.0072836364   2   -2000005    5
    0.0069306746   2    1000015   -15
    0.0069306746   2   -1000015    15
    0.0057330242   3    1000024    5   -6
    0.0057330242   3   -1000024   -5    6
    0.003009291   3    1000023    6   -6
    0.0024964404   2    2000015   -15
    0.0024964404   2   -2000015    15
    0.00084899342   3    1000022    6   -6
    0.00010953029   2    1000016   -16
    0.00010953029   2   -1000016    16

DECAY 1000035  24.796536
    0.18511855   2    1000006   -6
    0.18511855   2   -1000006    6
    0.1405225   2    1000024   -24
    0.1405225   2   -1000024    24
    0.094787716   2    1000023    25
    0.055596372   2    1000005   -5
    0.055596372   2   -1000005    5
    0.045552769   2    1000023    23
    0.02924127   2    1000022    25
    0.016131561   2    1000022    23
    0.0082274607   2    2000005   -5
    0.0082274607   2   -2000005    5
    0.0077248262   2    1000015   -15
    0.0077248262   2   -1000015    15
    0.0049684149   3    1000024    5   -6
    0.0049684149   3   -1000024   -5    6
    0.0029558752   3    1000023    6   -6
    0.0028181514   2    2000015   -15
    0.0028181514   2   -2000015    15
    0.00084468367   3    1000022    6   -6
    0.00024695332   2    1000016   -16
    0.00024695332   2   -1000016    16

DECAY 1000021  253.49559
    0.15908343   2    1000005   -5
    0.15908343   2   -1000005    5
    0.11545253   2    2000005   -5
    0.11545253   2   -2000005    5
    0.1122364   2    2000006   -6
    0.1122364   2   -2000006    6
    0.10791993   2    1000006   -6
    0.10791993   2   -1000006    6
    0.0044713659   2    1000006   -4
    0.0044713659   2   -1000006    4
    0.00036360129   3    1000037    5   -6
    0.00036360129   3   -1000037   -5    6
    0.00035989996   3    1000035    6   -6
    0.00034690944   3    1000025    6   -6

DECAY 25  0.0035537916
    0.61280075   2   -5    5
    0.18728701   2   -24    24
    0.073687813   2    21    21
    0.070310011   2   -15    15
    0.030326705   2   -4    4
    0.021492546   2    23    23
    0.0023418784   2    22    22
    0.0012781528   2    22    23
    0.00024385864   2   -13    13
    0.00023048089   2   -3    3
    6.3725761e-07   2   -1    1
    1.5628898e-07   2   -2    2
    5.4822484e-09   2   -11    11

DECAY 35  73.22317
    0.28319433   2   -5    5
    0.17506773   2   -1000006    1000006
    0.10229875   2   -1000024    1000037
    0.10229875   2   -1000037    1000024
    0.08283736   2   -2000006    2000006
    0.054065238   2    1000022    1000025
    0.049916184   2    1000022    1000035
    0.033708883   2   -15    15
    0.025357371   2   -2000006    1000006
    0.025357371   2   -1000006    2000006
    0.013982783   2    1000023    1000025
    0.012798684   2    1000023    1000035
    0.01151457   2   -2000005    1000005
    0.01151457   2   -1000005    2000005
    0.0061776265   2   -6    6
    0.0030469677   2   -2000015    1000015
    0.0030469677   2   -1000015    2000015
    0.0016779206   2   -1000024    1000024
    0.00087635393   2    1000022    1000022
    0.00045299867   2    1000022    1000023
    0.0002245582   2   -1000005    1000005
    0.00013030489   2   -2000005    2000005
    0.00011889144   2   -13    13
    7.8237123e-05   2   -3    3
    6.3233954e-05   2   -1000015    1000015
    5.853871e-05   2    1000023    1000023
    5.1746682e-05   2    25    25
    4.0930946e-05   2   -2000015    2000015
    3.8943586e-05   2    21    21
    1.2916921e-06   2    23    23
    3.2459064e-07   2   -24    24
    2.1632162e-07   2   -1    1
    1.8208052e-07   2    22    22
    1.4370219e-07   2    22    23
    9.5453026e-08   2   -1000011    1000011
    9.4864354e-08   2   -1000013    1000013
    4.4560794e-08   2   -4    4
    3.1124486e-09   2   -2000013    1000013
    3.1124486e-09   2   -1000013    2000013
    2.6701023e-09   2   -11    11
    1.148223e-12   2    23    36
    2.2965193e-13   2   -2    2
    7.2799414e-14   2   -2000011    1000011
    7.2799414e-14   2   -1000011    2000011

DECAY 36  73.92685
    0.2697251   2   -5    5
    0.16353602   2   -2000006    1000006
    0.16353602   2   -1000006    2000006
    0.10114156   2   -1000024    1000037
    0.10114156   2   -1000037    1000024
    0.053279303   2    1000022    1000035
    0.049523504   2    1000022    1000025
    0.032109979   2   -15    15
    0.013779529   2    1000023    1000035
    0.012697941   2    1000023    1000025
    0.011588145   2   -2000005    1000005
    0.011588145   2   -1000005    2000005
    0.0069419553   2   -6    6
    0.0030712812   2   -2000015    1000015
    0.0030712812   2   -1000015    2000015
    0.0016801968   2   -1000024    1000024
    0.00087745797   2    1000022    1000022
    0.00045387604   2    1000022    1000023
    0.00011325007   2   -13    13
    7.4529051e-05   2   -3    3
    5.8694131e-05   2    1000023    1000023
    8.0414643e-06   2    21    21
    2.3316689e-06   2    23    25
    2.0606901e-07   2   -1    1
    5.2202396e-08   2   -4    4
    2.1075041e-08   2    22    23
    2.6774966e-09   2   -2000013    1000013
    2.6774966e-09   2   -1000013    2000013
    2.5434206e-09   2   -11    11
    2.0827359e-09   2    22    22
    2.6905682e-13   2   -2    2
    6.2624312e-14   2   -2000011    1000011
    6.2624312e-14   2   -1000011    2000011
    7.5772196e-36   2    25    25

DECAY 37  62.323205
    0.30304547   2   -5    6
    0.1398214   2   -2000005    2000006
    0.12023499   2    1000024    1000025
    0.12011891   2    1000024    1000035
    0.11810965   2    1000022    1000037
    0.08054256   2   -2000005    1000006
    0.041747212   2   -15    16
    0.036860609   2    1000023    1000037
    0.01615207   2   -1000005    2000006
    0.014243139   2   -1000005    1000006
    0.0072480061   2   -2000015    1000016
    0.0011366533   2    1000023    1000024
    0.00044095588   2   -5    4
    0.00014759127   2   -13    14
    8.5231394e-05   2   -3    4
    4.6213649e-05   2   -1000015    1000016
    8.2958066e-06   2   -3    6
    3.9950526e-06   2   -3    2
    3.148879e-06   2   -5    2
    2.7674891e-06   2    24    25
    4.9548444e-07   2    1000022    1000024
    3.7468202e-07   2   -1    6
    2.3638182e-07   2   -1    2
    1.4475976e-08   2   -1    4
    6.9778189e-09   2   -1000013    1000014
    3.4521752e-09   2   -11    12
    1.6319005e-13   2   -1000011    1000012

DECAY 6  2.43
    1   2    5    24

DECAY 15 -1
