BLOCK SPINFO
   1   SPheno
   2   v4.0.5be

BLOCK SPHENOINFO
   1   2
   2   2

BLOCK MODSEL
   1   0

BLOCK MINPAR
   3    16.635165
   4    1

BLOCK EXTPAR
   0    1502.3073
   1   -61.292779
   2    226.70871
   3    3000
   11   -4265.122
   12    767.91526
   13    219.30454
   23    1093.2813
   25    16.03222
   26    3115.1859
   31    1929.8237
   32    1929.8237
   33    1565.4085
   34    703.34523
   35    703.34523
   36    1940.0541
   41    5000
   42    5000
   43    1526.0929
   44    5000
   45    5000
   46    1635.2518
   47    5000
   48    5000
   49    1393.716

BLOCK SMINPUTS
   1    127.90897
   2    1.1663787e-05
   3    0.1184
   4    91.1876
   5    4.18
   6    173.2
   7    1.777
   8    0
   11    0.00051099893
   12    0
   13    0.10565837
   14    0
   21    0.005
   22    0.0025
   23    0.095
   24    1.27

BLOCK GAUGE Q=  1502.3073
   1    0.35536298
   2    0.66519887
   3    1.219778

BLOCK YU Q=  1502.3073
   1   1    8.4006663e-06
   2   2    0.0042675385
   3   3    1.014868

BLOCK YD Q=  1502.3073
   1   1    0.0002706373
   2   2    0.0051421087
   3   3    0.26838739

BLOCK YE Q=  1502.3073
   1   1    4.7228187e-05
   2   2    0.0097652913
   3   3    0.16423614

BLOCK AU Q=  1502.3073
   1   1    0
   2   2    0
   3   3   -4265.1217

BLOCK AD Q=  1502.3073
   1   1    0
   2   2    0
   3   3    767.91533

BLOCK AE Q=  1502.3073
   1   1    0
   2   2    0
   3   3    219.30455

BLOCK MSOFT Q=  1502.3073
   1   -61.292779
   2    226.70871
   3    3000
   21    8467432.7
   22   -1120216.6
   31    1929.8237
   32    1929.8237
   33    1565.4085
   34    703.34523
   35    703.34523
   36    1940.0541
   41    5000
   42    5000
   43    1526.0929
   44    5000
   45    5000
   46    1635.2518
   47    5000
   48    5000
   49    1393.716

BLOCK MASS
   6    173.2
   23    91.1876
   24    80.429995
   15    1.777
   25    122.47373
   35    3114.5923
   36    3115.1859
   37    3115.6287
   1000001    5031.3317
   2000001    5020.4658
   1000002    5030.8979
   2000002    5022.074
   1000003    5031.3331
   2000003    5020.4663
   1000004    5030.8988
   2000004    5022.0748
   1000005    1412.9867
   2000005    1499.6116
   1000006    1321.6053
   2000006    1707.7166
   1000011    1934.0641
   2000011    704.54232
   1000012    1932.0979
   1000013    1934.0637
   2000013    704.54472
   1000014    1932.0972
   1000015    1568.7537
   2000015    1941.5441
   1000016    1566.6421
   1000021    3191.2839
   1000022   -61.652213
   1000023    243.50058
   1000025   -1104.819
   1000035    1106.1048
   1000024    243.70197
   1000037    1108.2789

BLOCK ALPHA
      -0.060214971

BLOCK HMIX Q=  1502.3073
   1    1093.2813
   2    16.03222
   3    243.97477
   4    9704383.1

BLOCK STOPMIX
   1   1    0.76117348
   1   2    0.64854833
   2   1   -0.64854833
   2   2    0.76117348

BLOCK SBOTMIX
   1   1    0.13538834
   1   2    0.99079261
   2   1   -0.99079261
   2   2    0.13538834

BLOCK STAUMIX
   1   1    0.99972289
   1   2    0.023540165
   2   1   -0.023540165
   2   2    0.99972289

BLOCK NMIX
   1   1    0.99918415
   1   2   -0.0009657052
   1   3    0.040371489
   1   4   -0.00049447015
   2   1   -0.0040669875
   2   2   -0.9968272
   2   3    0.076549898
   2   4   -0.021426735
   3   1    0.028101945
   3   2   -0.039056183
   3   3   -0.70511523
   3   4   -0.70745842
   4   1   -0.028718888
   4   2    0.069348498
   4   3    0.70379171
   4   4   -0.70642993

BLOCK UMIX
   1   1   -0.99413344
   1   2    0.10816054
   2   1    0.10816054
   2   2    0.99413344

BLOCK VMIX
   1   1   -0.99953754
   1   2    0.030409055
   2   1    0.030409055
   2   2    0.99953754

BLOCK HIGGSBOUNDSINPUTHIGGSCOUPLINGSFERMIONS
       0, 257.03208,3,36,15,15

BLOCK HIGGSBOUNDSINPUTHIGGSCOUPLINGSBOSONS
       0,4,36,21,21,23

BLOCK SPHENOLOWENERGY
   1    0.0003022241
   2    1.5939571e-06
   3    3.5266792e-05
   4    2.3532005e-15
   5    1.00526e-10
   6    2.1040989e-08
   7    7.9176026e-14
   8    3.3823955e-09
   9    7.1733057e-07
   10    9.6678458e-05
   11    0.99865146
   12    0.54231412
   13    19.376621
   14    0
   15    0
   16    0.002158417
   17    2.2816695e-15
   18    2.4814508e-11
   19    8.2934947e-11
   20    1.5758985e-15
   21    6.737352e-11
   22    2.770575e-08
   23    0
   24    0
   25    0
   26    0
   27    0
   28    0
   29    0
   30    0
   31    0
   39    5.7493317e-05
   40    0
   41    0
   42    0

BLOCK FWCOEF Q=  160
   305   4422   0   0   -0.18881911
   305   4422   0   2   -0.16621727
   305   4322   0   2    7.3796418e-05
   305   6421   0   0   -0.095227835
   305   6421   0   2   -0.086998763
   305   6321   0   2   -7.0681616e-05
   3051111   4133   0   0    1.5918519
   3051111   4133   0   2    1.5928872
   3051111   4233   0   2    4.689161e-05
   3051111   4137   0   0   -4.414544
   3051111   4137   0   2   -4.4141828
   3051111   4237   0   2   -0.00036469644
   3051313   4133   0   0    1.5918519
   3051313   4133   0   2    1.5928868
   3051313   4233   0   2    4.6891572e-05
   3051313   4137   0   0   -4.414544
   3051313   4137   0   2   -4.4141832
   3051313   4237   0   2   -0.0003646965
   3051212   4137   0   0    1.5053501
   3051212   4137   0   2    1.5052943
   3051212   4237   0   2    7.946801e-05
   3051414   4137   0   0    1.5053501
   3051414   4137   0   2    1.5052943
   3051414   4237   0   2    7.9468011e-05
   3051616   4137   0   0    1.5053501
   3051616   4137   0   2    1.5052952
   3051616   4237   0   2    7.9468126e-05

BLOCK IMFWCOEF Q=  160
   305   4422   0   0    3.8587283e-07
   305   4422   0   2    1.2783209e-05
   305   4322   0   2    3.3737975e-06
   305   6421   0   0    3.305256e-07
   305   6421   0   2   -5.0090129e-06
   305   6321   0   2    1.4314039e-06
   3051111   4133   0   2   -1.0883449e-06
   3051111   4233   0   2    9.4910916e-07
   3051111   4137   0   2    2.3759277e-05
   3051111   4237   0   2   -7.3838889e-06
   3051313   4133   0   2   -1.0883534e-06
   3051313   4233   0   2    9.4910862e-07
   3051313   4137   0   2    2.3759285e-05
   3051313   4237   0   2   -7.3838901e-06
   3051212   4137   0   2   -4.7722138e-06
   3051212   4237   0   2    1.6089996e-06
   3051414   4137   0   2   -4.7722134e-06
   3051414   4237   0   2    1.6089996e-06
   3051616   4137   0   2   -4.7552861e-06
   3051616   4237   0   2    1.6089932e-06

DECAY 23  2.4952


DECAY 24  2.085


DECAY 2000011  3.4804192
    0.99998696   2    1000022    11

DECAY 1000011  27.040195
    0.60267346   2   -1000024    12
    0.30431034   2    1000023    11
    0.08919504   2    1000022    11
    0.0033227597   2   -1000037    12
    0.0004157989   2    1000035    11

DECAY 2000013  3.4804515
    0.99998173   2    1000022    13

DECAY 1000013  27.042371
    0.60262484   2   -1000024    14
    0.30428655   2    1000023    13
    0.089188067   2    1000022    13
    0.0033224905   2   -1000037    14
    0.00044621837   2    1000035    13
    0.0001132176   2    1000025    13

DECAY 1000015  21.791752
    0.59686354   2   -1000024    16
    0.301591   2    1000023    15
    0.090002943   2    1000022    15
    0.0049995049   2    1000035    15
    0.0048773269   2    1000025    15
    0.0016656892   2   -1000037    16

DECAY 2000015  10.892752
    0.8918395   2    1000022    15
    0.043834773   2   -1000037    16
    0.022311906   2    1000035    15
    0.022301658   2    1000025    15
    0.010017754   2    1000016   -24
    0.0048281608   2    1000015    25
    0.0048231368   2    1000015    23

DECAY 1000012  27.077387
    0.60774826   2    1000024    11
    0.30092844   2    1000023    12
    0.089627874   2    1000022    12
    0.0010180451   2    1000035    12
    0.00041588434   2    1000025    12
    0.00026149634   2    1000037    11

DECAY 1000014  27.079049
    0.60771223   2    1000024    13
    0.30090986   2    1000023    14
    0.089622341   2    1000022    14
    0.0010179816   2    1000035    14
    0.00041585839   2    1000025    14
    0.0003217285   2    1000037    13

DECAY 1000016  21.819229
    0.60170766   2    1000024    15
    0.29773995   2    1000023    16
    0.090092733   2    1000022    16
    0.0096560784   2    1000037    15
    0.00057012667   2    1000035    16
    0.00023345181   2    1000025    16

DECAY 2000001  143.54036
    0.98048193   2    1000021    1
    0.019489112   2    1000022    1

DECAY 1000001  208.63571
    0.67998781   2    1000021    1
    0.20882217   2   -1000024    2
    0.10482602   2    1000023    1
    0.0033959279   2    1000022    1
    0.0022483469   2   -1000037    2
    0.00053303804   2    1000035    1
    0.00018668328   2    1000025    1

DECAY 2000003  143.54518
    0.98044934   2    1000021    3
    0.019488489   2    1000022    3

DECAY 1000003  208.63992
    0.6799748   2    1000021    3
    0.20881799   2   -1000024    4
    0.10482401   2    1000023    3
    0.003395881   2    1000022    3
    0.002256239   2   -1000037    4
    0.00053870461   2    1000035    3
    0.00019237849   2    1000025    3

DECAY 1000005  1.7886707
    0.44587494   2    1000022    5
    0.20008136   2   -1000024    6
    0.10393859   2    1000023    5
    0.086756403   2   -1000037    6
    0.081775143   2    1000025    5
    0.079186597   2    1000035    5
    0.0023869737   2    1000006   -24

DECAY 2000005  34.559085
    0.33686624   2   -1000024    6
    0.29821394   2    1000006   -24
    0.1745712   2    1000023    5
    0.17063454   2   -1000037    6
    0.0070190924   2    1000035    5
    0.0068008234   2    1000025    5
    0.0058941642   2    1000022    5

DECAY 2000002  152.11614
    0.9263059   2    1000021    2
    0.073585109   2    1000022    2

DECAY 1000002  208.63198
    0.67978351   2    1000021    2
    0.21108406   2    1000024    1
    0.10512383   2    1000023    2
    0.0033227689   2    1000022    2
    0.00039661363   2    1000035    2
    0.00017773425   2    1000037    1
    0.00011148565   2    1000025    2

DECAY 2000004  152.11945
    0.92628585   2    1000021    4
    0.073583508   2    1000022    4

DECAY 1000004  208.63606
    0.67977036   2    1000021    4
    0.21108011   2    1000024    3
    0.10512178   2    1000023    4
    0.0033227039   2    1000022    4
    0.00040056471   2    1000035    4
    0.00018905002   2    1000037    3
    0.00011543907   2    1000025    4

DECAY 1000006  12.759541
    0.53310885   2    1000024    5
    0.25473137   2    1000023    6
    0.1022761   2    1000022    6
    0.081508239   2    1000037    5
    0.013285397   2    1000025    6
    0.011932867   2    1000035    6
    0.0028718433   2    1000023    4
    0.00018892546   3    1000022    24    5

DECAY 2000006  70.760744
    0.34494133   2    1000006    23
    0.18580378   2    2000005    24
    0.10424896   2    1000037    5
    0.10111573   2    1000035    6
    0.093078883   2    1000025    6
    0.076754356   2    1000024    5
    0.037326998   2    1000023    6
    0.031666796   2    1000022    6
    0.01476032   2    1000006    25
    0.010302838   2    1000005    24

DECAY 1000024  0.00012355243
    0.99946466   2    1000022    24
    0.00028727154   3    1000022   -15    16
    0.00012289166   3    1000022   -13    14
    0.00012285735   3    1000022   -11    12

DECAY 1000037  8.2832467
    0.3020929   2    1000023    24
    0.2992204   2    1000024    23
    0.29602265   2    1000024    25
    0.088569388   2    1000022    24
    0.0061269755   3    1000024    6   -6
    0.0058421296   3    1000023   -5    6
    0.0019699933   3    1000022   -5    6
    0.00010372264   3    1000024    5   -5

DECAY 1000022 -1


DECAY 1000023  0.00016962431
    0.74510482   2    1000022    25
    0.25444327   2    1000022    23
    0.00019307414   3    1000022    12   -12
    0.00010448939   3    1000022    15   -15

DECAY 1000025  9.241102
    0.27215915   2    1000024   -24
    0.27215915   2   -1000024    24
    0.20634775   2    1000023    23
    0.15954296   2    1000023    25
    0.040928865   2    1000022    23
    0.03600858   2    1000022    25
    0.0049009333   3    1000024    5   -6
    0.0049009333   3   -1000024   -5    6
    0.0018033061   3    1000023    6   -6
    0.00080689297   3    1000022    6   -6
    0.00010332966   2    2000013   -13
    0.00010332966   2   -2000013    13

DECAY 1000035  8.3420228
    0.29902539   2    1000024   -24
    0.29902539   2   -1000024    24
    0.2220907   2    1000023    25
    0.072044459   2    1000023    23
    0.050540229   2    1000022    25
    0.043153757   2    1000022    23
    0.0053704139   3    1000024    5   -6
    0.0053704139   3   -1000024   -5    6
    0.0021078707   3    1000023    6   -6
    0.00080213574   3    1000022    6   -6
    0.00011900559   2    2000013   -13
    0.00011900559   2   -2000013    13

DECAY 1000021  230.42294
    0.13237007   2    1000005   -5
    0.13237007   2   -1000005    5
    0.12455887   2    2000005   -5
    0.12455887   2   -2000005    5
    0.12237794   2    1000006   -6
    0.12237794   2   -1000006    6
    0.11960119   2    2000006   -6
    0.11960119   2   -2000006    6
    0.00095433753   2    1000006   -4
    0.00095433753   2   -1000006    4

DECAY 25  0.003559764
    0.6111103   2   -5    5
    0.18960186   2   -24    24
    0.072977434   2    21    21
    0.070161689   2   -15    15
    0.030197707   2   -4    4
    0.021813801   2    23    23
    0.0023653865   2    22    22
    0.0012978769   2    22    23
    0.00024334788   2   -13    13
    0.00022980792   2   -3    3
    6.3539541e-07   2   -1    1
    1.5562346e-07   2   -2    2
    5.4707643e-09   2   -11    11

DECAY 35  45.956783
    0.20866472   2   -1000024    1000037
    0.20866472   2   -1000037    1000024
    0.17890157   2   -5    5
    0.12118685   2    1000023    1000025
    0.083481733   2    1000023    1000035
    0.076310316   2   -1000006    1000006
    0.038339106   2   -15    15
    0.033127698   2    1000022    1000025
    0.026486772   2    1000022    1000035
    0.0089163552   2   -6    6
    0.0061658308   2   -1000024    1000024
    0.0030573246   2    1000023    1000023
    0.0019262178   2    1000025    1000035
    0.0017453543   2    1000022    1000023
    0.00060445472   2    1000035    1000035
    0.00056104534   2   -2000006    1000006
    0.00056104534   2   -1000006    2000006
    0.00033647101   2    1000025    1000025
    0.00024466178   2    1000022    1000022
    0.00022892656   2    25    25
    0.00015496118   2   -1000005    1000005
    0.00013207034   2   -13    13
    9.4206077e-05   2   -1000037    1000037
    7.3953458e-05   2   -3    3
    2.6880902e-05   2    21    21
    3.8613847e-06   2    23    23
    1.1101535e-06   2   -24    24
    3.9014645e-07   2   -1000011    1000011
    3.892536e-07   2   -1000013    1000013
    3.3144993e-07   2    22    22
    2.5854741e-07   2    22    23
    2.0444997e-07   2   -1    1
    1.6066023e-07   2   -4    4
    1.4535032e-08   2   -2000013    1000013
    1.4535032e-08   2   -1000013    2000013
    2.9661679e-09   2   -11    11
    8.2825094e-13   2   -2    2
    3.399763e-13   2   -2000011    1000011
    3.399763e-13   2   -1000011    2000011

DECAY 36  44.77869
    0.21373795   2   -1000024    1000037
    0.21373795   2   -1000037    1000024
    0.17705615   2   -5    5
    0.12294351   2    1000023    1000035
    0.086766891   2    1000023    1000025
    0.037995922   2   -15    15
    0.033629555   2    1000022    1000035
    0.031442316   2   -2000006    1000006
    0.031442316   2   -1000006    2000006
    0.02752615   2    1000022    1000025
    0.0075558583   2   -6    6
    0.0068837641   2   -1000024    1000024
    0.0034142546   2    1000023    1000023
    0.0018410951   2    1000022    1000023
    0.0015731157   2    1000035    1000035
    0.00094759561   2    1000025    1000035
    0.00053769338   2    1000025    1000025
    0.0004932466   2   -1000037    1000037
    0.00025178313   2    1000022    1000022
    0.00013088761   2   -13    13
    7.3289417e-05   2   -3    3
    1.1420906e-05   2    21    21
    6.6289502e-06   2    23    25
    2.026134e-07   2   -1    1
    1.7542476e-07   2    22    23
    1.4930987e-07   2   -4    4
    1.0685057e-07   2    22    22
    1.4852969e-08   2   -2000013    1000013
    1.4852969e-08   2   -1000013    2000013
    2.9396239e-09   2   -11    11
    7.6978829e-13   2   -2    2
    3.4741239e-13   2   -2000011    1000011
    3.4741239e-13   2   -1000011    2000011
    9.4013419e-37   2    25    25

DECAY 37  44.788193
    0.21877912   2    1000023    1000037
    0.21576271   2   -5    6
    0.21479042   2    1000024    1000035
    0.21457938   2    1000024    1000025
    0.060010255   2    1000022    1000037
    0.038497419   2   -15    16
    0.02357895   2   -2000005    1000006
    0.0083203334   2   -1000005    1000006
    0.0036174909   2    1000022    1000024
    0.0010802651   2    1000025    1000037
    0.00044523085   2    1000035    1000037
    0.00030535162   2   -5    4
    0.00013610212   2   -13    14
    6.980162e-05   2   -3    4
    1.4151849e-05   2   -3    6
    6.6342038e-06   2    24    25
    3.2648692e-06   2   -3    2
    2.1805243e-06   2   -5    2
    6.4433311e-07   2   -1    6
    1.932724e-07   2   -1    2
    5.48277e-08   2    1000023    1000024
    2.9524449e-08   2   -1000013    1000014
    1.4916408e-08   2   -1    4
    3.1834426e-09   2   -11    12
    6.905784e-13   2   -1000011    1000012
    3.6351742e-14   2    24    35

DECAY 6  2.43
    1   2    5    24

DECAY 15 -1
