BLOCK SPINFO
   1   SPheno
   2   v4.0.5be

BLOCK SPHENOINFO
   1   2
   2   2

BLOCK MODSEL
   1   0

BLOCK MINPAR
   3    49.170163
   4   -1

BLOCK EXTPAR
   0    3440.5661
   1    1118.4016
   2   -831.10929
   3    4303.6938
   11   -4426.5943
   12    659.02205
   13   -293.88781
   23   -610.76665
   25    48.84026
   26    1352.2306
   31    890.02484
   32    890.02484
   33    3376.8472
   34    3432.3526
   35    3432.3526
   36    2725.235
   41    4230.5064
   42    4230.5064
   43    2475.1753
   44    1267.3045
   45    1267.3045
   46    4540.961
   47    1263.4315
   48    1263.4315
   49    2622.9213

BLOCK SMINPUTS
   1    127.90897
   2    1.1663787e-05
   3    0.1184
   4    91.1876
   5    4.18
   6    173.2
   7    1.777
   8    0
   11    0.00051099893
   12    0
   13    0.10565837
   14    0
   21    0.005
   22    0.0025
   23    0.095
   24    1.27

BLOCK GAUGE Q=  3440.5661
   1    0.35536298
   2    0.66519887
   3    1.219778

BLOCK YU Q=  3440.5661
   1   1    8.3861294e-06
   2   2    0.0042601537
   3   3    1.0131118

BLOCK YD Q=  3440.5661
   1   1    0.00082303779
   2   2    0.015637718
   3   3    0.81619558

BLOCK YE Q=  3440.5661
   1   1    0.00014362611
   2   2    0.029697325
   3   3    0.49946015

BLOCK AU Q=  3440.5661
   1   1    0
   2   2    0
   3   3   -4426.5985

BLOCK AD Q=  3440.5661
   1   1    0
   2   2    0
   3   3    659.02237

BLOCK AE Q=  3440.5661
   1   1    0
   2   2    0
   3   3   -293.88769

BLOCK MSOFT Q=  3440.5661
   1    1118.4016
   2   -831.10929
   3    4303.6938
   21    1717204.8
   22   -207185.88
   31    890.02484
   32    890.02484
   33    3376.8472
   34    3432.3526
   35    3432.3526
   36    2725.235
   41    4230.5064
   42    4230.5064
   43    2475.1753
   44    1267.3045
   45    1267.3045
   46    4540.961
   47    1263.4315
   48    1263.4315
   49    2622.9213

BLOCK MASS
   6    173.2
   23    91.1876
   24    80.429995
   15    1.777
   25    124.54489
   35    1351.9122
   36    1352.2306
   37    1355.8765
   1000001    4364.2343
   2000001    1445.7067
   1000002    4363.4928
   2000002    1458.5551
   1000003    4364.2283
   2000003    1445.6872
   1000004    4363.4869
   2000004    1458.5543
   1000005    2581.5404
   2000005    2730.335
   1000006    2580.3472
   2000006    4587.559
   1000011    913.11255
   2000011    3433.151
   1000012    909.22441
   1000013    913.04679
   2000013    3433.0936
   1000014    909.15867
   1000015    2704.6135
   2000015    3377.0976
   1000016    3375.4201
   1000021    4398.6081
   1000022   -604.74434
   1000023    616.32894
   1000025   -881.29291
   1000035    1102.3746
   1000024    605.97323
   1000037    881.5197

BLOCK ALPHA
      -0.020652028

BLOCK HMIX Q=  3440.5661
   1   -610.76665
   2    48.84026
   3    243.10472
   4    1828527.6

BLOCK STOPMIX
   1   1    0.9990666
   1   2    0.043196318
   2   1   -0.043196318
   2   2    0.9990666

BLOCK SBOTMIX
   1   1   -0.99515501
   1   2    0.098318363
   2   1   -0.098318363
   2   2   -0.99515501

BLOCK STAUMIX
   1   1   -0.013016109
   1   2    0.99991529
   2   1   -0.99991529
   2   2   -0.013016109

BLOCK NMIX
   1   1   -0.017745619
   1   2   -0.21359645
   1   3   -0.69710383
   1   4    0.68418411
   2   1    0.061656672
   2   2    0.037398131
   2   3   -0.70524442
   2   4   -0.70528727
   3   1    0.0039594106
   3   2   -0.97620333
   3   3    0.12544056
   3   4   -0.17685036
   4   1   -0.9979318
   4   2    0.0022356794
   4   3   -0.030679265
   4   4   -0.056443897

BLOCK UMIX
   1   1   -0.17822553
   1   2   -0.98398966
   2   1   -0.98398966
   2   2    0.17822553

BLOCK VMIX
   1   1    0.25132939
   1   2    0.96790162
   2   1    0.96790162
   2   2   -0.25132939

BLOCK HIGGSBOUNDSINPUTHIGGSCOUPLINGSFERMIONS
       0, 2385.371,3,36,15,15

BLOCK HIGGSBOUNDSINPUTHIGGSCOUPLINGSBOSONS
       0,4,36,21,21,23

BLOCK SPHENOLOWENERGY
   1    0.00035326794
   2    1.5874827e-06
   3    3.5252173e-05
   4    1.1550076e-15
   5    4.9329952e-11
   6    9.7152734e-09
   7    4.0412758e-14
   8    1.7261198e-09
   9    3.4799568e-07
   10    8.8734616e-05
   11    0.91659461
   12    0.54177118
   13    19.288606
   14    0
   15    0
   16    0.0021571056
   17    2.2816652e-15
   18    2.4801989e-11
   19    8.2906548e-11
   20    5.5313895e-15
   21    2.3648743e-10
   22    2.549678e-08
   23    0
   24    0
   25    0
   26    0
   27    0
   28    0
   29    0
   30    0
   31    0
   39    7.374811e-05
   40    0
   41    0
   42    0

BLOCK FWCOEF Q=  160
   305   4422   0   0   -0.18881911
   305   4422   0   2   -0.22374425
   305   4322   0   2   -0.00063062517
   305   6421   0   0   -0.095227835
   305   6421   0   2   -0.12775196
   305   6321   0   2   -0.0006148024
   3051111   4133   0   0    1.6221723
   3051111   4133   0   2    1.6222967
   3051111   4233   0   2    0.00041598465
   3051111   4137   0   0   -4.4448644
   3051111   4137   0   2   -4.4431915
   3051111   4237   0   2   -0.0030987083
   3051313   4133   0   0    1.6221723
   3051313   4133   0   2    1.622295
   3051313   4233   0   2    0.00041597265
   3051313   4137   0   0   -4.4448644
   3051313   4137   0   2   -4.4431932
   3051313   4237   0   2   -0.0030987009
   3051212   4137   0   0    1.5053501
   3051212   4137   0   2    1.5050065
   3051212   4237   0   2    0.00067073918
   3051414   4137   0   0    1.5053501
   3051414   4137   0   2    1.5050065
   3051414   4237   0   2    0.00067074161
   3051616   4137   0   0    1.5053501
   3051616   4137   0   2    1.5050052
   3051616   4237   0   2    0.0006714251

BLOCK IMFWCOEF Q=  160
   305   4422   0   0    3.8578268e-07
   305   4422   0   2    1.5306067e-05
   305   4322   0   2   -3.2004576e-06
   305   6421   0   0    3.3044838e-07
   305   6421   0   2    1.73935e-05
   305   6321   0   2   -1.2044065e-06
   3051111   4133   0   2   -1.0466782e-06
   3051111   4233   0   2    1.1128716e-05
   3051111   4137   0   2    6.5825995e-06
   3051111   4237   0   2   -8.2913648e-05
   3051313   4133   0   2   -1.0467761e-06
   3051313   4233   0   2    1.1128702e-05
   3051313   4137   0   2    6.5827256e-06
   3051313   4237   0   2   -8.2913715e-05
   3051212   4137   0   2   -1.089622e-06
   3051212   4237   0   2    1.7947287e-05
   3051414   4137   0   2   -1.0896209e-06
   3051414   4237   0   2    1.7947287e-05
   3051616   4137   0   2   -1.1129476e-06
   3051616   4237   0   2    1.7947289e-05

DECAY 23  2.4952


DECAY 24  2.085


DECAY 1000011  0.20274776
    0.39434781   2   -1000024    12
    0.3108731   2    1000022    11
    0.17750629   2   -1000037    12
    0.088206868   2    1000025    11
    0.029065917   2    1000023    11

DECAY 2000011  13.885992
    0.99519242   2    1000035    11
    0.0044231431   2    1000023    11
    0.00036734972   2    1000022    11

DECAY 1000013  0.20730582
    0.38556202   2   -1000024    14
    0.31581172   2    1000022    13
    0.17290619   2   -1000037    14
    0.085924148   2    1000025    13
    0.039795916   2    1000023    13

DECAY 2000013  13.999364
    0.98711205   2    1000035    13
    0.0063915765   2    1000023    13
    0.0039104912   2   -1000024    14
    0.002327475   2    1000022    13
    0.0001192448   2   -1000037    14

DECAY 1000015  33.605883
    0.35100843   2   -1000024    16
    0.2801227   2    1000035    15
    0.17992454   2    1000023    15
    0.17654666   2    1000022    15
    0.008286034   2   -1000037    16
    0.0041116345   2    1000025    15

DECAY 2000015  58.076684
    0.43184092   2   -1000037    16
    0.21554586   2    1000025    15
    0.1423915   2    1000022    15
    0.1353295   2    1000023    15
    0.057923321   2    1000035    15
    0.013627997   2   -1000024    16
    0.0017134864   2    1000015    23
    0.0016274163   2    1000015    25

DECAY 1000012  0.24908016
    0.62706306   2    1000024    11
    0.20814119   2    1000022    12
    0.10842201   2    1000037    11
    0.056280376   2    1000025    12

DECAY 1000014  0.25358727
    0.63448184   2    1000024    13
    0.20438011   2    1000022    14
    0.10601831   2    1000037    13
    0.055028062   2    1000025    14

DECAY 1000016  58.10455
    0.42394829   2    1000037    15
    0.29166114   2    1000024    15
    0.21249857   2    1000025    16
    0.058483332   2    1000035    16
    0.0099801861   2    1000022    16
    0.0034237219   2    1000015    24

DECAY 2000001  0.14308305
    0.98421544   2    1000035    1
    0.014403396   2    1000023    1
    0.0012541059   2    1000022    1

DECAY 1000001  53.642726
    0.63801491   2   -1000037    2
    0.31444629   2    1000025    1
    0.021880685   2   -1000024    2
    0.015255158   2    1000022    1
    0.010162363   2    1000035    1
    0.0002405867   2    1000023    1

DECAY 2000003  0.15247299
    0.92352613   2    1000035    3
    0.030346917   2   -1000024    4
    0.028838815   2    1000023    3
    0.016390613   2    1000022    3
    0.000578209   2   -1000037    4
    0.00031931489   2    1000025    3

DECAY 1000003  53.664695
    0.63775455   2   -1000037    4
    0.31432271   2    1000025    3
    0.021898009   2   -1000024    4
    0.015433376   2    1000022    3
    0.010158507   2    1000035    3
    0.00042896445   2    1000023    3

DECAY 1000005  103.2753
    0.42993218   2   -1000024    6
    0.18678609   2   -1000037    6
    0.15292676   2    1000022    5
    0.14650431   2    1000023    5
    0.081604772   2    1000025    5
    0.0022458846   2    1000035    5

DECAY 2000005  66.658979
    0.46290007   2   -1000024    6
    0.24340149   2    1000023    5
    0.23071204   2    1000022    5
    0.029022696   2   -1000037    6
    0.016891233   2    1000035    5
    0.014215955   2    1000025    5
    0.0014699857   2    1000006   -24
    0.00080198747   2    1000005    25
    0.00058454064   2    1000005    23

DECAY 2000002  0.60541473
    0.98500335   2    1000035    2
    0.013800846   2    1000023    2
    0.0011617986   2    1000022    2

DECAY 1000002  53.687234
    0.61668825   2    1000037    1
    0.31321694   2    1000025    2
    0.043468836   2    1000024    1
    0.016168311   2    1000022    2
    0.0096534884   2    1000035    2
    0.00080417422   2    1000023    2

DECAY 2000004  0.6061105
    0.98386495   2    1000035    4
    0.014072597   2    1000023    4
    0.0014382609   2    1000022    4
    0.00055723223   2    1000024    3

DECAY 1000004  53.70901
    0.61644887   2    1000037    3
    0.31309008   2    1000025    4
    0.043818079   2    1000024    3
    0.016175022   2    1000022    4
    0.0096496275   2    1000035    4
    0.00081788159   2    1000023    4

DECAY 1000006  106.25958
    0.2842964   2    1000024    5
    0.21708707   2    1000023    6
    0.20862828   2    1000022    6
    0.1693872   2    1000037    5
    0.089668556   2    1000025    6
    0.026172865   3    1000022    24    5
    0.0027145866   2    1000035    6
    0.0019484205   2    1000022    4

DECAY 2000006  280.27151
    0.30656124   2    1000024    5
    0.16005656   2    1000023    6
    0.15254405   2    1000022    6
    0.13784364   2    1000005    24
    0.10467309   2    1000006    25
    0.069502552   2    1000006    23
    0.033660331   2    1000035    6
    0.015516854   2    1000037    5
    0.0076515876   2    1000025    6
    0.0039466392   2    1000005    37
    0.0030279147   2    1000021    6
    0.0019373715   2    1000006    36
    0.0019274992   2    1000006    35
    0.001135156   2    2000005    24

DECAY 1000024  7.1480477e-12
    0.60401205   3    1000022   -1    2
    0.20159705   3    1000022   -11    12
    0.19439091   3    1000022   -13    14

DECAY 1000037  5.4454006
    0.31202872   2    1000022    24
    0.24078788   2    1000024    23
    0.23779053   2    1000023    24
    0.20874494   2    1000024    25
    0.00038928009   3    1000022   -5    6
    0.00024015379   3    1000023   -5    6

DECAY 1000022 -1


DECAY 1000023  1.2460636e-06
    0.29548414   2    1000022    22
    0.11096047   3    1000022    12   -12
    0.082972434   3    1000022    1   -1
    0.082908179   3    1000022    3   -3
    0.064711987   3    1000022    2   -2
    0.055134159   3    1000022    4   -4
    0.042283492   3    1000024    1   -2
    0.042283492   3   -1000024   -1    2
    0.039284197   3    1000024    3   -4
    0.039284197   3   -1000024   -3    4
    0.018715364   3    1000022    11   -11
    0.018693316   3    1000022    13   -13
    0.014092226   3    1000024    11   -12
    0.014092226   3   -1000024   -11    12
    0.014084834   3    1000024    13   -14
    0.014084834   3   -1000024   -13    14
    0.013274354   3    1000022    15   -15
    0.013217961   3    1000022    5   -5
    0.01221907   3    1000024    15   -16
    0.01221907   3   -1000024   -15    16

DECAY 1000025  7.3682656
    0.23562127   2    1000024   -24
    0.23562127   2   -1000024    24
    0.22124433   2    1000023    23
    0.15447388   2    1000023    25
    0.14630583   2    1000022    25
    0.0060239222   2    1000022    23
    0.00032187044   3    1000024    5   -6
    0.00032187044   3   -1000024   -5    6

DECAY 1000035  3.5184135
    0.16865456   2    1000024   -24
    0.16865456   2   -1000024    24
    0.16643098   2    1000022    23
    0.16481809   2    1000022    25
    0.15122491   2    1000023    25
    0.020214217   2    1000014   -14
    0.020214217   2   -1000014    14
    0.020201784   2    1000012   -12
    0.020201784   2   -1000012    12
    0.019160016   2    1000013   -13
    0.019160016   2   -1000013    13
    0.019147791   2    1000011   -11
    0.019147791   2   -1000011    11
    0.014548115   2    1000023    23
    0.0016393683   3    1000024    5   -6
    0.0016393683   3   -1000024   -5    6
    0.0014172944   2    1000025    23
    0.001137312   2    1000025    25
    0.0009776283   2    1000037   -24
    0.0009776283   2   -1000037    24
    0.00021961277   3    1000022    6   -6
    0.00017163356   3    1000023    6   -6

DECAY 1000021  598.76903
    0.086501674   2    2000003   -3
    0.086501674   2   -2000003    3
    0.08650111   2    2000001   -1
    0.08650111   2   -2000001    1
    0.086127462   2    2000004   -4
    0.086127462   2   -2000004    4
    0.086127443   2    2000002   -2
    0.086127443   2   -2000002    2
    0.046749162   2    1000005   -5
    0.046749162   2   -1000005    5
    0.046168791   2    1000006   -6
    0.046168791   2   -1000006    6
    0.041056085   2    2000005   -5
    0.041056085   2   -2000005    5
    0.02031631   2    1000006   -4
    0.02031631   2   -1000006    4
    0.00015989972   3    1000023    6   -6
    0.00015333591   3    1000024    5   -6
    0.00015333591   3   -1000024   -5    6
    0.00015330677   3    1000022    6   -6

DECAY 25  0.0038936116
    0.58606705   2   -5    5
    0.21695464   2   -24    24
    0.071425605   2    21    21
    0.067216149   2   -15    15
    0.028123141   2   -4    4
    0.02602654   2    23    23
    0.0023000894   2    22    22
    0.0014319185   2    22    23
    0.00023380655   2   -13    13
    0.00022029851   2   -3    3
    6.0910386e-07   2   -1    1
    1.4492666e-07   2   -2    2
    5.2562372e-09   2   -11    11

DECAY 35  55.911004
    0.87293827   2   -5    5
    0.12272503   2   -15    15
    0.0014176936   2   -1000024    1000024
    0.0011331923   2    1000022    1000023
    0.00049311633   2    1000022    1000022
    0.00049264457   2   -13    13
    0.00040954836   2   -6    6
    0.0003429965   2   -3    3
    3.4264549e-05   2    21    21
    9.6323023e-06   2    25    25
    1.043563e-06   2    23    23
    9.6219031e-07   2   -24    24
    9.4837972e-07   2   -1    1
    4.0323278e-07   2    1000023    1000023
    1.3822246e-07   2    22    23
    9.2771622e-08   2    22    22
    1.1067236e-08   2   -11    11
    5.7788469e-09   2   -4    4
    2.9786809e-14   2   -2    2

DECAY 36  53.737881
    0.86681303   2   -5    5
    0.12186508   2   -15    15
    0.0072559438   2   -1000024    1000024
    0.0025331745   2    1000022    1000022
    0.00048919487   2   -13    13
    0.00043090882   2   -6    6
    0.00034058129   2   -3    3
    0.00021812394   2    1000022    1000023
    4.9036166e-05   2    21    21
    2.1203094e-06   2    1000023    1000023
    1.4611323e-06   2    23    25
    9.4170122e-07   2   -1    1
    2.1116559e-07   2    22    23
    1.7247586e-07   2    22    22
    1.0989751e-08   2   -11    11
    5.637043e-09   2   -4    4
    2.9050657e-14   2   -2    2
    3.8635205e-39   2    25    25

DECAY 37  51.361296
    0.86798738   2   -5    6
    0.12763843   2   -15    16
    0.0021884337   2    1000023    1000024
    0.0013082162   2   -5    4
    0.00045124867   2   -13    14
    0.00033897741   2   -3    4
    5.8534531e-05   2    1000022    1000024
    1.5723185e-05   2   -3    2
    9.3420268e-06   2   -5    2
    1.5462821e-06   2    24    25
    1.1381913e-06   2   -3    6
    9.4072675e-07   2   -1    2
    4.3788986e-08   2   -1    4
    2.9996968e-08   2   -1    6
    1.0554753e-08   2   -11    12
    2.5886033e-11   2    24    35
    1.7034147e-11   2    24    36

DECAY 6  2.43
    1   2    5    24

DECAY 15 -1
