BLOCK SPINFO
   1   SPheno
   2   v4.0.5be

BLOCK SPHENOINFO
   1   2
   2   2

BLOCK MODSEL
   1   0

BLOCK MINPAR
   3    56.310604
   4   -1

BLOCK EXTPAR
   0    928.47094
   1   -1399.203
   2   -704.77229
   3    3000
   11   -3194.6121
   12   -1216.4926
   13   -587.30949
   23   -591.02797
   25    56.514997
   26    4910.9904
   31    1330.0179
   32    1330.0179
   33    1907.138
   34    1895.175
   35    1895.175
   36    755.91941
   41    5000
   42    5000
   43    1122.566
   44    5000
   45    5000
   46    1077.4264
   47    5000
   48    5000
   49    1025.8181

BLOCK SMINPUTS
   1    127.90897
   2    1.1663787e-05
   3    0.1184
   4    91.1876
   5    4.18
   6    173.2
   7    1.777
   8    0
   11    0.00051099893
   12    0
   13    0.10565837
   14    0
   21    0.005
   22    0.0025
   23    0.095
   24    1.27

BLOCK GAUGE Q=  928.47094
   1    0.35536298
   2    0.66519887
   3    1.219778

BLOCK YU Q=  928.47094
   1   1    8.3856846e-06
   2   2    0.0042599278
   3   3    1.013058

BLOCK YD Q=  928.47094
   1   1    0.00095231906
   2   2    0.018094062
   3   3    0.94440209

BLOCK YE Q=  928.47094
   1   1    0.00016618664
   2   2    0.034362126
   3   3    0.57791443

BLOCK AU Q=  928.47094
   1   1    0
   2   2    0
   3   3   -3194.6121

BLOCK AD Q=  928.47094
   1   1    0
   2   2    0
   3   3   -1216.4927

BLOCK AE Q=  928.47094
   1   1    0
   2   2    0
   3   3   -587.30948

BLOCK MSOFT Q=  928.47094
   1   -1399.203
   2   -704.77229
   3    3000
   21    23333296
   22   -305343.53
   31    1330.0179
   32    1330.0179
   33    1907.138
   34    1895.175
   35    1895.175
   36    755.91941
   41    5000
   42    5000
   43    1122.566
   44    5000
   45    5000
   46    1077.4264
   47    5000
   48    5000
   49    1025.8181

BLOCK MASS
   6    173.2
   23    91.1876
   24    80.429995
   15    1.777
   25    122.74058
   35    4902.7004
   36    4910.9904
   37    4903.8778
   1000001    5002.3111
   2000001    4991.3637
   1000002    5001.8757
   2000002    4996.8728
   1000003    5002.3398
   2000003    4991.4083
   1000004    5001.9024
   2000004    4996.8744
   1000005    1042.671
   2000005    1123.6424
   1000006    718.15677
   2000006    1200.3762
   1000011    1342.228
   2000011    1888.0005
   1000012    1339.5333
   1000013    1342.3505
   2000013    1888.1675
   1000014    1339.6549
   1000015    858.75401
   2000015    1940.0874
   1000016    1937.838
   1000021    3149.0155
   1000022   -575.77059
   1000023    597.45618
   1000025   -762.87751
   1000035   -1406.2193
   1000024    578.57532
   1000037    763.34969

BLOCK ALPHA
      -0.017772496

BLOCK HMIX Q=  928.47094
   1   -591.02797
   2    56.514997
   3    244.45956
   4    24117827

BLOCK STOPMIX
   1   1    0.57042385
   1   2    0.82135049
   2   1   -0.82135049
   2   2    0.57042385

BLOCK SBOTMIX
   1   1   -0.87524374
   1   2    0.48368213
   2   1   -0.48368213
   2   2   -0.87524374

BLOCK STAUMIX
   1   1   -0.019364198
   1   2    0.9998125
   2   1   -0.9998125
   2   2   -0.019364198

BLOCK NMIX
   1   1   -0.035583329
   1   2    0.32034572
   1   3    0.68026059
   1   4   -0.65829931
   2   1    0.015356015
   2   2   -0.041733898
   2   3    0.70521252
   2   4    0.70760001
   3   1    0.017848814
   3   2    0.94636849
   3   3   -0.19908208
   3   4    0.25383936
   4   1    0.99908931
   4   2   -0.0048561447
   4   3    0.016945493
   4   4   -0.038856515

BLOCK UMIX
   1   1   -0.28590326
   1   2   -0.95825849
   2   1   -0.95825849
   2   2    0.28590326

BLOCK VMIX
   1   1    0.36463769
   1   2    0.93114948
   2   1    0.93114948
   2   2   -0.36463769

BLOCK HIGGSBOUNDSINPUTHIGGSCOUPLINGSFERMIONS
       0, 3193.9448,3,36,15,15

BLOCK HIGGSBOUNDSINPUTHIGGSCOUPLINGSBOSONS
       0,4,36,21,21,23

BLOCK SPHENOLOWENERGY
   1    0.00048349066
   2    1.6010366e-06
   3    3.5222581e-05
   4    1.4787885e-15
   5    6.3155306e-11
   6    1.2242609e-08
   7    5.0134357e-14
   8    2.1411916e-09
   9    4.2203043e-07
   10    9.4928592e-05
   11    0.98057602
   12    0.54684548
   13    19.501111
   14    0
   15    0
   16    0.0022115626
   17    2.2822122e-15
   18    2.4812803e-11
   19    8.29252e-11
   20    1.3836022e-14
   21    5.9164882e-10
   22    9.0890882e-08
   23    0
   24    0
   25    0
   26    0
   27    0
   28    0
   29    0
   30    0
   31    0
   39    9.2706149e-05
   40    0
   41    0
   42    0

BLOCK FWCOEF Q=  160
   305   4422   0   0   -0.18881911
   305   4422   0   2   -0.36165619
   305   4322   0   2   -0.0007166277
   305   6421   0   0   -0.095227835
   305   6421   0   2   -0.18764305
   305   6321   0   2   -0.00033103053
   3051111   4133   0   0    1.5755331
   3051111   4133   0   2    1.5771836
   3051111   4233   0   2    0.0004347652
   3051111   4137   0   0   -4.3982252
   3051111   4137   0   2   -4.3937199
   3051111   4237   0   2   -0.0034689213
   3051313   4133   0   0    1.5755331
   3051313   4133   0   2    1.5771755
   3051313   4233   0   2    0.00043476215
   3051313   4137   0   0   -4.3982252
   3051313   4137   0   2   -4.393728
   3051313   4237   0   2   -0.0034689321
   3051212   4137   0   0    1.5053501
   3051212   4137   0   2    1.5043777
   3051212   4237   0   2    0.00075883798
   3051414   4137   0   0    1.5053501
   3051414   4137   0   2    1.5043777
   3051414   4237   0   2    0.00075883802
   3051616   4137   0   0    1.5053501
   3051616   4137   0   2    1.5043779
   3051616   4237   0   2    0.00075884949

BLOCK IMFWCOEF Q=  160
   305   4422   0   0    3.8538464e-07
   305   4422   0   2    3.7649511e-05
   305   4322   0   2   -1.1876819e-05
   305   6421   0   0    3.3010743e-07
   305   6421   0   2    3.1843524e-05
   305   6321   0   2   -4.678537e-06
   3051111   4133   0   2   -3.7320054e-06
   3051111   4233   0   2    8.3164294e-06
   3051111   4137   0   2    3.0844565e-05
   3051111   4237   0   2   -6.6363455e-05
   3051313   4133   0   2   -3.7320615e-06
   3051313   4233   0   2    8.3163812e-06
   3051313   4137   0   2    3.084483e-05
   3051313   4237   0   2   -6.6363654e-05
   3051212   4137   0   2   -6.4828753e-06
   3051212   4237   0   2    1.4517223e-05
   3051414   4137   0   2   -6.4828753e-06
   3051414   4237   0   2    1.4517223e-05
   3051616   4137   0   2   -6.4845815e-06
   3051616   4237   0   2    1.4517219e-05

DECAY 23  2.4952


DECAY 24  2.085


DECAY 1000011  8.4419603
    0.5882926   2   -1000037    12
    0.29304865   2    1000025    11
    0.075841466   2   -1000024    12
    0.042311356   2    1000022    11
    0.00050593048   2    1000023    11

DECAY 2000011  1.8910151
    0.99269691   2    1000035    11
    0.0052255769   2    1000022    11
    0.0011189413   2    1000025    11
    0.0009581172   2    1000023    11

DECAY 1000013  8.4644841
    0.58688318   2   -1000037    14
    0.29241297   2    1000025    13
    0.075652865   2   -1000024    14
    0.043355133   2    1000022    13
    0.0016958592   2    1000023    13

DECAY 2000013  1.9650121
    0.95582122   2    1000035    13
    0.017017222   2   -1000024    14
    0.013622701   2    1000022    13
    0.010011894   2    1000023    13
    0.0017034186   2    1000025    13
    0.0012912041   2   -1000037    14
    0.00053234059   2    1000013    25

DECAY 1000015  3.1778623
    0.49803421   2   -1000024    16
    0.25642   2    1000022    15
    0.23727373   2    1000023    15
    0.005531355   2   -1000037    16
    0.0027407034   2    1000025    15

DECAY 2000015  30.613306
    0.3694903   2   -1000037    16
    0.19570459   2    1000025    15
    0.18061907   2    1000022    15
    0.17220581   2    1000023    15
    0.033689608   2   -1000024    16
    0.017659145   2    1000035    15
    0.015619666   2    1000015    23
    0.015011804   2    1000015    25

DECAY 1000012  8.522363
    0.54702026   2    1000037    11
    0.27718881   2    1000025    12
    0.12173169   2    1000024    11
    0.052952143   2    1000022    12
    0.0011071004   2    1000023    12

DECAY 1000014  8.5447775
    0.54586969   2    1000037    13
    0.27653497   2    1000025    14
    0.12366856   2    1000024    13
    0.052822379   2    1000022    14
    0.0011043961   2    1000023    14

DECAY 1000016  30.68677
    0.38081495   2    1000024    15
    0.36864872   2    1000037    15
    0.17419208   2    1000025    16
    0.031099065   2    1000015    24
    0.026607296   2    1000022    16
    0.018070267   2    1000035    16
    0.00056762978   2    1000023    16

DECAY 2000001  145.13215
    0.98372083   2    1000021    1
    0.016244057   2    1000035    1

DECAY 1000001  207.63056
    0.69311141   2    1000021    1
    0.18578568   2   -1000037    2
    0.089999695   2    1000025    1
    0.016875348   2   -1000024    2
    0.011019376   2    1000022    1
    0.0030045283   2    1000035    1
    0.00020396386   2    1000023    1

DECAY 2000003  145.19983
    0.98329429   2    1000021    3
    0.016236733   2    1000035    3
    0.00020011285   2   -1000024    4
    0.00012453197   2    1000022    3
    0.00011258077   2    1000023    3

DECAY 1000003  207.66728
    0.69300326   2    1000021    3
    0.18575515   2   -1000037    4
    0.089990241   2    1000025    3
    0.016879756   2   -1000024    4
    0.01108801   2    1000022    3
    0.0030040577   2    1000035    3
    0.00027953351   2    1000023    3

DECAY 1000005  43.308241
    0.58425245   2    1000006   -24
    0.15635606   2   -1000024    6
    0.12054123   2    1000022    5
    0.093587767   2    1000023    5
    0.033402804   2   -1000037    6
    0.011859686   2    1000025    5

DECAY 2000005  35.968175
    0.39695476   2    1000006   -24
    0.2576071   2   -1000024    6
    0.14539116   2    1000023    5
    0.1114787   2    1000022    5
    0.061319708   2   -1000037    6
    0.027248564   2    1000025    5

DECAY 2000002  152.80777
    0.93806703   2    1000021    2
    0.061804027   2    1000035    2

DECAY 1000002  207.62732
    0.69290347   2    1000021    2
    0.17540871   2    1000037    1
    0.091209634   2    1000025    2
    0.027447999   2    1000024    1
    0.010180059   2    1000022    2
    0.0026934177   2    1000035    2
    0.00015670599   2    1000023    2

DECAY 2000004  152.81138
    0.93804555   2    1000021    4
    0.061802587   2    1000035    4

DECAY 1000004  207.66374
    0.69279508   2    1000021    4
    0.17539121   2    1000037    3
    0.091194651   2    1000025    4
    0.027583139   2    1000024    3
    0.010182024   2    1000022    4
    0.0026929772   2    1000035    4
    0.00016091348   2    1000023    4

DECAY 1000006  1.2194215
    0.9946339   2    1000024    5
    0.0052880498   2    1000022    4

DECAY 2000006  78.208252
    0.41250755   2    1000006    23
    0.1963507   2    1000024    5
    0.11149601   2    1000022    6
    0.10066164   2    1000023    6
    0.084673079   2    1000006    25
    0.073088636   2    1000005    24
    0.015057359   2    1000037    5
    0.0061650173   2    1000025    6

DECAY 1000024  6.1487111e-10
    0.48267499   3    1000022   -1    2
    0.176632   3    1000022   -3    4
    0.16102065   3    1000022   -11    12
    0.15988957   3    1000022   -13    14
    0.019782795   3    1000022   -15    16

DECAY 1000037  3.3906081
    0.39461691   2    1000022    24
    0.21909855   2    1000024    23
    0.19069246   2    1000023    24
    0.15709487   2    1000024    25
    0.038493664   2    1000006   -5

DECAY 1000022 -1


DECAY 1000023  2.2389928e-05
    0.13548552   3    1000022    12   -12
    0.10716158   2    1000022    22
    0.10130008   3    1000022    1   -1
    0.10127805   3    1000022    3   -3
    0.079006213   3    1000022    2   -2
    0.075526106   3    1000022    4   -4
    0.068075321   3    1000022    5   -5
    0.044661354   3    1000024    1   -2
    0.044661354   3   -1000024   -1    2
    0.04368513   3    1000024    3   -4
    0.04368513   3   -1000024   -3    4
    0.022858387   3    1000022    11   -11
    0.022851234   3    1000022    13   -13
    0.021377747   3    1000022    15   -15
    0.014887799   3    1000024    11   -12
    0.014887799   3   -1000024   -11    12
    0.014887658   3    1000024    13   -14
    0.014887658   3   -1000024   -13    14
    0.014417941   3    1000024    15   -16
    0.014417941   3   -1000024   -15    16

DECAY 1000025  5.0937105
    0.27929086   2    1000024   -24
    0.27929086   2   -1000024    24
    0.23388848   2    1000023    23
    0.10930566   2    1000023    25
    0.095138316   2    1000022    25
    0.0030333026   2    1000022    23

DECAY 1000035  11.688283
    0.1658758   2    1000006   -6
    0.1658758   2   -1000006    6
    0.11862873   2    1000015   -15
    0.11862873   2   -1000015    15
    0.070393611   2    1000023    23
    0.062591913   2    1000024   -24
    0.062591913   2   -1000024    24
    0.060026067   2    1000023    25
    0.052053119   2    1000022    25
    0.015997595   2    1000037   -24
    0.015997595   2   -1000037    24
    0.013343047   2    1000025    25
    0.012742084   2    2000005   -5
    0.012742084   2   -2000005    5
    0.0093512969   2    1000022    23
    0.0086518804   2    2000006   -6
    0.0086518804   2   -2000006    6
    0.0064903192   2    1000005   -5
    0.0064903192   2   -1000005    5
    0.0014096391   3    1000024    5   -6
    0.0014096391   3   -1000024   -5    6
    0.0014004715   3    1000023    6   -6
    0.0012681187   3    1000022    6   -6
    0.0012302609   2    1000025    23
    0.00065852435   2    1000012   -12
    0.00065852435   2   -1000012    12
    0.00065618324   2    1000014   -14
    0.00065618324   2   -1000014    14
    0.00058585579   2    1000011   -11
    0.00058585579   2   -1000011    11
    0.00058366384   2    1000013   -13
    0.00058366384   2   -1000013    13
    0.00051678002   3    1000037    5   -6
    0.00051678002   3   -1000037   -5    6
    0.00012747709   3    1000025    6   -6

DECAY 1000021  310.46641
    0.12268631   2    2000006   -6
    0.12268631   2   -2000006    6
    0.12023992   2    1000006   -6
    0.12023992   2   -1000006    6
    0.11930369   2    1000005   -5
    0.11930369   2   -1000005    5
    0.11402726   2    2000005   -5
    0.11402726   2   -2000005    5
    0.021873537   2    1000006   -4
    0.021873537   2   -1000006    4
    0.0013128232   3    1000023    6   -6
    0.0010609841   3    1000022    6   -6
    0.00040983596   3    1000037    5   -6
    0.00040983596   3   -1000037   -5    6
    0.00031851336   3    1000025    6   -6

DECAY 25  0.0036027792
    0.61308379   2   -5    5
    0.19294078   2   -24    24
    0.069370846   2   -15    15
    0.068152119   2    21    21
    0.029958517   2   -4    4
    0.022318404   2    23    23
    0.0023931343   2    22    22
    0.0013139268   2    22    23
    0.00024063203   2   -13    13
    0.00022707197   2   -3    3
    6.2783169e-07   2   -1    1
    1.5439037e-07   2   -2    2
    5.4097063e-09   2   -11    11

DECAY 35  335.70385
    0.6721691   2   -5    5
    0.10378936   2   -15    15
    0.042258573   2   -1000024    1000037
    0.042258573   2   -1000037    1000024
    0.025619083   2    1000023    1000025
    0.017058953   2   -1000024    1000024
    0.015045752   2   -1000005    1000005
    0.01432683   2   -2000005    2000005
    0.013749032   2    1000022    1000025
    0.0097606806   2   -1000037    1000037
    0.007874509   2    1000023    1000035
    0.0074466176   2    1000022    1000022
    0.0054692818   2    1000022    1000035
    0.0051439764   2   -1000006    1000006
    0.0047994443   2    1000025    1000025
    0.0045380773   2   -2000006    2000006
    0.0036516869   2    1000022    1000023
    0.00089448555   2   -2000006    1000006
    0.00089448555   2   -1000006    2000006
    0.0008633588   2    1000025    1000035
    0.00056093938   2   -2000015    1000015
    0.00056093938   2   -1000015    2000015
    0.0003652951   2   -13    13
    0.00024635869   2   -6    6
    0.00021053314   2   -3    3
    0.00014655565   2    1000023    1000023
    0.00014226119   2   -2000005    1000005
    0.00014226119   2   -1000005    2000005
    4.8486453e-06   2    1000035    1000035
    4.2122185e-06   2    21    21
    1.6087784e-06   2    25    25
    1.1339217e-06   2   -1000015    1000015
    5.8219062e-07   2   -1    1
    5.1922455e-07   2   -2000015    2000015
    1.1218187e-08   2    22    23
    1.0513754e-08   2    23    23
    8.2031925e-09   2   -11    11
    4.4026995e-09   2    22    22
    4.3295417e-09   2   -1000011    1000011
    4.2506375e-09   2   -1000013    1000013
    3.6230128e-09   2   -4    4
    2.1149801e-09   2   -2000011    2000011
    2.0824676e-09   2   -2000013    2000013
    1.7747711e-09   2   -24    24
    5.6323405e-10   2   -2000013    1000013
    5.6323405e-10   2   -1000013    2000013
    1.8670135e-14   2   -2    2
    1.3174298e-14   2   -2000011    1000011
    1.3174298e-14   2   -1000011    2000011

DECAY 36  300.71552
    0.64941601   2   -5    5
    0.10026475   2   -15    15
    0.045045115   2   -1000024    1000037
    0.045045115   2   -1000037    1000024
    0.024828851   2    1000023    1000025
    0.021322112   2   -1000024    1000024
    0.017618641   2    1000022    1000025
    0.016535267   2   -2000005    1000005
    0.016535267   2   -1000005    2000005
    0.013118955   2   -1000037    1000037
    0.0094181133   2    1000022    1000022
    0.0075679725   2    1000022    1000035
    0.0070429318   2    1000023    1000035
    0.0064283696   2    1000025    1000025
    0.0063990866   2   -2000006    1000006
    0.0063990866   2   -1000006    2000006
    0.0035212035   2    1000022    1000023
    0.001285492   2    1000025    1000035
    0.0006265432   2   -2000015    1000015
    0.0006265432   2   -1000015    2000015
    0.00035289643   2   -13    13
    0.00022109369   2   -6    6
    0.00020335192   2   -3    3
    0.00016211776   2    1000023    1000023
    9.4837438e-06   2    1000035    1000035
    4.9757115e-06   2    21    21
    5.6233283e-07   2   -1    1
    3.5306527e-08   2    22    23
    3.1838884e-08   2    23    25
    2.1320645e-08   2    22    22
    7.9246551e-09   2   -11    11
    2.9880292e-09   2   -4    4
    6.2618721e-10   2   -2000013    1000013
    6.2618721e-10   2   -1000013    2000013
    1.4342814e-10   2    23    35
    1.5399815e-14   2   -2    2
    1.4646583e-14   2   -2000011    1000011
    1.4646583e-14   2   -1000011    2000011
    1.9443825e-37   2    25    25

DECAY 37  282.25885
    0.62711008   2   -5    6
    0.11017114   2   -15    16
    0.067541823   2    1000022    1000037
    0.065470656   2    1000024    1000025
    0.056163568   2    1000023    1000037
    0.025278317   2   -1000005    2000006
    0.013956349   2    1000024    1000035
    0.013068278   2   -2000005    1000006
    0.0096126216   2    1000023    1000024
    0.0062423844   2   -2000005    2000006
    0.0024211959   2    1000035    1000037
    0.0013360658   2   -1000015    1000016
    0.00093096534   2   -5    4
    0.00038949415   2   -13    14
    0.00022435689   2   -3    4
    5.3914834e-05   2   -1000005    1000006
    1.0564898e-05   2   -3    2
    7.9464176e-06   2    1000022    1000024
    6.6480519e-06   2   -5    2
    1.846108e-06   2    1000025    1000037
    6.2920707e-07   2   -3    6
    6.2309922e-07   2   -1    2
    4.0344125e-07   2   -2000015    1000016
    3.3781174e-08   2    24    25
    2.937852e-08   2   -1    4
    2.0235614e-08   2   -1000011    1000012
    2.0103619e-08   2   -1000013    1000014
    1.3476364e-08   2   -1    6
    9.1103086e-09   2   -11    12
    1.3543345e-09   2   -2000013    1000014
    3.1679382e-14   2   -2000011    1000012
    1.0914559e-14   2    24    35

DECAY 6  2.43
    1   2    5    24

DECAY 15 -1
