BLOCK SPINFO
   1   SPheno
   2   v4.0.5be

BLOCK SPHENOINFO
   1   2
   2   2

BLOCK MODSEL
   1   0

BLOCK MINPAR
   3    56.192019
   4    1

BLOCK EXTPAR
   0    1327.5914
   1   -939.84304
   2    766.17905
   3    3000
   11   -3129.33
   12   -303.16669
   13   -95.956266
   23    142.66445
   25    56.185985
   26    4734.239
   31    1543.8787
   32    1543.8787
   33    1305.7936
   34    1891.2318
   35    1891.2318
   36    1084.2552
   41    5000
   42    5000
   43    1802.4844
   44    5000
   45    5000
   46    1074.8914
   47    5000
   48    5000
   49    1793.9143

BLOCK SMINPUTS
   1    127.90897
   2    1.1663787e-05
   3    0.1184
   4    91.1876
   5    4.18
   6    173.2
   7    1.777
   8    0
   11    0.00051099893
   12    0
   13    0.10565837
   14    0
   21    0.005
   22    0.0025
   23    0.095
   24    1.27

BLOCK GAUGE Q=  1327.5914
   1    0.35536298
   2    0.66519887
   3    1.219778

BLOCK YU Q=  1327.5914
   1   1    8.3857e-06
   2   2    0.0042599356
   3   3    1.0130599

BLOCK YD Q=  1327.5914
   1   1    0.00094677672
   2   2    0.017988758
   3   3    0.93890583

BLOCK YE Q=  1327.5914
   1   1    0.00016521946
   2   2    0.034162144
   3   3    0.57455107

BLOCK AU Q=  1327.5914
   1   1    0
   2   2    0
   3   3   -3129.3302

BLOCK AD Q=  1327.5914
   1   1    0
   2   2    0
   3   3   -303.16664

BLOCK AE Q=  1327.5914
   1   1    0
   2   2    0
   3   3   -95.956266

BLOCK MSOFT Q=  1327.5914
   1   -939.84304
   2    766.17905
   3    3000
   21    22219086
   22    7875.6553
   31    1543.8787
   32    1543.8787
   33    1305.7936
   34    1891.2318
   35    1891.2318
   36    1084.2552
   41    5000
   42    5000
   43    1802.4844
   44    5000
   45    5000
   46    1074.8914
   47    5000
   48    5000
   49    1793.9143

BLOCK MASS
   6    173.2
   23    91.1876
   24    80.429995
   15    1.777
   25    124.05273
   35    4727.0906
   36    4734.239
   37    4728.297
   1000001    5020.9343
   2000001    5010.4259
   1000002    5020.4889
   2000002    5014.7356
   1000003    5020.9488
   2000003    5010.4532
   1000004    5020.5032
   2000004    5014.7366
   1000005    1807.0046
   2000005    1859.3465
   1000006    959.93187
   2000006    1836.0667
   1000011    1553.4352
   2000011    1887.0332
   1000012    1551.0156
   1000013    1553.4985
   2000013    1887.1323
   1000014    1551.0779
   1000015    1127.8938
   2000015    1338.1542
   1000016    1335.2007
   1000021    3177.9005
   1000022    139.48598
   1000023   -146.23536
   1000025    816.93257
   1000035   -944.23299
   1000024    142.07466
   1000037    817.09476

BLOCK ALPHA
      -0.017814556

BLOCK HMIX Q=  1327.5914
   1    142.66445
   2    56.185985
   3    244.12083
   4    22413018

BLOCK STOPMIX
   1   1    0.19030628
   1   2    0.98172477
   2   1   -0.98172477
   2   2    0.19030628

BLOCK SBOTMIX
   1   1    0.99441619
   1   2    0.10552933
   2   1   -0.10552933
   2   2    0.99441619

BLOCK STAUMIX
   1   1    0.028146171
   1   2    0.99960382
   2   1   -0.99960382
   2   2    0.028146171

BLOCK NMIX
   1   1   -0.029044767
   1   2   -0.085316656
   1   3    0.71437378
   1   4   -0.69393629
   2   1    0.038941698
   2   2    0.059060716
   2   3    0.69945642
   2   4    0.71116531
   3   1    0.0025785526
   3   2   -0.99459941
   3   3   -0.019729855
   3   4    0.10186312
   4   1    0.99881595
   4   2   -0.0022159238
   4   3   -0.0064459584
   4   4   -0.048168896

BLOCK UMIX
   1   1   -0.028029579
   1   2    0.99960709
   2   1    0.99960709
   2   2    0.028029579

BLOCK VMIX
   1   1   -0.14467682
   1   2    0.98947896
   2   1    0.98947896
   2   2    0.14467682

BLOCK HIGGSBOUNDSINPUTHIGGSCOUPLINGSFERMIONS
       0, 3156.8649,3,36,15,15

BLOCK HIGGSBOUNDSINPUTHIGGSCOUPLINGSBOSONS
       0,4,36,21,21,23

BLOCK SPHENOLOWENERGY
   1    0.00023526222
   2    1.6155778e-06
   3    3.5255662e-05
   4    3.4365895e-15
   5    1.4680332e-10
   6    3.0513604e-08
   7    1.1557993e-13
   8    4.9374431e-09
   9    1.0399878e-06
   10    9.6176528e-05
   11    0.99346671
   12    0.54296496
   13    19.394897
   14    0
   15    0
   16    0.0021609599
   17    2.2816961e-15
   18    2.4792152e-11
   19    8.2888465e-11
   20    1.0258031e-14
   21    4.3861781e-10
   22    1.4653618e-07
   23    0
   24    0
   25    0
   26    0
   27    0
   28    0
   29    0
   30    0
   31    0
   39    8.1837544e-05
   40    0
   41    0
   42    0

BLOCK FWCOEF Q=  160
   305   4422   0   0   -0.18881911
   305   4422   0   2   -0.076039308
   305   4322   0   2    0.00065339165
   305   6421   0   0   -0.095227835
   305   6421   0   2   -0.044138733
   305   6321   0   2    0.00019426299
   3051111   4133   0   0    1.5884668
   3051111   4133   0   2    1.5904145
   3051111   4233   0   2    0.00044013729
   3051111   4137   0   0   -4.4111589
   3051111   4137   0   2   -4.4098783
   3051111   4237   0   2   -0.003442843
   3051313   4133   0   0    1.5884668
   3051313   4133   0   2    1.5904078
   3051313   4233   0   2    0.00044013442
   3051313   4137   0   0   -4.4111589
   3051313   4137   0   2   -4.4098849
   3051313   4237   0   2   -0.0034428519
   3051212   4137   0   0    1.5053501
   3051212   4137   0   2    1.5050836
   3051212   4237   0   2    0.00075092203
   3051414   4137   0   0    1.5053501
   3051414   4137   0   2    1.5050836
   3051414   4237   0   2    0.00075092208
   3051616   4137   0   0    1.5053501
   3051616   4137   0   2    1.5050839
   3051616   4237   0   2    0.00075093515

BLOCK IMFWCOEF Q=  160
   305   4422   0   0    3.8585194e-07
   305   4422   0   2    3.8590977e-05
   305   4322   0   2    1.2705529e-05
   305   6421   0   0    3.3050771e-07
   305   6421   0   2   -2.9783851e-06
   305   6321   0   2    4.8409249e-06
   3051111   4133   0   2   -5.5779432e-07
   3051111   4233   0   2    8.492819e-06
   3051111   4137   0   2    6.0755122e-06
   3051111   4237   0   2   -6.6440135e-05
   3051313   4133   0   2   -5.5797152e-07
   3051313   4233   0   2    8.4927735e-06
   3051313   4137   0   2    6.0755372e-06
   3051313   4237   0   2   -6.6440299e-05
   3051212   4137   0   2   -1.1155888e-06
   3051212   4237   0   2    1.4491328e-05
   3051414   4137   0   2   -1.1155862e-06
   3051414   4237   0   2    1.4491328e-05
   3051616   4137   0   2   -1.1125686e-06
   3051616   4237   0   2    1.4491328e-05

DECAY 23  2.4952


DECAY 24  2.085


DECAY 1000011  11.5688
    0.61797694   2   -1000037    12
    0.30514626   2    1000025    11
    0.066347637   2    1000035    11
    0.0059126795   2    1000022    11
    0.0037032635   2    1000023    11
    0.00091321948   2   -1000024    12

DECAY 2000011  5.3375813
    0.99584802   2    1000035    11
    0.0026616592   2    1000023    11
    0.0014823298   2    1000022    11

DECAY 1000013  11.605465
    0.6160881   2   -1000037    14
    0.30421429   2    1000025    13
    0.066147075   2    1000035    13
    0.0074547264   2    1000022    13
    0.0051854308   2    1000023    13
    0.00091037272   2   -1000024    14

DECAY 2000013  5.4248862
    0.97994179   2    1000035    13
    0.0079790944   2   -1000024    14
    0.006522927   2    1000023    13
    0.0055353474   2    1000022    13

DECAY 1000015  14.870548
    0.48255218   2   -1000024    16
    0.24791   2    1000022    15
    0.23552273   2    1000023    15
    0.03401131   2    1000035    15

DECAY 2000015  16.036858
    0.28884935   2   -1000037    16
    0.27601748   2    1000022    15
    0.2646968   2    1000023    15
    0.14275423   2    1000025    15
    0.026219564   2    1000035    15
    0.00073939675   2    1000015    25
    0.00071325441   2    1000015    23

DECAY 1000012  11.613217
    0.60082441   2    1000037    11
    0.30446364   2    1000025    12
    0.066851008   2    1000035    12
    0.02419787   2    1000024    11
    0.0028179182   2    1000022    12
    0.00084515951   2    1000023    12

DECAY 1000014  11.649802
    0.59900001   2    1000037    13
    0.30353841   2    1000025    14
    0.066650048   2    1000035    14
    0.027159811   2    1000024    13
    0.0028091853   2    1000022    14
    0.00084254041   2    1000023    14

DECAY 1000016  16.073344
    0.54774721   2    1000024    15
    0.28031902   2    1000037    15
    0.14197213   2    1000025    16
    0.026230397   2    1000035    16
    0.0017427176   2    1000022    16
    0.0014661389   2    1000015    24
    0.00052238309   2    1000023    16

DECAY 2000001  143.89775
    0.9819125   2    1000021    1
    0.01804034   2    1000035    1

DECAY 1000001  205.88789
    0.6915871   2    1000021    1
    0.20329756   2   -1000037    2
    0.100728   2    1000025    1
    0.003238964   2    1000035    1
    0.00068861113   2    1000022    1
    0.00029137289   2    1000023    1
    0.00016839314   2   -1000024    2

DECAY 2000003  143.96484
    0.98147468   2    1000021    3
    0.018032055   2    1000035    3
    0.00022351825   2   -1000024    4
    0.00013884435   2    1000023    3
    0.0001305307   2    1000022    3

DECAY 1000003  205.92359
    0.69147452   2    1000021    3
    0.20326314   2   -1000037    4
    0.10071091   2    1000025    3
    0.0032384194   2    1000035    3
    0.00076825306   2    1000022    3
    0.00036777651   2    1000023    3
    0.00017696782   2   -1000024    4

DECAY 1000005  134.34492
    0.38995979   2    1000006   -24
    0.26038834   2   -1000024    6
    0.12053025   2    1000022    5
    0.1133954   2    1000023    5
    0.078270555   2   -1000037    6
    0.036449371   2    1000025    5
    0.0010062899   2    1000035    5

DECAY 2000005  65.399363
    0.48410255   2   -1000024    6
    0.24905369   2    1000022    5
    0.24235821   2    1000023    5
    0.01050263   2    1000006   -24
    0.00876443   2    1000035    5
    0.0035223758   2   -1000037    6
    0.0016961112   2    1000025    5

DECAY 2000002  152.16433
    0.93151772   2    1000021    2
    0.068308414   2    1000035    2
    0.00011141613   2    1000023    2

DECAY 1000002  205.88477
    0.69137222   2    1000021    2
    0.19918219   2    1000037    1
    0.10053379   2    1000025    2
    0.0044864103   2    1000024    1
    0.0030812331   2    1000035    2
    0.00087749268   2    1000022    2
    0.00046667275   2    1000023    2

DECAY 2000004  152.16798
    0.93149563   2    1000021    4
    0.068306795   2    1000035    4
    0.00011742137   2    1000023    4

DECAY 1000004  205.92039
    0.69125958   2    1000021    4
    0.19914848   2    1000037    3
    0.10051681   2    1000025    4
    0.0046417915   2    1000024    3
    0.0030807304   2    1000035    4
    0.00088157341   2    1000022    4
    0.00047103593   2    1000023    4

DECAY 1000006  36.088003
    0.52456627   2    1000024    5
    0.24196243   2    1000023    6
    0.23342474   2    1000022    6

DECAY 2000006  144.6951
    0.23355385   2    1000006    25
    0.21407962   2    1000024    5
    0.19144267   2    1000006    23
    0.12665807   2    1000023    6
    0.11987922   2    1000022    6
    0.073889362   2    1000037    5
    0.039435362   2    1000025    6
    0.0010618476   2    1000035    6

DECAY 1000024  1.074654e-10
    0.50191129   3    1000022   -1    2
    0.16730888   3    1000022   -11    12
    0.16592901   3    1000022   -13    14
    0.15208819   3    1000022   -3    4
    0.01276263   3    1000022   -15    16

DECAY 1000037  7.1782956
    0.25983824   2    1000023    24
    0.24944592   2    1000024    23
    0.24688057   2    1000022    24
    0.23546292   2    1000024    25
    0.003102143   3    1000023   -5    6
    0.0030863811   3    1000022   -5    6
    0.0021229077   3    1000024    6   -6

DECAY 1000022 -1


DECAY 1000023  7.2867933e-08
    0.40522255   2    1000022    22
    0.12564536   3    1000022    12   -12
    0.093953657   3    1000022    1   -1
    0.093737195   3    1000022    3   -3
    0.073275791   3    1000022    2   -2
    0.04527512   3    1000022    4   -4
    0.023193323   3    1000024    1   -2
    0.023193323   3   -1000024   -1    2
    0.021201618   3    1000022    11   -11
    0.021125256   3    1000022    13   -13
    0.014816717   3    1000024    3   -4
    0.014816717   3   -1000024   -3    4
    0.0077311989   3    1000024    11   -12
    0.0077311989   3   -1000024   -11    12
    0.0077064428   3    1000024    13   -14
    0.0077064428   3   -1000024   -13    14
    0.0072256524   3    1000022    15   -15
    0.0032212203   3    1000024    15   -16
    0.0032212203   3   -1000024   -15    16

DECAY 1000025  7.7799851
    0.23678357   2    1000024   -24
    0.23678357   2   -1000024    24
    0.162993   2    1000023    23
    0.14299881   2    1000022    25
    0.14264755   2    1000023    25
    0.070765081   2    1000022    23
    0.0027268773   3    1000024    5   -6
    0.0027268773   3   -1000024   -5    6
    0.00075305682   3    1000023    6   -6
    0.00075300776   3    1000022    6   -6

DECAY 1000035  2.6683187
    0.23641478   2    1000024   -24
    0.23641478   2   -1000024    24
    0.14650133   2    1000022    23
    0.14179249   2    1000022    25
    0.13894914   2    1000023    25
    0.089078752   2    1000023    23
    0.0036958662   3    1000024    5   -6
    0.0036958662   3   -1000024   -5    6
    0.0012195418   3    1000023    6   -6
    0.0011910476   3    1000022    6   -6
    0.00021113537   3    1000022    15   -15
    0.00020654379   3    1000024    15   -16
    0.00020654379   3   -1000024   -15    16
    0.00019976593   3    1000023    15   -15

DECAY 1000021  203.53689
    0.18218582   2    1000006   -6
    0.18218582   2   -1000006    6
    0.10830373   2    2000006   -6
    0.10830373   2   -2000006    6
    0.10572189   2    1000005   -5
    0.10572189   2   -1000005    5
    0.100033   2    2000005   -5
    0.100033   2   -2000005    5
    0.0034769837   2    1000006   -4
    0.0034769837   2   -1000006    4
    0.00029258071   3    1000035    6   -6

DECAY 25  0.0037449222
    0.58712451   2   -5    5
    0.21403864   2   -24    24
    0.072614798   2    21    21
    0.067480069   2   -15    15
    0.029072923   2   -4    4
    0.025424627   2    23    23
    0.0023649254   2    22    22
    0.0014242588   2    22    23
    0.00023401674   2   -13    13
    0.00022047106   2   -3    3
    6.0957965e-07   2   -1    1
    1.4982225e-07   2   -2    2
    5.2609682e-09   2   -11    11

DECAY 35  248.04729
    0.6292808   2   -5    5
    0.12572499   2   -15    15
    0.071997147   2   -1000024    1000037
    0.071997147   2   -1000037    1000024
    0.037484462   2    1000023    1000025
    0.035489637   2    1000022    1000025
    0.010378058   2    1000023    1000035
    0.010301358   2    1000022    1000035
    0.0035661981   2   -1000024    1000024
    0.00058943716   2   -2000005    1000005
    0.00058943716   2   -1000005    2000005
    0.00043374297   2   -13    13
    0.00043325426   2    1000022    1000022
    0.00028631383   2   -2000005    2000005
    0.00027185734   2   -1000005    1000005
    0.00023410192   2   -3    3
    0.00022205446   2   -6    6
    0.00014003531   2   -2000006    1000006
    0.00014003531   2   -1000006    2000006
    0.00013449994   2    1000023    1000023
    9.972167e-05   2   -1000037    1000037
    5.0396735e-05   2    1000025    1000025
    4.6922353e-05   2    1000022    1000023
    2.2555015e-05   2    1000025    1000035
    2.1458675e-05   2   -2000006    2000006
    2.0189179e-05   2   -2000015    1000015
    2.0189179e-05   2   -1000015    2000015
    1.7425443e-05   2   -1000006    1000006
    3.8630643e-06   2    21    21
    1.7523184e-06   2    1000035    1000035
    6.4719891e-07   2   -1    1
    1.0950152e-07   2   -2000015    2000015
    6.373713e-08   2    25    25
    2.2342373e-08   2    23    23
    1.9331743e-08   2   -1000015    1000015
    9.7401688e-09   2   -11    11
    5.502016e-09   2   -1000011    1000011
    5.4167622e-09   2   -1000013    1000013
    3.9188676e-09   2   -24    24
    3.467507e-09   2    22    23
    3.198434e-09   2   -4    4
    2.8196486e-09   2   -2000011    2000011
    2.7671997e-09   2   -2000013    2000013
    2.9175232e-10   2    22    22
    4.2246544e-11   2   -2000013    1000013
    4.2246544e-11   2   -1000013    2000013
    1.6486676e-14   2   -2    2
    9.8815304e-16   2   -2000011    1000011
    9.8815304e-16   2   -1000011    2000011

DECAY 36  224.54011
    0.60761381   2   -5    5
    0.12141686   2   -15    15
    0.079599925   2   -1000024    1000037
    0.079599925   2   -1000037    1000024
    0.042890977   2    1000022    1000025
    0.03781245   2    1000023    1000025
    0.011931815   2    1000022    1000035
    0.010954171   2    1000023    1000035
    0.004016034   2   -1000024    1000024
    0.00096035843   2   -2000005    1000005
    0.00096035843   2   -1000005    2000005
    0.0005154087   2    1000022    1000022
    0.00041887933   2   -13    13
    0.0002260313   2   -3    3
    0.00020665546   2   -6    6
    0.00017754327   2   -2000006    1000006
    0.00017754327   2   -1000006    2000006
    0.00017708363   2   -1000037    1000037
    0.00013893214   2    1000023    1000023
    8.9099817e-05   2    1000025    1000025
    4.0128381e-05   2    1000022    1000023
    2.268152e-05   2    1000025    1000035
    2.2343921e-05   2   -2000015    1000015
    2.2343921e-05   2   -1000015    2000015
    6.5381298e-06   2    21    21
    1.3508312e-06   2    1000035    1000035
    6.2488339e-07   2   -1    1
    6.3780515e-08   2    23    25
    2.9796226e-08   2    22    23
    2.2373706e-08   2    22    22
    9.4064487e-09   2   -11    11
    2.9532748e-09   2   -4    4
    9.1483437e-11   2    23    35
    4.643136e-11   2   -2000013    1000013
    4.643136e-11   2   -1000013    2000013
    1.5223061e-14   2   -2    2
    1.0860343e-15   2   -2000011    1000011
    1.0860343e-15   2   -1000011    2000011
    1.4094672e-39   2    25    25

DECAY 37  254.51
    0.64301874   2   -5    6
    0.11731257   2   -15    16
    0.0737884   2    1000022    1000037
    0.070890161   2    1000024    1000025
    0.069892923   2    1000023    1000037
    0.019815722   2    1000024    1000035
    0.0017684818   2   -1000005    2000006
    0.00095438047   2   -5    4
    0.00095221685   2    1000023    1000024
    0.00042029544   2    1000022    1000024
    0.00041474164   2   -13    14
    0.00023181399   2   -1000005    1000006
    0.0002084755   2   -3    4
    0.00013226135   2   -2000005    2000006
    9.9557074e-05   2   -2000005    1000006
    4.1800989e-05   2    1000035    1000037
    3.9456855e-05   2   -1000015    1000016
    9.8132632e-06   2   -3    2
    6.8152602e-06   2   -5    2
    6.2798373e-07   2   -3    6
    5.7834723e-07   2   -1    2
    5.6071944e-08   2    24    25
    2.7276398e-08   2   -1    4
    2.1071328e-08   2   -1000011    1000012
    2.0954537e-08   2   -1000013    1000014
    1.7728697e-08   2   -2000015    1000016
    1.4517259e-08   2   -1    6
    9.7008501e-09   2   -11    12
    1.0143289e-09   2    1000025    1000037
    8.3748576e-11   2   -2000013    1000014
    1.3672125e-14   2    24    35
    1.9590036e-15   2   -2000011    1000012

DECAY 6  2.43
    1   2    5    24

DECAY 15 -1
