BLOCK SPINFO
   1   SPheno
   2   v4.0.5be

BLOCK SPHENOINFO
   1   2
   2   2

BLOCK MODSEL
   1   0

BLOCK MINPAR
   3    12.235485
   4    1

BLOCK EXTPAR
   0    1918.5263
   1   -950.09668
   2    566.4028
   3    3000
   11    4897.3774
   12   -989.73842
   13   -554.79773
   23    133.49537
   25    11.697918
   26    1964.0872
   31    1362.1911
   32    1362.1911
   33    1467.4718
   34    822.02387
   35    822.02387
   36    569.43546
   41    5000
   42    5000
   43    1964.9934
   44    5000
   45    5000
   46    1961.5249
   47    5000
   48    5000
   49    905.35898

BLOCK SMINPUTS
   1    127.90897
   2    1.1663787e-05
   3    0.1184
   4    91.1876
   5    4.18
   6    173.2
   7    1.777
   8    0
   11    0.00051099893
   12    0
   13    0.10565837
   14    0
   21    0.005
   22    0.0025
   23    0.095
   24    1.27

BLOCK GAUGE Q=  1918.5263
   1    0.35536298
   2    0.66519887
   3    1.219778

BLOCK YU Q=  1918.5263
   1   1    8.4149518e-06
   2   2    0.0042747955
   3   3    1.0165938

BLOCK YD Q=  1918.5263
   1   1    0.00019780645
   2   2    0.0037583225
   3   3    0.19616201

BLOCK YE Q=  1918.5263
   1   1    3.4518671e-05
   2   2    0.0071373664
   3   3    0.12003876

BLOCK AU Q=  1918.5263
   1   1    0
   2   2    0
   3   3    4897.3774

BLOCK AD Q=  1918.5263
   1   1    0
   2   2    0
   3   3   -989.73842

BLOCK AE Q=  1918.5263
   1   1    0
   2   2    0
   3   3   -554.79773

BLOCK MSOFT Q=  1918.5263
   1   -950.09668
   2    566.4028
   3    3000
   21    3816163.6
   22    102286.43
   31    1362.1911
   32    1362.1911
   33    1467.4718
   34    822.02387
   35    822.02387
   36    569.43546
   41    5000
   42    5000
   43    1964.9934
   44    5000
   45    5000
   46    1961.5249
   47    5000
   48    5000
   49    905.35898

BLOCK MASS
   6    173.2
   23    91.1876
   24    80.429995
   15    1.777
   25    126.46446
   35    1963.9033
   36    1964.0872
   37    1965.7142
   1000001    5046.7311
   2000001    5035.8142
   1000002    5046.2834
   2000002    5036.2765
   1000003    5046.7314
   2000003    5035.8144
   1000004    5046.2837
   2000004    5036.2769
   1000005    978.22186
   2000005    1969.3553
   1000006    1748.5059
   2000006    2105.0791
   1000011    1366.0741
   2000011    834.72739
   1000012    1363.4682
   1000013    1366.0728
   2000013    834.72378
   1000014    1363.467
   1000015    585.53074
   2000015    1470.9298
   1000016    1468.4889
   1000021    3222.4124
   1000022    135.56373
   1000023   -145.26473
   1000025    610.47824
   1000035   -943.58391
   1000024    137.87246
   1000037    610.73723

BLOCK ALPHA
      -0.082037917

BLOCK HMIX Q=  1918.5263
   1    133.49537
   2    11.697918
   3    243.69329
   4    3857638.6

BLOCK STOPMIX
   1   1   -0.64272688
   1   2    0.7660954
   2   1   -0.7660954
   2   2   -0.64272688

BLOCK SBOTMIX
   1   1    0.0018896104
   1   2    0.99999821
   2   1   -0.99999821
   2   2    0.0018896104

BLOCK STAUMIX
   1   1    0.0021452011
   1   2    0.9999977
   2   1   -0.9999977
   2   2    0.0021452011

BLOCK NMIX
   1   1   -0.03056691
   1   2   -0.12848446
   1   3    0.71452249
   1   4   -0.6870335
   2   1    0.036082612
   2   2    0.070582472
   2   3    0.69828406
   2   4    0.71141797
   3   1    0.0041426173
   3   2   -0.98919371
   3   3   -0.042975254
   3   4    0.14011341
   4   1    0.99887264
   4   2   -0.0023790038
   4   3   -0.0031807236
   4   4   -0.047304075

BLOCK UMIX
   1   1   -0.060873808
   1   2    0.99814547
   2   1    0.99814547
   2   2    0.060873808

BLOCK VMIX
   1   1   -0.19915713
   1   2    0.97996757
   2   1    0.97996757
   2   2    0.19915713

BLOCK HIGGSBOUNDSINPUTHIGGSCOUPLINGSFERMIONS
       0, 136.84128,3,36,15,15

BLOCK HIGGSBOUNDSINPUTHIGGSCOUPLINGSBOSONS
       0,4,36,21,21,23

BLOCK SPHENOLOWENERGY
   1    0.00034282799
   2    1.5867428e-06
   3    3.5222721e-05
   4    2.4099322e-15
   5    1.0294959e-10
   6    2.1553106e-08
   7    8.0992421e-14
   8    3.4599946e-09
   9    7.3395091e-07
   10    9.6576457e-05
   11    0.99759783
   12    0.54279122
   13    19.393343
   14    0
   15    0
   16    0.0021608031
   17    2.281694e-15
   18    2.4786167e-11
   19    8.286703e-11
   20    2.1962182e-15
   21    9.3894744e-11
   22    2.4618578e-08
   23    0
   24    0
   25    0
   26    0
   27    0
   28    0
   29    0
   30    0
   31    0
   39    1.7109783e-05
   40    0
   41    0
   42    0

BLOCK FWCOEF Q=  160
   305   4422   0   0   -0.18881911
   305   4422   0   2   -0.21312454
   305   4322   0   2   -0.00033360507
   305   6421   0   0   -0.095227835
   305   6421   0   2   -0.1173276
   305   6321   0   2   -0.00035578234
   3051111   4133   0   0    1.6004671
   3051111   4133   0   2    1.6010881
   3051111   4233   0   2    2.461903e-05
   3051111   4137   0   0   -4.4231592
   3051111   4137   0   2   -4.4184864
   3051111   4237   0   2   -0.00018801148
   3051313   4133   0   0    1.6004671
   3051313   4133   0   2    1.6010879
   3051313   4233   0   2    2.4619008e-05
   3051313   4137   0   0   -4.4231592
   3051313   4137   0   2   -4.4184867
   3051313   4237   0   2   -0.00018801149
   3051212   4137   0   0    1.5053501
   3051212   4137   0   2    1.5043523
   3051212   4237   0   2    4.0894552e-05
   3051414   4137   0   0    1.5053501
   3051414   4137   0   2    1.5043523
   3051414   4237   0   2    4.0894555e-05
   3051616   4137   0   0    1.5053501
   3051616   4137   0   2    1.5043521
   3051616   4237   0   2    4.0895253e-05

BLOCK IMFWCOEF Q=  160
   305   4422   0   0    3.8581633e-07
   305   4422   0   2    1.0102653e-05
   305   4322   0   2   -1.5465701e-06
   305   6421   0   0    3.304772e-07
   305   6421   0   2   -3.8318261e-06
   305   6321   0   2   -7.9700524e-07
   3051111   4133   0   2   -1.5348579e-06
   3051111   4233   0   2    5.6581522e-07
   3051111   4137   0   2    1.3484122e-05
   3051111   4237   0   2   -4.3285322e-06
   3051313   4133   0   2   -1.5348588e-06
   3051313   4233   0   2    5.6581503e-07
   3051313   4137   0   2    1.3484126e-05
   3051313   4237   0   2   -4.3285327e-06
   3051212   4137   0   2   -2.5904347e-06
   3051212   4237   0   2    9.4151149e-07
   3051414   4137   0   2   -2.5904346e-06
   3051414   4237   0   2    9.4151149e-07
   3051616   4137   0   2   -2.5928323e-06
   3051616   4237   0   2    9.4151134e-07

DECAY 23  2.4952


DECAY 24  2.085


DECAY 2000011  0.0088697619
    0.57942503   2    1000023    11
    0.41881725   2    1000022    11
    0.0017556151   2    1000025    11

DECAY 1000011  12.100383
    0.63388539   2   -1000037    12
    0.31002328   2    1000025    11
    0.038343379   2    1000035    11
    0.010216519   2    1000022    11
    0.0039233501   2    1000023    11
    0.0036080817   2   -1000024    12

DECAY 2000013  0.010465772
    0.52814252   2    1000023    13
    0.39407518   2    1000022    13
    0.076197307   2   -1000024    14
    0.0015203207   2    1000025    13

DECAY 1000013  12.101718
    0.63381426   2   -1000037    14
    0.30998866   2    1000025    13
    0.038338979   2    1000035    13
    0.010272619   2    1000022    13
    0.0039774726   2    1000023    13
    0.00360768   2   -1000024    14

DECAY 1000015  0.30432127
    0.49097686   2   -1000024    16
    0.26109811   2    1000022    15
    0.24792503   2    1000023    15

DECAY 2000015  14.44107
    0.61189662   2   -1000037    16
    0.2992918   2    1000025    15
    0.043817939   2    1000035    15
    0.023853967   2    1000022    15
    0.017536141   2    1000023    15
    0.0032232127   2   -1000024    16
    0.00020176478   2    1000015    23
    0.00017855755   2    1000015    25

DECAY 1000012  12.159878
    0.60569865   2    1000037    11
    0.3100929   2    1000025    12
    0.038498022   2    1000035    12
    0.038354265   2    1000024    11
    0.0060859306   2    1000022    12
    0.0012702358   2    1000023    12

DECAY 1000014  12.161206
    0.60563168   2    1000037    13
    0.31005845   2    1000025    14
    0.038493649   2    1000035    14
    0.038460871   2    1000024    13
    0.0060852598   2    1000022    14
    0.0012700958   2    1000023    14

DECAY 1000016  14.49747
    0.58579208   2    1000037    15
    0.2998357   2    1000025    16
    0.063153677   2    1000024    15
    0.044153644   2    1000035    16
    0.0055129599   2    1000022    16
    0.0011510708   2    1000023    16
    0.00040087174   2    1000015    24

DECAY 2000001  141.23383
    0.98146378   2    1000021    1
    0.018491385   2    1000035    1

DECAY 1000001  205.12475
    0.68129372   2    1000021    1
    0.20950694   2   -1000037    2
    0.10303906   2    1000025    1
    0.0032767805   2    1000035    1
    0.0016370906   2    1000022    1
    0.00080137857   2   -1000024    2
    0.00044502461   2    1000023    1

DECAY 2000003  141.23667
    0.9814442   2    1000021    3
    0.018491015   2    1000035    3

DECAY 1000003  205.12802
    0.68128298   2    1000021    3
    0.20950396   2   -1000037    4
    0.10303744   2    1000025    3
    0.0032767285   2    1000035    3
    0.001640579   2    1000022    3
    0.00080993985   2   -1000024    4
    0.00044837398   2    1000023    3

DECAY 1000005  1.392857
    0.48139836   2   -1000024    6
    0.26478599   2    1000022    5
    0.25115573   2    1000023    5
    0.001879102   2    1000035    5
    0.00048107437   2   -1000037    6
    0.00029974212   2    1000025    5

DECAY 2000005  78.792045
    0.48135561   2   -1000024    6
    0.2087052   2    1000006   -24
    0.19856498   2   -1000037    6
    0.088123461   2    1000025    5
    0.011309736   2    1000022    5
    0.0096851699   2    1000023    5
    0.0021220468   2    1000035    5

DECAY 2000002  149.13675
    0.92977697   2    1000021    2
    0.070053392   2    1000035    2

DECAY 1000002  205.12044
    0.68108114   2    1000021    2
    0.20193074   2    1000037    1
    0.10272465   2    1000025    2
    0.0085770892   2    1000024    1
    0.0031058226   2    1000035    2
    0.0019394521   2    1000022    2
    0.00064109966   2    1000023    2

DECAY 2000004  149.14038
    0.9297542   2    1000021    4
    0.0700517   2    1000035    4
    0.00010422497   2    1000023    4

DECAY 1000004  205.12366
    0.68107032   2    1000021    4
    0.20192761   2    1000037    3
    0.10272322   2    1000025    4
    0.0085838122   2    1000024    3
    0.0031057939   2    1000035    4
    0.0019436342   2    1000022    4
    0.00064560695   2    1000023    4

DECAY 1000006  63.635036
    0.27212146   2    1000023    6
    0.25679195   2    1000024    5
    0.24367196   2    1000022    6
    0.13890784   2    1000037    5
    0.074363948   2    1000025    6
    0.01391137   2    1000035    6
    0.00020427719   3    1000022    24    5

DECAY 2000006  101.98947
    0.23314834   2    1000024    5
    0.21462594   2    1000023    6
    0.20920503   2    1000022    6
    0.20305332   2    1000006    23
    0.046994504   2    1000037    5
    0.037074671   2    2000005    24
    0.02872447   2    1000025    6
    0.016947433   2    1000035    6
    0.010163974   2    1000006    25

DECAY 1000024  5.8559191e-11
    0.52978481   3    1000022   -1    2
    0.17661734   3    1000022   -11    12
    0.1747884   3    1000022   -13    14
    0.11371031   3    1000022   -3    4
    0.0050991413   3    1000022   -15    16

DECAY 1000037  5.4334581
    0.26943271   2    1000023    24
    0.25007081   2    1000022    24
    0.24952103   2    1000024    23
    0.22756007   2    1000024    25
    0.0016030619   3    1000022   -5    6
    0.0013591179   3    1000023   -5    6
    0.00045056618   3    1000024    6   -6

DECAY 1000022 -1


DECAY 1000023  2.6210925e-07
    0.23563109   2    1000022    22
    0.12014474   3    1000022    12   -12
    0.089838239   3    1000022    1   -1
    0.089713538   3    1000022    3   -3
    0.070066456   3    1000022    2   -2
    0.053332227   3    1000024    1   -2
    0.053332227   3   -1000024   -1    2
    0.052615776   3    1000022    4   -4
    0.044037806   3    1000024    3   -4
    0.044037806   3   -1000024   -3    4
    0.020271555   3    1000022    11   -11
    0.020227326   3    1000022    13   -13
    0.017777661   3    1000024    11   -12
    0.017777661   3   -1000024   -11    12
    0.017753461   3    1000024    13   -14
    0.017753461   3   -1000024   -13    14
    0.01229417   3    1000024    15   -16
    0.01229417   3   -1000024   -15    16
    0.010837246   3    1000022    15   -15
    0.00026338335   3    1000022    5   -5

DECAY 1000025  5.9232011
    0.2392486   2    1000024   -24
    0.2392486   2   -1000024    24
    0.19102925   2    1000023    23
    0.15438828   2    1000022    25
    0.12320871   2    1000023    25
    0.049712173   2    1000022    23
    0.0014720649   3    1000024    5   -6
    0.0014720649   3   -1000024   -5    6
    0.00011233621   3    1000022    6   -6

DECAY 1000035  4.803774
    0.18617908   2    1000015   -15
    0.18617908   2   -1000015    15
    0.1239021   2    1000024   -24
    0.1239021   2   -1000024    24
    0.087283816   2    1000022    25
    0.068117437   2    1000022    23
    0.067176789   2    1000023    25
    0.055226311   2    1000023    23
    0.023276725   2    2000013   -13
    0.023276725   2   -2000013    13
    0.023275286   2    2000011   -11
    0.023275286   2   -2000011    11
    0.0024562186   3    1000024    5   -6
    0.0024562186   3   -1000024   -5    6
    0.00078727544   3    1000022    6   -6
    0.00076988476   3    1000023    6   -6
    0.00062516319   2    1000037   -24
    0.00062516319   2   -1000037    24
    0.00058876512   2    1000025    23
    0.00057157799   2    1000025    25

DECAY 1000021  195.8903
    0.2006549   2    1000005   -5
    0.2006549   2   -1000005    5
    0.13883204   2    1000006   -6
    0.13883204   2   -1000006    6
    0.095561515   2    2000005   -5
    0.095561515   2   -2000005    5
    0.064806062   2    2000006   -6
    0.064806062   2   -2000006    6

DECAY 25  0.004093294
    0.55100541   2   -5    5
    0.25213318   2   -24    24
    0.070465853   2    21    21
    0.063540937   2   -15    15
    0.031404019   2    23    23
    0.027031169   2   -4    4
    0.0023674645   2    22    22
    0.0016239245   2    22    23
    0.00022037682   2   -13    13
    0.00020694983   2   -3    3
    5.7219424e-07   2   -1    1
    1.3929345e-07   2   -2    2
    4.954298e-09   2   -11    11

DECAY 35  25.969309
    0.24623551   2   -1000024    1000037
    0.24623551   2   -1000037    1000024
    0.14847954   2    1000023    1000025
    0.13058561   2   -5    5
    0.10291552   2    1000022    1000025
    0.026543288   2    1000023    1000035
    0.025067513   2   -1000024    1000024
    0.024094251   2    1000022    1000035
    0.023598477   2   -15    15
    0.019217752   2   -6    6
    0.0037176309   2    1000022    1000022
    0.0010776015   2    1000023    1000023
    0.00084456161   2    1000022    1000023
    0.00066931248   2   -1000037    1000037
    0.00034859164   2    1000025    1000025
    0.00010654521   2    1000025    1000035
    9.4935422e-05   2    25    25
    8.187912e-05   2   -13    13
    5.0948196e-05   2   -3    3
    1.6760264e-05   2    23    23
    9.1207365e-06   2   -24    24
    3.9696142e-06   2    21    21
    1.6797471e-06   2   -1000015    1000015
    1.2337995e-06   2   -1000011    1000011
    1.2326663e-06   2   -1000013    1000013
    2.9216339e-07   2    22    23
    2.6862591e-07   2   -4    4
    2.053649e-07   2    22    22
    1.4085741e-07   2   -1    1
    1.0843975e-07   2    1000035    1000035
    1.8392043e-09   2   -11    11
    1.3848979e-12   2   -2    2

DECAY 36  25.838838
    0.2447281   2   -1000024    1000037
    0.2447281   2   -1000037    1000024
    0.15290308   2    1000022    1000025
    0.12715167   2   -5    5
    0.097864065   2    1000023    1000025
    0.028280831   2   -1000024    1000024
    0.028258384   2    1000022    1000035
    0.022977783   2   -15    15
    0.022703011   2    1000023    1000035
    0.019069512   2   -6    6
    0.0051971318   2    1000022    1000022
    0.0031815751   2   -1000037    1000037
    0.0016078512   2    1000025    1000025
    0.00078844302   2    1000023    1000023
    0.00031578067   2    1000022    1000023
    7.9725255e-05   2   -13    13
    6.6165878e-05   2    1000025    1000035
    4.9607234e-05   2   -3    3
    2.5481005e-05   2    21    21
    2.2638498e-05   2    23    25
    3.4789322e-07   2    22    23
    2.6940573e-07   2    22    22
    2.5762177e-07   2   -4    4
    1.3715004e-07   2   -1    1
    4.6339611e-08   2    1000035    1000035
    1.7908219e-09   2   -11    11
    1.3282872e-12   2   -2    2
    1.7234027e-36   2    25    25

DECAY 37  25.748497
    0.27087337   2    1000022    1000037
    0.25352728   2    1000024    1000025
    0.24718838   2    1000023    1000037
    0.14507788   2   -5    6
    0.050217253   2    1000024    1000035
    0.022856286   2   -15    16
    0.0074827022   2    1000023    1000024
    0.0022352572   2    1000022    1000024
    0.00018474865   2   -5    4
    0.00017246647   2    1000035    1000037
    8.0805207e-05   2   -13    14
    4.5940033e-05   2   -3    4
    2.9778018e-05   2   -3    6
    2.2808424e-05   2    24    25
    2.1284172e-06   2   -3    2
    1.362699e-06   2   -1    6
    1.3192937e-06   2   -5    2
    1.2672966e-07   2   -1    2
    8.6606104e-08   2    1000025    1000037
    1.8455937e-08   2   -1    4
    1.8900422e-09   2   -11    12
    1.0289653e-12   2    24    35
    6.0241196e-13   2    24    36

DECAY 6  2.43
    1   2    5    24

DECAY 15 -1
