BLOCK SPINFO
   1   SPheno
   2   v4.0.5be

BLOCK SPHENOINFO
   1   2
   2   2

BLOCK MODSEL
   1   0

BLOCK MINPAR
   3    17.331359
   4    1

BLOCK EXTPAR
   0    2688.5692
   1   -218.62807
   2    3165.4152
   3    2492.3606
   11    5591.7191
   12    4695.503
   13   -5974.1464
   23    231.5064
   25    16.561766
   26    2458.1412
   31    1038.3112
   32    1038.3112
   33    2502.1363
   34    905.22865
   35    905.22865
   36    1770.4124
   41    4015.5055
   42    4015.5055
   43    4281.2587
   44    1998.2945
   45    1998.2945
   46    1585.4538
   47    2860.9199
   48    2860.9199
   49    4009.8372

BLOCK SMINPUTS
   1    127.90897
   2    1.1663787e-05
   3    0.1184
   4    91.1876
   5    4.18
   6    173.2
   7    1.777
   8    0
   11    0.00051099893
   12    0
   13    0.10565837
   14    0
   21    0.005
   22    0.0025
   23    0.095
   24    1.27

BLOCK GAUGE Q=  2688.5692
   1    0.35536298
   2    0.66519887
   3    1.219778

BLOCK YU Q=  2688.5692
   1   1    8.3996419e-06
   2   2    0.0042670181
   3   3    1.0147442

BLOCK YD Q=  2688.5692
   1   1    0.00027954239
   2   2    0.0053113054
   3   3    0.27721845

BLOCK YE Q=  2688.5692
   1   1    4.8782191e-05
   2   2    0.01008661
   3   3    0.16964018

BLOCK AU Q=  2688.5692
   1   1    0
   2   2    0
   3   3    5591.7165

BLOCK AD Q=  2688.5692
   1   1    0
   2   2    0
   3   3    4695.5037

BLOCK AE Q=  2688.5692
   1   1    0
   2   2    0
   3   3   -5974.1485

BLOCK MSOFT Q=  2688.5692
   1   -218.62807
   2    3165.4152
   3    2492.3606
   21    5876581.9
   22   -173974.05
   31    1038.3112
   32    1038.3112
   33    2502.1363
   34    905.22865
   35    905.22865
   36    1770.4124
   41    4015.5055
   42    4015.5055
   43    4281.2587
   44    1998.2945
   45    1998.2945
   46    1585.4538
   47    2860.9199
   48    2860.9199
   49    4009.8372

BLOCK MASS
   6    173.2
   23    91.1876
   24    80.429995
   15    1.777
   25    125.83942
   35    2458.1386
   36    2458.1412
   37    2459.7447
   1000001    4090.1101
   2000001    2944.4563
   1000002    4089.3775
   2000002    2108.2497
   1000003    4090.1093
   2000003    2944.4553
   1000004    4089.3768
   2000004    2108.2493
   1000005    4066.5744
   2000005    4310.5199
   1000006    1674.4129
   2000006    4316.9785
   1000011    1066.8365
   2000011    918.01765
   1000012    1063.5444
   1000013    1066.8326
   2000013    918.00837
   1000014    1063.5404
   1000015    1774.9398
   2000015    2521.636
   1000016    2519.9988
   1000021    2732.9443
   1000022   -198.66872
   1000023    246.00629
   1000025   -264.54546
   1000035    3199.3858
   1000024    244.22744
   1000037    3199.5791

BLOCK ALPHA
      -0.057860125

BLOCK HMIX Q=  2688.5692
   1    231.5064
   2    16.561766
   3    243.36962
   4    6042458.2

BLOCK STOPMIX
   1   1   -0.049543581
   1   2    0.99877196
   2   1   -0.99877196
   2   2   -0.049543581

BLOCK SBOTMIX
   1   1   -0.0013956609
   1   2    0.99999903
   2   1   -0.99999903
   2   2   -0.0013956609

BLOCK STAUMIX
   1   1    0.0054752729
   1   2    0.99998501
   2   1   -0.99998501
   2   2    0.0054752729

BLOCK NMIX
   1   1    0.83595795
   1   2    0.00718466
   1   3    0.43002569
   1   4    0.34088208
   2   1   -0.073160485
   2   2   -0.019473476
   2   3    0.70305887
   2   4   -0.7070902
   3   1   -0.54389496
   3   2    0.013030331
   3   3    0.56637068
   3   4    0.61905794
   4   1    0.00034373465
   4   2   -0.99969964
   4   3   -0.0032223826
   4   4    0.024292452

BLOCK UMIX
   1   1   -0.0045556358
   1   2    0.99998962
   2   1    0.99998962
   2   2    0.0045556358

BLOCK VMIX
   1   1   -0.034345131
   1   2    0.99941003
   2   1    0.99941003
   2   2    0.034345131

BLOCK HIGGSBOUNDSINPUTHIGGSCOUPLINGSFERMIONS
       0, 274.2921,3,36,15,15

BLOCK HIGGSBOUNDSINPUTHIGGSCOUPLINGSBOSONS
       0,4,36,21,21,23

BLOCK SPHENOLOWENERGY
   1    0.00033765464
   2    1.5881895e-06
   3    3.5245887e-05
   4    2.3770009e-15
   5    1.0154287e-10
   6    2.1261185e-08
   7    7.9909173e-14
   8    3.4137205e-09
   9    7.2422388e-07
   10    9.6503351e-05
   11    0.99684267
   12    0.54290593
   13    19.397035
   14    0
   15    0
   16    0.0021612639
   17    2.281699e-15
   18    2.4799576e-11
   19    8.2894644e-11
   20    2.0800601e-17
   21    8.8322715e-13
   22    8.1664421e-09
   23    0
   24    0
   25    0
   26    0
   27    0
   28    0
   29    0
   30    0
   31    0
   39    3.8098625e-05
   40    0
   41    0
   42    0

BLOCK FWCOEF Q=  160
   305   4422   0   0   -0.18881911
   305   4422   0   2   -0.20766653
   305   4322   0   2   -0.00039552972
   305   6421   0   0   -0.095227835
   305   6421   0   2   -0.11249982
   305   6321   0   2   -0.0003559376
   3051111   4133   0   0    1.6124178
   3051111   4133   0   2    1.612895
   3051111   4233   0   2    3.3373941e-05
   3051111   4137   0   0   -4.4351098
   3051111   4137   0   2   -4.4327879
   3051111   4237   0   2   -0.00025236853
   3051313   4133   0   0    1.6124178
   3051313   4133   0   2    1.6128941
   3051313   4233   0   2    3.3373903e-05
   3051313   4137   0   0   -4.4351098
   3051313   4137   0   2   -4.4327888
   3051313   4237   0   2   -0.00025236855
   3051212   4137   0   0    1.5053501
   3051212   4137   0   2    1.5048473
   3051212   4237   0   2    5.475154e-05
   3051414   4137   0   0    1.5053501
   3051414   4137   0   2    1.5048473
   3051414   4237   0   2    5.4751544e-05
   3051616   4137   0   0    1.5053501
   3051616   4137   0   2    1.5048475
   3051616   4237   0   2    5.4752573e-05

BLOCK IMFWCOEF Q=  160
   305   4422   0   0    3.8581378e-07
   305   4422   0   2    3.9974756e-06
   305   4322   0   2   -3.9672154e-06
   305   6421   0   0    3.3047502e-07
   305   6421   0   2   -2.2849402e-06
   305   6321   0   2   -2.3391937e-06
   3051111   4133   0   2   -1.7971927e-06
   3051111   4233   0   2    7.8020974e-07
   3051111   4137   0   2    1.4379988e-05
   3051111   4237   0   2   -5.8994891e-06
   3051313   4133   0   2   -1.7971842e-06
   3051313   4233   0   2    7.8020946e-07
   3051313   4137   0   2    1.4379996e-05
   3051313   4237   0   2   -5.89949e-06
   3051212   4137   0   2   -3.1046643e-06
   3051212   4237   0   2    1.2798744e-06
   3051414   4137   0   2   -3.1046643e-06
   3051414   4237   0   2    1.2798744e-06
   3051616   4137   0   2   -3.1017016e-06
   3051616   4237   0   2    1.2798694e-06

DECAY 23  2.4952


DECAY 24  2.085


DECAY 2000011  4.0972026
    0.7147834   2    1000022    11
    0.28002507   2    1000025    11
    0.0051915202   2    1000023    11

DECAY 1000011  1.2341591
    0.73003959   2    1000022    11
    0.2581227   2    1000025    11
    0.011695897   2    1000023    11
    0.00014180812   2   -1000024    12

DECAY 2000013  4.1003607
    0.71429958   2    1000022    13
    0.2799286   2    1000025    13
    0.0053805559   2    1000023    13
    0.00039126908   2   -1000024    14

DECAY 1000013  1.2360994
    0.72919277   2    1000022    13
    0.25820872   2    1000025    13
    0.01245126   2    1000023    13
    0.0001415849   2   -1000024    14

DECAY 1000015  10.60192
    0.59098156   2    1000022    15
    0.26687654   2    1000025    15
    0.092267102   2   -1000024    16
    0.049874803   2    1000023    15

DECAY 2000015  4.586783
    0.54786531   2    1000022    15
    0.2826364   2    1000025    15
    0.16088947   2    1000023    15
    0.0044740155   2    1000015    23
    0.0040873966   2    1000015    25

DECAY 1000012  1.2330832
    0.68271493   2    1000022    12
    0.30794054   2    1000025    12
    0.0080366317   2    1000024    11
    0.0013079042   2    1000023    12

DECAY 1000014  1.2350089
    0.6816475   2    1000022    14
    0.30745894   2    1000025    14
    0.0095876995   2    1000024    13
    0.0013058589   2    1000023    14

DECAY 1000016  4.6014564
    0.45963764   2    1000022    16
    0.31323984   2    1000024    15
    0.21729935   2    1000025    16
    0.008913753   2    1000015    24
    0.00090941526   2    1000023    16

DECAY 2000001  6.0842593
    0.73283518   2    1000021    1
    0.18709634   2    1000022    1
    0.078641345   2    1000025    1
    0.0014263954   2    1000023    1

DECAY 1000001  107.62786
    0.9190819   2    1000021    1
    0.050374473   2   -1000037    2
    0.025185308   2    1000035    1
    0.0033416729   2    1000022    1
    0.0020028218   2    1000025    1

DECAY 2000003  6.0874695
    0.73244217   2    1000021    3
    0.18704715   2    1000022    3
    0.078685357   2    1000025    3
    0.0015575997   2    1000023    3
    0.00026772888   2   -1000024    4

DECAY 1000003  107.6315
    0.91905001   2    1000021    3
    0.05037265   2   -1000037    4
    0.025184419   2    1000035    3
    0.0033454723   2    1000022    3
    0.0020095206   2    1000025    3

DECAY 1000005  111.09483
    0.86876269   2    1000021    5
    0.055359315   2   -1000024    6
    0.027573087   2    1000023    5
    0.024460363   2    1000022    5
    0.023842664   2    1000025    5

DECAY 2000005  309.83836
    0.39272577   2    1000021    5
    0.28190854   2   -1000024    6
    0.26385141   2    1000006   -24
    0.024702431   2   -1000037    6
    0.012344477   2    1000035    5
    0.010446329   2    1000023    5
    0.0074887795   2    1000025    5
    0.0051590728   2    1000022    5
    0.0013729308   2    1000006   -37

DECAY 2000002  4.6057124
    0.70172751   2    1000022    2
    0.29294904   2    1000025    2
    0.0053234411   2    1000023    2

DECAY 1000002  107.58139
    0.91878291   2    1000021    2
    0.050271954   2    1000037    1
    0.02515706   2    1000035    2
    0.004054896   2    1000022    2
    0.0011657537   2    1000025    2
    0.00039196288   2    1000024    1
    0.00017546035   2    1000023    2

DECAY 2000004  4.6071906
    0.70152146   2    1000022    4
    0.29291482   2    1000025    4
    0.005402566   2    1000023    4
    0.0001611451   2    1000024    3

DECAY 1000004  107.58497
    0.91875096   2    1000021    4
    0.050270216   2    1000037    3
    0.025156168   2    1000035    4
    0.0040563465   2    1000022    4
    0.0011709538   2    1000025    4
    0.00041306987   2    1000024    3
    0.0001822857   2    1000023    4

DECAY 1000006  68.26776
    0.47856815   2    1000024    5
    0.23693496   2    1000023    6
    0.18703212   2    1000025    6
    0.097469466   2    1000022    6

DECAY 2000006  332.22129
    0.36805679   2    1000021    6
    0.1861388   2    1000006    25
    0.13160497   2    1000023    6
    0.12342717   2    1000006    23
    0.10362135   2    1000025    6
    0.030257024   2    1000022    6
    0.023029371   2    1000037    5
    0.021060864   2    1000024    5
    0.011529337   2    1000035    6
    0.00065542568   2    1000006    36
    0.00061851131   2    1000006    35

DECAY 1000024  0.00026343418
    0.33393522   3    1000022   -1    2
    0.33285634   3    1000022   -3    4
    0.11129452   3    1000022   -11    12
    0.1112929   3    1000022   -13    14
    0.11062102   3    1000022   -15    16

DECAY 1000037  81.516114
    0.13653431   2    1000014   -13
    0.13653405   2    1000012   -11
    0.13648224   2   -1000013    14
    0.13648199   2   -1000011    12
    0.087509318   2    1000024    25
    0.080937778   2    1000023    24
    0.080516777   2    1000024    23
    0.060189157   2    1000025    24
    0.024875658   2    1000016   -15
    0.024798631   2   -2000015    16
    0.020174965   2    1000022    24
    0.013270702   2    1000024    35
    0.013248038   2    1000024    36
    0.013047755   2    37    1000023
    0.0092803215   2    37    1000025
    0.0080270269   3    1000024    6   -6
    0.0053047867   2    37    1000022
    0.0050832623   3    1000023   -5    6
    0.0036479621   3    1000025   -5    6
    0.0028344085   2    1000006   -5
    0.0012003277   3    1000022   -5    6

DECAY 1000022 -1


DECAY 1000023  0.00023891338
    0.20421505   3    1000022    12   -12
    0.15269006   3    1000022    1   -1
    0.15268383   3    1000022    3   -3
    0.14109276   3    1000022    5   -5
    0.11909432   3    1000022    2   -2
    0.11807507   3    1000022    4   -4
    0.034384537   3    1000022    11   -11
    0.034382469   3    1000022    13   -13
    0.033818912   3    1000022    15   -15
    0.0095628757   2    1000022    22

DECAY 1000025  3.0705659e-05
    0.10608427   3    1000024    1   -2
    0.10608427   3   -1000024   -1    2
    0.1041099   3    1000024    3   -4
    0.1041099   3   -1000024   -3    4
    0.040315101   3    1000022    12   -12
    0.035364405   3    1000024    11   -12
    0.035364405   3   -1000024   -11    12
    0.035361245   3    1000024    13   -14
    0.035361245   3   -1000024   -13    14
    0.034100136   3    1000024    15   -16
    0.034100136   3   -1000024   -15    16
    0.032938629   3    1000023    12   -12
    0.029387407   3    1000022    1   -1
    0.029387049   3    1000022    3   -3
    0.02863315   3    1000022    5   -5
    0.024632469   3    1000023    1   -1
    0.024625069   3    1000023    3   -3
    0.024409503   2    1000023    22
    0.023113298   3    1000022    2   -2
    0.023039239   3    1000022    4   -4
    0.019210332   3    1000023    2   -2
    0.018055927   3    1000023    4   -4
    0.013494394   3    1000023    5   -5
    0.0063236511   3    1000022    15   -15
    0.0055645685   3    1000023    11   -11
    0.0055619594   3    1000023    13   -13
    0.005493836   2    1000022    22
    0.0054521765   3    1000022    13   -13
    0.0054518542   3    1000022    11   -11
    0.0048704773   3    1000023    15   -15

DECAY 1000035  82.315842
    0.079766294   2    1000024   -24
    0.079766294   2   -1000024    24
    0.067661834   2    1000014   -14
    0.067661834   2   -1000014    14
    0.067661708   2    1000012   -12
    0.067661708   2   -1000012    12
    0.067508016   2    1000013   -13
    0.067508016   2   -1000013    13
    0.067507892   2    1000011   -11
    0.067507892   2   -1000011    11
    0.054859302   2    1000023    25
    0.037721313   2    1000025    23
    0.033147519   2    1000025    25
    0.029575345   2    1000023    23
    0.013061933   2    37   -1000024
    0.013061933   2   -37    1000024
    0.012505359   2    1000022    23
    0.012323147   2    1000016   -16
    0.012323147   2   -1000016    16
    0.012261523   2    2000015   -15
    0.012261523   2   -2000015    15
    0.010194186   2    1000022    25
    0.0082149962   2    1000023    35
    0.0068891099   2    1000025    35
    0.0047915423   2    1000023    36
    0.0046300539   3    1000024    5   -6
    0.0046300539   3   -1000024   -5    6
    0.0036442983   2    1000022    35
    0.0035499261   3    1000023    6   -6
    0.0025712812   3    1000025    6   -6
    0.0023016606   2    1000025    36
    0.0016140169   2    1000022    36
    0.0013891033   2    1000006   -6
    0.0013891033   2   -1000006    6
    0.00085464809   3    1000022    6   -6

DECAY 1000021  58.517185
    0.27288877   2    1000006   -6
    0.27288877   2   -1000006    6
    0.11332519   2    2000002   -2
    0.11332519   2   -2000002    2
    0.11332513   2    2000004   -4
    0.11332513   2   -2000004    4
    0.00012286293   2    1000022    21
    0.00010919702   2    1000006   -4
    0.00010919702   2   -1000006    4
    0.00010165166   3    1000024    5   -6
    0.00010165166   3   -1000024   -5    6

DECAY 25  0.0039974384
    0.55999868   2   -5    5
    0.24204991   2   -24    24
    0.071706112   2    21    21
    0.064525347   2   -15    15
    0.029787825   2    23    23
    0.027590664   2   -4    4
    0.0023405956   2    22    22
    0.0015659844   2    22    23
    0.00022380412   2   -13    13
    0.00021035305   2   -3    3
    5.8160428e-07   2   -1    1
    1.4217873e-07   2   -2    2
    5.0313548e-09   2   -11    11

DECAY 35  12.824816
    0.6377502   2   -5    5
    0.11897491   2   -15    15
    0.064294847   2    1000022    1000022
    0.054630068   2    1000025    1000025
    0.05149087   2    1000022    1000023
    0.045156252   2    1000023    1000025
    0.023498449   2   -6    6
    0.0019092847   2   -1000024    1000024
    0.0013052523   2    1000022    1000025
    0.00041704623   2   -13    13
    0.00024694401   2   -3    3
    0.00020313441   2    1000023    1000023
    8.4285424e-05   2    25    25
    1.3170278e-05   2    23    23
    5.2114737e-06   2   -24    24
    3.5541382e-06   2    21    21
    1.5117792e-06   2   -2000011    2000011
    1.5100313e-06   2   -2000013    2000013
    1.2381648e-06   2   -1000011    1000011
    1.2354595e-06   2   -1000013    1000013
    6.8274501e-07   2   -1    1
    3.2050667e-07   2   -4    4
    6.2692691e-08   2    22    22
    2.7209679e-08   2    22    23
    9.3671838e-09   2   -11    11
    3.6451863e-09   2   -2000013    1000013
    3.6451863e-09   2   -1000013    2000013
    1.6522772e-12   2   -2    2
    8.5262198e-14   2   -2000011    1000011
    8.5262198e-14   2   -1000011    2000011

DECAY 36  12.541228
    0.63368059   2   -5    5
    0.11821517   2   -15    15
    0.065285806   2    1000022    1000023
    0.055616901   2    1000022    1000022
    0.054998333   2    1000023    1000025
    0.045071149   2    1000025    1000025
    0.023266283   2   -6    6
    0.0020859161   2   -1000024    1000024
    0.00078301022   2    1000022    1000025
    0.00041438107   2   -13    13
    0.00027183624   2    1000023    1000023
    0.00024536675   2   -3    3
    4.4520647e-05   2    21    21
    1.9465669e-05   2    23    25
    6.7838415e-07   2   -1    1
    3.1057637e-07   2   -4    4
    1.8908904e-07   2    22    22
    8.3467488e-08   2    22    23
    9.307322e-09   2   -11    11
    3.7504742e-09   2   -2000013    1000013
    3.7504742e-09   2   -1000013    2000013
    1.6011475e-12   2   -2    2
    8.772398e-14   2   -2000011    1000011
    8.772398e-14   2   -1000011    2000011
    1.1329156e-38   2    25    25

DECAY 37  12.4924
    0.65634786   2   -5    6
    0.14105403   2    1000022    1000024
    0.11827812   2   -15    16
    0.080396354   2    1000024    1000025
    0.002252029   2    1000023    1000024
    0.00093526977   2   -5    4
    0.00041815554   2   -13    14
    0.00022880105   2   -3    4
    3.7791643e-05   2   -3    6
    1.9598497e-05   2    24    25
    1.0676131e-05   2   -3    2
    6.678789e-06   2   -5    2
    6.107815e-06   2   -2000011    1000012
    6.1052741e-06   2   -2000013    1000014
    1.7178711e-06   2   -1    6
    6.339677e-07   2   -1    2
    4.5291906e-08   2   -1    4
    9.7807017e-09   2   -11    12
    6.8218426e-09   2   -1000013    1000014
    1.1646126e-12   2    24    35
    1.155025e-12   2    24    36
    1.5955959e-13   2   -1000011    1000012

DECAY 6  2.43
    1   2    5    24

DECAY 15 -1
