# SUSY Les Houches Accord 2 - MSSM spectrum + Decays
# SPheno v4.0.5be
# W. Porod, Comput. Phys. Commun. 153 (2003) 275-315, hep-ph/0301101;
# W. Porod, F.~Staub, Comput. Phys. Commun. 183 (2012) 2458
#                     arXiv:1104.1573 [hep-ph] 
# in case of problems send email to porod@physik.uni-wuerzburg.de
# Created: 20.12.2022,  16:32
Block SPINFO         # Program information
     1   SPheno      # spectrum calculator
     2   v4.0.5be    # version number
#
Block SPhenoINFO     # SPheno specific information
    1      2         # using 2-loop RGEs
    2      2         # using pole masses for boundary conditions at mZ
Block MODSEL  # Model selection
    1    0    # general MSSM
Block MINPAR  # Input parameters
    3    3.00541284E+01  # tanb at m_Z    
    4   -1.00000000E+00  # Sign(mu)
Block EXTPAR  # non-universal input parameters
    0    3.60346986E+03  # scale for input parameters
    1    1.09899198E+02  # M_1
    2   -3.42570041E+02  # M_2
    3    4.53360349E+03  # M_3
   11   -7.22659416E+03  # A_t
   12   -8.90551990E+02  # A_b
   13    2.67119237E+02  # A_tau
   23   -8.39292756E+02  # mu
   25    2.90086909E+01  # tan(beta)
   26    3.70737773E+03  # m_A, pole mass
   31    1.00000000E+04  # M_L11
   32    1.00000000E+04  # M_L22
   33    1.00000000E+04  # M_L33
   34    1.00000000E+04  # M_E11
   35    1.00000000E+04  # M_E22
   36    1.00000000E+04  # M_E33
   41    1.00000000E+04  # M_Q11
   42    1.00000000E+04  # M_Q22
   43    3.10401873E+03  # M_Q33
   44    1.00000000E+04  # M_U11
   45    1.00000000E+04  # M_U22
   46    4.11932594E+03  # M_U33
   47    1.00000000E+04  # M_D11
   48    1.00000000E+04  # M_D22
   49    3.91324884E+03  # M_D33
Block SMINPUTS  # SM parameters
         1     1.27908970E+02  # alpha_em^-1(MZ)^MSbar
         2     1.16637870E-05  # G_mu [GeV^-2]
         3     1.18400000E-01  # alpha_s(MZ)^MSbar
         4     9.11876000E+01  # m_Z(pole)
         5     4.18000000E+00  # m_b(m_b), MSbar
         6     1.73200000E+02  # m_t(pole)
         7     1.77700000E+00  # m_tau(pole)
         8     0.00000000E+00  # m_nu_3
        11     5.10998930E-04  # m_e(pole)
        12     0.00000000E+00  # m_nu_1
        13     1.05658372E-01  # m_muon(pole)
        14     0.00000000E+00  # m_nu_2
        21     5.00000000E-03  # m_d(2 GeV), MSbar
        22     2.50000000E-03  # m_u(2 GeV), MSbar
        23     9.50000000E-02  # m_s(2 GeV), MSbar
        24     1.27000000E+00  # m_c(m_c), MSbar
Block gauge Q=  3.60346986E+03  # (SUSY scale)
   1    3.55362975E-01  # g'(Q)^DRbar
   2    6.65198874E-01  # g(Q)^DRbar
   3    1.21977796E+00  # g3(Q)^DRbar
Block Yu Q=  3.60346986E+03  # (SUSY scale)
  1  1     8.38935243E-06   # Y_u(Q)^DRbar
  2  2     4.26179104E-03   # Y_c(Q)^DRbar
  3  3     1.01350116E+00   # Y_t(Q)^DRbar
Block Yd Q=  3.60346986E+03  # (SUSY scale)
  1  1     4.89031481E-04   # Y_d(Q)^DRbar
  2  2     9.29159814E-03   # Y_s(Q)^DRbar
  3  3     4.84965989E-01   # Y_b(Q)^DRbar
Block Ye Q=  3.60346986E+03  # (SUSY scale)
  1  1     8.53395695E-05   # Y_e(Q)^DRbar
  2  2     1.76455164E-02   # Y_mu(Q)^DRbar
  3  3     2.96768557E-01   # Y_tau(Q)^DRbar
Block Au Q=  3.60346986E+03  # (SUSY scale)
  1  1     0.00000000E+00   # A_u(Q)^DRbar
  2  2     0.00000000E+00   # A_c(Q)^DRbar
  3  3    -7.22659416E+03   # A_t(Q)^DRbar
Block Ad Q=  3.60346986E+03  # (SUSY scale)
  1  1     0.00000000E+00   # A_d(Q)^DRbar
  2  2     0.00000000E+00   # A_s(Q)^DRbar
  3  3    -8.90552048E+02   # A_b(Q)^DRbar
Block Ae Q=  3.60346986E+03  # (SUSY scale)
  1  1     0.00000000E+00   # A_e(Q)^DRbar
  2  2     0.00000000E+00   # A_mu(Q)^DRbar
  3  3     2.67119238E+02   # A_tau(Q)^DRbar
Block MSOFT Q=  3.60346986E+03  # soft SUSY breaking masses at Q
   1    1.09899198E+02  # M_1
   2   -3.42570041E+02  # M_2
   3    4.53360349E+03  # M_3
  21    1.30127789E+07  # M^2_(H,d)
  22   -4.50180610E+05  # M^2_(H,u)
  31    1.00000000E+04  # M_(L,11)
  32    1.00000000E+04  # M_(L,22)
  33    1.00000000E+04  # M_(L,33)
  34    1.00000000E+04  # M_(E,11)
  35    1.00000000E+04  # M_(E,22)
  36    1.00000000E+04  # M_(E,33)
  41    1.00000000E+04  # M_(Q,11)
  42    1.00000000E+04  # M_(Q,22)
  43    3.10401873E+03  # M_(Q,33)
  44    1.00000000E+04  # M_(U,11)
  45    1.00000000E+04  # M_(U,22)
  46    4.11932594E+03  # M_(U,33)
  47    1.00000000E+04  # M_(D,11)
  48    1.00000000E+04  # M_(D,22)
  49    3.91324884E+03  # M_(D,33)
Block MASS  # Mass spectrum
#   PDG code      mass          particle
         6     1.73200000E+02  # m_t(pole)
        23     9.11876000E+01  # m_Z(pole)
        24     8.04299946E+01  # W+
        15     1.77700000E+00  # m_tau(pole)
        25     1.27982498E+02  # h0
        35     3.70659215E+03  # H0
        36     3.70737773E+03  # A0
        37     3.70814941E+03  # H+
   1000001     1.00926802E+04  # ~d_L
   2000001     1.00680844E+04  # ~d_R
   1000002     1.00923166E+04  # ~u_L
   2000002     1.00709546E+04  # ~u_R
   1000003     1.00926827E+04  # ~s_L
   2000003     1.00680882E+04  # ~s_R
   1000004     1.00923191E+04  # ~c_L
   2000004     1.00709555E+04  # ~c_R
   1000005     3.19360746E+03  # ~b_1
   2000005     4.03807186E+03  # ~b_2
   1000006     3.17125417E+03  # ~t_1
   2000006     4.09459298E+03  # ~t_2
   1000011     1.00213103E+04  # ~e_L-
   2000011     1.00090799E+04  # ~e_R-
   1000012     1.00205470E+04  # ~nu_eL
   1000013     1.00213216E+04  # ~mu_L-
   2000013     1.00090980E+04  # ~mu_R-
   1000014     1.00205570E+04  # ~nu_muL
   1000015     1.00141205E+04  # ~tau_1-
   2000015     1.00246215E+04  # ~tau_2-
   1000016     1.00233793E+04  # ~nu_tauL
   1000021     4.97914826E+03  # ~g
   1000022     1.10787863E+02  # ~chi_10
   1000023     3.72487925E+02  # ~chi_20
   1000025     8.55791571E+02  # ~chi_30
   1000035     8.60534079E+02  # ~chi_40
   1000024     3.72647990E+02  # ~chi_1+
   1000037     8.61706430E+02  # ~chi_2+
# Higgs mixing
Block alpha # Effective Higgs mixing angle
          -3.33238448E-02   # alpha
Block Hmix Q=  3.60346986E+03  # Higgs mixing parameters
   1   -8.39292756E+02  # mu
   2    2.90086909E+01  # tan[beta](Q)
   3    2.43027732E+02  # v(Q)
   4    1.37446496E+07  # m^2_A(Q)
Block stopmix # stop mixing matrix
   1  1     9.88945629E-01   # Re[R_st(1,1)]
   1  2     1.48278596E-01   # Re[R_st(1,2)]
   2  1    -1.48278596E-01   # Re[R_st(2,1)]
   2  2     9.88945629E-01   # Re[R_st(2,2)]
Block sbotmix # sbottom mixing matrix
   1  1    -9.99963977E-01   # Re[R_sb(1,1)]
   1  2     8.48789083E-03   # Re[R_sb(1,2)]
   2  1    -8.48789083E-03   # Re[R_sb(2,1)]
   2  2    -9.99963977E-01   # Re[R_sb(2,2)]
Block staumix # stau mixing matrix
   1  1    -2.16009485E-01   # Re[R_sta(1,1)]
   1  2     9.76391265E-01   # Re[R_sta(1,2)]
   2  1    -9.76391265E-01   # Re[R_sta(2,1)]
   2  2    -2.16009485E-01   # Re[R_sta(2,2)]
Block Nmix # neutralino mixing matrix
   1  1     9.98603230E-01   # Re[N(1,1)]
   1  2     6.74018354E-04   # Re[N(1,2)]
   1  3    -5.25818700E-02   # Re[N(1,3)]
   1  4    -5.12665263E-03   # Re[N(1,4)]
   2  1    -5.17998577E-03   # Re[N(2,1)]
   2  2    -9.91782541E-01   # Re[N(2,2)]
   2  3    -1.16267951E-01   # Re[N(2,3)]
   2  4     5.31255334E-02   # Re[N(2,4)]
   3  1     4.07433510E-02   # Re[N(3,1)]
   3  2    -4.48792042E-02   # Re[N(3,2)]
   3  3     7.04229421E-01   # Re[N(3,3)]
   3  4     7.07380208E-01   # Re[N(3,4)]
   4  1    -3.32375844E-02   # Re[N(4,1)]
   4  2     1.19803146E-01   # Re[N(4,2)]
   4  3    -6.98410934E-01   # Re[N(4,3)]
   4  4     7.04815321E-01   # Re[N(4,4)]
Block Umix # chargino mixing matrix
   1  1    -9.86415481E-01   # Re[U(1,1)]
   1  2    -1.64269594E-01   # Re[U(1,2)]
   2  1    -1.64269594E-01   # Re[U(2,1)]
   2  2     9.86415481E-01   # Re[U(2,2)]
Block Vmix # chargino mixing matrix
   1  1     9.97155145E-01   # Re[V(1,1)]
   1  2     7.53765046E-02   # Re[V(1,2)]
   2  1     7.53765046E-02   # Re[V(2,1)]
   2  2    -9.97155145E-01   # Re[V(2,2)]
DECAY        23     2.49520000E+00   # Z
DECAY        24     2.08500000E+00   # W
DECAY   2000011     5.02776470E+01   # ~e^-_R
#    BR                NDA      ID1      ID2
     9.97248098E-01    2     1000022        11   # BR(~e^-_R -> chi^0_1 e^-)
     1.63631830E-03    2     1000025        11   # BR(~e^-_R -> chi^0_3 e^-)
     1.08878943E-03    2     1000035        11   # BR(~e^-_R -> chi^0_4 e^-)
DECAY   1000011     1.44512563E+02   # ~e^-_L
#    BR                NDA      ID1      ID2
     8.70642585E-02    2     1000022        11   # BR(~e^-_L -> chi^0_1 e^-)
     3.01074712E-01    2     1000023        11   # BR(~e^-_L -> chi^0_2 e^-)
     1.60694264E-04    2     1000025        11   # BR(~e^-_L -> chi^0_3 e^-)
     3.13180171E-03    2     1000035        11   # BR(~e^-_L -> chi^0_4 e^-)
     5.92338465E-01    2    -1000024        12   # BR(~e^-_L -> chi^-_1 nu_e)
     1.62300691E-02    2    -1000037        12   # BR(~e^-_L -> chi^-_2 nu_e)
#    BR                NDA      ID1      ID2       ID3
DECAY   2000013     5.03999441E+01   # ~mu^-_R
#    BR                NDA      ID1      ID2
     9.94833444E-01    2     1000022        13   # BR(~mu^-_R -> chi^0_1 mu^-)
     2.23353309E-03    2     1000025        13   # BR(~mu^-_R -> chi^0_3 mu^-)
     1.67734249E-03    2     1000035        13   # BR(~mu^-_R -> chi^0_4 mu^-)
     1.17929287E-03    2    -1000037        14   # BR(~mu^-_R -> chi^-_2 nu_mu)
DECAY   1000013     1.44573906E+02   # ~mu^-_L
#    BR                NDA      ID1      ID2
     8.70286015E-02    2     1000022        13   # BR(~mu^-_L -> chi^0_1 mu^-)
     3.00953095E-01    2     1000023        13   # BR(~mu^-_L -> chi^0_2 mu^-)
     3.70468660E-04    2     1000025        13   # BR(~mu^-_L -> chi^0_3 mu^-)
     3.33682972E-03    2     1000035        13   # BR(~mu^-_L -> chi^0_4 mu^-)
     5.92087803E-01    2    -1000024        14   # BR(~mu^-_L -> chi^-_1 nu_mu)
     1.62232014E-02    2    -1000037        14   # BR(~mu^-_L -> chi^-_2 nu_mu)
#    BR                NDA      ID1      ID2       ID3
DECAY   1000015     8.85257720E+01   # ~tau^-_1
#    BR                NDA      ID1      ID2
     5.51111238E-01    2     1000022        15   # BR(~tau^-_1 -> chi^0_1 tau^-)
     4.07981550E-02    2     1000023        15   # BR(~tau^-_1 -> chi^0_2 tau^-)
     9.16364437E-02    2     1000025        15   # BR(~tau^-_1 -> chi^0_3 tau^-)
     8.35416716E-02    2     1000035        15   # BR(~tau^-_1 -> chi^0_4 tau^-)
     8.04522205E-02    2    -1000024        16   # BR(~tau^-_1 -> chi^-_1 nu_tau)
     1.52460271E-01    2    -1000037        16   # BR(~tau^-_1 -> chi^-_2 nu_tau)
DECAY   2000015     1.58230971E+02   # ~tau^-_2
#    BR                NDA      ID1      ID2
     8.88674958E-02    2     1000022        15   # BR(~tau^-_2 -> chi^0_1 tau^-)
     2.55215752E-01    2     1000023        15   # BR(~tau^-_2 -> chi^0_2 tau^-)
     5.78481296E-02    2     1000025        15   # BR(~tau^-_2 -> chi^0_3 tau^-)
     6.31184813E-02    2     1000035        15   # BR(~tau^-_2 -> chi^0_4 tau^-)
     4.99092199E-01    2    -1000024        16   # BR(~tau^-_2 -> chi^-_1 nu_tau)
     3.58579424E-02    2    -1000037        16   # BR(~tau^-_2 -> chi^-_2 nu_tau)
#    BR                NDA      ID1      ID2       ID3
DECAY   1000012     1.44517323E+02   # ~nu_e
#    BR                NDA      ID1      ID2
     8.66159086E-02    2     1000022        12   # BR(~nu_e -> chi^0_1 nu_e)
     2.97700561E-01    2     1000023        12   # BR(~nu_e -> chi^0_2 nu_e)
     1.33583610E-03    2     1000025        12   # BR(~nu_e -> chi^0_3 nu_e)
     5.69017285E-03    2     1000035        12   # BR(~nu_e -> chi^0_4 nu_e)
     6.05240633E-01    2     1000024        11   # BR(~nu_e -> chi^+_1 e^-)
     3.41688877E-03    2     1000037        11   # BR(~nu_e -> chi^+_2 e^-)
#    BR                NDA      ID1      ID2       ID3
DECAY   1000014     1.44578643E+02   # ~nu_mu
#    BR                NDA      ID1      ID2
     8.65792585E-02    2     1000022        14   # BR(~nu_mu -> chi^0_1 nu_mu)
     2.97574595E-01    2     1000023        14   # BR(~nu_mu -> chi^0_2 nu_mu)
     1.33527091E-03    2     1000025        14   # BR(~nu_mu -> chi^0_3 nu_mu)
     5.68776531E-03    2     1000035        14   # BR(~nu_mu -> chi^0_4 nu_mu)
     6.04996087E-01    2     1000024        13   # BR(~nu_mu -> chi^+_1 mu^-)
     3.82702258E-03    2     1000037        13   # BR(~nu_mu -> chi^+_2 mu^-)
#    BR                NDA      ID1      ID2       ID3
DECAY   1000016     1.61867667E+02   # ~nu_tau
#    BR                NDA      ID1      ID2
     7.73535519E-02    2     1000022        16   # BR(~nu_tau -> chi^0_1 nu_tau)
     2.65866040E-01    2     1000023        16   # BR(~nu_tau -> chi^0_2 nu_tau)
     1.19299691E-03    2     1000025        16   # BR(~nu_tau -> chi^0_3 nu_tau)
     5.08173063E-03    2     1000035        16   # BR(~nu_tau -> chi^0_4 nu_tau)
     5.43437988E-01    2     1000024        15   # BR(~nu_tau -> chi^+_1 tau^-)
     1.07067692E-01    2     1000037        15   # BR(~nu_tau -> chi^+_2 tau^-)
#    BR                NDA      ID1      ID2       ID3
DECAY   2000001     4.59129771E+02   # ~d_R
#    BR                NDA      ID1      ID2
     1.22054597E-02    2     1000022         1   # BR(~d_R -> chi^0_1 d)
     9.87760649E-01    2     1000021         1   # BR(~d_R -> ~g d)
DECAY   1000001     5.90329308E+02   # ~d_L
#    BR                NDA      ID1      ID2
     2.36100527E-03    2     1000022         1   # BR(~d_L -> chi^0_1 d)
     7.36811026E-02    2     1000023         1   # BR(~d_L -> chi^0_2 d)
     2.01643409E-04    2     1000025         1   # BR(~d_L -> chi^0_3 d)
     1.17223315E-03    2     1000035         1   # BR(~d_L -> chi^0_4 d)
     1.46042798E-01    2    -1000024         2   # BR(~d_L -> chi^-_1 u)
     4.00225548E-03    2    -1000037         2   # BR(~d_L -> chi^-_2 u)
     7.72538962E-01    2     1000021         1   # BR(~d_L -> ~g d)
DECAY   2000003     4.59164162E+02   # ~s_R
#    BR                NDA      ID1      ID2
     1.22046540E-02    2     1000022         3   # BR(~s_R -> chi^0_1 s)
     9.87687521E-01    2     1000021         3   # BR(~s_R -> ~g s)
DECAY   1000003     5.90350235E+02   # ~s_L
#    BR                NDA      ID1      ID2
     2.36100312E-03    2     1000022         3   # BR(~s_L -> chi^0_1 s)
     7.36789045E-02    2     1000023         3   # BR(~s_L -> chi^0_2 s)
     2.15949993E-04    2     1000025         3   # BR(~s_L -> chi^0_3 s)
     1.18626717E-03    2     1000035         3   # BR(~s_L -> chi^0_4 s)
     1.46037686E-01    2    -1000024         4   # BR(~s_L -> chi^-_1 c)
     4.00817508E-03    2    -1000037         4   # BR(~s_L -> chi^-_2 c)
     7.72512015E-01    2     1000021         3   # BR(~s_L -> ~g s)
DECAY   1000005     1.10137800E+02   # ~b_1
#    BR                NDA      ID1      ID2
     4.43340754E-03    2     1000022         5   # BR(~b_1 -> chi^0_1 b)
     1.23954856E-01    2     1000023         5   # BR(~b_1 -> chi^0_2 b)
     5.81723432E-02    2     1000025         5   # BR(~b_1 -> chi^0_3 b)
     5.84530270E-02    2     1000035         5   # BR(~b_1 -> chi^0_4 b)
     2.43203278E-01    2    -1000024         6   # BR(~b_1 -> chi^-_1 t)
     5.11783088E-01    2    -1000037         6   # BR(~b_1 -> chi^-_2 t)
DECAY   2000005     3.70886839E+01   # ~b_2
#    BR                NDA      ID1      ID2
     6.16932325E-02    2     1000022         5   # BR(~b_2 -> chi^0_1 b)
     5.85663888E-03    2     1000023         5   # BR(~b_2 -> chi^0_2 b)
     2.30905703E-01    2     1000025         5   # BR(~b_2 -> chi^0_3 b)
     2.27221915E-01    2     1000035         5   # BR(~b_2 -> chi^0_4 b)
     1.16479926E-02    2    -1000024         6   # BR(~b_2 -> chi^-_1 t)
     4.51910976E-01    2    -1000037         6   # BR(~b_2 -> chi^-_2 t)
     4.72825874E-03    2     1000006       -24   # BR(~b_2 -> ~t_1 W^-)
     2.24522112E-03    2     1000005        23   # BR(~b_2 -> ~b_1 Z)
     3.79006237E-03    2     1000005        25   # BR(~b_2 -> ~b_1 h^0)
DECAY   2000002     4.76290866E+02   # ~u_R
#    BR                NDA      ID1      ID2
     4.70761757E-02    2     1000022         2   # BR(~u_R -> chi^0_1 u)
     9.52793897E-01    2     1000021         2   # BR(~u_R -> ~g u)
DECAY   1000002     5.90311416E+02   # ~u_L
#    BR                NDA      ID1      ID2
     2.39706035E-03    2     1000022         2   # BR(~u_L -> chi^0_1 u)
     7.39552865E-02    2     1000023         2   # BR(~u_L -> chi^0_2 u)
     1.04995873E-04    2     1000025         2   # BR(~u_L -> chi^0_3 u)
     9.61841279E-04    2     1000035         2   # BR(~u_L -> chi^0_4 u)
     1.49239331E-01    2     1000024         1   # BR(~u_L -> chi^+_1 d)
     8.42751822E-04    2     1000037         1   # BR(~u_L -> chi^+_2 d)
     7.72498733E-01    2     1000021         2   # BR(~u_L -> ~g u)
DECAY   2000004     4.76298102E+02   # ~c_R
#    BR                NDA      ID1      ID2
     4.70754631E-02    2     1000022         4   # BR(~c_R -> chi^0_1 c)
     9.52779553E-01    2     1000021         4   # BR(~c_R -> ~g c)
DECAY   1000004     5.90332309E+02   # ~c_L
#    BR                NDA      ID1      ID2
     2.39697618E-03    2     1000022         4   # BR(~c_L -> chi^0_1 c)
     7.39527027E-02    2     1000023         4   # BR(~c_L -> chi^0_2 c)
     1.08039840E-04    2     1000025         4   # BR(~c_L -> chi^0_3 c)
     9.64829121E-04    2     1000035         4   # BR(~c_L -> chi^0_4 c)
     1.49234873E-01    2     1000024         3   # BR(~c_L -> chi^+_1 s)
     8.70801335E-04    2     1000037         3   # BR(~c_L -> chi^+_2 s)
     7.72471778E-01    2     1000021         4   # BR(~c_L -> ~g c)
DECAY   1000006     1.10554542E+02   # ~t_1
#    BR                NDA      ID1      ID2
     5.26351683E-04    2     1000022         4   # BR(~t_1 -> chi^0_1 c)
     5.54489372E-03    2     1000022         6   # BR(~t_1 -> chi^0_1 t)
     1.58722897E-02    2     1000023         4   # BR(~t_1 -> chi^0_2 c)
     1.15522930E-01    2     1000023         6   # BR(~t_1 -> chi^0_2 t)
     2.45389947E-01    2     1000025         6   # BR(~t_1 -> chi^0_3 t)
     2.52595683E-01    2     1000035         6   # BR(~t_1 -> chi^0_4 t)
     2.34074276E-01    2     1000024         5   # BR(~t_1 -> chi^+_1 b)
     1.29103374E-01    2     1000037         5   # BR(~t_1 -> chi^+_2 b)
#    BR                NDA      ID1      ID2       ID3
     1.37025438E-03    3     1000022        24         5   # BR(~t_1 -> chi^0_1 W^+ b)
DECAY   2000006     3.01367133E+02   # ~t_2
#    BR                NDA      ID1      ID2
     2.93813262E-02    2     1000022         6   # BR(~t_2 -> chi^0_1 t)
     3.98733350E-03    2     1000023         6   # BR(~t_2 -> chi^0_2 t)
     1.29008631E-01    2     1000025         6   # BR(~t_2 -> chi^0_3 t)
     1.22835847E-01    2     1000035         6   # BR(~t_2 -> chi^0_4 t)
     8.07655031E-03    2     1000024         5   # BR(~t_2 -> chi^+_1 b)
     2.44183572E-01    2     1000037         5   # BR(~t_2 -> chi^+_2 b)
     2.02249542E-01    2     1000005        24   # BR(~t_2 -> ~b_1 W^+)
     1.05187786E-01    2     1000006        23   # BR(~t_2 -> ~t_1 Z)
     1.55089412E-01    2     1000006        25   # BR(~t_2 -> ~t_1 h^0)
DECAY   1000024     7.81111087E-04   # chi^+_1
#    BR                NDA      ID1      ID2
     9.99562980E-01    2     1000022        24   # BR(chi^+_1 -> chi^0_1 W^+)
#    BR                NDA      ID1      ID2       ID3
     4.36613181E-04    3     1000022        -5         6   # BR(chi^+_1 -> chi^0_1 b_bar t)
DECAY   1000037     6.05342733E+00   # chi^+_2
#    BR                NDA      ID1      ID2
     9.33007710E-02    2     1000022        24   # BR(chi^+_2 -> chi^0_1 W^+)
     3.20442043E-01    2     1000023        24   # BR(chi^+_2 -> chi^0_2 W^+)
     2.97835960E-01    2     1000024        23   # BR(chi^+_2 -> chi^+_1 Z)
     2.83618463E-01    2     1000024        25   # BR(chi^+_2 -> chi^+_1 h^0)
#    BR                NDA      ID1      ID2       ID3
     1.02315727E-03    3     1000024         6        -6   # BR(chi^+_2 -> chi^+_1 t t_bar)
     1.22270172E-03    3     1000022        -5         6   # BR(chi^+_2 -> chi^0_1 b_bar t)
     2.55611546E-03    3     1000023        -5         6   # BR(chi^+_2 -> chi^0_2 b_bar t)
DECAY   1000022     0.00000000E+00   # chi^0_1
DECAY   1000023     1.31742033E-03   # chi^0_2
#    BR                NDA      ID1      ID2
     4.54788351E-01    2     1000022        23   # BR(chi^0_2 -> chi^0_1 Z)
     5.45139827E-01    2     1000022        25   # BR(chi^0_2 -> chi^0_1 h^0)
#    BR                NDA      ID1      ID2       ID3
DECAY   1000025     7.25884510E+00   # chi^0_3
#    BR                NDA      ID1      ID2
     2.49782572E-01    2     1000024       -24   # BR(chi^0_3 -> chi^+_1 W^-)
     2.49782572E-01    2    -1000024        24   # BR(chi^0_3 -> chi^-_1 W^+)
     3.14231534E-02    2     1000022        23   # BR(chi^0_3 -> chi^0_1 Z)
     2.32892168E-01    2     1000023        23   # BR(chi^0_3 -> chi^0_2 Z)
     4.13567672E-02    2     1000022        25   # BR(chi^0_3 -> chi^0_1 h^0)
     1.89929825E-01    2     1000023        25   # BR(chi^0_3 -> chi^0_2 h^0)
#    BR                NDA      ID1      ID2       ID3
     3.49205692E-04    3     1000022         6        -6   # BR(chi^0_3 -> chi^0_1 t t_bar)
     2.03553541E-04    3     1000023         6        -6   # BR(chi^0_3 -> chi^0_2 t t_bar)
     2.13565401E-03    3     1000024         5        -6   # BR(chi^0_3 -> chi^+_1 b t_bar)
     2.13565401E-03    3    -1000024        -5         6   # BR(chi^0_3 -> chi^-_1 b_bar t)
DECAY   1000035     6.32639250E+00   # chi^0_4
#    BR                NDA      ID1      ID2
     3.04378211E-01    2     1000024       -24   # BR(chi^0_4 -> chi^+_1 W^-)
     3.04378211E-01    2    -1000024        24   # BR(chi^0_4 -> chi^-_1 W^+)
     5.34783061E-02    2     1000022        23   # BR(chi^0_4 -> chi^0_1 Z)
     3.67054833E-02    2     1000023        23   # BR(chi^0_4 -> chi^0_2 Z)
     5.42438911E-02    2     1000022        25   # BR(chi^0_4 -> chi^0_1 h^0)
     2.40299052E-01    2     1000023        25   # BR(chi^0_4 -> chi^0_2 h^0)
#    BR                NDA      ID1      ID2       ID3
     4.53790883E-04    3     1000022         6        -6   # BR(chi^0_4 -> chi^0_1 t t_bar)
     2.79007323E-04    3     1000023         6        -6   # BR(chi^0_4 -> chi^0_2 t t_bar)
     2.88992337E-03    3     1000024         5        -6   # BR(chi^0_4 -> chi^+_1 b t_bar)
     2.88992337E-03    3    -1000024        -5         6   # BR(chi^0_4 -> chi^-_1 b_bar t)
DECAY   1000021     1.41485088E+02   # ~g
#    BR                NDA      ID1      ID2
     2.41322808E-02    2     1000006        -4   # BR(~g -> ~t_1 c_bar)
     2.41322808E-02    2    -1000006         4   # BR(~g -> ~t^*_1 c)
     1.77187657E-01    2     1000006        -6   # BR(~g -> ~t_1 t_bar)
     1.77187657E-01    2    -1000006         6   # BR(~g -> ~t^*_1 t)
     5.70962407E-02    2     2000006        -6   # BR(~g -> ~t_2 t_bar)
     5.70962407E-02    2    -2000006         6   # BR(~g -> ~t^*_2 t)
     1.80460753E-01    2     1000005        -5   # BR(~g -> ~b_1 b_bar)
     1.80460753E-01    2    -1000005         5   # BR(~g -> ~b^*_1 b)
     6.10156690E-02    2     2000005        -5   # BR(~g -> ~b_2 b_bar)
     6.10156690E-02    2    -2000005         5   # BR(~g -> ~b^*_2 b)
#    BR                NDA      ID1      ID2       ID3
DECAY        25     4.30987926E-03   # Gamma(h0)
     2.33655720E-03   2        22        22   # BR(h0 -> photon photon)
     1.74702218E-03   2        22        23   # BR(h0 -> photon Z)
     3.57920482E-02   2        23        23   # BR(h0 -> Z Z)
     2.79411529E-01   2       -24        24   # BR(h0 -> W W)
     6.98957385E-02   2        21        21   # BR(h0 -> gluon gluon)
     4.72132762E-09   2       -11        11   # BR(h0 -> Electron electron)
     2.10014601E-04   2       -13        13   # BR(h0 -> Muon muon)
     6.05583673E-02   2       -15        15   # BR(h0 -> Tau tau)
     1.33595991E-07   2        -2         2   # BR(h0 -> Up up)
     2.59263829E-02   2        -4         4   # BR(h0 -> Charm charm)
     5.44274091E-07   2        -1         1   # BR(h0 -> Down down)
     1.96851652E-04   2        -3         3   # BR(h0 -> Strange strange)
     5.23924806E-01   2        -5         5   # BR(h0 -> Bottom bottom)
DECAY        35     8.93374094E+01   # Gamma(HH)
     1.76342715E-08   2        22        22   # BR(HH -> photon photon)
     6.12390108E-08   2        22        23   # BR(HH -> photon Z)
     3.76985161E-07   2        23        23   # BR(HH -> Z Z)
     8.71449216E-08   2       -24        24   # BR(HH -> W W)
     2.25651804E-06   2        21        21   # BR(HH -> gluon gluon)
     5.92874984E-09   2       -11        11   # BR(HH -> Electron electron)
     2.63991798E-04   2       -13        13   # BR(HH -> Muon muon)
     7.62466151E-02   2       -15        15   # BR(HH -> Tau tau)
     1.14872171E-13   2        -2         2   # BR(HH -> Up up)
     2.22862951E-08   2        -4         4   # BR(HH -> Charm charm)
     1.86683752E-03   2        -6         6   # BR(HH -> Top top)
     4.38317276E-07   2        -1         1   # BR(HH -> Down down)
     1.58535327E-04   2        -3         3   # BR(HH -> Strange strange)
     4.26837684E-01   2        -5         5   # BR(HH -> Bottom bottom)
     8.14866999E-03   2  -1000024   1000024   # BR(HH -> Chargino1 chargino1)
     1.45836879E-01   2  -1000024   1000037   # BR(HH -> Chargino1 chargino2)
     1.45836879E-01   2  -1000037   1000024   # BR(HH -> Chargino2 chargino1)
     9.56707600E-04   2  -1000037   1000037   # BR(HH -> Chargino2 chargino2)
     2.60136518E-04   2   1000022   1000022   # BR(HH -> neutralino1 neutralino1)
     2.09119522E-03   2   1000022   1000023   # BR(HH -> neutralino1 neutralino2)
     2.22679490E-02   2   1000022   1000025   # BR(HH -> neutralino1 neutralino3)
     1.93128594E-02   2   1000022   1000035   # BR(HH -> neutralino1 neutralino4)
     4.02688086E-03   2   1000023   1000023   # BR(HH -> neutralino2 neutralino2)
     7.93133284E-02   2   1000023   1000025   # BR(HH -> neutralino2 neutralino3)
     6.09602327E-02   2   1000023   1000035   # BR(HH -> neutralino2 neutralino4)
     5.84057480E-04   2   1000025   1000025   # BR(HH -> neutralino3 neutralino3)
     3.08489657E-03   2   1000025   1000035   # BR(HH -> neutralino3 neutralino4)
     1.93957545E-03   2   1000035   1000035   # BR(HH -> neutralino4 neutralino4)
     2.82411508E-06   2        25        25   # BR(HH -> h0 h0)
DECAY        36     8.70344978E+01   # Gamma(A0)
     5.75655381E-08   2        22        22   # BR(A0 -> photon photon)
     1.07826394E-07   2        22        23   # BR(A0 -> photon Z)
     7.70160238E-06   2        21        21   # BR(A0 -> gluon gluon)
     5.77362797E-09   2       -11        11   # BR(A0 -> Electron electron)
     2.57085067E-04   2       -13        13   # BR(A0 -> Muon muon)
     7.42518779E-02   2       -15        15   # BR(A0 -> Tau tau)
     1.11166476E-13   2        -2         2   # BR(A0 -> Up up)
     2.15663168E-08   2        -4         4   # BR(A0 -> Charm charm)
     1.82365035E-03   2        -6         6   # BR(A0 -> Top top)
     4.26839714E-07   2        -1         1   # BR(A0 -> Down down)
     1.54383929E-04   2        -3         3   # BR(A0 -> Strange strange)
     4.15666137E-01   2        -5         5   # BR(A0 -> Bottom bottom)
     9.16013318E-03   2  -1000024   1000024   # BR(A0 -> Chargino1 chargino1)
     1.48978389E-01   2  -1000024   1000037   # BR(A0 -> Chargino1 chargino2)
     1.48978389E-01   2  -1000037   1000024   # BR(A0 -> Chargino2 chargino1)
     1.70012824E-03   2  -1000037   1000037   # BR(A0 -> Chargino2 chargino2)
     2.64543907E-04   2   1000022   1000022   # BR(A0 -> neutralino1 neutralino1)
     2.17807854E-03   2   1000022   1000023   # BR(A0 -> neutralino1 neutralino2)
     2.05511830E-02   2   1000022   1000025   # BR(A0 -> neutralino1 neutralino3)
     2.21048304E-02   2   1000022   1000035   # BR(A0 -> neutralino1 neutralino4)
     4.52932631E-03   2   1000023   1000023   # BR(A0 -> neutralino2 neutralino2)
     6.50637493E-02   2   1000023   1000025   # BR(A0 -> neutralino2 neutralino3)
     7.83866089E-02   2   1000023   1000035   # BR(A0 -> neutralino2 neutralino4)
     6.61370048E-04   2   1000025   1000025   # BR(A0 -> neutralino3 neutralino3)
     2.40128463E-03   2   1000025   1000035   # BR(A0 -> neutralino3 neutralino4)
     2.87977485E-03   2   1000035   1000035   # BR(A0 -> neutralino4 neutralino4)
     7.54049395E-07   2        23        25   # BR(A0 -> Z h0)
     6.54130921E-39   2        25        25   # BR(A0 -> h0 h0)
DECAY        37     8.73408951E+01   # Gamma(Hp)
     6.34174092E-09   2       -11        12   # BR(Hp -> Electron nu_e)
     2.71129232E-04   2       -13        14   # BR(Hp -> Muon nu_mu)
     7.66907828E-02   2       -15        16   # BR(Hp -> Tau nu_tau)
     4.07620698E-07   2        -1         2   # BR(Hp -> Down up)
     6.89578327E-06   2        -3         2   # BR(Hp -> Strange up)
     4.39286020E-06   2        -5         2   # BR(Hp -> Bottom up)
     2.01618272E-08   2        -1         4   # BR(Hp -> Down charm)
     1.46900913E-04   2        -3         4   # BR(Hp -> Strange charm)
     6.15157708E-04   2        -5         4   # BR(Hp -> Bottom charm)
     1.18487097E-07   2        -1         6   # BR(Hp -> Down top)
     2.80190291E-06   2        -3         6   # BR(Hp -> Strange top)
     4.16522084E-01   2        -5         6   # BR(Hp -> Bottom top)
     4.29943142E-03   2   1000022   1000024   # BR(Hp -> neutralino1 chargino1)
     4.15103924E-02   2   1000022   1000037   # BR(Hp -> neutralino1 chargino2)
     1.38367099E-07   2   1000023   1000024   # BR(Hp -> neutralino2 chargino1)
     1.56056609E-01   2   1000023   1000037   # BR(Hp -> neutralino2 chargino2)
     1.49751404E-01   2   1000024   1000025   # BR(Hp -> chargino1 neutralino3)
     2.59154008E-03   2   1000025   1000037   # BR(Hp -> neutralino3 chargino2)
     1.50988158E-01   2   1000024   1000035   # BR(Hp -> chargino1 neutralino4)
     5.40877172E-04   2   1000035   1000037   # BR(Hp -> neutralino4 chargino2)
     7.52180493E-07   2        24        25   # BR(Hp -> W h0)
     1.42751806E-13   2        24        35   # BR(Hp -> W HH)
DECAY         6     2.43000000E+00   # top
#    BR                NDA      ID1      ID2
     1.00000000E+00    2           5        24   # BR(t -> b W)
Block HiggsBoundsInputHiggsCouplingsFermions
# ScalarNormEffCoupSq PseudoSNormEffCoupSq NP IP1 IP2 IP2
    9.35236590E-01    0.00000000E+00        3  25   5   5  # h0-b-b eff. coupling^2, normalised to SM
    8.41568911E+02    0.00000000E+00        3  35   5   5  # H0-b-b eff. coupling^2, normalised to SM
    0.00000000E+00    8.41504148E+02        3  36   5   5  # A0-b-b eff. coupling^2, normalised to SM
#
    1.00007696E+00    0.00000000E+00        3  25   6   6  # h0-t-t eff. coupling^2, normalised to SM
    1.11138679E-03    0.00000000E+00        3  35   6   6  # H0-t-t eff. coupling^2, normalised to SM
    0.00000000E+00    1.18834827E-03        3  36   6   6  # A0-t-t eff. coupling^2, normalised to SM
#
    9.35236590E-01    0.00000000E+00        3  25  15  15  # h0-tau-tau eff. coupling^2, normalised to SM
    8.41568911E+02    0.00000000E+00        3  35  15  15  # H0-tau-tau eff. coupling^2, normalised to SM
    0.00000000E+00    8.41504148E+02        3  36  15  15  # A0-tau-tau eff. coupling^2, normalised to SM
#
Block HiggsBoundsInputHiggsCouplingsBosons
    9.99998712E-01        3  25  24  24  # h0-W-W eff. coupling^2, normalised to SM
    1.28808270E-06        3  35  24  24  # H0-W-W eff. coupling^2, normalised to SM
    0.00000000E+00        3  36  24  24  # A0-W-W eff. coupling^2, normalised to SM
#
    9.99998712E-01        3  25  23  23  # h0-Z-Z eff. coupling^2, normalised to SM
    1.28808270E-06        3  35  23  23  # H0-Z-Z eff. coupling^2, normalised to SM
    0.00000000E+00        3  36  23  23  # A0-Z-Z eff. coupling^2, normalised to SM
#
    1.26287607E+00        3  25  21  21  # h0-g-g eff. coupling^2, normalised to SM
    1.99610622E-03        3  35  21  21  # H0-g-g eff. coupling^2, normalised to SM
    1.00813804E-01        3  36  21  21  # A0-g-g eff. coupling^2, normalised to SM
#
    0.00000000E+00        3  25  25  23  # h0-h0-Z eff. coupling^2, normalised to SM
    0.00000000E+00        3  35  25  23  # H0-h0-Z eff. coupling^2, normalised to SM
    1.28808270E-06        3  36  25  23  # A0-h0-Z eff. coupling^2, normalised to SM
    0.00000000E+00        3  35  35  23  # H0-H0-Z eff. coupling^2, normalised to SM
    9.99998712E-01        3  36  35  23  # A0-H0-Z eff. coupling^2, normalised to SM
    0.00000000E+00        3  36  36  23  # A0-A0-Z eff. coupling^2, normalised to SM
#
    0.00000000E+00        4  25  21  21  23  # h0-g-g-Z eff. coupling^2, normalised to SM
    0.00000000E+00        4  35  21  21  23  # H0-g-g-Z eff. coupling^2, normalised to SM
    0.00000000E+00        4  36  21  21  23  # A0-g-g-Z eff. coupling^2, normalised to SM
Block SPhenoLowEnergy  # low energy observables
    1    3.34304106E-04   # BR(b -> s gamma)
    2    1.58910228E-06   # BR(b -> s mu+ mu-)
    3    3.52601312E-05   # BR(b -> s nu nu)
    4    1.98390441E-15   # BR(Bd -> e+ e-)
    5    8.47506949E-11   # BR(Bd -> mu+ mu-)
    6    1.77739893E-08   # BR(Bd -> tau+ tau-)
    7    6.73641959E-14   # BR(Bs -> e+ e-)
    8    2.87781473E-09   # BR(Bs -> mu+ mu-)
    9    6.11503162E-07   # BR(Bs -> tau+ tau-)
   10    9.63539497E-05   # BR(B_u -> tau nu)
   11    9.95299412E-01   # BR(B_u -> tau nu)/BR(B_u -> tau nu)_SM
   12    5.41965907E-01   # |Delta(M_Bd)| [ps^-1] 
   13    1.93611623E+01   # |Delta(M_Bs)| [ps^-1] 
   14    0.00000000E+00   # neutron EDM according to the chiral quark model
   15    0.00000000E+00   # neutron EDM according to the relativistic quark-parton model
   16    2.15727281E-03   # epsilon_K
   17    2.28165804E-15   # Delta(M_K)
   18    2.48070618E-11   # BR(K^0 -> pi^0 nu nu)
   19    8.29207526E-11   # BR(K^+ -> pi^+ nu nu)
   20    1.50265339E-16   # Delta(g-2)_electron/2
   21    6.42434253E-12   # Delta(g-2)_muon/2
   22    1.81946516E-09   # Delta(g-2)_tau/2
   23    0.00000000E+00   # electric dipole moment of the electron
   24    0.00000000E+00   # electric dipole moment of the muon
   25    0.00000000E+00   # electric dipole moment of the tau
   26    0.00000000E+00   # Br(mu -> e gamma)
   27    0.00000000E+00   # Br(tau -> e gamma)
   28    0.00000000E+00   # Br(tau -> mu gamma)
   29    0.00000000E+00   # Br(mu -> 3 e)
   30    0.00000000E+00   # Br(tau -> 3 e)
   31    0.00000000E+00   # Br(tau -> 3 mu)
   39    5.88008874E-05   # Delta(rho_parameter)
   40    0.00000000E+00   # BR(Z -> e mu)
   41    0.00000000E+00   # BR(Z -> e tau)
   42    0.00000000E+00   # BR(Z -> mu tau)
Block FWCOEF Q=  1.60000000E+02  # Wilson coefficients at scale Q
#    id        order  M        value         comment
     0305 4422   00   0    -1.88819110E-01   # C7
     0305 4422   00   2    -2.04765749E-01   # C7
     0305 4322   00   2    -1.64104418E-04   # C7'
     0305 6421   00   0    -9.52278348E-02   # C8
     0305 6421   00   2    -1.07222968E-01   # C8
     0305 6321   00   2    -1.48959152E-04   # C8'
 03051111 4133   00   0     1.62299721E+00   # C9 e+e-
 03051111 4133   00   2     1.62323376E+00   # C9 e+e-
 03051111 4233   00   2     2.57343649E-04   # C9' e+e-
 03051111 4137   00   0    -4.44568931E+00   # C10 e+e-
 03051111 4137   00   2    -4.44482728E+00   # C10 e+e-
 03051111 4237   00   2    -1.91484671E-03   # C10' e+e-
 03051313 4133   00   0     1.62299721E+00   # C9 mu+mu-
 03051313 4133   00   2     1.62323367E+00   # C9 mu+mu-
 03051313 4233   00   2     2.57343572E-04   # C9' mu+mu-
 03051313 4137   00   0    -4.44568931E+00   # C10 mu+mu-
 03051313 4137   00   2    -4.44482736E+00   # C10 mu+mu-
 03051313 4237   00   2    -1.91484676E-03   # C10' mu+mu-
 03051212 4137   00   0     1.50535012E+00   # C11 nu_1 nu_1
 03051212 4137   00   2     1.50516577E+00   # C11 nu_1 nu_1
 03051212 4237   00   2     4.14405153E-04   # C11' nu_1 nu_1
 03051414 4137   00   0     1.50535012E+00   # C11 nu_2 nu_2
 03051414 4137   00   2     1.50516577E+00   # C11 nu_2 nu_2
 03051414 4237   00   2     4.14405163E-04   # C11' nu_2 nu_2
 03051616 4137   00   0     1.50535012E+00   # C11 nu_3 nu_3
 03051616 4137   00   2     1.50516578E+00   # C11 nu_3 nu_3
 03051616 4237   00   2     4.14407897E-04   # C11' nu_3 nu_3
Block IMFWCOEF Q=  1.60000000E+02  # Im(Wilson coefficients) at scale Q
#    id        order  M        value         comment
     0305 4422   00   0     3.85778318E-07   # C7
     0305 4422   00   2     3.76102488E-06   # C7
     0305 4322   00   2    -1.25202212E-06   # C7'
     0305 6421   00   0     3.30444642E-07   # C8
     0305 6421   00   2     7.63144001E-06   # C8
     0305 6321   00   2    -4.66253841E-07   # C8'
 03051111 4133   00   2     4.99955653E-07   # C9 e+e-
 03051111 4233   00   2     4.88571176E-06   # C9' e+e-
 03051111 4137   00   2     4.51578703E-06   # C10 e+e-
 03051111 4237   00   2    -3.63546645E-05   # C10' e+e-
 03051313 4133   00   2     4.99952799E-07   # C9 mu+mu-
 03051313 4233   00   2     4.88571118E-06   # C9' mu+mu-
 03051313 4137   00   2     4.51579010E-06   # C10 mu+mu-
 03051313 4237   00   2    -3.63546663E-05   # C10' mu+mu-
 03051212 4137   00   2    -9.37661035E-07   # C11 nu_1 nu_1
 03051212 4237   00   2     7.86776385E-06   # C11' nu_1 nu_1
 03051414 4137   00   2    -9.37660882E-07   # C11 nu_2 nu_2
 03051414 4237   00   2     7.86776385E-06   # C11' nu_2 nu_2
 03051616 4137   00   2    -9.37618135E-07   # C11 nu_3 nu_3
 03051616 4237   00   2     7.86776384E-06   # C11' nu_3 nu_3
