BLOCK SPINFO
   1   SPheno
   2   v4.0.5be

BLOCK SPHENOINFO
   1   2
   2   2

BLOCK MODSEL
   1   0

BLOCK MINPAR
   3    49.325517
   4   -1

BLOCK EXTPAR
   0    2961.4421
   1    1785.6055
   2   -1472.8882
   3    1978.1694
   11    3507.8373
   12   -1969.7266
   13   -5057.4624
   23   -1236.3414
   25    49.883717
   26    1716.3905
   31    1897.6877
   32    1897.6877
   33    1663.7461
   34    4902.774
   35    4902.774
   36    4119.3851
   41    3187.5519
   42    3187.5519
   43    3193.2375
   44    3378.1951
   45    3378.1951
   46    2741.1581
   47    2414.3287
   48    2414.3287
   49    2452.8266

BLOCK SMINPUTS
   1    127.90897
   2    1.1663787e-05
   3    0.1184
   4    91.1876
   5    4.18
   6    173.2
   7    1.777
   8    0
   11    0.00051099893
   12    0
   13    0.10565837
   14    0
   21    0.005
   22    0.0025
   23    0.095
   24    1.27

BLOCK GAUGE Q=  2961.4421
   1    0.35536298
   2    0.66519887
   3    1.219778

BLOCK YU Q=  2961.4421
   1   1    8.3860567e-06
   2   2    0.0042601168
   3   3    1.013103

BLOCK YD Q=  2961.4421
   1   1    0.00084061445
   2   2    0.015971675
   3   3    0.83362612

BLOCK YE Q=  2961.4421
   1   1    0.00014669337
   2   2    0.030331536
   3   3    0.51012654

BLOCK AU Q=  2961.4421
   1   1    0
   2   2    0
   3   3    3507.8373

BLOCK AD Q=  2961.4421
   1   1    0
   2   2    0
   3   3   -1969.7265

BLOCK AE Q=  2961.4421
   1   1    0
   2   2    0
   3   3   -5057.4623

BLOCK MSOFT Q=  2961.4421
   1    1785.6055
   2   -1472.8882
   3    1978.1694
   21    1785762.3
   22   -1390081.6
   31    1897.6877
   32    1897.6877
   33    1663.7461
   34    4902.774
   35    4902.774
   36    4119.3851
   41    3187.5519
   42    3187.5519
   43    3193.2375
   44    3378.1951
   45    3378.1951
   46    2741.1581
   47    2414.3287
   48    2414.3287
   49    2452.8266

BLOCK MASS
   6    173.2
   23    91.1876
   24    80.429995
   15    1.777
   25    123.0398
   35    1715.4379
   36    1716.3905
   37    1718.5536
   1000001    3261.4884
   2000001    2497.4372
   1000002    3260.5348
   2000002    3437.3444
   1000003    3261.4789
   2000003    2497.4194
   1000004    3260.5252
   2000004    3437.3439
   1000005    2474.6046
   2000005    3191.2716
   1000006    2736.6914
   2000006    3204.6504
   1000011    1911.9015
   2000011    4909.1273
   1000012    1909.855
   1000013    1911.883
   2000013    4909.0757
   1000014    1909.8251
   1000015    1672.0794
   2000015    4080.8113
   1000016    1669.9587
   1000021    2239.1456
   1000022   -1233.8861
   1000023    1244.7749
   1000025   -1525.2187
   1000035    1775.6681
   1000024    1234.9569
   1000037    1525.4021

BLOCK ALPHA
      -0.020438655

BLOCK HMIX Q=  2961.4421
   1   -1236.3414
   2    49.883717
   3    243.2444
   4    2945996.4

BLOCK STOPMIX
   1   1   -0.16659274
   1   2    0.98602579
   2   1   -0.98602579
   2   2   -0.16659274

BLOCK SBOTMIX
   1   1   -0.042703785
   1   2    0.99908778
   2   1   -0.99908778
   2   2   -0.042703785

BLOCK STAUMIX
   1   1   -0.99997056
   1   2    0.0076733823
   2   1   -0.0076733823
   2   2   -0.99997056

BLOCK NMIX
   1   1    0.010371803
   1   2    0.19845966
   1   3    0.69600604
   1   4   -0.6899868
   2   1    0.057424871
   2   2    0.019759775
   2   3   -0.70599551
   2   4   -0.70560774
   3   1   -0.0021062628
   3   2    0.9799092
   3   3   -0.12668659
   3   4    0.15402608
   4   1   -0.99829373
   4   2    0.0011310705
   4   3   -0.033112527
   4   4   -0.048082301

BLOCK UMIX
   1   1   -0.17983258
   1   2   -0.98369723
   2   1   -0.98369723
   2   2    0.17983258

BLOCK VMIX
   1   1    0.21860666
   1   2    0.97581306
   2   1    0.97581306
   2   2   -0.21860666

BLOCK HIGGSBOUNDSINPUTHIGGSCOUPLINGSFERMIONS
       0, 2488.3852,3,36,15,15

BLOCK HIGGSBOUNDSINPUTHIGGSCOUPLINGSBOSONS
       0,4,36,21,21,23

BLOCK SPHENOLOWENERGY
   1    0.00032035429
   2    1.5902333e-06
   3    3.5250844e-05
   4    5.5918338e-15
   5    2.3883958e-10
   6    4.7863941e-08
   7    1.9680818e-13
   8    8.4062967e-09
   9    1.7050173e-06
   10    9.317128e-05
   11    0.96242365
   12    0.54193742
   13    19.370212
   14    0
   15    0
   16    0.0021573899
   17    2.2816648e-15
   18    2.4796179e-11
   19    8.2897952e-11
   20    3.9568596e-15
   21    1.6917375e-10
   22    5.2923392e-08
   23    0
   24    0
   25    0
   26    0
   27    0
   28    0
   29    0
   30    0
   31    0
   39    7.7062882e-05
   40    0
   41    0
   42    0

BLOCK FWCOEF Q=  160
   305   4422   0   0   -0.18881911
   305   4422   0   2   -0.18669509
   305   4322   0   2    2.7840076e-05
   305   6421   0   0   -0.095227835
   305   6421   0   2   -0.10365531
   305   6321   0   2   -0.00018360949
   3051111   4133   0   0    1.6169103
   3051111   4133   0   2    1.6174233
   3051111   4233   0   2    0.00022273753
   3051111   4137   0   0   -4.4396024
   3051111   4137   0   2   -4.4378068
   3051111   4237   0   2   -0.0016708938
   3051313   4133   0   0    1.6169103
   3051313   4133   0   2    1.6174208
   3051313   4233   0   2    0.00022273177
   3051313   4137   0   0   -4.4396024
   3051313   4137   0   2   -4.4378093
   3051313   4237   0   2   -0.001670891
   3051212   4137   0   0    1.5053501
   3051212   4137   0   2    1.5049655
   3051212   4237   0   2    0.00036210617
   3051414   4137   0   0    1.5053501
   3051414   4137   0   2    1.5049655
   3051414   4237   0   2    0.00036210731
   3051616   4137   0   0    1.5053501
   3051616   4137   0   2    1.5049654
   3051616   4237   0   2    0.00036242989

BLOCK IMFWCOEF Q=  160
   305   4422   0   0    3.858693e-07
   305   4422   0   2    6.5912507e-06
   305   4322   0   2    6.0312816e-06
   305   6421   0   0    3.3052257e-07
   305   6421   0   2    3.8243791e-05
   305   6321   0   2    3.6147008e-06
   3051111   4133   0   2    7.1544375e-07
   3051111   4233   0   2    6.6656039e-06
   3051111   4137   0   2   -3.8442708e-06
   3051111   4237   0   2   -5.0025905e-05
   3051313   4133   0   2    7.1539735e-07
   3051313   4233   0   2    6.6655961e-06
   3051313   4137   0   2   -3.844268e-06
   3051313   4237   0   2   -5.0025951e-05
   3051212   4137   0   2    9.1356053e-07
   3051212   4237   0   2    1.0841315e-05
   3051414   4137   0   2    9.1356044e-07
   3051414   4237   0   2    1.0841315e-05
   3051616   4137   0   2    9.1318683e-07
   3051616   4237   0   2    1.0841314e-05

DECAY 23  2.4952


DECAY 24  2.085


DECAY 1000011  3.5732837
    0.60204024   2   -1000037    12
    0.29827166   2    1000025    11
    0.051732866   2   -1000024    12
    0.033368751   2    1000022    11
    0.012597975   2    1000035    11
    0.0019885118   2    1000023    11

DECAY 2000011  18.644525
    0.99605034   2    1000035    11
    0.0038198083   2    1000023    11
    0.00012495395   2    1000022    11

DECAY 1000013  3.5846461
    0.60008529   2   -1000037    14
    0.29732262   2    1000025    13
    0.051566953   2   -1000024    14
    0.034873479   2    1000022    13
    0.012555134   2    1000035    13
    0.0035965272   2    1000023    13

DECAY 2000013  18.803946
    0.98759306   2    1000035    13
    0.0058726046   2    1000023    13
    0.0040570194   2   -1000024    14
    0.0021553109   2    1000022    13
    0.00012836875   2    1000013    25
    0.00012612787   2   -1000037    14

DECAY 1000015  2.5058585
    0.37450857   2    1000022    15
    0.34360417   2    1000023    15
    0.15959169   2   -1000037    16
    0.080489106   2    1000025    15
    0.04180647   2   -1000024    16

DECAY 2000015  87.762836
    0.20794671   2    1000016   -37
    0.19151385   2   -1000024    16
    0.15321907   2    1000035    15
    0.10404231   2    1000015    35
    0.10398322   2    1000015    36
    0.099311947   2    1000023    15
    0.095907877   2    1000022    15
    0.017866013   2    1000016   -24
    0.0089137563   2    1000015    23
    0.0077040889   2    1000015    25
    0.0064090543   2   -1000037    16
    0.003182096   2    1000025    15

DECAY 1000012  3.5830498
    0.58575652   2    1000037    11
    0.29627171   2    1000025    12
    0.075922773   2    1000024    11
    0.029637754   2    1000022    12
    0.012318721   2    1000035    12

DECAY 1000014  3.594205
    0.58390853   2    1000037    13
    0.29531498   2    1000025    14
    0.078864878   2    1000024    13
    0.02954398   2    1000022    14
    0.012275391   2    1000035    14

DECAY 1000016  2.5025006
    0.74263234   2    1000024    15
    0.15701957   2    1000037    15
    0.077740434   2    1000025    16
    0.022538516   2    1000022    16

DECAY 2000001  7.9269973
    0.95679448   2    1000021    1
    0.042861755   2    1000035    1
    0.00032888819   2    1000023    1

DECAY 1000001  98.645779
    0.72937849   2    1000021    1
    0.17190148   2   -1000037    2
    0.085366854   2    1000025    1
    0.0069069962   2   -1000024    2
    0.0041306197   2    1000022    1
    0.002305712   2    1000035    1

DECAY 2000003  7.9403222
    0.95506999   2    1000021    3
    0.042788627   2    1000035    3
    0.00088155355   2   -1000024    4
    0.00077657606   2    1000023    3
    0.00045259028   2    1000022    3

DECAY 1000003  98.658044
    0.72927814   2    1000021    3
    0.17187955   2   -1000037    4
    0.085357292   2    1000025    3
    0.0069142572   2   -1000024    4
    0.0041896543   2    1000022    3
    0.0023054951   2    1000035    3

DECAY 1000005  44.561616
    0.41315755   2   -1000024    6
    0.21378819   2    1000023    5
    0.21282227   2    1000022    5
    0.14375355   2    1000021    5
    0.0072946347   2    1000035    5
    0.006046348   2   -1000037    6
    0.0031374575   2    1000025    5

DECAY 2000005  181.74228
    0.35735582   2    1000021    5
    0.24406902   2   -1000024    6
    0.10386835   2   -1000037    6
    0.086910893   2    1000023    5
    0.086113064   2    1000022    5
    0.059517933   2    1000006   -24
    0.047284776   2    1000025    5
    0.0068467062   2    1000005    23
    0.0066247127   2    1000005    25
    0.0014087213   2    1000035    5

DECAY 1000002  98.593383
    0.72879196   2    1000021    2
    0.16914201   2    1000037    1
    0.085228699   2    1000025    2
    0.010207321   2    1000024    1
    0.0042872995   2    1000022    2
    0.0022471997   2    1000035    2

DECAY 2000002  94.041798
    0.956066   2    1000021    2
    0.043723908   2    1000035    2
    0.00020319999   2    1000023    2

DECAY 1000004  98.605037
    0.72869498   2    1000021    4
    0.16912438   2    1000037    3
    0.085218085   2    1000025    4
    0.010324733   2    1000024    3
    0.004291044   2    1000022    4
    0.0022469207   2    1000035    4

DECAY 2000004  94.043515
    0.95604695   2    1000021    4
    0.043723112   2    1000035    4
    0.00020813454   2    1000023    4

DECAY 1000006  92.673757
    0.37861459   2    1000024    5
    0.21112177   2    1000021    6
    0.19191713   2    1000022    6
    0.18990591   2    1000023    6
    0.022810387   2    1000035    6
    0.003562572   2    1000037    5
    0.0019181116   2    1000025    6
    0.00010968778   3    1000022    24    5

DECAY 2000006  188.29764
    0.3607898   2    1000021    6
    0.16061978   2    1000024    5
    0.12228967   2    1000023    6
    0.11569766   2    1000022    6
    0.097302893   2    1000037    5
    0.049275512   2    1000006    25
    0.049046057   2    1000025    6
    0.030029244   2    1000006    23
    0.013618457   2    1000005    24
    0.0013309361   2    1000035    6

DECAY 1000024  3.5479199e-12
    0.60558318   3    1000022   -1    2
    0.20192423   3    1000022   -11    12
    0.19249259   3    1000022   -13    14

DECAY 1000037  6.8375922
    0.30536344   2    1000022    24
    0.23846021   2    1000024    23
    0.23239278   2    1000023    24
    0.22284473   2    1000024    25
    0.00056487245   3    1000022   -5    6
    0.00036513309   3    1000023   -5    6

DECAY 1000022 -1


DECAY 1000023  1.0445524e-06
    0.36722073   2    1000022    22
    0.09924261   3    1000022    12   -12
    0.074212863   3    1000022    1   -1
    0.074147501   3    1000022    3   -3
    0.057880097   3    1000022    2   -2
    0.048273491   3    1000022    4   -4
    0.039321191   3    1000024    1   -2
    0.039321191   3   -1000024   -1    2
    0.036233859   3    1000024    3   -4
    0.036233859   3   -1000024   -3    4
    0.016746609   3    1000022    11   -11
    0.016723526   3    1000022    13   -13
    0.013106553   3    1000024    11   -12
    0.013106553   3   -1000024   -11    12
    0.013098958   3    1000024    13   -14
    0.013098958   3   -1000024   -13    14
    0.01137068   3    1000022    15   -15
    0.011181761   3    1000024    15   -16
    0.011181761   3   -1000024   -15    16
    0.0082972461   3    1000022    5   -5

DECAY 1000025  9.301345
    0.22737165   2    1000024   -24
    0.22737165   2   -1000024    24
    0.21695511   2    1000023    23
    0.16449537   2    1000023    25
    0.160887   2    1000022    25
    0.0019892798   2    1000022    23
    0.00043743949   3    1000024    5   -6
    0.00043743949   3   -1000024   -5    6

DECAY 1000035  4.2573883
    0.20342628   2    1000022    23
    0.19677397   2    1000022    25
    0.19573693   2    1000024   -24
    0.19573693   2   -1000024    24
    0.17826647   2    1000023    25
    0.0068240733   2    1000023    23
    0.0034987024   2    1000016   -16
    0.0034987024   2   -1000016    16
    0.0033411542   2    1000015   -15
    0.0033411542   2   -1000015    15
    0.0022836687   3    1000024    5   -6
    0.0022836687   3   -1000024   -5    6
    0.001277309   2    1000025    23
    0.00099969523   2    1000025    25
    0.00093793242   2    1000037   -24
    0.00093793242   2   -1000037    24
    0.0004366949   3    1000022    6   -6
    0.00035207345   3    1000023    6   -6

DECAY 1000021  0.044064923
    0.22761042   3    1000024    5   -6
    0.22761042   3   -1000024   -5    6
    0.14567466   3    1000022    5   -5
    0.1427724   3    1000023    5   -5
    0.1065524   3    1000022    6   -6
    0.097773251   3    1000023    6   -6
    0.0067888144   2    1000023    21
    0.0046160887   3    1000025    5   -5
    0.0045813334   2    1000022    21
    0.0033739577   3    1000037    5   -6
    0.0033739577   3   -1000037   -5    6
    0.0031539568   3    1000025    2   -2
    0.0031538459   3    1000025    4   -4
    0.0031537035   3    1000025    3   -3
    0.0031531673   3    1000025    1   -1
    0.0022743224   3    1000037    3   -4
    0.0022743224   3   -1000037   -3    4
    0.0022738361   3    1000037    1   -2
    0.0022738361   3   -1000037   -1    2
    0.0010210433   3    1000025    6   -6
    0.00073970161   3    1000035    5   -5
    0.00066180002   3    1000035    3   -3
    0.00066173733   3    1000035    1   -1
    0.00051720852   3    1000022    3   -3
    0.00048848984   3    1000022    4   -4
    0.00048746057   3    1000022    2   -2
    0.00046957862   3    1000022    1   -1
    0.00043153341   3    1000024    3   -4
    0.00043153341   3   -1000024   -3    4
    0.0003832089   3    1000024    1   -2
    0.0003832089   3   -1000024   -1    2
    0.00020993548   3    1000035    2   -2
    0.00020991842   3    1000035    4   -4
    0.00020311641   3    1000035    6   -6

DECAY 25  0.0036879962
    0.60708223   2   -5    5
    0.19477438   2   -24    24
    0.072809977   2    21    21
    0.069184151   2   -15    15
    0.029389322   2   -4    4
    0.022667607   2    23    23
    0.002308581   2    22    22
    0.0013159273   2    22    23
    0.00023991371   2   -13    13
    0.00022712827   2   -3    3
    6.2798275e-07   2   -1    1
    1.514563e-07   2   -2    2
    5.3935526e-09   2   -11    11

DECAY 35  107.15768
    0.90531789   2   -5    5
    0.093706804   2   -15    15
    0.00035105857   2   -6    6
    0.00031845234   2   -13    13
    0.0002770669   2   -3    3
    2.7067325e-05   2    21    21
    7.6576696e-07   2   -1    1
    3.2159793e-07   2    23    23
    3.0342232e-07   2    25    25
    2.1250608e-07   2   -24    24
    2.5100284e-08   2    22    23
    2.0864658e-08   2    22    22
    7.1534889e-09   2   -11    11
    4.9657675e-09   2   -4    4
    2.5604133e-14   2   -2    2

DECAY 36  97.777641
    0.90528238   2   -5    5
    0.093704783   2   -15    15
    0.00037626169   2   -6    6
    0.00031844309   2   -13    13
    0.00027704501   2   -3    3
    3.9818155e-05   2    21    21
    7.6570625e-07   2   -1    1
    4.6730552e-07   2    23    25
    1.817338e-08   2    22    22
    7.1532838e-09   2   -11    11
    6.4037567e-09   2    22    23
    5.0828126e-09   2   -4    4
    2.6206504e-14   2   -2    2
    9.0999711e-42   2    25    25

DECAY 37  105.10527
    0.9185114   2   -5    6
    0.079556641   2   -15    16
    0.0013716466   2   -5    4
    0.00028126153   2   -13    14
    0.00025540272   2   -3    4
    1.1882824e-05   2   -3    2
    9.7949798e-06   2   -5    2
    7.672286e-07   2   -3    6
    7.08404e-07   2   -1    2
    4.3723592e-07   2    24    25
    3.3031457e-08   2   -1    4
    1.8195417e-08   2   -1    6
    6.5787365e-09   2   -11    12
    3.7976821e-12   2    24    35
    6.1272455e-13   2    24    36

DECAY 6  2.43
    1   2    5    24

DECAY 15 -1
