BLOCK SPINFO
   1   SPheno
   2   v4.0.5be

BLOCK SPHENOINFO
   1   2
   2   2

BLOCK MODSEL
   1   0

BLOCK MINPAR
   3    8.797628
   4    1

BLOCK EXTPAR
   0    1285.2504
   1    1377.7974
   2    735.32323
   3    3000
   11    3364.5569
   12    391.37726
   13    1181.1307
   23    129.37074
   25    8.4349146
   26    3657.0733
   31    1116.944
   32    1116.944
   33    248.06001
   34    1365.0156
   35    1365.0156
   36    1889.8481
   41    5000
   42    5000
   43    1865.7007
   44    5000
   45    5000
   46    1022.4523
   47    5000
   48    5000
   49    1358.0856

BLOCK SMINPUTS
   1    127.90897
   2    1.1663787e-05
   3    0.1184
   4    91.1876
   5    4.18
   6    173.2
   7    1.777
   8    0
   11    0.00051099893
   12    0
   13    0.10565837
   14    0
   21    0.005
   22    0.0025
   23    0.095
   24    1.27

BLOCK GAUGE Q=  1285.2504
   1    0.35536298
   2    0.66519887
   3    1.219778

BLOCK YU Q=  1285.2504
   1   1    8.4430888e-06
   2   2    0.0042890891
   3   3    1.0199929

BLOCK YD Q=  1285.2504
   1   1    0.00014310747
   2   2    0.0027190419
   3   3    0.14191776

BLOCK YE Q=  1285.2504
   1   1    2.4973299e-05
   2   2    0.0051636863
   3   3    0.086844708

BLOCK AU Q=  1285.2504
   1   1    0
   2   2    0
   3   3    3364.5574

BLOCK AD Q=  1285.2504
   1   1    0
   2   2    0
   3   3    391.37724

BLOCK AE Q=  1285.2504
   1   1    0
   2   2    0
   3   3    1181.1307

BLOCK MSOFT Q=  1285.2504
   1    1377.7974
   2    735.32323
   3    3000
   21    13132631
   22    208016.15
   31    1116.944
   32    1116.944
   33    248.06001
   34    1365.0156
   35    1365.0156
   36    1889.8481
   41    5000
   42    5000
   43    1865.7007
   44    5000
   45    5000
   46    1022.4523
   47    5000
   48    5000
   49    1358.0856

BLOCK MASS
   6    173.2
   23    91.1876
   24    80.429995
   15    1.777
   25    123.591
   35    3656.6239
   36    3657.0733
   37    3657.7898
   1000001    5020.7276
   2000001    5010.3797
   1000002    5020.3078
   2000002    5012.8759
   1000003    5020.7284
   2000003    5010.3802
   1000004    5020.3086
   2000004    5012.8769
   1000005    1340.2151
   2000005    1836.3843
   1000006    883.85228
   2000006    1868.9419
   1000011    1126.9454
   2000011    1366.1234
   1000012    1123.8582
   1000013    1126.946
   2000013    1366.1243
   1000014    1123.8588
   1000015    286.84397
   2000015    1890.5242
   1000016    275.58722
   1000021    3177.1514
   1000022    126.7625
   1000023   -136.4635
   1000025    780.3071
   1000035    1377.5738
   1000024    130.03754
   1000037    780.54018

BLOCK ALPHA
      -0.11337468

BLOCK HMIX Q=  1285.2504
   1    129.37074
   2    8.4349146
   3    244.12985
   4    13374185

BLOCK STOPMIX
   1   1   -0.19676595
   1   2    0.98045049
   2   1   -0.98045049
   2   2   -0.19676595

BLOCK SBOTMIX
   1   1    0.00088188468
   1   2    0.99999961
   2   1   -0.99999961
   2   2    0.00088188468

BLOCK STAUMIX
   1   1   -1
   1   2    2.0972884e-05
   2   1   -2.0972884e-05
   2   2   -1

BLOCK NMIX
   1   1    0.027528517
   1   2   -0.095052669
   1   3    0.71682151
   1   4   -0.69019859
   2   1    0.018706417
   2   2   -0.055392912
   2   3   -0.69658925
   2   4   -0.71508399
   3   1   -0.0081507303
   3   2   -0.99391992
   3   3   -0.029699338
   3   4    0.1057105
   4   1    0.99941274
   4   2   -0.0044509251
   4   3   -0.0069484961
   4   4    0.033257952

BLOCK UMIX
   1   1   -0.042217113
   1   2    0.99910846
   2   1    0.99910846
   2   2    0.042217113

BLOCK VMIX
   1   1   -0.1507327
   1   2    0.98857456
   2   1    0.98857456
   2   2    0.1507327

BLOCK HIGGSBOUNDSINPUTHIGGSCOUPLINGSFERMIONS
       0, 71.147784,3,36,15,15

BLOCK HIGGSBOUNDSINPUTHIGGSCOUPLINGSBOSONS
       0,4,36,21,21,23

BLOCK SPHENOLOWENERGY
   1    0.00033329759
   2    1.5856376e-06
   3    3.5177278e-05
   4    2.4637523e-15
   5    1.0524872e-10
   6    2.2034436e-08
   7    8.2953064e-14
   8    3.5437528e-09
   9    7.5171463e-07
   10    9.6775215e-05
   11    0.99965092
   12    0.54378279
   13    19.429697
   14    0
   15    0
   16    0.0021649526
   17    2.2817359e-15
   18    2.4755994e-11
   19    8.2795147e-11
   20    2.6302164e-15
   21    1.1245034e-10
   22    5.9470862e-08
   23    0
   24    0
   25    0
   26    0
   27    0
   28    0
   29    0
   30    0
   31    0
   39   -4.231061e-05
   40    0
   41    0
   42    0

BLOCK FWCOEF Q=  160
   305   4422   0   0   -0.18881911
   305   4422   0   2   -0.20379958
   305   4322   0   2   -0.00015468831
   305   6421   0   0   -0.095227835
   305   6421   0   2   -0.1059296
   305   6321   0   2   -0.00014466728
   3051111   4133   0   0    1.5862424
   3051111   4133   0   2    1.587653
   3051111   4233   0   2    9.8762559e-06
   3051111   4137   0   0   -4.4089345
   3051111   4137   0   2   -4.3998564
   3051111   4237   0   2   -7.6488208e-05
   3051313   4133   0   0    1.5862424
   3051313   4133   0   2    1.5876528
   3051313   4233   0   2    9.8762534e-06
   3051313   4137   0   0   -4.4089345
   3051313   4137   0   2   -4.3998567
   3051313   4237   0   2   -7.6488215e-05
   3051212   4137   0   0    1.5053501
   3051212   4137   0   2    1.5033808
   3051212   4237   0   2    1.6691633e-05
   3051414   4137   0   0    1.5053501
   3051414   4137   0   2    1.5033808
   3051414   4237   0   2    1.6691633e-05
   3051616   4137   0   0    1.5053501
   3051616   4137   0   2    1.5033798
   3051616   4237   0   2    1.6692286e-05

BLOCK IMFWCOEF Q=  160
   305   4422   0   0    3.8581717e-07
   305   4422   0   2    5.3322923e-06
   305   4322   0   2   -1.2168444e-06
   305   6421   0   0    3.3047792e-07
   305   6421   0   2   -5.0353511e-07
   305   6321   0   2   -5.1854697e-07
   3051111   4133   0   2   -1.5587442e-06
   3051111   4233   0   2    1.9997564e-07
   3051111   4137   0   2    1.1927708e-05
   3051111   4237   0   2   -1.5515354e-06
   3051313   4133   0   2   -1.5587448e-06
   3051313   4233   0   2    1.999756e-07
   3051313   4137   0   2    1.1927711e-05
   3051313   4237   0   2   -1.5515355e-06
   3051212   4137   0   2   -2.3897329e-06
   3051212   4237   0   2    3.3858304e-07
   3051414   4137   0   2   -2.3897329e-06
   3051414   4237   0   2    3.3858304e-07
   3051616   4137   0   2   -2.407801e-06
   3051616   4237   0   2    3.3859433e-07

DECAY 23  2.4952


DECAY 24  2.085


DECAY 1000011  4.07858
    0.65725245   2   -1000037    12
    0.32843901   2    1000025    11
    0.0076536696   2    1000022    11
    0.0042204759   2   -1000024    12
    0.0024343873   2    1000023    11

DECAY 2000011  0.0076744842
    0.66619398   2    1000022    11
    0.30683048   2    1000023    11
    0.026973367   2    1000025    11

DECAY 1000013  4.0791706
    0.6571588   2   -1000037    14
    0.32839228   2    1000025    13
    0.0077259395   2    1000022    13
    0.0042198671   2   -1000024    14
    0.0025031128   2    1000023    13

DECAY 2000013  0.0090972167
    0.6022309   2    1000022    13
    0.29673969   2    1000023    13
    0.078082008   2   -1000024    14
    0.022786658   2    1000025    13

DECAY 1000015  0.036517837
    0.53336192   2    1000022    15
    0.38885002   2    1000023    15
    0.077779426   2   -1000024    16

DECAY 2000015  2.6598522
    0.78474948   2    1000035    15
    0.10545168   2   -1000024    16
    0.05698711   2    1000022    15
    0.052453121   2    1000023    15
    0.00022737089   2    1000025    15
    0.00012980259   2   -1000037    16

DECAY 1000012  4.1876003
    0.61867293   2    1000037    11
    0.31030204   2    1000025    12
    0.052250117   2    1000024    11
    0.013871019   2    1000022    12
    0.0049038955   2    1000023    12

DECAY 1000014  4.1881889
    0.61858757   2    1000037    13
    0.31025916   2    1000025    14
    0.052380989   2    1000024    13
    0.013869077   2    1000022    14
    0.0049032089   2    1000023    14

DECAY 1000016  0.069846725
    0.82739146   2    1000024    15
    0.13005215   2    1000022    16
    0.04255639   2    1000023    16

DECAY 2000001  143.77066
    0.98337074   2    1000021    1
    0.016606474   2    1000035    1

DECAY 1000001  206.2022
    0.69086371   2    1000021    1
    0.20374225   2   -1000037    2
    0.10052455   2    1000025    1
    0.0030495708   2    1000035    1
    0.0010693793   2    1000022    1
    0.00038150548   2   -1000024    2
    0.00036904381   2    1000023    1

DECAY 2000003  143.77218
    0.98336071   2    1000021    3
    0.016606301   2    1000035    3

DECAY 1000003  206.20486
    0.69085518   2    1000021    3
    0.20373985   2   -1000037    4
    0.10052327   2    1000025    3
    0.0030495323   2    1000035    3
    0.0010711982   2    1000022    3
    0.00039019574   2   -1000024    4
    0.00037076962   2    1000023    3

DECAY 1000005  1.035924
    0.49062552   2   -1000024    6
    0.26236895   2    1000022    5
    0.24651435   2    1000023    5
    0.00029993326   2   -1000037    6
    0.00018307063   2    1000025    5

DECAY 2000005  127.05821
    0.57544111   2    1000006   -24
    0.28424441   2   -1000024    6
    0.091252068   2   -1000037    6
    0.042081715   2    1000025    5
    0.0035733649   2    1000022    5
    0.0029984341   2    1000023    5
    0.0004049048   2    1000035    5

DECAY 2000002  151.2093
    0.93671354   2    1000021    2
    0.063199878   2    1000035    2

DECAY 1000002  206.19969
    0.69066002   2    1000021    2
    0.19945276   2    1000037    1
    0.10110539   2    1000025    2
    0.004863046   2    1000024    1
    0.0027589304   2    1000035    2
    0.00086981821   2    1000022    2
    0.0002900332   2    1000023    2

DECAY 2000004  151.21301
    0.93669086   2    1000021    4
    0.063198354   2    1000035    4

DECAY 1000004  206.20229
    0.69065141   2    1000021    4
    0.19945029   2    1000037    3
    0.10110423   2    1000025    4
    0.0048665447   2    1000024    3
    0.0027589026   2    1000035    4
    0.00087404478   2    1000022    4
    0.00029457804   2    1000023    4

DECAY 1000006  31.804306
    0.49721759   2    1000024    5
    0.26012135   2    1000023    6
    0.2405602   2    1000022    6
    0.0021007384   2    1000037    5

DECAY 2000006  135.0615
    0.29813956   2    1000006    25
    0.2822256   2    1000006    23
    0.14399585   2    1000023    6
    0.13622006   2    1000022    6
    0.070858964   2    1000037    5
    0.038750849   2    1000025    6
    0.029263836   2    1000024    5
    0.00054256118   2    1000035    6

DECAY 1000024  3.8664685e-10
    0.44949992   3    1000022   -1    2
    0.21705781   3    1000022   -3    4
    0.1498476   3    1000022   -11    12
    0.14907237   3    1000022   -13    14
    0.034522294   3    1000022   -15    16

DECAY 1000037  12.244449
    0.2100966   2    1000016   -15
    0.20953887   2   -1000015    16
    0.15163946   2    1000023    24
    0.14443351   2    1000024    23
    0.14131168   2    1000022    24
    0.13854442   2    1000024    25
    0.0017637668   3    1000022   -5    6
    0.0014582475   3    1000023   -5    6
    0.0011298517   3    1000024    6   -6

DECAY 1000022 -1


DECAY 1000023  2.6619593e-07
    0.2456095   2    1000022    22
    0.14638908   3    1000022    12   -12
    0.10940354   3    1000022    1   -1
    0.10926403   3    1000022    3   -3
    0.08532538   3    1000022    2   -2
    0.065603221   3    1000022    4   -4
    0.032519886   3    1000024    1   -2
    0.032519886   3   -1000024   -1    2
    0.025784864   3    1000024    3   -4
    0.025784864   3   -1000024   -3    4
    0.024688243   3    1000022    11   -11
    0.024638705   3    1000022    13   -13
    0.013935529   3    1000022    15   -15
    0.010840399   3    1000024    11   -12
    0.010840399   3   -1000024   -11    12
    0.010822459   3    1000024    13   -14
    0.010822459   3   -1000024   -13    14
    0.0069265332   3    1000024    15   -16
    0.0069265332   3   -1000024   -15    16
    0.0013544898   3    1000022    5   -5

DECAY 1000025  12.680563
    0.14446628   2    1000024   -24
    0.14446628   2   -1000024    24
    0.10928263   2    1000023    23
    0.10159419   2    1000016   -16
    0.10159419   2   -1000016    16
    0.10094531   2    1000015   -15
    0.10094531   2   -1000015    15
    0.094911554   2    1000022    25
    0.066010682   2    1000023    25
    0.031824707   2    1000022    23
    0.0015769673   3    1000024    5   -6
    0.0015769673   3   -1000024   -5    6
    0.00040931998   3    1000022    6   -6
    0.00038742642   3    1000023    6   -6

DECAY 1000035  10.935621
    0.13437605   2    1000006   -6
    0.13437605   2   -1000006    6
    0.084174684   2    1000024   -24
    0.084174684   2   -1000024    24
    0.074047455   2    1000016   -16
    0.074047455   2   -1000016    16
    0.071123355   2    1000015   -15
    0.071123355   2   -1000015    15
    0.064869316   2    1000023    23
    0.054050451   2    1000022    25
    0.037259588   2    1000023    25
    0.025672842   2    1000022    23
    0.0089866719   2    1000012   -12
    0.0089866719   2   -1000012    12
    0.0089866362   2    1000014   -14
    0.0089866362   2   -1000014    14
    0.0085026475   2    1000011   -11
    0.0085026475   2   -1000011    11
    0.0085026146   2    1000013   -13
    0.0085026146   2   -1000013    13
    0.0042217918   2    1000037   -24
    0.0042217918   2   -1000037    24
    0.0037929049   2    1000025    25
    0.002258736   3    1000024    5   -6
    0.002258736   3   -1000024   -5    6
    0.0012795248   3    1000023    6   -6
    0.0012512224   3    1000022    6   -6
    0.00029942042   2    1000005   -5
    0.00029942042   2   -1000005    5
    0.00028782225   2    1000025    23

DECAY 1000021  226.46512
    0.18467033   2    1000006   -6
    0.18467033   2   -1000006    6
    0.14031454   2    1000005   -5
    0.14031454   2   -1000005    5
    0.092075373   2    2000005   -5
    0.092075373   2   -2000005    5
    0.082707404   2    2000006   -6
    0.082707404   2   -2000006    6
    0.0001716846   3    1000025    6   -6

DECAY 25  0.0036996967
    0.59570152   2   -5    5
    0.2061525   2   -24    24
    0.071726413   2    21    21
    0.068444271   2   -15    15
    0.029480264   2   -4    4
    0.024260953   2    23    23
    0.0023853313   2    22    22
    0.001386815   2    22    23
    0.00023734966   2   -13    13
    0.0002238099   2   -3    3
    6.1881165e-07   2   -1    1
    1.5192344e-07   2   -2    2
    5.3359021e-09   2   -11    11

DECAY 35  51.771715
    0.25939361   2   -1000024    1000037
    0.25939361   2   -1000037    1000024
    0.15679253   2    1000023    1000025
    0.10291697   2    1000022    1000025
    0.055907849   2   -5    5
    0.03782086   2    1000023    1000035
    0.033675684   2   -6    6
    0.024227613   2    1000022    1000035
    0.016747367   2   -2000006    1000006
    0.016747367   2   -1000006    2000006
    0.01345807   2   -1000024    1000024
    0.011027216   2   -15    15
    0.0050551683   2   -1000006    1000006
    0.0030356164   2    1000022    1000022
    0.0015947474   2    1000023    1000023
    0.00056911025   2    1000022    1000023
    0.00042353326   2   -2000015    1000015
    0.00042353326   2   -1000015    2000015
    0.00029399616   2   -1000037    1000037
    0.00014937261   2    1000025    1000025
    9.0771544e-05   2   -2000005    1000005
    9.0771544e-05   2   -1000005    2000005
    4.7388028e-05   2    25    25
    3.7869568e-05   2   -13    13
    2.5565794e-05   2    1000025    1000035
    2.2065714e-05   2   -3    3
    6.0022366e-06   2    23    23
    2.1828096e-06   2    21    21
    1.5923168e-06   2   -1000015    1000015
    1.4181947e-06   2   -1000011    1000011
    1.4176418e-06   2   -1000013    1000013
    1.4104697e-06   2   -24    24
    7.7103392e-07   2   -2000011    2000011
    7.706801e-07   2   -2000013    2000013
    4.6297978e-07   2   -4    4
    3.9801202e-07   2    1000035    1000035
    9.5364887e-08   2   -1000005    1000005
    6.5290531e-08   2    22    22
    6.1005013e-08   2   -1    1
    4.6807337e-08   2    22    23
    8.5047596e-10   2   -11    11
    2.3096391e-10   2   -2000013    1000013
    2.3096391e-10   2   -1000013    2000013
    2.3865215e-12   2   -2    2
    5.4022707e-15   2   -2000011    1000011
    5.4022707e-15   2   -1000011    2000011

DECAY 36  51.546181
    0.25877656   2   -1000024    1000037
    0.25877656   2   -1000037    1000024
    0.16358463   2    1000022    1000025
    0.095847893   2    1000023    1000025
    0.053845864   2   -5    5
    0.039803949   2    1000022    1000035
    0.032032786   2   -6    6
    0.02229404   2    1000023    1000035
    0.019393985   2   -2000006    1000006
    0.019393985   2   -1000006    2000006
    0.015410976   2   -1000024    1000024
    0.010620357   2   -15    15
    0.004739416   2    1000022    1000022
    0.0020265369   2   -1000037    1000037
    0.001004132   2    1000023    1000023
    0.00099720865   2    1000025    1000025
    0.00042537544   2   -2000015    1000015
    0.00042537544   2   -1000015    2000015
    0.00025528524   2    1000025    1000035
    9.1258504e-05   2   -2000005    1000005
    9.1258504e-05   2   -1000005    2000005
    6.7364866e-05   2    1000022    1000023
    3.6471964e-05   2   -13    13
    2.1250879e-05   2   -3    3
    1.3886814e-05   2    21    21
    1.1591548e-05   2    23    25
    1.1295059e-05   2    1000035    1000035
    4.3632013e-07   2   -4    4
    1.1043341e-07   2    22    22
    9.6750883e-08   2    22    23
    5.8752337e-08   2   -1    1
    8.1908769e-10   2   -11    11
    2.2985228e-10   2   -2000013    1000013
    2.2985228e-10   2   -1000013    2000013
    2.2491707e-12   2   -2    2
    5.3762688e-15   2   -2000011    1000011
    5.3762688e-15   2   -1000011    2000011
    2.5772304e-39   2    25    25

DECAY 37  51.104271
    0.27981186   2    1000022    1000037
    0.26854554   2    1000024    1000025
    0.25801426   2    1000023    1000037
    0.092828871   2   -5    6
    0.060781016   2    1000024    1000035
    0.024303828   2   -2000005    1000006
    0.011078681   2   -15    16
    0.0025311848   2    1000023    1000024
    0.0008590375   2   -2000015    1000016
    0.00049145514   2    1000022    1000024
    0.00028108809   2    1000035    1000037
    0.00022561914   2   -1000005    2000006
    8.4630956e-05   2   -5    4
    5.091349e-05   2   -3    6
    3.9167082e-05   2   -13    14
    2.1010352e-05   2   -3    4
    1.8029329e-05   2   -1000005    1000006
    1.1703563e-05   2    24    25
    6.7967173e-06   2   -1000015    1000016
    5.6436158e-06   2   -1000011    1000012
    5.6428305e-06   2   -1000013    1000014
    2.3337243e-06   2   -1    6
    9.6495784e-07   2   -3    2
    6.0434727e-07   2   -5    2
    5.7043233e-08   2   -1    2
    3.8982692e-08   2    1000025    1000037
    2.3954495e-08   2   -1    4
    9.1612213e-10   2   -11    12
    4.8353826e-10   2   -2000013    1000014
    5.7402211e-14   2    24    35
    1.1310042e-14   2   -2000011    1000012

DECAY 6  2.43
    1   2    5    24

DECAY 15 -1
