BLOCK SPINFO
   1   SPheno
   2   v4.0.5be

BLOCK SPHENOINFO
   1   2
   2   2

BLOCK MODSEL
   1   0

BLOCK MINPAR
   3    25.727759
   4    1

BLOCK EXTPAR
   0    1450.2707
   1   -1137.2806
   2   -4564.0161
   3    2415.7275
   11   -2601.6984
   12   -4006.2472
   13    6909.1359
   23    2872.1955
   25    24.895498
   26    2975.5002
   31    4728.4178
   32    4728.4178
   33    3547.1075
   34    4877.109
   35    4877.109
   36    4015.7425
   41    2694.2858
   42    2694.2858
   43    1807.1463
   44    1253.6106
   45    1253.6106
   46    1168.5388
   47    3942.1534
   48    3942.1534
   49    4253.8501

BLOCK SMINPUTS
   1    127.90897
   2    1.1663787e-05
   3    0.1184
   4    91.1876
   5    4.18
   6    173.2
   7    1.777
   8    0
   11    0.00051099893
   12    0
   13    0.10565837
   14    0
   21    0.005
   22    0.0025
   23    0.095
   24    1.27

BLOCK GAUGE Q=  1450.2707
   1    0.35536298
   2    0.66519887
   3    1.219778

BLOCK YU Q=  1450.2707
   1   1    8.3911333e-06
   2   2    0.0042626957
   3   3    1.0137163

BLOCK YD Q=  1450.2707
   1   1    0.00041977995
   2   2    0.007975819
   3   3    0.41629017

BLOCK YE Q=  1450.2707
   1   1    7.325467e-05
   2   2    0.015146742
   3   3    0.25474329

BLOCK AU Q=  1450.2707
   1   1    0
   2   2    0
   3   3   -2601.6983

BLOCK AD Q=  1450.2707
   1   1    0
   2   2    0
   3   3   -4006.247

BLOCK AE Q=  1450.2707
   1   1    0
   2   2    0
   3   3    6909.1359

BLOCK MSOFT Q=  1450.2707
   1   -1137.2806
   2   -4564.0161
   3    2415.7275
   21    893648.58
   22   -7938473.5
   31    4728.4178
   32    4728.4178
   33    3547.1075
   34    4877.109
   35    4877.109
   36    4015.7425
   41    2694.2858
   42    2694.2858
   43    1807.1463
   44    1253.6106
   45    1253.6106
   46    1168.5388
   47    3942.1534
   48    3942.1534
   49    4253.8501

BLOCK MASS
   6    173.2
   23    91.1876
   24    80.429995
   15    1.777
   25    120.78783
   35    2976.7081
   36    2975.5002
   37    2975.7108
   1000001    2716.1982
   2000001    3970.1632
   1000002    2715.2576
   2000002    1284.2535
   1000003    2716.1989
   2000003    3970.1628
   1000004    2715.2586
   2000004    1284.2542
   1000005    1802.1645
   2000005    4280.1115
   1000006    1148.5786
   2000006    1831.2069
   1000011    4720.5059
   2000011    4887.176
   1000012    4719.5683
   1000013    4720.5076
   2000013    4887.1877
   1000014    4719.5735
   1000015    3537.4036
   2000015    4033.4214
   1000016    3536.733
   1000021    2529.2326
   1000022   -1141.8367
   1000023   -2864.8711
   1000025    2866.9384
   1000035   -4528.3727
   1000024    2865.2178
   1000037    4528.4446

BLOCK ALPHA
      -0.038887036

BLOCK HMIX Q=  1450.2707
   1    2872.1955
   2    24.895498
   3    244.08241
   4    8853601.5

BLOCK STOPMIX
   1   1    0.2069895
   1   2    0.97834316
   2   1   -0.97834316
   2   2    0.2069895

BLOCK SBOTMIX
   1   1    0.99995288
   1   2    0.0097072157
   2   1   -0.0097072157
   2   2    0.99995288

BLOCK STAUMIX
   1   1    0.99956993
   1   2    0.029324974
   2   1   -0.029324974
   2   2    0.99956993

BLOCK NMIX
   1   1   -0.99980876
   1   2    9.3640052e-05
   1   3   -0.018434322
   1   4   -0.006527365
   2   1    0.017647082
   2   2    0.029845627
   2   3   -0.70676114
   2   4   -0.70660208
   3   1    0.0084192582
   3   2   -0.0076422709
   3   3   -0.70703775
   3   4    0.70708438
   4   1   -0.00036889895
   4   2    0.9995253
   4   3    0.015699535
   4   4    0.026505906

BLOCK UMIX
   1   1   -0.023782101
   1   2    0.99971717
   2   1   -0.99971717
   2   2   -0.023782101

BLOCK VMIX
   1   1    0.039275116
   1   2    0.99922844
   2   1    0.99922844
   2   2   -0.039275116

BLOCK HIGGSBOUNDSINPUTHIGGSCOUPLINGSFERMIONS
       0, 619.78582,3,36,15,15

BLOCK HIGGSBOUNDSINPUTHIGGSCOUPLINGSBOSONS
       0,4,36,21,21,23

BLOCK SPHENOLOWENERGY
   1    0.00031294288
   2    1.5916308e-06
   3    3.525986e-05
   4    2.2040859e-15
   5    9.4155848e-11
   6    1.9699305e-08
   7    7.4265865e-14
   8    3.1726289e-09
   9    6.7256829e-07
   10    9.649773e-05
   11    0.99678461
   12    0.5419785
   13    19.363637
   14    0
   15    0
   16    0.0021573138
   17    2.2816586e-15
   18    2.480975e-11
   19    8.2921336e-11
   20   -4.6524666e-16
   21   -1.9890709e-11
   22   -7.1388324e-09
   23    0
   24    0
   25    0
   26    0
   27    0
   28    0
   29    0
   30    0
   31    0
   39    6.1136807e-05
   40    0
   41    0
   42    0

BLOCK FWCOEF Q=  160
   305   4422   0   0   -0.18881911
   305   4422   0   2   -0.17968522
   305   4322   0   2    0.00010212735
   305   6421   0   0   -0.095227835
   305   6421   0   2   -0.092798504
   305   6321   0   2   -1.6328683e-05
   3051111   4133   0   0    1.5907384
   3051111   4133   0   2    1.5910331
   3051111   4233   0   2    1.6759452e-05
   3051111   4137   0   0   -4.4134304
   3051111   4137   0   2   -4.4124878
   3051111   4237   0   2   -0.0001309197
   3051313   4133   0   0    1.5907384
   3051313   4133   0   2    1.5910328
   3051313   4233   0   2    1.6759392e-05
   3051313   4137   0   0   -4.4134304
   3051313   4137   0   2   -4.4124882
   3051313   4237   0   2   -0.00013091967
   3051212   4137   0   0    1.5053501
   3051212   4137   0   2    1.5051446
   3051212   4237   0   2    2.854044e-05
   3051414   4137   0   0    1.5053501
   3051414   4137   0   2    1.5051446
   3051414   4237   0   2    2.8540451e-05
   3051616   4137   0   0    1.5053501
   3051616   4137   0   2    1.5051446
   3051616   4237   0   2    2.8543588e-05

BLOCK IMFWCOEF Q=  160
   305   4422   0   0    3.8588643e-07
   305   4422   0   2    3.9427178e-07
   305   4322   0   2    3.9390571e-06
   305   6421   0   0    3.3053725e-07
   305   6421   0   2   -4.8759768e-06
   305   6321   0   2    2.5207581e-06
   3051111   4133   0   2   -1.3478669e-06
   3051111   4233   0   2    5.8542649e-07
   3051111   4137   0   2    1.1465589e-05
   3051111   4237   0   2   -4.5732411e-06
   3051313   4133   0   2   -1.3478646e-06
   3051313   4233   0   2    5.8542635e-07
   3051313   4137   0   2    1.1465591e-05
   3051313   4237   0   2   -4.5732416e-06
   3051212   4137   0   2   -2.4993949e-06
   3051212   4237   0   2    9.9696351e-07
   3051414   4137   0   2   -2.4993949e-06
   3051414   4237   0   2    9.9696351e-07
   3051616   4137   0   2   -2.5001909e-06
   3051616   4237   0   2    9.9696358e-07

DECAY 23  2.4952


DECAY 24  2.085


DECAY 1000011  5.6703883
    0.92626053   2    1000022    11
    0.046545095   2   -1000037    12
    0.023271495   2    1000035    11
    0.0022550545   2    1000023    11
    0.0016533771   2   -1000024    12

DECAY 2000011  21.944172
    0.99981572   2    1000022    11
    0.00015014056   2    1000023    11

DECAY 1000013  5.6789879
    0.92485949   2    1000022    13
    0.046475393   2   -1000037    14
    0.02323666   2    1000035    13
    0.0030076787   2    1000023    13
    0.0016508754   2   -1000024    14
    0.00076990437   2    1000025    13

DECAY 2000013  21.963621
    0.99893363   2    1000022    13
    0.000437184   2   -1000024    14
    0.00036857492   2    1000023    13
    0.00025249615   2    1000025    13

DECAY 1000015  4.1241829
    0.86750288   2    1000022    15
    0.066344138   2    1000023    15
    0.065058907   2    1000025    15
    0.0010940703   2   -1000024    16

DECAY 2000015  20.596866
    0.83154372   2    1000022    15
    0.061726823   2   -1000024    16
    0.031017149   2    1000025    15
    0.030989951   2    1000023    15
    0.02211072   2    1000016   -24
    0.011736207   2    1000015    25
    0.010875429   2    1000015    23

DECAY 1000012  5.6768967
    0.92561801   2    1000022    12
    0.046011968   2    1000037    11
    0.023045706   2    1000035    12
    0.0045011554   2    1000024    11
    0.00060843318   2    1000023    12
    0.000214726   2    1000025    12

DECAY 1000014  5.6855097
    0.92421707   2    1000022    14
    0.04594467   2    1000037    13
    0.023012009   2    1000035    14
    0.0060043393   2    1000024    13
    0.00060751371   2    1000023    14
    0.00021440151   2    1000025    14

DECAY 1000016  4.1107115
    0.86717442   2    1000022    16
    0.13257329   2    1000024    15
    0.00018666012   2    1000023    16

DECAY 1000001  4.0455775
    0.93644219   2    1000021    1
    0.063557806   2    1000022    1

DECAY 2000001  112.49309
    0.98342579   2    1000021    1
    0.016572411   2    1000022    1

DECAY 1000003  4.0456039
    0.9364424   2    1000021    3
    0.063557598   2    1000022    3

DECAY 2000003  112.49605
    0.98339962   2    1000021    3
    0.016571985   2    1000022    3

DECAY 1000005  34.96655
    0.99738788   2    1000006   -24
    0.0026121243   2    1000022    5

DECAY 2000005  161.41177
    0.8864724   2    1000021    5
    0.027647919   2   -1000024    6
    0.018770945   2    1000005    25
    0.016223435   2    2000006   -24
    0.01390714   2    1000023    5
    0.013898024   2    1000025    5
    0.012775203   2    1000022    5
    0.0086502814   2    1000005    23
    0.0010649662   2    1000006   -24
    0.0005896858   2    1000006   -37

DECAY 2000002  0.125817
    1   2    1000022    2

DECAY 1000002  4.0094032
    0.93604472   2    1000021    2
    0.063955279   2    1000022    2

DECAY 2000004  0.12581143
    1   2    1000022    4

DECAY 1000004  4.0093251
    0.93604334   2    1000021    4
    0.063956501   2    1000022    4

DECAY 1000006  5.2188866e-07
    1   2    1000022    4

DECAY 2000006  39.242497
    0.52314828   2    1000006    25
    0.4736038   2    1000006    23
    0.0032479249   2    1000022    6

DECAY 1000024  99.557227
    0.59251999   2    1000006   -5
    0.32186156   2   -1000005    6
    0.066161896   2    2000006   -5
    0.018323333   2    1000022    24
    0.0011042917   3    1000022   -5    6

DECAY 1000037  217.89426
    0.19265989   2   -1000005    6
    0.17893621   2    2000006   -5
    0.11242275   2   -1000001    2
    0.11242262   2   -1000003    4
    0.11240028   2    1000002   -1
    0.1124002   2    1000004   -3
    0.035458637   2    1000024    25
    0.032789643   2    1000024    23
    0.03268029   2    1000025    24
    0.026746294   2    1000023    24
    0.016924133   2    1000006   -5
    0.013896002   2    1000016   -15
    0.013872095   2   -1000015    16
    0.0024561845   3    1000024    6   -6
    0.0020289624   3    1000023   -5    6
    0.001677625   3    1000025   -5    6
    0.00015756174   3    1000021   -5    6

DECAY 1000022 -1


DECAY 1000023  100.13657
    0.32487807   2    1000006   -6
    0.32487807   2   -1000006    6
    0.13902596   2    2000006   -6
    0.13902596   2   -2000006    6
    0.027067148   2    1000005   -5
    0.027067148   2   -1000005    5
    0.013570246   2    1000022    25
    0.0033791497   2    1000022    23
    0.00099562449   3    1000022    6   -6

DECAY 1000025  101.87254
    0.31987125   2    1000006   -6
    0.31987125   2   -1000006    6
    0.1378406   2    2000006   -6
    0.1378406   2   -2000006    6
    0.026611842   2    1000005   -5
    0.026611842   2   -1000005    5
    0.015612482   2    1000022    25
    0.014649659   2    1000022    23
    0.0010577065   3    1000022    6   -6

DECAY 1000035  229.39907
    0.092218748   2    1000005   -5
    0.092218748   2   -1000005    5
    0.086215776   2    2000006   -6
    0.086215776   2   -2000006    6
    0.053403542   2    1000002   -2
    0.053403542   2   -1000002    2
    0.053403518   2    1000004   -4
    0.053403518   2   -1000004    4
    0.053376034   2    1000001   -1
    0.053376034   2   -1000001    1
    0.053376004   2    1000003   -3
    0.053376004   2   -1000003    3
    0.037239718   2    1000025    25
    0.03466848   2    1000024   -24
    0.03466848   2   -1000024    24
    0.03181704   2    1000023    25
    0.026494172   2    1000025    23
    0.0079521653   2    1000006   -6
    0.0079521653   2   -1000006    6
    0.0066045274   2    1000016   -16
    0.0066045274   2   -1000016    16
    0.0065827811   2    1000015   -15
    0.0065827811   2   -1000015    15
    0.0021385627   3    1000024    5   -6
    0.0021385627   3   -1000024   -5    6
    0.0017384764   2    1000023    23
    0.0013656514   3    1000025    6   -6
    0.0011685933   3    1000023    6   -6
    0.00011442745   3    1000021    5   -5
    0.00010634668   3    1000021    6   -6

DECAY 1000021  164.01982
    0.13338565   2    1000006   -6
    0.13338565   2   -1000006    6
    0.12570934   2    2000002   -2
    0.12570934   2   -2000002    2
    0.12570922   2    2000004   -4
    0.12570922   2   -2000004    4
    0.056333738   2    2000006   -6
    0.056333738   2   -2000006    6
    0.055302358   2    1000005   -5
    0.055302358   2   -1000005    5
    0.0034994693   2    1000006   -4
    0.0034994693   2   -1000006    4
    0.00010025185   3    1000022    6   -6

DECAY 25  0.0033954729
    0.63481673   2   -5    5
    0.16430358   2   -24    24
    0.074704748   2    21    21
    0.072527424   2   -15    15
    0.031409014   2   -4    4
    0.018271151   2    23    23
    0.0023284942   2    22    22
    0.0011483213   2    22    23
    0.00025156448   2   -13    13
    0.00023814127   2   -3    3
    6.584357e-07   2   -1    1
    1.6187234e-07   2   -2    2
    5.6555074e-09   2   -11    11

DECAY 35  22.183432
    0.61058963   2   -5    5
    0.23373849   2   -1000006    1000006
    0.15185877   2   -15    15
    0.0028845066   2   -6    6
    0.00053560491   2   -13    13
    0.00022632135   2   -3    3
    7.8901148e-05   2    25    25
    5.5899937e-05   2    21    21
    2.6587336e-05   2    1000022    1000022
    1.5990854e-06   2   -1000004    1000004
    1.5986899e-06   2   -1000002    1000002
    6.2568208e-07   2   -1    1
    5.1395711e-07   2    22    23
    3.9005691e-07   2    22    22
    3.4696948e-07   2    23    23
    1.0584568e-07   2   -24    24
    1.034087e-07   2   -4    4
    1.2029413e-08   2   -11    11
    5.3369295e-13   2   -2    2
    1.2732831e-13   2    23    36

DECAY 36  16.872529
    0.79839589   2   -5    5
    0.19862614   2   -15    15
    0.0018679899   2   -6    6
    0.00070054551   2   -13    13
    0.00029608509   2   -3    3
    7.9272833e-05   2    1000022    1000022
    3.2296427e-05   2    21    21
    8.1854898e-07   2   -1    1
    7.3680748e-07   2    23    25
    9.4686719e-08   2   -4    4
    7.2695669e-08   2    22    22
    4.1127931e-08   2    22    23
    1.5733831e-08   2   -11    11
    4.8886332e-13   2   -2    2
    2.745382e-36   2    25    25

DECAY 37  21.262673
    0.81262908   2   -5    6
    0.18525588   2   -15    16
    0.0011929797   2   -5    4
    0.00065494567   2   -13    14
    0.00023362153   2   -3    4
    1.2214523e-05   2   -3    6
    1.0936334e-05   2   -3    2
    8.5191052e-06   2   -5    2
    6.4772929e-07   2   -1    2
    5.8517174e-07   2    24    25
    5.4436007e-07   2   -1    6
    3.5222699e-08   2   -1    4
    1.5319247e-08   2   -11    12

DECAY 6  2.43
    1   2    5    24

DECAY 15 -1
