BLOCK SPINFO
   1   SPheno
   2   v4.0.5be

BLOCK SPHENOINFO
   1   2
   2   2

BLOCK MODSEL
   1   0

BLOCK MINPAR
   3    39.553289
   4   -1

BLOCK EXTPAR
   0    1354.1928
   1   -1129.1892
   2    139.80868
   3    3000
   11    4277.564
   12   -1445.3
   13   -1131.8541
   23   -249.45549
   25    38.806965
   26    1945.717
   31    1777.4158
   32    1777.4158
   33    1260.6608
   34    127.64221
   35    127.64221
   36    1217.0565
   41    5000
   42    5000
   43    1497.8287
   44    5000
   45    5000
   46    1470.5719
   47    5000
   48    5000
   49    1252.5918

BLOCK SMINPUTS
   1    127.90897
   2    1.1663787e-05
   3    0.1184
   4    91.1876
   5    4.18
   6    173.2
   7    1.777
   8    0
   11    0.00051099893
   12    0
   13    0.10565837
   14    0
   21    0.005
   22    0.0025
   23    0.095
   24    1.27

BLOCK GAUGE Q=  1354.1928
   1    0.35536298
   2    0.66519887
   3    1.219778

BLOCK YU Q=  1354.1928
   1   1    8.3871554e-06
   2   2    0.0042606749
   3   3    1.0132357

BLOCK YD Q=  1354.1928
   1   1    0.00065404046
   2   2    0.012426769
   3   3    0.64860319

BLOCK YE Q=  1354.1928
   1   1    0.00011413484
   2   2    0.023599466
   3   3    0.39690419

BLOCK AU Q=  1354.1928
   1   1    0
   2   2    0
   3   3    4277.5643

BLOCK AD Q=  1354.1928
   1   1    0
   2   2    0
   3   3   -1445.3002

BLOCK AE Q=  1354.1928
   1   1    0
   2   2    0
   3   3   -1131.854

BLOCK MSOFT Q=  1354.1928
   1   -1129.1892
   2    139.80868
   3    3000
   21    3797451
   22    27232.773
   31    1777.4158
   32    1777.4158
   33    1260.6608
   34    127.64221
   35    127.64221
   36    1217.0565
   41    5000
   42    5000
   43    1497.8287
   44    5000
   45    5000
   46    1470.5719
   47    5000
   48    5000
   49    1252.5918

BLOCK MASS
   6    173.2
   23    91.1876
   24    80.429995
   15    1.777
   25    125.15744
   35    1944.3541
   36    1945.717
   37    1946.5958
   1000001    5027.0501
   2000001    5016.1797
   1000002    5026.6205
   2000002    5016.9099
   1000003    5027.0542
   2000003    5016.1864
   1000004    5026.6245
   2000004    5016.9107
   1000005    1233.4589
   2000005    1425.1925
   1000006    1145.7665
   2000006    1600.5341
   1000011    1780.8718
   2000011    172.83107
   1000012    1778.7731
   1000013    1780.8648
   2000013    172.75564
   1000014    1778.766
   1000015    1217.5025
   2000015    1261.3832
   1000016    1257.747
   1000021    3183.5203
   1000022    134.72898
   1000023   -257.96708
   1000025    278.89711
   1000035   -1127.8326
   1000024    135.80535
   1000037    285.35138

BLOCK ALPHA
      -0.025460805

BLOCK HMIX Q=  1354.1928
   1   -249.45549
   2    38.806965
   3    244.05316
   4    3785814.6

BLOCK STOPMIX
   1   1   -0.64945907
   1   2    0.76039655
   2   1   -0.76039655
   2   2   -0.64945907

BLOCK SBOTMIX
   1   1   -0.040909208
   1   2    0.99916287
   2   1   -0.99916287
   2   2   -0.040909208

BLOCK STAUMIX
   1   1   -0.14041631
   1   2    0.99009255
   2   1   -0.99009255
   2   2   -0.14041631

BLOCK NMIX
   1   1    0.0067230494
   1   2    0.89576462
   1   3    0.39557338
   1   4    0.20268756
   2   1   -0.03727777
   2   2   -0.14448338
   2   3    0.69047872
   2   4   -0.70779521
   3   1    0.0209288
   3   2   -0.42038491
   3   3    0.60551822
   3   4    0.67541557
   4   1    0.99906314
   4   2   -0.0026125839
   4   3    0.010417037
   4   4   -0.041922618

BLOCK UMIX
   1   1   -0.84583424
   1   2   -0.53344582
   2   1    0.53344582
   2   2   -0.84583424

BLOCK VMIX
   1   1   -0.96196877
   1   2    0.27315945
   2   1    0.27315945
   2   2    0.96196877

BLOCK HIGGSBOUNDSINPUTHIGGSCOUPLINGSFERMIONS
       0, 1505.9806,3,36,15,15

BLOCK HIGGSBOUNDSINPUTHIGGSCOUPLINGSBOSONS
       0,4,36,21,21,23

BLOCK SPHENOLOWENERGY
   1    0.00027942816
   2    1.596117e-06
   3    3.5198082e-05
   4    4.8425058e-15
   5    2.0685063e-10
   6    4.2389336e-08
   7    1.6634879e-13
   8    7.1058744e-09
   9    1.4754169e-06
   10    9.4984979e-05
   11    0.98115847
   12    0.54257348
   13    19.38548
   14    0
   15    0
   16    0.0021596108
   17    2.2816841e-15
   18    2.4770651e-11
   19    8.2830167e-11
   20   -6.9840616e-15
   21   -2.9866244e-10
   22   -1.0524276e-07
   23    0
   24    0
   25    0
   26    0
   27    0
   28    0
   29    0
   30    0
   31    0
   39    8.471966e-05
   40    0
   41    0
   42    0

BLOCK FWCOEF Q=  160
   305   4422   0   0   -0.18881911
   305   4422   0   2   -0.13548214
   305   4322   0   2    9.9255371e-05
   305   6421   0   0   -0.095227835
   305   6421   0   2   -0.077895666
   305   6321   0   2   -0.00015019518
   3051111   4133   0   0    1.5886178
   3051111   4133   0   2    1.5897069
   3051111   4233   0   2    0.00020523118
   3051111   4137   0   0   -4.4113099
   3051111   4137   0   2   -4.4042748
   3051111   4237   0   2   -0.0016037113
   3051313   4133   0   0    1.5886178
   3051313   4133   0   2    1.5897045
   3051313   4233   0   2    0.00020522834
   3051313   4137   0   0   -4.4113099
   3051313   4137   0   2   -4.4042772
   3051313   4237   0   2   -0.0016037132
   3051212   4137   0   0    1.5053501
   3051212   4137   0   2    1.5038377
   3051212   4237   0   2    0.00034977779
   3051414   4137   0   0    1.5053501
   3051414   4137   0   2    1.5038377
   3051414   4237   0   2    0.00034977807
   3051616   4137   0   0    1.5053501
   3051616   4137   0   2    1.5038394
   3051616   4237   0   2    0.00034985726

BLOCK IMFWCOEF Q=  160
   305   4422   0   0    3.8586741e-07
   305   4422   0   2   -2.6115859e-05
   305   4322   0   2    6.1243228e-06
   305   6421   0   0    3.3052096e-07
   305   6421   0   2    8.3160473e-06
   305   6321   0   2    2.7963511e-06
   3051111   4133   0   2    1.6617758e-07
   3051111   4233   0   2    4.9721282e-06
   3051111   4137   0   2    1.6809128e-05
   3051111   4237   0   2   -3.8882224e-05
   3051313   4133   0   2    1.6614548e-07
   3051313   4233   0   2    4.9721011e-06
   3051313   4137   0   2    1.6809173e-05
   3051313   4237   0   2   -3.8882281e-05
   3051212   4137   0   2   -3.2624944e-06
   3051212   4237   0   2    8.4804016e-06
   3051414   4137   0   2   -3.2624933e-06
   3051414   4237   0   2    8.4804016e-06
   3051616   4137   0   2   -3.2332757e-06
   3051616   4237   0   2    8.4804005e-06

DECAY 23  2.4952


DECAY 24  2.085


DECAY 2000011  6.0442238e-06
    0.99969137   2    1000022    11
    0.00030863321   2   -1000024    12

DECAY 1000011  23.833831
    0.46513248   2   -1000024    12
    0.26297826   2    1000022    11
    0.17768923   2   -1000037    12
    0.052402742   2    1000025    11
    0.033277752   2    1000035    11
    0.0085195329   2    1000023    11

DECAY 2000013  0.00013140963
    0.60493524   2   -1000024    14
    0.39506476   2    1000022    13

DECAY 1000013  23.852867
    0.46475941   2   -1000024    14
    0.2628954   2    1000022    13
    0.17754665   2   -1000037    14
    0.05264915   2    1000025    13
    0.033250755   2    1000035    13
    0.008890638   2    1000023    13

DECAY 1000015  7.4658908
    0.26359609   2   -1000024    16
    0.23135278   2   -1000037    16
    0.21048579   2    1000023    15
    0.14722583   2    1000022    15
    0.13119066   2    1000025    15
    0.016148851   2    1000035    15

DECAY 2000015  19.340349
    0.35251151   2   -1000024    16
    0.23052606   2    1000022    15
    0.18547247   2   -1000037    16
    0.12626393   2    1000025    15
    0.10173431   2    1000023    15
    0.0034915807   2    1000035    15

DECAY 1000012  23.900585
    0.59922415   2    1000024    11
    0.25776025   2    1000022    12
    0.058048186   2    1000025    12
    0.046401524   2    1000037    11
    0.033694295   2    1000035    12
    0.0048715888   2    1000023    12

DECAY 1000014  23.919405
    0.59898219   2    1000024    13
    0.2575564   2    1000022    14
    0.058002259   2    1000025    14
    0.046924134   2    1000037    13
    0.033667289   2    1000035    14
    0.0048677347   2    1000023    14

DECAY 1000016  19.762812
    0.5619666   2    1000024    15
    0.21788212   2    1000022    16
    0.16590163   2    1000037    15
    0.047167926   2    1000025    16
    0.0039887489   2    1000023    16
    0.003092755   2    1000035    16

DECAY 2000001  143.74652
    0.98243378   2    1000021    1
    0.017529336   2    1000035    1

DECAY 1000001  209.18505
    0.68051413   2    1000021    1
    0.1511305   2   -1000024    2
    0.084525538   2    1000022    1
    0.059812672   2   -1000037    2
    0.018909085   2    1000025    1
    0.0031086703   2    1000035    1
    0.0019994005   2    1000023    1

DECAY 2000003  143.7778
    0.98222488   2    1000021    3
    0.01752556   2    1000035    3

DECAY 1000003  209.20266
    0.68045889   2    1000021    3
    0.15111852   2   -1000024    4
    0.08453   2    1000022    3
    0.0598157   2   -1000037    4
    0.018934328   2    1000025    3
    0.0031084187   2    1000035    3
    0.0020341453   2    1000023    3

DECAY 1000005  18.612952
    0.3200592   2   -1000037    6
    0.23929985   2    1000023    5
    0.17546376   2    1000025    5
    0.16774118   2   -1000024    6
    0.096442653   2    1000022    5
    0.00098546639   2    1000035    5

DECAY 2000005  88.029995
    0.36559415   2    1000006   -24
    0.32421881   2   -1000037    6
    0.11339763   2   -1000024    6
    0.073995147   2    1000022    5
    0.062320705   2    1000023    5
    0.059661318   2    1000025    5
    0.00033290412   2    1000035    5
    0.00027858388   2    1000005    25
    0.00020075342   2    1000005    23

DECAY 2000002  151.39922
    0.93327725   2    1000021    2
    0.06658491   2    1000035    2
    0.00010229043   2    1000023    2

DECAY 1000002  209.18508
    0.68030013   2    1000021    2
    0.19546382   2    1000024    1
    0.084971297   2    1000022    2
    0.018248621   2    1000025    2
    0.015682359   2    1000037    1
    0.0029310086   2    1000035    2
    0.0024027621   2    1000023    2

DECAY 2000004  151.40285
    0.93325506   2    1000021    4
    0.066583326   2    1000035    4
    0.00010825294   2    1000023    4

DECAY 1000004  209.20261
    0.6802448   2    1000021    4
    0.19546853   2    1000024    3
    0.084964582   2    1000022    4
    0.018251054   2    1000025    4
    0.015733375   2    1000037    3
    0.0029307808   2    1000035    4
    0.0024068808   2    1000023    4

DECAY 1000006  43.450171
    0.39871702   2    1000037    5
    0.29451599   2    1000025    6
    0.22897352   2    1000023    6
    0.047250704   2    1000024    5
    0.015061447   2    1000022    6
    0.014633643   2    1000022    4
    0.00046276573   3    1000022    24    5
    0.00038491582   2    1000023    4

DECAY 2000006  110.52427
    0.33483401   2    1000006    23
    0.14577816   2    1000024    5
    0.14357999   2    1000023    6
    0.11324538   2    1000037    5
    0.090709615   2    2000005    24
    0.090167119   2    1000025    6
    0.063118529   2    1000022    6
    0.012479286   2    1000006    25
    0.0045704383   2    1000035    6
    0.0015174779   2    1000005    24

DECAY 1000024  4.3626151e-12
    0.67090879   2    1000022    211
    0.16843172   3    1000022   -11    12
    0.16065949   3    1000022   -13    14

DECAY 1000037  0.77722515
    0.47639112   2    1000022    24
    0.37262144   2    1000024    23
    0.1503323   2    1000024    25
    0.00058393715   2   -2000013    14

DECAY 1000022 -1


DECAY 1000023  1.541479
    0.33545726   2    1000024   -24
    0.33545726   2   -1000024    24
    0.32796427   2    1000022    23
    0.00031171183   2    2000013   -13
    0.00031171183   2   -2000013    13
    0.00017747032   2    2000011   -11
    0.00017747032   2   -2000011    11
    0.00013212149   2    1000022    22

DECAY 1000025  0.96910523
    0.41747404   2    1000024   -24
    0.41747404   2   -1000024    24
    0.1172977   2    1000022    25
    0.046762922   2    1000022    23
    0.00034273677   2    2000013   -13
    0.00034273677   2   -2000013    13
    0.00012016724   2    2000011   -11
    0.00012016724   2   -2000011    11

DECAY 1000035  14.167328
    0.19036849   2    2000013   -13
    0.19036849   2   -2000013    13
    0.19036042   2    2000011   -11
    0.19036042   2   -2000011    11
    0.047160307   2    1000037   -24
    0.047160307   2   -1000037    24
    0.03807138   2    1000023    25
    0.034541619   2    1000025    23
    0.028178107   2    1000025    25
    0.014961553   2    1000023    23
    0.0076279984   2    1000024   -24
    0.0076279984   2   -1000024    24
    0.0052777277   2    1000022    23
    0.0041995745   2    1000022    25
    0.00087057885   3    1000037    5   -6
    0.00087057885   3   -1000037   -5    6
    0.0005790612   3    1000023    6   -6
    0.00047394974   3    1000025    6   -6
    0.00020766091   3    1000024    5   -6
    0.00020766091   3   -1000024   -5    6

DECAY 1000021  264.94467
    0.15117121   2    1000006   -6
    0.15117121   2   -1000006    6
    0.12848141   2    1000005   -5
    0.12848141   2   -1000005    5
    0.11366469   2    2000005   -5
    0.11366469   2   -2000005    5
    0.084839357   2    2000006   -6
    0.084839357   2   -2000006    6
    0.021712594   2    1000006   -4
    0.021712594   2   -1000006    4

DECAY 25  0.0039203543
    0.57469638   2   -5    5
    0.22986081   2   -24    24
    0.069194761   2    21    21
    0.06600866   2   -15    15
    0.028065513   2   -4    4
    0.027912411   2    23    23
    0.0022952944   2    22    22
    0.0015202911   2    22    23
    0.00022949135   2   -13    13
    0.00021563528   2   -3    3
    5.9620859e-07   2   -1    1
    1.4462788e-07   2   -2    2
    5.1592171e-09   2   -11    11

DECAY 35  79.492483
    0.62320288   2   -5    5
    0.077125109   2   -15    15
    0.066486765   2   -1000024    1000037
    0.066486765   2   -1000037    1000024
    0.04958554   2   -1000024    1000024
    0.030122958   2    1000022    1000023
    0.023785553   2    1000022    1000022
    0.015983451   2    1000022    1000025
    0.012123517   2    1000023    1000025
    0.011810516   2    1000025    1000025
    0.0088593966   2   -1000037    1000037
    0.0059186934   2    1000025    1000035
    0.0040193643   2    1000023    1000035
    0.0019133961   2    1000022    1000035
    0.0013211094   2    1000023    1000023
    0.0007802668   2   -6    6
    0.00027679859   2   -13    13
    0.00017692823   2   -3    3
    1.3213823e-05   2    21    21
    5.5988216e-06   2    25    25
    7.5006584e-07   2    23    23
    4.8912612e-07   2   -1    1
    4.1408299e-07   2   -24    24
    2.6607646e-07   2    22    23
    9.9180406e-08   2    22    22
    7.1710457e-08   2   -1000011    1000011
    7.1024981e-08   2   -1000013    1000013
    9.7055985e-09   2   -4    4
    6.2175633e-09   2   -11    11
    1.384035e-10   2   -2000013    1000013
    1.384035e-10   2   -1000013    2000013
    5.0038177e-14   2   -2    2
    3.2372223e-15   2   -2000011    1000011
    3.2372223e-15   2   -1000011    2000011

DECAY 36  75.696682
    0.60967003   2   -5    5
    0.075450467   2   -15    15
    0.071212468   2   -1000024    1000037
    0.071212468   2   -1000037    1000024
    0.05075162   2   -1000024    1000024
    0.034396229   2    1000022    1000023
    0.024205335   2    1000022    1000022
    0.015200409   2    1000022    1000025
    0.01248541   2    1000023    1000025
    0.012054499   2    1000025    1000025
    0.0080000643   2   -1000037    1000037
    0.0076466308   2    1000023    1000035
    0.0033259299   2    1000025    1000035
    0.0016570658   2    1000023    1000023
    0.0014966314   2    1000022    1000035
    0.00076586004   2   -6    6
    0.00027079315   2   -13    13
    0.00017307301   2   -3    3
    2.3336093e-05   2    21    21
    1.0588531e-06   2    23    25
    4.7846737e-07   2   -1    1
    1.1703773e-07   2    22    23
    9.2395426e-09   2   -4    4
    8.2453239e-09   2    22    22
    6.0826701e-09   2   -11    11
    1.4655394e-10   2   -2000013    1000013
    1.4655394e-10   2   -1000013    2000013
    6.8211336e-14   2    23    35
    4.7639827e-14   2   -2    2
    3.4278601e-15   2   -2000011    1000011
    3.4278601e-15   2   -1000011    2000011
    1.6386008e-37   2    25    25

DECAY 37  77.318409
    0.61368253   2   -5    6
    0.10940498   2    1000022    1000037
    0.087662553   2    1000024    1000025
    0.083576404   2    1000023    1000024
    0.078768553   2   -15    16
    0.012245284   2    1000023    1000037
    0.0089313534   2    1000035    1000037
    0.0030597802   2    1000024    1000035
    0.0012956944   2    1000025    1000037
    0.00091301163   2   -5    4
    0.00027847523   2   -13    14
    0.00016243366   2   -3    4
    7.5687884e-06   2   -3    2
    6.5198486e-06   2   -5    2
    2.1140798e-06   2    1000022    1000024
    1.1760797e-06   2   -3    6
    1.0396139e-06   2    24    25
    4.5057767e-07   2   -1    2
    4.306763e-08   2   -1    6
    2.1332007e-08   2   -1    4
    6.5135645e-09   2   -11    12
    2.9685519e-10   2   -1000013    1000014
    9.9589618e-13   2    24    35
    6.9432901e-15   2   -1000011    1000012

DECAY 6  2.43
    1   2    5    24

DECAY 15 -1
