BLOCK SPINFO
   1   SPheno
   2   v4.0.5be

BLOCK SPHENOINFO
   1   2
   2   2

BLOCK MODSEL
   1   0

BLOCK MINPAR
   3    31.197864
   4    1

BLOCK EXTPAR
   0    1229.9007
   1   -628.24129
   2   -1451.8929
   3    3000
   11   -3836.7047
   12   -812.68156
   13   -588.48111
   23    1918.4115
   25    30.285513
   26    2690.2915
   31    1844.1574
   32    1844.1574
   33    1453.7442
   34    1583.0675
   35    1583.0675
   36    1876.1986
   41    5000
   42    5000
   43    1347.8726
   44    5000
   45    5000
   46    1341.751
   47    5000
   48    5000
   49    1582.0709

BLOCK SMINPUTS
   1    127.90897
   2    1.1663787e-05
   3    0.1184
   4    91.1876
   5    4.18
   6    173.2
   7    1.777
   8    0
   11    0.00051099893
   12    0
   13    0.10565837
   14    0
   21    0.005
   22    0.0025
   23    0.095
   24    1.27

BLOCK GAUGE Q=  1229.9007
   1    0.35536298
   2    0.66519887
   3    1.219778

BLOCK YU Q=  1229.9007
   1   1    8.3889415e-06
   2   2    0.0042615823
   3   3    1.0134515

BLOCK YD Q=  1229.9007
   1   1    0.00051053127
   2   2    0.0097000941
   3   3    0.50628704

BLOCK YE Q=  1229.9007
   1   1    8.9091439e-05
   2   2    0.018421284
   3   3    0.30981569

BLOCK AU Q=  1229.9007
   1   1    0
   2   2    0
   3   3   -3836.7047

BLOCK AD Q=  1229.9007
   1   1    0
   2   2    0
   3   3   -812.68153

BLOCK AE Q=  1229.9007
   1   1    0
   2   2    0
   3   3   -588.48111

BLOCK MSOFT Q=  1229.9007
   1   -628.24129
   2   -1451.8929
   3    3000
   21    3607634.7
   22   -3630817
   31    1844.1574
   32    1844.1574
   33    1453.7442
   34    1583.0675
   35    1583.0675
   36    1876.1986
   41    5000
   42    5000
   43    1347.8726
   44    5000
   45    5000
   46    1341.751
   47    5000
   48    5000
   49    1582.0709

BLOCK MASS
   6    173.2
   23    91.1876
   24    80.429995
   15    1.777
   25    120.15456
   35    2689.3665
   36    2690.2915
   37    2688.2302
   1000001    5016.6332
   2000001    5008.746
   1000002    5016.2073
   2000002    5010.448
   1000003    5016.6425
   2000003    5008.7433
   1000004    5016.2099
   2000004    5010.449
   1000005    1280.7008
   2000005    1574.5611
   1000006    1035.2909
   2000006    1461.0925
   1000011    1852.452
   2000011    1584.5094
   1000012    1850.4295
   1000013    1852.46
   2000013    1584.4973
   1000014    1850.4269
   1000015    1462.7313
   2000015    1878.0611
   1000016    1462.8548
   1000021    3171.5825
   1000022   -631.33719
   1000023   -1494.895
   1000025    1906.772
   1000035   -1912.6266
   1000024    1494.8622
   1000037    1913.1146

BLOCK ALPHA
      -0.032250038

BLOCK HMIX Q=  1229.9007
   1    1918.4115
   2    30.285513
   3    244.19601
   4    7237668.6

BLOCK STOPMIX
   1   1    0.67071857
   1   2    0.74171194
   2   1   -0.74171194
   2   2    0.67071857

BLOCK SBOTMIX
   1   1    0.99185001
   1   2    0.12741098
   2   1   -0.12741098
   2   2    0.99185001

BLOCK STAUMIX
   1   1    0.99731694
   1   2    0.073204712
   2   1   -0.073204712
   2   2    0.99731694

BLOCK NMIX
   1   1   -0.99964035
   1   2    0.00042546563
   1   3   -0.025758907
   1   4   -0.0074478512
   2   1   -0.0034550593
   2   2   -0.99264633
   2   3    0.096628834
   2   4    0.07282994
   3   1    0.012937967
   3   2   -0.016971637
   3   3   -0.70681358
   3   4    0.70707789
   4   1   -0.023234552
   4   2    0.11985429
   4   3    0.70029559
   4   4    0.70333576

BLOCK UMIX
   1   1   -0.99019702
   1   2    0.13967774
   2   1   -0.13967774
   2   2   -0.99019702

BLOCK VMIX
   1   1    0.99441246
   1   2    0.10556446
   2   1    0.10556446
   2   2   -0.99441246

BLOCK HIGGSBOUNDSINPUTHIGGSCOUPLINGSFERMIONS
       0, 917.21229,3,36,15,15

BLOCK HIGGSBOUNDSINPUTHIGGSCOUPLINGSBOSONS
       0,4,36,21,21,23

BLOCK SPHENOLOWENERGY
   1    0.00029265384
   2    1.5952431e-06
   3    3.5254428e-05
   4    1.9173632e-15
   5    8.1907133e-11
   6    1.7120849e-08
   7    6.4372339e-14
   8    2.7499699e-09
   9    5.8246388e-07
   10    9.6375948e-05
   11    0.99552664
   12    0.54189905
   13    19.35964
   14    0
   15    0
   16    0.0021569443
   17    2.281655e-15
   18    2.4819593e-11
   19    8.2942409e-11
   20   -2.947784e-15
   21   -1.2602775e-10
   22   -4.278089e-08
   23    0
   24    0
   25    0
   26    0
   27    0
   28    0
   29    0
   30    0
   31    0
   39    7.7831543e-05
   40    0
   41    0
   42    0

BLOCK FWCOEF Q=  160
   305   4422   0   0   -0.18881911
   305   4422   0   2   -0.15501656
   305   4322   0   2    0.00010966874
   305   6421   0   0   -0.095227835
   305   6421   0   2   -0.078298991
   305   6321   0   2   -6.6194189e-05
   3051111   4133   0   0    1.5849645
   3051111   4133   0   2    1.585453
   3051111   4233   0   2    0.00010807933
   3051111   4137   0   0   -4.4076566
   3051111   4137   0   2   -4.4061915
   3051111   4237   0   2   -0.00085050754
   3051313   4133   0   0    1.5849645
   3051313   4133   0   2    1.5854515
   3051313   4233   0   2    0.00010807902
   3051313   4137   0   0   -4.4076566
   3051313   4137   0   2   -4.406193
   3051313   4237   0   2   -0.00085050781
   3051212   4137   0   0    1.5053501
   3051212   4137   0   2    1.505035
   3051212   4237   0   2    0.00018564934
   3051414   4137   0   0    1.5053501
   3051414   4137   0   2    1.505035
   3051414   4237   0   2    0.00018564937
   3051616   4137   0   0    1.5053501
   3051616   4137   0   2    1.5050348
   3051616   4237   0   2    0.0001856589

BLOCK IMFWCOEF Q=  160
   305   4422   0   0    3.8592375e-07
   305   4422   0   2   -4.5893656e-06
   305   4322   0   2    4.5251585e-06
   305   6421   0   0    3.3056921e-07
   305   6421   0   2   -1.8855372e-05
   305   6321   0   2    2.1480623e-06
   3051111   4133   0   2   -2.8388405e-06
   3051111   4233   0   2    2.4166228e-06
   3051111   4137   0   2    2.3512846e-05
   3051111   4237   0   2   -1.90233e-05
   3051313   4133   0   2   -2.8388293e-06
   3051313   4233   0   2    2.4166202e-06
   3051313   4137   0   2    2.3512863e-05
   3051313   4237   0   2   -1.9023307e-05
   3051212   4137   0   2   -5.0419577e-06
   3051212   4237   0   2    4.1524335e-06
   3051414   4137   0   2   -5.0419578e-06
   3051414   4237   0   2    4.1524335e-06
   3051616   4137   0   2   -5.0448528e-06
   3051616   4237   0   2    4.1524323e-06

DECAY 23  2.4952


DECAY 24  2.085


DECAY 2000011  5.6302775
    0.9999998   2    1000022    11

DECAY 1000011  4.7399263
    0.41041865   2   -1000024    12
    0.38262185   2    1000022    11
    0.2069595   2    1000023    11

DECAY 2000013  5.6302103
    0.99999913   2    1000022    13

DECAY 1000013  4.7416693
    0.41028266   2   -1000024    14
    0.38248512   2    1000022    13
    0.2068935   2    1000023    13
    0.00033871393   2    2000013    25

DECAY 1000015  1.240761
    1   2    1000022    15

DECAY 2000015  10.149562
    0.72730313   2    1000022    15
    0.13657284   2    1000016   -24
    0.069265646   2    1000015    25
    0.066828678   2    1000015    23

DECAY 1000012  4.7249083
    0.41140238   2    1000024    11
    0.38442167   2    1000022    12
    0.20417594   2    1000023    12

DECAY 1000014  4.7249027
    0.41140497   2    1000024    13
    0.3844213   2    1000022    14
    0.20417373   2    1000023    14

DECAY 1000016  1.2178562
    1   2    1000022    16

DECAY 2000001  144.58427
    0.98127211   2    1000021    1
    0.01871745   2    1000022    1

DECAY 1000001  198.25684
    0.71976442   2    1000021    1
    0.18134052   2   -1000024    2
    0.091005675   2    1000023    1
    0.0034346347   2    1000022    1
    0.0031737002   2   -1000037    2
    0.0012507167   2    1000035    1

DECAY 2000003  144.59767
    0.98117926   2    1000021    3
    0.018715746   2    1000022    3

DECAY 1000003  198.26613
    0.71973556   2    1000021    3
    0.18133249   2   -1000024    4
    0.091001999   2    1000023    3
    0.0034345106   2    1000022    3
    0.0031802351   2   -1000037    4
    0.0012675928   2    1000035    3

DECAY 1000005  22.277145
    0.99452236   2    1000006   -24
    0.005477639   2    1000022    5

DECAY 2000005  6.5331229
    0.524391   2    1000006   -24
    0.27293135   2    1000005    25
    0.10793979   2    1000005    23
    0.091316644   2    1000022    5
    0.0034138599   2    2000006   -24

DECAY 2000002  152.88861
    0.92913272   2    1000021    2
    0.070828767   2    1000022    2

DECAY 1000002  198.24665
    0.71957759   2    1000021    2
    0.18287563   2    1000024    1
    0.091225505   2    1000023    2
    0.0034018216   2    1000022    2
    0.0018127155   2    1000037    1
    0.0010892068   2    1000035    2

DECAY 2000004  152.8913
    0.92911665   2    1000021    4
    0.070827527   2    1000022    4

DECAY 1000004  198.25508
    0.71954805   2    1000021    4
    0.18286878   2    1000024    3
    0.091221739   2    1000023    4
    0.0034016786   2    1000022    4
    0.0018464374   2    1000037    3
    0.001092434   2    1000035    4

DECAY 1000006  0.51575974
    0.99015489   2    1000022    6
    0.0097917003   2    1000022    4

DECAY 2000006  41.894335
    0.71978383   2    1000006    23
    0.2442028   2    1000005    24
    0.023243541   2    1000022    6
    0.012769828   2    1000006    25

DECAY 1000024  2.7922249
    0.58225841   2    1000006   -5
    0.39489921   2   -1000005    6
    0.0098605412   2    2000006   -5
    0.0044311628   2    1000022    24
    0.0041962523   2   -1000015    16
    0.0041630343   2    1000016   -15
    0.00013136191   3    1000022   -5    6

DECAY 1000037  52.373714
    0.40758551   2    1000006   -5
    0.31761883   2   -1000005    6
    0.098924023   2    2000006   -5
    0.04466358   2    1000023    24
    0.042496764   2    1000024    25
    0.037788968   2    1000024    23
    0.022587113   2    1000022    24
    0.020375216   2   -2000005    6
    0.0062195305   2    1000016   -15
    0.00080092259   3    1000022   -5    6
    0.00046575297   3    1000023   -5    6
    0.00030906427   2   -1000015    16

DECAY 1000022 -1


DECAY 1000023  3.2473938
    0.21707952   2    1000005   -5
    0.21707952   2   -1000005    5
    0.20490378   2    1000006   -6
    0.20490378   2   -1000006    6
    0.072322149   2    1000006   -4
    0.072322149   2   -1000006    4
    0.0031825662   2    1000022    25
    0.0018404068   2    1000015   -15
    0.0018404068   2   -1000015    15
    0.0017885189   2    1000016   -16
    0.0017885189   2   -1000016    16
    0.00074573792   2    1000022    23

DECAY 1000025  57.612262
    0.30804006   2    1000006   -6
    0.30804006   2   -1000006    6
    0.047011461   2    2000006   -6
    0.047011461   2   -2000006    6
    0.044760967   2    1000023    25
    0.037885476   2    1000005   -5
    0.037885476   2   -1000005    5
    0.035959577   2    1000023    23
    0.03397054   2    1000024   -24
    0.03397054   2   -1000024    24
    0.017345149   2    1000022    25
    0.016011435   2    1000022    23
    0.01285219   2    2000005   -5
    0.01285219   2   -2000005    5
    0.0026559733   2    1000015   -15
    0.0026559733   2   -1000015    15
    0.00041798724   3    1000022    6   -6
    0.00029630795   3    1000024    5   -6
    0.00029630795   3   -1000024   -5    6

DECAY 1000035  57.826104
    0.33802313   2    1000006   -6
    0.33802313   2   -1000006    6
    0.04348686   2    2000006   -6
    0.04348686   2   -2000006    6
    0.037996212   2    1000023    25
    0.03706463   2    1000005   -5
    0.03706463   2   -1000005    5
    0.035167123   2    1000024   -24
    0.035167123   2   -1000024    24
    0.014983372   2    1000022    25
    0.013414809   2    2000005   -5
    0.013414809   2   -2000005    5
    0.0047983137   2    1000022    23
    0.0026973415   2    1000015   -15
    0.0026973415   2   -1000015    15
    0.00070025393   2    1000023    23
    0.00043137232   3    1000024    5   -6
    0.00043137232   3   -1000024   -5    6
    0.00039344445   3    1000022    6   -6
    0.00021933881   2    1000016   -16
    0.00021933881   2   -1000016    16

DECAY 1000021  257.94515
    0.12818382   2    2000006   -6
    0.12818382   2   -2000006    6
    0.12754714   2    1000006   -6
    0.12754714   2   -1000006    6
    0.12736627   2    1000005   -5
    0.12736627   2   -1000005    5
    0.10341718   2    2000005   -5
    0.10341718   2   -2000005    5
    0.012938722   2    1000006   -4
    0.012938722   2   -1000006    4
    0.00016012717   3    1000023    6   -6
    0.00015242121   3    1000024    5   -6
    0.00015242121   3   -1000024   -5    6
    0.0001210757   3    1000023    5   -5
    0.00010875832   3    1000037    5   -6
    0.00010875832   3   -1000037   -5    6

DECAY 25  0.0033345811
    0.64581448   2   -5    5
    0.15543129   2   -24    24
    0.07412482   2   -15    15
    0.071825245   2    21    21
    0.031788801   2   -4    4
    0.017068341   2    23    23
    0.0023465816   2    22    22
    0.001098864   2    22    23
    0.00025711828   2   -13    13
    0.0002436111   2   -3    3
    6.7356001e-07   2   -1    1
    1.638311e-07   2   -2    2
    5.780373e-09   2   -11    11

DECAY 35  38.619188
    0.50481063   2   -1000006    1000006
    0.35406087   2   -5    5
    0.11890368   2   -15    15
    0.0082377664   2    1000022    1000025
    0.0037859371   2   -2000006    1000006
    0.0037859371   2   -1000006    2000006
    0.0024806953   2   -6    6
    0.0014648783   2    25    25
    0.0011409191   2    1000022    1000035
    0.00041891158   2   -13    13
    0.00040830973   2    1000022    1000023
    0.00023025136   2   -3    3
    0.0001912499   2    21    21
    7.1370659e-05   2    1000022    1000022
    4.6536774e-06   2    23    23
    1.626782e-06   2   -24    24
    1.1254684e-06   2    22    22
    6.365687e-07   2   -1    1
    4.4002148e-07   2    22    23
    1.0243195e-07   2   -4    4
    9.4088096e-09   2   -11    11
    5.2820046e-13   2   -2    2

DECAY 36  40.106075
    0.32573868   2   -5    5
    0.2764838   2   -2000006    1000006
    0.2764838   2   -1000006    2000006
    0.10984449   2   -15    15
    0.0075407178   2    1000022    1000035
    0.00121427   2    1000022    1000025
    0.0011699218   2   -6    6
    0.0008167753   2    1000022    1000023
    0.0003869884   2   -13    13
    0.00021268686   2   -3    3
    8.4620949e-05   2    1000022    1000022
    1.5531859e-05   2    21    21
    6.7973207e-06   2    23    25
    5.8800783e-07   2   -1    1
    1.5907803e-07   2    22    23
    8.2987281e-08   2    22    22
    8.1526669e-08   2   -4    4
    8.6918385e-09   2   -11    11
    4.2051632e-13   2   -2    2
    2.6457633e-36   2    25    25

DECAY 37  35.032975
    0.57996808   2   -5    6
    0.2579149   2   -1000005    1000006
    0.14935999   2   -15    16
    0.0097305542   2    1000022    1000037
    0.0013770063   2    1000022    1000024
    0.00085590764   2   -5    4
    0.000528041   2   -13    14
    0.00023493014   2   -3    4
    1.098786e-05   2   -3    2
    7.7696671e-06   2    24    25
    6.1120641e-06   2   -5    2
    4.815667e-06   2   -3    6
    6.5135481e-07   2   -1    2
    2.049641e-07   2   -1    6
    3.2256738e-08   2   -1    4
    1.2350934e-08   2   -11    12

DECAY 6  2.43
    1   2    5    24

DECAY 15 -1
