BLOCK SPINFO
   1   SPheno
   2   v4.0.5be

BLOCK SPHENOINFO
   1   2
   2   2

BLOCK MODSEL
   1   0

BLOCK MINPAR
   3    40.7421
   4    1

BLOCK EXTPAR
   0    1447.2839
   1    16.717593
   2   -1711.9077
   3    3000
   11    4852.388
   12    820.77178
   13   -1345.2114
   23    1086.2384
   25    39.370218
   26    1537.7505
   31    67.774413
   32    67.774413
   33    755.86331
   34    260.86868
   35    260.86868
   36    1344.5314
   41    5000
   42    5000
   43    1653.3579
   44    5000
   45    5000
   46    1475.1293
   47    5000
   48    5000
   49    1263.0832

BLOCK SMINPUTS
   1    127.90897
   2    1.1663787e-05
   3    0.1184
   4    91.1876
   5    4.18
   6    173.2
   7    1.777
   8    0
   11    0.00051099893
   12    0
   13    0.10565837
   14    0
   21    0.005
   22    0.0025
   23    0.095
   24    1.27

BLOCK GAUGE Q=  1447.2839
   1    0.35536298
   2    0.66519887
   3    1.219778

BLOCK YU Q=  1447.2839
   1   1    8.3870763e-06
   2   2    0.0042606348
   3   3    1.0132262

BLOCK YD Q=  1447.2839
   1   1    0.00066352709
   2   2    0.012607015
   3   3    0.65801096

BLOCK YE Q=  1447.2839
   1   1    0.00011579033
   2   2    0.023941768
   3   3    0.40266115

BLOCK AU Q=  1447.2839
   1   1    0
   2   2    0
   3   3    4852.3881

BLOCK AD Q=  1447.2839
   1   1    0
   2   2    0
   3   3    820.77174

BLOCK AE Q=  1447.2839
   1   1    0
   2   2    0
   3   3   -1345.2114

BLOCK MSOFT Q=  1447.2839
   1    16.717593
   2   -1711.9077
   3    3000
   21    1174671.5
   22   -1098217.4
   31    67.774413
   32    67.774413
   33    755.86331
   34    260.86868
   35    260.86868
   36    1344.5314
   41    5000
   42    5000
   43    1653.3579
   44    5000
   45    5000
   46    1475.1293
   47    5000
   48    5000
   49    1263.0832

BLOCK MASS
   6    173.2
   23    91.1876
   24    80.429995
   15    1.777
   25    120.40513
   35    1537.418
   36    1537.7505
   37    1540.2286
   1000001    5027.548
   2000001    5019.7268
   1000002    5027.1435
   2000002    5021.144
   1000003    5027.5547
   2000003    5019.7278
   1000004    5027.1464
   2000004    5021.1448
   1000005    1269.7809
   2000005    1600.5219
   1000006    1208.4445
   2000006    1733.328
   1000011    158.53496
   2000011    266.08391
   1000012    138.54713
   1000013    157.46629
   2000013    266.64834
   1000014    138.51921
   1000015    769.51325
   2000015    1342.0586
   1000016    768.75251
   1000021    3190.1299
   1000022    16.30266
   1000023   -1088.0915
   1000025    1095.6769
   1000035   -1753.6904
   1000024    1089.6241
   1000037    1754.0345

BLOCK ALPHA
      -0.024317284

BLOCK HMIX Q=  1447.2839
   1    1086.2384
   2    39.370218
   3    244.01656
   4    2364676.7

BLOCK STOPMIX
   1   1   -0.53266756
   1   2    0.84632457
   2   1   -0.84632457
   2   2   -0.53266756

BLOCK SBOTMIX
   1   1    0.058128488
   1   2    0.99830911
   2   1   -0.99830911
   2   2    0.058128488

BLOCK STAUMIX
   1   1    0.99817418
   1   2    0.060401281
   2   1   -0.060401281
   2   2    0.99817418

BLOCK NMIX
   1   1   -0.99916459
   1   2    0.00085526913
   1   3   -0.040837876
   1   4    0.0012862734
   2   1    0.02801109
   2   2    0.0866119
   2   3   -0.70565511
   2   4   -0.70268387
   3   1    0.029741497
   3   2   -0.020364918
   3   3   -0.70581682
   3   4    0.70747673
   4   1   -0.00096970217
   4   2    0.99603359
   4   3    0.04696544
   4   4    0.075567121

BLOCK UMIX
   1   1   -0.064686787
   1   2    0.99790562
   2   1   -0.99790562
   2   2   -0.064686787

BLOCK VMIX
   1   1    0.10530888
   1   2    0.99443956
   2   1    0.99443956
   2   2   -0.10530888

BLOCK HIGGSBOUNDSINPUTHIGGSCOUPLINGSFERMIONS
       0, 1550.0141,3,36,15,15

BLOCK HIGGSBOUNDSINPUTHIGGSCOUPLINGSBOSONS
       0,4,36,21,21,23

BLOCK SPHENOLOWENERGY
   1    0.00038816331
   2    1.5895982e-06
   3    3.5284642e-05
   4    5.3703242e-15
   5    2.2941509e-10
   6    4.8067201e-08
   7    1.8037986e-13
   8    7.7058533e-09
   9    1.6358812e-06
   10    8.8479927e-05
   11    0.91396377
   12    0.54453646
   13    19.418098
   14    0
   15    0
   16    0.0021798922
   17    2.2818929e-15
   18    2.4813191e-11
   19    8.2939534e-11
   20    9.8727527e-15
   21    4.2649219e-10
   22   -6.0583471e-08
   23    0
   24    0
   25    0
   26    0
   27    0
   28    0
   29    0
   30    0
   31    0
   39    9.5941496e-05
   40    0
   41    0
   42    0

BLOCK FWCOEF Q=  160
   305   4422   0   0   -0.18881911
   305   4422   0   2   -0.26185031
   305   4322   0   2   -0.00073189965
   305   6421   0   0   -0.095227835
   305   6421   0   2   -0.14904938
   305   6321   0   2   -0.00062946388
   3051111   4133   0   0    1.5910163
   3051111   4133   0   2    1.5923485
   3051111   4233   0   2    0.0001748296
   3051111   4137   0   0   -4.4137084
   3051111   4137   0   2   -4.4152128
   3051111   4237   0   2   -0.0013630017
   3051313   4133   0   0    1.5910163
   3051313   4133   0   2    1.5923414
   3051313   4233   0   2    0.00017482529
   3051313   4137   0   0   -4.4137084
   3051313   4137   0   2   -4.4152199
   3051313   4237   0   2   -0.0013630019
   3051212   4137   0   0    1.5053501
   3051212   4137   0   2    1.5056839
   3051212   4237   0   2    0.00029707553
   3051414   4137   0   0    1.5053501
   3051414   4137   0   2    1.505684
   3051414   4237   0   2    0.00029707621
   3051616   4137   0   0    1.5053501
   3051616   4137   0   2    1.5056846
   3051616   4237   0   2    0.00029726994

BLOCK IMFWCOEF Q=  160
   305   4422   0   0    3.8550406e-07
   305   4422   0   2   -8.8602025e-06
   305   4322   0   2   -6.8239914e-06
   305   6421   0   0    3.3020972e-07
   305   6421   0   2   -2.2848505e-05
   305   6321   0   2   -3.5367786e-06
   3051111   4133   0   2    3.5305886e-08
   3051111   4233   0   2    5.0273564e-06
   3051111   4137   0   2    7.4973567e-07
   3051111   4237   0   2   -3.921761e-05
   3051313   4133   0   2    3.5317228e-08
   3051313   4233   0   2    5.0273354e-06
   3051313   4137   0   2    7.4964279e-07
   3051313   4237   0   2   -3.921767e-05
   3051212   4137   0   2   -7.552205e-08
   3051212   4237   0   2    8.5481729e-06
   3051414   4137   0   2   -7.5518052e-08
   3051414   4237   0   2    8.5481729e-06
   3051616   4137   0   2   -6.3958688e-08
   3051616   4237   0   2    8.5482245e-06

DECAY 23  2.4952


DECAY 24  2.085


DECAY 1000011  0.19401182
    0.99997386   2    1000022    11

DECAY 2000011  1.3247395
    1   2    1000022    11

DECAY 1000013  0.19264973
    0.99997976   2    1000022    13

DECAY 2000013  1.3275962
    1   2    1000022    13

DECAY 1000015  0.9834137
    1   2    1000022    15

DECAY 2000015  11.29329
    0.59376213   2    1000022    15
    0.15607607   2    1000016   -24
    0.086094614   2    1000015    25
    0.076806974   2    1000015    23
    0.043604435   2   -1000024    16
    0.022178421   2    1000023    15
    0.021477349   2    1000025    15

DECAY 1000012  0.16951037
    1   2    1000022    12

DECAY 1000014  0.1694743
    1   2    1000022    14

DECAY 1000016  0.96634714
    0.99993524   2    1000022    16

DECAY 2000001  143.60191
    0.98048727   2    1000021    1
    0.019482593   2    1000022    1

DECAY 1000001  193.57532
    0.73157021   2    1000021    1
    0.17562398   2   -1000037    2
    0.087522689   2    1000035    1
    0.0036537468   2    1000022    1
    0.00086892385   2   -1000024    2
    0.00069205347   2    1000023    1

DECAY 2000003  143.63074
    0.98029119   2    1000021    3
    0.01947887   2    1000022    3

DECAY 1000003  193.59216
    0.73151017   2    1000021    3
    0.17560916   2   -1000037    4
    0.087515404   2    1000035    3
    0.0036535704   2    1000022    3
    0.0008772516   2   -1000024    4
    0.0007290333   2    1000023    3
    0.00010540643   2    1000025    3

DECAY 1000005  1.6444994
    0.45223782   2    1000022    5
    0.23523607   2    1000023    5
    0.21473457   2    1000025    5
    0.097791543   2   -1000024    6

DECAY 2000005  72.59721
    0.80857092   2    1000006   -24
    0.1169854   2   -1000024    6
    0.027298376   2    1000023    5
    0.026872965   2    1000025    5
    0.014247452   2    1000005    25
    0.0031045874   2    1000022    5
    0.0029202997   2    1000005    23

DECAY 2000002  152.15845
    0.92631953   2    1000021    2
    0.073568772   2    1000022    2

DECAY 1000002  193.56945
    0.73137482   2    1000021    2
    0.17438957   2    1000037    1
    0.087453728   2    1000035    2
    0.0035839842   2    1000022    2
    0.0023029831   2    1000024    1
    0.00087136991   2    1000023    2

DECAY 2000004  152.16175
    0.92629952   2    1000021    4
    0.073567174   2    1000022    4

DECAY 1000004  193.58577
    0.73131441   2    1000021    4
    0.17437528   2    1000037    3
    0.087446433   2    1000035    4
    0.0035836837   2    1000022    4
    0.0023768672   2    1000024    3
    0.00087551931   2    1000023    4

DECAY 1000006  2.687152
    0.70211709   2    1000022    6
    0.29257237   2    1000024    5
    0.0047533857   2    1000022    4
    0.00017758905   3    1000022    24    5
    0.00013963795   3   -1000013    14    5
    0.00013924771   3   -1000011    12    5

DECAY 2000006  81.967357
    0.56867666   2    1000006    23
    0.15776349   2    1000006    25
    0.08217988   2    1000024    5
    0.058256545   2    1000023    6
    0.058174092   2    1000025    6
    0.049720776   2    2000005    24
    0.015298546   2    1000022    6
    0.0099300115   2    1000005    24

DECAY 1000024  1.3705002
    0.53538053   2    1000022    24
    0.33114808   2    1000016   -15
    0.041929112   2    1000014   -13
    0.037564212   2    1000012   -11
    0.014037826   2   -1000013    14
    0.014029672   2   -1000011    12
    0.012725986   3    1000022   -5    6
    0.008979017   2   -1000015    16
    0.0039897921   2   -2000013    14
    0.00021556121   3    1000022   -15    16

DECAY 1000037  54.210964
    0.13954185   2   -1000013    14
    0.13951097   2   -1000011    12
    0.13908478   2    1000014   -13
    0.13908323   2    1000012   -11
    0.092087111   2    1000016   -15
    0.091706815   2   -1000015    16
    0.065443137   2    1000023    24
    0.057934031   2    1000024    23
    0.057549277   2    1000025    24
    0.055204279   2    1000024    25
    0.018465272   2    1000006   -5
    0.0013724001   3    1000023   -5    6
    0.001280751   3    1000024    6   -6
    0.001102151   3    1000025   -5    6
    0.00024165427   2   -2000015    16
    0.00020353646   2    2000006   -5
    0.00013030745   2    1000022    24

DECAY 1000022 -1


DECAY 1000023  1.3417226
    0.28848417   2    1000022    23
    0.24063106   2    1000022    25
    0.17011523   2    1000015   -15
    0.17011523   2   -1000015    15
    0.019860728   2    1000013   -13
    0.019860728   2   -1000013    13
    0.01764095   2    1000011   -11
    0.01764095   2   -1000011    11
    0.0088672598   2    1000014   -14
    0.0088672598   2   -1000014    14
    0.008867142   2    1000012   -12
    0.008867142   2   -1000012    12
    0.0051177948   3    1000022    6   -6
    0.0034459047   2    2000013   -13
    0.0034459047   2   -2000013    13
    0.0022981299   2    1000016   -16
    0.0022981299   2   -1000016    16
    0.001413161   2    2000011   -11
    0.001413161   2   -2000011    11
    0.00052539009   3    1000022    5   -5
    0.00021988004   3    1000022    15   -15

DECAY 1000025  1.2028789
    0.3021879   2    1000022    25
    0.2898174   2    1000022    23
    0.18671413   2    1000015   -15
    0.18671413   2   -1000015    15
    0.0052810043   3    1000022    6   -6
    0.0040806887   2    2000013   -13
    0.0040806887   2   -2000013    13
    0.0025511589   2    1000014   -14
    0.0025511589   2   -1000014    14
    0.0025511255   2    1000012   -12
    0.0025511255   2   -1000012    12
    0.0025199905   2    1000013   -13
    0.0025199905   2   -1000013    13
    0.0017925675   2    2000011   -11
    0.0017925675   2   -2000011    11
    0.00067918596   2    1000016   -16
    0.00067918596   2   -1000016    16
    0.00059790182   3    1000022    5   -5
    0.00026066045   3    1000022    15   -15

DECAY 1000035  57.815359
    0.065470606   2    1000014   -14
    0.065470606   2   -1000014    14
    0.065470275   2    1000012   -12
    0.065470275   2   -1000012    12
    0.065095329   2    1000013   -13
    0.065095329   2   -1000013    13
    0.06508058   2    1000011   -11
    0.06508058   2   -1000011    11
    0.055388644   2    1000025    23
    0.054700192   2    1000024   -24
    0.054700192   2   -1000024    24
    0.054491928   2    1000025    25
    0.048555505   2    1000023    25
    0.043264444   2    1000016   -16
    0.043264444   2   -1000016    16
    0.042827878   2    1000015   -15
    0.042827878   2   -1000015    15
    0.0099372104   2    1000006   -6
    0.0099372104   2   -1000006    6
    0.0055714663   2    2000005   -5
    0.0055714663   2   -2000005    5
    0.0030179702   2    1000023    23
    0.0013102916   3    1000024    5   -6
    0.0013102916   3   -1000024   -5    6
    0.0002771743   3    1000025    6   -6
    0.00026751662   3    1000023    6   -6
    0.00012886016   2    1000022    23
    0.00011910391   2    1000022    25
    0.00011530882   2    2000015   -15
    0.00011530882   2   -2000015    15

DECAY 1000021  243.62169
    0.15818123   2    1000006   -6
    0.15818123   2   -1000006    6
    0.13720691   2    1000005   -5
    0.13720691   2   -1000005    5
    0.10855898   2    2000005   -5
    0.10855898   2   -2000005    5
    0.082652113   2    2000006   -6
    0.082652113   2   -2000006    6
    0.010893087   2    1000006   -4
    0.010893087   2   -1000006    4
    0.0023850471   3    1000023    6   -6
    0.0022248862   3    1000025    6   -6

DECAY 25  0.34336914
    0.00623323   2   -5    5
    0.00155428   2   -24    24
    0.0007051199   2    21    21
    0.00069758471   2   -15    15
    0.00030844275   2   -4    4
    0.00017152882   2    23    23
    2.0733291e-05   2    22    22
    1.0517095e-05   2    22    23
    4.7054911e-06   2    1000022    1000022
    2.4019334e-06   2   -13    13
    2.2913096e-06   2   -3    3
    6.3352209e-09   2   -1    1
    1.5896202e-09   2   -2    2
    5.3955727e-11   2   -11    11

DECAY 35  17.220761
    0.73320233   2   -5    5
    0.23820191   2   -15    15
    0.014514172   2    1000022    1000023
    0.011857892   2    1000022    1000025
    0.00069947972   2   -13    13
    0.00057679733   2   -3    3
    0.00035829724   2   -1000015    1000015
    0.00032704441   2    1000022    1000022
    0.00018321129   2   -6    6
    5.4864576e-05   2    25    25
    1.1355291e-05   2    21    21
    2.5085357e-06   2    23    23
    1.9365514e-06   2   -24    24
    1.5947881e-06   2   -1    1
    6.0226682e-07   2   -1000011    1000011
    5.1069604e-07   2   -1000013    1000013
    4.3597423e-07   2   -2000013    2000013
    3.6806922e-07   2   -2000011    2000011
    1.5495762e-07   2   -2000013    1000013
    1.5495762e-07   2   -1000013    2000013
    1.5723548e-08   2   -11    11
    1.3737262e-08   2   -4    4
    5.7680023e-09   2    22    22
    2.2851311e-09   2    22    23
    3.7042866e-12   2   -2000011    1000011
    3.7042866e-12   2   -1000011    2000011
    7.0879626e-14   2   -2    2

DECAY 36  16.737331
    0.73291283   2   -5    5
    0.23803787   2   -15    15
    0.014327082   2    1000022    1000025
    0.012778448   2    1000022    1000023
    0.00069902097   2   -13    13
    0.00057637648   2   -3    3
    0.0003380298   2    1000022    1000022
    0.00028404618   2   -6    6
    4.0744167e-05   2    21    21
    3.4255738e-06   2    23    25
    1.593624e-06   2   -1    1
    1.5676946e-07   2   -2000013    1000013
    1.5676946e-07   2   -1000013    2000013
    1.1059939e-07   2    22    22
    7.615872e-08   2    22    23
    1.5859562e-08   2   -4    4
    1.571321e-08   2   -11    11
    3.6668234e-12   2   -2000011    1000011
    3.6668234e-12   2   -1000011    2000011
    8.1866874e-14   2   -2    2
    3.9102587e-36   2    25    25

DECAY 37  16.816552
    0.66533508   2   -5    6
    0.30403908   2   -15    16
    0.027769629   2    1000022    1000024
    0.0010748888   2   -13    14
    0.00099406751   2   -5    4
    0.00053361383   2   -3    4
    0.00020734628   2   -1000015    1000016
    2.4791261e-05   2   -3    2
    7.0986749e-06   2   -5    2
    4.0449308e-06   2   -3    6
    3.4344866e-06   2    24    25
    2.4496417e-06   2   -1000011    1000012
    2.3014448e-06   2   -1000013    1000014
    1.4819284e-06   2   -1    2
    4.5019373e-07   2   -2000013    1000014
    1.5024533e-07   2   -1    6
    7.0050331e-08   2   -1    4
    2.5141761e-08   2   -11    12
    1.4176124e-11   2    24    35
    1.0613837e-11   2   -2000011    1000012
    7.5546308e-12   2    24    36

DECAY 6  2.43
    1   2    5    24

DECAY 15 -1
