BLOCK SPINFO
   1   SPheno
   2   v4.0.5be

BLOCK SPHENOINFO
   1   2
   2   2

BLOCK MODSEL
   1   0

BLOCK MINPAR
   3    10.14491
   4   -1

BLOCK EXTPAR
   0    2712.2918
   1   -45.810675
   2    3425.538
   3    2202.4622
   11    4739.2045
   12    3975.2134
   13   -1510.5348
   23   -398.40897
   25    9.668002
   26    3164.7312
   31    4461.1782
   32    4461.1782
   33    4979.2556
   34    2642.1176
   35    2642.1176
   36    2908.2151
   41    4633.0643
   42    4633.0643
   43    2394.4628
   44    3168.7069
   45    3168.7069
   46    3045.2823
   47    3630.6305
   48    3630.6305
   49    2760.9158

BLOCK SMINPUTS
   1    127.90897
   2    1.1663787e-05
   3    0.1184
   4    91.1876
   5    4.18
   6    173.2
   7    1.777
   8    0
   11    0.00051099893
   12    0
   13    0.10565837
   14    0
   21    0.005
   22    0.0025
   23    0.095
   24    1.27

BLOCK GAUGE Q=  2712.2918
   1    0.35536298
   2    0.66519887
   3    1.219778

BLOCK YU Q=  2712.2918
   1   1    8.4291033e-06
   2   2    0.0042819845
   3   3    1.0183034

BLOCK YD Q=  2712.2918
   1   1    0.00016375643
   2   2    0.0031113721
   3   3    0.16239506

BLOCK YE Q=  2712.2918
   1   1    2.8576694e-05
   2   2    0.005908754
   3   3    0.099375522

BLOCK AU Q=  2712.2918
   1   1    0
   2   2    0
   3   3    4739.2016

BLOCK AD Q=  2712.2918
   1   1    0
   2   2    0
   3   3    3975.2207

BLOCK AE Q=  2712.2918
   1   1    0
   2   2    0
   3   3   -1510.5352

BLOCK MSOFT Q=  2712.2918
   1   -45.810675
   2    3425.538
   3    2202.4622
   21    9631384.1
   22    57245.635
   31    4461.1782
   32    4461.1782
   33    4979.2556
   34    2642.1176
   35    2642.1176
   36    2908.2151
   41    4633.0643
   42    4633.0643
   43    2394.4628
   44    3168.7069
   45    3168.7069
   46    3045.2823
   47    3630.6305
   48    3630.6305
   49    2760.9158

BLOCK MASS
   6    173.2
   23    91.1876
   24    80.429995
   15    1.777
   25    124.33507
   35    3164.8062
   36    3164.7312
   37    3166.0792
   1000001    4700.4146
   2000001    3688.2408
   1000002    4699.8461
   2000002    3234.7
   1000003    4700.4141
   2000003    3688.2405
   1000004    4699.8457
   2000004    3234.6996
   1000005    2465.0852
   2000005    2835.0074
   1000006    2441.7331
   2000006    3012.8301
   1000011    4475.9289
   2000011    2644.4644
   1000012    4474.8234
   1000013    4475.928
   2000013    2644.4627
   1000014    4474.8227
   1000015    2910.4444
   2000015    4991.947
   1000016    4990.994
   1000021    2481.6547
   1000022   -43.94259
   1000023    404.75954
   1000025   -407.62132
   1000035    3471.0326
   1000024    403.7688
   1000037    3471.1505

BLOCK ALPHA
      -0.098473605

BLOCK HMIX Q=  2712.2918
   1   -398.40897
   2    9.668002
   3    243.34008
   4    10015524

BLOCK STOPMIX
   1   1   -0.98004329
   1   2    0.19878417
   2   1   -0.19878417
   2   2   -0.98004329

BLOCK SBOTMIX
   1   1   -0.99996156
   1   2    0.0087684196
   2   1   -0.0087684196
   2   2   -0.99996156

BLOCK STAUMIX
   1   1   -0.00024787751
   1   2    0.99999997
   2   1   -0.99999997
   2   2   -0.00024787751

BLOCK NMIX
   1   1   -0.9935911
   1   2   -0.00080124882
   1   3    0.11062446
   1   4   -0.023201519
   2   1   -0.061919392
   2   2   -0.016070815
   2   3   -0.70449763
   2   4   -0.70681737
   3   1   -0.09456541
   3   2    0.015667982
   3   3   -0.70103156
   3   4    0.70665879
   4   1    0.00030963777
   4   2   -0.99974777
   4   3    0.00024952678
   4   4    0.022455303

BLOCK UMIX
   1   1   -0.00036282348
   1   2   -0.99999993
   2   1    0.99999993
   2   2   -0.00036282348

BLOCK VMIX
   1   1   -0.031807154
   1   2    0.99949402
   2   1    0.99949402
   2   2    0.031807154

BLOCK HIGGSBOUNDSINPUTHIGGSCOUPLINGSFERMIONS
       0, 93.470263,3,36,15,15

BLOCK HIGGSBOUNDSINPUTHIGGSCOUPLINGSBOSONS
       0,4,36,21,21,23

BLOCK SPHENOLOWENERGY
   1    0.00032071239
   2    1.5903072e-06
   3    3.5252344e-05
   4    2.6065179e-15
   5    1.1134747e-10
   6    2.3308882e-08
   7    8.8023551e-14
   8    3.7603629e-09
   9    7.9758424e-07
   10    9.6749006e-05
   11    0.9993802
   12    0.54236082
   13    19.378738
   14    0
   15    0
   16    0.0021588385
   17    2.281674e-15
   18    2.4804384e-11
   19    8.2910885e-11
   20   -2.845059e-16
   21   -1.2163543e-11
   22   -3.0538261e-09
   23    0
   24    0
   25    0
   26    0
   27    0
   28    0
   29    0
   30    0
   31    0
   39   -3.3950924e-05
   40    0
   41    0
   42    0

BLOCK FWCOEF Q=  160
   305   4422   0   0   -0.18881911
   305   4422   0   2   -0.18842423
   305   4322   0   2   -6.024612e-05
   305   6421   0   0   -0.095227835
   305   6421   0   2   -0.099696401
   305   6321   0   2   -0.00012446494
   3051111   4133   0   0    1.6126398
   3051111   4133   0   2    1.613363
   3051111   4233   0   2    2.3951917e-05
   3051111   4137   0   0   -4.4353319
   3051111   4137   0   2   -4.433643
   3051111   4237   0   2   -0.00018045546
   3051313   4133   0   0    1.6126398
   3051313   4133   0   2    1.6133629
   3051313   4233   0   2    2.3951913e-05
   3051313   4137   0   0   -4.4353319
   3051313   4137   0   2   -4.433643
   3051313   4237   0   2   -0.00018045546
   3051212   4137   0   0    1.5053501
   3051212   4137   0   2    1.5049846
   3051212   4237   0   2    3.9143448e-05
   3051414   4137   0   0    1.5053501
   3051414   4137   0   2    1.5049846
   3051414   4237   0   2    3.9143448e-05
   3051616   4137   0   0    1.5053501
   3051616   4137   0   2    1.5049846
   3051616   4237   0   2    3.9143531e-05

BLOCK IMFWCOEF Q=  160
   305   4422   0   0    3.8582987e-07
   305   4422   0   2   -4.8570138e-06
   305   4322   0   2    1.0237619e-06
   305   6421   0   0    3.304888e-07
   305   6421   0   2    5.411242e-06
   305   6321   0   2    5.2955454e-07
   3051111   4133   0   2   -7.2072519e-07
   3051111   4233   0   2    4.6996058e-07
   3051111   4137   0   2    7.8769151e-06
   3051111   4237   0   2   -3.5416705e-06
   3051313   4133   0   2   -7.20725e-07
   3051313   4233   0   2    4.6996053e-07
   3051313   4137   0   2    7.8769154e-06
   3051313   4237   0   2   -3.5416706e-06
   3051212   4137   0   2   -1.6932256e-06
   3051212   4237   0   2    7.6824303e-07
   3051414   4137   0   2   -1.6932256e-06
   3051414   4237   0   2    7.6824303e-07
   3051616   4137   0   2   -1.6927936e-06
   3051616   4237   0   2    7.682434e-07

DECAY 23  2.4952


DECAY 24  2.085


DECAY 2000011  13.272285
    0.98780687   2    1000022    11
    0.0085324707   2    1000025    11
    0.0036606601   2    1000023    11

DECAY 1000011  15.02396
    0.41663409   2   -1000037    12
    0.37049734   2    1000022    11
    0.20818579   2    1000035    11
    0.0031160691   2    1000023    11
    0.0015663707   2    1000025    11

DECAY 2000013  13.27578
    0.98754785   2    1000022    13
    0.0085949999   2    1000025    13
    0.0037251688   2    1000023    13
    0.00013198071   2   -1000024    14

DECAY 1000013  15.027013
    0.41654889   2   -1000037    14
    0.37042453   2    1000022    13
    0.20814322   2    1000035    13
    0.0032164467   2    1000023    13
    0.0016660472   2    1000025    13

DECAY 1000015  15.710028
    0.9190032   2    1000022    15
    0.035009967   2   -1000024    16
    0.025185604   2    1000025    15
    0.020801227   2    1000023    15

DECAY 2000015  24.836302
    0.47199474   2   -1000037    16
    0.25044638   2    1000022    15
    0.23583008   2    1000035    15
    0.021452936   2    1000023    15
    0.020213566   2    1000025    15

DECAY 1000012  15.027835
    0.41538237   2    1000037    11
    0.36808104   2    1000022    12
    0.20790811   2    1000035    12
    0.0056466083   2    1000025    12
    0.0026089294   2    1000024    11
    0.00037294371   2    1000023    12

DECAY 1000014  15.030882
    0.41529772   2    1000037    13
    0.36800637   2    1000022    14
    0.20786574   2    1000035    14
    0.0056454628   2    1000025    14
    0.0028118305   2    1000024    13
    0.00037286805   2    1000023    14

DECAY 1000016  24.83998
    0.47101998   2    1000037    15
    0.24837977   2    1000022    16
    0.23573783   2    1000035    16
    0.04072727   2    1000024    15
    0.0038226836   2    1000025    16
    0.00025246658   2    1000023    16

DECAY 2000001  89.249556
    0.97694209   2    1000021    1
    0.022770223   2    1000022    1
    0.00020132044   2    1000025    1

DECAY 1000001  206.49889
    0.93466074   2    1000021    1
    0.041419774   2   -1000037    2
    0.020705102   2    1000035    1
    0.0031075457   2    1000022    1
    0.0001042938   2    1000025    1

DECAY 2000003  89.250909
    0.97692694   2    1000021    3
    0.022769973   2    1000022    3
    0.00020512232   2    1000025    3

DECAY 1000003  206.50142
    0.9346491   2    1000021    3
    0.04141923   2   -1000037    4
    0.020704838   2    1000035    3
    0.003107561   2    1000022    3
    0.00010640849   2    1000025    3

DECAY 1000005  49.17643
    0.96802115   2   -1000024    6
    0.012387745   2    1000025    5
    0.012349158   2    1000023    5
    0.0072419486   2    1000022    5

DECAY 2000005  16.699157
    0.73223123   2    1000021    5
    0.094344578   2    1000022    5
    0.085243098   2   -1000024    6
    0.042990732   2    1000025    5
    0.042820261   2    1000023    5
    0.0011064773   2    1000006   -24
    0.00079227428   2    1000005    25
    0.00047134565   2    1000005    23

DECAY 2000002  50.433546
    0.8568788   2    1000021    2
    0.14134861   2    1000022    2
    0.0012405017   2    1000025    2
    0.0005320865   2    1000023    2

DECAY 1000002  206.4667
    0.93451861   2    1000021    2
    0.041355308   2    1000037    1
    0.020689247   2    1000035    2
    0.0031644602   2    1000022    2
    0.00019975969   2    1000024    1

DECAY 2000004  50.435701
    0.85683969   2    1000021    4
    0.14134252   2    1000022    4
    0.001251736   2    1000025    4
    0.00054340525   2    1000023    4

DECAY 1000004  206.46917
    0.93450695   2    1000021    4
    0.041354795   2    1000037    3
    0.020688982   2    1000035    4
    0.003164426   2    1000022    4
    0.00020406526   2    1000024    3

DECAY 1000006  50.619297
    0.47141601   2    1000023    6
    0.46123018   2    1000025    6
    0.052900372   2    1000024    5
    0.013205255   2    1000022    6
    0.0012232347   3    1000022    24    5

DECAY 2000006  210.84645
    0.27536988   2    1000024    5
    0.14246333   2    1000025    6
    0.13978251   2    1000023    6
    0.12185624   2    1000005    24
    0.12168115   2    1000021    6
    0.10411326   2    1000006    25
    0.065088578   2    1000006    23
    0.029644761   2    1000022    6

DECAY 1000024  0.27799975
    0.99848635   2    1000022    24
    0.001513638   3    1000022   -5    6

DECAY 1000037  52.001119
    0.2201215   2    1000006   -5
    0.21061178   2   -1000005    6
    0.13976539   2    1000024    25
    0.13274757   2    1000024    23
    0.13262724   2    1000023    24
    0.13186255   2    1000025    24
    0.012990754   3    1000024    6   -6
    0.0089010074   3    1000025   -5    6
    0.0080150688   3    1000023   -5    6
    0.0012219289   2    2000006   -5
    0.00041904522   2    1000022    24
    0.00034973808   3    1000021   -5    6
    0.00013471808   3    1000024    5   -5

DECAY 1000022 -1


DECAY 1000023  0.30054121
    0.66025774   2    1000022    23
    0.33973395   2    1000022    25

DECAY 1000025  0.2356779
    0.6385261   2    1000022    25
    0.36144996   2    1000022    23

DECAY 1000035  54.184835
    0.12792043   2    1000024   -24
    0.12792043   2   -1000024    24
    0.10384572   2    1000005   -5
    0.10384572   2   -1000005    5
    0.10286888   2    1000006   -6
    0.10286888   2   -1000006    6
    0.10285182   2    1000025    25
    0.069628276   2    1000023    25
    0.064854267   2    1000025    23
    0.062114102   2    1000023    23
    0.0078810755   3    1000024    5   -6
    0.0078810755   3   -1000024   -5    6
    0.0070121625   3    1000025    6   -6
    0.006276146   3    1000023    6   -6
    0.00052338287   2    2000006   -6
    0.00052338287   2   -2000006    6
    0.00033614743   3    1000021    5   -5
    0.00030234499   2    1000022    25
    0.00012179682   3    1000021    6   -6

DECAY 1000021  0.37633245
    0.39456687   3    1000023    6   -6
    0.38506032   3    1000025    6   -6
    0.064744906   3    1000024    5   -6
    0.064744906   3   -1000024   -5    6
    0.019534599   3    1000022    6   -6
    0.016805777   2    1000005   -5
    0.016805777   2   -1000005    5
    0.007589436   3    1000022    4   -4
    0.0075894307   3    1000022    2   -2
    0.0060992825   2    1000023    21
    0.0056815173   2    1000025    21
    0.0043217388   3    1000022    5   -5
    0.0017408385   3    1000025    5   -5
    0.0017328491   3    1000023    5   -5
    0.0010045087   3    1000022    3   -3
    0.0010045011   3    1000022    1   -1
    0.00036190121   2    1000006   -4
    0.00036190121   2   -1000006    4

DECAY 25  0.003899794
    0.5665073   2   -5    5
    0.21183225   2   -24    24
    0.071012305   2    21    21
    0.065114463   2   -15    15
    0.028110552   2    1000022    1000022
    0.027996698   2   -4    4
    0.025305586   2    23    23
    0.0022790581   2    22    22
    0.0014024536   2    22    23
    0.00022583032   2   -13    13
    0.00021276838   2   -3    3
    5.8828262e-07   2   -1    1
    1.4427548e-07   2   -2    2
    5.0769243e-09   2   -11    11

DECAY 35  9.1268278
    0.39761574   2   -5    5
    0.22944822   2    1000022    1000023
    0.14604367   2    1000022    1000025
    0.13287029   2   -6    6
    0.071573376   2   -15    15
    0.0090773932   2    1000022    1000022
    0.005113041   2    1000023    1000025
    0.0044285095   2    1000025    1000025
    0.0027971251   2   -1000024    1000024
    0.00039149478   2    1000023    1000023
    0.00024764038   2   -13    13
    0.00018417592   2    25    25
    0.000149152   2   -3    3
    3.218784e-05   2    23    23
    1.6643641e-05   2    21    21
    9.0644525e-06   2   -24    24
    1.7828262e-06   2   -4    4
    4.1235383e-07   2   -1    1
    5.6952119e-08   2    22    22
    8.5622283e-09   2    22    23
    5.56176e-09   2   -11    11
    9.1901522e-12   2   -2    2

DECAY 36  8.9429805
    0.39502309   2   -5    5
    0.22526788   2    1000022    1000025
    0.15596337   2    1000022    1000023
    0.12769592   2   -6    6
    0.071107914   2   -15    15
    0.010063588   2    1000022    1000022
    0.0072050296   2    1000025    1000025
    0.0038337592   2    1000023    1000025
    0.003026558   2   -1000024    1000024
    0.00028690036   2    1000023    1000023
    0.0002460297   2   -13    13
    0.00014818144   2   -3    3
    7.3884344e-05   2    21    21
    5.5591223e-05   2    23    25
    1.691847e-06   2   -4    4
    4.0966947e-07   2   -1    1
    1.4752028e-07   2    22    22
    4.9269662e-08   2    22    23
    5.5255867e-09   2   -11    11
    8.7214447e-12   2   -2    2
    2.292611e-39   2    25    25

DECAY 37  9.1203191
    0.53149448   2   -5    6
    0.39111566   2    1000022    1000024
    0.071450179   2   -15    16
    0.0031744535   2    1000023    1000024
    0.0015205001   2    1000024    1000025
    0.00059176082   2   -5    4
    0.00025260187   2   -13    14
    0.00018841138   2   -3    6
    0.00013762842   2   -3    4
    5.461075e-05   2    24    25
    8.6321682e-06   2   -1    6
    6.3712168e-06   2   -3    2
    4.2257642e-06   2   -5    2
    3.7721065e-07   2   -1    2
    9.6474543e-08   2   -1    4
    5.9083841e-09   2   -11    12
    6.6428227e-13   2    24    36
    4.9896816e-13   2    24    35

DECAY 6  2.43
    1   2    5    24

DECAY 15 -1
