BLOCK SPINFO
   1   SPheno
   2   v4.0.5be

BLOCK SPHENOINFO
   1   2
   2   2

BLOCK MODSEL
   1   0

BLOCK MINPAR
   3    5.5116088
   4    1

BLOCK EXTPAR
   0    2511.0284
   1    4638.67
   2    2949.863
   3    4587.0429
   11   -6270.5413
   12   -1890.603
   13    5764.4072
   23    288.07625
   25    5.259769
   26    3287.2384
   31    2737.1896
   32    2737.1896
   33    295.94272
   34    939.60191
   35    939.60191
   36    3656.0129
   41    2135.3284
   42    2135.3284
   43    2057.827
   44    3661.141
   45    3661.141
   46    3155.9822
   47    3908.1919
   48    3908.1919
   49    2206.6835

BLOCK SMINPUTS
   1    127.90897
   2    1.1663787e-05
   3    0.1184
   4    91.1876
   5    4.18
   6    173.2
   7    1.777
   8    0
   11    0.00051099893
   12    0
   13    0.10565837
   14    0
   21    0.005
   22    0.0025
   23    0.095
   24    1.27

BLOCK GAUGE Q=  2511.0284
   1    0.35536298
   2    0.66519887
   3    1.219778

BLOCK YU Q=  2511.0284
   1   1    8.53456e-06
   2   2    0.0043355565
   3   3    1.0310434

BLOCK YD Q=  2511.0284
   1   1    9.0204468e-05
   2   2    0.0017138849
   3   3    0.089454566

BLOCK YE Q=  2511.0284
   1   1    1.5741339e-05
   2   2    0.0032548097
   3   3    0.054740545

BLOCK AU Q=  2511.0284
   1   1    0
   2   2    0
   3   3   -6270.5434

BLOCK AD Q=  2511.0284
   1   1    0
   2   2    0
   3   3   -1890.6028

BLOCK AE Q=  2511.0284
   1   1    0
   2   2    0
   3   3    5764.4069

BLOCK MSOFT Q=  2511.0284
   1    4638.67
   2    2949.863
   3    4587.0429
   21    10252123
   22    344745.77
   31    2737.1896
   32    2737.1896
   33    295.94272
   34    939.60191
   35    939.60191
   36    3656.0129
   41    2135.3284
   42    2135.3284
   43    2057.827
   44    3661.141
   45    3661.141
   46    3155.9822
   47    3908.1919
   48    3908.1919
   49    2206.6835

BLOCK MASS
   6    173.2
   23    91.1876
   24    80.429995
   15    1.777
   25    121.61847
   35    3287.3631
   36    3287.2384
   37    3288.4595
   1000001    2214.36
   2000001    3986.5062
   1000002    2212.9388
   2000002    3740.3854
   1000003    2214.3596
   2000003    3986.5061
   1000004    2212.9385
   2000004    3740.3849
   1000005    2077.4248
   2000005    2260.0076
   1000006    2042.7398
   2000006    3086.67
   1000011    2758.8671
   2000011    940.35784
   1000012    2757.3999
   1000013    2758.8668
   2000013    940.35674
   1000014    2757.3996
   1000015    367.6373
   2000015    3663.033
   1000016    359.13966
   1000021    4500.1213
   1000022    287.15281
   1000023   -290.29464
   1000025    2923.8404
   1000035    4598.879
   1000024    288.19364
   1000037    2923.9256

BLOCK ALPHA
      -0.17984186

BLOCK HMIX Q=  2511.0284
   1    288.07625
   2    5.259769
   3    243.41148
   4    10805936

BLOCK STOPMIX
   1   1    0.98591465
   1   2    0.1672492
   2   1   -0.1672492
   2   2    0.98591465

BLOCK SBOTMIX
   1   1    0.9999488
   1   2    0.01011925
   2   1   -0.01011925
   2   2    0.9999488

BLOCK STAUMIX
   1   1   -0.99999984
   1   2    0.00055780221
   2   1   -0.00055780221
   2   2   -0.99999984

BLOCK NMIX
   1   1   -0.0085726628
   1   2    0.024732385
   1   3   -0.7086726
   1   4    0.70505175
   2   1   -0.0052068992
   2   2    0.013996222
   2   3    0.70549186
   2   4    0.70856068
   3   1    0.00059111905
   3   2    0.99959608
   3   3    0.0076552988
   3   4   -0.027362853
   4   1   -0.99994952
   4   2    0.00030599641
   4   3    0.0024064329
   4   4   -0.0097502418

BLOCK UMIX
   1   1   -0.010829553
   1   2    0.99994136
   2   1    0.99994136
   2   2    0.010829553

BLOCK VMIX
   1   1   -0.0387298
   1   2    0.99924972
   2   1    0.99924972
   2   2    0.0387298

BLOCK HIGGSBOUNDSINPUTHIGGSCOUPLINGSFERMIONS
       0, 27.66517,3,36,15,15

BLOCK HIGGSBOUNDSINPUTHIGGSCOUPLINGSBOSONS
       0,4,36,21,21,23

BLOCK SPHENOLOWENERGY
   1    0.00032259967
   2    1.5918828e-06
   3    3.5291797e-05
   4    2.6173463e-15
   5    1.1181006e-10
   6    2.3406258e-08
   7    8.8151455e-14
   8    3.7658273e-09
   9    7.9876158e-07
   10    9.6792333e-05
   11    0.99982775
   12    0.54229823
   13    19.376667
   14    0
   15    0
   16    0.0021586228
   17    2.2816717e-15
   18    2.4826432e-11
   19    8.2967941e-11
   20    1.8180289e-16
   21    7.7726167e-12
   22    3.6586489e-09
   23    0
   24    0
   25    0
   26    0
   27    0
   28    0
   29    0
   30    0
   31    0
   39   -0.00030884104
   40    0
   41    0
   42    0

BLOCK FWCOEF Q=  160
   305   4422   0   0   -0.18881911
   305   4422   0   2   -0.19072708
   305   4322   0   2   -3.9991904e-05
   305   6421   0   0   -0.095227835
   305   6421   0   2   -0.10072214
   305   6321   0   2   -0.00010882051
   3051111   4133   0   0    1.6099283
   3051111   4133   0   2    1.6106033
   3051111   4233   0   2    9.2768447e-06
   3051111   4137   0   0   -4.4326204
   3051111   4137   0   2   -4.4348049
   3051111   4237   0   2   -7.0126881e-05
   3051313   4133   0   0    1.6099283
   3051313   4133   0   2    1.6106033
   3051313   4233   0   2    9.2768443e-06
   3051313   4137   0   0   -4.4326204
   3051313   4137   0   2   -4.4348049
   3051313   4237   0   2   -7.0126881e-05
   3051212   4137   0   0    1.5053501
   3051212   4137   0   2    1.5058263
   3051212   4237   0   2    1.5221973e-05
   3051414   4137   0   0    1.5053501
   3051414   4137   0   2    1.5058263
   3051414   4237   0   2    1.5221973e-05
   3051616   4137   0   0    1.5053501
   3051616   4137   0   2    1.5058242
   3051616   4237   0   2    1.5222066e-05

BLOCK IMFWCOEF Q=  160
   305   4422   0   0    3.8582706e-07
   305   4422   0   2    3.5089059e-06
   305   4322   0   2    1.2225363e-06
   305   6421   0   0    3.3048639e-07
   305   6421   0   2    5.33722e-07
   305   6321   0   2    6.1458145e-07
   3051111   4133   0   2    1.5294899e-07
   3051111   4233   0   2    1.7731896e-07
   3051111   4137   0   2    4.3996423e-07
   3051111   4237   0   2   -1.3407508e-06
   3051313   4133   0   2    1.5294869e-07
   3051313   4233   0   2    1.7731895e-07
   3051313   4137   0   2    4.3996404e-07
   3051313   4237   0   2   -1.3407508e-06
   3051212   4137   0   2   -6.0569049e-08
   3051212   4237   0   2    2.9102709e-07
   3051414   4137   0   2   -6.0569059e-08
   3051414   4237   0   2    2.9102709e-07
   3051616   4137   0   2   -9.8722284e-08
   3051616   4237   0   2    2.9102867e-07

DECAY 23  2.4952


DECAY 24  2.085


DECAY 2000011  0.00039038367
    0.73133671   2    1000022    11
    0.26865355   2    1000023    11

DECAY 1000011  0.0091055754
    0.52994667   2    1000022    11
    0.30601832   2   -1000024    12
    0.16403501   2    1000023    11

DECAY 2000013  0.00071564482
    0.5132601   2    1000022    13
    0.25941168   2    1000023    13
    0.22732822   2   -1000024    14

DECAY 1000013  0.0096770115
    0.52817591   2    1000022    13
    0.28794764   2   -1000024    14
    0.18359699   2    1000023    13
    0.00027946541   2    2000013    25

DECAY 1000015  0.0034022087
    0.51623834   2    1000022    15
    0.46730107   2    1000023    15
    0.016437944   2   -1000024    16

DECAY 2000015  0.50345412
    0.42839931   2   -1000024    16
    0.21789769   2    1000022    15
    0.21411283   2    1000023    15
    0.058162633   2    1000016   -37
    0.021277651   2    1000015    36
    0.021158619   2    1000015    35
    0.020047425   2    1000016   -24
    0.010005459   2    1000015    23
    0.0089353018   2    1000015    25

DECAY 1000012  0.049163284
    0.72450653   2    1000024    11
    0.20753151   2    1000022    12
    0.067961966   2    1000023    12

DECAY 1000014  0.049731638
    0.72765502   2    1000024    13
    0.20515972   2    1000022    14
    0.067185259   2    1000023    14

DECAY 1000016  0.0034874834
    0.93392723   2    1000024    15
    0.050670911   2    1000022    16
    0.01540186   2    1000023    16

DECAY 1000001  0.010802901
    0.60137672   2    1000022    1
    0.20451451   2   -1000024    2
    0.19410877   2    1000023    1

DECAY 2000001  0.00022301822
    0.72725488   2    1000022    1
    0.26913233   2    1000023    1
    0.0028630973   2   -1000024    2
    0.00074457366   2    1000025    1

DECAY 1000003  0.011726175
    0.55936602   2    1000022    3
    0.25651609   2   -1000024    4
    0.18411789   2    1000023    3

DECAY 2000003  0.00068317219
    0.40641994   2    1000022    3
    0.33740643   2   -1000024    4
    0.25532337   2    1000023    3
    0.00059441719   2    1000003    25
    0.00024730572   2    1000025    3

DECAY 1000005  41.897087
    0.99221048   2   -1000024    6
    0.0039748867   2    1000022    5
    0.0038146371   2    1000023    5

DECAY 2000005  0.70391898
    0.49664614   2   -1000024    6
    0.24750159   2    1000022    5
    0.24675259   2    1000023    5
    0.0054559763   2    1000006   -24
    0.0022600941   2    1000005    25
    0.0013836048   2    1000005    23

DECAY 1000002  0.034915475
    0.80876549   2    1000024    1
    0.14521078   2    1000022    2
    0.04602373   2    1000023    2

DECAY 2000002  0.00083084435
    0.73015931   2    1000022    2
    0.2693028   2    1000023    2
    0.00053145102   2    1000025    2

DECAY 1000004  0.035838162
    0.79141706   2    1000024    3
    0.15255389   2    1000022    4
    0.056029052   2    1000023    4

DECAY 2000004  0.0035923391
    0.38418028   2    1000024    3
    0.36012971   2    1000022    4
    0.25541094   2    1000023    4
    0.00016679527   2    1000025    4

DECAY 1000006  42.54084
    0.47978931   2    1000023    6
    0.47670356   2    1000022    6
    0.042987694   2    1000024    5
    0.00042416634   3    1000022    24    5

DECAY 2000006  329.6492
    0.27516439   2    1000005    24
    0.19982509   2    1000006    25
    0.18730447   2    1000024    5
    0.14475789   2    1000006    23
    0.097037303   2    1000023    6
    0.095849277   2    1000022    6

DECAY 1000024  1.1883057e-12
    0.68618672   2    1000022    211
    0.16087616   3    1000022   -11    12
    0.15293712   3    1000022   -13    14

DECAY 1000037  100.52278
    0.12400764   2    1000016   -15
    0.12399754   2   -1000015    16
    0.09570743   2    1000006   -5
    0.090457014   2   -1000005    6
    0.069988825   2    1000004   -3
    0.069988773   2    1000002   -1
    0.069844416   2   -1000001    2
    0.069844325   2   -1000003    4
    0.068035563   2    1000024    25
    0.06664307   2    1000023    24
    0.066323125   2    1000024    23
    0.066031903   2    1000022    24
    0.0057853808   3    1000024    6   -6
    0.003826784   3    1000022   -5    6
    0.003266716   3    1000023   -5    6
    0.0015654933   2    1000014   -13
    0.0015654879   2    1000012   -11
    0.001540954   2   -1000013    14
    0.0015409491   2   -1000011    12

DECAY 1000022 -1


DECAY 1000023  4.8941577e-09
    0.86179507   2    1000022    22
    0.032654643   3    1000022    12   -12
    0.024416587   3    1000022    1   -1
    0.024127378   3    1000022    3   -3
    0.019043397   3    1000022    2   -2
    0.007563931   3    1000024    1   -2
    0.007563931   3   -1000024   -1    2
    0.0055103134   3    1000022    11   -11
    0.0054077983   3    1000022    13   -13
    0.0025214165   3    1000024    11   -12
    0.0025214165   3   -1000024   -11    12
    0.0024839989   3    1000024    13   -14
    0.0024839989   3   -1000024   -13    14
    0.00069875601   3    1000024    3   -4
    0.00069875601   3   -1000024   -3    4
    0.00050484888   3    1000022    4   -4

DECAY 1000025  101.32615
    0.065980648   2    1000024   -24
    0.065980648   2   -1000024    24
    0.061514169   2    1000016   -16
    0.061514169   2   -1000016    16
    0.061501585   2    1000015   -15
    0.061501585   2   -1000015    15
    0.050718109   2    1000022    25
    0.050090795   2    1000023    23
    0.046658339   2    1000005   -5
    0.046658339   2   -1000005    5
    0.045741469   2    1000006   -6
    0.045741469   2   -1000006    6
    0.034741877   2    1000002   -2
    0.034741877   2   -1000002    2
    0.034741829   2    1000004   -4
    0.034741829   2   -1000004    4
    0.034607707   2    1000003   -3
    0.034607707   2   -1000003    3
    0.034607678   2    1000001   -1
    0.034607678   2   -1000001    1
    0.024610216   2    1000023    25
    0.015684617   2    1000022    23
    0.0036505016   3    1000024    5   -6
    0.0036505016   3   -1000024   -5    6
    0.0027837195   3    1000022    6   -6
    0.0024511227   3    1000023    6   -6
    0.00077583843   2    1000014   -14
    0.00077583843   2   -1000014    14
    0.00077583553   2    1000012   -12
    0.00077583553   2   -1000012    12
    0.00076357794   2    1000013   -13
    0.00076357794   2   -1000013    13
    0.00076357571   2    1000011   -11
    0.00076357571   2   -1000011    11

DECAY 1000035  111.71913
    0.094941978   2    2000013   -13
    0.094941978   2   -2000013    13
    0.094941959   2    2000011   -11
    0.094941959   2   -2000011    11
    0.040851635   2    2000006   -6
    0.040851635   2   -2000006    6
    0.02937664   2    1000024   -24
    0.02937664   2   -1000024    24
    0.025566967   2    1000016   -16
    0.025566967   2   -1000016    16
    0.025493577   2    1000015   -15
    0.025493577   2   -1000015    15
    0.021680721   2    1000023    23
    0.019829724   2    2000005   -5
    0.019829724   2   -2000005    5
    0.019536356   2    1000022    25
    0.015798488   2    2000002   -2
    0.015798488   2   -2000002    2
    0.015798483   2    2000004   -4
    0.015798483   2   -2000004    4
    0.013820234   2    2000015   -15
    0.013820234   2   -2000015    15
    0.010617803   2    1000014   -14
    0.010617803   2   -1000014    14
    0.0106178   2    1000012   -12
    0.0106178   2   -1000012    12
    0.010580848   2    1000013   -13
    0.010580848   2   -1000013    13
    0.010580845   2    1000011   -11
    0.010580845   2   -1000011    11
    0.0094737189   2    1000023    25
    0.0078227967   2    1000022    23
    0.0067027386   2    1000006   -6
    0.0067027386   2   -1000006    6
    0.0054932704   2    37   -1000024
    0.0054932704   2   -37    1000024
    0.0054794184   2    1000005   -5
    0.0054794184   2   -1000005    5
    0.0051465782   2    1000023    35
    0.0051023025   2    1000003   -3
    0.0051023025   2   -1000003    3
    0.0051023015   2    1000001   -1
    0.0051023015   2   -1000001    1
    0.0050712807   2    1000004   -4
    0.0050712807   2   -1000004    4
    0.0050712752   2    1000002   -2
    0.0050712752   2   -1000002    2
    0.0031122451   2    1000022    36
    0.0024868421   2    1000022    35
    0.0021299894   2    2000003   -3
    0.0021299894   2   -2000003    3
    0.0021299889   2    2000001   -1
    0.0021299889   2   -2000001    1
    0.0018869137   3    1000024    5   -6
    0.0018869137   3   -1000024   -5    6
    0.0015560779   3    1000022    6   -6
    0.00147529   3    1000023    6   -6
    0.0014237264   2    1000023    36

DECAY 1000021  621.1771
    0.066386294   2    1000005   -5
    0.066386294   2   -1000005    5
    0.065364792   2    1000006   -6
    0.065364792   2   -1000006    6
    0.061633436   2    1000004   -4
    0.061633436   2   -1000004    4
    0.061633429   2    1000002   -2
    0.061633429   2   -1000002    2
    0.061582937   2    1000003   -3
    0.061582937   2   -1000003    3
    0.061582925   2    1000001   -1
    0.061582925   2   -1000001    1
    0.059957729   2    2000005   -5
    0.059957729   2   -2000005    5
    0.031343482   2    2000006   -6
    0.031343482   2   -2000006    6
    0.010247235   2    2000002   -2
    0.010247235   2   -2000002    2
    0.010247235   2    2000004   -4
    0.010247235   2   -2000004    4
    0.004967291   2    2000003   -3
    0.004967291   2   -2000003    3
    0.0049672894   2    2000001   -1
    0.0049672894   2   -2000001    1

DECAY 25  0.0034746796
    0.62299763   2   -5    5
    0.17652345   2   -24    24
    0.074342647   2    21    21
    0.071332256   2   -15    15
    0.030802724   2   -4    4
    0.019960504   2    23    23
    0.0023395482   2    22    22
    0.0012189852   2    22    23
    0.00024742055   2   -13    13
    0.00023402325   2   -3    3
    6.4705085e-07   2   -1    1
    1.5874434e-07   2   -2    2
    5.5623348e-09   2   -11    11

DECAY 35  6.352112
    0.63542418   2   -6    6
    0.17092768   2   -5    5
    0.050929054   2   -1000024    1000037
    0.050929054   2   -1000037    1000024
    0.0480555   2    1000023    1000025
    0.032439786   2   -15    15
    0.0053548662   2   -1000024    1000024
    0.0020558809   2    1000022    1000025
    0.0011166798   2    1000022    1000022
    0.00086132235   2    25    25
    0.00077289929   2    1000023    1000023
    0.00042497771   2    1000022    1000023
    0.00014146345   2    21    21
    0.00013468647   2    23    23
    0.00011036948   2   -13    13
    6.4777981e-05   2   -3    3
    4.0561846e-05   2   -1000015    1000015
    3.6127586e-05   2   -24    24
    2.1130557e-05   2   -1000011    1000011
    2.1126517e-05   2   -1000013    1000013
    8.4925647e-06   2   -4    4
    1.2075683e-06   2    22    22
    3.693581e-07   2    22    23
    1.7908782e-07   2   -1    1
    2.4787523e-09   2   -11    11
    4.3777365e-11   2   -2    2

DECAY 36  6.1612301
    0.62681177   2   -6    6
    0.17259505   2   -5    5
    0.052318817   2   -1000024    1000037
    0.052318817   2   -1000037    1000024
    0.050782633   2    1000022    1000025
    0.032754364   2   -15    15
    0.0069497801   2   -1000024    1000024
    0.0024670691   2    1000022    1000022
    0.0019254782   2    1000023    1000025
    0.00039335885   2    1000023    1000023
    0.00024238721   2    23    25
    0.00023826797   2    21    21
    0.0001114479   2   -13    13
    6.5411011e-05   2   -3    3
    1.4775153e-05   2    1000022    1000023
    8.2852962e-06   2   -4    4
    1.5789886e-06   2    22    22
    5.2310919e-07   2    22    23
    1.8083858e-07   2   -1    1
    2.5029954e-09   2   -11    11
    4.2709788e-11   2   -2    2
    1.4142142e-37   2    25    25

DECAY 37  6.515094
    0.81559891   2   -5    6
    0.05094078   2    1000022    1000037
    0.050395366   2    1000024    1000025
    0.04942055   2    1000023    1000037
    0.030663648   2   -15    16
    0.0010058168   2    1000023    1000024
    0.00092383024   2   -3    6
    0.00024517231   2   -5    4
    0.00022959729   2    24    25
    0.00020299291   2    1000022    1000024
    0.00015177714   2   -1000015    1000016
    0.00010840693   2   -13    14
    6.5783524e-05   2   -3    4
    4.236718e-05   2   -1    6
    2.6970642e-06   2   -3    2
    1.7506916e-06   2   -5    2
    3.9428382e-07   2   -1    4
    1.5965406e-07   2   -1    2
    2.5356494e-09   2   -11    12
    5.6724471e-13   2    24    36
    3.3104299e-13   2    24    35

DECAY 6  2.43
    1   2    5    24

DECAY 15 -1
