BLOCK SPINFO
   1   SPheno
   2   v4.0.5be

BLOCK SPHENOINFO
   1   2
   2   2

BLOCK MODSEL
   1   0

BLOCK MINPAR
   3    11.547459
   4   -1

BLOCK EXTPAR
   0    4465.3333
   1    431.24556
   2    3040.0667
   3    3298.4815
   11   -4302.6628
   12    3660.2735
   13    7913.8794
   23   -251.7932
   25    10.974089
   26    1550.2541
   31    4023.0997
   32    4023.0997
   33    3730.6616
   34    1060.0237
   35    1060.0237
   36    444.67203
   41    2133.5963
   42    2133.5963
   43    4391.1074
   44    391.40954
   45    391.40954
   46    4433.4715
   47    3399.7669
   48    3399.7669
   49    3846.7206

BLOCK SMINPUTS
   1    127.90897
   2    1.1663787e-05
   3    0.1184
   4    91.1876
   5    4.18
   6    173.2
   7    1.777
   8    0
   11    0.00051099893
   12    0
   13    0.10565837
   14    0
   21    0.005
   22    0.0025
   23    0.095
   24    1.27

BLOCK GAUGE Q=  4465.3333
   1    0.35536298
   2    0.66519887
   3    1.219778

BLOCK YU Q=  4465.3333
   1   1    8.4191101e-06
   2   2    0.0042769079
   3   3    1.0170961

BLOCK YD Q=  4465.3333
   1   1    0.00018565852
   2   2    0.003527512
   3   3    0.18411508

BLOCK YE Q=  4465.3333
   1   1    3.239877e-05
   2   2    0.0066990382
   3   3    0.1126668

BLOCK AU Q=  4465.3333
   1   1    0
   2   2    0
   3   3   -4302.6655

BLOCK AD Q=  4465.3333
   1   1    0
   2   2    0
   3   3    3660.2737

BLOCK AE Q=  4465.3333
   1   1    0
   2   2    0
   3   3    7913.8781

BLOCK MSOFT Q=  4465.3333
   1    431.24556
   2    3040.0667
   3    3298.4815
   21    2199810.6
   22    317070.51
   31    4023.0997
   32    4023.0997
   33    3730.6616
   34    1060.0237
   35    1060.0237
   36    444.67203
   41    2133.5963
   42    2133.5963
   43    4391.1074
   44    391.40954
   45    391.40954
   46    4433.4715
   47    3399.7669
   48    3399.7669
   49    3846.7206

BLOCK MASS
   6    173.2
   23    91.1876
   24    80.429995
   15    1.777
   25    122.227
   35    1550.326
   36    1550.2541
   37    1552.5208
   1000001    2380.6412
   2000001    3547.5213
   1000002    2379.3181
   2000002    891.77157
   1000003    2380.6404
   2000003    3547.5206
   1000004    2379.3174
   2000004    891.7707
   1000005    3972.99
   2000005    4478.4072
   1000006    4396.0297
   2000006    4535.7294
   1000011    4046.9034
   2000011    1064.0173
   1000012    4045.7027
   1000013    4046.9017
   2000013    1064.009
   1000014    4045.701
   1000015    438.87277
   2000015    3754.2141
   1000016    3752.9546
   1000021    3518.2273
   1000022    266.06157
   1000023   -275.76257
   1000025    425.01812
   1000035    3039.5596
   1000024    272.42791
   1000037    3039.7171

BLOCK ALPHA
      -0.087185282

BLOCK HMIX Q=  4465.3333
   1   -251.7932
   2    10.974089
   3    242.83461
   4    2403287.6

BLOCK STOPMIX
   1   1    0.63844268
   1   2    0.76966937
   2   1   -0.76966937
   2   2    0.63844268

BLOCK SBOTMIX
   1   1   -0.0029734824
   1   2    0.99999558
   2   1   -0.99999558
   2   2   -0.0029734824

BLOCK STAUMIX
   1   1   -0.0013545511
   1   2    0.99999908
   2   1   -0.99999908
   2   2   -0.0013545511

BLOCK NMIX
   1   1    0.17851669
   1   2   -0.017340484
   1   3   -0.70487769
   1   4   -0.68627876
   2   1    0.048745126
   2   2   -0.01818246
   2   3    0.70318401
   2   4   -0.70910194
   3   1   -0.98272861
   3   2   -0.0044962192
   3   3   -0.093164789
   3   4   -0.15982676
   4   1    0.00043683333
   4   2   -0.99967419
   4   3   -0.00014385221
   4   4    0.025520555

BLOCK UMIX
   1   1    0.0001999313
   1   2   -0.99999998
   2   1    0.99999998
   2   2    0.0001999313

BLOCK VMIX
   1   1   -0.03609634
   1   2    0.99934831
   2   1    0.99934831
   2   2    0.03609634

BLOCK HIGGSBOUNDSINPUTHIGGSCOUPLINGSFERMIONS
       0, 120.43062,3,36,15,15

BLOCK HIGGSBOUNDSINPUTHIGGSCOUPLINGSBOSONS
       0,4,36,21,21,23

BLOCK SPHENOLOWENERGY
   1    0.00034179364
   2    1.5891035e-06
   3    3.5273248e-05
   4    2.4388468e-15
   5    1.0418478e-10
   6    2.1811155e-08
   7    8.23065e-14
   8    3.5161317e-09
   9    7.4583859e-07
   10    9.6460512e-05
   11    0.99640016
   12    0.5421743
   13    19.370534
   14    0
   15    0
   16    0.0021580843
   17    2.2816667e-15
   18    2.481237e-11
   19    8.2937561e-11
   20   -2.8339617e-16
   21   -1.2116067e-11
   22   -4.5429861e-09
   23    0
   24    0
   25    0
   26    0
   27    0
   28    0
   29    0
   30    0
   31    0
   39   -9.556485e-06
   40    0
   41    0
   42    0

BLOCK FWCOEF Q=  160
   305   4422   0   0   -0.18881911
   305   4422   0   2   -0.21090071
   305   4322   0   2   -0.00046634153
   305   6421   0   0   -0.095227835
   305   6421   0   2   -0.12001678
   305   6321   0   2   -0.00050715661
   3051111   4133   0   0    1.630062
   3051111   4133   0   2    1.6304531
   3051111   4233   0   2    2.1746603e-05
   3051111   4137   0   0   -4.4527541
   3051111   4137   0   2   -4.4531202
   3051111   4237   0   2   -0.00016023219
   3051313   4133   0   0    1.630062
   3051313   4133   0   2    1.6304531
   3051313   4233   0   2    2.1746577e-05
   3051313   4137   0   0   -4.4527541
   3051313   4137   0   2   -4.4531203
   3051313   4237   0   2   -0.00016023218
   3051212   4137   0   0    1.5053501
   3051212   4137   0   2    1.5054306
   3051212   4237   0   2    3.4622704e-05
   3051414   4137   0   0    1.5053501
   3051414   4137   0   2    1.5054306
   3051414   4237   0   2    3.4622709e-05
   3051616   4137   0   0    1.5053501
   3051616   4137   0   2    1.5054306
   3051616   4237   0   2    3.4624069e-05

BLOCK IMFWCOEF Q=  160
   305   4422   0   0    3.8582045e-07
   305   4422   0   2   -3.9173075e-06
   305   4322   0   2   -1.5707067e-06
   305   6421   0   0    3.3048073e-07
   305   6421   0   2    3.1502819e-06
   305   6321   0   2   -7.2600488e-07
   3051111   4133   0   2    1.0033016e-06
   3051111   4233   0   2    5.6169103e-07
   3051111   4137   0   2   -5.7713617e-06
   3051111   4237   0   2   -4.1387357e-06
   3051313   4133   0   2    1.0033013e-06
   3051313   4233   0   2    5.6169096e-07
   3051313   4137   0   2   -5.7713619e-06
   3051313   4237   0   2   -4.1387359e-06
   3051212   4137   0   2    1.2708845e-06
   3051212   4237   0   2    8.9428534e-07
   3051414   4137   0   2    1.2708845e-06
   3051414   4237   0   2    8.9428534e-07
   3051616   4137   0   2    1.270481e-06
   3051616   4237   0   2    8.9428543e-07

DECAY 23  2.4952


DECAY 24  2.085


DECAY 2000011  3.8078056
    0.95777067   2    1000025    11
    0.039323643   2    1000022    11
    0.0029056793   2    1000023    11

DECAY 1000011  15.139806
    0.44693283   2   -1000037    12
    0.32261742   2    1000025    11
    0.22327648   2    1000035    11
    0.0071011909   2    1000022    11

DECAY 2000013  3.8094124
    0.95735473   2    1000025    13
    0.039415771   2    1000022    13
    0.0030117558   2    1000023    13
    0.00021774534   2   -1000024    14

DECAY 1000013  15.143364
    0.44682665   2   -1000037    14
    0.32254351   2    1000025    13
    0.22322343   2    1000035    13
    0.0072170328   2    1000022    13
    0.00018885733   2    1000023    13

DECAY 1000015  0.12260281
    0.41240407   2    1000022    15
    0.34154723   2   -1000024    16
    0.17988508   2    1000023    15
    0.066163625   2    1000025    15

DECAY 2000015  14.860008
    0.3043969   2    1000025    15
    0.26381481   2   -1000037    16
    0.13181144   2    1000035    15
    0.11332555   2    1000015    35
    0.11322691   2    1000015    36
    0.038025203   2    1000022    15
    0.031300128   2    1000023    15
    0.0021288059   2    1000015    23
    0.0019698478   2    1000015    25

DECAY 1000012  15.145746
    0.44535777   2    1000037    11
    0.31153347   2    1000025    12
    0.22298808   2    1000035    12
    0.014806404   2    1000022    12
    0.0030361005   2    1000024    11
    0.0022781704   2    1000023    12

DECAY 1000014  15.149296
    0.44525222   2    1000037    13
    0.31146032   2    1000025    14
    0.22293523   2    1000035    14
    0.014802928   2    1000022    14
    0.0032716583   2    1000024    13
    0.0022776355   2    1000023    14

DECAY 1000016  14.866848
    0.29334805   2    1000025    16
    0.26258871   2    1000037    15
    0.22624754   2    1000015    37
    0.13149378   2    1000035    16
    0.065946217   2    1000024    15
    0.013972976   2    1000022    16
    0.0042529982   2    1000015    24
    0.0021497309   2    1000023    16

DECAY 1000001  0.31753616
    0.8991373   2    1000025    1
    0.077675982   2    1000022    1
    0.023184143   2    1000023    1

DECAY 2000001  2.0010248
    0.92863253   2    1000025    1
    0.037853061   2    1000021    1
    0.031188969   2    1000022    1
    0.0023242203   2    1000023    1

DECAY 1000003  0.31895114
    0.89516281   2    1000025    3
    0.078224492   2    1000022    3
    0.023968056   2    1000023    3
    0.0026446456   2   -1000024    4

DECAY 2000003  2.0027512
    0.92783543   2    1000025    3
    0.037817826   2    1000021    3
    0.031376953   2    1000022    3
    0.0025358349   2    1000023    3
    0.00043333863   2   -1000024    4

DECAY 1000005  22.073299
    0.6617136   2    1000021    5
    0.11978991   2   -1000024    6
    0.095774638   2    1000025    5
    0.06309272   2    1000022    5
    0.059625387   2    1000023    5

DECAY 2000005  163.77931
    0.55618525   2   -1000024    6
    0.31634068   2    1000021    5
    0.07024563   2   -1000037    6
    0.034993038   2    1000035    5
    0.0093643694   2    1000022    5
    0.0091442836   2    1000023    5
    0.003606449   2    1000025    5

DECAY 2000002  1.2053229
    0.9530875   2    1000025    2
    0.043697187   2    1000022    2
    0.0032153066   2    1000023    2

DECAY 1000002  0.34585354
    0.91431704   2    1000025    2
    0.076857002   2    1000024    1
    0.0061643421   2    1000022    2
    0.0026616175   2    1000023    2

DECAY 2000004  1.2058448
    0.95267691   2    1000025    4
    0.043778706   2    1000022    4
    0.0033234346   2    1000023    4
    0.00022094744   2    1000024    3

DECAY 1000004  0.34726664
    0.91065199   2    1000025    4
    0.078192093   2    1000024    3
    0.0072850777   2    1000022    4
    0.0038707459   2    1000023    4

DECAY 1000006  209.77985
    0.26893777   2    1000024    5
    0.24474392   2    1000021    6
    0.21955714   2    1000023    6
    0.21585131   2    1000022    6
    0.022370309   2    1000025    6
    0.017819102   2    1000037    5
    0.0089532991   2    1000035    6
    0.0016339267   3    1000022    24    5
    0.00012743291   2    1000021    4

DECAY 2000006  193.58714
    0.24574555   2    1000021    6
    0.23429871   2    1000023    6
    0.20971736   2    1000022    6
    0.19321955   2    1000024    5
    0.052116637   2    1000025    6
    0.040499396   2    1000037    5
    0.020322433   2    1000035    6
    0.0038405212   2    1000006    23
    0.000218848   2    1000006    25

DECAY 1000024  1.2594971e-08
    0.36751387   3    1000022   -1    2
    0.30310371   3    1000022   -3    4
    0.12250489   3    1000022   -11    12
    0.12233663   3    1000022   -13    14
    0.084540906   3    1000022   -15    16

DECAY 1000037  64.812054
    0.09956538   2    1000024    25
    0.094072152   2    1000023    24
    0.093630689   2    1000024    23
    0.092781316   2    1000004   -3
    0.092781148   2    1000002   -1
    0.092575497   2   -1000001    2
    0.092575464   2   -1000003    4
    0.087648264   2    1000022    24
    0.058408888   2    1000024    36
    0.058308372   2    1000024    35
    0.057869627   2    37    1000022
    0.052881481   2    37    1000023
    0.0086768863   3    1000024    6   -6
    0.0059353654   3    1000023   -5    6
    0.0056979256   2    1000025    24
    0.0051371854   3    1000022   -5    6
    0.0010953005   2    37    1000025
    0.00032344353   3    1000025   -5    6

DECAY 1000022 -1


DECAY 1000023  2.3716678e-07
    0.41619016   2    1000022    22
    0.147201   3    1000022    12   -12
    0.11007347   3    1000022    1   -1
    0.10992494   3    1000022    3   -3
    0.085851103   3    1000022    2   -2
    0.064991499   3    1000022    4   -4
    0.024837856   3    1000022    11   -11
    0.02478513   3    1000022    13   -13
    0.013546271   3    1000022    15   -15
    0.00059070282   3    1000022    5   -5
    0.00051747754   3    1000024    1   -2
    0.00051747754   3   -1000024   -1    2
    0.00017249704   3    1000024    11   -12
    0.00017249704   3   -1000024   -11    12
    0.00017090823   3    1000024    13   -14
    0.00017090823   3   -1000024   -13    14
    0.00013436176   3    1000024    3   -4
    0.00013436176   3   -1000024   -3    4

DECAY 1000025  0.69398643
    0.31886812   2    1000023    23
    0.18193492   2    1000023    25
    0.17653005   2    1000024   -24
    0.17653005   2   -1000024    24
    0.12439381   2    1000022    25
    0.021693275   2    1000022    23

DECAY 1000035  66.114073
    0.091916435   2    1000024   -24
    0.091916435   2   -1000024    24
    0.069882644   2    1000023    25
    0.057146981   2    37   -1000024
    0.057146981   2   -37    1000024
    0.045679286   2    1000023    23
    0.045482288   2    1000002   -2
    0.045482288   2   -1000002    2
    0.045482262   2    1000004   -4
    0.045482262   2   -1000004    4
    0.04541739   2    1000022    25
    0.045336505   2    1000003   -3
    0.045336505   2   -1000003    3
    0.045336414   2    1000001   -1
    0.045336414   2   -1000001    1
    0.043838602   2    1000022    23
    0.039352819   2    1000022    35
    0.027837073   2    1000023    35
    0.024342634   2    1000023    36
    0.017237027   2    1000022    36
    0.0050232725   3    1000024    5   -6
    0.0050232725   3   -1000024   -5    6
    0.0041793039   3    1000023    6   -6
    0.0036990851   3    1000022    6   -6
    0.0034702141   2    1000025    25
    0.0022825313   2    1000025    23
    0.00086256682   2    1000025    35
    0.00023071128   3    1000025    6   -6
    0.00020315239   2    1000025    36

DECAY 1000021  305.19143
    0.14939461   2    2000004   -4
    0.14939461   2   -2000004    4
    0.14939457   2    2000002   -2
    0.14939457   2   -2000002    2
    0.050238742   2    1000004   -4
    0.050238742   2   -1000004    4
    0.050238714   2    1000002   -2
    0.050238714   2   -1000002    2
    0.0501446   2    1000003   -3
    0.0501446   2   -1000003    3
    0.050144546   2    1000001   -1
    0.050144546   2   -1000001    1
    0.00020032051   3    1000024    5   -6
    0.00020032051   3   -1000024   -5    6
    0.00018566934   3    1000023    6   -6
    0.00017344615   3    1000022    6   -6

DECAY 25  0.0035821893
    0.61785519   2   -5    5
    0.18332149   2   -24    24
    0.072941787   2    21    21
    0.07075991   2   -15    15
    0.030091131   2   -4    4
    0.020986006   2    23    23
    0.0023134951   2    22    22
    0.0012527485   2    22    23
    0.00024544815   2   -13    13
    0.00023199691   2   -3    3
    6.4144786e-07   2   -1    1
    1.5507642e-07   2   -2    2
    5.5179842e-09   2   -11    11

DECAY 35  4.9292967
    0.52509135   2   -5    5
    0.14330144   2    1000022    1000025
    0.12962197   2    1000023    1000025
    0.092464037   2   -6    6
    0.087445492   2   -15    15
    0.01194384   2    1000022    1000022
    0.0029907773   2   -1000024    1000024
    0.002705118   2    1000025    1000025
    0.0017531108   2    1000023    1000023
    0.00092163072   2    1000022    1000023
    0.00076566263   2    25    25
    0.00030430869   2   -13    13
    0.00020056443   2   -3    3
    0.00011684892   2    23    23
    0.00010943897   2   -1000002    1000002
    0.00010937852   2   -1000004    1000004
    8.9150567e-05   2   -24    24
    3.5311674e-05   2   -1000015    1000015
    2.8586823e-05   2    21    21
    1.347836e-06   2   -4    4
    5.5450749e-07   2   -1    1
    7.203685e-08   2    22    22
    6.8359979e-09   2   -11    11
    4.8447091e-09   2    22    23
    6.9494927e-12   2   -2    2

DECAY 36  4.8628223
    0.52082946   2   -5    5
    0.15049136   2    1000023    1000025
    0.12717672   2    1000022    1000025
    0.09390093   2   -6    6
    0.086733608   2   -15    15
    0.009585936   2    1000022    1000022
    0.0033946539   2   -1000024    1000024
    0.002833168   2    1000023    1000023
    0.0022091035   2    1000022    1000023
    0.002033773   2    1000025    1000025
    0.00030182997   2   -13    13
    0.00019893171   2   -3    3
    0.00015691108   2    23    25
    0.00015145408   2    21    21
    1.2971893e-06   2   -4    4
    5.4999347e-07   2   -1    1
    2.4160994e-07   2    22    22
    6.0753296e-08   2    22    23
    6.7803048e-09   2   -11    11
    6.6889343e-12   2   -2    2
    1.2279602e-34   2    25    25

DECAY 37  4.7213644
    0.60712867   2   -5    6
    0.2991559   2    1000024    1000025
    0.087687385   2   -15    16
    0.0043654168   2    1000022    1000024
    0.00075465578   2   -5    4
    0.00031000681   2   -13    14
    0.00018388476   2   -3    4
    0.00016271948   2    24    25
    0.00014649823   2   -3    6
    8.3679884e-05   2    1000023    1000024
    8.4819706e-06   2   -3    2
    6.7070145e-06   2   -1    6
    5.3890118e-06   2   -5    2
    5.0651763e-07   2   -1    2
    8.5908584e-08   2   -1    4
    7.2510915e-09   2   -11    12
    1.7232688e-11   2    24    36
    1.466555e-11   2    24    35

DECAY 6  2.43
    1   2    5    24

DECAY 15 -1
