BLOCK SPINFO
   1   SPheno
   2   v4.0.5be

BLOCK SPHENOINFO
   1   2
   2   2

BLOCK MODSEL
   1   0

BLOCK MINPAR
   3    32.953666
   4    1

BLOCK EXTPAR
   0    1141.0699
   1   -1654.1257
   2    1032.9292
   3    3000
   11    2544.0748
   12   -892.57465
   13    141.41246
   23    495.66086
   25    31.921362
   26    2402.5425
   31    1140.7942
   32    1140.7942
   33    1245.6075
   34    1818.8326
   35    1818.8326
   36    739.07594
   41    5000
   42    5000
   43    1254.867
   44    5000
   45    5000
   46    1255.8619
   47    5000
   48    5000
   49    713.50516

BLOCK SMINPUTS
   1    127.90897
   2    1.1663787e-05
   3    0.1184
   4    91.1876
   5    4.18
   6    173.2
   7    1.777
   8    0
   11    0.00051099893
   12    0
   13    0.10565837
   14    0
   21    0.005
   22    0.0025
   23    0.095
   24    1.27

BLOCK GAUGE Q=  1141.0699
   1    0.35536298
   2    0.66519887
   3    1.219778

BLOCK YU Q=  1141.0699
   1   1    8.3884853e-06
   2   2    0.0042613505
   3   3    1.0133964

BLOCK YD Q=  1141.0699
   1   1    0.00053807796
   2   2    0.010223481
   3   3    0.53360472

BLOCK YE Q=  1141.0699
   1   1    9.3898538e-05
   2   2    0.01941524
   3   3    0.32653239

BLOCK AU Q=  1141.0699
   1   1    0
   2   2    0
   3   3    2544.0748

BLOCK AD Q=  1141.0699
   1   1    0
   2   2    0
   3   3   -892.57462

BLOCK AE Q=  1141.0699
   1   1    0
   2   2    0
   3   3    141.41246

BLOCK MSOFT Q=  1141.0699
   1   -1654.1257
   2    1032.9292
   3    3000
   21    5530015.2
   22   -196825.93
   31    1140.7942
   32    1140.7942
   33    1245.6075
   34    1818.8326
   35    1818.8326
   36    739.07594
   41    5000
   42    5000
   43    1254.867
   44    5000
   45    5000
   46    1255.8619
   47    5000
   48    5000
   49    713.50516

BLOCK MASS
   6    173.2
   23    91.1876
   24    80.429995
   15    1.777
   25    122.59535
   35    2401.7509
   36    2402.5425
   37    2403.837
   1000001    5012.7577
   2000001    5003.4942
   1000002    5012.3139
   2000002    5004.3626
   1000003    5012.7623
   2000003    5003.5007
   1000004    5012.3179
   2000004    5004.3639
   1000005    550.91336
   2000005    1175.5025
   1000006    986.75512
   2000006    1319.5173
   1000011    1150.7338
   2000011    1823.0229
   1000012    1147.6221
   1000013    1150.7312
   2000013    1823.0171
   1000014    1147.6194
   1000015    744.57545
   2000015    1254.0661
   1000016    1250.8273
   1000021    3165.7921
   1000022    497.33322
   1000023   -502.71029
   1000025    1080.3195
   1000035   -1655.5412
   1000024    498.55367
   1000037    1080.4253

BLOCK ALPHA
      -0.030474307

BLOCK HMIX Q=  1141.0699
   1    495.66086
   2    31.921362
   3    244.25502
   4    5772210.4

BLOCK STOPMIX
   1   1   -0.67684375
   1   2    0.73612671
   2   1   -0.73612671
   2   2   -0.67684375

BLOCK SBOTMIX
   1   1    0.029262155
   1   2    0.99957177
   2   1   -0.99957177
   2   2    0.029262155

BLOCK STAUMIX
   1   1    0.02826088
   1   2    0.99960058
   2   1   -0.99960058
   2   2    0.02826088

BLOCK NMIX
   1   1   -0.014940901
   1   2   -0.099343971
   1   3    0.70666132
   1   4   -0.70038369
   2   1   -0.026566781
   2   2   -0.034814512
   2   3   -0.70601667
   2   4   -0.70683988
   3   1    0.0016001248
   3   2   -0.99444359
   3   3   -0.045871143
   3   4    0.09473765
   4   1    0.9995341
   4   2   -0.00081834539
   4   3   -0.0081288207
   4   4   -0.029408117

BLOCK UMIX
   1   1   -0.064955942
   1   2    0.99788813
   2   1    0.99788813
   2   2    0.064955942

BLOCK VMIX
   1   1   -0.13413715
   1   2    0.99096278
   2   1    0.99096278
   2   2    0.13413715

BLOCK HIGGSBOUNDSINPUTHIGGSCOUPLINGSFERMIONS
       0, 1018.9733,3,36,15,15

BLOCK HIGGSBOUNDSINPUTHIGGSCOUPLINGSBOSONS
       0,4,36,21,21,23

BLOCK SPHENOLOWENERGY
   1    0.00035977237
   2    1.5845352e-06
   3    3.5181721e-05
   4    2.8948693e-15
   5    1.2366574e-10
   6    2.5900013e-08
   7    9.7065388e-14
   8    4.1466372e-09
   9    8.7992711e-07
   10    9.5465315e-05
   11    0.98612016
   12    0.54404308
   13    19.433517
   14    0
   15    0
   16    0.0021685515
   17    2.2817737e-15
   18    2.4759721e-11
   19    8.2805357e-11
   20    8.0213677e-15
   21    3.4294193e-10
   22    9.7130599e-08
   23    0
   24    0
   25    0
   26    0
   27    0
   28    0
   29    0
   30    0
   31    0
   39    8.6115648e-05
   40    0
   41    0
   42    0

BLOCK FWCOEF Q=  160
   305   4422   0   0   -0.18881911
   305   4422   0   2   -0.23391396
   305   4322   0   2   -0.00032756907
   305   6421   0   0   -0.095227835
   305   6421   0   2   -0.12243501
   305   6321   0   2   -0.00028519541
   3051111   4133   0   0    1.5823163
   3051111   4133   0   2    1.5839975
   3051111   4233   0   2    0.00011358027
   3051111   4137   0   0   -4.4050084
   3051111   4137   0   2   -4.3964199
   3051111   4237   0   2   -0.00089441123
   3051313   4133   0   0    1.5823163
   3051313   4133   0   2    1.583995
   3051313   4233   0   2    0.0001135796
   3051313   4137   0   0   -4.4050084
   3051313   4137   0   2   -4.3964223
   3051313   4237   0   2   -0.00089441233
   3051212   4137   0   0    1.5053501
   3051212   4137   0   2    1.5034826
   3051212   4237   0   2    0.00019535532
   3051414   4137   0   0    1.5053501
   3051414   4137   0   2    1.5034826
   3051414   4237   0   2    0.00019535538
   3051616   4137   0   0    1.5053501
   3051616   4137   0   2    1.5034826
   3051616   4237   0   2    0.00019537282

BLOCK IMFWCOEF Q=  160
   305   4422   0   0    3.8574393e-07
   305   4422   0   2    2.1795455e-05
   305   4322   0   2   -2.7641888e-06
   305   6421   0   0    3.3041519e-07
   305   6421   0   2   -9.6174926e-07
   305   6321   0   2   -1.1445377e-06
   3051111   4133   0   2   -9.4511578e-07
   3051111   4233   0   2    2.662445e-06
   3051111   4137   0   2    7.8054869e-06
   3051111   4237   0   2   -2.0989753e-05
   3051313   4133   0   2   -9.4511055e-07
   3051313   4233   0   2    2.6624385e-06
   3051313   4137   0   2    7.8055112e-06
   3051313   4237   0   2   -2.0989779e-05
   3051212   4137   0   2   -1.556015e-06
   3051212   4237   0   2    4.584526e-06
   3051414   4137   0   2   -1.5560151e-06
   3051414   4237   0   2    4.584526e-06
   3051616   4137   0   2   -1.5558278e-06
   3051616   4237   0   2    4.5845252e-06

DECAY 23  2.4952


DECAY 24  2.085


DECAY 1000011  0.28668934
    0.49378451   2   -1000037    12
    0.24548338   2    1000025    11
    0.1345811   2    1000022    11
    0.098369992   2   -1000024    12
    0.027781009   2    1000023    11

DECAY 2000011  0.28850897
    0.97476187   2    1000035    11
    0.019130692   2    1000023    11
    0.0060722455   2    1000022    11

DECAY 1000013  0.29233975
    0.48420686   2   -1000037    14
    0.24072383   2    1000025    13
    0.14172046   2    1000022    13
    0.096468253   2   -1000024    14
    0.036880587   2    1000023    13

DECAY 2000013  0.31214485
    0.90089558   2    1000035    13
    0.03733316   2   -1000024    14
    0.036317696   2    1000023    13
    0.024349554   2    1000022    13
    0.00095580259   2    1000013    25

DECAY 1000015  0.95968705
    0.50208068   2   -1000024    16
    0.25503279   2    1000022    15
    0.24288653   2    1000023    15

DECAY 2000015  3.3042191
    0.29602031   2    1000022    15
    0.28628063   2    1000023    15
    0.22125442   2   -1000037    16
    0.1099733   2    1000025    15
    0.041761676   2    1000015    23
    0.038528417   2    1000015    25
    0.0061812436   2   -1000024    16

DECAY 1000012  0.34191819
    0.37495117   2    1000037    11
    0.34990183   2    1000024    11
    0.18969769   2    1000025    12
    0.081346434   2    1000022    12
    0.0041028804   2    1000023    12

DECAY 1000014  0.34753921
    0.36886199   2    1000037    13
    0.36045561   2    1000024    13
    0.1866155   2    1000025    14
    0.080030395   2    1000022    14
    0.0040365029   2    1000023    14

DECAY 1000016  3.3672835
    0.59634524   2    1000024    15
    0.20734612   2    1000037    15
    0.10453594   2    1000025    16
    0.081610296   2    1000015    24
    0.0096735774   2    1000022    16
    0.00048883436   2    1000023    16

DECAY 2000001  144.23881
    0.98463801   2    1000021    1
    0.015343917   2    1000035    1

DECAY 1000001  203.75701
    0.701759   2    1000021    1
    0.19608441   2   -1000037    2
    0.097424187   2    1000025    1
    0.0027480694   2    1000035    1
    0.00099245136   2    1000022    1
    0.00089577825   2   -1000024    2

DECAY 2000003  144.25982
    0.98449926   2    1000021    3
    0.015341716   2    1000035    3

DECAY 1000003  203.76951
    0.70171827   2    1000021    3
    0.19607275   2   -1000037    4
    0.097418417   2    1000025    3
    0.0027479074   2    1000035    3
    0.0010173627   2    1000022    3
    0.00090426953   2   -1000024    4
    0.00012102154   2    1000023    3

DECAY 1000005  0.096351502
    0.55368521   2    1000022    5
    0.44631479   2    1000023    5

DECAY 2000005  29.667129
    0.49610369   2   -1000024    6
    0.32460202   2    1000006   -24
    0.076087971   2    1000022    5
    0.074951177   2    1000023    5
    0.01675234   2    1000005    25
    0.007301222   2    1000005    23
    0.0042015819   2    1000025    5

DECAY 2000002  150.97873
    0.94128149   2    1000021    2
    0.058650945   2    1000035    2

DECAY 1000002  203.75168
    0.7015503   2    1000021    2
    0.1933568   2    1000037    1
    0.09730484   2    1000025    2
    0.0038198641   2    1000024    1
    0.0026977065   2    1000035    2
    0.0011045506   2    1000022    2
    0.00016593948   2    1000023    2

DECAY 2000004  150.98234
    0.94125944   2    1000021    4
    0.058649552   2    1000035    4

DECAY 1000004  203.76406
    0.70150946   2    1000021    4
    0.19334544   2    1000037    3
    0.0972991   2    1000025    4
    0.0038694195   2    1000024    3
    0.0026975531   2    1000035    4
    0.0011087503   2    1000022    4
    0.0001702775   2    1000023    4

DECAY 1000006  18.368645
    0.35184338   2    1000024    5
    0.33012194   2    1000023    6
    0.31342551   2    1000022    6
    0.0043039763   2    1000005    24
    0.00018645276   2    1000022    4

DECAY 2000006  50.916592
    0.2895846   2    1000006    23
    0.26807187   2    1000024    5
    0.17091768   2    1000022    6
    0.1645233   2    1000023    6
    0.083259559   2    2000005    24
    0.0087120783   2    1000037    5
    0.0078656442   2    1000005    24
    0.0040134461   2    1000025    6
    0.0030518123   2    1000006    25

DECAY 1000024  2.1915752e-12
    0.61292363   2    1000022    211
    0.1971111   3    1000022   -11    12
    0.18996527   3    1000022   -13    14

DECAY 1000037  9.3860873
    0.24969493   2    1000023    24
    0.2401196   2    1000022    24
    0.23760024   2    1000024    23
    0.23540126   2    1000024    25
    0.028114558   2    1000006   -5
    0.0032103897   3    1000022   -5    6
    0.003058676   3    1000023   -5    6
    0.0021594659   3    1000024    6   -6
    0.00054543561   2   -1000005    6

DECAY 1000022 -1


DECAY 1000023  5.3572049e-08
    0.62823695   2    1000022    22
    0.057892382   3    1000022    12   -12
    0.043289912   3    1000022    1   -1
    0.043132769   3    1000022    3   -3
    0.033762349   3    1000022    2   -2
    0.032176238   3    1000024    1   -2
    0.032176238   3   -1000024   -1    2
    0.020537632   3    1000024    3   -4
    0.020537632   3   -1000024   -3    4
    0.015492751   3    1000022    4   -4
    0.01072543   3    1000024    11   -12
    0.01072543   3   -1000024   -11    12
    0.010690993   3    1000024    13   -14
    0.010690993   3   -1000024   -13    14
    0.0097686214   3    1000022    11   -11
    0.009713006   3    1000022    13   -13
    0.0044677741   3    1000024    15   -16
    0.0044677741   3   -1000024   -15    16
    0.0015151254   3    1000022    15   -15

DECAY 1000025  10.689285
    0.21210953   2    1000024   -24
    0.21210953   2   -1000024    24
    0.19648   2    1000023    23
    0.18226297   2    1000022    25
    0.16745581   2    1000023    25
    0.023317661   2    1000022    23
    0.0021252974   3    1000024    5   -6
    0.0021252974   3   -1000024   -5    6
    0.00074358509   3    1000022    6   -6
    0.00067776468   3    1000023    6   -6
    0.00019221977   2    1000005   -5
    0.00019221977   2   -1000005    5

DECAY 1000035  18.939892
    0.13950253   2    1000015   -15
    0.13950253   2   -1000015    15
    0.073002428   2    1000006   -6
    0.073002428   2   -1000006    6
    0.057695303   2    1000005   -5
    0.057695303   2   -1000005    5
    0.056704532   2    1000024   -24
    0.056704532   2   -1000024    24
    0.04421574   2    1000022    25
    0.042860815   2    1000022    23
    0.039540655   2    1000023    25
    0.015929766   2    2000006   -6
    0.015929766   2   -2000006    6
    0.014846773   2    1000014   -14
    0.014846773   2   -1000014    14
    0.014846645   2    1000012   -12
    0.014846645   2   -1000012    12
    0.014608173   2    1000013   -13
    0.014608173   2   -1000013    13
    0.01460804   2    1000011   -11
    0.01460804   2   -1000011    11
    0.013898229   2    1000023    23
    0.010133048   2    1000016   -16
    0.010133048   2   -1000016    16
    0.0099702858   2    2000015   -15
    0.0099702858   2   -2000015    15
    0.0045907355   2    2000005   -5
    0.0045907355   2   -2000005    5
    0.0020208396   3    1000024    5   -6
    0.0020208396   3   -1000024   -5    6
    0.0009599392   3    1000022    6   -6
    0.00088568679   3    1000023    6   -6
    0.00016840043   2    1000037   -24
    0.00016840043   2   -1000037    24
    0.00015938772   2    1000025    23
    0.00014715276   2    1000025    25

DECAY 1000021  310.00263
    0.14210171   2    1000005   -5
    0.14210171   2   -1000005    5
    0.13792776   2    1000006   -6
    0.13792776   2   -1000006    6
    0.11235638   2    2000005   -5
    0.11235638   2   -2000005    5
    0.089481139   2    2000006   -6
    0.089481139   2   -2000006    6
    0.01677862   2    1000006   -4
    0.01677862   2   -1000006    4
    0.00073989213   3    1000037    5   -6
    0.00073989213   3   -1000037   -5    6
    0.00044528229   3    1000024    5   -6
    0.00044528229   3   -1000024   -5    6
    0.00020144359   3    1000025    6   -6

DECAY 25  0.0035965598
    0.61100135   2   -5    5
    0.19020355   2   -24    24
    0.072244561   2    21    21
    0.070331479   2   -15    15
    0.030164449   2   -4    4
    0.021937065   2    23    23
    0.0023472171   2    22    22
    0.0012953353   2    22    23
    0.00024397162   2   -13    13
    0.00023023033   2   -3    3
    6.3656425e-07   2   -1    1
    1.5545261e-07   2   -2    2
    5.4847852e-09   2   -11    11

DECAY 35  45.557194
    0.41969553   2   -5    5
    0.12512498   2   -15    15
    0.12383017   2   -1000024    1000037
    0.12383017   2   -1000037    1000024
    0.08020388   2    1000023    1000025
    0.0440007   2    1000022    1000025
    0.042442074   2   -1000006    1000006
    0.0091864511   2   -2000005    1000005
    0.0091864511   2   -1000005    2000005
    0.0087155552   2    1000022    1000035
    0.0064425476   2   -1000024    1000024
    0.0025111082   2    1000023    1000035
    0.0015071107   2    1000022    1000022
    0.00094717814   2   -6    6
    0.00062817336   2    1000022    1000023
    0.00043844469   2   -13    13
    0.00023642675   2   -3    3
    0.00023343575   2   -1000037    1000037
    0.00013388074   2   -2000006    1000006
    0.00013388074   2   -1000006    2000006
    0.00013306833   2   -2000015    1000015
    0.00013306833   2   -1000015    2000015
    0.00011742232   2    1000025    1000025
    8.60062e-05   2    1000023    1000023
    7.0966027e-05   2   -1000005    1000005
    1.8319983e-05   2    21    21
    9.1810166e-06   2    25    25
    1.3116432e-06   2    23    23
    6.536767e-07   2   -1    1
    5.8457842e-07   2   -1000015    1000015
    5.3612193e-07   2   -24    24
    8.3111801e-08   2    22    23
    7.0318503e-08   2   -1000011    1000011
    6.9904552e-08   2   -1000013    1000013
    1.9861734e-08   2   -4    4
    9.8478805e-09   2   -11    11
    2.1515429e-09   2    22    22
    1.02388e-13   2   -2    2

DECAY 36  44.185271
    0.41588808   2   -5    5
    0.12626213   2   -1000024    1000037
    0.12626213   2   -1000037    1000024
    0.12413396   2   -15    15
    0.081632487   2    1000022    1000025
    0.045588895   2    1000023    1000025
    0.017457374   2   -2000006    1000006
    0.017457374   2   -1000006    2000006
    0.0095325666   2   -2000005    1000005
    0.0095325666   2   -1000005    2000005
    0.0089434534   2    1000023    1000035
    0.0084770132   2   -1000024    1000024
    0.0026959728   2    1000022    1000035
    0.0021033186   2    1000022    1000022
    0.0012417441   2   -1000037    1000037
    0.00066553309   2   -6    6
    0.00062328816   2    1000025    1000025
    0.00044404577   2    1000022    1000023
    0.00043496777   2   -13    13
    0.00023454261   2   -3    3
    0.00013763193   2   -2000015    1000015
    0.00013763193   2   -1000015    2000015
    9.4744364e-05   2    1000023    1000023
    1.5518747e-05   2    21    21
    1.9371334e-06   2    23    25
    6.4846846e-07   2   -1    1
    2.7462091e-07   2    22    23
    1.568983e-07   2    22    22
    1.7136492e-08   2   -4    4
    9.7698061e-09   2   -11    11
    8.8341854e-14   2   -2    2
    7.4744899e-37   2    25    25

DECAY 37  44.897351
    0.44371321   2   -5    6
    0.12984639   2    1000022    1000037
    0.12721306   2    1000024    1000025
    0.12588792   2    1000023    1000037
    0.11627512   2   -15    16
    0.023969564   2   -1000005    1000006
    0.011415195   2    1000024    1000035
    0.0090338498   2   -2000005    1000006
    0.0080590193   2   -1000005    2000006
    0.002671774   2    1000023    1000024
    0.00065595756   2   -5    4
    0.00041107424   2   -13    14
    0.00033505658   2    1000022    1000024
    0.00027129363   2   -1000015    1000016
    0.00022012703   2   -3    4
    1.028258e-05   2   -3    2
    4.6842147e-06   2   -5    2
    3.147697e-06   2   -3    6
    1.9113736e-06   2    24    25
    6.1087846e-07   2   -1    2
    2.8453813e-07   2   -1000011    1000012
    2.8393922e-07   2   -1000013    1000014
    1.2951534e-07   2   -1    6
    2.9643218e-08   2   -1    4
    9.6150692e-09   2   -11    12
    1.4894682e-09   2    1000025    1000037
    1.1972973e-12   2    24    35
    1.1019987e-13   2    24    36

DECAY 6  2.43
    1   2    5    24

DECAY 15 -1
