BLOCK SPINFO
   1   SPheno
   2   v4.0.5be

BLOCK SPHENOINFO
   1   2
   2   2

BLOCK MODSEL
   1   0

BLOCK MINPAR
   3    9.1156379
   4   -1

BLOCK EXTPAR
   0    1774.4292
   1    89.775631
   2   -1770.9159
   3    3000
   11   -2922.1409
   12    1818.3286
   13    1712.529
   23   -416.18498
   25    8.7442078
   26    2369.9147
   31    1297.6326
   32    1297.6326
   33    155.94226
   34    155.93049
   35    155.93049
   36    1807.3786
   41    5000
   42    5000
   43    1751.1162
   44    5000
   45    5000
   46    1779.6212
   47    5000
   48    5000
   49    887.40103

BLOCK SMINPUTS
   1    127.90897
   2    1.1663787e-05
   3    0.1184
   4    91.1876
   5    4.18
   6    173.2
   7    1.777
   8    0
   11    0.00051099893
   12    0
   13    0.10565837
   14    0
   21    0.005
   22    0.0025
   23    0.095
   24    1.27

BLOCK GAUGE Q=  1774.4292
   1    0.35536298
   2    0.66519887
   3    1.219778

BLOCK YU Q=  1774.4292
   1   1    8.4390217e-06
   2   2    0.004287023
   3   3    1.0195016

BLOCK YD Q=  1774.4292
   1   1    0.0001482835
   2   2    0.0028173864
   3   3    0.14705076

BLOCK YE Q=  1774.4292
   1   1    2.5876555e-05
   2   2    0.0053504508
   3   3    0.089985781

BLOCK AU Q=  1774.4292
   1   1    0
   2   2    0
   3   3   -2922.1408

BLOCK AD Q=  1774.4292
   1   1    0
   2   2    0
   3   3    1818.3286

BLOCK AE Q=  1774.4292
   1   1    0
   2   2    0
   3   3    1712.529

BLOCK MSOFT Q=  1774.4292
   1    89.775631
   2   -1770.9159
   3    3000
   21    5344002.8
   22   -60608.151
   31    1297.6326
   32    1297.6326
   33    155.94226
   34    155.93049
   35    155.93049
   36    1807.3786
   41    5000
   42    5000
   43    1751.1162
   44    5000
   45    5000
   46    1779.6212
   47    5000
   48    5000
   49    887.40103

BLOCK MASS
   6    173.2
   23    91.1876
   24    80.429995
   15    1.777
   25    120.62955
   35    2369.8598
   36    2369.9147
   37    2371.4908
   1000001    5036.9125
   2000001    5028.4505
   1000002    5036.4747
   2000002    5029.4323
   1000003    5036.9129
   2000003    5028.4506
   1000004    5036.4751
   2000004    5029.4328
   1000005    921.3574
   2000005    1788.0173
   1000006    1664.76
   2000006    1891.323
   1000011    1313.9524
   2000011    176.64236
   1000012    1311.207
   1000013    1313.9519
   2000013    176.63767
   1000014    1311.2065
   1000015    221.37551
   2000015    1810.3648
   1000016    206.88942
   1000021    3207.3223
   1000022    89.129318
   1000023   -423.34918
   1000025    426.67964
   1000035   -1813.8561
   1000024    422.01432
   1000037    1814.12

BLOCK ALPHA
      -0.10971254

BLOCK HMIX Q=  1774.4292
   1   -416.18498
   2    8.7442078
   3    243.84097
   4    5616495.8

BLOCK STOPMIX
   1   1    0.68350206
   1   2    0.72994859
   2   1   -0.72994859
   2   2    0.68350206

BLOCK SBOTMIX
   1   1   -0.0057042192
   1   2    0.99998373
   2   1   -0.99998373
   2   2   -0.0057042192

BLOCK STAUMIX
   1   1   -0.99999569
   1   2    0.0029363291
   2   1   -0.0029363291
   2   2   -0.99999569

BLOCK NMIX
   1   1    0.99430624
   1   2   -4.3374252e-05
   1   3   -0.10601476
   1   4   -0.010768998
   2   1    0.067521442
   2   2    0.044343053
   2   3    0.70484935
   2   4   -0.70474247
   3   1    0.082429895
   3   2   -0.022140282
   3   3    0.70121329
   3   4    0.70782417
   4   1    0.001127344
   4   2   -0.99877099
   4   3    0.015754072
   4   4   -0.046979129

BLOCK UMIX
   1   1   -0.022287743
   1   2   -0.9997516
   2   1   -0.9997516
   2   2    0.022287743

BLOCK VMIX
   1   1    0.066500721
   1   2    0.99778638
   2   1    0.99778638
   2   2   -0.066500721

BLOCK HIGGSBOUNDSINPUTHIGGSCOUPLINGSFERMIONS
       0, 76.461171,3,36,15,15

BLOCK HIGGSBOUNDSINPUTHIGGSCOUPLINGSBOSONS
       0,4,36,21,21,23

BLOCK SPHENOLOWENERGY
   1    0.00033787424
   2    1.587998e-06
   3    3.5238466e-05
   4    2.4707645e-15
   5    1.0554827e-10
   6    2.2096879e-08
   7    8.3354924e-14
   8    3.5609202e-09
   9    7.5534896e-07
   10    9.6718663e-05
   11    0.99906676
   12    0.543011
   13    19.401823
   14    0
   15    0
   16    0.0021617818
   17    2.2817039e-15
   18    2.4799264e-11
   19    8.2897498e-11
   20   -1.5099263e-16
   21   -6.4693336e-12
   22    7.1513942e-09
   23    0
   24    0
   25    0
   26    0
   27    0
   28    0
   29    0
   30    0
   31    0
   39   -3.3949872e-05
   40    0
   41    0
   42    0

BLOCK FWCOEF Q=  160
   305   4422   0   0   -0.18881911
   305   4422   0   2   -0.20823176
   305   4322   0   2   -0.00025393466
   305   6421   0   0   -0.095227835
   305   6421   0   2   -0.11163181
   305   6321   0   2   -0.00025744855
   3051111   4133   0   0    1.5976862
   3051111   4133   0   2    1.5987761
   3051111   4233   0   2    1.227015e-05
   3051111   4137   0   0   -4.4203783
   3051111   4137   0   2   -4.4173158
   3051111   4237   0   2   -9.4565977e-05
   3051313   4133   0   0    1.5976862
   3051313   4133   0   2    1.5987759
   3051313   4233   0   2    1.2270134e-05
   3051313   4137   0   0   -4.4203783
   3051313   4137   0   2   -4.4173159
   3051313   4237   0   2   -9.4565988e-05
   3051212   4137   0   0    1.5053501
   3051212   4137   0   2    1.5046878
   3051212   4237   0   2    2.0549024e-05
   3051414   4137   0   0    1.5053501
   3051414   4137   0   2    1.5046878
   3051414   4237   0   2    2.0549024e-05
   3051616   4137   0   0    1.5053501
   3051616   4137   0   2    1.5046871
   3051616   4237   0   2    2.0545319e-05

BLOCK IMFWCOEF Q=  160
   305   4422   0   0    3.8581303e-07
   305   4422   0   2    2.5009362e-06
   305   4322   0   2   -1.2779112e-06
   305   6421   0   0    3.3047438e-07
   305   6421   0   2    5.1548192e-06
   305   6321   0   2   -4.2665289e-07
   3051111   4133   0   2   -1.4173577e-06
   3051111   4233   0   2    2.7157266e-07
   3051111   4137   0   2    1.1980449e-05
   3051111   4237   0   2   -2.0941149e-06
   3051313   4133   0   2   -1.4173555e-06
   3051313   4233   0   2    2.7157242e-07
   3051313   4137   0   2    1.1980451e-05
   3051313   4237   0   2   -2.0941151e-06
   3051212   4137   0   2   -2.5295348e-06
   3051212   4237   0   2    4.5519321e-07
   3051414   4137   0   2   -2.5295348e-06
   3051414   4237   0   2    4.5519321e-07
   3051616   4137   0   2   -2.542796e-06
   3051616   4237   0   2    4.5512508e-07

DECAY 23  2.4952


DECAY 24  2.085


DECAY 2000011  0.48755451
    1   2    1000022    11

DECAY 1000011  1.6534213
    0.97769668   2    1000022    11
    0.018166341   2    1000023    11
    0.0027950856   2   -1000024    12
    0.001341896   2    1000025    11

DECAY 2000013  0.4875248
    1   2    1000022    13

DECAY 1000013  1.6540585
    0.97732467   2    1000022    13
    0.018340061   2    1000023    13
    0.0027940074   2   -1000024    14
    0.0015194433   2    1000025    13

DECAY 1000015  0.19315122
    0.99999436   2    1000022    15

DECAY 2000015  9.6280118
    0.92981897   2    1000022    15
    0.027048127   2   -1000024    16
    0.01904114   2    1000025    15
    0.017285184   2    1000023    15
    0.0034540841   2    1000016   -24
    0.0017140083   2    1000015    23
    0.001638482   2    1000015    25

DECAY 1000012  1.6751708
    0.96326375   2    1000022    12
    0.024485724   2    1000024    11
    0.012061385   2    1000025    12
    0.0001891402   2    1000023    12

DECAY 1000014  1.6757693
    0.96291934   2    1000022    14
    0.024834518   2    1000024    13
    0.012057071   2    1000025    14
    0.00018907254   2    1000023    14

DECAY 1000016  0.17044163
    1   2    1000022    16

DECAY 2000001  142.4573
    0.98030882   2    1000021    1
    0.019470578   2    1000022    1
    0.00013198635   2    1000025    1

DECAY 1000001  191.62565
    0.73336792   2    1000021    1
    0.17516496   2   -1000037    2
    0.087453481   2    1000035    1
    0.0036265513   2    1000022    1
    0.00015460196   2    1000025    1
    0.00011915158   2    1000023    1
    0.00011333326   2   -1000024    2

DECAY 2000003  142.45888
    0.98029808   2    1000021    3
    0.019470425   2    1000022    3
    0.00013467853   2    1000025    3

DECAY 1000003  191.62829
    0.73335802   2    1000021    3
    0.1751626   2   -1000037    4
    0.087452286   2    1000035    3
    0.0036265482   2    1000022    3
    0.00015660574   2    1000025    3
    0.00012276272   2   -1000024    4
    0.00012117767   2    1000023    3

DECAY 1000005  0.966407
    0.52182712   2    1000022    5
    0.22389393   2   -1000024    6
    0.12821842   2    1000023    5
    0.12606053   2    1000025    5

DECAY 2000005  34.963195
    0.91797109   2   -1000024    6
    0.053294726   2    1000006   -24
    0.0099473473   2    1000023    5
    0.0099208203   2    1000025    5
    0.0072273784   2    1000022    5
    0.00093466703   2    1000005    25
    0.00070396635   2    1000005    23

DECAY 2000002  150.97702
    0.92566559   2    1000021    2
    0.073501737   2    1000022    2
    0.00049822505   2    1000025    2
    0.00033437778   2    1000023    2

DECAY 1000002  191.61693
    0.73316368   2    1000021    2
    0.17446073   2    1000037    1
    0.087375055   2    1000035    2
    0.0036228491   2    1000022    2
    0.001008936   2    1000024    1
    0.00036239689   2    1000023    2

DECAY 2000004  150.98064
    0.92564338   2    1000021    4
    0.073499974   2    1000022    4
    0.00050423304   2    1000025    4
    0.0003403293   2    1000023    4

DECAY 1000004  191.6195
    0.73315372   2    1000021    4
    0.17445841   2    1000037    3
    0.087373872   2    1000035    4
    0.0036228012   2    1000022    4
    0.0010130007   2    1000024    3
    0.00036710165   2    1000023    4

DECAY 1000006  44.099708
    0.34040987   2    1000024    5
    0.31053454   2    1000023    6
    0.30055713   2    1000025    6
    0.047852412   2    1000022    6
    0.00035437632   2    1000005    24
    0.00012573406   3    1000022    24    5
    0.00011952837   3   -1000015    16    5

DECAY 2000006  63.114925
    0.29899862   2    1000025    6
    0.29105313   2    1000024    5
    0.28628883   2    1000023    6
    0.079487445   2    1000006    23
    0.030729787   2    1000022    6
    0.011514933   2    2000005    24
    0.00073122618   2    1000037    5
    0.00064151201   2    1000006    25
    0.00055452035   2    1000005    24

DECAY 1000024  0.27495458
    0.90718525   2    1000022    24
    0.08932527   2    1000016   -15
    0.0018264485   2   -1000015    16
    0.0013657696   3    1000022   -5    6
    0.00029719254   2   -2000013    14

DECAY 1000037  40.530483
    0.1910859   2   -1000015    16
    0.19106902   2    1000016   -15
    0.10596684   2    1000024    25
    0.10416438   2    1000023    24
    0.10364027   2    1000024    23
    0.10344525   2    1000025    24
    0.044737923   2    1000014   -13
    0.044737852   2    1000012   -11
    0.044503372   2   -1000013    14
    0.044503305   2   -1000011    12
    0.0084240055   2    1000006   -5
    0.0059182794   3    1000024    6   -6
    0.0040611433   3    1000025   -5    6
    0.0032111193   3    1000023   -5    6
    0.00029348547   2    1000022    24
    0.00018427901   3    1000024    5   -5

DECAY 1000022 -1


DECAY 1000023  0.38884149
    0.4903375   2    1000022    25
    0.41348122   2    1000022    23
    0.030867947   2    1000015   -15
    0.030867947   2   -1000015    15
    0.0086127201   2    2000013   -13
    0.0086127201   2   -2000013    13
    0.0085063226   2    2000011   -11
    0.0085063226   2   -2000011    11

DECAY 1000025  0.27649965
    0.45187813   2    1000022    25
    0.39148296   2    1000022    23
    0.033292423   2    1000015   -15
    0.033292423   2   -1000015    15
    0.018237082   2    2000013   -13
    0.018237082   2   -2000013    13
    0.018086377   2    2000011   -11
    0.018086377   2   -2000011    11
    0.0087011953   2    1000016   -16
    0.0087011953   2   -1000016    16

DECAY 1000035  41.569783
    0.1019257   2    1000024   -24
    0.1019257   2   -1000024    24
    0.093428497   2    1000016   -16
    0.093428497   2   -1000016    16
    0.092847142   2    1000015   -15
    0.092847142   2   -1000015    15
    0.082670616   2    1000023    25
    0.081119375   2    1000025    23
    0.053318858   2    1000025    25
    0.021862033   2    1000014   -14
    0.021862033   2   -1000014    14
    0.021861997   2    1000012   -12
    0.021861997   2   -1000012    12
    0.021609696   2    1000013   -13
    0.021609696   2   -1000013    13
    0.021609661   2    1000011   -11
    0.021609661   2   -1000011    11
    0.02006731   2    1000023    23
    0.0041627936   3    1000024    5   -6
    0.0041627936   3   -1000024   -5    6
    0.0018360385   3    1000023    6   -6
    0.0014889239   3    1000025    6   -6
    0.00022976543   2    1000022    23
    0.00022743631   2    2000005   -5
    0.00022743631   2   -2000005    5
    0.00010188314   3    1000022    6   -6

DECAY 1000021  215.03547
    0.1858229   2    1000005   -5
    0.1858229   2   -1000005    5
    0.10883589   2    2000006   -6
    0.10883589   2   -2000006    6
    0.10485415   2    2000005   -5
    0.10485415   2   -2000005    5
    0.1002135   2    1000006   -6
    0.1002135   2   -1000006    6
    0.00014034651   3    1000035    5   -5

DECAY 25  0.0033918734
    0.63762085   2   -5    5
    0.1614976   2   -24    24
    0.074788089   2    21    21
    0.072903598   2   -15    15
    0.031398686   2   -4    4
    0.017902467   2    23    23
    0.0022622865   2    22    22
    0.0011330966   2    22    23
    0.00025294246   2   -13    13
    0.00023955447   2   -3    3
    6.6234454e-07   2   -1    1
    1.6181898e-07   2   -2    2
    5.6864885e-09   2   -11    11

DECAY 35  10.883862
    0.21296776   2   -5    5
    0.13505071   2    1000022    1000025
    0.12960319   2   -1000024    1000037
    0.12960319   2   -1000037    1000024
    0.11136604   2    1000025    1000035
    0.10606625   2   -6    6
    0.094040858   2    1000022    1000023
    0.038877281   2   -15    15
    0.015764393   2    1000023    1000035
    0.0064053262   2   -1000024    1000024
    0.005559435   2    1000022    1000022
    0.003910409   2    1000025    1000025
    0.0035766964   2   -2000015    1000015
    0.0035766964   2   -1000015    2000015
    0.0018893592   2    1000022    1000035
    0.00093607765   2    1000023    1000025
    0.00035194102   2    25    25
    0.00012858485   2   -13    13
    7.8862307e-05   2   -3    3
    6.4347541e-05   2    1000023    1000023
    5.5865608e-05   2    23    23
    2.459556e-05   2    21    21
    2.3266687e-05   2   -24    24
    1.4887279e-05   2   -1000015    1000015
    7.886136e-06   2   -1000011    1000011
    7.8817332e-06   2   -1000013    1000013
    6.2254775e-06   2   -1000005    1000005
    1.340205e-06   2   -4    4
    3.9105246e-07   2    22    22
    2.2493616e-07   2    22    23
    2.1803291e-07   2   -1    1
    1.6504962e-08   2   -2000013    1000013
    1.6504962e-08   2   -1000013    2000013
    2.8881502e-09   2   -11    11
    6.9086324e-12   2   -2    2
    3.8605286e-13   2   -2000011    1000011
    3.8605286e-13   2   -1000011    2000011

DECAY 36  10.818529
    0.20982358   2   -5    5
    0.14287763   2    1000022    1000023
    0.12972185   2   -1000024    1000037
    0.12972185   2   -1000037    1000024
    0.11355873   2    1000023    1000035
    0.10481367   2   -6    6
    0.088762294   2    1000022    1000025
    0.038299192   2   -15    15
    0.015240912   2    1000025    1000035
    0.0085077888   2   -1000024    1000024
    0.0053636596   2    1000022    1000022
    0.0035999349   2   -2000015    1000015
    0.0035999349   2   -1000015    2000015
    0.0028801594   2    1000025    1000025
    0.0015176662   2    1000023    1000025
    0.0012340158   2    1000022    1000035
    0.00012668333   2   -13    13
    0.00011474129   2    1000023    1000023
    7.9996519e-05   2    23    25
    7.7698955e-05   2   -3    3
    7.5353881e-05   2    21    21
    1.2947838e-06   2   -4    4
    6.5489871e-07   2    22    22
    4.5711014e-07   2    22    23
    2.1481549e-07   2   -1    1
    1.6505191e-08   2   -2000013    1000013
    1.6505191e-08   2   -1000013    2000013
    2.8454528e-09   2   -11    11
    6.674714e-12   2   -2    2
    3.8605813e-13   2   -2000011    1000011
    3.8605813e-13   2   -1000011    2000011
    1.8381462e-36   2    25    25

DECAY 37  10.77868
    0.31638678   2   -5    6
    0.2414867   2    1000022    1000024
    0.13164861   2    1000024    1000035
    0.13147026   2    1000023    1000037
    0.12839772   2    1000025    1000037
    0.036561585   2   -15    16
    0.0073135707   2   -2000015    1000016
    0.0031621968   2    1000022    1000037
    0.0026795032   2    1000023    1000024
    0.00031067982   2   -5    4
    0.00015189622   2   -3    6
    0.00012925831   2   -13    14
    8.1811946e-05   2    1000024    1000025
    8.053419e-05   2    24    25
    7.4101305e-05   2   -3    4
    5.1911418e-05   2   -1000015    1000016
    6.9617537e-06   2   -1    6
    3.3972986e-06   2   -3    2
    2.21856e-06   2   -5    2
    2.0183075e-07   2   -1    2
    7.3289523e-08   2   -1    4
    3.2676632e-08   2   -1000013    1000014
    3.0233653e-09   2   -11    12
    1.4572016e-12   2    24    35
    1.2278307e-12   2    24    36
    7.6430897e-13   2   -1000011    1000012

DECAY 6  2.43
    1   2    5    24

DECAY 15 -1
