BLOCK SPINFO
   1   SPheno
   2   v4.0.5be

BLOCK SPHENOINFO
   1   2
   2   2

BLOCK MODSEL
   1   0

BLOCK MINPAR
   3    54.793785
   4    1

BLOCK EXTPAR
   0    1426.945
   1   -194.05422
   2    1127.1431
   3    3000
   11    4589.3851
   12    472.41294
   13   -741.7923
   23    664.12153
   25    53.559904
   26    3524.7822
   31    1097.6695
   32    1097.6695
   33    1635.3783
   34    1474.8736
   35    1474.8736
   36    1265.1487
   41    5000
   42    5000
   43    1394.642
   44    5000
   45    5000
   46    1704.3265
   47    5000
   48    5000
   49    1723.3018

BLOCK SMINPUTS
   1    127.90897
   2    1.1663787e-05
   3    0.1184
   4    91.1876
   5    4.18
   6    173.2
   7    1.777
   8    0
   11    0.00051099893
   12    0
   13    0.10565837
   14    0
   21    0.005
   22    0.0025
   23    0.095
   24    1.27

BLOCK GAUGE Q=  1426.945
   1    0.35536298
   2    0.66519887
   3    1.219778

BLOCK YU Q=  1426.945
   1   1    8.3858334e-06
   2   2    0.0042600034
   3   3    1.013076

BLOCK YD Q=  1426.945
   1   1    0.0009025396
   2   2    0.017148252
   3   3    0.89503647

BLOCK YE Q=  1426.945
   1   1    0.00015749976
   2   2    0.032565955
   3   3    0.54770579

BLOCK AU Q=  1426.945
   1   1    0
   2   2    0
   3   3    4589.3851

BLOCK AD Q=  1426.945
   1   1    0
   2   2    0
   3   3    472.41293

BLOCK AE Q=  1426.945
   1   1    0
   2   2    0
   3   3   -741.7923

BLOCK MSOFT Q=  1426.945
   1   -194.05422
   2    1127.1431
   3    3000
   21    12014106
   22   -361034.93
   31    1097.6695
   32    1097.6695
   33    1635.3783
   34    1474.8736
   35    1474.8736
   36    1265.1487
   41    5000
   42    5000
   43    1394.642
   44    5000
   45    5000
   46    1704.3265
   47    5000
   48    5000
   49    1723.3018

BLOCK MASS
   6    173.2
   23    91.1876
   24    80.429995
   15    1.777
   25    123.0315
   35    3523.1089
   36    3524.7822
   37    3523.7836
   1000001    5027.9923
   2000001    5018.4991
   1000002    5027.5734
   2000002    5020.8207
   1000003    5028.0019
   2000003    5018.51
   1000004    5027.5806
   2000004    5020.8215
   1000005    1353.7305
   2000005    1751.5447
   1000006    1200.0151
   2000006    1696.7885
   1000011    1111.6462
   2000011    1474.2369
   1000012    1108.527
   1000013    1111.6493
   2000013    1474.249
   1000014    1108.5374
   1000015    1267.2412
   2000015    1645.9194
   1000016    1642.265
   1000021    3188.5517
   1000022   -193.59852
   1000023    667.69579
   1000025   -675.79641
   1000035    1176.5533
   1000024    667.82845
   1000037    1176.6403

BLOCK ALPHA
      -0.018249269

BLOCK HMIX Q=  1426.945
   1    664.12153
   2    53.559904
   3    244.0153
   4    12424089

BLOCK STOPMIX
   1   1   -0.85298381
   1   2    0.52193738
   2   1   -0.52193738
   2   2   -0.85298381

BLOCK SBOTMIX
   1   1    0.99903786
   1   2    0.043856089
   2   1   -0.043856089
   2   2    0.99903786

BLOCK STAUMIX
   1   1    0.060516664
   1   2    0.99816719
   2   1   -0.99816719
   2   2    0.060516664

BLOCK NMIX
   1   1    0.9972304
   1   2    0.0011854113
   1   3    0.0716907
   1   4    0.019762949
   2   1   -0.036647764
   2   2   -0.11217861
   2   3    0.70454058
   2   4   -0.69978245
   3   1    0.064630569
   3   2   -0.030087762
   3   3   -0.70363271
   3   4   -0.70697852
   4   1    0.0033714533
   4   2   -0.99323173
   4   3   -0.058172396
   4   4    0.1004755

BLOCK UMIX
   1   1   -0.082145463
   1   2    0.99662035
   2   1    0.99662035
   2   2    0.082145463

BLOCK VMIX
   1   1   -0.14201137
   1   2    0.98986503
   2   1    0.98986503
   2   2    0.14201137

BLOCK HIGGSBOUNDSINPUTHIGGSCOUPLINGSFERMIONS
       0, 2868.6633,3,36,15,15

BLOCK HIGGSBOUNDSINPUTHIGGSCOUPLINGSBOSONS
       0,4,36,21,21,23

BLOCK SPHENOLOWENERGY
   1    0.00039429307
   2    1.5871947e-06
   3    3.5224244e-05
   4    5.120722e-15
   5    2.1875274e-10
   6    4.5858966e-08
   7    1.7190235e-13
   8    7.3437076e-09
   9    1.5599268e-06
   10    9.4081534e-05
   11    0.97182622
   12    0.54448363
   13    19.441948
   14    0
   15    0
   16    0.0021790174
   17    2.2818811e-15
   18    2.4796574e-11
   19    8.2889882e-11
   20    9.1301752e-15
   21    3.9033553e-10
   22    8.9354798e-08
   23    0
   24    0
   25    0
   26    0
   27    0
   28    0
   29    0
   30    0
   31    0
   39    8.0824646e-05
   40    0
   41    0
   42    0

BLOCK FWCOEF Q=  160
   305   4422   0   0   -0.18881911
   305   4422   0   2   -0.27134094
   305   4322   0   2   -0.00050829127
   305   6421   0   0   -0.095227835
   305   6421   0   2   -0.14302234
   305   6321   0   2   -0.00031911247
   3051111   4133   0   0    1.5909746
   3051111   4133   0   2    1.5918533
   3051111   4233   0   2    0.00049405268
   3051111   4137   0   0   -4.4136667
   3051111   4137   0   2   -4.4093349
   3051111   4237   0   2   -0.0038514773
   3051313   4133   0   0    1.5909746
   3051313   4133   0   2    1.591847
   3051313   4233   0   2    0.00049404915
   3051313   4137   0   0   -4.4136667
   3051313   4137   0   2   -4.4093413
   3051313   4237   0   2   -0.0038514869
   3051212   4137   0   0    1.5053501
   3051212   4137   0   2    1.5044164
   3051212   4237   0   2    0.00083956607
   3051414   4137   0   0    1.5053501
   3051414   4137   0   2    1.5044164
   3051414   4237   0   2    0.00083956619
   3051616   4137   0   0    1.5053501
   3051616   4137   0   2    1.5044165
   3051616   4237   0   2    0.0008395987

BLOCK IMFWCOEF Q=  160
   305   4422   0   0    3.8550872e-07
   305   4422   0   2    4.2886093e-05
   305   4322   0   2   -7.4076691e-06
   305   6421   0   0    3.3021371e-07
   305   6421   0   2   -4.3222001e-06
   305   6321   0   2   -3.5035415e-06
   3051111   4133   0   2   -2.0829175e-06
   3051111   4233   0   2    9.7353303e-06
   3051111   4137   0   2    1.6845406e-05
   3051111   4237   0   2   -7.5903888e-05
   3051313   4133   0   2   -2.0829002e-06
   3051313   4233   0   2    9.7352785e-06
   3051313   4137   0   2    1.6845528e-05
   3051313   4237   0   2   -7.5904069e-05
   3051212   4137   0   2   -3.4713442e-06
   3051212   4237   0   2    1.6545959e-05
   3051414   4137   0   2   -3.4713451e-06
   3051414   4237   0   2    1.6545959e-05
   3051616   4137   0   2   -3.4708846e-06
   3051616   4237   0   2    1.6545968e-05

DECAY 23  2.4952


DECAY 24  2.085


DECAY 1000011  1.3732553
    0.95505727   2    1000022    11
    0.025274708   2    1000023    11
    0.019640035   2   -1000024    12

DECAY 2000011  7.140245
    0.99641439   2    1000022    11
    0.0027036227   2    1000025    11
    0.00088036944   2    1000023    11

DECAY 1000013  1.3827417
    0.94859057   2    1000022    13
    0.02853863   2    1000023    13
    0.019505471   2   -1000024    14
    0.0033653322   2    1000025    13

DECAY 2000013  7.1806634
    0.99083577   2    1000022    13
    0.0040267654   2    1000025    13
    0.0027179014   2   -1000024    14
    0.0022341239   2    1000023    13
    0.00017811001   2    1000013    25

DECAY 1000015  13.944006
    0.43666275   2    1000022    15
    0.28341726   2   -1000024    16
    0.14273066   2    1000023    15
    0.1371881   2    1000025    15

DECAY 2000015  14.721872
    0.23476086   2   -1000037    16
    0.23389783   2    1000023    15
    0.23056376   2    1000025    15
    0.1386919   2    1000022    15
    0.11679384   2    1000035    15
    0.023176921   2    1000015    23
    0.021396774   2    1000015    25
    0.00071812002   2   -1000024    16

DECAY 1000012  1.4007121
    0.92510907   2    1000022    12
    0.057021134   2    1000024    11
    0.012127822   2    1000023    12
    0.0057419721   2    1000025    12

DECAY 1000014  1.4101473
    0.91892897   2    1000022    14
    0.063320247   2    1000024    13
    0.012047047   2    1000023    14
    0.005703734   2    1000025    14

DECAY 1000016  14.779932
    0.47239915   2    1000024    15
    0.22815121   2    1000037    15
    0.13437427   2    1000022    16
    0.11472136   2    1000035    16
    0.046023189   2    1000015    24
    0.002921887   2    1000023    16
    0.0014089308   2    1000025    16

DECAY 2000001  143.65397
    0.98055671   2    1000021    1
    0.019338185   2    1000022    1

DECAY 1000001  201.90932
    0.70253857   2    1000021    1
    0.19454096   2   -1000037    2
    0.096728632   2    1000035    1
    0.0034003627   2    1000022    1
    0.0014275075   2   -1000024    2
    0.0011809159   2    1000023    1
    0.00018305567   2    1000025    1

DECAY 2000003  143.71158
    0.98017151   2    1000021    3
    0.019331518   2    1000022    3
    0.00019579121   2   -1000024    4
    0.00017602256   2    1000025    3
    0.00012311472   2    1000023    3

DECAY 1000003  201.9405
    0.70243503   2    1000021    3
    0.19451155   2   -1000037    4
    0.096714371   2    1000035    3
    0.0034005881   2    1000022    3
    0.0014357729   2   -1000024    4
    0.0012503107   2    1000023    3
    0.00025237228   2    1000025    3

DECAY 1000005  34.774275
    0.40995797   2   -1000024    6
    0.21409101   2    1000006   -24
    0.17832519   2    1000023    5
    0.17255606   2    1000025    5
    0.010182629   2    1000035    5
    0.0092412972   2    1000022    5
    0.0056458442   2   -1000037    6

DECAY 2000005  42.808593
    0.46223486   2   -1000024    6
    0.23508765   2    1000023    5
    0.23499778   2    1000025    5
    0.024277299   2    1000022    5
    0.017420978   2    1000005    25
    0.017269813   2    1000006   -24
    0.0049292952   2    1000005    23
    0.0024905997   2   -1000037    6
    0.0012917325   2    1000035    5

DECAY 2000002  152.27948
    0.92660209   2    1000021    2
    0.073005221   2    1000022    2
    0.0002965179   2    1000025    2

DECAY 1000002  201.90646
    0.70233247   2    1000021    2
    0.19189564   2    1000037    1
    0.096486503   2    1000035    2
    0.0042664253   2    1000024    1
    0.0034921362   2    1000022    2
    0.0014903559   2    1000023    2

DECAY 2000004  152.283
    0.92658084   2    1000021    4
    0.073003543   2    1000022    4
    0.00030224064   2    1000025    4
    0.00010104874   2    1000023    4

DECAY 1000004  201.93729
    0.70222864   2    1000021    4
    0.19186757   2    1000037    3
    0.096472029   2    1000035    4
    0.0044049824   2    1000024    3
    0.0034916108   2    1000022    4
    0.0014943661   2    1000023    4

DECAY 1000006  21.842945
    0.40564238   2    1000024    5
    0.27938355   2    1000025    6
    0.27206543   2    1000023    6
    0.038938357   2    1000022    6
    0.0025816902   2    1000022    4
    0.00067757352   2    1000037    5
    0.00057199573   2    1000023    4
    0.00013902325   3    1000022    24    5

DECAY 2000006  142.24166
    0.28002662   2    1000005    24
    0.27428603   2    1000006    23
    0.17511446   2    1000024    5
    0.088059297   2    1000006    25
    0.080174656   2    1000023    6
    0.079158905   2    1000025    6
    0.018075059   2    1000022    6
    0.0032237915   2    1000037    5
    0.0018811835   2    1000035    6

DECAY 1000024  0.43558605
    0.99318391   2    1000022    24
    0.0067657832   3    1000022   -5    6

DECAY 1000037  9.285007
    0.24870686   2    1000025    24
    0.24130589   2    1000023    24
    0.23649185   2    1000024    23
    0.23599313   2    1000024    25
    0.006907831   2    1000012   -11
    0.0069057892   2    1000014   -13
    0.0063931853   2   -1000011    12
    0.0063925908   2   -1000013    14
    0.0032183309   2    1000022    24
    0.0029620438   3    1000023   -5    6
    0.0027107047   3    1000025   -5    6
    0.0012584537   3    1000024    6   -6
    0.0005798015   3    1000024    5   -5
    0.00014630223   3    1000022   -5    6

DECAY 1000022 -1


DECAY 1000023  0.63215014
    0.52802499   2    1000022    23
    0.47156059   2    1000022    25
    0.00035708281   3    1000022    6   -6

DECAY 1000025  0.39869486
    0.71878084   2    1000022    25
    0.28040222   2    1000022    23
    0.00071868197   3    1000022    6   -6

DECAY 1000035  11.095734
    0.2006401   2    1000024   -24
    0.2006401   2   -1000024    24
    0.19676727   2    1000025    23
    0.1833705   2    1000023    25
    0.17462539   2    1000025    25
    0.013959056   2    1000023    23
    0.002913494   2    1000012   -12
    0.002913494   2   -1000012    12
    0.0029126248   2    1000014   -14
    0.0029126248   2   -1000014    14
    0.002640455   2    1000011   -11
    0.002640455   2   -1000011    11
    0.0026402135   2    1000013   -13
    0.0026402135   2   -1000013    13
    0.0018796841   3    1000024    5   -6
    0.0018796841   3   -1000024   -5    6
    0.0017535122   2    1000022    23
    0.0015786208   2    1000022    25
    0.00026263089   3    1000023    6   -6
    0.0002193231   3    1000025    6   -6

DECAY 1000021  253.16513
    0.15258563   2    1000006   -6
    0.15258563   2   -1000006    6
    0.125225   2    1000005   -5
    0.125225   2   -1000005    5
    0.090909239   2    2000005   -5
    0.090909239   2   -2000005    5
    0.082632441   2    2000006   -6
    0.082632441   2   -2000006    6
    0.048367597   2    1000006   -4
    0.048367597   2   -1000006    4
    0.0004252552   3    1000035    6   -6

DECAY 25  0.0036361096
    0.60555748   2   -5    5
    0.19737451   2   -24    24
    0.071163673   2    21    21
    0.068946587   2   -15    15
    0.029822624   2   -4    4
    0.022966343   2    23    23
    0.002366102   2    22    22
    0.0013371181   2    22    23
    0.00023917318   2   -13    13
    0.0002256106   2   -3    3
    6.2379024e-07   2   -1    1
    1.5368941e-07   2   -2    2
    5.3769066e-09   2   -11    11

DECAY 35  130.0025
    0.50070167   2   -5    5
    0.18699171   2   -15    15
    0.079664831   2   -1000024    1000037
    0.079664831   2   -1000037    1000024
    0.047532945   2    1000025    1000035
    0.03248038   2    1000023    1000035
    0.017062027   2   -1000006    1000006
    0.014809052   2    1000022    1000023
    0.014254042   2    1000022    1000025
    0.0051818517   2   -2000006    2000006
    0.0040167864   2   -1000024    1000024
    0.0036240003   2   -2000006    1000006
    0.0036240003   2   -1000006    2000006
    0.0019391025   2   -2000015    1000015
    0.0019391025   2   -1000015    2000015
    0.0011577623   2   -2000005    1000005
    0.0011577623   2   -1000005    2000005
    0.00089178966   2    1000023    1000023
    0.0007558341   2   -1000037    1000037
    0.00068429899   2   -13    13
    0.00038127217   2    1000035    1000035
    0.00037965179   2    1000025    1000025
    0.00031188357   2   -3    3
    0.00030713298   2    1000022    1000022
    0.00015740205   2   -6    6
    0.0001240211   2    1000022    1000035
    8.4144213e-05   2    1000023    1000025
    3.4387268e-05   2   -1000015    1000015
    3.1613627e-05   2    25    25
    1.9930973e-05   2   -2000015    2000015
    1.8292584e-05   2    21    21
    1.5367716e-05   2   -1000005    1000005
    8.6236893e-07   2   -1    1
    4.0926554e-08   2    22    23
    2.6270922e-08   2    22    22
    1.5368212e-08   2   -11    11
    1.5280639e-08   2   -1000011    1000011
    1.4958867e-08   2   -1000013    1000013
    6.9097238e-09   2   -2000011    2000011
    6.8417365e-09   2   -2000013    2000013
    2.4077566e-09   2   -4    4
    2.3195557e-09   2   -2000013    1000013
    2.3195557e-09   2   -1000013    2000013
    6.5179809e-11   2    23    23
    1.6030234e-11   2   -24    24
    5.4258037e-14   2   -2000011    1000011
    5.4258037e-14   2   -1000011    2000011
    1.2416266e-14   2   -2    2

DECAY 36  124.09024
    0.48675337   2   -5    5
    0.18178934   2   -15    15
    0.082699487   2   -1000024    1000037
    0.082699487   2   -1000037    1000024
    0.048491025   2    1000023    1000035
    0.034832384   2    1000025    1000035
    0.017528518   2   -2000006    1000006
    0.017528518   2   -1000006    2000006
    0.015964687   2    1000022    1000023
    0.014487971   2    1000022    1000025
    0.0051111479   2   -1000024    1000024
    0.0020631243   2   -2000015    1000015
    0.0020631243   2   -1000015    2000015
    0.0015348835   2   -1000037    1000037
    0.0012263519   2   -2000005    1000005
    0.0012263519   2   -1000005    2000005
    0.0011679936   2    1000023    1000023
    0.00077349487   2    1000035    1000035
    0.0006652628   2   -13    13
    0.00043184016   2    1000025    1000025
    0.00031938509   2    1000022    1000022
    0.00030317868   2   -3    3
    0.00017407507   2   -6    6
    0.00010251881   2    1000022    1000035
    5.4660906e-05   2    1000023    1000025
    6.8466984e-06   2    21    21
    8.3829803e-07   2   -1    1
    7.2105017e-08   2    22    23
    4.7094523e-08   2    22    22
    1.4940787e-08   2   -11    11
    2.952369e-09   2   -4    4
    2.4211175e-09   2   -2000013    1000013
    2.4211175e-09   2   -1000013    2000013
    1.2687972e-10   2    23    25
    1.1612649e-13   2    23    35
    5.6630167e-14   2   -2000011    1000011
    5.6630167e-14   2   -1000011    2000011
    1.5226947e-14   2   -2    2
    1.3265296e-36   2    25    25

DECAY 37  116.47377
    0.48191176   2   -5    6
    0.18165149   2   -15    16
    0.092284381   2    1000023    1000037
    0.090343531   2    1000024    1000035
    0.089472926   2    1000025    1000037
    0.033635148   2    1000022    1000024
    0.014671054   2   -1000005    2000006
    0.0061760094   2   -1000005    1000006
    0.0043893713   2   -1000015    1000016
    0.0024173885   2   -2000005    1000006
    0.00083114112   2    1000024    1000025
    0.00071419515   2   -5    4
    0.00064220276   2   -13    14
    0.00031721668   2   -3    4
    0.00026282931   2    1000023    1000024
    0.0002467368   2    1000022    1000037
    1.4884419e-05   2   -3    2
    1.0487378e-05   2   -2000015    1000016
    5.10009e-06   2   -5    2
    1.0291725e-06   2   -3    6
    8.8082332e-07   2   -1    2
    6.7115765e-08   2   -1000011    1000012
    6.6609213e-08   2   -1000013    1000014
    4.1442778e-08   2   -1    4
    2.5582342e-08   2   -1    6
    1.5021189e-08   2   -11    12
    1.0118259e-08   2    1000035    1000037
    5.3029692e-09   2   -2000013    1000014
    1.3512211e-10   2    24    25
    1.2404777e-13   2   -2000011    1000012

DECAY 6  2.43
    1   2    5    24

DECAY 15 -1
