BLOCK SPINFO
   1   SPheno
   2   v4.0.5be

BLOCK SPHENOINFO
   1   2
   2   2

BLOCK MODSEL
   1   0

BLOCK MINPAR
   3    38.849798
   4   -1

BLOCK EXTPAR
   0    1691.9443
   1    251.6576
   2   -269.42053
   3    3000
   11    2463.375
   12   -1864.8214
   13    1796.4735
   23   -951.44953
   25    38.84958
   26    2372.3711
   31    785.98131
   32    785.98131
   33    332.93807
   34    698.53271
   35    698.53271
   36    1301.4014
   41    5000
   42    5000
   43    1778.6453
   44    5000
   45    5000
   46    1609.4543
   47    5000
   48    5000
   49    875.99871

BLOCK SMINPUTS
   1    127.90897
   2    1.1663787e-05
   3    0.1184
   4    91.1876
   5    4.18
   6    173.2
   7    1.777
   8    0
   11    0.00051099893
   12    0
   13    0.10565837
   14    0
   21    0.005
   22    0.0025
   23    0.095
   24    1.27

BLOCK GAUGE Q=  1691.9443
   1    0.35536298
   2    0.66519887
   3    1.219778

BLOCK YU Q=  1691.9443
   1   1    8.3871493e-06
   2   2    0.0042606718
   3   3    1.013235

BLOCK YD Q=  1691.9443
   1   1    0.00065475821
   2   2    0.012440406
   3   3    0.64931497

BLOCK YE Q=  1691.9443
   1   1    0.00011426009
   2   2    0.023625364
   3   3    0.39733975

BLOCK AU Q=  1691.9443
   1   1    0
   2   2    0
   3   3    2463.375

BLOCK AD Q=  1691.9443
   1   1    0
   2   2    0
   3   3   -1864.8213

BLOCK AE Q=  1691.9443
   1   1    0
   2   2    0
   3   3    1796.4735

BLOCK MSOFT Q=  1691.9443
   1    251.6576
   2   -269.42053
   3    3000
   21    4937671.3
   22   -835987.72
   31    785.98131
   32    785.98131
   33    332.93807
   34    698.53271
   35    698.53271
   36    1301.4014
   41    5000
   42    5000
   43    1778.6453
   44    5000
   45    5000
   46    1609.4543
   47    5000
   48    5000
   49    875.99871

BLOCK MASS
   6    173.2
   23    91.1876
   24    80.429995
   15    1.777
   25    121.95118
   35    2369.4566
   36    2372.3711
   37    2371.444
   1000001    5036.3162
   2000001    5025.3639
   1000002    5035.8549
   2000002    5026.7605
   1000003    5036.3218
   2000003    5025.3663
   1000004    5035.8578
   2000004    5026.7612
   1000005    877.99371
   2000005    1787.8388
   1000006    1558.014
   2000006    1837.3877
   1000011    789.15936
   2000011    701.53856
   1000012    784.75867
   1000013    789.23227
   2000013    701.42858
   1000014    784.74833
   1000015    331.85893
   2000015    1298.8296
   1000016    330.68609
   1000021    3201.9079
   1000022    249.90098
   1000023   -286.43539
   1000025    953.97463
   1000035   -955.59632
   1000024    286.64509
   1000037    958.03067

BLOCK ALPHA
      -0.025823827

BLOCK HMIX Q=  1691.9443
   1   -951.44953
   2    38.84958
   3    243.8843
   4    5628144.8

BLOCK STOPMIX
   1   1   -0.42687171
   1   2    0.90431219
   2   1   -0.90431219
   2   2   -0.42687171

BLOCK SBOTMIX
   1   1   -0.053315518
   1   2    0.99857772
   2   1   -0.99857772
   2   2   -0.053315518

BLOCK STAUMIX
   1   1   -0.99892629
   1   2    0.046327873
   2   1   -0.046327873
   2   2   -0.99892629

BLOCK NMIX
   1   1    0.9986867
   1   2    0.0015200108
   1   3   -0.049830351
   1   4   -0.01181142
   2   1    0.00271869
   2   2    0.99532893
   2   3    0.09185923
   2   4   -0.02957709
   3   1    0.043569066
   3   2   -0.044092678
   3   3    0.7042049
   3   4    0.70728568
   4   1    0.026818448
   4   2   -0.085871061
   4   3    0.70226369
   4   4   -0.70621006

BLOCK UMIX
   1   1   -0.99156315
   1   2   -0.12962452
   2   1   -0.12962452
   2   2    0.99156315

BLOCK VMIX
   1   1    0.99912577
   1   2    0.041805431
   2   1    0.041805431
   2   2   -0.99912577

BLOCK HIGGSBOUNDSINPUTHIGGSCOUPLINGSFERMIONS
       0, 1509.2899,3,36,15,15

BLOCK HIGGSBOUNDSINPUTHIGGSCOUPLINGSBOSONS
       0,4,36,21,21,23

BLOCK SPHENOLOWENERGY
   1    0.00031123119
   2    1.5893768e-06
   3    3.5204009e-05
   4    2.7000983e-15
   5    1.1534325e-10
   6    2.4041716e-08
   7    9.2383879e-14
   8    3.9465692e-09
   9    8.3332703e-07
   10    9.5626086e-05
   11    0.98778086
   12    0.54234257
   13    19.375303
   14    0
   15    0
   16    0.0021584998
   17    2.2816719e-15
   18    2.4763412e-11
   19    8.2817904e-11
   20    1.3432776e-14
   21    5.7422459e-10
   22    2.6366029e-07
   23    0
   24    0
   25    0
   26    0
   27    0
   28    0
   29    0
   30    0
   31    0
   39    9.3019108e-05
   40    0
   41    0
   42    0

BLOCK FWCOEF Q=  160
   305   4422   0   0   -0.18881911
   305   4422   0   2   -0.17618524
   305   4322   0   2   -3.3114039e-05
   305   6421   0   0   -0.095227835
   305   6421   0   2   -0.096283654
   305   6321   0   2   -0.00016450859
   3051111   4133   0   0    1.5965774
   3051111   4133   0   2    1.5972458
   3051111   4233   0   2    0.00016982376
   3051111   4137   0   0   -4.4192696
   3051111   4137   0   2   -4.412769
   3051111   4237   0   2   -0.0013114698
   3051313   4133   0   0    1.5965774
   3051313   4133   0   2    1.5972415
   3051313   4233   0   2    0.00016982217
   3051313   4137   0   0   -4.4192696
   3051313   4137   0   2   -4.4127732
   3051313   4237   0   2   -0.0013114718
   3051212   4137   0   0    1.5053501
   3051212   4137   0   2    1.5039618
   3051212   4237   0   2    0.00028550284
   3051414   4137   0   0    1.5053501
   3051414   4137   0   2    1.5039618
   3051414   4237   0   2    0.00028550298
   3051616   4137   0   0    1.5053501
   3051616   4137   0   2    1.5039635
   3051616   4237   0   2    0.00028554164

BLOCK IMFWCOEF Q=  160
   305   4422   0   0    3.8587745e-07
   305   4422   0   2    1.2019461e-05
   305   4322   0   2    2.6546608e-06
   305   6421   0   0    3.3052955e-07
   305   6421   0   2    1.206467e-05
   305   6321   0   2    1.2011446e-06
   3051111   4133   0   2   -2.3627077e-07
   3051111   4233   0   2    4.0177018e-06
   3051111   4137   0   2    2.136181e-06
   3051111   4237   0   2   -3.1045168e-05
   3051313   4133   0   2   -2.3636359e-07
   3051313   4233   0   2    4.0176855e-06
   3051313   4137   0   2    2.1362549e-06
   3051313   4237   0   2   -3.1045216e-05
   3051212   4137   0   2    1.6633882e-08
   3051212   4237   0   2    6.7585434e-06
   3051414   4137   0   2    1.6637204e-08
   3051414   4237   0   2    6.7585434e-06
   3051616   4137   0   2    4.6392555e-08
   3051616   4237   0   2    6.7585204e-06

DECAY 23  2.4952


DECAY 24  2.085


DECAY 2000011  2.6801176
    0.99999325   2    1000022    11

DECAY 1000011  8.5535441
    0.60172374   2   -1000024    12
    0.304172   2    1000023    11
    0.094104255   2    1000022    11

DECAY 2000013  2.6796057
    0.99994233   2    1000022    13

DECAY 1000013  8.5548777
    0.60171932   2   -1000024    14
    0.30417655   2    1000023    13
    0.094104126   2    1000022    13

DECAY 1000015  0.36143039
    0.51501894   2   -1000024    16
    0.26527553   2    1000023    15
    0.21970553   2    1000022    15

DECAY 2000015  12.720942
    0.47363692   2    1000022    15
    0.20284777   2    1000016   -24
    0.10064831   2    1000015    23
    0.086814514   2    1000015    25
    0.066736529   2   -1000037    16
    0.034250899   2    1000025    15
    0.033846235   2    1000035    15
    0.00080236143   2   -1000024    16
    0.0004164571   2    1000023    15

DECAY 1000012  8.5315839
    0.60701376   2    1000024    11
    0.3004614   2    1000023    12
    0.092524841   2    1000022    12

DECAY 1000014  8.5315083
    0.60701844   2    1000024    13
    0.30045766   2    1000023    14
    0.092523892   2    1000022    14

DECAY 1000016  0.34494065
    0.52036933   2    1000024    15
    0.25993065   2    1000023    16
    0.21970003   2    1000022    16

DECAY 2000001  142.76949
    0.98044847   2    1000021    1
    0.019503029   2    1000022    1

DECAY 1000001  207.82578
    0.67901803   2    1000021    1
    0.20838633   2   -1000024    2
    0.10488498   2    1000023    1
    0.003329723   2   -1000037    2
    0.0032997205   2    1000022    1
    0.00081456143   2    1000035    1
    0.00026665609   2    1000025    1

DECAY 2000003  142.79842
    0.9802515   2    1000021    3
    0.019499354   2    1000022    3

DECAY 1000003  207.84249
    0.67896617   2    1000021    3
    0.20836978   2   -1000024    4
    0.10487728   2    1000023    3
    0.0033376102   2   -1000037    4
    0.0032996427   2    1000022    3
    0.00084858883   2    1000035    3
    0.00030092686   2    1000025    3

DECAY 1000005  0.71861755
    0.61325325   2    1000022    5
    0.24797089   2   -1000024    6
    0.13877586   2    1000023    5

DECAY 2000005  60.011631
    0.31107422   2   -1000037    6
    0.236011   2   -1000024    6
    0.13462641   2    1000006   -24
    0.12320693   2    1000023    5
    0.06405176   2    1000035    5
    0.063996957   2    1000025    5
    0.039450205   2    1000005    23
    0.023522757   2    1000005    25
    0.0040597609   2    1000022    5

DECAY 2000002  151.29164
    0.92618058   2    1000021    2
    0.073638412   2    1000022    2
    0.00013088544   2    1000025    2

DECAY 1000002  207.81901
    0.67880917   2    1000021    2
    0.21156443   2    1000024    1
    0.10508291   2    1000023    2
    0.0034142807   2    1000022    2
    0.00065182378   2    1000035    2
    0.00034650098   2    1000037    1
    0.00013088157   2    1000025    2

DECAY 2000004  151.29501
    0.92615993   2    1000021    4
    0.073636768   2    1000022    4
    0.00013646647   2    1000025    4

DECAY 1000004  207.83535
    0.67875694   2    1000021    4
    0.21154915   2    1000024    3
    0.1050747   2    1000023    4
    0.003414015   2    1000022    4
    0.0006558171   2    1000035    4
    0.00041442646   2    1000037    3
    0.0001349454   2    1000025    4

DECAY 1000006  32.117945
    0.33191299   2    1000037    5
    0.22053627   2    1000025    6
    0.2004756   2    1000035    6
    0.094548004   2    1000024    5
    0.079994658   2    1000022    6
    0.045548865   2    1000023    6
    0.013612736   2    1000023    4
    0.012892015   2    1000005    24
    0.00044902049   2    1000022    4

DECAY 2000006  60.795887
    0.19776772   2    1000024    5
    0.17528787   2    1000037    5
    0.14815918   2    1000035    6
    0.13822005   2    1000025    6
    0.096798106   2    1000006    23
    0.095598795   2    1000023    6
    0.073274282   2    1000005    24
    0.058261554   2    1000006    25
    0.016632443   2    1000022    6

DECAY 1000024  7.186612e-08
    0.97429603   3    1000022   -15    16
    0.01206618   3    1000022   -1    2
    0.012002949   3    1000022   -3    4
    0.00081831966   3    1000022   -13    14
    0.00081650608   3    1000022   -11    12

DECAY 1000037  8.0529214
    0.26048133   2    1000023    24
    0.25303479   2    1000024    23
    0.25119586   2    1000024    25
    0.14315329   2    1000016   -15
    0.07790552   2    1000022    24
    0.0042227529   2   -1000015    16
    0.0034919857   3    1000023   -5    6
    0.0029911999   3    1000024    6   -6
    0.0012468081   3    1000022   -5    6
    0.00090923844   2   -1000011    12
    0.00090852929   2   -1000013    14
    0.00016927159   2    1000014   -13
    0.00013978474   2   -2000013    14

DECAY 1000022 -1


DECAY 1000023  1.9345755e-07
    0.49482162   3    1000022    12   -12
    0.48167618   3    1000022    15   -15
    0.0047352928   3    1000022    5   -5
    0.0042475429   3    1000022    1   -1
    0.0042472431   3    1000022    3   -3
    0.0033179357   3    1000022    2   -2
    0.0032682118   3    1000022    4   -4
    0.0015737948   2    1000022    22
    0.0010564227   3    1000022    11   -11
    0.001055751   3    1000022    13   -13

DECAY 1000025  9.3220168
    0.21998952   2    1000024   -24
    0.21998952   2   -1000024    24
    0.17826076   2    1000023    23
    0.15833894   2    1000023    25
    0.061000971   2    1000015   -15
    0.061000971   2   -1000015    15
    0.04334037   2    1000022    25
    0.018592655   2    1000022    23
    0.014746164   2    1000005   -5
    0.014746164   2   -1000005    5
    0.0031232821   3    1000024    5   -6
    0.0031232821   3   -1000024   -5    6
    0.00081665815   3    1000023    6   -6
    0.0007912569   2    1000016   -16
    0.0007912569   2   -1000016    16
    0.00026655159   3    1000022    6   -6
    0.00016252631   2    2000013   -13
    0.00016252631   2   -2000013    13
    0.00010684613   2    1000014   -14
    0.00010684613   2   -1000014    14
    0.00010683435   2    1000012   -12
    0.00010683435   2   -1000012    12
    0.0001029164   2    2000011   -11
    0.0001029164   2   -2000011    11

DECAY 1000035  8.7009575
    0.24100205   2    1000024   -24
    0.24100205   2   -1000024    24
    0.18486985   2    1000023    25
    0.065748951   2    1000015   -15
    0.065748951   2   -1000015    15
    0.052632489   2    1000022    23
    0.051857998   2    1000022    25
    0.049887177   2    1000023    23
    0.016264217   2    1000005   -5
    0.016264217   2   -1000005    5
    0.0038711023   3    1000024    5   -6
    0.0038711023   3   -1000024   -5    6
    0.0018802214   2    1000016   -16
    0.0018802214   2   -1000016    16
    0.00096920766   3    1000023    6   -6
    0.00033164517   3    1000022    6   -6
    0.00025727129   2    1000014   -14
    0.00025727129   2   -1000014    14
    0.00025724321   2    1000012   -12
    0.00025724321   2   -1000012    12
    0.00015548587   2    1000013   -13
    0.00015548587   2   -1000013    13
    0.00012511273   2    1000011   -11
    0.00012511273   2   -1000011    11
    0.0001062317   2    2000013   -13
    0.0001062317   2   -2000013    13

DECAY 1000021  228.39038
    0.17751185   2    1000005   -5
    0.17751185   2   -1000005    5
    0.13371904   2    1000006   -6
    0.13371904   2   -1000006    6
    0.098237932   2    2000005   -5
    0.098237932   2   -2000005    5
    0.081408943   2    2000006   -6
    0.081408943   2   -2000006    6
    0.0083240349   2    1000006   -4
    0.0083240349   2   -1000006    4
    0.0004026849   3    1000025    5   -5
    0.00039595869   3    1000035    5   -5
    0.00029834106   3    1000037    5   -6
    0.00029834106   3   -1000037   -5    6

DECAY 25  0.0035408263
    0.62134421   2   -5    5
    0.17983459   2   -24    24
    0.073249535   2    21    21
    0.070661736   2   -15    15
    0.030402423   2   -4    4
    0.020472154   2    23    23
    0.00232018   2    22    22
    0.0012372825   2    22    23
    0.00024531519   2   -13    13
    0.00023177081   2   -3    3
    6.4082161e-07   2   -1    1
    1.566806e-07   2   -2    2
    5.5150066e-09   2   -11    11

DECAY 35  140.81077
    0.76425363   2   -5    5
    0.060759773   2   -15    15
    0.045904056   2   -1000024    1000037
    0.045904056   2   -1000037    1000024
    0.026191234   2    1000023    1000025
    0.018605034   2    1000023    1000035
    0.009303641   2   -2000015    1000015
    0.009303641   2   -1000015    2000015
    0.0066753292   2    1000022    1000035
    0.0061155287   2    1000022    1000025
    0.002097996   2   -1000024    1000024
    0.0012268081   2   -1000005    1000005
    0.0010430583   2    1000023    1000023
    0.00065506605   2   -6    6
    0.0006274615   2    1000022    1000023
    0.00056104225   2    1000025    1000035
    0.00019496556   2   -13    13
    0.00012771533   2    1000035    1000035
    0.00012201385   2   -3    3
    0.00010238957   2   -1000015    1000015
    8.554748e-05   2    1000022    1000022
    6.8359862e-05   2    1000025    1000025
    3.5599902e-05   2   -1000037    1000037
    3.4507737e-05   2    21    21
    3.3728901e-07   2   -1    1
    3.3057098e-07   2    25    25
    1.7179185e-07   2    23    23
    7.1564286e-08   2   -24    24
    4.491707e-08   2    22    23
    4.1738176e-08   2   -2000013    2000013
    3.999523e-08   2   -2000011    2000011
    2.7946841e-08   2   -1000011    1000011
    2.5976435e-08   2   -1000013    1000013
    7.2811417e-09   2   -2000013    1000013
    7.2811417e-09   2   -1000013    2000013
    6.709446e-09   2   -4    4
    4.379134e-09   2   -11    11
    1.3197322e-09   2    22    22
    1.7091868e-13   2   -2000011    1000011
    1.7091868e-13   2   -1000011    2000011
    3.4589646e-14   2   -2    2

DECAY 36  130.55191
    0.7523918   2   -5    5
    0.059805713   2   -15    15
    0.049459809   2   -1000024    1000037
    0.049459809   2   -1000037    1000024
    0.027872714   2    1000023    1000035
    0.02044562   2    1000023    1000025
    0.010113484   2   -2000015    1000015
    0.010113484   2   -1000015    2000015
    0.0073293007   2    1000022    1000025
    0.0065133054   2    1000022    1000035
    0.0024625456   2   -1000024    1000024
    0.0012245694   2    1000023    1000023
    0.00073398038   2   -6    6
    0.00064769979   2    1000022    1000023
    0.00044168145   2    1000035    1000035
    0.00020860633   2    1000025    1000035
    0.00019190088   2   -13    13
    0.00019063782   2    1000025    1000025
    0.00015734822   2   -1000037    1000037
    0.0001200806   2   -3    3
    9.4374245e-05   2    1000022    1000022
    2.0734786e-05   2    21    21
    3.3194504e-07   2   -1    1
    2.6463412e-07   2    23    25
    1.1548901e-07   2    22    23
    6.1027222e-08   2    22    22
    8.0443364e-09   2   -2000013    1000013
    8.0443364e-09   2   -1000013    2000013
    7.499669e-09   2   -4    4
    4.3102751e-09   2   -11    11
    1.7682706e-12   2    23    35
    1.8815757e-13   2   -2000011    1000011
    1.8815757e-13   2   -1000011    2000011
    3.8666762e-14   2   -2    2
    2.7883232e-38   2    25    25

DECAY 37  134.05326
    0.76377878   2   -5    6
    0.053395918   2   -15    16
    0.049614174   2    1000023    1000037
    0.04859599   2    1000024    1000035
    0.048338407   2    1000024    1000025
    0.019693338   2   -2000015    1000016
    0.013349885   2    1000022    1000037
    0.0012916365   2    1000022    1000024
    0.0011336353   2   -5    4
    0.00033160494   2    1000025    1000037
    0.00018877371   2   -13    14
    0.00011754977   2   -3    4
    9.6586052e-05   2    1000035    1000037
    5.8300987e-05   2   -1000015    1000016
    8.0953282e-06   2   -5    2
    5.4904569e-06   2   -3    2
    8.4526521e-07   2   -3    6
    3.2603239e-07   2   -1    2
    2.5767459e-07   2    24    25
    1.6734896e-07   2   -2000013    1000014
    1.649378e-07   2   -2000011    1000012
    3.0839332e-08   2   -1    6
    1.5467297e-08   2   -1    4
    1.2736128e-08   2   -1000013    1000014
    8.704292e-09   2    1000023    1000024
    4.4154368e-09   2   -11    12
    3.1474237e-13   2    24    35
    2.9801184e-13   2   -1000011    1000012

DECAY 6  2.43
    1   2    5    24

DECAY 15 -1
