BLOCK SPINFO
   1   SPheno
   2   v4.0.5be

BLOCK SPHENOINFO
   1   2
   2   2

BLOCK MODSEL
   1   0

BLOCK MINPAR
   3    14.016721
   4   -1

BLOCK EXTPAR
   0    1189.7349
   1   -327.00042
   2   -1851.1599
   3    3000
   11    2713.54
   12    879.61233
   13    1553.6421
   23   -427.50058
   25    13.480291
   26    597.99001
   31    762.88469
   32    762.88469
   33    320.23113
   34    1476.9183
   35    1476.9183
   36    524.8909
   41    5000
   42    5000
   43    1248.9215
   44    5000
   45    5000
   46    1350.9956
   47    5000
   48    5000
   49    1737.8909

BLOCK SMINPUTS
   1    127.90897
   2    1.1663787e-05
   3    0.1184
   4    91.1876
   5    4.18
   6    173.2
   7    1.777
   8    0
   11    0.00051099893
   12    0
   13    0.10565837
   14    0
   21    0.005
   22    0.0025
   23    0.095
   24    1.27

BLOCK GAUGE Q=  1189.7349
   1    0.35536298
   2    0.66519887
   3    1.219778

BLOCK YU Q=  1189.7349
   1   1    8.4074102e-06
   2   2    0.0042709644
   3   3    1.0156827

BLOCK YD Q=  1189.7349
   1   1    0.00022774128
   2   2    0.0043270844
   3   3    0.22584799

BLOCK YE Q=  1189.7349
   1   1    3.974252e-05
   2   2    0.0082174926
   3   3    0.13820471

BLOCK AU Q=  1189.7349
   1   1    0
   2   2    0
   3   3    2713.5401

BLOCK AD Q=  1189.7349
   1   1    0
   2   2    0
   3   3    879.61241

BLOCK AE Q=  1189.7349
   1   1    0
   2   2    0
   3   3    1553.6421

BLOCK MSOFT Q=  1189.7349
   1   -327.00042
   2   -1851.1599
   3    3000
   21    165938.47
   22   -127990.45
   31    762.88469
   32    762.88469
   33    320.23113
   34    1476.9183
   35    1476.9183
   36    524.8909
   41    5000
   42    5000
   43    1248.9215
   44    5000
   45    5000
   46    1350.9956
   47    5000
   48    5000
   49    1737.8909

BLOCK MASS
   6    173.2
   23    91.1876
   24    80.429995
   15    1.777
   25    122.06989
   35    598.14423
   36    597.99001
   37    603.64222
   1000001    5012.3474
   2000001    5006.2619
   1000002    5011.9184
   2000002    5007.7569
   1000003    5012.3487
   2000003    5006.263
   1000004    5011.9196
   2000004    5007.7581
   1000005    1179.9395
   2000005    1728.1218
   1000006    1027.2613
   2000006    1377.9056
   1000011    775.49082
   2000011    1478.7697
   1000012    771.1362
   1000013    775.48959
   2000013    1478.7681
   1000014    771.13511
   1000015    336.85367
   2000015    527.14621
   1000016    328.77641
   1000021    3167.3591
   1000022   -317.33194
   1000023    436.86289
   1000025   -441.24841
   1000035   -1881.7048
   1000024    432.65032
   1000037    1881.9133

BLOCK ALPHA
      -0.076002623

BLOCK HMIX Q=  1189.7349
   1   -427.50058
   2    13.480291
   3    244.21391
   4    357592.06

BLOCK STOPMIX
   1   1   -0.77419946
   1   2    0.6329417
   2   1   -0.6329417
   2   2   -0.77419946

BLOCK SBOTMIX
   1   1   -0.99994164
   1   2    0.01080361
   2   1   -0.01080361
   2   2   -0.99994164

BLOCK STAUMIX
   1   1   -0.99697291
   1   2    0.077749682
   2   1   -0.077749682
   2   2   -0.99697291

BLOCK NMIX
   1   1    0.9571152
   1   2   -0.0099679461
   1   3   -0.22970969
   1   4    0.17625151
   2   1   -0.038156931
   2   2    0.022816114
   2   3   -0.7039029
   2   4   -0.7089035
   3   1   -0.2871808
   3   2   -0.040828163
   3   3   -0.67198734
   3   4    0.68139068
   4   1   -0.0013155042
   4   2    0.99885591
   4   3   -0.013681066
   4   4    0.045803622

BLOCK UMIX
   1   1   -0.019406358
   1   2   -0.99981168
   2   1   -0.99981168
   2   2    0.019406358

BLOCK VMIX
   1   1    0.064948333
   1   2    0.99788863
   2   1    0.99788863
   2   2   -0.064948333

BLOCK HIGGSBOUNDSINPUTHIGGSCOUPLINGSFERMIONS
       0, 181.71826,3,36,15,15

BLOCK HIGGSBOUNDSINPUTHIGGSCOUPLINGSBOSONS
       0,4,36,21,21,23

BLOCK SPHENOLOWENERGY
   1    0.00037016155
   2    1.5883349e-06
   3    3.5266189e-05
   4    2.5108763e-15
   5    1.0726172e-10
   6    2.2450845e-08
   7    8.4815293e-14
   8    3.6233044e-09
   9    7.6842862e-07
   10    9.4058286e-05
   11    0.97158608
   12    0.54361318
   13    19.413777
   14    0
   15    0
   16    0.0021637026
   17    2.281727e-15
   18    2.4799753e-11
   19    8.2906844e-11
   20    3.0632265e-15
   21    1.3096219e-10
   22    8.5897123e-08
   23    0
   24    0
   25    0
   26    0
   27    0
   28    0
   29    0
   30    0
   31    0
   39    6.2378195e-05
   40    0
   41    0
   42    0

BLOCK FWCOEF Q=  160
   305   4422   0   0   -0.18881911
   305   4422   0   2   -0.2357275
   305   4322   0   2   -0.0011942625
   305   6421   0   0   -0.095227835
   305   6421   0   2   -0.15971056
   305   6321   0   2   -0.0013773532
   3051111   4133   0   0    1.5835242
   3051111   4133   0   2    1.5861504
   3051111   4233   0   2   -1.6728716e-05
   3051111   4137   0   0   -4.4062164
   3051111   4137   0   2   -4.4058639
   3051111   4237   0   2    0.00013342437
   3051313   4133   0   0    1.5835242
   3051313   4133   0   2    1.5861498
   3051313   4233   0   2   -1.6729789e-05
   3051313   4137   0   0   -4.4062164
   3051313   4137   0   2   -4.4058645
   3051313   4237   0   2    0.00013342537
   3051212   4137   0   0    1.5053501
   3051212   4137   0   2    1.5052776
   3051212   4237   0   2   -2.9140688e-05
   3051414   4137   0   0    1.5053501
   3051414   4137   0   2    1.5052776
   3051414   4237   0   2   -2.9140457e-05
   3051616   4137   0   0    1.5053501
   3051616   4137   0   2    1.505277
   3051616   4237   0   2   -2.9075637e-05

BLOCK IMFWCOEF Q=  160
   305   4422   0   0    3.858453e-07
   305   4422   0   2    5.2324353e-06
   305   4322   0   2    1.6140244e-06
   305   6421   0   0    3.3050202e-07
   305   6421   0   2    4.7414448e-06
   305   6321   0   2    6.0510941e-07
   3051111   4133   0   2    4.0784916e-07
   3051111   4233   0   2    5.2080751e-07
   3051111   4137   0   2   -2.3578e-06
   3051111   4237   0   2   -4.0916879e-06
   3051313   4133   0   2    4.0784525e-07
   3051313   4233   0   2    5.2080724e-07
   3051313   4137   0   2   -2.3578038e-06
   3051313   4237   0   2   -4.0916889e-06
   3051212   4137   0   2    5.6770486e-07
   3051212   4237   0   2    8.9332535e-07
   3051414   4137   0   2    5.677048e-07
   3051414   4237   0   2    8.9332535e-07
   3051616   4137   0   2    5.5772305e-07
   3051616   4237   0   2    8.9332145e-07

DECAY 23  2.4952


DECAY 24  2.085


DECAY 1000011  0.65479407
    0.90817516   2    1000022    11
    0.089947922   2    1000025    11
    0.0018625422   2   -1000024    12

DECAY 2000011  6.7117412
    0.9228897   2    1000022    11
    0.075767539   2    1000025    11
    0.0013427577   2    1000023    11

DECAY 1000013  0.65528617
    0.9075467   2    1000022    13
    0.090210746   2    1000025    13
    0.0018611352   2   -1000024    14
    0.0003814159   2    1000023    13

DECAY 2000013  6.7151112
    0.92243973   2    1000022    13
    0.075839983   2    1000025    13
    0.0014641542   2    1000023    13
    0.00024726603   2   -1000024    14

DECAY 1000015  0.0047369069
    0.99998755   2    1000022    15

DECAY 2000015  1.2335911
    0.79632341   2    1000022    15
    0.083975907   2    1000016   -24
    0.038377527   2    1000015    25
    0.033426818   2    1000015    23
    0.022585053   2    1000025    15
    0.016937418   2   -1000024    16
    0.008373869   2    1000023    15

DECAY 1000012  0.67221196
    0.94669942   2    1000022    12
    0.028954408   2    1000025    12
    0.020000926   2    1000024    11
    0.0043452472   2    1000023    12

DECAY 1000014  0.67269523
    0.94601686   2    1000022    14
    0.028933486   2    1000025    14
    0.020707542   2    1000024    13
    0.0043421078   2    1000023    14

DECAY 1000016  0.0018401099
    1   2    1000022    16

DECAY 2000001  144.89443
    0.98087707   2    1000021    1
    0.017528929   2    1000022    1
    0.0015662642   2    1000025    1

DECAY 1000001  192.30816
    0.74233839   2    1000021    1
    0.16925165   2   -1000037    2
    0.084509873   2    1000035    1
    0.0037038616   2    1000022    1

DECAY 2000003  144.89821
    0.98085228   2    1000021    3
    0.017529149   2    1000022    3
    0.001571928   2    1000025    3

DECAY 1000003  192.31193
    0.7423245   2    1000021    3
    0.16924842   2   -1000037    4
    0.084508249   2    1000035    3
    0.0037042971   2    1000022    3
    0.00010380144   2    1000023    3

DECAY 1000005  23.840647
    0.71187918   2   -1000024    6
    0.24420909   2    1000006   -24
    0.018611287   2    1000023    5
    0.016667507   2    1000025    5
    0.0086329352   2    1000022    5

DECAY 2000005  4.1451858
    0.36534192   2   -1000024    6
    0.21789458   2    1000022    5
    0.18481742   2    1000025    5
    0.18445448   2    1000023    5
    0.015688904   2    1000006   -24
    0.013834047   2    1000006   -37
    0.0090074828   2    1000005    25
    0.0071981651   2    1000005    23
    0.0017630086   2    2000006   -24

DECAY 2000002  153.36594
    0.92771178   2    1000021    2
    0.066262815   2    1000022    2
    0.005920756   2    1000025    2
    0.00010455571   2    1000023    2

DECAY 1000002  192.30235
    0.74212833   2    1000021    2
    0.16858238   2    1000037    1
    0.084421213   2    1000035    2
    0.0029303236   2    1000022    2
    0.0009552837   2    1000025    2
    0.00095346282   2    1000024    1

DECAY 2000004  153.36957
    0.92769017   2    1000021    4
    0.066261625   2    1000022    4
    0.0059260145   2    1000025    4
    0.00011042008   2    1000023    4

DECAY 1000004  192.30605
    0.74211438   2    1000021    4
    0.16857921   2    1000037    3
    0.084419601   2    1000035    4
    0.0029305568   2    1000022    4
    0.00096297701   2    1000024    3
    0.00095959521   2    1000025    4

DECAY 1000006  23.127393
    0.3409629   2    1000023    6
    0.290069   2    1000024    5
    0.28532931   2    1000025    6
    0.083596468   2    1000022    6

DECAY 2000006  62.435272
    0.26950283   2    1000006    23
    0.21206711   2    1000024    5
    0.16503847   2    1000005    24
    0.16093208   2    1000025    6
    0.15696663   2    1000023    6
    0.021305209   2    1000022    6
    0.014187673   2    1000006    25

DECAY 1000024  0.3304306
    0.94960045   2    1000022    24
    0.049272271   2    1000016   -15
    0.0011262808   2   -1000015    16

DECAY 1000037  86.364894
    0.098754727   2   -1000005    6
    0.089764891   2    1000016   -15
    0.089229996   2   -1000015    16
    0.071442229   2    1000006   -5
    0.066126611   2    1000014   -13
    0.066126536   2    1000012   -11
    0.066078663   2   -1000013    14
    0.066078577   2   -1000011    12
    0.051066768   2    1000023    24
    0.050948082   2    1000024    23
    0.050239108   2    1000024    25
    0.048281646   2    1000025    24
    0.036988944   2    37    1000025
    0.035204163   2    1000024    36
    0.035064999   2    1000024    35
    0.034778284   2    37    1000023
    0.031069886   2    2000006   -5
    0.0039266811   2    37    1000022
    0.0024299276   3    1000024    6   -6
    0.0024034336   2    1000022    24
    0.0018433968   3    1000023   -5    6
    0.0015081172   3    1000025   -5    6
    0.00054439961   2   -2000015    16

DECAY 1000022 -1


DECAY 1000023  0.34987748
    0.96072872   2    1000022    23
    0.018651526   2    1000015   -15
    0.018651526   2   -1000015    15
    0.00096424433   2    1000016   -16
    0.00096424433   2   -1000016    16

DECAY 1000025  0.064145728
    0.46040163   2    1000022    25
    0.1902683   2    1000015   -15
    0.1902683   2   -1000015    15
    0.083082804   2    1000022    23
    0.03797099   2    1000016   -16
    0.03797099   2   -1000016    16

DECAY 1000035  89.964368
    0.050747605   2    1000005   -5
    0.050747605   2   -1000005    5
    0.049487363   2    1000024   -24
    0.049487363   2   -1000024    24
    0.043225622   2    1000016   -16
    0.043225622   2   -1000016    16
    0.042683959   2    1000015   -15
    0.042683959   2   -1000015    15
    0.038820936   2    37   -1000024
    0.038820936   2   -37    1000024
    0.037955758   2    1000023    23
    0.036258625   2    1000006   -6
    0.036258625   2   -1000006    6
    0.035573904   2    1000025    25
    0.031840396   2    1000014   -14
    0.031840396   2   -1000014    14
    0.03184036   2    1000012   -12
    0.03184036   2   -1000012    12
    0.031605922   2    1000013   -13
    0.031605922   2   -1000013    13
    0.031605877   2    1000011   -11
    0.031605877   2   -1000011    11
    0.031006714   2    1000023    35
    0.027814066   2    1000023    25
    0.020860127   2    1000025    35
    0.015349151   2    2000006   -6
    0.015349151   2   -2000006    6
    0.010344917   2    1000025    23
    0.0096724703   2    1000025    36
    0.0079064149   2    1000023    36
    0.0022235605   2    1000022    35
    0.0017451804   3    1000024    5   -6
    0.0017451804   3   -1000024   -5    6
    0.0017259871   2    1000022    25
    0.0012756332   2    1000022    36
    0.001044729   3    1000025    6   -6
    0.00099660398   3    1000023    6   -6
    0.00056306079   2    1000022    23
    0.00026050671   2    2000015   -15
    0.00026050671   2   -2000015    15

DECAY 1000021  253.19742
    0.16580347   2    1000006   -6
    0.16580347   2   -1000006    6
    0.13732736   2    1000005   -5
    0.13732736   2   -1000005    5
    0.10548002   2    2000006   -6
    0.10548002   2   -2000006    6
    0.09131243   2    2000005   -5
    0.09131243   2   -2000005    5

DECAY 25  0.0039063023
    0.64628773   2   -5    5
    0.16518591   2   -24    24
    0.073020663   2   -15    15
    0.065274242   2    21    21
    0.027634991   2   -4    4
    0.018849815   2    23    23
    0.002120426   2    22    22
    0.0011333417   2    22    23
    0.00025309975   2   -13    13
    0.00023896942   2   -3    3
    6.6072144e-07   2   -1    1
    1.4241842e-07   2   -2    2
    5.6900042e-09   2   -11    11

DECAY 35  2.4418613
    0.84244727   2   -5    5
    0.10714835   2   -15    15
    0.045999521   2   -6    6
    0.0026598484   2    25    25
    0.00063169631   2   -24    24
    0.00036560661   2   -13    13
    0.00031445256   2    23    23
    0.00026478098   2   -3    3
    0.00016626828   2    21    21
    9.0355479e-07   2   -4    4
    7.32029e-07   2   -1    1
    4.0725958e-07   2    22    22
    1.6145116e-07   2    22    23
    8.2153748e-09   2   -11    11
    4.6595586e-12   2   -2    2

DECAY 36  2.4459002
    0.83168028   2   -5    5
    0.1057664   2   -15    15
    0.061074081   2   -6    6
    0.00053237211   2    23    25
    0.00036087796   2   -13    13
    0.00032242932   2    21    21
    0.00026136445   2   -3    3
    7.8515296e-07   2   -4    4
    7.2258344e-07   2   -1    1
    5.3267756e-07   2    22    22
    1.3844892e-07   2    22    23
    8.1091162e-09   2   -11    11
    4.0489145e-12   2   -2    2
    6.2686685e-36   2    25    25

DECAY 37  1.986799
    0.87771255   2   -5    6
    0.11937311   2   -15    16
    0.0013972228   2   -5    4
    0.00068906364   2    24    25
    0.00042203354   2   -13    14
    0.00028864063   2   -3    4
    8.9237916e-05   2   -3    6
    1.3191735e-05   2   -3    2
    9.9776883e-06   2   -5    2
    4.0766961e-06   2   -1    6
    7.9815113e-07   2   -1    2
    8.0445201e-08   2   -1    4
    9.871409e-09   2   -11    12
    3.910482e-09   2    24    36
    3.4060617e-09   2    24    35

DECAY 6  2.43
    1   2    5    24

DECAY 15 -1
