BLOCK SPINFO
   1   SPheno
   2   v4.0.5be

BLOCK SPHENOINFO
   1   2
   2   2

BLOCK MODSEL
   1   0

BLOCK MINPAR
   3    24.612253
   4   -1

BLOCK EXTPAR
   0    2831.4747
   1    172.51704
   2   -645.19154
   3    3129.3673
   11   -1899.1033
   12   -2204.0445
   13    5541.8367
   23   -619.84446
   25    23.668484
   26    4781.2609
   31    3675.0835
   32    3675.0835
   33    2601.0306
   34    3834.0371
   35    3834.0371
   36    1673.5356
   41    3905.6921
   42    3905.6921
   43    4105.6228
   44    3281.1349
   45    3281.1349
   46    1818.4221
   47    2336.042
   48    2336.042
   49    3345.792

BLOCK SMINPUTS
   1    127.90897
   2    1.1663787e-05
   3    0.1184
   4    91.1876
   5    4.18
   6    173.2
   7    1.777
   8    0
   11    0.00051099893
   12    0
   13    0.10565837
   14    0
   21    0.005
   22    0.0025
   23    0.095
   24    1.27

BLOCK GAUGE Q=  2831.4747
   1    0.35536298
   2    0.66519887
   3    1.219778

BLOCK YU Q=  2831.4747
   1   1    8.3918522e-06
   2   2    0.0042630609
   3   3    1.0138031

BLOCK YD Q=  2831.4747
   1   1    0.00039912461
   2   2    0.0075833676
   3   3    0.39580655

BLOCK YE Q=  2831.4747
   1   1    6.9650163e-05
   2   2    0.014401445
   3   3    0.24220861

BLOCK AU Q=  2831.4747
   1   1    0
   2   2    0
   3   3   -1899.1038

BLOCK AD Q=  2831.4747
   1   1    0
   2   2    0
   3   3   -2204.0442

BLOCK AE Q=  2831.4747
   1   1    0
   2   2    0
   3   3    5541.8362

BLOCK MSOFT Q=  2831.4747
   1    172.51704
   2   -645.19154
   3    3129.3673
   21    22447198
   22   -253991.11
   31    3675.0835
   32    3675.0835
   33    2601.0306
   34    3834.0371
   35    3834.0371
   36    1673.5356
   41    3905.6921
   42    3905.6921
   43    4105.6228
   44    3281.1349
   45    3281.1349
   46    1818.4221
   47    2336.042
   48    2336.042
   49    3345.792

BLOCK MASS
   6    173.2
   23    91.1876
   24    80.429995
   15    1.777
   25    120.43184
   35    4779.9347
   36    4781.2609
   37    4780.8641
   1000001    3993.1564
   2000001    2455.8231
   1000002    3992.3924
   2000002    3376.7752
   1000003    3993.1552
   2000003    2455.8214
   1000004    3992.3913
   2000004    3376.7748
   1000005    3436.3708
   2000005    4168.1974
   1000006    1922.1808
   2000006    4170.913
   1000011    3682.546
   2000011    3838.2802
   1000012    3681.2845
   1000013    3682.5417
   2000013    3838.2726
   1000014    3681.2804
   1000015    1678.3845
   2000015    2605.9912
   1000016    2604.3027
   1000021    3339.6396
   1000022    171.1637
   1000023   -596.84527
   1000025    635.02855
   1000035   -724.47283
   1000024    597.16662
   1000037    724.81929

BLOCK ALPHA
      -0.040652935

BLOCK HMIX Q=  2831.4747
   1   -619.84446
   2    23.668484
   3    243.33682
   4    22860456

BLOCK STOPMIX
   1   1    0.020054802
   1   2    0.99979888
   2   1   -0.99979888
   2   2    0.020054802

BLOCK SBOTMIX
   1   1   -0.0049749071
   1   2    0.99998763
   2   1   -0.99998763
   2   2   -0.0049749071

BLOCK STAUMIX
   1   1   -0.0091128559
   1   2    0.99995848
   2   1   -0.99995848
   2   2   -0.0091128559

BLOCK NMIX
   1   1    0.99694886
   1   2    0.0014181608
   1   3   -0.075996221
   1   4   -0.017763232
   2   1    0.035458715
   2   2    0.54007212
   2   3    0.61041605
   2   4   -0.5783226
   3   1    0.066211349
   3   2   -0.040746146
   3   3    0.70246661
   3   4    0.70745775
   4   1   -0.021253378
   4   2    0.84063062
   4   3   -0.35799089
   4   4    0.40587063

BLOCK UMIX
   1   1   -0.50220411
   1   2   -0.86474912
   2   1   -0.86474912
   2   2    0.50220411

BLOCK VMIX
   1   1    0.57080892
   1   2    0.82108293
   2   1    0.82108293
   2   2   -0.57080892

BLOCK HIGGSBOUNDSINPUTHIGGSCOUPLINGSFERMIONS
       0, 560.19712,3,36,15,15

BLOCK HIGGSBOUNDSINPUTHIGGSCOUPLINGSBOSONS
       0,4,36,21,21,23

BLOCK SPHENOLOWENERGY
   1    0.0003289882
   2    1.5878176e-06
   3    3.5221583e-05
   4    2.3987073e-15
   5    1.0247018e-10
   6    2.145898e-08
   7    8.0898954e-14
   8    3.4560049e-09
   9    7.3331548e-07
   10    9.6646398e-05
   11    0.99832029
   12    0.54252428
   13    19.384016
   14    0
   15    0
   16    0.0021596443
   17    2.2816822e-15
   18    2.4779717e-11
   19    8.285201e-11
   20    1.209564e-15
   21    5.1713135e-11
   22    2.3789694e-08
   23    0
   24    0
   25    0
   26    0
   27    0
   28    0
   29    0
   30    0
   31    0
   39    5.56409e-05
   40    0
   41    0
   42    0

BLOCK FWCOEF Q=  160
   305   4422   0   0   -0.18881911
   305   4422   0   2   -0.19899399
   305   4322   0   2   -0.00021575324
   305   6421   0   0   -0.095227835
   305   6421   0   2   -0.10245159
   305   6321   0   2   -0.00015122404
   3051111   4133   0   0    1.6143837
   3051111   4133   0   2    1.6146973
   3051111   4233   0   2    5.1704682e-05
   3051111   4137   0   0   -4.4370758
   3051111   4137   0   2   -4.4323568
   3051111   4237   0   2   -0.00038977972
   3051313   4133   0   0    1.6143837
   3051313   4133   0   2    1.614697
   3051313   4233   0   2    5.1704651e-05
   3051313   4137   0   0   -4.4370758
   3051313   4137   0   2   -4.4323572
   3051313   4237   0   2   -0.00038977978
   3051212   4137   0   0    1.5053501
   3051212   4137   0   2    1.5043296
   3051212   4237   0   2    8.4519911e-05
   3051414   4137   0   0    1.5053501
   3051414   4137   0   2    1.5043296
   3051414   4237   0   2    8.4519913e-05
   3051616   4137   0   0    1.5053501
   3051616   4137   0   2    1.5043298
   3051616   4237   0   2    8.4520502e-05

BLOCK IMFWCOEF Q=  160
   305   4422   0   0    3.8581213e-07
   305   4422   0   2    3.5873481e-06
   305   4322   0   2   -2.8432756e-06
   305   6421   0   0    3.304736e-07
   305   6421   0   2    3.7473296e-06
   305   6321   0   2   -1.3031087e-06
   3051111   4133   0   2   -7.0746067e-07
   3051111   4233   0   2    1.0507732e-06
   3051111   4137   0   2    7.0636561e-06
   3051111   4237   0   2   -7.9211124e-06
   3051313   4133   0   2   -7.0746204e-07
   3051313   4233   0   2    1.0507728e-06
   3051313   4137   0   2    7.0636607e-06
   3051313   4237   0   2   -7.9211137e-06
   3051212   4137   0   2   -1.4820242e-06
   3051212   4237   0   2    1.7176128e-06
   3051414   4137   0   2   -1.482024e-06
   3051414   4237   0   2    1.7176128e-06
   3051616   4137   0   2   -1.4783426e-06
   3051616   4237   0   2    1.7176147e-06

DECAY 23  2.4952


DECAY 24  2.085


DECAY 1000011  49.857371
    0.44927647   2   -1000037    12
    0.20660258   2    1000035    11
    0.15547699   2   -1000024    12
    0.096326908   2    1000023    11
    0.092308213   2    1000022    11

DECAY 2000011  19.203462
    0.99421062   2    1000022    11
    0.0041650538   2    1000025    11
    0.0012024024   2    1000023    11
    0.00042190107   2    1000035    11

DECAY 1000013  49.871619
    0.44914751   2   -1000037    14
    0.20657929   2    1000035    13
    0.15543237   2   -1000024    14
    0.096406962   2    1000023    13
    0.092283484   2    1000022    13
    0.00015037391   2    1000025    13

DECAY 2000013  19.233415
    0.99266508   2    1000022    13
    0.0045429103   2    1000025    13
    0.001492665   2    1000023    13
    0.000586298   2   -1000024    14
    0.0005193787   2    1000035    13
    0.0001931266   2   -1000037    14

DECAY 1000015  11.141963
    0.73791771   2    1000022    15
    0.10321703   2   -1000024    16
    0.065862898   2    1000025    15
    0.052227108   2    1000023    15
    0.026866787   2   -1000037    16
    0.013908469   2    1000035    15

DECAY 2000015  35.854099
    0.40883564   2   -1000037    16
    0.19729977   2    1000035    15
    0.14320677   2   -1000024    16
    0.11730744   2    1000023    15
    0.090830784   2    1000022    15
    0.037185584   2    1000025    15
    0.0027522353   2    1000015    23
    0.0025817793   2    1000015    25

DECAY 1000012  49.877634
    0.4047233   2    1000037    11
    0.21789695   2    1000035    12
    0.20069926   2    1000024    11
    0.091261602   2    1000022    12
    0.083647038   2    1000023    12
    0.001771855   2    1000025    12

DECAY 1000014  49.891879
    0.40467829   2    1000037    13
    0.21783445   2    1000035    14
    0.20085742   2    1000024    13
    0.091235443   2    1000022    14
    0.083623053   2    1000023    14
    0.0017713469   2    1000025    14

DECAY 1000016  35.891288
    0.38474987   2    1000037    15
    0.24358634   2    1000024    15
    0.19733737   2    1000035    16
    0.089333981   2    1000022    16
    0.077863686   2    1000023    16
    0.0054918111   2    1000015    24
    0.0016369415   2    1000025    16

DECAY 2000001  1.356797
    0.99462724   2    1000022    1
    0.0038598962   2    1000025    1
    0.0011267782   2    1000023    1
    0.00038107836   2    1000035    1

DECAY 1000001  78.620902
    0.362098   2    1000021    1
    0.31267382   2   -1000037    2
    0.14908082   2    1000035    1
    0.10777696   2   -1000024    2
    0.060875955   2    1000023    1
    0.0069081595   2    1000022    1
    0.00058628981   2    1000025    1

DECAY 2000003  1.361683
    0.99106953   2    1000022    3
    0.0047299743   2    1000025    3
    0.0018014502   2    1000023    3
    0.0013658897   2   -1000024    4
    0.00059947767   2    1000035    3
    0.00043368323   2   -1000037    4

DECAY 1000003  78.626533
    0.36207097   2    1000021    3
    0.31265718   2   -1000037    4
    0.14907699   2    1000035    3
    0.10778077   2   -1000024    4
    0.060892251   2    1000023    3
    0.0069079966   2    1000022    3
    0.00061340724   2    1000025    3

DECAY 1000005  22.68655
    0.33334197   2   -1000024    6
    0.21737891   2    1000025    5
    0.16722383   2    1000023    5
    0.1049631   2   -1000037    6
    0.086573012   2    1000022    5
    0.053733148   2    1000035    5
    0.036782113   2    1000021    5

DECAY 2000005  197.95207
    0.31899804   2   -1000024    6
    0.26567156   2   -1000037    6
    0.21308042   2    1000021    5
    0.0702671   2    1000035    5
    0.048754009   2    1000006   -24
    0.048570855   2    1000023    5
    0.031180209   2    1000025    5
    0.0032117743   2    1000022    5
    0.00016716042   2    1000005    25

DECAY 2000002  7.6267935
    0.97767237   2    1000022    2
    0.016721067   2    1000021    2
    0.0040334107   2    1000025    2
    0.0011667023   2    1000023    2
    0.00040645052   2    1000035    2

DECAY 1000002  78.612772
    0.36142138   2    1000021    2
    0.28186156   2    1000037    1
    0.14640338   2    1000035    2
    0.13921995   2    1000024    1
    0.063783853   2    1000023    2
    0.0071318279   2    1000022    2
    0.00017805416   2    1000025    2

DECAY 2000004  7.6289648
    0.97739367   2    1000022    4
    0.016703844   2    1000021    4
    0.0041069696   2    1000025    4
    0.0012165279   2    1000023    4
    0.00043028878   2    1000035    4
    0.00010124776   2    1000024    3

DECAY 1000004  78.618291
    0.36139398   2    1000021    4
    0.28185543   2    1000037    3
    0.14639567   2    1000035    4
    0.13925146   2    1000024    3
    0.06378534   2    1000023    4
    0.0071313296   2    1000022    4
    0.00018678084   2    1000025    4

DECAY 1000006  65.562746
    0.32379196   2    1000024    5
    0.23335482   2    1000025    6
    0.15704062   2    1000023    6
    0.14916911   2    1000037    5
    0.073480024   2    1000035    6
    0.063152341   2    1000022    6

DECAY 2000006  198.69083
    0.20610996   2    1000021    6
    0.20493233   2    1000025    6
    0.16743504   2    1000023    6
    0.12774362   2    1000037    5
    0.12243706   2    1000035    6
    0.10982128   2    1000024    5
    0.033966961   2    1000006    25
    0.0243353   2    1000006    23
    0.0030184245   2    1000022    6
    0.00020003208   2    1000005    24

DECAY 1000024  0.24503651
    0.99563367   2    1000022    24
    0.0043640609   3    1000022   -5    6

DECAY 1000037  1.8543589
    0.6856064   2    1000023    24
    0.16385283   2    1000024    23
    0.097047985   2    1000022    24
    0.029306428   2    1000024    25
    0.023392304   2    1000025    24
    0.00079337915   3    1000022   -5    6

DECAY 1000022 -1


DECAY 1000023  0.3675399
    0.50988459   2    1000022    23
    0.48995663   2    1000022    25
    0.00013218949   3    1000022    6   -6

DECAY 1000025  0.37208837
    0.67616095   2    1000022    25
    0.322324   2    1000022    23
    0.00045866623   3    1000022    6   -6
    0.00011851453   3    1000023    12   -12

DECAY 1000035  2.7417783
    0.43260422   2    1000024   -24
    0.43260422   2   -1000024    24
    0.048156132   2    1000022    23
    0.044245001   2    1000022    25
    0.017625622   2    1000023    25
    0.0049004109   3    1000025    12   -12
    0.0036646145   3    1000025    1   -1
    0.0036645947   3    1000025    3   -3
    0.003625316   3    1000025    5   -5
    0.0028579969   3    1000025    2   -2
    0.0028543883   3    1000025    4   -4
    0.00082698851   3    1000025    11   -11
    0.00082698057   3    1000025    13   -13
    0.00082482382   3    1000025    15   -15
    0.00057663114   2    1000023    23
    0.00010520247   3    1000022    6   -6

DECAY 1000021  85.836668
    0.25487393   2    1000006   -6
    0.25487393   2   -1000006    6
    0.12144843   2    2000003   -3
    0.12144843   2   -2000003    3
    0.12144805   2    2000001   -1
    0.12144805   2   -2000001    1
    0.00037197269   3    1000024    5   -6
    0.00037197269   3   -1000024   -5    6
    0.00033210937   3    1000022    4   -4
    0.00033210864   3    1000022    2   -2
    0.00023556391   3    1000025    5   -5
    0.00021545568   3    1000023    5   -5
    0.00020097646   3    1000025    6   -6
    0.00019858263   3    1000037    5   -6
    0.00019858263   3   -1000037   -5    6
    0.00018948986   3    1000023    6   -6
    0.00013115371   3    1000035    5   -5
    0.00012097511   3    1000037    3   -4
    0.00012097511   3   -1000037   -3    4
    0.00012096029   3    1000037    1   -2
    0.00012096029   3   -1000037   -1    2
    0.00010801144   3    1000035    6   -6

DECAY 25  0.0033645147
    0.63928589   2   -5    5
    0.15911761   2   -24    24
    0.075273218   2    21    21
    0.073133178   2   -15    15
    0.031687249   2   -4    4
    0.017569379   2    23    23
    0.0023198155   2    22    22
    0.0011188458   2    22    23
    0.00025363342   2   -13    13
    0.00024035205   2   -3    3
    6.6455057e-07   2   -1    1
    1.6330711e-07   2   -2    2
    5.702025e-09   2   -11    11

DECAY 35  101.21622
    0.31007146   2   -5    5
    0.10338287   2   -1000024    1000037
    0.10338287   2   -1000037    1000024
    0.093119628   2   -1000024    1000024
    0.069101868   2    1000025    1000035
    0.060852371   2   -1000037    1000037
    0.058495893   2   -15    15
    0.039311783   2    1000023    1000023
    0.033905356   2    1000035    1000035
    0.030098612   2    1000023    1000025
    0.027095222   2    1000022    1000025
    0.02153352   2    1000022    1000023
    0.016706418   2   -2000015    1000015
    0.016706418   2   -1000015    2000015
    0.0064227038   2    1000023    1000035
    0.0043993916   2    1000022    1000035
    0.0033044427   2   -6    6
    0.0011176398   2    1000025    1000025
    0.00060496734   2    1000022    1000022
    0.00020147512   2   -13    13
    0.00012425166   2   -3    3
    4.661656e-05   2   -1000006    1000006
    1.0067712e-05   2   -1000015    1000015
    2.5267708e-06   2    25    25
    8.1948305e-07   2    21    21
    3.4352827e-07   2   -1    1
    2.7511903e-07   2    23    23
    5.6401073e-08   2    22    23
    4.7691497e-08   2   -24    24
    4.2817004e-08   2   -4    4
    2.2283344e-08   2    22    22
    4.5243575e-09   2   -11    11
    4.1671555e-09   2   -1000001    1000001
    4.1589393e-09   2   -1000003    1000003
    2.2069395e-13   2   -2    2

DECAY 36  99.017215
    0.29842168   2   -5    5
    0.11582413   2   -1000024    1000024
    0.085253273   2   -1000024    1000037
    0.085253273   2   -1000037    1000024
    0.082534834   2   -1000037    1000037
    0.056488488   2    1000025    1000035
    0.056299393   2   -15    15
    0.049634236   2    1000023    1000023
    0.04537425   2    1000035    1000035
    0.024565382   2    1000022    1000023
    0.023924325   2    1000022    1000025
    0.023605951   2    1000023    1000025
    0.017097906   2   -2000015    1000015
    0.017097906   2   -1000015    2000015
    0.0079134195   2    1000023    1000035
    0.0057069987   2    1000022    1000035
    0.0030457872   2   -6    6
    0.0010410223   2    1000025    1000025
    0.00059805528   2    1000022    1000022
    0.00019390954   2   -13    13
    0.00011958259   2   -3    3
    4.9568596e-06   2    21    21
    7.3467244e-07   2    23    25
    3.3062217e-07   2   -1    1
    8.0999479e-08   2    22    23
    4.8064722e-08   2    22    22
    3.9240506e-08   2   -4    4
    4.3544539e-09   2   -11    11
    2.0226511e-13   2   -2    2
    4.5527587e-14   2    23    35
    1.5212105e-39   2    25    25

DECAY 37  100.69283
    0.31079055   2   -5    6
    0.19244096   2    1000023    1000037
    0.16999254   2    1000024    1000035
    0.11345575   2    1000025    1000037
    0.065209321   2    1000024    1000025
    0.057518295   2   -15    16
    0.045632853   2    1000022    1000024
    0.033659346   2   -1000015    1000016
    0.010209431   2    1000022    1000037
    0.00045709788   2   -5    4
    0.00023271929   2    1000023    1000024
    0.00020334762   2   -13    14
    0.00011431415   2   -3    4
    6.9208734e-05   2    1000035    1000037
    5.3798874e-06   2   -3    2
    4.3717103e-06   2   -3    6
    3.2641496e-06   2   -5    2
    7.2244278e-07   2    24    25
    3.1711182e-07   2   -1    2
    1.9267493e-07   2   -1    6
    1.663912e-08   2   -1    4
    4.756322e-09   2   -11    12
    6.4800982e-11   2   -1000003    1000006
    8.2333509e-15   2   -1000001    1000006

DECAY 6  2.43
    1   2    5    24

DECAY 15 -1
