BLOCK SPINFO
   1   SPheno
   2   v4.0.5be

BLOCK SPHENOINFO
   1   2
   2   2

BLOCK MODSEL
   1   0

BLOCK MINPAR
   3    17.884884
   4   -1

BLOCK EXTPAR
   0    3388.4279
   1    860.70777
   2    3414.298
   3    4118.7837
   11   -4682.5371
   12   -5777.7625
   13   -5868.6314
   23   -2731.7785
   25    17.117327
   26    2148.3191
   31    4030.0591
   32    4030.0591
   33    1886.2196
   34    939.36537
   35    939.36537
   36    2586.3892
   41    4925.4944
   42    4925.4944
   43    2568.0222
   44    1766.3779
   45    1766.3779
   46    4169.7305
   47    2029.0354
   48    2029.0354
   49    4418.8082

BLOCK SMINPUTS
   1    127.90897
   2    1.1663787e-05
   3    0.1184
   4    91.1876
   5    4.18
   6    173.2
   7    1.777
   8    0
   11    0.00051099893
   12    0
   13    0.10565837
   14    0
   21    0.005
   22    0.0025
   23    0.095
   24    1.27

BLOCK GAUGE Q=  3388.4279
   1    0.35536298
   2    0.66519887
   3    1.219778

BLOCK YU Q=  3388.4279
   1   1    8.3986676e-06
   2   2    0.0042665231
   3   3    1.0146265

BLOCK YD Q=  3388.4279
   1   1    0.00028888606
   2   2    0.0054888351
   3   3    0.28648445

BLOCK YE Q=  3388.4279
   1   1    5.041273e-05
   2   2    0.010423754
   3   3    0.17531039

BLOCK AU Q=  3388.4279
   1   1    0
   2   2    0
   3   3   -4682.5421

BLOCK AD Q=  3388.4279
   1   1    0
   2   2    0
   3   3   -5777.726

BLOCK AE Q=  3388.4279
   1   1    0
   2   2    0
   3   3   -5868.6285

BLOCK MSOFT Q=  3388.4279
   1    860.70777
   2    3414.298
   3    4118.7837
   21   -2983768.2
   22   -7348166.9
   31    4030.0591
   32    4030.0591
   33    1886.2196
   34    939.36537
   35    939.36537
   36    2586.3892
   41    4925.4944
   42    4925.4944
   43    2568.0222
   44    1766.3779
   45    1766.3779
   46    4169.7305
   47    2029.0354
   48    2029.0354
   49    4418.8082

BLOCK MASS
   6    173.2
   23    91.1876
   24    80.429995
   15    1.777
   25    122.83964
   35    2148.348
   36    2148.3191
   37    2150.2516
   1000001    5038.0325
   2000001    2183.8504
   1000002    5037.3912
   2000002    1923.7536
   1000003    5038.0314
   2000003    2183.8503
   1000004    5037.3901
   2000004    1923.7542
   1000005    2732.5042
   2000005    4518.078
   1000006    2727.8361
   2000006    4208.9931
   1000011    4050.0383
   2000011    956.26105
   1000012    4048.8425
   1000013    4050.0356
   2000013    956.25825
   1000014    4048.839
   1000015    1917.1001
   2000015    2588.4212
   1000016    1915.4982
   1000021    4272.0371
   1000022    849.18778
   1000023    2738.4145
   1000025   -2743.1795
   1000035    3446.3425
   1000024    2739.1552
   1000037    3446.5526

BLOCK ALPHA
      -0.056151916

BLOCK HMIX Q=  3388.4279
   1   -2731.7785
   2    17.117327
   3    243.13721
   4    4615275.1

BLOCK STOPMIX
   1   1    0.99811153
   1   2    0.061427744
   2   1   -0.061427744
   2   2    0.99811153

BLOCK SBOTMIX
   1   1   -0.99997489
   1   2    0.0070864186
   2   1   -0.0070864186
   2   2   -0.99997489

BLOCK STAUMIX
   1   1   -0.99972674
   1   2    0.02337616
   2   1   -0.02337616
   2   2   -0.99972674

BLOCK NMIX
   1   1   -0.99983727
   1   2    0.00011032325
   1   3    0.017454787
   1   4    0.0045547413
   2   1    0.015535878
   2   2    0.073822423
   2   3    0.70559326
   2   4    0.70458997
   3   1   -0.009118989
   3   2    0.0094697127
   3   3   -0.7069379
   3   4    0.70715343
   4   1    0.00095287951
   4   2   -0.99722643
   4   3    0.04552229
   4   4    0.058874875

BLOCK UMIX
   1   1   -0.06549481
   1   2   -0.99785291
   2   1    0.99785291
   2   2   -0.06549481

BLOCK VMIX
   1   1   -0.084616224
   1   2    0.99641362
   2   1    0.99641362
   2   2    0.084616224

BLOCK HIGGSBOUNDSINPUTHIGGSCOUPLINGSFERMIONS
       0, 293.00288,3,36,15,15

BLOCK HIGGSBOUNDSINPUTHIGGSCOUPLINGSBOSONS
       0,4,36,21,21,23

BLOCK SPHENOLOWENERGY
   1    0.00033556697
   2    1.5894712e-06
   3    3.5271197e-05
   4    2.5255619e-15
   5    1.0788923e-10
   6    2.2591327e-08
   7    8.5300725e-14
   8    3.6440474e-09
   9    7.731277e-07
   10    9.6324066e-05
   11    0.99499072
   12    0.5419899
   13    19.363164
   14    0
   15    0
   16    0.0021573472
   17    2.281659e-15
   18    2.4810492e-11
   19    8.2931388e-11
   20   -3.7861643e-16
   21   -1.618705e-11
   22   -8.6046087e-09
   23    0
   24    0
   25    0
   26    0
   27    0
   28    0
   29    0
   30    0
   31    0
   39    3.8577513e-05
   40    0
   41    0
   42    0

BLOCK FWCOEF Q=  160
   305   4422   0   0   -0.18881911
   305   4422   0   2   -0.20496248
   305   4322   0   2   -0.00028979257
   305   6421   0   0   -0.095227835
   305   6421   0   2   -0.11210942
   305   6321   0   2   -0.00031258898
   3051111   4133   0   0    1.6205377
   3051111   4133   0   2    1.620806
   3051111   4233   0   2    5.4470736e-05
   3051111   4137   0   0   -4.4432298
   3051111   4137   0   2   -4.4434046
   3051111   4237   0   2   -0.00040712051
   3051313   4133   0   0    1.6205377
   3051313   4133   0   2    1.6208059
   3051313   4233   0   2    5.4470683e-05
   3051313   4137   0   0   -4.4432298
   3051313   4137   0   2   -4.4434047
   3051313   4237   0   2   -0.0004071205
   3051212   4137   0   0    1.5053501
   3051212   4137   0   2    1.5053891
   3051212   4237   0   2    8.8158237e-05
   3051414   4137   0   0    1.5053501
   3051414   4137   0   2    1.5053891
   3051414   4237   0   2    8.8158246e-05
   3051616   4137   0   0    1.5053501
   3051616   4137   0   2    1.5053887
   3051616   4237   0   2    8.8160814e-05

BLOCK IMFWCOEF Q=  160
   305   4422   0   0    3.8578454e-07
   305   4422   0   2   -3.9751682e-06
   305   4322   0   2   -1.1601675e-06
   305   6421   0   0    3.3044997e-07
   305   6421   0   2    2.3149814e-06
   305   6321   0   2   -5.0649525e-07
   3051111   4133   0   2    3.2040624e-07
   3051111   4233   0   2    1.2202836e-06
   3051111   4137   0   2   -1.3213488e-06
   3051111   4237   0   2   -9.1197283e-06
   3051313   4133   0   2    3.2040576e-07
   3051313   4233   0   2    1.2202834e-06
   3051313   4137   0   2   -1.3213491e-06
   3051313   4237   0   2   -9.1197289e-06
   3051212   4137   0   2    3.0524681e-07
   3051212   4237   0   2    1.9747869e-06
   3051414   4137   0   2    3.0524681e-07
   3051414   4237   0   2    1.9747869e-06
   3051616   4137   0   2    2.9936255e-07
   3051616   4237   0   2    1.974789e-06

DECAY 23  2.4952


DECAY 24  2.085


DECAY 2000011  0.21466749
    1   2    1000022    11

DECAY 1000011  8.7757231
    0.52947953   2    1000022    11
    0.30772834   2   -1000037    12
    0.15361247   2    1000035    11
    0.0051303967   2   -1000024    12
    0.0040366635   2    1000023    11

DECAY 2000013  0.21465752
    1   2    1000022    13

DECAY 1000013  8.7801376
    0.52921316   2    1000022    13
    0.30757119   2   -1000037    14
    0.15353413   2    1000035    13
    0.0051278018   2   -1000024    14
    0.0041809924   2    1000023    13
    0.00021326691   2    2000013    25
    0.0001585411   2    1000025    13

DECAY 1000015  1.5582063
    1   2    1000022    15

DECAY 2000015  11.521164
    0.89820222   2    1000022    15
    0.050675586   2    1000016   -24
    0.026114586   2    1000015    25
    0.02500761   2    1000015    23

DECAY 1000012  8.7772749
    0.52963826   2    1000022    12
    0.30574569   2    1000037    11
    0.15337707   2    1000035    12
    0.0085508062   2    1000024    11
    0.0025659672   2    1000023    12
    0.00012220419   2    1000025    12

DECAY 1000014  8.7798042
    0.52948514   2    1000022    14
    0.30565476   2    1000037    13
    0.15333135   2    1000035    14
    0.0088404205   2    1000024    13
    0.0025652183   2    1000023    14
    0.00012216852   2    1000025    14

DECAY 1000016  1.5534462
    1   2    1000022    16

DECAY 2000001  0.87811362
    1   2    1000022    1

DECAY 1000001  50.95182
    0.61613519   2    1000021    1
    0.24529412   2   -1000037    2
    0.12256108   2    1000035    1
    0.013039627   2    1000022    1
    0.0018525976   2   -1000024    2
    0.0010908147   2    1000023    1

DECAY 2000003  0.87811394
    1   2    1000022    3

DECAY 1000003  50.954787
    0.6160978   2    1000021    3
    0.24527973   2   -1000037    4
    0.12255384   2    1000035    3
    0.013038882   2    1000022    3
    0.0018699705   2   -1000024    4
    0.0011053731   2    1000023    3

DECAY 1000005  0.3135528
    1   2    1000022    5

DECAY 2000005  14.087103
    0.28419454   2    1000021    5
    0.20746599   2   -1000024    6
    0.16661577   2    1000022    5
    0.10437271   2    1000025    5
    0.10413268   2    1000023    5
    0.057005166   2    1000006   -24
    0.046889853   2    1000005    25
    0.028414097   2    1000005    23
    0.00060859805   2   -1000037    6
    0.00029884669   2    1000035    5

DECAY 2000002  2.784067
    1   2    1000022    2

DECAY 1000002  50.92556
    0.61557142   2    1000021    2
    0.24457238   2    1000037    1
    0.12247038   2    1000035    2
    0.013012205   2    1000022    2
    0.0030928721   2    1000024    1
    0.001267484   2    1000023    2

DECAY 2000004  2.7840639
    1   2    1000022    4

DECAY 1000004  50.928111
    0.61553789   2    1000021    4
    0.24455993   2    1000037    3
    0.12246418   2    1000035    4
    0.013011549   2    1000022    4
    0.0031219589   2    1000024    3
    0.0012761535   2    1000023    4

DECAY 1000006  0.45443462
    0.74736183   2    1000022    6
    0.12996544   2    1000022    4
    0.12209948   3    1000022    24    5
    0.0003523883   3   -1000015    16    5
    0.00021959787   3    1000016   -15    5

DECAY 2000006  149.06331
    0.24751167   2    1000005    24
    0.18985583   2    1000006    25
    0.18882735   2    1000024    5
    0.12405632   2    1000006    23
    0.095612193   2    1000025    6
    0.095220778   2    1000023    6
    0.057469869   2    1000022    6
    0.00097435558   2    1000037    5
    0.00047162931   2    1000035    6

DECAY 1000024  2.0240101
    0.82685649   2    1000022    24
    0.11852034   2    1000016   -15
    0.040274816   3    1000022   -5    6
    0.0079531232   2   -1000015    16
    0.0046618432   2   -2000015    16
    0.0011230458   2   -2000013    14
    0.00018743159   2    2000004   -3
    0.0001798617   2    1000006   -5
    0.00016083293   2   -2000003    4

DECAY 1000037  42.063064
    0.17108917   2    1000016   -15
    0.17103505   2   -1000015    16
    0.14715196   2    1000006   -5
    0.13738869   2   -1000005    6
    0.095005561   2    1000025    24
    0.092886237   2    1000024    25
    0.09194196   2    1000024    23
    0.086867588   2    1000023    24
    0.0025694248   3    1000025   -5    6
    0.00188628   3    1000023   -5    6
    0.0016898758   3    1000024    6   -6
    0.00028199096   2    1000022    24
    0.00011289528   2   -2000015    16

DECAY 1000022 -1


DECAY 1000023  1.9321081
    0.60713837   2    1000022    25
    0.22196881   2    1000022    23
    0.062109027   2    1000015   -15
    0.062109027   2   -1000015    15
    0.02844562   3    1000022    6   -6
    0.0034928292   2    1000016   -16
    0.0034928292   2   -1000016    16
    0.0024352613   2    2000015   -15
    0.0024352613   2   -2000015    15
    0.0012507163   2    2000013   -13
    0.0012507163   2   -2000013    13
    0.00073241875   3    1000022    5   -5
    0.00066262671   2    2000011   -11
    0.00066262671   2   -2000011    11
    0.00039138453   2    2000004   -4
    0.00039138453   2   -2000004    4
    0.00029395852   2    2000002   -2
    0.00029395852   2   -2000002    2
    0.00012204296   2    2000003   -3
    0.00012204296   2   -2000003    3

DECAY 1000025  3.0451076
    0.48616764   2    1000022    25
    0.41378233   2    1000022    23
    0.035941241   2    1000015   -15
    0.035941241   2   -1000015    15
    0.022193871   3    1000022    6   -6
    0.0016634921   2    2000015   -15
    0.0016634921   2   -2000015    15
    0.00052079603   2    2000013   -13
    0.00052079603   2   -2000013    13
    0.00039866919   3    1000022    5   -5
    0.00014524808   2    2000011   -11
    0.00014524808   2   -2000011    11
    0.00012823981   2    2000004   -4
    0.00012823981   2   -2000004    4
    0.00010706176   2    1000016   -16
    0.00010706176   2   -1000016    16

DECAY 1000035  47.270969
    0.10308068   2    1000025    25
    0.084995264   2    1000024   -24
    0.084995264   2   -1000024    24
    0.081344835   2    1000023    25
    0.08091682   2    1000025    23
    0.076282348   2    1000016   -16
    0.076282348   2   -1000016    16
    0.075936694   2    1000015   -15
    0.075936694   2   -1000015    15
    0.066079837   2    1000005   -5
    0.066079837   2   -1000005    5
    0.060604893   2    1000006   -6
    0.060604893   2   -1000006    6
    0.0018191326   3    1000024    5   -6
    0.0018191326   3   -1000024   -5    6
    0.0013248966   2    1000023    23
    0.00081851996   3    1000025    6   -6
    0.00066359039   3    1000023    6   -6
    0.00016377289   2    1000022    25

DECAY 1000021  394.96651
    0.10173981   2    2000002   -2
    0.10173981   2   -2000002    2
    0.10173978   2    2000004   -4
    0.10173978   2   -2000004    4
    0.087346797   2    2000003   -3
    0.087346797   2   -2000003    3
    0.087346794   2    2000001   -1
    0.087346794   2   -2000001    1
    0.055892455   2    1000005   -5
    0.055892455   2   -1000005    5
    0.0550014   2    1000006   -6
    0.0550014   2   -1000006    6
    0.010697488   2    1000006   -4
    0.010697488   2   -1000006    4
    0.00011040661   3    1000022    6   -6

DECAY 25  0.0036298153
    0.60680257   2   -5    5
    0.19360138   2   -24    24
    0.073663709   2    21    21
    0.069572976   2   -15    15
    0.029808146   2   -4    4
    0.022439851   2    23    23
    0.0023291584   2    22    22
    0.0013118755   2    22    23
    0.00024132995   2   -13    13
    0.00022821268   2   -3    3
    6.3098588e-07   2   -1    1
    1.5361529e-07   2   -2    2
    5.4253937e-09   2   -11    11

DECAY 35  10.228255
    0.84427441   2   -5    5
    0.1260562   2   -15    15
    0.028544541   2   -6    6
    0.00044835287   2   -13    13
    0.00036424197   2   -3    3
    0.00024093546   2    25    25
    3.1964791e-05   2    1000022    1000022
    2.0103101e-05   2    23    23
    9.6205578e-06   2   -24    24
    5.7882833e-06   2    21    21
    1.195791e-06   2   -1000011    1000011
    1.1923666e-06   2   -1000013    1000013
    1.0071341e-06   2   -1    1
    4.0709133e-07   2   -4    4
    2.3892042e-08   2    22    22
    1.0070768e-08   2   -11    11
    4.9649987e-09   2    22    23
    2.0982185e-12   2   -2    2

DECAY 36  9.9542357
    0.84335688   2   -5    5
    0.12591907   2   -15    15
    0.029734244   2   -6    6
    0.00044786338   2   -13    13
    0.00036384433   2   -3    3
    8.6430026e-05   2    1000022    1000022
    6.1629601e-05   2    21    21
    2.8382714e-05   2    23    25
    1.006036e-06   2   -1    1
    4.1192963e-07   2   -4    4
    1.4763814e-07   2    22    22
    7.1052355e-08   2    22    23
    1.0059813e-08   2   -11    11
    2.1234452e-12   2   -2    2
    3.2006239e-37   2    25    25

DECAY 37  9.5925878
    0.85442888   2   -5    6
    0.14339059   2   -15    16
    0.0012279272   2   -5    4
    0.00050693727   2   -13    14
    0.00034721869   2   -3    4
    4.1031568e-05   2   -3    6
    2.9569077e-05   2    24    25
    1.6182432e-05   2   -3    2
    8.7686664e-06   2   -5    2
    1.8585846e-06   2   -1    6
    9.6267751e-07   2   -1    2
    6.1878459e-08   2   -1    4
    1.1857315e-08   2   -11    12
    3.822399e-12   2    24    36
    3.5455947e-12   2    24    35

DECAY 6  2.43
    1   2    5    24

DECAY 15 -1
