BLOCK SPINFO
   1   SPheno
   2   v4.0.5be

BLOCK SPHENOINFO
   1   2
   2   2

BLOCK MODSEL
   1   0

BLOCK MINPAR
   3    46.610011
   4    1

BLOCK EXTPAR
   0    2621.269
   1   -306.32655
   2   -4118.3079
   3    4811.186
   11   -3792.0567
   12   -4248.136
   13    4551.4953
   23    2376.1779
   25    45.609982
   26    4157.5764
   31    660.76429
   32    660.76429
   33    729.94623
   34    4018.8247
   35    4018.8247
   36    2063.3199
   41    3361.4827
   42    3361.4827
   43    4429.7257
   44    2039.86
   45    2039.86
   46    1475.1726
   47    2109.5453
   48    2109.5453
   49    4748.4742

BLOCK SMINPUTS
   1    127.90897
   2    1.1663787e-05
   3    0.1184
   4    91.1876
   5    4.18
   6    173.2
   7    1.777
   8    0
   11    0.00051099893
   12    0
   13    0.10565837
   14    0
   21    0.005
   22    0.0025
   23    0.095
   24    1.27

BLOCK GAUGE Q=  2621.269
   1    0.35536298
   2    0.66519887
   3    1.219778

BLOCK YU Q=  2621.269
   1   1    8.3863871e-06
   2   2    0.0042602846
   3   3    1.0131429

BLOCK YD Q=  2621.269
   1   1    0.00076862597
   2   2    0.014603893
   3   3    0.76223611

BLOCK YE Q=  2621.269
   1   1    0.00013413085
   2   2    0.027734006
   3   3    0.46644036

BLOCK AU Q=  2621.269
   1   1    0
   2   2    0
   3   3   -3792.0566

BLOCK AD Q=  2621.269
   1   1    0
   2   2    0
   3   3   -4248.1364

BLOCK AE Q=  2621.269
   1   1    0
   2   2    0
   3   3    4551.4953

BLOCK MSOFT Q=  2621.269
   1   -306.32655
   2   -4118.3079
   3    4811.186
   21    11526554
   22   -5708822.6
   31    660.76429
   32    660.76429
   33    729.94623
   34    4018.8247
   35    4018.8247
   36    2063.3199
   41    3361.4827
   42    3361.4827
   43    4429.7257
   44    2039.86
   45    2039.86
   46    1475.1726
   47    2109.5453
   48    2109.5453
   49    4748.4742

BLOCK MASS
   6    173.2
   23    91.1876
   24    80.429995
   15    1.777
   25    121.73854
   35    4156.4962
   36    4157.5764
   37    4157.4638
   1000001    3449.4566
   2000001    2141.0979
   1000002    3448.5502
   2000002    2065.2074
   1000003    3449.4549
   2000003    2141.0972
   1000004    3448.5483
   2000004    2065.2078
   1000005    4498.491
   2000005    4817.1828
   1000006    1525.406
   2000006    4504.4081
   1000011    670.54332
   2000011    4023.8915
   1000012    665.59274
   1000013    670.57042
   2000013    4023.8696
   1000014    665.62554
   1000015    740.40377
   2000015    2064.7401
   1000016    741.7228
   1000021    4749.8739
   1000022   -303.69922
   1000023   -2386.9006
   1000025    2388.6218
   1000035   -4111.5413
   1000024    2387.1522
   1000037    4111.6664

BLOCK ALPHA
      -0.02146276

BLOCK HMIX Q=  2621.269
   1    2376.1779
   2    45.609982
   3    243.40726
   4    17285442

BLOCK STOPMIX
   1   1    0.030364262
   1   2    0.9995389
   2   1   -0.9995389
   2   2    0.030364262

BLOCK SBOTMIX
   1   1    0.99731614
   1   2    0.073215498
   2   1   -0.073215498
   2   2    0.99731614

BLOCK STAUMIX
   1   1    0.99889374
   1   2    0.047024475
   2   1   -0.047024475
   2   2    0.99889374

BLOCK NMIX
   1   1   -0.99981126
   1   2    2.8579124e-05
   1   3   -0.019323536
   1   4   -0.0020122965
   2   1    0.015084393
   2   2    0.030673723
   2   3   -0.70685381
   2   4   -0.70653327
   3   1    0.012239339
   3   2   -0.0085254507
   3   3   -0.70692216
   3   4    0.70713406
   4   1   -0.00032994214
   4   2    0.99949309
   4   3    0.0156635
   4   4    0.027714749

BLOCK UMIX
   1   1   -0.021696678
   1   2    0.9997646
   2   1   -0.9997646
   2   2   -0.021696678

BLOCK VMIX
   1   1    0.038722181
   1   2    0.99925001
   2   1    0.99925001
   2   2   -0.038722181

BLOCK HIGGSBOUNDSINPUTHIGGSCOUPLINGSFERMIONS
       0, 2080.2704,3,36,15,15

BLOCK HIGGSBOUNDSINPUTHIGGSCOUPLINGSBOSONS
       0,4,36,21,21,23

BLOCK SPHENOLOWENERGY
   1    0.00031480618
   2    1.5911464e-06
   3    3.5255831e-05
   4    2.2270812e-15
   5    9.513758e-11
   6    1.9870064e-08
   7    7.4879032e-14
   8    3.1988038e-09
   9    6.7697162e-07
   10    9.6320326e-05
   11    0.99495209
   12    0.54174501
   13    19.353951
   14    0
   15    0
   16    0.0021565936
   17    2.2816515e-15
   18    2.4803982e-11
   19    8.2909324e-11
   20   -1.8158442e-15
   21   -7.764084e-11
   22   -3.4038924e-08
   23    0
   24    0
   25    0
   26    0
   27    0
   28    0
   29    0
   30    0
   31    0
   39    6.8471658e-05
   40    0
   41    0
   42    0

BLOCK FWCOEF Q=  160
   305   4422   0   0   -0.18881911
   305   4422   0   2   -0.18179842
   305   4322   0   2    0.00018770669
   305   6421   0   0   -0.095227835
   305   6421   0   2   -0.094442047
   305   6321   0   2    4.6570376e-05
   3051111   4133   0   0    1.6123943
   3051111   4133   0   2    1.6125726
   3051111   4233   0   2    0.00013478209
   3051111   4137   0   0   -4.4350864
   3051111   4137   0   2   -4.4337776
   3051111   4237   0   2   -0.0010189432
   3051313   4133   0   0    1.6123943
   3051313   4133   0   2    1.61257
   3051313   4233   0   2    0.00013478179
   3051313   4137   0   0   -4.4350864
   3051313   4137   0   2   -4.4337802
   3051313   4237   0   2   -0.0010189437
   3051212   4137   0   0    1.5053501
   3051212   4137   0   2    1.5050663
   3051212   4237   0   2    0.00022104651
   3051414   4137   0   0    1.5053501
   3051414   4137   0   2    1.5050663
   3051414   4237   0   2    0.00022104654
   3051616   4137   0   0    1.5053501
   3051616   4137   0   2    1.5050663
   3051616   4237   0   2    0.0002210564

BLOCK IMFWCOEF Q=  160
   305   4422   0   0    3.8588784e-07
   305   4422   0   2   -1.1010799e-06
   305   4322   0   2    4.6469099e-06
   305   6421   0   0    3.3053846e-07
   305   6421   0   2   -3.2484418e-06
   305   6321   0   2    2.5751639e-06
   3051111   4133   0   2   -9.7818574e-07
   3051111   4233   0   2    2.9682845e-06
   3051111   4137   0   2    7.6571658e-06
   3051111   4237   0   2   -2.24403e-05
   3051313   4133   0   2   -9.7816636e-07
   3051313   4233   0   2    2.9682822e-06
   3051313   4137   0   2    7.6571835e-06
   3051313   4237   0   2   -2.2440311e-05
   3051212   4137   0   2   -1.6588925e-06
   3051212   4237   0   2    4.8681215e-06
   3051414   4137   0   2   -1.6588932e-06
   3051414   4237   0   2    4.8681215e-06
   3051616   4137   0   2   -1.6590668e-06
   3051616   4237   0   2    4.868122e-06

DECAY 23  2.4952


DECAY 24  2.085


DECAY 1000011  0.5319255
    0.99999999   2    1000022    11

DECAY 2000011  19.984558
    0.99983966   2    1000022    11

DECAY 1000013  0.53197198
    0.99999999   2    1000022    13

DECAY 2000013  20.046568
    0.99674241   2    1000022    13
    0.0012893803   2   -1000024    14
    0.00074110675   2    1000023    13
    0.0007071823   2    1000025    13
    0.00051991831   2    1000013    25

DECAY 1000015  0.65076379
    1   2    1000022    15

DECAY 2000015  27.605261
    0.35880492   2    1000022    15
    0.31481408   2    1000016   -24
    0.16937682   2    1000015    25
    0.15700418   2    1000015    23

DECAY 1000012  0.52404929
    1   2    1000022    12

DECAY 1000014  0.52410226
    1   2    1000022    14

DECAY 1000016  0.64532784
    1   2    1000022    16

DECAY 2000001  1.1473104
    1   2    1000022    1

DECAY 1000001  0.48158996
    0.98421872   2    1000022    1
    0.0080595229   2   -1000024    2
    0.006719349   2    1000023    1
    0.00099018643   2    1000025    1

DECAY 2000003  1.1473131
    1   2    1000022    3

DECAY 1000003  0.48800457
    0.97129201   2    1000022    3
    0.010688318   2    1000023    3
    0.0086404458   2   -1000024    4
    0.0050270174   2    1000025    3
    0.0043522115   2    2000003    25

DECAY 1000005  115.03838
    0.40569036   2   -1000024    6
    0.34180345   2    1000006   -24
    0.11694676   2    1000023    5
    0.11622973   2    1000025    5
    0.0086274023   2   -1000037    6
    0.0060782708   2    1000022    5
    0.0046240298   2    1000035    5

DECAY 2000005  68.698831
    0.46381901   2   -1000024    6
    0.23083604   2    1000025    5
    0.22990361   2    1000023    5
    0.038218164   2    1000022    5
    0.01232874   2    1000005    25
    0.010611888   2    2000006   -24
    0.0054366157   2    1000005    23
    0.0042137003   2    1000021    5
    0.0039807681   2    1000006   -24
    0.00043059135   2   -1000037    6
    0.00022086923   2    1000035    5

DECAY 2000002  4.4129825
    1   2    1000022    2

DECAY 1000002  0.49066554
    0.96513246   2    1000022    2
    0.025187761   2    1000024    1
    0.0093425951   2    1000023    2
    0.0003371793   2    1000025    2

DECAY 2000004  4.4129793
    1   2    1000022    4

DECAY 1000004  0.49496339
    0.95675119   2    1000022    4
    0.032967079   2    1000024    3
    0.0096060952   2    1000023    4
    0.00067545779   2    1000025    4

DECAY 1000006  3.0546275
    0.99974178   2    1000022    6
    0.00013159383   3    1000016   -15    5

DECAY 2000006  126.09121
    0.23391241   2    1000006    25
    0.21446612   2    1000024    5
    0.18865424   2    1000023    6
    0.18824146   2    1000025    6
    0.15733613   2    1000006    23
    0.0086950243   2    1000037    5
    0.0050079718   2    1000022    6
    0.0036866514   2    1000035    6

DECAY 1000024  31.879016
    0.80041638   2    1000006   -5
    0.13259334   2    1000016   -15
    0.052165681   2    1000022    24
    0.010224141   2   -2000015    16
    0.0021842447   3    1000022   -5    6
    0.00090732041   2    1000014   -13
    0.00080375379   2   -1000015    16
    0.00042035325   2    1000012   -11
    0.00013163627   2   -1000011    12
    0.00013163445   2   -1000013    14

DECAY 1000037  151.51468
    0.11312224   2   -1000011    12
    0.11312174   2   -1000013    14
    0.11309668   2    1000012   -11
    0.11309619   2    1000014   -13
    0.11165833   2    1000016   -15
    0.11136424   2   -1000015    16
    0.050620107   2    1000024    25
    0.04749403   2    1000023    24
    0.044608946   2    1000025    24
    0.044587283   2    1000024    23
    0.031464052   2    1000004   -3
    0.031463877   2    1000002   -1
    0.031417847   2   -1000003    4
    0.031417777   2   -1000001    2
    0.0036684522   3    1000024    6   -6
    0.0027910894   3    1000023   -5    6
    0.0025254676   3    1000025   -5    6
    0.0021248556   2    1000006   -5
    0.00025852152   2   -2000015    16

DECAY 1000022 -1


DECAY 1000023  31.888775
    0.40232888   2    1000006   -6
    0.40232888   2   -1000006    6
    0.066534945   2    1000015   -15
    0.066534945   2   -1000015    15
    0.027941533   2    1000022    25
    0.020710691   2    1000022    23
    0.0051114591   2    2000015   -15
    0.0051114591   2   -2000015    15
    0.0015978093   3    1000022    6   -6
    0.0004524525   2    1000013   -13
    0.0004524525   2   -1000013    13
    0.00020966163   2    1000011   -11
    0.00020966163   2   -1000011    11

DECAY 1000025  32.220286
    0.39764009   2    1000006   -6
    0.39764009   2   -1000006    6
    0.065388428   2    1000015   -15
    0.065388428   2   -1000015    15
    0.031210277   2    1000022    23
    0.030200981   2    1000022    25
    0.0051321444   2    2000015   -15
    0.0051321444   2   -2000015    15
    0.0015538006   3    1000022    6   -6
    0.0002410819   2    1000013   -13
    0.0002410819   2   -1000013    13

DECAY 1000035  158.1772
    0.054210136   2    1000012   -12
    0.054210136   2   -1000012    12
    0.054209848   2    1000014   -14
    0.054209848   2   -1000014    14
    0.054128383   2    1000011   -11
    0.054128383   2   -1000011    11
    0.054128185   2    1000013   -13
    0.054128185   2   -1000013    13
    0.053506794   2    1000016   -16
    0.053506794   2   -1000016    16
    0.053296901   2    1000015   -15
    0.053296901   2   -1000015    15
    0.049158657   2    1000025    25
    0.045016414   2    1000023    25
    0.041755689   2    1000024   -24
    0.041755689   2   -1000024    24
    0.04104776   2    1000025    23
    0.015070121   2    1000004   -4
    0.015070121   2   -1000004    4
    0.015070049   2    1000002   -2
    0.015070049   2   -1000002    2
    0.015036082   2    1000003   -3
    0.015036082   2   -1000003    3
    0.015036009   2    1000001   -1
    0.015036009   2   -1000001    1
    0.0031666868   2    1000023    23
    0.0025858691   3    1000024    5   -6
    0.0025858691   3   -1000024   -5    6
    0.0016306824   3    1000025    6   -6
    0.0014883268   3    1000023    6   -6
    0.0010385305   2    1000006   -6
    0.0010385305   2   -1000006    6
    0.00012502695   2    2000015   -15
    0.00012502695   2   -2000015    15

DECAY 1000021  604.62365
    0.093028798   2    1000006   -6
    0.093028798   2   -1000006    6
    0.076463314   2    2000002   -2
    0.076463314   2   -2000002    2
    0.076463297   2    2000004   -4
    0.076463297   2   -2000004    4
    0.073818464   2    2000003   -3
    0.073818464   2   -2000003    3
    0.07381844   2    2000001   -1
    0.07381844   2   -2000001    1
    0.025999363   2    1000004   -4
    0.025999363   2   -1000004    4
    0.025999309   2    1000002   -2
    0.025999309   2   -1000002    2
    0.025968901   2    1000003   -3
    0.025968901   2   -1000003    3
    0.025968844   2    1000001   -1
    0.025968844   2   -1000001    1
    0.0012313744   2    1000005   -5
    0.0012313744   2   -1000005    5
    0.00088282867   2    2000006   -6
    0.00088282867   2   -2000006    6
    0.00013392923   2    1000006   -4
    0.00013392923   2   -1000006    4
    0.00010572166   3    1000024    5   -6
    0.00010572166   3   -1000024   -5    6

DECAY 25  0.0034914076
    0.62105102   2   -5    5
    0.17807361   2   -24    24
    0.074792474   2    21    21
    0.071081564   2   -15    15
    0.030775536   2   -4    4
    0.020184687   2    23    23
    0.0023337169   2    22    22
    0.0012270223   2    22    23
    0.00024653931   2   -13    13
    0.00023302947   2   -3    3
    6.4430139e-07   2   -1    1
    1.5860427e-07   2   -2    2
    5.5425205e-09   2   -11    11

DECAY 35  92.276585
    0.66852438   2   -5    5
    0.13838983   2   -15    15
    0.083293783   2   -2000015    1000015
    0.083293783   2   -1000015    2000015
    0.012566651   2    1000022    1000025
    0.01068588   2    1000022    1000023
    0.0011490545   2   -1000015    1000015
    0.00078392211   2   -1000006    1000006
    0.00049677471   2   -6    6
    0.00047062176   2   -13    13
    0.00017200598   2   -3    3
    0.00013089629   2   -2000015    2000015
    3.4653065e-05   2    1000022    1000022
    5.1699303e-06   2    21    21
    1.6433195e-06   2    25    25
    4.755008e-07   2   -1    1
    3.0585777e-08   2   -1000011    1000011
    3.0149619e-08   2   -1000013    1000013
    2.9900353e-08   2   -1000002    1000002
    2.9896745e-08   2   -1000004    1000004
    1.9513703e-08   2    22    22
    1.5107224e-08   2    23    23
    1.0568733e-08   2   -11    11
    4.4501838e-09   2   -4    4
    3.0530097e-09   2   -24    24
    7.9853794e-10   2    22    23
    2.2917544e-14   2   -2    2

DECAY 36  86.777654
    0.65884561   2   -5    5
    0.13639435   2   -15    15
    0.08947841   2   -2000015    1000015
    0.08947841   2   -1000015    2000015
    0.013446778   2    1000022    1000023
    0.011307711   2    1000022    1000025
    0.00046383531   2   -13    13
    0.00036691297   2   -6    6
    0.00016951254   2   -3    3
    3.7330144e-05   2    1000022    1000022
    1.0575878e-05   2    21    21
    4.6860455e-07   2   -1    1
    3.5376954e-08   2    23    25
    2.4937436e-08   2    22    22
    2.1618154e-08   2    22    23
    1.0416308e-08   2   -11    11
    3.0367605e-09   2   -4    4
    1.8624514e-14   2    23    35
    1.5637569e-14   2   -2    2
    9.8709509e-38   2    25    25

DECAY 37  112.13565
    0.67944625   2   -5    6
    0.16107885   2   -15    16
    0.13807929   2   -2000015    1000016
    0.019199042   2    1000022    1000024
    0.0010072416   2   -5    4
    0.00056947105   2   -13    14
    0.00046507694   2   -1000015    1000016
    0.00013921693   2   -3    4
    7.1927435e-06   2   -5    2
    6.5438659e-06   2   -3    2
    1.1353799e-06   2   -3    6
    3.8614034e-07   2   -1    2
    9.8940058e-08   2   -1000011    1000012
    9.8435695e-08   2   -1000013    1000014
    4.2555522e-08   2   -1    6
    2.7383526e-08   2    24    25
    1.8486035e-08   2   -1    4
    1.3319987e-08   2   -11    12
    3.2755627e-10   2   -1000003    1000006
    3.4858046e-13   2   -1000003    1000004
    4.1601144e-14   2   -1000001    1000006
    5.1635405e-17   2   -1000001    1000004
    9.7937928e-20   2   -1000003    1000002
    5.0710702e-21   2   -1000001    1000002

DECAY 6  2.43
    1   2    5    24

DECAY 15 -1
