BLOCK SPINFO
   1   SPheno
   2   v4.0.5be

BLOCK SPHENOINFO
   1   2
   2   2

BLOCK MODSEL
   1   0

BLOCK MINPAR
   3    5.7738239
   4   -1

BLOCK EXTPAR
   0    4672.4866
   1   -865.21264
   2   -1163.6012
   3    4011.1246
   11   -6757.9114
   12   -315.90366
   13    6540.9906
   23   -1162.8916
   25    5.4702668
   26    2775.7161
   31    4514.7247
   32    4514.7247
   33    3792.8914
   34    4216.0137
   35    4216.0137
   36    1576.3742
   41    1461.4601
   42    1461.4601
   43    4927.0659
   44    2424.4007
   45    2424.4007
   46    4345.662
   47    1809.7953
   48    1809.7953
   49    4882.8475

BLOCK SMINPUTS
   1    127.90897
   2    1.1663787e-05
   3    0.1184
   4    91.1876
   5    4.18
   6    173.2
   7    1.777
   8    0
   11    0.00051099893
   12    0
   13    0.10565837
   14    0
   21    0.005
   22    0.0025
   23    0.095
   24    1.27

BLOCK GAUGE Q=  4672.4866
   1    0.35536298
   2    0.66519887
   3    1.219778

BLOCK YU Q=  4672.4866
   1   1    8.5233161e-06
   2   2    0.0043298446
   3   3    1.0296851

BLOCK YD Q=  4672.4866
   1   1    9.3690887e-05
   2   2    0.0017801269
   3   3    0.092912002

BLOCK YE Q=  4672.4866
   1   1    1.6349745e-05
   2   2    0.0033806087
   3   3    0.056856277

BLOCK AU Q=  4672.4866
   1   1    0
   2   2    0
   3   3   -6757.9191

BLOCK AD Q=  4672.4866
   1   1    0
   2   2    0
   3   3   -315.90355

BLOCK AE Q=  4672.4866
   1   1    0
   2   2    0
   3   3    6540.9877

BLOCK MSOFT Q=  4672.4866
   1   -865.21264
   2   -1163.6012
   3    4011.1246
   21    6060612.9
   22   -653839.81
   31    4514.7247
   32    4514.7247
   33    3792.8914
   34    4216.0137
   35    4216.0137
   36    1576.3742
   41    1461.4601
   42    1461.4601
   43    4927.0659
   44    2424.4007
   45    2424.4007
   46    4345.662
   47    1809.7953
   48    1809.7953
   49    4882.8475

BLOCK MASS
   6    173.2
   23    91.1876
   24    80.429995
   15    1.777
   25    122.49453
   35    2775.6091
   36    2775.7161
   37    2776.8592
   1000001    1769.5392
   2000001    2071.1507
   1000002    1767.8282
   2000002    2642.3822
   1000003    1769.5385
   2000003    2071.1505
   1000004    1767.8277
   2000004    2642.3815
   1000005    4993.9358
   2000005    5014.6184
   1000006    4357.5752
   2000006    5010.156
   1000011    4523.3924
   2000011    4225.0514
   1000012    4522.3389
   1000013    4523.3917
   2000013    4225.05
   1000014    4522.3382
   1000015    1593.0627
   2000015    3799.9807
   1000016    3798.8042
   1000021    4181.3555
   1000022   -847.89987
   1000023   -1124.6485
   1000025    1177.2324
   1000035   -1253.3751
   1000024    1122.3449
   1000037    1251.9565

BLOCK ALPHA
      -0.17199111

BLOCK HMIX Q=  4672.4866
   1   -1162.8916
   2    5.4702668
   3    242.78633
   4    7704599.7

BLOCK STOPMIX
   1   1    0.15204644
   1   2    0.98837335
   2   1   -0.98837335
   2   2    0.15204644

BLOCK SBOTMIX
   1   1   -0.99825183
   1   2    0.05910398
   2   1   -0.05910398
   2   2   -0.99825183

BLOCK STAUMIX
   1   1   -0.0019302596
   1   2    0.99999814
   2   1   -0.99999814
   2   2   -0.0019302596

BLOCK NMIX
   1   1    0.99314143
   1   2   -0.019341509
   1   3   -0.090083593
   1   4    0.07197886
   2   1   -0.097875555
   2   2   -0.67263604
   2   3   -0.52702967
   2   4    0.51011847
   3   1    0.012443877
   3   2   -0.018868196
   3   3    0.70646174
   3   4    0.70739024
   4   1   -0.062734597
   4   2    0.73947999
   4   3   -0.46372026
   4   4    0.4839393

BLOCK UMIX
   1   1   -0.64813434
   1   2   -0.76152602
   2   1   -0.76152602
   2   2    0.64813434

BLOCK VMIX
   1   1    0.67636163
   1   2    0.73656972
   2   1    0.73656972
   2   2   -0.67636163

BLOCK HIGGSBOUNDSINPUTHIGGSCOUPLINGSFERMIONS
       0, 29.923819,3,36,15,15

BLOCK HIGGSBOUNDSINPUTHIGGSCOUPLINGSBOSONS
       0,4,36,21,21,23

BLOCK SPHENOLOWENERGY
   1    0.00032884934
   2    1.5898139e-06
   3    3.5265959e-05
   4    2.5209407e-15
   5    1.0769173e-10
   6    2.2544406e-08
   7    8.5069172e-14
   8    3.6341524e-09
   9    7.7084128e-07
   10    9.6781055e-05
   11    0.99971125
   12    0.54231608
   13    19.377287
   14    0
   15    0
   16    0.0021586265
   17    2.281672e-15
   18    2.4811833e-11
   19    8.2922825e-11
   20    1.3833011e-16
   21    5.9140401e-12
   22    2.1917326e-09
   23    0
   24    0
   25    0
   26    0
   27    0
   28    0
   29    0
   30    0
   31    0
   39   -0.00028719829
   40    0
   41    0
   42    0

BLOCK FWCOEF Q=  160
   305   4422   0   0   -0.18881911
   305   4422   0   2   -0.19777793
   305   4322   0   2   -0.0001968738
   305   6421   0   0   -0.095227835
   305   6421   0   2   -0.10575926
   305   6321   0   2   -0.00022080562
   3051111   4133   0   0    1.6316137
   3051111   4133   0   2    1.6317514
   3051111   4233   0   2    8.233113e-06
   3051111   4137   0   0   -4.4543058
   3051111   4137   0   2   -4.4539303
   3051111   4237   0   2   -6.1060154e-05
   3051313   4133   0   0    1.6316137
   3051313   4133   0   2    1.6317514
   3051313   4233   0   2    8.2331127e-06
   3051313   4137   0   0   -4.4543058
   3051313   4137   0   2   -4.4539303
   3051313   4237   0   2   -6.1060154e-05
   3051212   4137   0   0    1.5053501
   3051212   4137   0   2    1.5052741
   3051212   4237   0   2    1.3190113e-05
   3051414   4137   0   0    1.5053501
   3051414   4137   0   2    1.5052741
   3051414   4237   0   2    1.3190113e-05
   3051616   4137   0   0    1.5053501
   3051616   4137   0   2    1.5052742
   3051616   4237   0   2    1.3190162e-05

BLOCK IMFWCOEF Q=  160
   305   4422   0   0    3.8581688e-07
   305   4422   0   2    1.7326714e-06
   305   4322   0   2   -8.2096858e-07
   305   6421   0   0    3.3047767e-07
   305   6421   0   2    3.2710169e-06
   305   6321   0   2   -4.4743088e-07
   3051111   4133   0   2   -1.1205297e-06
   3051111   4233   0   2    1.6483074e-07
   3051111   4137   0   2    1.184581e-05
   3051111   4237   0   2   -1.221308e-06
   3051313   4133   0   2   -1.1205299e-06
   3051313   4233   0   2    1.6483074e-07
   3051313   4137   0   2    1.184581e-05
   3051313   4237   0   2   -1.221308e-06
   3051212   4137   0   2   -2.4661577e-06
   3051212   4237   0   2    2.6382232e-07
   3051414   4137   0   2   -2.4661577e-06
   3051414   4237   0   2    2.6382232e-07
   3051616   4137   0   2   -2.4640858e-06
   3051616   4237   0   2    2.63823e-07

DECAY 23  2.4952


DECAY 24  2.085


DECAY 2000011  19.534349
    0.98731159   2    1000022    11
    0.008987795   2    1000023    11
    0.0035574474   2    1000035    11
    0.00014317118   2    1000025    11

DECAY 1000011  56.934576
    0.34583349   2   -1000037    12
    0.2587385   2   -1000024    12
    0.16175243   2    1000023    11
    0.14854963   2    1000035    11
    0.085080565   2    1000022    11

DECAY 2000013  19.535976
    0.98722938   2    1000022    13
    0.0089988243   2    1000023    13
    0.0035659382   2    1000035    13
    0.00016403555   2    1000025    13

DECAY 1000013  56.935463
    0.34582804   2   -1000037    14
    0.25873443   2   -1000024    14
    0.16175432   2    1000023    13
    0.14855057   2    1000035    13
    0.08507936   2    1000022    13

DECAY 1000015  4.1227869
    0.98384457   2    1000022    15
    0.00646434   2    1000023    15
    0.0037974587   2   -1000024    16
    0.0026115141   2    1000025    15
    0.0018356186   2    1000035    15
    0.0014464943   2   -1000037    16

DECAY 2000015  45.284329
    0.34052882   2   -1000037    16
    0.25843111   2   -1000024    16
    0.16279262   2    1000023    15
    0.14716688   2    1000035    15
    0.087185716   2    1000022    15
    0.0022486035   2    1000025    15
    0.00085750329   2    1000015    23
    0.00078874821   2    1000015    25

DECAY 1000012  56.945621
    0.32337489   2    1000037    11
    0.28162873   2    1000024    11
    0.17800715   2    1000035    12
    0.11839321   2    1000023    12
    0.098398241   2    1000022    12
    0.00019777985   2    1000025    12

DECAY 1000014  56.946504
    0.32337632   2    1000037    13
    0.2816335   2    1000024    13
    0.17800436   2    1000035    14
    0.11839135   2    1000023    14
    0.098396699   2    1000022    14
    0.00019777674   2    1000025    14

DECAY 1000016  45.300848
    0.32004076   2    1000037    15
    0.28390732   2    1000024    15
    0.17514106   2    1000035    16
    0.11823364   2    1000023    16
    0.1007676   2    1000022    16
    0.0017132515   2    1000015    24
    0.00019636813   2    1000025    16

DECAY 1000001  7.0478993
    0.33170653   2   -1000024    2
    0.31971706   2   -1000037    2
    0.16855653   2    1000023    1
    0.15462033   2    1000035    1
    0.025246913   2    1000022    1
    0.00015264356   2    1000025    1

DECAY 2000001  0.79766606
    0.99070019   2    1000022    1
    0.0069049436   2    1000023    1
    0.0022916835   2    1000035    1
    0.00010296313   2    1000025    1

DECAY 1000003  7.0481075
    0.33170499   2   -1000024    4
    0.31972448   2   -1000037    4
    0.16855316   2    1000023    3
    0.15461606   2    1000035    3
    0.025246237   2    1000022    3
    0.00015507453   2    1000025    3

DECAY 2000003  0.79779022
    0.99054691   2    1000022    3
    0.0069262743   2    1000023    3
    0.002305348   2    1000035    3
    0.00014025014   2    1000025    3

DECAY 1000005  214.22347
    0.31325832   2   -1000024    6
    0.3040125   2   -1000037    6
    0.16435434   2    1000021    5
    0.12084273   2    1000006   -24
    0.050582872   2    1000035    5
    0.041267802   2    1000023    5
    0.0038972453   2    1000022    5
    0.0017841934   2    1000025    5

DECAY 2000005  41.577382
    0.88447134   2    1000021    5
    0.062100691   2    1000022    5
    0.020914527   2   -1000037    6
    0.0094382166   2    1000025    5
    0.0089625633   2    1000035    5
    0.008883302   2   -1000024    6
    0.0028371207   2    1000023    5
    0.0023922372   2    1000006   -24

DECAY 1000002  7.0836516
    0.35812233   2    1000024    1
    0.2961549   2    1000037    1
    0.18535757   2    1000023    2
    0.14411465   2    1000035    2
    0.016156197   2    1000022    2

DECAY 2000002  4.7357898
    0.9889271   2    1000022    2
    0.0080035122   2    1000023    2
    0.002945436   2    1000035    2
    0.00012395334   2    1000025    2

DECAY 1000004  7.0838723
    0.35811344   2    1000024    3
    0.29614739   2    1000037    3
    0.18536383   2    1000023    4
    0.14411061   2    1000035    4
    0.016155801   2    1000022    4
    0.00010891417   2    1000025    4

DECAY 2000004  4.7370472
    0.9886651   2    1000022    4
    0.0080370795   2    1000023    4
    0.0029735316   2    1000035    4
    0.00019090869   2    1000025    4

DECAY 1000006  165.0952
    0.2572439   2    1000037    5
    0.23575482   2    1000025    6
    0.21246882   2    1000024    5
    0.13348761   2    1000035    6
    0.10529081   2    1000023    6
    0.052744964   2    1000022    6
    0.0029898764   2    1000021    6

DECAY 2000006  222.1868
    0.21413068   2    1000025    6
    0.17415652   2    1000023    6
    0.15047875   2    1000021    6
    0.12888371   2    1000024    5
    0.1194156   2    1000035    6
    0.086079599   2    1000006    25
    0.060975946   2    1000006    23
    0.057861019   2    1000037    5
    0.0080181665   2    1000022    6

DECAY 1000024  0.53363289
    0.99938303   2    1000022    24
    0.00061667906   3    1000022   -5    6

DECAY 1000037  2.5281391
    0.72097242   2    1000023    24
    0.17677587   2    1000024    23
    0.09815088   2    1000022    24
    0.0025416887   2    1000024    25
    0.00041833876   3    1000025   -1    2
    0.00041805069   3    1000025   -3    4
    0.00030392498   3    1000022   -5    6
    0.00013944283   3    1000025   -11    12
    0.00013944227   3    1000025   -13    14
    0.00013912275   3    1000025   -15    16

DECAY 1000022 -1


DECAY 1000023  0.42716873
    0.98792107   2    1000022    25
    0.012076976   2    1000022    23

DECAY 1000025  1.245639
    0.72008338   2    1000022    23
    0.27820631   2    1000022    25
    0.00016730903   3    1000023    12   -12
    0.00013763012   3    1000024    1   -2
    0.00013763012   3   -1000024   -1    2
    0.00013733243   3    1000024    3   -4
    0.00013733243   3   -1000024   -3    4
    0.00012509323   3    1000023    1   -1
    0.00012508926   3    1000023    3   -3
    0.00011765182   3    1000023    5   -5

DECAY 1000035  3.5406207
    0.46443027   2    1000024   -24
    0.46443027   2   -1000024    24
    0.064389091   2    1000022    25
    0.0021442413   2    1000023    25
    0.0015554209   2    1000022    23
    0.00061205162   3    1000025    12   -12
    0.00045774126   3    1000025    1   -1
    0.00045773644   3    1000025    3   -3
    0.00044768438   3    1000025    5   -5
    0.00035692042   3    1000025    2   -2
    0.00035603678   3    1000025    4   -4
    0.00010328767   3    1000025    11   -11
    0.00010328581   3    1000025    13   -13
    0.00010273588   3    1000025    15   -15

DECAY 1000021  564.60614
    0.07392377   2    1000004   -4
    0.07392377   2   -1000004    4
    0.073923756   2    1000002   -2
    0.073923756   2   -1000002    2
    0.073861473   2    1000003   -3
    0.073861473   2   -1000003    3
    0.073861451   2    1000001   -1
    0.073861451   2   -1000001    1
    0.0624198   2    2000003   -3
    0.0624198   2   -2000003    3
    0.062419792   2    2000001   -1
    0.062419792   2   -2000001    1
    0.039543206   2    2000004   -4
    0.039543206   2   -2000004    4
    0.039543186   2    2000002   -2
    0.039543186   2   -2000002    2
    0.00021445497   3    1000025    6   -6
    0.000137063   3    1000024    5   -6
    0.000137063   3   -1000024   -5    6
    0.00013140332   3    1000023    6   -6
    0.00010734133   3    1000037    5   -6
    0.00010734133   3   -1000037   -5    6

DECAY 25  0.0035773112
    0.6107424   2   -5    5
    0.18910683   2   -24    24
    0.074128211   2    21    21
    0.070014945   2   -15    15
    0.030137689   2   -4    4
    0.021766027   2    23    23
    0.0023412391   2    22    22
    0.0012895539   2    22    23
    0.00024282948   2   -13    13
    0.00022947506   2   -3    3
    6.3447565e-07   2   -1    1
    1.5531447e-07   2   -2    2
    5.4591097e-09   2   -11    11

DECAY 35  20.45158
    0.20114748   2   -1000024    1000037
    0.20114748   2   -1000037    1000024
    0.15315941   2   -6    6
    0.10541831   2    1000025    1000035
    0.089063676   2    1000023    1000025
    0.076197842   2    1000022    1000025
    0.052129082   2   -5    5
    0.046893951   2   -1000024    1000024
    0.018311902   2    1000023    1000023
    0.016292235   2   -1000037    1000037
    0.015439464   2    1000022    1000023
    0.009493093   2   -15    15
    0.0093704232   2    1000035    1000035
    0.0040789301   2    1000022    1000035
    0.0010611154   2    1000022    1000022
    0.00038949313   2    25    25
    0.00015110931   2    1000023    1000035
    8.3764711e-05   2    1000025    1000025
    5.4381691e-05   2    23    23
    4.0638179e-05   2    21    21
    3.2727868e-05   2   -13    13
    2.1891154e-05   2   -3    3
    1.8213452e-05   2   -24    24
    2.2527179e-06   2   -4    4
    5.6938066e-07   2    22    23
    5.112851e-07   2    22    22
    6.0525092e-08   2   -1    1
    7.3506586e-10   2   -11    11
    1.1614256e-11   2   -2    2

DECAY 36  20.159895
    0.24317285   2   -1000024    1000024
    0.16479524   2   -1000037    1000037
    0.14905898   2   -6    6
    0.098223313   2    1000023    1000023
    0.092675653   2    1000035    1000035
    0.059760465   2    1000022    1000023
    0.051516862   2   -5    5
    0.030093422   2   -1000024    1000037
    0.030093422   2   -1000037    1000024
    0.020696347   2    1000022    1000035
    0.017987244   2    1000022    1000025
    0.014381409   2    1000023    1000025
    0.0140388   2    1000025    1000035
    0.0093814797   2   -15    15
    0.0030833517   2    1000022    1000022
    0.00068302963   2    1000023    1000035
    0.00014216753   2    1000025    1000025
    8.5175279e-05   2    23    25
    7.1649324e-05   2    21    21
    3.2343196e-05   2   -13    13
    2.1631857e-05   2   -3    3
    2.1598582e-06   2   -4    4
    1.7029757e-06   2    22    23
    1.2444299e-06   2    22    22
    5.9807961e-08   2   -1    1
    7.2643055e-10   2   -11    11
    1.1136719e-11   2   -2    2
    2.0759444e-35   2    25    25

DECAY 37  20.539562
    0.2485487   2    1000023    1000037
    0.21316513   2    1000024    1000035
    0.2109508   2   -5    6
    0.12276515   2    1000024    1000025
    0.10699823   2    1000025    1000037
    0.067635222   2    1000022    1000024
    0.019017882   2    1000022    1000037
    0.009013322   2   -15    16
    0.0011111348   2    1000023    1000024
    0.00034316503   2    1000035    1000037
    0.00022915912   2   -3    6
    8.3765591e-05   2    24    25
    7.3215445e-05   2   -5    4
    3.1865315e-05   2   -13    14
    2.1178209e-05   2   -3    4
    1.0508993e-05   2   -1    6
    8.947801e-07   2   -3    2
    5.2281111e-07   2   -5    2
    9.8640374e-08   2   -1    4
    5.3069275e-08   2   -1    2
    7.4533303e-10   2   -11    12
    2.0226749e-13   2    24    35
    1.2934679e-13   2    24    36

DECAY 6  2.43
    1   2    5    24

DECAY 15 -1
