BLOCK SPINFO
   1   SPheno
   2   v4.0.5be

BLOCK SPHENOINFO
   1   2
   2   2

BLOCK MODSEL
   1   0

BLOCK MINPAR
   3    23.706684
   4   -1

BLOCK EXTPAR
   0    3266.7858
   1   -446.74403
   2    3653.6668
   3    4868.3281
   11   -4025.0432
   12   -6641.8595
   13    1.5392473
   23   -1749.3168
   25    22.783252
   26    4057.5995
   31    1328.569
   32    1328.569
   33    4948.4398
   34    4362.8596
   35    4362.8596
   36    4479.8223
   41    2761.5424
   42    2761.5424
   43    3304.0673
   44    1881.7638
   45    1881.7638
   46    3079.2045
   47    2950.3165
   48    2950.3165
   49    2234.2373

BLOCK SMINPUTS
   1    127.90897
   2    1.1663787e-05
   3    0.1184
   4    91.1876
   5    4.18
   6    173.2
   7    1.777
   8    0
   11    0.00051099893
   12    0
   13    0.10565837
   14    0
   21    0.005
   22    0.0025
   23    0.095
   24    1.27

BLOCK GAUGE Q=  3266.7858
   1    0.35536298
   2    0.66519887
   3    1.219778

BLOCK YU Q=  3266.7858
   1   1    8.3924445e-06
   2   2    0.0042633618
   3   3    1.0138747

BLOCK YD Q=  3266.7858
   1   1    0.00038422396
   2   2    0.0073002553
   3   3    0.38102977

BLOCK YE Q=  3266.7858
   1   1    6.7049891e-05
   2   2    0.013863791
   3   3    0.23316616

BLOCK AU Q=  3266.7858
   1   1    0
   2   2    0
   3   3   -4025.0431

BLOCK AD Q=  3266.7858
   1   1    0
   2   2    0
   3   3   -6641.8611

BLOCK AE Q=  3266.7858
   1   1    0
   2   2    0
   3   3    1.5392473

BLOCK MSOFT Q=  3266.7858
   1   -446.74403
   2    3653.6668
   3    4868.3281
   21    13312559
   22   -2874675.7
   31    1328.569
   32    1328.569
   33    4948.4398
   34    4362.8596
   35    4362.8596
   36    4479.8223
   41    2761.5424
   42    2761.5424
   43    3304.0673
   44    1881.7638
   45    1881.7638
   46    3079.2045
   47    2950.3165
   48    2950.3165
   49    2234.2373

BLOCK MASS
   6    173.2
   23    91.1876
   24    80.429995
   15    1.777
   25    122.25738
   35    4057.5553
   36    4057.5995
   37    4058.7884
   1000001    2911.6039
   2000001    3067.2937
   1000002    2910.4884
   2000002    1997.2945
   1000003    2911.6012
   2000003    3067.291
   1000004    2910.4865
   2000004    1997.2943
   1000005    2344.5184
   2000005    3407.5626
   1000006    3108.8935
   2000006    3432.697
   1000011    1370.5777
   2000011    4365.9087
   1000012    1367.9169
   1000013    1370.5741
   2000013    4365.8981
   1000014    1367.9146
   1000015    4480.0765
   2000015    4964.4461
   1000016    4963.2802
   1000021    4771.5463
   1000022   -442.60056
   1000023    1770.7436
   1000025   -1773.5498
   1000035    3633.9786
   1000024    1771.3067
   1000037    3634.0707

BLOCK ALPHA
      -0.042218356

BLOCK HMIX Q=  3266.7858
   1   -1749.3168
   2    22.783252
   3    243.16591
   4    16464114

BLOCK STOPMIX
   1   1    0.2788912
   1   2    0.96032271
   2   1   -0.96032271
   2   2    0.2788912

BLOCK SBOTMIX
   1   1   -0.012682267
   1   2    0.99991958
   2   1   -0.99991958
   2   2   -0.012682267

BLOCK STAUMIX
   1   1   -0.015221513
   1   2    0.99988415
   2   1   -0.99988415
   2   2   -0.015221513

BLOCK NMIX
   1   1   -0.99960149
   1   2   -0.00017067537
   1   3    0.027120257
   1   4   -0.0078304329
   2   1    0.01364265
   2   2    0.027852053
   2   3    0.70701161
   2   4    0.70652157
   3   1   -0.024711295
   3   2    0.010618645
   3   3   -0.7065766
   3   4    0.70712524
   4   1    0.0002883108
   4   2   -0.99955564
   4   3    0.012189627
   4   4    0.027200211

BLOCK UMIX
   1   1   -0.017428316
   1   2   -0.99984812
   2   1    0.99984812
   2   2   -0.017428316

BLOCK VMIX
   1   1   -0.038712715
   1   2    0.99925038
   2   1    0.99925038
   2   2    0.038712715

BLOCK HIGGSBOUNDSINPUTHIGGSCOUPLINGSFERMIONS
       0, 519.07659,3,36,15,15

BLOCK HIGGSBOUNDSINPUTHIGGSCOUPLINGSBOSONS
       0,4,36,21,21,23

BLOCK SPHENOLOWENERGY
   1    0.00032945593
   2    1.5899506e-06
   3    3.5268236e-05
   4    2.4859411e-15
   5    1.0619679e-10
   6    2.2242846e-08
   7    8.395865e-14
   8    3.5867179e-09
   9    7.6116592e-07
   10    9.657332e-05
   11    0.99756543
   12    0.54203811
   13    19.366136
   14    0
   15    0
   16    0.0021575643
   17    2.2816609e-15
   18    2.4808776e-11
   19    8.2928151e-11
   20   -6.8944089e-16
   21   -2.9475026e-11
   22   -5.4636366e-09
   23    0
   24    0
   25    0
   26    0
   27    0
   28    0
   29    0
   30    0
   31    0
   39    5.0743759e-05
   40    0
   41    0
   42    0

BLOCK FWCOEF Q=  160
   305   4422   0   0   -0.18881911
   305   4422   0   2   -0.19928756
   305   4322   0   2   -0.00022161098
   305   6421   0   0   -0.095227835
   305   6421   0   2   -0.10357002
   305   6321   0   2   -0.00017376096
   3051111   4133   0   0    1.6193819
   3051111   4133   0   2    1.6197425
   3051111   4233   0   2    7.8817115e-05
   3051111   4137   0   0   -4.4420741
   3051111   4137   0   2   -4.4419658
   3051111   4237   0   2   -0.00058949077
   3051313   4133   0   0    1.6193819
   3051313   4133   0   2    1.6197421
   3051313   4233   0   2    7.8817082e-05
   3051313   4137   0   0   -4.4420741
   3051313   4137   0   2   -4.4419663
   3051313   4237   0   2   -0.00058949085
   3051212   4137   0   0    1.5053501
   3051212   4137   0   2    1.5053273
   3051212   4237   0   2    0.00012767925
   3051414   4137   0   0    1.5053501
   3051414   4137   0   2    1.5053273
   3051414   4237   0   2    0.00012767925
   3051616   4137   0   0    1.5053501
   3051616   4137   0   2    1.5053275
   3051616   4237   0   2    0.00012768013

BLOCK IMFWCOEF Q=  160
   305   4422   0   0    3.8578388e-07
   305   4422   0   2   -4.026222e-06
   305   4322   0   2   -2.564916e-06
   305   6421   0   0    3.3044941e-07
   305   6421   0   2    1.3497284e-06
   305   6321   0   2   -1.2387164e-06
   3051111   4133   0   2    5.4106427e-07
   3051111   4233   0   2    1.5639393e-06
   3051111   4137   0   2   -3.4440346e-06
   3051111   4237   0   2   -1.1697649e-05
   3051313   4133   0   2    5.4106106e-07
   3051313   4233   0   2    1.563939e-06
   3051313   4137   0   2   -3.4440385e-06
   3051313   4237   0   2   -1.169765e-05
   3051212   4137   0   2    7.5590685e-07
   3051212   4237   0   2    2.5336234e-06
   3051414   4137   0   2    7.5590662e-07
   3051414   4237   0   2    2.5336234e-06
   3051616   4137   0   2    7.5998835e-07
   3051616   4237   0   2    2.5336254e-06

DECAY 23  2.4952


DECAY 24  2.085


DECAY 1000011  1.3810852
    1   2    1000022    11

DECAY 2000011  21.483577
    0.99943257   2    1000022    11
    0.00043473208   2    1000025    11
    0.0001326738   2    1000023    11

DECAY 1000013  1.3810826
    1   2    1000022    13

DECAY 2000013  21.508022
    0.9982947   2    1000022    13
    0.0007043834   2    1000025    13
    0.00054152702   2   -1000024    14
    0.00040334791   2    1000023    13

DECAY 1000015  28.969774
    0.76147599   2    1000022    15
    0.11917385   2   -1000024    16
    0.059734877   2    1000023    15
    0.059595369   2    1000025    15

DECAY 2000015  24.482657
    0.38441994   2   -1000037    16
    0.25078463   2    1000022    15
    0.19206463   2    1000035    15
    0.084203071   2    1000023    15
    0.083505615   2    1000025    15
    0.0024378257   2    1000015    25
    0.0023855225   2    1000015    23
    0.00019876561   2   -1000024    16

DECAY 1000012  1.3753949
    1   2    1000022    12

DECAY 1000014  1.3753914
    1   2    1000022    14

DECAY 1000016  24.485411
    0.38343689   2    1000037    15
    0.25023453   2    1000022    16
    0.19191292   2    1000035    16
    0.168947   2    1000024    15
    0.0047960955   2    1000015    24
    0.0003852028   2    1000025    16
    0.00028735585   2    1000023    16

DECAY 1000001  0.3942906
    0.98091567   2    1000022    1
    0.008345453   2    1000023    1
    0.0078342735   2   -1000024    2
    0.0029046065   2    1000025    1

DECAY 2000001  1.6411834
    0.99962641   2    1000022    1
    0.00028354877   2    1000025    1

DECAY 1000003  0.39592654
    0.97686716   2    1000022    3
    0.0098552668   2    1000023    3
    0.0088500102   2   -1000024    4
    0.0044275669   2    1000025    3

DECAY 2000003  1.6440945
    0.99785689   2    1000022    3
    0.00087845736   2   -1000024    4
    0.00071933539   2    1000025    3
    0.00052564731   2    1000023    3

DECAY 1000005  3.6207992
    0.33798467   2    1000022    5
    0.31863619   2   -1000024    6
    0.17268231   2    1000023    5
    0.17069683   2    1000025    5

DECAY 2000005  51.954231
    0.7055994   2   -1000024    6
    0.16946406   2    1000006   -24
    0.050516383   2    1000023    5
    0.050357478   2    1000025    5
    0.0091667872   2    1000005    25
    0.008880517   2    1000022    5
    0.0060153743   2    1000005    23

DECAY 2000002  4.0299419
    0.99996034   2    1000022    2

DECAY 1000002  0.40816988
    0.95080318   2    1000022    2
    0.037300144   2    1000024    1
    0.011417038   2    1000023    2
    0.00047963712   2    1000025    2

DECAY 2000004  4.0300026
    0.99994413   2    1000022    4

DECAY 1000004  0.40980454
    0.94700945   2    1000022    4
    0.040130267   2    1000024    3
    0.011875519   2    1000023    4
    0.00098433093   2    1000025    4

DECAY 1000006  60.884932
    0.45055771   2    1000024    5
    0.2247035   2    1000023    6
    0.22395476   2    1000025    6
    0.10007576   2    1000022    6
    0.0003313088   2    1000005    24
    0.00028768663   2    1000022    4

DECAY 2000006  58.079511
    0.33114554   2    1000023    6
    0.33110495   2    1000025    6
    0.12659572   2    1000024    5
    0.095147913   2    1000006    25
    0.087187192   2    1000006    23
    0.018235224   2    1000022    6
    0.010583451   2    1000005    24

DECAY 1000024  1.2847776
    0.96770603   2    1000022    24
    0.028303891   3    1000022   -5    6
    0.0019102836   2    1000014   -13
    0.0014814889   2    1000012   -11
    0.00029682027   2   -1000013    14
    0.00029681556   2   -1000011    12

DECAY 1000037  100.44201
    0.11714422   2    1000014   -13
    0.11714406   2    1000012   -11
    0.11713372   2   -1000013    14
    0.11713351   2   -1000011    12
    0.069705351   2    1000024    25
    0.064796317   2    1000025    24
    0.064687998   2    1000024    23
    0.063066057   2    1000023    24
    0.061336121   2    1000004   -3
    0.061335834   2    1000002   -1
    0.061241186   2   -1000003    4
    0.061240907   2   -1000001    2
    0.0052864427   2    2000006   -5
    0.0052303298   3    1000024    6   -6
    0.0041708082   2   -2000005    6
    0.0040888885   3    1000025   -5    6
    0.0034634117   3    1000023   -5    6
    0.0016938353   2    1000006   -5

DECAY 1000022 -1


DECAY 1000023  1.7156346
    0.55628703   2    1000022    23
    0.42910967   2    1000022    25
    0.011810497   3    1000022    6   -6
    0.00060919952   2    1000013   -13
    0.00060919952   2   -1000013    13
    0.00045081583   2    1000011   -11
    0.00045081583   2   -1000011    11
    0.00015617825   2    1000014   -14
    0.00015617825   2   -1000014    14
    0.00015617666   2    1000012   -12
    0.00015617666   2   -1000012    12

DECAY 1000025  1.1913364
    0.73386615   2    1000022    25
    0.24495619   2    1000022    23
    0.019411381   3    1000022    6   -6
    0.00030508795   2    1000014   -14
    0.00030508795   2   -1000014    14
    0.00030508487   2    1000012   -12
    0.00030508487   2   -1000012    12
    0.00023408398   2    1000013   -13
    0.00023408398   2   -1000013    13

DECAY 1000035  107.06777
    0.06795657   2    1000025    25
    0.061626074   2    1000024   -24
    0.061626074   2   -1000024    24
    0.057291189   2    1000023    25
    0.054995642   2    1000014   -14
    0.054995642   2   -1000014    14
    0.05499558   2    1000012   -12
    0.05499558   2   -1000012    12
    0.054891156   2    1000013   -13
    0.054891156   2   -1000013    13
    0.05489105   2    1000011   -11
    0.05489105   2   -1000011    11
    0.052443716   2    1000025    23
    0.028778813   2    1000004   -4
    0.028778813   2   -1000004    4
    0.028778742   2    1000002   -2
    0.028778742   2   -1000002    2
    0.028705937   2    1000003   -3
    0.028705937   2   -1000003    3
    0.028705743   2    1000001   -1
    0.028705743   2   -1000001    1
    0.0076204422   2    1000023    23
    0.0032649176   2    2000005   -5
    0.0032649176   2   -2000005    5
    0.0032493345   3    1000024    5   -6
    0.0032493345   3   -1000024   -5    6
    0.0026921891   3    1000025    6   -6
    0.0023399705   3    1000023    6   -6
    0.0011637711   2    2000006   -6
    0.0011637711   2   -2000006    6
    0.00072374819   2    1000006   -6
    0.00072374819   2   -1000006    6

DECAY 1000021  708.05508
    0.067848088   2    2000004   -4
    0.067848088   2   -2000004    4
    0.067848086   2    2000002   -2
    0.067848086   2   -2000002    2
    0.057394691   2    1000005   -5
    0.057394691   2   -1000005    5
    0.039326941   2    1000004   -4
    0.039326941   2   -1000004    4
    0.039326886   2    1000002   -2
    0.039326886   2   -1000002    2
    0.03929125   2    1000003   -3
    0.03929125   2   -1000003    3
    0.039291163   2    1000001   -1
    0.039291163   2   -1000001    1
    0.034339175   2    2000003   -3
    0.034339175   2   -2000003    3
    0.034339088   2    2000001   -1
    0.034339088   2   -2000001    1
    0.03069923   2    1000006   -6
    0.03069923   2   -1000006    6
    0.024932069   2    2000006   -6
    0.024932069   2   -2000006    6
    0.023944556   2    2000005   -5
    0.023944556   2   -2000005    5
    0.0013875298   2    1000006   -4
    0.0013875298   2   -1000006    4

DECAY 25  0.0035462803
    0.61366287   2   -5    5
    0.18580549   2   -24    24
    0.074400663   2    21    21
    0.070367323   2   -15    15
    0.03039617   2   -4    4
    0.021283469   2    23    23
    0.0023384301   2    22    22
    0.0012700235   2    22    23
    0.0002440301   2   -13    13
    0.00023072889   2   -3    3
    6.3794341e-07   2   -1    1
    1.5664753e-07   2   -2    2
    5.4861043e-09   2   -11    11

DECAY 35  34.987435
    0.78009681   2   -5    5
    0.12263664   2   -15    15
    0.052803017   2    1000022    1000023
    0.034843554   2    1000022    1000025
    0.008449346   2   -6    6
    0.00039017545   2   -13    13
    0.00031808423   2   -3    3
    0.000199938   2   -1000024    1000024
    0.00017339211   2    1000022    1000022
    3.2161999e-05   2    1000025    1000025
    3.0840636e-05   2    1000023    1000023
    1.6693878e-05   2    25    25
    2.4076413e-06   2    1000023    1000025
    1.20523e-06   2    21    21
    1.0893423e-06   2    23    23
    8.7953703e-07   2   -1    1
    6.0726294e-07   2   -1000002    1000002
    6.0717752e-07   2   -1000004    1000004
    2.5413628e-07   2   -1000011    1000011
    2.5332135e-07   2   -1000013    1000013
    2.2631207e-07   2   -24    24
    1.3794691e-07   2   -4    4
    8.7622747e-09   2   -11    11
    6.2570892e-09   2    22    22
    4.346448e-09   2    22    23
    7.1117246e-13   2   -2    2

DECAY 36  33.812067
    0.77684002   2   -5    5
    0.12212581   2   -15    15
    0.054178269   2    1000022    1000025
    0.036410684   2    1000022    1000023
    0.0085173865   2   -6    6
    0.00074592224   2   -1000024    1000024
    0.00038855455   2   -13    13
    0.00031675683   2   -3    3
    0.00019815227   2    1000022    1000022
    0.00015436866   2    1000025    1000025
    0.00010468068   2    1000023    1000023
    1.5824433e-05   2    21    21
    2.41434e-06   2    23    25
    8.7585863e-07   2   -1    1
    1.3798136e-07   2   -4    4
    5.7589241e-08   2    22    23
    5.7238875e-08   2    22    22
    1.3447714e-08   2    1000023    1000025
    8.7258729e-09   2   -11    11
    7.113826e-13   2   -2    2
    3.1632807e-38   2    25    25

DECAY 37  33.717182
    0.77125838   2   -5    6
    0.13529511   2   -15    16
    0.091407153   2    1000022    1000024
    0.0011322   2   -5    4
    0.00047831636   2   -13    14
    0.00030372098   2   -3    4
    5.1658677e-05   2    1000023    1000024
    3.3064263e-05   2    1000024    1000025
    1.4268607e-05   2   -3    2
    1.2119433e-05   2   -3    6
    8.0850742e-06   2   -5    2
    2.4240897e-06   2    24    25
    1.0361173e-06   2   -1000011    1000012
    1.0349313e-06   2   -1000013    1000014
    8.4263815e-07   2   -1    2
    5.3510257e-07   2   -1    6
    4.4360252e-08   2   -1    4
    1.118787e-08   2   -11    12
    1.151187e-13   2    24    35
    9.5901799e-14   2    24    36

DECAY 6  2.43
    1   2    5    24

DECAY 15 -1
