BLOCK SPINFO
   1   SPheno
   2   v4.0.5be

BLOCK SPHENOINFO
   1   2
   2   2

BLOCK MODSEL
   1   0

BLOCK MINPAR
   3    57.983354
   4   -1

BLOCK EXTPAR
   0    3607.61
   1   -672.58515
   2    2320.4839
   3    1774.4921
   11    3232.0534
   12    7438.3354
   13   -627.61363
   23   -2266.4941
   25    59.829842
   26    3330.9357
   31    3393.194
   32    3393.194
   33    1539.1842
   34    4571.2235
   35    4571.2235
   36    2898.0487
   41    3561.1945
   42    3561.1945
   43    2940.0318
   44    4790.0359
   45    4790.0359
   46    4359.7495
   47    3477.8024
   48    3477.8024
   49    4892.8389

BLOCK SMINPUTS
   1    127.90897
   2    1.1663787e-05
   3    0.1184
   4    91.1876
   5    4.18
   6    173.2
   7    1.777
   8    0
   11    0.00051099893
   12    0
   13    0.10565837
   14    0
   21    0.005
   22    0.0025
   23    0.095
   24    1.27

BLOCK GAUGE Q=  3607.61
   1    0.35536298
   2    0.66519887
   3    1.219778

BLOCK YU Q=  3607.61
   1   1    8.3855432e-06
   2   2    0.0042598559
   3   3    1.013041

BLOCK YD Q=  3607.61
   1   1    0.0010081596
   2   2    0.019155033
   3   3    0.99977844

BLOCK YE Q=  3607.61
   1   1    0.00017593123
   2   2    0.036376998
   3   3    0.61180126

BLOCK AU Q=  3607.61
   1   1    0
   2   2    0
   3   3    3232.0534

BLOCK AD Q=  3607.61
   1   1    0
   2   2    0
   3   3    7438.3359

BLOCK AE Q=  3607.61
   1   1    0
   2   2    0
   3   3   -627.61365

BLOCK MSOFT Q=  3607.61
   1   -672.58515
   2    2320.4839
   3    1774.4921
   21    6600861.8
   22   -4977677.8
   31    3393.194
   32    3393.194
   33    1539.1842
   34    4571.2235
   35    4571.2235
   36    2898.0487
   41    3561.1945
   42    3561.1945
   43    2940.0318
   44    4790.0359
   45    4790.0359
   46    4359.7495
   47    3477.8024
   48    3477.8024
   49    4892.8389

BLOCK MASS
   6    173.2
   23    91.1876
   24    80.429995
   15    1.777
   25    122.39024
   35    3327.5785
   36    3330.9357
   37    3329.3636
   1000001    3637.7627
   2000001    3536.5734
   1000002    3636.769
   2000002    4847.9228
   1000003    3637.7544
   2000003    3536.5311
   1000004    3636.7501
   2000004    4847.9222
   1000005    2987.955
   2000005    4791.6196
   1000006    2989.6659
   2000006    4353.279
   1000011    3410.1611
   2000011    4575.3898
   1000012    3408.8103
   1000013    3410.117
   2000013    4575.2931
   1000014    3408.7692
   1000015    1561.3664
   2000015    2879.1114
   1000016    1561.3465
   1000021    2083.4547
   1000022   -669.47262
   1000023    2243.7913
   1000025   -2269.3667
   1000035    2386.2806
   1000024    2244.3842
   1000037    2386.5062

BLOCK ALPHA
      -0.017278433

BLOCK HMIX Q=  3607.61
   1   -2266.4941
   2    59.829842
   3    243.04585
   4    11095132

BLOCK STOPMIX
   1   1   -0.99916277
   1   2    0.040911697
   2   1   -0.040911697
   2   2   -0.99916277

BLOCK SBOTMIX
   1   1   -0.99960182
   1   2    0.028217056
   2   1   -0.028217056
   2   2   -0.99960182

BLOCK STAUMIX
   1   1   -0.99933949
   1   2    0.036339747
   2   1   -0.036339747
   2   2   -0.99933949

BLOCK NMIX
   1   1   -0.99974689
   1   2   -0.00019005938
   1   3    0.02147447
   1   4   -0.0067058513
   2   1   -0.0093791733
   2   2   -0.44483655
   2   3   -0.63712047
   2   4   -0.62937269
   3   1    0.019925643
   3   2   -0.012197513
   3   3    0.70672583
   3   4   -0.70710168
   4   1    0.0045997042
   4   2   -0.89552869
   4   3    0.30684678
   4   4    0.32226118

BLOCK UMIX
   1   1   -0.40860297
   1   2   -0.91271223
   2   1    0.91271223
   2   2   -0.40860297

BLOCK VMIX
   1   1   -0.43077649
   1   2    0.90245865
   2   1    0.90245865
   2   2    0.43077649

BLOCK HIGGSBOUNDSINPUTHIGGSCOUPLINGSFERMIONS
       0, 3579.61,3,36,15,15

BLOCK HIGGSBOUNDSINPUTHIGGSCOUPLINGSBOSONS
       0,4,36,21,21,23

BLOCK SPHENOLOWENERGY
   1    0.00031903863
   2    1.5904713e-06
   3    3.5252444e-05
   4    4.0760086e-15
   5    1.7410261e-10
   6    3.5323992e-08
   7    1.4233814e-13
   8    6.0799599e-09
   9    1.2483049e-06
   10    9.555264e-05
   11    0.98702219
   12    0.5416791
   13    19.361791
   14    0
   15    0
   16    0.0021564367
   17    2.2816513e-15
   18    2.4801151e-11
   19    8.290581e-11
   20   -2.0096034e-15
   21   -8.5915169e-11
   22   -3.0719839e-08
   23    0
   24    0
   25    0
   26    0
   27    0
   28    0
   29    0
   30    0
   31    0
   39    8.6496966e-05
   40    0
   41    0
   42    0

BLOCK FWCOEF Q=  160
   305   4422   0   0   -0.18881911
   305   4422   0   2   -0.18747014
   305   4322   0   2   -7.7574785e-07
   305   6421   0   0   -0.095227835
   305   6421   0   2   -0.095240096
   305   6321   0   2   -2.4878336e-05
   3051111   4133   0   0    1.6244181
   3051111   4133   0   2    1.6246066
   3051111   4233   0   2    0.00064203667
   3051111   4137   0   0   -4.4471102
   3051111   4137   0   2   -4.4456033
   3051111   4237   0   2   -0.004768176
   3051313   4133   0   0    1.6244181
   3051313   4133   0   2    1.6246054
   3051313   4233   0   2    0.0006420347
   3051313   4137   0   0   -4.4471102
   3051313   4137   0   2   -4.4456046
   3051313   4237   0   2   -0.0047681786
   3051212   4137   0   0    1.5053501
   3051212   4137   0   2    1.5050262
   3051212   4237   0   2    0.0010315866
   3051414   4137   0   0    1.5053501
   3051414   4137   0   2    1.5050262
   3051414   4237   0   2    0.0010315868
   3051616   4137   0   0    1.5053501
   3051616   4137   0   2    1.5050258
   3051616   4237   0   2    0.0010316454

BLOCK IMFWCOEF Q=  160
   305   4422   0   0    3.858743e-07
   305   4422   0   2   -3.1090806e-05
   305   4322   0   2    1.9187222e-06
   305   6421   0   0    3.3052686e-07
   305   6421   0   2    4.0377783e-05
   305   6321   0   2    2.1065419e-06
   3051111   4133   0   2    1.6754362e-07
   3051111   4233   0   2    1.2805749e-05
   3051111   4137   0   2    2.2129156e-06
   3051111   4237   0   2   -9.5106262e-05
   3051313   4133   0   2    1.6753933e-07
   3051313   4233   0   2    1.2805731e-05
   3051313   4137   0   2    2.2129294e-06
   3051313   4237   0   2   -9.5106326e-05
   3051212   4137   0   2   -4.4022525e-07
   3051212   4237   0   2    2.0576072e-05
   3051414   4137   0   2   -4.4022547e-07
   3051414   4237   0   2    2.0576072e-05
   3051616   4137   0   2   -4.4641409e-07
   3051616   4237   0   2    2.0576074e-05

DECAY 23  2.4952


DECAY 24  2.085


DECAY 1000011  16.176727
    0.40248473   2   -1000037    12
    0.24483866   2    1000022    11
    0.19274435   2    1000035    11
    0.099551336   2   -1000024    12
    0.060380205   2    1000023    11

DECAY 2000011  22.011273
    0.99969939   2    1000022    11
    0.00023578164   2    1000025    11

DECAY 1000013  16.203807
    0.401787   2   -1000037    14
    0.24442817   2    1000022    13
    0.1925452   2    1000035    13
    0.099379762   2   -1000024    14
    0.061000244   2    1000023    13
    0.0008596237   2    1000025    13

DECAY 2000013  22.154273
    0.99322616   2    1000022    13
    0.0026116536   2   -1000024    14
    0.0017778871   2    1000025    13
    0.0013256633   2    1000023    13
    0.00048097508   2   -1000037    14
    0.00029474583   2    1000013    25
    0.00028291507   2    1000035    13

DECAY 1000015  1.3200254
    1   2    1000022    15

DECAY 2000015  34.878823
    0.37048083   2    1000022    15
    0.21495402   2    1000016   -24
    0.13183757   2    1000015    25
    0.10714482   2    1000015    23
    0.075945588   2   -1000024    16
    0.044121465   2    1000025    15
    0.036994398   2    1000023    15
    0.011886386   2   -1000037    16
    0.0066349253   2    1000035    15

DECAY 1000012  16.174512
    0.39279196   2    1000037    11
    0.24441149   2    1000022    12
    0.19452475   2    1000035    12
    0.11048652   2    1000024    11
    0.057635228   2    1000023    12
    0.00015005239   2    1000025    12

DECAY 1000014  16.201656
    0.3923497   2    1000037    13
    0.2439986   2    1000022    14
    0.19418751   2    1000035    14
    0.11177854   2    1000024    13
    0.057535852   2    1000023    14
    0.00014979344   2    1000025    14

DECAY 1000016  1.3048278
    1   2    1000022    16

DECAY 2000001  120.84716
    0.98481604   2    1000021    1
    0.015180694   2    1000022    1

DECAY 1000001  146.22369
    0.88672849   2    1000021    1
    0.059194513   2   -1000037    2
    0.028553611   2    1000035    1
    0.014025725   2   -1000024    2
    0.0082549064   2    1000023    1
    0.0032325364   2    1000022    1

DECAY 2000003  120.86051
    0.98467037   2    1000021    3
    0.0151789   2    1000022    3

DECAY 1000003  146.23303
    0.88666585   2    1000021    3
    0.059190994   2   -1000037    4
    0.028556943   2    1000035    3
    0.014027206   2   -1000024    4
    0.0082826487   2    1000023    3
    0.0032324001   2    1000022    3

DECAY 1000005  89.079476
    0.69876699   2    1000021    5
    0.099489793   2   -1000024    6
    0.059617537   2    1000025    5
    0.058122431   2    1000023    5
    0.05631441   2   -1000037    6
    0.023004135   2    1000035    5
    0.0046847062   2    1000022    5

DECAY 2000005  393.33205
    0.63238523   2    1000021    5
    0.12068941   2   -1000024    6
    0.072860262   2    1000025    5
    0.058840069   2    1000023    5
    0.034345735   2    1000006   -24
    0.024781738   2   -1000037    6
    0.018399903   2    1000005    25
    0.017210219   2    1000005    23
    0.013918218   2    1000035    5
    0.0065679392   2    1000022    5

DECAY 1000002  146.14104
    0.8865144   2    1000021    2
    0.05784111   2    1000037    1
    0.028434148   2    1000035    2
    0.015583537   2    1000024    1
    0.0083765577   2    1000023    2
    0.0032471938   2    1000022    2

DECAY 2000002  264.77932
    0.96066411   2    1000021    2
    0.039323271   2    1000022    2

DECAY 1000004  146.149
    0.88645187   2    1000021    4
    0.057846332   2    1000037    3
    0.028432445   2    1000035    4
    0.015640487   2    1000024    3
    0.0083771437   2    1000023    4
    0.0032469966   2    1000022    4

DECAY 2000004  264.78132
    0.96065637   2    1000021    4
    0.039322962   2    1000022    4

DECAY 1000006  87.334902
    0.68764894   2    1000021    6
    0.11615656   2    1000024    5
    0.061224103   2    1000025    6
    0.049207283   2    1000023    6
    0.048842097   2    1000037    5
    0.031268103   2    1000035    6
    0.0044489601   2    1000022    6
    0.0012034959   3    1000022    24    5

DECAY 2000006  340.81866
    0.5984623   2    1000021    6
    0.11745155   2    1000024    5
    0.068433566   2    1000025    6
    0.056630542   2    1000023    6
    0.040533568   2    1000005    24
    0.038449424   2    1000006    25
    0.02704266   2    1000022    6
    0.021086326   2    1000037    5
    0.020155604   2    1000006    23
    0.011754462   2    1000035    6

DECAY 1000024  4.1083972
    0.56862458   2    1000016   -15
    0.29628637   2    1000022    24
    0.12330846   2   -1000015    16
    0.011639257   3    1000022   -5    6
    0.00012604267   3    1000022   -15    16

DECAY 1000037  8.8715756
    0.37086599   2    1000016   -15
    0.31267022   2   -1000015    16
    0.11384808   2    1000025    24
    0.085712847   2    1000023    24
    0.052746337   2    1000024    23
    0.036059224   2    1000022    24
    0.026503567   2    1000024    25
    0.0015199643   3    1000022   -5    6

DECAY 1000022 -1


DECAY 1000023  4.676243
    0.25644268   2    1000015   -15
    0.25644268   2   -1000015    15
    0.19983151   2    1000022    23
    0.17239931   2    1000022    25
    0.054345843   2    1000016   -16
    0.054345843   2   -1000016    16
    0.0059421056   3    1000022    6   -6
    0.00012467684   3    1000022    5   -5
    0.00010788349   3    1000022    15   -15

DECAY 1000025  3.8293573
    0.30502828   2    1000015   -15
    0.30502828   2   -1000015    15
    0.29255039   2    1000022    25
    0.086327422   2    1000022    23
    0.010296216   3    1000022    6   -6
    0.00018873818   2    1000016   -16
    0.00018873818   2   -1000016    16
    0.00018042845   3    1000022    15   -15
    0.00017885478   3    1000022    5   -5

DECAY 1000035  8.7767694
    0.18230557   2    1000015   -15
    0.18230557   2   -1000015    15
    0.15780609   2    1000016   -16
    0.15780609   2   -1000016    16
    0.12614635   2    1000025    23
    0.054990134   2    1000024   -24
    0.054990134   2   -1000024    24
    0.031627447   2    1000022    23
    0.02772094   2    1000022    25
    0.023082842   2    1000023    25
    0.0010375493   3    1000022    6   -6

DECAY 1000021  0.0007736633
    0.23459992   3    1000022    6   -6
    0.16392475   3    1000022    3   -3
    0.16391495   3    1000022    1   -1
    0.15608267   3    1000022    4   -4
    0.15608186   3    1000022    2   -2
    0.12205632   3    1000022    5   -5
    0.0033395204   2    1000022    21

DECAY 25  0.0035703454
    0.61267227   2   -5    5
    0.18729831   2   -24    24
    0.07409371   2    21    21
    0.070099648   2   -15    15
    0.030238221   2   -4    4
    0.021512328   2    23    23
    0.0023336654   2    22    22
    0.0012778182   2    22    23
    0.00024317877   2   -13    13
    0.00023004979   2   -3    3
    6.3606363e-07   2   -1    1
    1.5583313e-07   2   -2    2
    5.4669632e-09   2   -11    11

DECAY 35  193.35303
    0.91822807   2   -5    5
    0.076239823   2   -15    15
    0.0027370541   2    1000022    1000023
    0.00087469617   2    1000022    1000025
    0.0006248679   2   -6    6
    0.00062312509   2    1000022    1000035
    0.00032378788   2   -3    3
    0.00031541154   2   -13    13
    1.336587e-05   2    1000022    1000022
    1.2857074e-05   2    21    21
    5.6756474e-06   2   -1000015    1000015
    8.9491998e-07   2   -1    1
    2.8162831e-07   2    25    25
    4.0284879e-08   2    23    23
    1.0640472e-08   2   -24    24
    7.0836687e-09   2   -11    11
    6.4567633e-09   2   -4    4
    4.9680241e-09   2    22    22
    4.2342811e-09   2    22    23
    3.3269795e-14   2   -2    2

DECAY 36  169.14121
    0.91776429   2   -5    5
    0.076185789   2   -15    15
    0.0037829783   2    1000022    1000025
    0.00090515208   2    1000022    1000023
    0.00053263123   2   -6    6
    0.00032360604   2   -3    3
    0.00031520608   2   -13    13
    0.00015402828   2    1000022    1000035
    1.8681155e-05   2    1000022    1000022
    1.6598683e-05   2    21    21
    8.9441482e-07   2   -1    1
    8.1467066e-08   2    23    25
    3.0313379e-08   2    22    23
    2.4742388e-08   2    22    22
    7.0791262e-09   2   -11    11
    5.3112463e-09   2   -4    4
    2.7691935e-12   2    23    35
    2.7367897e-14   2   -2    2
    5.8585953e-38   2    25    25

DECAY 37  214.19161
    0.88963341   2   -5    6
    0.10451069   2   -15    16
    0.0031823438   2    1000022    1000024
    0.0013191741   2   -5    4
    0.00068925895   2    1000022    1000037
    0.00036948254   2   -13    14
    0.00026974031   2   -3    4
    1.2648825e-05   2   -3    2
    9.4202638e-06   2   -5    2
    2.3065607e-06   2   -1000015    1000016
    7.4818178e-07   2   -1    2
    6.5819681e-07   2   -3    6
    6.4273255e-08   2    24    25
    3.5089556e-08   2   -1    4
    1.1825609e-08   2   -1    6
    8.6422351e-09   2   -11    12
    1.1522113e-13   2    24    35

DECAY 6  2.43
    1   2    5    24

DECAY 15 -1
