BLOCK SPINFO
   1   SPheno
   2   v4.0.5be

BLOCK SPHENOINFO
   1   2
   2   2

BLOCK MODSEL
   1   0

BLOCK MINPAR
   3    48.290631
   4    1

BLOCK EXTPAR
   0    3231.0224
   1   -2337.8954
   2    1744.3436
   3    2890.9956
   11    6931.1655
   12    3840.1521
   13   -1218.8786
   23    889.19363
   25    47.162146
   26    2015.124
   31    2696.1754
   32    2696.1754
   33    1989.9072
   34    4103.4738
   35    4103.4738
   36    2242.3668
   41    1762.6967
   42    1762.6967
   43    4425.8743
   44    2899.5005
   45    2899.5005
   46    2307.1995
   47    3339.5641
   48    3339.5641
   49    3508.9481

BLOCK SMINPUTS
   1    127.90897
   2    1.1663787e-05
   3    0.1184
   4    91.1876
   5    4.18
   6    173.2
   7    1.777
   8    0
   11    0.00051099893
   12    0
   13    0.10565837
   14    0
   21    0.005
   22    0.0025
   23    0.095
   24    1.27

BLOCK GAUGE Q=  3231.0224
   1    0.35536298
   2    0.66519887
   3    1.219778

BLOCK YU Q=  3231.0224
   1   1    8.3862567e-06
   2   2    0.0042602184
   3   3    1.0131272

BLOCK YD Q=  3231.0224
   1   1    0.0007947709
   2   2    0.015100647
   3   3    0.78816369

BLOCK YE Q=  3231.0224
   1   1    0.00013869333
   2   2    0.028677383
   3   3    0.4823064

BLOCK AU Q=  3231.0224
   1   1    0
   2   2    0
   3   3    6931.1655

BLOCK AD Q=  3231.0224
   1   1    0
   2   2    0
   3   3    3840.1519

BLOCK AE Q=  3231.0224
   1   1    0
   2   2    0
   3   3   -1218.8786

BLOCK MSOFT Q=  3231.0224
   1   -2337.8954
   2    1744.3436
   3    2890.9956
   21    3346477.6
   22   -787494.71
   31    2696.1754
   32    2696.1754
   33    1989.9072
   34    4103.4738
   35    4103.4738
   36    2242.3668
   41    1762.6967
   42    1762.6967
   43    4425.8743
   44    2899.5005
   45    2899.5005
   46    2307.1995
   47    3339.5641
   48    3339.5641
   49    3508.9481

BLOCK MASS
   6    173.2
   23    91.1876
   24    80.429995
   15    1.777
   25    127.70782
   35    2014.8666
   36    2015.124
   37    2016.6118
   1000001    1942.9491
   2000001    3439.4824
   1000002    1941.3315
   2000002    3017.1755
   1000003    1942.9434
   2000003    3439.4743
   1000004    1941.326
   2000004    3017.175
   1000005    3582.5965
   2000005    4424.4264
   1000006    2354.8365
   2000006    4433.2189
   1000011    2710.1155
   2000011    4110.9082
   1000012    2708.5736
   1000013    2710.082
   2000013    4110.8488
   1000014    2708.5392
   1000015    1996.5957
   2000015    2235.8247
   1000016    1996.6877
   1000021    3077.1533
   1000022    901.29477
   1000023   -904.579
   1000025    1775.6799
   1000035   -2313.5829
   1000024    902.31868
   1000037    1775.889

BLOCK ALPHA
      -0.020835158

BLOCK HMIX Q=  3231.0224
   1    889.19363
   2    47.162146
   3    243.14431
   4    4060724.9

BLOCK STOPMIX
   1   1   -0.067052843
   1   2    0.99774943
   2   1   -0.99774943
   2   2   -0.067052843

BLOCK SBOTMIX
   1   1    0.010620328
   1   2    0.9999436
   2   1   -0.9999436
   2   2    0.010620328

BLOCK STAUMIX
   1   1    0.99681268
   1   2    0.079777724
   2   1   -0.079777724
   2   2    0.99681268

BLOCK NMIX
   1   1   -0.01003566
   1   2   -0.06359127
   1   3    0.70678395
   1   4   -0.70449407
   2   1   -0.022061063
   2   2   -0.020162461
   2   3   -0.70670948
   2   4   -0.70687233
   3   1    0.00066622125
   3   2   -0.99777224
   3   3   -0.030761267
   3   4    0.059193328
   4   1    0.99970603
   4   2   -0.00041837161
   4   3   -0.0084797185
   4   4   -0.02271053

BLOCK UMIX
   1   1   -0.043537411
   1   2    0.9990518
   2   1    0.9990518
   2   2    0.043537411

BLOCK VMIX
   1   1   -0.083769837
   1   2    0.99648513
   2   1    0.99648513
   2   2    0.083769837

BLOCK HIGGSBOUNDSINPUTHIGGSCOUPLINGSFERMIONS
       0, 2224.268,3,36,15,15

BLOCK HIGGSBOUNDSINPUTHIGGSCOUPLINGSBOSONS
       0,4,36,21,21,23

BLOCK SPHENOLOWENERGY
   1    0.00034858226
   2    1.5867576e-06
   3    3.5232006e-05
   4    2.7071668e-15
   5    1.1564744e-10
   6    2.4232693e-08
   7    9.0152919e-14
   8    3.8513403e-09
   9    8.1760991e-07
   10    9.264739e-05
   11    0.95701207
   12    0.54252618
   13    19.365159
   14    0
   15    0
   16    0.0021605176
   17    2.2816948e-15
   18    2.4793316e-11
   19    8.2860817e-11
   20    2.212135e-15
   21    9.4574382e-11
   22    3.1106469e-08
   23    0
   24    0
   25    0
   26    0
   27    0
   28    0
   29    0
   30    0
   31    0
   39    7.0123557e-05
   40    0
   41    0
   42    0

BLOCK FWCOEF Q=  160
   305   4422   0   0   -0.18881911
   305   4422   0   2   -0.21932281
   305   4322   0   2   -0.0010501674
   305   6421   0   0   -0.095227835
   305   6421   0   2   -0.12206313
   305   6321   0   2   -0.00085041883
   3051111   4133   0   0    1.6198725
   3051111   4133   0   2    1.6199019
   3051111   4233   0   2    0.00033669623
   3051111   4137   0   0   -4.4425646
   3051111   4137   0   2   -4.4389474
   3051111   4237   0   2   -0.0025165528
   3051313   4133   0   0    1.6198725
   3051313   4133   0   2    1.6198998
   3051313   4233   0   2    0.00033669331
   3051313   4137   0   0   -4.4425646
   3051313   4137   0   2   -4.4389494
   3051313   4237   0   2   -0.0025165521
   3051212   4137   0   0    1.5053501
   3051212   4137   0   2    1.5045706
   3051212   4237   0   2    0.00054500853
   3051414   4137   0   0    1.5053501
   3051414   4137   0   2    1.5045706
   3051414   4237   0   2    0.00054500907
   3051616   4137   0   0    1.5053501
   3051616   4137   0   2    1.5045705
   3051616   4237   0   2    0.00054515925

BLOCK IMFWCOEF Q=  160
   305   4422   0   0    3.8572733e-07
   305   4422   0   2    2.496888e-05
   305   4322   0   2   -1.4486927e-05
   305   6421   0   0    3.3040097e-07
   305   6421   0   2   -1.1563899e-05
   305   6321   0   2   -9.7542969e-06
   3051111   4133   0   2   -4.0146342e-06
   3051111   4233   0   2    7.9179871e-06
   3051111   4137   0   2    3.1921323e-05
   3051111   4237   0   2   -5.9188105e-05
   3051313   4133   0   2   -4.0146018e-06
   3051313   4233   0   2    7.9179792e-06
   3051313   4137   0   2    3.1921378e-05
   3051313   4237   0   2   -5.9188137e-05
   3051212   4137   0   2   -6.8430348e-06
   3051212   4237   0   2    1.2818337e-05
   3051414   4137   0   2   -6.8430349e-06
   3051414   4237   0   2    1.2818337e-05
   3051616   4137   0   2   -6.8437995e-06
   3051616   4237   0   2    1.2818336e-05

DECAY 23  2.4952


DECAY 24  2.085


DECAY 1000011  11.958302
    0.64833594   2   -1000037    12
    0.32322197   2    1000025    11
    0.020896836   2    1000035    11
    0.0037516241   2    1000022    11
    0.0029896791   2   -1000024    12
    0.00080395201   2    1000023    11

DECAY 2000011  9.6485465
    0.99886023   2    1000035    11
    0.00094353618   2    1000023    11
    0.0001954555   2    1000022    11

DECAY 1000013  11.992707
    0.64644389   2   -1000037    14
    0.32227996   2    1000025    13
    0.020833865   2    1000035    13
    0.0052015824   2    1000022    13
    0.002981047   2   -1000024    14
    0.0022596618   2    1000023    13

DECAY 2000013  9.7708398
    0.98631793   2    1000035    13
    0.0062243706   2   -1000024    14
    0.0040446085   2    1000023    13
    0.0033089158   2    1000022    13

DECAY 1000015  7.1524971
    0.41788555   2    1000022    15
    0.40751803   2    1000023    15
    0.10577797   2   -1000037    16
    0.052886062   2    1000025    15
    0.015932385   2   -1000024    16

DECAY 2000015  15.015383
    0.47432603   2   -1000024    16
    0.24142663   2    1000023    15
    0.23846035   2    1000022    15
    0.022334554   2    1000016   -24
    0.010507742   2    1000015    23
    0.0096352662   2    1000015    25
    0.0022069954   2   -1000037    16
    0.00110244   2    1000025    15

DECAY 1000012  11.971365
    0.6428352   2    1000037    11
    0.32259287   2    1000025    12
    0.020799741   2    1000035    12
    0.011046704   2    1000024    11
    0.0026703267   2    1000022    12

DECAY 1000014  12.005718
    0.6409656   2    1000037    13
    0.32165341   2    1000025    14
    0.020737118   2    1000035    14
    0.013926236   2    1000024    13
    0.0026626352   2    1000022    14

DECAY 1000016  7.0824138
    0.83547761   2    1000024    15
    0.10773594   2    1000037    15
    0.054063877   2    1000025    16
    0.0026675748   2    1000022    16

DECAY 1000001  0.73502417
    0.62904746   2   -1000037    2
    0.31454352   2    1000025    1
    0.027383855   2    1000022    1
    0.027133873   2   -1000024    2
    0.0018912816   2    1000023    1

DECAY 2000001  11.391593
    0.94940175   2    1000021    1
    0.050505744   2    1000035    1

DECAY 1000003  0.74078721
    0.62409633   2   -1000037    4
    0.31207795   2    1000025    3
    0.030818712   2    1000022    3
    0.027494274   2   -1000024    4
    0.0055127337   2    1000023    3

DECAY 2000003  11.418466
    0.94712887   2    1000021    3
    0.050386407   2    1000035    3
    0.001182621   2   -1000024    4
    0.00066222911   2    1000023    3
    0.00060678937   2    1000022    3

DECAY 1000005  97.548752
    0.39530495   2   -1000024    6
    0.19941599   2    1000021    5
    0.19914716   2    1000022    5
    0.19867583   2    1000023    5
    0.0069669706   2    1000035    5
    0.00030529075   2   -1000037    6
    0.00015420712   2    1000025    5

DECAY 2000005  365.90521
    0.2659114   2    1000006   -24
    0.25439599   2    1000021    5
    0.22437391   2   -1000024    6
    0.07644261   2   -1000037    6
    0.068694823   2    1000022    5
    0.068548828   2    1000023    5
    0.037439741   2    1000025    5
    0.0020744109   2    1000006   -37
    0.00090533975   2    1000035    5
    0.00084875023   2    1000005    25
    0.00036419786   2    1000005    23

DECAY 1000002  0.77810739
    0.58072046   2    1000037    1
    0.29174458   2    1000025    2
    0.094743861   2    1000024    1
    0.028884801   2    1000022    2
    0.0039062967   2    1000023    2

DECAY 2000002  1.1463837
    0.99713847   2    1000035    2
    0.0023693945   2    1000023    2
    0.00049101979   2    1000022    2

DECAY 1000004  0.78386539
    0.57642123   2    1000037    3
    0.28957519   2    1000025    4
    0.10091323   2    1000024    3
    0.028940706   2    1000022    4
    0.0041496475   2    1000023    4

DECAY 2000004  1.1481804
    0.99557333   2    1000035    4
    0.0027589737   2    1000023    4
    0.00088113536   2    1000022    4
    0.00078116994   2    1000024    3

DECAY 1000006  69.229011
    0.49754885   2    1000024    5
    0.25084647   2    1000023    6
    0.24848911   2    1000022    6
    0.0020995885   2    1000037    5
    0.0010143088   2    1000025    6

DECAY 2000006  396.42744
    0.23763455   2    1000021    6
    0.19529827   2    1000006    25
    0.1292701   2    1000024    5
    0.12340506   2    1000006    23
    0.10426576   2    1000023    6
    0.1041608   2    1000022    6
    0.067602573   2    1000037    5
    0.034525792   2    1000025    6
    0.0010742635   2    1000035    6
    0.0010463645   2    1000006    36
    0.0010247998   2    1000006    35
    0.00069167529   2    1000005    24

DECAY 1000024  1.1309585e-12
    0.69331014   2    1000022    211
    0.15735185   3    1000022   -11    12
    0.14933801   3    1000022   -13    14

DECAY 1000037  14.244878
    0.25663959   2    1000024    25
    0.24451737   2    1000023    24
    0.2400368   2    1000022    24
    0.2390193   2    1000024    23
    0.0069192252   3    1000024    6   -6
    0.0064688888   3    1000022   -5    6
    0.0062270591   3    1000023   -5    6

DECAY 1000022 -1


DECAY 1000023  1.049852e-08
    0.88247243   2    1000022    22
    0.025506167   3    1000022    12   -12
    0.019072432   3    1000022    1   -1
    0.018887999   3    1000022    3   -3
    0.014875368   3    1000022    2   -2
    0.007896691   3    1000024    1   -2
    0.007896691   3   -1000024   -1    2
    0.0043042227   3    1000022    11   -11
    0.0042387993   3    1000022    13   -13
    0.0026323014   3    1000024    11   -12
    0.0026323014   3   -1000024   -11    12
    0.0026038877   3    1000024    13   -14
    0.0026038877   3   -1000024   -13    14
    0.0015708612   3    1000024    3   -4
    0.0015708612   3   -1000024   -3    4
    0.0011152424   3    1000022    4   -4

DECAY 1000025  17.014038
    0.20142264   2    1000024   -24
    0.20142264   2   -1000024    24
    0.19490591   2    1000022    25
    0.1864231   2    1000023    23
    0.18197871   2    1000023    25
    0.018509842   2    1000022    23
    0.0053205431   3    1000024    5   -6
    0.0053205431   3   -1000024   -5    6
    0.0023618563   3    1000022    6   -6
    0.0021743809   3    1000023    6   -6

DECAY 1000035  7.8452459
    0.19222716   2    1000024   -24
    0.19222716   2   -1000024    24
    0.15932091   2    1000022    23
    0.15706517   2    1000022    25
    0.14472554   2    1000023    25
    0.033211178   2    1000023    23
    0.012223203   2    1000015   -15
    0.012223203   2   -1000015    15
    0.012073073   2    1000016   -16
    0.012073073   2   -1000016    16
    0.0071570129   3    1000024    5   -6
    0.0071570129   3   -1000024   -5    6
    0.0053855444   2    1000003   -3
    0.0053855444   2   -1000003    3
    0.0053853856   2    1000001   -1
    0.0053853856   2   -1000001    1
    0.0053776577   2    1000004   -4
    0.0053776577   2   -1000004    4
    0.0053775778   2    1000002   -2
    0.0053775778   2   -1000002    2
    0.004026853   3    1000022    6   -6
    0.0037476351   3    1000023    6   -6
    0.0032249501   2    2000015   -15
    0.0032249501   2   -2000015    15
    0.00027630662   3    1000023    5   -5
    0.00026191753   3    1000022    5   -5
    0.0001015404   2    1000037   -24
    0.0001015404   2   -1000037    24

DECAY 1000021  148.11217
    0.11142748   2    1000004   -4
    0.11142748   2   -1000004    4
    0.11142668   2    1000002   -2
    0.11142668   2   -1000002    2
    0.11118203   2    1000003   -3
    0.11118203   2   -1000003    3
    0.11118117   2    1000001   -1
    0.11118117   2   -1000001    1
    0.05348308   2    1000006   -6
    0.05348308   2   -1000006    6
    0.00045820123   2    2000002   -2
    0.00045820123   2   -2000002    2
    0.00045810913   2    2000004   -4
    0.00045810913   2   -2000004    4
    0.00017143661   3    1000024    5   -6
    0.00017143661   3   -1000024   -5    6
    0.00014337392   3    1000022    5   -5
    0.0001427291   3    1000023    5   -5

DECAY 25  0.004283698
    0.52996251   2   -5    5
    0.27344131   2   -24    24
    0.069839893   2    21    21
    0.061398741   2   -15    15
    0.034854668   2    23    23
    0.026048034   2   -4    4
    0.0023269488   2    22    22
    0.0017150427   2    22    23
    0.00021288241   2   -13    13
    0.00019927905   2   -3    3
    5.5099027e-07   2   -1    1
    1.3422404e-07   2   -2    2
    4.7858018e-09   2   -11    11

DECAY 35  54.469528
    0.79672369   2   -5    5
    0.20151069   2   -15    15
    0.00067585808   2   -13    13
    0.00032765893   2   -3    3
    0.00032675175   2   -6    6
    0.00024777656   2   -1000024    1000024
    0.00010232541   2    1000022    1000023
    6.0628056e-05   2    1000022    1000022
    1.4955627e-05   2    21    21
    6.0786124e-06   2    25    25
    1.6582387e-06   2    1000023    1000023
    9.0638375e-07   2   -1    1
    6.0711895e-07   2    23    23
    3.1846204e-07   2   -24    24
    4.0555318e-08   2    22    23
    3.5860084e-08   2    22    22
    1.5181253e-08   2   -11    11
    4.7306051e-09   2   -4    4
    2.4388187e-14   2   -2    2

DECAY 36  51.877986
    0.79580428   2   -5    5
    0.20128467   2   -15    15
    0.0012041412   2   -1000024    1000024
    0.00067509377   2   -13    13
    0.00034389547   2   -6    6
    0.00032728355   2   -3    3
    0.00030443275   2    1000022    1000022
    2.5610838e-05   2    21    21
    2.1438627e-05   2    1000022    1000023
    7.2876672e-06   2    1000023    1000023
    9.0534643e-07   2   -1    1
    8.6111589e-07   2    23    25
    4.7291637e-08   2    22    22
    3.0984786e-08   2    22    23
    1.5164069e-08   2   -11    11
    4.8090016e-09   2   -4    4
    2.4790204e-14   2   -2    2
    8.1397289e-37   2    25    25

DECAY 37  47.669039
    0.80010884   2   -5    6
    0.19729065   2   -15    16
    0.0011897633   2   -5    4
    0.00069749346   2   -13    14
    0.00033772487   2   -3    4
    0.00031386414   2    1000023    1000024
    3.3894484e-05   2    1000022    1000024
    1.5743888e-05   2   -3    2
    8.4961415e-06   2   -5    2
    1.5497428e-06   2   -3    6
    9.4055407e-07   2    24    25
    9.3749644e-07   2   -1    2
    4.843693e-08   2   -1    6
    4.4023111e-08   2   -1    4
    1.6314445e-08   2   -11    12
    4.6197869e-13   2    24    35
    2.0805909e-13   2    24    36

DECAY 6  2.43
    1   2    5    24

DECAY 15 -1
