BLOCK SPINFO
   1   SPheno
   2   v4.0.5be

BLOCK SPHENOINFO
   1   2
   2   2

BLOCK MODSEL
   1   0

BLOCK MINPAR
   3    35.783293
   4    1

BLOCK EXTPAR
   0    1540.6699
   1    108.74109
   2   -718.63884
   3    3000
   11    2794.8758
   12    514.54074
   13   -425.60406
   23    613.56242
   25    34.65561
   26    3799.6849
   31    1974.6733
   32    1974.6733
   33    603.07515
   34    863.95633
   35    863.95633
   36    1353.9659
   41    5000
   42    5000
   43    1761.5492
   44    5000
   45    5000
   46    1391.7136
   47    5000
   48    5000
   49    1555.5379

BLOCK SMINPUTS
   1    127.90897
   2    1.1663787e-05
   3    0.1184
   4    91.1876
   5    4.18
   6    173.2
   7    1.777
   8    0
   11    0.00051099893
   12    0
   13    0.10565837
   14    0
   21    0.005
   22    0.0025
   23    0.095
   24    1.27

BLOCK GAUGE Q=  1540.6699
   1    0.35536298
   2    0.66519887
   3    1.219778

BLOCK YU Q=  1540.6699
   1   1    8.387862e-06
   2   2    0.0042610339
   3   3    1.0133211

BLOCK YD Q=  1540.6699
   1   1    0.00058412402
   2   2    0.011098356
   3   3    0.57926799

BLOCK YE Q=  1540.6699
   1   1    0.00010193391
   2   2    0.0210767
   3   3    0.35447543

BLOCK AU Q=  1540.6699
   1   1    0
   2   2    0
   3   3    2794.8758

BLOCK AD Q=  1540.6699
   1   1    0
   2   2    0
   3   3    514.54075

BLOCK AE Q=  1540.6699
   1   1    0
   2   2    0
   3   3   -425.60406

BLOCK MSOFT Q=  1540.6699
   1    108.74109
   2   -718.63884
   3    3000
   21    14034136
   22   -306557.78
   31    1974.6733
   32    1974.6733
   33    603.07515
   34    863.95633
   35    863.95633
   36    1353.9659
   41    5000
   42    5000
   43    1761.5492
   44    5000
   45    5000
   46    1391.7136
   47    5000
   48    5000
   49    1555.5379

BLOCK MASS
   6    173.2
   23    91.1876
   24    80.429995
   15    1.777
   25    123.03726
   35    3798.2505
   36    3799.6849
   37    3799.5467
   1000001    5029.941
   2000001    5019.5128
   1000002    5029.4904
   2000002    5022.0995
   1000003    5029.9451
   2000003    5019.5177
   1000004    5029.4937
   2000004    5022.1003
   1000005    1581.9933
   2000005    1760.6104
   1000006    1318.7101
   2000006    1799.9891
   1000011    1980.8388
   2000011    860.20506
   1000012    1978.8643
   1000013    1980.8413
   2000013    860.22886
   1000014    1978.8662
   1000015    624.05866
   2000015    1355.656
   1000016    620.08667
   1000021    3190.3866
   1000022    107.7498
   1000023   -603.86238
   1000025    627.41399
   1000035   -778.23866
   1000024    605.42507
   1000037    778.59911

BLOCK ALPHA
      -0.027982308

BLOCK HMIX Q=  1540.6699
   1    613.56242
   2    34.65561
   3    243.97554
   4    14437605

BLOCK STOPMIX
   1   1   -0.29323137
   1   2    0.95604151
   2   1   -0.95604151
   2   2   -0.29323137

BLOCK SBOTMIX
   1   1    0.065836351
   1   2    0.99783043
   2   1   -0.99783043
   2   2    0.065836351

BLOCK STAUMIX
   1   1    0.99967627
   1   2    0.025443204
   2   1   -0.025443204
   2   2    0.99967627

BLOCK NMIX
   1   1   -0.99714066
   1   2   -0.0015503386
   1   3   -0.074111531
   1   4    0.014682614
   2   1    0.040078816
   2   2    0.33601439
   2   3   -0.67596772
   2   4   -0.65464162
   3   1    0.062700512
   3   2   -0.042153861
   3   3   -0.70253695
   3   4    0.70762528
   4   1   -0.013146712
   4   2    0.94091178
   4   3    0.20980218
   4   4    0.26550939

BLOCK UMIX
   1   1   -0.29634025
   1   2    0.95508244
   2   1   -0.95508244
   2   2   -0.29634025

BLOCK VMIX
   1   1    0.37567897
   1   2    0.92674986
   2   1    0.92674986
   2   2   -0.37567897

BLOCK HIGGSBOUNDSINPUTHIGGSCOUPLINGSFERMIONS
       0, 1201.0113,3,36,15,15

BLOCK HIGGSBOUNDSINPUTHIGGSCOUPLINGSBOSONS
       0,4,36,21,21,23

BLOCK SPHENOLOWENERGY
   1    0.00034845033
   2    1.5860085e-06
   3    3.5207733e-05
   4    2.9606278e-15
   5    1.2647494e-10
   6    2.6503821e-08
   7    9.9349604e-14
   8    4.2442216e-09
   9    9.0118401e-07
   10    9.6180492e-05
   11    0.99350766
   12    0.54356906
   13    19.41947
   14    0
   15    0
   16    0.0021657683
   17    2.2817448e-15
   18    2.4762228e-11
   19    8.2817031e-11
   20   -5.8889386e-15
   21   -2.5178667e-10
   22   -1.5253938e-07
   23    0
   24    0
   25    0
   26    0
   27    0
   28    0
   29    0
   30    0
   31    0
   39    8.3401818e-05
   40    0
   41    0
   42    0

BLOCK FWCOEF Q=  160
   305   4422   0   0   -0.18881911
   305   4422   0   2   -0.22172827
   305   4322   0   2   -0.00027870935
   305   6421   0   0   -0.095227835
   305   6421   0   2   -0.11373524
   305   6321   0   2   -0.00019020462
   3051111   4133   0   0    1.5931175
   3051111   4133   0   2    1.5943883
   3051111   4233   0   2    0.00016388917
   3051111   4137   0   0   -4.4158096
   3051111   4137   0   2   -4.4097608
   3051111   4237   0   2   -0.0012723686
   3051313   4133   0   0    1.5931175
   3051313   4133   0   2    1.5943867
   3051313   4233   0   2    0.00016388841
   3051313   4137   0   0   -4.4158096
   3051313   4137   0   2   -4.4097624
   3051313   4237   0   2   -0.00127237
   3051212   4137   0   0    1.5053501
   3051212   4137   0   2    1.5040413
   3051212   4237   0   2    0.00027721346
   3051414   4137   0   0    1.5053501
   3051414   4137   0   2    1.5040413
   3051414   4237   0   2    0.00027721348
   3051616   4137   0   0    1.5053501
   3051616   4137   0   2    1.5040419
   3051616   4237   0   2    0.00027721588

BLOCK IMFWCOEF Q=  160
   305   4422   0   0    3.8574882e-07
   305   4422   0   2   -1.4626774e-05
   305   4322   0   2   -3.5233801e-06
   305   6421   0   0    3.3041938e-07
   305   6421   0   2   -1.0873256e-05
   305   6321   0   2   -1.4351963e-06
   3051111   4133   0   2    4.413572e-07
   3051111   4233   0   2    3.2924445e-06
   3051111   4137   0   2   -1.1223813e-06
   3051111   4237   0   2   -2.5567105e-05
   3051313   4133   0   2    4.4133598e-07
   3051313   4233   0   2    3.2924327e-06
   3051313   4137   0   2   -1.1223715e-06
   3051313   4237   0   2   -2.5567132e-05
   3051212   4137   0   2    4.03328e-07
   3051212   4237   0   2    5.5703835e-06
   3051414   4137   0   2    4.0332852e-07
   3051414   4237   0   2    5.5703835e-06
   3051616   4137   0   2    4.1335449e-07
   3051616   4237   0   2    5.5703422e-06

DECAY 23  2.4952


DECAY 24  2.085


DECAY 2000011  4.1692662
    0.99867301   2    1000022    11
    0.00089268744   2    1000025    11
    0.00042838844   2    1000023    11

DECAY 1000011  21.4578
    0.52991434   2   -1000037    12
    0.2534142   2    1000035    11
    0.1152847   2    1000022    11
    0.058653539   2   -1000024    12
    0.042708565   2    1000023    11

DECAY 2000013  4.1729461
    0.99783119   2    1000022    13
    0.0010893268   2    1000025    13
    0.00064244063   2    1000023    13
    0.00042325974   2   -1000024    14

DECAY 1000013  21.47274
    0.52954677   2   -1000037    14
    0.25326434   2    1000035    13
    0.11520909   2    1000022    13
    0.058612832   2   -1000024    14
    0.042985155   2    1000023    13
    0.00035033469   2    1000025    13

DECAY 1000015  0.75738627
    0.99228701   2    1000022    15
    0.0053133831   2    1000023    15
    0.0023996016   2   -1000024    16

DECAY 2000015  11.983265
    0.55857218   2    1000022    15
    0.16035854   2   -1000024    16
    0.088233021   2    1000025    15
    0.081058325   2    1000023    15
    0.044364232   2    1000016   -24
    0.023288923   2    1000015    25
    0.021808032   2    1000015    23
    0.014841198   2   -1000037    16
    0.0074755504   2    1000035    15

DECAY 1000012  21.49239
    0.49727816   2    1000037    11
    0.26022482   2    1000035    12
    0.11365224   2    1000022    12
    0.093979994   2    1000024    11
    0.032988373   2    1000023    12
    0.0018764083   2    1000025    12

DECAY 1000014  21.506628
    0.49700031   2    1000037    13
    0.260053   2    1000035    14
    0.11357711   2    1000022    14
    0.094527833   2    1000024    13
    0.03296658   2    1000023    14
    0.0018751688   2    1000025    14

DECAY 1000016  0.73017774
    0.99178793   2    1000022    16
    0.0072253259   2    1000024    15
    0.00098673973   2    1000023    16

DECAY 2000001  143.54624
    0.98049853   2    1000021    1
    0.019392968   2    1000022    1

DECAY 1000001  205.92552
    0.68875558   2    1000021    1
    0.18685386   2   -1000037    2
    0.091131054   2    1000035    1
    0.018339664   2   -1000024    2
    0.011295796   2    1000023    1
    0.0033277595   2    1000022    1
    0.00029629085   2    1000025    1

DECAY 2000003  143.57053
    0.98033616   2    1000021    3
    0.019390174   2    1000022    3
    0.00011533219   2    1000025    3

DECAY 1000003  205.93968
    0.68871028   2    1000021    3
    0.18684242   2   -1000037    4
    0.091127387   2    1000035    3
    0.018345725   2   -1000024    4
    0.011321509   2    1000023    3
    0.0033278608   2    1000022    3
    0.00032482138   2    1000025    3

DECAY 1000005  15.80225
    0.44364876   2   -1000024    6
    0.23408972   2    1000023    5
    0.23166036   2    1000025    5
    0.061282487   2    1000022    5
    0.018029981   2   -1000037    6
    0.0097318558   2    1000035    5
    0.0015568397   2    1000006   -24

DECAY 2000005  76.873818
    0.33226152   2    1000006   -24
    0.3041544   2   -1000024    6
    0.17573128   2   -1000037    6
    0.064356374   2    1000035    5
    0.060072498   2    1000023    5
    0.058417233   2    1000025    5
    0.0033364458   2    1000022    5
    0.0011972637   2    1000005    25
    0.00047298175   2    1000005    23

DECAY 2000002  152.21905
    0.92640232   2    1000021    2
    0.073189912   2    1000022    2
    0.00028068356   2    1000025    2
    0.00011495252   2    1000023    2

DECAY 1000002  205.92062
    0.68854415   2    1000021    2
    0.17591913   2    1000037    1
    0.090221844   2    1000035    2
    0.02947238   2    1000024    1
    0.012296643   2    1000023    2
    0.0034458082   2    1000022    2
    0.00010004768   2    1000025    2

DECAY 2000004  152.22258
    0.92638094   2    1000021    4
    0.073188216   2    1000022    4
    0.00028646518   2    1000025    4
    0.00011990704   2    1000023    4

DECAY 1000004  205.93462
    0.68849871   2    1000021    4
    0.17591226   2    1000037    3
    0.090216313   2    1000035    4
    0.029523298   2    1000024    3
    0.012299515   2    1000023    4
    0.0034455777   2    1000022    4
    0.00010432479   2    1000025    4

DECAY 1000006  35.969504
    0.44090385   2    1000024    5
    0.2392678   2    1000025    6
    0.23079201   2    1000023    6
    0.06962104   2    1000022    6
    0.011202192   2    1000037    5
    0.0075631414   2    1000035    6
    0.00045105442   2    1000023    4
    0.00019413642   2    1000022    4

DECAY 2000006  79.893616
    0.18345432   2    1000006    23
    0.16881844   2    1000006    25
    0.16189483   2    1000025    6
    0.15334442   2    1000037    5
    0.13963592   2    1000023    6
    0.099070593   2    1000024    5
    0.083802828   2    1000035    6
    0.0081187111   2    1000022    6
    0.0018599283   2    1000005    24

DECAY 1000024  0.35060435
    0.99349118   2    1000022    24
    0.0060568418   3    1000022   -5    6
    0.00045100014   3    1000022   -15    16

DECAY 1000037  3.7310891
    0.34697506   2    1000023    24
    0.16752503   2    1000024    23
    0.1317284   2    1000025    24
    0.11439555   2    1000024    25
    0.10902298   2    1000016   -15
    0.10615763   2   -1000015    16
    0.023924185   2    1000022    24
    0.00026365368   3    1000022   -5    6

DECAY 1000022 -1


DECAY 1000023  0.43108649
    0.57551143   2    1000022    23
    0.42354351   2    1000022    25
    0.00051766261   3    1000022    6   -6
    0.00032333856   3    1000022    15   -15

DECAY 1000025  0.39042941
    0.64990616   2    1000022    25
    0.34889349   2    1000022    23
    0.00086607828   3    1000022    6   -6

DECAY 1000035  5.4084269
    0.23314428   2    1000024   -24
    0.23314428   2   -1000024    24
    0.19586282   2    1000025    23
    0.0926837   2    1000025    25
    0.075463937   2    1000023    25
    0.037939071   2    1000016   -16
    0.037939071   2   -1000016    16
    0.035720887   2    1000015   -15
    0.035720887   2   -1000015    15
    0.010697493   2    1000022    23
    0.0090829226   2    1000022    25
    0.0025049692   2    1000023    23

DECAY 1000021  211.27152
    0.16464519   2    1000006   -6
    0.16464519   2   -1000006    6
    0.12704172   2    1000005   -5
    0.12704172   2   -1000005    5
    0.10814994   2    2000005   -5
    0.10814994   2   -2000005    5
    0.094234147   2    2000006   -6
    0.094234147   2   -2000006    6
    0.0058395219   2    1000006   -4
    0.0058395219   2   -1000006    4

DECAY 25  0.0036307149
    0.60214222   2   -5    5
    0.19779233   2   -24    24
    0.073756855   2    21    21
    0.069247952   2   -15    15
    0.029895498   2   -4    4
    0.023017647   2    23    23
    0.002343703   2    22    22
    0.0013358801   2    22    23
    0.00024026795   2   -13    13
    0.00022686533   2   -3    3
    6.2726064e-07   2   -1    1
    1.5406489e-07   2   -2    2
    5.4015156e-09   2   -11    11

DECAY 35  90.30294
    0.36923765   2   -5    5
    0.11065325   2   -1000024    1000037
    0.11065325   2   -1000037    1000024
    0.089497343   2   -15    15
    0.068349748   2    1000025    1000035
    0.050776634   2   -1000024    1000024
    0.040558948   2    1000023    1000035
    0.029150579   2   -1000037    1000037
    0.024978488   2    1000022    1000023
    0.020668886   2    1000022    1000025
    0.018759084   2    1000023    1000023
    0.015176112   2    1000035    1000035
    0.013756925   2   -2000006    1000006
    0.013756925   2   -1000006    2000006
    0.0076618515   2   -1000006    1000006
    0.0065669937   2    1000023    1000025
    0.0030456912   2   -2000006    2000006
    0.0011779696   2   -2000005    1000005
    0.0011779696   2   -1000005    2000005
    0.00079604661   2    1000025    1000025
    0.00078619453   2    1000022    1000035
    0.00065783189   2   -6    6
    0.00052135557   2   -2000015    1000015
    0.00052135557   2   -1000015    2000015
    0.00050188616   2    1000022    1000022
    0.00035204453   2   -13    13
    0.00020038414   2   -3    3
    2.6531443e-05   2   -1000005    1000005
    1.2650804e-05   2   -2000005    2000005
    7.5799454e-06   2    21    21
    7.4626588e-06   2    25    25
    1.8040148e-06   2   -1000015    1000015
    1.3095952e-06   2   -2000015    2000015
    5.5402461e-07   2   -1    1
    1.8848812e-07   2    23    23
    1.3560856e-07   2    22    23
    6.8347947e-08   2    22    22
    4.2313435e-08   2   -24    24
    3.5279592e-08   2   -1000011    1000011
    3.497565e-08   2   -1000013    1000013
    1.1675485e-08   2   -4    4
    7.9060627e-09   2   -11    11
    2.4684324e-09   2   -2000013    1000013
    2.4684324e-09   2   -1000013    2000013
    6.0190564e-14   2   -2    2
    5.7737009e-14   2   -2000011    1000011
    5.7737009e-14   2   -1000011    2000011

DECAY 36  87.943902
    0.35669645   2   -5    5
    0.11292693   2   -1000024    1000037
    0.11292693   2   -1000037    1000024
    0.08645881   2   -15    15
    0.068072145   2    1000025    1000035
    0.052925936   2   -1000024    1000024
    0.042850155   2    1000023    1000035
    0.030687108   2   -1000037    1000037
    0.024253868   2    1000022    1000025
    0.022835784   2    1000022    1000023
    0.020044992   2   -2000006    1000006
    0.020044992   2   -1000006    2000006
    0.019162092   2    1000023    1000023
    0.016058217   2    1000035    1000035
    0.0071588851   2    1000023    1000025
    0.0012329622   2   -2000005    1000005
    0.0012329622   2   -1000005    2000005
    0.0010237014   2    1000025    1000025
    0.00068018799   2   -6    6
    0.00058291704   2    1000022    1000035
    0.00053691702   2   -2000015    1000015
    0.00053691702   2   -1000015    2000015
    0.00052909938   2    1000022    1000022
    0.0003401017   2   -13    13
    0.00019357656   2   -3    3
    6.3682066e-06   2    21    21
    5.3520306e-07   2   -1    1
    3.8683491e-07   2    23    25
    3.8930586e-08   2    22    23
    1.2444786e-08   2   -4    4
    7.6379234e-09   2   -11    11
    2.7152738e-09   2    22    22
    2.5299976e-09   2   -2000013    1000013
    2.5299976e-09   2   -1000013    2000013
    7.5843308e-14   2    23    35
    6.415957e-14   2   -2    2
    5.91769e-14   2   -2000011    1000011
    5.91769e-14   2   -1000011    2000011
    1.0598084e-38   2    25    25

DECAY 37  90.482159
    0.36602422   2   -5    6
    0.15689925   2    1000023    1000037
    0.14315894   2    1000024    1000035
    0.12797721   2    1000025    1000037
    0.10752879   2   -15    16
    0.047156748   2    1000022    1000024
    0.023455706   2   -2000005    1000006
    0.020143529   2    1000024    1000025
    0.0029157816   2   -1000005    2000006
    0.0014043224   2    1000022    1000037
    0.0010430377   2   -2000015    1000016
    0.00060789934   2   -2000005    2000006
    0.00054110151   2   -5    4
    0.00043586156   2    1000023    1000024
    0.00038015257   2   -13    14
    0.00018454246   2   -3    4
    0.00012057844   2   -1000005    1000006
    8.6656637e-06   2   -3    2
    5.1407096e-06   2    1000035    1000037
    3.8640226e-06   2   -5    2
    2.0731556e-06   2   -3    6
    1.5774114e-06   2   -1000015    1000016
    5.1219014e-07   2   -1    2
    3.760874e-07   2    24    25
    8.2488722e-08   2   -1    6
    2.4734839e-08   2   -1    4
    8.891808e-09   2   -11    12
    4.8820524e-09   2   -1000013    1000014
    1.1419069e-13   2   -1000011    1000012
    5.504983e-14   2    24    35

DECAY 6  2.43
    1   2    5    24

DECAY 15 -1
