BLOCK SPINFO
   1   SPheno
   2   v4.0.5be

BLOCK SPHENOINFO
   1   2
   2   2

BLOCK MODSEL
   1   0

BLOCK MINPAR
   3    42.994308
   4   -1

BLOCK EXTPAR
   0    2940.2501
   1    577.18442
   2   -3225.9279
   3    3178.6433
   11    2624.4475
   12    990.18793
   13    2677.0914
   23   -559.15809
   25    42.217975
   26    3305.2756
   31    3315.9605
   32    3315.9605
   33    2170.4312
   34    4662.531
   35    4662.531
   36    1836.1407
   41    2140.6436
   42    2140.6436
   43    3389.5138
   44    3066.6551
   45    3066.6551
   46    2417.6807
   47    4800.8009
   48    4800.8009
   49    4566.5451

BLOCK SMINPUTS
   1    127.90897
   2    1.1663787e-05
   3    0.1184
   4    91.1876
   5    4.18
   6    173.2
   7    1.777
   8    0
   11    0.00051099893
   12    0
   13    0.10565837
   14    0
   21    0.005
   22    0.0025
   23    0.095
   24    1.27

BLOCK GAUGE Q=  2940.2501
   1    0.35536298
   2    0.66519887
   3    1.219778

BLOCK YU Q=  2940.2501
   1   1    8.3867239e-06
   2   2    0.0042604557
   3   3    1.0131836

BLOCK YD Q=  2940.2501
   1   1    0.00071149195
   2   2    0.013518347
   3   3    0.70557706

BLOCK YE Q=  2940.2501
   1   1    0.00012416055
   2   2    0.025672463
   3   3    0.4317686

BLOCK AU Q=  2940.2501
   1   1    0
   2   2    0
   3   3    2624.4469

BLOCK AD Q=  2940.2501
   1   1    0
   2   2    0
   3   3    990.18758

BLOCK AE Q=  2940.2501
   1   1    0
   2   2    0
   3   3    2677.0916

BLOCK MSOFT Q=  2940.2501
   1    577.18442
   2   -3225.9279
   3    3178.6433
   21    10736671
   22   -193926.57
   31    3315.9605
   32    3315.9605
   33    2170.4312
   34    4662.531
   35    4662.531
   36    1836.1407
   41    2140.6436
   42    2140.6436
   43    3389.5138
   44    3066.6551
   45    3066.6551
   46    2417.6807
   47    4800.8009
   48    4800.8009
   49    4566.5451

BLOCK MASS
   6    173.2
   23    91.1876
   24    80.429995
   15    1.777
   25    120.56815
   35    3304.5822
   36    3305.2756
   37    3305.8132
   1000001    2304.1735
   2000001    4867.2804
   1000002    2302.7769
   2000002    3172.2556
   1000003    2304.1693
   2000003    4867.2732
   1000004    2302.7727
   2000004    3172.2551
   1000005    3473.6903
   2000005    4615.9066
   1000006    2485.1022
   2000006    3478.7586
   1000011    3334.8105
   2000011    4671.1471
   1000012    3333.448
   1000013    3334.7926
   2000013    4671.1117
   1000014    3333.4302
   1000015    1832.3482
   2000015    2185.6985
   1000016    2183.0862
   1000021    3353.1666
   1000022    542.44808
   1000023   -570.34245
   1000025    603.90958
   1000035   -3212.9096
   1000024    570.14364
   1000037    3213.0174

BLOCK ALPHA
      -0.023305191

BLOCK HMIX Q=  2940.2501
   1   -559.15809
   2    42.217975
   3    243.28609
   4    10924847

BLOCK STOPMIX
   1   1   -0.060719589
   1   2    0.99815486
   2   1   -0.99815486
   2   2   -0.060719589

BLOCK SBOTMIX
   1   1   -0.99997955
   1   2    0.0063955504
   2   1   -0.0063955504
   2   2   -0.99997955

BLOCK STAUMIX
   1   1   -0.033967138
   1   2    0.99942295
   2   1   -0.99942295
   2   2   -0.033967138

BLOCK NMIX
   1   1   -0.68853368
   1   2   -0.010085918
   1   3    0.52627805
   1   4    0.49884974
   2   1   -0.028150085
   2   2   -0.021146997
   2   3   -0.70687598
   2   4    0.70646071
   3   1    0.72465775
   3   2   -0.0099991384
   3   3    0.47258184
   3   4    0.5014355
   4   1   -0.00029392619
   4   2    0.99967549
   4   3   -0.0049164912
   4   4    0.024992913

BLOCK UMIX
   1   1   -0.0069599175
   1   2   -0.99997578
   2   1   -0.99997578
   2   2    0.0069599175

BLOCK VMIX
   1   1    0.035370816
   1   2    0.99937426
   2   1    0.99937426
   2   2   -0.035370816

BLOCK HIGGSBOUNDSINPUTHIGGSCOUPLINGSFERMIONS
       0, 1782.3574,3,36,15,15

BLOCK HIGGSBOUNDSINPUTHIGGSCOUPLINGSBOSONS
       0,4,36,21,21,23

BLOCK SPHENOLOWENERGY
   1    0.00031913794
   2    1.5906384e-06
   3    3.5253971e-05
   4    2.6782461e-15
   5    1.1441097e-10
   6    2.3913793e-08
   7    9.0725623e-14
   8    3.8757726e-09
   9    8.2078155e-07
   10    9.5943236e-05
   11    0.99105689
   12    0.54220367
   13    19.369028
   14    0
   15    0
   16    0.0021582518
   17    2.281669e-15
   18    2.4799034e-11
   19    8.2905013e-11
   20    1.5391946e-15
   21    6.5805428e-11
   22    2.5379327e-08
   23    0
   24    0
   25    0
   26    0
   27    0
   28    0
   29    0
   30    0
   31    0
   39    7.1073534e-05
   40    0
   41    0
   42    0

BLOCK FWCOEF Q=  160
   305   4422   0   0   -0.18881911
   305   4422   0   2   -0.18647384
   305   4322   0   2    0.00010457176
   305   6421   0   0   -0.095227835
   305   6421   0   2   -0.098918613
   305   6321   0   2   -4.5078843e-05
   3051111   4133   0   0    1.6163226
   3051111   4133   0   2    1.6171571
   3051111   4233   0   2    0.00015232873
   3051111   4137   0   0   -4.4390147
   3051111   4137   0   2   -4.437525
   3051111   4237   0   2   -0.001143474
   3051313   4133   0   0    1.6163226
   3051313   4133   0   2    1.6171562
   3051313   4233   0   2    0.00015232822
   3051313   4137   0   0   -4.4390147
   3051313   4137   0   2   -4.4375259
   3051313   4237   0   2   -0.0011434746
   3051212   4137   0   0    1.5053501
   3051212   4137   0   2    1.5050277
   3051212   4237   0   2    0.00024783948
   3051414   4137   0   0    1.5053501
   3051414   4137   0   2    1.5050277
   3051414   4237   0   2    0.00024783954
   3051616   4137   0   0    1.5053501
   3051616   4137   0   2    1.5050276
   3051616   4237   0   2    0.00024785653

BLOCK IMFWCOEF Q=  160
   305   4422   0   0    3.8583954e-07
   305   4422   0   2    5.2681592e-06
   305   4322   0   2    3.780246e-06
   305   6421   0   0    3.3049708e-07
   305   6421   0   2    6.372706e-06
   305   6321   0   2    1.7431111e-06
   3051111   4133   0   2    6.3041114e-07
   3051111   4233   0   2    3.4312354e-06
   3051111   4137   0   2   -3.8775402e-06
   3051111   4237   0   2   -2.5762933e-05
   3051313   4133   0   2    6.304066e-07
   3051313   4233   0   2    3.4312316e-06
   3051313   4137   0   2   -3.8775431e-06
   3051313   4237   0   2   -2.5762948e-05
   3051212   4137   0   2    8.4775956e-07
   3051212   4237   0   2    5.5839242e-06
   3051414   4137   0   2    8.4775945e-07
   3051414   4237   0   2    5.5839242e-06
   3051616   4137   0   2    8.465069e-07
   3051616   4237   0   2    5.583924e-06

DECAY 23  2.4952


DECAY 24  2.085


DECAY 1000011  4.1857597
    0.47467505   2    1000022    11
    0.46656817   2    1000025    11
    0.036063151   2   -1000037    12
    0.018046418   2    1000035    11
    0.0043270491   2    1000023    11
    0.00032016293   2   -1000024    12

DECAY 2000011  22.763596
    0.52349463   2    1000025    11
    0.47571238   2    1000022    11
    0.00079289696   2    1000023    11

DECAY 1000013  4.2268738
    0.47276988   2    1000022    13
    0.46418908   2    1000025    13
    0.035702277   2   -1000037    14
    0.017865823   2    1000035    13
    0.0091558941   2    1000023    13
    0.00031704686   2   -1000024    14

DECAY 2000013  22.882489
    0.52134816   2    1000025    13
    0.47395852   2    1000022    13
    0.0025973087   2   -1000024    14
    0.0020865714   2    1000023    13

DECAY 1000015  18.562837
    0.29849792   2   -1000024    16
    0.28436815   2    1000022    15
    0.26752068   2    1000025    15
    0.14961325   2    1000023    15

DECAY 2000015  9.6217522
    0.36650575   2    1000023    15
    0.32117173   2    1000022    15
    0.29241293   2    1000025    15
    0.010063698   2    1000015    23
    0.0094503385   2    1000015    25
    0.00039554656   2   -1000024    16

DECAY 1000012  4.2007867
    0.51527237   2    1000025    12
    0.42364066   2    1000022    12
    0.035120828   2    1000037    11
    0.017607443   2    1000035    12
    0.0082358782   2    1000024    11
    0.00012281419   2    1000023    12

DECAY 1000014  4.2418838
    0.51027711   2    1000025    14
    0.41953378   2    1000022    14
    0.034770672   2    1000037    13
    0.017864912   2    1000024    13
    0.017431898   2    1000035    14
    0.00012162359   2    1000023    14

DECAY 1000016  9.6194675
    0.73288511   2    1000024    15
    0.13434786   2    1000025    16
    0.11254097   2    1000022    16
    0.020193696   2    1000015    24

DECAY 1000001  0.28784206
    0.59081294   2    1000025    1
    0.39806077   2    1000022    1
    0.0081179619   2    1000023    1
    0.0030083298   2   -1000024    2

DECAY 2000001  108.69165
    0.97569267   2    1000021    1
    0.012727576   2    1000025    1
    0.011559822   2    1000022    1

DECAY 1000003  0.29593416
    0.58011802   2    1000025    3
    0.39415618   2    1000022    3
    0.020326688   2    1000023    3
    0.0053991088   2   -1000024    4

DECAY 2000003  108.72534
    0.97538367   2    1000021    3
    0.012758737   2    1000025    3
    0.01160008   2    1000022    3
    0.00015831075   2   -1000024    4

DECAY 1000005  113.96046
    0.58543316   2   -1000024    6
    0.14287112   2    1000023    5
    0.10625646   2    1000006   -24
    0.081674775   2    1000022    5
    0.065383501   2    1000025    5
    0.011174659   2    1000021    5
    0.0044073449   2   -1000037    6
    0.0027989765   2    1000035    5

DECAY 2000005  172.79689
    0.47033744   2    1000021    5
    0.25583434   2   -1000024    6
    0.12819358   2    1000023    5
    0.077740021   2    1000022    5
    0.065045702   2    1000025    5
    0.0012627809   2    2000006   -24
    0.00090789109   2    1000005    25
    0.00063965522   2    1000005    23

DECAY 1000002  0.31225136
    0.50989035   2    1000022    2
    0.39890365   2    1000025    2
    0.071634122   2    1000024    1
    0.019571881   2    1000023    2

DECAY 2000002  6.6255394
    0.52152021   2    1000025    2
    0.4776864   2    1000022    2
    0.00079339192   2    1000023    2

DECAY 1000004  0.32033788
    0.49760392   2    1000022    4
    0.38938837   2    1000025    4
    0.092785458   2    1000024    3
    0.02022226   2    1000023    4

DECAY 2000004  6.6276792
    0.52139348   2    1000025    4
    0.47757103   2    1000022    4
    0.00087382767   2    1000023    4
    0.00016165334   2    1000024    3

DECAY 1000006  95.689504
    0.47582052   2    1000024    5
    0.23589882   2    1000023    6
    0.15306695   2    1000025    6
    0.13521084   2    1000022    6

DECAY 2000006  116.52579
    0.28616556   2    1000023    6
    0.27978631   2    1000024    5
    0.15206716   2    1000022    6
    0.1380531   2    1000025    6
    0.083935011   2    1000006    25
    0.052326915   2    1000006    23
    0.005684547   2    1000037    5
    0.0019813954   2    1000035    6

DECAY 1000024  1.2045277e-05
    0.33516362   3    1000022   -1    2
    0.33182912   3    1000022   -3    4
    0.11171893   3    1000022   -11    12
    0.11171828   3    1000022   -13    14
    0.10957005   3    1000022   -15    16

DECAY 1000037  76.933004
    0.13027485   2    1000004   -3
    0.13027387   2    1000002   -1
    0.13009747   2   -1000003    4
    0.13009664   2   -1000001    2
    0.092885025   2    1000024    25
    0.086449278   2    1000024    23
    0.086405283   2    1000023    24
    0.053208978   2    1000016   -15
    0.053009501   2   -2000015    16
    0.044752265   2    1000022    24
    0.041699908   2    1000025    24
    0.0086719122   3    1000024    6   -6
    0.0055169556   3    1000023   -5    6
    0.0029484726   3    1000022   -5    6
    0.0027525076   3    1000025   -5    6
    0.00075563982   3    1000024    5   -5

DECAY 1000022 -1


DECAY 1000023  3.2208516e-05
    0.19826006   3    1000022    12   -12
    0.14825718   3    1000022    1   -1
    0.14823809   3    1000022    3   -3
    0.11562903   3    1000022    2   -2
    0.11545141   3    1000022    5   -5
    0.11257111   3    1000022    4   -4
    0.06300625   2    1000022    22
    0.033455903   3    1000022    11   -11
    0.03344914   3    1000022    13   -13
    0.031681829   3    1000022    15   -15

DECAY 1000025  0.00013716183
    0.10974435   3    1000023    12   -12
    0.082063732   3    1000023    1   -1
    0.082056598   3    1000023    3   -3
    0.073509022   3    1000024    1   -2
    0.073509022   3   -1000024   -1    2
    0.073029284   3    1000024    3   -4
    0.073029284   3   -1000024   -3    4
    0.069362261   3    1000023    5   -5
    0.06400136   3    1000023    2   -2
    0.062848416   3    1000023    4   -4
    0.035238529   2    1000023    22
    0.024503605   3    1000024    11   -12
    0.024503605   3   -1000024   -11    12
    0.024503486   3    1000024    13   -14
    0.024503486   3   -1000024   -13    14
    0.024194152   3    1000024    15   -16
    0.024194152   3   -1000024   -15    16
    0.018520374   3    1000023    11   -11
    0.018517845   3    1000023    13   -13
    0.017864732   3    1000023    15   -15
    0.00023310735   2    1000022    22

DECAY 1000035  79.105398
    0.084335053   2    1000024   -24
    0.084335053   2   -1000024    24
    0.063369069   2    1000004   -4
    0.063369069   2   -1000004    4
    0.063368583   2    1000002   -2
    0.063368583   2   -1000002    2
    0.063219974   2    1000003   -3
    0.063219974   2   -1000003    3
    0.06321948   2    1000001   -1
    0.06321948   2   -1000001    1
    0.062490615   2    1000023    25
    0.029668291   2    1000022    23
    0.029034781   2    1000022    25
    0.028286269   2    1000025    23
    0.027992779   2    1000025    25
    0.02608127   2    1000023    23
    0.025893736   2    1000016   -16
    0.025893736   2   -1000016    16
    0.025750439   2    2000015   -15
    0.025750439   2   -2000015    15
    0.0051954297   3    1000024    5   -6
    0.0051954297   3   -1000024   -5    6
    0.0034303497   3    1000023    6   -6
    0.0017537347   3    1000022    6   -6
    0.0015772956   3    1000025    6   -6
    0.00036958962   3    1000023    5   -5
    0.00021749891   3    1000022    5   -5
    0.00016689241   3    1000025    5   -5

DECAY 1000021  133.83648
    0.10352266   2    1000004   -4
    0.10352266   2   -1000004    4
    0.10352205   2    1000002   -2
    0.10352205   2   -1000002    2
    0.10329861   2    1000003   -3
    0.10329861   2   -1000003    3
    0.10329793   2    1000001   -1
    0.10329793   2   -1000001    1
    0.076273921   2    1000006   -6
    0.076273921   2   -1000006    6
    0.0040876044   2    2000002   -2
    0.0040876044   2   -2000002    2
    0.0040875333   2    2000004   -4
    0.0040875333   2   -2000004    4
    0.00095161347   3    1000024    5   -6
    0.00095161347   3   -1000024   -5    6
    0.00048840845   3    1000023    6   -6
    0.00042012575   3    1000023    5   -5
    0.00026634355   3    1000022    6   -6
    0.00024385583   3    1000022    5   -5
    0.00022903472   3    1000025    6   -6
    0.00019132546   3    1000025    5   -5

DECAY 25  0.0033837681
    0.63810715   2   -5    5
    0.16073693   2   -24    24
    0.074980174   2    21    21
    0.072923498   2   -15    15
    0.031519472   2   -4    4
    0.01779636   2    23    23
    0.0023160929   2    22    22
    0.00112689   2    22    23
    0.00025290816   2   -13    13
    0.0002396915   2   -3    3
    6.6272257e-07   2   -1    1
    1.6244219e-07   2   -2    2
    5.6857182e-09   2   -11    11

DECAY 35  97.096945
    0.82679662   2   -5    5
    0.13601396   2   -15    15
    0.011744423   2    1000023    1000025
    0.0077976021   2    1000022    1000022
    0.0074996709   2    1000025    1000025
    0.0061459448   2    1000022    1000023
    0.0020191594   2    1000022    1000025
    0.00088441509   2   -6    6
    0.00046041761   2   -13    13
    0.00031669443   2   -3    3
    0.00030534622   2   -1000024    1000024
    8.4964517e-06   2    21    21
    5.5946136e-06   2    1000023    1000023
    8.7545918e-07   2   -1    1
    5.2044885e-07   2    25    25
    1.7620244e-07   2    23    23
    4.6951098e-08   2   -24    24
    1.2758513e-08   2   -4    4
    1.0340304e-08   2   -11    11
    9.1110038e-09   2    22    23
    7.1034597e-09   2    22    22
    6.5777215e-14   2   -2    2

DECAY 36  90.507742
    0.82453299   2   -5    5
    0.13564258   2   -15    15
    0.01215571   2    1000023    1000025
    0.008558465   2    1000022    1000022
    0.0083856208   2    1000025    1000025
    0.0064198973   2    1000022    1000023
    0.002270612   2    1000022    1000025
    0.00085855301   2   -6    6
    0.000459159   2   -13    13
    0.00037675435   2   -1000024    1000024
    0.0003158241   2   -3    3
    1.5124628e-05   2    21    21
    7.4398186e-06   2    1000023    1000023
    8.7305468e-07   2   -1    1
    3.3168515e-07   2    23    25
    3.1664502e-08   2    22    22
    1.7209886e-08   2    22    23
    1.2263273e-08   2   -4    4
    1.0312206e-08   2   -11    11
    6.3222616e-14   2   -2    2
    1.5137373e-38   2    25    25

DECAY 37  97.646874
    0.83771142   2   -5    6
    0.12515182   2   -15    16
    0.021106283   2    1000024    1000025
    0.01392932   2    1000022    1000024
    0.001241375   2   -5    4
    0.0004424563   2   -13    14
    0.00028675786   2   -3    4
    0.0001056229   2    1000023    1000024
    1.3445441e-05   2   -3    2
    8.8646983e-06   2   -5    2
    1.4444065e-06   2   -3    6
    7.9559276e-07   2   -1    2
    3.0774302e-07   2    24    25
    4.6729961e-08   2   -1    6
    3.7621993e-08   2   -1    4
    1.0349099e-08   2   -11    12
    3.9411736e-14   2    24    35

DECAY 6  2.43
    1   2    5    24

DECAY 15 -1
