BLOCK DCINFO
   1   SDECAY/HDECAY
   2   1.3b /3.4

BLOCK SPINFO
   1   SOFTSUSY
   2   3.4.0

BLOCK MODSEL
   1   0

BLOCK SMINPUTS
   1    127.90897
   2    1.1663787e-05
   3    0.1184
   4    91.1876
   5    4.18
   6    173.2
   7    1.777

BLOCK MINPAR
   3    15.47

BLOCK EXTPAR
   0   -1
   1    2561.49
   2    1370.75
   3    3788.28
   11   -3793.8
   12    1106.19
   13   -3628.75
   23   -381
   26    2267.33
   31    3013.54
   32    3013.54
   33    3123.79
   34    601.59
   35    601.59
   36    2120.87
   41    3847.11
   42    3847.11
   43    2229.51
   44    2399.81
   45    2399.81
   46    3761.93
   47    1872.9
   48    1872.9
   49    2439.54

BLOCK MASS
   24    80.382194
   25    126.22791
   35    2267.3688
   36    2267.3299
   37    2269.1188
   5    4.8187603
   1000001    3947.8649
   2000001    1994.3753
   1000002    3947.2072
   2000002    2512.7605
   1000003    3947.8649
   2000003    1994.3753
   1000004    3947.2072
   2000004    2512.7605
   1000005    2326.947
   2000005    2550.5848
   1000006    2323.0727
   2000006    3798.7416
   1000011    3022.1107
   2000011    645.26709
   1000012    3020.7456
   1000013    3022.1107
   2000013    645.26709
   1000014    3020.7456
   1000015    2135.3724
   2000015    3131.1673
   1000016    3129.8372
   1000021    3848.9808
   1000022    394.12162
   1000023   -399.68903
   1000025    1423.2184
   1000035    2525.7379
   1000024    396.90072
   1000037    1423.3996

BLOCK NMIX
   1   1   -0.013476657
   1   2    0.050871345
   1   3    0.70927434
   1   4    0.70296543
   2   1   -0.011283057
   2   2    0.033223837
   2   3   -0.70481649
   2   4    0.7085214
   3   1    0.0023468297
   3   2    0.99815161
   3   3   -0.012686383
   3   4   -0.059387788
   4   1    0.99984277
   4   2   -0.0012822514
   4   3    0.0016361925
   4   4    0.017610053

BLOCK UMIX
   1   1    0.018029943
   1   2    0.99983745
   2   1   -0.99983745
   2   2    0.018029943

BLOCK VMIX
   1   1    0.084262491
   1   2   -0.99644359
   2   1   -0.99644359
   2   2   -0.084262491

BLOCK STOPMIX
   1   1    0.99818986
   1   2    0.060141594
   2   1   -0.060141594
   2   2    0.99818986

BLOCK SBOTMIX
   1   1    0.99989273
   1   2   -0.014646791
   2   1    0.014646791
   2   2    0.99989273

BLOCK STAUMIX
   1   1   -0.0007154717
   1   2    0.99999974
   2   1   -0.99999974
   2   2   -0.0007154717

BLOCK ALPHA
      -0.067782932

BLOCK HMIX Q=  2896.62
   1   -386.39927
   2    14.799144
   3    242.2556
   4    4917985.5

BLOCK GAUGE Q=  2896.62
   1    0.36517394
   2    0.6380072
   3    1.0066097

BLOCK AU Q=  2896.62
   1   1    0
   2   2    0
   3   3   -3793.8

BLOCK AD Q=  2896.62
   1   1    0
   2   2    0
   3   3    1106.19

BLOCK AE Q=  2896.62
   1   1    0
   2   2    0
   3   3   -3628.75

BLOCK YU Q=  2896.62
   1   1    0
   2   2    0
   3   3    0.81747872

BLOCK YD Q=  2896.62
   1   1    0
   2   2    0
   3   3    0.20087601

BLOCK YE Q=  2896.62
   1   1    0
   2   2    0
   3   3    0.15058833

BLOCK MSOFT Q=  2896.62
   1    2561.49
   2    1370.75
   3    3788.28
   21    4947952
   22   -24756.576
   31    3013.54
   32    3013.54
   33    3123.79
   34    601.59
   35    601.59
   36    2120.87
   41    3847.11
   42    3847.11
   43    2229.51
   44    2399.81
   45    2399.81
   46    3761.93
   47    1872.9
   48    1872.9
   49    2439.54

BLOCK HIGGSBOUNDSINPUTHIGGSCOUPLINGSFERMIONS
       0, 219.01466,3,36,15,15

BLOCK HIGGSBOUNDSINPUTHIGGSCOUPLINGSBOSONS
       0,4,36,21,21,23

DECAY 6  1.4339242
    1   2    5    24

DECAY 1000021  203.35897
    0.094469461   2    2000001   -1
    0.094469461   2   -2000001    1
    0.094469461   2    2000003   -3
    0.094469461   2   -2000003    3
    0.07039786   2    1000005   -5
    0.07039786   2   -1000005    5
    0.069335669   2    1000006   -6
    0.069335669   2   -1000006    6
    0.058126182   2    2000002   -2
    0.058126182   2   -2000002    2
    0.058126154   2    2000004   -4
    0.058126154   2   -2000004    4
    0.055075212   2    2000005   -5
    0.055075212   2   -2000005    5

DECAY 1000006  41.83428
    0.34791155   2    1000023    6
    0.34070022   2    1000022    6
    0.17127833   2    1000037    5
    0.087260009   2    1000025    6
    0.052849889   2    1000024    5

DECAY 2000006  161.92975
    0.29951924   2    1000024    5
    0.18620464   2    1000005    24
    0.15175344   2    1000023    6
    0.14951209   2    1000022    6
    0.096165368   2    1000006    23
    0.093786478   2    1000006    25
    0.017120439   2    1000035    6
    0.0039476412   2    1000037    5
    0.0019635838   2    1000025    6
    2.7089381e-05   2    2000005    24

DECAY 1000005  41.541223
    0.68828486   2   -1000024    6
    0.17999662   2   -1000037    6
    0.088412184   2    1000025    5
    0.022074709   2    1000022    5
    0.021231617   2    1000023    5

DECAY 2000005  3.9105982
    0.49563471   2   -1000024    6
    0.24967222   2    1000022    5
    0.24845001   2    1000023    5
    0.0023031475   2    1000006   -24
    0.0011909376   2    1000005    25
    0.0010551234   2    1000005    23
    0.0010375665   2   -1000037    6
    0.00051506993   2    1000025    5
    0.00014120989   2    1000035    5

DECAY 1000002  35.834994
    0.64437904   2    1000037    1
    0.32360948   2    1000025    2
    0.019276701   2    1000021    2
    0.0059400084   2    1000024    1
    0.005414923   2    1000035    2
    0.00097612049   2    1000022    2
    0.00040372349   2    1000023    2

DECAY 2000002  0.013150249
    0.19458187   3    2    13   -2000013
    0.19437655   3    2    11   -2000011
    0.11336668   3    2   -11    2000011
    0.11118421   3    2   -13    2000013
    0.077844532   2    1000022    2
    0.072254907   3    2    24   -1000024
    0.054488522   2    1000023    2
    0.035488302   3    2    23    1000023
    0.034027493   3    2   -24    1000024
    0.031858713   3    2    25    1000022
    0.020314445   3    2    23    1000022
    0.01877531   3    2    25    1000023
    0.012965534   3    2    1   -2000001
    0.012690254   3    2    3   -2000003
    0.0053122189   3    2   -3    2000003
    0.0052441593   3    2   -1    2000001
    0.0018498509   3    2    15   -1000015
    0.0016265852   3    2   -15    1000015
    0.00056001222   3    2    24   -1000037
    0.00052017267   3    2   -24    1000037
    0.00050138215   3    2    25    1000025
    9.6560911e-05   3    2   -5    1000005
    4.6228783e-05   3    2    5   -1000005
    2.5086217e-05   3    2    23    1000025
    2.4669495e-07   3    2   -6    1000006
    1.7909927e-07   3    2    6   -1000006

DECAY 1000001  35.803804
    0.64950056   2   -1000037    2
    0.32339011   2    1000025    1
    0.019546231   2    1000021    1
    0.0055707096   2    1000035    1
    0.0011962579   2    1000022    1
    0.00052389421   2    1000023    1
    0.00027223965   2   -1000024    2

DECAY 2000001  0.00073944476
    0.26998697   2    1000022    1
    0.18881581   2    1000023    1
    0.13875276   3    1    11   -2000011
    0.13807658   3    1    13   -2000013
    0.077234978   3    1    24   -1000024
    0.041784054   3    1   -13    2000013
    0.041458134   3    1   -11    2000011
    0.029535675   3    1    23    1000023
    0.028129214   3    1    25    1000022
    0.016471819   3    1   -24    1000024
    0.01506671   3    1    23    1000022
    0.014428393   3    1    25    1000023
    9.1126482e-05   3    1    24   -1000037
    8.4532345e-05   3    1   -24    1000037
    8.2373969e-05   3    1    25    1000025
    8.7577874e-07   3    1    23    1000025

DECAY 1000004  37.069883
    0.64797009   2    1000037    3
    0.32541305   2    1000025    4
    0.013825873   2    1000021    4
    0.0059991787   2    1000024    3
    0.0053982107   2    1000035    4
    0.00098585678   2    1000022    4
    0.00040773952   2    1000023    4

DECAY 2000004  0.013124366
    0.19508751   3    4    13   -2000013
    0.1942951   3    4    11   -2000011
    0.11190635   3    4   -11    2000011
    0.11150253   3    4   -13    2000013
    0.078015052   2    1000022    4
    0.072381399   3    4    24   -1000024
    0.054606465   2    1000023    4
    0.03548819   3    4    23    1000023
    0.033879731   3    4   -24    1000024
    0.032067834   3    4    25    1000022
    0.020433749   3    4    23    1000022
    0.018805479   3    4    25    1000023
    0.012901194   3    4    3   -2000003
    0.012884432   3    4    1   -2000001
    0.0053155328   3    4   -3    2000003
    0.0052337765   3    4   -1    2000001
    0.0018289645   3    4    15   -1000015
    0.0016181353   3    4   -15    1000015
    0.00055758883   3    4    24   -1000037
    0.00051991082   3    4   -24    1000037
    0.00050256903   3    4    25    1000025
    9.6553233e-05   3    4   -5    1000005
    4.6422051e-05   3    4    5   -1000005
    2.5115117e-05   3    4    23    1000025
    2.4267838e-07   3    4   -6    1000006
    1.7468272e-07   3    4    6   -1000006

DECAY 1000003  37.034652
    0.65318585   2   -1000037    4
    0.32522538   2    1000025    3
    0.014022219   2    1000021    3
    0.0055540955   2    1000035    3
    0.0012083129   2    1000022    3
    0.0005291595   2    1000023    3
    0.00027497937   2   -1000024    4

DECAY 2000003  0.00073527127
    0.2681886   2    1000022    3
    0.18755325   2    1000023    3
    0.13954034   3    3    11   -2000011
    0.13886032   3    3    13   -2000013
    0.077662493   3    3    24   -1000024
    0.042021226   3    3   -13    2000013
    0.041693456   3    3   -11    2000011
    0.029703323   3    3    23    1000023
    0.028288879   3    3    25    1000022
    0.016565315   3    3   -24    1000024
    0.015152231   3    3    23    1000022
    0.014510291   3    3    25    1000023
    9.1643728e-05   3    3    24   -1000037
    8.5023042e-05   3    3   -24    1000037
    8.2740891e-05   3    3    25    1000025
    8.8057296e-07   3    3    23    1000025

DECAY 1000011  22.618887
    0.65496938   2   -1000037    12
    0.32730781   2    1000025    11
    0.016035319   2    1000035    11
    0.00097366293   2    1000022    11
    0.00037413079   2    1000023    11
    0.00033970103   2   -1000024    12

DECAY 2000011  0.00041062864
    0.59520003   2    1000022    11
    0.40320015   2    1000023    11
    0.0010210199   3    11    24   -1000024
    0.00017499023   3    11    25    1000022
    0.00016463051   3    11    23    1000023
    0.00011878616   3    11    23    1000022
    9.9386639e-05   3    11    25    1000023
    2.1002188e-05   3    11   -24    1000024

DECAY 1000013  22.618887
    0.65496938   2   -1000037    14
    0.32730781   2    1000025    13
    0.016035318   2    1000035    13
    0.00097366293   2    1000022    13
    0.00037413079   2    1000023    13
    0.00033970103   2   -1000024    14

DECAY 2000013  0.0004106277
    0.59520131   2    1000022    13
    0.40320102   2    1000023    13
    0.0010182216   3    13    24   -1000024
    0.0001764445   3    13    25    1000022
    0.00016457974   3    13    23    1000023
    0.00011893255   3    13    23    1000022
    9.855643e-05   3    13    25    1000023
    2.0935022e-05   3    13   -24    1000024

DECAY 1000015  1.7990123
    0.49902257   2   -1000024    16
    0.25251487   2    1000022    15
    0.24839617   2    1000023    15
    3.7197871e-05   2   -1000037    16
    2.9184322e-05   2    1000025    15

DECAY 2000015  25.839751
    0.6174292   2   -1000037    16
    0.3085475   2    1000025    15
    0.027514246   2    1000022    15
    0.026626627   2    1000023    15
    0.019520787   2    1000035    15
    0.00030307203   2   -1000024    16
    2.9696167e-05   2    1000015    23
    2.8874055e-05   2    1000015    25

DECAY 1000012  22.647689
    0.649075   2    1000037    11
    0.32482235   2    1000025    12
    0.016084226   2    1000035    12
    0.007406518   2    1000024    11
    0.0017910193   2    1000022    12
    0.00082088973   2    1000023    12

DECAY 1000014  22.647689
    0.649075   2    1000037    13
    0.32482235   2    1000025    14
    0.016084226   2    1000035    14
    0.007406518   2    1000024    13
    0.0017910193   2    1000022    14
    0.00082088974   2    1000023    14

DECAY 1000016  25.866328
    0.6120869   2    1000037    15
    0.30630466   2    1000025    16
    0.05957032   2    1000024    15
    0.019605474   2    1000035    16
    0.0016286459   2    1000022    16
    0.00074651929   2    1000023    16
    5.7479075e-05   2   -1000015   -24

DECAY 1000024  1.7833556e-10
    0.36964642   3    1000022    2   -1
    0.36964642   3    1000022    4   -3
    0.12321572   3    1000022   -11    12
    0.12321572   3    1000022   -13    14
    0.014275729   3    1000022   -15    16

DECAY 1000037  10.499256
    0.25593814   2    1000024    23
    0.25014199   2    1000023    24
    0.24706362   2    1000024    25
    0.24685625   2    1000022    24

DECAY 1000022 -1


DECAY 1000023  4.9991543e-09
    0.16140099   3    1000022   -1    1
    0.16140099   3    1000022   -3    3
    0.12430953   3    1000022   -2    2
    0.12430953   3    1000022   -4    4
    0.074196585   3    1000022   -12    12
    0.074196585   3    1000022   -14    14
    0.074196569   3    1000022   -16    16
    0.043570227   2    1000022    22
    0.037103978   3    1000022   -11    11
    0.037103978   3    1000022   -13    13
    0.015975301   3    1000022   -15    15
    0.0133475   3    1000024   -2    1
    0.0133475   3   -1000024   -1    2
    0.0133475   3    1000024   -4    3
    0.0133475   3   -1000024   -3    4
    0.0044491722   3    1000024   -12    11
    0.0044491722   3   -1000024    12   -11
    0.0044491722   3    1000024   -14    13
    0.0044491722   3   -1000024    14   -13
    0.00052452533   3    1000024   -16    15
    0.00052452533   3   -1000024    16   -15

DECAY 1000025  10.498245
    0.25142286   2    1000024   -24
    0.25142286   2   -1000024    24
    0.17909341   2    1000023    23
    0.17084466   2    1000022    25
    0.075523925   2    1000022    23
    0.071687283   2    1000023    25
    1.2501763e-06   2    2000011   -11
    1.2501763e-06   2   -2000011    11
    1.2501763e-06   2    2000013   -13
    1.2501763e-06   2   -2000013    13

DECAY 1000035  31.848016
    0.18376928   2    2000011   -11
    0.18376928   2   -2000011    11
    0.18376928   2    2000013   -13
    0.18376928   2   -2000013    13
    0.044867288   2    1000024   -24
    0.044867288   2   -1000024    24
    0.029101106   2    1000022    25
    0.02811918   2    1000023    23
    0.020583214   2    1000023    25
    0.019139292   2    1000022    23
    0.01711067   2    1000015   -15
    0.01711067   2   -1000015    15
    0.010128836   2    2000001   -1
    0.010128836   2   -2000001    1
    0.010128836   2    2000003   -3
    0.010128836   2   -2000003    3
    0.0007120501   2    1000037   -24
    0.0007120501   2   -1000037    24
    0.00068820235   2    1000025    25
    0.00040570019   2    1000005   -5
    0.00040570019   2   -1000005    5
    0.00019598124   2    1000006   -6
    0.00019598124   2   -1000006    6
    5.513695e-05   2    1000025    23
    3.461444e-05   2    2000002   -2
    3.461444e-05   2   -2000002    2
    3.4390804e-05   2    2000004   -4
    3.4390804e-05   2   -2000004    4

DECAY 25  0.0041553166
    0.57135156   2    5   -5
    0.23121938   2    24   -24
    0.079040757   2    21    21
    0.06347009   2   -15    15
    0.029381381   2    23    23
    0.021035565   2    4   -4
    0.0023572134   2    22    22
    0.001674623   2    22    23
    0.00024477003   2    3   -3
    0.00022465664   2   -13    13

DECAY 35  15.779668
    0.36946947   2    5   -5
    0.1755501   2    1000024   -1000037
    0.1755501   2    1000037   -1000024
    0.11005515   2    1000023    1000025
    0.065796647   2   -15    15
    0.065641015   2    1000022    1000025
    0.027496199   2    6   -6
    0.0072832142   2    1000024   -1000024
    0.0019336259   2    1000022    1000022
    0.0006610781   2    1000023    1000023
    0.00023287368   2   -13    13
    0.00015531969   2    3   -3
    8.6782937e-05   2    25    25
    4.0311773e-05   2    1000022    1000023
    2.332621e-05   2    24   -24
    1.1625948e-05   2    23    23
    9.0846187e-06   2    21    21
    1.8849965e-06   2    2000011   -2000011
    1.8849965e-06   2    2000013   -2000013
    2.8223709e-07   2    4   -4
    1.6543759e-08   2    23    22
    1.0130937e-08   2    22    22

DECAY 36  15.785917
    0.36938088   2    5   -5
    0.17523152   2    1000024   -1000037
    0.17523152   2    1000037   -1000024
    0.11146662   2    1000022    1000025
    0.06577242   2   -15    15
    0.064108637   2    1000023    1000025
    0.027666872   2    6   -6
    0.0078317155   2    1000024   -1000024
    0.0016802857   2    1000022    1000022
    0.00099131608   2    1000023    1000023
    0.00023278736   2   -13    13
    0.00015678664   2    1000022    1000023
    0.00015531241   2    3   -3
    6.9386619e-05   2    21    21
    2.3555395e-05   2    23    25
    2.8209502e-07   2    4   -4
    6.3416538e-08   2    23    22
    2.9367215e-08   2    22    22

DECAY 37  15.778988
    0.39952421   2    6   -5
    0.17938013   2    1000037    1000022
    0.17731484   2    1000024    1000025
    0.17543507   2    1000037    1000023
    0.065853218   2   -15    16
    0.0010829645   2    1000024    1000023
    0.00062772847   2    4   -5
    0.00035791069   2    1000024    1000022
    0.00023307333   2   -13    14
    0.00015316517   2    4   -3
    2.3647898e-05   2    24    25
    7.7678373e-06   2    2   -3
    6.2772676e-06   2    2   -5
    1.5266451e-12   2    24    36

DECAY 5 -1


DECAY 15 -1


DECAY 23  2.4952


DECAY 24  2.085
