BLOCK SPINFO
   1   SPheno
   2   v4.0.5be

BLOCK SPHENOINFO
   1   2
   2   2

BLOCK MODSEL
   1   0

BLOCK MINPAR
   3    54.561076
   4   -1

BLOCK EXTPAR
   0    2506.1547
   1    2719.3364
   2   -3337.812
   3    2025.4693
   11    2310.5681
   12    7959.769
   13    4666.7828
   23   -413.864
   25    54.950256
   26    4901.0025
   31    623.75453
   32    623.75453
   33    1938.0146
   34    4200.8959
   35    4200.8959
   36    3724.7709
   41    3921.166
   42    3921.166
   43    1379.3362
   44    4213.8391
   45    4213.8391
   46    3827.8185
   47    3834.8783
   48    3834.8783
   49    3801.6836

BLOCK SMINPUTS
   1    127.90897
   2    1.1663787e-05
   3    0.1184
   4    91.1876
   5    4.18
   6    173.2
   7    1.777
   8    0
   11    0.00051099893
   12    0
   13    0.10565837
   14    0
   21    0.005
   22    0.0025
   23    0.095
   24    1.27

BLOCK GAUGE Q=  2506.1547
   1    0.35536298
   2    0.66519887
   3    1.219778

BLOCK YU Q=  2506.1547
   1   1    8.3857604e-06
   2   2    0.0042599663
   3   3    1.0130672

BLOCK YD Q=  2506.1547
   1   1    0.0009259604
   2   2    0.017593248
   3   3    0.91826256

BLOCK YE Q=  2506.1547
   1   1    0.00016158686
   2   2    0.033411038
   3   3    0.5619187

BLOCK AU Q=  2506.1547
   1   1    0
   2   2    0
   3   3    2310.5681

BLOCK AD Q=  2506.1547
   1   1    0
   2   2    0
   3   3    7959.769

BLOCK AE Q=  2506.1547
   1   1    0
   2   2    0
   3   3    4666.7828

BLOCK MSOFT Q=  2506.1547
   1    2719.3364
   2   -3337.812
   3    2025.4693
   21    24632663
   22   -136971.88
   31    623.75453
   32    623.75453
   33    1938.0146
   34    4200.8959
   35    4200.8959
   36    3724.7709
   41    3921.166
   42    3921.166
   43    1379.3362
   44    4213.8391
   45    4213.8391
   46    3827.8185
   47    3834.8783
   48    3834.8783
   49    3801.6836

BLOCK MASS
   6    173.2
   23    91.1876
   24    80.429995
   15    1.777
   25    120.69607
   35    4896.3713
   36    4901.0025
   37    4898.1491
   1000001    3981.7877
   2000001    3880.8474
   1000002    3981.0975
   2000002    4262.0379
   1000003    3981.7876
   2000003    3880.8471
   1000004    3981.0972
   2000004    4262.0377
   1000005    1629.6284
   2000005    3879.3424
   1000006    1632.1004
   2000006    3848.2998
   1000011    658.97431
   2000011    4203.8208
   1000012    653.73119
   1000013    659.07219
   2000013    4203.8163
   1000014    653.83038
   1000015    1978.067
   2000015    3732.6982
   1000016    1976.1101
   1000021    2284.6623
   1000022   -421.84021
   1000023    423.23959
   1000025    2720.0783
   1000035   -3347.3123
   1000024    422.72964
   1000037    3347.5361

BLOCK ALPHA
      -0.018343361

BLOCK HMIX Q=  2506.1547
   1   -413.864
   2    54.950256
   3    243.53194
   4    24019826

BLOCK STOPMIX
   1   1   -0.99966231
   1   2    0.025986014
   2   1   -0.025986014
   2   2   -0.99966231

BLOCK SBOTMIX
   1   1   -0.99998
   1   2    0.0063245778
   2   1   -0.0063245778
   2   2   -0.99998

BLOCK STAUMIX
   1   1   -0.99998775
   1   2    0.0049496284
   2   1   -0.0049496284
   2   2   -0.99998775

BLOCK NMIX
   1   1   -0.0098845533
   1   2   -0.019707098
   1   3   -0.70764802
   1   4    0.70622107
   2   1    0.013051527
   2   2    0.014782658
   2   3   -0.70655294
   2   4   -0.70738537
   3   1   -0.99986595
   3   2    0.00021078967
   3   3   -0.002226489
   3   4   -0.01621963
   4   1   -0.00017702444
   4   2    0.99969648
   4   3   -0.003501552
   4   4    0.024385424

BLOCK UMIX
   1   1   -0.0049541518
   1   2   -0.99998773
   2   1   -0.99998773
   2   2    0.0049541518

BLOCK VMIX
   1   1    0.034496668
   1   2    0.99940481
   2   1    0.99940481
   2   2   -0.034496668

BLOCK HIGGSBOUNDSINPUTHIGGSCOUPLINGSFERMIONS
       0, 3019.5306,3,36,15,15

BLOCK HIGGSBOUNDSINPUTHIGGSCOUPLINGSBOSONS
       0,4,36,21,21,23

BLOCK SPHENOLOWENERGY
   1    0.00029786338
   2    1.5947318e-06
   3    3.5260394e-05
   4    3.3420891e-15
   5    1.4276656e-10
   6    2.9670958e-08
   7    1.1645853e-13
   8    4.974963e-09
   9    1.0468599e-06
   10    9.6207138e-05
   11    0.99378291
   12    0.54198012
   13    19.371322
   14    0
   15    0
   16    0.0021574562
   17    2.2816605e-15
   18    2.4801967e-11
   19    8.2911489e-11
   20    3.942227e-15
   21    1.6854603e-10
   22    3.7768715e-08
   23    0
   24    0
   25    0
   26    0
   27    0
   28    0
   29    0
   30    0
   31    0
   39    0.00022220912
   40    0
   41    0
   42    0

BLOCK FWCOEF Q=  160
   305   4422   0   0   -0.18881911
   305   4422   0   2   -0.16213183
   305   4322   0   2    0.00014580536
   305   6421   0   0   -0.095227835
   305   6421   0   2   -0.079836733
   305   6321   0   2    6.8223253e-05
   3051111   4133   0   0    1.6112095
   3051111   4133   0   2    1.6122586
   3051111   4233   0   2    0.0011506318
   3051111   4137   0   0   -4.4339016
   3051111   4137   0   2   -4.4333602
   3051111   4237   0   2   -0.0086995537
   3051313   4133   0   0    1.6112095
   3051313   4133   0   2    1.6122557
   3051313   4233   0   2    0.0011506285
   3051313   4137   0   0   -4.4339016
   3051313   4137   0   2   -4.4333631
   3051313   4237   0   2   -0.0086995788
   3051212   4137   0   0    1.5053501
   3051212   4137   0   2    1.5052287
   3051212   4237   0   2    0.0018877411
   3051414   4137   0   0    1.5053501
   3051414   4137   0   2    1.5052287
   3051414   4237   0   2    0.0018877411
   3051616   4137   0   0    1.5053501
   3051616   4137   0   2    1.5052302
   3051616   4237   0   2    0.0018877517

BLOCK IMFWCOEF Q=  160
   305   4422   0   0    3.8584046e-07
   305   4422   0   2    2.6611809e-05
   305   4322   0   2    3.6407285e-06
   305   6421   0   0    3.3049787e-07
   305   6421   0   2    8.1129822e-05
   305   6321   0   2    2.5860896e-06
   3051111   4133   0   2    2.3507562e-06
   3051111   4233   0   2    2.1138738e-05
   3051111   4137   0   2   -4.6870772e-06
   3051111   4237   0   2   -0.00015982571
   3051313   4133   0   2    2.3509039e-06
   3051313   4233   0   2    2.1138688e-05
   3051313   4137   0   2   -4.6872729e-06
   3051313   4237   0   2   -0.00015982617
   3051212   4137   0   2    9.4487557e-07
   3051212   4237   0   2    3.4681038e-05
   3051414   4137   0   2    9.448445e-07
   3051414   4237   0   2    3.4681038e-05
   3051616   4137   0   2    9.7092629e-07
   3051616   4237   0   2    3.4681037e-05

DECAY 23  2.4952


DECAY 24  2.085


DECAY 1000011  0.0011540956
    0.54668552   2    1000022    11
    0.41058549   2    1000023    11
    0.042723361   2   -1000024    12

DECAY 2000011  7.1418673
    0.99922257   2    1000025    11
    0.00049378948   2    1000023    11
    0.00028332864   2    1000022    11

DECAY 1000013  0.0062320249
    0.51129632   2    1000022    13
    0.48078632   2    1000023    13
    0.0079163115   2   -1000024    14

DECAY 2000013  7.3252324
    0.974206   2    1000025    13
    0.012488027   2   -1000024    14
    0.0067153822   2    1000023    13
    0.006530343   2    1000022    13

DECAY 1000015  11.327842
    0.50100263   2    1000022    15
    0.49888054   2    1000023    15
    0.00011683071   2   -1000024    16

DECAY 2000015  50.459023
    0.45279577   2   -1000024    16
    0.22678977   2    1000022    15
    0.22613628   2    1000023    15
    0.08172707   2    1000025    15
    0.0063834359   2    1000016   -24
    0.0031810953   2    1000015    23
    0.0029834608   2    1000015    25

DECAY 1000012  0.0025818563
    0.89806036   2    1000024    11
    0.079003368   2    1000022    12
    0.02293627   2    1000023    12

DECAY 1000014  0.0074987728
    0.96488123   2    1000024    13
    0.027217069   2    1000022    14
    0.007901703   2    1000023    14

DECAY 1000016  11.323523
    0.99981171   2    1000024    15
    0.00014562881   2    1000022    16

DECAY 2000001  131.35453
    0.99572672   2    1000021    1
    0.0042679781   2    1000025    1

DECAY 1000001  146.10315
    0.9679158   2    1000021    1
    0.020624317   2   -1000037    2
    0.010313449   2    1000035    1
    0.0010842503   2    1000025    1

DECAY 2000003  131.40103
    0.99537407   2    1000021    3
    0.0042664659   2    1000025    3
    0.00017757082   2   -1000024    4

DECAY 1000003  146.12844
    0.96774822   2    1000021    3
    0.020620701   2   -1000037    4
    0.010311659   2    1000035    3
    0.0010840626   2    1000025    3
    0.00011991711   2    1000022    3
    0.00010007789   2    1000023    3

DECAY 1000005  51.923038
    0.54185162   2   -1000024    6
    0.22957905   2    1000022    5
    0.22856933   2    1000023    5

DECAY 2000005  259.90427
    0.50263676   2    1000021    5
    0.24349394   2   -1000024    6
    0.12242043   2    1000022    5
    0.12204823   2    1000023    5
    0.0033979793   2    1000006   -24
    0.0021534823   2    1000025    5
    0.0021447071   2    1000005    25
    0.0017023102   2    1000005    23

DECAY 1000002  146.06226
    0.9676894   2    1000021    2
    0.020568041   2    1000037    1
    0.010296018   2    1000035    2
    0.001078588   2    1000025    2
    0.00027958216   2    1000024    1

DECAY 2000002  174.20162
    0.980798   2    1000021    2
    0.019187641   2    1000025    2

DECAY 1000004  146.08745
    0.96752184   2    1000021    4
    0.020564481   2    1000037    3
    0.010294196   2    1000035    4
    0.0010783999   2    1000025    4
    0.00044311526   2    1000024    3

DECAY 2000004  174.20454
    0.98078103   2    1000021    4
    0.01918731   2    1000025    4

DECAY 1000006  53.037515
    0.45017343   2    1000024    5
    0.26777256   2    1000023    6
    0.26731916   2    1000022    6
    0.014716266   3    1000022    24    5

DECAY 2000006  314.8417
    0.40236309   2    1000021    6
    0.24297512   2    1000024    5
    0.1212657   2    1000023    6
    0.12086099   2    1000022    6
    0.045862844   2    1000005    24
    0.036942369   2    1000006    25
    0.022856161   2    1000006    23
    0.0068164409   2    1000025    6

DECAY 1000024  1.291443e-12
    0.60806186   3    1000022   -1    2
    0.20273048   3    1000022   -11    12
    0.18920766   3    1000022   -13    14

DECAY 1000037  148.98511
    0.17161373   2    1000006   -5
    0.17035149   2   -1000005    6
    0.091389176   2    1000012   -11
    0.09138698   2    1000014   -13
    0.091379004   2   -1000011    12
    0.091376815   2   -1000013    14
    0.04969052   2    1000024    25
    0.049613133   2    1000023    24
    0.04950367   2    1000024    23
    0.049464069   2    1000022    24
    0.041930687   2    1000016   -15
    0.041887771   2   -1000015    16
    0.0045381748   3    1000024    6   -6
    0.0029124933   3    1000023   -5    6
    0.002848702   3    1000022   -5    6

DECAY 1000022 -1


DECAY 1000023  5.4768242e-10
    0.9767232   2    1000022    22
    0.0068919109   3    1000022    12   -12
    0.0051528609   3    1000022    1   -1
    0.0048852415   3    1000022    3   -3
    0.0040191917   3    1000022    2   -2
    0.0011629928   3    1000022    11   -11
    0.0010695453   3    1000022    13   -13

DECAY 1000025  22.27046
    0.076561139   2    1000024   -24
    0.076561139   2   -1000024    24
    0.068142024   2    1000012   -12
    0.068142024   2   -1000012    12
    0.068139488   2    1000014   -14
    0.068139488   2   -1000014    14
    0.067900276   2    1000011   -11
    0.067900276   2   -1000011    11
    0.067897763   2    1000013   -13
    0.067897763   2   -1000013    13
    0.05155488   2    1000022    25
    0.048574779   2    1000022    23
    0.048072796   2    1000023    25
    0.028028587   2    1000023    23
    0.017114614   2    1000016   -16
    0.017114614   2   -1000016    16
    0.017013277   2    1000015   -15
    0.017013277   2   -1000015    15
    0.012418095   2    1000006   -6
    0.012418095   2   -1000006    6
    0.010529754   2    1000005   -5
    0.010529754   2   -1000005    5
    0.0035437216   3    1000024    5   -6
    0.0035437216   3   -1000024   -5    6
    0.0025503402   3    1000022    6   -6
    0.0025092186   3    1000023    6   -6

DECAY 1000035  151.55418
    0.085627654   2    1000006   -6
    0.085627654   2   -1000006    6
    0.084839322   2    1000005   -5
    0.084839322   2   -1000005    5
    0.048752973   2    1000024   -24
    0.048752973   2   -1000024    24
    0.044951242   2    1000012   -12
    0.044951242   2   -1000012    12
    0.04495016   2    1000014   -14
    0.04495016   2   -1000014    14
    0.044876861   2    1000011   -11
    0.044876861   2   -1000011    11
    0.04487579   2    1000013   -13
    0.04487579   2   -1000013    13
    0.031243144   2    1000022    25
    0.031224671   2    1000023    23
    0.029158382   2    1000023    25
    0.020621483   2    1000016   -16
    0.020621483   2   -1000016    16
    0.020569275   2    1000015   -15
    0.020569275   2   -1000015    15
    0.017452561   2    1000022    23
    0.0030996527   3    1000024    5   -6
    0.0030996527   3   -1000024   -5    6
    0.0022326842   3    1000022    6   -6
    0.0022120897   3    1000023    6   -6

DECAY 1000021  32.394265
    0.25188138   2    1000005   -5
    0.25188138   2   -1000005    5
    0.24777451   2    1000006   -6
    0.24777451   2   -1000006    6
    0.00012882926   3    1000024    5   -6
    0.00012882926   3   -1000024   -5    6

DECAY 25  0.0033915902
    0.63587187   2   -5    5
    0.16275852   2   -24    24
    0.075241534   2    21    21
    0.072643616   2   -15    15
    0.031473251   2   -4    4
    0.018066195   2    23    23
    0.0023160931   2    22    22
    0.001137493   2    22    23
    0.00025194645   2   -13    13
    0.00023865556   2   -3    3
    6.5985906e-07   2   -1    1
    1.6220337e-07   2   -2    2
    5.6640963e-09   2   -11    11

DECAY 35  226.81576
    0.78795352   2   -5    5
    0.12618139   2   -15    15
    0.02416373   2   -1000024    1000037
    0.02416373   2   -1000037    1000024
    0.015130858   2    1000023    1000035
    0.0090484519   2    1000022    1000035
    0.0064484996   2    1000022    1000025
    0.005249798   2    1000023    1000025
    0.00054923559   2   -6    6
    0.00047802362   2   -13    13
    0.00025426322   2   -3    3
    0.00020189272   2   -1000024    1000024
    0.00013458514   2   -1000005    1000005
    1.7090804e-05   2    1000022    1000022
    1.017121e-05   2   -1000006    1000006
    5.5049156e-06   2    1000023    1000023
    3.3093299e-06   2    21    21
    2.9959888e-06   2   -1000015    1000015
    2.0931989e-06   2    1000022    1000023
    7.0291738e-07   2   -1    1
    2.7750214e-08   2    25    25
    1.8871958e-08   2    23    23
    1.0734562e-08   2   -11    11
    9.05471e-09   2    22    23
    7.8682315e-09   2   -1000011    1000011
    7.7540549e-09   2   -1000013    1000013
    5.3378008e-09   2   -4    4
    3.1899581e-09   2   -24    24
    2.4437206e-09   2    22    22
    6.2738287e-11   2   -2000013    1000013
    6.2738287e-11   2   -1000013    2000013
    2.7498279e-14   2   -2    2
    1.4674531e-15   2   -2000011    1000011
    1.4674531e-15   2   -1000011    2000011

DECAY 36  216.30342
    0.78426993   2   -5    5
    0.12560335   2   -15    15
    0.025447165   2   -1000024    1000037
    0.025447165   2   -1000037    1000024
    0.015965104   2    1000022    1000035
    0.0095021312   2    1000023    1000035
    0.0067607548   2    1000023    1000025
    0.0055405373   2    1000022    1000025
    0.00047854733   2   -6    6
    0.00047585303   2   -13    13
    0.00025307617   2   -3    3
    0.00022041634   2   -1000024    1000024
    1.9866956e-05   2    1000022    1000022
    8.1185323e-06   2    21    21
    5.5272598e-06   2    1000023    1000023
    1.6588288e-06   2    1000022    1000023
    6.9962516e-07   2   -1    1
    5.3472767e-08   2    23    25
    1.5844777e-08   2    22    22
    1.3960004e-08   2    22    23
    1.0685737e-08   2   -11    11
    4.5078593e-09   2   -4    4
    6.7757743e-11   2   -2000013    1000013
    6.7757743e-11   2   -1000013    2000013
    1.0826761e-11   2    23    35
    2.3221166e-14   2   -2    2
    1.5848585e-15   2   -2000011    1000011
    1.5848585e-15   2   -1000011    2000011
    5.0403192e-41   2    25    25

DECAY 37  257.69527
    0.81060423   2   -5    6
    0.1131584   2   -15    16
    0.021367182   2    1000022    1000037
    0.021312525   2    1000024    1000035
    0.021288361   2    1000023    1000037
    0.010291117   2    1000024    1000025
    0.0012033993   2   -5    4
    0.00040005515   2   -13    14
    0.0002286531   2   -3    4
    5.4001342e-05   2    1000023    1000024
    3.9092442e-05   2   -1000005    1000006
    3.0630028e-05   2    1000022    1000024
    1.0767055e-05   2   -3    2
    8.5935111e-06   2   -5    2
    1.520734e-06   2   -1000015    1000016
    6.8410359e-07   2   -3    6
    6.3433143e-07   2   -1    2
    4.4815704e-08   2    24    25
    2.9925771e-08   2   -1    4
    2.7205531e-08   2   -1000011    1000012
    2.7064361e-08   2   -1000013    1000014
    1.5699885e-08   2   -1    6
    9.3573317e-09   2   -11    12
    1.1550881e-10   2   -2000013    1000014
    9.3826601e-14   2    24    35
    2.7017742e-15   2   -2000011    1000012

DECAY 6  2.43
    1   2    5    24

DECAY 15 -1
