BLOCK SPINFO
   1   SPheno
   2   v4.0.5be

BLOCK SPHENOINFO
   1   2
   2   2

BLOCK MODSEL
   1   0

BLOCK MINPAR
   3    27.631359
   4    1

BLOCK EXTPAR
   0    1501.3939
   1   -534.04724
   2   -1192.4553
   3    3000
   11    2494.4628
   12    1805.2105
   13    1354.979
   23    1975.273
   25    26.616031
   26    3753.2801
   31    1003.783
   32    1003.783
   33    1901.1501
   34    1347.086
   35    1347.086
   36    1655.4633
   41    5000
   42    5000
   43    1273.8055
   44    5000
   45    5000
   46    1759.5751
   47    5000
   48    5000
   49    1540.9381

BLOCK SMINPUTS
   1    127.90897
   2    1.1663787e-05
   3    0.1184
   4    91.1876
   5    4.18
   6    173.2
   7    1.777
   8    0
   11    0.00051099893
   12    0
   13    0.10565837
   14    0
   21    0.005
   22    0.0025
   23    0.095
   24    1.27

BLOCK GAUGE Q=  1501.3939
   1    0.35536298
   2    0.66519887
   3    1.219778

BLOCK YU Q=  1501.3939
   1   1    8.3902878e-06
   2   2    0.0042622662
   3   3    1.0136141

BLOCK YD Q=  1501.3939
   1   1    0.00044874579
   2   2    0.0085261701
   3   3    0.44501521

BLOCK YE Q=  1501.3939
   1   1    7.8309422e-05
   2   2    0.016191905
   3   3    0.2723212

BLOCK AU Q=  1501.3939
   1   1    0
   2   2    0
   3   3    2494.4613

BLOCK AD Q=  1501.3939
   1   1    0
   2   2    0
   3   3    1805.2067

BLOCK AE Q=  1501.3939
   1   1    0
   2   2    0
   3   3    1354.9795

BLOCK MSOFT Q=  1501.3939
   1   -534.04724
   2   -1192.4553
   3    3000
   21    10220064
   22   -3830214.8
   31    1003.783
   32    1003.783
   33    1901.1501
   34    1347.086
   35    1347.086
   36    1655.4633
   41    5000
   42    5000
   43    1273.8055
   44    5000
   45    5000
   46    1759.5751
   47    5000
   48    5000
   49    1540.9381

BLOCK MASS
   6    173.2
   23    91.1876
   24    80.429995
   15    1.777
   25    120.77279
   35    3751.8192
   36    3753.2801
   37    3753.6888
   1000001    5025.5602
   2000001    5016.2722
   1000002    5025.1089
   2000002    5018.9625
   1000003    5025.567
   2000003    5016.2704
   1000004    5025.1109
   2000004    5018.9633
   1000005    1286.1908
   2000005    1559.166
   1000006    1260.359
   2000006    1788.525
   1000011    1020.3007
   2000011    1345.307
   1000012    1016.835
   1000013    1020.2872
   2000013    1345.3237
   1000014    1016.8408
   1000015    1654.7959
   2000015    1912.5325
   1000016    1908.1943
   1000021    3184.993
   1000022   -535.52374
   1000023   -1234.0311
   1000025    1967.7688
   1000035   -1970.9811
   1000024    1234.1325
   1000037    1971.664

BLOCK ALPHA
      -0.036244667

BLOCK HMIX Q=  1501.3939
   1    1975.273
   2    26.616031
   3    244.04007
   4    14087112

BLOCK STOPMIX
   1   1   -0.97254604
   1   2    0.23271056
   2   1   -0.23271056
   2   2   -0.97254604

BLOCK SBOTMIX
   1   1    0.99444285
   1   2    0.10527783
   2   1   -0.10527783
   2   2    0.99444285

BLOCK STAUMIX
   1   1    0.098024032
   1   2    0.99518405
   2   1   -0.99518405
   2   2    0.098024032

BLOCK NMIX
   1   1   -0.99969034
   1   2    0.00063722042
   1   3   -0.024160744
   1   4   -0.0059223327
   2   1    0.00239594
   2   2    0.99725345
   2   3   -0.063513634
   2   4   -0.038024071
   3   1    0.012876936
   3   2   -0.018069966
   3   3   -0.70663796
   3   4    0.7072273
   4   1    0.02115811
   4   2   -0.071823551
   4   3   -0.70430467
   4   4   -0.70593813

BLOCK UMIX
   1   1   -0.99584445
   1   2    0.091070453
   2   1   -0.091070453
   2   2   -0.99584445

BLOCK VMIX
   1   1    0.99848821
   1   2    0.054966277
   2   1    0.054966277
   2   2   -0.99848821

BLOCK HIGGSBOUNDSINPUTHIGGSCOUPLINGSFERMIONS
       0, 708.41308,3,36,15,15

BLOCK HIGGSBOUNDSINPUTHIGGSCOUPLINGSBOSONS
       0,4,36,21,21,23

BLOCK SPHENOLOWENERGY
   1    0.00033395175
   2    1.5885132e-06
   3    3.5246284e-05
   4    3.2972723e-15
   5    1.408559e-10
   6    2.949452e-08
   7    1.1082736e-13
   8    4.7345471e-09
   9    1.0045125e-06
   10    9.6391823e-05
   11    0.99569063
   12    0.54272968
   13    19.390332
   14    0
   15    0
   16    0.0021615391
   17    2.2817015e-15
   18    2.4791097e-11
   19    8.2885159e-11
   20   -5.1395381e-15
   21   -2.1974325e-10
   22   -3.4869727e-08
   23    0
   24    0
   25    0
   26    0
   27    0
   28    0
   29    0
   30    0
   31    0
   39    7.7170166e-05
   40    0
   41    0
   42    0

BLOCK FWCOEF Q=  160
   305   4422   0   0   -0.18881911
   305   4422   0   2   -0.20401443
   305   4322   0   2   -0.00016217571
   305   6421   0   0   -0.095227835
   305   6421   0   2   -0.10810552
   305   6321   0   2   -0.00016415846
   3051111   4133   0   0    1.5920073
   3051111   4133   0   2    1.592455
   3051111   4233   0   2    8.2247329e-05
   3051111   4137   0   0   -4.4146994
   3051111   4137   0   2   -4.4124136
   3051111   4237   0   2   -0.00063993912
   3051313   4133   0   0    1.5920073
   3051313   4133   0   2    1.5924535
   3051313   4233   0   2    8.22472e-05
   3051313   4137   0   0   -4.4146994
   3051313   4137   0   2   -4.4124151
   3051313   4237   0   2   -0.0006399394
   3051212   4137   0   0    1.5053501
   3051212   4137   0   2    1.5048591
   3051212   4237   0   2    0.0001394608
   3051414   4137   0   0    1.5053501
   3051414   4137   0   2    1.5048591
   3051414   4237   0   2    0.0001394608
   3051616   4137   0   0    1.5053501
   3051616   4137   0   2    1.5048595
   3051616   4237   0   2    0.00013946282

BLOCK IMFWCOEF Q=  160
   305   4422   0   0    3.8572929e-07
   305   4422   0   2   -4.1768666e-06
   305   4322   0   2   -1.4107557e-06
   305   6421   0   0    3.3040265e-07
   305   6421   0   2   -1.318253e-05
   305   6321   0   2   -9.3970677e-07
   3051111   4133   0   2    1.3657491e-07
   3051111   4233   0   2    1.6916016e-06
   3051111   4137   0   2   -9.253802e-07
   3051111   4237   0   2   -1.3165195e-05
   3051313   4133   0   2    1.3656011e-07
   3051313   4233   0   2    1.6915999e-06
   3051313   4137   0   2   -9.253776e-07
   3051313   4237   0   2   -1.3165201e-05
   3051212   4137   0   2    3.2929516e-07
   3051212   4237   0   2    2.869082e-06
   3051414   4137   0   2    3.2929444e-07
   3051414   4237   0   2    2.869082e-06
   3051616   4137   0   2    3.3504647e-07
   3051616   4237   0   2    2.8690866e-06

DECAY 23  2.4952


DECAY 24  2.085


DECAY 1000011  0.67074755
    1   2    1000022    11

DECAY 2000011  4.7841894
    0.99999978   2    1000022    11

DECAY 1000013  0.67072698
    1   2    1000022    13

DECAY 2000013  4.7872735
    0.99937782   2    1000022    13
    0.00062152388   2    1000013    25

DECAY 1000015  6.7002214
    0.98835498   2    1000022    15
    0.0077717176   2   -1000024    16
    0.0038732991   2    1000023    15

DECAY 2000015  11.087756
    0.50421609   2   -1000024    16
    0.25387254   2    1000023    15
    0.18793371   2    1000022    15
    0.027458971   2    1000015    25
    0.026518686   2    1000015    23

DECAY 1000012  0.66818388
    1   2    1000022    12

DECAY 1000014  0.66819358
    1   2    1000022    14

DECAY 1000016  11.123622
    0.51024306   2    1000024    15
    0.25350668   2    1000023    16
    0.18320279   2    1000022    16
    0.053047468   2    1000015    24

DECAY 2000001  143.7915
    0.98096791   2    1000021    1
    0.019023245   2    1000022    1

DECAY 1000001  201.22231
    0.70579581   2    1000021    1
    0.1925299   2   -1000024    2
    0.096456997   2    1000023    1
    0.0034294591   2    1000022    1
    0.0013053251   2   -1000037    2
    0.00044980132   2    1000035    1

DECAY 2000003  143.80167
    0.98089719   2    1000021    3
    0.01902192   2    1000022    3

DECAY 1000003  201.22961
    0.70577368   2    1000021    3
    0.19252321   2   -1000024    4
    0.096453784   2    1000023    3
    0.0034293599   2    1000022    3
    0.0013117701   2   -1000037    4
    0.00046258564   2    1000035    3

DECAY 1000005  0.17440532
    0.79798987   2    1000022    5
    0.20201013   2    1000023    5

DECAY 2000005  3.3249103
    0.38214622   2    1000005    25
    0.30198003   2    1000006   -24
    0.19857848   2    1000022    5
    0.11591624   2    1000005    23
    0.00077828474   2   -1000024    6
    0.0006007471   2    1000023    5

DECAY 2000002  152.28754
    0.92807921   2    1000021    2
    0.071888104   2    1000022    2

DECAY 1000002  201.21129
    0.70560089   2    1000021    2
    0.19354227   2    1000024    1
    0.096616595   2    1000023    2
    0.0033805731   2    1000022    2
    0.00047552935   2    1000037    1
    0.00036452769   2    1000035    2

DECAY 2000004  152.29016
    0.9280634   2    1000021    4
    0.071886869   2    1000022    4

DECAY 1000004  201.21796
    0.70557822   2    1000021    4
    0.19353623   2    1000024    3
    0.096613445   2    1000023    4
    0.0033804621   2    1000022    4
    0.00050107221   2    1000037    3
    0.00036771847   2    1000035    4

DECAY 1000006  0.23974703
    0.75776725   2    1000022    6
    0.14390961   2    1000022    4
    0.077700708   2    1000024    5
    0.011570396   2    1000023    4
    0.0090519388   3    1000022    24    5

DECAY 2000006  50.932954
    0.44269456   2    1000005    24
    0.25503416   2    1000006    25
    0.23831061   2    1000006    23
    0.060488401   2    1000022    6
    0.0019510314   2    1000024    5
    0.0010006306   2    1000023    6
    0.00052061551   2    2000005    24

DECAY 1000024  2.2005198
    0.25382021   2    1000012   -11
    0.25380855   2    1000014   -13
    0.24527002   2   -1000013    14
    0.24524184   2   -1000011    12
    0.0017441542   2    1000022    24
    0.00010719917   3    1000022   -5    6

DECAY 1000037  38.560809
    0.49544227   2   -1000005    6
    0.1198029   2    1000006   -5
    0.08979611   2    1000023    24
    0.085772341   2    1000024    25
    0.083839975   2    1000024    23
    0.047926458   2    2000006   -5
    0.033181674   2   -2000005    6
    0.032789255   2    1000022    24
    0.0030960337   2   -1000015    16
    0.0023734274   3    1000023   -5    6
    0.0017486916   3    1000024    6   -6
    0.0012190594   3    1000022   -5    6
    0.0010007543   2   -1000013    14
    0.0010007348   2   -1000011    12
    0.00043765496   2    1000014   -13
    0.00036636197   2    1000012   -11
    0.00015391693   2    1000016   -15

DECAY 1000022 -1


DECAY 1000023  2.1982769
    0.1263024   2    1000012   -12
    0.1263024   2   -1000012    12
    0.12629628   2    1000014   -14
    0.12629628   2   -1000014    14
    0.12332722   2    1000013   -13
    0.12332722   2   -1000013    13
    0.12331217   2    1000011   -11
    0.12331217   2   -1000011    11
    0.0011722831   2    1000022    25
    0.00027225839   2    1000022    23

DECAY 1000025  39.393306
    0.22688966   2    1000006   -6
    0.22688966   2   -1000006    6
    0.09269909   2    1000023    25
    0.08189222   2    1000024   -24
    0.08189222   2   -1000024    24
    0.077342997   2    1000023    23
    0.048078247   2    1000005   -5
    0.048078247   2   -1000005    5
    0.025099215   2    1000022    25
    0.023709365   2    1000022    23
    0.020525951   2    2000005   -5
    0.020525951   2   -2000005    5
    0.008831332   2    2000006   -6
    0.008831332   2   -2000006    6
    0.0017300673   3    1000024    5   -6
    0.0017300673   3   -1000024   -5    6
    0.0015616936   2    1000015   -15
    0.0015616936   2   -1000015    15
    0.00097329876   3    1000023    6   -6
    0.00072993398   3    1000022    6   -6

DECAY 1000035  35.542182
    0.25251612   2    1000006   -6
    0.25251612   2   -1000006    6
    0.088399237   2    1000024   -24
    0.088399237   2   -1000024    24
    0.087803149   2    1000023    25
    0.052867377   2    1000005   -5
    0.052867377   2   -1000005    5
    0.023937808   2    1000022    25
    0.023305561   2    2000005   -5
    0.023305561   2   -2000005    5
    0.012812491   2    2000006   -6
    0.012812491   2   -2000006    6
    0.0096319259   2    1000022    23
    0.0053852456   2    1000023    23
    0.0025767487   3    1000024    5   -6
    0.0025767487   3   -1000024   -5    6
    0.0017035189   2    1000015   -15
    0.0017035189   2   -1000015    15
    0.0009820463   3    1000023    6   -6
    0.000776337   3    1000022    6   -6
    0.00045415045   2    1000012   -12
    0.00045415045   2   -1000012    12
    0.00045414668   2    1000014   -14
    0.00045414668   2   -1000014    14
    0.00027795503   2    1000013   -13
    0.00027795503   2   -1000013    13
    0.00023953632   2    1000011   -11
    0.00023953632   2   -1000011    11

DECAY 1000021  252.36826
    0.14040687   2    1000006   -6
    0.14040687   2   -1000006    6
    0.13074358   2    1000005   -5
    0.13074358   2   -1000005    5
    0.1080642   2    2000005   -5
    0.1080642   2   -2000005    5
    0.08096006   2    2000006   -6
    0.08096006   2   -2000006    6
    0.039109718   2    1000006   -4
    0.039109718   2   -1000006    4
    0.00036180434   3    1000023    6   -6
    0.00026223239   3    1000024    5   -6
    0.00026223239   3   -1000024   -5    6
    0.00012324516   3    1000037    5   -6
    0.00012324516   3   -1000037   -5    6

DECAY 25  0.003395116
    0.63467028   2   -5    5
    0.16403609   2   -24    24
    0.074751232   2    21    21
    0.072834308   2   -15    15
    0.031508803   2   -4    4
    0.018235923   2    23    23
    0.0023243313   2    22    22
    0.0011463823   2    22    23
    0.00025261133   2   -13    13
    0.00023921763   2   -3    3
    6.6141431e-07   2   -1    1
    1.6238647e-07   2   -2    2
    5.6790415e-09   2   -11    11

DECAY 35  68.381238
    0.1951214   2   -2000006    1000006
    0.1951214   2   -1000006    2000006
    0.17816139   2   -5    5
    0.076228227   2   -15    15
    0.069633892   2   -1000024    1000037
    0.069633892   2   -1000037    1000024
    0.059600961   2   -1000006    1000006
    0.051504392   2    1000023    1000025
    0.02434278   2   -2000006    2000006
    0.017518866   2    1000023    1000035
    0.01740656   2    1000022    1000025
    0.012837603   2    1000022    1000035
    0.011448616   2   -2000005    1000005
    0.011448616   2   -1000005    2000005
    0.0018337826   2   -2000015    1000015
    0.0018337826   2   -1000015    2000015
    0.001828034   2   -6    6
    0.0016665394   2   -1000024    1000024
    0.00082949551   2    1000023    1000023
    0.00051032675   2    1000022    1000023
    0.00047356243   2   -1000005    1000005
    0.00035620171   2   -2000005    2000005
    0.00025524866   2   -13    13
    0.00013873688   2   -3    3
    0.00012642967   2   -1000015    1000015
    6.2603814e-05   2    1000022    1000022
    4.8930824e-05   2    25    25
    2.5243072e-05   2    21    21
    6.2117396e-07   2    23    23
    3.8357435e-07   2   -1    1
    1.4151278e-07   2   -24    24
    1.1587827e-07   2   -1000011    1000011
    1.1338378e-07   2   -1000013    1000013
    9.4810952e-08   2    22    22
    6.285949e-08   2   -2000013    2000013
    6.1761174e-08   2   -2000011    2000011
    4.2041829e-08   2   -2000013    1000013
    4.2041829e-08   2   -1000013    2000013
    3.7271179e-08   2    22    23
    1.9568884e-08   2   -4    4
    5.7323615e-09   2   -11    11
    9.8356327e-13   2   -2000011    1000011
    9.8356327e-13   2   -1000011    2000011
    1.0092518e-13   2   -2    2

DECAY 36  68.277808
    0.24279094   2   -2000006    1000006
    0.24279094   2   -1000006    2000006
    0.17006584   2   -5    5
    0.072738803   2   -15    15
    0.069270021   2   -1000024    1000037
    0.069270021   2   -1000037    1000024
    0.050683447   2    1000023    1000035
    0.018014238   2    1000023    1000025
    0.017182532   2    1000022    1000035
    0.013083583   2    1000022    1000025
    0.011892618   2   -2000005    1000005
    0.011892618   2   -1000005    2000005
    0.0025698034   2   -1000024    1000024
    0.0019284657   2   -2000015    1000015
    0.0019284657   2   -1000015    2000015
    0.0015806222   2   -6    6
    0.0012787923   2    1000023    1000023
    0.00058969285   2    1000022    1000023
    0.00024356017   2   -13    13
    0.00013237263   2   -3    3
    6.5954744e-05   2    1000022    1000022
    4.8489457e-06   2    21    21
    1.228189e-06   2    23    25
    3.6597556e-07   2   -1    1
    8.1648151e-08   2    22    23
    4.1760315e-08   2   -2000013    1000013
    4.1760315e-08   2   -1000013    2000013
    2.3174336e-08   2    22    22
    2.2725868e-08   2   -4    4
    5.4698448e-09   2   -11    11
    9.7677756e-13   2   -2000011    1000011
    9.7677756e-13   2   -1000011    2000011
    1.1722124e-13   2   -2    2
    1.0708996e-13   2    23    35
    3.3245442e-36   2    25    25

DECAY 37  57.759764
    0.34082316   2   -1000005    2000006
    0.22426069   2   -5    6
    0.099227638   2   -15    16
    0.08356023   2    1000023    1000037
    0.082942968   2    1000024    1000025
    0.082768941   2    1000024    1000035
    0.035335629   2    1000022    1000037
    0.031756766   2   -2000005    1000006
    0.012449433   2   -1000005    1000006
    0.0045550252   2   -1000015    1000016
    0.0012982624   2    1000022    1000024
    0.00035080504   2   -13    14
    0.00032780018   2   -5    4
    0.00017166792   2   -2000005    2000006
    0.00015324281   2   -3    4
    7.1936198e-06   2   -3    2
    4.9002275e-06   2   -3    6
    2.3408309e-06   2   -5    2
    1.4528933e-06   2    24    25
    5.3860835e-07   2   -1000011    1000012
    5.3443904e-07   2   -1000013    1000014
    4.2527829e-07   2   -1    2
    2.1429202e-07   2   -1    6
    1.0198455e-07   2   -2000013    1000014
    2.1864545e-08   2   -1    4
    8.2053663e-09   2   -11    12
    6.814765e-09   2    1000023    1000024
    2.3856154e-12   2   -2000011    1000012
    5.384721e-13   2    24    35

DECAY 6  2.43
    1   2    5    24

DECAY 15 -1
