BLOCK SPINFO
   1   SPheno
   2   v4.0.5be

BLOCK SPHENOINFO
   1   2
   2   2

BLOCK MODSEL
   1   0

BLOCK MINPAR
   3    21.212284
   4   -1

BLOCK EXTPAR
   0    3114.3949
   1   -3686.477
   2    2624.6057
   3    3765.177
   11    3722.9244
   12    1352.9693
   13    4641.9988
   23   -171.72247
   25    20.304871
   26    3049.7992
   31    4471.2895
   32    4471.2895
   33    1361.0695
   34    2286.8198
   35    2286.8198
   36    3561.1512
   41    2151.7087
   42    2151.7087
   43    2616.8611
   44    3407.492
   45    3407.492
   46    3504.0355
   47    4968.6092
   48    4968.6092
   49    4519.5035

BLOCK SMINPUTS
   1    127.90897
   2    1.1663787e-05
   3    0.1184
   4    91.1876
   5    4.18
   6    173.2
   7    1.777
   8    0
   11    0.00051099893
   12    0
   13    0.10565837
   14    0
   21    0.005
   22    0.0025
   23    0.095
   24    1.27

BLOCK GAUGE Q=  3114.3949
   1    0.35536298
   2    0.66519887
   3    1.219778

BLOCK YU Q=  3114.3949
   1   1    8.3945341e-06
   2   2    0.0042644233
   3   3    1.0141271

BLOCK YD Q=  3114.3949
   1   1    0.00034251301
   2   2    0.0065077473
   3   3    0.33966558

BLOCK YE Q=  3114.3949
   1   1    5.9771026e-05
   2   2    0.012358752
   3   3    0.20785388

BLOCK AU Q=  3114.3949
   1   1    0
   2   2    0
   3   3    3722.9244

BLOCK AD Q=  3114.3949
   1   1    0
   2   2    0
   3   3    1352.9693

BLOCK AE Q=  3114.3949
   1   1    0
   2   2    0
   3   3    4641.9988

BLOCK MSOFT Q=  3114.3949
   1   -3686.477
   2    2624.6057
   3    3765.177
   21    9192081.1
   22    124778.57
   31    4471.2895
   32    4471.2895
   33    1361.0695
   34    2286.8198
   35    2286.8198
   36    3561.1512
   41    2151.7087
   42    2151.7087
   43    2616.8611
   44    3407.492
   45    3407.492
   46    3504.0355
   47    4968.6092
   48    4968.6092
   49    4519.5035

BLOCK MASS
   6    173.2
   23    91.1876
   24    80.429995
   15    1.777
   25    122.52151
   35    3049.7247
   36    3049.7992
   37    3051.1507
   1000001    2321.3324
   2000001    5046.2337
   1000002    2319.9304
   2000002    3528.324
   1000003    2321.3311
   2000003    5046.2322
   1000004    2319.9293
   2000004    3528.3234
   1000005    2738.6677
   2000005    4602.7515
   1000006    2732.1719
   2000006    3550.0898
   1000011    4484.5588
   2000011    2303.8559
   1000012    4483.4387
   1000013    4484.5542
   2000013    2303.8447
   1000014    4483.4346
   1000015    1395.1154
   2000015    3569.8117
   1000016    1392.4563
   1000021    3892.0535
   1000022    183.55713
   1000023   -185.34497
   1000025    2629.4762
   1000035   -3650.8675
   1000024    184.58397
   1000037    2629.6687

BLOCK ALPHA
      -0.047220332

BLOCK HMIX Q=  3114.3949
   1   -171.72247
   2    20.304871
   3    243.21941
   4    9301275.3

BLOCK STOPMIX
   1   1   -0.99514204
   1   2    0.098449537
   2   1   -0.098449537
   2   2   -0.99514204

BLOCK SBOTMIX
   1   1   -0.99999973
   1   2    0.00073255746
   2   1   -0.00073255746
   2   2   -0.99999973

BLOCK STAUMIX
   1   1   -0.99999914
   1   2    0.0013080703
   2   1   -0.0013080703
   2   2   -0.99999914

BLOCK NMIX
   1   1   -0.0076669603
   1   2   -0.021334926
   1   3   -0.70859495
   1   4   -0.70525119
   2   1    0.0093947273
   2   2    0.020715669
   2   3   -0.70561429
   2   4    0.70823095
   3   1    0.00021009523
   3   2   -0.99955773
   3   3    0.000500593
   3   4    0.029732899
   4   1   -0.99992645
   4   2    0.00014820068
   4   3   -0.0011962672
   4   4    0.012067904

BLOCK UMIX
   1   1   -0.0007113688
   1   2   -0.99999975
   2   1    0.99999975
   2   2   -0.0007113688

BLOCK VMIX
   1   1   -0.042059059
   1   2    0.99911513
   2   1    0.99911513
   2   2    0.042059059

BLOCK HIGGSBOUNDSINPUTHIGGSCOUPLINGSFERMIONS
       0, 412.28778,3,36,15,15

BLOCK HIGGSBOUNDSINPUTHIGGSCOUPLINGSBOSONS
       0,4,36,21,21,23

BLOCK SPHENOLOWENERGY
   1    0.00032365913
   2    1.5896569e-06
   3    3.5247828e-05
   4    2.6259885e-15
   5    1.121792e-10
   6    2.3481581e-08
   7    8.8635957e-14
   8    3.7865237e-09
   9    8.0308416e-07
   10    9.6525477e-05
   11    0.99707123
   12    0.54205034
   13    19.366413
   14    0
   15    0
   16    0.0021576126
   17    2.2816615e-15
   18    2.4797231e-11
   19    8.2895488e-11
   20   -7.1947877e-16
   21   -3.0760235e-11
   22   -1.6838335e-08
   23    0
   24    0
   25    0
   26    0
   27    0
   28    0
   29    0
   30    0
   31    0
   39    5.2755664e-05
   40    0
   41    0
   42    0

BLOCK FWCOEF Q=  160
   305   4422   0   0   -0.18881911
   305   4422   0   2   -0.19177557
   305   4322   0   2   -5.1750931e-05
   305   6421   0   0   -0.095227835
   305   6421   0   2   -0.10206841
   305   6321   0   2   -0.00013153338
   3051111   4133   0   0    1.6176491
   3051111   4133   0   2    1.6180861
   3051111   4233   0   2    7.6043212e-05
   3051111   4137   0   0   -4.4403412
   3051111   4137   0   2   -4.4382209
   3051111   4237   0   2   -0.0005698533
   3051313   4133   0   0    1.6176491
   3051313   4133   0   2    1.618086
   3051313   4233   0   2    7.6043146e-05
   3051313   4137   0   0   -4.4403412
   3051313   4137   0   2   -4.438221
   3051313   4237   0   2   -0.00056985337
   3051212   4137   0   0    1.5053501
   3051212   4137   0   2    1.5048917
   3051212   4237   0   2    0.00012347466
   3051414   4137   0   0    1.5053501
   3051414   4137   0   2    1.5048917
   3051414   4237   0   2    0.00012347467
   3051616   4137   0   0    1.5053501
   3051616   4137   0   2    1.5048913
   3051616   4237   0   2    0.00012347605

BLOCK IMFWCOEF Q=  160
   305   4422   0   0    3.8582619e-07
   305   4422   0   2   -6.9596064e-06
   305   4322   0   2    1.3127435e-06
   305   6421   0   0    3.3048565e-07
   305   6421   0   2   -8.5926724e-07
   305   6321   0   2    5.876056e-07
   3051111   4133   0   2   -4.2609985e-07
   3051111   4233   0   2    1.5560923e-06
   3051111   4137   0   2    4.6651874e-06
   3051111   4237   0   2   -1.1662468e-05
   3051313   4133   0   2   -4.2609973e-07
   3051313   4233   0   2    1.5560915e-06
   3051313   4137   0   2    4.6651883e-06
   3051313   4237   0   2   -1.166247e-05
   3051212   4137   0   2   -9.9222243e-07
   3051212   4237   0   2    2.527e-06
   3051414   4137   0   2   -9.9222244e-07
   3051414   4237   0   2    2.527e-06
   3051616   4137   0   2   -9.9978154e-07
   3051616   4237   0   2    2.5270003e-06

DECAY 23  2.4952


DECAY 24  2.085


DECAY 2000011  0.001680738
    0.60011803   2    1000023    11
    0.3997858   2    1000022    11

DECAY 1000011  26.153019
    0.64989591   2   -1000037    12
    0.32463766   2    1000025    11
    0.024481033   2    1000035    11
    0.00049814685   2    1000023    11
    0.00048648481   2    1000022    11

DECAY 2000013  0.015502575
    0.44579471   2   -1000024    14
    0.28699997   2    1000023    13
    0.26720531   2    1000022    13

DECAY 1000013  26.16652
    0.64955852   2   -1000037    14
    0.32446913   2    1000025    13
    0.02446818   2    1000035    13
    0.00075628997   2    1000023    13
    0.00074683937   2    1000022    13

DECAY 1000015  1.1653774
    0.50229448   2    1000022    15
    0.49769275   2    1000023    15

DECAY 2000015  6.1701783
    0.49461251   2   -1000024    16
    0.2484985   2    1000022    15
    0.24654603   2    1000023    15
    0.0052187146   2    1000016   -24
    0.002602155   2    1000015    23
    0.002518326   2    1000015    25

DECAY 1000012  26.160882
    0.6480501   2    1000037    11
    0.32443486   2    1000025    12
    0.024446646   2    1000035    12
    0.0026597426   2    1000024    11
    0.00022342561   2    1000022    12
    0.0001852264   2    1000023    12

DECAY 1000014  26.174381
    0.64771402   2    1000037    13
    0.32426661   2    1000025    14
    0.024433838   2    1000035    14
    0.0031770894   2    1000024    13
    0.00022331017   2    1000022    14
    0.0001851307   2    1000023    14

DECAY 1000016  1.1793727
    0.99727323   2    1000024    15
    0.0014911983   2    1000022    16
    0.0012355713   2    1000023    16

DECAY 1000001  0.0076974433
    0.52309023   2    1000022    1
    0.47558287   2    1000023    1
    0.001326907   2   -1000024    2

DECAY 2000001  66.015584
    0.99030224   2    1000021    1
    0.0096911428   2    1000035    1

DECAY 1000003  0.010451067
    0.47780939   2    1000022    3
    0.44201106   2    1000023    3
    0.080179545   2   -1000024    4

DECAY 2000003  66.023905
    0.99017536   2    1000021    3
    0.0096899054   2    1000035    3

DECAY 1000005  61.291969
    0.89702208   2   -1000024    6
    0.051114238   2    1000022    5
    0.050664486   2    1000023    5
    0.0011991947   2    1000025    5

DECAY 2000005  50.912304
    0.57950373   2    1000021    5
    0.20625273   2   -1000024    6
    0.10385595   2    1000022    5
    0.10298987   2    1000023    5
    0.0069401525   2    1000035    5
    0.0001875758   2    1000006   -24
    0.0001749997   2    1000005    25

DECAY 1000002  0.045925596
    0.77682201   2    1000024    1
    0.1131432   2    1000022    2
    0.11003478   2    1000023    2

DECAY 2000002  0.0011523563
    0.60017693   2    1000023    2
    0.39975914   2    1000022    2

DECAY 1000004  0.048677773
    0.77244447   2    1000024    3
    0.11520916   2    1000022    4
    0.11234637   2    1000023    4

DECAY 2000004  0.003688618
    0.3601427   2    1000023    4
    0.34356275   2    1000024    3
    0.29609386   2    1000022    4
    0.00012096646   2    1000037    3

DECAY 1000006  62.177934
    0.4430479   2    1000023    6
    0.43930111   2    1000022    6
    0.10343923   2    1000024    5
    0.012109042   3    1000022    24    5
    0.0020972973   2    1000037    5

DECAY 2000006  188.31036
    0.38174787   2    1000024    5
    0.19171105   2    1000023    6
    0.19015697   2    1000022    6
    0.10244674   2    1000005    24
    0.082289159   2    1000006    25
    0.051586315   2    1000006    23

DECAY 1000024  1.1271363e-12
    0.69207338   2    1000022    211
    0.157964   3    1000022   -11    12
    0.14996262   3    1000022   -13    14

DECAY 1000037  41.724981
    0.14339526   2    1000016   -15
    0.14322128   2   -1000015    16
    0.13602801   2    1000024    25
    0.12974503   2    1000023    24
    0.12901613   2    1000024    23
    0.12863739   2    1000022    24
    0.040830912   2    1000004   -3
    0.040830619   2    1000002   -1
    0.040556482   2   -1000001    2
    0.040556398   2   -1000003    4
    0.011338367   3    1000024    6   -6
    0.0078864916   3    1000023   -5    6
    0.0076277003   3    1000022   -5    6
    0.00031434769   3    1000024    5   -5

DECAY 1000022 -1


DECAY 1000023  4.7703374e-10
    0.95381682   2    1000022    22
    0.013566528   3    1000022    12   -12
    0.010143585   3    1000022    1   -1
    0.0097178505   3    1000022    3   -3
    0.0079117987   3    1000022    2   -2
    0.0022893932   3    1000022    11   -11
    0.0021400742   3    1000022    13   -13
    0.00012857726   3    1000024    1   -2
    0.00012857726   3   -1000024   -1    2

DECAY 1000025  42.333199
    0.12742347   2    1000024   -24
    0.12742347   2   -1000024    24
    0.085000801   2    1000023    25
    0.070732749   2    1000016   -16
    0.070732749   2   -1000016    16
    0.070490337   2    1000015   -15
    0.070490337   2   -1000015    15
    0.069660517   2    1000022    25
    0.066021288   2    1000023    23
    0.061215452   2    1000022    23
    0.020116144   2    1000002   -2
    0.020116144   2   -1000002    2
    0.020116095   2    1000004   -4
    0.020116095   2   -1000004    4
    0.019948775   2    1000003   -3
    0.019948775   2   -1000003    3
    0.019948622   2    1000001   -1
    0.019948622   2   -1000001    1
    0.0057615219   3    1000024    5   -6
    0.0057615219   3   -1000024   -5    6
    0.0044119541   3    1000023    6   -6
    0.0042989359   3    1000022    6   -6
    0.00015129199   3    1000022    5   -5
    0.00014737501   3    1000023    5   -5

DECAY 1000035  34.119011
    0.097341366   2    2000013   -13
    0.097341366   2   -2000013    13
    0.097340112   2    2000011   -11
    0.097340112   2   -2000011    11
    0.070791801   2    1000024   -24
    0.070791801   2   -1000024    24
    0.049096062   2    1000016   -16
    0.049096062   2   -1000016    16
    0.048978147   2    1000015   -15
    0.048978147   2   -1000015    15
    0.042182469   2    1000022    23
    0.040574871   2    1000023    25
    0.033276427   2    1000022    25
    0.028572602   2    1000023    23
    0.0079622589   2    1000003   -3
    0.0079622589   2   -1000003    3
    0.0079622469   2    1000001   -1
    0.0079622469   2   -1000001    1
    0.0079487951   2    1000004   -4
    0.0079487951   2   -1000004    4
    0.0079487947   2    1000002   -2
    0.0079487947   2   -1000002    2
    0.0060490344   2    37   -1000024
    0.0060490344   2   -37    1000024
    0.0050766414   2    1000006   -6
    0.0050766414   2   -1000006    6
    0.0043048654   2    1000022    35
    0.004290417   2    1000005   -5
    0.004290417   2   -1000005    5
    0.0042211951   3    1000024    5   -6
    0.0042211951   3   -1000024   -5    6
    0.0035383076   2    1000023    35
    0.0031378757   3    1000023    6   -6
    0.0031026983   3    1000022    6   -6
    0.0021492526   2    1000023    36
    0.0017879914   2    1000022    36
    0.0015613371   2    2000002   -2
    0.0015613371   2   -2000002    2
    0.0015612755   2    2000004   -4
    0.0015612755   2   -2000004    4
    0.00051813806   2    2000015   -15
    0.00051813806   2   -2000015    15

DECAY 1000021  261.20136
    0.091660877   2    1000004   -4
    0.091660877   2   -1000004    4
    0.09166079   2    1000002   -2
    0.09166079   2   -1000002    2
    0.091538797   2    1000003   -3
    0.091538797   2   -1000003    3
    0.091538688   2    1000001   -1
    0.091538688   2   -1000001    1
    0.058226334   2    1000006   -6
    0.058226334   2   -1000006    6
    0.056211004   2    1000005   -5
    0.056211004   2   -1000005    5
    0.0070009819   2    2000002   -2
    0.0070009819   2   -2000002    2
    0.0070009642   2    2000004   -4
    0.0070009642   2   -2000004    4
    0.0048719084   2    2000006   -6
    0.0048719084   2   -2000006    6

DECAY 25  0.0035820631
    0.61035914   2   -5    5
    0.18942069   2   -24    24
    0.074167335   2    21    21
    0.069983958   2   -15    15
    0.030159905   2   -4    4
    0.021814082   2    23    23
    0.0023331281   2    22    22
    0.0012889342   2    22    23
    0.00024273577   2   -13    13
    0.00022929891   2   -3    3
    6.3398846e-07   2   -1    1
    1.5542915e-07   2   -2    2
    5.4570027e-09   2   -11    11

DECAY 35  20.411409
    0.74437688   2   -5    5
    0.13307649   2   -15    15
    0.03532106   2   -1000024    1000037
    0.03532106   2   -1000037    1000024
    0.022803246   2    1000023    1000025
    0.013165419   2   -6    6
    0.012552397   2    1000022    1000025
    0.0022457691   2   -1000024    1000024
    0.00046613104   2   -13    13
    0.00028189222   2   -3    3
    0.00021281152   2    1000022    1000022
    0.0001458023   2    1000023    1000023
    1.9207289e-05   2    25    25
    3.5390855e-06   2    21    21
    3.494407e-06   2    23    23
    1.3742989e-06   2   -1000015    1000015
    1.0325861e-06   2   -24    24
    7.7933116e-07   2   -1    1
    1.775155e-07   2   -4    4
    1.2105421e-08   2    1000022    1000023
    1.0468977e-08   2   -11    11
    6.2575185e-09   2    22    23
    3.4674211e-09   2    22    22
    9.1507777e-13   2   -2    2

DECAY 36  19.898386
    0.74229927   2   -5    5
    0.13270619   2   -15    15
    0.036246121   2   -1000024    1000037
    0.036246121   2   -1000037    1000024
    0.023681524   2    1000022    1000025
    0.012720947   2   -6    6
    0.012624349   2    1000023    1000025
    0.0023253168   2   -1000024    1000024
    0.00046483092   2   -13    13
    0.00028110541   2   -3    3
    0.00018323448   2    1000022    1000022
    0.00018320013   2    1000023    1000023
    2.8043627e-05   2    21    21
    5.8986759e-06   2    23    25
    2.847103e-06   2    1000022    1000023
    7.7715767e-07   2   -1    1
    1.6913123e-07   2   -4    4
    2.2316068e-08   2    22    22
    1.6577384e-08   2    22    23
    1.0439775e-08   2   -11    11
    8.7188789e-13   2   -2    2
    8.7602032e-40   2    25    25

DECAY 37  20.37519
    0.7555058   2   -5    6
    0.13475102   2   -15    16
    0.035958525   2    1000022    1000037
    0.035648071   2    1000024    1000025
    0.035430452   2    1000023    1000037
    0.0011011341   2   -5    4
    0.00047639297   2   -13    14
    0.00043876212   2    1000023    1000024
    0.00038331911   2    1000022    1000024
    0.00025740248   2   -3    4
    1.9018116e-05   2   -3    6
    1.2050678e-05   2   -3    2
    7.8632324e-06   2   -5    2
    5.7718059e-06   2    24    25
    2.7907063e-06   2   -1000015    1000016
    8.5478292e-07   2   -1    6
    7.1375545e-07   2   -1    2
    4.1150489e-08   2   -1    4
    1.1142881e-08   2   -11    12
    3.9392588e-13   2    24    35
    3.0124518e-13   2    24    36

DECAY 6  2.43
    1   2    5    24

DECAY 15 -1
