# SUSY Les Houches Accord 2 - MSSM spectrum + Decays
# SPheno v4.0.5be
# W. Porod, Comput. Phys. Commun. 153 (2003) 275-315, hep-ph/0301101;
# W. Porod, F.~Staub, Comput. Phys. Commun. 183 (2012) 2458
#                     arXiv:1104.1573 [hep-ph] 
# in case of problems send email to porod@physik.uni-wuerzburg.de
# Created: 16.05.2022,  02:37
Block SPINFO         # Program information
     1   SPheno      # spectrum calculator
     2   v4.0.5be    # version number
#
Block SPhenoINFO     # SPheno specific information
    1      2         # using 2-loop RGEs
    2      2         # using pole masses for boundary conditions at mZ
Block MODSEL  # Model selection
    1    0    # general MSSM
Block MINPAR  # Input parameters
    3    5.66906198E+01  # tanb at m_Z    
    4   -1.00000000E+00  # Sign(mu)
Block EXTPAR  # non-universal input parameters
    0    4.12055640E+03  # scale for input parameters
    1    5.10630665E+01  # M_1
    2    7.12806306E+02  # M_2
    3    2.88795130E+03  # M_3
   11    6.37475549E+03  # A_t
   12   -1.21047374E+03  # A_b
   13    1.82169282E+03  # A_tau
   23   -1.68226536E+02  # mu
   25    5.66133897E+01  # tan(beta)
   26    3.74055107E+03  # m_A, pole mass
   31    5.80764646E+02  # M_L11
   32    5.80764646E+02  # M_L22
   33    1.57779392E+03  # M_L33
   34    3.75736628E+02  # M_E11
   35    3.75736628E+02  # M_E22
   36    1.01384069E+03  # M_E33
   41    1.00000000E+04  # M_Q11
   42    1.00000000E+04  # M_Q22
   43    4.30035492E+03  # M_Q33
   44    1.00000000E+04  # M_U11
   45    1.00000000E+04  # M_U22
   46    3.99622267E+03  # M_U33
   47    1.00000000E+04  # M_D11
   48    1.00000000E+04  # M_D22
   49    3.57090130E+03  # M_D33
Block SMINPUTS  # SM parameters
         1     1.27908970E+02  # alpha_em^-1(MZ)^MSbar
         2     1.16637870E-05  # G_mu [GeV^-2]
         3     1.18400000E-01  # alpha_s(MZ)^MSbar
         4     9.11876000E+01  # m_Z(pole)
         5     4.18000000E+00  # m_b(m_b), MSbar
         6     1.73200000E+02  # m_t(pole)
         7     1.77700000E+00  # m_tau(pole)
         8     0.00000000E+00  # m_nu_3
        11     5.10998930E-04  # m_e(pole)
        12     0.00000000E+00  # m_nu_1
        13     1.05658372E-01  # m_muon(pole)
        14     0.00000000E+00  # m_nu_2
        21     5.00000000E-03  # m_d(2 GeV), MSbar
        22     2.50000000E-03  # m_u(2 GeV), MSbar
        23     9.50000000E-02  # m_s(2 GeV), MSbar
        24     1.27000000E+00  # m_c(m_c), MSbar
Block gauge Q=  4.12055640E+03  # (SUSY scale)
   1    3.55362975E-01  # g'(Q)^DRbar
   2    6.65198874E-01  # g(Q)^DRbar
   3    1.21977796E+00  # g3(Q)^DRbar
Block Yu Q=  4.12055640E+03  # (SUSY scale)
  1  1     8.38568002E-06   # Y_u(Q)^DRbar
  2  2     4.25992545E-03   # Y_c(Q)^DRbar
  3  3     1.01305750E+00   # Y_t(Q)^DRbar
Block Yd Q=  4.12055640E+03  # (SUSY scale)
  1  1     9.53976536E-04   # Y_d(Q)^DRbar
  2  2     1.81255542E-02   # Y_s(Q)^DRbar
  3  3     9.46045790E-01   # Y_b(Q)^DRbar
Block Ye Q=  4.12055640E+03  # (SUSY scale)
  1  1     1.66475881E-04   # Y_e(Q)^DRbar
  2  2     3.44219324E-02   # Y_mu(Q)^DRbar
  3  3     5.78920276E-01   # Y_tau(Q)^DRbar
Block Au Q=  4.12055640E+03  # (SUSY scale)
  1  1     0.00000000E+00   # A_u(Q)^DRbar
  2  2     0.00000000E+00   # A_c(Q)^DRbar
  3  3     6.37475550E+03   # A_t(Q)^DRbar
Block Ad Q=  4.12055640E+03  # (SUSY scale)
  1  1     0.00000000E+00   # A_d(Q)^DRbar
  2  2     0.00000000E+00   # A_s(Q)^DRbar
  3  3    -1.21047373E+03   # A_b(Q)^DRbar
Block Ae Q=  4.12055640E+03  # (SUSY scale)
  1  1     0.00000000E+00   # A_e(Q)^DRbar
  2  2     0.00000000E+00   # A_mu(Q)^DRbar
  3  3     1.82169281E+03   # A_tau(Q)^DRbar
Block MSOFT Q=  4.12055640E+03  # soft SUSY breaking masses at Q
   1    5.10630665E+01  # M_1
   2    7.12806306E+02  # M_2
   3    2.88795130E+03  # M_3
  21    1.47508591E+07  # M^2_(H,d)
  22    3.35560779E+05  # M^2_(H,u)
  31    5.80764646E+02  # M_(L,11)
  32    5.80764646E+02  # M_(L,22)
  33    1.57779392E+03  # M_(L,33)
  34    3.75736628E+02  # M_(E,11)
  35    3.75736628E+02  # M_(E,22)
  36    1.01384069E+03  # M_(E,33)
  41    1.00000000E+04  # M_(Q,11)
  42    1.00000000E+04  # M_(Q,22)
  43    4.30035492E+03  # M_(Q,33)
  44    1.00000000E+04  # M_(U,11)
  45    1.00000000E+04  # M_(U,22)
  46    3.99622267E+03  # M_(U,33)
  47    1.00000000E+04  # M_(D,11)
  48    1.00000000E+04  # M_(D,22)
  49    3.57090130E+03  # M_(D,33)
Block MASS  # Mass spectrum
#   PDG code      mass          particle
         6     1.73200000E+02  # m_t(pole)
        23     9.11876000E+01  # m_Z(pole)
        24     8.04299946E+01  # W+
        15     1.77700000E+00  # m_tau(pole)
        25     1.28019126E+02  # h0
        35     3.73772650E+03  # H0
        36     3.74055107E+03  # A0
        37     3.73998975E+03  # H+
   1000001     1.01131556E+04  # ~d_L
   2000001     1.00881866E+04  # ~d_R
   1000002     1.01127976E+04  # ~u_L
   2000002     1.00907170E+04  # ~u_R
   1000003     1.01131584E+04  # ~s_L
   2000003     1.00881916E+04  # ~s_R
   1000004     1.01128004E+04  # ~c_L
   2000004     1.00907174E+04  # ~c_R
   1000005     3.61611990E+03  # ~b_1
   2000005     4.28798668E+03  # ~b_2
   1000006     3.93409357E+03  # ~t_1
   2000006     4.31585695E+03  # ~t_2
   1000011     5.92033885E+02  # ~e_L-
   2000011     4.03481657E+02  # ~e_R-
   1000012     5.86268298E+02  # ~nu_eL
   1000013     5.91923775E+02  # ~mu_L-
   2000013     4.03154588E+02  # ~mu_R-
   1000014     5.86165666E+02  # ~nu_muL
   1000015     9.62239694E+02  # ~tau_1-
   2000015     1.55963024E+03  # ~tau_2-
   1000016     1.55832091E+03  # ~nu_tauL
   1000021     3.37581371E+03  # ~g
   1000022     4.78511656E+01  # ~chi_10
   1000023     1.89980998E+02  # ~chi_20
   1000025     1.96017979E+02  # ~chi_30
   1000035     7.64776710E+02  # ~chi_40
   1000024     1.86820591E+02  # ~chi_1+
   1000037     7.64987794E+02  # ~chi_2+
# Higgs mixing
Block alpha # Effective Higgs mixing angle
          -1.76647171E-02   # alpha
Block Hmix Q=  4.12055640E+03  # Higgs mixing parameters
   1   -1.68226536E+02  # mu
   2    5.66133897E+01  # tan[beta](Q)
   3    2.42874469E+02  # v(Q)
   4    1.39917223E+07  # m^2_A(Q)
Block stopmix # stop mixing matrix
   1  1    -2.69556370E-01   # Re[R_st(1,1)]
   1  2     9.62984612E-01   # Re[R_st(1,2)]
   2  1    -9.62984612E-01   # Re[R_st(2,1)]
   2  2    -2.69556370E-01   # Re[R_st(2,2)]
Block sbotmix # sbottom mixing matrix
   1  1    -2.40112474E-03   # Re[R_sb(1,1)]
   1  2     9.99997117E-01   # Re[R_sb(1,2)]
   2  1    -9.99997117E-01   # Re[R_sb(2,1)]
   2  2    -2.40112474E-03   # Re[R_sb(2,2)]
Block staumix # stau mixing matrix
   1  1    -1.40428227E-02   # Re[R_sta(1,1)]
   1  2     9.99901395E-01   # Re[R_sta(1,2)]
   2  1    -9.99901395E-01   # Re[R_sta(2,1)]
   2  2    -1.40428227E-02   # Re[R_sta(2,2)]
Block Nmix # neutralino mixing matrix
   1  1     9.68021331E-01   # Re[N(1,1)]
   1  2    -5.76842422E-03   # Re[N(1,2)]
   1  3    -2.44001138E-01   # Re[N(1,3)]
   1  4    -5.80075133E-02   # Re[N(1,4)]
   2  1     2.14481488E-01   # Re[N(2,1)]
   2  2     9.45750973E-02   # Re[N(2,2)]
   2  3     6.84584661E-01   # Re[N(2,3)]
   2  4     6.90215244E-01   # Re[N(2,4)]
   3  1     1.29945077E-01   # Re[N(3,1)]
   3  2    -6.08917750E-02   # Re[N(3,2)]
   3  3     6.86444886E-01   # Re[N(3,3)]
   3  4    -7.12881398E-01   # Re[N(3,4)]
   4  1     6.83153263E-03   # Re[N(4,1)]
   4  2    -9.93636990E-01   # Re[N(4,2)]
   4  3     2.45092682E-02   # Re[N(4,3)]
   4  4     1.09718540E-01   # Re[N(4,4)]
Block Umix # chargino mixing matrix
   1  1    -3.47492457E-02   # Re[U(1,1)]
   1  2    -9.99396063E-01   # Re[U(1,2)]
   2  1     9.99396063E-01   # Re[U(2,1)]
   2  2    -3.47492457E-02   # Re[U(2,2)]
Block Vmix # chargino mixing matrix
   1  1    -1.55371964E-01   # Re[V(1,1)]
   1  2     9.87856039E-01   # Re[V(1,2)]
   2  1     9.87856039E-01   # Re[V(2,1)]
   2  2     1.55371964E-01   # Re[V(2,2)]
DECAY        23     2.49520000E+00   # Z
DECAY        24     2.08500000E+00   # W
DECAY   2000011     1.92316792E+00   # ~e^-_R
#    BR                NDA      ID1      ID2
     9.60235099E-01    2     1000022        11   # BR(~e^-_R -> chi^0_1 e^-)
     2.93752279E-02    2     1000023        11   # BR(~e^-_R -> chi^0_2 e^-)
     1.03896014E-02    2     1000025        11   # BR(~e^-_R -> chi^0_3 e^-)
DECAY   1000011     7.69530643E-01   # ~e^-_L
#    BR                NDA      ID1      ID2
     8.73975042E-01    2     1000022        11   # BR(~e^-_L -> chi^0_1 e^-)
     1.19199181E-01    2     1000023        11   # BR(~e^-_L -> chi^0_2 e^-)
     1.95377809E-04    2     1000025        11   # BR(~e^-_L -> chi^0_3 e^-)
     6.63037846E-03    2    -1000024        12   # BR(~e^-_L -> chi^-_1 nu_e)
#    BR                NDA      ID1      ID2       ID3
DECAY   2000013     1.93315148E+00   # ~mu^-_R
#    BR                NDA      ID1      ID2
     9.54743926E-01    2     1000022        13   # BR(~mu^-_R -> chi^0_1 mu^-)
     3.05630242E-02    2     1000023        13   # BR(~mu^-_R -> chi^0_2 mu^-)
     1.16653545E-02    2     1000025        13   # BR(~mu^-_R -> chi^0_3 mu^-)
     3.02769576E-03    2    -1000024        14   # BR(~mu^-_R -> chi^-_1 nu_mu)
DECAY   1000013     7.80893207E-01   # ~mu^-_L
#    BR                NDA      ID1      ID2
     8.62141784E-01    2     1000022        13   # BR(~mu^-_L -> chi^0_1 mu^-)
     1.24177439E-01    2     1000023        13   # BR(~mu^-_L -> chi^0_2 mu^-)
     6.86675994E-03    2     1000025        13   # BR(~mu^-_L -> chi^0_3 mu^-)
     6.53214882E-03    2    -1000024        14   # BR(~mu^-_L -> chi^-_1 nu_mu)
     2.81855279E-04    2     2000013        25   # BR(~mu^-_L -> ~mu^-_R h^0)
#    BR                NDA      ID1      ID2       ID3
DECAY   1000015     1.66658548E+01   # ~tau^-_1
#    BR                NDA      ID1      ID2
     2.94415125E-01    2     1000022        15   # BR(~tau^-_1 -> chi^0_1 tau^-)
     1.78772741E-01    2     1000023        15   # BR(~tau^-_1 -> chi^0_2 tau^-)
     1.70393200E-01    2     1000025        15   # BR(~tau^-_1 -> chi^0_3 tau^-)
     3.56390181E-01    2    -1000024        16   # BR(~tau^-_1 -> chi^-_1 nu_tau)
DECAY   2000015     2.40907850E+01   # ~tau^-_2
#    BR                NDA      ID1      ID2
     9.88103858E-02    2     1000022        15   # BR(~tau^-_2 -> chi^0_1 tau^-)
     2.08594855E-01    2     1000023        15   # BR(~tau^-_2 -> chi^0_2 tau^-)
     1.97897893E-01    2     1000025        15   # BR(~tau^-_2 -> chi^0_3 tau^-)
     1.61359902E-01    2     1000035        15   # BR(~tau^-_2 -> chi^0_4 tau^-)
     2.81087576E-04    2    -1000024        16   # BR(~tau^-_2 -> chi^-_1 nu_tau)
     3.28490385E-01    2    -1000037        16   # BR(~tau^-_2 -> chi^-_2 nu_tau)
     2.41755847E-03    2     1000015        23   # BR(~tau^-_2 -> ~tau^-_1 Z)
     2.14793328E-03    2     1000015        25   # BR(~tau^-_2 -> ~tau^-_1 h^0)
#    BR                NDA      ID1      ID2       ID3
DECAY   1000012     8.32176778E-01   # ~nu_e
#    BR                NDA      ID1      ID2
     8.36612816E-01    2     1000022        12   # BR(~nu_e -> chi^0_1 nu_e)
     9.94061092E-04    2     1000023        12   # BR(~nu_e -> chi^0_2 nu_e)
     4.15412192E-02    2     1000025        12   # BR(~nu_e -> chi^0_3 nu_e)
     1.20851904E-01    2     1000024        11   # BR(~nu_e -> chi^+_1 e^-)
DECAY   1000014     8.43164268E-01   # ~nu_mu
#    BR                NDA      ID1      ID2
     8.25562272E-01    2     1000022        14   # BR(~nu_mu -> chi^0_1 nu_mu)
     9.80854862E-04    2     1000023        14   # BR(~nu_mu -> chi^0_2 nu_mu)
     4.09890938E-02    2     1000025        14   # BR(~nu_mu -> chi^0_3 nu_mu)
     1.32467779E-01    2     1000024        13   # BR(~nu_mu -> chi^+_1 mu^-)
DECAY   1000016     2.41584468E+01   # ~nu_tau
#    BR                NDA      ID1      ID2
     7.74850519E-02    2     1000022        16   # BR(~nu_tau -> chi^0_1 nu_tau)
     1.10274806E-04    2     1000023        16   # BR(~nu_tau -> chi^0_2 nu_tau)
     4.66982671E-03    2     1000025        16   # BR(~nu_tau -> chi^0_3 nu_tau)
     1.62734836E-01    2     1000035        16   # BR(~nu_tau -> chi^0_4 nu_tau)
     4.30664413E-01    2     1000024        15   # BR(~nu_tau -> chi^+_1 tau^-)
     3.19500441E-01    2     1000037        15   # BR(~nu_tau -> chi^+_2 tau^-)
     4.83515675E-03    2     1000015        24   # BR(~nu_tau -> ~tau^-_1 W^+)
DECAY   2000001     6.33576874E+02   # ~d_R
#    BR                NDA      ID1      ID2
     8.32965440E-03    2     1000022         1   # BR(~d_R -> chi^0_1 d)
     4.08781054E-04    2     1000023         1   # BR(~d_R -> chi^0_2 d)
     1.50127509E-04    2     1000025         1   # BR(~d_R -> chi^0_3 d)
     9.91110739E-01    2     1000021         1   # BR(~d_R -> ~g d)
DECAY   1000001     7.63716312E+02   # ~d_L
#    BR                NDA      ID1      ID2
     1.84969771E-03    2     1000022         1   # BR(~d_L -> chi^0_1 d)
     1.85263373E-04    2     1000023         1   # BR(~d_L -> chi^0_2 d)
     4.11372644E-04    2     1000025         1   # BR(~d_L -> chi^0_3 d)
     5.70288496E-02    2     1000035         1   # BR(~d_L -> chi^0_4 d)
     1.40663733E-04    2    -1000024         2   # BR(~d_L -> chi^-_1 u)
     1.15100934E-01    2    -1000037         2   # BR(~d_L -> chi^-_2 u)
     8.25283219E-01    2     1000021         1   # BR(~d_L -> ~g d)
DECAY   2000003     6.33708760E+02   # ~s_R
#    BR                NDA      ID1      ID2
     8.33410233E-03    2     1000022         3   # BR(~s_R -> chi^0_1 s)
     4.57289408E-04    2     1000023         3   # BR(~s_R -> chi^0_2 s)
     1.98951862E-04    2     1000025         3   # BR(~s_R -> chi^0_3 s)
     1.03851714E-04    2    -1000024         4   # BR(~s_R -> chi^-_1 c)
     9.90905209E-01    2     1000021         3   # BR(~s_R -> ~g s)
DECAY   1000003     7.63786130E+02   # ~s_L
#    BR                NDA      ID1      ID2
     1.85466710E-03    2     1000022         3   # BR(~s_L -> chi^0_1 s)
     2.25664264E-04    2     1000023         3   # BR(~s_L -> chi^0_2 s)
     4.51970657E-04    2     1000025         3   # BR(~s_L -> chi^0_3 s)
     5.70237036E-02    2     1000035         3   # BR(~s_L -> chi^0_4 s)
     1.45312280E-04    2    -1000024         4   # BR(~s_L -> chi^-_1 c)
     1.15090560E-01    2    -1000037         4   # BR(~s_L -> chi^-_2 c)
     8.25208122E-01    2     1000021         3   # BR(~s_L -> ~g s)
DECAY   1000005     1.34507266E+02   # ~b_1
#    BR                NDA      ID1      ID2
     4.26959777E-02    2     1000022         5   # BR(~b_1 -> chi^0_1 b)
     2.23770303E-01    2     1000023         5   # BR(~b_1 -> chi^0_2 b)
     2.24384667E-01    2     1000025         5   # BR(~b_1 -> chi^0_3 b)
     2.38150364E-04    2     1000035         5   # BR(~b_1 -> chi^0_4 b)
     4.73409301E-01    2    -1000024         6   # BR(~b_1 -> chi^-_1 t)
     4.74883191E-04    2    -1000037         6   # BR(~b_1 -> chi^-_2 t)
     3.50267173E-02    2     1000021         5   # BR(~b_1 -> ~g b)
DECAY   2000005     2.79867536E+02   # ~b_2
#    BR                NDA      ID1      ID2
     1.82948220E-02    2     1000022         5   # BR(~b_2 -> chi^0_1 b)
     1.27574230E-01    2     1000023         5   # BR(~b_2 -> chi^0_2 b)
     1.28542190E-01    2     1000025         5   # BR(~b_2 -> chi^0_3 b)
     6.27324923E-02    2     1000035         5   # BR(~b_2 -> chi^0_4 b)
     3.03202097E-01    2    -1000024         6   # BR(~b_2 -> chi^-_1 t)
     1.33806750E-01    2    -1000037         6   # BR(~b_2 -> chi^-_2 t)
     1.74820761E-01    2     1000021         5   # BR(~b_2 -> ~g b)
     5.09684349E-02    2     1000006       -24   # BR(~b_2 -> ~t_1 W^-)
DECAY   2000002     6.50714099E+02   # ~u_R
#    BR                NDA      ID1      ID2
     3.24492085E-02    2     1000022         2   # BR(~u_R -> chi^0_1 u)
     1.59193553E-03    2     1000023         2   # BR(~u_R -> chi^0_2 u)
     5.84313109E-04    2     1000025         2   # BR(~u_R -> chi^0_3 u)
     9.65372945E-01    2     1000021         2   # BR(~u_R -> ~g u)
DECAY   1000002     7.63702080E+02   # ~u_L
#    BR                NDA      ID1      ID2
     1.61784220E-03    2     1000022         2   # BR(~u_L -> chi^0_1 u)
     1.02667860E-03    2     1000023         2   # BR(~u_L -> chi^0_2 u)
     5.67492515E-02    2     1000035         2   # BR(~u_L -> chi^0_4 u)
     2.81233005E-03    2     1000024         1   # BR(~u_L -> chi^+_1 d)
     1.12456164E-01    2     1000037         1   # BR(~u_L -> chi^+_2 d)
     8.25254729E-01    2     1000021         2   # BR(~u_L -> ~g u)
DECAY   2000004     6.50721385E+02   # ~c_R
#    BR                NDA      ID1      ID2
     3.24488640E-02    2     1000022         4   # BR(~c_R -> chi^0_1 c)
     1.59458354E-03    2     1000023         4   # BR(~c_R -> chi^0_2 c)
     5.87149054E-04    2     1000025         4   # BR(~c_R -> chi^0_3 c)
     9.65362146E-01    2     1000021         4   # BR(~c_R -> ~g c)
DECAY   1000004     7.63771865E+02   # ~c_L
#    BR                NDA      ID1      ID2
     1.61771086E-03    2     1000022         4   # BR(~c_L -> chi^0_1 c)
     1.02886017E-03    2     1000023         4   # BR(~c_L -> chi^0_2 c)
     5.67441396E-02    2     1000035         4   # BR(~c_L -> chi^0_4 c)
     2.89821265E-03    2     1000024         3   # BR(~c_L -> chi^+_1 s)
     1.12446023E-01    2     1000037         3   # BR(~c_L -> chi^+_2 s)
     8.25179629E-01    2     1000021         4   # BR(~c_L -> ~g c)
DECAY   1000006     1.88150493E+02   # ~t_1
#    BR                NDA      ID1      ID2
     3.88931684E-02    2     1000022         6   # BR(~t_1 -> chi^0_1 t)
     2.05739912E-01    2     1000023         6   # BR(~t_1 -> chi^0_2 t)
     2.06681575E-01    2     1000025         6   # BR(~t_1 -> chi^0_3 t)
     2.12961863E-02    2     1000035         6   # BR(~t_1 -> chi^0_4 t)
     3.89555094E-01    2     1000024         5   # BR(~t_1 -> chi^+_1 b)
     4.16397618E-02    2     1000037         5   # BR(~t_1 -> chi^+_2 b)
     3.56515574E-03    2     1000021         4   # BR(~t_1 -> ~g c)
     9.20089942E-02    2     1000021         6   # BR(~t_1 -> ~g t)
#    BR                NDA      ID1      ID2       ID3
     4.90319915E-04    3     1000022        24         5   # BR(~t_1 -> chi^0_1 W^+ b)
DECAY   2000006     2.89790799E+02   # ~t_2
#    BR                NDA      ID1      ID2
     7.17792944E-03    2     1000022         6   # BR(~t_2 -> chi^0_1 t)
     1.43662618E-01    2     1000023         6   # BR(~t_2 -> chi^0_2 t)
     1.59958761E-01    2     1000025         6   # BR(~t_2 -> chi^0_3 t)
     5.22651293E-02    2     1000035         6   # BR(~t_2 -> chi^0_4 t)
     2.84964148E-01    2     1000024         5   # BR(~t_2 -> chi^+_1 b)
     9.71541679E-02    2     1000037         5   # BR(~t_2 -> chi^+_2 b)
     1.87958997E-01    2     1000021         6   # BR(~t_2 -> ~g t)
     2.81434292E-02    2     1000006        23   # BR(~t_2 -> ~t_1 Z)
     3.86886532E-02    2     1000006        25   # BR(~t_2 -> ~t_1 h^0)
DECAY   1000024     8.73468972E-02   # chi^+_1
#    BR                NDA      ID1      ID2
     9.99998286E-01    2     1000022        24   # BR(chi^+_1 -> chi^0_1 W^+)
#    BR                NDA      ID1      ID2       ID3
DECAY   1000037     8.48029509E+00   # chi^+_2
#    BR                NDA      ID1      ID2
     6.37878967E-02    2    -1000011        12   # BR(chi^+_2 -> ~e^+_L nu_e)
     6.38587785E-02    2    -1000013        14   # BR(chi^+_2 -> ~mu^+_L nu_mu)
     6.59834757E-02    2     1000012       -11   # BR(chi^+_2 -> ~nu_e e^+)
     6.60496178E-02    2     1000014       -13   # BR(chi^+_2 -> ~nu_mu mu^+)
     1.86738418E-01    2     1000023        24   # BR(chi^+_2 -> chi^0_2 W^+)
     1.88150606E-01    2     1000025        24   # BR(chi^+_2 -> chi^0_3 W^+)
     1.82924142E-01    2     1000024        23   # BR(chi^+_2 -> chi^+_1 Z)
     1.77494988E-01    2     1000024        25   # BR(chi^+_2 -> chi^+_1 h^0)
#    BR                NDA      ID1      ID2       ID3
     1.03365633E-03    3     1000024         6        -6   # BR(chi^+_2 -> chi^+_1 t t_bar)
     1.92033936E-03    3     1000023        -5         6   # BR(chi^+_2 -> chi^0_2 b_bar t)
     2.02805912E-03    3     1000025        -5         6   # BR(chi^+_2 -> chi^0_3 b_bar t)
DECAY   1000022     0.00000000E+00   # chi^0_1
DECAY   1000023     5.39929871E-02   # chi^0_2
#    BR                NDA      ID1      ID2
     6.30738995E-01    2     1000022        23   # BR(chi^0_2 -> chi^0_1 Z)
     3.69240100E-01    2     1000022        25   # BR(chi^0_2 -> chi^0_1 h^0)
#    BR                NDA      ID1      ID2       ID3
DECAY   1000025     1.31772916E-01   # chi^0_3
#    BR                NDA      ID1      ID2
     7.79499096E-01    2     1000022        23   # BR(chi^0_3 -> chi^0_1 Z)
     2.20454016E-01    2     1000022        25   # BR(chi^0_3 -> chi^0_1 h^0)
#    BR                NDA      ID1      ID2       ID3
DECAY   1000035     9.27297483E+00   # chi^0_4
#    BR                NDA      ID1      ID2
     2.85659047E-02    2     1000011       -11   # BR(chi^0_4 -> ~e^-_L e^+)
     2.85659047E-02    2    -1000011        11   # BR(chi^0_4 -> ~e^+_L e^-)
     2.85978524E-02    2     1000013       -13   # BR(chi^0_4 -> ~mu^-_L mu^+)
     2.85978524E-02    2    -1000013        13   # BR(chi^0_4 -> ~mu^+_L mu^-)
     3.06935443E-02    2     1000012       -12   # BR(chi^0_4 -> ~nu_e nu_bar_e)
     3.06935443E-02    2    -1000012        12   # BR(chi^0_4 -> ~nu^*_e nu_e)
     3.07241800E-02    2     1000014       -14   # BR(chi^0_4 -> ~nu_mu nu_bar_mu)
     3.07241800E-02    2    -1000014        14   # BR(chi^0_4 -> ~nu^*_mu nu_mu)
     1.71612095E-01    2     1000024       -24   # BR(chi^0_4 -> chi^+_1 W^-)
     1.71612095E-01    2    -1000024        24   # BR(chi^0_4 -> chi^-_1 W^+)
     4.81876759E-02    2     1000023        23   # BR(chi^0_4 -> chi^0_2 Z)
     1.23774400E-01    2     1000025        23   # BR(chi^0_4 -> chi^0_3 Z)
     1.15877403E-01    2     1000023        25   # BR(chi^0_4 -> chi^0_2 h^0)
     1.27503689E-01    2     1000025        25   # BR(chi^0_4 -> chi^0_3 h^0)
#    BR                NDA      ID1      ID2       ID3
     3.44009900E-04    3     1000023         6        -6   # BR(chi^0_4 -> chi^0_2 t t_bar)
     3.41917136E-04    3     1000025         6        -6   # BR(chi^0_4 -> chi^0_3 t t_bar)
     1.76959198E-03    3     1000024         5        -6   # BR(chi^0_4 -> chi^+_1 b t_bar)
     1.76959198E-03    3    -1000024        -5         6   # BR(chi^0_4 -> chi^-_1 b_bar t)
DECAY   1000021     7.68717457E-01   # ~g
#    BR                NDA      ID1      ID2
     1.32666186E-03    2     1000023        21   # BR(~g -> chi^0_2 g)
     1.08306140E-03    2     1000025        21   # BR(~g -> chi^0_3 g)
#    BR                NDA      ID1      ID2       ID3
     1.07644934E-04    3     1000022         2        -2   # BR(~g -> chi^0_1 u u_bar)
     1.07645081E-04    3     1000022         4        -4   # BR(~g -> chi^0_1 c c_bar)
     8.72935476E-03    3     1000022         6        -6   # BR(~g -> chi^0_1 t t_bar)
     2.09977657E-02    3     1000022         5        -5   # BR(~g -> chi^0_1 b b_bar)
     9.47103317E-02    3     1000023         6        -6   # BR(~g -> chi^0_2 t t_bar)
     1.24328338E-01    3     1000023         5        -5   # BR(~g -> chi^0_2 b b_bar)
     9.66060611E-02    3     1000025         6        -6   # BR(~g -> chi^0_3 t t_bar)
     1.24700924E-01    3     1000025         5        -5   # BR(~g -> chi^0_3 b b_bar)
     1.84486250E-04    3     1000035         2        -2   # BR(~g -> chi^0_4 u u_bar)
     1.84486461E-04    3     1000035         4        -4   # BR(~g -> chi^0_4 c c_bar)
     1.50613841E-02    3     1000035         6        -6   # BR(~g -> chi^0_4 t t_bar)
     1.85360962E-04    3     1000035         1        -1   # BR(~g -> chi^0_4 d d_bar)
     1.85361130E-04    3     1000035         3        -3   # BR(~g -> chi^0_4 s s_bar)
     1.04941245E-02    3     1000035         5        -5   # BR(~g -> chi^0_4 b b_bar)
     2.24147899E-01    3     1000024         5        -6   # BR(~g -> chi^+_1 b t_bar)
     2.24147899E-01    3    -1000024        -5         6   # BR(~g -> chi^-_1 b_bar t)
     3.69781160E-04    3     1000037         1        -2   # BR(~g -> chi^+_2 d u_bar)
     3.69781160E-04    3    -1000037        -1         2   # BR(~g -> chi^-_2 d_bar u)
     3.69781542E-04    3     1000037         3        -4   # BR(~g -> chi^+_2 s c_bar)
     3.69781542E-04    3    -1000037        -3         4   # BR(~g -> chi^-_2 s_bar c)
     2.55309079E-02    3     1000037         5        -6   # BR(~g -> chi^+_2 b t_bar)
     2.55309079E-02    3    -1000037        -5         6   # BR(~g -> chi^-_2 b_bar t)
DECAY        25     4.41090786E-03   # Gamma(h0)
     2.26980791E-03   2        22        22   # BR(h0 -> photon photon)
     1.70751119E-03   2        22        23   # BR(h0 -> photon Z)
     3.51243524E-02   2        23        23   # BR(h0 -> Z Z)
     2.74019972E-01   2       -24        24   # BR(h0 -> W W)
     6.84368861E-02   2        21        21   # BR(h0 -> gluon gluon)
     4.09900898E-09   2       -11        11   # BR(h0 -> Electron electron)
     1.82332914E-04   2       -13        13   # BR(h0 -> Muon muon)
     5.27261171E-02   2       -15        15   # BR(h0 -> Tau tau)
     1.16516650E-07   2        -2         2   # BR(h0 -> Up up)
     2.26144937E-02   2        -4         4   # BR(h0 -> Charm charm)
     4.74256473E-07   2        -1         1   # BR(h0 -> Down down)
     1.71527639E-04   2        -3         3   # BR(h0 -> Strange strange)
     4.56154455E-01   2        -5         5   # BR(h0 -> Bottom bottom)
     8.65919492E-02   2   1000022   1000022   # BR(h0 -> neutralino1 neutralino1)
DECAY        35     1.89194471E+02   # Gamma(HH)
     2.23696512E-08   2        22        22   # BR(HH -> photon photon)
     4.04351406E-08   2        22        23   # BR(HH -> photon Z)
     3.33067041E-08   2        23        23   # BR(HH -> Z Z)
     7.62212507E-09   2       -24        24   # BR(HH -> W W)
     6.40734849E-06   2        21        21   # BR(HH -> gluon gluon)
     7.44350448E-09   2       -11        11   # BR(HH -> Electron electron)
     3.31442958E-04   2       -13        13   # BR(HH -> Muon muon)
     1.06073288E-01   2       -15        15   # BR(HH -> Tau tau)
     1.51372269E-14   2        -2         2   # BR(HH -> Up up)
     2.93656227E-09   2        -4         4   # BR(HH -> Charm charm)
     2.22707476E-04   2        -6         6   # BR(HH -> Top top)
     6.27919666E-07   2        -1         1   # BR(HH -> Down down)
     2.27127097E-04   2        -3         3   # BR(HH -> Strange strange)
     6.24663283E-01   2        -5         5   # BR(HH -> Bottom bottom)
     4.40885051E-03   2  -1000024   1000024   # BR(HH -> Chargino1 chargino1)
     7.24053382E-02   2  -1000024   1000037   # BR(HH -> Chargino1 chargino2)
     7.24053382E-02   2  -1000037   1000024   # BR(HH -> Chargino2 chargino1)
     1.85717737E-04   2  -1000037   1000037   # BR(HH -> Chargino2 chargino2)
     3.25055277E-03   2   1000022   1000022   # BR(HH -> neutralino1 neutralino1)
     9.97558534E-03   2   1000022   1000023   # BR(HH -> neutralino1 neutralino2)
     7.84815181E-03   2   1000022   1000025   # BR(HH -> neutralino1 neutralino3)
     4.89972205E-03   2   1000022   1000035   # BR(HH -> neutralino1 neutralino4)
     7.23137110E-05   2   1000023   1000023   # BR(HH -> neutralino2 neutralino2)
     1.09907862E-03   2   1000023   1000025   # BR(HH -> neutralino2 neutralino3)
     3.47638481E-02   2   1000023   1000035   # BR(HH -> neutralino2 neutralino4)
     1.39031073E-03   2   1000025   1000025   # BR(HH -> neutralino3 neutralino3)
     3.42740527E-02   2   1000025   1000035   # BR(HH -> neutralino3 neutralino4)
     9.40203315E-05   2   1000035   1000035   # BR(HH -> neutralino4 neutralino4)
     2.03244602E-07   2        25        25   # BR(HH -> h0 h0)
     7.50649903E-09   2  -1000011   1000011   # BR(HH -> Selectron1 selectron1)
     3.14437345E-15   2  -2000011   1000011   # BR(HH -> Selectron2 selectron1)
     3.14437345E-15   2  -1000011   2000011   # BR(HH -> Selectron1 selectron2)
     1.12558504E-08   2  -2000011   2000011   # BR(HH -> Selectron2 selectron2)
     7.34133773E-09   2  -1000013   1000013   # BR(HH -> Smuon1 smuon1)
     1.34417658E-10   2  -2000013   1000013   # BR(HH -> Smuon2 smuon1)
     1.34417658E-10   2  -1000013   2000013   # BR(HH -> Smuon1 smuon2)
     1.11063030E-08   2  -2000013   2000013   # BR(HH -> Smuon2 smuon2)
     8.77201518E-06   2  -1000015   1000015   # BR(HH -> Stau1 stau1)
     1.06932014E-02   2  -2000015   1000015   # BR(HH -> Stau2 stau1)
     1.06932014E-02   2  -1000015   2000015   # BR(HH -> Stau1 stau2)
     6.61209730E-06   2  -2000015   2000015   # BR(HH -> Stau2 stau2)
DECAY        36     1.75265854E+02   # Gamma(A0)
     3.94378069E-10   2        22        22   # BR(A0 -> photon photon)
     5.39123283E-09   2        22        23   # BR(A0 -> photon Z)
     9.83727384E-06   2        21        21   # BR(A0 -> gluon gluon)
     7.22377904E-09   2       -11        11   # BR(A0 -> Electron electron)
     3.21657313E-04   2       -13        13   # BR(A0 -> Muon muon)
     1.02946578E-01   2       -15        15   # BR(A0 -> Tau tau)
     1.38404463E-14   2        -2         2   # BR(A0 -> Up up)
     2.68495127E-09   2        -4         4   # BR(A0 -> Charm charm)
     2.05650492E-04   2        -6         6   # BR(A0 -> Top top)
     6.09378323E-07   2        -1         1   # BR(A0 -> Down down)
     2.20420846E-04   2        -3         3   # BR(A0 -> Strange strange)
     6.06252085E-01   2        -5         5   # BR(A0 -> Bottom bottom)
     4.72904447E-03   2  -1000024   1000024   # BR(A0 -> Chargino1 chargino1)
     7.82612424E-02   2  -1000024   1000037   # BR(A0 -> Chargino1 chargino2)
     7.82612424E-02   2  -1000037   1000024   # BR(A0 -> Chargino2 chargino1)
     1.69344813E-04   2  -1000037   1000037   # BR(A0 -> Chargino2 chargino2)
     3.44770758E-03   2   1000022   1000022   # BR(A0 -> neutralino1 neutralino1)
     1.00448428E-02   2   1000022   1000023   # BR(A0 -> neutralino1 neutralino2)
     9.20720163E-03   2   1000022   1000025   # BR(A0 -> neutralino1 neutralino3)
     5.33165447E-03   2   1000022   1000035   # BR(A0 -> neutralino1 neutralino4)
     7.33441748E-05   2   1000023   1000023   # BR(A0 -> neutralino2 neutralino2)
     1.12542924E-03   2   1000023   1000025   # BR(A0 -> neutralino2 neutralino3)
     3.62636349E-02   2   1000023   1000035   # BR(A0 -> neutralino2 neutralino4)
     1.63171715E-03   2   1000025   1000025   # BR(A0 -> neutralino3 neutralino3)
     3.83078250E-02   2   1000025   1000035   # BR(A0 -> neutralino3 neutralino4)
     8.60793612E-05   2   1000035   1000035   # BR(A0 -> neutralino4 neutralino4)
     7.07631385E-08   2        23        25   # BR(A0 -> Z h0)
     1.12685153E-12   2        23        35   # BR(A0 -> Z HH)
     4.08140177E-40   2        25        25   # BR(A0 -> h0 h0)
     3.44437769E-15   2  -2000011   1000011   # BR(A0 -> Selectron2 selectron1)
     3.44437769E-15   2  -1000011   2000011   # BR(A0 -> Selectron1 selectron2)
     1.47257906E-10   2  -2000013   1000013   # BR(A0 -> Smuon2 smuon1)
     1.47257906E-10   2  -1000013   2000013   # BR(A0 -> Smuon1 smuon2)
     1.15513823E-02   2  -2000015   1000015   # BR(A0 -> Stau2 stau1)
     1.15513823E-02   2  -1000015   2000015   # BR(A0 -> Stau1 stau2)
DECAY        37     2.10182532E+02   # Gamma(Hp)
     9.45707574E-09   2       -11        12   # BR(Hp -> Electron nu_e)
     4.04319525E-04   2       -13        14   # BR(Hp -> Muon nu_mu)
     1.14364582E-01   2       -15        16   # BR(Hp -> Tau nu_tau)
     5.91352094E-07   2        -1         2   # BR(Hp -> Down up)
     1.00069591E-05   2        -3         2   # BR(Hp -> Strange up)
     6.80254506E-06   2        -5         2   # BR(Hp -> Bottom up)
     2.78121306E-08   2        -1         4   # BR(Hp -> Down charm)
     2.13127571E-04   2        -3         4   # BR(Hp -> Strange charm)
     9.52599817E-04   2        -5         4   # BR(Hp -> Bottom charm)
     1.39824153E-08   2        -1         6   # BR(Hp -> Down top)
     6.21958874E-07   2        -3         6   # BR(Hp -> Strange top)
     6.42398791E-01   2        -5         6   # BR(Hp -> Bottom top)
     1.95515693E-02   2   1000022   1000024   # BR(Hp -> neutralino1 chargino1)
     8.93213374E-03   2   1000022   1000037   # BR(Hp -> neutralino1 chargino2)
     2.76976591E-03   2   1000023   1000024   # BR(Hp -> neutralino2 chargino1)
     6.27889407E-02   2   1000023   1000037   # BR(Hp -> neutralino2 chargino2)
     5.18534170E-05   2   1000024   1000025   # BR(Hp -> chargino1 neutralino3)
     6.25238192E-02   2   1000025   1000037   # BR(Hp -> neutralino3 chargino2)
     6.57498204E-02   2   1000024   1000035   # BR(Hp -> chargino1 neutralino4)
     3.95519358E-09   2   1000035   1000037   # BR(Hp -> neutralino4 chargino2)
     5.90044675E-08   2        24        25   # BR(Hp -> W h0)
     3.84634111E-13   2        24        35   # BR(Hp -> W HH)
     5.01719332E-15   2  -1000011   1000012   # BR(Hp -> Selectron1 snu_e1)
     3.97795522E-08   2  -2000011   1000012   # BR(Hp -> Selectron2 snu_e1)
     2.14579744E-10   2  -1000013   1000014   # BR(Hp -> Smuon1 snu_mu1)
     3.95895940E-08   2  -2000013   1000014   # BR(Hp -> Smuon2 snu_mu1)
     1.92778008E-02   2  -1000015   1000016   # BR(Hp -> Stau1 snu_tau1)
     2.66038332E-06   2  -2000015   1000016   # BR(Hp -> Stau2 snu_tau1)
DECAY         6     2.43000000E+00   # top
#    BR                NDA      ID1      ID2
     1.00000000E+00    2           5        24   # BR(t -> b W)
Block HiggsBoundsInputHiggsCouplingsFermions
# ScalarNormEffCoupSq PseudoSNormEffCoupSq NP IP1 IP2 IP2
    1.00032702E+00    0.00000000E+00        3  25   5   5  # h0-b-b eff. coupling^2, normalised to SM
    3.20507557E+03    0.00000000E+00        3  35   5   5  # H0-b-b eff. coupling^2, normalised to SM
    0.00000000E+00    3.20507589E+03        3  36   5   5  # A0-b-b eff. coupling^2, normalised to SM
#
    9.99999898E-01    0.00000000E+00        3  25   6   6  # h0-t-t eff. coupling^2, normalised to SM
    3.12107123E-04    0.00000000E+00        3  35   6   6  # H0-t-t eff. coupling^2, normalised to SM
    0.00000000E+00    3.12005092E-04        3  36   6   6  # A0-t-t eff. coupling^2, normalised to SM
#
    1.00032702E+00    0.00000000E+00        3  25  15  15  # h0-tau-tau eff. coupling^2, normalised to SM
    3.20507557E+03    0.00000000E+00        3  35  15  15  # H0-tau-tau eff. coupling^2, normalised to SM
    0.00000000E+00    3.20507589E+03        3  36  15  15  # A0-tau-tau eff. coupling^2, normalised to SM
#
Block HiggsBoundsInputHiggsCouplingsBosons
    1.00000000E+00        3  25  24  24  # h0-W-W eff. coupling^2, normalised to SM
    8.34012422E-12        3  35  24  24  # H0-W-W eff. coupling^2, normalised to SM
    0.00000000E+00        3  36  24  24  # A0-W-W eff. coupling^2, normalised to SM
#
    1.00000000E+00        3  25  23  23  # h0-Z-Z eff. coupling^2, normalised to SM
    8.34012422E-12        3  35  23  23  # H0-Z-Z eff. coupling^2, normalised to SM
    0.00000000E+00        3  36  23  23  # A0-Z-Z eff. coupling^2, normalised to SM
#
    1.26424690E+00        3  25  21  21  # h0-g-g eff. coupling^2, normalised to SM
    1.57322199E-02        3  35  21  21  # H0-g-g eff. coupling^2, normalised to SM
    1.50515237E-01        3  36  21  21  # A0-g-g eff. coupling^2, normalised to SM
#
    0.00000000E+00        3  25  25  23  # h0-h0-Z eff. coupling^2, normalised to SM
    0.00000000E+00        3  35  25  23  # H0-h0-Z eff. coupling^2, normalised to SM
    8.34012422E-12        3  36  25  23  # A0-h0-Z eff. coupling^2, normalised to SM
    0.00000000E+00        3  35  35  23  # H0-H0-Z eff. coupling^2, normalised to SM
    1.00000000E+00        3  36  35  23  # A0-H0-Z eff. coupling^2, normalised to SM
    0.00000000E+00        3  36  36  23  # A0-A0-Z eff. coupling^2, normalised to SM
#
    0.00000000E+00        4  25  21  21  23  # h0-g-g-Z eff. coupling^2, normalised to SM
    0.00000000E+00        4  35  21  21  23  # H0-g-g-Z eff. coupling^2, normalised to SM
    0.00000000E+00        4  36  21  21  23  # A0-g-g-Z eff. coupling^2, normalised to SM
Block SPhenoLowEnergy  # low energy observables
    1    3.12776318E-04   # BR(b -> s gamma)
    2    1.59109553E-06   # BR(b -> s mu+ mu-)
    3    3.52471579E-05   # BR(b -> s nu nu)
    4    5.13414630E-15   # BR(Bd -> e+ e-)
    5    2.19308894E-10   # BR(Bd -> mu+ mu-)
    6    4.49944868E-08   # BR(Bd -> tau+ tau-)
    7    1.78035546E-13   # BR(Bs -> e+ e-)
    8    7.60510101E-09   # BR(Bs -> mu+ mu-)
    9    1.57997614E-06   # BR(Bs -> tau+ tau-)
   10    9.56662237E-05   # BR(B_u -> tau nu)
   11    9.88195465E-01   # BR(B_u -> tau nu)/BR(B_u -> tau nu)_SM
   12    5.41868455E-01   # |Delta(M_Bd)| [ps^-1] 
   13    1.93714770E+01   # |Delta(M_Bs)| [ps^-1] 
   14    0.00000000E+00   # neutron EDM according to the chiral quark model
   15    0.00000000E+00   # neutron EDM according to the relativistic quark-parton model
   16    2.15709196E-03   # epsilon_K
   17    2.28165733E-15   # Delta(M_K)
   18    2.47982274E-11   # BR(K^0 -> pi^0 nu nu)
   19    8.29000517E-11   # BR(K^+ -> pi^+ nu nu)
   20   -2.92498491E-14   # Delta(g-2)_electron/2
   21   -1.25934162E-09   # Delta(g-2)_muon/2
   22   -8.49154145E-08   # Delta(g-2)_tau/2
   23    0.00000000E+00   # electric dipole moment of the electron
   24    0.00000000E+00   # electric dipole moment of the muon
   25    0.00000000E+00   # electric dipole moment of the tau
   26    0.00000000E+00   # Br(mu -> e gamma)
   27    0.00000000E+00   # Br(tau -> e gamma)
   28    0.00000000E+00   # Br(tau -> mu gamma)
   29    0.00000000E+00   # Br(mu -> 3 e)
   30    0.00000000E+00   # Br(tau -> 3 e)
   31    0.00000000E+00   # Br(tau -> 3 mu)
   39    8.45104395E-05   # Delta(rho_parameter)
   40    0.00000000E+00   # BR(Z -> e mu)
   41    0.00000000E+00   # BR(Z -> e tau)
   42    0.00000000E+00   # BR(Z -> mu tau)
Block FWCOEF Q=  1.60000000E+02  # Wilson coefficients at scale Q
#    id        order  M        value         comment
     0305 4422   00   0    -1.88819110E-01   # C7
     0305 4422   00   2    -1.79447774E-01   # C7
     0305 4322   00   2    -1.18520097E-05   # C7'
     0305 6421   00   0    -9.52278348E-02   # C8
     0305 6421   00   2    -9.27961040E-02   # C8
     0305 6321   00   2    -6.27693370E-05   # C8'
 03051111 4133   00   0     1.62895033E+00   # C9 e+e-
 03051111 4133   00   2     1.62909480E+00   # C9 e+e-
 03051111 4233   00   2     7.60301858E-04   # C9' e+e-
 03051111 4137   00   0    -4.45164243E+00   # C10 e+e-
 03051111 4137   00   2    -4.44958581E+00   # C10 e+e-
 03051111 4237   00   2    -5.60904029E-03   # C10' e+e-
 03051313 4133   00   0     1.62895033E+00   # C9 mu+mu-
 03051313 4133   00   2     1.62909079E+00   # C9 mu+mu-
 03051313 4233   00   2     7.60299265E-04   # C9' mu+mu-
 03051313 4137   00   0    -4.45164243E+00   # C10 mu+mu-
 03051313 4137   00   2    -4.44958980E+00   # C10 mu+mu-
 03051313 4237   00   2    -5.60904569E-03   # C10' mu+mu-
 03051212 4137   00   0     1.50535012E+00   # C11 nu_1 nu_1
 03051212 4137   00   2     1.50492042E+00   # C11 nu_1 nu_1
 03051212 4237   00   2     1.21225262E-03   # C11' nu_1 nu_1
 03051414 4137   00   0     1.50535012E+00   # C11 nu_2 nu_2
 03051414 4137   00   2     1.50492042E+00   # C11 nu_2 nu_2
 03051414 4237   00   2     1.21225273E-03   # C11' nu_2 nu_2
 03051616 4137   00   0     1.50535012E+00   # C11 nu_3 nu_3
 03051616 4137   00   2     1.50492017E+00   # C11 nu_3 nu_3
 03051616 4237   00   2     1.21228582E-03   # C11' nu_3 nu_3
Block IMFWCOEF Q=  1.60000000E+02  # Im(Wilson coefficients) at scale Q
#    id        order  M        value         comment
     0305 4422   00   0     3.85827865E-07   # C7
     0305 4422   00   2    -1.68850234E-05   # C7
     0305 4322   00   2     1.44195429E-06   # C7'
     0305 6421   00   0     3.30487083E-07   # C8
     0305 6421   00   2     1.83153583E-05   # C8
     0305 6321   00   2     1.04497495E-06   # C8'
 03051111 4133   00   2    -6.10314063E-07   # C9 e+e-
 03051111 4233   00   2     1.45861800E-05   # C9' e+e-
 03051111 4137   00   2     2.85055212E-06   # C10 e+e-
 03051111 4237   00   2    -1.07611020E-04   # C10' e+e-
 03051313 4133   00   2    -6.10391184E-07   # C9 mu+mu-
 03051313 4233   00   2     1.45861432E-05   # C9' mu+mu-
 03051313 4137   00   2     2.85069914E-06   # C10 mu+mu-
 03051313 4237   00   2    -1.07611126E-04   # C10' mu+mu-
 03051212 4137   00   2    -3.49864915E-07   # C11 nu_1 nu_1
 03051212 4237   00   2     2.32574310E-05   # C11' nu_1 nu_1
 03051414 4137   00   2    -3.49866212E-07   # C11 nu_2 nu_2
 03051414 4237   00   2     2.32574310E-05   # C11' nu_2 nu_2
 03051616 4137   00   2    -3.55566189E-07   # C11 nu_3 nu_3
 03051616 4237   00   2     2.32574557E-05   # C11' nu_3 nu_3
