BLOCK SPINFO
   1   SPheno
   2   v4.0.5be

BLOCK SPHENOINFO
   1   2
   2   2

BLOCK MODSEL
   1   0

BLOCK MINPAR
   3    33.274962
   4    1

BLOCK EXTPAR
   0    1541.5324
   1   -91.385697
   2    778.71274
   3    3000
   11    2499.0005
   12   -1023.7445
   13   -1045.8626
   23    821.68216
   25    32.196725
   26    2748.3514
   31    135.55953
   32    135.55953
   33    546.30831
   34    1194.6252
   35    1194.6252
   36    1760.5386
   41    5000
   42    5000
   43    1926.3335
   44    5000
   45    5000
   46    1253.903
   47    5000
   48    5000
   49    1942.9413

BLOCK SMINPUTS
   1    127.90897
   2    1.1663787e-05
   3    0.1184
   4    91.1876
   5    4.18
   6    173.2
   7    1.777
   8    0
   11    0.00051099893
   12    0
   13    0.10565837
   14    0
   21    0.005
   22    0.0025
   23    0.095
   24    1.27

BLOCK GAUGE Q=  1541.5324
   1    0.35536298
   2    0.66519887
   3    1.219778

BLOCK YU Q=  1541.5324
   1   1    8.3884152e-06
   2   2    0.0042613149
   3   3    1.0133879

BLOCK YD Q=  1541.5324
   1   1    0.00054271505
   2   2    0.010311586
   3   3    0.53820327

BLOCK YE Q=  1541.5324
   1   1    9.4707745e-05
   2   2    0.019582558
   3   3    0.32934641

BLOCK AU Q=  1541.5324
   1   1    0
   2   2    0
   3   3    2499.0005

BLOCK AD Q=  1541.5324
   1   1    0
   2   2    0
   3   3   -1023.7445

BLOCK AE Q=  1541.5324
   1   1    0
   2   2    0
   3   3   -1045.8626

BLOCK MSOFT Q=  1541.5324
   1   -91.385697
   2    778.71274
   3    3000
   21    6887535.7
   22   -627653.78
   31    135.55953
   32    135.55953
   33    546.30831
   34    1194.6252
   35    1194.6252
   36    1760.5386
   41    5000
   42    5000
   43    1926.3335
   44    5000
   45    5000
   46    1253.903
   47    5000
   48    5000
   49    1942.9413

BLOCK MASS
   6    173.2
   23    91.1876
   24    80.429995
   15    1.777
   25    121.25822
   35    2747.4369
   36    2748.3514
   37    2749.161
   1000001    5029.4224
   2000001    5019.1608
   1000002    5028.9785
   2000002    5021.2734
   1000003    5029.4261
   2000003    5019.1636
   1000004    5028.981
   2000004    5021.2742
   1000005    1931.8619
   2000005    1979.2303
   1000006    1214.6367
   2000006    1956.4058
   1000011    186.57042
   2000011    1194.093
   1000012    168.57531
   1000013    186.55797
   2000013    1194.0912
   1000014    168.58506
   1000015    563.41962
   2000015    1758.8715
   1000016    558.52811
   1000021    3192.2456
   1000022   -91.019677
   1000023    763.89549
   1000025   -831.68718
   1000035    878.90541
   1000024    764.29468
   1000037    879.42817

BLOCK ALPHA
      -0.030157257

BLOCK HMIX Q=  1541.5324
   1    821.68216
   2    32.196725
   3    243.99312
   4    7553435.4

BLOCK STOPMIX
   1   1   -0.16209645
   1   2    0.98677492
   2   1   -0.98677492
   2   2   -0.16209645

BLOCK SBOTMIX
   1   1    0.95454335
   1   2    0.29807214
   2   1   -0.29807214
   2   2    0.95454335

BLOCK STAUMIX
   1   1    0.99983334
   1   2    0.018256011
   2   1   -0.018256011
   2   2    0.99983334

BLOCK NMIX
   1   1    0.99849951
   1   2    0.00022089739
   1   3    0.054577379
   1   4    0.0044703438
   2   1   -0.022877361
   2   2   -0.78481204
   2   3    0.45604123
   2   4   -0.41901442
   3   1    0.041700661
   3   2   -0.03312812
   3   3   -0.70484579
   3   4   -0.70735846
   4   1   -0.027136771
   4   2    0.61884775
   4   3    0.54059238
   4   4   -0.56925472

BLOCK UMIX
   1   1   -0.74414589
   1   2    0.66801714
   2   1    0.66801714
   2   2    0.74414589

BLOCK VMIX
   1   1   -0.78664259
   1   2    0.61740865
   2   1    0.61740865
   2   2    0.78664259

BLOCK HIGGSBOUNDSINPUTHIGGSCOUPLINGSFERMIONS
       0, 1036.6291,3,36,15,15

BLOCK HIGGSBOUNDSINPUTHIGGSCOUPLINGSBOSONS
       0,4,36,21,21,23

BLOCK SPHENOLOWENERGY
   1    0.00034300327
   2    1.5854428e-06
   3    3.5192529e-05
   4    2.9245729e-15
   5    1.2493492e-10
   6    2.6176853e-08
   7    9.8138941e-14
   8    4.1925087e-09
   9    8.9005198e-07
   10    9.5765895e-05
   11    0.98922503
   12    0.54353143
   13    19.416259
   14    0
   15    0
   16    0.0021655742
   17    2.2817432e-15
   18    2.4761676e-11
   19    8.2811265e-11
   20    2.1216222e-15
   21    8.955276e-11
   22    1.307182e-07
   23    0
   24    0
   25    0
   26    0
   27    0
   28    0
   29    0
   30    0
   31    0
   39    0.00015323045
   40    0
   41    0
   42    0

BLOCK FWCOEF Q=  160
   305   4422   0   0   -0.18881911
   305   4422   0   2   -0.21451881
   305   4322   0   2   -0.00026063233
   305   6421   0   0   -0.095227835
   305   6421   0   2   -0.11359196
   305   6321   0   2   -0.00024112366
   3051111   4133   0   0    1.5930741
   3051111   4133   0   2    1.593912
   3051111   4233   0   2    0.00011397639
   3051111   4137   0   0   -4.4157662
   3051111   4137   0   2   -4.4081921
   3051111   4237   0   2   -0.00088493533
   3051313   4133   0   0    1.5930741
   3051313   4133   0   2    1.5939061
   3051313   4233   0   2    0.00011397583
   3051313   4137   0   0   -4.4157662
   3051313   4137   0   2   -4.4081981
   3051313   4237   0   2   -0.00088493649
   3051212   4137   0   0    1.5053501
   3051212   4137   0   2    1.5037133
   3051212   4237   0   2    0.00019280016
   3051414   4137   0   0    1.5053501
   3051414   4137   0   2    1.5037133
   3051414   4237   0   2    0.0001928002
   3051616   4137   0   0    1.5053501
   3051616   4137   0   2    1.5037136
   3051616   4237   0   2    0.00019281278

BLOCK IMFWCOEF Q=  160
   305   4422   0   0    3.8575008e-07
   305   4422   0   2    1.6132722e-05
   305   4322   0   2   -2.1255952e-06
   305   6421   0   0    3.3042046e-07
   305   6421   0   2   -2.2587042e-06
   305   6321   0   2   -1.0286322e-06
   3051111   4133   0   2   -9.4875601e-07
   3051111   4233   0   2    2.571968e-06
   3051111   4137   0   2    5.7490131e-06
   3051111   4237   0   2   -1.9978964e-05
   3051313   4133   0   2   -9.4870647e-07
   3051313   4233   0   2    2.5719617e-06
   3051313   4137   0   2    5.749039e-06
   3051313   4237   0   2   -1.9978988e-05
   3051212   4137   0   2   -1.0122474e-06
   3051212   4237   0   2    4.3528628e-06
   3051414   4137   0   2   -1.0122498e-06
   3051414   4237   0   2    4.3528628e-06
   3051616   4137   0   2   -1.0064063e-06
   3051616   4237   0   2    4.3528838e-06

DECAY 23  2.4952


DECAY 24  2.085


DECAY 1000011  0.13578679
    0.99997704   2    1000022    11

DECAY 2000011  5.9173682
    0.99919055   2    1000022    11
    0.00046744079   2    1000025    11
    0.00018519763   2    1000023    11
    0.00015679059   2    1000035    11

DECAY 1000013  0.13576953
    0.99997717   2    1000022    13

DECAY 2000013  5.9243588
    0.99801447   2    1000022    13
    0.00066955078   2    1000025    13
    0.000350906   2    1000013    25
    0.00029663326   2    1000023    13
    0.00025103056   2    1000035    13
    0.0002391182   2   -1000024    14
    0.00017829488   2   -1000037    14

DECAY 1000015  0.67581726
    0.99999999   2    1000022    15

DECAY 2000015  15.076681
    0.58151282   2    1000022    15
    0.083666779   2   -1000037    16
    0.07633687   2    1000025    15
    0.067950094   2   -1000024    16
    0.058989336   2    1000016   -24
    0.044235401   2    1000035    15
    0.031703642   2    1000023    15
    0.029237193   2    1000015    23
    0.026367866   2    1000015    25

DECAY 1000012  0.10588096
    1   2    1000022    12

DECAY 1000014  0.10589715
    1   2    1000022    14

DECAY 1000016  0.66254401
    0.99961259   2    1000022    16
    0.0001937278   3    1000014    15   -13
    0.00019368069   3    1000012    15   -11

DECAY 2000001  143.28785
    0.98045945   2    1000021    1
    0.019484702   2    1000022    1

DECAY 1000001  205.22458
    0.6897608   2    1000021    1
    0.11401035   2   -1000024    2
    0.090474389   2   -1000037    2
    0.062752435   2    1000023    1
    0.039434579   2    1000035    1
    0.0033995561   2    1000022    1
    0.00016789949   2    1000025    1

DECAY 2000003  143.30817
    0.98032242   2    1000021    3
    0.01948217   2    1000022    3

DECAY 1000003  205.23677
    0.68972169   2    1000021    3
    0.11400676   2   -1000024    4
    0.090474361   2   -1000037    4
    0.062758996   2    1000023    3
    0.039446492   2    1000035    3
    0.0033995105   2    1000022    3
    0.0001921882   2    1000025    3

DECAY 1000005  72.552684
    0.35083504   2    1000006   -24
    0.233655   2   -1000037    6
    0.23350355   2   -1000024    6
    0.088020342   2    1000023    5
    0.048675386   2    1000025    5
    0.037982723   2    1000035    5
    0.0073279664   2    1000022    5

DECAY 2000005  22.789918
    0.37524475   2   -1000037    6
    0.17549061   2    1000025    5
    0.15789604   2    1000035    5
    0.12861914   2    1000006   -24
    0.096623198   2   -1000024    6
    0.03919744   2    1000022    5
    0.026928824   2    1000023    5

DECAY 2000002  151.91194
    0.92624546   2    1000021    2
    0.073545179   2    1000022    2
    0.00012141375   2    1000025    2

DECAY 1000002  205.21829
    0.6895568   2    1000021    2
    0.12739564   2    1000024    1
    0.07727988   2    1000037    1
    0.064064772   2    1000023    2
    0.038219209   2    1000035    2
    0.0034162943   2    1000022    2

DECAY 2000004  151.91539
    0.92622457   2    1000021    4
    0.07354351   2    1000022    4
    0.00012705724   2    1000025    4

DECAY 1000004  205.23028
    0.68951748   2    1000021    4
    0.12741023   2    1000024    3
    0.077302357   2    1000037    3
    0.064062484   2    1000023    4
    0.038219753   2    1000035    4
    0.0034160961   2    1000022    4

DECAY 1000006  15.536313
    0.2581837   2    1000037    5
    0.21121031   2    1000025    6
    0.16315196   2    1000024    5
    0.16140469   2    1000022    6
    0.12897948   2    1000035    6
    0.076487234   2    1000023    6
    0.00051119551   2    1000023    4

DECAY 2000006  83.653868
    0.20816567   2    1000006    25
    0.17652688   2    1000006    23
    0.16925248   2    1000024    5
    0.15345075   2    1000025    6
    0.11014218   2    1000035    6
    0.10912995   2    1000023    6
    0.069002751   2    1000037    5
    0.0043293243   2    1000022    6

DECAY 1000024  8.1891193
    0.23021656   2    1000014   -13
    0.23007215   2    1000012   -11
    0.20118055   2   -1000013    14
    0.20117715   2   -1000011    12
    0.065412314   2    1000016   -15
    0.048176658   2   -1000015    16
    0.023501965   2    1000022    24
    0.00026237151   3    1000022   -5    6

DECAY 1000037  8.1265641
    0.19385507   2   -1000013    14
    0.19385263   2   -1000011    12
    0.16867871   2    1000014   -13
    0.16847109   2    1000012   -11
    0.087129051   2    1000016   -15
    0.072372368   2   -1000015    16
    0.046273997   2    1000022    24
    0.045534316   2    1000023    24
    0.023045081   2    1000024    23
    0.00068166656   3    1000022   -5    6

DECAY 1000022 -1


DECAY 1000023  8.579869
    0.11013305   2    1000013   -13
    0.11013305   2   -1000013    13
    0.11006718   2    1000011   -11
    0.11006718   2   -1000011    11
    0.10584274   2    1000012   -12
    0.10584274   2   -1000012    12
    0.10584148   2    1000014   -14
    0.10584148   2   -1000014    14
    0.030607682   2    1000015   -15
    0.030607682   2   -1000015    15
    0.0253334   2    1000016   -16
    0.0253334   2   -1000016    16
    0.012245442   2    1000022    23
    0.012048549   2    1000022    25

DECAY 1000025  0.82923252
    0.34463811   2    1000022    25
    0.28589786   2    1000022    23
    0.15681429   2    1000015   -15
    0.15681429   2   -1000015    15
    0.0062305121   2    1000012   -12
    0.0062305121   2   -1000012    12
    0.0062304504   2    1000014   -14
    0.0062304504   2   -1000014    14
    0.0026537345   3    1000022    6   -6
    0.0025687937   3    1000024    1   -2
    0.0025687937   3   -1000024   -1    2
    0.0025661769   3    1000024    3   -4
    0.0025661769   3   -1000024   -3    4
    0.0020422907   2    1000016   -16
    0.0020422907   2   -1000016    16
    0.0019482786   2    1000013   -13
    0.0019482786   2   -1000013    13
    0.00085827006   3    1000023    12   -12
    0.00085598449   3    1000024    11   -12
    0.00085598449   3   -1000024   -11    12
    0.0008559829   3    1000024    13   -14
    0.0008559829   3   -1000024   -13    14
    0.00085407221   3    1000024    15   -16
    0.00085407221   3   -1000024   -15    16
    0.00064261512   3    1000023    1   -1
    0.00064260575   3    1000023    3   -3
    0.00062436802   3    1000023    5   -5
    0.00050119884   3    1000023    2   -2
    0.00049945319   3    1000023    4   -4
    0.00023442498   2    1000011   -11
    0.00023442498   2   -1000011    11
    0.00016077336   2    1000023    22
    0.00014505794   3    1000023    11   -11
    0.00014505396   3    1000023    13   -13
    0.00014319888   3    1000023    15   -15

DECAY 1000035  7.619399
    0.094475441   2    1000012   -12
    0.094475441   2   -1000012    12
    0.094474607   2    1000014   -14
    0.094474607   2   -1000014    14
    0.084668744   2    1000013   -13
    0.084668744   2   -1000013    13
    0.084552005   2    1000011   -11
    0.084552005   2   -1000011    11
    0.043738578   2    1000015   -15
    0.043738578   2   -1000015    15
    0.036191404   2    1000016   -16
    0.036191404   2   -1000016    16
    0.032024124   2    1000024   -24
    0.032024124   2   -1000024    24
    0.030338192   2    1000022    23
    0.029075457   2    1000022    25
    0.00021117675   3    1000022    6   -6

DECAY 1000021  180.67467
    0.19875846   2    1000006   -6
    0.19875846   2   -1000006    6
    0.10478372   2    1000005   -5
    0.10478372   2   -1000005    5
    0.099331201   2    2000005   -5
    0.099331201   2   -2000005    5
    0.095753399   2    2000006   -6
    0.095753399   2   -2000006    6
    0.0012494656   2    1000006   -4
    0.0012494656   2   -1000006    4

DECAY 25  0.0034473224
    0.6280927   2   -5    5
    0.17079802   2   -24    24
    0.074683178   2    21    21
    0.072244316   2   -15    15
    0.031078096   2   -4    4
    0.019173376   2    23    23
    0.0022683644   2    22    22
    0.0011741195   2    22    23
    0.00025015935   2   -13    13
    0.00023684965   2   -3    3
    6.5486692e-07   2   -1    1
    1.6016497e-07   2   -2    2
    5.6239392e-09   2   -11    11

DECAY 35  58.227404
    0.41968564   2   -5    5
    0.12483348   2   -15    15
    0.08821748   2   -1000024    1000037
    0.08821748   2   -1000037    1000024
    0.055559795   2   -1000024    1000024
    0.050102865   2    1000023    1000025
    0.031972617   2    1000025    1000035
    0.031923989   2   -1000037    1000037
    0.025847151   2    1000023    1000023
    0.02311202   2    1000022    1000025
    0.018827495   2    1000035    1000035
    0.011793253   2    1000022    1000023
    0.010900301   2    1000022    1000035
    0.0058774876   2   -1000006    1000006
    0.0039915225   2    1000023    1000035
    0.0035036894   2   -2000015    1000015
    0.0035036894   2   -1000015    2000015
    0.00078713029   2   -6    6
    0.00047067913   2   -13    13
    0.00032574969   2    1000025    1000025
    0.00030625677   2    1000022    1000022
    0.00020716848   2   -3    3
    1.4969703e-05   2    25    25
    9.1140134e-06   2   -1000015    1000015
    5.0025716e-06   2    21    21
    9.7533217e-07   2    23    23
    5.7279387e-07   2   -1    1
    3.311942e-07   2   -24    24
    1.8609106e-07   2    22    23
    1.513242e-07   2   -1000011    1000011
    1.5012536e-07   2   -1000013    1000013
    4.8508925e-08   2   -2000011    2000011
    4.8341197e-08   2   -2000013    2000013
    1.943288e-08   2    22    22
    1.7351163e-08   2   -4    4
    1.2156985e-08   2   -2000013    1000013
    1.2156985e-08   2   -1000013    2000013
    1.0571474e-08   2   -11    11
    2.843578e-13   2   -2000011    1000011
    2.843578e-13   2   -1000011    2000011
    8.9450126e-14   2   -2    2

DECAY 36  56.481421
    0.41341221   2   -5    5
    0.12297008   2   -15    15
    0.089558195   2   -1000024    1000024
    0.06267898   2   -1000037    1000037
    0.059959659   2   -1000024    1000037
    0.059959659   2   -1000037    1000024
    0.041863922   2    1000023    1000023
    0.036447694   2    1000035    1000035
    0.03067517   2    1000023    1000025
    0.022050357   2    1000022    1000025
    0.018515184   2    1000025    1000035
    0.012809748   2    1000022    1000023
    0.012369684   2    1000022    1000035
    0.0072205919   2    1000023    1000035
    0.0036194684   2   -2000015    1000015
    0.0036194684   2   -1000015    2000015
    0.00080843201   2   -6    6
    0.00046552957   2    1000025    1000025
    0.00046363983   2   -13    13
    0.00031414114   2    1000022    1000022
    0.00020406491   2   -3    3
    1.1640688e-05   2    21    21
    1.5442971e-06   2    23    25
    5.642136e-07   2   -1    1
    2.1006489e-07   2    22    23
    1.1601779e-07   2    22    22
    1.7317948e-08   2   -4    4
    1.240489e-08   2   -2000013    1000013
    1.240489e-08   2   -1000013    2000013
    1.0413343e-08   2   -11    11
    2.9015153e-13   2   -2000011    1000011
    2.9015153e-13   2   -1000011    2000011
    8.9285797e-14   2   -2    2
    3.8242693e-37   2    25    25

DECAY 37  55.610957
    0.42048833   2   -5    6
    0.14455865   2    1000023    1000037
    0.1309141   2    1000024    1000035
    0.10946369   2   -15    16
    0.09128351   2    1000024    1000025
    0.045341419   2    1000025    1000037
    0.025152541   2    1000022    1000024
    0.024021525   2    1000022    1000037
    0.0073832839   2   -2000015    1000016
    0.00062123022   2   -5    4
    0.00038699327   2   -13    14
    0.00019920564   2   -3    4
    0.00012459279   2    1000035    1000037
    3.3667636e-05   2    1000023    1000024
    9.3199515e-06   2   -3    2
    7.1374012e-06   2   -1000015    1000016
    4.4362251e-06   2   -5    2
    2.820058e-06   2   -3    6
    1.5710279e-06   2    24    25
    6.2084922e-07   2   -1000011    1000012
    6.1908982e-07   2   -1000013    1000014
    5.5282278e-07   2   -1    2
    1.1584555e-07   2   -1    6
    2.6851445e-08   2   -1    4
    2.5697668e-08   2   -2000013    1000014
    9.0518129e-09   2   -11    12
    6.0108475e-13   2   -2000011    1000012
    3.7284682e-13   2    24    35

DECAY 6  2.43
    1   2    5    24

DECAY 15 -1
