BLOCK DCINFO
   1   SDECAY/HDECAY
   2   1.3b /3.4

BLOCK SPINFO
   1   SOFTSUSY
   2   3.4.0

BLOCK MODSEL
   1   0

BLOCK SMINPUTS
   1    127.90897
   2    1.1663787e-05
   3    0.1184
   4    91.1876
   5    4.18
   6    173.2
   7    1.777

BLOCK MINPAR
   3    39.49

BLOCK EXTPAR
   0   -1
   1   -795.45
   2    1294.01
   3    2036.4
   11    2392.06
   12   -914.88
   13    1782.94
   23   -1100.85
   26    1628.32
   31    984.89
   32    984.89
   33    2047.8
   34    3103.15
   35    3103.15
   36    2119.77
   41    3363.03
   42    3363.03
   43    2174.55
   44    3434.2
   45    3434.2
   46    3369.6
   47    2250.36
   48    2250.36
   49    3637.76

BLOCK MASS
   24    80.39198
   25    124.13308
   35    1628.3436
   36    1628.32
   37    1630.2481
   5    4.8187603
   1000001    3421.0994
   2000001    2330.4888
   1000002    3420.3105
   2000002    3485.413
   1000003    3421.0994
   2000003    2330.4888
   1000004    3420.3105
   2000004    3485.413
   1000005    2240.1619
   2000005    3666.2947
   1000006    2241.2785
   2000006    3377.8351
   1000011    1008.7509
   2000011    3105.5838
   1000012    1005.3308
   1000013    1008.7509
   2000013    3105.5838
   1000014    1005.3308
   1000015    2048.3532
   2000015    2116.7137
   1000016    2052.0617
   1000021    2261.7925
   1000022   -787.3837
   1000023    1127.8738
   1000025   -1145.9893
   1000035    1339.5034
   1000024    1128.9303
   1000037    1339.7386

BLOCK NMIX
   1   1    0.99586238
   1   2    0.0020480791
   1   3   -0.074267715
   1   4    0.05232805
   2   1    0.015058291
   2   2    0.26368007
   2   3    0.68651455
   2   4    0.67745394
   3   1   -0.089524851
   3   2    0.023165515
   3   3   -0.70288884
   3   4    0.70526303
   4   1   -0.0040818885
   4   2    0.96432981
   4   3   -0.17067326
   4   4   -0.20229185

BLOCK UMIX
   1   1    0.2409386
   1   2    0.97054036
   2   1   -0.97054036
   2   2    0.2409386

BLOCK VMIX
   1   1    0.28577538
   1   2   -0.95829663
   2   1   -0.95829663
   2   2   -0.28577538

BLOCK STOPMIX
   1   1    0.99887344
   1   2   -0.047453629
   2   1    0.047453629
   2   2    0.99887344

BLOCK SBOTMIX
   1   1    0.99991823
   1   2   -0.01278778
   2   1    0.01278778
   2   2    0.99991823

BLOCK STAUMIX
   1   1    0.95946775
   1   2   -0.28181845
   2   1    0.28181845
   2   2    0.95946775

BLOCK ALPHA
      -0.026027043

BLOCK HMIX Q=  2709.092
   1   -1130.8432
   2    38.666342
   3    242.60352
   4    2160485.3

BLOCK GAUGE Q=  2709.092
   1    0.36454312
   2    0.63787732
   3    1.0172218

BLOCK AU Q=  2709.092
   1   1    0
   2   2    0
   3   3    2392.06

BLOCK AD Q=  2709.092
   1   1    0
   2   2    0
   3   3   -914.87999

BLOCK AE Q=  2709.092
   1   1    0
   2   2    0
   3   3    1782.94

BLOCK YU Q=  2709.092
   1   1    0
   2   2    0
   3   3    0.83454615

BLOCK YD Q=  2709.092
   1   1    0
   2   2    0
   3   3    0.58048559

BLOCK YE Q=  2709.092
   1   1    0
   2   2    0
   3   3    0.37602023

BLOCK MSOFT Q=  2709.092
   1   -795.45
   2    1294.01
   3    2036.4
   21    1440564
   22   -1163745.7
   31    984.89
   32    984.89
   33    2047.8
   34    3103.15
   35    3103.15
   36    2119.77
   41    3363.03
   42    3363.03
   43    2174.55
   44    3434.2
   45    3434.2
   46    3369.6
   47    2250.36
   48    2250.36
   49    3637.76

BLOCK HIGGSBOUNDSINPUTHIGGSCOUPLINGSFERMIONS
       0, 1495.086,3,36,15,15

BLOCK HIGGSBOUNDSINPUTHIGGSCOUPLINGSBOSONS
       0,4,36,21,21,23

DECAY 6  1.432905
    1   2    5    24

DECAY 1000021  0.018852951
    0.5   2    1000005   -5
    0.5   2   -1000005    5

DECAY 1000006  36.468619
    0.2301133   2    1000024    5
    0.22269823   2    1000025    6
    0.21140593   2    1000023    6
    0.20482391   2    1000037    5
    0.12048529   2    1000035    6
    0.010473341   2    1000022    6

DECAY 2000006  157.30433
    0.35668285   2    1000021    6
    0.22005293   2    1000024    5
    0.11694453   2    1000025    6
    0.10884655   2    1000023    6
    0.060250893   2    1000005    24
    0.044408566   2    1000022    6
    0.042084331   2    1000006    25
    0.030854362   2    1000006    23
    0.013293077   2    1000037    5
    0.0065819112   2    1000035    6

DECAY 1000005  36.400306
    0.42561729   2   -1000024    6
    0.23577126   2   -1000037    6
    0.11878936   2    1000023    5
    0.11110866   2    1000025    5
    0.099970911   2    1000035    5
    0.0087425266   2    1000022    5

DECAY 2000005  121.73322
    0.63436346   2    1000021    5
    0.15410257   2   -1000024    6
    0.081502195   2    1000025    5
    0.077422052   2    1000023    5
    0.016819619   2    1000022    5
    0.010110171   2    1000006   -24
    0.0097840759   2   -1000037    6
    0.0057438869   2    1000005    25
    0.0052249194   2    1000005    23
    0.0049267702   2    1000035    5
    2.8560663e-07   2    2000006   -24

DECAY 1000002  106.39155
    0.72419407   2    1000021    2
    0.16497436   2    1000037    1
    0.083404935   2    1000035    2
    0.016235715   2    1000024    1
    0.0070654715   2    1000023    2
    0.0041217619   2    1000022    2
    3.6850456e-06   2    1000025    2

DECAY 2000002  90.17764
    0.92146801   2    1000021    2
    0.077957623   2    1000022    2
    0.00055742106   2    1000025    2
    1.5889362e-05   2    1000023    2
    1.0592394e-06   2    1000035    2

DECAY 1000001  106.42275
    0.72466786   2    1000021    1
    0.16923521   2   -1000037    2
    0.083683431   2    1000035    1
    0.011541393   2   -1000024    2
    0.0067649602   2    1000023    1
    0.0039475297   2    1000022    1
    0.00015962266   2    1000025    1

DECAY 2000001  1.5881724
    0.64383486   2    1000022    1
    0.35222418   2    1000021    1
    0.003824388   2    1000025    1
    0.00011035147   2    1000023    1
    6.2192156e-06   2    1000035    1

DECAY 1000004  89.918505
    0.66116168   2    1000021    4
    0.20265018   2    1000037    3
    0.10245251   2    1000035    4
    0.019965516   2    1000024    3
    0.0086886502   2    1000023    4
    0.0050769283   2    1000022    4
    4.5312179e-06   2    1000025    4

DECAY 2000004  71.486176
    0.89691635   2    1000021    4
    0.10233094   2    1000022    4
    0.00073050048   2    1000025    4
    2.0824789e-05   2    1000023    4
    1.3868044e-06   2    1000035    4

DECAY 1000003  89.930762
    0.66169899   2    1000021    3
    0.2079159   2   -1000037    4
    0.10281043   2    1000035    3
    0.014194937   2   -1000024    4
    0.0083203748   2    1000023    3
    0.0048630595   2    1000022    3
    0.00019630581   2    1000025    3

DECAY 2000003  1.503698
    0.70863098   2    1000022    3
    0.28704597   2    1000021    3
    0.0041951716   2    1000025    3
    0.00012107637   2    1000023    3
    6.8030057e-06   2    1000035    3

DECAY 1000011  0.20336172
    1   2    1000022    11

DECAY 2000011  14.360234
    0.99295308   2    1000022    11
    0.0068388899   2    1000025    11
    0.0001954041   2    1000023    11
    1.2623229e-05   2    1000035    11

DECAY 1000013  0.20336169
    1   2    1000022    13

DECAY 2000013  14.360234
    0.99295308   2    1000022    13
    0.0068388899   2    1000025    13
    0.0001954041   2    1000023    13
    1.2623229e-05   2    1000035    13

DECAY 1000015  13.452174
    0.3205195   2   -1000037    16
    0.19085124   2    1000022    15
    0.16097655   2    1000035    15
    0.14225864   2    1000023    15
    0.093388635   2    1000025    15
    0.09200543   2   -1000024    16

DECAY 2000015  13.965733
    0.54793584   2    1000022    15
    0.14535322   2   -1000024    16
    0.11555853   2    1000025    15
    0.080070828   2    1000023    15
    0.074020393   2   -1000037    16
    0.037061193   2    1000035    15

DECAY 1000012  0.19555227
    1   2    1000022    12

DECAY 1000014  0.19555227
    1   2    1000022    14

DECAY 1000016  13.219744
    0.38798158   2    1000037    15
    0.25017709   2    1000024    15
    0.19336201   2    1000035    16
    0.14692577   2    1000022    16
    0.019909985   2    1000023    16
    0.0016435647   2    1000025    16

DECAY 1000024  0.4876458
    0.89023071   2    1000022    24
    0.032782852   2    1000012   -11
    0.032782852   2    1000014   -13
    0.022101794   2   -1000011    12
    0.022101794   2   -1000013    14

DECAY 1000037  7.3361613
    0.13217694   2    1000023    24
    0.13057906   2   -1000011    12
    0.13057906   2   -1000013    14
    0.12957148   2    1000012   -11
    0.12957148   2    1000014   -13
    0.12335089   2    1000024    23
    0.10427046   2    1000025    24
    0.10371842   2    1000024    25
    0.016182193   2    1000022    24

DECAY 1000022 -1


DECAY 1000023  0.48173078
    0.86855609   2    1000022    23
    0.023124   2    1000022    25
    0.014062282   2    1000011   -11
    0.014062282   2   -1000011    11
    0.014062282   2    1000013   -13
    0.014062282   2   -1000013    13
    0.013017697   2    1000012   -12
    0.013017697   2   -1000012    12
    0.013017697   2    1000014   -14
    0.013017697   2   -1000014    14

DECAY 1000025  0.55725506
    0.96177619   2    1000022    25
    0.032679518   2    1000022    23
    0.0012206768   2    1000012   -12
    0.0012206768   2   -1000012    12
    0.0012206768   2    1000014   -14
    0.0012206768   2   -1000014    14
    0.00016539626   2    1000011   -11
    0.00016539626   2   -1000011    11
    0.00016539626   2    1000013   -13
    0.00016539626   2   -1000013    13

DECAY 1000035  7.2851985
    0.12947164   2    1000024   -24
    0.12947164   2   -1000024    24
    0.10211953   2    1000023    25
    0.097301842   2    1000025    23
    0.066311264   2    1000012   -12
    0.066311264   2   -1000012    12
    0.066311264   2    1000014   -14
    0.066311264   2   -1000014    14
    0.064523158   2    1000011   -11
    0.064523158   2   -1000011    11
    0.064523158   2    1000013   -13
    0.064523158   2   -1000013    13
    0.015542151   2    1000022    23
    0.0012805237   2    1000023    23
    0.0010351592   2    1000022    25
    0.00043981443   2    1000025    25

DECAY 25  0.0037082429
    0.58611685   2    5   -5
    0.20602183   2    24   -24
    0.08445607   2    21    21
    0.070244317   2   -15    15
    0.025360588   2    23    23
    0.023257844   2    4   -4
    0.0024642328   2    22    22
    0.0015574666   2    22    23
    0.0002720761   2    3   -3
    0.00024873137   2   -13    13

DECAY 35  44.300966
    0.87486973   2    5   -5
    0.1232151   2   -15    15
    0.0010612574   2    6   -6
    0.00045857828   2   -13    13
    0.0003512229   2    3   -3
    3.0594741e-05   2    21    21
    7.6921792e-06   2    1000022    1000022
    4.4457215e-06   2    25    25
    9.0085145e-07   2    24   -24
    4.4804034e-07   2    23    23
    1.3861812e-08   2    23    22
    1.1122568e-08   2    4   -4
    8.7724496e-10   2    22    22

DECAY 36  44.308673
    0.8747334   2    5   -5
    0.12319352   2   -15    15
    0.0010818465   2    6   -6
    0.00045849569   2   -13    13
    0.00035117685   2    3   -3
    0.00012781865   2    1000022    1000022
    5.2745851e-05   2    21    21
    9.0492022e-07   2    23    25
    5.0303646e-08   2    22    22
    2.8095722e-08   2    23    22
    1.1076077e-08   2    4   -4

DECAY 37  47.032023
    0.88152297   2    6   -5
    0.11619753   2   -15    16
    0.0014893861   2    4   -5
    0.00043245836   2   -13    14
    0.00032537057   2    4   -3
    1.6530009e-05   2    2   -3
    1.4893805e-05   2    2   -5
    8.5743648e-07   2    24    25
    7.4475019e-13   2    24    36

DECAY 5 -1


DECAY 15 -1


DECAY 23  2.4952


DECAY 24  2.085
