BLOCK SPINFO
   1   SPheno
   2   v4.0.5be

BLOCK SPHENOINFO
   1   2
   2   2

BLOCK MODSEL
   1   0

BLOCK MINPAR
   3    11.368162
   4    1

BLOCK EXTPAR
   0    3712.9109
   1   -1236.4984
   2    3974.9965
   3    3209.2111
   11   -7840.575
   12    480.68841
   13    969.40838
   23    4508.9771
   25    10.829249
   26    4550.7989
   31    3568.7444
   32    3568.7444
   33    1934.7962
   34    2112.6711
   35    2112.6711
   36    4959.6307
   41    2783.4837
   42    2783.4837
   43    2716.1437
   44    2029.1666
   45    2029.1666
   46    4849.7716
   47    3815.564
   48    3815.564
   49    3421.2501

BLOCK SMINPUTS
   1    127.90897
   2    1.1663787e-05
   3    0.1184
   4    91.1876
   5    4.18
   6    173.2
   7    1.777
   8    0
   11    0.00051099893
   12    0
   13    0.10565837
   14    0
   21    0.005
   22    0.0025
   23    0.095
   24    1.27

BLOCK GAUGE Q=  3712.9109
   1    0.35536298
   2    0.66519887
   3    1.219778

BLOCK YU Q=  3712.9109
   1   1    8.4200436e-06
   2   2    0.0042773821
   3   3    1.0172089

BLOCK YD Q=  3712.9109
   1   1    0.00018322846
   2   2    0.0034813408
   3   3    0.18170522

BLOCK YE Q=  3712.9109
   1   1    3.1974706e-05
   2   2    0.0066113552
   3   3    0.11119212

BLOCK AU Q=  3712.9109
   1   1    0
   2   2    0
   3   3   -7840.5752

BLOCK AD Q=  3712.9109
   1   1    0
   2   2    0
   3   3    480.68837

BLOCK AE Q=  3712.9109
   1   1    0
   2   2    0
   3   3    969.40839

BLOCK MSOFT Q=  3712.9109
   1   -1236.4984
   2    3974.9965
   3    3209.2111
   21   -66832.952
   22   -20047645
   31    3568.7444
   32    3568.7444
   33    1934.7962
   34    2112.6711
   35    2112.6711
   36    4959.6307
   41    2783.4837
   42    2783.4837
   43    2716.1437
   44    2029.1666
   45    2029.1666
   46    4849.7716
   47    3815.564
   48    3815.564
   49    3421.2501

BLOCK MASS
   6    173.2
   23    91.1876
   24    80.429995
   15    1.777
   25    125.2695
   35    4550.7584
   36    4550.7989
   37    4551.7708
   1000001    2967.1542
   2000001    3922.5629
   1000002    2966.1489
   2000002    2203.5744
   1000003    2967.154
   2000003    3922.5624
   1000004    2966.1488
   2000004    2203.5748
   1000005    2883.0294
   2000005    3541.271
   1000006    2870.4347
   2000006    4802.6548
   1000011    3600.0597
   2000011    2117.7004
   1000012    3598.8033
   1000013    3600.0578
   2000013    2117.6959
   1000014    3598.8008
   1000015    1976.4432
   2000015    4963.3065
   1000016    1974.6242
   1000021    3395.5948
   1000022   -1225.6746
   1000023    3925.3271
   1000025   -4493.9325
   1000035    4499.8944
   1000024    3925.3956
   1000037    4500.3371

BLOCK ALPHA
      -0.087839451

BLOCK HMIX Q=  3712.9109
   1    4508.9771
   2    10.829249
   3    243.01912
   4    20709771

BLOCK STOPMIX
   1   1    0.99701149
   1   2    0.077253406
   2   1   -0.077253406
   2   2    0.99701149

BLOCK SBOTMIX
   1   1    0.99973813
   1   2    0.022883758
   2   1   -0.022883758
   2   2    0.99973813

BLOCK STAUMIX
   1   1    0.99999148
   1   2    0.0041288046
   2   1   -0.0041288046
   2   2    0.99999148

BLOCK NMIX
   1   1    0.99994649
   1   2    9.0898798e-06
   1   3    0.010189782
   1   4    0.0017853827
   2   1    0.00067040345
   2   2    0.99434963
   2   3   -0.079082404
   2   4    0.070811936
   3   1   -0.0084672738
   3   2    0.0058777021
   3   3    0.70700932
   3   4    0.70712911
   4   1   -0.0059055208
   4   2    0.10599179
   4   3    0.70269479
   4   4   -0.70352747

BLOCK UMIX
   1   1   -0.99389719
   1   2    0.11031034
   2   1    0.11031034
   2   2    0.99389719

BLOCK VMIX
   1   1   -0.99513104
   1   2    0.098560734
   2   1    0.098560734
   2   2    0.99513104

BLOCK HIGGSBOUNDSINPUTHIGGSCOUPLINGSFERMIONS
       0, 117.27264,3,36,15,15

BLOCK HIGGSBOUNDSINPUTHIGGSCOUPLINGSBOSONS
       0,4,36,21,21,23

BLOCK SPHENOLOWENERGY
   1    0.00032069993
   2    1.591311e-06
   3    3.5276847e-05
   4    2.4052701e-15
   5    1.0275038e-10
   6    2.1508406e-08
   7    8.0612645e-14
   8    3.4437689e-09
   9    7.304101e-07
   10    9.6776021e-05
   11    0.99965925
   12    0.5417248
   13    19.356086
   14    0
   15    0
   16    0.0021563569
   17    2.2816484e-15
   18    2.4816436e-11
   19    8.2943402e-11
   20    1.0216136e-16
   21    4.3676385e-12
   22    1.6121929e-09
   23    0
   24    0
   25    0
   26    0
   27    0
   28    0
   29    0
   30    0
   31    0
   39   -2.746674e-05
   40    0
   41    0
   42    0

BLOCK FWCOEF Q=  160
   305   4422   0   0   -0.18881911
   305   4422   0   2   -0.18882071
   305   4322   0   2   -1.3485709e-06
   305   6421   0   0   -0.095227835
   305   6421   0   2   -0.098370255
   305   6321   0   2   -6.2077342e-05
   3051111   4133   0   0    1.6236355
   3051111   4133   0   2    1.6238761
   3051111   4233   0   2    3.5750541e-05
   3051111   4137   0   0   -4.4463276
   3051111   4137   0   2   -4.4470555
   3051111   4237   0   2   -0.00026580053
   3051313   4133   0   0    1.6236355
   3051313   4133   0   2    1.623876
   3051313   4233   0   2    3.5750539e-05
   3051313   4137   0   0   -4.4463276
   3051313   4137   0   2   -4.4470555
   3051313   4237   0   2   -0.00026580054
   3051212   4137   0   0    1.5053501
   3051212   4137   0   2    1.5055084
   3051212   4237   0   2    5.7515411e-05
   3051414   4137   0   0    1.5053501
   3051414   4137   0   2    1.5055084
   3051414   4237   0   2    5.7515411e-05
   3051616   4137   0   0    1.5053501
   3051616   4137   0   2    1.505508
   3051616   4237   0   2    5.7515432e-05

BLOCK IMFWCOEF Q=  160
   305   4422   0   0    3.8585765e-07
   305   4422   0   2    8.7443676e-06
   305   4322   0   2    1.1348643e-06
   305   6421   0   0    3.3051259e-07
   305   6421   0   2   -1.1605938e-05
   305   6321   0   2    4.4680542e-07
   3051111   4133   0   2    2.9296799e-07
   3051111   4233   0   2    6.6861847e-07
   3051111   4137   0   2    1.4558103e-06
   3051111   4237   0   2   -4.9711708e-06
   3051313   4133   0   2    2.9296769e-07
   3051313   4233   0   2    6.6861844e-07
   3051313   4137   0   2    1.45581e-06
   3051313   4237   0   2   -4.9711709e-06
   3051212   4137   0   2   -3.0086939e-07
   3051212   4237   0   2    1.07569e-06
   3051414   4137   0   2   -3.008694e-07
   3051414   4237   0   2    1.07569e-06
   3051616   4137   0   2   -3.078974e-07
   3051616   4237   0   2    1.0756899e-06

DECAY 23  2.4952


DECAY 24  2.085


DECAY 2000011  4.7053231
    1   2    1000022    11

DECAY 1000011  3.5343766
    0.99999999   2    1000022    11

DECAY 2000013  4.7052931
    1   2    1000022    13

DECAY 1000013  3.5359614
    0.99955108   2    1000022    13
    0.00044891608   2    2000013    25

DECAY 1000015  0.94039867
    1   2    1000022    15

DECAY 2000015  23.737291
    0.92626814   2    1000022    15
    0.035582864   2    1000016   -24
    0.017766072   2    1000015    23
    0.017037931   2    1000015    25
    0.0016158774   2   -1000037    16
    0.00083795703   2    1000025    15
    0.00081055565   2    1000035    15

DECAY 1000012  3.5337527
    0.99957637   2    1000022    12
    0.00042362627   3    1000016    11   -15

DECAY 1000014  3.533749
    0.99957638   2    1000022    14
    0.00042362263   3    1000016    13   -15

DECAY 1000016  0.93716506
    1   2    1000022    16

DECAY 1000001  0.28480123
    1   2    1000022    1

DECAY 2000001  21.233137
    0.91602794   2    1000021    1
    0.083972031   2    1000022    1

DECAY 1000003  0.28480122
    1   2    1000022    3

DECAY 2000003  21.233364
    0.9160165   2    1000021    3
    0.083971118   2    1000022    3

DECAY 1000005  0.27134229
    1   2    1000022    5

DECAY 2000005  4.8646502
    0.37244188   2    1000021    5
    0.31451689   2    1000022    5
    0.12762284   2    1000006   -24
    0.12489631   2    1000005    25
    0.060522086   2    1000005    23

DECAY 2000002  2.3468163
    1   2    1000022    2

DECAY 1000002  0.28468343
    1   2    1000022    2

DECAY 2000004  2.3468136
    1   2    1000022    4

DECAY 1000004  0.28468746
    0.9999851   2    1000022    4

DECAY 1000006  0.33266227
    0.88907285   2    1000022    6
    0.11038094   3    1000022    24    5
    0.00039182719   3   -1000015    16    5
    0.00015438685   3    1000016   -15    5

DECAY 2000006  371.31203
    0.31598964   2    1000005    24
    0.24871082   2    1000021    6
    0.24325184   2    1000006    25
    0.15934029   2    1000006    23
    0.025028461   2    1000022    6
    0.0039377568   2    1000037    5
    0.0018211667   2    1000025    6
    0.0017542543   2    1000035    6

DECAY 1000024  81.476669
    0.14275294   2   -1000005    6
    0.13893084   2    1000006   -5
    0.11721099   2    1000016   -15
    0.11674514   2   -1000015    16
    0.11595659   2    1000004   -3
    0.11595652   2    1000002   -1
    0.11546075   2   -1000003    4
    0.1154605   2   -1000001    2
    0.0053409643   2    1000014   -13
    0.0053408763   2    1000012   -11
    0.0052885529   2   -1000013    14
    0.0052884953   2   -1000011    12
    0.00023595366   2    1000022    24

DECAY 1000037  67.017955
    0.70156029   2   -1000005    6
    0.068166039   2    1000024    25
    0.065965683   2    1000024    23
    0.064565842   2    1000023    24
    0.038835896   2    1000022    24
    0.022985555   2    1000006   -5
    0.0091919551   2   -2000005    6
    0.0071851278   2    1000016   -15
    0.0034592085   2   -1000003    4
    0.0034480054   2   -1000001    2
    0.0032244315   3    1000022   -5    6
    0.0027631237   2    1000004   -3
    0.0027554918   2    1000002   -1
    0.0023138988   2   -1000015    16
    0.001048406   3    1000023   -5    6
    0.00067077611   3    1000024    6   -6
    0.00046631158   2   -1000013    14
    0.00046630988   2   -1000011    12
    0.00037692788   2    1000014   -13
    0.00037318717   2    1000012   -11
    0.00013334957   3    1000021   -5    6

DECAY 1000022 -1


DECAY 1000023  81.493623
    0.074153479   2    1000006   -6
    0.074153479   2   -1000006    6
    0.066818751   2    1000005   -5
    0.066818751   2   -1000005    5
    0.058476663   2    1000015   -15
    0.058476663   2   -1000015    15
    0.058434112   2    1000016   -16
    0.058434112   2   -1000016    16
    0.057882823   2    1000004   -4
    0.057882823   2   -1000004    4
    0.057882717   2    1000002   -2
    0.057882717   2   -1000002    2
    0.057750608   2    1000003   -3
    0.057750608   2   -1000003    3
    0.057750557   2    1000001   -1
    0.057750557   2   -1000001    1
    0.0026627849   2    1000014   -14
    0.0026627849   2   -1000014    14
    0.0026627461   2    1000012   -12
    0.0026627461   2   -1000012    12
    0.002647022   2    1000013   -13
    0.002647022   2   -1000013    13
    0.002646988   2    1000011   -11
    0.002646988   2   -1000011    11
    0.00026978631   2    1000022    25
    0.00016150853   2    1000022    23

DECAY 1000025  72.252751
    0.34271315   2    1000006   -6
    0.34271315   2   -1000006    6
    0.0663433   2    1000023    23
    0.064074431   2    1000024   -24
    0.064074431   2   -1000024    24
    0.045390778   2    1000023    25
    0.024130271   2    1000022    25
    0.011973578   2    1000022    23
    0.010595331   2    1000005   -5
    0.010595331   2   -1000005    5
    0.0044076275   2    2000005   -5
    0.0044076275   2   -2000005    5
    0.0024863403   2    1000015   -15
    0.0024863403   2   -1000015    15
    0.0016930416   3    1000022    6   -6
    0.00075467782   3    1000024    5   -6
    0.00075467782   3   -1000024   -5    6
    0.00014540775   3    1000023    6   -6

DECAY 1000035  70.518047
    0.34045177   2    1000006   -6
    0.34045177   2   -1000006    6
    0.06692888   2    1000024   -24
    0.06692888   2   -1000024    24
    0.064488881   2    1000023    25
    0.034883485   2    1000022    25
    0.02472855   2    1000022    23
    0.012242189   2    1000005   -5
    0.012242189   2   -1000005    5
    0.0045810209   2    2000005   -5
    0.0045810209   2   -2000005    5
    0.0034748621   2    1000015   -15
    0.0034748621   2   -1000015    15
    0.0020710876   3    1000022    6   -6
    0.0015458346   2    1000003   -3
    0.0015458346   2   -1000003    3
    0.0015422148   2    1000001   -1
    0.0015422148   2   -1000001    1
    0.0014890757   2    1000004   -4
    0.0014890757   2   -1000004    4
    0.0014837418   2    1000002   -2
    0.0014837418   2   -1000002    2
    0.0010907302   2    1000016   -16
    0.0010907302   2   -1000016    16
    0.00099051596   3    1000024    5   -6
    0.00099051596   3   -1000024   -5    6
    0.00021729842   2    1000014   -14
    0.00021729842   2   -1000014    14
    0.00021729735   2    1000012   -12
    0.00021729735   2   -1000012    12
    0.00021226188   3    1000023    6   -6
    0.00020609205   2    1000023    23
    0.00019419292   2    1000013   -13
    0.00019419292   2   -1000013    13
    0.00019242208   2    1000011   -11
    0.00019242208   2   -1000011    11

DECAY 1000021  105.0873
    0.16024277   2    2000002   -2
    0.16024277   2   -2000002    2
    0.16024263   2    2000004   -4
    0.16024263   2   -2000004    4
    0.037239508   2    1000005   -5
    0.037239508   2   -1000005    5
    0.035069825   2    1000006   -6
    0.035069825   2   -1000006    6
    0.026849317   2    1000002   -2
    0.026849317   2   -1000002    2
    0.026849222   2    1000004   -4
    0.026849222   2   -1000004    4
    0.026732227   2    1000003   -3
    0.026732227   2   -1000003    3
    0.026732201   2    1000001   -1
    0.026732201   2   -1000001    1

DECAY 25  0.0038954899
    0.56715603   2   -5    5
    0.23406143   2   -24    24
    0.072561196   2    21    21
    0.065309505   2   -15    15
    0.028485385   2    23    23
    0.028101267   2   -4    4
    0.0023570022   2    22    22
    0.00152791   2    22    23
    0.00022649966   2   -13    13
    0.00021303533   2   -3    3
    5.8902049e-07   2   -1    1
    1.448113e-07   2   -2    2
    5.0919605e-09   2   -11    11

DECAY 35  7.642474
    0.66930598   2   -5    5
    0.16555788   2   -15    15
    0.16404026   2   -6    6
    0.00056205316   2   -13    13
    0.00024717333   2   -3    3
    0.00012968111   2    25    25
    8.5435534e-05   2    1000022    1000022
    1.6558503e-05   2    23    23
    1.2918297e-05   2   -1000004    1000004
    1.288532e-05   2   -1000002    1000002
    9.8425943e-06   2    21    21
    3.0253651e-06   2   -24    24
    1.4157671e-06   2   -1000011    1000011
    1.4119328e-06   2   -1000013    1000013
    1.3720901e-06   2   -4    4
    1.180878e-06   2   -1000015    1000015
    6.8330401e-07   2   -1    1
    8.3531276e-08   2    22    22
    3.0195017e-08   2    22    23
    1.2621808e-08   2   -11    11
    7.0719986e-12   2   -2    2

DECAY 36  7.2625263
    0.68428385   2   -5    5
    0.16923038   2   -15    15
    0.14542613   2   -6    6
    0.00057452566   2   -13    13
    0.00025270415   2   -3    3
    0.00011928966   2    1000022    1000022
    6.8278344e-05   2    21    21
    4.2710268e-05   2    23    25
    1.1609641e-06   2   -4    4
    6.9859326e-07   2   -1    1
    2.1085185e-07   2    22    22
    4.5092002e-08   2    22    23
    1.2901897e-08   2   -11    11
    5.9837483e-12   2   -2    2
    2.8025187e-36   2    25    25

DECAY 37  8.1614345
    0.8537978   2   -5    6
    0.14414174   2   -15    16
    0.0010254534   2   -5    4
    0.00050959232   2   -13    14
    0.00023272102   2   -3    6
    0.00021728995   2   -3    4
    3.8040765e-05   2    24    25
    1.0658916e-05   2   -1    6
    1.0127012e-05   2   -3    2
    8.5183211e-06   2   -1000015    1000016
    7.3227711e-06   2   -5    2
    5.9708891e-07   2   -1    2
    1.2507213e-07   2   -1    4
    1.1919417e-08   2   -11    12
    1.7745339e-13   2    24    35

DECAY 6  2.43
    1   2    5    24

DECAY 15 -1
