BLOCK SPINFO
   1   SPheno
   2   v4.0.5be

BLOCK SPHENOINFO
   1   2
   2   2

BLOCK MODSEL
   1   0

BLOCK MINPAR
   3    25.257371
   4    1

BLOCK EXTPAR
   0    2100.5887
   1    202.9944
   2   -405.56488
   3    2715.4772
   11    2894.4133
   12   -6456.4564
   13    529.56507
   23    2170.2561
   25    24.237746
   26    1113.5776
   31    1531.2259
   32    1531.2259
   33    3297.031
   34    2000.7736
   35    2000.7736
   36    1291.2018
   41    3437.345
   42    3437.345
   43    1412.5201
   44    3465.3725
   45    3465.3725
   46    2908.3989
   47    1665.5026
   48    1665.5026
   49    2141.1402

BLOCK SMINPUTS
   1    127.90897
   2    1.1663787e-05
   3    0.1184
   4    91.1876
   5    4.18
   6    173.2
   7    1.777
   8    0
   11    0.00051099893
   12    0
   13    0.10565837
   14    0
   21    0.005
   22    0.0025
   23    0.095
   24    1.27

BLOCK GAUGE Q=  2100.5887
   1    0.35536298
   2    0.66519887
   3    1.219778

BLOCK YU Q=  2100.5887
   1   1    8.3915051e-06
   2   2    0.0042628846
   3   3    1.0137612

BLOCK YD Q=  2100.5887
   1   1    0.00040870726
   2   2    0.0077654379
   3   3    0.40530953

BLOCK YE Q=  2100.5887
   1   1    7.1322405e-05
   2   2    0.014747211
   3   3    0.24802383

BLOCK AU Q=  2100.5887
   1   1    0
   2   2    0
   3   3    2894.4133

BLOCK AD Q=  2100.5887
   1   1    0
   2   2    0
   3   3   -6456.4661

BLOCK AE Q=  2100.5887
   1   1    0
   2   2    0
   3   3    529.56507

BLOCK MSOFT Q=  2100.5887
   1    202.9944
   2   -405.56488
   3    2715.4772
   21   -3508037.5
   22   -4683582.1
   31    1531.2259
   32    1531.2259
   33    3297.031
   34    2000.7736
   35    2000.7736
   36    1291.2018
   41    3437.345
   42    3437.345
   43    1412.5201
   44    3465.3725
   45    3465.3725
   46    2908.3989
   47    1665.5026
   48    1665.5026
   49    2141.1402

BLOCK MASS
   6    173.2
   23    91.1876
   24    80.429995
   15    1.777
   25    121.43854
   35    1113.5198
   36    1113.5776
   37    1116.8157
   1000001    3499.8618
   2000001    1753.8641
   1000002    3499.0605
   2000002    3521.4342
   1000003    3499.8612
   2000003    1753.8644
   1000004    3499.0599
   2000004    3521.4341
   1000005    1507.3684
   2000005    2211.1459
   1000006    1505.4409
   2000006    2931.0171
   1000011    1537.1975
   2000011    1999.9832
   1000012    1534.7579
   1000013    1537.1888
   2000013    1999.9784
   1000014    1534.7552
   1000015    1289.3512
   2000015    3303.786
   1000016    3302.452
   1000021    2854.6706
   1000022    202.19149
   1000023   -432.47075
   1000025   -2163.925
   1000035    2164.1272
   1000024    432.66395
   1000037    2165.4006

BLOCK ALPHA
      -0.04041883

BLOCK HMIX Q=  2100.5887
   1    2170.2561
   2    24.237746
   3    243.67236
   4    1240055

BLOCK STOPMIX
   1   1   -0.99808013
   1   2    0.061935823
   2   1   -0.061935823
   2   2   -0.99808013

BLOCK SBOTMIX
   1   1    0.99927557
   1   2    0.038057078
   2   1   -0.038057078
   2   2    0.99927557

BLOCK STAUMIX
   1   1    0.0098754002
   1   2    0.99995124
   2   1   -0.99995124
   2   2    0.0098754002

BLOCK NMIX
   1   1   -0.99978643
   1   2   -0.00040118826
   1   3   -0.020490016
   1   4    0.0026648677
   2   1    0.00035405357
   2   2    0.99927427
   2   3   -0.037618124
   2   4   -0.0059743643
   3   1    0.012604614
   3   2   -0.030823705
   3   3   -0.70638044
   3   4   -0.70704858
   4   1    0.016373808
   4   2   -0.022375877
   4   3   -0.706535
   4   4    0.70713472

BLOCK UMIX
   1   1   -0.99858592
   1   2    0.053161718
   2   1   -0.053161718
   2   2   -0.99858592

BLOCK VMIX
   1   1    0.99996392
   1   2    0.0084946436
   2   1    0.0084946436
   2   2   -0.99996392

BLOCK HIGGSBOUNDSINPUTHIGGSCOUPLINGSFERMIONS
       0, 587.46835,3,36,15,15

BLOCK HIGGSBOUNDSINPUTHIGGSCOUPLINGSBOSONS
       0,4,36,21,21,23

BLOCK SPHENOLOWENERGY
   1    0.00035667741
   2    1.5872094e-06
   3    3.5249932e-05
   4    2.7688989e-15
   5    1.1828403e-10
   6    2.4750179e-08
   7    9.2323233e-14
   8    3.9440374e-09
   9    8.3606387e-07
   10    9.3201613e-05
   11    0.96273698
   12    0.54229266
   13    19.361179
   14    0
   15    0
   16    0.0021591377
   17    2.2816802e-15
   18    2.4795839e-11
   19    8.2895491e-11
   20   -3.1476868e-15
   21   -1.3457235e-10
   22   -1.5720113e-08
   23    0
   24    0
   25    0
   26    0
   27    0
   28    0
   29    0
   30    0
   31    0
   39    8.4975452e-05
   40    0
   41    0
   42    0

BLOCK FWCOEF Q=  160
   305   4422   0   0   -0.18881911
   305   4422   0   2   -0.22574018
   305   4322   0   2   -0.00066544036
   305   6421   0   0   -0.095227835
   305   6421   0   2   -0.13572587
   305   6321   0   2   -0.00075440654
   3051111   4133   0   0    1.603871
   3051111   4133   0   2    1.6041557
   3051111   4233   0   2    2.5295445e-05
   3051111   4137   0   0   -4.4265631
   3051111   4137   0   2   -4.4245494
   3051111   4237   0   2   -0.00019354378
   3051313   4133   0   0    1.603871
   3051313   4133   0   2    1.6041551
   3051313   4233   0   2    2.5293912e-05
   3051313   4137   0   0   -4.4265631
   3051313   4137   0   2   -4.42455
   3051313   4237   0   2   -0.0001935425
   3051212   4137   0   0    1.5053501
   3051212   4137   0   2    1.504934
   3051212   4237   0   2    4.2068471e-05
   3051414   4137   0   0    1.5053501
   3051414   4137   0   2    1.504934
   3051414   4237   0   2    4.2068791e-05
   3051616   4137   0   0    1.5053501
   3051616   4137   0   2    1.5049318
   3051616   4237   0   2    4.2158911e-05

BLOCK IMFWCOEF Q=  160
   305   4422   0   0    3.8576289e-07
   305   4422   0   2   -5.4445309e-06
   305   4322   0   2   -1.5346092e-06
   305   6421   0   0    3.3043143e-07
   305   6421   0   2   -1.877655e-05
   305   6321   0   2   -1.1240561e-06
   3051111   4133   0   2    5.9759469e-07
   3051111   4233   0   2    1.6861318e-06
   3051111   4137   0   2    1.2925878e-06
   3051111   4237   0   2   -1.2908592e-05
   3051313   4133   0   2    5.9758742e-07
   3051313   4233   0   2    1.6861308e-06
   3051313   4137   0   2    1.2925909e-06
   3051313   4237   0   2   -1.2908595e-05
   3051212   4137   0   2    1.154062e-07
   3051212   4237   0   2    2.8057352e-06
   3051414   4137   0   2    1.1540639e-07
   3051414   4237   0   2    2.8057352e-06
   3051616   4137   0   2    7.6040746e-08
   3051616   4237   0   2    2.8057333e-06

DECAY 23  2.4952


DECAY 24  2.085


DECAY 1000011  19.038389
    0.60091635   2   -1000024    12
    0.3010327   2    1000023    11
    0.098050957   2    1000022    11

DECAY 2000011  9.8406154
    0.99999988   2    1000022    11

DECAY 1000013  19.038257
    0.60091593   2   -1000024    14
    0.30103288   2    1000023    13
    0.098051187   2    1000022    13

DECAY 2000013  9.842635
    0.99979254   2    1000022    13
    0.00020395591   2    1000013    25

DECAY 1000015  6.1737335
    0.99808558   2    1000022    15
    0.0012755029   2   -1000024    16
    0.00063891244   2    1000023    15

DECAY 2000015  49.054192
    0.57082262   2   -1000024    16
    0.28603297   2    1000023    15
    0.084084992   2    1000022    15
    0.014800866   2    1000015    23
    0.014714212   2    1000015    25
    0.013494262   2    1000025    15
    0.013452721   2    1000035    15
    0.00099010927   2    1000015    36
    0.00098409623   2    1000015    35
    0.00062315034   2   -1000037    16

DECAY 1000012  19.020194
    0.60186554   2    1000024    11
    0.30045038   2    1000023    12
    0.09768408   2    1000022    12

DECAY 1000014  19.020165
    0.60186586   2    1000024    13
    0.3004501   2    1000023    14
    0.097684037   2    1000022    14

DECAY 1000016  49.086192
    0.5722866   2    1000024    15
    0.28553584   2    1000023    16
    0.083718509   2    1000022    16
    0.029560608   2    1000015    24
    0.026693988   2    1000037    15
    0.001975049   2    1000015    37
    0.00013602226   2    1000025    16

DECAY 2000001  0.95290867
    0.99999986   2    1000022    1

DECAY 1000001  76.18043
    0.4062641   2    1000021    1
    0.39105213   2   -1000024    2
    0.19577644   2    1000023    1
    0.006338123   2    1000022    1
    0.00043539864   2   -1000037    2

DECAY 2000003  0.95291746
    0.99999163   2    1000022    3

DECAY 1000003  76.183052
    0.40624944   2    1000021    3
    0.39103846   2   -1000024    4
    0.19576973   2    1000023    3
    0.0063379264   2    1000022    3
    0.000441794   2   -1000037    4

DECAY 1000005  16.584861
    0.6503627   2   -1000024    6
    0.337018   2    1000023    5
    0.0126193   2    1000022    5

DECAY 2000005  5.9130751
    0.38746668   2    1000005    25
    0.27150833   2    1000006   -24
    0.20431982   2    1000022    5
    0.1343712   2    1000005    23
    0.0010982291   2    1000025    5
    0.0010890188   2    1000035    5

DECAY 1000002  76.160942
    0.40553555   2    1000021    2
    0.3921371   2    1000024    1
    0.19582833   2    1000023    2
    0.0063956632   2    1000022    2

DECAY 2000002  40.480711
    0.80706456   2    1000021    2
    0.19290329   2    1000022    2

DECAY 1000004  76.162871
    0.40552342   2    1000021    4
    0.39212725   2    1000024    3
    0.19582327   2    1000023    4
    0.0063954981   2    1000022    4

DECAY 2000004  40.481596
    0.80704449   2    1000021    4
    0.19289901   2    1000022    4

DECAY 1000006  16.753133
    0.66498694   2    1000024    5
    0.32202394   2    1000023    6
    0.012197167   2    1000022    6
    0.00079194998   3    1000022    24    5

DECAY 2000006  121.36914
    0.21401547   2    1000005    24
    0.16303861   2    1000006    25
    0.13174044   2    1000005    37
    0.10688646   2    1000006    23
    0.10156516   2    1000037    5
    0.066917983   2    1000006    36
    0.065763293   2    1000006    35
    0.052877873   2    1000022    6
    0.048212668   2    1000025    6
    0.048187816   2    1000035    6
    0.00048951271   2    1000024    5
    0.00024316583   2    1000023    6

DECAY 1000024  7.110254e-06
    0.96996552   2    1000022    24
    0.014143431   3    1000022   -13    14
    0.014142697   3    1000022   -11    12
    0.00086612881   3    1000022   -15    16
    0.00055893561   3    1000022   -5    6
    0.00016179006   3    1000022   -3    4
    0.00016149575   3    1000022   -1    2

DECAY 1000037  43.942472
    0.38654168   2   -1000005    6
    0.10388641   2    1000024    25
    0.10074778   2    1000023    24
    0.10045849   2    1000024    23
    0.065202175   2    1000006   -5
    0.058122472   2    1000024    36
    0.058020372   2    1000024    35
    0.053361089   2    37    1000023
    0.032685906   2    1000022    24
    0.016059643   2    37    1000022
    0.012490548   2   -1000015    16
    0.0060298683   3    1000024    6   -6
    0.004653814   3    1000023   -5    6
    0.0013880393   3    1000022   -5    6
    0.00015084302   2   -1000013    14
    0.00015083955   2   -1000011    12

DECAY 1000022 -1


DECAY 1000023  1.1680371e-05
    0.81335744   2    1000022    23
    0.13642203   2    1000022    25
    0.022501185   3    1000022    12   -12
    0.010980272   3    1000022    13   -13
    0.010979749   3    1000022    11   -11
    0.0045369727   3    1000022    5   -5
    0.00063167866   3    1000022    15   -15
    0.00012701403   3    1000022    2   -2
    0.00012697289   3    1000022    4   -4
    0.00012588126   3    1000022    3   -3
    0.00012572678   3    1000022    1   -1

DECAY 1000025  43.651346
    0.19169493   2    1000006   -6
    0.19169493   2   -1000006    6
    0.10124977   2    1000024   -24
    0.10124977   2   -1000024    24
    0.068743663   2    1000023    25
    0.053386328   2    37   -1000024
    0.053386328   2   -37    1000024
    0.045647638   2    1000023    35
    0.034982614   2    1000023    23
    0.032067118   2    1000005   -5
    0.032067118   2   -1000005    5
    0.020603122   2    1000022    23
    0.016839532   2    1000022    25
    0.01237855   2    1000023    36
    0.011189236   2    1000022    35
    0.0062912923   2    1000015   -15
    0.0062912923   2   -1000015    15
    0.0056821267   2    1000022    36
    0.005201682   3    1000024    5   -6
    0.005201682   3   -1000024   -5    6
    0.0030301628   3    1000023    6   -6
    0.00084365536   3    1000022    6   -6

DECAY 1000035  45.22471
    0.18250949   2    1000006   -6
    0.18250949   2   -1000006    6
    0.09797209   2    1000024   -24
    0.09797209   2   -1000024    24
    0.078090357   2    1000023    25
    0.064165123   2    1000023    23
    0.05609489   2    37   -1000024
    0.05609489   2   -37    1000024
    0.037509057   2    1000023    35
    0.030971795   2    1000005   -5
    0.030971795   2   -1000005    5
    0.019088217   2    1000022    25
    0.01412104   2    1000023    36
    0.011788132   2    1000022    23
    0.0091942829   2    1000022    35
    0.0064813641   2    1000022    36
    0.0060840945   2    1000015   -15
    0.0060840945   2   -1000015    15
    0.0041625749   3    1000024    5   -6
    0.0041625749   3   -1000024   -5    6
    0.0029995193   3    1000023    6   -6
    0.00078910107   3    1000022    6   -6

DECAY 1000021  167.84689
    0.13335013   2    1000006   -6
    0.13335013   2   -1000006    6
    0.1308743   2    1000005   -5
    0.1308743   2   -1000005    5
    0.097550177   2    2000001   -1
    0.097550177   2   -2000001    1
    0.097550139   2    2000003   -3
    0.097550139   2   -2000003    3
    0.040303662   2    2000005   -5
    0.040303662   2   -2000005    5

DECAY 25  0.0035336204
    0.63020023   2   -5    5
    0.17007858   2   -24    24
    0.073233561   2    21    21
    0.073008633   2   -15    15
    0.030368034   2   -4    4
    0.019162064   2    23    23
    0.0022809722   2    22    22
    0.0011761136   2    22    23
    0.00025305376   2   -13    13
    0.00023794112   2   -3    3
    6.5788414e-07   2   -1    1
    1.5650512e-07   2   -2    2
    5.6889789e-09   2   -11    11

DECAY 35  6.4808079
    0.76816124   2   -5    5
    0.22169859   2   -15    15
    0.0052432229   2   -6    6
    0.0013237095   2   -1000024    1000024
    0.00091228733   2    1000022    1000023
    0.00074466124   2   -13    13
    0.00066146914   2    1000023    1000023
    0.00065431514   2    25    25
    0.000367661   2   -3    3
    0.00012906577   2    1000022    1000022
    3.982729e-05   2   -24    24
    3.3634466e-05   2    23    23
    2.9084224e-05   2    21    21
    1.0165121e-06   2   -1    1
    1.0225158e-07   2   -4    4
    9.4073845e-08   2    22    23
    1.6729772e-08   2   -11    11
    1.9440779e-10   2    22    22
    5.2737629e-13   2   -2    2

DECAY 36  6.3653618
    0.76631125   2   -5    5
    0.22117491   2   -15    15
    0.0062354995   2   -6    6
    0.0027994049   2   -1000024    1000024
    0.001398825   2    1000023    1000023
    0.00074289581   2   -13    13
    0.00067327807   2    1000022    1000023
    0.00036678038   2   -3    3
    0.00015478848   2    1000022    1000022
    9.244019e-05   2    21    21
    4.8262734e-05   2    23    25
    1.0140772e-06   2   -1    1
    3.7225205e-07   2    22    23
    1.5371495e-07   2    22    22
    1.0776827e-07   2   -4    4
    1.6690102e-08   2   -11    11
    5.5615876e-13   2   -2    2
    1.5698101e-35   2    25    25

DECAY 37  5.8315776
    0.75145984   2   -5    6
    0.24432339   2   -15    16
    0.0017593864   2    1000022    1000024
    0.0011288463   2   -5    4
    0.00086377416   2   -13    14
    0.00036586415   2   -3    4
    5.3406816e-05   2    24    25
    1.8590892e-05   2   -3    6
    1.6918742e-05   2   -3    2
    8.0611436e-06   2   -5    2
    1.014976e-06   2   -1    2
    8.291502e-07   2   -1    6
    5.472376e-08   2   -1    4
    2.0203768e-08   2   -11    12
    1.0709597e-10   2    1000023    1000024
    9.053105e-11   2    24    35
    8.2872903e-11   2    24    36

DECAY 6  2.43
    1   2    5    24

DECAY 15 -1
