BLOCK SPINFO
   1   SPheno
   2   v4.0.5be

BLOCK SPHENOINFO
   1   2
   2   2

BLOCK MODSEL
   1   0

BLOCK MINPAR
   3    57.782939
   4   -1

BLOCK EXTPAR
   0    1632.4327
   1   -46.812159
   2    1833.1779
   3    3000
   11   -3653.5549
   12   -417.1456
   13   -713.41112
   23   -1041.4912
   25    58.328017
   26    597.18424
   31    152.81559
   32    152.81559
   33    416.46618
   34    675.41749
   35    675.41749
   36    1537.9658
   41    5000
   42    5000
   43    1935.1181
   44    5000
   45    5000
   46    1423.2234
   47    5000
   48    5000
   49    1350.7763

BLOCK SMINPUTS
   1    127.90897
   2    1.1663787e-05
   3    0.1184
   4    91.1876
   5    4.18
   6    173.2
   7    1.777
   8    0
   11    0.00051099893
   12    0
   13    0.10565837
   14    0
   21    0.005
   22    0.0025
   23    0.095
   24    1.27

BLOCK GAUGE Q=  1632.4327
   1    0.35536298
   2    0.66519887
   3    1.219778

BLOCK YU Q=  1632.4327
   1   1    8.3856043e-06
   2   2    0.004259887
   3   3    1.0130484

BLOCK YD Q=  1632.4327
   1   1    0.00098286037
   2   2    0.018674347
   3   3    0.9746895

BLOCK YE Q=  1632.4327
   1   1    0.00017151632
   2   2    0.035464136
   3   3    0.59644842

BLOCK AU Q=  1632.4327
   1   1    0
   2   2    0
   3   3   -3653.5551

BLOCK AD Q=  1632.4327
   1   1    0
   2   2    0
   3   3   -417.14602

BLOCK AE Q=  1632.4327
   1   1    0
   2   2    0
   3   3   -713.41116

BLOCK MSOFT Q=  1632.4327
   1   -46.812159
   2    1833.1779
   3    3000
   21   -658886.9
   22   -1056922.4
   31    152.81559
   32    152.81559
   33    416.46618
   34    675.41749
   35    675.41749
   36    1537.9658
   41    5000
   42    5000
   43    1935.1181
   44    5000
   45    5000
   46    1423.2234
   47    5000
   48    5000
   49    1350.7763

BLOCK MASS
   6    173.2
   23    91.1876
   24    80.429995
   15    1.777
   25    123.83177
   35    596.89457
   36    597.18424
   37    607.19213
   1000001    5031.8528
   2000001    5023.8695
   1000002    5031.4171
   2000002    5025.6871
   1000003    5031.8693
   2000003    5023.8717
   1000004    5031.4237
   2000004    5025.6877
   1000005    1357.149
   2000005    1931.6586
   1000006    1354.3449
   2000006    1967.6204
   1000011    220.79113
   2000011    675.31206
   1000012    205.8391
   1000013    220.6058
   2000013    675.34779
   1000014    205.83774
   1000015    440.36012
   2000015    1531.1149
   1000016    442.35496
   1000021    3199.3513
   1000022   -46.244874
   1000023    1039.6811
   1000025   -1045.3939
   1000035    1871.111
   1000024    1040.5478
   1000037    1871.3169

BLOCK ALPHA
      -0.018292728

BLOCK HMIX Q=  1632.4327
   1   -1041.4912
   2    58.328017
   3    243.90987
   4    356629.02

BLOCK STOPMIX
   1   1    0.26126827
   1   2    0.96526623
   2   1   -0.96526623
   2   2    0.26126827

BLOCK SBOTMIX
   1   1   -0.079204298
   1   2    0.99685841
   2   1   -0.99685841
   2   2   -0.079204298

BLOCK STAUMIX
   1   1   -0.9990218
   1   2    0.044220441
   2   1   -0.044220441
   2   2   -0.9990218

BLOCK NMIX
   1   1   -0.99906961
   1   2   -1.1448297e-05
   1   3    0.043058232
   1   4   -0.00242876
   2   1    0.028725851
   2   2    0.068177675
   2   3    0.70625188
   2   4    0.70408445
   3   1   -0.032139207
   3   2    0.019569693
   3   3   -0.70581105
   3   4    0.70740007
   4   1    0.001344331
   4   2   -0.99748124
   4   3    0.034424319
   4   4    0.06200264

BLOCK UMIX
   1   1   -0.048057223
   1   2   -0.99884458
   2   1    0.99884458
   2   2   -0.048057223

BLOCK VMIX
   1   1   -0.087143798
   1   2    0.99619574
   2   1    0.99619574
   2   2    0.087143798

BLOCK HIGGSBOUNDSINPUTHIGGSCOUPLINGSFERMIONS
       0, 3402.1576,3,36,15,15

BLOCK HIGGSBOUNDSINPUTHIGGSCOUPLINGSBOSONS
       0,4,36,21,21,23

BLOCK SPHENOLOWENERGY
   1    0.00045851413
   2    1.5978278e-06
   3    3.5286196e-05
   4    5.6538272e-14
   5    2.4124137e-09
   6    3.4260089e-07
   7    1.900195e-12
   8    8.1083541e-08
   9    1.1819972e-05
   10    1.9647704e-05
   11    0.20295325
   12    0.54223327
   13    18.727599
   14    0
   15    0
   16    0.0021771245
   17    2.2819196e-15
   18    2.481437e-11
   19    8.2942188e-11
   20    4.2828631e-15
   21    1.8367469e-10
   22   -6.3186378e-08
   23    0
   24    0
   25    0
   26    0
   27    0
   28    0
   29    0
   30    0
   31    0
   39    9.3700957e-05
   40    0
   41    0
   42    0

BLOCK FWCOEF Q=  160
   305   4422   0   0   -0.18881911
   305   4422   0   2   -0.32815663
   305   4322   0   2   -0.0018581997
   305   6421   0   0   -0.095227835
   305   6421   0   2   -0.20526166
   305   6321   0   2   -0.0016383621
   3051111   4133   0   0    1.5960032
   3051111   4133   0   2    1.5972961
   3051111   4233   0   2   -0.00027056221
   3051111   4137   0   0   -4.4186953
   3051111   4137   0   2   -4.4202217
   3051111   4237   0   2    0.0021012158
   3051313   4133   0   0    1.5960032
   3051313   4133   0   2    1.5972823
   3051313   4233   0   2   -0.00027087299
   3051313   4137   0   0   -4.4186953
   3051313   4137   0   2   -4.4202355
   3051313   4237   0   2    0.0021015123
   3051212   4137   0   0    1.5053501
   3051212   4137   0   2    1.5056873
   3051212   4237   0   2   -0.00045754042
   3051414   4137   0   0    1.5053501
   3051414   4137   0   2    1.5056873
   3051414   4237   0   2   -0.00045747346
   3051616   4137   0   0    1.5053501
   3051616   4137   0   2    1.5056875
   3051616   4237   0   2   -0.00043860188

BLOCK IMFWCOEF Q=  160
   305   4422   0   0    3.8550831e-07
   305   4422   0   2   -2.7412989e-05
   305   4322   0   2   -1.0689639e-05
   305   6421   0   0    3.3021337e-07
   305   6421   0   2    1.1381283e-05
   305   6321   0   2   -4.5663651e-06
   3051111   4133   0   2    3.0616347e-08
   3051111   4233   0   2    9.4443733e-06
   3051111   4137   0   2    4.9116728e-07
   3051111   4237   0   2   -7.3105594e-05
   3051313   4133   0   2    3.0474275e-08
   3051313   4233   0   2    9.444314e-06
   3051313   4137   0   2    4.909742e-07
   3051313   4237   0   2   -7.3105793e-05
   3051212   4137   0   2   -3.65796e-08
   3051212   4237   0   2    1.5917551e-05
   3051414   4137   0   2   -3.6578784e-08
   3051414   4237   0   2    1.5917551e-05
   3051616   4137   0   2   -3.3885129e-08
   3051616   4237   0   2    1.5917566e-05

DECAY 23  2.4952


DECAY 24  2.085


DECAY 1000011  0.25308865
    0.99999497   2    1000022    11

DECAY 2000011  3.3551953
    0.99999988   2    1000022    11

DECAY 1000013  0.25284572
    0.99999526   2    1000022    13

DECAY 2000013  3.372507
    0.99492961   2    1000022    13
    0.0050703885   2    1000013    25

DECAY 1000015  0.55355188
    1   2    1000022    15

DECAY 2000015  25.122896
    0.30476309   2    1000022    15
    0.14479727   2    1000016   -24
    0.12379073   2   -1000024    16
    0.087850849   2    1000015    25
    0.072215638   2    1000015    23
    0.07106406   2    1000016   -37
    0.062203323   2    1000023    15
    0.06151608   2    1000025    15
    0.035976811   2    1000015    36
    0.03582215   2    1000015    35

DECAY 1000012  0.23267975
    1   2    1000022    12

DECAY 1000014  0.23267787
    1   2    1000022    14

DECAY 1000016  0.54255508
    0.9999983   2    1000022    16

DECAY 2000001  142.93231
    0.98038196   2    1000021    1
    0.019583389   2    1000022    1

DECAY 1000001  191.03286
    0.73787709   2    1000021    1
    0.17177331   2   -1000037    2
    0.08569953   2    1000035    1
    0.0036684635   2    1000022    1
    0.00049069241   2   -1000024    2
    0.00042277087   2    1000023    1

DECAY 2000003  142.99619
    0.97994558   2    1000021    3
    0.0195751   2    1000022    3
    0.00022276471   2   -1000024    4
    0.0001296803   2    1000025    3
    0.00012621407   2    1000023    3

DECAY 1000003  191.06838
    0.73774886   2    1000021    3
    0.17174236   2   -1000037    4
    0.085684207   2    1000035    3
    0.0036681312   2    1000022    3
    0.00050598872   2    1000023    3
    0.00049923279   2   -1000024    4
    0.00015122114   2    1000025    3

DECAY 1000005  8.3724377
    0.38474259   2   -1000024    6
    0.26272469   2    1000023    5
    0.25180795   2    1000025    5
    0.10072478   2    1000022    5

DECAY 2000005  84.6569
    0.50099661   2    1000006   -24
    0.22733111   2   -1000024    6
    0.10808065   2    1000023    5
    0.10780537   2    1000025    5
    0.029588716   2    1000005    25
    0.022538878   2    1000005    23
    0.0032789538   2    1000022    5
    0.00037971504   2    1000035    5

DECAY 2000002  151.53687
    0.92596152   2    1000021    2
    0.073912359   2    1000022    2

DECAY 1000002  191.02484
    0.73767076   2    1000021    2
    0.17084635   2    1000037    1
    0.085608723   2    1000035    2
    0.0036692431   2    1000022    2
    0.0016138515   2    1000024    1
    0.00057072301   2    1000023    2

DECAY 2000004  151.54019
    0.92594124   2    1000021    4
    0.073910737   2    1000022    4

DECAY 1000004  191.05911
    0.73754169   2    1000021    4
    0.17081636   2    1000037    3
    0.085593583   2    1000035    4
    0.0036685893   2    1000022    4
    0.0017801436   2    1000024    3
    0.00057492852   2    1000023    4

DECAY 1000006  10.230051
    0.46390209   2    1000024    5
    0.26617072   2    1000022    6
    0.14015631   2    1000023    6
    0.12962273   2    1000025    6
    0.00010387402   2    1000022    4

DECAY 2000006  95.765621
    0.27558053   2    1000006    25
    0.24225245   2    1000006    23
    0.19618609   2    1000024    5
    0.11033262   2    1000025    6
    0.10890325   2    1000023    6
    0.04436262   2    1000005    24
    0.0077780622   2    1000006    36
    0.0058971783   2    1000006    35
    0.0058010596   2    1000022    6
    0.0016331561   2    1000037    5
    0.0012729873   2    1000005    37

DECAY 1000024  3.6189474
    0.68726403   2    1000016   -15
    0.19537194   2    1000022    24
    0.07919363   2    37    1000022
    0.012184446   2    1000014   -13
    0.0088733407   2    1000012   -11
    0.0065466204   2   -1000015    16
    0.0039880901   3    1000022   -5    6
    0.0026659644   2   -1000013    14
    0.0026655426   2   -1000011    12
    0.0012021249   2   -2000013    14

DECAY 1000037  70.670938
    0.11307056   2   -1000013    14
    0.1130652   2   -1000011    12
    0.11288308   2    1000014   -13
    0.11288223   2    1000012   -11
    0.10330984   2    1000016   -15
    0.10316044   2   -1000015    16
    0.052504032   2    1000023    24
    0.051404301   2    1000025    24
    0.050449019   2    1000024    23
    0.049426781   2    1000024    25
    0.034041168   2    1000024    36
    0.033604021   2    1000024    35
    0.033532575   2    37    1000023
    0.030866293   2    37    1000025
    0.0014155251   2    1000006   -5
    0.0013716507   3    1000025   -5    6
    0.0012977991   3    1000024    6   -6
    0.0012794734   3    1000023   -5    6
    0.00013815048   2    1000022    24
    0.00010158715   3    1000024    5   -5

DECAY 1000022 -1


DECAY 1000023  3.6365866
    0.34414431   2    1000015   -15
    0.34414431   2   -1000015    15
    0.10802513   2    1000022    23
    0.090578033   2    1000022    25
    0.047571148   2    1000022    35
    0.033949664   2    1000022    36
    0.005628908   2    1000013   -13
    0.005628908   2   -1000013    13
    0.0040023878   2    1000011   -11
    0.0040023878   2   -1000011    11
    0.0016212054   2    1000014   -14
    0.0016212054   2   -1000014    14
    0.0016212036   2    1000012   -12
    0.0016212036   2   -1000012    12
    0.0013793221   3    1000022    6   -6
    0.0011779017   2    1000016   -16
    0.0011779017   2   -1000016    16
    0.00079442248   2    2000013   -13
    0.00079442248   2   -2000013    13
    0.00019809075   2    2000011   -11
    0.00019809075   2   -2000011    11

DECAY 1000025  3.4952678
    0.35533011   2    1000015   -15
    0.35533011   2   -1000015    15
    0.10293559   2    1000022    25
    0.091050886   2    1000022    23
    0.045699653   2    1000022    35
    0.037682548   2    1000022    36
    0.0017052119   2    1000013   -13
    0.0017052119   2   -1000013    13
    0.0016213245   3    1000022    6   -6
    0.00089659294   2    2000013   -13
    0.00089659294   2   -2000013    13
    0.0008208906   2    1000014   -14
    0.0008208906   2   -1000014    14
    0.00082088972   2    1000012   -12
    0.00082088972   2   -1000012    12
    0.00059877038   2    1000016   -16
    0.00059877038   2   -1000016    16
    0.0002635468   2    2000011   -11
    0.0002635468   2   -2000011    11

DECAY 1000035  73.606459
    0.054402115   2    1000014   -14
    0.054402115   2   -1000014    14
    0.054402098   2    1000012   -12
    0.054402098   2   -1000012    12
    0.054048699   2    1000013   -13
    0.054048699   2   -1000013    13
    0.054045739   2    1000011   -11
    0.054045739   2   -1000011    11
    0.049686179   2    1000016   -16
    0.049686179   2   -1000016    16
    0.049410731   2    1000015   -15
    0.049410731   2   -1000015    15
    0.047938003   2    1000024   -24
    0.047938003   2   -1000024    24
    0.047344153   2    1000025    25
    0.04653708   2    1000025    23
    0.043503682   2    1000023    25
    0.03190096   2    37   -1000024
    0.03190096   2   -37    1000024
    0.031300777   2    1000023    35
    0.029080115   2    1000025    35
    0.0038030414   2    1000023    23
    0.0012447217   2    1000025    36
    0.0012021307   2    1000023    36
    0.00096146676   3    1000024    5   -6
    0.00096146676   3   -1000024   -5    6
    0.00054900331   2    1000006   -6
    0.00054900331   2   -1000006    6
    0.00042054267   3    1000025    6   -6
    0.00040265333   3    1000023    6   -6

DECAY 1000021  201.46427
    0.15813696   2    1000005   -5
    0.15813696   2   -1000005    5
    0.1476121   2    1000006   -6
    0.1476121   2   -1000006    6
    0.098229164   2    2000006   -6
    0.098229164   2   -2000006    6
    0.094847992   2    2000005   -5
    0.094847992   2   -2000005    5
    0.00089376233   2    1000006   -4
    0.00089376233   2   -1000006    4
    0.00019373704   3    1000035    6   -6
    0.00010772272   3    1000037    5   -6
    0.00010772272   3   -1000037   -5    6

DECAY 25  0.0040038096
    0.61424971   2   -5    5
    0.19550542   2   -24    24
    0.068593663   2   -15    15
    0.067244677   2    21    21
    0.027145947   2   -4    4
    0.023120042   2    23    23
    0.0021484884   2    22    22
    0.0012961682   2    22    23
    0.00023644899   2   -13    13
    0.00023118066   2   -3    3
    0.00022747189   2    1000022    1000022
    6.3920531e-07   2   -1    1
    1.3989255e-07   2   -2    2
    5.3152889e-09   2   -11    11

DECAY 35  34.075666
    0.92279079   2   -5    5
    0.076216178   2   -15    15
    0.00033585147   2   -3    3
    0.00023846621   2   -13    13
    0.0002076156   2   -6    6
    0.00010886838   2    21    21
    6.7580575e-05   2    1000022    1000022
    2.7643228e-05   2    25    25
    1.9223213e-06   2   -24    24
    9.5607259e-07   2    23    23
    9.2885391e-07   2   -1    1
    3.5335371e-07   2   -1000011    1000011
    3.3356695e-07   2   -1000013    1000013
    6.3485267e-08   2    22    22
    2.3775384e-08   2    22    23
    5.3587366e-09   2   -11    11
    2.910371e-09   2   -4    4
    1.5011827e-14   2   -2    2

DECAY 36  33.024596
    0.92269093   2   -5    5
    0.07620684   2   -15    15
    0.00033576319   2   -3    3
    0.00032230108   2   -6    6
    0.00023842483   2   -13    13
    0.00013115667   2    21    21
    7.1834271e-05   2    1000022    1000022
    1.6709233e-06   2    23    25
    9.2860974e-07   2   -1    1
    9.7704168e-08   2    22    22
    4.1513583e-08   2    22    23
    5.3578071e-09   2   -11    11
    2.9357168e-09   2   -4    4
    1.5191914e-14   2   -2    2
    2.4123554e-36   2    25    25

DECAY 37  26.314112
    0.84350386   2   -5    6
    0.15407236   2   -15    16
    0.0014416804   2   -5    4
    0.00054470972   2   -13    14
    0.00040093259   2   -3    4
    1.8386393e-05   2   -3    2
    1.0295173e-05   2   -5    2
    2.2600328e-06   2    24    25
    1.7240585e-06   2   -1000011    1000012
    1.6895277e-06   2   -1000013    1000014
    1.1136714e-06   2   -1    2
    8.9282009e-07   2   -3    6
    5.1118789e-08   2   -1    4
    1.8305652e-08   2   -1    6
    1.2740818e-08   2   -11    12
    5.8972975e-09   2    24    35
    5.1142067e-09   2    24    36

DECAY 6  2.43
    1   2    5    24

DECAY 15 -1
