BLOCK DCINFO
   1   SDECAY/HDECAY
   2   1.3b /3.4

BLOCK SPINFO
   1   SOFTSUSY
   2   3.4.0

BLOCK MODSEL
   1   0

BLOCK SMINPUTS
   1    127.90897
   2    1.1663787e-05
   3    0.1184
   4    91.1876
   5    4.18
   6    173.2
   7    1.777

BLOCK MINPAR
   3    8.16

BLOCK EXTPAR
   0   -1
   1    1374.36
   2   -2442.1
   3    2727.64
   11    3862.08
   12   -126.3
   13    257.5
   23   -925.97
   26    1849.46
   31    2880.01
   32    2880.01
   33    1535.19
   34    2104.6
   35    2104.6
   36    3855.74
   41    1745.27
   42    1745.27
   43    1771.04
   44    3000.54
   45    3000.54
   46    2247.65
   47    2515.9
   48    2515.9
   49    2055.8

BLOCK MASS
   24    80.413966
   25    127.88977
   35    1849.6172
   36    1849.4599
   37    1851.4981
   5    4.8187603
   1000001    1838.2811
   2000001    2585.2612
   1000002    1836.7462
   2000002    3059.213
   1000003    1838.2811
   2000003    2585.2612
   1000004    1836.7462
   2000004    3059.213
   1000005    1830.5931
   2000005    2129.5946
   1000006    1784.3167
   2000006    2267.0489
   1000011    2892.3114
   2000011    2108.7993
   1000012    2890.9592
   1000013    2892.3114
   2000013    2108.7993
   1000014    2890.9592
   1000015    1554.7425
   2000015    3858.85
   1000016    1552.524
   1000021    2766.0022
   1000022   -949.34402
   1000023    950.98326
   1000025    1372.695
   1000035   -2424.331
   1000024    950.16011
   1000037    2424.4937

BLOCK NMIX
   1   1    0.014979511
   1   2    0.04176988
   1   3    0.70711731
   1   4   -0.70570249
   2   1   -0.063239454
   2   2   -0.014291003
   2   3    0.70600535
   2   4    0.70523257
   3   1    0.99788584
   3   2   -0.0010533997
   3   3    0.034117951
   3   4    0.055305508
   4   1   -0.00047874195
   4   2    0.99902449
   4   3   -0.019429695
   4   4    0.039652529

BLOCK UMIX
   1   1    0.027489322
   1   2    0.9996221
   2   1   -0.9996221
   2   2    0.027489322

BLOCK VMIX
   1   1   -0.056109551
   1   2   -0.99842462
   2   1    0.99842462
   2   2   -0.056109551

BLOCK STOPMIX
   1   1    0.95315877
   1   2   -0.30247041
   2   1    0.30247041
   2   2    0.95315877

BLOCK SBOTMIX
   1   1    0.99989443
   1   2   -0.014530067
   2   1    0.014530067
   2   2    0.99989443

BLOCK STAUMIX
   1   1    0.99999941
   1   2   -0.0010890361
   2   1    0.0010890361
   2   2    0.99999941

BLOCK ALPHA
      -0.12846724

BLOCK HMIX Q=  1989.425
   1   -939.75652
   2    7.7948919
   3    243.10001
   4    3406164

BLOCK GAUGE Q=  1989.425
   1    0.36353789
   2    0.63647168
   3    1.0222163

BLOCK AU Q=  1989.425
   1   1    0
   2   2    0
   3   3    3862.08

BLOCK AD Q=  1989.425
   1   1    0
   2   2    0
   3   3   -126.3

BLOCK AE Q=  1989.425
   1   1    0
   2   2    0
   3   3    257.5

BLOCK YU Q=  1989.425
   1   1    0
   2   2    0
   3   3    0.85988847

BLOCK YD Q=  1989.425
   1   1    0
   2   2    0
   3   3    0.1128937

BLOCK YE Q=  1989.425
   1   1    0
   2   2    0
   3   3    0.081414718

BLOCK MSOFT Q=  1989.425
   1    1374.36
   2   -2442.1
   3    2727.64
   21    2421087.5
   22   -765888.3
   31    2880.01
   32    2880.01
   33    1535.19
   34    2104.6
   35    2104.6
   36    3855.74
   41    1745.27
   42    1745.27
   43    1771.04
   44    3000.54
   45    3000.54
   46    2247.65
   47    2515.9
   48    2515.9
   49    2055.8

BLOCK HIGGSBOUNDSINPUTHIGGSCOUPLINGSFERMIONS
       0, 60.760339,3,36,15,15

BLOCK HIGGSBOUNDSINPUTHIGGSCOUPLINGSBOSONS
       0,4,36,21,21,23

DECAY 6  1.4256233
    1   2    5    24

DECAY 1000021  115.11937
    0.083889145   2    1000006   -6
    0.083889145   2   -1000006    6
    0.070752706   2    1000002   -2
    0.070752706   2   -1000002    2
    0.070752632   2    1000004   -4
    0.070752632   2   -1000004    4
    0.070566219   2    1000001   -1
    0.070566219   2   -1000001    1
    0.070566219   2    1000003   -3
    0.070566219   2   -1000003    3
    0.070536124   2    1000005   -5
    0.070536124   2   -1000005    5
    0.037225756   2    2000005   -5
    0.037225756   2   -2000005    5
    0.018475276   2    2000006   -6
    0.018475276   2   -2000006    6
    0.0036179612   2    2000001   -1
    0.0036179612   2   -2000001    1
    0.0036179612   2    2000003   -3
    0.0036179612   2   -2000003    3

DECAY 1000006  14.809728
    0.46997121   2    1000023    6
    0.40320288   2    1000022    6
    0.12005935   2    1000024    5
    0.0067665647   2    1000025    6

DECAY 2000006  99.158637
    0.26781238   2    1000005    24
    0.20194168   2    1000024    5
    0.16363867   2    1000006    23
    0.12461737   2    1000006    25
    0.11550151   2    1000022    6
    0.10723326   2    1000023    6
    0.019253902   2    1000025    6
    1.2260093e-06   2    2000005    24

DECAY 1000005  14.074693
    0.97827681   2   -1000024    6
    0.0092690988   2    1000022    5
    0.0087953323   2    1000023    5
    0.0036587542   2    1000025    5

DECAY 2000005  1.1699324
    0.36219643   2    1000025    5
    0.29777999   2   -1000024    6
    0.14973369   2    1000023    5
    0.14754786   2    1000022    5
    0.023996321   2    1000006   -24
    0.010143734   2    1000005    25
    0.0086019733   2    1000005    23

DECAY 1000002  0.088036423
    0.593455   2    1000025    2
    0.28497659   2    1000024    1
    0.090228007   2    1000022    2
    0.031340405   2    1000023    2

DECAY 2000002  11.954811
    0.63402364   2    1000021    2
    0.36400694   2    1000025    2
    0.0018647039   2    1000023    2
    0.00010469946   2    1000022    2
    1.8587831e-08   2    1000035    2

DECAY 1000001  0.065791105
    0.81595572   2    1000025    1
    0.092025146   2    1000022    1
    0.091712119   2   -1000024    2
    0.0003070145   2    1000023    1

DECAY 2000001  0.76450953
    0.99390814   2    1000025    1
    0.0057678909   2    1000023    1
    0.00032396619   2    1000022    1
    6.854521e-09   2    1000035    1

DECAY 1000004  0.087152359
    0.59081326   2    1000025    4
    0.28682818   2    1000024    3
    0.090814932   2    1000022    4
    0.031543626   2    1000023    4

DECAY 2000004  10.214361
    0.55299534   2    1000021    4
    0.44459193   2    1000025    4
    0.0022844403   2    1000023    4
    0.00012826815   2    1000022    4
    2.2199688e-08   2    1000035    4

DECAY 1000003  0.064978174
    0.8143146   2    1000025    3
    0.092846286   2    1000022    3
    0.092529362   2   -1000024    4
    0.00030974768   2    1000023    3

DECAY 2000003  0.78033562
    0.99388681   2    1000025    3
    0.0057880852   2    1000023    3
    0.00032510376   2    1000022    3
    6.4551316e-09   2    1000035    3

DECAY 1000011  5.4128641
    0.41831121   2    1000025    11
    0.38041044   2   -1000037    12
    0.18999434   2    1000035    11
    0.0043527898   2    1000023    11
    0.0043415596   2    1000022    11
    0.0025896527   2   -1000024    12

DECAY 2000011  3.6968501
    0.99195906   2    1000025    11
    0.0076130448   2    1000023    11
    0.00042789857   2    1000022    11

DECAY 1000013  5.4128641
    0.41831121   2    1000025    13
    0.38041045   2   -1000037    14
    0.18999434   2    1000035    13
    0.0043527899   2    1000023    13
    0.0043415596   2    1000022    13
    0.0025896528   2   -1000024    14

DECAY 2000013  3.6968501
    0.99195906   2    1000025    13
    0.0076130448   2    1000023    13
    0.00042789857   2    1000022    13

DECAY 1000015  0.19506182
    0.50540504   2    1000025    15
    0.23845249   2    1000022    15
    0.23689606   2    1000023    15
    0.019246411   2   -1000024    16

DECAY 2000015  16.440511
    0.93769512   2    1000025    15
    0.027278533   2   -1000024    16
    0.017963748   2    1000023    15
    0.013897021   2    1000022    15
    0.0015175372   2    1000016   -24
    0.00080923909   2    1000015    25
    0.00078078922   2    1000015    23
    1.7976391e-05   2    1000016   -37
    1.4694089e-05   2   -1000037    16
    9.0026265e-06   2    1000015    36
    8.8892037e-06   2    1000015    35
    7.4473465e-06   2    1000035    15

DECAY 1000012  5.4204231
    0.42040187   2    1000025    12
    0.37711978   2    1000037    11
    0.18901011   2    1000035    12
    0.010766625   2    1000024    11
    0.0018871096   2    1000022    12
    0.00081451201   2    1000023    12

DECAY 1000014  5.420423
    0.42040187   2    1000025    14
    0.37711977   2    1000037    13
    0.18901011   2    1000035    14
    0.010766625   2    1000024    13
    0.0018871096   2    1000022    14
    0.00081451202   2    1000023    14

DECAY 1000016  0.19630443
    0.49494458   2    1000025    16
    0.48534605   2    1000024    15
    0.013780865   2    1000022    16
    0.0059285017   2    1000023    16

DECAY 1000024  1.3383582e-12
    0.5984099   2    1000022    211
    0.15795371   3    1000022   -11    12
    0.14554403   3    1000022   -13    14
    0.097409271   3    1000022    211    111
    0.00034154672   4    1000022    211    111    111
    0.00034154672   4    1000022    211    211   -211

DECAY 1000037  59.675391
    0.092521804   2    1000024    25
    0.09026166   2    1000024    23
    0.088998302   2    1000006   -5
    0.08873726   2    1000002   -1
    0.088737245   2    1000004   -3
    0.088555873   2   -1000001    2
    0.088555627   2   -1000003    4
    0.087578782   2    1000022    24
    0.087428751   2    1000023    24
    0.08382548   2   -1000005    6
    0.056799626   2    1000016   -15
    0.056709686   2   -1000015    16
    0.0010855189   2    2000006   -5
    0.00019693549   2    1000025    24
    7.4495332e-06   2   -2000005    6

DECAY 1000022 -1


DECAY 1000023  1.1528134e-11
    0.24090872   2    1000022    22
    0.15542853   3    1000022   -1    1
    0.15542853   3    1000022   -3    3
    0.11974742   3    1000022   -2    2
    0.071382518   3    1000022   -12    12
    0.071382518   3    1000022   -14    14
    0.071382174   3    1000022   -16    16
    0.035700175   3    1000022   -11    11
    0.035700175   3    1000022   -13    13
    0.012881802   3    1000024   -2    1
    0.012881802   3   -1000024   -1    2
    0.0042939084   3    1000024   -12    11
    0.0042939084   3   -1000024    12   -11
    0.0042939084   3    1000024   -14    13
    0.0042939084   3   -1000024    14   -13

DECAY 1000025  1.877346
    0.25022102   2    1000023    25
    0.24400168   2    1000024   -24
    0.24400168   2   -1000024    24
    0.23403943   2    1000022    23
    0.014757155   2    1000023    23
    0.012979016   2    1000022    25

DECAY 1000035  59.642836
    0.087837415   2    1000024   -24
    0.087837415   2   -1000024    24
    0.082996301   2    1000022    25
    0.080421171   2    1000023    23
    0.045292631   2    1000005   -5
    0.045292631   2   -1000005    5
    0.04441952   2    1000002   -2
    0.04441952   2   -1000002    2
    0.044419397   2    1000004   -4
    0.044419397   2   -1000004    4
    0.04423866   2    1000001   -1
    0.04423866   2   -1000001    1
    0.04423866   2    1000003   -3
    0.04423866   2   -1000003    3
    0.041523384   2    1000006   -6
    0.041523384   2   -1000006    6
    0.028458007   2    1000016   -16
    0.028458007   2   -1000016    16
    0.028313508   2    1000015   -15
    0.028313508   2   -1000015    15
    0.0094966914   2    1000022    23
    0.0093922921   2    1000023    25
    0.00019432079   2    1000025    23
    7.2216193e-06   2    1000025    25
    4.8157179e-06   2    2000005   -5
    4.8157179e-06   2   -2000005    5
    1.4507112e-09   2    2000011   -11
    1.4507112e-09   2   -2000011    11
    1.4507112e-09   2    2000013   -13
    1.4507112e-09   2   -2000013    13

DECAY 25  0.0044000285
    0.5439366   2    5   -5
    0.25938222   2    24   -24
    0.077105794   2    21    21
    0.060983646   2   -15    15
    0.033881668   2    23    23
    0.020071854   2    4   -4
    0.0023635098   2    22    22
    0.001824185   2    22    23
    0.00023465725   2    3   -3
    0.00021585789   2   -13    13

DECAY 35  3.0246494
    0.48994651   2    5   -5
    0.43109326   2    6   -6
    0.075497071   2   -15    15
    0.0019233755   2    25    25
    0.00051094023   2    24   -24
    0.0003060302   2    21    21
    0.00026874046   2   -13    13
    0.00025436741   2    23    23
    0.00019376768   2    3   -3
    4.4735212e-06   2    4   -4
    1.0309445e-06   2    22    22
    4.3207166e-07   2    23    22

DECAY 36  3.0344634
    0.4886396   2    5   -5
    0.43444628   2    6   -6
    0.075263896   2   -15    15
    0.00067000115   2    21    21
    0.00051252785   2    23    25
    0.00026790926   2   -13    13
    0.00019339411   2    3   -3
    4.4389785e-06   2    4   -4
    1.2251602e-06   2    22    22
    7.234991e-07   2    23    22

DECAY 37  3.0236111
    0.92254667   2    6   -5
    0.075617276   2   -15    16
    0.00083679543   2    4   -5
    0.00051694442   2    24    25
    0.00026916715   2   -13    14
    0.00019508271   2    4   -3
    9.6942679e-06   2    2   -3
    8.3678579e-06   2    2   -5
    1.5293672e-11   2    24    36

DECAY 5 -1


DECAY 15 -1


DECAY 23  2.4952


DECAY 24  2.085
