BLOCK SPINFO
   1   SPheno
   2   v4.0.5be

BLOCK SPHENOINFO
   1   2
   2   2

BLOCK MODSEL
   1   0

BLOCK MINPAR
   3    19.949922
   4   -1

BLOCK EXTPAR
   0    3289.93
   1   -854.56403
   2   -815.8566
   3    1625.7984
   11    1875.8139
   12    4861.8894
   13   -4422.6227
   23   -2294.959
   25    19.094747
   26    1692.4832
   31    2068.9102
   32    2068.9102
   33    1418.1663
   34    2726.7279
   35    2726.7279
   36    4557.6012
   41    3460.071
   42    3460.071
   43    2701.0156
   44    3137.1557
   45    3137.1557
   46    3921.056
   47    2991.7208
   48    2991.7208
   49    4771.1965

BLOCK SMINPUTS
   1    127.90897
   2    1.1663787e-05
   3    0.1184
   4    91.1876
   5    4.18
   6    173.2
   7    1.777
   8    0
   11    0.00051099893
   12    0
   13    0.10565837
   14    0
   21    0.005
   22    0.0025
   23    0.095
   24    1.27

BLOCK GAUGE Q=  3289.93
   1    0.35536298
   2    0.66519887
   3    1.219778

BLOCK YU Q=  3289.93
   1   1    8.395862e-06
   2   2    0.0042650979
   3   3    1.0142876

BLOCK YD Q=  3289.93
   1   1    0.00032215098
   2   2    0.0061208685
   3   3    0.31947282

BLOCK YE Q=  3289.93
   1   1    5.6217701e-05
   2   2    0.011624038
   3   3    0.19549719

BLOCK AU Q=  3289.93
   1   1    0
   2   2    0
   3   3    1875.8139

BLOCK AD Q=  3289.93
   1   1    0
   2   2    0
   3   3    4861.8908

BLOCK AE Q=  3289.93
   1   1    0
   2   2    0
   3   3   -4422.6227

BLOCK MSOFT Q=  3289.93
   1   -854.56403
   2   -815.8566
   3    1625.7984
   21   -2500587.4
   22   -5097567.9
   31    2068.9102
   32    2068.9102
   33    1418.1663
   34    2726.7279
   35    2726.7279
   36    4557.6012
   41    3460.071
   42    3460.071
   43    2701.0156
   44    3137.1557
   45    3137.1557
   46    3921.056
   47    2991.7208
   48    2991.7208
   49    4771.1965

BLOCK MASS
   6    173.2
   23    91.1876
   24    80.429995
   15    1.777
   25    120.2322
   35    1692.5202
   36    1692.4832
   37    1694.8191
   1000001    3521.8585
   2000001    3048.0167
   1000002    3521.0561
   2000002    3192.2806
   1000003    3521.8572
   2000003    3048.0147
   1000004    3521.0548
   2000004    3192.2802
   1000005    2756.0035
   2000005    4813.2778
   1000006    2757.5923
   2000006    3925.0324
   1000011    2075.7859
   2000011    2730.8229
   1000012    2073.8758
   1000013    2075.7812
   2000013    2730.8153
   1000014    2073.8727
   1000015    1426.65
   2000015    4557.7845
   1000016    1424.1497
   1000021    1905.0962
   1000022   -847.77461
   1000023   -854.91636
   1000025    2305.3178
   1000035   -2307.1828
   1000024    854.95294
   1000037    2307.7558

BLOCK ALPHA
      -0.050482984

BLOCK HMIX Q=  3289.93
   1   -2294.959
   2    19.094747
   3    243.15079
   4    2864499.5

BLOCK STOPMIX
   1   1   -0.99949248
   1   2    0.031855644
   2   1   -0.031855644
   2   2   -0.99949248

BLOCK SBOTMIX
   1   1   -0.99997081
   1   2    0.0076407219
   2   1   -0.0076407219
   2   2   -0.99997081

BLOCK STAUMIX
   1   1   -0.99999295
   1   2    0.0037543307
   2   1   -0.0037543307
   2   2   -0.99999295

BLOCK NMIX
   1   1    0.99213785
   1   2   -0.1215964
   1   3   -0.027346353
   1   4    0.011357332
   2   1    0.12272387
   2   2    0.99164193
   2   3    0.036842354
   2   4   -0.01509219
   3   1    0.0093447541
   3   2   -0.016652546
   3   3    0.70677863
   3   4    0.70717702
   4   1    0.022672072
   4   2   -0.039790586
   4   3    0.70594531
   4   4   -0.7067842

BLOCK UMIX
   1   1   -0.99840634
   1   2   -0.056433807
   2   1   -0.056433807
   2   2    0.99840634

BLOCK VMIX
   1   1    0.99973175
   1   2    0.023161104
   2   1    0.023161104
   2   2   -0.99973175

BLOCK HIGGSBOUNDSINPUTHIGGSCOUPLINGSFERMIONS
       0, 364.60937,3,36,15,15

BLOCK HIGGSBOUNDSINPUTHIGGSCOUPLINGSBOSONS
       0,4,36,21,21,23

BLOCK SPHENOLOWENERGY
   1    0.00033437645
   2    1.5887364e-06
   3    3.5254182e-05
   4    2.5429912e-15
   5    1.0863365e-10
   6    2.2738427e-08
   7    8.6091864e-14
   8    3.6778398e-09
   9    7.7999358e-07
   10    9.602662e-05
   11    0.99191822
   12    0.54195746
   13    19.360817
   14    0
   15    0
   16    0.0021572616
   17    2.2816587e-15
   18    2.4799479e-11
   19    8.2904082e-11
   20    1.7186527e-15
   21    7.3477483e-11
   22    2.8950854e-08
   23    0
   24    0
   25    0
   26    0
   27    0
   28    0
   29    0
   30    0
   31    0
   39    6.2129335e-05
   40    0
   41    0
   42    0

BLOCK FWCOEF Q=  160
   305   4422   0   0   -0.18881911
   305   4422   0   2   -0.20290756
   305   4322   0   2   -0.00028771376
   305   6421   0   0   -0.095227835
   305   6421   0   2   -0.11352336
   305   6321   0   2   -0.00036665693
   3051111   4133   0   0    1.6195442
   3051111   4133   0   2    1.6197535
   3051111   4233   0   2    4.0048932e-05
   3051111   4137   0   0   -4.4422363
   3051111   4137   0   2   -4.4406897
   3051111   4237   0   2   -0.00030015236
   3051313   4133   0   0    1.6195442
   3051313   4133   0   2    1.6197533
   3051313   4233   0   2    4.0048772e-05
   3051313   4137   0   0   -4.4422363
   3051313   4137   0   2   -4.44069
   3051313   4237   0   2   -0.00030015227
   3051212   4137   0   0    1.5053501
   3051212   4137   0   2    1.5050248
   3051212   4237   0   2    6.5010081e-05
   3051414   4137   0   0    1.5053501
   3051414   4137   0   2    1.5050248
   3051414   4237   0   2    6.5010112e-05
   3051616   4137   0   0    1.5053501
   3051616   4137   0   2    1.505025
   3051616   4237   0   2    6.5018841e-05

BLOCK IMFWCOEF Q=  160
   305   4422   0   0    3.8583695e-07
   305   4422   0   2    4.9135194e-06
   305   4322   0   2    6.3441606e-07
   305   6421   0   0    3.3049486e-07
   305   6421   0   2    1.7247387e-05
   305   6321   0   2    6.2151907e-07
   3051111   4133   0   2    4.4418573e-07
   3051111   4233   0   2    1.1563863e-06
   3051111   4137   0   2   -6.4575254e-09
   3051111   4237   0   2   -8.6609301e-06
   3051313   4133   0   2    4.4418187e-07
   3051313   4233   0   2    1.156386e-06
   3051313   4137   0   2   -6.4546051e-09
   3051313   4237   0   2   -8.6609311e-06
   3051212   4137   0   2    1.7825366e-07
   3051212   4237   0   2    1.8758573e-06
   3051414   4137   0   2    1.7825373e-07
   3051414   4237   0   2    1.8758573e-06
   3051616   4137   0   2    1.8123444e-07
   3051616   4237   0   2    1.875858e-06

DECAY 23  2.4952


DECAY 24  2.085


DECAY 1000011  20.658722
    0.60794376   2   -1000024    12
    0.34084047   2    1000023    11
    0.051215767   2    1000022    11

DECAY 2000011  11.197316
    0.98492379   2    1000022    11
    0.015015779   2    1000023    11

DECAY 1000013  20.658646
    0.60794351   2   -1000024    14
    0.34084061   2    1000023    13
    0.05121588   2    1000022    13

DECAY 2000013  11.199575
    0.98472154   2    1000022    13
    0.015013407   2    1000023    13

DECAY 1000015  8.46489
    0.60748317   2   -1000024    16
    0.34068415   2    1000023    15
    0.051832677   2    1000022    15

DECAY 2000015  31.493952
    0.66713857   2    1000022    15
    0.079353774   2    1000016   -37
    0.060741248   2   -1000037    16
    0.039676877   2    1000015    36
    0.039607988   2    1000015    35
    0.030578909   2    1000035    15
    0.030490949   2    1000025    15
    0.021157608   2    1000016   -24
    0.010562774   2    1000015    23
    0.010279622   2    1000023    15
    0.010216261   2    1000015    25
    0.00019542288   2   -1000024    16

DECAY 1000012  20.654351
    0.60866836   2    1000024    11
    0.26115376   2    1000023    12
    0.13017788   2    1000022    12

DECAY 1000014  20.654307
    0.60866857   2    1000024    13
    0.26115362   2    1000023    14
    0.13017782   2    1000022    14

DECAY 1000016  8.4360574
    0.60775525   2    1000024    15
    0.26072847   2    1000023    16
    0.13151628   2    1000022    16

DECAY 2000001  90.777748
    0.98405077   2    1000021    1
    0.015707493   2    1000022    1
    0.00023965582   2    1000023    1

DECAY 1000001  180.65537
    0.77001395   2    1000021    1
    0.15149984   2   -1000024    2
    0.071470336   2    1000023    1
    0.0067747838   2    1000022    1
    0.00017796548   2   -1000037    2

DECAY 2000003  90.778373
    0.9840417   2    1000021    3
    0.015707389   2    1000022    3
    0.00023968248   2    1000023    3

DECAY 1000003  180.65662
    0.77000788   2    1000021    3
    0.15149866   2   -1000024    4
    0.071469829   2    1000023    3
    0.006774744   2    1000022    3
    0.000180297   2   -1000037    4

DECAY 1000005  94.262365
    0.62920005   2    1000021    5
    0.20722786   2   -1000024    6
    0.098961724   2    1000023    5
    0.049831108   2   -1000037    6
    0.0094422137   2    1000022    5
    0.0026751025   2    1000025    5
    0.0026619394   2    1000035    5

DECAY 2000005  294.28017
    0.91823254   2    1000021    5
    0.019636553   2   -1000037    6
    0.011878202   2    1000006   -37
    0.0098586081   2    1000025    5
    0.0098374737   2    1000035    5
    0.0084503468   2    1000022    5
    0.0059954868   2    1000005    35
    0.0059855537   2    1000005    36
    0.0045472313   2    1000006   -24
    0.0030972734   2    1000005    25
    0.0022780415   2    1000005    23
    0.0001510245   2    1000023    5

DECAY 2000002  110.61157
    0.94434726   2    1000021    2
    0.054807445   2    1000022    2
    0.00083644579   2    1000023    2

DECAY 1000002  180.60944
    0.76974397   2    1000021    2
    0.15189769   2    1000024    1
    0.078055366   2    1000023    2
    0.00023099681   2    1000022    2

DECAY 2000004  110.61195
    0.94434272   2    1000021    4
    0.054807227   2    1000022    4
    0.00083644376   2    1000023    4

DECAY 1000004  180.61046
    0.76973837   2    1000021    4
    0.15189679   2    1000024    3
    0.078054867   2    1000023    4
    0.00023099595   2    1000022    4

DECAY 1000006  120.39303
    0.47457768   2    1000021    6
    0.19726909   2    1000021    4
    0.16495864   2    1000024    5
    0.084161239   2    1000023    6
    0.033785941   2    1000023    4
    0.019955779   2    1000025    6
    0.019267919   2    1000035    6
    0.0041658298   2    1000037    5
    0.001353785   3    1000022    24    5
    0.00040396688   2    1000022    6
    0.00010013127   2    1000022    4

DECAY 2000006  269.97786
    0.6684667   2    1000021    6
    0.12733058   2    1000037    5
    0.062936497   2    1000025    6
    0.062807308   2    1000035    6
    0.02891098   2    1000022    6
    0.020002231   2    1000005    24
    0.019155577   2    1000006    25
    0.0099368365   2    1000006    23
    0.00045182367   2    1000023    6

DECAY 1000024  4.4455973e-09
    0.3602033   3    1000022   -1    2
    0.30947354   3    1000022   -3    4
    0.12021815   3    1000022   -11    12
    0.12008871   3    1000022   -13    14
    0.090016313   3    1000022   -15    16

DECAY 1000037  17.753022
    0.31795274   2    1000023    24
    0.29556393   2    1000024    25
    0.27970458   2    1000024    23
    0.055641455   2    1000022    24
    0.018995913   2    1000016   -15
    0.017121729   3    1000024    6   -6
    0.011569933   3    1000023   -5    6
    0.001960793   3    1000022   -5    6
    0.0006686672   2   -1000015    16
    0.00056442381   3    1000024    5   -5

DECAY 1000022 -1


DECAY 1000023  2.8009347e-13
    0.78967492   2    1000022    22
    0.073798116   3    1000022    12   -12
    0.036031206   3    1000022    1   -1
    0.035963331   3    1000022    3   -3
    0.023648542   3    1000022    15   -15
    0.021790645   3    1000022    2   -2
    0.014304295   3    1000022    4   -4
    0.0023953039   3    1000022    11   -11
    0.0023936432   3    1000022    13   -13

DECAY 1000025  21.174871
    0.23451959   2    1000024   -24
    0.23451959   2   -1000024    24
    0.17099572   2    1000023    23
    0.14911318   2    1000023    25
    0.095720114   2    1000022    23
    0.073694344   2    1000022    25
    0.0094371142   3    1000024    5   -6
    0.0094371142   3   -1000024   -5    6
    0.0078809977   2    1000015   -15
    0.0078809977   2   -1000015    15
    0.0040828861   3    1000023    6   -6
    0.0021912744   3    1000022    6   -6
    0.00023450049   3    1000023    5   -5
    0.00010151151   3    1000022    5   -5

DECAY 1000035  17.620858
    0.28358518   2    1000024   -24
    0.28358518   2   -1000024    24
    0.21839979   2    1000023    25
    0.10790932   2    1000022    25
    0.035999075   2    1000023    23
    0.019607006   2    1000022    23
    0.0106399   3    1000024    5   -6
    0.0106399   3   -1000024   -5    6
    0.0095393934   2    1000015   -15
    0.0095393934   2   -1000015    15
    0.0060823897   3    1000023    6   -6
    0.0032766847   3    1000022    6   -6
    0.00029741175   2    1000016   -16
    0.00029741175   2   -1000016    16
    0.00024666598   3    1000023    5   -5
    0.0001047139   3    1000022    5   -5

DECAY 1000021  0.0057476839
    0.15444468   3    1000023    5   -5
    0.12856769   3    1000023    6   -6
    0.12022316   3    1000024    5   -6
    0.12022316   3   -1000024   -5    6
    0.048606549   3    1000023    2   -2
    0.048605879   3    1000023    4   -4
    0.044110402   3    1000023    3   -3
    0.044110294   3    1000023    1   -1
    0.038750395   3    1000022    2   -2
    0.038749831   3    1000022    4   -4
    0.038055134   3    1000024    1   -2
    0.038055134   3   -1000024   -1    2
    0.038054948   3    1000024    3   -4
    0.038054948   3   -1000024   -3    4
    0.016460135   3    1000022    3   -3
    0.016460067   3    1000022    1   -1
    0.016450582   3    1000022    5   -5
    0.012008363   3    1000022    6   -6

DECAY 25  0.0033850479
    0.64531831   2   -5    5
    0.15451191   2   -24    24
    0.074271811   2    21    21
    0.073582146   2   -15    15
    0.031446004   2   -4    4
    0.01699344   2    23    23
    0.0022894355   2    22    22
    0.0010886614   2    22    23
    0.00025519512   2   -13    13
    0.00024225225   2   -3    3
    6.6980269e-07   2   -1    1
    1.6206455e-07   2   -2    2
    5.7371372e-09   2   -11    11

DECAY 35  11.979956
    0.85781838   2   -5    5
    0.12345978   2   -15    15
    0.017773603   2   -6    6
    0.00042156713   2   -13    13
    0.00032288933   2   -3    3
    7.3553575e-05   2   -1000024    1000024
    4.5576819e-05   2    25    25
    3.8347669e-05   2    1000022    1000022
    1.5621409e-05   2    23    23
    1.4105143e-05   2    21    21
    1.0522699e-05   2   -24    24
    4.7540111e-06   2    1000022    1000023
    8.926364e-07   2   -1    1
    2.4385984e-07   2   -4    4
    1.1150561e-07   2    22    23
    4.1068057e-08   2    22    22
    9.4698394e-09   2   -11    11
    1.2571515e-12   2   -2    2

DECAY 36  11.682456
    0.85635449   2   -5    5
    0.12325036   2   -15    15
    0.017691326   2   -6    6
    0.0011054542   2   -1000024    1000024
    0.00057610504   2    1000022    1000022
    0.00042084748   2   -13    13
    0.00032233237   2   -3    3
    0.0001875994   2    1000022    1000023
    6.8737559e-05   2    21    21
    2.1207273e-05   2    23    25
    8.9109615e-07   2   -1    1
    2.8497304e-07   2    22    23
    2.3203091e-07   2   -4    4
    1.1788266e-07   2    22    22
    9.4536751e-09   2   -11    11
    1.1961375e-12   2   -2    2
    8.7232522e-37   2    25    25

DECAY 37  11.408328
    0.87945747   2   -5    6
    0.11824377   2   -15    16
    0.001291082   2   -5    4
    0.00041803456   2   -13    14
    0.00030110372   2   -3    4
    0.0002190007   2    1000023    1000024
    2.2437418e-05   2   -3    6
    2.1851365e-05   2    24    25
    1.3997479e-05   2   -3    2
    9.219663e-06   2   -5    2
    1.00908e-06   2   -1    6
    8.3485512e-07   2   -1    2
    1.3749972e-07   2    1000022    1000024
    4.8078568e-08   2   -1    4
    9.7778718e-09   2   -11    12
    8.288248e-12   2    24    36
    7.6539492e-12   2    24    35

DECAY 6  2.43
    1   2    5    24

DECAY 15 -1
