BLOCK SPINFO
   1   SPheno
   2   v4.0.5be

BLOCK SPHENOINFO
   1   2
   2   2

BLOCK MODSEL
   1   0

BLOCK MINPAR
   3    55.824128
   4    1

BLOCK EXTPAR
   0    3672.9424
   1   -1360.0126
   2   -4861.9297
   3    3665.0181
   11   -2158.3635
   12   -5466.1333
   13   -4823.0813
   23    1024.0617
   25    55.167281
   26    4639.6242
   31    3921.2148
   32    3921.2148
   33    1827.2606
   34    2899.6306
   35    2899.6306
   36    4492.3402
   41    1453.9238
   42    1453.9238
   43    3684.0802
   44    2756.9438
   45    2756.9438
   46    3456.0064
   47    1270.0821
   48    1270.0821
   49    4484.3313

BLOCK SMINPUTS
   1    127.90897
   2    1.1663787e-05
   3    0.1184
   4    91.1876
   5    4.18
   6    173.2
   7    1.777
   8    0
   11    0.00051099893
   12    0
   13    0.10565837
   14    0
   21    0.005
   22    0.0025
   23    0.095
   24    1.27

BLOCK GAUGE Q=  3672.9424
   1    0.35536298
   2    0.66519887
   3    1.219778

BLOCK YU Q=  3672.9424
   1   1    8.3857495e-06
   2   2    0.0042599607
   3   3    1.0130659

BLOCK YD Q=  3672.9424
   1   1    0.00092961626
   2   2    0.017662709
   3   3    0.92188803

BLOCK YE Q=  3672.9424
   1   1    0.00016222484
   2   2    0.033542951
   3   3    0.56413725

BLOCK AU Q=  3672.9424
   1   1    0
   2   2    0
   3   3   -2158.364

BLOCK AD Q=  3672.9424
   1   1    0
   2   2    0
   3   3   -5466.1409

BLOCK AE Q=  3672.9424
   1   1    0
   2   2    0
   3   3   -4823.081

BLOCK MSOFT Q=  3672.9424
   1   -1360.0126
   2   -4861.9297
   3    3665.0181
   21    20787506
   22   -806830.48
   31    3921.2148
   32    3921.2148
   33    1827.2606
   34    2899.6306
   35    2899.6306
   36    4492.3402
   41    1453.9238
   42    1453.9238
   43    3684.0802
   44    2756.9438
   45    2756.9438
   46    3456.0064
   47    1270.0821
   48    1270.0821
   49    4484.3313

BLOCK MASS
   6    173.2
   23    91.1876
   24    80.429995
   15    1.777
   25    120.162
   35    4637.9978
   36    4639.6242
   37    4638.8165
   1000001    1703.603
   2000001    1496.6272
   1000002    1701.7278
   2000002    2911.8414
   1000003    1703.5997
   2000003    1496.6161
   1000004    1701.7231
   2000004    2911.8409
   1000005    3807.4683
   2000005    4557.6654
   1000006    3534.6629
   2000006    3816.6315
   1000011    3949.6595
   2000011    2909.3327
   1000012    3948.4321
   1000013    3949.615
   2000013    2909.2341
   1000014    3948.3859
   1000015    1850.2283
   2000015    4473.6039
   1000016    1848.2243
   1000021    3777.4049
   1000022   -1040.3721
   1000023    1045.0639
   1000025   -1348.8426
   1000035   -4802.4274
   1000024    1043.8206
   1000037    4802.4821

BLOCK ALPHA
      -0.017925265

BLOCK HMIX Q=  3672.9424
   1    1024.0617
   2    55.167281
   3    243.05611
   4    21526113

BLOCK STOPMIX
   1   1    0.15930843
   1   2    0.98722886
   2   1   -0.98722886
   2   2    0.15930843

BLOCK SBOTMIX
   1   1    0.99981834
   1   2    0.019059872
   2   1   -0.019059872
   2   2    0.99981834

BLOCK STAUMIX
   1   1    0.99998034
   1   2    0.006270542
   2   1   -0.006270542
   2   2    0.99998034

BLOCK NMIX
   1   1   -0.10036307
   1   2    0.0141938
   1   3   -0.7047931
   1   4   -0.70213423
   2   1    0.013340329
   2   2   -0.0095898814
   2   3   -0.70672352
   2   4    0.70729904
   3   1    0.99486142
   3   2    0.0017765975
   3   3   -0.061623217
   3   4   -0.080313015
   4   1   -0.00021503468
   4   2    0.9998517
   4   3    0.0033362718
   4   4    0.016894056

BLOCK UMIX
   1   1   -0.0047175511
   1   2    0.99998887
   2   1   -0.99998887
   2   2   -0.0047175511

BLOCK VMIX
   1   1    0.023890791
   1   2    0.99971457
   2   1    0.99971457
   2   2   -0.023890791

BLOCK HIGGSBOUNDSINPUTHIGGSCOUPLINGSFERMIONS
       0, 3043.4289,3,36,15,15

BLOCK HIGGSBOUNDSINPUTHIGGSCOUPLINGSBOSONS
       0,4,36,21,21,23

BLOCK SPHENOLOWENERGY
   1    0.00031482922
   2    1.5911785e-06
   3    3.5254326e-05
   4    2.5663797e-15
   5    1.0963197e-10
   6    2.2904326e-08
   7    8.5976544e-14
   8    3.6728885e-09
   9    7.7759618e-07
   10    9.6135171e-05
   11    0.99303951
   12    0.54189419
   13    19.358071
   14    0
   15    0
   16    0.0021571201
   17    2.2816572e-15
   18    2.4802371e-11
   19    8.2906559e-11
   20   -1.1248538e-15
   21   -4.8088682e-11
   22   -2.5444827e-08
   23    0
   24    0
   25    0
   26    0
   27    0
   28    0
   29    0
   30    0
   31    0
   39    7.0735133e-05
   40    0
   41    0
   42    0

BLOCK FWCOEF Q=  160
   305   4422   0   0   -0.18881911
   305   4422   0   2   -0.18152062
   305   4322   0   2    0.00027743954
   305   6421   0   0   -0.095227835
   305   6421   0   2   -0.095442697
   305   6321   0   2    6.3351221e-05
   3051111   4133   0   0    1.6248029
   3051111   4133   0   2    1.6252445
   3051111   4233   0   2    0.00036507363
   3051111   4137   0   0   -4.447495
   3051111   4137   0   2   -4.4461016
   3051111   4237   0   2   -0.0027091802
   3051313   4133   0   0    1.6248029
   3051313   4133   0   2    1.6252436
   3051313   4233   0   2    0.00036507241
   3051313   4137   0   0   -4.447495
   3051313   4137   0   2   -4.4461025
   3051313   4237   0   2   -0.0027091824
   3051212   4137   0   0    1.5053501
   3051212   4137   0   2    1.5050488
   3051212   4237   0   2    0.00058607598
   3051414   4137   0   0    1.5053501
   3051414   4137   0   2    1.5050488
   3051414   4237   0   2    0.00058607603
   3051616   4137   0   0    1.5053501
   3051616   4137   0   2    1.5050485
   3051616   4237   0   2    0.00058608926

BLOCK IMFWCOEF Q=  160
   305   4422   0   0    3.8584155e-07
   305   4422   0   2   -3.4135096e-06
   305   4322   0   2    6.0384769e-06
   305   6421   0   0    3.3049881e-07
   305   6421   0   2   -8.7716239e-06
   305   6321   0   2    2.6223727e-06
   3051111   4133   0   2   -7.0680275e-07
   3051111   4233   0   2    7.1941181e-06
   3051111   4137   0   2    6.1246592e-06
   3051111   4237   0   2   -5.3388209e-05
   3051313   4133   0   2   -7.067973e-07
   3051313   4233   0   2    7.1941007e-06
   3051313   4137   0   2    6.1246648e-06
   3051313   4237   0   2   -5.3388252e-05
   3051212   4137   0   2   -1.323931e-06
   3051212   4237   0   2    1.1549451e-05
   3051414   4137   0   2   -1.3239313e-06
   3051414   4237   0   2    1.1549451e-05
   3051616   4137   0   2   -1.3284977e-06
   3051616   4237   0   2    1.1549451e-05

DECAY 23  2.4952


DECAY 24  2.085


DECAY 2000011  9.0309687
    0.98737991   2    1000025    11
    0.012401371   2    1000022    11
    0.00021858865   2    1000023    11

DECAY 1000011  3.8817427
    0.99377575   2    1000025    11
    0.00602804   2    1000022    11
    0.00017246874   2   -1000024    12

DECAY 2000013  9.1291856
    0.97670476   2    1000025    13
    0.01496183   2    1000022    13
    0.0054146556   2   -1000024    14
    0.0029187572   2    1000023    13

DECAY 1000013  3.9595067
    0.97430724   2    1000025    13
    0.015514834   2    1000022    13
    0.0096679951   2    1000023    13
    0.0003408559   2    2000013    25
    0.000169079   2   -1000024    14

DECAY 1000015  5.9602361
    0.45804544   2    1000022    15
    0.45509615   2    1000023    15
    0.086730504   2    1000025    15
    0.00012790087   2   -1000024    16

DECAY 2000015  72.001054
    0.35167168   2   -1000024    16
    0.2567128   2    1000025    15
    0.17747212   2    1000022    15
    0.17571476   2    1000023    15
    0.018943187   2    1000016   -24
    0.010031398   2    1000015    25
    0.0094540558   2    1000015    23

DECAY 1000012  3.8951031
    0.97674881   2    1000025    12
    0.017766223   2    1000022    12
    0.0044067228   2    1000024    11
    0.0010782456   2    1000023    12

DECAY 1000014  3.9714891
    0.95794531   2    1000025    14
    0.023572947   2    1000024    13
    0.01742425   2    1000022    14
    0.001057491   2    1000023    14

DECAY 1000016  5.9492027
    0.91307667   2    1000024    15
    0.083812209   2    1000025    16
    0.0029342913   2    1000022    16
    0.00017683256   2    1000023    16

DECAY 2000001  0.031448461
    0.92685785   2    1000025    1
    0.0715774   2    1000022    1
    0.0013489615   2    1000023    1
    0.00021579114   2   -1000024    2

DECAY 1000001  0.035701309
    0.89939384   2    1000025    1
    0.085074722   2    1000022    1
    0.011856956   2    1000023    1
    0.0036469723   2   -1000024    2

DECAY 2000003  0.036331431
    0.80222766   2    1000025    3
    0.095738284   2    1000022    3
    0.06742787   2   -1000024    4
    0.034606183   2    1000023    3

DECAY 1000003  0.040406851
    0.79479376   2    1000025    3
    0.12610187   2    1000022    3
    0.061185274   2    1000023    3
    0.009142478   2   -1000024    4
    0.0087766185   2    2000003    25

DECAY 1000005  123.80579
    0.53360863   2   -1000024    6
    0.22195876   2    1000023    5
    0.22167899   2    1000022    5
    0.017707025   2    1000006   -24
    0.0044490304   2    1000025    5
    0.00059755578   2    1000021    5

DECAY 2000005  177.21258
    0.38943684   2   -1000024    6
    0.19895061   2    1000021    5
    0.19504449   2    1000023    5
    0.19384341   2    1000022    5
    0.013437249   2    1000025    5
    0.0039273436   2    1000005    25
    0.0033705452   2    2000006   -24
    0.0017793772   2    1000005    23
    0.00021014038   2    1000006   -24

DECAY 1000002  0.036669142
    0.903758   2    1000025    2
    0.091033791   2    1000024    1
    0.0041244158   2    1000023    2
    0.0010837929   2    1000022    2

DECAY 2000002  4.0209915
    0.98738562   2    1000025    2
    0.01239595   2    1000022    2
    0.00021843188   2    1000023    2

DECAY 1000004  0.041007479
    0.80815734   2    1000025    4
    0.18137604   2    1000024    3
    0.0066063957   2    1000023    4
    0.0038602301   2    1000022    4

DECAY 2000004  4.022582
    0.98699398   2    1000025    4
    0.012489955   2    1000022    4
    0.00031769064   2    1000023    4
    0.00019837502   2    1000024    3

DECAY 1000006  124.16236
    0.47941256   2    1000024    5
    0.23763076   2    1000023    6
    0.23316633   2    1000022    6
    0.049056127   2    1000025    6
    0.00073368716   3    1000022    24    5

DECAY 2000006  126.19182
    0.44286523   2    1000024    5
    0.26628054   2    1000023    6
    0.26547005   2    1000022    6
    0.011678962   2    1000006    25
    0.0090491594   2    1000006    23
    0.0046560465   2    1000025    6

DECAY 1000024  1.5489145e-09
    0.43965255   3    1000022   -1    2
    0.22844156   3    1000022   -3    4
    0.14655194   3    1000022   -11    12
    0.14586885   3    1000022   -13    14
    0.039485096   3    1000022   -15    16

DECAY 1000037  292.85995
    0.16547932   2    1000004   -3
    0.16547905   2    1000002   -1
    0.16546519   2   -1000003    4
    0.16546504   2   -1000001    2
    0.05235284   2    1000016   -15
    0.052336178   2   -1000015    16
    0.035401843   2    1000024    25
    0.03299246   2    1000023    24
    0.032971737   2    1000024    23
    0.03245709   2    1000022    24
    0.029122128   2   -1000005    6
    0.028296242   2    2000006   -5
    0.0075755438   2    1000014   -13
    0.0075748042   2    1000012   -11
    0.0075600243   2   -1000013    14
    0.0075593128   2   -1000011    12
    0.0041103845   3    1000024    6   -6
    0.002624017   3    1000022   -5    6
    0.0025766653   3    1000023   -5    6
    0.0017327182   2    1000006   -5
    0.00053188384   2    1000025    24
    0.00021733421   3    1000024    5   -5

DECAY 1000022 -1


DECAY 1000023  3.2520966e-08
    0.82320203   2    1000022    22
    0.048720195   3    1000022    12   -12
    0.036431473   3    1000022    1   -1
    0.03625861   3    1000022    3   -3
    0.028413676   3    1000022    2   -2
    0.0099160634   3    1000022    4   -4
    0.0082216521   3    1000022    11   -11
    0.0081601434   3    1000022    13   -13
    0.00053384295   3    1000022    15   -15

DECAY 1000025  2.7672103
    0.21837557   2    1000024   -24
    0.21837557   2   -1000024    24
    0.21797182   2    1000023    23
    0.17842627   2    1000023    25
    0.16194148   2    1000022    25
    0.0037713904   2    1000022    23
    0.00055452391   3    1000024    5   -6
    0.00055452391   3   -1000024   -5    6

DECAY 1000035  297.80852
    0.081379447   2    1000004   -4
    0.081379447   2   -1000004    4
    0.081379303   2    1000002   -2
    0.081379303   2   -1000002    2
    0.081340326   2    1000003   -3
    0.081340326   2   -1000003    3
    0.081340236   2    1000001   -1
    0.081340236   2   -1000001    1
    0.032447475   2    1000024   -24
    0.032447475   2   -1000024    24
    0.025921922   2    1000023    25
    0.025753347   2    1000016   -16
    0.025753347   2   -1000016    16
    0.025720027   2    1000015   -15
    0.025720027   2   -1000015    15
    0.023686685   2    1000022    25
    0.022402488   2    1000023    23
    0.014676024   2    1000005   -5
    0.014676024   2   -1000005    5
    0.01395689   2    2000006   -6
    0.01395689   2   -2000006    6
    0.0099126016   2    1000022    23
    0.0037263128   2    1000014   -14
    0.0037263128   2   -1000014    14
    0.0037259494   2    1000012   -12
    0.0037259494   2   -1000012    12
    0.0037149312   2    1000013   -13
    0.0037149312   2   -1000013    13
    0.0037145816   2    1000011   -11
    0.0037145816   2   -1000011    11
    0.00281135   3    1000024    5   -6
    0.00281135   3   -1000024   -5    6
    0.0021178948   3    1000023    6   -6
    0.0020027335   3    1000022    6   -6
    0.00085510639   2    1000006   -6
    0.00085510639   2   -1000006    6
    0.00041585571   2    1000025    25
    0.00013114448   2    1000025    23
    0.0001067048   3    1000022    5   -5
    0.00010160711   3    1000023    5   -5

DECAY 1000021  481.62969
    0.082493875   2    2000003   -3
    0.082493875   2   -2000003    3
    0.082493421   2    2000001   -1
    0.082493421   2   -2000001    1
    0.073741551   2    1000004   -4
    0.073741551   2   -1000004    4
    0.073741349   2    1000002   -2
    0.073741349   2   -1000002    2
    0.073658707   2    1000003   -3
    0.073658707   2   -1000003    3
    0.073658564   2    1000001   -1
    0.073658564   2   -1000001    1
    0.019112619   2    2000004   -4
    0.019112619   2   -2000004    4
    0.019112613   2    2000002   -2
    0.019112613   2   -2000002    2
    0.00098761974   2    1000006   -6
    0.00098761974   2   -1000006    6
    0.00048903998   3    1000024    5   -6
    0.00048903998   3   -1000024   -5    6
    0.00028412835   3    1000023    5   -5
    0.00028388932   3    1000022    5   -5
    0.00020956167   3    1000023    6   -6
    0.0002087265   3    1000022    6   -6

DECAY 25  0.0033371498
    0.64293271   2   -5    5
    0.15544719   2   -24    24
    0.075269212   2    21    21
    0.073486904   2   -15    15
    0.031880767   2   -4    4
    0.017072596   2    23    23
    0.0023172182   2    22    22
    0.001096277   2    22    23
    0.00025489005   2   -13    13
    0.00024139613   2   -3    3
    6.674365e-07   2   -1    1
    1.6430575e-07   2   -2    2
    5.7302795e-09   2   -11    11

DECAY 35  135.79094
    0.79452516   2   -5    5
    0.17459033   2   -15    15
    0.016269684   2    1000023    1000025
    0.012610488   2    1000022    1000025
    0.00064339355   2   -13    13
    0.00039269887   2    1000022    1000022
    0.00039015739   2   -6    6
    0.00017074997   2   -3    3
    0.00012242983   2    1000025    1000025
    0.00012065833   2   -1000024    1000024
    0.00011679073   2    1000022    1000023
    2.7383701e-05   2    1000023    1000023
    1.131587e-05   2   -1000015    1000015
    5.8072241e-06   2    21    21
    1.0277345e-06   2   -2000004    1000004
    1.0277345e-06   2   -1000004    2000004
    4.7206585e-07   2   -1    1
    9.3855535e-08   2    25    25
    7.5620901e-08   2   -2000003    2000003
    7.5565738e-08   2   -2000001    2000001
    5.1540974e-08   2   -1000002    1000002
    5.1507061e-08   2   -1000004    1000004
    1.8175287e-08   2    23    23
    1.4448233e-08   2   -11    11
    5.6076573e-09   2    22    22
    3.765974e-09   2    22    23
    3.2533917e-09   2   -24    24
    2.4732224e-09   2   -1000001    1000001
    2.4432896e-09   2   -1000003    1000003
    2.022123e-09   2   -4    4
    9.6435463e-10   2   -2000003    1000003
    9.6435463e-10   2   -1000003    2000003
    3.982483e-12   2   -2000002    1000002
    3.982483e-12   2   -1000002    2000002
    2.6710234e-12   2   -2000001    1000001
    2.6710234e-12   2   -1000001    2000001
    1.0407904e-14   2   -2    2

DECAY 36  124.18431
    0.79224024   2   -5    5
    0.1740984   2   -15    15
    0.017363774   2    1000022    1000025
    0.014126159   2    1000023    1000025
    0.00064158727   2   -13    13
    0.00049605617   2    1000022    1000022
    0.000347431   2   -6    6
    0.00018582927   2    1000025    1000025
    0.00017022701   2   -3    3
    0.00016169265   2   -1000024    1000024
    0.00011670147   2    1000022    1000023
    3.9999662e-05   2    1000023    1000023
    9.0868661e-06   2    21    21
    1.1252688e-06   2   -2000004    1000004
    1.1252688e-06   2   -1000004    2000004
    4.7061993e-07   2   -1    1
    4.995217e-08   2    23    25
    1.4407887e-08   2   -11    11
    9.5807735e-09   2    22    22
    9.1368832e-09   2    22    23
    1.6168724e-09   2   -4    4
    1.1032666e-09   2   -2000003    1000003
    1.1032666e-09   2   -1000003    2000003
    4.3604293e-12   2   -2000002    1000002
    4.3604293e-12   2   -1000002    2000002
    3.0556512e-12   2   -2000001    1000001
    3.0556512e-12   2   -1000001    2000001
    1.0070785e-13   2    23    35
    8.3209922e-15   2   -2    2
    1.8964011e-37   2    25    25

DECAY 37  152.23822
    0.78171783   2   -5    6
    0.18989904   2   -15    16
    0.026230905   2    1000024    1000025
    0.0011599802   2   -5    4
    0.00067136063   2   -13    14
    0.00015354879   2   -3    4
    0.00013874605   2    1000022    1000024
    8.2834539e-06   2   -5    2
    7.2261959e-06   2   -3    2
    5.7493355e-06   2    1000023    1000024
    5.5606987e-06   2   -1000015    1000016
    7.5552822e-07   2   -3    6
    4.2598361e-07   2   -1    2
    2.5059529e-07   2   -2000003    2000004
    1.0656491e-07   2   -2000001    1000002
    1.0642222e-07   2   -2000003    1000004
    4.073639e-08   2    24    25
    2.4134092e-08   2   -1    6
    2.0208878e-08   2   -1    4
    1.5703195e-08   2   -11    12
    1.3407106e-08   2   -2000001    2000004
    5.7007722e-09   2   -2000003    1000002
    5.6912632e-09   2   -2000001    1000004
    1.6201635e-09   2   -1000003    1000004
    8.6784269e-11   2   -1000003    1000002
    6.5256789e-12   2   -1000003    2000004
    4.4948683e-12   2   -1000001    1000002
    1.3166696e-12   2   -2000001    2000002
    2.4006599e-13   2   -1000001    1000004
    7.0406132e-14   2   -2000003    2000002
    9.6695395e-16   2   -1000001    2000004
    1.8334254e-18   2   -1000003    2000002
    9.4961485e-20   2   -1000001    2000002

DECAY 6  2.43
    1   2    5    24

DECAY 15 -1
