BLOCK SPINFO
   1   SPheno
   2   v4.0.5be

BLOCK SPHENOINFO
   1   2
   2   2

BLOCK MODSEL
   1   0

BLOCK MINPAR
   3    18.494839
   4   -1

BLOCK EXTPAR
   0    2163.7811
   1    4255.0411
   2   -1175.2754
   3    4822.471
   11    3933.1746
   12   -7129.9937
   13   -3748.3941
   23   -867.3486
   25    17.725403
   26    964.99562
   31    1510.3587
   32    1510.3587
   33    1390.3142
   34    1355.8801
   35    1355.8801
   36    4330.8917
   41    1781.5115
   42    1781.5115
   43    3452.2125
   44    1835.4403
   45    1835.4403
   46    1480.0157
   47    2962.3756
   48    2962.3756
   49    4080.1038

BLOCK SMINPUTS
   1    127.90897
   2    1.1663787e-05
   3    0.1184
   4    91.1876
   5    4.18
   6    173.2
   7    1.777
   8    0
   11    0.00051099893
   12    0
   13    0.10565837
   14    0
   21    0.005
   22    0.0025
   23    0.095
   24    1.27

BLOCK GAUGE Q=  2163.7811
   1    0.35536298
   2    0.66519887
   3    1.219778

BLOCK YU Q=  2163.7811
   1   1    8.3977044e-06
   2   2    0.0042660338
   3   3    1.0145101

BLOCK YD Q=  2163.7811
   1   1    0.00029911414
   2   2    0.0056831687
   3   3    0.2966275

BLOCK YE Q=  2163.7811
   1   1    5.2197605e-05
   2   2    0.010792809
   3   3    0.1815173

BLOCK AU Q=  2163.7811
   1   1    0
   2   2    0
   3   3    3933.1723

BLOCK AD Q=  2163.7811
   1   1    0
   2   2    0
   3   3   -7129.9888

BLOCK AE Q=  2163.7811
   1   1    0
   2   2    0
   3   3   -3748.3956

BLOCK MSOFT Q=  2163.7811
   1    4255.0411
   2   -1175.2754
   3    4822.471
   21    87816.748
   22   -741634.54
   31    1510.3587
   32    1510.3587
   33    1390.3142
   34    1355.8801
   35    1355.8801
   36    4330.8917
   41    1781.5115
   42    1781.5115
   43    3452.2125
   44    1835.4403
   45    1835.4403
   46    1480.0157
   47    2962.3756
   48    2962.3756
   49    4080.1038

BLOCK MASS
   6    173.2
   23    91.1876
   24    80.429995
   15    1.777
   25    123.02083
   35    965.05606
   36    964.99562
   37    968.45556
   1000001    1737.5192
   2000001    2984.4013
   1000002    1735.7495
   2000002    1781.5045
   1000003    1737.5183
   2000003    2984.4001
   1000004    1735.7487
   2000004    1781.5041
   1000005    3461.4289
   2000005    4119.9865
   1000006    1349.6032
   2000006    3469.1296
   1000011    1518.6201
   2000011    1363.38
   1000012    1516.1966
   1000013    1518.6192
   2000013    1363.3719
   1000014    1516.1935
   1000015    1399.8737
   2000015    4336.6619
   1000016    1397.2838
   1000021    4661.7464
   1000022   -868.89908
   1000023    880.18167
   1000025   -1212.1352
   1000035    4215.9764
   1000024    871.00008
   1000037    1212.3972

BLOCK ALPHA
      -0.055376093

BLOCK HMIX Q=  2163.7811
   1   -867.3486
   2    17.725403
   3    243.53402
   4    931216.54

BLOCK STOPMIX
   1   1   -0.06019322
   1   2    0.99818674
   2   1   -0.99818674
   2   2   -0.06019322

BLOCK SBOTMIX
   1   1   -0.99999147
   1   2    0.0041308711
   2   1   -0.0041308711
   2   2   -0.99999147

BLOCK STAUMIX
   1   1   -0.9999992
   1   2    0.0012617158
   2   1   -0.0012617158
   2   2   -0.9999992

BLOCK NMIX
   1   1   -0.00639049
   1   2   -0.17159509
   1   3   -0.70018719
   1   4    0.6930023
   2   1    0.0088497616
   2   2    0.025070119
   2   3   -0.70633968
   2   4   -0.70737361
   3   1    0.0011746146
   3   2   -0.98484851
   3   3    0.1040164
   3   4   -0.13875381
   4   1    0.99993973
   4   2   -0.00016163359
   4   3    0.0016543191
   4   4    0.010852348

BLOCK UMIX
   1   1   -0.14768387
   1   2   -0.98903462
   2   1   -0.98903462
   2   2    0.14768387

BLOCK VMIX
   1   1    0.19703151
   1   2    0.98039716
   2   1    0.98039716
   2   2   -0.19703151

BLOCK HIGGSBOUNDSINPUTHIGGSCOUPLINGSFERMIONS
       0, 314.18991,3,36,15,15

BLOCK HIGGSBOUNDSINPUTHIGGSCOUPLINGSBOSONS
       0,4,36,21,21,23

BLOCK SPHENOLOWENERGY
   1    0.00035346818
   2    1.5873708e-06
   3    3.5249826e-05
   4    2.4404158e-15
   5    1.0425175e-10
   6    2.182158e-08
   7    8.2371317e-14
   8    3.5188987e-09
   9    7.4630764e-07
   10    9.489405e-05
   11    0.98021921
   12    0.54223379
   13    19.365926
   14    0
   15    0
   16    0.002158412
   17    2.2816719e-15
   18    2.4796167e-11
   19    8.2897292e-11
   20    2.0001007e-15
   21    8.5509826e-11
   22    2.5005752e-08
   23    0
   24    0
   25    0
   26    0
   27    0
   28    0
   29    0
   30    0
   31    0
   39    5.2928502e-05
   40    0
   41    0
   42    0

BLOCK FWCOEF Q=  160
   305   4422   0   0   -0.18881911
   305   4422   0   2   -0.22136726
   305   4322   0   2   -0.00060898709
   305   6421   0   0   -0.095227835
   305   6421   0   2   -0.13622905
   305   6321   0   2   -0.00078721905
   3051111   4133   0   0    1.6047916
   3051111   4133   0   2    1.6052684
   3051111   4233   0   2   -1.8055644e-05
   3051111   4137   0   0   -4.4274837
   3051111   4137   0   2   -4.4255257
   3051111   4237   0   2    0.00013811863
   3051313   4133   0   0    1.6047916
   3051313   4133   0   2    1.6052681
   3051313   4233   0   2   -1.8056355e-05
   3051313   4137   0   0   -4.4274837
   3051313   4137   0   2   -4.4255261
   3051313   4237   0   2    0.0001381193
   3051212   4137   0   0    1.5053501
   3051212   4137   0   2    1.5049281
   3051212   4237   0   2   -3.0014454e-05
   3051414   4137   0   0    1.5053501
   3051414   4137   0   2    1.5049281
   3051414   4237   0   2   -3.0014302e-05
   3051616   4137   0   0    1.5053501
   3051616   4137   0   2    1.5049281
   3051616   4237   0   2   -2.9971542e-05

BLOCK IMFWCOEF Q=  160
   305   4422   0   0    3.8584659e-07
   305   4422   0   2    3.3053081e-06
   305   4322   0   2    1.8503962e-06
   305   6421   0   0    3.3050312e-07
   305   6421   0   2    1.7003774e-06
   305   6321   0   2    8.6946714e-07
   3051111   4133   0   2    4.013985e-07
   3051111   4233   0   2    4.9320017e-07
   3051111   4137   0   2   -2.983716e-06
   3051111   4237   0   2   -3.7704476e-06
   3051313   4133   0   2    4.0139522e-07
   3051313   4233   0   2    4.9319995e-07
   3051313   4137   0   2   -2.9837185e-06
   3051313   4237   0   2   -3.7704483e-06
   3051212   4137   0   2    7.1032733e-07
   3051212   4237   0   2    8.1933987e-07
   3051414   4137   0   2    7.1032733e-07
   3051414   4237   0   2    8.1933987e-07
   3051616   4137   0   2    7.1026904e-07
   3051616   4237   0   2    8.1933982e-07

DECAY 23  2.4952


DECAY 24  2.085


DECAY 2000011  0.00028161264
    0.64806939   2    1000023    11
    0.35036624   2    1000022    11
    0.0014740706   2    1000025    11

DECAY 1000011  2.799049
    0.61435939   2   -1000037    12
    0.30465915   2    1000025    11
    0.046955087   2   -1000024    12
    0.033091297   2    1000022    11
    0.0009350713   2    1000023    11

DECAY 2000013  0.0024526491
    0.44204259   2   -1000024    14
    0.29305163   2    1000023    13
    0.26289523   2    1000022    13
    0.0012297282   2   -1000037    14
    0.00078081647   2    1000025    13

DECAY 1000013  2.8006638
    0.61400214   2   -1000037    14
    0.30448331   2    1000025    13
    0.046927929   2   -1000024    14
    0.033351588   2    1000022    13
    0.0012108679   2    1000023    13

DECAY 1000015  1.6397898
    0.45907744   2   -1000037    16
    0.22810386   2    1000025    15
    0.14767122   2    1000022    15
    0.10321696   2    1000023    15
    0.06193053   2   -1000024    16

DECAY 2000015  9.0435124
    0.28280082   2   -1000024    16
    0.20036226   2    1000016   -37
    0.14437173   2    1000023    15
    0.14184555   2    1000022    15
    0.10018139   2    1000015    36
    0.10014601   2    1000015    35
    0.0072562228   2    1000035    15
    0.0070209726   2    1000016   -24
    0.0061922737   2   -1000037    16
    0.0035045285   2    1000015    23
    0.0032434151   2    1000015    25
    0.0030748251   2    1000025    15

DECAY 1000012  2.831289
    0.58916658   2    1000037    11
    0.29809963   2    1000025    12
    0.082235508   2    1000024    11
    0.030069527   2    1000022    12
    0.0004287478   2    1000023    12

DECAY 1000014  2.8327974
    0.58884742   2    1000037    13
    0.29793594   2    1000025    14
    0.082734788   2    1000024    13
    0.030053333   2    1000022    14
    0.00042851683   2    1000023    14

DECAY 1000016  1.6687288
    0.43372203   2    1000037    15
    0.30734062   2    1000024    15
    0.21917138   2    1000025    16
    0.039211058   2    1000022    16
    0.00055491165   2    1000023    16

DECAY 1000001  6.2090196
    0.63443056   2   -1000037    2
    0.31492744   2    1000025    1
    0.030139437   2   -1000024    2
    0.020126709   2    1000022    1
    0.00037584912   2    1000023    1

DECAY 2000001  0.00017638744
    0.62922953   2    1000023    1
    0.33549847   2    1000022    1
    0.024658972   2   -1000024    2
    0.0093147505   2    1000025    1
    0.00083380045   2    1000001    25
    0.00045792731   2   -1000037    2

DECAY 1000003  6.209952
    0.63433518   2   -1000037    4
    0.31487956   2    1000025    3
    0.030186639   2   -1000024    4
    0.020173442   2    1000022    3
    0.00042517458   2    1000023    3

DECAY 2000003  0.0034197619
    0.45914882   2   -1000024    4
    0.26503323   2    1000023    3
    0.24694509   2    1000022    3
    0.015525348   2    1000003    25
    0.0085265812   2   -1000037    4
    0.0046989696   2    1000025    3

DECAY 1000005  166.22163
    0.37407812   2    1000006   -24
    0.3592217   2   -1000024    6
    0.15304081   2   -1000037    6
    0.068719251   2    1000025    5
    0.018085355   2    1000022    5
    0.01594778   2    1000023    5
    0.010906988   2    1000006   -37

DECAY 2000005  13.287494
    0.48169562   2   -1000024    6
    0.2467416   2    1000023    5
    0.24218897   2    1000022    5
    0.011106596   2   -1000037    6
    0.0093338088   2    1000006   -37
    0.0055268248   2    1000025    5
    0.0014658025   2    2000006   -24
    0.0010284187   2    1000005    25
    0.00075510805   2    1000005    23
    0.00015725653   2    1000006   -24

DECAY 1000002  6.2592987
    0.6153707   2    1000037    1
    0.3106094   2    1000025    2
    0.05308881   2    1000024    1
    0.020452853   2    1000022    2
    0.00047823673   2    1000023    2

DECAY 2000002  0.00027398511
    0.64979055   2    1000023    2
    0.34442577   2    1000022    2
    0.0057785044   2    1000025    2

DECAY 1000004  6.2602364
    0.6152787   2    1000037    3
    0.31055939   2    1000025    4
    0.053177355   2    1000024    3
    0.02047841   2    1000022    4
    0.00050613808   2    1000023    4

DECAY 2000004  0.0010077003
    0.35930206   2    1000023    4
    0.35649276   2    1000024    3
    0.27192741   2    1000022    4
    0.0071617784   2    1000037    3
    0.0051159866   2    1000025    4

DECAY 1000006  17.752145
    0.51643419   2    1000024    5
    0.24247381   2    1000022    6
    0.23964676   2    1000023    6
    0.0014452269   2    1000037    5

DECAY 2000006  174.1652
    0.22363201   2    1000006    25
    0.1793526   2    1000006    23
    0.17699043   2    1000023    6
    0.17155815   2    1000022    6
    0.13484054   2    1000037    5
    0.071643024   2    1000025    6
    0.03157973   2    1000024    5
    0.0052093327   2    1000006    36
    0.0051941832   2    1000006    35

DECAY 1000024  3.0586885e-11
    0.59366211   3    1000022   -1    2
    0.19791362   3    1000022   -11    12
    0.19392609   3    1000022   -13    14
    0.01449818   3    1000022   -3    4

DECAY 1000037  7.5675269
    0.28622   2    1000022    24
    0.24077308   2    1000024    23
    0.23648101   2    1000023    24
    0.23472164   2    1000024    25
    0.00096387138   3    1000022   -5    6
    0.00082750191   3    1000023   -5    6

DECAY 1000022 -1


DECAY 1000023  1.117638e-06
    0.34525778   2    1000022    22
    0.11169874   3    1000022    12   -12
    0.083521503   3    1000022    1   -1
    0.083452883   3    1000022    3   -3
    0.065143018   3    1000022    2   -2
    0.055017185   3    1000022    4   -4
    0.033755313   3    1000024    1   -2
    0.033755313   3   -1000024   -1    2
    0.031007526   3    1000024    3   -4
    0.031007526   3   -1000024   -3    4
    0.018848002   3    1000022    11   -11
    0.0188237   3    1000022    13   -13
    0.013093895   3    1000022    15   -15
    0.011541337   3    1000022    5   -5
    0.011251696   3    1000024    11   -12
    0.011251696   3   -1000024   -11    12
    0.01124494   3    1000024    13   -14
    0.01124494   3   -1000024   -13    14
    0.0095415027   3    1000024    15   -16
    0.0095415027   3   -1000024   -15    16

DECAY 1000025  9.7350214
    0.22551334   2    1000024   -24
    0.22551334   2   -1000024    24
    0.21368557   2    1000023    23
    0.17654758   2    1000022    25
    0.1527979   2    1000023    25
    0.0042681162   2    1000022    23
    0.0008088457   3    1000024    5   -6
    0.0008088457   3   -1000024   -5    6

DECAY 1000035  149.97944
    0.0756137   2    1000006   -6
    0.0756137   2   -1000006    6
    0.063530444   2    2000002   -2
    0.063530444   2   -2000002    2
    0.063530442   2    2000004   -4
    0.063530442   2   -2000004    4
    0.056616883   2    2000013   -13
    0.056616883   2   -2000013    13
    0.056616725   2    2000011   -11
    0.056616725   2   -2000011    11
    0.017407938   2    1000024   -24
    0.017407938   2   -1000024    24
    0.016066269   2    37   -1000024
    0.016066269   2   -37    1000024
    0.013996661   2    1000016   -16
    0.013996661   2   -1000016    16
    0.013967012   2    1000015   -15
    0.013967012   2   -1000015    15
    0.013390428   2    1000014   -14
    0.013390428   2   -1000014    14
    0.013390412   2    1000012   -12
    0.013390412   2   -1000012    12
    0.01336151   2    1000013   -13
    0.01336151   2   -1000013    13
    0.013361506   2    1000011   -11
    0.013361506   2   -1000011    11
    0.013237678   2    1000022    25
    0.012398774   2    1000023    35
    0.011247743   2    1000022    23
    0.010984726   2    1000023    25
    0.0097143256   2    1000022    35
    0.0063027586   2    1000023    23
    0.0058587868   2    2000003   -3
    0.0058587868   2   -2000003    3
    0.0058587771   2    2000001   -1
    0.0058587771   2   -2000001    1
    0.0050018993   2    1000022    36
    0.0040626541   2    1000003   -3
    0.0040626541   2   -1000003    3
    0.0040626522   2    1000001   -1
    0.0040626522   2   -1000001    1
    0.0040513068   2    1000004   -4
    0.0040513068   2   -1000004    4
    0.004051301   2    1000002   -2
    0.004051301   2   -1000002    2
    0.0040333022   2    1000023    36
    0.0010557959   3    1000024    5   -6
    0.0010557959   3   -1000024   -5    6
    0.00093884133   3    1000022    6   -6
    0.00088765481   3    1000023    6   -6
    0.0006261246   2    1000005   -5
    0.0006261246   2   -1000005    5
    0.00057983273   2    2000006   -6
    0.00057983273   2   -2000006    6
    0.00050957165   2    1000037   -24
    0.00050957165   2   -1000037    24
    0.0004155706   2    1000025    25
    0.00038405936   2    37   -1000037
    0.00038405936   2   -37    1000037
    0.00036976517   2    1000025    23
    0.00024401403   2    1000025    35

DECAY 1000021  884.81886
    0.066070624   2    1000006   -6
    0.066070624   2   -1000006    6
    0.057853453   2    1000004   -4
    0.057853453   2   -1000004    4
    0.057853438   2    1000002   -2
    0.057853438   2   -1000002    2
    0.057815469   2    1000003   -3
    0.057815469   2   -1000003    3
    0.05781545   2    1000001   -1
    0.05781545   2   -1000001    1
    0.056862962   2    2000004   -4
    0.056862962   2   -2000004    4
    0.056862955   2    2000002   -2
    0.056862955   2   -2000002    2
    0.027157646   2    2000003   -3
    0.027157646   2   -2000003    3
    0.027157615   2    2000001   -1
    0.027157615   2   -2000001    1
    0.01569704   2    1000005   -5
    0.01569704   2   -1000005    5
    0.015097338   2    2000006   -6
    0.015097338   2   -2000006    6
    0.0037367573   2    2000005   -5
    0.0037367573   2   -2000005    5

DECAY 25  0.0037710659
    0.61394432   2   -5    5
    0.19008853   2   -24    24
    0.071008927   2    21    21
    0.070049361   2   -15    15
    0.028778181   2   -4    4
    0.022113768   2    23    23
    0.0022580312   2    22    22
    0.0012851462   2    22    23
    0.00024291165   2   -13    13
    0.00023002975   2   -3    3
    6.3600206e-07   2   -1    1
    1.4830696e-07   2   -2    2
    5.46095e-09   2   -11    11

DECAY 35  6.1056515
    0.85731242   2   -5    5
    0.12084432   2   -15    15
    0.020639304   2   -6    6
    0.00041607738   2   -13    13
    0.0003231543   2   -3    3
    0.00028375862   2    25    25
    7.8350013e-05   2   -24    24
    5.6142876e-05   2    23    23
    4.5063399e-05   2    21    21
    8.9324323e-07   2   -1    1
    3.5000887e-07   2   -4    4
    8.8277248e-08   2    22    22
    7.0843547e-08   2    22    23
    9.3481207e-09   2   -11    11
    1.8050803e-12   2   -2    2

DECAY 36  6.0031472
    0.85587596   2   -5    5
    0.12063841   2   -15    15
    0.022517315   2   -6    6
    0.00041536151   2   -13    13
    0.00032259733   2   -3    3
    0.00014487029   2    21    21
    8.4032375e-05   2    23    25
    8.9170361e-07   2   -1    1
    3.3181659e-07   2   -4    4
    1.7554531e-07   2    22    22
    4.5104927e-08   2    22    23
    9.3320342e-09   2   -11    11
    1.7113208e-12   2   -2    2
    2.1376725e-37   2    25    25

DECAY 37  5.4811622
    0.87691358   2   -5    6
    0.12086505   2   -15    16
    0.0013254439   2   -5    4
    0.00042730366   2   -13    14
    0.00031693408   2   -3    4
    9.3667427e-05   2    24    25
    3.1570272e-05   2   -3    6
    1.4620249e-05   2   -3    2
    9.4650637e-06   2   -5    2
    1.4279733e-06   2   -1    6
    8.7849513e-07   2   -1    2
    5.4280708e-08   2   -1    4
    9.9946773e-09   2   -11    12
    1.2268383e-10   2    24    36
    1.1234282e-10   2    24    35

DECAY 6  2.43
    1   2    5    24

DECAY 15 -1
