BLOCK SPINFO
   1   SPheno
   2   v4.0.5be

BLOCK SPHENOINFO
   1   2
   2   2

BLOCK MODSEL
   1   0

BLOCK MINPAR
   3    39.055966
   4    1

BLOCK EXTPAR
   0    1518.8948
   1   -1475.9436
   2   -1571.8291
   3    3000
   11   -4553.5585
   12   -330.78805
   13    1526.0801
   23    542.59288
   25    38.180132
   26    4218.247
   31    1925.5744
   32    1925.5744
   33    1930.781
   34    1671.336
   35    1671.336
   36    1697.4496
   41    5000
   42    5000
   43    1408.1889
   44    5000
   45    5000
   46    1806.1678
   47    5000
   48    5000
   49    1169.4962

BLOCK SMINPUTS
   1    127.90897
   2    1.1663787e-05
   3    0.1184
   4    91.1876
   5    4.18
   6    173.2
   7    1.777
   8    0
   11    0.00051099893
   12    0
   13    0.10565837
   14    0
   21    0.005
   22    0.0025
   23    0.095
   24    1.27

BLOCK GAUGE Q=  1518.8948
   1    0.35536298
   2    0.66519887
   3    1.219778

BLOCK YU Q=  1518.8948
   1   1    8.3872475e-06
   2   2    0.0042607217
   3   3    1.0132469

BLOCK YD Q=  1518.8948
   1   1    0.00064348307
   2   2    0.012226178
   3   3    0.63813357

BLOCK YE Q=  1518.8948
   1   1    0.0001122925
   2   2    0.023218528
   3   3    0.39049744

BLOCK AU Q=  1518.8948
   1   1    0
   2   2    0
   3   3   -4553.558

BLOCK AD Q=  1518.8948
   1   1    0
   2   2    0
   3   3   -330.78815

BLOCK AE Q=  1518.8948
   1   1    0
   2   2    0
   3   3    1526.0801

BLOCK MSOFT Q=  1518.8948
   1   -1475.9436
   2   -1571.8291
   3    3000
   21    17467040
   22   -248940.98
   31    1925.5744
   32    1925.5744
   33    1930.781
   34    1671.336
   35    1671.336
   36    1697.4496
   41    5000
   42    5000
   43    1408.1889
   44    5000
   45    5000
   46    1806.1678
   47    5000
   48    5000
   49    1169.4962

BLOCK MASS
   6    173.2
   23    91.1876
   24    80.429995
   15    1.777
   25    121.63849
   35    4216.2876
   36    4218.247
   37    4217.4394
   1000001    5029.2413
   2000001    5020.5468
   1000002    5028.8126
   2000002    5023.3694
   1000003    5029.2463
   2000003    5020.5533
   1000004    5028.8168
   2000004    5023.3701
   1000005    1195.007
   2000005    1399.7856
   1000006    1287.504
   2000006    1791.8713
   1000011    1937.8969
   2000011    1672.1486
   1000012    1935.926
   1000013    1937.9047
   2000013    1672.1653
   1000014    1935.9326
   1000015    1704.4777
   2000015    1945.9618
   1000016    1943.6494
   1000021    3193.6203
   1000022   -548.61538
   1000023    553.53473
   1000025   -1478.9491
   1000035   -1625.0764
   1000024    551.08293
   1000037    1625.1317

BLOCK ALPHA
      -0.025638008

BLOCK HMIX Q=  1518.8948
   1    542.59288
   2    38.180132
   3    243.96898
   4    17793608

BLOCK STOPMIX
   1   1    0.90021692
   1   2    0.43544174
   2   1   -0.43544174
   2   2    0.90021692

BLOCK SBOTMIX
   1   1    0.082812139
   1   2    0.99656518
   2   1   -0.99656518
   2   2    0.082812139

BLOCK STAUMIX
   1   1    0.038078361
   1   2    0.99927476
   2   1   -0.99927476
   2   2    0.038078361

BLOCK NMIX
   1   1   -0.032331023
   1   2    0.050204846
   1   3   -0.70806027
   1   4   -0.70362265
   2   1    0.015728103
   2   2   -0.02659852
   2   3   -0.70585295
   2   4    0.70768408
   3   1    0.99915441
   3   2    0.021968028
   3   3   -0.011460077
   3   4   -0.032810708
   4   1    0.019944972
   4   2   -0.99814298
   4   3   -0.017056843
   4   4   -0.054971486

BLOCK UMIX
   1   1   -0.023876373
   1   2    0.99971492
   2   1   -0.99971492
   2   2   -0.023876373

BLOCK VMIX
   1   1    0.076934028
   1   2    0.99703619
   2   1    0.99703619
   2   2   -0.076934028

BLOCK HIGGSBOUNDSINPUTHIGGSCOUPLINGSFERMIONS
       0, 1457.7224,3,36,15,15

BLOCK HIGGSBOUNDSINPUTHIGGSCOUPLINGSBOSONS
       0,4,36,21,21,23

BLOCK SPHENOLOWENERGY
   1    0.0002646641
   2    1.6033178e-06
   3    3.525644e-05
   4    2.380728e-15
   5    1.0170123e-10
   6    2.1245685e-08
   7    7.9789319e-14
   8    3.4085725e-09
   9    7.2153097e-07
   10    9.6478181e-05
   11    0.99658268
   12    0.54216539
   13    19.369315
   14    0
   15    0
   16    0.0021578228
   17    2.2816637e-15
   18    2.4825977e-11
   19    8.2955315e-11
   20   -3.8078694e-15
   21   -1.6280237e-10
   22   -4.6246095e-08
   23    0
   24    0
   25    0
   26    0
   27    0
   28    0
   29    0
   30    0
   31    0
   39    8.7805572e-05
   40    0
   41    0
   42    0

BLOCK FWCOEF Q=  160
   305   4422   0   0   -0.18881911
   305   4422   0   2   -0.11832033
   305   4322   0   2    0.00036139335
   305   6421   0   0   -0.095227835
   305   6421   0   2   -0.060423258
   305   6321   0   2    7.9940711e-05
   3051111   4133   0   0    1.5927056
   3051111   4133   0   2    1.5937283
   3051111   4233   0   2    0.00030647736
   3051111   4137   0   0   -4.4153978
   3051111   4137   0   2   -4.4141847
   3051111   4237   0   2   -0.0023828937
   3051313   4133   0   0    1.5927056
   3051313   4133   0   2    1.5937263
   3051313   4233   0   2    0.00030647654
   3051313   4137   0   0   -4.4153978
   3051313   4137   0   2   -4.4141867
   3051313   4237   0   2   -0.0023828958
   3051212   4137   0   0    1.5053501
   3051212   4137   0   2    1.5050911
   3051212   4237   0   2    0.00051923764
   3051414   4137   0   0    1.5053501
   3051414   4137   0   2    1.5050911
   3051414   4237   0   2    0.00051923766
   3051616   4137   0   0    1.5053501
   3051616   4137   0   2    1.5050911
   3051616   4237   0   2    0.00051924233

BLOCK IMFWCOEF Q=  160
   305   4422   0   0    3.8589346e-07
   305   4422   0   2   -1.3386875e-05
   305   4322   0   2    7.6896832e-06
   305   6421   0   0    3.3054326e-07
   305   6421   0   2   -2.8875883e-05
   305   6321   0   2    3.0902997e-06
   3051111   4133   0   2   -3.2748372e-06
   3051111   4233   0   2    5.8481297e-06
   3051111   4137   0   2    2.6954217e-05
   3051111   4237   0   2   -4.5473865e-05
   3051313   4133   0   2   -3.2748273e-06
   3051313   4233   0   2    5.8481166e-06
   3051313   4137   0   2    2.6954255e-05
   3051313   4237   0   2   -4.5473904e-05
   3051212   4137   0   2   -5.7707317e-06
   3051212   4237   0   2    9.9088522e-06
   3051414   4137   0   2   -5.7707325e-06
   3051414   4237   0   2    9.9088522e-06
   3051616   4137   0   2   -5.7709408e-06
   3051616   4237   0   2    9.9088522e-06

DECAY 23  2.4952


DECAY 24  2.085


DECAY 2000011  0.40628389
    0.97870372   2    1000025    11
    0.017213778   2    1000022    11
    0.0040563347   2    1000023    11

DECAY 1000011  2.7117031
    0.55363913   2   -1000037    12
    0.2701769   2    1000035    11
    0.1693889   2    1000025    11
    0.0030298064   2   -1000024    12
    0.0028867112   2    1000022    11
    0.0008785512   2    1000023    11

DECAY 2000013  0.43483021
    0.91459336   2    1000025    13
    0.032752575   2   -1000024    14
    0.032547688   2    1000022    13
    0.020082559   2    1000023    13

DECAY 1000013  2.7295474
    0.55004321   2   -1000037    14
    0.2684224   2    1000035    13
    0.16828614   2    1000025    13
    0.0060977158   2    1000022    13
    0.0040728151   2    1000023    13
    0.0030100157   2   -1000024    14

DECAY 1000015  8.8344615
    0.46983476   2   -1000024    16
    0.23862796   2    1000022    15
    0.23247378   2    1000023    15
    0.059048618   2    1000025    15

DECAY 2000015  7.8735678
    0.31731423   2    1000023    15
    0.31672886   2    1000022    15
    0.19897455   2   -1000037    16
    0.097136811   2    1000035    15
    0.06022811   2    1000025    15
    0.0050004202   2    1000015    25
    0.0046128067   2    1000015    23

DECAY 1000012  2.7476229
    0.53769477   2    1000037    11
    0.27531731   2    1000035    12
    0.14083807   2    1000025    12
    0.031003064   2    1000024    11
    0.011943399   2    1000022    12
    0.0032033779   2    1000023    12

DECAY 1000014  2.7652388
    0.53428856   2    1000037    13
    0.27357319   2    1000035    14
    0.139944   2    1000025    14
    0.037143893   2    1000024    13
    0.011867368   2    1000022    14
    0.0031829856   2    1000023    14

DECAY 1000016  7.9120363
    0.64079455   2    1000024    15
    0.19464159   2    1000037    15
    0.09965839   2    1000035    16
    0.050201999   2    1000025    16
    0.0094150994   2    1000015    24
    0.004169916   2    1000022    16
    0.0011184572   2    1000023    16

DECAY 2000001  142.80588
    0.98362714   2    1000021    1
    0.016341272   2    1000025    1

DECAY 1000001  195.23769
    0.72410467   2    1000021    1
    0.18177567   2   -1000037    2
    0.091249611   2    1000035    1
    0.0023013309   2    1000025    1
    0.00034678705   2    1000022    1
    0.00012618759   2   -1000024    2

DECAY 2000003  142.83563
    0.98342705   2    1000021    3
    0.01633791   2    1000025    3
    0.00010196479   2   -1000024    4

DECAY 1000003  195.25462
    0.72404456   2    1000021    3
    0.18176022   2   -1000037    4
    0.091241854   2    1000035    3
    0.0023011432   2    1000025    3
    0.00038414469   2    1000022    3
    0.00013519921   2   -1000024    4
    0.00013287466   2    1000023    3

DECAY 1000005  11.431388
    0.47407766   2   -1000024    6
    0.26735994   2    1000022    5
    0.25856239   2    1000023    5

DECAY 2000005  29.714177
    0.65584652   2   -1000024    6
    0.1363532   2    1000023    5
    0.13595631   2    1000022    5
    0.062624237   2    1000006   -24
    0.0061636209   2    1000005    25
    0.0030561187   2    1000005    23

DECAY 2000002  150.12092
    0.93765363   2    1000021    2
    0.062228242   2    1000025    2

DECAY 1000002  195.23319
    0.72389282   2    1000021    2
    0.18078441   2    1000037    1
    0.089950868   2    1000035    2
    0.0037802996   2    1000025    2
    0.0013102575   2    1000024    1
    0.00021868095   2    1000022    2

DECAY 2000004  150.12447
    0.93763154   2    1000021    4
    0.062226773   2    1000025    4

DECAY 1000004  195.24995
    0.72383259   2    1000021    4
    0.18076914   2    1000037    3
    0.089943243   2    1000035    4
    0.0037799892   2    1000025    4
    0.0013846668   2    1000024    3
    0.00022316246   2    1000022    4

DECAY 1000006  22.624226
    0.36505519   2    1000024    5
    0.31919651   2    1000023    6
    0.31407825   2    1000022    6
    0.0013966536   3    1000022    24    5
    0.00012408415   2    1000022    4
    0.00011402863   2    1000005    24

DECAY 2000006  154.87766
    0.26393768   2    2000005    24
    0.20882861   2    1000006    23
    0.17851943   2    1000024    5
    0.13793396   2    1000006    25
    0.10230394   2    1000022    6
    0.10141095   2    1000023    6
    0.0054673255   2    1000005    24
    0.0012520354   2    1000025    6
    0.00034607283   2    1000037    5

DECAY 1000024  2.5134987e-10
    0.51357673   3    1000022   -1    2
    0.17119834   3    1000022   -11    12
    0.16964566   3    1000022   -13    14
    0.13641535   3    1000022   -3    4
    0.0091639237   3    1000022   -15    16

DECAY 1000037  16.941933
    0.19745652   2    1000024    25
    0.19294403   2    1000023    24
    0.19260744   2    1000022    24
    0.19187707   2    1000024    23
    0.15817195   2    1000006   -5
    0.046448126   2   -2000005    6
    0.006628822   3    1000024    6   -6
    0.0061717097   3    1000022   -5    6
    0.0057515324   3    1000023   -5    6
    0.0010277615   2    1000025    24
    0.00079111507   2   -1000005    6

DECAY 1000022 -1


DECAY 1000023  3.3214755e-08
    0.77435512   2    1000022    22
    0.060431186   3    1000022    12   -12
    0.045188479   3    1000022    1   -1
    0.044993017   3    1000022    3   -3
    0.035243338   3    1000022    2   -2
    0.013674486   3    1000022    4   -4
    0.01019782   3    1000022    11   -11
    0.010128442   3    1000022    13   -13
    0.0012484371   3    1000024    1   -2
    0.0012484371   3   -1000024   -1    2
    0.00094143726   3    1000022    15   -15
    0.00041615817   3    1000024    11   -12
    0.00041615817   3   -1000024   -11    12
    0.00041233272   3    1000024    13   -14
    0.00041233272   3   -1000024   -13    14
    0.00032528702   3    1000024    3   -4
    0.00032528702   3   -1000024   -3    4

DECAY 1000025  4.551663
    0.21441252   2    1000024   -24
    0.21441252   2   -1000024    24
    0.15692995   2    1000023    25
    0.15242284   2    1000023    23
    0.13881979   2    1000022    25
    0.035152284   2    1000022    23
    0.032261994   2    1000005   -5
    0.032261994   2   -1000005    5
    0.0055161011   3    1000024    5   -6
    0.0055161011   3   -1000024   -5    6
    0.0033770552   2    1000006   -6
    0.0033770552   2   -1000006    6
    0.0021208065   3    1000023    6   -6
    0.0019654659   3    1000022    6   -6
    0.00060034731   2    2000005   -5
    0.00060034731   2   -2000005    5

DECAY 1000035  19.934089
    0.16154425   2    1000024   -24
    0.16154425   2   -1000024    24
    0.15021889   2    1000023    25
    0.13297605   2    1000022    25
    0.13236201   2    1000023    23
    0.067720414   2    1000006   -6
    0.067720414   2   -1000006    6
    0.036342186   2    1000022    23
    0.035833724   2    2000005   -5
    0.035833724   2   -2000005    5
    0.0056101492   3    1000024    5   -6
    0.0056101492   3   -1000024   -5    6
    0.0028985286   3    1000023    6   -6
    0.0026659134   3    1000022    6   -6
    0.00041099706   2    1000005   -5
    0.00041099706   2   -1000005    5
    0.00022896895   2    1000025    25

DECAY 1000021  265.72915
    0.13148284   2    1000005   -5
    0.13148284   2   -1000005    5
    0.11615527   2    2000005   -5
    0.11615527   2   -2000005    5
    0.11197321   2    1000006   -6
    0.11197321   2   -1000006    6
    0.093451951   2    2000006   -6
    0.093451951   2   -2000006    6
    0.046700791   2    1000006   -4
    0.046700791   2   -1000006    4
    0.00011325611   3    1000035    6   -6

DECAY 25  0.0034593118
    0.62241083   2   -5    5
    0.177709   2   -24    24
    0.073304372   2    21    21
    0.071492154   2   -15    15
    0.030905468   2   -4    4
    0.020102684   2    23    23
    0.0023641152   2    22    22
    0.0012280461   2    22    23
    0.00024796073   2   -13    13
    0.00023456261   2   -3    3
    6.485423e-07   2   -1    1
    1.5927366e-07   2   -2    2
    5.5744782e-09   2   -11    11

DECAY 35  105.4825
    0.47985333   2   -5    5
    0.11421504   2   -1000024    1000037
    0.11421504   2   -1000037    1000024
    0.11247675   2   -15    15
    0.062310417   2    1000023    1000035
    0.055114859   2    1000022    1000035
    0.016283663   2    1000023    1000025
    0.014661308   2    1000022    1000025
    0.005739468   2   -1000006    1000006
    0.0041050944   2   -2000015    1000015
    0.0041050944   2   -1000015    2000015
    0.0034565722   2   -2000006    2000006
    0.0031799155   2   -2000006    1000006
    0.0031799155   2   -1000006    2000006
    0.0019687452   2   -1000024    1000024
    0.0011515946   2   -2000005    1000005
    0.0011515946   2   -1000005    2000005
    0.00091375014   2   -6    6
    0.00076660547   2    1000022    1000022
    0.00038914198   2   -13    13
    0.00022143633   2   -3    3
    0.00017896267   2    1000023    1000023
    7.7508031e-05   2    1000022    1000023
    7.5256673e-05   2   -1000037    1000037
    3.9555555e-05   2    1000035    1000035
    3.8163624e-05   2   -1000005    1000005
    3.7452816e-05   2   -2000005    2000005
    3.3034242e-05   2   -1000015    1000015
    2.6136908e-05   2    1000025    1000035
    2.1969935e-05   2   -2000015    2000015
    5.7221928e-06   2    25    25
    4.2247671e-06   2    1000025    1000025
    1.5607316e-06   2    21    21
    6.1217276e-07   2   -1    1
    1.6053381e-07   2    23    23
    4.1243192e-08   2    22    23
    3.1920284e-08   2   -24    24
    1.6118849e-08   2   -2000011    2000011
    1.6038129e-08   2   -2000013    2000013
    1.5873362e-08   2   -4    4
    1.5631184e-08   2   -1000011    1000011
    1.544196e-08   2   -1000013    1000013
    1.2796545e-08   2    22    22
    8.7389451e-09   2   -11    11
    1.2165954e-09   2   -2000013    1000013
    1.2165954e-09   2   -1000013    2000013
    8.183038e-14   2   -2    2
    2.8456972e-14   2   -2000011    1000011
    2.8456972e-14   2   -1000011    2000011

DECAY 36  101.249
    0.46579702   2   -5    5
    0.11902708   2   -1000024    1000037
    0.11902708   2   -1000037    1000024
    0.10919573   2   -15    15
    0.065180687   2    1000022    1000035
    0.057196826   2    1000023    1000035
    0.017018103   2    1000022    1000025
    0.015230701   2    1000023    1000025
    0.0082126883   2   -2000006    1000006
    0.0082126883   2   -1000006    2000006
    0.0043096192   2   -2000015    1000015
    0.0043096192   2   -1000015    2000015
    0.0021258823   2   -1000024    1000024
    0.0012393197   2   -2000005    1000005
    0.0012393197   2   -1000005    2000005
    0.0007721805   2    1000022    1000022
    0.00073272301   2   -6    6
    0.00037779015   2   -13    13
    0.00022154442   2    1000023    1000023
    0.00021496744   2   -3    3
    0.00012922712   2   -1000037    1000037
    0.00010386132   2    1000022    1000023
    6.7987828e-05   2    1000035    1000035
    4.2119351e-05   2    1000025    1000035
    7.8052924e-06   2    21    21
    6.4274788e-06   2    1000025    1000025
    5.942897e-07   2   -1    1
    3.7460721e-07   2    23    25
    1.3949001e-08   2    22    23
    1.259823e-08   2   -4    4
    8.4839855e-09   2   -11    11
    1.3819734e-09   2    22    22
    1.2695888e-09   2   -2000013    1000013
    1.2695888e-09   2   -1000013    2000013
    3.1341888e-13   2    23    35
    6.4947355e-14   2   -2    2
    2.9695811e-14   2   -2000011    1000011
    2.9695811e-14   2   -1000011    2000011
    2.0164534e-36   2    25    25

DECAY 37  117.17464
    0.52827702   2   -5    6
    0.10979571   2   -15    16
    0.1041543   2    1000022    1000037
    0.10287045   2    1000023    1000037
    0.10050658   2    1000024    1000035
    0.034002204   2    1000024    1000025
    0.0074434628   2   -1000015    1000016
    0.0066613151   2   -2000005    2000006
    0.0017662672   2   -2000005    1000006
    0.0016921229   2   -1000005    2000006
    0.001086607   2   -1000005    1000006
    0.00078260403   2   -5    4
    0.0003881669   2   -13    14
    0.00028150015   2    1000023    1000024
    0.0001844953   2   -3    4
    6.4429198e-05   2    1000025    1000037
    1.4940202e-05   2    1000022    1000024
    1.0929709e-05   2   -2000015    1000016
    8.6734839e-06   2   -3    2
    5.5885994e-06   2   -5    2
    1.5561515e-06   2   -3    6
    5.1169432e-07   2   -1    2
    3.2360806e-07   2    24    25
    5.8755212e-08   2   -1    6
    5.7159588e-08   2   -2000011    1000012
    5.7056959e-08   2   -2000013    1000014
    3.0785805e-08   2    1000035    1000037
    2.4521966e-08   2   -1    4
    9.0792641e-09   2   -11    12
    2.1346537e-09   2   -1000013    1000014
    4.9928119e-14   2   -1000011    1000012
    2.3566071e-14   2    24    35

DECAY 6  2.43
    1   2    5    24

DECAY 15 -1
