BLOCK SPINFO
   1   SPheno
   2   v4.0.5be

BLOCK SPHENOINFO
   1   2
   2   2

BLOCK MODSEL
   1   0

BLOCK MINPAR
   3    42.205695
   4   -1

BLOCK EXTPAR
   0    1693.8359
   1   -283.61377
   2   -1855.7069
   3    3000
   11   -3305.3781
   12    1146.7501
   13   -262.71029
   23   -1587.5348
   25    42.43298
   26    3972.4297
   31    985.17126
   32    985.17126
   33    1128.6748
   34    1591.5847
   35    1591.5847
   36    685.99987
   41    5000
   42    5000
   43    1867.6727
   44    5000
   45    5000
   46    1506.0572
   47    5000
   48    5000
   49    954.30877

BLOCK SMINPUTS
   1    127.90897
   2    1.1663787e-05
   3    0.1184
   4    91.1876
   5    4.18
   6    173.2
   7    1.777
   8    0
   11    0.00051099893
   12    0
   13    0.10565837
   14    0
   21    0.005
   22    0.0025
   23    0.095
   24    1.27

BLOCK GAUGE Q=  1693.8359
   1    0.35536298
   2    0.66519887
   3    1.219778

BLOCK YU Q=  1693.8359
   1   1    8.3867001e-06
   2   2    0.0042604436
   3   3    1.0131807

BLOCK YD Q=  1693.8359
   1   1    0.00071511337
   2   2    0.013587154
   3   3    0.70916838

BLOCK YE Q=  1693.8359
   1   1    0.00012479251
   2   2    0.025803134
   3   3    0.43396626

BLOCK AU Q=  1693.8359
   1   1    0
   2   2    0
   3   3   -3305.378

BLOCK AD Q=  1693.8359
   1   1    0
   2   2    0
   3   3    1146.7501

BLOCK AE Q=  1693.8359
   1   1    0
   2   2    0
   3   3   -262.71029

BLOCK MSOFT Q=  1693.8359
   1   -283.61377
   2   -1855.7069
   3    3000
   21    13429252
   22   -2458207.3
   31    985.17126
   32    985.17126
   33    1128.6748
   34    1591.5847
   35    1591.5847
   36    685.99987
   41    5000
   42    5000
   43    1867.6727
   44    5000
   45    5000
   46    1506.0572
   47    5000
   48    5000
   49    954.30877

BLOCK MASS
   6    173.2
   23    91.1876
   24    80.429995
   15    1.777
   25    122.7757
   35    3969.0497
   36    3972.4297
   37    3968.4422
   1000001    5032.444
   2000001    5024.3549
   1000002    5031.992
   2000002    5026.9306
   1000003    5032.4624
   2000003    5024.3508
   1000004    5031.9971
   2000004    5026.9313
   1000005    1022.7474
   2000005    1908.4485
   1000006    1475.4152
   2000006    1944.5917
   1000011    1006.1835
   2000011    1590.5125
   1000012    1002.6662
   1000013    1006.1894
   2000013    1590.5381
   1000014    1002.6912
   1000015    686.68006
   2000015    1158.75
   1000016    1148.3464
   1000021    3201.3515
   1000022   -282.79958
   1000023   -1565.7815
   1000025    1574.6221
   1000035   -1903.4579
   1000024    1564.9853
   1000037    1903.6939

BLOCK ALPHA
      -0.023741777

BLOCK HMIX Q=  1693.8359
   1   -1587.5348
   2    42.43298
   3    243.8959
   4    15780198

BLOCK STOPMIX
   1   1    0.30315071
   1   2    0.95294263
   2   1   -0.95294263
   2   2    0.30315071

BLOCK SBOTMIX
   1   1   -0.091139535
   1   2    0.99583813
   2   1   -0.99583813
   2   2   -0.091139535

BLOCK STAUMIX
   1   1   -0.13800305
   1   2    0.9904318
   2   1   -0.9904318
   2   2   -0.13800305

BLOCK NMIX
   1   1    0.99954751
   1   2   -0.0002797501
   1   3   -0.029504149
   1   4    0.0058477131
   2   1    0.024710795
   2   2    0.17445896
   2   3    0.69792051
   2   4   -0.69416166
   3   1    0.016717544
   3   2   -0.015586777
   3   3    0.70666982
   3   4    0.7071742
   4   1   -0.0038300319
   4   2    0.98454103
   4   3   -0.11249103
   4   4    0.13420154

BLOCK UMIX
   1   1   -0.15360262
   1   2   -0.9881327
   2   1   -0.9881327
   2   2    0.15360262

BLOCK VMIX
   1   1    0.18442834
   1   2    0.98284596
   2   1    0.98284596
   2   2   -0.18442834

BLOCK HIGGSBOUNDSINPUTHIGGSCOUPLINGSFERMIONS
       0, 1800.5578,3,36,15,15

BLOCK HIGGSBOUNDSINPUTHIGGSCOUPLINGSBOSONS
       0,4,36,21,21,23

BLOCK SPHENOLOWENERGY
   1    0.00036034573
   2    1.5871191e-06
   3    3.5244079e-05
   4    1.8474987e-15
   5    7.8921235e-11
   6    1.6416133e-08
   7    6.3413717e-14
   8    2.7089786e-09
   9    5.7146028e-07
   10    9.562906e-05
   11    0.98781158
   12    0.54337606
   13    19.393203
   14    0
   15    0
   16    0.0021678355
   17    2.2817661e-15
   18    2.4804186e-11
   19    8.290873e-11
   20    5.4414491e-15
   21    2.3266727e-10
   22    1.002052e-07
   23    0
   24    0
   25    0
   26    0
   27    0
   28    0
   29    0
   30    0
   31    0
   39    7.4142479e-05
   40    0
   41    0
   42    0

BLOCK FWCOEF Q=  160
   305   4422   0   0   -0.18881911
   305   4422   0   2   -0.23435269
   305   4322   0   2   -0.00039426999
   305   6421   0   0   -0.095227835
   305   6421   0   2   -0.12341671
   305   6321   0   2   -0.0002348899
   3051111   4133   0   0    1.5967335
   3051111   4133   0   2    1.597256
   3051111   4233   0   2    0.00024643937
   3051111   4137   0   0   -4.4194256
   3051111   4137   0   2   -4.4169898
   3051111   4237   0   2   -0.0019047486
   3051313   4133   0   0    1.5967335
   3051313   4133   0   2    1.5972516
   3051313   4233   0   2    0.00024643859
   3051313   4137   0   0   -4.4194256
   3051313   4137   0   2   -4.4169941
   3051313   4237   0   2   -0.0019047506
   3051212   4137   0   0    1.5053501
   3051212   4137   0   2    1.5048231
   3051212   4237   0   2    0.00041465916
   3051414   4137   0   0    1.5053501
   3051414   4137   0   2    1.5048231
   3051414   4237   0   2    0.00041465919
   3051616   4137   0   0    1.5053501
   3051616   4137   0   2    1.5048233
   3051616   4237   0   2    0.00041466809

BLOCK IMFWCOEF Q=  160
   305   4422   0   0    3.8561525e-07
   305   4422   0   2    4.038161e-06
   305   4322   0   2   -5.6739051e-06
   305   6421   0   0    3.3030497e-07
   305   6421   0   2    2.5027699e-05
   305   6321   0   2   -2.3661304e-06
   3051111   4133   0   2   -1.6459278e-06
   3051111   4233   0   2    4.9000321e-06
   3051111   4137   0   2    1.3334498e-05
   3051111   4237   0   2   -3.7877961e-05
   3051313   4133   0   2   -1.6458979e-06
   3051313   4233   0   2    4.9000212e-06
   3051313   4137   0   2    1.3334544e-05
   3051313   4237   0   2   -3.7878e-05
   3051212   4137   0   2   -2.8410584e-06
   3051212   4237   0   2    8.2459632e-06
   3051414   4137   0   2   -2.8410605e-06
   3051414   4237   0   2    8.2459632e-06
   3051616   4137   0   2   -2.8397625e-06
   3051616   4237   0   2    8.2459658e-06

DECAY 23  2.4952


DECAY 24  2.085


DECAY 1000011  1.0700321
    1   2    1000022    11

DECAY 2000011  7.4876505
    0.99999924   2    1000022    11

DECAY 1000013  1.0700498
    1   2    1000022    13

DECAY 2000013  7.4939823
    0.99917482   2    1000022    13
    0.00081980468   2    1000013    25

DECAY 1000015  2.3523006
    1   2    1000022    15

DECAY 2000015  6.217568
    0.40880943   2    1000015    23
    0.37499636   2    1000015    25
    0.21619418   2    1000022    15

DECAY 1000012  1.0672406
    1   2    1000022    12

DECAY 1000014  1.0672764
    1   2    1000022    14

DECAY 1000016  6.2264568
    0.79554596   2    1000015    24
    0.204454   2    1000022    16

DECAY 2000001  142.72663
    0.98047357   2    1000021    1
    0.019511383   2    1000022    1

DECAY 1000001  190.41278
    0.73934687   2    1000021    1
    0.16680457   2   -1000037    2
    0.082918706   2    1000035    1
    0.0044788813   2   -1000024    2
    0.0036737414   2    1000022    1
    0.0027444921   2    1000023    1

DECAY 2000003  142.75613
    0.98026793   2    1000021    3
    0.019507446   2    1000022    3
    0.00010291038   2   -1000024    4

DECAY 1000003  190.43147
    0.73928436   2    1000021    3
    0.16678952   2   -1000037    4
    0.082911952   2    1000035    3
    0.004485915   2   -1000024    4
    0.0036734784   2    1000022    3
    0.0027827164   2    1000023    3

DECAY 1000005  0.50810991
    1   2    1000022    5

DECAY 2000005  43.634523
    0.60975351   2    1000006   -24
    0.15888391   2    1000005    23
    0.10619167   2    1000005    25
    0.074524116   2   -1000024    6
    0.022763755   2    1000023    5
    0.022313   2    1000025    5
    0.0055681236   2    1000022    5

DECAY 2000002  151.36079
    0.92631367   2    1000021    2
    0.073631741   2    1000022    2

DECAY 1000002  190.40016
    0.73914892   2    1000021    2
    0.16501068   2    1000037    1
    0.082682355   2    1000035    2
    0.006456765   2    1000024    1
    0.0036506277   2    1000022    2
    0.0030355947   2    1000023    2

DECAY 2000004  151.36374
    0.92629562   2    1000021    4
    0.073630303   2    1000022    4

DECAY 1000004  190.41718
    0.73908529   2    1000021    4
    0.16499793   2    1000037    3
    0.082675161   2    1000035    4
    0.0065332589   2    1000024    3
    0.0036503047   2    1000022    4
    0.0030391192   2    1000023    4

DECAY 1000006  2.9438568
    0.92110322   2    1000022    6
    0.07559027   2    1000005    24
    0.0025826511   2    1000022    4
    0.00068728296   3   -1000015    16    5

DECAY 2000006  53.547964
    0.28654358   2    1000006    25
    0.2808674   2    1000006    23
    0.26345319   2    1000005    24
    0.055203227   2    1000024    5
    0.053937764   2    1000023    6
    0.047924414   2    1000025    6
    0.01164256   2    1000022    6
    0.00042787175   2    1000037    5

DECAY 1000024  12.718287
    0.6481281   2   -1000005    6
    0.15367391   2   -1000015    16
    0.082450199   2    1000022    24
    0.052011725   2    1000016   -15
    0.038903964   2    1000006   -5
    0.0066789957   2    1000014   -13
    0.0064023191   2    1000012   -11
    0.0043976207   2   -1000011    12
    0.0043975489   2   -1000013    14
    0.0025139284   3    1000022   -5    6
    0.00044111554   2   -2000015    16

DECAY 1000037  33.613262
    0.12640377   2   -1000011    12
    0.12640264   2   -1000013    14
    0.12573239   2    1000012   -11
    0.12573196   2    1000014   -13
    0.098396458   2    1000016   -15
    0.097308725   2   -2000015    16
    0.081023901   2    1000023    24
    0.059560451   2    1000024    23
    0.058593306   2    1000024    25
    0.057928759   2    1000025    24
    0.038374472   2    1000006   -5
    0.0025975919   2   -1000005    6
    0.0011514931   2    1000022    24
    0.00025985975   2   -1000015    16
    0.00025161786   3    1000023   -5    6
    0.0002065497   3    1000025   -5    6

DECAY 1000022 -1


DECAY 1000023  11.661544
    0.33121738   2    1000005   -5
    0.33121738   2   -1000005    5
    0.085609595   2    1000015   -15
    0.085609595   2   -1000015    15
    0.057090978   2    1000022    25
    0.027816969   2    1000022    23
    0.025403021   2    2000015   -15
    0.025403021   2   -2000015    15
    0.0037352014   2    1000013   -13
    0.0037352014   2   -1000013    13
    0.0035863262   2    1000011   -11
    0.0035863262   2   -1000011    11
    0.0026742499   2    1000012   -12
    0.0026742499   2   -1000012    12
    0.0026740645   2    1000014   -14
    0.0026740645   2   -1000014    14
    0.0019679702   3    1000022    6   -6
    0.0016409843   2    1000016   -16
    0.0016409843   2   -1000016    16

DECAY 1000025  11.796921
    0.33243827   2    1000005   -5
    0.33243827   2   -1000005    5
    0.081059099   2    1000015   -15
    0.081059099   2   -1000015    15
    0.063942495   2    1000022    23
    0.053237377   2    1000022    25
    0.026556835   2    2000015   -15
    0.026556835   2   -2000015    15
    0.0020431628   3    1000022    6   -6
    0.00015911149   2    1000013   -13
    0.00015911149   2   -1000013    13

DECAY 1000035  35.875177
    0.069287864   2    1000025    23
    0.062747305   2    1000024   -24
    0.062747305   2   -1000024    24
    0.059333122   2    1000012   -12
    0.059333122   2   -1000012    12
    0.05933085   2    1000014   -14
    0.05933085   2   -1000014    14
    0.058526623   2    1000013   -13
    0.058526623   2   -1000013    13
    0.058524727   2    1000011   -11
    0.058524727   2   -1000011    11
    0.0537536   2    1000023    25
    0.052319616   2    1000025    25
    0.04597859   2    1000016   -16
    0.04597859   2   -1000016    16
    0.045623677   2    2000015   -15
    0.045623677   2   -2000015    15
    0.01995846   2    1000006   -6
    0.01995846   2   -1000006    6
    0.001141794   2    1000005   -5
    0.001141794   2   -1000005    5
    0.00066403015   2    1000022    25
    0.00052275147   2    1000023    23
    0.00039362689   2    1000022    23
    0.00020363811   3    1000024    5   -6
    0.00020363811   3   -1000024   -5    6
    0.00010446807   2    1000015   -15
    0.00010446807   2   -1000015    15

DECAY 1000021  213.68587
    0.17887088   2    1000005   -5
    0.17887088   2   -1000005    5
    0.12640442   2    1000006   -6
    0.12640442   2   -1000006    6
    0.096464014   2    2000006   -6
    0.096464014   2   -2000006    6
    0.092067168   2    2000005   -5
    0.092067168   2   -2000005    5
    0.0054949696   2    1000006   -4
    0.0054949696   2   -1000006    4
    0.00029124046   3    1000024    5   -6
    0.00029124046   3   -1000024   -5    6
    0.00016581464   3    1000025    6   -6
    0.00015680313   3    1000023    6   -6

DECAY 25  0.0035907232
    0.60680581   2   -5    5
    0.1943382   2   -24    24
    0.072383938   2    21    21
    0.069769072   2   -15    15
    0.030056631   2   -4    4
    0.022496065   2    23    23
    0.0023603069   2    22    22
    0.001318623   2    22    23
    0.00024201384   2   -13    13
    0.00022854601   2   -3    3
    6.3190903e-07   2   -1    1
    1.5489565e-07   2   -2    2
    5.4407721e-09   2   -11    11

DECAY 35  247.84903
    0.7564138   2   -5    5
    0.070427156   2   -15    15
    0.024445416   2   -2000006    1000006
    0.024445416   2   -1000006    2000006
    0.02009737   2   -1000024    1000037
    0.02009737   2   -1000037    1000024
    0.016231577   2    1000025    1000035
    0.015856629   2   -1000006    1000006
    0.012829778   2   -2000005    1000005
    0.012829778   2   -1000005    2000005
    0.0072774885   2    1000022    1000025
    0.0058012979   2    1000022    1000023
    0.0053437699   2   -2000006    2000006
    0.0032879563   2    1000023    1000035
    0.0013045298   2   -1000024    1000024
    0.00064114338   2   -6    6
    0.00057959604   2    1000023    1000025
    0.00049025616   2    1000023    1000023
    0.00046331069   2   -1000005    1000005
    0.00024819773   2   -13    13
    0.00015799864   2   -1000037    1000037
    0.00015242991   2   -3    3
    0.00013274727   2   -2000015    1000015
    0.00013274727   2   -1000015    2000015
    9.4724031e-05   2   -2000005    2000005
    7.983109e-05   2    1000035    1000035
    6.1373839e-05   2    1000022    1000035
    2.8556595e-05   2    1000022    1000022
    1.2659976e-05   2   -1000015    1000015
    1.056367e-05   2   -2000015    2000015
    9.7401618e-06   2    25    25
    8.9288958e-06   2    1000025    1000025
    5.067275e-06   2    21    21
    4.2155323e-07   2   -1    1
    1.0957728e-07   2    23    23
    3.2115054e-08   2    22    22
    2.3354948e-08   2   -24    24
    2.2498921e-08   2    22    23
    1.3334842e-08   2   -1000011    1000011
    1.303551e-08   2   -1000013    1000013
    6.8500424e-09   2   -2000013    1000013
    6.8500424e-09   2   -1000013    2000013
    5.9747313e-09   2   -2000013    2000013
    5.935413e-09   2   -2000011    2000011
    5.5738722e-09   2   -11    11
    2.52481e-09   2   -4    4
    1.6023625e-13   2   -2000011    1000011
    1.6023625e-13   2   -1000011    2000011
    1.3005132e-14   2   -2    2

DECAY 36  226.93342
    0.73879147   2   -5    5
    0.068767825   2   -15    15
    0.03977879   2   -2000006    1000006
    0.03977879   2   -1000006    2000006
    0.019787982   2   -1000024    1000037
    0.019787982   2   -1000037    1000024
    0.015953708   2    1000023    1000035
    0.014417313   2   -2000005    1000005
    0.014417313   2   -1000005    2000005
    0.0079764002   2    1000022    1000023
    0.0063108636   2    1000022    1000025
    0.0041946826   2   -1000024    1000024
    0.0039453241   2    1000025    1000035
    0.0017149685   2   -1000037    1000037
    0.0015974608   2    1000023    1000023
    0.00086578423   2    1000035    1000035
    0.00084129888   2   -6    6
    0.00024235065   2   -13    13
    0.00020497575   2    1000023    1000025
    0.00015751202   2   -2000015    1000015
    0.00015751202   2   -1000015    2000015
    0.00014883595   2   -3    3
    9.4680534e-05   2    1000022    1000035
    3.2479833e-05   2    1000022    1000022
    2.4763484e-05   2    1000025    1000025
    8.1158497e-06   2    21    21
    4.1161659e-07   2   -1    1
    2.5086248e-07   2    23    25
    8.6185385e-08   2    22    23
    4.1481564e-08   2    22    22
    7.4301143e-09   2   -2000013    1000013
    7.4301143e-09   2   -1000013    2000013
    5.4425955e-09   2   -11    11
    4.0261704e-09   2   -4    4
    2.1356069e-12   2    23    35
    1.7379102e-13   2   -2000011    1000011
    1.7379102e-13   2   -1000011    2000011
    2.0743013e-14   2   -2    2
    2.7472787e-37   2    25    25

DECAY 37  202.07476
    0.74683327   2   -5    6
    0.069959294   2   -15    16
    0.050739087   2   -2000005    1000006
    0.026621054   2   -1000005    2000006
    0.02565623   2    1000023    1000037
    0.02511836   2    1000024    1000035
    0.024032474   2    1000025    1000037
    0.016012419   2    1000022    1000024
    0.0094787144   2   -1000005    1000006
    0.0021628287   2   -2000005    2000006
    0.0012844025   2    1000024    1000025
    0.0011073906   2   -5    4
    0.00034665628   2   -1000015    1000016
    0.00024733101   2   -13    14
    0.00018088228   2    1000022    1000037
    0.00016886729   2   -3    4
    2.5621885e-05   2    1000023    1000024
    7.9337962e-06   2   -3    2
    7.9079106e-06   2   -5    2
    7.4612439e-06   2   -2000015    1000016
    8.5399973e-07   2   -3    6
    4.688795e-07   2   -1    2
    2.8097233e-07   2    24    25
    6.4213156e-08   2   -1000011    1000012
    6.3696345e-08   2   -1000013    1000014
    2.7632377e-08   2   -1    6
    2.2217047e-08   2   -1    4
    1.69823e-08   2   -2000013    1000014
    1.2016137e-08   2    1000035    1000037
    5.785098e-09   2   -11    12
    3.9723737e-13   2   -2000011    1000012

DECAY 6  2.43
    1   2    5    24

DECAY 15 -1
