BLOCK SPINFO
   1   SPheno
   2   v4.0.5be

BLOCK SPHENOINFO
   1   2
   2   2

BLOCK MODSEL
   1   0

BLOCK MINPAR
   3    30.630389
   4    1

BLOCK EXTPAR
   0    2647.2915
   1   -712.22987
   2   -3860.6164
   3    2549.2494
   11   -5071.6002
   12    3772.0408
   13   -3377.9773
   23    1880.8492
   25    29.471831
   26    3505.8978
   31    1739.0717
   32    1739.0717
   33    789.98935
   34    4140.4826
   35    4140.4826
   36    3137.3693
   41    2711.6476
   42    2711.6476
   43    1515.4002
   44    3887.3637
   45    3887.3637
   46    4207.7241
   47    1785.1801
   48    1785.1801
   49    525.90077

BLOCK SMINPUTS
   1    127.90897
   2    1.1663787e-05
   3    0.1184
   4    91.1876
   5    4.18
   6    173.2
   7    1.777
   8    0
   11    0.00051099893
   12    0
   13    0.10565837
   14    0
   21    0.005
   22    0.0025
   23    0.095
   24    1.27

BLOCK GAUGE Q=  2647.2915
   1    0.35536298
   2    0.66519887
   3    1.219778

BLOCK YU Q=  2647.2915
   1   1    8.3891972e-06
   2   2    0.0042617122
   3   3    1.0134824

BLOCK YD Q=  2647.2915
   1   1    0.00049682996
   2   2    0.0094397691
   3   3    0.49269963

BLOCK YE Q=  2647.2915
   1   1    8.670046e-05
   2   2    0.017926905
   3   3    0.30150106

BLOCK AU Q=  2647.2915
   1   1    0
   2   2    0
   3   3   -5071.6001

BLOCK AD Q=  2647.2915
   1   1    0
   2   2    0
   3   3    3772.0477

BLOCK AE Q=  2647.2915
   1   1    0
   2   2    0
   3   3   -3377.9773

BLOCK MSOFT Q=  2647.2915
   1   -712.22987
   2   -3860.6164
   3    2549.2494
   21    8681954.7
   22   -3586279.8
   31    1739.0717
   32    1739.0717
   33    789.98935
   34    4140.4826
   35    4140.4826
   36    3137.3693
   41    2711.6476
   42    2711.6476
   43    1515.4002
   44    3887.3637
   45    3887.3637
   46    4207.7241
   47    1785.1801
   48    1785.1801
   49    525.90077

BLOCK MASS
   6    173.2
   23    91.1876
   24    80.429995
   15    1.777
   25    124.21351
   35    3505.7623
   36    3505.8978
   37    3507.1666
   1000001    2822.4514
   2000001    1902.1669
   1000002    2821.3572
   2000002    3948.1413
   1000003    2822.4505
   2000003    1902.1655
   1000004    2821.3562
   2000004    3948.1409
   1000005    734.51232
   2000005    1673.7683
   1000006    1666.4235
   2000006    4205.505
   1000011    1759.9031
   2000011    4143.0781
   1000012    1757.7351
   1000013    1759.9035
   2000013    4143.0643
   1000014    1757.7333
   1000015    815.50494
   2000015    3134.1105
   1000016    813.2681
   1000021    2711.652
   1000022   -709.56892
   1000023   -1889.8599
   1000025    1891.1023
   1000035   -3807.8625
   1000024    1889.825
   1000037    3807.9211

BLOCK ALPHA
      -0.032679043

BLOCK HMIX Q=  2647.2915
   1    1880.8492
   2    29.471831
   3    243.41316
   4    12291319

BLOCK STOPMIX
   1   1    0.99882324
   1   2    0.048498774
   2   1   -0.048498774
   2   2    0.99882324

BLOCK SBOTMIX
   1   1    0.038951893
   1   2    0.99924109
   2   1   -0.99924109
   2   2    0.038951893

BLOCK STAUMIX
   1   1    0.99994088
   1   2    0.010873357
   2   1   -0.010873357
   2   2    0.99994088

BLOCK NMIX
   1   1   -0.99960684
   1   2    0.00019733639
   1   3   -0.026512285
   1   4   -0.0091230543
   2   1    0.025197735
   2   2    0.027529391
   2   3   -0.70672688
   2   4   -0.70650146
   3   1    0.012292481
   3   2   -0.010026597
   3   3   -0.70688116
   3   4    0.70715443
   4   1   -0.00037332802
   4   2    0.99957069
   4   3    0.012378694
   4   4    0.026553108

BLOCK UMIX
   1   1   -0.017616
   1   2    0.99984483
   2   1   -0.99984483
   2   2   -0.017616

BLOCK VMIX
   1   1    0.037926257
   1   2    0.99928054
   2   1    0.99928054
   2   2   -0.037926257

BLOCK HIGGSBOUNDSINPUTHIGGSCOUPLINGSFERMIONS
       0, 868.58884,3,36,15,15

BLOCK HIGGSBOUNDSINPUTHIGGSCOUPLINGSBOSONS
       0,4,36,21,21,23

BLOCK SPHENOLOWENERGY
   1    0.00031123616
   2    1.5919069e-06
   3    3.5259181e-05
   4    1.9886361e-15
   5    8.4952256e-11
   6    1.7783122e-08
   7    6.6406394e-14
   8    2.8368788e-09
   9    6.017269e-07
   10    9.6475643e-05
   11    0.99655646
   12    0.54173307
   13    19.354872
   14    0
   15    0
   16    0.0021565036
   17    2.2816504e-15
   18    2.4809285e-11
   19    8.2919541e-11
   20   -1.2070861e-15
   21   -5.1607525e-11
   22   -2.1303344e-08
   23    0
   24    0
   25    0
   26    0
   27    0
   28    0
   29    0
   30    0
   31    0
   39    6.322195e-05
   40    0
   41    0
   42    0

BLOCK FWCOEF Q=  160
   305   4422   0   0   -0.18881911
   305   4422   0   2   -0.17589726
   305   4322   0   2    0.0001567795
   305   6421   0   0   -0.095227835
   305   6421   0   2   -0.097263299
   305   6321   0   2   -8.5986312e-05
   3051111   4133   0   0    1.6121703
   3051111   4133   0   2    1.6124803
   3051111   4233   0   2    0.00031199925
   3051111   4137   0   0   -4.4348624
   3051111   4137   0   2   -4.4339434
   3051111   4237   0   2   -0.0023575558
   3051313   4133   0   0    1.6121703
   3051313   4133   0   2    1.6124797
   3051313   4233   0   2    0.00031199906
   3051313   4137   0   0   -4.4348624
   3051313   4137   0   2   -4.433944
   3051313   4237   0   2   -0.0023575564
   3051212   4137   0   0    1.5053501
   3051212   4137   0   2    1.5051498
   3051212   4237   0   2    0.00051146042
   3051414   4137   0   0    1.5053501
   3051414   4137   0   2    1.5051498
   3051414   4237   0   2    0.00051146043
   3051616   4137   0   0    1.5053501
   3051616   4137   0   2    1.5051484
   3051616   4237   0   2    0.00051146398

BLOCK IMFWCOEF Q=  160
   305   4422   0   0    3.8587924e-07
   305   4422   0   2    2.9417913e-05
   305   4322   0   2    4.5458997e-06
   305   6421   0   0    3.3053109e-07
   305   6421   0   2   -9.0569212e-05
   305   6321   0   2    7.8035898e-07
   3051111   4133   0   2   -3.3957288e-07
   3051111   4233   0   2    5.8945769e-06
   3051111   4137   0   2    9.0956748e-06
   3051111   4237   0   2   -4.4543257e-05
   3051313   4133   0   2   -3.3956428e-07
   3051313   4233   0   2    5.8945746e-06
   3051313   4137   0   2    9.0956812e-06
   3051313   4237   0   2   -4.4543269e-05
   3051212   4137   0   2   -1.9882446e-06
   3051212   4237   0   2    9.6634469e-06
   3051414   4137   0   2   -1.9882464e-06
   3051414   4237   0   2    9.6634469e-06
   3051616   4137   0   2   -2.0138735e-06
   3051616   4237   0   2    9.663448e-06

DECAY 23  2.4952


DECAY 24  2.085


DECAY 1000011  1.5480282
    1   2    1000022    11

DECAY 2000011  19.608968
    0.99947668   2    1000022    11
    0.00042274435   2    1000023    11
    0.00010054633   2    1000025    11

DECAY 1000013  1.5480347
    1   2    1000022    13

DECAY 2000013  19.644343
    0.99767399   2    1000022    13
    0.00084541279   2   -1000024    14
    0.00084437032   2    1000023    13
    0.00052263443   2    1000025    13
    0.00011357669   2    1000013    25

DECAY 1000015  0.060578675
    1   2    1000022    15

DECAY 2000015  22.820669
    0.62063488   2    1000022    15
    0.1004642   2   -1000024    16
    0.087828004   2    1000016   -24
    0.050391047   2    1000023    15
    0.050272773   2    1000025    15
    0.046583168   2    1000015    25
    0.043825921   2    1000015    23

DECAY 1000012  1.5469483
    0.99998478   2    1000022    12

DECAY 1000014  1.5469458
    0.99998465   2    1000022    14

DECAY 1000016  0.05823447
    1   2    1000022    16

DECAY 2000001  0.78635973
    0.99999983   2    1000022    1

DECAY 1000001  1.6710619
    0.78987402   2    1000021    1
    0.20718005   2    1000022    1
    0.0014042773   2   -1000024    2
    0.0012025062   2    1000023    1
    0.0003381475   2    1000025    1

DECAY 2000003  0.78636131
    0.99999846   2    1000022    3

DECAY 1000003  1.6734631
    0.7887268   2    1000021    3
    0.20688448   2    1000022    3
    0.0016537072   2    1000023    3
    0.0015862269   2   -1000024    4
    0.00079026085   2    1000025    3
    0.00035852394   2    2000003    25

DECAY 1000005  0.0017634238
    1   2    1000022    5

DECAY 2000005  4.9331687
    0.71466188   2    1000005    25
    0.25368342   2    1000005    23
    0.031654696   2    1000022    5

DECAY 1000002  1.6544543
    0.78272416   2    1000021    2
    0.20823129   2    1000022    2
    0.0065661402   2    1000024    1
    0.0023385672   2    1000023    2
    0.00013984416   2    1000025    2

DECAY 2000002  95.227158
    0.9133217   2    1000021    2
    0.086635058   2    1000022    2

DECAY 1000004  1.6561492
    0.78184249   2    1000021    4
    0.20801796   2    1000022    4
    0.0074755253   2    1000024    3
    0.0024306857   2    1000023    4
    0.00023333592   2    1000025    4

DECAY 2000004  95.228732
    0.91330539   2    1000021    4
    0.086633597   2    1000022    4

DECAY 1000006  2.6231732
    0.93816995   2    1000005    24
    0.059289064   2    1000022    6
    0.0024549841   3    1000022    24    5

DECAY 2000006  389.0679
    0.28579247   2    1000021    6
    0.18177582   2    2000005    24
    0.14057245   2    1000024    5
    0.13700273   2    1000006    25
    0.091215852   2    1000006    23
    0.070355593   2    1000025    6
    0.070155163   2    1000023    6
    0.02270701   2    1000022    6
    0.00042250299   2    1000005    24

DECAY 1000024  14.886536
    0.68718181   2   -1000005    6
    0.11051134   2   -2000005    6
    0.077134119   2    1000022    24
    0.076691088   2    1000016   -15
    0.045574451   2    1000006   -5
    0.0026747691   3    1000022   -5    6
    0.00018804344   2   -1000015    16

DECAY 1000037  207.80585
    0.15848705   2    1000006   -5
    0.15565987   2   -2000005    6
    0.073382381   2   -1000015    16
    0.073365425   2    1000016   -15
    0.049874241   2    1000014   -13
    0.049874173   2    1000012   -11
    0.049863794   2   -1000011    12
    0.049863783   2   -1000013    14
    0.049154289   2    1000004   -3
    0.049154196   2    1000002   -1
    0.049116857   2   -1000003    4
    0.04911684   2   -1000001    2
    0.035695213   2    1000024    25
    0.033720185   2    1000024    23
    0.033533697   2    1000025    24
    0.032862848   2    1000023    24
    0.0029493243   3    1000024    6   -6
    0.0021989698   3    1000023   -5    6
    0.0019075101   3    1000025   -5    6
    0.00014919625   2   -1000005    6

DECAY 1000022 -1


DECAY 1000023  14.742173
    0.33492042   2    1000005   -5
    0.33492042   2   -1000005    5
    0.066315521   2    1000006   -6
    0.066315521   2   -1000006    6
    0.060536699   2    1000022    25
    0.038700018   2    1000015   -15
    0.038700018   2   -1000015    15
    0.021540971   2    2000005   -5
    0.021540971   2   -2000005    5
    0.015022725   2    1000022    23
    0.0013624792   3    1000022    6   -6

DECAY 1000025  15.647954
    0.31499418   2    1000005   -5
    0.31499418   2   -1000005    5
    0.065197422   2    1000006   -6
    0.065197422   2   -1000006    6
    0.065161647   2    1000022    25
    0.05960927   2    1000022    23
    0.036157937   2    1000015   -15
    0.036157937   2   -1000015    15
    0.02052305   2    2000005   -5
    0.02052305   2   -2000005    5
    0.0013704418   3    1000022    6   -6

DECAY 1000035  216.10127
    0.077341123   2    1000006   -6
    0.077341123   2   -1000006    6
    0.075639142   2    2000005   -5
    0.075639142   2   -2000005    5
    0.035305706   2    1000016   -16
    0.035305706   2   -1000016    16
    0.035250383   2    1000015   -15
    0.035250383   2   -1000015    15
    0.03470427   2    1000025    25
    0.033184521   2    1000024   -24
    0.033184521   2   -1000024    24
    0.030396177   2    1000023    25
    0.028246242   2    1000025    23
    0.024002594   2    1000014   -14
    0.024002594   2   -1000014    14
    0.024002568   2    1000012   -12
    0.024002568   2   -1000012    12
    0.02395137   2    1000011   -11
    0.02395137   2   -1000011    11
    0.023951368   2    1000013   -13
    0.023951368   2   -1000013    13
    0.023642157   2    1000004   -4
    0.023642157   2   -1000004    4
    0.023642111   2    1000002   -2
    0.023642111   2   -1000002    2
    0.023603799   2    1000003   -3
    0.023603799   2   -1000003    3
    0.023603761   2    1000001   -1
    0.023603761   2   -1000001    1
    0.003740954   2    1000023    23
    0.0025276112   3    1000024    5   -6
    0.0025276112   3   -1000024   -5    6
    0.0017875142   3    1000025    6   -6
    0.0016056281   3    1000023    6   -6

DECAY 1000021  171.33199
    0.20107376   2    1000005   -5
    0.20107376   2   -1000005    5
    0.089785768   2    2000005   -5
    0.089785768   2   -2000005    5
    0.088205498   2    1000006   -6
    0.088205498   2   -1000006    6
    0.060431231   2    2000003   -3
    0.060431231   2   -2000003    3
    0.060431055   2    2000001   -1
    0.060431055   2   -2000001    1

DECAY 25  0.0037740207
    0.58518013   2   -5    5
    0.21607208   2   -24    24
    0.072672489   2    21    21
    0.067159092   2   -15    15
    0.028932761   2   -4    4
    0.025749223   2    23    23
    0.0023476983   2    22    22
    0.0014335231   2    22    23
    0.00023290781   2   -13    13
    0.0002193328   2   -3    3
    6.0643204e-07   2   -1    1
    1.490999e-07   2   -2    2
    5.236036e-09   2   -11    11

DECAY 35  34.68999
    0.40092129   2   -5    5
    0.19205026   2   -2000005    1000005
    0.19205026   2   -1000005    2000005
    0.15720873   2   -15    15
    0.031144547   2    1000022    1000025
    0.018204672   2    1000022    1000023
    0.0029826864   2   -6    6
    0.0022977941   2   -1000006    1000006
    0.001448336   2   -1000005    1000005
    0.00069356794   2   -2000005    2000005
    0.00056677257   2   -13    13
    0.00022402728   2   -3    3
    0.00012868412   2    1000022    1000022
    4.398627e-05   2   -1000015    1000015
    2.9898231e-05   2    21    21
    2.305565e-06   2    25    25
    6.1935604e-07   2   -1    1
    4.1171948e-07   2    23    23
    1.0187726e-07   2   -24    24
    4.880136e-08   2   -4    4
    3.9353575e-08   2    22    23
    2.8797544e-08   2   -1000011    1000011
    2.863478e-08   2   -1000013    1000013
    1.7812612e-08   2    22    22
    1.2728756e-08   2   -11    11
    2.5165934e-13   2   -2    2

DECAY 36  33.788738
    0.3945637   2   -5    5
    0.19837295   2   -2000005    1000005
    0.19837295   2   -1000005    2000005
    0.15466248   2   -15    15
    0.032163965   2    1000022    1000023
    0.018570237   2    1000022    1000025
    0.002351283   2   -6    6
    0.00055758723   2   -13    13
    0.00022041272   2   -3    3
    0.00015114082   2    1000022    1000022
    1.1764606e-05   2    21    21
    7.8076349e-07   2    23    25
    6.0936451e-07   2   -1    1
    5.0359343e-08   2    22    22
    3.8727218e-08   2   -4    4
    3.6257154e-08   2    22    23
    1.2522465e-08   2   -11    11
    1.9973245e-13   2   -2    2
    4.651937e-38   2    25    25

DECAY 37  38.230775
    0.43636457   2   -5    6
    0.34486892   2   -1000005    1000006
    0.17212486   2   -15    16
    0.044986626   2    1000022    1000024
    0.00064158837   2   -5    4
    0.00060852272   2   -13    14
    0.00019079478   2   -3    4
    0.00013989558   2   -1000005    1000004
    2.702303e-05   2   -2000005    1000006
    2.5249434e-05   2   -1000015    1000016
    8.9498671e-06   2   -3    2
    5.6862955e-06   2   -3    6
    4.5816022e-06   2   -5    2
    9.9900039e-07   2   -1000005    1000002
    6.9111263e-07   2    24    25
    5.2913311e-07   2   -1    2
    2.4780033e-07   2   -1    6
    1.0869775e-07   2   -1000011    1000012
    1.0847864e-07   2   -1000013    1000014
    2.701517e-08   2   -1    4
    1.423341e-08   2   -11    12
    2.5874906e-11   2   -1000003    1000006
    1.9454027e-13   2    24    35
    1.1713068e-13   2    24    36
    3.2864345e-15   2   -1000001    1000006

DECAY 6  2.43
    1   2    5    24

DECAY 15 -1
