BLOCK SPINFO
   1   SPheno
   2   v4.0.5be

BLOCK SPHENOINFO
   1   2
   2   2

BLOCK MODSEL
   1   0

BLOCK MINPAR
   3    55.084784
   4    1

BLOCK EXTPAR
   0    1777.2284
   1    162.76161
   2   -531.28858
   3    3000
   11   -5202.3721
   12   -1092.7246
   13   -226.94651
   23    728.89576
   25    54.671908
   26    2265.7826
   31    1007.5695
   32    1007.5695
   33    1559.4819
   34    712.70834
   35    712.70834
   36    1124.6904
   41    5000
   42    5000
   43    1941.4081
   44    5000
   45    5000
   46    1748.5049
   47    5000
   48    5000
   49    1050.8906

BLOCK SMINPUTS
   1    127.90897
   2    1.1663787e-05
   3    0.1184
   4    91.1876
   5    4.18
   6    173.2
   7    1.777
   8    0
   11    0.00051099893
   12    0
   13    0.10565837
   14    0
   21    0.005
   22    0.0025
   23    0.095
   24    1.27

BLOCK GAUGE Q=  1777.2284
   1    0.35536298
   2    0.66519887
   3    1.219778

BLOCK YU Q=  1777.2284
   1   1    8.3857745e-06
   2   2    0.0042599735
   3   3    1.0130689

BLOCK YD Q=  1777.2284
   1   1    0.00092127155
   2   2    0.01750416
   3   3    0.91361269

BLOCK YE Q=  1777.2284
   1   1    0.00016076862
   2   2    0.033241852
   3   3    0.55907327

BLOCK AU Q=  1777.2284
   1   1    0
   2   2    0
   3   3   -5202.3716

BLOCK AD Q=  1777.2284
   1   1    0
   2   2    0
   3   3   -1092.725

BLOCK AE Q=  1777.2284
   1   1    0
   2   2    0
   3   3   -226.94651

BLOCK MSOFT Q=  1777.2284
   1    162.76161
   2   -531.28858
   3    3000
   21    4737859.5
   22   -473080.4
   31    1007.5695
   32    1007.5695
   33    1559.4819
   34    712.70834
   35    712.70834
   36    1124.6904
   41    5000
   42    5000
   43    1941.4081
   44    5000
   45    5000
   46    1748.5049
   47    5000
   48    5000
   49    1050.8906

BLOCK MASS
   6    173.2
   23    91.1876
   24    80.429995
   15    1.777
   25    123.07727
   35    2263.4357
   36    2265.7826
   37    2265.9675
   1000001    5042.1595
   2000001    5031.3824
   1000002    5041.7164
   2000002    5032.3181
   1000003    5042.1649
   2000003    5031.3852
   1000004    5041.7194
   2000004    5032.3185
   1000005    1080.9574
   2000005    1913.9189
   1000006    1563.5746
   2000006    2020.0768
   1000011    1011.648
   2000011    718.43236
   1000012    1008.2439
   1000013    1011.6414
   2000013    718.36417
   1000014    1008.2208
   1000015    1112.9596
   2000015    1557.6167
   1000016    1553.9555
   1000021    3213.3489
   1000022    161.17008
   1000023   -550.23982
   1000025    737.29011
   1000035   -751.07617
   1000024    550.51584
   1000037    752.49939

BLOCK ALPHA
      -0.018260693

BLOCK HMIX Q=  1777.2284
   1    728.89576
   2    54.671908
   3    243.78419
   4    5133770.9

BLOCK STOPMIX
   1   1    0.50109226
   1   2    0.86539387
   2   1   -0.86539387
   2   2    0.50109226

BLOCK SBOTMIX
   1   1    0.032559691
   1   2    0.99946979
   2   1   -0.99946979
   2   2    0.032559691

BLOCK STAUMIX
   1   1    0.058298053
   1   2    0.99829922
   2   1   -0.99829922
   2   2    0.058298053

BLOCK NMIX
   1   1   -0.99784572
   1   2   -0.0019679467
   1   3   -0.063760885
   1   4    0.015316764
   2   1   -0.010014226
   2   2   -0.95986739
   2   3    0.22612587
   2   4    0.16559409
   3   1    0.055893349
   3   2   -0.04432013
   3   3   -0.70348671
   3   4    0.70711959
   4   1   -0.032856892
   4   2    0.27692319
   4   3    0.67075188
   4   4    0.68725969

BLOCK UMIX
   1   1   -0.94692573
   1   2    0.32145241
   2   1   -0.32145241
   2   2   -0.94692573

BLOCK VMIX
   1   1    0.9716218
   1   2    0.23653979
   2   1    0.23653979
   2   2   -0.9716218

BLOCK HIGGSBOUNDSINPUTHIGGSCOUPLINGSFERMIONS
       0, 2989.0175,3,36,15,15

BLOCK HIGGSBOUNDSINPUTHIGGSCOUPLINGSBOSONS
       0,4,36,21,21,23

BLOCK SPHENOLOWENERGY
   1    0.00026281279
   2    1.6032982e-06
   3    3.5245481e-05
   4    2.9883112e-15
   5    1.2764722e-10
   6    2.6140112e-08
   7    9.9403073e-14
   8    4.2461772e-09
   9    8.8193589e-07
   10    9.50244e-05
   11    0.98156567
   12    0.54189992
   13    19.34712
   14    0
   15    0
   16    0.0021570261
   17    2.2816588e-15
   18    2.4815399e-11
   19    8.2928888e-11
   20   -7.8559421e-15
   21   -3.356946e-10
   22   -8.7789525e-08
   23    0
   24    0
   25    0
   26    0
   27    0
   28    0
   29    0
   30    0
   31    0
   39    9.2072696e-05
   40    0
   41    0
   42    0

BLOCK FWCOEF Q=  160
   305   4422   0   0   -0.18881911
   305   4422   0   2   -0.11533691
   305   4322   0   2    0.00043122456
   305   6421   0   0   -0.095227835
   305   6421   0   2   -0.060738972
   305   6321   0   2    4.0486644e-05
   3051111   4133   0   0    1.5989036
   3051111   4133   0   2    1.5994809
   3051111   4233   0   2    0.0005247626
   3051111   4137   0   0   -4.4215957
   3051111   4137   0   2   -4.4192709
   3051111   4237   0   2   -0.0040438696
   3051313   4133   0   0    1.5989036
   3051313   4133   0   2    1.5994736
   3051313   4233   0   2    0.00052475672
   3051313   4137   0   0   -4.4215957
   3051313   4137   0   2   -4.4192782
   3051313   4237   0   2   -0.0040438761
   3051212   4137   0   0    1.5053501
   3051212   4137   0   2    1.5048718
   3051212   4237   0   2    0.00087991335
   3051414   4137   0   0    1.5053501
   3051414   4137   0   2    1.5048718
   3051414   4237   0   2    0.00087991395
   3051616   4137   0   0    1.5053501
   3051616   4137   0   2    1.5048709
   3051616   4237   0   2    0.00088008346

BLOCK IMFWCOEF Q=  160
   305   4422   0   0    3.8592058e-07
   305   4422   0   2   -2.0038238e-05
   305   4322   0   2    1.1170808e-05
   305   6421   0   0    3.305665e-07
   305   6421   0   2   -3.8579829e-05
   305   6321   0   2    5.1497056e-06
   3051111   4133   0   2   -4.5207145e-06
   3051111   4233   0   2    1.1385668e-05
   3051111   4137   0   2    3.5109919e-05
   3051111   4237   0   2   -8.7756123e-05
   3051313   4133   0   2   -4.5207089e-06
   3051313   4233   0   2    1.1385613e-05
   3051313   4137   0   2    3.5110125e-05
   3051313   4237   0   2   -8.775629e-05
   3051212   4137   0   2   -7.1279111e-06
   3051212   4237   0   2    1.9095095e-05
   3051414   4137   0   2   -7.1279082e-06
   3051414   4237   0   2    1.9095095e-05
   3051616   4137   0   2   -7.1442802e-06
   3051616   4237   0   2    1.9095113e-05

DECAY 23  2.4952


DECAY 24  2.085


DECAY 2000011  3.2417093
    0.99998091   2    1000022    11

DECAY 1000011  7.4681953
    0.52974276   2   -1000024    12
    0.27543528   2    1000023    11
    0.16212703   2    1000022    11
    0.02458839   2   -1000037    12
    0.0080791165   2    1000035    11

DECAY 2000013  3.2418082
    0.9998526   2    1000022    13

DECAY 1000013  7.4757432
    0.52919858   2   -1000024    14
    0.27522629   2    1000023    13
    0.16197374   2    1000022    13
    0.024562605   2   -1000037    14
    0.0083412389   2    1000035    13
    0.00035106141   2    1000025    13
    0.000346481   2    2000013    25

DECAY 1000015  9.9531769
    0.53974901   2    1000022    15
    0.17457176   2   -1000037    16
    0.10779666   2    1000025    15
    0.088988421   2    1000035    15
    0.059286649   2   -1000024    16
    0.029607504   2    1000023    15

DECAY 2000015  24.045638
    0.37732563   2   -1000024    16
    0.21193065   2    1000023    15
    0.12271434   2    1000035    15
    0.12132517   2    1000025    15
    0.080984179   2    1000022    15
    0.045211462   2   -1000037    16
    0.020634355   2    1000015    25
    0.019874209   2    1000015    23

DECAY 1000012  7.4887421
    0.55118242   2    1000024    11
    0.26620029   2    1000023    12
    0.15872018   2    1000022    12
    0.013011906   2    1000037    11
    0.010179346   2    1000035    12
    0.00070585   2    1000025    12

DECAY 1000014  7.4933452
    0.55096332   2    1000024    13
    0.26602035   2    1000023    14
    0.15861867   2    1000022    14
    0.013520628   2    1000037    13
    0.010171699   2    1000035    14
    0.00070532606   2    1000025    14

DECAY 1000016  24.143671
    0.44088645   2    1000024    15
    0.22869039   2    1000037    15
    0.19744471   2    1000023    16
    0.078198786   2    1000022    16
    0.039414571   2    1000015    24
    0.01442907   2    1000035    16
    0.00093601684   2    1000025    16

DECAY 2000001  142.04008
    0.98026686   2    1000021    1
    0.019650496   2    1000022    1

DECAY 1000001  205.93132
    0.68157459   2    1000021    1
    0.18868729   2   -1000024    2
    0.096582557   2    1000023    1
    0.021290993   2   -1000037    2
    0.008239409   2    1000035    1
    0.0033209461   2    1000022    1
    0.00030421157   2    1000025    1

DECAY 2000003  142.09897
    0.97986268   2    1000021    3
    0.019643236   2    1000022    3
    0.0001849658   2   -1000037    4
    0.00016140865   2    1000025    3
    0.0001132252   2    1000035    3

DECAY 1000003  205.96307
    0.68147227   2    1000021    3
    0.18865884   2   -1000024    4
    0.09657519   2    1000023    3
    0.021295779   2   -1000037    4
    0.0083021818   2    1000035    3
    0.0033210412   2    1000022    3
    0.00037469902   2    1000025    3

DECAY 1000005  10.208357
    0.31991339   2   -1000037    6
    0.24792186   2    1000025    5
    0.2084138   2    1000035    5
    0.1022637   2   -1000024    6
    0.064918809   2    1000022    5
    0.056568437   2    1000023    5

DECAY 2000005  115.03327
    0.35254274   2    1000006   -24
    0.24662063   2   -1000037    6
    0.11599088   2   -1000024    6
    0.099695097   2    1000025    5
    0.094551924   2    1000035    5
    0.066642773   2    1000023    5
    0.014120802   2    1000005    25
    0.0068013603   2    1000005    23
    0.0030338063   2    1000022    5

DECAY 2000002  150.54746
    0.9255183   2    1000021    2
    0.074174056   2    1000022    2
    0.00022330026   2    1000025    2

DECAY 1000002  205.92629
    0.68136748   2    1000021    2
    0.19864425   2    1000024    1
    0.097296359   2    1000023    2
    0.011527979   2    1000037    1
    0.0075708802   2    1000035    2
    0.0034711567   2    1000022    2
    0.00012189234   2    1000025    2

DECAY 2000004  150.55092
    0.92549691   2    1000021    4
    0.074172348   2    1000022    4
    0.00022907897   2    1000025    4

DECAY 1000004  205.95768
    0.68126484   2    1000021    4
    0.19862915   2    1000024    3
    0.097281831   2    1000023    4
    0.011653744   2    1000037    3
    0.0075736915   2    1000035    4
    0.0034706314   2    1000022    4
    0.00012610968   2    1000025    4

DECAY 1000006  40.659337
    0.47484133   2    1000037    5
    0.21932694   2    1000035    6
    0.19290622   2    1000025    6
    0.065352926   2    1000022    6
    0.020726948   2    1000024    5
    0.015021828   2    1000023    4
    0.0088032097   2    1000023    6
    0.0023192633   2    1000005    24
    0.00066855549   2    1000022    4

DECAY 2000006  126.01089
    0.25342314   2    1000006    23
    0.16298468   2    1000037    5
    0.14392842   2    1000024    5
    0.13376005   2    1000025    6
    0.10496298   2    1000006    25
    0.1008962   2    1000035    6
    0.068147677   2    1000023    6
    0.012690869   2    1000005    24
    0.0099170651   2    2000005    24
    0.0092889344   2    1000022    6

DECAY 1000024  0.015190359
    0.99520632   2    1000022    24
    0.003769528   3    1000022   -5    6
    0.00041888835   3    1000022   -13    14
    0.00041578411   3    1000022   -11    12
    0.00018915588   3    1000022   -15    16

DECAY 1000037  3.2061694
    0.40683349   2    1000023    24
    0.23965682   2    1000024    23
    0.19767093   2    1000024    25
    0.15421921   2    1000022    24
    0.0015469431   3    1000022   -5    6

DECAY 1000022 -1


DECAY 1000023  0.021356155
    0.61343866   2    1000022    23
    0.38496357   2    1000022    25
    0.00064099108   3    1000022    12   -12
    0.00030780468   3    1000022    13   -13
    0.00030574841   3    1000022    11   -11
    0.00013517524   3    1000022    5   -5
    0.00013319028   3    1000022    15   -15

DECAY 1000025  3.8260183
    0.30217867   2    1000023    23
    0.20798296   2    1000023    25
    0.18520028   2    1000024   -24
    0.18520028   2   -1000024    24
    0.082697187   2    1000022    25
    0.036363258   2    1000022    23
    0.00021288834   3    1000022    6   -6

DECAY 1000035  3.7577251
    0.324401   2    1000024   -24
    0.324401   2   -1000024    24
    0.16980007   2    1000023    25
    0.096446757   2    1000022    23
    0.077731126   2    1000022    25
    0.0068324286   2    1000023    23
    0.00026154171   3    1000022    6   -6

DECAY 1000021  209.79666
    0.17824866   2    1000005   -5
    0.17824866   2   -1000005    5
    0.11565688   2    1000006   -6
    0.11565688   2   -1000006    6
    0.095062357   2    2000006   -6
    0.095062357   2   -2000006    6
    0.094401734   2    2000005   -5
    0.094401734   2   -2000005    5
    0.016508114   2    1000006   -4
    0.016508114   2   -1000006    4

DECAY 25  0.0036431248
    0.60350525   2   -5    5
    0.19798298   2   -24    24
    0.072428131   2    21    21
    0.069263846   2   -15    15
    0.029608182   2   -4    4
    0.023058527   2    23    23
    0.0023478837   2    22    22
    0.0013376092   2    22    23
    0.00023999626   2   -13    13
    0.00022681241   2   -3    3
    6.2711206e-07   2   -1    1
    1.5258341e-07   2   -2    2
    5.3953991e-09   2   -11    11

DECAY 35  90.996651
    0.62642003   2   -5    5
    0.13834036   2   -15    15
    0.062391432   2   -1000024    1000037
    0.062391432   2   -1000037    1000024
    0.035029269   2    1000023    1000025
    0.020991626   2    1000023    1000035
    0.012445051   2   -1000024    1000024
    0.010289055   2    1000022    1000035
    0.010056757   2    1000022    1000025
    0.0060919585   2    1000023    1000023
    0.0044347775   2    1000025    1000035
    0.0036515103   2   -1000037    1000037
    0.0030639962   2    1000035    1000035
    0.0028240616   2    1000022    1000023
    0.00044929759   2   -13    13
    0.00035494881   2   -6    6
    0.00028686099   2   -3    3
    0.00024030881   2    1000025    1000025
    0.00021349262   2    1000022    1000022
    2.3065517e-05   2    21    21
    7.9201683e-06   2    25    25
    1.0074457e-06   2   -1000015    1000015
    7.9301947e-07   2   -1    1
    3.4965534e-07   2    23    23
    1.6472534e-07   2    22    23
    1.5537134e-07   2   -24    24
    7.319573e-08   2    22    22
    2.1722126e-08   2   -1000011    1000011
    2.0918223e-08   2   -1000013    1000013
    1.9631869e-08   2   -2000013    2000013
    1.9618592e-08   2   -2000011    2000011
    1.0091875e-08   2   -11    11
    6.4584241e-09   2   -4    4
    5.8912862e-09   2   -2000013    1000013
    5.8912862e-09   2   -1000013    2000013
    1.3783583e-13   2   -2000011    1000011
    1.3783583e-13   2   -1000011    2000011
    3.3295585e-14   2   -2    2

DECAY 36  85.532307
    0.61385382   2   -5    5
    0.13558709   2   -15    15
    0.063989275   2   -1000024    1000037
    0.063989275   2   -1000037    1000024
    0.029800239   2    1000023    1000035
    0.028226072   2    1000023    1000025
    0.015974094   2   -1000024    1000024
    0.012806298   2    1000022    1000025
    0.0091096221   2    1000022    1000035
    0.0078091783   2    1000023    1000023
    0.0061921782   2   -1000037    1000037
    0.0053457545   2    1000035    1000035
    0.0028334917   2    1000025    1000035
    0.0027297568   2    1000022    1000023
    0.00047496536   2    1000025    1000025
    0.00044034242   2   -13    13
    0.00029648607   2   -6    6
    0.00028111574   2   -3    3
    0.00023621953   2    1000022    1000022
    2.3348356e-05   2    21    21
    7.7713754e-07   2   -1    1
    5.2156793e-07   2    23    25
    5.3430892e-08   2    22    23
    9.8906877e-09   2   -11    11
    6.2415091e-09   2   -2000013    1000013
    6.2415091e-09   2   -1000013    2000013
    5.381746e-09   2   -4    4
    5.1453926e-09   2    22    22
    9.1385747e-13   2    23    35
    1.4598907e-13   2   -2000011    1000011
    1.4598907e-13   2   -1000011    2000011
    2.7746374e-14   2   -2    2
    4.7094108e-38   2    25    25

DECAY 37  108.1487
    0.67435927   2   -5    6
    0.12714248   2   -15    16
    0.060900458   2    1000023    1000037
    0.057070799   2    1000024    1000035
    0.054243941   2    1000024    1000025
    0.015909684   2    1000022    1000037
    0.0045198754   2    1000022    1000024
    0.0039944316   2    1000025    1000037
    0.001001599   2   -5    4
    0.0004494943   2   -13    14
    0.00022023271   2   -3    4
    0.00016776258   2    1000035    1000037
    1.0281306e-05   2   -3    2
    7.1524525e-06   2   -5    2
    7.217306e-07   2   -3    6
    6.1067258e-07   2   -1    2
    5.9115117e-07   2    1000023    1000024
    4.1304967e-07   2    24    25
    6.5129775e-08   2   -2000013    1000014
    6.5120615e-08   2   -2000011    1000012
    2.8593217e-08   2   -1    4
    1.8270339e-08   2   -1    6
    1.0513719e-08   2   -11    12
    9.4031713e-09   2   -1000013    1000014
    1.3087134e-12   2    24    35
    2.199216e-13   2   -1000011    1000012

DECAY 6  2.43
    1   2    5    24

DECAY 15 -1
