BLOCK SPINFO
   1   SPheno
   2   v4.0.5be

BLOCK SPHENOINFO
   1   2
   2   2

BLOCK MODSEL
   1   0

BLOCK MINPAR
   3    50.409013
   4    1

BLOCK EXTPAR
   0    1573.1622
   1   -87.65527
   2    171.43597
   3    3000
   11   -4930.8191
   12   -979.45365
   13    268.34118
   23    972.55921
   25    49.791311
   26    1694.3675
   31    503.7523
   32    503.7523
   33    1226.4205
   34    613.09106
   35    613.09106
   36    711.90217
   41    5000
   42    5000
   43    1592.484
   44    5000
   45    5000
   46    1743.0412
   47    5000
   48    5000
   49    1210.847

BLOCK SMINPUTS
   1    127.90897
   2    1.1663787e-05
   3    0.1184
   4    91.1876
   5    4.18
   6    173.2
   7    1.777
   8    0
   11    0.00051099893
   12    0
   13    0.10565837
   14    0
   21    0.005
   22    0.0025
   23    0.095
   24    1.27

BLOCK GAUGE Q=  1573.1622
   1    0.35536298
   2    0.66519887
   3    1.219778

BLOCK YU Q=  1573.1622
   1   1    8.3860629e-06
   2   2    0.00426012
   3   3    1.0131038

BLOCK YD Q=  1573.1622
   1   1    0.00083905788
   2   2    0.0159421
   3   3    0.8320825

BLOCK YE Q=  1573.1622
   1   1    0.00014642174
   2   2    0.030275371
   3   3    0.50918194

BLOCK AU Q=  1573.1622
   1   1    0
   2   2    0
   3   3   -4930.8191

BLOCK AD Q=  1573.1622
   1   1    0
   2   2    0
   3   3   -979.4536

BLOCK AE Q=  1573.1622
   1   1    0
   2   2    0
   3   3    268.34118

BLOCK MSOFT Q=  1573.1622
   1   -87.65527
   2    171.43597
   3    3000
   21    2005261
   22   -896577.41
   31    503.7523
   32    503.7523
   33    1226.4205
   34    613.09106
   35    613.09106
   36    711.90217
   41    5000
   42    5000
   43    1592.484
   44    5000
   45    5000
   46    1743.0412
   47    5000
   48    5000
   49    1210.847

BLOCK MASS
   6    173.2
   23    91.1876
   24    80.429995
   15    1.777
   25    121.15559
   35    1693.1171
   36    1694.3675
   37    1696.7107
   1000001    5035.3093
   2000001    5024.3564
   1000002    5034.8769
   2000002    5025.5242
   1000003    5035.3166
   2000003    5024.3593
   1000004    5034.8806
   2000004    5025.5248
   1000005    1219.3972
   2000005    1559.9837
   1000006    1377.4254
   2000006    1796.7138
   1000011    505.46264
   2000011    617.59816
   1000012    499.06577
   1000013    505.20868
   2000013    617.73812
   1000014    499.04425
   1000015    701.06517
   2000015    1226.7164
   1000016    1220.71
   1000021    3198.6049
   1000022   -87.054319
   1000023    184.06698
   1000025   -979.51073
   1000035    980.09636
   1000024    184.26981
   1000037    982.66496

BLOCK ALPHA
      -0.020153602

BLOCK HMIX Q=  1573.1622
   1    972.55921
   2    49.791311
   3    243.91636
   4    2870881.3

BLOCK STOPMIX
   1   1    0.7807538
   1   2    0.62483879
   2   1   -0.62483879
   2   2    0.7807538

BLOCK SBOTMIX
   1   1    0.1023357
   1   2    0.99474992
   2   1   -0.99474992
   2   2    0.1023357

BLOCK STAUMIX
   1   1    0.086588594
   1   2    0.99624415
   2   1   -0.99624415
   2   2    0.086588594

BLOCK NMIX
   1   1    0.99895078
   1   2    0.00035413852
   1   3    0.045702475
   1   4    0.0029150478
   2   1   -0.0034621061
   2   2   -0.99625954
   2   3    0.084519123
   2   4   -0.017648288
   3   1   -0.034306546
   3   2    0.047344224
   3   3    0.7043739
   3   4    0.70741713
   4   1    0.030139904
   4   2   -0.072286439
   4   3   -0.70329597
   4   4    0.70656991

BLOCK UMIX
   1   1   -0.99285887
   1   2    0.11929483
   2   1    0.11929483
   2   2    0.99285887

BLOCK VMIX
   1   1   -0.99968768
   1   2    0.024990985
   2   1    0.024990985
   2   2    0.99968768

BLOCK HIGGSBOUNDSINPUTHIGGSCOUPLINGSFERMIONS
       0, 2479.1746,3,36,15,15

BLOCK HIGGSBOUNDSINPUTHIGGSCOUPLINGSBOSONS
       0,4,36,21,21,23

BLOCK SPHENOLOWENERGY
   1    0.00026540451
   2    1.6037718e-06
   3    3.5274835e-05
   4    3.2800426e-15
   5    1.4010419e-10
   6    2.8427612e-08
   7    1.0926505e-13
   8    4.6673046e-09
   9    9.6082276e-07
   10    9.4359977e-05
   11    0.97470243
   12    0.54180777
   13    19.339485
   14    0
   15    0
   16    0.0021567874
   17    2.2816582e-15
   18    2.4822198e-11
   19    8.295186e-11
   20    1.142722e-14
   21    4.8749099e-10
   22    8.2225591e-08
   23    0
   24    0
   25    0
   26    0
   27    0
   28    0
   29    0
   30    0
   31    0
   39    0.00011025997
   40    0
   41    0
   42    0

BLOCK FWCOEF Q=  160
   305   4422   0   0   -0.18881911
   305   4422   0   2   -0.11791725
   305   4322   0   2    0.00030835332
   305   6421   0   0   -0.095227835
   305   6421   0   2   -0.065434926
   305   6321   0   2   -0.00011303402
   3051111   4133   0   0    1.5943399
   3051111   4133   0   2    1.5952476
   3051111   4233   0   2    0.00037460407
   3051111   4137   0   0   -4.417032
   3051111   4137   0   2   -4.4173138
   3051111   4237   0   2   -0.0029063411
   3051313   4133   0   0    1.5943399
   3051313   4133   0   2    1.5952391
   3051313   4233   0   2    0.00037459635
   3051313   4137   0   0   -4.417032
   3051313   4137   0   2   -4.4173223
   3051313   4237   0   2   -0.0029063432
   3051212   4137   0   0    1.5053501
   3051212   4137   0   2    1.5054902
   3051212   4237   0   2    0.00063303843
   3051414   4137   0   0    1.5053501
   3051414   4137   0   2    1.5054902
   3051414   4237   0   2    0.0006330396
   3051616   4137   0   0    1.5053501
   3051616   4137   0   2    1.5054844
   3051616   4237   0   2    0.00063337338

BLOCK IMFWCOEF Q=  160
   305   4422   0   0    3.8593505e-07
   305   4422   0   2    4.0123171e-05
   305   4322   0   2    1.094824e-05
   305   6421   0   0    3.3057889e-07
   305   6421   0   2   -2.2463926e-05
   305   6321   0   2    4.7178936e-06
   3051111   4133   0   2   -4.2814484e-06
   3051111   4233   0   2    9.3037902e-06
   3051111   4137   0   2    3.1258488e-05
   3051111   4237   0   2   -7.2209579e-05
   3051313   4133   0   2   -4.2818873e-06
   3051313   4233   0   2    9.3037496e-06
   3051313   4137   0   2    3.1258838e-05
   3051313   4237   0   2   -7.2209714e-05
   3051212   4137   0   2   -5.4069642e-06
   3051212   4237   0   2    1.5728346e-05
   3051414   4137   0   2   -5.4069513e-06
   3051414   4237   0   2    1.5728346e-05
   3051616   4137   0   2   -5.5130055e-06
   3051616   4237   0   2    1.5728401e-05

DECAY 23  2.4952


DECAY 24  2.085


DECAY 1000011  5.5627905
    0.59284521   2   -1000024    12
    0.29976791   2    1000023    11
    0.10738687   2    1000022    11

DECAY 2000011  2.9748956
    0.99998962   2    1000022    11

DECAY 1000013  5.558495
    0.59282246   2   -1000024    14
    0.29976494   2    1000023    13
    0.1074126   2    1000022    13

DECAY 2000013  2.9758459
    0.99992245   2    1000022    13

DECAY 1000015  3.6612049
    0.93121468   2    1000022    15
    0.045735211   2   -1000024    16
    0.023050107   2    1000023    15

DECAY 2000015  20.034095
    0.49581482   2   -1000024    16
    0.25270782   2    1000023    15
    0.077228806   2    1000022    15
    0.067809372   2    1000015    23
    0.06213475   2    1000015    25
    0.020994461   2    1000035    15
    0.020950313   2    1000025    15
    0.0023596613   2   -1000037    16

DECAY 1000012  5.4837413
    0.5972249   2    1000024    11
    0.2956731   2    1000023    12
    0.107102   2    1000022    12

DECAY 1000014  5.4834581
    0.59723008   2    1000024    13
    0.29566759   2    1000023    14
    0.10710233   2    1000022    14

DECAY 1000016  20.391531
    0.50707757   2    1000024    15
    0.24883989   2    1000023    16
    0.13173171   2    1000015    24
    0.07418055   2    1000022    16
    0.037766195   2    1000037    15
    0.00025995877   2    1000035    16
    0.00014412985   2    1000025    16

DECAY 2000001  143.07118
    0.98040783   2    1000021    1
    0.019553192   2    1000022    1

DECAY 1000001  208.36189
    0.67866412   2    1000021    1
    0.20914719   2   -1000024    2
    0.10516153   2    1000023    1
    0.003350484   2    1000022    1
    0.0028012848   2   -1000037    2
    0.00059388152   2    1000035    1
    0.00028151   2    1000025    1

DECAY 2000003  143.11841
    0.98008645   2    1000021    3
    0.01954712   2    1000022    3
    0.00016184687   2   -1000037    4
    0.00010284894   2    1000025    3

DECAY 1000003  208.38795
    0.67858289   2    1000021    3
    0.20912131   2   -1000024    4
    0.1051494   2    1000023    3
    0.0033503241   2    1000022    3
    0.0028090401   2   -1000037    4
    0.00064959761   2    1000035    3
    0.00033743895   2    1000025    3

DECAY 1000005  4.8019457
    0.220837   2   -1000037    6
    0.21539082   2    1000025    5
    0.21298074   2    1000035    5
    0.15583416   2    1000022    5
    0.12771466   2   -1000024    6
    0.067242632   2    1000023    5

DECAY 2000005  52.976745
    0.23215337   2   -1000024    6
    0.22740837   2    1000006   -24
    0.22248876   2   -1000037    6
    0.12259809   2    1000023    5
    0.074979727   2    1000035    5
    0.074884578   2    1000025    5
    0.028310383   2    1000005    25
    0.013278313   2    1000005    23
    0.0038984051   2    1000022    5

DECAY 2000002  151.60398
    0.9260284   2    1000021    2
    0.073827856   2    1000022    2

DECAY 1000002  208.35887
    0.67845799   2    1000021    2
    0.21201885   2    1000024    1
    0.10541458   2    1000023    2
    0.0033770291   2    1000022    2
    0.0004408895   2    1000035    2
    0.00016741812   2    1000025    2
    0.00012323488   2    1000037    1

DECAY 2000004  151.60734
    0.92600789   2    1000021    4
    0.073826218   2    1000022    4

DECAY 1000004  208.38444
    0.6783763   2    1000021    4
    0.21199472   2    1000024    3
    0.10540171   2    1000023    4
    0.0033766168   2    1000022    4
    0.00044487663   2    1000035    4
    0.00023434168   2    1000037    3
    0.00017143323   2    1000025    4

DECAY 1000006  23.22341
    0.3325231   2    1000024    5
    0.22560266   2    1000037    5
    0.15653281   2    1000023    6
    0.084988302   2    1000025    6
    0.077182367   2    1000035    6
    0.063685207   2    1000023    4
    0.054130898   2    1000022    6
    0.0031500397   2    1000005    24
    0.0020938482   2    1000022    4
    0.00011076247   3    1000022    24    5

DECAY 2000006  101.45573
    0.30123264   2    1000006    23
    0.18631027   2    2000005    24
    0.15772433   2    1000037    5
    0.10403907   2    1000035    6
    0.094648483   2    1000025    6
    0.055340816   2    1000024    5
    0.026352067   2    1000023    6
    0.025533505   2    1000006    25
    0.024608736   2    1000022    6
    0.024210089   2    1000005    24

DECAY 1000024  2.0240743e-05
    0.96739267   2    1000022    24
    0.01602328   3    1000022   -13    14
    0.016003174   3    1000022   -11    12
    0.00057996835   3    1000022   -15    16

DECAY 1000037  7.7371289
    0.2761379   2    1000023    24
    0.27334056   2    1000024    23
    0.26969293   2    1000024    25
    0.084491186   2    1000022    24
    0.075168253   2   -1000015    16
    0.0048653596   3    1000023   -5    6
    0.0043057564   2   -1000013    14
    0.0043026455   2   -1000011    12
    0.0042795311   3    1000024    6   -6
    0.0015433007   3    1000022   -5    6
    0.00082069547   2    1000014   -13
    0.00041756903   2   -2000013    14
    0.00032610415   3    1000024    5   -5
    0.00019227223   2    1000012   -11

DECAY 1000022 -1


DECAY 1000023  1.2652087e-05
    0.94808539   2    1000022    23
    0.02624937   3    1000022    12   -12
    0.012423766   3    1000022    13   -13
    0.01239392   3    1000022    11   -11
    0.00062829495   3    1000022    15   -15
    0.00015399704   3    1000022    5   -5

DECAY 1000025  8.5075326
    0.25264886   2    1000024   -24
    0.25264886   2   -1000024    24
    0.17675888   2    1000023    23
    0.15989518   2    1000023    25
    0.039536799   2    1000022    25
    0.034623942   2    1000015   -15
    0.034623942   2   -1000015    15
    0.033460198   2    1000022    23
    0.0045983814   3    1000024    5   -6
    0.0045983814   3   -1000024   -5    6
    0.0014331912   3    1000023    6   -6
    0.00059909657   2    1000014   -14
    0.00059909657   2   -1000014    14
    0.00059906033   2    1000012   -12
    0.00059906033   2   -1000012    12
    0.00054509475   3    1000022    6   -6
    0.00039540508   2    1000013   -13
    0.00039540508   2   -1000013    13
    0.00031229241   2    2000013   -13
    0.00031229241   2   -2000013    13
    0.00012882434   3    1000023    5   -5
    0.00012356321   2    2000011   -11
    0.00012356321   2   -2000011    11
    0.00011485572   2    1000011   -11
    0.00011485572   2   -1000011    11

DECAY 1000035  7.8398721
    0.27252497   2    1000024   -24
    0.27252497   2   -1000024    24
    0.18607527   2    1000023    25
    0.081753477   2    1000023    23
    0.046874006   2    1000022    23
    0.046479416   2    1000022    25
    0.037362119   2    1000015   -15
    0.037362119   2   -1000015    15
    0.0043217459   3    1000024    5   -6
    0.0043217459   3   -1000024   -5    6
    0.0015080806   3    1000023    6   -6
    0.001179358   2    1000014   -14
    0.001179358   2   -1000014    14
    0.0011792868   2    1000012   -12
    0.0011792868   2   -1000012    12
    0.00077205209   2    1000013   -13
    0.00077205209   2   -1000013    13
    0.00053831577   3    1000022    6   -6
    0.00046795431   2    1000011   -11
    0.00046795431   2   -1000011    11
    0.00030837253   2    2000013   -13
    0.00030837253   2   -2000013    13
    0.0001363642   3    1000023    5   -5
    0.00010371992   2    2000011   -11
    0.00010371992   2   -2000011    11

DECAY 1000021  245.77727
    0.1406054   2    1000005   -5
    0.1406054   2   -1000005    5
    0.11195776   2    2000005   -5
    0.11195776   2   -2000005    5
    0.11109348   2    1000006   -6
    0.11109348   2   -1000006    6
    0.10369239   2    2000006   -6
    0.10369239   2   -2000006    6
    0.032522523   2    1000006   -4
    0.032522523   2   -1000006    4

DECAY 25  0.0034752104
    0.63443273   2   -5    5
    0.16745466   2   -24    24
    0.073079442   2   -15    15
    0.071674971   2    21    21
    0.030620843   2   -4    4
    0.018759311   2    23    23
    0.0023161612   2    22    22
    0.0011679079   2    22    23
    0.00025399796   2   -13    13
    0.00023914913   2   -3    3
    6.6122126e-07   2   -1    1
    1.5780818e-07   2   -2    2
    5.710261e-09   2   -11    11

DECAY 35  58.062284
    0.6686609   2   -5    5
    0.16009736   2   -15    15
    0.050091745   2   -1000024    1000037
    0.050091745   2   -1000037    1000024
    0.030023162   2    1000023    1000025
    0.019145011   2    1000023    1000035
    0.0075726463   2    1000022    1000035
    0.0069421888   2    1000022    1000025
    0.0032079977   2   -1000024    1000024
    0.0015933498   2    1000023    1000023
    0.00094189824   2    1000022    1000023
    0.00059805667   2   -13    13
    0.00049039963   2   -6    6
    0.00029437929   2   -3    3
    0.00013273005   2    1000022    1000022
    4.1218373e-05   2    25    25
    3.7104016e-05   2   -1000015    1000015
    3.2856959e-05   2    21    21
    2.0517011e-06   2    23    23
    1.3813454e-06   2   -24    24
    8.1381634e-07   2   -1    1
    8.7647268e-08   2   -1000011    1000011
    7.8365384e-08   2   -1000013    1000013
    6.4138122e-08   2    22    23
    5.3884732e-08   2   -2000013    2000013
    4.8647871e-08   2   -2000011    2000011
    2.6851321e-08   2   -2000013    1000013
    2.6851321e-08   2   -1000013    2000013
    1.7682898e-08   2    22    22
    1.3434337e-08   2   -11    11
    9.9556809e-09   2   -4    4
    6.3260167e-13   2   -2000011    1000011
    6.3260167e-13   2   -1000011    2000011
    5.1327695e-14   2   -2    2

DECAY 36  55.238371
    0.66153109   2   -5    5
    0.1583992   2   -15    15
    0.052642244   2   -1000024    1000037
    0.052642244   2   -1000037    1000024
    0.031248238   2    1000023    1000035
    0.020443988   2    1000023    1000025
    0.0080731436   2    1000022    1000025
    0.0072268119   2    1000022    1000035
    0.0035710144   2   -1000024    1000024
    0.0017738241   2    1000023    1000023
    0.00097517626   2    1000022    1000023
    0.00059170662   2   -13    13
    0.00040685273   2   -6    6
    0.00029122534   2   -3    3
    0.00014033964   2    1000022    1000022
    3.8816882e-05   2    21    21
    2.8610063e-06   2    23    25
    8.0509875e-07   2   -1    1
    2.2929245e-07   2    22    23
    1.2223466e-07   2    22    22
    2.6741221e-08   2   -2000013    1000013
    2.6741221e-08   2   -1000013    2000013
    1.3291708e-08   2   -11    11
    8.1969695e-09   2   -4    4
    6.2547267e-13   2   -2000011    1000011
    6.2547267e-13   2   -1000011    2000011
    6.0759588e-14   2    23    35
    4.2259672e-14   2   -2    2
    7.5255749e-35   2    25    25

DECAY 37  68.726384
    0.72968816   2   -5    6
    0.1254571   2   -15    16
    0.043632406   2    1000023    1000037
    0.042857007   2    1000024    1000025
    0.042846145   2    1000024    1000035
    0.012155682   2    1000022    1000037
    0.0015808314   2    1000022    1000024
    0.0010898075   2   -5    4
    0.00044353631   2   -13    14
    0.00022646626   2   -3    4
    1.053474e-05   2   -3    2
    7.7823561e-06   2   -5    2
    2.3137691e-06   2    24    25
    9.0179149e-07   2   -3    6
    6.2780937e-07   2   -1    2
    2.8728374e-07   2   -1000011    1000012
    2.7587152e-07   2   -1000013    1000014
    5.2659082e-08   2   -2000013    1000014
    2.9363246e-08   2   -1    4
    2.6303033e-08   2   -1    6
    1.5036865e-08   2    1000023    1000024
    1.0374361e-08   2   -11    12
    1.1852925e-11   2    24    35
    1.3977396e-12   2    24    36
    1.2350331e-12   2   -2000011    1000012

DECAY 6  2.43
    1   2    5    24

DECAY 15 -1
