BLOCK SPINFO
   1   SPheno
   2   v4.0.5be

BLOCK SPHENOINFO
   1   2
   2   2

BLOCK MODSEL
   1   0

BLOCK MINPAR
   3    21.309507
   4   -1

BLOCK EXTPAR
   0    4860.5129
   1   -3037.5225
   2    1149.7017
   3    3502.4243
   11   -7935.002
   12   -6075.411
   13   -171.96712
   23   -796.78283
   25    20.346396
   26    909.5415
   31    2790.2843
   32    2790.2843
   33    2499.3238
   34    774.72274
   35    774.72274
   36    4766.279
   41    1594.0563
   42    1594.0563
   43    4991.0322
   44    3908.9905
   45    3908.9905
   46    4755.0819
   47    3283.6462
   48    3283.6462
   49    3240.2835

BLOCK SMINPUTS
   1    127.90897
   2    1.1663787e-05
   3    0.1184
   4    91.1876
   5    4.18
   6    173.2
   7    1.777
   8    0
   11    0.00051099893
   12    0
   13    0.10565837
   14    0
   21    0.005
   22    0.0025
   23    0.095
   24    1.27

BLOCK GAUGE Q=  4860.5129
   1    0.35536298
   2    0.66519887
   3    1.219778

BLOCK YU Q=  4860.5129
   1   1    8.3944927e-06
   2   2    0.0042644023
   3   3    1.0141221

BLOCK YD Q=  4860.5129
   1   1    0.00034321178
   2   2    0.0065210239
   3   3    0.34035854

BLOCK YE Q=  4860.5129
   1   1    5.9892966e-05
   2   2    0.012383966
   3   3    0.20827793

BLOCK AU Q=  4860.5129
   1   1    0
   2   2    0
   3   3   -7935.0092

BLOCK AD Q=  4860.5129
   1   1    0
   2   2    0
   3   3   -6075.3957

BLOCK AE Q=  4860.5129
   1   1    0
   2   2    0
   3   3   -171.96706

BLOCK MSOFT Q=  4860.5129
   1   -3037.5225
   2    1149.7017
   3    3502.4243
   21    237138.85
   22   -150817.34
   31    2790.2843
   32    2790.2843
   33    2499.3238
   34    774.72274
   35    774.72274
   36    4766.279
   41    1594.0563
   42    1594.0563
   43    4991.0322
   44    3908.9905
   45    3908.9905
   46    4755.0819
   47    3283.6462
   48    3283.6462
   49    3240.2835

BLOCK MASS
   6    173.2
   23    91.1876
   24    80.429995
   15    1.777
   25    126.69127
   35    909.60423
   36    909.5415
   37    912.98749
   1000001    1880.0293
   2000001    3461.7359
   1000002    1878.3457
   2000002    4055.3774
   1000003    1880.0269
   2000003    3461.7337
   1000004    1878.3434
   2000004    4055.3765
   1000005    3407.8886
   2000005    5015.6305
   1000006    4676.6105
   2000006    5051.6469
   1000011    2799.6698
   2000011    848.00077
   1000012    2798.1661
   1000013    2799.6649
   2000013    847.97678
   1000014    2798.1608
   1000015    2506.5352
   2000015    4777.1601
   1000016    2505.3893
   1000021    3747.7471
   1000022    790.71762
   1000023   -798.88679
   1000025    1186.3193
   1000035   -2983.6171
   1000024    792.81862
   1000037    1186.5487

BLOCK ALPHA
      -0.048172146

BLOCK HMIX Q=  4860.5129
   1   -796.78283
   2    20.346396
   3    242.72314
   4    827265.73

BLOCK STOPMIX
   1   1    0.31490528
   1   2    0.9491231
   2   1   -0.9491231
   2   2    0.31490528

BLOCK SBOTMIX
   1   1   -0.0015440441
   1   2    0.99999881
   2   1   -0.99999881
   2   2   -0.0015440441

BLOCK STAUMIX
   1   1   -0.99999857
   1   2    0.0016923178
   2   1   -0.0016923178
   2   2   -0.99999857

BLOCK NMIX
   1   1   -0.0076766859
   1   2   -0.13577586
   1   3   -0.70394584
   1   4   -0.69711279
   2   1    0.014843564
   2   2    0.029527645
   2   3   -0.70621646
   2   4    0.70722422
   3   1    0.0011911839
   3   2   -0.99029942
   3   3    0.075456409
   3   4    0.11667034
   4   1   -0.99985965
   4   2    0.00030101758
   4   3   -0.0049896159
   4   4    0.015990464

BLOCK UMIX
   1   1   -0.10714548
   1   2   -0.99424335
   2   1    0.99424335
   2   2   -0.10714548

BLOCK VMIX
   1   1   -0.16561113
   1   2    0.98619113
   2   1    0.98619113
   2   2    0.16561113

BLOCK HIGGSBOUNDSINPUTHIGGSCOUPLINGSFERMIONS
       0, 413.97582,3,36,15,15

BLOCK HIGGSBOUNDSINPUTHIGGSCOUPLINGSBOSONS
       0,4,36,21,21,23

BLOCK SPHENOLOWENERGY
   1    0.00036764384
   2    1.5879425e-06
   3    3.5269394e-05
   4    2.2181342e-15
   5    9.4756363e-11
   6    1.9847306e-08
   7    7.5643568e-14
   8    3.2314969e-09
   9    6.8578835e-07
   10    9.3255106e-05
   11    0.96328955
   12    0.54200384
   13    19.348446
   14    0
   15    0
   16    0.0021575631
   17    2.2816648e-15
   18    2.4812924e-11
   19    8.2930697e-11
   20   -7.6742894e-16
   21   -3.2809712e-11
   22   -1.0888103e-08
   23    0
   24    0
   25    0
   26    0
   27    0
   28    0
   29    0
   30    0
   31    0
   39    4.6848674e-05
   40    0
   41    0
   42    0

BLOCK FWCOEF Q=  160
   305   4422   0   0   -0.18881911
   305   4422   0   2   -0.23679317
   305   4322   0   2   -0.0010386489
   305   6421   0   0   -0.095227835
   305   6421   0   2   -0.14594671
   305   6321   0   2   -0.0010683846
   3051111   4133   0   0    1.6331885
   3051111   4133   0   2    1.6334151
   3051111   4233   0   2    9.1857678e-05
   3051111   4137   0   0   -4.4558806
   3051111   4137   0   2   -4.4558375
   3051111   4237   0   2   -0.00067366031
   3051313   4133   0   0    1.6331885
   3051313   4133   0   2    1.6334149
   3051313   4233   0   2    9.1856057e-05
   3051313   4137   0   0   -4.4558806
   3051313   4137   0   2   -4.4558377
   3051313   4237   0   2   -0.00067365883
   3051212   4137   0   0    1.5053501
   3051212   4137   0   2    1.5053527
   3051212   4237   0   2    0.00014545826
   3051414   4137   0   0    1.5053501
   3051414   4137   0   2    1.5053527
   3051414   4237   0   2    0.0001454586
   3051616   4137   0   0    1.5053501
   3051616   4137   0   2    1.5053528
   3051616   4237   0   2    0.00014555454

BLOCK IMFWCOEF Q=  160
   305   4422   0   0    3.8580506e-07
   305   4422   0   2   -1.6803637e-05
   305   4322   0   2   -3.8558877e-06
   305   6421   0   0    3.3046755e-07
   305   6421   0   2    1.1322225e-05
   305   6321   0   2   -1.9916229e-06
   3051111   4133   0   2    3.7150248e-07
   3051111   4233   0   2    2.895954e-06
   3051111   4137   0   2    1.0311249e-06
   3051111   4237   0   2   -2.1241194e-05
   3051313   4133   0   2    3.714966e-07
   3051313   4233   0   2    2.8959532e-06
   3051313   4137   0   2    1.0311241e-06
   3051313   4237   0   2   -2.1241196e-05
   3051212   4137   0   2   -8.8613078e-09
   3051212   4237   0   2    4.5864464e-06
   3051414   4137   0   2   -8.861245e-09
   3051414   4237   0   2    4.5864464e-06
   3051616   4137   0   2   -6.8895612e-09
   3051616   4237   0   2    4.5864464e-06

DECAY 23  2.4952


DECAY 24  2.085


DECAY 2000011  1.6158345e-05
    0.73510175   2    1000023    11
    0.26483825   2    1000022    11

DECAY 1000011  24.979143
    0.65641231   2   -1000037    12
    0.32524423   2    1000025    11
    0.009585716   2   -1000024    12
    0.0081737095   2    1000022    11
    0.00058403547   2    1000023    11

DECAY 2000013  9.5722561e-05
    0.43266272   2   -1000024    14
    0.29497241   2    1000023    13
    0.27236486   2    1000022    13

DECAY 1000013  24.986587
    0.6562146   2   -1000037    14
    0.32514753   2    1000025    13
    0.0095828378   2   -1000024    14
    0.008314759   2    1000022    13
    0.00072770762   2    1000023    13

DECAY 1000015  21.779193
    0.60286745   2   -1000037    16
    0.29905208   2    1000025    15
    0.048021276   2    1000022    15
    0.04054294   2    1000023    15
    0.0095162593   2   -1000024    16

DECAY 2000015  16.897293
    0.52831311   2    1000035    15
    0.22783873   2   -1000024    16
    0.1153002   2    1000023    15
    0.1142867   2    1000022    15
    0.0047802622   2    1000016   -24
    0.0027196476   2   -1000037    16
    0.0023990809   2    1000015    25
    0.0023862229   2    1000015    23
    0.0013507419   2    1000025    15
    0.00031318528   2    1000016   -37
    0.00015660661   2    1000015    36
    0.00015551481   2    1000015    35

DECAY 1000012  25.010157
    0.64437222   2    1000037    11
    0.32534886   2    1000025    12
    0.022856119   2    1000024    11
    0.0072290173   2    1000022    12
    0.00019378947   2    1000023    12

DECAY 1000014  25.017278
    0.64418907   2    1000037    13
    0.32525511   2    1000025    14
    0.023135098   2    1000024    13
    0.0072269415   2    1000022    14
    0.00019373382   2    1000023    14

DECAY 1000016  21.81967
    0.59217611   2    1000037    15
    0.29868324   2    1000025    16
    0.10184646   2    1000024    15
    0.0071039397   2    1000022    16
    0.00019024759   2    1000023    16

DECAY 1000001  9.0968101
    0.65104679   2   -1000037    2
    0.3232498   2    1000025    1
    0.014127746   2   -1000024    2
    0.011134027   2    1000022    1
    0.00044163466   2    1000023    1

DECAY 2000001  0.12826923
    0.99609545   2    1000035    1
    0.0030038762   2    1000023    1
    0.00082584665   2    1000022    1

DECAY 1000003  9.0982788
    0.65093958   2   -1000037    4
    0.32319628   2    1000025    3
    0.014173308   2   -1000024    4
    0.011190929   2    1000022    3
    0.00049990177   2    1000023    3

DECAY 2000003  0.13356003
    0.95662842   2    1000035    3
    0.019464501   2   -1000024    4
    0.012660141   2    1000023    3
    0.010527371   2    1000022    3
    0.00040713327   2    1000003    25
    0.00019605152   2   -1000037    4
    0.00011323197   2    1000025    3

DECAY 1000005  14.097348
    0.4901868   2   -1000024    6
    0.24815764   2    1000023    5
    0.24735365   2    1000022    5
    0.0073546337   2    1000035    5
    0.0046326753   2   -1000037    6
    0.0023145978   2    1000025    5

DECAY 2000005  269.81991
    0.35199028   2   -1000024    6
    0.28622802   2    1000021    5
    0.15433635   2   -1000037    6
    0.071769264   2    1000025    5
    0.064452687   2    1000006   -24
    0.021579417   2    1000022    5
    0.020354164   2    1000023    5
    0.014015484   2    1000005    36
    0.014012663   2    1000005    35
    0.0010871184   2    1000035    5
    0.00011567135   2    1000005    25

DECAY 1000002  9.1538438
    0.63447371   2    1000037    1
    0.3199127   2    1000025    2
    0.033486423   2    1000024    1
    0.011500008   2    1000022    2
    0.00062716776   2    1000023    2

DECAY 2000002  8.7271141
    0.78143173   2    1000021    2
    0.2182992   2    1000035    2
    0.00021124234   2    1000023    2

DECAY 1000004  9.1553166
    0.63436915   2    1000037    3
    0.31986026   2    1000025    4
    0.033597093   2    1000024    3
    0.011521718   2    1000022    4
    0.00065177775   2    1000023    4

DECAY 2000004  8.7297879
    0.78117985   2    1000021    4
    0.21823175   2    1000035    4
    0.00028887589   2    1000023    4
    0.00015121784   2    1000024    3
    0.00013217567   2    1000022    4

DECAY 1000006  232.07501
    0.37047951   2    1000024    5
    0.21908099   2    1000021    6
    0.19706857   2    1000022    6
    0.19395824   2    1000023    6
    0.014692271   2    1000035    6
    0.0021124433   2    1000005    37
    0.00090662165   2    1000025    6
    0.00086657819   3    1000022    24    5
    0.00082717223   2    1000037    5

DECAY 2000006  274.98412
    0.27004094   2    1000021    6
    0.17794607   2    1000023    6
    0.16643854   2    1000022    6
    0.14926753   2    1000037    5
    0.079459099   2    1000025    6
    0.051247455   2    1000024    5
    0.039691306   2    1000006    25
    0.037993212   2    1000006    23
    0.02560136   2    1000005    37
    0.0022040643   2    1000035    6
    0.00011042262   2    1000005    24

DECAY 1000024  5.550867e-12
    0.60197835   3    1000022   -1    2
    0.20066419   3    1000022   -11    12
    0.19560579   3    1000022   -13    14
    0.0017516731   3    1000022   -3    4

DECAY 1000037  7.0433019
    0.27109875   2    1000023    24
    0.2466413   2    1000022    24
    0.24295582   2    1000024    23
    0.23580583   2    1000024    25
    0.0018863117   3    1000023   -5    6
    0.0014550671   3    1000022   -5    6
    0.00013571008   3    1000024    6   -6

DECAY 1000022 -1


DECAY 1000023  3.4266145e-07
    0.41483269   2    1000022    22
    0.073063928   3    1000022    12   -12
    0.05463462   3    1000022    1   -1
    0.054548744   3    1000022    3   -3
    0.054441595   3    1000024    1   -2
    0.054441595   3   -1000024   -1    2
    0.045746632   3    1000024    3   -4
    0.045746632   3   -1000024   -3    4
    0.042611854   3    1000022    2   -2
    0.030788378   3    1000022    4   -4
    0.018147091   3    1000024    11   -12
    0.018147091   3   -1000024   -11    12
    0.018125102   3    1000024    13   -14
    0.018125102   3   -1000024   -13    14
    0.012973554   3    1000024    15   -16
    0.012973554   3   -1000024   -15    16
    0.012329372   3    1000022    11   -11
    0.01229956   3    1000022    13   -13
    0.0060229121   3    1000022    15   -15

DECAY 1000025  9.038551
    0.22202978   2    1000023    25
    0.20357469   2    1000023    23
    0.1950457   2    1000024   -24
    0.1950457   2   -1000024    24
    0.1727573   2    1000022    25
    0.0092136803   2    1000022    23
    0.0011314696   3    1000024    5   -6
    0.0011314696   3   -1000024   -5    6

DECAY 1000035  43.385929
    0.14594513   2    2000013   -13
    0.14594513   2   -2000013    13
    0.14594367   2    2000011   -11
    0.14594367   2   -2000011    11
    0.046040726   2    1000024   -24
    0.046040726   2   -1000024    24
    0.036034817   2    1000022    23
    0.03586844   2    37   -1000024
    0.03586844   2   -37    1000024
    0.035301292   2    1000023    25
    0.028954721   2    1000022    35
    0.02846784   2    1000022    25
    0.024182681   2    1000023    35
    0.010115132   2    1000023    23
    0.008603653   2    1000023    36
    0.0070725189   2    1000022    36
    0.0052504886   2    1000003   -3
    0.0052504886   2   -1000003    3
    0.0052504697   2    1000001   -1
    0.0052504697   2   -1000001    1
    0.0052273918   2    1000004   -4
    0.0052273918   2   -1000004    4
    0.0052273857   2    1000002   -2
    0.0052273857   2   -1000002    2
    0.0037589014   2    1000016   -16
    0.0037589014   2   -1000016    16
    0.0037340428   2    1000015   -15
    0.0037340428   2   -1000015    15
    0.0021929371   3    1000024    5   -6
    0.0021929371   3   -1000024   -5    6
    0.0017030801   3    1000023    6   -6
    0.0015315554   3    1000022    6   -6
    0.00073230406   2    1000037   -24
    0.00073230406   2   -1000037    24
    0.00062720532   2    1000014   -14
    0.00062720532   2   -1000014    14
    0.00062717075   2    1000012   -12
    0.00062717075   2   -1000012    12
    0.00062673005   2    1000025    23
    0.00061600354   2    1000013   -13
    0.00061600354   2   -1000013    13
    0.00061597175   2    1000011   -11
    0.00061597175   2   -1000011    11
    0.00050555413   2    37   -1000037
    0.00050555413   2   -37    1000037
    0.00048599232   2    1000025    25
    0.00044939336   2    1000025    35

DECAY 1000021  256.97201
    0.12102766   2    1000004   -4
    0.12102766   2   -1000004    4
    0.12102747   2    1000002   -2
    0.12102747   2   -1000002    2
    0.1208821   2    1000003   -3
    0.1208821   2   -1000003    3
    0.12088189   2    1000001   -1
    0.12088189   2   -1000001    1
    0.0064706126   2    1000005   -5
    0.0064706126   2   -1000005    5
    0.0046520657   2    2000003   -3
    0.0046520657   2   -2000003    3
    0.0046519953   2    2000001   -1
    0.0046519953   2   -2000001    1
    0.00016973677   3    1000024    5   -6
    0.00016973677   3   -1000024   -5    6
    0.00016452363   3    1000023    6   -6
    0.00015957256   3    1000022    6   -6

DECAY 25  0.0042458288
    0.55688594   2   -5    5
    0.24879415   2   -24    24
    0.068767044   2    21    21
    0.064040032   2   -15    15
    0.031121735   2    23    23
    0.026106958   2   -4    4
    0.002265311   2    22    22
    0.0015866907   2    22    23
    0.00022218696   2   -13    13
    0.00020922875   2   -3    3
    5.7849688e-07   2   -1    1
    1.345304e-07   2   -2    2
    4.9949892e-09   2   -11    11

DECAY 35  6.6780233
    0.85940591   2   -5    5
    0.12747705   2   -15    15
    0.01176143   2   -6    6
    0.00044726862   2   -13    13
    0.00042361152   2    25    25
    0.00034401679   2   -3    3
    5.4809152e-05   2   -24    24
    4.7792226e-05   2    21    21
    3.692921e-05   2    23    23
    9.5122745e-07   2   -1    1
    1.9388033e-07   2   -4    4
    2.4576316e-08   2    22    22
    1.0049081e-08   2   -11    11
    3.3342134e-09   2    22    23
    9.9982154e-13   2   -2    2

DECAY 36  6.5619578
    0.85833167   2   -5    5
    0.1273148   2   -15    15
    0.01337536   2   -6    6
    0.00044669018   2   -13    13
    0.00034357709   2   -3    3
    0.00013013202   2    21    21
    5.6216331e-05   2    23    25
    9.5001151e-07   2   -1    1
    2.4798883e-07   2    22    22
    1.8685033e-07   2   -4    4
    1.585582e-07   2    22    23
    1.003609e-08   2   -11    11
    9.6414895e-13   2   -2    2
    4.2559953e-37   2    25    25

DECAY 37  5.7633959
    0.85386781   2   -5    6
    0.14385515   2   -15    16
    0.0013106148   2   -5    4
    0.0005085828   2   -13    14
    0.00034392359   2   -3    4
    6.5245691e-05   2    24    25
    2.1473902e-05   2   -3    6
    1.5857724e-05   2   -3    2
    9.3591733e-06   2   -5    2
    9.6339357e-07   2   -1    6
    9.5379948e-07   2   -1    2
    5.3287314e-08   2   -1    4
    1.1895805e-08   2   -11    12
    1.1430631e-10   2    24    36
    1.0428031e-10   2    24    35

DECAY 6  2.43
    1   2    5    24

DECAY 15 -1
