BLOCK SPINFO
   1   SPheno
   2   v4.0.5be

BLOCK SPHENOINFO
   1   2
   2   2

BLOCK MODSEL
   1   0

BLOCK MINPAR
   3    52.991588
   4    1

BLOCK EXTPAR
   0    1345.4254
   1    1030.97
   2   -568.82562
   3    3000
   11   -1746.1702
   12   -1073.043
   13    752.50053
   23    233.24007
   25    52.548619
   26    3403.581
   31    1134.7432
   32    1134.7432
   33    912.47615
   34    1291.0342
   35    1291.0342
   36    1416.781
   41    5000
   42    5000
   43    1778.5218
   44    5000
   45    5000
   46    1083.5969
   47    5000
   48    5000
   49    1802.176

BLOCK SMINPUTS
   1    127.90897
   2    1.1663787e-05
   3    0.1184
   4    91.1876
   5    4.18
   6    173.2
   7    1.777
   8    0
   11    0.00051099893
   12    0
   13    0.10565837
   14    0
   21    0.005
   22    0.0025
   23    0.095
   24    1.27

BLOCK GAUGE Q=  1345.4254
   1    0.35536298
   2    0.66519887
   3    1.219778

BLOCK YU Q=  1345.4254
   1   1    8.3858902e-06
   2   2    0.0042600322
   3   3    1.0130829

BLOCK YD Q=  1345.4254
   1   1    0.00088550439
   2   2    0.016824584
   3   3    0.87814288

BLOCK YE Q=  1345.4254
   1   1    0.00015452699
   2   2    0.031951281
   3   3    0.53736798

BLOCK AU Q=  1345.4254
   1   1    0
   2   2    0
   3   3   -1746.1722

BLOCK AD Q=  1345.4254
   1   1    0
   2   2    0
   3   3   -1073.0427

BLOCK AE Q=  1345.4254
   1   1    0
   2   2    0
   3   3    752.50017

BLOCK MSOFT Q=  1345.4254
   1    1030.97
   2   -568.82562
   3    3000
   21    11553596
   22   -33329.448
   31    1134.7432
   32    1134.7432
   33    912.47615
   34    1291.0342
   35    1291.0342
   36    1416.781
   41    5000
   42    5000
   43    1778.5218
   44    5000
   45    5000
   46    1083.5969
   47    5000
   48    5000
   49    1802.176

BLOCK MASS
   6    173.2
   23    91.1876
   24    80.429995
   15    1.777
   25    120.04161
   35    3399.9197
   36    3403.581
   37    3401.5367
   1000001    5021.453
   2000001    5010.9058
   1000002    5020.9963
   2000002    5013.1177
   1000003    5021.4622
   2000003    5010.9223
   1000004    5021.0052
   2000004    5013.1187
   1000005    1772.756
   2000005    1820.1356
   1000006    1012.758
   2000006    1787.3664
   1000011    1141.9871
   2000011    1292.0696
   1000012    1138.8055
   1000013    1141.9959
   2000013    1292.0883
   1000014    1138.8162
   1000015    926.17361
   2000015    1422.558
   1000016    922.5235
   1000021    3177.1371
   1000022   -230.53132
   1000023    240.23232
   1000025   -614.35569
   1000035    1033.0423
   1000024    233.63645
   1000037    614.61743

BLOCK ALPHA
      -0.018896715

BLOCK HMIX Q=  1345.4254
   1    233.24007
   2    52.548619
   3    244.13971
   4    11584364

BLOCK STOPMIX
   1   1    0.11721471
   1   2    0.9931066
   2   1   -0.9931066
   2   2    0.11721471

BLOCK SBOTMIX
   1   1    0.98185967
   1   2    0.18960904
   2   1   -0.18960904
   2   2    0.98185967

BLOCK STAUMIX
   1   1    0.9998573
   1   2    0.016893386
   2   1   -0.016893386
   2   2    0.9998573

BLOCK NMIX
   1   1   -0.023905179
   1   2   -0.14520398
   1   3    0.71036588
   1   4    0.68827659
   2   1    0.040707788
   2   2    0.068955455
   2   3    0.70155148
   2   4   -0.7081056
   3   1   -0.0041127265
   3   2    0.98699342
   3   3    0.055468363
   3   4    0.15083213
   4   1    0.99887662
   4   2   -0.0022214125
   4   3   -0.011361823
   4   4    0.045950739

BLOCK UMIX
   1   1   -0.079124686
   1   2    0.99686473
   2   1   -0.99686473
   2   2   -0.079124686

BLOCK VMIX
   1   1    0.21480376
   1   2    0.97665723
   2   1    0.97665723
   2   2   -0.21480376

BLOCK HIGGSBOUNDSINPUTHIGGSCOUPLINGSFERMIONS
       0, 2761.3573,3,36,15,15

BLOCK HIGGSBOUNDSINPUTHIGGSCOUPLINGSBOSONS
       0,4,36,21,21,23

BLOCK SPHENOLOWENERGY
   1    0.0002726046
   2    1.5964684e-06
   3    3.5160595e-05
   4    2.8655563e-15
   5    1.2241166e-10
   6    2.5535883e-08
   7    9.6131174e-14
   8    4.106668e-09
   9    8.6816305e-07
   10    9.569092e-05
   11    0.98845057
   12    0.54312153
   13    19.399128
   14    0
   15    0
   16    0.0021615994
   17    2.2817032e-15
   18    2.4746515e-11
   19    8.2772099e-11
   20   -1.6304668e-14
   21   -6.9714309e-10
   22   -2.4128059e-07
   23    0
   24    0
   25    0
   26    0
   27    0
   28    0
   29    0
   30    0
   31    0
   39    8.7206162e-05
   40    0
   41    0
   42    0

BLOCK FWCOEF Q=  160
   305   4422   0   0   -0.18881911
   305   4422   0   2   -0.1265068
   305   4322   0   2    0.00027300551
   305   6421   0   0   -0.095227835
   305   6421   0   2   -0.073461939
   305   6321   0   2   -2.0535396e-06
   3051111   4133   0   0    1.5888173
   3051111   4133   0   2    1.5901424
   3051111   4233   0   2    0.00030716814
   3051111   4137   0   0   -4.4115094
   3051111   4137   0   2   -4.400876
   3051111   4237   0   2   -0.0023994174
   3051313   4133   0   0    1.5888173
   3051313   4133   0   2    1.5901354
   3051313   4233   0   2    0.00030716484
   3051313   4137   0   0   -4.4115094
   3051313   4137   0   2   -4.400883
   3051313   4237   0   2   -0.0023994254
   3051212   4137   0   0    1.5053501
   3051212   4137   0   2    1.5030441
   3051212   4237   0   2    0.00052329822
   3051414   4137   0   0    1.5053501
   3051414   4137   0   2    1.5030441
   3051414   4237   0   2    0.00052329834
   3051616   4137   0   0    1.5053501
   3051616   4137   0   2    1.5030443
   3051616   4237   0   2    0.00052333223

BLOCK IMFWCOEF Q=  160
   305   4422   0   0    3.8584705e-07
   305   4422   0   2   -2.412316e-05
   305   4322   0   2    6.6271991e-06
   305   6421   0   0    3.3050351e-07
   305   6421   0   2   -1.2340536e-05
   305   6321   0   2    2.2854008e-06
   3051111   4133   0   2   -1.5248746e-06
   3051111   4233   0   2    6.4468052e-06
   3051111   4137   0   2    1.227126e-05
   3051111   4237   0   2   -5.0377614e-05
   3051313   4133   0   2   -1.5248948e-06
   3051313   4233   0   2    6.4467581e-06
   3051313   4137   0   2    1.22714e-05
   3051313   4237   0   2   -5.0377769e-05
   3051212   4137   0   2   -2.4328932e-06
   3051212   4237   0   2    1.098705e-05
   3051414   4137   0   2   -2.4328909e-06
   3051414   4237   0   2    1.098705e-05
   3051616   4137   0   2   -2.4290731e-06
   3051616   4237   0   2    1.0987051e-05

DECAY 23  2.4952


DECAY 24  2.085


DECAY 1000011  7.7601119
    0.64957956   2   -1000037    12
    0.3171935   2    1000025    11
    0.014874238   2    1000022    11
    0.0074458082   2   -1000024    12
    0.006038601   2    1000035    11
    0.0048682971   2    1000023    11

DECAY 2000011  0.85661464
    0.98415527   2    1000035    11
    0.011707287   2    1000023    11
    0.0040599905   2    1000022    11

DECAY 1000013  7.7815081
    0.6478066   2   -1000037    14
    0.31633271   2    1000025    13
    0.016217084   2    1000022    13
    0.0074254023   2   -1000024    14
    0.0061953253   2    1000023    13
    0.006022874   2    1000035    13

DECAY 2000013  0.90576804
    0.93085779   2    1000035    13
    0.026938919   2   -1000024    14
    0.024362943   2    1000023    13
    0.017543827   2    1000022    13
    0.00012602011   2    1000025    13
    0.00010858897   2   -1000037    14

DECAY 1000015  8.6029592
    0.29422211   2   -1000037    16
    0.28641467   2    1000022    15
    0.26778215   2    1000023    15
    0.14443789   2    1000025    15
    0.0071431927   2   -1000024    16

DECAY 2000015  17.25208
    0.4440754   2   -1000024    16
    0.22563336   2    1000022    15
    0.22113048   2    1000023    15
    0.092365343   2    1000035    15
    0.0060503414   2    1000016   -24
    0.0031345776   2    1000015    25
    0.0031310455   2   -1000037    16
    0.0029349673   2    1000015    23
    0.001544482   2    1000025    15

DECAY 1000012  7.8289652
    0.6134965   2    1000037    11
    0.31489197   2    1000025    12
    0.054214037   2    1000024    11
    0.010327597   2    1000022    12
    0.0057670159   2    1000035    12
    0.0013028807   2    1000023    12

DECAY 1000014  7.8503243
    0.61185107   2    1000037    13
    0.31404301   2    1000025    14
    0.056754574   2    1000024    13
    0.010299611   2    1000022    14
    0.0057523833   2    1000035    14
    0.0012993503   2    1000023    14

DECAY 1000016  8.648828
    0.57155794   2    1000024    15
    0.27802016   2    1000037    15
    0.14227463   2    1000025    16
    0.0072378654   2    1000022    16
    0.00090940236   2    1000023    16

DECAY 2000001  144.00181
    0.98218457   2    1000021    1
    0.017770933   2    1000035    1

DECAY 1000001  207.53214
    0.68680879   2    1000021    1
    0.20537074   2   -1000037    2
    0.10081384   2    1000025    1
    0.0031680217   2    1000035    1
    0.0021070067   2    1000022    1
    0.0013277577   2   -1000024    2
    0.00040384995   2    1000023    1

DECAY 2000003  144.05957
    0.98180272   2    1000021    3
    0.017763901   2    1000035    3
    0.00019381011   2   -1000024    4
    0.00012799844   2    1000023    3
    0.00010947866   2    1000022    3

DECAY 1000003  207.56311
    0.68671096   2    1000021    3
    0.2053409   2   -1000037    4
    0.1007994   2    1000025    3
    0.0031675723   2    1000035    3
    0.0021749624   2    1000022    3
    0.0013358517   2   -1000024    4
    0.00047035377   2    1000023    3

DECAY 1000005  92.675416
    0.35298675   2   -1000024    6
    0.16262661   2    1000006   -24
    0.14994318   2    1000022    5
    0.13758569   2    1000023    5
    0.13613865   2   -1000037    6
    0.059545255   2    1000025    5
    0.0011738601   2    1000035    5

DECAY 2000005  55.668448
    0.47229344   2   -1000024    6
    0.24165553   2    1000023    5
    0.23611139   2    1000022    5
    0.02020032   2   -1000037    6
    0.011787656   2    1000006   -24
    0.0094867813   2    1000025    5
    0.0084648851   2    1000035    5

DECAY 2000002  151.93321
    0.93242737   2    1000021    2
    0.067407949   2    1000035    2
    0.00012154526   2    1000023    2

DECAY 1000002  207.52744
    0.68659503   2    1000021    2
    0.1971144   2    1000037    1
    0.10050763   2    1000025    2
    0.0097850972   2    1000024    1
    0.0030133892   2    1000035    2
    0.0023688605   2    1000022    2
    0.0006155879   2    1000023    2

DECAY 2000004  151.93686
    0.93240528   2    1000021    4
    0.067406369   2    1000035    4
    0.00012748657   2    1000023    4

DECAY 1000004  207.55831
    0.68649714   2    1000021    4
    0.19708628   2    1000037    3
    0.10049303   2    1000025    4
    0.0099180864   2    1000024    3
    0.0030129621   2    1000035    4
    0.0023726373   2    1000022    4
    0.00061985942   2    1000023    4

DECAY 1000006  34.263113
    0.49705876   2    1000024    5
    0.24436368   2    1000023    6
    0.23045253   2    1000022    6
    0.020048748   2    1000037    5
    0.0080462172   2    1000025    6

DECAY 2000006  98.680004
    0.28635962   2    1000024    5
    0.17858555   2    1000023    6
    0.17309898   2    1000022    6
    0.11268612   2    1000006    25
    0.10887248   2    1000037    5
    0.081624315   2    1000006    23
    0.05709944   2    1000025    6
    0.0016734906   2    1000035    6

DECAY 1000024  9.0371164e-10
    0.46032751   3    1000022   -1    2
    0.20431929   3    1000022   -3    4
    0.15347416   3    1000022   -11    12
    0.15259323   3    1000022   -13    14
    0.029285807   3    1000022   -15    16

DECAY 1000037  4.791869
    0.26760124   2    1000022    24
    0.25647703   2    1000023    24
    0.24719871   2    1000024    23
    0.22642648   2    1000024    25
    0.0012200357   3    1000022   -5    6
    0.00098957644   3    1000023   -5    6

DECAY 1000022 -1


DECAY 1000023  3.4954287e-07
    0.33195437   2    1000022    22
    0.14771741   3    1000022    12   -12
    0.11045133   3    1000022    1   -1
    0.11032417   3    1000022    3   -3
    0.08614308   3    1000022    2   -2
    0.067953398   3    1000022    4   -4
    0.024921558   3    1000022    11   -11
    0.024877412   3    1000022    13   -13
    0.015076678   3    1000022    15   -15
    0.014141248   3    1000024    1   -2
    0.014141248   3   -1000024   -1    2
    0.011708234   3    1000024    3   -4
    0.011708234   3   -1000024   -3    4
    0.0047138275   3    1000024    11   -12
    0.0047138275   3   -1000024   -11    12
    0.0047075289   3    1000024    13   -14
    0.0047075289   3   -1000024   -13    14
    0.0034778306   3    1000022    5   -5
    0.0032805472   3    1000024    15   -16
    0.0032805472   3   -1000024   -15    16

DECAY 1000025  5.866993
    0.22832819   2    1000024   -24
    0.22832819   2   -1000024    24
    0.18522299   2    1000023    23
    0.17323286   2    1000023    25
    0.1446803   2    1000022    25
    0.037582208   2    1000022    23
    0.0012702697   3    1000024    5   -6
    0.0012702697   3   -1000024   -5    6

DECAY 1000035  3.1719628
    0.22103902   2    1000024   -24
    0.22103902   2   -1000024    24
    0.16165625   2    1000022    23
    0.15170795   2    1000023    25
    0.13434472   2    1000022    25
    0.061126715   2    1000023    23
    0.0084407617   2    1000016   -16
    0.0084407617   2   -1000016    16
    0.007792441   2    1000015   -15
    0.007792441   2   -1000015    15
    0.0033166192   3    1000024    5   -6
    0.0033166192   3   -1000024   -5    6
    0.0019413085   2    1000025    23
    0.0019027091   2    1000037   -24
    0.0019027091   2   -1000037    24
    0.0013394535   2    1000025    25
    0.0012742013   3    1000023    6   -6
    0.0012320757   3    1000022    6   -6

DECAY 1000021  206.85529
    0.17816496   2    1000006   -6
    0.17816496   2   -1000006    6
    0.10967672   2    2000006   -6
    0.10967672   2   -2000006    6
    0.10765384   2    1000005   -5
    0.10765384   2   -1000005    5
    0.10274147   2    2000005   -5
    0.10274147   2   -2000005    5
    0.0015253307   2    1000006   -4
    0.0015253307   2   -1000006    4
    0.00024926118   3    1000035    6   -6

DECAY 25  0.0033364844
    0.64522008   2   -5    5
    0.15329702   2   -24    24
    0.075514008   2    21    21
    0.073442087   2   -15    15
    0.031852574   2   -4    4
    0.016796501   2    23    23
    0.0022987523   2    22    22
    0.0010815544   2    22    23
    0.00025481004   2   -13    13
    0.00024177723   2   -3    3
    6.6848971e-07   2   -1    1
    1.641603e-07   2   -2    2
    5.7284823e-09   2   -11    11

DECAY 35  152.14864
    0.60176508   2   -5    5
    0.11292299   2   -15    15
    0.080108941   2   -1000024    1000037
    0.080108941   2   -1000037    1000024
    0.041449342   2    1000022    1000025
    0.040581671   2    1000023    1000025
    0.011685994   2    1000022    1000035
    0.0096932794   2    1000023    1000035
    0.0094729457   2   -1000024    1000024
    0.0022360094   2   -2000015    1000015
    0.0022360094   2   -1000015    2000015
    0.0019538116   2    1000022    1000022
    0.001243469   2   -1000037    1000037
    0.0010818954   2   -2000006    1000006
    0.0010818954   2   -1000006    2000006
    0.00062645905   2    1000025    1000025
    0.00040131722   2   -13    13
    0.00035251225   2    1000022    1000023
    0.00029107822   2   -6    6
    0.00024599615   2   -3    3
    0.0002193004   2    1000023    1000023
    0.0001571494   2    1000025    1000035
    6.7781662e-05   2   -1000006    1000006
    7.0109924e-06   2    21    21
    3.6614485e-06   2   -1000015    1000015
    2.6134979e-06   2    1000035    1000035
    1.7994669e-06   2   -2000015    2000015
    6.8008658e-07   2   -1    1
    6.9302509e-08   2    22    23
    3.6852202e-08   2    23    23
    3.2315642e-08   2    22    22
    1.6048108e-08   2    25    25
    1.3788929e-08   2   -1000011    1000011
    1.3575213e-08   2   -1000013    1000013
    9.4737139e-09   2   -24    24
    9.0130125e-09   2   -11    11
    7.7948901e-09   2   -2000011    2000011
    7.6825009e-09   2   -2000013    2000013
    4.6478371e-09   2   -4    4
    2.6326618e-10   2   -2000013    1000013
    2.6326618e-10   2   -1000013    2000013
    2.3958446e-14   2   -2    2
    6.158116e-15   2   -2000011    1000011
    6.158116e-15   2   -1000011    2000011

DECAY 36  141.7868
    0.58394489   2   -5    5
    0.10958314   2   -15    15
    0.086170566   2   -1000024    1000037
    0.086170566   2   -1000037    1000024
    0.044751032   2    1000023    1000025
    0.043462128   2    1000022    1000025
    0.012351772   2    1000023    1000035
    0.010666389   2    1000022    1000035
    0.010072978   2   -1000024    1000024
    0.0024020617   2   -2000015    1000015
    0.0024020617   2   -1000015    2000015
    0.0019863454   2    1000022    1000022
    0.0012379193   2   -1000037    1000037
    0.0012262738   2   -2000006    1000006
    0.0012262738   2   -1000006    2000006
    0.0006264272   2    1000025    1000025
    0.00043627425   2    1000022    1000023
    0.00038945182   2   -13    13
    0.00025931608   2    1000023    1000023
    0.00025457865   2   -6    6
    0.00023870126   2   -3    3
    0.00012373143   2    1000025    1000035
    1.0288155e-05   2    21    21
    6.0758825e-06   2    1000035    1000035
    6.5991946e-07   2   -1    1
    7.1297541e-08   2    23    25
    1.662578e-08   2    22    23
    8.7465401e-09   2   -11    11
    4.0566216e-09   2   -4    4
    4.8425425e-10   2    22    22
    2.7903334e-10   2   -2000013    1000013
    2.7903334e-10   2   -1000013    2000013
    5.0974167e-12   2    23    35
    2.091144e-14   2   -2    2
    6.5266184e-15   2   -2000011    1000011
    6.5266184e-15   2   -1000011    2000011
    1.1055165e-38   2    25    25

DECAY 37  158.54626
    0.60593061   2   -5    6
    0.1204837   2   -15    16
    0.084617625   2    1000022    1000037
    0.079688929   2    1000024    1000025
    0.078315723   2    1000023    1000037
    0.020086491   2    1000024    1000035
    0.0043001772   2   -2000015    1000016
    0.002804416   2    1000023    1000024
    0.0013996092   2   -1000005    1000006
    0.00089824431   2   -5    4
    0.00054675614   2    1000022    1000024
    0.00042595284   2   -13    14
    0.00026304006   2    1000035    1000037
    0.00021675859   2   -3    4
    1.016672e-05   2   -3    2
    6.414391e-06   2   -5    2
    2.4308868e-06   2   -2000005    1000006
    1.3685385e-06   2   -1000015    1000016
    7.46132e-07   2   -3    6
    6.0137242e-07   2   -1    2
    6.3676339e-08   2    24    25
    5.2004409e-08   2   -1000011    1000012
    5.1715593e-08   2   -1000013    1000014
    2.8301795e-08   2   -1    4
    1.9458668e-08   2   -1    6
    1.0244165e-08   2    1000025    1000037
    9.9630811e-09   2   -11    12
    5.3423151e-10   2   -2000013    1000014
    9.4939404e-14   2    24    35
    1.24979e-14   2   -2000011    1000012

DECAY 6  2.43
    1   2    5    24

DECAY 15 -1
