BLOCK SPINFO
   1   SPheno
   2   v4.0.5be

BLOCK SPHENOINFO
   1   2
   2   2

BLOCK MODSEL
   1   0

BLOCK MINPAR
   3    8.5942055
   4    1

BLOCK EXTPAR
   0    1453.4592
   1    1807.3125
   2   -946.2003
   3    3000
   11   -4159.3539
   12   -995.21474
   13   -21.725661
   23    101.61547
   25    8.2627451
   26    2866.3759
   31    1006.3823
   32    1006.3823
   33    781.11028
   34    897.62021
   35    897.62021
   36    1615.1281
   41    5000
   42    5000
   43    1416.5563
   44    5000
   45    5000
   46    1673.3428
   47    5000
   48    5000
   49    1279.1932

BLOCK SMINPUTS
   1    127.90897
   2    1.1663787e-05
   3    0.1184
   4    91.1876
   5    4.18
   6    173.2
   7    1.777
   8    0
   11    0.00051099893
   12    0
   13    0.10565837
   14    0
   21    0.005
   22    0.0025
   23    0.095
   24    1.27

BLOCK GAUGE Q=  1453.4592
   1    0.35536298
   2    0.66519887
   3    1.219778

BLOCK YU Q=  1453.4592
   1   1    8.4455522e-06
   2   2    0.0042903405
   3   3    1.0202905

BLOCK YD Q=  1453.4592
   1   1    0.00014022733
   2   2    0.0026643192
   3   3    0.13906157

BLOCK YE Q=  1453.4592
   1   1    2.4470694e-05
   2   2    0.0050597634
   3   3    0.085096896

BLOCK AU Q=  1453.4592
   1   1    0
   2   2    0
   3   3   -4159.3536

BLOCK AD Q=  1453.4592
   1   1    0
   2   2    0
   3   3   -995.21476

BLOCK AE Q=  1453.4592
   1   1    0
   2   2    0
   3   3   -21.725661

BLOCK MSOFT Q=  1453.4592
   1    1807.3125
   2   -946.2003
   3    3000
   21    8068136.4
   22    142795.44
   31    1006.3823
   32    1006.3823
   33    781.11028
   34    897.62021
   35    897.62021
   36    1615.1281
   41    5000
   42    5000
   43    1416.5563
   44    5000
   45    5000
   46    1673.3428
   47    5000
   48    5000
   49    1279.1932

BLOCK MASS
   6    173.2
   23    91.1876
   24    80.429995
   15    1.777
   25    121.57686
   35    2866.0263
   36    2866.3759
   37    2867.4092
   1000001    5028.4437
   2000001    5018.4548
   1000002    5028.0291
   2000002    5019.7247
   1000003    5028.4443
   2000003    5018.4551
   1000004    5028.0297
   2000004    5019.7255
   1000005    1288.0076
   2000005    1385.3401
   1000006    1255.6759
   2000006    1682.3958
   1000011    1019.2405
   2000011    904.54209
   1000012    1015.8936
   1000013    1019.2403
   2000013    904.54165
   1000014    1015.8934
   1000015    797.05601
   2000015    1620.4469
   1000016    792.88271
   1000021    3188.4978
   1000022   -106.47706
   1000023    110.83723
   1000025   -990.50987
   1000035    1800.8574
   1000024    109.45472
   1000037    990.66512

BLOCK ALPHA
      -0.11614405

BLOCK HMIX Q=  1453.4592
   1    101.61547
   2    8.2627451
   3    244.00954
   4    8216110.9

BLOCK STOPMIX
   1   1    0.85423078
   1   2    0.519894
   2   1   -0.519894
   2   2    0.85423078

BLOCK SBOTMIX
   1   1    0.014403588
   1   2    0.99989626
   2   1   -0.99989626
   2   2    0.014403588

BLOCK STAUMIX
   1   1    0.99999971
   1   2    0.00076293666
   2   1   -0.00076293666
   2   2    0.99999971

BLOCK NMIX
   1   1   -0.014136991
   1   2   -0.055053907
   1   3    0.71420073
   1   4    0.69762922
   2   1    0.020707722
   2   2    0.058006176
   2   3    0.69992592
   2   4   -0.71155476
   3   1   -0.0012929785
   3   2    0.99679681
   3   3   -0.0012876502
   3   4    0.079954967
   4   1    0.99968478
   4   2   -0.00069085332
   4   3   -0.0044002738
   4   4    0.024708225

BLOCK UMIX
   1   1    0.0017325235
   1   2    0.9999985
   2   1   -0.9999985
   2   2    0.0017325235

BLOCK VMIX
   1   1    0.11324497
   1   2    0.9935671
   2   1    0.9935671
   2   2   -0.11324497

BLOCK HIGGSBOUNDSINPUTHIGGSCOUPLINGSFERMIONS
       0, 68.272956,3,36,15,15

BLOCK HIGGSBOUNDSINPUTHIGGSCOUPLINGSBOSONS
       0,4,36,21,21,23

BLOCK SPHENOLOWENERGY
   1    0.00031193411
   2    1.5909922e-06
   3    3.5239157e-05
   4    2.6681639e-15
   5    1.1398093e-10
   6    2.3860858e-08
   7    8.9841685e-14
   8    3.8380339e-09
   9    8.1408264e-07
   10    9.6757829e-05
   11    0.99947133
   12    0.5429206
   13    19.398808
   14    0
   15    0
   16    0.0021611917
   17    2.2816977e-15
   18    2.4816877e-11
   19    8.293253e-11
   20   -1.5641971e-15
   21   -6.6874385e-11
   22   -2.068198e-08
   23    0
   24    0
   25    0
   26    0
   27    0
   28    0
   29    0
   30    0
   31    0
   39   -4.6256465e-05
   40    0
   41    0
   42    0

BLOCK FWCOEF Q=  160
   305   4422   0   0   -0.18881911
   305   4422   0   2   -0.17765705
   305   4322   0   2   -3.5057673e-05
   305   6421   0   0   -0.095227835
   305   6421   0   2   -0.094744675
   305   6321   0   2   -0.00013277093
   3051111   4133   0   0    1.5906134
   3051111   4133   0   2    1.5915862
   3051111   4233   0   2    1.3772613e-05
   3051111   4137   0   0   -4.4133055
   3051111   4137   0   2   -4.4102697
   3051111   4237   0   2   -0.00010636454
   3051313   4133   0   0    1.5906134
   3051313   4133   0   2    1.591586
   3051313   4233   0   2    1.3772609e-05
   3051313   4137   0   0   -4.4133055
   3051313   4137   0   2   -4.4102698
   3051313   4237   0   2   -0.00010636454
   3051212   4137   0   0    1.5053501
   3051212   4137   0   2    1.5047025
   3051212   4237   0   2    2.3190238e-05
   3051414   4137   0   0    1.5053501
   3051414   4137   0   2    1.5047025
   3051414   4237   0   2    2.3190238e-05
   3051616   4137   0   0    1.5053501
   3051616   4137   0   2    1.5047024
   3051616   4237   0   2    2.3190398e-05

BLOCK IMFWCOEF Q=  160
   305   4422   0   0    3.8582736e-07
   305   4422   0   2   -4.5078978e-06
   305   4322   0   2    1.7245927e-06
   305   6421   0   0    3.3048665e-07
   305   6421   0   2   -4.9960811e-06
   305   6321   0   2    6.9451494e-07
   3051111   4133   0   2   -4.1425116e-06
   3051111   4233   0   2    2.7979978e-07
   3051111   4137   0   2    3.2202326e-05
   3051111   4237   0   2   -2.1638958e-06
   3051313   4133   0   2   -4.1425101e-06
   3051313   4233   0   2    2.7979973e-07
   3051313   4137   0   2    3.2202331e-05
   3051313   4237   0   2   -2.163896e-06
   3051212   4137   0   2   -6.7484368e-06
   3051212   4237   0   2    4.7178012e-07
   3051414   4137   0   2   -6.7484368e-06
   3051414   4237   0   2    4.7178012e-07
   3051616   4137   0   2   -6.75068e-06
   3051616   4237   0   2    4.7178216e-07

DECAY 23  2.4952


DECAY 24  2.085


DECAY 2000011  0.0027742119
    0.68158347   2    1000023    11
    0.31841276   2    1000022    11

DECAY 1000011  0.079302916
    0.34581863   2   -1000037    12
    0.26352407   2    1000023    11
    0.21691716   2    1000022    11
    0.17340831   2    1000025    11
    0.00033182104   2   -1000024    12

DECAY 2000013  0.0036689813
    0.57503223   2    1000023    13
    0.30305194   2    1000022    13
    0.12191582   2   -1000024    14

DECAY 1000013  0.079809661
    0.34361845   2   -1000037    14
    0.26496362   2    1000023    13
    0.21878438   2    1000022    13
    0.17230383   2    1000025    13
    0.0003297141   2   -1000024    14

DECAY 1000015  0.13997997
    0.50150118   2    1000023    15
    0.49836983   2    1000022    15
    0.00012897769   2   -1000024    16

DECAY 2000015  0.46919955
    0.49302649   2   -1000024    16
    0.25490881   2    1000022    15
    0.2489666   2    1000023    15
    0.0015553587   2    1000016   -24
    0.0007663097   2    1000015    23
    0.00075988478   2    1000015    25

DECAY 1000012  0.16360618
    0.68482186   2    1000024    11
    0.12982794   2    1000037    11
    0.066224709   2    1000025    12
    0.060321786   2    1000022    12
    0.058803708   2    1000023    12

DECAY 1000014  0.16411124
    0.68579618   2    1000024    13
    0.12942513   2    1000037    13
    0.066019834   2    1000025    14
    0.060136129   2    1000022    14
    0.058622724   2    1000023    14

DECAY 1000016  0.21115351
    0.92902687   2    1000024    15
    0.035960335   2    1000022    16
    0.035012792   2    1000023    16

DECAY 2000001  142.98978
    0.98512425   2    1000021    1
    0.014863382   2    1000035    1

DECAY 1000001  203.78923
    0.69632013   2    1000021    1
    0.20067776   2   -1000037    2
    0.099745985   2    1000025    1
    0.002635838   2    1000035    1
    0.00032013874   2    1000023    1
    0.00029949881   2    1000022    1

DECAY 2000003  142.99122
    0.98511453   2    1000021    3
    0.014863234   2    1000035    3

DECAY 1000003  203.79184
    0.69631149   2    1000021    3
    0.20067532   2   -1000037    4
    0.09974472   2    1000025    3
    0.0026358048   2    1000035    3
    0.00032183546   2    1000023    3
    0.00030126583   2    1000022    3

DECAY 1000005  0.96282242
    0.4915361   2   -1000024    6
    0.26076626   2    1000022    5
    0.24708331   2    1000023    5
    0.00040069192   2   -1000037    6
    0.00021363906   2    1000025    5

DECAY 2000005  35.642294
    0.75999509   2   -1000024    6
    0.10137327   2    1000006   -24
    0.082281327   2   -1000037    6
    0.040617   2    1000025    5
    0.0079533624   2    1000022    5
    0.0077793904   2    1000023    5

DECAY 2000002  149.5066
    0.94306788   2    1000021    2
    0.056884915   2    1000035    2

DECAY 1000002  203.78691
    0.6961162   2    1000021    2
    0.19808806   2    1000037    1
    0.099645458   2    1000025    2
    0.0027828018   2    1000024    1
    0.0025949265   2    1000035    2
    0.00041293697   2    1000023    2
    0.00035962313   2    1000022    2

DECAY 2000004  149.51029
    0.94304473   2    1000021    4
    0.056883527   2    1000035    4

DECAY 1000004  203.78946
    0.69610749   2    1000021    4
    0.19808561   2    1000037    3
    0.099644247   2    1000025    4
    0.0027862391   2    1000024    3
    0.0025948967   2    1000035    4
    0.00041750293   2    1000023    4
    0.00036401284   2    1000022    4

DECAY 1000006  30.739865
    0.38655597   2    1000023    6
    0.37196897   2    1000022    6
    0.18257062   2    1000024    5
    0.045193557   2    1000037    5
    0.013574883   2    1000025    6
    0.00013593202   3    1000022    24    5

DECAY 2000006  124.82033
    0.21922051   2    1000024    5
    0.20862115   2    2000005    24
    0.20710306   2    1000006    23
    0.14258718   2    1000023    6
    0.1372006   2    1000022    6
    0.075121097   2    1000006    25
    0.0068635179   2    1000037    5
    0.0031861609   2    1000025    6

DECAY 1000024  6.7963016e-10
    0.46939372   3    1000022   -1    2
    0.19346181   3    1000022   -3    4
    0.15647099   3    1000022   -11    12
    0.15549367   3    1000022   -13    14
    0.025179806   3    1000022   -15    16

DECAY 1000037  9.2900568
    0.22396058   2    1000023    24
    0.21726047   2    1000024    23
    0.2151356   2    1000022    24
    0.21316511   2    1000024    25
    0.059858752   2    1000016   -15
    0.058378628   2   -1000015    16
    0.0045226578   3    1000022   -5    6
    0.0040604125   3    1000023   -5    6
    0.0035916908   3    1000024    6   -6

DECAY 1000022 -1


DECAY 1000023  9.5088167e-09
    0.60556818   2    1000022    22
    0.10983454   3    1000022    12   -12
    0.082128302   3    1000022    1   -1
    0.081676284   3    1000022    3   -3
    0.064053718   3    1000022    2   -2
    0.018533101   3    1000022    11   -11
    0.018433629   3    1000022    4   -4
    0.018372553   3    1000022    13   -13
    0.00058205973   3    1000022    15   -15
    0.00024668153   3    1000024    1   -2
    0.00024668153   3   -1000024   -1    2

DECAY 1000025  9.8780793
    0.20746555   2    1000024   -24
    0.20746555   2   -1000024    24
    0.16026166   2    1000023    25
    0.10445919   2    1000022    23
    0.10159425   2    1000023    23
    0.09516979   2    1000022    25
    0.028335206   2    1000016   -16
    0.028335206   2   -1000016    16
    0.027202058   2    1000015   -15
    0.027202058   2   -1000015    15
    0.0048795932   3    1000024    5   -6
    0.0048795932   3   -1000024   -5    6
    0.0013842372   3    1000023    6   -6
    0.0012979792   3    1000022    6   -6

DECAY 1000035  24.113776
    0.10482918   2    2000013   -13
    0.10482918   2   -2000013    13
    0.10482911   2    2000011   -11
    0.10482911   2   -2000011    11
    0.051118587   2    1000024   -24
    0.051118587   2   -1000024    24
    0.033895138   2    1000022    23
    0.03264915   2    1000023    25
    0.030543059   2    1000016   -16
    0.030543059   2   -1000016    16
    0.030231414   2    1000015   -15
    0.030231414   2   -1000015    15
    0.021845235   2    1000014   -14
    0.021845235   2   -1000014    14
    0.021845226   2    1000012   -12
    0.021845226   2   -1000012    12
    0.021598796   2    1000013   -13
    0.021598796   2   -1000013    13
    0.021598787   2    1000011   -11
    0.021598787   2   -1000011    11
    0.019531518   2    1000022    25
    0.017147022   2    1000023    23
    0.014908835   2    1000005   -5
    0.014908835   2   -1000005    5
    0.01187021   2    1000006   -6
    0.01187021   2   -1000006    6
    0.0067917608   2    2000015   -15
    0.0067917608   2   -2000015    15
    0.0026253979   2    2000005   -5
    0.0026253979   2   -2000005    5
    0.0017902619   3    1000023    6   -6
    0.0017501667   3    1000022    6   -6
    0.0017150785   3    1000024    5   -6
    0.0017150785   3   -1000024   -5    6
    0.00011823989   2    1000037   -24
    0.00011823989   2   -1000037    24
    0.00011035117   2    1000025    23

DECAY 1000021  243.39182
    0.13575859   2    1000005   -5
    0.13575859   2   -1000005    5
    0.1276046   2    2000005   -5
    0.1276046   2   -2000005    5
    0.12249613   2    1000006   -6
    0.12249613   2   -1000006    6
    0.11403289   2    2000006   -6
    0.11403289   2   -2000006    6

DECAY 25  0.0034665037
    0.62439025   2   -5    5
    0.17610952   2   -24    24
    0.073233376   2    21    21
    0.071513012   2   -15    15
    0.030842511   2   -4    4
    0.019896979   2    23    23
    0.0023208877   2    22    22
    0.0012099971   2    22    23
    0.00024803406   2   -13    13
    0.00023461666   2   -3    3
    6.4869172e-07   2   -1    1
    1.5894942e-07   2   -2    2
    5.5761277e-09   2   -11    11

DECAY 35  33.333386
    0.27190735   2   -1000024    1000037
    0.27190735   2   -1000037    1000024
    0.16869665   2    1000022    1000025
    0.10550337   2    1000023    1000025
    0.070359336   2   -5    5
    0.043913624   2   -6    6
    0.024517347   2    1000022    1000035
    0.012681009   2   -15    15
    0.012484168   2    1000023    1000035
    0.0096356158   2   -1000024    1000024
    0.006390897   2   -1000006    1000006
    0.0011091032   2    1000022    1000022
    0.00064147256   2    1000023    1000023
    4.7036803e-05   2   -1000037    1000037
    4.4080777e-05   2   -13    13
    2.6944068e-05   2    1000022    1000023
    2.6648669e-05   2   -3    3
    2.2871377e-05   2    1000025    1000025
    1.8278256e-05   2    25    25
    1.3788901e-05   2    23    23
    4.4235155e-06   2   -24    24
    3.7814376e-06   2    21    21
    2.9946192e-06   2    1000025    1000035
    2.8070521e-06   2   -1000015    1000015
    2.6458393e-06   2   -2000011    2000011
    2.6449285e-06   2   -2000013    2000013
    1.8752162e-06   2   -1000011    1000011
    1.87433e-06   2   -1000013    1000013
    1.7657727e-06   2   -1000005    1000005
    5.8521188e-07   2   -4    4
    7.3675147e-08   2   -1    1
    4.3402092e-08   2    22    23
    3.9367315e-08   2   -2000015    1000015
    3.9367315e-08   2   -1000015    2000015
    1.3936619e-09   2    22    22
    9.9004876e-10   2   -11    11
    2.8174776e-10   2   -2000013    1000013
    2.8174776e-10   2   -1000013    2000013
    3.0167703e-12   2   -2    2
    6.5901147e-15   2   -2000011    1000011
    6.5901147e-15   2   -1000011    2000011

DECAY 36  33.005287
    0.27463708   2   -1000024    1000037
    0.27463708   2   -1000037    1000024
    0.16257464   2    1000023    1000025
    0.11436734   2    1000022    1000025
    0.06874576   2   -5    5
    0.043356741   2   -6    6
    0.023802148   2    1000023    1000035
    0.013587595   2    1000022    1000035
    0.012389912   2   -15    15
    0.0098241986   2   -1000024    1000024
    0.0010525721   2    1000023    1000023
    0.00071535705   2    1000022    1000022
    0.00011527856   2   -1000037    1000037
    5.7803092e-05   2    1000025    1000025
    4.3068872e-05   2   -13    13
    2.6036381e-05   2   -3    3
    2.459722e-05   2    21    21
    2.1951731e-05   2    23    25
    2.005657e-05   2    1000022    1000023
    5.6781475e-07   2   -4    4
    7.1982104e-08   2   -1    1
    4.0111891e-08   2   -2000015    1000015
    4.0111891e-08   2   -1000015    2000015
    2.5797502e-08   2    22    23
    1.8289198e-08   2    22    22
    9.4987685e-09   2    1000025    1000035
    9.6731399e-10   2   -11    11
    2.8795262e-10   2   -2000013    1000013
    2.8795262e-10   2   -1000013    2000013
    2.9271942e-12   2   -2    2
    6.7352417e-15   2   -2000011    1000011
    6.7352417e-15   2   -1000011    2000011
    2.7126662e-38   2    25    25

DECAY 37  33.248217
    0.28432063   2    1000022    1000037
    0.27440426   2    1000024    1000025
    0.26902263   2    1000023    1000037
    0.1154645   2   -5    6
    0.036971079   2    1000024    1000035
    0.012738783   2   -15    16
    0.0019519018   2   -1000005    1000006
    0.0017109485   2    1000023    1000024
    0.001590167   2   -2000005    1000006
    0.0015242079   2    1000022    1000024
    0.00010251038   2   -5    4
    6.5808394e-05   2   -3    6
    4.503615e-05   2   -13    14
    2.4894075e-05   2   -3    4
    2.1829898e-05   2    24    25
    1.1823148e-05   2   -1000015    1000016
    1.0419311e-05   2   -2000011    1000012
    1.0418028e-05   2   -2000013    1000014
    3.087662e-06   2    1000035    1000037
    3.0166268e-06   2   -1    6
    1.1377575e-06   2   -3    2
    7.3202344e-07   2   -5    2
    7.873221e-08   2   -2000015    1000016
    6.7439992e-08   2   -1    2
    3.0738576e-08   2   -1    4
    2.3425751e-09   2    1000025    1000037
    1.0534002e-09   2   -11    12
    5.0424186e-10   2   -1000013    1000014
    2.0706368e-13   2    24    35
    4.8223906e-14   2    24    36
    1.1794171e-14   2   -1000011    1000012

DECAY 6  2.43
    1   2    5    24

DECAY 15 -1
