BLOCK SPINFO
   1   SPheno
   2   v4.0.5be

BLOCK SPHENOINFO
   1   2
   2   2

BLOCK MODSEL
   1   0

BLOCK MINPAR
   3    19.948473
   4   -1

BLOCK EXTPAR
   0    1468.0333
   1    104.95529
   2   -1705.8937
   3    3000
   11   -2784.0191
   12   -1816.5424
   13   -550.96278
   23   -1921.9169
   25    19.289102
   26    3498.1753
   31    276.08666
   32    276.08666
   33    1887.315
   34    331.75911
   35    331.75911
   36    1755.633
   41    5000
   42    5000
   43    1673.4576
   44    5000
   45    5000
   46    1297.9622
   47    5000
   48    5000
   49    1553.5143

BLOCK SMINPUTS
   1    127.90897
   2    1.1663787e-05
   3    0.1184
   4    91.1876
   5    4.18
   6    173.2
   7    1.777
   8    0
   11    0.00051099893
   12    0
   13    0.10565837
   14    0
   21    0.005
   22    0.0025
   23    0.095
   24    1.27

BLOCK GAUGE Q=  1468.0333
   1    0.35536298
   2    0.66519887
   3    1.219778

BLOCK YU Q=  1468.0333
   1   1    8.3956318e-06
   2   2    0.004264981
   3   3    1.0142597

BLOCK YD Q=  1468.0333
   1   1    0.00032542105
   2   2    0.006183
   3   3    0.32271571

BLOCK YE Q=  1468.0333
   1   1    5.6788353e-05
   2   2    0.01174203
   3   3    0.19748163

BLOCK AU Q=  1468.0333
   1   1    0
   2   2    0
   3   3   -2784.019

BLOCK AD Q=  1468.0333
   1   1    0
   2   2    0
   3   3   -1816.5426

BLOCK AE Q=  1468.0333
   1   1    0
   2   2    0
   3   3   -550.96279

BLOCK MSOFT Q=  1468.0333
   1    104.95529
   2   -1705.8937
   3    3000
   21    8569390.6
   22   -3624870.9
   31    276.08666
   32    276.08666
   33    1887.315
   34    331.75911
   35    331.75911
   36    1755.633
   41    5000
   42    5000
   43    1673.4576
   44    5000
   45    5000
   46    1297.9622
   47    5000
   48    5000
   49    1553.5143

BLOCK MASS
   6    173.2
   23    91.1876
   24    80.429995
   15    1.777
   25    121.16348
   35    3500.0157
   36    3498.1753
   37    3500.1232
   1000001    5022.8639
   2000001    5015.2676
   1000002    5022.4243
   2000002    5017.6618
   1000003    5022.8693
   2000003    5015.2658
   1000004    5022.4258
   2000004    5017.6627
   1000005    1560.7614
   2000005    1692.4875
   1000006    1250.2136
   2000006    1723.8029
   1000011    316.35548
   2000011    323.18453
   1000012    306.07154
   1000013    311.9943
   2000013    327.38137
   1000014    306.06792
   1000015    1753.8365
   2000015    1900.9933
   1000016    1896.786
   1000021    3182.8482
   1000022    104.87367
   1000023   -1733.5522
   1000025    1912.1376
   1000035   -1929.6574
   1000024    1733.6412
   1000037    1930.1877

BLOCK ALPHA
      -0.050208706

BLOCK HMIX Q=  1468.0333
   1   -1921.9169
   2    19.289102
   3    244.03812
   4    12237231

BLOCK STOPMIX
   1   1    0.28996019
   1   2    0.95703871
   2   1   -0.95703871
   2   2    0.28996019

BLOCK SBOTMIX
   1   1   -0.23587328
   1   2    0.97178382
   2   1   -0.97178382
   2   2   -0.23587328

BLOCK STAUMIX
   1   1   -0.12384581
   1   2    0.99230147
   2   1   -0.99230147
   2   2   -0.12384581

BLOCK NMIX
   1   1    0.99972775
   1   2   -2.6474848e-05
   1   3   -0.023331466
   1   4   -0.00024030473
   2   1   -0.0045605821
   2   2   -0.96454382
   2   3   -0.19613966
   2   4    0.17653232
   3   1    0.016663325
   3   2   -0.014373267
   3   3    0.70673835
   3   4    0.70713269
   4   1   -0.015682807
   4   2    0.26353109
   4   3   -0.67934216
   4   4    0.68468945

BLOCK UMIX
   1   1   -0.95086354
   1   2   -0.3096103
   2   1   -0.3096103
   2   2    0.95086354

BLOCK VMIX
   1   1    0.95942553
   1   2    0.28196215
   2   1    0.28196215
   2   2   -0.95942553

BLOCK HIGGSBOUNDSINPUTHIGGSCOUPLINGSFERMIONS
       0, 372.06946,3,36,15,15

BLOCK HIGGSBOUNDSINPUTHIGGSCOUPLINGSBOSONS
       0,4,36,21,21,23

BLOCK SPHENOLOWENERGY
   1    0.00033954077
   2    1.5879129e-06
   3    3.524323e-05
   4    2.6154656e-15
   5    1.1172992e-10
   6    2.3398507e-08
   7    8.8407033e-14
   8    3.7767523e-09
   9    8.0138432e-07
   10    9.6566973e-05
   11    0.99749986
   12    0.542828
   13    19.394322
   14    0
   15    0
   16    0.0021618921
   17    2.2817049e-15
   18    2.4801928e-11
   19    8.2904468e-11
   20   -1.8978384e-14
   21   -8.1257964e-10
   22    1.7795569e-08
   23    0
   24    0
   25    0
   26    0
   27    0
   28    0
   29    0
   30    0
   31    0
   39    6.4788585e-05
   40    0
   41    0
   42    0

BLOCK FWCOEF Q=  160
   305   4422   0   0   -0.18881911
   305   4422   0   2   -0.21048482
   305   4322   0   2   -0.00021837231
   305   6421   0   0   -0.095227835
   305   6421   0   2   -0.11160893
   305   6321   0   2   -0.00017988421
   3051111   4133   0   0    1.5910773
   3051111   4133   0   2    1.5914788
   3051111   4233   0   2    4.2522994e-05
   3051111   4137   0   0   -4.4137694
   3051111   4137   0   2   -4.4111908
   3051111   4237   0   2   -0.00033155155
   3051313   4133   0   0    1.5910773
   3051313   4133   0   2    1.5914773
   3051313   4233   0   2    4.2522927e-05
   3051313   4137   0   0   -4.4137694
   3051313   4137   0   2   -4.4111922
   3051313   4237   0   2   -0.00033155165
   3051212   4137   0   0    1.5053501
   3051212   4137   0   2    1.5047911
   3051212   4237   0   2    7.2249301e-05
   3051414   4137   0   0    1.5053501
   3051414   4137   0   2    1.5047911
   3051414   4237   0   2    7.2249303e-05
   3051616   4137   0   0    1.5053501
   3051616   4137   0   2    1.5047918
   3051616   4237   0   2    7.2252585e-05

BLOCK IMFWCOEF Q=  160
   305   4422   0   0    3.8575013e-07
   305   4422   0   2    2.6010921e-06
   305   4322   0   2   -2.2277498e-06
   305   6421   0   0    3.304205e-07
   305   6421   0   2    9.6898631e-06
   305   6321   0   2   -9.9039578e-07
   3051111   4133   0   2   -1.4420741e-06
   3051111   4233   0   2    8.919971e-07
   3051111   4137   0   2    1.192747e-05
   3051111   4237   0   2   -6.9562604e-06
   3051313   4133   0   2   -1.4420466e-06
   3051313   4233   0   2    8.9199611e-07
   3051313   4137   0   2    1.1927475e-05
   3051313   4237   0   2   -6.9562623e-06
   3051212   4137   0   2   -2.5382098e-06
   3051212   4237   0   2    1.5159303e-06
   3051414   4137   0   2   -2.5382104e-06
   3051414   4237   0   2    1.5159303e-06
   3051616   4137   0   2   -2.5259447e-06
   3051616   4237   0   2    1.5159774e-06

DECAY 23  2.4952


DECAY 24  2.085


DECAY 1000011  0.31464586
    0.99999936   2    1000022    11

DECAY 2000011  1.2991899
    1   2    1000022    11

DECAY 1000013  0.30815478
    0.99999996   2    1000022    13

DECAY 2000013  1.3239649
    1   2    1000022    13

DECAY 1000015  8.6551017
    0.99993999   2    1000022    15

DECAY 2000015  3.2129865
    0.76915171   2    1000022    15
    0.12821752   2   -1000024    16
    0.067173906   2    1000023    15
    0.017963902   2    1000015    25
    0.017492957   2    1000015    23

DECAY 1000012  0.2993621
    1   2    1000022    12

DECAY 1000014  0.29935667
    1   2    1000022    14

DECAY 1000016  3.118934
    0.75893375   2    1000022    16
    0.13450482   2    1000024    15
    0.067220792   2    1000023    16
    0.039340637   2    1000015    24

DECAY 2000001  144.00406
    0.98057593   2    1000021    1
    0.019416233   2    1000022    1

DECAY 1000001  193.87508
    0.73241938   2    1000021    1
    0.16000152   2   -1000024    2
    0.082183016   2    1000023    1
    0.015882086   2   -1000037    2
    0.0058769316   2    1000035    1
    0.0036119801   2    1000022    1

DECAY 2000003  144.00943
    0.98053808   2    1000021    3
    0.019415517   2    1000022    3

DECAY 1000003  193.87984
    0.7324043   2    1000021    3
    0.15999827   2   -1000024    4
    0.082181737   2    1000023    3
    0.015888151   2   -1000037    4
    0.0058833709   2    1000035    3
    0.003611906   2    1000022    3

DECAY 1000005  1.356716
    0.63060293   2    1000022    5
    0.36939707   2    1000006   -24

DECAY 2000005  23.777717
    0.98119115   2    1000006   -24
    0.010359295   2    1000022    5
    0.0045807272   2    1000005    23
    0.003868829   2    1000005    25

DECAY 2000002  152.65005
    0.92666973   2    1000021    2
    0.073301085   2    1000022    2

DECAY 1000002  193.86134
    0.73223511   2    1000021    2
    0.16288551   2    1000024    1
    0.082454984   2    1000023    2
    0.01317122   2    1000037    1
    0.00563256   2    1000035    2
    0.0036097713   2    1000022    2

DECAY 2000004  152.65272
    0.92665365   2    1000021    4
    0.0732998   2    1000022    4

DECAY 1000004  193.86557
    0.73221963   2    1000021    4
    0.16288346   2    1000024    3
    0.082453494   2    1000023    4
    0.013183878   2    1000037    3
    0.0056355642   2    1000035    4
    0.0036096931   2    1000022    4

DECAY 1000006  2.4477758
    0.9992875   2    1000022    6
    0.00049454524   2    1000022    4
    0.00010317275   3    1000022    24    5

DECAY 2000006  28.302889
    0.48101229   2    1000006    25
    0.47642182   2    1000006    23
    0.024152704   2    1000005    24
    0.018413189   2    1000022    6

DECAY 1000024  26.305042
    0.25064385   2    1000014   -13
    0.25063497   2    1000012   -11
    0.24556297   2   -1000013    14
    0.2451004   2   -1000011    12
    0.0039163389   2    1000006   -5
    0.0035122347   2    1000022    24
    0.00045907433   3    1000022   -5    6
    0.00012477929   2    2000006   -5

DECAY 1000037  29.694502
    0.63930951   2    1000006   -5
    0.073847906   2    1000023    24
    0.042680158   2   -2000005    6
    0.040152833   2    1000022    24
    0.036309785   2   -1000005    6
    0.033134955   2    1000024    23
    0.029385023   2    1000024    25
    0.026011287   2   -1000013    14
    0.025972011   2   -1000011    12
    0.021692997   2    1000014   -13
    0.021616661   2    1000012   -11
    0.0077931573   2    2000006   -5
    0.0014255877   3    1000022   -5    6
    0.0005085578   2   -1000015    16

DECAY 1000022 -1


DECAY 1000023  27.009845
    0.12366131   2    1000013   -13
    0.12366131   2   -1000013    13
    0.12342534   2    1000011   -11
    0.12342534   2   -1000011    11
    0.12272378   2    1000014   -14
    0.12272378   2   -1000014    14
    0.12272359   2    1000012   -12
    0.12272359   2   -1000012    12
    0.0025823784   2    1000006   -6
    0.0025823784   2   -1000006    6
    0.0019544492   2    1000005   -5
    0.0019544492   2   -1000005    5
    0.0015781699   2    1000022    25
    0.001385818   2    1000022    23
    0.00074975419   2    2000005   -5
    0.00074975419   2   -2000005    5
    0.00064041226   2    1000006   -4
    0.00064041226   2   -1000006    4

DECAY 1000025  28.183117
    0.38704174   2    1000006   -6
    0.38704174   2   -1000006    6
    0.043223556   2    1000023    23
    0.029920762   2    1000023    25
    0.029761949   2    1000024   -24
    0.029761949   2   -1000024    24
    0.022289663   2    1000022    23
    0.021100388   2    1000022    25
    0.01140908   2    1000005   -5
    0.01140908   2   -1000005    5
    0.0071848561   2    2000006   -6
    0.0071848561   2   -2000006    6
    0.0051052042   2    2000005   -5
    0.0051052042   2   -2000005    5
    0.0010967487   3    1000022    6   -6
    0.00032546332   2    1000015   -15
    0.00032546332   2   -1000015    15

DECAY 1000035  32.066508
    0.36756219   2    1000006   -6
    0.36756219   2   -1000006    6
    0.031787875   2    1000024   -24
    0.031787875   2   -1000024    24
    0.029615887   2    1000023    25
    0.021391393   2    1000022    25
    0.019391614   2    1000022    23
    0.014457839   2    2000006   -6
    0.014457839   2   -2000006    6
    0.009305033   2    1000014   -14
    0.009305033   2   -1000014    14
    0.0093050216   2    1000012   -12
    0.0093050216   2   -1000012    12
    0.0082132581   2    1000013   -13
    0.0082132581   2   -1000013    13
    0.0081646597   2    1000011   -11
    0.0081646597   2   -1000011    11
    0.0077004583   2    1000005   -5
    0.0077004583   2   -1000005    5
    0.0073712721   2    2000005   -5
    0.0073712721   2   -2000005    5
    0.00097021397   3    1000022    6   -6
    0.00025424267   2    1000015   -15
    0.00025424267   2   -1000015    15
    0.00010622735   2    1000023    23

DECAY 1000021  216.97302
    0.1440406   2    1000006   -6
    0.1440406   2   -1000006    6
    0.12544738   2    1000005   -5
    0.12544738   2   -1000005    5
    0.11723484   2    2000006   -6
    0.11723484   2   -2000006    6
    0.11149862   2    2000005   -5
    0.11149862   2   -2000005    5
    0.0010934704   2    1000006   -4
    0.0010934704   2   -1000006    4
    0.00019219652   3    1000023    6   -6
    0.00018502968   3    1000024    5   -6
    0.00018502968   3   -1000024   -5    6
    0.00016446512   3    1000025    6   -6
    0.00014012029   3    1000037    5   -6
    0.00014012029   3   -1000037   -5    6
    0.00013592171   3    1000023    5   -5
    0.00012057582   3    1000035    6   -6

DECAY 25  0.0034336709
    0.62965977   2   -5    5
    0.16963337   2   -24    24
    0.074470708   2    21    21
    0.072117343   2   -15    15
    0.031136588   2   -4    4
    0.019006397   2    23    23
    0.0023098972   2    22    22
    0.0011777696   2    22    23
    0.00025055723   2   -13    13
    0.00023678316   2   -3    3
    6.5468318e-07   2   -1    1
    1.6046654e-07   2   -2    2
    5.63318e-09   2   -11    11

DECAY 35  60.395992
    0.3836283   2   -5    5
    0.18566368   2   -2000006    1000006
    0.18566368   2   -1000006    2000006
    0.10599816   2   -1000006    1000006
    0.049233611   2   -15    15
    0.027598777   2   -2000006    2000006
    0.017238556   2    1000022    1000025
    0.013808305   2    1000022    1000035
    0.0082744345   2   -2000005    1000005
    0.0082744345   2   -1000005    2000005
    0.0072472272   2   -6    6
    0.0041563366   2   -1000005    1000005
    0.0019736321   2    1000022    1000023
    0.00048103779   2   -1000024    1000024
    0.00023796656   2    1000023    1000023
    0.00019288213   2   -13    13
    0.0001066781   2   -3    3
    7.5284727e-05   2    21    21
    7.2926384e-05   2    25    25
    6.7574739e-05   2    1000022    1000022
    1.8535684e-06   2    23    23
    4.5958534e-07   2   -24    24
    3.6285071e-07   2    22    23
    3.1482215e-07   2   -1000011    1000011
    2.9496487e-07   2   -1    1
    2.7870778e-07   2    22    22
    2.5933286e-07   2   -2000013    2000013
    2.5065961e-07   2   -1000013    1000013
    2.0256025e-07   2   -2000011    2000011
    6.4077245e-08   2   -2000013    1000013
    6.4077245e-08   2   -1000013    2000013
    4.5988205e-08   2   -4    4
    4.3317108e-09   2   -11    11
    1.5870002e-12   2   -2000011    1000011
    1.5870002e-12   2   -1000011    2000011
    3.8401138e-13   2    23    36
    2.3695034e-13   2   -2    2

DECAY 36  61.669949
    0.36329004   2   -5    5
    0.25752386   2   -2000006    1000006
    0.25752386   2   -1000006    2000006
    0.046619544   2   -15    15
    0.015153296   2    1000022    1000025
    0.015068093   2    1000022    1000035
    0.010575543   2   -2000005    1000005
    0.010575543   2   -1000005    2000005
    0.0085735693   2   -6    6
    0.0084661805   2   -1000024    1000024
    0.0041927834   2    1000023    1000023
    0.0020729795   2    1000022    1000023
    0.00018266437   2   -13    13
    0.00010101504   2   -3    3
    6.6323506e-05   2    1000022    1000022
    1.001979e-05   2    21    21
    3.3428437e-06   2    23    25
    7.2588279e-07   2    22    23
    2.7930689e-07   2   -1    1
    1.5362183e-07   2    22    22
    5.9578397e-08   2   -2000013    1000013
    5.9578397e-08   2   -1000013    2000013
    5.6754267e-08   2   -4    4
    4.1022181e-09   2   -11    11
    1.3935446e-12   2   -2000011    1000011
    1.3935446e-12   2   -1000011    2000011
    2.9243794e-13   2   -2    2
    1.3187134e-37   2    25    25

DECAY 37  47.100838
    0.44888772   2   -5    6
    0.38694905   2   -2000005    1000006
    0.059138364   2   -15    16
    0.044461933   2   -1000005    2000006
    0.037420766   2    1000022    1000037
    0.016174839   2   -1000005    1000006
    0.0052358543   2    1000022    1000024
    0.00070987854   2   -2000005    2000006
    0.0006550353   2   -5    4
    0.00020907519   2   -13    14
    0.00012768627   2   -3    4
    1.0509239e-05   2   -3    6
    5.9866088e-06   2   -3    2
    4.6776267e-06   2   -5    2
    4.3861854e-06   2    24    25
    1.5843931e-06   2   -1000011    1000012
    1.4458963e-06   2   -1000013    1000014
    4.7330696e-07   2   -1    6
    3.5415281e-07   2   -1    2
    2.9308571e-07   2   -2000013    1000014
    6.6165874e-08   2    1000023    1000024
    2.0886384e-08   2   -1    4
    4.8902905e-09   2   -11    12
    7.0106611e-12   2   -2000011    1000012
    8.1049185e-13   2    24    36

DECAY 6  2.43
    1   2    5    24

DECAY 15 -1
