BLOCK SPINFO
   1   SPheno
   2   v4.0.5be

BLOCK SPHENOINFO
   1   2
   2   2

BLOCK MODSEL
   1   0

BLOCK MINPAR
   3    41.116123
   4   -1

BLOCK EXTPAR
   0    1658.954
   1   -1950.8113
   2   -1594.6645
   3    3000
   11    3892.8411
   12   -711.08245
   13   -143.6882
   23   -286.69592
   25    40.468403
   26    4726.5578
   31    1865.0269
   32    1865.0269
   33    656.69727
   34    292.20901
   35    292.20901
   36    1898.1202
   41    5000
   42    5000
   43    1638.5253
   44    5000
   45    5000
   46    1754.1889
   47    5000
   48    5000
   49    961.72178

BLOCK SMINPUTS
   1    127.90897
   2    1.1663787e-05
   3    0.1184
   4    91.1876
   5    4.18
   6    173.2
   7    1.777
   8    0
   11    0.00051099893
   12    0
   13    0.10565837
   14    0
   21    0.005
   22    0.0025
   23    0.095
   24    1.27

BLOCK GAUGE Q=  1658.954
   1    0.35536298
   2    0.66519887
   3    1.219778

BLOCK YU Q=  1658.954
   1   1    8.3869316e-06
   2   2    0.0042605612
   3   3    1.0132087

BLOCK YD Q=  1658.954
   1   1    0.00068202361
   2   2    0.012958449
   3   3    0.67635371

BLOCK YE Q=  1658.954
   1   1    0.00011901811
   2   2    0.02460917
   3   3    0.41388576

BLOCK AU Q=  1658.954
   1   1    0
   2   2    0
   3   3    3892.8414

BLOCK AD Q=  1658.954
   1   1    0
   2   2    0
   3   3   -711.08257

BLOCK AE Q=  1658.954
   1   1    0
   2   2    0
   3   3   -143.6882

BLOCK MSOFT Q=  1658.954
   1   -1950.8113
   2   -1594.6645
   3    3000
   21    22209635
   22    2978.6527
   31    1865.0269
   32    1865.0269
   33    656.69727
   34    292.20901
   35    292.20901
   36    1898.1202
   41    5000
   42    5000
   43    1638.5253
   44    5000
   45    5000
   46    1754.1889
   47    5000
   48    5000
   49    961.72178

BLOCK MASS
   6    173.2
   23    91.1876
   24    80.429995
   15    1.777
   25    125.27807
   35    4722.5935
   36    4726.5578
   37    4723.7928
   1000001    5033.8126
   2000001    5024.7222
   1000002    5033.3708
   2000002    5027.5958
   1000003    5033.8181
   2000003    5024.7312
   1000004    5033.376
   2000004    5027.5964
   1000005    1032.2286
   2000005    1657.0539
   1000006    1499.8279
   2000006    1834.9627
   1000011    1879.4724
   2000011    285.58672
   1000012    1877.4167
   1000013    1879.4896
   2000013    285.85623
   1000014    1877.4336
   1000015    702.97085
   2000015    1909.1126
   1000016    699.42726
   1000021    3201.4635
   1000022   -280.94453
   1000023    286.6429
   1000025   -1647.5481
   1000035   -1946.3725
   1000024    283.44975
   1000037    1647.6465

BLOCK ALPHA
      -0.024345713

BLOCK HMIX Q=  1658.954
   1   -286.69592
   2    40.468403
   3    243.87308
   4    22340348

BLOCK STOPMIX
   1   1   -0.75340972
   1   2    0.65755137
   2   1   -0.65755137
   2   2   -0.75340972

BLOCK SBOTMIX
   1   1   -0.018312512
   1   2    0.99983231
   2   1   -0.99983231
   2   2   -0.018312512

BLOCK STAUMIX
   1   1   -0.99997919
   1   2    0.006452107
   2   1   -0.006452107
   2   2   -0.99997919

BLOCK NMIX
   1   1   -0.019535762
   1   2    0.042701519
   1   3    0.71036696
   1   4   -0.70226329
   2   1    0.013943148
   2   2   -0.028845691
   2   3    0.70374797
   2   4    0.70972692
   3   1    0.006968901
   3   2    0.99865496
   3   3   -0.010023453
   3   4    0.050390802
   4   1    0.99968764
   4   2   -0.0057249094
   4   3    0.0041362419
   4   4   -0.023973733

BLOCK UMIX
   1   1   -0.014251467
   1   2   -0.99989844
   2   1   -0.99989844
   2   2    0.014251467

BLOCK VMIX
   1   1    0.071662192
   1   2    0.99742896
   2   1    0.99742896
   2   2   -0.071662192

BLOCK HIGGSBOUNDSINPUTHIGGSCOUPLINGSFERMIONS
       0, 1637.6916,3,36,15,15

BLOCK HIGGSBOUNDSINPUTHIGGSCOUPLINGSBOSONS
       0,4,36,21,21,23

BLOCK SPHENOLOWENERGY
   1    0.00028317092
   2    1.5980358e-06
   3    3.5256997e-05
   4    3.2272915e-15
   5    1.3786444e-10
   6    2.876578e-08
   7    1.1044565e-13
   8    4.7181716e-09
   9    9.9736878e-07
   10    9.6458866e-05
   11    0.99638316
   12    0.54252251
   13    19.385495
   14    0
   15    0
   16    0.0021592614
   17    2.2816784e-15
   18    2.4794409e-11
   19    8.2894386e-11
   20    3.7697715e-15
   21    1.610963e-10
   22    1.0721221e-07
   23    0
   24    0
   25    0
   26    0
   27    0
   28    0
   29    0
   30    0
   31    0
   39    7.6994104e-05
   40    0
   41    0
   42    0

BLOCK FWCOEF Q=  160
   305   4422   0   0   -0.18881911
   305   4422   0   2   -0.14173653
   305   4322   0   2    0.00025410197
   305   6421   0   0   -0.095227835
   305   6421   0   2   -0.075857088
   305   6321   0   2    5.4070646e-05
   3051111   4133   0   0    1.5959251
   3051111   4133   0   2    1.5975561
   3051111   4233   0   2    0.00029610537
   3051111   4137   0   0   -4.4186172
   3051111   4137   0   2   -4.4174576
   3051111   4237   0   2   -0.002289229
   3051313   4133   0   0    1.5959251
   3051313   4133   0   2    1.5975541
   3051313   4233   0   2    0.00029610357
   3051313   4137   0   0   -4.4186172
   3051313   4137   0   2   -4.4174597
   3051313   4237   0   2   -0.0022892325
   3051212   4137   0   0    1.5053501
   3051212   4137   0   2    1.5051027
   3051212   4237   0   2    0.00049846872
   3051414   4137   0   0    1.5053501
   3051414   4137   0   2    1.5051027
   3051414   4237   0   2    0.00049846874
   3051616   4137   0   0    1.5053501
   3051616   4137   0   2    1.5051013
   3051616   4237   0   2    0.00049847347

BLOCK IMFWCOEF Q=  160
   305   4422   0   0    3.8586033e-07
   305   4422   0   2    1.4338582e-05
   305   4322   0   2    5.5823009e-06
   305   6421   0   0    3.3051489e-07
   305   6421   0   2    1.9875605e-05
   305   6321   0   2    2.3620707e-06
   3051111   4133   0   2    4.1256714e-07
   3051111   4233   0   2    5.6366127e-06
   3051111   4137   0   2   -2.0647689e-06
   3051111   4237   0   2   -4.3582161e-05
   3051313   4133   0   2    4.1253272e-07
   3051313   4233   0   2    5.6365821e-06
   3051313   4137   0   2   -2.0647754e-06
   3051313   4237   0   2   -4.3582226e-05
   3051212   4137   0   2    5.3138971e-07
   3051212   4237   0   2    9.4898028e-06
   3051414   4137   0   2    5.3138889e-07
   3051414   4237   0   2    9.4898028e-06
   3051616   4137   0   2    5.0788926e-07
   3051616   4237   0   2    9.4898182e-06

DECAY 23  2.4952


DECAY 24  2.085


DECAY 2000011  5.694967e-07
    0.99996859   2    1000022    11

DECAY 1000011  1.3471213
    0.65795253   2   -1000037    12
    0.33087215   2    1000025    11
    0.0061106019   2    1000022    11
    0.0026824097   2    1000023    11
    0.0023823064   2   -1000024    12

DECAY 2000013  3.6692034e-06
    0.73619817   2    1000022    13
    0.26380183   2   -1000024    14

DECAY 1000013  1.3691715
    0.64744058   2   -1000037    14
    0.32558577   2    1000025    13
    0.01398938   2    1000022    13
    0.01045335   2    1000023    13
    0.0023439632   2   -1000024    14
    0.00018695779   2    2000013    25

DECAY 1000015  1.6834207
    0.50908468   2    1000022    15
    0.49005529   2    1000023    15
    0.00086002655   2   -1000024    16

DECAY 2000015  12.696039
    0.48984467   2   -1000024    16
    0.24752366   2    1000022    15
    0.24280339   2    1000023    15
    0.009993351   2    1000016   -24
    0.0049612011   2    1000015    23
    0.0048410073   2    1000015    25

DECAY 1000012  1.4142574
    0.61391437   2    1000037    11
    0.30566692   2    1000025    12
    0.05730863   2    1000024    11
    0.015767863   2    1000022    12
    0.0073422205   2    1000023    12

DECAY 1000014  1.4360212
    0.60468867   2    1000037    13
    0.30107325   2    1000025    14
    0.07147802   2    1000024    13
    0.015529044   2    1000022    14
    0.0072310157   2    1000023    14

DECAY 1000016  1.6946447
    0.99473552   2    1000024    15
    0.0036078022   2    1000022    16
    0.0016566791   2    1000023    16

DECAY 2000001  141.99161
    0.98572366   2    1000021    1
    0.014263617   2    1000035    1

DECAY 1000001  194.42063
    0.7247692   2    1000021    1
    0.18166473   2   -1000037    2
    0.090384131   2    1000025    1
    0.0027830531   2    1000035    1
    0.00024164511   2    1000022    1
    0.00011124465   2    1000023    1

DECAY 2000003  142.02582
    0.98549284   2    1000021    3
    0.014260226   2    1000035    3
    0.00011741538   2   -1000024    4

DECAY 1000003  194.43975
    0.72470085   2    1000021    3
    0.18164719   2   -1000037    4
    0.090375392   2    1000025    3
    0.0027827854   2    1000035    3
    0.00028487399   2    1000022    3
    0.00015367135   2    1000023    3

DECAY 1000005  15.501506
    0.48198315   2   -1000024    6
    0.26271023   2    1000022    5
    0.25530662   2    1000023    5

DECAY 2000005  52.024677
    0.595699   2   -1000024    6
    0.13801043   2    1000022    5
    0.13539139   2    1000023    5
    0.12639997   2    1000006   -24
    0.0022737481   2    1000005    25
    0.0022094227   2    1000005    23

DECAY 2000002  148.37938
    0.94530223   2    1000021    2
    0.054651528   2    1000035    2

DECAY 1000002  194.41349
    0.72455938   2    1000021    2
    0.18075167   2    1000037    1
    0.090826051   2    1000025    2
    0.0024467356   2    1000035    2
    0.0011632573   2    1000024    1
    0.00017422111   2    1000022    2

DECAY 2000004  148.38298
    0.94527927   2    1000021    4
    0.054650196   2    1000035    4

DECAY 1000004  194.4325
    0.72449096   2    1000021    4
    0.18073428   2    1000037    3
    0.090817289   2    1000025    4
    0.0024465055   2    1000035    4
    0.0012488206   2    1000024    3
    0.00017878786   2    1000022    4

DECAY 1000006  50.64641
    0.41053399   2    1000024    5
    0.29421062   2    1000023    6
    0.29192616   2    1000022    6
    0.002029183   3    1000022    24    5
    0.0012008039   2    1000005    24

DECAY 2000006  84.252897
    0.30187993   2    1000024    5
    0.19927911   2    1000006    23
    0.19819238   2    1000023    6
    0.19234811   2    1000022    6
    0.096061155   2    2000005    24
    0.005444334   2    1000006    25
    0.003922325   2    1000037    5
    0.0022732919   2    1000005    24
    0.00059935575   2    1000025    6

DECAY 1000024  2.7127553e-10
    0.50950296   3    1000022   -1    2
    0.16983977   3    1000022   -11    12
    0.16907749   3    1000022   -13    14
    0.1413444   3    1000022   -3    4
    0.010235393   3    1000022   -15    16

DECAY 1000037  25.122938
    0.19306962   2   -1000015    16
    0.19301422   2    1000016   -15
    0.14821168   2    1000023    24
    0.14682062   2    1000024    23
    0.14562043   2    1000022    24
    0.14393669   2    1000024    25
    0.011738657   2    1000006   -5
    0.0071202379   3    1000024    6   -6
    0.0051335657   3    1000023   -5    6
    0.0050352952   3    1000022   -5    6
    0.0002922738   3    1000024    5   -5

DECAY 1000022 -1


DECAY 1000023  1.2459269e-07
    0.26006427   2    2000013   -13
    0.26006427   2   -2000013    13
    0.22897354   2    1000022    22
    0.060808524   2    2000011   -11
    0.060808524   2   -2000011    11
    0.033114699   3    1000022    12   -12
    0.024761952   3    1000022    1   -1
    0.024681908   3    1000022    3   -3
    0.019312105   3    1000022    2   -2
    0.0097100989   3    1000022    4   -4
    0.005588058   3    1000022    11   -11
    0.0055596778   3    1000022    13   -13
    0.0012362936   3    1000024    1   -2
    0.0012362936   3   -1000024   -1    2
    0.0011135377   3    1000022    15   -15
    0.00057426288   3    1000024    3   -4
    0.00057426288   3   -1000024   -3    4
    0.00041209954   3    1000024    11   -12
    0.00041209954   3   -1000024   -11    12
    0.00040985785   3    1000024    13   -14
    0.00040985785   3   -1000024   -13    14

DECAY 1000025  26.008351
    0.14435395   2    1000024   -24
    0.14435395   2   -1000024    24
    0.098128198   2    1000023    23
    0.093712616   2    1000015   -15
    0.093712616   2   -1000015    15
    0.093293042   2    1000022    25
    0.092742182   2    1000016   -16
    0.092742182   2   -1000016    16
    0.087025781   2    1000023    25
    0.042922265   2    1000022    23
    0.00440948   3    1000024    5   -6
    0.00440948   3   -1000024   -5    6
    0.0036040263   3    1000023    6   -6
    0.0035708425   3    1000022    6   -6
    0.00048491624   3    1000022    5   -5
    0.00047447695   3    1000023    5   -5

DECAY 1000035  31.087218
    0.1505023   2    2000011   -11
    0.1505023   2   -2000011    11
    0.15048981   2    2000013   -13
    0.15048981   2   -2000013    13
    0.042435941   2    1000024   -24
    0.042435941   2   -1000024    24
    0.030447636   2    1000016   -16
    0.030447636   2   -1000016    16
    0.030058055   2    1000023    23
    0.029085032   2    1000015   -15
    0.029085032   2   -1000015    15
    0.027047231   2    1000005   -5
    0.027047231   2   -1000005    5
    0.026262303   2    1000022    25
    0.024480816   2    1000023    25
    0.017383721   2    1000006   -6
    0.017383721   2   -1000006    6
    0.014659982   2    1000022    23
    0.0015081584   3    1000024    5   -6
    0.0015081584   3   -1000024   -5    6
    0.001064823   2    2000005   -5
    0.001064823   2   -2000005    5
    0.00084688257   3    1000022    6   -6
    0.00084675129   3    1000023    6   -6
    0.00032816378   2    1000037   -24
    0.00032816378   2   -1000037    24
    0.00031723233   2    1000025    25
    0.0002257926   2    2000015   -15
    0.0002257926   2   -2000015    15
    0.00019447942   2    1000012   -12
    0.00019447942   2   -1000012    12
    0.0001943861   2    1000014   -14
    0.0001943861   2   -1000014    14
    0.00017556148   2    1000011   -11
    0.00017556148   2   -1000011    11
    0.00017547274   2    1000013   -13
    0.00017547274   2   -1000013    13

DECAY 1000021  243.88996
    0.15599835   2    1000005   -5
    0.15599835   2   -1000005    5
    0.13426336   2    1000006   -6
    0.13426336   2   -1000006    6
    0.10411114   2    2000005   -5
    0.10411114   2   -2000005    5
    0.073352871   2    2000006   -6
    0.073352871   2   -2000006    6
    0.032086951   2    1000006   -4
    0.032086951   2   -1000006    4
    0.0001152582   3    1000037    5   -6
    0.0001152582   3   -1000037   -5    6

DECAY 25  0.0039062934
    0.56826586   2   -5    5
    0.23362358   2   -24    24
    0.071759096   2    21    21
    0.065446509   2   -15    15
    0.028436896   2    23    23
    0.028152773   2   -4    4
    0.0023467172   2    22    22
    0.0015272635   2    22    23
    0.00022704116   2   -13    13
    0.00021351924   2   -3    3
    5.9035837e-07   2   -1    1
    1.4507698e-07   2   -2    2
    5.1041343e-09   2   -11    11

DECAY 35  190.84641
    0.63776348   2   -5    5
    0.092259426   2   -15    15
    0.078390315   2   -1000024    1000037
    0.078390315   2   -1000037    1000024
    0.042439446   2    1000023    1000025
    0.035600389   2    1000022    1000025
    0.011114722   2    1000023    1000035
    0.0090709353   2    1000022    1000035
    0.0052333755   2   -2000005    1000005
    0.0052333755   2   -1000005    2000005
    0.0010660938   2   -1000024    1000024
    0.00098193888   2   -1000006    1000006
    0.00069685265   2   -2000006    2000006
    0.00068539233   2   -6    6
    0.00030799733   2   -13    13
    0.00027801012   2    1000022    1000022
    0.00017315398   2   -3    3
    0.00013840811   2    1000023    1000023
    3.4535533e-05   2   -2000015    1000015
    3.4535533e-05   2   -1000015    2000015
    2.2854659e-05   2   -2000006    1000006
    2.2854659e-05   2   -1000006    2000006
    1.8593521e-05   2    1000022    1000023
    1.3867385e-05   2   -1000037    1000037
    1.0755108e-05   2   -1000005    1000005
    6.8494429e-06   2    1000025    1000025
    4.9352278e-06   2   -2000005    2000005
    3.5730727e-06   2    21    21
    2.0064319e-06   2    1000025    1000035
    4.7868725e-07   2   -1    1
    1.4013128e-07   2    25    25
    1.175506e-07   2    1000035    1000035
    5.9696578e-08   2    23    23
    1.1333294e-08   2   -1000011    1000011
    1.1215407e-08   2   -1000013    1000013
    1.0829261e-08   2   -1000015    1000015
    1.0821919e-08   2   -2000011    2000011
    1.0735604e-08   2   -2000013    2000013
    1.0481413e-08   2   -24    24
    8.4235993e-09   2   -4    4
    6.9163396e-09   2   -11    11
    5.2308713e-09   2    22    23
    1.4517089e-09   2    22    22
    8.6347136e-10   2   -2000015    2000015
    2.7070511e-10   2   -2000013    1000013
    2.7070511e-10   2   -1000013    2000013
    4.3416407e-14   2   -2    2
    6.331824e-15   2   -2000011    1000011
    6.331824e-15   2   -1000011    2000011

DECAY 36  177.33732
    0.61961412   2   -5    5
    0.089629231   2   -15    15
    0.084435018   2   -1000024    1000037
    0.084435018   2   -1000037    1000024
    0.046306931   2    1000022    1000025
    0.037755643   2    1000023    1000025
    0.012138536   2    1000022    1000035
    0.0096113371   2    1000023    1000035
    0.0056375662   2   -2000005    1000005
    0.0056375662   2   -1000005    2000005
    0.0011885101   2   -1000024    1000024
    0.00092888092   2   -2000006    1000006
    0.00092888092   2   -1000006    2000006
    0.00064412841   2   -6    6
    0.00033455264   2    1000022    1000022
    0.00029921083   2   -13    13
    0.00016819819   2   -3    3
    0.00013720174   2    1000023    1000023
    4.4782136e-05   2   -1000037    1000037
    3.7150727e-05   2   -2000015    1000015
    3.7150727e-05   2   -1000015    2000015
    2.2086969e-05   2    1000025    1000025
    1.1719028e-05   2    1000022    1000023
    8.3217846e-06   2    1000025    1000035
    6.84565e-06   2    21    21
    7.1129155e-07   2    1000035    1000035
    4.6498706e-07   2   -1    1
    1.65471e-07   2    23    25
    2.9405496e-08   2    22    23
    2.271505e-08   2    22    22
    7.8524529e-09   2   -4    4
    6.7191093e-09   2   -11    11
    2.9078937e-10   2   -2000013    1000013
    2.9078937e-10   2   -1000013    2000013
    6.0676722e-12   2    23    35
    4.0473131e-14   2   -2    2
    6.8015934e-15   2   -2000011    1000011
    6.8015934e-15   2   -1000011    2000011
    1.1354854e-38   2    25    25

DECAY 37  191.40053
    0.64713343   2   -5    6
    0.083438675   2   -15    16
    0.079337776   2    1000022    1000037
    0.078954499   2    1000024    1000025
    0.077875425   2    1000023    1000037
    0.019368046   2    1000024    1000035
    0.0087565362   2   -1000005    1000006
    0.0023968396   2   -1000005    2000006
    0.00095999933   2   -5    4
    0.000644424   2   -2000005    2000006
    0.00041130402   2   -2000005    1000006
    0.00029498538   2   -13    14
    0.0001583873   2   -3    4
    0.00013854648   2    1000023    1000024
    6.8908726e-05   2   -2000015    1000016
    3.656263e-05   2    1000022    1000024
    9.5709384e-06   2    1000035    1000037
    7.4552325e-06   2   -3    2
    6.8553846e-06   2   -5    2
    1.0205817e-06   2   -3    6
    4.3935122e-07   2   -1    2
    1.5308173e-07   2    24    25
    4.2420615e-08   2   -2000011    1000012
    4.2299729e-08   2   -2000013    1000014
    3.5956218e-08   2   -1    6
    2.0947714e-08   2   -1    4
    8.5124408e-09   2   -1000015    1000016
    6.8997388e-09   2   -11    12
    6.1245826e-10   2    1000025    1000037
    5.3513676e-10   2   -1000013    1000014
    1.7655661e-14   2    24    35
    1.2516766e-14   2   -1000011    1000012

DECAY 6  2.43
    1   2    5    24

DECAY 15 -1
