#
#                              ======================
#                              | THE SUSYHIT OUTPUT |
#                              ======================
#
#
#              ------------------------------------------------------
#              |     This is the output of the SUSY-HIT package     |
#              |  created by A.Djouadi, M.Muehlleitner and M.Spira. |
#              |  In case of problems with SUSY-HIT email to        |
#              |           margarete.muehlleitner@cern.ch           |
#              |           michael.spira@psi.ch                     |
#              |           abdelhak.djouadi@cern.ch                 |
#              ------------------------------------------------------
#
#              ------------------------------------------------------
#              |  SUSY Les Houches Accord - MSSM Spectrum + Decays  |
#              |              based on the decay programs           |
#              |                                                    |
#              |                     SDECAY 1.3b                    |
#              |                                                    |
#              |  Authors: M.Muhlleitner, A.Djouadi and Y.Mambrini  |
#              |  Ref.:    Comput.Phys.Commun.168(2005)46           |
#              |           [hep-ph/0311167]                         |
#              |                                                    |
#              |                     HDECAY 3.4                     |
#              |                                                    |
#              |  By: A.Djouadi,J.Kalinowski,M.Muhlleitner,M.Spira  |
#              |  Ref.:    Comput.Phys.Commun.108(1998)56           |
#              |           [hep-ph/9704448]                         |
#              |                                                    |
#              |                                                    |
#              |  If not stated otherwise all DRbar couplings and   |
#              |  soft SUSY breaking masses are given at the scale  |
#              |  Q=  0.36226030E+04
#              |                                                    |
#              ------------------------------------------------------
#
#
BLOCK DCINFO  # Decay Program information
     1   SDECAY/HDECAY # decay calculator
     2   1.3b  /3.4    # version number
#
BLOCK SPINFO  # Spectrum calculator information
     1     SOFTSUSY    # spectrum calculator               
     2     3.4.0       # version number                    
#
BLOCK MODSEL  # Model selection
     1     0   #  nonUniversal                                     
#
BLOCK SMINPUTS  # Standard Model inputs
         1     1.27908970E+02   # alpha_em^-1(M_Z)^MSbar
         2     1.16637870E-05   # G_F [GeV^-2]
         3     1.18400000E-01   # alpha_S(M_Z)^MSbar
         4     9.11876000E+01   # M_Z pole mass
         5     4.18000000E+00   # mb(mb)^MSbar
         6     1.73200000E+02   # mt pole mass
         7     1.77700000E+00   # mtau pole mass
#
BLOCK MINPAR  # Input parameters - minimal models
         3     5.03700000E+01   # tanb                
#
BLOCK EXTPAR  # Input parameters - non-minimal models
         0    -1.00000000E+00   # Set                 
         1    -1.83940000E+02   # M_1(MX)             
         2    -1.72129000E+03   # M_2(MX)             
         3     1.53927000E+03   # M_3(MX)             
        11     2.19545000E+03   # At(MX)              
        12    -2.69477000E+03   # Ab(MX)              
        13    -5.62730000E+02   # Atau(MX)            
        23     3.65300000E+02   # mu(MX)              
        26     1.28431000E+03   # mA(pole)            
        31     1.90056000E+03   # meL(MX)             
        32     1.90056000E+03   # mmuL(MX)            
        33     2.31400000E+02   # mtauL(MX)           
        34     3.62949000E+03   # meR(MX)             
        35     3.62949000E+03   # mmuR(MX)            
        36     2.40720000E+02   # mtauR(MX)           
        41     2.58013000E+03   # mqL1(MX)            
        42     2.58013000E+03   # mqL2(MX)            
        43     3.38311000E+03   # mqL3(MX)            
        44     3.59809000E+03   # muR(MX)             
        45     3.59809000E+03   # mcR(MX)             
        46     3.87480000E+03   # mtR(MX)             
        47     3.24248000E+03   # mdR(MX)             
        48     3.24248000E+03   # msR(MX)             
        49     2.88843000E+03   # mbR(MX)             
#
BLOCK MASS  # Mass Spectrum
# PDG code           mass       particle
        24     8.03853940E+01   # W+
        25     1.24102126E+02   # h
        35     1.28431606E+03   # H
        36     1.28430989E+03   # A
        37     1.28690104E+03   # H+
         5     4.81876030E+00   # b-quark pole mass calculated from mb(mb)_Msbar
   1000001     2.64963353E+03   # ~d_L
   2000001     3.29036348E+03   # ~d_R
   1000002     2.64858672E+03   # ~u_L
   2000002     3.64520561E+03   # ~u_R
   1000003     2.64963353E+03   # ~s_L
   2000003     3.29036348E+03   # ~s_R
   1000004     2.64858672E+03   # ~c_L
   2000004     3.64520561E+03   # ~c_R
   1000005     2.90107074E+03   # ~b_1
   2000005     3.39370840E+03   # ~b_2
   1000006     3.39234417E+03   # ~t_1
   2000006     3.86900079E+03   # ~t_2
   1000011     1.92169183E+03   # ~e_L
   2000011     3.63257925E+03   # ~e_R
   1000012     1.91974146E+03   # ~nu_eL
   1000013     1.92169183E+03   # ~mu_L
   2000013     3.63257925E+03   # ~mu_R
   1000014     1.91974146E+03   # ~nu_muL
   1000015     1.87079586E+02   # ~tau_1
   2000015     3.49077896E+02   # ~tau_2
   1000016     3.19651121E+02   # ~nu_tauL
   1000021     1.78987750E+03   # ~g
   1000022    -1.78055872E+02   # ~chi_10
   1000023    -3.85127271E+02   # ~chi_20
   1000025     3.86058485E+02   # ~chi_30
   1000035    -1.74890070E+03   # ~chi_40
   1000024     3.82387708E+02   # ~chi_1+
   1000037     1.74906879E+03   # ~chi_2+
#
BLOCK NMIX  # Neutralino Mixing Matrix
  1  1     9.87358843E-01   # N_11
  1  2    -3.08103003E-03   # N_12
  1  3     1.44417335E-01   # N_13
  1  4     6.52430456E-02   # N_14
  2  1    -1.48311550E-01   # N_21
  2  2    -4.00522381E-02   # N_22
  2  3     6.96456823E-01   # N_23
  2  4     7.00961765E-01   # N_24
  3  1     5.58946443E-02   # N_31
  3  2    -2.66592851E-02   # N_32
  3  3    -7.02850703E-01   # N_33
  3  4     7.08636691E-01   # N_34
  4  1    -1.40965527E-03   # N_41
  4  2     9.98837128E-01   # N_42
  4  3     9.61329040E-03   # N_43
  4  4     4.72227649E-02   # N_44
#
BLOCK UMIX  # Chargino Mixing Matrix U
  1  1    -1.33100384E-02   # U_11
  1  2     9.99911418E-01   # U_12
  2  1    -9.99911418E-01   # U_21
  2  2    -1.33100384E-02   # U_22
#
BLOCK VMIX  # Chargino Mixing Matrix V
  1  1     6.67097213E-02   # V_11
  1  2     9.97772425E-01   # V_12
  2  1     9.97772425E-01   # V_21
  2  2    -6.67097213E-02   # V_22
#
BLOCK STOPMIX  # Stop Mixing Matrix
  1  1     9.96540761E-01   # cos(theta_t)
  1  2    -8.31054250E-02   # sin(theta_t)
  2  1     8.31054250E-02   # -sin(theta_t)
  2  2     9.96540761E-01   # cos(theta_t)
#
BLOCK SBOTMIX  # Sbottom Mixing Matrix
  1  1     1.48826369E-02   # cos(theta_b)
  1  2     9.99889247E-01   # sin(theta_b)
  2  1    -9.99889247E-01   # -sin(theta_b)
  2  2     1.48826369E-02   # cos(theta_b)
#
BLOCK STAUMIX  # Stau Mixing Matrix
  1  1     3.89598399E-01   # cos(theta_tau)
  1  2     9.20984847E-01   # sin(theta_tau)
  2  1    -9.20984847E-01   # -sin(theta_tau)
  2  2     3.89598399E-01   # cos(theta_tau)
#
BLOCK ALPHA  # Higgs mixing
          -2.04857033E-02   # Mixing angle in the neutral Higgs boson sector
#
BLOCK HMIX Q=  3.62260300E+03  # DRbar Higgs Parameters
         1     3.75071381E+02   # mu(Q)MSSM           
         2     4.95521788E+01   # tan                 
         3     2.41981505E+02   # higgs               
         4     8.43882002E+05   # mA^2(Q)MSSM         
#
BLOCK GAUGE Q=  3.62260300E+03  # The gauge couplings
     1     3.65964694E-01   # gprime(Q) DRbar
     2     6.39416245E-01   # g(Q) DRbar
     3     1.01494213E+00   # g3(Q) DRbar
#
BLOCK AU Q=  3.62260300E+03  # The trilinear couplings
  1  1     0.00000000E+00   # A_u(Q) DRbar
  2  2     0.00000000E+00   # A_c(Q) DRbar
  3  3     2.19545001E+03   # A_t(Q) DRbar
#
BLOCK AD Q=  3.62260300E+03  # The trilinear couplings
  1  1     0.00000000E+00   # A_d(Q) DRbar
  2  2     0.00000000E+00   # A_s(Q) DRbar
  3  3    -2.69476999E+03   # A_b(Q) DRbar
#
BLOCK AE Q=  3.62260300E+03  # The trilinear couplings
  1  1     0.00000000E+00   # A_e(Q) DRbar
  2  2     0.00000000E+00   # A_mu(Q) DRbar
  3  3    -5.62729995E+02   # A_tau(Q) DRbar
#
BLOCK Yu Q=  3.62260300E+03  # The Yukawa couplings
  1  1     0.00000000E+00   # y_u(Q) DRbar
  2  2     0.00000000E+00   # y_c(Q) DRbar
  3  3     8.25049943E-01   # y_t(Q) DRbar
#
BLOCK Yd Q=  3.62260300E+03  # The Yukawa couplings
  1  1     0.00000000E+00   # y_d(Q) DRbar
  2  2     0.00000000E+00   # y_s(Q) DRbar
  3  3     6.21930185E-01   # y_b(Q) DRbar
#
BLOCK Ye Q=  3.62260300E+03  # The Yukawa couplings
  1  1     0.00000000E+00   # y_e(Q) DRbar
  2  2     0.00000000E+00   # y_mu(Q) DRbar
  3  3     4.67624957E-01   # y_tau(Q) DRbar
#
BLOCK MSOFT Q=  3.62260300E+03  # The soft SUSY breaking masses at the scale Q
         1    -1.83940000E+02   # M_1(Q)              
         2    -1.72129000E+03   # M_2(Q)              
         3     1.53927000E+03   # M_3(Q)              
        21     1.64597751E+06   # mH1^2(Q)            
        22     1.35972794E+05   # mH2^2(Q)            
        31     1.90056000E+03   # meL(Q)              
        32     1.90056000E+03   # mmuL(Q)             
        33     2.31399998E+02   # mtauL(Q)            
        34     3.62949000E+03   # meR(Q)              
        35     3.62949000E+03   # mmuR(Q)             
        36     2.40719995E+02   # mtauR(Q)            
        41     2.58013000E+03   # mqL1(Q)             
        42     2.58013000E+03   # mqL2(Q)             
        43     3.38310999E+03   # mqL3(Q)             
        44     3.59809000E+03   # muR(Q)              
        45     3.59809000E+03   # mcR(Q)              
        46     3.87480000E+03   # mtR(Q)              
        47     3.24248000E+03   # mdR(Q)              
        48     3.24248000E+03   # msR(Q)              
        49     2.88842999E+03   # mbR(Q)              
#
Block HiggsBoundsInputHiggsCouplingsFermions
# ScalarNormEffCoupSq PseudoSNormEffCoupSq NP   IP1 IP2 IP2
    1.03072628E+00    0.00000000E+00        3  25   5   5  # h0-b-b eff. coupling^2, normalised to SM
    2.45538770E+03    0.00000000E+00        3  35   5   5  # H0-b-b eff. coupling^2, normalised to SM
    0.00000000E+00    2.45541842E+03        3  36   5   5  # A0-b-b eff. coupling^2, normalised to SM
#
    9.99987486E-01    0.00000000E+00        3  25   6   6  # h0-t-t eff. coupling^2, normalised to SM
    4.19776227E-04    0.00000000E+00        3  35   6   6  # H0-t-t eff. coupling^2, normalised to SM
    0.00000000E+00    4.07262563E-04        3  36   6   6  # A0-t-t eff. coupling^2, normalised to SM
#
    1.03072628E+00    0.00000000E+00        3  25  15  15  # h0-tau-tau eff. coupling^2, normalised to SM
    2.45538770E+03    0.00000000E+00        3  35  15  15  # H0-tau-tau eff. coupling^2, normalised to SM
    0.00000000E+00    2.45541842E+03        3  36  15  15  # A0-tau-tau eff. coupling^2, normalised to SM
#
Block HiggsBoundsInputHiggsCouplingsBosons
    9.99999905E-01        3  25  24  24  # h0-W-W eff. coupling^2, normalised to SM
    9.46761620E-08        3  35  24  24  # H0-W-W eff. coupling^2, normalised to SM
    0.00000000E+00        3  36  24  24  # A0-W-W eff. coupling^2, normalised to SM
#
    9.99999905E-01        3  25  23  23  # h0-Z-Z eff. coupling^2, normalised to SM
    9.46761620E-08        3  35  23  23  # H0-Z-Z eff. coupling^2, normalised to SM
    0.00000000E+00        3  36  23  23  # A0-Z-Z eff. coupling^2, normalised to SM
#
    8.88878321E-01        3  25  21  21  # h0-g-g eff. coupling^2, normalised to SM
    1.06286479E-06        3  35  21  21  # H0-g-g eff. coupling^2, normalised to SM
    1.96704033E-06        3  36  21  21  # A0-g-g eff. coupling^2, normalised to SM
#
    0.00000000E+00        3  25  25  23  # h0-h0-Z eff. coupling^2, normalised to SM
    0.00000000E+00        3  35  25  23  # H0-h0-Z eff. coupling^2, normalised to SM
    9.46761620E-08        3  36  25  23  # A0-h0-Z eff. coupling^2, normalised to SM
    0.00000000E+00        3  35  35  23  # H0-H0-Z eff. coupling^2, normalised to SM
    9.99999905E-01        3  36  35  23  # A0-H0-Z eff. coupling^2, normalised to SM
    0.00000000E+00        3  36  36  23  # A0-A0-Z eff. coupling^2, normalised to SM
#
    0.00000000E+00        4  25  21  21  23  # h0-g-g-Z eff. coupling^2, normalised to SM
    0.00000000E+00        4  35  21  21  23  # H0-g-g-Z eff. coupling^2, normalised to SM
    0.00000000E+00        4  36  21  21  23  # A0-g-g-Z eff. coupling^2, normalised to SM
#
#
#
#                             =================
#                             |The decay table|
#                             =================
#
# - The QCD corrections to the decays gluino -> squark  + quark
#                                     squark -> gaugino + quark_prime
#                                     squark -> squark_prime + Higgs
#                                     squark -> gluino  + quark
#   are included.
#
# - The multi-body decays for the inos, stops and sbottoms are included.
#
# - The loop induced decays for the gluino, neutralinos and stops
#   are included.
#
# - The SUSY decays of the top quark are included.
#
#
#         PDG            Width
DECAY         6     1.44012178E+00   # top decays
#          BR         NDA      ID1       ID2
     1.00000000E+00    2           5        24   # BR(t ->  b    W+)
#
#         PDG            Width
DECAY   1000021     9.47564044E-03   # gluino decays
#          BR         NDA      ID1       ID2
     1.63979003E-04    2     1000022        21   # BR(~g -> ~chi_10 g)
     4.30539323E-03    2     1000023        21   # BR(~g -> ~chi_20 g)
     2.94768989E-03    2     1000025        21   # BR(~g -> ~chi_30 g)
     2.40696174E-09    2     1000035        21   # BR(~g -> ~chi_40 g)
#           BR         NDA      ID1       ID2       ID3
     9.27041565E-03    3     1000022         1        -1   # BR(~g -> ~chi_10 d  db)
     8.99204818E-05    3     1000023         1        -1   # BR(~g -> ~chi_20 d  db)
     1.98304222E-04    3     1000025         1        -1   # BR(~g -> ~chi_30 d  db)
     1.10002218E-08    3     1000035         1        -1   # BR(~g -> ~chi_40 d  db)
     1.70035636E-02    3     1000022         2        -2   # BR(~g -> ~chi_10 u  ub)
     5.42660535E-04    3     1000023         2        -2   # BR(~g -> ~chi_20 u  ub)
     8.37956672E-05    3     1000025         2        -2   # BR(~g -> ~chi_30 u  ub)
     1.10197956E-08    3     1000035         2        -2   # BR(~g -> ~chi_40 u  ub)
     9.27041565E-03    3     1000022         3        -3   # BR(~g -> ~chi_10 s  sb)
     8.99204818E-05    3     1000023         3        -3   # BR(~g -> ~chi_20 s  sb)
     1.98304222E-04    3     1000025         3        -3   # BR(~g -> ~chi_30 s  sb)
     1.10002218E-08    3     1000035         3        -3   # BR(~g -> ~chi_40 s  sb)
     1.70035636E-02    3     1000022         4        -4   # BR(~g -> ~chi_10 c  cb)
     5.42660535E-04    3     1000023         4        -4   # BR(~g -> ~chi_20 c  cb)
     8.37956672E-05    3     1000025         4        -4   # BR(~g -> ~chi_30 c  cb)
     1.10197956E-08    3     1000035         4        -4   # BR(~g -> ~chi_40 c  cb)
     1.77265051E-02    3     1000022         5        -5   # BR(~g -> ~chi_10 b  bb)
     1.26090764E-01    3     1000023         5        -5   # BR(~g -> ~chi_20 b  bb)
     1.28178360E-01    3     1000025         5        -5   # BR(~g -> ~chi_30 b  bb)
     2.21472743E-09    3     1000035         5        -5   # BR(~g -> ~chi_40 b  bb)
     1.23476006E-02    3     1000022         6        -6   # BR(~g -> ~chi_10 t  tb)
     9.16889686E-02    3     1000023         6        -6   # BR(~g -> ~chi_20 t  tb)
     1.02519126E-01    3     1000025         6        -6   # BR(~g -> ~chi_30 t  tb)
     4.20788527E-04    3     1000024         1        -2   # BR(~g -> ~chi_1+ d  ub)
     4.20788527E-04    3    -1000024         2        -1   # BR(~g -> ~chi_1- u  db)
     2.15785378E-08    3     1000037         1        -2   # BR(~g -> ~chi_2+ d  ub)
     2.15785378E-08    3    -1000037         2        -1   # BR(~g -> ~chi_2- u  db)
     4.20788527E-04    3     1000024         3        -4   # BR(~g -> ~chi_1+ s  cb)
     4.20788527E-04    3    -1000024         4        -3   # BR(~g -> ~chi_1- c  sb)
     2.15785378E-08    3     1000037         3        -4   # BR(~g -> ~chi_2+ s  cb)
     2.15785378E-08    3    -1000037         4        -3   # BR(~g -> ~chi_2- c  sb)
     2.28985502E-01    3     1000024         5        -6   # BR(~g -> ~chi_1+ b  tb)
     2.28985502E-01    3    -1000024         6        -5   # BR(~g -> ~chi_1- t  bb)
#
#         PDG            Width
DECAY   1000006     1.87581426E+02   # stop1 decays
#          BR         NDA      ID1       ID2
     4.63747858E-03    2     1000022         6   # BR(~t_1 -> ~chi_10 t )
     1.15915283E-01    2     1000023         6   # BR(~t_1 -> ~chi_20 t )
     1.20361222E-01    2     1000025         6   # BR(~t_1 -> ~chi_30 t )
     3.90926328E-02    2     1000035         6   # BR(~t_1 -> ~chi_40 t )
     1.39018118E-01    2     1000024         5   # BR(~t_1 -> ~chi_1+ b )
     7.72722433E-02    2     1000037         5   # BR(~t_1 -> ~chi_2+ b )
     5.03166710E-01    2     1000021         6   # BR(~t_1 -> ~g      t )
     5.36311312E-04    2     1000005        24   # BR(~t_1 -> ~b_1    W+)
#
#         PDG            Width
DECAY   2000006     2.48480380E+02   # stop2 decays
#          BR         NDA      ID1       ID2
     3.55585922E-02    2     1000022         6   # BR(~t_2 -> ~chi_10 t )
     1.02834151E-01    2     1000023         6   # BR(~t_2 -> ~chi_20 t )
     1.02607242E-01    2     1000025         6   # BR(~t_2 -> ~chi_30 t )
     1.14423861E-03    2     1000035         6   # BR(~t_2 -> ~chi_40 t )
     2.03461867E-01    2     1000024         5   # BR(~t_2 -> ~chi_1+ b )
     2.28171320E-03    2     1000037         5   # BR(~t_2 -> ~chi_2+ b )
     5.26833774E-01    2     1000021         6   # BR(~t_2 -> ~g      t )
     7.30440709E-03    2     1000006        25   # BR(~t_2 -> ~t_1    h )
     6.06543396E-03    2     1000006        23   # BR(~t_2 -> ~t_1    Z )
     1.86274915E-05    2     1000005        24   # BR(~t_2 -> ~b_1    W+)
     1.18899527E-02    2     2000005        24   # BR(~t_2 -> ~b_2    W+)
#
#         PDG            Width
DECAY   1000005     1.05472557E+02   # sbottom1 decays
#          BR         NDA      ID1       ID2
     2.05124022E-02    2     1000022         5   # BR(~b_1 -> ~chi_10 b )
     9.92810045E-02    2     1000023         5   # BR(~b_1 -> ~chi_20 b )
     1.00754902E-01    2     1000025         5   # BR(~b_1 -> ~chi_30 b )
     1.28443409E-07    2     1000035         5   # BR(~b_1 -> ~chi_40 b )
     2.02812053E-01    2    -1000024         6   # BR(~b_1 -> ~chi_1- t )
     5.30384471E-07    2    -1000037         6   # BR(~b_1 -> ~chi_2- t )
     5.76638979E-01    2     1000021         5   # BR(~b_1 -> ~g      b )
#
#         PDG            Width
DECAY   2000005     1.89527828E+02   # sbottom2 decays
#          BR         NDA      ID1       ID2
     5.27166343E-03    2     1000022         5   # BR(~b_2 -> ~chi_10 b )
     6.52247298E-02    2     1000023         5   # BR(~b_2 -> ~chi_20 b )
     6.65380222E-02    2     1000025         5   # BR(~b_2 -> ~chi_30 b )
     3.92207835E-02    2     1000035         5   # BR(~b_2 -> ~chi_40 b )
     2.34016455E-01    2    -1000024         6   # BR(~b_2 -> ~chi_1- t )
     7.93283188E-02    2    -1000037         6   # BR(~b_2 -> ~chi_2- t )
     5.09838297E-01    2     1000021         5   # BR(~b_2 -> ~g      b )
     2.87150477E-04    2     1000005        25   # BR(~b_2 -> ~b_1    h )
     2.74579715E-04    2     1000005        23   # BR(~b_2 -> ~b_1    Z )
#
#         PDG            Width
DECAY   1000002     6.67606824E+01   # sup_L decays
#          BR         NDA      ID1       ID2
     5.25501414E-03    2     1000022         2   # BR(~u_L -> ~chi_10 u)
     6.92411578E-04    2     1000023         2   # BR(~u_L -> ~chi_20 u)
     3.79174899E-05    2     1000025         2   # BR(~u_L -> ~chi_30 u)
     4.97223172E-02    2     1000035         2   # BR(~u_L -> ~chi_40 u)
     1.32004487E-03    2     1000024         1   # BR(~u_L -> ~chi_1+ d)
     9.92570637E-02    2     1000037         1   # BR(~u_L -> ~chi_2+ d)
     8.43715231E-01    2     1000021         2   # BR(~u_L -> ~g      u)
#
#         PDG            Width
DECAY   2000002     1.59532917E+02   # sup_R decays
#          BR         NDA      ID1       ID2
     5.06497729E-02    2     1000022         2   # BR(~u_R -> ~chi_10 u)
     1.12368829E-03    2     1000023         2   # BR(~u_R -> ~chi_20 u)
     1.59584326E-04    2     1000025         2   # BR(~u_R -> ~chi_30 u)
     6.17736597E-08    2     1000035         2   # BR(~u_R -> ~chi_40 u)
     9.48066893E-01    2     1000021         2   # BR(~u_R -> ~g      u)
#
#         PDG            Width
DECAY   1000001     6.68115342E+01   # sdown_L decays
#          BR         NDA      ID1       ID2
     5.60840547E-03    2     1000022         1   # BR(~d_L -> ~chi_10 d)
     2.04831099E-05    2     1000023         1   # BR(~d_L -> ~chi_20 d)
     2.06369671E-04    2     1000025         1   # BR(~d_L -> ~chi_30 d)
     4.98180030E-02    2     1000035         1   # BR(~d_L -> ~chi_40 d)
     5.25326324E-05    2    -1000024         2   # BR(~d_L -> ~chi_1- u)
     9.97674529E-02    2    -1000037         2   # BR(~d_L -> ~chi_2- u)
     8.44526753E-01    2     1000021         1   # BR(~d_L -> ~g      d)
#
#         PDG            Width
DECAY   2000001     1.19381111E+02   # sdown_R decays
#          BR         NDA      ID1       ID2
     1.52265398E-02    2     1000022         1   # BR(~d_R -> ~chi_10 d)
     3.36511454E-04    2     1000023         1   # BR(~d_R -> ~chi_20 d)
     4.77896297E-05    2     1000025         1   # BR(~d_R -> ~chi_30 d)
     1.61833353E-08    2     1000035         1   # BR(~d_R -> ~chi_40 d)
     9.84389143E-01    2     1000021         1   # BR(~d_R -> ~g      d)
#
#         PDG            Width
DECAY   1000004     5.34719033E+01   # scharm_L decays
#          BR         NDA      ID1       ID2
     6.85354772E-03    2     1000022         4   # BR(~c_L -> ~chi_10 c)
     9.01644178E-04    2     1000023         4   # BR(~c_L -> ~chi_20 c)
     4.93750606E-05    2     1000025         4   # BR(~c_L -> ~chi_30 c)
     6.38917616E-02    2     1000035         4   # BR(~c_L -> ~chi_40 c)
     1.71896926E-03    2     1000024         3   # BR(~c_L -> ~chi_1+ s)
     1.27542297E-01    2     1000037         3   # BR(~c_L -> ~chi_2+ s)
     7.99042405E-01    2     1000021         4   # BR(~c_L -> ~g      c)
#
#         PDG            Width
DECAY   2000004     1.23316270E+02   # scharm_R decays
#          BR         NDA      ID1       ID2
     6.79254756E-02    2     1000022         4   # BR(~c_R -> ~chi_10 c)
     1.50576536E-03    2     1000023         4   # BR(~c_R -> ~chi_20 c)
     2.13845577E-04    2     1000025         4   # BR(~c_R -> ~chi_30 c)
     8.24423836E-08    2     1000035         4   # BR(~c_R -> ~chi_40 c)
     9.30354831E-01    2     1000021         4   # BR(~c_R -> ~g      c)
#
#         PDG            Width
DECAY   1000003     5.34968837E+01   # sstrange_L decays
#          BR         NDA      ID1       ID2
     7.31651199E-03    2     1000022         3   # BR(~s_L -> ~chi_10 s)
     2.66802789E-05    2     1000023         3   # BR(~s_L -> ~chi_20 s)
     2.68805125E-04    2     1000025         3   # BR(~s_L -> ~chi_30 s)
     6.40343033E-02    2     1000035         3   # BR(~s_L -> ~chi_40 s)
     6.84276626E-05    2    -1000024         4   # BR(~s_L -> ~chi_1- c)
     1.28236874E-01    2    -1000037         4   # BR(~s_L -> ~chi_2- c)
     8.00048398E-01    2     1000021         3   # BR(~s_L -> ~g      s)
#
#         PDG            Width
DECAY   2000003     9.10777756E+01   # sstrange_R decays
#          BR         NDA      ID1       ID2
     2.07314766E-02    2     1000022         3   # BR(~s_R -> ~chi_10 s)
     4.57715351E-04    2     1000023         3   # BR(~s_R -> ~chi_20 s)
     6.50021179E-05    2     1000025         3   # BR(~s_R -> ~chi_30 s)
     2.18815531E-08    2     1000035         3   # BR(~s_R -> ~chi_40 s)
     9.78745784E-01    2     1000021         3   # BR(~s_R -> ~g      s)
#
#         PDG            Width
DECAY   1000011     3.23137020E+00   # selectron_L decays
#          BR         NDA      ID1       ID2
     7.50909980E-01    2     1000022        11   # BR(~e_L -> ~chi_10 e-)
     3.47809483E-02    2     1000023        11   # BR(~e_L -> ~chi_20 e-)
     6.33127140E-05    2     1000025        11   # BR(~e_L -> ~chi_30 e-)
     7.10611530E-02    2     1000035        11   # BR(~e_L -> ~chi_40 e-)
     7.90427325E-04    2    -1000024        12   # BR(~e_L -> ~chi_1- nu_e)
     1.42394178E-01    2    -1000037        12   # BR(~e_L -> ~chi_2- nu_e)
#
#         PDG            Width
DECAY   2000011     1.92562292E+01   # selectron_R decays
#          BR         NDA      ID1       ID2
     9.75310777E-01    2     1000022        11   # BR(~e_R -> ~chi_10 e-)
     2.16179158E-02    2     1000023        11   # BR(~e_R -> ~chi_20 e-)
     3.07012783E-03    2     1000025        11   # BR(~e_R -> ~chi_30 e-)
     1.17886712E-06    2     1000035        11   # BR(~e_R -> ~chi_40 e-)
#
#         PDG            Width
DECAY   1000013     3.23137013E+00   # smuon_L decays
#          BR         NDA      ID1       ID2
     7.50909990E-01    2     1000022        13   # BR(~mu_L -> ~chi_10 mu-)
     3.47809487E-02    2     1000023        13   # BR(~mu_L -> ~chi_20 mu-)
     6.33127148E-05    2     1000025        13   # BR(~mu_L -> ~chi_30 mu-)
     7.10611399E-02    2     1000035        13   # BR(~mu_L -> ~chi_40 mu-)
     7.90427341E-04    2    -1000024        14   # BR(~mu_L -> ~chi_1- nu_mu)
     1.42394181E-01    2    -1000037        14   # BR(~mu_L -> ~chi_2- nu_mu)
#
#         PDG            Width
DECAY   2000013     1.92562292E+01   # smuon_R decays
#          BR         NDA      ID1       ID2
     9.75310777E-01    2     1000022        13   # BR(~mu_R -> ~chi_10 mu-)
     2.16179158E-02    2     1000023        13   # BR(~mu_R -> ~chi_20 mu-)
     3.07012783E-03    2     1000025        13   # BR(~mu_R -> ~chi_30 mu-)
     1.17886712E-06    2     1000035        13   # BR(~mu_R -> ~chi_40 mu-)
#
#         PDG            Width
DECAY   1000015     7.79527644E-03   # stau_1 decays
#          BR         NDA      ID1       ID2
     1.00000000E+00    2     1000022        15   # BR(~tau_1 -> ~chi_10  tau-)
#
#         PDG            Width
DECAY   2000015     8.79187804E-01   # stau_2 decays
#          BR         NDA      ID1       ID2
     3.76182270E-01    2     1000022        15   # BR(~tau_2 -> ~chi_10  tau-)
     2.28105895E-01    2     1000015        25   # BR(~tau_2 -> ~tau_1   h)
     3.95711835E-01    2     1000015        23   # BR(~tau_2 -> ~tau_1   Z)
#
#         PDG            Width
DECAY   1000012     3.25503156E+00   # snu_eL decays
#          BR         NDA      ID1       ID2
     7.61087333E-01    2     1000022        12   # BR(~nu_eL -> ~chi_10 nu_e)
     4.44082969E-03    2     1000023        12   # BR(~nu_eL -> ~chi_20 nu_e)
     7.59690080E-03    2     1000025        12   # BR(~nu_eL -> ~chi_30 nu_e)
     6.93215728E-02    2     1000035        12   # BR(~nu_eL -> ~chi_40 nu_e)
     1.96878953E-02    2     1000024        11   # BR(~nu_eL -> ~chi_1+ e-)
     1.37865469E-01    2     1000037        11   # BR(~nu_eL -> ~chi_2+ e-)
#
#         PDG            Width
DECAY   1000014     3.25503146E+00   # snu_muL decays
#          BR         NDA      ID1       ID2
     7.61087355E-01    2     1000022        14   # BR(~nu_muL -> ~chi_10 nu_mu)
     4.44082982E-03    2     1000023        14   # BR(~nu_muL -> ~chi_20 nu_mu)
     7.59690102E-03    2     1000025        14   # BR(~nu_muL -> ~chi_30 nu_mu)
     6.93215749E-02    2     1000035        14   # BR(~nu_muL -> ~chi_40 nu_mu)
     1.96878958E-02    2     1000024        13   # BR(~nu_muL -> ~chi_1+ mu-)
     1.37865444E-01    2     1000037        13   # BR(~nu_muL -> ~chi_2+ mu-)
#
#         PDG            Width
DECAY   1000016     6.28807440E-01   # snu_tauL decays
#          BR         NDA      ID1       ID2
     3.17504465E-01    2     1000022        16   # BR(~nu_tauL -> ~chi_10 nu_tau)
     6.82495535E-01    2    -1000015       -24   # BR(~nu_tauL -> ~tau_1+ W-)
#
#         PDG            Width
DECAY   1000024     6.73122443E-01   # chargino1+ decays
#          BR         NDA      ID1       ID2
     1.12356989E-01    2     1000016       -15   # BR(~chi_1+ -> ~nu_tau1 tau+)
     6.15684263E-01    2    -1000015        16   # BR(~chi_1+ -> ~tau_1+  nu_tau)
     4.76846701E-03    2    -2000015        16   # BR(~chi_1+ -> ~tau_2+  nu_tau)
     2.67190281E-01    2     1000022        24   # BR(~chi_1+ -> ~chi_10  W+)
#
#         PDG            Width
DECAY   1000037     2.87673081E+01   # chargino2+ decays
#          BR         NDA      ID1       ID2
     2.30033651E-01    2     1000016       -15   # BR(~chi_2+ -> ~nu_tau1 tau+)
     3.50038774E-02    2    -1000015        16   # BR(~chi_2+ -> ~tau_1+  nu_tau)
     1.94924897E-01    2    -2000015        16   # BR(~chi_2+ -> ~tau_2+  nu_tau)
     1.19923812E-01    2     1000024        23   # BR(~chi_2+ -> ~chi_1+  Z )
     3.36281005E-04    2     1000022        24   # BR(~chi_2+ -> ~chi_10  W+)
     1.17793295E-01    2     1000023        24   # BR(~chi_2+ -> ~chi_20  W+)
     1.16116258E-01    2     1000025        24   # BR(~chi_2+ -> ~chi_30  W+)
     1.19313525E-01    2     1000024        25   # BR(~chi_2+ -> ~chi_1+  h )
     1.68099528E-02    2     1000024        35   # BR(~chi_2+ -> ~chi_1+  H )
     1.68543042E-02    2     1000024        36   # BR(~chi_2+ -> ~chi_1+  A )
     9.52572676E-04    2     1000022        37   # BR(~chi_2+ -> ~chi_10  H+)
     1.58904077E-02    2     1000023        37   # BR(~chi_2+ -> ~chi_20  H+)
     1.60471652E-02    2     1000025        37   # BR(~chi_2+ -> ~chi_30  H+)
#
#         PDG            Width
DECAY   1000022     0.00000000E+00   # neutralino1 decays
#
#         PDG            Width
DECAY   1000023     6.83776830E-01   # neutralino2 decays
#          BR         NDA      ID1       ID2
     4.74837839E-02    2     1000022        23   # BR(~chi_20 -> ~chi_10   Z )
     2.14588608E-01    2     1000022        25   # BR(~chi_20 -> ~chi_10   h )
     3.47897859E-01    2     1000015       -15   # BR(~chi_20 -> ~tau_1-   tau+)
     3.47897859E-01    2    -1000015        15   # BR(~chi_20 -> ~tau_1+   tau-)
     2.08431164E-02    2     2000015       -15   # BR(~chi_20 -> ~tau_2-   tau+)
     2.08431164E-02    2    -2000015        15   # BR(~chi_20 -> ~tau_2+   tau-)
     2.22828625E-04    2     1000016       -16   # BR(~chi_20 -> ~nu_tau1  nu_taub)
     2.22828625E-04    2    -1000016        16   # BR(~chi_20 -> ~nu_tau1* nu_tau )
#
#         PDG            Width
DECAY   1000025     6.58412006E-01   # neutralino3 decays
#          BR         NDA      ID1       ID2
     2.27820686E-01    2     1000022        23   # BR(~chi_30 -> ~chi_10   Z )
     2.35910191E-02    2     1000022        25   # BR(~chi_30 -> ~chi_10   h )
     3.52482641E-01    2     1000015       -15   # BR(~chi_30 -> ~tau_1-   tau+)
     3.52482641E-01    2    -1000015        15   # BR(~chi_30 -> ~tau_1+   tau-)
     2.14059957E-02    2     2000015       -15   # BR(~chi_30 -> ~tau_2-   tau+)
     2.14059957E-02    2    -2000015        15   # BR(~chi_30 -> ~tau_2+   tau-)
     4.05511287E-04    2     1000016       -16   # BR(~chi_30 -> ~nu_tau1  nu_taub)
     4.05511287E-04    2    -1000016        16   # BR(~chi_30 -> ~nu_tau1* nu_tau )
#
#         PDG            Width
DECAY   1000035     2.87139595E+01   # neutralino4 decays
#          BR         NDA      ID1       ID2
     1.68228885E-04    2     1000022        23   # BR(~chi_40 -> ~chi_10   Z )
     3.64732868E-02    2     1000023        23   # BR(~chi_40 -> ~chi_20   Z )
     8.38878169E-02    2     1000025        23   # BR(~chi_40 -> ~chi_30   Z )
     1.16487761E-01    2     1000024       -24   # BR(~chi_40 -> ~chi_1+   W-)
     1.16487761E-01    2    -1000024        24   # BR(~chi_40 -> ~chi_1-   W+)
     1.86141767E-04    2     1000022        25   # BR(~chi_40 -> ~chi_10   h )
     6.92414874E-04    2     1000022        35   # BR(~chi_40 -> ~chi_10   H )
     2.68396792E-04    2     1000022        36   # BR(~chi_40 -> ~chi_10   A )
     8.23901820E-02    2     1000023        25   # BR(~chi_40 -> ~chi_20   h )
     1.51921459E-02    2     1000023        35   # BR(~chi_40 -> ~chi_20   H )
     1.01394858E-03    2     1000023        36   # BR(~chi_40 -> ~chi_20   A )
     3.65531380E-02    2     1000025        25   # BR(~chi_40 -> ~chi_30   h )
     1.01453736E-03    2     1000025        35   # BR(~chi_40 -> ~chi_30   H )
     1.54042027E-02    2     1000025        36   # BR(~chi_40 -> ~chi_30   A )
     1.65069859E-02    2     1000024       -37   # BR(~chi_40 -> ~chi_1+   H-)
     1.65069859E-02    2    -1000024        37   # BR(~chi_40 -> ~chi_1-   H+)
     1.74487176E-02    2     1000015       -15   # BR(~chi_40 -> ~tau_1-   tau+)
     1.74487176E-02    2    -1000015        15   # BR(~chi_40 -> ~tau_1+   tau-)
     9.72995102E-02    2     2000015       -15   # BR(~chi_40 -> ~tau_2-   tau+)
     9.72995102E-02    2    -2000015        15   # BR(~chi_40 -> ~tau_2+   tau-)
     1.15634805E-01    2     1000016       -16   # BR(~chi_40 -> ~nu_tau1  nu_taub)
     1.15634805E-01    2    -1000016        16   # BR(~chi_40 -> ~nu_tau1* nu_tau )
#
#         PDG            Width
DECAY        25     4.10385347E-03   # h decays
#          BR         NDA      ID1       ID2
     6.25462158E-01    2           5        -5   # BR(h -> b       bb     )
     6.47350854E-02    2         -15        15   # BR(h -> tau+    tau-   )
     2.28551133E-04    2         -13        13   # BR(h -> mu+     mu-    )
     2.49254074E-04    2           3        -3   # BR(h -> s       sb     )
     2.10115105E-02    2           4        -4   # BR(h -> c       cb     )
     7.61089587E-02    2          21        21   # BR(h -> g       g      )
     2.26994195E-03    2          22        22   # BR(h -> gam     gam    )
     1.40302673E-03    2          22        23   # BR(h -> Z       gam    )
     1.85705715E-01    2          24       -24   # BR(h -> W+      W-     )
     2.28257983E-02    2          23        23   # BR(h -> Z       Z      )
#
#         PDG            Width
DECAY        35     4.83765030E+01   # H decays
#          BR         NDA      ID1       ID2
     7.83018360E-01    2           5        -5   # BR(H -> b       bb     )
     1.66917344E-01    2         -15        15   # BR(H -> tau+    tau-   )
     5.02232898E-04    2         -13        13   # BR(H -> mu+     mu-    )
     3.10797615E-04    2           3        -3   # BR(H -> s       sb     )
     5.15103095E-09    2           4        -4   # BR(H -> c       cb     )
     4.77698354E-04    2           6        -6   # BR(H -> t       tb     )
     5.92963908E-05    2          21        21   # BR(H -> g       g      )
     2.00356694E-08    2          22        22   # BR(H -> gam     gam    )
     2.41292636E-08    2          23        22   # BR(H -> Z       gam    )
     1.30586808E-06    2          24       -24   # BR(H -> W+      W-     )
     6.47762106E-07    2          23        23   # BR(H -> Z       Z      )
     4.42680316E-06    2          25        25   # BR(H -> h       h      )
     5.23536506E-04    2     1000024  -1000024   # BR(H -> ~chi_1+ ~chi_1-)
     1.19973210E-03    2     1000022   1000022   # BR(H -> ~chi_10 ~chi_10)
     9.03520153E-05    2     1000023   1000023   # BR(H -> ~chi_20 ~chi_20)
     1.74302421E-04    2     1000025   1000025   # BR(H -> ~chi_30 ~chi_30)
     1.11769179E-02    2     1000022   1000023   # BR(H -> ~chi_10 ~chi_20)
     1.24414262E-02    2     1000022   1000025   # BR(H -> ~chi_10 ~chi_30)
     4.08009512E-04    2     1000023   1000025   # BR(H -> ~chi_20 ~chi_30)
     6.15958495E-03    2     1000015  -1000015   # BR(H -> ~tau_1- ~tau_1+)
     5.49391686E-03    2     2000015  -2000015   # BR(H -> ~tau_2- ~tau_2+)
     5.51976958E-03    2     1000015  -2000015   # BR(H -> ~tau_1- ~tau_2+)
     5.51976958E-03    2     2000015  -1000015   # BR(H -> ~tau_2- ~tau_1+)
     5.23441526E-07    2     1000016  -1000016   # BR(H -> ~nu_tauL ~nu_tauL*)
#
#         PDG            Width
DECAY        36     4.83993084E+01   # A decays
#          BR         NDA      ID1       ID2
     7.82676867E-01    2           5        -5   # BR(A -> b       bb     )
     1.66841050E-01    2         -15        15   # BR(A -> tau+    tau-   )
     5.01999979E-04    2         -13        13   # BR(A -> mu+     mu-    )
     3.10662971E-04    2           3        -3   # BR(A -> s       sb     )
     5.04085578E-09    2           4        -4   # BR(A -> c       cb     )
     4.89384120E-04    2           6        -6   # BR(A -> t       tb     )
     8.06239593E-05    2          21        21   # BR(A -> g       g      )
     3.01878634E-08    2          22        22   # BR(A -> gam     gam    )
     3.59157789E-08    2          23        22   # BR(A -> Z       gam    )
     1.30166740E-06    2          23        25   # BR(A -> Z       h      )
     7.97764312E-04    2     1000024  -1000024   # BR(A -> ~chi_1+ ~chi_1-)
     1.25218329E-03    2     1000022   1000022   # BR(A -> ~chi_10 ~chi_10)
     1.29954142E-04    2     1000023   1000023   # BR(A -> ~chi_20 ~chi_20)
     2.96153996E-04    2     1000025   1000025   # BR(A -> ~chi_30 ~chi_30)
     1.24041471E-02    2     1000022   1000023   # BR(A -> ~chi_10 ~chi_20)
     1.12177074E-02    2     1000022   1000025   # BR(A -> ~chi_10 ~chi_30)
     2.57082326E-04    2     1000023   1000025   # BR(A -> ~chi_20 ~chi_30)
     1.13715234E-02    2     1000015  -2000015   # BR(A -> ~tau_1- ~tau_2+)
     1.13715234E-02    2    -1000015   2000015   # BR(A -> ~tau_1+ ~tau_2-)
#
#         PDG            Width
DECAY        37     4.56566267E+01   # H+ decays
#          BR         NDA      ID1       ID2
     1.30632065E-03    2           4        -5   # BR(H+ -> c       bb     )
     1.77220346E-01    2         -15        16   # BR(H+ -> tau+    nu_tau )
     5.33229735E-04    2         -13        14   # BR(H+ -> mu+     nu_mu  )
     1.30631293E-05    2           2        -5   # BR(H+ -> u       bb     )
     1.64522007E-05    2           2        -3   # BR(H+ -> u       sb     )
     3.23834035E-04    2           4        -3   # BR(H+ -> c       sb     )
     7.69150507E-01    2           6        -5   # BR(H+ -> t       bb     )
     1.39330236E-06    2          24        25   # BR(H+ -> W+      h      )
     3.35934934E-12    2          24        36   # BR(H+ -> W+      A      )
     2.63755602E-02    2     1000024   1000022   # BR(H+ -> ~chi_1+ ~chi_10)
     8.88257559E-04    2     1000024   1000023   # BR(H+ -> ~chi_1+ ~chi_20)
     7.48136873E-06    2     1000024   1000025   # BR(H+ -> ~chi_1+ ~chi_30)
     2.07377771E-02    2    -1000015   1000016   # BR(H+ -> ~tau_1+ ~nu_tauL)
     3.42577721E-03    2    -2000015   1000016   # BR(H+ -> ~tau_2+ ~nu_tauL)

DECAY         5   0.000000e+00 # b decays
DECAY        15   0.000000e+00 # tau decays
DECAY        23     2.49520000E+00   # Z
DECAY        24     2.08500000E+00   # W
