BLOCK SPINFO
   1   SPheno
   2   v4.0.5be

BLOCK SPHENOINFO
   1   2
   2   2

BLOCK MODSEL
   1   0

BLOCK MINPAR
   3    51.237562
   4    1

BLOCK EXTPAR
   0    2128.2041
   1    699.32344
   2   -1265.6468
   3    2650.93
   11    4647.1744
   12    1365.8144
   13    4232.7237
   23    1083.514
   25    49.70423
   26    4650.0683
   31    1813.511
   32    1813.511
   33    3202.635
   34    4510.1669
   35    4510.1669
   36    3639.1787
   41    3682.5799
   42    3682.5799
   43    1415.6552
   44    4980.4797
   45    4980.4797
   46    3026.7928
   47    974.60579
   48    974.60579
   49    1209.1465

BLOCK SMINPUTS
   1    127.90897
   2    1.1663787e-05
   3    0.1184
   4    91.1876
   5    4.18
   6    173.2
   7    1.777
   8    0
   11    0.00051099893
   12    0
   13    0.10565837
   14    0
   21    0.005
   22    0.0025
   23    0.095
   24    1.27

BLOCK GAUGE Q=  2128.2041
   1    0.35536298
   2    0.66519887
   3    1.219778

BLOCK YU Q=  2128.2041
   1   1    8.3860689e-06
   2   2    0.004260123
   3   3    1.0131045

BLOCK YD Q=  2128.2041
   1   1    0.00083759104
   2   2    0.01591423
   3   3    0.83062784

BLOCK YE Q=  2128.2041
   1   1    0.00014616576
   2   2    0.030222444
   3   3    0.50829178

BLOCK AU Q=  2128.2041
   1   1    0
   2   2    0
   3   3    4647.1744

BLOCK AD Q=  2128.2041
   1   1    0
   2   2    0
   3   3    1365.8141

BLOCK AE Q=  2128.2041
   1   1    0
   2   2    0
   3   3    4232.7237

BLOCK MSOFT Q=  2128.2041
   1    699.32344
   2   -1265.6468
   3    2650.93
   21    20431311
   22   -1168455.4
   31    1813.511
   32    1813.511
   33    3202.635
   34    4510.1669
   35    4510.1669
   36    3639.1787
   41    3682.5799
   42    3682.5799
   43    1415.6552
   44    4980.4797
   45    4980.4797
   46    3026.7928
   47    974.60579
   48    974.60579
   49    1209.1465

BLOCK MASS
   6    173.2
   23    91.1876
   24    80.429995
   15    1.777
   25    126.28374
   35    4647.8339
   36    4650.0683
   37    4648.5793
   1000001    3740.6811
   2000001    1076.1728
   1000002    3739.9751
   2000002    5026.397
   1000003    3740.681
   2000003    1076.1851
   1000004    3739.975
   2000004    5026.397
   1000005    1309.1756
   2000005    1516.0945
   1000006    1496.3113
   2000006    3026.9455
   1000011    1830.2444
   2000011    4508.6588
   1000012    1828.1357
   1000013    1830.275
   2000013    4508.6563
   1000014    1828.1448
   1000015    3219.9497
   2000015    3644.3162
   1000016    3218.2437
   1000021    2818.6289
   1000022    698.73686
   1000023   -1080.4494
   1000025    1097.9413
   1000035   -1322.4347
   1000024    1081.9913
   1000037    1322.6617

BLOCK ALPHA
      -0.019531722

BLOCK HMIX Q=  2128.2041
   1    1083.514
   2    49.70423
   3    243.6306
   4    21623135

BLOCK STOPMIX
   1   1   -0.99524395
   1   2    0.097413923
   2   1   -0.097413923
   2   2   -0.99524395

BLOCK SBOTMIX
   1   1    0.13018053
   1   2    0.99149031
   2   1   -0.99149031
   2   2    0.13018053

BLOCK STAUMIX
   1   1    0.99957878
   1   2    0.029021763
   2   1   -0.029021763
   2   2    0.99957878

BLOCK NMIX
   1   1   -0.99671748
   1   2   -0.0018043078
   1   3   -0.067879645
   1   4    0.044083503
   2   1    0.016447592
   2   2    0.23987323
   2   3   -0.69076114
   2   4   -0.68193795
   3   1    0.079171038
   3   2   -0.02400694
   3   3   -0.70339866
   3   4    0.70596454
   4   1   -0.0039598611
   4   2    0.97050567
   4   3    0.15320485
   4   4    0.18609499

BLOCK UMIX
   1   1   -0.21537801
   1   2    0.97653075
   2   1   -0.97653075
   2   2   -0.21537801

BLOCK VMIX
   1   1    0.26217109
   1   2    0.96502141
   2   1    0.96502141
   2   2   -0.26217109

BLOCK HIGGSBOUNDSINPUTHIGGSCOUPLINGSFERMIONS
       0, 2470.5105,3,36,15,15

BLOCK HIGGSBOUNDSINPUTHIGGSCOUPLINGSBOSONS
       0,4,36,21,21,23

BLOCK SPHENOLOWENERGY
   1    0.00035689482
   2    1.5882663e-06
   3    3.5265426e-05
   4    5.0953436e-15
   5    2.1766585e-10
   6    4.5477922e-08
   7    1.7353247e-13
   8    7.4132491e-09
   9    1.5691642e-06
   10    9.573148e-05
   11    0.98886954
   12    0.54277301
   13    19.389598
   14    0
   15    0
   16    0.0021625614
   17    2.2817126e-15
   18    2.4802687e-11
   19    8.2914107e-11
   20   -4.9333325e-15
   21   -2.1093714e-10
   22   -3.6495485e-08
   23    0
   24    0
   25    0
   26    0
   27    0
   28    0
   29    0
   30    0
   31    0
   39    8.5566162e-05
   40    0
   41    0
   42    0

BLOCK FWCOEF Q=  160
   305   4422   0   0   -0.18881911
   305   4422   0   2   -0.22990915
   305   4322   0   2   -0.00044012399
   305   6421   0   0   -0.095227835
   305   6421   0   2   -0.12324343
   305   6321   0   2   -0.00031317807
   3051111   4133   0   0    1.6051513
   3051111   4133   0   2    1.605914
   3051111   4233   0   2    0.00062356595
   3051111   4137   0   0   -4.4278434
   3051111   4137   0   2   -4.4275784
   3051111   4237   0   2   -0.0047621122
   3051313   4133   0   0    1.6051513
   3051313   4133   0   2    1.6059118
   3051313   4233   0   2    0.00062356485
   3051313   4137   0   0   -4.4278434
   3051313   4137   0   2   -4.4275806
   3051313   4237   0   2   -0.0047621174
   3051212   4137   0   0    1.5053501
   3051212   4137   0   2    1.5053034
   3051212   4237   0   2    0.001034758
   3051414   4137   0   0    1.5053501
   3051414   4137   0   2    1.5053034
   3051414   4237   0   2    0.0010347581
   3051616   4137   0   0    1.5053501
   3051616   4137   0   2    1.5053032
   3051616   4237   0   2    0.001034767

BLOCK IMFWCOEF Q=  160
   305   4422   0   0    3.8563748e-07
   305   4422   0   2   -1.6319503e-05
   305   4322   0   2   -6.8397111e-06
   305   6421   0   0    3.3032401e-07
   305   6421   0   2   -6.9574202e-05
   305   6321   0   2   -4.1672558e-06
   3051111   4133   0   2    1.0238853e-06
   3051111   4233   0   2    1.1647369e-05
   3051111   4137   0   2   -4.0896767e-06
   3051111   4237   0   2   -8.8951305e-05
   3051313   4133   0   2    1.023758e-06
   3051313   4233   0   2    1.1647353e-05
   3051313   4137   0   2   -4.0896041e-06
   3051313   4237   0   2   -8.8951403e-05
   3051212   4137   0   2    1.0821599e-06
   3051212   4237   0   2    1.9328204e-05
   3051414   4137   0   2    1.0821597e-06
   3051414   4237   0   2    1.9328204e-05
   3051616   4137   0   2    1.0787639e-06
   3051616   4237   0   2    1.9328205e-05

DECAY 23  2.4952


DECAY 24  2.085


DECAY 1000011  7.4392702
    0.47139299   2   -1000037    12
    0.23195721   2    1000035    11
    0.22556698   2    1000022    11
    0.04251365   2   -1000024    12
    0.028420746   2    1000023    11
    0.00014842686   2    1000025    11

DECAY 2000011  21.569184
    0.99390789   2    1000022    11
    0.0058257911   2    1000025    11
    0.00025247468   2    1000023    11

DECAY 1000013  7.453583
    0.47053002   2   -1000037    14
    0.2315573   2    1000035    13
    0.22515535   2    1000022    13
    0.042434245   2   -1000024    14
    0.029270339   2    1000023    13
    0.0010527453   2    1000025    13

DECAY 2000013  21.716272
    0.98719189   2    1000022    13
    0.0074381565   2    1000025    13
    0.0031952293   2   -1000024    14
    0.0018500686   2    1000023    13
    0.00014618031   2   -1000037    14

DECAY 1000015  46.25457
    0.39953452   2   -1000037    16
    0.20227729   2    1000035    15
    0.15172859   2    1000023    15
    0.13763488   2    1000025    15
    0.081751099   2    1000022    15
    0.027073611   2   -1000024    16

DECAY 2000015  48.526438
    0.34854633   2    1000022    15
    0.30070336   2   -1000024    16
    0.16065453   2    1000025    15
    0.15057956   2    1000023    15
    0.018535631   2   -1000037    16
    0.0093613454   2    1000035    15
    0.0057752441   2    1000016   -24
    0.0030380018   2    1000015    25
    0.0028059981   2    1000015    23

DECAY 1000012  7.448974
    0.45690288   2    1000037    11
    0.23223879   2    1000035    12
    0.22180943   2    1000022    12
    0.062683173   2    1000024    11
    0.02442493   2    1000023    12
    0.0019407956   2    1000025    12

DECAY 1000014  7.4628621
    0.45611006   2    1000037    13
    0.23181281   2    1000035    14
    0.2213985   2    1000022    14
    0.06436156   2    1000024    13
    0.024379857   2    1000023    14
    0.0019372152   2    1000025    14

DECAY 1000016  46.217609
    0.40568094   2    1000037    15
    0.30173015   2    1000024    15
    0.20028891   2    1000035    16
    0.078362815   2    1000022    16
    0.012885257   2    1000023    16
    0.0010519243   2    1000025    16

DECAY 2000001  0.19970966
    1   2    1000022    1

DECAY 1000001  93.645599
    0.58904486   2    1000021    1
    0.25672005   2   -1000037    2
    0.12697774   2    1000035    1
    0.013696427   2   -1000024    2
    0.0082928677   2    1000023    1
    0.0050545959   2    1000022    1
    0.00021342947   2    1000025    1

DECAY 2000003  0.19972563
    1   2    1000022    3

DECAY 1000003  93.663156
    0.58893435   2    1000021    3
    0.25667286   2   -1000037    4
    0.12695761   2    1000035    3
    0.013704944   2   -1000024    4
    0.0083716896   2    1000023    3
    0.0050545064   2    1000022    3
    0.00029631448   2    1000025    3

DECAY 1000005  2.9966892
    0.30406411   2    1000023    5
    0.28727747   2   -1000024    6
    0.25655519   2    1000025    5
    0.15210323   2    1000022    5

DECAY 2000005  12.97739
    0.45679959   2   -1000024    6
    0.1829157   2    1000023    5
    0.18254533   2    1000025    5
    0.072402278   2    1000005    25
    0.045833553   2   -1000037    6
    0.031740452   2    1000035    5
    0.01808318   2    1000005    23
    0.0096799136   2    1000022    5

DECAY 1000002  93.629113
    0.58845321   2    1000021    2
    0.25067411   2    1000037    1
    0.12659397   2    1000035    2
    0.0202931   2    1000024    1
    0.0087070289   2    1000023    2
    0.0052641613   2    1000022    2

DECAY 2000002  197.25116
    0.94529245   2    1000021    2
    0.054369305   2    1000022    2
    0.00032346463   2    1000025    2

DECAY 1000004  93.645857
    0.58834704   2    1000021    4
    0.25063628   2    1000037    3
    0.12657153   2    1000035    4
    0.020450277   2    1000024    3
    0.0087112073   2    1000023    4
    0.0052632479   2    1000022    4

DECAY 2000004  197.25439
    0.94527667   2    1000021    4
    0.054368419   2    1000022    4
    0.00032762691   2    1000025    4

DECAY 1000006  12.667648
    0.38927571   2    1000024    5
    0.28195571   2    1000023    6
    0.24288678   2    1000025    6
    0.045183672   2    1000037    5
    0.028633389   2    1000005    24
    0.011311811   2    1000022    6
    0.00051457173   2    1000035    6
    0.00023613546   3    1000022    24    5

DECAY 2000006  266.33673
    0.2765622   2    2000005    24
    0.19609866   2    1000006    25
    0.15826177   2    1000024    5
    0.14281715   2    1000006    23
    0.085356451   2    1000025    6
    0.078215872   2    1000023    6
    0.022932478   2    1000022    6
    0.015856064   2    1000037    5
    0.0099348359   2    1000021    6
    0.0078663266   2    1000035    6
    0.0060981994   2    1000005    24

DECAY 1000024  0.50064666
    0.99469271   2    1000022    24
    0.0053045827   3    1000022   -5    6

DECAY 1000037  5.3201511
    0.34592028   2    1000023    24
    0.23123998   2    1000024    23
    0.20866068   2    1000025    24
    0.19316301   2    1000024    25
    0.020429914   2    1000022    24
    0.00031698439   3    1000022   -5    6
    0.00018574408   3    1000023   -5    6

DECAY 1000022 -1


DECAY 1000023  0.95530914
    0.5643459   2    1000022    23
    0.43558654   2    1000022    25

DECAY 1000025  0.54848885
    0.948546   2    1000022    25
    0.051185548   2    1000022    23
    0.00010397359   3    1000022    6   -6

DECAY 1000035  7.5482968
    0.23257845   2    1000024   -24
    0.23257845   2   -1000024    24
    0.21681924   2    1000025    23
    0.15627935   2    1000025    25
    0.13278534   2    1000023    25
    0.013894249   2    1000022    23
    0.012620053   2    1000022    25
    0.0020199043   2    1000023    23
    0.00013145584   3    1000024    5   -6
    0.00013145584   3   -1000024   -5    6

DECAY 1000021  259.58714
    0.11726252   2    2000001   -1
    0.11726252   2   -2000001    1
    0.11726161   2    2000003   -3
    0.11726161   2   -2000003    3
    0.098745561   2    1000005   -5
    0.098745561   2   -1000005    5
    0.08526263   2    1000006   -6
    0.08526263   2   -1000006    6
    0.081251715   2    2000005   -5
    0.081251715   2   -2000005    5

DECAY 25  0.004044616
    0.55165115   2   -5    5
    0.25046848   2   -24    24
    0.071372954   2    21    21
    0.063656308   2   -15    15
    0.03108917   2    23    23
    0.027374808   2   -4    4
    0.0023495853   2    22    22
    0.0016087633   2    22    23
    0.00022072622   2   -13    13
    0.00020733141   2   -3    3
    5.7325067e-07   2   -1    1
    1.4106504e-07   2   -2    2
    4.9621549e-09   2   -11    11

DECAY 35  130.53322
    0.41665033   2   -5    5
    0.16994776   2   -15    15
    0.095352563   2   -1000024    1000037
    0.095352563   2   -1000037    1000024
    0.057351684   2    1000025    1000035
    0.036819235   2    1000023    1000035
    0.020230162   2    1000022    1000023
    0.017172425   2   -1000024    1000024
    0.01499556   2    1000022    1000025
    0.012729653   2   -2000006    1000006
    0.012729653   2   -1000006    2000006
    0.0108413   2   -2000005    1000005
    0.0108413   2   -1000005    2000005
    0.0098838495   2   -1000037    1000037
    0.0068024338   2    1000023    1000023
    0.0049960189   2    1000035    1000035
    0.0022864794   2    1000023    1000025
    0.0014356172   2   -1000006    1000006
    0.00093655501   2   -1000005    1000005
    0.00085568298   2   -2000005    2000005
    0.00054159987   2   -13    13
    0.00043339485   2    1000025    1000025
    0.0003242655   2    1000022    1000022
    0.00023001373   2   -3    3
    0.00013887918   2   -6    6
    0.00011451453   2    1000022    1000035
    3.9306374e-06   2    21    21
    1.6833545e-06   2    25    25
    6.3586204e-07   2   -1    1
    8.1667087e-08   2    22    23
    3.2941807e-08   2    22    22
    2.9799831e-08   2    23    23
    1.2162116e-08   2   -11    11
    1.0556153e-08   2   -1000011    1000011
    1.0413135e-08   2   -1000013    1000013
    5.3220834e-09   2   -24    24
    3.3067794e-09   2   -1000001    1000001
    3.2894043e-09   2   -1000003    1000003
    1.3575865e-09   2   -4    4
    6.9985506e-15   2   -2    2

DECAY 36  125.36738
    0.40462364   2   -5    5
    0.16509218   2   -15    15
    0.096079343   2   -1000024    1000037
    0.096079343   2   -1000037    1000024
    0.047781983   2    1000025    1000035
    0.047688333   2    1000023    1000035
    0.021275017   2   -1000024    1000024
    0.01968568   2    1000022    1000025
    0.016908201   2    1000022    1000023
    0.013823092   2   -2000006    1000006
    0.013823092   2   -1000006    2000006
    0.013476769   2   -1000037    1000037
    0.012219056   2   -2000005    1000005
    0.012219056   2   -1000005    2000005
    0.0083206132   2    1000023    1000023
    0.0068206513   2    1000035    1000035
    0.0021309518   2    1000023    1000025
    0.00062525183   2    1000025    1000025
    0.00052611101   2   -13    13
    0.00039071488   2    1000022    1000022
    0.0002233813   2   -3    3
    0.0001195764   2   -6    6
    6.3369613e-05   2    1000022    1000035
    3.8615702e-06   2    21    21
    6.1753273e-07   2   -1    1
    7.8210965e-08   2    23    25
    1.9274512e-08   2    22    23
    1.1814676e-08   2   -11    11
    2.4132578e-09   2   -4    4
    1.8020452e-09   2    22    22
    4.8813533e-13   2    23    35
    1.2443126e-14   2   -2    2
    4.5670355e-40   2    25    25

DECAY 37  121.75283
    0.36730714   2   -5    6
    0.20045341   2   -15    16
    0.1186173   2    1000023    1000037
    0.114561   2    1000024    1000035
    0.10882736   2    1000025    1000037
    0.03935676   2    1000022    1000024
    0.023474133   2   -1000005    1000006
    0.016012968   2   -2000005    2000006
    0.0064054026   2    1000024    1000025
    0.0016146202   2   -1000005    2000006
    0.0015555436   2   -2000005    1000006
    0.00070867409   2   -13    14
    0.00054449221   2   -5    4
    0.00023331782   2   -3    4
    0.00019862164   2    1000022    1000037
    0.00011219381   2    1000023    1000024
    1.0980477e-05   2   -3    2
    3.8882355e-06   2   -5    2
    1.1309993e-06   2   -3    6
    6.4777962e-07   2   -1    2
    1.5983684e-07   2    1000035    1000037
    8.0476107e-08   2    24    25
    4.4502018e-08   2   -1000011    1000012
    4.4286468e-08   2   -1000013    1000014
    3.5890319e-08   2   -1    6
    3.0724294e-08   2   -1    4
    1.6575961e-08   2   -11    12
    1.602516e-10   2   -1000003    2000006
    1.4023648e-12   2   -1000003    1000006
    2.0372092e-14   2   -1000001    2000006
    1.7827644e-16   2   -1000001    1000006

DECAY 6  2.43
    1   2    5    24

DECAY 15 -1
