BLOCK SPINFO
   1   SPheno
   2   v4.0.5be

BLOCK SPHENOINFO
   1   2
   2   2

BLOCK MODSEL
   1   0

BLOCK MINPAR
   3    36.438519
   4   -1

BLOCK EXTPAR
   0    1693.034
   1    334.58867
   2    1011.8289
   3    3000
   11    2528.6246
   12    268.80381
   13    1290.9614
   23   -1073.3326
   25    36.085738
   26    2466.669
   31    457.94115
   32    457.94115
   33    977.39895
   34    1853.8639
   35    1853.8639
   36    1587.7551
   41    5000
   42    5000
   43    1546.8585
   44    5000
   45    5000
   46    1846.5875
   47    5000
   48    5000
   49    1408.5522

BLOCK SMINPUTS
   1    127.90897
   2    1.1663787e-05
   3    0.1184
   4    91.1876
   5    4.18
   6    173.2
   7    1.777
   8    0
   11    0.00051099893
   12    0
   13    0.10565837
   14    0
   21    0.005
   22    0.0025
   23    0.095
   24    1.27

BLOCK GAUGE Q=  1693.034
   1    0.35536298
   2    0.66519887
   3    1.219778

BLOCK YU Q=  1693.034
   1   1    8.3875909e-06
   2   2    0.0042608962
   3   3    1.0132884

BLOCK YD Q=  1693.034
   1   1    0.00060820933
   2   2    0.011555977
   3   3    0.60315307

BLOCK YE Q=  1693.034
   1   1    0.00010613698
   2   2    0.021945761
   3   3    0.36909159

BLOCK AU Q=  1693.034
   1   1    0
   2   2    0
   3   3    2528.6246

BLOCK AD Q=  1693.034
   1   1    0
   2   2    0
   3   3    268.80379

BLOCK AE Q=  1693.034
   1   1    0
   2   2    0
   3   3    1290.9614

BLOCK MSOFT Q=  1693.034
   1    334.58867
   2    1011.8289
   3    3000
   21    5045081.9
   22   -1092868.7
   31    457.94115
   32    457.94115
   33    977.39895
   34    1853.8639
   35    1853.8639
   36    1587.7551
   41    5000
   42    5000
   43    1546.8585
   44    5000
   45    5000
   46    1846.5875
   47    5000
   48    5000
   49    1408.5522

BLOCK MASS
   6    173.2
   23    91.1876
   24    80.429995
   15    1.777
   25    121.63318
   35    2465.2067
   36    2466.669
   37    2467.3142
   1000001    5035.1238
   2000001    5025.12
   1000002    5034.6679
   2000002    5026.9417
   1000003    5035.1293
   2000003    5025.121
   1000004    5034.6704
   2000004    5026.9423
   1000005    1414.8941
   2000005    1578.7583
   1000006    1529.5799
   2000006    1873.9552
   1000011    482.45281
   2000011    1855.1541
   1000012    475.49342
   1000013    482.44382
   2000013    1855.1428
   1000014    475.49517
   1000015    988.32675
   2000015    1585.247
   1000016    986.64284
   1000021    3199.6508
   1000022    333.78557
   1000023    1007.4198
   1000025   -1078.0047
   1000035    1118.5883
   1000024    1007.6537
   1000037    1118.912

BLOCK ALPHA
      -0.027505668

BLOCK HMIX Q=  1693.034
   1   -1073.3326
   2    36.085738
   3    243.88904
   4    6084456

BLOCK STOPMIX
   1   1   -0.94572659
   1   2    0.32496342
   2   1   -0.32496342
   2   2   -0.94572659

BLOCK SBOTMIX
   1   1   -0.28449261
   1   2    0.95867823
   2   1   -0.95867823
   2   2   -0.28449261

BLOCK STAUMIX
   1   1   -0.99899423
   1   2    0.044838914
   2   1   -0.044838914
   2   2   -0.99899423

BLOCK NMIX
   1   1   -0.99889215
   1   2    0.0012079464
   1   3    0.045254975
   1   4    0.012844904
   2   1    0.025437003
   2   2    0.81228257
   2   3    0.42733772
   2   4    0.39614702
   3   1   -0.022859083
   3   2    0.027218156
   3   3   -0.70603571
   3   4    0.70728368
   4   1   -0.032324676
   4   2    0.58262745
   4   3   -0.56289256
   4   4   -0.58536513

BLOCK UMIX
   1   1   -0.78215326
   1   2   -0.62308609
   2   1    0.62308609
   2   2   -0.78215326

BLOCK VMIX
   1   1   -0.81487296
   1   2    0.57963959
   2   1    0.57963959
   2   2    0.81487296

BLOCK HIGGSBOUNDSINPUTHIGGSCOUPLINGSFERMIONS
       0, 1302.1805,3,36,15,15

BLOCK HIGGSBOUNDSINPUTHIGGSCOUPLINGSBOSONS
       0,4,36,21,21,23

BLOCK SPHENOLOWENERGY
   1    0.00031411688
   2    1.5894481e-06
   3    3.5214689e-05
   4    2.4954977e-15
   5    1.0660389e-10
   6    2.2258862e-08
   7    8.493997e-14
   8    3.6285999e-09
   9    7.6761363e-07
   10    9.5857169e-05
   11    0.99016786
   12    0.54222302
   13    19.370616
   14    0
   15    0
   16    0.0021581086
   17    2.2816676e-15
   18    2.4777094e-11
   19    8.2848087e-11
   20   -1.2786607e-14
   21   -5.467315e-10
   22   -1.0968498e-07
   23    0
   24    0
   25    0
   26    0
   27    0
   28    0
   29    0
   30    0
   31    0
   39    9.4359958e-05
   40    0
   41    0
   42    0

BLOCK FWCOEF Q=  160
   305   4422   0   0   -0.18881911
   305   4422   0   2   -0.18001038
   305   4322   0   2   -7.7501369e-05
   305   6421   0   0   -0.095227835
   305   6421   0   2   -0.097072784
   305   6321   0   2   -0.00016788808
   3051111   4133   0   0    1.5965183
   3051111   4133   0   2    1.5971356
   3051111   4233   0   2    0.00016232156
   3051111   4137   0   0   -4.4192104
   3051111   4137   0   2   -4.4138314
   3051111   4237   0   2   -0.0012538234
   3051313   4133   0   0    1.5965183
   3051313   4133   0   2    1.5971316
   3051313   4233   0   2    0.00016232066
   3051313   4137   0   0   -4.4192104
   3051313   4137   0   2   -4.4138355
   3051313   4237   0   2   -0.0012538249
   3051212   4137   0   0    1.5053501
   3051212   4137   0   2    1.5041897
   3051212   4237   0   2    0.00027296724
   3051414   4137   0   0    1.5053501
   3051414   4137   0   2    1.5041897
   3051414   4237   0   2    0.00027296733
   3051616   4137   0   0    1.5053501
   3051616   4137   0   2    1.5041903
   3051616   4237   0   2    0.00027299384

BLOCK IMFWCOEF Q=  160
   305   4422   0   0    3.858786e-07
   305   4422   0   2   -2.0659919e-05
   305   4322   0   2    1.6445425e-06
   305   6421   0   0    3.3053055e-07
   305   6421   0   2    3.8771743e-06
   305   6321   0   2    8.9885251e-07
   3051111   4133   0   2   -7.289073e-07
   3051111   4233   0   2    3.7026607e-06
   3051111   4137   0   2    4.5810793e-06
   3051111   4237   0   2   -2.8614628e-05
   3051313   4133   0   2   -7.2891506e-07
   3051313   4233   0   2    3.7026528e-06
   3051313   4137   0   2    4.5811244e-06
   3051313   4237   0   2   -2.8614662e-05
   3051212   4137   0   2   -8.0062739e-07
   3051212   4237   0   2    6.2296682e-06
   3051414   4137   0   2   -8.0063229e-07
   3051414   4237   0   2    6.2296682e-06
   3051616   4137   0   2   -7.8985034e-07
   3051616   4237   0   2    6.2296743e-06

DECAY 23  2.4952


DECAY 24  2.085


DECAY 1000011  0.16361135
    0.99999983   2    1000022    11

DECAY 2000011  8.7174772
    0.99895829   2    1000022    11
    0.00045256161   2    1000035    11
    0.00034398858   2    1000023    11
    0.00024512636   2    1000025    11

DECAY 1000013  0.16359886
    0.99999983   2    1000022    13

DECAY 2000013  8.7358198
    0.99685786   2    1000022    13
    0.00071265392   2    1000035    13
    0.00068948286   2    1000025    13
    0.00052795014   2    1000023    13
    0.00050385475   2   -1000037    14
    0.0003925916   2   -1000024    14
    0.00031560824   2    1000013    25

DECAY 1000015  0.98344847
    1   2    1000022    15

DECAY 2000015  12.146283
    0.59649275   2    1000022    15
    0.1002337   2    1000016   -24
    0.061613801   2   -1000037    16
    0.051351008   2    1000025    15
    0.051336812   2    1000015    25
    0.049271608   2    1000015    23
    0.039291279   2   -1000024    16
    0.03193341   2    1000035    15
    0.018475635   2    1000023    15

DECAY 1000012  0.15402686
    1   2    1000022    12

DECAY 1000014  0.15402963
    1   2    1000022    14

DECAY 1000016  0.97627525
    0.9978372   2    1000022    16
    0.0010815855   3    1000014    15   -13
    0.0010812184   3    1000012    15   -11

DECAY 2000001  143.00286
    0.98055738   2    1000021    1
    0.01940261   2    1000022    1

DECAY 1000001  202.78531
    0.69661513   2    1000021    1
    0.12322186   2   -1000024    2
    0.076685754   2   -1000037    2
    0.065712525   2    1000023    1
    0.034192943   2    1000035    1
    0.0034742896   2    1000022    1

DECAY 2000003  143.0272
    0.98039124   2    1000021    3
    0.019399502   2    1000022    3

DECAY 1000003  202.79977
    0.69656832   2    1000021    3
    0.12321586   2   -1000024    4
    0.076685927   2   -1000037    4
    0.065719028   2    1000023    3
    0.034209352   2    1000035    3
    0.0034741797   2    1000022    3
    0.00012733507   2    1000025    3

DECAY 1000005  4.4253222
    0.3031455   2   -1000024    6
    0.20314073   2    1000023    5
    0.19937418   2    1000025    5
    0.17485119   2    1000022    5
    0.062436395   2    1000035    5
    0.057051991   2   -1000037    6

DECAY 2000005  17.97112
    0.46029814   2   -1000037    6
    0.20813303   2   -1000024    6
    0.10231676   2    1000035    5
    0.09215033   2    1000025    5
    0.090369779   2    1000023    5
    0.024195576   2    1000005    23
    0.013312584   2    1000005    25
    0.0092238103   2    1000022    5

DECAY 2000002  151.53724
    0.92658414   2    1000021    2
    0.073266541   2    1000022    2

DECAY 1000002  202.77668
    0.69641085   2    1000021    2
    0.13373858   2    1000024    1
    0.067190513   2    1000023    2
    0.066359991   2    1000037    1
    0.032865748   2    1000035    2
    0.0033810159   2    1000022    2

DECAY 2000004  151.54054
    0.92656394   2    1000021    4
    0.073264943   2    1000022    4

DECAY 1000004  202.7907
    0.69636363   2    1000021    4
    0.133753   2    1000024    3
    0.06718712   2    1000023    4
    0.066391736   2    1000037    3
    0.032866345   2    1000035    4
    0.0033807848   2    1000022    4

DECAY 1000006  16.921634
    0.24681914   2    1000025    6
    0.24187001   2    1000035    6
    0.23110342   2    1000037    5
    0.13328483   2    1000024    5
    0.080821474   2    1000023    6
    0.026608618   2    1000023    4
    0.024284876   2    1000022    6
    0.011333345   2    1000005    24
    0.003521742   2    1000022    4
    0.00035255115   3    1000022    24    5

DECAY 2000006  62.692144
    0.16551148   2    1000024    5
    0.15083606   2    2000005    24
    0.12012983   2    1000025    6
    0.11233355   2    1000006    23
    0.11182929   2    1000037    5
    0.1097215   2    1000006    25
    0.073195587   2    1000023    6
    0.056606967   2    1000022    6
    0.053583762   2    1000035    6
    0.046251968   2    1000005    24

DECAY 1000024  7.0283134
    0.25334941   2    1000014   -13
    0.2531928   2    1000012   -11
    0.2293491   2   -1000013    14
    0.22934401   2   -1000011    12
    0.03291508   2    1000022    24
    0.00078755131   2    1000016   -15
    0.00057840508   2   -1000015    16
    0.00048241467   3    1000022   -5    6

DECAY 1000037  5.863492
    0.21611464   2   -1000013    14
    0.21611096   2   -1000011    12
    0.18985723   2    1000014   -13
    0.18947845   2    1000012   -11
    0.077499755   2    1000022    24
    0.048790791   2    1000023    24
    0.02386039   2    1000024    23
    0.022089451   2    1000016   -15
    0.014753981   2   -1000015    16
    0.0013698373   3    1000022   -5    6

DECAY 1000022 -1


DECAY 1000023  7.228905
    0.1243121   2    1000013   -13
    0.1243121   2   -1000013    13
    0.12423857   2    1000011   -11
    0.12423857   2   -1000011    11
    0.11818547   2    1000012   -12
    0.11818547   2   -1000012    12
    0.11818497   2    1000014   -14
    0.11818497   2   -1000014    14
    0.021684321   2    1000022    25
    0.0070316971   2    1000022    23
    0.00032909507   2    1000015   -15
    0.00032909507   2   -1000015    15
    0.00032603889   2    1000016   -16
    0.00032603889   2   -1000016    16
    0.00012483142   3    1000022    6   -6

DECAY 1000025  1.1592868
    0.468441   2    1000022    25
    0.46481539   2    1000022    23
    0.015866667   2    1000015   -15
    0.015866667   2   -1000015    15
    0.0036687983   3    1000022    6   -6
    0.0024911045   3    1000024    1   -2
    0.0024911045   3   -1000024   -1    2
    0.0024889748   3    1000024    3   -4
    0.0024889748   3   -1000024   -3    4
    0.0020640708   2    1000012   -12
    0.0020640708   2   -1000012    12
    0.0020640635   2    1000014   -14
    0.0020640635   2   -1000014    14
    0.0017152576   2    1000013   -13
    0.0017152576   2   -1000013    13
    0.00083026363   3    1000024    11   -12
    0.00083026363   3   -1000024   -11    12
    0.00083026164   3    1000024    13   -14
    0.00083026164   3   -1000024   -13    14
    0.00082890822   3    1000024    15   -16
    0.00082890822   3   -1000024   -15    16
    0.00075223158   3    1000023    12   -12
    0.00056347683   3    1000023    1   -1
    0.0005634695   3    1000023    3   -3
    0.00055313155   3    1000023    5   -5
    0.00043947407   3    1000023    2   -2
    0.00043810962   3    1000023    4   -4
    0.00029475637   2    1000011   -11
    0.00029475637   2   -1000011    11
    0.00014533011   2    1000023    22
    0.0001271922   3    1000023    11   -11
    0.00012718874   3    1000023    13   -13
    0.0001237821   3    1000023    15   -15

DECAY 1000035  5.5359848
    0.10742136   2    1000012   -12
    0.10742136   2   -1000012    12
    0.10742101   2    1000014   -14
    0.10742101   2   -1000014    14
    0.094378515   2    1000013   -13
    0.094378515   2   -1000013    13
    0.094171668   2    1000011   -11
    0.094171668   2   -1000011    11
    0.059172009   2    1000022    25
    0.037543626   2    1000024   -24
    0.037543626   2   -1000024    24
    0.021254566   2    1000022    23
    0.010638198   2    1000015   -15
    0.010638198   2   -1000015    15
    0.0078869316   2    1000016   -16
    0.0078869316   2   -1000016    16
    0.0005169621   3    1000022    6   -6

DECAY 1000021  230.82366
    0.13300186   2    1000005   -5
    0.13300186   2   -1000005    5
    0.1322917   2    1000006   -6
    0.1322917   2   -1000006    6
    0.11720043   2    2000005   -5
    0.11720043   2   -2000005    5
    0.07924547   2    2000006   -6
    0.07924547   2   -2000006    6
    0.038177891   2    1000006   -4
    0.038177891   2   -1000006    4

DECAY 25  0.0034991815
    0.62476987   2   -5    5
    0.17557895   2   -24    24
    0.073911931   2    21    21
    0.071169837   2   -15    15
    0.030701768   2   -4    4
    0.019859603   2    23    23
    0.0023161419   2    22    22
    0.0012105187   2    22    23
    0.00024688802   2   -13    13
    0.00023368071   2   -3    3
    6.4610278e-07   2   -1    1
    1.5822434e-07   2   -2    2
    5.5503598e-09   2   -11    11

DECAY 35  92.750439
    0.80988169   2   -5    5
    0.060520933   2   -15    15
    0.029147421   2   -1000024    1000037
    0.029147421   2   -1000037    1000024
    0.01926286   2    1000023    1000025
    0.010938008   2   -1000024    1000024
    0.010383677   2    1000022    1000025
    0.0075055177   2    1000025    1000035
    0.0051891852   2    1000022    1000035
    0.0051700558   2    1000023    1000023
    0.0037922203   2    1000022    1000023
    0.0032719888   2   -1000037    1000037
    0.0019357483   2    1000035    1000035
    0.0016713726   2    1000023    1000035
    0.0016293632   2   -6    6
    0.00019610146   2   -13    13
    0.00016251131   2   -3    3
    0.00011008929   2    1000022    1000022
    4.7308706e-05   2   -1000015    1000015
    1.8942668e-05   2    1000025    1000025
    1.5107769e-05   2    21    21
    7.7663755e-07   2    25    25
    4.4924809e-07   2   -1    1
    1.726432e-07   2    23    23
    8.2270966e-08   2   -1000011    1000011
    8.1554333e-08   2   -1000013    1000013
    7.9348291e-08   2    22    23
    6.8042077e-08   2   -24    24
    2.2982412e-08   2    22    22
    1.7190007e-08   2   -4    4
    5.0838588e-09   2   -2000013    1000013
    5.0838588e-09   2   -1000013    2000013
    4.4046013e-09   2   -11    11
    1.189114e-13   2   -2000011    1000011
    1.189114e-13   2   -1000011    2000011
    8.861973e-14   2   -2    2

DECAY 36  87.180567
    0.8026654   2   -5    5
    0.059977086   2   -15    15
    0.02886207   2   -1000024    1000024
    0.016019237   2   -1000024    1000037
    0.016019237   2   -1000037    1000024
    0.015986728   2   -1000037    1000037
    0.013593861   2    1000023    1000023
    0.0095401334   2    1000035    1000035
    0.009145975   2    1000022    1000025
    0.00703773   2    1000023    1000025
    0.006714872   2    1000022    1000035
    0.005564531   2    1000023    1000035
    0.0048072215   2    1000022    1000023
    0.0019137178   2    1000025    1000035
    0.00155639   2   -6    6
    0.00019432913   2   -13    13
    0.00016104717   2   -3    3
    0.00012257316   2    1000022    1000022
    9.4598231e-05   2    1000025    1000025
    2.2393222e-05   2    21    21
    4.4520135e-07   2   -1    1
    2.6643404e-07   2    23    25
    1.0575609e-07   2    22    23
    1.9372253e-08   2    22    22
    1.5948626e-08   2   -4    4
    5.3975715e-09   2   -2000013    1000013
    5.3975715e-09   2   -1000013    2000013
    4.3647724e-09   2   -11    11
    1.2624833e-13   2   -2000011    1000011
    1.2624833e-13   2   -1000011    2000011
    8.4226328e-14   2    23    35
    8.2227839e-14   2   -2    2
    6.941417e-37   2    25    25

DECAY 37  93.054747
    0.80110036   2   -5    6
    0.070404824   2   -15    16
    0.037447672   2    1000023    1000037
    0.03423062   2    1000024    1000035
    0.02767738   2    1000024    1000025
    0.011359668   2    1000022    1000037
    0.0081906179   2    1000022    1000024
    0.0079178259   2    1000025    1000037
    0.0011881617   2   -5    4
    0.00024890627   2   -13    14
    0.00014856899   2   -3    4
    3.3436443e-05   2    1000035    1000037
    2.6640948e-05   2   -1000015    1000016
    8.4847023e-06   2   -5    2
    7.1324587e-06   2    1000023    1000024
    6.9424198e-06   2   -3    2
    1.3600526e-06   2   -3    6
    4.1210096e-07   2   -1    2
    3.2181122e-07   2   -1000011    1000012
    3.2080929e-07   2   -1000013    1000014
    2.5004277e-07   2    24    25
    5.2344984e-08   2   -1    6
    1.9681735e-08   2   -1    4
    1.0413901e-08   2   -2000013    1000014
    5.8219436e-09   2   -11    12
    6.0799431e-13   2    24    35
    2.4358603e-13   2   -2000011    1000012

DECAY 6  2.43
    1   2    5    24

DECAY 15 -1
