BLOCK SPINFO
   1   SPheno
   2   v4.0.5be

BLOCK SPHENOINFO
   1   2
   2   2

BLOCK MODSEL
   1   0

BLOCK MINPAR
   3    53.64212
   4    1

BLOCK EXTPAR
   0    1721.8969
   1    348.33801
   2    1561.6726
   3    3000
   11    3906.7335
   12    847.13589
   13   -1949.7427
   23    359.8751
   25    52.699132
   26    802.25455
   31    1646.2683
   32    1646.2683
   33    1498.3782
   34    1370.6409
   35    1370.6409
   36    1264.4445
   41    5000
   42    5000
   43    1654.7347
   44    5000
   45    5000
   46    1870.9856
   47    5000
   48    5000
   49    938.06059

BLOCK SMINPUTS
   1    127.90897
   2    1.1663787e-05
   3    0.1184
   4    91.1876
   5    4.18
   6    173.2
   7    1.777
   8    0
   11    0.00051099893
   12    0
   13    0.10565837
   14    0
   21    0.005
   22    0.0025
   23    0.095
   24    1.27

BLOCK GAUGE Q=  1721.8969
   1    0.35536298
   2    0.66519887
   3    1.219778

BLOCK YU Q=  1721.8969
   1   1    8.3858815e-06
   2   2    0.0042600278
   3   3    1.0130818

BLOCK YD Q=  1721.8969
   1   1    0.00088803981
   2   2    0.016872756
   3   3    0.88065722

BLOCK YE Q=  1721.8969
   1   1    0.00015496944
   2   2    0.032042765
   3   3    0.5389066

BLOCK AU Q=  1721.8969
   1   1    0
   2   2    0
   3   3    3906.7337

BLOCK AD Q=  1721.8969
   1   1    0
   2   2    0
   3   3    847.13572

BLOCK AE Q=  1721.8969
   1   1    0
   2   2    0
   3   3   -1949.7428

BLOCK MSOFT Q=  1721.8969
   1    348.33801
   2    1561.6726
   3    3000
   21    554945.69
   22   -65927.662
   31    1646.2683
   32    1646.2683
   33    1498.3782
   34    1370.6409
   35    1370.6409
   36    1264.4445
   41    5000
   42    5000
   43    1654.7347
   44    5000
   45    5000
   46    1870.9856
   47    5000
   48    5000
   49    938.06059

BLOCK MASS
   6    173.2
   23    91.1876
   24    80.429995
   15    1.777
   25    125.49881
   35    802.09053
   36    802.25455
   37    808.40831
   1000001    5037.0965
   2000001    5028.1489
   1000002    5036.6517
   2000002    5029.3209
   1000003    5037.1013
   2000003    5028.1553
   1000004    5036.6557
   2000004    5029.3215
   1000005    952.54985
   2000005    1664.393
   1000006    1556.9852
   2000006    1904.2756
   1000011    1659.0692
   2000011    1373.7244
   1000012    1656.804
   1000013    1659.0495
   2000013    1373.6769
   1000014    1656.7826
   1000015    1247.4626
   2000015    1503.2796
   1000016    1500.0601
   1000021    3206.5488
   1000022    322.36897
   1000023   -365.76661
   1000025    387.04187
   1000035    1606.2353
   1000024    362.24124
   1000037    1606.3042

BLOCK ALPHA
      -0.019379902

BLOCK HMIX Q=  1721.8969
   1    359.8751
   2    52.699132
   3    243.82749
   4    643612.36

BLOCK STOPMIX
   1   1   -0.84772507
   1   2    0.53043586
   2   1   -0.53043586
   2   2   -0.84772507

BLOCK SBOTMIX
   1   1    0.018749317
   1   2    0.99982422
   2   1   -0.99982422
   2   2    0.018749317

BLOCK STAUMIX
   1   1    0.05378819
   1   2    0.99855237
   2   1   -0.99855237
   2   2    0.05378819

BLOCK NMIX
   1   1    0.77156929
   1   2   -0.026528997
   1   3    0.47430964
   1   4   -0.42309268
   2   1    0.043068098
   2   2   -0.028107724
   2   3   -0.70372418
   2   4   -0.70860946
   3   1   -0.63468248
   3   2   -0.03735128
   3   3    0.5288143
   3   4   -0.56226192
   4   1    0.002029631
   4   2   -0.99855448
   4   3   -0.012572939
   4   4    0.052218308

BLOCK UMIX
   1   1   -0.017770185
   1   2    0.9998421
   2   1    0.9998421
   2   2    0.017770185

BLOCK VMIX
   1   1   -0.07381765
   1   2    0.99727176
   2   1    0.99727176
   2   2    0.07381765

BLOCK HIGGSBOUNDSINPUTHIGGSCOUPLINGSFERMIONS
       0, 2777.1986,3,36,15,15

BLOCK HIGGSBOUNDSINPUTHIGGSCOUPLINGSBOSONS
       0,4,36,21,21,23

BLOCK SPHENOLOWENERGY
   1    0.0004087378
   2    1.5880215e-06
   3    3.5223441e-05
   4    1.9014726e-15
   5    8.1214998e-11
   6    1.6212533e-08
   7    6.2472072e-14
   8    2.6682959e-09
   9    5.3637269e-07
   10    6.8671154e-05
   11    0.70934673
   12    0.54293879
   13    19.277846
   14    0
   15    0
   16    0.002163828
   17    2.2817522e-15
   18    2.4787458e-11
   19    8.2870512e-11
   20    6.7032545e-15
   21    2.8657283e-10
   22    8.7962184e-08
   23    0
   24    0
   25    0
   26    0
   27    0
   28    0
   29    0
   30    0
   31    0
   39    8.3233397e-05
   40    0
   41    0
   42    0

BLOCK FWCOEF Q=  160
   305   4422   0   0   -0.18881911
   305   4422   0   2   -0.28105102
   305   4322   0   2   -0.0011814075
   305   6421   0   0   -0.095227835
   305   6421   0   2   -0.1687337
   305   6321   0   2   -0.0011409169
   3051111   4133   0   0    1.5976918
   3051111   4133   0   2    1.5986999
   3051111   4233   0   2    3.6666298e-05
   3051111   4137   0   0   -4.4203839
   3051111   4137   0   2   -4.4158508
   3051111   4237   0   2   -0.00027608384
   3051313   4133   0   0    1.5976918
   3051313   4133   0   2    1.5986962
   3051313   4233   0   2    3.657985e-05
   3051313   4137   0   0   -4.4203839
   3051313   4137   0   2   -4.4158544
   3051313   4237   0   2   -0.00027600848
   3051212   4137   0   0    1.5053501
   3051212   4137   0   2    1.5043684
   3051212   4237   0   2    6.0082811e-05
   3051414   4137   0   0    1.5053501
   3051414   4137   0   2    1.5043684
   3051414   4237   0   2    6.0100985e-05
   3051616   4137   0   0    1.5053501
   3051616   4137   0   2    1.5043684
   3051616   4237   0   2    6.5222423e-05

BLOCK IMFWCOEF Q=  160
   305   4422   0   0    3.8573199e-07
   305   4422   0   2    3.1698323e-05
   305   4322   0   2   -5.3069248e-06
   305   6421   0   0    3.3040496e-07
   305   6421   0   2   -5.5784466e-06
   305   6321   0   2   -2.3123661e-06
   3051111   4133   0   2   -1.0241197e-06
   3051111   4233   0   2    8.9488385e-06
   3051111   4137   0   2    8.8904962e-06
   3051111   4237   0   2   -6.9036068e-05
   3051313   4133   0   2   -1.0240995e-06
   3051313   4233   0   2    8.9487867e-06
   3051313   4137   0   2    8.8905282e-06
   3051313   4237   0   2   -6.9036215e-05
   3051212   4137   0   2   -1.8443316e-06
   3051212   4237   0   2    1.5025972e-05
   3051414   4137   0   2   -1.8443318e-06
   3051414   4237   0   2    1.5025972e-05
   3051616   4137   0   2   -1.8454323e-06
   3051616   4237   0   2    1.502597e-05

DECAY 23  2.4952


DECAY 24  2.085


DECAY 2000011  6.0366598
    0.60779552   2    1000022    11
    0.3903735   2    1000025    11
    0.0018308824   2    1000023    11

DECAY 1000011  2.0208512
    0.49763622   2    1000022    11
    0.45777607   2    1000025    11
    0.028309037   2   -1000037    12
    0.014123665   2    1000035    11
    0.0020697599   2   -1000024    12

DECAY 2000013  6.0849602
    0.60386975   2    1000022    13
    0.38835163   2    1000025    13
    0.0039909515   2   -1000024    14
    0.0037876666   2    1000023    13

DECAY 1000013  2.051708
    0.49358785   2    1000022    13
    0.45501177   2    1000025    13
    0.027863192   2   -1000037    14
    0.013901271   2    1000035    13
    0.007487721   2    1000023    13
    0.0020386026   2   -1000024    14
    0.00010959977   2    2000013    25

DECAY 1000015  17.40281
    0.34696148   2   -1000024    16
    0.27430169   2    1000022    15
    0.20799473   2    1000025    15
    0.1707421   2    1000023    15

DECAY 2000015  9.5866615
    0.399878   2    1000023    15
    0.31833493   2    1000025    15
    0.26395343   2    1000022    15
    0.0085499464   2    1000015    23
    0.0084668875   2    1000015    25
    0.00081681116   2   -1000024    16

DECAY 1000012  2.0605882
    0.63056566   2    1000022    12
    0.28794974   2    1000025    12
    0.034969676   2    1000024    11
    0.025368649   2    1000037    11
    0.012778873   2    1000035    12
    0.0083673962   2    1000023    12

DECAY 1000014  2.091164
    0.62133661   2    1000022    14
    0.283735   2    1000025    14
    0.049124585   2    1000024    13
    0.024977204   2    1000037    13
    0.012581681   2    1000035    14
    0.0082449247   2    1000023    14

DECAY 1000016  9.6070141
    0.80629609   2    1000024    15
    0.12034339   2    1000022    16
    0.054508118   2    1000025    16
    0.017263897   2    1000015    24
    0.0015885066   2    1000023    16

DECAY 2000001  142.49341
    0.98048887   2    1000021    1
    0.01163194   2    1000022    1
    0.0078421476   2    1000025    1

DECAY 1000001  195.02504
    0.72115721   2    1000021    1
    0.18341487   2   -1000037    2
    0.091539389   2    1000035    1
    0.0030299249   2    1000022    1
    0.00064336866   2    1000025    1
    0.00014418091   2    1000023    1

DECAY 2000003  142.55029
    0.98010233   2    1000021    3
    0.011671757   2    1000022    3
    0.0078940914   2    1000025    3
    0.00019764496   2   -1000024    4
    0.00013403247   2    1000023    3

DECAY 1000003  195.05557
    0.7210469   2    1000021    3
    0.18338646   2   -1000037    4
    0.091525211   2    1000035    3
    0.0030619947   2    1000022    3
    0.00068357807   2    1000025    3
    0.0002156313   2    1000023    3

DECAY 1000005  20.87908
    0.46588701   2   -1000024    6
    0.25301496   2    1000023    5
    0.14304092   2    1000025    5
    0.1380571   2    1000022    5

DECAY 2000005  55.298062
    0.54155611   2   -1000024    6
    0.20878157   2    1000023    5
    0.11823549   2    1000025    5
    0.098256307   2    1000022    5
    0.023096729   2    1000006   -24
    0.0064980144   2    1000005    25
    0.0029515032   2    1000005    23
    0.00062427859   2    1000035    5

DECAY 2000002  150.95791
    0.92631823   2    1000021    2
    0.043928799   2    1000022    2
    0.029616181   2    1000025    2
    0.0001365465   2    1000023    2

DECAY 1000002  195.01804
    0.72094587   2    1000021    2
    0.1824562   2    1000037    1
    0.091398511   2    1000035    2
    0.0025401342   2    1000025    2
    0.0013858301   2    1000022    2
    0.0012264733   2    1000024    1

DECAY 2000004  150.96149
    0.92629619   2    1000021    4
    0.043929867   2    1000022    4
    0.029619263   2    1000025    4
    0.00014251682   2    1000023    4

DECAY 1000004  195.04841
    0.72083544   2    1000021    4
    0.18242805   2    1000037    3
    0.091384407   2    1000035    4
    0.0025426456   2    1000025    4
    0.0013872739   2    1000022    4
    0.0013705743   2    1000024    3

DECAY 1000006  51.696989
    0.4301762   2    1000024    5
    0.27309226   2    1000023    6
    0.22081159   2    1000025    6
    0.069933634   2    1000022    6
    0.0029884846   2    1000005    24
    0.0026058979   3    1000022    24    5
    0.00037936667   2    1000022    4

DECAY 2000006  109.53269
    0.32008377   2    1000024    5
    0.16177454   2    1000023    6
    0.1417665   2    1000006    23
    0.13263039   2    2000005    24
    0.096976996   2    1000022    6
    0.087637605   2    1000025    6
    0.043495058   2    1000006    25
    0.01036481   2    1000005    37
    0.0023987952   2    1000037    5
    0.0017671418   2    1000005    24
    0.0011044004   2    1000035    6

DECAY 1000024  5.743151e-05
    0.33409457   3    1000022   -1    2
    0.33257563   3    1000022   -3    4
    0.11137255   3    1000022   -13    14
    0.11137234   3    1000022   -11    12
    0.11058492   3    1000022   -15    16

DECAY 1000037  21.947465
    0.16011169   2    1000024    25
    0.15855239   2    1000023    24
    0.15716857   2    1000024    23
    0.10770098   2    1000025    24
    0.085345085   2    37    1000023
    0.083321612   2    1000024    36
    0.083074397   2    1000024    35
    0.050138658   2    1000022    24
    0.046380586   2    37    1000025
    0.037182608   2    37    1000022
    0.0070152401   3    1000024    6   -6
    0.0052898328   3    1000023   -5    6
    0.0052395475   2    1000016   -15
    0.0049579208   2   -2000015    16
    0.0034965204   3    1000025   -5    6
    0.0028744046   2    1000006   -5
    0.0018283342   3    1000022   -5    6

DECAY 1000022 -1


DECAY 1000023  0.00022890156
    0.20184519   3    1000022    12   -12
    0.15091045   3    1000022    1   -1
    0.15090304   3    1000022    3   -3
    0.14131944   3    1000022    5   -5
    0.11769758   3    1000022    2   -2
    0.11648177   3    1000022    4   -4
    0.034045324   3    1000022    11   -11
    0.034043515   3    1000022    13   -13
    0.033596025   3    1000022    15   -15
    0.019142452   2    1000022    22

DECAY 1000025  2.5733635e-05
    0.099140093   3    1000024    1   -2
    0.099140093   3   -1000024   -1    2
    0.097900065   3    1000024    3   -4
    0.097900065   3   -1000024   -3    4
    0.068960887   3    1000023    12   -12
    0.051573265   3    1000023    1   -1
    0.051561588   3    1000023    3   -3
    0.045472694   2    1000023    22
    0.040222281   3    1000023    2   -2
    0.03838142   3    1000023    4   -4
    0.03397507   3    1000023    5   -5
    0.033044688   3    1000024    11   -12
    0.033044688   3   -1000024   -11    12
    0.033044508   3    1000024    13   -14
    0.033044508   3   -1000024   -13    14
    0.03225288   3    1000024    15   -16
    0.03225288   3   -1000024   -15    16
    0.011852231   3    1000022    5   -5
    0.011641423   3    1000023    11   -11
    0.011637553   3    1000023    13   -13
    0.010625742   3    1000023    15   -15
    0.0078717871   3    1000022    12   -12
    0.0056599421   3    1000022    3   -3
    0.0056598896   3    1000022    1   -1
    0.0044358966   3    1000022    2   -2
    0.0044225122   3    1000022    4   -4
    0.0018860879   2    1000022    22
    0.0013870575   3    1000022    15   -15
    0.0010046856   3    1000022    13   -13
    0.0010035202   3    1000022    11   -11

DECAY 1000035  23.270184
    0.1488447   2    1000024   -24
    0.1488447   2   -1000024    24
    0.10908635   2    1000023    23
    0.10277117   2    1000023    25
    0.077608413   2    37   -1000024
    0.077608413   2   -37    1000024
    0.075337103   2    1000025    25
    0.065028045   2    1000023    35
    0.0347753   2    1000022    25
    0.034576714   2    1000025    35
    0.02625281   2    1000025    23
    0.026207584   2    1000022    35
    0.016605772   2    1000023    36
    0.013991224   2    1000022    23
    0.0095102757   2    1000025    36
    0.009137627   2    1000022    36
    0.0040394092   3    1000024    5   -6
    0.0040394092   3   -1000024   -5    6
    0.0024806393   2    1000016   -16
    0.0024806393   2   -1000016    16
    0.0024085912   3    1000023    6   -6
    0.0023230296   2    2000015   -15
    0.0023230296   2   -2000015    15
    0.001583282   3    1000025    6   -6
    0.00089958411   3    1000022    6   -6
    0.00049270057   3    1000023    5   -5
    0.00027477441   3    1000025    5   -5
    0.00024037625   3    1000022    5   -5

DECAY 1000021  239.85287
    0.16446079   2    1000005   -5
    0.16446079   2   -1000005    5
    0.12988126   2    1000006   -6
    0.12988126   2   -1000006    6
    0.10561923   2    2000005   -5
    0.10561923   2   -2000005    5
    0.070167561   2    2000006   -6
    0.070167561   2   -2000006    6
    0.02936898   2    1000006   -4
    0.02936898   2   -1000006    4
    0.00037749207   3    1000037    5   -6
    0.00037749207   3   -1000037   -5    6
    0.00013161124   3    1000035    6   -6

DECAY 25  0.0040986874
    0.57701069   2   -5    5
    0.22785345   2   -24    24
    0.068646302   2    21    21
    0.067557223   2   -15    15
    0.02785507   2    23    23
    0.026878603   2   -4    4
    0.0022620538   2    22    22
    0.0014824059   2    22    23
    0.00023422958   2   -13    13
    0.0002192218   2   -3    3
    6.0612612e-07   2   -1    1
    1.385103e-07   2   -2    2
    5.2657352e-09   2   -11    11

DECAY 35  27.528638
    0.79862486   2   -5    5
    0.18974418   2   -15    15
    0.0049543538   2    1000022    1000023
    0.0027736198   2    1000023    1000025
    0.0021800859   2    1000022    1000022
    0.00065221823   2   -13    13
    0.00041024965   2   -3    3
    0.00022433995   2   -6    6
    0.00013937911   2    1000025    1000025
    0.00012494198   2   -1000024    1000024
    6.7691319e-05   2    21    21
    4.8375436e-05   2    1000022    1000025
    2.5326725e-05   2    1000023    1000023
    2.3959811e-05   2    25    25
    3.2020256e-06   2   -24    24
    1.9200982e-06   2    23    23
    1.1343114e-06   2   -1    1
    8.9141282e-08   2    22    22
    5.2954021e-08   2    22    23
    1.4654382e-08   2   -11    11
    4.8536831e-09   2   -4    4
    2.5032263e-14   2   -2    2

DECAY 36  26.679138
    0.79766802   2   -5    5
    0.18951987   2   -15    15
    0.0068051028   2    1000022    1000022
    0.0019243583   2    1000025    1000025
    0.0012696485   2    1000022    1000023
    0.00065756395   2   -1000024    1000024
    0.00065143031   2   -13    13
    0.00040974   2   -3    3
    0.00035829122   2    1000023    1000025
    0.00025961775   2   -6    6
    0.00024832722   2    1000022    1000025
    0.00013327642   2    1000023    1000023
    9.0399187e-05   2    21    21
    3.0957493e-06   2    23    25
    1.1329023e-06   2   -1    1
    8.1328167e-08   2    22    22
    2.7882367e-08   2    22    23
    1.4636677e-08   2   -11    11
    4.4918458e-09   2   -4    4
    2.3163722e-14   2   -2    2
    8.5429766e-37   2    25    25

DECAY 37  23.865125
    0.79075237   2   -5    6
    0.19492621   2   -15    16
    0.0072622757   2    1000022    1000024
    0.0046245866   2    1000024    1000025
    0.0012578332   2   -5    4
    0.00068913989   2   -13    14
    0.00042675267   2   -3    4
    2.6055965e-05   2    1000023    1000024
    1.9653953e-05   2   -3    2
    8.9822687e-06   2   -5    2
    3.580565e-06   2    24    25
    1.2757012e-06   2   -3    6
    1.1844701e-06   2   -1    2
    5.4713946e-08   2   -1    4
    3.2398897e-08   2   -1    6
    1.6119054e-08   2   -11    12
    5.6973872e-10   2    24    35
    4.9958639e-10   2    24    36

DECAY 6  2.43
    1   2    5    24

DECAY 15 -1
