BLOCK SPINFO
   1   SPheno
   2   v4.0.5be

BLOCK SPHENOINFO
   1   2
   2   2

BLOCK MODSEL
   1   0

BLOCK MINPAR
   3    26.689469
   4    1

BLOCK EXTPAR
   0    3521.8787
   1   -4761.8403
   2   -4294.4745
   3    2504.922
   11    5382.9672
   12    6856.9757
   13   -2510.3725
   23    897.67733
   25    25.584
   26    2632.9347
   31    3143.8372
   32    3143.8372
   33    1559.965
   34    3678.0709
   35    3678.0709
   36    1792.0374
   41    4688.102
   42    4688.102
   43    3638.7252
   44    1493.2141
   45    1493.2141
   46    3385.6777
   47    2679.5007
   48    2679.5007
   49    4519.2835

BLOCK SMINPUTS
   1    127.90897
   2    1.1663787e-05
   3    0.1184
   4    91.1876
   5    4.18
   6    173.2
   7    1.777
   8    0
   11    0.00051099893
   12    0
   13    0.10565837
   14    0
   21    0.005
   22    0.0025
   23    0.095
   24    1.27

BLOCK GAUGE Q=  3521.8787
   1    0.35536298
   2    0.66519887
   3    1.219778

BLOCK YU Q=  3521.8787
   1   1    8.3907745e-06
   2   2    0.0042625134
   3   3    1.0136729

BLOCK YD Q=  3521.8787
   1   1    0.00043137079
   2   2    0.008196045
   3   3    0.42778465

BLOCK YE Q=  3521.8787
   1   1    7.5277357e-05
   2   2    0.01556497
   3   3    0.26177719

BLOCK AU Q=  3521.8787
   1   1    0
   2   2    0
   3   3    5382.9672

BLOCK AD Q=  3521.8787
   1   1    0
   2   2    0
   3   3    6856.9758

BLOCK AE Q=  3521.8787
   1   1    0
   2   2    0
   3   3   -2510.3725

BLOCK MSOFT Q=  3521.8787
   1   -4761.8403
   2   -4294.4745
   3    2504.922
   21    5988807.9
   22   -599365.3
   31    3143.8372
   32    3143.8372
   33    1559.965
   34    3678.0709
   35    3678.0709
   36    1792.0374
   41    4688.102
   42    4688.102
   43    3638.7252
   44    1493.2141
   45    1493.2141
   46    3385.6777
   47    2679.5007
   48    2679.5007
   49    4519.2835

BLOCK MASS
   6    173.2
   23    91.1876
   24    80.429995
   15    1.777
   25    124.56534
   35    2632.9189
   36    2632.9347
   37    2634.6019
   1000001    4782.5145
   2000001    2792.6009
   1000002    4781.8302
   2000002    1669.3501
   1000003    4782.5127
   2000003    2792.5976
   1000004    4781.8284
   2000004    1669.3495
   1000005    3681.8315
   2000005    4575.5481
   1000006    3341.9793
   2000006    3711.4622
   1000011    3178.9976
   2000011    3690.5329
   1000012    3177.5817
   1000013    3178.9865
   2000013    3690.5129
   1000014    3177.5708
   1000015    1600.4502
   2000015    1798.8819
   1000016    1598.9557
   1000021    2786.4269
   1000022   -915.53863
   1000023    917.58628
   1000025   -4294.6082
   1000035   -4690.2621
   1000024    916.38051
   1000037    4294.7736

BLOCK ALPHA
      -0.037572012

BLOCK HMIX Q=  3521.8787
   1    897.67733
   2    25.584
   3    243.05905
   4    6932345.2

BLOCK STOPMIX
   1   1   -0.28140241
   1   2    0.95958985
   2   1   -0.95958985
   2   2   -0.28140241

BLOCK SBOTMIX
   1   1    0.99999052
   1   2    0.0043542593
   2   1   -0.0043542593
   2   2    0.99999052

BLOCK STAUMIX
   1   1    0.99780365
   1   2    0.066241039
   2   1   -0.066241039
   2   2    0.99780365

BLOCK NMIX
   1   1   -0.0080767312
   1   2    0.015665333
   1   3   -0.70747323
   1   4   -0.70652034
   2   1    0.0058450957
   2   2   -0.011057583
   2   3   -0.70673081
   2   4    0.70737199
   3   1    0.001711529
   3   2    0.99981499
   3   3    0.003266258
   3   4    0.018878184
   4   1   -0.99994883
   4   2    0.0015201329
   4   3    0.0015888335
   4   4    0.0098738476

BLOCK UMIX
   1   1   -0.0046251296
   1   2    0.9999893
   2   1   -0.9999893
   2   2   -0.0046251296

BLOCK VMIX
   1   1    0.026730395
   1   2    0.99964268
   2   1    0.99964268
   2   2   -0.026730395

BLOCK HIGGSBOUNDSINPUTHIGGSCOUPLINGSFERMIONS
       0, 654.54103,3,36,15,15

BLOCK HIGGSBOUNDSINPUTHIGGSCOUPLINGSBOSONS
       0,4,36,21,21,23

BLOCK SPHENOLOWENERGY
   1    0.00033603848
   2    1.5893565e-06
   3    3.526727e-05
   4    2.5652073e-15
   5    1.095829e-10
   6    2.2950258e-08
   7    8.5970539e-14
   8    3.6726642e-09
   9    7.7935948e-07
   10    9.6128807e-05
   11    0.99297377
   12    0.54220994
   13    19.370455
   14    0
   15    0
   16    0.0021583752
   17    2.2816699e-15
   18    2.4807545e-11
   19    8.2925049e-11
   20   -7.2694523e-16
   21   -3.1079088e-11
   22   -1.194562e-08
   23    0
   24    0
   25    0
   26    0
   27    0
   28    0
   29    0
   30    0
   31    0
   39    5.8520412e-05
   40    0
   41    0
   42    0

BLOCK FWCOEF Q=  160
   305   4422   0   0   -0.18881911
   305   4422   0   2   -0.20607502
   305   4322   0   2   -0.00030266683
   305   6421   0   0   -0.095227835
   305   6421   0   2   -0.11058667
   305   6321   0   2   -0.00028447912
   3051111   4133   0   0    1.6220908
   3051111   4133   0   2    1.6226647
   3051111   4233   0   2    0.00013436882
   3051111   4137   0   0   -4.4447829
   3051111   4137   0   2   -4.4445972
   3051111   4237   0   2   -0.0010016164
   3051313   4133   0   0    1.6220908
   3051313   4133   0   2    1.6226644
   3051313   4233   0   2    0.00013436866
   3051313   4137   0   0   -4.4447829
   3051313   4137   0   2   -4.4445976
   3051313   4237   0   2   -0.0010016165
   3051212   4137   0   0    1.5053501
   3051212   4137   0   2    1.5053104
   3051212   4237   0   2    0.00021681083
   3051414   4137   0   0    1.5053501
   3051414   4137   0   2    1.5053104
   3051414   4237   0   2    0.00021681085
   3051616   4137   0   0    1.5053501
   3051616   4137   0   2    1.5053101
   3051616   4237   0   2    0.00021681655

BLOCK IMFWCOEF Q=  160
   305   4422   0   0    3.8579148e-07
   305   4422   0   2   -1.9049038e-06
   305   4322   0   2   -2.5158996e-06
   305   6421   0   0    3.3045591e-07
   305   6421   0   2   -9.9287959e-06
   305   6321   0   2   -1.3533194e-06
   3051111   4133   0   2    5.7157125e-07
   3051111   4233   0   2    2.7966734e-06
   3051111   4137   0   2   -3.010283e-06
   3051111   4237   0   2   -2.0846813e-05
   3051313   4133   0   2    5.7156947e-07
   3051313   4233   0   2    2.7966723e-06
   3051313   4137   0   2   -3.0102842e-06
   3051313   4237   0   2   -2.0846817e-05
   3051212   4137   0   2    6.5900163e-07
   3051212   4237   0   2    4.5125221e-06
   3051414   4137   0   2    6.5900153e-07
   3051414   4237   0   2    4.5125221e-06
   3051616   4137   0   2    6.5378684e-07
   3051616   4237   0   2    4.512521e-06

DECAY 23  2.4952


DECAY 24  2.085


DECAY 1000011  0.002760016
    0.549357   2    1000022    11
    0.26829168   2    1000023    11
    0.18235132   2   -1000024    12

DECAY 2000011  0.0016237261
    0.65622992   2    1000022    11
    0.34354258   2    1000023    11
    0.00022560581   2   -1000024    12

DECAY 1000013  0.015640002
    0.50930211   2    1000022    13
    0.45851821   2    1000023    13
    0.032179675   2   -1000024    14

DECAY 2000013  0.033076344
    0.4734896   2   -1000024    14
    0.2692586   2    1000022    13
    0.2532772   2    1000023    13
    0.0039746011   2    1000013    25

DECAY 1000015  0.99268714
    0.50149385   2    1000022    15
    0.49246959   2    1000023    15
    0.0060365587   2   -1000024    16

DECAY 2000015  2.9180804
    0.45808477   2   -1000024    16
    0.23095008   2    1000023    15
    0.229541   2    1000022    15
    0.042243045   2    1000016   -24
    0.0203884   2    1000015    25
    0.018792708   2    1000015    23

DECAY 1000012  0.02385836
    0.70418539   2    1000024    11
    0.19677866   2    1000022    12
    0.099035942   2    1000023    12

DECAY 1000014  0.036731904
    0.80786135   2    1000024    13
    0.12781244   2    1000022    14
    0.064326208   2    1000023    14

DECAY 1000016  0.98972261
    0.99807437   2    1000024    15
    0.0012824729   2    1000022    16
    0.00064315535   2    1000023    16

DECAY 2000001  0.004438803
    0.96849052   2    1000021    1
    0.019180277   2    1000022    1
    0.010474788   2    1000023    1
    0.0018544146   2   -1000024    2

DECAY 1000001  167.08669
    0.98577812   2    1000021    1
    0.0094406889   2   -1000037    2
    0.0047188499   2    1000025    1

DECAY 2000003  0.010358581
    0.41438156   2    1000021    3
    0.28686569   2   -1000024    4
    0.15146545   2    1000022    3
    0.1472873   2    1000023    3

DECAY 1000003  167.09409
    0.98573329   2    1000021    3
    0.0094401744   2   -1000037    4
    0.0047186097   2    1000025    3

DECAY 1000005  144.14788
    0.45669933   2   -1000024    6
    0.36802976   2    1000021    5
    0.093404877   2    1000006   -24
    0.041003589   2    1000022    5
    0.040862444   2    1000023    5

DECAY 2000005  173.74354
    0.8227762   2    1000021    5
    0.088093944   2   -1000024    6
    0.044211362   2    1000022    5
    0.044122395   2    1000023    5
    0.00032713719   2    1000005    25
    0.00025862061   2    2000006   -24
    0.00015330234   2    1000005    23

DECAY 2000002  0.00018092582
    0.65714612   2    1000022    2
    0.34284758   2    1000023    2

DECAY 1000002  167.03293
    0.98566423   2    1000021    2
    0.0094133407   2    1000037    1
    0.0047141929   2    1000025    2
    0.00016718303   2    1000024    1

DECAY 2000004  0.00077015565
    0.38216547   2    1000024    3
    0.34603569   2    1000022    4
    0.27179884   2    1000023    4

DECAY 1000004  167.04021
    0.98561982   2    1000021    4
    0.009412869   2    1000037    3
    0.0047139313   2    1000025    4
    0.00020257818   2    1000024    3

DECAY 1000006  135.0811
    0.4083001   2    1000024    5
    0.21978049   2    1000022    6
    0.21969756   2    1000023    6
    0.14441081   2    1000021    6
    0.0074080496   2    1000021    4
    0.00040084512   3    1000022    24    5

DECAY 2000006  157.93757
    0.37517118   2    1000021    6
    0.20704399   2    1000023    6
    0.20627484   2    1000022    6
    0.09903752   2    1000024    5
    0.062997875   2    1000006    25
    0.049474599   2    1000006    23

DECAY 1000024  9.8129525e-13
    0.60896847   3    1000022   -1    2
    0.2030343   3    1000022   -11    12
    0.18799724   3    1000022   -13    14

DECAY 1000037  101.77783
    0.1377156   2    1000016   -15
    0.13708979   2   -1000015    16
    0.089599703   2    1000024    25
    0.084727181   2    1000023    24
    0.084643419   2    1000024    23
    0.084571968   2    1000022    24
    0.038018636   2    1000014   -13
    0.038018001   2    1000012   -11
    0.037963026   2   -1000013    14
    0.037962383   2   -1000011    12
    0.03690496   2   -1000005    6
    0.033675665   2    1000024    36
    0.033658935   2    2000006   -5
    0.033604004   2    1000024    35
    0.033581728   2    37    1000023
    0.030488935   2    37    1000022
    0.0097510634   3    1000024    6   -6
    0.0063142254   3    1000022   -5    6
    0.0058695888   3    1000023   -5    6
    0.0050872479   2    1000006   -5
    0.00058489143   2   -2000015    16

DECAY 1000022 -1


DECAY 1000023  2.3186702e-09
    0.9611711   2    1000022    22
    0.010945082   3    1000022    12   -12
    0.0081839633   3    1000022    1   -1
    0.0079822401   3    1000022    3   -3
    0.0063830821   3    1000022    2   -2
    0.0018470166   3    1000022    11   -11
    0.0017758501   3    1000022    13   -13
    0.00051731763   3    1000024    1   -2
    0.00051731763   3   -1000024   -1    2
    0.00017245777   3    1000024    11   -12
    0.00017245777   3   -1000024   -11    12
    0.00016605639   3    1000024    13   -14
    0.00016605639   3   -1000024   -13    14

DECAY 1000025  105.65205
    0.081812595   2    1000024   -24
    0.081812595   2   -1000024    24
    0.067342184   2    1000023    25
    0.06622973   2    1000016   -16
    0.06622973   2   -1000016    16
    0.066124986   2    1000015   -15
    0.066124986   2   -1000015    15
    0.057740422   2    1000022    25
    0.054417184   2    1000023    23
    0.029364031   2    37   -1000024
    0.029364031   2   -37    1000024
    0.027168844   2    1000022    35
    0.026991142   2    1000022    23
    0.023335812   2    1000023    35
    0.018827808   2    1000005   -5
    0.018827808   2   -1000005    5
    0.018308418   2    1000013   -13
    0.018308418   2   -1000013    13
    0.018308108   2    1000011   -11
    0.018308108   2   -1000011    11
    0.018280966   2    1000014   -14
    0.018280966   2   -1000014    14
    0.018280661   2    1000012   -12
    0.018280661   2   -1000012    12
    0.016000548   2    2000006   -6
    0.016000548   2   -2000006    6
    0.0065821603   3    1000024    5   -6
    0.0065821603   3   -1000024   -5    6
    0.0060114662   2    1000023    36
    0.0051719071   2    1000022    36
    0.0050744665   3    1000023    6   -6
    0.0047463309   3    1000022    6   -6
    0.0024796096   2    1000006   -6
    0.0024796096   2   -1000006    6
    0.00028227917   2    2000015   -15
    0.00028227917   2   -2000015    15

DECAY 1000035  121.77096
    0.098394604   2    2000004   -4
    0.098394604   2   -2000004    4
    0.098394569   2    2000002   -2
    0.098394569   2   -2000002    2
    0.07016087   2    2000015   -15
    0.07016087   2   -2000015    15
    0.029296292   2    1000006   -6
    0.029296292   2   -1000006    6
    0.025340598   2    1000024   -24
    0.025340598   2   -1000024    24
    0.019017628   2    1000015   -15
    0.019017628   2   -1000015    15
    0.01900118   2    1000016   -16
    0.01900118   2   -1000016    16
    0.017954813   2    1000023    25
    0.016861889   2    1000023    23
    0.015395228   2    1000022    25
    0.014036067   2    2000013   -13
    0.014036067   2   -2000013    13
    0.014035574   2    2000011   -11
    0.014035574   2   -2000011    11
    0.013438407   2    2000003   -3
    0.013438407   2   -2000003    3
    0.013438372   2    2000001   -1
    0.013438372   2   -2000001    1
    0.01011953   2    37   -1000024
    0.01011953   2   -37    1000024
    0.0088661176   2    1000022    35
    0.0087900023   2    1000022    23
    0.0076173928   2    1000023    35
    0.0071205585   2    1000014   -14
    0.0071205585   2   -1000014    14
    0.0071204753   2    1000012   -12
    0.0071204753   2   -1000012    12
    0.0070293252   2    1000013   -13
    0.0070293252   2   -1000013    13
    0.0070292415   2    1000011   -11
    0.0070292415   2   -1000011    11
    0.0026441788   2    1000023    36
    0.0022717695   2    1000022    36
    0.0021504506   2    2000006   -6
    0.0021504506   2   -2000006    6
    0.001855578   3    1000024    5   -6
    0.001855578   3   -1000024   -5    6
    0.0014822353   3    1000023    6   -6
    0.0013933504   3    1000022    6   -6
    0.0012078655   2    1000005   -5
    0.0012078655   2   -1000005    5

DECAY 1000021  67.914509
    0.24955676   2    2000004   -4
    0.24955676   2   -2000004    4
    0.24955665   2    2000002   -2
    0.24955665   2   -2000002    2
    0.00043326474   3    1000024    5   -6
    0.00043326474   3   -1000024   -5    6
    0.00041118917   3    1000022    6   -6
    0.0004102247   3    1000023    6   -6

DECAY 25  0.0038229955
    0.57958332   2   -5    5
    0.22144213   2   -24    24
    0.072837679   2    21    21
    0.066691776   2   -15    15
    0.028614327   2   -4    4
    0.026575727   2    23    23
    0.0023440038   2    22    22
    0.0014611617   2    22    23
    0.00023131981   2   -13    13
    0.00021780274   2   -3    3
    6.0220258e-07   2   -1    1
    1.4745784e-07   2   -2    2
    5.2003315e-09   2   -11    11

DECAY 35  21.29386
    0.82788472   2   -5    5
    0.16534974   2   -15    15
    0.0053776228   2   -6    6
    0.00059006137   2   -13    13
    0.00033049286   2   -3    3
    0.00030171534   2   -1000024    1000024
    8.6619473e-05   2    1000022    1000022
    3.7522903e-05   2    1000023    1000023
    2.6688585e-05   2    25    25
    6.3776503e-06   2    21    21
    3.7061669e-06   2    1000022    1000023
    2.7490309e-06   2    23    23
    9.8924212e-07   2   -24    24
    9.1376258e-07   2   -1    1
    7.2783459e-08   2   -4    4
    1.3252959e-08   2   -11    11
    7.7394486e-10   2    22    23
    8.4985948e-11   2    22    22
    3.7526074e-13   2   -2    2

DECAY 36  20.560484
    0.82756017   2   -5    5
    0.16528505   2   -15    15
    0.0053975788   2   -6    6
    0.00058982863   2   -13    13
    0.00056886249   2   -1000024    1000024
    0.00033036211   2   -3    3
    0.00014401547   2    1000022    1000022
    8.455633e-05   2    1000023    1000023
    2.9119033e-05   2    21    21
    5.1129458e-06   2    1000022    1000023
    4.2611219e-06   2    23    25
    9.1340055e-07   2   -1    1
    7.1645355e-08   2   -4    4
    5.1603555e-08   2    22    22
    3.4608872e-08   2    22    23
    1.3247807e-08   2   -11    11
    3.6942546e-13   2   -2    2
    2.9462714e-36   2    25    25

DECAY 37  20.541311
    0.81503054   2   -5    6
    0.1827098   2   -15    16
    0.0011988179   2   -5    4
    0.00064594451   2   -13    14
    0.00031000043   2   -3    4
    4.9029449e-05   2    1000023    1000024
    1.6462931e-05   2    1000022    1000024
    1.4493733e-05   2   -3    2
    1.0681756e-05   2   -3    6
    8.5607972e-06   2   -5    2
    4.276714e-06   2    24    25
    8.6005785e-07   2   -1    2
    4.6894275e-07   2   -1    6
    4.439988e-08   2   -1    4
    1.5108709e-08   2   -11    12
    8.9477933e-13   2    24    35
    8.534834e-13   2    24    36

DECAY 6  2.43
    1   2    5    24

DECAY 15 -1
