BLOCK SPINFO
   1   SPheno
   2   v4.0.5be

BLOCK SPHENOINFO
   1   2
   2   2

BLOCK MODSEL
   1   0

BLOCK MINPAR
   3    16.624431
   4   -1

BLOCK EXTPAR
   0    3308.5774
   1   -1926.6033
   2    1024.8145
   3    1895.5338
   11   -4334.6798
   12   -3178.4575
   13   -5212.5611
   23   -965.9949
   25    15.88132
   26    3462.3774
   31    2189.5226
   32    2189.5226
   33    4458.7595
   34    3007.7317
   35    3007.7317
   36    3195.1233
   41    3513.4037
   42    3513.4037
   43    3724.464
   44    4852.3777
   45    4852.3777
   46    2930.7378
   47    2775.2785
   48    2775.2785
   49    4296.6531

BLOCK SMINPUTS
   1    127.90897
   2    1.1663787e-05
   3    0.1184
   4    91.1876
   5    4.18
   6    173.2
   7    1.777
   8    0
   11    0.00051099893
   12    0
   13    0.10565837
   14    0
   21    0.005
   22    0.0025
   23    0.095
   24    1.27

BLOCK GAUGE Q=  3308.5774
   1    0.35536298
   2    0.66519887
   3    1.219778

BLOCK YU Q=  3308.5774
   1   1    8.4009771e-06
   2   2    0.0042676964
   3   3    1.0149055

BLOCK YD Q=  3308.5774
   1   1    0.00026809989
   2   2    0.0050938979
   3   3    0.26587108

BLOCK YE Q=  3308.5774
   1   1    4.6785391e-05
   2   2    0.009673735
   3   3    0.16269631

BLOCK AU Q=  3308.5774
   1   1    0
   2   2    0
   3   3   -4334.6797

BLOCK AD Q=  3308.5774
   1   1    0
   2   2    0
   3   3   -3178.4575

BLOCK AE Q=  3308.5774
   1   1    0
   2   2    0
   3   3   -5212.5611

BLOCK MSOFT Q=  3308.5774
   1   -1926.6033
   2    1024.8145
   3    1895.5338
   21    10977246
   22   -666604.24
   31    2189.5226
   32    2189.5226
   33    4458.7595
   34    3007.7317
   35    3007.7317
   36    3195.1233
   41    3513.4037
   42    3513.4037
   43    3724.464
   44    4852.3777
   45    4852.3777
   46    2930.7378
   47    2775.2785
   48    2775.2785
   49    4296.6531

BLOCK MASS
   6    173.2
   23    91.1876
   24    80.429995
   15    1.777
   25    123.61825
   35    3462.0229
   36    3462.3774
   37    3463.1824
   1000001    3582.5359
   2000001    2846.0041
   1000002    3581.727
   2000002    4910.9503
   1000003    3582.5348
   2000003    2846.0025
   1000004    3581.7259
   2000004    4910.9497
   1000005    3740.3992
   2000005    4348.4277
   1000006    2917.9246
   2000006    3751.5311
   1000011    2201.3231
   2000011    3011.909
   1000012    2199.4973
   1000013    2201.3185
   2000013    3011.9014
   1000014    2199.4928
   1000015    3197.4028
   2000015    4468.427
   1000016    4467.3618
   1000021    2196.8357
   1000022    959.67262
   1000023   -982.89992
   1000025    1098.7016
   1000035   -1915.4479
   1000024    960.78319
   1000037    1098.9615

BLOCK ALPHA
      -0.060193233

BLOCK HMIX Q=  3308.5774
   1   -965.9949
   2    15.88132
   3    243.12382
   4    11988057

BLOCK STOPMIX
   1   1    0.11123793
   1   2    0.9937938
   2   1   -0.9937938
   2   2    0.11123793

BLOCK SBOTMIX
   1   1   -0.99998584
   1   2    0.0053225647
   2   1   -0.0053225647
   2   2   -0.99998584

BLOCK STAUMIX
   1   1   -0.0018508182
   1   2    0.99999829
   2   1   -0.99999829
   2   2   -0.0018508182

BLOCK NMIX
   1   1    0.009093686
   1   2    0.41532357
   1   3    0.65201023
   1   4    0.63427619
   2   1    0.035207542
   2   2    0.028887487
   2   3   -0.70621059
   2   4    0.7065356
   3   1   -0.004329297
   3   2    0.90921456
   3   3   -0.27537981
   3   4   -0.31221164
   4   1    0.99932927
   4   2   -0.00085819528
   4   3    0.01775447
   4   4   -0.032016422

BLOCK UMIX
   1   1   -0.39285326
   1   2   -0.91960117
   2   1    0.91960117
   2   2   -0.39285326

BLOCK VMIX
   1   1   -0.44531103
   1   2    0.89537595
   2   1    0.89537595
   2   2    0.44531103

BLOCK HIGGSBOUNDSINPUTHIGGSCOUPLINGSFERMIONS
       0, 252.21631,3,36,15,15

BLOCK HIGGSBOUNDSINPUTHIGGSCOUPLINGSBOSONS
       0,4,36,21,21,23

BLOCK SPHENOLOWENERGY
   1    0.00033234843
   2    1.5890339e-06
   3    3.5254456e-05
   4    2.431112e-15
   5    1.0385442e-10
   6    2.1745007e-08
   7    8.1966296e-14
   8    3.5016001e-09
   9    7.4286148e-07
   10    9.6659595e-05
   11    0.99845661
   12    0.54233909
   13    19.377526
   14    0
   15    0
   16    0.0021588459
   17    2.281674e-15
   18    2.4799867e-11
   19    8.2905371e-11
   20   -1.2998729e-15
   21   -5.5573832e-11
   22   -7.6136539e-09
   23    0
   24    0
   25    0
   26    0
   27    0
   28    0
   29    0
   30    0
   31    0
   39    3.2520275e-05
   40    0
   41    0
   42    0

BLOCK FWCOEF Q=  160
   305   4422   0   0   -0.18881911
   305   4422   0   2   -0.20252767
   305   4322   0   2   -0.00028580741
   305   6421   0   0   -0.095227835
   305   6421   0   2   -0.10585906
   305   6321   0   2   -0.00021689781
   3051111   4133   0   0    1.6196809
   3051111   4133   0   2    1.6201284
   3051111   4233   0   2    4.8133649e-05
   3051111   4137   0   0   -4.442373
   3051111   4137   0   2   -4.4408645
   3051111   4237   0   2   -0.00036052189
   3051313   4133   0   0    1.6196809
   3051313   4133   0   2    1.6201281
   3051313   4233   0   2    4.8133633e-05
   3051313   4137   0   0   -4.442373
   3051313   4137   0   2   -4.4408647
   3051313   4237   0   2   -0.00036052192
   3051212   4137   0   0    1.5053501
   3051212   4137   0   2    1.5050314
   3051212   4237   0   2    7.8081413e-05
   3051414   4137   0   0    1.5053501
   3051414   4137   0   2    1.5050314
   3051414   4237   0   2    7.8081414e-05
   3051616   4137   0   0    1.5053501
   3051616   4137   0   2    1.5050309
   3051616   4237   0   2    7.8081784e-05

BLOCK IMFWCOEF Q=  160
   305   4422   0   0    3.858055e-07
   305   4422   0   2   -8.1205581e-06
   305   4322   0   2   -3.3200012e-06
   305   6421   0   0    3.3046792e-07
   305   6421   0   2    6.6660356e-06
   305   6321   0   2   -1.4829411e-06
   3051111   4133   0   2    3.9650215e-07
   3051111   4233   0   2    9.5957146e-07
   3051111   4137   0   2   -8.3515421e-07
   3051111   4237   0   2   -7.1861324e-06
   3051313   4133   0   2    3.9649435e-07
   3051313   4233   0   2    9.5957128e-07
   3051313   4137   0   2   -8.3515346e-07
   3051313   4237   0   2   -7.1861331e-06
   3051212   4137   0   2    3.2470888e-07
   3051212   4237   0   2    1.5563642e-06
   3051414   4137   0   2    3.2470898e-07
   3051414   4237   0   2    1.5563642e-06
   3051616   4137   0   2    3.1563255e-07
   3051616   4237   0   2    1.5563649e-06

DECAY 23  2.4952


DECAY 24  2.085


DECAY 1000011  16.988775
    0.54371296   2   -1000037    12
    0.26448285   2    1000025    11
    0.11535989   2   -1000024    12
    0.066055706   2    1000022    11
    0.0095569041   2    1000035    11
    0.00083168592   2    1000023    11

DECAY 2000011  5.3767659
    0.996987   2    1000035    11
    0.0027854204   2    1000023    11
    0.00018790521   2    1000022    11

DECAY 1000013  16.99132
    0.54362891   2   -1000037    14
    0.26445206   2    1000025    13
    0.11534215   2   -1000024    14
    0.06611303   2    1000022    13
    0.0095552128   2    1000035    13
    0.00090863886   2    1000023    13

DECAY 2000013  5.3858015
    0.9953052   2    1000035    13
    0.0031953253   2    1000023    13
    0.00071038619   2   -1000024    14
    0.00054486689   2    1000022    13
    0.0001207467   2   -1000037    14

DECAY 1000015  9.3744524
    0.70348913   2    1000035    15
    0.12651458   2   -1000024    16
    0.075187874   2    1000023    15
    0.063761041   2    1000022    15
    0.020800745   2   -1000037    16
    0.010246632   2    1000025    15

DECAY 2000015  58.241462
    0.50434471   2   -1000037    16
    0.24796531   2    1000025    15
    0.094619253   2   -1000024    16
    0.069780636   2    1000022    15
    0.063931859   2    1000035    15
    0.018944465   2    1000023    15
    0.00020796528   2    1000015    25
    0.00020580312   2    1000015    23

DECAY 1000012  17.015788
    0.51363205   2    1000037    11
    0.26624862   2    1000025    12
    0.14775124   2    1000024    11
    0.06283487   2    1000022    12
    0.0094962091   2    1000035    12

DECAY 1000014  17.01833
    0.51357337   2    1000037    13
    0.26620758   2    1000025    14
    0.14786227   2    1000024    13
    0.062825235   2    1000022    14
    0.0094945284   2    1000035    14

DECAY 1000016  58.25765
    0.48314259   2    1000037    15
    0.24754088   2    1000025    16
    0.15285072   2    1000024    15
    0.064284512   2    1000035    16
    0.051738945   2    1000022    16
    0.00041130487   2    1000015    24

DECAY 2000001  37.172506
    0.98718173   2    1000021    1
    0.012773644   2    1000035    1

DECAY 1000001  149.4858
    0.73652693   2    1000021    1
    0.14641464   2   -1000037    2
    0.071691406   2    1000025    1
    0.028044791   2   -1000024    2
    0.015555977   2    1000022    1
    0.0017200866   2    1000035    1

DECAY 2000003  37.174634
    0.98712135   2    1000021    3
    0.012772883   2    1000035    3

DECAY 1000003  149.48837
    0.73651347   2    1000021    3
    0.14641366   2   -1000037    4
    0.071690888   2    1000025    3
    0.028050096   2   -1000024    4
    0.015560241   2    1000022    3
    0.0017200573   2    1000035    3

DECAY 1000005  265.14919
    0.47777283   2    1000021    5
    0.21500944   2   -1000024    6
    0.13851074   2   -1000037    6
    0.098202805   2    1000006   -24
    0.044091749   2    1000025    5
    0.016731159   2    1000022    5
    0.0085993109   2    1000023    5
    0.0010819677   2    1000035    5

DECAY 2000005  203.03153
    0.93773252   2    1000021    5
    0.022728151   2   -1000024    6
    0.013542921   2    1000023    5
    0.011450985   2    1000022    5
    0.0077657503   2    1000035    5
    0.004321974   2   -1000037    6
    0.0021286068   2    1000025    5
    0.00012536782   2    2000006   -24
    0.00012139258   2    1000005    25

DECAY 1000002  149.45004
    0.73613586   2    1000021    2
    0.13879104   2    1000037    1
    0.071442923   2    1000025    2
    0.036032478   2    1000024    1
    0.015799586   2    1000022    2
    0.001686636   2    1000035    2
    0.00011148569   2    1000023    2

DECAY 2000002  255.90824
    0.96918035   2    1000021    2
    0.030766697   2    1000035    2

DECAY 1000004  149.45251
    0.73612238   2    1000021    4
    0.13879021   2    1000037    3
    0.0714425   2    1000025    4
    0.036040896   2    1000024    3
    0.015802224   2    1000022    4
    0.0016866136   2    1000035    4
    0.00011518081   2    1000023    4

DECAY 2000004  255.91139
    0.96916794   2    1000021    4
    0.030766304   2    1000035    4

DECAY 1000006  138.47802
    0.31412503   2    1000021    6
    0.29222666   2    1000024    5
    0.16674116   2    1000023    6
    0.14486295   2    1000022    6
    0.04530368   2    1000037    5
    0.021920709   2    1000025    6
    0.01481089   2    1000035    6

DECAY 2000006  269.41761
    0.46129   2    1000021    6
    0.12339704   2    1000023    6
    0.10133889   2    1000022    6
    0.09794821   2    1000037    5
    0.073568242   2    1000025    6
    0.068694858   2    1000006    25
    0.049314467   2    1000006    23
    0.023331422   2    1000024    5
    0.0011168705   2    1000035    6

DECAY 1000024  2.0845e-12
    0.65707967   2    1000022    211
    0.17527606   3    1000022   -11    12
    0.16764427   3    1000022   -13    14

DECAY 1000037  1.8938421
    0.47398695   2    1000023    24
    0.24567167   2    1000022    24
    0.19319097   2    1000024    23
    0.087150378   2    1000024    25

DECAY 1000022 -1


DECAY 1000023  6.0956191e-05
    0.10546938   3    1000024    1   -2
    0.10546938   3   -1000024   -1    2
    0.10381968   3    1000024    3   -4
    0.10381968   3   -1000024   -3    4
    0.066601066   3    1000022    12   -12
    0.06302384   2    1000022    22
    0.049801967   3    1000022    1   -1
    0.049792552   3    1000022    3   -3
    0.038842295   3    1000022    2   -2
    0.037351958   3    1000022    4   -4
    0.035155446   3    1000024    11   -12
    0.035155446   3   -1000024   -11    12
    0.035152805   3    1000024    13   -14
    0.035152805   3   -1000024   -13    14
    0.034382984   3    1000022    5   -5
    0.034099742   3    1000024    15   -16
    0.034099742   3   -1000024   -15    16
    0.011238148   3    1000022    11   -11
    0.011234796   3    1000022    13   -13
    0.010336294   3    1000022    15   -15

DECAY 1000025  1.9683929
    0.43294251   2    1000023    23
    0.24168701   2    1000024   -24
    0.24168701   2   -1000024    24
    0.082154937   2    1000022    25
    0.0014600566   2    1000022    23

DECAY 1000035  5.9707325
    0.18849444   2    1000023    25
    0.18681626   2    1000024   -24
    0.18681626   2   -1000024    24
    0.17308358   2    1000022    23
    0.12917688   2    1000022    25
    0.02922567   2    1000037   -24
    0.02922567   2   -1000037    24
    0.027260463   2    1000025    23
    0.018855538   2    1000025    25
    0.016480943   2    1000023    23
    0.0043165155   3    1000024    5   -6
    0.0043165155   3   -1000024   -5    6
    0.0025462726   3    1000023    6   -6
    0.0019300161   3    1000022    6   -6
    0.00053052454   3    1000037    5   -6
    0.00053052454   3   -1000037   -5    6
    0.00019614686   3    1000025    6   -6

DECAY 1000021  0.024750604
    0.16520143   3    1000023    6   -6
    0.14770049   3    1000024    5   -6
    0.14770049   3   -1000024   -5    6
    0.13197887   3    1000022    6   -6
    0.055024445   3    1000037    5   -6
    0.055024445   3   -1000037   -5    6
    0.040163899   3    1000025    6   -6
    0.027544217   3    1000037    3   -4
    0.027544217   3   -1000037   -3    4
    0.027543151   3    1000037    1   -2
    0.027543151   3   -1000037   -1    2
    0.013850776   3    1000025    3   -3
    0.013850063   3    1000025    1   -1
    0.013819538   3    1000025    4   -4
    0.013819201   3    1000025    2   -2
    0.011527411   3    1000025    5   -5
    0.0087415704   3    1000024    3   -4
    0.0087415704   3   -1000024   -3    4
    0.0087353872   3    1000024    1   -2
    0.0087353872   3   -1000024   -1    2
    0.007723559   3    1000022    5   -5
    0.0075664527   2    1000023    21
    0.0067166514   2    1000022    21
    0.0046135155   3    1000023    5   -5
    0.0043314869   3    1000022    4   -4
    0.0043309821   3    1000022    2   -2
    0.0042655297   3    1000022    3   -3
    0.0042597888   3    1000022    1   -1
    0.001191957   2    1000025    21

DECAY 25  0.0037032852
    0.59373451   2   -5    5
    0.20656039   2   -24    24
    0.073603113   2    21    21
    0.06821403   2   -15    15
    0.029380017   2   -4    4
    0.024322345   2    23    23
    0.0023424682   2    22    22
    0.0013826364   2    22    23
    0.00023656371   2   -13    13
    0.00022315331   2   -3    3
    6.1699673e-07   2   -1    1
    1.514065e-07   2   -2    2
    5.3182326e-09   2   -11    11

DECAY 35  42.405715
    0.24263668   2   -5    5
    0.14330396   2   -1000024    1000037
    0.14330396   2   -1000037    1000024
    0.096106644   2   -1000024    1000024
    0.090501459   2    1000023    1000025
    0.062700556   2   -1000037    1000037
    0.045219303   2   -15    15
    0.042772128   2    1000022    1000022
    0.032204043   2    1000025    1000025
    0.029018589   2    1000022    1000023
    0.027701503   2    1000022    1000025
    0.019630801   2    1000022    1000035
    0.0114203   2   -6    6
    0.0066863562   2    1000023    1000035
    0.0064927467   2    1000025    1000035
    0.00015294496   2   -13    13
    9.8547183e-05   2   -3    3
    2.4987135e-05   2    1000023    1000023
    2.050068e-05   2    25    25
    2.2398651e-06   2    23    23
    6.1643089e-07   2    21    21
    5.6293949e-07   2   -24    24
    2.7246801e-07   2   -1    1
    1.4915416e-07   2   -4    4
    1.2952582e-07   2    22    23
    2.0276103e-08   2    22    22
    3.4348902e-09   2   -11    11
    7.6885484e-13   2   -2    2

DECAY 36  41.9548
    0.23656394   2   -5    5
    0.13112982   2   -1000024    1000037
    0.13112982   2   -1000037    1000024
    0.1113264   2   -1000024    1000024
    0.076722386   2   -1000037    1000037
    0.076435779   2    1000023    1000025
    0.048396969   2    1000022    1000022
    0.04408829   2   -15    15
    0.03977279   2    1000025    1000025
    0.033682471   2    1000022    1000025
    0.026399472   2    1000023    1000035
    0.02635032   2    1000022    1000023
    0.010917005   2   -6    6
    0.0053264876   2    1000022    1000035
    0.0014499948   2    1000025    1000035
    0.0001491194   2   -13    13
    9.6080523e-05   2   -3    3
    4.6727647e-05   2    1000023    1000023
    1.1482858e-05   2    21    21
    4.1350441e-06   2    23    25
    2.6564864e-07   2   -1    1
    1.4095544e-07   2   -4    4
    8.0386244e-08   2    22    23
    5.2644402e-09   2    22    22
    3.3489718e-09   2   -11    11
    7.2661235e-13   2   -2    2
    8.1894893e-41   2    25    25

DECAY 37  41.985442
    0.24680511   2   -5    6
    0.23168161   2    1000022    1000037
    0.21748521   2    1000024    1000025
    0.16041777   2    1000023    1000037
    0.064336998   2    1000023    1000024
    0.04558957   2   -15    16
    0.024827971   2    1000024    1000035
    0.0081167982   2    1000035    1000037
    0.00034884163   2   -5    4
    0.00016117538   2   -13    14
    0.00010729964   2    1000022    1000024
    9.001497e-05   2   -3    4
    1.6643569e-05   2   -3    6
    4.2160106e-06   2   -3    2
    4.1368465e-06   2    24    25
    3.1119242e-06   2    1000025    1000037
    2.4910875e-06   2   -5    2
    7.5722787e-07   2   -1    6
    2.4938692e-07   2   -1    2
    1.8575183e-08   2   -1    4
    3.7699088e-09   2   -11    12
    6.79586e-14   2    24    35

DECAY 6  2.43
    1   2    5    24

DECAY 15 -1
