BLOCK SPINFO
   1   SPheno
   2   v4.0.5be

BLOCK SPHENOINFO
   1   2
   2   2

BLOCK MODSEL
   1   0

BLOCK MINPAR
   3    53.067294
   4   -1

BLOCK EXTPAR
   0    4101.6228
   1   -1062.0281
   2    1289.7492
   3    4000
   11   -50.395046
   12   -66.153476
   13   -1871.4337
   23   -1458.8323
   25    53.264597
   26    2000
   31    551.60939
   32    551.60939
   33    2000
   34    1798.2068
   35    1798.2068
   36    2000
   41    4000
   42    4000
   43    4000
   44    4000
   45    4000
   46    4000
   47    4000
   48    4000
   49    4000

BLOCK SMINPUTS
   1    127.90897
   2    1.1663787e-05
   3    0.1184
   4    91.1876
   5    4.18
   6    173.2
   7    1.777
   8    0
   11    0.00051099893
   12    0
   13    0.10565837
   14    0
   21    0.005
   22    0.0025
   23    0.095
   24    1.27

BLOCK GAUGE Q=  4101.6228
   1    0.35536298
   2    0.66519887
   3    1.219778

BLOCK YU Q=  4101.6228
   1   1    8.3858496e-06
   2   2    0.0042600116
   3   3    1.013078

BLOCK YD Q=  4101.6228
   1   1    0.00089756511
   2   2    0.017053737
   3   3    0.89010334

BLOCK YE Q=  4101.6228
   1   1    0.00015663168
   2   2    0.032386463
   3   3    0.54468703

BLOCK AU Q=  4101.6228
   1   1    0
   2   2    0
   3   3   -50.395046

BLOCK AD Q=  4101.6228
   1   1    0
   2   2    0
   3   3   -66.153476

BLOCK AE Q=  4101.6228
   1   1    0
   2   2    0
   3   3   -1871.4337

BLOCK MSOFT Q=  4101.6228
   1   -1062.0281
   2    1289.7492
   3    4000
   21    2391357.1
   22   -1792709.7
   31    551.60939
   32    551.60939
   33    2000
   34    1798.2068
   35    1798.2068
   36    2000
   41    4000
   42    4000
   43    4000
   44    4000
   45    4000
   46    4000
   47    4000
   48    4000
   49    4000

BLOCK MASS
   6    173.2
   23    91.1876
   24    80.429995
   15    1.777
   25    120.824
   35    1999.2356
   36    2000
   37    2001.4619
   1000001    4156.3929
   2000001    4142.9278
   1000002    4155.6247
   2000002    4144.9699
   1000003    4156.3975
   2000003    4142.8887
   1000004    4155.6129
   2000004    4144.9691
   1000005    4067.2201
   2000005    4118.6373
   1000006    4095.5661
   2000006    4107.6885
   1000011    599.40955
   2000011    1802.4706
   1000012    593.75029
   1000013    599.34237
   2000013    1802.4235
   1000014    593.70843
   1000015    1953.9178
   2000015    2022.1156
   1000016    1998.1302
   1000021    4249.1304
   1000022   -1043.3786
   1000023    1313.2436
   1000025   -1473.174
   1000035    1489.0192
   1000024    1313.3599
   1000037    1489.5666
   1000039    1e-09

BLOCK ALPHA
      -0.018942823

BLOCK HMIX Q=  4101.6228
   1   -1458.8323
   2    53.264597
   3    242.93732
   4    4000000

BLOCK STOPMIX
   1   1    0.54349495
   1   2    0.83941243
   2   1   -0.83941243
   2   2    0.54349495

BLOCK SBOTMIX
   1   1   -0.57987977
   1   2    0.81470206
   2   1   -0.81470206
   2   2   -0.57987977

BLOCK STAUMIX
   1   1   -0.5703773
   1   2    0.82138281
   2   1   -0.82138281
   2   2   -0.5703773

BLOCK NMIX
   1   1    0.9971279
   1   2    0.0015136863
   1   3   -0.061432194
   1   4    0.044268964
   2   1   -0.0038020757
   2   2   -0.94987615
   2   3   -0.23426815
   2   4   -0.20697652
   3   1    0.074748991
   3   2   -0.020180169
   3   3    0.70417759
   3   4   -0.70578982
   4   1    0.011579266
   4   2   -0.31197078
   4   3    0.66744172
   4   4    0.67606339

BLOCK UMIX
   1   1   -0.94118089
   1   2   -0.33790314
   2   1    0.33790314
   2   2   -0.94118089

BLOCK VMIX
   1   1   -0.95405639
   1   2    0.29962709
   2   1    0.29962709
   2   2    0.95405639

BLOCK HIGGSBOUNDSINPUTHIGGSCOUPLINGSFERMIONS
       0, 2837.1173,3,36,15,15

BLOCK HIGGSBOUNDSINPUTHIGGSCOUPLINGSBOSONS
       0,4,36,21,21,23

BLOCK SPHENOLOWENERGY
   1    0.00033579952
   2    1.5886389e-06
   3    3.5253736e-05
   4    1.8549265e-15
   5    7.923988e-11
   6    1.6559309e-08
   7    6.3315382e-14
   8    2.7048204e-09
   9    5.7303248e-07
   10    9.302938e-05
   11    0.96095788
   12    0.54182627
   13    19.337185
   14    0
   15    0
   16    0.0021569458
   17    2.2816593e-15
   18    2.4799573e-11
   19    8.2904679e-11
   20   -2.6511092e-15
   21   -1.1329314e-10
   22   -4.0700833e-08
   23    0
   24    0
   25    0
   26    0
   27    0
   28    0
   29    0
   30    0
   31    0
   39    7.9256492e-05
   40    0
   41    0
   42    0

BLOCK FWCOEF Q=  160
   305   4422   0   0   -0.18881911
   305   4422   0   2   -0.20527973
   305   4322   0   2   -0.00034006235
   305   6421   0   0   -0.095227835
   305   6421   0   2   -0.11210046
   305   6321   0   2   -0.000348117
   3051111   4133   0   0    1.6286051
   3051111   4133   0   2    1.6288025
   3051111   4233   0   2    0.00023260126
   3051111   4137   0   0   -4.4512972
   3051111   4137   0   2   -4.4497798
   3051111   4237   0   2   -0.0017163717
   3051313   4133   0   0    1.6286051
   3051313   4133   0   2    1.6287999
   3051313   4233   0   2    0.00023259649
   3051313   4137   0   0   -4.4512972
   3051313   4137   0   2   -4.4497824
   3051313   4237   0   2   -0.0017163706
   3051212   4137   0   0    1.5053501
   3051212   4137   0   2    1.5050275
   3051212   4237   0   2    0.00037098478
   3051414   4137   0   0    1.5053501
   3051414   4137   0   2    1.5050275
   3051414   4237   0   2    0.00037098563
   3051616   4137   0   0    1.5053501
   3051616   4137   0   2    1.5050276
   3051616   4237   0   2    0.00037122582

BLOCK IMFWCOEF Q=  160
   305   4422   0   0    3.8581722e-07
   305   4422   0   2   -1.0477376e-05
   305   4322   0   2   -1.5755356e-06
   305   6421   0   0    3.3047797e-07
   305   6421   0   2    2.9841777e-06
   305   6321   0   2   -5.5483456e-07
   3051111   4133   0   2    4.6533037e-08
   3051111   4233   0   2    6.6047331e-06
   3051111   4137   0   2   -7.3552088e-07
   3051111   4237   0   2   -4.8749073e-05
   3051313   4133   0   2    4.6521178e-08
   3051313   4233   0   2    6.6047187e-06
   3051313   4137   0   2   -7.3552635e-07
   3051313   4237   0   2   -4.8749125e-05
   3051212   4137   0   2    2.5655854e-07
   3051212   4237   0   2    1.0536854e-05
   3051414   4137   0   2    2.565579e-07
   3051414   4237   0   2    1.0536854e-05
   3051616   4137   0   2    2.5709971e-07
   3051616   4237   0   2    1.0536854e-05

DECAY 23  2.4952


DECAY 24  2.085


DECAY 1000011  1.030547e-07
    0.86040534   2    1000039    11
    0.052523436   3    1000012    1   -2
    0.041187506   3    1000012    3   -4
    0.017477492   3    1000012    13   -14
    0.017471321   3    1000012    11   -12
    0.010931877   3    1000012    15   -16

DECAY 2000011  3.9869539
    0.99855741   2    1000022    11
    0.0013990749   2    1000025    11

DECAY 1000013  1.0267291e-07
    0.86312086   2    1000039    13
    0.051551943   3    1000014    1   -2
    0.040338065   3    1000014    3   -4
    0.017184064   3    1000014    11   -12
    0.017118135   3    1000014    13   -14
    0.010684161   3    1000014    15   -16

DECAY 2000013  4.0060783
    0.99372865   2    1000022    13
    0.0027168537   2    1000013    25
    0.0019046206   2    1000025    13
    0.0008358374   2   -1000037    14
    0.00045216463   2    1000035    13
    0.00023583966   2   -1000024    14
    0.00012058757   2    1000023    13

DECAY 1000015  10.732028
    0.3679212   2    1000022    15
    0.28119948   2   -1000024    16
    0.14690532   2    1000023    15
    0.093299305   2    1000025    15
    0.056173001   2    1000035    15
    0.05449865   2   -1000037    16

DECAY 2000015  11.091585
    0.22988452   2    1000022    15
    0.20306703   2   -1000024    16
    0.17264564   2   -1000037    16
    0.14938535   2    1000035    15
    0.12570654   2    1000025    15
    0.11927267   2    1000023    15

DECAY 1000012  8.456133e-08
    1   2    1000039    12

DECAY 1000014  8.4531527e-08
    1   2    1000039    14

DECAY 1000016  12.01903
    0.46636392   2    1000024    15
    0.21212452   2    1000023    16
    0.1970842   2    1000037    15
    0.10921763   2    1000022    16
    0.014645713   2    1000035    16
    0.00055083969   2    1000025    16

DECAY 2000001  2.0288525
    0.99427067   2    1000022    1
    0.0048732228   2    1000025    1
    0.00068934876   2    1000039    1
    0.00012696935   2    1000035    1

DECAY 1000001  44.677475
    0.58781431   2   -1000024    2
    0.29894808   2    1000023    1
    0.071030385   2   -1000037    2
    0.03068179   2    1000035    1
    0.011141918   2    1000022    1
    0.00035170649   2    1000025    1

DECAY 2000003  2.0653507
    0.97672718   2    1000022    3
    0.0091660678   2    1000025    3
    0.0077944807   2   -1000037    4
    0.0040344931   2    1000035    3
    0.0010721771   2   -1000024    4
    0.00067713483   2    1000039    3
    0.0005284703   2    1000023    3

DECAY 1000003  44.697045
    0.58755958   2   -1000024    4
    0.29884173   2    1000023    3
    0.071023317   2   -1000037    4
    0.0308498   2    1000035    3
    0.011138841   2    1000022    3
    0.00055493516   2    1000025    3

DECAY 1000005  116.75422
    0.30852013   2   -1000037    6
    0.21817603   2   -1000024    6
    0.19701829   2    1000025    5
    0.14371268   2    1000035    5
    0.11033973   2    1000023    5
    0.022222216   2    1000022    5

DECAY 2000005  138.7202
    0.49056788   2   -1000037    6
    0.2013216   2    1000035    5
    0.18394357   2    1000025    5
    0.08012927   2   -1000024    6
    0.041952022   2    1000023    5
    0.0020758666   2    1000022    5

DECAY 2000002  8.1158978
    0.99483356   2    1000022    2
    0.0048643433   2    1000025    2
    0.00017275196   2    1000039    2
    0.00011599955   2    1000035    2

DECAY 1000002  44.715285
    0.60333548   2    1000024    1
    0.29946812   2    1000023    2
    0.055787202   2    1000037    1
    0.029846727   2    1000035    2
    0.011515956   2    1000022    2

DECAY 2000004  8.1181772
    0.99455425   2    1000022    4
    0.0049327438   2    1000025    4
    0.00017992597   2    1000035    4
    0.00017270322   2    1000039    4
    0.000127249   2    1000037    3

DECAY 1000004  44.734596
    0.60312257   2    1000024    3
    0.29933842   2    1000023    4
    0.056123087   2    1000037    3
    0.029845674   2    1000035    4
    0.011510989   2    1000022    4

DECAY 1000006  141.91772
    0.30349473   2    1000037    5
    0.22212958   2    1000025    6
    0.17862439   2    1000024    5
    0.15873007   2    1000035    6
    0.085321121   2    1000023    6
    0.036752756   2    1000022    6
    0.013676142   2    1000023    4
    0.00073470913   3    1000022    24    5
    0.00052727416   2    1000022    4

DECAY 2000006  151.10166
    0.39707615   2    1000037    5
    0.24274654   2    1000035    6
    0.20794242   2    1000025    6
    0.086795673   2    1000024    5
    0.04198682   2    1000023    6
    0.023443597   2    1000022    6

DECAY 1000024  13.107867
    0.25419734   2    1000014   -13
    0.25410514   2    1000012   -11
    0.24489424   2   -1000013    14
    0.24486536   2   -1000011    12
    0.001934788   2    1000022    24

DECAY 1000037  4.837149
    0.17550863   2    1000023    24
    0.16529269   2    1000022    24
    0.14754268   2    1000024    23
    0.1188073   2    1000024    25
    0.10870668   2   -1000013    14
    0.10869727   2   -1000011    12
    0.08811105   2    1000014   -13
    0.086088459   2    1000012   -11
    0.0012370833   3    1000022   -5    6

DECAY 1000022  2.3615468
    0.12544514   2    1000014   -14
    0.12544514   2   -1000014    14
    0.1254282   2    1000012   -12
    0.1254282   2   -1000012    12
    0.12458113   2    1000013   -13
    0.12458113   2   -1000013    13
    0.12454522   2    1000011   -11
    0.12454522   2   -1000011    11

DECAY 1000023  13.178207
    0.12472088   2    1000014   -14
    0.12472088   2   -1000014    14
    0.12471184   2    1000012   -12
    0.12471184   2   -1000012    12
    0.12459773   2    1000013   -13
    0.12459773   2   -1000013    13
    0.12454813   2    1000011   -11
    0.12454813   2   -1000011    11
    0.001876349   2    1000022    23
    0.0009652312   2    1000022    25

DECAY 1000025  5.1756494
    0.23925702   2    1000024   -24
    0.23925702   2   -1000024    24
    0.23826217   2    1000023    23
    0.14466332   2    1000023    25
    0.12526918   2    1000022    25
    0.0039921956   2    1000022    23
    0.0015879864   2    1000014   -14
    0.0015879864   2   -1000014    14
    0.0015878996   2    1000012   -12
    0.0015878996   2   -1000012    12
    0.0011954995   2    1000013   -13
    0.0011954995   2   -1000013    13
    0.00017019819   2    1000011   -11
    0.00017019819   2   -1000011    11
    0.00016677504   2    1000023    22

DECAY 1000035  5.2724705
    0.14963626   2    1000022    23
    0.13776359   2    1000024   -24
    0.13776359   2   -1000024    24
    0.11808186   2    1000022    25
    0.11278057   2    1000023    25
    0.044499256   2    1000014   -14
    0.044499256   2   -1000014    14
    0.044496884   2    1000012   -12
    0.044496884   2   -1000012    12
    0.041733788   2    1000013   -13
    0.041733788   2   -1000013    13
    0.040806441   2    1000011   -11
    0.040806441   2   -1000011    11
    0.0008279724   2    1000023    23

DECAY 1000021  5.8919206
    0.095080995   3    1000035    6   -6
    0.092144873   3    1000025    6   -6
    0.076578179   2    1000005   -5
    0.076578179   2   -1000005    5
    0.068173312   3    1000037    5   -6
    0.068173312   3   -1000037   -5    6
    0.037820229   2    2000005   -5
    0.037820229   2   -2000005    5
    0.026027194   2    2000003   -3
    0.026027194   2   -2000003    3
    0.026008288   2    2000001   -1
    0.026008288   2   -2000001    1
    0.025029883   2    2000002   -2
    0.025029883   2   -2000002    2
    0.025028458   2    2000004   -4
    0.025028458   2   -2000004    4
    0.020225538   2    1000004   -4
    0.020225538   2   -1000004    4
    0.020222332   2    1000002   -2
    0.020222332   2   -1000002    2
    0.019895062   2    1000001   -1
    0.019895062   2   -1000001    1
    0.019893105   2    1000003   -3
    0.019893105   2   -1000003    3
    0.018311241   3    1000023    6   -6
    0.016602161   3    1000024    5   -6
    0.016602161   3   -1000024   -5    6
    0.013781129   3    1000022    6   -6
    0.0079590287   2    1000006   -4
    0.0079590287   2   -1000006    4
    0.000731523   2    1000035    21
    0.00064981549   2    1000025    21
    0.00026939904   2    1000039    21

DECAY 25  0.0034260683
    0.63620851   2   -5    5
    0.16351641   2   -24    24
    0.074400214   2    21    21
    0.072565475   2   -15    15
    0.031176616   2   -4    4
    0.018196765   2    23    23
    0.0023035213   2    22    22
    0.0011412653   2    22    23
    0.00025137117   2   -13    13
    0.00023903057   2   -3    3
    6.6089608e-07   2   -1    1
    1.606741e-07   2   -2    2
    5.6511424e-09   2   -11    11

DECAY 35  93.280087
    0.89917212   2   -5    5
    0.099738643   2   -15    15
    0.00045603342   2   -6    6
    0.00034472582   2   -3    3
    0.00026496445   2   -13    13
    2.0746894e-05   2    21    21
    1.1136638e-06   2    25    25
    9.5306417e-07   2   -1    1
    2.0903229e-07   2    23    23
    1.1087878e-07   2   -24    24
    4.2842158e-08   2   -1000011    1000011
    4.1839457e-08   2   -1000013    1000013
    6.3547003e-09   2   -4    4
    5.9517132e-09   2   -11    11
    5.9498393e-09   2    22    22
    1.4758365e-09   2    22    23
    3.2762349e-14   2   -2    2

DECAY 36  86.146654
    0.8991547   2   -5    5
    0.099737838   2   -15    15
    0.0004656468   2   -6    6
    0.00034471308   2   -3    3
    0.0002649686   2   -13    13
    3.0738098e-05   2    21    21
    9.5302982e-07   2   -1    1
    3.0587628e-07   2    23    25
    6.9456177e-08   2    22    23
    5.2649033e-08   2    22    22
    6.2695781e-09   2   -4    4
    5.9518076e-09   2   -11    11
    3.2331793e-14   2   -2    2
    1.8161056e-36   2    25    25

DECAY 37  92.797074
    0.87645644   2   -5    6
    0.12146796   2   -15    16
    0.0013042041   2   -5    4
    0.00042943299   2   -13    14
    0.00031546092   2   -3    4
    1.4704871e-05   2   -3    2
    9.3133674e-06   2   -5    2
    9.0781874e-07   2   -3    6
    8.7533295e-07   2   -1    2
    2.8498602e-07   2    24    25
    1.6872673e-07   2   -1000011    1000012
    1.6731189e-07   2   -1000013    1000014
    4.0872421e-08   2   -1    4
    2.0494157e-08   2   -1    6
    1.0044482e-08   2   -11    12
    8.0167569e-13   2    24    35
    9.7910991e-14   2    24    36

DECAY 6  2.43
    1   2    5    24

DECAY 15 -1


DECAY 1000039 -1
