BLOCK DCINFO
   1   SDECAY/HDECAY
   2   1.3b /3.4

BLOCK SPINFO
   1   SOFTSUSY
   2   3.4.0

BLOCK MODSEL
   1   0

BLOCK SMINPUTS
   1    127.90897
   2    1.1663787e-05
   3    0.1184
   4    91.1876
   5    4.18
   6    173.2
   7    1.777

BLOCK MINPAR
   3    29.68

BLOCK EXTPAR
   0   -1
   1   -553.64
   2   -1326.48
   3    2783.13
   11   -3309.94
   12    3197.24
   13    102.55
   23    353.37
   26    1984.03
   31    313.81
   32    313.81
   33    487
   34    3924.89
   35    3924.89
   36    3079.94
   41    2673.46
   42    2673.46
   43    1733.04
   44    3253.67
   45    3253.67
   46    3780.85
   47    1175.85
   48    1175.85
   49    1488.49

BLOCK MASS
   24    80.377088
   25    125.64437
   35    1984.0322
   36    1984.0301
   37    1986.0152
   5    4.8187603
   1000001    2771.877
   2000001    1306.987
   1000002    2770.8784
   2000002    3327.0628
   1000003    2771.877
   2000003    1306.987
   1000004    2770.8784
   2000004    3327.0628
   1000005    1592.6458
   2000005    1832.3394
   1000006    1830.8139
   2000006    3799.5929
   1000011    369.806
   2000011    3927.8863
   1000012    361.00218
   1000013    369.806
   2000013    3927.8863
   1000014    361.00218
   1000015    520.97138
   2000015    3078.6554
   1000016    514.68386
   1000021    2882.5868
   1000022   -360.38196
   1000023    370.74851
   1000025   -553.33965
   1000035   -1350.5202
   1000024    367.13777
   1000037    1350.6854

BLOCK NMIX
   1   1    0.15347031
   1   2   -0.053669959
   1   3    0.70522042
   1   4    0.6900946
   2   1    0.03450691
   2   2   -0.034086272
   2   3   -0.70372016
   2   4    0.70881968
   3   1    0.98754461
   3   2    0.01299846
   3   3   -0.08495387
   3   4   -0.13179345
   4   1   -0.003430834
   4   2    0.99789213
   4   3    0.014997838
   4   4    0.063044371

BLOCK UMIX
   1   1   -0.021237526
   1   2    0.99977446
   2   1   -0.99977446
   2   2   -0.021237526

BLOCK VMIX
   1   1    0.089171718
   1   2    0.99601627
   2   1    0.99601627
   2   2   -0.089171718

BLOCK STOPMIX
   1   1    0.99909281
   1   2    0.042585878
   2   1   -0.042585878
   2   2    0.99909281

BLOCK SBOTMIX
   1   1    0.020282194
   1   2    0.9997943
   2   1   -0.9997943
   2   2    0.020282194

BLOCK STAUMIX
   1   1    0.99999826
   1   2    0.0018638661
   2   1   -0.0018638661
   2   2    0.99999826

BLOCK ALPHA
      -0.035046951

BLOCK HMIX Q=  2560.977
   1    359.0418
   2    28.672287
   3    242.40027
   4    3880731.4

BLOCK GAUGE Q=  2560.977
   1    0.36471973
   2    0.64025579
   3    1.0162765

BLOCK AU Q=  2560.977
   1   1    0
   2   2    0
   3   3   -3309.94

BLOCK AD Q=  2560.977
   1   1    0
   2   2    0
   3   3    3197.24

BLOCK AE Q=  2560.977
   1   1    0
   2   2    0
   3   3    102.55

BLOCK YU Q=  2560.977
   1   1    0
   2   2    0
   3   3    0.82056323

BLOCK YD Q=  2560.977
   1   1    0
   2   2    0
   3   3    0.37377526

BLOCK YE Q=  2560.977
   1   1    0
   2   2    0
   3   3    0.27936675

BLOCK MSOFT Q=  2560.977
   1   -553.64
   2   -1326.48
   3    2783.13
   21    3857066.9
   22   -80181.186
   31    313.81
   32    313.81
   33    487
   34    3924.89
   35    3924.89
   36    3079.94
   41    2673.46
   42    2673.46
   43    1733.04
   44    3253.67
   45    3253.67
   46    3780.85
   47    1175.85
   48    1175.85
   49    1488.49

BLOCK HIGGSBOUNDSINPUTHIGGSCOUPLINGSFERMIONS
       0, 822.10004,3,36,15,15

BLOCK HIGGSBOUNDSINPUTHIGGSCOUPLINGSBOSONS
       0,4,36,21,21,23

DECAY 6  1.4442784
    1   2    5    24

DECAY 1000021  136.6114
    0.12910775   2    2000001   -1
    0.12910775   2   -2000001    1
    0.12910775   2    2000003   -3
    0.12910775   2   -2000003    3
    0.096436541   2    1000005   -5
    0.096436541   2   -1000005    5
    0.071094602   2    2000005   -5
    0.071094602   2   -2000005    5
    0.069567757   2    1000006   -6
    0.069567757   2   -1000006    6
    0.0011817401   2    1000002   -2
    0.0011817401   2   -1000002    2
    0.0011816167   2    1000004   -4
    0.0011816167   2   -1000004    4
    0.0011611169   2    1000001   -1
    0.0011611169   2   -1000001    1
    0.0011611169   2    1000003   -3
    0.0011611169   2   -1000003    3

DECAY 1000006  31.537343
    0.35065919   2    1000023    6
    0.33310326   2    1000022    6
    0.1488413   2    1000024    5
    0.098307431   2    1000037    5
    0.048817487   2    1000035    6
    0.019666346   2    1000025    6
    0.00060498286   2    1000005    24

DECAY 2000006  201.95126
    0.24648513   2    1000024    5
    0.1788899   2    1000021    6
    0.14007787   2    2000005    24
    0.12433071   2    1000023    6
    0.11924011   2    1000022    6
    0.073153893   2    1000006    25
    0.07202482   2    1000006    23
    0.044823715   2    1000025    6
    0.0006031551   2    1000037    5
    0.00029895437   2    1000035    6
    7.1469312e-05   2    1000005    24
    2.6286793e-07   2    1000005    37

DECAY 1000005  8.5549048
    0.45075222   2   -1000024    6
    0.23633572   2    1000022    5
    0.22847945   2    1000023    5
    0.08442142   2    1000025    5
    7.3966709e-06   2   -1000037    6
    3.7972732e-06   2    1000035    5

DECAY 2000005  31.571671
    0.69618977   2   -1000024    6
    0.097708853   2   -1000037    6
    0.074927506   2    1000022    5
    0.074125573   2    1000023    5
    0.049228391   2    1000035    5
    0.0072195564   2    1000025    5
    0.00030056003   2    1000005    23
    0.00029978874   2    1000005    25

DECAY 1000002  19.67147
    0.64614051   2    1000037    1
    0.32391397   2    1000035    2
    0.020665046   2    1000025    2
    0.0085493439   2    1000024    1
    0.00040727735   2    1000023    2
    0.00032385046   2    1000022    2

DECAY 2000002  22.631062
    0.68811811   2    1000021    2
    0.30392334   2    1000025    2
    0.007573454   2    1000022    2
    0.00038237054   2    1000023    2
    2.7195592e-06   2    1000035    2

DECAY 1000001  19.61736
    0.65331512   2   -1000037    2
    0.3259029   2    1000035    1
    0.015702902   2    1000025    1
    0.0037026801   2    1000022    1
    0.00088995522   2    1000023    1
    0.00048643795   2   -1000024    2

DECAY 2000001  0.53235113
    0.96890216   2    1000025    1
    0.029614911   2    1000022    1
    0.0014829285   2    1000023    1

DECAY 1000004  20.168684
    0.64603913   2    1000037    3
    0.32386328   2    1000035    4
    0.02076324   2    1000025    4
    0.0085989815   2    1000024    3
    0.00040963294   2    1000023    4
    0.00032574368   2    1000022    4

DECAY 2000004  18.738939
    0.60481494   2    1000021    4
    0.38508912   2    1000025    4
    0.0096074803   2    1000022    4
    0.00048503254   2    1000023    4
    3.4294365e-06   2    1000035    4

DECAY 1000003  20.113289
    0.65324442   2   -1000037    4
    0.32586835   2    1000035    3
    0.015778291   2    1000025    3
    0.0037245089   2    1000022    3
    0.00089514648   2    1000023    3
    0.00048928577   2   -1000024    4

DECAY 2000003  0.52118151
    0.96886122   2    1000025    3
    0.029653992   2    1000022    3
    0.0014847914   2    1000023    3

DECAY 1000011  4.6311016e-06
    0.93927674   2    1000022    11
    0.060723256   2   -1000024    12

DECAY 2000011  19.983749
    0.97468208   2    1000025    11
    0.024091655   2    1000022    11
    0.001216745   2    1000023    11
    9.520994e-06   2    1000035    11

DECAY 1000013  4.6308211e-06
    0.93927307   2    1000022    13
    0.060726934   2   -1000024    14

DECAY 2000013  19.983749
    0.97468208   2    1000025    13
    0.024091655   2    1000022    13
    0.001216745   2    1000023    13
    9.520994e-06   2    1000035    13

DECAY 1000015  0.20825058
    0.52836424   2    1000022    15
    0.46912223   2    1000023    15
    0.0025135323   2   -1000024    16

DECAY 2000015  24.688403
    0.60409664   2    1000025    15
    0.18803139   2   -1000024    16
    0.10869172   2    1000022    15
    0.093931987   2    1000023    15
    0.0023749998   2    1000016   -24
    0.0012497173   2    1000015    25
    0.0012186383   2    1000015    23
    0.00013845584   2    1000016   -37
    8.2150836e-05   2   -1000037    16
    6.9173187e-05   2    1000015    35
    6.9095123e-05   2    1000015    36
    4.6032405e-05   2    1000035    15

DECAY 1000012  3.454048e-07
    1   2    1000022    12

DECAY 1000014  3.454048e-07
    1   2    1000022    14

DECAY 1000016  0.21377854
    0.9426605   2    1000024    15
    0.050776363   2    1000022    16
    0.0065631353   2    1000023    16

DECAY 1000024  2.6154453e-05
    0.5   2    1000012   -11
    0.5   2    1000014   -13

DECAY 1000037  37.183274
    0.12669842   2    1000012   -11
    0.12669842   2    1000014   -13
    0.12668852   2   -1000011    12
    0.12668852   2   -1000013    14
    0.10738306   2    1000016   -15
    0.10727383   2   -1000015    16
    0.070995261   2    1000024    23
    0.06951081   2    1000023    24
    0.068981362   2    1000024    25
    0.065285891   2    1000022    24
    0.0037959092   2    1000025    24

DECAY 1000022 -1


DECAY 1000023  2.352619e-05
    0.2498275   2    1000012   -12
    0.2498275   2   -1000012    12
    0.2498275   2    1000014   -14
    0.2498275   2   -1000014    14
    0.00017249736   2    1000011   -11
    0.00017249736   2   -1000011    11
    0.00017249736   2    1000013   -13
    0.00017249736   2   -1000013    13

DECAY 1000025  1.6037072
    0.11147296   2    1000024   -24
    0.11147296   2   -1000024    24
    0.098239214   2    1000022    25
    0.088903454   2    1000023    23
    0.071353456   2    1000011   -11
    0.071353456   2   -1000011    11
    0.071353456   2    1000013   -13
    0.071353456   2   -1000013    13
    0.070087619   2    1000012   -12
    0.070087619   2   -1000012    12
    0.070087619   2    1000014   -14
    0.070087619   2   -1000014    14
    0.0079260502   2    1000022    23
    0.0038626655   2    1000016   -16
    0.0038626655   2   -1000016    16
    0.0029956819   2    1000015   -15
    0.0029956819   2   -1000015    15
    0.0025043602   2    1000023    25

DECAY 1000035  37.178317
    0.069527328   2    1000024   -24
    0.069527328   2   -1000024    24
    0.063835668   2    1000012   -12
    0.063835668   2   -1000012    12
    0.063835668   2    1000014   -14
    0.063835668   2   -1000014    14
    0.062857212   2    1000011   -11
    0.062857212   2   -1000011    11
    0.062857212   2    1000013   -13
    0.062857212   2   -1000013    13
    0.054093618   2    1000016   -16
    0.054093618   2   -1000016    16
    0.053229665   2    1000015   -15
    0.053229665   2   -1000015    15
    0.051447769   2    1000023    23
    0.046748914   2    1000022    25
    0.018849828   2    1000022    23
    0.018663017   2    1000023    25
    0.0031944285   2    1000025    25
    0.00062329552   2    1000025    23
    1.6760488e-09   2    2000001   -1
    1.6760488e-09   2   -2000001    1
    1.6760488e-09   2    2000003   -3
    1.6760488e-09   2   -2000003    3

DECAY 25  0.0042362075
    0.59651886   2    5   -5
    0.21314499   2    24   -24
    0.076600466   2    21    21
    0.062069981   2   -15    15
    0.02682778   2    23    23
    0.020557854   2    4   -4
    0.002260394   2    22    22
    0.0015606047   2    22    23
    0.00023935046   2    3   -3
    0.00021971662   2   -13    13

DECAY 35  29.283162
    0.62235653   2    5   -5
    0.124321   2   -15    15
    0.060096354   2    1000024   -1000037
    0.060096354   2    1000037   -1000024
    0.043332452   2    1000023    1000035
    0.031609738   2    1000023    1000025
    0.026505963   2    1000022    1000025
    0.017053965   2    1000022    1000035
    0.0045603003   2    1000022    1000022
    0.0037179251   2    1000024   -1000024
    0.0034999921   2    6   -6
    0.00077515071   2    1000022    1000023
    0.00070129296   2    1000025    1000025
    0.00058335316   2    1000023    1000023
    0.00044484744   2   -13    13
    0.00024681266   2    3   -3
    5.672581e-05   2    1000025    1000035
    1.7234539e-05   2    21    21
    1.3288646e-05   2    25    25
    2.8909041e-06   2    24   -24
    1.7749292e-06   2    1000012   -1000012
    1.7749292e-06   2    1000014   -1000014
    1.6290466e-06   2    1000016   -1000016
    1.4398488e-06   2    23    23
    5.4250102e-07   2    1000011   -1000011
    5.4250102e-07   2    1000013   -1000013
    6.7811306e-08   2    1000015   -1000015
    3.6162624e-08   2    4   -4
    1.6909903e-08   2    22    22
    8.975369e-09   2    23    22

DECAY 36  29.289553
    0.6222545   2    5   -5
    0.12429568   2   -15    15
    0.059890109   2    1000024   -1000037
    0.059890109   2    1000037   -1000024
    0.043608345   2    1000022    1000035
    0.029129368   2    1000022    1000025
    0.028612165   2    1000023    1000025
    0.016303308   2    1000023    1000035
    0.0045804545   2    1000022    1000022
    0.0041664937   2    1000024   -1000024
    0.00353666   2    6   -6
    0.00092004502   2    1000022    1000023
    0.00081913273   2    1000025    1000025
    0.00078054598   2    1000023    1000023
    0.00046855151   2    1000025    1000035
    0.00044475539   2   -13    13
    0.00024678311   2    3   -3
    5.0000426e-05   2    21    21
    2.9145371e-06   2    23    25
    3.6105149e-08   2    4   -4
    3.2088199e-08   2    23    22
    1.9520248e-08   2    22    22

DECAY 37  28.281967
    0.61244696   2    6   -5
    0.12885269   2   -15    16
    0.067358209   2    1000024    1000025
    0.063463505   2    1000037    1000022
    0.062619651   2    1000024    1000035
    0.061950742   2    1000037    1000023
    0.0010274602   2    4   -5
    0.00063527597   2    1000024    1000022
    0.00055639375   2    1000037    1000025
    0.0004610613   2   -13    14
    0.00034486796   2    1000024    1000023
    0.00025149678   2    4   -3
    1.277552e-05   2    2   -3
    1.0274575e-05   2    2   -5
    3.0318873e-06   2    24    25
    2.2010635e-06   2   -1000011    1000012
    2.2010635e-06   2   -1000013    1000014
    1.2117756e-06   2   -1000015    1000016
    1.4331673e-12   2    24    36

DECAY 5 -1


DECAY 15 -1


DECAY 23  2.4952


DECAY 24  2.085
