BLOCK SPINFO
   1   SPheno
   2   v4.0.5be

BLOCK SPHENOINFO
   1   2
   2   2

BLOCK MODSEL
   1   0

BLOCK MINPAR
   3    29.197847
   4    1

BLOCK EXTPAR
   0    1558.8497
   1    1028.3417
   2   -344.38333
   3    3000
   11   -3042.4904
   12   -1187.9159
   13   -662.69598
   23    412.91259
   25    28.30688
   26    2116.463
   31    371.95266
   32    371.95266
   33    1334.7143
   34    1905.7302
   35    1905.7302
   36    340.44104
   41    5000
   42    5000
   43    1512.7811
   44    5000
   45    5000
   46    1677.6855
   47    5000
   48    5000
   49    1118.4859

BLOCK SMINPUTS
   1    127.90897
   2    1.1663787e-05
   3    0.1184
   4    91.1876
   5    4.18
   6    173.2
   7    1.777
   8    0
   11    0.00051099893
   12    0
   13    0.10565837
   14    0
   21    0.005
   22    0.0025
   23    0.095
   24    1.27

BLOCK GAUGE Q=  1558.8497
   1    0.35536298
   2    0.66519887
   3    1.219778

BLOCK YU Q=  1558.8497
   1   1    8.3896024e-06
   2   2    0.004261918
   3   3    1.0135314

BLOCK YD Q=  1558.8497
   1   1    0.0004772145
   2   2    0.0090670754
   3   3    0.47324724

BLOCK YE Q=  1558.8497
   1   1    8.3277419e-05
   2   2    0.017219129
   3   3    0.28959743

BLOCK AU Q=  1558.8497
   1   1    0
   2   2    0
   3   3   -3042.4903

BLOCK AD Q=  1558.8497
   1   1    0
   2   2    0
   3   3   -1187.9159

BLOCK AE Q=  1558.8497
   1   1    0
   2   2    0
   3   3   -662.69599

BLOCK MSOFT Q=  1558.8497
   1    1028.3417
   2   -344.38333
   3    3000
   21    4325469.8
   22   -123954.36
   31    371.95266
   32    371.95266
   33    1334.7143
   34    1905.7302
   35    1905.7302
   36    340.44104
   41    5000
   42    5000
   43    1512.7811
   44    5000
   45    5000
   46    1677.6855
   47    5000
   48    5000
   49    1118.4859

BLOCK MASS
   6    173.2
   23    91.1876
   24    80.429995
   15    1.777
   25    123.99291
   35    2115.8692
   36    2116.463
   37    2117.8556
   1000001    5031.9379
   2000001    5021.0771
   1000002    5031.4889
   2000002    5022.3597
   1000003    5031.94
   2000003    5021.0797
   1000004    5031.4907
   2000004    5022.3604
   1000005    1121.8039
   2000005    1506.2631
   1000006    1416.4918
   2000006    1715.5145
   1000011    382.56222
   2000011    1908.8598
   1000012    373.77848
   1000013    382.55253
   2000013    1908.8521
   1000014    373.77332
   1000015    348.63358
   2000015    1337.5525
   1000016    1334.7135
   1000021    3192.8898
   1000022   -335.50873
   1000023    420.75726
   1000025   -454.37463
   1000035    1027.0117
   1000024    336.65632
   1000037    457.14851

BLOCK ALPHA
      -0.034386581

BLOCK HMIX Q=  1558.8497
   1    412.91259
   2    28.30688
   3    243.9496
   4    4479415.8

BLOCK STOPMIX
   1   1    0.84878182
   1   2    0.52874324
   2   1   -0.52874324
   2   2    0.84878182

BLOCK SBOTMIX
   1   1    0.02840824
   1   2    0.9995964
   2   1   -0.9995964
   2   2    0.02840824

BLOCK STAUMIX
   1   1    0.01301735
   1   2    0.99991527
   2   1   -0.99991527
   2   2    0.01301735

BLOCK NMIX
   1   1    0.010342274
   1   2    0.83930311
   1   3   -0.42754213
   1   4   -0.33566508
   2   1    0.053335532
   2   2    0.074844529
   2   3    0.70237874
   2   4   -0.70584539
   3   1   -0.017972807
   3   2    0.53847896
   3   3    0.56863816
   3   4    0.62158509
   4   1    0.99836133
   4   2   -0.0029991121
   4   3   -0.022857417
   4   4    0.052375635

BLOCK UMIX
   1   1   -0.80743606
   1   2    0.58995509
   2   1   -0.58995509
   2   2   -0.80743606

BLOCK VMIX
   1   1    0.88623213
   1   2    0.46324141
   2   1    0.46324141
   2   2   -0.88623213

BLOCK HIGGSBOUNDSINPUTHIGGSCOUPLINGSFERMIONS
       0, 801.27945,3,36,15,15

BLOCK HIGGSBOUNDSINPUTHIGGSCOUPLINGSBOSONS
       0,4,36,21,21,23

BLOCK SPHENOLOWENERGY
   1    0.00029635102
   2    1.5922954e-06
   3    3.5207883e-05
   4    2.6881845e-15
   5    1.1483575e-10
   6    2.4009855e-08
   7    9.0250907e-14
   8    3.8555023e-09
   9    8.1684241e-07
   10    9.5888273e-05
   11    0.99048915
   12    0.54254425
   13    19.380191
   14    0
   15    0
   16    0.0021594152
   17    2.2816807e-15
   18    2.4780373e-11
   19    8.2851932e-11
   20   -1.6892804e-14
   21   -7.2228675e-10
   22   -8.1148746e-08
   23    0
   24    0
   25    0
   26    0
   27    0
   28    0
   29    0
   30    0
   31    0
   39    9.4008738e-05
   40    0
   41    0
   42    0

BLOCK FWCOEF Q=  160
   305   4422   0   0   -0.18881911
   305   4422   0   2   -0.15713874
   305   4322   0   2    2.5560342e-05
   305   6421   0   0   -0.095227835
   305   6421   0   2   -0.088850766
   305   6321   0   2   -0.00018369503
   3051111   4133   0   0    1.5933793
   3051111   4133   0   2    1.5941097
   3051111   4233   0   2    0.00011588048
   3051111   4137   0   0   -4.4160714
   3051111   4137   0   2   -4.4098805
   3051111   4237   0   2   -0.00089848002
   3051313   4133   0   0    1.5933793
   3051313   4133   0   2    1.5941064
   3051313   4233   0   2    0.00011587999
   3051313   4137   0   0   -4.4160714
   3051313   4137   0   2   -4.4098837
   3051313   4237   0   2   -0.00089848073
   3051212   4137   0   0    1.5053501
   3051212   4137   0   2    1.5040421
   3051212   4237   0   2    0.00019575122
   3051414   4137   0   0    1.5053501
   3051414   4137   0   2    1.5040421
   3051414   4237   0   2    0.00019575128
   3051616   4137   0   0    1.5053501
   3051616   4137   0   2    1.5040403
   3051616   4237   0   2    0.00019576831

BLOCK IMFWCOEF Q=  160
   305   4422   0   0    3.858558e-07
   305   4422   0   2   -1.479123e-05
   305   4322   0   2    4.3130279e-06
   305   6421   0   0    3.3051101e-07
   305   6421   0   2   -1.1689403e-05
   305   6321   0   2    1.6130165e-06
   3051111   4133   0   2   -3.227664e-06
   3051111   4233   0   2    2.7009335e-06
   3051111   4137   0   2    1.9397942e-05
   3051111   4237   0   2   -2.0957939e-05
   3051313   4133   0   2   -3.2278113e-06
   3051313   4233   0   2    2.70093e-06
   3051313   4137   0   2    1.9398173e-05
   3051313   4237   0   2   -2.0957957e-05
   3051212   4137   0   2   -3.4591095e-06
   3051212   4237   0   2    4.5660891e-06
   3051414   4137   0   2   -3.4591084e-06
   3051414   4237   0   2    4.5660891e-06
   3051616   4137   0   2   -3.4995727e-06
   3051616   4237   0   2    4.5660804e-06

DECAY 23  2.4952


DECAY 24  2.085


DECAY 1000011  0.17579326
    0.63562339   2   -1000024    12
    0.36437609   2    1000022    11

DECAY 2000011  4.8547766
    0.9941463   2    1000035    11
    0.0050872521   2    1000023    11
    0.00056792254   2    1000025    11
    0.00019847475   2    1000022    11

DECAY 1000013  0.17574508
    0.63556021   2   -1000024    14
    0.36443927   2    1000022    13

DECAY 2000013  4.8753822
    0.98993484   2    1000035    13
    0.0060969139   2    1000023    13
    0.0013379161   2   -1000037    14
    0.0012300822   2    1000025    13
    0.00075458391   2   -1000024    14
    0.00059411327   2    1000022    13

DECAY 1000015  0.0016289512
    0.61400593   2   -1000024    16
    0.38599407   2    1000022    15

DECAY 2000015  17.263473
    0.38681928   2   -1000024    16
    0.23264262   2    1000022    15
    0.18801679   2   -1000037    16
    0.10877381   2    1000025    15
    0.054901674   2    1000023    15
    0.016180697   2    1000035    15
    0.0063588118   2    1000015    23
    0.0063063167   2    1000015    25

DECAY 1000012  0.13526082
    0.68081351   2    1000024    11
    0.31918649   2    1000022    12

DECAY 1000014  0.1352627
    0.68089543   2    1000024    13
    0.31910457   2    1000022    14

DECAY 1000016  17.340768
    0.50598986   2    1000024    15
    0.2066946   2    1000022    16
    0.1783429   2    1000037    15
    0.079546753   2    1000025    16
    0.016217243   2    1000035    16
    0.012618269   2    1000015    24
    0.00059038851   2    1000023    16

DECAY 2000001  143.18453
    0.98202145   2    1000021    1
    0.017915024   2    1000035    1

DECAY 1000001  208.07248
    0.68120808   2    1000021    1
    0.13755406   2   -1000024    2
    0.073991777   2    1000022    1
    0.072877413   2   -1000037    2
    0.03072541   2    1000025    1
    0.0031950033   2    1000035    1
    0.00044826086   2    1000023    1

DECAY 2000003  143.20095
    0.98191071   2    1000021    3
    0.017913009   2    1000035    3

DECAY 1000003  208.08261
    0.68117594   2    1000021    3
    0.13754922   2   -1000024    4
    0.073995344   2    1000022    3
    0.072880708   2   -1000037    4
    0.030736485   2    1000025    3
    0.0031948685   2    1000035    3
    0.00046742769   2    1000023    3

DECAY 1000005  7.1974358
    0.2717719   2   -1000037    6
    0.2521256   2    1000023    5
    0.20819235   2   -1000024    6
    0.14848718   2    1000025    5
    0.11714785   2    1000022    5
    0.0022751277   2    1000035    5

DECAY 2000005  48.952441
    0.50076877   2   -1000037    6
    0.25361126   2   -1000024    6
    0.10575033   2    1000022    5
    0.071566431   2    1000025    5
    0.05822062   2    1000023    5
    0.0046287659   2    1000006   -24
    0.0025845279   2    1000005    25
    0.001547941   2    1000005    23
    0.001321363   2    1000035    5

DECAY 2000002  151.04364
    0.9318084   2    1000021    2
    0.067951856   2    1000035    2
    0.00020827777   2    1000023    2

DECAY 1000002  208.06829
    0.68099712   2    1000021    2
    0.16569962   2    1000024    1
    0.074638781   2    1000022    2
    0.044930283   2    1000037    1
    0.030001348   2    1000025    2
    0.0029862504   2    1000035    2
    0.00074659988   2    1000023    2

DECAY 2000004  151.04723
    0.93178634   2    1000021    4
    0.067950281   2    1000035    4
    0.00021417199   2    1000023    4

DECAY 1000004  208.07833
    0.6809649   2    1000021    4
    0.16570531   2    1000024    3
    0.074636195   2    1000022    4
    0.044953406   2    1000037    3
    0.030003197   2    1000025    4
    0.0029861272   2    1000035    4
    0.0007508621   2    1000023    4

DECAY 1000006  43.553753
    0.33571592   2    1000037    5
    0.26879258   2    1000025    6
    0.24094288   2    1000023    6
    0.069064092   2    1000024    5
    0.063755568   2    1000022    6
    0.013437451   2    1000022    4
    0.0046477888   2    1000035    6
    0.0023285815   3    1000022    24    5
    0.001189075   2    1000005    24
    0.00012606132   2    1000023    4

DECAY 2000006  84.87964
    0.19567351   2    1000024    5
    0.19112126   2    1000023    6
    0.1389857   2    1000037    5
    0.11331144   2    1000006    23
    0.10682256   2    2000005    24
    0.10424623   2    1000022    6
    0.096480985   2    1000025    6
    0.036352012   2    1000006    25
    0.01534282   2    1000035    6
    0.0016634781   2    1000005    24

DECAY 1000024  1.4555985e-11
    0.56276592   3    1000022   -1    2
    0.22321655   3    1000022   -11    12
    0.21401752   3    1000022   -13    14

DECAY 1000037  1.2640627
    0.65062352   2    1000022    24
    0.14169789   2    1000024    23
    0.049771515   2   -1000013    14
    0.049759724   2   -1000011    12
    0.037619146   2    1000014   -13
    0.037533851   2    1000012   -11
    0.032939568   2   -1000015    16

DECAY 1000022 -1


DECAY 1000023  0.080623595
    0.21568511   2    1000015   -15
    0.21568511   2   -1000015    15
    0.1546183   2    1000024   -24
    0.1546183   2   -1000024    24
    0.048258056   3    1000022    12   -12
    0.036083302   3    1000022    1   -1
    0.036083048   3    1000022    3   -3
    0.035672591   3    1000022    5   -5
    0.028143136   3    1000022    2   -2
    0.028096555   3    1000022    4   -4
    0.0081431399   3    1000022    11   -11
    0.0081430467   3    1000022    13   -13
    0.0081135321   3    1000022    15   -15
    0.0039086727   2    1000013   -13
    0.0039086727   2   -1000013    13
    0.0036840271   2    1000011   -11
    0.0036840271   2   -1000011    11
    0.0030832046   2    1000022    22
    0.0010971487   2    1000014   -14
    0.0010971487   2   -1000014    14
    0.0010969219   2    1000012   -12
    0.0010969219   2   -1000012    12

DECAY 1000025  2.0861615
    0.43640233   2    1000024   -24
    0.43640233   2   -1000024    24
    0.015051217   2    1000014   -14
    0.015051217   2   -1000014    14
    0.015049478   2    1000012   -12
    0.015049478   2   -1000012    12
    0.011381569   2    1000013   -13
    0.011381569   2   -1000013    13
    0.011362595   2    1000011   -11
    0.011362595   2   -1000011    11
    0.0095502018   2    1000015   -15
    0.0095502018   2   -1000015    15
    0.0023401885   2    1000022    23

DECAY 1000035  10.995177
    0.18304428   2    1000015   -15
    0.18304428   2   -1000015    15
    0.051027058   2    1000023    25
    0.044505995   2    1000014   -14
    0.044505995   2   -1000014    14
    0.04450562   2    1000012   -12
    0.04450562   2   -1000012    12
    0.042886983   2    1000013   -13
    0.042886983   2   -1000013    13
    0.042886144   2    1000011   -11
    0.042886144   2   -1000011    11
    0.040914495   2    1000037   -24
    0.040914495   2   -1000037    24
    0.037319046   2    1000025    23
    0.028640398   2    1000025    25
    0.02091898   2    1000024   -24
    0.02091898   2   -1000024    24
    0.018211652   2    1000022    23
    0.014697113   2    1000022    25
    0.0086781703   2    1000023    23
    0.0004695545   3    1000037    5   -6
    0.0004695545   3   -1000037   -5    6
    0.00030266937   3    1000024    5   -6
    0.00030266937   3   -1000024   -5    6
    0.00018368752   3    1000023    6   -6

DECAY 1000021  246.52957
    0.14725266   2    1000005   -5
    0.14725266   2   -1000005    5
    0.11587787   2    2000005   -5
    0.11587787   2   -2000005    5
    0.1098315   2    2000006   -6
    0.1098315   2   -2000006    6
    0.10851816   2    1000006   -6
    0.10851816   2   -1000006    6
    0.018413715   2    1000006   -4
    0.018413715   2   -1000006    4

DECAY 25  0.003762156
    0.58964486   2   -5    5
    0.21169649   2   -24    24
    0.072751498   2    21    21
    0.067643641   2   -15    15
    0.028961678   2   -4    4
    0.025116167   2    23    23
    0.0023229355   2    22    22
    0.0014066599   2    22    23
    0.00023419143   2   -13    13
    0.0002211173   2   -3    3
    6.1136586e-07   2   -1    1
    1.4924928e-07   2   -2    2
    5.2648955e-09   2   -11    11

DECAY 35  46.177256
    0.40007328   2   -5    5
    0.10175428   2   -1000024    1000037
    0.10175428   2   -1000037    1000024
    0.085384904   2   -1000024    1000024
    0.077670231   2   -15    15
    0.055446631   2    1000022    1000023
    0.040459249   2    1000022    1000022
    0.037036428   2   -1000037    1000037
    0.026606216   2    1000025    1000025
    0.023675517   2    1000023    1000025
    0.015498551   2    1000022    1000025
    0.013679722   2    1000025    1000035
    0.0092971359   2    1000023    1000035
    0.0049752931   2    1000022    1000035
    0.0019899619   2   -6    6
    0.0019714534   2   -2000015    1000015
    0.0019714534   2   -1000015    2000015
    0.00033021333   2    1000023    1000023
    0.00023752947   2   -13    13
    0.00016560965   2   -3    3
    8.3702476e-06   2    21    21
    5.1120191e-06   2    25    25
    2.9589946e-06   2   -1000015    1000015
    1.1023427e-06   2    23    23
    5.3913204e-07   2   -24    24
    4.9923016e-07   2    1000035    1000035
    4.5784722e-07   2   -1    1
    3.0701183e-07   2    22    23
    3.0258417e-07   2   -1000011    1000011
    3.0127594e-07   2   -1000013    1000013
    1.0076505e-07   2    22    22
    3.1056717e-08   2   -4    4
    5.3353719e-09   2   -11    11
    1.6011519e-13   2   -2    2

DECAY 36  45.198003
    0.39056045   2   -5    5
    0.10402878   2   -1000024    1000037
    0.10402878   2   -1000037    1000024
    0.087239737   2   -1000024    1000024
    0.075824737   2   -15    15
    0.057852013   2    1000022    1000023
    0.040970908   2    1000022    1000022
    0.037831668   2   -1000037    1000037
    0.028465672   2    1000025    1000025
    0.022691196   2    1000023    1000025
    0.018768394   2    1000023    1000035
    0.015173625   2    1000022    1000025
    0.0068157819   2    1000025    1000035
    0.0029515445   2    1000022    1000035
    0.0020165109   2   -2000015    1000015
    0.0020165109   2   -1000015    2000015
    0.0018777184   2   -6    6
    0.00045834627   2    1000023    1000023
    0.00023187982   2   -13    13
    0.00016166848   2   -3    3
    1.805672e-05   2    21    21
    1.3834167e-05   2    1000035    1000035
    1.5418129e-06   2    23    25
    4.4695262e-07   2   -1    1
    1.5766605e-07   2    22    23
    2.8583626e-08   2   -4    4
    1.3992034e-08   2    22    22
    5.2084581e-09   2   -11    11
    1.4737604e-13   2   -2    2
    5.1574415e-38   2    25    25

DECAY 37  46.792249
    0.40961785   2   -5    6
    0.17239483   2    1000022    1000037
    0.14854082   2    1000024    1000025
    0.12735336   2    1000023    1000024
    0.077164755   2   -15    16
    0.032467012   2    1000023    1000037
    0.019824078   2    1000035    1000037
    0.0072148902   2    1000024    1000035
    0.0039112037   2   -1000015    1000016
    0.00060597003   2   -5    4
    0.00045520441   2    1000025    1000037
    0.00027280515   2   -13    14
    0.0001476478   2   -3    4
    1.0663485e-05   2    1000022    1000024
    6.88597e-06   2   -3    2
    4.3272527e-06   2   -5    2
    3.2907519e-06   2   -3    6
    1.4941288e-06   2    24    25
    1.1700408e-06   2   -1000011    1000012
    1.168232e-06   2   -1000013    1000014
    4.0954155e-07   2   -1    2
    1.4101278e-07   2   -1    6
    2.0345322e-08   2   -1    4
    6.3809409e-09   2   -11    12
    8.9928565e-13   2    24    35
    1.5233679e-13   2    24    36

DECAY 6  2.43
    1   2    5    24

DECAY 15 -1
