BLOCK SPINFO
   1   SPheno
   2   v4.0.5be

BLOCK SPHENOINFO
   1   2
   2   2

BLOCK MODSEL
   1   0

BLOCK MINPAR
   3    30.90407
   4   -1

BLOCK EXTPAR
   0    3992.1838
   1   -2733.538
   2    2492.0993
   3    4449.0867
   11   -6636.0616
   12   -7874.0505
   13    1559.6966
   23   -906.19285
   25    29.799162
   26    2382.3484
   31    4803.5142
   32    4803.5142
   33    1797.6753
   34    4089.7794
   35    4089.7794
   36    3823.4427
   41    1467.3961
   42    1467.3961
   43    4118.6035
   44    4460.4566
   45    4460.4566
   46    3765.5431
   47    4322.4968
   48    4322.4968
   49    3212.1728

BLOCK SMINPUTS
   1    127.90897
   2    1.1663787e-05
   3    0.1184
   4    91.1876
   5    4.18
   6    173.2
   7    1.777
   8    0
   11    0.00051099893
   12    0
   13    0.10565837
   14    0
   21    0.005
   22    0.0025
   23    0.095
   24    1.27

BLOCK GAUGE Q=  3992.1838
   1    0.35536298
   2    0.66519887
   3    1.219778

BLOCK YU Q=  3992.1838
   1   1    8.3890918e-06
   2   2    0.0042616586
   3   3    1.0134697

BLOCK YD Q=  3992.1838
   1   1    0.00050234171
   2   2    0.0095444925
   3   3    0.49816556

BLOCK YE Q=  3992.1838
   1   1    8.7662302e-05
   2   2    0.018125784
   3   3    0.30484586

BLOCK AU Q=  3992.1838
   1   1    0
   2   2    0
   3   3   -6636.0615

BLOCK AD Q=  3992.1838
   1   1    0
   2   2    0
   3   3   -7874.0519

BLOCK AE Q=  3992.1838
   1   1    0
   2   2    0
   3   3    1559.6966

BLOCK MSOFT Q=  3992.1838
   1   -2733.538
   2    2492.0993
   3    4449.0867
   21    4880793
   22   -565994.77
   31    4803.5142
   32    4803.5142
   33    1797.6753
   34    4089.7794
   35    4089.7794
   36    3823.4427
   41    1467.3961
   42    1467.3961
   43    4118.6035
   44    4460.4566
   45    4460.4566
   46    3765.5431
   47    4322.4968
   48    4322.4968
   49    3212.1728

BLOCK MASS
   6    173.2
   23    91.1876
   24    80.429995
   15    1.777
   25    125.63643
   35    2382.3011
   36    2382.3484
   37    2383.9162
   1000001    1743.8286
   2000001    4469.2665
   1000002    1741.9878
   2000002    4603.5341
   1000003    1743.8238
   2000003    4469.2615
   1000004    1741.9832
   2000004    4603.5335
   1000005    3359.575
   2000005    4196.0791
   1000006    3770.2264
   2000006    4227.208
   1000011    4818.4133
   2000011    4099.7371
   1000012    4817.3484
   1000013    4818.3996
   2000013    4099.7087
   1000014    4817.3345
   1000015    1830.2507
   2000015    3826.1691
   1000016    1829.262
   1000021    4593.1388
   1000022    921.22401
   1000023   -923.24305
   1000025    2494.6455
   1000035   -2710.8427
   1000024    921.89669
   1000037    2494.8276

BLOCK ALPHA
      -0.032474861

BLOCK HMIX Q=  3992.1838
   1   -906.19285
   2    29.799162
   3    242.93655
   4    5675584

BLOCK STOPMIX
   1   1    0.2607089
   1   2    0.96541746
   2   1   -0.96541746
   2   2    0.2607089

BLOCK SBOTMIX
   1   1   -0.0063874808
   1   2    0.9999796
   2   1   -0.9999796
   2   2   -0.0063874808

BLOCK STAUMIX
   1   1   -0.99999068
   1   2    0.0043181095
   2   1   -0.0043181095
   2   2   -0.99999068

BLOCK NMIX
   1   1   -0.0082675267
   1   2   -0.033643779
   1   3   -0.70733797
   1   4   -0.70602602
   2   1    0.017905103
   2   2    0.016735113
   2   3   -0.7067413
   2   4    0.70704744
   3   1   -0.00029797571
   3   2    0.99929373
   3   3   -0.01197668
   3   4   -0.035616242
   4   1   -0.99980546
   4   2    0.00028008399
   4   3   -0.0068040951
   4   4    0.01851106

BLOCK UMIX
   1   1   -0.016947439
   1   2   -0.99985638
   2   1    0.99985638
   2   2   -0.016947439

BLOCK VMIX
   1   1   -0.050394092
   1   2    0.99872941
   2   1    0.99872941
   2   2    0.050394092

BLOCK HIGGSBOUNDSINPUTHIGGSCOUPLINGSFERMIONS
       0, 887.99003,3,36,15,15

BLOCK HIGGSBOUNDSINPUTHIGGSCOUPLINGSBOSONS
       0,4,36,21,21,23

BLOCK SPHENOLOWENERGY
   1    0.00033815713
   2    1.5892487e-06
   3    3.5269875e-05
   4    2.0065725e-15
   5    8.5718812e-11
   6    1.7963647e-08
   7    6.8217192e-14
   8    2.914247e-09
   9    6.1880926e-07
   10    9.5674257e-05
   11    0.98827844
   12    0.54197193
   13    19.357371
   14    0
   15    0
   16    0.0021573548
   17    2.2816597e-15
   18    2.4811623e-11
   19    8.2933235e-11
   20   -6.7088994e-16
   21   -2.8682506e-11
   22   -1.305072e-08
   23    0
   24    0
   25    0
   26    0
   27    0
   28    0
   29    0
   30    0
   31    0
   39    6.0232372e-05
   40    0
   41    0
   42    0

BLOCK FWCOEF Q=  160
   305   4422   0   0   -0.18881911
   305   4422   0   2   -0.20845052
   305   4322   0   2   -0.00049344709
   305   6421   0   0   -0.095227835
   305   6421   0   2   -0.11215293
   305   6321   0   2   -0.00040712413
   3051111   4133   0   0    1.6266106
   3051111   4133   0   2    1.6269392
   3051111   4233   0   2    0.0002217949
   3051111   4137   0   0   -4.4493028
   3051111   4137   0   2   -4.449392
   3051111   4237   0   2   -0.0016418145
   3051313   4133   0   0    1.6266106
   3051313   4133   0   2    1.6269389
   3051313   4233   0   2    0.00022179457
   3051313   4137   0   0   -4.4493028
   3051313   4137   0   2   -4.4493922
   3051313   4237   0   2   -0.0016418145
   3051212   4137   0   0    1.5053501
   3051212   4137   0   2    1.5053715
   3051212   4237   0   2    0.00035502838
   3051414   4137   0   0    1.5053501
   3051414   4137   0   2    1.5053715
   3051414   4237   0   2    0.00035502843
   3051616   4137   0   0    1.5053501
   3051616   4137   0   2    1.5053712
   3051616   4237   0   2    0.00035504341

BLOCK IMFWCOEF Q=  160
   305   4422   0   0    3.8578511e-07
   305   4422   0   2   -1.2643431e-05
   305   4322   0   2   -5.4081718e-06
   305   6421   0   0    3.3045046e-07
   305   6421   0   2    3.3527956e-06
   305   6321   0   2   -2.9083167e-06
   3051111   4133   0   2    7.36018e-07
   3051111   4233   0   2    4.5915486e-06
   3051111   4137   0   2   -3.6429337e-06
   3051111   4237   0   2   -3.3990367e-05
   3051313   4133   0   2    7.3601292e-07
   3051313   4233   0   2    4.591547e-06
   3051313   4137   0   2   -3.642935e-06
   3051313   4237   0   2   -3.3990372e-05
   3051212   4137   0   2    8.2429426e-07
   3051212   4237   0   2    7.3501269e-06
   3051414   4137   0   2    8.2429427e-07
   3051414   4237   0   2    7.3501269e-06
   3051616   4137   0   2    8.1979521e-07
   3051616   4237   0   2    7.3501275e-06

DECAY 23  2.4952


DECAY 24  2.085


DECAY 2000011  6.5291219
    0.99889379   2    1000035    11
    0.00091153835   2    1000023    11
    0.00019446943   2    1000022    11

DECAY 1000011  36.935802
    0.61501522   2   -1000037    12
    0.3070966   2    1000025    11
    0.076441399   2    1000035    11
    0.00077209141   2    1000022    11
    0.00036855811   2    1000023    11
    0.00030612965   2   -1000024    12

DECAY 2000013  6.5772368
    0.99155837   2    1000035    13
    0.0036714538   2   -1000024    14
    0.0027386366   2    1000023    13
    0.0020307284   2    1000022    13

DECAY 1000013  36.964917
    0.61452651   2   -1000037    14
    0.30685262   2    1000025    13
    0.076380593   2    1000035    13
    0.0011671631   2    1000022    13
    0.00076313391   2    1000023    13
    0.00030588752   2   -1000024    14

DECAY 1000015  1.896568
    0.50147194   2    1000022    15
    0.49683333   2    1000023    15
    0.0016947253   2   -1000024    16

DECAY 2000015  17.979187
    0.34887093   2   -1000024    16
    0.2651194   2    1000035    15
    0.1746568   2    1000022    15
    0.17463202   2    1000023    15
    0.018095606   2    1000016   -24
    0.0094578185   2    1000015    25
    0.0090318447   2    1000015    23

DECAY 1000012  36.941805
    0.61319562   2    1000037    11
    0.30707503   2    1000025    12
    0.076541177   2    1000035    12
    0.0027056915   2    1000024    11
    0.00045509867   2    1000022    12

DECAY 1000014  36.970759
    0.61271115   2    1000037    13
    0.30683237   2    1000025    14
    0.076480605   2    1000035    14
    0.0034937763   2    1000024    13
    0.00045474075   2    1000022    14

DECAY 1000016  1.9089861
    0.99787247   2    1000024    15
    0.0020071087   2    1000022    16
    0.00012042648   2    1000023    16

DECAY 1000001  0.0071519232
    0.57762849   2    1000022    1
    0.32004399   2   -1000024    2
    0.10232752   2    1000023    1

DECAY 2000001  0.99746813
    0.99906653   2    1000035    1
    0.00074527491   2    1000023    1
    0.00016707877   2    1000022    1

DECAY 1000003  0.0091113875
    0.54342535   2    1000022    3
    0.28679732   2   -1000024    4
    0.16977733   2    1000023    3

DECAY 2000003  1.012412
    0.98431604   2    1000035    3
    0.0073319964   2   -1000024    4
    0.0043865105   2    1000023    3
    0.0038243396   2    1000022    3
    0.00013909683   2    1000003    25

DECAY 1000005  28.49568
    0.49429395   2   -1000024    6
    0.24920953   2    1000022    5
    0.24847644   2    1000023    5
    0.0080080253   2    1000035    5

DECAY 2000005  142.69649
    0.54068519   2   -1000024    6
    0.16215759   2    1000006   -24
    0.10917897   2   -1000037    6
    0.065894897   2    1000022    5
    0.065691903   2    1000023    5
    0.054046455   2    1000025    5
    0.0014013229   2    1000035    5
    0.00061725952   2    1000005    25
    0.00032641657   2    1000005    23

DECAY 1000002  0.026668678
    0.75702406   2    1000024    1
    0.18396044   2    1000022    2
    0.059015503   2    1000023    2

DECAY 2000002  4.3963163
    0.99748012   2    1000035    2
    0.0016818944   2    1000021    2
    0.00069059158   2    1000023    2
    0.00014729209   2    1000022    2

DECAY 1000004  0.028624115
    0.76236969   2    1000024    3
    0.17700479   2    1000022    4
    0.060625525   2    1000023    4

DECAY 2000004  4.3993619
    0.99678851   2    1000035    4
    0.0016651102   2    1000021    4
    0.00086431336   2    1000023    4
    0.00034748303   2    1000024    3
    0.00032090318   2    1000022    4

DECAY 1000006  135.35016
    0.48451253   2    1000024    5
    0.24910412   2    1000022    6
    0.2479161   2    1000023    6
    0.013724643   2    1000035    6
    0.0026885554   2    1000037    5
    0.0013743946   2    1000025    6
    0.00067317044   3    1000022    24    5

DECAY 2000006  151.95821
    0.25850794   2    1000023    6
    0.2559917   2    1000022    6
    0.14294533   2    1000024    5
    0.10197753   2    1000006    25
    0.10075227   2    1000037    5
    0.086216092   2    1000006    23
    0.050873704   2    1000025    6
    0.0021008902   2    1000035    6
    0.00063453739   2    1000005    24

DECAY 1000024  2.593096e-13
    0.84231297   2    1000022    211
    0.083559454   3    1000022   -11    12
    0.074127572   3    1000022   -13    14

DECAY 1000037  59.429127
    0.14520707   2    1000004   -3
    0.14520558   2    1000002   -1
    0.14494974   2   -1000003    4
    0.14494854   2   -1000001    2
    0.085967166   2    1000024    25
    0.080960834   2    1000023    24
    0.080524771   2    1000022    24
    0.080498039   2    1000024    23
    0.039408959   2    1000016   -15
    0.039391146   2   -1000015    16
    0.0051172841   3    1000024    6   -6
    0.0040728017   3    1000023   -5    6
    0.0036483923   3    1000022   -5    6

DECAY 1000022 -1


DECAY 1000023  2.2559029e-09
    0.95532892   2    1000022    22
    0.010471887   3    1000022    12   -12
    0.0078301077   3    1000022    1   -1
    0.0076316784   3    1000022    3   -3
    0.0061071482   3    1000022    2   -2
    0.0027662469   3    1000024    1   -2
    0.0027662469   3   -1000024   -1    2
    0.0017671634   3    1000022    11   -11
    0.0016971764   3    1000022    13   -13
    0.00092215961   3    1000024    11   -12
    0.00092215961   3   -1000024   -11    12
    0.00089455179   3    1000024    13   -14
    0.00089455179   3   -1000024   -13    14

DECAY 1000025  63.079056
    0.07607295   2    1000024   -24
    0.07607295   2   -1000024    24
    0.074536491   2    1000023    25
    0.068448372   2    1000004   -4
    0.068448372   2   -1000004    4
    0.068447828   2    1000002   -2
    0.068447828   2   -1000002    2
    0.068187843   2    1000003   -3
    0.068187843   2   -1000003    3
    0.068187125   2    1000001   -1
    0.068187125   2   -1000001    1
    0.065072375   2    1000022    25
    0.061174068   2    1000023    23
    0.018581597   2    1000016   -16
    0.018581597   2   -1000016    16
    0.018523451   2    1000015   -15
    0.018523451   2   -1000015    15
    0.015054948   2    1000022    23
    0.0032970136   3    1000024    5   -6
    0.0032970136   3   -1000024   -5    6
    0.0024047652   3    1000023    6   -6
    0.0021725175   3    1000022    6   -6

DECAY 1000035  12.016199
    0.15185514   2    1000024   -24
    0.15185514   2   -1000024    24
    0.1251729   2    1000022    23
    0.11948599   2    1000023    25
    0.1047937   2    1000022    25
    0.042060721   2    1000016   -16
    0.042060721   2   -1000016    16
    0.04189897   2    1000015   -15
    0.04189897   2   -1000015    15
    0.026787728   2    1000023    23
    0.016274596   2    1000003   -3
    0.016274596   2   -1000003    3
    0.016274458   2    1000001   -1
    0.016274458   2   -1000001    1
    0.016220662   2    1000004   -4
    0.016220662   2   -1000004    4
    0.016220583   2    1000002   -2
    0.016220583   2   -1000002    2
    0.0065629711   3    1000024    5   -6
    0.0065629711   3   -1000024   -5    6
    0.0045100312   3    1000023    6   -6
    0.0041249784   3    1000022    6   -6
    0.00014650399   3    1000022    5   -5
    0.00013395302   3    1000023    5   -5

DECAY 1000021  448.68366
    0.11105664   2    1000004   -4
    0.11105664   2   -1000004    4
    0.11105645   2    1000002   -2
    0.11105645   2   -1000002    2
    0.11097776   2    1000003   -3
    0.11097776   2   -1000003    3
    0.11097756   2    1000001   -1
    0.11097756   2   -1000001    1
    0.032761713   2    1000005   -5
    0.032761713   2   -1000005    5
    0.013993806   2    1000006   -6
    0.013993806   2   -1000006    6
    0.0041449736   2    2000005   -5
    0.0041449736   2   -2000005    5
    0.0039272493   2    2000006   -6
    0.0039272493   2   -2000006    6
    0.00042900481   2    2000003   -3
    0.00042900481   2   -2000003    3
    0.00042897098   2    2000001   -1
    0.00042897098   2   -2000001    1

DECAY 25  0.0039690041
    0.56318677   2   -5    5
    0.23869646   2   -24    24
    0.071947335   2    21    21
    0.064840669   2   -15    15
    0.029259265   2    23    23
    0.027742378   2   -4    4
    0.0023410795   2    22    22
    0.0015487394   2    22    23
    0.00022494476   2   -13    13
    0.00021163344   2   -3    3
    5.8514534e-07   2   -1    1
    1.429611e-07   2   -2    2
    5.0570001e-09   2   -11    11

DECAY 35  30.969825
    0.86018177   2   -5    5
    0.13507474   2   -15    15
    0.0032607053   2   -6    6
    0.00050089888   2   -13    13
    0.0004738661   2   -1000024    1000024
    0.00034506095   2   -3    3
    8.4500893e-05   2    1000022    1000022
    4.4753203e-05   2    1000022    1000023
    1.5183746e-05   2    25    25
    1.0014466e-05   2    21    21
    5.1943552e-06   2    1000023    1000023
    1.6244755e-06   2    23    23
    9.5420402e-07   2   -1    1
    6.7160087e-07   2   -24    24
    4.4395357e-08   2   -4    4
    1.1250709e-08   2   -11    11
    3.2314815e-09   2    22    23
    1.9107745e-09   2    22    22
    2.2887894e-13   2   -2    2

DECAY 36  29.812322
    0.85948311   2   -5    5
    0.1349658   2   -15    15
    0.003336611   2   -6    6
    0.0011160887   2   -1000024    1000024
    0.00050049111   2   -13    13
    0.000344781   2   -3    3
    0.00018217941   2    1000022    1000022
    2.8252568e-05   2    21    21
    2.4549361e-05   2    1000022    1000023
    1.4607588e-05   2    1000023    1000023
    2.4056369e-06   2    23    25
    9.5343063e-07   2   -1    1
    5.999877e-08   2    22    23
    5.8366583e-08   2    22    22
    4.4353138e-08   2   -4    4
    1.1241548e-08   2   -11    11
    2.2869462e-13   2   -2    2
    2.3934983e-41   2    25    25

DECAY 37  29.277157
    0.8419594   2   -5    6
    0.1555208   2   -15    16
    0.0012452878   2   -5    4
    0.00054982177   2   -13    14
    0.00032805835   2   -3    4
    0.00029077426   2    1000023    1000024
    7.26281e-05   2    1000022    1000024
    1.5322474e-05   2   -3    2
    8.8926414e-06   2   -5    2
    5.3690424e-06   2   -3    6
    2.456917e-06   2    24    25
    9.1027781e-07   2   -1    2
    2.2412059e-07   2   -1    6
    4.4453504e-08   2   -1    4
    1.2860389e-08   2   -11    12
    5.1086278e-13   2    24    35
    4.4032303e-13   2    24    36

DECAY 6  2.43
    1   2    5    24

DECAY 15 -1
