BLOCK SPINFO
   1   SPheno
   2   v4.0.5be

BLOCK SPHENOINFO
   1   2
   2   2

BLOCK MODSEL
   1   0

BLOCK MINPAR
   3    46.297967
   4   -1

BLOCK EXTPAR
   0    1518.0239
   1   -228.68564
   2    1576.1621
   3    3000
   11    2897.2441
   12   -1762.7278
   13   -135.34564
   23   -447.94801
   25    46.07946
   26    1209.5827
   31    1159.1715
   32    1159.1715
   33    1811.3441
   34    1570.1225
   35    1570.1225
   36    756.63141
   41    5000
   42    5000
   43    1448.3207
   44    5000
   45    5000
   46    1679.5279
   47    5000
   48    5000
   49    1650.5031

BLOCK SMINPUTS
   1    127.90897
   2    1.1663787e-05
   3    0.1184
   4    91.1876
   5    4.18
   6    173.2
   7    1.777
   8    0
   11    0.00051099893
   12    0
   13    0.10565837
   14    0
   21    0.005
   22    0.0025
   23    0.095
   24    1.27

BLOCK GAUGE Q=  1518.0239
   1    0.35536298
   2    0.66519887
   3    1.219778

BLOCK YU Q=  1518.0239
   1   1    8.3863463e-06
   2   2    0.0042602639
   3   3    1.013138

BLOCK YD Q=  1518.0239
   1   1    0.0007765339
   2   2    0.014754144
   3   3    0.7700783

BLOCK YE Q=  1518.0239
   1   1    0.00013551084
   2   2    0.028019345
   3   3    0.47123928

BLOCK AU Q=  1518.0239
   1   1    0
   2   2    0
   3   3    2897.2441

BLOCK AD Q=  1518.0239
   1   1    0
   2   2    0
   3   3   -1762.7277

BLOCK AE Q=  1518.0239
   1   1    0
   2   2    0
   3   3   -135.34564

BLOCK MSOFT Q=  1518.0239
   1   -228.68564
   2    1576.1621
   3    3000
   21    1334228.3
   22   -151495.68
   31    1159.1715
   32    1159.1715
   33    1811.3441
   34    1570.1225
   35    1570.1225
   36    756.63141
   41    5000
   42    5000
   43    1448.3207
   44    5000
   45    5000
   46    1679.5279
   47    5000
   48    5000
   49    1650.5031

BLOCK MASS
   6    173.2
   23    91.1876
   24    80.429995
   15    1.777
   25    123.18218
   35    1209.2109
   36    1209.5827
   37    1214.0237
   1000001    5027.8687
   2000001    5019.6719
   1000002    5027.423
   2000002    5020.9233
   1000003    5027.8745
   2000003    5019.6793
   1000004    5027.4277
   2000004    5020.9241
   1000005    1432.6618
   2000005    1649.0769
   1000006    1359.485
   2000006    1695.0511
   1000011    1174.0645
   2000011    1572.6889
   1000012    1170.9841
   1000013    1174.0469
   2000013    1572.6624
   1000014    1170.9681
   1000015    749.52258
   2000015    1818.2752
   1000016    1815.6642
   1000021    3189.3902
   1000022   -225.38817
   1000023    453.1923
   1000025   -460.0037
   1000035    1614.7477
   1000024    453.19817
   1000037    1614.9487

BLOCK ALPHA
      -0.021881723

BLOCK HMIX Q=  1518.0239
   1   -447.94801
   2    46.07946
   3    243.98155
   4    1463090.3

BLOCK STOPMIX
   1   1   -0.88984396
   1   2    0.45626497
   2   1   -0.45626497
   2   2   -0.88984396

BLOCK SBOTMIX
   1   1   -0.99660747
   1   2    0.082301615
   2   1   -0.082301615
   2   2   -0.99660747

BLOCK STAUMIX
   1   1   -0.012928089
   1   2    0.99991643
   2   1   -0.99991643
   2   2   -0.012928089

BLOCK NMIX
   1   1    0.98925858
   1   2    0.0030678251
   1   3   -0.12989798
   1   4    0.066966947
   2   1   -0.0448804
   2   2   -0.046668965
   2   3   -0.70631317
   2   4   -0.70493224
   3   1    0.13910976
   3   2   -0.027536525
   3   3    0.69574994
   3   4   -0.70414646
   4   1    0.0013007118
   4   2   -0.99852608
   4   3    0.013425653
   4   4    0.052571133

BLOCK UMIX
   1   1   -0.019021033
   1   2   -0.99981908
   2   1    0.99981908
   2   2   -0.019021033

BLOCK VMIX
   1   1   -0.074432516
   1   2    0.99722605
   2   1    0.99722605
   2   2    0.074432516

BLOCK HIGGSBOUNDSINPUTHIGGSCOUPLINGSFERMIONS
       0, 2123.3167,3,36,15,15

BLOCK HIGGSBOUNDSINPUTHIGGSCOUPLINGSBOSONS
       0,4,36,21,21,23

BLOCK SPHENOLOWENERGY
   1    0.00031227213
   2    1.5898604e-06
   3    3.5212831e-05
   4    5.9187805e-15
   5    2.5279599e-10
   6    5.0158288e-08
   7    2.0403982e-13
   8    8.7149417e-09
   9    1.7524982e-06
   10    9.072113e-05
   11    0.93711454
   12    0.5424097
   13    19.359794
   14    0
   15    0
   16    0.0021589878
   17    2.2816845e-15
   18    2.4779305e-11
   19    8.2852079e-11
   20   -7.5112255e-15
   21   -3.2112175e-10
   22   -8.1534489e-08
   23    0
   24    0
   25    0
   26    0
   27    0
   28    0
   29    0
   30    0
   31    0
   39    8.7487271e-05
   40    0
   41    0
   42    0

BLOCK FWCOEF Q=  160
   305   4422   0   0   -0.18881911
   305   4422   0   2   -0.1740517
   305   4322   0   2   -0.00030409731
   305   6421   0   0   -0.095227835
   305   6421   0   2   -0.10785296
   305   6321   0   2   -0.00052160955
   3051111   4133   0   0    1.5929316
   3051111   4133   0   2    1.5942888
   3051111   4233   0   2    0.00014398203
   3051111   4137   0   0   -4.4156237
   3051111   4137   0   2   -4.4100891
   3051111   4237   0   2   -0.0011145741
   3051313   4133   0   0    1.5929316
   3051313   4133   0   2    1.5942848
   3051313   4233   0   2    0.0001439674
   3051313   4137   0   0   -4.4156237
   3051313   4137   0   2   -4.4100931
   3051313   4237   0   2   -0.0011145671
   3051212   4137   0   0    1.5053501
   3051212   4137   0   2    1.504149
   3051212   4237   0   2    0.00024284802
   3051414   4137   0   0    1.5053501
   3051414   4137   0   2    1.504149
   3051414   4237   0   2    0.00024285082
   3051616   4137   0   0    1.5053501
   3051616   4137   0   2    1.5041492
   3051616   4237   0   2    0.00024363965

BLOCK IMFWCOEF Q=  160
   305   4422   0   0    3.8587418e-07
   305   4422   0   2   -2.4558182e-05
   305   4322   0   2    3.4910044e-06
   305   6421   0   0    3.3052676e-07
   305   6421   0   2    9.5292582e-07
   305   6321   0   2    1.406557e-06
   3051111   4133   0   2   -7.3167749e-07
   3051111   4233   0   2    6.2450745e-06
   3051111   4137   0   2    6.5029306e-06
   3051111   4237   0   2   -4.8505205e-05
   3051313   4133   0   2   -7.3165769e-07
   3051313   4233   0   2    6.2450438e-06
   3051313   4137   0   2    6.5029569e-06
   3051313   4237   0   2   -4.850531e-05
   3051212   4137   0   2   -1.3319781e-06
   3051212   4237   0   2    1.0568705e-05
   3051414   4137   0   2   -1.3319784e-06
   3051414   4237   0   2    1.0568705e-05
   3051616   4137   0   2   -1.3294871e-06
   3051616   4237   0   2    1.0568714e-05

DECAY 23  2.4952


DECAY 24  2.085


DECAY 1000011  1.3839555
    0.9786925   2    1000022    11
    0.013495854   2    1000023    11
    0.0058549298   2    1000025    11
    0.0019567175   2   -1000024    12

DECAY 2000011  7.5601889
    0.98131563   2    1000022    11
    0.016914042   2    1000025    11
    0.0017702643   2    1000023    11

DECAY 1000013  1.3972049
    0.96959944   2    1000022    13
    0.018110297   2    1000023    13
    0.010352152   2    1000025    13
    0.0019381131   2   -1000024    14

DECAY 2000013  7.6017553
    0.97598459   2    1000022    13
    0.018128674   2    1000025    13
    0.0031157646   2    1000023    13
    0.0027158645   2   -1000024    14

DECAY 1000015  5.7495255
    0.53933804   2    1000022    15
    0.23182657   2   -1000024    16
    0.11620395   2    1000023    15
    0.11263144   2    1000025    15

DECAY 2000015  10.764942
    0.33047324   2    1000023    15
    0.31909828   2    1000025    15
    0.21466364   2    1000022    15
    0.06627605   2   -1000037    16
    0.033065075   2    1000035    15
    0.018370849   2    1000015    25
    0.01792565   2    1000015    23
    0.00012721993   2   -1000024    16

DECAY 1000012  1.4008142
    0.94186226   2    1000022    12
    0.02947051   2    1000024    11
    0.027297569   2    1000025    12
    0.0013696641   2    1000023    12

DECAY 1000014  1.4140107
    0.93305754   2    1000022    14
    0.038543436   2    1000024    13
    0.027042174   2    1000025    14
    0.00135685   2    1000023    14

DECAY 1000016  10.770927
    0.66188089   2    1000024    15
    0.19856421   2    1000022    16
    0.064376675   2    1000037    15
    0.035720612   2    1000015    24
    0.03238101   2    1000035    16
    0.0067406353   2    1000025    16
    0.00033596478   2    1000023    16

DECAY 2000001  143.67313
    0.98057732   2    1000021    1
    0.019012036   2    1000022    1
    0.00037135142   2    1000025    1

DECAY 1000001  195.84666
    0.72370831   2    1000021    1
    0.18170417   2   -1000037    2
    0.090664489   2    1000035    1
    0.0033719661   2    1000022    1
    0.00030417262   2    1000025    1
    0.00016645025   2    1000023    1

DECAY 2000003  143.71656
    0.98028639   2    1000021    3
    0.019008857   2    1000022    3
    0.00044303364   2    1000025    3
    0.00014875139   2   -1000024    4
    0.0001128747   2    1000023    3

DECAY 1000003  195.87049
    0.72362331   2    1000021    3
    0.18168241   2   -1000037    4
    0.090653621   2    1000035    3
    0.0033734234   2    1000022    3
    0.00035690227   2    1000025    3
    0.00022084165   2    1000023    3

DECAY 1000005  36.323882
    0.61658674   2   -1000024    6
    0.18890682   2    1000023    5
    0.17894537   2    1000025    5
    0.015561068   2    1000022    5

DECAY 2000005  34.616952
    0.47519934   2   -1000024    6
    0.23882909   2    1000023    5
    0.23510111   2    1000025    5
    0.030385527   2    1000022    5
    0.01376816   2    1000006   -24
    0.0034550399   2    1000005    25
    0.0032579328   2    1000005    23

DECAY 2000002  152.17726
    0.92663553   2    1000021    2
    0.071816362   2    1000022    2
    0.001402005   2    1000025    2
    0.00014600372   2    1000023    2

DECAY 1000002  195.8387
    0.72350071   2    1000021    2
    0.18074683   2    1000037    1
    0.090572357   2    1000035    2
    0.0036150742   2    1000022    2
    0.001232041   2    1000024    1
    0.0003321375   2    1000023    2

DECAY 2000004  152.18084
    0.92661384   2    1000021    4
    0.071814728   2    1000022    4
    0.0014077706   2    1000025    4
    0.00015182717   2    1000023    4

DECAY 1000004  195.86235
    0.72341555   2    1000021    4
    0.18072529   2    1000037    3
    0.090561566   2    1000035    4
    0.0036146814   2    1000022    4
    0.001340919   2    1000024    3
    0.00033662482   2    1000023    4

DECAY 1000006  36.646372
    0.37426392   2    1000024    5
    0.30335324   2    1000023    6
    0.28918245   2    1000025    6
    0.030940052   2    1000022    6
    0.001751165   2    1000022    4
    0.00037280441   3    1000022    24    5
    0.00013606789   2    1000023    4

DECAY 2000006  89.765731
    0.31537151   2    1000024    5
    0.16046876   2    1000025    6
    0.15565619   2    1000023    6
    0.15324976   2    1000005    24
    0.12295762   2    1000006    23
    0.063421307   2    1000006    25
    0.028697994   2    1000022    6
    0.00017685416   2    1000037    5

DECAY 1000024  0.32174528
    0.99978764   2    1000022    24
    0.00019367378   3    1000022   -5    6

DECAY 1000037  22.029983
    0.15353641   2    1000024    25
    0.14915806   2    1000023    24
    0.14882928   2    1000024    23
    0.14699204   2    1000025    24
    0.072541571   2    1000006   -5
    0.072171324   2    1000014   -13
    0.072166899   2    1000012   -11
    0.071702616   2   -1000013    14
    0.071697813   2   -1000011    12
    0.011345104   2   -1000005    6
    0.0068806294   3    1000023   -5    6
    0.0068545909   3    1000025   -5    6
    0.005522696   3    1000024    6   -6
    0.0053815473   3    1000024    5   -5
    0.0028700574   2    1000022    24
    0.00077519712   2    37    1000022
    0.00073207571   3    1000024    15   -15
    0.00037257554   3    1000023   -15    16
    0.00031292818   3    1000025   -15    16
    0.00011205536   3    1000022   -5    6

DECAY 1000022 -1


DECAY 1000023  0.48202181
    0.63679554   2    1000022    23
    0.36317567   2    1000022    25

DECAY 1000025  0.22193978
    0.85707116   2    1000022    25
    0.14287972   2    1000022    23

DECAY 1000035  24.074565
    0.13717475   2    1000024   -24
    0.13717475   2   -1000024    24
    0.11268459   2    1000025    25
    0.10428871   2    1000023    25
    0.099826763   2    1000025    23
    0.035594465   2    1000023    23
    0.033130804   2    1000014   -14
    0.033130804   2   -1000014    14
    0.033128807   2    1000012   -12
    0.033128807   2   -1000012    12
    0.032653975   2    1000013   -13
    0.032653975   2   -1000013    13
    0.032651751   2    1000011   -11
    0.032651751   2   -1000011    11
    0.021723168   2    1000006   -6
    0.021723168   2   -1000006    6
    0.019824333   2    1000005   -5
    0.019824333   2   -1000005    5
    0.0064595969   3    1000024    5   -6
    0.0064595969   3   -1000024   -5    6
    0.0023270442   3    1000023    5   -5
    0.00224956   3    1000025    6   -6
    0.002125108   3    1000023    6   -6
    0.0018994338   3    1000025    5   -5
    0.0017569225   2    1000022    25
    0.0015586832   2    1000022    23
    0.00057700308   2    1000022    35
    0.0003619265   3    1000023    15   -15
    0.00033922452   3    1000024    15   -16
    0.00033922452   3   -1000024   -15    16
    0.00030265688   3    1000025    15   -15
    0.00014968296   2    1000022    36

DECAY 1000021  245.72248
    0.14221705   2    1000006   -6
    0.14221705   2   -1000006    6
    0.12246336   2    1000005   -5
    0.12246336   2   -1000005    5
    0.10305567   2    2000005   -5
    0.10305567   2   -2000005    5
    0.086514119   2    2000006   -6
    0.086514119   2   -2000006    6
    0.045408192   2    1000006   -4
    0.045408192   2   -1000006    4
    0.00018475664   3    1000037    5   -6
    0.00018475664   3   -1000037   -5    6
    0.00010521847   3    1000035    5   -5

DECAY 25  0.0037362796
    0.60810859   2   -5    5
    0.19527042   2   -24    24
    0.07163893   2    21    21
    0.069041654   2   -15    15
    0.029074902   2   -4    4
    0.022790994   2    23    23
    0.0022916354   2    22    22
    0.0013163944   2    22    23
    0.00023929587   2   -13    13
    0.00022640637   2   -3    3
    6.2598823e-07   2   -1    1
    1.4983554e-07   2   -2    2
    5.3796602e-09   2   -11    11

DECAY 35  53.418465
    0.88962337   2   -5    5
    0.090840172   2   -15    15
    0.010769754   2    1000022    1000023
    0.0061401626   2    1000022    1000025
    0.00065783014   2    1000022    1000022
    0.00056971572   2   -6    6
    0.00034540821   2   -1000024    1000024
    0.00029824313   2   -13    13
    0.00025753404   2    1000025    1000025
    0.00023510652   2   -3    3
    0.00019659392   2    1000023    1000025
    4.312825e-05   2    21    21
    1.924653e-05   2    1000023    1000023
    1.771659e-06   2    25    25
    6.5555285e-07   2   -24    24
    6.4995379e-07   2   -1    1
    6.1372236e-07   2    23    23
    1.6364151e-08   2    22    22
    8.2118882e-09   2    22    23
    7.7757707e-09   2   -4    4
    6.7002491e-09   2   -11    11
    4.0100146e-14   2   -2    2

DECAY 36  50.579726
    0.88818962   2   -5    5
    0.090695914   2   -15    15
    0.010003893   2    1000022    1000025
    0.0074695547   2    1000022    1000023
    0.00084484833   2    1000022    1000022
    0.00078642767   2   -1000024    1000024
    0.00068129892   2    1000025    1000025
    0.00061049312   2   -6    6
    0.00029776701   2   -13    13
    0.00023471995   2   -3    3
    8.023483e-05   2    1000023    1000025
    6.2522155e-05   2    21    21
    4.103316e-05   2    1000023    1000023
    8.9346506e-07   2    23    25
    6.4888485e-07   2   -1    1
    6.0439092e-08   2    22    22
    5.7523271e-08   2    22    23
    7.6369603e-09   2   -4    4
    6.6895521e-09   2   -11    11
    3.9399129e-14   2   -2    2
    2.050197e-38   2    25    25

DECAY 37  51.862039
    0.87869003   2   -5    6
    0.10034484   2   -15    16
    0.018872997   2    1000022    1000024
    0.0013333415   2   -5    4
    0.00035475611   2   -13    14
    0.00022154356   2   -3    4
    0.00012842487   2    1000023    1000024
    3.1745392e-05   2    1000024    1000025
    1.0260959e-05   2   -3    2
    9.5214518e-06   2   -5    2
    9.7022882e-07   2   -3    6
    8.8478115e-07   2    24    25
    6.1456434e-07   2   -1    2
    3.0126686e-08   2   -1    6
    2.8666244e-08   2   -1    4
    8.2977824e-09   2   -11    12
    6.7544263e-11   2    24    35
    4.5196066e-11   2    24    36

DECAY 6  2.43
    1   2    5    24

DECAY 15 -1
