BLOCK SPINFO
   1   SPheno
   2   v4.0.5be

BLOCK SPHENOINFO
   1   2
   2   2

BLOCK MODSEL
   1   0

BLOCK MINPAR
   3    56.148884
   4   -1

BLOCK EXTPAR
   0    2979.4959
   1   -811.13082
   2    3436.3952
   3    3058.121
   11   -3779.2663
   12    3237.6982
   13    2469.9161
   23   -950.74669
   25    56.463547
   26    3682.558
   31    2598.2946
   32    2598.2946
   33    4734.4795
   34    2028.5345
   35    2028.5345
   36    4522.4732
   41    3160.4268
   42    3160.4268
   43    1988.6936
   44    528.13144
   45    528.13144
   46    4178.0854
   47    2455.3779
   48    2455.3779
   49    3039.524

BLOCK SMINPUTS
   1    127.90897
   2    1.1663787e-05
   3    0.1184
   4    91.1876
   5    4.18
   6    173.2
   7    1.777
   8    0
   11    0.00051099893
   12    0
   13    0.10565837
   14    0
   21    0.005
   22    0.0025
   23    0.095
   24    1.27

BLOCK GAUGE Q=  2979.4959
   1    0.35536298
   2    0.66519887
   3    1.219778

BLOCK YU Q=  2979.4959
   1   1    8.385687e-06
   2   2    0.004259929
   3   3    1.0130583

BLOCK YD Q=  2979.4959
   1   1    0.00095145238
   2   2    0.018077595
   3   3    0.94354261

BLOCK YE Q=  2979.4959
   1   1    0.0001660354
   2   2    0.034330854
   3   3    0.57738849

BLOCK AU Q=  2979.4959
   1   1    0
   2   2    0
   3   3   -3779.2701

BLOCK AD Q=  2979.4959
   1   1    0
   2   2    0
   3   3    3237.7077

BLOCK AE Q=  2979.4959
   1   1    0
   2   2    0
   3   3    2469.9159

BLOCK MSOFT Q=  2979.4959
   1   -811.13082
   2    3436.3952
   3    3058.121
   21    13070619
   22   -843349.31
   31    2598.2946
   32    2598.2946
   33    4734.4795
   34    2028.5345
   35    2028.5345
   36    4522.4732
   41    3160.4268
   42    3160.4268
   43    1988.6936
   44    528.13144
   45    528.13144
   46    4178.0854
   47    2455.3779
   48    2455.3779
   49    3039.524

BLOCK MASS
   6    173.2
   23    91.1876
   24    80.429995
   15    1.777
   25    122.41782
   35    3680.7616
   36    3682.558
   37    3682.0029
   1000001    3289.8654
   2000001    2578.3741
   1000002    3288.9001
   2000002    800.03585
   1000003    3289.8558
   2000003    2578.3532
   1000004    3288.8904
   2000004    800.03567
   1000005    2113.6969
   2000005    3099.4892
   1000006    2112.7198
   2000006    4201.8804
   1000011    2626.9872
   2000011    2026.1549
   1000012    2625.3548
   1000013    2626.9507
   2000013    2026.0708
   1000014    2625.3144
   1000015    4511.61
   2000015    4744.6821
   1000016    4743.5299
   1000021    3203.4815
   1000022   -793.0854
   1000023    963.71695
   1000025   -971.16651
   1000035    3427.629
   1000024    964.35939
   1000037    3427.7469

BLOCK ALPHA
      -0.017840083

BLOCK HMIX Q=  2979.4959
   1   -950.74669
   2    56.463547
   3    243.27388
   4    13561234

BLOCK STOPMIX
   1   1    0.99918183
   1   2    0.040443325
   2   1   -0.040443325
   2   2    0.99918183

BLOCK SBOTMIX
   1   1   -0.99964464
   1   2    0.026657027
   2   1   -0.026657027
   2   2   -0.99964464

BLOCK STAUMIX
   1   1   -0.045080241
   1   2    0.99898337
   2   1   -0.99898337
   2   2   -0.045080241

BLOCK NMIX
   1   1    0.98341441
   1   2    0.002211946
   1   3   -0.1396022
   1   4    0.11576889
   2   1   -0.017156547
   2   2   -0.022076718
   2   3   -0.70712289
   2   4   -0.70653768
   3   1    0.18055938
   3   2   -0.012738626
   3   3    0.6931425
   3   4   -0.69770302
   4   1    0.00025402449
   4   2   -0.99967267
   4   3    0.0064745964
   4   4    0.024749988

BLOCK UMIX
   1   1   -0.0091635946
   1   2   -0.99995801
   2   1    0.99995801
   2   2   -0.0091635946

BLOCK VMIX
   1   1   -0.035027295
   1   2    0.99938636
   2   1    0.99938636
   2   2    0.035027295

BLOCK HIGGSBOUNDSINPUTHIGGSCOUPLINGSFERMIONS
       0, 3188.1322,3,36,15,15

BLOCK HIGGSBOUNDSINPUTHIGGSCOUPLINGSBOSONS
       0,4,36,21,21,23

BLOCK SPHENOLOWENERGY
   1    0.00034668221
   2    1.5889492e-06
   3    3.527093e-05
   4    1.4043099e-15
   5    5.9987273e-11
   6    1.2373547e-08
   7    4.8523689e-14
   8    2.0728383e-09
   9    4.3438486e-07
   10    9.5239154e-05
   11    0.983784
   12    0.54201777
   13    19.340673
   14    0
   15    0
   16    0.0021579794
   17    2.2816668e-15
   18    2.4810123e-11
   19    8.2932109e-11
   20   -1.9523282e-15
   21   -8.3466296e-11
   22   -1.5413392e-08
   23    0
   24    0
   25    0
   26    0
   27    0
   28    0
   29    0
   30    0
   31    0
   39    7.3432784e-05
   40    0
   41    0
   42    0

BLOCK FWCOEF Q=  160
   305   4422   0   0   -0.18881911
   305   4422   0   2   -0.21978239
   305   4322   0   2   -0.00048255426
   305   6421   0   0   -0.095227835
   305   6421   0   2   -0.11242432
   305   6321   0   2   -0.0002639104
   3051111   4133   0   0    1.617445
   3051111   4133   0   2    1.6180234
   3051111   4233   0   2    0.00086789225
   3051111   4137   0   0   -4.4401371
   3051111   4137   0   2   -4.4405267
   3051111   4237   0   2   -0.0065091582
   3051313   4133   0   0    1.617445
   3051313   4133   0   2    1.6180221
   3051313   4233   0   2    0.00086788871
   3051313   4137   0   0   -4.4401371
   3051313   4137   0   2   -4.4405281
   3051313   4237   0   2   -0.0065091654
   3051212   4137   0   0    1.5053501
   3051212   4137   0   2    1.5054354
   3051212   4237   0   2    0.0014104563
   3051414   4137   0   0    1.5053501
   3051414   4137   0   2    1.5054354
   3051414   4237   0   2    0.0014104564
   3051616   4137   0   0    1.5053501
   3051616   4137   0   2    1.5054356
   3051616   4237   0   2    0.0014104896

BLOCK IMFWCOEF Q=  160
   305   4422   0   0    3.8574703e-07
   305   4422   0   2   -3.3738305e-05
   305   4322   0   2   -7.0093378e-06
   305   6421   0   0    3.3041784e-07
   305   6421   0   2    1.6898289e-05
   305   6321   0   2   -2.5693815e-06
   3051111   4133   0   2    1.0949823e-06
   3051111   4233   0   2    1.6495224e-05
   3051111   4137   0   2   -4.9625351e-06
   3051111   4237   0   2   -0.00012371713
   3051313   4133   0   2    1.0949709e-06
   3051313   4233   0   2    1.6495172e-05
   3051313   4137   0   2   -4.9625463e-06
   3051313   4237   0   2   -0.00012371727
   3051212   4137   0   2    1.0898812e-06
   3051212   4237   0   2    2.6808012e-05
   3051414   4137   0   2    1.0898804e-06
   3051414   4237   0   2    2.6808012e-05
   3051616   4137   0   2    1.0945725e-06
   3051616   4237   0   2    2.6808012e-05

DECAY 23  2.4952


DECAY 24  2.085


DECAY 2000011  7.258622
    0.9726236   2    1000022    11
    0.027129086   2    1000025    11
    0.00024722076   2    1000023    11

DECAY 1000011  2.7286858
    0.97423208   2    1000022    11
    0.022137223   2    1000025    11
    0.0030979101   2    1000023    11
    0.00053277301   2   -1000024    12

DECAY 2000013  7.3149404
    0.96515793   2    1000022    13
    0.028767943   2    1000025    13
    0.0038847991   2   -1000024    14
    0.0021893285   2    1000023    13

DECAY 1000013  2.7763466
    0.95784518   2    1000022    13
    0.029702043   2    1000025    13
    0.011353195   2    1000023    13
    0.00057596795   2    2000013    25
    0.00052361521   2   -1000024    14

DECAY 1000015  75.736856
    0.35938835   2   -1000024    16
    0.2806726   2    1000022    15
    0.18025798   2    1000023    15
    0.17948725   2    1000025    15
    0.0001292287   2   -1000037    16

DECAY 2000015  49.020175
    0.29503436   2    1000023    15
    0.28916147   2    1000025    15
    0.19447324   2   -1000037    16
    0.12128271   2    1000022    15
    0.0971736   2    1000035    15
    0.0011399183   2    1000015    25
    0.0010311444   2    1000015    23
    0.00070354923   2   -1000024    16

DECAY 1000012  2.7370231
    0.95421231   2    1000022    12
    0.037507546   2    1000025    12
    0.0077532278   2    1000024    11
    0.00052691449   2    1000023    12

DECAY 1000014  2.7830269
    0.93841882   2    1000022    14
    0.036886614   2    1000025    14
    0.02417637   2    1000024    13
    0.00051819159   2    1000023    14

DECAY 1000016  48.984115
    0.59118843   2    1000024    15
    0.19440495   2    1000037    15
    0.11022327   2    1000022    16
    0.097294918   2    1000035    16
    0.0046652953   2    1000025    16
    0.0021578252   2    1000015    24

DECAY 2000001  1.17611
    0.97029208   2    1000022    1
    0.029397477   2    1000025    1
    0.00028123952   2    1000023    1

DECAY 1000001  1.1123203
    0.62704383   2    1000021    1
    0.34528671   2    1000022    1
    0.021883038   2    1000025    1
    0.0039588385   2    1000023    1
    0.001826742   2   -1000024    2

DECAY 2000003  1.2008294
    0.9505316   2    1000022    3
    0.03371519   2    1000025    3
    0.010326227   2   -1000024    4
    0.005426982   2    1000023    3

DECAY 1000003  1.1313178
    0.61638036   2    1000021    3
    0.33981402   2    1000022    3
    0.029062647   2    1000025    3
    0.011771639   2    1000023    3
    0.0026714717   2   -1000024    4
    0.00029986098   2    2000003    25

DECAY 1000005  50.011775
    0.52585689   2   -1000024    6
    0.2350496   2    1000023    5
    0.22311096   2    1000025    5
    0.015982548   2    1000022    5

DECAY 2000005  95.606189
    0.46569605   2   -1000024    6
    0.23415514   2    1000023    5
    0.22574608   2    1000025    5
    0.024096598   2    1000022    5
    0.022831698   2    1000006   -24
    0.016109577   2    1000005    25
    0.011364857   2    1000005    23

DECAY 2000002  0.00051700827
    1   2    1000022    2

DECAY 1000002  1.1281096
    0.60488076   2    1000021    2
    0.35796607   2    1000022    2
    0.026350304   2    1000024    1
    0.0067729146   2    1000023    2
    0.0040299521   2    1000025    2

DECAY 2000004  0.00050655566
    1   2    1000022    4

DECAY 1000004  1.146666
    0.59487713   2    1000021    4
    0.35218306   2    1000022    4
    0.041460064   2    1000024    3
    0.0070943024   2    1000023    4
    0.0043854273   2    1000025    4

DECAY 1000006  50.102571
    0.46956749   2    1000024    5
    0.26116214   2    1000023    6
    0.25526045   2    1000025    6
    0.010469818   2    1000022    6
    0.0021465173   2    1000022    4
    0.0013569474   3    1000022    24    5

DECAY 2000006  295.37169
    0.25978923   2    1000024    5
    0.19072212   2    1000021    6
    0.1298168   2    1000023    6
    0.12615788   2    1000025    6
    0.11612466   2    1000005    24
    0.086198404   2    1000006    25
    0.058022285   2    1000006    23
    0.032966585   2    1000022    6
    0.00012308671   2    1000037    5

DECAY 1000024  0.42990557
    0.99988185   2    1000022    24
    0.00011792211   2    2000004   -3

DECAY 1000037  75.572287
    0.2287136   2    1000006   -5
    0.22521123   2   -1000005    6
    0.096916805   2    1000024    25
    0.092618347   2    1000024    23
    0.092528788   2    1000023    24
    0.089631735   2    1000025    24
    0.034075988   2    1000014   -13
    0.034073003   2    1000012   -11
    0.033994353   2   -1000013    14
    0.03399166   2   -1000011    12
    0.0084301903   3    1000024    6   -6
    0.0056119812   3    1000025   -5    6
    0.0055493467   3    1000023   -5    6
    0.0037691084   2    1000004   -3
    0.0037685888   2    1000002   -1
    0.0037220339   2   -1000003    4
    0.003721697   2   -1000001    2
    0.0031194805   2    1000022    24
    0.00022269673   3    1000024    5   -5
    0.00019927477   3    1000022   -5    6

DECAY 1000022 -1


DECAY 1000023  0.6471982
    0.6817877   2    1000022    23
    0.31754974   2    1000022    25
    0.00017949027   2    2000004   -4
    0.00017949027   2   -2000004    4
    0.00014186007   2    2000002   -2
    0.00014186007   2   -2000002    2

DECAY 1000025  0.26545672
    0.82020687   2    1000022    25
    0.041395677   2    2000004   -4
    0.041395677   2   -2000004    4
    0.041263928   2    2000002   -2
    0.041263928   2   -2000002    2
    0.014471872   2    1000022    23

DECAY 1000035  79.603039
    0.10899795   2    1000005   -5
    0.10899795   2   -1000005    5
    0.10645599   2    1000006   -6
    0.10645599   2   -1000006    6
    0.088148238   2    1000024   -24
    0.088148238   2   -1000024    24
    0.071602657   2    1000025    25
    0.068699639   2    1000023    25
    0.063464381   2    1000025    23
    0.022431234   2    1000023    23
    0.016185207   2    1000014   -14
    0.016185207   2   -1000014    14
    0.016183795   2    1000012   -12
    0.016183795   2   -1000012    12
    0.016119224   2    1000013   -13
    0.016119224   2   -1000013    13
    0.016117941   2    1000011   -11
    0.016117941   2   -1000011    11
    0.0052507539   3    1000024    5   -6
    0.0052507539   3   -1000024   -5    6
    0.0039094319   3    1000025    6   -6
    0.003889773   3    1000023    6   -6
    0.0023320462   2    1000022    25
    0.0020752049   2    1000022    23
    0.0017869973   2    1000004   -4
    0.0017869973   2   -1000004    4
    0.0017868303   2    1000002   -2
    0.0017868303   2   -1000002    2
    0.0017631174   2    1000003   -3
    0.0017631174   2   -1000003    3
    0.0017628782   2    1000001   -1
    0.0017628782   2   -1000001    1
    0.00013548551   3    1000022    6   -6
    0.0001048918   3    1000023    5   -5

DECAY 1000021  265.58663
    0.15694262   2    2000004   -4
    0.15694262   2   -2000004    4
    0.15694262   2    2000002   -2
    0.15694262   2   -2000002    2
    0.056929531   2    1000005   -5
    0.056929531   2   -1000005    5
    0.05566499   2    1000006   -6
    0.05566499   2   -1000006    6
    0.028402338   2    1000006   -4
    0.028402338   2   -1000006    4
    0.022144126   2    2000003   -3
    0.022144126   2   -2000003    3
    0.022142804   2    2000001   -1
    0.022142804   2   -2000001    1
    0.00072609819   2    2000005   -5
    0.00072609819   2   -2000005    5

DECAY 25  0.0035641432
    0.61157514   2   -5    5
    0.1881992   2   -24    24
    0.074023992   2    21    21
    0.070187471   2   -15    15
    0.030287274   2   -4    4
    0.021627893   2    23    23
    0.0023420144   2    22    22
    0.0012826783   2    22    23
    0.00024339321   2   -13    13
    0.00023014415   2   -3    3
    6.3632711e-07   2   -1    1
    1.5608648e-07   2   -2    2
    5.4717838e-09   2   -11    11

DECAY 35  158.23265
    0.84434487   2   -5    5
    0.13293793   2   -15    15
    0.011877508   2    1000022    1000023
    0.0071539977   2    1000022    1000025
    0.0009115837   2    1000022    1000022
    0.00083133715   2    1000025    1000025
    0.00052150175   2    1000023    1000025
    0.00043657997   2   -6    6
    0.00043237358   2   -13    13
    0.0003772052   2   -3    3
    0.00015303182   2   -1000024    1000024
    1.1035552e-05   2    1000023    1000023
    8.835092e-06   2    21    21
    1.0430783e-06   2   -1    1
    9.3751208e-07   2    25    25
    6.7795382e-08   2   -1000002    1000002
    6.7761383e-08   2   -1000004    1000004
    5.5046929e-08   2    23    23
    1.2832771e-08   2   -24    24
    9.7102834e-09   2   -11    11
    9.2650482e-09   2   -4    4
    6.8337004e-09   2    22    22
    5.5987305e-09   2    22    23
    4.776171e-14   2   -2    2

DECAY 36  143.80295
    0.84240843   2   -5    5
    0.13263133   2   -15    15
    0.010971966   2    1000022    1000025
    0.0094337536   2    1000022    1000023
    0.0013491861   2    1000025    1000025
    0.0013189055   2    1000022    1000022
    0.00044046943   2   -6    6
    0.00043137048   2   -13    13
    0.00038465074   2    1000023    1000025
    0.00037634136   2   -3    3
    0.00022553526   2   -1000024    1000024
    1.5425665e-05   2    1000023    1000023
    1.1435926e-05   2    21    21
    1.0406907e-06   2   -1    1
    1.173526e-07   2    23    25
    1.3107388e-08   2    22    23
    1.1329131e-08   2    22    22
    9.6877173e-09   2   -11    11
    9.3161567e-09   2   -4    4
    1.4291238e-13   2    23    35
    4.8027813e-14   2   -2    2
    2.5158406e-40   2    25    25

DECAY 37  151.91234
    0.8227637   2   -5    6
    0.15281593   2   -15    16
    0.021649714   2    1000022    1000024
    0.0012199815   2   -5    4
    0.0005854305   2    1000024    1000025
    0.00054025874   2   -13    14
    0.00036069617   2   -3    4
    3.6497887e-05   2    1000023    1000024
    1.6932863e-05   2   -3    2
    8.7119263e-06   2   -5    2
    1.0012465e-06   2   -1    2
    9.6071423e-07   2   -3    6
    1.1108339e-07   2    24    25
    4.7043563e-08   2   -1    4
    1.9457006e-08   2   -1    6
    1.2636708e-08   2   -11    12
    8.0213347e-10   2   -1000005    1000004
    4.1974754e-12   2   -1000003    1000004
    1.9100653e-12   2   -2000005    1000004
    2.6407123e-14   2    24    35
    6.2230728e-16   2   -1000001    1000004
    3.0044323e-17   2   -1000005    1000002
    1.1793043e-18   2   -1000003    1000002
    7.1543246e-20   2   -2000005    1000002
    6.1114853e-20   2   -1000001    1000002

DECAY 6  2.43
    1   2    5    24

DECAY 15 -1
