BLOCK SPINFO
   1   SPheno
   2   v4.0.5be

BLOCK SPHENOINFO
   1   2
   2   2

BLOCK MODSEL
   1   0

BLOCK MINPAR
   3    12.104918
   4    1

BLOCK EXTPAR
   0    1476.9488
   1    44.567301
   2    1969.1184
   3    3000
   11    2594.4289
   12   -1518.8684
   13   -277.95966
   23    545.4272
   25    11.61075
   26    2240.2721
   31    591.0793
   32    591.0793
   33    1666.1975
   34    0.20472058
   35    0.20472058
   36    1600.6285
   41    5000
   42    5000
   43    1610.2999
   44    5000
   45    5000
   46    1413.7877
   47    5000
   48    5000
   49    1799.7849

BLOCK SMINPUTS
   1    127.90897
   2    1.1663787e-05
   3    0.1184
   4    91.1876
   5    4.18
   6    173.2
   7    1.777
   8    0
   11    0.00051099893
   12    0
   13    0.10565837
   14    0
   21    0.005
   22    0.0025
   23    0.095
   24    1.27

BLOCK GAUGE Q=  1476.9488
   1    0.35536298
   2    0.66519887
   3    1.219778

BLOCK YU Q=  1476.9488
   1   1    8.4154118e-06
   2   2    0.0042750292
   3   3    1.0166493

BLOCK YD Q=  1476.9488
   1   1    0.00019634322
   2   2    0.0037305211
   3   3    0.19471095

BLOCK YE Q=  1476.9488
   1   1    3.4263327e-05
   2   2    0.0070845694
   3   3    0.1191508

BLOCK AU Q=  1476.9488
   1   1    0
   2   2    0
   3   3    2594.4289

BLOCK AD Q=  1476.9488
   1   1    0
   2   2    0
   3   3   -1518.8684

BLOCK AE Q=  1476.9488
   1   1    0
   2   2    0
   3   3   -277.95966

BLOCK MSOFT Q=  1476.9488
   1    44.567301
   2    1969.1184
   3    3000
   21    4652422.3
   22   -210981.64
   31    591.0793
   32    591.0793
   33    1666.1975
   34    0.20472058
   35    0.20472058
   36    1600.6285
   41    5000
   42    5000
   43    1610.2999
   44    5000
   45    5000
   46    1413.7877
   47    5000
   48    5000
   49    1799.7849

BLOCK MASS
   6    173.2
   23    91.1876
   24    80.429995
   15    1.777
   25    120.55424
   35    2240.2695
   36    2240.2721
   37    2242.0071
   1000001    5024.0245
   2000001    5017.3413
   1000002    5023.589
   2000002    5018.5317
   1000003    5024.0253
   2000003    5017.3417
   1000004    5023.5897
   2000004    5018.5326
   1000005    1606.2505
   2000005    1825.4955
   1000006    1312.4916
   2000006    1662.0128
   1000011    608.79586
   2000011    68.076302
   1000012    603.3089
   1000013    608.79637
   2000013    68.061417
   1000014    603.30806
   1000015    1602.6915
   2000015    1678.6282
   1000016    1676.2094
   1000021    3185.6073
   1000022    42.888379
   1000023    554.14837
   1000025   -556.05831
   1000035    2008.1864
   1000024    552.74347
   1000037    2008.3605

BLOCK ALPHA
      -0.082814294

BLOCK HMIX Q=  1476.9488
   1    545.4272
   2    11.61075
   3    244.02876
   4    5018818.9

BLOCK STOPMIX
   1   1   -0.40549903
   1   2    0.91409548
   2   1   -0.91409548
   2   2   -0.40549903

BLOCK SBOTMIX
   1   1    0.99973
   1   2    0.023236418
   2   1   -0.023236418
   2   2    0.99973

BLOCK STAUMIX
   1   1    0.048035942
   1   2    0.99884561
   2   1   -0.99884561
   2   2    0.048035942

BLOCK NMIX
   1   1    0.99661681
   1   2   -0.00074543772
   1   3    0.081149407
   1   4   -0.013005873
   2   1    0.066622261
   2   2    0.041078416
   2   3   -0.70482969
   2   4    0.70504549
   3   1   -0.048117886
   3   2    0.01988011
   3   3    0.70455958
   3   4    0.70773247
   4   1    0.0010383144
   4   2   -0.99895785
   4   3   -0.015022714
   4   4    0.043086549

BLOCK UMIX
   1   1   -0.021270106
   1   2    0.99977377
   2   1    0.99977377
   2   2    0.021270106

BLOCK VMIX
   1   1   -0.060997963
   1   2    0.99813789
   2   1    0.99813789
   2   2    0.060997963

BLOCK HIGGSBOUNDSINPUTHIGGSCOUPLINGSFERMIONS
       0, 134.80952,3,36,15,15

BLOCK HIGGSBOUNDSINPUTHIGGSCOUPLINGSBOSONS
       0,4,36,21,21,23

BLOCK SPHENOLOWENERGY
   1    0.00033703358
   2    1.5874768e-06
   3    3.5221875e-05
   4    2.6165483e-15
   5    1.11776e-10
   6    2.3400317e-08
   7    8.8091714e-14
   8    3.7632763e-09
   9    7.982621e-07
   10    9.6628143e-05
   11    0.99813172
   12    0.54344386
   13    19.416901
   14    0
   15    0
   16    0.00216387
   17    2.2817252e-15
   18    2.4782841e-11
   19    8.2861473e-11
   20    4.1702831e-15
   21    1.783752e-10
   22    1.6663495e-08
   23    0
   24    0
   25    0
   26    0
   27    0
   28    0
   29    0
   30    0
   31    0
   39    2.5188336e-05
   40    0
   41    0
   42    0

BLOCK FWCOEF Q=  160
   305   4422   0   0   -0.18881911
   305   4422   0   2   -0.20709658
   305   4322   0   2   -0.00024605497
   305   6421   0   0   -0.095227835
   305   6421   0   2   -0.1116328
   305   6321   0   2   -0.00027153997
   3051111   4133   0   0    1.5912025
   3051111   4133   0   2    1.5929319
   3051111   4233   0   2    1.629302e-05
   3051111   4137   0   0   -4.4138946
   3051111   4137   0   2   -4.4092151
   3051111   4237   0   2   -0.00012705315
   3051313   4133   0   0    1.5912025
   3051313   4133   0   2    1.5929314
   3051313   4233   0   2    1.6292971e-05
   3051313   4137   0   0   -4.4138946
   3051313   4137   0   2   -4.4092156
   3051313   4237   0   2   -0.00012705319
   3051212   4137   0   0    1.5053501
   3051212   4137   0   2    1.5043335
   3051212   4237   0   2    2.7666199e-05
   3051414   4137   0   0    1.5053501
   3051414   4137   0   2    1.5043335
   3051414   4237   0   2    2.7666201e-05
   3051616   4137   0   0    1.5053501
   3051616   4137   0   2    1.504334
   3051616   4237   0   2    2.7668065e-05

BLOCK IMFWCOEF Q=  160
   305   4422   0   0    3.8580372e-07
   305   4422   0   2    5.4500807e-06
   305   4322   0   2   -8.7366182e-07
   305   6421   0   0    3.304664e-07
   305   6421   0   2   -4.669723e-07
   305   6321   0   2   -3.645804e-07
   3051111   4133   0   2   -5.0387927e-07
   3051111   4233   0   2    3.8968269e-07
   3051111   4137   0   2    4.9354537e-06
   3051111   4237   0   2   -3.0393883e-06
   3051313   4133   0   2   -5.0387084e-07
   3051313   4233   0   2    3.8968194e-07
   3051313   4137   0   2    4.935461e-06
   3051313   4237   0   2   -3.0393892e-06
   3051212   4137   0   2   -1.0251889e-06
   3051212   4237   0   2    6.6200822e-07
   3051414   4137   0   2   -1.0251891e-06
   3051414   4237   0   2    6.6200822e-07
   3051616   4137   0   2   -1.0161797e-06
   3051616   4237   0   2    6.6203397e-07

DECAY 23  2.4952


DECAY 24  2.085


DECAY 2000011  0.12357405
    1   2    1000022    11

DECAY 1000011  0.75049368
    0.99927988   2    1000022    11
    0.00061708309   2    1000023    11

DECAY 2000013  0.12347351
    1   2    1000022    13

DECAY 1000013  0.75074475
    0.99895186   2    1000022    13
    0.00062839812   2    1000023    13
    0.00030571825   2    2000013    25

DECAY 1000015  8.7247804
    0.91505174   2    1000022    15
    0.04062307   2   -1000024    16
    0.023228258   2    1000023    15
    0.021096934   2    1000025    15

DECAY 2000015  2.5096502
    0.83502704   2    1000022    15
    0.087978745   2    1000023    15
    0.076242939   2    1000025    15
    0.00074818182   2   -1000024    16

DECAY 1000012  0.74786837
    0.99914872   2    1000022    12
    0.00068152562   2    1000024    11
    0.00016713682   2    1000025    12

DECAY 1000014  0.74788246
    0.99912848   2    1000022    14
    0.00070178062   2    1000024    13
    0.00016712818   2    1000025    14

DECAY 1000016  2.5261185
    0.82912864   2    1000022    16
    0.16598686   2    1000024    15
    0.0048069238   2    1000025    16

DECAY 2000001  143.8929
    0.9805391   2    1000021    1
    0.019332553   2    1000022    1

DECAY 1000001  189.33794
    0.74886413   2    1000021    1
    0.1648219   2   -1000037    2
    0.08231238   2    1000035    1
    0.0037089412   2    1000022    1
    0.00010313565   2   -1000024    2

DECAY 2000003  143.89565
    0.98052068   2    1000021    3
    0.019332249   2    1000022    3

DECAY 1000003  189.34117
    0.7488518   2    1000021    3
    0.16481915   2   -1000037    4
    0.082311   2    1000035    3
    0.0037089267   2    1000022    3
    0.0001125103   2   -1000024    4
    0.0001008317   2    1000023    3

DECAY 1000005  41.019831
    0.6028434   2   -1000024    6
    0.36845252   2    1000006   -24
    0.011505505   2    1000023    5
    0.011386475   2    1000025    5
    0.0058120988   2    1000022    5

DECAY 2000005  3.3621369
    0.33903133   2   -1000024    6
    0.30132606   2    1000022    5
    0.1691484   2    1000025    5
    0.16869286   2    1000023    5
    0.011857731   2    1000006   -24
    0.0052372877   2    1000005    25
    0.0028722772   2    1000005    23
    0.0018340544   2    2000006   -24

DECAY 2000002  152.4203
    0.92649424   2    1000021    2
    0.073021173   2    1000022    2
    0.00031844841   2    1000023    2
    0.00016608844   2    1000025    2

DECAY 1000002  189.32855
    0.74866177   2    1000021    2
    0.16426603   2    1000037    1
    0.082242989   2    1000035    2
    0.0036470108   2    1000022    2
    0.00084818814   2    1000024    1
    0.00031942524   2    1000023    2

DECAY 2000004  152.42389
    0.92647262   2    1000021    4
    0.073019458   2    1000022    4
    0.00032425275   2    1000023    4
    0.00017193038   2    1000025    4

DECAY 1000004  189.33171
    0.74864936   2    1000021    4
    0.16426334   2    1000037    3
    0.082241648   2    1000035    4
    0.0036469515   2    1000022    4
    0.00085531879   2    1000024    3
    0.00032409454   2    1000023    4

DECAY 1000006  35.897254
    0.41193852   2    1000024    5
    0.2649529   2    1000023    6
    0.25878671   2    1000025    6
    0.064302702   2    1000022    6

DECAY 2000006  48.543753
    0.26009897   2    1000025    6
    0.25313517   2    1000023    6
    0.21173542   2    1000006    23
    0.13185515   2    1000006    25
    0.12530499   2    1000024    5
    0.017870295   2    1000022    6

DECAY 1000024  0.38177999
    0.99402904   2    1000022    24
    0.0052656142   3    1000022   -5    6
    0.00070076217   2   -2000013    14

DECAY 1000037  56.624687
    0.12872847   2    1000014   -13
    0.1287284   2    1000012   -11
    0.12868297   2   -1000011    12
    0.12868292   2   -1000013    14
    0.083031578   2    1000024    25
    0.080051389   2    1000025    24
    0.079711019   2    1000023    24
    0.079710777   2    1000024    23
    0.051478662   2   -1000005    6
    0.036901551   2    1000006   -5
    0.035576722   2    2000006   -5
    0.014317929   2    1000016   -15
    0.014148109   2   -2000015    16
    0.0042969979   3    1000024    6   -6
    0.0032174734   3    1000023   -5    6
    0.0026583221   3    1000025   -5    6

DECAY 1000022 -1


DECAY 1000023  0.368485
    0.57413901   2    1000022    25
    0.35952233   2    1000022    23
    0.016627298   2    2000013   -13
    0.016627298   2   -2000013    13
    0.016267141   2    2000011   -11
    0.016267141   2   -2000011    11
    0.00054109644   3    1000022    6   -6

DECAY 1000025  0.42303271
    0.60445704   2    1000022    23
    0.36459228   2    1000022    25
    0.0077335089   2    2000013   -13
    0.0077335089   2   -2000013    13
    0.0074185188   2    2000011   -11
    0.0074185188   2   -2000011    11
    0.00062026714   3    1000022    6   -6

DECAY 1000035  58.506104
    0.077531223   2    1000024   -24
    0.077531223   2   -1000024    24
    0.065236952   2    1000023    25
    0.062801224   2    1000025    23
    0.062458575   2    1000014   -14
    0.062458575   2   -1000014    14
    0.062458541   2    1000012   -12
    0.062458541   2   -1000012    12
    0.06209423   2    1000011   -11
    0.06209423   2   -1000011    11
    0.062094209   2    1000013   -13
    0.062094209   2   -1000013    13
    0.046947314   2    1000025    25
    0.029329643   2    1000005   -5
    0.029329643   2   -1000005    5
    0.016794456   2    1000006   -6
    0.016794456   2   -1000006    6
    0.014599934   2    1000023    23
    0.013814943   2    2000006   -6
    0.013814943   2   -2000006    6
    0.0069420056   2    1000016   -16
    0.0069420056   2   -1000016    16
    0.0068214431   2    2000015   -15
    0.0068214431   2   -2000015    15
    0.0030993097   3    1000024    5   -6
    0.0030993097   3   -1000024   -5    6
    0.0019080347   3    1000023    6   -6
    0.0015457999   3    1000025    6   -6

DECAY 1000021  210.51227
    0.1690669   2    1000006   -6
    0.1690669   2   -1000006    6
    0.12453868   2    1000005   -5
    0.12453868   2   -1000005    5
    0.10522036   2    2000006   -6
    0.10522036   2   -2000006    6
    0.10104183   2    2000005   -5
    0.10104183   2   -2000005    5

DECAY 25  0.052900502
    0.46787839   2   -1000011    1000011
    0.46735184   2   -1000013    1000013
    0.040974697   2   -5    5
    0.01026492   2   -24    24
    0.0047722255   2    21    21
    0.0046904469   2   -15    15
    0.0020174401   2   -4    4
    0.0011361894   2    23    23
    0.00065428223   2    1000022    1000022
    0.00016243658   2    22    22
    6.5383237e-05   2    22    23
    1.6286059e-05   2   -13    13
    1.5408634e-05   2   -3    3
    4.2603364e-08   2   -1    1
    1.0397287e-08   2   -2    2
    3.661333e-10   2   -11    11

DECAY 35  6.9772283
    0.48675942   2   -5    5
    0.19039463   2    1000022    1000025
    0.13706753   2    1000022    1000023
    0.097201072   2   -15    15
    0.073107999   2   -6    6
    0.0066423988   2   -1000024    1000024
    0.0045854772   2    1000022    1000022
    0.0021239768   2    1000025    1000025
    0.00063790879   2    1000023    1000025
    0.00040519253   2    25    25
    0.00034487414   2   -13    13
    0.00028431598   2    1000022    1000035
    0.00020035316   2   -3    3
    5.70663e-05   2    23    23
    4.5204834e-05   2    1000023    1000023
    2.5730067e-05   2   -24    24
    1.5226341e-05   2    21    21
    9.8751475e-06   2   -2000011    2000011
    9.8740996e-06   2   -2000013    2000013
    7.5260629e-06   2   -1000011    1000011
    7.5137143e-06   2   -1000013    1000013
    1.0727863e-06   2   -4    4
    5.5392656e-07   2   -1    1
    3.5585012e-07   2    22    22
    1.9279371e-07   2    22    23
    6.2486514e-08   2   -2000013    1000013
    6.2486514e-08   2   -1000013    2000013
    7.7463595e-09   2   -11    11
    5.5303578e-12   2   -2    2
    1.4615893e-12   2   -2000011    1000011
    1.4615893e-12   2   -1000011    2000011

DECAY 36  6.913667
    0.4816376   2   -5    5
    0.19661132   2    1000022    1000023
    0.13436271   2    1000022    1000025
    0.09617246   2   -15    15
    0.072503802   2   -6    6
    0.0098514318   2   -1000024    1000024
    0.0048900731   2    1000022    1000022
    0.0020182284   2    1000025    1000025
    0.00078557657   2    1000023    1000025
    0.00037110549   2    1000022    1000035
    0.00034121912   2   -13    13
    0.00019823416   2   -3    3
    8.9986353e-05   2    21    21
    8.3287959e-05   2    1000023    1000023
    8.0233126e-05   2    23    25
    1.0349035e-06   2   -4    4
    7.0082051e-07   2    22    22
    5.4806799e-07   2   -1    1
    3.1976388e-07   2    22    23
    6.3113063e-08   2   -2000013    1000013
    6.3113063e-08   2   -1000013    2000013
    7.6642625e-09   2   -11    11
    5.3352435e-12   2   -2    2
    1.476221e-12   2   -2000011    1000011
    1.476221e-12   2   -1000011    2000011
    6.5469163e-38   2    25    25

DECAY 37  6.9572571
    0.56476671   2   -5    6
    0.33508296   2    1000022    1000024
    0.094431654   2   -15    16
    0.0031504948   2    1000023    1000024
    0.00070628715   2   -5    4
    0.000662555   2    1000022    1000037
    0.00037511561   2    1000024    1000025
    0.0003338498   2   -13    14
    0.00018558743   2   -3    4
    0.00012697893   2   -3    6
    8.0006884e-05   2    24    25
    3.8811087e-05   2   -2000011    1000012
    3.8809438e-05   2   -2000013    1000014
    8.6095037e-06   2   -3    2
    5.8114226e-06   2   -1    6
    5.0436081e-06   2   -5    2
    5.1182906e-07   2   -1    2
    1.1648209e-07   2   -1000013    1000014
    7.722226e-08   2   -1    4
    7.8087815e-09   2   -11    12
    3.0984661e-12   2    24    35
    3.0754616e-12   2    24    36
    2.7245109e-12   2   -1000011    1000012

DECAY 6  2.43
    1   2    5    24

DECAY 15 -1
