BLOCK SPINFO
   1   SPheno
   2   v4.0.5be

BLOCK SPHENOINFO
   1   2
   2   2

BLOCK MODSEL
   1   0

BLOCK MINPAR
   3    21.634899
   4   -1

BLOCK EXTPAR
   0    1874.3405
   1   -748.42295
   2    3427.4989
   3    1998.5233
   11   -3611.2078
   12    1530.3561
   13    7279.6104
   23   -2919.6128
   25    20.907058
   26    3629.3828
   31    2069.3465
   32    2069.3465
   33    3810.6273
   34    4945.7313
   35    4945.7313
   36    4674.6731
   41    3961.2286
   42    3961.2286
   43    873.06742
   44    4135.8576
   45    4135.8576
   46    3435.3593
   47    2285.0723
   48    2285.0723
   49    3302.3687

BLOCK SMINPUTS
   1    127.90897
   2    1.1663787e-05
   3    0.1184
   4    91.1876
   5    4.18
   6    173.2
   7    1.777
   8    0
   11    0.00051099893
   12    0
   13    0.10565837
   14    0
   21    0.005
   22    0.0025
   23    0.095
   24    1.27

BLOCK GAUGE Q=  1874.3405
   1    0.35536298
   2    0.66519887
   3    1.219778

BLOCK YU Q=  1874.3405
   1   1    8.3939574e-06
   2   2    0.0042641304
   3   3    1.0140575

BLOCK YD Q=  1874.3405
   1   1    0.0003526468
   2   2    0.0067002891
   3   3    0.34971512

BLOCK YE Q=  1874.3405
   1   1    6.1539445e-05
   2   2    0.012724405
   3   3    0.21400357

BLOCK AU Q=  1874.3405
   1   1    0
   2   2    0
   3   3   -3611.2077

BLOCK AD Q=  1874.3405
   1   1    0
   2   2    0
   3   3    1530.3559

BLOCK AE Q=  1874.3405
   1   1    0
   2   2    0
   3   3    7279.6104

BLOCK MSOFT Q=  1874.3405
   1   -748.42295
   2    3427.4989
   3    1998.5233
   21    4596006.9
   22   -8536419
   31    2069.3465
   32    2069.3465
   33    3810.6273
   34    4945.7313
   35    4945.7313
   36    4674.6731
   41    3961.2286
   42    3961.2286
   43    873.06742
   44    4135.8576
   45    4135.8576
   46    3435.3593
   47    2285.0723
   48    2285.0723
   49    3302.3687

BLOCK MASS
   6    173.2
   23    91.1876
   24    80.429995
   15    1.777
   25    121.9526
   35    3629.4711
   36    3629.3828
   37    3630.8009
   1000001    4004.6891
   2000001    2343.2571
   1000002    4004.0564
   2000002    4170.8415
   1000003    4004.6889
   2000003    2343.2592
   1000004    4004.0562
   2000004    4170.8418
   1000005    1019.1852
   2000005    3340.1769
   1000006    1016.6061
   2000006    3455.7652
   1000011    2073.1312
   2000011    4951.8611
   1000012    2071.2667
   1000013    2073.1405
   2000013    4951.8595
   1000014    2071.2764
   1000015    3820.557
   2000015    4684.31
   1000016    3819.5852
   1000021    2214.5107
   1000022   -754.0506
   1000023    2918.3882
   1000025   -2924.8127
   1000035    3447.8472
   1000024    2919.0312
   1000037    3448.0785

BLOCK ALPHA
      -0.046288396

BLOCK HMIX Q=  1874.3405
   1   -2919.6128
   2    20.907058
   3    243.85544
   4    13172419

BLOCK STOPMIX
   1   1    0.99897265
   1   2    0.045317237
   2   1   -0.045317237
   2   2    0.99897265

BLOCK SBOTMIX
   1   1   -0.99986898
   1   2    0.016187297
   2   1   -0.016187297
   2   2   -0.99986898

BLOCK STAUMIX
   1   1   -0.99987437
   1   2    0.015850856
   2   1   -0.015850856
   2   2   -0.99987437

BLOCK NMIX
   1   1   -0.99985844
   1   2   -9.1682259e-05
   1   3    0.016133075
   1   4   -0.004775751
   2   1    0.0079934873
   2   2    0.1047669
   2   3    0.70393736
   2   4    0.70244729
   3   1   -0.01478387
   3   2    0.0093013992
   3   3   -0.7068587
   3   4    0.7071391
   4   1    0.00079602682
   4   2   -0.9944533
   4   3    0.067547749
   4   4    0.080618211

BLOCK UMIX
   1   1   -0.092997907
   1   2   -0.9956663
   2   1    0.9956663
   2   2   -0.092997907

BLOCK VMIX
   1   1   -0.11115384
   1   2    0.99380321
   2   1    0.99380321
   2   2    0.11115384

BLOCK HIGGSBOUNDSINPUTHIGGSCOUPLINGSFERMIONS
       0, 437.10509,3,36,15,15

BLOCK HIGGSBOUNDSINPUTHIGGSCOUPLINGSBOSONS
       0,4,36,21,21,23

BLOCK SPHENOLOWENERGY
   1    0.00033478737
   2    1.5900449e-06
   3    3.5280097e-05
   4    2.5087555e-15
   5    1.0717138e-10
   6    2.244609e-08
   7    8.5030606e-14
   8    3.6325111e-09
   9    7.7085022e-07
   10    9.654383e-05
   11    0.9972608
   12    0.54211379
   13    19.368421
   14    0
   15    0
   16    0.0021580812
   17    2.2816662e-15
   18    2.4814103e-11
   19    8.2940755e-11
   20   -6.3337851e-16
   21   -2.7078843e-11
   22   -6.1243513e-09
   23    0
   24    0
   25    0
   26    0
   27    0
   28    0
   29    0
   30    0
   31    0
   39    5.4850368e-05
   40    0
   41    0
   42    0

BLOCK FWCOEF Q=  160
   305   4422   0   0   -0.18881911
   305   4422   0   2   -0.20530388
   305   4322   0   2   -0.00020981532
   305   6421   0   0   -0.095227835
   305   6421   0   2   -0.10759268
   305   6321   0   2   -0.00014356924
   3051111   4133   0   0    1.5997723
   3051111   4133   0   2    1.6002806
   3051111   4233   0   2    8.0283148e-05
   3051111   4137   0   0   -4.4224644
   3051111   4137   0   2   -4.4235239
   3051111   4237   0   2   -0.00061910924
   3051313   4133   0   0    1.5997723
   3051313   4133   0   2    1.6002803
   3051313   4233   0   2    8.0283121e-05
   3051313   4137   0   0   -4.4224644
   3051313   4137   0   2   -4.4235243
   3051313   4237   0   2   -0.0006191093
   3051212   4137   0   0    1.5053501
   3051212   4137   0   2    1.5055806
   3051212   4237   0   2    0.00013469028
   3051414   4137   0   0    1.5053501
   3051414   4137   0   2    1.5055806
   3051414   4237   0   2    0.00013469028
   3051616   4137   0   0    1.5053501
   3051616   4137   0   2    1.5055809
   3051616   4237   0   2    0.00013469099

BLOCK IMFWCOEF Q=  160
   305   4422   0   0    3.8575344e-07
   305   4422   0   2   -1.576177e-05
   305   4322   0   2   -2.1441409e-06
   305   6421   0   0    3.3042333e-07
   305   6421   0   2    2.7029701e-05
   305   6321   0   2   -4.3337503e-07
   3051111   4133   0   2    1.0393293e-06
   3051111   4233   0   2    1.5831144e-06
   3051111   4137   0   2   -2.022589e-06
   3051111   4237   0   2   -1.2207352e-05
   3051313   4133   0   2    1.0393279e-06
   3051313   4233   0   2    1.5831142e-06
   3051313   4137   0   2   -2.0225921e-06
   3051313   4237   0   2   -1.2207353e-05
   3051212   4137   0   2    4.394234e-07
   3051212   4237   0   2    2.6557685e-06
   3051414   4137   0   2    4.3942314e-07
   3051414   4237   0   2    2.6557685e-06
   3051616   4137   0   2    4.4585386e-07
   3051616   4237   0   2    2.6557672e-06

DECAY 23  2.4952


DECAY 24  2.085


DECAY 1000011  1.960832
    1   2    1000022    11

DECAY 2000011  23.737041
    0.99987415   2    1000022    11

DECAY 1000013  1.9608474
    1   2    1000022    13

DECAY 2000013  23.752849
    0.99920851   2    1000022    13
    0.00028344008   2   -1000024    14
    0.0002393117   2    1000025    13
    0.00017025014   2    1000023    13

DECAY 1000015  6.8474104
    0.6482608   2    1000022    15
    0.16731681   2   -1000037    16
    0.083534683   2    1000035    15
    0.049252864   2    1000023    15
    0.043450854   2    1000025    15
    0.0081839901   2   -1000024    16

DECAY 2000015  26.815708
    0.83238966   2    1000022    15
    0.058478087   2   -1000024    16
    0.029723067   2    1000025    15
    0.029251411   2    1000023    15
    0.024339706   2    1000016   -24
    0.012711067   2    1000015    25
    0.012083771   2    1000015    23
    0.00067409361   2   -1000037    16
    0.00034913895   2    1000035    15

DECAY 1000012  1.9566488
    1   2    1000022    12

DECAY 1000014  1.9566636
    1   2    1000022    14

DECAY 1000016  6.8369832
    0.64773135   2    1000022    16
    0.16646124   2    1000037    15
    0.097923132   2    1000024    15
    0.083457611   2    1000035    16
    0.0043022039   2    1000023    16
    0.00012445734   2    1000025    16

DECAY 2000001  3.1634087
    0.66775898   2    1000021    1
    0.33224102   2    1000022    1

DECAY 1000001  156.47463
    0.9735802   2    1000021    1
    0.014943368   2   -1000037    2
    0.0074613477   2    1000035    1
    0.003318964   2    1000022    1
    0.00042804965   2   -1000024    2
    0.00026456316   2    1000023    1

DECAY 2000003  3.1634735
    0.66776519   2    1000021    3
    0.33223482   2    1000022    3

DECAY 1000003  156.47632
    0.9735696   2    1000021    3
    0.014943203   2   -1000037    4
    0.0074612647   2    1000035    3
    0.0033189338   2    1000022    3
    0.00042998889   2   -1000024    4
    0.00026705315   2    1000023    3

DECAY 1000005  0.029524104
    1   2    1000022    5

DECAY 2000005  95.713937
    0.8652743   2    1000021    5
    0.05162996   2    1000006   -24
    0.030741999   2    1000005    25
    0.02580397   2    1000005    23
    0.017531053   2    1000022    5
    0.0043694949   2   -1000024    6
    0.002339842   2    1000023    5
    0.0023093787   2    1000025    5

DECAY 1000002  156.42337
    0.97347433   2    1000021    2
    0.014863061   2    1000037    1
    0.0074448623   2    1000035    2
    0.0033262942   2    1000022    2
    0.00061118043   2    1000024    1
    0.0002791799   2    1000023    2

DECAY 2000002  178.47675
    0.95117857   2    1000021    2
    0.048817615   2    1000022    2

DECAY 1000004  156.42435
    0.97346756   2    1000021    4
    0.014862958   2    1000037    3
    0.0074448125   2    1000035    4
    0.0033262722   2    1000022    4
    0.00061615739   2    1000024    3
    0.00028014506   2    1000023    4

DECAY 2000004  178.47748
    0.95117441   2    1000021    4
    0.048817407   2    1000022    4

DECAY 1000006  0.023482016
    0.9984431   2    1000022    6
    0.0015568975   3    1000022    24    5

DECAY 2000006  208.48038
    0.44343093   2    1000021    6
    0.21002369   2    1000005    24
    0.15474777   2    1000006    25
    0.10491201   2    1000006    23
    0.033360789   2    1000022    6
    0.027252777   2    1000024    5
    0.013209241   2    1000023    6
    0.01306268   2    1000025    6

DECAY 1000024  80.888081
    0.86108206   2   -1000005    6
    0.11226255   2    1000006   -5
    0.023852456   2    1000022    24
    0.0011206419   3    1000022   -5    6
    0.00049795778   2    1000014   -13
    0.00048378795   2    1000012   -11
    0.00033741489   2   -1000011    12
    0.00033740869   2   -1000013    14

DECAY 1000037  111.9743
    0.33212851   2   -1000005    6
    0.32986681   2    1000006   -5
    0.054779941   2   -1000011    12
    0.054779382   2   -1000013    14
    0.054686286   2    1000012   -11
    0.054685899   2    1000014   -13
    0.031631181   2    1000023    24
    0.029862289   2    1000025    24
    0.028153201   2    1000024    23
    0.027928614   2    1000024    25
    0.0004633836   3    1000025   -5    6
    0.00035276366   3    1000023   -5    6
    0.000302967   2    1000022    24
    0.00018688094   3    1000024    6   -6

DECAY 1000022 -1


DECAY 1000023  82.396292
    0.43091349   2    1000006   -6
    0.43091349   2   -1000006    6
    0.051546464   2    1000005   -5
    0.051546464   2   -1000005    5
    0.018084135   2    1000022    23
    0.014616635   2    1000022    25
    0.00065944201   3    1000022    6   -6
    0.00023434072   2    1000013   -13
    0.00023434072   2   -1000013    13
    0.00022742016   2    1000011   -11
    0.00022742016   2   -1000011    11
    0.00019389723   2    1000012   -12
    0.00019389723   2   -1000012    12
    0.00019389353   2    1000014   -14
    0.00019389353   2   -1000014    14

DECAY 1000025  80.520451
    0.43653452   2    1000006   -6
    0.43653452   2   -1000006    6
    0.051102992   2    1000005   -5
    0.051102992   2   -1000005    5
    0.018326419   2    1000022    25
    0.0055505097   2    1000022    23
    0.00078762454   3    1000022    6   -6

DECAY 1000035  115.23543
    0.1629029   2    1000005   -5
    0.1629029   2   -1000005    5
    0.15861193   2    1000006   -6
    0.15861193   2   -1000006    6
    0.033023165   2    1000025    25
    0.030563536   2    1000025    23
    0.026797148   2    1000023    25
    0.026621052   2    1000012   -12
    0.026621052   2   -1000012    12
    0.026620769   2    1000014   -14
    0.026620769   2   -1000014    14
    0.026521523   2    1000011   -11
    0.026521523   2   -1000011    11
    0.026521351   2    1000013   -13
    0.026521351   2   -1000013    13
    0.026149854   2    1000024   -24
    0.026149854   2   -1000024    24
    0.00034617085   3    1000024    5   -6
    0.00034617085   3   -1000024   -5    6
    0.00023727065   2    1000023    23
    0.00022741657   2    1000022    23
    0.0002037327   2    1000022    25

DECAY 1000021  80.667608
    0.25244464   2    1000005   -5
    0.25244464   2   -1000005    5
    0.24752357   2    1000006   -6
    0.24752357   2   -1000006    6

DECAY 25  0.0035147877
    0.61811853   2   -5    5
    0.18119572   2   -24    24
    0.07454239   2    21    21
    0.070869374   2   -15    15
    0.030588882   2   -4    4
    0.020627696   2    23    23
    0.0023344785   2    22    22
    0.0012437802   2    22    23
    0.00024577993   2   -13    13
    0.00023256632   2   -3    3
    6.4302414e-07   2   -1    1
    1.5764151e-07   2   -2    2
    5.5254468e-09   2   -11    11

DECAY 35  25.968566
    0.85267899   2   -5    5
    0.11715174   2   -15    15
    0.015476052   2   -1000006    1000006
    0.013745299   2   -6    6
    0.00038826453   2   -13    13
    0.00032990267   2   -3    3
    9.085614e-05   2    25    25
    6.6137462e-05   2   -1000005    1000005
    6.1186595e-05   2    1000022    1000022
    6.6191375e-06   2    21    21
    3.1273697e-06   2    23    23
    9.1225092e-07   2   -1    1
    7.4159347e-07   2   -24    24
    1.2789238e-07   2   -4    4
    3.0280161e-08   2    22    23
    8.7197046e-09   2   -11    11
    3.6258263e-09   2    22    22
    6.5901484e-13   2   -2    2

DECAY 36  24.838653
    0.86468488   2   -5    5
    0.11880186   2   -15    15
    0.015673294   2   -6    6
    0.00039373405   2   -13    13
    0.0003345587   2   -3    3
    8.1453427e-05   2    1000022    1000022
    2.2792604e-05   2    21    21
    6.2394005e-06   2    23    25
    9.2512796e-07   2   -1    1
    1.4731029e-07   2   -4    4
    6.2932614e-08   2    22    22
    4.6912504e-08   2    22    23
    8.8425416e-09   2   -11    11
    7.5914597e-13   2   -2    2
    4.2642119e-38   2    25    25

DECAY 37  25.013557
    0.85761504   2   -5    6
    0.13587264   2   -15    16
    0.0044077342   2   -1000005    1000006
    0.0012542972   2   -5    4
    0.00048035819   2   -13    14
    0.0003204464   2   -3    4
    1.7553041e-05   2   -3    6
    1.5034024e-05   2   -3    2
    8.9569737e-06   2   -5    2
    6.2056912e-06   2    24    25
    8.8915836e-07   2   -1    2
    7.8321981e-07   2   -1    6
    4.8756898e-08   2   -1    4
    1.1235628e-08   2   -11    12
    2.2428386e-10   2   -1000003    1000006
    3.122595e-13   2    24    36
    2.263919e-13   2    24    35
    2.8508103e-14   2   -1000001    1000006

DECAY 6  2.43
    1   2    5    24

DECAY 15 -1
