BLOCK SPINFO
   1   SPheno
   2   v4.0.5be

BLOCK SPHENOINFO
   1   2
   2   2

BLOCK MODSEL
   1   0

BLOCK MINPAR
   3    30.895983
   4   -1

BLOCK EXTPAR
   0    1176.8098
   1    690.70541
   2    1362.5639
   3    3000
   11    4179.1642
   12   -749.2376
   13   -1003.0526
   23   -502.86281
   25    30.119097
   26    2259.0067
   31    667.77276
   32    667.77276
   33    981.42002
   34    1698.7163
   35    1698.7163
   36    913.17966
   41    5000
   42    5000
   43    893.77306
   44    5000
   45    5000
   46    1980.7393
   47    5000
   48    5000
   49    1680.1208

BLOCK SMINPUTS
   1    127.90897
   2    1.1663787e-05
   3    0.1184
   4    91.1876
   5    4.18
   6    173.2
   7    1.777
   8    0
   11    0.00051099893
   12    0
   13    0.10565837
   14    0
   21    0.005
   22    0.0025
   23    0.095
   24    1.27

BLOCK GAUGE Q=  1176.8098
   1    0.35536298
   2    0.66519887
   3    1.219778

BLOCK YU Q=  1176.8098
   1   1    8.3889921e-06
   2   2    0.004261608
   3   3    1.0134576

BLOCK YD Q=  1176.8098
   1   1    0.00050772902
   2   2    0.0096468514
   3   3    0.50350809

BLOCK YE Q=  1176.8098
   1   1    8.8602427e-05
   2   2    0.018320172
   3   3    0.30811515

BLOCK AU Q=  1176.8098
   1   1    0
   2   2    0
   3   3    4179.1643

BLOCK AD Q=  1176.8098
   1   1    0
   2   2    0
   3   3   -749.23761

BLOCK AE Q=  1176.8098
   1   1    0
   2   2    0
   3   3   -1003.0526

BLOCK MSOFT Q=  1176.8098
   1    690.70541
   2    1362.5639
   3    3000
   21    4866382
   22   -243896.06
   31    667.77276
   32    667.77276
   33    981.42002
   34    1698.7163
   35    1698.7163
   36    913.17966
   41    5000
   42    5000
   43    893.77306
   44    5000
   45    5000
   46    1980.7393
   47    5000
   48    5000
   49    1680.1208

BLOCK MASS
   6    173.2
   23    91.1876
   24    80.429995
   15    1.777
   25    123.10954
   35    2258.3338
   36    2259.0067
   37    2260.2753
   1000001    5016.3684
   2000001    5008.1487
   1000002    5015.9602
   2000002    5009.7854
   1000003    5016.3723
   2000003    5008.1537
   1000004    5015.9636
   2000004    5009.7864
   1000005    800.2839
   2000005    1668.0282
   1000006    719.16434
   2000006    1925.6812
   1000011    685.74395
   2000011    1700.3861
   1000012    680.95186
   1000013    685.74072
   2000013    1700.3798
   1000014    680.9494
   1000015    911.95321
   2000015    996.74216
   1000016    991.35284
   1000021    3175.1772
   1000022    502.79611
   1000023   -512.49711
   1000025    696.62573
   1000035    1395.7145
   1000024    508.99925
   1000037    1395.9307

BLOCK ALPHA
      -0.032549524

BLOCK HMIX Q=  1176.8098
   1   -502.86281
   2    30.119097
   3    244.2104
   4    5103111.3

BLOCK STOPMIX
   1   1   -0.97750955
   1   2    0.21089116
   2   1   -0.21089116
   2   2   -0.97750955

BLOCK SBOTMIX
   1   1   -0.99981866
   1   2    0.019043305
   2   1   -0.019043305
   2   2   -0.99981866

BLOCK STAUMIX
   1   1   -0.1561087
   1   2    0.98773988
   2   1   -0.98773988
   2   2   -0.1561087

BLOCK NMIX
   1   1   -0.15323855
   1   2    0.059309661
   1   3    0.7028026
   1   4    0.69214797
   2   1   -0.026460399
   2   2    0.030779065
   2   3   -0.70534203
   2   4    0.70770411
   3   1   -0.98782587
   3   2   -0.014292148
   3   3   -0.090038932
   3   4   -0.12605072
   4   1   -0.0042250757
   4   2    0.99766264
   4   3   -0.021309874
   4   4   -0.064786498

BLOCK UMIX
   1   1   -0.030079122
   1   2   -0.99954752
   2   1    0.99954752
   2   2   -0.030079122

BLOCK VMIX
   1   1   -0.09140898
   1   2    0.99581344
   2   1    0.99581344
   2   2    0.09140898

BLOCK HIGGSBOUNDSINPUTHIGGSCOUPLINGSFERMIONS
       0, 907.16003,3,36,15,15

BLOCK HIGGSBOUNDSINPUTHIGGSCOUPLINGSBOSONS
       0,4,36,21,21,23

BLOCK SPHENOLOWENERGY
   1    0.00028896184
   2    1.5950103e-06
   3    3.5226951e-05
   4    2.8883815e-15
   5    1.2338669e-10
   6    2.5729158e-08
   7    9.8240672e-14
   8    4.1967807e-09
   9    8.8670349e-07
   10    9.6042836e-05
   11    0.99208573
   12    0.54224092
   13    19.372028
   14    0
   15    0
   16    0.0021581943
   17    2.2816682e-15
   18    2.4799679e-11
   19    8.2897386e-11
   20   -8.0047263e-15
   21   -3.4223761e-10
   22   -8.4827563e-08
   23    0
   24    0
   25    0
   26    0
   27    0
   28    0
   29    0
   30    0
   31    0
   39    7.8721386e-05
   40    0
   41    0
   42    0

BLOCK FWCOEF Q=  160
   305   4422   0   0   -0.18881911
   305   4422   0   2   -0.14838832
   305   4322   0   2    1.7957844e-05
   305   6421   0   0   -0.095227835
   305   6421   0   2   -0.082136321
   305   6321   0   2   -0.00015487332
   3051111   4133   0   0    1.5833823
   3051111   4133   0   2    1.5844341
   3051111   4233   0   2    0.00014836914
   3051111   4137   0   0   -4.4060744
   3051111   4137   0   2   -4.401923
   3051111   4237   0   2   -0.0011690972
   3051313   4133   0   0    1.5833823
   3051313   4133   0   2    1.5844317
   3051313   4233   0   2    0.0001483685
   3051313   4137   0   0   -4.4060744
   3051313   4137   0   2   -4.4019254
   3051313   4237   0   2   -0.0011690984
   3051212   4137   0   0    1.5053501
   3051212   4137   0   2    1.5044509
   3051212   4237   0   2    0.00025528545
   3051414   4137   0   0    1.5053501
   3051414   4137   0   2    1.5044509
   3051414   4237   0   2    0.00025528551
   3051616   4137   0   0    1.5053501
   3051616   4137   0   2    1.5044516
   3051616   4237   0   2    0.00025530279

BLOCK IMFWCOEF Q=  160
   305   4422   0   0    3.858856e-07
   305   4422   0   2   -2.5163647e-05
   305   4322   0   2    3.7355407e-06
   305   6421   0   0    3.3053654e-07
   305   6421   0   2   -1.0645838e-06
   305   6321   0   2    1.5853024e-06
   3051111   4133   0   2   -1.9095339e-06
   3051111   4233   0   2    3.2777081e-06
   3051111   4137   0   2    1.5143685e-05
   3051111   4237   0   2   -2.5840112e-05
   3051313   4133   0   2   -1.9095142e-06
   3051313   4233   0   2    3.2777021e-06
   3051313   4137   0   2    1.514372e-05
   3051313   4237   0   2   -2.5840138e-05
   3051212   4137   0   2   -3.1635139e-06
   3051212   4237   0   2    5.6424868e-06
   3051414   4137   0   2   -3.1635166e-06
   3051414   4237   0   2    5.6424868e-06
   3051616   4137   0   2   -3.1511085e-06
   3051616   4237   0   2    5.642485e-06

DECAY 23  2.4952


DECAY 24  2.085


DECAY 1000011  0.0015934018
    0.69118473   2   -1000024    12
    0.2060243   2    1000022    11
    0.10278843   2    1000023    11

DECAY 2000011  5.9453256
    0.97106305   2    1000025    11
    0.028102161   2    1000022    11
    0.00083201856   2    1000023    11

DECAY 1000013  0.0025224174
    0.43660671   2   -1000024    14
    0.32168312   2    1000022    13
    0.24170856   2    1000023    13

DECAY 2000013  5.9645049
    0.96794438   2    1000025    13
    0.028794998   2    1000022    13
    0.0016123483   2    1000023    13
    0.0015762511   2   -1000024    14

DECAY 1000015  2.4630978
    0.32975556   2   -1000024    16
    0.3069669   2    1000025    15
    0.20431704   2    1000022    15
    0.1589605   2    1000023    15

DECAY 2000015  1.3783265
    0.37942683   2    1000023    15
    0.34119504   2    1000022    15
    0.27294788   2    1000025    15
    0.0063027063   2   -1000024    16

DECAY 1000012  0.023251525
    0.53140186   2    1000022    12
    0.41945646   2    1000024    11
    0.049141679   2    1000023    12

DECAY 1000014  0.024138624
    0.51186205   2    1000022    14
    0.44080329   2    1000024    13
    0.047334655   2    1000023    14

DECAY 1000016  1.4028066
    0.75199097   2    1000024    15
    0.21011079   2    1000025    16
    0.034201158   2    1000022    16
    0.0033741039   2    1000023    16
    0.00016169984   3    1000015   -4    3
    0.00016127419   3    1000015   -2    1

DECAY 2000001  144.07403
    0.98132806   2    1000021    1
    0.01821142   2    1000025    1
    0.00044665724   2    1000022    1

DECAY 1000001  199.30826
    0.71366826   2    1000021    1
    0.18840663   2   -1000037    2
    0.093994856   2    1000035    1
    0.0027829691   2    1000025    1
    0.00081421689   2    1000022    1
    0.00019635347   2   -1000024    2
    0.00013671224   2    1000023    1

DECAY 2000003  144.09267
    0.98120477   2    1000021    3
    0.018209582   2    1000025    3
    0.00047766201   2    1000022    3

DECAY 1000003  199.31956
    0.7136298   2    1000021    3
    0.18839621   2   -1000037    4
    0.093989637   2    1000035    3
    0.0027831751   2    1000025    3
    0.00083666611   2    1000022    3
    0.00020517013   2   -1000024    4
    0.0001593417   2    1000023    3

DECAY 1000005  5.5567554
    0.73736321   2   -1000024    6
    0.13449744   2    1000022    5
    0.12599593   2    1000023    5
    0.0012061677   2    1000025    5
    0.00093725415   2    1000006   -24

DECAY 2000005  15.417074
    0.43885094   2   -1000024    6
    0.22325169   2    1000023    5
    0.22239611   2    1000022    5
    0.04372866   2    1000025    5
    0.037819713   2    1000006   -24
    0.017135413   2    1000005    25
    0.016622793   2    1000005    23
    0.00011974881   2   -1000037    6

DECAY 2000002  152.31848
    0.92933126   2    1000021    2
    0.068927098   2    1000025    2
    0.0016901732   2    1000022    2

DECAY 1000002  199.30631
    0.7134619   2    1000021    2
    0.18698308   2    1000037    1
    0.093702475   2    1000035    2
    0.0038541627   2    1000025    2
    0.0018133585   2    1000024    1
    0.00011131651   2    1000022    2

DECAY 2000004  152.32207
    0.92930966   2    1000021    4
    0.068925676   2    1000025    4
    0.0016957011   2    1000022    4

DECAY 1000004  199.31749
    0.71342332   2    1000021    4
    0.18697279   2    1000037    3
    0.093697337   2    1000035    4
    0.003854084   2    1000025    4
    0.0018587331   2    1000024    3
    0.00011557669   2    1000022    4

DECAY 1000006  3.2309199
    0.36880245   2    1000022    6
    0.34110261   2    1000023    6
    0.28997317   2    1000024    5

DECAY 2000006  322.01848
    0.37641559   2    1000005    24
    0.20518749   2    1000006    25
    0.20218847   2    1000006    23
    0.10397629   2    1000024    5
    0.051324722   2    1000023    6
    0.050679495   2    1000022    6
    0.010119967   2    1000025    6

DECAY 1000024  1.1358089e-08
    0.36920987   3    1000022   -1    2
    0.30142102   3    1000022   -3    4
    0.12311615   3    1000022   -11    12
    0.12293752   3    1000022   -13    14
    0.083315448   3    1000022   -15    16

DECAY 1000037  45.912317
    0.2180346   2    1000006   -5
    0.16183863   2   -1000005    6
    0.077063907   2    1000014   -13
    0.077063481   2    1000012   -11
    0.076959587   2   -1000013    14
    0.076959127   2   -1000011    12
    0.061041121   2    1000023    24
    0.061014326   2    1000024    25
    0.059916925   2    1000024    23
    0.057354301   2    1000022    24
    0.032613329   2    1000016   -15
    0.031478109   2   -2000015    16
    0.0031993043   2    1000025    24
    0.0016131146   3    1000023   -5    6
    0.0014622808   3    1000024    6   -6
    0.0013565759   3    1000022   -5    6
    0.00089007526   2   -1000015    16

DECAY 1000022 -1


DECAY 1000023  3.327027e-07
    0.46922531   2    1000022    22
    0.13247789   3    1000022    12   -12
    0.099034187   3    1000022    1   -1
    0.09891107   3    1000022    3   -3
    0.077237908   3    1000022    2   -2
    0.059779301   3    1000022    4   -4
    0.022349361   3    1000022    11   -11
    0.022306607   3    1000022    13   -13
    0.012885822   3    1000022    15   -15
    0.0015857366   3    1000022    5   -5
    0.00098707552   3    1000024    1   -2
    0.00098707552   3   -1000024   -1    2
    0.00040708696   3    1000024    3   -4
    0.00040708696   3   -1000024   -3    4
    0.00032906618   3    1000024    11   -12
    0.00032906618   3   -1000024   -11    12
    0.00032701327   3    1000024    13   -14
    0.00032701327   3   -1000024   -13    14

DECAY 1000025  1.1673602
    0.28660986   2    1000023    23
    0.18425085   2    1000024   -24
    0.18425085   2   -1000024    24
    0.18202966   2    1000023    25
    0.15074685   2    1000022    25
    0.0078518056   2    1000022    23
    0.00068555588   2    1000014   -14
    0.00068555588   2   -1000014    14
    0.00068534336   2    1000012   -12
    0.00068534336   2   -1000012    12
    0.00037087664   2    1000013   -13
    0.00037087664   2   -1000013    13
    0.0003707073   2    1000011   -11
    0.0003707073   2   -1000011    11

DECAY 1000035  47.897626
    0.095513997   2    1000006   -6
    0.095513997   2   -1000006    6
    0.086377583   2    1000005   -5
    0.086377583   2   -1000005    5
    0.05757586   2    1000024   -24
    0.05757586   2   -1000024    24
    0.053979361   2    1000023    25
    0.046969779   2    1000023    23
    0.04424343   2    1000022    25
    0.037227069   2    1000014   -14
    0.037227069   2   -1000014    14
    0.037226901   2    1000012   -12
    0.037226901   2   -1000012    12
    0.036566949   2    1000013   -13
    0.036566949   2   -1000013    13
    0.036566693   2    1000011   -11
    0.036566693   2   -1000011    11
    0.015742331   2    1000016   -16
    0.015742331   2   -1000016    16
    0.014955769   2    2000015   -15
    0.014955769   2   -2000015    15
    0.011487437   2    1000022    23
    0.0025767718   2    1000025    25
    0.0013694944   3    1000024    5   -6
    0.0013694944   3   -1000024   -5    6
    0.00064666588   3    1000023    6   -6
    0.00057005304   3    1000022    6   -6
    0.00042235226   2    1000015   -15
    0.00042235226   2   -1000015    15
    0.00032623488   2    1000025    23

DECAY 1000021  273.88864
    0.16166528   2    1000006   -6
    0.16166528   2   -1000006    6
    0.15048506   2    1000005   -5
    0.15048506   2   -1000005    5
    0.089929255   2    2000005   -5
    0.089929255   2   -2000005    5
    0.063360286   2    2000006   -6
    0.063360286   2   -2000006    6
    0.034214566   2    1000006   -4
    0.034214566   2   -1000006    4
    0.00016535367   3    1000037    5   -6
    0.00016535367   3   -1000037   -5    6

DECAY 25  0.0036403197
    0.60547641   2   -5    5
    0.19883537   2   -24    24
    0.069909462   2   -15    15
    0.068491962   2    21    21
    0.029895275   2   -4    4
    0.023172951   2    23    23
    0.0023920681   2    22    22
    0.0013541566   2    22    23
    0.0002424744   2   -13    13
    0.00022907798   2   -3    3
    6.3337709e-07   2   -1    1
    1.5406404e-07   2   -2    2
    5.4511183e-09   2   -11    11

DECAY 35  52.167717
    0.71316315   2   -5    5
    0.076289549   2   -15    15
    0.051608292   2   -1000024    1000037
    0.051608292   2   -1000037    1000024
    0.036355184   2    1000023    1000035
    0.0187172   2    1000023    1000025
    0.015396085   2    1000022    1000035
    0.014136916   2    1000022    1000025
    0.0041079462   2   -1000006    1000006
    0.0039415892   2   -2000015    1000015
    0.0039415892   2   -1000015    2000015
    0.0026888098   2    1000022    1000022
    0.00259176   2   -6    6
    0.0023396814   2   -1000024    1000024
    0.00067682201   2   -1000015    1000015
    0.00062818642   2    1000022    1000023
    0.00056855358   2   -2000015    2000015
    0.00037085679   2    1000025    1000025
    0.0002589042   2   -13    13
    0.00024372212   2    1000023    1000023
    0.00018404493   2   -3    3
    0.00011935578   2    1000025    1000035
    2.6944588e-05   2    25    25
    2.2077974e-05   2   -1000005    1000005
    9.0770526e-06   2    21    21
    1.9286348e-06   2    23    23
    8.597426e-07   2   -24    24
    5.0879394e-07   2   -1    1
    1.9336243e-07   2   -1000011    1000011
    1.9237819e-07   2   -1000013    1000013
    3.2717321e-08   2   -4    4
    2.788764e-08   2    22    23
    9.8354644e-09   2    22    22
    5.8153411e-09   2   -11    11
    1.6869263e-13   2   -2    2

DECAY 36  50.073011
    0.70905414   2   -5    5
    0.075851673   2   -15    15
    0.053586482   2   -1000024    1000037
    0.053586482   2   -1000037    1000024
    0.037666369   2    1000022    1000035
    0.017855527   2    1000022    1000025
    0.016002236   2    1000023    1000025
    0.015779725   2    1000023    1000035
    0.0047604626   2   -2000015    1000015
    0.0047604626   2   -1000015    2000015
    0.0030531161   2    1000022    1000022
    0.0029063842   2   -1000024    1000024
    0.0025497638   2   -6    6
    0.00067848283   2    1000022    1000023
    0.00055951303   2    1000025    1000035
    0.00051861664   2    1000025    1000025
    0.00036200267   2    1000023    1000023
    0.00025741246   2   -13    13
    0.00018298909   2   -3    3
    2.4683388e-05   2    21    21
    2.8086665e-06   2    23    25
    5.0587411e-07   2   -1    1
    1.058874e-07   2    22    23
    3.1101827e-08   2   -4    4
    2.0255313e-08   2    22    22
    5.7818451e-09   2   -11    11
    1.6038548e-13   2   -2    2
    5.385198e-41   2    25    25

DECAY 37  51.416235
    0.70757885   2   -5    6
    0.083918958   2   -15    16
    0.052865648   2    1000022    1000037
    0.052534745   2    1000024    1000035
    0.052209256   2    1000023    1000037
    0.037520611   2    1000024    1000025
    0.0089961393   2   -1000015    1000016
    0.0011464497   2   -1000005    1000006
    0.0010486403   2   -5    4
    0.00067813432   2    1000025    1000037
    0.00035116702   2    1000023    1000024
    0.000344315   2    1000022    1000024
    0.0003175051   2   -2000015    1000016
    0.00029668363   2   -13    14
    0.000169684   2   -3    4
    7.920271e-06   2   -3    2
    7.4883757e-06   2   -5    2
    2.9011758e-06   2   -3    6
    2.7429599e-06   2    24    25
    7.6805557e-07   2   -1000011    1000012
    7.6665673e-07   2   -1000013    1000014
    4.7062139e-07   2   -1    2
    1.2163667e-07   2   -1    6
    2.3023157e-08   2   -1    4
    6.9394611e-09   2   -11    12
    7.2996526e-13   2    24    35
    8.697891e-14   2    24    36

DECAY 6  2.43
    1   2    5    24

DECAY 15 -1
