BLOCK DCINFO
   1   SDECAY/HDECAY
   2   1.3b /3.4

BLOCK SPINFO
   1   SOFTSUSY
   2   3.4.0

BLOCK MODSEL
   1   0

BLOCK SMINPUTS
   1    127.90897
   2    1.1663787e-05
   3    0.1184
   4    91.1876
   5    4.18
   6    173.2
   7    1.777

BLOCK MINPAR
   3    21.78

BLOCK EXTPAR
   0   -1
   1    791.37
   2   -1894.91
   3    2105.26
   11   -2353.25
   12   -3417.94
   13    513.45
   23    860.94
   26    2080.13
   31    1140.51
   32    1140.51
   33    997.9
   34    1340.54
   35    1340.54
   36    3820.02
   41    2208.75
   42    2208.75
   43    1619.22
   44    3904.89
   45    3904.89
   46    806.31
   47    2464.53
   48    2464.53
   49    840.75

BLOCK MASS
   24    80.390321
   25    125.24363
   35    2080.1549
   36    2080.13
   37    2081.8447
   5    4.8187603
   1000001    2239.5141
   2000001    2483.8093
   1000002    2238.2861
   2000002    3923.0517
   1000003    2239.5141
   2000003    2483.8093
   1000004    2238.2861
   2000004    3923.0517
   1000005    847.63555
   2000005    1634.9872
   1000006    804.57552
   2000006    1658.0754
   1000011    1158.7702
   2000011    1324.8832
   1000012    1155.8051
   1000013    1158.7702
   2000013    1324.8832
   1000014    1155.8051
   1000015    1020.5928
   2000015    3816.9079
   1000016    1017.3109
   1000021    2181.3075
   1000022    781.46085
   1000023   -874.06926
   1000025    888.12976
   1000035   -1905.8141
   1000024    873.98795
   1000037    1905.9818

BLOCK NMIX
   1   1    0.94054416
   1   2    0.0069648815
   1   3    0.25205653
   1   4   -0.22758664
   2   1   -0.018341164
   2   2   -0.049299871
   2   3    0.70678467
   2   4    0.70547045
   3   1   -0.33917481
   3   2    0.01945246
   3   3    0.66069073
   3   4   -0.66938017
   4   1   -0.00085843844
   4   2    0.99857029
   4   3    0.020265763
   4   4    0.049456516

BLOCK UMIX
   1   1   -0.028378047
   1   2    0.99959726
   2   1   -0.99959726
   2   2   -0.028378047

BLOCK VMIX
   1   1    0.069564329
   1   2    0.99757747
   2   1    0.99757747
   2   2   -0.069564329

BLOCK STOPMIX
   1   1    0.17246689
   1   2    0.98501531
   2   1   -0.98501531
   2   2    0.17246689

BLOCK SBOTMIX
   1   1    0.023959235
   1   2    0.99971294
   2   1   -0.99971294
   2   2    0.023959235

BLOCK STAUMIX
   1   1    0.99999755
   1   2    0.0022122373
   2   1   -0.0022122373
   2   2    0.99999755

BLOCK ALPHA
      -0.047560379

BLOCK HMIX Q=  1133.065
   1    868.89037
   2    21.097921
   3    244.10162
   4    4550294.8

BLOCK GAUGE Q=  1133.065
   1    0.36194655
   2    0.63651582
   3    1.0390998

BLOCK AU Q=  1133.065
   1   1    0
   2   2    0
   3   3   -2353.25

BLOCK AD Q=  1133.065
   1   1    0
   2   2    0
   3   3   -3417.94

BLOCK AE Q=  1133.065
   1   1    0
   2   2    0
   3   3    513.45

BLOCK YU Q=  1133.065
   1   1    0
   2   2    0
   3   3    0.83948293

BLOCK YD Q=  1133.065
   1   1    0
   2   2    0
   3   3    0.26465534

BLOCK YE Q=  1133.065
   1   1    0
   2   2    0
   3   3    0.20556515

BLOCK MSOFT Q=  1133.065
   1    791.37
   2   -1894.91
   3    2105.26
   21    3529277
   22   -718930.94
   31    1140.51
   32    1140.51
   33    997.9
   34    1340.54
   35    1340.54
   36    3820.02
   41    2208.75
   42    2208.75
   43    1619.22
   44    3904.89
   45    3904.89
   46    806.30999
   47    2464.53
   48    2464.53
   49    840.75

BLOCK HIGGSBOUNDSINPUTHIGGSCOUPLINGSFERMIONS
       0, 445.12225,3,36,15,15

BLOCK HIGGSBOUNDSINPUTHIGGSCOUPLINGSBOSONS
       0,4,36,21,21,23

DECAY 6  1.4268682
    1   2    5    24

DECAY 1000021  78.125877
    0.19900627   2    1000005   -5
    0.19900627   2   -1000005    5
    0.19416197   2    1000006   -6
    0.19416197   2   -1000006    6
    0.053512106   2    2000005   -5
    0.053512106   2   -2000005    5
    0.053319661   2    2000006   -6
    0.053319661   2   -2000006    6

DECAY 1000006  5.0775855e-10
    0.99157032   2    1000022    4
    0.0076447063   2    1000022    2
    0.0002704435   4    2   -1    1000022    5
    0.00025482584   4    4   -3    1000022    5
    8.9410606e-05   4   -11    12    1000022    5
    8.9351523e-05   4   -13    14    1000022    5
    8.0943984e-05   4   -15    16    1000022    5

DECAY 2000006  48.858445
    0.37851447   2    1000006    23
    0.3317066   2    1000006    25
    0.1146547   2    1000025    6
    0.11206073   2    1000023    6
    0.036504393   2    1000024    5
    0.013711164   2    1000022    6
    0.012847935   2    1000005    24

DECAY 1000005  0.011129282
    1   2    1000022    5

DECAY 2000005  47.721061
    0.72743564   2    1000006   -24
    0.23204026   2   -1000024    6
    0.01226706   2    1000023    5
    0.011130809   2    1000025    5
    0.0067828482   2    1000005    25
    0.0064431223   2    1000005    23
    0.0039002565   2    1000022    5

DECAY 1000002  2.7515562
    0.48962871   2    1000037    1
    0.24544519   2    1000035    2
    0.14913963   2    1000021    2
    0.083142431   2    1000022    2
    0.021863561   2    1000024    1
    0.0062916974   2    1000023    2
    0.0044887845   2    1000025    2

DECAY 2000002  143.91065
    0.94409113   2    1000021    2
    0.049593334   2    1000022    2
    0.0062970388   2    1000025    2
    1.8475475e-05   2    1000023    2
    2.625841e-08   2    1000035    2

DECAY 1000001  2.7308328
    0.49840687   2   -1000037    2
    0.24899826   2    1000035    1
    0.15664736   2    1000021    1
    0.071703901   2    1000022    1
    0.015791115   2    1000025    1
    0.0047832713   2    1000023    1
    0.0036692258   2   -1000024    2

DECAY 2000001  10.536854
    0.89504569   2    1000021    1
    0.093515977   2    1000022    1
    0.011404665   2    1000025    1
    3.3653209e-05   2    1000023    1
    1.6604652e-08   2    1000035    1

DECAY 1000004  2.6928061
    0.50379881   2    1000037    3
    0.25254991   2    1000035    4
    0.12024694   2    1000021    4
    0.08863319   2    1000022    4
    0.023288638   2    1000024    3
    0.0067017792   2    1000023    4
    0.0047807324   2    1000025    4

DECAY 2000004  115.60657
    0.92769992   2    1000021    4
    0.064135534   2    1000022    4
    0.0081406208   2    1000025    4
    2.3885636e-05   2    1000023    4
    3.3815226e-08   2    1000035    4

DECAY 1000003  2.6665851
    0.51405007   2   -1000037    4
    0.25682107   2    1000035    3
    0.12663278   2    1000021    3
    0.076615108   2    1000022    3
    0.016856852   2    1000025    3
    0.0051067581   2    1000023    3
    0.0039173708   2   -1000024    4

DECAY 2000003  8.6039251
    0.86525259   2    1000021    3
    0.12007392   2    1000022    3
    0.014630296   2    1000025    3
    4.3176795e-05   2    1000023    3
    2.0838978e-08   2    1000035    3

DECAY 1000011  0.43586781
    0.93484804   2    1000022    11
    0.054843286   2    1000025    11
    0.007101191   2    1000023    11
    0.0032074809   2   -1000024    12

DECAY 2000011  2.8394381
    0.91490471   2    1000022    11
    0.084834332   2    1000025    11
    0.00026095404   2    1000023    11

DECAY 1000013  0.43586779
    0.93484804   2    1000022    13
    0.054843284   2    1000025    13
    0.0071011908   2    1000023    13
    0.0032074811   2   -1000024    14

DECAY 2000013  2.839438
    0.91490472   2    1000022    13
    0.084834331   2    1000025    13
    0.00026095404   2    1000023    13

DECAY 1000015  0.27783407
    0.78011843   2    1000022    15
    0.11384137   2    1000023    15
    0.10425831   2    1000025    15
    0.0017818858   2   -1000024    16

DECAY 2000015  24.323121
    0.67171681   2    1000022    15
    0.13589575   2    1000025    15
    0.11831024   2   -1000024    16
    0.059384695   2    1000023    15
    0.0055842912   2    1000016   -24
    0.0029870371   2    1000015    25
    0.0028661236   2    1000015    23
    0.0015581352   2    1000016   -37
    0.00077896938   2    1000015    35
    0.00077852633   2    1000015    36
    9.2236127e-05   2   -1000037    16
    4.7186704e-05   2    1000035    15

DECAY 1000012  0.42727427
    0.89520404   2    1000022    12
    0.082430899   2    1000025    12
    0.019346372   2    1000024    11
    0.0030186904   2    1000023    12

DECAY 1000014  0.42727427
    0.89520404   2    1000022    14
    0.0824309   2    1000025    14
    0.01934637   2    1000024    13
    0.0030186904   2    1000023    14

DECAY 1000016  0.26447534
    0.725838   2    1000022    16
    0.23302543   2    1000024    15
    0.03953146   2    1000025    16
    0.0016051174   2    1000023    16

DECAY 1000024  0.4330159
    0.94437149   2    1000006   -5
    0.055628511   2    1000022    24

DECAY 1000037  35.92051
    0.10884203   2    1000016   -15
    0.10870202   2   -1000015    16
    0.092888434   2    1000024    25
    0.085072688   2    1000012   -11
    0.085072688   2    1000014   -13
    0.084956589   2    1000024    23
    0.084907844   2   -1000011    12
    0.084907844   2   -1000013    14
    0.084857602   2    1000023    24
    0.071811188   2    1000025    24
    0.03548895   2    2000006   -5
    0.031391339   2   -2000005    6
    0.029841165   2    1000006   -5
    0.011201893   2    1000022    24
    5.772558e-05   2   -1000005    6

DECAY 1000022 -1


DECAY 1000023  0.0074448237
    0.42882896   2    1000005   -5
    0.42882896   2   -1000005    5
    0.14234208   2    1000022    23

DECAY 1000025  0.013558899
    0.47558865   2    1000005   -5
    0.47558865   2   -1000005    5
    0.048822695   2    1000022    23

DECAY 1000035  35.791603
    0.082228048   2    1000024   -24
    0.082228048   2   -1000024    24
    0.079734434   2    1000023    25
    0.063651323   2    1000025    23
    0.054759607   2    1000016   -16
    0.054759607   2   -1000016    16
    0.054376284   2    1000015   -15
    0.054376284   2   -1000015    15
    0.042803855   2    1000012   -12
    0.042803855   2   -1000012    12
    0.042803855   2    1000014   -14
    0.042803855   2   -1000014    14
    0.042465258   2    1000011   -11
    0.042465258   2   -1000011    11
    0.042465258   2    1000013   -13
    0.042465258   2   -1000013    13
    0.022390988   2    2000005   -5
    0.022390988   2   -2000005    5
    0.014620102   2    1000006   -6
    0.014620102   2   -1000006    6
    0.013047202   2    1000023    23
    0.01148014   2    2000006   -6
    0.01148014   2   -2000006    6
    0.011104448   2    1000025    25
    0.0094826345   2    1000022    23
    0.0021332525   2    1000022    25
    2.9905298e-05   2    1000005   -5
    2.9905298e-05   2   -1000005    5
    2.7305872e-08   2    2000011   -11
    2.7305872e-08   2   -2000011    11
    2.7305872e-08   2    2000013   -13
    2.7305872e-08   2   -2000013    13

DECAY 25  0.0045255487
    0.63464399   2    5   -5
    0.19067322   2    24   -24
    0.069867877   2    21    21
    0.057780872   2   -15    15
    0.023895712   2    23    23
    0.019194074   2    4   -4
    0.002106173   2    22    22
    0.0014105754   2    22    23
    0.0002229831   2    3   -3
    0.00020452404   2   -13    13

DECAY 35  15.200683
    0.74571084   2    5   -5
    0.13461853   2   -15    15
    0.049739548   2    1000022    1000023
    0.033345755   2    1000006   -1000006
    0.012974825   2    6   -6
    0.0085406024   2    1000022    1000025
    0.0047765953   2    1000022    1000022
    0.0047329643   2    1000023    1000025
    0.0026094463   2    1000025    1000025
    0.0010185128   2    1000005   -1000005
    0.00092714286   2    1000024   -1000024
    0.00047700582   2   -13    13
    0.00026000577   2    3   -3
    0.00015754428   2    1000023    1000023
    6.0698122e-05   2    21    21
    3.7057831e-05   2    25    25
    7.4073085e-06   2    24   -24
    3.6902829e-06   2    23    23
    1.3413675e-06   2    1000016   -1000016
    2.507239e-07   2    22    22
    1.3371594e-07   2    4   -4
    8.9572789e-08   2    1000015   -1000015
    1.0470903e-08   2    23    22

DECAY 36  14.711303
    0.77057423   2    5   -5
    0.13909796   2   -15    15
    0.030108816   2    1000022    1000025
    0.015770932   2    1000022    1000023
    0.013551702   2    6   -6
    0.013456013   2    1000022    1000022
    0.012069853   2    1000025    1000025
    0.0030170818   2    1000024   -1000024
    0.0010477531   2    1000023    1000025
    0.00049287674   2   -13    13
    0.00045837445   2    1000023    1000023
    0.0002687002   2    3   -3
    7.7634431e-05   2    21    21
    7.7240691e-06   2    23    25
    1.4714624e-07   2    22    22
    1.3827886e-07   2    4   -4
    5.7918309e-08   2    23    22

DECAY 37  13.259904
    0.69930725   2    6   -5
    0.15445054   2   -15    16
    0.077640765   2    1000024    1000022
    0.061775131   2    1000006   -1000005
    0.0045700005   2    1000024    1000025
    0.0011547603   2    4   -5
    0.00054727672   2   -13    14
    0.00029344694   2    4   -3
    0.0002245759   2    1000024    1000023
    1.4901154e-05   2    2   -3
    1.1547573e-05   2    2   -5
    8.6021405e-06   2    24    25
    1.2080859e-06   2   -1000015    1000016
    1.470205e-12   2    24    36

DECAY 5 -1


DECAY 15 -1


DECAY 23  2.4952


DECAY 24  2.085
