# SUSY Les Houches Accord 2 - MSSM spectrum + Decays
# SPheno v4.0.5be
# W. Porod, Comput. Phys. Commun. 153 (2003) 275-315, hep-ph/0301101;
# W. Porod, F.~Staub, Comput. Phys. Commun. 183 (2012) 2458
#                     arXiv:1104.1573 [hep-ph] 
# in case of problems send email to porod@physik.uni-wuerzburg.de
# Created: 07.09.2021,  20:39
Block SPINFO         # Program information
     1   SPheno      # spectrum calculator
     2   v4.0.5be    # version number
#
Block SPhenoINFO     # SPheno specific information
    1      2         # using 2-loop RGEs
    2      2         # using pole masses for boundary conditions at mZ
Block MODSEL  # Model selection
    1    0    # general MSSM
Block MINPAR  # Input parameters
    3    6.99489601E+00  # tanb at m_Z    
    4   -1.00000000E+00  # Sign(mu)
Block EXTPAR  # non-universal input parameters
    0    3.86444627E+03  # scale for input parameters
    1   -2.02984772E+02  # M_1
    2   -1.94481080E+03  # M_2
    3    2.55884417E+03  # M_3
   11    4.41080052E+03  # A_t
   12    7.81686202E+02  # A_b
   13    1.36925706E+03  # A_tau
   23   -2.28842987E+02  # mu
   25    6.63405737E+00  # tan(beta)
   26    1.46597372E+03  # m_A, pole mass
   31    1.00000000E+04  # M_L11
   32    1.00000000E+04  # M_L22
   33    1.00000000E+04  # M_L33
   34    1.00000000E+04  # M_E11
   35    1.00000000E+04  # M_E22
   36    1.00000000E+04  # M_E33
   41    1.00000000E+04  # M_Q11
   42    1.00000000E+04  # M_Q22
   43    4.71768115E+03  # M_Q33
   44    1.00000000E+04  # M_U11
   45    1.00000000E+04  # M_U22
   46    3.11428161E+03  # M_U33
   47    1.00000000E+04  # M_D11
   48    1.00000000E+04  # M_D22
   49    2.65681269E+03  # M_D33
Block SMINPUTS  # SM parameters
         1     1.27908970E+02  # alpha_em^-1(MZ)^MSbar
         2     1.16637870E-05  # G_mu [GeV^-2]
         3     1.18400000E-01  # alpha_s(MZ)^MSbar
         4     9.11876000E+01  # m_Z(pole)
         5     4.18000000E+00  # m_b(m_b), MSbar
         6     1.73200000E+02  # m_t(pole)
         7     1.77700000E+00  # m_tau(pole)
         8     0.00000000E+00  # m_nu_3
        11     5.10998930E-04  # m_e(pole)
        12     0.00000000E+00  # m_nu_1
        13     1.05658372E-01  # m_muon(pole)
        14     0.00000000E+00  # m_nu_2
        21     5.00000000E-03  # m_d(2 GeV), MSbar
        22     2.50000000E-03  # m_u(2 GeV), MSbar
        23     9.50000000E-02  # m_s(2 GeV), MSbar
        24     1.27000000E+00  # m_c(m_c), MSbar
Block gauge Q=  3.86444627E+03  # (SUSY scale)
   1    3.55362975E-01  # g'(Q)^DRbar
   2    6.65198874E-01  # g(Q)^DRbar
   3    1.21977796E+00  # g3(Q)^DRbar
Block Yu Q=  3.86444627E+03  # (SUSY scale)
  1  1     8.47909087E-06   # Y_u(Q)^DRbar
  2  2     4.30737816E-03   # Y_c(Q)^DRbar
  3  3     1.02434228E+00   # Y_t(Q)^DRbar
Block Yd Q=  3.86444627E+03  # (SUSY scale)
  1  1     1.13033912E-04   # Y_d(Q)^DRbar
  2  2     2.14764434E-03   # Y_s(Q)^DRbar
  3  3     1.12094221E-01   # Y_b(Q)^DRbar
Block Ye Q=  3.86444627E+03  # (SUSY scale)
  1  1     1.97252443E-05   # Y_e(Q)^DRbar
  2  2     4.07855492E-03   # Y_mu(Q)^DRbar
  3  3     6.85945841E-02   # Y_tau(Q)^DRbar
Block Au Q=  3.86444627E+03  # (SUSY scale)
  1  1     0.00000000E+00   # A_u(Q)^DRbar
  2  2     0.00000000E+00   # A_c(Q)^DRbar
  3  3     4.41080054E+03   # A_t(Q)^DRbar
Block Ad Q=  3.86444627E+03  # (SUSY scale)
  1  1     0.00000000E+00   # A_d(Q)^DRbar
  2  2     0.00000000E+00   # A_s(Q)^DRbar
  3  3     7.81686199E+02   # A_b(Q)^DRbar
Block Ae Q=  3.86444627E+03  # (SUSY scale)
  1  1     0.00000000E+00   # A_e(Q)^DRbar
  2  2     0.00000000E+00   # A_mu(Q)^DRbar
  3  3     1.36925706E+03   # A_tau(Q)^DRbar
Block MSOFT Q=  3.86444627E+03  # soft SUSY breaking masses at Q
   1   -2.02984772E+02  # M_1
   2   -1.94481080E+03  # M_2
   3    2.55884417E+03  # M_3
  21    1.97038709E+06  # M^2_(H,d)
  22    2.38998315E+05  # M^2_(H,u)
  31    1.00000000E+04  # M_(L,11)
  32    1.00000000E+04  # M_(L,22)
  33    1.00000000E+04  # M_(L,33)
  34    1.00000000E+04  # M_(E,11)
  35    1.00000000E+04  # M_(E,22)
  36    1.00000000E+04  # M_(E,33)
  41    1.00000000E+04  # M_(Q,11)
  42    1.00000000E+04  # M_(Q,22)
  43    4.71768115E+03  # M_(Q,33)
  44    1.00000000E+04  # M_(U,11)
  45    1.00000000E+04  # M_(U,22)
  46    3.11428161E+03  # M_(U,33)
  47    1.00000000E+04  # M_(D,11)
  48    1.00000000E+04  # M_(D,22)
  49    2.65681269E+03  # M_(D,33)
Block MASS  # Mass spectrum
#   PDG code      mass          particle
         6     1.73200000E+02  # m_t(pole)
        23     9.11876000E+01  # m_Z(pole)
        24     8.04299946E+01  # W+
        15     1.77700000E+00  # m_tau(pole)
        25     1.22452231E+02  # h0
        35     1.46618116E+03  # H0
        36     1.46597372E+03  # A0
        37     1.46981863E+03  # H+
   1000001     1.01119617E+04  # ~d_L
   2000001     1.00884390E+04  # ~d_R
   1000002     1.01116144E+04  # ~u_L
   2000002     1.00916012E+04  # ~u_R
   1000003     1.01119621E+04  # ~s_L
   2000003     1.00884391E+04  # ~s_R
   1000004     1.01116148E+04  # ~c_L
   2000004     1.00916019E+04  # ~c_R
   1000005     2.77744827E+03  # ~b_1
   2000005     4.75365775E+03  # ~b_2
   1000006     3.13850499E+03  # ~t_1
   2000006     4.75829894E+03  # ~t_2
   1000011     1.00200409E+04  # ~e_L-
   2000011     1.00089661E+04  # ~e_R-
   1000012     1.00192923E+04  # ~nu_eL
   1000013     1.00200413E+04  # ~mu_L-
   2000013     1.00089669E+04  # ~mu_R-
   1000014     1.00192927E+04  # ~nu_muL
   1000015     1.00091925E+04  # ~tau_1-
   2000015     1.00201658E+04  # ~tau_2-
   1000016     1.00194112E+04  # ~nu_tauL
   1000021     3.01370953E+03  # ~g
   1000022     1.83137289E+02  # ~chi_10
   1000023     2.46142220E+02  # ~chi_20
   1000025     2.63443732E+02  # ~chi_30
   1000035     2.05881415E+03  # ~chi_40
   1000024     2.42400986E+02  # ~chi_1+
   1000037     2.05878140E+03  # ~chi_2+
# Higgs mixing
Block alpha # Effective Higgs mixing angle
          -1.43497605E-01   # alpha
Block Hmix Q=  3.86444627E+03  # Higgs mixing parameters
   1   -2.28842987E+02  # mu
   2    6.63405737E+00  # tan[beta](Q)
   3    2.42976017E+02  # v(Q)
   4    2.14907895E+06  # m^2_A(Q)
Block stopmix # stop mixing matrix
   1  1    -4.54710754E-02   # Re[R_st(1,1)]
   1  2     9.98965656E-01   # Re[R_st(1,2)]
   2  1    -9.98965656E-01   # Re[R_st(2,1)]
   2  2    -4.54710754E-02   # Re[R_st(2,2)]
Block sbotmix # sbottom mixing matrix
   1  1    -2.93357072E-04   # Re[R_sb(1,1)]
   1  2     9.99999957E-01   # Re[R_sb(1,2)]
   2  1    -9.99999957E-01   # Re[R_sb(2,1)]
   2  2    -2.93357072E-04   # Re[R_sb(2,2)]
Block staumix # stau mixing matrix
   1  1    -2.33506245E-02   # Re[R_sta(1,1)]
   1  2     9.99727337E-01   # Re[R_sta(1,2)]
   2  1    -9.99727337E-01   # Re[R_sta(2,1)]
   2  2    -2.33506245E-02   # Re[R_sta(2,2)]
Block Nmix # neutralino mixing matrix
   1  1     8.48714616E-01   # Re[N(1,1)]
   1  2    -1.65460885E-02   # Re[N(1,2)]
   1  3    -4.10664544E-01   # Re[N(1,3)]
   1  4     3.32812799E-01   # Re[N(1,4)]
   2  1    -5.98914898E-02   # Re[N(2,1)]
   2  2     2.08520902E-02   # Re[N(2,2)]
   2  3    -7.00605997E-01   # Re[N(2,3)]
   2  4    -7.10724586E-01   # Re[N(2,4)]
   3  1     5.25447893E-01   # Re[N(3,1)]
   3  2     3.10244335E-02   # Re[N(3,2)]
   3  3     5.83437981E-01   # Re[N(3,3)]
   3  4    -6.18499894E-01   # Re[N(3,4)]
   4  1     1.01079825E-03   # Re[N(4,1)]
   4  2    -9.99164102E-01   # Re[N(4,2)]
   4  3     1.02952310E-02   # Re[N(4,3)]
   4  4    -3.95485106E-02   # Re[N(4,4)]
Block Umix # chargino mixing matrix
   1  1    -1.45543839E-02   # Re[U(1,1)]
   1  2    -9.99894079E-01   # Re[U(1,2)]
   2  1    -9.99894079E-01   # Re[U(2,1)]
   2  2     1.45543839E-02   # Re[U(2,2)]
Block Vmix # chargino mixing matrix
   1  1     5.59478020E-02   # Re[V(1,1)]
   1  2     9.98433695E-01   # Re[V(1,2)]
   2  1     9.98433695E-01   # Re[V(2,1)]
   2  2    -5.59478020E-02   # Re[V(2,2)]
DECAY        23     2.49520000E+00   # Z
DECAY        24     2.08500000E+00   # W
DECAY   2000011     5.02476920E+01   # ~e^-_R
#    BR                NDA      ID1      ID2
     7.20460396E-01    2     1000022        11   # BR(~e^-_R -> chi^0_1 e^-)
     3.58577025E-03    2     1000023        11   # BR(~e^-_R -> chi^0_2 e^-)
     2.75952894E-01    2     1000025        11   # BR(~e^-_R -> chi^0_3 e^-)
DECAY   1000011     1.33961484E+02   # ~e^-_L
#    BR                NDA      ID1      ID2
     6.27880069E-02    2     1000022        11   # BR(~e^-_L -> chi^0_1 e^-)
     3.19483200E-02    2     1000025        11   # BR(~e^-_L -> chi^0_3 e^-)
     3.01182927E-01    2     1000035        11   # BR(~e^-_L -> chi^0_4 e^-)
     1.39316282E-04    2    -1000024        12   # BR(~e^-_L -> chi^-_1 nu_e)
     6.03900599E-01    2    -1000037        12   # BR(~e^-_L -> chi^-_2 nu_e)
#    BR                NDA      ID1      ID2       ID3
DECAY   2000013     5.02543126E+01   # ~mu^-_R
#    BR                NDA      ID1      ID2
     7.20376649E-01    2     1000022        13   # BR(~mu^-_R -> chi^0_1 mu^-)
     3.61761030E-03    2     1000023        13   # BR(~mu^-_R -> chi^0_2 mu^-)
     2.75938964E-01    2     1000025        13   # BR(~mu^-_R -> chi^0_3 mu^-)
DECAY   1000013     1.33964802E+02   # ~mu^-_L
#    BR                NDA      ID1      ID2
     6.27906253E-02    2     1000022        13   # BR(~mu^-_L -> chi^0_1 mu^-)
     3.19559445E-02    2     1000025        13   # BR(~mu^-_L -> chi^0_3 mu^-)
     3.01175483E-01    2     1000035        13   # BR(~mu^-_L -> chi^0_4 mu^-)
     1.39312837E-04    2    -1000024        14   # BR(~mu^-_L -> chi^-_1 nu_mu)
     6.03885669E-01    2    -1000037        14   # BR(~mu^-_L -> chi^-_2 nu_mu)
#    BR                NDA      ID1      ID2       ID3
DECAY   1000015     5.21662839E+01   # ~tau^-_1
#    BR                NDA      ID1      ID2
     6.97824523E-01    2     1000022        15   # BR(~tau^-_1 -> chi^0_1 tau^-)
     1.20446481E-02    2     1000023        15   # BR(~tau^-_1 -> chi^0_2 tau^-)
     2.70977556E-01    2     1000025        15   # BR(~tau^-_1 -> chi^0_3 tau^-)
     3.69548633E-04    2     1000035        15   # BR(~tau^-_1 -> chi^0_4 tau^-)
     1.80442782E-02    2    -1000024        16   # BR(~tau^-_1 -> chi^-_1 nu_tau)
     7.39446220E-04    2    -1000037        16   # BR(~tau^-_1 -> chi^-_2 nu_tau)
DECAY   2000015     1.34854375E+02   # ~tau^-_2
#    BR                NDA      ID1      ID2
     6.32282540E-02    2     1000022        15   # BR(~tau^-_2 -> chi^0_1 tau^-)
     3.53353158E-03    2     1000023        15   # BR(~tau^-_2 -> chi^0_2 tau^-)
     3.44644522E-02    2     1000025        15   # BR(~tau^-_2 -> chi^0_3 tau^-)
     2.99051612E-01    2     1000035        15   # BR(~tau^-_2 -> chi^0_4 tau^-)
     5.99625818E-01    2    -1000037        16   # BR(~tau^-_2 -> chi^-_2 nu_tau)
#    BR                NDA      ID1      ID2       ID3
DECAY   1000012     1.33964083E+02   # ~nu_e
#    BR                NDA      ID1      ID2
     7.26539583E-02    2     1000022        12   # BR(~nu_e -> chi^0_1 nu_e)
     9.18277754E-04    2     1000023        12   # BR(~nu_e -> chi^0_2 nu_e)
     2.04937297E-02    2     1000025        12   # BR(~nu_e -> chi^0_3 nu_e)
     3.01802338E-01    2     1000035        12   # BR(~nu_e -> chi^0_4 nu_e)
     2.05844589E-03    2     1000024        11   # BR(~nu_e -> chi^+_1 e^-)
     6.02073251E-01    2     1000037        11   # BR(~nu_e -> chi^+_2 e^-)
#    BR                NDA      ID1      ID2       ID3
DECAY   1000014     1.33967401E+02   # ~nu_mu
#    BR                NDA      ID1      ID2
     7.26521618E-02    2     1000022        14   # BR(~nu_mu -> chi^0_1 nu_mu)
     9.18255048E-04    2     1000023        14   # BR(~nu_mu -> chi^0_2 nu_mu)
     2.04932229E-02    2     1000025        14   # BR(~nu_mu -> chi^0_3 nu_mu)
     3.01794877E-01    2     1000035        14   # BR(~nu_mu -> chi^0_4 nu_mu)
     2.08311030E-03    2     1000024        13   # BR(~nu_mu -> chi^+_1 mu^-)
     6.02058373E-01    2     1000037        13   # BR(~nu_mu -> chi^+_2 mu^-)
#    BR                NDA      ID1      ID2       ID3
DECAY   1000016     1.34902707E+02   # ~nu_tau
#    BR                NDA      ID1      ID2
     7.21493051E-02    2     1000022        16   # BR(~nu_tau -> chi^0_1 nu_tau)
     9.11899423E-04    2     1000023        16   # BR(~nu_tau -> chi^0_2 nu_tau)
     2.03513809E-02    2     1000025        16   # BR(~nu_tau -> chi^0_3 nu_tau)
     2.99706646E-01    2     1000035        16   # BR(~nu_tau -> chi^0_4 nu_tau)
     8.98682036E-03    2     1000024        15   # BR(~nu_tau -> chi^+_1 tau^-)
     5.97893948E-01    2     1000037        15   # BR(~nu_tau -> chi^+_2 tau^-)
#    BR                NDA      ID1      ID2       ID3
DECAY   2000001     6.66158540E+02   # ~d_R
#    BR                NDA      ID1      ID2
     6.08618973E-03    2     1000022         1   # BR(~d_R -> chi^0_1 d)
     2.33117785E-03    2     1000025         1   # BR(~d_R -> chi^0_3 d)
     9.91552327E-01    2     1000021         1   # BR(~d_R -> ~g d)
DECAY   1000001     7.86774419E+02   # ~d_L
#    BR                NDA      ID1      ID2
     1.58951485E-03    2     1000022         1   # BR(~d_L -> chi^0_1 d)
     2.20989290E-04    2     1000025         1   # BR(~d_L -> chi^0_3 d)
     5.19092346E-02    2     1000035         1   # BR(~d_L -> chi^0_4 d)
     1.03933058E-01    2    -1000037         2   # BR(~d_L -> chi^-_2 u)
     8.42267136E-01    2     1000021         1   # BR(~d_L -> ~g d)
DECAY   2000003     6.66160393E+02   # ~s_R
#    BR                NDA      ID1      ID2
     6.08640647E-03    2     1000022         3   # BR(~s_R -> chi^0_1 s)
     2.33164239E-03    2     1000025         3   # BR(~s_R -> chi^0_3 s)
     9.91549582E-01    2     1000021         3   # BR(~s_R -> ~g s)
DECAY   1000003     7.86779112E+02   # ~s_L
#    BR                NDA      ID1      ID2
     1.58970367E-03    2     1000022         3   # BR(~s_L -> chi^0_1 s)
     2.21387748E-04    2     1000025         3   # BR(~s_L -> chi^0_3 s)
     5.19089275E-02    2     1000035         3   # BR(~s_L -> chi^0_4 s)
     1.03932457E-01    2    -1000037         4   # BR(~s_L -> chi^-_2 c)
     8.42262158E-01    2     1000021         3   # BR(~s_L -> ~g s)
DECAY   1000005     2.89501348E+00   # ~b_1
#    BR                NDA      ID1      ID2
     4.22725043E-01    2     1000022         5   # BR(~b_1 -> chi^0_1 b)
     1.17736242E-01    2     1000023         5   # BR(~b_1 -> chi^0_2 b)
     2.25257333E-01    2     1000025         5   # BR(~b_1 -> chi^0_3 b)
     2.34269629E-01    2    -1000024         6   # BR(~b_1 -> chi^-_1 t)
DECAY   2000005     3.03136485E+02   # ~b_2
#    BR                NDA      ID1      ID2
     2.59234992E-03    2     1000022         5   # BR(~b_2 -> chi^0_1 b)
     1.98230366E-03    2     1000023         5   # BR(~b_2 -> chi^0_2 b)
     1.59580224E-03    2     1000025         5   # BR(~b_2 -> chi^0_3 b)
     4.54975440E-02    2     1000035         5   # BR(~b_2 -> chi^0_4 b)
     3.23767539E-01    2    -1000024         6   # BR(~b_2 -> chi^-_1 t)
     9.20123504E-02    2    -1000037         6   # BR(~b_2 -> chi^-_2 t)
     4.42748723E-01    2     1000021         5   # BR(~b_2 -> ~g b)
     8.91372798E-02    2     1000006       -24   # BR(~b_2 -> ~t_1 W^-)
     6.15494239E-04    2     1000006       -37   # BR(~b_2 -> ~t_1 H^-)
DECAY   2000002     6.83336234E+02   # ~u_R
#    BR                NDA      ID1      ID2
     2.37402271E-02    2     1000022         2   # BR(~u_R -> chi^0_1 u)
     1.18157418E-04    2     1000023         2   # BR(~u_R -> chi^0_2 u)
     9.09315902E-03    2     1000025         2   # BR(~u_R -> chi^0_3 u)
     9.67048426E-01    2     1000021         2   # BR(~u_R -> ~g u)
DECAY   1000002     7.86760824E+02   # ~u_L
#    BR                NDA      ID1      ID2
     1.02401343E-03    2     1000022         2   # BR(~u_L -> chi^0_1 u)
     8.76954531E-04    2     1000025         2   # BR(~u_L -> chi^0_3 u)
     5.18706495E-02    2     1000035         2   # BR(~u_L -> chi^0_4 u)
     3.53737975E-04    2     1000024         1   # BR(~u_L -> chi^+_1 d)
     1.03627299E-01    2     1000037         1   # BR(~u_L -> chi^+_2 d)
     8.42241482E-01    2     1000021         2   # BR(~u_L -> ~g u)
DECAY   2000004     6.83343707E+02   # ~c_R
#    BR                NDA      ID1      ID2
     2.37405728E-02    2     1000022         4   # BR(~c_R -> chi^0_1 c)
     1.20906555E-04    2     1000023         4   # BR(~c_R -> chi^0_2 c)
     9.09514024E-03    2     1000025         4   # BR(~c_R -> chi^0_3 c)
     9.67037898E-01    2     1000021         4   # BR(~c_R -> ~g c)
DECAY   1000004     7.86765483E+02   # ~c_L
#    BR                NDA      ID1      ID2
     1.02453223E-03    2     1000022         4   # BR(~c_L -> chi^0_1 c)
     8.78762172E-04    2     1000025         4   # BR(~c_L -> chi^0_3 c)
     5.18703471E-02    2     1000035         4   # BR(~c_L -> chi^0_4 c)
     3.54910298E-04    2     1000024         3   # BR(~c_L -> chi^+_1 s)
     1.03626690E-01    2     1000037         3   # BR(~c_L -> chi^+_2 s)
     8.42236501E-01    2     1000021         4   # BR(~c_L -> ~g c)
DECAY   1000006     1.35859741E+02   # ~t_1
#    BR                NDA      ID1      ID2
     9.30354876E-02    2     1000022         6   # BR(~t_1 -> chi^0_1 t)
     2.40344528E-01    2     1000023         6   # BR(~t_1 -> chi^0_2 t)
     1.90856910E-01    2     1000025         6   # BR(~t_1 -> chi^0_3 t)
     4.75598904E-01    2     1000024         5   # BR(~t_1 -> chi^+_1 b)
     1.09141589E-04    2     1000037         5   # BR(~t_1 -> chi^+_2 b)
#    BR                NDA      ID1      ID2       ID3
DECAY   2000006     3.13809703E+02   # ~t_2
#    BR                NDA      ID1      ID2
     3.40153882E-02    2     1000022         6   # BR(~t_2 -> chi^0_1 t)
     1.58075178E-01    2     1000023         6   # BR(~t_2 -> chi^0_2 t)
     1.23132525E-01    2     1000025         6   # BR(~t_2 -> chi^0_3 t)
     4.41086370E-02    2     1000035         6   # BR(~t_2 -> chi^0_4 t)
     3.78829006E-03    2     1000024         5   # BR(~t_2 -> chi^+_1 b)
     8.84155796E-02    2     1000037         5   # BR(~t_2 -> chi^+_2 b)
     4.29044518E-01    2     1000021         6   # BR(~t_2 -> ~g t)
     4.32380190E-02    2     1000006        23   # BR(~t_2 -> ~t_1 Z)
     3.06808072E-04    2     1000006        36   # BR(~t_2 -> ~t_1 A^0)
     7.55612581E-02    2     1000006        25   # BR(~t_2 -> ~t_1 h^0)
     2.67684013E-04    2     1000006        35   # BR(~t_2 -> ~t_1 H^0)
DECAY   1000024     1.17557138E-03   # chi^+_1
#    BR                NDA      ID1      ID2       ID3
     3.33630439E-01    3     1000022        -1         2   # BR(chi^+_1 -> chi^0_1 d_bar u)
     3.33090255E-01    3     1000022        -3         4   # BR(chi^+_1 -> chi^0_1 s_bar c)
     1.11210366E-01    3     1000022       -11        12   # BR(chi^+_1 -> chi^0_1 e^+ nu_e)
     1.11209416E-01    3     1000022       -13        14   # BR(chi^+_1 -> chi^0_1 mu^+ nu_mu)
     1.10859524E-01    3     1000022       -15        16   # BR(chi^+_1 -> chi^0_1 tau^+ nu_tau)
DECAY   1000037     2.34745085E+01   # chi^+_2
#    BR                NDA      ID1      ID2
     4.02684044E-02    2     1000022        24   # BR(chi^+_2 -> chi^0_1 W^+)
     2.03519559E-01    2     1000023        24   # BR(chi^+_2 -> chi^0_2 W^+)
     1.60930151E-01    2     1000025        24   # BR(chi^+_2 -> chi^0_3 W^+)
     1.58372072E-02    2          37   1000022   # BR(chi^+_2 -> H^+ chi^0_1)
     3.65060651E-02    2          37   1000023   # BR(chi^+_2 -> H^+ chi^0_2)
     3.42354495E-02    2          37   1000025   # BR(chi^+_2 -> H^+ chi^0_3)
     2.01915844E-01    2     1000024        23   # BR(chi^+_2 -> chi^+_1 Z)
     3.77776653E-02    2     1000024        36   # BR(chi^+_2 -> chi^+_1 A^0)
     2.03390990E-01    2     1000024        25   # BR(chi^+_2 -> chi^+_1 h^0)
     3.79644479E-02    2     1000024        35   # BR(chi^+_2 -> chi^+_1 H^0)
#    BR                NDA      ID1      ID2       ID3
     1.20322540E-02    3     1000024         6        -6   # BR(chi^+_2 -> chi^+_1 t t_bar)
     1.46162776E-03    3     1000022        -5         6   # BR(chi^+_2 -> chi^0_1 b_bar t)
     8.50196609E-03    3     1000023        -5         6   # BR(chi^+_2 -> chi^0_2 b_bar t)
     5.65762388E-03    3     1000025        -5         6   # BR(chi^+_2 -> chi^0_3 b_bar t)
DECAY   1000022     0.00000000E+00   # chi^0_1
DECAY   1000023     1.12188527E-03   # chi^0_2
#    BR                NDA      ID1      ID2
     3.57673322E-03    2     1000022        22   # BR(chi^0_2 -> chi^0_1 photon)
#    BR                NDA      ID1      ID2       ID3
     1.19007714E-01    3     1000022         2        -2   # BR(chi^0_2 -> chi^0_1 u u_bar)
     1.18493448E-01    3     1000022         4        -4   # BR(chi^0_2 -> chi^0_1 c c_bar)
     1.52591238E-01    3     1000022         1        -1   # BR(chi^0_2 -> chi^0_1 d d_bar)
     1.52588138E-01    3     1000022         3        -3   # BR(chi^0_2 -> chi^0_1 s s_bar)
     1.46702169E-01    3     1000022         5        -5   # BR(chi^0_2 -> chi^0_1 b b_bar)
     3.44352034E-02    3     1000022        11       -11   # BR(chi^0_2 -> chi^0_1 e^- e^+)
     3.44340484E-02    3     1000022        13       -13   # BR(chi^0_2 -> chi^0_1 mu^- mu^+)
     3.41104412E-02    3     1000022        15       -15   # BR(chi^0_2 -> chi^0_1 tau^- tau^+)
     2.04059456E-01    3     1000022        12       -12   # BR(chi^0_2 -> chi^0_1 nu_e nu_bar_e)
DECAY   1000025     5.71061809E-05   # chi^0_3
#    BR                NDA      ID1      ID2
     3.02924884E-03    2     1000022        22   # BR(chi^0_3 -> chi^0_1 photon)
     1.11781875E-02    2     1000023        22   # BR(chi^0_3 -> chi^0_2 photon)
#    BR                NDA      ID1      ID2       ID3
     6.08063931E-02    3     1000022         2        -2   # BR(chi^0_3 -> chi^0_1 u u_bar)
     6.07253170E-02    3     1000022         4        -4   # BR(chi^0_3 -> chi^0_1 c c_bar)
     7.79435988E-02    3     1000022         1        -1   # BR(chi^0_3 -> chi^0_1 d d_bar)
     7.79431828E-02    3     1000022         3        -3   # BR(chi^0_3 -> chi^0_1 s s_bar)
     7.72064537E-02    3     1000022         5        -5   # BR(chi^0_3 -> chi^0_1 b b_bar)
     1.75710584E-02    3     1000022        11       -11   # BR(chi^0_3 -> chi^0_1 e^- e^+)
     1.75710124E-02    3     1000022        13       -13   # BR(chi^0_3 -> chi^0_1 mu^- mu^+)
     1.75538222E-02    3     1000022        15       -15   # BR(chi^0_3 -> chi^0_1 tau^- tau^+)
     1.04259868E-01    3     1000022        12       -12   # BR(chi^0_3 -> chi^0_1 nu_e nu_bar_e)
     7.54401886E-03    3     1000023         2        -2   # BR(chi^0_3 -> chi^0_2 u u_bar)
     7.02488594E-03    3     1000023         4        -4   # BR(chi^0_3 -> chi^0_2 c c_bar)
     9.67295806E-03    3     1000023         1        -1   # BR(chi^0_3 -> chi^0_2 d d_bar)
     9.66961151E-03    3     1000023         3        -3   # BR(chi^0_3 -> chi^0_2 s s_bar)
     4.80117772E-03    3     1000023         5        -5   # BR(chi^0_3 -> chi^0_2 b b_bar)
     2.18292245E-03    3     1000023        11       -11   # BR(chi^0_3 -> chi^0_2 e^- e^+)
     2.18173065E-03    3     1000023        13       -13   # BR(chi^0_3 -> chi^0_2 mu^- mu^+)
     1.87361737E-03    3     1000023        15       -15   # BR(chi^0_3 -> chi^0_2 tau^- tau^+)
     1.29354900E-02    3     1000023        12       -12   # BR(chi^0_3 -> chi^0_2 nu_e nu_bar_e)
     7.00521393E-02    3     1000024         1        -2   # BR(chi^0_3 -> chi^+_1 d u_bar)
     7.00521393E-02    3    -1000024        -1         2   # BR(chi^0_3 -> chi^-_1 d_bar u)
     6.88379889E-02    3     1000024         3        -4   # BR(chi^0_3 -> chi^+_1 s c_bar)
     6.88379889E-02    3    -1000024        -3         4   # BR(chi^0_3 -> chi^-_1 s_bar c)
     2.33506864E-02    3     1000024        11       -12   # BR(chi^0_3 -> chi^+_1 e^- nu_bar_e)
     2.33506864E-02    3    -1000024       -11        12   # BR(chi^0_3 -> chi^-_1 e^+ nu_e)
     2.33487387E-02    3     1000024        13       -14   # BR(chi^0_3 -> chi^+_1 mu^- nu_bar_mu)
     2.33487387E-02    3    -1000024       -13        14   # BR(chi^0_3 -> chi^-_1 mu^+ nu_mu)
     2.25731693E-02    3     1000024        15       -16   # BR(chi^0_3 -> chi^+_1 tau^- nu_bar_tau)
     2.25731693E-02    3    -1000024       -15        16   # BR(chi^0_3 -> chi^-_1 tau^+ nu_tau)
DECAY   1000035     2.48058930E+01   # chi^0_4
#    BR                NDA      ID1      ID2
     1.91918861E-01    2     1000024       -24   # BR(chi^0_4 -> chi^+_1 W^-)
     1.91918861E-01    2    -1000024        24   # BR(chi^0_4 -> chi^-_1 W^+)
     4.66018110E-02    2          37  -1000024   # BR(chi^0_4 -> H^+ chi^-_1)
     4.66018110E-02    2         -37   1000024   # BR(chi^0_4 -> H^- chi^+_1)
     9.33826959E-03    2     1000022        23   # BR(chi^0_4 -> chi^0_1 Z)
     1.43207072E-01    2     1000023        23   # BR(chi^0_4 -> chi^0_2 Z)
     3.88489992E-02    2     1000025        23   # BR(chi^0_4 -> chi^0_3 Z)
     5.54431895E-03    2     1000022        36   # BR(chi^0_4 -> chi^0_1 A^0)
     7.56451968E-03    2     1000023        36   # BR(chi^0_4 -> chi^0_2 A^0)
     9.23213321E-03    2     1000025        36   # BR(chi^0_4 -> chi^0_3 A^0)
     2.90529021E-02    2     1000022        25   # BR(chi^0_4 -> chi^0_1 h^0)
     8.09562322E-02    2     1000023        25   # BR(chi^0_4 -> chi^0_2 h^0)
     1.13040867E-01    2     1000025        25   # BR(chi^0_4 -> chi^0_3 h^0)
     7.37924436E-03    2     1000022        35   # BR(chi^0_4 -> chi^0_1 H^0)
     3.85333055E-02    2     1000023        35   # BR(chi^0_4 -> chi^0_2 H^0)
     1.47712551E-02    2     1000025        35   # BR(chi^0_4 -> chi^0_3 H^0)
#    BR                NDA      ID1      ID2       ID3
     1.08203454E-03    3     1000022         6        -6   # BR(chi^0_4 -> chi^0_1 t t_bar)
     4.98110377E-03    3     1000023         6        -6   # BR(chi^0_4 -> chi^0_2 t t_bar)
     4.24415633E-03    3     1000025         6        -6   # BR(chi^0_4 -> chi^0_3 t t_bar)
     7.57740356E-03    3     1000024         5        -6   # BR(chi^0_4 -> chi^+_1 b t_bar)
     7.57740356E-03    3    -1000024        -5         6   # BR(chi^0_4 -> chi^-_1 b_bar t)
DECAY   1000021     2.40941763E+00   # ~g
#    BR                NDA      ID1      ID2
     4.20052361E-01    2     1000005        -5   # BR(~g -> ~b_1 b_bar)
     4.20052361E-01    2    -1000005         5   # BR(~g -> ~b^*_1 b)
     1.00812674E-04    2     1000022        21   # BR(~g -> chi^0_1 g)
     4.52138704E-04    2     1000023        21   # BR(~g -> chi^0_2 g)
     3.39427358E-04    2     1000025        21   # BR(~g -> chi^0_3 g)
#    BR                NDA      ID1      ID2       ID3
     1.53067933E-02    3     1000022         6        -6   # BR(~g -> chi^0_1 t t_bar)
     3.86830003E-02    3     1000023         6        -6   # BR(~g -> chi^0_2 t t_bar)
     2.82679381E-02    3     1000025         6        -6   # BR(~g -> chi^0_3 t t_bar)
     3.82269144E-02    3     1000024         5        -6   # BR(~g -> chi^+_1 b t_bar)
     3.82269144E-02    3    -1000024        -5         6   # BR(~g -> chi^-_1 b_bar t)
DECAY        25     3.37485722E-03   # Gamma(h0)
     2.48259020E-03   2        22        22   # BR(h0 -> photon photon)
     1.36175504E-03   2        22        23   # BR(h0 -> photon Z)
     2.29441706E-02   2        23        23   # BR(h0 -> Z Z)
     1.99513802E-01   2       -24        24   # BR(h0 -> W W)
     7.84603796E-02   2        21        21   # BR(h0 -> gluon gluon)
     5.34011108E-09   2       -11        11   # BR(h0 -> Electron electron)
     2.37536216E-04   2       -13        13   # BR(h0 -> Muon muon)
     6.84867529E-02   2       -15        15   # BR(h0 -> Tau tau)
     1.49649692E-07   2        -2         2   # BR(h0 -> Up up)
     2.90412375E-02   2        -4         4   # BR(h0 -> Charm charm)
     6.20420052E-07   2        -1         1   # BR(h0 -> Down down)
     2.24391477E-04   2        -3         3   # BR(h0 -> Strange strange)
     5.97246609E-01   2        -5         5   # BR(h0 -> Bottom bottom)
DECAY        35     3.66400710E+00   # Gamma(HH)
     1.37894633E-06   2        22        22   # BR(HH -> photon photon)
     5.10431086E-07   2        22        23   # BR(HH -> photon Z)
     4.60829420E-04   2        23        23   # BR(HH -> Z Z)
     3.80146000E-04   2       -24        24   # BR(HH -> W W)
     1.64507470E-04   2        21        21   # BR(HH -> gluon gluon)
     2.92564159E-09   2       -11        11   # BR(HH -> Electron electron)
     1.30234740E-04   2       -13        13   # BR(HH -> Muon muon)
     3.76090299E-02   2       -15        15   # BR(HH -> Tau tau)
     2.07905298E-11   2        -2         2   # BR(HH -> Up up)
     4.03239398E-06   2        -4         4   # BR(HH -> Charm charm)
     2.86429586E-01   2        -6         6   # BR(HH -> Top top)
     2.35583232E-07   2        -1         1   # BR(HH -> Down down)
     8.52114235E-05   2        -3         3   # BR(HH -> Strange strange)
     2.27208124E-01   2        -5         5   # BR(HH -> Bottom bottom)
     9.06175934E-03   2  -1000024   1000024   # BR(HH -> Chargino1 chargino1)
     9.52246759E-02   2   1000022   1000022   # BR(HH -> neutralino1 neutralino1)
     1.78688896E-01   2   1000022   1000023   # BR(HH -> neutralino1 neutralino2)
     1.30977873E-02   2   1000022   1000025   # BR(HH -> neutralino1 neutralino3)
     5.23583022E-03   2   1000023   1000023   # BR(HH -> neutralino2 neutralino2)
     9.71133334E-02   2   1000023   1000025   # BR(HH -> neutralino2 neutralino3)
     4.63700264E-02   2   1000025   1000025   # BR(HH -> neutralino3 neutralino3)
     2.73386223E-03   2        25        25   # BR(HH -> h0 h0)
DECAY        36     3.65931082E+00   # Gamma(A0)
     2.07916639E-06   2        22        22   # BR(A0 -> photon photon)
     7.98666728E-07   2        22        23   # BR(A0 -> photon Z)
     3.49804982E-04   2        21        21   # BR(A0 -> gluon gluon)
     2.87360971E-09   2       -11        11   # BR(A0 -> Electron electron)
     1.27918628E-04   2       -13        13   # BR(A0 -> Muon muon)
     3.69404149E-02   2       -15        15   # BR(A0 -> Tau tau)
     1.98196917E-11   2        -2         2   # BR(A0 -> Up up)
     3.84374599E-06   2        -4         4   # BR(A0 -> Charm charm)
     2.90121690E-01   2        -6         6   # BR(A0 -> Top top)
     2.31398051E-07   2        -1         1   # BR(A0 -> Down down)
     8.36977245E-05   2        -3         3   # BR(A0 -> Strange strange)
     2.23186012E-01   2        -5         5   # BR(A0 -> Bottom bottom)
     1.16330805E-02   2  -1000024   1000024   # BR(A0 -> Chargino1 chargino1)
     1.64300355E-01   2   1000022   1000022   # BR(A0 -> neutralino1 neutralino1)
     8.36675696E-02   2   1000022   1000023   # BR(A0 -> neutralino1 neutralino2)
     3.11046148E-02   2   1000022   1000025   # BR(A0 -> neutralino1 neutralino3)
     3.23697016E-03   2   1000023   1000023   # BR(A0 -> neutralino2 neutralino2)
     5.65405983E-02   2   1000023   1000025   # BR(A0 -> neutralino2 neutralino3)
     9.80865034E-02   2   1000025   1000025   # BR(A0 -> neutralino3 neutralino3)
     6.13814260E-04   2        23        25   # BR(A0 -> Z h0)
     1.53091821E-36   2        25        25   # BR(A0 -> h0 h0)
DECAY        37     3.87215037E+00   # Gamma(Hp)
     3.07138828E-09   2       -11        12   # BR(Hp -> Electron nu_e)
     1.31311441E-04   2       -13        14   # BR(Hp -> Muon nu_mu)
     3.71422602E-02   2       -15        16   # BR(Hp -> Tau nu_tau)
     2.14935112E-07   2        -1         2   # BR(Hp -> Down up)
     3.59641896E-06   2        -3         2   # BR(Hp -> Strange up)
     2.33479818E-06   2        -5         2   # BR(Hp -> Bottom up)
     2.07645449E-07   2        -1         4   # BR(Hp -> Down charm)
     8.17153829E-05   2        -3         4   # BR(Hp -> Strange charm)
     3.26961454E-04   2        -5         4   # BR(Hp -> Bottom charm)
     2.11730231E-05   2        -1         6   # BR(Hp -> Down top)
     4.61753154E-04   2        -3         6   # BR(Hp -> Strange top)
     5.45500043E-01   2        -5         6   # BR(Hp -> Bottom top)
     2.58163603E-01   2   1000022   1000024   # BR(Hp -> neutralino1 chargino1)
     1.82872343E-04   2   1000023   1000024   # BR(Hp -> neutralino2 chargino1)
     1.57395653E-01   2   1000024   1000025   # BR(Hp -> chargino1 neutralino3)
     5.86296877E-04   2        24        25   # BR(Hp -> W h0)
     2.23419104E-10   2        24        35   # BR(Hp -> W HH)
     2.94798198E-10   2        24        36   # BR(Hp -> W A0)
DECAY         6     2.43000000E+00   # top
#    BR                NDA      ID1      ID2
     1.00000000E+00    2           5        24   # BR(t -> b W)
Block HiggsBoundsInputHiggsCouplingsFermions
# ScalarNormEffCoupSq PseudoSNormEffCoupSq NP IP1 IP2 IP2
    9.20496742E-01    0.00000000E+00        3  25   5   5  # h0-b-b eff. coupling^2, normalised to SM
    4.40902204E+01    0.00000000E+00        3  35   5   5  # H0-b-b eff. coupling^2, normalised to SM
    0.00000000E+00    4.40107172E+01        3  36   5   5  # A0-b-b eff. coupling^2, normalised to SM
#
    1.00180645E+00    0.00000000E+00        3  25   6   6  # h0-t-t eff. coupling^2, normalised to SM
    2.09152861E-02    0.00000000E+00        3  35   6   6  # H0-t-t eff. coupling^2, normalised to SM
    0.00000000E+00    2.27217383E-02        3  36   6   6  # A0-t-t eff. coupling^2, normalised to SM
#
    9.20496742E-01    0.00000000E+00        3  25  15  15  # h0-tau-tau eff. coupling^2, normalised to SM
    4.40902204E+01    0.00000000E+00        3  35  15  15  # H0-tau-tau eff. coupling^2, normalised to SM
    0.00000000E+00    4.40107172E+01        3  36  15  15  # A0-tau-tau eff. coupling^2, normalised to SM
#
Block HiggsBoundsInputHiggsCouplingsBosons
    9.99962627E-01        3  25  24  24  # h0-W-W eff. coupling^2, normalised to SM
    3.73726514E-05        3  35  24  24  # H0-W-W eff. coupling^2, normalised to SM
    0.00000000E+00        3  36  24  24  # A0-W-W eff. coupling^2, normalised to SM
#
    9.99962627E-01        3  25  23  23  # h0-Z-Z eff. coupling^2, normalised to SM
    3.73726514E-05        3  35  23  23  # H0-Z-Z eff. coupling^2, normalised to SM
    0.00000000E+00        3  36  23  23  # A0-Z-Z eff. coupling^2, normalised to SM
#
    1.27217575E+00        3  25  21  21  # h0-g-g eff. coupling^2, normalised to SM
    1.73265863E-02        3  35  21  21  # H0-g-g eff. coupling^2, normalised to SM
    1.65886073E-01        3  36  21  21  # A0-g-g eff. coupling^2, normalised to SM
#
    0.00000000E+00        3  25  25  23  # h0-h0-Z eff. coupling^2, normalised to SM
    0.00000000E+00        3  35  25  23  # H0-h0-Z eff. coupling^2, normalised to SM
    3.73726514E-05        3  36  25  23  # A0-h0-Z eff. coupling^2, normalised to SM
    0.00000000E+00        3  35  35  23  # H0-H0-Z eff. coupling^2, normalised to SM
    9.99962627E-01        3  36  35  23  # A0-H0-Z eff. coupling^2, normalised to SM
    0.00000000E+00        3  36  36  23  # A0-A0-Z eff. coupling^2, normalised to SM
#
    0.00000000E+00        4  25  21  21  23  # h0-g-g-Z eff. coupling^2, normalised to SM
    0.00000000E+00        4  35  21  21  23  # H0-g-g-Z eff. coupling^2, normalised to SM
    0.00000000E+00        4  36  21  21  23  # A0-g-g-Z eff. coupling^2, normalised to SM
Block SPhenoLowEnergy  # low energy observables
    1    3.39332193E-04   # BR(b -> s gamma)
    2    1.58933923E-06   # BR(b -> s mu+ mu-)
    3    3.52738430E-05   # BR(b -> s nu nu)
    4    2.61222603E-15   # BR(Bd -> e+ e-)
    5    1.11591328E-10   # BR(Bd -> mu+ mu-)
    6    2.33603890E-08   # BR(Bd -> tau+ tau-)
    7    8.81888937E-14   # BR(Bs -> e+ e-)
    8    3.76742663E-09   # BR(Bs -> mu+ mu-)
    9    7.99098300E-07   # BR(Bs -> tau+ tau-)
   10    9.66693610E-05   # BR(B_u -> tau nu)
   11    9.98557490E-01   # BR(B_u -> tau nu)/BR(B_u -> tau nu)_SM
   12    5.42959355E-01   # |Delta(M_Bd)| [ps^-1] 
   13    1.93996755E+01   # |Delta(M_Bs)| [ps^-1] 
   14    0.00000000E+00   # neutron EDM according to the chiral quark model
   15    0.00000000E+00   # neutron EDM according to the relativistic quark-parton model
   16    2.16127469E-03   # epsilon_K
   17    2.28169917E-15   # Delta(M_K)
   18    2.48125686E-11   # BR(K^0 -> pi^0 nu nu)
   19    8.29355252E-11   # BR(K^+ -> pi^+ nu nu)
   20    5.92232583E-17   # Delta(g-2)_electron/2
   21    2.53197920E-12   # Delta(g-2)_muon/2
   22    7.16244609E-10   # Delta(g-2)_tau/2
   23    0.00000000E+00   # electric dipole moment of the electron
   24    0.00000000E+00   # electric dipole moment of the muon
   25    0.00000000E+00   # electric dipole moment of the tau
   26    0.00000000E+00   # Br(mu -> e gamma)
   27    0.00000000E+00   # Br(tau -> e gamma)
   28    0.00000000E+00   # Br(tau -> mu gamma)
   29    0.00000000E+00   # Br(mu -> 3 e)
   30    0.00000000E+00   # Br(tau -> 3 e)
   31    0.00000000E+00   # Br(tau -> 3 mu)
   39   -1.32621942E-04   # Delta(rho_parameter)
   40    0.00000000E+00   # BR(Z -> e mu)
   41    0.00000000E+00   # BR(Z -> e tau)
   42    0.00000000E+00   # BR(Z -> mu tau)
Block FWCOEF Q=  1.60000000E+02  # Wilson coefficients at scale Q
#    id        order  M        value         comment
     0305 4422   00   0    -1.88819110E-01   # C7
     0305 4422   00   2    -2.07711227E-01   # C7
     0305 4322   00   2    -3.97028588E-04   # C7'
     0305 6421   00   0    -9.52278348E-02   # C8
     0305 6421   00   2    -1.19634133E-01   # C8
     0305 6321   00   2    -4.91883539E-04   # C8'
 03051111 4133   00   0     1.62500501E+00   # C9 e+e-
 03051111 4133   00   2     1.62554893E+00   # C9 e+e-
 03051111 4233   00   2     7.80763478E-06   # C9' e+e-
 03051111 4137   00   0    -4.44769711E+00   # C10 e+e-
 03051111 4137   00   2    -4.44811950E+00   # C10 e+e-
 03051111 4237   00   2    -5.66170435E-05   # C10' e+e-
 03051313 4133   00   0     1.62500501E+00   # C9 mu+mu-
 03051313 4133   00   2     1.62554893E+00   # C9 mu+mu-
 03051313 4233   00   2     7.80763110E-06   # C9' mu+mu-
 03051313 4137   00   0    -4.44769711E+00   # C10 mu+mu-
 03051313 4137   00   2    -4.44811951E+00   # C10 mu+mu-
 03051313 4237   00   2    -5.66170402E-05   # C10' mu+mu-
 03051212 4137   00   0     1.50535012E+00   # C11 nu_1 nu_1
 03051212 4137   00   2     1.50544237E+00   # C11 nu_1 nu_1
 03051212 4237   00   2     1.22462117E-05   # C11' nu_1 nu_1
 03051414 4137   00   0     1.50535012E+00   # C11 nu_2 nu_2
 03051414 4137   00   2     1.50544237E+00   # C11 nu_2 nu_2
 03051414 4237   00   2     1.22462124E-05   # C11' nu_2 nu_2
 03051616 4137   00   0     1.50535012E+00   # C11 nu_3 nu_3
 03051616 4137   00   2     1.50544237E+00   # C11 nu_3 nu_3
 03051616 4237   00   2     1.22464308E-05   # C11' nu_3 nu_3
Block IMFWCOEF Q=  1.60000000E+02  # Im(Wilson coefficients) at scale Q
#    id        order  M        value         comment
     0305 4422   00   0     3.85823946E-07   # C7
     0305 4422   00   2     8.11713121E-07   # C7
     0305 4322   00   2     2.19161238E-07   # C7'
     0305 6421   00   0     3.30483726E-07   # C8
     0305 6421   00   2     3.06081593E-06   # C8
     0305 6321   00   2     1.46073402E-07   # C8'
 03051111 4133   00   2     2.10687569E-07   # C9 e+e-
 03051111 4233   00   2     2.07428710E-07   # C9' e+e-
 03051111 4137   00   2    -2.48528103E-07   # C10 e+e-
 03051111 4237   00   2    -1.51582258E-06   # C10' e+e-
 03051313 4133   00   2     2.10687510E-07   # C9 mu+mu-
 03051313 4233   00   2     2.07428708E-07   # C9' mu+mu-
 03051313 4137   00   2    -2.48528050E-07   # C10 mu+mu-
 03051313 4237   00   2    -1.51582258E-06   # C10' mu+mu-
 03051212 4137   00   2     6.93108020E-08   # C11 nu_1 nu_1
 03051212 4237   00   2     3.27881310E-07   # C11' nu_1 nu_1
 03051414 4137   00   2     6.93108041E-08   # C11 nu_2 nu_2
 03051414 4237   00   2     3.27881310E-07   # C11' nu_2 nu_2
 03051616 4137   00   2     6.93113953E-08   # C11 nu_3 nu_3
 03051616 4237   00   2     3.27881309E-07   # C11' nu_3 nu_3
