BLOCK SPINFO
   1   SPheno
   2   v4.0.5be

BLOCK SPHENOINFO
   1   2
   2   2

BLOCK MODSEL
   1   0

BLOCK MINPAR
   3    57.948218
   4    1

BLOCK EXTPAR
   0    1824.496
   1   -84.232358
   2    373.50488
   3    3000
   11    2450.5987
   12    930.64335
   13    1183.2008
   23    1816.0177
   25    56.465022
   26    1190.2462
   31    75.40325
   32    75.40325
   33    558.48455
   34    1716.7381
   35    1716.7381
   36    1200.7478
   41    5000
   42    5000
   43    1996.7022
   44    5000
   45    5000
   46    1603.7147
   47    5000
   48    5000
   49    956.69667

BLOCK SMINPUTS
   1    127.90897
   2    1.1663787e-05
   3    0.1184
   4    91.1876
   5    4.18
   6    173.2
   7    1.777
   8    0
   11    0.00051099893
   12    0
   13    0.10565837
   14    0
   21    0.005
   22    0.0025
   23    0.095
   24    1.27

BLOCK GAUGE Q=  1824.496
   1    0.35536298
   2    0.66519887
   3    1.219778

BLOCK YU Q=  1824.496
   1   1    8.3856869e-06
   2   2    0.0042599289
   3   3    1.0130583

BLOCK YD Q=  1824.496
   1   1    0.00095147721
   2   2    0.018078067
   3   3    0.94356725

BLOCK YE Q=  1824.496
   1   1    0.00016603973
   2   2    0.03433175
   3   3    0.57740356

BLOCK AU Q=  1824.496
   1   1    0
   2   2    0
   3   3    2450.5987

BLOCK AD Q=  1824.496
   1   1    0
   2   2    0
   3   3    930.64341

BLOCK AE Q=  1824.496
   1   1    0
   2   2    0
   3   3    1183.2008

BLOCK MSOFT Q=  1824.496
   1   -84.232358
   2    373.50488
   3    3000
   21   -1864533.1
   22   -3225956.7
   31    75.40325
   32    75.40325
   33    558.48455
   34    1716.7381
   35    1716.7381
   36    1200.7478
   41    5000
   42    5000
   43    1996.7022
   44    5000
   45    5000
   46    1603.7147
   47    5000
   48    5000
   49    956.69667

BLOCK MASS
   6    173.2
   23    91.1876
   24    80.429995
   15    1.777
   25    120.05208
   35    1189.9157
   36    1190.2462
   37    1193.5984
   1000001    5040.1273
   2000001    5029.0623
   1000002    5039.6655
   2000002    5030.9942
   1000003    5040.1441
   2000003    5029.053
   1000004    5039.6683
   2000004    5030.9946
   1000005    990.43871
   2000005    2034.6801
   1000006    1618.2954
   2000006    2056.9704
   1000011    118.67386
   2000011    1717.5877
   1000012    87.946941
   1000013    118.33866
   2000013    1717.5705
   1000014    87.966274
   1000015    521.83032
   2000015    1191.416
   1000016    550.09222
   1000021    3210.2023
   1000022   -83.655456
   1000023    395.27631
   1000025   -1803.6357
   1000035    1805.6094
   1000024    395.48299
   1000037    1806.2712

BLOCK ALPHA
      -0.017643508

BLOCK HMIX Q=  1824.496
   1    1816.0177
   2    56.465022
   3    243.85028
   4    1416686

BLOCK STOPMIX
   1   1   -0.22579482
   1   2    0.97417488
   2   1   -0.97417488
   2   2   -0.22579482

BLOCK SBOTMIX
   1   1    0.042634752
   1   2    0.99909073
   2   1   -0.99909073
   2   2    0.042634752

BLOCK STAUMIX
   1   1    0.98546418
   1   2    0.16988334
   2   1   -0.16988334
   2   2    0.98546418

BLOCK NMIX
   1   1    0.99969014
   1   2   -0.00021266243
   1   3    0.024877689
   1   4    0.00082595089
   2   1   -0.0013317301
   2   2   -0.99892024
   2   3    0.045312902
   2   4   -0.010164847
   3   1   -0.018158607
   3   2    0.024873474
   3   3    0.70642519
   3   4    0.70711741
   4   1    0.016974048
   4   2   -0.039238014
   4   3   -0.70589751
   4   4    0.70702261

BLOCK UMIX
   1   1   -0.9979279
   1   2    0.064342077
   2   1    0.064342077
   2   2    0.9979279

BLOCK VMIX
   1   1   -0.99989352
   1   2    0.014592558
   2   1    0.014592558
   2   2    0.99989352

BLOCK HIGGSBOUNDSINPUTHIGGSCOUPLINGSFERMIONS
       0, 3188.2987,3,36,15,15

BLOCK HIGGSBOUNDSINPUTHIGGSCOUPLINGSBOSONS
       0,4,36,21,21,23

BLOCK SPHENOLOWENERGY
   1    0.00035917259
   2    1.5860322e-06
   3    3.5226309e-05
   4    4.4611423e-15
   5    1.9057574e-10
   6    3.9929494e-08
   7    1.4898812e-13
   8    6.3647988e-09
   9    1.3514413e-06
   10    7.7388256e-05
   11    0.79939105
   12    0.54301996
   13    19.307498
   14    0
   15    0
   16    0.0021654485
   17    2.2817556e-15
   18    2.4781534e-11
   19    8.2860229e-11
   20    5.6022948e-15
   21    2.3546557e-10
   22    1.9830103e-07
   23    0
   24    0
   25    0
   26    0
   27    0
   28    0
   29    0
   30    0
   31    0
   39    0.00032711589
   40    0
   41    0
   42    0

BLOCK FWCOEF Q=  160
   305   4422   0   0   -0.18881911
   305   4422   0   2   -0.22902201
   305   4322   0   2   -0.00062829316
   305   6421   0   0   -0.095227835
   305   6421   0   2   -0.13566926
   305   6321   0   2   -0.00070391906
   3051111   4133   0   0    1.5999224
   3051111   4133   0   2    1.6001101
   3051111   4233   0   2    5.4449352e-05
   3051111   4137   0   0   -4.4226145
   3051111   4137   0   2   -4.4182636
   3051111   4237   0   2   -0.00041634418
   3051313   4133   0   0    1.5999224
   3051313   4133   0   2    1.6000991
   3051313   4233   0   2    5.4418977e-05
   3051313   4137   0   0   -4.4226145
   3051313   4137   0   2   -4.4182746
   3051313   4237   0   2   -0.00041632053
   3051212   4137   0   0    1.5053501
   3051212   4137   0   2    1.504431
   3051212   4237   0   2    9.0552471e-05
   3051414   4137   0   0    1.5053501
   3051414   4137   0   2    1.504431
   3051414   4237   0   2    9.0558771e-05
   3051616   4137   0   0    1.5053501
   3051616   4137   0   2    1.5044304
   3051616   4237   0   2    9.2337633e-05

BLOCK IMFWCOEF Q=  160
   305   4422   0   0    3.8562893e-07
   305   4422   0   2    2.2946382e-05
   305   4322   0   2   -2.0048607e-06
   305   6421   0   0    3.3031668e-07
   305   6421   0   2   -1.4445989e-05
   305   6321   0   2   -1.5245428e-06
   3051111   4133   0   2   -9.8715611e-07
   3051111   4233   0   2    6.5115319e-06
   3051111   4137   0   2    3.0556455e-06
   3051111   4237   0   2   -5.0103941e-05
   3051313   4133   0   2   -9.8703625e-07
   3051313   4233   0   2    6.5115079e-06
   3051313   4137   0   2    3.0556145e-06
   3051313   4237   0   2   -5.0104037e-05
   3051212   4137   0   2   -1.5985307e-07
   3051212   4237   0   2    1.0899545e-05
   3051414   4137   0   2   -1.5979485e-07
   3051414   4237   0   2    1.0899545e-05
   3051616   4137   0   2   -1.6878638e-07
   3051616   4237   0   2    1.0899606e-05

DECAY 23  2.4952


DECAY 24  2.085


DECAY 1000011  0.037713563
    0.99902639   2    1000022    11
    0.00048877716   3    1000012    1   -2
    0.00048483701   3    1000012    3   -4

DECAY 2000011  8.5840462
    0.99999834   2    1000022    11

DECAY 1000013  0.037186088
    0.99906652   2    1000022    13
    0.00046867918   3    1000014    1   -2
    0.00046480325   3    1000014    3   -4

DECAY 2000013  8.6065086
    0.99738116   2    1000022    13
    0.0025895914   2    1000013    25

DECAY 1000015  1.9234626
    0.42652932   2   -1000024    16
    0.35856314   2    1000022    15
    0.21490754   2    1000023    15

DECAY 2000015  36.249155
    0.43438072   2    1000016   -24
    0.22733514   2    1000015    23
    0.17452711   2    1000015    25
    0.15922551   2    1000022    15
    0.0030030026   2   -1000024    16
    0.0015285132   2    1000023    15

DECAY 1000012  0.0010016608
    1   2    1000022    12

DECAY 1000014  0.0010102675
    1   2    1000022    14

DECAY 1000016  2.3562012
    0.48054439   2    1000024    15
    0.27991137   2    1000022    16
    0.23953034   2    1000023    16

DECAY 2000001  142.17763
    0.98026514   2    1000021    1
    0.019724598   2    1000022    1

DECAY 1000001  206.90651
    0.67915821   2    1000021    1
    0.21092806   2   -1000024    2
    0.10562508   2    1000023    1
    0.0034040653   2    1000022    1
    0.00067435782   2   -1000037    2
    0.00014565735   2    1000035    1

DECAY 2000003  142.2262
    0.9799236   2    1000021    3
    0.019717968   2    1000022    3
    0.00017368974   2   -1000037    4

DECAY 1000003  206.93472
    0.67907405   2    1000021    3
    0.21089999   2   -1000024    4
    0.10561136   2    1000023    3
    0.0034037101   2    1000022    3
    0.00068097825   2   -1000037    4
    0.00020543355   2    1000035    3
    0.00012447726   2    1000025    3

DECAY 1000005  0.71968681
    0.78412587   2    1000022    5
    0.13965912   2   -1000024    6
    0.076215006   2    1000023    5

DECAY 2000005  54.105258
    0.29727321   2   -1000024    6
    0.2523563   2    1000006   -24
    0.19549369   2    1000005    25
    0.15264055   2    1000023    5
    0.042150021   2    1000005    23
    0.024381856   2   -1000037    6
    0.015321044   2    1000025    5
    0.015078786   2    1000035    5
    0.0053045358   2    1000022    5

DECAY 2000002  150.79978
    0.92554903   2    1000021    2
    0.074415893   2    1000022    2

DECAY 1000002  206.89597
    0.67896067   2    1000021    2
    0.21175072   2    1000024    1
    0.10572089   2    1000023    2
    0.0033876996   2    1000022    2
    0.00010683392   2    1000035    2

DECAY 2000004  150.80253
    0.9255321   2    1000021    4
    0.074414535   2    1000022    4

DECAY 1000004  206.92246
    0.67887483   2    1000021    4
    0.21172436   2    1000024    3
    0.1057074   2    1000023    4
    0.0033872671   2    1000022    4
    0.00015446916   2    1000037    3
    0.00011016836   2    1000035    4

DECAY 1000006  4.2109628
    0.79340295   2    1000022    6
    0.125856   2    1000024    5
    0.060657943   2    1000023    6
    0.015123081   2    1000005    24
    0.0029527553   2    1000023    4
    0.0015042571   3    1000016   -15    5
    0.0002741493   3    1000022    24    5
    0.00010518589   2    1000022    4

DECAY 2000006  48.246172
    0.33637458   2    1000024    5
    0.17840162   2    1000006    25
    0.16387682   2    1000023    6
    0.15360673   2    1000006    23
    0.095052961   2    1000005    24
    0.039236675   2    1000037    5
    0.011636216   2    1000035    6
    0.011521972   2    1000025    6
    0.010292414   2    1000022    6

DECAY 1000024  6.0174315
    0.26132155   2    1000012   -11
    0.26131345   2    1000014   -13
    0.23880517   2   -1000013    14
    0.23853878   2   -1000011    12

DECAY 1000037  49.191137
    0.47945807   2   -1000005    6
    0.099839098   2    1000016   -15
    0.080636724   2    1000024    25
    0.077135554   2    1000023    24
    0.076123112   2    1000024    23
    0.043221158   2    1000006   -5
    0.038554344   2   -2000015    16
    0.024948221   2    1000022    24
    0.020723676   2    1000024    36
    0.020696324   2    1000024    35
    0.020609894   2    37    1000023
    0.0071314789   2    37    1000022
    0.0039243944   3    1000024    6   -6
    0.0031035247   3    1000023   -5    6
    0.00095227078   2   -1000015    16
    0.00085467105   3    1000022   -5    6
    0.00066336592   2   -1000013    14
    0.00066333348   2   -1000011    12
    0.000460926   2    1000014   -13
    0.00025673326   3    1000024    5   -5

DECAY 1000022 -1


DECAY 1000023  6.0125676
    0.1302439   2    1000012   -12
    0.1302439   2   -1000012    12
    0.13023793   2    1000014   -14
    0.13023793   2   -1000014    14
    0.11982202   2    1000013   -13
    0.11982202   2   -1000013    13
    0.11968643   2    1000011   -11
    0.11968643   2   -1000011    11

DECAY 1000025  48.589813
    0.23971632   2    1000005   -5
    0.23971632   2   -1000005    5
    0.077223166   2    1000024   -24
    0.077223166   2   -1000024    24
    0.055170574   2    1000023    25
    0.054654767   2    1000023    23
    0.050938702   2    1000015   -15
    0.050938702   2   -1000015    15
    0.021593382   2    37   -1000024
    0.021593382   2   -37    1000024
    0.019761717   2    2000015   -15
    0.019761717   2   -2000015    15
    0.018847737   2    1000023    35
    0.012184459   2    1000022    25
    0.011790422   2    1000022    23
    0.0047683915   2    1000006   -6
    0.0047683915   2   -1000006    6
    0.0044248032   2    1000022    35
    0.0029597321   2    1000022    36
    0.0029077899   2    1000023    36
    0.0028721759   3    1000024    5   -6
    0.0028721759   3   -1000024   -5    6
    0.0014757334   3    1000023    6   -6
    0.00061602169   3    1000022    6   -6
    0.00023394819   2    1000013   -13
    0.00023394819   2   -1000013    13
    0.00014356105   3    1000023    5   -5

DECAY 1000035  47.116828
    0.24737281   2    1000005   -5
    0.24737281   2   -1000005    5
    0.078363383   2    1000024   -24
    0.078363383   2   -1000024    24
    0.06092869   2    1000023    25
    0.052291169   2    1000015   -15
    0.052291169   2   -1000015    15
    0.022642257   2    1000023    23
    0.021310467   2    37   -1000024
    0.021310467   2   -37    1000024
    0.020547133   2    2000015   -15
    0.020547133   2   -2000015    15
    0.018145941   2    1000023    35
    0.013913923   2    1000022    23
    0.013495609   2    1000022    25
    0.0053129873   2    1000006   -6
    0.0053129873   2   -1000006    6
    0.004254328   2    1000022    35
    0.0032829743   2    1000022    36
    0.0032500426   2    1000023    36
    0.0027717554   3    1000024    5   -6
    0.0027717554   3   -1000024   -5    6
    0.0015196013   3    1000023    6   -6
    0.00060373236   3    1000022    6   -6
    0.00029804329   2    1000013   -13
    0.00029804329   2   -1000013    13
    0.00019586561   2    1000012   -12
    0.00019586561   2   -1000012    12
    0.0001958652   2    1000014   -14
    0.0001958652   2   -1000014    14
    0.00016196156   2    1000016   -16
    0.00016196156   2   -1000016    16
    0.00014962889   3    1000023    5   -5

DECAY 1000021  198.32345
    0.19607776   2    1000005   -5
    0.19607776   2   -1000005    5
    0.1413421   2    1000006   -6
    0.1413421   2   -1000006    6
    0.085779389   2    2000005   -5
    0.085779389   2   -2000005    5
    0.07602395   2    2000006   -6
    0.07602395   2   -2000006    6
    0.00026354883   2    1000006   -4
    0.00026354883   2   -1000006    4
    0.00019304106   3    1000037    5   -6
    0.00019304106   3   -1000037   -5    6
    0.00016211697   3    1000035    6   -6
    0.00015813449   3    1000025    6   -6

DECAY 25  0.27967446
    0.0078065505   2   -5    5
    0.0018310689   2   -24    24
    0.00091186736   2   -15    15
    0.0008892197   2    21    21
    0.00037955479   2   -4    4
    0.00020066862   2    23    23
    2.5607615e-05   2    22    22
    1.2539958e-05   2    22    23
    3.1523934e-06   2   -13    13
    2.9766557e-06   2   -3    3
    8.2301974e-09   2   -1    1
    1.9561279e-09   2   -2    2
    7.0875263e-11   2   -11    11

DECAY 35  26.093907
    0.60271332   2   -5    5
    0.38665947   2   -15    15
    0.0069125785   2   -1000015    1000015
    0.0014993309   2   -13    13
    0.00075082337   2   -1000024    1000024
    0.00056253211   2   -3    3
    0.00037456223   2    1000023    1000023
    0.00036824093   2    1000022    1000023
    6.3087142e-05   2    25    25
    5.8460197e-05   2    1000022    1000022
    2.487314e-05   2    21    21
    3.9134029e-06   2   -6    6
    2.396646e-06   2   -24    24
    2.1981289e-06   2    23    23
    1.5553675e-06   2   -1    1
    2.6067683e-07   2   -1000011    1000011
    2.5176359e-07   2   -1000013    1000013
    4.585801e-08   2    22    23
    4.0592687e-08   2    22    22
    3.3682634e-08   2   -11    11
    1.9174803e-09   2   -4    4
    9.8986509e-15   2   -2    2

DECAY 36  25.085141
    0.6064852   2   -5    5
    0.3890182   2   -15    15
    0.0015086029   2   -13    13
    0.0013056834   2   -1000024    1000024
    0.0006513829   2    1000023    1000023
    0.00056597572   2   -3    3
    0.00034953709   2    1000022    1000023
    6.1946846e-05   2    1000022    1000022
    4.2723445e-05   2    21    21
    5.6855179e-06   2   -6    6
    3.1694337e-06   2    23    25
    1.5648881e-06   2   -1    1
    1.8502683e-07   2    22    23
    1.0716687e-07   2    22    22
    3.3890894e-08   2   -11    11
    1.5718962e-09   2   -4    4
    8.1112018e-15   2   -2    2
    5.3753593e-37   2    25    25

DECAY 37  22.463002
    0.63573179   2   -5    6
    0.35683233   2   -15    16
    0.0037499889   2   -1000015    1000016
    0.0012615344   2   -13    14
    0.00096534133   2   -5    4
    0.00082108267   2    1000022    1000024
    0.00059403124   2   -3    4
    2.7507094e-05   2   -3    2
    6.8935466e-06   2   -5    2
    3.584865e-06   2    24    25
    1.7922656e-06   2   -3    6
    1.6491293e-06   2   -1    2
    1.1662697e-06   2   -1000011    1000012
    1.1519747e-06   2   -1000013    1000014
    7.6555441e-08   2   -1    4
    4.3727235e-08   2   -1    6
    2.9507421e-08   2   -11    12
    7.3771328e-10   2    1000023    1000024
    4.0932939e-11   2    24    35
    2.5586092e-11   2    24    36

DECAY 6  2.43
    1   2    5    24

DECAY 15 -1
