BLOCK SPINFO
   1   SPheno
   2   v4.0.5be

BLOCK SPHENOINFO
   1   2
   2   2

BLOCK MODSEL
   1   0

BLOCK MINPAR
   3    44.52415
   4   -1

BLOCK EXTPAR
   0    3598.8355
   1    3256.6404
   2   -784.09389
   3    3526.1171
   11   -2873.8279
   12   -3747.6351
   13    5151.2307
   23   -789.60235
   25    43.92881
   26    1154.6657
   31    4625.3594
   32    4625.3594
   33    1861.1521
   34    1321.2338
   35    1321.2338
   36    4878.9835
   41    961.31041
   42    961.31041
   43    3311.1911
   44    3633.9421
   45    3633.9421
   46    3752.0804
   47    4549.2958
   48    4549.2958
   49    1384.0418

BLOCK SMINPUTS
   1    127.90897
   2    1.1663787e-05
   3    0.1184
   4    91.1876
   5    4.18
   6    173.2
   7    1.777
   8    0
   11    0.00051099893
   12    0
   13    0.10565837
   14    0
   21    0.005
   22    0.0025
   23    0.095
   24    1.27

BLOCK GAUGE Q=  3598.8355
   1    0.35536298
   2    0.66519887
   3    1.219778

BLOCK YU Q=  3598.8355
   1   1    8.3865443e-06
   2   2    0.0042603645
   3   3    1.0131619

BLOCK YD Q=  3598.8355
   1   1    0.00074030849
   2   2    0.014065861
   3   3    0.73415404

BLOCK YE Q=  3598.8355
   1   1    0.00012918925
   2   2    0.026712238
   3   3    0.44925591

BLOCK AU Q=  3598.8355
   1   1    0
   2   2    0
   3   3   -2873.8278

BLOCK AD Q=  3598.8355
   1   1    0
   2   2    0
   3   3   -3747.6349

BLOCK AE Q=  3598.8355
   1   1    0
   2   2    0
   3   3    5151.2306

BLOCK MSOFT Q=  3598.8355
   1    3256.6404
   2   -784.09389
   3    3526.1171
   21    989409.27
   22   -369956.88
   31    4625.3594
   32    4625.3594
   33    1861.1521
   34    1321.2338
   35    1321.2338
   36    4878.9835
   41    961.31041
   42    961.31041
   43    3311.1911
   44    3633.9421
   45    3633.9421
   46    3752.0804
   47    4549.2958
   48    4549.2958
   49    1384.0418

BLOCK MASS
   6    173.2
   23    91.1876
   24    80.429995
   15    1.777
   25    122.23174
   35    1154.5202
   36    1154.6657
   37    1157.9379
   1000001    1229.5935
   2000001    4646.66
   1000002    1226.9045
   2000002    3759.9579
   1000003    1229.5846
   2000003    4646.6505
   1000004    1226.8959
   2000004    3759.9573
   1000005    1536.3806
   2000005    3399.2637
   1000006    3393.0804
   2000006    3817.0675
   1000011    4634.3821
   2000011    1356.0427
   1000012    4633.2937
   1000013    4634.3612
   2000013    1355.9769
   1000014    4633.2726
   1000015    1856.4669
   2000015    4862.0521
   1000016    1854.6895
   1000021    3703.3699
   1000022   -744.74086
   1000023    795.72409
   1000025   -858.38528
   1000035    3217.4933
   1000024    745.50186
   1000037    859.15266

BLOCK ALPHA
      -0.022919343

BLOCK HMIX Q=  3598.8355
   1   -789.60235
   2    43.92881
   3    243.06195
   4    1333252.9

BLOCK STOPMIX
   1   1    0.99090491
   1   2    0.13456399
   2   1   -0.13456399
   2   2    0.99090491

BLOCK SBOTMIX
   1   1   -0.0084805894
   1   2    0.99996404
   2   1   -0.99996404
   2   2   -0.0084805894

BLOCK STAUMIX
   1   1   -0.99999353
   1   2    0.0035986981
   2   1   -0.0035986981
   2   2   -0.99999353

BLOCK NMIX
   1   1   -0.0056639233
   1   2   -0.67344104
   1   3   -0.53921418
   1   4    0.5056611
   2   1    0.012367991
   2   2    0.034152114
   2   3   -0.70602696
   2   4   -0.70725286
   3   1   -0.0053992953
   3   2    0.73845158
   3   3   -0.45909015
   3   4    0.49385863
   4   1    0.99989289
   4   2   -0.00024962004
   4   3    0.003199647
   4   4    0.014279341

BLOCK UMIX
   1   1   -0.65314355
   1   2   -0.75723412
   2   1   -0.75723412
   2   2    0.65314355

BLOCK VMIX
   1   1    0.70327866
   1   2    0.71091429
   2   1    0.71091429
   2   2   -0.70327866

BLOCK HIGGSBOUNDSINPUTHIGGSCOUPLINGSFERMIONS
       0, 1929.7404,3,36,15,15

BLOCK HIGGSBOUNDSINPUTHIGGSCOUPLINGSBOSONS
       0,4,36,21,21,23

BLOCK SPHENOLOWENERGY
   1    0.00035702114
   2    1.5869041e-06
   3    3.5242356e-05
   4    1.2876727e-15
   5    5.4994223e-11
   6    1.0725806e-08
   7    4.5286313e-14
   8    1.934243e-09
   9    3.8776028e-07
   10    8.790208e-05
   11    0.90799483
   12    0.54190019
   13    19.2985
   14    0
   15    0
   16    0.002157612
   17    2.2816717e-15
   18    2.4794587e-11
   19    8.2884078e-11
   20    1.6832649e-15
   21    7.1966315e-11
   22    5.46633e-08
   23    0
   24    0
   25    0
   26    0
   27    0
   28    0
   29    0
   30    0
   31    0
   39    7.3597835e-05
   40    0
   41    0
   42    0

BLOCK FWCOEF Q=  160
   305   4422   0   0   -0.18881911
   305   4422   0   2   -0.22713682
   305   4322   0   2   -0.00091960675
   305   6421   0   0   -0.095227835
   305   6421   0   2   -0.13268177
   305   6321   0   2   -0.00084743386
   3051111   4133   0   0    1.6235316
   3051111   4133   0   2    1.6237304
   3051111   4233   0   2    0.00015721117
   3051111   4137   0   0   -4.4462237
   3051111   4137   0   2   -4.4435666
   3051111   4237   0   2   -0.0011668387
   3051313   4133   0   0    1.6235316
   3051313   4133   0   2    1.6237299
   3051313   4233   0   2    0.0001571972
   3051313   4137   0   0   -4.4462237
   3051313   4137   0   2   -4.4435671
   3051313   4237   0   2   -0.0011668272
   3051212   4137   0   0    1.5053501
   3051212   4137   0   2    1.5047796
   3051212   4237   0   2    0.00025249498
   3051414   4137   0   0    1.5053501
   3051414   4137   0   2    1.5047796
   3051414   4237   0   2    0.00025249781
   3051616   4137   0   0    1.5053501
   3051616   4137   0   2    1.5047806
   3051616   4237   0   2    0.00025329613

BLOCK IMFWCOEF Q=  160
   305   4422   0   0    3.8579483e-07
   305   4422   0   2    1.5625683e-05
   305   4322   0   2   -6.2706319e-06
   305   6421   0   0    3.3045878e-07
   305   6421   0   2    2.2069379e-05
   305   6321   0   2   -2.9937954e-06
   3051111   4133   0   2   -6.2752101e-07
   3051111   4233   0   2    6.6451102e-06
   3051111   4137   0   2    1.0392034e-05
   3051111   4237   0   2   -4.9382973e-05
   3051313   4133   0   2   -6.2752395e-07
   3051313   4233   0   2    6.6450946e-06
   3051313   4137   0   2    1.0392046e-05
   3051313   4237   0   2   -4.9383001e-05
   3051212   4137   0   2   -2.1672872e-06
   3051212   4237   0   2    1.0686065e-05
   3051414   4137   0   2   -2.167287e-06
   3051414   4237   0   2    1.0686065e-05
   3051616   4137   0   2   -2.1498917e-06
   3051616   4237   0   2    1.0686068e-05

DECAY 23  2.4952


DECAY 24  2.085


DECAY 2000011  0.00062640657
    0.71545186   2    1000023    11
    0.17029301   2    1000022    11
    0.11394459   2    1000025    11
    0.00020067077   2   -1000024    12
    0.00010986727   2   -1000037    12

DECAY 1000011  59.070477
    0.36926485   2   -1000037    12
    0.27957611   2   -1000024    12
    0.17423986   2    1000025    11
    0.1499658   2    1000022    11
    0.026413006   2    1000035    11
    0.00054037719   2    1000023    11

DECAY 2000013  0.017252097
    0.31146473   2   -1000024    14
    0.2650606   2    1000023    13
    0.17051913   2   -1000037    14
    0.1643788   2    1000022    13
    0.088576739   2    1000025    13

DECAY 1000013  59.132993
    0.36887255   2   -1000037    14
    0.27927915   2   -1000024    14
    0.1742733   2    1000025    13
    0.15011358   2    1000022    13
    0.026384524   2    1000035    13
    0.0010621319   2    1000023    13

DECAY 1000015  21.043303
    0.27383657   2   -1000037    16
    0.23438135   2   -1000024    16
    0.19846673   2    1000022    15
    0.17527774   2    1000025    15
    0.11803761   2    1000023    15

DECAY 2000015  79.731155
    0.21190121   2    1000016   -37
    0.13264737   2   -1000024    16
    0.11568198   2    1000023    15
    0.10596887   2    1000015    36
    0.10596005   2    1000015    35
    0.099246738   2   -1000037    16
    0.096783179   2    1000035    15
    0.067265199   2    1000022    15
    0.049039015   2    1000025    15
    0.0079148879   2    1000016   -24
    0.0039520573   2    1000015    23
    0.0036394377   2    1000015    25

DECAY 1000012  59.089108
    0.32528095   2    1000037    11
    0.32395737   2    1000024    11
    0.17688033   2    1000025    12
    0.14720996   2    1000022    12
    0.026424746   2    1000035    12
    0.00024663971   2    1000023    12

DECAY 1000014  59.150726
    0.3253829   2    1000037    13
    0.32422304   2    1000024    13
    0.17669515   2    1000025    14
    0.14705587   2    1000022    14
    0.02639665   2    1000035    14
    0.00024638152   2    1000023    14

DECAY 1000016  21.083856
    0.41126254   2    1000024    15
    0.33471696   2    1000037    15
    0.13139449   2    1000025    16
    0.12243044   2    1000022    16
    0.00019557442   2    1000023    16

DECAY 1000001  5.2329093
    0.35291339   2   -1000024    2
    0.31065227   2   -1000037    2
    0.18747112   2    1000022    1
    0.14860617   2    1000025    1
    0.00035705098   2    1000023    1

DECAY 2000001  49.512891
    0.98579372   2    1000021    1
    0.014193767   2    1000035    1

DECAY 1000003  5.2345248
    0.35280007   2   -1000024    4
    0.3105651   2   -1000037    4
    0.18751942   2    1000022    3
    0.14860343   2    1000025    3
    0.00051198644   2    1000023    3

DECAY 2000003  49.546705
    0.9851049   2    1000021    3
    0.014183945   2    1000035    3
    0.00020090846   2   -1000024    4
    0.00018091913   2    1000023    3
    0.0001468897   2   -1000037    4
    0.00010347823   2    1000022    3

DECAY 1000005  17.258704
    0.3091805   2   -1000024    6
    0.25469792   2    1000023    5
    0.17795679   2   -1000037    6
    0.16463869   2    1000022    5
    0.093526101   2    1000025    5

DECAY 2000005  162.36522
    0.28499135   2   -1000037    6
    0.25848329   2   -1000024    6
    0.10009586   2    1000023    5
    0.096170616   2    1000022    5
    0.086298428   2    1000025    5
    0.083580465   2    1000005    36
    0.083567772   2    1000005    35
    0.0038107721   2    1000005    25
    0.0029697067   2    1000005    23

DECAY 1000002  5.2909719
    0.4017398   2    1000024    1
    0.26795553   2    1000037    1
    0.18517441   2    1000022    2
    0.14467747   2    1000025    2
    0.00045279627   2    1000023    2

DECAY 2000002  0.86825518
    0.69305708   2    1000035    2
    0.30505348   2    1000021    2
    0.0013497601   2    1000023    2
    0.00028637241   2    1000022    2
    0.00025330359   2    1000025    2

DECAY 1000004  5.2925854
    0.40180889   2    1000024    3
    0.26797075   2    1000037    3
    0.18512648   2    1000022    4
    0.14462677   2    1000025    4
    0.00046710681   2    1000023    4

DECAY 2000004  0.87073097
    0.69108323   2    1000035    4
    0.30408549   2    1000021    4
    0.0020572521   2    1000023    4
    0.00072731455   2    1000024    3
    0.00069278642   2    1000037    3
    0.00065348216   2    1000022    4
    0.00059416801   2    1000025    4

DECAY 1000006  165.01591
    0.19518988   2    1000037    5
    0.18464108   2    1000023    6
    0.16216119   2    1000024    5
    0.15884811   2    1000005    37
    0.14383681   2    1000025    6
    0.11941967   2    1000022    6
    0.030195851   3    1000022    24    5
    0.0056964092   2    1000005    24

DECAY 2000006  157.21934
    0.27203248   2    1000024    5
    0.22814331   2    1000023    6
    0.18144491   2    1000037    5
    0.13737208   2    1000022    6
    0.089835686   2    1000025    6
    0.03648239   2    2000005    24
    0.025828373   2    1000006    25
    0.018403369   2    1000006    23
    0.0059639892   2    1000005    37
    0.0043093637   2    1000035    6
    0.0001840439   2    1000005    24

DECAY 1000024  1.1692052e-12
    0.61214886   3    1000022   -1    2
    0.20327958   3    1000022   -11    12
    0.18457156   3    1000022   -13    14

DECAY 1000037  1.2875351
    0.86559296   2    1000022    24
    0.13364107   2    1000024    23
    0.00025507447   3    1000023   -1    2
    0.00025471723   3    1000023   -3    4

DECAY 1000022 -1


DECAY 1000023  0.0014534351
    0.11763746   3    1000022    12   -12
    0.087929405   3    1000022    1   -1
    0.087926423   3    1000022    3   -3
    0.083047686   3    1000022    5   -5
    0.068636305   3    1000022    2   -2
    0.068143249   3    1000022    4   -4
    0.06676761   3    1000024    1   -2
    0.06676761   3   -1000024   -1    2
    0.066587553   3    1000024    3   -4
    0.066587553   3   -1000024   -3    4
    0.027463766   2    1000022    22
    0.022254023   3    1000024    11   -12
    0.022254023   3   -1000024   -11    12
    0.02225402   3    1000024    13   -14
    0.02225402   3   -1000024   -13    14
    0.022107287   3    1000024    15   -16
    0.022107287   3   -1000024   -15    16
    0.019850473   3    1000022    11   -11
    0.019849703   3    1000022    13   -13
    0.019574539   3    1000022    15   -15

DECAY 1000025  2.3230132
    0.49945798   2    1000024   -24
    0.49945798   2   -1000024    24
    0.00021518598   3    1000023    12   -12
    0.00016099327   3    1000023    1   -1
    0.00016099006   3    1000023    3   -3
    0.00015588995   3    1000023    5   -5
    0.00012543278   3    1000023    2   -2
    0.00012489177   3    1000023    4   -4

DECAY 1000035  47.96612
    0.11395132   2    2000013   -13
    0.11395132   2   -2000013    13
    0.11394654   2    2000011   -11
    0.11394654   2   -2000011    11
    0.033465447   2    1000005   -5
    0.033465447   2   -1000005    5
    0.029378238   2    1000023    25
    0.024805212   2    1000023    35
    0.022605477   2    1000024   -24
    0.022605477   2   -1000024    24
    0.019182436   2    1000037   -24
    0.019182436   2   -1000037    24
    0.01879733   2    1000016   -16
    0.01879733   2   -1000016    16
    0.018727089   2    1000015   -15
    0.018727089   2   -1000015    15
    0.017964262   2    37   -1000024
    0.017964262   2   -37    1000024
    0.017319534   2    1000022    25
    0.016046837   2    1000022    23
    0.014714866   2    1000025    25
    0.013764894   2    1000025    23
    0.013728409   2    37   -1000037
    0.013728409   2   -37    1000037
    0.012815962   2    1000022    35
    0.012032357   2    1000023    23
    0.010267673   2    1000003   -3
    0.010267673   2   -1000003    3
    0.010267619   2    1000001   -1
    0.010267619   2   -1000001    1
    0.010225533   2    1000004   -4
    0.010225533   2   -1000004    4
    0.010225465   2    1000002   -2
    0.010225465   2   -1000002    2
    0.0099000181   2    1000025    35
    0.0069427332   2    1000023    36
    0.0046640082   2    1000022    36
    0.0030105952   2    1000025    36
    0.0016607117   3    1000023    6   -6
    0.0011971983   3    1000024    5   -6
    0.0011971983   3   -1000024   -5    6
    0.0010258759   3    1000037    5   -6
    0.0010258759   3   -1000037   -5    6
    0.00094981842   3    1000022    6   -6
    0.00077265294   3    1000025    6   -6

DECAY 1000021  427.5355
    0.10160298   2    1000004   -4
    0.10160298   2   -1000004    4
    0.10160263   2    1000002   -2
    0.10160263   2   -1000002    2
    0.10149309   2    1000003   -3
    0.10149309   2   -1000003    3
    0.10149273   2    1000001   -1
    0.10149273   2   -1000001    1
    0.087872464   2    1000005   -5
    0.087872464   2   -1000005    5
    0.0031786621   2    2000005   -5
    0.0031786621   2   -2000005    5
    0.0023525079   2    1000006   -6
    0.0023525079   2   -1000006    6
    0.00020318485   3    1000023    6   -6
    0.00012385309   3    1000022    6   -6
    0.00011782999   3    1000024    5   -6
    0.00011782999   3   -1000024   -5    6

DECAY 25  0.0036533795
    0.62284409   2   -5    5
    0.17984438   2   -24    24
    0.072090305   2    21    21
    0.071118947   2   -15    15
    0.029529627   2   -4    4
    0.020589938   2    23    23
    0.0022702579   2    22    22
    0.0012304735   2    22    23
    0.00024616668   2   -13    13
    0.00023501226   2   -3    3
    6.4978943e-07   2   -1    1
    1.5218172e-07   2   -2    2
    5.5341379e-09   2   -11    11

DECAY 35  42.524302
    0.87796886   2   -5    5
    0.12069534   2   -15    15
    0.00049576415   2   -6    6
    0.00039161291   2   -3    3
    0.00038450746   2   -13    13
    4.2490463e-05   2    21    21
    1.6498621e-05   2    25    25
    1.9639275e-06   2   -24    24
    1.734083e-06   2    23    23
    1.0829665e-06   2   -1    1
    7.1187774e-08   2    22    23
    5.3840436e-08   2    22    22
    1.0689597e-08   2   -4    4
    8.6383522e-09   2   -11    11
    5.5143907e-14   2   -2    2

DECAY 36  40.701331
    0.87792025   2   -5    5
    0.12069167   2   -15    15
    0.00054510642   2   -6    6
    0.00039160528   2   -3    3
    0.00038448199   2   -13    13
    6.321496e-05   2    21    21
    2.527178e-06   2    23    25
    1.0829456e-06   2   -1    1
    2.1516336e-08   2    22    22
    1.6525807e-08   2    22    23
    1.0677073e-08   2   -4    4
    8.6377898e-09   2   -11    11
    5.5058093e-14   2   -2    2
    4.3440766e-36   2    25    25

DECAY 37  38.503811
    0.87859649   2   -5    6
    0.11922472   2   -15    16
    0.0013375998   2   -5    4
    0.00042150362   2   -13    14
    0.00038688732   2   -3    4
    1.7907674e-05   2   -3    2
    9.551863e-06   2   -5    2
    2.7066611e-06   2    24    25
    1.4587947e-06   2   -3    6
    1.0738263e-06   2   -1    2
    4.9957136e-08   2   -1    4
    4.1927173e-08   2   -1    6
    9.8590137e-09   2   -11    12
    1.6439156e-11   2    24    35
    1.3226291e-11   2    24    36

DECAY 6  2.43
    1   2    5    24

DECAY 15 -1
