BLOCK SPINFO
   1   SPheno
   2   v4.0.5be

BLOCK SPHENOINFO
   1   2
   2   2

BLOCK MODSEL
   1   0

BLOCK MINPAR
   3    56.814298
   4   -1

BLOCK EXTPAR
   0    4059.4315
   1   -1889.7725
   2   -458.76341
   3    4000
   11    4573.2476
   12   -44.435357
   13    1386.0646
   23   -579.72471
   25    57.27838
   26    2000
   31    456.49907
   32    456.49907
   33    1613.3818
   34    1937.7108
   35    1937.7108
   36    1179.9818
   41    4000
   42    4000
   43    4000
   44    4000
   45    4000
   46    4000
   47    4000
   48    4000
   49    4000

BLOCK SMINPUTS
   1    127.90897
   2    1.1663787e-05
   3    0.1184
   4    91.1876
   5    4.18
   6    173.2
   7    1.777
   8    0
   11    0.00051099893
   12    0
   13    0.10565837
   14    0
   21    0.005
   22    0.0025
   23    0.095
   24    1.27

BLOCK GAUGE Q=  4059.4315
   1    0.35536298
   2    0.66519887
   3    1.219778

BLOCK YU Q=  4059.4315
   1   1    8.3856498e-06
   2   2    0.0042599101
   3   3    1.0130538

BLOCK YD Q=  4059.4315
   1   1    0.00096517864
   2   2    0.018338394
   3   3    0.95715476

BLOCK YE Q=  4059.4315
   1   1    0.00016843073
   2   2    0.034826133
   3   3    0.58571827

BLOCK AU Q=  4059.4315
   1   1    0
   2   2    0
   3   3    4573.2476

BLOCK AD Q=  4059.4315
   1   1    0
   2   2    0
   3   3   -44.435357

BLOCK AE Q=  4059.4315
   1   1    0
   2   2    0
   3   3    1386.0646

BLOCK MSOFT Q=  4059.4315
   1   -1889.7725
   2   -458.76341
   3    4000
   21    4318301.7
   22    43136.444
   31    456.49907
   32    456.49907
   33    1613.3818
   34    1937.7108
   35    1937.7108
   36    1179.9818
   41    4000
   42    4000
   43    4000
   44    4000
   45    4000
   46    4000
   47    4000
   48    4000
   49    4000

BLOCK MASS
   6    173.2
   23    91.1876
   24    80.429995
   15    1.777
   25    125.05613
   35    1997.1754
   36    2000
   37    1999.5089
   1000001    4154.9563
   2000001    4143.0991
   1000002    4154.1889
   2000002    4145.5584
   1000003    4154.9474
   2000003    4143.0733
   1000004    4154.1771
   2000004    4145.5575
   1000005    4063.6651
   2000005    4085.7856
   1000006    3988.3087
   2000006    4131.8226
   1000011    479.76555
   2000011    1948.3526
   1000012    472.60914
   1000013    479.59301
   2000013    1948.2551
   1000014    472.46774
   1000015    1145.8715
   2000015    1603.4055
   1000016    1598.5277
   1000021    4249.2261
   1000022   -457.35525
   1000023    574.59573
   1000025   -600.49055
   1000035   -1858.6831
   1000024    458.035
   1000037    603.48265
   1000039    1e-09

BLOCK ALPHA
      -0.017724442

BLOCK HMIX Q=  4059.4315
   1   -579.72471
   2    57.27838
   3    242.92013
   4    4000000

BLOCK STOPMIX
   1   1   -0.65290356
   1   2    0.75744104
   2   1   -0.75744104
   2   2   -0.65290356

BLOCK SBOTMIX
   1   1   -0.82705765
   1   2    0.56211711
   2   1   -0.56211711
   2   2   -0.82705765

BLOCK STAUMIX
   1   1   -0.04831601
   1   2    0.9988321
   2   1   -0.9988321
   2   2   -0.04831601

BLOCK NMIX
   1   1   -0.0091251255
   1   2    0.8938199
   1   3    0.34935769
   1   4   -0.28098385
   2   1    0.012598659
   2   2   -0.05240968
   2   3    0.70398583
   2   4    0.70816556
   3   1   -0.023090906
   3   2   -0.44535049
   3   3    0.61828733
   3   4   -0.64718663
   4   1    0.99961233
   4   2   -0.001467605
   4   3    0.0085988039
   4   4   -0.026440325

BLOCK UMIX
   1   1   -0.87507743
   1   2   -0.48398295
   2   1   -0.48398295
   2   2    0.87507743

BLOCK VMIX
   1   1    0.92085183
   1   2    0.38991269
   2   1    0.38991269
   2   2   -0.92085183

BLOCK HIGGSBOUNDSINPUTHIGGSCOUPLINGSFERMIONS
       0, 3280.8129,3,36,15,15

BLOCK HIGGSBOUNDSINPUTHIGGSCOUPLINGSBOSONS
       0,4,36,21,21,23

BLOCK SPHENOLOWENERGY
   1    0.00032626159
   2    1.5893613e-06
   3    3.5249759e-05
   4    4.3928561e-15
   5    1.8763943e-10
   6    3.8231049e-08
   7    1.5328582e-13
   8    6.5476941e-09
   9    1.3500412e-06
   10    9.3031878e-05
   11    0.96098368
   12    0.54176356
   13    19.34972
   14    0
   15    0
   16    0.0021567507
   17    2.281658e-15
   18    2.4797386e-11
   19    8.2898885e-11
   20    1.8182151e-14
   21    7.7743372e-10
   22    8.9764524e-08
   23    0
   24    0
   25    0
   26    0
   27    0
   28    0
   29    0
   30    0
   31    0
   39    8.6282511e-05
   40    0
   41    0
   42    0

BLOCK FWCOEF Q=  160
   305   4422   0   0   -0.18881911
   305   4422   0   2   -0.19380764
   305   4322   0   2   -0.00010989736
   305   6421   0   0   -0.095227835
   305   6421   0   2   -0.10709502
   305   6321   0   2   -0.00025000929
   3051111   4133   0   0    1.6284586
   3051111   4133   0   2    1.6286166
   3051111   4233   0   2    0.00040612605
   3051111   4137   0   0   -4.4511507
   3051111   4137   0   2   -4.4492276
   3051111   4237   0   2   -0.0029975248
   3051313   4133   0   0    1.6284586
   3051313   4133   0   2    1.6286133
   3051313   4233   0   2    0.00040611949
   3051313   4137   0   0   -4.4511507
   3051313   4137   0   2   -4.4492308
   3051313   4237   0   2   -0.002997525
   3051212   4137   0   0    1.5053501
   3051212   4137   0   2    1.5049538
   3051212   4237   0   2    0.00064792038
   3051414   4137   0   0    1.5053501
   3051414   4137   0   2    1.5049538
   3051414   4237   0   2    0.00064792148
   3051616   4137   0   0    1.5053501
   3051616   4137   0   2    1.5049533
   3051616   4237   0   2    0.00064823262

BLOCK IMFWCOEF Q=  160
   305   4422   0   0    3.8584324e-07
   305   4422   0   2    9.9367966e-06
   305   4322   0   2    2.5406421e-06
   305   6421   0   0    3.3050025e-07
   305   6421   0   2    9.6346067e-06
   305   6321   0   2    1.1935209e-06
   3051111   4133   0   2   -5.2340171e-07
   3051111   4233   0   2    1.0041521e-05
   3051111   4137   0   2    1.0740299e-06
   3051111   4237   0   2   -7.412787e-05
   3051313   4133   0   2   -5.235882e-07
   3051313   4233   0   2    1.0041495e-05
   3051313   4137   0   2    1.0741868e-06
   3051313   4237   0   2   -7.4127966e-05
   3051212   4137   0   2    1.1741224e-07
   3051212   4237   0   2    1.602287e-05
   3051414   4137   0   2    1.174105e-07
   3051414   4237   0   2    1.602287e-05
   3051616   4137   0   2    1.0764121e-07
   3051616   4237   0   2    1.602287e-05

DECAY 23  2.4952


DECAY 24  2.085


DECAY 1000011  0.03924303
    0.64600941   2   -1000024    12
    0.35398903   2    1000022    11

DECAY 2000011  0.08544194
    0.92588581   2    1000035    11
    0.05004086   2    1000025    11
    0.015165896   2    1000023    11
    0.0085196043   2    1000022    11
    0.00037654709   2    1000039    11

DECAY 1000013  0.038671557
    0.64564586   2   -1000024    14
    0.35435257   2    1000022    13

DECAY 2000013  0.16573207
    0.47634229   2    1000035    13
    0.1775249   2   -1000037    14
    0.12499656   2    1000023    13
    0.11460711   2    1000025    13
    0.059299845   2   -1000024    14
    0.035300839   2    1000022    13
    0.011734381   2    1000013    25
    0.00019407749   2    1000039    13

DECAY 1000015  8.9583289
    0.32743672   2   -1000037    16
    0.24094034   2    1000023    15
    0.17406129   2   -1000024    16
    0.16645131   2    1000025    15
    0.091110084   2    1000022    15

DECAY 2000015  26.315913
    0.32952621   2   -1000024    16
    0.21283134   2    1000022    15
    0.16516356   2    1000025    15
    0.15797178   2    1000023    15
    0.10711827   2   -1000037    16
    0.013731232   2    1000015    25
    0.013657152   2    1000015    23

DECAY 1000012  0.019785531
    0.65749355   2    1000024    11
    0.34250508   2    1000022    12

DECAY 1000014  0.019425059
    0.65737194   2    1000024    13
    0.34262667   2    1000022    14

DECAY 1000016  26.413842
    0.46188865   2    1000024    15
    0.2923407   2    1000037    15
    0.1813572   2    1000022    16
    0.036844082   2    1000025    16
    0.02686246   2    1000015    24
    0.00070645878   2    1000023    16

DECAY 2000001  1.4778217
    0.99778745   2    1000035    1
    0.0009465797   2    1000039    1
    0.00081888533   2    1000025    1
    0.00026373802   2    1000023    1
    0.00013336085   2    1000022    1

DECAY 1000001  53.696942
    0.50900596   2   -1000024    2
    0.26650757   2    1000022    1
    0.15289403   2   -1000037    2
    0.063567647   2    1000025    1
    0.0070189168   2    1000035    1
    0.00097944833   2    1000023    1

DECAY 2000003  1.5309976
    0.96312017   2    1000035    3
    0.013282094   2   -1000037    4
    0.0088615837   2    1000023    3
    0.0074056033   2    1000025    3
    0.0041378937   2   -1000024    4
    0.0022789815   2    1000022    3
    0.00091367386   2    1000039    3

DECAY 1000003  53.72494
    0.50874336   2   -1000024    4
    0.26642965   2    1000022    3
    0.15283702   2   -1000037    4
    0.063723356   2    1000025    3
    0.0070152518   2    1000035    3
    0.0012249533   2    1000023    3

DECAY 1000005  183.95959
    0.27838734   2   -1000024    6
    0.26504351   2   -1000037    6
    0.18452182   2    1000023    5
    0.15622295   2    1000022    5
    0.11255008   2    1000025    5
    0.0032673902   2    1000035    5

DECAY 2000005  163.57771
    0.49741077   2   -1000037    6
    0.22632335   2    1000025    5
    0.22514073   2    1000023    5
    0.025423573   2   -1000024    6
    0.01765572   2    1000022    5
    0.0073158712   2    1000035    5
    0.00072200627   2    1000006   -24

DECAY 2000002  5.9135372
    0.99859645   2    1000035    2
    0.00080005757   2    1000025    2
    0.00023903307   2    1000023    2
    0.00023725779   2    1000039    2
    0.00012720343   2    1000022    2

DECAY 1000002  53.74352
    0.56305257   2    1000024    1
    0.26429589   2    1000022    2
    0.099130227   2    1000037    1
    0.065888347   2    1000025    2
    0.0067828169   2    1000035    2
    0.00082377205   2    1000023    2

DECAY 2000004  5.9164083
    0.99811092   2    1000035    4
    0.0009012797   2    1000025    4
    0.00036098199   2    1000023    4
    0.00023714231   2    1000039    4
    0.00020550894   2    1000037    3
    0.00014663777   2    1000022    4

DECAY 1000004  53.771466
    0.56287587   2    1000024    3
    0.26415995   2    1000022    4
    0.099456821   2    1000037    3
    0.065864911   2    1000025    4
    0.0067792701   2    1000035    4
    0.0008368185   2    1000023    4

DECAY 1000006  185.84913
    0.24119385   2    1000024    5
    0.23946831   2    1000037    5
    0.22077945   2    1000023    6
    0.13040185   2    1000025    6
    0.11471677   2    1000022    6
    0.02246798   3    1000022    24    5
    0.015472966   2    1000035    6
    0.015444579   2    1000022    4

DECAY 2000006  189.28366
    0.43743792   2    1000037    5
    0.24062243   2    1000025    6
    0.20366724   2    1000023    6
    0.070136819   2    1000024    5
    0.026845149   2    1000022    6
    0.016537924   2    1000035    6
    0.0045399968   2    1000006    23
    0.00020528956   2    1000006    25

DECAY 1000024  3.4441202e-08
    0.99996197   2    1000039    24

DECAY 1000037  2.0163963
    0.55892754   2    1000022    24
    0.21083203   2    1000024    23
    0.086196729   2    1000024    25
    0.041887129   2   -1000013    14
    0.041783846   2   -1000011    12
    0.030412857   2    1000014   -13
    0.029948145   2    1000012   -11

DECAY 1000022  1.760113e-08
    0.74162025   2    1000039    23
    0.22234464   2    1000039    22
    0.036035116   2    1000039    25

DECAY 1000023  1.3476733
    0.64038842   2    1000022    23
    0.17838377   2    1000024   -24
    0.17838377   2   -1000024    24
    0.00041522539   2    1000013   -13
    0.00041522539   2   -1000013    13
    0.00034427201   2    1000014   -14
    0.00034427201   2   -1000014    14
    0.00034341211   2    1000012   -12
    0.00034341211   2   -1000012    12
    0.00027440494   2    1000022    22
    0.00017956594   2    1000011   -11
    0.00017956594   2   -1000011    11

DECAY 1000025  2.9189799
    0.4182542   2    1000024   -24
    0.4182542   2   -1000024    24
    0.06129942   2    1000022    25
    0.012563634   2    1000013   -13
    0.012563634   2   -1000013    13
    0.012405292   2    1000011   -11
    0.012405292   2   -1000011    11
    0.012318831   2    1000014   -14
    0.012318831   2   -1000014    14
    0.012294874   2    1000012   -12
    0.012294874   2   -1000012    12
    0.0030099975   2    1000022    23

DECAY 1000035  17.726172
    0.10096648   2    1000015   -15
    0.10096648   2   -1000015    15
    0.062424776   2    1000037   -24
    0.062424776   2   -1000037    24
    0.057893885   2    1000014   -14
    0.057893885   2   -1000014    14
    0.057889097   2    1000012   -12
    0.057889097   2   -1000012    12
    0.057020847   2    1000013   -13
    0.057020847   2   -1000013    13
    0.057014928   2    1000011   -11
    0.057014928   2   -1000011    11
    0.056276559   2    1000023    23
    0.048778045   2    1000023    25
    0.047482943   2    1000025    25
    0.012388853   2    1000025    23
    0.0077767716   2    1000024   -24
    0.0077767716   2   -1000024    24
    0.0056288768   2    1000022    25
    0.0044848509   2    1000016   -16
    0.0044848509   2   -1000016    16
    0.0043158405   2    2000015   -15
    0.0043158405   2   -2000015    15
    0.0021573922   3    1000037    5   -6
    0.0021573922   3   -1000037   -5    6
    0.0020089438   2    1000022    23
    0.0012861959   3    1000023    6   -6
    0.0011688794   3    1000025    6   -6
    0.00027971193   3    1000024    5   -6
    0.00027971193   3   -1000024   -5    6
    0.0001637719   3    1000022    6   -6

DECAY 1000021  7.2510139
    0.15541927   2    1000006   -6
    0.15541927   2   -1000006    6
    0.064640822   2    1000005   -5
    0.064640822   2   -1000005    5
    0.048158096   2    2000005   -5
    0.048158096   2   -2000005    5
    0.028981105   3    1000025    6   -6
    0.025921036   2    1000006   -4
    0.025921036   2   -1000006    4
    0.02452433   3    1000023    6   -6
    0.022419788   3    1000037    5   -6
    0.022419788   3   -1000037   -5    6
    0.021113402   2    2000003   -3
    0.021113402   2   -2000003    3
    0.02110327   2    2000001   -1
    0.02110327   2   -2000001    1
    0.02014835   2    2000002   -2
    0.02014835   2   -2000002    2
    0.020147213   2    2000004   -4
    0.020147213   2   -2000004    4
    0.016970758   2    1000004   -4
    0.016970758   2   -1000004    4
    0.016968059   2    1000002   -2
    0.016968059   2   -1000002    2
    0.016701306   2    1000003   -3
    0.016701306   2   -1000003    3
    0.016698207   2    1000001   -1
    0.016698207   2   -1000001    1
    0.0036605496   3    1000024    5   -6
    0.0036605496   3   -1000024   -5    6
    0.0025634613   3    1000022    6   -6
    0.0013174099   2    1000023    21
    0.0012319805   3    1000035    6   -6
    0.00084855954   2    1000025    21
    0.0002189289   2    1000039    21
    0.00017384811   2    1000022    21

DECAY 25  0.0039171555
    0.57455085   2   -5    5
    0.22761398   2   -24    24
    0.071931302   2    21    21
    0.066017306   2   -15    15
    0.028044196   2   -4    4
    0.02758428   2    23    23
    0.0023219522   2    22    22
    0.001490516   2    22    23
    0.00022936077   2   -13    13
    0.00021551717   2   -3    3
    5.9588134e-07   2   -1    1
    1.4451811e-07   2   -2    2
    5.1562907e-09   2   -11    11

DECAY 35  127.82437
    0.7468044   2   -5    5
    0.11042074   2   -15    15
    0.037539264   2   -1000024    1000037
    0.037539264   2   -1000037    1000024
    0.022791277   2    1000022    1000023
    0.014377822   2   -1000024    1000024
    0.0089258979   2    1000022    1000025
    0.0071771537   2    1000022    1000022
    0.0052158926   2   -1000037    1000037
    0.0046428039   2    1000023    1000025
    0.0034556747   2    1000025    1000025
    0.0004377929   2   -13    13
    0.00026473592   2   -3    3
    0.00025986721   2   -6    6
    0.00012707124   2    1000023    1000023
    1.8154146e-05   2    21    21
    7.5149937e-07   2    25    25
    7.3183464e-07   2   -1    1
    2.3292686e-07   2    23    23
    1.2373628e-07   2   -24    24
    6.7991472e-08   2    22    23
    2.9178228e-08   2   -1000011    1000011
    2.8682156e-08   2   -1000013    1000013
    1.6689313e-08   2    22    22
    9.8338289e-09   2   -11    11
    3.5937707e-09   2   -4    4
    1.8527776e-14   2   -2    2

DECAY 36  117.80343
    0.73600139   2   -5    5
    0.10883222   2   -15    15
    0.036329532   2   -1000024    1000037
    0.036329532   2   -1000037    1000024
    0.0203909   2   -1000024    1000024
    0.017089513   2    1000022    1000023
    0.014302615   2    1000022    1000025
    0.010196368   2    1000022    1000022
    0.0098875397   2   -1000037    1000037
    0.0063605009   2    1000025    1000025
    0.0031077451   2    1000023    1000025
    0.00043149815   2   -13    13
    0.00026088767   2   -3    3
    0.00025718476   2   -6    6
    0.00019527628   2    1000023    1000023
    2.5957095e-05   2    21    21
    7.2119624e-07   2   -1    1
    3.422788e-07   2    23    25
    1.6812618e-07   2    22    23
    9.5818854e-08   2    22    22
    9.6924197e-09   2   -11    11
    3.4422495e-09   2   -4    4
    1.6750329e-12   2    23    35
    1.7748917e-14   2   -2    2
    1.2377225e-37   2    25    25

DECAY 37  126.7691
    0.7539046   2   -5    6
    0.10181694   2   -15    16
    0.048927086   2    1000022    1000037
    0.046412694   2    1000024    1000025
    0.041051832   2    1000023    1000024
    0.0061082665   2    1000023    1000037
    0.0011219636   2   -5    4
    0.00035995955   2   -13    14
    0.00024218569   2   -3    4
    3.3054794e-05   2    1000025    1000037
    1.1289115e-05   2   -3    2
    8.0119821e-06   2   -5    2
    6.7189994e-07   2   -1    2
    6.3917189e-07   2   -3    6
    3.1828266e-07   2    24    25
    2.0077592e-07   2    1000022    1000024
    1.1501156e-07   2   -1000011    1000012
    1.1431028e-07   2   -1000013    1000014
    3.1348642e-08   2   -1    4
    1.3084382e-08   2   -1    6
    8.4194914e-09   2   -11    12
    7.4244881e-13   2    24    35

DECAY 6  2.43
    1   2    5    24

DECAY 15 -1


DECAY 1000039 -1
