BLOCK SPINFO
   1   SPheno
   2   v4.0.5be

BLOCK SPHENOINFO
   1   2
   2   2

BLOCK MODSEL
   1   0

BLOCK MINPAR
   3    28.507937
   4    1

BLOCK EXTPAR
   0    3064.6109
   1    4569.0248
   2   -2940.0813
   3    4223.7077
   11    4628.5306
   12   -2203.2818
   13   -5988.3744
   23    509.94414
   25    27.385966
   26    3850.0298
   31    743.47852
   32    743.47852
   33    4898.5862
   34    3047.9531
   35    3047.9531
   36    3500.0856
   41    3061.9884
   42    3061.9884
   43    1917.5392
   44    2125.7544
   45    2125.7544
   46    4553.8919
   47    2587.9388
   48    2587.9388
   49    4551.2393

BLOCK SMINPUTS
   1    127.90897
   2    1.1663787e-05
   3    0.1184
   4    91.1876
   5    4.18
   6    173.2
   7    1.777
   8    0
   11    0.00051099893
   12    0
   13    0.10565837
   14    0
   21    0.005
   22    0.0025
   23    0.095
   24    1.27

BLOCK GAUGE Q=  3064.6109
   1    0.35536298
   2    0.66519887
   3    1.219778

BLOCK YU Q=  3064.6109
   1   1    8.3899599e-06
   2   2    0.0042620996
   3   3    1.0135745

BLOCK YD Q=  3064.6109
   1   1    0.00046170884
   2   2    0.008772468
   3   3    0.45787049

BLOCK YE Q=  3064.6109
   1   1    8.0571569e-05
   2   2    0.016659645
   3   3    0.28018783

BLOCK AU Q=  3064.6109
   1   1    0
   2   2    0
   3   3    4628.5305

BLOCK AD Q=  3064.6109
   1   1    0
   2   2    0
   3   3   -2203.2818

BLOCK AE Q=  3064.6109
   1   1    0
   2   2    0
   3   3   -5988.3744

BLOCK MSOFT Q=  3064.6109
   1    4569.0248
   2   -2940.0813
   3    4223.7077
   21    14470076
   22   -249543.84
   31    743.47852
   32    743.47852
   33    4898.5862
   34    3047.9531
   35    3047.9531
   36    3500.0856
   41    3061.9884
   42    3061.9884
   43    1917.5392
   44    2125.7544
   45    2125.7544
   46    4553.8919
   47    2587.9388
   48    2587.9388
   49    4551.2393

BLOCK MASS
   6    173.2
   23    91.1876
   24    80.429995
   15    1.777
   25    123.65829
   35    3849.7446
   36    3850.0298
   37    3851.0663
   1000001    3203.5186
   2000001    2706.2861
   1000002    3202.5068
   2000002    2253.7415
   1000003    3203.5167
   2000003    2706.2827
   1000004    3202.5049
   2000004    2253.7409
   1000005    2048.4537
   2000005    4637.5324
   1000006    2045.7421
   2000006    4590.9207
   1000011    805.66345
   2000011    3054.6781
   1000012    801.38713
   1000013    805.64535
   2000013    3054.6634
   1000014    801.36914
   1000015    3506.699
   2000015    4911.9228
   1000016    4911.2744
   1000021    4242.4899
   1000022   -522.94631
   1000023    524.9136
   1000025   -2945.1396
   1000035    4520.1056
   1000024    524.25242
   1000037    2945.3435

BLOCK ALPHA
      -0.035116534

BLOCK HMIX Q=  3064.6109
   1    509.94414
   2    27.385966
   3    243.23961
   4    14822730

BLOCK STOPMIX
   1   1   -0.99924563
   1   2    0.038835138
   2   1   -0.038835138
   2   2   -0.99924563

BLOCK SBOTMIX
   1   1    0.99999819
   1   2    0.0019026822
   2   1   -0.0019026822
   2   2    0.99999819

BLOCK STAUMIX
   1   1    0.0029413893
   1   2    0.99999567
   2   1   -0.99999567
   2   2    0.0029413893

BLOCK NMIX
   1   1   -0.0057737593
   1   2   -0.022297998
   1   3    0.70772687
   1   4    0.70611057
   2   1    0.0078456026
   2   2    0.016845591
   2   3    0.70647399
   2   4   -0.707495
   3   1    0.00015511872
   3   2   -0.99960943
   3   3   -0.0038812824
   3   4   -0.027674853
   4   1    0.99995254
   4   2   -0.00010585398
   4   3   -0.0014559366
   4   4    0.0096323871

BLOCK UMIX
   1   1   -0.0054943567
   1   2    0.99998491
   2   1   -0.99998491
   2   2   -0.0054943567

BLOCK VMIX
   1   1    0.039154018
   1   2    0.99923319
   2   1    0.99923319
   2   2   -0.039154018

BLOCK HIGGSBOUNDSINPUTHIGGSCOUPLINGSFERMIONS
       0, 749.99112,3,36,15,15

BLOCK HIGGSBOUNDSINPUTHIGGSCOUPLINGSBOSONS
       0,4,36,21,21,23

BLOCK SPHENOLOWENERGY
   1    0.00032909447
   2    1.5897138e-06
   3    3.5261876e-05
   4    2.5861428e-15
   5    1.1047721e-10
   6    2.313365e-08
   7    8.6716867e-14
   8    3.7045464e-09
   9    7.8599843e-07
   10    9.6463305e-05
   11    0.99642901
   12    0.54193816
   13    19.362272
   14    0
   15    0
   16    0.0021571609
   17    2.281657e-15
   18    2.480423e-11
   19    8.2916756e-11
   20   -1.4779595e-15
   21   -6.3186655e-11
   22   -8.6593679e-09
   23    0
   24    0
   25    0
   26    0
   27    0
   28    0
   29    0
   30    0
   31    0
   39    6.4955836e-05
   40    0
   41    0
   42    0

BLOCK FWCOEF Q=  160
   305   4422   0   0   -0.18881911
   305   4422   0   2   -0.19872695
   305   4322   0   2   -0.00017525897
   305   6421   0   0   -0.095227835
   305   6421   0   2   -0.1037833
   305   6321   0   2   -0.00015894868
   3051111   4133   0   0    1.6172633
   3051111   4133   0   2    1.6176463
   3051111   4233   0   2    0.0002031758
   3051111   4137   0   0   -4.4399554
   3051111   4137   0   2   -4.4392554
   3051111   4237   0   2   -0.0015244186
   3051313   4133   0   0    1.6172633
   3051313   4133   0   2    1.6176458
   3051313   4233   0   2    0.00020317564
   3051313   4137   0   0   -4.4399554
   3051313   4137   0   2   -4.4392559
   3051313   4237   0   2   -0.0015244192
   3051212   4137   0   0    1.5053501
   3051212   4137   0   2    1.5051994
   3051212   4237   0   2    0.00033033616
   3051414   4137   0   0    1.5053501
   3051414   4137   0   2    1.5051994
   3051414   4237   0   2    0.00033033616
   3051616   4137   0   0    1.5053501
   3051616   4137   0   2    1.5052003
   3051616   4237   0   2    0.00033033815

BLOCK IMFWCOEF Q=  160
   305   4422   0   0    3.8580107e-07
   305   4422   0   2   -7.2524438e-06
   305   4322   0   2   -1.6017516e-06
   305   6421   0   0    3.3046413e-07
   305   6421   0   2   -9.1807677e-06
   305   6321   0   2   -8.0901958e-07
   3051111   4133   0   2    5.3905363e-07
   3051111   4233   0   2    3.8697155e-06
   3051111   4137   0   2   -2.6361717e-06
   3051111   4237   0   2   -2.9034906e-05
   3051313   4133   0   2    5.3905326e-07
   3051313   4233   0   2    3.8697132e-06
   3051313   4137   0   2   -2.6361791e-06
   3051313   4237   0   2   -2.9034917e-05
   3051212   4137   0   2    5.8783798e-07
   3051212   4237   0   2    6.2917625e-06
   3051414   4137   0   2    5.8783621e-07
   3051414   4237   0   2    6.2917625e-06
   3051616   4137   0   2    6.0458056e-07
   3051616   4237   0   2    6.2917644e-06

DECAY 23  2.4952


DECAY 24  2.085


DECAY 1000011  0.0013560816
    0.56419965   2    1000022    11
    0.38331185   2    1000023    11
    0.052486862   2   -1000024    12

DECAY 2000011  0.0013726557
    0.64836089   2    1000023    11
    0.35136334   2    1000022    11
    0.00027071756   2   -1000024    12

DECAY 1000013  0.0028372581
    0.53243818   2    1000022    13
    0.4424769   2    1000023    13
    0.025084139   2   -1000024    14

DECAY 2000013  0.033365366
    0.47615422   2   -1000024    14
    0.26428795   2    1000023    13
    0.25302501   2    1000022    13
    0.006532656   2    1000013    25

DECAY 1000015  10.471678
    0.49991235   2   -1000024    16
    0.25056379   2    1000022    15
    0.2495237   2    1000023    15

DECAY 2000015  34.342911
    0.51641206   2   -1000037    16
    0.25801152   2    1000025    15
    0.10972977   2    1000022    15
    0.10925037   2    1000023    15
    0.004213084   2    1000035    15
    0.0011895446   2    1000015    23
    0.0011713641   2    1000015    25

DECAY 1000012  0.0041525518
    0.85227669   2    1000024    11
    0.10337991   2    1000022    12
    0.044343398   2    1000023    12

DECAY 1000014  0.0056013329
    0.89049501   2    1000024    13
    0.076633941   2    1000022    14
    0.032871051   2    1000023    14

DECAY 1000016  34.359301
    0.51516742   2    1000037    15
    0.25786016   2    1000025    16
    0.22006671   2    1000024    15
    0.0042017233   2    1000035    16
    0.0023785042   2    1000015    24
    0.00022701973   2    1000022    16

DECAY 2000001  0.00015407627
    0.59347084   2    1000023    1
    0.33752595   2    1000022    1
    0.069003208   2   -1000024    2

DECAY 1000001  1.0224825
    0.65993435   2   -1000037    2
    0.33023686   2    1000025    1
    0.0059170593   2    1000022    1
    0.003123077   2    1000023    1
    0.00078860893   2   -1000024    2

DECAY 2000003  0.0078093381
    0.49147013   2   -1000024    4
    0.25628082   2    1000023    3
    0.25224905   2    1000022    3

DECAY 1000003  1.028204
    0.65624435   2   -1000037    4
    0.32839469   2    1000025    3
    0.0081412496   2    1000022    3
    0.0053542034   2    1000023    3
    0.0018487738   2   -1000024    4

DECAY 1000005  43.362501
    0.82778565   2   -1000024    6
    0.086326592   2    1000022    5
    0.085887762   2    1000023    5

DECAY 2000005  47.709962
    0.39399162   2   -1000024    6
    0.2041083   2    1000021    5
    0.1979097   2    1000022    5
    0.19720696   2    1000023    5
    0.0026817583   2    1000006   -24
    0.0026116465   2    1000005    25
    0.0013396782   2    1000005    23
    0.00013561946   2    1000035    5

DECAY 2000002  0.00042730554
    0.64848319   2    1000023    2
    0.35151022   2    1000022    2

DECAY 1000002  1.0567471
    0.63298001   2    1000037    1
    0.31719234   2    1000025    2
    0.038747849   2    1000024    1
    0.006875964   2    1000022    2
    0.0042038346   2    1000023    2

DECAY 2000004  0.0018827663
    0.3864563   2    1000024    3
    0.34075362   2    1000023    4
    0.27279008   2    1000022    4

DECAY 1000004  1.0624548
    0.62957082   2    1000037    3
    0.3154782   2    1000025    4
    0.042898824   2    1000024    3
    0.0073541191   2    1000022    4
    0.0046980357   2    1000023    4

DECAY 1000006  44.079042
    0.40980283   2    1000023    6
    0.40893141   2    1000022    6
    0.17221631   2    1000024    5
    0.0089080969   3    1000022    24    5

DECAY 2000006  302.93902
    0.30027902   2    1000024    5
    0.16809709   2    1000005    24
    0.15036037   2    1000023    6
    0.14975395   2    1000022    6
    0.1240656   2    1000006    25
    0.084046764   2    1000006    23
    0.022728723   2    1000021    6
    0.00044739377   2    1000037    5
    0.00022108423   2    1000025    6

DECAY 1000024  8.8796625e-12
    0.60381092   3    1000022   -1    2
    0.20129174   3    1000022   -11    12
    0.19489733   3    1000022   -13    14

DECAY 1000037  90.684622
    0.12238701   2    1000014   -13
    0.12238613   2    1000012   -11
    0.12236159   2   -1000013    14
    0.1223607   2   -1000011    12
    0.11401309   2    1000006   -5
    0.11020101   2   -1000005    6
    0.069303832   2    1000024    25
    0.068086775   2    1000023    24
    0.067900297   2    1000024    23
    0.067859934   2    1000022    24
    0.0056025216   3    1000024    6   -6
    0.0038619899   3    1000022   -5    6
    0.0036429002   3    1000023   -5    6

DECAY 1000022 -1


DECAY 1000023  1.6944402e-09
    0.95844697   2    1000022    22
    0.012226859   3    1000022    12   -12
    0.009142286   3    1000022    1   -1
    0.008898457   3    1000022    3   -3
    0.0071305628   3    1000022    2   -2
    0.002063269   3    1000022    11   -11
    0.001977349   3    1000022    13   -13

DECAY 1000025  93.74173
    0.065856498   2    1000024   -24
    0.065856498   2   -1000024    24
    0.059246855   2    1000014   -14
    0.059246855   2   -1000014    14
    0.059246429   2    1000012   -12
    0.059246429   2   -1000012    12
    0.059125904   2    1000013   -13
    0.059125904   2   -1000013    13
    0.059125475   2    1000011   -11
    0.059125475   2   -1000011    11
    0.056126921   2    1000006   -6
    0.056126921   2   -1000006    6
    0.055234786   2    1000005   -5
    0.055234786   2   -1000005    5
    0.049541567   2    1000023    25
    0.042809203   2    1000022    25
    0.041975472   2    1000023    23
    0.023778992   2    1000022    23
    0.0041489948   3    1000024    5   -6
    0.0041489948   3   -1000024   -5    6
    0.0028989253   3    1000023    6   -6
    0.0027342206   3    1000022    6   -6

DECAY 1000035  96.389831
    0.08867991   2    2000004   -4
    0.08867991   2   -2000004    4
    0.088679899   2    2000002   -2
    0.088679899   2   -2000002    2
    0.034772226   2    2000013   -13
    0.034772226   2   -2000013    13
    0.034771661   2    2000011   -11
    0.034771661   2   -2000011    11
    0.029689971   2    1000024   -24
    0.029689971   2   -1000024    24
    0.027639058   2    1000014   -14
    0.027639058   2   -1000014    14
    0.027638977   2    1000012   -12
    0.027638977   2   -1000012    12
    0.027597982   2    1000013   -13
    0.027597982   2   -1000013    13
    0.0275979   2    1000011   -11
    0.0275979   2   -1000011    11
    0.019378763   2    1000023    25
    0.019206966   2    1000022    23
    0.018672443   2    1000015   -15
    0.018672443   2   -1000015    15
    0.016765574   2    1000022    25
    0.01616097   2    2000003   -3
    0.01616097   2   -2000003    3
    0.016160923   2    2000001   -1
    0.016160923   2   -2000001    1
    0.010480629   2    1000023    23
    0.0069089915   2    1000006   -6
    0.0069089915   2   -1000006    6
    0.0062056926   2    1000005   -5
    0.0062056926   2   -1000005    5
    0.0024346339   2    1000003   -3
    0.0024346339   2   -1000003    3
    0.002434628   2    1000001   -1
    0.002434628   2   -1000001    1
    0.0024319514   2    1000004   -4
    0.0024319514   2   -1000004    4
    0.0024319432   2    1000002   -2
    0.0024319432   2   -1000002    2
    0.0018665089   3    1000024    5   -6
    0.0018665089   3   -1000024   -5    6
    0.0014922807   3    1000023    6   -6
    0.0014385213   3    1000022    6   -6
    0.0014061938   2    1000022    35
    0.0013541548   2    37   -1000024
    0.0013541548   2   -37    1000024
    0.0012128319   2    1000023    35
    0.00014978642   2    1000023    36
    0.00013242632   2    1000022    36

DECAY 1000021  493.8821
    0.075401539   2    1000006   -6
    0.075401539   2   -1000006    6
    0.074763663   2    1000005   -5
    0.074763663   2   -1000005    5
    0.065502638   2    2000004   -4
    0.065502638   2   -2000004    4
    0.065502616   2    2000002   -2
    0.065502616   2   -2000002    2
    0.044718971   2    2000003   -3
    0.044718971   2   -2000003    3
    0.044718813   2    2000001   -1
    0.044718813   2   -2000001    1
    0.035036064   2    1000006   -4
    0.035036064   2   -1000006    4
    0.023526575   2    1000004   -4
    0.023526575   2   -1000004    4
    0.023526515   2    1000002   -2
    0.023526515   2   -1000002    2
    0.023487213   2    1000003   -3
    0.023487213   2   -1000003    3
    0.023487139   2    1000001   -1
    0.023487139   2   -1000001    1
    0.00015848509   3    1000024    5   -6
    0.00015848509   3   -1000024   -5    6
    0.0001308454   3    1000023    6   -6
    0.00013038637   3    1000022    6   -6

DECAY 25  0.0037059042
    0.59289246   2   -5    5
    0.20730907   2   -24    24
    0.073657326   2    21    21
    0.068148734   2   -15    15
    0.029372737   2   -4    4
    0.02443025   2    23    23
    0.0023430204   2    22    22
    0.0013864249   2    22    23
    0.00023634155   2   -13    13
    0.00022285753   2   -3    3
    6.1617889e-07   2   -1    1
    1.5136895e-07   2   -2    2
    5.3132378e-09   2   -11    11

DECAY 35  40.482311
    0.68969157   2   -5    5
    0.15078315   2   -15    15
    0.051216602   2   -1000024    1000037
    0.051216602   2   -1000037    1000024
    0.03719055   2    1000023    1000025
    0.014046834   2    1000022    1000025
    0.0037846427   2   -6    6
    0.0011018968   2   -1000024    1000024
    0.00048169245   2   -13    13
    0.00027351897   2   -3    3
    0.00014112461   2    1000022    1000022
    5.3785042e-05   2    1000023    1000023
    6.335653e-06   2    25    25
    5.4016573e-06   2    1000022    1000023
    3.009657e-06   2    21    21
    7.5622159e-07   2   -1    1
    6.3779308e-07   2    23    23
    1.9563733e-07   2   -1000011    1000011
    1.9484449e-07   2   -1000013    1000013
    1.4090398e-07   2   -24    24
    5.0252958e-08   2   -4    4
    1.0817635e-08   2   -11    11
    1.0791536e-08   2    22    23
    5.8223401e-09   2    22    22
    8.0931209e-10   2   -2000013    1000013
    8.0931209e-10   2   -1000013    2000013
    2.5908469e-13   2   -2    2
    1.8929876e-14   2   -2000011    1000011
    1.8929876e-14   2   -1000011    2000011

DECAY 36  39.198439
    0.68551645   2   -5    5
    0.14987118   2   -15    15
    0.052911273   2   -1000024    1000037
    0.052911273   2   -1000037    1000024
    0.03858813   2    1000022    1000025
    0.014392845   2    1000023    1000025
    0.0036266576   2   -6    6
    0.0012002456   2   -1000024    1000024
    0.00047878154   2   -13    13
    0.00027186238   2   -3    3
    0.0001362174   2    1000022    1000022
    6.8784254e-05   2    1000023    1000023
    1.3625826e-05   2    21    21
    1.0496462e-05   2    1000022    1000023
    1.3336407e-06   2    23    25
    7.5164726e-07   2   -1    1
    4.7694023e-08   2   -4    4
    2.394312e-08   2    22    23
    1.0752256e-08   2   -11    11
    9.6823679e-09   2    22    22
    8.3498566e-10   2   -2000013    1000013
    8.3498566e-10   2   -1000013    2000013
    2.4590748e-13   2   -2    2
    1.9530381e-14   2   -2000011    1000011
    1.9530381e-14   2   -1000011    2000011
    8.5702474e-39   2    25    25

DECAY 37  40.267662
    0.68720153   2   -5    6
    0.15543595   2   -15    16
    0.051878281   2    1000022    1000037
    0.05167369   2    1000024    1000025
    0.051557718   2    1000023    1000037
    0.0010127488   2   -5    4
    0.00054952144   2   -13    14
    0.00025904033   2    1000023    1000024
    0.00025437779   2   -3    4
    0.00014724826   2    1000022    1000024
    1.1945061e-05   2   -3    2
    7.2320703e-06   2   -5    2
    6.8219933e-06   2   -3    6
    1.2997698e-06   2    24    25
    7.7241424e-07   2   -1000011    1000012
    7.7129648e-07   2   -1000013    1000014
    7.0576026e-07   2   -1    2
    2.9552372e-07   2   -1    6
    3.5745459e-08   2   -1    4
    1.2853364e-08   2   -11    12
    1.7030728e-09   2   -2000013    1000014
    1.3633915e-13   2    24    35
    4.0439584e-14   2    24    36
    3.9835149e-14   2   -2000011    1000012

DECAY 6  2.43
    1   2    5    24

DECAY 15 -1
