# SUSY Les Houches Accord 2 - MSSM spectrum + Decays
# SPheno v4.0.5be
# W. Porod, Comput. Phys. Commun. 153 (2003) 275-315, hep-ph/0301101;
# W. Porod, F.~Staub, Comput. Phys. Commun. 183 (2012) 2458
#                     arXiv:1104.1573 [hep-ph] 
# in case of problems send email to porod@physik.uni-wuerzburg.de
# Created: 07.09.2021,  16:17
Block SPINFO         # Program information
     1   SPheno      # spectrum calculator
     2   v4.0.5be    # version number
#
Block SPhenoINFO     # SPheno specific information
    1      2         # using 2-loop RGEs
    2      2         # using pole masses for boundary conditions at mZ
Block MODSEL  # Model selection
    1    0    # general MSSM
Block MINPAR  # Input parameters
    3    5.82956816E+01  # tanb at m_Z    
    4    1.00000000E+00  # Sign(mu)
Block EXTPAR  # non-universal input parameters
    0    3.79350696E+03  # scale for input parameters
    1    2.24637712E+02  # M_1
    2   -6.28177796E+02  # M_2
    3    3.42299750E+03  # M_3
   11   -2.55902872E+03  # A_t
   12    1.32946255E+03  # A_b
   13   -3.62671230E+02  # A_tau
   23    2.26761133E+02  # mu
   25    5.82714408E+01  # tan(beta)
   26    1.93017330E+03  # m_A, pole mass
   31    1.00000000E+04  # M_L11
   32    1.00000000E+04  # M_L22
   33    1.00000000E+04  # M_L33
   34    1.00000000E+04  # M_E11
   35    1.00000000E+04  # M_E22
   36    1.00000000E+04  # M_E33
   41    1.00000000E+04  # M_Q11
   42    1.00000000E+04  # M_Q22
   43    3.98671783E+03  # M_Q33
   44    1.00000000E+04  # M_U11
   45    1.00000000E+04  # M_U22
   46    3.47929025E+03  # M_U33
   47    1.00000000E+04  # M_D11
   48    1.00000000E+04  # M_D22
   49    3.22154911E+03  # M_D33
Block SMINPUTS  # SM parameters
         1     1.27908970E+02  # alpha_em^-1(MZ)^MSbar
         2     1.16637870E-05  # G_mu [GeV^-2]
         3     1.18400000E-01  # alpha_s(MZ)^MSbar
         4     9.11876000E+01  # m_Z(pole)
         5     4.18000000E+00  # m_b(m_b), MSbar
         6     1.73200000E+02  # m_t(pole)
         7     1.77700000E+00  # m_tau(pole)
         8     0.00000000E+00  # m_nu_3
        11     5.10998930E-04  # m_e(pole)
        12     0.00000000E+00  # m_nu_1
        13     1.05658372E-01  # m_muon(pole)
        14     0.00000000E+00  # m_nu_2
        21     5.00000000E-03  # m_d(2 GeV), MSbar
        22     2.50000000E-03  # m_u(2 GeV), MSbar
        23     9.50000000E-02  # m_s(2 GeV), MSbar
        24     1.27000000E+00  # m_c(m_c), MSbar
Block gauge Q=  3.79350696E+03  # (SUSY scale)
   1    3.55362975E-01  # g'(Q)^DRbar
   2    6.65198874E-01  # g(Q)^DRbar
   3    1.21977796E+00  # g3(Q)^DRbar
Block Yu Q=  3.79350696E+03  # (SUSY scale)
  1  1     8.38560665E-06   # Y_u(Q)^DRbar
  2  2     4.25988818E-03   # Y_c(Q)^DRbar
  3  3     1.01304864E+00   # Y_t(Q)^DRbar
Block Yd Q=  3.79350696E+03  # (SUSY scale)
  1  1     9.81907304E-04   # Y_d(Q)^DRbar
  2  2     1.86562388E-02   # Y_s(Q)^DRbar
  3  3     9.73744361E-01   # Y_b(Q)^DRbar
Block Ye Q=  3.79350696E+03  # (SUSY scale)
  1  1     1.71350005E-04   # Y_e(Q)^DRbar
  2  2     3.54297465E-02   # Y_mu(Q)^DRbar
  3  3     5.95870051E-01   # Y_tau(Q)^DRbar
Block Au Q=  3.79350696E+03  # (SUSY scale)
  1  1     0.00000000E+00   # A_u(Q)^DRbar
  2  2     0.00000000E+00   # A_c(Q)^DRbar
  3  3    -2.55902951E+03   # A_t(Q)^DRbar
Block Ad Q=  3.79350696E+03  # (SUSY scale)
  1  1     0.00000000E+00   # A_d(Q)^DRbar
  2  2     0.00000000E+00   # A_s(Q)^DRbar
  3  3     1.32946233E+03   # A_b(Q)^DRbar
Block Ae Q=  3.79350696E+03  # (SUSY scale)
  1  1     0.00000000E+00   # A_e(Q)^DRbar
  2  2     0.00000000E+00   # A_mu(Q)^DRbar
  3  3    -3.62671185E+02   # A_tau(Q)^DRbar
Block MSOFT Q=  3.79350696E+03  # soft SUSY breaking masses at Q
   1    2.24637712E+02  # M_1
   2   -6.28177796E+02  # M_2
   3    3.42299750E+03  # M_3
  21    3.67645112E+06  # M^2_(H,d)
  22    2.69120581E+05  # M^2_(H,u)
  31    1.00000000E+04  # M_(L,11)
  32    1.00000000E+04  # M_(L,22)
  33    1.00000000E+04  # M_(L,33)
  34    1.00000000E+04  # M_(E,11)
  35    1.00000000E+04  # M_(E,22)
  36    1.00000000E+04  # M_(E,33)
  41    1.00000000E+04  # M_(Q,11)
  42    1.00000000E+04  # M_(Q,22)
  43    3.98671783E+03  # M_(Q,33)
  44    1.00000000E+04  # M_(U,11)
  45    1.00000000E+04  # M_(U,22)
  46    3.47929025E+03  # M_(U,33)
  47    1.00000000E+04  # M_(D,11)
  48    1.00000000E+04  # M_(D,22)
  49    3.22154911E+03  # M_(D,33)
Block MASS  # Mass spectrum
#   PDG code      mass          particle
         6     1.73200000E+02  # m_t(pole)
        23     9.11876000E+01  # m_Z(pole)
        24     8.04299946E+01  # W+
        15     1.77700000E+00  # m_tau(pole)
        25     1.23956757E+02  # h0
        35     1.92860516E+03  # H0
        36     1.93017330E+03  # A0
        37     1.92854772E+03  # H+
   1000001     1.01053633E+04  # ~d_L
   2000001     1.00805773E+04  # ~d_R
   1000002     1.01049957E+04  # ~u_L
   2000002     1.00836265E+04  # ~u_R
   1000003     1.01053702E+04  # ~s_L
   2000003     1.00805900E+04  # ~s_R
   1000004     1.01050026E+04  # ~c_L
   2000004     1.00836273E+04  # ~c_R
   1000005     3.30861646E+03  # ~b_1
   2000005     4.05029967E+03  # ~b_2
   1000006     3.54694032E+03  # ~t_1
   2000006     4.05721376E+03  # ~t_2
   1000011     1.00212731E+04  # ~e_L-
   2000011     1.00090032E+04  # ~e_R-
   1000012     1.00205023E+04  # ~nu_eL
   1000013     1.00213080E+04  # ~mu_L-
   2000013     1.00090701E+04  # ~mu_R-
   1000014     1.00205369E+04  # ~nu_muL
   1000015     1.00277933E+04  # ~tau_1-
   2000015     1.00315543E+04  # ~tau_2-
   1000016     1.00303476E+04  # ~nu_tauL
   1000021     3.89724068E+03  # ~g
   1000022     2.04160208E+02  # ~chi_10
   1000023     2.39089665E+02  # ~chi_20
   1000025     2.71226112E+02  # ~chi_30
   1000035     6.91804353E+02  # ~chi_40
   1000024     2.40701944E+02  # ~chi_1+
   1000037     6.92009590E+02  # ~chi_2+
# Higgs mixing
Block alpha # Effective Higgs mixing angle
          -1.72413383E-02   # alpha
Block Hmix Q=  3.79350696E+03  # Higgs mixing parameters
   1    2.26761133E+02  # mu
   2    5.82714408E+01  # tan[beta](Q)
   3    2.43003226E+02  # v(Q)
   4    3.72556897E+06  # m^2_A(Q)
Block stopmix # stop mixing matrix
   1  1     9.96931352E-02   # Re[R_st(1,1)]
   1  2     9.95018230E-01   # Re[R_st(1,2)]
   2  1    -9.95018230E-01   # Re[R_st(2,1)]
   2  2     9.96931352E-02   # Re[R_st(2,2)]
Block sbotmix # sbottom mixing matrix
   1  1     4.41402337E-03   # Re[R_sb(1,1)]
   1  2     9.99990258E-01   # Re[R_sb(1,2)]
   2  1    -9.99990258E-01   # Re[R_sb(2,1)]
   2  2     4.41402337E-03   # Re[R_sb(2,2)]
Block staumix # stau mixing matrix
   1  1     3.38487868E-01   # Re[R_sta(1,1)]
   1  2     9.40970756E-01   # Re[R_sta(1,2)]
   2  1    -9.40970756E-01   # Re[R_sta(2,1)]
   2  2     3.38487868E-01   # Re[R_sta(2,2)]
Block Nmix # neutralino mixing matrix
   1  1    -8.00574465E-01   # Re[N(1,1)]
   1  2    -3.58921890E-02   # Re[N(1,2)]
   1  3    -4.57460641E-01   # Re[N(1,3)]
   1  4     3.85385572E-01   # Re[N(1,4)]
   2  1     6.51376192E-02   # Re[N(2,1)]
   2  2     1.22933141E-01   # Re[N(2,2)]
   2  3    -7.07422392E-01   # Re[N(2,3)]
   2  4    -6.92963270E-01   # Re[N(2,4)]
   3  1     5.95648501E-01   # Re[N(3,1)]
   3  2    -5.11045438E-02   # Re[N(3,2)]
   3  3    -5.37019096E-01   # Re[N(3,3)]
   3  4     5.95148451E-01   # Re[N(3,4)]
   4  1     6.36236964E-03   # Re[N(4,1)]
   4  2    -9.90448141E-01   # Re[N(4,2)]
   4  3    -4.35179542E-02   # Re[N(4,3)]
   4  4    -1.30683544E-01   # Re[N(4,4)]
Block Umix # chargino mixing matrix
   1  1    -6.18335961E-02   # Re[U(1,1)]
   1  2     9.98086472E-01   # Re[U(1,2)]
   2  1    -9.98086472E-01   # Re[U(2,1)]
   2  2    -6.18335961E-02   # Re[U(2,2)]
Block Vmix # chargino mixing matrix
   1  1     1.85507563E-01   # Re[V(1,1)]
   1  2     9.82642837E-01   # Re[V(1,2)]
   2  1     9.82642837E-01   # Re[V(2,1)]
   2  2    -1.85507563E-01   # Re[V(2,2)]
DECAY        23     2.49520000E+00   # Z
DECAY        24     2.08500000E+00   # W
DECAY   2000011     5.02383220E+01   # ~e^-_R
#    BR                NDA      ID1      ID2
     6.41065224E-01    2     1000022        11   # BR(~e^-_R -> chi^0_1 e^-)
     4.24262012E-03    2     1000023        11   # BR(~e^-_R -> chi^0_2 e^-)
     3.54651903E-01    2     1000025        11   # BR(~e^-_R -> chi^0_3 e^-)
DECAY   1000011     1.43656120E+02   # ~e^-_L
#    BR                NDA      ID1      ID2
     6.59299190E-02    2     1000022        11   # BR(~e^-_L -> chi^0_1 e^-)
     7.63031835E-03    2     1000023        11   # BR(~e^-_L -> chi^0_2 e^-)
     2.18737784E-02    2     1000025        11   # BR(~e^-_L -> chi^0_3 e^-)
     2.96299067E-01    2     1000035        11   # BR(~e^-_L -> chi^0_4 e^-)
     2.34519891E-03    2    -1000024        12   # BR(~e^-_L -> chi^-_1 nu_e)
     6.05921719E-01    2    -1000037        12   # BR(~e^-_L -> chi^-_2 nu_e)
#    BR                NDA      ID1      ID2       ID3
DECAY   2000013     5.07379614E+01   # ~mu^-_R
#    BR                NDA      ID1      ID2
     6.35786656E-01    2     1000022        13   # BR(~mu^-_R -> chi^0_1 mu^-)
     6.66338613E-03    2     1000023        13   # BR(~mu^-_R -> chi^0_2 mu^-)
     3.52580461E-01    2     1000025        13   # BR(~mu^-_R -> chi^0_3 mu^-)
     4.90185905E-03    2    -1000024        14   # BR(~mu^-_R -> chi^-_1 nu_mu)
DECAY   1000013     1.43906586E+02   # ~mu^-_L
#    BR                NDA      ID1      ID2
     6.61790222E-02    2     1000022        13   # BR(~mu^-_L -> chi^0_1 mu^-)
     8.48634830E-03    2     1000023        13   # BR(~mu^-_L -> chi^0_2 mu^-)
     2.23365551E-02    2     1000025        13   # BR(~mu^-_L -> chi^0_3 mu^-)
     2.95787679E-01    2     1000035        13   # BR(~mu^-_L -> chi^0_4 mu^-)
     2.34112531E-03    2    -1000024        14   # BR(~mu^-_L -> chi^-_1 nu_mu)
     6.04869271E-01    2    -1000037        14   # BR(~mu^-_L -> chi^-_2 nu_mu)
#    BR                NDA      ID1      ID2       ID3
DECAY   1000015     1.94472387E+02   # ~tau^-_1
#    BR                NDA      ID1      ID2
     2.61450453E-01    2     1000022        15   # BR(~tau^-_1 -> chi^0_1 tau^-)
     1.95096563E-01    2     1000023        15   # BR(~tau^-_1 -> chi^0_2 tau^-)
     1.51743521E-01    2     1000025        15   # BR(~tau^-_1 -> chi^0_3 tau^-)
     1.79403212E-02    2     1000035        15   # BR(~tau^-_1 -> chi^0_4 tau^-)
     3.37064803E-01    2    -1000024        16   # BR(~tau^-_1 -> chi^-_1 nu_tau)
     3.67043374E-02    2    -1000037        16   # BR(~tau^-_1 -> chi^-_2 nu_tau)
DECAY   2000015     2.11941311E+02   # ~tau^-_2
#    BR                NDA      ID1      ID2
     9.68607088E-02    2     1000022        15   # BR(~tau^-_2 -> chi^0_1 tau^-)
     1.61358061E-01    2     1000023        15   # BR(~tau^-_2 -> chi^0_2 tau^-)
     1.52367438E-01    2     1000025        15   # BR(~tau^-_2 -> chi^0_3 tau^-)
     1.85841208E-01    2     1000035        15   # BR(~tau^-_2 -> chi^0_4 tau^-)
     2.48685928E-02    2    -1000024        16   # BR(~tau^-_2 -> chi^-_1 nu_tau)
     3.78703992E-01    2    -1000037        16   # BR(~tau^-_2 -> chi^-_2 nu_tau)
#    BR                NDA      ID1      ID2       ID3
DECAY   1000012     1.43660697E+02   # ~nu_e
#    BR                NDA      ID1      ID2
     4.70872635E-02    2     1000022        12   # BR(~nu_e -> chi^0_1 nu_e)
     2.38209801E-03    2     1000023        12   # BR(~nu_e -> chi^0_2 nu_e)
     4.18124464E-02    2     1000025        12   # BR(~nu_e -> chi^0_3 nu_e)
     3.00361231E-01    2     1000035        12   # BR(~nu_e -> chi^0_4 nu_e)
     2.11060726E-02    2     1000024        11   # BR(~nu_e -> chi^+_1 e^-)
     5.87250888E-01    2     1000037        11   # BR(~nu_e -> chi^+_2 e^-)
#    BR                NDA      ID1      ID2       ID3
DECAY   1000014     1.43911140E+02   # ~nu_mu
#    BR                NDA      ID1      ID2
     4.70054821E-02    2     1000022        14   # BR(~nu_mu -> chi^0_1 nu_mu)
     2.37796078E-03    2     1000023        14   # BR(~nu_mu -> chi^0_2 nu_mu)
     4.17398265E-02    2     1000025        14   # BR(~nu_mu -> chi^0_3 nu_mu)
     2.99839581E-01    2     1000035        14   # BR(~nu_mu -> chi^0_4 nu_mu)
     2.27995872E-02    2     1000024        13   # BR(~nu_mu -> chi^+_1 mu^-)
     5.86237563E-01    2     1000037        13   # BR(~nu_mu -> chi^+_2 mu^-)
#    BR                NDA      ID1      ID2       ID3
DECAY   1000016     2.14571973E+02   # ~nu_tau
#    BR                NDA      ID1      ID2
     3.15569940E-02    2     1000022        16   # BR(~nu_tau -> chi^0_1 nu_tau)
     1.59643803E-03    2     1000023        16   # BR(~nu_tau -> chi^0_2 nu_tau)
     2.80219462E-02    2     1000025        16   # BR(~nu_tau -> chi^0_3 nu_tau)
     2.01299875E-01    2     1000035        16   # BR(~nu_tau -> chi^0_4 nu_tau)
     3.42704164E-01    2     1000024        15   # BR(~nu_tau -> chi^+_1 tau^-)
     3.94820583E-01    2     1000037        15   # BR(~nu_tau -> chi^+_2 tau^-)
#    BR                NDA      ID1      ID2       ID3
DECAY   2000001     5.81233008E+02   # ~d_R
#    BR                NDA      ID1      ID2
     6.20081978E-03    2     1000022         1   # BR(~d_R -> chi^0_1 d)
     3.43052303E-03    2     1000025         1   # BR(~d_R -> chi^0_3 d)
     9.90326733E-01    2     1000021         1   # BR(~d_R -> ~g d)
DECAY   1000001     7.11626463E+02   # ~d_L
#    BR                NDA      ID1      ID2
     7.10655673E-04    2     1000022         1   # BR(~d_L -> chi^0_1 d)
     7.74011705E-04    2     1000023         1   # BR(~d_L -> chi^0_2 d)
     1.54191133E-03    2     1000025         1   # BR(~d_L -> chi^0_3 d)
     6.08806320E-02    2     1000035         1   # BR(~d_L -> chi^0_4 d)
     4.77407333E-04    2    -1000024         2   # BR(~d_L -> chi^-_1 u)
     1.23363467E-01    2    -1000037         2   # BR(~d_L -> chi^-_2 u)
     8.12251915E-01    2     1000021         1   # BR(~d_L -> ~g d)
DECAY   2000003     5.81373302E+02   # ~s_R
#    BR                NDA      ID1      ID2
     6.22436599E-03    2     1000022         3   # BR(~s_R -> chi^0_1 s)
     1.01044451E-04    2     1000023         3   # BR(~s_R -> chi^0_2 s)
     3.46417938E-03    2     1000025         3   # BR(~s_R -> chi^0_3 s)
     1.19467603E-04    2    -1000024         4   # BR(~s_R -> chi^-_1 c)
     9.90089874E-01    2     1000021         3   # BR(~s_R -> ~g s)
DECAY   1000003     7.11700567E+02   # ~s_L
#    BR                NDA      ID1      ID2
     7.31083244E-04    2     1000022         3   # BR(~s_L -> chi^0_1 s)
     8.22942929E-04    2     1000023         3   # BR(~s_L -> chi^0_2 s)
     1.56998697E-03    2     1000025         3   # BR(~s_L -> chi^0_3 s)
     6.08745198E-02    2     1000035         3   # BR(~s_L -> chi^0_4 s)
     4.82301283E-04    2    -1000024         4   # BR(~s_L -> chi^-_1 c)
     1.23350883E-01    2    -1000037         4   # BR(~s_L -> chi^-_2 c)
     8.12168283E-01    2     1000021         3   # BR(~s_L -> ~g s)
DECAY   1000005     1.24957517E+02   # ~b_1
#    BR                NDA      ID1      ID2
     1.13498855E-01    2     1000022         5   # BR(~b_1 -> chi^0_1 b)
     2.47544987E-01    2     1000023         5   # BR(~b_1 -> chi^0_2 b)
     1.46879361E-01    2     1000025         5   # BR(~b_1 -> chi^0_3 b)
     7.83357480E-04    2     1000035         5   # BR(~b_1 -> chi^0_4 b)
     4.89723286E-01    2    -1000024         6   # BR(~b_1 -> chi^-_1 t)
     1.57015247E-03    2    -1000037         6   # BR(~b_1 -> chi^-_2 t)
DECAY   2000005     2.15904474E+02   # ~b_2
#    BR                NDA      ID1      ID2
     7.43428186E-02    2     1000022         5   # BR(~b_2 -> chi^0_1 b)
     1.76781021E-01    2     1000023         5   # BR(~b_2 -> chi^0_2 b)
     1.03461805E-01    2     1000025         5   # BR(~b_2 -> chi^0_3 b)
     7.72154970E-02    2     1000035         5   # BR(~b_2 -> chi^0_4 b)
     3.66228991E-01    2    -1000024         6   # BR(~b_2 -> chi^-_1 t)
     1.68259314E-01    2    -1000037         6   # BR(~b_2 -> chi^-_2 t)
     8.13644289E-03    2     1000021         5   # BR(~b_2 -> ~g b)
     2.53540024E-02    2     1000006       -24   # BR(~b_2 -> ~t_1 W^-)
     1.46699434E-04    2     1000005        25   # BR(~b_2 -> ~b_1 h^0)
DECAY   2000002     5.98402034E+02   # ~u_R
#    BR                NDA      ID1      ID2
     2.40986659E-02    2     1000022         2   # BR(~u_R -> chi^0_1 u)
     1.59485426E-04    2     1000023         2   # BR(~u_R -> chi^0_2 u)
     1.33320562E-02    2     1000025         2   # BR(~u_R -> chi^0_3 u)
     9.62408283E-01    2     1000021         2   # BR(~u_R -> ~g u)
DECAY   1000002     7.11610396E+02   # ~u_L
#    BR                NDA      ID1      ID2
     1.98880258E-03    2     1000022         2   # BR(~u_L -> chi^0_1 u)
     1.12996394E-03    2     1000023         2   # BR(~u_L -> chi^0_2 u)
     1.88555306E-04    2     1000025         2   # BR(~u_L -> chi^0_3 u)
     6.06018254E-02    2     1000035         2   # BR(~u_L -> chi^0_4 u)
     4.29719109E-03    2     1000024         1   # BR(~u_L -> chi^+_1 d)
     1.19573606E-01    2     1000037         1   # BR(~u_L -> chi^+_2 d)
     8.12220056E-01    2     1000021         2   # BR(~u_L -> ~g u)
DECAY   2000004     5.98409353E+02   # ~c_R
#    BR                NDA      ID1      ID2
     2.40992733E-02    2     1000022         4   # BR(~c_R -> chi^0_1 c)
     1.62401129E-04    2     1000023         4   # BR(~c_R -> chi^0_2 c)
     1.33340478E-02    2     1000025         4   # BR(~c_R -> chi^0_3 c)
     9.62396591E-01    2     1000021         4   # BR(~c_R -> ~g c)
DECAY   1000004     7.11684464E+02   # ~c_L
#    BR                NDA      ID1      ID2
     1.98935802E-03    2     1000022         4   # BR(~c_L -> chi^0_1 c)
     1.13230648E-03    2     1000023         4   # BR(~c_L -> chi^0_2 c)
     1.90348529E-04    2     1000025         4   # BR(~c_L -> chi^0_3 c)
     6.05956421E-02    2     1000035         4   # BR(~c_L -> chi^0_4 c)
     4.39430688E-03    2     1000024         3   # BR(~c_L -> chi^+_1 s)
     1.19561614E-01    2     1000037         3   # BR(~c_L -> chi^+_2 s)
     8.12136424E-01    2     1000021         4   # BR(~c_L -> ~g c)
DECAY   1000006     1.50792563E+02   # ~t_1
#    BR                NDA      ID1      ID2
     1.09494971E-01    2     1000022         6   # BR(~t_1 -> chi^0_1 t)
     2.24605397E-01    2     1000023         6   # BR(~t_1 -> chi^0_2 t)
     1.76476049E-01    2     1000025         6   # BR(~t_1 -> chi^0_3 t)
     1.37222300E-02    2     1000035         6   # BR(~t_1 -> chi^0_4 t)
     4.47999928E-01    2     1000024         5   # BR(~t_1 -> chi^+_1 b)
     2.75468327E-02    2     1000037         5   # BR(~t_1 -> chi^+_2 b)
#    BR                NDA      ID1      ID2       ID3
     1.47380382E-04    3     1000022        24         5   # BR(~t_1 -> chi^0_1 W^+ b)
DECAY   2000006     2.15146349E+02   # ~t_2
#    BR                NDA      ID1      ID2
     5.43802936E-02    2     1000022         6   # BR(~t_2 -> chi^0_1 t)
     1.86894693E-01    2     1000023         6   # BR(~t_2 -> chi^0_2 t)
     1.42841517E-01    2     1000025         6   # BR(~t_2 -> chi^0_3 t)
     7.67519496E-02    2     1000035         6   # BR(~t_2 -> chi^0_4 t)
     3.66760759E-01    2     1000024         5   # BR(~t_2 -> chi^+_1 b)
     1.42366207E-01    2     1000037         5   # BR(~t_2 -> chi^+_2 b)
     1.50469776E-04    2     1000005        24   # BR(~t_2 -> ~b_1 W^+)
     1.29609487E-02    2     1000006        23   # BR(~t_2 -> ~t_1 Z)
     1.68931623E-02    2     1000006        25   # BR(~t_2 -> ~t_1 h^0)
DECAY   1000024     2.98600734E-05   # chi^+_1
#    BR                NDA      ID1      ID2       ID3
     3.34385919E-01    3     1000022        -1         2   # BR(chi^+_1 -> chi^0_1 d_bar u)
     3.32542994E-01    3     1000022        -3         4   # BR(chi^+_1 -> chi^0_1 s_bar c)
     1.11460604E-01    3     1000022       -11        12   # BR(chi^+_1 -> chi^0_1 e^+ nu_e)
     1.11459890E-01    3     1000022       -13        14   # BR(chi^+_1 -> chi^0_1 mu^+ nu_mu)
     1.10149716E-01    3     1000022       -15        16   # BR(chi^+_1 -> chi^0_1 tau^+ nu_tau)
DECAY   1000037     5.55419993E+00   # chi^+_2
#    BR                NDA      ID1      ID2
     1.01919431E-01    2     1000022        24   # BR(chi^+_2 -> chi^0_1 W^+)
     2.63410325E-01    2     1000023        24   # BR(chi^+_2 -> chi^0_2 W^+)
     1.51058708E-01    2     1000025        24   # BR(chi^+_2 -> chi^0_3 W^+)
     2.47821904E-01    2     1000024        23   # BR(chi^+_2 -> chi^+_1 Z)
     2.31919601E-01    2     1000024        25   # BR(chi^+_2 -> chi^+_1 h^0)
#    BR                NDA      ID1      ID2       ID3
     4.00676894E-04    3     1000024         6        -6   # BR(chi^+_2 -> chi^+_1 t t_bar)
     7.46726840E-04    3     1000022        -5         6   # BR(chi^+_2 -> chi^0_1 b_bar t)
     1.85379764E-03    3     1000023        -5         6   # BR(chi^+_2 -> chi^0_2 b_bar t)
     8.59683375E-04    3     1000025        -5         6   # BR(chi^+_2 -> chi^0_3 b_bar t)
DECAY   1000022     0.00000000E+00   # chi^0_1
DECAY   1000023     5.82543836E-05   # chi^0_2
#    BR                NDA      ID1      ID2
     2.70922293E-02    2     1000022        22   # BR(chi^0_2 -> chi^0_1 photon)
#    BR                NDA      ID1      ID2       ID3
     1.18334332E-01    3     1000022         2        -2   # BR(chi^0_2 -> chi^0_1 u u_bar)
     1.16376415E-01    3     1000022         4        -4   # BR(chi^0_2 -> chi^0_1 c c_bar)
     1.51727420E-01    3     1000022         1        -1   # BR(chi^0_2 -> chi^0_1 d d_bar)
     1.51715288E-01    3     1000022         3        -3   # BR(chi^0_2 -> chi^0_1 s s_bar)
     1.30336139E-01    3     1000022         5        -5   # BR(chi^0_2 -> chi^0_1 b b_bar)
     3.42395671E-02    3     1000022        11       -11   # BR(chi^0_2 -> chi^0_1 e^- e^+)
     3.42352338E-02    3     1000022        13       -13   # BR(chi^0_2 -> chi^0_1 mu^- mu^+)
     3.30421772E-02    3     1000022        15       -15   # BR(chi^0_2 -> chi^0_1 tau^- tau^+)
     2.02901200E-01    3     1000022        12       -12   # BR(chi^0_2 -> chi^0_1 nu_e nu_bar_e)
DECAY   1000025     1.17409488E-04   # chi^0_3
#    BR                NDA      ID1      ID2
     9.92462518E-04    2     1000022        22   # BR(chi^0_3 -> chi^0_1 photon)
     2.55059133E-02    2     1000023        22   # BR(chi^0_3 -> chi^0_2 photon)
#    BR                NDA      ID1      ID2       ID3
     1.71459162E-03    3     1000022         2        -2   # BR(chi^0_3 -> chi^0_1 u u_bar)
     1.70881115E-03    3     1000022         4        -4   # BR(chi^0_3 -> chi^0_1 c c_bar)
     2.19649882E-03    3     1000022         1        -1   # BR(chi^0_3 -> chi^0_1 d d_bar)
     2.19647448E-03    3     1000022         3        -3   # BR(chi^0_3 -> chi^0_1 s s_bar)
     2.26944557E-03    3     1000022         5        -5   # BR(chi^0_3 -> chi^0_1 b b_bar)
     4.94118571E-04    3     1000022        11       -11   # BR(chi^0_3 -> chi^0_1 e^- e^+)
     4.94115315E-04    3     1000022        13       -13   # BR(chi^0_3 -> chi^0_1 mu^- mu^+)
     4.93133604E-04    3     1000022        15       -15   # BR(chi^0_3 -> chi^0_1 tau^- tau^+)
     2.94014331E-03    3     1000022        12       -12   # BR(chi^0_3 -> chi^0_1 nu_e nu_bar_e)
     7.11568401E-02    3     1000023         2        -2   # BR(chi^0_3 -> chi^0_2 u u_bar)
     6.97505609E-02    3     1000023         4        -4   # BR(chi^0_3 -> chi^0_2 c c_bar)
     9.12373326E-02    3     1000023         1        -1   # BR(chi^0_3 -> chi^0_2 d d_bar)
     9.12285861E-02    3     1000023         3        -3   # BR(chi^0_3 -> chi^0_2 s s_bar)
     7.59689088E-02    3     1000023         5        -5   # BR(chi^0_3 -> chi^0_2 b b_bar)
     2.05900010E-02    3     1000023        11       -11   # BR(chi^0_3 -> chi^0_2 e^- e^+)
     2.05868703E-02    3     1000023        13       -13   # BR(chi^0_3 -> chi^0_2 mu^- mu^+)
     1.97288026E-02    3     1000023        15       -15   # BR(chi^0_3 -> chi^0_2 tau^- tau^+)
     1.22011454E-01    3     1000023        12       -12   # BR(chi^0_3 -> chi^0_2 nu_e nu_bar_e)
     6.30772544E-02    3     1000024         1        -2   # BR(chi^0_3 -> chi^+_1 d u_bar)
     6.30772544E-02    3    -1000024        -1         2   # BR(chi^0_3 -> chi^-_1 d_bar u)
     6.25641482E-02    3     1000024         3        -4   # BR(chi^0_3 -> chi^+_1 s c_bar)
     6.25641482E-02    3    -1000024        -3         4   # BR(chi^0_3 -> chi^-_1 s_bar c)
     2.10259348E-02    3     1000024        11       -12   # BR(chi^0_3 -> chi^+_1 e^- nu_bar_e)
     2.10259348E-02    3    -1000024       -11        12   # BR(chi^0_3 -> chi^-_1 e^+ nu_e)
     2.10257932E-02    3     1000024        13       -14   # BR(chi^0_3 -> chi^+_1 mu^- nu_bar_mu)
     2.10257932E-02    3    -1000024       -13        14   # BR(chi^0_3 -> chi^-_1 mu^+ nu_mu)
     2.06743371E-02    3     1000024        15       -16   # BR(chi^0_3 -> chi^+_1 tau^- nu_bar_tau)
     2.06743371E-02    3    -1000024       -15        16   # BR(chi^0_3 -> chi^-_1 tau^+ nu_tau)
DECAY   1000035     6.61776301E+00   # chi^0_4
#    BR                NDA      ID1      ID2
     2.25663989E-01    2     1000024       -24   # BR(chi^0_4 -> chi^+_1 W^-)
     2.25663989E-01    2    -1000024        24   # BR(chi^0_4 -> chi^-_1 W^+)
     6.61696641E-02    2     1000022        23   # BR(chi^0_4 -> chi^0_1 Z)
     4.33384748E-02    2     1000023        23   # BR(chi^0_4 -> chi^0_2 Z)
     1.11208048E-01    2     1000025        23   # BR(chi^0_4 -> chi^0_3 Z)
     6.45709822E-02    2     1000022        25   # BR(chi^0_4 -> chi^0_1 h^0)
     1.51892987E-01    2     1000023        25   # BR(chi^0_4 -> chi^0_2 h^0)
     1.07378769E-01    2     1000025        25   # BR(chi^0_4 -> chi^0_3 h^0)
#    BR                NDA      ID1      ID2       ID3
     1.93104136E-03    3     1000024         5        -6   # BR(chi^0_4 -> chi^+_1 b t_bar)
     1.93104136E-03    3    -1000024        -5         6   # BR(chi^0_4 -> chi^-_1 b_bar t)
DECAY   1000021     1.26687144E+01   # ~g
#    BR                NDA      ID1      ID2
     1.86730450E-04    2     1000006        -4   # BR(~g -> ~t_1 c_bar)
     1.86730450E-04    2    -1000006         4   # BR(~g -> ~t^*_1 c)
     1.05986090E-01    2     1000006        -6   # BR(~g -> ~t_1 t_bar)
     1.05986090E-01    2    -1000006         6   # BR(~g -> ~t^*_1 t)
     3.55031063E-01    2     1000005        -5   # BR(~g -> ~b_1 b_bar)
     3.55031063E-01    2    -1000005         5   # BR(~g -> ~b^*_1 b)
     2.93557667E-04    2     1000023        21   # BR(~g -> chi^0_2 g)
     2.15001848E-04    2     1000025        21   # BR(~g -> chi^0_3 g)
#    BR                NDA      ID1      ID2       ID3
     2.28827956E-03    3     1000022         6        -6   # BR(~g -> chi^0_1 t t_bar)
     3.11557575E-03    3     1000022         5        -5   # BR(~g -> chi^0_1 b b_bar)
     7.63269156E-03    3     1000023         6        -6   # BR(~g -> chi^0_2 t t_bar)
     7.38645116E-03    3     1000023         5        -5   # BR(~g -> chi^0_2 b b_bar)
     5.64803626E-03    3     1000025         6        -6   # BR(~g -> chi^0_3 t t_bar)
     4.32079391E-03    3     1000025         5        -5   # BR(~g -> chi^0_3 b b_bar)
     2.96673470E-03    3     1000035         6        -6   # BR(~g -> chi^0_4 t t_bar)
     3.43413937E-03    3     1000035         5        -5   # BR(~g -> chi^0_4 b b_bar)
     1.51359268E-02    3     1000024         5        -6   # BR(~g -> chi^+_1 b t_bar)
     1.51359268E-02    3    -1000024        -5         6   # BR(~g -> chi^-_1 b_bar t)
     4.84103960E-03    3     1000037         5        -6   # BR(~g -> chi^+_2 b t_bar)
     4.84103960E-03    3    -1000037        -5         6   # BR(~g -> chi^-_2 b_bar t)
DECAY        25     3.45909009E-03   # Gamma(h0)
     2.53524732E-03   2        22        22   # BR(h0 -> photon photon)
     1.52586139E-03   2        22        23   # BR(h0 -> photon Z)
     2.71911470E-02   2        23        23   # BR(h0 -> Z Z)
     2.29352742E-01   2       -24        24   # BR(h0 -> W W)
     7.94441109E-02   2        21        21   # BR(h0 -> gluon gluon)
     5.08218525E-09   2       -11        11   # BR(h0 -> Electron electron)
     2.26064119E-04   2       -13        13   # BR(h0 -> Muon muon)
     6.51808719E-02   2       -15        15   # BR(h0 -> Tau tau)
     1.43592382E-07   2        -2         2   # BR(h0 -> Up up)
     2.78672585E-02   2        -4         4   # BR(h0 -> Charm charm)
     5.89095524E-07   2        -1         1   # BR(h0 -> Down down)
     2.13062020E-04   2        -3         3   # BR(h0 -> Strange strange)
     5.66462897E-01   2        -5         5   # BR(h0 -> Bottom bottom)
DECAY        35     9.40968069E+01   # Gamma(HH)
     7.57055510E-08   2        22        22   # BR(HH -> photon photon)
     1.30709943E-07   2        22        23   # BR(HH -> photon Z)
     1.45383158E-07   2        23        23   # BR(HH -> Z Z)
     8.12036114E-08   2       -24        24   # BR(HH -> W W)
     1.89245340E-05   2        21        21   # BR(HH -> gluon gluon)
     9.54996471E-09   2       -11        11   # BR(HH -> Electron electron)
     4.25150303E-04   2       -13        13   # BR(HH -> Muon muon)
     1.22779877E-01   2       -15        15   # BR(HH -> Tau tau)
     1.52913271E-14   2        -2         2   # BR(HH -> Up up)
     2.96586948E-09   2        -4         4   # BR(HH -> Charm charm)
     1.97122026E-04   2        -6         6   # BR(HH -> Top top)
     7.31448429E-07   2        -1         1   # BR(HH -> Down down)
     2.64570393E-04   2        -3         3   # BR(HH -> Strange strange)
     6.60312335E-01   2        -5         5   # BR(HH -> Bottom bottom)
     6.31492556E-03   2  -1000024   1000024   # BR(HH -> Chargino1 chargino1)
     6.12295428E-02   2  -1000024   1000037   # BR(HH -> Chargino1 chargino2)
     6.12295428E-02   2  -1000037   1000024   # BR(HH -> Chargino2 chargino1)
     3.49409044E-04   2  -1000037   1000037   # BR(HH -> Chargino2 chargino2)
     4.81838686E-03   2   1000022   1000022   # BR(HH -> neutralino1 neutralino1)
     7.30470843E-03   2   1000022   1000023   # BR(HH -> neutralino1 neutralino2)
     1.75913243E-04   2   1000022   1000025   # BR(HH -> neutralino1 neutralino3)
     1.64246296E-02   2   1000022   1000035   # BR(HH -> neutralino1 neutralino4)
     7.83139475E-04   2   1000023   1000023   # BR(HH -> neutralino2 neutralino2)
     5.18362265E-03   2   1000023   1000025   # BR(HH -> neutralino2 neutralino3)
     2.95388640E-02   2   1000023   1000035   # BR(HH -> neutralino2 neutralino4)
     5.75525261E-03   2   1000025   1000025   # BR(HH -> neutralino3 neutralino3)
     1.67151630E-02   2   1000025   1000035   # BR(HH -> neutralino3 neutralino4)
     1.76991261E-04   2   1000035   1000035   # BR(HH -> neutralino4 neutralino4)
     7.52211638E-07   2        25        25   # BR(HH -> h0 h0)
DECAY        36     8.86724405E+01   # Gamma(A0)
     2.18585286E-09   2        22        22   # BR(A0 -> photon photon)
     3.47378818E-08   2        22        23   # BR(A0 -> photon Z)
     2.71132899E-05   2        21        21   # BR(A0 -> gluon gluon)
     9.38605103E-09   2       -11        11   # BR(A0 -> Electron electron)
     4.17854568E-04   2       -13        13   # BR(A0 -> Muon muon)
     1.20673389E-01   2       -15        15   # BR(A0 -> Tau tau)
     1.43414807E-14   2        -2         2   # BR(A0 -> Up up)
     2.78139107E-09   2        -4         4   # BR(A0 -> Charm charm)
     1.91532107E-04   2        -6         6   # BR(A0 -> Top top)
     7.18819108E-07   2        -1         1   # BR(A0 -> Down down)
     2.60002630E-04   2        -3         3   # BR(A0 -> Strange strange)
     6.48933508E-01   2        -5         5   # BR(A0 -> Bottom bottom)
     6.92533008E-03   2  -1000024   1000024   # BR(A0 -> Chargino1 chargino1)
     6.48648760E-02   2  -1000024   1000037   # BR(A0 -> Chargino1 chargino2)
     6.48648760E-02   2  -1000037   1000024   # BR(A0 -> Chargino2 chargino1)
     5.39460071E-04   2  -1000037   1000037   # BR(A0 -> Chargino2 chargino2)
     5.67303119E-03   2   1000022   1000022   # BR(A0 -> neutralino1 neutralino1)
     7.06793682E-03   2   1000022   1000023   # BR(A0 -> neutralino1 neutralino2)
     1.97124725E-04   2   1000022   1000025   # BR(A0 -> neutralino1 neutralino3)
     1.60203344E-02   2   1000022   1000035   # BR(A0 -> neutralino1 neutralino4)
     8.21017634E-04   2   1000023   1000023   # BR(A0 -> neutralino2 neutralino2)
     4.69726386E-03   2   1000023   1000025   # BR(A0 -> neutralino2 neutralino3)
     3.49544256E-02   2   1000023   1000035   # BR(A0 -> neutralino2 neutralino4)
     7.12896965E-03   2   1000025   1000025   # BR(A0 -> neutralino3 neutralino3)
     1.54667682E-02   2   1000025   1000035   # BR(A0 -> neutralino3 neutralino4)
     2.74210668E-04   2   1000035   1000035   # BR(A0 -> neutralino4 neutralino4)
     2.07215734E-07   2        23        25   # BR(A0 -> Z h0)
     1.17418167E-13   2        23        35   # BR(A0 -> Z HH)
     8.71509271E-39   2        25        25   # BR(A0 -> h0 h0)
DECAY        37     1.03868628E+02   # Gamma(Hp)
     1.04346870E-08   2       -11        12   # BR(Hp -> Electron nu_e)
     4.46115459E-04   2       -13        14   # BR(Hp -> Muon nu_mu)
     1.26186695E-01   2       -15        16   # BR(Hp -> Tau nu_tau)
     6.92949415E-07   2        -1         2   # BR(Hp -> Down up)
     1.16360658E-05   2        -3         2   # BR(Hp -> Strange up)
     7.20050428E-06   2        -5         2   # BR(Hp -> Bottom up)
     3.23274335E-08   2        -1         4   # BR(Hp -> Down charm)
     2.49739843E-04   2        -3         4   # BR(Hp -> Strange charm)
     1.00832771E-03   2        -5         4   # BR(Hp -> Bottom charm)
     1.46689045E-08   2        -1         6   # BR(Hp -> Down top)
     6.84181870E-07   2        -3         6   # BR(Hp -> Strange top)
     6.77123063E-01   2        -5         6   # BR(Hp -> Bottom top)
     1.69285624E-02   2   1000022   1000024   # BR(Hp -> neutralino1 chargino1)
     2.83331559E-02   2   1000022   1000037   # BR(Hp -> neutralino1 chargino2)
     7.19684080E-04   2   1000023   1000024   # BR(Hp -> neutralino2 chargino1)
     5.92772376E-02   2   1000023   1000037   # BR(Hp -> neutralino2 chargino2)
     5.11411690E-03   2   1000024   1000025   # BR(Hp -> chargino1 neutralino3)
     2.80676508E-02   2   1000025   1000037   # BR(Hp -> neutralino3 chargino2)
     5.65251935E-02   2   1000024   1000035   # BR(Hp -> chargino1 neutralino4)
     1.01560698E-08   2   1000035   1000037   # BR(Hp -> neutralino4 chargino2)
     1.76715167E-07   2        24        25   # BR(Hp -> W h0)
DECAY         6     2.43000000E+00   # top
#    BR                NDA      ID1      ID2
     1.00000000E+00    2           5        24   # BR(t -> b W)
Block HiggsBoundsInputHiggsCouplingsFermions
# ScalarNormEffCoupSq PseudoSNormEffCoupSq NP IP1 IP2 IP2
    1.00957435E+00    0.00000000E+00        3  25   5   5  # h0-b-b eff. coupling^2, normalised to SM
    3.39555124E+03    0.00000000E+00        3  35   5   5  # H0-b-b eff. coupling^2, normalised to SM
    0.00000000E+00    3.39556081E+03        3  36   5   5  # A0-b-b eff. coupling^2, normalised to SM
#
    9.99997180E-01    0.00000000E+00        3  25   6   6  # h0-t-t eff. coupling^2, normalised to SM
    2.97321828E-04    0.00000000E+00        3  35   6   6  # H0-t-t eff. coupling^2, normalised to SM
    0.00000000E+00    2.94502162E-04        3  36   6   6  # A0-t-t eff. coupling^2, normalised to SM
#
    1.00957435E+00    0.00000000E+00        3  25  15  15  # h0-tau-tau eff. coupling^2, normalised to SM
    3.39555124E+03    0.00000000E+00        3  35  15  15  # H0-tau-tau eff. coupling^2, normalised to SM
    0.00000000E+00    3.39556081E+03        3  36  15  15  # A0-tau-tau eff. coupling^2, normalised to SM
#
Block HiggsBoundsInputHiggsCouplingsBosons
    9.99999993E-01        3  25  24  24  # h0-W-W eff. coupling^2, normalised to SM
    6.71701068E-09        3  35  24  24  # H0-W-W eff. coupling^2, normalised to SM
    0.00000000E+00        3  36  24  24  # A0-W-W eff. coupling^2, normalised to SM
#
    9.99999993E-01        3  25  23  23  # h0-Z-Z eff. coupling^2, normalised to SM
    6.71701068E-09        3  35  23  23  # H0-Z-Z eff. coupling^2, normalised to SM
    0.00000000E+00        3  36  23  23  # A0-Z-Z eff. coupling^2, normalised to SM
#
    1.26380628E+00        3  25  21  21  # h0-g-g eff. coupling^2, normalised to SM
    2.63809490E-02        3  35  21  21  # H0-g-g eff. coupling^2, normalised to SM
    1.78844132E-01        3  36  21  21  # A0-g-g eff. coupling^2, normalised to SM
#
    0.00000000E+00        3  25  25  23  # h0-h0-Z eff. coupling^2, normalised to SM
    0.00000000E+00        3  35  25  23  # H0-h0-Z eff. coupling^2, normalised to SM
    6.71701068E-09        3  36  25  23  # A0-h0-Z eff. coupling^2, normalised to SM
    0.00000000E+00        3  35  35  23  # H0-H0-Z eff. coupling^2, normalised to SM
    9.99999993E-01        3  36  35  23  # A0-H0-Z eff. coupling^2, normalised to SM
    0.00000000E+00        3  36  36  23  # A0-A0-Z eff. coupling^2, normalised to SM
#
    0.00000000E+00        4  25  21  21  23  # h0-g-g-Z eff. coupling^2, normalised to SM
    0.00000000E+00        4  35  21  21  23  # H0-g-g-Z eff. coupling^2, normalised to SM
    0.00000000E+00        4  36  21  21  23  # A0-g-g-Z eff. coupling^2, normalised to SM
Block SPhenoLowEnergy  # low energy observables
    1    3.21896697E-04   # BR(b -> s gamma)
    2    1.58957402E-06   # BR(b -> s mu+ mu-)
    3    3.52413454E-05   # BR(b -> s nu nu)
    4    4.66666765E-15   # BR(Bd -> e+ e-)
    5    1.99331259E-10   # BR(Bd -> mu+ mu-)
    6    4.03947358E-08   # BR(Bd -> tau+ tau-)
    7    1.51844808E-13   # BR(Bs -> e+ e-)
    8    6.48611245E-09   # BR(Bs -> mu+ mu-)
    9    1.33589741E-06   # BR(Bs -> tau+ tau-)
   10    9.22995970E-05   # BR(B_u -> tau nu)
   11    9.53419500E-01   # BR(B_u -> tau nu)/BR(B_u -> tau nu)_SM
   12    5.41908454E-01   # |Delta(M_Bd)| [ps^-1] 
   13    1.93279675E+01   # |Delta(M_Bs)| [ps^-1] 
   14    0.00000000E+00   # neutron EDM according to the chiral quark model
   15    0.00000000E+00   # neutron EDM according to the relativistic quark-parton model
   16    2.15737647E-03   # epsilon_K
   17    2.28166487E-15   # Delta(M_K)
   18    2.47935735E-11   # BR(K^0 -> pi^0 nu nu)
   19    8.28891259E-11   # BR(K^+ -> pi^+ nu nu)
   20   -5.27614780E-16   # Delta(g-2)_electron/2
   21   -2.25575492E-11   # Delta(g-2)_muon/2
   22   -6.40731405E-09   # Delta(g-2)_tau/2
   23    0.00000000E+00   # electric dipole moment of the electron
   24    0.00000000E+00   # electric dipole moment of the muon
   25    0.00000000E+00   # electric dipole moment of the tau
   26    0.00000000E+00   # Br(mu -> e gamma)
   27    0.00000000E+00   # Br(tau -> e gamma)
   28    0.00000000E+00   # Br(tau -> mu gamma)
   29    0.00000000E+00   # Br(mu -> 3 e)
   30    0.00000000E+00   # Br(tau -> 3 e)
   31    0.00000000E+00   # Br(tau -> 3 mu)
   39    7.44412554E-05   # Delta(rho_parameter)
   40    0.00000000E+00   # BR(Z -> e mu)
   41    0.00000000E+00   # BR(Z -> e tau)
   42    0.00000000E+00   # BR(Z -> mu tau)
Block FWCOEF Q=  1.60000000E+02  # Wilson coefficients at scale Q
#    id        order  M        value         comment
     0305 4422   00   0    -1.88819110E-01   # C7
     0305 4422   00   2    -1.88166686E-01   # C7
     0305 4322   00   2    -1.88499859E-04   # C7'
     0305 6421   00   0    -9.52278348E-02   # C8
     0305 6421   00   2    -1.05826616E-01   # C8
     0305 6321   00   2    -3.14243288E-04   # C8'
 03051111 4133   00   0     1.62611486E+00   # C9 e+e-
 03051111 4133   00   2     1.62636986E+00   # C9 e+e-
 03051111 4233   00   2     5.68617338E-04   # C9' e+e-
 03051111 4137   00   0    -4.44880696E+00   # C10 e+e-
 03051111 4137   00   2    -4.44618465E+00   # C10 e+e-
 03051111 4237   00   2    -4.21052263E-03   # C10' e+e-
 03051313 4133   00   0     1.62611486E+00   # C9 mu+mu-
 03051313 4133   00   2     1.62636958E+00   # C9 mu+mu-
 03051313 4233   00   2     5.68610777E-04   # C9' mu+mu-
 03051313 4137   00   0    -4.44880696E+00   # C10 mu+mu-
 03051313 4137   00   2    -4.44618493E+00   # C10 mu+mu-
 03051313 4237   00   2    -4.21051767E-03   # C10' mu+mu-
 03051212 4137   00   0     1.50535012E+00   # C11 nu_1 nu_1
 03051212 4137   00   2     1.50478440E+00   # C11 nu_1 nu_1
 03051212 4237   00   2     9.10590151E-04   # C11' nu_1 nu_1
 03051414 4137   00   0     1.50535012E+00   # C11 nu_2 nu_2
 03051414 4137   00   2     1.50478440E+00   # C11 nu_2 nu_2
 03051414 4237   00   2     9.10591483E-04   # C11' nu_2 nu_2
 03051616 4137   00   0     1.50535012E+00   # C11 nu_3 nu_3
 03051616 4137   00   2     1.50478440E+00   # C11 nu_3 nu_3
 03051616 4237   00   2     9.10966750E-04   # C11' nu_3 nu_3
Block IMFWCOEF Q=  1.60000000E+02  # Im(Wilson coefficients) at scale Q
#    id        order  M        value         comment
     0305 4422   00   0     3.85824304E-07   # C7
     0305 4422   00   2    -7.15142821E-06   # C7
     0305 4322   00   2     1.39048775E-06   # C7'
     0305 6421   00   0     3.30484032E-07   # C8
     0305 6421   00   2    -1.22024494E-05   # C8
     0305 6321   00   2     3.34803128E-07   # C8'
 03051111 4133   00   2     2.81165906E-07   # C9 e+e-
 03051111 4233   00   2     1.31760313E-05   # C9' e+e-
 03051111 4137   00   2     1.52700934E-06   # C10 e+e-
 03051111 4237   00   2    -9.75842503E-05   # C10' e+e-
 03051313 4133   00   2     2.81159689E-07   # C9 mu+mu-
 03051313 4233   00   2     1.31760241E-05   # C9' mu+mu-
 03051313 4137   00   2     1.52701650E-06   # C10 mu+mu-
 03051313 4237   00   2    -9.75842718E-05   # C10' mu+mu-
 03051212 4137   00   2    -3.05262709E-07   # C11 nu_1 nu_1
 03051212 4237   00   2     2.11040966E-05   # C11' nu_1 nu_1
 03051414 4137   00   2    -3.05262378E-07   # C11 nu_2 nu_2
 03051414 4237   00   2     2.11040966E-05   # C11' nu_2 nu_2
 03051616 4137   00   2    -3.05171639E-07   # C11 nu_3 nu_3
 03051616 4237   00   2     2.11040966E-05   # C11' nu_3 nu_3
