BLOCK SPINFO
   1   SPheno
   2   v4.0.5be

BLOCK SPHENOINFO
   1   2
   2   2

BLOCK MODSEL
   1   0

BLOCK MINPAR
   3    56.870266
   4    1

BLOCK EXTPAR
   0    1391.8711
   1    259.13373
   2   -1945.7622
   3    3000
   11   -3062.3484
   12    237.32126
   13   -581.9051
   23    276.9065
   25    56.622317
   26    3968.1211
   31    1184.9727
   32    1184.9727
   33    1138.1856
   34    1965.2632
   35    1965.2632
   36    1520.3598
   41    5000
   42    5000
   43    1120.1541
   44    5000
   45    5000
   46    1842.5544
   47    5000
   48    5000
   49    1297.5792

BLOCK SMINPUTS
   1    127.90897
   2    1.1663787e-05
   3    0.1184
   4    91.1876
   5    4.18
   6    173.2
   7    1.777
   8    0
   11    0.00051099893
   12    0
   13    0.10565837
   14    0
   21    0.005
   22    0.0025
   23    0.095
   24    1.27

BLOCK GAUGE Q=  1391.8711
   1    0.35536298
   2    0.66519887
   3    1.219778

BLOCK YU Q=  1391.8711
   1   1    8.3856796e-06
   2   2    0.0042599252
   3   3    1.0130575

BLOCK YD Q=  1391.8711
   1   1    0.00095412691
   2   2    0.018128411
   3   3    0.94619492

BLOCK YE Q=  1391.8711
   1   1    0.00016650212
   2   2    0.034427358
   3   3    0.57901153

BLOCK AU Q=  1391.8711
   1   1    0
   2   2    0
   3   3   -3062.3484

BLOCK AD Q=  1391.8711
   1   1    0
   2   2    0
   3   3    237.32123

BLOCK AE Q=  1391.8711
   1   1    0
   2   2    0
   3   3   -581.9051

BLOCK MSOFT Q=  1391.8711
   1    259.13373
   2   -1945.7622
   3    3000
   21    15665800
   22   -55702.843
   31    1184.9727
   32    1184.9727
   33    1138.1856
   34    1965.2632
   35    1965.2632
   36    1520.3598
   41    5000
   42    5000
   43    1120.1541
   44    5000
   45    5000
   46    1842.5544
   47    5000
   48    5000
   49    1297.5792

BLOCK MASS
   6    173.2
   23    91.1876
   24    80.429995
   15    1.777
   25    123.03418
   35    3963.9196
   36    3968.1211
   37    3965.3063
   1000001    5019.9597
   2000001    5013.2656
   1000002    5019.5167
   2000002    5016.2809
   1000003    5019.971
   2000003    5013.285
   1000004    5019.5274
   2000004    5016.2818
   1000005    1100.7309
   2000005    1316.8772
   1000006    1065.4686
   2000006    1818.266
   1000011    1201.1269
   2000011    1963.9388
   1000012    1198.109
   1000013    1201.1599
   2000013    1963.97
   1000014    1198.1424
   1000015    1163.8679
   2000015    1531.0574
   1000016    1161.0884
   1000021    3181.7737
   1000022    238.72147
   1000023   -282.34106
   1000025    306.0041
   1000035   -1982.2507
   1000024    281.94072
   1000037    1982.4369

BLOCK ALPHA
      -0.017604963

BLOCK HMIX Q=  1391.8711
   1    276.9065
   2    56.622317
   3    244.08781
   4    15745985

BLOCK STOPMIX
   1   1    0.97890339
   1   2    0.20432364
   2   1   -0.20432364
   2   2    0.97890339

BLOCK SBOTMIX
   1   1    0.99782791
   1   2    0.065874557
   2   1   -0.065874557
   2   2    0.99782791

BLOCK STAUMIX
   1   1    0.99961564
   1   2    0.027723102
   2   1   -0.027723102
   2   2    0.99961564

BLOCK NMIX
   1   1   -0.80972395
   1   2   -0.013932837
   1   3   -0.44635904
   1   4    0.38067915
   2   1    0.056283776
   2   2    0.032154119
   2   3   -0.70522939
   2   4   -0.70600975
   3   1    0.58410491
   3   2   -0.020964693
   3   3   -0.55080938
   3   4    0.59581117
   4   1    0.00084663305
   4   2   -0.99916589
   4   3   -0.0049135303
   4   4   -0.040529867

BLOCK UMIX
   1   1   -0.0069339262
   1   2    0.99997596
   2   1   -0.99997596
   2   2   -0.0069339262

BLOCK VMIX
   1   1    0.057271592
   1   2    0.99835863
   2   1    0.99835863
   2   2   -0.057271592

BLOCK HIGGSBOUNDSINPUTHIGGSCOUPLINGSFERMIONS
       0, 3206.0867,3,36,15,15

BLOCK HIGGSBOUNDSINPUTHIGGSCOUPLINGSBOSONS
       0,4,36,21,21,23

BLOCK SPHENOLOWENERGY
   1    0.000248372
   2    1.6088526e-06
   3    3.5239592e-05
   4    2.615575e-15
   5    1.1173252e-10
   6    2.3283246e-08
   7    8.7519743e-14
   8    3.7387807e-09
   9    7.8957213e-07
   10    9.5983115e-05
   11    0.99146883
   12    0.54235052
   13    19.372726
   14    0
   15    0
   16    0.0021586084
   17    2.2816725e-15
   18    2.480844e-11
   19    8.2917972e-11
   20   -6.6372487e-15
   21   -2.8376462e-10
   22   -7.8482058e-08
   23    0
   24    0
   25    0
   26    0
   27    0
   28    0
   29    0
   30    0
   31    0
   39    7.7703848e-05
   40    0
   41    0
   42    0

BLOCK FWCOEF Q=  160
   305   4422   0   0   -0.18881911
   305   4422   0   2   -0.09417115
   305   4322   0   2    0.00038825338
   305   6421   0   0   -0.095227835
   305   6421   0   2   -0.055036245
   305   6321   0   2    5.0195622e-05
   3051111   4133   0   0    1.5901888
   3051111   4133   0   2    1.5915919
   3051111   4233   0   2    0.00054308734
   3051111   4137   0   0   -4.4128809
   3051111   4137   0   2   -4.4101034
   3051111   4237   0   2   -0.0042363961
   3051313   4133   0   0    1.5901888
   3051313   4133   0   2    1.5915863
   3051313   4233   0   2    0.00054308345
   3051313   4137   0   0   -4.4128809
   3051313   4137   0   2   -4.410109
   3051313   4237   0   2   -0.0042364089
   3051212   4137   0   0    1.5053501
   3051212   4137   0   2    1.5047475
   3051212   4237   0   2    0.00092363802
   3051414   4137   0   0    1.5053501
   3051414   4137   0   2    1.5047475
   3051414   4237   0   2    0.00092363811
   3051616   4137   0   0    1.5053501
   3051616   4137   0   2    1.5047474
   3051616   4237   0   2    0.00092366354

BLOCK IMFWCOEF Q=  160
   305   4422   0   0    3.8587174e-07
   305   4422   0   2   -1.9950181e-05
   305   4322   0   2    8.3081113e-06
   305   6421   0   0    3.3052467e-07
   305   6421   0   2   -2.8722517e-05
   305   6321   0   2    2.7233732e-06
   3051111   4133   0   2   -1.6173297e-06
   3051111   4233   0   2    1.0561011e-05
   3051111   4137   0   2    1.415778e-05
   3051111   4237   0   2   -8.2393581e-05
   3051313   4133   0   2   -1.6172783e-06
   3051313   4233   0   2    1.0560952e-05
   3051313   4137   0   2    1.4157846e-05
   3051313   4237   0   2   -8.239382e-05
   3051212   4137   0   2   -3.029908e-06
   3051212   4237   0   2    1.7963829e-05
   3051414   4137   0   2   -3.0299108e-06
   3051414   4237   0   2    1.7963829e-05
   3051616   4137   0   2   -3.031258e-06
   3051616   4237   0   2    1.7963826e-05

DECAY 23  2.4952


DECAY 24  2.085


DECAY 1000011  1.3827727
    0.703212   2    1000022    11
    0.28324781   2    1000025    11
    0.01321194   2    1000023    11
    0.00032824868   2   -1000024    12

DECAY 2000011  9.5155267
    0.66000077   2    1000022    11
    0.33684823   2    1000025    11
    0.0031508933   2    1000023    11

DECAY 1000013  1.4081087
    0.69428196   2    1000022    13
    0.28349334   2    1000025    13
    0.021902348   2    1000023    13
    0.00032235344   2   -1000024    14

DECAY 2000013  9.6048133
    0.65480818   2    1000022    13
    0.33511607   2    1000025    13
    0.0054215663   2    1000023    13
    0.0046246117   2   -1000024    14

DECAY 1000015  8.2265008
    0.41781634   2    1000023    15
    0.29414794   2    1000022    15
    0.28697097   2    1000025    15
    0.0010647494   2   -1000024    16

DECAY 2000015  26.554788
    0.35846052   2   -1000024    16
    0.25048978   2    1000022    15
    0.20160517   2    1000025    15
    0.1793162   2    1000023    15
    0.0050350557   2    1000016   -24
    0.0026830097   2    1000015    25
    0.0024102713   2    1000015    23

DECAY 1000012  1.3941757
    0.61132763   2    1000022    12
    0.3665157   2    1000025    12
    0.022141986   2    1000024    11

DECAY 1000014  1.419433
    0.60046923   2    1000022    14
    0.36000679   2    1000025    14
    0.039509558   2    1000024    13

DECAY 1000016  8.2000947
    0.8399659   2    1000024    15
    0.10018718   2    1000022    16
    0.059844519   2    1000025    16

DECAY 2000001  143.91068
    0.98065759   2    1000021    1
    0.012693933   2    1000022    1
    0.0065863039   2    1000025    1

DECAY 1000001  189.75415
    0.7474096   2    1000021    1
    0.16590245   2   -1000037    2
    0.082847625   2    1000035    1
    0.0019668562   2    1000022    1
    0.0018054387   2    1000025    1

DECAY 2000003  143.97766
    0.98021534   2    1000021    3
    0.012733096   2    1000022    3
    0.0066516377   2    1000025    3
    0.00022620617   2   -1000024    4
    0.00017369981   2    1000023    3

DECAY 1000003  189.78984
    0.74727527   2    1000021    3
    0.16587192   2   -1000037    4
    0.082832375   2    1000035    3
    0.0020006924   2    1000022    3
    0.0018570395   2    1000025    3
    0.00014212698   2    1000023    3

DECAY 1000005  35.522497
    0.51360536   2   -1000024    6
    0.23957277   2    1000023    5
    0.13878419   2    1000025    5
    0.10803768   2    1000022    5

DECAY 2000005  43.157572
    0.48011352   2   -1000024    6
    0.24607121   2    1000023    5
    0.15869409   2    1000025    5
    0.1054186   2    1000022    5
    0.0052367779   2    1000006   -24
    0.0028831477   2    1000005    25
    0.0015826583   2    1000005    23

DECAY 2000002  152.58137
    0.9269874   2    1000021    2
    0.047918907   2    1000022    2
    0.024862554   2    1000025    2
    0.00023110681   2    1000023    2

DECAY 1000002  189.74517
    0.74720188   2    1000021    2
    0.16534868   2    1000037    1
    0.082788851   2    1000035    2
    0.0028981376   2    1000022    2
    0.00079712872   2    1000025    2
    0.00075950482   2    1000024    1
    0.00020582046   2    1000023    2

DECAY 2000004  152.585
    0.92696556   2    1000021    4
    0.047919465   2    1000022    4
    0.024866167   2    1000025    4
    0.0002369775   2    1000023    4

DECAY 1000004  189.78071
    0.74706748   2    1000021    4
    0.16531833   2    1000037    3
    0.08277363   2    1000035    4
    0.0028989815   2    1000022    4
    0.00093072028   2    1000024    3
    0.00080034201   2    1000025    4
    0.00021051376   2    1000023    4

DECAY 1000006  33.450444
    0.48545162   2    1000024    5
    0.25458871   2    1000023    6
    0.15555457   2    1000025    6
    0.1007455   2    1000022    6
    0.0020675494   3    1000022    24    5
    0.0014904271   2    1000022    4
    0.00010161569   2    1000023    4

DECAY 2000006  168.2574
    0.25180703   2    1000005    24
    0.21160124   2    1000024    5
    0.17013547   2    1000006    25
    0.13443946   2    1000006    23
    0.1039819   2    1000023    6
    0.089818582   2    1000025    6
    0.037761557   2    1000022    6
    0.00045475505   2    2000005    24

DECAY 1000024  7.0837442e-05
    0.33397223   3    1000022   -1    2
    0.33271191   3    1000022   -3    4
    0.11130637   3    1000022   -13    14
    0.11130624   3    1000022   -11    12
    0.11070325   3    1000022   -15    16

DECAY 1000037  63.823543
    0.20544467   2    1000006   -5
    0.18617658   2   -1000005    6
    0.066889309   2    1000024    25
    0.065300171   2    1000023    24
    0.064757823   2    1000024    23
    0.058818752   2    1000016   -15
    0.05864569   2   -1000015    16
    0.054902985   2    1000012   -11
    0.054899476   2    1000014   -13
    0.054761727   2   -1000011    12
    0.054758243   2   -1000013    14
    0.044039815   2    1000025    24
    0.020835882   2    1000022    24
    0.0035542408   3    1000024    6   -6
    0.0027112769   3    1000023   -5    6
    0.0017860952   3    1000025   -5    6
    0.00084226425   3    1000022   -5    6
    0.00068798825   2   -2000005    6
    0.00014557135   2    2000006   -5

DECAY 1000022 -1


DECAY 1000023  0.0001873427
    0.20263058   3    1000022    12   -12
    0.15152582   3    1000022    1   -1
    0.15151846   3    1000022    3   -3
    0.14062726   3    1000022    5   -5
    0.11817801   3    1000022    2   -2
    0.11697097   3    1000022    4   -4
    0.034172101   3    1000022    11   -11
    0.034170448   3    1000022    13   -13
    0.03377733   3    1000022    15   -15
    0.016429029   2    1000022    22

DECAY 1000025  3.3363196e-05
    0.097628059   3    1000023    12   -12
    0.073003867   3    1000023    1   -1
    0.072990602   3    1000023    3   -3
    0.070544801   3    1000024    1   -2
    0.070544801   3   -1000024   -1    2
    0.069603479   3    1000024    3   -4
    0.069603479   3   -1000024   -3    4
    0.056936027   3    1000023    2   -2
    0.054830002   3    1000023    4   -4
    0.052045091   3    1000023    5   -5
    0.042138321   2    1000023    22
    0.023518098   3    1000024    11   -12
    0.023518098   3   -1000024   -11    12
    0.023517998   3    1000024    13   -14
    0.023517998   3   -1000024   -13    14
    0.022932819   3    1000024    15   -16
    0.022932819   3   -1000024   -15    16
    0.016480885   3    1000023    11   -11
    0.016476621   3    1000023    13   -13
    0.016034003   3    1000022    5   -5
    0.01593314   3    1000022    12   -12
    0.015362246   3    1000023    15   -15
    0.011348802   3    1000022    1   -1
    0.011348752   3    1000022    3   -3
    0.0088786515   3    1000022    2   -2
    0.0088501948   3    1000022    4   -4
    0.0027594905   3    1000022    15   -15
    0.0022993152   3    1000022    13   -13
    0.0022978512   3    1000022    11   -11
    0.0021236886   2    1000022    22

DECAY 1000035  66.181215
    0.10308127   2    1000006   -6
    0.10308127   2   -1000006    6
    0.093935069   2    1000005   -5
    0.093935069   2   -1000005    5
    0.062575473   2    1000024   -24
    0.062575473   2   -1000024    24
    0.040209566   2    1000023    25
    0.029811569   2    1000025    25
    0.028423102   2    1000016   -16
    0.028423102   2   -1000016    16
    0.028198686   2    1000015   -15
    0.028198686   2   -1000015    15
    0.026913723   2    1000025    23
    0.026532158   2    1000012   -12
    0.026532158   2   -1000012    12
    0.026530455   2    1000014   -14
    0.026530455   2   -1000014    14
    0.026330595   2    1000011   -11
    0.026330595   2   -1000011    11
    0.026328919   2    1000013   -13
    0.026328919   2   -1000013    13
    0.023858087   2    1000023    23
    0.013298371   2    1000022    25
    0.011918821   2    1000022    23
    0.0028061093   3    1000024    5   -6
    0.0028061093   3   -1000024   -5    6
    0.001857935   3    1000023    6   -6
    0.0012458346   3    1000025    6   -6
    0.00064531568   3    1000022    6   -6
    0.00035358686   2    2000005   -5
    0.00035358686   2   -2000005    5

DECAY 1000021  288.51088
    0.12643831   2    1000005   -5
    0.12643831   2   -1000005    5
    0.12227007   2    1000006   -6
    0.12227007   2   -1000006    6
    0.11213632   2    2000005   -5
    0.11213632   2   -2000005    5
    0.078445308   2    2000006   -6
    0.078445308   2   -2000006    6
    0.060642448   2    1000006   -4
    0.060642448   2   -1000006    4

DECAY 25  0.003629092
    0.60267428   2   -5    5
    0.19781419   2   -24    24
    0.073356734   2    21    21
    0.06913709   2   -15    15
    0.029844428   2   -4    4
    0.023018755   2    23    23
    0.0023505214   2    22    22
    0.0013370272   2    22    23
    0.00023979906   2   -13    13
    0.00022639708   2   -3    3
    6.2596475e-07   2   -1    1
    1.5380148e-07   2   -2    2
    5.3909748e-09   2   -11    11

DECAY 35  160.8938
    0.65023887   2   -5    5
    0.1429263   2   -15    15
    0.056598675   2   -1000024    1000037
    0.056598675   2   -1000037    1000024
    0.026685902   2    1000023    1000035
    0.017669982   2    1000025    1000035
    0.012387037   2    1000022    1000035
    0.0088394774   2    1000022    1000023
    0.0067985158   2    1000022    1000022
    0.0064624871   2    1000025    1000025
    0.005984237   2    1000023    1000025
    0.0012418119   2   -2000015    1000015
    0.0012418119   2   -1000015    2000015
    0.0012285823   2   -2000006    1000006
    0.0012285823   2   -1000006    2000006
    0.00069279407   2   -1000024    1000024
    0.00063863078   2   -2000005    1000005
    0.00063863078   2   -1000005    2000005
    0.00049624767   2   -13    13
    0.00039427185   2    1000022    1000025
    0.00030451329   2   -1000006    1000006
    0.00029812315   2   -3    3
    0.00025861436   2   -6    6
    0.00011323069   2   -2000006    2000006
    1.1662454e-05   2   -1000005    1000005
    6.4095541e-06   2   -2000005    2000005
    5.3634169e-06   2    21    21
    4.0236761e-06   2   -2000015    2000015
    3.9807226e-06   2   -1000015    1000015
    1.2769483e-06   2    1000023    1000023
    8.2419594e-07   2   -1    1
    1.1120239e-07   2    25    25
    8.5555803e-08   2   -1000037    1000037
    4.2819108e-08   2    1000035    1000035
    3.1746306e-08   2    23    23
    1.8147563e-08   2    22    23
    1.11444e-08   2   -11    11
    1.0733213e-08   2    22    22
    1.0455608e-08   2   -1000011    1000011
    1.0287395e-08   2   -1000013    1000013
    6.7765284e-09   2   -24    24
    4.3801813e-09   2   -4    4
    1.0782002e-09   2   -2000011    2000011
    1.0579466e-09   2   -2000013    2000013
    2.5375774e-10   2   -2000013    1000013
    2.5375774e-10   2   -1000013    2000013
    2.2581824e-14   2   -2    2
    5.9354304e-15   2   -2000011    1000011
    5.9354304e-15   2   -1000011    2000011

DECAY 36  148.16655
    0.6353479   2   -5    5
    0.13967835   2   -15    15
    0.061607029   2   -1000024    1000037
    0.061607029   2   -1000037    1000024
    0.032499278   2    1000023    1000035
    0.016974811   2    1000025    1000035
    0.012292212   2    1000022    1000035
    0.0088134525   2    1000022    1000023
    0.0079669428   2    1000022    1000022
    0.0077637734   2    1000025    1000025
    0.0059278766   2    1000023    1000025
    0.0015720774   2   -2000006    1000006
    0.0015720774   2   -1000006    2000006
    0.0013527101   2   -2000015    1000015
    0.0013527101   2   -1000015    2000015
    0.00076136458   2   -1000024    1000024
    0.00070278017   2   -2000005    1000005
    0.00070278017   2   -1000005    2000005
    0.00048960153   2    1000022    1000025
    0.00048497171   2   -13    13
    0.00029132458   2   -3    3
    0.00022465182   2   -6    6
    9.6034153e-06   2    21    21
    1.6524529e-06   2   -1000037    1000037
    1.3195764e-06   2    1000023    1000023
    8.2769815e-07   2    1000035    1000035
    8.054023e-07   2   -1    1
    7.2205554e-08   2    23    25
    1.089122e-08   2   -11    11
    4.7086887e-09   2    22    23
    3.7526023e-09   2   -4    4
    2.8382513e-09   2    22    22
    2.7465634e-10   2   -2000013    1000013
    2.7465634e-10   2   -1000013    2000013
    9.7086958e-12   2    23    35
    1.9346241e-14   2   -2    2
    6.4242399e-15   2   -2000011    1000011
    6.4242399e-15   2   -1000011    2000011
    1.3468975e-40   2    25    25

DECAY 37  179.22175
    0.67090699   2   -5    6
    0.14310403   2   -15    16
    0.050899375   2    1000024    1000035
    0.050899171   2    1000023    1000037
    0.029883609   2    1000025    1000037
    0.021276645   2    1000022    1000037
    0.017731471   2    1000022    1000024
    0.0077334938   2    1000024    1000025
    0.0022365437   2   -2000015    1000016
    0.0016157859   2   -1000005    2000006
    0.0014131962   2   -2000005    1000006
    0.00099497949   2   -5    4
    0.0005059237   2   -13    14
    0.0002761675   2    1000023    1000024
    0.0002472966   2   -3    4
    0.00014623935   2   -2000005    2000006
    0.00010659247   2   -1000005    1000006
    1.1618709e-05   2   -3    2
    7.1051794e-06   2   -5    2
    2.138547e-06   2   -1000015    1000016
    7.4280544e-07   2   -3    6
    6.8601932e-07   2   -1    2
    5.958773e-08   2    24    25
    3.6879791e-08   2   -1000011    1000012
    3.6667524e-08   2   -1000013    1000014
    3.229362e-08   2   -1    4
    1.7174548e-08   2   -1    6
    1.1833608e-08   2   -11    12
    4.5927224e-10   2   -2000013    1000014
    2.6167953e-13   2    1000035    1000037
    3.8951791e-14   2    24    35
    1.0742746e-14   2   -2000011    1000012

DECAY 6  2.43
    1   2    5    24

DECAY 15 -1
