BLOCK SPINFO
   1   SPheno
   2   v4.0.5be

BLOCK SPHENOINFO
   1   2
   2   2

BLOCK MODSEL
   1   0

BLOCK MINPAR
   3    36.206994
   4   -1

BLOCK EXTPAR
   0    4408.3078
   1   -2814.9239
   2   -2041.7008
   3    2353.8524
   11   -6482.221
   12   -2541.9208
   13   -7626.7597
   23   -1276.0108
   25    35.105151
   26    3636.3513
   31    4324.6253
   32    4324.6253
   33    4426.5427
   34    2919.9759
   35    2919.9759
   36    4373.0659
   41    2724.1652
   42    2724.1652
   43    4125.7768
   44    1959.525
   45    1959.525
   46    4766.0875
   47    3467.2588
   48    3467.2588
   49    4011.3798

BLOCK SMINPUTS
   1    127.90897
   2    1.1663787e-05
   3    0.1184
   4    91.1876
   5    4.18
   6    173.2
   7    1.777
   8    0
   11    0.00051099893
   12    0
   13    0.10565837
   14    0
   21    0.005
   22    0.0025
   23    0.095
   24    1.27

BLOCK GAUGE Q=  4408.3078
   1    0.35536298
   2    0.66519887
   3    1.219778

BLOCK YU Q=  4408.3078
   1   1    8.3877732e-06
   2   2    0.0042609888
   3   3    1.0133104

BLOCK YD Q=  4408.3078
   1   1    0.00059169483
   2   2    0.011242202
   3   3    0.58677586

BLOCK YE Q=  4408.3078
   1   1    0.00010325507
   2   2    0.021349875
   3   3    0.35906977

BLOCK AU Q=  4408.3078
   1   1    0
   2   2    0
   3   3   -6482.2274

BLOCK AD Q=  4408.3078
   1   1    0
   2   2    0
   3   3   -2541.9216

BLOCK AE Q=  4408.3078
   1   1    0
   2   2    0
   3   3   -7626.7575

BLOCK MSOFT Q=  4408.3078
   1   -2814.9239
   2   -2041.7008
   3    2353.8524
   21    11815836
   22   -1265797.7
   31    4324.6253
   32    4324.6253
   33    4426.5427
   34    2919.9759
   35    2919.9759
   36    4373.0659
   41    2724.1652
   42    2724.1652
   43    4125.7768
   44    1959.525
   45    1959.525
   46    4766.0875
   47    3467.2588
   48    3467.2588
   49    4011.3798

BLOCK MASS
   6    173.2
   23    91.1876
   24    80.429995
   15    1.777
   25    125.46872
   35    3635.332
   36    3636.3513
   37    3636.4904
   1000001    2863.1637
   2000001    3558.9888
   1000002    2862.076
   2000002    2124.2541
   1000003    2863.1565
   2000003    3558.9767
   1000004    2862.069
   2000004    2124.2534
   1000005    4063.8481
   2000005    4148.0644
   1000006    4129.178
   2000006    4706.3065
   1000011    4340.0163
   2000011    2933.9469
   1000012    4338.8728
   1000013    4339.9913
   2000013    2933.8877
   1000014    4338.8473
   1000015    4361.7848
   2000015    4432.7656
   1000016    4430.7921
   1000021    2640.0348
   1000022   -1291.7134
   1000023    1297.2288
   1000025   -2097.0904
   1000035   -2771.8954
   1000024    1293.0749
   1000037    2097.1545

BLOCK ALPHA
      -0.027669761

BLOCK HMIX Q=  4408.3078
   1   -1276.0108
   2    35.105151
   3    242.81851
   4    13223051

BLOCK STOPMIX
   1   1    0.98536671
   1   2    0.17044779
   2   1   -0.17044779
   2   2    0.98536671

BLOCK SBOTMIX
   1   1   -0.1400851
   1   2    0.99013947
   2   1   -0.99013947
   2   2   -0.1400851

BLOCK STAUMIX
   1   1   -0.10894381
   1   2    0.99404791
   2   1   -0.99404791
   2   2   -0.10894381

BLOCK NMIX
   1   1   -0.02153949
   1   2    0.07087913
   1   3    0.70635507
   1   4   -0.70397068
   2   1    0.0074271076
   2   2   -0.015997155
   2   3    0.70671885
   2   4    0.70727463
   3   1    0.0039103684
   3   2    0.99735408
   3   3   -0.038840288
   3   4    0.061326884
   4   1    0.99973276
   4   2   -0.0022551117
   4   3    0.010120235
   4   4   -0.020661506

BLOCK UMIX
   1   1   -0.055103421
   1   2   -0.99848065
   2   1   -0.99848065
   2   2    0.055103421

BLOCK VMIX
   1   1    0.087007948
   1   2    0.99620762
   2   1    0.99620762
   2   2   -0.087007948

BLOCK HIGGSBOUNDSINPUTHIGGSCOUPLINGSFERMIONS
       0, 1232.3716,3,36,15,15

BLOCK HIGGSBOUNDSINPUTHIGGSCOUPLINGSBOSONS
       0,4,36,21,21,23

BLOCK SPHENOLOWENERGY
   1    0.00033258882
   2    1.5888417e-06
   3    3.5251461e-05
   4    2.0476711e-15
   5    8.747494e-11
   6    1.8356194e-08
   7    7.0744586e-14
   8    3.0222316e-09
   9    6.4252687e-07
   10    9.6128023e-05
   11    0.99296567
   12    0.54196384
   13    19.356506
   14    0
   15    0
   16    0.002157267
   17    2.281659e-15
   18    2.4803145e-11
   19    8.290255e-11
   20    9.3383475e-16
   21    3.9923482e-11
   22    1.1334495e-08
   23    0
   24    0
   25    0
   26    0
   27    0
   28    0
   29    0
   30    0
   31    0
   39    6.3410016e-05
   40    0
   41    0
   42    0

BLOCK FWCOEF Q=  160
   305   4422   0   0   -0.18881911
   305   4422   0   2   -0.20340788
   305   4322   0   2   -0.00037083559
   305   6421   0   0   -0.095227835
   305   6421   0   2   -0.1040675
   305   6321   0   2   -0.00022939213
   3051111   4133   0   0    1.6302779
   3051111   4133   0   2    1.6303735
   3051111   4233   0   2    0.00041079636
   3051111   4137   0   0   -4.45297
   3051111   4137   0   2   -4.4512876
   3051111   4237   0   2   -0.0030255673
   3051313   4133   0   0    1.6302779
   3051313   4133   0   2    1.6303732
   3051313   4233   0   2    0.00041079598
   3051313   4137   0   0   -4.45297
   3051313   4137   0   2   -4.451288
   3051313   4237   0   2   -0.0030255679
   3051212   4137   0   0    1.5053501
   3051212   4137   0   2    1.5049902
   3051212   4237   0   2    0.00065371423
   3051414   4137   0   0    1.5053501
   3051414   4137   0   2    1.5049902
   3051414   4237   0   2    0.00065371425
   3051616   4137   0   0    1.5053501
   3051616   4137   0   2    1.5049902
   3051616   4237   0   2    0.00065372041

BLOCK IMFWCOEF Q=  160
   305   4422   0   0    3.8577542e-07
   305   4422   0   2    4.3451205e-06
   305   4322   0   2   -4.9148739e-06
   305   6421   0   0    3.3044216e-07
   305   6421   0   2    4.9851563e-05
   305   6321   0   2   -1.8348691e-06
   3051111   4133   0   2   -1.3412622e-06
   3051111   4233   0   2    7.7742601e-06
   3051111   4137   0   2    1.3775533e-05
   3051111   4237   0   2   -5.7258965e-05
   3051313   4133   0   2   -1.3412642e-06
   3051313   4233   0   2    7.7742552e-06
   3051313   4137   0   2    1.3775543e-05
   3051313   4237   0   2   -5.7258977e-05
   3051212   4137   0   2   -2.9112825e-06
   3051212   4237   0   2    1.2371564e-05
   3051414   4137   0   2   -2.9112826e-06
   3051414   4237   0   2    1.2371564e-05
   3051616   4137   0   2   -2.9112321e-06
   3051616   4237   0   2    1.2371564e-05

DECAY 23  2.4952


DECAY 24  2.085


DECAY 2000011  0.17503094
    0.97128439   2    1000035    11
    0.025397   2    1000022    11
    0.0030082103   2    1000023    11
    0.00030809674   2    1000025    11

DECAY 1000011  35.638561
    0.62793302   2   -1000037    12
    0.31458377   2    1000025    11
    0.05314649   2    1000035    11
    0.0027028242   2   -1000024    12
    0.0015695651   2    1000022    11

DECAY 2000013  0.20938925
    0.81134714   2    1000035    13
    0.082241331   2   -1000024    14
    0.062430209   2    1000022    13
    0.043585658   2    1000023    13
    0.00030338733   2    1000025    13

DECAY 1000013  35.671657
    0.62734242   2   -1000037    14
    0.31428883   2    1000025    13
    0.053096079   2    1000035    13
    0.0027002949   2   -1000024    14
    0.0020253754   2    1000022    13
    0.00052123174   2    1000023    13

DECAY 1000015  26.715512
    0.35096127   2   -1000024    16
    0.2885455   2    1000035    15
    0.18001072   2    1000022    15
    0.17245045   2    1000023    15
    0.0053304483   2   -1000037    16
    0.0027016144   2    1000025    15

DECAY 2000015  46.56432
    0.50060768   2   -1000037    16
    0.25099399   2    1000025    15
    0.10282213   2    1000023    15
    0.099866756   2    1000022    15
    0.045697971   2    1000035    15

DECAY 1000012  35.65358
    0.62444876   2    1000037    11
    0.31164546   2    1000025    12
    0.053975518   2    1000035    12
    0.0067334536   2    1000024    11
    0.0030197665   2    1000022    12
    0.00017704213   2    1000023    12

DECAY 1000014  35.685736
    0.62387998   2    1000037    13
    0.31136058   2    1000025    14
    0.05392569   2    1000035    14
    0.0076398521   2    1000024    13
    0.0030170208   2    1000022    14
    0.00017688115   2    1000023    14

DECAY 1000016  46.886542
    0.49757666   2    1000037    15
    0.24809825   2    1000025    16
    0.20750059   2    1000024    15
    0.044320813   2    1000035    16
    0.0023637101   2    1000022    16
    0.00013858937   2    1000023    16

DECAY 1000001  13.255841
    0.40724304   2   -1000037    2
    0.38252189   2    1000021    1
    0.20290739   2    1000025    1
    0.003658422   2   -1000024    2
    0.0033670504   2    1000022    1
    0.00018059079   2    1000023    1
    0.00012161689   2    1000035    1

DECAY 2000001  57.129937
    0.99460569   2    1000021    1
    0.0053798175   2    1000035    1

DECAY 1000003  13.260604
    0.40709093   2   -1000037    4
    0.38236156   2    1000021    3
    0.20283171   2    1000025    3
    0.0037056583   2   -1000024    4
    0.0035373122   2    1000022    3
    0.00035127181   2    1000023    3
    0.0001215538   2    1000035    3

DECAY 2000003  57.142419
    0.99436852   2    1000021    3
    0.005378512   2    1000035    3
    0.00011762807   2   -1000024    4

DECAY 1000005  153.87258
    0.69591274   2    1000021    5
    0.15104335   2   -1000024    6
    0.074867109   2    1000022    5
    0.072436207   2    1000023    5
    0.0040963899   2    1000035    5
    0.0011146164   2   -1000037    6
    0.00052958064   2    1000025    5

DECAY 2000005  236.93683
    0.48941039   2    1000021    5
    0.28373995   2   -1000024    6
    0.086812629   2   -1000037    6
    0.049064714   2    1000023    5
    0.047865199   2    1000022    5
    0.04224953   2    1000025    5
    0.00085758298   2    1000035    5

DECAY 2000002  0.00097714982
    0.89464563   2    1000022    2
    0.10530523   2    1000023    2

DECAY 1000002  13.238788
    0.40504518   2    1000037    1
    0.37957196   2    1000021    2
    0.20330133   2    1000025    2
    0.0091269168   2    1000024    1
    0.002712151   2    1000022    2
    0.00012936857   2    1000023    2
    0.00011309933   2    1000035    2

DECAY 2000004  0.0015820802
    0.64861754   2    1000022    4
    0.19070634   2    1000024    3
    0.16064241   2    1000023    4

DECAY 1000004  13.243459
    0.40489731   2    1000037    3
    0.37940798   2    1000021    4
    0.2032261   2    1000025    4
    0.0094655342   2    1000024    3
    0.0027359972   2    1000022    4
    0.0001540383   2    1000023    4
    0.00011303229   2    1000035    4

DECAY 1000006  243.66527
    0.47699071   2    1000021    6
    0.13815477   2    1000023    6
    0.13572935   2    1000022    6
    0.095059893   2    1000024    5
    0.083037402   2    1000037    5
    0.041372024   2    1000025    6
    0.0184757   3    1000022    24    5
    0.0098311761   2    1000021    4
    0.0013429584   2    1000035    6

DECAY 2000006  390.97958
    0.43467405   2    1000021    6
    0.20857179   2    1000024    5
    0.10658516   2    1000022    6
    0.10594252   2    1000023    6
    0.055637804   2    2000005    24
    0.045903101   2    1000006    25
    0.030053203   2    1000006    23
    0.010787756   2    1000035    6
    0.0016624565   2    1000005    24
    0.00010930151   2    1000037    5

DECAY 1000024  1.1055318e-11
    0.60351664   3    1000022   -1    2
    0.20118798   3    1000022   -11    12
    0.19529538   3    1000022   -13    14

DECAY 1000037  15.99489
    0.25016557   2    1000024    25
    0.24842786   2    1000022    24
    0.24214053   2    1000024    23
    0.24182926   2    1000023    24
    0.0060210566   3    1000024    6   -6
    0.0058108077   3    1000023   -5    6
    0.0055978737   3    1000022   -5    6

DECAY 1000022 -1


DECAY 1000023  6.4343432e-08
    0.74915769   2    1000022    22
    0.055617792   3    1000022    12   -12
    0.041589846   3    1000022    1   -1
    0.041446352   3    1000022    3   -3
    0.032436483   3    1000022    2   -2
    0.015516044   3    1000022    4   -4
    0.0093856659   3    1000022    11   -11
    0.0093347749   3    1000022    13   -13
    0.0089920032   3    1000024    1   -2
    0.0089920032   3   -1000024   -1    2
    0.0057346979   3    1000024    3   -4
    0.0057346979   3   -1000024   -3    4
    0.0029973347   3    1000024    11   -12
    0.0029973347   3   -1000024   -11    12
    0.0029876776   3    1000024    13   -14
    0.0029876776   3   -1000024   -13    14
    0.0016139789   3    1000022    15   -15
    0.0012389733   3    1000024    15   -16
    0.0012389733   3   -1000024   -15    16

DECAY 1000025  19.46398
    0.20655326   2    1000024   -24
    0.20655326   2   -1000024    24
    0.19371026   2    1000023    23
    0.19347408   2    1000022    25
    0.17629569   2    1000023    25
    0.009713418   2    1000022    23
    0.0049592012   3    1000024    5   -6
    0.0049592012   3   -1000024   -5    6
    0.0019521119   3    1000022    6   -6
    0.0017907729   3    1000023    6   -6

DECAY 1000035  14.919457
    0.1191865   2    1000024   -24
    0.1191865   2   -1000024    24
    0.11013503   2    1000023    23
    0.10594407   2    2000004   -4
    0.10594407   2   -2000004    4
    0.10594389   2    2000002   -2
    0.10594389   2   -2000002    2
    0.10207532   2    1000022    25
    0.092866103   2    1000023    25
    0.012809462   2    1000022    23
    0.0046325937   3    1000024    5   -6
    0.0046325937   3   -1000024   -5    6
    0.0030920343   3    1000022    6   -6
    0.0028844933   3    1000023    6   -6
    0.0015608021   2    1000025    25
    0.0015004643   2    1000037   -24
    0.0015004643   2   -1000037    24

DECAY 1000021  19.443432
    0.24979644   2    2000004   -4
    0.24979644   2   -2000004    4
    0.24979641   2    2000002   -2
    0.24979641   2   -2000002    2
    0.00016261339   3    1000024    5   -6
    0.00016261339   3   -1000024   -5    6
    0.00010580907   3    1000022    6   -6
    0.00010292101   3    1000023    6   -6

DECAY 25  0.0039381243
    0.56512879   2   -5    5
    0.23640005   2   -24    24
    0.072224516   2    21    21
    0.065092026   2   -15    15
    0.028882852   2    23    23
    0.027948263   2   -4    4
    0.0023463954   2    22    22
    0.0015381007   2    22    23
    0.00022575392   2   -13    13
    0.00021251394   2   -3    3
    5.8758023e-07   2   -1    1
    1.4402274e-07   2   -2    2
    5.0751929e-09   2   -11    11

DECAY 35  79.410109
    0.73811191   2   -5    5
    0.12860687   2   -15    15
    0.043267807   2   -1000024    1000037
    0.043267807   2   -1000037    1000024
    0.037021485   2    1000023    1000025
    0.0057686768   2    1000022    1000025
    0.0012035694   2   -6    6
    0.0011140762   2   -1000024    1000024
    0.00047929397   2    1000022    1000022
    0.00044765433   2   -13    13
    0.00035610306   2   -3    3
    0.00031398217   2    1000022    1000023
    2.997509e-05   2    1000023    1000023
    4.9119194e-06   2    21    21
    4.3527513e-06   2    25    25
    9.8475012e-07   2   -1    1
    3.4526675e-07   2    23    23
    8.1712448e-08   2   -24    24
    5.4939145e-08   2    22    23
    2.361477e-08   2   -4    4
    2.2732161e-08   2    22    22
    1.0053468e-08   2   -11    11
    1.2177003e-13   2   -2    2

DECAY 36  75.714892
    0.73241384   2   -5    5
    0.12761472   2   -15    15
    0.044750667   2   -1000024    1000037
    0.044750667   2   -1000037    1000024
    0.038668451   2    1000022    1000025
    0.0059923832   2    1000023    1000025
    0.0024605369   2   -1000024    1000024
    0.0012430884   2   -6    6
    0.0010987783   2    1000022    1000022
    0.00044420071   2   -13    13
    0.00035335232   2   -3    3
    0.00014010298   2    1000022    1000023
    5.5615133e-05   2    1000023    1000023
    1.1667827e-05   2    21    21
    9.771431e-07   2   -1    1
    6.9259841e-07   2    23    25
    1.5097423e-07   2    22    23
    7.3372029e-08   2    22    22
    2.4095859e-08   2   -4    4
    9.9758835e-09   2   -11    11
    1.242425e-13   2   -2    2
    1.5970594e-14   2    23    35
    1.6334466e-36   2    25    25

DECAY 37  74.303364
    0.73000489   2   -5    6
    0.12830814   2   -15    16
    0.046736252   2    1000022    1000037
    0.046609468   2    1000024    1000025
    0.045869689   2    1000023    1000037
    0.0010806661   2   -5    4
    0.00056502092   2    1000023    1000024
    0.00045361498   2   -13    14
    0.00034105782   2   -3    4
    1.6008055e-05   2   -3    2
    7.7170703e-06   2   -5    2
    3.1097818e-06   2    1000022    1000024
    2.5638484e-06   2   -3    6
    9.4660175e-07   2   -1    2
    7.0613492e-07   2    24    25
    9.4330688e-08   2   -1    6
    4.5162631e-08   2   -1    4
    1.0610101e-08   2   -11    12
    3.822201e-14   2    24    35

DECAY 6  2.43
    1   2    5    24

DECAY 15 -1
