BLOCK DCINFO
   1   SDECAY/HDECAY
   2   1.3b /3.4

BLOCK SPINFO
   1   SOFTSUSY
   2   3.4.0

BLOCK MODSEL
   1   0

BLOCK SMINPUTS
   1    127.90897
   2    1.1663787e-05
   3    0.1184
   4    91.1876
   5    4.18
   6    173.2
   7    1.777

BLOCK MINPAR
   3    42.66

BLOCK EXTPAR
   0   -1
   1   -780.14
   2   -1667.92
   3    3166.77
   11   -4152.37
   12    2699.92
   13   -3875.07
   23   -452.18
   26    3304.67
   31    2055.88
   32    2055.88
   33    1833.2
   34    1422.89
   35    1422.89
   36    3505.43
   41    3333.88
   42    3333.88
   43    2465.91
   44    2200.14
   45    2200.14
   46    3312.2
   47    1565.38
   48    1565.38
   49    270.12

BLOCK MASS
   24    80.376396
   25    127.50552
   35    3304.678
   36    3304.6702
   37    3305.8533
   5    4.8187603
   1000001    3434.7231
   2000001    1701.5088
   1000002    3433.9514
   2000002    2315.5662
   1000003    3434.7231
   2000003    1701.5088
   1000004    3433.9514
   2000004    2315.5662
   1000005    543.7116
   2000005    2544.261
   1000006    2532.3918
   2000006    3333.6864
   1000011    2069.5611
   2000011    1433.0038
   1000012    2067.7273
   1000013    2069.5611
   2000013    1433.0038
   1000014    2067.7273
   1000015    1842.4434
   2000015    3496.3064
   1000016    1840.4561
   1000021    3261.1584
   1000022   -464.72621
   1000023    472.49034
   1000025   -774.05562
   1000035   -1712.4865
   1000024    469.29759
   1000037    1712.6502

BLOCK NMIX
   1   1   -0.10258717
   1   2    0.04527982
   1   3    0.70671047
   1   4   -0.6985599
   2   1    0.024299628
   2   2   -0.025120856
   2   3    0.70515779
   2   4    0.70818851
   3   1    0.99442409
   3   2    0.0077701868
   3   3    0.055638116
   3   4   -0.089245436
   4   1   -0.0024746996
   4   2    0.99862821
   4   3   -0.014738092
   4   4    0.050183262

BLOCK UMIX
   1   1    0.020828959
   1   2    0.99978305
   2   1   -0.99978305
   2   2    0.020828959

BLOCK VMIX
   1   1   -0.070942703
   1   2   -0.99748039
   2   1    0.99748039
   2   2   -0.070942703

BLOCK STOPMIX
   1   1    0.9921363
   1   2    0.12516214
   2   1   -0.12516214
   2   2    0.9921363

BLOCK SBOTMIX
   1   1   -0.0093059366
   1   2    0.9999567
   2   1   -0.9999567
   2   2   -0.0093059366

BLOCK STAUMIX
   1   1    0.99999472
   1   2   -0.0032499188
   2   1    0.0032499188
   2   2    0.99999472

BLOCK ALPHA
      -0.023836357

BLOCK HMIX Q=  2857.484
   1   -465.08201
   2    42.053654
   3    242.33686
   4    11110000

BLOCK GAUGE Q=  2857.484
   1    0.365087
   2    0.63787737
   3    1.0113497

BLOCK AU Q=  2857.484
   1   1    0
   2   2    0
   3   3   -4152.37

BLOCK AD Q=  2857.484
   1   1    0
   2   2    0
   3   3    2699.92

BLOCK AE Q=  2857.484
   1   1    0
   2   2    0
   3   3   -3875.07

BLOCK YU Q=  2857.484
   1   1    0
   2   2    0
   3   3    0.81589822

BLOCK YD Q=  2857.484
   1   1    0
   2   2    0
   3   3    0.62640279

BLOCK YE Q=  2857.484
   1   1    0
   2   2    0
   3   3    0.44554289

BLOCK MSOFT Q=  2857.484
   1   -780.14
   2   -1667.92
   3    3166.77
   21    11044700
   22   -81697.118
   31    2055.88
   32    2055.88
   33    1833.2
   34    1422.89
   35    1422.89
   36    3505.43
   41    3333.88
   42    3333.88
   43    2465.91
   44    2200.14
   45    2200.14
   46    3312.2
   47    1565.38
   48    1565.38
   49    270.11988

BLOCK HIGGSBOUNDSINPUTHIGGSCOUPLINGSFERMIONS
       0, 1768.5098,3,36,15,15

BLOCK HIGGSBOUNDSINPUTHIGGSCOUPLINGSBOSONS
       0,4,36,21,21,23

DECAY 6  1.4335988
    1   2    5    24

DECAY 1000021  172.1776
    0.16684268   2    1000005   -5
    0.16684268   2   -1000005    5
    0.095539461   2    2000001   -1
    0.095539461   2   -2000001    1
    0.095539461   2    2000003   -3
    0.095539461   2   -2000003    3
    0.044347033   2    2000002   -2
    0.044347033   2   -2000002    2
    0.044346986   2    2000004   -4
    0.044346986   2   -2000004    4
    0.027458423   2    2000005   -5
    0.027458423   2   -2000005    5
    0.025925954   2    1000006   -6
    0.025925954   2   -1000006    6

DECAY 1000006  59.124097
    0.30938097   2    1000024    5
    0.25894435   2    1000023    6
    0.25216241   2    1000022    6
    0.102348   2    1000037    5
    0.051541449   2    1000035    6
    0.0129343   2    1000025    6
    0.012688515   2    1000005    24

DECAY 2000006  144.94739
    0.29331513   2    1000024    5
    0.17969718   2    2000005    24
    0.14760648   2    1000023    6
    0.14477477   2    1000022    6
    0.094451561   2    1000006    23
    0.091898424   2    1000006    25
    0.047865862   2    1000025    6
    0.00019998622   2    1000005    24
    0.00012298434   2    1000037    5
    6.7618735e-05   2    1000035    6

DECAY 1000005  0.27933381
    0.54863537   2    1000022    5
    0.45136463   2    1000023    5

DECAY 2000005  59.892033
    0.51689537   2   -1000024    6
    0.15510988   2    1000022    5
    0.15396164   2    1000023    5
    0.10351698   2   -1000037    6
    0.051391176   2    1000035    5
    0.0068142571   2    1000005    25
    0.0066574425   2    1000005    23
    0.005653263   2    1000025    5

DECAY 1000002  25.584984
    0.58683427   2    1000037    1
    0.29385158   2    1000035    2
    0.095486866   2    1000021    2
    0.0182585   2    1000025    2
    0.0050288233   2    1000024    1
    0.00033042091   2    1000022    2
    0.00020954205   2    1000023    2

DECAY 2000002  4.3006985
    0.98706824   2    1000025    2
    0.012245041   2    1000022    2
    0.0006851109   2    1000023    2
    1.6113839e-06   2    1000035    2

DECAY 1000001  25.564065
    0.59032808   2   -1000037    2
    0.29479795   2    1000035    1
    0.096377816   2    1000021    1
    0.015514712   2    1000025    1
    0.0021048718   2    1000022    1
    0.00044261741   2    1000023    1
    0.00043394981   2   -1000024    2

DECAY 2000001  0.64248279
    0.98495929   2    1000025    1
    0.014245733   2    1000022    1
    0.00079497418   2    1000023    1

DECAY 1000004  25.856557
    0.60369136   2    1000037    3
    0.30229281   2    1000035    4
    0.069357951   2    1000021    4
    0.018888069   2    1000025    4
    0.0052103553   2    1000024    3
    0.0003423569   2    1000022    4
    0.00021710231   2    1000023    4

DECAY 2000004  4.3142624
    0.98704932   2    1000025    4
    0.012263001   2    1000022    4
    0.00068608951   2    1000023    4
    1.5902865e-06   2    1000035    4

DECAY 1000003  25.828018
    0.60746884   2   -1000037    4
    0.30335827   2    1000035    3
    0.070028313   2    1000021    3
    0.016054525   2    1000025    3
    0.0021815673   2    1000022    3
    0.00045872578   2    1000023    3
    0.00044975041   2   -1000024    4

DECAY 2000003  0.6331081
    0.98493058   2    1000025    3
    0.014272954   2    1000022    3
    0.00079646131   2    1000023    3

DECAY 1000011  4.5628688
    0.45202445   2    1000025    11
    0.36454782   2   -1000037    12
    0.18148828   2    1000035    11
    0.0014332666   2   -1000024    12
    0.00029880567   2    1000022    11
    0.00020737951   2    1000023    11

DECAY 2000011  3.837115
    0.98238081   2    1000025    11
    0.016690169   2    1000022    11
    0.00092902502   2    1000023    11

DECAY 1000013  4.5628688
    0.45202445   2    1000025    13
    0.36454782   2   -1000037    14
    0.18148828   2    1000035    13
    0.0014332667   2   -1000024    14
    0.00029880567   2    1000022    13
    0.00020737951   2    1000023    13

DECAY 2000013  3.8371149
    0.98238081   2    1000025    13
    0.01669017   2    1000022    13
    0.00092902502   2    1000023    13

DECAY 1000015  8.4650446
    0.37691821   2    1000022    15
    0.37299766   2    1000023    15
    0.20049425   2    1000025    15
    0.032536024   2   -1000037    16
    0.016231865   2    1000035    15
    0.00082198981   2   -1000024    16

DECAY 2000015  43.621833
    0.38109531   2    1000025    15
    0.30503215   2   -1000024    16
    0.15671294   2    1000022    15
    0.15199255   2    1000023    15
    0.0024397337   2    1000016   -24
    0.0012939703   2    1000015    25
    0.0012536775   2    1000015    23
    0.00011871986   2   -1000037    16
    6.0943039e-05   2    1000035    15

DECAY 1000012  4.5860973
    0.42520981   2    1000025    12
    0.35793645   2    1000037    11
    0.1800399   2    1000035    12
    0.017792177   2    1000022    12
    0.016524697   2    1000024    11
    0.0024969578   2    1000023    12

DECAY 1000014  4.5860972
    0.42520982   2    1000025    14
    0.35793644   2    1000037    13
    0.1800399   2    1000035    14
    0.017792177   2    1000022    14
    0.016524697   2    1000024    13
    0.0024969578   2    1000023    14

DECAY 1000016  8.4877989
    0.75590663   2    1000024    15
    0.18739016   2    1000025    16
    0.031403452   2    1000037    15
    0.01581366   2    1000035    16
    0.0083196868   2    1000022    16
    0.0011664124   2    1000023    16

DECAY 1000024  2.2130273e-09
    0.35358906   3    1000022    2   -1
    0.35358906   3    1000022    4   -3
    0.11786413   3    1000022   -11    12
    0.11786413   3    1000022   -13    14
    0.05709363   3    1000022   -15    16

DECAY 1000037  13.723333
    0.25383716   2    1000024    23
    0.25235346   2    1000024    25
    0.24717399   2    1000023    24
    0.23970913   2    1000022    24
    0.0067683726   2    1000025    24
    0.00015788482   2   -1000005    6

DECAY 1000022 -1


DECAY 1000023  2.4220414e-08
    0.17354129   3    1000022   -1    1
    0.17354129   3    1000022   -3    3
    0.13366085   3    1000022   -2    2
    0.13366085   3    1000022   -4    4
    0.079777364   3    1000022   -16    16
    0.079777082   3    1000022   -12    12
    0.079777082   3    1000022   -14    14
    0.039893915   3    1000022   -11    11
    0.039893915   3    1000022   -13    13
    0.028138155   3    1000022   -15    15
    0.0086807074   2    1000022    22
    0.0054180575   3    1000024   -2    1
    0.0054180575   3   -1000024   -1    2
    0.0054180575   3    1000024   -4    3
    0.0054180575   3   -1000024   -3    4
    0.0018060257   3    1000024   -12    11
    0.0018060257   3   -1000024    12   -11
    0.0018060257   3    1000024   -14    13
    0.0018060257   3   -1000024    14   -13
    0.00038058258   3    1000024   -16    15
    0.00038058258   3   -1000024    16   -15

DECAY 1000025  1.8386935
    0.2040295   2    1000024   -24
    0.2040295   2   -1000024    24
    0.19236181   2    1000022    25
    0.18436437   2    1000023    23
    0.096882135   2    1000005   -5
    0.096882135   2   -1000005    5
    0.012571988   2    1000022    23
    0.0088785485   2    1000023    25

DECAY 1000035  13.716016
    0.24706855   2    1000024   -24
    0.24706855   2   -1000024    24
    0.19572835   2    1000023    23
    0.18873287   2    1000022    25
    0.057401808   2    1000022    23
    0.057123918   2    1000023    25
    0.00591441   2    1000025    25
    0.00080731526   2    1000025    23
    7.6743412e-05   2    1000005   -5
    7.6743412e-05   2   -1000005    5
    1.8219857e-07   2    2000011   -11
    1.8219857e-07   2   -2000011    11
    1.8219857e-07   2    2000013   -13
    1.8219857e-07   2   -2000013    13
    1.297351e-10   2    2000001   -1
    1.297351e-10   2   -2000001    1
    1.297351e-10   2    2000003   -3
    1.297351e-10   2   -2000003    3

DECAY 25  0.0041056727
    0.52369562   2    5   -5
    0.26836677   2    24   -24
    0.082304741   2    21    21
    0.064613183   2   -15    15
    0.034691188   2    23    23
    0.021463718   2    4   -4
    0.0024968762   2    22    22
    0.0018904149   2    22    23
    0.00024879166   2    3   -3
    0.00022869735   2   -13    13

DECAY 35  125.5657
    0.55662908   2    5   -5
    0.091607518   2   -15    15
    0.077624128   2    1000005   -2000005
    0.077624128   2    2000005   -1000005
    0.05551071   2    1000024   -1000037
    0.05551071   2    1000037   -1000024
    0.034788025   2    1000023    1000035
    0.020852877   2    1000022    1000035
    0.014819103   2    1000023    1000025
    0.011273722   2    1000022    1000025
    0.00097535315   2    1000024   -1000024
    0.0009433074   2    1000022    1000022
    0.00059677516   2    6   -6
    0.0003245622   2   -13    13
    0.00024296961   2    3   -3
    0.00022693148   2    1000022    1000023
    0.00014885159   2    1000023    1000023
    0.00012142649   2    1000025    1000025
    0.00011228937   2    1000025    1000035
    5.9777247e-05   2    1000005   -1000005
    6.2330321e-06   2    21    21
    9.5663441e-07   2    25    25
    3.5175838e-07   2    24   -24
    1.755299e-07   2    23    23
    1.2272657e-08   2    2000011   -2000011
    1.2272657e-08   2    2000013   -2000013
    9.0361892e-09   2    22    22
    6.0607771e-09   2    4   -4
    4.4432873e-09   2    23    22

DECAY 36  125.55554
    0.5566764   2    5   -5
    0.091615097   2   -15    15
    0.077656719   2    1000005   -2000005
    0.077656719   2   -1000005    2000005
    0.055430573   2    1000024   -1000037
    0.055430573   2    1000037   -1000024
    0.0346986   2    1000022    1000035
    0.020718229   2    1000023    1000035
    0.014274107   2    1000022    1000025
    0.011665412   2    1000023    1000025
    0.001125568   2    1000022    1000022
    0.0010910407   2    1000024   -1000024
    0.00059795324   2    6   -6
    0.00032458868   2   -13    13
    0.00028314926   2    1000025    1000035
    0.00024299908   2    3   -3
    0.00018127284   2    1000025    1000025
    0.00016869302   2    1000022    1000023
    0.00014732964   2    1000023    1000023
    1.4564304e-05   2    21    21
    3.5657201e-07   2    23    25
    3.4610785e-08   2    22    22
    1.0701674e-08   2    23    22
    6.0858484e-09   2    4   -4

DECAY 37  165.02789
    0.48115033   2    6   -5
    0.29940225   2    1000006   -1000005
    0.069727009   2   -15    16
    0.042449081   2    1000037    1000022
    0.042274011   2    1000024    1000035
    0.042161671   2    1000037    1000023
    0.021118506   2    1000024    1000025
    0.00080896189   2    4   -5
    0.00030323438   2    1000037    1000025
    0.00024704005   2   -13    14
    0.00018208954   2    4   -3
    8.4804409e-05   2    1000024    1000023
    7.3403192e-05   2    1000024    1000022
    9.2508642e-06   2    2   -3
    8.089611e-06   2    2   -5
    2.7171681e-07   2    24    25
    1.8477094e-14   2    24    36

DECAY 5 -1


DECAY 15 -1


DECAY 23  2.4952


DECAY 24  2.085
