BLOCK SPINFO
   1   SPheno
   2   v4.0.5be

BLOCK SPHENOINFO
   1   2
   2   2

BLOCK MODSEL
   1   0

BLOCK MINPAR
   3    26.049719
   4   -1

BLOCK EXTPAR
   0    1515.6081
   1   -1231.9724
   2    276.37211
   3    3000
   11   -2255.9202
   12    90.977582
   13   -963.90808
   23   -129.89333
   25    25.222441
   26    785.55351
   31    280.52582
   32    280.52582
   33    1496.8665
   34    153.23269
   35    153.23269
   36    484.25442
   41    5000
   42    5000
   43    1184.0804
   44    5000
   45    5000
   46    1988.1586
   47    5000
   48    5000
   49    1308.3574

BLOCK SMINPUTS
   1    127.90897
   2    1.1663787e-05
   3    0.1184
   4    91.1876
   5    4.18
   6    173.2
   7    1.777
   8    0
   11    0.00051099893
   12    0
   13    0.10565837
   14    0
   21    0.005
   22    0.0025
   23    0.095
   24    1.27

BLOCK GAUGE Q=  1515.6081
   1    0.35536298
   2    0.66519887
   3    1.219778

BLOCK YU Q=  1515.6081
   1   1    8.3909593e-06
   2   2    0.0042626073
   3   3    1.0136953

BLOCK YD Q=  1515.6081
   1   1    0.00042528393
   2   2    0.0080803947
   3   3    0.42174839

BLOCK YE Q=  1515.6081
   1   1    7.4215156e-05
   2   2    0.01534534
   3   3    0.25808338

BLOCK AU Q=  1515.6081
   1   1    0
   2   2    0
   3   3   -2255.9229

BLOCK AD Q=  1515.6081
   1   1    0
   2   2    0
   3   3    90.977546

BLOCK AE Q=  1515.6081
   1   1    0
   2   2    0
   3   3   -963.9076

BLOCK MSOFT Q=  1515.6081
   1   -1231.9724
   2    276.37211
   3    3000
   21    615163.89
   22    6890.1491
   31    280.52582
   32    280.52582
   33    1496.8665
   34    153.23269
   35    153.23269
   36    484.25442
   41    5000
   42    5000
   43    1184.0804
   44    5000
   45    5000
   46    1988.1586
   47    5000
   48    5000
   49    1308.3574

BLOCK MASS
   6    173.2
   23    91.1876
   24    80.429995
   15    1.777
   25    122.16407
   35    785.44309
   36    785.55351
   37    790.38307
   1000001    5029.4436
   2000001    5018.5185
   1000002    5028.987
   2000002    5019.4984
   1000003    5029.4454
   2000003    5018.5211
   1000004    5028.9887
   2000004    5019.4991
   1000005    1166.369
   2000005    1313.7282
   1000006    1155.0269
   2000006    1988.757
   1000011    290.9608
   2000011    188.66419
   1000012    279.15693
   1000013    290.95996
   2000013    188.64313
   1000014    279.15121
   1000015    493.4644
   2000015    1499.2928
   1000016    1496.5694
   1000021    3190.0375
   1000022    116.48082
   1000023   -139.61861
   1000025    317.09024
   1000035   -1225.0884
   1000024    123.44531
   1000037    318.25648

BLOCK ALPHA
      -0.039765086

BLOCK HMIX Q=  1515.6081
   1   -129.89333
   2    25.222441
   3    243.98601
   4    617094.32

BLOCK STOPMIX
   1   1    0.99222464
   1   2    0.12445988
   2   1   -0.12445988
   2   2    0.99222464

BLOCK SBOTMIX
   1   1   -0.99972513
   1   2    0.02344497
   2   1   -0.02344497
   2   2   -0.99972513

BLOCK STAUMIX
   1   1   -0.0020755389
   1   2    0.99999785
   2   1   -0.99999785
   2   2   -0.0020755389

BLOCK NMIX
   1   1   -0.019505206
   1   2   -0.27770065
   1   3   -0.72333856
   1   4   -0.63188861
   2   1    0.029772985
   2   2    0.140404
   2   3   -0.68154737
   2   4    0.71756078
   3   1    0.008065185
   3   2   -0.95035011
   3   3    0.11066383
   3   4    0.29072864
   4   1   -0.99933381
   4   2    0.0019333932
   4   3   -0.0052938342
   4   4    0.036057846

BLOCK UMIX
   1   1   -0.16268842
   1   2   -0.98667749
   2   1    0.98667749
   2   2   -0.16268842

BLOCK VMIX
   1   1   -0.42483984
   1   2    0.90526853
   2   1    0.90526853
   2   2    0.42483984

BLOCK HIGGSBOUNDSINPUTHIGGSCOUPLINGSFERMIONS
       0, 636.17152,3,36,15,15

BLOCK HIGGSBOUNDSINPUTHIGGSCOUPLINGSBOSONS
       0,4,36,21,21,23

BLOCK SPHENOLOWENERGY
   1    0.00039696974
   2    1.5868381e-06
   3    3.5221018e-05
   4    1.7796787e-15
   5    7.6023979e-11
   6    1.5801818e-08
   7    6.007837e-14
   8    2.5664844e-09
   9    5.4062423e-07
   10    9.0499482e-05
   11    0.934825
   12    0.5427606
   13    19.366371
   14    0
   15    0
   16    0.0021611443
   17    2.2817042e-15
   18    2.4772752e-11
   19    8.2840528e-11
   20   -1.9821363e-14
   21   -8.4701764e-10
   22   -7.6247782e-08
   23    0
   24    0
   25    0
   26    0
   27    0
   28    0
   29    0
   30    0
   31    0
   39    0.00012522856
   40    0
   41    0
   42    0

BLOCK FWCOEF Q=  160
   305   4422   0   0   -0.18881911
   305   4422   0   2   -0.26859252
   305   4322   0   2   -0.0011121279
   305   6421   0   0   -0.095227835
   305   6421   0   2   -0.16248966
   305   6321   0   2   -0.0011034783
   3051111   4133   0   0    1.5923138
   3051111   4133   0   2    1.5933482
   3051111   4233   0   2    7.0717989e-06
   3051111   4137   0   0   -4.4150059
   3051111   4137   0   2   -4.409987
   3051111   4237   0   2   -5.2258268e-05
   3051313   4133   0   0    1.5923138
   3051313   4133   0   2    1.5933457
   3051313   4233   0   2    7.0661244e-06
   3051313   4137   0   0   -4.4150059
   3051313   4137   0   2   -4.4099895
   3051313   4237   0   2   -5.2253896e-05
   3051212   4137   0   0    1.5053501
   3051212   4137   0   2    1.504316
   3051212   4237   0   2    1.1393311e-05
   3051414   4137   0   0    1.5053501
   3051414   4137   0   2    1.504316
   3051414   4237   0   2    1.1394476e-05
   3051616   4137   0   0    1.5053501
   3051616   4137   0   2    1.5043119
   3051616   4237   0   2    1.1722173e-05

BLOCK IMFWCOEF Q=  160
   305   4422   0   0    3.8581224e-07
   305   4422   0   2   -2.2329674e-05
   305   4322   0   2   -3.4920718e-06
   305   6421   0   0    3.304737e-07
   305   6421   0   2    3.7776623e-06
   305   6321   0   2   -1.0048183e-06
   3051111   4133   0   2   -2.1172976e-06
   3051111   4233   0   2    2.1918215e-06
   3051111   4137   0   2    7.3074896e-06
   3051111   4237   0   2   -1.7029597e-05
   3051313   4133   0   2   -2.1172808e-06
   3051313   4233   0   2    2.1918157e-06
   3051313   4137   0   2    7.3074049e-06
   3051313   4237   0   2   -1.7029614e-05
   3051212   4137   0   2   -5.3523315e-07
   3051212   4237   0   2    3.7112035e-06
   3051414   4137   0   2   -5.3522932e-07
   3051414   4237   0   2    3.7112035e-06
   3051616   4137   0   2   -6.092869e-07
   3051616   4237   0   2    3.7111936e-06

DECAY 23  2.4952


DECAY 24  2.085


DECAY 2000011  0.00031006231
    0.55454001   2    1000023    11
    0.44543877   2    1000022    11

DECAY 1000011  0.13909018
    0.53898204   2    1000022    11
    0.32772438   2   -1000024    12
    0.1332907   2    1000023    11

DECAY 2000013  0.0008522169
    0.36930034   2    1000022    13
    0.33005173   2   -1000024    14
    0.30064793   2    1000023    13

DECAY 1000013  0.13996929
    0.53921717   2    1000022    13
    0.32566428   2   -1000024    14
    0.13511569   2    1000023    13

DECAY 1000015  1.1338923
    0.49421601   2   -1000024    16
    0.27048012   2    1000022    15
    0.22810822   2    1000023    15
    0.0048741064   2   -1000037    16
    0.0023215391   2    1000025    15

DECAY 2000015  20.743577
    0.56500584   2   -1000037    16
    0.26094472   2    1000025    15
    0.075474169   2    1000022    15
    0.051410592   2    1000023    15
    0.016450785   2   -1000024    16
    0.010224897   2    1000015    35
    0.010222367   2    1000015    36
    0.0099431105   2    1000035    15
    0.00016620608   2    1000015    23
    0.0001573094   2    1000015    25

DECAY 1000012  0.35761599
    0.80263091   2    1000024    11
    0.1674244   2    1000022    12
    0.029944695   2    1000023    12

DECAY 1000014  0.35843816
    0.80309136   2    1000024    13
    0.16703406   2    1000022    14
    0.029874581   2    1000023    14

DECAY 1000016  20.81255
    0.47515614   2    1000037    15
    0.26313321   2    1000025    16
    0.20424428   2    1000024    15
    0.022337355   2    1000022    16
    0.020089487   2    1000015    37
    0.0098886207   2    1000035    16
    0.0048207121   2    1000023    16
    0.00033019224   2    1000015    24

DECAY 2000001  143.16345
    0.98268911   2    1000021    1
    0.017284614   2    1000035    1

DECAY 1000001  208.3461
    0.68070555   2    1000021    1
    0.20522638   2   -1000037    2
    0.095489848   2    1000025    1
    0.0079817023   2    1000022    1
    0.0056176878   2   -1000024    2
    0.0030423951   2    1000035    1
    0.0019364312   2    1000023    1

DECAY 2000003  143.1767
    0.98260002   2    1000021    3
    0.017283026   2    1000035    3

DECAY 1000003  208.35462
    0.68067857   2    1000021    3
    0.20521963   2   -1000037    4
    0.095486352   2    1000025    3
    0.0079977228   2    1000022    3
    0.0056245957   2   -1000024    4
    0.0030422726   2    1000035    3
    0.0019508539   2    1000023    3

DECAY 1000005  39.403852
    0.46671592   2   -1000024    6
    0.31806324   2   -1000037    6
    0.10172422   2    1000025    5
    0.064386589   2    1000022    5
    0.049110035   2    1000023    5

DECAY 2000005  8.9994643
    0.4731603   2   -1000024    6
    0.26094505   2    1000022    5
    0.23686846   2    1000023    5
    0.01798477   2   -1000037    6
    0.0084279126   2    1000025    5
    0.0013797363   2    1000035    5
    0.00069415047   2    1000006   -24
    0.00032333301   2    1000005    25
    0.00021628424   2    1000005    23

DECAY 2000002  150.70256
    0.93420532   2    1000021    2
    0.065695782   2    1000035    2

DECAY 1000002  208.34298
    0.68048756   2    1000021    2
    0.17274443   2    1000037    1
    0.094907028   2    1000025    2
    0.038305638   2    1000024    1
    0.0083905236   2    1000022    2
    0.0029127178   2    1000035    2
    0.0022521049   2    1000023    2

DECAY 2000004  150.7062
    0.93418289   2    1000021    4
    0.065694202   2    1000035    4

DECAY 1000004  208.35144
    0.6804605   2    1000021    4
    0.17273828   2    1000037    3
    0.094903941   2    1000025    4
    0.038334502   2    1000024    3
    0.0083936599   2    1000022    4
    0.0029126118   2    1000035    4
    0.0022564962   2    1000023    4

DECAY 1000006  39.209637
    0.29081631   2    1000023    6
    0.24062198   2    1000022    6
    0.18697342   2    1000024    5
    0.15027463   2    1000037    5
    0.12916859   2    1000025    6
    0.0021196772   3    1000022    24    5

DECAY 2000006  131.83654
    0.22897845   2    1000024    5
    0.17474394   2    1000005    24
    0.1523109   2    1000023    6
    0.1210166   2    1000006    25
    0.11500281   2    1000022    6
    0.088365204   2    1000006    23
    0.071896195   2    1000037    5
    0.034619222   2    1000025    6
    0.011565069   2    1000035    6
    0.00065976643   2    1000005    37
    0.00040252958   2    1000006    36
    0.00037879189   2    1000006    35

DECAY 1000024  2.2750523e-08
    0.36077445   3    1000022   -1    2
    0.30699855   3    1000022   -3    4
    0.12197578   3    1000022   -11    12
    0.12185255   3    1000022   -13    14
    0.088398672   3    1000022   -15    16

DECAY 1000037  2.1801915
    0.32833286   2    1000023    24
    0.23112246   2    1000022    24
    0.21397644   2    1000024    23
    0.13681722   2    1000024    25
    0.028013035   2    1000014   -13
    0.028004321   2    1000012   -11
    0.016861058   2   -1000013    14
    0.016860077   2   -1000011    12

DECAY 1000022 -1


DECAY 1000023  2.457993e-05
    0.14030729   3    1000022    12   -12
    0.10441026   3    1000022    1   -1
    0.10439034   3    1000022    3   -3
    0.081434448   3    1000022    2   -2
    0.07828258   3    1000022    4   -4
    0.071986996   3    1000022    5   -5
    0.052223557   3    1000024    1   -2
    0.052223557   3   -1000024   -1    2
    0.050681882   3    1000024    3   -4
    0.050681882   3   -1000024   -3    4
    0.041990513   2    1000022    22
    0.023332362   3    1000022    13   -13
    0.023328084   3    1000022    11   -11
    0.021867972   3    1000022    15   -15
    0.017467681   3    1000024    13   -14
    0.017467681   3   -1000024   -13    14
    0.017467204   3    1000024    11   -12
    0.017467204   3   -1000024   -11    12
    0.016494258   3    1000024    15   -16
    0.016494258   3   -1000024   -15    16

DECAY 1000025  2.6004457
    0.23332496   2    1000024   -24
    0.23332496   2   -1000024    24
    0.21740088   2    1000023    23
    0.13258173   2    1000023    25
    0.075670439   2    1000022    25
    0.034126167   2    1000022    23
    0.012379121   2    1000014   -14
    0.012379121   2   -1000014    14
    0.012375628   2    1000012   -12
    0.012375628   2   -1000012    12
    0.0059976507   2    1000013   -13
    0.0059976507   2   -1000013    13
    0.0059970497   2    1000011   -11
    0.0059970497   2   -1000011    11

DECAY 1000035  25.981686
    0.11275939   2    2000013   -13
    0.11275939   2   -2000013    13
    0.11275816   2    2000011   -11
    0.11275816   2   -2000011    11
    0.083030546   2    1000015   -15
    0.083030546   2   -1000015    15
    0.027232586   2    1000024   -24
    0.027232586   2   -1000024    24
    0.026777166   2    1000014   -14
    0.026777166   2   -1000014    14
    0.026777045   2    1000012   -12
    0.026777045   2   -1000012    12
    0.026142916   2    1000013   -13
    0.026142916   2   -1000013    13
    0.026142899   2    1000011   -11
    0.026142899   2   -1000011    11
    0.020284114   2    1000023    25
    0.016645608   2    1000022    23
    0.013388281   2    1000022    25
    0.011519818   2    1000023    23
    0.0096833188   2    37   -1000024
    0.0096833188   2   -37    1000024
    0.0074073654   2    1000022    35
    0.0058797644   2    1000023    35
    0.003481151   2    1000037   -24
    0.003481151   2   -1000037    24
    0.0033196046   2    1000022    36
    0.0031362217   2    1000023    36
    0.002418936   2    1000025    23
    0.0021217258   2    1000025    25
    0.00067336074   3    1000024    5   -6
    0.00067336074   3   -1000024   -5    6
    0.00040827439   3    1000023    6   -6
    0.00033059607   3    1000022    6   -6
    0.00026338971   2    37   -1000037
    0.00026338971   2   -37    1000037
    0.00023439799   2    1000025    35
    0.00017289411   3    1000025    12   -12
    0.00016875571   3    1000037    13   -14
    0.00016875571   3   -1000037   -13    14
    0.00016875428   3    1000037    11   -12
    0.00016875428   3   -1000037   -11    12

DECAY 1000021  241.81095
    0.14655318   2    1000005   -5
    0.14655318   2   -1000005    5
    0.14272553   2    1000006   -6
    0.14272553   2   -1000006    6
    0.13461523   2    2000005   -5
    0.13461523   2   -2000005    5
    0.075681201   2    2000006   -6
    0.075681201   2   -2000006    6
    0.00029444151   2    1000006   -4
    0.00029444151   2   -1000006    4

DECAY 25  0.0036713442
    0.62601226   2   -5    5
    0.17761936   2   -24    24
    0.07168502   2    21    21
    0.071646964   2   -15    15
    0.028853037   2   -4    4
    0.020307337   2    23    23
    0.0021811506   2    22    22
    0.0012116742   2    22    23
    0.00024736308   2   -13    13
    0.00023502303   2   -3    3
    6.4981337e-07   2   -1    1
    1.4869307e-07   2   -2    2
    5.5610277e-09   2   -11    11

DECAY 35  15.167159
    0.47867566   2   -5    5
    0.11248544   2   -1000024    1000037
    0.11248544   2   -1000037    1000024
    0.072205998   2   -1000024    1000024
    0.071724613   2   -15    15
    0.06633555   2    1000023    1000025
    0.056588642   2    1000022    1000025
    0.016785888   2    1000022    1000022
    0.0034167262   2   -1000037    1000037
    0.0028448021   2   -6    6
    0.0024480138   2    1000023    1000023
    0.001779406   2    1000025    1000025
    0.0015975282   2    1000022    1000023
    0.00023177536   2   -13    13
    0.00017857757   2   -3    3
    0.00011848083   2    25    25
    3.905723e-05   2    21    21
    1.9523334e-05   2   -24    24
    1.150523e-05   2    23    23
    2.3699582e-06   2   -2000011    2000011
    2.3646294e-06   2   -2000013    2000013
    2.0343678e-06   2   -1000011    1000011
    2.0236935e-06   2   -1000013    1000013
    1.404801e-06   2    22    23
    5.2552417e-07   2    22    22
    4.9372133e-07   2   -1    1
    4.7748709e-08   2   -4    4
    5.2076887e-09   2   -11    11
    4.105481e-09   2   -2000013    1000013
    4.105481e-09   2   -1000013    2000013
    2.4623563e-13   2   -2    2
    9.6043381e-14   2   -2000011    1000011
    9.6043381e-14   2   -1000011    2000011

DECAY 36  14.98121
    0.47345188   2   -5    5
    0.11133392   2   -1000024    1000037
    0.11133392   2   -1000037    1000024
    0.076213137   2   -1000024    1000024
    0.070941064   2   -15    15
    0.066415875   2    1000022    1000025
    0.056186049   2    1000023    1000025
    0.016204166   2    1000022    1000022
    0.0055532454   2   -1000037    1000037
    0.0033330899   2    1000023    1000023
    0.0032918565   2   -6    6
    0.002974233   2    1000025    1000025
    0.0022682546   2    1000022    1000023
    0.00022923362   2   -13    13
    0.00017661975   2   -3    3
    7.3431052e-05   2    21    21
    1.8398341e-05   2    23    25
    9.3622941e-07   2    22    23
    4.8830842e-07   2   -1    1
    1.4077892e-07   2    22    22
    4.3964751e-08   2   -4    4
    5.1505781e-09   2   -11    11
    4.1284566e-09   2   -2000013    1000013
    4.1284566e-09   2   -1000013    2000013
    2.2680457e-13   2   -2    2
    9.6564937e-14   2   -2000011    1000011
    9.6564937e-14   2   -1000011    2000011
    4.4160045e-39   2    25    25

DECAY 37  14.090112
    0.4526569   2   -5    6
    0.17548879   2    1000022    1000037
    0.14172991   2    1000024    1000025
    0.12772321   2    1000023    1000037
    0.07612379   2   -15    16
    0.022123403   2    1000023    1000024
    0.002933623   2    1000022    1000024
    0.00071802828   2   -5    4
    0.0002691273   2   -13    14
    0.00017368636   2   -3    4
    2.0148988e-05   2    24    25
    9.8890687e-06   2   -2000011    1000012
    9.8804995e-06   2   -2000013    1000014
    7.9943091e-06   2   -3    2
    5.1722999e-06   2   -3    6
    5.1274873e-06   2   -5    2
    5.7634537e-07   2    1000025    1000037
    4.8183628e-07   2   -1    2
    2.2665608e-07   2   -1    6
    2.4389429e-08   2   -1    4
    6.2949157e-09   2   -11    12
    5.2386547e-09   2   -1000013    1000014
    2.8232722e-10   2    24    35
    2.5218229e-10   2    24    36
    1.2249057e-13   2   -1000011    1000012

DECAY 6  2.43
    1   2    5    24

DECAY 15 -1
