BLOCK SPINFO
   1   SPheno
   2   v4.0.5be

BLOCK SPHENOINFO
   1   2
   2   2

BLOCK MODSEL
   1   0

BLOCK MINPAR
   3    37.76803
   4   -1

BLOCK EXTPAR
   0    1268.2277
   1   -290.10299
   2   -1429.0584
   3    3000
   11   -3007.5919
   12    773.25753
   13    1799.2174
   23   -119.43265
   25    36.969057
   26    4986.4036
   31    457.03102
   32    457.03102
   33    469.09845
   34    1946.2504
   35    1946.2504
   36    656.90604
   41    5000
   42    5000
   43    1347.7725
   44    5000
   45    5000
   46    1343.1739
   47    5000
   48    5000
   49    1610.5375

BLOCK SMINPUTS
   1    127.90897
   2    1.1663787e-05
   3    0.1184
   4    91.1876
   5    4.18
   6    173.2
   7    1.777
   8    0
   11    0.00051099893
   12    0
   13    0.10565837
   14    0
   21    0.005
   22    0.0025
   23    0.095
   24    1.27

BLOCK GAUGE Q=  1268.2277
   1    0.35536298
   2    0.66519887
   3    1.219778

BLOCK YU Q=  1268.2277
   1   1    8.3874389e-06
   2   2    0.004260819
   3   3    1.01327

BLOCK YD Q=  1268.2277
   1   1    0.000623086
   2   2    0.011838634
   3   3    0.61790606

BLOCK YE Q=  1268.2277
   1   1    0.00010873306
   2   2    0.022482549
   3   3    0.37811949

BLOCK AU Q=  1268.2277
   1   1    0
   2   2    0
   3   3   -3007.5919

BLOCK AD Q=  1268.2277
   1   1    0
   2   2    0
   3   3    773.25753

BLOCK AE Q=  1268.2277
   1   1    0
   2   2    0
   3   3    1799.2174

BLOCK MSOFT Q=  1268.2277
   1   -290.10299
   2   -1429.0584
   3    3000
   21    24676330
   22    38769.329
   31    457.03102
   32    457.03102
   33    469.09845
   34    1946.2504
   35    1946.2504
   36    656.90604
   41    5000
   42    5000
   43    1347.7725
   44    5000
   45    5000
   46    1343.1739
   47    5000
   48    5000
   49    1610.5375

BLOCK MASS
   6    173.2
   23    91.1876
   24    80.429995
   15    1.777
   25    122.8573
   35    4983.8396
   36    4986.4036
   37    4984.8915
   1000001    5016.227
   2000001    5007.545
   1000002    5015.7888
   2000002    5013.0752
   1000003    5016.2347
   2000003    5007.5592
   1000004    5015.7965
   2000004    5013.0763
   1000005    1314.558
   2000005    1639.777
   1000006    1114.5222
   2000006    1443.1309
   1000011    496.37107
   2000011    1939.4362
   1000012    489.62349
   1000013    496.49661
   2000013    1939.4935
   1000014    489.75088
   1000015    544.84719
   2000015    691.31442
   1000016    539.19727
   1000021    3171.4246
   1000022   -116.1225
   1000023    127.5877
   1000025   -297.80174
   1000035   -1471.5249
   1000024    123.50681
   1000037    1471.837

BLOCK ALPHA
      -0.02649688

BLOCK HMIX Q=  1268.2277
   1   -119.43265
   2    36.969057
   3    244.17037
   4    24864221

BLOCK STOPMIX
   1   1    0.64494358
   1   2    0.76423018
   2   1   -0.76423018
   2   2    0.64494358

BLOCK SBOTMIX
   1   1   -0.99992519
   1   2    0.012231598
   2   1   -0.012231598
   2   2   -0.99992519

BLOCK STAUMIX
   1   1   -0.99817952
   1   2    0.060312923
   2   1   -0.060312923
   2   2   -0.99817952

BLOCK NMIX
   1   1   -0.17680198
   1   2    0.040643433
   1   3    0.71615918
   1   4   -0.67394747
   2   1   -0.074077452
   2   2    0.03479396
   2   3   -0.69369112
   2   4   -0.71560781
   3   1    0.98145241
   3   2    0.012166064
   3   3    0.076640088
   3   4   -0.17529817
   4   1    0.0021804103
   4   2   -0.9984936
   4   3    0.0059122213
   4   4   -0.054505164

BLOCK UMIX
   1   1   -0.0083584925
   1   2   -0.99996507
   2   1   -0.99996507
   2   2    0.0083584925

BLOCK VMIX
   1   1    0.077047172
   1   2    0.99702745
   2   1    0.99702745
   2   2   -0.077047172

BLOCK HIGGSBOUNDSINPUTHIGGSCOUPLINGSFERMIONS
       0, 1366.7112,3,36,15,15

BLOCK HIGGSBOUNDSINPUTHIGGSCOUPLINGSBOSONS
       0,4,36,21,21,23

BLOCK SPHENOLOWENERGY
   1    0.00039142442
   2    1.5873419e-06
   3    3.5225501e-05
   4    1.7779604e-15
   5    7.5953168e-11
   6    1.5943711e-08
   7    6.0013866e-14
   8    2.5638147e-09
   9    5.4530156e-07
   10    9.6462727e-05
   11    0.99642304
   12    0.5433523
   13    19.411904
   14    0
   15    0
   16    0.0021637117
   17    2.2817236e-15
   18    2.4801587e-11
   19    8.2900239e-11
   20    1.1001597e-14
   21    4.705336e-10
   22    4.1816026e-07
   23    0
   24    0
   25    0
   26    0
   27    0
   28    0
   29    0
   30    0
   31    0
   39    0.00010415533
   40    0
   41    0
   42    0

BLOCK FWCOEF Q=  160
   305   4422   0   0   -0.18881911
   305   4422   0   2   -0.27024905
   305   4322   0   2   -0.00043520676
   305   6421   0   0   -0.095227835
   305   6421   0   2   -0.13504498
   305   6321   0   2   -0.00020535193
   3051111   4133   0   0    1.5862201
   3051111   4133   0   2    1.5878853
   3051111   4233   0   2    0.00022221687
   3051111   4137   0   0   -4.4089122
   3051111   4137   0   2   -4.4046487
   3051111   4237   0   2   -0.0017434632
   3051313   4133   0   0    1.5862201
   3051313   4133   0   2    1.587879
   3051313   4233   0   2    0.00022221621
   3051313   4137   0   0   -4.4089122
   3051313   4137   0   2   -4.404655
   3051313   4237   0   2   -0.0017434663
   3051212   4137   0   0    1.5053501
   3051212   4137   0   2    1.5044251
   3051212   4237   0   2    0.00038045615
   3051414   4137   0   0    1.5053501
   3051414   4137   0   2    1.5044251
   3051414   4237   0   2    0.00038045616
   3051616   4137   0   0    1.5053501
   3051616   4137   0   2    1.5044251
   3051616   4237   0   2    0.00038045837

BLOCK IMFWCOEF Q=  160
   305   4422   0   0    3.8579625e-07
   305   4422   0   2    1.7002618e-05
   305   4322   0   2   -6.8799829e-06
   305   6421   0   0    3.3046e-07
   305   6421   0   2    1.7032041e-05
   305   6321   0   2   -2.4338092e-06
   3051111   4133   0   2   -2.5006341e-06
   3051111   4233   0   2    4.2283961e-06
   3051111   4137   0   2    1.9601724e-05
   3051111   4237   0   2   -3.3178548e-05
   3051313   4133   0   2   -2.5005727e-06
   3051313   4233   0   2    4.2283857e-06
   3051313   4137   0   2    1.9601828e-05
   3051313   4237   0   2   -3.3178605e-05
   3051212   4137   0   2   -4.1718505e-06
   3051212   4237   0   2    7.2401858e-06
   3051414   4137   0   2   -4.1718674e-06
   3051414   4237   0   2    7.2401858e-06
   3051616   4137   0   2   -4.1769106e-06
   3051616   4237   0   2    7.2401856e-06

DECAY 23  2.4952


DECAY 24  2.085


DECAY 1000011  0.26356234
    0.97736986   2    1000025    11
    0.021445383   2    1000022    11
    0.0010192955   2   -1000024    12
    0.00016536848   2    1000023    11

DECAY 2000011  9.3048561
    0.9617985   2    1000025    11
    0.032503151   2    1000022    11
    0.005697403   2    1000023    11

DECAY 1000013  0.26817239
    0.96140756   2    1000025    13
    0.029612842   2    1000022    13
    0.0079774142   2    1000023    13
    0.0010020935   2   -1000024    14

DECAY 2000013  9.3438789
    0.95782437   2    1000025    13
    0.033431306   2    1000022    13
    0.0066694659   2    1000023    13
    0.0020702492   2   -1000024    14

DECAY 1000015  1.757685
    0.42740182   2    1000022    15
    0.37306933   2    1000023    15
    0.19506722   2    1000025    15
    0.0044616168   2   -1000024    16

DECAY 2000015  6.0557521
    0.36797256   2    1000025    15
    0.30264624   2   -1000024    16
    0.16977844   2    1000022    15
    0.15099705   2    1000023    15
    0.0049293484   2    1000016   -24
    0.0019376868   2    1000015    25
    0.0017386776   2    1000015    23

DECAY 1000012  0.29221826
    0.76791142   2    1000025    12
    0.11988099   2    1000022    12
    0.076771322   2    1000024    11
    0.035436267   2    1000023    12

DECAY 1000014  0.29675165
    0.75683905   2    1000025    14
    0.11808763   2    1000022    14
    0.090166678   2    1000024    13
    0.034906641   2    1000023    14

DECAY 1000016  1.753276
    0.79938548   2    1000024    15
    0.17147699   2    1000025    16
    0.022466077   2    1000022    16
    0.0066714563   2    1000023    16

DECAY 2000001  144.54696
    0.98079086   2    1000021    1
    0.018498605   2    1000025    1
    0.00060406476   2    1000022    1
    0.00010612371   2    1000023    1

DECAY 1000001  198.70385
    0.71802746   2    1000021    1
    0.18560012   2   -1000037    2
    0.092606518   2    1000035    1
    0.0029172482   2    1000025    1
    0.00057753941   2    1000022    1
    0.00025561462   2    1000023    1

DECAY 2000003  144.57625
    0.98060232   2    1000021    3
    0.01849547   2    1000025    3
    0.000653286   2    1000022    3
    0.00015238565   2    1000023    3

DECAY 1000003  198.7205
    0.7179713   2    1000021    3
    0.185585   2   -1000037    4
    0.092598953   2    1000035    3
    0.0029174173   2    1000025    3
    0.0006134523   2    1000022    3
    0.00028932453   2    1000023    3

DECAY 1000005  46.228586
    0.54697925   2   -1000024    6
    0.23689417   2    1000006   -24
    0.11009136   2    1000022    5
    0.1020611   2    1000023    5
    0.0039741097   2    1000025    5

DECAY 2000005  25.268969
    0.47667361   2   -1000024    6
    0.25052793   2    1000022    5
    0.23498417   2    1000023    5
    0.035654601   2    1000025    5
    0.001109088   2    1000006   -24
    0.00059821052   2    1000005    25
    0.00035780175   2    1000005    23

DECAY 2000002  153.46504
    0.92754953   2    1000021    2
    0.069772551   2    1000025    2
    0.0022778483   2    1000022    2
    0.00039978456   2    1000023    2

DECAY 1000002  198.69834
    0.71781757   2    1000021    2
    0.18449416   2    1000037    1
    0.09245403   2    1000035    2
    0.0038554082   2    1000025    2
    0.0013177375   2    1000024    1

DECAY 2000004  153.4687
    0.92752771   2    1000021    4
    0.069771238   2    1000025    4
    0.0022831498   2    1000022    4
    0.00040581019   2    1000023    4

DECAY 1000004  198.71493
    0.71776136   2    1000021    4
    0.18447915   2    1000037    3
    0.092446497   2    1000035    4
    0.0038553721   2    1000025    4
    0.0013877222   2    1000024    3

DECAY 1000006  36.1317
    0.42233409   2    1000024    5
    0.27451549   2    1000023    6
    0.23519607   2    1000022    6
    0.067368611   2    1000025    6
    0.00053688234   3    1000022    24    5

DECAY 2000006  68.459624
    0.28916703   2    1000024    5
    0.22561566   2    1000023    6
    0.21106219   2    1000006    23
    0.20917305   2    1000022    6
    0.040823313   2    1000005    24
    0.013928788   2    1000025    6
    0.010229979   2    1000006    25

DECAY 1000024  7.7265504e-08
    0.35881062   3    1000022   -1    2
    0.31082197   3    1000022   -3    4
    0.11963775   3    1000022   -11    12
    0.11951676   3    1000022   -13    14
    0.091212913   3    1000022   -15    16

DECAY 1000037  45.18294
    0.11272875   2    1000012   -11
    0.11271415   2    1000014   -13
    0.11261219   2   -1000011    12
    0.11259757   2   -1000013    14
    0.1068387   2    1000016   -15
    0.10631947   2   -1000015    16
    0.071843369   2    1000023    24
    0.070863762   2    1000024    25
    0.070136138   2    1000024    23
    0.063167744   2    1000022    24
    0.042018834   2    1000006   -5
    0.0061023197   2    1000025    24
    0.0058057026   3    1000024    6   -6
    0.0028223068   3    1000023   -5    6
    0.0025979264   3    1000022   -5    6
    0.00036858206   2   -2000015    16
    0.00029835512   2    2000006   -5
    0.00016326884   3    1000025   -5    6

DECAY 1000022 -1


DECAY 1000023  5.9400982e-07
    0.19980692   3    1000022    12   -12
    0.1680544   2    1000022    22
    0.14932971   3    1000022    1   -1
    0.14921088   3    1000022    3   -3
    0.1164641   3    1000022    2   -2
    0.098883535   3    1000022    4   -4
    0.033697464   3    1000022    11   -11
    0.033657273   3    1000022    13   -13
    0.024217308   3    1000022    15   -15
    0.022534832   3    1000022    5   -5
    0.00085370417   3    1000024    1   -2
    0.00085370417   3   -1000024   -1    2
    0.00053560537   3    1000024    3   -4
    0.00053560537   3   -1000024   -3    4
    0.00028461783   3    1000024    11   -12
    0.00028461783   3   -1000024   -11    12
    0.00028366629   3    1000024    13   -14
    0.00028366629   3   -1000024   -13    14
    0.00011418974   3    1000024    15   -16
    0.00011418974   3   -1000024   -15    16

DECAY 1000025  0.80069745
    0.26680598   2    1000024   -24
    0.26680598   2   -1000024    24
    0.24129394   2    1000023    23
    0.097872829   2    1000023    25
    0.09413471   2    1000022    25
    0.033046477   2    1000022    23

DECAY 1000035  46.314029
    0.068763305   2    1000024   -24
    0.068763305   2   -1000024    24
    0.055260867   2    1000012   -12
    0.055260867   2   -1000012    12
    0.055253707   2    1000014   -14
    0.055253707   2   -1000014    14
    0.054624188   2    1000011   -11
    0.054624188   2   -1000011    11
    0.054617102   2    1000013   -13
    0.054617102   2   -1000013    13
    0.052372374   2    1000016   -16
    0.052372374   2   -1000016    16
    0.051572801   2    1000015   -15
    0.051572801   2   -1000015    15
    0.042600959   2    1000023    23
    0.038811082   2    1000023    25
    0.037467009   2    1000022    25
    0.024306293   2    1000022    23
    0.020754609   2    1000006   -6
    0.020754609   2   -1000006    6
    0.0085357697   2    1000005   -5
    0.0085357697   2   -1000005    5
    0.0040301923   2    1000025    25
    0.0021677023   3    1000024    5   -6
    0.0021677023   3   -1000024   -5    6
    0.001718845   2    1000025    23
    0.0014503336   3    1000023    6   -6
    0.0012625107   3    1000022    6   -6
    0.00017917399   2    2000015   -15
    0.00017917399   2   -2000015    15
    0.00013573341   3    1000025    6   -6

DECAY 1000021  259.11144
    0.12904521   2    2000006   -6
    0.12904521   2   -2000006    6
    0.12425731   2    1000005   -5
    0.12425731   2   -1000005    5
    0.12200905   2    1000006   -6
    0.12200905   2   -1000006    6
    0.097229444   2    2000005   -5
    0.097229444   2   -2000005    5
    0.027121319   2    1000006   -4
    0.027121319   2   -1000006    4
    0.0001446102   3    1000035    5   -5
    0.00013847682   3    1000037    5   -6
    0.00013847682   3   -1000037   -5    6
    0.00011576376   3    1000035    6   -6

DECAY 25  0.003602919
    0.60506759   2   -5    5
    0.1954255   2   -24    24
    0.073230063   2    21    21
    0.069470366   2   -15    15
    0.029998553   2   -4    4
    0.022659396   2    23    23
    0.0023552426   2    22    22
    0.0013241854   2    22    23
    0.00024089376   2   -13    13
    0.00022741538   2   -3    3
    6.2878101e-07   2   -1    1
    1.5459622e-07   2   -2    2
    5.4155877e-09   2   -11    11

DECAY 35  149.55582
    0.49601526   2   -5    5
    0.1139433   2   -1000024    1000037
    0.1139433   2   -1000037    1000024
    0.098370195   2   -15    15
    0.058767286   2    1000023    1000035
    0.055272992   2    1000022    1000035
    0.01863752   2    1000023    1000025
    0.016680689   2    1000022    1000025
    0.0059405437   2   -2000015    1000015
    0.0059405437   2   -1000015    2000015
    0.0035181495   2   -2000005    1000005
    0.0035181495   2   -1000005    2000005
    0.0023151078   2    1000022    1000022
    0.0017280395   2   -1000024    1000024
    0.001070579   2   -1000006    1000006
    0.0009110666   2   -6    6
    0.00082691104   2   -2000006    2000006
    0.00077464793   2    1000023    1000023
    0.00051858259   2    1000025    1000035
    0.00034152863   2   -13    13
    0.00031197723   2    1000025    1000025
    0.00022909405   2    1000022    1000023
    0.00018698972   2   -3    3
    6.7749221e-05   2   -1000015    1000015
    6.692284e-05   2   -2000015    2000015
    4.1998979e-05   2   -2000006    1000006
    4.1998979e-05   2   -1000006    2000006
    6.513128e-06   2   -1000037    1000037
    3.2847985e-06   2    1000035    1000035
    2.748754e-06   2   -2000005    2000005
    2.3348696e-06   2    21    21
    2.1261686e-06   2   -1000005    1000005
    9.4393063e-07   2    25    25
    5.1697354e-07   2   -1    1
    6.4556619e-08   2    23    23
    2.4855226e-08   2   -1000011    1000011
    2.4683031e-08   2   -1000013    1000013
    1.236679e-08   2   -4    4
    1.0713954e-08   2   -24    24
    1.021469e-08   2   -2000011    2000011
    1.0127449e-08   2   -2000013    2000013
    7.6692411e-09   2   -11    11
    2.7376719e-09   2    22    23
    1.0560031e-09   2    22    22
    5.6711432e-11   2   -2000013    1000013
    5.6711432e-11   2   -1000013    2000013
    6.3740291e-14   2   -2    2
    1.3264864e-15   2   -2000011    1000011
    1.3264864e-15   2   -1000011    2000011

DECAY 36  142.58844
    0.4793851   2   -5    5
    0.11957183   2   -1000024    1000037
    0.11957183   2   -1000037    1000024
    0.095075316   2   -15    15
    0.065838757   2    1000022    1000035
    0.053608746   2    1000023    1000035
    0.01936257   2    1000022    1000025
    0.017511964   2    1000023    1000025
    0.0062984228   2   -2000015    1000015
    0.0062984228   2   -1000015    2000015
    0.0036918105   2   -2000005    1000005
    0.0036918105   2   -1000005    2000005
    0.0026887954   2    1000022    1000022
    0.0018386829   2   -1000024    1000024
    0.001034501   2   -2000006    1000006
    0.001034501   2   -1000006    2000006
    0.00084601471   2   -6    6
    0.00077765071   2    1000025    1000035
    0.00073011651   2    1000023    1000023
    0.00042671114   2    1000025    1000025
    0.00033009006   2   -13    13
    0.00018071503   2   -3    3
    0.00015837987   2    1000022    1000023
    2.7529095e-05   2   -1000037    1000037
    1.3827792e-05   2    1000035    1000035
    5.162927e-06   2    21    21
    4.9962699e-07   2   -1    1
    1.8712037e-07   2    23    25
    2.004525e-08   2    22    23
    1.8439071e-08   2    22    22
    1.1396014e-08   2   -4    4
    7.4125024e-09   2   -11    11
    5.9289544e-11   2   -2000013    1000013
    5.9289544e-11   2   -1000013    2000013
    8.5399289e-13   2    23    35
    5.8738081e-14   2   -2    2
    1.3867886e-15   2   -2000011    1000011
    1.3867886e-15   2   -1000011    2000011
    1.2127004e-37   2    25    25

DECAY 37  148.26174
    0.49548788   2   -5    6
    0.11934806   2    1000022    1000037
    0.11507998   2    1000024    1000035
    0.11078415   2    1000023    1000037
    0.095911499   2   -15    16
    0.039460352   2    1000024    1000025
    0.012085034   2   -2000015    1000016
    0.0042547363   2   -2000005    1000006
    0.0033013142   2   -2000005    2000006
    0.0012771426   2    1000025    1000037
    0.00082896937   2   -1000005    1000006
    0.00073456841   2   -5    4
    0.00044051028   2   -1000005    2000006
    0.00043354402   2    1000022    1000024
    0.00033908124   2   -13    14
    0.00017524499   2   -3    4
    3.666826e-05   2   -1000015    1000016
    8.2532201e-06   2   -3    2
    5.2969489e-06   2    1000023    1000024
    5.2455753e-06   2   -5    2
    1.5207348e-06   2   -3    6
    4.8628187e-07   2   -1    2
    1.7983647e-07   2    24    25
    9.8502041e-08   2   -1000011    1000012
    9.8258312e-08   2   -1000013    1000014
    5.7730645e-08   2   -1    6
    2.3361343e-08   2   -1    4
    7.9311454e-09   2   -11    12
    1.1493489e-10   2   -2000013    1000014
    6.5536066e-11   2    1000035    1000037
    1.1827517e-14   2    24    35
    2.6883628e-15   2   -2000011    1000012

DECAY 6  2.43
    1   2    5    24

DECAY 15 -1
