# SUSY Les Houches Accord 2 - MSSM spectrum + Decays
# SPheno v4.0.5be
# W. Porod, Comput. Phys. Commun. 153 (2003) 275-315, hep-ph/0301101;
# W. Porod, F.~Staub, Comput. Phys. Commun. 183 (2012) 2458
#                     arXiv:1104.1573 [hep-ph] 
# in case of problems send email to porod@physik.uni-wuerzburg.de
# Created: 12.05.2022,  14:40
Block SPINFO         # Program information
     1   SPheno      # spectrum calculator
     2   v4.0.5be    # version number
#
Block SPhenoINFO     # SPheno specific information
    1      2         # using 2-loop RGEs
    2      2         # using pole masses for boundary conditions at mZ
Block MODSEL  # Model selection
    1    0    # general MSSM
Block MINPAR  # Input parameters
    3    5.05472229E+01  # tanb at m_Z    
    4    1.00000000E+00  # Sign(mu)
Block EXTPAR  # non-universal input parameters
    0    4.56294379E+03  # scale for input parameters
    1   -1.13398610E+02  # M_1
    2   -3.04215719E+02  # M_2
    3    4.42130156E+03  # M_3
   11    1.59901308E+03  # A_t
   12   -7.71337381E+02  # A_b
   13    1.64112375E+02  # A_tau
   23    3.06881189E+02  # mu
   25    4.97273041E+01  # tan(beta)
   26    2.28969952E+03  # m_A, pole mass
   31    1.00000000E+04  # M_L11
   32    1.00000000E+04  # M_L22
   33    1.00000000E+04  # M_L33
   34    1.00000000E+04  # M_E11
   35    1.00000000E+04  # M_E22
   36    1.00000000E+04  # M_E33
   41    1.00000000E+04  # M_Q11
   42    1.00000000E+04  # M_Q22
   43    4.00006220E+03  # M_Q33
   44    1.00000000E+04  # M_U11
   45    1.00000000E+04  # M_U22
   46    4.95881400E+03  # M_U33
   47    1.00000000E+04  # M_D11
   48    1.00000000E+04  # M_D22
   49    2.65970727E+03  # M_D33
Block SMINPUTS  # SM parameters
         1     1.27908970E+02  # alpha_em^-1(MZ)^MSbar
         2     1.16637870E-05  # G_mu [GeV^-2]
         3     1.18400000E-01  # alpha_s(MZ)^MSbar
         4     9.11876000E+01  # m_Z(pole)
         5     4.18000000E+00  # m_b(m_b), MSbar
         6     1.73200000E+02  # m_t(pole)
         7     1.77700000E+00  # m_tau(pole)
         8     0.00000000E+00  # m_nu_3
        11     5.10998930E-04  # m_e(pole)
        12     0.00000000E+00  # m_nu_1
        13     1.05658372E-01  # m_muon(pole)
        14     0.00000000E+00  # m_nu_2
        21     5.00000000E-03  # m_d(2 GeV), MSbar
        22     2.50000000E-03  # m_u(2 GeV), MSbar
        23     9.50000000E-02  # m_s(2 GeV), MSbar
        24     1.27000000E+00  # m_c(m_c), MSbar
Block gauge Q=  4.56294379E+03  # (SUSY scale)
   1    3.55362975E-01  # g'(Q)^DRbar
   2    6.65198874E-01  # g(Q)^DRbar
   3    1.21977796E+00  # g3(Q)^DRbar
Block Yu Q=  4.56294379E+03  # (SUSY scale)
  1  1     8.38606728E-06   # Y_u(Q)^DRbar
  2  2     4.26012218E-03   # Y_c(Q)^DRbar
  3  3     1.01310429E+00   # Y_t(Q)^DRbar
Block Yd Q=  4.56294379E+03  # (SUSY scale)
  1  1     8.37979713E-04   # Y_d(Q)^DRbar
  2  2     1.59216146E-02   # Y_s(Q)^DRbar
  3  3     8.31013291E-01   # Y_b(Q)^DRbar
Block Ye Q=  4.56294379E+03  # (SUSY scale)
  1  1     1.46233588E-04   # Y_e(Q)^DRbar
  2  2     3.02364680E-02   # Y_mu(Q)^DRbar
  3  3     5.08527651E-01   # Y_tau(Q)^DRbar
Block Au Q=  4.56294379E+03  # (SUSY scale)
  1  1     0.00000000E+00   # A_u(Q)^DRbar
  2  2     0.00000000E+00   # A_c(Q)^DRbar
  3  3     1.59901311E+03   # A_t(Q)^DRbar
Block Ad Q=  4.56294379E+03  # (SUSY scale)
  1  1     0.00000000E+00   # A_d(Q)^DRbar
  2  2     0.00000000E+00   # A_s(Q)^DRbar
  3  3    -7.71337403E+02   # A_b(Q)^DRbar
Block Ae Q=  4.56294379E+03  # (SUSY scale)
  1  1     0.00000000E+00   # A_e(Q)^DRbar
  2  2     0.00000000E+00   # A_mu(Q)^DRbar
  3  3     1.64112372E+02   # A_tau(Q)^DRbar
Block MSOFT Q=  4.56294379E+03  # soft SUSY breaking masses at Q
   1   -1.13398610E+02  # M_1
   2   -3.04215719E+02  # M_2
   3    4.42130156E+03  # M_3
  21    5.34712034E+06  # M^2_(H,d)
  22    3.69517834E+05  # M^2_(H,u)
  31    1.00000000E+04  # M_(L,11)
  32    1.00000000E+04  # M_(L,22)
  33    1.00000000E+04  # M_(L,33)
  34    1.00000000E+04  # M_(E,11)
  35    1.00000000E+04  # M_(E,22)
  36    1.00000000E+04  # M_(E,33)
  41    1.00000000E+04  # M_(Q,11)
  42    1.00000000E+04  # M_(Q,22)
  43    4.00006220E+03  # M_(Q,33)
  44    1.00000000E+04  # M_(U,11)
  45    1.00000000E+04  # M_(U,22)
  46    4.95881400E+03  # M_(U,33)
  47    1.00000000E+04  # M_(D,11)
  48    1.00000000E+04  # M_(D,22)
  49    2.65970727E+03  # M_(D,33)
Block MASS  # Mass spectrum
#   PDG code      mass          particle
         6     1.73200000E+02  # m_t(pole)
        23     9.11876000E+01  # m_Z(pole)
        24     8.04299946E+01  # W+
        15     1.77700000E+00  # m_tau(pole)
        25     1.24425992E+02  # h0
        35     2.28828008E+03  # H0
        36     2.28969952E+03  # A0
        37     2.28607173E+03  # H+
   1000001     1.01090987E+04  # ~d_L
   2000001     1.00841991E+04  # ~d_R
   1000002     1.01087310E+04  # ~u_L
   2000002     1.00868584E+04  # ~u_R
   1000003     1.01090993E+04  # ~s_L
   2000003     1.00842001E+04  # ~s_R
   1000004     1.01087317E+04  # ~c_L
   2000004     1.00868586E+04  # ~c_R
   1000005     2.81986634E+03  # ~b_1
   2000005     4.13144120E+03  # ~b_2
   1000006     4.13271121E+03  # ~t_1
   2000006     5.03796539E+03  # ~t_2
   1000011     1.00213165E+04  # ~e_L-
   2000011     1.00094046E+04  # ~e_R-
   1000012     1.00205412E+04  # ~nu_eL
   1000013     1.00213197E+04  # ~mu_L-
   2000013     1.00094094E+04  # ~mu_R-
   1000014     1.00205439E+04  # ~nu_muL
   1000015     1.00107436E+04  # ~tau_1-
   2000015     1.00222425E+04  # ~tau_2-
   1000016     1.00213157E+04  # ~nu_tauL
   1000021     4.92040382E+03  # ~g
   1000022     1.11781367E+02  # ~chi_10
   1000023     2.80087933E+02  # ~chi_20
   1000025     3.32488683E+02  # ~chi_30
   1000035     3.91434185E+02  # ~chi_40
   1000024     2.80222153E+02  # ~chi_1+
   1000037     3.92131102E+02  # ~chi_2+
# Higgs mixing
Block alpha # Effective Higgs mixing angle
          -1.98522581E-02   # alpha
Block Hmix Q=  4.56294379E+03  # Higgs mixing parameters
   1    3.06881189E+02  # mu
   2    4.97273041E+01  # tan[beta](Q)
   3    2.42822054E+02  # v(Q)
   4    5.24272389E+06  # m^2_A(Q)
Block stopmix # stop mixing matrix
   1  1    -9.99766767E-01   # Re[R_st(1,1)]
   1  2     2.15965510E-02   # Re[R_st(1,2)]
   2  1    -2.15965510E-02   # Re[R_st(2,1)]
   2  2    -9.99766767E-01   # Re[R_st(2,2)]
Block sbotmix # sbottom mixing matrix
   1  1     3.69998403E-03   # Re[R_sb(1,1)]
   1  2     9.99993155E-01   # Re[R_sb(1,2)]
   2  1    -9.99993155E-01   # Re[R_sb(2,1)]
   2  2     3.69998403E-03   # Re[R_sb(2,2)]
Block staumix # stau mixing matrix
   1  1     1.15716599E-01   # Re[R_sta(1,1)]
   1  2     9.93282270E-01   # Re[R_sta(1,2)]
   2  1    -9.93282270E-01   # Re[R_sta(2,1)]
   2  2     1.15716599E-01   # Re[R_sta(2,2)]
Block Nmix # neutralino mixing matrix
   1  1    -9.86392839E-01   # Re[N(1,1)]
   1  2     1.67458332E-02   # Re[N(1,2)]
   1  3    -1.55465875E-01   # Re[N(1,3)]
   1  4    -5.07848947E-02   # Re[N(1,4)]
   2  1     1.23268788E-01   # Re[N(2,1)]
   2  2     6.73052892E-01   # Re[N(2,2)]
   2  3    -5.55136499E-01   # Re[N(2,3)]
   2  4    -4.72893305E-01   # Re[N(2,4)]
   3  1     7.15013855E-02   # Re[N(3,1)]
   3  2    -8.74676502E-02   # Re[N(3,2)]
   3  3    -6.95027632E-01   # Re[N(3,3)]
   3  4     7.10051796E-01   # Re[N(3,4)]
   4  1     8.19849046E-02   # Re[N(4,1)]
   4  2    -7.34213042E-01   # Re[N(4,2)]
   4  3    -4.29639873E-01   # Re[N(4,3)]
   4  4    -5.19248749E-01   # Re[N(4,4)]
Block Umix # chargino mixing matrix
   1  1    -6.07734313E-01   # Re[U(1,1)]
   1  2     7.94140419E-01   # Re[U(1,2)]
   2  1    -7.94140419E-01   # Re[U(2,1)]
   2  2    -6.07734313E-01   # Re[U(2,2)]
Block Vmix # chargino mixing matrix
   1  1     7.36036057E-01   # Re[V(1,1)]
   1  2     6.76942334E-01   # Re[V(1,2)]
   2  1     6.76942334E-01   # Re[V(2,1)]
   2  2    -7.36036057E-01   # Re[V(2,2)]
DECAY        23     2.49520000E+00   # Z
DECAY        24     2.08500000E+00   # W
DECAY   2000011     5.02786087E+01   # ~e^-_R
#    BR                NDA      ID1      ID2
     9.73018229E-01    2     1000022        11   # BR(~e^-_R -> chi^0_1 e^-)
     1.51759574E-02    2     1000023        11   # BR(~e^-_R -> chi^0_2 e^-)
     5.10273409E-03    2     1000025        11   # BR(~e^-_R -> chi^0_3 e^-)
     6.70299528E-03    2     1000035        11   # BR(~e^-_R -> chi^0_4 e^-)
DECAY   1000011     1.44589604E+02   # ~e^-_L
#    BR                NDA      ID1      ID2
     7.93913566E-02    2     1000022        11   # BR(~e^-_L -> chi^0_1 e^-)
     1.66299164E-01    2     1000023        11   # BR(~e^-_L -> chi^0_2 e^-)
     7.38941470E-04    2     1000025        11   # BR(~e^-_L -> chi^0_3 e^-)
     1.44972332E-01    2     1000035        11   # BR(~e^-_L -> chi^0_4 e^-)
     2.24992975E-01    2    -1000024        12   # BR(~e^-_L -> chi^-_1 nu_e)
     3.83605231E-01    2    -1000037        12   # BR(~e^-_L -> chi^-_2 nu_e)
#    BR                NDA      ID1      ID2       ID3
DECAY   2000013     5.06419614E+01   # ~mu^-_R
#    BR                NDA      ID1      ID2
     9.66124211E-01    2     1000022        13   # BR(~mu^-_R -> chi^0_1 mu^-)
     1.61731952E-02    2     1000023        13   # BR(~mu^-_R -> chi^0_2 mu^-)
     6.79883636E-03    2     1000025        13   # BR(~mu^-_R -> chi^0_3 mu^-)
     7.31645408E-03    2     1000035        13   # BR(~mu^-_R -> chi^0_4 mu^-)
     2.26362124E-03    2    -1000024        14   # BR(~mu^-_R -> chi^-_1 nu_mu)
     1.32368180E-03    2    -1000037        14   # BR(~mu^-_R -> chi^-_2 nu_mu)
DECAY   1000013     1.44771532E+02   # ~mu^-_L
#    BR                NDA      ID1      ID2
     7.93220369E-02    2     1000022        13   # BR(~mu^-_L -> chi^0_1 mu^-)
     1.66477614E-01    2     1000023        13   # BR(~mu^-_L -> chi^0_2 mu^-)
     1.34485004E-03    2     1000025        13   # BR(~mu^-_L -> chi^0_3 mu^-)
     1.45021897E-01    2     1000035        13   # BR(~mu^-_L -> chi^0_4 mu^-)
     2.24710308E-01    2    -1000024        14   # BR(~mu^-_L -> chi^-_1 nu_mu)
     3.83123295E-01    2    -1000037        14   # BR(~mu^-_L -> chi^-_2 nu_mu)
#    BR                NDA      ID1      ID2       ID3
DECAY   1000015     1.53662467E+02   # ~tau^-_1
#    BR                NDA      ID1      ID2
     3.29272109E-01    2     1000022        15   # BR(~tau^-_1 -> chi^0_1 tau^-)
     1.34105668E-01    2     1000023        15   # BR(~tau^-_1 -> chi^0_2 tau^-)
     1.56994701E-01    2     1000025        15   # BR(~tau^-_1 -> chi^0_3 tau^-)
     4.19193310E-02    2     1000035        15   # BR(~tau^-_1 -> chi^0_4 tau^-)
     2.59614196E-01    2    -1000024        16   # BR(~tau^-_1 -> chi^-_1 nu_tau)
     7.80939947E-02    2    -1000037        16   # BR(~tau^-_1 -> chi^-_2 nu_tau)
DECAY   2000015     1.95463924E+02   # ~tau^-_2
#    BR                NDA      ID1      ID2
     6.29368137E-02    2     1000022        15   # BR(~tau^-_2 -> chi^0_1 tau^-)
     1.83720133E-01    2     1000023        15   # BR(~tau^-_2 -> chi^0_2 tau^-)
     1.32592292E-01    2     1000025        15   # BR(~tau^-_2 -> chi^0_3 tau^-)
     1.73074838E-01    2     1000035        15   # BR(~tau^-_2 -> chi^0_4 tau^-)
     1.28220781E-01    2    -1000024        16   # BR(~tau^-_2 -> chi^-_1 nu_tau)
     3.19455142E-01    2    -1000037        16   # BR(~tau^-_2 -> chi^-_2 nu_tau)
#    BR                NDA      ID1      ID2       ID3
DECAY   1000012     1.44594362E+02   # ~nu_e
#    BR                NDA      ID1      ID2
     9.01465622E-02    2     1000022        12   # BR(~nu_e -> chi^0_1 nu_e)
     1.12286581E-01    2     1000023        12   # BR(~nu_e -> chi^0_2 nu_e)
     4.80635665E-03    2     1000025        12   # BR(~nu_e -> chi^0_3 nu_e)
     1.84072161E-01    2     1000035        12   # BR(~nu_e -> chi^0_4 nu_e)
     3.29983064E-01    2     1000024        11   # BR(~nu_e -> chi^+_1 e^-)
     2.78705275E-01    2     1000037        11   # BR(~nu_e -> chi^+_2 e^-)
#    BR                NDA      ID1      ID2       ID3
DECAY   1000014     1.44776268E+02   # ~nu_mu
#    BR                NDA      ID1      ID2
     9.00333207E-02    2     1000022        14   # BR(~nu_mu -> chi^0_1 nu_mu)
     1.12145527E-01    2     1000023        14   # BR(~nu_mu -> chi^0_2 nu_mu)
     4.80031895E-03    2     1000025        14   # BR(~nu_mu -> chi^0_3 nu_mu)
     1.83840932E-01    2     1000035        14   # BR(~nu_mu -> chi^0_4 nu_mu)
     3.30361229E-01    2     1000024        13   # BR(~nu_mu -> chi^+_1 mu^-)
     2.78818673E-01    2     1000037        13   # BR(~nu_mu -> chi^+_2 mu^-)
#    BR                NDA      ID1      ID2       ID3
DECAY   1000016     1.96053063E+02   # ~nu_tau
#    BR                NDA      ID1      ID2
     6.64906348E-02    2     1000022        16   # BR(~nu_tau -> chi^0_1 nu_tau)
     8.28207682E-02    2     1000023        16   # BR(~nu_tau -> chi^0_2 nu_tau)
     3.54509139E-03    2     1000025        16   # BR(~nu_tau -> chi^0_3 nu_tau)
     1.35768685E-01    2     1000035        16   # BR(~nu_tau -> chi^0_4 nu_tau)
     4.08980873E-01    2     1000024        15   # BR(~nu_tau -> chi^+_1 tau^-)
     3.02393948E-01    2     1000037        15   # BR(~nu_tau -> chi^+_2 tau^-)
#    BR                NDA      ID1      ID2       ID3
DECAY   2000001     4.67715033E+02   # ~d_R
#    BR                NDA      ID1      ID2
     1.17088819E-02    2     1000022         1   # BR(~d_R -> chi^0_1 d)
     1.82716746E-04    2     1000023         1   # BR(~d_R -> chi^0_2 d)
     9.87965831E-01    2     1000021         1   # BR(~d_R -> ~g d)
DECAY   1000001     5.99225970E+02   # ~d_L
#    BR                NDA      ID1      ID2
     2.74797722E-03    2     1000022         1   # BR(~d_L -> chi^0_1 d)
     3.14309114E-02    2     1000023         1   # BR(~d_L -> chi^0_2 d)
     7.44025771E-04    2     1000025         1   # BR(~d_L -> chi^0_3 d)
     4.15114780E-02    2     1000035         1   # BR(~d_L -> chi^0_4 d)
     5.47664778E-02    2    -1000024         2   # BR(~d_L -> chi^-_1 u)
     9.33773733E-02    2    -1000037         2   # BR(~d_L -> chi^-_2 u)
     7.75421756E-01    2     1000021         1   # BR(~d_L -> ~g d)
DECAY   2000003     4.67816356E+02   # ~s_R
#    BR                NDA      ID1      ID2
     1.17089665E-02    2     1000022         3   # BR(~s_R -> chi^0_1 s)
     2.16034997E-04    2     1000023         3   # BR(~s_R -> chi^0_2 s)
     1.13792052E-04    2     1000025         3   # BR(~s_R -> chi^0_3 s)
     1.00653197E-04    2     1000035         3   # BR(~s_R -> chi^0_4 s)
     9.87752070E-01    2     1000021         3   # BR(~s_R -> ~g s)
DECAY   1000003     5.99280417E+02   # ~s_L
#    BR                NDA      ID1      ID2
     2.74977761E-03    2     1000022         3   # BR(~s_L -> chi^0_1 s)
     3.14541599E-02    2     1000023         3   # BR(~s_L -> chi^0_2 s)
     7.84851462E-04    2     1000025         3   # BR(~s_L -> chi^0_3 s)
     4.15233249E-02    2     1000035         3   # BR(~s_L -> chi^0_4 s)
     5.47642839E-02    2    -1000024         4   # BR(~s_L -> chi^-_1 c)
     9.33721932E-02    2    -1000037         4   # BR(~s_L -> chi^-_2 c)
     7.75351409E-01    2     1000021         3   # BR(~s_L -> ~g s)
DECAY   1000005     7.67030976E+01   # ~b_1
#    BR                NDA      ID1      ID2
     3.22506729E-02    2     1000022         5   # BR(~b_1 -> chi^0_1 b)
     1.53607090E-01    2     1000023         5   # BR(~b_1 -> chi^0_2 b)
     2.37173783E-01    2     1000025         5   # BR(~b_1 -> chi^0_3 b)
     8.91308323E-02    2     1000035         5   # BR(~b_1 -> chi^0_4 b)
     3.11248494E-01    2    -1000024         6   # BR(~b_1 -> chi^-_1 t)
     1.76589128E-01    2    -1000037         6   # BR(~b_1 -> chi^-_2 t)
DECAY   2000005     1.93552944E+02   # ~b_2
#    BR                NDA      ID1      ID2
     1.04460552E-02    2     1000022         5   # BR(~b_2 -> chi^0_1 b)
     1.28582147E-01    2     1000023         5   # BR(~b_2 -> chi^0_2 b)
     1.40873233E-01    2     1000025         5   # BR(~b_2 -> chi^0_3 b)
     1.05327314E-01    2     1000035         5   # BR(~b_2 -> chi^0_4 b)
     2.63560956E-01    2    -1000024         6   # BR(~b_2 -> chi^-_1 t)
     3.50480199E-01    2    -1000037         6   # BR(~b_2 -> chi^-_2 t)
     2.56647139E-04    2     1000005        23   # BR(~b_2 -> ~b_1 Z)
     4.73448774E-04    2     1000005        25   # BR(~b_2 -> ~b_1 h^0)
DECAY   2000002     4.84879690E+02   # ~u_R
#    BR                NDA      ID1      ID2
     4.51894497E-02    2     1000022         2   # BR(~u_R -> chi^0_1 u)
     7.04823195E-04    2     1000023         2   # BR(~u_R -> chi^0_2 u)
     2.36989218E-04    2     1000025         2   # BR(~u_R -> chi^0_3 u)
     3.11316893E-04    2     1000035         2   # BR(~u_R -> chi^0_4 u)
     9.53557421E-01    2     1000021         2   # BR(~u_R -> ~g u)
DECAY   1000002     5.99207969E+02   # ~u_L
#    BR                NDA      ID1      ID2
     1.87451608E-03    2     1000022         2   # BR(~u_L -> chi^0_1 u)
     3.58120765E-02    2     1000023         2   # BR(~u_L -> chi^0_2 u)
     4.13839379E-04    2     1000025         2   # BR(~u_L -> chi^0_3 u)
     3.83369629E-02    2     1000035         2   # BR(~u_L -> chi^0_4 u)
     8.03310569E-02    2     1000024         1   # BR(~u_L -> chi^+_1 d)
     6.78497278E-02    2     1000037         1   # BR(~u_L -> chi^+_2 d)
     7.75381820E-01    2     1000021         2   # BR(~u_L -> ~g u)
DECAY   2000004     4.84886946E+02   # ~c_R
#    BR                NDA      ID1      ID2
     4.51887921E-02    2     1000022         4   # BR(~c_R -> chi^0_1 c)
     7.06489144E-04    2     1000023         4   # BR(~c_R -> chi^0_2 c)
     2.40764757E-04    2     1000025         4   # BR(~c_R -> chi^0_3 c)
     3.13330653E-04    2     1000035         4   # BR(~c_R -> chi^0_4 c)
     9.53543130E-01    2     1000021         4   # BR(~c_R -> ~g c)
DECAY   1000004     5.99262392E+02   # ~c_L
#    BR                NDA      ID1      ID2
     1.87436157E-03    2     1000022         4   # BR(~c_L -> chi^0_1 c)
     3.58101886E-02    2     1000023         4   # BR(~c_L -> chi^0_2 c)
     4.16866486E-04    2     1000025         4   # BR(~c_L -> chi^0_3 c)
     3.83351142E-02    2     1000035         4   # BR(~c_L -> chi^0_4 c)
     8.03771925E-02    2     1000024         3   # BR(~c_L -> chi^+_1 s)
     6.78748047E-02    2     1000037         3   # BR(~c_L -> chi^+_2 s)
     7.75311472E-01    2     1000021         4   # BR(~c_L -> ~g c)
DECAY   1000006     1.98024207E+02   # ~t_1
#    BR                NDA      ID1      ID2
     8.48110619E-04    2     1000022         4   # BR(~t_1 -> chi^0_1 c)
     3.64814036E-03    2     1000022         6   # BR(~t_1 -> chi^0_1 t)
     1.60986907E-02    2     1000023         4   # BR(~t_1 -> chi^0_2 c)
     1.41055136E-01    2     1000023         6   # BR(~t_1 -> chi^0_2 t)
     2.12779446E-01    2     1000025         6   # BR(~t_1 -> chi^0_3 t)
     1.54471055E-01    2     1000035         6   # BR(~t_1 -> chi^0_4 t)
     2.83745320E-01    2     1000024         5   # BR(~t_1 -> chi^+_1 b)
     1.80750026E-01    2     1000037         5   # BR(~t_1 -> chi^+_2 b)
     5.03595285E-04    2     1000005        24   # BR(~t_1 -> ~b_1 W^+)
#    BR                NDA      ID1      ID2       ID3
     6.10048076E-03    3     1000022        24         5   # BR(~t_1 -> chi^0_1 W^+ b)
DECAY   2000006     2.18553438E+02   # ~t_2
#    BR                NDA      ID1      ID2
     5.08710550E-02    2     1000022         6   # BR(~t_2 -> chi^0_1 t)
     1.02387097E-01    2     1000023         6   # BR(~t_2 -> chi^0_2 t)
     2.34138452E-01    2     1000025         6   # BR(~t_2 -> chi^0_3 t)
     1.29101162E-01    2     1000035         6   # BR(~t_2 -> chi^0_4 t)
     2.07795922E-01    2     1000024         5   # BR(~t_2 -> chi^+_1 b)
     2.58463287E-01    2     1000037         5   # BR(~t_2 -> chi^+_2 b)
     6.44421714E-03    2     2000005        24   # BR(~t_2 -> ~b_2 W^+)
     3.19733102E-03    2     1000006        23   # BR(~t_2 -> ~t_1 Z)
     7.60065657E-03    2     1000006        25   # BR(~t_2 -> ~t_1 h^0)
DECAY   1000024     1.07872665E-01   # chi^+_1
#    BR                NDA      ID1      ID2
     9.99999741E-01    2     1000022        24   # BR(chi^+_1 -> chi^0_1 W^+)
#    BR                NDA      ID1      ID2       ID3
DECAY   1000037     1.07652025E+00   # chi^+_2
#    BR                NDA      ID1      ID2
     9.45382943E-02    2     1000022        24   # BR(chi^+_2 -> chi^0_1 W^+)
     7.97189682E-01    2     1000023        24   # BR(chi^+_2 -> chi^0_2 W^+)
     1.07633506E-01    2     1000024        23   # BR(chi^+_2 -> chi^+_1 Z)
#    BR                NDA      ID1      ID2       ID3
     1.87418457E-04    3     1000025        -1         2   # BR(chi^+_2 -> chi^0_3 d_bar u)
     1.87104475E-04    3     1000025        -3         4   # BR(chi^+_2 -> chi^0_3 s_bar c)
DECAY   1000022     0.00000000E+00   # chi^0_1
DECAY   1000023     6.68219133E-02   # chi^0_2
#    BR                NDA      ID1      ID2
     3.16490733E-01    2     1000022        23   # BR(chi^0_2 -> chi^0_1 Z)
     6.83489454E-01    2     1000022        25   # BR(chi^0_2 -> chi^0_1 h^0)
#    BR                NDA      ID1      ID2       ID3
DECAY   1000025     3.44128155E-01   # chi^0_3
#    BR                NDA      ID1      ID2
     6.03058453E-01    2     1000022        23   # BR(chi^0_3 -> chi^0_1 Z)
     3.92632080E-01    2     1000022        25   # BR(chi^0_3 -> chi^0_1 h^0)
#    BR                NDA      ID1      ID2       ID3
     2.78853008E-04    3     1000023         2        -2   # BR(chi^0_3 -> chi^0_2 u u_bar)
     2.76968442E-04    3     1000023         4        -4   # BR(chi^0_3 -> chi^0_2 c c_bar)
     3.57538486E-04    3     1000023         1        -1   # BR(chi^0_3 -> chi^0_2 d d_bar)
     3.57527039E-04    3     1000023         3        -3   # BR(chi^0_3 -> chi^0_2 s s_bar)
     3.36938760E-04    3     1000023         5        -5   # BR(chi^0_3 -> chi^0_2 b b_bar)
     4.78142085E-04    3     1000023        12       -12   # BR(chi^0_3 -> chi^0_2 nu_e nu_bar_e)
     3.18523154E-04    3     1000024         1        -2   # BR(chi^0_3 -> chi^+_1 d u_bar)
     3.18523154E-04    3    -1000024        -1         2   # BR(chi^0_3 -> chi^-_1 d_bar u)
     3.17752034E-04    3     1000024         3        -4   # BR(chi^0_3 -> chi^+_1 s c_bar)
     3.17752034E-04    3    -1000024        -3         4   # BR(chi^0_3 -> chi^-_1 s_bar c)
     1.06174930E-04    3     1000024        11       -12   # BR(chi^0_3 -> chi^+_1 e^- nu_bar_e)
     1.06174930E-04    3    -1000024       -11        12   # BR(chi^0_3 -> chi^-_1 e^+ nu_e)
     1.06174417E-04    3     1000024        13       -14   # BR(chi^0_3 -> chi^+_1 mu^- nu_bar_mu)
     1.06174417E-04    3    -1000024       -13        14   # BR(chi^0_3 -> chi^-_1 mu^+ nu_mu)
     1.05589466E-04    3     1000024        15       -16   # BR(chi^0_3 -> chi^+_1 tau^- nu_bar_tau)
     1.05589466E-04    3    -1000024       -15        16   # BR(chi^0_3 -> chi^-_1 tau^+ nu_tau)
DECAY   1000035     1.71708255E+00   # chi^0_4
#    BR                NDA      ID1      ID2
     4.73382701E-01    2     1000024       -24   # BR(chi^0_4 -> chi^+_1 W^-)
     4.73382701E-01    2    -1000024        24   # BR(chi^0_4 -> chi^-_1 W^+)
     1.64040072E-02    2     1000022        23   # BR(chi^0_4 -> chi^0_1 Z)
     3.58910095E-02    2     1000022        25   # BR(chi^0_4 -> chi^0_1 h^0)
#    BR                NDA      ID1      ID2       ID3
     1.26908581E-04    3     1000025         1        -1   # BR(chi^0_4 -> chi^0_3 d d_bar)
     1.26905577E-04    3     1000025         3        -3   # BR(chi^0_4 -> chi^0_3 s s_bar)
     1.21485320E-04    3     1000025         5        -5   # BR(chi^0_4 -> chi^0_3 b b_bar)
     1.69708599E-04    3     1000025        12       -12   # BR(chi^0_4 -> chi^0_3 nu_e nu_bar_e)
DECAY   1000021     9.60917094E+01   # ~g
#    BR                NDA      ID1      ID2
     2.40756427E-02    2     1000006        -4   # BR(~g -> ~t_1 c_bar)
     2.40756427E-02    2    -1000006         4   # BR(~g -> ~t^*_1 c)
     6.50589019E-02    2     1000006        -6   # BR(~g -> ~t_1 t_bar)
     6.50589019E-02    2    -1000006         6   # BR(~g -> ~t^*_1 t)
     3.41773256E-01    2     1000005        -5   # BR(~g -> ~b_1 b_bar)
     3.41773256E-01    2    -1000005         5   # BR(~g -> ~b^*_1 b)
     6.59438138E-02    2     2000005        -5   # BR(~g -> ~b_2 b_bar)
     6.59438138E-02    2    -2000005         5   # BR(~g -> ~b^*_2 b)
#    BR                NDA      ID1      ID2       ID3
     3.27554087E-04    3     1000022         6        -6   # BR(~g -> chi^0_1 t t_bar)
     6.25175386E-04    3     1000023         6        -6   # BR(~g -> chi^0_2 t t_bar)
     1.44054327E-03    3     1000025         6        -6   # BR(~g -> chi^0_3 t t_bar)
     7.83872302E-04    3     1000035         6        -6   # BR(~g -> chi^0_4 t t_bar)
     6.42908894E-04    3     1000024         5        -6   # BR(~g -> chi^+_1 b t_bar)
     6.42908894E-04    3    -1000024        -5         6   # BR(~g -> chi^-_1 b_bar t)
     7.92719849E-04    3     1000037         5        -6   # BR(~g -> chi^+_2 b t_bar)
     7.92719849E-04    3    -1000037        -5         6   # BR(~g -> chi^-_2 b_bar t)
DECAY        25     3.51398566E-03   # Gamma(h0)
     2.53370443E-03   2        22        22   # BR(h0 -> photon photon)
     1.56839481E-03   2        22        23   # BR(h0 -> photon Z)
     2.84087156E-02   2        23        23   # BR(h0 -> Z Z)
     2.37375851E-01   2       -24        24   # BR(h0 -> W W)
     7.90673858E-02   2        21        21   # BR(h0 -> gluon gluon)
     5.01856285E-09   2       -11        11   # BR(h0 -> Electron electron)
     2.23234344E-04   2       -13        13   # BR(h0 -> Muon muon)
     6.43657027E-02   2       -15        15   # BR(h0 -> Tau tau)
     1.42171454E-07   2        -2         2   # BR(h0 -> Up up)
     2.75917134E-02   2        -4         4   # BR(h0 -> Charm charm)
     5.81327549E-07   2        -1         1   # BR(h0 -> Down down)
     2.10252356E-04   2        -3         3   # BR(h0 -> Strange strange)
     5.58654317E-01   2        -5         5   # BR(h0 -> Bottom bottom)
DECAY        35     9.15703255E+01   # Gamma(HH)
     8.31936192E-08   2        22        22   # BR(HH -> photon photon)
     1.92004110E-07   2        22        23   # BR(HH -> photon Z)
     1.53720927E-07   2        23        23   # BR(HH -> Z Z)
     6.72601044E-08   2       -24        24   # BR(HH -> W W)
     1.17717113E-05   2        21        21   # BR(HH -> gluon gluon)
     8.93422343E-09   2       -11        11   # BR(HH -> Electron electron)
     3.97761265E-04   2       -13        13   # BR(HH -> Muon muon)
     1.14873328E-01   2       -15        15   # BR(HH -> Tau tau)
     2.31250437E-14   2        -2         2   # BR(HH -> Up up)
     4.48567442E-09   2        -4         4   # BR(HH -> Charm charm)
     3.11867430E-04   2        -6         6   # BR(HH -> Top top)
     6.66479647E-07   2        -1         1   # BR(HH -> Down down)
     2.41062166E-04   2        -3         3   # BR(HH -> Strange strange)
     5.71728647E-01   2        -5         5   # BR(HH -> Bottom bottom)
     6.84262334E-02   2  -1000024   1000024   # BR(HH -> Chargino1 chargino1)
     4.54778177E-02   2  -1000024   1000037   # BR(HH -> Chargino1 chargino2)
     4.54778177E-02   2  -1000037   1000024   # BR(HH -> Chargino2 chargino1)
     3.04276686E-02   2  -1000037   1000037   # BR(HH -> Chargino2 chargino2)
     1.66772196E-03   2   1000022   1000022   # BR(HH -> neutralino1 neutralino1)
     1.60394619E-02   2   1000022   1000023   # BR(HH -> neutralino1 neutralino2)
     1.22523459E-02   2   1000022   1000025   # BR(HH -> neutralino1 neutralino3)
     1.64552506E-03   2   1000022   1000035   # BR(HH -> neutralino1 neutralino4)
     2.28054837E-02   2   1000023   1000023   # BR(HH -> neutralino2 neutralino2)
     1.29361267E-02   2   1000023   1000025   # BR(HH -> neutralino2 neutralino3)
     1.09293095E-03   2   1000023   1000035   # BR(HH -> neutralino2 neutralino4)
     1.48508684E-03   2   1000025   1000025   # BR(HH -> neutralino3 neutralino3)
     3.16882728E-02   2   1000025   1000035   # BR(HH -> neutralino3 neutralino4)
     2.10106394E-02   2   1000035   1000035   # BR(HH -> neutralino4 neutralino4)
     1.25345059E-06   2        25        25   # BR(HH -> h0 h0)
DECAY        36     8.71177107E+01   # Gamma(A0)
     4.14874059E-09   2        22        22   # BR(A0 -> photon photon)
     6.90771072E-08   2        22        23   # BR(A0 -> photon Z)
     1.86646865E-05   2        21        21   # BR(A0 -> gluon gluon)
     8.72409169E-09   2       -11        11   # BR(A0 -> Electron electron)
     3.88406243E-04   2       -13        13   # BR(A0 -> Muon muon)
     1.12171907E-01   2       -15        15   # BR(A0 -> Tau tau)
     2.16424107E-14   2        -2         2   # BR(A0 -> Up up)
     4.19774288E-09   2        -4         4   # BR(A0 -> Charm charm)
     2.99189392E-04   2        -6         6   # BR(A0 -> Top top)
     6.50751750E-07   2        -1         1   # BR(A0 -> Down down)
     2.35373339E-04   2        -3         3   # BR(A0 -> Strange strange)
     5.58245848E-01   2        -5         5   # BR(A0 -> Bottom bottom)
     7.17331744E-02   2  -1000024   1000024   # BR(A0 -> Chargino1 chargino1)
     4.80742758E-02   2  -1000024   1000037   # BR(A0 -> Chargino1 chargino2)
     4.80742758E-02   2  -1000037   1000024   # BR(A0 -> Chargino2 chargino1)
     3.17745196E-02   2  -1000037   1000037   # BR(A0 -> Chargino2 chargino2)
     1.72302878E-03   2   1000022   1000022   # BR(A0 -> neutralino1 neutralino1)
     1.63153839E-02   2   1000022   1000023   # BR(A0 -> neutralino1 neutralino2)
     1.36919962E-02   2   1000022   1000025   # BR(A0 -> neutralino1 neutralino3)
     1.52084736E-03   2   1000022   1000035   # BR(A0 -> neutralino1 neutralino4)
     2.36441807E-02   2   1000023   1000023   # BR(A0 -> neutralino2 neutralino2)
     1.42467757E-02   2   1000023   1000025   # BR(A0 -> neutralino2 neutralino3)
     1.25420680E-03   2   1000023   1000035   # BR(A0 -> neutralino2 neutralino4)
     1.83281759E-03   2   1000025   1000025   # BR(A0 -> neutralino3 neutralino3)
     3.23727409E-02   2   1000025   1000035   # BR(A0 -> neutralino3 neutralino4)
     2.23814238E-02   2   1000035   1000035   # BR(A0 -> neutralino4 neutralino4)
     2.27122128E-07   2        23        25   # BR(A0 -> Z h0)
     7.26422066E-14   2        23        35   # BR(A0 -> Z HH)
     6.52373170E-39   2        25        25   # BR(A0 -> h0 h0)
DECAY        37     9.86355853E+01   # Gamma(Hp)
     9.79290390E-09   2       -11        12   # BR(Hp -> Electron nu_e)
     4.18677227E-04   2       -13        14   # BR(Hp -> Muon nu_mu)
     1.18425668E-01   2       -15        16   # BR(Hp -> Tau nu_tau)
     6.34252865E-07   2        -1         2   # BR(Hp -> Down up)
     1.06719419E-05   2        -3         2   # BR(Hp -> Strange up)
     6.26593541E-06   2        -5         2   # BR(Hp -> Bottom up)
     2.97462727E-08   2        -1         4   # BR(Hp -> Down charm)
     2.28577235E-04   2        -3         4   # BR(Hp -> Strange charm)
     8.77454921E-04   2        -5         4   # BR(Hp -> Bottom charm)
     2.39715215E-08   2        -1         6   # BR(Hp -> Down top)
     8.58389818E-07   2        -3         6   # BR(Hp -> Strange top)
     5.90955647E-01   2        -5         6   # BR(Hp -> Bottom top)
     2.63862336E-02   2   1000022   1000024   # BR(Hp -> neutralino1 chargino1)
     2.00194770E-03   2   1000022   1000037   # BR(Hp -> neutralino1 chargino2)
     9.84374559E-04   2   1000023   1000024   # BR(Hp -> neutralino2 chargino1)
     1.02171518E-01   2   1000023   1000037   # BR(Hp -> neutralino2 chargino2)
     4.06630419E-02   2   1000024   1000025   # BR(Hp -> chargino1 neutralino3)
     4.37969458E-02   2   1000025   1000037   # BR(Hp -> neutralino3 chargino2)
     7.26657458E-02   2   1000024   1000035   # BR(Hp -> chargino1 neutralino4)
     4.05474574E-04   2   1000035   1000037   # BR(Hp -> neutralino4 chargino2)
     1.99854657E-07   2        24        25   # BR(Hp -> W h0)
DECAY         6     2.43000000E+00   # top
#    BR                NDA      ID1      ID2
     1.00000000E+00    2           5        24   # BR(t -> b W)
Block HiggsBoundsInputHiggsCouplingsFermions
# ScalarNormEffCoupSq PseudoSNormEffCoupSq NP IP1 IP2 IP2
    9.74828448E-01    0.00000000E+00        3  25   5   5  # h0-b-b eff. coupling^2, normalised to SM
    2.47282994E+03    0.00000000E+00        3  35   5   5  # H0-b-b eff. coupling^2, normalised to SM
    0.00000000E+00    2.47280477E+03        3  36   5   5  # A0-b-b eff. coupling^2, normalised to SM
#
    1.00001018E+00    0.00000000E+00        3  25   6   6  # h0-t-t eff. coupling^2, normalised to SM
    3.94219737E-04    0.00000000E+00        3  35   6   6  # H0-t-t eff. coupling^2, normalised to SM
    0.00000000E+00    4.04399090E-04        3  36   6   6  # A0-t-t eff. coupling^2, normalised to SM
#
    9.74828448E-01    0.00000000E+00        3  25  15  15  # h0-tau-tau eff. coupling^2, normalised to SM
    2.47282994E+03    0.00000000E+00        3  35  15  15  # H0-tau-tau eff. coupling^2, normalised to SM
    0.00000000E+00    2.47280477E+03        3  36  15  15  # A0-tau-tau eff. coupling^2, normalised to SM
#
Block HiggsBoundsInputHiggsCouplingsBosons
    9.99999935E-01        3  25  24  24  # h0-W-W eff. coupling^2, normalised to SM
    6.48763198E-08        3  35  24  24  # H0-W-W eff. coupling^2, normalised to SM
    0.00000000E+00        3  36  24  24  # A0-W-W eff. coupling^2, normalised to SM
#
    9.99999935E-01        3  25  23  23  # h0-Z-Z eff. coupling^2, normalised to SM
    6.48763198E-08        3  35  23  23  # H0-Z-Z eff. coupling^2, normalised to SM
    0.00000000E+00        3  36  23  23  # A0-Z-Z eff. coupling^2, normalised to SM
#
    1.26912112E+00        3  25  21  21  # h0-g-g eff. coupling^2, normalised to SM
    1.60103732E-02        3  35  21  21  # H0-g-g eff. coupling^2, normalised to SM
    1.51120789E-01        3  36  21  21  # A0-g-g eff. coupling^2, normalised to SM
#
    0.00000000E+00        3  25  25  23  # h0-h0-Z eff. coupling^2, normalised to SM
    0.00000000E+00        3  35  25  23  # H0-h0-Z eff. coupling^2, normalised to SM
    6.48763198E-08        3  36  25  23  # A0-h0-Z eff. coupling^2, normalised to SM
    0.00000000E+00        3  35  35  23  # H0-H0-Z eff. coupling^2, normalised to SM
    9.99999935E-01        3  36  35  23  # A0-H0-Z eff. coupling^2, normalised to SM
    0.00000000E+00        3  36  36  23  # A0-A0-Z eff. coupling^2, normalised to SM
#
    0.00000000E+00        4  25  21  21  23  # h0-g-g-Z eff. coupling^2, normalised to SM
    0.00000000E+00        4  35  21  21  23  # H0-g-g-Z eff. coupling^2, normalised to SM
    0.00000000E+00        4  36  21  21  23  # A0-g-g-Z eff. coupling^2, normalised to SM
Block SPhenoLowEnergy  # low energy observables
    1    3.29901202E-04   # BR(b -> s gamma)
    2    1.58908616E-06   # BR(b -> s mu+ mu-)
    3    3.52507976E-05   # BR(b -> s nu nu)
    4    2.55789908E-15   # BR(Bd -> e+ e-)
    5    1.09270607E-10   # BR(Bd -> mu+ mu-)
    6    2.28783150E-08   # BR(Bd -> tau+ tau-)
    7    8.49203454E-14   # BR(Bs -> e+ e-)
    8    3.62779914E-09   # BR(Bs -> mu+ mu-)
    9    7.69761336E-07   # BR(Bs -> tau+ tau-)
   10    9.41566363E-05   # BR(B_u -> tau nu)
   11    9.72602005E-01   # BR(B_u -> tau nu)/BR(B_u -> tau nu)_SM
   12    5.41809865E-01   # |Delta(M_Bd)| [ps^-1] 
   13    1.93449172E+01   # |Delta(M_Bs)| [ps^-1] 
   14    0.00000000E+00   # neutron EDM according to the chiral quark model
   15    0.00000000E+00   # neutron EDM according to the relativistic quark-parton model
   16    2.15676883E-03   # epsilon_K
   17    2.28165587E-15   # Delta(M_K)
   18    2.47985248E-11   # BR(K^0 -> pi^0 nu nu)
   19    8.29016146E-11   # BR(K^+ -> pi^+ nu nu)
   20   -3.28848608E-16   # Delta(g-2)_electron/2
   21   -1.40595192E-11   # Delta(g-2)_muon/2
   22   -3.99285440E-09   # Delta(g-2)_tau/2
   23    0.00000000E+00   # electric dipole moment of the electron
   24    0.00000000E+00   # electric dipole moment of the muon
   25    0.00000000E+00   # electric dipole moment of the tau
   26    0.00000000E+00   # Br(mu -> e gamma)
   27    0.00000000E+00   # Br(tau -> e gamma)
   28    0.00000000E+00   # Br(tau -> mu gamma)
   29    0.00000000E+00   # Br(mu -> 3 e)
   30    0.00000000E+00   # Br(tau -> 3 e)
   31    0.00000000E+00   # Br(tau -> 3 mu)
   39    7.28630111E-05   # Delta(rho_parameter)
   40    0.00000000E+00   # BR(Z -> e mu)
   41    0.00000000E+00   # BR(Z -> e tau)
   42    0.00000000E+00   # BR(Z -> mu tau)
Block FWCOEF Q=  1.60000000E+02  # Wilson coefficients at scale Q
#    id        order  M        value         comment
     0305 4422   00   0    -1.88819110E-01   # C7
     0305 4422   00   2    -1.98463211E-01   # C7
     0305 4322   00   2    -2.08070906E-04   # C7'
     0305 6421   00   0    -9.52278348E-02   # C8
     0305 6421   00   2    -1.08193970E-01   # C8
     0305 6321   00   2    -2.70479558E-04   # C8'
 03051111 4133   00   0     1.63217343E+00   # C9 e+e-
 03051111 4133   00   2     1.63236002E+00   # C9 e+e-
 03051111 4233   00   2     4.96345015E-04   # C9' e+e-
 03051111 4137   00   0    -4.45486554E+00   # C10 e+e-
 03051111 4137   00   2    -4.45315072E+00   # C10 e+e-
 03051111 4237   00   2    -3.64415388E-03   # C10' e+e-
 03051313 4133   00   0     1.63217343E+00   # C9 mu+mu-
 03051313 4133   00   2     1.63235987E+00   # C9 mu+mu-
 03051313 4233   00   2     4.96342854E-04   # C9' mu+mu-
 03051313 4137   00   0    -4.45486554E+00   # C10 mu+mu-
 03051313 4137   00   2    -4.45315087E+00   # C10 mu+mu-
 03051313 4237   00   2    -3.64415262E-03   # C10' mu+mu-
 03051212 4137   00   0     1.50535012E+00   # C11 nu_1 nu_1
 03051212 4137   00   2     1.50498131E+00   # C11 nu_1 nu_1
 03051212 4237   00   2     7.87032212E-04   # C11' nu_1 nu_1
 03051414 4137   00   0     1.50535012E+00   # C11 nu_2 nu_2
 03051414 4137   00   2     1.50498131E+00   # C11 nu_2 nu_2
 03051414 4237   00   2     7.87032629E-04   # C11' nu_2 nu_2
 03051616 4137   00   0     1.50535012E+00   # C11 nu_3 nu_3
 03051616 4137   00   2     1.50498131E+00   # C11 nu_3 nu_3
 03051616 4237   00   2     7.87150240E-04   # C11' nu_3 nu_3
Block IMFWCOEF Q=  1.60000000E+02  # Im(Wilson coefficients) at scale Q
#    id        order  M        value         comment
     0305 4422   00   0     3.85814118E-07   # C7
     0305 4422   00   2    -3.78833959E-06   # C7
     0305 4322   00   2    -4.23175412E-11   # C7'
     0305 6421   00   0     3.30475308E-07   # C8
     0305 6421   00   2    -7.48834602E-06   # C8
     0305 6321   00   2    -1.28290499E-07   # C8'
 03051111 4133   00   2     6.78600646E-07   # C9 e+e-
 03051111 4233   00   2     1.06377900E-05   # C9' e+e-
 03051111 4137   00   2     3.03818470E-08   # C10 e+e-
 03051111 4237   00   2    -7.81107657E-05   # C10' e+e-
 03051313 4133   00   2     6.78594999E-07   # C9 mu+mu-
 03051313 4233   00   2     1.06377859E-05   # C9' mu+mu-
 03051313 4137   00   2     3.03878829E-08   # C10 mu+mu-
 03051313 4237   00   2    -7.81107778E-05   # C10' mu+mu-
 03051212 4137   00   2     2.09411861E-08   # C11 nu_1 nu_1
 03051212 4237   00   2     1.68696775E-05   # C11' nu_1 nu_1
 03051414 4137   00   2     2.09414854E-08   # C11 nu_2 nu_2
 03051414 4237   00   2     1.68696775E-05   # C11' nu_2 nu_2
 03051616 4137   00   2     2.10241087E-08   # C11 nu_3 nu_3
 03051616 4237   00   2     1.68696775E-05   # C11' nu_3 nu_3
