BLOCK SPINFO
   1   SPheno
   2   v4.0.5be

BLOCK SPHENOINFO
   1   2
   2   2

BLOCK MODSEL
   1   0

BLOCK MINPAR
   3    43.204901
   4    1

BLOCK EXTPAR
   0    1078.9537
   1    493.82983
   2    1628.3394
   3    3000
   11    3526.4791
   12   -1721.0595
   13   -1017.9668
   23    963.44064
   25    41.951088
   26    1803.7365
   31    1102.1676
   32    1102.1676
   33    1606.052
   34    1942.0714
   35    1942.0714
   36    1255.3637
   41    5000
   42    5000
   43    1829.9349
   44    5000
   45    5000
   46    845.27658
   47    5000
   48    5000
   49    1437.6237

BLOCK SMINPUTS
   1    127.90897
   2    1.1663787e-05
   3    0.1184
   4    91.1876
   5    4.18
   6    173.2
   7    1.777
   8    0
   11    0.00051099893
   12    0
   13    0.10565837
   14    0
   21    0.005
   22    0.0025
   23    0.095
   24    1.27

BLOCK GAUGE Q=  1078.9537
   1    0.35536298
   2    0.66519887
   3    1.219778

BLOCK YU Q=  1078.9537
   1   1    8.3867539e-06
   2   2    0.004260471
   3   3    1.0131872

BLOCK YD Q=  1078.9537
   1   1    0.00070699668
   2   2    0.013432937
   3   3    0.70111916

BLOCK YE Q=  1078.9537
   1   1    0.00012337609
   2   2    0.025510262
   3   3    0.42904065

BLOCK AU Q=  1078.9537
   1   1    0
   2   2    0
   3   3    3526.4792

BLOCK AD Q=  1078.9537
   1   1    0
   2   2    0
   3   3   -1721.0593

BLOCK AE Q=  1078.9537
   1   1    0
   2   2    0
   3   3   -1017.9668

BLOCK MSOFT Q=  1078.9537
   1    493.82983
   2    1628.3394
   3    3000
   21    2319979.4
   22   -908935.2
   31    1102.1676
   32    1102.1676
   33    1606.052
   34    1942.0714
   35    1942.0714
   36    1255.3637
   41    5000
   42    5000
   43    1829.9349
   44    5000
   45    5000
   46    845.27658
   47    5000
   48    5000
   49    1437.6237

BLOCK MASS
   6    173.2
   23    91.1876
   24    80.429995
   15    1.777
   25    123.95068
   35    1803.3057
   36    1803.7365
   37    1805.9107
   1000001    5010.0276
   2000001    5003.2409
   1000002    5009.5979
   2000002    5004.4113
   1000003    5010.0378
   2000003    5003.2475
   1000004    5009.6038
   2000004    5004.4126
   1000005    1397.0064
   2000005    1784.6993
   1000006    640.28047
   2000006    1818.1736
   1000011    1113.4036
   2000011    1944.7693
   1000012    1110.2611
   1000013    1113.3977
   2000013    1944.7544
   1000014    1110.2567
   1000015    1253.4202
   2000015    1614.6872
   1000016    1610.708
   1000021    3164.7321
   1000022    494.01572
   1000023    966.33639
   1000025   -967.66532
   1000035    1676.2917
   1000024    964.58693
   1000037    1676.437

BLOCK ALPHA
      -0.023251439

BLOCK HMIX Q=  1078.9537
   1    963.44064
   2    41.951088
   3    244.27429
   4    3253465.4

BLOCK STOPMIX
   1   1   -0.19725031
   1   2    0.98035316
   2   1   -0.98035316
   2   2   -0.19725031

BLOCK SBOTMIX
   1   1    0.056030945
   1   2    0.99842903
   2   1   -0.99842903
   2   2    0.056030945

BLOCK STAUMIX
   1   1    0.072541963
   1   2    0.99736536
   2   1   -0.99736536
   2   2    0.072541963

BLOCK NMIX
   1   1   -0.99737679
   1   2    0.0021566765
   1   3   -0.064100567
   1   4    0.033555919
   2   1    0.069040988
   2   2    0.078461978
   2   3   -0.70373461
   2   4    0.7027337
   3   1    0.021560202
   3   2   -0.02046001
   3   3   -0.70637429
   3   4   -0.70721418
   4   1   -0.002834291
   4   2    0.9967048
   4   3    0.041037455
   4   4   -0.069910223

BLOCK UMIX
   1   1   -0.056896466
   1   2    0.99838008
   2   1    0.99838008
   2   2    0.056896466

BLOCK VMIX
   1   1   -0.097555689
   1   2    0.99523007
   2   1    0.99523007
   2   2    0.097555689

BLOCK HIGGSBOUNDSINPUTHIGGSCOUPLINGSFERMIONS
       0, 1759.8938,3,36,15,15

BLOCK HIGGSBOUNDSINPUTHIGGSCOUPLINGSBOSONS
       0,4,36,21,21,23

BLOCK SPHENOLOWENERGY
   1    0.0003840993
   2    1.5864528e-06
   3    3.5220709e-05
   4    3.8073647e-15
   5    1.6264395e-10
   6    3.3902526e-08
   7    1.2701989e-13
   8    5.4261998e-09
   9    1.1455958e-06
   10    9.0539061e-05
   11    0.93523384
   12    0.54554585
   13    19.467711
   14    0
   15    0
   16    0.0021874916
   17    2.2819691e-15
   18    2.478932e-11
   19    8.287368e-11
   20    7.0311303e-15
   21    3.0060295e-10
   22    6.3725753e-08
   23    0
   24    0
   25    0
   26    0
   27    0
   28    0
   29    0
   30    0
   31    0
   39    7.9248728e-05
   40    0
   41    0
   42    0

BLOCK FWCOEF Q=  160
   305   4422   0   0   -0.18881911
   305   4422   0   2   -0.25876963
   305   4322   0   2   -0.00060973769
   305   6421   0   0   -0.095227835
   305   6421   0   2   -0.14258634
   305   6321   0   2   -0.00050172562
   3051111   4133   0   0    1.580546
   3051111   4133   0   2    1.5817016
   3051111   4233   0   2    0.00012331033
   3051111   4137   0   0   -4.4032381
   3051111   4137   0   2   -4.3984895
   3051111   4237   0   2   -0.0009753186
   3051313   4133   0   0    1.580546
   3051313   4133   0   2    1.5816958
   3051313   4233   0   2    0.00012330745
   3051313   4137   0   0   -4.4032381
   3051313   4137   0   2   -4.3984953
   3051313   4237   0   2   -0.00097531875
   3051212   4137   0   0    1.5053501
   3051212   4137   0   2    1.504316
   3051212   4237   0   2    0.00021310628
   3051414   4137   0   0    1.5053501
   3051414   4137   0   2    1.504316
   3051414   4237   0   2    0.00021310677
   3051616   4137   0   0    1.5053501
   3051616   4137   0   2    1.5043163
   3051616   4237   0   2    0.00021324465

BLOCK IMFWCOEF Q=  160
   305   4422   0   0    3.8554382e-07
   305   4422   0   2    1.7790222e-05
   305   4322   0   2   -6.0956478e-06
   305   6421   0   0    3.3024378e-07
   305   6421   0   2   -3.6596613e-06
   305   6321   0   2   -2.962883e-06
   3051111   4133   0   2   -1.5819675e-06
   3051111   4233   0   2    3.8592718e-06
   3051111   4137   0   2    1.2856997e-05
   3051111   4237   0   2   -3.056972e-05
   3051313   4133   0   2   -1.5819265e-06
   3051313   4233   0   2    3.8592609e-06
   3051313   4137   0   2    1.2857045e-05
   3051313   4237   0   2   -3.0569763e-05
   3051212   4137   0   2   -2.7455207e-06
   3051212   4237   0   2    6.6795177e-06
   3051414   4137   0   2   -2.7455212e-06
   3051414   4237   0   2    6.6795177e-06
   3051616   4137   0   2   -2.7418965e-06
   3051616   4237   0   2    6.6795204e-06

DECAY 23  2.4952


DECAY 24  2.085


DECAY 1000011  0.89612275
    0.99334133   2    1000022    11
    0.0044292153   2    1000023    11
    0.0022032738   2   -1000024    12

DECAY 2000011  8.5355374
    0.99660302   2    1000022    11
    0.0030950246   2    1000023    11
    0.00030129855   2    1000025    11

DECAY 1000013  0.89701592
    0.99238589   2    1000022    13
    0.0049069711   2    1000023    13
    0.00220093   2   -1000024    14
    0.00050620926   2    1000025    13

DECAY 2000013  8.5660559
    0.99305312   2    1000022    13
    0.0039097404   2    1000023    13
    0.0016655841   2   -1000024    14
    0.0011305641   2    1000025    13
    0.00023942964   2    1000013    25

DECAY 1000015  6.0036633
    0.74672273   2    1000022    15
    0.12767487   2   -1000024    16
    0.063736753   2    1000023    15
    0.061865645   2    1000025    15

DECAY 2000015  4.9471132
    0.33633934   2    1000022    15
    0.24931002   2    1000023    15
    0.24682708   2    1000025    15
    0.086046751   2    1000015    23
    0.081357158   2    1000015    25
    0.00011965601   2   -1000024    16

DECAY 1000012  0.90600446
    0.99296048   2    1000022    12
    0.0061726552   2    1000024    11
    0.00054817347   2    1000023    12
    0.00031869226   2    1000025    12

DECAY 1000014  0.9068554
    0.9920209   2    1000022    14
    0.0071130937   2    1000024    13
    0.00054762967   2    1000023    14
    0.00031837593   2    1000025    14

DECAY 1000016  4.994009
    0.49509485   2    1000024    15
    0.33344879   2    1000022    16
    0.16985801   2    1000015    24
    0.0010054607   2    1000023    16
    0.00059289106   2    1000025    16

DECAY 2000001  144.86198
    0.98109667   2    1000021    1
    0.018809088   2    1000022    1

DECAY 1000001  195.72498
    0.72975268   2    1000021    1
    0.17712342   2   -1000037    2
    0.088358023   2    1000035    1
    0.0035703569   2    1000022    1
    0.00067637665   2   -1000024    2
    0.00045737059   2    1000023    1

DECAY 2000003  144.89586
    0.98087197   2    1000021    3
    0.018805212   2    1000022    3
    0.00014205928   2    1000023    3
    0.00011454078   2   -1000024    4

DECAY 1000003  195.74449
    0.72968532   2    1000021    3
    0.17710639   2   -1000037    4
    0.088349612   2    1000035    3
    0.003570377   2    1000022    3
    0.00068478217   2   -1000024    4
    0.00049938461   2    1000023    3
    0.00010413848   2    1000025    3

DECAY 1000005  7.6135985
    0.41467986   2   -1000024    6
    0.24276762   2    1000023    5
    0.24127419   2    1000025    5
    0.086889407   2    1000022    5
    0.014388925   2    1000006   -24

DECAY 2000005  126.03479
    0.78016772   2    1000006   -24
    0.13777272   2   -1000024    6
    0.034596888   2    1000025    5
    0.034244833   2    1000023    5
    0.0078780753   2    1000005    25
    0.0025578554   2    1000005    23
    0.0019120963   2    1000022    5
    0.00086981112   2    1000035    5

DECAY 2000002  153.20135
    0.92848762   2    1000021    2
    0.071158226   2    1000022    2
    0.00032227054   2    1000023    2

DECAY 1000002  195.71612
    0.72955684   2    1000021    2
    0.17599274   2    1000037    1
    0.088171843   2    1000035    2
    0.0034009233   2    1000022    2
    0.0019886169   2    1000024    1
    0.00086019578   2    1000023    2

DECAY 2000004  153.20477
    0.92846736   2    1000021    4
    0.071156656   2    1000022    4
    0.00032767166   2    1000023    4

DECAY 1000004  195.73507
    0.72948907   2    1000021    4
    0.17597627   2    1000037    3
    0.088163507   2    1000035    4
    0.0034006086   2    1000022    4
    0.0020730919   2    1000024    3
    0.00086433075   2    1000023    4

DECAY 1000006  0.00026209799
    0.54982651   3    1000022    24    5
    0.45017349   2    1000022    4

DECAY 2000006  130.94608
    0.39033904   2    1000006    25
    0.38817731   2    1000006    23
    0.076807985   2    1000024    5
    0.066749472   2    1000025    6
    0.065576757   2    1000023    6
    0.0061201143   2    1000005    24
    0.0037545257   2    1000022    6
    0.002474793   2    1000037    5

DECAY 1000024  9.3415409
    0.93229967   2    1000006   -5
    0.066700279   2    1000022    24
    0.00099504511   3    1000022   -5    6

DECAY 1000037  23.878145
    0.13706916   2    1000024    25
    0.13295316   2    1000023    24
    0.12909   2    1000025    24
    0.12459898   2    1000024    23
    0.096466712   2    1000014   -13
    0.096465144   2    1000012   -11
    0.096220364   2   -1000013    14
    0.096218776   2   -1000011    12
    0.079159807   2    1000006   -5
    0.002774783   3    1000023   -5    6
    0.002646548   3    1000025   -5    6
    0.0025039051   3    1000024    6   -6
    0.0018071494   2    1000016   -15
    0.001610719   2   -2000015    16
    0.00017292462   3    1000024    5   -5
    0.00012987636   3    1000022   -5    6

DECAY 1000022 -1


DECAY 1000023  6.4925061
    0.45580252   2    1000006   -6
    0.45580252   2   -1000006    6
    0.078609745   2    1000022    25
    0.009257619   2    1000022    23
    0.00047208353   3    1000022    6   -6

DECAY 1000025  7.5406608
    0.42732219   2    1000006   -6
    0.42732219   2   -1000006    6
    0.082456129   2    1000022    23
    0.062466803   2    1000022    25
    0.0004209725   3    1000022    6   -6

DECAY 1000035  26.180748
    0.1172052   2    1000023    25
    0.11413713   2    1000025    23
    0.11098463   2    1000024   -24
    0.11098463   2   -1000024    24
    0.10828988   2    1000025    25
    0.044239858   2    1000014   -14
    0.044239858   2   -1000014    14
    0.044239307   2    1000012   -12
    0.044239307   2   -1000012    12
    0.043583446   2    1000013   -13
    0.043583446   2   -1000013    13
    0.043582553   2    1000011   -11
    0.043582553   2   -1000011    11
    0.035062774   2    1000006   -6
    0.035062774   2   -1000006    6
    0.0076386277   2    1000023    23
    0.0022791635   3    1000024    5   -6
    0.0022791635   3   -1000024   -5    6
    0.00082639006   2    1000016   -16
    0.00082639006   2   -1000016    16
    0.00072575946   2    2000015   -15
    0.00072575946   2   -2000015    15
    0.00069287052   3    1000023    6   -6
    0.00062935211   3    1000025    6   -6
    0.00011297695   3    1000022    6   -6

DECAY 1000021  235.10267
    0.19125815   2    1000006   -6
    0.19125815   2   -1000006    6
    0.1290993   2    1000005   -5
    0.1290993   2   -1000005    5
    0.092697891   2    2000005   -5
    0.092697891   2   -2000005    5
    0.083414964   2    2000006   -6
    0.083414964   2   -2000006    6
    0.001521874   2    1000006   -4
    0.001521874   2   -1000006    4
    0.00085404742   3    1000022    6   -6
    0.00061598669   3    1000023    6   -6
    0.00060459864   3    1000025    6   -6
    0.00055943886   3    1000024    5   -6
    0.00055943886   3   -1000024   -5    6
    0.00031696864   3    1000035    6   -6
    0.00021274874   3    1000037    5   -6
    0.00021274874   3   -1000037   -5    6

DECAY 25  0.0037681023
    0.59497127   2   -5    5
    0.21040673   2   -24    24
    0.068466882   2    21    21
    0.067908616   2   -15    15
    0.029076052   2   -4    4
    0.024941929   2    23    23
    0.0023704689   2    22    22
    0.00139997   2    22    23
    0.00023556113   2   -13    13
    0.00022174967   2   -3    3
    6.1311461e-07   2   -1    1
    1.4983959e-07   2   -2    2
    5.2956905e-09   2   -11    11

DECAY 35  30.42555
    0.66753222   2   -5    5
    0.25814417   2   -15    15
    0.046567648   2   -1000006    1000006
    0.019092752   2    1000022    1000025
    0.0067387698   2    1000022    1000023
    0.00092217162   2   -13    13
    0.00046076202   2   -3    3
    0.00030102678   2    1000022    1000022
    0.00020041579   2   -6    6
    3.6993265e-05   2    21    21
    1.2740724e-06   2   -1    1
    6.9968528e-07   2    25    25
    5.6427286e-07   2    23    23
    3.471017e-07   2   -24    24
    1.0765629e-07   2    22    22
    4.7398239e-08   2    22    23
    2.0714692e-08   2   -11    11
    7.3713015e-09   2   -4    4
    3.7992788e-14   2   -2    2

DECAY 36  28.06582
    0.69907679   2   -5    5
    0.27035601   2   -15    15
    0.021305325   2    1000022    1000023
    0.0070267121   2    1000022    1000025
    0.00096581192   2   -13    13
    0.0004885207   2    1000022    1000022
    0.00048252468   2   -3    3
    0.00026519965   2   -6    6
    3.0891684e-05   2    21    21
    1.3342488e-06   2   -1    1
    8.1291235e-07   2    23    25
    2.1694998e-08   2   -11    11
    1.6418022e-08   2    22    22
    1.1973452e-08   2    22    23
    8.4131852e-09   2   -4    4
    4.335951e-14   2   -2    2
    5.0383259e-37   2    25    25

DECAY 37  26.869098
    0.71678493   2   -5    6
    0.25090187   2   -15    16
    0.029849503   2    1000022    1000024
    0.0010671117   2   -5    4
    0.00088702876   2   -13    14
    0.00047468515   2   -3    4
    2.209825e-05   2   -3    2
    7.6202834e-06   2   -5    2
    2.8043464e-06   2   -3    6
    1.3179689e-06   2   -1    2
    8.5371673e-07   2    24    25
    9.695749e-08   2   -1    6
    6.2075269e-08   2   -1    4
    2.0747695e-08   2   -11    12
    6.0716918e-12   2    24    35
    2.4593517e-12   2    24    36

DECAY 6  2.43
    1   2    5    24

DECAY 15 -1
