BLOCK SPINFO
   1   SPheno
   2   v4.0.5be

BLOCK SPHENOINFO
   1   2
   2   2

BLOCK MODSEL
   1   0

BLOCK MINPAR
   3    28.720572
   4    1

BLOCK EXTPAR
   0    1450.5407
   1    183.4255
   2    1550.8627
   3    3000
   11   -4333.6613
   12   -290.44187
   13   -527.82737
   23    1613.2152
   25    27.864562
   26    4201.2693
   31    411.91597
   32    411.91597
   33    1606.6048
   34    218.6793
   35    218.6793
   36    1198.8293
   41    5000
   42    5000
   43    1730.4707
   44    5000
   45    5000
   46    1326.5312
   47    5000
   48    5000
   49    1849.1156

BLOCK SMINPUTS
   1    127.90897
   2    1.1663787e-05
   3    0.1184
   4    91.1876
   5    4.18
   6    173.2
   7    1.777
   8    0
   11    0.00051099893
   12    0
   13    0.10565837
   14    0
   21    0.005
   22    0.0025
   23    0.095
   24    1.27

BLOCK GAUGE Q=  1450.5407
   1    0.35536298
   2    0.66519887
   3    1.219778

BLOCK YU Q=  1450.5407
   1   1    8.3897697e-06
   2   2    0.004262003
   3   3    1.0135516

BLOCK YD Q=  1450.5407
   1   1    0.000469767
   2   2    0.0089255729
   3   3    0.46586165

BLOCK YE Q=  1450.5407
   1   1    8.1977776e-05
   2   2    0.016950404
   3   3    0.28507791

BLOCK AU Q=  1450.5407
   1   1    0
   2   2    0
   3   3   -4333.6613

BLOCK AD Q=  1450.5407
   1   1    0
   2   2    0
   3   3   -290.44187

BLOCK AE Q=  1450.5407
   1   1    0
   2   2    0
   3   3   -527.82737

BLOCK MSOFT Q=  1450.5407
   1    183.4255
   2    1550.8627
   3    3000
   21    15021702
   22   -2546074.4
   31    411.91597
   32    411.91597
   33    1606.6048
   34    218.6793
   35    218.6793
   36    1198.8293
   41    5000
   42    5000
   43    1730.4707
   44    5000
   45    5000
   46    1326.5312
   47    5000
   48    5000
   49    1849.1156

BLOCK MASS
   6    173.2
   23    91.1876
   24    80.429995
   15    1.777
   25    120.73045
   35    4199.9368
   36    4201.2693
   37    4201.1341
   1000001    5025.359
   2000001    5016.9867
   1000002    5024.9363
   2000002    5020.1309
   1000003    5025.3656
   2000003    5016.9866
   1000004    5024.9388
   2000004    5020.1317
   1000005    1702.9422
   2000005    1885.6629
   1000006    1180.7846
   2000006    1781.9239
   1000011    447.33104
   2000011    189.98936
   1000012    440.14901
   1000013    447.47399
   2000013    189.79371
   1000014    440.16309
   1000015    1199.626
   2000015    1624.1435
   1000016    1620.075
   1000021    3187.4974
   1000022    181.83002
   1000023    1543.7714
   1000025   -1613.6364
   1000035    1662.6428
   1000024    1544.7382
   1000037    1663.6932

BLOCK ALPHA
      -0.034884558

BLOCK HMIX Q=  1450.5407
   1    1613.2152
   2    27.864562
   3    244.03529
   4    17650664

BLOCK STOPMIX
   1   1    0.37542101
   1   2    0.92685439
   2   1   -0.92685439
   2   2    0.37542101

BLOCK SBOTMIX
   1   1    0.98836227
   1   2    0.15211848
   2   1   -0.15211848
   2   2    0.98836227

BLOCK STAUMIX
   1   1    0.068481718
   1   2    0.99765237
   2   1   -0.99765237
   2   2    0.068481718

BLOCK NMIX
   1   1    0.99959102
   1   2   -0.00036811135
   1   3    0.028244522
   1   4   -0.0044625408
   2   1    0.014219353
   2   2    0.80579704
   2   3   -0.42812511
   2   4    0.40889831
   3   1   -0.016798532
   3   2    0.016723672
   3   3    0.70648439
   3   4    0.70733156
   4   1   -0.01825985
   4   2    0.59195549
   4   3    0.56284185
   4   4   -0.57659719

BLOCK UMIX
   1   1   -0.7530911
   1   2    0.65791625
   2   1    0.65791625
   2   2    0.7530911

BLOCK VMIX
   1   1   -0.77468491
   1   2    0.63234745
   2   1    0.63234745
   2   2    0.77468491

BLOCK HIGGSBOUNDSINPUTHIGGSCOUPLINGSFERMIONS
       0, 776.43379,3,36,15,15

BLOCK HIGGSBOUNDSINPUTHIGGSCOUPLINGSBOSONS
       0,4,36,21,21,23

BLOCK SPHENOLOWENERGY
   1    0.00028735648
   2    1.5990527e-06
   3    3.5305638e-05
   4    2.1489523e-15
   5    9.1800529e-11
   6    1.9198158e-08
   7    7.2304618e-14
   8    3.088842e-09
   9    6.5452475e-07
   10    9.6644125e-05
   11    0.99829681
   12    0.54202246
   13    19.365655
   14    0
   15    0
   16    0.0021572862
   17    2.281658e-15
   18    2.483124e-11
   19    8.2979976e-11
   20    3.8609035e-14
   21    1.6560209e-09
   22    3.4826305e-08
   23    0
   24    0
   25    0
   26    0
   27    0
   28    0
   29    0
   30    0
   31    0
   39    9.2274324e-05
   40    0
   41    0
   42    0

BLOCK FWCOEF Q=  160
   305   4422   0   0   -0.18881911
   305   4422   0   2   -0.14881104
   305   4322   0   2    0.00024623614
   305   6421   0   0   -0.095227835
   305   6421   0   2   -0.073137843
   305   6321   0   2    6.1598268e-05
   3051111   4133   0   0    1.5908045
   3051111   4133   0   2    1.5919961
   3051111   4233   0   2    0.00012385278
   3051111   4137   0   0   -4.4134966
   3051111   4137   0   2   -4.4170308
   3051111   4237   0   2   -0.00096657479
   3051313   4133   0   0    1.5908045
   3051313   4133   0   2    1.5919929
   3051313   4233   0   2    0.00012385252
   3051313   4137   0   0   -4.4134966
   3051313   4137   0   2   -4.417034
   3051313   4237   0   2   -0.00096657534
   3051212   4137   0   0    1.5053501
   3051212   4137   0   2    1.5061283
   3051212   4237   0   2    0.00021069389
   3051414   4137   0   0    1.5053501
   3051414   4137   0   2    1.5061283
   3051414   4237   0   2    0.00021069389
   3051616   4137   0   0    1.5053501
   3051616   4137   0   2    1.5061294
   3051616   4237   0   2    0.00021069658

BLOCK IMFWCOEF Q=  160
   305   4422   0   0    3.8591299e-07
   305   4422   0   2    1.6651599e-05
   305   4322   0   2    5.6278404e-06
   305   6421   0   0    3.3056e-07
   305   6421   0   2   -5.9571914e-06
   305   6321   0   2    2.7560948e-06
   3051111   4133   0   2   -1.2690417e-06
   3051111   4233   0   2    2.416285e-06
   3051111   4137   0   2    1.0036436e-05
   3051111   4237   0   2   -1.8858431e-05
   3051313   4133   0   2   -1.2690732e-06
   3051313   4233   0   2    2.4162808e-06
   3051313   4137   0   2    1.0036388e-05
   3051313   4237   0   2   -1.8858442e-05
   3051212   4137   0   2   -2.0671481e-06
   3051212   4237   0   2    4.1107847e-06
   3051414   4137   0   2   -2.0671525e-06
   3051414   4237   0   2    4.1107847e-06
   3051616   4137   0   2   -2.0476228e-06
   3051616   4237   0   2    4.1108077e-06

DECAY 23  2.4952


DECAY 24  2.085


DECAY 2000011  0.0067380688
    1   2    1000022    11

DECAY 1000011  0.39071449
    0.99999921   2    1000022    11

DECAY 2000013  0.0064311531
    1   2    1000022    13

DECAY 1000013  0.4027499
    0.9706758   2    1000022    13
    0.029324109   2    2000013    25

DECAY 1000015  5.7368128
    1   2    1000022    15

DECAY 2000015  3.2802724
    0.61159366   2    1000022    15
    0.18104366   2    1000015    23
    0.17206418   2    1000015    25
    0.021252021   2   -1000024    16
    0.013978512   2    1000023    15

DECAY 1000012  0.38049828
    1   2    1000022    12

DECAY 1000014  0.38052047
    1   2    1000022    14

DECAY 1000016  3.283435
    0.60462138   2    1000022    16
    0.35967939   2    1000015    24
    0.023992976   2    1000024    15
    0.011706173   2    1000023    16

DECAY 2000001  143.62277
    0.98055194   2    1000021    1
    0.019435004   2    1000022    1

DECAY 1000001  196.08374
    0.72265609   2    1000021    1
    0.10491615   2   -1000024    2
    0.077422959   2   -1000037    2
    0.059696446   2    1000023    1
    0.031693492   2    1000035    1
    0.0035795526   2    1000022    1

DECAY 2000003  143.63551
    0.98046494   2    1000021    3
    0.019433324   2    1000022    3

DECAY 1000003  196.09237
    0.72262777   2    1000021    3
    0.10491453   2   -1000024    4
    0.077424336   2   -1000037    4
    0.05969998   2    1000023    3
    0.031702373   2    1000035    3
    0.0035794318   2    1000022    3

DECAY 1000005  62.943309
    0.99129911   2    1000006   -24
    0.0045707253   2    1000022    5
    0.0033768208   2    1000023    5
    0.000594189   2    1000025    5
    0.00015915349   2    1000035    5

DECAY 2000005  5.9997345
    0.54564129   2    1000006   -24
    0.16405287   2    1000022    5
    0.064102974   2    1000005    25
    0.049300918   2    1000025    5
    0.047941412   2   -1000037    6
    0.046298215   2   -1000024    6
    0.035038064   2    1000005    23
    0.028907148   2    1000035    5
    0.014055159   2    1000023    5
    0.0046619452   2    2000006   -24

DECAY 2000002  152.33648
    0.92661222   2    1000021    2
    0.07333943   2    1000022    2

DECAY 1000002  196.07641
    0.72245865   2    1000021    2
    0.11101   2    1000024    1
    0.071515819   2    1000037    1
    0.060446569   2    1000023    2
    0.031001953   2    1000035    2
    0.0035498965   2    1000022    2

DECAY 2000004  152.33942
    0.92659451   2    1000021    4
    0.073338017   2    1000022    4

DECAY 1000004  196.0845
    0.72242989   2    1000021    4
    0.1110198   2    1000024    3
    0.071531211   2    1000037    3
    0.060445273   2    1000023    4
    0.031003248   2    1000035    4
    0.0035497516   2    1000022    4

DECAY 1000006  2.124944
    0.99598092   2    1000022    6
    0.0036170567   2    1000022    4
    0.00016464259   3    1000022    24    5

DECAY 2000006  72.504564
    0.54698342   2    1000006    23
    0.43288959   2    1000006    25
    0.0096947094   2    1000022    6
    0.0047464705   2    1000037    5
    0.004063007   2    1000024    5
    0.0016227976   2    1000023    6

DECAY 1000024  19.009139
    0.26641141   2    1000006   -5
    0.18130122   2    1000014   -13
    0.18121723   2    1000012   -11
    0.17026114   2   -1000011    12
    0.17024121   2   -1000013    14
    0.023419776   2    1000022    24
    0.0062434404   2   -1000015    16
    0.00076315119   3    1000022   -5    6

DECAY 1000037  16.433723
    0.25563256   2    1000006   -5
    0.16599727   2   -1000011    12
    0.16598073   2   -1000013    14
    0.15424698   2    1000014   -13
    0.15410782   2    1000012   -11
    0.041154346   2    1000022    24
    0.036195912   2    1000023    24
    0.016085907   2    1000024    23
    0.0078758123   2   -1000015    16
    0.0014575507   3    1000022   -5    6
    0.00058084971   2    1000016   -15
    0.00045270981   2   -2000015    16
    0.00015985064   2   -2000013    14

DECAY 1000022 -1


DECAY 1000023  20.938642
    0.13148321   2    1000006   -6
    0.13148321   2   -1000006    6
    0.090103549   2    1000013   -13
    0.090103549   2   -1000013    13
    0.09008119   2    1000011   -11
    0.09008119   2   -1000011    11
    0.087254827   2    1000012   -12
    0.087254827   2   -1000012    12
    0.087253839   2    1000014   -14
    0.087253839   2   -1000014    14
    0.0105202   2    1000022    25
    0.0060581739   2    1000022    23
    0.0026932364   2    1000006   -4
    0.0026932364   2   -1000006    4
    0.0025202193   2    1000015   -15
    0.0025202193   2   -1000015    15
    0.00036693217   3    1000022    6   -6

DECAY 1000025  14.97884
    0.44547793   2    1000006   -6
    0.44547793   2   -1000006    6
    0.049158736   2    1000022    23
    0.038151469   2    1000022    25
    0.0086433313   2    1000015   -15
    0.0086433313   2   -1000015    15
    0.001557626   3    1000022    6   -6
    0.00022369628   2    2000013   -13
    0.00022369628   2   -2000013    13
    0.00018658872   3    1000024    1   -2
    0.00018658872   3   -1000024   -1    2
    0.0001864125   3    1000024    3   -4
    0.0001864125   3   -1000024   -3    4
    0.00014306677   2    1000013   -13
    0.00014306677   2   -1000013    13
    0.0001341333   2    1000012   -12
    0.0001341333   2   -1000012    12
    0.00013413192   2    1000014   -14
    0.00013413192   2   -1000014    14

DECAY 1000035  17.507615
    0.20822342   2    1000006   -6
    0.20822342   2   -1000006    6
    0.065434994   2    1000012   -12
    0.065434994   2   -1000012    12
    0.065434362   2    1000014   -14
    0.065434362   2   -1000014    14
    0.061024416   2    1000013   -13
    0.061024416   2   -1000013    13
    0.060957104   2    1000011   -11
    0.060957104   2   -1000011    11
    0.024993974   2    1000022    25
    0.015323891   2    1000022    23
    0.01333307   2    1000024   -24
    0.01333307   2   -1000024    24
    0.0043375105   2    1000015   -15
    0.0043375105   2   -1000015    15
    0.00084996227   3    1000022    6   -6
    0.00020233006   2    2000015   -15
    0.00020233006   2   -2000015    15
    0.00019335388   2    1000016   -16
    0.00019335388   2   -1000016    16
    0.00016122502   2    2000013   -13
    0.00016122502   2   -2000013    13

DECAY 1000021  206.15218
    0.15528671   2    1000006   -6
    0.15528671   2   -1000006    6
    0.1195254   2    2000006   -6
    0.1195254   2   -2000006    6
    0.11671652   2    1000005   -5
    0.11671652   2   -1000005    5
    0.096809578   2    2000005   -5
    0.096809578   2   -2000005    5
    0.0083761803   2    1000006   -4
    0.0083761803   2   -1000006    4
    0.0033868776   3    1000025    6   -6
    0.0011653601   3    1000035    6   -6
    0.00054834145   3    1000024    5   -6
    0.00054834145   3   -1000024   -5    6
    0.00036336225   3    1000037    5   -6
    0.00036336225   3   -1000037   -5    6

DECAY 25  0.0033691757
    0.63535418   2   -5    5
    0.16449331   2   -24    24
    0.073378905   2    21    21
    0.072996435   2   -15    15
    0.031525589   2   -4    4
    0.018271293   2    23    23
    0.0023339622   2    22    22
    0.0011531155   2    22    23
    0.00025271889   2   -13    13
    0.00023965699   2   -3    3
    6.626275e-07   2   -1    1
    1.6247241e-07   2   -2    2
    5.6809582e-09   2   -11    11

DECAY 35  86.745048
    0.36182846   2   -5    5
    0.089491124   2   -15    15
    0.075183889   2   -1000024    1000037
    0.075183889   2   -1000037    1000024
    0.060553829   2   -2000006    1000006
    0.060553829   2   -1000006    2000006
    0.056915949   2   -1000006    1000006
    0.049377068   2    1000023    1000025
    0.037935483   2   -2000006    2000006
    0.025855142   2   -1000024    1000024
    0.022719114   2    1000022    1000025
    0.019899237   2    1000025    1000035
    0.015645336   2   -1000037    1000037
    0.012479319   2    1000023    1000023
    0.011784253   2    1000022    1000035
    0.0086743331   2    1000035    1000035
    0.0067838347   2    1000022    1000023
    0.0050587384   2    1000023    1000035
    0.0020516719   2   -6    6
    0.00036510434   2   -2000015    1000015
    0.00036510434   2   -1000015    2000015
    0.00031283281   2   -13    13
    0.00028076453   2   -2000005    1000005
    0.00028076453   2   -1000005    2000005
    0.00014473356   2   -3    3
    8.1787442e-05   2    1000022    1000022
    6.9209491e-05   2    25    25
    3.9401094e-05   2   -1000005    1000005
    3.7606103e-05   2    1000025    1000025
    2.84833e-05   2   -2000005    2000005
    8.9620202e-06   2   -1000015    1000015
    6.17874e-06   2   -2000015    2000015
    1.934677e-06   2    21    21
    8.0978663e-07   2    23    23
    4.0011159e-07   2   -1    1
    1.617267e-07   2   -24    24
    9.4923806e-08   2   -2000013    2000013
    8.7735091e-08   2   -2000011    2000011
    7.421791e-08   2    22    23
    5.7580708e-08   2   -1000011    1000011
    5.1431717e-08   2   -1000013    1000013
    4.3657107e-08   2   -4    4
    3.7038095e-08   2    22    22
    2.4162357e-08   2   -2000013    1000013
    2.4162357e-08   2   -1000013    2000013
    7.0255881e-09   2   -11    11
    5.6878171e-13   2   -2000011    1000011
    5.6878171e-13   2   -1000011    2000011
    2.2503788e-13   2   -2    2

DECAY 36  84.848979
    0.34948394   2   -5    5
    0.11230698   2   -2000006    1000006
    0.11230698   2   -1000006    2000006
    0.086445714   2   -15    15
    0.062883201   2   -1000024    1000024
    0.048606231   2   -1000037    1000037
    0.04234626   2   -1000024    1000037
    0.04234626   2   -1000037    1000024
    0.030431008   2    1000023    1000023
    0.026711025   2    1000035    1000035
    0.019455511   2    1000023    1000025
    0.018672165   2    1000022    1000025
    0.015160907   2    1000022    1000035
    0.013899293   2    1000023    1000035
    0.0084148859   2    1000022    1000023
    0.0071003844   2    1000025    1000035
    0.0014013255   2   -6    6
    0.00038121267   2   -2000015    1000015
    0.00038121267   2   -1000015    2000015
    0.00032289231   2   -2000005    1000005
    0.00032289231   2   -1000005    2000005
    0.00030218817   2   -13    13
    0.00013979941   2   -3    3
    8.6038881e-05   2    1000022    1000022
    8.1854274e-05   2    1000025    1000025
    7.328964e-06   2    21    21
    1.8453142e-06   2    23    25
    3.8647341e-07   2   -1    1
    1.2357232e-07   2    22    23
    6.838643e-08   2    22    22
    2.9191117e-08   2   -4    4
    2.548259e-08   2   -2000013    1000013
    2.548259e-08   2   -1000013    2000013
    6.7865138e-09   2   -11    11
    5.9604034e-13   2   -2000011    1000011
    5.9604034e-13   2   -1000011    2000011
    1.5047317e-13   2   -2    2
    5.4392801e-14   2    23    35
    1.2232288e-38   2    25    25

DECAY 37  87.105215
    0.45122215   2   -5    6
    0.12648921   2   -1000005    1000006
    0.097793766   2    1000023    1000037
    0.092915189   2    1000024    1000035
    0.079561673   2   -15    16
    0.07077378   2    1000024    1000025
    0.02645554   2    1000022    1000037
    0.024379493   2    1000025    1000037
    0.014884689   2    1000022    1000024
    0.010956038   2   -1000005    2000006
    0.002531496   2   -2000005    1000006
    0.00074129682   2   -1000015    1000016
    0.0006662782   2   -5    4
    0.00028127882   2   -13    14
    0.00015519994   2   -2000005    2000006
    0.00013376092   2   -3    4
    3.421116e-05   2    1000035    1000037
    6.2871601e-06   2   -3    2
    5.3350774e-06   2    1000023    1000024
    4.757913e-06   2   -5    2
    3.3736948e-06   2   -3    6
    2.1219389e-06   2   -2000015    1000016
    1.7979101e-06   2    24    25
    3.7081434e-07   2   -1    2
    3.5222559e-07   2   -2000013    1000014
    3.4281837e-07   2   -2000011    1000012
    1.4558769e-07   2   -1    6
    3.9693763e-08   2   -1000013    1000014
    1.8708317e-08   2   -1    4
    6.5791409e-09   2   -11    12
    9.2940677e-13   2   -1000011    1000012
    3.8461893e-14   2    24    35

DECAY 6  2.43
    1   2    5    24

DECAY 15 -1
