BLOCK SPINFO
   1   SPheno
   2   v4.0.5be

BLOCK SPHENOINFO
   1   2
   2   2

BLOCK MODSEL
   1   0

BLOCK MINPAR
   3    30.733776
   4   -1

BLOCK EXTPAR
   0    3515.2464
   1    2489.1318
   2   -2260.9035
   3    1806.3227
   11   -3166.9497
   12   -163.37783
   13    6136.0787
   23   -502.04045
   25    29.666146
   26    1349.632
   31    977.89831
   32    977.89831
   33    3378.5424
   34    1324.3135
   35    1324.3135
   36    1502.9495
   41    3871.0839
   42    3871.0839
   43    3596.7869
   44    4339.4167
   45    4339.4167
   46    3414.5907
   47    4860.5958
   48    4860.5958
   49    1434.181

BLOCK SMINPUTS
   1    127.90897
   2    1.1663787e-05
   3    0.1184
   4    91.1876
   5    4.18
   6    173.2
   7    1.777
   8    0
   11    0.00051099893
   12    0
   13    0.10565837
   14    0
   21    0.005
   22    0.0025
   23    0.095
   24    1.27

BLOCK GAUGE Q=  3515.2464
   1    0.35536298
   2    0.66519887
   3    1.219778

BLOCK YU Q=  3515.2464
   1   1    8.3891342e-06
   2   2    0.0042616802
   3   3    1.0134748

BLOCK YD Q=  3515.2464
   1   1    0.00050010191
   2   2    0.0095019364
   3   3    0.49594439

BLOCK YE Q=  3515.2464
   1   1    8.7271441e-05
   2   2    0.018044966
   3   3    0.30348664

BLOCK AU Q=  3515.2464
   1   1    0
   2   2    0
   3   3   -3166.9514

BLOCK AD Q=  3515.2464
   1   1    0
   2   2    0
   3   3   -163.37786

BLOCK AE Q=  3515.2464
   1   1    0
   2   2    0
   3   3    6136.078

BLOCK MSOFT Q=  3515.2464
   1    2489.1318
   2   -2260.9035
   3    1806.3227
   21    1576031.2
   22   -29696.502
   31    977.89831
   32    977.89831
   33    3378.5424
   34    1324.3135
   35    1324.3135
   36    1502.9495
   41    3871.0839
   42    3871.0839
   43    3596.7869
   44    4339.4167
   45    4339.4167
   46    3414.5907
   47    4860.5958
   48    4860.5958
   49    1434.181

BLOCK MASS
   6    173.2
   23    91.1876
   24    80.429995
   15    1.777
   25    121.88813
   35    1349.6093
   36    1349.632
   37    1352.5049
   1000001    3944.5641
   2000001    4917.6952
   1000002    3943.7932
   2000002    4396.4177
   1000003    3944.5614
   2000003    4917.691
   1000004    3943.7906
   2000004    4396.417
   1000005    1548.8109
   2000005    3627.7471
   1000006    3388.7384
   2000006    3646.4772
   1000011    1025.8489
   2000011    1347.8909
   1000012    1022.378
   1000013    1025.831
   2000013    1347.8669
   1000014    1022.3629
   1000015    1501.8243
   2000015    3381.2922
   1000016    3379.9168
   1000021    2108.6675
   1000022   -498.28699
   1000023    500.1271
   1000025   -2299.7996
   1000035    2450.0572
   1000024    498.88012
   1000037    2299.9722

BLOCK ALPHA
      -0.032968502

BLOCK HMIX Q=  3515.2464
   1   -502.04045
   2    29.666146
   3    243.0682
   4    1821506.5

BLOCK STOPMIX
   1   1    0.26139573
   1   2    0.96523172
   2   1   -0.96523172
   2   2    0.26139573

BLOCK SBOTMIX
   1   1   -0.0031021046
   1   2    0.99999519
   2   1   -0.99999519
   2   2   -0.0031021046

BLOCK STAUMIX
   1   1   -0.0040875739
   1   2    0.99999165
   2   1   -0.99999165
   2   2   -0.0040875739

BLOCK NMIX
   1   1   -0.010892778
   1   2   -0.031893574
   1   3   -0.70761471
   1   4    0.70579428
   2   1    0.015416215
   2   2    0.019198679
   2   3   -0.70653389
   2   4   -0.70725075
   3   1   -0.00034454712
   3   2    0.99930682
   3   3   -0.009009138
   3   4    0.036119185
   4   1   -0.99982177
   4   2    0.00029912563
   4   3   -0.003181651
   4   4   -0.018606951

BLOCK UMIX
   1   1   -0.012744227
   1   2   -0.99991879
   2   1   -0.99991879
   2   2    0.012744227

BLOCK VMIX
   1   1    0.051100092
   1   2    0.99869354
   2   1    0.99869354
   2   2   -0.051100092

BLOCK HIGGSBOUNDSINPUTHIGGSCOUPLINGSFERMIONS
       0, 880.08021,3,36,15,15

BLOCK HIGGSBOUNDSINPUTHIGGSCOUPLINGSBOSONS
       0,4,36,21,21,23

BLOCK SPHENOLOWENERGY
   1    0.00035160615
   2    1.5872941e-06
   3    3.5245139e-05
   4    2.0780267e-15
   5    8.877091e-11
   6    1.8579495e-08
   7    7.111904e-14
   8    3.0382034e-09
   9    6.4437885e-07
   10    9.3653734e-05
   11    0.96740722
   12    0.54219198
   13    19.355169
   14    0
   15    0
   16    0.0021584059
   17    2.281673e-15
   18    2.4797071e-11
   19    8.2892882e-11
   20    2.0050814e-15
   21    8.5719825e-11
   22    1.7150852e-08
   23    0
   24    0
   25    0
   26    0
   27    0
   28    0
   29    0
   30    0
   31    0
   39    6.7925791e-05
   40    0
   41    0
   42    0

BLOCK FWCOEF Q=  160
   305   4422   0   0   -0.18881911
   305   4422   0   2   -0.22221898
   305   4322   0   2   -0.00064788567
   305   6421   0   0   -0.095227835
   305   6421   0   2   -0.12560127
   305   6321   0   2   -0.00060555529
   3051111   4133   0   0    1.622149
   3051111   4133   0   2    1.6225532
   3051111   4233   0   2    9.8520099e-05
   3051111   4137   0   0   -4.4448411
   3051111   4137   0   2   -4.4424526
   3051111   4237   0   2   -0.00073035864
   3051313   4133   0   0    1.622149
   3051313   4133   0   2    1.622552
   3051313   4233   0   2    9.8518136e-05
   3051313   4137   0   0   -4.4448411
   3051313   4137   0   2   -4.4424538
   3051313   4237   0   2   -0.00073035758
   3051212   4137   0   0    1.5053501
   3051212   4137   0   2    1.5048354
   3051212   4237   0   2    0.00015809615
   3051414   4137   0   0    1.5053501
   3051414   4137   0   2    1.5048354
   3051414   4237   0   2    0.00015809653
   3051616   4137   0   0    1.5053501
   3051616   4137   0   2    1.5048358
   3051616   4237   0   2    0.00015820236

BLOCK IMFWCOEF Q=  160
   305   4422   0   0    3.858091e-07
   305   4422   0   2   -1.8741222e-06
   305   4322   0   2   -3.4364748e-06
   305   6421   0   0    3.3047101e-07
   305   6421   0   2    3.929393e-05
   305   6321   0   2   -9.2416929e-07
   3051111   4133   0   2   -9.011437e-07
   3051111   4233   0   2    3.2204474e-06
   3051111   4137   0   2    7.9203544e-06
   3051111   4237   0   2   -2.3932448e-05
   3051313   4133   0   2   -9.0113242e-07
   3051313   4233   0   2    3.2204436e-06
   3051313   4137   0   2    7.9203653e-06
   3051313   4237   0   2   -2.3932461e-05
   3051212   4137   0   2   -1.6721331e-06
   3051212   4237   0   2    5.1804502e-06
   3051414   4137   0   2   -1.6721333e-06
   3051414   4237   0   2    5.1804502e-06
   3051616   4137   0   2   -1.6661086e-06
   3051616   4237   0   2    5.1804397e-06

DECAY 23  2.4952


DECAY 24  2.085


DECAY 1000011  0.0065790738
    0.56985385   2    1000022    11
    0.30018884   2    1000023    11
    0.1299572   2   -1000024    12

DECAY 2000011  0.0017961695
    0.66640475   2    1000023    11
    0.33350752   2    1000022    11

DECAY 1000013  0.010449167
    0.54474527   2    1000022    13
    0.37343335   2    1000023    13
    0.08182131   2   -1000024    14

DECAY 2000013  0.015032981
    0.4325161   2   -1000024    14
    0.29523345   2    1000023    13
    0.25659689   2    1000022    13
    0.015653565   2    1000013    25

DECAY 1000015  4.357788
    0.49983492   2   -1000024    16
    0.25068117   2    1000022    15
    0.2494839   2    1000023    15

DECAY 2000015  30.905037
    0.27803349   2   -1000037    16
    0.1760749   2    1000015    35
    0.17605343   2    1000015    36
    0.13883365   2    1000025    15
    0.096682499   2    1000022    15
    0.096108403   2    1000023    15
    0.030962786   2    1000035    15
    0.0036628335   2    1000015    23
    0.0034789194   2    1000015    25
    0.00010908832   2   -1000024    16

DECAY 1000012  0.015733653
    0.86706371   2    1000024    11
    0.11304443   2    1000022    12
    0.019891857   2    1000023    12

DECAY 1000014  0.019574901
    0.8931538   2    1000024    13
    0.090858325   2    1000022    14
    0.015987878   2    1000023    14

DECAY 1000016  30.884558
    0.35126309   2    1000015    37
    0.27703939   2    1000037    15
    0.19425432   2    1000024    15
    0.13877029   2    1000025    16
    0.030980228   2    1000035    16
    0.0073238827   2    1000015    24
    0.00031340861   2    1000022    16

DECAY 1000001  181.74378
    0.8739264   2    1000021    1
    0.08321904   2   -1000037    2
    0.041570133   2    1000025    1
    0.0011462363   2    1000035    1

DECAY 2000001  260.10469
    0.99403255   2    1000021    1
    0.0059635807   2    1000035    1

DECAY 1000003  181.75166
    0.87388693   2    1000021    3
    0.083215251   2   -1000037    4
    0.041568242   2    1000025    3
    0.0011461839   2    1000035    3
    0.00010189865   2    1000022    3

DECAY 2000003  260.12155
    0.99396655   2    1000021    3
    0.0059631827   2    1000035    3

DECAY 1000005  11.978611
    0.49193715   2   -1000024    6
    0.2546661   2    1000022    5
    0.25339675   2    1000023    5

DECAY 2000005  234.92182
    0.53440564   2    1000021    5
    0.30145626   2   -1000024    6
    0.049045772   2   -1000037    6
    0.036473274   2    1000022    5
    0.036320468   2    1000023    5
    0.024286671   2    1000025    5
    0.016321024   2    1000006   -24
    0.00063984647   2    1000035    5
    0.00057675017   2    1000005    25
    0.00036257798   2    1000005    23

DECAY 1000002  181.6991
    0.87369706   2    1000021    2
    0.082985971   2    1000037    1
    0.041545287   2    1000025    2
    0.0011380573   2    1000035    2
    0.00048319286   2    1000024    1
    0.00010589498   2    1000022    2

DECAY 2000002  210.39327
    0.97781107   2    1000021    2
    0.022172726   2    1000035    2

DECAY 1000004  181.70691
    0.87365756   2    1000021    4
    0.08298224   2    1000037    3
    0.041543379   2    1000025    4
    0.0011380044   2    1000035    4
    0.00052080433   2    1000024    3
    0.00010967678   2    1000022    4

DECAY 2000004  210.39621
    0.9777967   2    1000021    4
    0.022172403   2    1000035    4

DECAY 1000006  233.8964
    0.44575433   2    1000021    6
    0.26320295   2    1000024    5
    0.13930411   2    1000023    6
    0.13808603   2    1000022    6
    0.00686096   2    1000035    6
    0.0041940329   2    1000037    5
    0.0020361238   2    1000025    6
    0.00047577569   3    1000022    24    5

DECAY 2000006  236.01445
    0.51240588   2    1000021    6
    0.15320674   2    1000022    6
    0.15297014   2    1000023    6
    0.093959428   2    1000024    5
    0.043919582   2    1000037    5
    0.021504627   2    1000025    6
    0.010577606   2    1000006    25
    0.0092296045   2    1000006    23
    0.0013713472   2    1000035    6
    0.00068818868   2    1000005    24
    0.00016686258   2    1000005    37

DECAY 1000024  2.1290326e-13
    0.69799506   2    1000022    211
    0.1625658   3    1000022   -11    12
    0.13943914   3    1000022   -13    14

DECAY 1000037  54.44272
    0.11941066   2    1000014   -13
    0.11940891   2    1000012   -11
    0.11930352   2   -1000013    14
    0.11930145   2   -1000011    12
    0.094422332   2    1000024    25
    0.091209174   2    1000023    24
    0.091069961   2    1000022    24
    0.090920151   2    1000024    23
    0.037506836   2    37    1000022
    0.034545561   2    1000024    36
    0.034527596   2    1000024    35
    0.034309767   2    37    1000023
    0.0059878692   3    1000024    6   -6
    0.0041494575   3    1000023   -5    6
    0.003901717   3    1000022   -5    6

DECAY 1000022 -1


DECAY 1000023  1.3716459e-09
    0.96000509   2    1000022    22
    0.010804757   3    1000022    12   -12
    0.0080788833   3    1000022    1   -1
    0.0078331531   3    1000022    3   -3
    0.0063011895   3    1000022    2   -2
    0.0018232967   3    1000022    11   -11
    0.0017368053   3    1000022    13   -13
    0.0010321854   3    1000024    1   -2
    0.0010321854   3   -1000024   -1    2
    0.00034409681   3    1000024    11   -12
    0.00034409681   3   -1000024   -11    12
    0.00033213171   3    1000024    13   -14
    0.00033213171   3   -1000024   -13    14

DECAY 1000025  56.710739
    0.087683254   2    1000024   -24
    0.087683254   2   -1000024    24
    0.066281154   2    1000022    25
    0.064397113   2    1000023    23
    0.058460531   2    1000023    25
    0.057400553   2    1000014   -14
    0.057400553   2   -1000014    14
    0.057399717   2    1000012   -12
    0.057399717   2   -1000012    12
    0.057166436   2    1000013   -13
    0.057166436   2   -1000013    13
    0.057165432   2    1000011   -11
    0.057165432   2   -1000011    11
    0.035854586   2    37   -1000024
    0.035854586   2   -37    1000024
    0.029815368   2    1000023    35
    0.026184131   2    1000022    35
    0.023138734   2    1000022    23
    0.0070875734   2    1000022    36
    0.0061436309   2    1000023    36
    0.0040004225   3    1000024    5   -6
    0.0040004225   3   -1000024   -5    6
    0.0026083189   3    1000022    6   -6
    0.002509059   3    1000023    6   -6

DECAY 1000035  36.525136
    0.081922822   2    2000013   -13
    0.081922822   2   -2000013    13
    0.081920287   2    2000011   -11
    0.081920287   2   -2000011    11
    0.065650391   2    1000015   -15
    0.065650391   2   -1000015    15
    0.042953219   2    1000024   -24
    0.042953219   2   -1000024    24
    0.031019901   2    1000022    25
    0.028758117   2    1000014   -14
    0.028758117   2   -1000014    14
    0.028757758   2    1000012   -12
    0.028757758   2   -1000012    12
    0.028613641   2    1000022    23
    0.028611599   2    1000013   -13
    0.028611599   2   -1000013    13
    0.028611174   2    1000011   -11
    0.028611174   2   -1000011    11
    0.027282614   2    1000023    25
    0.020242883   2    1000005   -5
    0.020242883   2   -1000005    5
    0.019729568   2    37   -1000024
    0.019729568   2   -37    1000024
    0.015824431   2    1000023    35
    0.014381828   2    1000023    23
    0.013893764   2    1000022    35
    0.0045920889   2    1000022    36
    0.0039842384   2    1000023    36
    0.0017640655   3    1000024    5   -6
    0.0017640655   3   -1000024   -5    6
    0.001308245   3    1000022    6   -6
    0.0012505209   3    1000023    6   -6

DECAY 1000021  13.262025
    0.49906733   2    1000005   -5
    0.49906733   2   -1000005    5
    0.00047085601   3    1000024    5   -6
    0.00047085601   3   -1000024   -5    6
    0.00041479627   3    1000022    6   -6
    0.00041382301   3    1000023    6   -6

DECAY 25  0.00357121
    0.62412945   2   -5    5
    0.17704776   2   -24    24
    0.073186338   2    21    21
    0.071403476   2   -15    15
    0.030110801   2   -4    4
    0.020129204   2    23    23
    0.0022929764   2    22    22
    0.0012169744   2    22    23
    0.00024791333   2   -13    13
    0.00023428861   2   -3    3
    6.4778465e-07   2   -1    1
    1.5517793e-07   2   -2    2
    5.5734096e-09   2   -11    11

DECAY 35  20.342873
    0.86172944   2   -5    5
    0.13395771   2   -15    15
    0.0028648771   2   -6    6
    0.00049798189   2   -13    13
    0.00045250745   2   -1000024    1000024
    0.0003184121   2   -3    3
    5.8599836e-05   2    1000022    1000022
    4.2537307e-05   2    25    25
    2.7933016e-05   2    21    21
    2.6049277e-05   2    1000022    1000023
    1.2259775e-05   2    1000023    1000023
    5.547144e-06   2    23    23
    5.1263993e-06   2   -24    24
    8.8035228e-07   2   -1    1
    4.750826e-08   2    22    22
    4.3493366e-08   2    22    23
    4.0619642e-08   2   -4    4
    1.1187141e-08   2   -11    11
    2.0943455e-13   2   -2    2

DECAY 36  19.721934
    0.86100729   2   -5    5
    0.13384469   2   -15    15
    0.0030008224   2   -6    6
    0.0010759849   2   -1000024    1000024
    0.00049756032   2   -13    13
    0.00031814033   2   -3    3
    0.00015306648   2    1000022    1000022
    6.0105402e-05   2    21    21
    2.4921545e-05   2    1000023    1000023
    8.6277735e-06   2    1000022    1000023
    7.7054502e-06   2    23    25
    8.7960089e-07   2   -1    1
    1.0454987e-07   2    22    22
    4.8930237e-08   2    22    23
    3.9551749e-08   2   -4    4
    1.1177669e-08   2   -11    11
    2.039426e-13   2   -2    2
    2.6798812e-36   2    25    25

DECAY 37  18.641682
    0.86048551   2   -5    6
    0.13705018   2   -15    16
    0.001292928   2   -5    4
    0.00048452265   2   -13    14
    0.0003078942   2   -3    4
    0.00024874033   2    1000023    1000024
    9.2326011e-05   2    1000022    1000024
    1.4279226e-05   2   -3    2
    9.2328532e-06   2   -5    2
    8.231206e-06   2    24    25
    5.032815e-06   2   -3    6
    8.5427942e-07   2   -1    2
    2.1066643e-07   2   -1    6
    4.1485211e-08   2   -1    4
    1.1333035e-08   2   -11    12
    1.4835685e-11   2    24    35
    1.4264248e-11   2    24    36

DECAY 6  2.43
    1   2    5    24

DECAY 15 -1
