# SUSY Les Houches Accord 2 - MSSM spectrum + Decays
# SPheno v4.0.5be
# W. Porod, Comput. Phys. Commun. 153 (2003) 275-315, hep-ph/0301101;
# W. Porod, F.~Staub, Comput. Phys. Commun. 183 (2012) 2458
#                     arXiv:1104.1573 [hep-ph] 
# in case of problems send email to porod@physik.uni-wuerzburg.de
# Created: 07.09.2021,  15:45
Block SPINFO         # Program information
     1   SPheno      # spectrum calculator
     2   v4.0.5be    # version number
#
Block SPhenoINFO     # SPheno specific information
    1      2         # using 2-loop RGEs
    2      2         # using pole masses for boundary conditions at mZ
Block MODSEL  # Model selection
    1    0    # general MSSM
Block MINPAR  # Input parameters
    3    3.62376508E+01  # tanb at m_Z    
    4    1.00000000E+00  # Sign(mu)
Block EXTPAR  # non-universal input parameters
    0    3.82808916E+03  # scale for input parameters
    1    1.61594462E+02  # M_1
    2    6.83978624E+02  # M_2
    3    1.63779128E+03  # M_3
   11    7.88203196E+03  # A_t
   12    7.26082435E+02  # A_b
   13    8.31705198E+01  # A_tau
   23    1.86305331E+02  # mu
   25    3.50449255E+01  # tan(beta)
   26    1.46135473E+02  # m_A, pole mass
   31    1.00000000E+04  # M_L11
   32    1.00000000E+04  # M_L22
   33    1.00000000E+04  # M_L33
   34    1.00000000E+04  # M_E11
   35    1.00000000E+04  # M_E22
   36    1.00000000E+04  # M_E33
   41    1.00000000E+04  # M_Q11
   42    1.00000000E+04  # M_Q22
   43    3.29381292E+03  # M_Q33
   44    1.00000000E+04  # M_U11
   45    1.00000000E+04  # M_U22
   46    4.62845572E+03  # M_U33
   47    1.00000000E+04  # M_D11
   48    1.00000000E+04  # M_D22
   49    3.95230787E+03  # M_D33
Block SMINPUTS  # SM parameters
         1     1.27908970E+02  # alpha_em^-1(MZ)^MSbar
         2     1.16637870E-05  # G_mu [GeV^-2]
         3     1.18400000E-01  # alpha_s(MZ)^MSbar
         4     9.11876000E+01  # m_Z(pole)
         5     4.18000000E+00  # m_b(m_b), MSbar
         6     1.73200000E+02  # m_t(pole)
         7     1.77700000E+00  # m_tau(pole)
         8     0.00000000E+00  # m_nu_3
        11     5.10998930E-04  # m_e(pole)
        12     0.00000000E+00  # m_nu_1
        13     1.05658372E-01  # m_muon(pole)
        14     0.00000000E+00  # m_nu_2
        21     5.00000000E-03  # m_d(2 GeV), MSbar
        22     2.50000000E-03  # m_u(2 GeV), MSbar
        23     9.50000000E-02  # m_s(2 GeV), MSbar
        24     1.27000000E+00  # m_c(m_c), MSbar
Block gauge Q=  3.82808916E+03  # (SUSY scale)
   1    3.55362975E-01  # g'(Q)^DRbar
   2    6.65198874E-01  # g(Q)^DRbar
   3    1.21977796E+00  # g3(Q)^DRbar
Block Yu Q=  3.82808916E+03  # (SUSY scale)
  1  1     8.38778486E-06   # Y_u(Q)^DRbar
  2  2     4.26099471E-03   # Y_c(Q)^DRbar
  3  3     1.01331178E+00   # Y_t(Q)^DRbar
Block Yd Q=  3.82808916E+03  # (SUSY scale)
  1  1     5.90680551E-04   # Y_d(Q)^DRbar
  2  2     1.12229305E-02   # Y_s(Q)^DRbar
  3  3     5.85770014E-01   # Y_b(Q)^DRbar
Block Ye Q=  3.82808916E+03  # (SUSY scale)
  1  1     1.03078076E-04   # Y_e(Q)^DRbar
  2  2     2.13132768E-02   # Y_mu(Q)^DRbar
  3  3     3.58454254E-01   # Y_tau(Q)^DRbar
Block Au Q=  3.82808916E+03  # (SUSY scale)
  1  1     0.00000000E+00   # A_u(Q)^DRbar
  2  2     0.00000000E+00   # A_c(Q)^DRbar
  3  3     7.88202925E+03   # A_t(Q)^DRbar
Block Ad Q=  3.82808916E+03  # (SUSY scale)
  1  1     0.00000000E+00   # A_d(Q)^DRbar
  2  2     0.00000000E+00   # A_s(Q)^DRbar
  3  3     7.26084762E+02   # A_b(Q)^DRbar
Block Ae Q=  3.82808916E+03  # (SUSY scale)
  1  1     0.00000000E+00   # A_e(Q)^DRbar
  2  2     0.00000000E+00   # A_mu(Q)^DRbar
  3  3     8.31706898E+01   # A_tau(Q)^DRbar
Block MSOFT Q=  3.82808916E+03  # soft SUSY breaking masses at Q
   1    1.61594462E+02  # M_1
   2    6.83978624E+02  # M_2
   3    1.63779128E+03  # M_3
  21   -6.02392090E+04  # M^2_(H,d)
  22    2.05980671E+05  # M^2_(H,u)
  31    1.00000000E+04  # M_(L,11)
  32    1.00000000E+04  # M_(L,22)
  33    1.00000000E+04  # M_(L,33)
  34    1.00000000E+04  # M_(E,11)
  35    1.00000000E+04  # M_(E,22)
  36    1.00000000E+04  # M_(E,33)
  41    1.00000000E+04  # M_(Q,11)
  42    1.00000000E+04  # M_(Q,22)
  43    3.29381292E+03  # M_(Q,33)
  44    1.00000000E+04  # M_(U,11)
  45    1.00000000E+04  # M_(U,22)
  46    4.62845572E+03  # M_(U,33)
  47    1.00000000E+04  # M_(D,11)
  48    1.00000000E+04  # M_(D,22)
  49    3.95230787E+03  # M_(D,33)
Block MASS  # Mass spectrum
#   PDG code      mass          particle
         6     1.73200000E+02  # m_t(pole)
        23     9.11876000E+01  # m_Z(pole)
        24     8.04299946E+01  # W+
        15     1.77700000E+00  # m_tau(pole)
        25     1.29920689E+02  # h0
        35     1.46713325E+02  # H0
        36     1.46135473E+02  # A0
        37     1.88464782E+02  # H+
   1000001     1.01201853E+04  # ~d_L
   2000001     1.00949668E+04  # ~d_R
   1000002     1.01198287E+04  # ~u_L
   2000002     1.00985309E+04  # ~u_R
   1000003     1.01201877E+04  # ~s_L
   2000003     1.00949709E+04  # ~s_R
   1000004     1.01198311E+04  # ~c_L
   2000004     1.00985315E+04  # ~c_R
   1000005     3.27711344E+03  # ~b_1
   2000005     3.99012840E+03  # ~b_2
   1000006     3.26145954E+03  # ~t_1
   2000006     4.49316216E+03  # ~t_2
   1000011     1.00214983E+04  # ~e_L-
   2000011     1.00086331E+04  # ~e_R-
   1000012     1.00207338E+04  # ~nu_eL
   1000013     1.00215093E+04  # ~mu_L-
   2000013     1.00086545E+04  # ~mu_R-
   1000014     1.00207448E+04  # ~nu_muL
   1000015     1.00146971E+04  # ~tau_1-
   2000015     1.00246588E+04  # ~tau_2-
   1000016     1.00238625E+04  # ~nu_tauL
   1000021     2.02236640E+03  # ~g
   1000022     1.45526730E+02  # ~chi_10
   1000023     2.08032281E+02  # ~chi_20
   1000025     2.15694570E+02  # ~chi_30
   1000035     7.47112638E+02  # ~chi_40
   1000024     1.99554616E+02  # ~chi_1+
   1000037     7.47215248E+02  # ~chi_2+
# Higgs mixing
Block alpha # Effective Higgs mixing angle
          -1.70458489E-01   # alpha
Block Hmix Q=  3.82808916E+03  # Higgs mixing parameters
   1    1.86305331E+02  # mu
   2    3.50449255E+01  # tan[beta](Q)
   3    2.42935509E+02  # v(Q)
   4    2.13555765E+04  # m^2_A(Q)
Block stopmix # stop mixing matrix
   1  1    -9.94011920E-01   # Re[R_st(1,1)]
   1  2     1.09271694E-01   # Re[R_st(1,2)]
   2  1    -1.09271694E-01   # Re[R_st(2,1)]
   2  2    -9.94011920E-01   # Re[R_st(2,2)]
Block sbotmix # sbottom mixing matrix
   1  1     9.99997718E-01   # Re[R_sb(1,1)]
   1  2     2.13619923E-03   # Re[R_sb(1,2)]
   2  1    -2.13619923E-03   # Re[R_sb(2,1)]
   2  2     9.99997718E-01   # Re[R_sb(2,2)]
Block staumix # stau mixing matrix
   1  1     5.69387148E-02   # Re[R_sta(1,1)]
   1  2     9.98377675E-01   # Re[R_sta(1,2)]
   2  1    -9.98377675E-01   # Re[R_sta(2,1)]
   2  2     5.69387148E-02   # Re[R_sta(2,2)]
Block Nmix # neutralino mixing matrix
   1  1     8.47719422E-01   # Re[N(1,1)]
   1  2    -4.37602603E-02   # Re[N(1,2)]
   1  3     4.26362018E-01   # Re[N(1,3)]
   1  4    -3.12525600E-01   # Re[N(1,4)]
   2  1     8.25017334E-02   # Re[N(2,1)]
   2  2    -5.94719350E-02   # Re[N(2,2)]
   2  3    -6.93178383E-01   # Re[N(2,3)]
   2  4    -7.13554681E-01   # Re[N(2,4)]
   3  1    -5.23911259E-01   # Re[N(3,1)]
   3  2    -9.73515095E-02   # Re[N(3,2)]
   3  3     5.80130905E-01   # Re[N(3,3)]
   3  4    -6.16025819E-01   # Re[N(3,4)]
   4  1     9.06853916E-03   # Re[N(4,1)]
   4  2    -9.92507336E-01   # Re[N(4,2)]
   4  3    -3.41656643E-02   # Re[N(4,3)]
   4  4     1.16960065E-01   # Re[N(4,4)]
Block Umix # chargino mixing matrix
   1  1    -4.83169814E-02   # Re[U(1,1)]
   1  2     9.98832053E-01   # Re[U(1,2)]
   2  1     9.98832053E-01   # Re[U(2,1)]
   2  2     4.83169814E-02   # Re[U(2,2)]
Block Vmix # chargino mixing matrix
   1  1    -1.65519223E-01   # Re[V(1,1)]
   1  2     9.86206564E-01   # Re[V(1,2)]
   2  1     9.86206564E-01   # Re[V(2,1)]
   2  2     1.65519223E-01   # Re[V(2,2)]
DECAY        23     2.49520000E+00   # Z
DECAY        24     2.08500000E+00   # W
DECAY   2000011     5.02612897E+01   # ~e^-_R
#    BR                NDA      ID1      ID2
     7.18730798E-01    2     1000022        11   # BR(~e^-_R -> chi^0_1 e^-)
     6.80452378E-03    2     1000023        11   # BR(~e^-_R -> chi^0_2 e^-)
     2.74383266E-01    2     1000025        11   # BR(~e^-_R -> chi^0_3 e^-)
DECAY   1000011     1.43456273E+02   # ~e^-_L
#    BR                NDA      ID1      ID2
     5.14412009E-02    2     1000022        11   # BR(~e^-_L -> chi^0_1 e^-)
     4.37159058E-02    2     1000025        11   # BR(~e^-_L -> chi^0_3 e^-)
     2.96614690E-01    2     1000035        11   # BR(~e^-_L -> chi^0_4 e^-)
     1.43450273E-03    2    -1000024        12   # BR(~e^-_L -> chi^-_1 nu_e)
     6.06720855E-01    2    -1000037        12   # BR(~e^-_L -> chi^-_2 nu_e)
#    BR                NDA      ID1      ID2       ID3
DECAY   2000013     5.04421443E+01   # ~mu^-_R
#    BR                NDA      ID1      ID2
     7.16481211E-01    2     1000022        13   # BR(~mu^-_R -> chi^0_1 mu^-)
     7.64097335E-03    2     1000023        13   # BR(~mu^-_R -> chi^0_2 mu^-)
     2.74003001E-01    2     1000025        13   # BR(~mu^-_R -> chi^0_3 mu^-)
     1.78752586E-03    2    -1000024        14   # BR(~mu^-_R -> chi^-_1 nu_mu)
DECAY   1000013     1.43546924E+02   # ~mu^-_L
#    BR                NDA      ID1      ID2
     5.15234128E-02    2     1000022        13   # BR(~mu^-_L -> chi^0_1 mu^-)
     3.75682857E-04    2     1000023        13   # BR(~mu^-_L -> chi^0_2 mu^-)
     4.39004778E-02    2     1000025        13   # BR(~mu^-_L -> chi^0_3 mu^-)
     2.96428439E-01    2     1000035        13   # BR(~mu^-_L -> chi^0_4 mu^-)
     1.43359842E-03    2    -1000024        14   # BR(~mu^-_L -> chi^-_1 nu_mu)
     6.06338389E-01    2    -1000037        14   # BR(~mu^-_L -> chi^-_2 nu_mu)
#    BR                NDA      ID1      ID2       ID3
DECAY   1000015     1.01672645E+02   # ~tau^-_1
#    BR                NDA      ID1      ID2
     4.08299145E-01    2     1000022        15   # BR(~tau^-_1 -> chi^0_1 tau^-)
     1.21539362E-01    2     1000023        15   # BR(~tau^-_1 -> chi^0_2 tau^-)
     2.16169946E-01    2     1000025        15   # BR(~tau^-_1 -> chi^0_3 tau^-)
     4.20863959E-04    2     1000035        15   # BR(~tau^-_1 -> chi^0_4 tau^-)
     2.52753130E-01    2    -1000024        16   # BR(~tau^-_1 -> chi^-_1 nu_tau)
     8.17553054E-04    2    -1000037        16   # BR(~tau^-_1 -> chi^-_2 nu_tau)
DECAY   2000015     1.68883346E+02   # ~tau^-_2
#    BR                NDA      ID1      ID2
     6.70431114E-02    2     1000022        15   # BR(~tau^-_2 -> chi^0_1 tau^-)
     7.45361535E-02    2     1000023        15   # BR(~tau^-_2 -> chi^0_2 tau^-)
     9.07034923E-02    2     1000025        15   # BR(~tau^-_2 -> chi^0_3 tau^-)
     2.52158902E-01    2     1000035        15   # BR(~tau^-_2 -> chi^0_4 tau^-)
     1.61585231E-04    2    -1000024        16   # BR(~tau^-_2 -> chi^-_1 nu_tau)
     5.15396755E-01    2    -1000037        16   # BR(~tau^-_2 -> chi^-_2 nu_tau)
#    BR                NDA      ID1      ID2       ID3
DECAY   1000012     1.43461046E+02   # ~nu_e
#    BR                NDA      ID1      ID2
     7.57967312E-02    2     1000022        12   # BR(~nu_e -> chi^0_1 nu_e)
     3.29352874E-03    2     1000023        12   # BR(~nu_e -> chi^0_2 nu_e)
     1.02340501E-02    2     1000025        12   # BR(~nu_e -> chi^0_3 nu_e)
     3.02429304E-01    2     1000035        12   # BR(~nu_e -> chi^0_4 nu_e)
     1.68326083E-02    2     1000024        11   # BR(~nu_e -> chi^+_1 e^-)
     5.91413778E-01    2     1000037        11   # BR(~nu_e -> chi^+_2 e^-)
#    BR                NDA      ID1      ID2       ID3
DECAY   1000014     1.43551689E+02   # ~nu_mu
#    BR                NDA      ID1      ID2
     7.57489539E-02    2     1000022        14   # BR(~nu_mu -> chi^0_1 nu_mu)
     3.29145272E-03    2     1000023        14   # BR(~nu_mu -> chi^0_2 nu_mu)
     1.02275993E-02    2     1000025        14   # BR(~nu_mu -> chi^0_3 nu_mu)
     3.02238679E-01    2     1000035        14   # BR(~nu_mu -> chi^0_4 nu_mu)
     1.74508533E-02    2     1000024        13   # BR(~nu_mu -> chi^+_1 mu^-)
     5.91042462E-01    2     1000037        13   # BR(~nu_mu -> chi^+_2 mu^-)
#    BR                NDA      ID1      ID2       ID3
DECAY   1000016     1.69108977E+02   # ~nu_tau
#    BR                NDA      ID1      ID2
     6.43211050E-02    2     1000022        16   # BR(~nu_tau -> chi^0_1 nu_tau)
     2.79488921E-03    2     1000023        16   # BR(~nu_tau -> chi^0_2 nu_tau)
     8.68461754E-03    2     1000025        16   # BR(~nu_tau -> chi^0_3 nu_tau)
     2.56643226E-01    2     1000035        16   # BR(~nu_tau -> chi^0_4 nu_tau)
     1.65328592E-01    2     1000024        15   # BR(~nu_tau -> chi^+_1 tau^-)
     5.02227571E-01    2     1000037        15   # BR(~nu_tau -> chi^+_2 tau^-)
#    BR                NDA      ID1      ID2       ID3
DECAY   2000001     7.39786277E+02   # ~d_R
#    BR                NDA      ID1      ID2
     5.47249934E-03    2     1000022         1   # BR(~d_R -> chi^0_1 d)
     2.08922911E-03    2     1000025         1   # BR(~d_R -> chi^0_3 d)
     9.92385701E-01    2     1000021         1   # BR(~d_R -> ~g d)
DECAY   1000001     8.69893012E+02   # ~d_L
#    BR                NDA      ID1      ID2
     1.94068789E-03    2     1000022         1   # BR(~d_L -> chi^0_1 d)
     2.81447074E-04    2     1000023         1   # BR(~d_L -> chi^0_2 d)
     5.00562819E-02    2     1000035         1   # BR(~d_L -> chi^0_4 d)
     2.38900801E-04    2    -1000024         2   # BR(~d_L -> chi^-_1 u)
     1.01063112E-01    2    -1000037         2   # BR(~d_L -> chi^-_2 u)
     8.46418701E-01    2     1000021         1   # BR(~d_L -> ~g d)
DECAY   2000003     7.39837037E+02   # ~s_R
#    BR                NDA      ID1      ID2
     5.47832145E-03    2     1000022         3   # BR(~s_R -> chi^0_1 s)
     2.10055161E-03    2     1000025         3   # BR(~s_R -> chi^0_3 s)
     9.92318083E-01    2     1000021         3   # BR(~s_R -> ~g s)
DECAY   1000003     8.69922168E+02   # ~s_L
#    BR                NDA      ID1      ID2
     1.94590548E-03    2     1000022         3   # BR(~s_L -> chi^0_1 s)
     2.95394084E-04    2     1000023         3   # BR(~s_L -> chi^0_2 s)
     5.00546502E-02    2     1000035         3   # BR(~s_L -> chi^0_4 s)
     2.42976224E-04    2    -1000024         4   # BR(~s_L -> chi^-_1 c)
     1.01059864E-01    2    -1000037         4   # BR(~s_L -> chi^-_2 c)
     8.46390566E-01    2     1000021         3   # BR(~s_L -> ~g s)
DECAY   1000005     2.26780551E+02   # ~b_1
#    BR                NDA      ID1      ID2
     2.03330935E-02    2     1000022         5   # BR(~b_1 -> chi^0_1 b)
     4.73408610E-02    2     1000023         5   # BR(~b_1 -> chi^0_2 b)
     3.28770792E-02    2     1000025         5   # BR(~b_1 -> chi^0_3 b)
     5.65905204E-02    2     1000035         5   # BR(~b_1 -> chi^0_4 b)
     2.83565838E-01    2    -1000024         6   # BR(~b_1 -> chi^-_1 t)
     1.22012220E-01    2    -1000037         6   # BR(~b_1 -> chi^-_2 t)
     4.37280388E-01    2     1000021         5   # BR(~b_1 -> ~g b)
DECAY   2000005     2.30817216E+02   # ~b_2
#    BR                NDA      ID1      ID2
     2.82242700E-02    2     1000022         5   # BR(~b_2 -> chi^0_1 b)
     5.64880408E-02    2     1000023         5   # BR(~b_2 -> chi^0_2 b)
     4.21618284E-02    2     1000025         5   # BR(~b_2 -> chi^0_3 b)
     1.42169668E-04    2     1000035         5   # BR(~b_2 -> chi^0_4 b)
     1.16675444E-01    2    -1000024         6   # BR(~b_2 -> chi^-_1 t)
     2.81885493E-04    2    -1000037         6   # BR(~b_2 -> chi^-_2 t)
     7.53497150E-01    2     1000021         5   # BR(~b_2 -> ~g b)
     1.19050162E-03    2     1000006       -37   # BR(~b_2 -> ~t_1 H^-)
     6.30877356E-04    2     1000005        36   # BR(~b_2 -> ~b_1 A^0)
     6.58818114E-04    2     1000005        35   # BR(~b_2 -> ~b_1 H^0)
DECAY   2000002     7.56995083E+02   # ~u_R
#    BR                NDA      ID1      ID2
     2.13998627E-02    2     1000022         2   # BR(~u_R -> chi^0_1 u)
     2.02602408E-04    2     1000023         2   # BR(~u_R -> chi^0_2 u)
     8.16970235E-03    2     1000025         2   # BR(~u_R -> chi^0_3 u)
     9.70225409E-01    2     1000021         2   # BR(~u_R -> ~g u)
DECAY   1000002     8.69882736E+02   # ~u_L
#    BR                NDA      ID1      ID2
     5.88158423E-04    2     1000022         2   # BR(~u_L -> chi^0_1 u)
     1.02595314E-04    2     1000023         2   # BR(~u_L -> chi^0_2 u)
     1.85941981E-03    2     1000025         2   # BR(~u_L -> chi^0_3 u)
     4.97303581E-02    2     1000035         2   # BR(~u_L -> chi^0_4 u)
     2.80360701E-03    2     1000024         1   # BR(~u_L -> chi^+_1 d)
     9.85219497E-02    2     1000037         1   # BR(~u_L -> chi^+_2 d)
     8.46393912E-01    2     1000021         2   # BR(~u_L -> ~g u)
DECAY   2000004     7.57002392E+02   # ~c_R
#    BR                NDA      ID1      ID2
     2.14001262E-02    2     1000022         4   # BR(~c_R -> chi^0_1 c)
     2.05051504E-04    2     1000023         4   # BR(~c_R -> chi^0_2 c)
     8.17145199E-03    2     1000025         4   # BR(~c_R -> chi^0_3 c)
     9.70216069E-01    2     1000021         4   # BR(~c_R -> ~g c)
DECAY   1000004     8.69911860E+02   # ~c_L
#    BR                NDA      ID1      ID2
     5.88549215E-04    2     1000022         4   # BR(~c_L -> chi^0_1 c)
     1.04729376E-04    2     1000023         4   # BR(~c_L -> chi^0_2 c)
     1.86095041E-03    2     1000025         4   # BR(~c_L -> chi^0_3 c)
     4.97287623E-02    2     1000035         4   # BR(~c_L -> chi^0_4 c)
     2.83249229E-03    2     1000024         3   # BR(~c_L -> chi^+_1 s)
     9.85187427E-02    2     1000037         3   # BR(~c_L -> chi^+_2 s)
     8.46365774E-01    2     1000021         4   # BR(~c_L -> ~g c)
DECAY   1000006     2.22524142E+02   # ~t_1
#    BR                NDA      ID1      ID2
     2.53906491E-02    2     1000022         6   # BR(~t_1 -> chi^0_1 t)
     1.48436388E-01    2     1000023         6   # BR(~t_1 -> chi^0_2 t)
     1.17666528E-01    2     1000025         6   # BR(~t_1 -> chi^0_3 t)
     6.33870737E-02    2     1000035         6   # BR(~t_1 -> chi^0_4 t)
     9.78876848E-02    2     1000024         5   # BR(~t_1 -> chi^+_1 b)
     1.17873582E-01    2     1000037         5   # BR(~t_1 -> chi^+_2 b)
     6.43565156E-04    2     1000021         4   # BR(~t_1 -> ~g c)
     4.21656677E-01    2     1000021         6   # BR(~t_1 -> ~g t)
#    BR                NDA      ID1      ID2       ID3
     7.05658047E-03    3     1000022        24         5   # BR(~t_1 -> chi^0_1 W^+ b)
DECAY   2000006     5.95998845E+02   # ~t_2
#    BR                NDA      ID1      ID2
     2.91880575E-02    2     1000022         6   # BR(~t_2 -> chi^0_1 t)
     7.90123233E-02    2     1000023         6   # BR(~t_2 -> chi^0_2 t)
     6.08853599E-02    2     1000025         6   # BR(~t_2 -> chi^0_3 t)
     6.43691931E-04    2     1000035         6   # BR(~t_2 -> chi^0_4 t)
     1.51611108E-01    2     1000024         5   # BR(~t_2 -> chi^+_1 b)
     1.28197429E-03    2     1000037         5   # BR(~t_2 -> chi^+_2 b)
     3.80182720E-01    2     1000021         6   # BR(~t_2 -> ~g t)
     1.25925918E-01    2     1000005        24   # BR(~t_2 -> ~b_1 W^+)
     5.90965955E-04    2     1000005        37   # BR(~t_2 -> ~b_1 H^+)
     6.41450149E-02    2     1000006        23   # BR(~t_2 -> ~t_1 Z)
     3.02681035E-04    2     1000006        36   # BR(~t_2 -> ~t_1 A^0)
     1.02254207E-01    2     1000006        25   # BR(~t_2 -> ~t_1 h^0)
     3.94455977E-03    2     1000006        35   # BR(~t_2 -> ~t_1 H^0)
DECAY   1000024     1.76440245E-04   # chi^+_1
#    BR                NDA      ID1      ID2       ID3
     3.33923586E-01    3     1000022        -1         2   # BR(chi^+_1 -> chi^0_1 d_bar u)
     3.33177440E-01    3     1000022        -3         4   # BR(chi^+_1 -> chi^0_1 s_bar c)
     1.11307952E-01    3     1000022       -11        12   # BR(chi^+_1 -> chi^0_1 e^+ nu_e)
     1.11305706E-01    3     1000022       -13        14   # BR(chi^+_1 -> chi^0_1 mu^+ nu_mu)
     1.10285317E-01    3     1000022       -15        16   # BR(chi^+_1 -> chi^0_1 tau^+ nu_tau)
DECAY   1000037     1.21663860E+01   # chi^+_2
#    BR                NDA      ID1      ID2
     1.84200795E-02    2     1000022        24   # BR(chi^+_2 -> chi^0_1 W^+)
     1.39377110E-01    2     1000023        24   # BR(chi^+_2 -> chi^0_2 W^+)
     1.16352966E-01    2     1000025        24   # BR(chi^+_2 -> chi^0_3 W^+)
     3.93103227E-02    2          37   1000022   # BR(chi^+_2 -> H^+ chi^0_1)
     1.14710818E-01    2          37   1000023   # BR(chi^+_2 -> H^+ chi^0_2)
     7.84216905E-02    2          37   1000025   # BR(chi^+_2 -> H^+ chi^0_3)
     1.33243849E-01    2     1000024        23   # BR(chi^+_2 -> chi^+_1 Z)
     1.17181822E-01    2     1000024        36   # BR(chi^+_2 -> chi^+_1 A^0)
     1.41279775E-01    2     1000024        25   # BR(chi^+_2 -> chi^+_1 h^0)
     9.86761395E-02    2     1000024        35   # BR(chi^+_2 -> chi^+_1 H^0)
#    BR                NDA      ID1      ID2       ID3
     5.91128743E-04    3     1000024         6        -6   # BR(chi^+_2 -> chi^+_1 t t_bar)
     1.95459934E-04    3     1000022        -5         6   # BR(chi^+_2 -> chi^0_1 b_bar t)
     1.19757263E-03    3     1000023        -5         6   # BR(chi^+_2 -> chi^0_2 b_bar t)
     1.04101192E-03    3     1000025        -5         6   # BR(chi^+_2 -> chi^0_3 b_bar t)
DECAY   1000022     0.00000000E+00   # chi^0_1
DECAY   1000023     9.62617339E-04   # chi^0_2
#    BR                NDA      ID1      ID2
     5.60862129E-03    2     1000022        22   # BR(chi^0_2 -> chi^0_1 photon)
#    BR                NDA      ID1      ID2       ID3
     1.18158883E-01    3     1000022         2        -2   # BR(chi^0_2 -> chi^0_1 u u_bar)
     1.17647868E-01    3     1000022         4        -4   # BR(chi^0_2 -> chi^0_1 c c_bar)
     1.51502546E-01    3     1000022         1        -1   # BR(chi^0_2 -> chi^0_1 d d_bar)
     1.51501072E-01    3     1000022         3        -3   # BR(chi^0_2 -> chi^0_1 s s_bar)
     1.49830151E-01    3     1000022         5        -5   # BR(chi^0_2 -> chi^0_1 b b_bar)
     3.41895360E-02    3     1000022        11       -11   # BR(chi^0_2 -> chi^0_1 e^- e^+)
     3.41903747E-02    3     1000022        13       -13   # BR(chi^0_2 -> chi^0_1 mu^- mu^+)
     3.44236212E-02    3     1000022        15       -15   # BR(chi^0_2 -> chi^0_1 tau^- tau^+)
     2.02604954E-01    3     1000022        12       -12   # BR(chi^0_2 -> chi^0_1 nu_e nu_bar_e)
DECAY   1000025     3.02736867E-05   # chi^0_3
#    BR                NDA      ID1      ID2
     3.99289488E-03    2     1000022        22   # BR(chi^0_3 -> chi^0_1 photon)
     1.52288871E-03    2     1000023        22   # BR(chi^0_3 -> chi^0_2 photon)
#    BR                NDA      ID1      ID2       ID3
     8.96539942E-02    3     1000022         2        -2   # BR(chi^0_3 -> chi^0_1 u u_bar)
     8.93678230E-02    3     1000022         4        -4   # BR(chi^0_3 -> chi^0_1 c c_bar)
     1.14928803E-01    3     1000022         1        -1   # BR(chi^0_3 -> chi^0_1 d d_bar)
     1.14988317E-01    3     1000022         3        -3   # BR(chi^0_3 -> chi^0_1 s s_bar)
     2.66079669E-01    3     1000022         5        -5   # BR(chi^0_3 -> chi^0_1 b b_bar)
     2.59122059E-02    3     1000022        11       -11   # BR(chi^0_3 -> chi^0_1 e^- e^+)
     2.59771439E-02    3     1000022        13       -13   # BR(chi^0_3 -> chi^0_1 mu^- mu^+)
     4.40342072E-02    3     1000022        15       -15   # BR(chi^0_3 -> chi^0_1 tau^- tau^+)
     1.53716185E-01    3     1000022        12       -12   # BR(chi^0_3 -> chi^0_1 nu_e nu_bar_e)
     2.43202378E-04    3     1000023         2        -2   # BR(chi^0_3 -> chi^0_2 u u_bar)
     1.67896803E-04    3     1000023         4        -4   # BR(chi^0_3 -> chi^0_2 c c_bar)
     3.11834277E-04    3     1000023         1        -1   # BR(chi^0_3 -> chi^0_2 d d_bar)
     3.11277299E-04    3     1000023         3        -3   # BR(chi^0_3 -> chi^0_2 s s_bar)
     4.17010678E-04    3     1000023        12       -12   # BR(chi^0_3 -> chi^0_2 nu_e nu_bar_e)
     1.15775210E-02    3     1000024         1        -2   # BR(chi^0_3 -> chi^+_1 d u_bar)
     1.15775210E-02    3    -1000024        -1         2   # BR(chi^0_3 -> chi^-_1 d_bar u)
     1.12317875E-02    3     1000024         3        -4   # BR(chi^0_3 -> chi^+_1 s c_bar)
     1.12317875E-02    3    -1000024        -3         4   # BR(chi^0_3 -> chi^-_1 s_bar c)
     3.85915891E-03    3     1000024        11       -12   # BR(chi^0_3 -> chi^+_1 e^- nu_bar_e)
     3.85915891E-03    3    -1000024       -11        12   # BR(chi^0_3 -> chi^-_1 e^+ nu_e)
     3.85882651E-03    3     1000024        13       -14   # BR(chi^0_3 -> chi^+_1 mu^- nu_bar_mu)
     3.85882651E-03    3    -1000024       -13        14   # BR(chi^0_3 -> chi^-_1 mu^+ nu_mu)
     3.57426302E-03    3     1000024        15       -16   # BR(chi^0_3 -> chi^+_1 tau^- nu_bar_tau)
     3.57426302E-03    3    -1000024       -15        16   # BR(chi^0_3 -> chi^-_1 tau^+ nu_tau)
DECAY   1000035     1.29418278E+01   # chi^0_4
#    BR                NDA      ID1      ID2
     1.28565150E-01    2     1000024       -24   # BR(chi^0_4 -> chi^+_1 W^-)
     1.28565150E-01    2    -1000024        24   # BR(chi^0_4 -> chi^-_1 W^+)
     1.03693961E-01    2          37  -1000024   # BR(chi^0_4 -> H^+ chi^-_1)
     1.03693961E-01    2         -37   1000024   # BR(chi^0_4 -> H^- chi^+_1)
     4.80208800E-03    2     1000022        23   # BR(chi^0_4 -> chi^0_1 Z)
     1.01521147E-01    2     1000023        23   # BR(chi^0_4 -> chi^0_2 Z)
     2.37049222E-02    2     1000025        23   # BR(chi^0_4 -> chi^0_3 Z)
     1.23100656E-02    2     1000022        36   # BR(chi^0_4 -> chi^0_1 A^0)
     2.44755955E-02    2     1000023        36   # BR(chi^0_4 -> chi^0_2 A^0)
     1.88028087E-02    2     1000025        36   # BR(chi^0_4 -> chi^0_3 A^0)
     1.68085479E-02    2     1000022        25   # BR(chi^0_4 -> chi^0_1 h^0)
     5.90493043E-02    2     1000023        25   # BR(chi^0_4 -> chi^0_2 h^0)
     9.60899931E-02    2     1000025        25   # BR(chi^0_4 -> chi^0_3 h^0)
     2.09686145E-02    2     1000022        35   # BR(chi^0_4 -> chi^0_1 H^0)
     1.14805799E-01    2     1000023        35   # BR(chi^0_4 -> chi^0_2 H^0)
     3.93906623E-02    2     1000025        35   # BR(chi^0_4 -> chi^0_3 H^0)
#    BR                NDA      ID1      ID2       ID3
     1.80930182E-04    3     1000023         6        -6   # BR(chi^0_4 -> chi^0_2 t t_bar)
     1.45018093E-04    3     1000025         6        -6   # BR(chi^0_4 -> chi^0_3 t t_bar)
     1.19024570E-03    3     1000024         5        -6   # BR(chi^0_4 -> chi^+_1 b t_bar)
     1.19024570E-03    3    -1000024        -5         6   # BR(chi^0_4 -> chi^-_1 b_bar t)
DECAY   1000021     3.39727602E-02   # ~g
#    BR                NDA      ID1      ID2
     1.03051571E-03    2     1000022        21   # BR(~g -> chi^0_1 g)
     5.33546149E-03    2     1000023        21   # BR(~g -> chi^0_2 g)
     3.23982957E-03    2     1000025        21   # BR(~g -> chi^0_3 g)
     1.04151694E-04    2     1000035        21   # BR(~g -> chi^0_4 g)
#    BR                NDA      ID1      ID2       ID3
     1.39631384E-04    3     1000022         2        -2   # BR(~g -> chi^0_1 u u_bar)
     1.39639210E-04    3     1000022         4        -4   # BR(~g -> chi^0_1 c c_bar)
     2.76519073E-02    3     1000022         6        -6   # BR(~g -> chi^0_1 t t_bar)
     2.67198514E-02    3     1000022         5        -5   # BR(~g -> chi^0_1 b b_bar)
     1.49235590E-01    3     1000023         6        -6   # BR(~g -> chi^0_2 t t_bar)
     6.01106354E-02    3     1000023         5        -5   # BR(~g -> chi^0_2 b b_bar)
     1.19340613E-01    3     1000025         6        -6   # BR(~g -> chi^0_3 t t_bar)
     4.23575000E-02    3     1000025         5        -5   # BR(~g -> chi^0_3 b b_bar)
     1.75954210E-04    3     1000035         2        -2   # BR(~g -> chi^0_4 u u_bar)
     1.75954471E-04    3     1000035         4        -4   # BR(~g -> chi^0_4 c c_bar)
     2.77517851E-02    3     1000035         6        -6   # BR(~g -> chi^0_4 t t_bar)
     1.77071926E-04    3     1000035         1        -1   # BR(~g -> chi^0_4 d d_bar)
     1.77072009E-04    3     1000035         3        -3   # BR(~g -> chi^0_4 s s_bar)
     2.40206711E-02    3     1000035         5        -5   # BR(~g -> chi^0_4 b b_bar)
     2.03187563E-01    3     1000024         5        -6   # BR(~g -> chi^+_1 b t_bar)
     2.03187563E-01    3    -1000024        -5         6   # BR(~g -> chi^-_1 b_bar t)
     3.52941962E-04    3     1000037         1        -2   # BR(~g -> chi^+_2 d u_bar)
     3.52941962E-04    3    -1000037        -1         2   # BR(~g -> chi^-_2 d_bar u)
     3.52942308E-04    3     1000037         3        -4   # BR(~g -> chi^+_2 s c_bar)
     3.52942308E-04    3    -1000037        -3         4   # BR(~g -> chi^-_2 s_bar c)
     5.20134616E-02    3     1000037         5        -6   # BR(~g -> chi^+_2 b t_bar)
     5.20134616E-02    3    -1000037        -5         6   # BR(~g -> chi^-_2 b_bar t)
DECAY        25     1.01634032E-01   # Gamma(h0)
     1.11068968E-04   2        22        22   # BR(h0 -> photon photon)
     8.53019653E-05   2        22        23   # BR(h0 -> photon Z)
     1.86385919E-03   2        23        23   # BR(h0 -> Z Z)
     1.40820209E-02   2       -24        24   # BR(h0 -> W W)
     2.12487176E-03   2        21        21   # BR(h0 -> gluon gluon)
     8.15987917E-09   2       -11        11   # BR(h0 -> Electron electron)
     3.62970227E-04   2       -13        13   # BR(h0 -> Muon muon)
     1.04662714E-01   2       -15        15   # BR(h0 -> Tau tau)
     4.72831434E-09   2        -2         2   # BR(h0 -> Up up)
     9.17794836E-04   2        -4         4   # BR(h0 -> Charm charm)
     9.36401998E-07   2        -1         1   # BR(h0 -> Down down)
     3.38669444E-04   2        -3         3   # BR(h0 -> Strange strange)
     8.75449780E-01   2        -5         5   # BR(h0 -> Bottom bottom)
DECAY        35     3.14913468E+00   # Gamma(HH)
     2.30789777E-07   2        22        22   # BR(HH -> photon photon)
     1.32622911E-07   2        22        23   # BR(HH -> photon Z)
     6.84141660E-06   2        23        23   # BR(HH -> Z Z)
     5.39904792E-05   2       -24        24   # BR(HH -> W W)
     9.39309131E-04   2        21        21   # BR(HH -> gluon gluon)
     8.51664272E-09   2       -11        11   # BR(HH -> Electron electron)
     3.78853861E-04   2       -13        13   # BR(HH -> Muon muon)
     1.09275830E-01   2       -15        15   # BR(HH -> Tau tau)
     5.77678150E-12   2        -2         2   # BR(HH -> Up up)
     1.12156957E-06   2        -4         4   # BR(HH -> Charm charm)
     9.56537428E-07   2        -1         1   # BR(HH -> Down down)
     3.45951966E-04   2        -3         3   # BR(HH -> Strange strange)
     8.88996773E-01   2        -5         5   # BR(HH -> Bottom bottom)
DECAY        36     3.27366822E+00   # Gamma(A0)
     3.55249516E-07   2        22        22   # BR(A0 -> photon photon)
     7.12298503E-09   2        22        23   # BR(A0 -> photon Z)
     9.22494138E-04   2        21        21   # BR(A0 -> gluon gluon)
     8.49963671E-09   2       -11        11   # BR(A0 -> Electron electron)
     3.78097706E-04   2       -13        13   # BR(A0 -> Muon muon)
     1.09121451E-01   2       -15        15   # BR(A0 -> Tau tau)
     1.03013375E-13   2        -2         2   # BR(A0 -> Up up)
     1.98646860E-08   2        -4         4   # BR(A0 -> Charm charm)
     9.55286366E-07   2        -1         1   # BR(A0 -> Down down)
     3.45499664E-04   2        -3         3   # BR(A0 -> Strange strange)
     8.89231105E-01   2        -5         5   # BR(A0 -> Bottom bottom)
     6.53772152E-09   2        23        25   # BR(A0 -> Z h0)
DECAY        37     5.89775098E-01   # Gamma(Hp)
     6.93944139E-08   2       -11        12   # BR(Hp -> Electron nu_e)
     2.96682607E-03   2       -13        14   # BR(Hp -> Muon nu_mu)
     8.39039029E-01   2       -15        16   # BR(Hp -> Tau nu_tau)
     6.55134401E-06   2        -1         2   # BR(Hp -> Down up)
     1.06092150E-04   2        -3         2   # BR(Hp -> Strange up)
     6.49657481E-05   2        -5         2   # BR(Hp -> Bottom up)
     3.01633598E-07   2        -1         4   # BR(Hp -> Down charm)
     2.36089747E-03   2        -3         4   # BR(Hp -> Strange charm)
     9.09670466E-03   2        -5         4   # BR(Hp -> Bottom charm)
     2.16297461E-08   2        -1         6   # BR(Hp -> Down top)
     5.50820642E-07   2        -3         6   # BR(Hp -> Strange top)
     1.45831238E-01   2        -5         6   # BR(Hp -> Bottom top)
     2.82189132E-05   2        24        25   # BR(Hp -> W h0)
     2.38152195E-04   2        24        35   # BR(Hp -> W HH)
     2.60380904E-04   2        24        36   # BR(Hp -> W A0)
DECAY         6     2.43000000E+00   # top
#    BR                NDA      ID1      ID2
     1.00000000E+00    2           5        24   # BR(t -> b W)
Block HiggsBoundsInputHiggsCouplingsFermions
# ScalarNormEffCoupSq PseudoSNormEffCoupSq NP IP1 IP2 IP2
    3.53696402E+01    0.00000000E+00        3  25   5   5  # h0-b-b eff. coupling^2, normalised to SM
    1.19377716E+03    0.00000000E+00        3  35   5   5  # H0-b-b eff. coupling^2, normalised to SM
    0.00000000E+00    1.22814680E+03        3  36   5   5  # A0-b-b eff. coupling^2, normalised to SM
#
    9.72015039E-01    0.00000000E+00        3  25   6   6  # h0-t-t eff. coupling^2, normalised to SM
    2.87991958E-02    0.00000000E+00        3  35   6   6  # H0-t-t eff. coupling^2, normalised to SM
    0.00000000E+00    8.14234908E-04        3  36   6   6  # A0-t-t eff. coupling^2, normalised to SM
#
    3.53696402E+01    0.00000000E+00        3  25  15  15  # h0-tau-tau eff. coupling^2, normalised to SM
    1.19377716E+03    0.00000000E+00        3  35  15  15  # H0-tau-tau eff. coupling^2, normalised to SM
    0.00000000E+00    1.22814680E+03        3  36  15  15  # A0-tau-tau eff. coupling^2, normalised to SM
#
Block HiggsBoundsInputHiggsCouplingsBosons
    9.79990374E-01        3  25  24  24  # h0-W-W eff. coupling^2, normalised to SM
    2.00096257E-02        3  35  24  24  # H0-W-W eff. coupling^2, normalised to SM
    0.00000000E+00        3  36  24  24  # A0-W-W eff. coupling^2, normalised to SM
#
    9.79990374E-01        3  25  23  23  # h0-Z-Z eff. coupling^2, normalised to SM
    2.00096257E-02        3  35  23  23  # H0-Z-Z eff. coupling^2, normalised to SM
    0.00000000E+00        3  36  23  23  # A0-Z-Z eff. coupling^2, normalised to SM
#
    8.72065747E-01        3  25  21  21  # h0-g-g eff. coupling^2, normalised to SM
    6.55853296E+00        3  35  21  21  # H0-g-g eff. coupling^2, normalised to SM
    1.66882821E+00        3  36  21  21  # A0-g-g eff. coupling^2, normalised to SM
#
    0.00000000E+00        3  25  25  23  # h0-h0-Z eff. coupling^2, normalised to SM
    0.00000000E+00        3  35  25  23  # H0-h0-Z eff. coupling^2, normalised to SM
    2.00096257E-02        3  36  25  23  # A0-h0-Z eff. coupling^2, normalised to SM
    0.00000000E+00        3  35  35  23  # H0-H0-Z eff. coupling^2, normalised to SM
    9.79990374E-01        3  36  35  23  # A0-H0-Z eff. coupling^2, normalised to SM
    0.00000000E+00        3  36  36  23  # A0-A0-Z eff. coupling^2, normalised to SM
#
    0.00000000E+00        4  25  21  21  23  # h0-g-g-Z eff. coupling^2, normalised to SM
    0.00000000E+00        4  35  21  21  23  # H0-g-g-Z eff. coupling^2, normalised to SM
    0.00000000E+00        4  36  21  21  23  # A0-g-g-Z eff. coupling^2, normalised to SM
Block SPhenoLowEnergy  # low energy observables
    1    5.90486998E-04   # BR(b -> s gamma)
    2    1.63277009E-06   # BR(b -> s mu+ mu-)
    3    3.52676065E-05   # BR(b -> s nu nu)
    4    2.12767568E-15   # BR(Bd -> e+ e-)
    5    9.08920014E-11   # BR(Bd -> mu+ mu-)
    6    1.90339634E-08   # BR(Bd -> tau+ tau-)
    7    7.11140189E-14   # BR(Bs -> e+ e-)
    8    3.03799407E-09   # BR(Bs -> mu+ mu-)
    9    6.44711964E-07   # BR(Bs -> tau+ tau-)
   10    2.06252212E-06   # BR(B_u -> tau nu)
   11    2.13050639E-02   # BR(B_u -> tau nu)/BR(B_u -> tau nu)_SM
   12    5.41387343E-01   # |Delta(M_Bd)| [ps^-1] 
   13    1.89606332E+01   # |Delta(M_Bs)| [ps^-1] 
   14    0.00000000E+00   # neutron EDM according to the chiral quark model
   15    0.00000000E+00   # neutron EDM according to the relativistic quark-parton model
   16    2.15813498E-03   # epsilon_K
   17    2.28192346E-15   # Delta(M_K)
   18    2.48117837E-11   # BR(K^0 -> pi^0 nu nu)
   19    8.29317700E-11   # BR(K^+ -> pi^+ nu nu)
   20    2.67476796E-16   # Delta(g-2)_electron/2
   21    1.14355151E-11   # Delta(g-2)_muon/2
   22    3.23803776E-09   # Delta(g-2)_tau/2
   23    0.00000000E+00   # electric dipole moment of the electron
   24    0.00000000E+00   # electric dipole moment of the muon
   25    0.00000000E+00   # electric dipole moment of the tau
   26    0.00000000E+00   # Br(mu -> e gamma)
   27    0.00000000E+00   # Br(tau -> e gamma)
   28    0.00000000E+00   # Br(tau -> mu gamma)
   29    0.00000000E+00   # Br(mu -> 3 e)
   30    0.00000000E+00   # Br(tau -> 3 e)
   31    0.00000000E+00   # Br(tau -> 3 mu)
   39    6.68866789E-05   # Delta(rho_parameter)
   40    0.00000000E+00   # BR(Z -> e mu)
   41    0.00000000E+00   # BR(Z -> e tau)
   42    0.00000000E+00   # BR(Z -> mu tau)
Block FWCOEF Q=  1.60000000E+02  # Wilson coefficients at scale Q
#    id        order  M        value         comment
     0305 4422   00   0    -1.88819110E-01   # C7
     0305 4422   00   2    -4.35275125E-01   # C7
     0305 4322   00   2    -4.25058615E-03   # C7'
     0305 6421   00   0    -9.52278348E-02   # C8
     0305 6421   00   2    -3.10629989E-01   # C8
     0305 6321   00   2    -3.70600377E-03   # C8'
 03051111 4133   00   0     1.62533064E+00   # C9 e+e-
 03051111 4133   00   2     1.62568493E+00   # C9 e+e-
 03051111 4233   00   2    -5.68210536E-04   # C9' e+e-
 03051111 4137   00   0    -4.44802274E+00   # C10 e+e-
 03051111 4137   00   2    -4.44765589E+00   # C10 e+e-
 03051111 4237   00   2     4.21763298E-03   # C10' e+e-
 03051313 4133   00   0     1.62533064E+00   # C9 mu+mu-
 03051313 4133   00   2     1.62568481E+00   # C9 mu+mu-
 03051313 4233   00   2    -5.69778194E-04   # C9' mu+mu-
 03051313 4137   00   0    -4.44802274E+00   # C10 mu+mu-
 03051313 4137   00   2    -4.44765601E+00   # C10 mu+mu-
 03051313 4237   00   2     4.21920623E-03   # C10' mu+mu-
 03051212 4137   00   0     1.50535012E+00   # C11 nu_1 nu_1
 03051212 4137   00   2     1.50527333E+00   # C11 nu_1 nu_1
 03051212 4237   00   2    -9.12290325E-04   # C11' nu_1 nu_1
 03051414 4137   00   0     1.50535012E+00   # C11 nu_2 nu_2
 03051414 4137   00   2     1.50527333E+00   # C11 nu_2 nu_2
 03051414 4237   00   2    -9.11949968E-04   # C11' nu_2 nu_2
 03051616 4137   00   0     1.50535012E+00   # C11 nu_3 nu_3
 03051616 4137   00   2     1.50527334E+00   # C11 nu_3 nu_3
 03051616 4237   00   2    -8.16035006E-04   # C11' nu_3 nu_3
Block IMFWCOEF Q=  1.60000000E+02  # Im(Wilson coefficients) at scale Q
#    id        order  M        value         comment
     0305 4422   00   0     3.85809424E-07   # C7
     0305 4422   00   2     2.53460692E-05   # C7
     0305 4322   00   2    -1.16805394E-06   # C7'
     0305 6421   00   0     3.30471287E-07   # C8
     0305 6421   00   2    -4.00819596E-05   # C8
     0305 6321   00   2    -1.32934461E-06   # C8'
 03051111 4133   00   2     7.06207476E-07   # C9 e+e-
 03051111 4233   00   2     8.53588748E-06   # C9' e+e-
 03051111 4137   00   2     4.24487564E-06   # C10 e+e-
 03051111 4237   00   2    -6.32944424E-05   # C10' e+e-
 03051313 4133   00   2     7.06202834E-07   # C9 mu+mu-
 03051313 4233   00   2     8.53588593E-06   # C9' mu+mu-
 03051313 4137   00   2     4.24488077E-06   # C10 mu+mu-
 03051313 4237   00   2    -6.32944471E-05   # C10' mu+mu-
 03051212 4137   00   2    -8.72206057E-07   # C11 nu_1 nu_1
 03051212 4237   00   2     1.36908066E-05   # C11' nu_1 nu_1
 03051414 4137   00   2    -8.72205824E-07   # C11 nu_2 nu_2
 03051414 4237   00   2     1.36908066E-05   # C11' nu_2 nu_2
 03051616 4137   00   2    -8.72140593E-07   # C11 nu_3 nu_3
 03051616 4237   00   2     1.36908065E-05   # C11' nu_3 nu_3
