BLOCK SPINFO
   1   SPheno
   2   v4.0.5be

BLOCK SPHENOINFO
   1   2
   2   2

BLOCK MODSEL
   1   0

BLOCK MINPAR
   3    8.6762657
   4    1

BLOCK EXTPAR
   0    2648.9495
   1    457.0213
   2    591.79936
   3    2043.172
   11   -4504.3038
   12    4794.6578
   13   -4038.5352
   23    3634.4802
   25    8.282697
   26    543.05447
   31    1143.9998
   32    1143.9998
   33    1866.6164
   34    3495.6731
   35    3495.6731
   36    2762.6564
   41    4350.4256
   42    4350.4256
   43    3951.9781
   44    2657.2492
   45    2657.2492
   46    1665.7298
   47    2438.7154
   48    2438.7154
   49    4081.1402

BLOCK SMINPUTS
   1    127.90897
   2    1.1663787e-05
   3    0.1184
   4    91.1876
   5    4.18
   6    173.2
   7    1.777
   8    0
   11    0.00051099893
   12    0
   13    0.10565837
   14    0
   21    0.005
   22    0.0025
   23    0.095
   24    1.27

BLOCK GAUGE Q=  2648.9495
   1    0.35536298
   2    0.66519887
   3    1.219778

BLOCK YU Q=  2648.9495
   1   1    8.4452589e-06
   2   2    0.0042901915
   3   3    1.0202551

BLOCK YD Q=  2648.9495
   1   1    0.00014056105
   2   2    0.0026706599
   3   3    0.13939251

BLOCK YE Q=  2648.9495
   1   1    2.4528931e-05
   2   2    0.005071805
   3   3    0.085299416

BLOCK AU Q=  2648.9495
   1   1    0
   2   2    0
   3   3   -4504.3038

BLOCK AD Q=  2648.9495
   1   1    0
   2   2    0
   3   3    4794.658

BLOCK AE Q=  2648.9495
   1   1    0
   2   2    0
   3   3   -4038.5352

BLOCK MSOFT Q=  2648.9495
   1    457.0213
   2    591.79936
   3    2043.172
   21   -12998111
   22   -13218001
   31    1143.9998
   32    1143.9998
   33    1866.6164
   34    3495.6731
   35    3495.6731
   36    2762.6564
   41    4350.4256
   42    4350.4256
   43    3951.9781
   44    2657.2492
   45    2657.2492
   46    1665.7298
   47    2438.7154
   48    2438.7154
   49    4081.1402

BLOCK MASS
   6    173.2
   23    91.1876
   24    80.429995
   15    1.777
   25    122.83853
   35    543.2049
   36    543.05447
   37    548.93767
   1000001    4410.3103
   2000001    2515.8046
   1000002    4409.7394
   2000002    2724.7579
   1000003    4410.3099
   2000003    2515.8047
   1000004    4409.7389
   2000004    2724.7581
   1000005    3974.5696
   2000005    4131.1235
   1000006    1762.1722
   2000006    3981.9794
   1000011    1146.7362
   2000011    3501.2454
   1000012    1143.7984
   1000013    1146.7356
   2000013    3501.2444
   1000014    1143.7982
   1000015    1869.0616
   2000015    2767.2452
   1000016    1867.3382
   1000021    2307.6042
   1000022    454.18893
   1000023    630.04016
   1000025   -3623.848
   1000035    3624.6464
   1000024    630.18221
   1000037    3625.2135

BLOCK ALPHA
      -0.12320792

BLOCK HMIX Q=  2648.9495
   1    3634.4802
   2    8.282697
   3    243.39791
   4    294908.15

BLOCK STOPMIX
   1   1    0.056083617
   1   2    0.99842608
   2   1   -0.99842608
   2   2    0.056083617

BLOCK SBOTMIX
   1   1    0.99900703
   1   2    0.044552835
   2   1   -0.044552835
   2   2    0.99900703

BLOCK STAUMIX
   1   1    0.99989625
   1   2    0.014404594
   2   1   -0.014404594
   2   2    0.99989625

BLOCK NMIX
   1   1    0.99990787
   1   2   -0.0022653941
   1   3    0.012987949
   1   4   -0.0032294836
   2   1   -0.0025743241
   2   2   -0.99972916
   2   3    0.022206098
   2   4   -0.0064699846
   3   1    0.0068733756
   3   2   -0.011143869
   3   3   -0.70694146
   3   4   -0.70715086
   4   1   -0.011418317
   4   2    0.0203047
   4   3    0.70680405
   4   4   -0.70702572

BLOCK UMIX
   1   1   -0.99950596
   1   2    0.031429963
   2   1    0.031429963
   2   2    0.99950596

BLOCK VMIX
   1   1   -0.9999578
   1   2    0.0091867384
   2   1    0.0091867384
   2   2    0.9999578

BLOCK HIGGSBOUNDSINPUTHIGGSCOUPLINGSFERMIONS
       0, 68.603069,3,36,15,15

BLOCK HIGGSBOUNDSINPUTHIGGSCOUPLINGSBOSONS
       0,4,36,21,21,23

BLOCK SPHENOLOWENERGY
   1    0.00039717639
   2    1.5904927e-06
   3    3.5306275e-05
   4    2.499755e-15
   5    1.0678669e-10
   6    2.2354308e-08
   7    8.423096e-14
   8    3.5983437e-09
   9    7.6322784e-07
   10    9.5446213e-05
   11    0.98592284
   12    0.5435157
   13    19.415052
   14    0
   15    0
   16    0.0021633089
   17    2.2817226e-15
   18    2.4842322e-11
   19    8.2997511e-11
   20    1.0034756e-15
   21    4.2901703e-11
   22    7.9135428e-09
   23    0
   24    0
   25    0
   26    0
   27    0
   28    0
   29    0
   30    0
   31    0
   39   -3.8134858e-05
   40    0
   41    0
   42    0

BLOCK FWCOEF Q=  160
   305   4422   0   0   -0.18881911
   305   4422   0   2   -0.26401014
   305   4322   0   2   -0.0014752103
   305   6421   0   0   -0.095227835
   305   6421   0   2   -0.17796598
   305   6321   0   2   -0.001620641
   3051111   4133   0   0    1.6118019
   3051111   4133   0   2    1.6121007
   3051111   4233   0   2   -1.4938352e-05
   3051111   4137   0   0   -4.434494
   3051111   4137   0   2   -4.4380601
   3051111   4237   0   2    0.00011226125
   3051313   4133   0   0    1.6118019
   3051313   4133   0   2    1.6121006
   3051313   4233   0   2   -1.4938575e-05
   3051313   4137   0   0   -4.434494
   3051313   4137   0   2   -4.4380602
   3051313   4237   0   2    0.00011226147
   3051212   4137   0   0    1.5053501
   3051212   4137   0   2    1.5061329
   3051212   4237   0   2   -2.4354024e-05
   3051414   4137   0   0    1.5053501
   3051414   4137   0   2    1.5061329
   3051414   4237   0   2   -2.4353975e-05
   3051616   4137   0   0    1.5053501
   3051616   4137   0   2    1.5061327
   3051616   4237   0   2   -2.4340535e-05

BLOCK IMFWCOEF Q=  160
   305   4422   0   0    3.8584574e-07
   305   4422   0   2    2.1995248e-06
   305   4322   0   2    9.9382378e-07
   305   6421   0   0    3.3050239e-07
   305   6421   0   2   -1.5310746e-06
   305   6321   0   2    6.599545e-07
   3051111   4133   0   2   -2.0052361e-06
   3051111   4233   0   2    1.1258324e-07
   3051111   4137   0   2    1.53989e-05
   3051111   4237   0   2   -8.6594055e-07
   3051313   4133   0   2   -2.0052369e-06
   3051313   4233   0   2    1.1258324e-07
   3051313   4137   0   2    1.5398899e-05
   3051313   4237   0   2   -8.6594057e-07
   3051212   4137   0   2   -3.180707e-06
   3051212   4237   0   2    1.879236e-07
   3051414   4137   0   2   -3.180707e-06
   3051414   4237   0   2    1.879236e-07
   3051616   4137   0   2   -3.1852765e-06
   3051616   4237   0   2    1.8792029e-07

DECAY 23  2.4952


DECAY 24  2.085


DECAY 1000011  8.3940191
    0.58534215   2   -1000024    12
    0.29372247   2    1000023    11
    0.12093538   2    1000022    11

DECAY 2000011  17.00235
    0.99999358   2    1000022    11

DECAY 1000013  8.3940072
    0.58534211   2   -1000024    14
    0.29372244   2    1000023    13
    0.12093544   2    1000022    13

DECAY 2000013  17.003244
    0.99994075   2    1000022    13

DECAY 1000015  21.450791
    0.6019015   2   -1000024    16
    0.3019513   2    1000023    15
    0.096147205   2    1000022    15

DECAY 2000015  14.687336
    0.89604074   2    1000022    15
    0.032500297   2    1000016   -24
    0.019472701   2    1000016   -37
    0.016138956   2    1000015    25
    0.016112891   2    1000015    23
    0.0097835163   2    1000015    36
    0.0097042191   2    1000015    35
    0.00016026457   2   -1000024    16

DECAY 1000012  8.3461307
    0.58511063   2    1000024    11
    0.29173218   2    1000023    12
    0.12315719   2    1000022    12

DECAY 1000014  8.3461264
    0.58511061   2    1000024    13
    0.29173218   2    1000023    14
    0.12315722   2    1000022    14

DECAY 1000016  21.432901
    0.60216723   2    1000024    15
    0.30015088   2    1000023    16
    0.097681883   2    1000022    16

DECAY 2000001  6.3134636
    0.79183262   2    1000021    1
    0.20816609   2    1000022    1

DECAY 1000001  240.04489
    0.76486829   2    1000021    1
    0.15504687   2   -1000024    2
    0.07748841   2    1000023    1
    0.0025740607   2    1000022    1

DECAY 2000003  6.3134642
    0.79183256   2    1000021    3
    0.20816608   2    1000022    3

DECAY 1000003  240.04584
    0.76486506   2    1000021    3
    0.15504621   2   -1000024    4
    0.077488095   2    1000023    3
    0.0025740506   2    1000022    3

DECAY 1000005  297.41261
    0.4636338   2    1000021    5
    0.23331478   2    1000006   -24
    0.12742   2    1000006   -37
    0.11106678   2   -1000024    6
    0.055744646   2    1000023    5
    0.0067884656   2   -1000037    6
    0.0018850137   2    1000022    5

DECAY 2000005  157.05947
    0.98252808   2    1000021    5
    0.014289037   2    1000022    5
    0.0010418172   2    1000006   -24
    0.00066549128   2   -1000037    6
    0.00031692989   2   -1000024    6
    0.0002724875   2    1000035    5
    0.00027196397   2    1000025    5
    0.0001591957   2    1000023    5
    0.00013466425   2    1000006   -37
    0.00012862664   2    2000006   -24
    0.00012491765   2    1000005    25

DECAY 2000002  22.945797
    0.74939272   2    1000021    2
    0.25060571   2    1000022    2

DECAY 1000002  240.01036
    0.76472994   2    1000021    2
    0.15518764   2    1000024    1
    0.077630946   2    1000023    2
    0.0024463555   2    1000022    2

DECAY 2000004  22.945701
    0.74939177   2    1000021    4
    0.25060665   2    1000022    4

DECAY 1000004  240.01111
    0.76472707   2    1000021    4
    0.15518714   2    1000024    3
    0.077630677   2    1000023    4
    0.0024463472   2    1000022    4

DECAY 1000006  3.4344452
    0.97483603   2    1000022    6
    0.016904824   2    1000024    5
    0.0082511361   2    1000023    6

DECAY 2000006  311.13183
    0.43802757   2    1000021    6
    0.1602241   2    1000006    25
    0.1122428   2    1000006    23
    0.1065809   2    1000024    5
    0.061077898   2    1000006    36
    0.059711674   2    1000006    35
    0.053091589   2    1000023    6
    0.0035865718   2    1000035    6
    0.0035367309   2    1000025    6
    0.0017444254   2    1000022    6
    0.00017574861   2    1000037    5

DECAY 1000024  0.00015903526
    0.99236586   2    1000022    24
    0.0036298948   3    1000022   -13    14
    0.0036298836   3    1000022   -11    12
    0.00036757803   3    1000022   -15    16

DECAY 1000037  117.32085
    0.55771482   2    1000006   -5
    0.073264762   2    1000024    25
    0.067669738   2    1000023    24
    0.067465781   2    1000024    23
    0.059631594   2    37    1000023
    0.059443225   2    1000024    36
    0.059301301   2    1000024    35
    0.023204262   2    1000022    24
    0.017191142   2    37    1000022
    0.0075319205   3    1000024    6   -6
    0.0041356158   3    1000023   -5    6
    0.0013181387   3    1000022   -5    6
    0.001211865   2    1000016   -15
    0.00039177647   2   -2000015    16
    0.00020355724   3    1000021   -5    6
    0.00010881196   2   -1000013    14
    0.00010881194   2   -1000011    12

DECAY 1000022 -1


DECAY 1000023  0.00013237833
    0.98421798   2    1000022    25
    0.0066310126   2    1000022    23
    0.0046183311   3    1000022    12   -12
    0.0021450528   3    1000022    13   -13
    0.0021450419   3    1000022    11   -11
    0.00021893968   3    1000022    15   -15

DECAY 1000025  124.09274
    0.26814773   2    1000006   -6
    0.26814773   2   -1000006    6
    0.066165813   2    37   -1000024
    0.066165813   2   -37    1000024
    0.06392951   2    1000024   -24
    0.06392951   2   -1000024    24
    0.051019064   2    1000023    35
    0.04894175   2    1000023    23
    0.032312698   2    1000023    25
    0.016363152   2    1000022    23
    0.015212178   2    1000023    36
    0.013733955   2    1000022    35
    0.0087018649   2    1000022    25
    0.0050201926   2    1000022    36
    0.0035125392   3    1000024    5   -6
    0.0035125392   3   -1000024   -5    6
    0.0025522515   3    1000023    6   -6
    0.00093654592   3    1000022    6   -6
    0.00056902953   2    1000015   -15
    0.00056902953   2   -1000015    15
    0.00018472568   2    2000015   -15
    0.00018472568   2   -2000015    15

DECAY 1000035  117.53946
    0.28170983   2    1000006   -6
    0.28170983   2   -1000006    6
    0.067326706   2    1000024   -24
    0.067326706   2   -1000024    24
    0.059259261   2    37   -1000024
    0.059259261   2   -37    1000024
    0.056048594   2    1000023    25
    0.032693398   2    1000023    35
    0.026084277   2    1000023    36
    0.015558341   2    1000023    23
    0.015094499   2    1000022    25
    0.008800046   2    1000022    35
    0.0086074497   2    1000022    36
    0.0062548124   2    1000022    23
    0.0040554888   3    1000024    5   -6
    0.0040554888   3   -1000024   -5    6
    0.0031038677   3    1000023    6   -6
    0.0010728573   3    1000022    6   -6
    0.00060453439   2    1000015   -15
    0.00060453439   2   -1000015    15
    0.00019682427   2    2000015   -15
    0.00019682427   2   -2000015    15

DECAY 1000021  10.970545
    0.49876209   2    1000006   -6
    0.49876209   2   -1000006    6
    0.00042551396   3    1000022    2   -2
    0.00042551368   3    1000022    4   -4
    0.00019103003   3    1000022    1   -1
    0.00019103001   3    1000022    3   -3
    0.00017200284   3    1000024    5   -6
    0.00017200284   3   -1000024   -5    6
    0.00011181004   3    1000024    3   -4
    0.00011181004   3   -1000024   -3    4
    0.00011180997   3    1000024    1   -2
    0.00011180997   3   -1000024   -1    2

DECAY 25  0.0039870825
    0.63357366   2   -5    5
    0.17621933   2   -24    24
    0.072492047   2   -15    15
    0.066424862   2    21    21
    0.027059382   2   -4    4
    0.020424679   2    23    23
    0.0021236047   2    22    22
    0.0011947783   2    22    23
    0.00025151806   2   -13    13
    0.00023533957   2   -3    3
    6.5068161e-07   2   -1    1
    1.3944928e-07   2   -2    2
    5.6544351e-09   2   -11    11

DECAY 35  0.87102039
    0.67686406   2   -5    5
    0.20088271   2   -6    6
    0.10202459   2   -15    15
    0.013003788   2    25    25
    0.0040474277   2   -24    24
    0.001946881   2    23    23
    0.00063442497   2    21    21
    0.0003552192   2   -13    13
    0.00023274484   2   -3    3
    5.4446169e-06   2   -4    4
    1.6462956e-06   2    22    22
    6.4343183e-07   2   -1    1
    4.0720667e-07   2    22    23
    7.9821941e-09   2   -11    11
    2.8081322e-11   2   -2    2

DECAY 36  0.92203132
    0.63409504   2   -5    5
    0.26563059   2   -6    6
    0.095551716   2   -15    15
    0.003148751   2    23    25
    0.0010149486   2    21    21
    0.0003326667   2   -13    13
    0.00021800889   2   -3    3
    4.2546128e-06   2   -4    4
    2.6882896e-06   2    22    22
    7.2886045e-07   2    22    23
    6.0269366e-07   2   -1    1
    7.4754121e-09   2   -11    11
    2.193567e-11   2   -2    2
    1.6432807e-33   2    25    25

DECAY 37  0.8380163
    0.895642   2   -5    6
    0.098610387   2   -15    16
    0.0036806043   2    24    25
    0.00097509473   2   -5    4
    0.00048775749   2   -3    6
    0.00034862996   2   -13    14
    0.00021568976   2   -3    4
    2.2359528e-05   2   -1    6
    9.625324e-06   2   -3    2
    6.963197e-06   2   -5    2
    5.832554e-07   2   -1    2
    2.7701178e-07   2   -1    4
    1.1306471e-08   2    24    36
    9.9348532e-09   2    24    35
    8.1544916e-09   2   -11    12

DECAY 6  2.43
    1   2    5    24

DECAY 15 -1
