BLOCK SPINFO
   1   SPheno
   2   v4.0.5be

BLOCK SPHENOINFO
   1   2
   2   2

BLOCK MODSEL
   1   0

BLOCK MINPAR
   3    51.048048
   4    1

BLOCK EXTPAR
   0    1764.5284
   1    248.64432
   2    1725.4532
   3    1798.2937
   11    4983.7947
   12    2140.059
   13   -6927.5605
   23    285.87714
   25    50.165105
   26    2120.9043
   31    3563.6342
   32    3563.6342
   33    2412.8243
   34    3860.3557
   35    3860.3557
   36    1582.9297
   41    3000.2724
   42    3000.2724
   43    1774.9885
   44    4892.865
   45    4892.865
   46    1862.7853
   47    4017.013
   48    4017.013
   49    3291.4196

BLOCK SMINPUTS
   1    127.90897
   2    1.1663787e-05
   3    0.1184
   4    91.1876
   5    4.18
   6    173.2
   7    1.777
   8    0
   11    0.00051099893
   12    0
   13    0.10565837
   14    0
   21    0.005
   22    0.0025
   23    0.095
   24    1.27

BLOCK GAUGE Q=  1764.5284
   1    0.35536298
   2    0.66519887
   3    1.219778

BLOCK YU Q=  1764.5284
   1   1    8.3860378e-06
   2   2    0.0042601072
   3   3    1.0131007

BLOCK YD Q=  1764.5284
   1   1    0.00084535435
   2   2    0.016061733
   3   3    0.83832662

BLOCK YE Q=  1764.5284
   1   1    0.00014752052
   2   2    0.030502564
   3   3    0.51300295

BLOCK AU Q=  1764.5284
   1   1    0
   2   2    0
   3   3    4983.7948

BLOCK AD Q=  1764.5284
   1   1    0
   2   2    0
   3   3    2140.0589

BLOCK AE Q=  1764.5284
   1   1    0
   2   2    0
   3   3   -6927.5605

BLOCK MSOFT Q=  1764.5284
   1    248.64432
   2    1725.4532
   3    1798.2937
   21    4417075.6
   22   -11581.76
   31    3563.6342
   32    3563.6342
   33    2412.8243
   34    3860.3557
   35    3860.3557
   36    1582.9297
   41    3000.2724
   42    3000.2724
   43    1774.9885
   44    4892.865
   45    4892.865
   46    1862.7853
   47    4017.013
   48    4017.013
   49    3291.4196

BLOCK MASS
   6    173.2
   23    91.1876
   24    80.429995
   15    1.777
   25    124.98789
   35    2120.0418
   36    2120.9043
   37    2122.1676
   1000001    3047.3086
   2000001    4052.1358
   1000002    3046.4575
   2000002    4939.6733
   1000003    3047.3082
   2000003    4052.1329
   1000004    3046.4572
   2000004    4939.6733
   1000005    1779.1229
   2000005    3312.6572
   1000006    1592.8579
   2000006    1954.7007
   1000011    3574.6659
   2000011    3857.0739
   1000012    3573.4065
   1000013    3574.6622
   2000013    3857.064
   1000014    3573.403
   1000015    1573.7755
   2000015    2417.0005
   1000016    2415.4581
   1000021    2027.0035
   1000022    231.69523
   1000023   -288.43144
   1000025    303.30308
   1000035    1771.2109
   1000024    285.00376
   1000037    1771.3997

BLOCK ALPHA
      -0.019666349

BLOCK HMIX Q=  1764.5284
   1    285.87714
   2    50.165105
   3    243.79245
   4    4498234.8

BLOCK STOPMIX
   1   1   -0.72551052
   1   2    0.68821108
   2   1   -0.68821108
   2   2   -0.72551052

BLOCK SBOTMIX
   1   1    0.9999949
   1   2    0.0031926055
   2   1   -0.0031926055
   2   2    0.9999949

BLOCK STAUMIX
   1   1    0.011195911
   1   2    0.99993732
   2   1   -0.99993732
   2   2    0.011195911

BLOCK NMIX
   1   1    0.85429401
   1   2   -0.017252577
   1   3    0.40229523
   1   4   -0.3286984
   2   1    0.057282406
   2   2   -0.026765183
   2   3   -0.70221107
   2   4   -0.70915581
   3   1   -0.51662213
   3   2   -0.034264571
   3   3    0.58735815
   3   4   -0.62204335
   4   1    0.0014314557
   4   2   -0.99890536
   4   3   -0.0082804606
   4   4    0.046015999

BLOCK UMIX
   1   1   -0.011676515
   1   2    0.99993183
   2   1    0.99993183
   2   2    0.011676515

BLOCK VMIX
   1   1   -0.064947074
   1   2    0.99788871
   2   1    0.99788871
   2   2    0.064947074

BLOCK HIGGSBOUNDSINPUTHIGGSCOUPLINGSFERMIONS
       0, 2516.5378,3,36,15,15

BLOCK HIGGSBOUNDSINPUTHIGGSCOUPLINGSBOSONS
       0,4,36,21,21,23

BLOCK SPHENOLOWENERGY
   1    0.00043311416
   2    1.5920178e-06
   3    3.5239867e-05
   4    1.9621755e-15
   5    8.3816839e-11
   6    1.7258607e-08
   7    6.500559e-14
   8    2.7768578e-09
   9    5.7870268e-07
   10    9.2850373e-05
   11    0.9591088
   12    0.54350769
   13    19.404106
   14    0
   15    0
   16    0.0021659228
   17    2.2817496e-15
   18    2.4820118e-11
   19    8.2927311e-11
   20    2.6528755e-15
   21    1.1341828e-10
   22    4.8765854e-08
   23    0
   24    0
   25    0
   26    0
   27    0
   28    0
   29    0
   30    0
   31    0
   39    8.6867332e-05
   40    0
   41    0
   42    0

BLOCK FWCOEF Q=  160
   305   4422   0   0   -0.18881911
   305   4422   0   2   -0.30929202
   305   4322   0   2   -0.0014151455
   305   6421   0   0   -0.095227835
   305   6421   0   2   -0.17150657
   305   6321   0   2   -0.000899902
   3051111   4133   0   0    1.5984701
   3051111   4133   0   2    1.5997296
   3051111   4233   0   2    0.00057308377
   3051111   4137   0   0   -4.4211622
   3051111   4137   0   2   -4.4184111
   3051111   4237   0   2   -0.004416009
   3051313   4133   0   0    1.5984701
   3051313   4133   0   2    1.5997278
   3051313   4233   0   2    0.00057307981
   3051313   4137   0   0   -4.4211622
   3051313   4137   0   2   -4.4184129
   3051313   4237   0   2   -0.0044160112
   3051212   4137   0   0    1.5053501
   3051212   4137   0   2    1.5047549
   3051212   4237   0   2    0.00096100197
   3051414   4137   0   0    1.5053501
   3051414   4137   0   2    1.5047549
   3051414   4237   0   2    0.00096100252
   3051616   4137   0   0    1.5053501
   3051616   4137   0   2    1.5047546
   3051616   4237   0   2    0.00096115755

BLOCK IMFWCOEF Q=  160
   305   4422   0   0    3.857392e-07
   305   4422   0   2    6.1545461e-05
   305   4322   0   2   -2.1547358e-05
   305   6421   0   0    3.3041114e-07
   305   6421   0   2   -1.1765748e-05
   305   6321   0   2   -1.1267095e-05
   3051111   4133   0   2   -5.5359348e-06
   3051111   4233   0   2    1.2118545e-05
   3051111   4137   0   2    4.9118869e-05
   3051111   4237   0   2   -9.3404988e-05
   3051313   4133   0   2   -5.5359068e-06
   3051313   4233   0   2    1.2118521e-05
   3051313   4137   0   2    4.9118918e-05
   3051313   4237   0   2   -9.3405074e-05
   3051212   4137   0   2   -1.062267e-05
   3051212   4237   0   2    2.0326585e-05
   3051414   4137   0   2   -1.062267e-05
   3051414   4237   0   2    2.0326585e-05
   3051616   4137   0   2   -1.0627498e-05
   3051616   4237   0   2    2.0326584e-05

DECAY 23  2.4952


DECAY 24  2.085


DECAY 1000011  31.337598
    0.57146562   2   -1000037    12
    0.28474957   2    1000035    11
    0.096006429   2    1000022    11
    0.04763589   2    1000025    11
    0.00013517315   2   -1000024    12

DECAY 2000011  19.214002
    0.73083517   2    1000022    11
    0.26589063   2    1000025    11
    0.0032728186   2    1000023    11

DECAY 1000013  31.402851
    0.57027679   2   -1000037    14
    0.28415729   2    1000035    13
    0.096145013   2    1000022    13
    0.048253251   2    1000025    13
    0.0010327654   2    1000023    13
    0.00013489212   2   -1000024    14

DECAY 2000013  19.355199
    0.72609433   2    1000022    13
    0.26520723   2    1000025    13
    0.0050474793   2    1000023    13
    0.0036479375   2   -1000024    14

DECAY 1000015  22.921632
    0.33630803   2   -1000024    16
    0.29790797   2    1000022    15
    0.19944647   2    1000025    15
    0.16633753   2    1000023    15

DECAY 2000015  22.361258
    0.27162325   2    1000023    15
    0.2350743   2    1000025    15
    0.20384733   2   -1000037    16
    0.17786576   2    1000022    15
    0.10162131   2    1000035    15
    0.0050521238   2    1000015    23
    0.0049073691   2    1000015    25

DECAY 1000012  31.350943
    0.56842906   2    1000037    11
    0.28526978   2    1000035    12
    0.11159932   2    1000022    12
    0.028893505   2    1000025    12
    0.0041787495   2    1000024    11
    0.0016295818   2    1000023    12

DECAY 1000014  31.416176
    0.56724766   2    1000037    13
    0.28467679   2    1000035    14
    0.11136749   2    1000022    14
    0.028833481   2    1000025    14
    0.0062483932   2    1000024    13
    0.0016261965   2    1000023    14

DECAY 1000016  22.3791
    0.55328189   2    1000024    15
    0.20213178   2    1000037    15
    0.10462056   2    1000022    16
    0.10146535   2    1000035    16
    0.026890641   2    1000025    16
    0.01009061   2    1000015    24
    0.0015191631   2    1000023    16

DECAY 1000001  92.844393
    0.8053226   2    1000021    1
    0.1266396   2   -1000037    2
    0.063235879   2    1000035    1
    0.0040969332   2    1000022    1
    0.00047216886   2    1000025    1
    0.00019411116   2    1000023    1

DECAY 2000001  182.04883
    0.98766929   2    1000021    1
    0.0090101254   2    1000022    1
    0.0032797324   2    1000025    1

DECAY 1000003  92.860744
    0.80518036   2    1000021    3
    0.12661724   2   -1000037    4
    0.063224729   2    1000035    3
    0.0041230724   2    1000022    3
    0.00052889116   2    1000025    3
    0.00027542222   2    1000023    3

DECAY 2000003  182.08962
    0.98744641   2    1000021    3
    0.0090264081   2    1000022    3
    0.0033178553   2    1000025    3
    0.0001130698   2   -1000024    4

DECAY 1000005  69.055053
    0.4871355   2   -1000024    6
    0.16851279   2    1000023    5
    0.16729682   2    1000006   -24
    0.11734599   2    1000025    5
    0.059701306   2    1000022    5

DECAY 2000005  195.39151
    0.52370865   2    1000021    5
    0.23222262   2   -1000024    6
    0.11518547   2    1000023    5
    0.083021362   2    1000025    5
    0.044663195   2    1000022    5
    0.00045537301   2    1000005    25
    0.00030746488   2    1000006   -24
    0.00023107929   2    1000005    23
    0.0001682909   2    2000006   -24

DECAY 1000002  92.807947
    0.80469964   2    1000021    2
    0.12606497   2    1000037    1
    0.063142502   2    1000035    2
    0.0025979734   2    1000022    2
    0.002257882   2    1000025    2
    0.0011980997   2    1000024    1

DECAY 2000002  280.62282
    0.96089648   2    1000021    2
    0.028562674   2    1000022    2
    0.010412675   2    1000025    2
    0.00012810711   2    1000023    2

DECAY 1000004  92.824204
    0.80455728   2    1000021    4
    0.12604287   2    1000037    3
    0.063131417   2    1000035    4
    0.0025987907   2    1000022    4
    0.0022619612   2    1000025    4
    0.0013629021   2    1000024    3

DECAY 2000004  280.6263
    0.96088436   2    1000021    4
    0.028562992   2    1000022    4
    0.010414997   2    1000025    4
    0.00013127852   2    1000023    4

DECAY 1000006  55.924
    0.43118519   2    1000024    5
    0.26741822   2    1000023    6
    0.25870635   2    1000025    6
    0.041588681   2    1000022    6
    0.0011000899   3    1000022    24    5

DECAY 2000006  104.38323
    0.32643293   2    1000024    5
    0.20833872   2    1000006    23
    0.18280301   2    1000023    6
    0.11666756   2    1000025    6
    0.081746875   2    1000005    24
    0.080629354   2    1000022    6
    0.0019936453   2    1000037    5
    0.0010066553   2    1000006    25
    0.00038125432   2    1000035    6

DECAY 1000024  0.00017223049
    0.33371326   3    1000022   -1    2
    0.3329505   3    1000022   -3    4
    0.1112394   3    1000022   -11    12
    0.11123892   3    1000022   -13    14
    0.11085793   3    1000022   -15    16

DECAY 1000037  16.391381
    0.23700063   2    1000024    25
    0.23315575   2    1000023    24
    0.23099745   2    1000024    23
    0.18907691   2    1000025    24
    0.043475104   2    1000022    24
    0.032780032   2    1000006   -5
    0.012986642   3    1000024    6   -6
    0.0094569888   3    1000023   -5    6
    0.0076650077   3    1000025   -5    6
    0.0021288928   3    1000022   -5    6
    0.0010432201   3    1000024    5   -5

DECAY 1000022 -1


DECAY 1000023  0.00062247875
    0.20342096   3    1000022    12   -12
    0.15210306   3    1000022    1   -1
    0.15209917   3    1000022    3   -3
    0.14500861   3    1000022    5   -5
    0.11862911   3    1000022    2   -2
    0.11797289   3    1000022    4   -4
    0.034323567   3    1000022    11   -11
    0.034322228   3    1000022    13   -13
    0.034038544   3    1000022    15   -15
    0.0080770803   2    1000022    22

DECAY 1000025  1.6737457e-05
    0.13061972   3    1000022    12   -12
    0.098422099   3    1000022    5   -5
    0.09731404   3    1000022    1   -1
    0.09731365   3    1000022    3   -3
    0.076066674   3    1000022    2   -2
    0.075865773   3    1000022    4   -4
    0.040029368   3    1000024    1   -2
    0.040029368   3   -1000024   -1    2
    0.039101159   3    1000024    3   -4
    0.039101159   3   -1000024   -3    4
    0.024366362   2    1000023    22
    0.021758157   3    1000022    15   -15
    0.021739672   3    1000022    13   -13
    0.021739123   3    1000022    11   -11
    0.021320782   3    1000023    12   -12
    0.01594375   3    1000023    1   -1
    0.015936258   3    1000023    3   -3
    0.013342925   3    1000024    11   -12
    0.013342925   3   -1000024   -11    12
    0.013342747   3    1000024    13   -14
    0.013342747   3   -1000024   -13    14
    0.012752146   3    1000024    15   -16
    0.012752146   3   -1000024   -15    16
    0.012434613   3    1000023    2   -2
    0.011287146   3    1000023    4   -4
    0.0059511988   3    1000023    5   -5
    0.0046546408   2    1000022    22
    0.0035981482   3    1000023    11   -11
    0.0035954908   3    1000023    13   -13
    0.0029360087   3    1000023    15   -15

DECAY 1000035  17.015253
    0.22245249   2    1000024   -24
    0.22245249   2   -1000024    24
    0.15191224   2    1000023    23
    0.14323609   2    1000023    25
    0.12553575   2    1000025    25
    0.057527895   2    1000025    23
    0.028231842   2    1000022    25
    0.014705522   2    1000022    23
    0.0073964853   3    1000024    5   -6
    0.0073964853   3   -1000024   -5    6
    0.0042886835   3    1000023    6   -6
    0.0036622035   3    1000025    6   -6
    0.0032811536   2    1000006   -6
    0.0032811536   2   -1000006    6
    0.0017588946   3    1000023    5   -5
    0.0012042437   3    1000025    5   -5
    0.0007966541   3    1000022    6   -6
    0.00062674813   3    1000022    5   -5

DECAY 1000021  15.156679
    0.38861801   2    1000006   -6
    0.38861801   2   -1000006    6
    0.10433785   2    1000005   -5
    0.10433785   2   -1000005    5
    0.0033089901   3    1000023    6   -6
    0.0028597731   3    1000024    5   -6
    0.0028597731   3   -1000024   -5    6
    0.0020733488   3    1000025    6   -6
    0.0014529294   3    1000022    6   -6
    0.00063597577   2    1000023    21
    0.0004876547   2    1000025    21
    0.00012564865   3    1000023    5   -5

DECAY 25  0.0038681455
    0.57318076   2   -5    5
    0.22884944   2   -24    24
    0.07175374   2    21    21
    0.065978097   2   -15    15
    0.028234915   2   -4    4
    0.027696553   2    23    23
    0.0023602827   2    22    22
    0.0015014048   2    22    23
    0.00022876995   2   -13    13
    0.00021529297   2   -3    3
    5.9526308e-07   2   -1    1
    1.4550075e-07   2   -2    2
    5.1430027e-09   2   -11    11

DECAY 35  70.703594
    0.77208166   2   -5    5
    0.16543279   2   -15    15
    0.012070065   2    1000022    1000023
    0.0090729861   2   -1000024    1000037
    0.0090729861   2   -1000037    1000024
    0.0079693859   2    1000022    1000022
    0.0075952692   2    1000023    1000035
    0.0048964855   2    1000023    1000025
    0.0041077345   2    1000025    1000025
    0.0037024593   2    1000022    1000025
    0.00099970361   2   -1000024    1000024
    0.00071624061   2    1000025    1000035
    0.00071605248   2    1000022    1000035
    0.00056093651   2   -13    13
    0.00037128595   2    1000023    1000023
    0.00033420747   2   -3    3
    0.00028443044   2   -6    6
    1.3523541e-05   2    21    21
    9.2409687e-07   2   -1    1
    5.2478059e-07   2    25    25
    2.0084948e-07   2    23    23
    9.7955166e-08   2   -24    24
    2.0341764e-08   2    22    23
    1.2599659e-08   2   -11    11
    1.0168933e-08   2    22    22
    4.4857031e-09   2   -4    4
    2.3124927e-14   2   -2    2

DECAY 36  67.159936
    0.76913119   2   -5    5
    0.16480726   2   -15    15
    0.010924993   2    1000022    1000023
    0.009586974   2   -1000024    1000037
    0.009586974   2   -1000037    1000024
    0.0094000372   2    1000022    1000022
    0.0055026407   2    1000025    1000035
    0.0051148698   2    1000025    1000025
    0.004560755   2    1000022    1000025
    0.0045156976   2    1000023    1000025
    0.002793481   2    1000022    1000035
    0.0013   2    1000023    1000035
    0.0011515202   2   -1000024    1000024
    0.00055881189   2   -13    13
    0.00039020873   2    1000023    1000023
    0.00033292282   2   -3    3
    0.00031737351   2   -6    6
    2.295786e-05   2    21    21
    9.2054608e-07   2   -1    1
    2.8969456e-07   2    23    25
    6.1537169e-08   2    22    22
    3.6170006e-08   2    22    23
    1.2551941e-08   2   -11    11
    4.8105649e-09   2   -4    4
    2.4798255e-14   2   -2    2
    2.6557913e-36   2    25    25

DECAY 37  64.654019
    0.76010315   2   -5    6
    0.17105562   2   -15    16
    0.02540544   2    1000022    1000024
    0.011148956   2    1000024    1000025
    0.010072152   2    1000024    1000035
    0.0097838757   2    1000023    1000037
    0.0065960076   2    1000025    1000037
    0.0037264019   2    1000022    1000037
    0.0011296298   2   -5    4
    0.0006047431   2   -13    14
    0.00033419166   2   -3    4
    1.5588984e-05   2   -3    2
    1.3638884e-05   2    1000023    1000024
    8.0667253e-06   2   -5    2
    1.2200328e-06   2   -3    6
    9.2758304e-07   2   -1    2
    3.0184361e-07   2    24    25
    4.3451046e-08   2   -1    4
    3.3505213e-08   2   -1    6
    1.4145004e-08   2   -11    12
    9.1361135e-13   2    24    35
    6.7748616e-14   2    24    36

DECAY 6  2.43
    1   2    5    24

DECAY 15 -1
