BLOCK SPINFO
   1   SPheno
   2   v4.0.5be

BLOCK SPHENOINFO
   1   2
   2   2

BLOCK MODSEL
   1   0

BLOCK MINPAR
   3    27.906291
   4    1

BLOCK EXTPAR
   0    2308.4928
   1    4459.4481
   2    1414.4584
   3    3921.429
   11   -4752.4453
   12   -198.13123
   13    3985.5846
   23    441.40384
   25    26.944284
   26    4582.856
   31    2340.4943
   32    2340.4943
   33    1520.4346
   34    3651.8325
   35    3651.8325
   36    1009.0567
   41    4902.3696
   42    4902.3696
   43    1322.0769
   44    3672.955
   45    3672.955
   46    3866.0702
   47    4810.4508
   48    4810.4508
   49    829.73013

BLOCK SMINPUTS
   1    127.90897
   2    1.1663787e-05
   3    0.1184
   4    91.1876
   5    4.18
   6    173.2
   7    1.777
   8    0
   11    0.00051099893
   12    0
   13    0.10565837
   14    0
   21    0.005
   22    0.0025
   23    0.095
   24    1.27

BLOCK GAUGE Q=  2308.4928
   1    0.35536298
   2    0.66519887
   3    1.219778

BLOCK YU Q=  2308.4928
   1   1    8.3901446e-06
   2   2    0.0042621934
   3   3    1.0135969

BLOCK YD Q=  2308.4928
   1   1    0.00045427238
   2   2    0.0086311752
   3   3    0.45049585

BLOCK YE Q=  2308.4928
   1   1    7.9273852e-05
   2   2    0.016391318
   3   3    0.27567501

BLOCK AU Q=  2308.4928
   1   1    0
   2   2    0
   3   3   -4752.4452

BLOCK AD Q=  2308.4928
   1   1    0
   2   2    0
   3   3   -198.13124

BLOCK AE Q=  2308.4928
   1   1    0
   2   2    0
   3   3    3985.5846

BLOCK MSOFT Q=  2308.4928
   1    4459.4481
   2    1414.4584
   3    3921.429
   21    20782215
   22   -300537.9
   31    2340.4943
   32    2340.4943
   33    1520.4346
   34    3651.8325
   35    3651.8325
   36    1009.0567
   41    4902.3696
   42    4902.3696
   43    1322.0769
   44    3672.955
   45    3672.955
   46    3866.0702
   47    4810.4508
   48    4810.4508
   49    829.73013

BLOCK MASS
   6    173.2
   23    91.1876
   24    80.429995
   15    1.777
   25    124.95447
   35    4581.7136
   36    4582.856
   37    4582.7437
   1000001    4962.1144
   2000001    4861.8839
   1000002    4961.6086
   2000002    3743.0766
   1000003    4962.1147
   2000003    4861.8846
   1000004    4961.6088
   2000004    3743.0767
   1000005    853.61078
   2000005    1380.1196
   1000006    1371.5618
   2000006    3885.4531
   1000011    2345.8945
   2000011    3662.1847
   1000012    2344.1676
   1000013    2345.8937
   2000013    3662.1796
   1000014    2344.1652
   1000015    1027.9962
   2000015    1530.0944
   1000016    1527.6274
   1000021    4090.6366
   1000022    449.08127
   1000023   -454.81351
   1000025    1465.1188
   1000035    4441.2793
   1000024    451.2285
   1000037    1465.2393

BLOCK ALPHA
      -0.035859858

BLOCK HMIX Q=  2308.4928
   1    441.40384
   2    26.944284
   3    243.53344
   4    21002569

BLOCK STOPMIX
   1   1    0.99863466
   1   2    0.05223799
   2   1   -0.05223799
   2   2    0.99863466

BLOCK SBOTMIX
   1   1    0.022823324
   1   2    0.99973951
   2   1   -0.99973951
   2   2    0.022823324

BLOCK STAUMIX
   1   1    0.011200366
   1   2    0.99993727
   2   1   -0.99993727
   2   2    0.011200366

BLOCK NMIX
   1   1    0.0080839676
   1   2   -0.05798546
   1   3    0.70866941
   1   4   -0.70310739
   2   1    0.0061280407
   2   2   -0.028831563
   2   3   -0.7052325
   2   4   -0.70836312
   3   1    0.00092249883
   3   2    0.99790097
   3   3    0.02080284
   3   4   -0.061319158
   4   1    0.99994812
   4   2   -0.00027514318
   4   3   -0.0014264317
   4   4    0.010081865

BLOCK UMIX
   1   1   -0.029487774
   1   2    0.99956514
   2   1    0.99956514
   2   2    0.029487774

BLOCK VMIX
   1   1   -0.086929056
   1   2    0.9962145
   2   1    0.9962145
   2   2    0.086929056

BLOCK HIGGSBOUNDSINPUTHIGGSCOUPLINGSFERMIONS
       0, 725.99442,3,36,15,15

BLOCK HIGGSBOUNDSINPUTHIGGSCOUPLINGSBOSONS
       0,4,36,21,21,23

BLOCK SPHENOLOWENERGY
   1    0.00030892729
   2    1.5928124e-06
   3    3.5269963e-05
   4    2.6128678e-15
   5    1.1161855e-10
   6    2.3355158e-08
   7    8.7606921e-14
   8    3.7425586e-09
   9    7.9347085e-07
   10    9.6615772e-05
   11    0.99800394
   12    0.54185687
   13    19.359764
   14    0
   15    0
   16    0.0021569186
   17    2.2816543e-15
   18    2.4808409e-11
   19    8.2925967e-11
   20    1.9113273e-15
   21    8.1716523e-11
   22    3.1066232e-08
   23    0
   24    0
   25    0
   26    0
   27    0
   28    0
   29    0
   30    0
   31    0
   39    5.7992686e-05
   40    0
   41    0
   42    0

BLOCK FWCOEF Q=  160
   305   4422   0   0   -0.18881911
   305   4422   0   2   -0.17446417
   305   4322   0   2    0.00010171248
   305   6421   0   0   -0.095227835
   305   6421   0   2   -0.091311657
   305   6321   0   2   -2.5151345e-05
   3051111   4133   0   0    1.6072694
   3051111   4133   0   2    1.6077873
   3051111   4233   0   2    0.00021023345
   3051111   4137   0   0   -4.4299615
   3051111   4137   0   2   -4.4300297
   3051111   4237   0   2   -0.0015998196
   3051313   4133   0   0    1.6072694
   3051313   4133   0   2    1.6077869
   3051313   4233   0   2    0.00021023333
   3051313   4137   0   0   -4.4299615
   3051313   4137   0   2   -4.4300301
   3051313   4237   0   2   -0.00159982
   3051212   4137   0   0    1.5053501
   3051212   4137   0   2    1.505373
   3051212   4237   0   2    0.00034745857
   3051414   4137   0   0    1.5053501
   3051414   4137   0   2    1.505373
   3051414   4237   0   2    0.00034745858
   3051616   4137   0   0    1.5053501
   3051616   4137   0   2    1.5053727
   3051616   4237   0   2    0.0003474596

BLOCK IMFWCOEF Q=  160
   305   4422   0   0    3.858457e-07
   305   4422   0   2    2.1979377e-05
   305   4322   0   2    2.9447508e-06
   305   6421   0   0    3.3050236e-07
   305   6421   0   2   -3.3868461e-06
   305   6321   0   2    1.056122e-06
   3051111   4133   0   2    9.7995117e-08
   3051111   4233   0   2    3.9259463e-06
   3051111   4137   0   2    9.7000374e-07
   3051111   4237   0   2   -2.9876703e-05
   3051313   4133   0   2    9.7976179e-08
   3051313   4233   0   2    3.9259445e-06
   3051313   4137   0   2    9.7001638e-07
   3051313   4237   0   2   -2.9876711e-05
   3051212   4137   0   2   -6.6119376e-08
   3051212   4237   0   2    6.488804e-06
   3051414   4137   0   2   -6.6119631e-08
   3051414   4237   0   2    6.488804e-06
   3051616   4137   0   2   -7.2148588e-08
   3051616   4237   0   2    6.4888058e-06

DECAY 23  2.4952


DECAY 24  2.085


DECAY 1000011  11.554068
    0.66422503   2   -1000037    12
    0.3314043   2    1000025    11
    0.0023887034   2    1000022    11
    0.0014412697   2   -1000024    12
    0.00054069994   2    1000023    11

DECAY 2000011  0.0018484329
    0.63126657   2    1000022    11
    0.36251522   2    1000023    11
    0.0059769748   2    1000025    11
    0.00024002766   2   -1000024    12

DECAY 1000013  11.565676
    0.66355754   2   -1000037    14
    0.33107148   2    1000025    13
    0.0028915591   2    1000022    13
    0.0014398225   2   -1000024    14
    0.0010396025   2    1000023    13

DECAY 2000013  0.039892182
    0.47549328   2   -1000024    14
    0.26831974   2    1000022    13
    0.25337012   2    1000023    13
    0.0020891067   2    1000013    25
    0.0004267479   2    1000025    13
    0.00030100194   2   -1000037    14

DECAY 1000015  2.0258308
    0.50035408   2   -1000024    16
    0.25319774   2    1000022    15
    0.24644818   2    1000023    15

DECAY 2000015  2.1379175
    0.45980417   2    1000022    15
    0.4498049   2    1000023    15
    0.043346425   2   -1000037    16
    0.021710013   2    1000025    15
    0.011205668   2    1000015    23
    0.010886516   2    1000015    25
    0.0032423065   2   -1000024    16

DECAY 1000012  11.606281
    0.65509067   2    1000037    11
    0.32839997   2    1000025    12
    0.012458473   2    1000024    11
    0.0032022435   2    1000022    12
    0.00084864076   2    1000023    12

DECAY 1000014  11.617851
    0.65443634   2    1000037    13
    0.32807173   2    1000025    14
    0.01344509   2    1000024    13
    0.0031990507   2    1000022    14
    0.00084779462   2    1000023    14

DECAY 1000016  2.2104122
    0.90777731   2    1000024    15
    0.038669652   2    1000037    15
    0.021646884   2    1000015    24
    0.019446539   2    1000025    16
    0.0098553796   2    1000022    16
    0.0026042339   2    1000023    16

DECAY 2000001  32.818153
    0.99772418   2    1000021    1
    0.0022662012   2    1000035    1

DECAY 1000001  94.851064
    0.42392762   2    1000021    1
    0.38338709   2   -1000037    2
    0.19099888   2    1000025    1
    0.0007999818   2    1000022    1
    0.00039384872   2   -1000024    2
    0.00028975126   2    1000035    1
    0.00020282875   2    1000023    1

DECAY 2000003  32.832321
    0.997295   2    1000021    3
    0.0022652295   2    1000035    3
    0.0002155168   2   -1000024    4
    0.00011365779   2    1000022    3
    0.00011030231   2    1000023    3

DECAY 1000003  94.860058
    0.4238876   2    1000021    3
    0.38335089   2   -1000037    4
    0.19098081   2    1000025    3
    0.00083809683   2    1000022    3
    0.00041225565   2   -1000024    4
    0.00028972404   2    1000035    3
    0.00024061916   2    1000023    3

DECAY 1000005  3.2505068
    0.45071328   2   -1000024    6
    0.27955165   2    1000022    5
    0.26973507   2    1000023    5

DECAY 2000005  26.14182
    0.81887982   2   -1000024    6
    0.085849607   2    1000022    5
    0.084608807   2    1000023    5
    0.0066663165   2    1000005    25
    0.0039954502   2    1000005    23

DECAY 2000002  0.00084045978
    0.63138068   2    1000022    2
    0.36254427   2    1000023    2
    0.0060690063   2    1000025    2

DECAY 1000002  94.850253
    0.42352142   2    1000021    2
    0.3807707   2    1000037    1
    0.1910994   2    1000025    2
    0.0034226305   2    1000024    1
    0.00072417695   2    1000022    2
    0.00028746623   2    1000035    2
    0.00017421311   2    1000023    2

DECAY 2000004  0.003463586
    0.37643472   2    1000024    3
    0.34074011   2    1000022    4
    0.27818414   2    1000023    4
    0.0025248428   2    1000025    4
    0.0021161883   2    1000037    3

DECAY 1000004  94.859185
    0.42348108   2    1000021    4
    0.38073493   2    1000037    3
    0.19108148   2    1000025    4
    0.0034982654   2    1000024    3
    0.00073329277   2    1000022    4
    0.00028743756   2    1000035    4
    0.00018351898   2    1000023    4

DECAY 1000006  26.003635
    0.40686661   2    1000023    6
    0.40334267   2    1000022    6
    0.17873578   2    1000024    5
    0.0077600117   2    1000005    24
    0.0030140366   3    1000022    24    5
    0.00022667155   2    1000022    4

DECAY 2000006  314.35502
    0.24201528   2    1000024    5
    0.23060994   2    2000005    24
    0.16418598   2    1000006    25
    0.1226693   2    1000023    6
    0.12068342   2    1000022    6
    0.11560623   2    1000006    23
    0.0027199807   2    1000037    5
    0.0013545296   2    1000025    6
    0.00015534726   2    1000005    24

DECAY 1000024  3.9320995e-11
    0.54689843   3    1000022   -1    2
    0.18230688   3    1000022   -11    12
    0.18012775   3    1000022   -13    14
    0.088608946   3    1000022   -3    4
    0.0020579996   3    1000022   -15    16

DECAY 1000037  13.775955
    0.24336421   2    1000023    24
    0.23976903   2    1000024    23
    0.23899204   2    1000022    24
    0.23470806   2    1000024    25
    0.020952023   2    1000006   -5
    0.0094721606   3    1000024    6   -6
    0.0065393301   3    1000022   -5    6
    0.0061143413   3    1000023   -5    6

DECAY 1000022 -1


DECAY 1000023  5.8357076e-08
    0.65906852   2    1000022    22
    0.073563037   3    1000022    12   -12
    0.0550087   3    1000022    1   -1
    0.054832975   3    1000022    3   -3
    0.042901884   3    1000022    2   -2
    0.021758608   3    1000022    4   -4
    0.014187612   3    1000024    1   -2
    0.014187612   3   -1000024   -1    2
    0.012413868   3    1000022    11   -11
    0.012351535   3    1000022    13   -13
    0.0077477791   3    1000024    3   -4
    0.0077477791   3   -1000024   -3    4
    0.0047292447   3    1000024    11   -12
    0.0047292447   3   -1000024   -11    12
    0.0047088349   3    1000024    13   -14
    0.0047088349   3   -1000024   -13    14
    0.0025168276   3    1000022    15   -15
    0.0014185507   3    1000024    15   -16
    0.0014185507   3   -1000024   -15    16

DECAY 1000025  15.351828
    0.21755951   2    1000024   -24
    0.21755951   2   -1000024    24
    0.17514733   2    1000023    23
    0.16711823   2    1000022    25
    0.14810055   2    1000023    25
    0.042084505   2    1000022    23
    0.0079429892   2    2000005   -5
    0.0079429892   2   -2000005    5
    0.0060229146   3    1000024    5   -6
    0.0060229146   3   -1000024   -5    6
    0.0022869032   3    1000022    6   -6
    0.0021211412   3    1000023    6   -6

DECAY 1000035  74.373272
    0.13435177   2    1000015   -15
    0.13435177   2   -1000015    15
    0.04634908   2    1000005   -5
    0.04634908   2   -1000005    5
    0.039695684   2    1000024   -24
    0.039695684   2   -1000024    24
    0.029183708   2    1000016   -16
    0.029183708   2   -1000016    16
    0.029111709   2    2000015   -15
    0.029111709   2   -2000015    15
    0.025779924   2    1000023    23
    0.023768409   2    1000022    25
    0.020968283   2    1000023    25
    0.019537828   2    1000014   -14
    0.019537828   2   -1000014    14
    0.019537798   2    1000012   -12
    0.019537798   2   -1000012    12
    0.019475407   2    1000013   -13
    0.019475407   2   -1000013    13
    0.019475397   2    1000011   -11
    0.019475397   2   -1000011    11
    0.016786455   2    2000002   -2
    0.016786455   2   -2000002    2
    0.016786422   2    2000004   -4
    0.016786422   2   -2000004    4
    0.015367925   2    2000013   -13
    0.015367925   2   -2000013    13
    0.015367742   2    2000011   -11
    0.015367742   2   -2000011    11
    0.014356737   2    1000022    23
    0.010415781   2    2000006   -6
    0.010415781   2   -2000006    6
    0.010259672   2    2000005   -5
    0.010259672   2   -2000005    5
    0.010221162   2    1000006   -6
    0.010221162   2   -1000006    6
    0.0026008449   3    1000024    5   -6
    0.0026008449   3   -1000024   -5    6
    0.0021277563   3    1000022    6   -6
    0.0020847514   3    1000023    6   -6
    0.00050557   2    1000037   -24
    0.00050557   2   -1000037    24
    0.00038687735   2    1000025    25

DECAY 1000021  344.6784
    0.16066648   2    1000005   -5
    0.16066648   2   -1000005    5
    0.13794931   2    2000005   -5
    0.13794931   2   -2000005    5
    0.13692771   2    1000006   -6
    0.13692771   2   -1000006    6
    0.053010372   2    1000006   -4
    0.053010372   2   -1000006    4
    0.0046501808   2    2000002   -2
    0.0046501808   2   -2000002    2
    0.0046501514   2    2000004   -4
    0.0046501514   2   -2000004    4
    0.00099844699   2    2000006   -6
    0.00099844699   2   -2000006    6
    0.00065041536   3    1000037    5   -6
    0.00065041536   3   -1000037   -5    6
    0.0003487146   3    1000025    5   -5
    0.00030487722   3    1000025    6   -6

DECAY 25  0.0038662125
    0.57299269   2   -5    5
    0.22815953   2   -24    24
    0.072661638   2    21    21
    0.065924877   2   -15    15
    0.028375355   2   -4    4
    0.027594767   2    23    23
    0.0023499399   2    22    22
    0.0014966791   2    22    23
    0.00022861356   2   -13    13
    0.0002151606   2   -3    3
    5.9489671e-07   2   -1    1
    1.4622492e-07   2   -2    2
    5.139487e-09   2   -11    11

DECAY 35  90.719022
    0.36596443   2   -5    5
    0.16454256   2   -1000024    1000037
    0.16454256   2   -1000037    1000024
    0.093550347   2    1000023    1000025
    0.082727838   2   -15    15
    0.071287232   2    1000022    1000025
    0.024834183   2   -2000015    1000015
    0.024834183   2   -1000015    2000015
    0.0030493025   2   -1000024    1000024
    0.0023410992   2   -6    6
    0.00074866353   2    1000022    1000022
    0.00028070206   2   -13    13
    0.00023570843   2   -2000005    1000005
    0.00023570843   2   -1000005    2000005
    0.00022321853   2    1000023    1000023
    0.00015060474   2   -3    3
    0.00014941746   2   -1000037    1000037
    0.00012094826   2    1000022    1000023
    7.6408235e-05   2   -1000006    1000006
    7.469368e-05   2    1000025    1000025
    1.3545482e-05   2   -1000015    1000015
    1.2549222e-05   2   -2000015    2000015
    1.3414514e-06   2    25    25
    1.2684184e-06   2    21    21
    4.1636476e-07   2   -1    1
    3.1963257e-07   2   -1000005    1000005
    2.3543992e-07   2    23    23
    1.8100109e-07   2   -2000005    2000005
    4.270197e-08   2   -24    24
    3.6011639e-08   2    22    23
    3.3617187e-08   2   -4    4
    1.4920692e-08   2    22    22
    6.3035965e-09   2   -11    11
    1.7330405e-13   2   -2    2

DECAY 36  88.461969
    0.35466334   2   -5    5
    0.16854581   2   -1000024    1000037
    0.16854581   2   -1000037    1000024
    0.096209078   2    1000022    1000025
    0.080176457   2   -15    15
    0.072701543   2    1000023    1000025
    0.025477702   2   -2000015    1000015
    0.025477702   2   -1000015    2000015
    0.003410511   2   -1000024    1000024
    0.0021132819   2   -6    6
    0.00091897655   2    1000022    1000022
    0.00037928177   2   -1000037    1000037
    0.00027204343   2   -13    13
    0.00024190001   2   -2000005    1000005
    0.00024190001   2   -1000005    2000005
    0.00020595332   2    1000023    1000023
    0.00018928872   2    1000025    1000025
    0.00014595385   2   -3    3
    7.6325925e-05   2    1000022    1000023
    5.9979869e-06   2    21    21
    5.9729693e-07   2    23    25
    4.0350594e-07   2   -1    1
    6.154266e-08   2    22    23
    4.4173764e-08   2    22    22
    3.0287432e-08   2   -4    4
    6.1091413e-09   2   -11    11
    1.5614383e-13   2   -2    2
    2.4167155e-14   2    23    35
    7.744623e-40   2    25    25

DECAY 37  92.935026
    0.38708758   2   -5    6
    0.16311881   2    1000022    1000037
    0.16158917   2    1000024    1000025
    0.1606818   2    1000023    1000037
    0.076797266   2   -15    16
    0.048515971   2   -1000015    1000016
    0.00063102265   2    1000023    1000024
    0.00057108609   2   -5    4
    0.00043959627   2   -1000005    1000006
    0.00027150564   2   -13    14
    0.00013585729   2   -3    4
    0.00012085388   2    1000022    1000024
    1.6497642e-05   2   -2000005    1000006
    7.7809698e-06   2   -2000015    1000016
    6.3915572e-06   2   -3    2
    4.078143e-06   2   -5    2
    3.6110082e-06   2   -3    6
    5.6865746e-07   2    24    25
    3.7682301e-07   2   -1    2
    1.5631505e-07   2   -1    6
    1.9103355e-08   2   -1    4
    6.3505453e-09   2   -11    12
    8.3288779e-11   2    1000025    1000037
    1.6991426e-14   2    24    35

DECAY 6  2.43
    1   2    5    24

DECAY 15 -1
