BLOCK SPINFO
   1   SPheno
   2   v4.0.5be

BLOCK SPHENOINFO
   1   2
   2   2

BLOCK MODSEL
   1   0

BLOCK MINPAR
   3    39.384197
   4    1

BLOCK EXTPAR
   0    1580.8786
   1   -24.022866
   2    698.3992
   3    3000
   11    4123.1335
   12   -773.85044
   13   -1332.0719
   23    205.24589
   25    38.30136
   26    426.38187
   31    1103.6544
   32    1103.6544
   33    1522.5627
   34    577.38394
   35    577.38394
   36    1173.3811
   41    5000
   42    5000
   43    1402.8013
   44    5000
   45    5000
   46    1932.4517
   47    5000
   48    5000
   49    1119.4303

BLOCK SMINPUTS
   1    127.90897
   2    1.1663787e-05
   3    0.1184
   4    91.1876
   5    4.18
   6    173.2
   7    1.777
   8    0
   11    0.00051099893
   12    0
   13    0.10565837
   14    0
   21    0.005
   22    0.0025
   23    0.095
   24    1.27

BLOCK GAUGE Q=  1580.8786
   1    0.35536298
   2    0.66519887
   3    1.219778

BLOCK YU Q=  1580.8786
   1   1    8.3872293e-06
   2   2    0.0042607125
   3   3    1.0132447

BLOCK YD Q=  1580.8786
   1   1    0.00064552485
   2   2    0.012264972
   3   3    0.64015837

BLOCK YE Q=  1580.8786
   1   1    0.00011264881
   2   2    0.0232922
   3   3    0.39173649

BLOCK AU Q=  1580.8786
   1   1    0
   2   2    0
   3   3    4123.1335

BLOCK AD Q=  1580.8786
   1   1    0
   2   2    0
   3   3   -773.85043

BLOCK AE Q=  1580.8786
   1   1    0
   2   2    0
   3   3   -1332.0719

BLOCK MSOFT Q=  1580.8786
   1   -24.022866
   2    698.3992
   3    3000
   21    161075.93
   22    21338.242
   31    1103.6544
   32    1103.6544
   33    1522.5627
   34    577.38394
   35    577.38394
   36    1173.3811
   41    5000
   42    5000
   43    1402.8013
   44    5000
   45    5000
   46    1932.4517
   47    5000
   48    5000
   49    1119.4303

BLOCK MASS
   6    173.2
   23    91.1876
   24    80.429995
   15    1.777
   25    126.27688
   35    426.42192
   36    426.38187
   37    436.39417
   1000001    5033.9613
   2000001    5023.5622
   1000002    5033.5254
   2000002    5024.7161
   1000003    5033.9643
   2000003    5023.5671
   1000004    5033.5283
   2000004    5024.7168
   1000005    1129.3358
   2000005    1387.8635
   1000006    1312.7915
   2000006    1903.7121
   1000011    1109.528
   2000011    582.16489
   1000012    1106.3736
   1000013    1109.5199
   2000013    582.1384
   1000014    1106.3651
   1000015    1168.5178
   2000015    1523.2766
   1000016    1520.8183
   1000021    3197.946
   1000022   -23.368894
   1000023    206.38467
   1000025   -215.67848
   1000035    739.67971
   1000024    205.02634
   1000037    739.87027

BLOCK ALPHA
      -0.028999924

BLOCK HMIX Q=  1580.8786
   1    205.24589
   2    38.30136
   3    243.90641
   4    181801.5

BLOCK STOPMIX
   1   1   -0.94364113
   1   2    0.33097042
   2   1   -0.33097042
   2   2   -0.94364113

BLOCK SBOTMIX
   1   1    0.028162979
   1   2    0.99960335
   2   1   -0.99960335
   2   2    0.028162979

BLOCK STAUMIX
   1   1    0.017274152
   1   2    0.99985079
   2   1   -0.99985079
   2   2    0.017274152

BLOCK NMIX
   1   1    0.97780654
   1   2    0.0016142433
   1   3    0.20871142
   1   4    0.018202054
   2   1   -0.13604735
   2   2   -0.10904691
   2   3    0.69872961
   2   4   -0.69381325
   3   1   -0.15917136
   3   2    0.059052295
   3   3    0.68332727
   3   4    0.71009939
   4   1    0.0070691032
   4   2   -0.99227969
   4   3   -0.035781597
   4   4    0.11853571

BLOCK UMIX
   1   1   -0.050627722
   1   2    0.9987176
   2   1    0.9987176
   2   2    0.050627722

BLOCK VMIX
   1   1   -0.16784313
   1   2    0.98581372
   2   1    0.98581372
   2   2    0.16784313

BLOCK HIGGSBOUNDSINPUTHIGGSCOUPLINGSFERMIONS
       0, 1466.9942,3,36,15,15

BLOCK HIGGSBOUNDSINPUTHIGGSCOUPLINGSBOSONS
       0,4,36,21,21,23

BLOCK SPHENOLOWENERGY
   1    0.00046406714
   2    1.5950915e-06
   3    3.5212641e-05
   4    1.7790324e-15
   5    7.599116e-11
   6    1.5494115e-08
   7    5.873613e-14
   8    2.5089476e-09
   9    5.1689888e-07
   10    5.21078e-05
   11    0.53825362
   12    0.54264691
   13    19.227686
   14    0
   15    0
   16    0.002162132
   17    2.2817589e-15
   18    2.4781274e-11
   19    8.2855392e-11
   20    9.8130176e-15
   21    4.1951571e-10
   22    9.1594336e-08
   23    0
   24    0
   25    0
   26    0
   27    0
   28    0
   29    0
   30    0
   31    0
   39    8.5563245e-05
   40    0
   41    0
   42    0

BLOCK FWCOEF Q=  160
   305   4422   0   0   -0.18881911
   305   4422   0   2   -0.33036987
   305   4322   0   2   -0.0021213809
   305   6421   0   0   -0.095227835
   305   6421   0   2   -0.21836963
   305   6321   0   2   -0.0020683295
   3051111   4133   0   0    1.5941387
   3051111   4133   0   2    1.5949598
   3051111   4233   0   2   -0.00023472006
   3051111   4137   0   0   -4.4168308
   3051111   4137   0   2   -4.4110965
   3051111   4237   0   2    0.0018285374
   3051313   4133   0   0    1.5941387
   3051313   4133   0   2    1.5949569
   3051313   4233   0   2   -0.00023490258
   3051313   4137   0   0   -4.4168308
   3051313   4137   0   2   -4.4110994
   3051313   4237   0   2    0.0018287152
   3051212   4137   0   0    1.5053501
   3051212   4137   0   2    1.5041196
   3051212   4237   0   2   -0.00039833595
   3051414   4137   0   0    1.5053501
   3051414   4137   0   2    1.5041196
   3051414   4237   0   2   -0.00039829645
   3051616   4137   0   0    1.5053501
   3051616   4137   0   2    1.5041193
   3051616   4237   0   2   -0.00038716408

BLOCK IMFWCOEF Q=  160
   305   4422   0   0    3.8578052e-07
   305   4422   0   2    3.5213379e-05
   305   4322   0   2   -4.2181235e-06
   305   6421   0   0    3.3044653e-07
   305   6421   0   2   -4.406488e-06
   305   6321   0   2   -1.9362895e-06
   3051111   4133   0   2   -1.5320662e-06
   3051111   4233   0   2    5.3308012e-06
   3051111   4137   0   2    1.2521996e-05
   3051111   4237   0   2   -4.1348039e-05
   3051313   4133   0   2   -1.5320445e-06
   3051313   4233   0   2    5.3307771e-06
   3051313   4137   0   2    1.252203e-05
   3051313   4237   0   2   -4.1348103e-05
   3051212   4137   0   2   -2.3815832e-06
   3051212   4237   0   2    9.006477e-06
   3051414   4137   0   2   -2.3815831e-06
   3051414   4237   0   2    9.006477e-06
   3051616   4137   0   2   -2.3878033e-06
   3051616   4237   0   2    9.0064912e-06

DECAY 23  2.4952


DECAY 24  2.085


DECAY 2000011  2.8843128
    0.96652549   2    1000022    11
    0.019125173   2    1000025    11
    0.014349299   2    1000023    11

DECAY 1000011  5.9936535
    0.50127103   2   -1000037    12
    0.24573755   2    1000035    11
    0.22350727   2    1000022    11
    0.025078397   2    1000023    11
    0.0038965417   2   -1000024    12
    0.00050921273   2    1000025    11

DECAY 2000013  2.8937933
    0.96340882   2    1000022    13
    0.019816869   2    1000025    13
    0.01511257   2    1000023    13
    0.0016617376   2   -1000024    14

DECAY 1000013  6.0048
    0.50032525   2   -1000037    14
    0.24527489   2    1000035    13
    0.22317758   2    1000022    13
    0.02593871   2    1000023    13
    0.0038892764   2   -1000024    14
    0.0013703516   2    1000025    13

DECAY 1000015  12.552133
    0.46040945   2    1000022    15
    0.26700675   2   -1000024    16
    0.13867637   2    1000023    15
    0.13382986   2    1000025    15

DECAY 2000015  18.240876
    0.42840488   2   -1000037    16
    0.21012232   2    1000035    15
    0.13135721   2    1000023    15
    0.11555765   2    1000025    15
    0.11091238   2    1000022    15
    0.0012503233   2    1000015    25
    0.0012350013   2    1000015    23
    0.0011602401   2   -1000024    16

DECAY 1000012  6.0447805
    0.4784878   2    1000037    11
    0.24444471   2    1000035    12
    0.21827084   2    1000022    12
    0.042326209   2    1000024    11
    0.015477811   2    1000025    12
    0.00099263721   2    1000023    12

DECAY 1000014  6.0557392
    0.47760828   2    1000037    13
    0.24399442   2    1000035    14
    0.21787417   2    1000022    14
    0.04408262   2    1000024    13
    0.015449665   2    1000025    14
    0.00099083219   2    1000023    14

DECAY 1000016  18.287843
    0.41494284   2    1000037    15
    0.26394568   2    1000024    15
    0.21166098   2    1000035    16
    0.099213735   2    1000022    16
    0.0072963862   2    1000025    16
    0.0024739334   2    1000015    24
    0.00046644696   2    1000023    16

DECAY 2000001  143.06841
    0.98039999   2    1000021    1
    0.018742063   2    1000022    1
    0.00049496696   2    1000025    1
    0.00036175376   2    1000023    1

DECAY 1000001  205.69542
    0.68716298   2    1000021    1
    0.20570036   2   -1000037    2
    0.10178855   2    1000035    1
    0.0032054244   2    1000022    1
    0.00081984294   2    1000025    1
    0.00077247444   2    1000023    1
    0.00055036802   2   -1000024    2

DECAY 2000003  143.0988
    0.98019531   2    1000021    3
    0.018742664   2    1000022    3
    0.000543604   2    1000025    3
    0.00041265664   2    1000023    3
    0.00010444239   2   -1000024    4

DECAY 1000003  205.71256
    0.68710726   2    1000021    3
    0.20568359   2   -1000037    4
    0.10178023   2    1000035    3
    0.0032083403   2    1000022    3
    0.00085375221   2    1000025    3
    0.00080794503   2    1000023    3
    0.00055887959   2   -1000024    4

DECAY 1000005  17.388877
    0.46878712   2   -1000024    6
    0.24268645   2    1000023    5
    0.2283985   2    1000025    5
    0.060029522   2    1000022    5

DECAY 2000005  46.523815
    0.54728242   2   -1000024    6
    0.14686372   2   -1000037    6
    0.11418883   2    1000023    5
    0.11006532   2    1000025    5
    0.06675546   2    1000035    5
    0.013408505   2    1000022    5
    0.00094720203   2    1000005    25
    0.00048854376   2    1000005    23

DECAY 2000002  151.60312
    0.92599878   2    1000021    2
    0.070764014   2    1000022    2
    0.0018683293   2    1000025    2
    0.0013653342   2    1000023    2

DECAY 1000002  205.69322
    0.68694977   2    1000021    2
    0.20040247   2    1000037    1
    0.10126488   2    1000035    2
    0.0060487378   2    1000024    1
    0.0033262649   2    1000022    2
    0.0019066923   2    1000023    2
    0.00010119635   2    1000025    2

DECAY 2000004  151.60674
    0.92597671   2    1000021    4
    0.070762327   2    1000022    4
    0.001874293   2    1000025    4
    0.0013710482   2    1000023    4

DECAY 1000004  205.71029
    0.68689397   2    1000021    4
    0.20038615   2    1000037    3
    0.10125666   2    1000035    4
    0.0061208316   2    1000024    3
    0.0033259933   2    1000022    4
    0.0019107704   2    1000023    4
    0.00010562666   2    1000025    4

DECAY 1000006  43.38452
    0.27624711   2    1000023    6
    0.27522552   2    1000025    6
    0.23778105   2    1000024    5
    0.1280681   2    1000037    5
    0.069442394   2    1000035    6
    0.012148114   2    1000022    6
    0.00040790744   3    1000022    24    5
    0.00031912157   2    1000005    24
    0.00023308322   2    1000022    4
    0.00012758972   2    1000023    4

DECAY 2000006  190.26683
    0.26741797   2    2000005    24
    0.19524655   2    1000024    5
    0.16721586   2    1000006    23
    0.14851938   2    1000006    25
    0.10342711   2    1000025    6
    0.09532341   2    1000023    6
    0.01837595   2    1000022    6
    0.0012408542   2    2000005    37
    0.00099279251   2    1000006    36
    0.00065067829   2    1000006    35
    0.00057346327   2    1000005    24
    0.00047574418   2    1000037    5
    0.00046860009   2    1000035    6

DECAY 1000024  0.11695634
    0.99999337   2    1000022    24

DECAY 1000037  8.6549617
    0.1890207   2    1000023    24
    0.18886191   2    1000025    24
    0.18426618   2    1000024    23
    0.17336088   2    1000024    25
    0.065733174   2    1000024    36
    0.063817609   2    1000024    35
    0.061566618   2    37    1000023
    0.060871171   2    37    1000025
    0.0057566353   2    37    1000022
    0.0026293585   2    1000022    24
    0.0017076782   3    1000023   -5    6
    0.001553243   3    1000025   -5    6
    0.00078617363   3    1000024    6   -6

DECAY 1000022 -1


DECAY 1000023  0.10481697
    0.69155152   2    1000022    23
    0.30838001   2    1000022    25

DECAY 1000025  0.089889247
    0.62147147   2    1000022    23
    0.37839934   2    1000022    25

DECAY 1000035  9.4259172
    0.1738974   2    1000024   -24
    0.1738974   2   -1000024    24
    0.13599326   2    1000025    23
    0.12302112   2    1000023    25
    0.11186214   2    1000025    25
    0.055982294   2    37   -1000024
    0.055982294   2   -37    1000024
    0.054642352   2    1000025    35
    0.050624982   2    1000023    35
    0.038592474   2    1000023    23
    0.0081258568   2    1000023    36
    0.0062109192   2    1000025    36
    0.0030850099   2    1000022    35
    0.0024372287   2    1000022    36
    0.0014435006   3    1000024    5   -6
    0.0014435006   3   -1000024   -5    6
    0.0013521831   2    1000022    23
    0.00095793557   2    1000022    25
    0.0002123697   3    1000023    6   -6
    0.00017981552   3    1000025    6   -6

DECAY 1000021  244.44863
    0.1483116   2    1000005   -5
    0.1483116   2   -1000005    5
    0.14450358   2    1000006   -6
    0.14450358   2   -1000006    6
    0.12757565   2    2000005   -5
    0.12757565   2   -2000005    5
    0.071920757   2    2000006   -6
    0.071920757   2   -2000006    6
    0.0075901915   2    1000006   -4
    0.0075901915   2   -1000006    4

DECAY 25  0.0047791138
    0.59803944   2   -5    5
    0.2118219   2   -24    24
    0.070662938   2   -15    15
    0.058891054   2    21    21
    0.026288748   2    23    23
    0.023180671   2   -4    4
    0.0072783805   2    1000022    1000022
    0.0019988926   2    22    22
    0.0013628546   2    22    23
    0.00024569738   2   -13    13
    0.00022866739   2   -3    3
    6.3223974e-07   2   -1    1
    1.194523e-07   2   -2    2
    5.5235337e-09   2   -11    11

DECAY 35  10.043692
    0.82595331   2   -5    5
    0.14314436   2   -15    15
    0.014577111   2    1000022    1000023
    0.010158026   2    1000022    1000025
    0.0039945898   2    1000022    1000022
    0.00050310319   2   -13    13
    0.00036477303   2   -3    3
    0.00035723696   2   -6    6
    0.00035276175   2   -1000024    1000024
    0.00018971988   2    21    21
    0.00017936975   2    1000023    1000025
    0.00017488977   2    25    25
    2.7664655e-05   2   -24    24
    1.2777699e-05   2    23    23
    8.8012676e-06   2    1000023    1000023
    1.0085418e-06   2   -1    1
    2.9625219e-07   2    22    22
    1.6340473e-07   2    22    23
    1.9964113e-08   2   -4    4
    1.1306147e-08   2   -11    11
    1.0297478e-13   2   -2    2

DECAY 36  9.963718
    0.82305592   2   -5    5
    0.14262853   2   -15    15
    0.014247409   2    1000022    1000023
    0.010498802   2    1000022    1000025
    0.0040370311   2    1000022    1000022
    0.0035384006   2   -1000024    1000024
    0.0007916777   2   -6    6
    0.00050126149   2   -13    13
    0.00036343286   2   -3    3
    0.00020195756   2    21    21
    0.00010273029   2    1000023    1000023
    2.1011754e-05   2    23    25
    1.0448959e-05   2    1000023    1000025
    1.0048363e-06   2   -1    1
    2.2618943e-07   2    22    22
    1.297585e-07   2    22    23
    1.4699742e-08   2   -4    4
    1.1264756e-08   2   -11    11
    7.5779774e-14   2   -2    2
    6.9102949e-36   2    25    25

DECAY 37  7.3124468
    0.76763059   2   -5    6
    0.18511488   2   -15    16
    0.043565792   2    1000022    1000024
    0.0015504785   2   -5    4
    0.00091858231   2    1000023    1000024
    0.00065446836   2   -13    14
    0.0004491842   2   -3    4
    4.7870404e-05   2    1000024    1000025
    3.2739693e-05   2    24    25
    2.0490808e-05   2   -3    2
    1.1072201e-05   2   -5    2
    2.4087075e-06   2   -3    6
    1.2465227e-06   2   -1    2
    8.9264166e-08   2   -1    6
    5.7840045e-08   2   -1    4
    1.8264282e-08   2    24    36
    1.7902931e-08   2    24    35
    1.5308085e-08   2   -11    12

DECAY 6  2.43
    1   2    5    24

DECAY 15 -1
