BLOCK SPINFO
   1   SPheno
   2   v4.0.5be

BLOCK SPHENOINFO
   1   2
   2   2

BLOCK MODSEL
   1   0

BLOCK MINPAR
   3    16.208804
   4    1

BLOCK EXTPAR
   0    1866.4445
   1   -321.99754
   2    936.40683
   3    3000
   11   -2251.7778
   12   -708.64841
   13    1069.1928
   23    337.83918
   25    15.576445
   26    3701.4326
   31    1454.7306
   32    1454.7306
   33    725.67637
   34    1641.5277
   35    1641.5277
   36    1263.6015
   41    5000
   42    5000
   43    1781.7294
   44    5000
   45    5000
   46    1895.1466
   47    5000
   48    5000
   49    773.16433

BLOCK SMINPUTS
   1    127.90897
   2    1.1663787e-05
   3    0.1184
   4    91.1876
   5    4.18
   6    173.2
   7    1.777
   8    0
   11    0.00051099893
   12    0
   13    0.10565837
   14    0
   21    0.005
   22    0.0025
   23    0.095
   24    1.27

BLOCK GAUGE Q=  1866.4445
   1    0.35536298
   2    0.66519887
   3    1.219778

BLOCK YU Q=  1866.4445
   1   1    8.4016328e-06
   2   2    0.0042680295
   3   3    1.0149847

BLOCK YD Q=  1866.4445
   1   1    0.00026297369
   2   2    0.0049965001
   3   3    0.26078749

BLOCK YE Q=  1866.4445
   1   1    4.5890832e-05
   2   2    0.0094887685
   3   3    0.15958548

BLOCK AU Q=  1866.4445
   1   1    0
   2   2    0
   3   3   -2251.7778

BLOCK AD Q=  1866.4445
   1   1    0
   2   2    0
   3   3   -708.64842

BLOCK AE Q=  1866.4445
   1   1    0
   2   2    0
   3   3    1069.1928

BLOCK MSOFT Q=  1866.4445
   1   -321.99754
   2    936.40683
   3    3000
   21    13494248
   22    1749.8011
   31    1454.7306
   32    1454.7306
   33    725.67637
   34    1641.5277
   35    1641.5277
   36    1263.6015
   41    5000
   42    5000
   43    1781.7294
   44    5000
   45    5000
   46    1895.1466
   47    5000
   48    5000
   49    773.16433

BLOCK MASS
   6    173.2
   23    91.1876
   24    80.429995
   15    1.777
   25    120.61932
   35    3700.8943
   36    3701.4326
   37    3702.0319
   1000001    5041.3309
   2000001    5030.8658
   1000002    5040.8664
   2000002    5032.8708
   1000003    5041.3315
   2000003    5030.8665
   1000004    5040.867
   2000004    5032.8713
   1000005    818.53511
   2000005    1827.3596
   1000006    1772.3674
   2000006    1965.5153
   1000011    1463.3295
   2000011    1642.1981
   1000012    1460.7797
   1000013    1463.3286
   2000013    1642.1969
   1000014    1460.7791
   1000015    743.36429
   2000015    1263.8618
   1000016    738.853
   1000021    3213.3333
   1000022   -302.51651
   1000023    338.30733
   1000025   -364.64329
   1000035    985.50394
   1000024    338.77981
   1000037    985.65201

BLOCK ALPHA
      -0.061716495

BLOCK HMIX Q=  1866.4445
   1    337.83918
   2    15.576445
   3    243.79279
   4    13700603

BLOCK STOPMIX
   1   1    0.84592776
   1   2    0.5332975
   2   1   -0.5332975
   2   2    0.84592776

BLOCK SBOTMIX
   1   1    0.0052465992
   1   2    0.99998624
   2   1   -0.99998624
   2   2    0.0052465992

BLOCK STAUMIX
   1   1    0.99997358
   1   2    0.0072693587
   2   1   -0.0072693587
   2   2    0.99997358

BLOCK NMIX
   1   1    0.82083016
   1   2    0.021868364
   1   3    0.43092406
   1   4    0.37425136
   2   1   -0.04970569
   2   2   -0.093328531
   2   3    0.70684932
   2   4   -0.69941631
   3   1   -0.56899555
   3   2    0.033834521
   3   3    0.55967783
   3   4    0.60154801
   4   1    0.0033548574
   4   2   -0.99481998
   4   3   -0.037805004
   4   4    0.094301334

BLOCK UMIX
   1   1   -0.0535774
   1   2    0.9985637
   2   1    0.9985637
   2   2    0.0535774

BLOCK VMIX
   1   1   -0.13363256
   1   2    0.99103095
   2   1    0.99103095
   2   2    0.13363256

BLOCK HIGGSBOUNDSINPUTHIGGSCOUPLINGSFERMIONS
       0, 242.62565,3,36,15,15

BLOCK HIGGSBOUNDSINPUTHIGGSCOUPLINGSBOSONS
       0,4,36,21,21,23

BLOCK SPHENOLOWENERGY
   1    0.00031075797
   2    1.5912621e-06
   3    3.5239241e-05
   4    2.5826878e-15
   5    1.1032948e-10
   6    2.3096381e-08
   7    8.6953948e-14
   8    3.7146695e-09
   9    7.8791411e-07
   10    9.6701401e-05
   11    0.99888845
   12    0.54266487
   13    19.389314
   14    0
   15    0
   16    0.0021600559
   17    2.2816862e-15
   18    2.4784203e-11
   19    8.2869067e-11
   20    2.7700122e-15
   21    1.1842705e-10
   22    4.1721968e-08
   23    0
   24    0
   25    0
   26    0
   27    0
   28    0
   29    0
   30    0
   31    0
   39    3.9709266e-05
   40    0
   41    0
   42    0

BLOCK FWCOEF Q=  160
   305   4422   0   0   -0.18881911
   305   4422   0   2   -0.17621815
   305   4322   0   2    3.1161035e-05
   305   6421   0   0   -0.095227835
   305   6421   0   2   -0.094023834
   305   6321   0   2   -7.9674096e-05
   3051111   4133   0   0    1.5995382
   3051111   4133   0   2    1.6007512
   3051111   4233   0   2    4.1552348e-05
   3051111   4137   0   0   -4.4222303
   3051111   4137   0   2   -4.4192208
   3051111   4237   0   2   -0.00031840035
   3051313   4133   0   0    1.5995382
   3051313   4133   0   2    1.6007508
   3051313   4233   0   2    4.155232e-05
   3051313   4137   0   0   -4.4222303
   3051313   4137   0   2   -4.4192212
   3051313   4237   0   2   -0.00031840041
   3051212   4137   0   0    1.5053501
   3051212   4137   0   2    1.5047061
   3051212   4237   0   2    6.9263269e-05
   3051414   4137   0   0    1.5053501
   3051414   4137   0   2    1.5047061
   3051414   4237   0   2    6.926327e-05
   3051616   4137   0   0    1.5053501
   3051616   4137   0   2    1.5047062
   3051616   4237   0   2    6.9262604e-05

BLOCK IMFWCOEF Q=  160
   305   4422   0   0    3.8583235e-07
   305   4422   0   2    1.0790089e-05
   305   4322   0   2    2.1370709e-06
   305   6421   0   0    3.3049092e-07
   305   6421   0   2   -1.7653373e-06
   305   6321   0   2    6.6852808e-07
   3051111   4133   0   2    5.4870242e-08
   3051111   4233   0   2    8.2348063e-07
   3051111   4137   0   2    5.6036166e-07
   3051111   4237   0   2   -6.3134606e-06
   3051313   4133   0   2    5.4862155e-08
   3051313   4233   0   2    8.2348022e-07
   3051313   4137   0   2    5.6036388e-07
   3051313   4237   0   2   -6.3134619e-06
   3051212   4137   0   2    5.9780918e-08
   3051212   4237   0   2    1.3734186e-06
   3051414   4137   0   2    5.9781025e-08
   3051414   4237   0   2    1.3734186e-06
   3051616   4137   0   2    6.1411216e-08
   3051616   4237   0   2    1.3734027e-06

DECAY 23  2.4952


DECAY 24  2.085


DECAY 1000011  7.5104644
    0.51042513   2   -1000037    12
    0.2525166   2    1000035    11
    0.16655567   2    1000022    11
    0.055050008   2    1000025    11
    0.011042748   2    1000023    11
    0.0044098396   2   -1000024    12

DECAY 2000011  7.6218413
    0.68075289   2    1000022    11
    0.31678958   2    1000025    11
    0.002452536   2    1000023    11

DECAY 1000013  7.5127914
    0.51026575   2   -1000037    14
    0.25243796   2    1000035    13
    0.16656353   2    1000022    13
    0.055128873   2    1000025    13
    0.011195406   2    1000023    13
    0.0044084706   2   -1000024    14

DECAY 2000013  7.6272285
    0.68033799   2    1000022    13
    0.31667507   2    1000025    13
    0.0026275167   2    1000023    13
    0.0003525206   2   -1000024    14

DECAY 1000015  0.89827675
    0.59480851   2    1000022    15
    0.22642782   2    1000025    15
    0.16477002   2    1000023    15
    0.013993643   2   -1000024    16

DECAY 2000015  6.6809233
    0.58415094   2    1000022    15
    0.28465501   2    1000025    15
    0.082059753   2   -1000024    16
    0.04314443   2    1000023    15
    0.0029830354   2    1000016   -24
    0.0014459804   2    1000015    23
    0.0014042127   2    1000015    25
    0.00010340385   2   -1000037    16

DECAY 1000012  7.5421506
    0.49687264   2    1000037    11
    0.25136866   2    1000035    12
    0.13556031   2    1000022    12
    0.085534007   2    1000025    12
    0.027260043   2    1000024    11
    0.0034043458   2    1000023    12

DECAY 1000014  7.5444763
    0.49671894   2    1000037    13
    0.25129069   2    1000035    14
    0.13551845   2    1000022    14
    0.085507592   2    1000025    14
    0.027561037   2    1000024    13
    0.0034032945   2    1000023    14

DECAY 1000016  0.91703392
    0.42649125   2    1000022    16
    0.33208184   2    1000024    15
    0.23154974   2    1000025    16
    0.0098771725   2    1000023    16

DECAY 2000001  141.97081
    0.98038009   2    1000021    1
    0.013233239   2    1000022    1
    0.0063379566   2    1000025    1

DECAY 1000001  202.56951
    0.69246975   2    1000021    1
    0.2020701   2   -1000037    2
    0.10040176   2    1000035    1
    0.0019801646   2    1000025    1
    0.0016802863   2    1000022    1
    0.00077471699   2    1000023    1
    0.00062321261   2   -1000024    2

DECAY 2000003  141.97582
    0.980346   2    1000021    3
    0.013236008   2    1000022    3
    0.0063431763   2    1000025    3

DECAY 1000003  202.57387
    0.69245518   2    1000021    3
    0.20206594   2   -1000037    4
    0.10039964   2    1000035    3
    0.001983944   2    1000025    3
    0.0016825221   2    1000022    3
    0.00078080271   2    1000023    3
    0.00063197145   2   -1000024    4

DECAY 1000005  1.7395229
    0.37742448   2   -1000024    6
    0.2206959   2    1000022    5
    0.21961649   2    1000023    5
    0.18226313   2    1000025    5

DECAY 2000005  48.846635
    0.68772079   2   -1000024    6
    0.17537986   2   -1000037    6
    0.082113048   2    1000035    5
    0.024630411   2    1000023    5
    0.01757034   2    1000025    5
    0.011127851   2    1000022    5
    0.00086855908   2    1000005    25
    0.00058914222   2    1000005    23

DECAY 2000002  150.54002
    0.92595804   2    1000021    2
    0.049939998   2    1000022    2
    0.023918394   2    1000025    2
    0.00018279507   2    1000023    2

DECAY 1000002  202.56289
    0.69225394   2    1000021    2
    0.19901818   2    1000037    1
    0.10015346   2    1000035    2
    0.0038768122   2    1000024    1
    0.0030705901   2    1000022    2
    0.0011333328   2    1000023    2
    0.00049368679   2    1000025    2

DECAY 2000004  150.54361
    0.92593583   2    1000021    4
    0.049940506   2    1000022    4
    0.023922133   2    1000025    4
    0.00018866637   2    1000023    4

DECAY 1000004  202.56718
    0.69223928   2    1000021    4
    0.19901403   2    1000037    3
    0.10015142   2    1000035    4
    0.0038889069   2    1000024    3
    0.0030717747   2    1000022    4
    0.0011376754   2    1000023    4
    0.00049690881   2    1000025    4

DECAY 1000006  53.940755
    0.30103316   2    1000023    6
    0.26752581   2    1000025    6
    0.25627932   2    1000024    5
    0.073516467   2    1000037    5
    0.060272865   2    1000022    6
    0.040136877   2    1000035    6
    0.0006654321   2    1000005    24
    0.00047675866   3    1000022    24    5

DECAY 2000006  76.27992
    0.32096865   2    1000024    5
    0.23686949   2    1000023    6
    0.14924215   2    1000025    6
    0.13178679   2    1000022    6
    0.062473067   2    1000037    5
    0.032386179   2    1000035    6
    0.030788299   2    1000006    23
    0.025819819   2    2000005    24
    0.0093686822   2    1000006    25
    0.00029687   2    1000005    24

DECAY 1000024  8.9896832e-05
    0.33443564   3    1000022   -1    2
    0.3326092   3    1000022   -3    4
    0.11143272   3    1000022   -11    12
    0.1114298   3    1000022   -13    14
    0.11009264   3    1000022   -15    16

DECAY 1000037  10.67912
    0.21135722   2    1000023    24
    0.21000058   2    1000024    23
    0.20182873   2    1000024    25
    0.14188975   2    1000025    24
    0.076570085   2    1000016   -15
    0.075301765   2   -1000015    16
    0.075221762   2    1000022    24
    0.0030248594   3    1000023   -5    6
    0.0022177322   3    1000024    6   -6
    0.0016143406   3    1000025   -5    6
    0.00095795658   3    1000022   -5    6

DECAY 1000022 -1


DECAY 1000023  6.5149584e-05
    0.20292945   3    1000022    12   -12
    0.15184473   3    1000022    1   -1
    0.15183318   3    1000022    3   -3
    0.13145798   3    1000022    5   -5
    0.11842712   3    1000022    2   -2
    0.11656281   3    1000022    4   -4
    0.034233875   3    1000022    11   -11
    0.034229788   3    1000022    13   -13
    0.033062401   3    1000022    15   -15
    0.02541867   2    1000022    22

DECAY 1000025  9.6366286e-05
    0.11346678   3    1000024    1   -2
    0.11346678   3   -1000024   -1    2
    0.1121857   3    1000024    3   -4
    0.1121857   3   -1000024   -3    4
    0.060239002   3    1000023    12   -12
    0.045028034   3    1000023    1   -1
    0.045021474   3    1000023    3   -3
    0.037830894   3    1000024    11   -12
    0.037830894   3   -1000024   -11    12
    0.037828853   3    1000024    13   -14
    0.037828853   3   -1000024   -13    14
    0.037035263   3    1000024    15   -16
    0.037035263   3   -1000024   -15    16
    0.03511771   3    1000023    2   -2
    0.034073033   3    1000023    4   -4
    0.034018886   3    1000023    5   -5
    0.027191923   2    1000023    22
    0.010166047   3    1000023    11   -11
    0.010163721   3    1000023    13   -13
    0.0095568419   3    1000023    15   -15
    0.0025955046   3    1000022    12   -12
    0.0018282886   3    1000022    5   -5
    0.0017702651   3    1000022    1   -1
    0.0017702399   3    1000022    3   -3
    0.0013860472   3    1000022    2   -2
    0.0013816829   3    1000022    4   -4
    0.0010219662   2    1000022    22
    0.0003439725   3    1000022    13   -13
    0.00034395678   3    1000022    11   -11
    0.0002864306   3    1000022    15   -15

DECAY 1000035  11.819906
    0.1932286   2    1000024   -24
    0.1932286   2   -1000024    24
    0.15215163   2    1000023    25
    0.11010728   2    1000025    23
    0.081351111   2    1000025    25
    0.055489438   2    1000022    23
    0.04108242   2    1000022    25
    0.03495074   2    1000016   -16
    0.03495074   2   -1000016    16
    0.033606846   2    1000015   -15
    0.033606846   2   -1000015    15
    0.029751232   2    1000023    23
    0.0025997672   3    1000024    5   -6
    0.0025997672   3   -1000024   -5    6
    0.00067742348   3    1000023    6   -6
    0.00032775888   3    1000025    6   -6
    0.00023875347   3    1000022    6   -6

DECAY 1000021  209.84369
    0.19816923   2    1000005   -5
    0.19816923   2   -1000005    5
    0.10375414   2    2000005   -5
    0.10375414   2   -2000005    5
    0.10192434   2    2000006   -6
    0.10192434   2   -2000006    6
    0.094089646   2    1000006   -6
    0.094089646   2   -1000006    6
    0.0019494485   2    1000006   -4
    0.0019494485   2   -1000006    4

DECAY 25  0.0033844787
    0.63694619   2   -5    5
    0.16165872   2   -24    24
    0.075183928   2    21    21
    0.072836767   2   -15    15
    0.031510833   2   -4    4
    0.01791667   2    23    23
    0.0023213476   2    22    22
    0.0011329275   2    22    23
    0.00025258218   2   -13    13
    0.00023920616   2   -3    3
    6.6138144e-07   2   -1    1
    1.6239714e-07   2   -2    2
    5.6783891e-09   2   -11    11

DECAY 35  56.208715
    0.22783146   2   -1000024    1000037
    0.22783146   2   -1000037    1000024
    0.17365444   2   -5    5
    0.094909222   2    1000023    1000035
    0.083944038   2    1000025    1000035
    0.051164105   2    1000022    1000035
    0.036073988   2   -15    15
    0.024186112   2    1000022    1000023
    0.021488815   2    1000025    1000025
    0.019035804   2    1000022    1000022
    0.0099192192   2    1000023    1000025
    0.0095536364   2   -1000024    1000024
    0.0093290624   2   -6    6
    0.0016872399   2   -1000006    1000006
    0.001616505   2   -2000005    1000005
    0.001616505   2   -1000005    2000005
    0.0012511879   2   -2000015    1000015
    0.0012511879   2   -1000015    2000015
    0.0011898193   2    1000023    1000023
    0.0010566594   2    1000022    1000025
    0.00079796235   2   -1000037    1000037
    0.00040437574   2    1000035    1000035
    0.0001224544   2   -13    13
    6.911004e-05   2   -3    3
    6.1526256e-06   2    25    25
    1.7989795e-06   2    21    21
    1.5054719e-06   2    23    23
    7.3525438e-07   2   -2000015    2000015
    3.4865565e-07   2   -24    24
    3.021032e-07   2   -1000011    1000011
    3.0164134e-07   2   -1000013    1000013
    2.3269798e-07   2   -1000005    1000005
    1.9106645e-07   2   -1    1
    1.4593188e-07   2   -2000011    2000011
    1.4574615e-07   2   -2000013    2000013
    1.3465212e-07   2   -4    4
    1.2697743e-07   2    22    23
    7.1084358e-08   2    22    22
    2.7500629e-09   2   -11    11
    1.0700713e-09   2   -2000013    1000013
    1.0700713e-09   2   -1000013    2000013
    3.3304714e-11   2   -1000015    1000015
    6.9409936e-13   2   -2    2
    2.5029179e-14   2   -2000011    1000011
    2.5029179e-14   2   -1000011    2000011

DECAY 36  55.568565
    0.22920545   2   -1000024    1000037
    0.22920545   2   -1000037    1000024
    0.16820069   2   -5    5
    0.13521042   2    1000023    1000035
    0.059715416   2    1000025    1000035
    0.036889098   2    1000022    1000035
    0.034941813   2   -15    15
    0.02890964   2    1000022    1000023
    0.017305146   2    1000025    1000025
    0.015913057   2    1000022    1000022
    0.013603907   2    1000023    1000025
    0.011046175   2   -1000024    1000024
    0.0084989214   2   -6    6
    0.0020144023   2   -1000037    1000037
    0.0016350547   2   -2000005    1000005
    0.0016350547   2   -1000005    2000005
    0.0015886301   2    1000023    1000023
    0.0012656394   2   -2000015    1000015
    0.0012656394   2   -1000015    2000015
    0.0010149056   2    1000035    1000035
    0.00073800187   2    1000022    1000025
    0.00011861033   2   -13    13
    6.6939234e-05   2   -3    3
    8.447327e-06   2    21    21
    2.963512e-06   2    23    25
    1.8506487e-07   2   -1    1
    1.2270046e-07   2   -4    4
    1.2158326e-07   2    22    23
    9.1470047e-08   2    22    22
    2.6637604e-09   2   -11    11
    1.0724516e-09   2   -2000013    1000013
    1.0724516e-09   2   -1000013    2000013
    6.3251284e-13   2   -2    2
    2.5084754e-14   2   -2000011    1000011
    2.5084754e-14   2   -1000011    2000011
    1.0871111e-38   2    25    25

DECAY 37  56.342969
    0.23446467   2    1000023    1000037
    0.22933633   2    1000024    1000035
    0.18764641   2   -5    6
    0.14189441   2    1000025    1000037
    0.087068858   2    1000022    1000037
    0.061832405   2    1000022    1000024
    0.034522138   2   -15    16
    0.015323513   2    1000024    1000025
    0.0024987833   2   -2000015    1000016
    0.0020404117   2   -1000005    1000006
    0.0013362886   2   -1000005    2000006
    0.0011653073   2    1000023    1000024
    0.00039527485   2   -2000005    1000006
    0.00026401958   2   -5    4
    0.00012204805   2   -13    14
    6.3562996e-05   2   -3    4
    1.3839124e-05   2   -3    6
    2.9784151e-06   2   -3    2
    2.9253958e-06   2    24    25
    1.8853707e-06   2   -5    2
    1.1848959e-06   2   -1000011    1000012
    1.1842485e-06   2   -1000013    1000014
    7.3592838e-07   2   -1000015    1000016
    6.3039769e-07   2   -1    6
    1.7602169e-07   2   -1    2
    1.5903213e-08   2    1000035    1000037
    1.3988573e-08   2   -1    4
    2.8547167e-09   2   -11    12
    2.2147806e-09   2   -2000013    1000014
    5.1804525e-14   2   -2000011    1000012
    4.6044231e-14   2    24    35

DECAY 6  2.43
    1   2    5    24

DECAY 15 -1
