BLOCK SPINFO
   1   SPheno
   2   v4.0.5be

BLOCK SPHENOINFO
   1   2
   2   2

BLOCK MODSEL
   1   0

BLOCK MINPAR
   3    50.248491
   4   -1

BLOCK EXTPAR
   0    4006.1397
   1   -4805.8663
   2    2115.6071
   3    3740.6833
   11    4423.3899
   12   -2578.0976
   13   -1323.806
   23   -1030.7071
   25    50.083259
   26    3175.4727
   31    2264.3955
   32    2264.3955
   33    2260.0307
   34    1298.3716
   35    1298.3716
   36    4685.0146
   41    1552.3297
   42    1552.3297
   43    3378.704
   44    2369.1995
   45    2369.1995
   46    4581.5515
   47    954.68178
   48    954.68178
   49    4178.5932

BLOCK SMINPUTS
   1    127.90897
   2    1.1663787e-05
   3    0.1184
   4    91.1876
   5    4.18
   6    173.2
   7    1.777
   8    0
   11    0.00051099893
   12    0
   13    0.10565837
   14    0
   21    0.005
   22    0.0025
   23    0.095
   24    1.27

BLOCK GAUGE Q=  4006.1397
   1    0.35536298
   2    0.66519887
   3    1.219778

BLOCK YU Q=  4006.1397
   1   1    8.3860433e-06
   2   2    0.00426011
   3   3    1.0131014

BLOCK YD Q=  4006.1397
   1   1    0.00084397567
   2   2    0.016035538
   3   3    0.8369594

BLOCK YE Q=  4006.1397
   1   1    0.00014727993
   2   2    0.030452818
   3   3    0.51216629

BLOCK AU Q=  4006.1397
   1   1    0
   2   2    0
   3   3    4423.3899

BLOCK AD Q=  4006.1397
   1   1    0
   2   2    0
   3   3   -2578.0976

BLOCK AE Q=  4006.1397
   1   1    0
   2   2    0
   3   3   -1323.806

BLOCK MSOFT Q=  4006.1397
   1   -4805.8663
   2    2115.6071
   3    3740.6833
   21    9595674.9
   22   -822294.02
   31    2264.3955
   32    2264.3955
   33    2260.0307
   34    1298.3716
   35    1298.3716
   36    4685.0146
   41    1552.3297
   42    1552.3297
   43    3378.704
   44    2369.1995
   45    2369.1995
   46    4581.5515
   47    954.68178
   48    954.68178
   49    4178.5932

BLOCK MASS
   6    173.2
   23    91.1876
   24    80.429995
   15    1.777
   25    123.59061
   35    3172.2919
   36    3175.4727
   37    3173.4864
   1000001    1818.0174
   2000001    1260.254
   1000002    1816.2402
   2000002    2558.5774
   1000003    1818.0004
   2000003    1260.2035
   1000004    1816.2211
   2000004    2558.5768
   1000005    3485.2096
   2000005    4249.5956
   1000006    3482.6465
   2000006    4608.3217
   1000011    2289.4037
   2000011    1337.5257
   1000012    2287.6092
   1000013    2289.3646
   2000013    1337.4105
   1000014    2287.5611
   1000015    2271.0115
   2000015    4681.9056
   1000016    2269.2719
   1000021    3859.7451
   1000022    1044.66
   1000023   -1047.761
   1000025    2120.3144
   1000035   -4728.2531
   1000024    1045.3062
   1000037    2120.5081

BLOCK ALPHA
      -0.019938295

BLOCK HMIX Q=  4006.1397
   1   -1030.7071
   2    50.083259
   3    242.94395
   4    10083627

BLOCK STOPMIX
   1   1   -0.9980683
   1   2    0.062126144
   2   1   -0.062126144
   2   2   -0.9980683

BLOCK SBOTMIX
   1   1   -0.99978742
   1   2    0.020618259
   2   1   -0.020618259
   2   2   -0.99978742

BLOCK STAUMIX
   1   1   -0.99998721
   1   2    0.005058135
   2   1   -0.005058135
   2   2   -0.99998721

BLOCK NMIX
   1   1   -0.0052216684
   1   2   -0.049684606
   1   3   -0.7070837
   1   4   -0.70536289
   2   1   -0.0085581561
   2   2   -0.017880972
   2   3    0.70676712
   2   4   -0.70716849
   3   1    0.00030870148
   3   2   -0.99860488
   3   3    0.022524672
   3   4    0.047758182
   4   1    0.9999497
   4   2   -0.00010419913
   4   3    0.0023496315
   4   4   -0.0097504629

BLOCK UMIX
   1   1   -0.031876347
   1   2   -0.99949182
   2   1    0.99949182
   2   2   -0.031876347

BLOCK VMIX
   1   1   -0.067584209
   1   2    0.99771357
   2   1    0.99771357
   2   2    0.067584209

BLOCK HIGGSBOUNDSINPUTHIGGSCOUPLINGSFERMIONS
       0, 2508.3328,3,36,15,15

BLOCK HIGGSBOUNDSINPUTHIGGSCOUPLINGSBOSONS
       0,4,36,21,21,23

BLOCK SPHENOLOWENERGY
   1    0.00032185522
   2    1.5900302e-06
   3    3.5251411e-05
   4    2.9968703e-15
   5    1.2801977e-10
   6    2.6620233e-08
   7    1.0264283e-13
   8    4.3847861e-09
   9    9.2351836e-07
   10    9.5635946e-05
   11    0.98788271
   12    0.54173845
   13    19.35444
   14    0
   15    0
   16    0.0021565558
   17    2.2816522e-15
   18    2.4800144e-11
   19    8.2902717e-11
   20   -2.6259777e-15
   21   -1.1226724e-10
   22   -3.0670101e-08
   23    0
   24    0
   25    0
   26    0
   27    0
   28    0
   29    0
   30    0
   31    0
   39    7.3026323e-05
   40    0
   41    0
   42    0

BLOCK FWCOEF Q=  160
   305   4422   0   0   -0.18881911
   305   4422   0   2   -0.18987509
   305   4322   0   2    1.5761331e-05
   305   6421   0   0   -0.095227835
   305   6421   0   2   -0.1001336
   305   6321   0   2   -7.4484806e-05
   3051111   4133   0   0    1.6276071
   3051111   4133   0   2    1.6277922
   3051111   4233   0   2    0.00051361659
   3051111   4137   0   0   -4.4502992
   3051111   4137   0   2   -4.4486453
   3051111   4237   0   2   -0.0037968767
   3051313   4133   0   0    1.6276071
   3051313   4133   0   2    1.6277912
   3051313   4233   0   2    0.00051361451
   3051313   4137   0   0   -4.4502992
   3051313   4137   0   2   -4.4486463
   3051313   4237   0   2   -0.0037968798
   3051212   4137   0   0    1.5053501
   3051212   4137   0   2    1.5049957
   3051212   4237   0   2    0.00082085714
   3051414   4137   0   0    1.5053501
   3051414   4137   0   2    1.5049957
   3051414   4237   0   2    0.00082085727
   3051616   4137   0   0    1.5053501
   3051616   4137   0   2    1.5049957
   3051616   4237   0   2    0.00082089444

BLOCK IMFWCOEF Q=  160
   305   4422   0   0    3.8585383e-07
   305   4422   0   2   -2.1659305e-05
   305   4322   0   2    2.3981469e-06
   305   6421   0   0    3.3050932e-07
   305   6421   0   2    7.4242371e-07
   305   6321   0   2    1.4541697e-06
   3051111   4133   0   2   -3.8015357e-07
   3051111   4233   0   2    1.023361e-05
   3051111   4137   0   2    4.1958627e-06
   3051111   4237   0   2   -7.5653239e-05
   3051313   4133   0   2   -3.8015296e-07
   3051313   4233   0   2    1.0233584e-05
   3051313   4137   0   2    4.1958758e-06
   3051313   4237   0   2   -7.5653306e-05
   3051212   4137   0   2   -8.4831417e-07
   3051212   4237   0   2    1.6355683e-05
   3051414   4137   0   2   -8.4831458e-07
   3051414   4237   0   2    1.6355683e-05
   3051616   4137   0   2   -8.4863514e-07
   3051616   4237   0   2    1.6355682e-05

DECAY 23  2.4952


DECAY 24  2.085


DECAY 2000011  0.00010154482
    0.72426791   2    1000023    11
    0.27487186   2    1000022    11
    0.00086023412   2   -1000024    12

DECAY 1000011  0.64325636
    0.63202912   2   -1000037    12
    0.31604567   2    1000025    11
    0.027043182   2    1000022    11
    0.019945457   2   -1000024    12
    0.0049364745   2    1000023    11

DECAY 2000013  0.0075483009
    0.49444842   2   -1000024    14
    0.25346038   2    1000023    13
    0.25209119   2    1000022    13

DECAY 1000013  0.67221188
    0.60454426   2   -1000037    14
    0.3023021   2    1000025    13
    0.04557387   2    1000022    13
    0.024338904   2    1000023    13
    0.019085636   2   -1000024    14
    0.0041552291   2    2000013    25

DECAY 1000015  7.8812976
    0.46983655   2    1000022    15
    0.46573374   2    1000023    15
    0.041604409   2   -1000037    16
    0.020809435   2    1000025    15
    0.0020158672   2   -1000024    16

DECAY 2000015  45.725745
    0.48168839   2   -1000024    16
    0.24107486   2    1000022    15
    0.24092568   2    1000023    15
    0.01746453   2    1000016   -24
    0.0093834553   2    1000015    25
    0.0087150315   2    1000015    23
    0.00049890424   2   -1000037    16
    0.00024916033   2    1000025    15

DECAY 1000012  0.66916963
    0.59351014   2    1000037    11
    0.29804729   2    1000025    12
    0.086049866   2    1000024    11
    0.020728265   2    1000022    12
    0.0016644395   2    1000023    12

DECAY 1000014  0.69524386
    0.57094593   2    1000037    13
    0.28671621   2    1000025    14
    0.1207859   2    1000024    13
    0.019950016   2    1000022    14
    0.0016019474   2    1000023    14

DECAY 1000016  7.8954855
    0.93728661   2    1000024    15
    0.04050136   2    1000037    15
    0.020345452   2    1000025    16
    0.0017278396   2    1000022    16
    0.0001387334   2    1000023    16

DECAY 2000001  1.0257577e-05
    0.56252455   2    1000023    1
    0.26813988   2    1000022    1
    0.16933557   2   -1000024    2

DECAY 1000001  0.016789666
    0.50863176   2    1000022    1
    0.43401963   2   -1000024    2
    0.057223838   2    1000023    1
    0.00012476595   2    2000001    25

DECAY 2000003  0.0012561396
    0.49897695   2   -1000024    4
    0.25255159   2    1000022    3
    0.24847146   2    1000023    3

DECAY 1000003  0.021980347
    0.48323464   2    1000022    3
    0.34465865   2   -1000024    4
    0.13770019   2    1000023    3
    0.034406526   2    2000003    25

DECAY 1000005  116.89269
    0.4981644   2   -1000024    6
    0.17262782   2    1000022    5
    0.17169308   2    1000023    5
    0.10562219   2   -1000037    6
    0.051892517   2    1000025    5

DECAY 2000005  116.29795
    0.4474213   2   -1000024    6
    0.22448252   2    1000023    5
    0.22440693   2    1000022    5
    0.088424449   2    1000021    5
    0.0066209177   2    1000006   -24
    0.0043663037   2    1000005    25
    0.0032756677   2    1000005    23
    0.00066799553   2   -1000037    6
    0.0003339165   2    1000025    5

DECAY 1000002  0.043184297
    0.75660468   2    1000024    1
    0.21236062   2    1000022    2
    0.031034694   2    1000023    2

DECAY 2000002  0.00039814661
    0.72815495   2    1000023    2
    0.27170465   2    1000022    2
    0.00013419111   2    1000025    2

DECAY 1000004  0.047615296
    0.77321759   2    1000024    3
    0.19559546   2    1000022    4
    0.031186951   2    1000023    4

DECAY 2000004  0.0016766999
    0.38063381   2    1000024    3
    0.36397544   2    1000023    4
    0.25497981   2    1000022    4
    0.0002467276   2    1000037    3
    0.000155531   2    1000025    4

DECAY 1000006  122.84821
    0.32564193   2    1000024    5
    0.23858013   2    1000023    6
    0.23688902   2    1000022    6
    0.099389829   2    1000037    5
    0.05058328   2    1000025    6
    0.048915806   3    1000022    24    5

DECAY 2000006  249.44443
    0.33932913   2    1000024    5
    0.16894785   2    1000023    6
    0.16864483   2    1000022    6
    0.12907823   2    1000021    6
    0.080130653   2    1000005    24
    0.073540676   2    1000006    25
    0.040074985   2    1000006    23
    0.00016843784   2    1000037    5

DECAY 1000024  2.2716067e-13
    0.85304534   2    1000022    211
    0.07823308   3    1000022   -11    12
    0.068721581   3    1000022   -13    14

DECAY 1000037  24.206448
    0.17232712   2    1000024    25
    0.16264963   2    1000023    24
    0.1607308   2    1000022    24
    0.16046665   2    1000024    23
    0.081719113   2    1000004   -3
    0.081709541   2    1000002   -1
    0.081126659   2   -1000003    4
    0.081119153   2   -1000001    2
    0.0066097929   3    1000024    6   -6
    0.0059745405   3    1000023   -5    6
    0.0054230437   3    1000022   -5    6

DECAY 1000022 -1


DECAY 1000023  8.6800457e-09
    0.88002441   2    1000022    22
    0.020874925   3    1000022    12   -12
    0.015609298   3    1000022    1   -1
    0.015433029   3    1000022    3   -3
    0.012636691   3    1000024    1   -2
    0.012636691   3   -1000024   -1    2
    0.012174371   3    1000022    2   -2
    0.0042123369   3    1000024    11   -12
    0.0042123369   3   -1000024   -11    12
    0.0041716829   3    1000024    13   -14
    0.0041716829   3   -1000024   -13    14
    0.0035226883   3    1000022    11   -11
    0.0034602656   3    1000022    13   -13
    0.0030425248   3    1000024    3   -4
    0.0030425248   3   -1000024   -3    4
    0.00043260505   3    1000022    4   -4
    0.00017096605   3    1000024    15   -16
    0.00017096605   3   -1000024   -15    16

DECAY 1000025  27.750105
    0.14561401   2    1000023    25
    0.14064774   2    1000024   -24
    0.14064774   2   -1000024    24
    0.13312523   2    1000022    25
    0.12579741   2    1000023    23
    0.03566201   2    1000004   -4
    0.03566201   2   -1000004    4
    0.035658265   2    1000002   -2
    0.035658265   2   -1000002    2
    0.035285971   2    1000003   -3
    0.035285971   2   -1000003    3
    0.03528227   2    1000001   -1
    0.03528227   2   -1000001    1
    0.016157646   2    1000022    23
    0.0045560499   3    1000024    5   -6
    0.0045560499   3   -1000024   -5    6
    0.002574377   3    1000023    6   -6
    0.0024116259   3    1000022    6   -6

DECAY 1000035  130.61078
    0.076970012   2    2000013   -13
    0.076970012   2   -2000013    13
    0.076967704   2    2000011   -11
    0.076967704   2   -2000011    11
    0.060639496   2    2000004   -4
    0.060639496   2   -2000004    4
    0.060639465   2    2000002   -2
    0.060639465   2   -2000002    2
    0.026159463   2    2000003   -3
    0.026159463   2   -2000003    3
    0.026159141   2    2000001   -1
    0.026159141   2   -2000001    1
    0.023771842   2    1000024   -24
    0.023771842   2   -1000024    24
    0.017286471   2    1000022    23
    0.016772845   2    1000023    25
    0.015422909   2    1000022    25
    0.013472817   2    1000016   -16
    0.013472817   2   -1000016    16
    0.01345078   2    1000015   -15
    0.01345078   2   -1000015    15
    0.013342622   2    1000014   -14
    0.013342622   2   -1000014    14
    0.013342279   2    1000012   -12
    0.013342279   2   -1000012    12
    0.013319365   2    1000013   -13
    0.013319365   2   -1000013    13
    0.013319086   2    1000011   -11
    0.013319086   2   -1000011    11
    0.0064903358   2    1000023    23
    0.0056371772   2    37   -1000024
    0.0056371772   2   -37    1000024
    0.0055096457   2    1000003   -3
    0.0055096457   2   -1000003    3
    0.0055096086   2    1000001   -1
    0.0055096086   2   -1000001    1
    0.0055004928   2    1000004   -4
    0.0055004928   2   -1000004    4
    0.0055004549   2    1000002   -2
    0.0055004549   2   -1000002    2
    0.0049668396   2    1000022    35
    0.0045810375   2    1000023    35
    0.0016831082   2    1000006   -6
    0.0016831082   2   -1000006    6
    0.0015804188   2    1000005   -5
    0.0015804188   2   -1000005    5
    0.0015597909   3    1000024    5   -6
    0.0015597909   3   -1000024   -5    6
    0.0012210969   3    1000023    6   -6
    0.0011859562   3    1000022    6   -6
    0.0011210389   2    2000005   -5
    0.0011210389   2   -2000005    5
    0.00073506298   2    1000023    36
    0.00068480165   2    1000022    36

DECAY 1000021  539.12569
    0.084570822   2    2000003   -3
    0.084570822   2   -2000003    3
    0.084569206   2    2000001   -1
    0.084569206   2   -2000001    1
    0.064229548   2    1000004   -4
    0.064229548   2   -1000004    4
    0.064228783   2    1000002   -2
    0.064228783   2   -1000002    2
    0.064157958   2    1000003   -3
    0.064157958   2   -1000003    3
    0.064157274   2    1000001   -1
    0.064157274   2   -1000001    1
    0.03329704   2    2000004   -4
    0.03329704   2   -2000004    4
    0.033297025   2    2000002   -2
    0.033297025   2   -2000002    2
    0.003614479   2    1000005   -5
    0.003614479   2   -1000005    5
    0.0034800584   2    1000006   -6
    0.0034800584   2   -1000006    6

DECAY 25  0.0037047186
    0.594593   2   -5    5
    0.20586441   2   -24    24
    0.073568008   2    21    21
    0.068197306   2   -15    15
    0.02936976   2   -4    4
    0.024226858   2    23    23
    0.002340656   2    22    22
    0.0013790546   2    22    23
    0.00023653572   2   -13    13
    0.00022364271   2   -3    3
    6.1834842e-07   2   -1    1
    1.5135396e-07   2   -2    2
    5.3176031e-09   2   -11    11

DECAY 35  126.47003
    0.87573651   2   -5    5
    0.10714551   2   -15    15
    0.0050776722   2   -1000024    1000037
    0.0050776722   2   -1000037    1000024
    0.0047061625   2    1000023    1000025
    0.0006232795   2   -6    6
    0.00054352166   2   -3    3
    0.00044492117   2   -1000024    1000024
    0.00037457365   2   -13    13
    0.00011016408   2    1000022    1000022
    9.6578775e-05   2    1000022    1000025
    4.2637435e-05   2    1000022    1000023
    1.0291872e-05   2    21    21
    8.4755257e-06   2    1000023    1000023
    1.502096e-06   2   -1    1
    2.2274799e-07   2    25    25
    7.6941207e-08   2    23    23
    3.8011937e-08   2   -2000001    2000001
    3.7976453e-08   2   -2000003    2000003
    2.6703799e-08   2   -1000002    1000002
    2.6683962e-08   2   -1000004    1000004
    2.1601573e-08   2   -24    24
    1.0064686e-08   2   -4    4
    9.8699509e-09   2   -1000011    1000011
    9.6745907e-09   2   -1000013    1000013
    8.4125363e-09   2   -11    11
    8.2357678e-09   2    22    22
    6.6168467e-09   2    22    23
    5.5506813e-09   2   -2000003    1000003
    5.5506813e-09   2   -1000003    2000003
    4.5778714e-09   2   -1000001    1000001
    4.4605245e-09   2   -1000003    1000003
    1.5369512e-11   2   -2000001    1000001
    1.5369512e-11   2   -1000001    2000001
    5.188993e-14   2   -2    2

DECAY 36  115.95971
    0.87297338   2   -5    5
    0.10679998   2   -15    15
    0.0058647812   2    1000022    1000025
    0.0058623637   2   -1000024    1000037
    0.0058623637   2   -1000037    1000024
    0.00080838932   2   -1000024    1000024
    0.00055137192   2   -6    6
    0.00054185039   2   -3    3
    0.0003733668   2   -13    13
    0.00019167725   2    1000022    1000022
    0.00010356394   2    1000023    1000025
    3.1194856e-05   2    1000022    1000023
    1.7378447e-05   2    1000023    1000023
    1.6583394e-05   2    21    21
    1.4974752e-06   2   -1    1
    1.4272251e-07   2    23    25
    6.3064263e-08   2    22    23
    2.1151962e-08   2    22    22
    8.8721862e-09   2   -4    4
    8.3854333e-09   2   -11    11
    6.1282345e-09   2   -2000003    1000003
    6.1282345e-09   2   -1000003    2000003
    1.6968424e-11   2   -2000001    1000001
    1.6968424e-11   2   -1000001    2000001
    3.0836857e-12   2    23    35
    4.5756265e-14   2   -2    2
    3.5173967e-38   2    25    25

DECAY 37  133.74565
    0.86318025   2   -5    6
    0.11981143   2   -15    16
    0.0050374111   2    1000022    1000037
    0.004922838   2    1000024    1000025
    0.0046494498   2    1000023    1000037
    0.001279673   2   -5    4
    0.00045778666   2   -3    4
    0.00042357614   2   -13    14
    0.00017813398   2    1000023    1000024
    2.6036695e-05   2    1000022    1000024
    2.1455201e-05   2   -3    2
    9.1381859e-06   2   -5    2
    1.2697036e-06   2   -1    2
    1.2048616e-06   2   -3    6
    1.235782e-07   2    24    25
    5.9554018e-08   2   -1    4
    5.8090505e-08   2   -2000001    1000002
    5.7959827e-08   2   -2000003    1000004
    2.4130974e-08   2   -1    6
    9.9087976e-09   2   -1000003    1000004
    9.9074898e-09   2   -11    12
    3.104796e-09   2   -2000003    1000002
    3.10238e-09   2   -2000001    1000004
    5.3076651e-10   2   -1000003    1000002
    2.7482509e-11   2   -1000001    1000002
    1.4678094e-12   2   -1000001    1000004
    2.4743624e-14   2    24    35

DECAY 6  2.43
    1   2    5    24

DECAY 15 -1
