BLOCK SPINFO
   1   SPheno
   2   v4.0.5be

BLOCK SPHENOINFO
   1   2
   2   2

BLOCK MODSEL
   1   0

BLOCK MINPAR
   3    52.687837
   4   -1

BLOCK EXTPAR
   0    1494.7606
   1    127.39362
   2   -1282.158
   3    3000
   11    4486.8266
   12   -1940.111
   13    700.22325
   23   -149.06063
   25    52.595048
   26    787.81425
   31    872.54123
   32    872.54123
   33    1989.3551
   34    1041.3825
   35    1041.3825
   36    1067.7689
   41    5000
   42    5000
   43    1770.4761
   44    5000
   45    5000
   46    1440.4666
   47    5000
   48    5000
   49    1297.4031

BLOCK SMINPUTS
   1    127.90897
   2    1.1663787e-05
   3    0.1184
   4    91.1876
   5    4.18
   6    173.2
   7    1.777
   8    0
   11    0.00051099893
   12    0
   13    0.10565837
   14    0
   21    0.005
   22    0.0025
   23    0.095
   24    1.27

BLOCK GAUGE Q=  1494.7606
   1    0.35536298
   2    0.66519887
   3    1.219778

BLOCK YU Q=  1494.7606
   1   1    8.3858875e-06
   2   2    0.0042600308
   3   3    1.0130826

BLOCK YD Q=  1494.7606
   1   1    0.0008862865
   2   2    0.016839444
   3   3    0.87891849

BLOCK YE Q=  1494.7606
   1   1    0.00015466348
   2   2    0.031979502
   3   3    0.53784261

BLOCK AU Q=  1494.7606
   1   1    0
   2   2    0
   3   3    4486.8268

BLOCK AD Q=  1494.7606
   1   1    0
   2   2    0
   3   3   -1940.1111

BLOCK AE Q=  1494.7606
   1   1    0
   2   2    0
   3   3    700.22324

BLOCK MSOFT Q=  1494.7606
   1    127.39362
   2   -1282.158
   3    3000
   21    672201.27
   22    47078.122
   31    872.54123
   32    872.54123
   33    1989.3551
   34    1041.3825
   35    1041.3825
   36    1067.7689
   41    5000
   42    5000
   43    1770.4761
   44    5000
   45    5000
   46    1440.4666
   47    5000
   48    5000
   49    1297.4031

BLOCK MASS
   6    173.2
   23    91.1876
   24    80.429995
   15    1.777
   25    124.68056
   35    787.49071
   36    787.81425
   37    794.77606
   1000001    5030.4694
   2000001    5021.3158
   1000002    5030.0431
   2000002    5022.6965
   1000003    5030.4753
   2000003    5021.3263
   1000004    5030.0489
   2000004    5022.6972
   1000005    1280.266
   2000005    1710.7364
   1000006    1238.5913
   2000006    1803.9117
   1000011    888.84424
   2000011    1043.6555
   1000012    884.99277
   1000013    888.81936
   2000013    1043.6146
   1000014    884.97077
   1000015    1057.4173
   2000015    1991.2844
   1000016    1989.4053
   1000021    3193.2997
   1000022    110.23077
   1000023   -155.29523
   1000025    177.78595
   1000035   -1325.5658
   1000024    154.33658
   1000037    1325.7191

BLOCK ALPHA
      -0.019858946

BLOCK HMIX Q=  1494.7606
   1   -149.06063
   2    52.595048
   3    243.95861
   4    620651.29

BLOCK STOPMIX
   1   1   -0.42416209
   1   2    0.90558629
   2   1   -0.90558629
   2   2   -0.42416209

BLOCK SBOTMIX
   1   1   -0.010492516
   1   2    0.99994495
   2   1   -0.99994495
   2   2   -0.010492516

BLOCK STAUMIX
   1   1   -0.0054172731
   1   2    0.99998533
   2   1   -0.99998533
   2   2   -0.0054172731

BLOCK NMIX
   1   1    0.83014098
   1   2    0.017518713
   1   3   -0.45611917
   1   4   -0.32017863
   2   1    0.11316913
   2   2    0.049118012
   2   3    0.70095334
   2   4   -0.70245611
   3   1    0.54594428
   3   2   -0.033379532
   3   3    0.54822735
   3   4    0.63267482
   4   1    0.0018818906
   4   2   -0.99808132
   4   3    0.0081548877
   4   4   -0.061348462

BLOCK UMIX
   1   1   -0.011544119
   1   2   -0.99993336
   2   1   -0.99993336
   2   2    0.011544119

BLOCK VMIX
   1   1    0.086868249
   1   2    0.99621981
   2   1    0.99621981
   2   2   -0.086868249

BLOCK HIGGSBOUNDSINPUTHIGGSCOUPLINGSFERMIONS
       0, 2766.2391,3,36,15,15

BLOCK HIGGSBOUNDSINPUTHIGGSCOUPLINGSBOSONS
       0,4,36,21,21,23

BLOCK SPHENOLOWENERGY
   1    0.00029666142
   2    1.5953488e-06
   3    3.5267176e-05
   4    5.3201775e-14
   5    2.2714191e-09
   6    4.0052913e-07
   7    1.8876133e-12
   8    8.059354e-08
   9    1.4451856e-05
   10    7.8041637e-05
   11    0.80614023
   12    0.542007
   13    19.450392
   14    0
   15    0
   16    0.0021598262
   17    2.2817117e-15
   18    2.4799858e-11
   19    8.2907496e-11
   20    8.7405847e-15
   21    3.7364915e-10
   22    7.3695886e-08
   23    0
   24    0
   25    0
   26    0
   27    0
   28    0
   29    0
   30    0
   31    0
   39    8.2299339e-05
   40    0
   41    0
   42    0

BLOCK FWCOEF Q=  160
   305   4422   0   0   -0.18881911
   305   4422   0   2   -0.15213858
   305   4322   0   2   -0.00036048449
   305   6421   0   0   -0.095227835
   305   6421   0   2   -0.10630395
   305   6321   0   2   -0.00078749218
   3051111   4133   0   0    1.5926069
   3051111   4133   0   2    1.5942992
   3051111   4233   0   2    2.0199962e-05
   3051111   4137   0   0   -4.415299
   3051111   4137   0   2   -4.4150275
   3051111   4237   0   2   -0.00015057229
   3051313   4133   0   0    1.5926069
   3051313   4133   0   2    1.5942909
   3051313   4233   0   2    2.0109399e-05
   3051313   4137   0   0   -4.415299
   3051313   4137   0   2   -4.4150358
   3051313   4237   0   2   -0.00015049496
   3051212   4137   0   0    1.5053501
   3051212   4137   0   2    1.5053009
   3051212   4237   0   2    3.2796325e-05
   3051414   4137   0   0    1.5053501
   3051414   4137   0   2    1.5053009
   3051414   4237   0   2    3.2815372e-05
   3051616   4137   0   0    1.5053501
   3051616   4137   0   2    1.5053011
   3051616   4237   0   2    3.8184238e-05

BLOCK IMFWCOEF Q=  160
   305   4422   0   0    3.8585575e-07
   305   4422   0   2    2.0667835e-05
   305   4322   0   2    9.5720729e-06
   305   6421   0   0    3.3051097e-07
   305   6421   0   2    2.3808701e-05
   305   6321   0   2    4.1925458e-06
   3051111   4133   0   2   -4.444397e-08
   3051111   4233   0   2    8.736772e-06
   3051111   4137   0   2    6.9111545e-07
   3051111   4237   0   2   -6.7934098e-05
   3051313   4133   0   2   -4.4542798e-08
   3051313   4233   0   2    8.7367167e-06
   3051313   4137   0   2    6.9102379e-07
   3051313   4237   0   2   -6.7934279e-05
   3051212   4137   0   2    5.4189838e-09
   3051212   4237   0   2    1.4803045e-05
   3051414   4137   0   2    5.4186619e-09
   3051414   4237   0   2    1.4803045e-05
   3051616   4137   0   2    8.5700412e-09
   3051616   4237   0   2    1.4803072e-05

DECAY 23  2.4952


DECAY 24  2.085


DECAY 1000011  1.0916902
    0.73835178   2    1000022    11
    0.22030809   2    1000025    11
    0.04044169   2    1000023    11
    0.00089844227   2   -1000024    12

DECAY 2000011  5.0714539
    0.69676906   2    1000022    11
    0.29056777   2    1000025    11
    0.01266307   2    1000023    11

DECAY 1000013  1.1086656
    0.7303117   2    1000022    13
    0.22144869   2    1000025    13
    0.047354958   2    1000023    13
    0.00088465789   2   -1000024    14

DECAY 2000013  5.1118963
    0.69207427   2    1000022    13
    0.28943195   2    1000025    13
    0.014513462   2    1000023    13
    0.0039734387   2   -1000024    14

DECAY 1000015  16.799528
    0.34696271   2   -1000024    16
    0.28770597   2    1000022    15
    0.19112183   2    1000025    15
    0.17420949   2    1000023    15

DECAY 2000015  22.567534
    0.25112587   2    1000023    15
    0.2407663   2   -1000037    16
    0.18608865   2    1000022    15
    0.17655834   2    1000025    15
    0.11974533   2    1000035    15
    0.011600897   2    1000015    35
    0.011594694   2    1000015    36
    0.0012728515   2    1000015    23
    0.0012076714   2    1000015    25

DECAY 1000012  1.1197355
    0.61176351   2    1000022    12
    0.33845845   2    1000025    12
    0.04935786   2    1000024    11
    0.00042017685   2    1000023    12

DECAY 1000014  1.1366263
    0.60265647   2    1000022    14
    0.3334191   2    1000025    14
    0.063510507   2    1000024    13
    0.00041392121   2    1000023    14

DECAY 1000016  22.571304
    0.50684744   2    1000024    15
    0.2380102   2    1000037    15
    0.11972055   2    1000035    16
    0.069957792   2    1000022    16
    0.040333258   2    1000025    16
    0.022540213   2    1000015    37
    0.0025412684   2    1000015    24

DECAY 2000001  143.38558
    0.98047575   2    1000021    1
    0.013460548   2    1000022    1
    0.0058129072   2    1000025    1
    0.00025018708   2    1000023    1

DECAY 1000001  199.76928
    0.70851095   2    1000021    1
    0.1919254   2   -1000037    2
    0.095675069   2    1000035    1
    0.0018858018   2    1000025    1
    0.0018802826   2    1000022    1

DECAY 2000003  143.44306
    0.98009042   2    1000021    3
    0.013496116   2    1000022    3
    0.0058696268   2    1000025    3
    0.00034666194   2    1000023    3
    0.00019708138   2   -1000024    4

DECAY 1000003  199.80003
    0.70840494   2    1000021    3
    0.19189621   2   -1000037    4
    0.095660493   2    1000035    3
    0.0019279769   2    1000025    3
    0.001909436   2    1000022    3
    0.00016245603   2    1000023    3

DECAY 1000005  38.185975
    0.48132123   2   -1000024    6
    0.24594293   2    1000023    5
    0.15326626   2    1000025    5
    0.11946959   2    1000022    5

DECAY 2000005  126.18531
    0.49997915   2    1000006   -24
    0.26464951   2   -1000024    6
    0.10075878   2    1000023    5
    0.06267031   2    1000025    5
    0.043545645   2    1000022    5
    0.018597886   2   -1000037    6
    0.0094993266   2    1000035    5
    0.00018144852   2    1000005    25
    0.00011793877   2    1000005    23

DECAY 2000002  151.93019
    0.92627901   2    1000021    2
    0.050827657   2    1000022    2
    0.021949394   2    1000025    2
    0.0009437133   2    1000023    2

DECAY 1000002  199.76621
    0.70829967   2    1000021    2
    0.19048446   2    1000037    1
    0.095537613   2    1000035    2
    0.0030270321   2    1000022    2
    0.0016698943   2    1000024    1
    0.0005307872   2    1000023    2
    0.00045054192   2    1000025    2

DECAY 2000004  151.93382
    0.92625696   2    1000021    4
    0.050827658   2    1000022    4
    0.021953647   2    1000025    4
    0.00094956635   2    1000023    4

DECAY 1000004  199.79689
    0.70819363   2    1000021    4
    0.19045552   2    1000037    3
    0.095523082   2    1000035    4
    0.0030275025   2    1000022    4
    0.0018109847   2    1000024    3
    0.00053518451   2    1000023    4
    0.00045410081   2    1000025    4

DECAY 1000006  51.069929
    0.47654001   2    1000024    5
    0.23736975   2    1000025    6
    0.2323101   2    1000023    6
    0.053782788   2    1000022    6
    0.00018321685   2    1000022    4

DECAY 2000006  133.43312
    0.3130176   2    1000006    23
    0.20536431   2    1000024    5
    0.18136641   2    1000006    25
    0.13117281   2    1000023    6
    0.087088173   2    1000025    6
    0.045421881   2    1000022    6
    0.02312395   2    1000037    5
    0.0099102307   2    1000035    6
    0.0032162041   2    2000005    24
    0.00031842809   2    1000005    24

DECAY 1000024  6.0732281e-05
    0.33381437   3    1000022   -1    2
    0.33259166   3    1000022   -3    4
    0.11123752   3    1000022   -13    14
    0.11123565   3    1000022   -11    12
    0.11112079   3    1000022   -15    16

DECAY 1000037  23.62431
    0.12346078   2    1000023    24
    0.12263087   2    1000024    23
    0.121382   2    1000024    25
    0.092967998   2    1000025    24
    0.075341939   2    1000014   -13
    0.07533592   2    1000012   -11
    0.074844798   2   -1000013    14
    0.074837955   2   -1000011    12
    0.049379822   2    1000024    36
    0.049333442   2    1000024    35
    0.04929664   2    37    1000023
    0.029962409   2    1000022    24
    0.029120139   2    37    1000025
    0.020320619   2    37    1000022
    0.0038549895   3    1000024    6   -6
    0.0033270124   3    1000023   -5    6
    0.0025248475   3    1000025   -5    6
    0.0010945791   2    1000006   -5
    0.00082851849   3    1000022   -5    6
    0.00012925638   3    1000024    5   -5

DECAY 1000022 -1


DECAY 1000023  0.00015235861
    0.20351567   3    1000022    12   -12
    0.15217113   3    1000022    1   -1
    0.15216425   3    1000022    3   -3
    0.14189589   3    1000022    5   -5
    0.1186832   3    1000022    2   -2
    0.117555   3    1000022    4   -4
    0.034226817   3    1000022    11   -11
    0.034226685   3    1000022    13   -13
    0.033947538   3    1000022    15   -15
    0.0116138   2    1000022    22

DECAY 1000025  3.6012268e-05
    0.067497419   3    1000023    12   -12
    0.067108333   3    1000022    12   -12
    0.056623846   3    1000024    1   -2
    0.056623846   3   -1000024   -1    2
    0.055826982   3    1000024    3   -4
    0.055826982   3   -1000024   -3    4
    0.053465951   3    1000022    5   -5
    0.05047604   3    1000023    1   -1
    0.050465845   3    1000023    3   -3
    0.048952299   3    1000022    1   -1
    0.048951657   3    1000022    3   -3
    0.039366294   3    1000023    2   -2
    0.038223509   3    1000022    2   -2
    0.038083022   3    1000022    4   -4
    0.037752354   3    1000023    4   -4
    0.034444338   3    1000023    5   -5
    0.019902437   2    1000023    22
    0.018881559   3    1000024    13   -14
    0.018881559   3   -1000024   -13    14
    0.018881488   3    1000024    11   -12
    0.018881488   3   -1000024   -11    12
    0.018420789   3    1000024    15   -16
    0.018420789   3   -1000024   -15    16
    0.011408131   3    1000023    11   -11
    0.011405169   3    1000023    13   -13
    0.011017545   3    1000022    15   -15
    0.010525923   3    1000023    15   -15
    0.0098837389   3    1000022    13   -13
    0.0098785017   3    1000022    11   -11
    0.0039221663   2    1000022    22

DECAY 1000035  24.322946
    0.12041643   2    1000024   -24
    0.12041643   2   -1000024    24
    0.074513472   2    1000023    25
    0.058024118   2    1000025    23
    0.05385461   2    1000025    25
    0.048322087   2    37   -1000024
    0.048322087   2   -37    1000024
    0.043813202   2    1000023    23
    0.036781886   2    1000014   -14
    0.036781886   2   -1000014    14
    0.036778945   2    1000012   -12
    0.036778945   2   -1000012    12
    0.036122261   2    1000013   -13
    0.036122261   2   -1000013    13
    0.036118934   2    1000011   -11
    0.036118934   2   -1000011    11
    0.031244304   2    1000023    35
    0.021548361   2    1000025    35
    0.017454604   2    1000022    23
    0.016076485   2    1000023    36
    0.015605627   2    1000022    25
    0.013110727   2    1000022    35
    0.0083928419   2    1000025    36
    0.0073366997   2    1000022    36
    0.0030878061   3    1000024    5   -6
    0.0030878061   3   -1000024   -5    6
    0.0017694668   3    1000023    6   -6
    0.0012772313   3    1000025    6   -6
    0.00048716124   3    1000022    6   -6

DECAY 1000021  232.14003
    0.16110083   2    1000006   -6
    0.16110083   2   -1000006    6
    0.14340808   2    1000005   -5
    0.14340808   2   -1000005    5
    0.10348851   2    2000005   -5
    0.10348851   2   -2000005    5
    0.082540284   2    2000006   -6
    0.082540284   2   -2000006    6
    0.0093726187   2    1000006   -4
    0.0093726187   2   -1000006    4

DECAY 25  0.0040920474
    0.60033926   2   -5    5
    0.20942321   2   -24    24
    0.068223852   2   -15    15
    0.065972422   2    21    21
    0.026790115   2   -4    4
    0.02519115   2    23    23
    0.0022183777   2    22    22
    0.0013809231   2    22    23
    0.00023712137   2   -13    13
    0.00022280306   2   -3    3
    6.1602375e-07   2   -1    1
    1.3805679e-07   2   -2    2
    5.3307562e-09   2   -11    11

DECAY 35  43.852388
    0.87561752   2   -5    5
    0.10404107   2   -15    15
    0.0053987621   2    1000022    1000023
    0.0052012518   2    1000022    1000022
    0.0038771505   2    1000023    1000025
    0.0037124506   2    1000025    1000025
    0.00093436896   2   -1000024    1000024
    0.00037539087   2   -13    13
    0.00027867283   2   -6    6
    0.00025657824   2   -3    3
    0.00020251149   2    1000022    1000025
    8.1418404e-05   2    21    21
    1.3505511e-05   2    25    25
    4.2357745e-06   2    1000023    1000023
    2.7126257e-06   2   -24    24
    1.6019725e-06   2    23    23
    7.0932918e-07   2   -1    1
    4.6840257e-08   2    22    22
    3.4256067e-08   2    22    23
    8.4345253e-09   2   -11    11
    4.4993819e-09   2   -4    4
    2.3202901e-14   2   -2    2

DECAY 36  41.977192
    0.87459922   2   -5    5
    0.10392268   2   -15    15
    0.0055687056   2    1000022    1000022
    0.0054658686   2    1000022    1000023
    0.0043883799   2    1000025    1000025
    0.0036397714   2    1000023    1000025
    0.0011498897   2   -1000024    1000024
    0.00037495615   2   -13    13
    0.00032210078   2   -6    6
    0.00025626608   2   -3    3
    0.00019931543   2    1000022    1000025
    0.00010371047   2    21    21
    5.5935122e-06   2    1000023    1000023
    2.6349715e-06   2    23    25
    7.0846602e-07   2   -1    1
    1.2378314e-07   2    22    22
    6.2347349e-08   2    22    23
    8.4247593e-09   2   -11    11
    4.1364336e-09   2   -4    4
    2.1330513e-14   2   -2    2
    1.3731819e-38   2    25    25

DECAY 37  39.4308
    0.86483309   2   -5    6
    0.11189768   2   -15    16
    0.015590952   2    1000022    1000024
    0.0049250987   2    1000024    1000025
    0.0013802719   2   -5    4
    0.00068991391   2    1000023    1000024
    0.00039560191   2   -13    14
    0.00026103177   2   -3    4
    1.2018765e-05   2   -3    2
    9.8566131e-06   2   -5    2
    2.9142951e-06   2    24    25
    7.8213808e-07   2   -3    6
    7.2412911e-07   2   -1    2
    3.3443486e-08   2   -1    4
    1.9958473e-08   2   -1    6
    9.2531702e-09   2   -11    12
    7.0251067e-10   2    24    35
    5.5988743e-10   2    24    36

DECAY 6  2.43
    1   2    5    24

DECAY 15 -1
