BLOCK SPINFO
   1   SPheno
   2   v4.0.5be

BLOCK SPHENOINFO
   1   2
   2   2

BLOCK MODSEL
   1   0

BLOCK MINPAR
   3    27.563697
   4   -1

BLOCK EXTPAR
   0    2093.8133
   1    4976.5209
   2   -3138.9961
   3    4276.7524
   11   -3720.8709
   12    5999.3547
   13    1061.0526
   23   -470.88106
   25    26.667995
   26    505.96852
   31    3245.7287
   32    3245.7287
   33    3729.7132
   34    2717.0806
   35    2717.0806
   36    4545.7707
   41    4166.2774
   42    4166.2774
   43    1174.143
   44    4743.6495
   45    4743.6495
   46    3844.6093
   47    2691.4978
   48    2691.4978
   49    4047.3828

BLOCK SMINPUTS
   1    127.90897
   2    1.1663787e-05
   3    0.1184
   4    91.1876
   5    4.18
   6    173.2
   7    1.777
   8    0
   11    0.00051099893
   12    0
   13    0.10565837
   14    0
   21    0.005
   22    0.0025
   23    0.095
   24    1.27

BLOCK GAUGE Q=  2093.8133
   1    0.35536298
   2    0.66519887
   3    1.219778

BLOCK YU Q=  2093.8133
   1   1    8.3902647e-06
   2   2    0.0042622545
   3   3    1.0136114

BLOCK YD Q=  2093.8133
   1   1    0.00044962068
   2   2    0.008542793
   3   3    0.44588283

BLOCK YE Q=  2093.8133
   1   1    7.8462097e-05
   2   2    0.016223473
   3   3    0.27285213

BLOCK AU Q=  2093.8133
   1   1    0
   2   2    0
   3   3   -3720.8709

BLOCK AD Q=  2093.8133
   1   1    0
   2   2    0
   3   3    5999.3549

BLOCK AE Q=  2093.8133
   1   1    0
   2   2    0
   3   3    1061.0526

BLOCK MSOFT Q=  2093.8133
   1    4976.5209
   2   -3138.9961
   3    4276.7524
   21   -37554.478
   22   -303196.16
   31    3245.7287
   32    3245.7287
   33    3729.7132
   34    2717.0806
   35    2717.0806
   36    4545.7707
   41    4166.2774
   42    4166.2774
   43    1174.143
   44    4743.6495
   45    4743.6495
   46    3844.6093
   47    2691.4978
   48    2691.4978
   49    4047.3828

BLOCK MASS
   6    173.2
   23    91.1876
   24    80.429995
   15    1.777
   25    122.48056
   35    506.01639
   36    505.96852
   37    513.49209
   1000001    4229.4178
   2000001    2724.3733
   1000002    4228.7769
   2000002    4790.8189
   1000003    4229.4171
   2000003    2724.3724
   1000004    4228.7762
   2000004    4790.8188
   1000005    1135.8453
   2000005    4085.6459
   1000006    1133.1308
   2000006    3868.9744
   1000011    3263.0384
   2000011    2707.3965
   1000012    3261.6516
   1000013    3263.0338
   2000013    2707.3877
   1000014    3261.6475
   1000015    3743.9985
   2000015    4542.6724
   1000016    3742.7516
   1000021    4346.9399
   1000022   -481.97718
   1000023    483.3772
   1000025   -3166.9624
   1000035    4967.3832
   1000024    482.6162
   1000037    3167.1775

BLOCK ALPHA
      -0.039993482

BLOCK HMIX Q=  2093.8133
   1   -470.88106
   2    26.667995
   3    243.61366
   4    256004.15

BLOCK STOPMIX
   1   1    0.9992611
   1   2    0.038435074
   2   1   -0.038435074
   2   2    0.9992611

BLOCK SBOTMIX
   1   1   -0.9999957
   1   2    0.0029340318
   2   1   -0.0029340318
   2   2   -0.9999957

BLOCK STAUMIX
   1   1   -0.99999324
   1   2    0.0036766627
   2   1   -0.0036766627
   2   2   -0.99999324

BLOCK NMIX
   1   1   -0.0058350586
   1   2   -0.021618912
   1   3   -0.70752989
   1   4    0.70632856
   2   1    0.0066009933
   2   2    0.014901049
   2   3   -0.70666714
   2   4   -0.70735843
   3   1    0.000142827
   3   2   -0.99965523
   3   3    0.0047675447
   3   4   -0.025820059
   4   1   -0.99996118
   4   2    8.1734765e-05
   4   3   -0.00053556662
   4   4   -0.008794766

BLOCK UMIX
   1   1   -0.0067431103
   1   2   -0.99997726
   2   1   -0.99997726
   2   2    0.0067431103

BLOCK VMIX
   1   1    0.036519442
   1   2    0.99933294
   2   1    0.99933294
   2   2   -0.036519442

BLOCK HIGGSBOUNDSINPUTHIGGSCOUPLINGSFERMIONS
       0, 711.18197,3,36,15,15

BLOCK HIGGSBOUNDSINPUTHIGGSCOUPLINGSBOSONS
       0,4,36,21,21,23

BLOCK SPHENOLOWENERGY
   1    0.00041666547
   2    1.5900713e-06
   3    3.5259506e-05
   4    1.9619871e-15
   5    8.3812779e-11
   6    1.7481782e-08
   7    6.6564226e-14
   8    2.8435871e-09
   9    6.0110189e-07
   10    7.9344515e-05
   11    0.81959846
   12    0.54201446
   13    19.298782
   14    0
   15    0
   16    0.0021583785
   17    2.2816882e-15
   18    2.4808373e-11
   19    8.2921034e-11
   20    9.7839733e-16
   21    4.1829022e-11
   22    1.0210701e-08
   23    0
   24    0
   25    0
   26    0
   27    0
   28    0
   29    0
   30    0
   31    0
   39    6.3806933e-05
   40    0
   41    0
   42    0

BLOCK FWCOEF Q=  160
   305   4422   0   0   -0.18881911
   305   4422   0   2   -0.28417184
   305   4322   0   2   -0.0017437368
   305   6421   0   0   -0.095227835
   305   6421   0   2   -0.18937136
   305   6321   0   2   -0.0017742122
   3051111   4133   0   0    1.6038124
   3051111   4133   0   2    1.6042461
   3051111   4233   0   2   -4.4671841e-05
   3051111   4137   0   0   -4.4265045
   3051111   4137   0   2   -4.4255006
   3051111   4237   0   2    0.00034303239
   3051313   4133   0   0    1.6038124
   3051313   4133   0   2    1.6042459
   3051313   4233   0   2   -4.4699419e-05
   3051313   4137   0   0   -4.4265045
   3051313   4137   0   2   -4.4255009
   3051313   4237   0   2    0.00034305954
   3051212   4137   0   0    1.5053501
   3051212   4137   0   2    1.5051329
   3051212   4237   0   2   -7.4560072e-05
   3051414   4137   0   0    1.5053501
   3051414   4137   0   2    1.5051329
   3051414   4237   0   2   -7.4554099e-05
   3051616   4137   0   0    1.5053501
   3051616   4137   0   2    1.505133
   3051616   4237   0   2   -7.2870938e-05

BLOCK IMFWCOEF Q=  160
   305   4422   0   0    3.8579676e-07
   305   4422   0   2    7.2923937e-06
   305   4322   0   2   -2.2287447e-06
   305   6421   0   0    3.3046044e-07
   305   6421   0   2    9.2520812e-06
   305   6321   0   2   -7.485428e-07
   3051111   4133   0   2   -7.2073934e-07
   3051111   4233   0   2    3.2457036e-06
   3051111   4137   0   2    6.9403306e-06
   3051111   4237   0   2   -2.4839295e-05
   3051313   4133   0   2   -7.2073821e-07
   3051313   4233   0   2    3.2457015e-06
   3051313   4137   0   2    6.9403324e-06
   3051313   4237   0   2   -2.4839301e-05
   3051212   4137   0   2   -1.4899849e-06
   3051212   4237   0   2    5.3989459e-06
   3051414   4137   0   2   -1.4899849e-06
   3051414   4237   0   2    5.3989459e-06
   3051616   4137   0   2   -1.4891157e-06
   3051616   4237   0   2    5.398946e-06

DECAY 23  2.4952


DECAY 24  2.085


DECAY 2000011  0.00099048226
    0.56107189   2    1000023    11
    0.43861428   2    1000022    11
    0.00031382462   2   -1000024    12

DECAY 1000011  0.15890027
    0.60583802   2   -1000037    12
    0.30401719   2    1000025    11
    0.052919219   2    1000022    11
    0.029361632   2    1000023    11
    0.0078639266   2   -1000024    12

DECAY 2000013  0.027568523
    0.48204375   2   -1000024    14
    0.26084189   2    1000023    13
    0.25711436   2    1000022    13

DECAY 1000013  0.17528666
    0.54915139   2   -1000037    14
    0.27557092   2    1000025    13
    0.094661458   2    1000022    13
    0.073179187   2    1000023    13
    0.0071287691   2   -1000024    14
    0.0003078916   2    2000013    25

DECAY 1000015  9.378106
    0.2874118   2    1000022    15
    0.28603704   2    1000023    15
    0.28422522   2   -1000037    16
    0.14209456   2    1000025    15
    0.00023138035   2   -1000024    16

DECAY 2000015  13.38534
    0.4912801   2   -1000024    16
    0.24596758   2    1000022    15
    0.24548576   2    1000023    15
    0.0065082547   2    1000016   -37
    0.0032795103   2    1000015    36
    0.0032710065   2    1000015    35
    0.0021014324   2    1000016   -24
    0.0010415911   2    1000015    23
    0.0010156389   2    1000015    25

DECAY 1000012  0.18355258
    0.50917835   2    1000037    11
    0.25593667   2    1000025    12
    0.19958813   2    1000024    11
    0.025616914   2    1000022    12
    0.0096799376   2    1000023    12

DECAY 1000014  0.19987827
    0.46755043   2    1000037    13
    0.2650228   2    1000024    13
    0.23501265   2    1000025    14
    0.023524539   2    1000022    14
    0.0088892858   2    1000023    14

DECAY 1000016  9.3907599
    0.57532206   2    1000024    15
    0.28244713   2    1000037    15
    0.14143058   2    1000025    16
    0.00058075374   2    1000022    16
    0.00021946443   2    1000023    16

DECAY 2000001  0.00013132387
    0.51248867   2    1000023    1
    0.4092348   2    1000022    1
    0.078276538   2   -1000024    2

DECAY 1000001  10.785759
    0.66593252   2   -1000037    2
    0.33288418   2    1000025    1
    0.00071290614   2    1000022    1
    0.00031748836   2    1000023    1
    0.0001528977   2   -1000024    2

DECAY 2000003  0.0075326713
    0.49264386   2   -1000024    4
    0.25423687   2    1000023    3
    0.25311927   2    1000022    3

DECAY 1000003  10.793217
    0.66547127   2   -1000037    4
    0.33265378   2    1000025    3
    0.00098911255   2    1000022    3
    0.00059323494   2    1000023    3
    0.00029054542   2   -1000024    4

DECAY 1000005  17.492845
    0.82742646   2   -1000024    6
    0.086548644   2    1000022    5
    0.086024893   2    1000023    5

DECAY 2000005  94.659072
    0.33078766   2    1000006   -37
    0.16538057   2   -1000024    6
    0.16530649   2    1000005    36
    0.16520154   2    1000005    35
    0.083084225   2    1000022    5
    0.082890894   2    1000023    5
    0.0033094394   2    1000006   -24
    0.0023797207   2    1000005    25
    0.0016544691   2    1000005    23

DECAY 1000002  10.815793
    0.66261411   2    1000037    1
    0.33161897   2    1000025    2
    0.0044729995   2    1000024    1
    0.00086068633   2    1000022    2
    0.00043323411   2    1000023    2

DECAY 2000002  11.810536
    0.9999311   2    1000021    2

DECAY 1000004  10.823228
    0.66215825   2    1000037    3
    0.33139028   2    1000025    4
    0.0050209173   2    1000024    3
    0.00092876324   2    1000022    4
    0.00050178431   2    1000023    4

DECAY 2000004  11.813863
    0.99964387   2    1000021    4
    0.00014341268   2    1000024    3
    0.0001105036   2    1000023    4
    0.00010185547   2    1000022    4

DECAY 1000006  17.333587
    0.41285121   2    1000022    6
    0.41246204   2    1000023    6
    0.17322327   2    1000024    5
    0.0014566408   3    1000022    24    5

DECAY 2000006  255.799
    0.29939651   2    1000024    5
    0.17335864   2    1000005    24
    0.14948208   2    1000023    6
    0.14912763   2    1000022    6
    0.12819558   2    1000006    25
    0.086627489   2    1000006    23
    0.0068530478   2    1000005    37
    0.0035182318   2    1000006    35
    0.0034343057   2    1000006    36

DECAY 1000024  2.8054119e-13
    0.66442056   2    1000022    211
    0.17889011   3    1000022   -11    12
    0.15668933   3    1000022   -13    14

DECAY 1000037  118.61322
    0.2684903   2    1000006   -5
    0.26452873   2   -1000005    6
    0.059854484   2    1000024    25
    0.05860222   2    1000023    24
    0.058482433   2    1000022    24
    0.058466151   2    1000024    23
    0.056962519   2    37    1000022
    0.054355267   2    1000024    36
    0.05425707   2    1000024    35
    0.054248415   2    37    1000023
    0.0052171199   3    1000024    6   -6
    0.0033463466   3    1000023   -5    6
    0.0031787192   3    1000022   -5    6

DECAY 1000022 -1


DECAY 1000023  5.0848734e-10
    0.97953489   2    1000022    22
    0.0059426213   3    1000022    12   -12
    0.0044430623   3    1000022    1   -1
    0.0041914134   3    1000022    3   -3
    0.0034655884   3    1000022    2   -2
    0.001002836   3    1000022    11   -11
    0.00091498664   3    1000022    13   -13
    0.00015461136   3    1000024    1   -2
    0.00015461136   3   -1000024   -1    2

DECAY 1000025  122.06349
    0.13259373   2    1000006   -6
    0.13259373   2   -1000006    6
    0.1299815   2    1000005   -5
    0.1299815   2   -1000005    5
    0.056912179   2    1000024   -24
    0.056912179   2   -1000024    24
    0.05522649   2    37   -1000024
    0.05522649   2   -37    1000024
    0.039716037   2    1000022    25
    0.038632989   2    1000023    23
    0.038099939   2    1000023    35
    0.033971288   2    1000023    25
    0.032513345   2    1000022    35
    0.020217293   2    1000022    36
    0.018246445   2    1000022    23
    0.017346417   2    1000023    36
    0.0034115238   3    1000024    5   -6
    0.0034115238   3   -1000024   -5    6
    0.0025411051   3    1000022    6   -6
    0.0024475968   3    1000023    6   -6

DECAY 1000035  80.789224
    0.076322105   2    2000013   -13
    0.076322105   2   -2000013    13
    0.076321686   2    2000011   -11
    0.076321686   2   -2000011    11
    0.038930576   2    1000024   -24
    0.038930576   2   -1000024    24
    0.038319114   2    37   -1000024
    0.038319114   2   -37    1000024
    0.031395329   2    2000006   -6
    0.031395329   2   -2000006    6
    0.025170785   2    2000003   -3
    0.025170785   2   -2000003    3
    0.025170772   2    2000001   -1
    0.025170772   2   -2000001    1
    0.02480494   2    1000022    25
    0.024369871   2    1000023    35
    0.021798256   2    1000022    23
    0.021198366   2    1000023    25
    0.020803611   2    1000022    35
    0.017126576   2    1000023    23
    0.01639448   2    1000022    36
    0.014067418   2    1000023    36
    0.012499656   2    1000014   -14
    0.012499656   2   -1000014    14
    0.012499609   2    1000012   -12
    0.012499609   2   -1000012    12
    0.012475914   2    1000013   -13
    0.012475914   2   -1000013    13
    0.012475861   2    1000011   -11
    0.012475861   2   -1000011    11
    0.011577486   2    1000006   -6
    0.011577486   2   -1000006    6
    0.011571122   2    1000005   -5
    0.011571122   2   -1000005    5
    0.0072183499   2    1000016   -16
    0.0072183499   2   -1000016    16
    0.0072017318   2    1000015   -15
    0.0072017318   2   -1000015    15
    0.0053884266   2    2000005   -5
    0.0053884266   2   -2000005    5
    0.0041385075   2    2000015   -15
    0.0041385075   2   -2000015    15
    0.0027683568   3    1000024    5   -6
    0.0027683568   3   -1000024   -5    6
    0.0023836908   3    1000022    6   -6
    0.0023133662   3    1000023    6   -6
    0.0010041267   2    2000002   -2
    0.0010041267   2   -2000002    2
    0.0010041003   2    2000004   -4
    0.0010041003   2   -2000004    4
    0.00097469343   2    1000003   -3
    0.00097469343   2   -1000003    3
    0.00097469164   2    1000001   -1
    0.00097469164   2   -1000001    1
    0.0009744608   2    1000004   -4
    0.0009744608   2   -1000004    4
    0.00097445856   2    1000002   -2
    0.00097445856   2   -1000002    2

DECAY 1000021  326.20344
    0.17121276   2    1000005   -5
    0.17121276   2   -1000005    5
    0.17016433   2    1000006   -6
    0.17016433   2   -1000006    6
    0.07271564   2    2000003   -3
    0.07271564   2   -2000003    3
    0.072715583   2    2000001   -1
    0.072715583   2   -2000001    1
    0.0082315281   2    2000006   -6
    0.0082315281   2   -2000006    6
    0.0026810723   2    2000005   -5
    0.0026810723   2   -2000005    5
    0.00056718703   2    1000002   -2
    0.00056718703   2   -1000002    2
    0.00056716161   2    1000004   -4
    0.00056716161   2   -1000004    4
    0.00056114131   2    1000003   -3
    0.00056114131   2   -1000003    3
    0.00056113461   2    1000001   -1
    0.00056113461   2   -1000001    1

DECAY 25  0.0041236928
    0.6498681   2   -5    5
    0.16379471   2   -24    24
    0.073808849   2   -15    15
    0.0638615   2    21    21
    0.026177279   2   -4    4
    0.018847284   2    23    23
    0.0020268322   2    22    22
    0.0011151927   2    22    23
    0.00025607571   2   -13    13
    0.00024336222   2   -3    3
    6.7287097e-07   2   -1    1
    1.3490459e-07   2   -2    2
    5.756902e-09   2   -11    11

DECAY 35  7.0738528
    0.87804086   2   -5    5
    0.11768575   2   -15    15
    0.002756991   2   -6    6
    0.00051119455   2    25    25
    0.00040888773   2   -13    13
    0.0003275234   2   -3    3
    0.00015530672   2    21    21
    7.6276564e-05   2   -24    24
    3.6047558e-05   2    23    23
    9.0555206e-07   2   -1    1
    1.2528445e-07   2    22    22
    7.2688828e-08   2   -4    4
    5.2177171e-08   2    22    23
    9.1883866e-09   2   -11    11
    3.7484138e-13   2   -2    2

DECAY 36  6.9872459
    0.87705916   2   -5    5
    0.11754642   2   -15    15
    0.0044030988   2   -6    6
    0.00040838292   2   -13    13
    0.00032712107   2   -3    3
    0.00019198723   2    21    21
    6.2670202e-05   2    23    25
    9.0443963e-07   2   -1    1
    1.4439489e-07   2    22    22
    6.0211934e-08   2   -4    4
    3.9912038e-08   2    22    23
    9.1770402e-09   2   -11    11
    3.1048237e-13   2   -2    2
    1.7026746e-37   2    25    25

DECAY 37  5.3128869
    0.85057047   2   -5    6
    0.14684637   2   -15    16
    0.0015505161   2   -5    4
    0.00051916638   2   -13    14
    0.00038656843   2   -3    4
    8.9285114e-05   2    24    25
    1.7677947e-05   2   -3    2
    1.1072417e-05   2   -5    2
    7.4068523e-06   2   -3    6
    1.072525e-06   2   -1    2
    3.1946938e-07   2   -1    6
    5.2605428e-08   2   -1    4
    1.2143357e-08   2   -11    12
    6.0752305e-09   2    24    36
    5.8848027e-09   2    24    35

DECAY 6  2.43
    1   2    5    24

DECAY 15 -1
