BLOCK SPINFO
   1   SPheno
   2   v4.0.5be

BLOCK SPHENOINFO
   1   2
   2   2

BLOCK MODSEL
   1   0

BLOCK MINPAR
   3    49.92101
   4    1

BLOCK EXTPAR
   0    3695.2838
   1    3980.2795
   2    1478.8879
   3    3101.5584
   11    2235.1706
   12   -2771.9008
   13    2714.4861
   23    1129.8531
   25    48.905928
   26    2585.4521
   31    3111.5335
   32    3111.5335
   33    2083.4186
   34    1456.2087
   35    1456.2087
   36    3996.8861
   41    2503.1943
   42    2503.1943
   43    2878.5456
   44    2666.6296
   45    2666.6296
   46    4523.4935
   47    2038.038
   48    2038.038
   49    4928.8509

BLOCK SMINPUTS
   1    127.90897
   2    1.1663787e-05
   3    0.1184
   4    91.1876
   5    4.18
   6    173.2
   7    1.777
   8    0
   11    0.00051099893
   12    0
   13    0.10565837
   14    0
   21    0.005
   22    0.0025
   23    0.095
   24    1.27

BLOCK GAUGE Q=  3695.2838
   1    0.35536298
   2    0.66519887
   3    1.219778

BLOCK YU Q=  3695.2838
   1   1    8.3861247e-06
   2   2    0.0042601513
   3   3    1.0131112

BLOCK YD Q=  3695.2838
   1   1    0.00082414393
   2   2    0.015658735
   3   3    0.81729253

BLOCK YE Q=  3695.2838
   1   1    0.00014381914
   2   2    0.029737237
   3   3    0.50013141

BLOCK AU Q=  3695.2838
   1   1    0
   2   2    0
   3   3    2235.1706

BLOCK AD Q=  3695.2838
   1   1    0
   2   2    0
   3   3   -2771.9015

BLOCK AE Q=  3695.2838
   1   1    0
   2   2    0
   3   3    2714.4861

BLOCK MSOFT Q=  3695.2838
   1    3980.2795
   2    1478.8879
   3    3101.5584
   21    5636103
   22   -1068768
   31    3111.5335
   32    3111.5335
   33    2083.4186
   34    1456.2087
   35    1456.2087
   36    3996.8861
   41    2503.1943
   42    2503.1943
   43    2878.5456
   44    2666.6296
   45    2666.6296
   46    4523.4935
   47    2038.038
   48    2038.038
   49    4928.8509

BLOCK MASS
   6    173.2
   23    91.1876
   24    80.429995
   15    1.777
   25    121.13491
   35    2584.9439
   36    2585.4521
   37    2586.5747
   1000001    2670.6857
   2000001    2210.0226
   1000002    2669.4775
   2000002    2816.0099
   1000003    2670.6807
   2000003    2210.0112
   1000004    2669.4721
   2000004    2816.0092
   1000005    2993.7025
   2000005    4978.629
   1000006    2995.4686
   2000006    4558.593
   1000011    3123.5246
   2000011    1485.4202
   1000012    3122.0945
   1000013    3123.4893
   2000013    1485.3177
   1000014    3122.0519
   1000015    2085.5658
   2000015    3987.4089
   1000016    2083.7992
   1000021    3269.7308
   1000022    1137.9181
   1000023   -1147.6896
   1000025    1526.6507
   1000035    3916.0147
   1000024    1139.1929
   1000037    1526.8425

BLOCK ALPHA
      -0.020109627

BLOCK HMIX Q=  3695.2838
   1    1129.8531
   2    48.905928
   3    243.03984
   4    6684562.7

BLOCK STOPMIX
   1   1   -0.99974977
   1   2    0.022369422
   2   1   -0.022369422
   2   2   -0.99974977

BLOCK SBOTMIX
   1   1    0.99997458
   1   2    0.0071303426
   2   1   -0.0071303426
   2   2    0.99997458

BLOCK STAUMIX
   1   1    0.99996667
   1   2    0.0081642129
   2   1   -0.0081642129
   2   2    0.99996667

BLOCK NMIX
   1   1   -0.011289342
   1   2    0.14806661
   1   3   -0.70185114
   1   4    0.69667339
   2   1   -0.0060008077
   2   2    0.020649769
   2   3    0.70656056
   2   4    0.70732578
   3   1    0.0021988266
   3   2    0.98876171
   3   3    0.090344249
   3   4   -0.1190939
   4   1   -0.99991585
   4   2    0.00037865763
   4   3    0.0038824813
   4   4   -0.012372418

BLOCK UMIX
   1   1   -0.12826429
   1   2    0.99174002
   2   1    0.99174002
   2   2    0.12826429

BLOCK VMIX
   1   1   -0.16909035
   1   2    0.98560055
   2   1    0.98560055
   2   2    0.16909035

BLOCK HIGGSBOUNDSINPUTHIGGSCOUPLINGSFERMIONS
       0, 2391.7898,3,36,15,15

BLOCK HIGGSBOUNDSINPUTHIGGSCOUPLINGSBOSONS
       0,4,36,21,21,23

BLOCK SPHENOLOWENERGY
   1    0.00032929573
   2    1.5891123e-06
   3    3.5249913e-05
   4    2.5985152e-15
   5    1.1100597e-10
   6    2.3259488e-08
   7    8.6566657e-14
   8    3.6981375e-09
   9    7.8518429e-07
   10    9.4623336e-05
   11    0.97742284
   12    0.54192838
   13    19.352524
   14    0
   15    0
   16    0.0021572609
   17    2.2816602e-15
   18    2.4798085e-11
   19    8.2899894e-11
   20    2.445809e-15
   21    1.0455946e-10
   22    4.6940405e-08
   23    0
   24    0
   25    0
   26    0
   27    0
   28    0
   29    0
   30    0
   31    0
   39    7.753464e-05
   40    0
   41    0
   42    0

BLOCK FWCOEF Q=  160
   305   4422   0   0   -0.18881911
   305   4422   0   2   -0.19804995
   305   4322   0   2   -0.00018415183
   305   6421   0   0   -0.095227835
   305   6421   0   2   -0.10686133
   305   6321   0   2   -0.00023867581
   3051111   4133   0   0    1.6246987
   3051111   4133   0   2    1.6249455
   3051111   4233   0   2    0.00043589081
   3051111   4137   0   0   -4.4473908
   3051111   4137   0   2   -4.4455626
   3051111   4237   0   2   -0.0032353136
   3051313   4133   0   0    1.6246987
   3051313   4133   0   2    1.6249447
   3051313   4233   0   2    0.00043588818
   3051313   4137   0   0   -4.4473908
   3051313   4137   0   2   -4.4455633
   3051313   4237   0   2   -0.0032353157
   3051212   4137   0   0    1.5053501
   3051212   4137   0   2    1.504959
   3051212   4237   0   2    0.00069990867
   3051414   4137   0   0    1.5053501
   3051414   4137   0   2    1.504959
   3051414   4237   0   2    0.00069990893
   3051616   4137   0   0    1.5053501
   3051616   4137   0   2    1.5049589
   3051616   4237   0   2    0.00069997987

BLOCK IMFWCOEF Q=  160
   305   4422   0   0    3.8579232e-07
   305   4422   0   2    2.6172e-05
   305   4322   0   2   -3.1376834e-07
   305   6421   0   0    3.3045663e-07
   305   6421   0   2   -1.7100064e-08
   305   6321   0   2   -4.4137581e-07
   3051111   4133   0   2    1.8462358e-07
   3051111   4233   0   2    9.1802059e-06
   3051111   4137   0   2    9.9483201e-07
   3051111   4237   0   2   -6.8142388e-05
   3051313   4133   0   2    1.8461567e-07
   3051313   4233   0   2    9.1801803e-06
   3051313   4137   0   2    9.9484125e-07
   3051313   4237   0   2   -6.8142446e-05
   3051212   4137   0   2   -1.3437466e-07
   3051212   4237   0   2    1.4741526e-05
   3051414   4137   0   2   -1.3437474e-07
   3051414   4237   0   2    1.4741526e-05
   3051616   4137   0   2   -1.373515e-07
   3051616   4237   0   2    1.4741525e-05

DECAY 23  2.4952


DECAY 24  2.085


DECAY 2000011  0.00020623427
    0.78757836   2    1000022    11
    0.21192721   2    1000023    11
    0.00049442854   2   -1000024    12

DECAY 1000011  24.020698
    0.65210843   2   -1000037    12
    0.32492055   2    1000025    11
    0.014155522   2   -1000024    12
    0.0086851611   2    1000022    11
    0.00013033056   2    1000023    11

DECAY 2000013  0.0088776842
    0.49083043   2   -1000024    14
    0.26564473   2    1000022    13
    0.24352484   2    1000023    13

DECAY 1000013  24.064006
    0.65091821   2   -1000037    14
    0.32433847   2    1000025    13
    0.014129789   2   -1000024    14
    0.0095152765   2    1000022    13
    0.00098304269   2    1000023    13
    0.00011520968   2    2000013    25

DECAY 1000015  11.137462
    0.34852933   2   -1000037    16
    0.23524386   2    1000022    15
    0.22611823   2    1000023    15
    0.1754614   2    1000025    15
    0.014647181   2   -1000024    16

DECAY 2000015  35.58718
    0.46119386   2   -1000024    16
    0.23428273   2    1000023    15
    0.23101821   2    1000022    15
    0.03093931   2    1000016   -24
    0.015425994   2    1000015    23
    0.014686406   2    1000015    25
    0.0078485125   2   -1000037    16
    0.0038962468   2    1000025    15
    0.00070872699   2    1000035    15

DECAY 1000012  24.056301
    0.64244205   2    1000037    11
    0.32256811   2    1000025    12
    0.02454644   2    1000024    11
    0.010200237   2    1000022    12
    0.0002431635   2    1000023    12

DECAY 1000014  24.096684
    0.64136771   2    1000037    13
    0.32201763   2    1000025    14
    0.026188995   2    1000024    13
    0.010182919   2    1000022    14
    0.00024275062   2    1000023    14

DECAY 1000016  11.158408
    0.47214166   2    1000024    15
    0.34597042   2    1000037    15
    0.17204759   2    1000025    16
    0.0096133123   2    1000022    16
    0.00022702306   2    1000023    16

DECAY 2000001  0.00014218498
    0.65313053   2    1000022    1
    0.22260773   2    1000023    1
    0.11138202   2   -1000024    2
    0.011935686   2    1000025    1
    0.00094403738   2   -1000037    2

DECAY 1000001  16.122717
    0.649894   2   -1000037    2
    0.32282119   2    1000025    1
    0.01605426   2   -1000024    2
    0.011001135   2    1000022    1
    0.00022935958   2    1000023    1

DECAY 2000003  0.011638115
    0.49123269   2   -1000024    4
    0.25370961   2    1000022    3
    0.24868789   2    1000023    3
    0.0041634735   2   -1000037    4
    0.0022063491   2    1000025    3

DECAY 1000003  16.13226
    0.64950715   2   -1000037    4
    0.32263166   2    1000025    3
    0.01608268   2   -1000024    4
    0.011260019   2    1000022    3
    0.00049652334   2    1000023    3

DECAY 1000005  94.740939
    0.45367957   2   -1000024    6
    0.16372368   2   -1000037    6
    0.15390765   2    1000022    5
    0.15254835   2    1000023    5
    0.076140749   2    1000025    5

DECAY 2000005  248.84872
    0.51068007   2    1000021    5
    0.2339156   2   -1000024    6
    0.11902911   2    1000023    5
    0.11742724   2    1000022    5
    0.0048027814   2    1000005    25
    0.0044410464   2    1000006   -24
    0.0039100392   2   -1000037    6
    0.0022243285   2    1000005    23
    0.0019445316   2    1000025    5
    0.0016252246   2    1000035    5

DECAY 1000002  16.161327
    0.63948665   2    1000037    1
    0.32213122   2    1000025    2
    0.027811779   2    1000024    1
    0.010385119   2    1000022    2
    0.00018523199   2    1000023    2

DECAY 2000002  0.0007337414
    0.76472196   2    1000022    2
    0.21461487   2    1000023    2
    0.020659446   2    1000025    2

DECAY 1000004  16.170505
    0.63912643   2    1000037    3
    0.32194709   2    1000025    4
    0.028323555   2    1000024    3
    0.010398054   2    1000022    4
    0.00020487395   2    1000023    4

DECAY 2000004  0.0021448165
    0.42248915   2    1000022    4
    0.32210543   2    1000024    3
    0.23823623   2    1000023    4
    0.010412251   2    1000025    4
    0.0067560626   2    1000037    3

DECAY 1000006  97.58486
    0.29693722   2    1000024    5
    0.22628762   2    1000023    6
    0.22008713   2    1000022    6
    0.14919346   2    1000037    5
    0.080145809   2    1000025    6
    0.027348767   3    1000022    24    5

DECAY 2000006  262.85357
    0.32034847   2    1000021    6
    0.30384691   2    1000024    5
    0.1548636   2    1000023    6
    0.15115613   2    1000022    6
    0.023558439   2    1000006    25
    0.022477086   2    1000005    24
    0.011189983   2    1000006    23
    0.0066704788   2    1000037    5
    0.0032890571   2    1000025    6
    0.0025998389   2    1000035    6

DECAY 1000024  2.7398995e-12
    0.60400266   3    1000022   -1    2
    0.20135064   3    1000022   -11    12
    0.1946467   3    1000022   -13    14

DECAY 1000037  8.8030791
    0.2709651   2    1000023    24
    0.24644504   2    1000022    24
    0.24300248   2    1000024    23
    0.23660566   2    1000024    25
    0.0014502797   3    1000022   -5    6
    0.0014166879   3    1000023   -5    6
    0.00011009358   3    1000024    6   -6

DECAY 1000022 -1


DECAY 1000023  8.6731531e-07
    0.31483208   2    1000022    22
    0.070887923   3    1000022    12   -12
    0.070658833   3    1000024    1   -2
    0.070658833   3   -1000024   -1    2
    0.063381936   3    1000024    3   -4
    0.063381936   3   -1000024   -3    4
    0.053007839   3    1000022    1   -1
    0.052949824   3    1000022    3   -3
    0.041341968   3    1000022    2   -2
    0.032983544   3    1000022    4   -4
    0.023552963   3    1000024    11   -12
    0.023552963   3   -1000024   -11    12
    0.023535233   3    1000024    13   -14
    0.023535233   3   -1000024   -13    14
    0.019108906   3    1000024    15   -16
    0.019108906   3   -1000024   -15    16
    0.011962401   3    1000022    11   -11
    0.011942139   3    1000022    13   -13
    0.0073389681   3    1000022    15   -15
    0.0022775735   3    1000022    5   -5

DECAY 1000025  10.809591
    0.21825557   2    1000023    23
    0.20364574   2    1000024   -24
    0.20364574   2   -1000024    24
    0.18605376   2    1000022    25
    0.18195559   2    1000023    25
    0.00405163   2    1000022    23
    0.0011704507   3    1000024    5   -6
    0.0011704507   3   -1000024   -5    6

DECAY 1000035  71.185575
    0.10128379   2    2000013   -13
    0.10128379   2   -2000013    13
    0.10127909   2    2000011   -11
    0.10127909   2   -2000011    11
    0.042963124   2    2000004   -4
    0.042963124   2   -2000004    4
    0.042963118   2    2000002   -2
    0.042963118   2   -2000002    2
    0.035378979   2    1000024   -24
    0.035378979   2   -1000024    24
    0.028996521   2    1000023    23
    0.026326256   2    1000022    25
    0.025304841   2    1000023    25
    0.021393051   2    2000003   -3
    0.021393051   2   -2000003    3
    0.021392844   2    2000001   -1
    0.021392844   2   -2000001    1
    0.017777089   2    1000016   -16
    0.017777089   2   -1000016    16
    0.017704984   2    1000015   -15
    0.017704984   2   -1000015    15
    0.0076619867   2    1000022    23
    0.0062514525   2    1000023    35
    0.0060489686   2    37   -1000024
    0.0060489686   2   -37    1000024
    0.0057821008   2    1000022    35
    0.0045934504   2    1000014   -14
    0.0045934504   2   -1000014    14
    0.0045930135   2    1000012   -12
    0.0045930135   2   -1000012    12
    0.0045657407   2    1000013   -13
    0.0045657407   2   -1000013    13
    0.0045653778   2    1000011   -11
    0.0045653778   2   -1000011    11
    0.0033086242   2    1000003   -3
    0.0033086242   2   -1000003    3
    0.0033086011   2    1000001   -1
    0.0033086011   2   -1000001    1
    0.0032857675   2    1000004   -4
    0.0032857675   2   -1000004    4
    0.0032857393   2    1000002   -2
    0.0032857393   2   -1000002    2
    0.0022420269   2    1000006   -6
    0.0022420269   2   -1000006    6
    0.0019966114   2    1000005   -5
    0.0019966114   2   -1000005    5
    0.0018628608   3    1000024    5   -6
    0.0018628608   3   -1000024   -5    6
    0.0014215481   3    1000022    6   -6
    0.0013993938   3    1000023    6   -6
    0.0013851467   2    1000037   -24
    0.0013851467   2   -1000037    24
    0.0011708282   2    1000025    25
    0.00034277051   2    1000022    36
    0.00029724264   2    1000023    36
    0.0002210042   2    1000025    23

DECAY 1000021  117.5803
    0.12142085   2    2000003   -3
    0.12142085   2   -2000003    3
    0.12141875   2    2000001   -1
    0.12141875   2   -2000001    1
    0.045763957   2    1000004   -4
    0.045763957   2   -1000004    4
    0.045763301   2    1000002   -2
    0.045763301   2   -1000002    2
    0.045598494   2    1000003   -3
    0.045598494   2   -1000003    3
    0.0455978   2    1000001   -1
    0.0455978   2   -1000001    1
    0.027453366   2    2000002   -2
    0.027453366   2   -2000002    2
    0.027453349   2    2000004   -4
    0.027453349   2   -2000004    4
    0.010759196   2    1000005   -5
    0.010759196   2   -1000005    5
    0.0086269103   2    1000006   -6
    0.0086269103   2   -1000006    6

DECAY 25  0.0034452857
    0.63067009   2   -5    5
    0.16851045   2   -24    24
    0.074606306   2    21    21
    0.07227488   2   -15    15
    0.031090523   2   -4    4
    0.018869747   2    23    23
    0.0023182652   2    22    22
    0.0011713869   2    22    23
    0.00025065499   2   -13    13
    0.00023687713   2   -3    3
    6.5494237e-07   2   -1    1
    1.6022964e-07   2   -2    2
    5.6350568e-09   2   -11    11

DECAY 35  75.328962
    0.8039207   2   -5    5
    0.19257188   2   -15    15
    0.0010689603   2   -1000024    1000024
    0.00071524907   2    1000022    1000023
    0.00064720841   2   -13    13
    0.00044569263   2    1000022    1000022
    0.0003399333   2   -6    6
    0.00026411407   2   -3    3
    1.1913376e-05   2    21    21
    9.8832166e-06   2    1000023    1000023
    3.1480765e-06   2    25    25
    7.3024324e-07   2   -1    1
    3.2681331e-07   2    23    23
    1.2061332e-07   2   -24    24
    7.5899487e-08   2    22    23
    4.4200142e-08   2    22    22
    1.4536615e-08   2   -11    11
    3.6086697e-09   2   -4    4
    1.8599966e-14   2   -2    2

DECAY 36  72.592906
    0.8000841   2   -5    5
    0.19165508   2   -15    15
    0.0047809373   2   -1000024    1000024
    0.0020143453   2    1000022    1000022
    0.0006441375   2   -13    13
    0.00033620435   2   -6    6
    0.00026284366   2   -3    3
    0.00016115515   2    1000022    1000023
    4.0482481e-05   2    1000023    1000023
    1.9220652e-05   2    21    21
    7.2672876e-07   2   -1    1
    5.0305129e-07   2    23    25
    1.4322044e-07   2    22    23
    1.0273574e-07   2    22    22
    1.4467618e-08   2   -11    11
    3.4918039e-09   2   -4    4
    1.7987392e-14   2   -2    2
    1.8952384e-38   2    25    25

DECAY 37  72.368463
    0.81861568   2   -5    6
    0.17813018   2   -15    16
    0.0012140928   2   -5    4
    0.0011200892   2    1000023    1000024
    0.00062975393   2   -13    14
    0.00025799531   2   -3    4
    1.2062934e-05   2   -3    2
    8.9700716e-06   2    1000022    1000024
    8.6698765e-06   2   -5    2
    1.1972071e-06   2   -3    6
    7.1594812e-07   2   -1    2
    5.0569695e-07   2    24    25
    3.7460193e-08   2   -1    6
    3.3721123e-08   2   -1    4
    1.473001e-08   2   -11    12
    2.1697682e-13   2    24    35
    3.3536823e-14   2    24    36

DECAY 6  2.43
    1   2    5    24

DECAY 15 -1
