BLOCK SPINFO
   1   SPheno
   2   v4.0.5be

BLOCK SPHENOINFO
   1   2
   2   2

BLOCK MODSEL
   1   0

BLOCK MINPAR
   3    54.828102
   4    1

BLOCK EXTPAR
   0    1548.6289
   1   -117.2442
   2    655.83236
   3    3000
   11    2363.6786
   12    1366.4195
   13   -1454.057
   23    1434.2065
   25    53.512228
   26    4689.79
   31    633.47159
   32    633.47159
   33    1056.7141
   34    213.42207
   35    213.42207
   36    1596.059
   41    5000
   42    5000
   43    1989.8071
   44    5000
   45    5000
   46    1176.8259
   47    5000
   48    5000
   49    1414.4988

BLOCK SMINPUTS
   1    127.90897
   2    1.1663787e-05
   3    0.1184
   4    91.1876
   5    4.18
   6    173.2
   7    1.777
   8    0
   11    0.00051099893
   12    0
   13    0.10565837
   14    0
   21    0.005
   22    0.0025
   23    0.095
   24    1.27

BLOCK GAUGE Q=  1548.6289
   1    0.35536298
   2    0.66519887
   3    1.219778

BLOCK YU Q=  1548.6289
   1   1    8.385836e-06
   2   2    0.0042600047
   3   3    1.0130763

BLOCK YD Q=  1548.6289
   1   1    0.0009017365
   2   2    0.017132993
   3   3    0.89424004

BLOCK YE Q=  1548.6289
   1   1    0.00015735961
   2   2    0.032536977
   3   3    0.54721843

BLOCK AU Q=  1548.6289
   1   1    0
   2   2    0
   3   3    2363.6786

BLOCK AD Q=  1548.6289
   1   1    0
   2   2    0
   3   3    1366.4196

BLOCK AE Q=  1548.6289
   1   1    0
   2   2    0
   3   3   -1454.057

BLOCK MSOFT Q=  1548.6289
   1   -117.2442
   2    655.83236
   3    3000
   21    19882130
   22   -2009669.4
   31    633.47159
   32    633.47159
   33    1056.7141
   34    213.42207
   35    213.42207
   36    1596.059
   41    5000
   42    5000
   43    1989.8071
   44    5000
   45    5000
   46    1176.8259
   47    5000
   48    5000
   49    1414.4988

BLOCK MASS
   6    173.2
   23    91.1876
   24    80.429995
   15    1.777
   25    120.68577
   35    4686.5896
   36    4689.79
   37    4687.8282
   1000001    5028.173
   2000001    5017.4794
   1000002    5027.7207
   2000002    5021.4368
   1000003    5028.1903
   2000003    5017.4866
   1000004    5027.7292
   2000004    5021.4376
   1000005    1453.5306
   2000005    2020.0183
   1000006    1179.0554
   2000006    2034.0448
   1000011    652.56602
   2000011    162.60494
   1000012    647.366
   1000013    652.91007
   2000013    163.33579
   1000014    647.52989
   1000015    1089.0532
   2000015    1625.7013
   1000016    1092.987
   1000021    3190.2751
   1000022   -116.62212
   1000023    688.93047
   1000025   -1435.0665
   1000035    1438.823
   1000024    689.09465
   1000037    1439.5683

BLOCK ALPHA
      -0.018267289

BLOCK HMIX Q=  1548.6289
   1    1434.2065
   2    53.512228
   3    244.01039
   4    21994130

BLOCK STOPMIX
   1   1   -0.13098589
   1   2    0.99138423
   2   1   -0.99138423
   2   2   -0.13098589

BLOCK SBOTMIX
   1   1    0.057039094
   1   2    0.99837195
   2   1   -0.99837195
   2   2    0.057039094

BLOCK STAUMIX
   1   1    0.99498319
   1   2    0.10004227
   2   1   -0.10004227
   2   2    0.99498319

BLOCK NMIX
   1   1    0.99950069
   1   2    0.00022881974
   1   3    0.031525357
   1   4    0.0021158452
   2   1   -0.0019159681
   2   2   -0.99695183
   2   3    0.070254909
   2   4   -0.033876485
   3   1    0.023777002
   3   2   -0.025781991
   3   3   -0.70619382
   3   4   -0.70714937
   4   1   -0.020721016
   4   2    0.073636105
   4   3    0.70381865
   4   4   -0.70624901

BLOCK UMIX
   1   1   -0.99504554
   1   2    0.099420193
   2   1    0.099420193
   2   2    0.99504554

BLOCK VMIX
   1   1   -0.99884042
   1   2    0.048143652
   2   1    0.048143652
   2   2    0.99884042

BLOCK HIGGSBOUNDSINPUTHIGGSCOUPLINGSFERMIONS
       0, 2863.5586,3,36,15,15

BLOCK HIGGSBOUNDSINPUTHIGGSCOUPLINGSBOSONS
       0,4,36,21,21,23

BLOCK SPHENOLOWENERGY
   1    0.00034155837
   2    1.5861991e-06
   3    3.520883e-05
   4    4.1971499e-15
   5    1.7929867e-10
   6    3.7592712e-08
   7    1.4102668e-13
   8    6.0246961e-09
   9    1.2799298e-06
   10    9.5595503e-05
   11    0.98746495
   12    0.54377806
   13    19.423857
   14    0
   15    0
   16    0.0021699306
   17    2.2817875e-15
   18    2.4771853e-11
   19    8.2836312e-11
   20   -9.407616e-15
   21   -4.1626257e-10
   22    1.5070759e-07
   23    0
   24    0
   25    0
   26    0
   27    0
   28    0
   29    0
   30    0
   31    0
   39    9.3483218e-05
   40    0
   41    0
   42    0

BLOCK FWCOEF Q=  160
   305   4422   0   0   -0.18881911
   305   4422   0   2   -0.21312902
   305   4322   0   2   -0.00020393234
   305   6421   0   0   -0.095227835
   305   6421   0   2   -0.1118345
   305   6321   0   2   -0.00016852254
   3051111   4133   0   0    1.5939159
   3051111   4133   0   2    1.5943155
   3051111   4233   0   2    0.00029632338
   3051111   4137   0   0   -4.416608
   3051111   4137   0   2   -4.4106849
   3051111   4237   0   2   -0.0023007504
   3051313   4133   0   0    1.5939159
   3051313   4133   0   2    1.5943053
   3051313   4233   0   2    0.00029632058
   3051313   4137   0   0   -4.416608
   3051313   4137   0   2   -4.410695
   3051313   4237   0   2   -0.0023007564
   3051212   4137   0   0    1.5053501
   3051212   4137   0   2    1.5040739
   3051212   4237   0   2    0.0005011727
   3051414   4137   0   0    1.5053501
   3051414   4137   0   2    1.5040739
   3051414   4237   0   2    0.00050117274
   3051616   4137   0   0    1.5053501
   3051616   4137   0   2    1.5040738
   3051616   4237   0   2    0.00050118514

BLOCK IMFWCOEF Q=  160
   305   4422   0   0    3.8562889e-07
   305   4422   0   2    2.3959282e-05
   305   4322   0   2   -2.6252252e-06
   305   6421   0   0    3.3031665e-07
   305   6421   0   2   -8.7748528e-06
   305   6321   0   2   -1.6281022e-06
   3051111   4133   0   2   -6.5468623e-07
   3051111   4233   0   2    5.8733196e-06
   3051111   4137   0   2    3.9825387e-06
   3051111   4237   0   2   -4.5606536e-05
   3051313   4133   0   2   -6.5477211e-07
   3051313   4233   0   2    5.8732744e-06
   3051313   4137   0   2    3.9827801e-06
   3051313   4237   0   2   -4.5606648e-05
   3051212   4137   0   2   -6.0792993e-07
   3051212   4237   0   2    9.9345332e-06
   3051414   4137   0   2   -6.0792878e-07
   3051414   4237   0   2    9.9345331e-06
   3051616   4137   0   2   -6.1029546e-07
   3051616   4237   0   2    9.9345526e-06

DECAY 23  2.4952


DECAY 24  2.085


DECAY 2000011  0.19247561
    1   2    1000022    11

DECAY 1000011  0.7680928
    0.99999908   2    1000022    11

DECAY 2000013  0.19701396
    1   2    1000022    13

DECAY 1000013  0.79836247
    0.96267505   2    1000022    13
    0.03732494   2    2000013    25

DECAY 1000015  6.5754037
    0.52239069   2   -1000024    16
    0.26446287   2    1000023    15
    0.21314644   2    1000022    15

DECAY 2000015  17.904768
    0.44668069   2    1000022    15
    0.25942535   2    1000016   -24
    0.12944454   2    1000015    23
    0.11264404   2    1000015    25
    0.025316594   2   -1000037    16
    0.013312826   2    1000025    15
    0.012878206   2    1000035    15
    0.00017757944   2   -1000024    16
    0.00012016952   2    1000023    15

DECAY 1000012  0.75985711
    1   2    1000022    12

DECAY 1000014  0.76007529
    1   2    1000022    14

DECAY 1000016  6.5787746
    0.53293851   2    1000024    15
    0.26346851   2    1000023    16
    0.20359298   2    1000022    16

DECAY 2000001  143.34652
    0.98048158   2    1000021    1
    0.019501017   2    1000022    1

DECAY 1000001  206.21657
    0.6869556   2    1000021    1
    0.20461473   2   -1000024    2
    0.10263133   2    1000023    1
    0.0033874283   2    1000022    1
    0.0017880707   2   -1000037    2
    0.00054108937   2    1000035    1

DECAY 2000003  143.39656
    0.98014464   2    1000021    3
    0.019494442   2    1000022    3
    0.00017037854   2   -1000037    4

DECAY 1000003  206.24486
    0.68687011   2    1000021    3
    0.2045874   2   -1000024    4
    0.10261831   2    1000023    3
    0.0033871163   2    1000022    3
    0.0017952746   2   -1000037    4
    0.00060031194   2    1000035    3
    0.0001414821   2    1000025    3

DECAY 1000005  1.2619083
    0.66871431   2    1000022    5
    0.20879697   2   -1000024    6
    0.11036717   2    1000023    5
    0.005508883   2    1000025    5
    0.0033854939   2    1000035    5
    0.0032271828   2    1000006   -24

DECAY 2000005  69.893897
    0.38752602   2    1000006   -24
    0.18858584   2   -1000024    6
    0.14300704   2   -1000037    6
    0.098567036   2    1000023    5
    0.056516359   2    1000025    5
    0.055937806   2    1000035    5
    0.05182296   2    1000005    25
    0.014012065   2    1000005    23
    0.0040248806   2    1000022    5

DECAY 2000002  152.16034
    0.92639414   2    1000021    2
    0.073543801   2    1000022    2

DECAY 1000002  206.20758
    0.68675717   2    1000021    2
    0.20616745   2    1000024    1
    0.10276645   2    1000023    2
    0.0034047341   2    1000022    2
    0.00044256846   2    1000035    2
    0.00041958571   2    1000037    1

DECAY 2000004  152.16341
    0.92637555   2    1000021    4
    0.073542314   2    1000022    4

DECAY 1000004  206.23476
    0.68667066   2    1000021    4
    0.20614199   2    1000024    3
    0.10275308   2    1000023    4
    0.0034042906   2    1000022    4
    0.0005380089   2    1000037    3
    0.00044622568   2    1000035    4

DECAY 1000006  2.4732095
    0.98104423   2    1000022    6
    0.0088586477   2    1000023    4
    0.0066839082   2    1000024    5
    0.002602448   2    1000023    6
    0.00063950049   2    1000022    4
    0.00015282451   3    1000022    24    5

DECAY 2000006  71.403958
    0.23571496   2    1000006    25
    0.19980823   2    1000024    5
    0.19433178   2    1000006    23
    0.11113834   2    1000037    5
    0.095704468   2    1000023    6
    0.064756131   2    1000025    6
    0.064521214   2    1000035    6
    0.029162755   2    1000005    24
    0.0048621273   2    1000022    6

DECAY 1000024  0.14750772
    0.28296008   2    1000012   -11
    0.28082364   2    1000014   -13
    0.21686525   2   -1000011    12
    0.21290844   2   -1000013    14
    0.0056156582   2    1000022    24
    0.00043315515   2   -2000013    14
    0.00033208053   3    1000022   -15    16

DECAY 1000037  15.323234
    0.31112903   2    1000006   -5
    0.19352951   2    1000024    25
    0.18284251   2    1000023    24
    0.18074187   2    1000024    23
    0.06432953   2    1000022    24
    0.049841026   2    1000016   -15
    0.0038999566   3    1000023   -5    6
    0.0037312916   3    1000024    6   -6
    0.0025800981   2   -1000011    12
    0.0025786906   2   -1000013    14
    0.0018492078   3    1000022   -5    6
    0.0012328711   2    1000014   -13
    0.00095448235   2   -2000013    14
    0.00061000599   2    1000012   -11

DECAY 1000022 -1


DECAY 1000023  0.14653556
    0.14054334   2    1000012   -12
    0.14054334   2   -1000012    12
    0.13947141   2    1000014   -14
    0.13947141   2   -1000014    14
    0.10886211   2    1000011   -11
    0.10886211   2   -1000011    11
    0.10687194   2    1000013   -13
    0.10687194   2   -1000013    13
    0.0038537499   2    1000022    25
    0.0037008524   2    1000022    23
    0.00025622867   2    2000013   -13
    0.00025622867   2   -2000013    13
    0.0001743505   3    1000022    15   -15
    0.00015983003   3    1000022    12   -12

DECAY 1000025  15.538319
    0.18240031   2    1000024   -24
    0.18240031   2   -1000024    24
    0.16268211   2    1000023    23
    0.16143871   2    1000023    25
    0.094585537   2    1000006   -6
    0.094585537   2   -1000006    6
    0.031961636   2    1000022    25
    0.027409132   2    1000022    23
    0.024475013   2    1000015   -15
    0.024475013   2   -1000015    15
    0.0040042377   3    1000024    5   -6
    0.0040042377   3   -1000024   -5    6
    0.0011998356   3    1000023    6   -6
    0.0010593439   3    1000022    6   -6
    0.00060027346   2    2000013   -13
    0.00060027346   2   -2000013    13
    0.00032685165   2    1000013   -13
    0.00032685165   2   -1000013    13
    0.00019097701   2    1000012   -12
    0.00019097701   2   -1000012    12
    0.0001909276   2    1000014   -14
    0.0001909276   2   -1000014    14
    0.00014679263   3    1000022    5   -5
    0.00012784107   2    2000011   -11
    0.00012784107   2   -2000011    11

DECAY 1000035  13.651096
    0.20257445   2    1000024   -24
    0.20257445   2   -1000024    24
    0.19526658   2    1000023    25
    0.11030989   2    1000006   -6
    0.11030989   2   -1000006    6
    0.040896937   2    1000022    23
    0.039162247   2    1000022    25
    0.02795556   2    1000015   -15
    0.02795556   2   -1000015    15
    0.022560314   2    1000023    23
    0.0041184244   3    1000024    5   -6
    0.0041184244   3   -1000024   -5    6
    0.0014157625   3    1000023    6   -6
    0.0011438307   3    1000022    6   -6
    0.0010586948   2    1000012   -12
    0.0010586948   2   -1000012    12
    0.0010584226   2    1000014   -14
    0.0010584226   2   -1000014    14
    0.00091910069   2    1000013   -13
    0.00091910069   2   -1000013    13
    0.00064644452   2    2000013   -13
    0.00064644452   2   -2000013    13
    0.0005728913   2    1000011   -11
    0.0005728913   2   -1000011    11
    0.00029772237   2    1000016   -16
    0.00029772237   2   -1000016    16
    0.00017226632   3    1000022    5   -5
    0.00011082064   2    2000011   -11
    0.00011082064   2   -2000011    11

DECAY 1000021  198.36081
    0.18302204   2    1000006   -6
    0.18302204   2   -1000006    6
    0.14940918   2    1000005   -5
    0.14940918   2   -1000005    5
    0.085471782   2    2000005   -5
    0.085471782   2   -2000005    5
    0.079326719   2    2000006   -6
    0.079326719   2   -2000006    6
    0.0017365792   2    1000006   -4
    0.0017365792   2   -1000006    4
    0.00064274117   3    1000037    5   -6
    0.00064274117   3   -1000037   -5    6
    0.00028914298   3    1000035    6   -6
    0.00028374152   3    1000025    6   -6

DECAY 25  0.003382467
    0.63520188   2   -5    5
    0.16300335   2   -24    24
    0.075080071   2    21    21
    0.073069759   2   -15    15
    0.03161031   2   -4    4
    0.018089653   2    23    23
    0.0023063961   2    22    22
    0.0011438146   2    22    23
    0.00025405244   2   -13    13
    0.00023989114   2   -3    3
    6.6327765e-07   2   -1    1
    1.6290988e-07   2   -2    2
    5.7121099e-09   2   -11    11

DECAY 35  170.49269
    0.37872868   2   -5    5
    0.19978991   2   -15    15
    0.08726864   2   -1000024    1000037
    0.08726864   2   -1000037    1000024
    0.049090996   2    1000023    1000025
    0.046603878   2   -2000006    1000006
    0.046603878   2   -1000006    2000006
    0.036966513   2    1000023    1000035
    0.013337641   2    1000022    1000025
    0.012633355   2    1000022    1000035
    0.0083851725   2   -2000005    1000005
    0.0083851725   2   -1000005    2000005
    0.0060402262   2   -2000015    1000015
    0.0060402262   2   -1000015    2000015
    0.0037398619   2   -1000006    1000006
    0.0020098793   2   -2000006    2000006
    0.0019659112   2   -1000024    1000024
    0.00097872935   2    1000023    1000023
    0.00076775372   2   -13    13
    0.00068025169   2    1000025    1000035
    0.00049882856   2    1000022    1000023
    0.00049246071   2   -6    6
    0.00037626494   2    1000035    1000035
    0.00026882832   2   -3    3
    0.00025770099   2   -1000015    1000015
    0.00022409979   2   -1000037    1000037
    0.00021666175   2   -2000015    2000015
    0.00013840931   2   -1000005    1000005
    8.637791e-05   2    1000025    1000025
    8.3478027e-05   2   -2000005    2000005
    5.8463809e-05   2    1000022    1000022
    6.7544083e-06   2    21    21
    5.3301841e-06   2    25    25
    7.4330085e-07   2   -1    1
    7.2161766e-08   2    23    23
    1.7239819e-08   2   -11    11
    1.2773708e-08   2   -24    24
    1.2688761e-08   2    22    23
    1.1551117e-08   2   -2000013    2000013
    1.0790125e-08   2   -2000011    2000011
    8.8331839e-09   2   -2000013    1000013
    8.8331839e-09   2   -1000013    2000013
    7.5023474e-09   2    22    22
    7.2218197e-09   2   -1000011    1000011
    6.3650097e-09   2   -1000013    1000013
    3.6866264e-09   2   -4    4
    2.0705868e-13   2   -2000011    1000011
    2.0705868e-13   2   -1000011    2000011
    1.9009704e-14   2   -2    2

DECAY 36  162.74345
    0.3653574   2   -5    5
    0.1927556   2   -15    15
    0.09128835   2   -1000024    1000037
    0.09128835   2   -1000037    1000024
    0.051964952   2   -2000006    1000006
    0.051964952   2   -1000006    2000006
    0.050640775   2    1000023    1000035
    0.039432101   2    1000023    1000025
    0.013786836   2    1000022    1000035
    0.01344436   2    1000022    1000025
    0.0089061092   2   -2000005    1000005
    0.0089061092   2   -1000005    2000005
    0.0065768416   2   -2000015    1000015
    0.0065768416   2   -1000015    2000015
    0.0023122607   2   -1000024    1000024
    0.0011513095   2    1000023    1000023
    0.00074075397   2   -13    13
    0.00068174004   2    1000035    1000035
    0.00052448392   2    1000022    1000023
    0.00044144509   2   -1000037    1000037
    0.0004333041   2    1000025    1000035
    0.00036508973   2   -6    6
    0.00025930411   2   -3    3
    0.00013487991   2    1000025    1000025
    6.1158793e-05   2    1000022    1000022
    3.6646479e-06   2    21    21
    7.169609e-07   2   -1    1
    1.9274428e-07   2    23    25
    4.5904282e-08   2    22    23
    2.7277848e-08   2    22    22
    1.6633753e-08   2   -11    11
    9.3310714e-09   2   -2000013    1000013
    9.3310714e-09   2   -1000013    2000013
    3.020319e-09   2   -4    4
    2.2668136e-12   2    23    35
    2.1825466e-13   2   -2000011    1000011
    2.1825466e-13   2   -1000011    2000011
    1.5577911e-14   2   -2    2
    2.440605e-37   2    25    25

DECAY 37  152.98316
    0.38541735   2   -5    6
    0.18421707   2   -15    16
    0.098964606   2    1000023    1000037
    0.097764831   2    1000024    1000035
    0.097507387   2    1000024    1000025
    0.070008188   2   -2000005    1000006
    0.028665015   2    1000022    1000037
    0.019635974   2   -1000005    2000006
    0.013852508   2   -2000015    1000016
    0.001112412   2    1000022    1000024
    0.00065127283   2   -13    14
    0.00059384813   2    1000025    1000037
    0.00057164644   2   -5    4
    0.00027999441   2   -3    4
    0.00024317523   2   -1000005    1000006
    0.00023742954   2   -2000005    2000006
    0.00014817517   2   -1000015    1000016
    0.00010971096   2    1000035    1000037
    1.317852e-05   2   -3    2
    4.0821447e-06   2   -5    2
    9.6675158e-07   2   -3    6
    7.7729694e-07   2   -1    2
    2.0483552e-07   2    24    25
    4.8361506e-08   2   -2000013    1000014
    4.7210644e-08   2   -2000011    1000012
    3.6707494e-08   2   -1    4
    2.5156915e-08   2   -1    6
    1.8446201e-08   2   -1000013    1000014
    1.5233339e-08   2   -11    12
    5.1681245e-09   2    1000023    1000024
    4.3158703e-13   2   -1000011    1000012
    2.5943785e-14   2    24    35

DECAY 6  2.43
    1   2    5    24

DECAY 15 -1
