BLOCK SPINFO
   1   SPheno
   2   v4.0.5be

BLOCK SPHENOINFO
   1   2
   2   2

BLOCK MODSEL
   1   0

BLOCK MINPAR
   3    36.577568
   4    1

BLOCK EXTPAR
   0    3256.182
   1   -4769.438
   2   -2680.2652
   3    3536.5348
   11   -3806.718
   12    1703.6522
   13    6273.8258
   23    532.65361
   25    35.431886
   26    590.14224
   31    1556.6743
   32    1556.6743
   33    923.59961
   34    2382.7162
   35    2382.7162
   36    4562.5307
   41    2078.7989
   42    2078.7989
   43    1993.992
   44    3371.443
   45    3371.443
   46    4893.5637
   47    3854.6162
   48    3854.6162
   49    1184.4352

BLOCK SMINPUTS
   1    127.90897
   2    1.1663787e-05
   3    0.1184
   4    91.1876
   5    4.18
   6    173.2
   7    1.777
   8    0
   11    0.00051099893
   12    0
   13    0.10565837
   14    0
   21    0.005
   22    0.0025
   23    0.095
   24    1.27

BLOCK GAUGE Q=  3256.182
   1    0.35536298
   2    0.66519887
   3    1.219778

BLOCK YU Q=  3256.182
   1   1    8.3877107e-06
   2   2    0.0042609571
   3   3    1.0133028

BLOCK YD Q=  3256.182
   1   1    0.00059719747
   2   2    0.011346752
   3   3    0.59223275

BLOCK YE Q=  3256.182
   1   1    0.00010421533
   2   2    0.021548424
   3   3    0.36240904

BLOCK AU Q=  3256.182
   1   1    0
   2   2    0
   3   3   -3806.7213

BLOCK AD Q=  3256.182
   1   1    0
   2   2    0
   3   3    1703.6492

BLOCK AE Q=  3256.182
   1   1    0
   2   2    0
   3   3    6273.82

BLOCK MSOFT Q=  3256.182
   1   -4769.438
   2   -2680.2652
   3    3536.5348
   21    51594.594
   22   -280788.67
   31    1556.6743
   32    1556.6743
   33    923.59961
   34    2382.7162
   35    2382.7162
   36    4562.5307
   41    2078.7989
   42    2078.7989
   43    1993.992
   44    3371.443
   45    3371.443
   46    4893.5637
   47    3854.6162
   48    3854.6162
   49    1184.4352

BLOCK MASS
   6    173.2
   23    91.1876
   24    80.429995
   15    1.777
   25    122.23993
   35    590.1528
   36    590.14224
   37    596.32577
   1000001    2259.6864
   2000001    3958.8031
   1000002    2258.2601
   2000002    3496.6343
   1000003    2259.6836
   2000003    3958.7991
   1000004    2258.2574
   2000004    3496.6337
   1000005    1354.4349
   2000005    2152.4391
   1000006    2152.0953
   2000006    4926.6968
   1000011    1594.7016
   2000011    2391.9741
   1000012    1592.2939
   1000013    1594.6847
   2000013    2391.9479
   1000014    1592.2801
   1000015    969.30008
   2000015    4555.7754
   1000016    966.59454
   1000021    3649.4979
   1000022   -542.49202
   1000023    545.35402
   1000025   -2641.2716
   1000035   -4717.518
   1000024    544.59302
   1000037    2641.3421

BLOCK ALPHA
      -0.028959005

BLOCK HMIX Q=  3256.182
   1    532.65361
   2    35.431886
   3    243.18871
   4    348267.87

BLOCK STOPMIX
   1   1    0.99963115
   1   2    0.027158141
   2   1   -0.027158141
   2   2    0.99963115

BLOCK SBOTMIX
   1   1    0.01318008
   1   2    0.99991314
   2   1   -0.99991314
   2   2    0.01318008

BLOCK STAUMIX
   1   1    0.9999994
   1   2    0.0010982402
   2   1   -0.0010982402
   2   2    0.9999994

BLOCK NMIX
   1   1   -0.0071548738
   1   2    0.025400115
   1   3   -0.70787922
   1   4   -0.70584039
   2   1    0.0060034405
   2   2   -0.01793165
   2   3   -0.706313
   2   4    0.70764706
   3   1    0.00068451435
   3   2    0.99951645
   3   3    0.0053171001
   3   4    0.030628838
   4   1   -0.99995615
   4   2    0.00039481445
   4   3    0.00082815431
   4   4    0.0093198905

BLOCK UMIX
   1   1   -0.0075291477
   1   2    0.99997166
   2   1   -0.99997166
   2   2   -0.0075291477

BLOCK VMIX
   1   1    0.04335172
   1   2    0.99905987
   2   1    0.99905987
   2   2   -0.04335172

BLOCK HIGGSBOUNDSINPUTHIGGSCOUPLINGSFERMIONS
       0, 1255.4185,3,36,15,15

BLOCK HIGGSBOUNDSINPUTHIGGSCOUPLINGSBOSONS
       0,4,36,21,21,23

BLOCK SPHENOLOWENERGY
   1    0.00038219048
   2    1.5873898e-06
   3    3.5255039e-05
   4    2.5995786e-15
   5    1.1105068e-10
   6    2.3226755e-08
   7    8.6138442e-14
   8    3.6798226e-09
   9    7.8001702e-07
   10    7.7935309e-05
   11    0.80504191
   12    0.54170799
   13    19.27416
   14    0
   15    0
   16    0.0021569076
   17    2.2816798e-15
   18    2.480416e-11
   19    8.2909086e-11
   20   -2.0312909e-15
   21   -8.6842819e-11
   22   -2.8105703e-08
   23    0
   24    0
   25    0
   26    0
   27    0
   28    0
   29    0
   30    0
   31    0
   39    7.1127762e-05
   40    0
   41    0
   42    0

BLOCK FWCOEF Q=  160
   305   4422   0   0   -0.18881911
   305   4422   0   2   -0.24820786
   305   4322   0   2   -0.0011813881
   305   6421   0   0   -0.095227835
   305   6421   0   2   -0.16873576
   305   6321   0   2   -0.0014484987
   3051111   4133   0   0    1.6196591
   3051111   4133   0   2    1.6198862
   3051111   4233   0   2    0.00011530346
   3051111   4137   0   0   -4.4423512
   3051111   4137   0   2   -4.4409496
   3051111   4237   0   2   -0.00085986464
   3051313   4133   0   0    1.6196591
   3051313   4133   0   2    1.6198856
   3051313   4233   0   2    0.00011525038
   3051313   4137   0   0   -4.4423512
   3051313   4137   0   2   -4.4409503
   3051313   4237   0   2   -0.00085981384
   3051212   4137   0   0    1.5053501
   3051212   4137   0   2    1.5050485
   3051212   4237   0   2    0.00018623061
   3051414   4137   0   0    1.5053501
   3051414   4137   0   2    1.5050485
   3051414   4237   0   2    0.000186242
   3051616   4137   0   0    1.5053501
   3051616   4137   0   2    1.5050472
   3051616   4237   0   2    0.00018945245

BLOCK IMFWCOEF Q=  160
   305   4422   0   0    3.858381e-07
   305   4422   0   2   -6.4693654e-06
   305   4322   0   2    3.624253e-06
   305   6421   0   0    3.3049585e-07
   305   6421   0   2   -3.428014e-05
   305   6321   0   2    1.2249713e-06
   3051111   4133   0   2   -8.0960686e-07
   3051111   4233   0   2    8.1580906e-06
   3051111   4137   0   2    8.4814996e-06
   3051111   4237   0   2   -6.0978656e-05
   3051313   4133   0   2   -8.0959976e-07
   3051313   4233   0   2    8.1580817e-06
   3051313   4137   0   2    8.4815103e-06
   3051313   4237   0   2   -6.0978688e-05
   3051212   4137   0   2   -1.8009667e-06
   3051212   4237   0   2    1.320677e-05
   3051414   4137   0   2   -1.8009677e-06
   3051414   4237   0   2    1.320677e-05
   3051616   4137   0   2   -1.8229551e-06
   3051616   4237   0   2    1.3206772e-05

DECAY 23  2.4952


DECAY 24  2.085


DECAY 1000011  0.0043640362
    0.58560855   2    1000022    11
    0.27201522   2    1000023    11
    0.14237621   2   -1000024    12

DECAY 2000011  0.00094388478
    0.58676103   2    1000022    11
    0.41273917   2    1000023    11
    0.00049234354   2   -1000024    12

DECAY 1000013  0.015867459
    0.52478791   2    1000022    13
    0.4360549   2    1000023    13
    0.039157177   2   -1000024    14

DECAY 2000013  0.040981966
    0.48479318   2   -1000024    14
    0.25659742   2    1000022    13
    0.25126449   2    1000023    13
    0.0073290326   2    1000013    25

DECAY 1000015  1.1908255
    0.5033751   2    1000022    15
    0.49640283   2    1000023    15
    0.00022207093   2   -1000024    16

DECAY 2000015  65.712533
    0.32291314   2    1000016   -37
    0.17600617   2   -1000024    16
    0.16149094   2    1000015    35
    0.1614783   2    1000015    36
    0.088224517   2    1000022    15
    0.087823202   2    1000023    15
    0.0010273626   2    1000016   -24
    0.00051311603   2    1000015    23
    0.00051227024   2    1000015    25

DECAY 1000012  0.027668626
    0.74278371   2    1000024    11
    0.16900552   2    1000022    12
    0.088210761   2    1000023    12

DECAY 1000014  0.039143948
    0.81819087   2    1000024    13
    0.11945879   2    1000022    14
    0.062350332   2    1000023    14

DECAY 1000016  1.189415
    0.99782337   2    1000024    15
    0.0014333043   2    1000022    16
    0.00074332529   2    1000023    16

DECAY 1000001  0.010484475
    0.60009135   2    1000022    1
    0.30446212   2    1000023    1
    0.095446534   2   -1000024    2

DECAY 2000001  7.0458491
    0.99996591   2    1000021    1

DECAY 1000003  0.016329264
    0.54256434   2    1000022    3
    0.35191299   2    1000023    3
    0.10552267   2   -1000024    4

DECAY 2000003  7.06521
    0.99720197   2    1000021    3
    0.0013814196   2   -1000024    4
    0.00070782621   2    1000022    3
    0.00069994833   2    1000023    3

DECAY 1000005  12.956826
    0.48680196   2   -1000024    6
    0.25783168   2    1000022    5
    0.25536636   2    1000023    5

DECAY 2000005  55.249133
    0.68585354   2   -1000024    6
    0.11946142   2    1000022    5
    0.11891479   2    1000023    5
    0.034705606   2    1000005    36
    0.034693488   2    1000005    35
    0.004068906   2    1000005    25
    0.0023022518   2    1000005    23

DECAY 1000002  0.040808056
    0.81269172   2    1000024    1
    0.12588484   2    1000022    2
    0.061423433   2    1000023    2

DECAY 2000002  0.00064932814
    0.58634258   2    1000022    2
    0.41261108   2    1000023    2
    0.0010389964   2    1000025    2

DECAY 1000004  0.04665167
    0.8206234   2    1000024    3
    0.11786925   2    1000022    4
    0.061507342   2    1000023    4

DECAY 2000004  0.0030816851
    0.38949616   2    1000024    3
    0.31805609   2    1000022    4
    0.28234691   2    1000023    4
    0.0048224428   2    1000003    37
    0.0024220154   2    1000004    36
    0.0024218993   2    1000004    35
    0.00029016833   2    1000025    4
    0.0001420029   2    1000037    3

DECAY 1000006  55.843024
    0.3394598   2    1000023    6
    0.33827114   2    1000022    6
    0.23545102   2    1000024    5
    0.068071163   2    1000005    37
    0.014128339   3    1000022    24    5
    0.0045689479   2    1000005    24

DECAY 2000006  347.11305
    0.28267185   2    1000024    5
    0.22395966   2    1000021    6
    0.14146867   2    1000023    6
    0.14082312   2    1000022    6
    0.091432911   2    2000005    24
    0.070236305   2    1000006    25
    0.045682038   2    1000006    23
    0.0016889359   2    2000005    37
    0.00085017046   2    1000006    36
    0.00083649485   2    1000006    35
    0.00011363954   2    1000035    6

DECAY 1000024  2.1431482e-11
    0.59888328   3    1000022   -1    2
    0.19964114   3    1000022   -11    12
    0.19513531   3    1000022   -13    14
    0.0063402822   3    1000022   -3    4

DECAY 1000037  97.35435
    0.089414522   2   -1000015    16
    0.089410016   2    1000016   -15
    0.057849175   2    1000024    25
    0.054770335   2    1000023    24
    0.05467533   2    1000024    36
    0.054675058   2    1000024    35
    0.054604874   2    1000024    23
    0.054555993   2    1000022    24
    0.054502805   2    37    1000023
    0.052273631   2    37    1000022
    0.048304036   2    1000014   -13
    0.048303074   2    1000012   -11
    0.048225386   2   -1000013    14
    0.048224213   2   -1000011    12
    0.04052543   2    1000006   -5
    0.036483163   2   -2000005    6
    0.025881466   2    1000004   -3
    0.025881128   2    1000002   -1
    0.025750838   2   -1000003    4
    0.025750662   2   -1000001    2
    0.0041796476   3    1000024    6   -6
    0.0029509478   3    1000022   -5    6
    0.0028003554   3    1000023   -5    6

DECAY 1000022 -1


DECAY 1000023  4.2304197e-09
    0.92860505   2    1000022    22
    0.020834778   3    1000022    12   -12
    0.0155791   3    1000022    1   -1
    0.01534473   3    1000022    3   -3
    0.012150833   3    1000022    2   -2
    0.003515907   3    1000022    11   -11
    0.0034329563   3    1000022    13   -13
    0.00015844838   3    1000024    1   -2
    0.00015844838   3   -1000024   -1    2

DECAY 1000025  99.752512
    0.053520821   2    1000024   -24
    0.053520821   2   -1000024    24
    0.050870657   2    37   -1000024
    0.050870657   2   -37    1000024
    0.043635018   2    1000016   -16
    0.043635018   2   -1000016    16
    0.043622916   2    1000015   -15
    0.043622916   2   -1000015    15
    0.042692329   2    1000023    25
    0.039054299   2    1000022    35
    0.037746264   2    1000022    25
    0.035721178   2    1000023    23
    0.034700557   2    1000023    35
    0.023573596   2    1000014   -14
    0.023573596   2   -1000014    14
    0.023573129   2    1000012   -12
    0.023573129   2   -1000012    12
    0.023526713   2    1000013   -13
    0.023526713   2   -1000013    13
    0.023526141   2    1000011   -11
    0.023526141   2   -1000011    11
    0.019765592   2    1000006   -6
    0.019765592   2   -1000006    6
    0.019698003   2    2000005   -5
    0.019698003   2   -2000005    5
    0.017632681   2    1000022    23
    0.016056262   2    1000023    36
    0.01444373   2    1000022    36
    0.012640212   2    1000004   -4
    0.012640212   2   -1000004    4
    0.01264008   2    1000002   -2
    0.01264008   2   -1000002    2
    0.012547467   2    1000003   -3
    0.012547467   2   -1000003    3
    0.012547299   2    1000001   -1
    0.012547299   2   -1000001    1
    0.00318951   3    1000024    5   -6
    0.00318951   3   -1000024   -5    6
    0.0021501874   3    1000023    6   -6
    0.0020339719   3    1000022    6   -6

DECAY 1000035  108.55645
    0.060252197   2    2000013   -13
    0.060252197   2   -2000013    13
    0.060251284   2    2000011   -11
    0.060251284   2   -2000011    11
    0.03063048   2    1000005   -5
    0.03063048   2   -1000005    5
    0.029556512   2    2000004   -4
    0.029556512   2   -2000004    4
    0.02955649   2    2000002   -2
    0.02955649   2   -2000002    2
    0.027475277   2    1000024   -24
    0.027475277   2   -1000024    24
    0.026025234   2    37   -1000024
    0.026025234   2   -37    1000024
    0.025085545   2    1000016   -16
    0.025085545   2   -1000016    16
    0.024999227   2    1000015   -15
    0.024999227   2   -1000015    15
    0.021459465   2    1000014   -14
    0.021459465   2   -1000014    14
    0.021459369   2    1000012   -12
    0.021459369   2   -1000012    12
    0.021379491   2    1000013   -13
    0.021379491   2   -1000013    13
    0.021379374   2    1000011   -11
    0.021379374   2   -1000011    11
    0.017736484   2    1000023    25
    0.0172592   2    1000022    35
    0.016296269   2    1000023    23
    0.015692787   2    1000022    25
    0.015321097   2    1000023    35
    0.011354134   2    1000022    23
    0.010719269   2    1000023    36
    0.0096300136   2    1000022    36
    0.0057341542   2    2000005   -5
    0.0057341542   2   -2000005    5
    0.0056824752   2    1000006   -6
    0.0056824752   2   -1000006    6
    0.0054256319   2    1000003   -3
    0.0054256319   2   -1000003    3
    0.0054256239   2    1000001   -1
    0.0054256239   2   -1000001    1
    0.0053817642   2    1000004   -4
    0.0053817642   2   -1000004    4
    0.0053817593   2    1000002   -2
    0.0053817593   2   -1000002    2
    0.0031838411   2    2000003   -3
    0.0031838411   2   -2000003    3
    0.0031838109   2    2000001   -1
    0.0031838109   2   -2000001    1
    0.0018795569   3    1000024    5   -6
    0.0018795569   3   -1000024   -5    6
    0.0014658666   3    1000023    6   -6
    0.0014188431   3    1000022    6   -6
    0.00049582774   2    2000015   -15
    0.00049582774   2   -2000015    15
    0.0001326599   2    1000037   -24
    0.0001326599   2   -1000037    24
    0.00010422319   2    1000025    25

DECAY 1000021  337.63701
    0.11893067   2    1000005   -5
    0.11893067   2   -1000005    5
    0.068041724   2    2000005   -5
    0.068041724   2   -2000005    5
    0.067271246   2    1000006   -6
    0.067271246   2   -1000006    6
    0.060920238   2    1000004   -4
    0.060920238   2   -1000004    4
    0.060920072   2    1000002   -2
    0.060920072   2   -1000002    2
    0.060824772   2    1000003   -3
    0.060824772   2   -1000003    3
    0.060824585   2    1000001   -1
    0.060824585   2   -1000001    1
    0.0010761235   2    2000002   -2
    0.0010761235   2   -2000002    2
    0.0010760961   2    2000004   -4
    0.0010760961   2   -2000004    4

DECAY 25  0.0038252237
    0.63475633   2   -5    5
    0.17192137   2   -24    24
    0.07294022   2   -15    15
    0.068674236   2    21    21
    0.028188983   2   -4    4
    0.01968612   2    23    23
    0.0021656487   2    22    22
    0.0011747892   2    22    23
    0.00025340277   2   -13    13
    0.00023809701   2   -3    3
    6.5830754e-07   2   -1    1
    1.4527286e-07   2   -2    2
    5.6968143e-09   2   -11    11

DECAY 35  10.448477
    0.85526678   2   -5    5
    0.14257155   2   -15    15
    0.0010945824   2   -6    6
    0.00050860503   2   -13    13
    0.00033920127   2   -3    3
    0.00011943157   2    21    21
    7.429111e-05   2    25    25
    1.637577e-05   2   -24    24
    8.1066064e-06   2    23    23
    9.3774308e-07   2   -1    1
    7.9345983e-08   2    22    22
    2.8073979e-08   2    22    23
    2.4493643e-08   2   -4    4
    1.142867e-08   2   -11    11
    1.2633403e-13   2   -2    2

DECAY 36  10.263802
    0.85499572   2   -5    5
    0.14251978   2   -15    15
    0.0014654922   2   -6    6
    0.00050839826   2   -13    13
    0.00033906547   2   -3    3
    0.00015634229   2    21    21
    1.4031825e-05   2    23    25
    9.3736766e-07   2   -1    1
    1.4900253e-07   2    22    22
    5.5645659e-08   2    22    23
    2.1145432e-08   2   -4    4
    1.1424021e-08   2   -11    11
    1.0915133e-13   2   -2    2
    4.0179242e-38   2    25    25

DECAY 37  8.8830063
    0.81794623   2   -5    6
    0.17961437   2   -15    16
    0.0014040855   2   -5    4
    0.0006350117   2   -13    14
    0.00035251693   2   -3    4
    1.7116961e-05   2    24    25
    1.6160361e-05   2   -3    2
    1.0026707e-05   2   -5    2
    3.307855e-06   2   -3    6
    9.7798499e-07   2   -1    2
    1.3194788e-07   2   -1    6
    4.6134196e-08   2   -1    4
    1.4852991e-08   2   -11    12
    1.3693001e-09   2    24    36
    1.357666e-09   2    24    35

DECAY 6  2.43
    1   2    5    24

DECAY 15 -1
