BLOCK SPINFO
   1   SPheno
   2   v4.0.5be

BLOCK SPHENOINFO
   1   2
   2   2

BLOCK MODSEL
   1   0

BLOCK MINPAR
   3    15.938247
   4   -1

BLOCK EXTPAR
   0    1772.167
   1    776.22313
   2    416.07746
   3    3000
   11    5055.1631
   12    1077.8123
   13    382.13116
   23   -574.55527
   25    15.281088
   26    3892.2035
   31    982.87563
   32    982.87563
   33    1007.9349
   34    1411.7785
   35    1411.7785
   36    1240.9191
   41    5000
   42    5000
   43    1947.0503
   44    5000
   45    5000
   46    1739.8521
   47    5000
   48    5000
   49    746.62385

BLOCK SMINPUTS
   1    127.90897
   2    1.1663787e-05
   3    0.1184
   4    91.1876
   5    4.18
   6    173.2
   7    1.777
   8    0
   11    0.00051099893
   12    0
   13    0.10565837
   14    0
   21    0.005
   22    0.0025
   23    0.095
   24    1.27

BLOCK GAUGE Q=  1772.167
   1    0.35536298
   2    0.66519887
   3    1.219778

BLOCK YU Q=  1772.167
   1   1    8.4023057e-06
   2   2    0.0042683713
   3   3    1.015066

BLOCK YD Q=  1772.167
   1   1    0.0002580079
   2   2    0.00490215
   3   3    0.25586299

BLOCK YE Q=  1772.167
   1   1    4.5024265e-05
   2   2    0.00930959
   3   3    0.15657199

BLOCK AU Q=  1772.167
   1   1    0
   2   2    0
   3   3    5055.1632

BLOCK AD Q=  1772.167
   1   1    0
   2   2    0
   3   3    1077.8123

BLOCK AE Q=  1772.167
   1   1    0
   2   2    0
   3   3    382.13115

BLOCK MSOFT Q=  1772.167
   1    776.22313
   2    416.07746
   3    3000
   21    14714638
   22   -171600.91
   31    982.87563
   32    982.87563
   33    1007.9349
   34    1411.7785
   35    1411.7785
   36    1240.9191
   41    5000
   42    5000
   43    1947.0503
   44    5000
   45    5000
   46    1739.8521
   47    5000
   48    5000
   49    746.62385

BLOCK MASS
   6    173.2
   23    91.1876
   24    80.429995
   15    1.777
   25    125.34857
   35    3891.694
   36    3892.2035
   37    3892.6678
   1000001    5041.9983
   2000001    5030.8741
   1000002    5041.5619
   2000002    5033.065
   1000003    5041.999
   2000003    5030.8747
   1000004    5041.5625
   2000004    5033.0655
   1000005    793.65814
   2000005    1922.3244
   1000006    1549.7885
   2000006    2026.4544
   1000011    989.52589
   2000011    1412.6117
   1000012    986.07238
   1000013    989.52595
   2000013    1412.612
   1000014    986.07307
   1000015    1014.3423
   2000015    1242.1385
   1000016    1011.2451
   1000021    3214.679
   1000022    430.10116
   1000023   -586.62449
   1000025    597.38579
   1000035    778.43449
   1000024    430.72796
   1000037    604.43275

BLOCK ALPHA
      -0.062764986

BLOCK HMIX Q=  1772.167
   1   -574.55527
   2    15.281088
   3    243.77749
   4    15149248

BLOCK STOPMIX
   1   1   -0.48747466
   1   2    0.87313713
   2   1   -0.87313713
   2   2   -0.48747466

BLOCK SBOTMIX
   1   1   -0.0079726672
   1   2    0.99996822
   2   1   -0.99996822
   2   2   -0.0079726672

BLOCK STAUMIX
   1   1   -0.99950128
   1   2    0.031578452
   2   1   -0.031578452
   2   2   -0.99950128

BLOCK NMIX
   1   1   -0.021768212
   1   2    0.94413889
   1   3    0.26924128
   1   4    0.18877776
   2   1   -0.024504278
   2   2    0.058625188
   2   3   -0.70371594
   2   4    0.70763444
   3   1    0.15465806
   3   2    0.32305149
   3   3   -0.65123542
   3   4   -0.66903741
   4   1   -0.98742421
   4   2    0.028330004
   4   3   -0.09047343
   4   4   -0.12651245

BLOCK UMIX
   1   1   -0.9290047
   1   2   -0.37006793
   2   1    0.37006793
   2   2   -0.9290047

BLOCK VMIX
   1   1   -0.96588637
   1   2    0.25896624
   2   1    0.25896624
   2   2    0.96588637

BLOCK HIGGSBOUNDSINPUTHIGGSCOUPLINGSFERMIONS
       0, 233.51164,3,36,15,15

BLOCK HIGGSBOUNDSINPUTHIGGSCOUPLINGSBOSONS
       0,4,36,21,21,23

BLOCK SPHENOLOWENERGY
   1    0.00030820572
   2    1.5903943e-06
   3    3.5216488e-05
   4    2.5801342e-15
   5    1.1022036e-10
   6    2.3071006e-08
   7    8.7401967e-14
   8    3.7338077e-09
   9    7.9188317e-07
   10    9.6724198e-05
   11    0.99912393
   12    0.54250925
   13    19.383947
   14    0
   15    0
   16    0.0021592434
   17    2.2816778e-15
   18    2.4785668e-11
   19    8.2863698e-11
   20   -5.232795e-15
   21   -2.2372508e-10
   22   -6.3198498e-08
   23    0
   24    0
   25    0
   26    0
   27    0
   28    0
   29    0
   30    0
   31    0
   39    3.7009261e-05
   40    0
   41    0
   42    0

BLOCK FWCOEF Q=  160
   305   4422   0   0   -0.18881911
   305   4422   0   2   -0.17378205
   305   4322   0   2    4.917352e-05
   305   6421   0   0   -0.095227835
   305   6421   0   2   -0.090192023
   305   6321   0   2   -4.0470784e-05
   3051111   4133   0   0    1.5977002
   3051111   4133   0   2    1.5982227
   3051111   4233   0   2    4.7249028e-05
   3051111   4137   0   0   -4.4203923
   3051111   4137   0   2   -4.415077
   3051111   4237   0   2   -0.00036337543
   3051313   4133   0   0    1.5977002
   3051313   4133   0   2    1.5982221
   3051313   4233   0   2    4.7249003e-05
   3051313   4137   0   0   -4.4203923
   3051313   4137   0   2   -4.4150776
   3051313   4237   0   2   -0.0003633755
   3051212   4137   0   0    1.5053501
   3051212   4137   0   2    1.5042206
   3051212   4237   0   2    7.9086916e-05
   3051414   4137   0   0    1.5053501
   3051414   4137   0   2    1.5042206
   3051414   4237   0   2    7.9086917e-05
   3051616   4137   0   0    1.5053501
   3051616   4137   0   2    1.5042206
   3051616   4237   0   2    7.9087088e-05

BLOCK IMFWCOEF Q=  160
   305   4422   0   0    3.8585372e-07
   305   4422   0   2   -1.2114233e-05
   305   4322   0   2    2.3023248e-06
   305   6421   0   0    3.3050923e-07
   305   6421   0   2    4.6466969e-06
   305   6321   0   2    1.1890211e-06
   3051111   4133   0   2   -2.5200789e-06
   3051111   4233   0   2    9.1564239e-07
   3051111   4137   0   2    1.9724299e-05
   3051111   4237   0   2   -7.0445104e-06
   3051313   4133   0   2   -2.5201037e-06
   3051313   4233   0   2    9.1564201e-07
   3051313   4137   0   2    1.9724336e-05
   3051313   4237   0   2   -7.0445117e-06
   3051212   4137   0   2   -3.7880236e-06
   3051212   4237   0   2    1.5332097e-06
   3051414   4137   0   2   -3.7880229e-06
   3051414   4237   0   2    1.5332097e-06
   3051616   4137   0   2   -3.788584e-06
   3051616   4237   0   2    1.5332097e-06

DECAY 23  2.4952


DECAY 24  2.085


DECAY 1000011  8.3501597
    0.59147207   2   -1000024    12
    0.29837718   2    1000022    11
    0.056144271   2   -1000037    12
    0.034671064   2    1000025    11
    0.018880529   2    1000035    11
    0.00045488517   2    1000023    11

DECAY 2000011  3.4757502
    0.965427   2    1000035    11
    0.032936671   2    1000025    11
    0.00083974828   2    1000023    11
    0.00079656894   2    1000022    11

DECAY 1000013  8.3508912
    0.59142032   2   -1000024    14
    0.2983612   2    1000022    13
    0.056139364   2   -1000037    14
    0.034702581   2    1000025    13
    0.018879183   2    1000035    13
    0.00049734645   2    1000023    13

DECAY 2000013  3.4792042
    0.96447149   2    1000035    13
    0.033104578   2    1000025    13
    0.0010762599   2    1000023    13
    0.00083757067   2    1000022    13
    0.00040320412   2   -1000037    14

DECAY 1000015  9.0373571
    0.57575764   2   -1000024    16
    0.29327922   2    1000022    15
    0.054143755   2   -1000037    16
    0.043746895   2    1000025    15
    0.020856082   2    1000035    15
    0.012216406   2    1000023    15

DECAY 2000015  3.1461852
    0.71390219   2    1000035    15
    0.10732069   2   -1000037    16
    0.079944806   2    1000025    15
    0.059365943   2    1000023    15
    0.013028467   2    1000016   -24
    0.0089634202   2   -1000024    16
    0.0061828824   2    1000015    25
    0.0058599176   2    1000015    23
    0.0054316855   2    1000022    15

DECAY 1000012  8.4295129
    0.62906932   2    1000024    11
    0.3084017   2    1000022    12
    0.026913346   2    1000037    11
    0.022585096   2    1000035    12
    0.011925148   2    1000025    12
    0.0011053893   2    1000023    12

DECAY 1000014  8.4302512
    0.62903392   2    1000024    13
    0.3083751   2    1000022    14
    0.026978313   2    1000037    13
    0.022583237   2    1000035    14
    0.011924131   2    1000025    14
    0.001105295   2    1000023    14

DECAY 1000016  9.10849
    0.6161263   2    1000024    15
    0.29949976   2    1000022    16
    0.046232215   2    1000037    15
    0.025062905   2    1000035    16
    0.011972448   2    1000025    16
    0.0011063766   2    1000023    16

DECAY 2000001  141.70278
    0.98110688   2    1000021    1
    0.018411367   2    1000035    1
    0.0004608463   2    1000025    1

DECAY 1000001  206.34333
    0.67936226   2    1000021    1
    0.18294438   2   -1000024    2
    0.09525822   2    1000022    1
    0.028617728   2   -1000037    2
    0.0091302706   2    1000025    1
    0.0042718862   2    1000035    1
    0.00041525943   2    1000023    1

DECAY 2000003  141.70751
    0.98107456   2    1000021    3
    0.018410885   2    1000035    3
    0.00046780957   2    1000025    3

DECAY 1000003  206.34753
    0.67934879   2    1000021    3
    0.18294121   2   -1000024    4
    0.095257131   2    1000022    3
    0.028625237   2   -1000037    4
    0.0091348844   2    1000025    3
    0.0042718901   2    1000035    3
    0.00042086383   2    1000023    3

DECAY 1000005  0.34474398
    0.30460336   2    1000023    5
    0.24349474   2    1000025    5
    0.18070064   2   -1000024    6
    0.14915979   2   -1000037    6
    0.1204121   2    1000022    5
    0.001629372   2    1000035    5

DECAY 2000005  102.65889
    0.44628022   2    1000006   -24
    0.31237194   2   -1000037    6
    0.14392704   2   -1000024    6
    0.068289245   2    1000022    5
    0.014385145   2    1000025    5
    0.010225924   2    1000023    5
    0.0025634298   2    1000035    5
    0.0011127108   2    1000005    25
    0.00084433894   2    1000005    23

DECAY 2000002  149.96714
    0.92855838   2    1000021    2
    0.0696203   2    1000035    2
    0.0017425287   2    1000025    2

DECAY 1000002  206.33958
    0.67915471   2    1000021    2
    0.19774455   2    1000024    1
    0.093699936   2    1000022    2
    0.014012883   2    1000037    1
    0.012850142   2    1000025    2
    0.002229645   2    1000035    2
    0.00030812793   2    1000023    2

DECAY 2000004  149.97068
    0.92853641   2    1000021    4
    0.069618861   2    1000035    4
    0.001747767   2    1000025    4

DECAY 1000004  206.34371
    0.67914114   2    1000021    4
    0.19774221   2    1000024    3
    0.093698354   2    1000022    4
    0.014022362   2    1000037    3
    0.012853768   2    1000025    4
    0.0022297323   2    1000035    4
    0.00031243218   2    1000023    4

DECAY 1000006  46.847838
    0.42417827   2    1000037    5
    0.26475168   2    1000025    6
    0.25099269   2    1000023    6
    0.048537694   2    1000035    6
    0.0051256571   2    1000024    5
    0.0050807294   2    1000022    6
    0.00068433779   2    1000022    4
    0.0003252099   3    1000022    24    5
    0.00032177044   2    1000005    24

DECAY 2000006  113.20305
    0.30616058   2    1000006    23
    0.15644595   2    1000024    5
    0.15024463   2    1000023    6
    0.12792065   2    1000006    25
    0.11795008   2    1000025    6
    0.08082214   2    1000022    6
    0.044496145   2    1000037    5
    0.0098013024   2    2000005    24
    0.004698932   2    1000035    6
    0.0014596039   2    1000005    24

DECAY 1000024  7.3250454e-13
    0.85985001   2    1000022    211
    0.074890661   3    1000022   -11    12
    0.065259327   3    1000022   -13    14

DECAY 1000037  1.4588563
    0.38752599   2    1000022    24
    0.35526802   2    1000024    23
    0.25719997   2    1000024    25

DECAY 1000022 -1


DECAY 1000023  3.2867386
    0.29073686   2    1000022    23
    0.26957761   2    1000024   -24
    0.26957761   2   -1000024    24
    0.16995259   2    1000022    25
    0.00015505947   2    1000022    22

DECAY 1000025  1.5855683
    0.37282234   2    1000024   -24
    0.37282234   2   -1000024    24
    0.23810149   2    1000022    25
    0.016234327   2    1000022    23

DECAY 1000035  1.3000844
    0.29652916   2    1000023    23
    0.21829731   2    1000023    25
    0.1717637   2    1000025    25
    0.15059833   2    1000037   -24
    0.15059833   2   -1000037    24
    0.0073382531   2    1000025    23
    0.001894751   2    1000024   -24
    0.001894751   2   -1000024    24
    0.00080370047   2    1000022    25

DECAY 1000021  215.30435
    0.19486808   2    1000005   -5
    0.19486808   2   -1000005    5
    0.14535706   2    1000006   -6
    0.14535706   2   -1000006    6
    0.091190553   2    2000005   -5
    0.091190553   2   -2000005    5
    0.067653358   2    2000006   -6
    0.067653358   2   -2000006    6
    0.00081245138   2    1000006   -4
    0.00081245138   2   -1000006    4

DECAY 25  0.0039134878
    0.56746058   2   -5    5
    0.23492092   2   -24    24
    0.071282701   2    21    21
    0.065300797   2   -15    15
    0.028634507   2    23    23
    0.028076404   2   -4    4
    0.0023543415   2    22    22
    0.0015294046   2    22    23
    0.00022647413   2   -13    13
    0.00021314222   2   -3    3
    5.8931603e-07   2   -1    1
    1.4468313e-07   2   -2    2
    5.0913855e-09   2   -11    11

DECAY 35  64.825594
    0.19801774   2   -5    5
    0.18793843   2   -1000024    1000037
    0.18793843   2   -1000037    1000024
    0.089068021   2    1000022    1000023
    0.084103911   2    1000022    1000025
    0.057004113   2   -1000024    1000024
    0.033576686   2    1000025    1000035
    0.031601055   2    1000023    1000035
    0.029459227   2   -15    15
    0.029454237   2    1000022    1000022
    0.024234944   2   -1000037    1000037
    0.011131426   2   -6    6
    0.010155934   2    1000025    1000025
    0.0090401102   2    1000023    1000025
    0.0041409363   2   -2000005    1000005
    0.0041409363   2   -1000005    2000005
    0.0035659287   2   -1000006    1000006
    0.0011769357   2   -2000006    1000006
    0.0011769357   2   -1000006    2000006
    0.00099584321   2    1000023    1000023
    0.00095643933   2    1000035    1000035
    0.00072570003   2    1000022    1000035
    0.00010193362   2   -13    13
    9.7684654e-05   2   -2000015    1000015
    9.7684654e-05   2   -1000015    2000015
    6.3101771e-05   2   -3    3
    2.3411295e-05   2    25    25
    2.4820377e-06   2    21    21
    1.5981123e-06   2    23    23
    1.4395685e-06   2   -1000005    1000005
    1.3202146e-06   2   -1000015    1000015
    3.5986624e-07   2   -1000011    1000011
    3.5927904e-07   2   -1000013    1000013
    3.4856965e-07   2   -24    24
    1.8564821e-07   2   -2000011    2000011
    1.8545513e-07   2   -2000013    2000013
    1.7444855e-07   2   -1    1
    1.3549632e-07   2   -4    4
    8.4834449e-08   2    22    23
    7.0537024e-08   2   -2000015    2000015
    7.053228e-09   2    22    22
    3.6473161e-09   2   -2000013    1000013
    3.6473161e-09   2   -1000013    2000013
    2.2891774e-09   2   -11    11
    6.9840381e-13   2   -2    2
    8.5311404e-14   2   -2000011    1000011
    8.5311404e-14   2   -1000011    2000011

DECAY 36  64.186907
    0.19615832   2   -1000024    1000037
    0.19615832   2   -1000037    1000024
    0.19053701   2   -5    5
    0.11004318   2    1000022    1000023
    0.069438612   2    1000022    1000025
    0.051182489   2   -1000024    1000024
    0.035855465   2    1000023    1000035
    0.029691972   2    1000025    1000035
    0.028350555   2   -15    15
    0.026279458   2    1000022    1000022
    0.018252832   2   -1000037    1000037
    0.010309838   2   -6    6
    0.0094810985   2    1000023    1000025
    0.0087218781   2    1000025    1000025
    0.0041828122   2   -2000005    1000005
    0.0041828122   2   -1000005    2000005
    0.0038531417   2   -2000006    1000006
    0.0038531417   2   -1000006    2000006
    0.0014216766   2    1000023    1000023
    0.00087050519   2    1000022    1000035
    0.00080592258   2    1000035    1000035
    9.9173914e-05   2   -2000015    1000015
    9.9173914e-05   2   -1000015    2000015
    9.8097304e-05   2   -13    13
    6.0726687e-05   2   -3    3
    8.0995392e-06   2    21    21
    3.3054566e-06   2    23    25
    1.6788295e-07   2   -1    1
    1.2244568e-07   2   -4    4
    7.7063879e-08   2    22    23
    3.658347e-09   2   -2000013    1000013
    3.658347e-09   2   -1000013    2000013
    3.2910558e-09   2    22    22
    2.2030208e-09   2   -11    11
    6.3114807e-13   2   -2    2
    8.5569115e-14   2   -2000011    1000011
    8.5569115e-14   2   -1000011    2000011
    5.2389851e-38   2    25    25

DECAY 37  64.925269
    0.23175377   2    1000022    1000037
    0.23018017   2    1000024    1000025
    0.21078365   2   -5    6
    0.2056778   2    1000023    1000024
    0.056338731   2    1000035    1000037
    0.030458605   2   -15    16
    0.020216617   2    1000023    1000037
    0.0075908015   2   -1000005    2000006
    0.0042711802   2   -2000005    1000006
    0.0009435671   2    1000024    1000035
    0.0009224814   2   -1000005    1000006
    0.00029925831   2   -5    4
    0.00019501537   2   -2000015    1000016
    0.00016578496   2    1000025    1000037
    0.00010768201   2   -13    14
    5.7505462e-05   2   -3    4
    1.2993287e-05   2   -3    6
    1.0228015e-05   2    1000022    1000024
    3.2702429e-06   2    24    25
    2.6958622e-06   2   -3    2
    2.4725068e-06   2   -1000015    1000016
    2.1370117e-06   2   -5    2
    1.4111431e-06   2   -1000011    1000012
    1.4103205e-06   2   -1000013    1000014
    5.9201265e-07   2   -1    6
    1.592192e-07   2   -1    2
    1.2853825e-08   2   -1    4
    7.421101e-09   2   -2000013    1000014
    2.5186935e-09   2   -11    12
    1.7358145e-13   2   -2000011    1000012

DECAY 6  2.43
    1   2    5    24

DECAY 15 -1
