BLOCK SPINFO
   1   SPheno
   2   v4.0.5be

BLOCK SPHENOINFO
   1   2
   2   2

BLOCK MODSEL
   1   0

BLOCK MINPAR
   3    47.82167
   4    1

BLOCK EXTPAR
   0    2653.9102
   1    726.94847
   2   -1067.5055
   3    3860.0565
   11   -2192.8838
   12   -3.513431
   13   -2782.9834
   23    1080.9337
   25    46.905113
   26    1494.7614
   31    4153.6627
   32    4153.6627
   33    923.4157
   34    4903.4876
   35    4903.4876
   36    4674.1112
   41    2158.2311
   42    2158.2311
   43    3229.1183
   44    1487.9887
   45    1487.9887
   46    2065.8893
   47    2988.7461
   48    2988.7461
   49    3957.2897

BLOCK SMINPUTS
   1    127.90897
   2    1.1663787e-05
   3    0.1184
   4    91.1876
   5    4.18
   6    173.2
   7    1.777
   8    0
   11    0.00051099893
   12    0
   13    0.10565837
   14    0
   21    0.005
   22    0.0025
   23    0.095
   24    1.27

BLOCK GAUGE Q=  2653.9102
   1    0.35536298
   2    0.66519887
   3    1.219778

BLOCK YU Q=  2653.9102
   1   1    8.3862774e-06
   2   2    0.0042602289
   3   3    1.0131297

BLOCK YD Q=  2653.9102
   1   1    0.00079044136
   2   2    0.015018386
   3   3    0.78387014

BLOCK YE Q=  2653.9102
   1   1    0.0001379378
   2   2    0.028521162
   3   3    0.47967902

BLOCK AU Q=  2653.9102
   1   1    0
   2   2    0
   3   3   -2192.8849

BLOCK AD Q=  2653.9102
   1   1    0
   2   2    0
   3   3   -3.513428

BLOCK AE Q=  2653.9102
   1   1    0
   2   2    0
   3   3   -2782.9829

BLOCK MSOFT Q=  2653.9102
   1    726.94847
   2   -1067.5055
   3    3860.0565
   21    1116240.6
   22   -1086117.7
   31    4153.6627
   32    4153.6627
   33    923.4157
   34    4903.4876
   35    4903.4876
   36    4674.1112
   41    2158.2311
   42    2158.2311
   43    3229.1183
   44    1487.9887
   45    1487.9887
   46    2065.8893
   47    2988.7461
   48    2988.7461
   49    3957.2897

BLOCK MASS
   6    173.2
   23    91.1876
   24    80.429995
   15    1.777
   25    120.47725
   35    1494.5711
   36    1494.7614
   37    1497.2684
   1000001    2269.7172
   2000001    3088.5542
   1000002    2268.258
   2000002    1583.6838
   1000003    2269.7137
   2000003    3088.5483
   1000004    2268.2548
   2000004    1583.6834
   1000005    3305.3702
   2000005    4028.1537
   1000006    2127.1857
   2000006    3311.06
   1000011    4161.328
   2000011    4909.8147
   1000012    4160.17
   1000013    4161.3178
   2000013    4909.7899
   1000014    4160.1603
   1000015    941.45946
   2000015    4670.2427
   1000016    937.94706
   1000021    3848.3973
   1000022    720.07888
   1000023   -1045.5191
   1000025    1097.2636
   1000035   -1152.8677
   1000024    1046.258
   1000037    1153.4486

BLOCK ALPHA
      -0.021036514

BLOCK HMIX Q=  2653.9102
   1    1080.9337
   2    46.905113
   3    243.40145
   4    2234311.5

BLOCK STOPMIX
   1   1    0.049948363
   1   2    0.9987518
   2   1   -0.9987518
   2   2    0.049948363

BLOCK SBOTMIX
   1   1    0.99980445
   1   2    0.019775283
   2   1   -0.019775283
   2   2    0.99980445

BLOCK STAUMIX
   1   1    0.99999089
   1   2    0.0042682694
   2   1   -0.0042682694
   2   2    0.99999089

BLOCK NMIX
   1   1   -0.99609823
   1   2   -0.0022119729
   1   3   -0.073218945
   1   4    0.049217901
   2   1   -0.012496943
   2   2   -0.68188802
   2   3    0.52963312
   2   4    0.50434246
   3   1    0.086585872
   3   2   -0.025763241
   3   3   -0.70293347
   3   4    0.70549534
   4   1   -0.01161988
   4   2    0.73099938
   4   3    0.46905467
   4   4    0.4954721

BLOCK UMIX
   1   1   -0.65548782
   1   2    0.75520575
   2   1   -0.75520575
   2   2   -0.65548782

BLOCK VMIX
   1   1    0.6935685
   1   2    0.72039068
   2   1    0.72039068
   2   2   -0.6935685

BLOCK HIGGSBOUNDSINPUTHIGGSCOUPLINGSFERMIONS
       0, 2200.0896,3,36,15,15

BLOCK HIGGSBOUNDSINPUTHIGGSCOUPLINGSBOSONS
       0,4,36,21,21,23

BLOCK SPHENOLOWENERGY
   1    0.00032664542
   2    1.588536e-06
   3    3.5232894e-05
   4    3.3575367e-15
   5    1.4342299e-10
   6    2.9618534e-08
   7    1.1216715e-13
   8    4.7915511e-09
   9    1.0033872e-06
   10    9.2162528e-05
   11    0.95200363
   12    0.54197136
   13    19.338704
   14    0
   15    0
   16    0.002157528
   17    2.2816672e-15
   18    2.478894e-11
   19    8.2869907e-11
   20   -1.9297558e-15
   21   -8.2503365e-11
   22   -7.4184918e-08
   23    0
   24    0
   25    0
   26    0
   27    0
   28    0
   29    0
   30    0
   31    0
   39    7.4171189e-05
   40    0
   41    0
   42    0

BLOCK FWCOEF Q=  160
   305   4422   0   0   -0.18881911
   305   4422   0   2   -0.19292146
   305   4322   0   2    4.835131e-06
   305   6421   0   0   -0.095227835
   305   6421   0   2   -0.11164278
   305   6321   0   2   -0.00027979682
   3051111   4133   0   0    1.6128883
   3051111   4133   0   2    1.6131366
   3051111   4233   0   2    4.4736129e-05
   3051111   4137   0   0   -4.4355804
   3051111   4137   0   2   -4.4319777
   3051111   4237   0   2   -0.00033702424
   3051313   4133   0   0    1.6128883
   3051313   4133   0   2    1.6131358
   3051313   4233   0   2    4.47291e-05
   3051313   4137   0   0   -4.4355804
   3051313   4137   0   2   -4.4319785
   3051313   4237   0   2   -0.0003370182
   3051212   4137   0   0    1.5053501
   3051212   4137   0   2    1.5045706
   3051212   4237   0   2    7.3104502e-05
   3051414   4137   0   0    1.5053501
   3051414   4137   0   2    1.5045706
   3051414   4237   0   2    7.3105976e-05
   3051616   4137   0   0    1.5053501
   3051616   4137   0   2    1.5045709
   3051616   4237   0   2    7.3521414e-05

BLOCK IMFWCOEF Q=  160
   305   4422   0   0    3.8585413e-07
   305   4422   0   2   -8.5232422e-06
   305   4322   0   2    6.8411559e-06
   305   6421   0   0    3.3050958e-07
   305   6421   0   2   -5.9880415e-06
   305   6321   0   2    3.3321671e-06
   3051111   4133   0   2   -1.4021093e-06
   3051111   4233   0   2    3.7231831e-06
   3051111   4137   0   2    1.2121564e-05
   3051111   4237   0   2   -2.8111294e-05
   3051313   4133   0   2   -1.4021067e-06
   3051313   4233   0   2    3.7231792e-06
   3051313   4137   0   2    1.2121577e-05
   3051313   4237   0   2   -2.8111308e-05
   3051212   4137   0   2   -2.5926928e-06
   3051212   4237   0   2    6.0976408e-06
   3051414   4137   0   2   -2.5926926e-06
   3051414   4237   0   2    6.0976408e-06
   3051616   4137   0   2   -2.5865854e-06
   3051616   4237   0   2    6.097642e-06

DECAY 23  2.4952


DECAY 24  2.085


DECAY 1000011  52.370124
    0.33999705   2   -1000037    12
    0.2637494   2   -1000024    12
    0.156608   2    1000035    11
    0.14554719   2    1000023    11
    0.093971183   2    1000022    11
    0.00012717494   2    1000025    11

DECAY 2000011  23.609628
    0.99265432   2    1000022    11
    0.0070708921   2    1000025    11
    0.00014874394   2    1000023    11
    0.0001259727   2    1000035    11

DECAY 1000013  52.428315
    0.33961856   2   -1000037    14
    0.26345584   2   -1000024    14
    0.15667473   2    1000035    13
    0.14570125   2    1000023    13
    0.093873116   2    1000022    13
    0.00067650892   2    1000025    13

DECAY 2000013  23.753564
    0.98665097   2    1000022    13
    0.00851988   2    1000025    13
    0.0017384532   2   -1000024    14
    0.0012829676   2   -1000037    14
    0.0010029761   2    1000023    13
    0.00078222826   2    1000035    13

DECAY 1000015  0.20841561
    1   2    1000022    15

DECAY 2000015  75.470455
    0.29536779   2    1000022    15
    0.14425081   2   -1000024    16
    0.12713432   2    1000025    15
    0.10878061   2   -1000037    16
    0.083765888   2    1000016   -37
    0.070975854   2    1000023    15
    0.055720966   2    1000035    15
    0.041891977   2    1000015    35
    0.04188398   2    1000015    36
    0.014771854   2    1000016   -24
    0.0080792784   2    1000015    25
    0.0073766809   2    1000015    23

DECAY 1000012  52.384102
    0.30917455   2    1000037    11
    0.2951016   2    1000024    11
    0.16191581   2    1000035    12
    0.13987039   2    1000023    12
    0.092368073   2    1000022    12
    0.001569575   2    1000025    12

DECAY 1000014  52.442288
    0.30930022   2    1000037    13
    0.29541616   2    1000024    13
    0.16173565   2    1000035    14
    0.13971479   2    1000023    14
    0.092265346   2    1000022    14
    0.0015678288   2    1000025    14

DECAY 1000016  0.19546369
    1   2    1000022    16

DECAY 1000001  17.671681
    0.35478389   2   -1000037    2
    0.30128037   2   -1000024    2
    0.16726212   2    1000035    1
    0.16208017   2    1000023    1
    0.014029996   2    1000022    1
    0.00056344884   2    1000025    1

DECAY 2000001  1.5402613
    0.99330419   2    1000022    1
    0.0064174716   2    1000025    1
    0.00014254519   2    1000023    1
    0.00011603292   2    1000035    1

DECAY 1000003  17.678083
    0.35466941   2   -1000037    4
    0.30118175   2   -1000024    4
    0.16727145   2    1000035    3
    0.16212002   2    1000023    3
    0.014027348   2    1000022    3
    0.00073001478   2    1000025    3

DECAY 2000003  1.561789
    0.97965216   2    1000022    3
    0.009667965   2    1000025    3
    0.0039661282   2   -1000024    4
    0.002823368   2   -1000037    4
    0.0020866292   2    1000023    3
    0.0015566742   2    1000035    3
    0.00024707279   2    1000003    25

DECAY 1000005  132.16419
    0.29133738   2   -1000037    6
    0.28355144   2   -1000024    6
    0.11946195   2    1000025    5
    0.11262408   2    1000023    5
    0.095676473   2    1000035    5
    0.092540594   2    1000006   -24
    0.0048080855   2    1000022    5

DECAY 2000005  90.37974
    0.26165486   2   -1000024    6
    0.23146958   2    1000025    5
    0.20443428   2   -1000037    6
    0.12894705   2    1000023    5
    0.10484295   2    1000035    5
    0.026753313   2    1000021    5
    0.025390254   2    1000022    5
    0.0064252412   2    2000006   -24
    0.0063157106   2    1000005    25
    0.0032721513   2    1000005    23
    0.00031510941   2    1000006   -37
    0.00017950138   2    1000006   -24

DECAY 2000002  2.2155893
    0.99663768   2    1000022    2
    0.0032353492   2    1000025    2

DECAY 1000002  17.725887
    0.33582268   2    1000024    1
    0.32134473   2    1000037    1
    0.16461958   2    1000035    2
    0.16348882   2    1000023    2
    0.014688828   2    1000022    2

DECAY 2000004  2.2158927
    0.99649738   2    1000022    4
    0.0032711977   2    1000025    4
    0.00010005435   2    1000023    4

DECAY 1000004  17.732289
    0.33590469   2    1000024    3
    0.32136099   2    1000037    3
    0.16456387   2    1000035    4
    0.16343798   2    1000023    4
    0.014683603   2    1000022    4

DECAY 1000006  49.460725
    0.24538426   2    1000024    5
    0.22844769   2    1000025    6
    0.22482589   2    1000037    5
    0.11637785   2    1000023    6
    0.11045468   2    1000035    6
    0.074463643   2    1000022    6

DECAY 2000006  135.40247
    0.23546848   2    1000024    5
    0.19738689   2    1000025    6
    0.17260487   2    1000037    5
    0.15415183   2    1000023    6
    0.12631794   2    1000035    6
    0.064675626   2    1000006    25
    0.045540798   2    1000006    23
    0.0038535545   2    1000022    6

DECAY 1000024  0.43008774
    0.5153687   2    1000022    24
    0.3154963   2    1000016   -15
    0.16778193   2   -1000015    16
    0.0013519148   3    1000022   -5    6

DECAY 1000037  2.3655329
    0.46401668   2    1000023    24
    0.1843652   2    1000016   -15
    0.17034895   2    1000022    24
    0.135655   2   -1000015    16
    0.044253668   2    1000024    23
    0.001158645   3    1000022   -5    6

DECAY 1000022 -1


DECAY 1000023  0.62546174
    0.40403201   2    1000022    23
    0.26221855   2    1000022    25
    0.10296255   2    1000015   -15
    0.10296255   2   -1000015    15
    0.063900625   2    1000016   -16
    0.063900625   2   -1000016    16

DECAY 1000025  0.7085862
    0.71574827   2    1000022    25
    0.12197965   2    1000015   -15
    0.12197965   2   -1000015    15
    0.035436356   2    1000022    23
    0.0012819899   2    1000016   -16
    0.0012819899   2   -1000016    16
    0.00026256711   3    1000023    12   -12
    0.00019649018   3    1000023    1   -1
    0.00019648396   3    1000023    3   -3
    0.00018466985   3    1000023    5   -5
    0.00015326686   3    1000023    2   -2
    0.00015310653   3    1000024    1   -2
    0.00015310653   3   -1000024   -1    2
    0.00015271083   3    1000024    3   -4
    0.00015271083   3   -1000024   -3    4
    0.00015220458   3    1000023    4   -4

DECAY 1000035  3.3803157
    0.27708067   2    1000024   -24
    0.27708067   2   -1000024    24
    0.12796729   2    1000022    23
    0.10014662   2    1000022    25
    0.062028102   2    1000015   -15
    0.062028102   2   -1000015    15
    0.046627667   2    1000016   -16
    0.046627667   2   -1000016    16

DECAY 1000021  449.70692
    0.087387946   2    2000004   -4
    0.087387946   2   -2000004    4
    0.087387935   2    2000002   -2
    0.087387935   2   -2000002    2
    0.060139202   2    1000006   -6
    0.060139202   2   -1000006    6
    0.053940187   2    1000004   -4
    0.053940187   2   -1000004    4
    0.053940033   2    1000002   -2
    0.053940033   2   -1000002    2
    0.053866324   2    1000003   -3
    0.053866324   2   -1000003    3
    0.053866147   2    1000001   -1
    0.053866147   2   -1000001    1
    0.016042926   2    2000003   -3
    0.016042926   2   -2000003    3
    0.016042707   2    2000001   -1
    0.016042707   2   -2000001    1
    0.0087106768   2    1000005   -5
    0.0087106768   2   -1000005    5
    0.0084298697   2    2000006   -6
    0.0084298697   2   -2000006    6

DECAY 25  0.0033964103
    0.64107954   2   -5    5
    0.15845786   2   -24    24
    0.074528116   2    21    21
    0.073131381   2   -15    15
    0.031384489   2   -4    4
    0.017512327   2    23    23
    0.0022991874   2    22    22
    0.0011121462   2    22    23
    0.00025404427   2   -13    13
    0.00024007426   2   -3    3
    6.6377864e-07   2   -1    1
    1.6174675e-07   2   -2    2
    5.711261e-09   2   -11    11

DECAY 35  38.424512
    0.85868152   2   -5    5
    0.13987258   2   -15    15
    0.00059195785   2   -13    13
    0.00054942998   2   -6    6
    0.00026404598   2   -3    3
    3.1563987e-05   2    21    21
    6.689528e-06   2    1000022    1000022
    8.4077416e-07   2    25    25
    7.299145e-07   2   -1    1
    3.4359364e-07   2    23    23
    2.759652e-07   2   -24    24
    1.3297898e-08   2   -11    11
    9.1576386e-09   2    22    22
    5.5491942e-09   2   -4    4
    7.0305424e-10   2    22    23
    2.8598079e-14   2   -2    2

DECAY 36  36.692094
    0.8585664   2   -5    5
    0.13986192   2   -15    15
    0.00059188134   2   -13    13
    0.00054047743   2   -6    6
    0.00026401058   2   -3    3
    0.00012508139   2    1000022    1000022
    4.8781953e-05   2    21    21
    7.2981741e-07   2   -1    1
    4.7846858e-07   2    23    25
    1.1777513e-07   2    22    23
    1.0055033e-07   2    22    22
    1.329619e-08   2   -11    11
    5.0516175e-09   2   -4    4
    2.6049289e-14   2   -2    2
    1.4030831e-42   2    25    25

DECAY 37  40.791404
    0.83004016   2   -5    6
    0.16787064   2   -15    16
    0.0012448434   2   -5    4
    0.0005934839   2   -13    14
    0.00022890948   2   -3    4
    1.063127e-05   2   -3    2
    8.8894766e-06   2   -5    2
    1.2842231e-06   2   -3    6
    6.350166e-07   2   -1    2
    4.3369873e-07   2    24    25
    4.3796262e-08   2   -1    6
    2.9815237e-08   2   -1    4
    1.388165e-08   2   -11    12
    4.7568244e-12   2    24    35
    3.3000215e-12   2    24    36

DECAY 6  2.43
    1   2    5    24

DECAY 15 -1
