BLOCK SPINFO
   1   SPheno
   2   v4.0.5be

BLOCK SPHENOINFO
   1   2
   2   2

BLOCK MODSEL
   1   0

BLOCK MINPAR
   3    15.165479
   4   -1

BLOCK EXTPAR
   0    4066.5094
   1   -993.45918
   2    912.63486
   3    4000
   11    5037.519
   12    1566.1432
   13    585.33205
   23   -1133.0283
   25    14.431434
   26    2000
   31    1944.6199
   32    1944.6199
   33    2000
   34    1370.8625
   35    1370.8625
   36    2000
   41    4000
   42    4000
   43    4000
   44    4000
   45    4000
   46    4000
   47    4000
   48    4000
   49    4000

BLOCK SMINPUTS
   1    127.90897
   2    1.1663787e-05
   3    0.1184
   4    91.1876
   5    4.18
   6    173.2
   7    1.777
   8    0
   11    0.00051099893
   12    0
   13    0.10565837
   14    0
   21    0.005
   22    0.0025
   23    0.095
   24    1.27

BLOCK GAUGE Q=  4066.5094
   1    0.35536298
   2    0.66519887
   3    1.219778

BLOCK YU Q=  4066.5094
   1   1    8.404477e-06
   2   2    0.0042694743
   3   3    1.0153283

BLOCK YD Q=  4066.5094
   1   1    0.0002437252
   2   2    0.0046307787
   3   3    0.24169902

BLOCK YE Q=  4066.5094
   1   1    4.2531829e-05
   2   2    0.0087942333
   3   3    0.14790454

BLOCK AU Q=  4066.5094
   1   1    0
   2   2    0
   3   3    5037.519

BLOCK AD Q=  4066.5094
   1   1    0
   2   2    0
   3   3    1566.1431

BLOCK AE Q=  4066.5094
   1   1    0
   2   2    0
   3   3    585.33204

BLOCK MSOFT Q=  4066.5094
   1   -993.45918
   2    912.63486
   3    4000
   21    2674962.8
   22   -926802.75
   31    1944.6199
   32    1944.6199
   33    2000
   34    1370.8625
   35    1370.8625
   36    2000
   41    4000
   42    4000
   43    4000
   44    4000
   45    4000
   46    4000
   47    4000
   48    4000
   49    4000

BLOCK MASS
   6    173.2
   23    91.1876
   24    80.429995
   15    1.777
   25    124.62941
   35    2000.0088
   36    2000
   37    2001.8658
   1000001    4155.7859
   2000001    4143.6198
   1000002    4155.0276
   2000002    4143.5367
   1000003    4155.7854
   2000003    4143.6179
   1000004    4155.0265
   2000004    4143.5359
   1000005    4097.3932
   2000005    4140.5228
   1000006    3982.7464
   2000006    4152.034
   1000011    1952.2664
   2000011    1381.9569
   1000012    1950.2787
   1000013    1952.2635
   2000013    1381.9488
   1000014    1950.2751
   1000015    1998.5592
   2000015    2013.5576
   1000016    2004.501
   1000021    4249.2333
   1000022    946.63594
   1000023   -972.84746
   1000025   -1155.8455
   1000035    1161.6712
   1000024    946.66646
   1000037    1162.7147
   1000039    1e-09

BLOCK ALPHA
      -0.066198486

BLOCK HMIX Q=  4066.5094
   1   -1133.0283
   2    14.431434
   3    242.92327
   4    4000000

BLOCK STOPMIX
   1   1   -0.56836329
   1   2    0.82277772
   2   1   -0.82277772
   2   2   -0.56836329

BLOCK SBOTMIX
   1   1   -0.99382074
   1   2    0.11099702
   2   1   -0.11099702
   2   2   -0.99382074

BLOCK STAUMIX
   1   1   -0.69017813
   1   2    0.72363952
   2   1   -0.72363952
   2   2   -0.69017813

BLOCK NMIX
   1   1   -0.0031493437
   1   2   -0.96982672
   1   3   -0.1907647
   1   4   -0.15177302
   2   1    0.98231917
   2   2    0.005435635
   2   3   -0.14138714
   2   4    0.12259354
   3   1    0.18671945
   3   2   -0.027800034
   3   3    0.69233972
   3   4   -0.69644003
   4   1    0.013227824
   4   2   -0.24214407
   4   3    0.68138405
   4   4    0.69058457

BLOCK UMIX
   1   1   -0.9633898
   1   2   -0.26810463
   2   1    0.26810463
   2   2   -0.9633898

BLOCK VMIX
   1   1   -0.97702236
   1   2    0.21313682
   2   1    0.21313682
   2   2    0.97702236

BLOCK HIGGSBOUNDSINPUTHIGGSCOUPLINGSFERMIONS
       0, 208.26629,3,36,15,15

BLOCK HIGGSBOUNDSINPUTHIGGSCOUPLINGSBOSONS
       0,4,36,21,21,23

BLOCK SPHENOLOWENERGY
   1    0.00033153486
   2    1.5888993e-06
   3    3.5252244e-05
   4    2.5422087e-15
   5    1.0860025e-10
   6    2.273311e-08
   7    8.5894078e-14
   8    3.6693915e-09
   9    7.7826477e-07
   10    9.6475242e-05
   11    0.99655231
   12    0.54197222
   13    19.363368
   14    0
   15    0
   16    0.002157253
   17    2.2816583e-15
   18    2.4799741e-11
   19    8.2902529e-11
   20   -1.0399761e-15
   21   -4.4462021e-11
   22   -1.301402e-08
   23    0
   24    0
   25    0
   26    0
   27    0
   28    0
   29    0
   30    0
   31    0
   39    2.8380701e-05
   40    0
   41    0
   42    0

BLOCK FWCOEF Q=  160
   305   4422   0   0   -0.18881911
   305   4422   0   2   -0.19997224
   305   4322   0   2   -0.00022086175
   305   6421   0   0   -0.095227835
   305   6421   0   2   -0.11052116
   305   6321   0   2   -0.00030171598
   3051111   4133   0   0    1.6268565
   3051111   4133   0   2    1.6270034
   3051111   4233   0   2    3.1734579e-05
   3051111   4137   0   0   -4.4495486
   3051111   4137   0   2   -4.4478157
   3051111   4237   0   2   -0.00023479682
   3051313   4133   0   0    1.6268565
   3051313   4133   0   2    1.6270033
   3051313   4233   0   2    3.1734544e-05
   3051313   4137   0   0   -4.4495486
   3051313   4137   0   2   -4.4478159
   3051313   4237   0   2   -0.00023479682
   3051212   4137   0   0    1.5053501
   3051212   4137   0   2    1.504983
   3051212   4237   0   2    5.0770016e-05
   3051414   4137   0   0    1.5053501
   3051414   4137   0   2    1.504983
   3051414   4237   0   2    5.0770022e-05
   3051616   4137   0   0    1.5053501
   3051616   4137   0   2    1.5049829
   3051616   4237   0   2    5.0771655e-05

BLOCK IMFWCOEF Q=  160
   305   4422   0   0    3.8583571e-07
   305   4422   0   2   -4.0472662e-06
   305   4322   0   2    6.0513189e-07
   305   6421   0   0    3.304938e-07
   305   6421   0   2    1.4236349e-06
   305   6321   0   2    3.3817327e-07
   3051111   4133   0   2   -3.7727025e-07
   3051111   4233   0   2    7.6816757e-07
   3051111   4137   0   2    3.4911976e-06
   3051111   4237   0   2   -5.684294e-06
   3051313   4133   0   2   -3.7727093e-07
   3051313   4233   0   2    7.6816743e-07
   3051313   4137   0   2    3.4911994e-06
   3051313   4237   0   2   -5.6842944e-06
   3051212   4137   0   2   -6.1860442e-07
   3051212   4237   0   2    1.2291123e-06
   3051414   4137   0   2   -6.1860438e-07
   3051414   4237   0   2    1.2291123e-06
   3051616   4137   0   2   -6.1893015e-07
   3051616   4237   0   2    1.2291123e-06

DECAY 23  2.4952


DECAY 24  2.085


DECAY 2000011  1.726948
    0.98726929   2    1000023    11
    0.01265556   2    1000025    11

DECAY 1000011  16.172492
    0.57699205   2   -1000024    12
    0.29339098   2    1000022    11
    0.084397323   2    1000023    11
    0.031806768   2   -1000037    12
    0.012250653   2    1000035    11
    0.0011602234   2    1000025    11

DECAY 2000013  1.7273191
    0.98703606   2    1000023    13
    0.012704643   2    1000025    13
    0.00010969054   2    1000035    13

DECAY 1000013  16.173969
    0.57693744   2   -1000024    14
    0.29336731   2    1000022    13
    0.08439136   2    1000023    13
    0.031803712   2   -1000037    14
    0.012285318   2    1000035    13
    0.001197702   2    1000025    13

DECAY 1000015  12.025199
    0.44126101   2   -1000024    16
    0.3131351   2    1000023    15
    0.2250088   2    1000022    15
    0.013922138   2    1000025    15
    0.0060924417   2    1000035    15
    0.00057747092   2   -1000037    16

DECAY 2000015  12.198279
    0.37944145   2   -1000024    16
    0.27814578   2    1000023    15
    0.19394117   2    1000022    15
    0.075448697   2   -1000037    16
    0.041430931   2    1000035    15
    0.031588849   2    1000025    15

DECAY 1000012  16.188129
    0.59151799   2    1000024    11
    0.2904199   2    1000022    12
    0.080702475   2    1000023    12
    0.020016661   2    1000037    11
    0.013709977   2    1000035    12
    0.003630997   2    1000025    12

DECAY 1000014  16.189343
    0.5914792   2    1000024    13
    0.29039689   2    1000022    14
    0.080696068   2    1000023    14
    0.020086269   2    1000037    13
    0.013708866   2    1000035    14
    0.003630703   2    1000025    14

DECAY 1000016  17.604393
    0.57982242   2    1000024    15
    0.28358465   2    1000022    16
    0.078993828   2    1000023    16
    0.04023491   2    1000037    15
    0.013729203   2    1000035    16
    0.0036328922   2    1000025    16

DECAY 2000001  2.06332
    0.9658985   2    1000023    1
    0.033243522   2    1000025    1
    0.00067839957   2    1000039    1
    0.00016748747   2    1000035    1

DECAY 1000001  49.661499
    0.61459298   2   -1000024    2
    0.31105877   2    1000022    1
    0.044985751   2   -1000037    2
    0.018712244   2    1000035    1
    0.0094529841   2    1000023    1
    0.0011686615   2    1000025    1

DECAY 2000003  2.0663237
    0.96450929   2    1000023    3
    0.033542722   2    1000025    3
    0.00067741184   2    1000039    3
    0.0006738906   2   -1000037    4
    0.00050350559   2    1000035    3

DECAY 1000003  49.664283
    0.61455925   2   -1000024    4
    0.31104249   2    1000022    3
    0.045008253   2   -1000037    4
    0.018725204   2    1000035    3
    0.0094530929   2    1000023    3
    0.0011831133   2    1000025    3

DECAY 1000005  123.34761
    0.55783121   2   -1000037    6
    0.26858114   2   -1000024    6
    0.12558747   2    1000022    5
    0.020067518   2    1000035    5
    0.014898738   2    1000025    5
    0.007359361   2    1000006   -24
    0.005663827   2    1000023    5

DECAY 2000005  11.749241
    0.45405711   2   -1000037    6
    0.1877129   2    1000035    5
    0.18587413   2    1000025    5
    0.16367831   2    1000023    5
    0.0043519638   2    1000006   -24
    0.0038622733   2   -1000024    6
    0.00034462922   2    1000022    5
    0.00011869077   2    1000039    5

DECAY 2000002  8.2488425
    0.96639414   2    1000023    2
    0.033259553   2    1000025    2
    0.00016967411   2    1000039    2
    0.00016663794   2    1000035    2

DECAY 1000002  49.703025
    0.63144121   2    1000024    1
    0.31144933   2    1000022    2
    0.028399801   2    1000037    1
    0.017978624   2    1000035    2
    0.010693178   2    1000023    2

DECAY 2000004  8.2513957
    0.96609758   2    1000023    4
    0.033323708   2    1000025    4
    0.00024036328   2    1000035    4
    0.00016962137   2    1000039    4
    0.00014753484   2    1000037    3

DECAY 1000004  49.705799
    0.63140814   2    1000024    3
    0.31143225   2    1000022    4
    0.028426187   2    1000037    3
    0.017990088   2    1000035    4
    0.01069296   2    1000023    4

DECAY 1000006  139.60046
    0.39020125   2    1000037    5
    0.27761662   2    1000035    6
    0.22473991   2    1000025    6
    0.060177365   2    1000023    6
    0.019186212   2    1000024    5
    0.012527412   2    1000022    6
    0.011602521   3    1000022    24    5
    0.0038098219   2    1000022    4
    0.00013072937   2    1000023    4

DECAY 2000006  135.84923
    0.27235303   2    1000025    6
    0.23797963   2    1000024    5
    0.21322593   2    1000035    6
    0.1241472   2    1000022    6
    0.12227063   2    1000037    5
    0.014829408   2    1000023    6
    0.011948011   2    1000006    23
    0.0032358286   2    1000006    25

DECAY 1000024  1.612703e-06
    1   2    1000039    24

DECAY 1000037  3.1276233
    0.28854477   2    1000022    24
    0.271301   2    1000024    23
    0.25313809   2    1000024    25
    0.18696706   2    1000023    24

DECAY 1000022  8.150307e-07
    0.76066963   2    1000039    23
    0.22591839   2    1000039    22
    0.013411978   2    1000039    25

DECAY 1000023  1.3135729e-06
    0.57405798   2    1000039    22
    0.16037855   2    1000039    23
    0.029195073   3    1000024    1   -2
    0.029195073   3   -1000024   -1    2
    0.028875932   3    1000024    3   -4
    0.028875932   3   -1000024   -3    4
    0.022821772   2    1000022    22
    0.013757894   3    1000022    12   -12
    0.010816289   3    1000022    1   -1
    0.010814698   3    1000022    3   -3
    0.0092474548   3    1000024    11   -12
    0.0092474548   3   -1000024   -11    12
    0.0092469414   3    1000024    13   -14
    0.0092469414   3   -1000024   -13    14
    0.00907801   3    1000024    15   -16
    0.00907801   3   -1000024   -15    16
    0.0084392436   3    1000022    2   -2
    0.0081860807   3    1000022    4   -4
    0.0081235256   3    1000022    5   -5
    0.0045403485   2    1000039    25
    0.0023043585   3    1000022    11   -11
    0.0023038266   3    1000022    13   -13
    0.0021686146   3    1000022    15   -15

DECAY 1000025  5.2867019
    0.24832103   2    1000022    23
    0.2389636   2    1000024   -24
    0.2389636   2   -1000024    24
    0.22613167   2    1000022    25
    0.046915929   2    1000023    25
    0.00049877023   2    1000023    23
    0.00014081202   2    1000022    22

DECAY 1000035  3.5151007
    0.26282968   2    1000024   -24
    0.26282968   2   -1000024    24
    0.22625337   2    1000022    25
    0.16958428   2    1000023    23
    0.073937516   2    1000023    25
    0.0044758322   2    1000022    23

DECAY 1000021  6.0019439
    0.19287494   2    1000006   -6
    0.19287494   2   -1000006    6
    0.051922042   2    1000005   -5
    0.051922042   2   -1000005    5
    0.026486135   2    2000005   -5
    0.026486135   2   -2000005    5
    0.025291262   2    2000002   -2
    0.025291262   2   -2000002    2
    0.025289879   2    2000004   -4
    0.025289879   2   -2000004    4
    0.025252891   2    2000003   -3
    0.025252891   2   -2000003    3
    0.025251999   2    2000001   -1
    0.025251999   2   -2000001    1
    0.023413595   3    1000025    6   -6
    0.020146131   2    1000002   -2
    0.020146131   2   -1000002    2
    0.020144773   2    1000004   -4
    0.020144773   2   -1000004    4
    0.019826881   2    1000003   -3
    0.019826881   2   -1000003    3
    0.019826693   2    1000001   -1
    0.019826693   2   -1000001    1
    0.018066764   3    1000035    6   -6
    0.011167091   3    1000022    6   -6
    0.0092896458   3    1000024    5   -6
    0.0092896458   3   -1000024   -5    6
    0.0055978277   2    1000006   -4
    0.0055978277   2   -1000006    4
    0.0045208519   3    1000037    5   -6
    0.0045208519   3   -1000037   -5    6
    0.0012333914   2    1000035    21
    0.0011545974   2    1000025    21
    0.001136793   3    1000023    6   -6
    0.00026449263   2    1000039    21

DECAY 25  0.0038448695
    0.57982735   2   -5    5
    0.22168278   2   -24    24
    0.072561159   2    21    21
    0.06660188   2   -15    15
    0.02844458   2   -4    4
    0.02663865   2    23    23
    0.0023334173   2    22    22
    0.0014607908   2    22    23
    0.00023098848   2   -13    13
    0.00021765501   2   -3    3
    6.0179302e-07   2   -1    1
    1.4658255e-07   2   -2    2
    5.192882e-09   2   -11    11

DECAY 35  7.4829854
    0.78609793   2   -5    5
    0.12168092   2   -15    15
    0.052631813   2   -6    6
    0.021153628   2    1000022    1000023
    0.011658318   2   -1000024    1000024
    0.0058058612   2    1000022    1000022
    0.00042150038   2   -13    13
    0.00029043753   2   -3    3
    0.00014257924   2    25    25
    5.6431163e-05   2    1000023    1000023
    3.2114705e-05   2    23    23
    1.7025431e-05   2   -24    24
    8.9091995e-06   2    21    21
    8.0293284e-07   2   -1    1
    7.9384437e-07   2    22    23
    7.2280338e-07   2   -4    4
    2.0848295e-07   2    22    22
    9.4678524e-09   2   -11    11
    3.7264049e-12   2   -2    2

DECAY 36  7.7261976
    0.75339297   2   -5    5
    0.11661673   2   -15    15
    0.049803   2   -6    6
    0.049702244   2   -1000024    1000024
    0.024667174   2    1000022    1000022
    0.0026250191   2    1000023    1000023
    0.0023782415   2    1000022    1000023
    0.00040395819   2   -13    13
    0.00027835547   2   -3    3
    8.3773991e-05   2    21    21
    4.1957857e-05   2    23    25
    4.1979787e-06   2    22    23
    9.2987729e-07   2    22    22
    7.6953158e-07   2   -1    1
    6.6199721e-07   2   -4    4
    9.0738153e-09   2   -11    11
    3.4133966e-12   2   -2    2
    2.6571768e-35   2    25    25

DECAY 37  7.2444087
    0.84601529   2   -5    6
    0.12709811   2   -15    16
    0.024841109   2    1000023    1000024
    0.001185871   2   -5    4
    0.00044933759   2   -13    14
    0.00026984599   2   -3    4
    7.0291579e-05   2   -3    6
    4.4938283e-05   2    24    25
    1.2549188e-05   2   -3    2
    8.46834e-06   2   -5    2
    3.2058546e-06   2   -1    6
    7.4694726e-07   2   -1    2
    1.6008994e-07   2    1000022    1000024
    6.4265112e-08   2   -1    4
    1.0510053e-08   2   -11    12
    4.2463665e-12   2    24    36
    4.1471792e-12   2    24    35

DECAY 6  2.43
    1   2    5    24

DECAY 15 -1


DECAY 1000039 -1
