BLOCK SPINFO
   1   SPheno
   2   v4.0.5be

BLOCK SPHENOINFO
   1   2
   2   2

BLOCK MODSEL
   1   0

BLOCK MINPAR
   3    16.321349
   4   -1

BLOCK EXTPAR
   0    4203.2791
   1   -586.89865
   2   -4865.0423
   3    3221.7791
   11   -6310.0356
   12    6949.2544
   13    1994.7417
   23   -174.58211
   25    15.558897
   26    707.55632
   31    958.91129
   32    958.91129
   33    245.55767
   34    2167.0903
   35    2167.0903
   36    2272.7967
   41    3675.6324
   42    3675.6324
   43    3514.433
   44    1445.8548
   45    1445.8548
   46    4908.5958
   47    3139.9706
   48    3139.9706
   49    4714.5166

BLOCK SMINPUTS
   1    127.90897
   2    1.1663787e-05
   3    0.1184
   4    91.1876
   5    4.18
   6    173.2
   7    1.777
   8    0
   11    0.00051099893
   12    0
   13    0.10565837
   14    0
   21    0.005
   22    0.0025
   23    0.095
   24    1.27

BLOCK GAUGE Q=  4203.2791
   1    0.35536298
   2    0.66519887
   3    1.219778

BLOCK YU Q=  4203.2791
   1   1    8.4016717e-06
   2   2    0.0042680492
   3   3    1.0149894

BLOCK YD Q=  4203.2791
   1   1    0.00026267865
   2   2    0.0049908943
   3   3    0.2604949

BLOCK YE Q=  4203.2791
   1   1    4.5839344e-05
   2   2    0.0094781226
   3   3    0.15940643

BLOCK AU Q=  4203.2791
   1   1    0
   2   2    0
   3   3   -6310.0423

BLOCK AD Q=  4203.2791
   1   1    0
   2   2    0
   3   3    6949.2586

BLOCK AE Q=  4203.2791
   1   1    0
   2   2    0
   3   3    1994.7408

BLOCK MSOFT Q=  4203.2791
   1   -586.89865
   2   -4865.0423
   3    3221.7791
   21    341221.87
   22    247409.21
   31    958.91129
   32    958.91129
   33    245.55767
   34    2167.0903
   35    2167.0903
   36    2272.7967
   41    3675.6324
   42    3675.6324
   43    3514.433
   44    1445.8548
   45    1445.8548
   46    4908.5958
   47    3139.9706
   48    3139.9706
   49    4714.5166

BLOCK MASS
   6    173.2
   23    91.1876
   24    80.429995
   15    1.777
   25    124.22996
   35    707.64965
   36    707.55632
   37    712.21149
   1000001    3840.3602
   2000001    3284.9387
   1000002    3839.5565
   2000002    1690.0333
   1000003    3840.3592
   2000003    3284.9373
   1000004    3839.5555
   2000004    1690.0322
   1000005    3632.9395
   2000005    4796.3629
   1000006    3624.9492
   2000006    4873.8767
   1000011    1049.0872
   2000011    2157.8112
   1000012    1046.3929
   1000013    1049.0818
   2000013    2157.8051
   1000014    1046.3879
   1000015    465.89322
   2000015    2261.5378
   1000016    459.56387
   1000021    3484.4809
   1000022   -190.07935
   1000023    195.06042
   1000025   -577.6648
   1000035   -4803.2724
   1000024    193.45476
   1000037    4803.3261

BLOCK ALPHA
      -0.064112271

BLOCK HMIX Q=  4203.2791
   1   -174.58211
   2    15.558897
   3    242.88694
   4    500635.94

BLOCK STOPMIX
   1   1    0.99664112
   1   2    0.081893103
   2   1   -0.081893103
   2   2    0.99664112

BLOCK SBOTMIX
   1   1   -0.99999792
   1   2    0.0020411203
   2   1   -0.0020411203
   2   2   -0.99999792

BLOCK STAUMIX
   1   1   -0.99999857
   1   2    0.0016888533
   2   1   -0.0016888533
   2   2   -0.99999857

BLOCK NMIX
   1   1    0.084747287
   1   2   -0.012515178
   1   3   -0.71000586
   1   4    0.69896562
   2   1   -0.037786449
   2   2    0.010385911
   2   3   -0.70338521
   2   4   -0.70972781
   3   1   -0.99568572
   3   2   -0.0016105249
   3   3   -0.03373795
   3   4    0.086423944
   4   1    0.00015052264
   4   2   -0.99986645
   4   3    0.0016351081
   4   4   -0.016260209

BLOCK UMIX
   1   1   -0.0023125317
   1   2   -0.99999733
   2   1   -0.99999733
   2   2    0.0023125317

BLOCK VMIX
   1   1    0.022997707
   1   2    0.99973552
   2   1    0.99973552
   2   2   -0.022997707

BLOCK HIGGSBOUNDSINPUTHIGGSCOUPLINGSFERMIONS
       0, 242.07928,3,36,15,15

BLOCK HIGGSBOUNDSINPUTHIGGSCOUPLINGSBOSONS
       0,4,36,21,21,23

BLOCK SPHENOLOWENERGY
   1    0.00038333502
   2    1.5882508e-06
   3    3.5270673e-05
   4    2.2906836e-15
   5    9.785547e-11
   6    2.0489206e-08
   7    7.7603451e-14
   8    3.3152192e-09
   9    7.0332256e-07
   10    9.3550498e-05
   11    0.96634082
   12    0.54219531
   13    19.358552
   14    0
   15    0
   16    0.0021584139
   17    2.2816736e-15
   18    2.4814687e-11
   19    8.2935261e-11
   20    6.9531474e-16
   21    2.9726844e-11
   22    1.0083229e-08
   23    0
   24    0
   25    0
   26    0
   27    0
   28    0
   29    0
   30    0
   31    0
   39    3.2394172e-05
   40    0
   41    0
   42    0

BLOCK FWCOEF Q=  160
   305   4422   0   0   -0.18881911
   305   4422   0   2   -0.25166091
   305   4322   0   2   -0.001233891
   305   6421   0   0   -0.095227835
   305   6421   0   2   -0.16230689
   305   6321   0   2   -0.0013160666
   3051111   4133   0   0    1.6280287
   3051111   4133   0   2    1.6283226
   3051111   4233   0   2    3.5090175e-05
   3051111   4137   0   0   -4.4507208
   3051111   4137   0   2   -4.4508441
   3051111   4237   0   2   -0.00025937319
   3051313   4133   0   0    1.6280287
   3051313   4133   0   2    1.6283224
   3051313   4233   0   2    3.5088928e-05
   3051313   4137   0   0   -4.4507208
   3051313   4137   0   2   -4.4508443
   3051313   4237   0   2   -0.00025937201
   3051212   4137   0   0    1.5053501
   3051212   4137   0   2    1.5053766
   3051212   4237   0   2    5.6071161e-05
   3051414   4137   0   0    1.5053501
   3051414   4137   0   2    1.5053766
   3051414   4237   0   2    5.6071428e-05
   3051616   4137   0   0    1.5053501
   3051616   4137   0   2    1.5053764
   3051616   4237   0   2    5.6146485e-05

BLOCK IMFWCOEF Q=  160
   305   4422   0   0    3.8581904e-07
   305   4422   0   2    1.2206167e-06
   305   4322   0   2   -1.665941e-06
   305   6421   0   0    3.3047952e-07
   305   6421   0   2    1.1302232e-05
   305   6321   0   2   -5.8620506e-07
   3051111   4133   0   2   -7.3818692e-07
   3051111   4233   0   2    1.6377059e-06
   3051111   4137   0   2    7.5340101e-06
   3051111   4237   0   2   -1.2104074e-05
   3051313   4133   0   2   -7.3818534e-07
   3051313   4233   0   2    1.6377056e-06
   3051313   4137   0   2    7.5340114e-06
   3051313   4237   0   2   -1.2104075e-05
   3051212   4137   0   2   -1.6327125e-06
   3051212   4237   0   2    2.6166007e-06
   3051414   4137   0   2   -1.6327125e-06
   3051414   4237   0   2    2.6166007e-06
   3051616   4137   0   2   -1.6359445e-06
   3051616   4237   0   2    2.6166013e-06

DECAY 23  2.4952


DECAY 24  2.085


DECAY 1000011  0.64327497
    0.99208   2    1000025    11
    0.0072057177   2    1000022    11
    0.00064263823   2    1000023    11

DECAY 2000011  9.3552688
    0.9901772   2    1000025    11
    0.0081949684   2    1000022    11
    0.0016278264   2    1000023    11

DECAY 1000013  0.64501583
    0.98939053   2    1000025    13
    0.008556666   2    1000022    13
    0.001981359   2    1000023    13

DECAY 2000013  9.3628329
    0.98937395   2    1000025    13
    0.0083927681   2    1000022    13
    0.001826957   2    1000023    13
    0.00040529169   2   -1000024    14

DECAY 1000015  0.16339706
    0.51409236   2    1000022    15
    0.48578061   2    1000023    15
    0.00012692634   2   -1000024    16

DECAY 2000015  13.720952
    0.71749265   2    1000025    15
    0.082104051   2   -1000024    16
    0.054250757   2    1000016   -37
    0.047246921   2    1000022    15
    0.041793315   2    1000023    15
    0.027127114   2    1000015    36
    0.027126277   2    1000015    35
    0.0014353784   2    1000016   -24
    0.00071422589   2    1000015    23
    0.00070931216   2    1000015    25

DECAY 1000012  0.64899788
    0.96465604   2    1000025    12
    0.022161504   2    1000022    12
    0.0070024534   2    1000024    11
    0.0061800003   2    1000023    12

DECAY 1000014  0.65073367
    0.96207017   2    1000025    14
    0.022102269   2    1000022    14
    0.0096640761   2    1000024    13
    0.0061634817   2    1000023    14

DECAY 1000016  0.16451416
    0.96406135   2    1000024    15
    0.028214282   2    1000022    16
    0.0077243669   2    1000023    16

DECAY 2000001  1.7231482
    0.99089301   2    1000025    1
    0.0075941667   2    1000022    1
    0.0015102208   2    1000023    1

DECAY 1000001  9.9862961
    0.94829196   2    1000021    1
    0.049912566   2    1000025    1
    0.0012839565   2    1000022    1
    0.00049350673   2    1000023    1

DECAY 2000003  1.7263714
    0.9890434   2    1000025    3
    0.0080508683   2    1000022    3
    0.001969335   2    1000023    3
    0.00093639602   2   -1000024    4

DECAY 1000003  9.989518
    0.94798083   2    1000021    3
    0.049896655   2    1000025    3
    0.0013788483   2    1000022    3
    0.00058685357   2    1000023    3
    0.00015654416   2   -1000024    4

DECAY 1000005  80.856573
    0.91096101   2   -1000024    6
    0.030578452   2    1000022    5
    0.029884295   2    1000023    5
    0.022718752   2    1000021    5
    0.0058574894   2    1000025    5

DECAY 2000005  109.08988
    0.77389203   2    1000021    5
    0.059011433   2   -1000024    6
    0.041844079   2    1000006   -37
    0.029985479   2    1000022    5
    0.029312903   2    1000023    5
    0.023706841   2    1000025    5
    0.020853115   2    1000005    36
    0.020851193   2    1000005    35
    0.00022294296   2    1000006   -24
    0.00020996643   2    1000005    25
    0.00011001444   2    1000005    23

DECAY 2000002  2.9500961
    0.98926444   2    1000025    2
    0.0089572611   2    1000022    2
    0.0017782991   2    1000023    2

DECAY 1000002  9.9659442
    0.94632775   2    1000021    2
    0.051853297   2    1000025    2
    0.0017851922   2    1000024    1

DECAY 2000004  2.9512773
    0.98886561   2    1000025    4
    0.0090528536   2    1000022    4
    0.0018795166   2    1000023    4
    0.00020201698   2    1000024    3

DECAY 1000004  9.9690878
    0.94601628   2    1000021    4
    0.051837964   2    1000025    4
    0.0019739859   2    1000024    3

DECAY 1000006  80.890353
    0.45598686   2    1000023    6
    0.44105656   2    1000022    6
    0.063834106   2    1000024    5
    0.016284733   2    1000025    6
    0.01337361   3    1000022    24    5
    0.0091604349   2    1000021    4
    0.00011872214   3   -1000015    16    5

DECAY 2000006  404.71553
    0.24497527   2    1000024    5
    0.22095241   2    1000021    6
    0.12412427   2    1000023    6
    0.12093428   2    1000022    6
    0.11382465   2    1000005    24
    0.088781701   2    1000006    25
    0.057367677   2    1000006    23
    0.026524064   2    1000025    6
    0.0012560723   2    1000005    37
    0.00063894008   2    1000006    36
    0.00062046833   2    1000006    35

DECAY 1000024  1.3535232e-09
    0.44365793   3    1000022   -1    2
    0.2238668   3    1000022   -3    4
    0.14788819   3    1000022   -11    12
    0.14716859   3    1000022   -13    14
    0.037418495   3    1000022   -15    16

DECAY 1000037  258.19414
    0.080349702   2   -1000015    16
    0.080349142   2    1000016   -15
    0.074257867   2   -1000013    14
    0.074257791   2   -1000011    12
    0.074257131   2    1000014   -13
    0.07425706   2    1000012   -11
    0.045450872   2    1000006   -5
    0.044148151   2   -1000005    6
    0.041284801   2    1000024    25
    0.039870416   2    37    1000022
    0.039062704   2    1000023    24
    0.038794923   2    1000024    23
    0.03874864   2    1000024    35
    0.03874826   2    1000024    36
    0.038336865   2    37    1000023
    0.037854409   2    1000022    24
    0.032002694   2    1000004   -3
    0.032002634   2    1000002   -1
    0.031971988   2   -1000003    4
    0.031971961   2   -1000001    2
    0.0050787804   3    1000024    6   -6
    0.003002438   3    1000023   -5    6
    0.0028411772   3    1000022   -5    6
    0.00068802338   2    1000025    24
    0.00015374004   3    1000021   -5    6
    0.00010424943   2    37    1000025
    0.00010003692   3    1000025   -15    16

DECAY 1000022 -1


DECAY 1000023  2.185227e-08
    0.65180855   2    1000022    22
    0.094902112   3    1000022    12   -12
    0.070961254   3    1000022    1   -1
    0.070661832   3    1000022    3   -3
    0.055344138   3    1000022    2   -2
    0.02203454   3    1000022    4   -4
    0.016013897   3    1000022    11   -11
    0.015907498   3    1000022    13   -13
    0.0016040686   3    1000022    15   -15
    0.00022721417   3    1000024    1   -2
    0.00022721417   3   -1000024   -1    2

DECAY 1000025  1.916811
    0.21256565   2    1000024   -24
    0.21256565   2   -1000024    24
    0.18234226   2    1000023    23
    0.14383845   2    1000022    25
    0.11646271   2    1000023    25
    0.034066857   2    1000022    23
    0.025134708   2    1000016   -16
    0.025134708   2   -1000016    16
    0.023058229   2    1000015   -15
    0.023058229   2   -1000015    15
    0.00086544482   3    1000024    5   -6
    0.00086544482   3   -1000024   -5    6

DECAY 1000035  259.79049
    0.039944149   2    1000016   -16
    0.039944149   2   -1000016    16
    0.039910698   2    1000015   -15
    0.039910698   2   -1000015    15
    0.039310613   2    37   -1000024
    0.039310613   2   -37    1000024
    0.038583913   2    1000024   -24
    0.038583913   2   -1000024    24
    0.036915528   2    1000014   -14
    0.036915528   2   -1000014    14
    0.036915493   2    1000012   -12
    0.036915493   2   -1000012    12
    0.036884699   2    1000013   -13
    0.036884699   2   -1000013    13
    0.036884661   2    1000011   -11
    0.036884661   2   -1000011    11
    0.024143742   2    1000022    25
    0.023554183   2    1000023    35
    0.02325766   2    1000023    23
    0.022695976   2    1000006   -6
    0.022695976   2   -1000006    6
    0.022350057   2    1000005   -5
    0.022350057   2   -1000005    5
    0.020305856   2    1000022    36
    0.019292165   2    1000023    25
    0.018538201   2    1000022    35
    0.015904894   2    1000004   -4
    0.015904894   2   -1000004    4
    0.015904868   2    1000002   -2
    0.015904868   2   -1000002    2
    0.015883037   2    1000003   -3
    0.015883037   2   -1000003    3
    0.015883006   2    1000001   -1
    0.015883006   2   -1000001    1
    0.015390146   2    1000023    36
    0.015041627   2    1000022    23
    0.0031175119   3    1000024    5   -6
    0.0031175119   3   -1000024   -5    6
    0.0025715268   3    1000023    6   -6
    0.0025216584   3    1000022    6   -6
    0.00047356755   2    1000025    25
    0.00025327677   2    1000025    23
    0.00018618423   3    1000021    6   -6

DECAY 1000021  123.72607
    0.24377394   2    2000004   -4
    0.24377394   2   -2000004    4
    0.24377378   2    2000002   -2
    0.24377378   2   -2000002    2
    0.0051589878   2    2000003   -3
    0.0051589878   2   -2000003    3
    0.0051589151   2    2000001   -1
    0.0051589151   2   -2000001    1
    0.0010779765   3    1000024    5   -6
    0.0010779765   3   -1000024   -5    6
    0.00093127208   3    1000023    6   -6
    0.00090452571   3    1000022    6   -6

DECAY 25  0.0040140424
    0.60338254   2   -5    5
    0.20350719   2   -24    24
    0.069183634   2   -15    15
    0.068471161   2    21    21
    0.027179532   2   -4    4
    0.024259876   2    23    23
    0.0022010472   2    22    22
    0.0013481127   2    22    23
    0.00023995408   2   -13    13
    0.00022618179   2   -3    3
    6.2536732e-07   2   -1    1
    1.4006484e-07   2   -2    2
    5.3944442e-09   2   -11    11

DECAY 35  3.2483826
    0.83838802   2   -5    5
    0.1275659   2   -15    15
    0.027781382   2   -6    6
    0.0017233788   2    25    25
    0.0015277081   2    1000022    1000022
    0.00063250151   2   -1000024    1000024
    0.00061290157   2    1000023    1000023
    0.00043956616   2   -13    13
    0.00031846891   2   -3    3
    0.00030347656   2    1000022    1000023
    0.00029646386   2   -24    24
    0.00016170393   2    23    23
    9.3015243e-05   2    21    21
    4.3324188e-05   2   -1000015    1000015
    8.8048838e-07   2   -1    1
    5.2353596e-07   2   -4    4
    2.2135417e-07   2    22    22
    8.9702406e-08   2    22    23
    9.8767787e-09   2   -11    11
    2.6998873e-12   2   -2    2

DECAY 36  3.2207239
    0.83401539   2   -5    5
    0.1268909   2   -15    15
    0.033668745   2   -6    6
    0.0025784332   2    1000022    1000022
    0.00086347556   2   -1000024    1000024
    0.00063807906   2    1000023    1000023
    0.00043723227   2   -13    13
    0.00031678379   2   -3    3
    0.00026496409   2    23    25
    0.00023412929   2    21    21
    8.9798705e-05   2    1000022    1000023
    8.7582923e-07   2   -1    1
    5.1484648e-07   2    22    22
    4.785847e-07   2   -4    4
    1.8020063e-07   2    22    23
    9.8243391e-09   2   -11    11
    2.468284e-12   2   -2    2
    3.1389501e-36   2    25    25

DECAY 37  2.7127891
    0.85655396   2   -5    6
    0.13986052   2   -15    16
    0.0013326871   2   -5    4
    0.00080826954   2    1000022    1000024
    0.00049446267   2   -13    14
    0.00032819948   2   -3    4
    0.00032543656   2    24    25
    0.00016642851   2   -1000015    1000016
    5.872603e-05   2   -3    6
    4.3062044e-05   2    1000023    1000024
    1.5059863e-05   2   -3    2
    9.5168121e-06   2   -5    2
    2.6740183e-06   2   -1    6
    9.0904988e-07   2   -1    2
    6.9092924e-08   2   -1    4
    1.1565534e-08   2   -11    12
    1.0889623e-09   2    24    36
    9.8419416e-10   2    24    35

DECAY 6  2.43
    1   2    5    24

DECAY 15 -1
