BLOCK SPINFO
   1   SPheno
   2   v4.0.5be

BLOCK SPHENOINFO
   1   2
   2   2

BLOCK MODSEL
   1   0

BLOCK MINPAR
   3    25.165709
   4    1

BLOCK EXTPAR
   0    1552.5219
   1   -76.749426
   2    1236.4296
   3    3000
   11    2903.6741
   12   -1481.6296
   13   -630.14244
   23    1342.3962
   25    24.213156
   26    4294.1601
   31    1670.289
   32    1670.289
   33    1685.4252
   34    844.65088
   35    844.65088
   36    1255.0586
   41    5000
   42    5000
   43    1334.5411
   44    5000
   45    5000
   46    1820.7077
   47    5000
   48    5000
   49    1091.1455

BLOCK SMINPUTS
   1    127.90897
   2    1.1663787e-05
   3    0.1184
   4    91.1876
   5    4.18
   6    173.2
   7    1.777
   8    0
   11    0.00051099893
   12    0
   13    0.10565837
   14    0
   21    0.005
   22    0.0025
   23    0.095
   24    1.27

BLOCK GAUGE Q=  1552.5219
   1    0.35536298
   2    0.66519887
   3    1.219778

BLOCK YU Q=  1552.5219
   1   1    8.3915196e-06
   2   2    0.004262892
   3   3    1.013763

BLOCK YD Q=  1552.5219
   1   1    0.00040829331
   2   2    0.0077575728
   3   3    0.40489902

BLOCK YE Q=  1552.5219
   1   1    7.1250168e-05
   2   2    0.014732275
   3   3    0.24777263

BLOCK AU Q=  1552.5219
   1   1    0
   2   2    0
   3   3    2903.6741

BLOCK AD Q=  1552.5219
   1   1    0
   2   2    0
   3   3   -1481.6297

BLOCK AE Q=  1552.5219
   1   1    0
   2   2    0
   3   3   -630.14244

BLOCK MSOFT Q=  1552.5219
   1   -76.749426
   2    1236.4296
   3    3000
   21    16588232
   22   -1720614.3
   31    1670.289
   32    1670.289
   33    1685.4252
   34    844.65088
   35    844.65088
   36    1255.0586
   41    5000
   42    5000
   43    1334.5411
   44    5000
   45    5000
   46    1820.7077
   47    5000
   48    5000
   49    1091.1455

BLOCK MASS
   6    173.2
   23    91.1876
   24    80.429995
   15    1.777
   25    122.45821
   35    4292.9756
   36    4294.1601
   37    4294.3487
   1000001    5028.4385
   2000001    5019.0615
   1000002    5027.99
   2000002    5022.1485
   1000003    5028.4425
   2000003    5019.0626
   1000004    5027.992
   2000004    5022.1493
   1000005    1094.0829
   2000005    1355.3554
   1000006    1314.8443
   2000006    1833.1633
   1000011    1680.8913
   2000011    838.14266
   1000012    1678.6329
   1000013    1680.8984
   2000013    838.17066
   1000014    1678.6381
   1000015    1255.6573
   2000015    1698.1221
   1000016    1695.04
   1000021    3190.9047
   1000022   -77.096255
   1000023    1249.9247
   1000025   -1346.4887
   1000035    1380.1745
   1000024    1250.1114
   1000037    1380.3397

BLOCK ALPHA
      -0.039775632

BLOCK HMIX Q=  1552.5219
   1    1342.3962
   2    24.213156
   3    243.98244
   4    18439811

BLOCK STOPMIX
   1   1   -0.96490816
   1   2    0.26258757
   2   1   -0.26258757
   2   2   -0.96490816

BLOCK SBOTMIX
   1   1    0.094730511
   1   2    0.99550295
   2   1   -0.99550295
   2   2    0.094730511

BLOCK STAUMIX
   1   1    0.045939682
   1   2    0.99894421
   2   1   -0.99894421
   2   2    0.045939682

BLOCK NMIX
   1   1    0.99945823
   1   2    2.1150473e-05
   1   3    0.032905675
   1   4    0.00068139824
   2   1    0.011324354
   2   2    0.87771745
   2   3   -0.35126854
   2   4    0.32572111
   3   1   -0.023737494
   3   2    0.020548865
   3   3    0.70633181
   3   4    0.70718431
   4   1   -0.019787334
   4   2    0.47873773
   4   3    0.61369618
   4   4   -0.62753139

BLOCK UMIX
   1   1   -0.85457257
   1   2    0.519332
   2   1    0.519332
   2   2    0.85457257

BLOCK VMIX
   1   1   -0.87525953
   1   2    0.48365356
   2   1    0.48365356
   2   2    0.87525953

BLOCK HIGGSBOUNDSINPUTHIGGSCOUPLINGSFERMIONS
       0, 586.27692,3,36,15,15

BLOCK HIGGSBOUNDSINPUTHIGGSCOUPLINGSBOSONS
       0,4,36,21,21,23

BLOCK SPHENOLOWENERGY
   1    0.00033570078
   2    1.5873889e-06
   3    3.522436e-05
   4    3.1255987e-15
   5    1.3352216e-10
   6    2.7959483e-08
   7    1.0503556e-13
   8    4.4871204e-09
   9    9.5203524e-07
   10    9.6551036e-05
   11    0.99733524
   12    0.54294314
   13    19.398687
   14    0
   15    0
   16    0.0021625711
   17    2.2817118e-15
   18    2.4784889e-11
   19    8.286651e-11
   20    3.027986e-15
   21    1.294542e-10
   22    3.6844533e-08
   23    0
   24    0
   25    0
   26    0
   27    0
   28    0
   29    0
   30    0
   31    0
   39    7.0441356e-05
   40    0
   41    0
   42    0

BLOCK FWCOEF Q=  160
   305   4422   0   0   -0.18881911
   305   4422   0   2   -0.20641896
   305   4322   0   2   -0.0001457879
   305   6421   0   0   -0.095227835
   305   6421   0   2   -0.10800649
   305   6321   0   2   -0.00013692745
   3051111   4133   0   0    1.5931507
   3051111   4133   0   2    1.5937192
   3051111   4233   0   2    8.7699885e-05
   3051111   4137   0   0   -4.4158428
   3051111   4137   0   2   -4.4114137
   3051111   4237   0   2   -0.00068091044
   3051313   4133   0   0    1.5931507
   3051313   4133   0   2    1.5937183
   3051313   4233   0   2    8.7699736e-05
   3051313   4137   0   0   -4.4158428
   3051313   4137   0   2   -4.4114146
   3051313   4237   0   2   -0.00068091074
   3051212   4137   0   0    1.5053501
   3051212   4137   0   2    1.5043915
   3051212   4237   0   2    0.00014833992
   3051414   4137   0   0    1.5053501
   3051414   4137   0   2    1.5043915
   3051414   4237   0   2    0.00014833992
   3051616   4137   0   0    1.5053501
   3051616   4137   0   2    1.5043915
   3051616   4237   0   2    0.00014834067

BLOCK IMFWCOEF Q=  160
   305   4422   0   0    3.8574058e-07
   305   4422   0   2    1.547081e-05
   305   4322   0   2   -1.4060693e-06
   305   6421   0   0    3.3041232e-07
   305   6421   0   2   -4.2741281e-06
   305   6321   0   2   -8.3209665e-07
   3051111   4133   0   2   -5.2379922e-07
   3051111   4233   0   2    1.7144861e-06
   3051111   4137   0   2    5.3264213e-06
   3051111   4237   0   2   -1.3313894e-05
   3051313   4133   0   2   -5.2379937e-07
   3051313   4233   0   2    1.7144837e-06
   3051313   4137   0   2    5.3264329e-06
   3051313   4237   0   2   -1.33139e-05
   3051212   4137   0   2   -1.042613e-06
   3051212   4237   0   2    2.9005309e-06
   3051414   4137   0   2   -1.042613e-06
   3051414   4237   0   2    2.9005309e-06
   3051616   4137   0   2   -1.0426125e-06
   3051616   4237   0   2    2.9005309e-06

DECAY 23  2.4952


DECAY 24  2.085


DECAY 2000011  4.135911
    1   2    1000022    11

DECAY 1000011  6.008722
    0.35914794   2   -1000024    12
    0.34957193   2    1000022    11
    0.1921951   2    1000023    11
    0.070429203   2   -1000037    12
    0.028646038   2    1000035    11

DECAY 2000013  4.1360575
    1   2    1000022    13

DECAY 1000013  6.0114927
    0.35899135   2   -1000024    14
    0.34941359   2    1000022    13
    0.19214007   2    1000023    13
    0.070399479   2   -1000037    14
    0.028682956   2    1000035    13
    0.00028542141   2    2000013    25

DECAY 1000015  6.2514213
    0.999989   2    1000022    15

DECAY 2000015  7.1421908
    0.31339102   2   -1000024    16
    0.29843969   2    1000022    15
    0.17527899   2    1000023    15
    0.068539242   2   -1000037    16
    0.042789094   2    1000015    23
    0.040905764   2    1000035    15
    0.040502562   2    1000015    25
    0.020153635   2    1000025    15

DECAY 1000012  6.0066452
    0.37386587   2    1000024    11
    0.34916365   2    1000022    12
    0.18553982   2    1000023    12
    0.060344925   2    1000037    11
    0.030913032   2    1000035    12
    0.0001727037   2    1000025    12

DECAY 1000014  6.0076696
    0.37387154   2    1000024    13
    0.34910521   2    1000022    14
    0.18551163   2    1000023    14
    0.060430287   2    1000037    13
    0.030908659   2    1000035    14
    0.00017267867   2    1000025    14

DECAY 1000016  7.1723011
    0.34720832   2    1000024    15
    0.29529908   2    1000022    16
    0.16451749   2    1000023    16
    0.085027777   2    1000015    24
    0.079504959   2    1000037    15
    0.028286001   2    1000035    16
    0.00015637983   2    1000025    16

DECAY 2000001  143.43834
    0.98047669   2    1000021    1
    0.019504893   2    1000022    1

DECAY 1000001  200.329
    0.7069067   2    1000021    1
    0.14203834   2   -1000024    2
    0.07457726   2    1000023    1
    0.050952293   2   -1000037    2
    0.021969792   2    1000035    1
    0.0034971413   2    1000022    1

DECAY 2000003  143.44878
    0.98040615   2    1000021    3
    0.019503523   2    1000022    3

DECAY 1000003  200.33621
    0.70688332   2    1000021    3
    0.14203506   2   -1000024    4
    0.074577882   2    1000023    3
    0.050956631   2   -1000037    4
    0.021978699   2    1000035    3
    0.0034970506   2    1000022    3

DECAY 1000005  0.61736651
    1   2    1000022    5

DECAY 2000005  1.2379757
    0.55837072   2    1000005    25
    0.21129543   2    1000005    23
    0.14588755   2    1000022    5
    0.084144111   2    1000023    5
    0.00030219375   2    1000025    5

DECAY 2000002  152.16755
    0.92634205   2    1000021    2
    0.073589197   2    1000022    2

DECAY 1000002  200.31957
    0.70670693   2    1000021    2
    0.14898857   2    1000024    1
    0.075260845   2    1000023    2
    0.044188774   2    1000037    1
    0.021330857   2    1000035    2
    0.0034986564   2    1000022    2

DECAY 2000004  152.17069
    0.92632303   2    1000021    4
    0.073587677   2    1000022    4

DECAY 1000004  200.32648
    0.70668328   2    1000021    4
    0.14899057   2    1000024    3
    0.075259045   2    1000023    4
    0.044206032   2    1000037    3
    0.021333268   2    1000035    4
    0.0034985366   2    1000022    4

DECAY 1000006  0.78031798
    0.45380427   2    1000022    6
    0.38865596   2    1000005    24
    0.067020248   2    1000024    5
    0.066836825   2    1000022    4
    0.015244866   2    1000023    4
    0.0084375467   3    1000022    24    5

DECAY 2000006  75.121308
    0.33995441   2    2000005    24
    0.21012509   2    1000006    25
    0.19532641   2    1000006    23
    0.054851411   2    1000037    5
    0.054805846   2    1000024    5
    0.04984545   2    1000022    6
    0.041072024   2    1000025    6
    0.022559889   2    1000035    6
    0.022420297   2    1000023    6
    0.0090391691   2    1000005    24

DECAY 1000024  0.19869006
    0.96331392   2    1000022    24
    0.032110982   3    1000022   -5    6
    0.0018682008   3    1000022   -15    16
    0.0011100831   2   -2000013    14
    0.00079642842   3    1000022   -13    14
    0.00079636695   3    1000022   -11    12

DECAY 1000037  2.5311171
    0.2773462   2    1000022    24
    0.2572914   2   -1000005    6
    0.22047444   2    1000023    24
    0.14108244   2    1000024    23
    0.053405072   2    1000006   -5
    0.035435996   2    1000024    25
    0.008248391   3    1000022   -5    6
    0.0061783356   2   -1000015    16
    0.00034265716   2   -2000013    14

DECAY 1000022 -1


DECAY 1000023  0.3297859
    0.30385408   2    1000022    25
    0.2769171   2    1000022    23
    0.20320301   2    1000005   -5
    0.20320301   2   -1000005    5
    0.0083040054   3    1000022    6   -6
    0.00086039892   3    1000022    15   -15
    0.00072013935   3    1000022    12   -12
    0.00067539788   2    2000013   -13
    0.00067539788   2   -2000013    13
    0.00036987067   2    2000011   -11
    0.00036987067   2   -2000011    11
    0.00034088566   3    1000022    5   -5
    0.00024931105   3    1000022    13   -13
    0.00024927862   3    1000022    11   -11

DECAY 1000025  3.5474964
    0.20401078   2    1000024   -24
    0.20401078   2   -1000024    24
    0.12956015   2    1000023    23
    0.12027187   2    1000022    23
    0.12024154   2    1000022    25
    0.10617233   2    1000005   -5
    0.10617233   2   -1000005    5
    0.0042837294   3    1000022    6   -6
    0.0019562027   2    1000015   -15
    0.0019562027   2   -1000015    15
    0.00035487127   2    2000013   -13
    0.00035487127   2   -2000013    13
    0.00020160306   2    2000011   -11
    0.00020160306   2   -2000011    11
    0.0001989947   2    1000023    22

DECAY 1000035  2.2820173
    0.17596119   2    1000022    25
    0.16759381   2    1000024   -24
    0.16759381   2   -1000024    24
    0.16535135   2    1000022    23
    0.12854199   2    1000005   -5
    0.12854199   2   -1000005    5
    0.047642152   2    1000023    25
    0.0050211192   3    1000022    6   -6
    0.0035890712   2    1000015   -15
    0.0035890712   2   -1000015    15
    0.0023179603   2    2000005   -5
    0.0023179603   2   -2000005    5
    0.00043284319   2    2000013   -13
    0.00043284319   2   -2000013    13
    0.00040159603   2    1000023    23
    0.00023704639   2    2000011   -11
    0.00023704639   2   -2000011    11

DECAY 1000021  264.63082
    0.13888601   2    1000005   -5
    0.13888601   2   -1000005    5
    0.13092867   2    1000006   -6
    0.13092867   2   -1000006    6
    0.11994491   2    2000005   -5
    0.11994491   2   -2000005    5
    0.073226668   2    2000006   -6
    0.073226668   2   -2000006    6
    0.035227221   2    1000006   -4
    0.035227221   2   -1000006    4
    0.00070660884   3    1000037    5   -6
    0.00070660884   3   -1000037   -5    6
    0.00053719938   3    1000035    6   -6
    0.00051436404   3    1000025    6   -6
    0.00028100893   3    1000024    5   -6
    0.00028100893   3   -1000024   -5    6
    0.00018419349   3    1000035    5   -5
    0.0001833238   3    1000023    6   -6

DECAY 25  0.0035668804
    0.61086673   2   -5    5
    0.18889856   2   -24    24
    0.073861704   2    21    21
    0.070226842   2   -15    15
    0.030313973   2   -4    4
    0.021726049   2    23    23
    0.0023434596   2    22    22
    0.0012882871   2    22    23
    0.00024358574   2   -13    13
    0.00023001205   2   -3    3
    6.3596107e-07   2   -1    1
    1.5622331e-07   2   -2    2
    5.4761124e-09   2   -11    11

DECAY 35  79.372286
    0.2032467   2   -5    5
    0.1182596   2   -1000024    1000037
    0.1182596   2   -1000037    1000024
    0.079370138   2   -2000006    1000006
    0.079370138   2   -1000006    2000006
    0.07645836   2    1000023    1000025
    0.074025541   2   -15    15
    0.035784629   2   -1000024    1000024
    0.029799144   2   -1000006    1000006
    0.027270673   2    1000022    1000025
    0.022684022   2   -1000037    1000037
    0.021272513   2    1000023    1000035
    0.020530125   2   -2000006    2000006
    0.018460943   2    1000025    1000035
    0.017893799   2    1000022    1000035
    0.017402796   2    1000023    1000023
    0.01333844   2    1000035    1000035
    0.0077934119   2   -2000005    1000005
    0.0077934119   2   -1000005    2000005
    0.0064841849   2    1000022    1000023
    0.0023155494   2   -6    6
    0.00044390255   2   -2000015    1000015
    0.00044390255   2   -1000015    2000015
    0.00033730917   2   -1000005    1000005
    0.00028298779   2   -2000005    2000005
    0.00025626569   2   -13    13
    0.00013015084   2    1000022    1000022
    0.00012666364   2    1000025    1000025
    0.00012565992   2   -3    3
    2.4825944e-05   2    25    25
    5.1589162e-06   2   -1000015    1000015
    4.2611403e-06   2    21    21
    2.9693882e-06   2   -2000015    2000015
    5.1216442e-07   2    23    23
    3.474315e-07   2   -1    1
    9.9792136e-08   2   -24    24
    8.7737211e-08   2    22    23
    7.8111059e-08   2   -2000011    2000011
    7.8079408e-08   2   -2000013    2000013
    7.4005773e-08   2   -1000011    1000011
    7.3478842e-08   2   -1000013    1000013
    4.2551009e-08   2    22    22
    3.4909609e-08   2   -4    4
    1.4882153e-08   2   -2000013    1000013
    1.4882153e-08   2   -1000013    2000013
    5.7549694e-09   2   -11    11
    3.4809918e-13   2   -2000011    1000011
    3.4809918e-13   2   -1000011    2000011
    1.7998109e-13   2   -2    2

DECAY 36  78.467629
    0.19579949   2   -5    5
    0.10670661   2   -2000006    1000006
    0.10670661   2   -1000006    2000006
    0.095482907   2   -1000024    1000037
    0.095482907   2   -1000037    1000024
    0.071291495   2   -15    15
    0.061237819   2   -1000024    1000024
    0.046294115   2   -1000037    1000037
    0.042443939   2    1000023    1000025
    0.039780649   2    1000023    1000035
    0.029859653   2    1000023    1000023
    0.026773288   2    1000035    1000035
    0.024111469   2    1000022    1000025
    0.020900799   2    1000022    1000035
    0.0097781976   2    1000025    1000035
    0.0081968897   2   -2000005    1000005
    0.0081968897   2   -1000005    2000005
    0.0072536733   2    1000022    1000023
    0.0021107542   2   -6    6
    0.00045320535   2   -2000015    1000015
    0.00045320535   2   -1000015    2000015
    0.00024680058   2   -13    13
    0.00017981953   2    1000025    1000025
    0.00013149054   2    1000022    1000022
    0.00012101415   2   -3    3
    4.5678796e-06   2    21    21
    1.1843025e-06   2    23    25
    3.3458723e-07   2   -1    1
    1.0159652e-07   2    22    23
    6.001119e-08   2    22    22
    3.4303143e-08   2   -4    4
    1.5032827e-08   2   -2000013    1000013
    1.5032827e-08   2   -1000013    2000013
    5.5423985e-09   2   -11    11
    3.5161934e-13   2   -2000011    1000011
    3.5161934e-13   2   -1000011    2000011
    1.7686265e-13   2   -2    2
    3.2653225e-14   2    23    35
    4.7202525e-37   2    25    25

DECAY 37  73.190303
    0.22697738   2   -5    6
    0.16369992   2    1000023    1000037
    0.15579035   2    1000024    1000035
    0.13520616   2   -2000005    2000006
    0.13276217   2    1000024    1000025
    0.074311746   2   -15    16
    0.041767675   2    1000022    1000037
    0.026535989   2    1000025    1000037
    0.020295728   2   -1000005    1000006
    0.014736327   2    1000022    1000024
    0.0055788452   2   -2000005    1000006
    0.00097195687   2   -1000015    1000016
    0.00052292717   2   -1000005    2000006
    0.00033162521   2   -5    4
    0.00026271846   2   -13    14
    0.0001268718   2   -3    4
    0.0001008386   2    1000035    1000037
    5.9639182e-06   2   -3    2
    5.2075909e-06   2   -3    6
    3.836642e-06   2    1000023    1000024
    2.3681453e-06   2   -5    2
    1.2702474e-06   2    24    25
    8.1671431e-07   2   -2000015    1000016
    3.5200975e-07   2   -1    2
    3.3294954e-07   2   -2000011    1000012
    3.3289999e-07   2   -2000013    1000014
    2.3016755e-07   2   -1    6
    3.184937e-08   2   -1000013    1000014
    1.8601006e-08   2   -1    4
    6.145012e-09   2   -11    12
    7.4495671e-13   2   -1000011    1000012
    9.0813021e-14   2    24    35

DECAY 6  2.43
    1   2    5    24

DECAY 15 -1
