BLOCK SPINFO
   1   SPheno
   2   v4.0.5be

BLOCK SPHENOINFO
   1   2
   2   2

BLOCK MODSEL
   1   0

BLOCK MINPAR
   3    26.49549
   4    1

BLOCK EXTPAR
   0    1427.8923
   1   -223.12709
   2   -215.20555
   3    3000
   11   -2317.9149
   12    1220.8107
   13   -1171.1445
   23    394.39415
   25    25.667602
   26    556.53031
   31    363.19796
   32    363.19796
   33    311.4091
   34    1116.8534
   35    1116.8534
   36    1918.1282
   41    5000
   42    5000
   43    1577.4568
   44    5000
   45    5000
   46    1363.4028
   47    5000
   48    5000
   49    1390.3379

BLOCK SMINPUTS
   1    127.90897
   2    1.1663787e-05
   3    0.1184
   4    91.1876
   5    4.18
   6    173.2
   7    1.777
   8    0
   11    0.00051099893
   12    0
   13    0.10565837
   14    0
   21    0.005
   22    0.0025
   23    0.095
   24    1.27

BLOCK GAUGE Q=  1427.8923
   1    0.35536298
   2    0.66519887
   3    1.219778

BLOCK YU Q=  1427.8923
   1   1    8.3907328e-06
   2   2    0.0042624923
   3   3    1.0136679

BLOCK YD Q=  1427.8923
   1   1    0.00043277827
   2   2    0.0082227871
   3   3    0.42918043

BLOCK YE Q=  1427.8923
   1   1    7.5522972e-05
   2   2    0.015615755
   3   3    0.26263132

BLOCK AU Q=  1427.8923
   1   1    0
   2   2    0
   3   3   -2317.9148

BLOCK AD Q=  1427.8923
   1   1    0
   2   2    0
   3   3    1220.8107

BLOCK AE Q=  1427.8923
   1   1    0
   2   2    0
   3   3   -1171.1445

BLOCK MSOFT Q=  1427.8923
   1   -223.12709
   2   -215.20555
   3    3000
   21    164124.74
   22   -122374.95
   31    363.19796
   32    363.19796
   33    311.4091
   34    1116.8534
   35    1116.8534
   36    1918.1282
   41    5000
   42    5000
   43    1577.4568
   44    5000
   45    5000
   46    1363.4028
   47    5000
   48    5000
   49    1390.3379

BLOCK MASS
   6    173.2
   23    91.1876
   24    80.429995
   15    1.777
   25    122.23483
   35    556.5365
   36    556.53031
   37    563.28282
   1000001    5026.0261
   2000001    5015.0954
   1000002    5025.5781
   2000002    5016.9179
   1000003    5026.0283
   2000003    5015.0982
   1000004    5025.5801
   2000004    5016.9187
   1000005    1385.4446
   2000005    1556.9551
   1000006    1270.9893
   2000006    1604.165
   1000011    370.66495
   2000011    1117.3708
   1000012    361.60661
   1000013    370.65822
   2000013    1117.3651
   1000014    361.60407
   1000015    318.29957
   2000015    1917.3598
   1000016    308.87125
   1000021    3181.8248
   1000022   -213.70664
   1000023   -224.86463
   1000025    405.26784
   1000035   -419.4148
   1000024    219.64176
   1000037    420.1716

BLOCK ALPHA
      -0.040070673

BLOCK HMIX Q=  1427.8923
   1    394.39415
   2    25.667602
   3    244.05538
   4    309725.99

BLOCK STOPMIX
   1   1    0.37679974
   1   2    0.92629475
   2   1   -0.92629475
   2   2    0.37679974

BLOCK SBOTMIX
   1   1    0.040826682
   1   2    0.99916624
   2   1   -0.99916624
   2   2    0.040826682

BLOCK STAUMIX
   1   1    0.9999844
   1   2    0.0055855804
   2   1   -0.0055855804
   2   2    0.9999844

BLOCK NMIX
   1   1    0.6854556
   1   2   -0.65467007
   1   3    0.28444323
   1   4    0.14370024
   2   1    0.71051892
   2   2    0.69705741
   2   3   -0.085373738
   2   4   -0.044555043
   3   1    0.051978574
   3   2   -0.093127886
   3   3   -0.69755731
   3   4    0.70854726
   4   1    0.15037188
   4   2   -0.27720977
   4   3   -0.65208678
   4   4   -0.68943881

BLOCK UMIX
   1   1   -0.92998546
   1   2    0.36759631
   2   1   -0.36759631
   2   2   -0.92998546

BLOCK VMIX
   1   1    0.98191775
   1   2    0.18930803
   2   1    0.18930803
   2   2   -0.98191775

BLOCK HIGGSBOUNDSINPUTHIGGSCOUPLINGSFERMIONS
       0, 658.82581,3,36,15,15

BLOCK HIGGSBOUNDSINPUTHIGGSCOUPLINGSBOSONS
       0,4,36,21,21,23

BLOCK SPHENOLOWENERGY
   1    0.00036003595
   2    1.5842155e-06
   3    3.5188203e-05
   4    3.1067277e-15
   5    1.3271342e-10
   6    2.763844e-08
   7    1.040803e-13
   8    4.4462307e-09
   9    9.3856981e-07
   10    8.6002371e-05
   11    0.88837156
   12    0.54288278
   13    19.355488
   14    0
   15    0
   16    0.002161114
   17    2.281711e-15
   18    2.4762906e-11
   19    8.28119e-11
   20   -2.9870426e-14
   21   -1.2770862e-09
   22   -3.8311739e-07
   23    0
   24    0
   25    0
   26    0
   27    0
   28    0
   29    0
   30    0
   31    0
   39    0.00011089909
   40    0
   41    0
   42    0

BLOCK FWCOEF Q=  160
   305   4422   0   0   -0.18881911
   305   4422   0   2   -0.22353191
   305   4322   0   2   -0.0012039427
   305   6421   0   0   -0.095227835
   305   6421   0   2   -0.15680693
   305   6321   0   2   -0.0014563933
   3051111   4133   0   0    1.5901997
   3051111   4133   0   2    1.5911073
   3051111   4233   0   2   -7.517669e-05
   3051111   4137   0   0   -4.4128918
   3051111   4137   0   2   -4.4047007
   3051111   4237   0   2    0.00059013186
   3051313   4133   0   0    1.5901997
   3051313   4133   0   2    1.5911041
   3051313   4233   0   2   -7.5193989e-05
   3051313   4137   0   0   -4.4128918
   3051313   4137   0   2   -4.4047039
   3051313   4237   0   2    0.00059014826
   3051212   4137   0   0    1.5053501
   3051212   4137   0   2    1.5036081
   3051212   4237   0   2   -0.00012867672
   3051414   4137   0   0    1.5053501
   3051414   4137   0   2    1.5036081
   3051414   4237   0   2   -0.00012867299
   3051616   4137   0   0    1.5053501
   3051616   4137   0   2    1.5036083
   3051616   4237   0   2   -0.00012762141

BLOCK IMFWCOEF Q=  160
   305   4422   0   0    3.8584894e-07
   305   4422   0   2   -1.1398581e-05
   305   4322   0   2    3.6577635e-06
   305   6421   0   0    3.3050514e-07
   305   6421   0   2   -6.5983492e-06
   305   6321   0   2    1.3366458e-06
   3051111   4133   0   2   -2.6895509e-06
   3051111   4233   0   2    1.901728e-06
   3051111   4137   0   2    1.5809122e-05
   3051111   4237   0   2   -1.4826452e-05
   3051313   4133   0   2   -2.6895617e-06
   3051313   4233   0   2    1.9017247e-06
   3051313   4137   0   2    1.5809196e-05
   3051313   4237   0   2   -1.4826465e-05
   3051212   4137   0   2   -2.624855e-06
   3051212   4237   0   2    3.2323185e-06
   3051414   4137   0   2   -2.6248543e-06
   3051414   4237   0   2    3.2323185e-06
   3051616   4137   0   2   -2.6216178e-06
   3051616   4237   0   2    3.2323172e-06

DECAY 23  2.4952


DECAY 24  2.085


DECAY 1000011  2.0039918
    0.59290848   2   -1000024    12
    0.3768949   2    1000023    11
    0.030196566   2    1000022    11

DECAY 2000011  5.1630103
    0.50540634   2    1000023    11
    0.47422993   2    1000022    11
    0.018147869   2    1000035    11
    0.0022158446   2    1000025    11

DECAY 1000013  2.0039401
    0.59288968   2   -1000024    14
    0.37688319   2    1000023    13
    0.030227073   2    1000022    13

DECAY 2000013  5.1715437
    0.50457657   2    1000023    13
    0.4735229   2    1000022    13
    0.01844712   2    1000035    13
    0.0025969692   2    1000025    13
    0.00066828328   2   -1000037    14
    0.00013090168   2   -1000024    14

DECAY 1000015  1.1198859
    0.59481175   2   -1000024    16
    0.36406931   2    1000023    15
    0.041118818   2    1000022    15

DECAY 2000015  16.140088
    0.29419094   2    1000023    15
    0.28543606   2    1000022    15
    0.12919824   2   -1000037    16
    0.075790517   2    1000035    15
    0.074122044   2    1000025    15
    0.052198214   2    1000016   -37
    0.026110144   2    1000015    36
    0.026083907   2    1000015    35
    0.01994424   2   -1000024    16
    0.0085186315   2    1000016   -24
    0.0042310502   2    1000015    23
    0.0041760114   2    1000015    25

DECAY 1000012  1.9849635
    0.61575351   2    1000024    11
    0.35384596   2    1000022    12
    0.030400525   2    1000023    12

DECAY 1000014  1.9850237
    0.61577375   2    1000024    13
    0.3538274   2    1000022    14
    0.03039885   2    1000023    14

DECAY 1000016  1.0727999
    0.61291905   2    1000024    15
    0.35886633   2    1000022    16
    0.028214615   2    1000023    16

DECAY 2000001  144.09997
    0.98064887   2    1000021    1
    0.0097696875   2    1000023    1
    0.0090961542   2    1000022    1
    0.00043328017   2    1000035    1

DECAY 1000001  209.18015
    0.68099092   2    1000021    1
    0.18223397   2   -1000024    2
    0.063573719   2    1000022    1
    0.034286904   2    1000023    1
    0.02818305   2   -1000037    2
    0.0096371698   2    1000035    1
    0.0010942636   2    1000025    1

DECAY 2000003  144.11354
    0.9805585   2    1000021    3
    0.0097691118   2    1000023    3
    0.0090990639   2    1000022    3
    0.00045281379   2    1000035    3

DECAY 1000003  209.18885
    0.68096365   2    1000021    3
    0.18222674   2   -1000024    4
    0.063573697   2    1000022    3
    0.034285726   2    1000023    3
    0.028190187   2   -1000037    4
    0.0096502929   2    1000035    3
    0.0011096995   2    1000025    3

DECAY 1000005  9.1624778
    0.35836143   2   -1000037    6
    0.22214049   2    1000025    5
    0.18656571   2    1000035    5
    0.094712193   2    1000022    5
    0.092342596   2   -1000024    6
    0.045810771   2    1000023    5

DECAY 2000005  63.555937
    0.44399027   2   -1000037    6
    0.18768166   2    1000006   -24
    0.18395876   2   -1000024    6
    0.067246859   2    1000022    5
    0.043056614   2    1000035    5
    0.039554215   2    1000025    5
    0.034013867   2    1000023    5
    0.00031373738   2    1000005    25
    0.00018400938   2    1000005    23

DECAY 2000002  152.65914
    0.92690955   2    1000021    2
    0.036901222   2    1000023    2
    0.034357165   2    1000022    2
    0.0016363551   2    1000035    2
    0.00019570343   2    1000025    2

DECAY 1000002  209.17634
    0.68078021   2    1000021    2
    0.20314034   2    1000024    1
    0.071441352   2    1000023    2
    0.02988965   2    1000022    2
    0.007474055   2    1000037    1
    0.0065401432   2    1000035    2
    0.00073424752   2    1000025    2

DECAY 2000004  152.66275
    0.92688784   2    1000021    4
    0.036900373   2    1000023    4
    0.034356602   2    1000022    4
    0.001641875   2    1000035    4
    0.00020158778   2    1000025    4

DECAY 1000004  209.18496
    0.68075286   2    1000021    4
    0.2031364   2    1000024    3
    0.071438446   2    1000023    4
    0.029888609   2    1000022    4
    0.0075012272   2    1000037    3
    0.0065439304   2    1000035    4
    0.00073852569   2    1000025    4

DECAY 1000006  40.728508
    0.47365493   2    1000037    5
    0.24931843   2    1000035    6
    0.21759133   2    1000025    6
    0.039051821   2    1000023    6
    0.015307426   2    1000022    6
    0.0048011759   2    1000024    5
    0.0001360881   3    1000022    24    5

DECAY 2000006  69.943259
    0.22194997   2    1000025    6
    0.21100348   2    1000024    5
    0.16594486   2    1000035    6
    0.11209582   2    1000006    23
    0.088586097   2    1000006    25
    0.080646279   2    1000037    5
    0.060950464   2    1000023    6
    0.058066105   2    1000022    6
    0.00075692878   2    1000005    24

DECAY 1000024  5.0177979e-08
    0.3624459   3    1000022   -1    2
    0.29052804   3    1000022   -3    4
    0.12958327   3    1000022   -11    12
    0.12937635   3    1000022   -13    14
    0.088066435   3    1000022   -15    16

DECAY 1000037  2.2710126
    0.46708753   2    1000023    24
    0.24776475   2    1000024    23
    0.18557667   2    1000024    25
    0.035213994   2    1000022    24
    0.029794847   2    1000016   -15
    0.019758302   2   -1000015    16
    0.0054132375   2   -1000013    14
    0.005411857   2   -1000011    12
    0.0019899797   2    1000014   -13
    0.0019628405   2    1000012   -11

DECAY 1000022 -1


DECAY 1000023  1.9536504e-08
    0.1807732   3    1000024    11   -12
    0.1807732   3   -1000024   -11    12
    0.18040804   3    1000024    13   -14
    0.18040804   3   -1000024   -13    14
    0.10978359   3    1000024    15   -16
    0.10978359   3   -1000024   -15    16
    0.030156383   2    1000022    22
    0.0095578756   2    1000024   -211
    0.0095578756   2   -1000024    211
    0.0030296466   3    1000022    15   -15
    0.0020940352   3    1000022    11   -11
    0.0020910915   3    1000022    13   -13
    0.0015509824   3    1000022    12   -12

DECAY 1000025  2.8832125
    0.32940259   2    1000022    23
    0.22244506   2    1000022    25
    0.19192105   2    1000024   -24
    0.19192105   2   -1000024    24
    0.027309981   2    1000023    23
    0.020462993   2    1000023    25
    0.0070064322   2    1000015   -15
    0.0070064322   2   -1000015    15
    0.0007942959   2    1000016   -16
    0.0007942959   2   -1000016    16
    0.00018792369   2    1000014   -14
    0.00018792369   2   -1000014    14
    0.00018790305   2    1000012   -12
    0.00018790305   2   -1000012    12

DECAY 1000035  2.5144151
    0.34999927   2    1000024   -24
    0.34999927   2   -1000024    24
    0.18635326   2    1000022    25
    0.036601015   2    1000022    23
    0.017410921   2    1000023    25
    0.011025419   2    1000015   -15
    0.011025419   2   -1000015    15
    0.0098294395   2    1000016   -16
    0.0098294395   2   -1000016    16
    0.003091704   2    1000014   -14
    0.003091704   2   -1000014    14
    0.0030914523   2    1000012   -12
    0.0030914523   2   -1000012    12
    0.002773719   2    1000023    23
    0.00069024281   2    1000013   -13
    0.00069024281   2   -1000013    13
    0.00068216249   2    1000011   -11
    0.00068216249   2   -1000011    11

DECAY 1000021  234.45676
    0.13187566   2    1000005   -5
    0.13187566   2   -1000005    5
    0.12890941   2    1000006   -6
    0.12890941   2   -1000006    6
    0.12272319   2    2000006   -6
    0.12272319   2   -2000006    6
    0.11621497   2    2000005   -5
    0.11621497   2   -2000005    5
    0.00015852301   2    1000006   -4
    0.00015852301   2   -1000006    4

DECAY 25  0.0038683014
    0.63867065   2   -5    5
    0.16990978   2   -24    24
    0.072555787   2   -15    15
    0.067785233   2    21    21
    0.027855439   2   -4    4
    0.019453768   2    23    23
    0.0021208144   2    22    22
    0.0011570108   2    22    23
    0.00025173738   2   -13    13
    0.00023896681   2   -3    3
    6.6071323e-07   2   -1    1
    1.4355365e-07   2   -2    2
    5.6593731e-09   2   -11    11

DECAY 35  6.243056
    0.82342359   2   -5    5
    0.11939081   2   -15    15
    0.029256613   2   -1000024    1000024
    0.022131991   2    1000022    1000022
    0.0034111798   2   -6    6
    0.0012257146   2    1000022    1000023
    0.0004175049   2   -13    13
    0.00032446611   2   -3    3
    0.00019441069   2    25    25
    0.00013396941   2    21    21
    4.7103159e-05   2   -24    24
    2.2826998e-05   2    23    23
    1.6447935e-05   2    1000023    1000023
    2.0897236e-06   2    22    23
    8.9703859e-07   2   -1    1
    2.7465306e-07   2    22    22
    9.8617728e-08   2   -4    4
    9.3817605e-09   2   -11    11
    5.0867394e-13   2   -2    2

DECAY 36  6.5472754
    0.77954096   2   -5    5
    0.11299881   2   -15    15
    0.057081543   2   -1000024    1000024
    0.042137802   2    1000022    1000022
    0.0046849349   2   -6    6
    0.0025963236   2    1000022    1000023
    0.00039515599   2   -13    13
    0.00030715147   2   -3    3
    0.0001735672   2    21    21
    3.9636093e-05   2    1000023    1000023
    3.7291021e-05   2    23    25
    5.1228453e-06   2    22    23
    8.4916952e-07   2   -1    1
    7.6315866e-07   2    22    22
    8.2545368e-08   2   -4    4
    8.8795552e-09   2   -11    11
    4.2641094e-13   2   -2    2
    3.5575071e-39   2    25    25

DECAY 37  5.1759137
    0.81443683   2   -5    6
    0.15278132   2   -15    16
    0.027755814   2    1000023    1000024
    0.0026259288   2    1000022    1000024
    0.0014216072   2   -5    4
    0.00054014685   2   -13    14
    0.00035124037   2   -3    4
    5.025429e-05   2    24    25
    1.6084632e-05   2   -3    2
    1.0151842e-05   2   -5    2
    9.1729083e-06   2   -3    6
    9.7422115e-07   2   -1    2
    4.0148417e-07   2   -1    6
    4.8940178e-08   2   -1    4
    1.2634092e-08   2   -11    12
    3.6428289e-09   2    24    36
    3.6261803e-09   2    24    35

DECAY 6  2.43
    1   2    5    24

DECAY 15 -1
