BLOCK SPINFO
   1   SPheno
   2   v4.0.5be

BLOCK SPHENOINFO
   1   2
   2   2

BLOCK MODSEL
   1   0

BLOCK MINPAR
   3    57.91884
   4    1

BLOCK EXTPAR
   0    4061.6401
   1    1570.9641
   2    827.08927
   3    4000
   11    5222.4734
   12    1304.0002
   13   -1900.268
   23    1929.166
   25    56.769775
   26    2000
   31    1413.9132
   32    1413.9132
   33    2000
   34    1551.3107
   35    1551.3107
   36    2000
   41    4000
   42    4000
   43    4000
   44    4000
   45    4000
   46    4000
   47    4000
   48    4000
   49    4000

BLOCK SMINPUTS
   1    127.90897
   2    1.1663787e-05
   3    0.1184
   4    91.1876
   5    4.18
   6    173.2
   7    1.777
   8    0
   11    0.00051099893
   12    0
   13    0.10565837
   14    0
   21    0.005
   22    0.0025
   23    0.095
   24    1.27

BLOCK GAUGE Q=  4061.6401
   1    0.35536298
   2    0.66519887
   3    1.219778

BLOCK YU Q=  4061.6401
   1   1    8.3856728e-06
   2   2    0.0042599218
   3   3    1.0130566

BLOCK YD Q=  4061.6401
   1   1    0.00095661092
   2   2    0.018175607
   3   3    0.94865827

BLOCK YE Q=  4061.6401
   1   1    0.0001669356
   2   2    0.034516988
   3   3    0.58051895

BLOCK AU Q=  4061.6401
   1   1    0
   2   2    0
   3   3    5222.4734

BLOCK AD Q=  4061.6401
   1   1    0
   2   2    0
   3   3    1304.0002

BLOCK AE Q=  4061.6401
   1   1    0
   2   2    0
   3   3   -1900.268

BLOCK MSOFT Q=  4061.6401
   1    1570.9641
   2    827.08927
   3    4000
   21    515529.95
   22   -3409348
   31    1413.9132
   32    1413.9132
   33    2000
   34    1551.3107
   35    1551.3107
   36    2000
   41    4000
   42    4000
   43    4000
   44    4000
   45    4000
   46    4000
   47    4000
   48    4000
   49    4000

BLOCK MASS
   6    173.2
   23    91.1876
   24    80.429995
   15    1.777
   25    124.87579
   35    1999.5576
   36    2000
   37    2001.9744
   1000001    4155.5022
   2000001    4143.4298
   1000002    4154.7365
   2000002    4144.4466
   1000003    4155.514
   2000003    4143.3983
   1000004    4154.7298
   2000004    4144.4458
   1000005    4074.0034
   2000005    4125.6833
   1000006    3979.661
   2000006    4145.308
   1000011    1425.0535
   2000011    1564.4625
   1000012    1422.448
   1000013    1424.9093
   2000013    1564.4743
   1000014    1422.4082
   1000015    1936.7859
   2000015    2034.8802
   1000016    1990.7355
   1000021    4249.2328
   1000022    868.48553
   1000023    1544.738
   1000025   -1942.541
   1000035    1946.8157
   1000024    868.60581
   1000037    1945.1127
   1000039    1e-09

BLOCK ALPHA
      -0.01738694

BLOCK HMIX Q=  4061.6401
   1    1929.166
   2    56.769775
   3    242.92215
   4    4000000

BLOCK STOPMIX
   1   1   -0.60504197
   1   2    0.79619358
   2   1   -0.79619358
   2   2   -0.60504197

BLOCK SBOTMIX
   1   1    0.88655681
   1   2    0.46261973
   2   1   -0.46261973
   2   2    0.88655681

BLOCK STAUMIX
   1   1    0.66187356
   1   2    0.74961549
   2   1   -0.74961549
   2   2    0.66187356

BLOCK NMIX
   1   1    0.0015213762
   1   2   -0.99846463
   1   3    0.050406889
   1   4   -0.022917492
   2   1    0.99656318
   2   2    0.0059543006
   2   3    0.064246116
   2   4   -0.051950022
   3   1   -0.0088118428
   3   2    0.019433017
   3   3    0.70671492
   3   4    0.7071766
   4   1   -0.082352041
   4   2    0.051529454
   4   3    0.70276996
   4   4   -0.70475332

BLOCK UMIX
   1   1   -0.99746526
   1   2    0.071155153
   2   1    0.071155153
   2   2    0.99746526

BLOCK VMIX
   1   1   -0.99947677
   1   2    0.032344776
   2   1    0.032344776
   2   2    0.99947677

BLOCK HIGGSBOUNDSINPUTHIGGSCOUPLINGSFERMIONS
       0, 3222.8073,3,36,15,15

BLOCK HIGGSBOUNDSINPUTHIGGSCOUPLINGSBOSONS
       0,4,36,21,21,23

BLOCK SPHENOLOWENERGY
   1    0.00033719014
   2    1.5884342e-06
   3    3.5252305e-05
   4    3.1366783e-15
   5    1.3399617e-10
   6    2.8097676e-08
   7    1.0436731e-13
   8    4.458596e-09
   9    9.4727958e-07
   10    9.0848275e-05
   11    0.9384279
   12    0.54205203
   13    19.336857
   14    0
   15    0
   16    0.002157956
   17    2.2816703e-15
   18    2.4800143e-11
   19    8.2904038e-11
   20    6.9899909e-15
   21    2.9882634e-10
   22    5.7352595e-08
   23    0
   24    0
   25    0
   26    0
   27    0
   28    0
   29    0
   30    0
   31    0
   39    7.4194022e-05
   40    0
   41    0
   42    0

BLOCK FWCOEF Q=  160
   305   4422   0   0   -0.18881911
   305   4422   0   2   -0.20656555
   305   4322   0   2   -0.00036742661
   305   6421   0   0   -0.095227835
   305   6421   0   2   -0.11402836
   305   6321   0   2   -0.00038748431
   3051111   4133   0   0    1.6284512
   3051111   4133   0   2    1.628547
   3051111   4233   0   2    0.00036310462
   3051111   4137   0   0   -4.4511433
   3051111   4137   0   2   -4.4495046
   3051111   4237   0   2   -0.0026806394
   3051313   4133   0   0    1.6284512
   3051313   4133   0   2    1.6285448
   3051313   4233   0   2    0.00036309858
   3051313   4137   0   0   -4.4511433
   3051313   4137   0   2   -4.4495067
   3051313   4237   0   2   -0.0026806378
   3051212   4137   0   0    1.5053501
   3051212   4137   0   2    1.5050053
   3051212   4237   0   2    0.00057942579
   3051414   4137   0   0    1.5053501
   3051414   4137   0   2    1.5050053
   3051414   4237   0   2    0.00057942686
   3051616   4137   0   0    1.5053501
   3051616   4137   0   2    1.5050052
   3051616   4237   0   2    0.00057972723

BLOCK IMFWCOEF Q=  160
   305   4422   0   0    3.8570729e-07
   305   4422   0   2    1.5017547e-05
   305   4322   0   2   -2.0674939e-06
   305   6421   0   0    3.303838e-07
   305   6421   0   2   -5.5725031e-06
   305   6321   0   2   -1.2716455e-06
   3051111   4133   0   2   -3.909694e-07
   3051111   4233   0   2    9.2139525e-06
   3051111   4137   0   2    2.7799804e-06
   3051111   4237   0   2   -6.8031517e-05
   3051313   4133   0   2   -3.9097203e-07
   3051313   4233   0   2    9.213933e-06
   3051313   4137   0   2    2.7799985e-06
   3051313   4237   0   2   -6.8031576e-05
   3051212   4137   0   2   -4.3047139e-07
   3051212   4237   0   2    1.4705153e-05
   3051414   4137   0   2   -4.3047128e-07
   3051414   4237   0   2    1.4705153e-05
   3051616   4137   0   2   -4.3268885e-07
   3051616   4237   0   2    1.4705153e-05

DECAY 23  2.4952


DECAY 24  2.085


DECAY 1000011  7.396648
    0.66651015   2   -1000024    12
    0.33348894   2    1000022    11

DECAY 2000011  0.0049210011
    0.99603724   2    1000023    11
    0.0021823527   2    1000039    11
    0.0017698514   2    1000022    11

DECAY 1000013  7.3941607
    0.66650731   2   -1000024    14
    0.33349178   2    1000022    13

DECAY 2000013  0.0072050455
    0.68106528   2    1000023    13
    0.29750794   2    1000013    25
    0.012469062   2   -1000024    14
    0.0074671247   2    1000022    13
    0.0014905896   2    1000039    13

DECAY 1000015  9.0822502
    0.59840621   2   -1000024    16
    0.30046099   2    1000022    15
    0.10112937   2    1000023    15

DECAY 2000015  10.180044
    0.58758896   2   -1000024    16
    0.29507041   2    1000022    15
    0.098336958   2    1000023    15
    0.005511473   2    1000025    15
    0.0053877798   2    1000035    15
    0.0051909862   2   -1000037    16
    0.0028889846   2    1000015    23

DECAY 1000012  7.3789332
    0.66668156   2    1000024    11
    0.33331753   2    1000022    12

DECAY 1000014  7.3782973
    0.66668434   2    1000024    13
    0.33331475   2    1000022    14

DECAY 1000016  17.666455
    0.65196903   2    1000024    15
    0.32468321   2    1000022    16
    0.0217598   2    1000023    16
    0.0015484924   2    1000037    15

DECAY 2000001  1.7142548
    0.9935066   2    1000023    1
    0.0055701186   2    1000035    1
    0.00081635152   2    1000039    1

DECAY 1000001  50.538042
    0.65861211   2   -1000024    2
    0.3301537   2    1000022    1
    0.007906804   2    1000023    1
    0.0022348159   2   -1000037    2
    0.00096652867   2    1000035    1

DECAY 2000003  1.7473264
    0.97473718   2    1000023    3
    0.010125914   2    1000035    3
    0.0094243136   2   -1000037    4
    0.0048006082   2    1000025    3
    0.00080086997   2    1000039    3

DECAY 1000003  50.555776
    0.65838312   2   -1000024    4
    0.33004022   2    1000022    3
    0.007905708   2    1000023    3
    0.0022522849   2   -1000037    4
    0.0011283347   2    1000035    3
    0.00026224918   2    1000025    3

DECAY 1000005  130.49618
    0.3403478   2   -1000037    6
    0.21638946   2   -1000024    6
    0.16419688   2    1000025    5
    0.15542518   2    1000035    5
    0.10987947   2    1000022    5
    0.012361999   2    1000023    5
    0.0013893605   2    1000006   -24

DECAY 2000005  103.93715
    0.47560221   2   -1000037    6
    0.22421683   2    1000035    5
    0.21823748   2    1000025    5
    0.043935972   2   -1000024    6
    0.022414227   2    1000022    5
    0.0085409237   2    1000023    5
    0.0070391848   2    1000006   -24

DECAY 2000002  6.855226
    0.99416766   2    1000023    2
    0.0055612629   2    1000035    2
    0.00020439186   2    1000039    2

DECAY 1000002  50.576023
    0.66063054   2    1000024    1
    0.32947608   2    1000022    2
    0.0090334133   2    1000023    2
    0.000462164   2    1000037    1
    0.00029929394   2    1000035    2

DECAY 2000004  6.8570429
    0.99390366   2    1000023    4
    0.0056261064   2    1000035    4
    0.00020433743   2    1000039    4
    0.0001325245   2    1000037    3
    0.0001302053   2    1000025    4

DECAY 1000004  50.593481
    0.66040375   2    1000024    3
    0.32936168   2    1000022    4
    0.0090303425   2    1000023    4
    0.00078852691   2    1000037    3
    0.00030820039   2    1000035    4

DECAY 1000006  120.23747
    0.38150219   2    1000037    5
    0.21604528   2    1000035    6
    0.20220807   2    1000025    6
    0.085498651   2    1000024    5
    0.041977697   2    1000022    6
    0.029225444   2    1000023    6
    0.025353138   2    1000022    4
    0.017499295   3    1000022    24    5
    0.00068079411   2    1000023    4

DECAY 2000006  133.48651
    0.34605337   2    1000037    5
    0.18547031   2    1000025    6
    0.17193818   2    1000024    5
    0.17016041   2    1000035    6
    0.084688606   2    1000022    6
    0.028045055   2    1000023    6
    0.01177552   2    1000006    23
    0.001858111   2    1000006    25

DECAY 1000024  1.0917486e-06
    1   2    1000039    24

DECAY 1000037  13.042773
    0.31667253   2    1000024    25
    0.29767275   2    1000022    24
    0.29747733   2    1000024    23
    0.062926867   2    1000023    24
    0.011942713   3    1000024    6   -6
    0.0098506631   3    1000022   -5    6
    0.0007135486   2   -1000013    14
    0.00071321403   2   -1000011    12
    0.00052914941   2    1000014   -13
    0.00035299742   3    1000024    5   -5
    0.00034350812   3    1000023   -5    6
    0.0002539052   3    1000024    15   -15
    0.00021922721   2   -2000013    14
    0.00014863136   2    1000012   -11
    0.00012495617   3    1000022   -15    16

DECAY 1000022  5.4566084e-07
    0.77140139   2    1000039    23
    0.22836685   2    1000039    22
    0.00023176717   2    1000039    25

DECAY 1000023  0.24889261
    0.095872579   2    1000022    25
    0.095081443   2    1000024   -24
    0.095081443   2   -1000024    24
    0.08803713   2    1000013   -13
    0.08803713   2   -1000013    13
    0.087828566   2    1000011   -11
    0.087828566   2   -1000011    11
    0.087583194   2    1000014   -14
    0.087583194   2   -1000014    14
    0.087528547   2    1000012   -12
    0.087528547   2   -1000012    12
    0.0069260756   2    1000022    23
    0.0018280257   3    1000024    5   -6
    0.0018280257   3   -1000024   -5    6
    0.00056709244   3    1000022    6   -6
    0.0002632485   3    1000024    15   -16
    0.0002632485   3   -1000024   -15    16
    0.00014494015   3    1000022    15   -15
    0.0001185564   3    1000022    12   -12

DECAY 1000025  16.636116
    0.23596571   2    1000024   -24
    0.23596571   2   -1000024    24
    0.20814767   2    1000022    23
    0.205863   2    1000022    25
    0.054000285   2    1000023    23
    0.038867985   2    1000023    25
    0.0081403918   3    1000024    5   -6
    0.0081403918   3   -1000024   -5    6
    0.0038848907   3    1000022    6   -6
    0.0001593517   2    1000013   -13
    0.0001593517   2   -1000013    13
    0.00014458122   3    1000022    5   -5

DECAY 1000035  12.916936
    0.29978528   2    1000024   -24
    0.29978528   2   -1000024    24
    0.28056788   2    1000022    25
    0.051970624   2    1000023    25
    0.03743422   2    1000022    23
    0.0097685229   3    1000024    5   -6
    0.0097685229   3   -1000024   -5    6
    0.0051394875   3    1000022    6   -6
    0.00077258077   2    1000023    23
    0.00065774594   2    1000014   -14
    0.00065774594   2   -1000014    14
    0.00065766163   2    1000012   -12
    0.00065766163   2   -1000012    12
    0.0004327704   2    2000013   -13
    0.0004327704   2   -2000013    13
    0.00032222012   2    2000011   -11
    0.00032222012   2   -2000011    11
    0.00019421959   2    1000013   -13
    0.00019421959   2   -1000013    13
    0.00017636404   3    1000022    5   -5

DECAY 1000021  6.5728617
    0.18286431   2    1000006   -6
    0.18286431   2   -1000006    6
    0.06116335   2    1000005   -5
    0.06116335   2   -1000005    5
    0.032287802   2    2000005   -5
    0.032287802   2   -2000005    5
    0.027808631   2    1000006   -4
    0.027808631   2   -1000006    4
    0.023154013   2    2000003   -3
    0.023154013   2   -2000003    3
    0.02314041   2    2000001   -1
    0.02314041   2   -2000001    1
    0.022703292   2    2000002   -2
    0.022703292   2   -2000002    2
    0.022702008   2    2000004   -4
    0.022702008   2   -2000004    4
    0.018509594   2    1000004   -4
    0.018509594   2   -1000004    4
    0.018508614   2    1000002   -2
    0.018508614   2   -1000002    2
    0.018213237   2    1000001   -1
    0.018213237   2   -1000001    1
    0.018208689   2    1000003   -3
    0.018208689   2   -1000003    3
    0.011074104   3    1000025    6   -6
    0.010129943   3    1000035    6   -6
    0.0087058627   3    1000037    5   -6
    0.0087058627   3   -1000037   -5    6
    0.0067231875   3    1000022    6   -6
    0.0062223461   3    1000024    5   -6
    0.0062223461   3   -1000024   -5    6
    0.0017185584   3    1000023    6   -6
    0.00093372771   2    1000025    21
    0.00079260857   2    1000035    21
    0.0002415187   2    1000039    21

DECAY 25  0.0038773311
    0.5756722   2   -5    5
    0.22562668   2   -24    24
    0.072358119   2    21    21
    0.066537143   2   -15    15
    0.028294529   2   -4    4
    0.027245858   2    23    23
    0.0023353973   2    22    22
    0.0014819503   2    22    23
    0.00023085266   2   -13    13
    0.00021652438   2   -3    3
    5.9866932e-07   2   -1    1
    1.458087e-07   2   -2    2
    5.1898307e-09   2   -11    11

DECAY 35  66.749979
    0.76493767   2   -5    5
    0.23343696   2   -15    15
    0.00083098177   2   -13    13
    0.00031312351   2   -3    3
    0.00022779833   2   -1000024    1000024
    0.00011422469   2    1000022    1000022
    0.00011419709   2   -6    6
    1.4742473e-05   2    21    21
    8.650474e-06   2    25    25
    8.6583762e-07   2   -1    1
    4.3377457e-07   2    23    23
    2.300376e-07   2   -24    24
    6.7053749e-08   2    22    23
    3.3841576e-08   2    22    22
    1.8665694e-08   2   -11    11
    1.7680935e-09   2   -4    4
    9.1169613e-15   2   -2    2

DECAY 36  63.142004
    0.76429097   2   -5    5
    0.2332513   2   -15    15
    0.00083032236   2   -13    13
    0.00077948213   2   -1000024    1000024
    0.00039087291   2    1000022    1000022
    0.00031285321   2   -3    3
    0.00011955035   2   -6    6
    2.2996118e-05   2    21    21
    8.6508971e-07   2   -1    1
    6.189473e-07   2    23    25
    1.0663241e-07   2    22    23
    4.032137e-08   2    22    22
    1.865091e-08   2   -11    11
    1.7863092e-09   2   -4    4
    9.2096734e-15   2   -2    2
    5.6096265e-39   2    25    25

DECAY 37  56.702305
    0.76080734   2   -5    6
    0.23686033   2   -15    16
    0.0011318744   2   -5    4
    0.00083738657   2   -13    14
    0.00033647399   2   -3    4
    1.5684364e-05   2   -3    2
    8.0827554e-06   2   -5    2
    1.1053408e-06   2   -3    6
    9.3398286e-07   2   -1    2
    6.922822e-07   2    24    25
    4.3668991e-08   2   -1    4
    2.8145014e-08   2   -1    6
    1.9586559e-08   2   -11    12
    5.9833235e-10   2    1000022    1000024
    1.9780542e-12   2    24    35
    7.1990285e-13   2    24    36

DECAY 6  2.43
    1   2    5    24

DECAY 15 -1


DECAY 1000039 -1
