BLOCK DCINFO
   1   SDECAY/HDECAY
   2   1.3b /3.4

BLOCK SPINFO
   1   SOFTSUSY
   2   3.4.0

BLOCK MODSEL
   1   0

BLOCK SMINPUTS
   1    127.90897
   2    1.1663787e-05
   3    0.1184
   4    91.1876
   5    4.18
   6    173.2
   7    1.777

BLOCK MINPAR
   3    34.34

BLOCK EXTPAR
   0   -1
   1    1030.45
   2    341.53
   3    3634.09
   11    3385.82
   12    1885.01
   13    2966.84
   23   -311.01
   26    3713.3
   31    932.53
   32    932.53
   33    1590.21
   34    3857.82
   35    3857.82
   36    2604.42
   41    3858.87
   42    3858.87
   43    3565.69
   44    2912.89
   45    2912.89
   46    2921.24
   47    546.71
   48    546.71
   49    2663.55

BLOCK MASS
   24    80.38277
   25    126.97855
   35    3713.3043
   36    3713.3001
   37    3714.5927
   5    4.8187603
   1000001    3966.6076
   2000001    824.92194
   1000002    3965.957
   2000002    3035.8584
   1000003    3966.6076
   2000003    824.92194
   1000004    3965.957
   2000004    3035.8584
   1000005    2774.6848
   2000005    3637.2057
   1000006    2976.9167
   2000006    3645.9812
   1000011    935.75111
   2000011    3862.9718
   1000012    932.07121
   1000013    935.75111
   2000013    3862.9718
   1000014    932.07121
   1000015    1586.8917
   2000015    2599.848
   1000016    1584.638
   1000021    3764.2697
   1000022    289.53368
   1000023   -332.09765
   1000025    405.26367
   1000035    1019.4339
   1000024    293.59511
   1000037    407.83728

BLOCK NMIX
   1   1   -0.031961882
   1   2    0.55499841
   1   3    0.62443606
   1   4    0.54866639
   2   1   -0.023728824
   2   2    0.08342685
   2   3   -0.69903942
   2   4    0.70980334
   3   1    0.030768547
   3   2    0.82763737
   3   3   -0.34817328
   3   4   -0.43914125
   4   1    0.99873354
   4   2   -0.0057540718
   4   3    0.014101413
   4   4    0.047951676

BLOCK UMIX
   1   1    0.50937589
   1   2    0.86054413
   2   1   -0.86054413
   2   2    0.50937589

BLOCK VMIX
   1   1    0.64466725
   1   2   -0.7644633
   2   1   -0.7644633
   2   2   -0.64466725

BLOCK STOPMIX
   1   1   -0.10372951
   1   2    0.99460554
   2   1   -0.99460554
   2   2   -0.10372951

BLOCK SBOTMIX
   1   1   -0.0052666981
   1   2    0.99998613
   2   1   -0.99998613
   2   2   -0.0052666981

BLOCK STAUMIX
   1   1    0.99998457
   1   2   -0.0055549763
   2   1    0.0055549763
   2   2    0.99998457

BLOCK ALPHA
      -0.030100242

BLOCK HMIX Q=  3228.583
   1   -318.13396
   2    33.263547
   3    240.99812
   4    13672026

BLOCK GAUGE Q=  3228.583
   1    0.36536365
   2    0.64189212
   3    1.0048709

BLOCK AU Q=  3228.583
   1   1    0
   2   2    0
   3   3    3385.82

BLOCK AD Q=  3228.583
   1   1    0
   2   2    0
   3   3    1885.01

BLOCK AE Q=  3228.583
   1   1    0
   2   2    0
   3   3    2966.84

BLOCK YU Q=  3228.583
   1   1    0
   2   2    0
   3   3    0.8322993

BLOCK YD Q=  3228.583
   1   1    0
   2   2    0
   3   3    0.46015203

BLOCK YE Q=  3228.583
   1   1    0
   2   2    0
   3   3    0.33658277

BLOCK MSOFT Q=  3228.583
   1    1030.45
   2    341.53
   3    3634.09
   21    13854111
   22    159307.53
   31    932.53
   32    932.53
   33    1590.21
   34    3857.82
   35    3857.82
   36    2604.42
   41    3858.87
   42    3858.87
   43    3565.69
   44    2912.89
   45    2912.89
   46    2921.24
   47    546.70992
   48    546.70992
   49    2663.55

BLOCK HIGGSBOUNDSINPUTHIGGSCOUPLINGSFERMIONS
       0, 1106.4636,3,36,15,15

BLOCK HIGGSBOUNDSINPUTHIGGSCOUPLINGSBOSONS
       0,4,36,21,21,23

DECAY 6  1.4514142
    1   2    5    24

DECAY 1000021  168.7723
    0.18774245   2    2000001   -1
    0.18774245   2   -2000001    1
    0.18774245   2    2000003   -3
    0.18774245   2   -2000003    3
    0.043069391   2    1000005   -5
    0.043069391   2   -1000005    5
    0.029847405   2    1000006   -6
    0.029847405   2   -1000006    6
    0.025314869   2    2000002   -2
    0.025314869   2   -2000002    2
    0.025314817   2    2000004   -4
    0.025314817   2   -2000004    4
    0.00096862023   2    2000005   -5
    0.00096862023   2   -2000005    5

DECAY 1000006  85.007042
    0.23888918   2    1000024    5
    0.2313765   2    1000023    6
    0.22960306   2    1000037    5
    0.12570225   2    1000022    6
    0.10884134   2    1000025    6
    0.065587568   2    1000035    6
    1.0261004e-07   2    1000005    24

DECAY 2000006  121.70423
    0.22547216   2    1000024    5
    0.20808247   2    1000023    6
    0.17129839   2    1000022    6
    0.14471063   2    1000025    6
    0.14021013   2    1000037    5
    0.056104237   2    1000006    25
    0.049793625   2    1000006    23
    0.0038184437   2    1000035    6
    0.00050991242   2    1000005    24

DECAY 1000005  23.868553
    0.35473835   2   -1000024    6
    0.23218555   2    1000023    5
    0.18866067   2    1000022    5
    0.11762172   2   -1000037    6
    0.055554792   2    1000025    5
    0.051238916   2    1000035    5

DECAY 2000005  119.98284
    0.35163883   2   -1000037    6
    0.3004998   2   -1000024    6
    0.097277185   2    1000025    5
    0.09626402   2    1000006   -24
    0.08732747   2    1000022    5
    0.062400624   2    1000023    5
    0.0040518248   2    1000035    5
    0.00027959521   2    1000005    25
    0.0002606522   2    1000005    23

DECAY 1000002  49.059964
    0.36202119   2    1000037    1
    0.2599567   2    1000024    1
    0.21522232   2    1000025    2
    0.094267639   2    1000022    2
    0.057247869   2    1000021    2
    0.0093417299   2    1000035    2
    0.0019425568   2    1000023    2

DECAY 2000002  5.5822356
    0.99687802   2    1000035    2
    0.0012695697   2    1000022    2
    0.0011565566   2    1000025    2
    0.00069585058   2    1000023    2

DECAY 1000001  49.033413
    0.45906218   2   -1000037    2
    0.20938149   2    1000025    1
    0.16240881   2   -1000024    2
    0.098547974   2    1000022    1
    0.057630384   2    1000021    1
    0.010556403   2    1000035    1
    0.002412766   2    1000023    1

DECAY 2000001  0.00088621696
    0.45496784   2    1000022    1
    0.31595502   2    1000025    1
    0.22907714   2    1000023    1

DECAY 1000004  50.530308
    0.36806911   2    1000037    3
    0.26445288   2    1000024    3
    0.21882053   2    1000025    4
    0.095900091   2    1000022    4
    0.041309549   2    1000021    4
    0.0094720833   2    1000035    4
    0.0019757605   2    1000023    4

DECAY 2000004  5.6448565
    0.99686926   2    1000035    4
    0.0012734589   2    1000022    4
    0.0011594519   2    1000025    4
    0.00069783463   2    1000023    4

DECAY 1000003  50.494938
    0.4668106   2   -1000037    4
    0.21291834   2    1000025    3
    0.1652459   2   -1000024    4
    0.10027165   2    1000022    3
    0.041593554   2    1000021    3
    0.010705527   2    1000035    3
    0.0024544253   2    1000023    3

DECAY 2000003  0.00084007317
    0.45513534   2    1000022    3
    0.3157617   2    1000025    3
    0.22910296   2    1000023    3

DECAY 1000011  8.0709098
    0.46180172   2   -1000037    12
    0.22403011   2    1000025    11
    0.20042734   2   -1000024    12
    0.11196607   2    1000022    11
    0.0017747592   2    1000023    11

DECAY 2000011  17.765702
    0.99712327   2    1000035    11
    0.0011665987   2    1000022    11
    0.0010694271   2    1000025    11
    0.00064070637   2    1000023    11

DECAY 1000013  8.0709097
    0.46180172   2   -1000037    14
    0.22403011   2    1000025    13
    0.20042734   2   -1000024    14
    0.11196607   2    1000022    13
    0.0017747592   2    1000023    13

DECAY 2000013  17.765702
    0.99712327   2    1000035    13
    0.0011665987   2    1000022    13
    0.0010694271   2    1000025    13
    0.00064070637   2    1000023    13

DECAY 1000015  21.383613
    0.39156221   2   -1000037    16
    0.20685764   2    1000025    15
    0.14866041   2   -1000024    16
    0.14374826   2    1000022    15
    0.075941714   2    1000023    15
    0.033229765   2    1000035    15

DECAY 2000015  21.420389
    0.46054319   2    1000035    15
    0.19496444   2   -1000024    16
    0.12996714   2    1000023    15
    0.10325105   2    1000022    15
    0.06996234   2   -1000037    16
    0.033262576   2    1000025    15
    0.0039468276   2    1000016   -24
    0.0020883592   2    1000015    25
    0.0020140774   2    1000015    23

DECAY 1000012  8.1959997
    0.35613842   2    1000037    11
    0.31434751   2    1000024    11
    0.20116958   2    1000025    12
    0.12500642   2    1000022    12
    0.0033380662   2    1000023    12

DECAY 1000014  8.1959995
    0.35613842   2    1000037    13
    0.31434751   2    1000024    13
    0.20116958   2    1000025    14
    0.12500643   2    1000022    14
    0.0033380662   2    1000023    14

DECAY 1000016  21.43541
    0.35004531   2    1000024    15
    0.34633013   2    1000037    15
    0.17368879   2    1000025    16
    0.093009922   2    1000022    16
    0.03432355   2    1000035    16
    0.0026022898   2    1000023    16

DECAY 1000024  2.1592863e-09
    0.35696143   3    1000022    2   -1
    0.35696143   3    1000022    4   -3
    0.11943909   3    1000022   -11    12
    0.11943909   3    1000022   -13    14
    0.047198972   3    1000022   -15    16

DECAY 1000037  0.33772944
    0.63678372   2    1000022    24
    0.36321628   2    1000024    23

DECAY 1000022 -1


DECAY 1000023  0.00023005466
    0.099572704   3    1000024   -2    1
    0.099572704   3   -1000024   -1    2
    0.099572704   3    1000024   -4    3
    0.099572704   3   -1000024   -3    4
    0.061498006   3    1000022   -1    1
    0.061498006   3    1000022   -3    3
    0.05488793   3    1000022   -5    5
    0.047409583   3    1000022   -2    2
    0.047409583   3    1000022   -4    4
    0.033205314   3    1000024   -12    11
    0.033205314   3   -1000024    12   -11
    0.033205314   3    1000024   -14    13
    0.033205314   3   -1000024    14   -13
    0.032856173   3    1000024   -16    15
    0.032856173   3   -1000024    16   -15
    0.028229238   3    1000022   -12    12
    0.028229238   3    1000022   -14    14
    0.028209635   3    1000022   -16    16
    0.014096681   3    1000022   -11    11
    0.014096681   3    1000022   -13    13
    0.013963955   3    1000022   -15    15
    0.003647046   2    1000022    22

DECAY 1000025  0.44413009
    0.49786362   2    1000024   -24
    0.49786362   2   -1000024    24
    0.0042727598   2    1000022    23

DECAY 1000035  3.0043384
    0.1552202   2    1000023    23
    0.10323881   2    1000037   -24
    0.10323881   2   -1000037    24
    0.090048414   2    1000024   -24
    0.090048414   2   -1000024    24
    0.089490539   2    1000025    25
    0.078455514   2    1000022    25
    0.045962714   2    1000023    25
    0.037895995   2    2000001   -1
    0.037895995   2   -2000001    1
    0.037895995   2    2000003   -3
    0.037895995   2   -2000003    3
    0.027822648   2    1000022    23
    0.018376601   2    1000025    23
    0.0061706859   2    1000012   -12
    0.0061706859   2   -1000012    12
    0.0061706859   2    1000014   -14
    0.0061706859   2   -1000014    14
    0.0054576539   2    1000011   -11
    0.0054576539   2   -1000011    11
    0.0054576539   2    1000013   -13
    0.0054576539   2   -1000013    13

DECAY 25  0.0042323946
    0.55576952   2    5   -5
    0.24594932   2    24   -24
    0.07905171   2    21    21
    0.062298059   2   -15    15
    0.031594216   2    23    23
    0.020751904   2    4   -4
    0.0023708098   2    22    22
    0.0017539667   2    22    23
    0.00023998315   2    3   -3
    0.00022050979   2   -13    13

DECAY 35  105.66354
    0.44935326   2    5   -5
    0.092002352   2    1000024   -1000024
    0.082160011   2   -15    15
    0.074912841   2    1000024   -1000037
    0.074912841   2    1000037   -1000024
    0.049816232   2    1000023    1000025
    0.045600284   2    1000037   -1000037
    0.038592478   2    1000022    1000022
    0.023784069   2    1000025    1000025
    0.017815901   2    1000023    1000035
    0.015605956   2    1000022    1000023
    0.013834828   2    1000022    1000025
    0.013642373   2    1000022    1000035
    0.0050041798   2    1000025    1000035
    0.0012540758   2    6   -6
    0.0012037665   2    1000023    1000023
    0.00029544492   2   -13    13
    0.00018830228   2    3   -3
    1.2282904e-05   2    1000035    1000035
    4.1657942e-06   2    21    21
    1.7521453e-06   2    1000015   -1000015
    1.4544259e-06   2    25    25
    3.3508861e-07   2    24   -24
    1.8075645e-07   2    1000012   -1000012
    1.8075645e-07   2    1000014   -1000014
    1.6724874e-07   2    23    23
    1.0891181e-07   2    1000016   -1000016
    5.5426922e-08   2    1000011   -1000011
    5.5426922e-08   2    1000013   -1000013
    2.6063134e-08   2    22    22
    1.2713019e-08   2    4   -4
    1.2408311e-08   2    2000001   -2000001
    1.2408311e-08   2    2000003   -2000003
    2.465212e-09   2    23    22

DECAY 36  105.66587
    0.44935589   2    5   -5
    0.086715618   2    1000024   -1000024
    0.082158405   2   -15    15
    0.080175501   2    1000024   -1000037
    0.080175501   2    1000037   -1000024
    0.05327314   2    1000023    1000025
    0.040358323   2    1000037   -1000037
    0.035583844   2    1000022    1000022
    0.021454981   2    1000025    1000025
    0.018050275   2    1000023    1000035
    0.017847933   2    1000022    1000023
    0.013573423   2    1000022    1000035
    0.013275633   2    1000022    1000025
    0.0048313601   2    1000025    1000035
    0.0014052154   2    1000023    1000023
    0.0012571047   2    6   -6
    0.00029543886   2   -13    13
    0.00018831037   2    3   -3
    1.2074094e-05   2    21    21
    1.1662088e-05   2    1000035    1000035
    3.3986731e-07   2    23    25
    1.2791365e-08   2    4   -4
    9.8299532e-09   2    23    22
    6.4352153e-09   2    22    22

DECAY 37  106.59996
    0.45483238   2    6   -5
    0.15209896   2    1000037    1000022
    0.13588233   2    1000024    1000025
    0.09405775   2    1000037    1000023
    0.081466835   2   -15    16
    0.045702939   2    1000024    1000023
    0.024618675   2    1000024    1000035
    0.010049346   2    1000037    1000035
    0.0007631501   2    4   -5
    0.000292952   2   -13    14
    0.00018390849   2    4   -3
    2.566604e-05   2    1000024    1000022
    9.3428835e-06   2    2   -3
    7.6314949e-06   2    2   -5
    6.0127479e-06   2    1000037    1000025
    1.3571131e-06   2   -1000015    1000016
    3.373789e-07   2    24    25
    2.1584532e-07   2   -1000011    1000012
    2.1584532e-07   2   -1000013    1000014
    4.4547352e-14   2    24    36

DECAY 5 -1


DECAY 15 -1


DECAY 23  2.4952


DECAY 24  2.085
