BLOCK SPINFO
   1   SPheno
   2   v4.0.5be

BLOCK SPHENOINFO
   1   2
   2   2

BLOCK MODSEL
   1   0

BLOCK MINPAR
   3    40.906688
   4    1

BLOCK EXTPAR
   0    3101.9869
   1   -782.97465
   2    3346.3004
   3    3357.4175
   11   -5059.594
   12    5379.9156
   13    5763.808
   23    3241.5678
   25    39.725456
   26    3501.8835
   31    2458.4916
   32    2458.4916
   33    4343.5821
   34    4987.3251
   35    4987.3251
   36    2068.9826
   41    3026.3128
   42    3026.3128
   43    4675.9339
   44    510.6375
   45    510.6375
   46    1861.4979
   47    1753.2226
   48    1753.2226
   49    1633.7302

BLOCK SMINPUTS
   1    127.90897
   2    1.1663787e-05
   3    0.1184
   4    91.1876
   5    4.18
   6    173.2
   7    1.777
   8    0
   11    0.00051099893
   12    0
   13    0.10565837
   14    0
   21    0.005
   22    0.0025
   23    0.095
   24    1.27

BLOCK GAUGE Q=  3101.9869
   1    0.35536298
   2    0.66519887
   3    1.219778

BLOCK YU Q=  3101.9869
   1   1    8.3870282e-06
   2   2    0.0042606103
   3   3    1.0132204

BLOCK YD Q=  3101.9869
   1   1    0.00066951026
   2   2    0.012720695
   3   3    0.66394438

BLOCK YE Q=  3101.9869
   1   1    0.00011683444
   2   2    0.024157656
   3   3    0.40629203

BLOCK AU Q=  3101.9869
   1   1    0
   2   2    0
   3   3   -5059.5939

BLOCK AD Q=  3101.9869
   1   1    0
   2   2    0
   3   3    5379.9164

BLOCK AE Q=  3101.9869
   1   1    0
   2   2    0
   3   3    5763.808

BLOCK MSOFT Q=  3101.9869
   1   -782.97465
   2    3346.3004
   3    3357.4175
   21    1685758.8
   22   -10543557
   31    2458.4916
   32    2458.4916
   33    4343.5821
   34    4987.3251
   35    4987.3251
   36    2068.9826
   41    3026.3128
   42    3026.3128
   43    4675.9339
   44    510.6375
   45    510.6375
   46    1861.4979
   47    1753.2226
   48    1753.2226
   49    1633.7302

BLOCK MASS
   6    173.2
   23    91.1876
   24    80.429995
   15    1.777
   25    123.78632
   35    3501.4895
   36    3501.8835
   37    3502.2724
   1000001    3173.0703
   2000001    1901.6244
   1000002    3172.0855
   2000002    779.48543
   1000003    3173.0691
   2000003    1901.6214
   1000004    3172.0839
   2000004    779.48668
   1000005    1801.6691
   2000005    4721.8165
   1000006    2035.8539
   2000006    4726.4309
   1000011    2485.8343
   2000011    4992.0624
   1000012    2484.1724
   1000013    2485.8371
   2000013    4992.0234
   1000014    2484.1694
   1000015    2081.5743
   2000015    4352.0079
   1000016    4350.5001
   1000021    3475.5479
   1000022   -770.72831
   1000023    3213.2014
   1000025   -3234.7286
   1000035    3381.4978
   1000024    3213.7533
   1000037    3381.776

BLOCK ALPHA
      -0.024473434

BLOCK HMIX Q=  3101.9869
   1    3241.5678
   2    39.725456
   3    243.24096
   4    12263188

BLOCK STOPMIX
   1   1    0.039830036
   1   2    0.99920647
   2   1   -0.99920647
   2   2    0.039830036

BLOCK SBOTMIX
   1   1    0.012114829
   1   2    0.99992661
   2   1   -0.99992661
   2   2    0.012114829

BLOCK STAUMIX
   1   1    0.015493644
   1   2    0.99987997
   2   1   -0.99987997
   2   2    0.015493644

BLOCK NMIX
   1   1    0.99988716
   1   2    4.674052e-05
   1   3    0.014702755
   1   4    0.0030796842
   2   1    0.0077012281
   2   2    0.35582094
   2   3   -0.662852
   2   4    0.65875593
   3   1   -0.01257325
   3   2    0.008018658
   3   3    0.70692246
   3   4    0.70713382
   4   1    0.0028743885
   4   2   -0.93451975
   4   3   -0.24631621
   4   4    0.25689084

BLOCK UMIX
   1   1   -0.34279796
   1   2    0.93940915
   2   1    0.93940915
   2   2    0.34279796

BLOCK VMIX
   1   1   -0.357805
   1   2    0.93379633
   2   1    0.93379633
   2   2    0.357805

BLOCK HIGGSBOUNDSINPUTHIGGSCOUPLINGSFERMIONS
       0, 1578.1118,3,36,15,15

BLOCK HIGGSBOUNDSINPUTHIGGSCOUPLINGSBOSONS
       0,4,36,21,21,23

BLOCK SPHENOLOWENERGY
   1    0.00031465532
   2    1.5918294e-06
   3    3.5269925e-05
   4    2.2197279e-15
   5    9.4823446e-11
   6    1.9802005e-08
   7    7.4464774e-14
   8    3.1811067e-09
   9    6.7315938e-07
   10    9.6283693e-05
   11    0.99457369
   12    0.54172135
   13    19.352452
   14    0
   15    0
   16    0.0021565064
   17    2.2816508e-15
   18    2.4811787e-11
   19    8.2932054e-11
   20    9.11267e-16
   21    3.8957974e-11
   22    8.9196146e-09
   23    0
   24    0
   25    0
   26    0
   27    0
   28    0
   29    0
   30    0
   31    0
   39    6.497087e-05
   40    0
   41    0
   42    0

BLOCK FWCOEF Q=  160
   305   4422   0   0   -0.18881911
   305   4422   0   2   -0.1815098
   305   4322   0   2    0.00023885617
   305   6421   0   0   -0.095227835
   305   6421   0   2   -0.094693342
   305   6321   0   2    8.5890081e-05
   3051111   4133   0   0    1.618113
   3051111   4133   0   2    1.6183369
   3051111   4233   0   2    0.00011529195
   3051111   4137   0   0   -4.4408051
   3051111   4137   0   2   -4.4408743
   3051111   4237   0   2   -0.00086399611
   3051313   4133   0   0    1.618113
   3051313   4133   0   2    1.6183355
   3051313   4233   0   2    0.00011529171
   3051313   4137   0   0   -4.4408051
   3051313   4137   0   2   -4.4408757
   3051313   4237   0   2   -0.0008639962
   3051212   4137   0   0    1.5053501
   3051212   4137   0   2    1.5053657
   3051212   4237   0   2    0.00018718908
   3051414   4137   0   0    1.5053501
   3051414   4137   0   2    1.5053657
   3051414   4237   0   2    0.00018718911
   3051616   4137   0   0    1.5053501
   3051616   4137   0   2    1.5053658
   3051616   4237   0   2    0.00018720016

BLOCK IMFWCOEF Q=  160
   305   4422   0   0    3.8589529e-07
   305   4422   0   2    8.7932569e-06
   305   4322   0   2    6.0016167e-06
   305   6421   0   0    3.3054484e-07
   305   6421   0   2   -1.0151196e-05
   305   6321   0   2    3.8413431e-06
   3051111   4133   0   2    2.3478823e-07
   3051111   4233   0   2    2.6403696e-06
   3051111   4137   0   2   -1.2262975e-06
   3051111   4237   0   2   -1.9788814e-05
   3051313   4133   0   2    2.3477457e-07
   3051313   4233   0   2    2.6403685e-06
   3051313   4137   0   2   -1.2263094e-06
   3051313   4237   0   2   -1.9788819e-05
   3051212   4137   0   2    2.7670705e-07
   3051212   4237   0   2    4.2873465e-06
   3051414   4137   0   2    2.7670693e-07
   3051414   4237   0   2    4.2873465e-06
   3051616   4137   0   2    2.7760994e-07
   3051616   4237   0   2    4.2873469e-06

DECAY 23  2.4952


DECAY 24  2.085


DECAY 1000011  2.5509782
    1   2    1000022    11

DECAY 2000011  23.898259
    0.99992022   2    1000022    11

DECAY 1000013  2.5509877
    1   2    1000022    13

DECAY 2000013  23.94628
    0.99790693   2    1000022    13
    0.0007323459   2   -1000024    14
    0.00046280562   2    1000025    13
    0.00038611587   2    1000023    13
    0.00038299464   2    1000013    25

DECAY 1000015  7.7872648
    1   2    1000022    15

DECAY 2000015  23.215155
    0.23010582   2   -1000037    16
    0.22105456   2    1000022    15
    0.13261779   2    1000015    23
    0.12008626   2    1000015    25
    0.11950867   2    1000035    15
    0.076924901   2    1000023    15
    0.061672256   2    1000025    15
    0.038029753   2   -1000024    16

DECAY 1000012  2.5476553
    1   2    1000022    12

DECAY 1000014  2.5476508
    1   2    1000022    14

DECAY 1000016  23.504059
    0.26176216   2    1000015    24
    0.23387896   2    1000037    15
    0.2180565   2    1000022    16
    0.15358879   2    1000024    15
    0.11186103   2    1000035    16
    0.020817188   2    1000023    16

DECAY 2000001  0.74134902
    1   2    1000022    1

DECAY 1000001  0.39187397
    0.99997599   2    1000022    1

DECAY 2000003  0.74134762
    1   2    1000022    3

DECAY 1000003  0.39526285
    0.99140674   2    1000022    3
    0.0085932615   2    2000003    25

DECAY 1000005  0.67464607
    1   2    1000022    5

DECAY 2000005  204.65106
    0.38234595   2    1000021    5
    0.29908706   2    1000006   -24
    0.11852644   2   -1000024    6
    0.061851615   2   -1000037    6
    0.037396825   2    1000005    25
    0.029029771   2    1000023    5
    0.028494607   2    1000025    5
    0.024211942   2    1000035    5
    0.01599032   2    1000005    23
    0.0030654709   2    1000022    5

DECAY 2000002  0.00086865588
    1   2    1000022    2

DECAY 1000002  0.39212395
    1   2    1000022    2

DECAY 2000004  0.00085756623
    1   2    1000022    4

DECAY 1000004  0.39212385
    0.99999914   2    1000022    4

DECAY 1000006  3.2733503
    0.99999391   2    1000022    6

DECAY 2000006  214.96818
    0.35800159   2    1000021    6
    0.21448593   2    1000006    25
    0.14270668   2    1000006    23
    0.063234339   2    1000025    6
    0.056077221   2    1000023    6
    0.054104283   2    1000024    5
    0.047495263   2    1000037    5
    0.03053361   2    1000005    24
    0.03037595   2    1000035    6
    0.0029851311   2    1000022    6

DECAY 1000024  53.826558
    0.5828229   2    1000006   -5
    0.32944397   2   -1000005    6
    0.034885799   2    1000022    24
    0.029687103   2   -1000015    16
    0.0055003352   2    1000014   -13
    0.0054505743   2    1000012   -11
    0.0049830859   2   -1000011    12
    0.0049830521   2   -1000013    14
    0.0018543446   3    1000022   -5    6
    0.00010745539   2   -2000003    4

DECAY 1000037  24.631018
    0.18990241   2    1000006   -5
    0.11268807   2   -1000011    12
    0.11268746   2   -1000013    14
    0.11171573   2    1000014   -13
    0.11169565   2    1000012   -11
    0.10203801   2   -1000005    6
    0.054006523   2    1000025    24
    0.03836969   2    1000023    24
    0.031030088   2    1000024    23
    0.022893422   2   -1000001    2
    0.022892723   2   -1000003    4
    0.022829114   2    1000004   -3
    0.022827811   2    1000002   -1
    0.022486697   2    1000024    25
    0.012346298   2    1000022    24
    0.008846712   2   -1000015    16
    0.00067425628   3    1000022   -5    6

DECAY 1000022 -1


DECAY 1000023  54.510338
    0.28807953   2    1000006   -6
    0.28807953   2   -1000006    6
    0.16162388   2    1000005   -5
    0.16162388   2   -1000005    5
    0.024218133   2    1000022    25
    0.024061306   2    1000022    23
    0.014599464   2    1000015   -15
    0.014599464   2   -1000015    15
    0.0027334877   2    1000013   -13
    0.0027334877   2   -1000013    13
    0.002709187   2    1000011   -11
    0.002709187   2   -1000011    11
    0.0025970724   2    1000014   -14
    0.0025970724   2   -1000014    14
    0.0025970536   2    1000012   -12
    0.0025970536   2   -1000012    12
    0.0013860176   3    1000022    6   -6

DECAY 1000025  60.726345
    0.30070365   2    1000006   -6
    0.30070365   2   -1000006    6
    0.16656486   2    1000005   -5
    0.16656486   2   -1000005    5
    0.022935303   2    1000022    25
    0.015000248   2    1000015   -15
    0.015000248   2   -1000015    15
    0.010754595   2    1000022    23
    0.0014241325   3    1000022    6   -6

DECAY 1000035  25.53349
    0.095382718   2    1000006   -6
    0.095382718   2   -1000006    6
    0.055440969   2    1000025    23
    0.054109852   2    1000014   -14
    0.054109852   2   -1000014    14
    0.054109543   2    1000012   -12
    0.054109543   2   -1000012    12
    0.053595861   2    1000013   -13
    0.053595861   2   -1000013    13
    0.053586494   2    1000011   -11
    0.053586494   2   -1000011    11
    0.050731107   2    1000005   -5
    0.050731107   2   -1000005    5
    0.032635482   2    1000024   -24
    0.032635482   2   -1000024    24
    0.021181328   2    1000023    25
    0.020949238   2    1000025    25
    0.010988041   2    1000002   -2
    0.010988041   2   -1000002    2
    0.010987738   2    1000004   -4
    0.010987738   2   -1000004    4
    0.010912686   2    1000003   -3
    0.010912686   2   -1000003    3
    0.010912082   2    1000001   -1
    0.010912082   2   -1000001    1
    0.0085571663   2    1000022    23
    0.0084906363   2    1000022    25
    0.0044198902   2    1000015   -15
    0.0044198902   2   -1000015    15
    0.0005125775   3    1000022    6   -6

DECAY 1000021  396.71288
    0.11694494   2    2000002   -2
    0.11694494   2   -2000002    2
    0.11694489   2    2000004   -4
    0.11694489   2   -2000004    4
    0.069332725   2    1000005   -5
    0.069332725   2   -1000005    5
    0.063649047   2    2000003   -3
    0.063649047   2   -2000003    3
    0.063648874   2    2000001   -1
    0.063648874   2   -2000001    1
    0.055053087   2    1000006   -6
    0.055053087   2   -1000006    6
    0.0036162675   2    1000004   -4
    0.0036162675   2   -1000004    4
    0.0036162604   2    1000002   -2
    0.0036162604   2   -1000002    2
    0.0035939179   2    1000003   -3
    0.0035939179   2   -1000003    3
    0.00359389   2    1000001   -1
    0.00359389   2   -1000001    1

DECAY 25  0.0037198276
    0.59135314   2   -5    5
    0.20940425   2   -24    24
    0.073114254   2    21    21
    0.067913433   2   -15    15
    0.029266944   2   -4    4
    0.024741005   2    23    23
    0.0023504984   2    22    22
    0.0013983104   2    22    23
    0.00023556644   2   -13    13
    0.00022182854   2   -3    3
    6.1333154e-07   2   -1    1
    1.5082385e-07   2   -2    2
    5.2958111e-09   2   -11    11

DECAY 35  54.062645
    0.7499919   2   -5    5
    0.24809231   2   -15    15
    0.00092206188   2   -13    13
    0.0006545272   2   -6    6
    0.00020969097   2   -3    3
    9.921198e-05   2   -1000005    1000005
    2.1574447e-05   2    1000022    1000022
    4.6331285e-06   2    21    21
    2.5076179e-06   2    25    25
    5.7959283e-07   2   -1    1
    3.9204257e-07   2   -1000004    1000004
    3.9200377e-07   2   -1000002    1000002
    1.4761864e-07   2    23    23
    3.658242e-08   2   -24    24
    2.0708158e-08   2   -11    11
    1.0152187e-08   2    22    23
    7.3097398e-09   2    22    22
    4.5947128e-10   2   -4    4
    2.4038348e-15   2   -2    2

DECAY 36  51.098659
    0.75022028   2   -5    5
    0.24815412   2   -15    15
    0.00092229282   2   -13    13
    0.00044824146   2   -6    6
    0.00020974654   2   -3    3
    2.7931415e-05   2    1000022    1000022
    1.6475156e-05   2    21    21
    5.7974375e-07   2   -1    1
    2.88228e-07   2    23    25
    2.0713115e-08   2   -11    11
    1.691608e-08   2    22    22
    5.1281642e-09   2    22    23
    1.3604648e-09   2   -4    4
    7.0788565e-15   2   -2    2
    1.3133346e-37   2    25    25

DECAY 37  62.389888
    0.81008995   2   -5    6
    0.18785365   2   -15    16
    0.0011995917   2   -5    4
    0.00066412959   2   -13    14
    0.00017304499   2   -3    4
    8.5663222e-06   2   -5    2
    8.1184038e-06   2   -3    2
    2.111464e-06   2   -3    6
    4.7994704e-07   2   -1    2
    2.3625143e-07   2    24    25
    8.5049879e-08   2   -1    6
    2.3228837e-08   2   -1    4
    1.553406e-08   2   -11    12
    4.2432226e-11   2   -1000005    1000004
    1.5743027e-11   2   -1000003    1000004
    2.3322591e-15   2   -1000001    1000004
    4.4230902e-18   2   -1000003    1000002
    1.5893208e-18   2   -1000005    1000002
    2.290438e-19   2   -1000001    1000002

DECAY 6  2.43
    1   2    5    24

DECAY 15 -1
