BLOCK SPINFO
   1   SPheno
   2   v4.0.5be

BLOCK SPHENOINFO
   1   2
   2   2

BLOCK MODSEL
   1   0

BLOCK MINPAR
   3    5.3602624
   4    1

BLOCK EXTPAR
   0    2001.3443
   1   -662.27401
   2   -1159.9582
   3    4986.317
   11    6224.1066
   12   -4237.4902
   13    3521.625
   23    2273.7301
   25    5.1076547
   26    1535.9327
   31    2373.7036
   32    2373.7036
   33    1379.7799
   34    4442.7227
   35    4442.7227
   36    4329.2455
   41    4362.7877
   42    4362.7877
   43    946.12619
   44    1000.3896
   45    1000.3896
   46    4924.9426
   47    1464.0175
   48    1464.0175
   49    2378.6709

BLOCK SMINPUTS
   1    127.90897
   2    1.1663787e-05
   3    0.1184
   4    91.1876
   5    4.18
   6    173.2
   7    1.777
   8    0
   11    0.00051099893
   12    0
   13    0.10565837
   14    0
   21    0.005
   22    0.0025
   23    0.095
   24    1.27

BLOCK GAUGE Q=  2001.3443
   1    0.35536298
   2    0.66519887
   3    1.219778

BLOCK YU Q=  2001.3443
   1   1    8.5435543e-06
   2   2    0.0043401256
   3   3    1.03213

BLOCK YD Q=  2001.3443
   1   1    8.7688039e-05
   2   2    0.0016660728
   3   3    0.086959058

BLOCK YE Q=  2001.3443
   1   1    1.5302204e-05
   2   2    0.0031640105
   3   3    0.053213451

BLOCK AU Q=  2001.3443
   1   1    0
   2   2    0
   3   3    6224.1066

BLOCK AD Q=  2001.3443
   1   1    0
   2   2    0
   3   3   -4237.491

BLOCK AE Q=  2001.3443
   1   1    0
   2   2    0
   3   3    3521.625

BLOCK MSOFT Q=  2001.3443
   1   -662.27401
   2   -1159.9582
   3    4986.317
   21   -2999101.8
   22   -5706671.4
   31    2373.7036
   32    2373.7036
   33    1379.7799
   34    4442.7227
   35    4442.7227
   36    4329.2455
   41    4362.7877
   42    4362.7877
   43    946.12619
   44    1000.3896
   45    1000.3896
   46    4924.9426
   47    1464.0175
   48    1464.0175
   49    2378.6709

BLOCK MASS
   6    173.2
   23    91.1876
   24    80.429995
   15    1.777
   25    122.51073
   35    1536.2043
   36    1535.9327
   37    1538.3029
   1000001    4405.0769
   2000001    1308.3096
   1000002    4404.5756
   2000002    680.21259
   1000003    4405.0766
   2000003    1308.3097
   1000004    4404.5754
   2000004    680.21536
   1000005    825.60564
   2000005    2333.1919
   1000006    814.59864
   2000006    4916.997
   1000011    2379.4005
   2000011    4448.5041
   1000012    2377.8116
   1000013    2379.4006
   2000013    4448.5038
   1000014    2377.8118
   1000015    1389.3623
   2000015    4334.8138
   1000016    1386.9366
   1000021    4901.94
   1000022   -660.30612
   1000023   -1200.4549
   1000025    2275.8806
   1000035   -2276.0536
   1000024    1200.5943
   1000037    2277.227

BLOCK ALPHA
      -0.18613442

BLOCK HMIX Q=  2001.3443
   1    2273.7301
   2    5.1076547
   3    243.58614
   4    2359089.2

BLOCK STOPMIX
   1   1   -0.99929295
   1   2    0.037597874
   2   1   -0.037597874
   2   2   -0.99929295

BLOCK SBOTMIX
   1   1    0.99997515
   1   2    0.0070492741
   2   1   -0.0070492741
   2   2    0.99997515

BLOCK STAUMIX
   1   1    0.99999965
   1   2    0.00083809495
   2   1   -0.00083809495
   2   2    0.99999965

BLOCK NMIX
   1   1   -0.9998153
   1   2   -0.00016917597
   1   3   -0.019115546
   1   4   -0.0019824931
   2   1    0.00068494813
   2   2    0.99894563
   2   3   -0.042999847
   2   4   -0.016067473
   3   1    0.01211278
   3   2   -0.019055026
   3   3   -0.70671368
   3   4    0.70713928
   4   1    0.014905516
   4   2   -0.041767177
   4   3   -0.70593299
   4   4   -0.70688892

BLOCK UMIX
   1   1   -0.99807928
   1   2    0.061949605
   2   1   -0.061949605
   2   2   -0.99807928

BLOCK VMIX
   1   1    0.99972234
   1   2    0.02356375
   2   1    0.02356375
   2   2   -0.99972234

BLOCK HIGGSBOUNDSINPUTHIGGSCOUPLINGSFERMIONS
       0, 26.088137,3,36,15,15

BLOCK HIGGSBOUNDSINPUTHIGGSCOUPLINGSBOSONS
       0,4,36,21,21,23

BLOCK SPHENOLOWENERGY
   1    0.00033969685
   2    1.5903339e-06
   3    3.5297245e-05
   4    2.6300818e-15
   5    1.1235411e-10
   6    2.3520263e-08
   7    8.8499154e-14
   8    3.7806811e-09
   9    8.0191441e-07
   10    9.6732728e-05
   11    0.99921205
   12    0.54302273
   13    19.402347
   14    0
   15    0
   16    0.0021619871
   17    2.2817068e-15
   18    2.4828897e-11
   19    8.2974681e-11
   20   -3.1314397e-16
   21   -1.3387812e-11
   22   -5.5189295e-09
   23    0
   24    0
   25    0
   26    0
   27    0
   28    0
   29    0
   30    0
   31    0
   39   -0.00027946194
   40    0
   41    0
   42    0

BLOCK FWCOEF Q=  160
   305   4422   0   0   -0.18881911
   305   4422   0   2   -0.20846646
   305   4322   0   2   -0.00037651308
   305   6421   0   0   -0.095227835
   305   6421   0   2   -0.11878601
   305   6321   0   2   -0.00045505554
   3051111   4133   0   0    1.6019414
   3051111   4133   0   2    1.6022954
   3051111   4233   0   2    4.9171019e-06
   3051111   4137   0   0   -4.4246335
   3051111   4137   0   2   -4.4273109
   3051111   4237   0   2   -3.7867724e-05
   3051313   4133   0   0    1.6019414
   3051313   4133   0   2    1.6022954
   3051313   4233   0   2    4.9171009e-06
   3051313   4137   0   0   -4.4246335
   3051313   4137   0   2   -4.4273109
   3051313   4237   0   2   -3.7867724e-05
   3051212   4137   0   0    1.5053501
   3051212   4137   0   2    1.5059415
   3051212   4237   0   2    8.2346292e-06
   3051414   4137   0   0    1.5053501
   3051414   4137   0   2    1.5059415
   3051414   4237   0   2    8.2346294e-06
   3051616   4137   0   0    1.5053501
   3051616   4137   0   2    1.5059415
   3051616   4237   0   2    8.2347274e-06

BLOCK IMFWCOEF Q=  160
   305   4422   0   0    3.8580695e-07
   305   4422   0   2   -7.108577e-07
   305   4322   0   2   -2.4266436e-07
   305   6421   0   0    3.3046917e-07
   305   6421   0   2   -2.303949e-06
   305   6321   0   2   -1.6647985e-07
   3051111   4133   0   2    2.6546097e-07
   3051111   4233   0   2    1.2299145e-07
   3051111   4137   0   2   -4.2849011e-07
   3051111   4237   0   2   -9.4642754e-07
   3051313   4133   0   2    2.6546056e-07
   3051313   4233   0   2    1.2299145e-07
   3051313   4137   0   2   -4.2848982e-07
   3051313   4237   0   2   -9.4642754e-07
   3051212   4137   0   2    2.5944382e-07
   3051212   4237   0   2    2.058051e-07
   3051414   4137   0   2    2.5944382e-07
   3051414   4237   0   2    2.058051e-07
   3051616   4137   0   2    2.5858191e-07
   3051616   4237   0   2    2.0580575e-07

DECAY 23  2.4952


DECAY 24  2.085


DECAY 1000011  19.952929
    0.58103668   2   -1000024    12
    0.29128235   2    1000023    11
    0.12764759   2    1000022    11

DECAY 2000011  21.374622
    0.99978934   2    1000022    11
    0.00012661531   2    1000035    11

DECAY 1000013  19.952935
    0.58103657   2   -1000024    14
    0.29128231   2    1000023    13
    0.12764756   2    1000022    13

DECAY 2000013  21.375675
    0.99974003   2    1000022    13
    0.00013786764   2    1000035    13

DECAY 1000015  2.2200047
    0.47126404   2    1000022    15
    0.3520528   2   -1000024    16
    0.17668316   2    1000023    15

DECAY 2000015  21.38168
    0.97158643   2    1000022    15
    0.0067940741   2    1000016   -37
    0.0059717501   2   -1000037    16
    0.0033967253   2    1000015    36
    0.0033768069   2    1000015    35
    0.0031084592   2    1000035    15
    0.0030734508   2    1000025    15
    0.0013149263   2    1000016   -24
    0.00068240172   2    1000015    25
    0.00065640921   2    1000015    23

DECAY 1000012  19.949226
    0.58213817   2    1000024    11
    0.29045027   2    1000023    12
    0.12739606   2    1000022    12

DECAY 1000014  19.949233
    0.58213811   2    1000024    13
    0.2904502   2    1000023    14
    0.12739602   2    1000022    14

DECAY 1000016  2.1906174
    0.47515843   2    1000022    16
    0.35000626   2    1000024    15
    0.1748353   2    1000023    16

DECAY 2000001  0.40555197
    0.99999998   2    1000022    1

DECAY 1000001  50.371889
    0.65718189   2   -1000024    2
    0.32909353   2    1000023    1
    0.01163703   2    1000022    1
    0.0015863388   2   -1000037    2
    0.00040813577   2    1000035    1

DECAY 2000003  0.40555201
    0.99999995   2    1000022    3

DECAY 1000003  50.373289
    0.65716339   2   -1000024    4
    0.32908436   2    1000023    3
    0.011636707   2    1000022    3
    0.0016040306   2   -1000037    4
    0.00040941726   2    1000035    3

DECAY 1000005  0.014919687
    1   2    1000022    5

DECAY 2000005  1.7905069
    0.61530482   2    1000022    5
    0.16132463   2    1000006   -24
    0.14316011   2    1000005    25
    0.079736663   2    1000005    23
    0.00023211497   2    1000025    5
    0.00023121307   2    1000035    5

DECAY 2000002  0.0050506832
    1   2    1000022    2

DECAY 1000002  50.409054
    0.65876224   2    1000024    1
    0.32896209   2    1000023    2
    0.011671282   2    1000022    2
    0.00031609197   2    1000035    2
    0.00022928683   2    1000037    1

DECAY 2000004  0.0050391368
    1   2    1000022    4

DECAY 1000004  50.410432
    0.6587442   2    1000024    3
    0.32895302   2    1000023    4
    0.011670959   2    1000022    4
    0.00032482569   2    1000035    4
    0.0002318502   2    1000037    3

DECAY 1000006  9.8431442e-07
    1   3    1000022    24    5

DECAY 2000006  450.75885
    0.23258825   2    1000005    24
    0.14986341   2    1000006    25
    0.14252665   2    1000037    5
    0.11637468   2    1000006    23
    0.097345869   2    1000005    37
    0.070943227   2    1000035    6
    0.070812706   2    1000025    6
    0.048792384   2    1000006    36
    0.04735496   2    1000006    35
    0.023388953   2    1000022    6

DECAY 1000024  8.8118612
    0.52423488   2    1000006   -5
    0.47571387   2   -1000005    6

DECAY 1000037  65.898077
    0.81647961   2   -1000005    6
    0.052739655   2    1000023    24
    0.049910225   2    1000024    23
    0.048300832   2    1000024    25
    0.017272167   2    1000022    24
    0.0063052779   2    1000006   -5
    0.0034169359   3    1000023   -5    6
    0.0021088032   2    37    1000022
    0.0016953458   3    1000024    6   -6
    0.0011030258   3    1000022   -5    6
    0.00041768431   2    1000016   -15
    0.00022954491   2   -1000015    16

DECAY 1000022 -1


DECAY 1000023  8.508524
    0.25818229   2    1000005   -5
    0.25818229   2   -1000005    5
    0.24178926   2    1000006   -6
    0.24178926   2   -1000006    6

DECAY 1000025  72.070903
    0.37494577   2    1000006   -6
    0.37494577   2   -1000006    6
    0.078939742   2    1000023    25
    0.04549957   2    1000024   -24
    0.04549957   2   -1000024    24
    0.036825101   2    1000023    23
    0.020475599   2    1000022    25
    0.0095349369   2    1000022    23
    0.0027437427   2    1000005   -5
    0.0027437427   2   -1000005    5
    0.0018325913   2    1000022    35
    0.0017907082   3    1000023    6   -6
    0.0015124453   3    1000024    5   -6
    0.0015124453   3   -1000024   -5    6
    0.00056873685   3    1000022    6   -6
    0.00017892563   2    1000015   -15
    0.00017892563   2   -1000015    15
    0.00015952963   2    1000022    36

DECAY 1000035  66.385316
    0.41069571   2    1000006   -6
    0.41069571   2   -1000006    6
    0.046316743   2    1000024   -24
    0.046316743   2   -1000024    24
    0.039918097   2    1000023    25
    0.010380494   2    1000022    25
    0.008280495   2    1000023    23
    0.006810244   2    1000022    23
    0.0042580472   2    1000022    35
    0.0038424461   3    1000024    5   -6
    0.0038424461   3   -1000024   -5    6
    0.0032207357   2    1000005   -5
    0.0032207357   2   -1000005    5
    0.00096740763   3    1000023    6   -6
    0.00044625725   3    1000022    6   -6
    0.00022276906   2    1000015   -15
    0.00022276906   2   -1000015    15

DECAY 1000021  913.7128
    0.076371587   2    2000002   -2
    0.076371587   2   -2000002    2
    0.076371563   2    2000004   -4
    0.076371563   2   -2000004    4
    0.075478941   2    1000006   -6
    0.075478941   2   -1000006    6
    0.074957309   2    1000005   -5
    0.074957309   2   -1000005    5
    0.068490914   2    2000001   -1
    0.068490914   2   -2000001    1
    0.068490912   2    2000003   -3
    0.068490912   2   -2000003    3
    0.047500396   2    2000005   -5
    0.047500396   2   -2000005    5
    0.0029462646   2    1000002   -2
    0.0029462646   2   -1000002    2
    0.0029462583   2    1000004   -4
    0.0029462583   2   -1000004    4
    0.0029406479   2    1000003   -3
    0.0029406479   2   -1000003    3
    0.0029406451   2    1000001   -1
    0.0029406451   2   -1000001    1
    0.0002044733   3    1000023    5   -5
    0.00020125288   3    1000024    5   -6
    0.00020125288   3   -1000024   -5    6
    0.00019416662   3    1000023    6   -6

DECAY 25  0.0036113766
    0.61317884   2   -5    5
    0.18765865   2   -24    24
    0.073183454   2    21    21
    0.070384899   2   -15    15
    0.029917265   2   -4    4
    0.021606438   2    23    23
    0.0023176415   2    22    22
    0.0012774199   2    22    23
    0.00024413317   2   -13    13
    0.00023046203   2   -3    3
    6.3720376e-07   2   -1    1
    1.5417881e-07   2   -2    2
    5.4884182e-09   2   -11    11

DECAY 35  2.3561907
    0.76290412   2   -6    6
    0.18728334   2   -5    5
    0.038029612   2   -15    15
    0.0090834002   2    25    25
    0.0010641031   2    23    23
    0.00082238384   2   -24    24
    0.00051219182   2    21    21
    0.00013253903   2   -13    13
    7.9910898e-05   2   -3    3
    7.3821243e-05   2    1000022    1000022
    1.0880077e-05   2   -4    4
    2.5534933e-06   2    22    22
    9.2227421e-07   2    22    23
    2.2093574e-07   2   -1    1
    2.9773692e-09   2   -11    11
    5.6118294e-11   2   -2    2

DECAY 36  2.3455043
    0.77563509   2   -6    6
    0.18425269   2   -5    5
    0.037405611   2   -15    15
    0.0014161773   2    23    25
    0.00080001478   2    21    21
    0.00026612567   2    1000022    1000022
    0.0001303624   2   -13    13
    7.8602288e-05   2   -3    3
    1.0459794e-05   2   -4    4
    3.3522163e-06   2    22    22
    1.2934086e-06   2    22    23
    2.173179e-07   2   -1    1
    2.9284716e-09   2   -11    11
    5.395836e-11   2   -2    2
    1.3663558e-35   2    25    25

DECAY 37  2.775644
    0.96533495   2   -5    6
    0.03184524   2   -15    16
    0.0012052664   2    24    25
    0.0011445977   2   -3    6
    0.00022877485   2   -5    4
    0.00011258451   2   -13    14
    7.0982645e-05   2   -3    4
    5.2492518e-05   2   -1    6
    2.8083997e-06   2   -3    2
    1.6335745e-06   2   -5    2
    4.967012e-07   2   -1    4
    1.6779545e-07   2   -1    2
    2.6333635e-09   2   -11    12
    3.6639458e-11   2    24    36
    1.9939306e-11   2    24    35

DECAY 6  2.43
    1   2    5    24

DECAY 15 -1
