BLOCK SPINFO
   1   SPheno
   2   v4.0.5be

BLOCK SPHENOINFO
   1   2
   2   2

BLOCK MODSEL
   1   0

BLOCK MINPAR
   3    46.516045
   4    1

BLOCK EXTPAR
   0    3469.5217
   1    4038.1361
   2   -1229.5127
   3    4369.1937
   11   -5517.933
   12    2595.4319
   13   -1177.7463
   23    223.51403
   25    45.706465
   26    3475.6505
   31    3276.6341
   32    3276.6341
   33    1964.4404
   34    3413.7279
   35    3413.7279
   36    659.52389
   41    3467.1492
   42    3467.1492
   43    2943.0684
   44    2551.9632
   45    2551.9632
   46    3952.6848
   47    1565.9506
   48    1565.9506
   49    3423.6667

BLOCK SMINPUTS
   1    127.90897
   2    1.1663787e-05
   3    0.1184
   4    91.1876
   5    4.18
   6    173.2
   7    1.777
   8    0
   11    0.00051099893
   12    0
   13    0.10565837
   14    0
   21    0.005
   22    0.0025
   23    0.095
   24    1.27

BLOCK GAUGE Q=  3469.5217
   1    0.35536298
   2    0.66519887
   3    1.219778

BLOCK YU Q=  3469.5217
   1   1    8.3863786e-06
   2   2    0.0042602803
   3   3    1.0131419

BLOCK YD Q=  3469.5217
   1   1    0.00077025114
   2   2    0.014634772
   3   3    0.76384776

BLOCK YE Q=  3469.5217
   1   1    0.00013441446
   2   2    0.027792646
   3   3    0.46742659

BLOCK AU Q=  3469.5217
   1   1    0
   2   2    0
   3   3   -5517.9329

BLOCK AD Q=  3469.5217
   1   1    0
   2   2    0
   3   3    2595.432

BLOCK AE Q=  3469.5217
   1   1    0
   2   2    0
   3   3   -1177.7463

BLOCK MSOFT Q=  3469.5217
   1    4038.1361
   2   -1229.5127
   3    4369.1937
   21    12349699
   22    149981.55
   31    3276.6341
   32    3276.6341
   33    1964.4404
   34    3413.7279
   35    3413.7279
   36    659.52389
   41    3467.1492
   42    3467.1492
   43    2943.0684
   44    2551.9632
   45    2551.9632
   46    3952.6848
   47    1565.9506
   48    1565.9506
   49    3423.6667

BLOCK MASS
   6    173.2
   23    91.1876
   24    80.429995
   15    1.777
   25    125.69834
   35    3473.3759
   36    3475.6505
   37    3474.6291
   1000001    3619.0621
   2000001    1742.8732
   1000002    3618.161
   2000002    2706.3514
   1000003    3619.0568
   2000003    1742.8576
   1000004    3618.1558
   2000004    2706.3506
   1000005    3038.5865
   2000005    3533.1985
   1000006    3025.7328
   2000006    3978.4018
   1000011    3287.0351
   2000011    3429.5831
   1000012    3285.665
   1000013    3287.0008
   2000013    3429.5175
   1000014    3285.6311
   1000015    662.93151
   2000015    1968.2938
   1000016    1964.2628
   1000021    4404.3488
   1000022   -233.89353
   1000023    238.21048
   1000025   -1284.4877
   1000035    3978.3951
   1000024    235.99453
   1000037    1284.5607

BLOCK ALPHA
      -0.021533121

BLOCK HMIX Q=  3469.5217
   1    223.51403
   2    45.706465
   3    243.08348
   4    12080146

BLOCK STOPMIX
   1   1    0.99318922
   1   2    0.11651253
   2   1   -0.11651253
   2   2    0.99318922

BLOCK SBOTMIX
   1   1    0.99998904
   1   2    0.0046812649
   2   1   -0.0046812649
   2   2    0.99998904

BLOCK STAUMIX
   1   1    0.0058579365
   1   2    0.99998284
   2   1   -0.99998284
   2   2    0.0058579365

BLOCK NMIX
   1   1   -0.007115657
   1   2   -0.052165048
   1   3    0.71007586
   1   4    0.70215414
   2   1    0.0084644802
   2   2    0.038259705
   2   3    0.7040518
   2   4   -0.70906672
   3   1   -0.0005313299
   3   2    0.99790529
   3   3    0.010125389
   3   4    0.063892243
   4   1    0.99993872
   4   2   -0.00016483029
   4   3   -0.00090145152
   4   4    0.011032793

BLOCK UMIX
   1   1   -0.014358047
   1   2    0.99989692
   2   1   -0.99989692
   2   2   -0.014358047

BLOCK VMIX
   1   1    0.090500718
   1   2    0.99589639
   2   1    0.99589639
   2   2   -0.090500718

BLOCK HIGGSBOUNDSINPUTHIGGSCOUPLINGSFERMIONS
       0, 2089.081,3,36,15,15

BLOCK HIGGSBOUNDSINPUTHIGGSCOUPLINGSBOSONS
       0,4,36,21,21,23

BLOCK SPHENOLOWENERGY
   1    0.00031256363
   2    1.5912045e-06
   3    3.5249209e-05
   4    3.0202289e-15
   5    1.2901922e-10
   6    2.6921854e-08
   7    1.0082009e-13
   8    4.3069828e-09
   9    9.1076448e-07
   10    9.5883642e-05
   11    0.99044131
   12    0.54181403
   13    19.352422
   14    0
   15    0
   16    0.0021568029
   17    2.2816542e-15
   18    2.4802274e-11
   19    8.2903605e-11
   20   -1.9844154e-15
   21   -8.4840556e-11
   22   -3.6735382e-08
   23    0
   24    0
   25    0
   26    0
   27    0
   28    0
   29    0
   30    0
   31    0
   39    6.7847162e-05
   40    0
   41    0
   42    0

BLOCK FWCOEF Q=  160
   305   4422   0   0   -0.18881911
   305   4422   0   2   -0.17853391
   305   4322   0   2    0.00016758007
   305   6421   0   0   -0.095227835
   305   6421   0   2   -0.094783639
   305   6321   0   2   -1.6484838e-05
   3051111   4133   0   0    1.6223211
   3051111   4133   0   2    1.6224617
   3051111   4233   0   2    0.0005217298
   3051111   4137   0   0   -4.4450132
   3051111   4137   0   2   -4.4431324
   3051111   4237   0   2   -0.0038863397
   3051313   4133   0   0    1.6223211
   3051313   4133   0   2    1.6224609
   3051313   4233   0   2    0.00052172887
   3051313   4137   0   0   -4.4450132
   3051313   4137   0   2   -4.4431331
   3051313   4237   0   2   -0.0038863413
   3051212   4137   0   0    1.5053501
   3051212   4137   0   2    1.5049494
   3051212   4237   0   2    0.00084119849
   3051414   4137   0   0    1.5053501
   3051414   4137   0   2    1.5049494
   3051414   4237   0   2    0.00084119856
   3051616   4137   0   0    1.5053501
   3051616   4137   0   2    1.5049497
   3051616   4237   0   2    0.00084121766

BLOCK IMFWCOEF Q=  160
   305   4422   0   0    3.8583308e-07
   305   4422   0   2   -1.4227111e-05
   305   4322   0   2    4.8124079e-06
   305   6421   0   0    3.3049155e-07
   305   6421   0   2   -1.5396412e-05
   305   6321   0   2    2.104882e-06
   3051111   4133   0   2   -1.2271375e-06
   3051111   4233   0   2    1.0082645e-05
   3051111   4137   0   2    1.1419263e-05
   3051111   4237   0   2   -7.5106796e-05
   3051313   4133   0   2   -1.227151e-06
   3051313   4233   0   2    1.0082634e-05
   3051313   4137   0   2    1.1419289e-05
   3051313   4237   0   2   -7.510683e-05
   3051212   4137   0   2   -2.3557147e-06
   3051212   4237   0   2    1.6256871e-05
   3051414   4137   0   2   -2.3557142e-06
   3051414   4237   0   2    1.6256871e-05
   3051616   4137   0   2   -2.3518159e-06
   3051616   4237   0   2    1.625687e-05

DECAY 23  2.4952


DECAY 24  2.085


DECAY 1000011  31.182578
    0.66602139   2   -1000037    12
    0.33151033   2    1000025    11
    0.0014386216   2    1000022    11
    0.00084032157   2    1000023    11
    0.00018933497   2   -1000024    12

DECAY 2000011  0.0020932345
    0.58444398   2    1000023    11
    0.4132548   2    1000022    11
    0.0017178603   2    1000025    11
    0.00058322563   2   -1000024    12

DECAY 1000013  31.232007
    0.66495536   2   -1000037    14
    0.33097984   2    1000025    13
    0.0022435175   2    1000022    13
    0.0016322495   2    1000023    13
    0.0001890333   2   -1000024    14

DECAY 2000013  0.10649823
    0.49008509   2   -1000024    14
    0.25531255   2    1000022    13
    0.25441541   2    1000023    13

DECAY 1000015  4.3954689
    0.50005409   2   -1000024    16
    0.25360764   2    1000022    15
    0.24633827   2    1000023    15

DECAY 2000015  17.026941
    0.33533288   2   -1000037    16
    0.24758786   2    1000022    15
    0.24287375   2    1000023    15
    0.1669554   2    1000025    15
    0.003609963   2    1000015    23
    0.0035364424   2    1000015    25
    0.00010370092   2   -1000024    16

DECAY 1000012  31.213558
    0.65957334   2    1000037    11
    0.33132047   2    1000025    12
    0.0075115617   2    1000024    11
    0.0010727778   2    1000022    12
    0.00052184226   2    1000023    12

DECAY 1000014  31.262973
    0.65851932   2    1000037    13
    0.33079091   2    1000025    14
    0.0090976889   2    1000024    13
    0.0010710709   2    1000022    14
    0.00052101193   2    1000023    14

DECAY 1000016  17.021411
    0.49524698   2    1000024    15
    0.33005085   2    1000037    15
    0.16580505   2    1000025    16
    0.0071812191   2    1000015    24
    0.0011546302   2    1000022    16
    0.00056126981   2    1000023    16

DECAY 2000001  0.00015434387
    0.49858387   2    1000023    1
    0.37261953   2    1000022    1
    0.12841656   2   -1000024    2
    0.00037431377   2    1000025    1

DECAY 1000001  36.521093
    0.66624525   2   -1000037    2
    0.33187069   2    1000025    1
    0.0011211063   2    1000022    1
    0.00058463256   2    1000023    1
    0.00017831096   2   -1000024    2

DECAY 2000003  0.014425709
    0.49599315   2   -1000024    4
    0.25358941   2    1000022    3
    0.2503803   2    1000023    3

DECAY 1000003  36.537571
    0.66594346   2   -1000037    4
    0.3317203   2    1000025    3
    0.0013310304   2    1000022    3
    0.00079119308   2    1000023    3
    0.0002133936   2   -1000024    4

DECAY 1000005  122.77206
    0.4919456   2   -1000024    6
    0.15061593   2   -1000037    6
    0.14347226   2    1000022    5
    0.14076757   2    1000023    5
    0.073198639   2    1000025    5

DECAY 2000005  81.125907
    0.49849592   2   -1000024    6
    0.25256792   2    1000022    5
    0.24838549   2    1000023    5
    0.00014586188   2    1000006   -24
    0.00014351808   2    1000005    25
    0.00012899319   2   -1000037    6

DECAY 2000002  0.00072882302
    0.58496663   2    1000023    2
    0.41362311   2    1000022    2
    0.0014051542   2    1000025    2

DECAY 1000002  36.567901
    0.65981959   2    1000037    1
    0.33119016   2    1000025    2
    0.0070745025   2    1000024    1
    0.0012329888   2    1000022    2
    0.0006827531   2    1000023    2

DECAY 2000004  0.0026487521
    0.36037342   2    1000024    3
    0.34355337   2    1000023    4
    0.2929698   2    1000022    4
    0.0018135607   2    1000037    3
    0.0012898466   2    1000025    4

DECAY 1000004  36.584347
    0.65952153   2    1000037    3
    0.33104039   2    1000025    4
    0.0074879212   2    1000024    3
    0.0012499064   2    1000022    4
    0.00070025543   2    1000023    4

DECAY 1000006  126.58672
    0.27186891   2    1000024    5
    0.23930146   2    1000023    6
    0.23440238   2    1000022    6
    0.14289733   2    1000037    5
    0.071164995   2    1000025    6
    0.040137692   3    1000022    24    5
    0.0001462527   2    1000022    4

DECAY 2000006  255.00642
    0.31629516   2    1000024    5
    0.16312906   2    1000005    24
    0.1594241   2    1000023    6
    0.15672536   2    1000022    6
    0.1212302   2    1000006    25
    0.083109858   2    1000006    23

DECAY 1000024  8.2195704e-11
    0.56126366   3    1000022   -1    2
    0.18709517   3    1000022   -11    12
    0.18454984   3    1000022   -13    14
    0.066517003   3    1000022   -3    4
    0.00057432846   3    1000022   -15    16

DECAY 1000037  11.060907
    0.24784453   2    1000023    24
    0.24448871   2    1000024    23
    0.24424222   2    1000022    24
    0.24411119   2    1000024    25
    0.0067376161   3    1000024    6   -6
    0.0063509361   3    1000022   -5    6
    0.0061542995   3    1000023   -5    6

DECAY 1000022 -1


DECAY 1000023  1.4891747e-08
    0.7449225   2    1000022    22
    0.069135976   3    1000022    12   -12
    0.051697714   3    1000022    1   -1
    0.051407629   3    1000022    3   -3
    0.040320256   3    1000022    2   -2
    0.011666849   3    1000022    11   -11
    0.011563792   3    1000022    13   -13
    0.011268903   3    1000022    4   -4
    0.0020364165   3    1000024    1   -2
    0.0020364165   3   -1000024   -1    2
    0.00067882537   3    1000024    11   -12
    0.00067882537   3   -1000024   -11    12
    0.00067177906   3    1000024    13   -14
    0.00067177906   3   -1000024   -13    14
    0.00043530612   3    1000024    3   -4
    0.00043530612   3   -1000024   -3    4
    0.00033271758   3    1000022    15   -15

DECAY 1000025  12.148282
    0.22573885   2    1000024   -24
    0.22573885   2   -1000024    24
    0.16111541   2    1000023    25
    0.14776442   2    1000023    23
    0.14384269   2    1000022    25
    0.076564149   2    1000022    23
    0.0066681309   3    1000024    5   -6
    0.0066681309   3   -1000024   -5    6
    0.0029724875   3    1000023    6   -6
    0.0028203036   3    1000022    6   -6

DECAY 1000035  66.023129
    0.14307317   2    1000015   -15
    0.14307317   2   -1000015    15
    0.058252458   2    2000004   -4
    0.058252458   2   -2000004    4
    0.058252438   2    2000002   -2
    0.058252438   2   -2000002    2
    0.039166144   2    1000024   -24
    0.039166144   2   -1000024    24
    0.032947795   2    2000003   -3
    0.032947795   2   -2000003    3
    0.032947515   2    2000001   -1
    0.032947515   2   -2000001    1
    0.022590664   2    1000022    23
    0.022220528   2    1000023    25
    0.021654435   2    1000016   -16
    0.021654435   2   -1000016    16
    0.021573863   2    2000015   -15
    0.021573863   2   -2000015    15
    0.019967965   2    1000022    25
    0.016589069   2    1000023    23
    0.0099895091   2    2000013   -13
    0.0099895091   2   -2000013    13
    0.009987299   2    2000011   -11
    0.009987299   2   -2000011    11
    0.0038276734   2    1000014   -14
    0.0038276734   2   -1000014    14
    0.0038273346   2    1000012   -12
    0.0038273346   2   -1000012    12
    0.0038092862   2    1000013   -13
    0.0038092862   2   -1000013    13
    0.0038089438   2    1000011   -11
    0.0038089438   2   -1000011    11
    0.0022521672   2    2000005   -5
    0.0022521672   2   -2000005    5
    0.0022039011   3    1000024    5   -6
    0.0022039011   3   -1000024   -5    6
    0.0021936271   2    1000005   -5
    0.0021936271   2   -1000005    5
    0.0021887232   2    1000006   -6
    0.0021887232   2   -1000006    6
    0.0018657229   2    37   -1000024
    0.0018657229   2   -37    1000024
    0.0018238478   3    1000023    6   -6
    0.0017760092   3    1000022    6   -6
    0.0015040107   2    1000022    35
    0.0013588471   2    1000023    35
    0.00049261124   2    1000023    36
    0.0004691407   2    1000022    36
    0.00037638332   2    1000004   -4
    0.00037638332   2   -1000004    4
    0.00037637333   2    1000002   -2
    0.00037637333   2   -1000002    2
    0.00037598178   2    1000003   -3
    0.00037598178   2   -1000003    3
    0.00037597127   2    1000001   -1
    0.00037597127   2   -1000001    1
    0.00015097336   2    1000037   -24
    0.00015097336   2   -1000037    24
    0.00011904958   2    1000025    23
    0.00010962881   2    1000025    25

DECAY 1000021  451.23418
    0.10275909   2    2000003   -3
    0.10275909   2   -2000003    3
    0.10275841   2    2000001   -1
    0.10275841   2   -2000001    1
    0.055964626   2    2000004   -4
    0.055964626   2   -2000004    4
    0.055964597   2    2000002   -2
    0.055964597   2   -2000002    2
    0.039667722   2    1000005   -5
    0.039667722   2   -1000005    5
    0.038689769   2    1000006   -6
    0.038689769   2   -1000006    6
    0.01984939   2    1000006   -4
    0.01984939   2   -1000006    4
    0.018356553   2    2000005   -5
    0.018356553   2   -2000005    5
    0.015271878   2    1000004   -4
    0.015271878   2   -1000004    4
    0.015271711   2    1000002   -2
    0.015271711   2   -1000002    2
    0.015240333   2    1000003   -3
    0.015240333   2   -1000003    3
    0.015240148   2    1000001   -1
    0.015240148   2   -1000001    1
    0.0049501924   2    2000006   -6
    0.0049501924   2   -2000006    6

DECAY 25  0.0039690675
    0.56144227   2   -5    5
    0.24023471   2   -24    24
    0.072070552   2    21    21
    0.064661322   2   -15    15
    0.029483409   2    23    23
    0.027772714   2   -4    4
    0.002342893   2    22    22
    0.0015562947   2    22    23
    0.00022425918   2   -13    13
    0.00021084144   2   -3    3
    5.8295443e-07   2   -1    1
    1.4311717e-07   2   -2    2
    5.0415867e-09   2   -11    11

DECAY 35  124.47575
    0.61428341   2   -5    5
    0.11766298   2   -15    15
    0.085226662   2   -1000024    1000037
    0.085226662   2   -1000037    1000024
    0.042838607   2    1000023    1000025
    0.0428019   2    1000022    1000025
    0.0041760906   2   -2000015    1000015
    0.0041760906   2   -1000015    2000015
    0.0020133489   2   -1000024    1000024
    0.00046369308   2   -6    6
    0.00041355861   2   -13    13
    0.00030451526   2    1000022    1000022
    0.00022623005   2   -3    3
    0.0001338845   2    1000023    1000023
    2.3358692e-05   2   -1000037    1000037
    1.1669916e-05   2    1000025    1000025
    9.5331665e-06   2    1000022    1000023
    5.7807746e-06   2    21    21
    7.1889947e-07   2   -1000015    1000015
    6.2543633e-07   2   -1    1
    4.9342483e-07   2    25    25
    8.8770746e-08   2    23    23
    3.432712e-08   2    22    23
    2.2219911e-08   2   -24    24
    1.9996337e-08   2    22    22
    9.2878716e-09   2   -11    11
    6.261659e-09   2   -4    4
    2.6822734e-09   2   -1000001    1000001
    2.6666348e-09   2   -1000003    1000003
    3.2278764e-14   2   -2    2

DECAY 36  117.40154
    0.60056424   2   -5    5
    0.11504116   2   -15    15
    0.09045295   2   -1000024    1000037
    0.09045295   2   -1000037    1000024
    0.046315638   2    1000022    1000025
    0.044578809   2    1000023    1000025
    0.0044298555   2   -2000015    1000015
    0.0044298555   2   -1000015    2000015
    0.0021422114   2   -1000024    1000024
    0.0004363133   2   -6    6
    0.0004043483   2   -13    13
    0.00030164092   2    1000022    1000022
    0.00022116923   2   -3    3
    0.00015759371   2    1000023    1000023
    2.9148933e-05   2   -1000037    1000037
    1.6470114e-05   2    1000022    1000023
    1.4593079e-05   2    1000025    1000025
    1.0248224e-05   2    21    21
    6.1144376e-07   2   -1    1
    1.7268317e-07   2    23    25
    9.0809746e-09   2   -11    11
    6.3235397e-09   2    22    23
    5.8280842e-09   2   -4    4
    1.147472e-09   2    22    22
    5.6970212e-13   2    23    35
    3.0043985e-14   2   -2    2
    3.4582471e-39   2    25    25

DECAY 37  126.43275
    0.61693635   2   -5    6
    0.11891858   2   -15    16
    0.085755756   2    1000022    1000037
    0.084315862   2    1000024    1000025
    0.083686261   2    1000023    1000037
    0.0082342117   2   -1000015    1000016
    0.00091429617   2   -5    4
    0.00042041958   2   -13    14
    0.00039150441   2    1000023    1000024
    0.00020550974   2    1000022    1000024
    0.00020337789   2   -3    4
    9.5412504e-06   2   -3    2
    6.5290177e-06   2   -5    2
    1.0053314e-06   2   -3    6
    5.642706e-07   2   -1    2
    1.6028048e-07   2    24    25
    3.225197e-08   2   -1    6
    2.6689614e-08   2   -1    4
    9.8336576e-09   2   -11    12
    3.603438e-12   2    1000025    1000037
    3.3281012e-14   2    24    35

DECAY 6  2.43
    1   2    5    24

DECAY 15 -1
