BLOCK SPINFO
   1   SPheno
   2   v4.0.5be

BLOCK SPHENOINFO
   1   2
   2   2

BLOCK MODSEL
   1   0

BLOCK MINPAR
   3    57.055197
   4   -1

BLOCK EXTPAR
   0    1556.6748
   1    58.23561
   2    263.3643
   3    3000
   11   -1967.0533
   12   -61.360104
   13   -191.81727
   23   -213.18508
   25    57.303556
   26    810.53316
   31    1767.3968
   32    1767.3968
   33    850.76658
   34    279.75376
   35    279.75376
   36    303.42239
   41    5000
   42    5000
   43    1256.2325
   44    5000
   45    5000
   46    1962.5583
   47    5000
   48    5000
   49    1004.0658

BLOCK SMINPUTS
   1    127.90897
   2    1.1663787e-05
   3    0.1184
   4    91.1876
   5    4.18
   6    173.2
   7    1.777
   8    0
   11    0.00051099893
   12    0
   13    0.10565837
   14    0
   21    0.005
   22    0.0025
   23    0.095
   24    1.27

BLOCK GAUGE Q=  1556.6748
   1    0.35536298
   2    0.66519887
   3    1.219778

BLOCK YU Q=  1556.6748
   1   1    8.3856487e-06
   2   2    0.0042599095
   3   3    1.0130537

BLOCK YD Q=  1556.6748
   1   1    0.00096560273
   2   2    0.018346452
   3   3    0.95757533

BLOCK YE Q=  1556.6748
   1   1    0.00016850474
   2   2    0.034841435
   3   3    0.58597563

BLOCK AU Q=  1556.6748
   1   1    0
   2   2    0
   3   3   -1967.0554

BLOCK AD Q=  1556.6748
   1   1    0
   2   2    0
   3   3   -61.360108

BLOCK AE Q=  1556.6748
   1   1    0
   2   2    0
   3   3   -191.81718

BLOCK MSOFT Q=  1556.6748
   1    58.23561
   2    263.3643
   3    3000
   21    694615.5
   22   -15084.074
   31    1767.3968
   32    1767.3968
   33    850.76658
   34    279.75376
   35    279.75376
   36    303.42239
   41    5000
   42    5000
   43    1256.2325
   44    5000
   45    5000
   46    1962.5583
   47    5000
   48    5000
   49    1004.0658

BLOCK MASS
   6    173.2
   23    91.1876
   24    80.429995
   15    1.777
   25    121.72809
   35    809.64608
   36    810.53316
   37    817.38716
   1000001    5031.1608
   2000001    5020.3629
   1000002    5030.6951
   2000002    5021.1872
   1000003    5031.1682
   2000003    5020.3756
   1000004    5030.7022
   2000004    5021.1879
   1000005    967.03261
   2000005    1239.6648
   1000006    1230.8392
   2000006    1968.7677
   1000011    1770.4594
   2000011    293.73699
   1000012    1768.2686
   1000013    1770.4434
   2000013    293.62518
   1000014    1768.2524
   1000015    290.04603
   2000015    847.10483
   1000016    842.43219
   1000021    3193.3279
   1000022    55.465334
   1000023    187.21623
   1000025   -222.28039
   1000035    319.53963
   1000024    187.40934
   1000037    320.50595

BLOCK ALPHA
      -0.018088258

BLOCK HMIX Q=  1556.6748
   1   -213.18508
   2    57.303556
   3    243.98042
   4    656964

BLOCK STOPMIX
   1   1    0.99269899
   1   2    0.12061808
   2   1   -0.12061808
   2   2    0.99269899

BLOCK SBOTMIX
   1   1   -0.052907462
   1   2    0.99859942
   2   1   -0.99859942
   2   2   -0.052907462

BLOCK STAUMIX
   1   1   -0.0331024
   1   2    0.99945196
   2   1   -0.99945196
   2   2   -0.0331024

BLOCK NMIX
   1   1    0.97318763
   1   2   -0.018087896
   1   3   -0.2225966
   1   4   -0.055040125
   2   1    0.18826477
   2   2    0.47913882
   2   3    0.64431731
   2   4    0.56554183
   3   1    0.11319412
   3   2   -0.11753777
   3   3    0.6809577
   3   4   -0.71391076
   4   1   -0.068185766
   4   2    0.86964573
   4   3   -0.26758654
   4   4   -0.4092242

BLOCK UMIX
   1   1   -0.3837064
   1   2   -0.92345514
   2   1    0.92345514
   2   2   -0.3837064

BLOCK VMIX
   1   1   -0.5872871
   1   2    0.80937869
   2   1    0.80937869
   2   2    0.5872871

BLOCK HIGGSBOUNDSINPUTHIGGSCOUPLINGSFERMIONS
       0, 3283.6975,3,36,15,15

BLOCK HIGGSBOUNDSINPUTHIGGSCOUPLINGSBOSONS
       0,4,36,21,21,23

BLOCK SPHENOLOWENERGY
   1    0.00042087485
   2    1.5888396e-06
   3    3.5211332e-05
   4    8.0294652e-15
   5    3.4250893e-10
   6    4.2984011e-08
   7    2.6472504e-13
   8    1.129295e-08
   9    1.4600358e-06
   10    7.0302701e-05
   11    0.72619999
   12    0.54237279
   13    19.200624
   14    0
   15    0
   16    0.0021613178
   17    2.2817302e-15
   18    2.476637e-11
   19    8.2825238e-11
   20   -9.5379846e-15
   21   -4.0768956e-10
   22   -3.8926171e-07
   23    0
   24    0
   25    0
   26    0
   27    0
   28    0
   29    0
   30    0
   31    0
   39    9.7782377e-05
   40    0
   41    0
   42    0

BLOCK FWCOEF Q=  160
   305   4422   0   0   -0.18881911
   305   4422   0   2   -0.29515345
   305   4322   0   2   -0.0012470289
   305   6421   0   0   -0.095227835
   305   6421   0   2   -0.17033639
   305   6321   0   2   -0.0010954381
   3051111   4133   0   0    1.5942486
   3051111   4133   0   2    1.5953916
   3051111   4233   0   2    1.5479762e-05
   3051111   4137   0   0   -4.4169407
   3051111   4137   0   2   -4.4111426
   3051111   4237   0   2   -0.00011105063
   3051313   4133   0   0    1.5942486
   3051313   4133   0   2    1.5953881
   3051313   4233   0   2    1.5363575e-05
   3051313   4137   0   0   -4.4169407
   3051313   4137   0   2   -4.411146
   3051313   4237   0   2   -0.00011095589
   3051212   4137   0   0    1.5053501
   3051212   4137   0   2    1.5041068
   3051212   4237   0   2    2.4160463e-05
   3051414   4137   0   0    1.5053501
   3051414   4137   0   2    1.5041068
   3051414   4237   0   2    2.4184237e-05
   3051616   4137   0   0    1.5053501
   3051616   4137   0   2    1.5041117
   3051616   4237   0   2    3.0881515e-05

BLOCK IMFWCOEF Q=  160
   305   4422   0   0    3.8578636e-07
   305   4422   0   2   -4.4624414e-05
   305   4322   0   2   -6.9101289e-06
   305   6421   0   0    3.3045153e-07
   305   6421   0   2    7.6387697e-06
   305   6321   0   2   -1.9327152e-06
   3051111   4133   0   2    8.709431e-07
   3051111   4233   0   2    9.7472908e-06
   3051111   4137   0   2    3.233251e-06
   3051111   4237   0   2   -7.5568937e-05
   3051313   4133   0   2    8.709048e-07
   3051313   4233   0   2    9.7471666e-06
   3051313   4137   0   2    3.2333e-06
   3051313   4237   0   2   -7.5569196e-05
   3051212   4137   0   2   -3.5246535e-07
   3051212   4237   0   2    1.6460344e-05
   3051414   4137   0   2   -3.5246412e-07
   3051414   4237   0   2    1.6460344e-05
   3051616   4137   0   2   -3.0234399e-07
   3051616   4237   0   2    1.6460301e-05

DECAY 23  2.4952


DECAY 24  2.085


DECAY 2000011  1.3218296
    0.98343415   2    1000022    11
    0.013952949   2    1000023    11
    0.0026128595   2    1000025    11

DECAY 1000011  24.284548
    0.51201022   2   -1000037    12
    0.20850335   2    1000035    11
    0.10544336   2    1000023    11
    0.09238464   2   -1000024    12
    0.080646065   2    1000022    11
    0.0010123687   2    1000025    11

DECAY 2000013  1.3253085
    0.9806747   2    1000022    13
    0.014673722   2    1000023    13
    0.0030491111   2    1000025    13
    0.0016024629   2   -1000024    14

DECAY 1000013  24.326144
    0.51112946   2   -1000037    14
    0.20826225   2    1000035    13
    0.10597571   2    1000023    13
    0.092225796   2   -1000024    14
    0.080594331   2    1000022    13
    0.0018001159   2    1000025    13

DECAY 1000015  2.436349
    0.56821729   2    1000022    15
    0.24245991   2   -1000024    16
    0.12503283   2    1000023    15
    0.064289973   2    1000025    15

DECAY 2000015  14.984321
    0.31883259   2   -1000037    16
    0.21629083   2    1000023    15
    0.1580845   2    1000025    15
    0.15075695   2    1000035    15
    0.078864935   2    1000022    15
    0.057230783   2   -1000024    16
    0.010058623   2    1000015    25
    0.0098807989   2    1000015    23

DECAY 1000012  24.34398
    0.39181249   2    1000037    11
    0.24561097   2    1000035    12
    0.21561499   2    1000024    11
    0.09235169   2    1000022    12
    0.044796765   2    1000023    12
    0.0098130945   2    1000025    12

DECAY 1000014  24.385218
    0.39138654   2    1000037    13
    0.24519306   2    1000035    14
    0.21670874   2    1000024    13
    0.092194664   2    1000022    14
    0.04472058   2    1000023    14
    0.0097964038   2    1000025    14

DECAY 1000016  15.088994
    0.44740548   2    1000024    15
    0.27620681   2    1000037    15
    0.14786981   2    1000035    16
    0.070508991   2    1000022    16
    0.03182462   2    1000023    16
    0.019443977   2    1000015    24
    0.0067403091   2    1000025    16

DECAY 2000001  143.28542
    0.98044569   2    1000021    1
    0.018521791   2    1000022    1
    0.00069166121   2    1000023    1
    0.0002499541   2    1000025    1

DECAY 1000001  208.26733
    0.67993059   2    1000021    1
    0.17987869   2   -1000037    2
    0.082010181   2    1000035    1
    0.03122283   2   -1000024    2
    0.02105561   2    1000023    1
    0.00389378   2    1000022    1
    0.0020083156   2    1000025    1

DECAY 2000003  143.35357
    0.97998889   2    1000021    3
    0.018524619   2    1000022    3
    0.00078814868   2    1000023    3
    0.00035785187   2    1000025    3
    0.00019942625   2   -1000024    4
    0.00010682305   2    1000035    3

DECAY 1000003  208.30348
    0.67981627   2    1000021    3
    0.17985075   2   -1000037    4
    0.082007515   2    1000035    3
    0.031223131   2   -1000024    4
    0.021118768   2    1000023    3
    0.0039011001   2    1000022    3
    0.002082465   2    1000025    3

DECAY 1000005  31.400184
    0.4229581   2   -1000024    6
    0.23075597   2    1000025    5
    0.22328863   2    1000023    5
    0.049097476   2   -1000037    6
    0.047290675   2    1000022    5
    0.026609154   2    1000035    5

DECAY 2000005  58.962503
    0.28294551   2   -1000037    6
    0.26771901   2   -1000024    6
    0.17042407   2    1000025    5
    0.16499452   2    1000023    5
    0.090519458   2    1000035    5
    0.019954768   2    1000022    5
    0.0019058358   2    1000005    25
    0.0015368277   2    1000005    23

DECAY 2000002  151.77783
    0.926152   2    1000021    2
    0.06995314   2    1000022    2
    0.0026112584   2    1000023    2
    0.0009428964   2    1000025    2
    0.00034070831   2    1000035    2

DECAY 1000002  208.26371
    0.67970963   2    1000021    2
    0.13817152   2    1000037    1
    0.077549332   2    1000035    2
    0.073138234   2    1000024    1
    0.027866285   2    1000023    2
    0.0025606923   2    1000022    2
    0.0010043096   2    1000025    2

DECAY 2000004  151.78146
    0.92612998   2    1000021    4
    0.069951505   2    1000022    4
    0.0026150094   2    1000023    4
    0.0009489333   2    1000025    4
    0.00034268592   2    1000035    4

DECAY 1000004  208.29977
    0.67959523   2    1000021    4
    0.13817133   2    1000037    3
    0.077537481   2    1000035    4
    0.07326285   2    1000024    3
    0.027864266   2    1000023    4
    0.0025602789   2    1000022    4
    0.0010085602   2    1000025    4

DECAY 1000006  58.742231
    0.40107502   2    1000024    5
    0.19783828   2    1000025    6
    0.1504815   2    1000023    6
    0.12550193   2    1000037    5
    0.10829545   2    1000035    6
    0.0070737446   2    1000023    4
    0.0053631357   2    1000022    6
    0.0028794992   2    1000005    24
    0.0008147422   3    1000022    24    5
    0.00067669904   2    1000022    4

DECAY 2000006  118.05069
    0.19526431   2    1000024    5
    0.16276938   2    1000025    6
    0.13758854   2    2000005    24
    0.13572844   2    1000037    5
    0.099733594   2    1000023    6
    0.095540592   2    1000006    25
    0.069554347   2    1000006    23
    0.067772204   2    1000035    6
    0.034038642   2    1000022    6
    0.0012360003   2    1000005    37
    0.00077394433   2    1000005    24

DECAY 1000024  0.06082586
    0.99979032   2    1000022    24
    0.00020866314   3    1000022   -15    16

DECAY 1000037  1.1949494
    0.41892017   2    1000025    24
    0.29605343   2    1000023    24
    0.19922071   2    1000024    23
    0.049529612   2    1000024    25
    0.03259138   2    1000022    24
    0.0036529529   2   -1000015    16

DECAY 1000022 -1


DECAY 1000023  0.039797361
    0.60398548   2    1000022    23
    0.39559266   2    1000022    25
    0.00035638846   3    1000022    15   -15

DECAY 1000025  0.18387488
    0.68823942   2    1000022    23
    0.30901094   2    1000022    25
    0.00028987475   3    1000024    1   -2
    0.00028987475   3   -1000024   -1    2
    0.00028816128   3    1000024    3   -4
    0.00028816128   3   -1000024   -3    4
    0.00026259036   3    1000022    15   -15
    0.00013096343   3    1000023    12   -12
    0.00010640158   3    1000024    15   -16
    0.00010640158   3   -1000024   -15    16

DECAY 1000035  1.1518304
    0.31721766   2    1000024   -24
    0.31721766   2   -1000024    24
    0.27388184   2    1000025    23
    0.043980244   2    1000023    25
    0.017970943   2    1000022    25
    0.012794435   2    1000022    23
    0.012787573   2    1000023    23
    0.0018820131   2    1000015   -15
    0.0018820131   2   -1000015    15

DECAY 1000021  271.14807
    0.1438415   2    1000005   -5
    0.1438415   2   -1000005    5
    0.12568291   2    2000005   -5
    0.12568291   2   -2000005    5
    0.12236559   2    1000006   -6
    0.12236559   2   -1000006    6
    0.069359576   2    2000006   -6
    0.069359576   2   -2000006    6
    0.038642468   2    1000006   -4
    0.038642468   2   -1000006    4

DECAY 25  0.0036999873
    0.62694792   2   -5    5
    0.16783731   2   -24    24
    0.071153337   2   -15    15
    0.070519989   2    21    21
    0.029047314   2   -4    4
    0.019020384   2    23    23
    0.011652367   2    1000022    1000022
    0.0021810683   2    22    22
    0.0011565676   2    22    23
    0.00024735226   2   -13    13
    0.00023558184   2   -3    3
    6.5135948e-07   2   -1    1
    1.4969759e-07   2   -2    2
    5.5607949e-09   2   -11    11

DECAY 35  50.884016
    0.75832851   2   -5    5
    0.096882735   2   -15    15
    0.030966235   2   -1000024    1000024
    0.025598924   2   -1000024    1000037
    0.025598924   2   -1000037    1000024
    0.020103825   2    1000025    1000035
    0.010866632   2    1000022    1000023
    0.0070965992   2    1000023    1000023
    0.0059465643   2    1000022    1000025
    0.0058416123   2    1000023    1000035
    0.0044145258   2   -1000037    1000037
    0.0028089972   2    1000035    1000035
    0.0017778683   2    1000022    1000022
    0.0017498701   2    1000023    1000025
    0.0010796966   2    1000025    1000025
    0.00034853431   2   -13    13
    0.00026381078   2   -3    3
    0.00021398359   2   -6    6
    6.532339e-05   2    21    21
    2.2226523e-05   2    1000022    1000035
    1.2290777e-05   2   -1000015    1000015
    8.826951e-06   2    25    25
    1.0291773e-06   2   -24    24
    7.2938524e-07   2   -1    1
    6.2208764e-07   2    23    23
    6.0108225e-07   2    22    23
    3.0055286e-07   2    22    22
    9.5728278e-08   2   -1000011    1000011
    9.3861492e-08   2   -1000013    1000013
    7.8310338e-09   2   -11    11
    3.3660778e-09   2   -4    4
    1.7359399e-14   2   -2    2

DECAY 36  48.837695
    0.75288977   2   -5    5
    0.096196891   2   -15    15
    0.039045734   2   -1000024    1000024
    0.020796994   2   -1000024    1000037
    0.020796994   2   -1000037    1000024
    0.012912348   2    1000025    1000035
    0.011508379   2    1000022    1000023
    0.0095669753   2   -1000037    1000037
    0.0089513249   2    1000023    1000035
    0.0087725161   2    1000023    1000023
    0.006220056   2    1000022    1000025
    0.0061480118   2    1000035    1000035
    0.0018577881   2    1000022    1000022
    0.0017476244   2    1000025    1000025
    0.0016015949   2    1000023    1000025
    0.00034605595   2   -13    13
    0.0002618979   2   -3    3
    0.00024904979   2   -6    6
    8.3025559e-05   2    21    21
    4.4868134e-05   2    1000022    1000035
    1.017209e-06   2    23    25
    7.2409647e-07   2   -1    1
    3.1267027e-07   2    22    23
    3.2028868e-08   2    22    22
    7.7753467e-09   2   -11    11
    3.1203716e-09   2   -4    4
    1.6105942e-14   2   -2    2
    3.3954278e-38   2    25    25

DECAY 37  45.971981
    0.72403119   2   -5    6
    0.11574878   2   -15    16
    0.053377164   2    1000023    1000037
    0.038014396   2    1000024    1000035
    0.030146225   2    1000025    1000037
    0.022329604   2    1000022    1000024
    0.012500907   2    1000024    1000025
    0.0017779067   2    1000023    1000024
    0.0011497886   2   -5    4
    0.00040921682   2   -13    14
    0.00026829144   2   -3    4
    0.00017032843   2    1000022    1000037
    5.3027413e-05   2    1000035    1000037
    1.2358101e-05   2   -3    2
    8.2107137e-06   2   -5    2
    1.1204146e-06   2    24    25
    7.4457716e-07   2   -1    2
    6.8697471e-07   2   -3    6
    3.4346253e-08   2   -1    4
    1.5055012e-08   2   -1    6
    9.5716242e-09   2   -11    12
    8.1624038e-10   2    24    35
    4.4436706e-10   2    24    36

DECAY 6  2.43
    1   2    5    24

DECAY 15 -1
