BLOCK SPINFO
   1   SPheno
   2   v4.0.5be

BLOCK SPHENOINFO
   1   2
   2   2

BLOCK MODSEL
   1   0

BLOCK MINPAR
   3    26.480009
   4   -1

BLOCK EXTPAR
   0    1501.8158
   1    505.19539
   2   -505.365
   3    3000
   11   -2853.9021
   12   -1322.8849
   13   -1641.4061
   23   -587.43836
   25    25.678416
   26    3766.1489
   31    496.26465
   32    496.26465
   33    1060.453
   34    1529.2987
   35    1529.2987
   36    1092.1947
   41    5000
   42    5000
   43    1168.5552
   44    5000
   45    5000
   46    1994.6001
   47    5000
   48    5000
   49    1531.6887

BLOCK SMINPUTS
   1    127.90897
   2    1.1663787e-05
   3    0.1184
   4    91.1876
   5    4.18
   6    173.2
   7    1.777
   8    0
   11    0.00051099893
   12    0
   13    0.10565837
   14    0
   21    0.005
   22    0.0025
   23    0.095
   24    1.27

BLOCK GAUGE Q=  1501.8158
   1    0.35536298
   2    0.66519887
   3    1.219778

BLOCK YU Q=  1501.8158
   1   1    8.3907275e-06
   2   2    0.0042624896
   3   3    1.0136673

BLOCK YD Q=  1501.8158
   1   1    0.00043296032
   2   2    0.0082262461
   3   3    0.42936096

BLOCK YE Q=  1501.8158
   1   1    7.5554742e-05
   2   2    0.015622324
   3   3    0.26274179

BLOCK AU Q=  1501.8158
   1   1    0
   2   2    0
   3   3   -2853.9021

BLOCK AD Q=  1501.8158
   1   1    0
   2   2    0
   3   3   -1322.8849

BLOCK AE Q=  1501.8158
   1   1    0
   2   2    0
   3   3   -1641.4061

BLOCK MSOFT Q=  1501.8158
   1    505.19539
   2   -505.365
   3    3000
   21    13798579
   22   -304088.02
   31    496.26465
   32    496.26465
   33    1060.453
   34    1529.2987
   35    1529.2987
   36    1092.1947
   41    5000
   42    5000
   43    1168.5552
   44    5000
   45    5000
   46    1994.6001
   47    5000
   48    5000
   49    1531.6887

BLOCK MASS
   6    173.2
   23    91.1876
   24    80.429995
   15    1.777
   25    123.04688
   35    3764.9422
   36    3766.1489
   37    3766.0839
   1000001    5028.455
   2000001    5017.6443
   1000002    5028.0056
   2000002    5020.5524
   1000003    5028.4577
   2000003    5017.6476
   1000004    5028.008
   2000004    5020.5532
   1000005    1154.2796
   2000005    1553.4807
   1000006    1133.3523
   2000006    1990.0702
   1000011    513.1427
   2000011    1527.2831
   1000012    506.58056
   1000013    513.15701
   2000013    1527.2897
   1000014    506.59634
   1000015    1065.4823
   2000015    1097.4644
   1000016    1066.9485
   1000021    3189.4256
   1000022    496.87996
   1000023   -499.35139
   1000025    605.41675
   1000035   -630.43313
   1000024    500.11239
   1000037    631.90733

BLOCK ALPHA
      -0.037818555

BLOCK HMIX Q=  1501.8158
   1   -587.43836
   2    25.678416
   3    244.00828
   4    14183878

BLOCK STOPMIX
   1   1    0.98825337
   1   2    0.15282431
   2   1   -0.15282431
   2   2    0.98825337

BLOCK SBOTMIX
   1   1   -0.99948663
   1   2    0.03203854
   2   1   -0.03203854
   2   2   -0.99948663

BLOCK STAUMIX
   1   1   -0.9235398
   1   2    0.38350259
   2   1   -0.38350259
   2   2   -0.9235398

BLOCK NMIX
   1   1    0.95729648
   1   2    0.013811567
   1   3   -0.22275665
   1   4   -0.18377202
   2   1   -0.015122457
   2   2   -0.85696256
   2   3   -0.39295169
   2   4    0.33312978
   3   1    0.28763114
   3   2   -0.046495672
   3   3    0.6695504
   3   4    0.68323404
   4   1   -0.024961528
   4   2    0.51309118
   4   3   -0.58963608
   4   4    0.62325248

BLOCK UMIX
   1   1   -0.83497895
   1   2   -0.55028188
   2   1   -0.55028188
   2   2    0.83497895

BLOCK VMIX
   1   1    0.88429895
   1   2    0.46692116
   2   1    0.46692116
   2   2   -0.88429895

BLOCK HIGGSBOUNDSINPUTHIGGSCOUPLINGSFERMIONS
       0, 659.38105,3,36,15,15

BLOCK HIGGSBOUNDSINPUTHIGGSCOUPLINGSBOSONS
       0,4,36,21,21,23

BLOCK SPHENOLOWENERGY
   1    0.0003539525
   2    1.5859461e-06
   3    3.5215736e-05
   4    2.3536961e-15
   5    1.0054753e-10
   6    2.1064643e-08
   7    7.9554898e-14
   8    3.398593e-09
   9    7.2141878e-07
   10    9.6470601e-05
   11    0.99650437
   12    0.54286364
   13    19.395003
   14    0
   15    0
   16    0.0021618064
   17    2.2817042e-15
   18    2.4785055e-11
   19    8.2864421e-11
   20    9.6879683e-15
   21    4.1418854e-10
   22    8.0666242e-08
   23    0
   24    0
   25    0
   26    0
   27    0
   28    0
   29    0
   30    0
   31    0
   39    8.0267849e-05
   40    0
   41    0
   42    0

BLOCK FWCOEF Q=  160
   305   4422   0   0   -0.18881911
   305   4422   0   2   -0.22781135
   305   4322   0   2   -0.00026333559
   305   6421   0   0   -0.095227835
   305   6421   0   2   -0.11755016
   305   6321   0   2   -0.00017532349
   3051111   4133   0   0    1.5919979
   3051111   4133   0   2    1.5927109
   3051111   4233   0   2    0.00012036083
   3051111   4137   0   0   -4.41469
   3051111   4137   0   2   -4.4093093
   3051111   4237   0   2   -0.00093598016
   3051313   4133   0   0    1.5919979
   3051313   4133   0   2    1.5927088
   3051313   4233   0   2    0.00012036062
   3051313   4137   0   0   -4.41469
   3051313   4137   0   2   -4.4093114
   3051313   4237   0   2   -0.00093598088
   3051212   4137   0   0    1.5053501
   3051212   4137   0   2    1.5042098
   3051212   4237   0   2    0.00020397966
   3051414   4137   0   0    1.5053501
   3051414   4137   0   2    1.5042098
   3051414   4237   0   2    0.00020397967
   3051616   4137   0   0    1.5053501
   3051616   4137   0   2    1.504209
   3051616   4237   0   2    0.00020398133

BLOCK IMFWCOEF Q=  160
   305   4422   0   0    3.857718e-07
   305   4422   0   2    1.715864e-05
   305   4322   0   2   -3.2004954e-06
   305   6421   0   0    3.3043906e-07
   305   6421   0   2    1.3023548e-05
   305   6321   0   2   -1.1384254e-06
   3051111   4133   0   2   -2.4485478e-06
   3051111   4233   0   2    2.3558538e-06
   3051111   4137   0   2    1.5464684e-05
   3051111   4237   0   2   -1.8323723e-05
   3051313   4133   0   2   -2.4486758e-06
   3051313   4233   0   2    2.3558507e-06
   3051313   4137   0   2    1.5464859e-05
   3051313   4237   0   2   -1.8323737e-05
   3051212   4137   0   2   -2.7573769e-06
   3051212   4237   0   2    3.9933275e-06
   3051414   4137   0   2   -2.7573764e-06
   3051414   4237   0   2    3.9933275e-06
   3051616   4137   0   2   -2.7718193e-06
   3051616   4237   0   2    3.9933301e-06

DECAY 23  2.4952


DECAY 24  2.085


DECAY 1000011  0.015278686
    0.53023424   2   -1000024    12
    0.31108032   2    1000023    11
    0.15868409   2    1000022    11

DECAY 2000011  6.0784185
    0.92502509   2    1000022    11
    0.074203179   2    1000025    11
    0.00054141629   2    1000035    11
    0.00023029577   2    1000023    11

DECAY 1000013  0.015311588
    0.53021472   2   -1000024    14
    0.31117137   2    1000023    13
    0.15861257   2    1000022    13

DECAY 2000013  6.0896239
    0.92337788   2    1000022    13
    0.074454324   2    1000025    13
    0.0008317512   2    1000035    13
    0.00058320254   2   -1000037    14
    0.00037983099   2    1000023    13
    0.00029394842   2   -1000024    14

DECAY 1000015  8.9947092
    0.46301558   2   -1000024    16
    0.26007758   2    1000023    15
    0.14290559   2    1000022    15
    0.063856526   2   -1000037    16
    0.043645586   2    1000035    15
    0.026499148   2    1000025    15

DECAY 2000015  5.3029068
    0.52135058   2    1000022    15
    0.21643598   2   -1000037    16
    0.12100607   2    1000025    15
    0.10968292   2    1000035    15
    0.016333819   2   -1000024    16
    0.015188554   2    1000023    15

DECAY 1000012  0.0044356974
    0.53004478   2    1000024    11
    0.29087517   2    1000023    12
    0.17908004   2    1000022    12

DECAY 1000014  0.0044539723
    0.53015592   2    1000024    13
    0.29092935   2    1000023    14
    0.17891473   2    1000022    14

DECAY 1000016  9.4514734
    0.50142372   2    1000024    15
    0.21837354   2    1000023    16
    0.1372698   2    1000037    15
    0.075450027   2    1000022    16
    0.058331921   2    1000035    16
    0.0091509884   2    1000025    16

DECAY 2000001  143.41185
    0.98086293   2    1000021    1
    0.017551339   2    1000022    1
    0.0015693732   2    1000025    1

DECAY 1000001  207.34742
    0.68384093   2    1000021    1
    0.14591197   2   -1000024    2
    0.076369689   2    1000023    1
    0.062620033   2   -1000037    2
    0.02769872   2    1000035    1
    0.0025687402   2    1000022    1
    0.00098991375   2    1000025    1

DECAY 2000003  143.4253
    0.98077339   2    1000021    3
    0.017551994   2    1000022    3
    0.0015896702   2    1000025    3

DECAY 1000003  207.35607
    0.68381378   2    1000021    3
    0.14590776   2   -1000024    4
    0.076371486   2    1000023    3
    0.062624179   2   -1000037    4
    0.027708534   2    1000035    3
    0.0025702198   2    1000022    3
    0.0010040457   2    1000025    3

DECAY 1000005  23.011969
    0.4812886   2   -1000037    6
    0.27800143   2   -1000024    6
    0.12831514   2    1000023    5
    0.058262403   2    1000035    5
    0.043473924   2    1000025    5
    0.010658505   2    1000022    5

DECAY 2000005  9.4089296
    0.30912684   2   -1000037    6
    0.2046404   2    1000025    5
    0.15623185   2    1000035    5
    0.12393525   2   -1000024    6
    0.088589461   2    1000022    5
    0.064223869   2    1000023    5
    0.026263441   2    1000006   -24
    0.015482595   2    1000005    25
    0.011506288   2    1000005    23

DECAY 2000002  151.95442
    0.92771247   2    1000021    2
    0.066298451   2    1000022    2
    0.0059280074   2    1000025    2

DECAY 1000002  207.34258
    0.68363125   2    1000021    2
    0.16364695   2    1000024    1
    0.077330288   2    1000023    2
    0.045081608   2    1000037    1
    0.026753355   2    1000035    2
    0.003554235   2    1000022    2

DECAY 2000004  151.95797
    0.92769095   2    1000021    4
    0.066297281   2    1000022    4
    0.0059333074   2    1000025    4

DECAY 1000004  207.35111
    0.68360398   2    1000021    4
    0.16364993   2    1000024    3
    0.077328113   2    1000023    4
    0.045101782   2    1000037    3
    0.026755518   2    1000035    4
    0.0035543836   2    1000022    4

DECAY 1000006  21.676314
    0.2109133   2    1000024    5
    0.20572594   2    1000025    6
    0.17731033   2    1000035    6
    0.17132286   2    1000023    6
    0.16031078   2    1000037    5
    0.039203694   2    1000022    6
    0.033523351   2    1000023    4
    0.0015478257   2    1000022    4
    0.00014191954   3    1000022    24    5

DECAY 2000006  150.47688
    0.23934741   2    1000005    24
    0.165572   2    1000006    25
    0.15012978   2    1000037    5
    0.12308681   2    1000006    23
    0.11157729   2    1000025    6
    0.075167727   2    1000035    6
    0.072103341   2    1000024    5
    0.036402173   2    1000023    6
    0.026565142   2    1000022    6

DECAY 1000024  8.048082e-12
    0.35363018   3    1000022   -1    2
    0.19068568   3    1000022   -11    12
    0.18893434   3    1000022   -13    14
    0.15495237   3    1000022   -3    4
    0.044337142   3    1000023   -1    2
    0.025004649   3    1000023   -11    12
    0.021612773   3    1000023   -13    14
    0.020842859   3    1000022   -15    16

DECAY 1000037  2.0767935
    0.56054281   2    1000023    24
    0.15849333   2    1000024    23
    0.076521373   2    1000022    24
    0.047037393   2   -1000011    12
    0.047027235   2   -1000013    14
    0.037334909   2    1000014   -13
    0.037280462   2    1000012   -11
    0.03575604   2    1000024    25

DECAY 1000022 -1


DECAY 1000023  1.2459322e-10
    0.95641387   2    1000022    22
    0.014101923   3    1000022    12   -12
    0.0086070967   3    1000022    1   -1
    0.0084607877   3    1000022    3   -3
    0.0067139933   3    1000022    2   -2
    0.0028858578   3    1000022    11   -11
    0.0028164703   3    1000022    13   -13

DECAY 1000025  1.100149
    0.67639887   2    1000023    23
    0.14978096   2    1000024   -24
    0.14978096   2   -1000024    24
    0.0043624165   2    1000012   -12
    0.0043624165   2   -1000012    12
    0.0043611477   2    1000014   -14
    0.0043611477   2   -1000014    14
    0.0017188729   2    1000022    23
    0.001149466   2    1000013   -13
    0.001149466   2   -1000013    13
    0.0011028703   2    1000011   -11
    0.0011028703   2   -1000011    11
    0.00036589139   2    1000023    22

DECAY 1000035  3.3341679
    0.36044651   2    1000024   -24
    0.36044651   2   -1000024    24
    0.1174602   2    1000022    23
    0.032866249   2    1000022    25
    0.022408648   2    1000023    25
    0.014477212   2    1000012   -12
    0.014477212   2   -1000012    12
    0.014473926   2    1000014   -14
    0.014473926   2   -1000014    14
    0.011853457   2    1000013   -13
    0.011853457   2   -1000013    13
    0.011836959   2    1000011   -11
    0.011836959   2   -1000011    11
    0.0010731314   2    1000023    23

DECAY 1000021  254.30985
    0.14020276   2    1000005   -5
    0.14020276   2   -1000005    5
    0.13626005   2    1000006   -6
    0.13626005   2   -1000006    6
    0.10796708   2    2000005   -5
    0.10796708   2   -2000005    5
    0.072464283   2    2000006   -6
    0.072464283   2   -2000006    6
    0.043007805   2    1000006   -4
    0.043007805   2   -1000006    4

DECAY 25  0.0036333337
    0.60210685   2   -5    5
    0.19785792   2   -24    24
    0.073800239   2    21    21
    0.069231976   2   -15    15
    0.02982422   2   -4    4
    0.023029771   2    23    23
    0.0023441268   2    22    22
    0.0013373699   2    22    23
    0.00024021426   2   -13    13
    0.00022652771   2   -3    3
    6.2632689e-07   2   -1    1
    1.536973e-07   2   -2    2
    5.40031e-09   2   -11    11

DECAY 35  92.349741
    0.36357815   2   -5    5
    0.1067987   2   -1000024    1000037
    0.1067987   2   -1000037    1000024
    0.06067488   2   -15    15
    0.060118018   2   -1000024    1000024
    0.045292702   2    1000022    1000025
    0.033013603   2   -1000037    1000037
    0.032543601   2    1000025    1000035
    0.028463404   2    1000022    1000022
    0.023539043   2    1000022    1000023
    0.022183484   2    1000035    1000035
    0.017237259   2    1000022    1000035
    0.016669105   2   -2000006    1000006
    0.016669105   2   -1000006    2000006
    0.012584056   2    1000023    1000025
    0.012321223   2   -2000005    1000005
    0.012321223   2   -1000005    2000005
    0.0058920008   2    1000025    1000025
    0.0049152255   2    1000023    1000035
    0.004168694   2    1000023    1000023
    0.0029918266   2   -2000015    1000015
    0.0029918266   2   -1000015    2000015
    0.0024661795   2   -6    6
    0.0021523232   2   -1000006    1000006
    0.0015886107   2   -1000015    1000015
    0.0015808598   2   -2000015    2000015
    0.00022260594   2   -13    13
    0.00012184582   2   -3    3
    5.0570978e-05   2   -1000005    1000005
    3.5664482e-05   2   -2000005    2000005
    7.7802867e-06   2    25    25
    5.3859498e-06   2    21    21
    4.9650099e-07   2    23    23
    3.3688046e-07   2   -1    1
    1.1263808e-07   2   -24    24
    1.0629259e-07   2   -1000011    1000011
    1.0587203e-07   2   -1000013    1000013
    7.5316044e-08   2    22    23
    4.1557057e-08   2   -2000011    2000011
    4.1410604e-08   2   -2000013    2000013
    2.681811e-08   2   -4    4
    9.5686911e-09   2    22    22
    4.9991892e-09   2   -11    11
    2.8584906e-09   2   -2000013    1000013
    2.8584906e-09   2   -1000013    2000013
    1.3822953e-13   2   -2    2
    6.6860555e-14   2   -2000011    1000011
    6.6860555e-14   2   -1000011    2000011

DECAY 36  90.143929
    0.35035194   2   -5    5
    0.097085103   2   -1000024    1000037
    0.097085103   2   -1000037    1000024
    0.074129506   2   -1000024    1000024
    0.058470907   2   -15    15
    0.046051074   2   -1000037    1000037
    0.035310794   2    1000022    1000022
    0.035073661   2    1000022    1000025
    0.029887259   2    1000035    1000035
    0.027963603   2    1000025    1000035
    0.022972249   2    1000022    1000035
    0.022328079   2    1000022    1000023
    0.018739452   2   -2000006    1000006
    0.018739452   2   -1000006    2000006
    0.012668781   2   -2000005    1000005
    0.012668781   2   -1000005    2000005
    0.012006032   2    1000023    1000025
    0.0063639248   2    1000023    1000035
    0.005757112   2    1000025    1000025
    0.0046877442   2   -2000015    1000015
    0.0046877442   2   -1000015    2000015
    0.0040474697   2    1000023    1000023
    0.0025838076   2   -6    6
    0.00021452262   2   -13    13
    0.00011741597   2   -3    3
    6.9414758e-06   2    21    21
    1.0073998e-06   2    23    25
    3.2463439e-07   2   -1    1
    1.1030245e-07   2    22    23
    6.1844846e-08   2    22    22
    2.7743495e-08   2   -4    4
    4.8177013e-09   2   -11    11
    2.9118006e-09   2   -2000013    1000013
    2.9118006e-09   2   -1000013    2000013
    1.4300655e-13   2   -2    2
    6.8107316e-14   2   -2000011    1000011
    6.8107316e-14   2   -1000011    2000011
    3.118199e-14   2    23    35
    2.0901948e-37   2    25    25

DECAY 37  88.468008
    0.35468534   2   -5    6
    0.1685536   2    1000022    1000037
    0.15133544   2    1000024    1000035
    0.091711574   2    1000024    1000025
    0.059694635   2   -15    16
    0.051621009   2    1000025    1000037
    0.048704682   2    1000023    1000024
    0.026572245   2   -2000005    1000006
    0.022540609   2   -1000005    2000006
    0.013120993   2    1000023    1000037
    0.008664902   2   -2000015    1000016
    0.00089467001   2   -1000015    1000016
    0.00052267254   2   -5    4
    0.00039668143   2   -2000005    2000006
    0.00032486484   2    1000035    1000037
    0.00029906665   2   -1000005    1000006
    0.00021104179   2   -13    14
    0.00011655019   2   -3    4
    1.4313196e-05   2    1000022    1000024
    5.4714625e-06   2   -3    2
    3.7324207e-06   2   -5    2
    3.5048195e-06   2   -3    6
    1.0268345e-06   2    24    25
    4.3557183e-07   2   -1000011    1000012
    4.3495626e-07   2   -1000013    1000014
    3.2338076e-07   2   -1    2
    1.5279488e-07   2   -1    6
    1.6533692e-08   2   -1    4
    6.012129e-09   2   -2000013    1000014
    4.9362895e-09   2   -11    12
    1.4062547e-13   2   -2000011    1000012
    2.9848518e-14   2    24    35

DECAY 6  2.43
    1   2    5    24

DECAY 15 -1
