BLOCK SPINFO
   1   SPheno
   2   v4.0.5be

BLOCK SPHENOINFO
   1   2
   2   2

BLOCK MODSEL
   1   0

BLOCK MINPAR
   3    24.606509
   4   -1

BLOCK EXTPAR
   0    1415.2805
   1    501.63202
   2    768.41946
   3    3000
   11    4540.9532
   12    1138.2571
   13    1065.4462
   23   -1333.9558
   25    23.959761
   26    1025.6641
   31    1031.4015
   32    1031.4015
   33    890.55075
   34    1005.453
   35    1005.453
   36    1105.6608
   41    5000
   42    5000
   43    1149.6401
   44    5000
   45    5000
   46    1990.6011
   47    5000
   48    5000
   49    1463.8736

BLOCK SMINPUTS
   1    127.90897
   2    1.1663787e-05
   3    0.1184
   4    91.1876
   5    4.18
   6    173.2
   7    1.777
   8    0
   11    0.00051099893
   12    0
   13    0.10565837
   14    0
   21    0.005
   22    0.0025
   23    0.095
   24    1.27

BLOCK GAUGE Q=  1415.2805
   1    0.35536298
   2    0.66519887
   3    1.219778

BLOCK YU Q=  1415.2805
   1   1    8.3916715e-06
   2   2    0.0042629691
   3   3    1.0137813

BLOCK YD Q=  1415.2805
   1   1    0.00040402776
   2   2    0.0076765274
   3   3    0.40066893

BLOCK YE Q=  1415.2805
   1   1    7.0505798e-05
   2   2    0.014578363
   3   3    0.24518408

BLOCK AU Q=  1415.2805
   1   1    0
   2   2    0
   3   3    4540.9533

BLOCK AD Q=  1415.2805
   1   1    0
   2   2    0
   3   3    1138.2572

BLOCK AE Q=  1415.2805
   1   1    0
   2   2    0
   3   3    1065.4462

BLOCK MSOFT Q=  1415.2805
   1    501.63202
   2    768.41946
   3    3000
   21   -717615.23
   22   -1742692.7
   31    1031.4015
   32    1031.4015
   33    890.55075
   34    1005.453
   35    1005.453
   36    1105.6608
   41    5000
   42    5000
   43    1149.6401
   44    5000
   45    5000
   46    1990.6011
   47    5000
   48    5000
   49    1463.8736

BLOCK MASS
   6    173.2
   23    91.1876
   24    80.429995
   15    1.777
   25    123.16545
   35    1025.3891
   36    1025.6641
   37    1030.0889
   1000001    5027.5802
   2000001    5017.5064
   1000002    5027.1656
   2000002    5018.8854
   1000003    5027.5838
   2000003    5017.5067
   1000004    5027.1672
   2000004    5018.8862
   1000005    1109.8409
   2000005    1470.738
   1000006    1035.0327
   2000006    1935.2227
   1000011    1039.061
   2000011    1008.3851
   1000012    1035.8108
   1000013    1039.1448
   2000013    1008.2895
   1000014    1035.8075
   1000015    894.2069
   2000015    1109.3427
   1000016    895.0065
   1000021    3188.5356
   1000022    500.72557
   1000023    799.79219
   1000025   -1328.6878
   1000035    1334.9703
   1000024    799.96279
   1000037    1335.0347

BLOCK ALPHA
      -0.042270622

BLOCK HMIX Q=  1415.2805
   1   -1333.9558
   2    23.959761
   3    244.04032
   4    1051986.9

BLOCK STOPMIX
   1   1   -0.96435527
   1   2    0.26461086
   2   1   -0.26461086
   2   2   -0.96435527

BLOCK SBOTMIX
   1   1   -0.99156969
   1   2    0.12957452
   2   1   -0.12957452
   2   2   -0.99156969

BLOCK STAUMIX
   1   1   -0.99070473
   1   2    0.13602989
   2   1   -0.13602989
   2   2   -0.99070473

BLOCK NMIX
   1   1   -0.99920179
   1   2    0.0024561921
   1   3    0.037827156
   1   4    0.012603689
   2   1   -0.0063992361
   2   2   -0.99488081
   2   3   -0.088050736
   2   4   -0.049176145
   3   1    0.01775356
   3   2   -0.027678127
   3   3    0.70635418
   3   4   -0.70709441
   4   1   -0.035208529
   4   2    0.097159992
   4   3   -0.70134154
   4   4   -0.70529451

BLOCK UMIX
   1   1   -0.99212467
   1   2   -0.12525431
   2   1    0.12525431
   2   2   -0.99212467

BLOCK VMIX
   1   1   -0.99753154
   1   2    0.07021992
   2   1    0.07021992
   2   2    0.99753154

BLOCK HIGGSBOUNDSINPUTHIGGSCOUPLINGSFERMIONS
       0, 574.07014,3,36,15,15

BLOCK HIGGSBOUNDSINPUTHIGGSCOUPLINGSBOSONS
       0,4,36,21,21,23

BLOCK SPHENOLOWENERGY
   1    0.00032855165
   2    1.5884025e-06
   3    3.5234274e-05
   4    2.9428752e-15
   5    1.2571306e-10
   6    2.6127477e-08
   7    1.0063711e-13
   8    4.2991029e-09
   9    9.0527569e-07
   10    9.4599558e-05
   11    0.97717722
   12    0.54198186
   13    19.358504
   14    0
   15    0
   16    0.0021574625
   17    2.2816632e-15
   18    2.4799583e-11
   19    8.2897934e-11
   20   -6.4692825e-15
   21   -2.7658172e-10
   22   -8.7444688e-08
   23    0
   24    0
   25    0
   26    0
   27    0
   28    0
   29    0
   30    0
   31    0
   39    7.1974472e-05
   40    0
   41    0
   42    0

BLOCK FWCOEF Q=  160
   305   4422   0   0   -0.18881911
   305   4422   0   2   -0.19394258
   305   4322   0   2   -0.00049077336
   305   6421   0   0   -0.095227835
   305   6421   0   2   -0.11676918
   305   6321   0   2   -0.00066738961
   3051111   4133   0   0    1.5898511
   3051111   4133   0   2    1.5903016
   3051111   4233   0   2    4.1417273e-05
   3051111   4137   0   0   -4.4125432
   3051111   4137   0   2   -4.4090177
   3051111   4237   0   2   -0.0003224308
   3051313   4133   0   0    1.5898511
   3051313   4133   0   2    1.5903003
   3051313   4233   0   2    4.1415355e-05
   3051313   4137   0   0   -4.4125432
   3051313   4137   0   2   -4.4090189
   3051313   4237   0   2   -0.00032242938
   3051212   4137   0   0    1.5053501
   3051212   4137   0   2    1.5046001
   3051212   4237   0   2    7.0297626e-05
   3051414   4137   0   0    1.5053501
   3051414   4137   0   2    1.5046001
   3051414   4237   0   2    7.0298017e-05
   3051616   4137   0   0    1.5053501
   3051616   4137   0   2    1.5046
   3051616   4237   0   2    7.0408103e-05

BLOCK IMFWCOEF Q=  160
   305   4422   0   0    3.8590055e-07
   305   4422   0   2   -2.1108116e-05
   305   4322   0   2    2.5501004e-06
   305   6421   0   0    3.3054934e-07
   305   6421   0   2    5.1650257e-06
   305   6321   0   2    1.4389536e-06
   3051111   4133   0   2   -2.0634431e-06
   3051111   4233   0   2    2.0401125e-06
   3051111   4137   0   2    1.6083781e-05
   3051111   4237   0   2   -1.5931302e-05
   3051313   4133   0   2   -2.0634344e-06
   3051313   4233   0   2    2.0401103e-06
   3051313   4137   0   2    1.6083794e-05
   3051313   4237   0   2   -1.5931308e-05
   3051212   4137   0   2   -3.1568775e-06
   3051212   4237   0   2    3.4735979e-06
   3051414   4137   0   2   -3.1568775e-06
   3051414   4237   0   2    3.4735979e-06
   3051616   4137   0   2   -3.1582494e-06
   3051616   4237   0   2    3.4735972e-06

DECAY 23  2.4952


DECAY 24  2.085


DECAY 2000011  2.8715953
    0.99999006   2    1000022    11

DECAY 1000011  3.011442
    0.49590141   2   -1000024    12
    0.25274019   2    1000022    11
    0.25135841   2    1000023    11

DECAY 2000013  2.8709848
    0.99998529   2    1000022    13

DECAY 1000013  3.0128261
    0.49594636   2   -1000024    14
    0.25267019   2    1000022    13
    0.25138344   2    1000023    13

DECAY 1000015  1.0215876
    0.54617629   2    1000022    15
    0.30062068   2   -1000024    16
    0.15320303   2    1000023    15

DECAY 2000015  4.6227308
    0.75125003   2    1000022    15
    0.12566883   2    1000016   -24
    0.059101849   2    1000015    25
    0.058073521   2    1000015    23
    0.0038743797   2   -1000024    16
    0.0020313848   2    1000023    15

DECAY 1000012  2.9782011
    0.49612798   2    1000024    11
    0.25850844   2    1000022    12
    0.24536358   2    1000023    12

DECAY 1000014  2.9781622
    0.49612849   2    1000024    13
    0.25851002   2    1000022    14
    0.24536149   2    1000023    14

DECAY 1000016  1.0100305
    0.5293477   2    1000022    16
    0.3150618   2    1000024    15
    0.1555905   2    1000023    16

DECAY 2000001  143.50471
    0.98087006   2    1000021    1
    0.019102772   2    1000022    1

DECAY 1000001  205.48317
    0.69012023   2    1000021    1
    0.20140706   2   -1000024    2
    0.10103422   2    1000023    1
    0.0034351086   2    1000022    1
    0.0029193636   2   -1000037    2
    0.00099536964   2    1000035    1

DECAY 2000003  143.51489
    0.98080072   2    1000021    3
    0.019101476   2    1000022    3

DECAY 1000003  205.49026
    0.69009827   2    1000021    3
    0.20140027   2   -1000024    4
    0.10103103   2    1000023    3
    0.003435033   2    1000022    3
    0.0029269172   2   -1000037    4
    0.0010074861   2    1000035    3
    0.00010099351   2    1000025    3

DECAY 1000005  2.8290992
    0.55862066   2   -1000024    6
    0.39787216   2    1000023    5
    0.043507178   2    1000022    5

DECAY 2000005  6.9999816
    0.58846792   2    1000006   -24
    0.18417527   2    1000005    23
    0.11350378   2    1000005    25
    0.087944139   2    1000022    5
    0.011399468   2    1000025    5
    0.010655834   2    1000035    5
    0.0024280435   2   -1000024    6
    0.0014255517   2    1000023    5

DECAY 2000002  151.88696
    0.92768324   2    1000021    2
    0.072214793   2    1000022    2

DECAY 1000002  205.4793
    0.68992314   2    1000021    2
    0.20359359   2    1000024    1
    0.10149085   2    1000023    2
    0.003250346   2    1000022    2
    0.00091752281   2    1000037    1
    0.00076855621   2    1000035    2

DECAY 2000004  151.89011
    0.92766409   2    1000021    4
    0.072213294   2    1000022    4

DECAY 1000004  205.48609
    0.68990088   2    1000021    4
    0.20358738   2    1000024    3
    0.10148753   2    1000023    4
    0.0032502408   2    1000022    4
    0.00094180746   2    1000037    3
    0.00077234951   2    1000035    4

DECAY 1000006  1.7544669
    0.74007732   2    1000024    5
    0.1971692   2    1000023    6
    0.061860381   2    1000022    6
    0.00053881911   2    1000023    4
    0.00029378943   3    1000022    24    5

DECAY 2000006  241.74574
    0.41798511   2    1000005    24
    0.24032288   2    1000006    25
    0.23764313   2    1000006    23
    0.041090476   2    1000037    5
    0.019131314   2    1000025    6
    0.017869308   2    1000035    6
    0.01453869   2    1000022    6
    0.006551448   2    1000024    5
    0.0031421641   2    1000023    6
    0.0017254717   2    2000005    24

DECAY 1000024  0.0031809209
    0.96887641   2    1000022    24
    0.01780006   3    1000022   -15    16
    0.005349885   3    1000022   -11    12
    0.005348703   3    1000022   -13    14
    0.0026225777   3    1000022   -5    6

DECAY 1000037  11.685904
    0.20924063   2   -1000005    6
    0.1886395   2    1000024    25
    0.18422167   2    1000023    24
    0.17912046   2    1000024    23
    0.13479517   2    1000006   -5
    0.066717655   2    1000022    24
    0.021172117   2    1000016   -15
    0.0069319115   2   -2000015    16
    0.0023107464   3    1000023   -5    6
    0.0014441014   3    1000022   -5    6
    0.0012261715   2   -1000011    12
    0.0012255636   2   -1000013    14
    0.0011879905   3    1000024    6   -6
    0.00084494826   2   -1000015    16
    0.00043057775   2    1000014   -13
    0.00039281125   2    1000012   -11

DECAY 1000022 -1


DECAY 1000023  0.0035766614
    0.88393294   2    1000022    25
    0.090130601   2    1000022    23
    0.012578648   3    1000022    12   -12
    0.0079771804   3    1000022    15   -15
    0.0023412307   3    1000022    11   -11
    0.0023401095   3    1000022    13   -13
    0.0006783148   3    1000022    5   -5

DECAY 1000025  14.856697
    0.16685921   2    1000023    25
    0.14768624   2    1000024   -24
    0.14768624   2   -1000024    24
    0.13628423   2    1000023    23
    0.12167821   2    1000006   -6
    0.12167821   2   -1000006    6
    0.049120948   2    1000022    25
    0.0436835   2    1000022    23
    0.019207791   2    1000005   -5
    0.019207791   2   -1000005    5
    0.0077813402   2    1000015   -15
    0.0077813402   2   -1000015    15
    0.0025294391   2    2000015   -15
    0.0025294391   2   -2000015    15
    0.0024292342   3    1000024    5   -6
    0.0024292342   3   -1000024   -5    6
    0.00048991093   3    1000022    6   -6
    0.00033112638   3    1000023    6   -6

DECAY 1000035  11.761942
    0.17653153   2    1000024   -24
    0.17653153   2   -1000024    24
    0.17481171   2    1000023    25
    0.15255651   2    1000006   -6
    0.15255651   2   -1000006    6
    0.051875637   2    1000022    25
    0.025029145   2    1000005   -5
    0.025029145   2   -1000005    5
    0.013812975   2    1000023    23
    0.013777834   2    1000022    23
    0.0097464026   2    1000015   -15
    0.0097464026   2   -1000015    15
    0.00351959   2    2000015   -15
    0.00351959   2   -2000015    15
    0.0022636135   3    1000024    5   -6
    0.0022636135   3   -1000024   -5    6
    0.0010181191   2    1000016   -16
    0.0010181191   2   -1000016    16
    0.0005320602   2    1000014   -14
    0.0005320602   2   -1000014    14
    0.00053205013   2    1000012   -12
    0.00053205013   2   -1000012    12
    0.00049540902   3    1000022    6   -6
    0.00035779404   3    1000023    6   -6
    0.00025652797   2    1000013   -13
    0.00025652797   2   -1000013    13
    0.00023826369   2    1000011   -11
    0.00023826369   2   -1000011    11

DECAY 1000021  246.34218
    0.16266179   2    1000006   -6
    0.16266179   2   -1000006    6
    0.14807169   2    1000005   -5
    0.14807169   2   -1000005    5
    0.1186198   2    2000005   -5
    0.1186198   2   -2000005    5
    0.069363019   2    2000006   -6
    0.069363019   2   -2000006    6
    0.00062799637   3    1000037    5   -6
    0.00062799637   3   -1000037   -5    6
    0.00034865934   3    1000035    6   -6
    0.00032438918   3    1000025    6   -6
    0.00019756331   2    1000006   -4
    0.00019756331   2   -1000006    4

DECAY 25  0.0039561483
    0.62989073   2   -5    5
    0.18408125   2   -24    24
    0.068771978   2   -15    15
    0.064444547   2    21    21
    0.027433558   2   -4    4
    0.021477768   2    23    23
    0.0021872603   2    22    22
    0.001246884   2    22    23
    0.00023857447   2   -13    13
    0.00022667864   2   -3    3
    6.2673733e-07   2   -1    1
    1.4137713e-07   2   -2    2
    5.363442e-09   2   -11    11

DECAY 35  20.887824
    0.93648549   2   -5    5
    0.056002681   2   -15    15
    0.0067854659   2   -6    6
    0.00024335709   2    25    25
    0.00019539226   2   -13    13
    0.00015707498   2   -3    3
    5.9384537e-05   2    21    21
    3.9094635e-05   2   -24    24
    2.9958762e-05   2    23    23
    1.5535092e-06   2    1000022    1000022
    4.3420233e-07   2   -1    1
    8.0905857e-08   2   -4    4
    1.9446542e-08   2    22    22
    6.8857147e-09   2    22    23
    4.3898494e-09   2   -11    11
    4.1716196e-13   2   -2    2

DECAY 36  20.262463
    0.93657651   2   -5    5
    0.056012848   2   -15    15
    0.0068824049   2   -6    6
    0.0001954247   2   -13    13
    0.00015708748   2   -3    3
    9.6163467e-05   2    21    21
    4.4606113e-05   2    23    25
    3.4208483e-05   2    1000022    1000022
    4.3423679e-07   2   -1    1
    1.2314041e-07   2    22    23
    1.1787046e-07   2    22    22
    7.2049403e-08   2   -4    4
    4.3905763e-09   2   -11    11
    3.7161398e-13   2   -2    2
    1.3163068e-36   2    25    25

DECAY 37  19.2571
    0.93334585   2   -5    6
    0.064770427   2   -15    16
    0.0014313335   2   -5    4
    0.00022898778   2   -13    14
    0.00015208377   2   -3    4
    4.7836455e-05   2    24    25
    1.0221226e-05   2   -5    2
    7.0259853e-06   2   -3    2
    5.5372078e-06   2   -3    6
    4.216558e-07   2   -1    2
    2.4428139e-07   2   -1    6
    2.1777883e-08   2   -1    4
    5.3560481e-09   2   -11    12
    1.6138545e-10   2    24    35
    1.1940167e-10   2    24    36

DECAY 6  2.43
    1   2    5    24

DECAY 15 -1
