BLOCK SPINFO
   1   SPheno
   2   v4.0.5be

BLOCK SPHENOINFO
   1   2
   2   2

BLOCK MODSEL
   1   0

BLOCK MINPAR
   3    52.727728
   4    1

BLOCK EXTPAR
   0    3409.3516
   1    925.5696
   2    2688.1069
   3    2701.3724
   11   -7518.6218
   12   -6592.2309
   13    1043.9448
   23    593.74738
   25    52.276335
   26    4188.7997
   31    2382.535
   32    2382.535
   33    3983.0237
   34    635.03282
   35    635.03282
   36    2676.1776
   41    2728.4161
   42    2728.4161
   43    3283.4811
   44    4724.5834
   45    4724.5834
   46    3647.909
   47    1418.6358
   48    1418.6358
   49    2569.2035

BLOCK SMINPUTS
   1    127.90897
   2    1.1663787e-05
   3    0.1184
   4    91.1876
   5    4.18
   6    173.2
   7    1.777
   8    0
   11    0.00051099893
   12    0
   13    0.10565837
   14    0
   21    0.005
   22    0.0025
   23    0.095
   24    1.27

BLOCK GAUGE Q=  3409.3516
   1    0.35536298
   2    0.66519887
   3    1.219778

BLOCK YU Q=  3409.3516
   1   1    8.385906e-06
   2   2    0.0042600403
   3   3    1.0130848

BLOCK YD Q=  3409.3516
   1   1    0.00088091777
   2   2    0.016737438
   3   3    0.87359439

BLOCK YE Q=  3409.3516
   1   1    0.00015372659
   2   2    0.031785784
   3   3    0.53458459

BLOCK AU Q=  3409.3516
   1   1    0
   2   2    0
   3   3   -7518.6221

BLOCK AD Q=  3409.3516
   1   1    0
   2   2    0
   3   3   -6592.2275

BLOCK AE Q=  3409.3516
   1   1    0
   2   2    0
   3   3    1043.9448

BLOCK MSOFT Q=  3409.3516
   1    925.5696
   2    2688.1069
   3    2701.3724
   21    17896415
   22   -175834.67
   31    2382.535
   32    2382.535
   33    3983.0237
   34    635.03282
   35    635.03282
   36    2676.1776
   41    2728.4161
   42    2728.4161
   43    3283.4811
   44    4724.5834
   45    4724.5834
   46    3647.909
   47    1418.6358
   48    1418.6358
   49    2569.2035

BLOCK MASS
   6    173.2
   23    91.1876
   24    80.429995
   15    1.777
   25    126.85414
   35    4185.2771
   36    4188.7997
   37    4186.2567
   1000001    2877.7435
   2000001    1602.5124
   1000002    2876.6797
   2000002    4793.9261
   1000003    2877.7375
   2000003    1602.4949
   1000004    2876.6737
   2000004    4793.9255
   1000005    2659.4719
   2000005    3302.5273
   1000006    3229.7095
   2000006    3598.9856
   1000011    2409.5788
   2000011    665.65254
   1000012    2407.8712
   1000013    2409.5396
   2000013    665.43595
   1000014    2407.8308
   1000015    2656.9147
   2000015    3986.7073
   1000016    3985.4245
   1000021    2928.9953
   1000022    597.17551
   1000023   -603.53706
   1000025    915.50442
   1000035    2714.8822
   1000024    601.26152
   1000037    2715.0953

BLOCK ALPHA
      -0.018992113

BLOCK HMIX Q=  3409.3516
   1    593.74738
   2    52.276335
   3    243.06522
   4    17546043

BLOCK STOPMIX
   1   1    0.90767388
   1   2    0.41967623
   2   1   -0.41967623
   2   2    0.90767388

BLOCK SBOTMIX
   1   1    0.020432817
   1   2    0.99979123
   2   1   -0.99979123
   2   2    0.020432817

BLOCK STAUMIX
   1   1    0.0060860069
   1   2    0.99998148
   2   1   -0.99998148
   2   2    0.0060860069

BLOCK NMIX
   1   1   -0.10037711
   1   2    0.026595563
   1   3   -0.7059854
   1   4    0.70057243
   2   1    0.02017389
   2   2   -0.016550409
   2   3   -0.70589768
   2   4   -0.70783301
   3   1    0.99474464
   3   2    0.0037683655
   3   3   -0.056917747
   3   4    0.085025148
   4   1    0.00074546051
   4   2   -0.99950216
   4   3   -0.0073113106
   4   4    0.030682726

BLOCK UMIX
   1   1   -0.01033865
   1   2    0.99994655
   2   1    0.99994655
   2   2    0.01033865

BLOCK VMIX
   1   1   -0.043394178
   1   2    0.99905803
   2   1    0.99905803
   2   2    0.043394178

BLOCK HIGGSBOUNDSINPUTHIGGSCOUPLINGSFERMIONS
       0, 2732.8152,3,36,15,15

BLOCK HIGGSBOUNDSINPUTHIGGSCOUPLINGSBOSONS
       0,4,36,21,21,23

BLOCK SPHENOLOWENERGY
   1    0.00029445899
   2    1.5963946e-06
   3    3.5283749e-05
   4    3.0653232e-15
   5    1.3094347e-10
   6    2.719982e-08
   7    1.0086748e-13
   8    4.308944e-09
   9    9.0740798e-07
   10    9.6132857e-05
   11    0.99301561
   12    0.54178312
   13    19.34804
   14    0
   15    0
   16    0.0021567594
   17    2.2816536e-15
   18    2.4822075e-11
   19    8.2956836e-11
   20    2.6164456e-15
   21    1.118791e-10
   22    1.69211e-08
   23    0
   24    0
   25    0
   26    0
   27    0
   28    0
   29    0
   30    0
   31    0
   39    7.1455875e-05
   40    0
   41    0
   42    0

BLOCK FWCOEF Q=  160
   305   4422   0   0   -0.18881911
   305   4422   0   2   -0.1555479
   305   4322   0   2    0.00073771945
   305   6421   0   0   -0.095227835
   305   6421   0   2   -0.085128944
   305   6321   0   2    0.00026005981
   3051111   4133   0   0    1.6220169
   3051111   4133   0   2    1.6226724
   3051111   4233   0   2    0.0010621478
   3051111   4137   0   0   -4.444709
   3051111   4137   0   2   -4.4464037
   3051111   4237   0   2   -0.0079165257
   3051313   4133   0   0    1.6220169
   3051313   4133   0   2    1.6226705
   3051313   4233   0   2    0.0010621446
   3051313   4137   0   0   -4.444709
   3051313   4137   0   2   -4.4464056
   3051313   4237   0   2   -0.0079165325
   3051212   4137   0   0    1.5053501
   3051212   4137   0   2    1.5057206
   3051212   4237   0   2    0.0017136517
   3051414   4137   0   0    1.5053501
   3051414   4137   0   2    1.5057206
   3051414   4237   0   2    0.0017136517
   3051616   4137   0   0    1.5053501
   3051616   4137   0   2    1.5057213
   3051616   4237   0   2    0.0017136675

BLOCK IMFWCOEF Q=  160
   305   4422   0   0    3.8586658e-07
   305   4422   0   2    6.7743141e-05
   305   4322   0   2    1.4478661e-05
   305   6421   0   0    3.3052024e-07
   305   6421   0   2   -7.0742172e-05
   305   6321   0   2    6.4005403e-06
   3051111   4133   0   2    9.6257036e-07
   3051111   4233   0   2    1.968846e-05
   3051111   4137   0   2   -3.0978975e-06
   3051111   4237   0   2   -0.00014674505
   3051313   4133   0   2    9.6251793e-07
   3051313   4233   0   2    1.9688409e-05
   3051313   4137   0   2   -3.0979281e-06
   3051313   4237   0   2   -0.00014674517
   3051212   4137   0   2    7.3495485e-07
   3051212   4237   0   2    3.1765183e-05
   3051414   4137   0   2    7.349528e-07
   3051414   4237   0   2    3.1765183e-05
   3051616   4137   0   2    7.4675953e-07
   3051616   4237   0   2    3.1765181e-05

DECAY 23  2.4952


DECAY 24  2.085


DECAY 2000011  0.0013266533
    0.96750676   2    1000022    11
    0.032485242   2    1000023    11

DECAY 1000011  2.2331131
    0.99591136   2    1000025    11
    0.0030565598   2    1000022    11
    0.0008927943   2   -1000024    12
    0.00013927319   2    1000023    11

DECAY 2000013  0.0022306816
    0.68460065   2    1000022    13
    0.20205192   2   -1000024    14
    0.11334743   2    1000023    13

DECAY 1000013  2.2769832
    0.97674661   2    1000025    13
    0.012336645   2    1000022    13
    0.0094469547   2    1000023    13
    0.00087557499   2   -1000024    14
    0.00059421419   2    2000013    25

DECAY 1000015  37.581105
    0.36183867   2   -1000024    16
    0.27391482   2    1000025    15
    0.18403766   2    1000022    15
    0.18020885   2    1000023    15

DECAY 2000015  41.559589
    0.25975008   2    1000022    15
    0.25957058   2    1000023    15
    0.24276874   2   -1000037    16
    0.12122331   2    1000035    15
    0.11026398   2    1000025    15
    0.0032752527   2    1000015    23
    0.0031241269   2    1000015    25

DECAY 1000012  2.2613327
    0.95484353   2    1000025    12
    0.026563653   2    1000022    12
    0.015518707   2    1000024    11
    0.0030741064   2    1000023    12

DECAY 1000014  2.3038123
    0.93721096   2    1000025    14
    0.033698382   2    1000024    13
    0.026073298   2    1000022    14
    0.0030173593   2    1000023    14

DECAY 1000016  41.569225
    0.52201068   2    1000024    15
    0.24193911   2    1000037    15
    0.12119608   2    1000035    16
    0.10541482   2    1000025    16
    0.0065434392   2    1000015    24
    0.0025950007   2    1000022    16
    0.00030085786   2    1000023    16

DECAY 2000001  0.40870768
    0.98289937   2    1000025    1
    0.016377624   2    1000022    1
    0.00067832353   2    1000023    1

DECAY 1000001  0.79644018
    0.38615782   2    1000025    1
    0.3837427   2   -1000037    2
    0.19223993   2    1000035    1
    0.028826242   2    1000022    1
    0.0059229933   2    1000023    1
    0.0031095001   2   -1000024    2

DECAY 2000003  0.42184247
    0.95229822   2    1000025    3
    0.023667951   2    1000022    3
    0.015628536   2   -1000024    4
    0.0084052967   2    1000023    3

DECAY 1000003  0.81220355
    0.37871409   2    1000025    3
    0.37625571   2   -1000037    4
    0.18849581   2    1000035    3
    0.037253304   2    1000022    3
    0.014776667   2    1000023    3
    0.004216093   2   -1000024    4
    0.00028831432   2    2000003    25

DECAY 1000005  73.485894
    0.48952452   2   -1000024    6
    0.24772316   2    1000022    5
    0.24610972   2    1000023    5
    0.016642595   2    1000025    5

DECAY 2000005  126.84183
    0.49317527   2   -1000024    6
    0.18424634   2    1000023    5
    0.18410104   2    1000022    5
    0.09355721   2    1000021    5
    0.023708995   2   -1000037    6
    0.012043083   2    1000035    5
    0.0042563443   2    1000025    5
    0.0032136879   2    1000005    25
    0.0016980333   2    1000005    23

DECAY 1000002  0.83363967
    0.40148398   2    1000025    2
    0.36145976   2    1000037    1
    0.18130606   2    1000035    2
    0.052361704   2    1000024    1
    0.0023307236   2    1000023    2
    0.0010577751   2    1000022    2

DECAY 2000002  158.56287
    0.93728925   2    1000021    2
    0.062024793   2    1000025    2
    0.00065932151   2    1000022    2

DECAY 1000004  0.8491664
    0.39414753   2    1000025    4
    0.35482576   2    1000037    3
    0.17797226   2    1000035    4
    0.068619024   2    1000024    3
    0.0028476479   2    1000023    4
    0.001587774   2    1000022    4

DECAY 2000004  158.56608
    0.93726941   2    1000021    4
    0.062023604   2    1000025    4
    0.00066449152   2    1000022    4

DECAY 1000006  129.00453
    0.38602014   2    1000024    5
    0.23832646   2    1000022    6
    0.23647454   2    1000023    6
    0.071313298   2    1000021    6
    0.036907044   3    1000022    24    5
    0.01465538   2    1000037    5
    0.0071649497   2    1000025    6
    0.0071564217   2    1000035    6
    0.0019783737   2    1000005    24

DECAY 2000006  214.7313
    0.30139173   2    1000024    5
    0.16096842   2    1000023    6
    0.15372991   2    1000022    6
    0.11889028   2    1000021    6
    0.09137091   2    2000005    24
    0.071937329   2    1000006    23
    0.057253525   2    1000006    25
    0.034018204   2    1000025    6
    0.006293161   2    1000037    5
    0.003141855   2    1000035    6
    0.0010046817   2    1000005    24

DECAY 1000024  1.280939e-09
    0.41193987   3    1000022   -1    2
    0.25879215   3    1000022   -3    4
    0.13731372   3    1000022   -11    12
    0.13688101   3    1000022   -13    14
    0.055073249   3    1000022   -15    16

DECAY 1000037  26.717954
    0.22510411   2    1000024    25
    0.21825049   2    1000023    24
    0.2175113   2    1000024    23
    0.21296723   2    1000022    24
    0.020355749   2    1000014   -13
    0.02035072   2    1000012   -11
    0.020179252   2   -1000013    14
    0.020174378   2   -1000011    12
    0.017108562   3    1000024    6   -6
    0.011324252   3    1000022   -5    6
    0.01120094   3    1000023   -5    6
    0.0044552982   2    1000025    24
    0.0006789489   3    1000024    5   -5
    0.00021280655   3    1000025   -5    6

DECAY 1000022 -1


DECAY 1000023  8.4553385e-08
    0.6724135   2    1000022    22
    0.085196395   3    1000022    12   -12
    0.063707998   3    1000022    1   -1
    0.063543019   3    1000022    3   -3
    0.049686581   3    1000022    2   -2
    0.028818561   3    1000022    4   -4
    0.014372541   3    1000022    11   -11
    0.014319481   3    1000022    13   -13
    0.0041343639   3    1000022    15   -15
    0.001015194   3    1000024    1   -2
    0.001015194   3   -1000024   -1    2
    0.00033840857   3    1000024    11   -12
    0.00033840857   3   -1000024   -11    12
    0.00033486211   3    1000024    13   -14
    0.00033486211   3   -1000024   -13    14
    0.00020698593   3    1000024    3   -4
    0.00020698593   3   -1000024   -3    4

DECAY 1000025  4.2653867
    0.12408972   2    1000023    23
    0.11871647   2    2000013   -13
    0.11871647   2   -2000013    13
    0.11854225   2    2000011   -11
    0.11854225   2   -2000011    11
    0.10802619   2    1000024   -24
    0.10802619   2   -1000024    24
    0.091924235   2    1000022    25
    0.088069827   2    1000023    25
    0.0048366958   2    1000022    23
    0.0002519009   3    1000024    5   -6
    0.0002519009   3   -1000024   -5    6

DECAY 1000035  29.006772
    0.20066543   2    1000024   -24
    0.20066543   2   -1000024    24
    0.14701497   2    1000022    25
    0.14588519   2    1000023    23
    0.14008414   2    1000023    25
    0.054045612   2    1000022    23
    0.0096116876   3    1000024    5   -6
    0.0096116876   3   -1000024   -5    6
    0.0093789995   2    1000014   -14
    0.0093789995   2   -1000014    14
    0.009376679   2    1000012   -12
    0.009376679   2   -1000012    12
    0.0092663065   2    1000013   -13
    0.0092663065   2   -1000013    13
    0.0092640684   2    1000011   -11
    0.0092640684   2   -1000011    11
    0.0064564042   3    1000022    6   -6
    0.006328215   3    1000023    6   -6
    0.0034043366   2    1000025    25
    0.00078778634   2    1000025    23
    0.00030697809   3    1000023    5   -5
    0.00030455484   3    1000022    5   -5
    0.00012475071   3    1000025    6   -6

DECAY 1000021  88.573197
    0.24027037   2    2000003   -3
    0.24027037   2   -2000003    3
    0.24026589   2    2000001   -1
    0.24026589   2   -2000001    1
    0.015074599   2    1000005   -5
    0.015074599   2   -1000005    5
    0.00098293058   3    1000024    5   -6
    0.00098293058   3   -1000024   -5    6
    0.00070468173   3    1000023    6   -6
    0.00069245591   3    1000022    6   -6
    0.00061343693   2    1000002   -2
    0.00061343693   2   -1000002    2
    0.00061339861   2    1000004   -4
    0.00061339861   2   -1000004    4
    0.00058909601   2    1000003   -3
    0.00058909601   2   -1000003    3
    0.00058896031   2    1000001   -1
    0.00058896031   2   -1000001    1
    0.00025391749   3    1000022    5   -5
    0.00025366846   3    1000023    5   -5

DECAY 25  0.004126441
    0.54212957   2   -5    5
    0.26029183   2   -24    24
    0.071120156   2    21    21
    0.062546652   2   -15    15
    0.032660022   2    23    23
    0.026829361   2   -4    4
    0.0023446523   2    22    22
    0.0016565053   2    22    23
    0.00021699314   2   -13    13
    0.00020355699   2   -3    3
    5.6281327e-07   2   -1    1
    1.3825228e-07   2   -2    2
    4.8782261e-09   2   -11    11

DECAY 35  166.30276
    0.73103392   2   -5    5
    0.14679543   2   -15    15
    0.031635624   2   -1000024    1000037
    0.031635624   2   -1000037    1000024
    0.021410496   2    1000023    1000035
    0.013882247   2    1000023    1000025
    0.010958616   2    1000022    1000025
    0.010232548   2    1000022    1000035
    0.00053869831   2   -13    13
    0.00050961752   2    1000022    1000022
    0.00043955589   2   -6    6
    0.00035774373   2   -1000024    1000024
    0.00022806222   2   -3    3
    0.00012697133   2    1000022    1000023
    0.00010173701   2    1000025    1000025
    7.1125115e-05   2    1000023    1000023
    3.3372958e-05   2    1000025    1000035
    7.5103811e-06   2    21    21
    6.3042033e-07   2   -1    1
    3.5210986e-07   2    25    25
    5.4760615e-08   2    23    23
    1.2097716e-08   2   -11    11
    1.1440073e-08   2    22    23
    1.0980001e-08   2   -24    24
    8.5749928e-09   2   -1000011    1000011
    8.4225358e-09   2   -1000013    1000013
    5.280487e-09   2   -4    4
    5.0854488e-09   2    22    22
    2.2054424e-09   2   -1000001    1000001
    2.1896609e-09   2   -1000003    1000003
    1.1294187e-09   2   -2000013    1000013
    1.1294187e-09   2   -1000013    2000013
    9.1312633e-11   2   -2000003    1000003
    9.1312633e-11   2   -1000003    2000003
    2.5287388e-13   2   -2000001    1000001
    2.5287388e-13   2   -1000001    2000001
    2.7211431e-14   2   -2    2
    2.6417257e-14   2   -2000011    1000011
    2.6417257e-14   2   -1000011    2000011

DECAY 36  153.11645
    0.72205483   2   -5    5
    0.14500308   2   -15    15
    0.034464152   2   -1000024    1000037
    0.034464152   2   -1000037    1000024
    0.02329616   2    1000022    1000035
    0.014690032   2    1000022    1000025
    0.012220557   2    1000023    1000025
    0.011089729   2    1000023    1000035
    0.0006488449   2    1000022    1000022
    0.00053212924   2   -13    13
    0.00043060005   2   -1000024    1000024
    0.00039368544   2   -6    6
    0.00022522802   2   -3    3
    0.00015483335   2    1000025    1000025
    0.00013548431   2    1000025    1000035
    0.00010803601   2    1000022    1000023
    7.7961817e-05   2    1000023    1000023
    9.6759536e-06   2    21    21
    6.2258582e-07   2   -1    1
    1.3221442e-07   2    23    25
    2.5216489e-08   2    22    22
    2.5019926e-08   2    22    23
    1.1949938e-08   2   -11    11
    4.6796172e-09   2   -4    4
    1.2240772e-09   2   -2000013    1000013
    1.2240772e-09   2   -1000013    2000013
    1.0372327e-10   2   -2000003    1000003
    1.0372327e-10   2   -1000003    2000003
    3.8921999e-12   2    23    35
    2.8724293e-13   2   -2000001    1000001
    2.8724293e-13   2   -1000001    2000001
    2.8631288e-14   2   -2000011    1000011
    2.8631288e-14   2   -1000011    2000011
    2.4114084e-14   2   -2    2
    1.2236902e-39   2    25    25

DECAY 37  178.66008
    0.75541134   2   -5    6
    0.13027821   2   -15    16
    0.02949887   2    1000022    1000037
    0.029477789   2    1000024    1000035
    0.029396445   2    1000023    1000037
    0.02387137   2    1000024    1000025
    0.0011204811   2   -5    4
    0.00046057983   2   -13    14
    0.00020055169   2   -3    4
    0.00014724124   2    1000025    1000037
    9.2293093e-05   2    1000022    1000024
    2.5911444e-05   2    1000023    1000024
    9.4279634e-06   2   -3    2
    8.0013901e-06   2   -5    2
    7.5746105e-07   2   -3    6
    5.5632445e-07   2   -1    2
    1.1314046e-07   2    24    25
    2.62683e-08   2   -1    4
    2.1026743e-08   2   -1    6
    1.077301e-08   2   -11    12
    2.0888754e-09   2   -1000013    1000014
    1.6504235e-10   2   -1000003    1000004
    8.8405566e-12   2   -1000003    1000002
    4.5783002e-13   2   -1000001    1000002
    4.8858436e-14   2   -1000011    1000012
    2.4452084e-14   2   -1000001    1000004

DECAY 6  2.43
    1   2    5    24

DECAY 15 -1
