BLOCK SPINFO
   1   SPheno
   2   v4.0.5be

BLOCK SPHENOINFO
   1   2
   2   2

BLOCK MODSEL
   1   0

BLOCK MINPAR
   3    32.279874
   4    1

BLOCK EXTPAR
   0    1449.726
   1   -1352.5843
   2    156.97917
   3    3000
   11   -1742.0077
   12   -1727.1716
   13    519.23544
   23    200.27514
   25    31.380274
   26    2572.1398
   31    1993.746
   32    1993.746
   33    630.50779
   34    1475.0819
   35    1475.0819
   36    1976.4066
   41    5000
   42    5000
   43    1863.3086
   44    5000
   45    5000
   46    1163.9381
   47    5000
   48    5000
   49    1188.9795

BLOCK SMINPUTS
   1    127.90897
   2    1.1663787e-05
   3    0.1184
   4    91.1876
   5    4.18
   6    173.2
   7    1.777
   8    0
   11    0.00051099893
   12    0
   13    0.10565837
   14    0
   21    0.005
   22    0.0025
   23    0.095
   24    1.27

BLOCK GAUGE Q=  1449.726
   1    0.35536298
   2    0.66519887
   3    1.219778

BLOCK YU Q=  1449.726
   1   1    8.3886283e-06
   2   2    0.0042614232
   3   3    1.0134137

BLOCK YD Q=  1449.726
   1   1    0.00052896621
   2   2    0.010050358
   3   3    0.52456872

BLOCK YE Q=  1449.726
   1   1    9.2308471e-05
   2   2    0.019086464
   3   3    0.32100293

BLOCK AU Q=  1449.726
   1   1    0
   2   2    0
   3   3   -1742.0095

BLOCK AD Q=  1449.726
   1   1    0
   2   2    0
   3   3   -1727.1716

BLOCK AE Q=  1449.726
   1   1    0
   2   2    0
   3   3    519.23524

BLOCK MSOFT Q=  1449.726
   1   -1352.5843
   2    156.97917
   3    3000
   21    6589914.2
   22   -6717.7472
   31    1993.746
   32    1993.746
   33    630.50779
   34    1475.0819
   35    1475.0819
   36    1976.4066
   41    5000
   42    5000
   43    1863.3086
   44    5000
   45    5000
   46    1163.9381
   47    5000
   48    5000
   49    1188.9795

BLOCK MASS
   6    173.2
   23    91.1876
   24    80.429995
   15    1.777
   25    120.80332
   35    2571.1918
   36    2572.1398
   37    2572.9554
   1000001    5026.4033
   2000001    5015.385
   1000002    5025.9403
   2000002    5016.7976
   1000003    5026.4063
   2000003    5015.3896
   1000004    5025.9432
   2000004    5016.7985
   1000005    1175.304
   2000005    1869.2687
   1000006    1117.2071
   2000006    1881.2139
   1000011    1998.5881
   2000011    1479.4716
   1000012    1996.5968
   1000013    1998.5839
   2000013    1479.4632
   1000014    1996.5926
   1000015    634.82906
   2000015    1977.3855
   1000016    629.66391
   1000021    3184.8365
   1000022    130.53996
   1000023   -208.36548
   1000025    249.76141
   1000035   -1353.8226
   1000024    132.87276
   1000037    255.11833

BLOCK ALPHA
      -0.031076871

BLOCK HMIX Q=  1449.726
   1    200.27514
   2    31.380274
   3    244.06242
   4    6615903.4

BLOCK STOPMIX
   1   1    0.1122523
   1   2    0.99367974
   2   1   -0.99367974
   2   2    0.1122523

BLOCK SBOTMIX
   1   1    0.0089557732
   1   2    0.9999599
   2   1   -0.9999599
   2   2    0.0089557732

BLOCK STAUMIX
   1   1    0.99999568
   1   2    0.0029385523
   2   1   -0.0029385523
   2   2    0.99999568

BLOCK NMIX
   1   1   -0.011149868
   1   2   -0.76414853
   1   3    0.53691661
   1   4   -0.35731394
   2   1   -0.026586284
   2   2   -0.14796964
   2   3   -0.68533517
   2   4   -0.71254042
   3   1    0.017045624
   3   2   -0.62783671
   3   3   -0.49195673
   3   4    0.60291715
   4   1    0.99943899
   4   2   -0.0017532334
   4   3   -0.0038504168
   4   4   -0.033223543

BLOCK UMIX
   1   1   -0.69594062
   1   2    0.71809934
   2   1    0.71809934
   2   2    0.69594062

BLOCK VMIX
   1   1   -0.87286442
   1   2    0.48796281
   2   1    0.48796281
   2   2    0.87286442

BLOCK HIGGSBOUNDSINPUTHIGGSCOUPLINGSFERMIONS
       0, 984.72159,3,36,15,15

BLOCK HIGGSBOUNDSINPUTHIGGSCOUPLINGSBOSONS
       0,4,36,21,21,23

BLOCK SPHENOLOWENERGY
   1    0.00029693378
   2    1.5905761e-06
   3    3.5168587e-05
   4    2.7344123e-15
   5    1.1681067e-10
   6    2.4442081e-08
   7    9.1930601e-14
   8    3.9272622e-09
   9    8.3265772e-07
   10    9.598143e-05
   11    0.99145142
   12    0.5432067
   13    19.404717
   14    0
   15    0
   16    0.0021621705
   17    2.2817085e-15
   18    2.4739489e-11
   19    8.2760169e-11
   20    4.1542701e-15
   21    1.7761053e-10
   22    2.6919951e-07
   23    0
   24    0
   25    0
   26    0
   27    0
   28    0
   29    0
   30    0
   31    0
   39    8.6276549e-05
   40    0
   41    0
   42    0

BLOCK FWCOEF Q=  160
   305   4422   0   0   -0.18881911
   305   4422   0   2   -0.15776943
   305   4322   0   2    9.4087766e-05
   305   6421   0   0   -0.095227835
   305   6421   0   2   -0.089555741
   305   6321   0   2   -0.00012355064
   3051111   4133   0   0    1.590864
   3051111   4133   0   2    1.5921592
   3051111   4233   0   2    0.00010826828
   3051111   4137   0   0   -4.4135561
   3051111   4137   0   2   -4.4036345
   3051111   4237   0   2   -0.00084206693
   3051313   4133   0   0    1.590864
   3051313   4133   0   2    1.5921578
   3051313   4233   0   2    0.00010826772
   3051313   4137   0   0   -4.4135561
   3051313   4137   0   2   -4.4036358
   3051313   4237   0   2   -0.00084206761
   3051212   4137   0   0    1.5053501
   3051212   4137   0   2    1.5032003
   3051212   4237   0   2    0.00018356442
   3051414   4137   0   0    1.5053501
   3051414   4137   0   2    1.5032003
   3051414   4237   0   2    0.00018356446
   3051616   4137   0   0    1.5053501
   3051616   4137   0   2    1.5032037
   3051616   4237   0   2    0.00018357775

BLOCK IMFWCOEF Q=  160
   305   4422   0   0    3.8583508e-07
   305   4422   0   2    1.4643606e-05
   305   4322   0   2    4.5039227e-06
   305   6421   0   0    3.3049326e-07
   305   6421   0   2   -4.255295e-06
   305   6321   0   2    1.418304e-06
   3051111   4133   0   2    6.7856241e-07
   3051111   4233   0   2    2.4991033e-06
   3051111   4137   0   2    5.1964841e-06
   3051111   4237   0   2   -1.945432e-05
   3051313   4133   0   2    6.7854335e-07
   3051313   4233   0   2    2.4990972e-06
   3051313   4137   0   2    5.1964974e-06
   3051313   4237   0   2   -1.9454336e-05
   3051212   4137   0   2   -9.0023347e-07
   3051212   4237   0   2    4.2409e-06
   3051414   4137   0   2   -9.0023278e-07
   3051414   4237   0   2    4.2409e-06
   3051616   4137   0   2   -8.389385e-07
   3051616   4237   0   2    4.2409047e-06

DECAY 23  2.4952


DECAY 24  2.085


DECAY 2000011  0.20442294
    0.96088044   2    1000035    11
    0.024694752   2    1000023    11
    0.0099725354   2    1000025    11
    0.0044510892   2    1000022    11

DECAY 1000011  26.617103
    0.32983372   2   -1000037    12
    0.31731626   2   -1000024    12
    0.19433548   2    1000022    11
    0.1226018   2    1000025    11
    0.027408645   2    1000035    11
    0.0085040952   2    1000023    11

DECAY 2000013  0.2250578
    0.87267261   2    1000035    13
    0.04392688   2    1000023    13
    0.024172731   2   -1000024    14
    0.021722803   2   -1000037    14
    0.019940917   2    1000025    13
    0.017564058   2    1000022    13

DECAY 1000013  26.631267
    0.32965757   2   -1000037    14
    0.31714683   2   -1000024    14
    0.19438709   2    1000022    13
    0.12266398   2    1000025    13
    0.027393817   2    1000035    13
    0.0087495144   2    1000023    13

DECAY 1000015  7.9027509
    0.31405958   2   -1000024    16
    0.25567583   2   -1000037    16
    0.23617976   2    1000022    15
    0.12512128   2    1000025    15
    0.068963558   2    1000023    15

DECAY 2000015  10.815941
    0.25896751   2    1000035    15
    0.18926418   2   -1000024    16
    0.17773642   2   -1000037    16
    0.17306073   2    1000023    15
    0.10591697   2    1000022    15
    0.089075953   2    1000025    15
    0.0030269088   2    1000016   -24
    0.0015020331   2    1000015    23
    0.0014492985   2    1000015    25

DECAY 1000012  26.67539
    0.49756629   2    1000024    11
    0.18776744   2    1000022    12
    0.15180562   2    1000037    11
    0.12950429   2    1000025    12
    0.027589128   2    1000035    12
    0.0057672266   2    1000023    12

DECAY 1000014  26.689503
    0.49757904   2    1000024    13
    0.18766775   2    1000022    14
    0.15197925   2    1000037    13
    0.12943552   2    1000025    14
    0.027574281   2    1000035    14
    0.0057641642   2    1000023    14

DECAY 1000016  8.1183544
    0.54926964   2    1000024    15
    0.17973976   2    1000022    16
    0.1678017   2    1000037    15
    0.098344908   2    1000025    16
    0.0048439866   2    1000023    16

DECAY 2000001  143.38858
    0.98321096   2    1000021    1
    0.016766826   2    1000035    1

DECAY 1000001  208.89192
    0.68039211   2    1000021    1
    0.10866694   2   -1000037    2
    0.1024486   2   -1000024    2
    0.061439667   2    1000022    1
    0.041944454   2    1000025    1
    0.0029427301   2    1000035    1
    0.0021654982   2    1000023    1

DECAY 2000003  143.4091
    0.98307363   2    1000021    3
    0.016764449   2    1000035    3

DECAY 1000003  208.90411
    0.68035385   2    1000021    3
    0.10866728   2   -1000037    4
    0.10244472   2   -1000024    4
    0.061449994   2    1000022    3
    0.041953649   2    1000025    3
    0.0029425613   2    1000035    3
    0.0021879436   2    1000023    3

DECAY 1000005  11.849948
    0.26640128   2   -1000024    6
    0.23850825   2    1000023    5
    0.22157857   2   -1000037    6
    0.15617086   2    1000022    5
    0.11734104   2    1000025    5

DECAY 2000005  85.513874
    0.42612172   2   -1000037    6
    0.19021284   2   -1000024    6
    0.17074255   2    1000006   -24
    0.088699569   2    1000022    5
    0.065492808   2    1000025    5
    0.056924592   2    1000023    5
    0.00070440982   2    1000035    5
    0.00065326878   2    1000005    25
    0.00044824653   2    1000005    23

DECAY 2000002  150.76103
    0.93610572   2    1000021    2
    0.063811221   2    1000035    2

DECAY 1000002  208.88783
    0.68017458   2    1000021    2
    0.16114759   2    1000024    1
    0.062076998   2    1000022    2
    0.050173044   2    1000037    1
    0.041138039   2    1000025    2
    0.0028287383   2    1000035    2
    0.002461012   2    1000023    2

DECAY 2000004  150.76467
    0.93608333   2    1000021    4
    0.063809686   2    1000035    4

DECAY 1000004  208.89995
    0.68013624   2    1000021    4
    0.16116315   2    1000024    3
    0.062074522   2    1000022    4
    0.050193403   2    1000037    3
    0.041138833   2    1000025    4
    0.0028285855   2    1000035    4
    0.0024652633   2    1000023    4

DECAY 1000006  40.812872
    0.34807299   2    1000037    5
    0.25288915   2    1000023    6
    0.16486982   2    1000024    5
    0.15281061   2    1000025    6
    0.080861011   2    1000022    6
    0.00047566036   2    1000022    4

DECAY 2000006  89.070699
    0.20813092   2    1000023    6
    0.20336164   2    1000025    6
    0.17134329   2    1000024    5
    0.12539984   2    1000037    5
    0.11326198   2    1000006    25
    0.09308636   2    1000022    6
    0.083866958   2    1000006    23
    0.00089409093   2    1000005    24
    0.00065492039   2    1000035    6

DECAY 1000024  1.5322914e-10
    0.52706485   3    1000022   -1    2
    0.17587084   3    1000022   -11    12
    0.17408686   3    1000022   -13    14
    0.11724275   3    1000022   -3    4
    0.0057347077   3    1000022   -15    16

DECAY 1000037  0.41567209
    0.61900112   2    1000022    24
    0.36852217   2    1000024    23
    0.010832218   2    1000024    25
    0.00054808713   3    1000023   -1    2
    0.00054642735   3    1000023   -3    4
    0.00018271118   3    1000023   -11    12
    0.00018270874   3    1000023   -13    14
    0.00018186397   3    1000023   -15    16

DECAY 1000022 -1


DECAY 1000023  0.032195941
    0.13378391   3    1000024    1   -2
    0.13378391   3   -1000024   -1    2
    0.13370645   3    1000024    3   -4
    0.13370645   3   -1000024   -3    4
    0.044594996   3    1000024    11   -12
    0.044594996   3   -1000024   -11    12
    0.044594914   3    1000024    13   -14
    0.044594914   3   -1000024   -13    14
    0.044571127   3    1000024    15   -16
    0.044571127   3   -1000024   -15    16
    0.03986097   3    1000022    12   -12
    0.02976982   3    1000022    1   -1
    0.029769536   3    1000022    3   -3
    0.029304699   3    1000022    5   -5
    0.023220459   3    1000022    2   -2
    0.023167757   3    1000022    4   -4
    0.0067159914   3    1000022    11   -11
    0.0067159156   3    1000022    13   -13
    0.0066936605   3    1000022    15   -15
    0.0022784014   2    1000022    22

DECAY 1000025  0.56830722
    0.49432016   2    1000024   -24
    0.49432016   2   -1000024    24
    0.010868095   2    1000022    23

DECAY 1000035  6.76894
    0.088750492   2    1000037   -24
    0.088750492   2   -1000037    24
    0.079098817   2    1000023    25
    0.07757015   2    1000016   -16
    0.07757015   2   -1000016    16
    0.07586432   2    1000015   -15
    0.07586432   2   -1000015    15
    0.056470843   2    1000025    25
    0.054779546   2    1000006   -6
    0.054779546   2   -1000006    6
    0.054320644   2    1000025    23
    0.051569088   2    1000023    23
    0.041045911   2    1000024   -24
    0.041045911   2   -1000024    24
    0.026224929   2    1000022    25
    0.023620867   2    1000022    23
    0.010143704   2    1000005   -5
    0.010143704   2   -1000005    5
    0.0027431919   3    1000037    5   -6
    0.0027431919   3   -1000037   -5    6
    0.0020336903   3    1000023    6   -6
    0.00136539   3    1000024    5   -6
    0.00136539   3   -1000024   -5    6
    0.0012219001   3    1000025    6   -6
    0.00071185475   3    1000022    6   -6

DECAY 1000021  223.10232
    0.15784392   2    1000006   -6
    0.15784392   2   -1000006    6
    0.15763887   2    1000005   -5
    0.15763887   2   -1000005    5
    0.09242844   2    2000006   -6
    0.09242844   2   -2000006    6
    0.090790659   2    2000005   -5
    0.090790659   2   -2000005    5
    0.001123261   2    1000006   -4
    0.001123261   2   -1000006    4

DECAY 25  0.0034170285
    0.63520988   2   -5    5
    0.16355887   2   -24    24
    0.07507023   2    21    21
    0.072716072   2   -15    15
    0.031251423   2   -4    4
    0.018193967   2    23    23
    0.0023447077   2    22    22
    0.0011643713   2    22    23
    0.00025153388   2   -13    13
    0.00023812092   2   -3    3
    6.5838026e-07   2   -1    1
    1.6105958e-07   2   -2    2
    5.6548193e-09   2   -11    11

DECAY 35  66.973579
    0.42943341   2   -5    5
    0.11376069   2   -1000024    1000024
    0.083836699   2   -15    15
    0.083684574   2   -1000024    1000037
    0.083684574   2   -1000037    1000024
    0.048982097   2    1000022    1000022
    0.037332715   2    1000023    1000025
    0.036874822   2    1000022    1000023
    0.027132049   2   -1000037    1000037
    0.026285624   2    1000025    1000025
    0.010174804   2    1000023    1000035
    0.0065669345   2    1000025    1000035
    0.0062057991   2    1000022    1000035
    0.0028798696   2    1000023    1000023
    0.0014374359   2   -6    6
    0.0012224339   2    1000022    1000025
    0.00028260127   2   -13    13
    0.00016815003   2   -3    3
    4.5089706e-05   2   -1000006    1000006
    5.6842011e-06   2    21    21
    1.9219054e-06   2    25    25
    6.4692412e-07   2    23    23
    4.6487878e-07   2   -1    1
    2.4051465e-07   2   -24    24
    1.5728801e-07   2    22    23
    4.4415704e-08   2    22    22
    2.1080632e-08   2   -4    4
    1.5902654e-08   2   -1000015    1000015
    6.3473571e-09   2   -11    11
    1.086739e-13   2   -2    2

DECAY 36  64.941578
    0.41668429   2   -5    5
    0.12640828   2   -1000024    1000024
    0.081349647   2   -15    15
    0.077359608   2   -1000024    1000037
    0.077359608   2   -1000037    1000024
    0.055150225   2    1000022    1000022
    0.036904783   2   -1000037    1000037
    0.034193302   2    1000023    1000025
    0.032664896   2    1000025    1000025
    0.031891751   2    1000022    1000023
    0.011705382   2    1000023    1000035
    0.0061017382   2    1000022    1000035
    0.0058816382   2    1000025    1000035
    0.0026810365   2    1000023    1000023
    0.0018631993   2    1000022    1000025
    0.0013482736   2   -6    6
    0.00027421657   2   -13    13
    0.00016315357   2   -3    3
    1.3138997e-05   2    21    21
    9.8744222e-07   2    23    25
    4.5106373e-07   2   -1    1
    2.5106591e-07   2    22    23
    1.2218076e-07   2    22    22
    1.9450943e-08   2   -4    4
    6.1590481e-09   2   -11    11
    1.002795e-13   2   -2    2
    1.1345093e-38   2    25    25

DECAY 37  66.670065
    0.43202849   2   -5    6
    0.18014938   2    1000022    1000037
    0.13335892   2    1000024    1000025
    0.10366236   2    1000023    1000024
    0.080419268   2   -15    16
    0.045431718   2    1000023    1000037
    0.012064244   2    1000035    1000037
    0.010733852   2    1000024    1000035
    0.00098735484   2    1000025    1000037
    0.00063901689   2   -5    4
    0.00028431089   2   -13    14
    0.00015337825   2   -3    4
    6.5268621e-05   2    1000022    1000024
    7.17029e-06   2   -3    2
    6.715483e-06   2   -1000005    1000006
    4.5632406e-06   2   -5    2
    2.3342598e-06   2   -3    6
    9.6357864e-07   2    24    25
    4.2550443e-07   2   -1    2
    1.3830958e-07   2   -1000015    1000016
    9.6689079e-08   2   -1    6
    2.0721954e-08   2   -1    4
    6.6500614e-09   2   -11    12
    3.4826487e-13   2    24    35

DECAY 6  2.43
    1   2    5    24

DECAY 15 -1
