BLOCK SPINFO
   1   SPheno
   2   v4.0.5be

BLOCK SPHENOINFO
   1   2
   2   2

BLOCK MODSEL
   1   0

BLOCK MINPAR
   3    17.646734
   4    1

BLOCK EXTPAR
   0    1161.4219
   1    708.49074
   2   -1109.9439
   3    3000
   11    3010.1713
   12   -439.45026
   13   -21.814616
   23    1168.8203
   25    16.976881
   26    1449.7636
   31    1604.5376
   32    1604.5376
   33    1468.214
   34    1104.6622
   35    1104.6622
   36    966.02607
   41    5000
   42    5000
   43    1314.8317
   44    5000
   45    5000
   46    1237.5308
   47    5000
   48    5000
   49    1931.611

BLOCK SMINPUTS
   1    127.90897
   2    1.1663787e-05
   3    0.1184
   4    91.1876
   5    4.18
   6    173.2
   7    1.777
   8    0
   11    0.00051099893
   12    0
   13    0.10565837
   14    0
   21    0.005
   22    0.0025
   23    0.095
   24    1.27

BLOCK GAUGE Q=  1161.4219
   1    0.35536298
   2    0.66519887
   3    1.219778

BLOCK YU Q=  1161.4219
   1   1    8.3989049e-06
   2   2    0.0042666437
   3   3    1.0146552

BLOCK YD Q=  1161.4219
   1   1    0.00028652387
   2   2    0.0054439536
   3   3    0.2841419

BLOCK YE Q=  1161.4219
   1   1    5.0000511e-05
   2   2    0.01033852
   3   3    0.1738769

BLOCK AU Q=  1161.4219
   1   1    0
   2   2    0
   3   3    3010.1714

BLOCK AD Q=  1161.4219
   1   1    0
   2   2    0
   3   3   -439.45025

BLOCK AE Q=  1161.4219
   1   1    0
   2   2    0
   3   3   -21.814616

BLOCK MSOFT Q=  1161.4219
   1    708.49074
   2   -1109.9439
   3    3000
   21    711476.69
   22   -1306954.9
   31    1604.5376
   32    1604.5376
   33    1468.214
   34    1104.6622
   35    1104.6622
   36    966.02607
   41    5000
   42    5000
   43    1314.8317
   44    5000
   45    5000
   46    1237.5308
   47    5000
   48    5000
   49    1931.611

BLOCK MASS
   6    173.2
   23    91.1876
   24    80.429995
   15    1.777
   25    123.25781
   35    1449.5562
   36    1449.7636
   37    1452.2485
   1000001    5013.7797
   2000001    5004.9313
   1000002    5013.3467
   2000002    5006.0928
   1000003    5013.7819
   2000003    5004.9322
   1000004    5013.3481
   2000004    5006.094
   1000005    1241.6578
   2000005    1928.4499
   1000006    982.19734
   2000006    1373.3501
   1000011    1610.9109
   2000011    1108.5627
   1000012    1608.6246
   1000013    1610.9104
   2000013    1108.56
   1000014    1608.6231
   1000015    969.63278
   2000015    1475.2433
   1000016    1472.4431
   1000021    3165.8788
   1000022    707.9768
   1000023   -1108.8122
   1000025    1175.1646
   1000035   -1216.158
   1000024    1109.8643
   1000037    1217.9055

BLOCK ALPHA
      -0.057163435

BLOCK HMIX Q=  1161.4219
   1    1168.8203
   2    16.976881
   3    244.23784
   4    2101814.4

BLOCK STOPMIX
   1   1   -0.60192462
   1   2    0.79855291
   2   1   -0.79855291
   2   2   -0.60192462

BLOCK SBOTMIX
   1   1    0.99985158
   1   2    0.017228488
   2   1   -0.017228488
   2   2    0.99985158

BLOCK STAUMIX
   1   1    0.027546121
   1   2    0.99962053
   2   1   -0.99962053
   2   2    0.027546121

BLOCK NMIX
   1   1   -0.99736329
   1   2   -0.0017745185
   1   3   -0.061227909
   1   4    0.038916098
   2   1    0.0099983957
   2   2    0.77744764
   2   3   -0.45877765
   2   4   -0.43011425
   3   1    0.07081636
   3   2   -0.025515787
   3   3   -0.70388306
   3   4    0.70631623
   4   1    0.012310307
   4   2   -0.62842737
   4   3   -0.53881616
   4   4   -0.56089629

BLOCK UMIX
   1   1   -0.74878142
   1   2    0.66281701
   2   1   -0.66281701
   2   2   -0.74878142

BLOCK VMIX
   1   1    0.78167856
   1   2    0.62368152
   2   1    0.62368152
   2   2   -0.78167856

BLOCK HIGGSBOUNDSINPUTHIGGSCOUPLINGSFERMIONS
       0, 288.21449,3,36,15,15

BLOCK HIGGSBOUNDSINPUTHIGGSCOUPLINGSBOSONS
       0,4,36,21,21,23

BLOCK SPHENOLOWENERGY
   1    0.00035596752
   2    1.5873767e-06
   3    3.5245901e-05
   4    2.9535482e-15
   5    1.2617225e-10
   6    2.6414725e-08
   7    9.9191743e-14
   8    4.2374688e-09
   9    8.9885459e-07
   10    9.5732661e-05
   11    0.98888174
   12    0.5435544
   13    19.417319
   14    0
   15    0
   16    0.0021658574
   17    2.2817461e-15
   18    2.4785906e-11
   19    8.2874115e-11
   20   -2.5305843e-15
   21   -1.0819042e-10
   22   -3.1953105e-08
   23    0
   24    0
   25    0
   26    0
   27    0
   28    0
   29    0
   30    0
   31    0
   39    6.1860015e-05
   40    0
   41    0
   42    0

BLOCK FWCOEF Q=  160
   305   4422   0   0   -0.18881911
   305   4422   0   2   -0.22685076
   305   4322   0   2   -0.00048843624
   305   6421   0   0   -0.095227835
   305   6421   0   2   -0.12916819
   305   6321   0   2   -0.0005169033
   3051111   4133   0   0    1.5827015
   3051111   4133   0   2    1.5839008
   3051111   4233   0   2    1.9052025e-05
   3051111   4137   0   0   -4.4053936
   3051111   4137   0   2   -4.4030567
   3051111   4237   0   2   -0.00014968391
   3051313   4133   0   0    1.5827015
   3051313   4133   0   2    1.5839002
   3051313   4233   0   2    1.9051857e-05
   3051313   4137   0   0   -4.4053936
   3051313   4137   0   2   -4.4030572
   3051313   4237   0   2   -0.00014968384
   3051212   4137   0   0    1.5053501
   3051212   4137   0   2    1.5048468
   3051212   4237   0   2    3.2687707e-05
   3051414   4137   0   0    1.5053501
   3051414   4137   0   2    1.5048468
   3051414   4237   0   2    3.2687738e-05
   3051616   4137   0   0    1.5053501
   3051616   4137   0   2    1.5048468
   3051616   4237   0   2    3.2696299e-05

BLOCK IMFWCOEF Q=  160
   305   4422   0   0    3.8574909e-07
   305   4422   0   2   -5.695343e-06
   305   4322   0   2   -1.9742585e-06
   305   6421   0   0    3.3041961e-07
   305   6421   0   2   -6.5116074e-06
   305   6321   0   2   -9.494979e-07
   3051111   4133   0   2    2.8078228e-07
   3051111   4233   0   2    7.3491755e-07
   3051111   4137   0   2   -1.0299258e-06
   3051111   4237   0   2   -5.7949985e-06
   3051313   4133   0   2    2.8077783e-07
   3051313   4233   0   2    7.3491705e-07
   3051313   4137   0   2   -1.0299291e-06
   3051313   4237   0   2   -5.7949998e-06
   3051212   4137   0   2    3.4469268e-07
   3051212   4237   0   2    1.2655595e-06
   3051414   4137   0   2    3.4469269e-07
   3051414   4237   0   2    1.2655595e-06
   3051616   4137   0   2    3.4489336e-07
   3051616   4237   0   2    1.2655592e-06

DECAY 23  2.4952


DECAY 24  2.085


DECAY 2000011  1.9427257
    1   2    1000022    11

DECAY 1000011  6.3671999
    0.34460518   2   -1000024    12
    0.20717997   2    1000022    11
    0.18895447   2    1000023    11
    0.1795825   2   -1000037    12
    0.079640901   2    1000035    11

DECAY 2000013  1.9427098
    1   2    1000022    13

DECAY 1000013  6.3684112
    0.3445391   2   -1000024    14
    0.20714182   2    1000022    13
    0.18894875   2    1000023    13
    0.17954796   2   -1000037    14
    0.079655159   2    1000035    13

DECAY 1000015  1.0567802
    1   2    1000022    15

DECAY 2000015  4.4653219
    0.30301099   2   -1000024    16
    0.24661322   2    1000022    15
    0.17416856   2    1000023    15
    0.13158741   2   -1000037    16
    0.064874421   2    1000035    15
    0.034119479   2    1000015    25
    0.032274173   2    1000015    23
    0.013351746   2    1000025    15

DECAY 1000012  6.3700119
    0.37292719   2    1000024    11
    0.20378014   2    1000022    12
    0.18255174   2    1000023    12
    0.15750381   2    1000037    11
    0.082267224   2    1000035    12
    0.00096989891   2    1000025    12

DECAY 1000014  6.3707494
    0.37294888   2    1000024    13
    0.20375618   2    1000022    14
    0.18252983   2    1000023    14
    0.15753811   2    1000037    13
    0.082257221   2    1000035    14
    0.00096978165   2    1000025    14

DECAY 1000016  4.4621965
    0.34788788   2    1000024    15
    0.24209529   2    1000022    16
    0.16228437   2    1000023    16
    0.12337452   2    1000037    15
    0.064434881   2    1000015    24
    0.059154941   2    1000035    16
    0.00076812203   2    1000025    16

DECAY 2000001  144.84488
    0.98147997   2    1000021    1
    0.018429232   2    1000022    1

DECAY 1000001  203.10278
    0.70449278   2    1000021    1
    0.11019257   2   -1000024    2
    0.084536347   2   -1000037    2
    0.059135453   2    1000023    1
    0.038275184   2    1000035    1
    0.0032265775   2    1000022    1
    0.00014108421   2    1000025    1

DECAY 2000003  144.85022
    0.98144435   2    1000021    3
    0.018428627   2    1000022    3

DECAY 1000003  203.10729
    0.70447823   2    1000021    3
    0.11019316   2   -1000024    4
    0.084539523   2   -1000037    4
    0.059136917   2    1000023    3
    0.038278105   2    1000035    3
    0.0032265593   2    1000022    3
    0.00014750519   2    1000025    3

DECAY 1000005  21.460444
    0.98842495   2    1000006   -24
    0.0070198913   2    1000023    5
    0.0038158915   2    1000022    5
    0.00050516519   2    1000025    5
    0.0002341031   2    1000035    5

DECAY 2000005  4.0385991
    0.19948698   2    1000022    5
    0.16359093   2   -1000037    6
    0.15157146   2    1000025    5
    0.13529281   2   -1000024    6
    0.08633001   2    1000035    5
    0.084513851   2    1000005    25
    0.065588155   2    1000023    5
    0.052150507   2    1000006   -24
    0.03497992   2    1000005    23
    0.026495369   2    2000006   -24

DECAY 2000002  153.01613
    0.9298586   2    1000021    2
    0.069797867   2    1000022    2
    0.00032712746   2    1000025    2

DECAY 1000002  203.09754
    0.70428874   2    1000021    2
    0.12007833   2    1000024    1
    0.074842163   2    1000037    1
    0.059674971   2    1000023    2
    0.037741718   2    1000035    2
    0.0033579189   2    1000022    2

DECAY 2000004  153.01943
    0.92983895   2    1000021    4
    0.069796381   2    1000022    4
    0.00033240945   2    1000025    4

DECAY 1000004  203.10189
    0.70427405   2    1000021    4
    0.1200816   2    1000024    3
    0.074847755   2    1000037    3
    0.059675275   2    1000023    4
    0.037743318   2    1000035    4
    0.0033578615   2    1000022    4

DECAY 1000006  0.14044765
    0.99996585   2    1000022    6

DECAY 2000006  29.631202
    0.73497193   2    1000006    23
    0.11442762   2    1000005    24
    0.078060034   2    1000006    25
    0.028403225   2    1000037    5
    0.02793937   2    1000022    6
    0.01098265   2    1000023    6
    0.002656837   2    1000024    5
    0.0025583338   2    1000025    6

DECAY 1000024  1.2646932
    0.83198238   2    1000006   -5
    0.15888188   2    1000022    24
    0.0081318457   2   -1000015    16
    0.00099705572   3    1000022   -5    6

DECAY 1000037  2.5637749
    0.45663142   2    1000023    24
    0.28006319   2    1000006   -5
    0.20835903   2    1000022    24
    0.043748711   2    1000024    23
    0.0088210704   2   -1000015    16
    0.0023056183   3    1000022   -5    6

DECAY 1000022 -1


DECAY 1000023  0.33798756
    0.61344024   2    1000022    23
    0.35706877   2    1000022    25
    0.014595994   2    1000015   -15
    0.014595994   2   -1000015    15
    0.00011779951   3    1000022    6   -6

DECAY 1000025  0.89235095
    0.70228527   2    1000022    25
    0.10325021   2    1000006   -6
    0.10325021   2   -1000006    6
    0.040998989   2    1000022    23
    0.021314122   2    1000015   -15
    0.021314122   2   -1000015    15
    0.00073498149   3    1000023    12   -12
    0.00058344077   3    1000022    6   -6
    0.0005492467   3    1000023    1   -1
    0.00054923812   3    1000023    3   -3
    0.00053302411   3    1000023    5   -5
    0.00042837433   3    1000023    2   -2
    0.00042678246   3    1000023    4   -4
    0.00040869407   3    1000024    1   -2
    0.00040869407   3   -1000024   -1    2
    0.0004081751   3    1000024    3   -4
    0.0004081751   3   -1000024   -3    4
    0.0002095632   2    2000013   -13
    0.0002095632   2   -2000013    13
    0.00020126653   2    2000011   -11
    0.00020126653   2   -2000011    11
    0.00013628255   3    1000024    11   -12
    0.00013628255   3   -1000024   -11    12
    0.00013627981   3    1000024    13   -14
    0.00013627981   3   -1000024   -13    14
    0.00013573638   3    1000024    15   -16
    0.00013573638   3   -1000024   -15    16
    0.00012557707   2    1000023    22
    0.0001239461   3    1000023    11   -11
    0.00012393781   3    1000023    13   -13
    0.00012278582   3    1000023    15   -15

DECAY 1000035  2.9815031
    0.28651842   2    1000024   -24
    0.28651842   2   -1000024    24
    0.18598593   2    1000022    23
    0.13580408   2    1000022    25
    0.048413831   2    1000006   -6
    0.048413831   2   -1000006    6
    0.0039500113   2    1000015   -15
    0.0039500113   2   -1000015    15
    0.00024231127   3    1000022    6   -6

DECAY 1000021  244.73861
    0.17438177   2    1000006   -6
    0.17438177   2   -1000006    6
    0.13706643   2    1000005   -5
    0.13706643   2   -1000005    5
    0.10969574   2    2000006   -6
    0.10969574   2   -2000006    6
    0.075744691   2    2000005   -5
    0.075744691   2   -2000005    5
    0.0010900914   3    1000035    6   -6
    0.0010143215   3    1000024    5   -6
    0.0010143215   3   -1000024   -5    6
    0.00079240728   3    1000037    5   -6
    0.00079240728   3   -1000037   -5    6
    0.00075127833   3    1000025    6   -6
    0.00065116387   3    1000023    6   -6

DECAY 25  0.0036953594
    0.60375256   2   -5    5
    0.19906651   2   -24    24
    0.070877681   2    21    21
    0.069411115   2   -15    15
    0.029472414   2   -4    4
    0.023269672   2    23    23
    0.0023393885   2    22    22
    0.0013419572   2    22    23
    0.0002407504   2   -13    13
    0.0002271621   2   -3    3
    6.2808022e-07   2   -1    1
    1.5188418e-07   2   -2    2
    5.4123592e-09   2   -11    11

DECAY 35  4.4670436
    0.78655259   2   -5    5
    0.19345082   2   -15    15
    0.01822015   2   -6    6
    0.00067332081   2   -13    13
    0.0005423106   2    25    25
    0.00043440541   2   -3    3
    5.0240178e-05   2    23    23
    4.2104685e-05   2   -24    24
    2.7038539e-05   2    1000022    1000022
    5.1021598e-06   2    21    21
    1.2010544e-06   2   -1    1
    4.564472e-07   2   -4    4
    1.5641643e-07   2    22    22
    9.2964539e-08   2    22    23
    1.5125821e-08   2   -11    11
    2.3540049e-12   2   -2    2

DECAY 36  4.3906783
    0.78562544   2   -5    5
    0.19314278   2   -15    15
    0.019282969   2   -6    6
    0.00067224407   2   -13    13
    0.00064803482   2    1000022    1000022
    0.00043369811   2   -3    3
    0.00012412231   2    21    21
    6.8120825e-05   2    23    25
    1.1990995e-06   2   -1    1
    4.812246e-07   2    22    22
    4.5399253e-07   2    22    23
    4.4560649e-07   2   -4    4
    1.5101615e-08   2   -11    11
    2.2986386e-12   2   -2    2
    3.6031634e-34   2    25    25

DECAY 37  4.5025284
    0.79674193   2   -5    6
    0.20086643   2   -15    16
    0.0011318812   2   -5    4
    0.00071013615   2   -13    14
    0.00039025376   2   -3    4
    6.6959399e-05   2    24    25
    6.2238094e-05   2   -3    6
    1.8091682e-05   2   -3    2
    8.082803e-06   2   -5    2
    2.8288723e-06   2   -1    6
    1.0816584e-06   2   -1    2
    7.6501862e-08   2   -1    4
    1.6610159e-08   2   -11    12
    4.2691581e-11   2    24    35
    2.8600963e-11   2    24    36

DECAY 6  2.43
    1   2    5    24

DECAY 15 -1
