BLOCK SPINFO
   1   SPheno
   2   v4.0.5be

BLOCK SPHENOINFO
   1   2
   2   2

BLOCK MODSEL
   1   0

BLOCK MINPAR
   3    14.77324
   4   -1

BLOCK EXTPAR
   0    3755.5865
   1    2243.7827
   2   -1542.7201
   3    4952.7093
   11   -5139.9031
   12   -6472.4466
   13   -3758.9477
   23   -452.41181
   25    14.092501
   26    721.06554
   31    1355.8609
   32    1355.8609
   33    3274.96
   34    3801.2968
   35    3801.2968
   36    2904.6104
   41    3533.992
   42    3533.992
   43    2930.0129
   44    99.626927
   45    99.626927
   46    4570.7959
   47    4148.5186
   48    4148.5186
   49    4366.0444

BLOCK SMINPUTS
   1    127.90897
   2    1.1663787e-05
   3    0.1184
   4    91.1876
   5    4.18
   6    173.2
   7    1.777
   8    0
   11    0.00051099893
   12    0
   13    0.10565837
   14    0
   21    0.005
   22    0.0025
   23    0.095
   24    1.27

BLOCK GAUGE Q=  3755.5865
   1    0.35536298
   2    0.66519887
   3    1.219778

BLOCK YU Q=  3755.5865
   1   1    8.4054545e-06
   2   2    0.0042699709
   3   3    1.0154464

BLOCK YD Q=  3755.5865
   1   1    0.00023802881
   2   2    0.0045225474
   3   3    0.23604999

BLOCK YE Q=  3755.5865
   1   1    4.1537768e-05
   2   2    0.008588693
   3   3    0.14444769

BLOCK AU Q=  3755.5865
   1   1    0
   2   2    0
   3   3   -5139.9082

BLOCK AD Q=  3755.5865
   1   1    0
   2   2    0
   3   3   -6472.4252

BLOCK AE Q=  3755.5865
   1   1    0
   2   2    0
   3   3   -3758.946

BLOCK MSOFT Q=  3755.5865
   1    2243.7827
   2   -1542.7201
   3    4952.7093
   21    240863.55
   22    29462.607
   31    1355.8609
   32    1355.8609
   33    3274.96
   34    3801.2968
   35    3801.2968
   36    2904.6104
   41    3533.992
   42    3533.992
   43    2930.0129
   44    99.626927
   45    99.626927
   46    4570.7959
   47    4148.5186
   48    4148.5186
   49    4366.0444

BLOCK MASS
   6    173.2
   23    91.1876
   24    80.429995
   15    1.777
   25    124.06155
   35    721.19345
   36    721.06554
   37    725.79167
   1000001    3696.4908
   2000001    4289.33
   1000002    3695.6159
   2000002    658.02596
   1000003    3696.49
   2000003    4289.3291
   1000004    3695.6151
   2000004    658.02443
   1000005    3055.9048
   2000005    4496.8716
   1000006    3051.0602
   2000006    4622.7965
   1000011    1395.8712
   2000011    3800.1338
   1000012    1393.2171
   1000013    1395.8673
   2000013    3800.1294
   1000014    1393.2132
   1000015    2900.6229
   2000015    3290.4287
   1000016    3289.0358
   1000021    5009.3448
   1000022   -448.58227
   1000023    451.9153
   1000025   -1583.3538
   1000035    2209.5595
   1000024    449.38148
   1000037    1583.5253

BLOCK ALPHA
      -0.070767753

BLOCK HMIX Q=  3755.5865
   1   -452.41181
   2    14.092501
   3    243.01531
   4    519935.51

BLOCK STOPMIX
   1   1    0.99822871
   1   2    0.059493267
   2   1   -0.059493267
   2   2    0.99822871

BLOCK SBOTMIX
   1   1    1
   1   2    2.0759023e-05
   2   1   -2.0759023e-05
   2   2    1

BLOCK STAUMIX
   1   1   -0.0019524665
   1   2    0.99999809
   2   1   -0.99999809
   2   2   -0.0019524665

BLOCK NMIX
   1   1   -0.012394972
   1   2   -0.052877111
   1   3   -0.70783797
   1   4    0.70428388
   2   1    0.016389784
   2   2    0.025652948
   2   3   -0.70610434
   2   4   -0.70745315
   3   1   -0.00066665384
   3   2    0.99827139
   3   3   -0.019347069
   3   4    0.055493041
   4   1   -0.99978862
   4   2    0.0004104419
   4   3   -0.0027869564
   4   4   -0.020365883

BLOCK UMIX
   1   1   -0.027372605
   1   2   -0.9996253
   2   1   -0.9996253
   2   2    0.027372605

BLOCK VMIX
   1   1    0.078547497
   1   2    0.99691037
   2   1    0.99691037
   2   2   -0.078547497

BLOCK HIGGSBOUNDSINPUTHIGGSCOUPLINGSFERMIONS
       0, 198.59859,3,36,15,15

BLOCK HIGGSBOUNDSINPUTHIGGSCOUPLINGSBOSONS
       0,4,36,21,21,23

BLOCK SPHENOLOWENERGY
   1    0.00038027212
   2    1.5879657e-06
   3    3.5267631e-05
   4    2.3842188e-15
   5    1.0185117e-10
   6    2.1324203e-08
   7    8.0586386e-14
   8    3.4426494e-09
   9    7.3030554e-07
   10    9.4201535e-05
   11    0.9730658
   12    0.54225508
   13    19.363736
   14    0
   15    0
   16    0.0021586793
   17    2.2816754e-15
   18    2.481224e-11
   19    8.2929981e-11
   20    8.6403086e-16
   21    3.6939779e-11
   22    6.5466175e-09
   23    0
   24    0
   25    0
   26    0
   27    0
   28    0
   29    0
   30    0
   31    0
   39    2.417442e-05
   40    0
   41    0
   42    0

BLOCK FWCOEF Q=  160
   305   4422   0   0   -0.18881911
   305   4422   0   2   -0.24845463
   305   4322   0   2   -0.0011653495
   305   6421   0   0   -0.095227835
   305   6421   0   2   -0.16020755
   305   6321   0   2   -0.001271902
   3051111   4133   0   0    1.6240784
   3051111   4133   0   2    1.6242722
   3051111   4233   0   2    1.3363359e-05
   3051111   4137   0   0   -4.4467705
   3051111   4137   0   2   -4.4465516
   3051111   4237   0   2   -9.9192468e-05
   3051313   4133   0   0    1.6240784
   3051313   4133   0   2    1.6242721
   3051313   4233   0   2    1.336258e-05
   3051313   4137   0   0   -4.4467705
   3051313   4137   0   2   -4.4465517
   3051313   4237   0   2   -9.9191718e-05
   3051212   4137   0   0    1.5053501
   3051212   4137   0   2    1.5053102
   3051212   4237   0   2    2.1461763e-05
   3051414   4137   0   0    1.5053501
   3051414   4137   0   2    1.5053102
   3051414   4237   0   2    2.146193e-05
   3051616   4137   0   0    1.5053501
   3051616   4137   0   2    1.5053101
   3051616   4237   0   2    2.1509134e-05

BLOCK IMFWCOEF Q=  160
   305   4422   0   0    3.8581502e-07
   305   4422   0   2    4.4611748e-06
   305   4322   0   2   -1.0925491e-06
   305   6421   0   0    3.3047608e-07
   305   6421   0   2    4.1890497e-06
   305   6321   0   2   -4.7564034e-07
   3051111   4133   0   2   -9.7451236e-07
   3051111   4233   0   2    1.040968e-06
   3051111   4137   0   2    7.2711813e-06
   3051111   4237   0   2   -7.7347487e-06
   3051313   4133   0   2   -9.7451357e-07
   3051313   4233   0   2    1.0409679e-06
   3051313   4137   0   2    7.2711846e-06
   3051313   4237   0   2   -7.7347492e-06
   3051212   4137   0   2   -1.4382755e-06
   3051212   4237   0   2    1.6735262e-06
   3051414   4137   0   2   -1.4382755e-06
   3051414   4237   0   2    1.6735262e-06
   3051616   4137   0   2   -1.4397665e-06
   3051616   4237   0   2    1.6735263e-06

DECAY 23  2.4952


DECAY 24  2.085


DECAY 1000011  0.030716297
    0.5693967   2    1000022    11
    0.24082635   2   -1000024    12
    0.18977694   2    1000023    11

DECAY 2000011  8.370356
    0.99906293   2    1000035    11
    0.00059557981   2    1000023    11
    0.0003407783   2    1000022    11

DECAY 1000013  0.032360059
    0.56598736   2    1000022    13
    0.2285924   2   -1000024    14
    0.20542023   2    1000023    13

DECAY 2000013  8.3812023
    0.99776652   2    1000035    13
    0.00091724204   2    1000023    13
    0.00066448211   2    1000022    13
    0.00064642585   2   -1000024    14

DECAY 1000015  4.8659409
    0.52745081   2    1000035    15
    0.23564611   2   -1000024    16
    0.11865212   2    1000022    15
    0.11818851   2    1000023    15

DECAY 2000015  28.252107
    0.60490685   2   -1000037    16
    0.30146682   2    1000025    15
    0.044021918   2    1000035    15
    0.025061005   2    1000022    15
    0.023793489   2    1000023    15
    0.00071706349   2   -1000024    16

DECAY 1000012  0.07268585
    0.83569163   2    1000024    11
    0.14502253   2    1000022    12
    0.01928584   2    1000023    12

DECAY 1000014  0.074324461
    0.83931476   2    1000024    13
    0.14182467   2    1000022    14
    0.018860572   2    1000023    14

DECAY 1000016  28.268267
    0.60073413   2    1000037    15
    0.30142924   2    1000025    16
    0.052556299   2    1000024    15
    0.044050707   2    1000035    16
    0.0010553328   2    1000022    16
    0.00014074942   2    1000023    16

DECAY 1000001  32.775787
    0.66136457   2   -1000037    2
    0.32989767   2    1000025    1
    0.0065293897   2    1000035    1
    0.0012372996   2    1000022    1
    0.00072205309   2   -1000024    2
    0.00024901877   2    1000023    1

DECAY 2000001  1.2928702
    0.99922712   2    1000035    1
    0.00048839612   2    1000023    1
    0.0002802109   2    1000022    1

DECAY 1000003  32.778545
    0.6613088   2   -1000037    4
    0.32986978   2    1000025    3
    0.0065288357   2    1000035    3
    0.0012594576   2    1000022    3
    0.00076142022   2   -1000024    4
    0.00027113404   2    1000023    3

DECAY 2000003  1.2962764
    0.99660095   2    1000035    3
    0.0013160611   2   -1000024    4
    0.0011418003   2    1000023    3
    0.00093757559   2    1000022    3

DECAY 1000005  84.461842
    0.70112441   2   -1000024    6
    0.17392613   2   -1000037    6
    0.084953761   2    1000025    5
    0.019631771   2    1000022    5
    0.019209153   2    1000023    5
    0.0011547746   2    1000035    5

DECAY 2000005  20.801866
    0.23398397   2   -1000024    6
    0.23019774   2    1000006   -37
    0.11770475   2    1000022    5
    0.11710791   2    1000023    5
    0.11569393   2    1000005    36
    0.11568688   2    1000005    35
    0.069419162   2    1000035    5
    0.00013665838   2   -1000037    6

DECAY 2000002  0.00017487514
    0.63010359   2    1000023    2
    0.36989491   2    1000022    2

DECAY 1000002  32.81963
    0.65660299   2    1000037    1
    0.32915228   2    1000025    2
    0.0064558829   2    1000035    2
    0.0059363695   2    1000024    1
    0.0014598886   2    1000022    2
    0.00039258804   2    1000023    2

DECAY 2000004  0.00030848911
    0.46307688   2    1000023    4
    0.31797208   2    1000022    4
    0.21895103   2    1000024    3

DECAY 1000004  32.822383
    0.6565477   2    1000037    3
    0.32912436   2    1000025    4
    0.0064553303   2    1000035    4
    0.005980169   2    1000024    3
    0.0014794625   2    1000022    4
    0.00041240533   2    1000023    4

DECAY 1000006  84.419247
    0.35173315   2    1000023    6
    0.34856468   2    1000022    6
    0.17063526   2    1000037    5
    0.084065583   2    1000025    6
    0.038225402   2    1000024    5
    0.0056410227   3    1000022    24    5
    0.0011280384   2    1000035    6

DECAY 2000006  290.16989
    0.31957299   2    1000024    5
    0.16033733   2    1000023    6
    0.15931401   2    1000022    6
    0.14572232   2    1000005    24
    0.11004156   2    1000006    25
    0.073056327   2    1000006    23
    0.02128794   2    1000035    6
    0.0050346101   2    1000005    37
    0.0025363504   2    1000006    36
    0.0024971463   2    1000006    35
    0.00039841952   2    1000037    5
    0.00020099835   2    1000025    6

DECAY 1000024  7.5782192e-13
    0.6099083   3    1000022   -1    2
    0.20335587   3    1000022   -11    12
    0.18673582   3    1000022   -13    14

DECAY 1000037  23.850636
    0.15240815   2    1000024    25
    0.15191014   2    1000022    24
    0.15169118   2    1000023    24
    0.15082597   2    1000024    23
    0.092075739   2    37    1000022
    0.076544494   2    1000024    36
    0.07616499   2    1000024    35
    0.075641035   2    37    1000023
    0.014823628   2    1000014   -13
    0.014823062   2    1000012   -11
    0.01451751   2   -1000013    14
    0.014516946   2   -1000011    12
    0.0055970553   3    1000024    6   -6
    0.0045756566   3    1000023   -5    6
    0.0038825131   3    1000022   -5    6

DECAY 1000022 -1


DECAY 1000023  8.6790129e-09
    0.86356803   2    1000022    22
    0.033067704   3    1000022    12   -12
    0.02472667   3    1000022    1   -1
    0.024494431   3    1000022    3   -3
    0.019285182   3    1000022    2   -2
    0.005620509   3    1000024    1   -2
    0.005620509   3   -1000024   -1    2
    0.0055801666   3    1000022    11   -11
    0.0054977695   3    1000022    13   -13
    0.0018735046   3    1000024    11   -12
    0.0018735046   3   -1000024   -11    12
    0.0018573644   3    1000024    13   -14
    0.0018573644   3   -1000024   -13    14
    0.0016148602   3    1000022    4   -4
    0.0016086982   3    1000024    3   -4
    0.0016086982   3   -1000024   -3    4
    0.00012251905   3    1000024    15   -16
    0.00012251905   3   -1000024   -15    16

DECAY 1000025  26.175259
    0.13921727   2    1000024   -24
    0.13921727   2   -1000024    24
    0.11271665   2    1000023    23
    0.11179118   2    1000022    25
    0.08539075   2    1000023    25
    0.083241803   2    37   -1000024
    0.083241803   2   -37    1000024
    0.072291488   2    1000023    35
    0.054519708   2    1000022    35
    0.02604273   2    1000022    23
    0.015381285   2    1000022    36
    0.011420363   2    1000023    36
    0.0067660741   2    1000014   -14
    0.0067660741   2   -1000014    14
    0.0067658123   2    1000012   -12
    0.0067658123   2   -1000012    12
    0.0065808397   2    1000013   -13
    0.0065808397   2   -1000013    13
    0.0065805811   2    1000011   -11
    0.0065805811   2   -1000011    11
    0.0039551991   3    1000024    5   -6
    0.0039551991   3   -1000024   -5    6
    0.0022314005   3    1000022    6   -6
    0.0019753394   3    1000023    6   -6

DECAY 1000035  39.283163
    0.15640882   2    2000004   -4
    0.15640882   2   -2000004    4
    0.15640878   2    2000002   -2
    0.15640878   2   -2000002    2
    0.034693172   2    1000024   -24
    0.034693172   2   -1000024    24
    0.029323522   2    37   -1000024
    0.029323522   2   -37    1000024
    0.027762851   2    1000022    25
    0.022765126   2    1000023    35
    0.021969153   2    1000022    23
    0.021061815   2    1000023    25
    0.017173699   2    1000022    35
    0.012835038   2    1000014   -14
    0.012835038   2   -1000014    14
    0.012834942   2    1000012   -12
    0.012834942   2   -1000012    12
    0.012746685   2    1000023    23
    0.012731314   2    1000013   -13
    0.012731314   2   -1000013    13
    0.01273122   2    1000011   -11
    0.01273122   2   -1000011    11
    0.0089923762   2    1000022    36
    0.0067025424   2    1000023    36
    0.0013793661   3    1000024    5   -6
    0.0013793661   3   -1000024   -5    6
    0.0010778091   3    1000022    6   -6
    0.00097164678   3    1000023    6   -6

DECAY 1000021  556.27781
    0.12871594   2    2000004   -4
    0.12871594   2   -2000004    4
    0.12871592   2    2000002   -2
    0.12871592   2   -2000002    2
    0.052536647   2    1000005   -5
    0.052536647   2   -1000005    5
    0.051929528   2    1000006   -6
    0.051929528   2   -1000006    6
    0.027680417   2    1000004   -4
    0.027680417   2   -1000004    4
    0.0276804   2    1000002   -2
    0.0276804   2   -1000002    2
    0.027649128   2    1000003   -3
    0.027649128   2   -1000003    3
    0.027649099   2    1000001   -1
    0.027649099   2   -1000001    1
    0.0094875304   2    2000003   -3
    0.0094875304   2   -2000003    3
    0.0094875074   2    2000001   -1
    0.0094875074   2   -2000001    1
    0.0050231033   2    2000005   -5
    0.0050231033   2   -2000005    5
    0.002789004   2    2000006   -6
    0.002789004   2   -2000006    6
    0.00061687078   2    1000006   -4
    0.00061687078   2   -1000006    4

DECAY 25  0.0039427514
    0.61339663   2   -5    5
    0.20348917   2   -24    24
    0.070274729   2   -15    15
    0.056838201   2    21    21
    0.027655984   2   -4    4
    0.024175794   2    23    23
    0.0023635479   2    22    22
    0.0013311174   2    22    23
    0.00024400309   2   -13    13
    0.00023004264   2   -3    3
    6.3604284e-07   2   -1    1
    1.4252117e-07   2   -2    2
    5.4854727e-09   2   -11    11

DECAY 35  2.7721733
    0.83018096   2   -5    5
    0.12363522   2   -15    15
    0.041457321   2   -6    6
    0.002592886   2    25    25
    0.00043799768   2   -13    13
    0.00043584807   2   -24    24
    0.00031650396   2   -3    3
    0.00029814368   2   -1000002    1000002
    0.00029797524   2   -1000004    1000004
    0.00024081666   2    23    23
    0.00010424362   2    21    21
    8.7506719e-07   2   -1    1
    7.8054372e-07   2   -4    4
    2.8749963e-07   2    22    22
    1.2581645e-07   2    22    23
    9.8414772e-09   2   -11    11
    4.0251987e-12   2   -2    2

DECAY 36  2.7483778
    0.82586086   2   -5    5
    0.12298286   2   -15    15
    0.04973994   2   -6    6
    0.00043567735   2   -13    13
    0.00039252915   2    23    25
    0.00031483222   2   -3    3
    0.00027112548   2    21    21
    8.7044495e-07   2   -1    1
    7.1509519e-07   2   -4    4
    4.534445e-07   2    22    22
    1.2371419e-07   2    22    23
    9.789346e-09   2   -11    11
    3.6881214e-12   2   -2    2
    8.595505e-38   2    25    25

DECAY 37  2.338684
    0.86184975   2   -5    6
    0.13545101   2   -15    16
    0.0013054018   2   -5    4
    0.00047887305   2   -13    14
    0.00047689854   2    24    25
    0.00032429273   2   -3    4
    8.4729858e-05   2   -3    6
    1.4872376e-05   2   -3    2
    9.3219612e-06   2   -5    2
    3.8668305e-06   2   -1    6
    8.9750134e-07   2   -1    2
    8.0625431e-08   2   -1    4
    1.1200891e-08   2   -11    12
    1.3625382e-09   2    24    36
    1.188044e-09   2    24    35

DECAY 6  2.43
    1   2    5    24

DECAY 15 -1
