BLOCK SPINFO
   1   SPheno
   2   v4.0.5be

BLOCK SPHENOINFO
   1   2
   2   2

BLOCK MODSEL
   1   0

BLOCK MINPAR
   3    38.849611
   4   -1

BLOCK EXTPAR
   0    4104.4761
   1   -1437.8694
   2    167.1137
   3    4000
   11    1255.4105
   12    980.04534
   13    1912.8017
   23   -135.19124
   25    37.747642
   26    2000
   31    887.51033
   32    887.51033
   33    2000
   34    269.85774
   35    269.85774
   36    2000
   41    4000
   42    4000
   43    4000
   44    4000
   45    4000
   46    4000
   47    4000
   48    4000
   49    4000

BLOCK SMINPUTS
   1    127.90897
   2    1.1663787e-05
   3    0.1184
   4    91.1876
   5    4.18
   6    173.2
   7    1.777
   8    0
   11    0.00051099893
   12    0
   13    0.10565837
   14    0
   21    0.005
   22    0.0025
   23    0.095
   24    1.27

BLOCK GAUGE Q=  4104.4761
   1    0.35536298
   2    0.66519887
   3    1.219778

BLOCK YU Q=  4104.4761
   1   1    8.3873137e-06
   2   2    0.0042607554
   3   3    1.0132549

BLOCK YD Q=  4104.4761
   1   1    0.00063619897
   2   2    0.012087781
   3   3    0.63091002

BLOCK YE Q=  4104.4761
   1   1    0.00011102137
   2   2    0.022955699
   3   3    0.38607709

BLOCK AU Q=  4104.4761
   1   1    0
   2   2    0
   3   3    1255.4106

BLOCK AD Q=  4104.4761
   1   1    0
   2   2    0
   3   3    980.04534

BLOCK AE Q=  4104.4761
   1   1    0
   2   2    0
   3   3    1912.8017

BLOCK MSOFT Q=  4104.4761
   1   -1437.8694
   2    167.1137
   3    4000
   21    4228926.8
   22    365614.83
   31    887.51033
   32    887.51033
   33    2000
   34    269.85774
   35    269.85774
   36    2000
   41    4000
   42    4000
   43    4000
   44    4000
   45    4000
   46    4000
   47    4000
   48    4000
   49    4000

BLOCK MASS
   6    173.2
   23    91.1876
   24    80.429995
   15    1.777
   25    123.21586
   35    1998.982
   36    2000
   37    2001.0079
   1000001    4155.2641
   2000001    4143.7256
   1000002    4154.4794
   2000002    4143.7236
   1000003    4155.2593
   2000003    4143.7168
   1000004    4154.4746
   2000004    4143.7227
   1000005    4115.4623
   2000005    4120.7847
   1000006    4084.0211
   2000006    4125.0335
   1000011    890.00348
   2000011    333.70687
   1000012    885.98974
   1000013    889.97698
   2000013    333.58023
   1000014    885.9642
   1000015    1990.2188
   2000015    1996.9068
   1000016    1992.9618
   1000021    4249.1637
   1000022    118.33895
   1000023   -165.96745
   1000025    231.42783
   1000035   -1411.8388
   1000024    123.39224
   1000037    235.29401
   1000039    1e-09

BLOCK ALPHA
      -0.025868984

BLOCK HMIX Q=  4104.4761
   1   -135.19124
   2    37.747642
   3    242.9212
   4    4000000

BLOCK STOPMIX
   1   1   -0.42980218
   1   2    0.90292308
   2   1   -0.90292308
   2   2   -0.42980218

BLOCK SBOTMIX
   1   1   -0.97108826
   1   2    0.23872074
   2   1   -0.23872074
   2   2   -0.97108826

BLOCK STAUMIX
   1   1   -0.59238168
   1   2    0.80565746
   2   1   -0.80565746
   2   2   -0.59238168

BLOCK NMIX
   1   1    0.013397814
   1   2    0.58146355
   1   3    0.65402391
   1   4    0.48370793
   2   1   -0.025868736
   2   2   -0.16797084
   2   3    0.67845707
   2   4   -0.71471156
   3   1    0.013264832
   3   2   -0.79604237
   3   3    0.33455908
   3   4    0.50419323
   4   1    0.99948754
   4   2   -0.0015769735
   4   3    0.0043526971
   4   4   -0.031673584

BLOCK UMIX
   1   1   -0.48876554
   1   2   -0.87241518
   2   1    0.87241518
   2   2   -0.48876554

BLOCK VMIX
   1   1   -0.74453136
   1   2    0.66758749
   2   1    0.66758749
   2   2    0.74453136

BLOCK HIGGSBOUNDSINPUTHIGGSCOUPLINGSFERMIONS
       0, 1424.8845,3,36,15,15

BLOCK HIGGSBOUNDSINPUTHIGGSCOUPLINGSBOSONS
       0,4,36,21,21,23

BLOCK SPHENOLOWENERGY
   1    0.0003335718
   2    1.5884164e-06
   3    3.5245645e-05
   4    2.4804361e-15
   5    1.0596154e-10
   6    2.2188043e-08
   7    8.4057528e-14
   8    3.5909386e-09
   9    7.6184889e-07
   10    9.467431e-05
   11    0.97794938
   12    0.54191649
   13    19.35168
   14    0
   15    0
   16    0.0021571565
   17    2.2816592e-15
   18    2.4794123e-11
   19    8.2890946e-11
   20   -4.3394578e-15
   21   -1.8543244e-10
   22   -3.0093952e-08
   23    0
   24    0
   25    0
   26    0
   27    0
   28    0
   29    0
   30    0
   31    0
   39    7.4642463e-05
   40    0
   41    0
   42    0

BLOCK FWCOEF Q=  160
   305   4422   0   0   -0.18881911
   305   4422   0   2   -0.20252438
   305   4322   0   2   -0.0002774481
   305   6421   0   0   -0.095227835
   305   6421   0   2   -0.1112376
   305   6321   0   2   -0.00032302505
   3051111   4133   0   0    1.6278845
   3051111   4133   0   2    1.6280816
   3051111   4233   0   2    0.00014747324
   3051111   4137   0   0   -4.4505766
   3051111   4137   0   2   -4.4481818
   3051111   4237   0   2   -0.0010891288
   3051313   4133   0   0    1.6278845
   3051313   4133   0   2    1.6280803
   3051313   4233   0   2    0.00014747169
   3051313   4137   0   0   -4.4505766
   3051313   4137   0   2   -4.4481831
   3051313   4237   0   2   -0.0010891289
   3051212   4137   0   0    1.5053501
   3051212   4137   0   2    1.5048499
   3051212   4237   0   2    0.00023544729
   3051414   4137   0   0    1.5053501
   3051414   4137   0   2    1.5048499
   3051414   4237   0   2    0.00023544753
   3051616   4137   0   0    1.5053501
   3051616   4137   0   2    1.5048485
   3051616   4237   0   2    0.00023551591

BLOCK IMFWCOEF Q=  160
   305   4422   0   0    3.8582104e-07
   305   4422   0   2   -5.6665906e-06
   305   4322   0   2   -4.2253301e-07
   305   6421   0   0    3.3048124e-07
   305   6421   0   2    3.3212109e-06
   305   6321   0   2   -6.5566356e-08
   3051111   4133   0   2   -2.0910833e-08
   3051111   4233   0   2    3.9388982e-06
   3051111   4137   0   2    1.2563189e-06
   3051111   4237   0   2   -2.9098199e-05
   3051313   4133   0   2   -2.0958653e-08
   3051313   4233   0   2    3.9388907e-06
   3051313   4137   0   2    1.2563666e-06
   3051313   4237   0   2   -2.909822e-05
   3051212   4137   0   2    4.573062e-08
   3051212   4237   0   2    6.290434e-06
   3051414   4137   0   2    4.5732219e-08
   3051414   4237   0   2    6.290434e-06
   3051616   4137   0   2    2.0583091e-08
   3051616   4237   0   2    6.2904351e-06

DECAY 23  2.4952


DECAY 24  2.085


DECAY 2000011  0.00094526196
    0.67245964   2    1000023    11
    0.2433897   2    1000022    11
    0.084091311   2    1000025    11

DECAY 1000011  10.509143
    0.49087297   2   -1000037    12
    0.20170796   2    1000025    11
    0.17131697   2   -1000024    12
    0.12462505   2    1000022    11
    0.011476977   2    1000023    11

DECAY 2000013  0.0052984028
    0.37428945   2   -1000024    14
    0.29200068   2    1000023    13
    0.25907843   2    1000022    13
    0.039809272   2   -1000037    14
    0.034821266   2    1000025    13

DECAY 1000013  10.517604
    0.49045908   2   -1000037    14
    0.2016237   2    1000025    13
    0.17117365   2   -1000024    14
    0.12488739   2    1000022    13
    0.011847581   2    1000023    13

DECAY 1000015  20.593836
    0.41068572   2   -1000024    16
    0.29744067   2    1000022    15
    0.10080079   2    1000023    15
    0.08780458   2    1000035    15
    0.068727386   2   -1000037    16
    0.034539121   2    1000025    15

DECAY 2000015  25.809506
    0.5023617   2   -1000037    16
    0.22868907   2    1000025    15
    0.13894882   2    1000023    15
    0.074016678   2    1000022    15
    0.050031744   2    1000035    15
    0.0059505805   2   -1000024    16

DECAY 1000012  10.671161
    0.38958594   2    1000024    11
    0.28140951   2    1000037    11
    0.20464832   2    1000025    12
    0.11627103   2    1000022    12
    0.0080851373   2    1000023    12

DECAY 1000014  10.679511
    0.38990676   2    1000024    13
    0.28135742   2    1000037    13
    0.20448068   2    1000025    14
    0.11617652   2    1000022    14
    0.0080785487   2    1000023    14

DECAY 1000016  32.299018
    0.43703588   2    1000024    15
    0.27783621   2    1000037    15
    0.17048689   2    1000025    16
    0.088947119   2    1000022    16
    0.019328317   2    1000035    16
    0.006364468   2    1000023    16

DECAY 2000001  1.8094454
    0.99788403   2    1000035    1
    0.00086129309   2    1000023    1
    0.00077368126   2    1000039    1
    0.00023699658   2    1000022    1
    0.00022561268   2    1000025    1

DECAY 1000001  55.044244
    0.50254706   2   -1000037    2
    0.2104929   2    1000025    1
    0.15847281   2   -1000024    2
    0.11123972   2    1000022    1
    0.008839569   2    1000023    1
    0.0083821568   2    1000035    1

DECAY 2000003  1.8333939
    0.98484616   2    1000035    3
    0.0049915259   2   -1000024    4
    0.0038561523   2    1000023    3
    0.0030317902   2    1000022    3
    0.0015593853   2   -1000037    4
    0.00095142084   2    1000025    3
    0.00076356701   2    1000039    3

DECAY 1000003  55.057684
    0.50243891   2   -1000037    4
    0.21046558   2    1000025    3
    0.15844597   2   -1000024    4
    0.11130588   2    1000022    3
    0.0089377749   2    1000023    3
    0.0083800987   2    1000035    3

DECAY 1000005  164.57671
    0.38422909   2   -1000037    6
    0.31170241   2   -1000024    6
    0.14498735   2    1000022    5
    0.086481386   2    1000023    5
    0.06948707   2    1000025    5
    0.0031044778   2    1000035    5

DECAY 2000005  72.701151
    0.26380069   2   -1000024    6
    0.25120069   2   -1000037    6
    0.22250213   2    1000023    5
    0.13825926   2    1000022    5
    0.10035557   2    1000025    5
    0.023862927   2    1000035    5

DECAY 2000002  7.2333105
    0.99850014   2    1000035    2
    0.00085335898   2    1000023    2
    0.00022926364   2    1000022    2
    0.0002237   2    1000025    2
    0.00019353941   2    1000039    2

DECAY 1000002  55.092219
    0.3673326   2    1000024    1
    0.29395813   2    1000037    1
    0.20778832   2    1000025    2
    0.11296036   2    1000022    2
    0.0098539401   2    1000023    2
    0.0080809104   2    1000035    2

DECAY 2000004  7.2362856
    0.99808896   2    1000035    4
    0.00095832782   2    1000023    4
    0.00027748307   2    1000022    4
    0.00027586265   2    1000025    4
    0.00019345957   2    1000039    4
    0.00011390405   2    1000037    3

DECAY 1000004  55.105656
    0.3674087   2    1000024    3
    0.29393793   2    1000037    3
    0.20774433   2    1000025    4
    0.11293899   2    1000022    4
    0.0098653678   2    1000023    4
    0.0080789517   2    1000035    4

DECAY 1000006  174.93549
    0.3589364   2    1000037    5
    0.22432022   2    1000023    6
    0.2013432   2    1000025    6
    0.099341713   2    1000024    5
    0.07010727   2    1000022    6
    0.030895285   2    1000035    6
    0.011279353   3    1000022    24    5
    0.0034667727   2    1000022    4
    0.00030240255   2    1000023    4

DECAY 2000006  171.45232
    0.37819788   2    1000024    5
    0.27045438   2    1000023    6
    0.1921303   2    1000022    6
    0.10680014   2    1000025    6
    0.039662477   2    1000037    5
    0.012746901   2    1000035    6

DECAY 1000024  6.9141947e-09
    0.38576641   3    1000022   -1    2
    0.28451129   3    1000022   -3    4
    0.12912659   3    1000022   -11    12
    0.12885081   3    1000022   -13    14
    0.071217833   3    1000022   -15    16
    0.00052706735   2    1000039    24

DECAY 1000037  0.2681723
    0.68345521   2    1000022    24
    0.29509464   2    1000024    23
    0.0071523548   3    1000023   -1    2
    0.0071453721   3    1000023   -3    4
    0.0023852799   3    1000023   -13    14
    0.002385191   3    1000023   -11    12
    0.0023803393   3    1000023   -15    16

DECAY 1000022  2.4368535e-12
    0.89143649   2    1000039    22
    0.10856351   2    1000039    23

DECAY 1000023  0.0011194722
    0.10079101   3    1000024    1   -2
    0.10079101   3   -1000024   -1    2
    0.10041673   3    1000024    3   -4
    0.10041673   3   -1000024   -3    4
    0.080101882   3    1000022    12   -12
    0.059822213   3    1000022    1   -1
    0.05981983   3    1000022    3   -3
    0.055402142   3    1000022    5   -5
    0.04666464   3    1000022    2   -2
    0.046273767   3    1000022    4   -4
    0.033609205   3    1000024    13   -14
    0.033609205   3   -1000024   -13    14
    0.033607402   3    1000024    11   -12
    0.033607402   3   -1000024   -11    12
    0.033374677   3    1000024    15   -16
    0.033374677   3   -1000024   -15    16
    0.013473504   3    1000022    13   -13
    0.013471727   3    1000022    11   -11
    0.013281887   3    1000022    15   -15
    0.0080903493   2    1000022    22

DECAY 1000025  0.40742348
    0.49622406   2    1000024   -24
    0.49622406   2   -1000024    24
    0.0032085092   2    1000022    23
    0.00086542847   3    1000023    12   -12
    0.00064845965   3    1000023    1   -1
    0.00064844906   3    1000023    3   -3
    0.00062610596   3    1000023    5   -5
    0.00050559654   3    1000023    2   -2
    0.0005036188   3    1000023    4   -4
    0.00014680083   3    1000023    13   -13
    0.00014678483   3    1000023    11   -11
    0.00014533451   3    1000023    15   -15

DECAY 1000035  19.207516
    0.16445536   2    2000013   -13
    0.16445536   2   -2000013    13
    0.16444057   2    2000011   -11
    0.16444057   2   -2000011    11
    0.030949421   2    1000023    25
    0.025700548   2    1000024   -24
    0.025700548   2   -1000024    24
    0.023145498   2    1000037   -24
    0.023145498   2   -1000037    24
    0.018578731   2    1000023    23
    0.017048817   2    1000014   -14
    0.017048817   2   -1000014    14
    0.01704754   2    1000012   -12
    0.01704754   2   -1000012    12
    0.016650443   2    1000013   -13
    0.016650443   2   -1000013    13
    0.016649136   2    1000011   -11
    0.016649136   2   -1000011    11
    0.016140729   2    1000022    23
    0.014007666   2    1000025    23
    0.013373478   2    1000022    25
    0.012089723   2    1000025    25
    0.00081352931   3    1000023    6   -6
    0.00079269363   3    1000024    5   -6
    0.00079269363   3   -1000024   -5    6
    0.00067495263   3    1000037    5   -6
    0.00067495263   3   -1000037   -5    6
    0.00042717213   3    1000022    6   -6
    0.00030452111   3    1000025    6   -6

DECAY 1000021  7.5234703
    0.14583935   3    1000023    6   -6
    0.12062151   3    1000025    6   -6
    0.082392512   3    1000037    5   -6
    0.082392512   3   -1000037   -5    6
    0.057221426   3    1000022    6   -6
    0.037326102   3    1000024    5   -6
    0.037326102   3   -1000024   -5    6
    0.032526795   2    1000005   -5
    0.032526795   2   -1000005    5
    0.029136321   2    2000005   -5
    0.029136321   2   -2000005    5
    0.02008273   2    2000003   -3
    0.02008273   2   -2000003    3
    0.020080161   2    2000002   -2
    0.020080161   2   -2000002    2
    0.020079413   2    2000001   -1
    0.020079413   2   -2000001    1
    0.020079064   2    2000004   -4
    0.020079064   2   -2000004    4
    0.016234132   2    1000004   -4
    0.016234132   2   -1000004    4
    0.016233932   2    1000002   -2
    0.016233932   2   -1000002    2
    0.01597058   2    1000003   -3
    0.01597058   2   -1000003    3
    0.01596896   2    1000001   -1
    0.01596896   2   -1000001    1
    0.012512653   3    1000035    6   -6
    0.0048139445   2    1000006   -4
    0.0048139445   2   -1000006    4
    0.00082847916   2    1000023    21
    0.00045971448   2    1000022    21
    0.0004548078   2    1000025    21
    0.00021098506   2    1000039    21

DECAY 25  0.0036746905
    0.6013467   2   -5    5
    0.1992735   2   -24    24
    0.073481893   2    21    21
    0.06897397   2   -15    15
    0.029524303   2   -4    4
    0.023274085   2    23    23
    0.0023112106   2    22    22
    0.001348642   2    22    23
    0.0002390781   2   -13    13
    0.00022584059   2   -3    3
    6.2442613e-07   2   -1    1
    1.5215111e-07   2   -2    2
    5.3747626e-09   2   -11    11

DECAY 35  67.492587
    0.54393744   2   -5    5
    0.10636441   2   -1000024    1000024
    0.092393153   2   -15    15
    0.053814991   2   -1000024    1000037
    0.053814991   2   -1000037    1000024
    0.041269567   2    1000023    1000025
    0.033656225   2    1000022    1000022
    0.022691179   2   -1000037    1000037
    0.018104538   2    1000022    1000025
    0.015195655   2    1000025    1000025
    0.0064763483   2    1000022    1000023
    0.0043077625   2    1000022    1000035
    0.0030705929   2    1000023    1000023
    0.0025576988   2    1000023    1000035
    0.00099715328   2    1000025    1000035
    0.0008105173   2   -6    6
    0.00031455484   2   -13    13
    0.00020672368   2   -3    3
    1.0702152e-05   2    21    21
    3.3204734e-06   2    25    25
    5.7152683e-07   2   -1    1
    5.1070235e-07   2    23    23
    3.0294982e-07   2    22    23
    2.7094553e-07   2   -24    24
    1.1460589e-07   2    22    22
    8.2535686e-08   2   -1000011    1000011
    8.1769438e-08   2   -1000013    1000013
    6.0657677e-08   2   -2000011    2000011
    6.0227047e-08   2   -2000013    2000013
    1.1163995e-08   2   -4    4
    7.0656204e-09   2   -11    11
    3.7271931e-10   2   -2000013    1000013
    3.7271931e-10   2   -1000013    2000013
    5.7555889e-14   2   -2    2
    8.7179639e-15   2   -2000011    1000011
    8.7179639e-15   2   -1000011    2000011

DECAY 36  64.810183
    0.53094827   2   -5    5
    0.10690388   2   -1000024    1000024
    0.090190078   2   -15    15
    0.05995896   2   -1000024    1000037
    0.05995896   2   -1000037    1000024
    0.045391068   2    1000023    1000025
    0.032884308   2    1000022    1000022
    0.019797176   2   -1000037    1000037
    0.018629584   2    1000022    1000025
    0.01402496   2    1000025    1000025
    0.0081327739   2    1000022    1000023
    0.00467436   2    1000023    1000035
    0.0036518806   2    1000023    1000023
    0.0030838442   2    1000022    1000035
    0.00078761607   2   -6    6
    0.00045186691   2    1000025    1000035
    0.00030705387   2   -13    13
    0.00020178179   2   -3    3
    2.0112731e-05   2    21    21
    7.1866455e-07   2    23    25
    5.5786404e-07   2   -1    1
    1.6272937e-07   2    22    23
    1.7457375e-08   2    22    22
    1.0494205e-08   2   -4    4
    6.8971259e-09   2   -11    11
    3.8598692e-10   2   -2000013    1000013
    3.8598692e-10   2   -1000013    2000013
    5.4107809e-14   2   -2    2
    1.8533626e-14   2    23    35
    9.0282736e-15   2   -2000011    1000011
    9.0282736e-15   2   -1000011    2000011
    1.9048139e-38   2    25    25

DECAY 37  65.38906
    0.53314439   2   -5    6
    0.14894749   2    1000022    1000037
    0.10140953   2    1000024    1000025
    0.092365947   2   -15    16
    0.069359514   2    1000023    1000037
    0.04464312   2    1000023    1000024
    0.0064924956   2    1000024    1000035
    0.0015723318   2    1000035    1000037
    0.00079239868   2   -5    4
    0.00065774466   2    1000022    1000024
    0.00032654688   2   -13    14
    0.00018857787   2   -3    4
    8.2184194e-05   2    1000025    1000037
    8.7899434e-06   2   -3    2
    5.6585469e-06   2   -5    2
    1.4558868e-06   2   -3    6
    7.1439721e-07   2    24    25
    5.2323012e-07   2   -1    2
    2.4747512e-07   2   -2000011    1000012
    2.4684603e-07   2   -2000013    1000014
    5.4135831e-08   2   -1    6
    2.4817482e-08   2   -1    4
    7.6379656e-09   2   -11    12
    7.3927831e-10   2   -1000013    1000014
    7.1008685e-13   2    24    35
    2.1649993e-14   2    24    36
    1.7290973e-14   2   -1000011    1000012

DECAY 6  2.43
    1   2    5    24

DECAY 15 -1


DECAY 1000039 -1
