BLOCK SPINFO
   1   SPheno
   2   v4.0.5be

BLOCK SPHENOINFO
   1   2
   2   2

BLOCK MODSEL
   1   0

BLOCK MINPAR
   3    17.459106
   4    1

BLOCK EXTPAR
   0    1472.3104
   1   -315.04952
   2    651.54861
   3    3000
   11    3845.9904
   12   -532.48327
   13   -841.16409
   23    329.05285
   25    16.766752
   26    343.97147
   31    826.13267
   32    826.13267
   33    1016.0978
   34    829.39855
   35    829.39855
   36    1592.819
   41    5000
   42    5000
   43    1269.7938
   44    5000
   45    5000
   46    1881.1923
   47    5000
   48    5000
   49    1293.4931

BLOCK SMINPUTS
   1    127.90897
   2    1.1663787e-05
   3    0.1184
   4    91.1876
   5    4.18
   6    173.2
   7    1.777
   8    0
   11    0.00051099893
   12    0
   13    0.10565837
   14    0
   21    0.005
   22    0.0025
   23    0.095
   24    1.27

BLOCK GAUGE Q=  1472.3104
   1    0.35536298
   2    0.66519887
   3    1.219778

BLOCK YU Q=  1472.3104
   1   1    8.3992711e-06
   2   2    0.0042668297
   3   3    1.0146994

BLOCK YD Q=  1472.3104
   1   1    0.0002829898
   2   2    0.0053768063
   3   3    0.28063721

BLOCK YE Q=  1472.3104
   1   1    4.938379e-05
   2   2    0.010211002
   3   3    0.17173225

BLOCK AU Q=  1472.3104
   1   1    0
   2   2    0
   3   3    3845.9904

BLOCK AD Q=  1472.3104
   1   1    0
   2   2    0
   3   3   -532.48327

BLOCK AE Q=  1472.3104
   1   1    0
   2   2    0
   3   3   -841.16409

BLOCK MSOFT Q=  1472.3104
   1   -315.04952
   2    651.54861
   3    3000
   21    5730.7726
   22   -51544.739
   31    826.13267
   32    826.13267
   33    1016.0978
   34    829.39855
   35    829.39855
   36    1592.819
   41    5000
   42    5000
   43    1269.7938
   44    5000
   45    5000
   46    1881.1923
   47    5000
   48    5000
   49    1293.4931

BLOCK MASS
   6    173.2
   23    91.1876
   24    80.429995
   15    1.777
   25    125.37221
   35    344.17105
   36    343.97147
   37    353.514
   1000001    5029.3692
   2000001    5018.9711
   1000002    5028.9424
   2000002    5020.5086
   1000003    5029.3702
   2000003    5018.9722
   1000004    5028.9434
   2000004    5020.5094
   1000005    1240.815
   2000005    1302.8905
   1000006    1174.6023
   2000006    1845.4738
   1000011    834.3873
   2000011    831.38345
   1000012    830.33837
   1000013    834.42753
   2000013    831.33819
   1000014    830.33669
   1000015    1021.9956
   2000015    1593.5669
   1000016    1018.6649
   1000021    3189.8742
   1000022   -294.13711
   1000023    324.47083
   1000025   -355.42819
   1000035    692.08744
   1000024    325.03474
   1000037    692.30737

BLOCK ALPHA
      -0.070090555

BLOCK HMIX Q=  1472.3104
   1    329.05285
   2    16.766752
   3    243.98485
   4    118316.37

BLOCK STOPMIX
   1   1   -0.95687441
   1   2    0.29050192
   2   1   -0.29050192
   2   2   -0.95687441

BLOCK SBOTMIX
   1   1    0.99586634
   1   2    0.090830778
   2   1   -0.090830778
   2   2    0.99586634

BLOCK STAUMIX
   1   1    0.99997105
   1   2    0.0076097806
   2   1   -0.0076097806
   2   2    0.99997105

BLOCK NMIX
   1   1    0.80872754
   1   2    0.030036656
   1   3    0.44264273
   1   4    0.38616702
   2   1   -0.050066806
   2   2   -0.1647926
   2   3    0.70386709
   2   4   -0.68913557
   3   1   -0.58600615
   3   2    0.043663382
   3   3    0.54977713
   3   4    0.5936627
   4   1    0.0070617071
   4   2   -0.9849034
   4   3   -0.079897634
   4   4    0.15340076

BLOCK UMIX
   1   1   -0.11328626
   1   2    0.99356239
   2   1    0.99356239
   2   2    0.11328626

BLOCK VMIX
   1   1   -0.21753931
   1   2    0.97605156
   2   1    0.97605156
   2   2    0.21753931

BLOCK HIGGSBOUNDSINPUTHIGGSCOUPLINGSFERMIONS
       0, 281.12397,3,36,15,15

BLOCK HIGGSBOUNDSINPUTHIGGSCOUPLINGSBOSONS
       0,4,36,21,21,23

BLOCK SPHENOLOWENERGY
   1    0.00046969465
   2    1.5966632e-06
   3    3.5225531e-05
   4    2.4326561e-15
   5    1.0392021e-10
   6    2.1749064e-08
   7    8.1538473e-14
   8    3.4833173e-09
   9    7.3861763e-07
   10    8.1983726e-05
   11    0.8468605
   12    0.54347335
   13    19.376398
   14    0
   15    0
   16    0.0021650716
   17    2.2817535e-15
   18    2.4790193e-11
   19    8.2877152e-11
   20    4.7301784e-15
   21    2.0222677e-10
   22    5.7547705e-08
   23    0
   24    0
   25    0
   26    0
   27    0
   28    0
   29    0
   30    0
   31    0
   39    7.0807596e-05
   40    0
   41    0
   42    0

BLOCK FWCOEF Q=  160
   305   4422   0   0   -0.18881911
   305   4422   0   2   -0.33316836
   305   4322   0   2   -0.0025108647
   305   6421   0   0   -0.095227835
   305   6421   0   2   -0.2296906
   305   6321   0   2   -0.0024618229
   3051111   4133   0   0    1.5911453
   3051111   4133   0   2    1.5921431
   3051111   4233   0   2   -7.3160881e-05
   3051111   4137   0   0   -4.4138374
   3051111   4137   0   2   -4.4094047
   3051111   4237   0   2    0.00057274207
   3051313   4133   0   0    1.5911453
   3051313   4133   0   2    1.5921424
   3051313   4233   0   2   -7.3174471e-05
   3051313   4137   0   0   -4.4138374
   3051313   4137   0   2   -4.4094054
   3051313   4237   0   2    0.00057275548
   3051212   4137   0   0    1.5053501
   3051212   4137   0   2    1.5044057
   3051212   4237   0   2   -0.00012485698
   3051414   4137   0   0    1.5053501
   3051414   4137   0   2    1.5044057
   3051414   4237   0   2   -0.00012485402
   3051616   4137   0   0    1.5053501
   3051616   4137   0   2    1.5044055
   3051616   4237   0   2   -0.00012402088

BLOCK IMFWCOEF Q=  160
   305   4422   0   0    3.8579609e-07
   305   4422   0   2    1.6460101e-05
   305   4322   0   2   -1.7882303e-06
   305   6421   0   0    3.3045986e-07
   305   6421   0   2   -1.2886587e-06
   305   6321   0   2   -8.1811378e-07
   3051111   4133   0   2   -1.6288623e-06
   3051111   4233   0   2    1.0380839e-06
   3051111   4137   0   2    1.2044205e-05
   3051111   4237   0   2   -8.0766871e-06
   3051313   4133   0   2   -1.6288574e-06
   3051313   4233   0   2    1.038083e-06
   3051313   4137   0   2    1.2044213e-05
   3051313   4237   0   2   -8.0766898e-06
   3051212   4137   0   2   -2.2175329e-06
   3051212   4237   0   2    1.7603472e-06
   3051414   4137   0   2   -2.2175329e-06
   3051414   4237   0   2    1.7603472e-06
   3051616   4137   0   2   -2.2208537e-06
   3051616   4237   0   2    1.7603507e-06

DECAY 23  2.4952


DECAY 24  2.085


DECAY 2000011  3.0566436
    0.68409092   2    1000022    11
    0.31344098   2    1000025    11
    0.0024616627   2    1000023    11

DECAY 1000011  1.9928504
    0.35319582   2   -1000037    12
    0.30176111   2    1000022    11
    0.17269012   2    1000035    11
    0.089609656   2    1000025    11
    0.048707963   2    1000023    11
    0.03403533   2   -1000024    12

DECAY 2000013  3.0588108
    0.68363067   2    1000022    13
    0.31330197   2    1000025    13
    0.0026605369   2    1000023    13
    0.0003993824   2   -1000024    14

DECAY 1000013  1.9946514
    0.35304432   2   -1000037    14
    0.30164309   2    1000022    13
    0.17261679   2    1000035    13
    0.089711576   2    1000025    13
    0.048976816   2    1000023    13
    0.034007413   2   -1000024    14

DECAY 1000015  5.6402588
    0.46082883   2   -1000037    16
    0.22517727   2    1000035    15
    0.16156253   2    1000022    15
    0.068805034   2    1000025    15
    0.066513308   2    1000023    15
    0.017113027   2   -1000024    16

DECAY 2000015  9.3896263
    0.53778987   2    1000022    15
    0.29241663   2    1000025    15
    0.089678458   2   -1000024    16
    0.046931133   2    1000023    15
    0.012179031   2    1000016   -37
    0.006145549   2    1000015    36
    0.0060813949   2    1000015    35
    0.0034046616   2    1000016   -24
    0.0016876301   2    1000015    25
    0.001663473   2    1000015    23
    0.0013320851   2   -1000037    16
    0.00069007931   2    1000035    15

DECAY 1000012  2.0399971
    0.31720123   2    1000037    11
    0.22142212   2    1000022    12
    0.16320168   2    1000035    12
    0.15208434   2    1000025    12
    0.12158029   2    1000024    11
    0.024510336   2    1000023    12

DECAY 1000014  2.0411917
    0.31701077   2    1000037    13
    0.22129182   2    1000022    14
    0.16310282   2    1000035    14
    0.15199475   2    1000025    14
    0.12210394   2    1000024    13
    0.024495906   2    1000023    14

DECAY 1000016  5.6822491
    0.43584582   2    1000037    15
    0.22358546   2    1000035    16
    0.14383896   2    1000024    15
    0.10714071   2    1000022    16
    0.077448528   2    1000025    16
    0.012140523   2    1000023    16

DECAY 2000001  143.5316
    0.98063275   2    1000021    1
    0.012680771   2    1000022    1
    0.0066369361   2    1000025    1

DECAY 1000001  206.48257
    0.6869061   2    1000021    1
    0.20372172   2   -1000037    2
    0.10035136   2    1000035    1
    0.0027288668   2   -1000024    2
    0.0025833182   2    1000023    1
    0.0023254201   2    1000025    1
    0.0013832128   2    1000022    1

DECAY 2000003  143.53742
    0.98059377   2    1000021    3
    0.012684159   2    1000022    3
    0.006642672   2    1000025    3

DECAY 1000003  206.48735
    0.6868907   2    1000021    3
    0.20371745   2   -1000037    4
    0.10034915   2    1000035    3
    0.002737127   2   -1000024    4
    0.0025901209   2    1000023    3
    0.0023295484   2    1000025    3
    0.0013858988   2    1000022    3

DECAY 1000005  30.12249
    0.65678292   2   -1000024    6
    0.19444436   2   -1000037    6
    0.082491827   2    1000035    5
    0.033144269   2    1000023    5
    0.016601827   2    1000025    5
    0.016534788   2    1000022    5

DECAY 2000005  4.4415606
    0.4186132   2   -1000024    6
    0.19075485   2    1000025    5
    0.18909468   2    1000023    5
    0.15432591   2    1000022    5
    0.026748437   2   -1000037    6
    0.012532281   2    1000035    5
    0.0079306398   2    1000006   -24

DECAY 2000002  152.03444
    0.92684125   2    1000021    2
    0.047901119   2    1000022    2
    0.025070776   2    1000025    2
    0.00018331243   2    1000023    2

DECAY 1000002  206.48126
    0.68669523   2    1000021    2
    0.19658737   2    1000037    1
    0.099831666   2    1000035    2
    0.010061674   2    1000024    1
    0.0032252913   2    1000022    2
    0.0032078664   2    1000023    2
    0.00039090106   2    1000025    2

DECAY 2000004  152.03806
    0.92681931   2    1000021    4
    0.047901769   2    1000022    4
    0.025074326   2    1000025    4
    0.000188943   2    1000023    4

DECAY 1000004  206.48598
    0.68667975   2    1000021    4
    0.19658309   2    1000037    3
    0.099829611   2    1000035    4
    0.010075117   2    1000024    3
    0.0032265199   2    1000022    4
    0.0032119392   2    1000023    4
    0.00039397281   2    1000025    4

DECAY 1000006  28.591438
    0.32118683   2    1000023    6
    0.21213975   2    1000025    6
    0.16392888   2    1000037    5
    0.14316036   2    1000022    6
    0.09408508   2    1000035    6
    0.065255352   2    1000024    5
    0.00024361903   3    1000022    24    5

DECAY 2000006  198.95514
    0.2878439   2    1000005    24
    0.17083448   2    1000024    5
    0.16978345   2    1000006    23
    0.16310187   2    1000006    25
    0.086071795   2    1000023    6
    0.073655391   2    1000025    6
    0.031608958   2    1000022    6
    0.0070137544   2    1000005    37
    0.0043983368   2    1000006    36
    0.0034817799   2    1000006    35
    0.0018247653   2    2000005    24
    0.00025981269   2    1000035    6

DECAY 1000024  4.0258963e-05
    0.33499871   3    1000022   -1    2
    0.33239874   3    1000022   -3    4
    0.1113954   3    1000022   -11    12
    0.11139144   3    1000022   -13    14
    0.10981572   3    1000022   -15    16

DECAY 1000037  6.9494932
    0.21295003   2    1000023    24
    0.20739027   2    1000024    23
    0.18943883   2    1000024    25
    0.13787717   2    1000025    24
    0.09582017   2    1000022    24
    0.047951416   2    1000024    36
    0.042334598   2    1000024    35
    0.038458306   2    37    1000023
    0.025865128   2    37    1000022
    0.00087334483   3    1000023   -5    6
    0.00054976647   3    1000025   -5    6
    0.0003972324   3    1000022   -5    6

DECAY 1000022 -1


DECAY 1000023  2.8945875e-05
    0.20202682   3    1000022    12   -12
    0.15133711   3    1000022    1   -1
    0.15132076   3    1000022    3   -3
    0.12295537   3    1000022    5   -5
    0.11803196   3    1000022    2   -2
    0.11540296   3    1000022    4   -4
    0.038453835   2    1000022    22
    0.033985842   3    1000022    11   -11
    0.033980358   3    1000022    13   -13
    0.032504978   3    1000022    15   -15

DECAY 1000025  0.00020715612
    0.11509084   3    1000024    1   -2
    0.11509084   3   -1000024   -1    2
    0.11416989   3    1000024    3   -4
    0.11416989   3   -1000024   -3    4
    0.060431802   3    1000023    12   -12
    0.045137231   3    1000023    1   -1
    0.045132553   3    1000023    3   -3
    0.038418408   3    1000024    11   -12
    0.038418408   3   -1000024   -11    12
    0.038416971   3    1000024    13   -14
    0.038416971   3   -1000024   -13    14
    0.037806051   3    1000024    15   -16
    0.037806051   3   -1000024   -15    16
    0.036978743   3    1000023    5   -5
    0.035203057   3    1000023    2   -2
    0.034452593   3    1000023    4   -4
    0.020422908   2    1000023    22
    0.010209573   3    1000023    11   -11
    0.010207985   3    1000023    13   -13
    0.0097476022   3    1000023    15   -15
    0.00089537259   3    1000022    12   -12
    0.00057999159   3    1000022    1   -1
    0.00057998083   3    1000022    3   -3
    0.00057727307   3    1000022    5   -5
    0.00049529738   2    1000022    22
    0.00045440182   3    1000022    2   -2
    0.00045275709   3    1000022    4   -4
    0.00010576764   3    1000022    15   -15

DECAY 1000035  7.800005
    0.19259609   2    1000024   -24
    0.19259609   2   -1000024    24
    0.15072129   2    1000023    25
    0.11476329   2    1000025    23
    0.075588996   2    1000022    23
    0.072068697   2    1000025    25
    0.051568487   2    1000022    25
    0.039039279   2    1000023    35
    0.031695709   2    37   -1000024
    0.031695709   2   -37    1000024
    0.025467675   2    1000022    35
    0.018067204   2    1000023    23
    0.00092875677   2    1000023    36
    0.00090273051   2    1000022    36
    0.0007279305   3    1000024    5   -6
    0.0007279305   3   -1000024   -5    6
    0.00069487621   3    1000025    5   -5

DECAY 1000021  246.82431
    0.1526985   2    1000006   -6
    0.1526985   2   -1000006    6
    0.13769011   2    1000005   -5
    0.13769011   2   -1000005    5
    0.13285059   2    2000005   -5
    0.13285059   2   -2000005    5
    0.076661042   2    2000006   -6
    0.076661042   2   -2000006    6

DECAY 25  0.0050927672
    0.64241949   2   -5    5
    0.18093941   2   -24    24
    0.075989016   2   -15    15
    0.053455648   2    21    21
    0.022064952   2    23    23
    0.021614227   2   -4    4
    0.0018245354   2    22    22
    0.0011823235   2    22    23
    0.00026390979   2   -13    13
    0.00024568983   2   -3    3
    6.7930318e-07   2   -1    1
    1.1138236e-07   2   -2    2
    5.9329798e-09   2   -11    11

DECAY 35  1.7044367
    0.85537915   2   -5    5
    0.13647561   2   -15    15
    0.005533784   2    25    25
    0.00094720202   2   -24    24
    0.00047590507   2   -13    13
    0.00043081696   2    23    23
    0.00039468008   2    21    21
    0.00036041634   2   -3    3
    9.9648769e-07   2   -1    1
    5.9970898e-07   2   -4    4
    5.7221869e-07   2    22    22
    2.5216143e-07   2    22    23
    1.0695618e-08   2   -11    11
    3.0936784e-12   2   -2    2

DECAY 36  1.6861395
    0.86096572   2   -5    5
    0.13732285   2   -15    15
    0.00060673792   2    23    25
    0.00047880718   2   -13    13
    0.00036265143   2   -3    3
    0.00026131724   2    21    21
    1.0026672e-06   2   -1    1
    3.8169187e-07   2    22    22
    3.7178787e-07   2   -4    4
    1.464529e-07   2    22    23
    1.0760838e-08   2   -11    11
    1.9152854e-12   2   -2    2
    2.135809e-35   2    25    25

DECAY 37  1.0415389
    0.78867299   2   -5    6
    0.20689437   2   -15    16
    0.0018805658   2   -5    4
    0.0012108506   2    24    25
    0.0007314818   2   -13    14
    0.00052117471   2   -3    4
    4.7562591e-05   2   -3    6
    2.3658559e-05   2   -3    2
    1.3429516e-05   2   -5    2
    2.1616392e-06   2   -1    6
    1.4442576e-06   2   -1    2
    1.0013833e-07   2    24    36
    9.9442606e-08   2   -1    4
    9.012763e-08   2    24    35
    1.7109438e-08   2   -11    12

DECAY 6  2.43
    1   2    5    24

DECAY 15 -1
