BLOCK SPINFO
   1   SPheno
   2   v4.0.5be

BLOCK SPHENOINFO
   1   2
   2   2

BLOCK MODSEL
   1   0

BLOCK MINPAR
   3    22.35769
   4   -1

BLOCK EXTPAR
   0    2000.1801
   1   -636.08264
   2   -2782.4878
   3    4101.7758
   11   -6605.772
   12   -5165.8835
   13   -1553.0563
   23   -887.54273
   25    21.559556
   26    1451.2258
   31    1784.2995
   32    1784.2995
   33    2571.9612
   34    3575.1421
   35    3575.1421
   36    2811.6564
   41    917.40015
   42    917.40015
   43    975.5528
   44    4959.8999
   45    4959.8999
   46    4168.8444
   47    3094.9374
   48    3094.9374
   49    2833.8186

BLOCK SMINPUTS
   1    127.90897
   2    1.1663787e-05
   3    0.1184
   4    91.1876
   5    4.18
   6    173.2
   7    1.777
   8    0
   11    0.00051099893
   12    0
   13    0.10565837
   14    0
   21    0.005
   22    0.0025
   23    0.095
   24    1.27

BLOCK GAUGE Q=  2000.1801
   1    0.35536298
   2    0.66519887
   3    1.219778

BLOCK YU Q=  2000.1801
   1   1    8.3933863e-06
   2   2    0.0042638403
   3   3    1.0139885

BLOCK YD Q=  2000.1801
   1   1    0.00036362796
   2   2    0.0069089313
   3   3    0.360605

BLOCK YE Q=  2000.1801
   1   1    6.3455739e-05
   2   2    0.013120634
   3   3    0.22066748

BLOCK AU Q=  2000.1801
   1   1    0
   2   2    0
   3   3   -6605.7718

BLOCK AD Q=  2000.1801
   1   1    0
   2   2    0
   3   3   -5165.8829

BLOCK AE Q=  2000.1801
   1   1    0
   2   2    0
   3   3   -1553.0563

BLOCK MSOFT Q=  2000.1801
   1   -636.08264
   2   -2782.4878
   3    4101.7758
   21    1250016.4
   22   -1201653
   31    1784.2995
   32    1784.2995
   33    2571.9612
   34    3575.1421
   35    3575.1421
   36    2811.6564
   41    917.40015
   42    917.40015
   43    975.5528
   44    4959.8999
   45    4959.8999
   46    4168.8444
   47    3094.9374
   48    3094.9374
   49    2833.8186

BLOCK MASS
   6    173.2
   23    91.1876
   24    80.429995
   15    1.777
   25    124.48587
   35    1451.2159
   36    1451.2258
   37    1453.6618
   1000001    827.57208
   2000001    3135.3931
   1000002    823.89602
   2000002    5001.2202
   1000003    827.57305
   2000003    3135.3915
   1000004    823.8973
   2000004    5001.22
   1000005    979.33185
   2000005    2850.5974
   1000006    957.36816
   2000006    4178.8737
   1000011    1813.0627
   2000011    3567.701
   1000012    1811.0043
   1000013    1813.0609
   2000013    3567.6946
   1000014    1811.0026
   1000015    2594.428
   2000015    2798.8914
   1000016    2593.0615
   1000021    4094.3601
   1000022   -633.96917
   1000023    900.56395
   1000025   -901.86656
   1000035   -2734.624
   1000024    898.75809
   1000037    2734.6871

BLOCK ALPHA
      -0.045177708

BLOCK HMIX Q=  2000.1801
   1   -887.54273
   2    21.559556
   3    243.66672
   4    2106056.2

BLOCK STOPMIX
   1   1    0.9983024
   1   2    0.058243614
   2   1   -0.058243614
   2   2    0.9983024

BLOCK SBOTMIX
   1   1   -0.99999115
   1   2    0.0042078614
   2   1   -0.0042078614
   2   2   -0.99999115

BLOCK STAUMIX
   1   1   -0.99959325
   1   2    0.028518994
   2   1   -0.028518994
   2   2   -0.99959325

BLOCK NMIX
   1   1    0.9926172
   1   2   -0.0027694137
   1   3   -0.09805863
   1   4    0.071329717
   2   1    0.018917404
   2   2   -0.01469238
   2   3    0.70645309
   2   4    0.70735444
   3   1   -0.11980275
   3   2   -0.031321217
   3   3   -0.70083387
   3   4    0.70249425
   4   1   -0.00072589574
   4   2    0.99939754
   4   3   -0.011850196
   4   4    0.032612885

BLOCK UMIX
   1   1   -0.016850471
   1   2   -0.99985802
   2   1   -0.99985802
   2   2    0.016850471

BLOCK VMIX
   1   1    0.046309536
   1   2    0.99892714
   2   1    0.99892714
   2   2   -0.046309536

BLOCK HIGGSBOUNDSINPUTHIGGSCOUPLINGSFERMIONS
       0, 464.81446,3,36,15,15

BLOCK HIGGSBOUNDSINPUTHIGGSCOUPLINGSBOSONS
       0,4,36,21,21,23

BLOCK SPHENOLOWENERGY
   1    0.00035155628
   2    1.5876759e-06
   3    3.525418e-05
   4    2.2857138e-15
   5    9.7643174e-11
   6    2.0444823e-08
   7    7.864227e-14
   8    3.3595982e-09
   9    7.1276574e-07
   10    9.5090427e-05
   11    0.98224771
   12    0.54207309
   13    19.357696
   14    0
   15    0
   16    0.0021580401
   17    2.2816672e-15
   18    2.4810579e-11
   19    8.2913885e-11
   20    1.1441276e-15
   21    4.8914975e-11
   22    1.1023553e-08
   23    0
   24    0
   25    0
   26    0
   27    0
   28    0
   29    0
   30    0
   31    0
   39    5.5253427e-05
   40    0
   41    0
   42    0

BLOCK FWCOEF Q=  160
   305   4422   0   0   -0.18881911
   305   4422   0   2   -0.22204223
   305   4322   0   2   -0.00065557607
   305   6421   0   0   -0.095227835
   305   6421   0   2   -0.12596431
   305   6321   0   2   -0.00060533621
   3051111   4133   0   0    1.6020837
   3051111   4133   0   2    1.6022969
   3051111   4233   0   2    0.00019472723
   3051111   4137   0   0   -4.4247758
   3051111   4137   0   2   -4.4233191
   3051111   4237   0   2   -0.0014944828
   3051313   4133   0   0    1.6020837
   3051313   4133   0   2    1.6022966
   3051313   4233   0   2    0.00019472679
   3051313   4137   0   0   -4.4247758
   3051313   4137   0   2   -4.4233194
   3051313   4237   0   2   -0.0014944827
   3051212   4137   0   0    1.5053501
   3051212   4137   0   2    1.5050348
   3051212   4237   0   2    0.00032496049
   3051414   4137   0   0    1.5053501
   3051414   4137   0   2    1.5050348
   3051414   4237   0   2    0.00032496057
   3051616   4137   0   0    1.5053501
   3051616   4137   0   2    1.505036
   3051616   4237   0   2    0.00032498353

BLOCK IMFWCOEF Q=  160
   305   4422   0   0    3.8576034e-07
   305   4422   0   2    1.1488934e-05
   305   4322   0   2   -4.700642e-06
   305   6421   0   0    3.3042925e-07
   305   6421   0   2    2.8657114e-05
   305   6321   0   2   -2.2259365e-06
   3051111   4133   0   2   -2.6854113e-06
   3051111   4233   0   2    4.1422933e-06
   3051111   4137   0   2    2.5636484e-05
   3051111   4237   0   2   -3.1793286e-05
   3051313   4133   0   2   -2.6854045e-06
   3051313   4233   0   2    4.1422922e-06
   3051313   4137   0   2    2.5636493e-05
   3051313   4237   0   2   -3.1793291e-05
   3051212   4137   0   2   -5.5460806e-06
   3051212   4237   0   2    6.9131354e-06
   3051414   4137   0   2   -5.5460817e-06
   3051414   4237   0   2    6.9131354e-06
   3051616   4137   0   2   -5.5240399e-06
   3051616   4237   0   2    6.9131353e-06

DECAY 23  2.4952


DECAY 24  2.085


DECAY 1000011  1.7545328
    0.97506987   2    1000022    11
    0.023406345   2    1000025    11
    0.0014694712   2   -1000024    12

DECAY 2000011  16.795935
    0.98624154   2    1000022    11
    0.01342351   2    1000025    11
    0.00033483913   2    1000023    11

DECAY 1000013  1.7580621
    0.97313659   2    1000022    13
    0.024342527   2    1000025    13
    0.0014665178   2   -1000024    14
    0.0010543666   2    1000023    13

DECAY 2000013  16.81761
    0.98497504   2    1000022    13
    0.013718812   2    1000025    13
    0.00065225515   2    1000023    13
    0.00063707584   2   -1000024    14

DECAY 1000015  4.8595147
    0.58681027   2    1000022    15
    0.21181533   2    1000025    15
    0.19885643   2    1000023    15
    0.0025179643   2   -1000024    16

DECAY 2000015  17.02961
    0.73236635   2    1000022    15
    0.12756368   2   -1000024    16
    0.072653961   2    1000025    15
    0.064364421   2    1000023    15
    0.0015796191   2    1000016   -24
    0.00075516862   2    1000015    25
    0.00071161629   2    1000015    23

DECAY 1000012  1.7708325
    0.98474501   2    1000022    12
    0.010967975   2    1000024    11
    0.0027186034   2    1000025    12
    0.0015684126   2    1000023    12

DECAY 1000014  1.774351
    0.98279085   2    1000022    14
    0.012930639   2    1000024    13
    0.0027132066   2    1000025    14
    0.0015652991   2    1000023    14

DECAY 1000016  4.8634889
    0.58947065   2    1000022    16
    0.40747672   2    1000024    15
    0.0019366075   2    1000025    16
    0.0011160267   2    1000023    16

DECAY 1000001  0.02003999
    1   2    1000022    1

DECAY 2000001  1.6082527
    0.9865195   2    1000022    1
    0.013145907   2    1000025    1
    0.00033004934   2    1000023    1

DECAY 1000003  0.020041748
    1   2    1000022    3

DECAY 2000003  1.6133639
    0.9834101   2    1000022    3
    0.013864507   2    1000025    3
    0.0015542265   2   -1000024    4
    0.0011021491   2    1000023    3

DECAY 1000005  0.11475595
    0.48790881   2    1000022    5
    0.26159885   2    1000023    5
    0.25049235   2    1000025    5

DECAY 2000005  39.262191
    0.32624117   2    1000006   -37
    0.16111774   2    1000005    36
    0.1610632   2    1000005    35
    0.15104166   2   -1000024    6
    0.075999437   2    1000023    5
    0.075205574   2    1000025    5
    0.037629519   2    1000022    5
    0.004930071   2    1000006   -24
    0.0043439329   2    1000005    25
    0.0024273389   2    1000005    23

DECAY 1000002  0.018265817
    1   2    1000022    2

DECAY 2000002  53.738539
    0.7988919   2    1000021    2
    0.19824632   2    1000022    2
    0.0027920992   2    1000025    2

DECAY 1000004  0.018264749
    1   2    1000022    4

DECAY 2000004  53.741949
    0.79883986   2    1000021    4
    0.19823389   2    1000022    4
    0.0028074253   2    1000025    4

DECAY 1000006  0.064100089
    0.55014142   2    1000024    5
    0.44821926   2    1000022    6
    0.0016264492   3    1000022    24    5

DECAY 2000006  486.85882
    0.2916516   2    1000005    24
    0.20185611   2    1000006    25
    0.15945017   2    1000024    5
    0.14640728   2    1000006    23
    0.079931709   2    1000023    6
    0.078520414   2    1000025    6
    0.019191662   2    1000022    6
    0.011532738   2    1000005    37
    0.0058023217   2    1000006    36
    0.0056493179   2    1000006    35

DECAY 1000024  0.51766787
    0.99620989   2    1000022    24
    0.0013168745   2    1000004   -3
    0.0012533336   2    1000002   -1
    0.00089454979   3    1000022   -5    6
    0.00017451411   2   -1000003    4
    0.00015066284   2   -1000001    2

DECAY 1000037  224.34246
    0.13279187   2   -1000001    2
    0.13279173   2   -1000003    4
    0.13278171   2    1000002   -1
    0.13278163   2    1000004   -3
    0.12425987   2    1000006   -5
    0.12022174   2   -1000005    6
    0.027707362   2    1000024    25
    0.026627286   2    1000024    23
    0.026599723   2    1000023    24
    0.026209358   2    1000025    24
    0.016876534   2    1000014   -13
    0.016876485   2    1000012   -11
    0.01684798   2   -1000013    14
    0.016847927   2   -1000011    12
    0.011671883   2    37    1000025
    0.010274054   2    1000024    36
    0.010270434   2    1000024    35
    0.010201422   2    37    1000023
    0.0027105076   3    1000024    6   -6
    0.0016588322   3    1000023   -5    6
    0.0015361042   3    1000025   -5    6
    0.00054491126   2    1000016   -15
    0.00053521159   2   -1000015    16
    0.00022141493   2    37    1000022
    0.00014449214   2    1000022    24

DECAY 1000022 -1


DECAY 1000023  0.85984514
    0.61326201   2    1000022    23
    0.38635623   2    1000022    25

DECAY 1000025  0.40007674
    0.96299326   2    1000022    25
    0.032230169   2    1000022    23
    0.0011410357   2    1000004   -4
    0.0011410357   2   -1000004    4
    0.0011293417   2    1000002   -2
    0.0011293417   2   -1000002    2

DECAY 1000035  229.86218
    0.064838776   2    1000004   -4
    0.064838776   2   -1000004    4
    0.064838775   2    1000002   -2
    0.064838775   2   -1000002    2
    0.064756536   2    1000001   -1
    0.064756536   2   -1000001    1
    0.064756509   2    1000003   -3
    0.064756509   2   -1000003    3
    0.062112974   2    1000006   -6
    0.062112974   2   -1000006    6
    0.059637239   2    1000005   -5
    0.059637239   2   -1000005    5
    0.026326038   2    1000024   -24
    0.026326038   2   -1000024    24
    0.022161929   2    1000025    25
    0.021260358   2    1000023    23
    0.018648862   2    1000023    25
    0.011567028   2    37   -1000024
    0.011567028   2   -37    1000024
    0.010581482   2    1000023    35
    0.0086844528   2    1000025    35
    0.0082490097   2    1000014   -14
    0.0082490097   2   -1000014    14
    0.0082489856   2    1000012   -12
    0.0082489856   2   -1000012    12
    0.0082069773   2    1000013   -13
    0.0082069773   2   -1000013    13
    0.0082069498   2    1000011   -11
    0.0082069498   2   -1000011    11
    0.0045831034   2    1000025    23
    0.0019709601   3    1000024    5   -6
    0.0019709601   3   -1000024   -5    6
    0.001570532   3    1000025    6   -6
    0.0014722907   3    1000023    6   -6
    0.0011760445   2    1000025    36
    0.00099720677   2    1000023    36
    0.00026619508   2    1000016   -16
    0.00026619508   2   -1000016    16
    0.00026054036   2    1000015   -15
    0.00026054036   2   -1000015    15
    0.00015891515   2    1000022    35
    0.00012606009   2    1000022    25

DECAY 1000021  736.53947
    0.075744069   2    1000002   -2
    0.075744069   2   -1000002    2
    0.075744048   2    1000004   -4
    0.075744048   2   -1000004    4
    0.075686904   2    1000001   -1
    0.075686904   2   -1000001    1
    0.075686889   2    1000003   -3
    0.075686889   2   -1000003    3
    0.073128659   2    1000005   -5
    0.073128659   2   -1000005    5
    0.072741507   2    1000006   -6
    0.072741507   2   -1000006    6
    0.021842668   2    2000005   -5
    0.021842668   2   -2000005    5
    0.014072237   2    2000003   -3
    0.014072237   2   -2000003    3
    0.014072196   2    2000001   -1
    0.014072196   2   -2000001    1
    0.00065933413   3    1000024    5   -6
    0.00065933413   3   -1000024   -5    6
    0.00057345715   3    1000025    6   -6
    0.00057282649   3    1000023    6   -6

DECAY 25  0.0038491107
    0.58467186   2   -5    5
    0.21809202   2   -24    24
    0.071409305   2    21    21
    0.067104115   2   -15    15
    0.028360912   2   -4    4
    0.026132141   2    23    23
    0.0023323043   2    22    22
    0.0014438662   2    22    23
    0.00023276639   2   -13    13
    0.00021994659   2   -3    3
    6.0813162e-07   2   -1    1
    1.4615215e-07   2   -2    2
    5.2328535e-09   2   -11    11

DECAY 35  12.376041
    0.86159817   2   -5    5
    0.12739124   2   -15    15
    0.0097659419   2   -6    6
    0.00044726441   2   -13    13
    0.00037640829   2   -3    3
    0.00030855331   2    1000022    1000022
    7.2035664e-05   2    25    25
    1.4258657e-05   2    21    21
    1.3560437e-05   2    23    23
    1.1346573e-05   2   -24    24
    1.0409195e-06   2   -1    1
    1.3956788e-07   2   -4    4
    1.8154536e-08   2    22    22
    1.0641732e-08   2    22    23
    1.0047569e-08   2   -11    11
    7.1962478e-13   2   -2    2

DECAY 36  12.092739
    0.85990426   2   -5    5
    0.12713927   2   -15    15
    0.010542633   2   -6    6
    0.0015030403   2    1000022    1000022
    0.00044637809   2   -13    13
    0.00037566622   2   -3    3
    6.898865e-05   2    21    21
    1.8477395e-05   2    23    25
    1.0388678e-06   2   -1    1
    1.41407e-07   2   -4    4
    7.7083432e-08   2    22    22
    2.2107276e-08   2    22    23
    1.0027641e-08   2   -11    11
    7.291693e-13   2   -2    2
    3.0889672e-36   2    25    25

DECAY 37  10.8696
    0.86410964   2   -5    6
    0.13368968   2   -15    16
    0.0012817808   2   -5    4
    0.00047264183   2   -13    14
    0.00038039924   2   -3    4
    2.0718582e-05   2    24    25
    1.7654022e-05   2   -3    2
    1.6478297e-05   2   -3    6
    9.1532469e-06   2   -5    2
    1.0554685e-06   2   -1    2
    7.3073323e-07   2   -1    6
    5.5685802e-08   2   -1    4
    1.1055142e-08   2   -11    12
    1.0947659e-11   2    24    35
    1.0728696e-11   2    24    36

DECAY 6  2.43
    1   2    5    24

DECAY 15 -1
