BLOCK DCINFO
   1   SDECAY/HDECAY
   2   1.3b /3.4

BLOCK SPINFO
   1   SOFTSUSY
   2   3.4.0

BLOCK MODSEL
   1   0

BLOCK SMINPUTS
   1    127.90897
   2    1.1663787e-05
   3    0.1184
   4    91.1876
   5    4.18
   6    173.2
   7    1.777

BLOCK MINPAR
   3    33.78

BLOCK EXTPAR
   0   -1
   1    1099.45
   2    2227.53
   3    1905.46
   11   -2907.1
   12   -1205.36
   13   -2177.13
   23    1530.57
   26    3093.11
   31    3851.49
   32    3851.49
   33    3077.62
   34    2344.39
   35    2344.39
   36    3101.13
   41    3255.85
   42    3255.85
   43    1091.83
   44    1163.47
   45    1163.47
   46    2042.95
   47    3354.71
   48    3354.71
   49    1122.12

BLOCK MASS
   24    80.394532
   25    126.47404
   35    3093.4812
   36    3093.11
   37    3094.599
   5    4.8187603
   1000001    3287.5854
   2000001    3381.0242
   1000002    3286.7656
   2000002    1226.4941
   1000003    3287.5854
   2000003    3381.0242
   1000004    3286.7656
   2000004    1226.4941
   1000005    1130.1729
   2000005    1221.2363
   1000006    1146.0786
   2000006    2070.9388
   1000011    3856.6141
   2000011    2347.2305
   1000012    3855.4732
   1000013    3856.6141
   2000013    2347.2305
   1000014    3855.4732
   1000015    3076.4001
   2000015    3114.2956
   1000016    3083.6312
   1000021    2015.0753
   1000022    1097.0037
   1000023    1542.6509
   1000025   -1547.2508
   1000035    2265.2252
   1000024    1541.8194
   1000037    2265.3842

BLOCK NMIX
   1   1    0.99727709
   1   2   -0.0032404228
   1   3    0.059507867
   1   4   -0.043436345
   2   1   -0.072825667
   2   2   -0.082704674
   2   3    0.70343359
   2   4   -0.70216632
   3   1   -0.01130791
   3   2    0.014442463
   3   3    0.70661422
   3   4    0.70736122
   4   1   -0.0026374351
   4   2    0.99646417
   4   3    0.048335734
   4   4   -0.068672039

BLOCK UMIX
   1   1   -0.068408233
   1   2    0.99765741
   2   1   -0.99765741
   2   2   -0.068408233

BLOCK VMIX
   1   1   -0.097330581
   1   2    0.99525211
   2   1   -0.99525211
   2   2   -0.097330581

BLOCK STOPMIX
   1   1    0.98948151
   1   2    0.14465938
   2   1   -0.14465938
   2   2    0.98948151

BLOCK SBOTMIX
   1   1    0.77719429
   1   2    0.62926071
   2   1   -0.62926071
   2   2    0.77719429

BLOCK STAUMIX
   1   1    0.88132081
   1   2    0.4725184
   2   1   -0.4725184
   2   2    0.88132081

BLOCK ALPHA
      -0.03051085

BLOCK HMIX Q=  1487.361
   1    1546.8332
   2    32.816984
   3    243.64586
   4    9527133.3

BLOCK GAUGE Q=  1487.361
   1    0.36261762
   2    0.6347602
   3    1.0347211

BLOCK AU Q=  1487.361
   1   1    0
   2   2    0
   3   3   -2907.1

BLOCK AD Q=  1487.361
   1   1    0
   2   2    0
   3   3   -1205.36

BLOCK AE Q=  1487.361
   1   1    0
   2   2    0
   3   3   -2177.13

BLOCK YU Q=  1487.361
   1   1    0
   2   2    0
   3   3    0.83226332

BLOCK YD Q=  1487.361
   1   1    0
   2   2    0
   3   3    0.37710674

BLOCK YE Q=  1487.361
   1   1    0
   2   2    0
   3   3    0.34942078

BLOCK MSOFT Q=  1487.361
   1    1099.45
   2    2227.53
   3    1905.46
   21    7177113
   22   -2362611.1
   31    3851.49
   32    3851.49
   33    3077.62
   34    2344.39
   35    2344.39
   36    3101.13
   41    3255.85
   42    3255.85
   43    1091.83
   44    1163.47
   45    1163.47
   46    2042.95
   47    3354.71
   48    3354.71
   49    1122.12

BLOCK HIGGSBOUNDSINPUTHIGGSCOUPLINGSFERMIONS
       0, 1076.9544,3,36,15,15

BLOCK HIGGSBOUNDSINPUTHIGGSCOUPLINGSBOSONS
       0,4,36,21,21,23

DECAY 6  1.4188224
    1   2    5    24

DECAY 1000021  81.455007
    0.11910298   2    1000005   -5
    0.11910298   2   -1000005    5
    0.10760585   2    1000006   -6
    0.10760585   2   -1000006    6
    0.10255038   2    2000005   -5
    0.10255038   2   -2000005    5
    0.085370454   2    2000002   -2
    0.085370454   2   -2000002    2
    0.085370331   2    2000004   -4
    0.085370331   2   -2000004    4

DECAY 1000006  1.4405174e-06
    0.32800156   3    1000005   -1    2
    0.32800156   3    1000005   -3    4
    0.10933385   3    1000005   -11    12
    0.10933385   3    1000005   -13    14
    0.10283425   3    1000005   -15    16
    0.022322826   2    1000022    4
    0.00017210221   2    1000022    2

DECAY 2000006  86.542571
    0.2752002   2    1000005    24
    0.22087822   2    1000006    23
    0.21092213   2    1000006    25
    0.14424219   2    2000005    24
    0.062494774   2    1000024    5
    0.032816881   2    1000023    6
    0.027398032   2    1000025    6
    0.026047575   2    1000022    6

DECAY 1000005  0.0014345934
    1   2    1000022    5

DECAY 2000005  0.014222251
    1   2    1000022    5

DECAY 1000002  102.97418
    0.89243657   2    1000021    2
    0.06798935   2    1000037    1
    0.034051724   2    1000035    2
    0.0033881574   2    1000022    2
    0.0014229085   2    1000024    1
    0.00069998971   2    1000023    2
    1.1297426e-05   2    1000025    2

DECAY 2000002  0.11870831
    1   2    1000022    2

DECAY 1000001  103.02154
    0.89278476   2    1000021    1
    0.068365044   2   -1000037    2
    0.034143741   2    1000035    1
    0.0036272167   2    1000022    1
    0.0007029537   2   -1000024    2
    0.00035568255   2    1000023    1
    2.0604376e-05   2    1000025    1

DECAY 2000001  102.41094
    0.98522035   2    1000021    1
    0.014716527   2    1000022    1
    6.1602332e-05   2    1000023    1
    1.4806086e-06   2    1000025    1
    3.9439929e-08   2    1000035    1

DECAY 1000004  84.103308
    0.86465282   2    1000021    4
    0.08550562   2    1000037    3
    0.042824627   2    1000035    4
    0.0043093097   2    1000022    4
    0.0018052307   2    1000024    3
    0.00088806463   2    1000023    4
    1.4332386e-05   2    1000025    4

DECAY 2000004  0.11345858
    1   2    1000022    4

DECAY 1000003  84.13302
    0.86508346   2    1000021    3
    0.085987951   2   -1000037    4
    0.042945392   2    1000035    3
    0.0046138383   2    1000022    3
    0.0008919238   2   -1000024    4
    0.0004512958   2    1000023    3
    2.6142331e-05   2    1000025    3

DECAY 2000003  81.413191
    0.98069652   2    1000021    3
    0.019221226   2    1000022    3
    8.0276964e-05   2    1000023    3
    1.9293974e-06   2    1000025    3
    5.1007191e-08   2    1000035    3

DECAY 1000011  24.22521
    0.54485199   2   -1000037    12
    0.27099356   2    1000035    11
    0.17295359   2    1000022    11
    0.0069568211   2    1000023    11
    0.0042154179   2   -1000024    12
    2.8623219e-05   2    1000025    11

DECAY 2000011  7.4823193
    0.99712395   2    1000022    11
    0.0028088865   2    1000023    11
    6.7108322e-05   2    1000025    11
    5.3810421e-08   2    1000035    11

DECAY 1000013  24.22521
    0.54485199   2   -1000037    14
    0.27099356   2    1000035    13
    0.17295359   2    1000022    13
    0.0069568211   2    1000023    13
    0.0042154179   2   -1000024    14
    2.8623219e-05   2    1000025    13

DECAY 2000013  7.4823193
    0.99712395   2    1000022    13
    0.0028088864   2    1000023    13
    6.7108321e-05   2    1000025    13
    5.3810375e-08   2    1000035    13

DECAY 1000015  16.7651
    0.31580959   2    1000022    15
    0.22872792   2   -1000037    16
    0.13678566   2    1000023    15
    0.1203838   2    1000025    15
    0.11394496   2    1000035    15
    0.084348078   2   -1000024    16

DECAY 2000015  19.436195
    0.5221918   2    1000022    15
    0.1493302   2   -1000024    16
    0.11370455   2    1000025    15
    0.10612115   2    1000023    15
    0.072508682   2   -1000037    16
    0.036143615   2    1000035    15

DECAY 1000012  24.236466
    0.54147793   2    1000037    11
    0.27226045   2    1000035    12
    0.17678074   2    1000022    12
    0.0085250017   2    1000024    11
    0.00075981596   2    1000023    12
    0.00019605873   2    1000025    12

DECAY 1000014  24.236466
    0.54147793   2    1000037    13
    0.27226045   2    1000035    14
    0.17678075   2    1000022    14
    0.0085250017   2    1000024    13
    0.00075981597   2    1000023    14
    0.00019605873   2    1000025    14

DECAY 1000016  15.238176
    0.34095124   2    1000037    15
    0.28376369   2    1000024    15
    0.2031202   2    1000022    16
    0.17119633   2    1000035    16
    0.00077015586   2    1000023    16
    0.0001983866   2    1000025    16

DECAY 1000024  9.287212
    0.64328558   2   -1000005    6
    0.17180223   2    1000006   -5
    0.10797443   2   -2000005    6
    0.076937765   2    1000022    24

DECAY 1000037  43.326109
    0.32541079   2    1000006   -5
    0.19121433   2   -1000005    6
    0.13150631   2   -2000005    6
    0.091129934   2    1000024    23
    0.088464909   2    1000023    24
    0.08787612   2    1000025    24
    0.083145908   2    1000024    25
    0.0012382647   2    2000006   -5
    1.3436811e-05   2    1000022    24

DECAY 1000022 -1


DECAY 1000023  10.255082
    0.34754481   2    1000006   -6
    0.34754481   2   -1000006    6
    0.074001463   2    1000005   -5
    0.074001463   2   -1000005    5
    0.07224508   2    1000022    25
    0.040624372   2    2000005   -5
    0.040624372   2   -2000005    5
    0.0018887979   2    1000022    23
    0.00038121082   2    2000002   -2
    0.00038121082   2   -2000002    2
    0.00038120703   2    2000004   -4
    0.00038120703   2   -2000004    4

DECAY 1000025  8.2558402
    0.31321948   2    1000006   -6
    0.31321948   2   -1000006    6
    0.087889949   2    1000022    23
    0.082385114   2    1000005   -5
    0.082385114   2   -1000005    5
    0.059344786   2    2000005   -5
    0.059344786   2   -2000005    5
    0.0021645681   2    1000022    25
    1.167972e-05   2    2000002   -2
    1.167972e-05   2   -2000002    2
    1.1679607e-05   2    2000004   -4
    1.1679607e-05   2   -2000004    4

DECAY 1000035  43.354869
    0.1558702   2    1000006   -6
    0.1558702   2   -1000006    6
    0.099604149   2    1000005   -5
    0.099604149   2   -1000005    5
    0.089173159   2    1000024   -24
    0.089173159   2   -1000024    24
    0.086968599   2    1000025    23
    0.080606295   2    1000023    25
    0.068697468   2    2000005   -5
    0.068697468   2   -2000005    5
    0.0027317848   2    1000023    23
    0.0024924999   2    1000025    25
    0.0002518426   2    2000006   -6
    0.0002518426   2   -2000006    6
    4.3221422e-06   2    1000022    25
    6.0803957e-07   2    2000002   -2
    6.0803957e-07   2   -2000002    2
    6.080392e-07   2    2000004   -4
    6.080392e-07   2   -2000004    4
    4.3950324e-07   2    1000022    23

DECAY 25  0.00545711
    0.66905293   2    5   -5
    0.18044728   2    24   -24
    0.059803921   2    21    21
    0.048122057   2   -15    15
    0.023053308   2    23    23
    0.01604325   2    4   -4
    0.0018182713   2    22    22
    0.0013031792   2    22    23
    0.00018546812   2    3   -3
    0.00017033239   2   -13    13

DECAY 35  44.258543
    0.76172934   2    5   -5
    0.14622583   2   -15    15
    0.022632151   2    1000022    1000025
    0.020728936   2    1000005   -1000005
    0.018846256   2    2000005   -2000005
    0.018797618   2    1000006   -1000006
    0.0056529795   2    1000022    1000023
    0.002616808   2    6   -6
    0.0008709981   2    1000005   -2000005
    0.0008709981   2    2000005   -1000005
    0.00052253078   2   -13    13
    0.00028402625   2    3   -3
    0.00020267045   2    1000022    1000022
    7.6416112e-06   2    21    21
    4.5446387e-06   2    1000023    1000025
    2.7089755e-06   2    1000024   -1000024
    2.7029873e-06   2    25    25
    5.0049371e-07   2    24   -24
    2.4971159e-07   2    23    23
    2.0217119e-07   2    1000023    1000023
    9.918228e-08   2    2000002   -2000002
    9.918228e-08   2    2000004   -2000004
    7.8945663e-08   2    22    22
    2.6609814e-08   2    4   -4
    6.3936005e-09   2    23    22
    1.7164611e-16   2    23    36

DECAY 36  43.46879
    0.77550747   2    5   -5
    0.14886529   2   -15    15
    0.023399695   2    1000022    1000023
    0.021067049   2    1000005   -2000005
    0.021067049   2   -1000005    2000005
    0.005601893   2    1000022    1000025
    0.002677382   2    6   -6
    0.00053196203   2   -13    13
    0.00046389897   2    1000024   -1000024
    0.00045377433   2    1000022    1000022
    0.00028917623   2    3   -3
    4.3014223e-05   2    1000023    1000023
    3.1744088e-05   2    21    21
    5.1615224e-07   2    23    25
    2.7255044e-08   2    4   -4
    2.6678049e-08   2    22    22
    2.4078637e-08   2    23    22
    6.4891222e-09   2    1000023    1000025

DECAY 37  40.475676
    0.4858593   2    6   -5
    0.2539359   2    1000006   -2000005
    0.15995061   2   -15    16
    0.067353016   2    1000006   -1000005
    0.031086619   2    1000024    1000022
    0.0008130465   2    4   -5
    0.00057157483   2   -13    14
    0.00030586914   2    4   -3
    6.1282195e-05   2    1000024    1000025
    3.8561777e-05   2    1000024    1000023
    1.5538308e-05   2    2   -3
    8.1304556e-06   2    2   -5
    5.5544995e-07   2    24    25
    2.3791962e-13   2    24    36

DECAY 5 -1


DECAY 15 -1


DECAY 23  2.4952


DECAY 24  2.085
