BLOCK SPINFO
   1   SPheno
   2   v4.0.5be

BLOCK SPHENOINFO
   1   2
   2   2

BLOCK MODSEL
   1   0

BLOCK MINPAR
   3    12.064233
   4   -1

BLOCK EXTPAR
   0    3899.7111
   1   -1232.3167
   2   -2427.2335
   3    1226.1973
   11   -3143.9873
   12   -1018.8239
   13   -81.380739
   23   -1288.2061
   25    11.473521
   26    3054.4327
   31    3549.2033
   32    3549.2033
   33    1450.9619
   34    3861.9185
   35    3861.9185
   36    3238.9835
   41    3352.4906
   42    3352.4906
   43    4107.3857
   44    1093.4552
   45    1093.4552
   46    3695.6049
   47    4420.3877
   48    4420.3877
   49    1320.0317

BLOCK SMINPUTS
   1    127.90897
   2    1.1663787e-05
   3    0.1184
   4    91.1876
   5    4.18
   6    173.2
   7    1.777
   8    0
   11    0.00051099893
   12    0
   13    0.10565837
   14    0
   21    0.005
   22    0.0025
   23    0.095
   24    1.27

BLOCK GAUGE Q=  3899.7111
   1    0.35536298
   2    0.66519887
   3    1.219778

BLOCK YU Q=  3899.7111
   1   1    8.4161573e-06
   2   2    0.0042754079
   3   3    1.0167394

BLOCK YD Q=  3899.7111
   1   1    0.0001940398
   2   2    0.0036867562
   3   3    0.19242668

BLOCK YE Q=  3899.7111
   1   1    3.3861364e-05
   2   2    0.0070014561
   3   3    0.11775297

BLOCK AU Q=  3899.7111
   1   1    0
   2   2    0
   3   3   -3143.9883

BLOCK AD Q=  3899.7111
   1   1    0
   2   2    0
   3   3   -1018.824

BLOCK AE Q=  3899.7111
   1   1    0
   2   2    0
   3   3   -81.38073

BLOCK MSOFT Q=  3899.7111
   1   -1232.3167
   2   -2427.2335
   3    1226.1973
   21    7437169.8
   22   -1303361.9
   31    3549.2033
   32    3549.2033
   33    1450.9619
   34    3861.9185
   35    3861.9185
   36    3238.9835
   41    3352.4906
   42    3352.4906
   43    4107.3857
   44    1093.4552
   45    1093.4552
   46    3695.6049
   47    4420.3877
   48    4420.3877
   49    1320.0317

BLOCK MASS
   6    173.2
   23    91.1876
   24    80.429995
   15    1.777
   25    120.90952
   35    3054.4632
   36    3054.4327
   37    3055.8088
   1000001    3420.7384
   2000001    4470.6913
   1000002    3419.8934
   2000002    1207.3018
   1000003    3420.7375
   2000003    4470.6904
   1000004    3419.8926
   2000004    1207.3013
   1000005    1402.2597
   2000005    4133.7129
   1000006    3671.7948
   2000006    4141.7747
   1000011    3569.3765
   2000011    3863.1693
   1000012    3568.0808
   1000013    3569.3739
   2000013    3863.1647
   1000014    3568.0783
   1000015    1496.2499
   2000015    3238.4279
   1000016    1494.0281
   1000021    1464.4925
   1000022   -1200.4277
   1000023    1309.2317
   1000025   -1316.3591
   1000035   -2473.7964
   1000024    1305.927
   1000037    2473.9182

BLOCK ALPHA
      -0.082910029

BLOCK HMIX Q=  3899.7111
   1   -1288.2061
   2    11.473521
   3    242.96197
   4    9329559.3

BLOCK STOPMIX
   1   1    0.11872957
   1   2    0.99292663
   2   1   -0.99292663
   2   2    0.11872957

BLOCK SBOTMIX
   1   1   -0.0019940262
   1   2    0.99999801
   2   1   -0.99999801
   2   2   -0.0019940262

BLOCK STAUMIX
   1   1   -0.99999494
   1   2    0.0031812339
   2   1   -0.0031812339
   2   2   -0.99999494

BLOCK NMIX
   1   1    0.94961472
   1   2   -0.014215564
   1   3   -0.22907895
   1   4    0.21343065
   2   1    0.011312586
   2   2   -0.013383641
   2   3    0.70670331
   2   4    0.70729296
   3   1   -0.31321054
   3   2   -0.049175376
   3   3   -0.6688639
   3   4    0.67238532
   4   1   -0.0017539905
   4   2    0.99859931
   4   3   -0.026727294
   4   4    0.045628905

BLOCK UMIX
   1   1   -0.037808448
   1   2   -0.999285
   2   1   -0.999285
   2   2    0.037808448

BLOCK VMIX
   1   1    0.06453935
   1   2    0.99791516
   2   1    0.99791516
   2   2   -0.06453935

BLOCK HIGGSBOUNDSINPUTHIGGSCOUPLINGSFERMIONS
       0, 131.64169,3,36,15,15

BLOCK HIGGSBOUNDSINPUTHIGGSCOUPLINGSBOSONS
       0,4,36,21,21,23

BLOCK SPHENOLOWENERGY
   1    0.00032859018
   2    1.5892185e-06
   3    3.5251236e-05
   4    2.5270164e-15
   5    1.0795129e-10
   6    2.2599716e-08
   7    8.5495222e-14
   8    3.6523537e-09
   9    7.7473336e-07
   10    9.6709614e-05
   11    0.99897328
   12    0.54218219
   13    19.372097
   14    0
   15    0
   16    0.0021581151
   17    2.2816669e-15
   18    2.4800141e-11
   19    8.2900549e-11
   20    4.2327001e-16
   21    1.8096087e-11
   22    9.9292047e-09
   23    0
   24    0
   25    0
   26    0
   27    0
   28    0
   29    0
   30    0
   31    0
   39   -3.821269e-06
   40    0
   41    0
   42    0

BLOCK FWCOEF Q=  160
   305   4422   0   0   -0.18881911
   305   4422   0   2   -0.1982427
   305   4322   0   2   -0.00019782695
   305   6421   0   0   -0.095227835
   305   6421   0   2   -0.10310553
   305   6321   0   2   -0.00017475772
   3051111   4133   0   0    1.6253547
   3051111   4133   0   2    1.6256346
   3051111   4233   0   2    2.2038853e-05
   3051111   4137   0   0   -4.4480468
   3051111   4137   0   2   -4.4462408
   3051111   4237   0   2   -0.0001581451
   3051313   4133   0   0    1.6253547
   3051313   4133   0   2    1.6256345
   3051313   4233   0   2    2.2038849e-05
   3051313   4137   0   0   -4.4480468
   3051313   4137   0   2   -4.4462408
   3051313   4237   0   2   -0.0001581451
   3051212   4137   0   0    1.5053501
   3051212   4137   0   2    1.5049609
   3051212   4237   0   2    3.4206195e-05
   3051414   4137   0   0    1.5053501
   3051414   4137   0   2    1.5049609
   3051414   4237   0   2    3.4206196e-05
   3051616   4137   0   0    1.5053501
   3051616   4137   0   2    1.5049605
   3051616   4237   0   2    3.4206525e-05

BLOCK IMFWCOEF Q=  160
   305   4422   0   0    3.8581454e-07
   305   4422   0   2   -4.6733487e-06
   305   4322   0   2   -1.2730749e-06
   305   6421   0   0    3.3047567e-07
   305   6421   0   2    3.4140841e-05
   305   6321   0   2   -1.5137251e-07
   3051111   4133   0   2   -6.9710421e-07
   3051111   4233   0   2    4.590308e-07
   3051111   4137   0   2    6.9367218e-06
   3051111   4237   0   2   -3.309839e-06
   3051313   4133   0   2   -6.9710405e-07
   3051313   4233   0   2    4.5903076e-07
   3051313   4137   0   2    6.9367225e-06
   3051313   4237   0   2   -3.3098391e-06
   3051212   4137   0   2   -1.4746989e-06
   3051212   4237   0   2    7.1590889e-07
   3051414   4137   0   2   -1.4746989e-06
   3051414   4237   0   2    7.1590889e-07
   3051616   4137   0   2   -1.4817877e-06
   3051616   4237   0   2    7.1591219e-07

DECAY 23  2.4952


DECAY 24  2.085


DECAY 1000011  16.283314
    0.52027296   2   -1000037    12
    0.25933953   2    1000035    11
    0.18452066   2    1000022    11
    0.033758548   2    1000025    11
    0.0020693594   2   -1000024    12

DECAY 2000011  15.776794
    0.90557767   2    1000022    11
    0.094297646   2    1000025    11
    0.00012336472   2    1000023    11

DECAY 1000013  16.285875
    0.52018935   2   -1000037    14
    0.25929787   2    1000035    13
    0.18450021   2    1000022    13
    0.033824656   2    1000025    13
    0.0020690315   2   -1000024    14
    0.00011888543   2    1000023    13

DECAY 2000013  15.782701
    0.90524753   2    1000022    13
    0.094345495   2    1000025    13
    0.00021671721   2    1000023    13
    0.00018700159   2   -1000024    14

DECAY 1000015  0.24375952
    0.84490949   2    1000022    15
    0.10411521   2    1000025    15
    0.046460493   2    1000023    15
    0.0045148007   2   -1000024    16

DECAY 2000015  13.507022
    0.81079825   2    1000022    15
    0.10302155   2    1000025    15
    0.046246519   2   -1000024    16
    0.023238369   2    1000023    15
    0.0084143249   2    1000016   -24
    0.0041925827   2    1000015    23
    0.0040342744   2    1000015    25

DECAY 1000012  16.29113
    0.51771429   2    1000037    11
    0.25974623   2    1000035    12
    0.20620065   2    1000022    12
    0.010042938   2    1000025    12
    0.0060234323   2    1000024    11
    0.00027245675   2    1000023    12

DECAY 1000014  16.293692
    0.5176313   2    1000037    13
    0.25970455   2    1000035    14
    0.20616801   2    1000022    14
    0.010041348   2    1000025    14
    0.0061823734   2    1000024    13
    0.00027241361   2    1000023    14

DECAY 1000016  0.25519894
    0.88032753   2    1000022    16
    0.10114928   2    1000024    15
    0.01799937   2    1000025    16
    0.00052381242   2    1000023    16

DECAY 1000001  190.78459
    0.94400575   2    1000021    1
    0.035855935   2   -1000037    2
    0.017918443   2    1000035    1
    0.002039087   2    1000022    1
    0.00016464973   2   -1000024    2

DECAY 2000001  283.3585
    0.99243913   2    1000021    1
    0.0068391108   2    1000022    1
    0.00072078613   2    1000025    1

DECAY 1000003  190.78606
    0.94399802   2    1000021    3
    0.035855601   2   -1000037    4
    0.017918279   2    1000035    3
    0.0020392676   2    1000022    3
    0.00016936599   2   -1000024    4

DECAY 2000003  283.36046
    0.992432   2    1000021    3
    0.0068392563   2    1000022    3
    0.0007223664   2    1000025    3

DECAY 1000005  0.070671214
    0.77652561   2    1000022    5
    0.11985395   2    1000023    5
    0.10362044   2    1000025    5

DECAY 2000005  349.70261
    0.71352205   2    1000021    5
    0.19516172   2   -1000024    6
    0.04351181   2   -1000037    6
    0.021391144   2    1000035    5
    0.017375465   2    1000006   -24
    0.0035307765   2    1000023    5
    0.0031527192   2    1000025    5
    0.0018415956   2    1000022    5
    0.00032377412   2    1000005    25
    0.00018894576   2    1000005    23

DECAY 2000002  0.00031341887
    1   2    1000022    2

DECAY 1000002  190.73083
    0.94382913   2    1000021    2
    0.03572019   2    1000037    1
    0.017877271   2    1000035    2
    0.0014554872   2    1000022    2
    0.00063077925   2    1000025    2
    0.00047971468   2    1000024    1

DECAY 2000004  0.00030710122
    1   2    1000022    4

DECAY 1000004  190.73222
    0.94382136   2    1000021    4
    0.035719889   2    1000037    3
    0.017877076   2    1000035    4
    0.0014556917   2    1000022    4
    0.00063294057   2    1000025    4
    0.00048322884   2    1000024    3

DECAY 1000006  325.18381
    0.63292012   2    1000021    6
    0.17230023   2    1000024    5
    0.086964632   2    1000023    6
    0.080985362   2    1000025    6
    0.02475272   2    1000022    6
    0.0013883643   2    1000037    5
    0.00067692628   2    1000035    6

DECAY 2000006  350.81091
    0.70451321   2    1000021    6
    0.099003088   2    1000023    6
    0.088095342   2    1000025    6
    0.041231758   2    1000037    5
    0.020341413   2    1000035    6
    0.012888935   2    1000022    6
    0.012682531   2    1000006    25
    0.012002813   2    1000024    5
    0.0088665978   2    1000006    23
    0.00037430923   2    1000005    24

DECAY 1000024  0.38895219
    0.99996128   2    1000022    24

DECAY 1000037  31.076544
    0.18044415   2    1000024    25
    0.1721832   2    1000024    23
    0.17210798   2    1000023    24
    0.16154159   2    1000025    24
    0.14082961   2    1000016   -15
    0.14072496   2   -1000015    16
    0.01265878   2    1000022    24
    0.0082299789   3    1000024    6   -6
    0.0063050865   3    1000023   -5    6
    0.0044526801   3    1000025   -5    6
    0.00038230718   3    1000022   -5    6

DECAY 1000022 -1


DECAY 1000023  0.39560731
    0.99978755   2    1000022    23

DECAY 1000025  0.044168692
    0.24740671   2    2000004   -4
    0.24740671   2   -2000004    4
    0.24707003   2    2000002   -2
    0.24707003   2   -2000002    2
    0.010915725   2    1000022    23

DECAY 1000035  34.573305
    0.15699188   2    1000024   -24
    0.15699188   2   -1000024    24
    0.14668158   2    1000023    23
    0.14051373   2    1000025    25
    0.10956535   2    1000023    25
    0.063487653   2    1000016   -16
    0.063487653   2   -1000016    16
    0.06303516   2    1000015   -15
    0.06303516   2   -1000015    15
    0.011276327   2    1000022    25
    0.0090706718   2    1000025    23
    0.0045821369   3    1000024    5   -6
    0.0045821369   3   -1000024   -5    6
    0.0029153937   3    1000025    6   -6
    0.0024161482   3    1000023    6   -6
    0.00087623698   2    1000022    23
    0.00027067755   3    1000022    6   -6

DECAY 1000021  9.1991106
    0.24186392   2    2000002   -2
    0.24186392   2   -2000002    2
    0.24186236   2    2000004   -4
    0.24186236   2   -2000004    4
    0.016272441   2    1000005   -5
    0.016272441   2   -1000005    5

DECAY 25  0.0034161968
    0.63346359   2   -5    5
    0.16561075   2   -24    24
    0.074730661   2    21    21
    0.072474212   2   -15    15
    0.031292113   2   -4    4
    0.018461398   2    23    23
    0.0023218715   2    22    22
    0.0011551946   2    22    23
    0.00025135803   2   -13    13
    0.00023803124   2   -3    3
    6.5813327e-07   2   -1    1
    1.612699e-07   2   -2    2
    5.6508646e-09   2   -11    11

DECAY 35  8.5367196
    0.62090247   2   -5    5
    0.11998389   2    1000022    1000023
    0.11149852   2   -15    15
    0.093444221   2   -6    6
    0.017749591   2    1000023    1000025
    0.015163062   2    1000022    1000025
    0.013608142   2    1000022    1000022
    0.0047320409   2    1000025    1000025
    0.0018872131   2   -1000024    1000024
    0.00037690917   2   -13    13
    0.00023470522   2   -3    3
    0.00021099109   2    25    25
    0.00010391983   2    1000023    1000023
    2.8950138e-05   2    23    23
    2.3619343e-05   2   -1000002    1000002
    2.360835e-05   2   -1000004    1000004
    8.5373194e-06   2   -24    24
    8.493631e-06   2    21    21
    1.6281706e-06   2   -1000015    1000015
    1.3784057e-06   2   -4    4
    6.4890853e-07   2   -1    1
    1.2805482e-07   2    22    22
    1.0274907e-07   2    22    23
    3.9356346e-08   2   -1000005    1000005
    8.4651403e-09   2   -11    11
    7.1059983e-12   2   -2    2

DECAY 36  8.419608
    0.61461449   2   -5    5
    0.11037091   2   -15    15
    0.090425042   2   -6    6
    0.067279396   2    1000022    1000025
    0.051879162   2    1000022    1000022
    0.028183097   2    1000022    1000023
    0.024432269   2    1000025    1000025
    0.0079791284   2   -1000024    1000024
    0.0038472785   2    1000023    1000025
    0.00037309599   2   -13    13
    0.00026278962   2    1000023    1000023
    0.00023232969   2   -3    3
    6.9957247e-05   2    21    21
    4.8359804e-05   2    23    25
    1.3183248e-06   2   -4    4
    6.4234132e-07   2   -1    1
    4.5450975e-07   2    22    22
    2.7638697e-07   2    22    23
    8.3794995e-09   2   -11    11
    6.796396e-12   2   -2    2
    5.033545e-35   2    25    25

DECAY 37  8.3190719
    0.71427012   2   -5    6
    0.14222578   2    1000022    1000024
    0.10691679   2   -15    16
    0.03352973   2    1000024    1000025
    0.001326869   2    1000023    1000024
    0.00091183494   2   -5    4
    0.00037798902   2   -13    14
    0.00021833185   2   -3    4
    0.00014162659   2   -3    6
    4.9040091e-05   2    24    25
    1.0169044e-05   2   -3    2
    8.0207001e-06   2   -1000015    1000016
    6.5114285e-06   2   -5    2
    6.4808995e-06   2   -1    6
    6.0235001e-07   2   -1    2
    8.7359814e-08   2   -1    4
    8.8412024e-09   2   -11    12
    1.7557749e-11   2   -1000005    1000004
    8.0728885e-13   2    24    36
    7.2164431e-13   2    24    35
    6.5763466e-19   2   -1000005    1000002

DECAY 6  2.43
    1   2    5    24

DECAY 15 -1
