BLOCK SPINFO
   1   SPheno
   2   v4.0.5be

BLOCK SPHENOINFO
   1   2
   2   2

BLOCK MODSEL
   1   0

BLOCK MINPAR
   3    54.014495
   4   -1

BLOCK EXTPAR
   0    4181.2796
   1    2847.0319
   2    1966.945
   3    2359.4869
   11    7425.6353
   12   -4387.9386
   13    4119.5205
   23   -468.39558
   25    53.88253
   26    1136.6739
   31    3634.1554
   32    3634.1554
   33    2814.7052
   34    4166.387
   35    4166.387
   36    1346.5634
   41    2685.2676
   42    2685.2676
   43    3982.1954
   44    2906.2099
   45    2906.2099
   46    4538.0168
   47    2144.9895
   48    2144.9895
   49    4178.7195

BLOCK SMINPUTS
   1    127.90897
   2    1.1663787e-05
   3    0.1184
   4    91.1876
   5    4.18
   6    173.2
   7    1.777
   8    0
   11    0.00051099893
   12    0
   13    0.10565837
   14    0
   21    0.005
   22    0.0025
   23    0.095
   24    1.27

BLOCK GAUGE Q=  4181.2796
   1    0.35536298
   2    0.66519887
   3    1.219778

BLOCK YU Q=  4181.2796
   1   1    8.3858159e-06
   2   2    0.0042599945
   3   3    1.0130739

BLOCK YD Q=  4181.2796
   1   1    0.00090797429
   2   2    0.017251512
   3   3    0.90042598

BLOCK YE Q=  4181.2796
   1   1    0.00015844815
   2   2    0.032762053
   3   3    0.55100383

BLOCK AU Q=  4181.2796
   1   1    0
   2   2    0
   3   3    7425.6354

BLOCK AD Q=  4181.2796
   1   1    0
   2   2    0
   3   3   -4387.9385

BLOCK AE Q=  4181.2796
   1   1    0
   2   2    0
   3   3    4119.5205

BLOCK MSOFT Q=  4181.2796
   1    2847.0319
   2    1966.945
   3    2359.4869
   21    1547317.2
   22    71607.024
   31    3634.1554
   32    3634.1554
   33    2814.7052
   34    4166.387
   35    4166.387
   36    1346.5634
   41    2685.2676
   42    2685.2676
   43    3982.1954
   44    2906.2099
   45    2906.2099
   46    4538.0168
   47    2144.9895
   48    2144.9895
   49    4178.7195

BLOCK MASS
   6    173.2
   23    91.1876
   24    80.429995
   15    1.777
   25    127.63951
   35    1136.3006
   36    1136.6739
   37    1139.8257
   1000001    2823.1979
   2000001    2292.5922
   1000002    2822.1019
   2000002    3015.9767
   1000003    2823.188
   2000003    2292.5701
   1000004    2822.0919
   2000004    3015.9759
   1000005    3959.786
   2000005    4178.1527
   1000006    3933.5929
   2000006    4444.5623
   1000011    3649.3175
   2000011    4177.5559
   1000012    3648.0452
   1000013    3649.266
   2000013    4177.4613
   1000014    3647.9939
   1000015    1301.7667
   2000015    2798.0965
   1000016    2793.5168
   1000021    2636.0979
   1000022    469.21834
   1000023   -473.42034
   1000025    2009.9279
   1000035    2804.1072
   1000024    471.31934
   1000037    2010.0817

BLOCK ALPHA
      -0.018815204

BLOCK HMIX Q=  4181.2796
   1   -468.39558
   2    53.88253
   3    242.85543
   4    1292027.5

BLOCK STOPMIX
   1   1   -0.97500272
   1   2    0.22219293
   2   1   -0.22219293
   2   2   -0.97500272

BLOCK SBOTMIX
   1   1   -0.99961561
   1   2    0.027724316
   2   1   -0.027724316
   2   2   -0.99961561

BLOCK STAUMIX
   1   1   -0.0083297418
   1   2    0.99996531
   2   1   -0.99996531
   2   2   -0.0083297418

BLOCK NMIX
   1   1   -0.013054107
   1   2    0.035404635
   1   3    0.70830513
   1   4    0.70489712
   2   1   -0.0096827181
   2   2    0.022968884
   2   3   -0.70584649
   2   4    0.70792613
   3   1    0.0021587008
   3   2    0.99910799
   3   3   -0.0088691099
   3   4   -0.0412299
   4   1    0.99986558
   4   2   -0.001472396
   4   3    0.0024312506
   4   4    0.016147625

BLOCK UMIX
   1   1   -0.012569039
   1   2   -0.99992101
   2   1    0.99992101
   2   2   -0.012569039

BLOCK VMIX
   1   1   -0.05842203
   1   2    0.99829197
   2   1    0.99829197
   2   2    0.05842203

BLOCK HIGGSBOUNDSINPUTHIGGSCOUPLINGSFERMIONS
       0, 2903.327,3,36,15,15

BLOCK HIGGSBOUNDSINPUTHIGGSCOUPLINGSBOSONS
       0,4,36,21,21,23

BLOCK SPHENOLOWENERGY
   1    0.00033660953
   2    1.5883588e-06
   3    3.5248779e-05
   4    1.2037017e-14
   5    5.1405551e-10
   6    9.8945163e-08
   7    4.3116907e-13
   8    1.8414019e-08
   9    3.5878618e-06
   10    8.6526966e-05
   11    0.89379043
   12    0.54166897
   13    19.463674
   14    0
   15    0
   16    0.0021566713
   17    2.281668e-15
   18    2.4801691e-11
   19    8.289969e-11
   20   -1.8863067e-15
   21   -8.0644067e-11
   22   -2.8361236e-08
   23    0
   24    0
   25    0
   26    0
   27    0
   28    0
   29    0
   30    0
   31    0
   39    7.1681986e-05
   40    0
   41    0
   42    0

BLOCK FWCOEF Q=  160
   305   4422   0   0   -0.18881911
   305   4422   0   2   -0.20419167
   305   4322   0   2   -0.00023323962
   305   6421   0   0   -0.095227835
   305   6421   0   2   -0.1191092
   305   6321   0   2   -0.00040292618
   3051111   4133   0   0    1.6293171
   3051111   4133   0   2    1.6294443
   3051111   4233   0   2    0.00070335085
   3051111   4137   0   0   -4.4520092
   3051111   4137   0   2   -4.4501425
   3051111   4237   0   2   -0.0051869418
   3051313   4133   0   0    1.6293171
   3051313   4133   0   2    1.6294433
   3051313   4233   0   2    0.00070332062
   3051313   4137   0   0   -4.4520092
   3051313   4137   0   2   -4.4501435
   3051313   4237   0   2   -0.0051869168
   3051212   4137   0   0    1.5053501
   3051212   4137   0   2    1.5049515
   3051212   4237   0   2    0.0011209499
   3051414   4137   0   0    1.5053501
   3051414   4137   0   2    1.5049515
   3051414   4237   0   2    0.0011209561
   3051616   4137   0   0    1.5053501
   3051616   4137   0   2    1.5049513
   3051616   4237   0   2    0.0011227233

BLOCK IMFWCOEF Q=  160
   305   4422   0   0    3.8584639e-07
   305   4422   0   2   -4.4960517e-05
   305   4322   0   2    6.2784565e-06
   305   6421   0   0    3.3050295e-07
   305   6421   0   2    3.8553536e-05
   305   6321   0   2    5.2739527e-06
   3051111   4133   0   2   -1.2150291e-06
   3051111   4233   0   2    1.8300105e-05
   3051111   4137   0   2    1.3142623e-05
   3051111   4237   0   2   -0.00013496837
   3051313   4133   0   2   -1.2150345e-06
   3051313   4233   0   2    1.8300084e-05
   3051313   4137   0   2    1.3142651e-05
   3051313   4237   0   2   -0.00013496844
   3051212   4137   0   2   -2.7540783e-06
   3051212   4237   0   2    2.9168013e-05
   3051414   4137   0   2   -2.7540788e-06
   3051414   4237   0   2    2.9168013e-05
   3051616   4137   0   2   -2.7576856e-06
   3051616   4237   0   2    2.9168012e-05

DECAY 23  2.4952


DECAY 24  2.085


DECAY 1000011  24.173269
    0.64478912   2   -1000037    12
    0.322657   2    1000025    11
    0.031627863   2    1000035    11
    0.0005195298   2    1000022    11
    0.00020347242   2    1000023    11
    0.00020302097   2   -1000024    12

DECAY 2000011  6.3407146
    0.99913778   2    1000035    11
    0.00055015178   2    1000022    11
    0.00030263135   2    1000023    11

DECAY 1000013  24.247637
    0.64278669   2   -1000037    14
    0.32165507   2    1000025    13
    0.031527858   2    1000035    13
    0.0020773478   2    1000022    13
    0.0017506325   2    1000023    13
    0.00020239525   2   -1000024    14

DECAY 2000013  6.5141204
    0.9724465   2    1000035    13
    0.013346325   2   -1000024    14
    0.0072333086   2    1000022    13
    0.0069433065   2    1000023    13

DECAY 1000015  11.881665
    0.50002862   2   -1000024    16
    0.25163243   2    1000022    15
    0.24833896   2    1000023    15

DECAY 2000015  42.975062
    0.20775025   2    1000015    35
    0.20772315   2    1000015    36
    0.18642149   2    1000022    15
    0.18509056   2    1000023    15
    0.13422548   2   -1000037    16
    0.067184681   2    1000025    15
    0.0058351093   2    1000015    25
    0.005751874   2    1000015    23

DECAY 1000012  24.194766
    0.641505   2    1000037    11
    0.32057864   2    1000025    12
    0.031874766   2    1000035    12
    0.0043807604   2    1000024    11
    0.0011527668   2    1000022    12
    0.00050807069   2    1000023    12

DECAY 1000014  24.26911
    0.63951538   2    1000037    13
    0.31958426   2    1000025    14
    0.031774094   2    1000035    14
    0.0074705361   2    1000024    13
    0.0011492182   2    1000022    14
    0.00050650669   2    1000023    14

DECAY 1000016  42.791872
    0.41401148   2    1000015    37
    0.37403365   2    1000024    15
    0.13319905   2    1000037    15
    0.066572047   2    1000025    16
    0.011481731   2    1000015    24
    0.00048733176   2    1000022    16
    0.00021470581   2    1000023    16

DECAY 2000001  0.00037953715
    0.57318197   2    1000022    1
    0.33509482   2    1000023    1
    0.090880542   2   -1000024    2
    0.00084183003   2    1000025    1

DECAY 1000001  12.743163
    0.47408082   2   -1000037    2
    0.28719714   2    1000021    1
    0.23654747   2    1000025    1
    0.001314205   2    1000022    1
    0.00056341393   2    1000023    1
    0.0002912152   2   -1000024    2

DECAY 2000003  0.025213561
    0.49384759   2   -1000024    4
    0.25588392   2    1000022    3
    0.250249   2    1000023    3

DECAY 1000003  12.759416
    0.47346799   2   -1000037    4
    0.2868026   2    1000021    3
    0.23624187   2    1000025    3
    0.0019323003   2    1000022    3
    0.0011775522   2    1000023    3
    0.0003660381   2   -1000024    4

DECAY 1000005  266.09256
    0.36413613   2    1000021    5
    0.29303932   2   -1000024    6
    0.1173605   2    1000022    5
    0.11610661   2    1000023    5
    0.072881904   2   -1000037    6
    0.035951529   2    1000025    5
    0.00052401264   2    1000035    5

DECAY 2000005  251.49402
    0.47518782   2    1000021    5
    0.26031811   2   -1000024    6
    0.13084159   2    1000022    5
    0.13025812   2    1000023    5
    0.0028021726   2    1000035    5
    0.00017819047   2    1000006   -24
    0.00017333171   2   -1000037    6

DECAY 1000002  12.740894
    0.47168368   2    1000037    1
    0.28410968   2    1000021    2
    0.23648391   2    1000025    2
    0.0062934598   2    1000024    1
    0.0010086919   2    1000022    2
    0.00041566615   2    1000023    2

DECAY 2000002  13.389688
    0.9906312   2    1000021    2
    0.0092415815   2    1000035    2

DECAY 1000004  12.75696
    0.47108105   2    1000037    3
    0.2837147   2    1000021    4
    0.2361816   2    1000025    4
    0.0075199831   2    1000024    3
    0.0010448714   2    1000022    4
    0.00045290841   2    1000023    4

DECAY 2000004  13.391598
    0.99047833   2    1000021    4
    0.0092400012   2    1000035    4
    0.0001200598   2    1000022    4

DECAY 1000006  269.43662
    0.32916156   2    1000021    6
    0.22728121   2    1000024    5
    0.14402815   2    1000023    6
    0.14228511   2    1000022    6
    0.069214487   2    1000037    5
    0.052112949   3    1000022    24    5
    0.035059755   2    1000025    6
    0.00085430223   2    1000035    6

DECAY 2000006  392.80115
    0.38412285   2    1000021    6
    0.22658228   2    1000024    5
    0.11331026   2    1000023    6
    0.1128434   2    1000022    6
    0.063114211   2    1000005    24
    0.054994512   2    1000006    25
    0.034595334   2    1000006    23
    0.0086807036   2    1000035    6
    0.0011505744   2    1000037    5
    0.00059801286   2    1000025    6

DECAY 1000024  5.8157679e-12
    0.60127788   3    1000022   -1    2
    0.20043986   3    1000022   -11    12
    0.19554151   3    1000022   -13    14
    0.0027407415   3    1000022   -3    4

DECAY 1000037  24.718434
    0.17320419   2    1000024    25
    0.16882651   2    1000023    24
    0.16774228   2    1000024    23
    0.16724019   2    1000022    24
    0.076154574   2    37    1000022
    0.076091328   2    1000024    36
    0.076026125   2    1000024    35
    0.071885442   2    37    1000023
    0.0091204741   3    1000024    6   -6
    0.0069978939   3    1000023   -5    6
    0.0066459624   3    1000022   -5    6

DECAY 1000022 -1


DECAY 1000023  1.138775e-08
    0.85109518   2    1000022    22
    0.037318552   3    1000022    12   -12
    0.027905448   3    1000022    1   -1
    0.027681159   3    1000022    3   -3
    0.021764276   3    1000022    2   -2
    0.0062976155   3    1000022    11   -11
    0.0062179925   3    1000022    13   -13
    0.0051665061   3    1000024    1   -2
    0.0051665061   3   -1000024   -1    2
    0.0029600889   3    1000022    4   -4
    0.001722229   3    1000024    11   -12
    0.001722229   3   -1000024   -11    12
    0.0017009317   3    1000024    13   -14
    0.0017009317   3   -1000024   -13    14
    0.00077548796   3    1000024    3   -4
    0.00077548796   3   -1000024   -3    4

DECAY 1000025  26.705931
    0.15633924   2    1000024   -24
    0.15633924   2   -1000024    24
    0.12231901   2    1000023    25
    0.1120398   2    1000022    25
    0.10992124   2    1000023    23
    0.070190036   2    37   -1000024
    0.070190036   2   -37    1000024
    0.058488781   2    1000022    35
    0.053998325   2    1000023    35
    0.045517953   2    1000022    23
    0.012780477   2    1000023    36
    0.012093886   2    1000022    36
    0.0059717491   3    1000024    5   -6
    0.0059717491   3   -1000024   -5    6
    0.0039572471   3    1000023    6   -6
    0.0038178591   3    1000022    6   -6

DECAY 1000035  22.672301
    0.19116416   2    1000015   -15
    0.19116416   2   -1000015    15
    0.079456329   2    1000024   -24
    0.079456329   2   -1000024    24
    0.053726751   2    37   -1000024
    0.053726751   2   -37    1000024
    0.053544296   2    1000023    25
    0.052506791   2    1000023    23
    0.049081429   2    1000022    25
    0.038765244   2    1000022    35
    0.035805397   2    1000023    35
    0.028385392   2    1000022    23
    0.016920552   2    1000023    36
    0.015884482   2    1000022    36
    0.011383757   2    2000003   -3
    0.011383757   2   -2000003    3
    0.011382872   2    2000001   -1
    0.011382872   2   -2000001    1
    0.0037377259   3    1000024    5   -6
    0.0037377259   3   -1000024   -5    6
    0.0028952011   3    1000023    6   -6
    0.0028115728   3    1000022    6   -6
    0.00055699992   2    1000025    25
    0.00050958895   2    1000037   -24
    0.00050958895   2   -1000037    24

DECAY 1000021  9.3631765
    0.24736412   2    2000003   -3
    0.24736412   2   -2000003    3
    0.24733458   2    2000001   -1
    0.24733458   2   -2000001    1
    0.0023559224   3    1000024    5   -6
    0.0023559224   3   -1000024   -5    6
    0.0012556024   3    1000023    6   -6
    0.0012434493   3    1000022    6   -6
    0.0011506445   3    1000022    5   -5
    0.0011379116   3    1000023    5   -5
    0.00016155685   3    1000037    3   -4
    0.00016155685   3   -1000037   -3    4
    0.00016155262   3    1000037    1   -2
    0.00016155262   3   -1000037   -1    2

DECAY 25  0.0043465195
    0.53775552   2   -5    5
    0.26763574   2   -24    24
    0.068712765   2    21    21
    0.061767758   2   -15    15
    0.034072416   2    23    23
    0.025672842   2   -4    4
    0.0022863304   2    22    22
    0.0016800989   2    22    23
    0.00021431719   2   -13    13
    0.00020151784   2   -3    3
    5.5717162e-07   2   -1    1
    1.3229083e-07   2   -2    2
    4.8180579e-09   2   -11    11

DECAY 35  52.719636
    0.88095665   2   -5    5
    0.11772264   2   -15    15
    0.00041805291   2   -13    13
    0.00034831346   2   -6    6
    0.00032896381   2   -3    3
    0.00012053738   2   -1000024    1000024
    4.9423994e-05   2    21    21
    3.2897711e-05   2    1000022    1000022
    1.2419356e-05   2    1000023    1000023
    4.5013981e-06   2    1000022    1000023
    3.4193109e-06   2    25    25
    9.0933341e-07   2   -1    1
    6.5790668e-07   2   -24    24
    5.6956307e-07   2    23    23
    2.0054749e-08   2    22    22
    9.3920415e-09   2   -11    11
    9.0799878e-09   2    22    23
    5.6693342e-09   2   -4    4
    2.9236045e-14   2   -2    2

DECAY 36  49.849969
    0.88059906   2   -5    5
    0.11767761   2   -15    15
    0.00041788902   2   -13    13
    0.00038941836   2   -1000024    1000024
    0.00037209001   2   -6    6
    0.00032882251   2   -3    3
    9.8763135e-05   2    1000022    1000022
    6.7324844e-05   2    21    21
    4.4919517e-05   2    1000023    1000023
    2.2149267e-06   2    1000022    1000023
    9.0894306e-07   2   -1    1
    8.4167499e-07   2    23    25
    7.095786e-08   2    22    22
    5.4009467e-08   2    22    23
    9.3883644e-09   2   -11    11
    5.4595969e-09   2   -4    4
    2.8165126e-14   2   -2    2
    1.5758103e-37   2    25    25

DECAY 37  51.808929
    0.86947933   2   -5    6
    0.12836536   2   -15    16
    0.0013258468   2   -5    4
    0.00045381927   2   -13    14
    0.00030515958   2   -3    4
    3.412457e-05   2    1000023    1000024
    1.4121881e-05   2   -3    2
    1.0140571e-05   2    1000022    1000024
    9.4679349e-06   2   -5    2
    8.8391283e-07   2   -3    6
    8.4657156e-07   2   -1    2
    8.2053415e-07   2    24    25
    3.9260862e-08   2   -1    4
    2.0869963e-08   2   -1    6
    1.061488e-08   2   -11    12
    1.4258198e-11   2    24    35
    8.1498643e-12   2    24    36

DECAY 6  2.43
    1   2    5    24

DECAY 15 -1
