BLOCK DCINFO
   1   SDECAY/HDECAY
   2   1.3b /3.4

BLOCK SPINFO
   1   SOFTSUSY
   2   3.4.0

BLOCK MODSEL
   1   0

BLOCK SMINPUTS
   1    127.90897
   2    1.1663787e-05
   3    0.1184
   4    91.1876
   5    4.18
   6    173.2
   7    1.777

BLOCK MINPAR
   3    26.29

BLOCK EXTPAR
   0   -1
   1    1398.62
   2   -1777.6
   3    3310.18
   11   -4050.83
   12    2358
   13   -2790.72
   23    493.54
   26    3202.73
   31    630.14
   32    630.14
   33    2329.82
   34    2223.54
   35    2223.54
   36    2395.18
   41    2845.94
   42    2845.94
   43    2278.79
   44    2402.81
   45    2402.81
   46    3557.58
   47    2605.38
   48    2605.38
   49    1736.43

BLOCK MASS
   24    80.380047
   25    126.94432
   35    3202.7347
   36    3202.73
   37    3204.1228
   5    4.8187603
   1000001    2962.263
   2000001    2715.2413
   1000002    2961.3286
   2000002    2517.8827
   1000003    2962.263
   2000003    2715.2413
   1000004    2961.3286
   2000004    2517.8827
   1000005    1854.4241
   2000005    2375.8121
   1000006    2369.0309
   2000006    3582.0809
   1000011    677.60278
   2000011    2227.7345
   1000012    672.72092
   1000013    677.60278
   2000013    2227.7345
   1000014    672.72092
   1000015    2342.4179
   2000015    2394.51
   1000016    2341.4046
   1000021    3372.1653
   1000022   -511.96278
   1000023    513.69616
   1000025    1383.7241
   1000035   -1807.3354
   1000024    513.16092
   1000037    1807.5027

BLOCK NMIX
   1   1   -0.015574279
   1   2   -0.041133356
   1   3    0.70761878
   1   4    0.70522418
   2   1   -0.036831906
   2   2   -0.025066232
   2   3   -0.70634317
   2   4    0.70646615
   3   1    0.9991999
   3   2   -0.00091811964
   3   3   -0.014999935
   3   4    0.037063802
   4   1   -0.00064722598
   4   2    0.99883877
   4   3    0.011400841
   4   4    0.046805061

BLOCK UMIX
   1   1   -0.016142458
   1   2    0.9998697
   2   1   -0.9998697
   2   2   -0.016142458

BLOCK VMIX
   1   1    0.066231821
   1   2    0.99780426
   2   1    0.99780426
   2   2   -0.066231821

BLOCK STOPMIX
   1   1    0.99679519
   1   2    0.07999592
   2   1   -0.07999592
   2   2    0.99679519

BLOCK SBOTMIX
   1   1    0.010767815
   1   2    0.99994202
   2   1   -0.99994202
   2   2    0.010767815

BLOCK STAUMIX
   1   1    0.99396085
   1   2    0.10973531
   2   1   -0.10973531
   2   2    0.99396085

BLOCK ALPHA
      -0.039565036

BLOCK HMIX Q=  2847.112
   1    501.33972
   2    25.313848
   3    242.46217
   4    10085350

BLOCK GAUGE Q=  2847.112
   1    0.36499773
   2    0.63817597
   3    1.0100469

BLOCK AU Q=  2847.112
   1   1    0
   2   2    0
   3   3   -4050.83

BLOCK AD Q=  2847.112
   1   1    0
   2   2    0
   3   3    2358

BLOCK AE Q=  2847.112
   1   1    0
   2   2    0
   3   3   -2790.72

BLOCK YU Q=  2847.112
   1   1    0
   2   2    0
   3   3    0.81584275

BLOCK YD Q=  2847.112
   1   1    0
   2   2    0
   3   3    0.32828226

BLOCK YE Q=  2847.112
   1   1    0
   2   2    0
   3   3    0.25393166

BLOCK MSOFT Q=  2847.112
   1    1398.62
   2   -1777.6
   3    3310.18
   21    10016119
   22   -123340.73
   31    630.14
   32    630.14
   33    2329.82
   34    2223.54
   35    2223.54
   36    2395.18
   41    2845.94
   42    2845.94
   43    2278.79
   44    2402.81
   45    2402.81
   46    3557.58
   47    2605.38
   48    2605.38
   49    1736.43

BLOCK HIGGSBOUNDSINPUTHIGGSCOUPLINGSFERMIONS
       0, 640.79088,3,36,15,15

BLOCK HIGGSBOUNDSINPUTHIGGSCOUPLINGSBOSONS
       0,4,36,21,21,23

DECAY 6  1.4347786
    1   2    5    24

DECAY 1000021  116.4858
    0.13167762   2    1000005   -5
    0.13167762   2   -1000005    5
    0.06890593   2    2000005   -5
    0.06890593   2   -2000005    5
    0.066928981   2    1000006   -6
    0.066928981   2   -1000006    6
    0.053684632   2    2000002   -2
    0.053684632   2   -2000002    2
    0.053684558   2    2000004   -4
    0.053684558   2   -2000004    4
    0.033908149   2    2000001   -1
    0.033908149   2   -2000001    1
    0.033908149   2    2000003   -3
    0.033908149   2   -2000003    3
    0.014356025   2    1000002   -2
    0.014356025   2   -1000002    2
    0.014355923   2    1000004   -4
    0.014355923   2   -1000004    4
    0.014295015   2    1000001   -1
    0.014295015   2   -1000001    1
    0.014295015   2    1000003   -3
    0.014295015   2   -1000003    3

DECAY 1000006  37.852233
    0.37024516   2    1000022    6
    0.36991705   2    1000023    6
    0.12165765   2    1000024    5
    0.088784249   2    1000037    5
    0.043950905   2    1000035    6
    0.0040257642   2    1000025    6
    0.0014192261   2    1000005    24

DECAY 2000006  163.57211
    0.27780011   2    1000024    5
    0.19671939   2    2000005    24
    0.13852368   2    1000023    6
    0.13800674   2    1000022    6
    0.10195432   2    1000006    23
    0.10183901   2    1000006    25
    0.037719686   2    1000025    6
    0.007381142   2    1000021    6
    5.1090205e-05   2    1000005    24
    2.7171633e-06   2    1000035    6
    2.1115566e-06   2    1000037    5

DECAY 1000005  6.9218649
    0.47885381   2   -1000024    6
    0.24580095   2    1000022    5
    0.24439262   2    1000023    5
    0.030952594   2    1000025    5
    1.6746601e-08   2    1000035    5

DECAY 2000005  38.053011
    0.73892924   2   -1000024    6
    0.088717911   2   -1000037    6
    0.06120551   2    1000022    5
    0.060776135   2    1000023    5
    0.044799154   2    1000035    5
    0.0040779318   2    1000025    5
    0.00075163021   2    1000005    23
    0.00074249188   2    1000005    25

DECAY 1000002  14.34563
    0.64813223   2    1000037    1
    0.32472882   2    1000035    2
    0.018078143   2    1000025    2
    0.0067663044   2    1000024    1
    0.0015005076   2    1000022    2
    0.00079400108   2    1000023    2

DECAY 2000002  2.887166
    0.99700488   2    1000025    2
    0.0025404297   2    1000023    2
    0.00045449103   2    1000022    2
    2.0336049e-07   2    1000035    2

DECAY 1000001  14.301627
    0.65349384   2   -1000037    2
    0.3262249   2    1000035    1
    0.018498558   2    1000025    1
    0.0011274533   2    1000022    1
    0.00040330461   2   -1000024    2
    0.00025193704   2    1000023    1

DECAY 2000001  0.87022223
    0.99730253   2    1000025    1
    0.0022879476   2    1000023    1
    0.00040928638   2    1000022    1
    2.3819039e-07   2    1000035    1

DECAY 1000004  14.512759
    0.64803196   2    1000037    3
    0.32467889   2    1000035    4
    0.018151916   2    1000025    4
    0.0068233707   2    1000024    3
    0.0015131704   2    1000022    4
    0.00080069512   2    1000023    4

DECAY 2000004  2.8940099
    0.99698893   2    1000025    4
    0.0025539574   2    1000023    4
    0.00045691489   2    1000022    4
    2.0177353e-07   2    1000035    4

DECAY 1000003  14.46785
    0.65343195   2   -1000037    4
    0.3261951   2    1000035    3
    0.018575119   2    1000025    3
    0.0011370319   2    1000022    3
    0.0004067286   2   -1000024    4
    0.00025407539   2    1000023    3

DECAY 2000003  0.87740102
    0.99728976   2    1000025    3
    0.0022987798   2    1000023    3
    0.00041122745   2    1000022    3
    2.3683176e-07   2    1000035    3

DECAY 1000011  0.0025826886
    0.49016328   2    1000022    11
    0.40909051   2    1000023    11
    0.10074621   2   -1000024    12

DECAY 2000011  4.4644302
    0.99620744   2    1000025    11
    0.00321683   2    1000023    11
    0.00057560454   2    1000022    11
    1.2945584e-07   2    1000035    11

DECAY 1000013  0.002582688
    0.49016327   2    1000022    13
    0.4090905   2    1000023    13
    0.10074624   2   -1000024    14

DECAY 2000013  4.4644301
    0.99620744   2    1000025    13
    0.00321683   2    1000023    13
    0.00057560454   2    1000022    13
    1.2945583e-07   2    1000035    13

DECAY 1000015  8.7910904
    0.34852489   2   -1000037    16
    0.17386845   2    1000035    15
    0.16038168   2    1000022    15
    0.15626606   2    1000023    15
    0.1539845   2    1000025    15
    0.006974423   2   -1000024    16

DECAY 2000015  11.17717
    0.49881352   2    1000025    15
    0.24487087   2   -1000024    16
    0.1264626   2    1000023    15
    0.12336207   2    1000022    15
    0.0043304737   2   -1000037    16
    0.0021604623   2    1000035    15

DECAY 1000012  0.0046887537
    0.89148317   2    1000024    11
    0.10689995   2    1000022    12
    0.0016168859   2    1000023    12

DECAY 1000014  0.0046887525
    0.89148314   2    1000024    13
    0.10689998   2    1000022    14
    0.0016168863   2    1000023    14

DECAY 1000016  8.7527395
    0.35230395   2    1000037    15
    0.31955544   2    1000024    15
    0.17674528   2    1000035    16
    0.15035922   2    1000025    16
    0.0010203945   2    1000022    16
    1.5715227e-05   2    1000023    16

DECAY 1000024  1.6466062e-12
    0.59997689   3    1000022    2   -1
    0.20001156   3    1000022   -11    12
    0.20001156   3    1000022   -13    14

DECAY 1000037  35.153467
    0.15391222   2    1000012   -11
    0.15391222   2    1000014   -13
    0.15382696   2   -1000011    12
    0.15382696   2   -1000013    14
    0.097527225   2    1000024    25
    0.097428444   2    1000024    23
    0.094932173   2    1000023    24
    0.094620616   2    1000022    24
    1.3181434e-05   2    1000025    24

DECAY 1000022 -1


DECAY 1000023  1.6786135e-11
    0.33882687   2    1000022    22
    0.14271317   3    1000022   -1    1
    0.14271317   3    1000022   -3    3
    0.10992864   3    1000022   -2    2
    0.065583566   3    1000022   -12    12
    0.065583566   3    1000022   -14    14
    0.065583026   3    1000022   -16    16
    0.032793006   3    1000022   -11    11
    0.032793006   3    1000022   -13    13
    0.00034819461   3    1000024   -12    11
    0.00034819461   3   -1000024    12   -11
    0.00034819461   3    1000024   -14    13
    0.00034819461   3   -1000024    14   -13

DECAY 1000025  7.7406573
    0.10926071   2    1000024   -24
    0.10926071   2   -1000024    24
    0.10185456   2    1000023    25
    0.094855703   2    1000022    23
    0.069183171   2    1000012   -12
    0.069183171   2   -1000012    12
    0.069183171   2    1000014   -14
    0.069183171   2   -1000014    14
    0.068121573   2    1000011   -11
    0.068121573   2   -1000011    11
    0.068121573   2    1000013   -13
    0.068121573   2   -1000013    13
    0.018093787   2    1000022    25
    0.017455553   2    1000023    23

DECAY 1000035  35.144742
    0.094994158   2    1000024   -24
    0.094994158   2   -1000024    24
    0.077180355   2    1000012   -12
    0.077180355   2   -1000012    12
    0.077180355   2    1000014   -14
    0.077180355   2   -1000014    14
    0.076705367   2    1000011   -11
    0.076705367   2   -1000011    11
    0.076705367   2    1000013   -13
    0.076705367   2   -1000013    13
    0.071146246   2    1000022    25
    0.070947852   2    1000023    23
    0.026416531   2    1000022    23
    0.025944881   2    1000023    25
    1.3034358e-05   2    1000025    23
    2.5254588e-07   2    1000025    25

DECAY 25  0.0044249696
    0.57611514   2    5   -5
    0.23448199   2    24   -24
    0.075446279   2    21    21
    0.059634412   2   -15    15
    0.030094967   2    23    23
    0.019844409   2    4   -4
    0.0022694756   2    22    22
    0.0016725772   2    22    23
    0.00022965977   2    3   -3
    0.00021109534   2   -13    13

DECAY 35  45.449256
    0.48170758   2    5   -5
    0.12033658   2    1000024   -1000037
    0.12033658   2    1000037   -1000024
    0.096230788   2   -15    15
    0.072323737   2    1000023    1000035
    0.048280347   2    1000022    1000035
    0.033251488   2    1000022    1000025
    0.019871854   2    1000023    1000025
    0.0044209854   2    6   -6
    0.0022673199   2    1000024   -1000024
    0.00035522769   2   -13    13
    0.00029526185   2    1000022    1000022
    0.00019033779   2    3   -3
    9.4859319e-05   2    1000022    1000023
    1.0547513e-05   2    1000025    1000035
    6.8005436e-06   2    25    25
    6.640523e-06   2    1000023    1000023
    4.3768548e-06   2    21    21
    4.0065251e-06   2    1000025    1000025
    1.543442e-06   2    24   -24
    8.820665e-07   2    1000012   -1000012
    8.820665e-07   2    1000014   -1000014
    7.7013468e-07   2    23    23
    2.7031116e-07   2    1000011   -1000011
    2.7031116e-07   2    1000013   -1000013
    4.492503e-08   2    4   -4
    7.4137131e-09   2    22    22
    2.9138804e-09   2    23    22

DECAY 36  45.451265
    0.4817127   2    5   -5
    0.12023244   2    1000024   -1000037
    0.12023244   2    1000037   -1000024
    0.096227122   2   -15    15
    0.072536619   2    1000022    1000035
    0.048066893   2    1000023    1000035
    0.033223095   2    1000023    1000025
    0.019911438   2    1000022    1000025
    0.0044360331   2    6   -6
    0.00243133   2    1000024   -1000024
    0.00035521367   2   -13    13
    0.00028087877   2    1000022    1000022
    0.00019035126   2    3   -3
    0.00010606978   2    1000022    1000023
    2.3574426e-05   2    21    21
    2.3406305e-05   2    1000025    1000025
    8.6714795e-06   2    1000023    1000023
    1.564125e-06   2    23    25
    8.538653e-08   2    1000025    1000035
    4.5152903e-08   2    4   -4
    1.9702155e-08   2    23    22
    8.6868175e-09   2    22    22

DECAY 37  44.222597
    0.47132533   2    6   -5
    0.12481965   2    1000037    1000022
    0.12406504   2    1000024    1000035
    0.12386832   2    1000037    1000023
    0.098943677   2   -15    16
    0.054272951   2    1000024    1000025
    0.0010215825   2    1000024    1000023
    0.00078571205   2    4   -5
    0.00036524159   2   -13    14
    0.0003068584   2    1000024    1000022
    0.00019271761   2    4   -3
    1.1492494e-05   2    1000037    1000025
    9.7887895e-06   2    2   -3
    7.8571117e-06   2    2   -5
    1.6105676e-06   2    24    25
    1.0911465e-06   2   -1000011    1000012
    1.0911465e-06   2   -1000013    1000014
    1.558955e-13   2    24    36

DECAY 5 -1


DECAY 15 -1


DECAY 23  2.4952


DECAY 24  2.085
