BLOCK SPINFO
   1   SPheno
   2   v4.0.5be

BLOCK SPHENOINFO
   1   2
   2   2

BLOCK MODSEL
   1   0

BLOCK MINPAR
   3    13.171693
   4    1

BLOCK EXTPAR
   0    1326.6927
   1   -194.65106
   2   -838.03226
   3    3000
   11   -2846.2319
   12    87.458072
   13   -614.46336
   23    220.23037
   25    12.690568
   26    2072.8053
   31    743.0991
   32    743.0991
   33    809.95704
   34    1299.4466
   35    1299.4466
   36    1932.9211
   41    5000
   42    5000
   43    1491.5616
   44    5000
   45    5000
   46    1312.5225
   47    5000
   48    5000
   49    1028.3395

BLOCK SMINPUTS
   1    127.90897
   2    1.1663787e-05
   3    0.1184
   4    91.1876
   5    4.18
   6    173.2
   7    1.777
   8    0
   11    0.00051099893
   12    0
   13    0.10565837
   14    0
   21    0.005
   22    0.0025
   23    0.095
   24    1.27

BLOCK GAUGE Q=  1326.6927
   1    0.35536298
   2    0.66519887
   3    1.219778

BLOCK YU Q=  1326.6927
   1   1    8.4103621e-06
   2   2    0.004272464
   3   3    1.0160393

BLOCK YD Q=  1326.6927
   1   1    0.00021447466
   2   2    0.0040750185
   3   3    0.21269166

BLOCK YE Q=  1326.6927
   1   1    3.7427396e-05
   2   2    0.0077387985
   3   3    0.13015386

BLOCK AU Q=  1326.6927
   1   1    0
   2   2    0
   3   3   -2846.232

BLOCK AD Q=  1326.6927
   1   1    0
   2   2    0
   3   3    87.45807

BLOCK AE Q=  1326.6927
   1   1    0
   2   2    0
   3   3   -614.46336

BLOCK MSOFT Q=  1326.6927
   1   -194.65106
   2   -838.03226
   3    3000
   21    4213803.5
   22    287.65075
   31    743.0991
   32    743.0991
   33    809.95704
   34    1299.4466
   35    1299.4466
   36    1932.9211
   41    5000
   42    5000
   43    1491.5616
   44    5000
   45    5000
   46    1312.5225
   47    5000
   48    5000
   49    1028.3395

BLOCK MASS
   6    173.2
   23    91.1876
   24    80.429995
   15    1.777
   25    122.68868
   35    2072.6414
   36    2072.8053
   37    2074.5098
   1000001    5021.6367
   2000001    5011.7999
   1000002    5021.2007
   2000002    5013.3099
   1000003    5021.6377
   2000003    5011.8007
   1000004    5021.2016
   2000004    5013.3109
   1000005    982.82984
   2000005    1449.301
   1000006    1154.9956
   2000006    1523.9136
   1000011    755.07547
   2000011    1301.1586
   1000012    750.5494
   1000013    755.07424
   2000013    1301.157
   1000014    750.54839
   1000015    820.81903
   2000015    1934.4925
   1000016    816.63925
   1000021    3177.2289
   1000022   -178.16378
   1000023    230.20353
   1000025   -239.81479
   1000035   -879.79776
   1000024    223.61556
   1000037    879.96443

BLOCK ALPHA
      -0.076153322

BLOCK HMIX Q=  1326.6927
   1    220.23037
   2    12.690568
   3    244.12038
   4    4296521.8

BLOCK STOPMIX
   1   1    0.45790733
   1   2    0.88899993
   2   1   -0.88899993
   2   2    0.45790733

BLOCK SBOTMIX
   1   1    0.0054388978
   1   2    0.99998521
   2   1   -0.99998521
   2   2    0.0054388978

BLOCK STAUMIX
   1   1    0.99999812
   1   2    0.0019414005
   2   1   -0.0019414005
   2   2    0.99999812

BLOCK NMIX
   1   1   -0.82569774
   1   2    0.034872678
   1   3   -0.44700819
   1   4   -0.34233144
   2   1    0.079860508
   2   2   -0.055490956
   2   3   -0.69638559
   2   4    0.71104864
   3   1    0.55839589
   3   2    0.070716032
   3   3   -0.56120547
   3   4   -0.60682921
   4   1   -0.0062910233
   4   2    0.99534109
   4   3    0.016709343
   4   4    0.094748763

BLOCK UMIX
   1   1   -0.023789279
   1   2    0.99971699
   2   1   -0.99971699
   2   2   -0.023789279

BLOCK VMIX
   1   1    0.13413019
   1   2    0.99096372
   2   1    0.99096372
   2   2   -0.13413019

BLOCK HIGGSBOUNDSINPUTHIGGSCOUPLINGSFERMIONS
       0, 161.0505,3,36,15,15

BLOCK HIGGSBOUNDSINPUTHIGGSCOUPLINGSBOSONS
       0,4,36,21,21,23

BLOCK SPHENOLOWENERGY
   1    0.00031114687
   2    1.5894568e-06
   3    3.5201962e-05
   4    2.593509e-15
   5    1.1079176e-10
   6    2.3193325e-08
   7    8.7317819e-14
   8    3.7302146e-09
   9    7.9121944e-07
   10    9.6588507e-05
   11    0.99772229
   12    0.54318193
   13    19.407287
   14    0
   15    0
   16    0.002162116
   17    2.2817073e-15
   18    2.4783994e-11
   19    8.2857785e-11
   20   -4.6314151e-15
   21   -1.9800885e-10
   22   -5.1310889e-08
   23    0
   24    0
   25    0
   26    0
   27    0
   28    0
   29    0
   30    0
   31    0
   39    3.3923425e-05
   40    0
   41    0
   42    0

BLOCK FWCOEF Q=  160
   305   4422   0   0   -0.18881911
   305   4422   0   2   -0.17549845
   305   4322   0   2   -9.4884617e-05
   305   6421   0   0   -0.095227835
   305   6421   0   2   -0.098108307
   305   6321   0   2   -0.00023377448
   3051111   4133   0   0    1.5873982
   3051111   4133   0   2    1.5885854
   3051111   4233   0   2    2.073241e-05
   3051111   4137   0   0   -4.4100903
   3051111   4137   0   2   -4.4034218
   3051111   4237   0   2   -0.00016142817
   3051313   4133   0   0    1.5873982
   3051313   4133   0   2    1.5885848
   3051313   4233   0   2    2.0732385e-05
   3051313   4137   0   0   -4.4100903
   3051313   4137   0   2   -4.4034224
   3051313   4237   0   2   -0.0001614282
   3051212   4137   0   0    1.5053501
   3051212   4137   0   2    1.5039086
   3051212   4237   0   2    3.5204199e-05
   3051414   4137   0   0    1.5053501
   3051414   4137   0   2    1.5039086
   3051414   4237   0   2    3.5204202e-05
   3051616   4137   0   0    1.5053501
   3051616   4137   0   2    1.5039086
   3051616   4237   0   2    3.5205121e-05

BLOCK IMFWCOEF Q=  160
   305   4422   0   0    3.8583428e-07
   305   4422   0   2   -6.4612397e-06
   305   4322   0   2    2.2488245e-06
   305   6421   0   0    3.3049258e-07
   305   6421   0   2   -5.0463814e-06
   305   6321   0   2    8.21922e-07
   3051111   4133   0   2   -2.9059281e-06
   3051111   4233   0   2    5.0159734e-07
   3051111   4137   0   2    2.1764427e-05
   3051111   4237   0   2   -3.9141044e-06
   3051313   4133   0   2   -2.9059227e-06
   3051313   4233   0   2    5.0159713e-07
   3051313   4137   0   2    2.1764438e-05
   3051313   4237   0   2   -3.9141051e-06
   3051212   4137   0   2   -4.4910719e-06
   3051212   4237   0   2    8.5367388e-07
   3051414   4137   0   2   -4.491072e-06
   3051414   4237   0   2    8.5367388e-07
   3051616   4137   0   2   -4.4902877e-06
   3051616   4237   0   2    8.5367631e-07

DECAY 23  2.4952


DECAY 24  2.085


DECAY 1000011  0.85854998
    0.56966514   2    1000022    11
    0.42616414   2    1000025    11
    0.0036466265   2   -1000024    12
    0.00052408978   2    1000023    11

DECAY 2000011  6.2333753
    0.68851575   2    1000022    11
    0.305195   2    1000025    11
    0.0062770149   2    1000023    11

DECAY 1000013  0.85929589
    0.56935747   2    1000022    13
    0.42605764   2    1000025    13
    0.0036434529   2   -1000024    14
    0.0009414336   2    1000023    13

DECAY 2000013  6.2363
    0.68823944   2    1000022    13
    0.30512477   2    1000025    13
    0.0063872337   2    1000023    13
    0.00023398787   2   -1000024    14

DECAY 1000015  1.1939887
    0.49633941   2    1000022    15
    0.40500639   2    1000025    15
    0.0956244   2    1000023    15
    0.0030298046   2   -1000024    16

DECAY 2000015  10.803118
    0.61471299   2    1000022    15
    0.29055442   2    1000025    15
    0.058684756   2   -1000024    16
    0.034081658   2    1000023    15
    0.00094514275   2    1000016   -24
    0.00046817162   2    1000015    23
    0.00046594941   2    1000015    25

DECAY 1000012  0.92925017
    0.71720958   2    1000022    12
    0.14846418   2    1000025    12
    0.10621675   2    1000024    11
    0.028109486   2    1000023    12

DECAY 1000014  0.92999222
    0.71663612   2    1000022    14
    0.14834542   2    1000025    14
    0.10693145   2    1000024    13
    0.028087004   2    1000023    14

DECAY 1000016  1.2699056
    0.58166962   2    1000022    16
    0.27280645   2    1000024    15
    0.12241597   2    1000025    16
    0.023107955   2    1000023    16

DECAY 2000001  144.30764
    0.98067206   2    1000021    1
    0.01318592   2    1000022    1
    0.0060181154   2    1000025    1
    0.00012315448   2    1000023    1

DECAY 1000001  205.55172
    0.6934656   2    1000021    1
    0.2019396   2   -1000037    2
    0.10031565   2    1000035    1
    0.0035492415   2    1000022    1
    0.00052038428   2    1000023    1
    0.00012122605   2   -1000024    2

DECAY 2000003  144.31101
    0.98064971   2    1000021    3
    0.013187893   2    1000022    3
    0.006021564   2    1000025    3
    0.00012867699   2    1000023    3

DECAY 1000003  205.55529
    0.69345402   2    1000021    3
    0.20193629   2   -1000037    4
    0.10031393   2    1000035    3
    0.0035507842   2    1000022    3
    0.00052426235   2    1000023    3
    0.00012989979   2   -1000024    4

DECAY 1000005  2.0383877
    0.36227125   2   -1000024    6
    0.25443521   2    1000022    5
    0.19435438   2    1000025    5
    0.18893834   2    1000023    5

DECAY 2000005  55.145089
    0.48960093   2   -1000024    6
    0.3400986   2    1000006   -24
    0.09741803   2   -1000037    6
    0.045811674   2    1000035    5
    0.01147471   2    1000023    5
    0.0081740415   2    1000022    5
    0.0072078419   2    1000025    5
    0.00013177448   2    1000005    25

DECAY 2000002  152.83574
    0.92698027   2    1000021    2
    0.049815685   2    1000022    2
    0.022736112   2    1000025    2
    0.00046521361   2    1000023    2

DECAY 1000002  205.54823
    0.69325637   2    1000021    2
    0.19840277   2    1000037    1
    0.099856967   2    1000035    2
    0.0038535254   2    1000024    1
    0.0030987416   2    1000025    2
    0.0013492617   2    1000022    2
    0.00018236291   2    1000023    2

DECAY 2000004  152.8394
    0.92695831   2    1000021    4
    0.049815896   2    1000022    4
    0.022739917   2    1000025    4
    0.00047120229   2    1000023    4

DECAY 1000004  205.55174
    0.69324472   2    1000021    4
    0.19839943   2    1000037    3
    0.099855325   2    1000035    4
    0.0038614731   2    1000024    3
    0.003101946   2    1000025    4
    0.0013502742   2    1000022    4
    0.00018682753   2    1000023    4

DECAY 1000006  37.357613
    0.42106928   2    1000024    5
    0.25403162   2    1000023    6
    0.2316121   2    1000025    6
    0.067863037   2    1000022    6
    0.019366379   2    1000037    5
    0.0060392699   2    1000035    6

DECAY 2000006  68.043752
    0.23423261   2    1000023    6
    0.20524211   2    1000006    23
    0.14470949   2    1000025    6
    0.13987269   2    1000024    5
    0.11012523   2    1000006    25
    0.086638951   2    1000022    6
    0.054273848   2    1000037    5
    0.024745906   2    1000035    6
    0.0001591548   2    1000005    24

DECAY 1000024  0.00026780801
    0.33383532   3    1000022   -1    2
    0.33274819   3    1000022   -3    4
    0.11138306   3    1000022   -11    12
    0.11138126   3    1000022   -13    14
    0.11065218   3    1000022   -15    16

DECAY 1000037  8.1971834
    0.21229635   2    1000023    24
    0.20957054   2    1000024    23
    0.20450723   2    1000024    25
    0.17643299   2    1000025    24
    0.037567422   2    1000022    24
    0.034457475   2    1000014   -13
    0.034456969   2    1000012   -11
    0.032840517   2   -1000013    14
    0.032839923   2   -1000011    12
    0.0089318634   2    1000016   -15
    0.0079694398   2   -1000015    16
    0.0027433928   3    1000023   -5    6
    0.002731642   3    1000025   -5    6
    0.0019194266   3    1000024    6   -6
    0.00069045286   3    1000022   -5    6

DECAY 1000022 -1


DECAY 1000023  0.00040548901
    0.20435446   3    1000022    12   -12
    0.15256142   3    1000022    1   -1
    0.15255642   3    1000022    3   -3
    0.14335618   3    1000022    5   -5
    0.11898657   3    1000022    2   -2
    0.11816649   3    1000022    4   -4
    0.034409837   3    1000022    11   -11
    0.034408127   3    1000022    13   -13
    0.033935094   3    1000022    15   -15
    0.0071899048   2    1000022    22

DECAY 1000025  1.3028459e-05
    0.10747233   3    1000022    12   -12
    0.078859701   3    1000024    1   -2
    0.078859701   3   -1000024   -1    2
    0.076927333   3    1000022    1   -1
    0.076925927   3    1000022    3   -3
    0.07654022   3    1000024    3   -4
    0.07654022   3   -1000024   -3    4
    0.07496218   3    1000022    5   -5
    0.060081578   3    1000022    2   -2
    0.059848396   3    1000022    4   -4
    0.026277587   3    1000024    11   -12
    0.026277587   3   -1000024   -11    12
    0.026273788   3    1000024    13   -14
    0.026273788   3   -1000024   -13    14
    0.024802142   3    1000024    15   -16
    0.024802142   3   -1000024   -15    16
    0.015914706   3    1000022    15   -15
    0.015142972   3    1000022    13   -13
    0.015142737   3    1000022    11   -11
    0.012972605   2    1000022    22
    0.007639469   2    1000023    22
    0.0028610699   3    1000023    12   -12
    0.0021408526   3    1000023    1   -1
    0.0021384242   3    1000023    3   -3
    0.0016696641   3    1000023    2   -2
    0.0013218786   3    1000023    4   -4
    0.00048325847   3    1000023    11   -11
    0.00048239655   3    1000023    13   -13
    0.00029074568   3    1000023    15   -15

DECAY 1000035  9.3055718
    0.19018337   2    1000024   -24
    0.19018337   2   -1000024    24
    0.16812789   2    1000023    25
    0.12797619   2    1000023    23
    0.10213518   2    1000025    25
    0.046631776   2    1000025    23
    0.019192304   2    1000022    25
    0.015380478   2    1000014   -14
    0.015380478   2   -1000014    14
    0.015380257   2    1000012   -12
    0.015380257   2   -1000012    12
    0.014208609   2    1000013   -13
    0.014208609   2   -1000013    13
    0.014208362   2    1000011   -11
    0.014208362   2   -1000011    11
    0.013872867   2    1000022    23
    0.0039764227   2    1000016   -16
    0.0039764227   2   -1000016    16
    0.0036110839   3    1000024    5   -6
    0.0036110839   3   -1000024   -5    6
    0.0034354348   2    1000015   -15
    0.0034354348   2   -1000015    15
    0.00067675254   3    1000023    6   -6
    0.00044247308   3    1000025    6   -6
    0.00012896542   3    1000022    6   -6

DECAY 1000021  261.49471
    0.14705151   2    1000005   -5
    0.14705151   2   -1000005    5
    0.12150259   2    1000006   -6
    0.12150259   2   -1000006    6
    0.11856783   2    2000006   -6
    0.11856783   2   -2000006    6
    0.11277957   2    2000005   -5
    0.11277957   2   -2000005    5

DECAY 25  0.0035612071
    0.60596447   2   -5    5
    0.19408005   2   -24    24
    0.074152303   2    21    21
    0.069459641   2   -15    15
    0.029776609   2   -4    4
    0.022426568   2    23    23
    0.0023564134   2    22    22
    0.0013147111   2    22    23
    0.00024089707   2   -13    13
    0.00022755251   2   -3    3
    6.2915946e-07   2   -1    1
    1.534508e-07   2   -2    2
    5.4156642e-09   2   -11    11

DECAY 35  24.392037
    0.22525261   2   -1000024    1000037
    0.22525261   2   -1000037    1000024
    0.16268037   2   -5    5
    0.10619535   2    1000023    1000035
    0.074105661   2    1000025    1000035
    0.048673782   2    1000022    1000035
    0.035402141   2    1000022    1000022
    0.028738575   2   -15    15
    0.022012129   2    1000022    1000023
    0.018567458   2   -6    6
    0.015058307   2    1000023    1000025
    0.013169997   2   -1000024    1000024
    0.012770874   2    1000025    1000025
    0.0089599285   2    1000022    1000025
    0.0026078686   2    1000023    1000023
    0.00018326702   2   -1000037    1000037
    9.9245794e-05   2   -13    13
    9.1889177e-05   2    1000035    1000035
    6.6167625e-05   2    25    25
    6.2972238e-05   2   -3    3
    1.2393786e-05   2    23    23
    6.2430818e-06   2   -24    24
    3.4659098e-06   2    21    21
    2.1189945e-06   2   -1000011    1000011
    2.1171313e-06   2   -1000013    1000013
    1.7544756e-06   2   -1000015    1000015
    2.6517885e-07   2   -4    4
    1.7409765e-07   2   -1    1
    1.4019992e-07   2    22    23
    1.8455673e-08   2    22    22
    2.2292608e-09   2   -11    11
    5.4094692e-10   2   -2000013    1000013
    5.4094692e-10   2   -1000013    2000013
    1.3671309e-12   2   -2    2
    1.2652806e-14   2   -2000011    1000011
    1.2652806e-14   2   -1000011    2000011

DECAY 36  24.24408
    0.22684159   2   -1000024    1000037
    0.22684159   2   -1000037    1000024
    0.15883717   2   -5    5
    0.11685118   2    1000023    1000035
    0.066587945   2    1000025    1000035
    0.047051182   2    1000022    1000035
    0.031866002   2    1000022    1000023
    0.028956286   2    1000022    1000022
    0.028059394   2   -15    15
    0.018071834   2   -6    6
    0.016768147   2    1000023    1000025
    0.013105731   2   -1000024    1000024
    0.0097424215   2    1000025    1000025
    0.0063035494   2    1000022    1000025
    0.0037658611   2    1000023    1000023
    9.8408225e-05   2   -1000037    1000037
    9.6899841e-05   2   -13    13
    6.1483117e-05   2   -3    3
    4.9908933e-05   2    1000035    1000035
    2.5919739e-05   2    21    21
    1.6970956e-05   2    23    25
    2.5072015e-07   2   -4    4
    1.6998046e-07   2   -1    1
    1.0393922e-07   2    22    23
    2.1765646e-09   2   -11    11
    1.5786965e-09   2    22    22
    5.3867894e-10   2   -2000013    1000013
    5.3867894e-10   2   -1000013    2000013
    1.29268e-12   2   -2    2
    1.2599754e-14   2   -2000011    1000011
    1.2599754e-14   2   -1000011    2000011
    4.9287012e-41   2    25    25

DECAY 37  24.428304
    0.22633769   2    1000024    1000035
    0.22167478   2    1000023    1000037
    0.182828   2   -5    6
    0.14205228   2    1000025    1000037
    0.096295365   2    1000022    1000037
    0.056707776   2    1000022    1000024
    0.043554543   2    1000024    1000025
    0.029464581   2   -15    16
    0.00060520209   2    1000023    1000024
    0.00024214542   2   -5    4
    0.00010416789   2   -13    14
    5.8304659e-05   2   -3    4
    2.8476093e-05   2   -3    6
    1.6907113e-05   2    24    25
    8.3048826e-06   2   -1000011    1000012
    8.302272e-06   2   -1000013    1000014
    7.2376196e-06   2   -1000015    1000016
    2.707028e-06   2   -3    2
    1.7291661e-06   2   -5    2
    1.3021491e-06   2   -1    6
    1.6106166e-07   2   -1    2
    1.9478612e-08   2   -1    4
    2.4364978e-09   2   -11    12
    1.3119849e-09   2    1000035    1000037
    1.2020524e-09   2   -2000013    1000014
    1.2682646e-12   2    24    35
    8.0145821e-13   2    24    36
    2.8116242e-14   2   -2000011    1000012

DECAY 6  2.43
    1   2    5    24

DECAY 15 -1
