BLOCK DCINFO
   1   SDECAY/HDECAY
   2   1.3b /3.4

BLOCK SPINFO
   1   SOFTSUSY
   2   3.4.0

BLOCK MODSEL
   1   0

BLOCK SMINPUTS
   1    127.90897
   2    1.1663787e-05
   3    0.1184
   4    91.1876
   5    4.18
   6    173.2
   7    1.777

BLOCK MINPAR
   3    8.22

BLOCK EXTPAR
   0   -1
   1    1037.06
   2   -2925.81
   3    2247.06
   11   -3421.65
   12    1298.6
   13   -208.32
   23    1191.45
   26    1344.56
   31    3309.51
   32    3309.51
   33    2930.24
   34    3565.77
   35    3565.77
   36    2158.3
   41    3404.36
   42    3404.36
   43    959.62
   44    2122.84
   45    2122.84
   46    3286.54
   47    1136.72
   48    1136.72
   49    2383.03

BLOCK MASS
   24    80.396408
   25    125.42404
   35    1344.7324
   36    1344.56
   37    1346.9856
   5    4.8187603
   1000001    3447.5767
   2000001    1215.8539
   1000002    3446.8314
   2000002    2185.6142
   1000003    3447.5767
   2000003    1215.8539
   1000004    3446.8314
   2000004    2185.6142
   1000005    1069.3174
   2000005    2439.8052
   1000006    1063.3889
   2000006    3297.2563
   1000011    3318.5236
   2000011    3569.8138
   1000012    3317.2803
   1000013    3318.5236
   2000013    3569.8138
   1000014    3317.2803
   1000015    2162.7466
   2000015    2940.9147
   1000016    2939.5415
   1000021    2356.6809
   1000022    1030.4115
   1000023   -1213.4133
   1000025    1221.2234
   1000035   -2939.7107
   1000024    1214.1174
   1000037    2939.8753

BLOCK NMIX
   1   1    0.98294759
   1   2    0.0027900888
   1   3    0.13787344
   1   4   -0.12164359
   2   1   -0.011671997
   2   2   -0.028097879
   2   3    0.70708929
   2   4    0.7064694
   3   1   -0.18351482
   3   2    0.014962429
   3   3    0.69349307
   3   4   -0.69653844
   4   1   -0.00032480772
   4   2    0.9994893
   4   3    0.0091113423
   4   4    0.030627236

BLOCK UMIX
   1   1   -0.012944397
   1   2    0.99991622
   2   1   -0.99991622
   2   2   -0.012944397

BLOCK VMIX
   1   1    0.043514668
   1   2    0.99905279
   2   1    0.99905279
   2   2   -0.043514668

BLOCK STOPMIX
   1   1    0.9985904
   1   2    0.053077368
   2   1   -0.053077368
   2   2    0.9985904

BLOCK SBOTMIX
   1   1    0.99999253
   1   2    0.0038639286
   2   1   -0.0038639286
   2   2    0.99999253

BLOCK STAUMIX
   1   1    0.0043091081
   1   2    0.99999072
   2   1   -0.99999072
   2   2    0.0043091081

BLOCK ALPHA
      -0.12765484

BLOCK HMIX Q=  1773.658
   1    1205.2523
   2    7.8838322
   3    243.73804
   4    2083671.8

BLOCK GAUGE Q=  1773.658
   1    0.36309397
   2    0.63492176
   3    1.0278745

BLOCK AU Q=  1773.658
   1   1    0
   2   2    0
   3   3   -3421.65

BLOCK AD Q=  1773.658
   1   1    0
   2   2    0
   3   3    1298.6

BLOCK AE Q=  1773.658
   1   1    0
   2   2    0
   3   3   -208.32

BLOCK YU Q=  1773.658
   1   1    0
   2   2    0
   3   3    0.83414669

BLOCK YD Q=  1773.658
   1   1    0
   2   2    0
   3   3    0.10465027

BLOCK YE Q=  1773.658
   1   1    0
   2   2    0
   3   3    0.080361774

BLOCK MSOFT Q=  1773.658
   1    1037.06
   2   -2925.81
   3    2247.06
   21    304360.15
   22   -1517343.9
   31    3309.51
   32    3309.51
   33    2930.24
   34    3565.77
   35    3565.77
   36    2158.3
   41    3404.36
   42    3404.36
   43    959.61998
   44    2122.84
   45    2122.84
   46    3286.54
   47    1136.72
   48    1136.72
   49    2383.03

BLOCK HIGGSBOUNDSINPUTHIGGSCOUPLINGSFERMIONS
       0, 62.15481,3,36,15,15

BLOCK HIGGSBOUNDSINPUTHIGGSCOUPLINGSBOSONS
       0,4,36,21,21,23

DECAY 6  1.4194621
    1   2    5    24

DECAY 1000021  109.6831
    0.13473346   2    1000005   -5
    0.13473346   2   -1000005    5
    0.13264668   2    1000006   -6
    0.13264668   2   -1000006    6
    0.11223058   2    2000001   -1
    0.11223058   2   -2000001    1
    0.11223058   2    2000003   -3
    0.11223058   2   -2000003    3
    0.0040794389   2    2000002   -2
    0.0040794389   2   -2000002    2
    0.0040792599   2    2000004   -4
    0.0040792599   2   -2000004    4

DECAY 1000006  7.2751793e-11
    0.94714238   2    1000022    4
    0.015532263   4    2   -1    1000022    5
    0.014827126   4    4   -3    1000022    5
    0.0073021804   2    1000022    2
    0.0052013838   4   -11    12    1000022    5
    0.005187501   4   -13    14    1000022    5
    0.0048071667   4   -15    16    1000022    5

DECAY 2000006  211.16693
    0.21205965   2    1000005    24
    0.20121793   2    1000021    6
    0.16132064   2    1000024    5
    0.11052983   2    1000006    25
    0.10941701   2    1000006    23
    0.080281523   2    1000025    6
    0.07985138   2    1000023    6
    0.02963543   2    1000022    6
    0.0078605406   2    1000005    37
    0.0039607935   2    1000006    36
    0.0038647369   2    1000006    35
    4.0483362e-07   2    2000005    24
    8.6931895e-08   2    1000037    5
    2.7863396e-08   2    1000035    6

DECAY 1000005  0.00073246347
    1   2    1000022    5

DECAY 2000005  2.3654594
    0.39446836   2    1000022    5
    0.25879285   2    1000021    5
    0.12569198   2   -1000024    6
    0.072564559   2    1000025    5
    0.063619869   2    1000023    5
    0.029963449   2    1000006   -24
    0.016138154   2    1000005    25
    0.015349126   2    1000005    23
    0.012107868   2    1000006   -37
    0.0056543207   2    1000005    36
    0.0056494626   2    1000005    35

DECAY 1000002  78.187331
    0.95518734   2    1000021    2
    0.026027118   2    1000037    1
    0.013030965   2    1000035    2
    0.0050890637   2    1000022    2
    0.00049357244   2    1000024    1
    0.00011987547   2    1000023    2
    5.2064842e-05   2    1000025    2

DECAY 2000002  2.9948413
    0.97329374   2    1000022    2
    0.026597431   2    1000025    2
    0.00010882975   2    1000023    2

DECAY 1000001  78.232223
    0.95557059   2    1000021    1
    0.026121945   2   -1000037    2
    0.013059089   2    1000035    1
    0.0047934921   2    1000022    1
    0.0003239671   2    1000025    1
    8.7253099e-05   2    1000023    1
    4.366594e-05   2   -1000024    2

DECAY 2000001  0.056600784
    0.99999997   2    1000022    1
    3.4087562e-08   2    1000023    1

DECAY 1000004  58.330217
    0.93924614   2    1000021    4
    0.035130821   2    1000037    3
    0.017588997   2    1000035    4
    0.0071057024   2    1000022    4
    0.00068849856   2    1000024    3
    0.00016721834   2    1000023    4
    7.2623916e-05   2    1000025    4

DECAY 2000004  3.0594167
    0.97335714   2    1000022    4
    0.026534274   2    1000025    4
    0.00010858446   2    1000023    4

DECAY 1000003  58.354354
    0.93977503   2    1000021    3
    0.035265716   2   -1000037    4
    0.017630591   2    1000035    3
    0.0066940494   2    1000022    3
    0.00045196423   2    1000025    3
    0.00012173135   2    1000023    3
    6.0920381e-05   2   -1000024    4

DECAY 2000003  0.054364139
    0.99999997   2    1000022    3
    2.8565164e-08   2    1000023    3

DECAY 1000011  5.4111787
    0.64075701   2    1000022    11
    0.22770351   2   -1000037    12
    0.11380515   2    1000035    11
    0.014884507   2    1000025    11
    0.0022315667   2    1000023    11
    0.00061825746   2   -1000024    12

DECAY 2000011  15.697166
    0.96855036   2    1000022    11
    0.031322486   2    1000025    11
    0.00012713667   2    1000023    11
    1.3038113e-08   2    1000035    11

DECAY 1000013  5.4111787
    0.64075701   2    1000022    13
    0.22770351   2   -1000037    14
    0.11380515   2    1000035    13
    0.014884507   2    1000025    13
    0.0022315667   2    1000023    13
    0.00061825746   2   -1000024    14

DECAY 2000013  15.697166
    0.96855037   2    1000022    13
    0.031322486   2    1000025    13
    0.00012713667   2    1000023    13
    1.3038113e-08   2    1000035    13

DECAY 1000015  6.988766
    0.93768714   2    1000022    15
    0.034203531   2    1000025    15
    0.018660951   2   -1000024    16
    0.0094483746   2    1000023    15

DECAY 2000015  3.2629632
    0.88901951   2    1000022    15
    0.058468631   2    1000025    15
    0.042825324   2    1000023    15
    0.0045280377   2    1000015    25
    0.004390155   2    1000015    23
    0.00076473385   2   -1000024    16
    3.6097867e-06   2   -1000037    16

DECAY 1000012  5.4180966
    0.62702334   2    1000022    12
    0.22569583   2    1000037    11
    0.11308114   2    1000035    12
    0.026380646   2    1000025    12
    0.0069736291   2    1000024    11
    0.0008454218   2    1000023    12

DECAY 1000014  5.4180966
    0.62702335   2    1000022    14
    0.22569582   2    1000037    13
    0.11308114   2    1000035    14
    0.026380646   2    1000025    14
    0.0069736291   2    1000024    13
    0.00084542181   2    1000023    14

DECAY 1000016  3.2752344
    0.8662386   2    1000022    16
    0.088718789   2    1000024    15
    0.035425785   2    1000025    16
    0.0084800324   2   -1000015   -24
    0.0011367896   2    1000023    16

DECAY 1000024  0.32217844
    0.93102434   2    1000022    24
    0.06897566   2    1000006   -5

DECAY 1000037  85.127415
    0.31428454   2    1000006   -5
    0.30853479   2   -1000005    6
    0.055960448   2    1000024    23
    0.054824942   2    1000024    25
    0.053607365   2    1000023    24
    0.051965151   2    1000025    24
    0.039733572   2    1000024    36
    0.03972226   2    1000024    35
    0.039674247   2    1000023    37
    0.037962278   2    1000025    37
    0.0021637952   2    1000022    24
    0.0015650705   2    1000022    37
    1.336503e-06   2   -2000005    6
    2.0787786e-07   2   -1000015    16

DECAY 1000022 -1


DECAY 1000023  0.29332841
    0.92927855   2    1000022    23
    0.034197797   2    1000005   -5
    0.034197797   2   -1000005    5
    0.0023258526   2    1000022    25

DECAY 1000025  0.34057862
    0.92820795   2    1000022    25
    0.032782899   2    1000005   -5
    0.032782899   2   -1000005    5
    0.0061871998   2    1000022    23
    9.7633289e-06   2    2000001   -1
    9.7633289e-06   2   -2000001    1
    9.7633289e-06   2    2000003   -3
    9.7633289e-06   2   -2000003    3

DECAY 1000035  85.236003
    0.15604291   2    1000005   -5
    0.15604291   2   -1000005    5
    0.15494542   2    1000006   -6
    0.15494542   2   -1000006    6
    0.054772295   2    1000024   -24
    0.054772295   2   -1000024    24
    0.042418618   2    1000023    25
    0.041163886   2    1000025    23
    0.039528423   2    1000024   -37
    0.039528423   2   -1000024    37
    0.038022895   2    1000023    35
    0.036433071   2    1000025    36
    0.012616403   2    1000023    23
    0.011656822   2    1000025    25
    0.0017310741   2    1000023    36
    0.001610756   2    1000025    35
    0.0015931278   2    1000022    23
    0.0014551399   2    1000022    36
    0.00060651878   2    1000022    25
    0.00011190704   2    1000022    35
    7.2048779e-07   2    2000005   -5
    7.2048779e-07   2   -2000005    5
    1.0600704e-07   2    1000015   -15
    1.0600704e-07   2   -1000015    15
    2.4808057e-09   2    2000002   -2
    2.4808057e-09   2   -2000002    2
    2.4808016e-09   2    2000004   -4
    2.4808016e-09   2   -2000004    4
    2.0945393e-09   2    2000001   -1
    2.0945393e-09   2   -2000001    1
    2.0945393e-09   2    2000003   -3
    2.0945393e-09   2   -2000003    3
    9.1512331e-10   2    1000016   -16
    9.1512331e-10   2   -1000016    16

DECAY 25  0.00424998
    0.60408038   2    5   -5
    0.2068675   2    24   -24
    0.075798548   2    21    21
    0.062540515   2   -15    15
    0.02602165   2    23    23
    0.020454875   2    4   -4
    0.0022473676   2    22    22
    0.0015266222   2    22    23
    0.00024117889   2    3   -3
    0.00022136279   2   -13    13

DECAY 35  2.1555974
    0.47265868   2    5   -5
    0.44037974   2    6   -6
    0.081619766   2   -15    15
    0.0032497851   2    25    25
    0.0007870539   2    24   -24
    0.00043389044   2    21    21
    0.00039065042   2    23    23
    0.00028791156   2   -13    13
    0.00018576087   2    3   -3
    4.7163914e-06   2    4   -4
    1.5242076e-06   2    22    22
    5.2673067e-07   2    23    22

DECAY 36  2.1748098
    0.46883258   2    5   -5
    0.44806046   2    6   -6
    0.080919379   2   -15    15
    0.00093137001   2    21    21
    0.00077859455   2    23    25
    0.0002854391   2   -13    13
    0.00018438303   2    3   -3
    4.608396e-06   2    4   -4
    2.2878775e-06   2    22    22
    8.9979469e-07   2    23    22

DECAY 37  2.080275
    0.91314501   2    6   -5
    0.084749246   2   -15    16
    0.00082109765   2    24    25
    0.00077429767   2    4   -5
    0.00029894876   2   -13    14
    0.00019403175   2    4   -3
    9.623274e-06   2    2   -3
    7.7428572e-06   2    2   -5
    5.3014674e-11   2    24    36

DECAY 5 -1


DECAY 15 -1


DECAY 23  2.4952


DECAY 24  2.085
