BLOCK SPINFO
   1   SPheno
   2   v4.0.5be

BLOCK SPHENOINFO
   1   2
   2   2

BLOCK MODSEL
   1   0

BLOCK MINPAR
   3    26.644035
   4   -1

BLOCK EXTPAR
   0    1448.3777
   1   -152.00028
   2   -712.86784
   3    3000
   11   -3162.5035
   12   -540.11852
   13    1174.6273
   23   -270.47423
   25    25.826154
   26    1699.7741
   31    1690.8308
   32    1690.8308
   33    1226.5156
   34    1086.1381
   35    1086.1381
   36    1695.0284
   41    5000
   42    5000
   43    1807.3802
   44    5000
   45    5000
   46    1246.5164
   47    5000
   48    5000
   49    1386.2481

BLOCK SMINPUTS
   1    127.90897
   2    1.1663787e-05
   3    0.1184
   4    91.1876
   5    4.18
   6    173.2
   7    1.777
   8    0
   11    0.00051099893
   12    0
   13    0.10565837
   14    0
   21    0.005
   22    0.0025
   23    0.095
   24    1.27

BLOCK GAUGE Q=  1448.3777
   1    0.35536298
   2    0.66519887
   3    1.219778

BLOCK YU Q=  1448.3777
   1   1    8.390655e-06
   2   2    0.0042624527
   3   3    1.0136585

BLOCK YD Q=  1448.3777
   1   1    0.00043544755
   2   2    0.0082735035
   3   3    0.43182752

BLOCK YE Q=  1448.3777
   1   1    7.5988782e-05
   2   2    0.01571207
   3   3    0.26425117

BLOCK AU Q=  1448.3777
   1   1    0
   2   2    0
   3   3   -3162.5036

BLOCK AD Q=  1448.3777
   1   1    0
   2   2    0
   3   3   -540.11856

BLOCK AE Q=  1448.3777
   1   1    0
   2   2    0
   3   3    1174.6273

BLOCK MSOFT Q=  1448.3777
   1   -152.00028
   2   -712.86784
   3    3000
   21    2828629.9
   22   -46393.74
   31    1690.8308
   32    1690.8308
   33    1226.5156
   34    1086.1381
   35    1086.1381
   36    1695.0284
   41    5000
   42    5000
   43    1807.3802
   44    5000
   45    5000
   46    1246.5164
   47    5000
   48    5000
   49    1386.2481

BLOCK MASS
   6    173.2
   23    91.1876
   24    80.429995
   15    1.777
   25    123.81037
   35    1699.4108
   36    1699.7741
   37    1701.9286
   1000001    5027.1389
   2000001    5016.9792
   1000002    5026.6939
   2000002    5018.2258
   1000003    5027.1409
   2000003    5016.982
   1000004    5026.6959
   2000004    5018.2267
   1000005    1388.649
   2000005    1791.202
   1000006    1149.2571
   2000006    1825.3514
   1000011    1695.3759
   2000011    1088.8839
   1000012    1693.1542
   1000013    1695.3717
   2000013    1088.873
   1000014    1693.1498
   1000015    1230.4123
   2000015    1694.9811
   1000016    1227.5744
   1000021    3186.1777
   1000022   -145.52001
   1000023   -276.71463
   1000025    279.5432
   1000035   -761.14994
   1000024    270.84425
   1000037    761.29442

BLOCK ALPHA
      -0.037842589

BLOCK HMIX Q=  1448.3777
   1   -270.47423
   2    25.826154
   3    244.02805
   4    2889232

BLOCK STOPMIX
   1   1    0.23200326
   1   2    0.97271501
   2   1   -0.97271501
   2   2    0.23200326

BLOCK SBOTMIX
   1   1   -0.012091434
   1   2    0.9999269
   2   1   -0.9999269
   2   2   -0.012091434

BLOCK STAUMIX
   1   1   -0.99994274
   1   2    0.010701491
   2   1   -0.010701491
   2   2   -0.99994274

BLOCK NMIX
   1   1    0.96453989
   1   2   -0.017793261
   1   3   -0.22999347
   1   4    0.12825446
   2   1    0.25405419
   2   2    0.11898432
   2   3    0.67656974
   2   4   -0.68084697
   3   1    0.070932436
   3   2   -0.053208603
   3   3    0.69789996
   3   4    0.71068494
   4   1    0.0093733969
   4   2   -0.99130973
   4   3    0.047875292
   4   4   -0.12216841

BLOCK UMIX
   1   1   -0.067631356
   1   2   -0.99771038
   2   1   -0.99771038
   2   2    0.067631356

BLOCK VMIX
   1   1    0.17275959
   1   2    0.98496402
   2   1    0.98496402
   2   2   -0.17275959

BLOCK HIGGSBOUNDSINPUTHIGGSCOUPLINGSFERMIONS
       0, 666.99024,3,36,15,15

BLOCK HIGGSBOUNDSINPUTHIGGSCOUPLINGSBOSONS
       0,4,36,21,21,23

BLOCK SPHENOLOWENERGY
   1    0.0003729766
   2    1.5853525e-06
   3    3.5204885e-05
   4    1.9112845e-15
   5    8.1647249e-11
   6    1.7054944e-08
   7    6.4488206e-14
   8    2.7549126e-09
   9    5.8310721e-07
   10    9.5254425e-05
   11    0.98394174
   12    0.54333558
   13    19.405721
   14    0
   15    0
   16    0.002163858
   17    2.2817263e-15
   18    2.4781843e-11
   19    8.2853368e-11
   20    4.4896795e-15
   21    1.9194609e-10
   22    7.6245772e-08
   23    0
   24    0
   25    0
   26    0
   27    0
   28    0
   29    0
   30    0
   31    0
   39    7.1469897e-05
   40    0
   41    0
   42    0

BLOCK FWCOEF Q=  160
   305   4422   0   0   -0.18881911
   305   4422   0   2   -0.24708487
   305   4322   0   2   -0.00057612081
   305   6421   0   0   -0.095227835
   305   6421   0   2   -0.13485759
   305   6321   0   2   -0.00048295817
   3051111   4133   0   0    1.5907106
   3051111   4133   0   2    1.5917152
   3051111   4233   0   2    7.1701118e-05
   3051111   4137   0   0   -4.4134028
   3051111   4137   0   2   -4.4070442
   3051111   4237   0   2   -0.00055800028
   3051313   4133   0   0    1.5907106
   3051313   4133   0   2    1.5917139
   3051313   4233   0   2    7.1700503e-05
   3051313   4137   0   0   -4.4134028
   3051313   4137   0   2   -4.4070455
   3051313   4237   0   2   -0.00055800034
   3051212   4137   0   0    1.5053501
   3051212   4137   0   2    1.5039744
   3051212   4237   0   2    0.00012163324
   3051414   4137   0   0    1.5053501
   3051414   4137   0   2    1.5039744
   3051414   4237   0   2    0.00012163333
   3051616   4137   0   0    1.5053501
   3051616   4137   0   2    1.5039747
   3051616   4237   0   2    0.00012165913

BLOCK IMFWCOEF Q=  160
   305   4422   0   0    3.8579146e-07
   305   4422   0   2    1.1994446e-05
   305   4322   0   2   -4.9053823e-06
   305   6421   0   0    3.304559e-07
   305   6421   0   2    1.0530592e-05
   305   6321   0   2   -1.9250591e-06
   3051111   4133   0   2   -2.4981559e-06
   3051111   4233   0   2    2.0107504e-06
   3051111   4137   0   2    2.1114143e-05
   3051111   4237   0   2   -1.5669728e-05
   3051313   4133   0   2   -2.4981485e-06
   3051313   4233   0   2    2.0107472e-06
   3051313   4137   0   2    2.111416e-05
   3051313   4237   0   2   -1.5669737e-05
   3051212   4137   0   2   -4.405308e-06
   3051212   4237   0   2    3.4158102e-06
   3051414   4137   0   2   -4.4053079e-06
   3051414   4237   0   2    3.4158102e-06
   3051616   4137   0   2   -4.4011261e-06
   3051616   4237   0   2    3.4158013e-06

DECAY 23  2.4952


DECAY 24  2.085


DECAY 2000011  5.2430468
    0.93646058   2    1000022    11
    0.058934286   2    1000023    11
    0.0045811324   2    1000025    11

DECAY 1000011  16.441703
    0.57591795   2   -1000037    12
    0.28146536   2    1000035    11
    0.11067702   2    1000022    11
    0.027896233   2    1000023    11
    0.0039426935   2   -1000024    12
    0.00010074886   2    1000025    11

DECAY 2000013  5.2523697
    0.93484059   2    1000022    13
    0.059236203   2    1000023    13
    0.0050054786   2    1000025    13
    0.00089197626   2   -1000024    14

DECAY 1000013  16.449581
    0.57563921   2   -1000037    14
    0.28132981   2    1000035    13
    0.11065007   2    1000022    13
    0.028102416   2    1000023    13
    0.0039407943   2   -1000024    14
    0.00033400826   2    1000025    13

DECAY 1000015  9.3291841
    0.43990731   2   -1000037    16
    0.2151746   2    1000035    15
    0.14995885   2    1000022    15
    0.10954466   2    1000023    15
    0.079984813   2    1000025    15
    0.005429768   2   -1000024    16

DECAY 2000015  12.906311
    0.61354078   2    1000022    15
    0.17180355   2   -1000024    16
    0.11950513   2    1000023    15
    0.087640488   2    1000025    15
    0.0030175712   2    1000016   -24
    0.0014647177   2    1000015    23
    0.0014339785   2    1000015    25
    0.0010383171   2   -1000037    16
    0.00055546842   2    1000035    15

DECAY 1000012  16.483574
    0.5583956   2    1000037    11
    0.28572618   2    1000035    12
    0.12658363   2    1000022    12
    0.025624035   2    1000024    11
    0.0035505898   2    1000025    12
    0.00011996961   2    1000023    12

DECAY 1000014  16.491378
    0.55813005   2    1000037    13
    0.28558949   2    1000035    14
    0.1265234   2    1000022    14
    0.026088255   2    1000024    13
    0.0035488995   2    1000025    14
    0.0001199125   2    1000023    14

DECAY 1000016  9.3676628
    0.42422106   2    1000037    15
    0.21693792   2    1000035    16
    0.19506229   2    1000024    15
    0.15932962   2    1000022    16
    0.0043035363   2    1000025    16
    0.00014556677   2    1000023    16

DECAY 2000001  143.78208
    0.98055807   2    1000021    1
    0.018092934   2    1000022    1
    0.00124976   2    1000023    1

DECAY 1000001  206.13734
    0.68907662   2    1000021    1
    0.20401163   2   -1000037    2
    0.10104241   2    1000035    1
    0.00385033   2    1000022    1
    0.00097626717   2   -1000024    2
    0.00058025153   2    1000023    1
    0.00046248341   2    1000025    1

DECAY 2000003  143.79592
    0.98046574   2    1000021    3
    0.018093706   2    1000022    3
    0.0012711953   2    1000023    3
    0.00012039481   2    1000025    3

DECAY 1000003  206.14616
    0.68904813   2    1000021    3
    0.20400324   2   -1000037    4
    0.1010382   2    1000035    3
    0.0038519159   2    1000022    3
    0.00098472185   2   -1000024    4
    0.0005952953   2    1000023    3
    0.0004784934   2    1000025    3

DECAY 1000005  10.109678
    0.45382543   2   -1000024    6
    0.22803528   2    1000025    5
    0.21944365   2    1000023    5
    0.097809935   2    1000022    5
    0.0005447381   2   -1000037    6
    0.00030395737   2    1000035    5

DECAY 2000005  98.485921
    0.42445118   2    1000006   -24
    0.33732654   2   -1000024    6
    0.11693589   2   -1000037    6
    0.053140209   2    1000035    5
    0.031713585   2    1000025    5
    0.029866764   2    1000023    5
    0.0061488014   2    1000022    5
    0.0002469425   2    1000005    25
    0.00017008251   2    1000005    23

DECAY 2000002  152.30068
    0.92656472   2    1000021    2
    0.068340791   2    1000022    2
    0.0047203909   2    1000023    2
    0.00036792608   2    1000025    2

DECAY 1000002  206.13361
    0.6888643   2    1000021    2
    0.19881653   2    1000037    1
    0.10035626   2    1000035    2
    0.0063698905   2    1000024    1
    0.0028772483   2    1000023    2
    0.002540136   2    1000022    2
    0.00017563664   2    1000025    2

DECAY 2000004  152.30431
    0.92654282   2    1000021    4
    0.068339363   2    1000022    4
    0.0047257556   2    1000023    4
    0.00037389805   2    1000025    4

DECAY 1000004  206.14237
    0.68883574   2    1000021    4
    0.19880832   2    1000037    3
    0.10035213   2    1000035    4
    0.0064023901   2    1000024    3
    0.0028811944   2    1000023    4
    0.0025401728   2    1000022    4
    0.00018005508   2    1000025    4

DECAY 1000006  39.935631
    0.46085483   2    1000024    5
    0.23548597   2    1000025    6
    0.22226947   2    1000023    6
    0.055242769   2    1000022    6
    0.018749195   2    1000037    5
    0.007374963   2    1000035    6

DECAY 2000006  108.84162
    0.24174342   2    1000006    25
    0.20682423   2    1000006    23
    0.16894174   2    1000025    6
    0.15281056   2    1000023    6
    0.093614409   2    1000024    5
    0.081259499   2    1000037    5
    0.040866036   2    1000035    6
    0.013567139   2    1000022    6
    0.00037296251   2    1000005    24

DECAY 1000024  0.21623836
    0.99999975   2    1000022    24

DECAY 1000037  6.5855617
    0.26212084   2    1000023    24
    0.24979733   2    1000025    24
    0.24732813   2    1000024    23
    0.23400889   2    1000024    25
    0.0020134184   2    1000022    24
    0.0019996164   3    1000025   -5    6
    0.0019079864   3    1000023   -5    6
    0.00076502735   3    1000024    6   -6

DECAY 1000022 -1


DECAY 1000023  0.058225442
    0.71237284   2    1000022    25
    0.28760981   2    1000022    23

DECAY 1000025  0.28921115
    0.82919158   2    1000022    23
    0.17079157   2    1000022    25

DECAY 1000035  7.6747706
    0.2266667   2    1000024   -24
    0.2266667   2   -1000024    24
    0.19032514   2    1000025    23
    0.16582784   2    1000023    25
    0.14987569   2    1000025    25
    0.034256934   2    1000023    23
    0.0021042312   3    1000024    5   -6
    0.0021042312   3   -1000024   -5    6
    0.0014049307   2    1000022    25
    0.00038557573   2    1000022    23
    0.00015679006   3    1000023    6   -6
    0.00014668586   3    1000025    6   -6

DECAY 1000021  219.04922
    0.15358376   2    1000006   -6
    0.15358376   2   -1000006    6
    0.14126825   2    1000005   -5
    0.14126825   2   -1000005    5
    0.1037634   2    2000006   -6
    0.1037634   2   -2000006    6
    0.10069399   2    2000005   -5
    0.10069399   2   -2000005    5
    0.00058385895   2    1000006   -4
    0.00058385895   2   -1000006    4

DECAY 25  0.0037554497
    0.59375063   2   -5    5
    0.20795554   2   -24    24
    0.072258355   2    21    21
    0.068281919   2   -15    15
    0.028985231   2   -4    4
    0.024581757   2    23    23
    0.0023361201   2    22    22
    0.0013897248   2    22    23
    0.00023679206   2   -13    13
    0.00022316096   2   -3    3
    6.1701736e-07   2   -1    1
    1.4937125e-07   2   -2    2
    5.3233638e-09   2   -11    11

DECAY 35  33.06722
    0.46098001   2   -5    5
    0.1281096   2   -1000024    1000037
    0.1281096   2   -1000037    1000024
    0.080197401   2    1000025    1000035
    0.077897177   2   -15    15
    0.045442504   2    1000023    1000035
    0.027237708   2    1000022    1000025
    0.023037486   2    1000022    1000023
    0.011816751   2   -1000024    1000024
    0.0058001329   2    1000022    1000022
    0.0048829716   2    1000022    1000035
    0.0031203351   2   -6    6
    0.0015990343   2    1000025    1000025
    0.00087619527   2    1000023    1000025
    0.0002675522   2   -1000037    1000037
    0.00026686641   2   -13    13
    0.00017038643   2   -3    3
    0.00013754478   2    1000035    1000035
    2.5028362e-05   2    25    25
    1.0565189e-05   2    1000023    1000023
    7.825665e-06   2    21    21
    3.8722376e-06   2    23    23
    2.5932722e-06   2   -24    24
    4.7108193e-07   2   -1    1
    2.532901e-07   2    22    23
    9.7402026e-08   2    22    22
    3.8977283e-08   2   -4    4
    5.9947205e-09   2   -11    11
    2.009443e-13   2   -2    2

DECAY 36  32.438929
    0.45345197   2   -5    5
    0.12888288   2   -1000024    1000037
    0.12888288   2   -1000037    1000024
    0.076625051   2   -15    15
    0.076179125   2    1000023    1000035
    0.049498861   2    1000025    1000035
    0.028923866   2    1000022    1000023
    0.022157098   2    1000022    1000025
    0.014184544   2   -1000024    1000024
    0.0066357445   2    1000022    1000022
    0.0062374793   2    1000022    1000035
    0.0032008193   2   -6    6
    0.0015621684   2    1000025    1000025
    0.001450995   2   -1000037    1000037
    0.00090790724   2    1000023    1000025
    0.00074143881   2    1000035    1000035
    0.0002625069   2   -13    13
    0.00016759854   2   -3    3
    2.6694841e-05   2    21    21
    1.3949157e-05   2    1000023    1000023
    5.2251899e-06   2    23    25
    4.6337441e-07   2   -1    1
    4.3723866e-07   2    22    23
    2.537228e-07   2    22    22
    3.825717e-08   2   -4    4
    5.8967952e-09   2   -11    11
    1.9726182e-13   2   -2    2
    6.9613333e-39   2    25    25

DECAY 37  31.646909
    0.44574997   2   -5    6
    0.13539306   2    1000024    1000035
    0.13313157   2    1000025    1000037
    0.13156683   2    1000023    1000037
    0.076349218   2   -15    16
    0.055856446   2    1000022    1000024
    0.01181635   2    1000022    1000037
    0.0073127864   2    1000023    1000024
    0.0017093874   2    1000024    1000025
    0.00066135746   2   -5    4
    0.00026992214   2   -13    14
    0.0001601139   2   -3    4
    7.4467266e-06   2   -3    2
    5.3872161e-06   2    24    25
    4.7227781e-06   2   -5    2
    4.6962938e-06   2   -3    6
    4.4422549e-07   2   -1    2
    2.047494e-07   2   -1    6
    5.7893908e-08   2    1000035    1000037
    2.250324e-08   2   -1    4
    6.313507e-09   2   -11    12
    4.3476117e-12   2    24    35
    1.9951674e-12   2    24    36

DECAY 6  2.43
    1   2    5    24

DECAY 15 -1
