BLOCK SPINFO
   1   SPheno
   2   v4.0.5be

BLOCK SPHENOINFO
   1   2
   2   2

BLOCK MODSEL
   1   0

BLOCK MINPAR
   3    44.748138
   4    1

BLOCK EXTPAR
   0    3415.0042
   1   -1458.7679
   2    4178.1257
   3    1232.6682
   11    4158.9884
   12   -5520.6059
   13    7042.0174
   23    4276.3862
   25    43.348937
   26    4056.3417
   31    3706.1003
   32    3706.1003
   33    2364.4461
   34    3521.727
   35    3521.727
   36    2435.3028
   41    3275.1879
   42    3275.1879
   43    3423.7228
   44    1939.7692
   45    1939.7692
   46    3344.6028
   47    2056.395
   48    2056.395
   49    3394.3366

BLOCK SMINPUTS
   1    127.90897
   2    1.1663787e-05
   3    0.1184
   4    91.1876
   5    4.18
   6    173.2
   7    1.777
   8    0
   11    0.00051099893
   12    0
   13    0.10565837
   14    0
   21    0.005
   22    0.0025
   23    0.095
   24    1.27

BLOCK GAUGE Q=  3415.0042
   1    0.35536298
   2    0.66519887
   3    1.219778

BLOCK YU Q=  3415.0042
   1   1    8.3866028e-06
   2   2    0.0042603942
   3   3    1.013169

BLOCK YD Q=  3415.0042
   1   1    0.0007305413
   2   2    0.013880285
   3   3    0.72446805

BLOCK YE Q=  3415.0042
   1   1    0.0001274848
   2   2    0.026359813
   3   3    0.44332869

BLOCK AU Q=  3415.0042
   1   1    0
   2   2    0
   3   3    4158.9884

BLOCK AD Q=  3415.0042
   1   1    0
   2   2    0
   3   3   -5520.6058

BLOCK AE Q=  3415.0042
   1   1    0
   2   2    0
   3   3    7042.0173

BLOCK MSOFT Q=  3415.0042
   1   -1458.7679
   2    4178.1257
   3    1232.6682
   21   -1636013.3
   22   -18007637
   31    3706.1003
   32    3706.1003
   33    2364.4461
   34    3521.727
   35    3521.727
   36    2435.3028
   41    3275.1879
   42    3275.1879
   43    3423.7228
   44    1939.7692
   45    1939.7692
   46    3344.6028
   47    2056.395
   48    2056.395
   49    3394.3366

BLOCK MASS
   6    173.2
   23    91.1876
   24    80.429995
   15    1.777
   25    122.43874
   35    4055.8938
   36    4056.3417
   37    4056.983
   1000001    3354.2579
   2000001    2111.4607
   1000002    3353.4109
   2000002    1999.0058
   1000003    3354.2552
   2000003    2111.454
   1000004    3353.4075
   2000004    1999.0062
   1000005    3398.3222
   2000005    3499.046
   1000006    3319.1945
   2000006    3513.5795
   1000011    3734.6639
   2000011    3526.3876
   1000012    3733.4003
   1000013    3734.6706
   2000013    3526.2948
   1000014    3733.3664
   1000015    2316.1827
   2000015    2465.2594
   1000016    2378.8155
   1000021    1473.4192
   1000022   -1445.2723
   1000023    4124.2855
   1000025   -4240.8445
   1000035    4265.296
   1000024    4124.4214
   1000037    4265.6917

BLOCK ALPHA
      -0.02238802

BLOCK HMIX Q=  3415.0042
   1    4276.3862
   2    43.348937
   3    243.10145
   4    16453908

BLOCK STOPMIX
   1   1   -0.45935444
   1   2    0.88825306
   2   1   -0.88825306
   2   2   -0.45935444

BLOCK SBOTMIX
   1   1    0.51784723
   1   2    0.85547311
   2   1   -0.85547311
   2   2    0.51784723

BLOCK STAUMIX
   1   1    0.76599741
   1   2    0.64284366
   2   1   -0.64284366
   2   2    0.76599741

BLOCK NMIX
   1   1    0.99992317
   1   2    5.289822e-05
   1   3    0.011792993
   1   4    0.0038177275
   2   1    0.0023515076
   2   2    0.91017006
   2   3   -0.29695668
   2   4    0.28879347
   3   1   -0.011038331
   3   2    0.0063373546
   3   3    0.70699883
   3   4    0.70710017
   4   1   -0.0051262247
   4   2    0.41418632
   4   3    0.64174006
   4   4   -0.64544024

BLOCK UMIX
   1   1   -0.90625829
   1   2    0.4227244
   2   1    0.4227244
   2   2    0.90625829

BLOCK VMIX
   1   1   -0.91159496
   1   2    0.41108956
   2   1    0.41108956
   2   2    0.91159496

BLOCK HIGGSBOUNDSINPUTHIGGSCOUPLINGSFERMIONS
       0, 1879.1303,3,36,15,15

BLOCK HIGGSBOUNDSINPUTHIGGSCOUPLINGSBOSONS
       0,4,36,21,21,23

BLOCK SPHENOLOWENERGY
   1    0.00032985635
   2    1.5894663e-06
   3    3.5260639e-05
   4    3.4324034e-15
   5    1.4662891e-10
   6    3.0727946e-08
   7    1.1524954e-13
   8    4.9234754e-09
   9    1.0454604e-06
   10    9.5829727e-05
   11    0.98988439
   12    0.5421311
   13    19.365936
   14    0
   15    0
   16    0.0021580513
   17    2.2816666e-15
   18    2.4806064e-11
   19    8.2916766e-11
   20    6.5660467e-16
   21    2.807027e-11
   22    5.5773079e-09
   23    0
   24    0
   25    0
   26    0
   27    0
   28    0
   29    0
   30    0
   31    0
   39    7.4322885e-05
   40    0
   41    0
   42    0

BLOCK FWCOEF Q=  160
   305   4422   0   0   -0.18881911
   305   4422   0   2   -0.19850787
   305   4322   0   2   -0.00019323091
   305   6421   0   0   -0.095227835
   305   6421   0   2   -0.10786872
   305   6321   0   2   -0.00024759396
   3051111   4133   0   0    1.6216581
   3051111   4133   0   2    1.6217364
   3051111   4233   0   2    0.00010311663
   3051111   4137   0   0   -4.4443502
   3051111   4137   0   2   -4.4435028
   3051111   4237   0   2   -0.00077046783
   3051313   4133   0   0    1.6216581
   3051313   4133   0   2    1.6217356
   3051313   4233   0   2    0.0001031164
   3051313   4137   0   0   -4.4443502
   3051313   4137   0   2   -4.4435036
   3051313   4237   0   2   -0.00077046791
   3051212   4137   0   0    1.5053501
   3051212   4137   0   2    1.5051668
   3051212   4237   0   2    0.00016679293
   3051414   4137   0   0    1.5053501
   3051414   4137   0   2    1.5051668
   3051414   4237   0   2    0.00016679296
   3051616   4137   0   0    1.5053501
   3051616   4137   0   2    1.5051667
   3051616   4237   0   2    0.00016680193

BLOCK IMFWCOEF Q=  160
   305   4422   0   0    3.8569905e-07
   305   4422   0   2    1.326919e-05
   305   4322   0   2   -2.0802295e-06
   305   6421   0   0    3.3037674e-07
   305   6421   0   2   -5.3826729e-05
   305   6321   0   2   -2.5824841e-06
   3051111   4133   0   2   -2.8921687e-07
   3051111   4233   0   2    2.380416e-06
   3051111   4137   0   2    3.3921626e-06
   3051111   4237   0   2   -1.777895e-05
   3051313   4133   0   2   -2.8921346e-07
   3051313   4233   0   2    2.3804146e-06
   3051313   4137   0   2    3.3921661e-06
   3051313   4237   0   2   -1.7778954e-05
   3051212   4137   0   2   -7.3208698e-07
   3051212   4237   0   2    3.8488335e-06
   3051414   4137   0   2   -7.3208703e-07
   3051414   4237   0   2    3.8488335e-06
   3051616   4137   0   2   -7.3320148e-07
   3051616   4237   0   2    3.8488331e-06

DECAY 23  2.4952


DECAY 24  2.085


DECAY 2000011  12.264299
    1   2    1000022    11

DECAY 1000011  3.3915499
    0.99999998   2    1000022    11

DECAY 2000013  12.26372
    1   2    1000022    13

DECAY 1000013  3.3945343
    0.99912542   2    1000022    13
    0.00087457851   2    2000013    25

DECAY 1000015  2.455644
    1   2    1000022    15

DECAY 2000015  4.7332225
    0.77139952   2    1000022    15
    0.20846137   2    1000015    23
    0.014322066   2    1000016   -24
    0.0058170459   2    1000015    25

DECAY 1000012  3.3888925
    0.99981081   2    1000022    12
    0.00018918881   3    1000016    11   -15

DECAY 1000014  3.3888402
    0.99981073   2    1000022    14
    0.00018926849   3    1000016    13   -15

DECAY 1000016  1.1905146
    0.99861776   2    1000022    16
    0.00069127365   3    1000015   -2    1
    0.00069097141   3    1000015   -4    3

DECAY 2000001  44.201998
    0.99246816   2    1000021    1
    0.0075318389   2    1000022    1

DECAY 1000001  172.75525
    0.99820409   2    1000021    1
    0.0017958056   2    1000022    1

DECAY 2000003  44.201321
    0.99246815   2    1000021    3
    0.0075318484   2    1000022    3

DECAY 1000003  172.76124
    0.99816794   2    1000021    3
    0.001795747   2    1000022    3

DECAY 1000005  178.1868
    0.99379614   2    1000021    5
    0.0062038632   2    1000022    5

DECAY 2000005  190.51215
    0.98008246   2    1000021    5
    0.016983042   2    1000006   -24
    0.0027244   2    1000022    5
    0.00021010394   2    1000005    23

DECAY 2000002  33.930123
    0.97003422   2    1000021    2
    0.029965783   2    1000022    2

DECAY 1000002  172.67027
    0.99820204   2    1000021    2
    0.0017979574   2    1000022    2

DECAY 2000004  33.930008
    0.9700342   2    1000021    4
    0.029965798   2    1000022    4

DECAY 1000004  172.66983
    0.99820204   2    1000021    4
    0.0017979572   2    1000022    4

DECAY 1000006  179.8686
    0.88713221   2    1000021    6
    0.091221648   2    1000021    4
    0.021438129   2    1000022    6
    0.00016438416   2    1000022    4

DECAY 2000006  200.19658
    0.97259082   2    1000021    6
    0.010523331   2    1000006    23
    0.0070750113   2    1000022    6
    0.0067314285   2    1000006    25
    0.0030794056   2    1000005    24

DECAY 1000024  52.580643
    0.14008028   2    1000016   -15
    0.1239841   2   -1000015    16
    0.10736844   2    2000006   -5
    0.10381412   2   -1000005    6
    0.098885012   2    1000004   -3
    0.098874733   2    1000002   -1
    0.097530299   2   -1000003    4
    0.097527941   2   -1000001    2
    0.058702697   2   -2000005    6
    0.019186803   2   -2000015    16
    0.0093652505   2    1000014   -13
    0.0093604484   2    1000012   -11
    0.0091944339   2   -1000011    12
    0.0091941362   2   -1000013    14
    0.008236137   2    1000022    24
    0.0081364848   2    1000006   -5
    0.00050267247   3    1000022   -5    6

DECAY 1000037  61.914192
    0.3146083   2    1000006   -5
    0.15824805   2   -2000005    6
    0.13228668   2   -1000005    6
    0.079562215   2    2000006   -5
    0.07676102   2    1000016   -15
    0.072545859   2   -2000015    16
    0.037531399   2    1000022    24
    0.023686505   2   -1000003    4
    0.023682903   2   -1000001    2
    0.022481209   2    1000004   -3
    0.022433961   2    1000002   -1
    0.0096291206   2    1000023    24
    0.0075452599   2    1000024    23
    0.0042365974   2    1000024    25
    0.0029540124   2   -1000011    12
    0.0029539435   2   -1000013    14
    0.0028277127   2    1000014   -13
    0.0028060659   2    1000012   -11
    0.002344308   3    1000022   -5    6
    0.00062662194   2   -1000015    16
    0.00018544   2   -2000003    4

DECAY 1000022 -1


DECAY 1000023  53.188369
    0.069467955   2    2000006   -6
    0.069467955   2   -2000006    6
    0.065325788   2    1000015   -15
    0.065325788   2   -1000015    15
    0.062780032   2    1000016   -16
    0.062780032   2   -1000016    16
    0.048751767   2    1000004   -4
    0.048751767   2   -1000004    4
    0.04875052   2    1000002   -2
    0.04875052   2   -1000002    2
    0.048569956   2    1000003   -3
    0.048569956   2   -1000003    3
    0.048565032   2    1000001   -1
    0.048565032   2   -1000001    1
    0.042324291   2    1000005   -5
    0.042324291   2   -1000005    5
    0.018074475   2    2000005   -5
    0.018074475   2   -2000005    5
    0.012072895   2    2000015   -15
    0.012072895   2   -2000015    15
    0.0065077863   2    1000022    25
    0.0064300266   2    1000022    23
    0.0051272702   2    1000006   -6
    0.0051272702   2   -1000006    6
    0.0051180718   2    1000006   -4
    0.0051180718   2   -1000006    4
    0.0045974298   2    1000014   -14
    0.0045974298   2   -1000014    14
    0.0045966715   2    1000012   -12
    0.0045966715   2   -1000012    12
    0.0045951908   2    1000013   -13
    0.0045951908   2   -1000013    13
    0.0045937606   2    1000011   -11
    0.0045937606   2   -1000011    11
    0.00037428602   3    1000022    6   -6

DECAY 1000025  59.775634
    0.13254988   2    1000006   -6
    0.13254988   2   -1000006    6
    0.12721525   2    2000006   -6
    0.12721525   2   -2000006    6
    0.070769469   2    1000005   -5
    0.070769469   2   -1000005    5
    0.056856419   2    2000005   -5
    0.056856419   2   -2000005    5
    0.03374069   2    1000022    25
    0.033564119   2    1000015   -15
    0.033564119   2   -1000015    15
    0.030906431   2    2000015   -15
    0.030906431   2   -2000015    15
    0.016929155   2    1000024   -24
    0.016929155   2   -1000024    24
    0.016432425   2    1000023    23
    0.0095391099   2    1000022    23
    0.0021139965   3    1000022    6   -6
    0.00011942356   2    2000003   -3
    0.00011942356   2   -2000003    3

DECAY 1000035  62.488816
    0.14301732   2    1000006   -6
    0.14301732   2   -1000006    6
    0.080260683   2    2000006   -6
    0.080260683   2   -2000006    6
    0.070333861   2    2000005   -5
    0.070333861   2   -2000005    5
    0.045530188   2    2000015   -15
    0.045530188   2   -2000015    15
    0.039761388   2    1000005   -5
    0.039761388   2   -1000005    5
    0.0297891   2    1000022    25
    0.029524708   2    1000022    23
    0.016200737   2    1000015   -15
    0.016200737   2   -1000015    15
    0.012394169   2    1000016   -16
    0.012394169   2   -1000016    16
    0.011328727   2    1000003   -3
    0.011328727   2   -1000003    3
    0.011305323   2    1000001   -1
    0.011305323   2   -1000001    1
    0.011226198   2    1000004   -4
    0.011226198   2   -1000004    4
    0.011224381   2    1000002   -2
    0.011224381   2   -1000002    2
    0.0089490529   2    1000024   -24
    0.0089490529   2   -1000024    24
    0.0042535242   2    1000023    25
    0.0017986228   3    1000022    6   -6
    0.0014281769   2    1000014   -14
    0.0014281769   2   -1000014    14
    0.0014280068   2    1000012   -12
    0.0014280068   2   -1000012    12
    0.0013950659   2    1000013   -13
    0.0013950659   2   -1000013    13
    0.0013845719   2    1000011   -11
    0.0013845719   2   -1000011    11

DECAY 1000021  3.8781633e-10
    0.42890839   3    1000022    2   -2
    0.41985737   3    1000022    4   -4
    0.06981521   3    1000022    1   -1
    0.0698084   3    1000022    3   -3
    0.0077245017   2    1000022    21
    0.0038861187   3    1000022    5   -5

DECAY 25  0.0035705742
    0.61133898   2   -5    5
    0.18829643   2   -24    24
    0.074126489   2    21    21
    0.070215945   2   -15    15
    0.030277945   2   -4    4
    0.021648246   2    23    23
    0.0023381513   2    22    22
    0.0012838157   2    22    23
    0.00024352289   2   -13    13
    0.00022968834   2   -3    3
    6.3506611e-07   2   -1    1
    1.5603814e-07   2   -2    2
    5.4746997e-09   2   -11    11

DECAY 35  75.49723
    0.7169166   2   -5    5
    0.28157518   2   -15    15
    0.0009094436   2   -13    13
    0.00033770373   2   -6    6
    0.00023611401   2   -3    3
    1.3695793e-05   2    25    25
    5.474796e-06   2    1000022    1000022
    4.6719918e-06   2    21    21
    6.5286837e-07   2   -1    1
    2.6640398e-07   2    23    23
    6.1957072e-08   2   -1000004    1000004
    6.1901718e-08   2   -1000002    1000002
    5.5371886e-08   2   -24    24
    2.0423408e-08   2   -11    11
    4.5149881e-09   2    22    23
    7.153209e-10   2   -4    4
    1.1133949e-10   2    22    22
    3.6804936e-15   2   -2    2

DECAY 36  71.66803
    0.71680844   2   -5    5
    0.28155786   2   -15    15
    0.00090939923   2   -13    13
    0.00046636972   2   -6    6
    0.00023607645   2   -3    3
    1.1613076e-05   2    1000022    1000022
    8.952828e-06   2    21    21
    6.5276312e-07   2   -1    1
    6.0099362e-07   2    23    25
    2.0422393e-08   2   -11    11
    1.157509e-08   2    22    22
    3.5716375e-09   2    22    23
    1.424555e-09   2   -4    4
    7.3336806e-15   2   -2    2
    2.4603484e-37   2    25    25

DECAY 37  64.192991
    0.74463159   2   -5    6
    0.25308176   2   -15    16
    0.0011030452   2   -5    4
    0.0008947341   2   -13    14
    0.00026488388   2   -3    4
    1.2447545e-05   2   -3    2
    7.87688e-06   2   -5    2
    2.1148528e-06   2   -3    6
    7.3523227e-07   2   -1    2
    6.7152383e-07   2    24    25
    7.8894796e-08   2   -1    6
    3.5169997e-08   2   -1    4
    2.0927924e-08   2   -11    12
    8.3851926e-12   2   -1000003    1000004
    3.2505444e-14   2    24    35
    1.2430722e-15   2   -1000001    1000004
    2.3558733e-18   2   -1000003    1000002
    1.2207856e-19   2   -1000001    1000002

DECAY 6  2.43
    1   2    5    24

DECAY 15 -1
