BLOCK SPINFO
   1   SPheno
   2   v4.0.5be

BLOCK SPHENOINFO
   1   2
   2   2

BLOCK MODSEL
   1   0

BLOCK MINPAR
   3    28.749145
   4    1

BLOCK EXTPAR
   0    1436.5957
   1    282.5521
   2   -502.96978
   3    3000
   11    2900.9541
   12    1560.1932
   13   -1126.0627
   23    1490.865
   25    27.712172
   26    563.17841
   31    1209.1394
   32    1209.1394
   33    1450.5399
   34    636.43057
   35    636.43057
   36    1374.5922
   41    5000
   42    5000
   43    1700.3029
   44    5000
   45    5000
   46    1287.6463
   47    5000
   48    5000
   49    1453.9374

BLOCK SMINPUTS
   1    127.90897
   2    1.1663787e-05
   3    0.1184
   4    91.1876
   5    4.18
   6    173.2
   7    1.777
   8    0
   11    0.00051099893
   12    0
   13    0.10565837
   14    0
   21    0.005
   22    0.0025
   23    0.095
   24    1.27

BLOCK GAUGE Q=  1436.5957
   1    0.35536298
   2    0.66519887
   3    1.219778

BLOCK YU Q=  1436.5957
   1   1    8.3898292e-06
   2   2    0.0042620332
   3   3    1.0135588

BLOCK YD Q=  1436.5957
   1   1    0.00046720117
   2   2    0.0088768223
   3   3    0.46331716

BLOCK YE Q=  1436.5957
   1   1    8.1530021e-05
   2   2    0.016857823
   3   3    0.28352084

BLOCK AU Q=  1436.5957
   1   1    0
   2   2    0
   3   3    2900.9541

BLOCK AD Q=  1436.5957
   1   1    0
   2   2    0
   3   3    1560.1931

BLOCK AE Q=  1436.5957
   1   1    0
   2   2    0
   3   3   -1126.0627

BLOCK MSOFT Q=  1436.5957
   1    282.5521
   2   -502.96978
   3    3000
   21   -1912157.8
   22   -2179135.9
   31    1209.1394
   32    1209.1394
   33    1450.5399
   34    636.43057
   35    636.43057
   36    1374.5922
   41    5000
   42    5000
   43    1700.3029
   44    5000
   45    5000
   46    1287.6463
   47    5000
   48    5000
   49    1453.9374

BLOCK MASS
   6    173.2
   23    91.1876
   24    80.429995
   15    1.777
   25    122.88236
   35    562.94215
   36    563.17841
   37    569.57672
   1000001    5026.3694
   2000001    5015.9416
   1000002    5025.9256
   2000002    5017.1599
   1000003    5026.3739
   2000003    5015.9417
   1000004    5025.9274
   2000004    5017.1606
   1000005    1457.7573
   2000005    1680.6058
   1000006    1199.1276
   2000006    1721.0906
   1000011    1212.8853
   2000011    640.76795
   1000012    1209.9473
   1000013    1212.8885
   2000013    640.75001
   1000014    1209.9436
   1000015    1367.2163
   2000015    1460.6272
   1000016    1450.4654
   1000021    3183.3015
   1000022    281.67094
   1000023   -533.85033
   1000025    1487.7106
   1000035   -1488.3421
   1000024    534.02988
   1000037    1490.3402

BLOCK ALPHA
      -0.037666865

BLOCK HMIX Q=  1436.5957
   1    1490.865
   2    27.712172
   3    244.04635
   4    317169.93

BLOCK STOPMIX
   1   1   -0.2943204
   1   2    0.95570681
   2   1   -0.95570681
   2   2   -0.2943204

BLOCK SBOTMIX
   1   1    0.094669746
   1   2    0.99550873
   2   1   -0.99550873
   2   2    0.094669746

BLOCK STAUMIX
   1   1    0.29160739
   1   2    0.9565381
   2   1   -0.9565381
   2   2    0.29160739

BLOCK NMIX
   1   1   -0.99948385
   1   2   -0.00070990207
   1   3   -0.031384659
   1   4    0.0068220843
   2   1    0.0010326184
   2   2    0.99802886
   2   3   -0.059675664
   2   4   -0.019394694
   3   1    0.027013842
   3   2   -0.028494388
   3   3   -0.70592071
   3   4    0.70720172
   4   1    0.017355912
   4   2   -0.055910386
   4   3   -0.7050743
   4   4   -0.70671283

BLOCK UMIX
   1   1   -0.99643425
   1   2    0.084372895
   2   1   -0.084372895
   2   2   -0.99643425

BLOCK VMIX
   1   1    0.99961933
   1   2    0.027589761
   2   1    0.027589761
   2   2   -0.99961933

BLOCK HIGGSBOUNDSINPUTHIGGSCOUPLINGSFERMIONS
       0, 767.96445,3,36,15,15

BLOCK HIGGSBOUNDSINPUTHIGGSCOUPLINGSBOSONS
       0,4,36,21,21,23

BLOCK SPHENOLOWENERGY
   1    0.0004102063
   2    1.5881547e-06
   3    3.5231461e-05
   4    2.7597474e-15
   5    1.1789086e-10
   6    2.4537036e-08
   7    9.1506215e-14
   8    3.9090508e-09
   9    8.2366433e-07
   10    7.7274077e-05
   11    0.79821163
   12    0.54330759
   13    19.341852
   14    0
   15    0
   16    0.0021662023
   17    2.2817649e-15
   18    2.4780516e-11
   19    8.2859743e-11
   20   -4.7307452e-15
   21   -2.0224965e-10
   22   -5.8474637e-08
   23    0
   24    0
   25    0
   26    0
   27    0
   28    0
   29    0
   30    0
   31    0
   39    8.2941451e-05
   40    0
   41    0
   42    0

BLOCK FWCOEF Q=  160
   305   4422   0   0   -0.18881911
   305   4422   0   2   -0.27826763
   305   4322   0   2   -0.0015222971
   305   6421   0   0   -0.095227835
   305   6421   0   2   -0.18333312
   305   6321   0   2   -0.0015825384
   3051111   4133   0   0    1.5904587
   3051111   4133   0   2    1.5910263
   3051111   4233   0   2   -0.00010628496
   3051111   4137   0   0   -4.4131508
   3051111   4137   0   2   -4.4093212
   3051111   4237   0   2    0.00083204424
   3051313   4133   0   0    1.5904587
   3051313   4133   0   2    1.5910244
   3051313   4233   0   2   -0.00010630743
   3051313   4137   0   0   -4.4131508
   3051313   4137   0   2   -4.4093231
   3051313   4237   0   2    0.00083206611
   3051212   4137   0   0    1.5053501
   3051212   4137   0   2    1.50453
   3051212   4237   0   2   -0.00018140783
   3051414   4137   0   0    1.5053501
   3051414   4137   0   2    1.50453
   3051414   4237   0   2   -0.00018140296
   3051616   4137   0   0    1.5053501
   3051616   4137   0   2    1.5045298
   3051616   4237   0   2   -0.0001800319

BLOCK IMFWCOEF Q=  160
   305   4422   0   0    3.8571006e-07
   305   4422   0   2   -6.8781862e-06
   305   4322   0   2   -2.4062605e-06
   305   6421   0   0    3.3038617e-07
   305   6421   0   2   -9.7461997e-06
   305   6321   0   2   -1.2728015e-06
   3051111   4133   0   2   -1.2393275e-08
   3051111   4233   0   2    1.8222674e-06
   3051111   4137   0   2    1.248507e-06
   3051111   4237   0   2   -1.4217516e-05
   3051313   4133   0   2   -1.240096e-08
   3051313   4233   0   2    1.8222645e-06
   3051313   4137   0   2    1.2484988e-06
   3051313   4237   0   2   -1.4217524e-05
   3051212   4137   0   2   -7.3403541e-09
   3051212   4237   0   2    3.0993971e-06
   3051414   4137   0   2   -7.3403625e-09
   3051414   4237   0   2    3.0993971e-06
   3051616   4137   0   2   -1.193777e-08
   3051616   4237   0   2    3.0994008e-06

DECAY 23  2.4952


DECAY 24  2.085


DECAY 2000011  2.0934017
    0.99999985   2    1000022    11

DECAY 1000011  11.715677
    0.58803353   2   -1000024    12
    0.2953802   2    1000023    11
    0.11658626   2    1000022    11

DECAY 2000013  2.0932919
    0.99999812   2    1000022    13

DECAY 1000013  11.719391
    0.58785019   2   -1000024    14
    0.29528933   2    1000023    13
    0.11655023   2    1000022    13
    0.00031010611   2    2000013    25

DECAY 1000015  7.2968006
    0.81205578   2    1000022    15
    0.12509098   2   -1000024    16
    0.062853247   2    1000023    15

DECAY 2000015  14.993284
    0.57191195   2   -1000024    16
    0.28762628   2    1000023    15
    0.1403554   2    1000022    15
    0.00010635197   2    1000015    23

DECAY 1000012  11.691492
    0.59020386   2    1000024    11
    0.29393411   2    1000023    12
    0.11586203   2    1000022    12

DECAY 1000014  11.691458
    0.5902049   2    1000024    13
    0.29393317   2    1000023    14
    0.11586193   2    1000022    14

DECAY 1000016  15.980074
    0.59744514   2    1000024    15
    0.29710075   2    1000023    16
    0.10519134   2    1000022    16
    0.00026276478   2    1000015    24

DECAY 2000001  144.00513
    0.98067917   2    1000021    1
    0.019303884   2    1000022    1

DECAY 1000001  207.82657
    0.68474731   2    1000021    1
    0.20664422   2   -1000024    2
    0.10361647   2    1000023    1
    0.0033243255   2    1000022    1
    0.0012608494   2   -1000037    2
    0.00030848351   2    1000035    1

DECAY 2000003  144.0182
    0.98059028   2    1000021    3
    0.019302187   2    1000022    3

DECAY 1000003  207.83516
    0.68472127   2    1000021    3
    0.20663585   2   -1000024    4
    0.10361241   2    1000023    3
    0.003324228   2    1000022    3
    0.0012680986   2   -1000037    4
    0.000324119   2    1000035    3
    0.0001140222   2    1000025    3

DECAY 1000005  1.1476671
    0.67290137   2    1000022    5
    0.18757246   2   -1000024    6
    0.098197229   2    1000023    5
    0.041328936   2    1000006   -24

DECAY 2000005  50.485813
    0.62197405   2    1000006   -24
    0.22341506   2   -1000024    6
    0.11595027   2    1000023    5
    0.014282976   2   -1000037    6
    0.01015908   2    1000005    25
    0.0041698998   2    1000022    5
    0.0033941565   2    1000035    5
    0.003381882   2    1000025    5
    0.0032726258   2    1000005    23

DECAY 2000002  152.48146
    0.92699579   2    1000021    2
    0.072941123   2    1000022    2

DECAY 1000002  207.81943
    0.68454842   2    1000021    2
    0.20795535   2    1000024    1
    0.10368685   2    1000023    2
    0.0033776031   2    1000022    2
    0.00024717599   2    1000035    2
    0.0001348944   2    1000037    1

DECAY 2000004  152.48449
    0.92697746   2    1000021    4
    0.07293967   2    1000022    4

DECAY 1000004  207.82764
    0.68452202   2    1000021    4
    0.20794748   2    1000024    3
    0.10368279   2    1000023    4
    0.0033774709   2    1000022    4
    0.00025078819   2    1000035    4
    0.00016611063   2    1000037    3

DECAY 1000006  3.1700487
    0.64476644   2    1000022    6
    0.24001199   2    1000024    5
    0.11294947   2    1000023    6
    0.0021144821   2    1000023    4

DECAY 2000006  53.304198
    0.33434282   2    1000006    23
    0.30886484   2    1000006    25
    0.20718674   2    1000024    5
    0.10118135   2    1000023    6
    0.01163675   2    1000037    5
    0.01057101   2    1000022    6
    0.010370028   2    1000005    24
    0.0081577858   2    1000025    6
    0.007688672   2    1000035    6

DECAY 1000024  7.1608532e-05
    0.97936101   2    1000022    24
    0.0075141423   3    1000022   -13    14
    0.0075032573   3    1000022   -11    12
    0.0045155184   3    1000022   -15    16
    0.0010908528   3    1000022   -5    6

DECAY 1000037  22.592609
    0.23042032   2    1000006   -5
    0.13230997   2    1000024    25
    0.13061414   2    1000023    24
    0.12837796   2    1000024    23
    0.10144493   2    1000024    36
    0.1009861   2    1000024    35
    0.091191429   2    37    1000023
    0.045938695   2    1000022    24
    0.028208681   2    37    1000022
    0.0040093013   3    1000024    6   -6
    0.0031160309   3    1000023   -5    6
    0.001404872   3    1000022   -5    6
    0.0010611033   2   -1000015    16
    0.000235687   2   -1000011    12
    0.00023568219   2   -1000013    14
    0.00014730356   2    1000016   -15
    0.00012302699   2   -2000013    14

DECAY 1000022 -1


DECAY 1000023  9.6597038e-05
    0.93440511   2    1000022    23
    0.023144808   2    1000022    25
    0.017954111   3    1000022    12   -12
    0.0073203509   3    1000022    13   -13
    0.0073126521   3    1000022    11   -11
    0.0056476821   3    1000022    5   -5
    0.0041438349   3    1000022    15   -15

DECAY 1000025  22.306487
    0.13055939   2    1000024   -24
    0.13055939   2   -1000024    24
    0.1248272   2    1000023    25
    0.10464947   2    1000023    23
    0.10094497   2    37   -1000024
    0.10094497   2   -37    1000024
    0.076827445   2    1000023    35
    0.066538585   2    1000006   -6
    0.066538585   2   -1000006    6
    0.030172768   2    1000022    25
    0.019616612   2    1000022    35
    0.014013284   2    1000023    36
    0.013579424   2    1000022    23
    0.0091973346   2    1000022    36
    0.003053187   3    1000024    5   -6
    0.003053187   3   -1000024   -5    6
    0.0015769025   3    1000023    6   -6
    0.00072127836   3    1000022    6   -6
    0.00061278347   2    1000015   -15
    0.00061278347   2   -1000015    15
    0.00033879703   2    1000005   -5
    0.00033879703   2   -1000005    5
    0.0001434218   2    2000013   -13
    0.0001434218   2   -2000013    13

DECAY 1000035  20.358132
    0.14342908   2    1000024   -24
    0.14342908   2   -1000024    24
    0.11691886   2    1000023    25
    0.099912113   2    37   -1000024
    0.099912113   2   -37    1000024
    0.097445015   2    1000023    35
    0.072064623   2    1000006   -6
    0.072064623   2   -1000006    6
    0.036029185   2    1000022    23
    0.029642246   2    1000023    23
    0.028543254   2    1000022    25
    0.024879559   2    1000022    35
    0.013223413   2    1000023    36
    0.0086702884   2    1000022    36
    0.0042354901   3    1000024    5   -6
    0.0042354901   3   -1000024   -5    6
    0.0015787262   3    1000023    6   -6
    0.00079653246   3    1000022    6   -6
    0.00065479467   2    1000015   -15
    0.00065479467   2   -1000015    15
    0.00038390907   2    1000005   -5
    0.00038390907   2   -1000005    5
    0.00010488621   2    2000013   -13
    0.00010488621   2   -2000013    13

DECAY 1000021  225.52169
    0.16457078   2    1000006   -6
    0.16457078   2   -1000006    6
    0.13039285   2    1000005   -5
    0.13039285   2   -1000005    5
    0.10875517   2    2000005   -5
    0.10875517   2   -2000005    5
    0.09527569   2    2000006   -6
    0.09527569   2   -2000006    6
    0.00030496954   2    1000006   -4
    0.00030496954   2   -1000006    4
    0.00027170568   3    1000025    6   -6
    0.00026474807   3    1000037    5   -6
    0.00026474807   3   -1000037   -5    6
    0.00025739389   3    1000035    6   -6

DECAY 25  0.0038986856
    0.62357037   2   -5    5
    0.18109587   2   -24    24
    0.074867973   2   -15    15
    0.067735847   2    21    21
    0.027816292   2   -4    4
    0.021008559   2    23    23
    0.0021743469   2    22    22
    0.0012265032   2    22    23
    0.00025932409   2   -13    13
    0.00024408765   2   -3    3
    6.7488028e-07   2   -1    1
    1.4335028e-07   2   -2    2
    5.8299214e-09   2   -11    11

DECAY 35  4.2581913
    0.78238406   2   -5    5
    0.21335402   2   -15    15
    0.0015183535   2    25    25
    0.0012199839   2   -6    6
    0.00072738109   2   -13    13
    0.00051818191   2   -3    3
    0.00011387209   2    21    21
    0.00010934088   2   -24    24
    5.3189453e-05   2    23    23
    1.4327426e-06   2   -1    1
    8.2188142e-08   2    22    22
    7.5316921e-08   2   -4    4
    1.6344938e-08   2   -11    11
    6.4107424e-09   2    22    23
    3.8860687e-13   2   -2    2

DECAY 36  4.2007753
    0.78337127   2   -5    5
    0.2135799   2   -15    15
    0.0015322464   2   -6    6
    0.00072811856   2   -13    13
    0.00051867825   2   -3    3
    0.000175624   2    21    21
    9.224372e-05   2    23    25
    1.4341147e-06   2   -1    1
    2.5812918e-07   2    22    22
    1.4592306e-07   2    22    23
    6.2805285e-08   2   -4    4
    1.6361507e-08   2   -11    11
    3.2450281e-13   2   -2    2
    4.2018916e-35   2    25    25

DECAY 37  3.600834
    0.7356468   2   -5    6
    0.26144844   2   -15    16
    0.0012748885   2   -5    4
    0.00092433087   2   -13    14
    0.00054365682   2   -3    4
    0.00011426747   2    24    25
    2.4901812e-05   2   -3    2
    1.1493217e-05   2   -3    6
    9.1041058e-06   2   -5    2
    1.5088825e-06   2   -1    2
    4.9722338e-07   2   -1    6
    7.4405835e-08   2   -1    4
    2.1620197e-08   2   -11    12
    4.7964302e-09   2    24    35
    4.0025433e-09   2    24    36

DECAY 6  2.43
    1   2    5    24

DECAY 15 -1
