BLOCK SPINFO
   1   SPheno
   2   v4.0.5be

BLOCK SPHENOINFO
   1   2
   2   2

BLOCK MODSEL
   1   0

BLOCK MINPAR
   3    30.457175
   4    1

BLOCK EXTPAR
   0    3926.4985
   1   -349.11624
   2    2584.8578
   3    3979.2171
   11   -5287.9844
   12   -803.81093
   13   -1675.412
   23    2009.8959
   25    29.315672
   26    2803.9904
   31    513.46429
   32    513.46429
   33    4954.433
   34    2244.189
   35    2244.189
   36    792.02795
   41    3198.9423
   42    3198.9423
   43    4082.7585
   44    3964.6775
   45    3964.6775
   46    3630.824
   47    1353.2338
   48    1353.2338
   49    3004.454

BLOCK SMINPUTS
   1    127.90897
   2    1.1663787e-05
   3    0.1184
   4    91.1876
   5    4.18
   6    173.2
   7    1.777
   8    0
   11    0.00051099893
   12    0
   13    0.10565837
   14    0
   21    0.005
   22    0.0025
   23    0.095
   24    1.27

BLOCK GAUGE Q=  3926.4985
   1    0.35536298
   2    0.66519887
   3    1.219778

BLOCK YU Q=  3926.4985
   1   1    8.3892487e-06
   2   2    0.0042617383
   3   3    1.0134886

BLOCK YD Q=  3926.4985
   1   1    0.00049420048
   2   2    0.0093898091
   3   3    0.49009202

BLOCK YE Q=  3926.4985
   1   1    8.6241598e-05
   2   2    0.017832027
   3   3    0.29990536

BLOCK AU Q=  3926.4985
   1   1    0
   2   2    0
   3   3   -5287.9898

BLOCK AD Q=  3926.4985
   1   1    0
   2   2    0
   3   3   -803.81024

BLOCK AE Q=  3926.4985
   1   1    0
   2   2    0
   3   3   -1675.4114

BLOCK MSOFT Q=  3926.4985
   1   -349.11624
   2    2584.8578
   3    3979.2171
   21    3757170.6
   22   -3806584.3
   31    513.46429
   32    513.46429
   33    4954.433
   34    2244.189
   35    2244.189
   36    792.02795
   41    3198.9423
   42    3198.9423
   43    4082.7585
   44    3964.6775
   45    3964.6775
   46    3630.824
   47    1353.2338
   48    1353.2338
   49    3004.454

BLOCK MASS
   6    173.2
   23    91.1876
   24    80.429995
   15    1.777
   25    124.06639
   35    2803.9023
   36    2803.9904
   37    2805.4335
   1000001    3385.5665
   2000001    1593.912
   1000002    3384.6319
   2000002    4103.9544
   1000003    3385.5647
   2000003    1593.9087
   1000004    3384.6302
   2000004    4103.9537
   1000005    3160.5963
   2000005    4176.363
   1000006    3675.0399
   2000006    4195.1628
   1000011    596.65981
   2000011    2251.4259
   1000012    591.33242
   1000013    596.62412
   2000013    2251.4047
   1000014    591.32166
   1000015    800.5959
   2000015    4964.786
   1000016    4963.6755
   1000021    4133.6778
   1000022   -343.85896
   1000023    2024.8928
   1000025   -2031.5012
   1000035    2622.0592
   1000024    2025.3069
   1000037    2622.2584

BLOCK ALPHA
      -0.032913112

BLOCK HMIX Q=  3926.4985
   1    2009.8959
   2    29.315672
   3    242.96405
   4    7862362

BLOCK STOPMIX
   1   1    0.18875882
   1   2    0.98202348
   2   1   -0.98202348
   2   2    0.18875882

BLOCK SBOTMIX
   1   1    0.016286535
   1   2    0.99986737
   2   1   -0.99986737
   2   2    0.016286535

BLOCK STAUMIX
   1   1    0.0045336417
   1   2    0.99998972
   2   1   -0.99998972
   2   2    0.0045336417

BLOCK NMIX
   1   1    0.99974363
   1   2    5.2306578e-05
   1   3    0.022441202
   1   4    0.0030090594
   2   1    0.013693341
   2   2    0.097810776
   2   3   -0.70449532
   2   4    0.70280288
   3   1   -0.017992764
   3   2    0.01149382
   3   3    0.70671916
   3   4    0.70717197
   4   1    0.0011906319
   4   2   -0.99513865
   4   3   -0.061080088
   4   4    0.077245477

BLOCK UMIX
   1   1   -0.085036958
   1   2    0.9963778
   2   1    0.9963778
   2   2    0.085036958

BLOCK VMIX
   1   1   -0.10791717
   1   2    0.99415989
   2   1    0.99415989
   2   2    0.10791717

BLOCK HIGGSBOUNDSINPUTHIGGSCOUPLINGSFERMIONS
       0, 859.40859,3,36,15,15

BLOCK HIGGSBOUNDSINPUTHIGGSCOUPLINGSBOSONS
       0,4,36,21,21,23

BLOCK SPHENOLOWENERGY
   1    0.00032044886
   2    1.5909192e-06
   3    3.5267367e-05
   4    2.5232813e-15
   5    1.0779135e-10
   6    2.2541767e-08
   7    8.4681604e-14
   8    3.6175836e-09
   9    7.6656242e-07
   10    9.6232105e-05
   11    0.99404081
   12    0.54177551
   13    19.354413
   14    0
   15    0
   16    0.0021566051
   17    2.2816517e-15
   18    2.4809205e-11
   19    8.2927698e-11
   20   -4.2455361e-16
   21   -1.8172746e-11
   22    9.1475534e-09
   23    0
   24    0
   25    0
   26    0
   27    0
   28    0
   29    0
   30    0
   31    0
   39    6.4970231e-05
   40    0
   41    0
   42    0

BLOCK FWCOEF Q=  160
   305   4422   0   0   -0.18881911
   305   4422   0   2   -0.18772634
   305   4322   0   2    5.1123169e-05
   305   6421   0   0   -0.095227835
   305   6421   0   2   -0.10077024
   305   6321   0   2   -9.1592742e-05
   3051111   4133   0   0    1.6260128
   3051111   4133   0   2    1.6262869
   3051111   4233   0   2    0.00014905641
   3051111   4137   0   0   -4.4487049
   3051111   4137   0   2   -4.4485238
   3051111   4237   0   2   -0.0011047761
   3051313   4133   0   0    1.6260128
   3051313   4133   0   2    1.6262859
   3051313   4233   0   2    0.0001490562
   3051313   4137   0   0   -4.4487049
   3051313   4137   0   2   -4.4485248
   3051313   4237   0   2   -0.0011047762
   3051212   4137   0   0    1.5053501
   3051212   4137   0   2    1.5053131
   3051212   4237   0   2    0.00023893405
   3051414   4137   0   0    1.5053501
   3051414   4137   0   2    1.5053131
   3051414   4237   0   2    0.00023893408
   3051616   4137   0   0    1.5053501
   3051616   4137   0   2    1.5053135
   3051616   4237   0   2    0.00023894118

BLOCK IMFWCOEF Q=  160
   305   4422   0   0    3.8586232e-07
   305   4422   0   2    9.0140256e-06
   305   4322   0   2    3.5364139e-06
   305   6421   0   0    3.305166e-07
   305   6421   0   2   -3.9462959e-06
   305   6321   0   2    1.7622631e-06
   3051111   4133   0   2    3.0699945e-07
   3051111   4233   0   2    3.1364463e-06
   3051111   4137   0   2   -1.6570641e-06
   3051111   4237   0   2   -2.3246677e-05
   3051313   4133   0   2    3.0699104e-07
   3051313   4233   0   2    3.1364448e-06
   3051313   4137   0   2   -1.6570789e-06
   3051313   4237   0   2   -2.3246683e-05
   3051212   4137   0   2    3.958329e-07
   3051212   4237   0   2    5.0276345e-06
   3051414   4137   0   2    3.9583226e-07
   3051414   4237   0   2    5.0276345e-06
   3051616   4137   0   2    4.0419451e-07
   3051616   4237   0   2    5.0276213e-06

DECAY 23  2.4952


DECAY 24  2.085


DECAY 1000011  0.33420929
    0.99999998   2    1000022    11

DECAY 2000011  10.785659
    0.99998108   2    1000022    11

DECAY 1000013  0.33415066
    0.99999998   2    1000022    13

DECAY 2000013  10.791824
    0.99940012   2    1000022    13
    0.0004865986   2    1000013    25

DECAY 1000015  2.6744833
    1   2    1000022    15

DECAY 2000015  48.637355
    0.46394549   2   -1000037    16
    0.23149279   2    1000035    15
    0.12702653   2    1000022    15
    0.066328506   2    1000023    15
    0.063264342   2    1000025    15
    0.016238707   2    1000015    23
    0.015359827   2    1000015    25
    0.0060302043   2    1000015    35
    0.0060121062   2    1000015    36
    0.0043014919   2   -1000024    16

DECAY 1000012  0.32516211
    1   2    1000022    12

DECAY 1000014  0.3251441
    1   2    1000022    14

DECAY 1000016  48.682969
    0.46173932   2    1000037    15
    0.23129429   2    1000035    16
    0.13307551   2    1000024    15
    0.1267607   2    1000022    16
    0.032432591   2    1000015    24
    0.012005279   2    1000015    37
    0.0025537677   2    1000023    16
    0.00013854847   2    1000025    16

DECAY 2000001  0.8085521
    1   2    1000022    1

DECAY 1000001  7.7087911
    0.61437734   2   -1000037    2
    0.30669532   2    1000035    1
    0.059973929   2    1000022    1
    0.011527804   2   -1000024    2
    0.0072538685   2    1000023    1
    0.00017145456   2    1000025    1

DECAY 2000003  0.80855126
    1   2    1000022    3

DECAY 1000003  7.7124947
    0.61408043   2   -1000037    4
    0.30654757   2    1000035    3
    0.059945471   2    1000022    3
    0.01158554   2   -1000024    4
    0.007407316   2    1000023    3
    0.0003284679   2    1000025    3
    0.00010521108   2    2000003    25

DECAY 1000005  12.054571
    0.42311392   2   -1000024    6
    0.21698211   2    1000023    5
    0.21531282   2    1000025    5
    0.14390021   2    1000022    5
    0.00043872214   2   -1000037    6
    0.00025221416   2    1000035    5

DECAY 2000005  103.07235
    0.4744429   2   -1000024    6
    0.18926429   2    1000006   -24
    0.13612361   2   -1000037    6
    0.065249921   2    1000035    5
    0.056931868   2    1000023    5
    0.056434302   2    1000025    5
    0.0097273853   2    1000005    25
    0.0056016575   2    1000022    5
    0.0049124797   2    1000005    23
    0.0013115933   2    1000021    5

DECAY 1000002  7.7314949
    0.6086714   2    1000037    1
    0.30494436   2    1000035    2
    0.059850917   2    1000022    2
    0.018495571   2    1000024    1
    0.0079835593   2    1000023    2

DECAY 2000002  9.0346504
    0.99970344   2    1000022    2
    0.00018718123   2    1000025    2
    0.00010887168   2    1000023    2

DECAY 1000004  7.7343891
    0.60844263   2    1000037    3
    0.3048293   2    1000035    4
    0.059828466   2    1000022    4
    0.018801168   2    1000024    3
    0.0080119633   2    1000023    4

DECAY 2000004  9.0363364
    0.99951652   2    1000022    4
    0.00023383699   2    1000025    4
    0.00015530888   2    1000023    4

DECAY 1000006  78.966875
    0.45523927   2    1000024    5
    0.22464211   2    1000023    6
    0.22178386   2    1000025    6
    0.098061078   2    1000022    6

DECAY 2000006  109.10146
    0.23207083   2    1000025    6
    0.22582105   2    1000023    6
    0.12801653   2    1000037    5
    0.12471314   2    1000006    25
    0.10998111   2    1000024    5
    0.094966236   2    1000006    23
    0.066735891   2    1000035    6
    0.0094345666   2    1000005    24
    0.0082606456   2    1000022    6

DECAY 1000024  2.9393811
    0.44821067   2    1000022    24
    0.43642152   2   -1000015    16
    0.031367046   2    1000014   -13
    0.029554735   2    1000012   -11
    0.018289605   2   -1000013    14
    0.018289189   2   -1000011    12
    0.017597731   3    1000022   -5    6
    0.00026075863   2   -2000003    4

DECAY 1000037  56.390419
    0.18270557   2   -1000013    14
    0.18270318   2   -1000011    12
    0.18224558   2    1000014   -13
    0.18224398   2    1000012   -11
    0.06884835   2    1000023    24
    0.067347907   2    1000025    24
    0.065980186   2    1000024    25
    0.064543396   2    1000024    23
    0.0010412439   3    1000023   -5    6
    0.00097465529   3    1000025   -5    6
    0.00073216339   3    1000024    6   -6
    0.00041227274   2    1000022    24
    0.00019251566   2   -1000015    16

DECAY 1000022 -1


DECAY 1000023  3.3242102
    0.26540683   2    1000022    25
    0.2505918   2    1000022    23
    0.19306028   2    1000015   -15
    0.19306028   2   -1000015    15
    0.013152617   2    1000013   -13
    0.013152617   2   -1000013    13
    0.012354215   2    1000011   -11
    0.012354215   2   -1000011    11
    0.0097406027   3    1000022    6   -6
    0.009185818   2    1000014   -14
    0.009185818   2   -1000014    14
    0.0091857557   2    1000012   -12
    0.0091857557   2   -1000012    12
    0.00012891301   2    2000003   -3
    0.00012891301   2   -2000003    3

DECAY 1000025  2.6230677
    0.29947685   2    1000022    25
    0.24723166   2    1000015   -15
    0.24723166   2   -1000015    15
    0.18831619   2    1000022    23
    0.012576048   3    1000022    6   -6
    0.0010265643   2    1000013   -13
    0.0010265643   2   -1000013    13
    0.0006360517   2    1000014   -14
    0.0006360517   2   -1000014    14
    0.00063604742   2    1000012   -12
    0.00063604742   2   -1000012    12
    0.0001813849   2    2000003   -3
    0.0001813849   2   -2000003    3
    0.00012014509   3    1000022    5   -5

DECAY 1000035  59.319976
    0.086895825   2    1000014   -14
    0.086895825   2   -1000014    14
    0.086895486   2    1000012   -12
    0.086895486   2   -1000012    12
    0.086507129   2    1000013   -13
    0.086507129   2   -1000013    13
    0.086505564   2    1000011   -11
    0.086505564   2   -1000011    11
    0.065328415   2    1000025    23
    0.061668222   2    1000023    25
    0.060130063   2    1000024   -24
    0.060130063   2   -1000024    24
    0.055144633   2    1000025    25
    0.00097951121   3    1000024    5   -6
    0.00097951121   3   -1000024   -5    6
    0.000890677   2    1000023    23
    0.0002524838   2    1000022    23
    0.00024191127   2    1000022    25
    0.00023100074   3    1000023    6   -6
    0.0001957114   3    1000025    6   -6

DECAY 1000021  256.23555
    0.1730391   2    2000003   -3
    0.1730391   2   -2000003    3
    0.17303885   2    2000001   -1
    0.17303885   2   -2000001    1
    0.041191083   2    1000005   -5
    0.041191083   2   -1000005    5
    0.025934093   2    1000004   -4
    0.025934093   2   -1000004    4
    0.025934011   2    1000002   -2
    0.025934011   2   -1000002    2
    0.025875882   2    1000003   -3
    0.025875882   2   -1000003    3
    0.025875772   2    1000001   -1
    0.025875772   2   -1000001    1
    0.0083515677   2    1000006   -6
    0.0083515677   2   -1000006    6
    0.0002544966   3    1000024    5   -6
    0.0002544966   3   -1000024   -5    6
    0.00019617311   3    1000025    6   -6
    0.00018728237   3    1000023    6   -6

DECAY 25  0.0037619054
    0.58735895   2   -5    5
    0.21338426   2   -24    24
    0.073196319   2    21    21
    0.067501225   2   -15    15
    0.02899326   2   -4    4
    0.025353861   2    23    23
    0.0023383439   2    22    22
    0.0014184065   2    22    23
    0.0002342236   2   -13    13
    0.00022038506   2   -3    3
    6.0934122e-07   2   -1    1
    1.4941195e-07   2   -2    2
    5.265622e-09   2   -11    11

DECAY 35  32.033008
    0.80008508   2   -5    5
    0.17509394   2   -15    15
    0.013758505   2    1000022    1000023
    0.0069113901   2    1000022    1000025
    0.0030826019   2   -6    6
    0.00072301176   2   -13    13
    0.0002372309   2   -3    3
    9.0538607e-05   2    1000022    1000022
    8.4120841e-06   2    21    21
    2.1753761e-06   2   -1000015    1000015
    2.1151923e-06   2    25    25
    1.2172028e-06   2    23    23
    6.5578918e-07   2   -1    1
    4.0212904e-07   2   -24    24
    3.0040281e-07   2   -1000011    1000011
    2.9791319e-07   2   -1000013    1000013
    4.091877e-08   2   -4    4
    2.2130395e-08   2   -2000013    1000013
    2.2130395e-08   2   -1000013    2000013
    1.816607e-08   2   -1000001    1000001
    1.8114396e-08   2   -1000003    1000003
    1.6238715e-08   2   -11    11
    1.5871351e-08   2    22    23
    9.6446562e-09   2    22    22
    5.1759948e-13   2   -2000011    1000011
    5.1759948e-13   2   -1000011    2000011
    2.109231e-13   2   -2    2

DECAY 36  30.754193
    0.79966   2   -5    5
    0.17499928   2   -15    15
    0.014042125   2    1000022    1000025
    0.0074086265   2    1000022    1000023
    0.0028043713   2   -6    6
    0.00072261716   2   -13    13
    0.0002371064   2   -3    3
    9.868272e-05   2    1000022    1000022
    2.4447275e-05   2    21    21
    1.9694749e-06   2    23    25
    6.5544555e-07   2   -1    1
    3.6598362e-08   2   -4    4
    2.29273e-08   2   -2000013    1000013
    2.29273e-08   2   -1000013    2000013
    2.1998425e-08   2    22    22
    1.6229953e-08   2   -11    11
    4.8206825e-09   2    22    23
    5.3623415e-13   2   -2000011    1000011
    5.3623415e-13   2   -1000011    2000011
    1.8864825e-13   2   -2    2
    1.3531879e-38   2    25    25

DECAY 37  33.225992
    0.821183   2   -5    6
    0.15663774   2   -15    16
    0.020175811   2    1000022    1000024
    0.0012129017   2   -5    4
    0.0005537704   2   -13    14
    0.00020793739   2   -3    4
    9.7296978e-06   2   -3    2
    8.6613698e-06   2   -5    2
    5.4458677e-06   2   -3    6
    1.8270911e-06   2    24    25
    1.1362306e-06   2   -1000011    1000012
    1.1328665e-06   2   -1000013    1000014
    5.7673346e-07   2   -1    2
    2.3567957e-07   2   -1    6
    4.6135005e-08   2   -2000013    1000014
    2.9069316e-08   2   -1    4
    1.2952747e-08   2   -11    12
    1.0791303e-12   2   -2000011    1000012
    3.4487726e-13   2    24    35
    2.5646564e-13   2    24    36

DECAY 6  2.43
    1   2    5    24

DECAY 15 -1
