BLOCK DCINFO
   1   SDECAY/HDECAY
   2   1.3b /3.4

BLOCK SPINFO
   1   SOFTSUSY
   2   3.4.0

BLOCK MODSEL
   1   0

BLOCK SMINPUTS
   1    127.90897
   2    1.1663787e-05
   3    0.1184
   4    91.1876
   5    4.18
   6    173.2
   7    1.777

BLOCK MINPAR
   3    19.76

BLOCK EXTPAR
   0   -1
   1   -350.32
   2   -480.65
   3    3166.11
   11    4041.9
   12    2698.54
   13    3243.47
   23   -383.92
   26    2575.83
   31    625.41
   32    625.41
   33    2326.9
   34    1634.19
   35    1634.19
   36    3984.42
   41    1599.53
   42    1599.53
   43    2501.09
   44    3907.64
   45    3907.64
   46    3969.96
   47    2666.29
   48    2666.29
   49    2037.44

BLOCK MASS
   24    80.386771
   25    127.78604
   35    2575.8506
   36    2575.83
   37    2577.2804
   5    4.8187603
   1000001    1755.5382
   2000001    2786.5861
   1000002    1753.8309
   2000002    3990.3711
   1000003    1755.5382
   2000003    2786.5861
   1000004    1753.8309
   2000004    3990.3711
   1000005    2166.7565
   2000005    2596.1066
   1000006    2592.7275
   2000006    3980.6325
   1000011    633.52677
   2000011    1637.4533
   1000012    628.32123
   1000013    633.52677
   2000013    1637.4533
   1000014    628.32123
   1000015    2330.3177
   2000015    3985.1058
   1000016    2328.67
   1000021    3260.5479
   1000022   -328.10678
   1000023   -391.40672
   1000025    404.13904
   1000035   -529.59867
   1000024    376.25071
   1000037    529.17398

BLOCK NMIX
   1   1    0.84187679
   1   2   -0.16137262
   1   3   -0.39473828
   1   4    0.33073258
   2   1    0.53160235
   2   2    0.40278808
   2   3    0.53220234
   2   4   -0.5214608
   3   1    0.03873083
   3   2   -0.059111833
   3   3    0.70119241
   3   4    0.709461
   4   1   -0.084512324
   4   2    0.89901415
   4   3   -0.2631949
   4   4    0.3396464

BLOCK UMIX
   1   1    0.36690202
   1   2    0.93025959
   2   1   -0.93025959
   2   2    0.36690202

BLOCK VMIX
   1   1   -0.47366738
   1   2   -0.88070382
   2   1    0.88070382
   2   2   -0.47366738

BLOCK STOPMIX
   1   1    0.99821574
   1   2   -0.059710371
   2   1    0.059710371
   2   2    0.99821574

BLOCK SBOTMIX
   1   1   -0.012031818
   1   2    0.99992762
   2   1   -0.99992762
   2   2   -0.012031818

BLOCK STAUMIX
   1   1    0.99999837
   1   2   -0.0018027749
   2   1    0.0018027749
   2   2    0.99999837

BLOCK ALPHA
      -0.053066538

BLOCK HMIX Q=  3151.563
   1   -390.80426
   2    18.895022
   3    241.15262
   4    6766182.7

BLOCK GAUGE Q=  3151.563
   1    0.36534395
   2    0.64237937
   3    1.0090736

BLOCK AU Q=  3151.563
   1   1    0
   2   2    0
   3   3    4041.9

BLOCK AD Q=  3151.563
   1   1    0
   2   2    0
   3   3    2698.54

BLOCK AE Q=  3151.563
   1   1    0
   2   2    0
   3   3    3243.47

BLOCK YU Q=  3151.563
   1   1    0
   2   2    0
   3   3    0.83597035

BLOCK YD Q=  3151.563
   1   1    0
   2   2    0
   3   3    0.26591829

BLOCK YE Q=  3151.563
   1   1    0
   2   2    0
   3   3    0.19509347

BLOCK MSOFT Q=  3151.563
   1   -350.32
   2   -480.65
   3    3166.11
   21    6507158.7
   22    55964.568
   31    625.41
   32    625.41
   33    2326.9
   34    1634.19
   35    1634.19
   36    3984.42
   41    1599.53
   42    1599.53
   43    2501.09
   44    3907.64
   45    3907.64
   46    3969.96
   47    2666.29
   48    2666.29
   49    2037.44

BLOCK HIGGSBOUNDSINPUTHIGGSCOUPLINGSFERMIONS
       0, 357.02187,3,36,15,15

BLOCK HIGGSBOUNDSINPUTHIGGSCOUPLINGSBOSONS
       0,4,36,21,21,23

DECAY 6  1.453438
    1   2    5    24

DECAY 1000021  171.33673
    0.092035593   2    1000002   -2
    0.092035593   2   -1000002    2
    0.092035566   2    1000004   -4
    0.092035566   2   -1000004    4
    0.091889677   2    1000001   -1
    0.091889677   2   -1000001    1
    0.091889677   2    1000003   -3
    0.091889677   2   -1000003    3
    0.056458663   2    1000005   -5
    0.056458663   2   -1000005    5
    0.024772653   2    1000006   -6
    0.024772653   2   -1000006    6
    0.024428651   2    2000005   -5
    0.024428651   2   -2000005    5
    0.01324476   2    2000001   -1
    0.01324476   2   -2000001    1
    0.01324476   2    2000003   -3
    0.01324476   2   -2000003    3

DECAY 1000006  67.577818
    0.25655738   2    1000025    6
    0.21194937   2    1000037    5
    0.17343167   2    1000023    6
    0.16140628   2    1000035    6
    0.13295865   2    1000024    5
    0.063082946   2    1000022    6
    0.00061370777   2    1000005    24

DECAY 2000006  197.39958
    0.20252387   2    1000024    5
    0.13664643   2    1000025    6
    0.13657976   2    2000005    24
    0.11675949   2    1000021    6
    0.087316445   2    1000023    6
    0.082229777   2    1000006    25
    0.071275401   2    1000037    5
    0.070296947   2    1000006    23
    0.058960385   2    1000022    6
    0.037375111   2    1000035    6
    3.6389538e-05   2    1000005    24

DECAY 1000005  6.8685453
    0.36421777   2   -1000024    6
    0.20256187   2    1000025    5
    0.19623933   2    1000022    5
    0.16790211   2    1000023    5
    0.044595114   2   -1000037    6
    0.0244838   2    1000035    5

DECAY 2000005  67.49844
    0.42818426   2   -1000024    6
    0.36806392   2   -1000037    6
    0.12537967   2    1000035    5
    0.028257831   2    1000023    5
    0.026107995   2    1000025    5
    0.023358315   2    1000022    5
    0.00032873874   2    1000005    25
    0.00031927362   2    1000005    23

DECAY 1000002  18.677568
    0.49970244   2    1000037    1
    0.25107122   2    1000035    2
    0.15908903   2    1000024    1
    0.089199895   2    1000023    2
    0.00093627919   2    1000025    2
    1.137389e-06   2    1000022    2

DECAY 2000002  41.44976
    0.7867391   2    1000021    2
    0.15140501   2    1000022    2
    0.060043352   2    1000023    2
    0.0014942115   2    1000035    2
    0.0003183295   2    1000025    2

DECAY 1000001  18.581535
    0.56113595   2   -1000037    2
    0.27137358   2    1000035    1
    0.096053678   2   -1000024    2
    0.037598505   2    1000022    1
    0.032285751   2    1000023    1
    0.0015525355   2    1000025    1

DECAY 2000001  1.5642105
    0.71131059   2    1000022    1
    0.28034998   2    1000023    1
    0.0068551605   2    1000035    1
    0.0014842679   2    1000025    1

DECAY 1000004  18.468116
    0.49960854   2    1000037    3
    0.25102301   2    1000035    4
    0.15918449   2    1000024    3
    0.089246114   2    1000023    4
    0.00093670194   2    1000025    4
    1.1383679e-06   2    1000022    4

DECAY 2000004  33.08333
    0.71964099   2    1000021    4
    0.19906282   2    1000022    4
    0.078915425   2    1000023    4
    0.0019624091   2    1000035    4
    0.00041835372   2    1000025    4

DECAY 1000003  18.373185
    0.56105807   2   -1000037    4
    0.27133562   2    1000035    3
    0.096116029   2   -1000024    4
    0.037632812   2    1000022    3
    0.032304152   2    1000023    3
    0.0015533169   2    1000025    3

DECAY 2000003  1.5931665
    0.71138312   2    1000022    3
    0.28028419   2    1000023    3
    0.0068488667   2    1000035    3
    0.001483822   2    1000025    3

DECAY 1000011  1.5113199
    0.32705612   2    1000023    11
    0.27215377   2   -1000037    12
    0.19409409   2   -1000024    12
    0.11302074   2    1000035    11
    0.092843002   2    1000022    11
    0.00083227344   2    1000025    11

DECAY 2000011  7.9245937
    0.71657084   2    1000022    11
    0.27569362   2    1000023    11
    0.0062838312   2    1000035    11
    0.0014517083   2    1000025    11

DECAY 1000013  1.5113197
    0.32705611   2    1000023    13
    0.2721538   2   -1000037    14
    0.19409412   2   -1000024    14
    0.11302069   2    1000035    13
    0.092843004   2    1000022    13
    0.00083227341   2    1000025    13

DECAY 2000013  7.9245936
    0.71657084   2    1000022    13
    0.27569362   2    1000023    13
    0.0062838312   2    1000035    13
    0.0014517083   2    1000025    13

DECAY 1000015  30.656568
    0.48555465   2   -1000037    16
    0.20669465   2    1000035    15
    0.16190115   2    1000023    15
    0.079903356   2   -1000024    16
    0.038947221   2    1000022    15
    0.026998975   2    1000025    15

DECAY 2000015  26.830635
    0.56855682   2    1000022    15
    0.2498473   2    1000023    15
    0.095152045   2   -1000024    16
    0.055375307   2    1000025    15
    0.015053805   2   -1000037    16
    0.013184732   2    1000035    15
    0.0013854674   2    1000016   -24
    0.0007343902   2    1000015    25
    0.00071013562   2    1000015    23

DECAY 1000012  1.5828704
    0.35323343   2    1000022    12
    0.30079868   2    1000024    11
    0.21359069   2    1000037    11
    0.12253365   2    1000035    12
    0.0061562783   2    1000023    12
    0.0036872755   2    1000025    12

DECAY 1000014  1.5828701
    0.3532335   2    1000022    14
    0.30079869   2    1000024    13
    0.21359058   2    1000037    13
    0.12253367   2    1000035    14
    0.0061562794   2    1000023    14
    0.0036872762   2    1000025    14

DECAY 1000016  30.688212
    0.44156299   2    1000037    15
    0.25122534   2    1000035    16
    0.17968314   2    1000024    15
    0.12263201   2    1000022    16
    0.0029675702   2    1000023    16
    0.0019289465   2    1000025    16

DECAY 1000024  0.00012213971
    0.3333353   3    1000022    2   -1
    0.3333353   3    1000022    4   -3
    0.11149529   3    1000022   -11    12
    0.11149529   3    1000022   -13    14
    0.11033882   3    1000022   -15    16

DECAY 1000037  1.4254182
    0.31803366   2    1000024    23
    0.30176529   2    1000023    24
    0.20247858   2    1000025    24
    0.13771252   2    1000024    25
    0.040009947   2    1000022    24

DECAY 1000022 -1


DECAY 1000023  8.6287384e-06
    0.11291903   3    1000022   -1    1
    0.11291903   3    1000022   -3    3
    0.10769078   3    1000022   -5    5
    0.086489381   3    1000022   -2    2
    0.086489381   3    1000022   -4    4
    0.056237255   2    1000022    22
    0.051157617   3    1000022   -16    16
    0.048328177   3    1000022   -12    12
    0.048328177   3    1000022   -14    14
    0.037725751   3    1000024   -2    1
    0.037725751   3   -1000024   -1    2
    0.037725751   3    1000024   -4    3
    0.037725751   3   -1000024   -3    4
    0.025203644   3    1000022   -15    15
    0.01959957   3    1000022   -11    11
    0.01959957   3    1000022   -13    13
    0.012658567   3    1000024   -12    11
    0.012658567   3   -1000024    12   -11
    0.012658567   3    1000024   -14    13
    0.012658567   3   -1000024    14   -13
    0.011750558   3    1000024   -16    15
    0.011750558   3   -1000024    16   -15

DECAY 1000025  0.00095914149
    0.1467993   3    1000022   -1    1
    0.1467993   3    1000022   -3    3
    0.1413061   3    1000022   -5    5
    0.11319095   3    1000022   -2    2
    0.11319095   3    1000022   -4    4
    0.067538962   3    1000022   -12    12
    0.067538962   3    1000022   -14    14
    0.067309542   3    1000022   -16    16
    0.033683233   3    1000022   -11    11
    0.033683233   3    1000022   -13    13
    0.033485324   3    1000022   -15    15
    0.0058062151   3    1000024   -2    1
    0.0058062151   3   -1000024   -1    2
    0.0058062151   3    1000024   -4    3
    0.0058062151   3   -1000024   -3    4
    0.0019370465   3    1000024   -12    11
    0.0019370465   3   -1000024    12   -11
    0.0019370465   3    1000024   -14    13
    0.0019370465   3   -1000024    14   -13
    0.0018967824   3    1000024   -16    15
    0.0018967824   3   -1000024    16   -15
    0.00053661668   2    1000022    22
    2.9366332e-05   3    1000023   -1    1
    2.9366332e-05   3    1000023   -3    3
    2.2646362e-05   3    1000023   -2    2
    2.2646362e-05   3    1000023   -4    4
    1.347005e-05   3    1000023   -12    12
    1.347005e-05   3    1000023   -14    14
    1.3462599e-05   3    1000023   -16    16
    6.7232272e-06   3    1000023   -11    11
    6.7232272e-06   3    1000023   -13    13
    6.0085943e-06   3    1000023   -15    15
    5.3393465e-06   3    1000023   -5    5
    1.6872945e-06   2    1000023    22

DECAY 1000035  1.3998918
    0.36988102   2    1000024   -24
    0.36988102   2   -1000024    24
    0.15025487   2    1000025    23
    0.092464191   2    1000023    25
    0.010650687   2    1000022    25
    0.0061546093   2    1000023    23
    0.00071361291   2    1000022    23

DECAY 25  0.0043620641
    0.54241379   2    5   -5
    0.25980409   2    24   -24
    0.078055705   2    21    21
    0.061080917   2   -15    15
    0.033759242   2    23    23
    0.020237493   2    4   -4
    0.0023751261   2    22    22
    0.0018224418   2    22    23
    0.00023502196   2    3   -3
    0.00021616895   2   -13    13

DECAY 35  45.119131
    0.2453948   2    5   -5
    0.15990008   2    1000024   -1000037
    0.15990008   2    1000037   -1000024
    0.11535989   2    1000025    1000035
    0.075749923   2    1000024   -1000024
    0.04184719   2   -15    15
    0.041214479   2    1000022    1000025
    0.039313677   2    1000023    1000035
    0.032873618   2    1000037   -1000037
    0.026688377   2    1000022    1000023
    0.023281578   2    1000022    1000022
    0.019599956   2    1000035    1000035
    0.0085693035   2    1000022    1000035
    0.006603327   2    6   -6
    0.0014825531   2    1000023    1000023
    0.0014389552   2    1000025    1000025
    0.00050685513   2    1000023    1000025
    0.00014346449   2   -13    13
    0.00010156527   2    3   -3
    1.5860258e-05   2    25    25
    4.4738436e-06   2    24   -24
    2.583872e-06   2    21    21
    2.230934e-06   2    23    23
    1.9055816e-06   2    1000012   -1000012
    1.9055816e-06   2    1000014   -1000014
    5.8390901e-07   2    1000011   -1000011
    5.8390901e-07   2    1000013   -1000013
    1.2177048e-07   2    22    22
    6.7465315e-08   2    4   -4
    3.2081084e-09   2    23    22

DECAY 36  45.119671
    0.24541421   2    5   -5
    0.1393976   2    1000024   -1000037
    0.1393976   2    1000037   -1000024
    0.096762552   2    1000024   -1000024
    0.082256609   2    1000025    1000035
    0.0550988   2    1000023    1000035
    0.052842637   2    1000037   -1000037
    0.04184729   2   -15    15
    0.035484256   2    1000022    1000023
    0.031028455   2    1000035    1000035
    0.029742845   2    1000022    1000022
    0.0296495   2    1000022    1000025
    0.010635461   2    1000022    1000035
    0.0066351395   2    6   -6
    0.0020110921   2    1000023    1000023
    0.0012876333   2    1000025    1000025
    0.00023564494   2    1000023    1000025
    0.00014346461   2   -13    13
    0.00010158538   2    3   -3
    2.2847423e-05   2    21    21
    4.5253752e-06   2    23    25
    1.5551185e-07   2    22    22
    6.7596313e-08   2    4   -4
    1.9693225e-08   2    23    22

DECAY 37  45.330991
    0.25580766   2    6   -5
    0.19209154   2    1000037    1000023
    0.1841798   2    1000024    1000035
    0.17413235   2    1000037    1000025
    0.050377027   2    1000024    1000022
    0.041675664   2   -15    16
    0.03651632   2    1000037    1000022
    0.035214484   2    1000024    1000025
    0.029104253   2    1000024    1000023
    0.00041998014   2    4   -5
    0.0002201322   2    1000037    1000035
    0.00014287623   2   -13    14
    9.958553e-05   2    4   -3
    5.0561828e-06   2    2   -3
    4.5157595e-06   2    24    25
    4.1997938e-06   2    2   -5
    2.2788718e-06   2   -1000011    1000012
    2.2788718e-06   2   -1000013    1000014
    1.862487e-13   2    24    36

DECAY 5 -1


DECAY 15 -1


DECAY 23  2.4952


DECAY 24  2.085
