# SUSY Les Houches Accord 2 - MSSM spectrum + Decays
# SPheno v4.0.5be
# W. Porod, Comput. Phys. Commun. 153 (2003) 275-315, hep-ph/0301101;
# W. Porod, F.~Staub, Comput. Phys. Commun. 183 (2012) 2458
#                     arXiv:1104.1573 [hep-ph] 
# in case of problems send email to porod@physik.uni-wuerzburg.de
# Created: 15.03.2021,  09:02
Block SPINFO         # Program information
     1   SPheno      # spectrum calculator
     2   v4.0.5be    # version number
#
Block SPhenoINFO     # SPheno specific information
    1      2         # using 2-loop RGEs
    2      2         # using pole masses for boundary conditions at mZ
Block MODSEL  # Model selection
    1    0    # general MSSM
Block MINPAR  # Input parameters
    3    1.95104049E+01  # tanb at m_Z    
    4   -1.00000000E+00  # Sign(mu)
Block EXTPAR  # non-universal input parameters
    0    3.28090756E+03  # scale for input parameters
    1    7.74238415E+02  # M_1
    2    3.18827314E+02  # M_2
    3    1.02044003E+03  # M_3
   11    7.75807957E+03  # A_t
   12    2.25049099E+02  # A_b
   13   -1.60200288E+03  # A_tau
   23   -2.28259950E+02  # mu
   25    1.86353316E+01  # tan(beta)
   26    2.12904071E+03  # m_A, pole mass
   31    1.00000000E+04  # M_L11
   32    1.00000000E+04  # M_L22
   33    1.00000000E+04  # M_L33
   34    1.00000000E+04  # M_E11
   35    1.00000000E+04  # M_E22
   36    1.00000000E+04  # M_E33
   41    1.00000000E+04  # M_Q11
   42    1.00000000E+04  # M_Q22
   43    2.77870408E+03  # M_Q33
   44    1.00000000E+04  # M_U11
   45    1.00000000E+04  # M_U22
   46    4.09829258E+03  # M_U33
   47    1.00000000E+04  # M_D11
   48    1.00000000E+04  # M_D22
   49    3.77826949E+03  # M_D33
Block SMINPUTS  # SM parameters
         1     1.27908970E+02  # alpha_em^-1(MZ)^MSbar
         2     1.16637870E-05  # G_mu [GeV^-2]
         3     1.18400000E-01  # alpha_s(MZ)^MSbar
         4     9.11876000E+01  # m_Z(pole)
         5     4.18000000E+00  # m_b(m_b), MSbar
         6     1.73200000E+02  # m_t(pole)
         7     1.77700000E+00  # m_tau(pole)
         8     0.00000000E+00  # m_nu_3
        11     5.10998930E-04  # m_e(pole)
        12     0.00000000E+00  # m_nu_1
        13     1.05658372E-01  # m_muon(pole)
        14     0.00000000E+00  # m_nu_2
        21     5.00000000E-03  # m_d(2 GeV), MSbar
        22     2.50000000E-03  # m_u(2 GeV), MSbar
        23     9.50000000E-02  # m_s(2 GeV), MSbar
        24     1.27000000E+00  # m_c(m_c), MSbar
Block gauge Q=  3.28090756E+03  # (SUSY scale)
   1    3.55362975E-01  # g'(Q)^DRbar
   2    6.65198874E-01  # g(Q)^DRbar
   3    1.21977796E+00  # g3(Q)^DRbar
Block Yu Q=  3.28090756E+03  # (SUSY scale)
  1  1     8.39643510E-06   # Y_u(Q)^DRbar
  2  2     4.26538903E-03   # Y_c(Q)^DRbar
  3  3     1.01435680E+00   # Y_t(Q)^DRbar
Block Yd Q=  3.28090756E+03  # (SUSY scale)
  1  1     3.14421553E-04   # Y_d(Q)^DRbar
  2  2     5.97400950E-03   # Y_s(Q)^DRbar
  3  3     3.11807655E-01   # Y_b(Q)^DRbar
Block Ye Q=  3.28090756E+03  # (SUSY scale)
  1  1     5.48688602E-05   # Y_e(Q)^DRbar
  2  2     1.13451401E-02   # Y_mu(Q)^DRbar
  3  3     1.90806592E-01   # Y_tau(Q)^DRbar
Block Au Q=  3.28090756E+03  # (SUSY scale)
  1  1     0.00000000E+00   # A_u(Q)^DRbar
  2  2     0.00000000E+00   # A_c(Q)^DRbar
  3  3     7.75807961E+03   # A_t(Q)^DRbar
Block Ad Q=  3.28090756E+03  # (SUSY scale)
  1  1     0.00000000E+00   # A_d(Q)^DRbar
  2  2     0.00000000E+00   # A_s(Q)^DRbar
  3  3     2.25049101E+02   # A_b(Q)^DRbar
Block Ae Q=  3.28090756E+03  # (SUSY scale)
  1  1     0.00000000E+00   # A_e(Q)^DRbar
  2  2     0.00000000E+00   # A_mu(Q)^DRbar
  3  3    -1.60200289E+03   # A_tau(Q)^DRbar
Block MSOFT Q=  3.28090756E+03  # soft SUSY breaking masses at Q
   1    7.74238415E+02  # M_1
   2    3.18827314E+02  # M_2
   3    1.02044003E+03  # M_3
  21    4.45007104E+06  # M^2_(H,d)
  22    1.10903423E+05  # M^2_(H,u)
  31    1.00000000E+04  # M_(L,11)
  32    1.00000000E+04  # M_(L,22)
  33    1.00000000E+04  # M_(L,33)
  34    1.00000000E+04  # M_(E,11)
  35    1.00000000E+04  # M_(E,22)
  36    1.00000000E+04  # M_(E,33)
  41    1.00000000E+04  # M_(Q,11)
  42    1.00000000E+04  # M_(Q,22)
  43    2.77870408E+03  # M_(Q,33)
  44    1.00000000E+04  # M_(U,11)
  45    1.00000000E+04  # M_(U,22)
  46    4.09829258E+03  # M_(U,33)
  47    1.00000000E+04  # M_(D,11)
  48    1.00000000E+04  # M_(D,22)
  49    3.77826949E+03  # M_(D,33)
Block MASS  # Mass spectrum
#   PDG code      mass          particle
         6     1.73200000E+02  # m_t(pole)
        23     9.11876000E+01  # m_Z(pole)
        24     8.04299946E+01  # W+
        15     1.77700000E+00  # m_tau(pole)
        25     1.30582626E+02  # h0
        35     2.12875065E+03  # H0
        36     2.12904071E+03  # A0
        37     2.13094652E+03  # H+
   1000001     1.01245450E+04  # ~d_L
   2000001     1.00990280E+04  # ~d_R
   1000002     1.01241910E+04  # ~u_L
   2000002     1.01022456E+04  # ~u_R
   1000003     1.01245466E+04  # ~s_L
   2000003     1.00990300E+04  # ~s_R
   1000004     1.01241926E+04  # ~c_L
   2000004     1.01022466E+04  # ~c_R
   1000005     2.74836146E+03  # ~b_1
   2000005     3.81665849E+03  # ~b_2
   1000006     2.72566218E+03  # ~t_1
   2000006     3.94926212E+03  # ~t_2
   1000011     1.00214865E+04  # ~e_L-
   2000011     1.00087745E+04  # ~e_R-
   1000012     1.00207239E+04  # ~nu_eL
   1000013     1.00214918E+04  # ~mu_L-
   2000013     1.00087846E+04  # ~mu_R-
   1000014     1.00207291E+04  # ~nu_muL
   1000015     1.00116888E+04  # ~tau_1-
   2000015     1.00229884E+04  # ~tau_2-
   1000016     1.00222196E+04  # ~nu_tauL
   1000021     1.31099599E+03  # ~g
   1000022     2.17102248E+02  # ~chi_10
   1000023     2.45942947E+02  # ~chi_20
   1000025     3.77359193E+02  # ~chi_30
   1000035     7.83351534E+02  # ~chi_40
   1000024     2.23482380E+02  # ~chi_1+
   1000037     3.78972445E+02  # ~chi_2+
# Higgs mixing
Block alpha # Effective Higgs mixing angle
          -5.14657054E-02   # alpha
Block Hmix Q=  3.28090756E+03  # Higgs mixing parameters
   1   -2.28259950E+02  # mu
   2    1.86353316E+01  # tan[beta](Q)
   3    2.43082324E+02  # v(Q)
   4    4.53281434E+06  # m^2_A(Q)
Block stopmix # stop mixing matrix
   1  1    -9.91665758E-01   # Re[R_st(1,1)]
   1  2     1.28837204E-01   # Re[R_st(1,2)]
   2  1    -1.28837204E-01   # Re[R_st(2,1)]
   2  2    -9.91665758E-01   # Re[R_st(2,2)]
Block sbotmix # sbottom mixing matrix
   1  1    -9.99999128E-01   # Re[R_sb(1,1)]
   1  2     1.32051904E-03   # Re[R_sb(1,2)]
   2  1    -1.32051904E-03   # Re[R_sb(2,1)]
   2  2    -9.99999128E-01   # Re[R_sb(2,2)]
Block staumix # stau mixing matrix
   1  1    -2.04834740E-02   # Re[R_sta(1,1)]
   1  2     9.99790192E-01   # Re[R_sta(1,2)]
   2  1    -9.99790192E-01   # Re[R_sta(2,1)]
   2  2    -2.04834740E-02   # Re[R_sta(2,2)]
Block Nmix # neutralino mixing matrix
   1  1    -4.57284187E-02   # Re[N(1,1)]
   1  2     3.55351125E-01   # Re[N(1,2)]
   1  3     6.94567509E-01   # Re[N(1,3)]
   1  4     6.23867347E-01   # Re[N(1,4)]
   2  1    -3.20317730E-02   # Re[N(2,1)]
   2  2     1.02271810E-01   # Re[N(2,2)]
   2  3    -6.93955585E-01   # Re[N(2,3)]
   2  4     7.11997253E-01   # Re[N(2,4)]
   3  1    -3.32802739E-02   # Re[N(3,1)]
   3  2    -9.29050964E-01   # Re[N(3,2)]
   3  3     1.89077012E-01   # Re[N(3,3)]
   3  4     3.16238223E-01   # Re[N(3,4)]
   4  1    -9.97885415E-01   # Re[N(4,1)]
   4  2     1.14176217E-02   # Re[N(4,2)]
   4  3    -1.58589159E-02   # Re[N(4,3)]
   4  4    -6.19905807E-02   # Re[N(4,4)]
Block Umix # chargino mixing matrix
   1  1    -2.80389096E-01   # Re[U(1,1)]
   1  2    -9.59886428E-01   # Re[U(1,2)]
   2  1     9.59886428E-01   # Re[U(2,1)]
   2  2    -2.80389096E-01   # Re[U(2,2)]
Block Vmix # chargino mixing matrix
   1  1    -4.68203909E-01   # Re[V(1,1)]
   1  2     8.83620450E-01   # Re[V(1,2)]
   2  1     8.83620450E-01   # Re[V(2,1)]
   2  2     4.68203909E-01   # Re[V(2,2)]
DECAY        23     2.49520000E+00   # Z
DECAY        24     2.08500000E+00   # W
DECAY   2000011     4.96784773E+01   # ~e^-_R
#    BR                NDA      ID1      ID2
     2.11486140E-03    2     1000022        11   # BR(~e^-_R -> chi^0_1 e^-)
     1.03742541E-03    2     1000023        11   # BR(~e^-_R -> chi^0_2 e^-)
     1.11803524E-03    2     1000025        11   # BR(~e^-_R -> chi^0_3 e^-)
     9.95729666E-01    2     1000035        11   # BR(~e^-_R -> chi^0_4 e^-)
DECAY   1000011     1.44415611E+02   # ~e^-_L
#    BR                NDA      ID1      ID2
     3.34168024E-02    2     1000022        11   # BR(~e^-_L -> chi^0_1 e^-)
     2.21241846E-03    2     1000023        11   # BR(~e^-_L -> chi^0_2 e^-)
     2.73044048E-01    2     1000025        11   # BR(~e^-_L -> chi^0_3 e^-)
     8.21098108E-02    2     1000035        11   # BR(~e^-_L -> chi^0_4 e^-)
     4.79779117E-02    2    -1000024        12   # BR(~e^-_L -> chi^-_1 nu_e)
     5.61239008E-01    2    -1000037        12   # BR(~e^-_L -> chi^-_2 nu_e)
#    BR                NDA      ID1      ID2       ID3
DECAY   2000013     4.97297268E+01   # ~mu^-_R
#    BR                NDA      ID1      ID2
     2.36106958E-03    2     1000022        13   # BR(~mu^-_R -> chi^0_1 mu^-)
     1.28423807E-03    2     1000023        13   # BR(~mu^-_R -> chi^0_2 mu^-)
     1.13525600E-03    2     1000025        13   # BR(~mu^-_R -> chi^0_3 mu^-)
     9.94704661E-01    2     1000035        13   # BR(~mu^-_R -> chi^0_4 mu^-)
     4.74374879E-04    2    -1000024        14   # BR(~mu^-_R -> chi^-_1 nu_mu)
DECAY   1000013     1.44441319E+02   # ~mu^-_L
#    BR                NDA      ID1      ID2
     3.34964991E-02    2     1000022        13   # BR(~mu^-_L -> chi^0_1 mu^-)
     2.29747710E-03    2     1000023        13   # BR(~mu^-_L -> chi^0_2 mu^-)
     2.73001927E-01    2     1000025        13   # BR(~mu^-_L -> chi^0_3 mu^-)
     8.20952852E-02    2     1000035        13   # BR(~mu^-_L -> chi^0_4 mu^-)
     4.79693977E-02    2    -1000024        14   # BR(~mu^-_L -> chi^-_1 nu_mu)
     5.61139414E-01    2    -1000037        14   # BR(~mu^-_L -> chi^-_2 nu_mu)
#    BR                NDA      ID1      ID2       ID3
DECAY   1000015     6.42170761E+01   # ~tau^-_1
#    BR                NDA      ID1      ID2
     5.90966423E-02    2     1000022        15   # BR(~tau^-_1 -> chi^0_1 tau^-)
     5.41751176E-02    2     1000023        15   # BR(~tau^-_1 -> chi^0_2 tau^-)
     3.18879645E-03    2     1000025        15   # BR(~tau^-_1 -> chi^0_3 tau^-)
     7.70212738E-01    2     1000035        15   # BR(~tau^-_1 -> chi^0_4 tau^-)
     1.08276420E-01    2    -1000024        16   # BR(~tau^-_1 -> chi^-_1 nu_tau)
     5.05028619E-03    2    -1000037        16   # BR(~tau^-_1 -> chi^-_2 nu_tau)
DECAY   2000015     1.51651233E+02   # ~tau^-_2
#    BR                NDA      ID1      ID2
     5.36129788E-02    2     1000022        15   # BR(~tau^-_2 -> chi^0_1 tau^-)
     2.55317166E-02    2     1000023        15   # BR(~tau^-_2 -> chi^0_2 tau^-)
     2.62483125E-01    2     1000025        15   # BR(~tau^-_2 -> chi^0_3 tau^-)
     7.83617721E-02    2     1000035        15   # BR(~tau^-_2 -> chi^0_4 tau^-)
     4.38570703E-02    2    -1000024        16   # BR(~tau^-_2 -> chi^-_1 nu_tau)
     5.36153337E-01    2    -1000037        16   # BR(~tau^-_2 -> chi^-_2 nu_tau)
#    BR                NDA      ID1      ID2       ID3
DECAY   1000012     1.44421028E+02   # ~nu_e
#    BR                NDA      ID1      ID2
     4.40076968E-02    2     1000022        12   # BR(~nu_e -> chi^0_1 nu_e)
     4.34749976E-03    2     1000023        12   # BR(~nu_e -> chi^0_2 nu_e)
     2.52892063E-01    2     1000025        12   # BR(~nu_e -> chi^0_3 nu_e)
     8.94452062E-02    2     1000035        12   # BR(~nu_e -> chi^0_4 nu_e)
     1.33764163E-01    2     1000024        11   # BR(~nu_e -> chi^+_1 e^-)
     4.75543372E-01    2     1000037        11   # BR(~nu_e -> chi^+_2 e^-)
#    BR                NDA      ID1      ID2       ID3
DECAY   1000014     1.44446733E+02   # ~nu_mu
#    BR                NDA      ID1      ID2
     4.39998883E-02    2     1000022        14   # BR(~nu_mu -> chi^0_1 nu_mu)
     4.34672836E-03    2     1000023        14   # BR(~nu_mu -> chi^0_2 nu_mu)
     2.52847191E-01    2     1000025        14   # BR(~nu_mu -> chi^0_3 nu_mu)
     8.94293365E-02    2     1000035        14   # BR(~nu_mu -> chi^0_4 nu_mu)
     1.33903941E-01    2     1000024        13   # BR(~nu_mu -> chi^+_1 mu^-)
     4.75472915E-01    2     1000037        13   # BR(~nu_mu -> chi^+_2 mu^-)
#    BR                NDA      ID1      ID2       ID3
DECAY   1000016     1.51693521E+02   # ~nu_tau
#    BR                NDA      ID1      ID2
     4.19041446E-02    2     1000022        16   # BR(~nu_tau -> chi^0_1 nu_tau)
     4.13969115E-03    2     1000023        16   # BR(~nu_tau -> chi^0_2 nu_tau)
     2.40804049E-01    2     1000025        16   # BR(~nu_tau -> chi^0_3 nu_tau)
     8.51700460E-02    2     1000035        16   # BR(~nu_tau -> chi^0_4 nu_tau)
     1.71418978E-01    2     1000024        15   # BR(~nu_tau -> chi^+_1 tau^-)
     4.56563091E-01    2     1000037        15   # BR(~nu_tau -> chi^+_2 tau^-)
#    BR                NDA      ID1      ID2       ID3
DECAY   2000001     7.76080525E+02   # ~d_R
#    BR                NDA      ID1      ID2
     7.14750310E-03    2     1000035         1   # BR(~d_R -> chi^0_4 d)
     9.92821799E-01    2     1000021         1   # BR(~d_R -> ~g d)
DECAY   1000001     9.07325989E+02   # ~d_L
#    BR                NDA      ID1      ID2
     6.48352814E-03    2     1000022         1   # BR(~d_L -> chi^0_1 d)
     5.71957389E-04    2     1000023         1   # BR(~d_L -> chi^0_2 d)
     4.17377027E-02    2     1000025         1   # BR(~d_L -> chi^0_3 d)
     1.73560235E-03    2     1000035         1   # BR(~d_L -> chi^0_4 d)
     7.71514787E-03    2    -1000024         2   # BR(~d_L -> chi^-_1 u)
     9.02541546E-02    2    -1000037         2   # BR(~d_L -> chi^-_2 u)
     8.51501907E-01    2     1000021         1   # BR(~d_L -> ~g d)
DECAY   2000003     7.76094974E+02   # ~s_R
#    BR                NDA      ID1      ID2
     7.14737374E-03    2     1000035         3   # BR(~s_R -> chi^0_4 s)
     9.92803525E-01    2     1000021         3   # BR(~s_R -> ~g s)
DECAY   1000003     9.07336960E+02   # ~s_L
#    BR                NDA      ID1      ID2
     6.48725904E-03    2     1000022         3   # BR(~s_L -> chi^0_1 s)
     5.75750735E-04    2     1000023         3   # BR(~s_L -> chi^0_2 s)
     4.17374859E-02    2     1000025         3   # BR(~s_L -> chi^0_3 s)
     1.73558359E-03    2     1000035         3   # BR(~s_L -> chi^0_4 s)
     7.71820395E-03    2    -1000024         4   # BR(~s_L -> chi^-_1 c)
     9.02539629E-02    2    -1000037         4   # BR(~s_L -> chi^-_2 c)
     8.51491754E-01    2     1000021         3   # BR(~s_L -> ~g s)
DECAY   1000005     2.24968000E+02   # ~b_1
#    BR                NDA      ID1      ID2
     1.83029442E-02    2     1000022         5   # BR(~b_1 -> chi^0_1 b)
     1.18055966E-02    2     1000023         5   # BR(~b_1 -> chi^0_2 b)
     4.49029072E-02    2     1000025         5   # BR(~b_1 -> chi^0_3 b)
     1.62750691E-03    2     1000035         5   # BR(~b_1 -> chi^0_4 b)
     1.98613260E-01    2    -1000024         6   # BR(~b_1 -> chi^-_1 t)
     1.49359084E-01    2    -1000037         6   # BR(~b_1 -> chi^-_2 t)
     5.75388701E-01    2     1000021         5   # BR(~b_1 -> ~g b)
DECAY   2000005     2.50957463E+02   # ~b_2
#    BR                NDA      ID1      ID2
     1.40864338E-02    2     1000022         5   # BR(~b_2 -> chi^0_1 b)
     1.40668202E-02    2     1000023         5   # BR(~b_2 -> chi^0_2 b)
     1.06033292E-03    2     1000025         5   # BR(~b_2 -> chi^0_3 b)
     7.76498971E-03    2     1000035         5   # BR(~b_2 -> chi^0_4 b)
     2.67637464E-02    2    -1000024         6   # BR(~b_2 -> chi^-_1 t)
     2.30190658E-03    2    -1000037         6   # BR(~b_2 -> chi^-_2 t)
     9.33883401E-01    2     1000021         5   # BR(~b_2 -> ~g b)
DECAY   2000002     7.93062541E+02   # ~u_R
#    BR                NDA      ID1      ID2
     2.79869381E-02    2     1000035         2   # BR(~u_R -> chi^0_4 u)
     9.71893060E-01    2     1000021         2   # BR(~u_R -> ~g u)
DECAY   1000002     9.07317468E+02   # ~u_L
#    BR                NDA      ID1      ID2
     5.91540409E-03    2     1000022         2   # BR(~u_L -> chi^0_1 u)
     4.57463190E-04    2     1000023         2   # BR(~u_L -> chi^0_2 u)
     4.28152813E-02    2     1000025         2   # BR(~u_L -> chi^0_3 u)
     1.34173059E-03    2     1000035         2   # BR(~u_L -> chi^0_4 u)
     2.15120280E-02    2     1000024         1   # BR(~u_L -> chi^+_1 d)
     7.64799922E-02    2     1000037         1   # BR(~u_L -> chi^+_2 d)
     8.51478101E-01    2     1000021         2   # BR(~u_L -> ~g u)
DECAY   2000004     7.93069897E+02   # ~c_R
#    BR                NDA      ID1      ID2
     2.79866987E-02    2     1000035         4   # BR(~c_R -> chi^0_4 c)
     9.71884110E-01    2     1000021         4   # BR(~c_R -> ~g c)
DECAY   1000004     9.07328408E+02   # ~c_L
#    BR                NDA      ID1      ID2
     5.91690278E-03    2     1000022         4   # BR(~c_L -> chi^0_1 c)
     4.59502278E-04    2     1000023         4   # BR(~c_L -> chi^0_2 c)
     4.28151757E-02    2     1000025         4   # BR(~c_L -> chi^0_3 c)
     1.34172972E-03    2     1000035         4   # BR(~c_L -> chi^0_4 c)
     2.15190451E-02    2     1000024         3   # BR(~c_L -> chi^+_1 s)
     7.64797008E-02    2     1000037         3   # BR(~c_L -> chi^+_2 s)
     8.51467944E-01    2     1000021         4   # BR(~c_L -> ~g c)
DECAY   1000006     2.18766540E+02   # ~t_1
#    BR                NDA      ID1      ID2
     9.63121415E-02    2     1000022         6   # BR(~t_1 -> chi^0_1 t)
     1.24325666E-01    2     1000023         6   # BR(~t_1 -> chi^0_2 t)
     7.89017597E-02    2     1000025         6   # BR(~t_1 -> chi^0_3 t)
     3.17232346E-03    2     1000035         6   # BR(~t_1 -> chi^0_4 t)
     3.06947918E-02    2     1000024         5   # BR(~t_1 -> chi^+_1 b)
     1.00665432E-01    2     1000037         5   # BR(~t_1 -> chi^+_2 b)
     3.61966335E-04    2     1000021         4   # BR(~t_1 -> ~g c)
     5.61393595E-01    2     1000021         6   # BR(~t_1 -> ~g t)
#    BR                NDA      ID1      ID2       ID3
     4.16794417E-03    3     1000022        24         5   # BR(~t_1 -> chi^0_1 W^+ b)
DECAY   2000006     6.34637491E+02   # ~t_2
#    BR                NDA      ID1      ID2
     5.26363891E-02    2     1000022         6   # BR(~t_2 -> chi^0_1 t)
     6.50110321E-02    2     1000023         6   # BR(~t_2 -> chi^0_2 t)
     8.57986982E-03    2     1000025         6   # BR(~t_2 -> chi^0_3 t)
     1.25961996E-02    2     1000035         6   # BR(~t_2 -> chi^0_4 t)
     1.06336411E-01    2     1000024         5   # BR(~t_2 -> chi^+_1 b)
     1.90003703E-02    2     1000037         5   # BR(~t_2 -> chi^+_2 b)
     3.90255076E-01    2     1000021         6   # BR(~t_2 -> ~g t)
     1.49291857E-01    2     1000005        24   # BR(~t_2 -> ~b_1 W^+)
     7.67333934E-02    2     1000006        23   # BR(~t_2 -> ~t_1 Z)
     1.19559401E-01    2     1000006        25   # BR(~t_2 -> ~t_1 h^0)
DECAY   1000024     1.65827185E-08   # chi^+_1
#    BR                NDA      ID1      ID2       ID3
     3.67427420E-01    3     1000022        -1         2   # BR(chi^+_1 -> chi^0_1 d_bar u)
     3.03277300E-01    3     1000022        -3         4   # BR(chi^+_1 -> chi^0_1 s_bar c)
     1.22475894E-01    3     1000022       -11        12   # BR(chi^+_1 -> chi^0_1 e^+ nu_e)
     1.22308247E-01    3     1000022       -13        14   # BR(chi^+_1 -> chi^0_1 mu^+ nu_mu)
     8.45111391E-02    3     1000022       -15        16   # BR(chi^+_1 -> chi^0_1 tau^+ nu_tau)
DECAY   1000037     1.67799795E+00   # chi^+_2
#    BR                NDA      ID1      ID2
     2.55821861E-01    2     1000022        24   # BR(chi^+_2 -> chi^0_1 W^+)
     4.27045177E-01    2     1000023        24   # BR(chi^+_2 -> chi^0_2 W^+)
     2.17216497E-01    2     1000024        23   # BR(chi^+_2 -> chi^+_1 Z)
     9.99164448E-02    2     1000024        25   # BR(chi^+_2 -> chi^+_1 h^0)
#    BR                NDA      ID1      ID2       ID3
DECAY   1000022     0.00000000E+00   # chi^0_1
DECAY   1000023     9.56512931E-05   # chi^0_2
#    BR                NDA      ID1      ID2
     3.62048488E-02    2     1000022        22   # BR(chi^0_2 -> chi^0_1 photon)
#    BR                NDA      ID1      ID2       ID3
     6.78603899E-02    3     1000022         2        -2   # BR(chi^0_2 -> chi^0_1 u u_bar)
     6.61846813E-02    3     1000022         4        -4   # BR(chi^0_2 -> chi^0_1 c c_bar)
     8.70096566E-02    3     1000022         1        -1   # BR(chi^0_2 -> chi^0_1 d d_bar)
     8.69991746E-02    3     1000022         3        -3   # BR(chi^0_2 -> chi^0_1 s s_bar)
     6.88711679E-02    3     1000022         5        -5   # BR(chi^0_2 -> chi^0_1 b b_bar)
     1.96356378E-02    3     1000022        11       -11   # BR(chi^0_2 -> chi^0_1 e^- e^+)
     1.96318905E-02    3     1000022        13       -13   # BR(chi^0_2 -> chi^0_1 mu^- mu^+)
     1.86112312E-02    3     1000022        15       -15   # BR(chi^0_2 -> chi^0_1 tau^- tau^+)
     1.16358258E-01    3     1000022        12       -12   # BR(chi^0_2 -> chi^0_1 nu_e nu_bar_e)
     6.93471907E-02    3     1000024         1        -2   # BR(chi^0_2 -> chi^+_1 d u_bar)
     6.93471907E-02    3    -1000024        -1         2   # BR(chi^0_2 -> chi^-_1 d_bar u)
     6.82967762E-02    3     1000024         3        -4   # BR(chi^0_2 -> chi^+_1 s c_bar)
     6.82967762E-02    3    -1000024        -3         4   # BR(chi^0_2 -> chi^-_1 s_bar c)
     2.31157570E-02    3     1000024        11       -12   # BR(chi^0_2 -> chi^+_1 e^- nu_bar_e)
     2.31157570E-02    3    -1000024       -11        12   # BR(chi^0_2 -> chi^-_1 e^+ nu_e)
     2.31140801E-02    3     1000024        13       -14   # BR(chi^0_2 -> chi^+_1 mu^- nu_bar_mu)
     2.31140801E-02    3    -1000024       -13        14   # BR(chi^0_2 -> chi^-_1 mu^+ nu_mu)
     2.24427278E-02    3     1000024        15       -16   # BR(chi^0_2 -> chi^+_1 tau^- nu_bar_tau)
     2.24427278E-02    3    -1000024       -15        16   # BR(chi^0_2 -> chi^-_1 tau^+ nu_tau)
DECAY   1000025     1.83441492E+00   # chi^0_3
#    BR                NDA      ID1      ID2
     2.75685108E-01    2     1000024       -24   # BR(chi^0_3 -> chi^+_1 W^-)
     2.75685108E-01    2    -1000024        24   # BR(chi^0_3 -> chi^-_1 W^+)
     1.69738884E-02    2     1000022        23   # BR(chi^0_3 -> chi^0_1 Z)
     3.29628149E-01    2     1000023        23   # BR(chi^0_3 -> chi^0_2 Z)
     7.10083411E-02    2     1000022        25   # BR(chi^0_3 -> chi^0_1 h^0)
     3.09749194E-02    2     1000023        25   # BR(chi^0_3 -> chi^0_2 h^0)
#    BR                NDA      ID1      ID2       ID3
DECAY   1000035     2.17064340E+00   # chi^0_4
#    BR                NDA      ID1      ID2
     1.35566139E-01    2     1000024       -24   # BR(chi^0_4 -> chi^+_1 W^-)
     1.35566139E-01    2    -1000024        24   # BR(chi^0_4 -> chi^-_1 W^+)
     7.38604926E-02    2     1000037       -24   # BR(chi^0_4 -> chi^+_2 W^-)
     7.38604926E-02    2    -1000037        24   # BR(chi^0_4 -> chi^-_2 W^+)
     4.64921938E-02    2     1000022        23   # BR(chi^0_4 -> chi^0_1 Z)
     1.72831061E-01    2     1000023        23   # BR(chi^0_4 -> chi^0_2 Z)
     9.99921875E-03    2     1000025        23   # BR(chi^0_4 -> chi^0_3 Z)
     9.97648560E-02    2     1000022        25   # BR(chi^0_4 -> chi^0_1 h^0)
     1.86593197E-01    2     1000023        25   # BR(chi^0_4 -> chi^0_2 h^0)
     6.14946727E-02    2     1000025        25   # BR(chi^0_4 -> chi^0_3 h^0)
#    BR                NDA      ID1      ID2       ID3
     2.98228797E-04    3     1000022         6        -6   # BR(chi^0_4 -> chi^0_1 t t_bar)
     3.79425092E-04    3     1000023         6        -6   # BR(chi^0_4 -> chi^0_2 t t_bar)
     1.25429663E-03    3     1000024         5        -6   # BR(chi^0_4 -> chi^+_1 b t_bar)
     1.25429663E-03    3    -1000024        -5         6   # BR(chi^0_4 -> chi^-_1 b_bar t)
     3.84917708E-04    3     1000037         5        -6   # BR(chi^0_4 -> chi^+_2 b t_bar)
     3.84917708E-04    3    -1000037        -5         6   # BR(chi^0_4 -> chi^-_2 b_bar t)
DECAY   1000021     4.58453724E-03   # ~g
#    BR                NDA      ID1      ID2
     1.09635386E-02    2     1000022        21   # BR(~g -> chi^0_1 g)
     1.30190110E-02    2     1000023        21   # BR(~g -> chi^0_2 g)
     2.56644817E-03    2     1000025        21   # BR(~g -> chi^0_3 g)
#    BR                NDA      ID1      ID2       ID3
     1.11280864E-01    3     1000022         6        -6   # BR(~g -> chi^0_1 t t_bar)
     2.76820848E-02    3     1000022         5        -5   # BR(~g -> chi^0_1 b b_bar)
     1.57352119E-01    3     1000023         6        -6   # BR(~g -> chi^0_2 t t_bar)
     1.84875874E-02    3     1000023         5        -5   # BR(~g -> chi^0_2 b b_bar)
     1.83648045E-04    3     1000025         2        -2   # BR(~g -> chi^0_3 u u_bar)
     1.83655672E-04    3     1000025         4        -4   # BR(~g -> chi^0_3 c c_bar)
     8.32862386E-02    3     1000025         6        -6   # BR(~g -> chi^0_3 t t_bar)
     1.78909930E-04    3     1000025         1        -1   # BR(~g -> chi^0_3 d d_bar)
     1.78912493E-04    3     1000025         3        -3   # BR(~g -> chi^0_3 s s_bar)
     4.13423863E-02    3     1000025         5        -5   # BR(~g -> chi^0_3 b b_bar)
     3.58094975E-04    3     1000035         6        -6   # BR(~g -> chi^0_4 t t_bar)
     4.49510892E-04    3     1000035         5        -5   # BR(~g -> chi^0_4 b b_bar)
     1.34112058E-01    3     1000024         5        -6   # BR(~g -> chi^+_1 b t_bar)
     1.34112058E-01    3    -1000024        -5         6   # BR(~g -> chi^-_1 b_bar t)
     3.55428895E-04    3     1000037         1        -2   # BR(~g -> chi^+_2 d u_bar)
     3.55428895E-04    3    -1000037        -1         2   # BR(~g -> chi^-_2 d_bar u)
     3.55440188E-04    3     1000037         3        -4   # BR(~g -> chi^+_2 s c_bar)
     3.55440188E-04    3    -1000037        -3         4   # BR(~g -> chi^-_2 s_bar c)
     1.31140362E-01    3     1000037         5        -6   # BR(~g -> chi^+_2 b t_bar)
     1.31140362E-01    3    -1000037        -5         6   # BR(~g -> chi^-_2 b_bar t)
DECAY        25     4.34076588E-03   # Gamma(h0)
     2.51565274E-03   2        22        22   # BR(h0 -> photon photon)
     2.13051764E-03   2        22        23   # BR(h0 -> photon Z)
     4.80333856E-02   2        23        23   # BR(h0 -> Z Z)
     3.59234996E-01   2       -24        24   # BR(h0 -> W W)
     7.35060967E-02   2        21        21   # BR(h0 -> gluon gluon)
     3.99465788E-09   2       -11        11   # BR(h0 -> Electron electron)
     1.77691880E-04   2       -13        13   # BR(h0 -> Muon muon)
     5.12403534E-02   2       -15        15   # BR(h0 -> Tau tau)
     1.11953660E-07   2        -2         2   # BR(h0 -> Up up)
     2.17315933E-02   2        -4         4   # BR(h0 -> Charm charm)
     4.58775829E-07   2        -1         1   # BR(h0 -> Down down)
     1.65928788E-04   2        -3         3   # BR(h0 -> Strange strange)
     4.41263209E-01   2        -5         5   # BR(h0 -> Bottom bottom)
DECAY        35     3.59350940E+01   # Gamma(HH)
     9.15001586E-08   2        22        22   # BR(HH -> photon photon)
     3.41213015E-07   2        22        23   # BR(HH -> photon Z)
     4.14160785E-06   2        23        23   # BR(HH -> Z Z)
     2.00809318E-06   2       -24        24   # BR(HH -> W W)
     2.41331929E-06   2        21        21   # BR(HH -> gluon gluon)
     3.05327154E-09   2       -11        11   # BR(HH -> Electron electron)
     1.35931517E-04   2       -13        13   # BR(HH -> Muon muon)
     3.92565279E-02   2       -15        15   # BR(HH -> Tau tau)
     3.49262527E-13   2        -2         2   # BR(HH -> Up up)
     6.77471986E-08   2        -4         4   # BR(HH -> Charm charm)
     5.00222102E-03   2        -6         6   # BR(HH -> Top top)
     2.34561752E-07   2        -1         1   # BR(HH -> Down down)
     8.48441680E-05   2        -3         3   # BR(HH -> Strange strange)
     2.30174759E-01   2        -5         5   # BR(HH -> Bottom bottom)
     1.15525287E-01   2  -1000024   1000024   # BR(HH -> Chargino1 chargino1)
     1.49111490E-01   2  -1000024   1000037   # BR(HH -> Chargino1 chargino2)
     1.49111490E-01   2  -1000037   1000024   # BR(HH -> Chargino2 chargino1)
     3.69687446E-02   2  -1000037   1000037   # BR(HH -> Chargino2 chargino2)
     4.17753472E-02   2   1000022   1000022   # BR(HH -> neutralino1 neutralino1)
     8.12220030E-03   2   1000022   1000023   # BR(HH -> neutralino1 neutralino2)
     6.41449497E-02   2   1000022   1000025   # BR(HH -> neutralino1 neutralino3)
     2.40581101E-02   2   1000022   1000035   # BR(HH -> neutralino1 neutralino4)
     3.02844953E-03   2   1000023   1000023   # BR(HH -> neutralino2 neutralino2)
     8.75337673E-02   2   1000023   1000025   # BR(HH -> neutralino2 neutralino3)
     2.48686967E-02   2   1000023   1000035   # BR(HH -> neutralino2 neutralino4)
     1.80258129E-02   2   1000025   1000025   # BR(HH -> neutralino3 neutralino3)
     3.02207322E-03   2   1000025   1000035   # BR(HH -> neutralino3 neutralino4)
     1.50023050E-05   2   1000035   1000035   # BR(HH -> neutralino4 neutralino4)
     2.49945096E-05   2        25        25   # BR(HH -> h0 h0)
DECAY        36     3.55633142E+01   # Gamma(A0)
     2.57174861E-08   2        22        22   # BR(A0 -> photon photon)
     2.45428268E-07   2        22        23   # BR(A0 -> photon Z)
     1.78938001E-05   2        21        21   # BR(A0 -> gluon gluon)
     2.96683589E-09   2       -11        11   # BR(A0 -> Electron electron)
     1.32083552E-04   2       -13        13   # BR(A0 -> Muon muon)
     3.81453662E-02   2       -15        15   # BR(A0 -> Tau tau)
     3.31884197E-13   2        -2         2   # BR(A0 -> Up up)
     6.43706286E-08   2        -4         4   # BR(A0 -> Charm charm)
     4.89297921E-03   2        -6         6   # BR(A0 -> Top top)
     2.27917592E-07   2        -1         1   # BR(A0 -> Down down)
     8.24409018E-05   2        -3         3   # BR(A0 -> Strange strange)
     2.23657372E-01   2        -5         5   # BR(A0 -> Bottom bottom)
     1.08158136E-01   2  -1000024   1000024   # BR(A0 -> Chargino1 chargino1)
     1.59149535E-01   2  -1000024   1000037   # BR(A0 -> Chargino1 chargino2)
     1.59149535E-01   2  -1000037   1000024   # BR(A0 -> Chargino2 chargino1)
     2.90846697E-02   2  -1000037   1000037   # BR(A0 -> Chargino2 chargino2)
     3.65625910E-02   2   1000022   1000022   # BR(A0 -> neutralino1 neutralino1)
     1.14754808E-02   2   1000022   1000023   # BR(A0 -> neutralino1 neutralino2)
     5.92343417E-02   2   1000022   1000025   # BR(A0 -> neutralino1 neutralino3)
     2.41488037E-02   2   1000022   1000035   # BR(A0 -> neutralino1 neutralino4)
     3.97811415E-03   2   1000023   1000023   # BR(A0 -> neutralino2 neutralino2)
     9.90935046E-02   2   1000023   1000025   # BR(A0 -> neutralino2 neutralino3)
     2.55647942E-02   2   1000023   1000035   # BR(A0 -> neutralino2 neutralino4)
     1.46741549E-02   2   1000025   1000025   # BR(A0 -> neutralino3 neutralino3)
     2.77798858E-03   2   1000025   1000035   # BR(A0 -> neutralino3 neutralino4)
     1.39174827E-05   2   1000035   1000035   # BR(A0 -> neutralino4 neutralino4)
     5.73002388E-06   2        23        25   # BR(A0 -> Z h0)
     1.29266216E-38   2        25        25   # BR(A0 -> h0 h0)
DECAY        37     3.73305063E+01   # Gamma(Hp)
     3.59336970E-09   2       -11        12   # BR(Hp -> Electron nu_e)
     1.53627777E-04   2       -13        14   # BR(Hp -> Muon nu_mu)
     4.34546415E-02   2       -15        16   # BR(Hp -> Tau nu_tau)
     2.39502642E-07   2        -1         2   # BR(Hp -> Down up)
     4.02670360E-06   2        -3         2   # BR(Hp -> Strange up)
     2.68269499E-06   2        -5         2   # BR(Hp -> Bottom up)
     1.48022320E-08   2        -1         4   # BR(Hp -> Down charm)
     8.63957658E-05   2        -3         4   # BR(Hp -> Strange charm)
     3.75673268E-04   2        -5         4   # BR(Hp -> Bottom charm)
     3.98031054E-07   2        -1         6   # BR(Hp -> Down top)
     8.80483941E-06   2        -3         6   # BR(Hp -> Strange top)
     2.58745794E-01   2        -5         6   # BR(Hp -> Bottom top)
     3.76840685E-04   2   1000022   1000024   # BR(Hp -> neutralino1 chargino1)
     2.34523042E-01   2   1000022   1000037   # BR(Hp -> neutralino1 chargino2)
     3.60610277E-02   2   1000023   1000024   # BR(Hp -> neutralino2 chargino1)
     1.72766801E-01   2   1000023   1000037   # BR(Hp -> neutralino2 chargino2)
     2.07080744E-01   2   1000024   1000025   # BR(Hp -> chargino1 neutralino3)
     1.70591926E-05   2   1000025   1000037   # BR(Hp -> neutralino3 chargino2)
     4.06254653E-02   2   1000024   1000035   # BR(Hp -> chargino1 neutralino4)
     5.71123765E-03   2   1000035   1000037   # BR(Hp -> neutralino4 chargino2)
     5.48040209E-06   2        24        25   # BR(Hp -> W h0)
     1.86069442E-12   2        24        35   # BR(Hp -> W HH)
     9.16386687E-13   2        24        36   # BR(Hp -> W A0)
DECAY         6     2.43000000E+00   # top
#    BR                NDA      ID1      ID2
     1.00000000E+00    2           5        24   # BR(t -> b W)
Block HiggsBoundsInputHiggsCouplingsFermions
# ScalarNormEffCoupSq PseudoSNormEffCoupSq NP IP1 IP2 IP2
    9.21669918E-01    0.00000000E+00        3  25   5   5  # h0-b-b eff. coupling^2, normalised to SM
    3.47353914E+02    0.00000000E+00        3  35   5   5  # H0-b-b eff. coupling^2, normalised to SM
    0.00000000E+00    3.47275584E+02        3  36   5   5  # A0-b-b eff. coupling^2, normalised to SM
#
    1.00022556E+00    0.00000000E+00        3  25   6   6  # h0-t-t eff. coupling^2, normalised to SM
    2.65400149E-03    0.00000000E+00        3  35   6   6  # H0-t-t eff. coupling^2, normalised to SM
    0.00000000E+00    2.87955747E-03        3  36   6   6  # A0-t-t eff. coupling^2, normalised to SM
#
    9.21669918E-01    0.00000000E+00        3  25  15  15  # h0-tau-tau eff. coupling^2, normalised to SM
    3.47353914E+02    0.00000000E+00        3  35  15  15  # H0-tau-tau eff. coupling^2, normalised to SM
    0.00000000E+00    3.47275584E+02        3  36  15  15  # A0-tau-tau eff. coupling^2, normalised to SM
#
Block HiggsBoundsInputHiggsCouplingsBosons
    9.99995402E-01        3  25  24  24  # h0-W-W eff. coupling^2, normalised to SM
    4.59837786E-06        3  35  24  24  # H0-W-W eff. coupling^2, normalised to SM
    0.00000000E+00        3  36  24  24  # A0-W-W eff. coupling^2, normalised to SM
#
    9.99995402E-01        3  25  23  23  # h0-Z-Z eff. coupling^2, normalised to SM
    4.59837786E-06        3  35  23  23  # H0-Z-Z eff. coupling^2, normalised to SM
    0.00000000E+00        3  36  23  23  # A0-Z-Z eff. coupling^2, normalised to SM
#
    1.26149389E+00        3  25  21  21  # h0-g-g eff. coupling^2, normalised to SM
    1.41164980E-03        3  35  21  21  # H0-g-g eff. coupling^2, normalised to SM
    9.97424983E-02        3  36  21  21  # A0-g-g eff. coupling^2, normalised to SM
#
    0.00000000E+00        3  25  25  23  # h0-h0-Z eff. coupling^2, normalised to SM
    0.00000000E+00        3  35  25  23  # H0-h0-Z eff. coupling^2, normalised to SM
    4.59837786E-06        3  36  25  23  # A0-h0-Z eff. coupling^2, normalised to SM
    0.00000000E+00        3  35  35  23  # H0-H0-Z eff. coupling^2, normalised to SM
    9.99995402E-01        3  36  35  23  # A0-H0-Z eff. coupling^2, normalised to SM
    0.00000000E+00        3  36  36  23  # A0-A0-Z eff. coupling^2, normalised to SM
#
    0.00000000E+00        4  25  21  21  23  # h0-g-g-Z eff. coupling^2, normalised to SM
    0.00000000E+00        4  35  21  21  23  # H0-g-g-Z eff. coupling^2, normalised to SM
    0.00000000E+00        4  36  21  21  23  # A0-g-g-Z eff. coupling^2, normalised to SM
Block SPhenoLowEnergy  # low energy observables
    1    3.17561306E-04   # BR(b -> s gamma)
    2    1.59132910E-06   # BR(b -> s mu+ mu-)
    3    3.52660997E-05   # BR(b -> s nu nu)
    4    3.45837950E-15   # BR(Bd -> e+ e-)
    5    1.47737610E-10   # BR(Bd -> mu+ mu-)
    6    3.09017738E-08   # BR(Bd -> tau+ tau-)
    7    1.17589070E-13   # BR(Bs -> e+ e-)
    8    5.02338632E-09   # BR(Bs -> mu+ mu-)
    9    1.06461022E-06   # BR(Bs -> tau+ tau-)
   10    9.63233715E-05   # BR(B_u -> tau nu)
   11    9.94983550E-01   # BR(B_u -> tau nu)/BR(B_u -> tau nu)_SM
   12    5.42014333E-01   # |Delta(M_Bd)| [ps^-1] 
   13    1.93648763E+01   # |Delta(M_Bs)| [ps^-1] 
   14    0.00000000E+00   # neutron EDM according to the chiral quark model
   15    0.00000000E+00   # neutron EDM according to the relativistic quark-parton model
   16    2.15751575E-03   # epsilon_K
   17    2.28166067E-15   # Delta(M_K)
   18    2.48152657E-11   # BR(K^0 -> pi^0 nu nu)
   19    8.29394240E-11   # BR(K^+ -> pi^+ nu nu)
   20   -1.27672607E-16   # Delta(g-2)_electron/2
   21   -5.45841558E-12   # Delta(g-2)_muon/2
   22   -1.54478017E-09   # Delta(g-2)_tau/2
   23    0.00000000E+00   # electric dipole moment of the electron
   24    0.00000000E+00   # electric dipole moment of the muon
   25    0.00000000E+00   # electric dipole moment of the tau
   26    0.00000000E+00   # Br(mu -> e gamma)
   27    0.00000000E+00   # Br(tau -> e gamma)
   28    0.00000000E+00   # Br(tau -> mu gamma)
   29    0.00000000E+00   # Br(mu -> 3 e)
   30    0.00000000E+00   # Br(tau -> 3 e)
   31    0.00000000E+00   # Br(tau -> 3 mu)
   39    6.35275561E-05   # Delta(rho_parameter)
   40    0.00000000E+00   # BR(Z -> e mu)
   41    0.00000000E+00   # BR(Z -> e tau)
   42    0.00000000E+00   # BR(Z -> mu tau)
Block FWCOEF Q=  1.60000000E+02  # Wilson coefficients at scale Q
#    id        order  M        value         comment
     0305 4422   00   0    -1.88819110E-01   # C7
     0305 4422   00   2    -1.84793831E-01   # C7
     0305 4322   00   2    -1.80054129E-04   # C7'
     0305 6421   00   0    -9.52278348E-02   # C8
     0305 6421   00   2    -9.72209598E-02   # C8
     0305 6321   00   2    -2.21647844E-04   # C8'
 03051111 4133   00   0     1.61943860E+00   # C9 e+e-
 03051111 4133   00   2     1.61999753E+00   # C9 e+e-
 03051111 4233   00   2     1.32798323E-04   # C9' e+e-
 03051111 4137   00   0    -4.44213070E+00   # C10 e+e-
 03051111 4137   00   2    -4.44181576E+00   # C10 e+e-
 03051111 4237   00   2    -9.92352704E-04   # C10' e+e-
 03051313 4133   00   0     1.61943860E+00   # C9 mu+mu-
 03051313 4133   00   2     1.61999749E+00   # C9 mu+mu-
 03051313 4233   00   2     1.32798257E-04   # C9' mu+mu-
 03051313 4137   00   0    -4.44213070E+00   # C10 mu+mu-
 03051313 4137   00   2    -4.44181580E+00   # C10 mu+mu-
 03051313 4237   00   2    -9.92352671E-04   # C10' mu+mu-
 03051212 4137   00   0     1.50535012E+00   # C11 nu_1 nu_1
 03051212 4137   00   2     1.50528522E+00   # C11 nu_1 nu_1
 03051212 4237   00   2     2.14933589E-04   # C11' nu_1 nu_1
 03051414 4137   00   0     1.50535012E+00   # C11 nu_2 nu_2
 03051414 4137   00   2     1.50528522E+00   # C11 nu_2 nu_2
 03051414 4237   00   2     2.14933601E-04   # C11' nu_2 nu_2
 03051616 4137   00   0     1.50535012E+00   # C11 nu_3 nu_3
 03051616 4137   00   2     1.50528522E+00   # C11 nu_3 nu_3
 03051616 4237   00   2     2.14937127E-04   # C11' nu_3 nu_3
Block IMFWCOEF Q=  1.60000000E+02  # Im(Wilson coefficients) at scale Q
#    id        order  M        value         comment
     0305 4422   00   0     3.85830559E-07   # C7
     0305 4422   00   2    -1.73274085E-05   # C7
     0305 4322   00   2     8.63518227E-07   # C7'
     0305 6421   00   0     3.30489390E-07   # C8
     0305 6421   00   2     4.47535239E-05   # C8
     0305 6321   00   2     1.18301335E-06   # C8'
 03051111 4133   00   2     1.96475781E-06   # C9 e+e-
 03051111 4233   00   2     2.66707480E-06   # C9' e+e-
 03051111 4137   00   2     8.95239861E-06   # C10 e+e-
 03051111 4237   00   2    -1.99330871E-05   # C10' e+e-
 03051313 4133   00   2     1.96475600E-06   # C9 mu+mu-
 03051313 4233   00   2     2.66707465E-06   # C9' mu+mu-
 03051313 4137   00   2     8.95240056E-06   # C10 mu+mu-
 03051313 4237   00   2    -1.99330875E-05   # C10' mu+mu-
 03051212 4137   00   2    -1.87964940E-06   # C11 nu_1 nu_1
 03051212 4237   00   2     4.31730715E-06   # C11' nu_1 nu_1
 03051414 4137   00   2    -1.87964931E-06   # C11 nu_2 nu_2
 03051414 4237   00   2     4.31730715E-06   # C11' nu_2 nu_2
 03051616 4137   00   2    -1.87962330E-06   # C11 nu_3 nu_3
 03051616 4237   00   2     4.31730714E-06   # C11' nu_3 nu_3
