BLOCK SPINFO
   1   SPheno
   2   v4.0.5be

BLOCK SPHENOINFO
   1   2
   2   2

BLOCK MODSEL
   1   0

BLOCK MINPAR
   3    24.531605
   4   -1

BLOCK EXTPAR
   0    1118.5375
   1    1653.0308
   2    1727.0437
   3    3000
   11   -2956.2576
   12   -1712.4206
   13    462.5809
   23   -407.95721
   25    23.788035
   26    1876.7743
   31    612.15836
   32    612.15836
   33    448.70166
   34    1715.1184
   35    1715.1184
   36    1242.603
   41    5000
   42    5000
   43    1731.9224
   44    5000
   45    5000
   46    906.22579
   47    5000
   48    5000
   49    1829.8051

BLOCK SMINPUTS
   1    127.90897
   2    1.1663787e-05
   3    0.1184
   4    91.1876
   5    4.18
   6    173.2
   7    1.777
   8    0
   11    0.00051099893
   12    0
   13    0.10565837
   14    0
   21    0.005
   22    0.0025
   23    0.095
   24    1.27

BLOCK GAUGE Q=  1118.5375
   1    0.35536298
   2    0.66519887
   3    1.219778

BLOCK YU Q=  1118.5375
   1   1    8.3917772e-06
   2   2    0.0042630228
   3   3    1.0137941

BLOCK YD Q=  1118.5375
   1   1    0.00040113705
   2   2    0.0076216039
   3   3    0.39780225

BLOCK YE Q=  1118.5375
   1   1    7.0001348e-05
   2   2    0.014474059
   3   3    0.24342986

BLOCK AU Q=  1118.5375
   1   1    0
   2   2    0
   3   3   -2956.2575

BLOCK AD Q=  1118.5375
   1   1    0
   2   2    0
   3   3   -1712.4206

BLOCK AE Q=  1118.5375
   1   1    0
   2   2    0
   3   3    462.5809

BLOCK MSOFT Q=  1118.5375
   1    1653.0308
   2    1727.0437
   3    3000
   21    3330249.2
   22   -167166.37
   31    612.15836
   32    612.15836
   33    448.70166
   34    1715.1184
   35    1715.1184
   36    1242.603
   41    5000
   42    5000
   43    1731.9224
   44    5000
   45    5000
   46    906.22579
   47    5000
   48    5000
   49    1829.8051

BLOCK MASS
   6    173.2
   23    91.1876
   24    80.429995
   15    1.777
   25    122.34263
   35    1876.718
   36    1876.7743
   37    1878.9581
   1000001    5010.0488
   2000001    5003.462
   1000002    5009.6121
   2000002    5004.4039
   1000003    5010.0516
   2000003    5003.4656
   1000004    5009.6146
   2000004    5004.4052
   1000005    1691.9177
   2000005    1817.8287
   1000006    727.82378
   2000006    1718.9959
   1000011    627.12725
   2000011    1719.4774
   1000012    621.74909
   1000013    627.12448
   2000013    1719.4731
   1000014    621.74664
   1000015    464.97172
   2000015    1246.7051
   1000016    458.11573
   1000021    3165.3101
   1000022    412.68036
   1000023   -418.52216
   1000025    1653.8275
   1000035    1770.4596
   1000024    415.78088
   1000037    1770.6086

BLOCK ALPHA
      -0.040994551

BLOCK HMIX Q=  1118.5375
   1   -407.95721
   2    23.788035
   3    244.26529
   4    3522281.8

BLOCK STOPMIX
   1   1    0.17876491
   1   2    0.98389182
   2   1   -0.98389182
   2   2    0.17876491

BLOCK SBOTMIX
   1   1   -0.99913371
   1   2    0.041615296
   2   1   -0.041615296
   2   2   -0.99913371

BLOCK STAUMIX
   1   1   -0.99991333
   1   2    0.013165637
   2   1   -0.013165637
   2   2   -0.99991333

BLOCK NMIX
   1   1   -0.02490082
   1   2    0.039741285
   1   3    0.70932043
   1   4    0.70332433
   2   1   -0.016184336
   2   2    0.026987149
   2   3   -0.70479851
   2   4    0.70870927
   3   1   -0.99927091
   3   2   -0.025402234
   3   3   -0.0060363698
   3   4   -0.027855466
   4   1    0.023992804
   4   2   -0.99852243
   4   3    0.0093359344
   4   4    0.047855355

BLOCK UMIX
   1   1   -0.01305422
   1   2   -0.99991479
   2   1    0.99991479
   2   2   -0.01305422

BLOCK VMIX
   1   1   -0.066876635
   1   2    0.99776125
   2   1    0.99776125
   2   2    0.066876635

BLOCK HIGGSBOUNDSINPUTHIGGSCOUPLINGSFERMIONS
       0, 565.87063,3,36,15,15

BLOCK HIGGSBOUNDSINPUTHIGGSCOUPLINGSBOSONS
       0,4,36,21,21,23

BLOCK SPHENOLOWENERGY
   1    0.00037801483
   2    1.5897099e-06
   3    3.5287243e-05
   4    2.2388634e-15
   5    9.564155e-11
   6    2.0013973e-08
   7    7.530942e-14
   8    3.2172108e-09
   9    6.8212983e-07
   10    9.5659499e-05
   11    0.98812601
   12    0.54405833
   13    19.434579
   14    0
   15    0
   16    0.0021678225
   17    2.2817662e-15
   18    2.4811032e-11
   19    8.2935581e-11
   20   -4.952958e-15
   21   -2.1175589e-10
   22   -6.4954444e-08
   23    0
   24    0
   25    0
   26    0
   27    0
   28    0
   29    0
   30    0
   31    0
   39    7.3443565e-05
   40    0
   41    0
   42    0

BLOCK FWCOEF Q=  160
   305   4422   0   0   -0.18881911
   305   4422   0   2   -0.25310142
   305   4322   0   2   -0.00056650183
   305   6421   0   0   -0.095227835
   305   6421   0   2   -0.13611198
   305   6321   0   2   -0.00044312898
   3051111   4133   0   0    1.5814508
   3051111   4133   0   2    1.5839398
   3051111   4233   0   2    5.2258707e-05
   3051111   4137   0   0   -4.4041429
   3051111   4137   0   2   -4.4058633
   3051111   4237   0   2   -0.00041222826
   3051313   4133   0   0    1.5814508
   3051313   4133   0   2    1.5839369
   3051313   4233   0   2    5.22584e-05
   3051313   4137   0   0   -4.4041429
   3051313   4137   0   2   -4.4058662
   3051313   4237   0   2   -0.00041222845
   3051212   4137   0   0    1.5053501
   3051212   4137   0   2    1.5057315
   3051212   4237   0   2    9.0055836e-05
   3051414   4137   0   0    1.5053501
   3051414   4137   0   2    1.5057315
   3051414   4237   0   2    9.0055883e-05
   3051616   4137   0   0    1.5053501
   3051616   4137   0   2    1.5057313
   3051616   4237   0   2    9.0069167e-05

BLOCK IMFWCOEF Q=  160
   305   4422   0   0    3.8577127e-07
   305   4422   0   2   -1.0534343e-05
   305   4322   0   2   -5.6050011e-06
   305   6421   0   0    3.304386e-07
   305   6421   0   2    9.0097121e-07
   305   6321   0   2   -2.2241355e-06
   3051111   4133   0   2    7.4981124e-08
   3051111   4233   0   2    1.4545816e-06
   3051111   4137   0   2   -4.2048088e-07
   3051111   4237   0   2   -1.1493132e-05
   3051313   4133   0   2    7.4944092e-08
   3051313   4233   0   2    1.45458e-06
   3051313   4137   0   2   -4.2051501e-07
   3051313   4237   0   2   -1.1493139e-05
   3051212   4137   0   2    1.5871275e-07
   3051212   4237   0   2    2.5107926e-06
   3051414   4137   0   2    1.5871215e-07
   3051414   4237   0   2    2.5107926e-06
   3051616   4137   0   2    1.5493531e-07
   3051616   4237   0   2    2.5107941e-06

DECAY 23  2.4952


DECAY 24  2.085


DECAY 1000011  0.0012014014
    0.51627647   2    1000022    11
    0.24595836   2   -1000024    12
    0.237759   2    1000023    11

DECAY 2000011  0.05516267
    0.87743817   2    1000025    11
    0.086249957   2    1000022    11
    0.036309102   2    1000023    11

DECAY 1000013  0.0020236011
    0.51559956   2    1000022    13
    0.33837526   2    1000023    13
    0.14602152   2   -1000024    14

DECAY 2000013  0.068034177
    0.71134288   2    1000025    13
    0.11700321   2    1000022    13
    0.093362554   2   -1000024    14
    0.075744914   2    1000023    13
    0.0025464455   2    1000013    25

DECAY 1000015  0.02242735
    0.56176523   2    1000022    15
    0.43589299   2    1000023    15
    0.002340629   2   -1000024    16

DECAY 2000015  2.6134398
    0.44366537   2   -1000024    16
    0.22469434   2    1000022    15
    0.22096983   2    1000023    15
    0.055522937   2    1000016   -24
    0.027938889   2    1000015    25
    0.027208633   2    1000015    23

DECAY 1000012  0.010929849
    0.68442384   2    1000024    11
    0.22049207   2    1000022    12
    0.095084084   2    1000023    12

DECAY 1000014  0.011723394
    0.70578975   2    1000024    13
    0.20556382   2    1000022    14
    0.088646429   2    1000023    14

DECAY 1000016  0.017840224
    0.98477235   2    1000024    15
    0.011302325   2    1000022    16
    0.0039253253   2    1000023    16

DECAY 2000001  144.29421
    0.98463681   2    1000021    1
    0.015337603   2    1000025    1

DECAY 1000001  193.99197
    0.73592604   2    1000021    1
    0.17407366   2   -1000037    2
    0.087543153   2    1000035    1
    0.0021000252   2    1000025    1
    0.00021887273   2    1000022    1
    0.00010004613   2    1000023    1

DECAY 2000003  144.30596
    0.98455923   2    1000021    3
    0.015336371   2    1000025    3

DECAY 1000003  193.99979
    0.73589789   2    1000021    3
    0.17406683   2   -1000037    4
    0.087539704   2    1000035    3
    0.0020999432   2    1000025    3
    0.00023363661   2    1000022    3
    0.00011461986   2    1000023    3

DECAY 1000005  90.51442
    0.62103831   2    1000006   -24
    0.32672651   2   -1000024    6
    0.026531908   2    1000022    5
    0.025699448   2    1000023    5

DECAY 2000005  10.427175
    0.49134241   2   -1000024    6
    0.24662589   2    1000022    5
    0.24570488   2    1000023    5
    0.012720013   2    1000006   -24
    0.0028808432   2    1000025    5
    0.00030299253   2    1000005    25
    0.00026544322   2    1000005    23
    0.00015254889   2    2000006   -24

DECAY 2000002  151.04517
    0.94127823   2    1000021    2
    0.058624805   2    1000025    2

DECAY 1000002  193.98755
    0.73570819   2    1000021    2
    0.17330487   2    1000037    1
    0.086047751   2    1000035    2
    0.0037314116   2    1000025    2
    0.0010028677   2    1000024    1
    0.00013977945   2    1000022    2

DECAY 2000004  151.0488
    0.94125602   2    1000021    4
    0.05862342   2    1000025    4

DECAY 1000004  193.99527
    0.73567996   2    1000021    4
    0.17329811   2    1000037    3
    0.08604441   2    1000035    4
    0.003731269   2    1000025    4
    0.0010321772   2    1000024    3
    0.00014432747   2    1000022    4

DECAY 1000006  10.949135
    0.60776815   2    1000024    5
    0.19881133   2    1000022    6
    0.19341908   2    1000023    6

DECAY 2000006  101.54027
    0.36103481   2    1000006    25
    0.28677674   2    1000006    23
    0.15168965   2    1000023    6
    0.14920742   2    1000022    6
    0.051291385   2    1000024    5

DECAY 1000024  2.9079347e-10
    0.46071026   3    1000022   -1    2
    0.20396048   3    1000022   -3    4
    0.15358775   3    1000022   -11    12
    0.1527019   3    1000022   -13    14
    0.029039602   3    1000022   -15    16

DECAY 1000037  52.730274
    0.12810148   2    1000016   -15
    0.12805509   2   -1000015    16
    0.11308781   2    1000014   -13
    0.11308754   2    1000012   -11
    0.11302209   2   -1000013    14
    0.11302181   2   -1000011    12
    0.070312331   2    1000023    24
    0.069883449   2    1000024    25
    0.069715666   2    1000024    23
    0.069122766   2    1000022    24
    0.0039277487   3    1000024    6   -6
    0.0027237821   3    1000023   -5    6
    0.0024766765   3    1000022   -5    6
    0.0018679455   2    1000006   -5
    0.0014603938   2    2000006   -5

DECAY 1000022 -1


DECAY 1000023  5.7214417e-08
    0.67499406   2    1000022    22
    0.082438938   3    1000022    12   -12
    0.06162813   3    1000022    1   -1
    0.061438566   3    1000022    3   -3
    0.048064415   3    1000022    2   -2
    0.025039978   3    1000022    4   -4
    0.013907269   3    1000022    11   -11
    0.013840362   3    1000022    13   -13
    0.0037925731   3    1000024    1   -2
    0.0037925731   3   -1000024   -1    2
    0.0031116325   3    1000022    15   -15
    0.0013200232   3    1000024    3   -4
    0.0013200232   3   -1000024   -3    4
    0.0012642875   3    1000024    11   -12
    0.0012642875   3   -1000024   -11    12
    0.001254983   3    1000024    13   -14
    0.001254983   3   -1000024   -13    14
    0.00013645848   3    1000024    15   -16
    0.00013645848   3   -1000024   -15    16

DECAY 1000025  22.45954
    0.14153492   2    1000006   -6
    0.14153492   2   -1000006    6
    0.053652983   2    1000024   -24
    0.053652983   2   -1000024    24
    0.043005092   2    1000015   -15
    0.043005092   2   -1000015    15
    0.037154363   2    1000013   -13
    0.037154363   2   -1000013    13
    0.037154252   2    1000011   -11
    0.037154252   2   -1000011    11
    0.035709162   2    1000016   -16
    0.035709162   2   -1000016    16
    0.034428633   2    2000015   -15
    0.034428633   2   -2000015    15
    0.032927801   2    1000023    25
    0.03251684   2    1000023    23
    0.030886706   2    1000014   -14
    0.030886706   2   -1000014    14
    0.030886625   2    1000012   -12
    0.030886625   2   -1000012    12
    0.027318468   2    1000022    25
    0.013310634   2    1000022    23
    0.0016325052   3    1000024    5   -6
    0.0016325052   3   -1000024   -5    6
    0.00092709951   3    1000023    6   -6
    0.0008543986   3    1000022    6   -6

DECAY 1000035  54.621336
    0.065889517   2    1000024   -24
    0.065889517   2   -1000024    24
    0.063518024   2    1000016   -16
    0.063518024   2   -1000016    16
    0.060062193   2    1000015   -15
    0.060062193   2   -1000015    15
    0.056437519   2    1000023    25
    0.056074747   2    1000014   -14
    0.056074747   2   -1000014    14
    0.056074623   2    1000012   -12
    0.056074623   2   -1000012    12
    0.053008014   2    1000013   -13
    0.053008014   2   -1000013    13
    0.05300787   2    1000011   -11
    0.05300787   2   -1000011    11
    0.047900302   2    1000023    23
    0.046846151   2    1000022    25
    0.02145379   2    1000022    23
    0.0022810322   3    1000024    5   -6
    0.0022810322   3   -1000024   -5    6
    0.0016151156   2    1000005   -5
    0.0016151156   2   -1000005    5
    0.0013092225   3    1000023    6   -6
    0.0012079095   3    1000022    6   -6
    0.00084698559   2    1000006   -6
    0.00084698559   2   -1000006    6

DECAY 1000021  219.99253
    0.18321731   2    1000006   -6
    0.18321731   2   -1000006    6
    0.11121388   2    2000006   -6
    0.11121388   2   -2000006    6
    0.10868046   2    1000005   -5
    0.10868046   2   -1000005    5
    0.095612144   2    2000005   -5
    0.095612144   2   -2000005    5
    0.00086824084   2    1000006   -4
    0.00086824084   2   -1000006    4
    0.00021577301   3    1000037    5   -6
    0.00021577301   3   -1000037   -5    6
    0.00010932303   3    1000035    5   -5

DECAY 25  0.0035760983
    0.61566994   2   -5    5
    0.18601105   2   -24    24
    0.072242521   2    21    21
    0.070487443   2   -15    15
    0.03016587   2   -4    4
    0.021343865   2    23    23
    0.0023346031   2    22    22
    0.001268338   2    22    23
    0.00024445613   2   -13    13
    0.00023111069   2   -3    3
    6.3899809e-07   2   -1    1
    1.5546029e-07   2   -2    2
    5.4956808e-09   2   -11    11

DECAY 35  15.160961
    0.82716518   2   -5    5
    0.13677321   2   -15    15
    0.017852399   2   -1000006    1000006
    0.0088505095   2   -6    6
    0.0035571885   2   -1000024    1000024
    0.0016369012   2   -2000015    1000015
    0.0016369012   2   -1000015    2000015
    0.0011546049   2    1000022    1000022
    0.00047937306   2   -13    13
    0.00043435819   2    1000023    1000023
    0.00033325683   2   -3    3
    4.2061606e-05   2    1000022    1000023
    3.666934e-05   2    25    25
    1.5263314e-05   2    21    21
    6.7455402e-06   2    23    23
    5.6357879e-06   2   -1000015    1000015
    3.9182741e-06   2   -24    24
    1.191324e-06   2   -1000011    1000011
    1.1876325e-06   2   -1000013    1000013
    9.2139535e-07   2   -1    1
    1.0841262e-07   2   -4    4
    7.1227942e-08   2    22    22
    1.0768033e-08   2   -11    11
    6.2671003e-09   2    22    23
    5.589541e-13   2   -2    2

DECAY 36  14.541969
    0.84090713   2   -5    5
    0.13904041   2   -15    15
    0.0093211751   2   -6    6
    0.0044255128   2   -1000024    1000024
    0.0017090831   2   -2000015    1000015
    0.0017090831   2   -1000015    2000015
    0.0012577532   2    1000022    1000022
    0.00065985103   2    1000023    1000023
    0.00048731839   2   -13    13
    0.00033877756   2   -3    3
    8.4103978e-05   2    1000022    1000023
    4.9241505e-05   2    21    21
    9.3869724e-06   2    23    25
    9.3665958e-07   2   -1    1
    1.1008629e-07   2   -4    4
    6.8938736e-08   2    22    23
    4.2308967e-08   2    22    22
    1.0946504e-08   2   -11    11
    5.6766734e-13   2   -2    2
    7.3151161e-37   2    25    25

DECAY 37  14.286998
    0.83541829   2   -5    6
    0.1582788   2   -15    16
    0.0035454403   2   -2000015    1000016
    0.0012317384   2   -5    4
    0.00055957269   2   -13    14
    0.00047214389   2    1000023    1000024
    0.00032366201   2   -3    4
    0.0001014868   2    1000022    1000024
    1.5070209e-05   2   -3    2
    1.3251968e-05   2   -3    6
    1.0688287e-05   2   -1000015    1000016
    9.6036741e-06   2    24    25
    8.7958874e-06   2   -5    2
    4.9547202e-06   2   -1000011    1000012
    4.9492274e-06   2   -1000013    1000014
    8.9799545e-07   2   -1    2
    5.8617396e-07   2   -1    6
    4.7118227e-08   2   -1    4
    1.3088463e-08   2   -11    12
    5.3708065e-12   2    24    35
    4.7285893e-12   2    24    36

DECAY 6  2.43
    1   2    5    24

DECAY 15 -1
