BLOCK SPINFO
   1   SPheno
   2   v4.0.5be

BLOCK SPHENOINFO
   1   2
   2   2

BLOCK MODSEL
   1   0

BLOCK MINPAR
   3    42.936335
   4    1

BLOCK EXTPAR
   0    2564.9049
   1   -3354.8335
   2   -641.95437
   3    1768.8811
   11    4369.7831
   12    6544.4509
   13    2350.4207
   23    196.15924
   25    41.913942
   26    4352.6284
   31    587.28426
   32    587.28426
   33    3957.6656
   34    4665.5054
   35    4665.5054
   36    4288.1838
   41    4305.2741
   42    4305.2741
   43    1790.2864
   44    3934.2252
   45    3934.2252
   46    3565.4453
   47    2980.3889
   48    2980.3889
   49    2199.7539

BLOCK SMINPUTS
   1    127.90897
   2    1.1663787e-05
   3    0.1184
   4    91.1876
   5    4.18
   6    173.2
   7    1.777
   8    0
   11    0.00051099893
   12    0
   13    0.10565837
   14    0
   21    0.005
   22    0.0025
   23    0.095
   24    1.27

BLOCK GAUGE Q=  2564.9049
   1    0.35536298
   2    0.66519887
   3    1.219778

BLOCK YU Q=  2564.9049
   1   1    8.3867581e-06
   2   2    0.0042604731
   3   3    1.0131877

BLOCK YD Q=  2564.9049
   1   1    0.00070637101
   2   2    0.013421049
   3   3    0.7004987

BLOCK YE Q=  2564.9049
   1   1    0.00012326691
   2   2    0.025487687
   3   3    0.42866096

BLOCK AU Q=  2564.9049
   1   1    0
   2   2    0
   3   3    4369.7831

BLOCK AD Q=  2564.9049
   1   1    0
   2   2    0
   3   3    6544.452

BLOCK AE Q=  2564.9049
   1   1    0
   2   2    0
   3   3    2350.4206

BLOCK MSOFT Q=  2564.9049
   1   -3354.8335
   2   -641.95437
   3    1768.8811
   21    19488049
   22    16535.597
   31    587.28426
   32    587.28426
   33    3957.6656
   34    4665.5054
   35    4665.5054
   36    4288.1838
   41    4305.2741
   42    4305.2741
   43    1790.2864
   44    3934.2252
   45    3934.2252
   46    3565.4453
   47    2980.3889
   48    2980.3889
   49    2199.7539

BLOCK MASS
   6    173.2
   23    91.1876
   24    80.429995
   15    1.777
   25    126.03196
   35    4345.8548
   36    4352.6284
   37    4348.0337
   1000001    4362.7759
   2000001    3033.6238
   1000002    4362.1717
   2000002    3983.1702
   1000003    4362.7737
   2000003    3033.6208
   1000004    4362.1695
   2000004    3983.1699
   1000005    1863.4552
   2000005    2271.9441
   1000006    1857.8072
   2000006    3541.1303
   1000011    603.16439
   2000011    4671.3884
   1000012    597.37932
   1000013    603.18203
   2000013    4671.3746
   1000014    597.39723
   1000015    3965.1553
   2000015    4291.4558
   1000016    3963.9623
   1000021    2027.6904
   1000022   -191.03339
   1000023    201.80483
   1000025   -684.44972
   1000035   -3348.9265
   1000024    195.05928
   1000037    684.73163

BLOCK ALPHA
      -0.023312397

BLOCK HMIX Q=  2564.9049
   1    196.15924
   2    41.913942
   3    243.40332
   4    18945374

BLOCK STOPMIX
   1   1   -0.99788068
   1   2    0.065070348
   2   1   -0.065070348
   2   2   -0.99788068

BLOCK SBOTMIX
   1   1    0.9999968
   1   2    0.0025279179
   2   1   -0.0025279179
   2   2    0.9999968

BLOCK STAUMIX
   1   1    0.99999275
   1   2    0.0038086031
   2   1   -0.0038086031
   2   2    0.99999275

BLOCK NMIX
   1   1    0.0095763691
   1   2   -0.11312176
   1   3    0.71499013
   1   4    0.68985569
   2   1   -0.0091846382
   2   2    0.067621799
   2   3    0.69830928
   2   4   -0.71253567
   3   1   -0.0020894983
   3   2   -0.99127727
   3   3   -0.033956015
   3   4   -0.12732634
   4   1   -0.99990978
   4   2    0.00036692781
   4   3    0.00050428778
   4   4    0.013417954

BLOCK UMIX
   1   1   -0.048536541
   1   2    0.99882141
   2   1   -0.99882141
   2   2   -0.048536541

BLOCK VMIX
   1   1    0.18174878
   1   2    0.983345
   2   1    0.983345
   2   2   -0.18174878

BLOCK HIGGSBOUNDSINPUTHIGGSCOUPLINGSFERMIONS
       0, 1756.7785,3,36,15,15

BLOCK HIGGSBOUNDSINPUTHIGGSCOUPLINGSBOSONS
       0,4,36,21,21,23

BLOCK SPHENOLOWENERGY
   1    0.00035456269
   2    1.587757e-06
   3    3.5256145e-05
   4    2.6969964e-15
   5    1.1521276e-10
   6    2.412176e-08
   7    9.0577816e-14
   8    3.8694863e-09
   9    8.2090166e-07
   10    9.6236302e-05
   11    0.99408416
   12    0.5421619
   13    19.369154
   14    0
   15    0
   16    0.0021582197
   17    2.2816682e-15
   18    2.4797023e-11
   19    8.2899102e-11
   20   -1.2861483e-14
   21   -5.5013126e-10
   22   -2.5905299e-08
   23    0
   24    0
   25    0
   26    0
   27    0
   28    0
   29    0
   30    0
   31    0
   39    9.8130678e-05
   40    0
   41    0
   42    0

BLOCK FWCOEF Q=  160
   305   4422   0   0   -0.18881911
   305   4422   0   2   -0.22683592
   305   4322   0   2   -0.00037039156
   305   6421   0   0   -0.095227835
   305   6421   0   2   -0.1233013
   305   6321   0   2   -0.00030236239
   3051111   4133   0   0    1.6114764
   3051111   4133   0   2    1.6120928
   3051111   4233   0   2    0.00060216556
   3051111   4137   0   0   -4.4341685
   3051111   4137   0   2   -4.4327936
   3051111   4237   0   2   -0.0045529608
   3051313   4133   0   0    1.6114764
   3051313   4133   0   2    1.61209
   3051313   4233   0   2    0.0006021648
   3051313   4137   0   0   -4.4341685
   3051313   4137   0   2   -4.4327962
   3051313   4237   0   2   -0.0045529667
   3051212   4137   0   0    1.5053501
   3051212   4137   0   2    1.5051036
   3051212   4237   0   2    0.0009879032
   3051414   4137   0   0    1.5053501
   3051414   4137   0   2    1.5051036
   3051414   4237   0   2    0.00098790322
   3051616   4137   0   0    1.5053501
   3051616   4137   0   2    1.5051028
   3051616   4237   0   2    0.00098790864

BLOCK IMFWCOEF Q=  160
   305   4422   0   0    3.8580248e-07
   305   4422   0   2   -3.0906838e-05
   305   4322   0   2   -5.4391472e-06
   305   6421   0   0    3.3046534e-07
   305   6421   0   2   -0.0001114202
   305   6321   0   2   -3.7749321e-06
   3051111   4133   0   2   -5.2900147e-07
   3051111   4233   0   2    1.1189173e-05
   3051111   4137   0   2    1.5315755e-06
   3051111   4237   0   2   -8.4604024e-05
   3051313   4133   0   2   -5.3065481e-07
   3051313   4233   0   2    1.1189162e-05
   3051313   4137   0   2    1.5331283e-06
   3051313   4237   0   2   -8.4604132e-05
   3051212   4137   0   2    5.9985276e-07
   3051212   4237   0   2    1.8357412e-05
   3051414   4137   0   2    5.9979025e-07
   3051414   4237   0   2    1.8357412e-05
   3051616   4137   0   2    5.8529891e-07
   3051616   4237   0   2    1.83574e-05

DECAY 23  2.4952


DECAY 24  2.085


DECAY 1000011  0.04333215
    0.57850849   2    1000022    11
    0.23144444   2   -1000024    12
    0.19004682   2    1000023    11

DECAY 2000011  5.5483996
    0.99923961   2    1000035    11
    0.00038679097   2    1000022    11
    0.00035566026   2    1000023    11

DECAY 1000013  0.049556644
    0.57091291   2    1000022    13
    0.22670402   2    1000023    13
    0.20238286   2   -1000024    14

DECAY 2000013  5.6686755
    0.97802297   2    1000035    13
    0.010588001   2   -1000024    14
    0.0058047079   2    1000022    13
    0.0055220062   2    1000023    13

DECAY 1000015  64.14135
    0.51088707   2   -1000037    16
    0.25242713   2    1000025    15
    0.11830699   2    1000022    15
    0.11059877   2    1000023    15
    0.0063721219   2    1000035    15
    0.0014079261   2   -1000024    16

DECAY 2000015  34.547254
    0.45089215   2   -1000024    16
    0.23095773   2    1000022    15
    0.22070007   2    1000023    15
    0.095413872   2    1000035    15
    0.0012781362   2   -1000037    16
    0.00062847819   2    1000025    15

DECAY 1000012  0.17912394
    0.77401081   2    1000024    11
    0.16539015   2    1000022    12
    0.060599037   2    1000023    12

DECAY 1000014  0.18528692
    0.78151798   2    1000024    13
    0.15989595   2    1000022    14
    0.058586064   2    1000023    14

DECAY 1000016  64.168088
    0.4954248   2    1000037    15
    0.25091984   2    1000025    16
    0.24208334   2    1000024    15
    0.0063655176   2    1000035    16
    0.0037836027   2    1000022    16
    0.001422905   2    1000023    16

DECAY 2000001  73.289616
    0.99999506   2    1000021    1

DECAY 1000001  266.58831
    0.79396487   2    1000021    1
    0.13673096   2   -1000037    2
    0.067288903   2    1000025    1
    0.00094620323   2    1000022    1
    0.00038692724   2    1000035    1
    0.00034410877   2    1000023    1
    0.00033802949   2   -1000024    2

DECAY 2000003  73.310809
    0.99970182   2    1000021    3
    0.0001467146   2   -1000024    4

DECAY 1000003  266.60516
    0.79391385   2    1000021    3
    0.13672244   2   -1000037    4
    0.06728468   2    1000025    3
    0.00097592148   2    1000022    3
    0.0003869015   2    1000035    3
    0.00037248187   2    1000023    3
    0.00034369665   2   -1000024    4

DECAY 1000005  72.720862
    0.48619303   2   -1000024    6
    0.18436745   2   -1000037    6
    0.12671852   2    1000022    5
    0.11963164   2    1000023    5
    0.083089375   2    1000025    5

DECAY 2000005  50.85912
    0.42356411   2   -1000024    6
    0.21966868   2    1000022    5
    0.2093847   2    1000023    5
    0.1459256   2    1000021    5
    0.0009233903   2   -1000037    6
    0.00045792913   2    1000025    5

DECAY 2000002  173.33109
    0.99558272   2    1000021    2
    0.0044080778   2    1000035    2

DECAY 1000002  266.57376
    0.79377705   2    1000021    2
    0.13251361   2    1000037    1
    0.067383413   2    1000025    2
    0.0047395579   2    1000024    1
    0.00089067617   2    1000022    2
    0.00038341382   2    1000035    2
    0.0003122731   2    1000023    2

DECAY 2000004  173.33384
    0.99556632   2    1000021    4
    0.0044079889   2    1000035    4

DECAY 1000004  266.59053
    0.79372605   2    1000021    4
    0.13250533   2    1000037    3
    0.067379199   2    1000025    4
    0.0047973647   2    1000024    3
    0.00089342361   2    1000022    4
    0.00038338878   2    1000035    4
    0.0003152422   2    1000023    4

DECAY 1000006  73.513449
    0.25668445   2    1000024    5
    0.25447019   2    1000023    6
    0.24124706   2    1000022    6
    0.15454188   2    1000037    5
    0.079243514   2    1000025    6
    0.012915426   3    1000022    24    5
    0.00066485562   2    1000022    4
    0.00023262624   2    1000023    4

DECAY 2000006  380.61047
    0.33180075   2    1000021    6
    0.17935688   2    1000024    5
    0.12658774   2    1000005    24
    0.10243365   2    1000006    25
    0.094733278   2    1000023    6
    0.088488909   2    1000022    6
    0.063398822   2    1000006    23
    0.0087855843   2    1000037    5
    0.0043202488   2    1000025    6

DECAY 1000024  3.5868407e-09
    0.41400645   3    1000022   -1    2
    0.2565124   3    1000022   -3    4
    0.138075   3    1000022   -11    12
    0.13760136   3    1000022   -13    14
    0.053804789   3    1000022   -15    16

DECAY 1000037  6.2952962
    0.2341651   2    1000023    24
    0.2294726   2    1000022    24
    0.22637139   2    1000024    23
    0.20524128   2    1000024    25
    0.026414215   2    1000012   -11
    0.026404325   2    1000014   -13
    0.023976992   2   -1000011    12
    0.023967279   2   -1000013    14
    0.0017943623   3    1000022   -5    6
    0.001631356   3    1000023   -5    6
    0.00055595691   3    1000024    6   -6

DECAY 1000022 -1


DECAY 1000023  5.6134741e-07
    0.25340053   2    1000022    22
    0.16756935   3    1000022    12   -12
    0.12527518   3    1000022    1   -1
    0.12516226   3    1000022    3   -3
    0.097704474   3    1000022    2   -2
    0.08115889   3    1000022    4   -4
    0.028262838   3    1000022    11   -11
    0.028224185   3    1000022    13   -13
    0.018933667   3    1000022    15   -15
    0.012989629   3    1000022    5   -5
    0.011158636   3    1000024    1   -2
    0.011158636   3   -1000024   -1    2
    0.0093962443   3    1000024    3   -4
    0.0093962443   3   -1000024   -3    4
    0.0037203721   3    1000024    11   -12
    0.0037203721   3   -1000024   -11    12
    0.0037158305   3    1000024    13   -14
    0.0037158305   3   -1000024   -13    14
    0.0026684195   3    1000024    15   -16
    0.0026684195   3   -1000024   -15    16

DECAY 1000025  7.2214119
    0.21305677   2    1000024   -24
    0.21305677   2   -1000024    24
    0.15591895   2    1000023    23
    0.15166362   2    1000023    25
    0.12511705   2    1000022    25
    0.049415973   2    1000022    23
    0.011607518   2    1000012   -12
    0.011607518   2   -1000012    12
    0.011603066   2    1000014   -14
    0.011603066   2   -1000014    14
    0.010253924   2    1000011   -11
    0.010253924   2   -1000011    11
    0.010249729   2    1000013   -13
    0.010249729   2   -1000013    13
    0.0019917765   3    1000024    5   -6
    0.0019917765   3   -1000024   -5    6
    0.00015290381   3    1000023    6   -6
    0.00015220909   3    1000022    6   -6

DECAY 1000035  28.824362
    0.075405891   2    1000024   -24
    0.075405891   2   -1000024    24
    0.068484364   2    1000012   -12
    0.068484364   2   -1000012    12
    0.068484094   2    1000014   -14
    0.068484094   2   -1000014    14
    0.068209113   2    1000011   -11
    0.068209113   2   -1000011    11
    0.068208846   2    1000013   -13
    0.068208846   2   -1000013    13
    0.043110658   2    1000023    25
    0.043099692   2    1000023    23
    0.036431217   2    1000022    25
    0.034748563   2    1000022    23
    0.028340911   2    2000005   -5
    0.028340911   2   -2000005    5
    0.012217001   2    1000006   -6
    0.012217001   2   -1000006    6
    0.011639047   2    1000005   -5
    0.011639047   2   -1000005    5
    0.0040095588   3    1000024    5   -6
    0.0040095588   3   -1000024   -5    6
    0.0035073855   2    1000037   -24
    0.0035073855   2   -1000037    24
    0.0031322033   2    2000003   -3
    0.0031322033   2   -2000003    3
    0.0031321474   2    2000001   -1
    0.0031321474   2   -2000001    1
    0.0029669787   3    1000023    6   -6
    0.0027551964   3    1000022    6   -6
    0.0023194342   2    1000025    25
    0.0011168391   2    1000025    23
    0.0006261427   3    1000025    12   -12
    0.0003548206   3    1000037    13   -14
    0.0003548206   3   -1000037   -13    14
    0.00035480028   3    1000037    11   -12
    0.00035480028   3   -1000037   -11    12
    0.00030848013   3    1000025    13   -13
    0.00030846605   3    1000025    11   -11
    0.00020988787   3    1000021    6   -6
    0.00018850338   3    1000037    5   -6
    0.00018850338   3   -1000037   -5    6
    0.00012645497   3    1000025    6   -6

DECAY 1000021  4.6053869
    0.15735882   2    1000005   -5
    0.15735882   2   -1000005    5
    0.13170436   3    1000023    6   -6
    0.12529663   3    1000022    6   -6
    0.082603613   2    1000006   -4
    0.082603613   2   -1000006    4
    0.072890761   3    1000024    5   -6
    0.072890761   3   -1000024   -5    6
    0.037757505   3    1000025    6   -6
    0.036165602   3    1000037    5   -6
    0.036165602   3   -1000037   -5    6
    0.0027836891   3    1000022    5   -5
    0.0026433043   3    1000023    5   -5
    0.00070123877   2    1000022    21
    0.00061860412   2    1000023    21

DECAY 25  0.0040112146
    0.55560447   2   -5    5
    0.24607678   2   -24    24
    0.071921102   2    21    21
    0.064093167   2   -15    15
    0.030396501   2    23    23
    0.02755341   2   -4    4
    0.0023399467   2    22    22
    0.0015829274   2    22    23
    0.00022207107   2   -13    13
    0.00020890353   2   -3    3
    5.7759677e-07   2   -1    1
    1.4198612e-07   2   -2    2
    4.9923918e-09   2   -11    11

DECAY 35  189.02926
    0.36461841   2   -5    5
    0.13748592   2   -2000005    1000005
    0.13748592   2   -1000005    2000005
    0.086654728   2   -15    15
    0.085942855   2   -1000024    1000037
    0.085942855   2   -1000037    1000024
    0.045561272   2    1000022    1000025
    0.041582154   2    1000023    1000025
    0.0067616756   2   -1000024    1000024
    0.0023453813   2    1000023    1000035
    0.0019146796   2    1000022    1000035
    0.0015328947   2    1000022    1000022
    0.0005211123   2   -1000037    1000037
    0.00047536134   2    1000023    1000023
    0.00036905333   2   -6    6
    0.00027002639   2   -13    13
    0.00025846586   2    1000025    1000025
    0.00016649152   2   -3    3
    8.6031811e-05   2    1000022    1000023
    1.5134174e-05   2   -1000006    1000006
    3.6017361e-06   2   -1000005    1000005
    2.6181957e-06   2    21    21
    2.1153947e-06   2    1000025    1000035
    5.1306695e-07   2    25    25
    4.6030529e-07   2   -1    1
    4.2403776e-08   2    23    23
    3.941253e-08   2    22    23
    1.7112658e-08   2    22    22
    1.7096803e-08   2   -1000011    1000011
    1.694417e-08   2   -1000013    1000013
    8.1499293e-09   2   -24    24
    6.0639553e-09   2   -11    11
    5.8905398e-09   2   -4    4
    3.0370117e-14   2   -2    2

DECAY 36  179.99438
    0.33978466   2   -5    5
    0.14579114   2   -2000005    1000005
    0.14579114   2   -1000005    2000005
    0.090534265   2   -1000024    1000037
    0.090534265   2   -1000037    1000024
    0.080724261   2   -15    15
    0.046687729   2    1000023    1000025
    0.045075893   2    1000022    1000025
    0.0069876927   2   -1000024    1000024
    0.0026031254   2    1000022    1000035
    0.0019167955   2    1000023    1000035
    0.0014851893   2    1000022    1000022
    0.00055466735   2    1000023    1000023
    0.00042891957   2   -1000037    1000037
    0.00033586476   2   -6    6
    0.00025151474   2   -13    13
    0.00021387579   2    1000025    1000025
    0.0001550629   2   -3    3
    0.00013245733   2    1000022    1000023
    6.2811129e-06   2    1000025    1000035
    4.6401381e-06   2    21    21
    4.2871065e-07   2   -1    1
    1.0367002e-07   2    23    25
    1.0581753e-08   2    22    23
    5.6481697e-09   2   -11    11
    5.3416967e-09   2   -4    4
    3.2430846e-10   2    22    22
    8.714739e-11   2    23    35
    2.754114e-14   2   -2    2
    1.3902219e-39   2    25    25

DECAY 37  191.01151
    0.37512802   2   -5    6
    0.26988526   2   -2000005    1000006
    0.091455091   2    1000022    1000037
    0.087333301   2    1000024    1000025
    0.085436378   2    1000023    1000037
    0.083922549   2   -15    16
    0.00421297   2    1000024    1000035
    0.0012664922   2    1000023    1000024
    0.00055604653   2   -5    4
    0.00033927731   2    1000022    1000024
    0.00029669606   2   -13    14
    0.00014704824   2   -3    4
    8.1251665e-06   2    1000035    1000037
    6.9154347e-06   2   -3    2
    3.9707454e-06   2   -5    2
    8.8794183e-07   2   -3    6
    4.0805288e-07   2   -1    2
    2.7026955e-07   2   -1000005    1000006
    9.7409456e-08   2    24    25
    6.6450615e-08   2   -1000011    1000012
    6.6238649e-08   2   -1000013    1000014
    3.0663414e-08   2   -1    6
    1.9413848e-08   2   -1    4
    6.9397518e-09   2   -11    12
    3.0600119e-09   2    1000025    1000037
    3.5009794e-13   2    24    35

DECAY 6  2.43
    1   2    5    24

DECAY 15 -1
