BLOCK SPINFO
   1   SPheno
   2   v4.0.5be

BLOCK SPHENOINFO
   1   2
   2   2

BLOCK MODSEL
   1   0

BLOCK MINPAR
   3    11.182848
   4   -1

BLOCK EXTPAR
   0    1389.4605
   1    986.95964
   2    259.04012
   3    3000
   11   -4597.0162
   12   -1329.595
   13    1103.1608
   23   -261.46441
   25    10.76567
   26    2864.8425
   31    1504.7592
   32    1504.7592
   33    837.70874
   34    1484.2416
   35    1484.2416
   36    498.90538
   41    5000
   42    5000
   43    1220.4026
   44    5000
   45    5000
   46    1841.907
   47    5000
   48    5000
   49    1904.2759

BLOCK SMINPUTS
   1    127.90897
   2    1.1663787e-05
   3    0.1184
   4    91.1876
   5    4.18
   6    173.2
   7    1.777
   8    0
   11    0.00051099893
   12    0
   13    0.10565837
   14    0
   21    0.005
   22    0.0025
   23    0.095
   24    1.27

BLOCK GAUGE Q=  1389.4605
   1    0.35536298
   2    0.66519887
   3    1.219778

BLOCK YU Q=  1389.4605
   1   1    8.4204653e-06
   2   2    0.0042775964
   3   3    1.0172598

BLOCK YD Q=  1389.4605
   1   1    0.00018216184
   2   2    0.003461075
   3   3    0.18064747

BLOCK YE Q=  1389.4605
   1   1    3.1788573e-05
   2   2    0.0065728688
   3   3    0.11054484

BLOCK AU Q=  1389.4605
   1   1    0
   2   2    0
   3   3   -4597.0163

BLOCK AD Q=  1389.4605
   1   1    0
   2   2    0
   3   3   -1329.595

BLOCK AE Q=  1389.4605
   1   1    0
   2   2    0
   3   3    1103.1608

BLOCK MSOFT Q=  1389.4605
   1    986.95964
   2    259.04012
   3    3000
   21    8053329.5
   22    30360.141
   31    1504.7592
   32    1504.7592
   33    837.70874
   34    1484.2416
   35    1484.2416
   36    498.90538
   41    5000
   42    5000
   43    1220.4026
   44    5000
   45    5000
   46    1841.907
   47    5000
   48    5000
   49    1904.2759

BLOCK MASS
   6    173.2
   23    91.1876
   24    80.429995
   15    1.777
   25    120.38138
   35    2864.4094
   36    2864.8425
   37    2865.7898
   1000001    5027.59
   2000001    5016.7108
   1000002    5027.1742
   2000002    5018.1996
   1000003    5027.5907
   2000003    5016.7113
   1000004    5027.1749
   2000004    5018.2004
   1000005    1171.9571
   2000005    1931.8562
   1000006    1077.9609
   2000006    1790.9745
   1000011    1508.8282
   2000011    1487.25
   1000012    1506.4656
   1000013    1508.8282
   2000013    1487.2487
   1000014    1506.4652
   1000015    506.919
   2000015    842.4111
   1000016    838.34868
   1000021    3187.343
   1000022    222.58897
   1000023   -274.37748
   1000025    327.47276
   1000035    987.95884
   1000024    227.26626
   1000037    331.93893

BLOCK ALPHA
      -0.089390564

BLOCK HMIX Q=  1389.4605
   1   -261.46441
   2    10.76567
   3    244.05097
   4    8207322.3

BLOCK STOPMIX
   1   1    0.94540537
   1   2    0.32589674
   2   1   -0.32589674
   2   2    0.94540537

BLOCK SBOTMIX
   1   1   -0.99999895
   1   2    0.0014474163
   2   1   -0.0014474163
   2   2   -0.99999895

BLOCK STAUMIX
   1   1   -0.015416779
   1   2    0.99988115
   2   1   -0.99988115
   2   2   -0.015416779

BLOCK NMIX
   1   1    0.025195455
   1   2   -0.6270346
   1   3   -0.60592192
   1   4   -0.48892886
   2   1    0.0270365
   2   2   -0.11404906
   2   3    0.69308085
   2   4   -0.71126702
   3   1    0.031329252
   3   2    0.77057945
   3   3   -0.39041088
   3   4   -0.5027973
   4   1   -0.99882566
   4   2    0.0052659524
   4   3   -0.0087695778
   4   4   -0.047356833

BLOCK UMIX
   1   1   -0.57597987
   1   2   -0.81746388
   2   1    0.81746388
   2   2   -0.57597987

BLOCK VMIX
   1   1   -0.74509476
   1   2    0.66695862
   2   1    0.66695862
   2   2    0.74509476

BLOCK HIGGSBOUNDSINPUTHIGGSCOUPLINGSFERMIONS
       0, 115.89965,3,36,15,15

BLOCK HIGGSBOUNDSINPUTHIGGSCOUPLINGSBOSONS
       0,4,36,21,21,23

BLOCK SPHENOLOWENERGY
   1    0.00034741285
   2    1.5897581e-06
   3    3.5288252e-05
   4    2.3380803e-15
   5    9.9880172e-11
   6    2.0910765e-08
   7    7.8823292e-14
   8    3.3673297e-09
   9    7.1429048e-07
   10    9.6714876e-05
   11    0.99902764
   12    0.54284426
   13    19.395937
   14    0
   15    0
   16    0.0021612235
   17    2.2816981e-15
   18    2.4822601e-11
   19    8.2957173e-11
   20   -2.102192e-15
   21   -8.9875725e-11
   22   -6.2839363e-08
   23    0
   24    0
   25    0
   26    0
   27    0
   28    0
   29    0
   30    0
   31    0
   39    2.2678932e-05
   40    0
   41    0
   42    0

BLOCK FWCOEF Q=  160
   305   4422   0   0   -0.18881911
   305   4422   0   2   -0.21942631
   305   4322   0   2   -0.00027839674
   305   6421   0   0   -0.095227835
   305   6421   0   2   -0.11671784
   305   6321   0   2   -0.00022975786
   3051111   4133   0   0    1.5890271
   3051111   4133   0   2    1.5905393
   3051111   4233   0   2    2.5235966e-05
   3051111   4137   0   0   -4.4117192
   3051111   4137   0   2   -4.4133967
   3051111   4237   0   2   -0.00019670445
   3051313   4133   0   0    1.5890271
   3051313   4133   0   2    1.5905391
   3051313   4233   0   2    2.5235958e-05
   3051313   4137   0   0   -4.4117192
   3051313   4137   0   2   -4.4133969
   3051313   4237   0   2   -0.00019670446
   3051212   4137   0   0    1.5053501
   3051212   4137   0   2    1.5057501
   3051212   4237   0   2    4.2896458e-05
   3051414   4137   0   0    1.5053501
   3051414   4137   0   2    1.5057501
   3051414   4237   0   2    4.2896458e-05
   3051616   4137   0   0    1.5053501
   3051616   4137   0   2    1.5057529
   3051616   4237   0   2    4.289666e-05

BLOCK IMFWCOEF Q=  160
   305   4422   0   0    3.8580564e-07
   305   4422   0   2   -1.1565564e-05
   305   4322   0   2   -2.6391875e-06
   305   6421   0   0    3.3046805e-07
   305   6421   0   2    2.6180134e-06
   305   6321   0   2   -1.0522157e-06
   3051111   4133   0   2   -1.1067774e-06
   3051111   4233   0   2    5.0790118e-07
   3051111   4137   0   2    2.2458882e-05
   3051111   4237   0   2   -3.9609971e-06
   3051313   4133   0   2   -1.1067877e-06
   3051313   4233   0   2    5.0790107e-07
   3051313   4137   0   2    2.2458888e-05
   3051313   4237   0   2   -3.9609974e-06
   3051212   4137   0   2   -4.2822517e-06
   3051212   4237   0   2    8.6380076e-07
   3051414   4137   0   2   -4.2822514e-06
   3051414   4237   0   2    8.6380076e-07
   3051616   4137   0   2   -4.232853e-06
   3051616   4237   0   2    8.6380207e-07

DECAY 23  2.4952


DECAY 24  2.085


DECAY 2000011  2.3436304
    0.9930571   2    1000035    11
    0.002833567   2    1000025    11
    0.0021748233   2    1000023    11
    0.0019344947   2    1000022    11

DECAY 1000011  19.043284
    0.42206368   2   -1000037    12
    0.22101026   2   -1000024    12
    0.19628594   2    1000025    11
    0.12563878   2    1000022    11
    0.031766452   2    1000035    11
    0.0032348936   2    1000023    11

DECAY 2000013  2.3460175
    0.99204308   2    1000035    13
    0.0029059012   2    1000025    13
    0.0024167839   2    1000023    13
    0.0021237291   2    1000022    13
    0.00034730154   2   -1000024    14
    0.00016320164   2   -1000037    14

DECAY 1000013  19.044502
    0.42203671   2   -1000037    14
    0.22099614   2   -1000024    14
    0.19628273   2    1000025    13
    0.12565475   2    1000022    13
    0.031764427   2    1000035    13
    0.0032652518   2    1000023    13

DECAY 1000015  0.14002293
    0.4260679   2   -1000024    16
    0.24852449   2    1000022    15
    0.21249538   2    1000023    15
    0.071815351   2   -1000037    16
    0.041096881   2    1000025    15

DECAY 2000015  8.7267408
    0.40658255   2   -1000037    16
    0.24055596   2   -1000024    16
    0.19288795   2    1000025    15
    0.14486694   2    1000022    15
    0.012577554   2    1000023    15
    0.0012723882   2    1000015    23
    0.001256659   2    1000015    25

DECAY 1000012  19.122053
    0.36769212   2    1000024    11
    0.27927156   2    1000037    11
    0.17887279   2    1000025    12
    0.13610868   2    1000022    12
    0.032703276   2    1000035    12
    0.0053515741   2    1000023    12

DECAY 1000014  19.123262
    0.36771214   2    1000024    13
    0.27927399   2    1000037    13
    0.17886143   2    1000025    14
    0.13610004   2    1000022    14
    0.032701172   2    1000035    14
    0.0053512341   2    1000023    14

DECAY 1000016  8.9008927
    0.40844759   2    1000024    15
    0.26749643   2    1000037    15
    0.16918115   2    1000025    16
    0.14693615   2    1000022    16
    0.005456846   2    1000023    16
    0.0024818401   2    1000015    24

DECAY 2000001  143.40756
    0.98195197   2    1000021    1
    0.018002442   2    1000035    1

DECAY 1000001  208.52128
    0.68075491   2    1000021    1
    0.14059997   2   -1000037    2
    0.070126239   2   -1000024    2
    0.061580502   2    1000025    1
    0.042158426   2    1000022    1
    0.0032894854   2    1000035    1
    0.0014904637   2    1000023    1

DECAY 2000003  143.40999
    0.98193574   2    1000021    3
    0.01800214   2    1000035    3

DECAY 1000003  208.52437
    0.68074518   2    1000021    3
    0.14060278   2   -1000037    4
    0.070129061   2   -1000024    4
    0.061580462   2    1000025    3
    0.042159905   2    1000022    3
    0.0032894376   2    1000035    3
    0.0014931772   2    1000023    3

DECAY 1000005  35.305469
    0.50196272   2   -1000037    6
    0.33559201   2   -1000024    6
    0.075360037   2    1000025    5
    0.06160865   2    1000022    5
    0.014002334   2    1000006   -24
    0.011064329   2    1000023    5
    0.00040991877   2    1000035    5

DECAY 2000005  2.9897765
    0.26620514   2   -1000024    6
    0.19627243   2    1000035    5
    0.19397494   2    1000023    5
    0.14898769   2    1000022    5
    0.13089988   2   -1000037    6
    0.061539871   2    1000025    5
    0.00098898647   2    1000006   -24
    0.00070656146   2    1000005    25
    0.00042393863   2    1000005    23

DECAY 2000002  151.33072
    0.9315642   2    1000021    2
    0.068263099   2    1000035    2

DECAY 1000002  208.52237
    0.68054373   2    1000021    2
    0.1173412   2    1000024    1
    0.09358518   2    1000037    1
    0.063384288   2    1000025    2
    0.040965245   2    1000022    2
    0.0029217101   2    1000035    2
    0.0012586456   2    1000023    2

DECAY 2000004  151.33438
    0.93154186   2    1000021    4
    0.068261486   2    1000035    4

DECAY 1000004  208.5254
    0.68053392   2    1000021    4
    0.11734333   2    1000024    3
    0.093585713   2    1000037    3
    0.063385594   2    1000025    4
    0.040966725   2    1000022    4
    0.0029216842   2    1000035    4
    0.0012630361   2    1000023    4

DECAY 1000006  31.518286
    0.30782791   2    1000024    5
    0.29007633   2    1000023    6
    0.22775564   2    1000022    6
    0.15158153   2    1000025    6
    0.021916262   2    1000037    5
    0.00081287486   3    1000022    24    5

DECAY 2000006  238.71273
    0.3165803   2    1000005    24
    0.1963558   2    1000006    23
    0.19398796   2    1000006    25
    0.10336852   2    1000037    5
    0.070644509   2    1000023    6
    0.053927708   2    1000025    6
    0.033607627   2    1000024    5
    0.023706339   2    1000022    6
    0.0078212388   2    1000035    6

DECAY 1000024  5.1660013e-09
    0.39433142   3    1000022   -1    2
    0.2765235   3    1000022   -3    4
    0.13164849   3    1000022   -11    12
    0.13131367   3    1000022   -13    14
    0.066182917   3    1000022   -15    16

DECAY 1000037  0.20814137
    0.73149988   2    1000022    24
    0.25990213   2    1000024    23
    0.0028681731   3    1000023   -1    2
    0.0028631521   3    1000023   -3    4
    0.00095605314   3    1000023   -11    12
    0.00095604469   3    1000023   -13    14
    0.000953393   3    1000023   -15    16

DECAY 1000022 -1


DECAY 1000023  0.0020882053
    0.10114053   3    1000024    1   -2
    0.10114053   3   -1000024   -1    2
    0.10084798   3    1000024    3   -4
    0.10084798   3   -1000024   -3    4
    0.078921982   3    1000022    12   -12
    0.058957912   3    1000022    1   -1
    0.058955978   3    1000022    3   -3
    0.055286436   3    1000022    5   -5
    0.045986099   3    1000022    2   -2
    0.045669281   3    1000022    4   -4
    0.033718023   3    1000024    11   -12
    0.033718023   3   -1000024   -11    12
    0.033717561   3    1000024    13   -14
    0.033717561   3   -1000024   -13    14
    0.033568719   3    1000024    15   -16
    0.033568719   3   -1000024   -15    16
    0.013300063   3    1000022    11   -11
    0.013299375   3    1000022    13   -13
    0.013120003   3    1000022    15   -15
    0.010517244   2    1000022    22

DECAY 1000025  0.28749104
    0.49847165   2    1000024   -24
    0.49847165   2   -1000024    24
    0.00066231908   2    1000022    23
    0.00046465379   3    1000023    12   -12
    0.00034796776   3    1000023    1   -1
    0.00034795694   3    1000023    3   -3
    0.00032802293   3    1000023    5   -5
    0.00027134587   3    1000023    2   -2
    0.0002695692   3    1000023    4   -4

DECAY 1000035  5.6079121
    0.23964008   2    1000015   -15
    0.23964008   2   -1000015    15
    0.095062819   2    1000023    25
    0.073870618   2    1000023    23
    0.070607796   2    1000037   -24
    0.070607796   2   -1000037    24
    0.048603451   2    1000025    25
    0.034018793   2    1000024   -24
    0.034018793   2   -1000024    24
    0.022275219   2    1000022    25
    0.017504894   2    1000025    23
    0.016122663   2    1000022    23
    0.0088221832   2    1000016   -16
    0.0088221832   2   -1000016    16
    0.0080611984   2    2000015   -15
    0.0080611984   2   -2000015    15
    0.00097982628   3    1000037    5   -6
    0.00097982628   3   -1000037   -5    6
    0.00061720154   3    1000023    6   -6
    0.00054122558   3    1000024    5   -6
    0.00054122558   3   -1000024   -5    6
    0.00028053884   3    1000025    6   -6
    0.00024114067   3    1000022    6   -6

DECAY 1000021  225.07478
    0.15674799   2    1000005   -5
    0.15674799   2   -1000005    5
    0.15186106   2    1000006   -6
    0.15186106   2   -1000006    6
    0.10726026   2    2000006   -6
    0.10726026   2   -2000006    6
    0.083882289   2    2000005   -5
    0.083882289   2   -2000005    5

DECAY 25  0.0033468865
    0.64191345   2   -5    5
    0.15901879   2   -24    24
    0.073253561   2   -15    15
    0.072653808   2    21    21
    0.031692584   2   -4    4
    0.017540888   2    23    23
    0.0023193132   2    22    22
    0.0011116589   2    22    23
    0.00025418905   2   -13    13
    0.00024092128   2   -3    3
    6.6612392e-07   2   -1    1
    1.6333438e-07   2   -2    2
    5.7145172e-09   2   -11    11

DECAY 35  42.708365
    0.22202839   2   -1000024    1000024
    0.1048311   2   -1000024    1000037
    0.1048311   2   -1000037    1000024
    0.097544117   2   -1000037    1000037
    0.096486694   2    1000022    1000022
    0.092354577   2   -5    5
    0.068474005   2    1000023    1000025
    0.058041554   2    1000025    1000025
    0.033816957   2    1000022    1000023
    0.025847299   2    1000023    1000035
    0.020885231   2   -6    6
    0.020697649   2    1000022    1000035
    0.016706831   2   -15    15
    0.015546156   2   -1000006    1000006
    0.013418646   2    1000025    1000035
    0.0035147928   2    1000023    1000023
    0.002736677   2    1000022    1000025
    0.0010450565   2   -2000015    1000015
    0.0010450565   2   -1000015    2000015
    5.8682593e-05   2   -13    13
    3.5928274e-05   2   -3    3
    2.5458406e-05   2    25    25
    9.1456198e-06   2    1000035    1000035
    4.7828477e-06   2    23    23
    3.8806413e-06   2   -1000015    1000015
    3.0358742e-06   2   -1000005    1000005
    1.5355078e-06   2   -24    24
    5.2803315e-07   2    22    23
    2.5686878e-07   2   -4    4
    1.1049227e-07   2    21    21
    9.9331773e-08   2   -1    1
    6.7425381e-08   2    22    22
    1.0514029e-08   2   -2000015    2000015
    1.3179919e-09   2   -11    11
    1.324143e-12   2   -2    2

DECAY 36  41.824232
    0.18545612   2   -1000024    1000024
    0.14811526   2   -1000024    1000037
    0.14811526   2   -1000037    1000024
    0.090351988   2   -5    5
    0.089006931   2    1000023    1000025
    0.07619932   2    1000022    1000022
    0.058885768   2   -1000037    1000037
    0.054855639   2    1000022    1000023
    0.039772213   2    1000025    1000025
    0.032645676   2    1000023    1000035
    0.020539679   2   -6    6
    0.018560282   2    1000022    1000035
    0.016346046   2   -15    15
    0.010035004   2    1000025    1000035
    0.005379867   2    1000023    1000023
    0.0034813063   2    1000022    1000025
    0.0010679926   2   -2000015    1000015
    0.0010679926   2   -1000015    2000015
    5.7415621e-05   2   -13    13
    3.5151913e-05   2   -3    3
    1.4776817e-05   2    21    21
    7.6972909e-06   2    23    25
    1.9916105e-06   2    1000035    1000035
    2.5312523e-07   2    22    23
    2.4583808e-07   2   -4    4
    9.7185501e-08   2   -1    1
    1.6565322e-08   2    22    22
    1.2895345e-09   2   -11    11
    1.267325e-12   2   -2    2
    2.1788566e-37   2    25    25

DECAY 37  42.034819
    0.29855072   2    1000022    1000037
    0.24727225   2    1000024    1000025
    0.13129678   2    1000023    1000024
    0.12921001   2    1000023    1000037
    0.11139303   2   -5    6
    0.034517614   2    1000024    1000035
    0.024250491   2    1000035    1000037
    0.017050422   2   -15    16
    0.003973474   2   -1000005    1000006
    0.0021297898   2   -1000015    1000016
    0.00013314062   2   -5    4
    6.0279333e-05   2   -13    14
    5.328507e-05   2    1000025    1000037
    3.3127017e-05   2   -3    4
    3.0759228e-05   2   -3    6
    3.0604941e-05   2    1000022    1000024
    7.6715956e-06   2    24    25
    2.5455973e-06   2   -2000015    1000016
    1.5378872e-06   2   -3    2
    1.4085314e-06   2   -1    6
    9.5075847e-07   2   -5    2
    9.1165749e-08   2   -1    2
    1.7138096e-08   2   -1    4
    1.4099399e-09   2   -11    12
    1.6228646e-13   2    24    35

DECAY 6  2.43
    1   2    5    24

DECAY 15 -1
