BLOCK SPINFO
   1   SPheno
   2   v4.0.5be

BLOCK SPHENOINFO
   1   2
   2   2

BLOCK MODSEL
   1   0

BLOCK MINPAR
   3    55.902788
   4    1

BLOCK EXTPAR
   0    1338.5695
   1   -505.76749
   2    364.8992
   3    3000
   11    4887.0843
   12   -952.31827
   13   -679.47068
   23    184.47589
   25    55.153338
   26    474.29874
   31    1405.9131
   32    1405.9131
   33    380.70573
   34    1244.0198
   35    1244.0198
   36    1993.4378
   41    5000
   42    5000
   43    1261.2757
   44    5000
   45    5000
   46    1776.8982
   47    5000
   48    5000
   49    1142.137

BLOCK SMINPUTS
   1    127.90897
   2    1.1663787e-05
   3    0.1184
   4    91.1876
   5    4.18
   6    173.2
   7    1.777
   8    0
   11    0.00051099893
   12    0
   13    0.10565837
   14    0
   21    0.005
   22    0.0025
   23    0.095
   24    1.27

BLOCK GAUGE Q=  1338.5695
   1    0.35536298
   2    0.66519887
   3    1.219778

BLOCK YU Q=  1338.5695
   1   1    8.3857502e-06
   2   2    0.0042599611
   3   3    1.013066

BLOCK YD Q=  1338.5695
   1   1    0.00092938139
   2   2    0.017658246
   3   3    0.92165512

BLOCK YE Q=  1338.5695
   1   1    0.00016218385
   2   2    0.033534476
   3   3    0.56399472

BLOCK AU Q=  1338.5695
   1   1    0
   2   2    0
   3   3    4887.0845

BLOCK AD Q=  1338.5695
   1   1    0
   2   2    0
   3   3   -952.31822

BLOCK AE Q=  1338.5695
   1   1    0
   2   2    0
   3   3   -679.47067

BLOCK MSOFT Q=  1338.5695
   1   -505.76749
   2    364.8992
   3    3000
   21    230610.81
   22    46071.121
   31    1405.9131
   32    1405.9131
   33    380.70573
   34    1244.0198
   35    1244.0198
   36    1993.4378
   41    5000
   42    5000
   43    1261.2757
   44    5000
   45    5000
   46    1776.8982
   47    5000
   48    5000
   49    1142.137

BLOCK MASS
   6    173.2
   23    91.1876
   24    80.429995
   15    1.777
   25    120.2805
   35    474.18189
   36    474.29874
   37    485.17409
   1000001    5027.4528
   2000001    5016.7039
   1000002    5027.0438
   2000002    5018.1597
   1000003    5027.4601
   2000003    5016.7171
   1000004    5027.0511
   2000004    5018.1605
   1000005    1111.4501
   2000005    1189.3751
   1000006    1045.0103
   2000006    1714.594
   1000011    1409.5736
   2000011    1246.3042
   1000012    1407.0833
   1000013    1409.5551
   2000013    1246.2626
   1000014    1407.064
   1000015    380.95903
   2000015    1986.405
   1000016    376.34692
   1000021    3186.2372
   1000022    175.4236
   1000023   -190.48331
   1000025    406.86376
   1000035   -509.39005
   1000024    178.7319
   1000037    407.36944

BLOCK ALPHA
      -0.018940587

BLOCK HMIX Q=  1338.5695
   1    184.47589
   2    55.153338
   3    244.08075
   4    224959.3

BLOCK STOPMIX
   1   1   -0.90916977
   1   2    0.41642567
   2   1   -0.41642567
   2   2   -0.90916977

BLOCK SBOTMIX
   1   1    0.11351556
   1   2    0.99353622
   2   1   -0.99353622
   2   2    0.11351556

BLOCK STAUMIX
   1   1    0.9999855
   1   2    0.0053852237
   2   1   -0.0053852237
   2   2    0.9999855

BLOCK NMIX
   1   1   -0.043346817
   1   2   -0.25588143
   1   3    0.70658253
   1   4   -0.65832126
   2   1    0.096845744
   2   2    0.097412728
   2   3    0.69696837
   2   4    0.70382295
   3   1    0.012193131
   3   2   -0.96174692
   3   3   -0.11707061
   3   4    0.24736342
   4   1    0.99428028
   4   2   -0.0088495646
   4   3   -0.035646749
   4   4   -0.10028814

BLOCK UMIX
   1   1   -0.16750165
   1   2    0.9858718
   2   1    0.9858718
   2   2    0.16750165

BLOCK VMIX
   1   1   -0.35422524
   1   2    0.93516013
   2   1    0.93516013
   2   2    0.35422524

BLOCK HIGGSBOUNDSINPUTHIGGSCOUPLINGSFERMIONS
       0, 3041.8908,3,36,15,15

BLOCK HIGGSBOUNDSINPUTHIGGSCOUPLINGSBOSONS
       0,4,36,21,21,23

BLOCK SPHENOLOWENERGY
   1    0.0005012504
   2    1.6040651e-06
   3    3.5223716e-05
   4    3.855225e-15
   5    1.6468912e-10
   6    3.4403475e-08
   7    1.2941145e-13
   8    5.5284029e-09
   9    1.1705508e-06
   10    2.7633423e-05
   11    0.28544267
   12    0.54267581
   13    19.085058
   14    0
   15    0
   16    0.0021638804
   17    2.2818069e-15
   18    2.4792921e-11
   19    8.2881682e-11
   20    1.1461666e-14
   21    4.9000427e-10
   22    3.8002728e-07
   23    0
   24    0
   25    0
   26    0
   27    0
   28    0
   29    0
   30    0
   31    0
   39    8.711471e-05
   40    0
   41    0
   42    0

BLOCK FWCOEF Q=  160
   305   4422   0   0   -0.18881911
   305   4422   0   2   -0.36666947
   305   4322   0   2   -0.0020881544
   305   6421   0   0   -0.095227835
   305   6421   0   2   -0.23410097
   305   6321   0   2   -0.0019384343
   3051111   4133   0   0    1.5887271
   3051111   4133   0   2    1.5896735
   3051111   4233   0   2   -0.00031767358
   3051111   4137   0   0   -4.4114192
   3051111   4137   0   2   -4.4067042
   3051111   4237   0   2    0.002498074
   3051313   4133   0   0    1.5887271
   3051313   4133   0   2    1.5896682
   3051313   4233   0   2   -0.00031818711
   3051313   4137   0   0   -4.4114192
   3051313   4137   0   2   -4.4067095
   3051313   4237   0   2    0.0024985719
   3051212   4137   0   0    1.5053501
   3051212   4137   0   2    1.5043491
   3051212   4237   0   2   -0.00054483184
   3051414   4137   0   0    1.5053501
   3051414   4137   0   2    1.5043491
   3051414   4237   0   2   -0.00054472064
   3051616   4137   0   0    1.5053501
   3051616   4137   0   2    1.5043529
   3051616   4237   0   2   -0.00051338489

BLOCK IMFWCOEF Q=  160
   305   4422   0   0    3.8573556e-07
   305   4422   0   2    5.8670841e-05
   305   4322   0   2   -8.4076894e-06
   305   6421   0   0    3.3040802e-07
   305   6421   0   2   -1.0802902e-05
   305   6321   0   2   -4.0784963e-06
   3051111   4133   0   2   -1.7628351e-06
   3051111   4233   0   2    1.0907697e-05
   3051111   4137   0   2    2.0774283e-05
   3051111   4237   0   2   -8.5323011e-05
   3051313   4133   0   2   -1.7628407e-06
   3051313   4233   0   2    1.0907625e-05
   3051313   4137   0   2    2.0774381e-05
   3051313   4237   0   2   -8.5323227e-05
   3051212   4137   0   2   -4.0218169e-06
   3051212   4237   0   2    1.8608714e-05
   3051414   4137   0   2   -4.0218151e-06
   3051414   4237   0   2    1.8608714e-05
   3051616   4137   0   2   -3.9547429e-06
   3051616   4237   0   2    1.8608692e-05

DECAY 23  2.4952


DECAY 24  2.085


DECAY 2000011  4.3632528
    0.98439898   2    1000035    11
    0.012839584   2    1000023    11
    0.002590976   2    1000022    11
    0.00017032183   2    1000025    11

DECAY 1000011  17.104779
    0.59222717   2   -1000037    12
    0.27812021   2    1000025    11
    0.074796948   2    1000035    11
    0.027374296   2    1000022    11
    0.019704393   2   -1000024    12
    0.0077769814   2    1000023    11

DECAY 2000013  4.4162342
    0.97253658   2    1000035    13
    0.015609954   2    1000023    13
    0.0058865442   2   -1000024    14
    0.0055882701   2    1000022    13
    0.00023734995   2    1000025    13
    0.00014130633   2   -1000037    14

DECAY 1000013  17.134931
    0.59117444   2   -1000037    14
    0.27764726   2    1000025    13
    0.074665481   2    1000035    13
    0.028216131   2    1000022    13
    0.019669444   2   -1000024    14
    0.0086249219   2    1000023    13

DECAY 1000015  1.5687961
    0.52765304   2    1000022    15
    0.43388183   2    1000023    15
    0.038465134   2   -1000024    16

DECAY 2000015  36.2984
    0.33043824   2   -1000024    16
    0.23769637   2    1000035    15
    0.17021877   2    1000022    15
    0.16776591   2    1000023    15
    0.036084249   2    1000016   -37
    0.018080289   2    1000015    36
    0.018070152   2    1000015    35
    0.0095949879   2   -1000037    16
    0.0047237661   2    1000025    15
    0.003797342   2    1000016   -24
    0.0018903884   2    1000015    23
    0.0016395321   2    1000015    25

DECAY 1000012  17.17436
    0.52942919   2    1000037    11
    0.28391459   2    1000025    12
    0.087599732   2    1000024    11
    0.079402778   2    1000035    12
    0.018928696   2    1000022    12
    0.00072501628   2    1000023    12

DECAY 1000014  17.204399
    0.52853846   2    1000037    13
    0.28341357   2    1000025    14
    0.089166459   2    1000024    13
    0.079262401   2    1000035    14
    0.018895371   2    1000022    14
    0.00072373975   2    1000023    14

DECAY 1000016  1.6876443
    0.96629687   2    1000024    15
    0.032570145   2    1000022    16
    0.0011329818   2    1000023    16

DECAY 2000001  143.69497
    0.98090352   2    1000021    1
    0.018873602   2    1000035    1
    0.00018257381   2    1000023    1

DECAY 1000001  208.30322
    0.68203447   2    1000021    1
    0.20380008   2   -1000037    2
    0.097415506   2    1000025    1
    0.006526541   2    1000022    1
    0.005945999   2   -1000024    2
    0.0035964359   2    1000035    1
    0.00068096921   2    1000023    1

DECAY 2000003  143.75825
    0.98048134   2    1000021    3
    0.018865617   2    1000035    3
    0.00028705656   2    1000023    3
    0.0002098697   2   -1000024    4
    0.00014433188   2    1000022    3

DECAY 1000003  208.33692
    0.68192787   2    1000021    3
    0.20376852   2   -1000037    4
    0.097401925   2    1000025    3
    0.006599839   2    1000022    3
    0.0059526365   2   -1000024    4
    0.0035960461   2    1000035    3
    0.00075316878   2    1000023    3

DECAY 1000005  35.03595
    0.4771058   2   -1000024    6
    0.26419254   2    1000022    5
    0.24355819   2    1000023    5
    0.010520196   2    1000035    5
    0.0031054768   2   -1000037    6
    0.001517793   2    1000025    5

DECAY 2000005  59.70831
    0.32044859   2   -1000024    6
    0.18405003   2   -1000037    6
    0.15980803   2    1000022    5
    0.15700073   2    1000023    5
    0.10601032   2    1000006   -24
    0.069801474   2    1000025    5
    0.0028808308   2    1000035    5

DECAY 2000002  152.08133
    0.92780904   2    1000021    2
    0.071352911   2    1000035    2
    0.00068912691   2    1000023    2
    0.00013811566   2    1000022    2

DECAY 1000002  208.30505
    0.68182405   2    1000021    2
    0.18335611   2    1000037    1
    0.09653084   2    1000025    2
    0.026589669   2    1000024    1
    0.0073629129   2    1000022    2
    0.0029439581   2    1000035    2
    0.0013924504   2    1000023    2

DECAY 2000004  152.08497
    0.92778703   2    1000021    4
    0.071351313   2    1000035    4
    0.00069499715   2    1000023    4
    0.00014326346   2    1000022    4

DECAY 1000004  208.33866
    0.68171739   2    1000021    4
    0.18333095   2    1000037    3
    0.096515941   2    1000025    4
    0.026730118   2    1000024    3
    0.0073654943   2    1000022    4
    0.0029435748   2    1000035    4
    0.0013965272   2    1000023    4

DECAY 1000006  44.396998
    0.31566887   2    1000024    5
    0.21458183   2    1000023    6
    0.1790459   2    1000037    5
    0.17264057   2    1000022    6
    0.11056243   2    1000025    6
    0.0031745984   2    1000035    6
    0.0021623833   2    1000022    4
    0.0017585467   3    1000022    24    5
    0.00040488404   2    1000023    4

DECAY 2000006  249.88241
    0.31624838   2    2000005    24
    0.2370994   2    1000006    23
    0.14901833   2    1000006    25
    0.14201308   2    1000024    5
    0.06690262   2    1000023    6
    0.064862079   2    1000022    6
    0.013277315   2    1000035    6
    0.0058118777   2    1000005    24
    0.0013430762   2    1000025    6
    0.0010499635   2    1000037    5
    0.00077637134   2    1000006    36
    0.00069572671   2    2000005    37
    0.00056181502   2    1000005    37
    0.00033996712   2    1000006    35

DECAY 1000024  4.58405e-10
    0.4472022   3    1000022   -1    2
    0.21920979   3    1000022   -3    4
    0.14912226   3    1000022   -11    12
    0.14837136   3    1000022   -13    14
    0.036094391   3    1000022   -15    16

DECAY 1000037  2.9854543
    0.32095549   2    1000023    24
    0.25028786   2    1000022    24
    0.23216264   2    1000024    23
    0.17583396   2    1000024    25
    0.011312789   2    1000016   -15
    0.009173736   2   -1000015    16
    0.00014921976   3    1000024    5   -5

DECAY 1000022 -1


DECAY 1000023  4.0116826e-06
    0.11341744   3    1000022    12   -12
    0.1008427   2    1000022    22
    0.084769331   3    1000022    1   -1
    0.084730507   3    1000022    3   -3
    0.068986843   3    1000024    1   -2
    0.068986843   3   -1000024   -1    2
    0.066114497   3    1000022    2   -2
    0.065165372   3    1000024    3   -4
    0.065165372   3   -1000024   -3    4
    0.060159392   3    1000022    4   -4
    0.033333458   3    1000022    5   -5
    0.022994801   3    1000024    11   -12
    0.022994801   3   -1000024   -11    12
    0.022985909   3    1000024    13   -14
    0.022985909   3   -1000024   -13    14
    0.020658744   3    1000024    15   -16
    0.020658744   3   -1000024   -15    16
    0.019123575   3    1000022    11   -11
    0.019110515   3    1000022    13   -13
    0.01681525   3    1000022    15   -15

DECAY 1000025  3.5226321
    0.24015044   2    1000023    23
    0.22659014   2    1000024   -24
    0.22659014   2   -1000024    24
    0.14434657   2    1000023    25
    0.11895104   2    1000022    25
    0.026145839   2    1000022    23
    0.004967977   2    1000016   -16
    0.004967977   2   -1000016    16
    0.0035145771   2    1000015   -15
    0.0035145771   2   -1000015    15

DECAY 1000035  1.7472074
    0.193172   2    1000024   -24
    0.193172   2   -1000024    24
    0.15777056   2    1000022    23
    0.13543766   2    1000022    25
    0.13140583   2    1000023    25
    0.038590715   2    1000016   -16
    0.038590715   2   -1000016    16
    0.037238309   2    1000023    23
    0.034267788   2    1000015   -15
    0.034267788   2   -1000015    15
    0.0014632961   2    1000037   -24
    0.0014632961   2   -1000037    24
    0.0011926935   2    1000025    23
    0.00062121946   3    1000024    5   -6
    0.00062121946   3   -1000024   -5    6
    0.00030159268   3    1000022    5   -5
    0.0002629775   3    1000023    5   -5

DECAY 1000021  290.47235
    0.14106829   2    1000006   -6
    0.14106829   2   -1000006    6
    0.12515446   2    1000005   -5
    0.12515446   2   -1000005    5
    0.12033576   2    2000005   -5
    0.12033576   2   -2000005    5
    0.072230086   2    2000006   -6
    0.072230086   2   -2000006    6
    0.041123026   2    1000006   -4
    0.041123026   2   -1000006    4

DECAY 25  0.0035978698
    0.66154547   2   -5    5
    0.14619513   2   -24    24
    0.077394115   2   -15    15
    0.065394891   2    21    21
    0.029622912   2   -4    4
    0.016094131   2    23    23
    0.0022014217   2    22    22
    0.0010354945   2    22    23
    0.00026526987   2   -13    13
    0.00025031801   2   -3    3
    6.9210192e-07   2   -1    1
    1.5266883e-07   2   -2    2
    5.9636321e-09   2   -11    11

DECAY 35  19.539578
    0.8009318   2   -5    5
    0.18589723   2   -15    15
    0.0084920137   2   -1000024    1000024
    0.0020541321   2    1000022    1000022
    0.0013152009   2    1000022    1000023
    0.00056334127   2   -13    13
    0.00040394029   2   -3    3
    0.00015829636   2    21    21
    0.00011202931   2   -6    6
    5.8991233e-05   2    1000023    1000023
    8.5296344e-06   2    25    25
    1.7622312e-06   2   -24    24
    1.1168556e-06   2   -1    1
    8.2334851e-07   2    23    23
    4.0208518e-07   2    22    23
    3.6733315e-07   2    22    22
    1.2659461e-08   2   -11    11
    4.1293602e-09   2   -4    4
    2.1295864e-14   2   -2    2

DECAY 36  19.507577
    0.79103351   2   -5    5
    0.18359463   2   -15    15
    0.018864543   2   -1000024    1000024
    0.0045011071   2    1000022    1000022
    0.00055632855   2   -13    13
    0.00051261082   2    1000022    1000023
    0.00039889603   2   -3    3
    0.00021391184   2   -6    6
    0.00017479104   2    21    21
    0.00014604558   2    1000023    1000023
    1.4227622e-06   2    23    25
    1.1029085e-06   2   -1    1
    5.8266211e-07   2    22    22
    5.0158469e-07   2    22    23
    1.2501868e-08   2   -11    11
    3.5234479e-09   2   -4    4
    1.815473e-14   2   -2    2
    6.7582009e-36   2    25    25

DECAY 37  14.989842
    0.78719314   2   -5    6
    0.20227926   2   -15    16
    0.0070142644   2    1000023    1000024
    0.0014860545   2   -5    4
    0.0007958281   2    1000022    1000024
    0.00071514802   2   -13    14
    0.00047917646   2   -3    4
    2.1897441e-05   2   -3    2
    1.0612105e-05   2   -5    2
    2.0762166e-06   2    24    25
    1.3299932e-06   2   -1    2
    1.085633e-06   2   -3    6
    6.0902788e-08   2   -1    4
    2.5465824e-08   2   -1    6
    1.6727388e-08   2   -11    12
    1.4243341e-08   2    24    35
    1.3504086e-08   2    24    36

DECAY 6  2.43
    1   2    5    24

DECAY 15 -1
