BLOCK SPINFO
   1   SPheno
   2   v4.0.5be

BLOCK SPHENOINFO
   1   2
   2   2

BLOCK MODSEL
   1   0

BLOCK MINPAR
   3    7.8719259
   4   -1

BLOCK EXTPAR
   0    1435.052
   1    1088.8472
   2    938.77273
   3    3000
   11   -2582.2652
   12    1113.3734
   13   -1194.9793
   23   -108.13776
   25    7.5655774
   26    2096.9709
   31    1714.429
   32    1714.429
   33    1409.1555
   34    1698.2967
   35    1698.2967
   36    1036.1234
   41    5000
   42    5000
   43    1971.4936
   44    5000
   45    5000
   46    1102.967
   47    5000
   48    5000
   49    1403.7004

BLOCK SMINPUTS
   1    127.90897
   2    1.1663787e-05
   3    0.1184
   4    91.1876
   5    4.18
   6    173.2
   7    1.777
   8    0
   11    0.00051099893
   12    0
   13    0.10565837
   14    0
   21    0.005
   22    0.0025
   23    0.095
   24    1.27

BLOCK GAUGE Q=  1435.052
   1    0.35536298
   2    0.66519887
   3    1.219778

BLOCK YU Q=  1435.052
   1   1    8.4572964e-06
   2   2    0.0042963066
   3   3    1.0217093

BLOCK YD Q=  1435.052
   1   1    0.00012857421
   2   2    0.0024429101
   3   3    0.12750533

BLOCK YE Q=  1435.052
   1   1    2.243714e-05
   2   2    0.004639289
   3   3    0.078025209

BLOCK AU Q=  1435.052
   1   1    0
   2   2    0
   3   3   -2582.2652

BLOCK AD Q=  1435.052
   1   1    0
   2   2    0
   3   3    1113.3734

BLOCK AE Q=  1435.052
   1   1    0
   2   2    0
   3   3   -1194.9793

BLOCK MSOFT Q=  1435.052
   1    1088.8472
   2    938.77273
   3    3000
   21    4299521.5
   22    69758.166
   31    1714.429
   32    1714.429
   33    1409.1555
   34    1698.2967
   35    1698.2967
   36    1036.1234
   41    5000
   42    5000
   43    1971.4936
   44    5000
   45    5000
   46    1102.967
   47    5000
   48    5000
   49    1403.7004

BLOCK MASS
   6    173.2
   23    91.1876
   24    80.429995
   15    1.777
   25    120.38614
   35    2096.9247
   36    2096.9709
   37    2098.6995
   1000001    5025.4039
   2000001    5015.6608
   1000002    5024.9728
   2000002    5016.7997
   1000003    5025.4044
   2000003    5015.6611
   1000004    5024.9734
   2000004    5016.8006
   1000005    1408.0466
   2000005    1976.5894
   1000006    1033.2716
   2000006    1993.0619
   1000011    1720.4487
   2000011    1701.989
   1000012    1718.291
   1000013    1720.4484
   2000013    1701.9883
   1000014    1718.2907
   1000015    1042.383
   2000015    1416.3899
   1000016    1413.848
   1000021    3186.0137
   1000022    105.91395
   1000023   -114.43176
   1000025    991.21754
   1000035    1090.8509
   1000024    110.43211
   1000037    991.47454

BLOCK ALPHA
      -0.12698818

BLOCK HMIX Q=  1435.052
   1   -108.13776
   2    7.5655774
   3    244.06307
   4    4397287.1

BLOCK STOPMIX
   1   1    0.13077948
   1   2    0.99141148
   2   1   -0.99141148
   2   2    0.13077948

BLOCK SBOTMIX
   1   1   -0.0024807457
   1   2    0.99999692
   2   1   -0.99999692
   2   2   -0.0024807457

BLOCK STAUMIX
   1   1    0.00073981418
   1   2    0.99999973
   2   1   -0.99999973
   2   2    0.00073981418

BLOCK NMIX
   1   1    0.027351428
   1   2   -0.054116481
   1   3   -0.72053447
   1   4   -0.6907629
   2   1    0.030016025
   2   2   -0.058723393
   2   3    0.69341606
   2   4   -0.7175129
   3   1   -0.032048686
   3   2   -0.99639231
   3   3   -0.0016997045
   3   4    0.078564386
   4   1   -0.99866101
   4   2    0.028728726
   4   3    0.0011619765
   4   4   -0.043005706

BLOCK UMIX
   1   1    0.0023197188
   1   2   -0.99999731
   2   1    0.99999731
   2   2    0.0023197188

BLOCK VMIX
   1   1   -0.11365428
   1   2    0.99352036
   2   1    0.99352036
   2   2    0.11365428

BLOCK HIGGSBOUNDSINPUTHIGGSCOUPLINGSFERMIONS
       0, 57.237961,3,36,15,15

BLOCK HIGGSBOUNDSINPUTHIGGSCOUPLINGSBOSONS
       0,4,36,21,21,23

BLOCK SPHENOLOWENERGY
   1    0.00034062032
   2    1.5882282e-06
   3    3.5244069e-05
   4    2.4202717e-15
   5    1.0339127e-10
   6    2.1644576e-08
   7    8.1580232e-14
   8    3.4851053e-09
   9    7.3924174e-07
   10    9.6726445e-05
   11    0.99914715
   12    0.54371117
   13    19.426924
   14    0
   15    0
   16    0.0021645714
   17    2.2817324e-15
   18    2.4783182e-11
   19    8.2869024e-11
   20   -1.3570187e-15
   21   -5.801684e-11
   22   -1.9344826e-08
   23    0
   24    0
   25    0
   26    0
   27    0
   28    0
   29    0
   30    0
   31    0
   39   -7.3507516e-05
   40    0
   41    0
   42    0

BLOCK FWCOEF Q=  160
   305   4422   0   0   -0.18881911
   305   4422   0   2   -0.21109665
   305   4322   0   2   -0.00030182898
   305   6421   0   0   -0.095227835
   305   6421   0   2   -0.11431658
   305   6321   0   2   -0.00030701331
   3051111   4133   0   0    1.5901592
   3051111   4133   0   2    1.5919068
   3051111   4233   0   2    6.6547516e-06
   3051111   4137   0   0   -4.4128513
   3051111   4137   0   2   -4.4103214
   3051111   4237   0   2   -5.0892556e-05
   3051313   4133   0   0    1.5901592
   3051313   4133   0   2    1.5919067
   3051313   4233   0   2    6.6547489e-06
   3051313   4137   0   0   -4.4128513
   3051313   4137   0   2   -4.4103215
   3051313   4237   0   2   -5.0892557e-05
   3051212   4137   0   0    1.5053501
   3051212   4137   0   2    1.5048068
   3051212   4237   0   2    1.1094663e-05
   3051414   4137   0   0    1.5053501
   3051414   4137   0   2    1.5048068
   3051414   4237   0   2    1.1094663e-05
   3051616   4137   0   0    1.5053501
   3051616   4137   0   2    1.5048068
   3051616   4237   0   2    1.1094783e-05

BLOCK IMFWCOEF Q=  160
   305   4422   0   0    3.8581993e-07
   305   4422   0   2   -4.1888633e-06
   305   4322   0   2   -1.5101895e-06
   305   6421   0   0    3.3048029e-07
   305   6421   0   2    1.178159e-06
   305   6321   0   2   -5.5146784e-07
   3051111   4133   0   2    2.933202e-07
   3051111   4233   0   2    1.6533776e-07
   3051111   4137   0   2   -1.2474352e-06
   3051111   4237   0   2   -1.2723566e-06
   3051313   4133   0   2    2.9331847e-07
   3051313   4233   0   2    1.6533774e-07
   3051313   4137   0   2   -1.2474361e-06
   3051313   4237   0   2   -1.2723567e-06
   3051212   4137   0   2    4.1164064e-07
   3051212   4237   0   2    2.7738535e-07
   3051414   4137   0   2    4.1164064e-07
   3051414   4237   0   2    2.7738535e-07
   3051616   4137   0   2    4.1168202e-07
   3051616   4237   0   2    2.7738577e-07

DECAY 23  2.4952


DECAY 24  2.085


DECAY 2000011  2.9788392
    0.99401799   2    1000035    11
    0.002563219   2    1000023    11
    0.002131104   2    1000022    11
    0.0012876771   2    1000025    11

DECAY 1000011  10.943041
    0.61737165   2   -1000037    12
    0.31725016   2    1000025    11
    0.063049133   2    1000035    11
    0.0012498905   2    1000023    11
    0.001071787   2    1000022    11

DECAY 2000013  2.9802798
    0.99353594   2    1000035    13
    0.0026784829   2    1000023    13
    0.0022560495   2    1000022    13
    0.0012870532   2    1000025    13
    0.00024247433   2   -1000024    14

DECAY 1000013  10.943766
    0.61733044   2   -1000037    14
    0.31722898   2    1000025    13
    0.063044915   2    1000035    13
    0.0012818842   2    1000023    13
    0.0011064011   2    1000022    13

DECAY 1000015  0.25537417
    0.48334432   2   -1000024    16
    0.26624421   2    1000022    15
    0.25021813   2    1000023    15
    0.0001932697   2    1000025    15

DECAY 2000015  5.3636993
    0.604626   2   -1000037    16
    0.31084662   2    1000025    15
    0.049019835   2    1000035    15
    0.018229074   2    1000022    15
    0.017251678   2    1000023    15

DECAY 1000012  10.995735
    0.60420631   2    1000037    11
    0.29365163   2    1000025    12
    0.077484535   2    1000035    12
    0.017623094   2    1000024    11
    0.003810104   2    1000023    12
    0.0032243257   2    1000022    12

DECAY 1000014  10.996458
    0.60416621   2    1000037    13
    0.29363214   2    1000025    14
    0.077479382   2    1000035    14
    0.017688303   2    1000024    13
    0.0038098526   2    1000023    14
    0.003224113   2    1000022    14

DECAY 1000016  5.4300852
    0.58439604   2    1000037    15
    0.28416443   2    1000025    16
    0.060410479   2    1000024    15
    0.059337734   2    1000035    16
    0.0063213911   2    1000023    16
    0.0053527977   2    1000022    16

DECAY 2000001  143.41112
    0.98227449   2    1000021    1
    0.017674801   2    1000035    1

DECAY 1000001  203.8229
    0.69611106   2    1000021    1
    0.20047673   2   -1000037    2
    0.098384338   2    1000025    1
    0.0042044364   2    1000035    1
    0.000445003   2    1000023    1
    0.00037727097   2    1000022    1

DECAY 2000003  143.41233
    0.98226636   2    1000021    3
    0.017674652   2    1000035    3

DECAY 1000003  203.8254
    0.6961028   2    1000021    3
    0.2004744   2   -1000037    4
    0.098383143   2    1000025    3
    0.0042043853   2    1000035    3
    0.00044639962   2    1000023    3
    0.00037878065   2    1000022    3

DECAY 1000005  1.0126069
    0.43049858   2   -1000024    6
    0.23184168   2    1000022    5
    0.2136538   2    1000023    5
    0.12374629   2    1000035    5
    0.00021520854   2    1000025    5

DECAY 2000005  89.554856
    0.44270714   2   -1000024    6
    0.38053977   2    1000006   -24
    0.11345491   2   -1000037    6
    0.05341927   2    1000025    5
    0.0040150311   2    1000022    5
    0.0038116543   2    1000023    5
    0.0020045505   2    1000035    5

DECAY 2000002  151.15851
    0.93271372   2    1000021    2
    0.067093879   2    1000035    2

DECAY 1000002  203.81815
    0.69590704   2    1000021    2
    0.19787306   2    1000037    1
    0.10065675   2    1000025    2
    0.0028007687   2    1000024    1
    0.0021905702   2    1000035    2
    0.00030886841   2    1000023    2
    0.00026293506   2    1000022    2

DECAY 2000004  151.16222
    0.93269103   2    1000021    4
    0.067092265   2    1000035    4

DECAY 1000004  203.8206
    0.6958987   2    1000021    4
    0.19787072   2    1000037    3
    0.10065561   2    1000025    4
    0.0028036519   2    1000024    3
    0.0021905576   2    1000035    4
    0.00031351973   2    1000023    4
    0.00026724705   2    1000022    4

DECAY 1000006  40.407824
    0.51359759   2    1000024    5
    0.25193895   2    1000023    6
    0.23446077   2    1000022    6

DECAY 2000006  96.533737
    0.23733905   2    1000006    25
    0.21394408   2    1000023    6
    0.19854967   2    1000022    6
    0.18066063   2    1000006    23
    0.10453956   2    1000037    5
    0.055055337   2    1000025    6
    0.0078855198   2    1000024    5
    0.0019849521   2    1000035    6

DECAY 1000024  2.1024227e-09
    0.39872304   3    1000022   -1    2
    0.27258211   3    1000022   -3    4
    0.13290963   3    1000022   -11    12
    0.13254737   3    1000022   -13    14
    0.063237849   3    1000022   -15    16

DECAY 1000037  8.1913887
    0.25784992   2    1000023    24
    0.2486813   2    1000024    23
    0.2407848   2    1000024    25
    0.23945041   2    1000022    24
    0.0051967133   3    1000023   -5    6
    0.0041354199   3    1000022   -5    6
    0.003888761   3    1000024    6   -6

DECAY 1000022 -1


DECAY 1000023  1.6360636e-07
    0.27999876   2    1000022    22
    0.17262143   3    1000022    12   -12
    0.12907963   3    1000022    1   -1
    0.12889299   3    1000022    3   -3
    0.1006708   3    1000022    2   -2
    0.074688932   3    1000022    4   -4
    0.029129327   3    1000022    11   -11
    0.029063041   3    1000022    13   -13
    0.015125463   3    1000022    15   -15
    0.0084337278   3    1000024    1   -2
    0.0084337278   3   -1000024   -1    2
    0.0051923581   3    1000024    3   -4
    0.0051923581   3   -1000024   -3    4
    0.0028113061   3    1000024    11   -12
    0.0028113061   3   -1000024   -11    12
    0.0028015517   3    1000024    13   -14
    0.0028015517   3   -1000024   -13    14
    0.0010818862   3    1000024    15   -16
    0.0010818862   3   -1000024   -15    16

DECAY 1000025  8.7945666
    0.24466787   2    1000024   -24
    0.24466787   2   -1000024    24
    0.17893378   2    1000023    25
    0.11268037   2    1000022    23
    0.11086472   2    1000023    23
    0.09705538   2    1000022    25
    0.0038570509   3    1000024    5   -6
    0.0038570509   3   -1000024   -5    6
    0.0017848167   3    1000023    6   -6
    0.0016174597   3    1000022    6   -6

DECAY 1000035  2.9872243
    0.20834891   2    1000024   -24
    0.20834891   2   -1000024    24
    0.18896408   2    1000023    25
    0.13458478   2    1000022    23
    0.1297021   2    1000023    23
    0.10261093   2    1000022    25
    0.0069029464   2    1000015   -15
    0.0069029464   2   -1000015    15
    0.0039222822   3    1000024    5   -6
    0.0039222822   3   -1000024   -5    6
    0.0023753149   3    1000023    6   -6
    0.0021989063   3    1000022    6   -6
    0.00059345258   2    1000037   -24
    0.00059345258   2   -1000037    24

DECAY 1000021  206.23362
    0.17718189   2    1000006   -6
    0.17718189   2   -1000006    6
    0.14804943   2    1000005   -5
    0.14804943   2   -1000005    5
    0.088047262   2    2000006   -6
    0.088047262   2   -2000006    6
    0.086505451   2    2000005   -5
    0.086505451   2   -2000005    5
    0.00020351003   3    1000035    6   -6

DECAY 25  0.0033756484
    0.64147314   2   -5    5
    0.15775127   2   -24    24
    0.074666164   2    21    21
    0.073308196   2   -15    15
    0.031524371   2   -4    4
    0.017402716   2    23    23
    0.0022763694   2    22    22
    0.0011017109   2    22    23
    0.00025427106   2   -13    13
    0.00024095358   2   -3    3
    6.6621262e-07   2   -1    1
    1.6246762e-07   2   -2    2
    5.7163608e-09   2   -11    11

DECAY 35  20.466616
    0.2562648   2   -1000024    1000037
    0.2562648   2   -1000037    1000024
    0.15466205   2    1000022    1000025
    0.09660306   2    1000023    1000025
    0.073135521   2   -5    5
    0.066640421   2   -6    6
    0.040843528   2    1000022    1000035
    0.026271129   2    1000023    1000035
    0.012854396   2   -15    15
    0.011481747   2   -1000024    1000024
    0.0026937348   2    1000022    1000022
    0.0017138525   2    1000023    1000023
    0.00024620189   2    25    25
    0.00014741031   2    1000022    1000023
    4.4536684e-05   2   -13    13
    4.2479798e-05   2    23    23
    2.7888724e-05   2   -3    3
    2.1044673e-05   2   -24    24
    2.0512711e-05   2    21    21
    1.2671379e-05   2   -1000037    1000037
    5.8251136e-06   2    1000025    1000025
    8.9550028e-07   2   -4    4
    8.8565311e-07   2   -1000015    1000015
    4.8320618e-07   2    1000025    1000035
    7.7104158e-08   2   -1    1
    2.3849791e-08   2    22    22
    2.1728405e-08   2    22    23
    1.0003758e-09   2   -11    11
    4.6166296e-12   2   -2    2

DECAY 36  20.388312
    0.25724559   2   -1000024    1000037
    0.25724559   2   -1000037    1000024
    0.14513561   2    1000023    1000025
    0.10697451   2    1000022    1000025
    0.071505575   2   -5    5
    0.065270184   2   -6    6
    0.038253081   2    1000023    1000035
    0.029083741   2    1000022    1000035
    0.012567754   2   -15    15
    0.01172464   2   -1000024    1000024
    0.00295883   2    1000023    1000023
    0.0016727998   2    1000022    1000022
    9.7969172e-05   2   -1000037    1000037
    5.8225444e-05   2    23    25
    4.9063415e-05   2    21    21
    4.6424294e-05   2    1000025    1000025
    4.3543353e-05   2   -13    13
    2.72664e-05   2   -3    3
    2.2867592e-05   2    1000022    1000023
    1.5718379e-05   2    1000025    1000035
    8.5209835e-07   2   -4    4
    7.5383609e-08   2   -1    1
    5.0663749e-08   2    22    22
    4.0376289e-08   2    22    23
    9.7806713e-10   2   -11    11
    4.393153e-12   2   -2    2
    5.3361894e-39   2    25    25

DECAY 37  20.406194
    0.27134988   2    1000022    1000037
    0.26622753   2    1000024    1000025
    0.2510155   2    1000023    1000037
    0.13914873   2   -5    6
    0.057458719   2    1000024    1000035
    0.012745155   2   -15    16
    0.00085964069   2    1000022    1000024
    0.00084115619   2    1000023    1000024
    0.00010579675   2   -5    4
    9.6207071e-05   2   -3    6
    5.8394437e-05   2    24    25
    4.5058706e-05   2   -13    14
    2.6253364e-05   2   -3    4
    1.5488447e-05   2    1000035    1000037
    4.4107944e-06   2   -1    6
    1.1838463e-06   2   -3    2
    7.5548871e-07   2   -5    2
    7.0434919e-08   2   -1    2
    4.3874922e-08   2   -1    4
    2.2768205e-08   2    1000025    1000037
    1.0539278e-09   2   -11    12
    1.1742046e-12   2    24    35
    1.0289501e-12   2    24    36

DECAY 6  2.43
    1   2    5    24

DECAY 15 -1
