BLOCK DCINFO
   1   SDECAY/HDECAY
   2   1.3b /3.4

BLOCK SPINFO
   1   SOFTSUSY
   2   3.4.0

BLOCK MODSEL
   1   0

BLOCK SMINPUTS
   1    127.90897
   2    1.1663787e-05
   3    0.1184
   4    91.1876
   5    4.18
   6    173.2
   7    1.777

BLOCK MINPAR
   3    13.19

BLOCK EXTPAR
   0   -1
   1    1120.19
   2    2422.32
   3    968.2
   11   -3362.28
   12   -2247.77
   13    2122.49
   23    2838.06
   26    2778.01
   31    1961.36
   32    1961.36
   33    1792.33
   34    2401.72
   35    2401.72
   36    3915.17
   41    3037.49
   42    3037.49
   43    3875.17
   44    3031.75
   45    3031.75
   46    3702.95
   47    3185.11
   48    3185.11
   49    3744.32

BLOCK MASS
   24    80.395931
   25    124.46462
   35    2778.0554
   36    2778.0099
   37    2779.2771
   5    4.8187603
   1000001    3092.7672
   2000001    3221.3197
   1000002    3091.8926
   2000002    3068.3262
   1000003    3092.7672
   2000003    3221.3197
   1000004    3091.8926
   2000004    3068.3262
   1000005    3779.4233
   2000005    3900.6564
   1000006    3677.6429
   2000006    3921.0392
   1000011    1993.6074
   2000011    2406.2231
   1000012    1991.743
   1000013    1993.6074
   2000013    2406.2231
   1000014    1991.743
   1000015    1826.1213
   2000015    3917.8681
   1000016    1824.207
   1000021    1189.646
   1000022    1107.6002
   1000023    2441.8223
   1000025   -2892.474
   1000035    2899.9718
   1000024    2441.9851
   1000037    2900.1898

BLOCK NMIX
   1   1    0.99979182
   1   2   -0.00056858548
   1   3    0.018586966
   1   4   -0.0083975734
   2   1    0.0030488904
   2   2    0.99189748
   2   3   -0.096187342
   2   4    0.082934236
   3   1   -0.007197816
   3   2    0.009450709
   3   3    0.70695354
   3   4    0.70716022
   4   1   -0.018847109
   4   2    0.1266876
   4   3    0.70044216
   4   4   -0.70212237

BLOCK UMIX
   1   1    0.99060193
   1   2   -0.13677649
   2   1    0.13677649
   2   2    0.99060193

BLOCK VMIX
   1   1    0.9930058
   1   2   -0.11806561
   2   1    0.11806561
   2   2    0.9930058

BLOCK STOPMIX
   1   1    0.28569721
   1   2    0.95831994
   2   1   -0.95831994
   2   2    0.28569721

BLOCK SBOTMIX
   1   1    0.094041146
   1   2    0.99556831
   2   1   -0.99556831
   2   2    0.094041146

BLOCK STAUMIX
   1   1    0.99998676
   1   2    0.0051450777
   2   1   -0.0051450777
   2   2    0.99998676

BLOCK ALPHA
      -0.079680054

BLOCK HMIX Q=  3789.244
   1    2882.8302
   2    12.556999
   3    242.80005
   4    8195357.8

BLOCK GAUGE Q=  3789.244
   1    0.3654483
   2    0.6355993
   3    1.0198581

BLOCK AU Q=  3789.244
   1   1    0
   2   2    0
   3   3   -3362.28

BLOCK AD Q=  3789.244
   1   1    0
   2   2    0
   3   3   -2247.77

BLOCK AE Q=  3789.244
   1   1    0
   2   2    0
   3   3    2122.49

BLOCK YU Q=  3789.244
   1   1    0
   2   2    0
   3   3    0.81498677

BLOCK YD Q=  3789.244
   1   1    0
   2   2    0
   3   3    0.16513766

BLOCK YE Q=  3789.244
   1   1    0
   2   2    0
   3   3    0.13234099

BLOCK MSOFT Q=  3789.244
   1    1120.19
   2    2422.32
   3    968.2
   21   -826958.23
   22   -8034593.5
   31    1961.36
   32    1961.36
   33    1792.33
   34    2401.72
   35    2401.72
   36    3915.17
   41    3037.49
   42    3037.49
   43    3875.17
   44    3031.75
   45    3031.75
   46    3702.95
   47    3185.11
   48    3185.11
   49    3744.32

BLOCK HIGGSBOUNDSINPUTHIGGSCOUPLINGSFERMIONS
       0, 157.67822,3,36,15,15

BLOCK HIGGSBOUNDSINPUTHIGGSCOUPLINGSBOSONS
       0,4,36,21,21,23

DECAY 6  1.4225142
    1   2    5    24

DECAY 1000021  3.5018422e-09
    0.38422269   3    1000022    2   -2
    0.38422269   3    1000022    4   -4
    0.094353391   3    1000022    1   -1
    0.094353391   3    1000022    3   -3
    0.041271055   3    1000022    5   -5
    0.0015767759   2    1000022    21

DECAY 1000006  186.58338
    0.88328599   2    1000021    6
    0.03578542   2    1000022    6
    0.031981601   2    1000037    5
    0.020471066   2    1000025    6
    0.014958308   2    1000035    6
    0.0091074983   2    1000024    5
    0.0044101155   2    1000023    6

DECAY 2000006  206.5874
    0.845368   2    1000021    6
    0.04722065   2    1000024    5
    0.029197767   2    1000035    6
    0.023456341   2    1000025    6
    0.023251432   2    1000023    6
    0.0097559979   2    1000006    23
    0.0090503685   2    1000037    5
    0.0075959582   2    1000006    25
    0.0048101758   2    1000022    6
    0.00029331309   2    1000005    24

DECAY 1000005  172.05584
    0.98396125   2    1000021    5
    0.010817772   2    1000022    5
    0.001849185   2   -1000037    6
    0.0010131377   2    1000025    5
    0.00096740141   2   -1000024    6
    0.00089229222   2    1000035    5
    0.00049408725   2    1000023    5
    4.8709482e-06   2    1000006   -24

DECAY 2000005  208.39694
    0.84948221   2    1000021    5
    0.052914428   2   -1000024    6
    0.049921089   2   -1000037    6
    0.026940289   2    1000023    5
    0.01592918   2    1000006   -24
    0.0023666988   2    1000022    5
    0.0013544888   2    1000035    5
    0.0010389946   2    1000025    5
    5.2620113e-05   2    1000005    23

DECAY 1000002  165.07039
    0.96694921   2    1000021    2
    0.020657016   2    1000024    1
    0.010322112   2    1000023    2
    0.0020237633   2    1000022    2
    3.0964281e-05   2    1000037    1
    1.6860233e-05   2    1000035    2
    7.7976382e-08   2    1000025    2

DECAY 2000002  162.86197
    0.96738594   2    1000021    2
    0.032613794   2    1000022    2
    1.8487035e-07   2    1000035    2
    5.4716146e-08   2    1000023    2
    2.9295128e-08   2    1000025    2

DECAY 1000001  165.14361
    0.96698391   2    1000021    1
    0.020591861   2   -1000024    2
    0.010315211   2    1000023    1
    0.0020479413   2    1000022    1
    4.188754e-05   2   -1000037    2
    1.9048086e-05   2    1000035    1
    1.4146812e-07   2    1000025    1

DECAY 2000001  172.31152
    0.99168139   2    1000021    1
    0.0083184273   2    1000022    1
    1.4150344e-07   2    1000035    1
    2.1543264e-08   2    1000025    1
    1.8198913e-08   2    1000023    1

DECAY 1000004  129.38688
    0.9570794   2    1000021    4
    0.026803976   2    1000024    3
    0.013393719   2    1000023    4
    0.0026631078   2    1000022    4
    3.8653784e-05   2    1000037    3
    2.1047398e-05   2    1000035    4
    9.748399e-08   2    1000025    4

DECAY 2000004  127.71083
    0.95709982   2    1000021    4
    0.042899841   2    1000022    4
    2.2957099e-07   2    1000035    4
    7.0917514e-08   2    1000023    4
    3.6440581e-08   2    1000025    4

DECAY 1000003  129.44309
    0.95712323   2    1000021    3
    0.026720282   2   -1000024    4
    0.013385278   2    1000023    3
    0.0026949479   2    1000022    3
    5.2297086e-05   2   -1000037    4
    2.3783609e-05   2    1000035    3
    1.7689512e-07   2    1000025    3

DECAY 2000003  134.05037
    0.98897237   2    1000021    3
    0.011027397   2    1000022    3
    1.8110341e-07   2    1000035    3
    2.7593537e-08   2    1000025    3
    2.3868651e-08   2    1000023    3

DECAY 1000011  1.2627836
    1   2    1000022    11

DECAY 2000011  7.9387016
    1   2    1000022    11

DECAY 1000013  1.2627835
    1   2    1000022    13

DECAY 2000013  7.9387016
    1   2    1000022    13

DECAY 1000015  0.96735619
    1   2    1000022    15

DECAY 2000015  19.155749
    0.91964396   2    1000022    15
    0.024761154   2    1000016   -24
    0.014386598   2   -1000037    16
    0.013264786   2    1000015    25
    0.012773124   2    1000015    23
    0.0073873823   2    1000025    15
    0.0072772037   2    1000035    15
    0.00033604726   2   -1000024    16
    0.00016974676   2    1000023    15

DECAY 1000012  1.2644865
    1   2    1000022    12

DECAY 1000014  1.2644865
    1   2    1000022    14

DECAY 1000016  0.96747613
    1   2    1000022    16

DECAY 1000024  8.1068578
    0.23338473   2    1000016   -15
    0.23085564   2   -1000015    16
    0.13375783   2    1000012   -11
    0.13375783   2    1000014   -13
    0.13212196   2   -1000011    12
    0.13212196   2   -1000013    14
    0.0040000553   2    1000022    24

DECAY 1000037  11.276433
    0.26751722   2    1000024    25
    0.25926682   2    1000024    23
    0.25764611   2    1000023    24
    0.16854867   2    1000022    24
    0.021284669   2    1000016   -15
    0.0069337855   2   -1000015    16
    0.0053795428   2   -1000011    12
    0.0053795428   2   -1000013    14
    0.0040218212   2    1000012   -11
    0.0040218212   2    1000014   -13

DECAY 1000022 -1


DECAY 1000023  8.1056723
    0.11622471   2    1000015   -15
    0.11622471   2   -1000015    15
    0.11587417   2    1000016   -16
    0.11587417   2   -1000016    16
    0.066464112   2    1000012   -12
    0.066464112   2   -1000012    12
    0.066464112   2    1000014   -14
    0.066464112   2   -1000014    14
    0.066438089   2    1000011   -11
    0.066438089   2   -1000011    11
    0.066438089   2    1000013   -13
    0.066438089   2   -1000013    13
    0.0038466743   2    1000022    25
    0.00034672246   2    1000022    23
    6.233741e-09   2    2000011   -11
    6.233741e-09   2   -2000011    11
    6.233741e-09   2    2000013   -13
    6.233741e-09   2   -2000013    13

DECAY 1000025  10.547338
    0.26373216   2    1000023    23
    0.26312528   2    1000024   -24
    0.26312528   2   -1000024    24
    0.16634527   2    1000022    23
    0.024767402   2    1000022    25
    0.0086372102   2    1000015   -15
    0.0086372102   2   -1000015    15
    0.0014123729   2    1000023    25
    3.6906843e-05   2    1000016   -16
    3.6906843e-05   2   -1000016    16
    2.8135484e-05   2    1000012   -12
    2.8135484e-05   2   -1000012    12
    2.8135484e-05   2    1000014   -14
    2.8135484e-05   2   -1000014    14
    4.2849667e-06   2    1000011   -11
    4.2849667e-06   2   -1000011    11
    4.2849667e-06   2    1000013   -13
    4.2849667e-06   2   -1000013    13
    3.5800683e-06   2    2000011   -11
    3.5800683e-06   2   -2000011    11
    3.5800683e-06   2    2000013   -13
    3.5800683e-06   2   -2000013    13

DECAY 1000035  11.163782
    0.2682895   2    1000023    25
    0.2506596   2    1000024   -24
    0.2506596   2   -1000024    24
    0.15934136   2    1000022    25
    0.022274528   2    1000022    23
    0.010563322   2    1000015   -15
    0.010563322   2   -1000015    15
    0.0036048647   2    1000016   -16
    0.0036048647   2   -1000016    16
    0.0027549546   2    1000012   -12
    0.0027549546   2   -1000012    12
    0.0027549546   2    1000014   -14
    0.0027549546   2   -1000014    14
    0.0019485157   2    1000011   -11
    0.0019485157   2   -1000011    11
    0.0019485157   2    1000013   -13
    0.0019485157   2   -1000013    13
    0.001529989   2    1000023    23
    2.3793436e-05   2    2000011   -11
    2.3793436e-05   2   -2000011    11
    2.3793436e-05   2    2000013   -13
    2.3793436e-05   2   -2000013    13

DECAY 25  0.0040736604
    0.61516175   2    5   -5
    0.19439391   2    24   -24
    0.077377134   2    21    21
    0.063571462   2   -15    15
    0.024076375   2    23    23
    0.021216404   2    4   -4
    0.0022706952   2    22    22
    0.0014614505   2    22    23
    0.00024579462   2    3   -3
    0.00022502114   2   -13    13

DECAY 35  6.5527954
    0.75690605   2    5   -5
    0.13204704   2   -15    15
    0.10993023   2    6   -6
    0.00046621246   2   -13    13
    0.00027726054   2    3   -3
    0.00019761239   2    25    25
    7.2352768e-05   2    1000022    1000022
    4.6729026e-05   2    24   -24
    3.1867533e-05   2    21    21
    2.3307707e-05   2    23    23
    1.1206898e-06   2    4   -4
    1.5168093e-07   2    22    22
    6.2674524e-08   2    23    22

DECAY 36  6.5579311
    0.75646907   2    5   -5
    0.13194623   2   -15    15
    0.11038961   2    6   -6
    0.00046585579   2   -13    13
    0.00027717292   2    3   -3
    0.0002293128   2    1000022    1000022
    0.00017390162   2    21    21
    4.7279063e-05   2    23    25
    1.1241913e-06   2    4   -4
    2.6225689e-07   2    22    22
    1.8387533e-07   2    23    22

DECAY 37  6.2525713
    0.85943815   2    6   -5
    0.13845328   2   -15    16
    0.0012556986   2    4   -5
    0.00048882988   2   -13    14
    0.00028726111   2    4   -3
    4.9692337e-05   2    24    25
    1.4536907e-05   2    2   -3
    1.255695e-05   2    2   -5
    6.8740531e-13   2    24    36

DECAY 5 -1


DECAY 15 -1


DECAY 23  2.4952


DECAY 24  2.085
