BLOCK SPINFO
   1   SPheno
   2   v4.0.5be

BLOCK SPHENOINFO
   1   2
   2   2

BLOCK MODSEL
   1   0

BLOCK MINPAR
   3    43.298307
   4    1

BLOCK EXTPAR
   0    1527.6653
   1   -174.66507
   2    1962.7414
   3    3000
   11    4135.9497
   12    1738.699
   13   -733.2469
   23    1223.8535
   25    41.945309
   26    3580.8362
   31    1051.9777
   32    1051.9777
   33    1633.3802
   34    1654.598
   35    1654.598
   36    1654.4747
   41    5000
   42    5000
   43    1498.875
   44    5000
   45    5000
   46    1686.8683
   47    5000
   48    5000
   49    1504.7319

BLOCK SMINPUTS
   1    127.90897
   2    1.1663787e-05
   3    0.1184
   4    91.1876
   5    4.18
   6    173.2
   7    1.777
   8    0
   11    0.00051099893
   12    0
   13    0.10565837
   14    0
   21    0.005
   22    0.0025
   23    0.095
   24    1.27

BLOCK GAUGE Q=  1527.6653
   1    0.35536298
   2    0.66519887
   3    1.219778

BLOCK YU Q=  1527.6653
   1   1    8.3867545e-06
   2   2    0.0042604713
   3   3    1.0131873

BLOCK YD Q=  1527.6653
   1   1    0.00070689935
   2   2    0.013431088
   3   3    0.70102264

BLOCK YE Q=  1527.6653
   1   1    0.00012335911
   2   2    0.025506751
   3   3    0.42898158

BLOCK AU Q=  1527.6653
   1   1    0
   2   2    0
   3   3    4135.9498

BLOCK AD Q=  1527.6653
   1   1    0
   2   2    0
   3   3    1738.6989

BLOCK AE Q=  1527.6653
   1   1    0
   2   2    0
   3   3   -733.2469

BLOCK MSOFT Q=  1527.6653
   1   -174.66507
   2    1962.7414
   3    3000
   21    11370618
   22   -1416113.2
   31    1051.9777
   32    1051.9777
   33    1633.3802
   34    1654.598
   35    1654.598
   36    1654.4747
   41    5000
   42    5000
   43    1498.875
   44    5000
   45    5000
   46    1686.8683
   47    5000
   48    5000
   49    1504.7319

BLOCK MASS
   6    173.2
   23    91.1876
   24    80.429995
   15    1.777
   25    124.60137
   35    3581.664
   36    3580.8362
   37    3580.7296
   1000001    5027.9827
   2000001    5020.6735
   1000002    5027.554
   2000002    5023.0271
   1000003    5027.9929
   2000003    5020.6743
   1000004    5027.558
   2000004    5023.0278
   1000005    1483.4427
   2000005    1545.1229
   1000006    1343.8252
   2000006    1736.6555
   1000011    1070.1147
   2000011    1654.2056
   1000012    1066.8664
   1000013    1070.1193
   2000013    1654.2142
   1000014    1066.8811
   1000015    1622.8015
   2000015    1681.4987
   1000016    1646.9603
   1000021    3191.7964
   1000022   -175.00583
   1000023    1228.6004
   1000025   -1232.401
   1000035    2001.2973
   1000024    1228.5924
   1000037    2001.4862

BLOCK ALPHA
      -0.023112268

BLOCK HMIX Q=  1527.6653
   1    1223.8535
   2    41.945309
   3    243.95784
   4    12822388

BLOCK STOPMIX
   1   1   -0.81035938
   1   2    0.58593317
   2   1   -0.58593317
   2   2   -0.81035938

BLOCK SBOTMIX
   1   1    0.90890044
   1   2    0.41701317
   2   1   -0.41701317
   2   2    0.90890044

BLOCK STAUMIX
   1   1    0.74716026
   1   2    0.66464392
   2   1   -0.66464392
   2   2    0.74716026

BLOCK NMIX
   1   1    0.99930856
   1   2    0.00018543764
   1   3    0.03689135
   1   4    0.0046262668
   2   1    0.022784482
   2   2    0.072295484
   2   3   -0.70586509
   2   4    0.70427886
   3   1   -0.029350896
   3   2    0.016841028
   3   3    0.70629592
   3   4    0.70710747
   4   1    0.0013419277
   4   2   -0.99724105
   4   3   -0.039237522
   4   4    0.062999267

BLOCK UMIX
   1   1   -0.055408291
   1   2    0.99846378
   2   1    0.99846378
   2   2    0.055408291

BLOCK VMIX
   1   1   -0.089106722
   1   2    0.99602208
   2   1    0.99602208
   2   2    0.089106722

BLOCK HIGGSBOUNDSINPUTHIGGSCOUPLINGSFERMIONS
       0, 1759.409,3,36,15,15

BLOCK HIGGSBOUNDSINPUTHIGGSCOUPLINGSBOSONS
       0,4,36,21,21,23

BLOCK SPHENOLOWENERGY
   1    0.00036117429
   2    1.5868633e-06
   3    3.5237616e-05
   4    4.7664076e-15
   5    2.036164e-10
   6    4.2669759e-08
   7    1.599775e-13
   8    6.8342637e-09
   9    1.4511537e-06
   10    9.5159863e-05
   11    0.98296495
   12    0.54406287
   13    19.432507
   14    0
   15    0
   16    0.0021742274
   17    2.2818315e-15
   18    2.479896e-11
   19    8.289774e-11
   20    4.0414877e-15
   21    1.7277324e-10
   22    4.4566348e-08
   23    0
   24    0
   25    0
   26    0
   27    0
   28    0
   29    0
   30    0
   31    0
   39    7.8138384e-05
   40    0
   41    0
   42    0

BLOCK FWCOEF Q=  160
   305   4422   0   0   -0.18881911
   305   4422   0   2   -0.23497345
   305   4322   0   2   -0.00034518853
   305   6421   0   0   -0.095227835
   305   6421   0   2   -0.12490354
   305   6321   0   2   -0.00025188667
   3051111   4133   0   0    1.5930272
   3051111   4133   0   2    1.5937719
   3051111   4233   0   2    0.00027274153
   3051111   4137   0   0   -4.4157193
   3051111   4137   0   2   -4.4126614
   3051111   4237   0   2   -0.0021198158
   3051313   4133   0   0    1.5930272
   3051313   4133   0   2    1.593768
   3051313   4233   0   2    0.00027274048
   3051313   4137   0   0   -4.4157193
   3051313   4137   0   2   -4.4126654
   3051313   4237   0   2   -0.0021198186
   3051212   4137   0   0    1.5053501
   3051212   4137   0   2    1.5046869
   3051212   4237   0   2    0.00046186925
   3051414   4137   0   0    1.5053501
   3051414   4137   0   2    1.5046869
   3051414   4237   0   2    0.0004618693
   3051616   4137   0   0    1.5053501
   3051616   4137   0   2    1.5046872
   3051616   4237   0   2    0.00046188201

BLOCK IMFWCOEF Q=  160
   305   4422   0   0    3.8553964e-07
   305   4422   0   2    2.2858618e-05
   305   4322   0   2   -4.5368609e-06
   305   6421   0   0    3.302402e-07
   305   6421   0   2   -6.9805306e-06
   305   6321   0   2   -2.3439092e-06
   3051111   4133   0   2   -1.1294335e-06
   3051111   4233   0   2    5.43947e-06
   3051111   4137   0   2    9.9517924e-06
   3051111   4237   0   2   -4.2283105e-05
   3051313   4133   0   2   -1.129407e-06
   3051313   4233   0   2    5.4394553e-06
   3051313   4137   0   2    9.9518243e-06
   3051313   4237   0   2   -4.2283157e-05
   3051212   4137   0   2   -2.1102019e-06
   3051212   4237   0   2    9.2127379e-06
   3051414   4137   0   2   -2.1102032e-06
   3051414   4237   0   2    9.2127379e-06
   3051616   4137   0   2   -2.106108e-06
   3051616   4237   0   2    9.2127483e-06

DECAY 23  2.4952


DECAY 24  2.085


DECAY 1000011  1.2724154
    1   2    1000022    11

DECAY 2000011  8.1178124
    0.99971847   2    1000022    11
    0.00017464364   2    1000025    11
    0.00010686738   2    1000023    11

DECAY 1000013  1.2724396
    1   2    1000022    13

DECAY 2000013  8.1297605
    0.99825809   2    1000022    13
    0.00052787468   2   -1000024    14
    0.00043460058   2    1000025    13
    0.00040884587   2    1000013    25
    0.00037059112   2    1000023    13

DECAY 1000015  6.4268122
    0.74033998   2    1000022    15
    0.092192153   2    1000023    15
    0.089213154   2   -1000024    16
    0.078254716   2    1000025    15

DECAY 2000015  7.3403544
    0.73552687   2    1000022    15
    0.094546236   2    1000025    15
    0.086487228   2   -1000024    16
    0.083410067   2    1000023    15

DECAY 1000012  1.266367
    1   2    1000022    12

DECAY 1000014  1.2663865
    1   2    1000022    14

DECAY 1000016  3.2287277
    0.62507263   2    1000022    16
    0.37286831   2    1000024    15
    0.0015964546   2    1000023    16
    0.00045984619   2    1000025    16

DECAY 2000001  143.49487
    0.98051608   2    1000021    1
    0.019459461   2    1000022    1

DECAY 1000001  189.22267
    0.74758351   2    1000021    1
    0.16514624   2   -1000037    2
    0.082416341   2    1000035    1
    0.0036869168   2    1000022    1
    0.00063493511   2   -1000024    2
    0.00048162452   2    1000023    1

DECAY 2000003  143.5267
    0.98029922   2    1000021    3
    0.019455319   2    1000022    3
    0.00011061442   2   -1000024    4

DECAY 1000003  189.2414
    0.74751511   2    1000021    3
    0.16513054   2   -1000037    4
    0.082408588   2    1000035    3
    0.0036866883   2    1000022    3
    0.00064326809   2   -1000024    4
    0.00052345993   2    1000023    3

DECAY 1000005  6.8124029
    0.55684622   2    1000006   -24
    0.16824333   2   -1000024    6
    0.1081248   2    1000023    5
    0.098430125   2    1000025    5
    0.068355528   2    1000022    5

DECAY 2000005  8.5701924
    0.37193445   2    1000006   -24
    0.32274232   2   -1000024    6
    0.12023689   2    1000025    5
    0.11477439   2    1000023    5
    0.070311952   2    1000022    5

DECAY 2000002  152.13224
    0.92645681   2    1000021    2
    0.073453154   2    1000022    2

DECAY 1000002  189.21293
    0.74738612   2    1000021    2
    0.1643234   2    1000037    1
    0.082329312   2    1000035    2
    0.0037021899   2    1000022    2
    0.0016422455   2    1000024    1
    0.00060280233   2    1000023    2

DECAY 2000004  152.13546
    0.92643732   2    1000021    4
    0.073451601   2    1000022    4

DECAY 1000004  189.23085
    0.74731721   2    1000021    4
    0.16430829   2    1000037    3
    0.082321664   2    1000035    4
    0.0037018419   2    1000022    4
    0.0017258838   2    1000024    3
    0.00060693846   2    1000023    4

DECAY 1000006  1.5984719
    0.67638353   2    1000022    6
    0.28770907   2    1000024    5
    0.034618641   2    1000022    4
    0.0011030062   3    1000022    24    5
    0.00017729092   2    1000023    4

DECAY 2000006  62.146045
    0.38375125   2    1000006    23
    0.27372576   2    1000005    24
    0.12345933   2    1000024    5
    0.058712892   2    1000006    25
    0.049293176   2    1000023    6
    0.047611978   2    1000025    6
    0.040298628   2    1000022    6
    0.023146985   2    2000005    24

DECAY 1000024  0.84641694
    0.96613738   2    1000022    24
    0.024563053   3    1000022   -5    6
    0.003636105   2    1000014   -13
    0.0030684359   2    1000012   -11
    0.0011424793   2   -1000011    12
    0.0011424176   2   -1000013    14
    0.00030947957   3    1000022   -15    16

DECAY 1000037  45.702299
    0.13740339   2    1000006   -5
    0.098004807   2   -1000011    12
    0.098004132   2   -1000013    14
    0.097999925   2    1000012   -11
    0.097998157   2    1000014   -13
    0.083005293   2    1000024    25
    0.080119666   2   -1000005    6
    0.079665663   2    1000025    24
    0.078258238   2    1000023    24
    0.07760739   2    1000024    23
    0.019954469   2    1000016   -15
    0.017879782   2   -2000005    6
    0.011803178   2   -1000015    16
    0.0079501452   2   -2000015    16
    0.0079431493   2    2000006   -5
    0.00216053   3    1000023   -5    6
    0.002135634   3    1000025   -5    6
    0.0017816136   3    1000024    6   -6
    0.00031149758   2    1000022    24

DECAY 1000022 -1


DECAY 1000023  1.0291141
    0.49723173   2    1000022    23
    0.48668989   2    1000022    25
    0.0084607751   3    1000022    6   -6
    0.0013168312   2    1000013   -13
    0.0013168312   2   -1000013    13
    0.0010919648   2    1000011   -11
    0.0010919648   2   -1000011    11
    0.00057452868   2    1000012   -12
    0.00057452868   2   -1000012    12
    0.0005744312   2    1000014   -14
    0.0005744312   2   -1000014    14
    0.00024980452   3    1000022    15   -15
    0.00024211396   3    1000022    5   -5

DECAY 1000025  0.78528023
    0.58792756   2    1000022    25
    0.39789986   2    1000022    23
    0.011970843   3    1000022    6   -6
    0.00032857273   3    1000022    15   -15
    0.00031196431   3    1000022    5   -5
    0.00030692297   2    1000013   -13
    0.00030692297   2   -1000013    13
    0.00022938953   2    1000012   -12
    0.00022938953   2   -1000012    12
    0.00022935157   2    1000014   -14
    0.00022935157   2   -1000014    14

DECAY 1000035  48.836554
    0.073705528   2    1000023    25
    0.072984468   2    1000024   -24
    0.072984468   2   -1000024    24
    0.071123885   2    1000025    23
    0.067945852   2    1000025    25
    0.058855033   2    1000006   -6
    0.058855033   2   -1000006    6
    0.046022396   2    1000012   -12
    0.046022396   2   -1000012    12
    0.046021385   2    1000014   -14
    0.046021385   2   -1000014    14
    0.045668296   2    1000011   -11
    0.045668296   2   -1000011    11
    0.04566816   2    1000013   -13
    0.04566816   2   -1000013    13
    0.042854656   2    1000005   -5
    0.042854656   2   -1000005    5
    0.0097305781   2    2000005   -5
    0.0097305781   2   -2000005    5
    0.0093566809   2    1000016   -16
    0.0093566809   2   -1000016    16
    0.0055005992   2    1000015   -15
    0.0055005992   2   -1000015    15
    0.0038284849   2    1000023    23
    0.0037059526   2    2000015   -15
    0.0037059526   2   -2000015    15
    0.0023154035   2    2000006   -6
    0.0023154035   2   -2000006    6
    0.001735626   3    1000024    5   -6
    0.001735626   3   -1000024   -5    6
    0.0011447557   3    1000023    6   -6
    0.0010832117   3    1000025    6   -6
    0.00016519103   2    1000022    23
    0.00015060405   2    1000022    25

DECAY 1000021  245.54359
    0.14624921   2    1000006   -6
    0.14624921   2   -1000006    6
    0.11794758   2    1000005   -5
    0.11794758   2   -1000005    5
    0.11307294   2    2000005   -5
    0.11307294   2   -2000005    5
    0.081146038   2    2000006   -6
    0.081146038   2   -2000006    6
    0.039729795   2    1000006   -4
    0.039729795   2   -1000006    4
    0.001771139   3    1000023    6   -6
    0.0017672933   3    1000025    6   -6

DECAY 25  0.0038165078
    0.57944915   2   -5    5
    0.22266748   2   -24    24
    0.071560455   2    21    21
    0.066596298   2   -15    15
    0.028701412   2   -4    4
    0.026742009   2    23    23
    0.0023636466   2    22    22
    0.0014703665   2    22    23
    0.00023099421   2   -13    13
    0.00021743757   2   -3    3
    6.0119317e-07   2   -1    1
    1.4790642e-07   2   -2    2
    5.1930135e-09   2   -11    11

DECAY 35  81.521253
    0.44723143   2   -5    5
    0.19520812   2   -15    15
    0.087367839   2   -1000006    1000006
    0.047753828   2   -1000024    1000037
    0.047753828   2   -1000037    1000024
    0.039698565   2    1000025    1000035
    0.028308439   2   -2000006    2000006
    0.019971285   2    1000022    1000023
    0.01990109   2    1000022    1000025
    0.011473469   2   -1000005    1000005
    0.0091990931   2   -2000005    2000005
    0.0081397237   2   -2000005    1000005
    0.0081397237   2   -1000005    2000005
    0.0080124648   2   -2000006    1000006
    0.0080124648   2   -1000006    2000006
    0.0078042251   2    1000023    1000035
    0.0012383157   2   -1000024    1000024
    0.0012214087   2   -1000015    1000015
    0.0010015488   2   -2000015    2000015
    0.00071205121   2   -13    13
    0.00053678759   2   -6    6
    0.00030394297   2   -3    3
    0.00029209867   2    1000023    1000023
    0.00014532109   2   -2000015    1000015
    0.00014532109   2   -1000015    2000015
    0.00013035025   2    1000022    1000022
    8.3577098e-05   2    1000023    1000025
    7.713722e-05   2    1000025    1000025
    6.7242625e-05   2    25    25
    5.0161679e-05   2    21    21
    1.7468255e-05   2    1000022    1000035
    8.4041507e-07   2   -1    1
    1.7714193e-07   2    22    22
    1.3729703e-07   2    22    23
    4.2160719e-08   2    23    23
    3.9739785e-08   2   -1000011    1000011
    3.9049935e-08   2   -1000013    1000013
    1.5991349e-08   2   -11    11
    1.213792e-08   2   -2000011    2000011
    1.2126692e-08   2   -2000013    2000013
    1.1744899e-08   2   -2000013    1000013
    1.1744899e-08   2   -1000013    2000013
    1.0160849e-08   2   -24    24
    4.2006524e-09   2   -4    4
    2.7472712e-13   2   -2000011    1000011
    2.7472712e-13   2   -1000011    2000011
    2.1657017e-14   2   -2    2

DECAY 36  80.333724
    0.43137335   2   -5    5
    0.18821316   2   -15    15
    0.075874265   2   -2000006    1000006
    0.075874265   2   -1000006    2000006
    0.047641115   2   -1000024    1000037
    0.047641115   2   -1000037    1000024
    0.039948454   2    1000023    1000035
    0.02058942   2    1000022    1000023
    0.019847113   2    1000022    1000025
    0.018812821   2   -2000005    1000005
    0.018812821   2   -1000005    2000005
    0.0078393283   2    1000025    1000035
    0.002486286   2   -1000024    1000024
    0.0012813062   2   -2000015    1000015
    0.0012813062   2   -1000015    2000015
    0.00068651073   2   -13    13
    0.00060625968   2    1000023    1000023
    0.00057814718   2   -6    6
    0.00029308151   2   -3    3
    0.00013417414   2    1000025    1000025
    0.00013204299   2    1000022    1000022
    3.4433397e-05   2    1000023    1000025
    1.1327363e-05   2    1000022    1000035
    6.7314886e-06   2    21    21
    8.1037982e-07   2   -1    1
    1.5495808e-07   2    22    23
    8.0553853e-08   2    23    25
    6.9252898e-08   2    22    22
    1.5417786e-08   2   -11    11
    1.1870416e-08   2   -2000013    1000013
    1.1870416e-08   2   -1000013    2000013
    5.5673941e-09   2   -4    4
    2.7765002e-13   2   -2000011    1000011
    2.7765002e-13   2   -1000011    2000011
    2.8709717e-14   2   -2    2
    3.1775634e-35   2    25    25

DECAY 37  70.676715
    0.44628768   2   -5    6
    0.18994694   2   -15    16
    0.075476913   2   -1000005    2000006
    0.060047111   2   -2000005    1000006
    0.055485461   2    1000023    1000037
    0.055041311   2    1000024    1000035
    0.05447618   2    1000025    1000037
    0.046417052   2    1000022    1000024
    0.011606022   2   -1000005    1000006
    0.0018819603   2   -2000015    1000016
    0.0010359702   2   -1000015    1000016
    0.00067153009   2   -13    14
    0.00066040249   2   -5    4
    0.00046723091   2    1000024    1000025
    0.00032366509   2   -3    4
    9.8727968e-05   2    1000023    1000024
    3.3002461e-05   2    1000022    1000037
    1.9459411e-05   2   -2000005    2000006
    1.5189301e-05   2   -3    2
    4.7159548e-06   2   -5    2
    1.9724959e-06   2   -3    6
    8.9866972e-07   2   -1    2
    1.8024462e-07   2   -1000011    1000012
    1.7912404e-07   2   -1000013    1000014
    9.1592118e-08   2    24    25
    6.8401325e-08   2   -1    6
    4.2675758e-08   2   -1    4
    2.7449856e-08   2   -2000013    1000014
    1.5707159e-08   2   -11    12
    6.4208103e-13   2   -2000011    1000012

DECAY 6  2.43
    1   2    5    24

DECAY 15 -1
