BLOCK DCINFO
   1   SDECAY/HDECAY
   2   1.3b /3.4

BLOCK SPINFO
   1   SOFTSUSY
   2   3.4.0

BLOCK MODSEL
   1   0

BLOCK SMINPUTS
   1    127.90897
   2    1.1663787e-05
   3    0.1184
   4    91.1876
   5    4.18
   6    173.2
   7    1.777

BLOCK MINPAR
   3    13.18

BLOCK EXTPAR
   0   -1
   1    403.16
   2    2943.65
   3    2993.67
   11   -3512.62
   12    619.63
   13   -1348.54
   23    507
   26    791.2
   31    2474.08
   32    2474.08
   33    2400.82
   34    1446.87
   35    1446.87
   36    722.15
   41    2418.7
   42    2418.7
   43    3680.59
   44    3275.99
   45    3275.99
   46    3722.99
   47    2409.06
   48    2409.06
   49    798.08

BLOCK MASS
   24    80.388685
   25    124.15608
   35    791.38455
   36    791.20006
   37    795.27406
   5    4.8187603
   1000001    2591.1618
   2000001    2553.2221
   1000002    2590.077
   2000002    3383.2943
   1000003    2591.1618
   2000003    2553.2221
   1000004    2590.077
   2000004    3383.2943
   1000005    1065.8383
   2000005    3760.2735
   1000006    3682.5951
   2000006    3823.1699
   1000011    2502.3409
   2000011    1461.7318
   1000012    2500.78
   1000013    2502.3409
   2000013    1461.7318
   1000014    2500.78
   1000015    747.89547
   2000015    2428.9646
   1000016    2427.358
   1000021    3153.4801
   1000022    388.73335
   1000023   -529.27744
   1000025    534.36488
   1000035    2934.1168
   1000024    527.22019
   1000037    2934.2829

BLOCK NMIX
   1   1    0.97071695
   1   2   -0.0048991855
   1   3    0.19005943
   1   4   -0.14684008
   2   1   -0.030943185
   2   2    0.01468178
   2   3    0.70540338
   2   4    0.70797814
   3   1   -0.2382244
   3   2   -0.023981032
   3   3    0.68281415
   3   4   -0.69024553
   4   1   -0.0005030484
   4   2    0.99959259
   4   3    0.0069519794
   4   4   -0.027677852

BLOCK UMIX
   1   1   -0.0098471389
   1   2    0.99995152
   2   1   -0.99995152
   2   2   -0.0098471389

BLOCK VMIX
   1   1   -0.039189566
   1   2    0.99923179
   2   1   -0.99923179
   2   2   -0.039189566

BLOCK STOPMIX
   1   1    0.65182677
   1   2    0.75836789
   2   1   -0.75836789
   2   2    0.65182677

BLOCK SBOTMIX
   1   1    0.0010400687
   1   2    0.99999946
   2   1   -0.99999946
   2   2    0.0010400687

BLOCK STAUMIX
   1   1    0.0026523138
   1   2    0.99999648
   2   1   -0.99999648
   2   2    0.0026523138

BLOCK ALPHA
      -0.082481374

BLOCK HMIX Q=  3702.875
   1    514.69609
   2    12.555998
   3    242.44661
   4    820227.24

BLOCK GAUGE Q=  3702.875
   1    0.36595223
   2    0.63707835
   3    1.0060322

BLOCK AU Q=  3702.875
   1   1    0
   2   2    0
   3   3   -3512.62

BLOCK AD Q=  3702.875
   1   1    0
   2   2    0
   3   3    619.63001

BLOCK AE Q=  3702.875
   1   1    0
   2   2    0
   3   3   -1348.54

BLOCK YU Q=  3702.875
   1   1    0
   2   2    0
   3   3    0.81427119

BLOCK YD Q=  3702.875
   1   1    0
   2   2    0
   3   3    0.16741025

BLOCK YE Q=  3702.875
   1   1    0
   2   2    0
   3   3    0.13002325

BLOCK MSOFT Q=  3702.875
   1    403.16
   2    2943.65
   3    2993.67
   21    282163.61
   22   -22708.996
   31    2474.08
   32    2474.08
   33    2400.82
   34    1446.87
   35    1446.87
   36    722.15
   41    2418.7
   42    2418.7
   43    3680.59
   44    3275.99
   45    3275.99
   46    3722.99
   47    2409.06
   48    2409.06
   49    798.07995

BLOCK HIGGSBOUNDSINPUTHIGGSCOUPLINGSFERMIONS
       0, 157.6531,3,36,15,15

BLOCK HIGGSBOUNDSINPUTHIGGSCOUPLINGSBOSONS
       0,4,36,21,21,23

DECAY 6  1.4294639
    1   2    5    24

DECAY 1000021  88.285815
    0.26842071   2    1000005   -5
    0.26842071   2   -1000005    5
    0.041625822   2    2000001   -1
    0.041625822   2   -2000001    1
    0.041625822   2    2000003   -3
    0.041625822   2   -2000003    3
    0.037146406   2    1000002   -2
    0.037146406   2   -1000002    2
    0.037146281   2    1000004   -4
    0.037146281   2   -1000004    4
    0.03701748   2    1000001   -1
    0.03701748   2   -1000001    1
    0.03701748   2    1000003   -3
    0.03701748   2   -1000003    3

DECAY 1000006  100.68601
    0.28828137   2    1000024    5
    0.23994834   2    1000023    6
    0.20000803   2    1000025    6
    0.17027049   2    1000021    6
    0.078858627   2    1000022    6
    0.01481033   2    1000037    5
    0.0073416539   2    1000035    6
    0.00037182029   2    1000005    37
    0.00010934344   2    1000005    24

DECAY 2000006  92.993148
    0.27545681   2    1000025    6
    0.25068094   2    1000023    6
    0.21858706   2    1000024    5
    0.16606419   2    1000021    6
    0.035025968   2    1000037    5
    0.02831199   2    1000022    6
    0.017419175   2    1000035    6
    0.0078595833   2    1000006    23
    0.00022709668   2    1000005    37
    0.00018426888   2    1000006    25
    0.00018291839   2    1000005    24

DECAY 1000005  1.1138894
    0.41537355   2    1000022    5
    0.27586582   2   -1000024    6
    0.15789477   2    1000025    5
    0.15086585   2    1000023    5

DECAY 2000005  74.735496
    0.63396693   2   -1000024    6
    0.2378067   2    1000021    5
    0.061666411   2   -1000037    6
    0.031058768   2    1000035    5
    0.013497094   2    1000023    5
    0.012660222   2    1000025    5
    0.0082091415   2    1000022    5
    0.00037461556   2    1000005    35
    0.00037308484   2    1000005    36
    0.00019420877   2    1000005    25
    0.00019283146   2    1000005    23

DECAY 1000002  0.39800274
    0.8100383   2    1000022    2
    0.11502224   2    1000025    2
    0.073115339   2    1000024    1
    0.0018241258   2    1000023    2

DECAY 2000002  11.80644
    0.59415179   2    1000022    2
    0.37029226   2    1000021    2
    0.034965453   2    1000025    2
    0.00059048075   2    1000023    2
    1.0507139e-08   2    1000035    2

DECAY 1000001  0.36869238
    0.97210296   2    1000022    1
    0.012002594   2    1000025    1
    0.010908942   2    1000023    1
    0.0049855038   2   -1000024    2

DECAY 2000001  1.4193809
    0.94452906   2    1000022    1
    0.054549029   2    1000025    1
    0.00092190808   2    1000023    1

DECAY 1000004  0.40387602
    0.81014875   2    1000022    4
    0.11495378   2    1000025    4
    0.073074394   2    1000024    3
    0.0018230847   2    1000023    4

DECAY 2000004  10.920426
    0.67323807   2    1000022    4
    0.286506   2    1000021    4
    0.039587362   2    1000025    4
    0.00066855188   2    1000023    4
    1.1410339e-08   2    1000035    4

DECAY 1000003  0.37418889
    0.97212237   2    1000022    3
    0.011994054   2    1000025    3
    0.010901448   2    1000023    3
    0.0049821263   2   -1000024    4

DECAY 2000003  1.4389171
    0.94456735   2    1000022    3
    0.054511352   2    1000025    3
    0.00092129389   2    1000023    3

DECAY 1000011  3.1788619
    0.92453846   2    1000022    11
    0.074870982   2    1000025    11
    0.00056282268   2   -1000024    12
    2.7738162e-05   2    1000023    11

DECAY 2000011  6.6753895
    0.94945521   2    1000022    11
    0.049701338   2    1000025    11
    0.00084345321   2    1000023    11

DECAY 1000013  3.1788619
    0.92453846   2    1000022    13
    0.074870982   2    1000025    13
    0.00056282269   2   -1000024    14
    2.7738162e-05   2    1000023    13

DECAY 2000013  6.6753894
    0.94945521   2    1000022    13
    0.049701338   2    1000025    13
    0.00084345321   2    1000023    13

DECAY 1000015  2.1831298
    0.91825852   2    1000022    15
    0.037901935   2    1000025    15
    0.029163687   2   -1000024    16
    0.014675858   2    1000023    15

DECAY 2000015  4.0470581
    0.7093631   2    1000022    15
    0.14218853   2    1000025    15
    0.0912318   2    1000023    15
    0.022480849   2    1000015    36
    0.022413967   2    1000015    35
    0.0060092385   2    1000015    25
    0.0059314581   2    1000015    23
    0.00038105602   2   -1000024    16

DECAY 1000012  3.1971687
    0.9514738   2    1000022    12
    0.036634201   2    1000025    12
    0.008856806   2    1000024    11
    0.0030351966   2    1000023    12

DECAY 1000014  3.1971687
    0.9514738   2    1000022    14
    0.036634201   2    1000025    14
    0.0088568059   2    1000024    13
    0.0030351966   2    1000023    14

DECAY 1000016  4.0625724
    0.72459916   2    1000022    16
    0.18913009   2    1000024    15
    0.044725484   2   -1000015   -37
    0.027819785   2    1000025    16
    0.011420298   2   -1000015   -24
    0.002305179   2    1000023    16

DECAY 1000024  0.14045157
    1   2    1000022    24

DECAY 1000037  55.767522
    0.1115381   2    1000024    25
    0.10800214   2    1000024    23
    0.10461471   2    1000023    24
    0.10048135   2    1000025    24
    0.085183394   2    1000024    36
    0.084945718   2    1000024    35
    0.084709139   2    1000023    37
    0.079518238   2    1000025    37
    0.031509626   2    1000002   -1
    0.031509607   2    1000004   -3
    0.031372181   2   -1000001    2
    0.031371886   2   -1000003    4
    0.02113521   2    1000016   -15
    0.021044752   2   -2000015    16
    0.015882697   2    1000012   -11
    0.015882697   2    1000014   -13
    0.015800321   2   -1000011    12
    0.015800321   2   -1000013    14
    0.0060832588   2    1000022    37
    0.0036134186   2    1000022    24
    1.1604547e-06   2   -1000005    6
    7.6657472e-08   2   -1000015    16

DECAY 1000022 -1


DECAY 1000023  0.11895095
    0.99594012   2    1000022    23
    0.0040598769   2    1000022    25

DECAY 1000025  0.12918833
    0.95594469   2    1000022    25
    0.044055314   2    1000022    23

DECAY 1000035  55.79197
    0.10482716   2    1000024   -24
    0.10482716   2   -1000024    24
    0.085001579   2    1000024   -37
    0.085001579   2   -1000024    37
    0.07982599   2    1000025    25
    0.079360295   2    1000023    23
    0.052229078   2    1000023    36
    0.048672303   2    1000025    35
    0.032788399   2    1000023    35
    0.030503531   2    1000025    36
    0.028700067   2    1000023    25
    0.027263948   2    1000025    23
    0.015743076   2    1000002   -2
    0.015743076   2   -1000002    2
    0.015742929   2    1000004   -4
    0.015742929   2   -1000004    4
    0.015657838   2    1000001   -1
    0.015657838   2   -1000001    1
    0.015657838   2    1000003   -3
    0.015657838   2   -1000003    3
    0.010571098   2    1000016   -16
    0.010571098   2   -1000016    16
    0.010498193   2    2000015   -15
    0.010498193   2   -2000015    15
    0.0079429673   2    1000012   -12
    0.0079429673   2   -1000012    12
    0.0079429673   2    1000014   -14
    0.0079429673   2   -1000014    14
    0.0078812605   2    1000011   -11
    0.0078812605   2   -1000011    11
    0.0078812605   2    1000013   -13
    0.0078812605   2   -1000013    13
    0.0035539171   2    1000022    35
    0.0028474849   2    1000022    25
    0.0025135428   2    1000022    36
    0.00104372   2    1000022    23
    5.8004759e-07   2    1000005   -5
    5.8004759e-07   2   -1000005    5
    6.9002581e-08   2    1000015   -15
    6.9002581e-08   2   -1000015    15
    2.0041158e-08   2    2000011   -11
    2.0041158e-08   2   -2000011    11
    2.0041158e-08   2    2000013   -13
    2.0041158e-08   2   -2000013    13
    7.0486611e-10   2    2000001   -1
    7.0486611e-10   2   -2000001    1
    7.0486611e-10   2    2000003   -3
    7.0486611e-10   2   -2000003    3

DECAY 25  0.0041693409
    0.62773455   2    5   -5
    0.18378922   2    24   -24
    0.074759369   2    21    21
    0.066340515   2   -15    15
    0.022621748   2    23    23
    0.020678868   2    4   -4
    0.0021967513   2    22    22
    0.0013879875   2    22    23
    0.00025616043   2    3   -3
    0.00023483462   2   -13    13

DECAY 35  2.1464254
    0.77652159   2    5   -5
    0.11848577   2   -15    15
    0.10051145   2    6   -6
    0.0023984809   2    25    25
    0.00063169331   2    24   -24
    0.00041938428   2   -13    13
    0.0003098317   2    23    23
    0.00030969887   2    3   -3
    0.00023392723   2    21    21
    0.0001762175   2    1000022    1000022
    1.2534598e-06   2    4   -4
    5.3658034e-07   2    22    22
    1.7465649e-07   2    23    22
    1.0759416e-16   2    23    36

DECAY 36  2.1766502
    0.76613067   2    5   -5
    0.11687306   2   -15    15
    0.10873909   2    6   -6
    0.0063691317   2    1000022    1000022
    0.00059956758   2    23    25
    0.00056680012   2    21    21
    0.00041366761   2   -13    13
    0.00030563131   2    3   -3
    1.1580387e-06   2    4   -4
    8.8158292e-07   2    22    22
    3.4630388e-07   2    23    22

DECAY 37  2.0393157
    0.87183866   2    6   -5
    0.12538603   2   -15    16
    0.0013229185   2    4   -5
    0.00065696587   2    24    25
    0.00044379888   2   -13    14
    0.00032209944   2    4   -3
    1.6304131e-05   2    2   -3
    1.3228971e-05   2    2   -5
    7.1989103e-10   2    24    36

DECAY 5 -1


DECAY 15 -1


DECAY 23  2.4952


DECAY 24  2.085
