BLOCK DCINFO
   1   SDECAY/HDECAY
   2   1.3b /3.4

BLOCK SPINFO
   1   SOFTSUSY
   2   3.4.0

BLOCK MODSEL
   1   0

BLOCK SMINPUTS
   1    127.90897
   2    1.1663787e-05
   3    0.1184
   4    91.1876
   5    4.18
   6    173.2
   7    1.777

BLOCK MINPAR
   3    29.21

BLOCK EXTPAR
   0   -1
   1    298.4
   2   -3647.06
   3    3413.97
   11    3134.49
   12   -2469.33
   13   -2249.36
   23    302.24
   26    2306.66
   31    2623.52
   32    2623.52
   33    3863.07
   34    1381.45
   35    1381.45
   36    1631.67
   41    3401.3
   42    3401.3
   43    2161.29
   44    2679.77
   45    2679.77
   46    3612.33
   47    1181.88
   48    1181.88
   49    2347.5

BLOCK MASS
   24    80.403612
   25    124.90466
   35    2306.6715
   36    2306.6597
   37    2308.4446
   5    4.8187603
   1000001    3515.5171
   2000001    1324.6498
   1000002    3514.7499
   2000002    2784.2907
   1000003    3515.5171
   2000003    1324.6498
   1000004    3514.7499
   2000004    2784.2907
   1000005    2270.1501
   2000005    2449.4065
   1000006    2268.6119
   2000006    3647.6211
   1000011    2645.9938
   2000011    1389.8448
   1000012    2644.4721
   1000013    2645.9938
   2000013    1389.8448
   1000014    2644.4721
   1000015    1632.9234
   2000015    3878.4463
   1000016    3877.3002
   1000021    3490.6828
   1000022    273.41552
   1000023   -318.04168
   1000025    341.04612
   1000035   -3629.3784
   1000024    317.28068
   1000037    3629.543

BLOCK NMIX
   1   1    0.80971203
   1   2    0.0081084999
   1   3    0.44226031
   1   4   -0.38562481
   2   1   -0.04861313
   2   2   -0.01613601
   2   3    0.70557283
   2   4    0.70678383
   3   1   -0.58481033
   3   2    0.012130895
   3   3    0.55368911
   3   4   -0.59268718
   4   1   -0.00025575987
   4   2    0.99976333
   4   3    0.001082574
   4   4    0.021726477

BLOCK UMIX
   1   1   -0.0015287827
   1   2    0.99999883
   2   1   -0.99999883
   2   2   -0.0015287827

BLOCK VMIX
   1   1    0.030713474
   1   2    0.99952823
   2   1    0.99952823
   2   2   -0.030713474

BLOCK STOPMIX
   1   1    0.9985849
   1   2   -0.053180781
   2   1    0.053180781
   2   2    0.9985849

BLOCK SBOTMIX
   1   1    0.99955609
   1   2    0.029792968
   2   1   -0.029792968
   2   2    0.99955609

BLOCK STAUMIX
   1   1    0.0015479315
   1   2    0.9999988
   2   1   -0.9999988
   2   2    0.0015479315

BLOCK ALPHA
      -0.035692879

BLOCK HMIX Q=  2795.561
   1    307.70146
   2    28.13282
   3    243.0669
   4    5100121

BLOCK GAUGE Q=  2795.561
   1    0.36498943
   2    0.63617099
   3    1.0095472

BLOCK AU Q=  2795.561
   1   1    0
   2   2    0
   3   3    3134.49

BLOCK AD Q=  2795.561
   1   1    0
   2   2    0
   3   3   -2469.33

BLOCK AE Q=  2795.561
   1   1    0
   2   2    0
   3   3   -2249.36

BLOCK YU Q=  2795.561
   1   1    0
   2   2    0
   3   3    0.83377157

BLOCK YD Q=  2795.561
   1   1    0
   2   2    0
   3   3    0.35834976

BLOCK YE Q=  2795.561
   1   1    0
   2   2    0
   3   3    0.28555112

BLOCK MSOFT Q=  2795.561
   1    298.4
   2   -3647.06
   3    3413.97
   21    5205056.4
   22    14757.679
   31    2623.52
   32    2623.52
   33    3863.07
   34    1381.45
   35    1381.45
   36    1631.67
   41    3401.3
   42    3401.3
   43    2161.29
   44    2679.77
   45    2679.77
   46    3612.33
   47    1181.88
   48    1181.88
   49    2347.5

BLOCK HIGGSBOUNDSINPUTHIGGSCOUPLINGSFERMIONS
       0, 791.45558,3,36,15,15

BLOCK HIGGSBOUNDSINPUTHIGGSCOUPLINGSBOSONS
       0,4,36,21,21,23

DECAY 6  1.4247345
    1   2    5    24

DECAY 1000021  174.62211
    0.13819354   2    2000001   -1
    0.13819354   2   -2000001    1
    0.13819354   2    2000003   -3
    0.13819354   2   -2000003    3
    0.063081869   2    1000006   -6
    0.063081869   2   -1000006    6
    0.062300433   2    1000005   -5
    0.062300433   2   -1000005    5
    0.048313441   2    2000005   -5
    0.048313441   2   -2000005    5
    0.024958615   2    2000002   -2
    0.024958615   2   -2000002    2
    0.024958561   2    2000004   -4
    0.024958561   2   -2000004    4

DECAY 1000006  35.842173
    0.41368015   2    1000023    6
    0.30193106   2    1000025    6
    0.15996008   2    1000024    5
    0.1244287   2    1000022    6

DECAY 2000006  148.00307
    0.3337825   2    1000024    5
    0.1674519   2    1000023    6
    0.13328848   2    1000025    6
    0.13197722   2    1000005    24
    0.089995023   2    1000022    6
    0.075291404   2    1000006    25
    0.068129048   2    1000006    23
    8.4263384e-05   2    2000005    24
    1.6287696e-07   2    1000037    5

DECAY 1000005  35.654581
    0.83440463   2   -1000024    6
    0.077758566   2    1000023    5
    0.049191276   2    1000025    5
    0.038645523   2    1000022    5

DECAY 2000005  13.504582
    0.44613651   2   -1000024    6
    0.22349648   2    1000023    5
    0.17820285   2    1000025    5
    0.14975399   2    1000022    5
    0.001237991   2    1000006   -24
    0.00061689003   2    1000005    25
    0.00055528139   2    1000005    23

DECAY 1000002  0.5704809
    0.6243336   2    1000022    2
    0.23224425   2    1000025    2
    0.084097383   2    1000021    2
    0.044178505   2    1000024    1
    0.015146262   2    1000023    2

DECAY 2000002  6.3242348
    0.65799313   2    1000022    2
    0.33965065   2    1000025    2
    0.0023562253   2    1000023    2

DECAY 1000001  0.54545486
    0.52957431   2    1000022    1
    0.37555381   2    1000025    1
    0.093611688   2    1000021    1
    0.001145694   2    1000023    1
    0.00011449931   2   -1000024    2

DECAY 2000001  0.72283296
    0.66674591   2    1000022    1
    0.33092424   2    1000025    1
    0.0023298507   2    1000023    1

DECAY 1000004  0.5798453
    0.64020713   2    1000022    4
    0.23806175   2    1000025    4
    0.060912601   2    1000021    4
    0.045290905   2    1000024    3
    0.015527614   2    1000023    4

DECAY 2000004  6.4094763
    0.65807399   2    1000022    4
    0.33957005   2    1000025    4
    0.0023559556   2    1000023    4

DECAY 1000003  0.55290842
    0.5445397   2    1000022    3
    0.38602517   2    1000025    3
    0.06813964   2    1000021    3
    0.0011777868   2    1000023    3
    0.00011770675   2   -1000024    4

DECAY 2000003  0.70309196
    0.66682537   2    1000022    3
    0.33084505   2    1000025    3
    0.0023295769   2    1000023    3

DECAY 1000011  3.4266721
    0.67974158   2    1000022    11
    0.31439103   2    1000025    11
    0.0058532719   2    1000023    11
    1.411582e-05   2   -1000024    12

DECAY 2000011  6.7042737
    0.66575454   2    1000022    11
    0.33191264   2    1000025    11
    0.0023328274   2    1000023    11

DECAY 1000013  3.4266721
    0.67974158   2    1000022    13
    0.31439103   2    1000025    13
    0.0058532719   2    1000023    13
    1.411582e-05   2   -1000024    14

DECAY 2000013  6.7042736
    0.66575454   2    1000022    13
    0.33191264   2    1000025    13
    0.0023328274   2    1000023    13

DECAY 1000015  12.993345
    0.45036284   2    1000022    15
    0.26547319   2    1000025    15
    0.18876352   2   -1000024    16
    0.095400446   2    1000023    15

DECAY 2000015  12.072925
    0.38650276   2    1000022    15
    0.29093104   2    1000025    15
    0.25846579   2    1000023    15
    0.039920825   2   -1000037    16
    0.019969948   2    1000035    15
    0.0021390642   2    1000015    25
    0.0020688031   2    1000015    23
    1.7750093e-06   2   -1000024    16

DECAY 1000012  3.4360587
    0.63178718   2    1000022    12
    0.36211865   2    1000025    12
    0.0056783223   2    1000024    11
    0.00041585147   2    1000023    12

DECAY 1000014  3.4360587
    0.63178718   2    1000022    14
    0.36211865   2    1000025    14
    0.0056783222   2    1000024    13
    0.00041585147   2    1000023    14

DECAY 1000016  12.079026
    0.5161685   2    1000024    15
    0.26655998   2    1000022    16
    0.15377709   2    1000025    16
    0.039518385   2    1000037    15
    0.019800432   2    1000035    16
    0.0039994445   2   -1000015   -24
    0.00017616757   2    1000023    16

DECAY 1000024  6.5712172e-05
    0.33362184   3    1000022    2   -1
    0.33362184   3    1000022    4   -3
    0.11120503   3    1000022   -11    12
    0.11120503   3    1000022   -13    14
    0.11034626   3    1000022   -15    16

DECAY 1000037  84.136362
    0.19188074   2    1000006   -5
    0.18987437   2   -1000005    6
    0.085466084   2    1000024    25
    0.084407586   2    1000024    23
    0.08193929   2    1000023    24
    0.056028485   2    1000025    24
    0.038187792   2    1000012   -11
    0.038187792   2    1000014   -13
    0.038124244   2   -1000011    12
    0.038124244   2   -1000013    14
    0.030890997   2    1000024    35
    0.03089065   2    1000024    36
    0.030724244   2    1000023    37
    0.025675456   2    1000022    24
    0.018937053   2    1000025    37
    0.012042633   2    1000022    37
    0.0021316864   2    1000002   -1
    0.0021316745   2    1000004   -3
    0.0021063429   2   -1000001    2
    0.0021061529   2   -1000003    4
    0.00014240539   2   -2000005    6
    8.2037515e-08   2   -1000015    16

DECAY 1000022 -1


DECAY 1000023  5.3129876e-05
    0.15351827   3    1000022   -1    1
    0.15351827   3    1000022   -3    3
    0.13787748   3    1000022   -5    5
    0.11820337   3    1000022   -2    2
    0.11820337   3    1000022   -4    4
    0.070651621   3    1000022   -12    12
    0.070651621   3    1000022   -14    14
    0.070651034   3    1000022   -16    16
    0.035306746   3    1000022   -11    11
    0.035306746   3    1000022   -13    13
    0.034919319   3    1000022   -15    15
    0.0011921332   2    1000022    22
    5.8078478e-12   3    1000024   -2    1
    5.8078478e-12   3   -1000024   -1    2
    1.9359479e-12   3    1000024   -12    11
    1.9359479e-12   3   -1000024    12   -11
    1.9359479e-12   3    1000024   -14    13
    1.9359479e-12   3   -1000024    14   -13

DECAY 1000025  1.8292292e-05
    0.10230768   3    1000024   -2    1
    0.10230768   3   -1000024   -1    2
    0.10230768   3    1000024   -4    3
    0.10230768   3   -1000024   -3    4
    0.039412001   2    1000022    22
    0.036938373   3    1000023   -1    1
    0.036938373   3    1000023   -3    3
    0.034103104   3    1000024   -12    11
    0.034103104   3   -1000024    12   -11
    0.034103104   3    1000024   -14    13
    0.034103104   3   -1000024    14   -13
    0.033178668   3    1000024   -16    15
    0.033178668   3   -1000024    16   -15
    0.028438675   3    1000023   -2    2
    0.028438675   3    1000023   -4    4
    0.025345641   3    1000023   -5    5
    0.023827902   2    1000023    22
    0.016998949   3    1000023   -16    16
    0.016998867   3    1000023   -12    12
    0.016998867   3    1000023   -14    14
    0.014130006   3    1000022   -1    1
    0.014130006   3    1000022   -3    3
    0.01383067   3    1000022   -5    5
    0.011073963   3    1000022   -2    2
    0.011073963   3    1000022   -4    4
    0.008503151   3    1000023   -11    11
    0.008503151   3    1000023   -13    13
    0.0082259629   3    1000023   -15    15
    0.0066183339   3    1000022   -12    12
    0.0066183339   3    1000022   -14    14
    0.0065759869   3    1000022   -16    16
    0.002953093   3    1000022   -15    15
    0.002713301   3    1000022   -11    11
    0.002713301   3    1000022   -13    13

DECAY 1000035  84.100463
    0.096448244   2    1000005   -5
    0.096448244   2   -1000005    5
    0.094487097   2    1000006   -6
    0.094487097   2   -1000006    6
    0.081715714   2    1000024   -24
    0.081715714   2   -1000024    24
    0.047221441   2    1000023    25
    0.038070919   2    1000023    23
    0.032333943   2    1000025    23
    0.03083716   2    1000024   -37
    0.03083716   2   -1000024    37
    0.02575683   2    1000025    25
    0.020845372   2    1000023    35
    0.019111853   2    1000012   -12
    0.019111853   2   -1000012    12
    0.019111853   2    1000014   -14
    0.019111853   2   -1000014    14
    0.019050897   2    1000011   -11
    0.019050897   2   -1000011    11
    0.019050897   2    1000013   -13
    0.019050897   2   -1000013    13
    0.01410134   2    1000022    23
    0.013067277   2    1000025    36
    0.012443617   2    1000022    25
    0.0099499463   2    1000023    36
    0.007900196   2    1000022    36
    0.005911419   2    1000025    35
    0.0041685426   2    1000022    35
    0.0010638011   2    1000002   -2
    0.0010638011   2   -1000002    2
    0.0010637061   2    1000004   -4
    0.0010637061   2   -1000004    4
    0.0010503502   2    1000001   -1
    0.0010503502   2   -1000001    1
    0.0010503502   2    1000003   -3
    0.0010503502   2   -1000003    3
    7.2591571e-05   2    2000005   -5
    7.2591571e-05   2   -2000005    5
    4.55725e-08   2    1000015   -15
    4.55725e-08   2   -1000015    15
    5.4481439e-09   2    2000011   -11
    5.4481439e-09   2   -2000011    11
    5.4481439e-09   2    2000013   -13
    5.4481439e-09   2   -2000013    13
    1.7984758e-09   2    2000001   -1
    1.7984758e-09   2   -2000001    1
    1.7984758e-09   2    2000003   -3
    1.7984758e-09   2   -2000003    3
    1.65293e-09   2    2000002   -2
    1.65293e-09   2   -2000002    2
    1.6529277e-09   2    2000004   -4
    1.6529277e-09   2   -2000004    4

DECAY 25  0.0041411214
    0.60937789   2    5   -5
    0.20043667   2    24   -24
    0.076986302   2    21    21
    0.063009159   2   -15    15
    0.025032046   2    23    23
    0.020930452   2    4   -4
    0.0022647942   2    22    22
    0.0014962652   2    22    23
    0.00024339116   2    3   -3
    0.00022303598   2   -13    13

DECAY 35  26.842614
    0.75379915   2    5   -5
    0.14291643   2   -15    15
    0.033034526   2    1000022    1000023
    0.022155331   2    1000022    1000022
    0.020566552   2    1000023    1000025
    0.019018192   2    1000025    1000025
    0.0045421834   2    6   -6
    0.0024733022   2    1000022    1000025
    0.00061268347   2    1000024   -1000024
    0.0005084148   2   -13    13
    0.00030383954   2    3   -3
    3.3683714e-05   2    1000023    1000023
    1.5349937e-05   2    21    21
    1.4542659e-05   2    25    25
    3.8516009e-06   2    24   -24
    1.9198111e-06   2    23    23
    4.6590572e-08   2    4   -4
    8.3272976e-09   2    23    22
    8.5940309e-10   2    22    22

DECAY 36  26.846194
    0.75373538   2    5   -5
    0.14289861   2   -15    15
    0.026659811   2    1000022    1000023
    0.026578392   2    1000022    1000022
    0.024273932   2    1000025    1000025
    0.016489034   2    1000023    1000025
    0.0045697613   2    6   -6
    0.0032390156   2    1000022    1000025
    0.00065808031   2    1000024   -1000024
    0.00050835021   2   -13    13
    0.00030382837   2    3   -3
    5.0217652e-05   2    21    21
    3.1592051e-05   2    1000023    1000023
    3.8921847e-06   2    23    25
    4.6587811e-08   2    4   -4
    3.5055981e-08   2    23    22
    1.8888144e-08   2    22    22

DECAY 37  25.570492
    0.74524696   2    6   -5
    0.15014387   2   -15    16
    0.070185606   2    1000024    1000022
    0.031711222   2    1000024    1000025
    0.0012482004   2    4   -5
    0.00058350464   2    1000024    1000023
    0.00053412461   2   -13    14
    0.00031398631   2    4   -3
    1.5949749e-05   2    2   -3
    1.2481979e-05   2    2   -5
    4.100257e-06   2    24    25
    9.3185511e-13   2    24    36

DECAY 5 -1


DECAY 15 -1


DECAY 23  2.4952


DECAY 24  2.085
