BLOCK SPINFO
   1   SPheno
   2   v4.0.5be

BLOCK SPHENOINFO
   1   2
   2   2

BLOCK MODSEL
   1   0

BLOCK MINPAR
   3    55.390248
   4    1

BLOCK EXTPAR
   0    2986.1058
   1    1697.5342
   2   -1096.6561
   3    2153.5919
   11    4270.7606
   12   -3540.4595
   13    2473.7193
   23    923.4564
   25    54.006725
   26    3921.8649
   31    3309.794
   32    3309.794
   33    2080.1804
   34    4164.8938
   35    4164.8938
   36    2598.9375
   41    1908.8109
   42    1908.8109
   43    2030.6273
   44    3823.8795
   45    3823.8795
   46    4220.9839
   47    4463.8296
   48    4463.8296
   49    1265.3311

BLOCK SMINPUTS
   1    127.90897
   2    1.1663787e-05
   3    0.1184
   4    91.1876
   5    4.18
   6    173.2
   7    1.777
   8    0
   11    0.00051099893
   12    0
   13    0.10565837
   14    0
   21    0.005
   22    0.0025
   23    0.095
   24    1.27

BLOCK GAUGE Q=  2986.1058
   1    0.35536298
   2    0.66519887
   3    1.219778

BLOCK YU Q=  2986.1058
   1   1    8.3858093e-06
   2   2    0.0042599911
   3   3    1.0130731

BLOCK YD Q=  2986.1058
   1   1    0.00091006638
   2   2    0.017291261
   3   3    0.90250068

BLOCK YE Q=  2986.1058
   1   1    0.00015881324
   2   2    0.032837541
   3   3    0.55227342

BLOCK AU Q=  2986.1058
   1   1    0
   2   2    0
   3   3    4270.7606

BLOCK AD Q=  2986.1058
   1   1    0
   2   2    0
   3   3   -3540.4596

BLOCK AE Q=  2986.1058
   1   1    0
   2   2    0
   3   3    2473.7193

BLOCK MSOFT Q=  2986.1058
   1    1697.5342
   2   -1096.6561
   3    2153.5919
   21    14857131
   22   -804262.4
   31    3309.794
   32    3309.794
   33    2080.1804
   34    4164.8938
   35    4164.8938
   36    2598.9375
   41    1908.8109
   42    1908.8109
   43    2030.6273
   44    3823.8795
   45    3823.8795
   46    4220.9839
   47    4463.8296
   48    4463.8296
   49    1265.3311

BLOCK MASS
   6    173.2
   23    91.1876
   24    80.429995
   15    1.777
   25    124.34433
   35    3918.4857
   36    3921.8649
   37    3919.5242
   1000001    2035.8374
   2000001    4519.6274
   1000002    2034.2696
   2000002    3882.7868
   1000003    2035.8329
   2000003    4519.6191
   1000004    2034.2652
   2000004    3882.7863
   1000005    1393.0097
   2000005    2121.2338
   1000006    2118.8826
   2000006    4208.269
   1000011    3317.3708
   2000011    4171.0162
   1000012    3316.0237
   1000013    3317.3404
   2000013    4170.9573
   1000014    3315.991
   1000015    2078.1601
   2000015    2588.5127
   1000016    2077.4202
   1000021    2361.9987
   1000022   -920.47238
   1000023    935.10208
   1000025   -1145.3136
   1000035    1691.7368
   1000024    922.57338
   1000037    1145.6089

BLOCK ALPHA
      -0.018077527

BLOCK HMIX Q=  2986.1058
   1    923.4564
   2    54.006725
   3    243.24992
   4    15381024

BLOCK STOPMIX
   1   1   -0.99908001
   1   2    0.042885079
   2   1   -0.042885079
   2   2   -0.99908001

BLOCK SBOTMIX
   1   1    0.033330815
   1   2    0.99944437
   2   1   -0.99944437
   2   2    0.033330815

BLOCK STAUMIX
   1   1    0.99944521
   1   2    0.033305653
   2   1   -0.033305653
   2   2    0.99944521

BLOCK NMIX
   1   1   -0.011056714
   1   2   -0.25395517
   1   3    0.68930695
   1   4    0.67841023
   2   1    0.041082763
   2   2    0.027831545
   2   3    0.70610883
   2   4   -0.70636246
   3   1    0.0029922452
   3   2   -0.9668149
   3   3   -0.16071204
   3   4   -0.198574
   4   1    0.99909009
   4   2   -0.001059323
   4   3   -0.020925583
   4   4    0.037148293

BLOCK UMIX
   1   1   -0.22880415
   1   2    0.97347248
   2   1   -0.97347248
   2   2   -0.22880415

BLOCK VMIX
   1   1    0.28261962
   1   2    0.95923206
   2   1    0.95923206
   2   2   -0.28261962

BLOCK HIGGSBOUNDSINPUTHIGGSCOUPLINGSFERMIONS
       0, 2916.7263,3,36,15,15

BLOCK HIGGSBOUNDSINPUTHIGGSCOUPLINGSBOSONS
       0,4,36,21,21,23

BLOCK SPHENOLOWENERGY
   1    0.00034424345
   2    1.588836e-06
   3    3.5266922e-05
   4    4.4512835e-15
   5    1.9014954e-10
   6    3.9565681e-08
   7    1.5839967e-13
   8    6.7666481e-09
   9    1.4248358e-06
   10    9.5504875e-05
   11    0.9865288
   12    0.54212885
   13    19.373898
   14    0
   15    0
   16    0.0021582077
   17    2.2816693e-15
   18    2.4801992e-11
   19    8.2914163e-11
   20   -2.8932646e-15
   21   -1.2370011e-10
   22   -5.5983529e-08
   23    0
   24    0
   25    0
   26    0
   27    0
   28    0
   29    0
   30    0
   31    0
   39    0.00010309218
   40    0
   41    0
   42    0

BLOCK FWCOEF Q=  160
   305   4422   0   0   -0.18881911
   305   4422   0   2   -0.21250672
   305   4322   0   2   -0.00054033949
   305   6421   0   0   -0.095227835
   305   6421   0   2   -0.12546583
   305   6321   0   2   -0.00047806451
   3051111   4133   0   0    1.6174021
   3051111   4133   0   2    1.618066
   3051111   4233   0   2    0.0011004596
   3051111   4137   0   0   -4.4400942
   3051111   4137   0   2   -4.440105
   3051111   4237   0   2   -0.0082493962
   3051313   4133   0   0    1.6174021
   3051313   4133   0   2    1.618065
   3051313   4233   0   2    0.0011004573
   3051313   4137   0   0   -4.4400942
   3051313   4137   0   2   -4.440106
   3051313   4237   0   2   -0.0082494026
   3051212   4137   0   0    1.5053501
   3051212   4137   0   2    1.5053645
   3051212   4237   0   2    0.0017875619
   3051414   4137   0   0    1.5053501
   3051414   4137   0   2    1.5053645
   3051414   4237   0   2    0.001787562
   3051616   4137   0   0    1.5053501
   3051616   4137   0   2    1.5053649
   3051616   4237   0   2    0.0017875847

BLOCK IMFWCOEF Q=  160
   305   4422   0   0    3.8574474e-07
   305   4422   0   2    2.3286806e-05
   305   4322   0   2   -8.2912737e-06
   305   6421   0   0    3.3041588e-07
   305   6421   0   2   -0.00025018121
   305   6321   0   2   -6.6347616e-06
   3051111   4133   0   2    4.8370079e-06
   3051111   4233   0   2    2.047353e-05
   3051111   4137   0   2   -2.1151417e-05
   3051111   4237   0   2   -0.00015348207
   3051313   4133   0   2    4.8369145e-06
   3051313   4233   0   2    2.0473497e-05
   3051313   4137   0   2   -2.1151353e-05
   3051313   4237   0   2   -0.00015348219
   3051212   4137   0   2    4.8023486e-06
   3051212   4237   0   2    3.3258034e-05
   3051414   4137   0   2    4.8023502e-06
   3051414   4237   0   2    3.3258034e-05
   3051616   4137   0   2    4.8099466e-06
   3051616   4237   0   2    3.3258036e-05

DECAY 23  2.4952


DECAY 24  2.085


DECAY 1000011  36.46151
    0.58875966   2   -1000037    12
    0.28944809   2    1000025    11
    0.062212511   2    1000035    11
    0.035699966   2   -1000024    12
    0.023038862   2    1000022    11
    0.00084091084   2    1000023    11

DECAY 2000011  14.637396
    0.99765061   2    1000035    11
    0.0021798311   2    1000023    11
    0.00015846644   2    1000022    11

DECAY 1000013  36.521298
    0.58778752   2   -1000037    14
    0.28900937   2    1000025    13
    0.062109749   2    1000035    13
    0.035641087   2   -1000024    14
    0.023789457   2    1000022    13
    0.0016628134   2    1000023    13

DECAY 2000013  14.799247
    0.98671693   2    1000035    13
    0.005183043   2   -1000024    14
    0.0048748866   2    1000023    13
    0.0027563996   2    1000022    13
    0.00027056124   2   -1000037    14
    0.00014433736   2    1000025    13

DECAY 1000015  21.940407
    0.3775055   2   -1000037    16
    0.19809789   2    1000022    15
    0.1929224   2    1000025    15
    0.18284777   2    1000023    15
    0.035132543   2   -1000024    16
    0.013493888   2    1000035    15

DECAY 2000015  29.150219
    0.38149888   2   -1000024    16
    0.2037688   2    1000023    15
    0.19145298   2    1000022    15
    0.14622989   2    1000035    15
    0.024973972   2   -1000037    16
    0.019489221   2    1000016   -24
    0.012341295   2    1000025    15
    0.010656574   2    1000015    25
    0.0095883963   2    1000015    23

DECAY 1000012  36.482183
    0.57097875   2    1000037    11
    0.29102135   2    1000025    12
    0.062611618   2    1000035    12
    0.054408064   2    1000024    11
    0.020968486   2    1000022    12

DECAY 1000014  36.541888
    0.57011584   2    1000037    13
    0.29054143   2    1000025    14
    0.062507831   2    1000035    14
    0.055889233   2    1000024    13
    0.02093395   2    1000022    14

DECAY 1000016  21.92757
    0.39442099   2    1000024    15
    0.38599555   2    1000037    15
    0.18947035   2    1000025    16
    0.0165719   2    1000022    16
    0.013532028   2    1000035    16

DECAY 1000001  12.830667
    0.61809352   2   -1000037    2
    0.30531602   2    1000025    1
    0.046195361   2   -1000024    2
    0.028068816   2    1000022    1
    0.0021424601   2    1000035    1
    0.00018381501   2    1000023    1

DECAY 2000001  190.3566
    0.99019368   2    1000021    1
    0.009783509   2    1000035    1

DECAY 1000003  12.83856
    0.61771312   2   -1000037    4
    0.30513841   2    1000025    3
    0.046198004   2   -1000024    4
    0.028333589   2    1000022    3
    0.0021411461   2    1000035    3
    0.00047572439   2    1000023    3

DECAY 2000003  190.4053
    0.98993586   2    1000021    3
    0.0097810244   2    1000035    3
    0.00012289098   2   -1000024    4

DECAY 1000005  12.972833
    0.46422604   2   -1000024    6
    0.26555536   2    1000022    5
    0.26160242   2    1000023    5
    0.0048383784   2   -1000037    6
    0.0037777939   2    1000025    5

DECAY 2000005  66.796142
    0.38161107   2   -1000024    6
    0.17180488   2   -1000037    6
    0.16666054   2    1000023    5
    0.16481088   2    1000022    5
    0.07377773   2    1000025    5
    0.030998041   2    1000005    25
    0.0096824591   2    1000005    23
    0.00065439539   2    1000035    5

DECAY 1000002  12.890842
    0.59602808   2    1000037    1
    0.30255551   2    1000025    2
    0.070044288   2    1000024    1
    0.028771998   2    1000022    2
    0.002066373   2    1000035    2
    0.00053374915   2    1000023    2

DECAY 2000002  127.31417
    0.95526859   2    1000021    2
    0.044621481   2    1000035    2
    0.00010200221   2    1000023    2

DECAY 1000004  12.898727
    0.59568157   2    1000037    3
    0.30236788   2    1000025    4
    0.070562374   2    1000024    3
    0.028771905   2    1000022    4
    0.0020650235   2    1000035    4
    0.00055124847   2    1000023    4

DECAY 2000004  127.31652
    0.95524993   2    1000021    4
    0.044620656   2    1000035    4
    0.00010686685   2    1000023    4

DECAY 1000006  66.305916
    0.34420094   2    1000024    5
    0.20983485   2    1000022    6
    0.20938744   2    1000023    6
    0.13774927   2    1000037    5
    0.067039369   2    1000025    6
    0.019435793   2    1000005    24
    0.011882067   3    1000022    24    5
    0.00046667887   2    1000035    6

DECAY 2000006  407.26761
    0.38210884   2    1000021    6
    0.17295988   2    1000024    5
    0.094695882   2    2000005    24
    0.094548202   2    1000023    6
    0.086274714   2    1000022    6
    0.079663196   2    1000006    25
    0.047387457   2    1000006    23
    0.017323862   2    1000037    5
    0.016327218   2    1000035    6
    0.0085314309   2    1000025    6
    0.00017932114   2    1000005    24

DECAY 1000024  3.6693846e-11
    0.59117214   3    1000022   -1    2
    0.19703624   3    1000022   -11    12
    0.19323432   3    1000022   -13    14
    0.018557298   3    1000022   -3    4

DECAY 1000037  4.5316896
    0.35231094   2    1000022    24
    0.23264437   2    1000024    23
    0.22076187   2    1000023    24
    0.19416134   2    1000024    25

DECAY 1000022 -1


DECAY 1000023  3.7299061e-06
    0.23310513   2    1000022    22
    0.11871864   3    1000022    12   -12
    0.088773352   3    1000022    1   -1
    0.088730314   3    1000022    3   -3
    0.069239844   3    1000022    2   -2
    0.062646994   3    1000022    4   -4
    0.042704009   3    1000024    1   -2
    0.042704009   3   -1000024   -1    2
    0.040736738   3    1000024    3   -4
    0.040736738   3   -1000024   -3    4
    0.03270815   3    1000022    5   -5
    0.020033721   3    1000022    11   -11
    0.020018454   3    1000022    13   -13
    0.016224837   3    1000022    15   -15
    0.014234421   3    1000024    11   -12
    0.014234421   3   -1000024   -11    12
    0.014229722   3    1000024    13   -14
    0.014229722   3   -1000024   -13    14
    0.012995391   3    1000024    15   -16
    0.012995391   3   -1000024   -15    16

DECAY 1000025  6.7200171
    0.24294087   2    1000024   -24
    0.24294087   2   -1000024    24
    0.22439675   2    1000023    23
    0.15990131   2    1000023    25
    0.12729936   2    1000022    25
    0.0023429015   2    1000022    23

DECAY 1000035  5.1105265
    0.18798034   2    1000024   -24
    0.18798034   2   -1000024    24
    0.17988281   2    1000022    23
    0.17751365   2    1000023    25
    0.16056893   2    1000022    25
    0.028617941   2    1000005   -5
    0.028617941   2   -1000005    5
    0.014468044   2    1000023    23
    0.0061401285   2    1000025    23
    0.0060158389   2    1000037   -24
    0.0060158389   2   -1000037    24
    0.0050251901   2    1000025    25
    0.0039628446   3    1000024    5   -6
    0.0039628446   3   -1000024   -5    6
    0.0015185847   3    1000023    6   -6
    0.001447783   3    1000022    6   -6

DECAY 1000021  52.965441
    0.2806276   2    1000005   -5
    0.2806276   2   -1000005    5
    0.044018632   2    1000004   -4
    0.044018632   2   -1000004    4
    0.044017838   2    1000002   -2
    0.044017838   2   -1000002    2
    0.043629907   2    1000003   -3
    0.043629907   2   -1000003    3
    0.043628797   2    1000001   -1
    0.043628797   2   -1000001    1
    0.024732582   2    2000005   -5
    0.024732582   2   -2000005    5
    0.019267637   2    1000006   -6
    0.019267637   2   -1000006    6

DECAY 25  0.003787536
    0.58222736   2   -5    5
    0.21832583   2   -24    24
    0.073173691   2    21    21
    0.067057123   2   -15    15
    0.028884119   2   -4    4
    0.026086151   2    23    23
    0.0023480551   2    22    22
    0.0014452894   2    22    23
    0.00023260802   2   -13    13
    0.00021900809   2   -3    3
    6.0553677e-07   2   -1    1
    1.4884897e-07   2   -2    2
    5.2292948e-09   2   -11    11

DECAY 35  146.86988
    0.4693948   2   -5    5
    0.14397992   2   -15    15
    0.069792399   2   -1000024    1000037
    0.069792399   2   -1000037    1000024
    0.063064834   2   -2000005    1000005
    0.063064834   2   -1000005    2000005
    0.041413998   2    1000023    1000025
    0.026299348   2    1000022    1000025
    0.014011123   2   -1000024    1000024
    0.010384906   2    1000022    1000035
    0.0074463727   2   -1000037    1000037
    0.0060666077   2    1000023    1000035
    0.0055673529   2    1000022    1000022
    0.0037589037   2    1000025    1000025
    0.0033170798   2    1000022    1000023
    0.0010043243   2    1000025    1000035
    0.00052917313   2   -13    13
    0.00044069973   2   -6    6
    0.00042861391   2   -1000005    1000005
    0.0002328285   2   -3    3
    3.7069145e-06   2    1000023    1000023
    2.9619469e-06   2    1000035    1000035
    1.0639109e-06   2    21    21
    9.3230486e-07   2    25    25
    6.4378966e-07   2   -1    1
    4.3087156e-08   2    23    23
    2.4112298e-08   2   -1000001    1000001
    2.4084214e-08   2   -1000003    1000003
    2.1114367e-08   2    22    23
    1.670472e-08   2   -1000002    1000002
    1.6694707e-08   2   -1000004    1000004
    1.2048782e-08   2    22    22
    1.188386e-08   2   -11    11
    9.3223393e-09   2   -24    24
    3.3065094e-09   2   -4    4
    1.7025864e-14   2   -2    2

DECAY 36  139.3287
    0.45276625   2   -5    5
    0.1389272   2   -15    15
    0.070801988   2   -1000024    1000037
    0.070801988   2   -1000037    1000024
    0.066909863   2   -2000005    1000005
    0.066909863   2   -1000005    2000005
    0.035187155   2    1000022    1000025
    0.034361956   2    1000023    1000025
    0.017768032   2   -1000024    1000024
    0.0119883   2    1000023    1000035
    0.010628279   2   -1000037    1000037
    0.0069673488   2    1000022    1000022
    0.00592587   2    1000022    1000035
    0.005372606   2    1000025    1000025
    0.0029534747   2    1000022    1000023
    0.0005106221   2   -13    13
    0.00050011196   2    1000025    1000035
    0.00046824287   2   -6    6
    0.00022460634   2   -3    3
    1.4392641e-05   2    1000035    1000035
    5.6935652e-06   2    21    21
    5.4076366e-06   2    1000023    1000023
    6.210566e-07   2   -1    1
    9.390564e-08   2    23    25
    1.9170238e-08   2    22    23
    1.1467318e-08   2   -11    11
    3.4909969e-09   2   -4    4
    1.9071921e-09   2    22    22
    3.4741849e-12   2    23    35
    1.7976226e-14   2   -2    2
    1.3164368e-39   2    25    25

DECAY 37  142.59696
    0.43188804   2   -5    6
    0.1686495   2   -15    16
    0.13124546   2   -1000005    1000006
    0.084399606   2    1000022    1000037
    0.081242695   2    1000024    1000025
    0.07481299   2    1000023    1000037
    0.016327923   2    1000024    1000035
    0.0080877843   2    1000023    1000024
    0.0015300482   2    1000035    1000037
    0.00064022351   2   -5    4
    0.00059623601   2   -13    14
    0.00025746338   2   -1000005    1000004
    0.00022231429   2   -3    4
    8.1112717e-05   2    1000022    1000024
    1.0443583e-05   2   -3    2
    4.571856e-06   2   -5    2
    1.8385542e-06   2   -1000005    1000002
    8.2159491e-07   2   -3    6
    6.1702467e-07   2   -1    2
    9.162194e-08   2    24    25
    7.4309216e-08   2    1000025    1000037
    3.9736383e-08   2   -1000001    1000002
    3.964209e-08   2   -1000003    1000004
    2.9106402e-08   2   -1    4
    2.249826e-08   2   -1    6
    1.3946022e-08   2   -11    12
    2.1235245e-09   2   -1000003    1000002
    2.122186e-09   2   -1000001    1000004
    1.1532738e-14   2    24    35

DECAY 6  2.43
    1   2    5    24

DECAY 15 -1
