BLOCK SPINFO
   1   SPheno
   2   v4.0.5be

BLOCK SPHENOINFO
   1   2
   2   2

BLOCK MODSEL
   1   0

BLOCK MINPAR
   3    6.7118412
   4    1

BLOCK EXTPAR
   0    1436.6551
   1   -1124.033
   2    691.14133
   3    3000
   11    2806.2995
   12   -587.72563
   13    1349.6636
   23    389.42513
   25    6.4285268
   26    3499.3992
   31    441.70693
   32    441.70693
   33    1479.061
   34    1053.8815
   35    1053.8815
   36    804.78222
   41    5000
   42    5000
   43    1787.5436
   44    5000
   45    5000
   46    1225.9684
   47    5000
   48    5000
   49    1860.7196

BLOCK SMINPUTS
   1    127.90897
   2    1.1663787e-05
   3    0.1184
   4    91.1876
   5    4.18
   6    173.2
   7    1.777
   8    0
   11    0.00051099893
   12    0
   13    0.10565837
   14    0
   21    0.005
   22    0.0025
   23    0.095
   24    1.27

BLOCK GAUGE Q=  1436.6551
   1    0.35536298
   2    0.66519887
   3    1.219778

BLOCK YU Q=  1436.6551
   1   1    8.4852077e-06
   2   2    0.0043104855
   3   3    1.0250812

BLOCK YD Q=  1436.6551
   1   1    0.00010961101
   2   2    0.0020826092
   3   3    0.10869978

BLOCK YE Q=  1436.6551
   1   1    1.9127923e-05
   2   2    0.0039550478
   3   3    0.066517398

BLOCK AU Q=  1436.6551
   1   1    0
   2   2    0
   3   3    2806.2994

BLOCK AD Q=  1436.6551
   1   1    0
   2   2    0
   3   3   -587.72563

BLOCK AE Q=  1436.6551
   1   1    0
   2   2    0
   3   3    1349.6636

BLOCK MSOFT Q=  1436.6551
   1   -1124.033
   2    691.14133
   3    3000
   21    11774351
   22    188875.22
   31    441.70693
   32    441.70693
   33    1479.061
   34    1053.8815
   35    1053.8815
   36    804.78222
   41    5000
   42    5000
   43    1787.5436
   44    5000
   45    5000
   46    1225.9684
   47    5000
   48    5000
   49    1860.7196

BLOCK MASS
   6    173.2
   23    91.1876
   24    80.429995
   15    1.777
   25    120.63308
   35    3499.073
   36    3499.3992
   37    3500.2245
   1000001    5025.9219
   2000001    5015.5142
   1000002    5025.5058
   2000002    5017.737
   1000003    5025.9225
   2000003    5015.5145
   1000004    5025.5064
   2000004    5017.7379
   1000005    1775.4488
   2000005    1884.4545
   1000006    1142.5635
   2000006    1806.4448
   1000011    463.25212
   2000011    1055.9523
   1000012    456.29008
   1000013    463.25271
   2000013    1055.9528
   1000014    456.29075
   1000015    807.17369
   2000015    1485.949
   1000016    1483.5425
   1000021    3184.7764
   1000022    384.39916
   1000023   -395.75383
   1000025    736.70873
   1000035   -1121.1403
   1000024    385.15874
   1000037    736.92273

BLOCK ALPHA
      -0.1481752

BLOCK HMIX Q=  1436.6551
   1    389.42513
   2    6.4285268
   3    244.04973
   4    12245795

BLOCK STOPMIX
   1   1   -0.22053627
   1   2    0.97537878
   2   1   -0.97537878
   2   2   -0.22053627

BLOCK SBOTMIX
   1   1    0.99983362
   1   2    0.018241059
   2   1   -0.018241059
   2   2    0.99983362

BLOCK STAUMIX
   1   1    0.0013741486
   1   2    0.99999906
   2   1   -0.99999906
   2   2    0.0013741486

BLOCK NMIX
   1   1   -0.02327544
   1   2   -0.18467909
   1   3    0.70165052
   1   4   -0.68777789
   2   1    0.036481816
   2   2    0.042268004
   2   3    0.7051835
   2   4    0.70682298
   3   1    0.0042174668
   3   2   -0.98188806
   3   3   -0.10159836
   3   4    0.15986191
   4   1    0.99905433
   4   2   -0.001701029
   4   3   -0.0089751496
   4   4   -0.042508931

BLOCK UMIX
   1   1   -0.14396279
   1   2    0.9895831
   2   1    0.9895831
   2   2    0.14396279

BLOCK VMIX
   1   1   -0.22682101
   1   2    0.97393646
   2   1    0.97393646
   2   2    0.22682101

BLOCK HIGGSBOUNDSINPUTHIGGSCOUPLINGSFERMIONS
       0, 41.325957,3,36,15,15

BLOCK HIGGSBOUNDSINPUTHIGGSCOUPLINGSBOSONS
       0,4,36,21,21,23

BLOCK SPHENOLOWENERGY
   1    0.00032912354
   2    1.5862818e-06
   3    3.5183608e-05
   4    2.5392465e-15
   5    1.0847374e-10
   6    2.2708454e-08
   7    8.5532078e-14
   8    3.6539281e-09
   9    7.7505171e-07
   10    9.6787031e-05
   11    0.99977298
   12    0.54365568
   13    19.425203
   14    0
   15    0
   16    0.0021644968
   17    2.2817314e-15
   18    2.4756119e-11
   19    8.2797549e-11
   20    2.798803e-15
   21    1.1965732e-10
   22    1.8461516e-08
   23    0
   24    0
   25    0
   26    0
   27    0
   28    0
   29    0
   30    0
   31    0
   39   -0.00014704238
   40    0
   41    0
   42    0

BLOCK FWCOEF Q=  160
   305   4422   0   0   -0.18881911
   305   4422   0   2   -0.19872959
   305   4322   0   2   -0.00012881151
   305   6421   0   0   -0.095227835
   305   6421   0   2   -0.10390422
   305   6321   0   2   -0.00014052415
   3051111   4133   0   0    1.5901988
   3051111   4133   0   2    1.5914842
   3051111   4233   0   2    5.9689163e-06
   3051111   4137   0   0   -4.4128909
   3051111   4137   0   2   -4.4043991
   3051111   4237   0   2   -4.5842906e-05
   3051313   4133   0   0    1.5901988
   3051313   4133   0   2    1.591484
   3051313   4233   0   2    5.9689152e-06
   3051313   4137   0   0   -4.4128909
   3051313   4137   0   2   -4.4043994
   3051313   4237   0   2   -4.5842909e-05
   3051212   4137   0   0    1.5053501
   3051212   4137   0   2    1.5035156
   3051212   4237   0   2    9.994767e-06
   3051414   4137   0   0    1.5053501
   3051414   4137   0   2    1.5035156
   3051414   4237   0   2    9.9947671e-06
   3051616   4137   0   0    1.5053501
   3051616   4137   0   2    1.5035153
   3051616   4237   0   2    9.9944498e-06

BLOCK IMFWCOEF Q=  160
   305   4422   0   0    3.8581408e-07
   305   4422   0   2    4.1181243e-06
   305   4322   0   2   -6.1383214e-07
   305   6421   0   0    3.3047528e-07
   305   6421   0   2   -4.3563216e-07
   305   6321   0   2   -2.7198685e-07
   3051111   4133   0   2   -1.179551e-06
   3051111   4233   0   2    1.2151913e-07
   3051111   4137   0   2    7.2187961e-06
   3051111   4237   0   2   -9.3531358e-07
   3051313   4133   0   2   -1.1795521e-06
   3051313   4233   0   2    1.2151911e-07
   3051313   4137   0   2    7.2188e-06
   3051313   4237   0   2   -9.3531363e-07
   3051212   4137   0   2   -1.277148e-06
   3051212   4237   0   2    2.0391948e-07
   3051414   4137   0   2   -1.2771481e-06
   3051414   4237   0   2    2.0391948e-07
   3051616   4137   0   2   -1.2820576e-06
   3051616   4237   0   2    2.0391368e-07

DECAY 23  2.4952


DECAY 24  2.085


DECAY 1000011  0.016308932
    0.49396573   2   -1000024    12
    0.47122443   2    1000022    11
    0.034808119   2    1000023    11

DECAY 2000011  0.0074050365
    0.70453724   2    1000023    11
    0.29210465   2    1000022    11
    0.0033572892   2    1000025    11

DECAY 1000013  0.016320844
    0.4936114   2   -1000024    14
    0.47127343   2    1000022    13
    0.035113455   2    1000023    13

DECAY 2000013  0.0079092332
    0.67487143   2    1000023    13
    0.28888673   2    1000022    13
    0.03058045   2   -1000024    14
    0.0032565722   2    1000025    13
    0.002178233   2    1000013    25
    0.00022658424   2   -1000037    14

DECAY 1000015  0.087515918
    0.47610357   2   -1000024    16
    0.26787162   2    1000023    15
    0.25542456   2    1000022    15
    0.00038245463   2   -1000037    16
    0.00021780369   2    1000025    15

DECAY 2000015  11.790281
    0.61779056   2   -1000037    16
    0.30290838   2    1000025    15
    0.029129885   2    1000035    15
    0.023484947   2    1000022    15
    0.019970222   2   -1000024    16
    0.0065951373   2    1000023    15

DECAY 1000012  0.02216365
    0.77057136   2    1000024    11
    0.22654295   2    1000022    12
    0.0028856943   2    1000023    12

DECAY 1000014  0.022174265
    0.77067759   2    1000024    13
    0.22643804   2    1000022    14
    0.0028843679   2    1000023    14

DECAY 1000016  11.832954
    0.59415684   2    1000037    15
    0.30337296   2    1000025    16
    0.058755404   2    1000024    15
    0.029099451   2    1000035    16
    0.014247474   2    1000022    16
    0.00024702796   2    1000023    16
    0.00012084389   2    1000015    24

DECAY 2000001  143.5296
    0.98238874   2    1000021    1
    0.017574823   2    1000035    1

DECAY 1000001  206.31241
    0.68869082   2    1000021    1
    0.20107167   2   -1000037    2
    0.099132368   2    1000025    1
    0.0043924609   2   -1000024    2
    0.0034539631   2    1000022    1
    0.0031232148   2    1000035    1
    0.00013551147   2    1000023    1

DECAY 2000003  143.53047
    0.98238291   2    1000021    3
    0.017574718   2    1000035    3

DECAY 1000003  206.31474
    0.68868333   2    1000021    3
    0.20106988   2   -1000037    4
    0.099131284   2    1000025    3
    0.0044008359   2   -1000024    4
    0.0034549437   2    1000022    3
    0.0031231802   2    1000035    3
    0.00013653964   2    1000023    3

DECAY 1000005  85.654577
    0.42368371   2    1000006   -24
    0.36561533   2   -1000024    6
    0.14205757   2   -1000037    6
    0.060338012   2    1000025    5
    0.0049585135   2    1000022    5
    0.0022834039   2    1000023    5
    0.0010634606   2    1000035    5

DECAY 2000005  1.2795202
    0.34260514   2    1000035    5
    0.30842139   2   -1000024    6
    0.159091   2    1000023    5
    0.15097656   2    1000022    5
    0.016482289   2   -1000037    6
    0.0142931   2    1000006   -24
    0.0079926231   2    1000025    5
    0.00013789878   2    1000005    23

DECAY 2000002  151.3496
    0.93315899   2    1000021    2
    0.066702796   2    1000035    2

DECAY 1000002  206.30948
    0.68849056   2    1000021    2
    0.19474873   2    1000037    1
    0.098822042   2    1000025    2
    0.010902939   2    1000024    1
    0.0037781625   2    1000022    2
    0.0030057587   2    1000035    2
    0.00025180665   2    1000023    2

DECAY 2000004  151.3533
    0.93313643   2    1000021    4
    0.066701183   2    1000035    4
    0.0001033616   2    1000023    4

DECAY 1000004  206.31175
    0.68848299   2    1000021    4
    0.19474666   2    1000037    3
    0.098821197   2    1000025    4
    0.010904847   2    1000024    3
    0.0037823195   2    1000022    4
    0.0030057421   2    1000035    4
    0.00025624368   2    1000023    4

DECAY 1000006  34.916236
    0.4527466   2    1000024    5
    0.26163299   2    1000023    6
    0.24053415   2    1000022    6
    0.030346072   2    1000037    5
    0.014739695   2    1000025    6

DECAY 2000006  91.658881
    0.22475831   2    1000006    25
    0.21215997   2    1000006    23
    0.18027976   2    1000022    6
    0.18013447   2    1000023    6
    0.091924142   2    1000037    5
    0.055551413   2    1000025    6
    0.052109367   2    1000024    5
    0.0030825582   2    1000035    6

DECAY 1000024  4.1734527e-13
    0.80511513   2    1000022    211
    0.10203041   3    1000022   -11    12
    0.092854466   3    1000022   -13    14

DECAY 1000037  11.410231
    0.1658987   2    1000023    24
    0.14860114   2    1000022    24
    0.14523719   2    1000024    23
    0.13065935   2    1000024    25
    0.10252182   2    1000012   -11
    0.10252144   2    1000014   -13
    0.10183399   2   -1000011    12
    0.10183366   2   -1000013    14
    0.00057162055   3    1000022   -5    6
    0.00031665114   3    1000023   -5    6

DECAY 1000022 -1


DECAY 1000023  1.8414083e-06
    0.15961047   2    1000022    22
    0.096918389   3    1000024    1   -2
    0.096918389   3   -1000024   -1    2
    0.090359095   3    1000024    3   -4
    0.090359095   3   -1000024   -3    4
    0.067836137   3    1000022    12   -12
    0.05069505   3    1000022    1   -1
    0.050653931   3    1000022    3   -3
    0.039537925   3    1000022    2   -2
    0.033464307   3    1000022    4   -4
    0.03229562   3    1000024    11   -12
    0.03229562   3   -1000024   -11    12
    0.032279798   3    1000024    13   -14
    0.032279798   3   -1000024   -13    14
    0.028226704   3    1000024    15   -16
    0.028226704   3   -1000024   -15    16
    0.01140829   3    1000022    11   -11
    0.011393809   3    1000022    13   -13
    0.0079825013   3    1000022    15   -15
    0.0072583655   3    1000022    5   -5

DECAY 1000025  12.261035
    0.14854188   2    1000023    23
    0.14050849   2    1000024   -24
    0.14050849   2   -1000024    24
    0.11315566   2    1000022    25
    0.069133104   2    1000023    25
    0.048659442   2    1000012   -12
    0.048659442   2   -1000012    12
    0.048659266   2    1000014   -14
    0.048659266   2   -1000014    14
    0.046387201   2    1000011   -11
    0.046387201   2   -1000011    11
    0.046387042   2    1000013   -13
    0.046387042   2   -1000013    13
    0.006931919   2    1000022    23
    0.00050999297   3    1000024    5   -6
    0.00050999297   3   -1000024   -5    6

DECAY 1000035  8.3161674
    0.083981854   2    1000022    25
    0.078425205   2    1000015   -15
    0.078425205   2   -1000015    15
    0.072847733   2    1000024   -24
    0.072847733   2   -1000024    24
    0.059210882   2    1000012   -12
    0.059210882   2   -1000012    12
    0.059210814   2    1000014   -14
    0.059210814   2   -1000014    14
    0.057749273   2    1000011   -11
    0.057749273   2   -1000011    11
    0.057749217   2    1000013   -13
    0.057749217   2   -1000013    13
    0.050875215   2    1000022    23
    0.047400125   2    1000023    25
    0.022142661   2    1000023    23
    0.0043096149   2    2000011   -11
    0.0043096149   2   -2000011    11
    0.0043095457   2    2000013   -13
    0.0043095457   2   -2000013    13
    0.0016965933   3    1000024    5   -6
    0.0016965933   3   -1000024   -5    6
    0.0012090664   2    1000025    25
    0.00073932373   2    1000037   -24
    0.00073932373   2   -1000037    24
    0.00067655861   2    1000025    23
    0.00064047023   3    1000022    6   -6
    0.00050778593   3    1000023    6   -6

DECAY 1000021  200.22111
    0.18808728   2    1000006   -6
    0.18808728   2   -1000006    6
    0.11180994   2    1000005   -5
    0.11180994   2   -1000005    5
    0.100439   2    2000006   -6
    0.100439   2   -2000006    6
    0.09944058   2    2000005   -5
    0.09944058   2   -2000005    5
    0.00021338922   3    1000035    6   -6

DECAY 25  0.0033863624
    0.63733593   2   -5    5
    0.16182644   2   -24    24
    0.074473017   2    21    21
    0.072921227   2   -15    15
    0.031542039   2   -4    4
    0.01794018   2    23    23
    0.0023312029   2    22    22
    0.001136593   2    22    23
    0.00025297825   2   -13    13
    0.00023955815   2   -3    3
    6.6235472e-07   2   -1    1
    1.625581e-07   2   -2    2
    5.6872931e-09   2   -11    11

DECAY 35  51.31785
    0.23921828   2   -1000024    1000037
    0.23921828   2   -1000037    1000024
    0.16264978   2    1000023    1000025
    0.076293191   2    1000022    1000025
    0.052777808   2   -6    6
    0.037004755   2    1000023    1000035
    0.036031972   2   -2000006    1000006
    0.036031972   2   -1000006    2000006
    0.031266738   2   -5    5
    0.024172611   2   -1000024    1000024
    0.023337338   2    1000022    1000035
    0.013803293   2   -1000006    1000006
    0.0064195656   2    1000022    1000022
    0.0061811259   2   -15    15
    0.0056969144   2   -1000037    1000037
    0.0049793959   2    1000022    1000023
    0.0029393746   2    1000025    1000025
    0.00082425758   2    1000025    1000035
    0.00036933997   2   -2000015    1000015
    0.00036933997   2   -1000015    2000015
    0.00021653625   2    1000023    1000023
    9.3201699e-05   2    25    25
    2.1732966e-05   2   -13    13
    1.5001285e-05   2    1000035    1000035
    1.2429861e-05   2   -3    3
    1.0991576e-05   2    23    23
    3.0836739e-06   2   -1000011    1000011
    3.0828724e-06   2   -1000013    1000013
    2.7262291e-06   2   -24    24
    2.6719802e-06   2    21    21
    1.7174196e-06   2   -2000015    2000015
    1.6458323e-06   2   -2000011    2000011
    1.645452e-06   2   -2000013    2000013
    1.534717e-06   2   -1000015    1000015
    7.527116e-07   2   -4    4
    1.132569e-07   2    22    23
    1.0861656e-07   2    22    22
    3.4364903e-08   2   -1    1
    2.676378e-09   2   -2000013    1000013
    2.676378e-09   2   -1000013    2000013
    4.8808835e-10   2   -11    11
    3.8800735e-12   2   -2    2
    6.2600782e-14   2   -2000011    1000011
    6.2600782e-14   2   -1000011    2000011

DECAY 36  51.155967
    0.22751358   2   -1000024    1000037
    0.22751358   2   -1000037    1000024
    0.14925458   2    1000022    1000025
    0.081656072   2    1000023    1000025
    0.050296085   2   -6    6
    0.043560159   2   -2000006    1000006
    0.043560159   2   -1000006    2000006
    0.037178041   2   -1000024    1000024
    0.036528968   2    1000022    1000035
    0.03008973   2   -5    5
    0.023865991   2    1000023    1000035
    0.017824293   2   -1000037    1000037
    0.012144998   2    1000022    1000022
    0.0090108639   2    1000025    1000025
    0.0059481473   2   -15    15
    0.0021491791   2    1000022    1000023
    0.00096402635   2    1000025    1000035
    0.0003704943   2   -2000015    1000015
    0.0003704943   2   -1000015    2000015
    0.00012505244   2    1000023    1000023
    2.0914127e-05   2   -13    13
    2.0455295e-05   2    21    21
    2.0338608e-05   2    23    25
    1.19611e-05   2   -3    3
    7.116237e-07   2   -4    4
    6.9375692e-07   2    1000035    1000035
    2.0029434e-07   2    22    22
    1.9767613e-07   2    22    23
    3.3069026e-08   2   -1    1
    2.6645878e-09   2   -2000013    1000013
    2.6645878e-09   2   -1000013    2000013
    4.6969814e-10   2   -11    11
    3.6684038e-12   2   -2    2
    6.2324985e-14   2   -2000011    1000011
    6.2324985e-14   2   -1000011    2000011
    2.8122865e-38   2    25    25

DECAY 37  49.924217
    0.26692494   2    1000022    1000037
    0.25538961   2    1000024    1000025
    0.24724211   2    1000023    1000037
    0.092523366   2   -5    6
    0.060292575   2    1000024    1000035
    0.054628355   2   -1000005    1000006
    0.0131069   2    1000023    1000024
    0.0063163076   2   -15    16
    0.0018257775   2    1000035    1000037
    0.00075959105   2   -1000015    1000016
    0.00075226271   2    1000022    1000024
    8.6019361e-05   2   -3    6
    4.7498751e-05   2   -5    4
    2.2330398e-05   2   -13    14
    2.086472e-05   2    24    25
    1.2508182e-05   2   -3    4
    1.2444997e-05   2   -1000011    1000012
    1.2443842e-05   2   -1000013    1000014
    1.1819325e-05   2   -2000005    1000006
    6.90175e-06   2   -2000015    1000016
    3.9444427e-06   2   -1    6
    5.5083935e-07   2   -3    2
    4.625218e-07   2    1000025    1000037
    3.3918155e-07   2   -5    2
    3.7514211e-08   2   -1    4
    3.2581648e-08   2   -1    2
    5.6154345e-09   2   -2000013    1000014
    5.2231033e-10   2   -11    12
    1.3134575e-13   2   -2000011    1000012
    5.5205173e-14   2    24    35

DECAY 6  2.43
    1   2    5    24

DECAY 15 -1
