BLOCK SPINFO
   1   SPheno
   2   v4.0.5be

BLOCK SPHENOINFO
   1   2
   2   2

BLOCK MODSEL
   1   0

BLOCK MINPAR
   3    12.225789
   4   -1

BLOCK EXTPAR
   0    2068.978
   1   -1032.3108
   2    2685.9598
   3    3388.3058
   11    3392.2019
   12    2658.8215
   13    1789.3091
   23   -1173.1638
   25    11.697507
   26    544.32669
   31    3748.1671
   32    3748.1671
   33    1686.5148
   34    3201.7189
   35    3201.7189
   36    2489.2983
   41    1146.3389
   42    1146.3389
   43    2406.7697
   44    2086.9998
   45    2086.9998
   46    1737.351
   47    2381.8058
   48    2381.8058
   49    1602.5851

BLOCK SMINPUTS
   1    127.90897
   2    1.1663787e-05
   3    0.1184
   4    91.1876
   5    4.18
   6    173.2
   7    1.777
   8    0
   11    0.00051099893
   12    0
   13    0.10565837
   14    0
   21    0.005
   22    0.0025
   23    0.095
   24    1.27

BLOCK GAUGE Q=  2068.978
   1    0.35536298
   2    0.66519887
   3    1.219778

BLOCK YU Q=  2068.978
   1   1    8.4149539e-06
   2   2    0.0042747966
   3   3    1.016594

BLOCK YD Q=  2068.978
   1   1    0.00019779956
   2   2    0.0037581916
   3   3    0.19615518

BLOCK YE Q=  2068.978
   1   1    3.4517469e-05
   2   2    0.0071371179
   3   3    0.12003458

BLOCK AU Q=  2068.978
   1   1    0
   2   2    0
   3   3    3392.2001

BLOCK AD Q=  2068.978
   1   1    0
   2   2    0
   3   3    2658.8316

BLOCK AE Q=  2068.978
   1   1    0
   2   2    0
   3   3    1789.3096

BLOCK MSOFT Q=  2068.978
   1   -1032.3108
   2    2685.9598
   3    3388.3058
   21   -1110813.2
   22   -1297943.2
   31    3748.1671
   32    3748.1671
   33    1686.5148
   34    3201.7189
   35    3201.7189
   36    2489.2983
   41    1146.3389
   42    1146.3389
   43    2406.7697
   44    2086.9998
   45    2086.9998
   46    1737.351
   47    2381.8058
   48    2381.8058
   49    1602.5851

BLOCK MASS
   6    173.2
   23    91.1876
   24    80.429995
   15    1.777
   25    121.9883
   35    544.51699
   36    544.32669
   37    550.15491
   1000001    1223.5907
   2000001    2452.8349
   1000002    1220.6599
   2000002    2157.3733
   1000003    1223.5904
   2000003    2452.8345
   1000004    1220.6598
   2000004    2157.3729
   1000005    1663.1003
   2000005    2452.8488
   1000006    1730.712
   2000006    2473.3578
   1000011    3758.4081
   2000011    3204.3157
   1000012    3757.1968
   1000013    3758.4075
   2000013    3204.3147
   1000014    3757.1961
   1000015    1706.0434
   2000015    2490.9235
   1000016    1703.9121
   1000021    3313.8166
   1000022   -1019.9738
   1000023    1184.1421
   1000025   -1193.1569
   1000035    2663.5048
   1000024    1184.7715
   1000037    2663.5949

BLOCK ALPHA
      -0.087638928

BLOCK HMIX Q=  2068.978
   1   -1173.1638
   2    11.697507
   3    243.65984
   4    296291.55

BLOCK STOPMIX
   1   1   -0.16698987
   1   2    0.98595861
   2   1   -0.98595861
   2   2   -0.16698987

BLOCK SBOTMIX
   1   1   -0.012680512
   1   2    0.9999196
   2   1   -0.9999196
   2   2   -0.012680512

BLOCK STAUMIX
   1   1   -0.99996708
   1   2    0.0081143537
   2   1   -0.0081143537
   2   2   -0.99996708

BLOCK NMIX
   1   1    0.97851483
   1   2    0.0031598527
   1   3   -0.15454267
   1   4    0.13643791
   2   1   -0.013079848
   2   2   -0.033215413
   2   3   -0.70703382
   2   4   -0.70627815
   3   1    0.2057607
   3   2   -0.015103136
   3   3    0.68997202
   3   4   -0.69381052
   4   1   -0.0004190646
   4   2    0.9993291
   4   3   -0.01258379
   4   4   -0.034392233

BLOCK UMIX
   1   1   -0.017857426
   1   2   -0.99984054
   2   1    0.99984054
   2   2   -0.017857426

BLOCK VMIX
   1   1   -0.048710882
   1   2    0.99881292
   2   1    0.99881292
   2   2    0.048710882

BLOCK HIGGSBOUNDSINPUTHIGGSCOUPLINGSFERMIONS
       0, 136.83168,3,36,15,15

BLOCK HIGGSBOUNDSINPUTHIGGSCOUPLINGSBOSONS
       0,4,36,21,21,23

BLOCK SPHENOLOWENERGY
   1    0.00039417045
   2    1.5883737e-06
   3    3.5261464e-05
   4    2.4210432e-15
   5    1.034242e-10
   6    2.16502e-08
   7    8.1693467e-14
   8    3.4899418e-09
   9    7.402274e-07
   10    9.4181495e-05
   11    0.97285879
   12    0.5430806
   13    19.394929
   14    0
   15    0
   16    0.0021617301
   17    2.2817074e-15
   18    2.480872e-11
   19    8.2916795e-11
   20   -4.835716e-16
   21   -2.0674208e-11
   22   -9.1928193e-09
   23    0
   24    0
   25    0
   26    0
   27    0
   28    0
   29    0
   30    0
   31    0
   39    2.8894627e-05
   40    0
   41    0
   42    0

BLOCK FWCOEF Q=  160
   305   4422   0   0   -0.18881911
   305   4422   0   2   -0.26086158
   305   4322   0   2   -0.0013670863
   305   6421   0   0   -0.095227835
   305   6421   0   2   -0.17614669
   305   6321   0   2   -0.0015546044
   3051111   4133   0   0    1.6031321
   3051111   4133   0   2    1.6039318
   3051111   4233   0   2   -2.5961632e-05
   3051111   4137   0   0   -4.4258242
   3051111   4137   0   2   -4.4250213
   3051111   4237   0   2    0.00019943834
   3051313   4133   0   0    1.6031321
   3051313   4133   0   2    1.6039317
   3051313   4233   0   2   -2.5962487e-05
   3051313   4137   0   0   -4.4258242
   3051313   4137   0   2   -4.4250213
   3051313   4237   0   2    0.00019943919
   3051212   4137   0   0    1.5053501
   3051212   4137   0   2    1.505176
   3051212   4237   0   2   -4.3355909e-05
   3051414   4137   0   0    1.5053501
   3051414   4137   0   2    1.505176
   3051414   4237   0   2   -4.3355723e-05
   3051616   4137   0   0    1.5053501
   3051616   4137   0   2    1.5051759
   3051616   4237   0   2   -4.3303486e-05

BLOCK IMFWCOEF Q=  160
   305   4422   0   0    3.8584514e-07
   305   4422   0   2   -2.7830407e-06
   305   4322   0   2    2.2610516e-06
   305   6421   0   0    3.3050188e-07
   305   6421   0   2    5.8802541e-07
   305   6321   0   2    1.1915362e-06
   3051111   4133   0   2   -1.5897104e-06
   3051111   4233   0   2    2.6904249e-07
   3051111   4137   0   2    1.3264401e-05
   3051111   4237   0   2   -2.0549027e-06
   3051313   4133   0   2   -1.5897096e-06
   3051313   4233   0   2    2.6904246e-07
   3051313   4137   0   2    1.3264402e-05
   3051313   4237   0   2   -2.0549028e-06
   3051212   4137   0   2   -2.8748456e-06
   3051212   4237   0   2    4.4670725e-07
   3051414   4137   0   2   -2.8748456e-06
   3051414   4237   0   2    4.4670725e-07
   3051616   4137   0   2   -2.8779798e-06
   3051616   4237   0   2    4.4670696e-07

DECAY 23  2.4952


DECAY 24  2.085


DECAY 2000011  12.958151
    0.96081321   2    1000022    11
    0.039028284   2    1000025    11
    0.00015847772   2    1000023    11

DECAY 1000011  16.362434
    0.50079039   2   -1000037    12
    0.25006114   2    1000035    11
    0.2399499   2    1000022    11
    0.0073497794   2    1000025    11
    0.0013257718   2    1000023    11
    0.00052302011   2   -1000024    12

DECAY 2000013  12.962984
    0.96045949   2    1000022    13
    0.039102081   2    1000025    13
    0.0002517664   2    1000023    13
    0.00018662998   2   -1000024    14

DECAY 1000013  16.365562
    0.50069429   2   -1000037    14
    0.25001315   2    1000035    13
    0.23990872   2    1000022    13
    0.0074379892   2    1000025    13
    0.001419919   2    1000023    13
    0.00052292003   2   -1000024    14

DECAY 1000015  1.0117517
    0.85319248   2    1000022    15
    0.076970086   2    1000025    15
    0.068352147   2    1000023    15
    0.0014852854   2   -1000024    16

DECAY 2000015  9.9235484
    0.83755267   2    1000022    15
    0.052230823   2    1000025    15
    0.042992841   2   -1000024    16
    0.021623448   2    1000023    15
    0.012380502   2    1000016   -37
    0.010340361   2    1000016   -24
    0.0062276579   2    1000015    36
    0.0062004368   2    1000015    35
    0.005340041   2    1000015    25
    0.0051112168   2    1000015    23

DECAY 1000012  16.365283
    0.49886355   2    1000037    11
    0.24983566   2    1000035    12
    0.23407741   2    1000022    12
    0.012770321   2    1000025    12
    0.0038891594   2    1000024    11
    0.00056389956   2    1000023    12

DECAY 1000014  16.368359
    0.49876937   2    1000037    13
    0.2497885   2    1000035    14
    0.23403336   2    1000022    14
    0.012767918   2    1000025    14
    0.00407705   2    1000024    13
    0.00056379345   2    1000023    14

DECAY 1000016  1.0054368
    0.8291408   2    1000022    16
    0.13920147   2    1000024    15
    0.03028601   2    1000025    16
    0.0013717232   2    1000023    16

DECAY 1000001  0.014745871
    0.99532929   2    1000022    1
    0.002359927   2    1000025    1
    0.0014024913   2    1000023    1
    0.00090828827   2   -1000024    2

DECAY 2000001  0.9308625
    0.96355443   2    1000022    1
    0.03629555   2    1000025    1
    0.0001486389   2    1000023    1

DECAY 1000003  0.014749255
    0.9951645   2    1000022    3
    0.0023822982   2    1000025    3
    0.0014518105   2    1000023    3
    0.0010013883   2   -1000024    4

DECAY 2000003  0.93172986
    0.96266983   2    1000022    3
    0.036465749   2    1000025    3
    0.00043467757   2   -1000024    4
    0.00036536013   2    1000023    3

DECAY 1000005  0.93691295
    0.38519524   2    1000022    5
    0.28931641   2   -1000024    6
    0.16551701   2    1000023    5
    0.15997134   2    1000025    5

DECAY 2000005  68.249088
    0.50943939   2    1000006   -24
    0.42523559   2   -1000024    6
    0.029950598   2    1000006   -37
    0.0081629596   2    1000023    5
    0.0079564005   2    1000025    5
    0.0057649801   2    1000005    36
    0.0057462429   2    1000005    35
    0.0035305443   2    1000022    5
    0.0023866834   2    1000005    25
    0.0018266059   2    1000005    23

DECAY 1000002  0.015514766
    0.99264456   2    1000022    2
    0.0055167666   2    1000024    1
    0.0015197905   2    1000023    2
    0.00031887932   2    1000025    2

DECAY 2000002  2.8799042
    0.96573556   2    1000022    2
    0.03412471   2    1000025    2
    0.00013973118   2    1000023    2

DECAY 1000004  0.015515945
    0.99249944   2    1000022    4
    0.0055982039   2    1000024    3
    0.0015471817   2    1000023    4
    0.00035517071   2    1000025    4

DECAY 2000004  2.8809129
    0.96540151   2    1000022    4
    0.034172771   2    1000025    4
    0.00020618097   2    1000023    4
    0.00013247801   2    1000024    3

DECAY 1000006  21.261556
    0.45364164   2    1000024    5
    0.23771664   2    1000023    6
    0.20956069   2    1000025    6
    0.099081029   2    1000022    6

DECAY 2000006  75.357874
    0.30057228   2    1000006    25
    0.24043471   2    1000006    23
    0.19145775   2    1000023    6
    0.18819748   2    1000025    6
    0.030304032   2    1000024    5
    0.014702731   2    1000006    36
    0.012842523   2    1000006    35
    0.010657106   2    1000005    37
    0.0073733756   2    1000022    6
    0.0034580116   2    1000005    24

DECAY 1000024  0.53508784
    0.99999961   2    1000022    24

DECAY 1000037  137.67452
    0.15905363   2    1000004   -3
    0.15905362   2    1000002   -1
    0.15897391   2   -1000001    2
    0.15897382   2   -1000003    4
    0.041046906   2    1000024    35
    0.041039695   2    1000024    36
    0.041021442   2    37    1000023
    0.035267137   2    1000024    25
    0.032266267   2    1000024    23
    0.032144484   2    1000023    24
    0.030829237   2    1000025    24
    0.030022792   2    37    1000025
    0.029651482   2    1000016   -15
    0.029605369   2   -1000015    16
    0.0049207138   2    1000006   -5
    0.0045828975   2    2000006   -5
    0.0030433987   2   -2000005    6
    0.0020087404   3    1000024    6   -6
    0.0018473228   3    1000025   -5    6
    0.0016568468   2    1000022    24
    0.0014492232   3    1000023   -5    6
    0.0014347202   2    37    1000022

DECAY 1000022 -1


DECAY 1000023  0.71903025
    0.76562969   2    1000022    23
    0.23434411   2    1000022    25

DECAY 1000025  0.23970268
    0.99111076   2    1000022    25
    0.0088824522   2    1000022    23

DECAY 1000035  142.49713
    0.076897927   2    1000002   -2
    0.076897927   2   -1000002    2
    0.07689787   2    1000004   -4
    0.07689787   2   -1000004    4
    0.0767244   2    1000003   -3
    0.0767244   2   -1000003    3
    0.07672438   2    1000001   -1
    0.07672438   2   -1000001    1
    0.039542259   2    37   -1000024
    0.039542259   2   -37    1000024
    0.038283981   2    1000025    25
    0.036394766   2    1000023    35
    0.031348562   2    1000024   -24
    0.031348562   2   -1000024    24
    0.028119304   2    1000023    25
    0.024524061   2    1000025    35
    0.024521013   2    1000025    23
    0.014343048   2    1000016   -16
    0.014343048   2   -1000016    16
    0.014279197   2    1000015   -15
    0.014279197   2   -1000015    15
    0.0055480416   2    1000023    23
    0.0044425034   2    1000025    36
    0.003358343   2    1000023    36
    0.0028450782   2    2000005   -5
    0.0028450782   2   -2000005    5
    0.0023009006   2    1000006   -6
    0.0023009006   2   -1000006    6
    0.0018552796   2    1000022    25
    0.0014014825   3    1000024    5   -6
    0.0014014825   3   -1000024   -5    6
    0.0012394727   2    1000022    23
    0.001113556   3    1000025    6   -6
    0.001098154   2    1000022    35
    0.00090021759   3    1000023    6   -6
    0.00081663479   2    2000006   -6
    0.00081663479   2   -2000006    6
    0.0002861945   2    1000022    36

DECAY 1000021  544.72245
    0.067260306   2    1000002   -2
    0.067260306   2   -1000002    2
    0.067260305   2    1000004   -4
    0.067260305   2   -1000004    4
    0.067158825   2    1000003   -3
    0.067158825   2   -1000003    3
    0.067158816   2    1000001   -1
    0.067158816   2   -1000001    1
    0.050396829   2    1000005   -5
    0.050396829   2   -1000005    5
    0.049719838   2    1000006   -6
    0.049719838   2   -1000006    6
    0.029889138   2    2000004   -4
    0.029889138   2   -2000004    4
    0.029889134   2    2000002   -2
    0.029889134   2   -2000002    2
    0.018405034   2    2000003   -3
    0.018405034   2   -2000003    3
    0.01840502   2    2000001   -1
    0.01840502   2   -2000001    1
    0.018401753   2    2000005   -5
    0.018401753   2   -2000005    5
    0.016040173   2    2000006   -6
    0.016040173   2   -2000006    6

DECAY 25  0.0039391151
    0.64953708   2   -5    5
    0.16231907   2   -24    24
    0.072768833   2   -15    15
    0.065885   2    21    21
    0.027299764   2   -4    4
    0.018492096   2    23    23
    0.0020890705   2    22    22
    0.0011140586   2    22    23
    0.0002528521   2   -13    13
    0.00024135723   2   -3    3
    6.6731265e-07   2   -1    1
    1.4069122e-07   2   -2    2
    5.6844379e-09   2   -11    11

DECAY 35  1.7239341
    0.82753885   2   -5    5
    0.095649293   2   -15    15
    0.070369149   2   -6    6
    0.0040055418   2    25    25
    0.0010466965   2   -24    24
    0.00050383537   2    23    23
    0.00033986131   2   -13    13
    0.00028886083   2   -3    3
    0.0002547345   2    21    21
    1.8296182e-06   2   -4    4
    7.9848154e-07   2   -1    1
    4.3637328e-07   2    22    22
    1.0627509e-07   2    22    23
    7.6370774e-09   2   -11    11
    9.4369001e-12   2   -2    2

DECAY 36  1.7541509
    0.80453476   2   -5    5
    0.10057539   2   -6    6
    0.092987262   2   -15    15
    0.00084945363   2    23    25
    0.00043855087   2    21    21
    0.00033038289   2   -13    13
    0.00028080255   2   -3    3
    1.5434696e-06   2   -4    4
    8.4578269e-07   2    22    22
    7.7620649e-07   2   -1    1
    2.296687e-07   2    22    23
    7.4240879e-09   2   -11    11
    7.9636649e-12   2   -2    2
    3.0912779e-37   2    25    25

DECAY 37  1.411096
    0.88005968   2   -5    6
    0.11653831   2   -15    16
    0.0013802235   2   -5    4
    0.0011210693   2    24    25
    0.0004120128   2   -13    14
    0.00031041605   2   -3    4
    0.00014660009   2   -3    6
    1.4138717e-05   2   -3    2
    9.8563054e-06   2   -5    2
    6.7070849e-06   2   -1    6
    8.5666762e-07   2   -1    2
    1.14144e-07   2   -1    4
    9.6370231e-09   2   -11    12
    6.4074601e-09   2    24    36
    5.4291042e-09   2    24    35

DECAY 6  2.43
    1   2    5    24

DECAY 15 -1
