BLOCK SPINFO
   1   SPheno
   2   v4.0.5be

BLOCK SPHENOINFO
   1   2
   2   2

BLOCK MODSEL
   1   0

BLOCK MINPAR
   3    17.243475
   4    1

BLOCK EXTPAR
   0    1305.2259
   1    368.09146
   2   -634.07897
   3    3000
   11    2329.7633
   12   -1474.5307
   13    1021.2946
   23    1913.3086
   25    16.579462
   26    3845.3154
   31    1901.83
   32    1901.83
   33    561.19579
   34    484.42755
   35    484.42755
   36    1813.3149
   41    5000
   42    5000
   43    1236.6379
   44    5000
   45    5000
   46    1460.8044
   47    5000
   48    5000
   49    1274.3828

BLOCK SMINPUTS
   1    127.90897
   2    1.1663787e-05
   3    0.1184
   4    91.1876
   5    4.18
   6    173.2
   7    1.777
   8    0
   11    0.00051099893
   12    0
   13    0.10565837
   14    0
   21    0.005
   22    0.0025
   23    0.095
   24    1.27

BLOCK GAUGE Q=  1305.2259
   1    0.35536298
   2    0.66519887
   3    1.219778

BLOCK YU Q=  1305.2259
   1   1    8.3996093e-06
   2   2    0.0042670015
   3   3    1.0147403

BLOCK YD Q=  1305.2259
   1   1    0.00027983999
   2   2    0.0053169598
   3   3    0.27751358

BLOCK YE Q=  1305.2259
   1   1    4.8834124e-05
   2   2    0.010097348
   3   3    0.16982078

BLOCK AU Q=  1305.2259
   1   1    0
   2   2    0
   3   3    2329.7633

BLOCK AD Q=  1305.2259
   1   1    0
   2   2    0
   3   3   -1474.5308

BLOCK AE Q=  1305.2259
   1   1    0
   2   2    0
   3   3    1021.2946

BLOCK MSOFT Q=  1305.2259
   1    368.09146
   2   -634.07897
   3    3000
   21    11091952
   22   -3553858.1
   31    1901.83
   32    1901.83
   33    561.19579
   34    484.42755
   35    484.42755
   36    1813.3149
   41    5000
   42    5000
   43    1236.6379
   44    5000
   45    5000
   46    1460.8044
   47    5000
   48    5000
   49    1274.3828

BLOCK MASS
   6    173.2
   23    91.1876
   24    80.429995
   15    1.777
   25    120.21136
   35    3844.3101
   36    3845.3154
   37    3845.7953
   1000001    5018.7055
   2000001    5008.3138
   1000002    5018.2567
   2000002    5011.3254
   1000003    5018.7085
   2000003    5008.3139
   1000004    5018.2581
   2000004    5011.3264
   1000005    1193.5166
   2000005    1253.98
   1000006    1145.6532
   2000006    1487.0248
   1000011    1908.0106
   2000011    474.80839
   1000012    1905.9778
   1000013    1908.0131
   2000013    474.82552
   1000014    1905.9794
   1000015    579.75265
   2000015    1813.0742
   1000016    574.79484
   1000021    3171.5316
   1000022    367.63638
   1000023   -671.39215
   1000025   -1905.9285
   1000035    1906.6152
   1000024    671.54137
   1000037    1907.8755

BLOCK ALPHA
      -0.058030932

BLOCK HMIX Q=  1305.2259
   1    1913.3086
   2    16.579462
   3    244.17615
   4    14786450

BLOCK STOPMIX
   1   1   -0.91142345
   1   2    0.41146966
   2   1   -0.41146966
   2   2   -0.91142345

BLOCK SBOTMIX
   1   1    0.89346602
   1   2    0.44913079
   2   1   -0.44913079
   2   2    0.89346602

BLOCK STAUMIX
   1   1    0.99984716
   1   2    0.017482918
   2   1   -0.017482918
   2   2    0.99984716

BLOCK NMIX
   1   1   -0.99968673
   1   2   -0.00050942538
   1   3   -0.024322879
   1   4    0.005881082
   2   1    0.00053029001
   2   2    0.99884646
   2   3   -0.046024041
   2   4   -0.013683802
   3   1    0.013038685
   3   2   -0.042218677
   3   3   -0.70593632
   3   4   -0.70689567
   4   1    0.021357916
   4   2   -0.022870586
   4   3   -0.70635975
   4   4    0.707161

BLOCK UMIX
   1   1   -0.99787742
   1   2    0.065120354
   2   1   -0.065120354
   2   2   -0.99787742

BLOCK VMIX
   1   1    0.99980975
   1   2    0.019505391
   2   1    0.019505391
   2   2   -0.99980975

BLOCK HIGGSBOUNDSINPUTHIGGSCOUPLINGSFERMIONS
       0, 274.87856,3,36,15,15

BLOCK HIGGSBOUNDSINPUTHIGGSCOUPLINGSBOSONS
       0,4,36,21,21,23

BLOCK SPHENOLOWENERGY
   1    0.00033066827
   2    1.5883094e-06
   3    3.5235759e-05
   4    2.9400287e-15
   5    1.2559474e-10
   6    2.6296211e-08
   7    9.8884203e-14
   8    4.2243316e-09
   9    8.9615754e-07
   10    9.6669314e-05
   11    0.99855701
   12    0.54273744
   13    19.391891
   14    0
   15    0
   16    0.0021612084
   17    2.2816979e-15
   18    2.4783904e-11
   19    8.2867751e-11
   20   -2.0047056e-15
   21   -8.5707998e-11
   22   -4.0854716e-08
   23    0
   24    0
   25    0
   26    0
   27    0
   28    0
   29    0
   30    0
   31    0
   39    5.5518499e-05
   40    0
   41    0
   42    0

BLOCK FWCOEF Q=  160
   305   4422   0   0   -0.18881911
   305   4422   0   2   -0.20033094
   305   4322   0   2   -0.00013127683
   305   6421   0   0   -0.095227835
   305   6421   0   2   -0.10555573
   305   6321   0   2   -0.00014035324
   3051111   4133   0   0    1.5868583
   3051111   4133   0   2    1.5872675
   3051111   4233   0   2    2.9484844e-05
   3051111   4137   0   0   -4.4095504
   3051111   4137   0   2   -4.4062106
   3051111   4237   0   2   -0.00023089379
   3051313   4133   0   0    1.5868583
   3051313   4133   0   2    1.5872671
   3051313   4233   0   2    2.9484815e-05
   3051313   4137   0   0   -4.4095504
   3051313   4137   0   2   -4.406211
   3051313   4237   0   2   -0.00023089383
   3051212   4137   0   0    1.5053501
   3051212   4137   0   2    1.5046307
   3051212   4237   0   2    5.0369421e-05
   3051414   4137   0   0    1.5053501
   3051414   4137   0   2    1.5046307
   3051414   4237   0   2    5.0369422e-05
   3051616   4137   0   0    1.5053501
   3051616   4137   0   2    1.5046316
   3051616   4237   0   2    5.0368733e-05

BLOCK IMFWCOEF Q=  160
   305   4422   0   0    3.8576748e-07
   305   4422   0   2   -3.1075836e-06
   305   4322   0   2   -9.366369e-07
   305   6421   0   0    3.3043536e-07
   305   6421   0   2   -7.7546036e-06
   305   6321   0   2   -6.1053541e-07
   3051111   4133   0   2    3.3538188e-07
   3051111   4233   0   2    6.098307e-07
   3051111   4137   0   2    6.4014376e-08
   3051111   4237   0   2   -4.7778087e-06
   3051313   4133   0   2    3.3537781e-07
   3051313   4233   0   2    6.0983026e-07
   3051313   4137   0   2    6.4016592e-08
   3051313   4237   0   2   -4.7778095e-06
   3051212   4137   0   2    1.548173e-07
   3051212   4237   0   2    1.0423049e-06
   3051414   4137   0   2    1.5481742e-07
   3051414   4237   0   2    1.0423049e-06
   3051616   4137   0   2    1.6989739e-07
   3051616   4237   0   2    1.0422882e-06

DECAY 23  2.4952


DECAY 24  2.085


DECAY 2000011  0.38240432
    1   2    1000022    11

DECAY 1000011  21.499015
    0.59714778   2   -1000024    12
    0.2993614   2    1000023    11
    0.10349082   2    1000022    11

DECAY 2000013  0.38250027
    1   2    1000022    13

DECAY 1000013  21.500877
    0.59709731   2   -1000024    14
    0.29933636   2    1000023    13
    0.10348212   2    1000022    13

DECAY 1000015  0.26127997
    0.99999998   2    1000022    15

DECAY 2000015  10.190226
    0.82121548   2    1000022    15
    0.087812843   2    1000016   -24
    0.047434227   2    1000015    25
    0.043535807   2    1000015    23

DECAY 1000012  21.498066
    0.59848912   2    1000024    11
    0.29853642   2    1000023    12
    0.10297446   2    1000022    12

DECAY 1000014  21.498108
    0.59848939   2    1000024    13
    0.29853624   2    1000023    14
    0.10297436   2    1000022    14

DECAY 1000016  0.25148351
    1   2    1000022    16

DECAY 2000001  144.60322
    0.98087447   2    1000021    1
    0.019116594   2    1000022    1

DECAY 1000001  207.47413
    0.68885826   2    1000021    1
    0.20451386   2   -1000024    2
    0.10243792   2    1000023    1
    0.0033189064   2    1000022    1
    0.00066087296   2   -1000037    2
    0.00015470458   2    1000025    1

DECAY 2000003  144.60733
    0.98084658   2    1000021    3
    0.019116062   2    1000022    3

DECAY 1000003  207.47788
    0.68884732   2    1000021    3
    0.20451026   2   -1000024    4
    0.10243616   2    1000023    3
    0.0033188564   2    1000022    3
    0.00066730396   2   -1000037    4
    0.00015965555   2    1000025    3

DECAY 1000005  5.8524465
    0.61485045   2   -1000024    6
    0.34328362   2    1000023    5
    0.041865922   2    1000022    5

DECAY 2000005  2.2016799
    0.41879032   2   -1000024    6
    0.22977981   2    1000023    5
    0.21300412   2    1000022    5
    0.13842576   2    1000006   -24

DECAY 2000002  153.22051
    0.92775637   2    1000021    2
    0.072210154   2    1000022    2

DECAY 1000002  207.46484
    0.68866368   2    1000021    2
    0.20529618   2    1000024    1
    0.10247142   2    1000023    2
    0.0033569587   2    1000022    2
    0.00012410379   2    1000025    2

DECAY 2000004  153.22321
    0.92774031   2    1000021    4
    0.072208885   2    1000022    4

DECAY 1000004  207.46833
    0.68865249   2    1000021    4
    0.20529285   2    1000024    3
    0.10246972   2    1000023    4
    0.003356903   2    1000022    4
    0.00012729792   2    1000025    4

DECAY 1000006  5.8233434
    0.63704965   2    1000024    5
    0.28899101   2    1000023    6
    0.063722218   2    1000022    6
    0.0093738377   2    1000023    4
    0.00055886075   2    1000022    4
    0.00030350005   3    1000022    24    5

DECAY 2000006  32.87745
    0.36798925   2    1000005    24
    0.28699175   2    1000006    23
    0.16914518   2    1000006    25
    0.074318053   2    1000022    6
    0.046259687   2    2000005    24
    0.037295646   2    1000024    5
    0.01800043   2    1000023    6

DECAY 1000024  0.40213557
    0.52500102   2    1000016   -15
    0.47488048   2   -1000015    16
    0.00011508857   2    1000022    24

DECAY 1000037  48.009787
    0.37728373   2   -1000005    6
    0.16082751   2    2000006   -5
    0.10998078   2    1000006   -5
    0.078624756   2    1000024    25
    0.076798336   2    1000023    24
    0.075897482   2    1000024    23
    0.075575102   2   -2000005    6
    0.027462446   2    1000022    24
    0.009442375   2    1000016   -15
    0.0032862255   3    1000024    6   -6
    0.003151716   3    1000023   -5    6
    0.0009722653   3    1000022   -5    6
    0.00053018434   2   -1000015    16
    0.00010753108   2   -2000015    16

DECAY 1000022 -1


DECAY 1000023  0.40127
    0.2618516   2    1000016   -16
    0.2618516   2   -1000016    16
    0.23806837   2    1000015   -15
    0.23806837   2   -1000015    15
    0.00014110828   2    1000022    23

DECAY 1000025  46.381825
    0.19728279   2    1000006   -6
    0.19728279   2   -1000006    6
    0.12325675   2    2000006   -6
    0.12325675   2   -2000006    6
    0.078430448   2    1000024   -24
    0.078430448   2   -1000024    24
    0.063212627   2    1000023    25
    0.020674022   2    1000022    23
    0.017877783   2    1000023    23
    0.016506192   2    2000005   -5
    0.016506192   2   -2000005    5
    0.015979147   2    1000005   -5
    0.015979147   2   -1000005    5
    0.015504672   2    1000022    25
    0.004895185   2    1000015   -15
    0.004895185   2   -1000015    15
    0.0036146764   3    1000024    5   -6
    0.0036146764   3   -1000024   -5    6
    0.0015975353   3    1000023    6   -6
    0.00060935445   3    1000022    6   -6
    0.00018078274   2    1000016   -16
    0.00018078274   2   -1000016    16

DECAY 1000035  48.801836
    0.1929879   2    1000006   -6
    0.1929879   2   -1000006    6
    0.11246821   2    2000006   -6
    0.11246821   2   -2000006    6
    0.07607125   2    1000023    25
    0.075017921   2    1000024   -24
    0.075017921   2   -1000024    24
    0.058162978   2    1000023    23
    0.01854855   2    1000022    25
    0.015612477   2    1000005   -5
    0.015612477   2   -1000005    5
    0.01529643   2    2000005   -5
    0.01529643   2   -2000005    5
    0.0073332463   2    1000022    23
    0.0045927979   2    1000015   -15
    0.0045927979   2   -1000015    15
    0.0025635418   3    1000024    5   -6
    0.0025635418   3   -1000024   -5    6
    0.0017211297   3    1000023    6   -6
    0.00059871211   3    1000022    6   -6

DECAY 1000021  266.50427
    0.14551159   2    1000006   -6
    0.14551159   2   -1000006    6
    0.12945407   2    1000005   -5
    0.12945407   2   -1000005    5
    0.12567786   2    2000005   -5
    0.12567786   2   -2000005    5
    0.095777158   2    2000006   -6
    0.095777158   2   -2000006    6
    0.0033510556   2    1000006   -4
    0.0033510556   2   -1000006    4

DECAY 25  0.0033429909
    0.64261972   2   -5    5
    0.15607487   2   -24    24
    0.074705538   2    21    21
    0.07364026   2   -15    15
    0.031888633   2   -4    4
    0.017158264   2    23    23
    0.0023141966   2    22    22
    0.0011001628   2    22    23
    0.00025542814   2   -13    13
    0.00024208575   2   -3    3
    6.6934426e-07   2   -1    1
    1.6434587e-07   2   -2    2
    5.742376e-09   2   -11    11

DECAY 35  74.816863
    0.16165478   2   -1000006    1000006
    0.13185564   2   -2000006    2000006
    0.1169147   2   -2000006    1000006
    0.1169147   2   -1000006    2000006
    0.10414043   2   -1000024    1000037
    0.10414043   2   -1000037    1000024
    0.082589624   2   -5    5
    0.057748488   2    1000023    1000025
    0.045823651   2    1000023    1000035
    0.027426373   2   -15    15
    0.020518567   2    1000022    1000035
    0.012592463   2    1000022    1000025
    0.0050618892   2   -6    6
    0.0023619702   2   -1000005    1000005
    0.0021067765   2   -2000005    2000005
    0.0015476685   2   -1000024    1000024
    0.0015253706   2   -2000005    1000005
    0.0015253706   2   -1000005    2000005
    0.00098391494   2   -2000015    1000015
    0.00098391494   2   -1000015    2000015
    0.00077322428   2    1000023    1000023
    0.00046780372   2    1000022    1000023
    0.00010064961   2   -13    13
    6.1094805e-05   2    1000022    1000022
    5.8194458e-05   2    1000025    1000035
    5.478131e-05   2    25    25
    5.4683543e-05   2   -3    3
    6.7735751e-06   2    21    21
    1.2982085e-06   2    23    23
    9.8515451e-07   2   -2000015    2000015
    8.5486207e-07   2   -1000015    1000015
    2.8728632e-07   2   -24    24
    2.8715134e-07   2    1000035    1000035
    1.9592115e-07   2   -1000011    1000011
    1.9518897e-07   2   -1000013    1000013
    1.5118794e-07   2   -1    1
    1.313616e-07   2    1000025    1000025
    7.9801508e-08   2   -1000037    1000037
    7.1614206e-08   2   -4    4
    4.4725583e-08   2   -2000013    2000013
    4.4721238e-08   2   -2000011    2000011
    4.254376e-08   2    22    23
    3.5528999e-08   2    22    22
    3.2855483e-08   2   -2000013    1000013
    3.2855483e-08   2   -1000013    2000013
    2.2603423e-09   2   -11    11
    7.6849628e-13   2   -2000011    1000011
    7.6849628e-13   2   -1000011    2000011
    3.692165e-13   2   -2    2

DECAY 36  74.706429
    0.26601979   2   -2000006    1000006
    0.26601979   2   -1000006    2000006
    0.10431785   2   -1000024    1000037
    0.10431785   2   -1000037    1000024
    0.078937064   2   -5    5
    0.05767392   2    1000023    1000035
    0.046099189   2    1000023    1000025
    0.026199645   2   -15    15
    0.020622394   2    1000022    1000025
    0.012573653   2    1000022    1000035
    0.0045417217   2   -6    6
    0.0037656397   2   -2000005    1000005
    0.0037656397   2   -1000005    2000005
    0.001630607   2   -1000024    1000024
    0.00098629542   2   -2000015    1000015
    0.00098629542   2   -1000015    2000015
    0.00081453733   2    1000023    1000023
    0.00043675746   2    1000022    1000023
    9.614471e-05   2   -13    13
    6.7285425e-05   2    1000022    1000022
    5.2231878e-05   2   -3    3
    3.644399e-05   2    1000035    1000035
    2.4496567e-05   2    1000025    1000025
    6.6275368e-06   2   -1000037    1000037
    4.7263235e-06   2    21    21
    2.6304539e-06   2    23    25
    4.5773795e-07   2    1000025    1000035
    1.4440926e-07   2   -1    1
    7.0381457e-08   2   -4    4
    3.2820767e-08   2   -2000013    1000013
    3.2820767e-08   2   -1000013    2000013
    3.2783634e-08   2    22    23
    2.7594171e-09   2    22    22
    2.1591953e-09   2   -11    11
    7.6768098e-13   2   -2000011    1000011
    7.6768098e-13   2   -1000011    2000011
    3.6289163e-13   2   -2    2
    1.5101474e-14   2    23    35
    6.800734e-38   2    25    25

DECAY 37  61.257944
    0.27682211   2   -1000005    2000006
    0.12819879   2    1000023    1000037
    0.12758768   2    1000024    1000035
    0.1274486   2    1000024    1000025
    0.11748962   2   -5    6
    0.072100618   2   -2000005    2000006
    0.068417275   2   -1000005    1000006
    0.040442342   2    1000022    1000037
    0.037330915   2   -15    16
    0.0024084148   2   -2000015    1000016
    0.0011050572   2    1000022    1000024
    0.00023355922   2   -2000005    1000006
    0.00016224769   2   -5    4
    0.00013197808   2   -13    14
    6.234812e-05   2   -3    4
    2.8012135e-05   2    1000025    1000037
    1.1653597e-05   2   -3    6
    1.0242639e-05   2    1000035    1000037
    3.2103559e-06   2    24    25
    2.9235176e-06   2   -3    2
    1.1586147e-06   2   -5    2
    5.3023777e-07   2   -1    6
    2.2268943e-07   2   -2000013    1000014
    2.2268269e-07   2   -2000011    1000012
    1.7276285e-07   2   -1    2
    7.949198e-08   2   -1000013    1000014
    1.2924441e-08   2   -1    4
    3.086981e-09   2   -11    12
    2.2688756e-09   2   -1000015    1000016
    1.8148227e-10   2    1000023    1000024
    1.8593229e-12   2   -1000011    1000012
    1.6061526e-13   2    24    35

DECAY 6  2.43
    1   2    5    24

DECAY 15 -1
