BLOCK SPINFO
   1   SPheno
   2   v4.0.5be

BLOCK SPHENOINFO
   1   2
   2   2

BLOCK MODSEL
   1   0

BLOCK MINPAR
   3    13.961838
   4   -1

BLOCK EXTPAR
   0    1652.1846
   1   -309.95705
   2    1763.4395
   3    4550.3159
   11    4990.5862
   12    6143.4521
   13    2.2775092
   23   -162.96295
   25    13.368034
   26    4672.3994
   31    3152.6968
   32    3152.6968
   33    483.20345
   34    4209.5584
   35    4209.5584
   36    1059.1445
   41    1765.6768
   42    1765.6768
   43    2368.628
   44    4133.8696
   45    4133.8696
   46    1490.8265
   47    4966.5469
   48    4966.5469
   49    4943.2164

BLOCK SMINPUTS
   1    127.90897
   2    1.1663787e-05
   3    0.1184
   4    91.1876
   5    4.18
   6    173.2
   7    1.777
   8    0
   11    0.00051099893
   12    0
   13    0.10565837
   14    0
   21    0.005
   22    0.0025
   23    0.095
   24    1.27

BLOCK GAUGE Q=  1652.1846
   1    0.35536298
   2    0.66519887
   3    1.219778

BLOCK YU Q=  1652.1846
   1   1    8.4077982e-06
   2   2    0.0042711615
   3   3    1.0157296

BLOCK YD Q=  1652.1846
   1   1    0.00022585518
   2   2    0.0042912484
   3   3    0.22397756

BLOCK YE Q=  1652.1846
   1   1    3.941338e-05
   2   2    0.008149437
   3   3    0.13706013

BLOCK AU Q=  1652.1846
   1   1    0
   2   2    0
   3   3    4990.5863

BLOCK AD Q=  1652.1846
   1   1    0
   2   2    0
   3   3    6143.4521

BLOCK AE Q=  1652.1846
   1   1    0
   2   2    0
   3   3    2.2775092

BLOCK MSOFT Q=  1652.1846
   1   -309.95705
   2    1763.4395
   3    4550.3159
   21    21601056
   22    194878.56
   31    3152.6968
   32    3152.6968
   33    483.20345
   34    4209.5584
   35    4209.5584
   36    1059.1445
   41    1765.6768
   42    1765.6768
   43    2368.628
   44    4133.8696
   45    4133.8696
   46    1490.8265
   47    4966.5469
   48    4966.5469
   49    4943.2164

BLOCK MASS
   6    173.2
   23    91.1876
   24    80.429995
   15    1.777
   25    125.10417
   35    4671.8653
   36    4672.3994
   37    4672.7925
   1000001    1678.2664
   2000001    4985.6826
   1000002    1676.4594
   2000002    4154.1894
   1000003    1678.2674
   2000003    4985.6828
   1000004    1676.4605
   2000004    4154.1893
   1000005    2260.6434
   2000005    4964.8544
   1000006    1187.5388
   2000006    2298.6313
   1000011    3158.7892
   2000011    4216.0517
   1000012    3157.447
   1000013    3158.7905
   2000013    4216.0528
   1000014    3157.4483
   1000015    507.57845
   2000015    1073.7006
   1000016    501.25099
   1000021    4484.902
   1000022   -166.42619
   1000023    173.61214
   1000025   -319.52688
   1000035    1791.4356
   1000024    173.40083
   1000037    1791.6485

BLOCK ALPHA
      -0.071576518

BLOCK HMIX Q=  1652.1846
   1   -162.96295
   2    13.368034
   3    243.75844
   4    21831316

BLOCK STOPMIX
   1   1   -0.20164694
   1   2    0.97945827
   2   1   -0.97945827
   2   2   -0.20164694

BLOCK SBOTMIX
   1   1   -0.99999954
   1   2    0.00096242336
   2   1   -0.00096242336
   2   2   -0.99999954

BLOCK STAUMIX
   1   1   -0.99999094
   1   2    0.0042573435
   2   1   -0.0042573435
   2   2   -0.99999094

BLOCK NMIX
   1   1    0.22736619
   1   2    0.029193489
   1   3   -0.6998195
   1   4    0.676539
   2   1   -0.060729641
   2   2   -0.031342754
   2   3   -0.70421707
   2   4   -0.70668796
   3   1   -0.97191336
   3   2    0.0077869201
   3   3   -0.11971
   3   4    0.20246802
   4   1    0.00097375818
   4   2   -0.99905192
   4   3    0.0007104306
   4   4    0.043517942

BLOCK UMIX
   1   1   -0.001013374
   1   2   -0.99999949
   2   1    0.99999949
   2   2   -0.001013374

BLOCK VMIX
   1   1   -0.061528518
   1   2    0.99810533
   2   1    0.99810533
   2   2    0.061528518

BLOCK HIGGSBOUNDSINPUTHIGGSCOUPLINGSFERMIONS
       0, 178.70432,3,36,15,15

BLOCK HIGGSBOUNDSINPUTHIGGSCOUPLINGSBOSONS
       0,4,36,21,21,23

BLOCK SPHENOLOWENERGY
   1    0.00031677565
   2    1.5895786e-06
   3    3.5226162e-05
   4    2.5806294e-15
   5    1.1024154e-10
   6    2.3078032e-08
   7    8.7051227e-14
   8    3.7188251e-09
   9    7.8879593e-07
   10    9.6759327e-05
   11    0.9994868
   12    0.54238076
   13    19.379492
   14    0
   15    0
   16    0.0021589757
   17    2.2816751e-15
   18    2.4787131e-11
   19    8.2861527e-11
   20   -8.1666915e-16
   21   -3.4915288e-11
   22   -1.4016304e-09
   23    0
   24    0
   25    0
   26    0
   27    0
   28    0
   29    0
   30    0
   31    0
   39    1.3151336e-05
   40    0
   41    0
   42    0

BLOCK FWCOEF Q=  160
   305   4422   0   0   -0.18881911
   305   4422   0   2   -0.18411957
   305   4322   0   2    0.00011246908
   305   6421   0   0   -0.095227835
   305   6421   0   2   -0.095865146
   305   6321   0   2   -1.578196e-06
   3051111   4133   0   0    1.5951953
   3051111   4133   0   2    1.5957527
   3051111   4233   0   2    2.4722906e-05
   3051111   4137   0   0   -4.4178874
   3051111   4137   0   2   -4.4136334
   3051111   4237   0   2   -0.00019156832
   3051313   4133   0   0    1.5951953
   3051313   4133   0   2    1.5957526
   3051313   4233   0   2    2.4722901e-05
   3051313   4137   0   0   -4.4178874
   3051313   4137   0   2   -4.4136335
   3051313   4237   0   2   -0.00019156833
   3051212   4137   0   0    1.5053501
   3051212   4137   0   2    1.5044259
   3051212   4237   0   2    4.1719581e-05
   3051414   4137   0   0    1.5053501
   3051414   4137   0   2    1.5044259
   3051414   4237   0   2    4.1719581e-05
   3051616   4137   0   0    1.5053501
   3051616   4137   0   2    1.5044254
   3051616   4237   0   2    4.1719629e-05

BLOCK IMFWCOEF Q=  160
   305   4422   0   0    3.858315e-07
   305   4422   0   2   -4.7190064e-06
   305   4322   0   2    2.9927657e-06
   305   6421   0   0    3.304902e-07
   305   6421   0   2   -1.1557403e-06
   305   6321   0   2    1.360454e-06
   3051111   4133   0   2   -2.3837246e-06
   3051111   4233   0   2    4.8192193e-07
   3051111   4137   0   2    1.9505607e-05
   3051111   4237   0   2   -3.7344652e-06
   3051313   4133   0   2   -2.3837236e-06
   3051313   4233   0   2    4.8192186e-07
   3051313   4137   0   2    1.950561e-05
   3051313   4237   0   2   -3.7344655e-06
   3051212   4137   0   2   -4.2069733e-06
   3051212   4237   0   2    8.1328857e-07
   3051414   4137   0   2   -4.2069733e-06
   3051414   4237   0   2    8.1328857e-07
   3051616   4137   0   2   -4.2160718e-06
   3051616   4237   0   2    8.1328848e-07

DECAY 23  2.4952


DECAY 24  2.085


DECAY 1000011  23.105341
    0.55369684   2   -1000037    12
    0.27609853   2    1000035    11
    0.15418749   2    1000025    11
    0.01358241   2    1000022    11
    0.0024335025   2    1000023    11

DECAY 2000011  20.95122
    0.94417562   2    1000025    11
    0.052107276   2    1000022    11
    0.0037164542   2    1000023    11

DECAY 1000013  23.109514
    0.55359752   2   -1000037    14
    0.276049   2    1000035    13
    0.15416226   2    1000025    13
    0.01366791   2    1000022    13
    0.0025220881   2    1000023    13

DECAY 2000013  20.96233
    0.9436792   2    1000025    13
    0.052209418   2    1000022    13
    0.0038458176   2    1000023    13
    0.00026483835   2   -1000024    14

DECAY 1000015  0.40899058
    0.52330552   2    1000025    15
    0.27969998   2    1000022    15
    0.19696399   2    1000023    15

DECAY 2000015  5.2929322
    0.80078316   2    1000025    15
    0.085463449   2    1000022    15
    0.071904788   2   -1000024    16
    0.039210695   2    1000023    15
    0.0013335901   2    1000016   -24
    0.00065847802   2    1000015    25
    0.00064583576   2    1000015    23

DECAY 1000012  23.117457
    0.55063345   2    1000037    11
    0.27618883   2    1000035    12
    0.16356276   2    1000025    12
    0.0050898595   2    1000022    12
    0.0045243779   2    1000024    11

DECAY 1000014  23.121627
    0.55053476   2    1000037    13
    0.27613933   2    1000035    14
    0.16353333   2    1000025    14
    0.0050889435   2    1000022    14
    0.0047029069   2    1000024    13

DECAY 1000016  0.38917501
    0.55487507   2    1000025    16
    0.40690901   2    1000024    15
    0.038210606   2    1000022    16

DECAY 1000001  0.22841357
    0.98254455   2    1000025    1
    0.013342148   2    1000023    1
    0.0040482795   2    1000022    1

DECAY 2000001  17.087917
    0.83838991   2    1000021    1
    0.15260812   2    1000025    1
    0.0084021097   2    1000022    1
    0.00059944751   2    1000023    1

DECAY 1000003  0.22960768
    0.97747024   2    1000025    3
    0.014569094   2    1000023    3
    0.0053095516   2    1000022    3
    0.0026511143   2   -1000024    4

DECAY 2000003  17.091562
    0.83821171   2    1000021    3
    0.15257708   2    1000025    3
    0.008452398   2    1000022    3
    0.0006520409   2    1000023    3
    0.00010660769   2   -1000024    4

DECAY 1000005  171.96151
    0.69902847   2    1000006   -24
    0.26249572   2   -1000024    6
    0.015664236   2   -1000037    6
    0.0079958168   2    1000035    5
    0.0064543062   2    1000023    5
    0.0063668825   2    1000022    5
    0.00199457   2    1000025    5

DECAY 2000005  25.977127
    0.51071096   2    1000021    5
    0.18982201   2   -1000024    6
    0.10271545   2    1000025    5
    0.098663821   2    1000022    5
    0.094755964   2    1000023    5
    0.0013791528   2    2000006   -24
    0.0011102725   2    1000005    25
    0.00073796959   2    1000005    23
    0.00010107583   2    1000006   -24

DECAY 1000002  0.28985039
    0.64587632   2    1000025    2
    0.18865833   2    1000024    1
    0.1211863   2    1000022    2
    0.04427905   2    1000023    2

DECAY 2000002  9.1719718
    0.94416233   2    1000025    2
    0.052119727   2    1000022    2
    0.0037173089   2    1000023    2

DECAY 1000004  0.29104323
    0.64331307   2    1000025    4
    0.18994597   2    1000024    3
    0.12162402   2    1000022    4
    0.045116929   2    1000023    4

DECAY 2000004  9.1749698
    0.94385995   2    1000025    4
    0.052177761   2    1000022    4
    0.003797903   2    1000023    4
    0.000163133   2    1000024    3

DECAY 1000006  46.455605
    0.47327029   2    1000024    5
    0.24494216   2    1000023    6
    0.23447714   2    1000022    6
    0.047308429   2    1000025    6

DECAY 2000006  186.98998
    0.36579221   2    1000006    25
    0.33582556   2    1000006    23
    0.12257098   2    1000023    6
    0.10985876   2    1000022    6
    0.026099233   2    1000024    5
    0.016952604   2    1000025    6
    0.015318075   2    1000037    5
    0.0075825861   2    1000035    6

DECAY 1000024  5.7985018e-08
    0.36200292   3    1000022   -1    2
    0.30825734   3    1000022   -3    4
    0.12066595   3    1000022   -11    12
    0.12052827   3    1000022   -13    14
    0.08854552   3    1000022   -15    16

DECAY 1000037  30.48016
    0.21897656   2    1000016   -15
    0.21885653   2   -1000015    16
    0.1240872   2    1000024    25
    0.1187137   2    1000023    24
    0.11770087   2    1000024    23
    0.11031383   2    1000022    24
    0.020987206   2    1000006   -5
    0.01197594   2    1000002   -1
    0.011975711   2    1000004   -3
    0.011659368   2   -1000001    2
    0.011658378   2   -1000003    4
    0.0073512296   2    1000025    24
    0.0061840952   3    1000024    6   -6
    0.0046074856   3    1000023   -5    6
    0.00458649   3    1000022   -5    6
    0.00032839427   3    1000025   -5    6

DECAY 1000022 -1


DECAY 1000023  8.1750861e-08
    0.42994253   2    1000022    22
    0.14761082   3    1000022    12   -12
    0.11038069   3    1000022    1   -1
    0.11015633   3    1000022    3   -3
    0.086088526   3    1000022    2   -2
    0.056402485   3    1000022    4   -4
    0.024909152   3    1000022    11   -11
    0.024829488   3    1000022    13   -13
    0.0096799731   3    1000022    15   -15

DECAY 1000025  0.96537321
    0.27866142   2    1000024   -24
    0.27866142   2   -1000024    24
    0.27462243   2    1000023    23
    0.083946189   2    1000022    25
    0.067678943   2    1000023    25
    0.016385988   2    1000022    23

DECAY 1000035  31.208153
    0.11529572   2    1000024   -24
    0.11529572   2   -1000024    24
    0.10723162   2    1000016   -16
    0.10723162   2   -1000016    16
    0.10654512   2    1000015   -15
    0.10654512   2   -1000015    15
    0.078679207   2    1000022    25
    0.063875755   2    1000023    25
    0.05584436   2    1000023    23
    0.054811759   2    1000022    23
    0.0095644295   2    1000006   -6
    0.0095644295   2   -1000006    6
    0.0059223454   2    1000025    25
    0.0058370899   2    1000002   -2
    0.0058370899   2   -1000002    2
    0.0058365953   2    1000004   -4
    0.0058365953   2   -1000004    4
    0.0056648823   2    1000001   -1
    0.0056648823   2   -1000001    1
    0.0056647827   2    1000003   -3
    0.0056647827   2   -1000003    3
    0.0045145244   2    1000025    23
    0.0039693965   3    1000024    5   -6
    0.0039693965   3   -1000024   -5    6
    0.0025199484   3    1000023    6   -6
    0.002425146   3    1000022    6   -6
    0.00015860045   3    1000025    6   -6

DECAY 1000021  660.92147
    0.089664013   2    1000006   -6
    0.089664013   2   -1000006    6
    0.074325434   2    1000002   -2
    0.074325434   2   -1000002    2
    0.0743254   2    1000004   -4
    0.0743254   2   -1000004    4
    0.074273367   2    1000001   -1
    0.074273367   2   -1000001    1
    0.074273337   2    1000003   -3
    0.074273337   2   -1000003    3
    0.055880388   2    1000005   -5
    0.055880388   2   -1000005    5
    0.052266865   2    2000006   -6
    0.052266865   2   -2000006    6
    0.0020262375   2    2000002   -2
    0.0020262375   2   -2000002    2
    0.002026226   2    2000004   -4
    0.002026226   2   -2000004    4
    0.0003002479   3    1000037    3   -4
    0.0003002479   3   -1000037   -3    4
    0.00030024715   3    1000037    1   -2
    0.00030024715   3   -1000037   -1    2
    0.00015060004   3    1000035    3   -3
    0.0001505997   3    1000035    1   -1
    0.00014987669   3    1000035    4   -4
    0.00014987629   3    1000035    2   -2

DECAY 25  0.0038894756
    0.57224127   2   -5    5
    0.23039372   2   -24    24
    0.070824653   2    21    21
    0.065912457   2   -15    15
    0.028376153   2   -4    4
    0.027947694   2    23    23
    0.0023542341   2    22    22
    0.0015053443   2    22    23
    0.00022859667   2   -13    13
    0.00021513116   2   -3    3
    5.9481622e-07   2   -1    1
    1.4622924e-07   2   -2    2
    5.1391056e-09   2   -11    11

DECAY 35  59.595305
    0.23279609   2   -1000024    1000037
    0.23279609   2   -1000037    1000024
    0.15913515   2   -5    5
    0.12931713   2    1000023    1000035
    0.10201914   2    1000022    1000035
    0.050984315   2    1000023    1000025
    0.035961478   2    1000022    1000025
    0.029303898   2   -15    15
    0.015209438   2   -6    6
    0.0026271221   2   -1000024    1000024
    0.0021792029   2    1000025    1000035
    0.001734708   2    1000022    1000022
    0.0014800925   2    1000025    1000025
    0.001267783   2   -2000006    1000006
    0.001267783   2   -1000006    2000006
    0.0011968464   2    1000022    1000023
    0.00050891994   2   -1000006    1000006
    0.00010473816   2   -13    13
    5.981555e-05   2   -3    3
    1.8653546e-05   2   -2000006    2000006
    9.3636618e-06   2    25    25
    6.3210721e-06   2   -1000037    1000037
    3.1465814e-06   2    1000035    1000035
    2.274728e-06   2   -1000001    1000001
    2.274506e-06   2   -1000003    1000003
    1.5521095e-06   2   -1000002    1000002
    1.5512458e-06   2   -1000004    1000004
    1.2361181e-06   2    23    23
    7.1373536e-07   2    21    21
    3.5739916e-07   2   -1000015    1000015
    3.3152174e-07   2    1000023    1000023
    2.1954807e-07   2   -24    24
    2.0368906e-07   2   -4    4
    1.9846428e-07   2   -2000015    2000015
    1.6536195e-07   2   -1    1
    5.8302727e-08   2   -2000015    1000015
    5.8302727e-08   2   -1000015    2000015
    1.3530763e-08   2    22    23
    2.3520609e-09   2   -11    11
    1.6908612e-09   2    22    22
    1.0498917e-12   2   -2    2

DECAY 36  59.080909
    0.23487844   2   -1000024    1000037
    0.23487844   2   -1000037    1000024
    0.15401529   2   -5    5
    0.12841503   2    1000022    1000035
    0.1041464   2    1000023    1000035
    0.048164297   2    1000022    1000025
    0.038225762   2    1000023    1000025
    0.028361896   2   -15    15
    0.014303896   2   -6    6
    0.0030354859   2    1000025    1000035
    0.0026474574   2   -1000024    1000024
    0.002539533   2    1000025    1000025
    0.0023249842   2    1000022    1000022
    0.0014888637   2   -2000006    1000006
    0.0014888637   2   -1000006    2000006
    0.00090790346   2    1000022    1000023
    0.00010137194   2   -13    13
    5.7892093e-05   2   -3    3
    7.5671614e-06   2    21    21
    4.4904634e-06   2   -1000037    1000037
    3.1603828e-06   2    23    25
    2.2497392e-06   2    1000035    1000035
    2.5222958e-07   2    1000023    1000023
    1.8995158e-07   2   -4    4
    1.6004455e-07   2   -1    1
    5.8363529e-08   2   -2000015    1000015
    5.8363529e-08   2   -1000015    2000015
    5.9958545e-09   2    22    22
    5.1248462e-09   2    22    23
    2.2764238e-09   2   -11    11
    9.7909248e-13   2   -2    2
    4.1861676e-38   2    25    25

DECAY 37  59.782106
    0.23240375   2    1000024    1000035
    0.2321697   2    1000023    1000037
    0.22888453   2    1000022    1000037
    0.17699592   2   -5    6
    0.084027182   2    1000024    1000025
    0.03047094   2   -15    16
    0.006461102   2    1000022    1000024
    0.0051785645   2    1000025    1000037
    0.001692069   2   -1000005    1000006
    0.0012693461   2    1000023    1000024
    0.00024035751   2   -5    4
    0.00010772561   2   -13    14
    5.5373185e-05   2   -3    4
    2.1620132e-05   2   -3    6
    3.6081991e-06   2   -1000003    1000006
    3.5853665e-06   2   -1000001    1000002
    3.5789714e-06   2   -1000003    1000004
    3.1249019e-06   2    24    25
    2.5972064e-06   2   -3    2
    1.7163982e-06   2   -5    2
    1.7012801e-06   2   -1000015    1000016
    9.8781814e-07   2   -1    6
    1.9171527e-07   2   -1000003    1000002
    1.914833e-07   2   -1000001    1000004
    1.6548863e-07   2   -1000001    1000006
    1.5311158e-07   2   -1    2
    1.1937836e-07   2   -2000015    1000016
    7.5323103e-08   2   -1000003    2000006
    1.6178954e-08   2   -1    4
    4.9512591e-09   2   -1000005    1000004
    3.4546185e-09   2   -1000001    2000006
    2.5197131e-09   2   -11    12
    3.5358249e-11   2   -1000005    1000002
    8.8469257e-12   2    1000035    1000037

DECAY 6  2.43
    1   2    5    24

DECAY 15 -1
