BLOCK SPINFO
   1   SPheno
   2   v4.0.5be

BLOCK SPHENOINFO
   1   2
   2   2

BLOCK MODSEL
   1   0

BLOCK MINPAR
   3    51.568436
   4    1

BLOCK EXTPAR
   0    1267.2631
   1   -408.24489
   2    557.22593
   3    3000
   11   -3303.1263
   12    175.56198
   13    544.18935
   23    448.56869
   25    51.241189
   26    538.37786
   31    750.60315
   32    750.60315
   33    1452.7144
   34    1226.5245
   35    1226.5245
   36    1364.1956
   41    5000
   42    5000
   43    1642.2337
   44    5000
   45    5000
   46    1141.2559
   47    5000
   48    5000
   49    1088.9871

BLOCK SMINPUTS
   1    127.90897
   2    1.1663787e-05
   3    0.1184
   4    91.1876
   5    4.18
   6    173.2
   7    1.777
   8    0
   11    0.00051099893
   12    0
   13    0.10565837
   14    0
   21    0.005
   22    0.0025
   23    0.095
   24    1.27

BLOCK GAUGE Q=  1267.2631
   1    0.35536298
   2    0.66519887
   3    1.219778

BLOCK YU Q=  1267.2631
   1   1    8.3859686e-06
   2   2    0.004260072
   3   3    1.0130924

BLOCK YD Q=  1267.2631
   1   1    0.00086348079
   2   2    0.016406135
   3   3    0.85630237

BLOCK YE Q=  1267.2631
   1   1    0.00015068371
   2   2    0.031156613
   3   3    0.52400297

BLOCK AU Q=  1267.2631
   1   1    0
   2   2    0
   3   3   -3303.1263

BLOCK AD Q=  1267.2631
   1   1    0
   2   2    0
   3   3    175.56199

BLOCK AE Q=  1267.2631
   1   1    0
   2   2    0
   3   3    544.18935

BLOCK MSOFT Q=  1267.2631
   1   -408.24489
   2    557.22593
   3    3000
   21    122455.45
   22   -184620.45
   31    750.60315
   32    750.60315
   33    1452.7144
   34    1226.5245
   35    1226.5245
   36    1364.1956
   41    5000
   42    5000
   43    1642.2337
   44    5000
   45    5000
   46    1141.2559
   47    5000
   48    5000
   49    1088.9871

BLOCK MASS
   6    173.2
   23    91.1876
   24    80.429995
   15    1.777
   25    124.26989
   35    538.27778
   36    538.37786
   37    548.64238
   1000001    5020.5708
   2000001    5010.2177
   1000002    5020.1348
   2000002    5011.7128
   1000003    5020.5792
   2000003    5010.2306
   1000004    5020.1423
   2000004    5011.7139
   1000005    1027.4834
   2000005    1587.6863
   1000006    981.60289
   2000006    1636.0545
   1000011    757.71959
   2000011    1228.4446
   1000012    753.22949
   1000013    757.69745
   2000013    1228.4169
   1000014    753.21473
   1000015    1354.92
   2000015    1454.5269
   1000016    1449.9255
   1000021    3175.1225
   1000022   -393.61196
   1000023    432.62441
   1000025   -471.55366
   1000035    609.75749
   1000024    434.81178
   1000037    610.28888

BLOCK ALPHA
      -0.021332706

BLOCK HMIX Q=  1267.2631
   1    448.56869
   2    51.241189
   3    244.14387
   4    289850.72

BLOCK STOPMIX
   1   1    0.28831314
   1   2    0.95753618
   2   1   -0.95753618
   2   2    0.28831314

BLOCK SBOTMIX
   1   1    0.035947531
   1   2    0.99935368
   2   1   -0.99935368
   2   2    0.035947531

BLOCK STAUMIX
   1   1    0.14880401
   1   2    0.98886671
   2   1   -0.98886671
   2   2    0.14880401

BLOCK NMIX
   1   1    0.89472216
   1   2    0.023292234
   1   3    0.33741278
   1   4    0.29168879
   2   1   -0.035206518
   2   2   -0.34553544
   2   3    0.6776059
   2   4   -0.6482407
   3   1   -0.44505954
   3   2    0.047970938
   3   3    0.61884783
   3   4    0.64548288
   4   1    0.012440374
   4   2   -0.93688928
   4   3   -0.2098338
   4   4    0.27938054

BLOCK UMIX
   1   1   -0.29945496
   1   2    0.95411044
   2   1    0.95411044
   2   2    0.29945496

BLOCK VMIX
   1   1   -0.39915071
   1   2    0.91688533
   2   1    0.91688533
   2   2    0.39915071

BLOCK HIGGSBOUNDSINPUTHIGGSCOUPLINGSFERMIONS
       0, 2625.6595,3,36,15,15

BLOCK HIGGSBOUNDSINPUTHIGGSCOUPLINGSBOSONS
       0,4,36,21,21,23

BLOCK SPHENOLOWENERGY
   1    0.00030398241
   2    1.5932823e-06
   3    3.5256274e-05
   4    1.1860839e-14
   5    5.0648925e-10
   6    9.4895797e-08
   7    3.9588567e-13
   8    1.6906024e-08
   9    3.2223389e-06
   10    6.7589184e-05
   11    0.6981704
   12    0.54219319
   13    19.234507
   14    0
   15    0
   16    0.0021587372
   17    2.2817277e-15
   18    2.4793968e-11
   19    8.2891183e-11
   20    1.542967e-14
   21    6.5962155e-10
   22    1.2236849e-07
   23    0
   24    0
   25    0
   26    0
   27    0
   28    0
   29    0
   30    0
   31    0
   39    8.8947588e-05
   40    0
   41    0
   42    0

BLOCK FWCOEF Q=  160
   305   4422   0   0   -0.18881911
   305   4422   0   2   -0.15766379
   305   4322   0   2   -0.00076645249
   305   6421   0   0   -0.095227835
   305   6421   0   2   -0.12244442
   305   6321   0   2   -0.0012706973
   3051111   4133   0   0    1.5866156
   3051111   4133   0   2    1.5882223
   3051111   4233   0   2   -0.00030182159
   3051111   4137   0   0   -4.4093076
   3051111   4137   0   2   -4.4078019
   3051111   4237   0   2    0.0023791474
   3051313   4133   0   0    1.5866156
   3051313   4133   0   2    1.5882121
   3051313   4233   0   2   -0.00030208669
   3051313   4137   0   0   -4.4093076
   3051313   4137   0   2   -4.4078121
   3051313   4237   0   2    0.0023794022
   3051212   4137   0   0    1.5053501
   3051212   4137   0   2    1.5050466
   3051212   4237   0   2   -0.000519144
   3051414   4137   0   0    1.5053501
   3051414   4137   0   2    1.5050466
   3051414   4237   0   2   -0.00051908661
   3051616   4137   0   0    1.5053501
   3051616   4137   0   2    1.5050457
   3051616   4237   0   2   -0.00050291329

BLOCK IMFWCOEF Q=  160
   305   4422   0   0    3.8589701e-07
   305   4422   0   2    3.7632494e-05
   305   4322   0   2    1.1481375e-05
   305   6421   0   0    3.3054631e-07
   305   6421   0   2   -5.5191382e-06
   305   6321   0   2    4.4718224e-06
   3051111   4133   0   2   -1.4743083e-06
   3051111   4233   0   2    7.1201685e-06
   3051111   4137   0   2    1.0595874e-05
   3051111   4237   0   2   -5.5869299e-05
   3051313   4133   0   2   -1.4744759e-06
   3051313   4233   0   2    7.1201292e-06
   3051313   4137   0   2    1.0595767e-05
   3051313   4237   0   2   -5.5869447e-05
   3051212   4137   0   2   -1.9009662e-06
   3051212   4237   0   2    1.2190716e-05
   3051414   4137   0   2   -1.9009656e-06
   3051414   4237   0   2    1.2190716e-05
   3051616   4137   0   2   -1.9157782e-06
   3051616   4237   0   2    1.2190727e-05

DECAY 23  2.4952


DECAY 24  2.085


DECAY 1000011  2.0698042
    0.36201713   2   -1000037    12
    0.21585117   2    1000022    11
    0.17317398   2    1000035    11
    0.12999842   2   -1000024    12
    0.097170971   2    1000023    11
    0.021788328   2    1000025    11

DECAY 2000011  4.8740173
    0.81631526   2    1000022    11
    0.18236881   2    1000025    11
    0.001204527   2    1000023    11
    0.00011131594   2    1000035    11

DECAY 1000013  2.0755765
    0.36092188   2   -1000037    14
    0.21566695   2    1000022    13
    0.17269201   2    1000035    13
    0.12962566   2   -1000024    14
    0.09835719   2    1000023    13
    0.022736304   2    1000025    13

DECAY 2000013  4.9102574
    0.81070436   2    1000022    13
    0.18236348   2    1000025    13
    0.0033651091   2   -1000024    14
    0.0028979261   2    1000023    13
    0.00024577254   2   -1000037    14
    0.00023132578   2    1000035    13
    0.00019201994   2    1000013    25

DECAY 1000015  17.561681
    0.33915032   2   -1000024    16
    0.31038776   2    1000022    15
    0.177094   2    1000023    15
    0.16781437   2    1000025    15
    0.0035964816   2   -1000037    16
    0.001957082   2    1000035    15

DECAY 2000015  21.129299
    0.39398215   2   -1000037    16
    0.19892058   2    1000035    15
    0.15779981   2    1000023    15
    0.13913217   2    1000025    15
    0.092938137   2    1000022    15
    0.017065673   2   -1000024    16
    0.00016148362   2    1000015    23

DECAY 1000012  2.099321
    0.31335429   2    1000037    11
    0.22371947   2    1000024    11
    0.17252641   2    1000022    12
    0.167023   2    1000035    12
    0.075703614   2    1000023    12
    0.047673218   2    1000025    12

DECAY 1000014  2.1051168
    0.31251795   2    1000037    13
    0.2258746   2    1000024    13
    0.17204296   2    1000022    14
    0.16653506   2    1000035    14
    0.075490791   2    1000023    14
    0.047538629   2    1000025    14

DECAY 1000016  21.378923
    0.36252971   2    1000037    15
    0.35785959   2    1000024    15
    0.18006509   2    1000035    16
    0.052953495   2    1000022    16
    0.026444987   2    1000023    16
    0.019488304   2    1000025    16
    0.00065883404   2    1000015    24

DECAY 2000001  144.36581
    0.98088244   2    1000021    1
    0.015319858   2    1000022    1
    0.0037703731   2    1000025    1

DECAY 1000001  207.82059
    0.68657461   2    1000021    1
    0.18791641   2   -1000037    2
    0.091030742   2    1000035    1
    0.018785432   2   -1000024    2
    0.012058153   2    1000023    1
    0.0019436456   2    1000022    1
    0.0016910085   2    1000025    1

DECAY 2000003  144.4198
    0.98052506   2    1000021    3
    0.015334994   2    1000022    3
    0.0038386786   2    1000025    3
    0.00016657288   2   -1000024    4
    0.00010767982   2    1000023    3

DECAY 1000003  207.84974
    0.68648254   2    1000021    3
    0.18789178   2   -1000037    4
    0.091023666   2    1000035    3
    0.018790013   2   -1000024    4
    0.012114817   2    1000023    3
    0.0019578787   2    1000022    3
    0.0017393096   2    1000025    3

DECAY 1000005  19.042603
    0.44398663   2   -1000024    6
    0.24925298   2    1000023    5
    0.18830471   2    1000025    5
    0.085967005   2    1000022    5
    0.020415921   2   -1000037    6
    0.012072757   2    1000035    5

DECAY 2000005  114.85614
    0.45113773   2    1000006   -24
    0.19901448   2   -1000024    6
    0.12159963   2   -1000037    6
    0.083770169   2    1000023    5
    0.066224183   2    1000025    5
    0.046622396   2    1000035    5
    0.020133028   2    1000022    5
    0.0044260622   2    1000005    25
    0.0037646614   2    1000006   -37
    0.0028794866   2    1000005    23
    0.00021464335   2    1000005    35
    0.00021352884   2    1000005    36

DECAY 2000002  152.80409
    0.92773434   2    1000021    2
    0.057912895   2    1000022    2
    0.01425232   2    1000025    2

DECAY 1000002  207.8179
    0.68636489   2    1000021    2
    0.17352545   2    1000037    1
    0.090166669   2    1000035    2
    0.033373589   2    1000024    1
    0.012964755   2    1000023    2
    0.0035024287   2    1000022    2
    0.00010222045   2    1000025    2

DECAY 2000004  152.80769
    0.92771277   2    1000021    4
    0.057912549   2    1000022    4
    0.014256804   2    1000025    4

DECAY 1000004  207.84688
    0.68627267   2    1000021    4
    0.17351279   2    1000037    3
    0.090154922   2    1000035    4
    0.033484612   2    1000024    3
    0.012966554   2    1000023    4
    0.0035026736   2    1000022    4
    0.00010577787   2    1000025    4

DECAY 1000006  24.119099
    0.51597005   2    1000024    5
    0.20985589   2    1000023    6
    0.17246862   2    1000025    6
    0.081817577   2    1000022    6
    0.015190698   2    1000037    5
    0.0046926134   2    1000035    6

DECAY 2000006  124.42522
    0.24096761   2    1000006    25
    0.23189056   2    1000006    23
    0.13832557   2    1000024    5
    0.10698924   2    1000037    5
    0.088853801   2    1000023    6
    0.085012787   2    1000025    6
    0.066240158   2    1000035    6
    0.030912565   2    1000022    6
    0.0061284539   2    1000005    24
    0.0026340113   2    1000006    36
    0.0017722183   2    1000006    35
    0.00027304343   2    1000005    37

DECAY 1000024  0.0001012237
    0.33491907   3    1000022   -1    2
    0.33355443   3    1000022   -3    4
    0.11072543   3    1000022   -15    16
    0.11040104   3    1000022   -11    12
    0.1103995   3    1000022   -13    14

DECAY 1000037  2.903452
    0.25143347   2    1000023    24
    0.23510556   2    1000025    24
    0.21958374   2    1000024    23
    0.15341438   2    1000022    24
    0.14039865   2    1000024    25

DECAY 1000022 -1


DECAY 1000023  5.809986e-05
    0.20040059   3    1000022    12   -12
    0.15103147   3    1000022    1   -1
    0.15102214   3    1000022    3   -3
    0.13761211   3    1000022    5   -5
    0.11779533   3    1000022    2   -2
    0.11625434   3    1000022    4   -4
    0.03358517   3    1000022    11   -11
    0.033584678   3    1000022    13   -13
    0.033342814   3    1000022    15   -15
    0.025371361   2    1000022    22

DECAY 1000025  0.00069593038
    0.10640913   3    1000024    1   -2
    0.10640913   3   -1000024   -1    2
    0.10584901   3    1000024    3   -4
    0.10584901   3   -1000024   -3    4
    0.068043389   3    1000023    12   -12
    0.05074638   3    1000023    1   -1
    0.050743194   3    1000023    3   -3
    0.046139177   3    1000023    5   -5
    0.03957827   3    1000023    2   -2
    0.039059307   3    1000023    4   -4
    0.035585267   3    1000024    11   -12
    0.035585267   3   -1000024   -11    12
    0.035584677   3    1000024    13   -14
    0.035584677   3   -1000024   -13    14
    0.035201441   3    1000024    15   -16
    0.035201441   3   -1000024   -15    16
    0.018190119   2    1000023    22
    0.011487305   3    1000023    11   -11
    0.011487103   3    1000023    13   -13
    0.011231384   3    1000023    15   -15
    0.0033074728   3    1000022    12   -12
    0.0030003674   3    1000022    5   -5
    0.0022772863   3    1000022    1   -1
    0.0022772834   3    1000022    3   -3
    0.0017793712   3    1000022    2   -2
    0.0017775929   3    1000022    4   -4
    0.00052261421   3    1000022    15   -15
    0.00042272963   3    1000022    13   -13
    0.00042216633   3    1000022    11   -11
    0.00024843349   2    1000022    22

DECAY 1000035  3.4571873
    0.21568068   2    1000024   -24
    0.21568068   2   -1000024    24
    0.19384564   2    1000025    23
    0.12468356   2    1000022    23
    0.11137383   2    1000023    25
    0.077402689   2    1000022    25
    0.05589331   2    1000025    25
    0.0053669817   2    1000023    23

DECAY 1000021  254.65772
    0.14787385   2    1000005   -5
    0.14787385   2   -1000005    5
    0.14082123   2    1000006   -6
    0.14082123   2   -1000006    6
    0.1073613   2    2000006   -6
    0.1073613   2   -2000006    6
    0.10381285   2    2000005   -5
    0.10381285   2   -2000005    5

DECAY 25  0.0042766117
    0.62254444   2   -5    5
    0.19182904   2   -24    24
    0.071220777   2   -15    15
    0.062653093   2    21    21
    0.025025437   2   -4    4
    0.022886063   2    23    23
    0.0020887218   2    22    22
    0.0012726867   2    22    23
    0.00024921638   2   -13    13
    0.00022976278   2   -3    3
    6.3525998e-07   2   -1    1
    1.2896176e-07   2   -2    2
    5.6026742e-09   2   -11    11

DECAY 35  23.687981
    0.86798509   2   -5    5
    0.13083978   2   -15    15
    0.00049201053   2   -13    13
    0.0002972824   2   -3    3
    0.0001868801   2   -6    6
    0.00015242765   2    21    21
    3.4182793e-05   2    25    25
    7.6234125e-06   2   -24    24
    3.6574364e-06   2    23    23
    8.2184128e-07   2   -1    1
    1.4040441e-07   2    22    22
    9.1042134e-08   2    22    23
    1.1056085e-08   2   -11    11
    6.576922e-09   2   -4    4
    3.392227e-14   2   -2    2

DECAY 36  23.12651
    0.86795545   2   -5    5
    0.13082286   2   -15    15
    0.00049194218   2   -13    13
    0.00029721947   2   -3    3
    0.00024915011   2   -6    6
    0.00017606255   2    21    21
    6.400371e-06   2    23    25
    8.2166717e-07   2   -1    1
    7.1135993e-08   2    22    22
    1.1054546e-08   2   -11    11
    1.0054153e-08   2    22    23
    5.1903325e-09   2   -4    4
    2.6759976e-14   2   -2    2
    1.4962871e-35   2    25    25

DECAY 37  20.439357
    0.85486729   2   -5    6
    0.14275011   2   -15    16
    0.0015186094   2   -5    4
    0.0005046828   2   -13    14
    0.00032377553   2   -3    4
    1.4824638e-05   2   -3    2
    1.0844551e-05   2   -5    2
    7.9220338e-06   2    24    25
    9.4878698e-07   2   -3    6
    8.9790067e-07   2   -1    2
    4.1282368e-08   2   -1    4
    2.5980823e-08   2   -1    6
    1.1804584e-08   2   -11    12
    7.8206641e-09   2    24    35
    7.4510139e-09   2    24    36

DECAY 6  2.43
    1   2    5    24

DECAY 15 -1
