BLOCK SPINFO
   1   SPheno
   2   v4.0.5be

BLOCK SPHENOINFO
   1   2
   2   2

BLOCK MODSEL
   1   0

BLOCK MINPAR
   3    38.376101
   4    1

BLOCK EXTPAR
   0    3826.0868
   1   -544.77843
   2   -1366.4437
   3    3544.6755
   11   -6821.4051
   12    4027.7341
   13   -5125.0725
   23    310.91138
   25    37.321857
   26    1612.1764
   31    2631.1267
   32    2631.1267
   33    4007.1903
   34    361.68496
   35    361.68496
   36    3675.4796
   41    1853.4696
   42    1853.4696
   43    3295.1629
   44    4272.2384
   45    4272.2384
   46    4381.9043
   47    2630.9438
   48    2630.9438
   49    4911.7874

BLOCK SMINPUTS
   1    127.90897
   2    1.1663787e-05
   3    0.1184
   4    91.1876
   5    4.18
   6    173.2
   7    1.777
   8    0
   11    0.00051099893
   12    0
   13    0.10565837
   14    0
   21    0.005
   22    0.0025
   23    0.095
   24    1.27

BLOCK GAUGE Q=  3826.0868
   1    0.35536298
   2    0.66519887
   3    1.219778

BLOCK YU Q=  3826.0868
   1   1    8.3873812e-06
   2   2    0.0042607897
   3   3    1.013263

BLOCK YD Q=  3826.0868
   1   1    0.00062902786
   2   2    0.011951529
   3   3    0.62379852

BLOCK YE Q=  3826.0868
   1   1    0.00010976996
   2   2    0.022696946
   3   3    0.3817253

BLOCK AU Q=  3826.0868
   1   1    0
   2   2    0
   3   3   -6821.4049

BLOCK AD Q=  3826.0868
   1   1    0
   2   2    0
   3   3    4027.7342

BLOCK AE Q=  3826.0868
   1   1    0
   2   2    0
   3   3   -5125.0725

BLOCK MSOFT Q=  3826.0868
   1   -544.77843
   2   -1366.4437
   3    3544.6755
   21    2650914.7
   22    147243.14
   31    2631.1267
   32    2631.1267
   33    4007.1903
   34    361.68496
   35    361.68496
   36    3675.4796
   41    1853.4696
   42    1853.4696
   43    3295.1629
   44    4272.2384
   45    4272.2384
   46    4381.9043
   47    2630.9438
   48    2630.9438
   49    4911.7874

BLOCK MASS
   6    173.2
   23    91.1876
   24    80.429995
   15    1.777
   25    126.61683
   35    1612.0422
   36    1612.1764
   37    1614.3882
   1000001    2068.9318
   2000001    2800.0422
   1000002    2067.3829
   2000002    4380.8215
   1000003    2068.9271
   2000003    2800.0354
   1000004    2067.3783
   2000004    4380.8208
   1000005    3387.5778
   2000005    4977.6025
   1000006    3371.8905
   2000006    4341.4637
   1000011    2638.7133
   2000011    422.76866
   1000012    2637.1408
   1000013    2638.6965
   2000013    422.62255
   1000014    2637.1171
   1000015    3666.4433
   2000015    4005.5406
   1000016    4004.4212
   1000021    3723.4598
   1000022   -316.43901
   1000023    326.14001
   1000025   -540.06741
   1000035   -1404.8574
   1000024    322.5232
   1000037    1405.0388

BLOCK ALPHA
      -0.026262159

BLOCK HMIX Q=  3826.0868
   1    310.91138
   2    37.321857
   3    242.96963
   4    2599112.6

BLOCK STOPMIX
   1   1    0.99224789
   1   2    0.12427435
   2   1   -0.12427435
   2   2    0.99224789

BLOCK SBOTMIX
   1   1    0.99999927
   1   2    0.0012085996
   2   1   -0.0012085996
   2   2    0.99999927

BLOCK STAUMIX
   1   1    0.011412952
   1   2    0.99993487
   2   1   -0.99993487
   2   2    0.011412952

BLOCK NMIX
   1   1    0.13447965
   1   2   -0.048937517
   1   3    0.70744825
   1   4    0.69212522
   2   1    0.036974152
   2   2   -0.03351867
   2   3   -0.70321205
   2   4    0.70922649
   3   1    0.9902215
   3   2    0.011006337
   3   3   -0.069782576
   3   4   -0.12029392
   4   1    0.0030839044
   4   2   -0.99817858
   4   3   -0.011839643
   4   4   -0.059074813

BLOCK UMIX
   1   1   -0.016756555
   1   2    0.9998596
   2   1   -0.9998596
   2   2   -0.016756555

BLOCK VMIX
   1   1    0.083534684
   1   2    0.99650487
   2   1    0.99650487
   2   2   -0.083534684

BLOCK HIGGSBOUNDSINPUTHIGGSCOUPLINGSFERMIONS
       0, 1392.921,3,36,15,15

BLOCK HIGGSBOUNDSINPUTHIGGSCOUPLINGSBOSONS
       0,4,36,21,21,23

BLOCK SPHENOLOWENERGY
   1    0.00032630352
   2    1.5892346e-06
   3    3.5247337e-05
   4    3.2817027e-15
   5    1.4018853e-10
   6    2.922551e-08
   7    1.0897234e-13
   8    4.6552311e-09
   9    9.8363365e-07
   10    9.3804754e-05
   11    0.9689672
   12    0.54179472
   13    19.337696
   14    0
   15    0
   16    0.002156792
   17    2.2816569e-15
   18    2.4803286e-11
   19    8.2897483e-11
   20   -2.5239725e-15
   21   -1.0791711e-10
   22   -1.5523855e-08
   23    0
   24    0
   25    0
   26    0
   27    0
   28    0
   29    0
   30    0
   31    0
   39    6.634537e-05
   40    0
   41    0
   42    0

BLOCK FWCOEF Q=  160
   305   4422   0   0   -0.18881911
   305   4422   0   2   -0.19274176
   305   4322   0   2    1.5422886e-05
   305   6421   0   0   -0.095227835
   305   6421   0   2   -0.1107096
   305   6321   0   2   -0.00025580506
   3051111   4133   0   0    1.625402
   3051111   4133   0   2    1.6254717
   3051111   4233   0   2    0.00047680561
   3051111   4137   0   0   -4.4480941
   3051111   4137   0   2   -4.445988
   3051111   4237   0   2   -0.003536095
   3051313   4133   0   0    1.625402
   3051313   4133   0   2    1.6254711
   3051313   4233   0   2    0.00047680254
   3051313   4137   0   0   -4.4480941
   3051313   4137   0   2   -4.4459887
   3051313   4237   0   2   -0.0035360945
   3051212   4137   0   0    1.5053501
   3051212   4137   0   2    1.5049066
   3051212   4237   0   2    0.00076486145
   3051414   4137   0   0    1.5053501
   3051414   4137   0   2    1.5049066
   3051414   4237   0   2    0.00076486194
   3051616   4137   0   0    1.5053501
   3051616   4137   0   2    1.5049065
   3051616   4237   0   2    0.00076500042

BLOCK IMFWCOEF Q=  160
   305   4422   0   0    3.8583583e-07
   305   4422   0   2   -2.1161536e-05
   305   4322   0   2    6.5161919e-06
   305   6421   0   0    3.3049391e-07
   305   6421   0   2   -2.9278736e-05
   305   6321   0   2    3.1595981e-06
   3051111   4133   0   2   -2.4525254e-06
   3051111   4233   0   2    1.0269093e-05
   3051111   4137   0   2    2.2212193e-05
   3051111   4237   0   2   -7.6161558e-05
   3051313   4133   0   2   -2.4525204e-06
   3051313   4233   0   2    1.0269079e-05
   3051313   4137   0   2    2.2212213e-05
   3051313   4237   0   2   -7.6161591e-05
   3051212   4137   0   2   -4.5865397e-06
   3051212   4237   0   2    1.6473821e-05
   3051414   4137   0   2   -4.5865397e-06
   3051414   4237   0   2    1.6473821e-05
   3051616   4137   0   2   -4.5892555e-06
   3051616   4237   0   2    1.6473819e-05

DECAY 23  2.4952


DECAY 24  2.085


DECAY 2000011  0.0079058408
    0.93973074   2    1000022    11
    0.06026702   2    1000023    11

DECAY 1000011  20.966136
    0.56857326   2   -1000037    12
    0.28245474   2    1000035    11
    0.148286   2    1000025    11
    0.00030185767   2   -1000024    12
    0.00028232611   2    1000022    11
    0.00010181375   2    1000023    11

DECAY 2000013  0.0094111093
    0.83190776   2    1000022    13
    0.087852556   2    1000023    13
    0.080239688   2   -1000024    14

DECAY 1000013  20.992238
    0.56785691   2   -1000037    14
    0.28209898   2    1000035    13
    0.14810623   2    1000025    13
    0.00090829614   2    1000022    13
    0.00071940967   2    1000023    13
    0.00030148028   2   -1000024    14

DECAY 1000015  38.574651
    0.44916681   2    1000025    15
    0.27135549   2   -1000024    16
    0.14500721   2    1000022    15
    0.13446448   2    1000023    15

DECAY 2000015  57.031914
    0.47539046   2   -1000037    16
    0.23615617   2    1000035    15
    0.10030828   2    1000022    15
    0.099620936   2    1000023    15
    0.088081371   2    1000025    15
    0.00019014311   2    1000015    23
    0.00018905787   2    1000015    25

DECAY 1000012  20.987021
    0.56333375   2    1000037    11
    0.28360556   2    1000035    12
    0.13621173   2    1000025    12
    0.0078374296   2    1000022    12
    0.0074896424   2    1000024    11
    0.0015218929   2    1000023    12

DECAY 1000014  21.012797
    0.56262984   2    1000037    13
    0.28325111   2    1000035    14
    0.13604321   2    1000025    14
    0.0087280818   2    1000024    13
    0.0078277415   2    1000022    14
    0.0015200116   2    1000023    14

DECAY 1000016  57.050218
    0.47184663   2    1000037    15
    0.23749538   2    1000035    16
    0.20504895   2    1000024    15
    0.079906958   2    1000025    16
    0.0044507153   2    1000022    16
    0.00086514429   2    1000023    16
    0.00038622008   2    1000015    24

DECAY 1000001  8.2051624
    0.64421957   2   -1000037    2
    0.32152303   2    1000035    1
    0.026341793   2    1000025    1
    0.0056240399   2    1000022    1
    0.001698244   2    1000023    1
    0.00059332587   2   -1000024    2

DECAY 2000001  1.4505779
    0.97953638   2    1000025    1
    0.01900216   2    1000022    1
    0.0014408896   2    1000023    1

DECAY 1000003  8.2113626
    0.64372597   2   -1000037    4
    0.32127708   2    1000035    3
    0.026324879   2    1000025    3
    0.0059605086   2    1000022    3
    0.0020327676   2    1000023    3
    0.0006788032   2   -1000024    4

DECAY 2000003  1.4660455
    0.9692237   2    1000025    3
    0.02144142   2    1000022    3
    0.0052828671   2   -1000024    4
    0.0040301095   2    1000023    3

DECAY 1000005  124.41509
    0.53936156   2   -1000024    6
    0.16778455   2   -1000037    6
    0.10431376   2    1000022    5
    0.10248764   2    1000023    5
    0.081978036   2    1000035    5
    0.004074455   2    1000025    5

DECAY 2000005  155.3
    0.49075007   2    1000021    5
    0.24536824   2   -1000024    6
    0.12346091   2    1000022    5
    0.1216891   2    1000023    5
    0.018332835   2    1000025    5
    0.00012263844   2    1000006   -24
    0.00011270863   2    1000005    25

DECAY 1000002  8.2666258
    0.63304301   2    1000037    1
    0.31737695   2    1000035    2
    0.033539473   2    1000025    2
    0.014625622   2    1000024    1
    0.00075933221   2    1000023    2
    0.00065560984   2    1000022    2

DECAY 2000002  36.137722
    0.73734503   2    1000021    2
    0.25744197   2    1000025    2
    0.0048449141   2    1000022    2
    0.00036600516   2    1000023    2

DECAY 1000004  8.2728208
    0.63256263   2    1000037    3
    0.31713465   2    1000035    4
    0.033515508   2    1000025    4
    0.015288786   2    1000024    3
    0.00080200873   2    1000023    4
    0.00069642061   2    1000022    4

DECAY 2000004  36.140736
    0.7372803   2    1000021    4
    0.25742096   2    1000025    4
    0.0048652915   2    1000022    4
    0.00038776075   2    1000023    4

DECAY 1000006  127.83963
    0.26175846   2    1000023    6
    0.24671639   2    1000022    6
    0.19985343   2    1000024    5
    0.16004922   2    1000037    5
    0.079794405   2    1000035    6
    0.036009367   3    1000022    24    5
    0.015814298   2    1000025    6

DECAY 2000006  323.33497
    0.27044686   2    1000024    5
    0.1574403   2    1000005    24
    0.13740084   2    1000023    6
    0.13296824   2    1000022    6
    0.1251792   2    1000006    25
    0.080681142   2    1000006    23
    0.06614823   2    1000021    6
    0.029725174   2    1000025    6

DECAY 1000024  3.065319e-08
    0.37060188   3    1000022   -1    2
    0.30023272   3    1000022   -3    4
    0.12353446   3    1000022   -11    12
    0.12336137   3    1000022   -13    14
    0.082269574   3    1000022   -15    16

DECAY 1000037  11.888692
    0.24695136   2    1000024    25
    0.24463104   2    1000023    24
    0.24262699   2    1000024    23
    0.23212263   2    1000022    24
    0.011724616   2    1000025    24
    0.0076387679   3    1000024    6   -6
    0.0068980986   3    1000022   -5    6
    0.0067819038   3    1000023   -5    6
    0.00028014773   3    1000024    5   -5
    0.00027478792   3    1000025   -5    6

DECAY 1000022 -1


DECAY 1000023  3.6567403e-07
    0.38257326   2    1000022    22
    0.15322834   3    1000022    12   -12
    0.11457914   3    1000022    1   -1
    0.11445047   3    1000022    3   -3
    0.089362586   3    1000022    2   -2
    0.070900566   3    1000022    4   -4
    0.025835359   3    1000022    11   -11
    0.025795169   3    1000022    13   -13
    0.01563556   3    1000022    15   -15
    0.0042415883   3    1000022    5   -5
    0.00073634019   3    1000024    1   -2
    0.00073634019   3   -1000024   -1    2
    0.00040007582   3    1000024    3   -4
    0.00040007582   3   -1000024   -3    4
    0.00024544712   3    1000024    11   -12
    0.00024544712   3   -1000024   -11    12
    0.00024440061   3    1000024    13   -14
    0.00024440061   3   -1000024   -13    14

DECAY 1000025  2.143753
    0.14917753   2    1000024   -24
    0.14917753   2   -1000024    24
    0.14047502   2    1000023    23
    0.097079025   2    1000023    25
    0.09325302   2    2000013   -13
    0.09325302   2   -2000013    13
    0.093049068   2    2000011   -11
    0.093049068   2   -2000011    11
    0.081686831   2    1000022    25
    0.0097257837   2    1000022    23

DECAY 1000035  13.351777
    0.21821927   2    1000024   -24
    0.21821927   2   -1000024    24
    0.17183759   2    1000023    25
    0.15189308   2    1000023    23
    0.14423896   2    1000022    25
    0.06427124   2    1000022    23
    0.0082348064   2    1000025    25
    0.0072528487   3    1000024    5   -6
    0.0072528487   3   -1000024   -5    6
    0.003368497   3    1000023    6   -6
    0.0030085394   3    1000022    6   -6
    0.0017473122   2    1000025    23
    0.00012718322   3    1000022    5   -5
    0.0001149773   3    1000023    5   -5
    0.00010146057   3    1000025    6   -6

DECAY 1000021  258.63733
    0.10194753   2    1000004   -4
    0.10194753   2   -1000004    4
    0.10194714   2    1000002   -2
    0.10194714   2   -1000002    2
    0.10181139   2    1000003   -3
    0.10181139   2   -1000003    3
    0.10181097   2    1000001   -1
    0.10181097   2   -1000001    1
    0.040224801   2    2000003   -3
    0.040224801   2   -2000003    3
    0.040224287   2    2000001   -1
    0.040224287   2   -2000001    1
    0.0063230374   2    1000005   -5
    0.0063230374   2   -1000005    5
    0.0053076912   2    1000006   -6
    0.0053076912   2   -1000006    6
    0.00016640429   3    1000024    5   -6
    0.00016640429   3   -1000024   -5    6
    0.00015007337   3    1000023    6   -6
    0.00014741237   3    1000022    6   -6

DECAY 25  0.0041328977
    0.54952016   2   -5    5
    0.2536517   2   -24    24
    0.070642545   2    21    21
    0.063326074   2   -15    15
    0.031684721   2    23    23
    0.026812281   2   -4    4
    0.0023158852   2    22    22
    0.001620527   2    22    23
    0.00021940168   2   -13    13
    0.00020599716   2   -3    3
    5.6955902e-07   2   -1    1
    1.3816519e-07   2   -2    2
    4.9323735e-09   2   -11    11

DECAY 35  34.013069
    0.81551803   2   -5    5
    0.14042262   2   -15    15
    0.020490625   2    1000023    1000025
    0.016096323   2    1000022    1000025
    0.002322311   2   -1000024    1000024
    0.0021791336   2    1000022    1000022
    0.0013244492   2   -6    6
    0.00046827598   2   -13    13
    0.00041852495   2    1000023    1000023
    0.00028208135   2    1000022    1000023
    0.00027781802   2   -3    3
    0.00016503104   2    1000025    1000025
    2.3287744e-05   2    21    21
    7.9811713e-06   2    25    25
    1.3134094e-06   2    23    23
    9.4826898e-07   2   -24    24
    7.6802279e-07   2   -1    1
    1.9356331e-07   2   -1000011    1000011
    1.9183145e-07   2   -1000013    1000013
    3.6455128e-08   2    22    22
    2.421734e-08   2    22    23
    1.7710812e-08   2   -4    4
    1.0519216e-08   2   -11    11
    9.1307111e-14   2   -2    2

DECAY 36  32.927329
    0.81391444   2   -5    5
    0.14014703   2   -15    15
    0.020419359   2    1000022    1000025
    0.017098228   2    1000023    1000025
    0.0027571008   2   -1000024    1000024
    0.0023703487   2    1000022    1000022
    0.0013410571   2   -6    6
    0.00056661471   2    1000023    1000023
    0.00046735076   2   -13    13
    0.00033322295   2    1000022    1000023
    0.00027726976   2   -3    3
    0.00026313307   2    1000025    1000025
    4.2175842e-05   2    21    21
    1.7930632e-06   2    23    25
    7.6650741e-07   2   -1    1
    5.333252e-08   2    22    23
    2.5187391e-08   2    22    22
    1.699322e-08   2   -4    4
    1.0498425e-08   2   -11    11
    8.7633753e-14   2   -2    2
    1.424305e-38   2    25    25

DECAY 37  33.264492
    0.81390346   2   -5    6
    0.14293654   2   -15    16
    0.040812794   2    1000024    1000025
    0.0012161342   2   -5    4
    0.00050533256   2   -13    14
    0.00025524006   2   -3    4
    0.00017998816   2    1000023    1000024
    0.00016501077   2    1000022    1000024
    1.1865207e-05   2   -3    2
    8.6844606e-06   2   -5    2
    2.3189606e-06   2   -3    6
    1.7862332e-06   2    24    25
    7.0811008e-07   2   -1    2
    8.9437123e-08   2   -1    6
    3.3654308e-08   2   -1    4
    1.1819781e-08   2   -11    12
    2.9050004e-12   2    24    35
    2.1642613e-12   2    24    36

DECAY 6  2.43
    1   2    5    24

DECAY 15 -1
