BLOCK SPINFO
   1   SPheno
   2   v4.0.5be

BLOCK SPHENOINFO
   1   2
   2   2

BLOCK MODSEL
   1   0

BLOCK MINPAR
   3    43.635886
   4   -1

BLOCK EXTPAR
   0    1880.6395
   1   -1544.6808
   2    266.72945
   3    3000
   11   -3809.0339
   12    1918.1669
   13    1826.2063
   23   -259.53541
   25    42.931808
   26    1631.0241
   31    1058.425
   32    1058.425
   33    1484.3519
   34    1745.6953
   35    1745.6953
   36    996.64046
   41    5000
   42    5000
   43    1967.2212
   44    5000
   45    5000
   46    1816.5877
   47    5000
   48    5000
   49    988.63706

BLOCK SMINPUTS
   1    127.90897
   2    1.1663787e-05
   3    0.1184
   4    91.1876
   5    4.18
   6    173.2
   7    1.777
   8    0
   11    0.00051099893
   12    0
   13    0.10565837
   14    0
   21    0.005
   22    0.0025
   23    0.095
   24    1.27

BLOCK GAUGE Q=  1880.6395
   1    0.35536298
   2    0.66519887
   3    1.219778

BLOCK YU Q=  1880.6395
   1   1    8.3866463e-06
   2   2    0.0042604163
   3   3    1.0131742

BLOCK YD Q=  1880.6395
   1   1    0.00072351535
   2   2    0.013746792
   3   3    0.71750052

BLOCK YE Q=  1880.6395
   1   1    0.00012625872
   2   2    0.026106299
   3   3    0.439065

BLOCK AU Q=  1880.6395
   1   1    0
   2   2    0
   3   3   -3809.0339

BLOCK AD Q=  1880.6395
   1   1    0
   2   2    0
   3   3    1918.167

BLOCK AE Q=  1880.6395
   1   1    0
   2   2    0
   3   3    1826.2063

BLOCK MSOFT Q=  1880.6395
   1   -1544.6808
   2    266.72945
   3    3000
   21    2702165.5
   22    4689.2739
   31    1058.425
   32    1058.425
   33    1484.3519
   34    1745.6953
   35    1745.6953
   36    996.64046
   41    5000
   42    5000
   43    1967.2212
   44    5000
   45    5000
   46    1816.5877
   47    5000
   48    5000
   49    988.63706

BLOCK MASS
   6    173.2
   23    91.1876
   24    80.429995
   15    1.777
   25    125.69923
   35    1630.0561
   36    1631.0241
   37    1632.7972
   1000001    5044.1895
   2000001    5032.9764
   1000002    5043.7247
   2000002    5033.9467
   1000003    5044.1917
   2000003    5032.9795
   1000004    5043.7267
   2000004    5033.9471
   1000005    1024.2687
   2000005    1977.9844
   1000006    1721.217
   2000006    2054.828
   1000011    1062.779
   2000011    1752.4432
   1000012    1059.4288
   1000013    1062.7577
   2000013    1752.4137
   1000014    1059.41
   1000015    993.55658
   2000015    1483.0576
   1000016    1480.386
   1000021    3216.9331
   1000022    216.26033
   1000023   -262.13313
   1000025    333.52672
   1000035   -1536.7534
   1000024    219.64466
   1000037    336.09069

BLOCK ALPHA
      -0.023098024

BLOCK HMIX Q=  1880.6395
   1   -259.53541
   2    42.931808
   3    243.73749
   4    2660239.6

BLOCK STOPMIX
   1   1    0.49003612
   1   2    0.87170213
   2   1   -0.87170213
   2   2    0.49003612

BLOCK SBOTMIX
   1   1   -0.011024332
   1   2    0.99993923
   2   1   -0.99993923
   2   2   -0.011024332

BLOCK STAUMIX
   1   1   -0.018577369
   1   2    0.99982743
   2   1   -0.99982743
   2   2   -0.018577369

BLOCK NMIX
   1   1    0.012478805
   1   2    0.59011655
   1   3    0.61957629
   1   4    0.51742822
   2   1   -0.024700041
   2   2   -0.10720071
   2   3    0.69554986
   2   4   -0.71000585
   3   1    0.01093994
   3   2   -0.80016803
   3   3    0.36373847
   3   4    0.47676594
   4   1    0.99955715
   4   2   -0.0012585788
   4   3    0.0054716845
   4   4   -0.029222791

BLOCK UMIX
   1   1   -0.52716468
   1   2   -0.84976315
   2   1    0.84976315
   2   2   -0.52716468

BLOCK VMIX
   1   1   -0.69480365
   1   2    0.71919948
   2   1    0.71919948
   2   2    0.69480365

BLOCK HIGGSBOUNDSINPUTHIGGSCOUPLINGSFERMIONS
       0, 1843.1401,3,36,15,15

BLOCK HIGGSBOUNDSINPUTHIGGSCOUPLINGSBOSONS
       0,4,36,21,21,23

BLOCK SPHENOLOWENERGY
   1    0.00038619879
   2    1.587399e-06
   3    3.5241213e-05
   4    9.2085506e-16
   5    3.931137e-11
   6    6.6924195e-09
   7    3.1266138e-14
   8    1.3348365e-09
   9    2.3308579e-07
   10    9.2310125e-05
   11    0.95352825
   12    0.54264441
   13    19.350266
   14    0
   15    0
   16    0.0021613745
   17    2.2817042e-15
   18    2.4791242e-11
   19    8.2882803e-11
   20   -1.0682233e-14
   21   -4.5671766e-10
   22   -8.7433834e-08
   23    0
   24    0
   25    0
   26    0
   27    0
   28    0
   29    0
   30    0
   31    0
   39    7.9677356e-05
   40    0
   41    0
   42    0

BLOCK FWCOEF Q=  160
   305   4422   0   0   -0.18881911
   305   4422   0   2   -0.2615494
   305   4322   0   2   -0.00077514569
   305   6421   0   0   -0.095227835
   305   6421   0   2   -0.14209293
   305   6321   0   2   -0.0005686921
   3051111   4133   0   0    1.6004826
   3051111   4133   0   2    1.6013555
   3051111   4233   0   2    0.00024459611
   3051111   4137   0   0   -4.4231747
   3051111   4137   0   2   -4.4203303
   3051111   4237   0   2   -0.0018778904
   3051313   4133   0   0    1.6004826
   3051313   4133   0   2    1.6013513
   3051313   4233   0   2    0.00024459155
   3051313   4137   0   0   -4.4231747
   3051313   4137   0   2   -4.4203344
   3051313   4237   0   2   -0.0018778905
   3051212   4137   0   0    1.5053501
   3051212   4137   0   2    1.5047621
   3051212   4237   0   2    0.00040847737
   3051414   4137   0   0    1.5053501
   3051414   4137   0   2    1.5047621
   3051414   4237   0   2    0.00040847815
   3051616   4137   0   0    1.5053501
   3051616   4137   0   2    1.504761
   3051616   4237   0   2    0.00040869658

BLOCK IMFWCOEF Q=  160
   305   4422   0   0    3.8577966e-07
   305   4422   0   2   -2.9579741e-05
   305   4322   0   2   -8.0387632e-06
   305   6421   0   0    3.3044579e-07
   305   6421   0   2    1.4185213e-05
   305   6321   0   2   -2.9479091e-06
   3051111   4133   0   2   -1.0129809e-06
   3051111   4233   0   2    6.4858807e-06
   3051111   4137   0   2    1.1346345e-05
   3051111   4237   0   2   -4.9835012e-05
   3051313   4133   0   2   -1.0131066e-06
   3051313   4233   0   2    6.4858634e-06
   3051313   4137   0   2    1.1346413e-05
   3051313   4237   0   2   -4.9835078e-05
   3051212   4137   0   2   -1.9207488e-06
   3051212   4237   0   2    1.0840068e-05
   3051414   4137   0   2   -1.9207454e-06
   3051414   4237   0   2    1.0840068e-05
   3051616   4137   0   2   -1.9396984e-06
   3051616   4237   0   2    1.0840067e-05

DECAY 23  2.4952


DECAY 24  2.085


DECAY 1000011  11.84414
    0.46200573   2   -1000037    12
    0.20252675   2    1000025    11
    0.20116384   2   -1000024    12
    0.12925415   2    1000022    11
    0.005049529   2    1000023    11

DECAY 2000011  0.47693448
    0.98439182   2    1000035    11
    0.010765934   2    1000023    11
    0.0027885212   2    1000022    11
    0.0020525976   2    1000025    11

DECAY 1000013  11.856597
    0.46150699   2   -1000037    14
    0.20243811   2    1000025    13
    0.20094775   2   -1000024    14
    0.12954463   2    1000022    13
    0.0055625154   2    1000023    13

DECAY 2000013  0.52248274
    0.89835924   2    1000035    13
    0.031814686   2   -1000024    14
    0.030854687   2    1000023    13
    0.019474331   2    1000022    13
    0.01172538   2   -1000037    14
    0.0074621149   2    1000025    13
    0.00030955529   2    1000013    25

DECAY 1000015  6.6640187
    0.38655033   2   -1000024    16
    0.23859713   2    1000023    15
    0.2068349   2    1000022    15
    0.11352717   2   -1000037    16
    0.054490467   2    1000025    15

DECAY 2000015  23.44045
    0.36733341   2   -1000037    16
    0.18974165   2    1000025    15
    0.18092312   2    1000022    15
    0.14221999   2   -1000024    16
    0.1145308   2    1000023    15
    0.002662466   2    1000015    25
    0.0025885659   2    1000015    23

DECAY 1000012  11.978225
    0.34425151   2    1000024    11
    0.32574562   2    1000037    11
    0.20526237   2    1000025    12
    0.12170859   2    1000022    12
    0.0030319022   2    1000023    12

DECAY 1000014  11.990674
    0.34468058   2    1000024    13
    0.32566701   2    1000037    13
    0.20504403   2    1000025    14
    0.1215797   2    1000022    14
    0.0030286867   2    1000023    14

DECAY 1000016  23.535637
    0.42242337   2    1000024    15
    0.31780455   2    1000037    15
    0.16206482   2    1000025    16
    0.090265731   2    1000022    16
    0.0051459648   2    1000015    24
    0.0022955581   2    1000023    16

DECAY 2000001  141.28585
    0.98364381   2    1000021    1
    0.016337936   2    1000035    1

DECAY 1000001  206.83969
    0.67753151   2    1000021    1
    0.15364619   2   -1000037    2
    0.068458853   2    1000025    1
    0.059433977   2   -1000024    2
    0.036962594   2    1000022    1
    0.0028384749   2    1000035    1
    0.0011284034   2    1000023    1

DECAY 2000003  141.32371
    0.98338254   2    1000021    3
    0.016333575   2    1000035    3

DECAY 1000003  206.86057
    0.67746422   2    1000021    3
    0.153635   2   -1000037    4
    0.068463952   2    1000025    3
    0.059432507   2   -1000024    4
    0.036993853   2    1000022    3
    0.0028381922   2    1000035    3
    0.0011722774   2    1000023    3

DECAY 1000005  17.835541
    0.3664487   2   -1000024    6
    0.24804084   2    1000023    5
    0.20891796   2    1000022    5
    0.11637593   2   -1000037    6
    0.060216574   2    1000025    5

DECAY 2000005  98.695322
    0.31239141   2   -1000037    6
    0.24472195   2   -1000024    6
    0.15687878   2    1000006   -24
    0.10567824   2    1000022    5
    0.096918192   2    1000023    5
    0.079965086   2    1000025    5
    0.0017475463   2    1000005    25
    0.0012515218   2    1000005    23
    0.0004472789   2    1000035    5

DECAY 2000002  148.32145
    0.93766453   2    1000021    2
    0.062268728   2    1000035    2

DECAY 1000002  206.83531
    0.67731221   2    1000021    2
    0.11005087   2    1000037    1
    0.10323715   2    1000024    1
    0.067790445   2    1000025    2
    0.037520769   2    1000022    2
    0.0027590163   2    1000035    2
    0.0013295424   2    1000023    2

DECAY 2000004  148.32504
    0.93764169   2    1000021    4
    0.062267216   2    1000035    4

DECAY 1000004  206.8561
    0.67724483   2    1000021    4
    0.11006501   2    1000037    3
    0.10329259   2    1000024    3
    0.067785659   2    1000025    4
    0.037519341   2    1000022    4
    0.0027587477   2    1000035    4
    0.0013338193   2    1000023    4

DECAY 1000006  67.162286
    0.41052635   2    1000024    5
    0.25288156   2    1000023    6
    0.19758947   2    1000022    6
    0.084101436   2    1000037    5
    0.049063822   2    1000025    6
    0.0035719094   2    1000022    4
    0.0010441278   3    1000022    24    5
    0.0006988221   2    1000035    6
    0.00039761369   2    1000005    24
    0.00012488778   2    1000023    4

DECAY 2000006  103.87715
    0.25682871   2    1000037    5
    0.18798114   2    1000023    6
    0.18757754   2    1000025    6
    0.12244773   2    1000006    23
    0.10945225   2    1000024    5
    0.080083301   2    1000022    6
    0.052030662   2    1000006    25
    0.0022050863   2    1000005    24
    0.0013935799   2    1000035    6

DECAY 1000024  8.513096e-10
    0.44276606   3    1000022   -1    2
    0.22419451   3    1000022   -3    4
    0.1480375   3    1000022   -11    12
    0.14731939   3    1000022   -13    14
    0.037682538   3    1000022   -15    16

DECAY 1000037  0.39894616
    0.62082169   2    1000022    24
    0.34717075   2    1000024    23
    0.010671134   3    1000023   -1    2
    0.010663372   3    1000023   -3    4
    0.0035575962   3    1000023   -11    12
    0.0035575858   3    1000023   -13    14
    0.0035562078   3    1000023   -15    16

DECAY 1000022 -1


DECAY 1000023  0.0012399647
    0.10549543   3    1000024    1   -2
    0.10549543   3   -1000024   -1    2
    0.10510056   3    1000024    3   -4
    0.10510056   3   -1000024   -3    4
    0.073340915   3    1000022    12   -12
    0.054807828   3    1000022    1   -1
    0.054805447   3    1000022    3   -3
    0.05118358   3    1000022    5   -5
    0.042748662   3    1000022    2   -2
    0.04235882   3    1000022    4   -4
    0.035166267   3    1000024    11   -12
    0.035166267   3   -1000024   -11    12
    0.035165716   3    1000024    13   -14
    0.035165716   3   -1000024   -13    14
    0.035002315   3    1000024    15   -16
    0.035002315   3   -1000024   -15    16
    0.012356203   3    1000022    11   -11
    0.012355608   3    1000022    13   -13
    0.012223528   3    1000022    15   -15
    0.011958831   2    1000022    22

DECAY 1000025  0.52958579
    0.49500411   2    1000024   -24
    0.49500411   2   -1000024    24
    0.0028118982   2    1000022    23
    0.0014448524   3    1000023    12   -12
    0.0010813987   3    1000023    1   -1
    0.0010813849   3    1000023    3   -3
    0.0010624943   3    1000023    5   -5
    0.00084330047   3    1000023    2   -2
    0.00084072435   3    1000023    4   -4
    0.00024436811   3    1000023    11   -11
    0.00024436591   3    1000023    13   -13
    0.00024375329   3    1000023    15   -15

DECAY 1000035  9.9007426
    0.13194018   2    1000015   -15
    0.13194018   2   -1000015    15
    0.068730733   2    1000023    25
    0.059709366   2    1000024   -24
    0.059709366   2   -1000024    24
    0.041112183   2    1000037   -24
    0.041112183   2   -1000037    24
    0.040363785   2    1000022    23
    0.040112647   2    1000005   -5
    0.040112647   2   -1000005    5
    0.035285936   2    1000022    25
    0.032885112   2    1000023    23
    0.027492314   2    1000025    23
    0.026947606   2    1000014   -14
    0.026947606   2   -1000014    14
    0.026945876   2    1000012   -12
    0.026945876   2   -1000012    12
    0.026389549   2    1000013   -13
    0.026389549   2   -1000013    13
    0.026387613   2    1000011   -11
    0.026387613   2   -1000011    11
    0.02453411   2    1000025    25
    0.0019279063   3    1000024    5   -6
    0.0019279063   3   -1000024   -5    6
    0.0015492217   3    1000023    6   -6
    0.0012330593   3    1000037    5   -6
    0.0012330593   3   -1000037   -5    6
    0.00091891046   3    1000022    6   -6
    0.00052617693   3    1000025    6   -6
    0.00050750582   2    1000016   -16
    0.00050750582   2   -1000016    16
    0.00045602526   2    2000015   -15
    0.00045602526   2   -2000015    15
    0.00014001985   3    1000023    5   -5
    0.000130618   3    1000022    5   -5

DECAY 1000021  198.7112
    0.193492   2    1000005   -5
    0.193492   2   -1000005    5
    0.10603095   2    1000006   -6
    0.10603095   2   -1000006    6
    0.096287837   2    2000006   -6
    0.096287837   2   -2000006    6
    0.092669286   2    2000005   -5
    0.092669286   2   -2000005    5
    0.011371268   2    1000006   -4
    0.011371268   2   -1000006    4

DECAY 25  0.0039965416
    0.56399297   2   -5    5
    0.23860539   2   -24    24
    0.071287031   2    21    21
    0.064970349   2   -15    15
    0.029283956   2    23    23
    0.027553067   2   -4    4
    0.0023244519   2    22    22
    0.0015448468   2    22    23
    0.0002251364   2   -13    13
    0.00021207416   2   -3    3
    5.8636326e-07   2   -1    1
    1.4198511e-07   2   -2    2
    5.0613075e-09   2   -11    11

DECAY 35  63.776943
    0.62138528   2   -5    5
    0.097200562   2   -15    15
    0.071250344   2   -1000024    1000024
    0.044764694   2   -1000024    1000037
    0.044764694   2   -1000037    1000024
    0.029503647   2    1000023    1000025
    0.028624254   2    1000022    1000022
    0.026458874   2   -1000037    1000037
    0.016759519   2    1000025    1000025
    0.014888725   2    1000022    1000023
    0.0024484939   2    1000022    1000025
    0.00076005476   2    1000023    1000023
    0.0006086117   2   -6    6
    0.00032801914   2   -13    13
    0.00022939517   2   -3    3
    1.7735579e-05   2    21    21
    5.0263858e-06   2    25    25
    6.3424065e-07   2   -1    1
    5.6225778e-07   2    23    23
    3.9958921e-07   2   -24    24
    3.2738351e-07   2    22    23
    1.3678104e-07   2    22    22
    7.379489e-09   2   -4    4
    7.3685048e-09   2   -11    11
    3.8042853e-14   2   -2    2

DECAY 36  61.171134
    0.61084971   2   -5    5
    0.09555554   2   -15    15
    0.075230829   2   -1000024    1000024
    0.045836935   2   -1000024    1000037
    0.045836935   2   -1000037    1000024
    0.02972167   2    1000022    1000022
    0.029026065   2    1000023    1000025
    0.028459759   2   -1000037    1000037
    0.018465009   2    1000025    1000025
    0.016004658   2    1000022    1000023
    0.0028290146   2    1000022    1000025
    0.00097423757   2    1000023    1000023
    0.00063217765   2   -6    6
    0.00032246693   2   -13    13
    0.00022549847   2   -3    3
    2.7928694e-05   2    21    21
    7.7606223e-07   2    23    25
    6.2346634e-07   2   -1    1
    1.3830797e-07   2    22    23
    1.1446908e-08   2    22    22
    7.2888451e-09   2   -4    4
    7.2437789e-09   2   -11    11
    3.7581467e-14   2   -2    2
    1.2329523e-37   2    25    25

DECAY 37  60.027959
    0.5983063   2   -5    6
    0.1113166   2    1000022    1000037
    0.10357638   2   -15    16
    0.08791123   2    1000024    1000025
    0.049014772   2    1000023    1000037
    0.048171771   2    1000023    1000024
    0.00089426609   2   -5    4
    0.0003661801   2   -13    14
    0.00021874562   2   -3    4
    0.00012717513   2    1000022    1000024
    7.7378602e-05   2    1000025    1000037
    1.0170527e-05   2   -3    2
    6.3859883e-06   2   -5    2
    1.1615088e-06   2   -3    6
    7.9516252e-07   2    24    25
    6.070752e-07   2   -1    2
    3.8760049e-08   2   -1    6
    2.8503971e-08   2   -1    4
    8.5649907e-09   2   -11    12
    3.5048958e-12   2    24    35
    3.9711334e-13   2    24    36

DECAY 6  2.43
    1   2    5    24

DECAY 15 -1
