BLOCK SPINFO
   1   SPheno
   2   v4.0.5be

BLOCK SPHENOINFO
   1   2
   2   2

BLOCK MODSEL
   1   0

BLOCK MINPAR
   3    12.849023
   4   -1

BLOCK EXTPAR
   0    3684.8396
   1    3656.383
   2   -1644.9283
   3    2747.4229
   11    3613.5325
   12   -987.09934
   13   -2591.1748
   23   -387.70321
   25    12.22462
   26    4068.1566
   31    923.4488
   32    923.4488
   33    1429.6791
   34    2742.7893
   35    2742.7893
   36    3397.1234
   41    4309.935
   42    4309.935
   43    4934.4301
   44    4608.861
   45    4608.861
   46    2641.2086
   47    3973.1242
   48    3973.1242
   49    923.2136

BLOCK SMINPUTS
   1    127.90897
   2    1.1663787e-05
   3    0.1184
   4    91.1876
   5    4.18
   6    173.2
   7    1.777
   8    0
   11    0.00051099893
   12    0
   13    0.10565837
   14    0
   21    0.005
   22    0.0025
   23    0.095
   24    1.27

BLOCK GAUGE Q=  3684.8396
   1    0.35536298
   2    0.66519887
   3    1.219778

BLOCK YU Q=  3684.8396
   1   1    8.4123778e-06
   2   2    0.0042734879
   3   3    1.0162828

BLOCK YD Q=  3684.8396
   1   1    0.0002066495
   2   2    0.0039263406
   3   3    0.20493155

BLOCK YE Q=  3684.8396
   1   1    3.606185e-05
   2   2    0.0074564468
   3   3    0.12540517

BLOCK AU Q=  3684.8396
   1   1    0
   2   2    0
   3   3    3613.5325

BLOCK AD Q=  3684.8396
   1   1    0
   2   2    0
   3   3   -987.09934

BLOCK AE Q=  3684.8396
   1   1    0
   2   2    0
   3   3   -2591.1748

BLOCK MSOFT Q=  3684.8396
   1    3656.383
   2   -1644.9283
   3    2747.4229
   21    16217744
   22    135319.61
   31    923.4488
   32    923.4488
   33    1429.6791
   34    2742.7893
   35    2742.7893
   36    3397.1234
   41    4309.935
   42    4309.935
   43    4934.4301
   44    4608.861
   45    4608.861
   46    2641.2086
   47    3973.1242
   48    3973.1242
   49    923.2136

BLOCK MASS
   6    173.2
   23    91.1876
   24    80.429995
   15    1.777
   25    122.04926
   35    4067.8203
   36    4068.1566
   37    4068.8338
   1000001    4401.6003
   2000001    4057.3917
   1000002    4400.863
   2000002    4686.8682
   1000003    4401.5995
   2000003    4057.3908
   1000004    4400.8623
   2000004    4686.8675
   1000005    1160.7647
   2000005    4982.9482
   1000006    2723.2449
   2000006    4985.9794
   1000011    968.09482
   2000011    2756.7716
   1000012    964.45526
   1000013    968.08943
   2000013    2756.767
   1000014    964.45143
   1000015    1460.8078
   2000015    3408.1231
   1000016    1458.4941
   1000021    3070.7322
   1000022   -385.97891
   1000023    389.40568
   1000025   -1697.6163
   1000035    3610.0249
   1000024    386.92612
   1000037    1697.6913

BLOCK ALPHA
      -0.077776459

BLOCK HMIX Q=  3684.8396
   1   -387.70321
   2    12.22462
   3    243.03527
   4    16549898

BLOCK STOPMIX
   1   1   -0.02730303
   1   2    0.9996272
   2   1   -0.9996272
   2   2   -0.02730303

BLOCK SBOTMIX
   1   1   -0.00034575591
   1   2    0.99999994
   2   1   -0.99999994
   2   2   -0.00034575591

BLOCK STAUMIX
   1   1   -0.99999991
   1   2    0.00041448775
   2   1   -0.00041448775
   2   2   -0.99999991

BLOCK NMIX
   1   1   -0.0083933175
   1   2   -0.045842925
   1   3   -0.7082421
   1   4    0.70442963
   2   1    0.0088828336
   2   2    0.024511767
   2   3   -0.70580618
   2   4   -0.70792507
   3   1    0.00043143469
   3   2   -0.99864787
   3   3    0.015187815
   3   4   -0.049714929
   4   1    0.99992523
   4   2   -0.00017166967
   4   3    0.00031852924
   4   4    0.012223245

BLOCK UMIX
   1   1   -0.021487317
   1   2   -0.99976912
   2   1   -0.99976912
   2   2    0.021487317

BLOCK VMIX
   1   1    0.070374247
   1   2    0.99752066
   2   1    0.99752066
   2   2   -0.070374247

BLOCK HIGGSBOUNDSINPUTHIGGSCOUPLINGSFERMIONS
       0, 149.44132,3,36,15,15

BLOCK HIGGSBOUNDSINPUTHIGGSCOUPLINGSBOSONS
       0,4,36,21,21,23

BLOCK SPHENOLOWENERGY
   1    0.00032202978
   2    1.5898796e-06
   3    3.5248719e-05
   4    2.6065958e-15
   5    1.1135081e-10
   6    2.3310023e-08
   7    8.8072832e-14
   8    3.7624685e-09
   9    7.9804527e-07
   10    9.6748714e-05
   11    0.99937718
   12    0.54230523
   13    19.376681
   14    0
   15    0
   16    0.0021585676
   17    2.281671e-15
   18    2.4795462e-11
   19    8.2895424e-11
   20    1.1584408e-15
   21    4.9526927e-11
   22    1.2579947e-08
   23    0
   24    0
   25    0
   26    0
   27    0
   28    0
   29    0
   30    0
   31    0
   39    1.1579309e-06
   40    0
   41    0
   42    0

BLOCK FWCOEF Q=  160
   305   4422   0   0   -0.18881911
   305   4422   0   2   -0.19039284
   305   4322   0   2   -2.6739353e-05
   305   6421   0   0   -0.095227835
   305   6421   0   2   -0.099250522
   305   6321   0   2   -7.6463976e-05
   3051111   4133   0   0    1.6233878
   3051111   4133   0   2    1.6237963
   3051111   4233   0   2    1.7647481e-05
   3051111   4137   0   0   -4.4460799
   3051111   4137   0   2   -4.4440168
   3051111   4237   0   2   -0.0001294048
   3051313   4133   0   0    1.6233878
   3051313   4133   0   2    1.6237961
   3051313   4233   0   2    1.7647477e-05
   3051313   4137   0   0   -4.4460799
   3051313   4137   0   2   -4.4440171
   3051313   4237   0   2   -0.00012940481
   3051212   4137   0   0    1.5053501
   3051212   4137   0   2    1.5049068
   3051212   4237   0   2    2.8004979e-05
   3051414   4137   0   0    1.5053501
   3051414   4137   0   2    1.5049068
   3051414   4237   0   2    2.8004979e-05
   3051616   4137   0   0    1.5053501
   3051616   4137   0   2    1.5049068
   3051616   4237   0   2    2.80049e-05

BLOCK IMFWCOEF Q=  160
   305   4422   0   0    3.8582612e-07
   305   4422   0   2    1.0238251e-06
   305   4322   0   2    9.1119441e-07
   305   6421   0   0    3.3048559e-07
   305   6421   0   2    3.9969363e-06
   305   6321   0   2    5.0648653e-07
   3051111   4133   0   2    2.5700013e-07
   3051111   4233   0   2    3.6153023e-07
   3051111   4137   0   2   -1.8762278e-06
   3051111   4237   0   2   -2.6559784e-06
   3051313   4133   0   2    2.5699765e-07
   3051313   4233   0   2    3.6153019e-07
   3051313   4137   0   2   -1.876228e-06
   3051313   4237   0   2   -2.6559786e-06
   3051212   4137   0   2    4.5924026e-07
   3051212   4237   0   2    5.7478488e-07
   3051414   4137   0   2    4.5924017e-07
   3051414   4237   0   2    5.7478488e-07
   3051616   4137   0   2    4.6029478e-07
   3051616   4237   0   2    5.7478228e-07

DECAY 23  2.4952


DECAY 24  2.085


DECAY 1000011  0.012974686
    0.58837672   2    1000022    11
    0.21411321   2   -1000024    12
    0.19751   2    1000023    11

DECAY 2000011  0.001988864
    0.52785103   2    1000023    11
    0.4716146   2    1000022    11
    0.00049960333   2    1000025    11

DECAY 1000013  0.013729398
    0.5837256   2    1000022    13
    0.21393303   2    1000023    13
    0.2023413   2   -1000024    14

DECAY 2000013  0.0078738502
    0.37198443   2   -1000024    14
    0.31862779   2    1000023    13
    0.3058306   2    1000022    13
    0.0033276729   2    1000013    25
    0.00016060989   2    1000025    13

DECAY 1000015  0.41889297
    0.50743452   2    1000022    15
    0.48022139   2    1000023    15
    0.012344092   2   -1000024    16

DECAY 2000015  2.085041
    0.49802579   2   -1000024    16
    0.25049959   2    1000022    15
    0.24880816   2    1000023    15
    0.0012060907   2    1000016   -24
    0.00061506794   2    1000015    25
    0.00060124441   2    1000015    23
    0.00016218258   2   -1000037    16

DECAY 1000012  0.035885438
    0.82489769   2    1000024    11
    0.14272421   2    1000022    12
    0.032378099   2    1000023    12

DECAY 1000014  0.036634848
    0.82848082   2    1000024    13
    0.13980363   2    1000022    14
    0.031715542   2    1000023    14

DECAY 1000016  0.46056866
    0.97468294   2    1000024    15
    0.02061993   2    1000022    16
    0.0046971325   2    1000023    16

DECAY 2000001  58.551384
    0.99831484   2    1000021    1
    0.0016793632   2    1000035    1

DECAY 1000001  133.7377
    0.68447436   2    1000021    1
    0.20984077   2   -1000037    2
    0.10470452   2    1000025    1
    0.0004930764   2    1000035    1
    0.00028056292   2    1000022    1
    0.0001317093   2   -1000024    2

DECAY 2000003  58.553739
    0.9982733   2    1000021    3
    0.0016792896   2    1000035    3

DECAY 1000003  133.7405
    0.68445941   2    1000021    3
    0.20983635   2   -1000037    4
    0.1047023   2    1000025    3
    0.00049306521   2    1000035    3
    0.0002855294   2    1000022    3
    0.00014341714   2   -1000024    4

DECAY 1000005  1.4883178
    0.48571954   2   -1000024    6
    0.25859864   2    1000022    5
    0.25568182   2    1000023    5

DECAY 2000005  329.49631
    0.45921099   2    1000021    5
    0.30474772   2   -1000024    6
    0.10544343   2   -1000037    6
    0.065562607   2    1000006   -24
    0.051878358   2    1000025    5
    0.0063910999   2    1000022    5
    0.0062524691   2    1000023    5
    0.00047735195   2    1000035    5

DECAY 1000002  133.701
    0.68411261   2    1000021    2
    0.20889585   2    1000037    1
    0.10467124   2    1000025    2
    0.001412967   2    1000024    1
    0.00049055475   2    1000035    2
    0.00031967655   2    1000022    2

DECAY 2000002  122.24266
    0.98582546   2    1000021    2
    0.014161915   2    1000035    2

DECAY 1000004  133.70374
    0.68409754   2    1000021    4
    0.20889152   2    1000037    3
    0.10466903   2    1000025    4
    0.001422843   2    1000024    3
    0.00049054222   2    1000035    4
    0.00032551806   2    1000022    4
    0.00010300646   2    1000023    4

DECAY 2000004  122.24587
    0.9857984   2    1000021    4
    0.014161518   2    1000035    4

DECAY 1000006  106.85895
    0.50112317   2    1000024    5
    0.25007983   2    1000023    6
    0.24799125   2    1000022    6
    0.00053987788   2    1000037    5
    0.00026580387   2    1000025    6

DECAY 2000006  337.57741
    0.44802625   2    1000021    6
    0.14979747   2    1000023    6
    0.14836141   2    1000022    6
    0.10164205   2    1000037    5
    0.056280563   2    1000006    25
    0.051060757   2    1000025    6
    0.032062171   2    1000006    23
    0.012283145   2    1000024    5
    0.00046095684   2    1000035    6

DECAY 1000024  1.7763775e-12
    0.60713342   3    1000022   -1    2
    0.2024194   3    1000022   -11    12
    0.19044719   3    1000022   -13    14

DECAY 1000037  30.426779
    0.12837941   2    1000024    25
    0.12603797   2    1000023    24
    0.12564339   2    1000022    24
    0.12531385   2    1000024    23
    0.1120907   2    1000014   -13
    0.11208986   2    1000012   -11
    0.11178696   2   -1000013    14
    0.11178576   2   -1000011    12
    0.016765663   2    1000016   -15
    0.016542452   2   -1000015    16
    0.005564708   3    1000024    6   -6
    0.0043219107   3    1000023   -5    6
    0.0036681876   3    1000022   -5    6

DECAY 1000022 -1


DECAY 1000023  8.8834066e-09
    0.85226975   2    1000022    22
    0.037073303   3    1000022    12   -12
    0.027721761   3    1000022    1   -1
    0.027475362   3    1000022    3   -3
    0.021621034   3    1000022    2   -2
    0.0062560072   3    1000022    11   -11
    0.0061685736   3    1000022    13   -13
    0.0049257465   3    1000024    1   -2
    0.0049257465   3   -1000024   -1    2
    0.0021886506   3    1000022    4   -4
    0.0016419671   3    1000024    11   -12
    0.0016419671   3   -1000024   -11    12
    0.0016272046   3    1000024    13   -14
    0.0016272046   3   -1000024   -13    14
    0.0013266664   3    1000024    3   -4
    0.0013266664   3   -1000024   -3    4

DECAY 1000025  31.816364
    0.12101584   2    1000024   -24
    0.12101584   2   -1000024    24
    0.094560951   2    1000022    25
    0.094182769   2    1000023    23
    0.070194947   2    1000023    25
    0.053736661   2    1000014   -14
    0.053736661   2   -1000014    14
    0.053736255   2    1000012   -12
    0.053736255   2   -1000012    12
    0.053300995   2    1000013   -13
    0.053300995   2   -1000013    13
    0.053300415   2    1000011   -11
    0.053300415   2   -1000011    11
    0.026378603   2    1000022    23
    0.0080347683   2    1000016   -16
    0.0080347683   2   -1000016    16
    0.0078847352   2    1000015   -15
    0.0078847352   2   -1000015    15
    0.003983747   3    1000024    5   -6
    0.003983747   3   -1000024   -5    6
    0.0024564475   3    1000022    6   -6
    0.0022120767   3    1000023    6   -6

DECAY 1000035  47.916671
    0.050713272   2    1000005   -5
    0.050713272   2   -1000005    5
    0.048132498   2    1000024   -24
    0.048132498   2   -1000024    24
    0.045669618   2    1000006   -6
    0.045669618   2   -1000006    6
    0.04082572   2    1000014   -14
    0.04082572   2   -1000014    14
    0.04082567   2    1000012   -12
    0.04082567   2   -1000012    12
    0.040725914   2    1000013   -13
    0.040725914   2   -1000013    13
    0.040725843   2    1000011   -11
    0.040725843   2   -1000011    11
    0.03314887   2    1000016   -16
    0.03314887   2   -1000016    16
    0.033065349   2    1000015   -15
    0.033065349   2   -1000015    15
    0.032901765   2    1000022    25
    0.032884728   2    2000013   -13
    0.032884728   2   -2000013    13
    0.032884423   2    2000011   -11
    0.032884423   2   -2000011    11
    0.025205481   2    1000022    23
    0.024317292   2    1000023    25
    0.022919101   2    1000023    23
    0.0028200864   3    1000024    5   -6
    0.0028200864   3   -1000024   -5    6
    0.0024708083   3    1000022    6   -6
    0.0023210759   3    1000023    6   -6
    0.0022371806   2    2000015   -15
    0.0022371806   2   -2000015    15

DECAY 1000021  70.552735
    0.47321956   2    1000005   -5
    0.47321956   2   -1000005    5
    0.026560353   2    1000006   -6
    0.026560353   2   -1000006    6

DECAY 25  0.0035269848
    0.61683084   2   -5    5
    0.18253393   2   -24    24
    0.074512666   2    21    21
    0.070691216   2   -15    15
    0.030544293   2   -4    4
    0.020820746   2    23    23
    0.0023364143   2    22    22
    0.00125215   2    22    23
    0.00024519113   2   -13    13
    0.00023175093   2   -3    3
    6.4076821e-07   2   -1    1
    1.5741148e-07   2   -2    2
    5.5122087e-09   2   -11    11

DECAY 35  44.293546
    0.25803287   2   -1000024    1000037
    0.25803287   2   -1000037    1000024
    0.16624905   2   -5    5
    0.16055766   2    1000023    1000025
    0.098059528   2    1000022    1000025
    0.031461888   2   -15    15
    0.021613347   2   -6    6
    0.0036925687   2   -1000024    1000024
    0.0010820702   2    1000022    1000035
    0.00058421649   2    1000022    1000022
    0.00018282101   2    1000023    1000023
    0.00014153941   2    1000022    1000023
    0.00010991218   2   -13    13
    6.2745464e-05   2   -3    3
    4.2819529e-05   2   -1000037    1000037
    4.1758605e-05   2    1000023    1000035
    2.150194e-05   2    1000025    1000025
    1.6640381e-05   2    25    25
    2.602382e-06   2    23    23
    1.1515819e-06   2    21    21
    7.9681513e-07   2   -1000011    1000011
    7.9616003e-07   2   -1000013    1000013
    5.3907462e-07   2   -24    24
    4.1850552e-07   2   -1000015    1000015
    2.8890582e-07   2   -4    4
    1.7346834e-07   2   -1    1
    8.4786947e-08   2    22    23
    6.933733e-08   2    22    22
    7.471441e-09   2   -1000005    1000005
    2.4683441e-09   2   -11    11
    1.1445263e-09   2   -2000013    1000013
    1.1445263e-09   2   -1000013    2000013
    1.4891735e-12   2   -2    2
    2.6770588e-14   2   -2000011    1000011
    2.6770588e-14   2   -1000011    2000011

DECAY 36  43.908691
    0.25989926   2   -1000024    1000037
    0.25989926   2   -1000037    1000024
    0.16243376   2    1000022    1000025
    0.16186544   2   -5    5
    0.098192585   2    1000023    1000025
    0.030632822   2   -15    15
    0.020005658   2   -6    6
    0.0042516308   2   -1000024    1000024
    0.0010144823   2    1000023    1000035
    0.00083372249   2    1000022    1000022
    0.00035686638   2   -1000037    1000037
    0.00017860407   2    1000025    1000025
    0.00013996372   2    1000023    1000023
    0.00010701557   2   -13    13
    6.1091282e-05   2   -3    3
    5.5509866e-05   2    1000022    1000023
    5.4637593e-05   2    1000022    1000035
    1.1356383e-05   2    21    21
    5.6398449e-06   2    23    25
    2.6549921e-07   2   -4    4
    1.6889659e-07   2   -1    1
    1.3740594e-07   2    22    23
    1.1816498e-07   2    22    22
    2.4032592e-09   2   -11    11
    1.1511405e-09   2   -2000013    1000013
    1.1511405e-09   2   -1000013    2000013
    1.3685733e-12   2   -2    2
    2.6925297e-14   2   -2000011    1000011
    2.6925297e-14   2   -1000011    2000011
    4.6781392e-40   2    25    25

DECAY 37  44.19557
    0.26146213   2    1000022    1000037
    0.25931538   2    1000024    1000025
    0.25847127   2    1000023    1000037
    0.18735099   2   -5    6
    0.030396722   2   -15    16
    0.001133363   2    1000024    1000035
    0.0010213016   2    1000023    1000024
    0.00032145771   2    1000022    1000024
    0.0002463506   2   -5    4
    0.00010746323   2   -13    14
    6.5615507e-05   2   -1000005    1000006
    5.7427495e-05   2   -3    4
    3.0449102e-05   2   -3    6
    5.6079317e-06   2    24    25
    3.1369473e-06   2   -1000011    1000012
    3.1360269e-06   2   -1000013    1000014
    2.6861943e-06   2   -3    2
    2.1787315e-06   2   -1000015    1000016
    1.7591943e-06   2   -5    2
    1.3926292e-06   2   -1    6
    1.5859702e-07   2   -1    2
    2.0122138e-08   2   -1    4
    2.5135761e-09   2   -11    12
    2.3058003e-09   2   -2000013    1000014
    6.8502818e-11   2    1000025    1000037
    5.393294e-14   2   -2000011    1000012
    3.2937717e-14   2    24    35

DECAY 6  2.43
    1   2    5    24

DECAY 15 -1
