BLOCK SPINFO
   1   SPheno
   2   v4.0.5be

BLOCK SPHENOINFO
   1   2
   2   2

BLOCK MODSEL
   1   0

BLOCK MINPAR
   3    43.336074
   4   -1

BLOCK EXTPAR
   0    1381.0718
   1   -3.2735636
   2   -1846.1961
   3    3000
   11    2847.8351
   12    985.98295
   13    1069.7634
   23   -111.76562
   25    42.652893
   26    3617.334
   31    1073.6599
   32    1073.6599
   33    365.0129
   34    1748.014
   35    1748.014
   36    1989.7952
   41    5000
   42    5000
   43    1147.1853
   44    5000
   45    5000
   46    1791.4774
   47    5000
   48    5000
   49    1055.7187

BLOCK SMINPUTS
   1    127.90897
   2    1.1663787e-05
   3    0.1184
   4    91.1876
   5    4.18
   6    173.2
   7    1.777
   8    0
   11    0.00051099893
   12    0
   13    0.10565837
   14    0
   21    0.005
   22    0.0025
   23    0.095
   24    1.27

BLOCK GAUGE Q=  1381.0718
   1    0.35536298
   2    0.66519887
   3    1.219778

BLOCK YU Q=  1381.0718
   1   1    8.3866761e-06
   2   2    0.0042604315
   3   3    1.0131778

BLOCK YD Q=  1381.0718
   1   1    0.00071881745
   2   2    0.013657532
   3   3    0.71284167

BLOCK YE Q=  1381.0718
   1   1    0.0001254389
   2   2    0.025936787
   3   3    0.43621408

BLOCK AU Q=  1381.0718
   1   1    0
   2   2    0
   3   3    2847.8351

BLOCK AD Q=  1381.0718
   1   1    0
   2   2    0
   3   3    985.983

BLOCK AE Q=  1381.0718
   1   1    0
   2   2    0
   3   3    1069.7635

BLOCK MSOFT Q=  1381.0718
   1   -3.2735636
   2   -1846.1961
   3    3000
   21    13088504
   22    39251.991
   31    1073.6599
   32    1073.6599
   33    365.0129
   34    1748.014
   35    1748.014
   36    1989.7952
   41    5000
   42    5000
   43    1147.1853
   44    5000
   45    5000
   46    1791.4774
   47    5000
   48    5000
   49    1055.7187

BLOCK MASS
   6    173.2
   23    91.1876
   24    80.429995
   15    1.777
   25    122.97731
   35    3614.8996
   36    3617.334
   37    3616.2786
   1000001    5020.245
   2000001    5013.2206
   1000002    5019.8014
   2000002    5015.9228
   1000003    5020.2514
   2000003    5013.2322
   1000004    5019.8078
   2000004    5015.9237
   1000005    1041.7525
   2000005    1120.7116
   1000006    1079.5012
   2000006    1766.8894
   1000011    1090.2185
   2000011    1746.9393
   1000012    1086.925
   1000013    1090.2311
   2000013    1746.9502
   1000014    1086.9379
   1000015    412.68385
   2000015    1993.0232
   1000016    406.12018
   1000021    3181.6566
   1000022   -2.1824846
   1000023   -123.44746
   1000025    126.4402
   1000035   -1883.2064
   1000024    116.8467
   1000037    1883.38

BLOCK ALPHA
      -0.023113547

BLOCK HMIX Q=  1381.0718
   1   -111.76562
   2    42.652893
   3    244.08402
   4    13085106

BLOCK STOPMIX
   1   1   -0.97353967
   1   2    0.22851806
   2   1   -0.22851806
   2   2   -0.97353967

BLOCK SBOTMIX
   1   1   -0.082695234
   1   2    0.99657488
   2   1   -0.99657488
   2   2   -0.082695234

BLOCK STAUMIX
   1   1   -0.99999634
   1   2    0.0027059717
   2   1   -0.0027059717
   2   2   -0.99999634

BLOCK NMIX
   1   1    0.93536363
   1   2   -0.00097362737
   1   3   -0.35336218
   1   4    0.015136271
   2   1   -0.26238324
   2   2   -0.032786036
   2   3   -0.66450966
   2   4    0.69893277
   3   1   -0.23716848
   3   2    0.028149979
   3   3   -0.65844447
   3   4   -0.71372934
   4   1   -0.0010164731
   4   2    0.99906542
   4   3   -0.0035988461
   4   4    0.043061683

BLOCK UMIX
   1   1   -0.0050930231
   1   2   -0.99998703
   2   1   -0.99998703
   2   2    0.0050930231

BLOCK VMIX
   1   1    0.060946535
   1   2    0.99814103
   2   1    0.99814103
   2   2   -0.060946535

BLOCK HIGGSBOUNDSINPUTHIGGSCOUPLINGSFERMIONS
       0, 1819.2693,3,36,15,15

BLOCK HIGGSBOUNDSINPUTHIGGSCOUPLINGSBOSONS
       0,4,36,21,21,23

BLOCK SPHENOLOWENERGY
   1    0.00028611247
   2    1.597044e-06
   3    3.5247976e-05
   4    3.2171917e-15
   5    1.3743312e-10
   6    2.8684976e-08
   7    1.0979371e-13
   8    4.6903255e-09
   9    9.9179863e-07
   10    9.608948e-05
   11    0.99256754
   12    0.54277334
   13    19.392331
   14    0
   15    0
   16    0.0021604776
   17    2.2816912e-15
   18    2.4787896e-11
   19    8.2878582e-11
   20    7.2057199e-15
   21    3.0807948e-10
   22    1.1264024e-07
   23    0
   24    0
   25    0
   26    0
   27    0
   28    0
   29    0
   30    0
   31    0
   39    9.1964684e-05
   40    0
   41    0
   42    0

BLOCK FWCOEF Q=  160
   305   4422   0   0   -0.18881911
   305   4422   0   2   -0.14451681
   305   4322   0   2    0.00015167126
   305   6421   0   0   -0.095227835
   305   6421   0   2   -0.081016594
   305   6321   0   2   -2.8276492e-05
   3051111   4133   0   0    1.5894333
   3051111   4133   0   2    1.5915962
   3051111   4233   0   2    0.00028838007
   3051111   4137   0   0   -4.4121254
   3051111   4137   0   2   -4.4100855
   3051111   4237   0   2   -0.0022496149
   3051313   4133   0   0    1.5894333
   3051313   4133   0   2    1.5915929
   3051313   4233   0   2    0.00028837836
   3051313   4137   0   0   -4.4121254
   3051313   4137   0   2   -4.4100889
   3051313   4237   0   2   -0.0022496201
   3051212   4137   0   0    1.5053501
   3051212   4137   0   2    1.5049096
   3051212   4237   0   2    0.00049054605
   3051414   4137   0   0    1.5053501
   3051414   4137   0   2    1.5049096
   3051414   4237   0   2    0.00049054609
   3051616   4137   0   0    1.5053501
   3051616   4137   0   2    1.5049088
   3051616   4237   0   2    0.00049055444

BLOCK IMFWCOEF Q=  160
   305   4422   0   0    3.8583845e-07
   305   4422   0   2    1.6683432e-05
   305   4322   0   2    4.3389958e-06
   305   6421   0   0    3.3049615e-07
   305   6421   0   2    1.7242508e-05
   305   6321   0   2    1.6210358e-06
   3051111   4133   0   2    5.3554228e-07
   3051111   4233   0   2    5.7382682e-06
   3051111   4137   0   2   -2.9058324e-06
   3051111   4237   0   2   -4.4775714e-05
   3051313   4133   0   2    5.3551472e-07
   3051313   4233   0   2    5.7382425e-06
   3051313   4137   0   2   -2.9058462e-06
   3051313   4237   0   2   -4.4775812e-05
   3051212   4137   0   2    6.9574332e-07
   3051212   4237   0   2    9.7637198e-06
   3051414   4137   0   2    6.9574156e-07
   3051414   4237   0   2    9.7637198e-06
   3051616   4137   0   2    6.800702e-07
   3051616   4237   0   2    9.7636474e-06

DECAY 23  2.4952


DECAY 24  2.085


DECAY 1000011  1.3789892
    0.86548708   2    1000022    11
    0.10144295   2    1000023    11
    0.032893561   2    1000025    11
    0.00017640135   2   -1000024    12

DECAY 2000011  8.7665205
    0.87602131   2    1000022    11
    0.068246319   2    1000023    11
    0.055732312   2    1000025    11

DECAY 1000013  1.3932645
    0.85793686   2    1000022    13
    0.10491217   2    1000023    13
    0.036976374   2    1000025    13
    0.00017459607   2   -1000024    14

DECAY 2000013  8.8129414
    0.87174364   2    1000022    13
    0.069046873   2    1000023    13
    0.056577081   2    1000025    13
    0.0026291556   2   -1000024    14

DECAY 1000015  1.8361805
    0.35311656   2    1000022    15
    0.33619107   2    1000023    15
    0.31061342   2    1000025    15

DECAY 2000015  25.057185
    0.38694247   2    1000022    15
    0.29901033   2   -1000024    16
    0.15935321   2    1000023    15
    0.15195717   2    1000025    15
    0.0013783383   2    1000016   -24
    0.00068514286   2    1000015    23
    0.00067289324   2    1000015    25

DECAY 1000012  1.3993133
    0.85699312   2    1000022    12
    0.079776963   2    1000025    12
    0.038414395   2    1000023    12
    0.024815526   2    1000024    11

DECAY 1000014  1.4135409
    0.84837736   2    1000022    14
    0.078974978   2    1000025    14
    0.03802822   2    1000023    14
    0.034619445   2    1000024    13

DECAY 1000016  1.8038001
    0.72281562   2    1000024    15
    0.24839183   2    1000022    16
    0.019379184   2    1000025    16
    0.0094133671   2    1000023    16

DECAY 2000001  143.93493
    0.9805571   2    1000021    1
    0.017012751   2    1000022    1
    0.0013372396   2    1000023    1
    0.0010925352   2    1000025    1

DECAY 1000001  191.52196
    0.74073903   2    1000021    1
    0.17036274   2   -1000037    2
    0.085060376   2    1000035    1
    0.0032384416   2    1000022    1
    0.00057093636   2    1000025    1

DECAY 2000003  143.9732
    0.9803048   2    1000021    3
    0.017024357   2    1000022    3
    0.0013937165   2    1000023    3
    0.0011480407   2    1000025    3
    0.00012907063   2   -1000024    4

DECAY 1000003  191.5431
    0.74066077   2    1000021    3
    0.17034432   2   -1000037    4
    0.085051169   2    1000035    3
    0.0032501991   2    1000022    3
    0.00061287016   2    1000025    3

DECAY 1000005  20.533034
    0.47139475   2   -1000024    6
    0.21816589   2    1000023    5
    0.21187564   2    1000025    5
    0.098563727   2    1000022    5

DECAY 2000005  32.466571
    0.65384068   2   -1000024    6
    0.15302475   2    1000023    5
    0.15192675   2    1000025    5
    0.041207818   2    1000022    5

DECAY 2000002  152.6174
    0.92661602   2    1000021    2
    0.064213973   2    1000022    2
    0.0050467835   2    1000023    2
    0.0041231637   2    1000025    2

DECAY 1000002  191.51519
    0.74052405   2    1000021    2
    0.16971551   2    1000037    1
    0.084989332   2    1000035    2
    0.0031633989   2    1000022    2
    0.00085640706   2    1000024    1
    0.00072844981   2    1000023    2

DECAY 2000004  152.62106
    0.92659409   2    1000021    4
    0.064212441   2    1000022    4
    0.0050524487   2    1000023    4
    0.0041291076   2    1000025    4

DECAY 1000004  191.53626
    0.74044575   2    1000021    4
    0.1696972   2    1000037    3
    0.084980141   2    1000035    4
    0.0031630567   2    1000022    4
    0.00095319046   2    1000024    3
    0.00073298971   2    1000023    4

DECAY 1000006  32.823332
    0.35432365   2    1000024    5
    0.33518119   2    1000025    6
    0.30043403   2    1000023    6
    0.0078939116   2    1000022    6
    0.0017597159   2    1000022    4
    0.0003951694   2    1000023    4

DECAY 2000006  158.43387
    0.25594234   2    2000005    24
    0.21504299   2    1000024    5
    0.14585252   2    1000006    25
    0.14030199   2    1000006    23
    0.11205682   2    1000023    6
    0.1084733   2    1000025    6
    0.02002731   2    1000022    6
    0.0023027324   2    1000005    24

DECAY 1000024  0.036687716
    0.99999806   2    1000022    24

DECAY 1000037  66.862704
    0.15150752   2    1000006   -5
    0.14531706   2   -2000005    6
    0.11235616   2   -1000015    16
    0.11230094   2    1000016   -15
    0.062941107   2    1000025    24
    0.062597506   2    1000024    23
    0.062451955   2    1000023    24
    0.061575216   2    1000024    25
    0.054943178   2    1000012   -11
    0.054941874   2    1000014   -13
    0.054812803   2   -1000011    12
    0.054811523   2   -1000013    14
    0.0031732416   3    1000024    6   -6
    0.0023706405   3    1000025   -5    6
    0.0023190328   3    1000023   -5    6
    0.0010127597   2   -1000005    6
    0.00054162963   2    2000006   -5

DECAY 1000022 -1


DECAY 1000023  0.014700155
    0.99985777   2    1000022    23
    0.00011884936   2    1000022    22

DECAY 1000025  0.020288801
    0.9935859   2    1000022    23
    0.0063770097   2    1000022    25

DECAY 1000035  68.500613
    0.077490675   2    1000006   -6
    0.077490675   2   -1000006    6
    0.075154793   2    2000005   -5
    0.075154793   2   -2000005    5
    0.061419966   2    1000024   -24
    0.061419966   2   -1000024    24
    0.054963196   2    1000016   -16
    0.054963196   2   -1000016    16
    0.054669577   2    1000015   -15
    0.054669577   2   -1000015    15
    0.035893598   2    1000025    23
    0.035022058   2    1000023    25
    0.032521186   2    1000025    25
    0.026886192   2    1000012   -12
    0.026886192   2   -1000012    12
    0.026885555   2    1000014   -14
    0.026885555   2   -1000014    14
    0.026665374   2    1000011   -11
    0.026665374   2   -1000011    11
    0.026664754   2    1000013   -13
    0.026664754   2   -1000013    13
    0.025157142   2    1000023    23
    0.0029728196   3    1000024    5   -6
    0.0029728196   3   -1000024   -5    6
    0.0014193768   3    1000025    6   -6
    0.0013473485   3    1000023    6   -6
    0.00052097594   2    1000005   -5
    0.00052097594   2   -1000005    5

DECAY 1000021  299.4939
    0.12971336   2    1000006   -6
    0.12971336   2   -1000006    6
    0.12538315   2    1000005   -5
    0.12538315   2   -1000005    5
    0.12057208   2    2000005   -5
    0.12057208   2   -2000005    5
    0.069687114   2    2000006   -6
    0.069687114   2   -2000006    6
    0.054580187   2    1000006   -4
    0.054580187   2   -1000006    4

DECAY 25  0.0039288631
    0.5583003   2   -5    5
    0.18158696   2   -24    24
    0.067656222   2    21    21
    0.064038908   2   -15    15
    0.04000492   2    1000022    1000023
    0.035868546   2    1000022    1000022
    0.027609278   2   -4    4
    0.021106118   2    23    23
    0.002167648   2    22    22
    0.0012285359   2    22    23
    0.00022216157   2   -13    13
    0.00020967768   2   -3    3
    5.7973754e-07   2   -1    1
    1.4228321e-07   2   -2    2
    4.9944632e-09   2   -11    11

DECAY 35  134.63612
    0.64511669   2   -5    5
    0.10841784   2   -15    15
    0.059554594   2   -1000024    1000037
    0.059554594   2   -1000037    1000024
    0.028318378   2    1000025    1000035
    0.023731305   2    1000023    1000035
    0.013461639   2   -2000005    1000005
    0.013461639   2   -1000005    2000005
    0.0088223103   2    1000022    1000023
    0.0086115208   2    1000022    1000025
    0.0076803842   2    1000022    1000035
    0.007127569   2    1000022    1000022
    0.0034006715   2    1000023    1000025
    0.0029760087   2   -2000015    1000015
    0.0029760087   2   -1000015    2000015
    0.0024773857   2    1000025    1000025
    0.0010985822   2    1000023    1000023
    0.0008295706   2   -1000024    1000024
    0.00063725892   2   -6    6
    0.00049694782   2   -2000005    2000005
    0.0004929212   2   -1000005    1000005
    0.00036276514   2   -13    13
    0.00020883787   2   -3    3
    7.0963615e-05   2   -2000006    1000006
    7.0963615e-05   2   -1000006    2000006
    3.3953333e-05   2   -1000006    1000006
    4.9729601e-06   2    21    21
    2.1552744e-06   2   -2000006    2000006
    5.7736197e-07   2   -1    1
    4.3476016e-07   2    25    25
    1.0716898e-07   2    23    23
    9.714675e-08   2   -1000015    1000015
    2.5537934e-08   2   -24    24
    2.3679478e-08   2   -1000011    1000011
    2.3463184e-08   2   -1000013    1000013
    8.1469472e-09   2   -11    11
    7.97637e-09   2   -4    4
    4.8253804e-09   2   -2000011    2000011
    4.7713285e-09   2   -2000013    2000013
    2.0836802e-09   2    22    23
    8.1868415e-10   2    22    22
    5.5979722e-11   2   -2000013    1000013
    5.5979722e-11   2   -1000013    2000013
    4.1113711e-14   2   -2    2
    1.3093719e-15   2   -2000011    1000011
    1.3093719e-15   2   -1000011    2000011

DECAY 36  126.32555
    0.63106213   2   -5    5
    0.10605597   2   -15    15
    0.063568767   2   -1000024    1000037
    0.063568767   2   -1000037    1000024
    0.030610031   2    1000023    1000035
    0.024949689   2    1000025    1000035
    0.014873204   2   -2000005    1000005
    0.014873204   2   -1000005    2000005
    0.010507686   2    1000022    1000023
    0.0081989356   2    1000022    1000035
    0.0081279775   2    1000022    1000025
    0.0076315748   2    1000022    1000022
    0.0036723796   2    1000023    1000025
    0.0031719131   2   -2000015    1000015
    0.0031719131   2   -1000015    2000015
    0.0024008205   2    1000025    1000025
    0.001297384   2    1000023    1000023
    0.00089496948   2   -1000024    1000024
    0.00060827088   2   -6    6
    0.00035485933   2   -13    13
    0.00020427111   2   -3    3
    9.2237365e-05   2   -2000006    1000006
    9.2237365e-05   2   -1000006    2000006
    9.9562756e-06   2    21    21
    5.647372e-07   2   -1    1
    2.1756587e-07   2    23    25
    2.6707058e-08   2    22    23
    2.5221472e-08   2    22    22
    7.9694419e-09   2   -11    11
    7.5152725e-09   2   -4    4
    5.9356475e-11   2   -2000013    1000013
    5.9356475e-11   2   -1000013    2000013
    7.4361753e-13   2    23    35
    3.8737382e-14   2   -2    2
    1.3883541e-15   2   -2000011    1000011
    1.3883541e-15   2   -1000011    2000011
    7.1325366e-42   2    25    25

DECAY 37  132.71635
    0.64605527   2   -5    6
    0.10233681   2   -15    16
    0.060520708   2    1000024    1000035
    0.053298633   2    1000023    1000037
    0.052490609   2    1000025    1000037
    0.027949695   2    1000022    1000024
    0.027147234   2   -1000005    1000006
    0.015610548   2    1000022    1000037
    0.0060466051   2   -2000015    1000016
    0.0032668978   2    1000023    1000024
    0.0023435998   2   -1000005    2000006
    0.0010316778   2    1000024    1000025
    0.00095744143   2   -5    4
    0.00036179708   2   -13    14
    0.0003401358   2   -2000005    1000006
    0.00019448152   2   -3    4
    2.9600937e-05   2   -2000005    2000006
    9.127873e-06   2   -3    2
    6.8371192e-06   2   -5    2
    1.0891703e-06   2   -3    6
    5.3956069e-07   2   -1    2
    2.0699572e-07   2    24    25
    1.9353241e-07   2   -1000015    1000016
    9.4344735e-08   2   -1000011    1000012
    9.4036707e-08   2   -1000013    1000014
    3.6692498e-08   2   -1    6
    2.5585306e-08   2   -1    4
    8.4624714e-09   2   -11    12
    1.1468537e-10   2   -2000013    1000014
    5.11672e-14   2    24    35
    2.6825617e-15   2   -2000011    1000012

DECAY 6  2.43
    1   2    5    24

DECAY 15 -1
