BLOCK SPINFO
   1   SPheno
   2   v4.0.5be

BLOCK SPHENOINFO
   1   2
   2   2

BLOCK MODSEL
   1   0

BLOCK MINPAR
   3    33.136734
   4   -1

BLOCK EXTPAR
   0    3760.7787
   1    2186.761
   2    1667.7873
   3    1271.4341
   11   -4105.3874
   12   -3192.2512
   13   -2070.1023
   23   -1237.2906
   25    31.997731
   26    4202.6111
   31    3547.2547
   32    3547.2547
   33    4037.4891
   34    4381.4007
   35    4381.4007
   36    2296.2756
   41    4671.2506
   42    4671.2506
   43    3458.28
   44    3575.9858
   45    3575.9858
   46    4118.4512
   47    2132.446
   48    2132.446
   49    4730.4729

BLOCK SMINPUTS
   1    127.90897
   2    1.1663787e-05
   3    0.1184
   4    91.1876
   5    4.18
   6    173.2
   7    1.777
   8    0
   11    0.00051099893
   12    0
   13    0.10565837
   14    0
   21    0.005
   22    0.0025
   23    0.095
   24    1.27

BLOCK GAUGE Q=  3760.7787
   1    0.35536298
   2    0.66519887
   3    1.219778

BLOCK YU Q=  3760.7787
   1   1    8.3884657e-06
   2   2    0.0042613406
   3   3    1.013394

BLOCK YD Q=  3760.7787
   1   1    0.000539364
   2   2    0.010247916
   3   3    0.53488008

BLOCK YE Q=  3760.7787
   1   1    9.4122962e-05
   2   2    0.019461643
   3   3    0.32731282

BLOCK AU Q=  3760.7787
   1   1    0
   2   2    0
   3   3   -4105.3901

BLOCK AD Q=  3760.7787
   1   1    0
   2   2    0
   3   3   -3192.2535

BLOCK AE Q=  3760.7787
   1   1    0
   2   2    0
   3   3   -2070.1019

BLOCK MSOFT Q=  3760.7787
   1    2186.761
   2    1667.7873
   3    1271.4341
   21    16251912
   22   -1267695.2
   31    3547.2547
   32    3547.2547
   33    4037.4891
   34    4381.4007
   35    4381.4007
   36    2296.2756
   41    4671.2506
   42    4671.2506
   43    3458.28
   44    3575.9858
   45    3575.9858
   46    4118.4512
   47    2132.446
   48    2132.446
   49    4730.4729

BLOCK MASS
   6    173.2
   23    91.1876
   24    80.429995
   15    1.777
   25    123.28593
   35    4201.54
   36    4202.6111
   37    4202.6516
   1000001    4737.3978
   2000001    2193.1303
   1000002    4736.8151
   2000002    3623.6149
   1000003    4737.394
   2000003    2193.1223
   1000004    4736.8113
   2000004    3623.6141
   1000005    3472.4041
   2000005    4768.3716
   1000006    3464.3034
   2000006    4082.6263
   1000011    3557.9979
   2000011    4390.438
   1000012    3556.7016
   1000013    3557.9798
   2000013    4390.4049
   1000014    3556.6838
   1000015    2302.29
   2000015    4043.038
   1000016    4041.4651
   1000021    1546.0137
   1000022    1251.1683
   1000023   -1259.5749
   1000025    1741.7544
   1000035    2170.1662
   1000024    1253.2693
   1000037    1741.5432

BLOCK ALPHA
      -0.030206394

BLOCK HMIX Q=  3760.7787
   1   -1237.2906
   2    31.997731
   3    242.98806
   4    17661940

BLOCK STOPMIX
   1   1    0.99265638
   1   2    0.12096823
   2   1   -0.12096823
   2   2    0.99265638

BLOCK SBOTMIX
   1   1   -0.99997321
   1   2    0.0073198571
   2   1   -0.0073198571
   2   2   -0.99997321

BLOCK STAUMIX
   1   1   -0.0060243553
   1   2    0.99998185
   2   1   -0.99998185
   2   2   -0.0060243553

BLOCK NMIX
   1   1   -0.032914607
   1   2    0.11181162
   1   3    0.70440145
   1   4    0.70016669
   2   1   -0.0093855223
   2   2    0.019356919
   2   3   -0.70657248
   2   4    0.70731362
   3   1    0.0089542915
   3   2    0.9935281
   3   3   -0.065420195
   3   4   -0.092422527
   4   1    0.99937398
   4   2   -0.0050375837
   4   3    0.017150073
   4   4    0.03053091

BLOCK UMIX
   1   1   -0.093226522
   1   2   -0.99564492
   2   1    0.99564492
   2   2   -0.093226522

BLOCK VMIX
   1   1   -0.13168575
   1   2    0.99129151
   2   1    0.99129151
   2   2    0.13168575

BLOCK HIGGSBOUNDSINPUTHIGGSCOUPLINGSFERMIONS
       0, 1023.8548,3,36,15,15

BLOCK HIGGSBOUNDSINPUTHIGGSCOUPLINGSBOSONS
       0,4,36,21,21,23

BLOCK SPHENOLOWENERGY
   1    0.00033339075
   2    1.5892449e-06
   3    3.5260426e-05
   4    2.3345311e-15
   5    9.9728969e-11
   6    2.0903393e-08
   7    7.8715817e-14
   8    3.3627523e-09
   9    7.1415772e-07
   10    9.6399332e-05
   11    0.9957682
   12    0.54207963
   13    19.366657
   14    0
   15    0
   16    0.0021577717
   17    2.2816634e-15
   18    2.4803015e-11
   19    8.2913761e-11
   20   -1.4074329e-15
   21   -6.017279e-11
   22   -1.3728957e-08
   23    0
   24    0
   25    0
   26    0
   27    0
   28    0
   29    0
   30    0
   31    0
   39    6.4412028e-05
   40    0
   41    0
   42    0

BLOCK FWCOEF Q=  160
   305   4422   0   0   -0.18881911
   305   4422   0   2   -0.20441876
   305   4322   0   2   -0.00025628086
   305   6421   0   0   -0.095227835
   305   6421   0   2   -0.10432735
   305   6321   0   2   -0.00012724013
   3051111   4133   0   0    1.6245959
   3051111   4133   0   2    1.6249778
   3051111   4233   0   2    0.00025627279
   3051111   4137   0   0   -4.447288
   3051111   4137   0   2   -4.4464461
   3051111   4237   0   2   -0.001904619
   3051313   4133   0   0    1.6245959
   3051313   4133   0   2    1.6249773
   3051313   4233   0   2    0.00025627261
   3051313   4137   0   0   -4.447288
   3051313   4137   0   2   -4.4464465
   3051313   4237   0   2   -0.0019046194
   3051212   4137   0   0    1.5053501
   3051212   4137   0   2    1.505172
   3051212   4237   0   2    0.0004120441
   3051414   4137   0   0    1.5053501
   3051414   4137   0   2    1.505172
   3051414   4237   0   2    0.00041204411
   3051616   4137   0   0    1.5053501
   3051616   4137   0   2    1.505172
   3051616   4237   0   2    0.00041204666

BLOCK IMFWCOEF Q=  160
   305   4422   0   0    3.8578841e-07
   305   4422   0   2   -1.7036579e-05
   305   4322   0   2   -3.2513533e-06
   305   6421   0   0    3.3045329e-07
   305   6421   0   2    2.5268058e-05
   305   6321   0   2   -4.9271687e-07
   3051111   4133   0   2    6.2071416e-07
   3051111   4233   0   2    4.8635021e-06
   3051111   4137   0   2   -1.7263387e-06
   3051111   4237   0   2   -3.614385e-05
   3051313   4133   0   2    6.2070345e-07
   3051313   4233   0   2    4.8634998e-06
   3051313   4137   0   2   -1.7263331e-06
   3051313   4237   0   2   -3.6143859e-05
   3051212   4137   0   2    4.450764e-07
   3051212   4237   0   2    7.8193384e-06
   3051414   4137   0   2    4.4507638e-07
   3051414   4237   0   2    7.8193384e-06
   3051616   4137   0   2    4.4510905e-07
   3051616   4237   0   2    7.8193386e-06

DECAY 23  2.4952


DECAY 24  2.085


DECAY 1000011  29.022483
    0.61860891   2   -1000037    12
    0.31091604   2    1000025    11
    0.059513959   2    1000035    11
    0.0071967079   2   -1000024    12
    0.0036794476   2    1000022    11

DECAY 2000011  12.604701
    0.99816981   2    1000035    11
    0.0016006468   2    1000022    11
    0.00012986097   2    1000023    11

DECAY 1000013  29.042665
    0.61817192   2   -1000037    14
    0.31069862   2    1000025    13
    0.059471698   2    1000035    13
    0.0071916495   2   -1000024    14
    0.0040286648   2    1000022    13
    0.00043744277   2    1000023    13

DECAY 2000013  12.660672
    0.99374026   2    1000035    13
    0.0026880478   2    1000022    13
    0.0021853821   2   -1000024    14
    0.0012278619   2    1000023    13
    0.00010713231   2    1000025    13

DECAY 1000015  4.9885877
    0.48396611   2   -1000024    16
    0.24441536   2    1000022    15
    0.24104788   2    1000023    15
    0.028771845   2    1000035    15
    0.0011821212   2   -1000037    16
    0.00061669003   2    1000025    15

DECAY 2000015  45.592938
    0.51358248   2   -1000037    16
    0.25866272   2    1000025    15
    0.079275597   2    1000022    15
    0.077040371   2    1000023    15
    0.055373464   2    1000035    15
    0.0054975192   2    1000015    23
    0.0053699757   2    1000015    25
    0.0051978767   2   -1000024    16

DECAY 1000012  29.042742
    0.61227862   2    1000037    11
    0.30452157   2    1000025    12
    0.061684238   2    1000035    12
    0.014341083   2    1000024    11
    0.0069296022   2    1000022    12
    0.00024488243   2    1000023    12

DECAY 1000014  29.062921
    0.6118511   2    1000037    13
    0.3043067   2    1000025    14
    0.061640371   2    1000035    14
    0.015032384   2    1000024    13
    0.0069247367   2    1000022    14
    0.00024471048   2    1000023    14

DECAY 1000016  45.611369
    0.5093194   2    1000037    15
    0.25279443   2    1000025    16
    0.16401503   2    1000024    15
    0.057367504   2    1000035    16
    0.010976613   2    1000015    24
    0.0053381999   2    1000022    16
    0.00018882407   2    1000023    16

DECAY 2000001  43.811542
    0.99997244   2    1000021    1

DECAY 1000001  345.806
    0.86329159   2    1000021    1
    0.089421002   2   -1000037    2
    0.044374435   2    1000025    1
    0.0012607575   2    1000035    1
    0.000906581   2   -1000024    2
    0.00072257297   2    1000022    1

DECAY 2000003  43.814872
    0.99987844   2    1000021    3

DECAY 1000003  345.81586
    0.86326597   2    1000021    3
    0.08941842   2   -1000037    4
    0.044373199   2    1000025    3
    0.0012607244   2    1000035    3
    0.00091073949   2   -1000024    4
    0.00073481223   2    1000022    3

DECAY 1000005  270.15687
    0.65217631   2    1000021    5
    0.19368869   2   -1000024    6
    0.066415078   2   -1000037    6
    0.031309612   2    1000025    5
    0.02815248   2    1000022    5
    0.027549697   2    1000023    5
    0.00070813531   2    1000035    5

DECAY 2000005  350.98766
    0.85875901   2    1000021    5
    0.066161174   2   -1000024    6
    0.033419801   2    1000023    5
    0.033194855   2    1000022    5
    0.0047814041   2    1000035    5
    0.0011613065   2    1000006   -24
    0.0010343383   2    1000005    25
    0.00060631361   2   -1000037    6
    0.00057901587   2    1000005    23
    0.00029971035   2    1000025    5

DECAY 2000002  194.70341
    0.98288758   2    1000021    2
    0.017072691   2    1000035    2

DECAY 1000002  345.78703
    0.86318213   2    1000021    2
    0.088627878   2    1000037    1
    0.044653741   2    1000025    2
    0.0018087392   2    1000024    1
    0.0011255315   2    1000035    2
    0.00058569058   2    1000022    2

DECAY 2000004  194.70526
    0.98287738   2    1000021    4
    0.017072516   2    1000035    4

DECAY 1000004  345.79656
    0.86315716   2    1000021    4
    0.088625498   2    1000037    3
    0.044652494   2    1000025    4
    0.0018331694   2    1000024    3
    0.0011255   2    1000035    4
    0.00058776116   2    1000022    4

DECAY 1000006  354.22836
    0.49783298   2    1000021    6
    0.2319067   2    1000021    4
    0.074287468   2    1000022    6
    0.074251037   2    1000023    6
    0.047494801   2    1000024    5
    0.044538249   2    1000037    5
    0.023675794   2    1000025    6
    0.0053124605   3    1000022    24    5
    0.0005246182   2    1000035    6
    0.00017114669   2    1000022    4

DECAY 2000006  405.50552
    0.57501776   2    1000021    6
    0.16062001   2    1000024    5
    0.084122147   2    1000023    6
    0.081245007   2    1000022    6
    0.034431266   2    1000005    24
    0.026339638   2    1000006    25
    0.017474271   2    1000006    23
    0.01170082   2    1000035    6
    0.0060419793   2    1000037    5
    0.0030071027   2    1000025    6

DECAY 1000024  2.9338329e-11
    0.55976596   3    1000022   -1    2
    0.18659711   3    1000022   -11    12
    0.18409333   3    1000022   -13    14
    0.068865148   3    1000022   -3    4
    0.0006784664   3    1000022   -15    16

DECAY 1000037  10.055289
    0.26203764   2    1000023    24
    0.24546883   2    1000022    24
    0.24474757   2    1000024    23
    0.24104686   2    1000024    25
    0.0030949155   3    1000023   -5    6
    0.0025549875   3    1000022   -5    6
    0.0010481586   3    1000024    6   -6

DECAY 1000022 -1


DECAY 1000023  3.6845203e-07
    0.47010084   2    1000022    22
    0.07931796   3    1000022    12   -12
    0.059312286   3    1000022    1   -1
    0.059224328   3    1000022    3   -3
    0.046258352   3    1000022    2   -2
    0.040071759   3    1000024    1   -2
    0.040071759   3   -1000024   -1    2
    0.034045325   3    1000022    4   -4
    0.033084352   3    1000024    3   -4
    0.033084352   3   -1000024   -3    4
    0.013385096   3    1000022    11   -11
    0.013357266   3    1000024    11   -12
    0.013357266   3   -1000024   -11    12
    0.013353845   3    1000022    13   -13
    0.013339058   3    1000024    13   -14
    0.013339058   3   -1000024   -13    14
    0.0092322744   3    1000024    15   -16
    0.0092322744   3   -1000024   -15    16
    0.0068289535   3    1000022    15   -15

DECAY 1000025  12.756036
    0.21155777   2    1000023    25
    0.20017862   2    1000023    23
    0.19887741   2    1000024   -24
    0.19887741   2   -1000024    24
    0.1801815   2    1000022    25
    0.0058164001   2    1000022    23
    0.00201781   3    1000024    5   -6
    0.00201781   3   -1000024   -5    6
    0.00022738504   3    1000023    6   -6
    0.00022205038   3    1000022    6   -6

DECAY 1000035  5.9712936
    0.20107876   2    1000023    25
    0.19566184   2    1000023    23
    0.19296598   2    1000024   -24
    0.19296598   2   -1000024    24
    0.1718367   2    1000022    25
    0.015177038   2    1000022    23
    0.0054334688   2    1000025    25
    0.0049500072   2    1000037   -24
    0.0049500072   2   -1000037    24
    0.0046876941   3    1000024    5   -6
    0.0046876941   3   -1000024   -5    6
    0.0026615931   3    1000023    6   -6
    0.0023608305   3    1000022    6   -6
    0.00014394539   3    1000021    3   -3
    0.00014393101   3    1000021    1   -1

DECAY 1000021  8.0873154e-06
    0.36097559   2    1000022    21
    0.30267042   2    1000023    21
    0.10076881   3    1000022    5   -5
    0.085574205   3    1000023    5   -5
    0.071695254   3    1000024    5   -6
    0.071695254   3   -1000024   -5    6
    0.0010917909   3    1000024    3   -4
    0.0010917909   3   -1000024   -3    4
    0.00097762645   3    1000022    3   -3
    0.00079312874   3    1000024    1   -2
    0.00079312874   3   -1000024   -1    2
    0.00067317504   3    1000022    1   -1
    0.00042219303   3    1000022    4   -4
    0.00041875635   3    1000022    2   -2
    0.00029896791   3    1000023    3   -3

DECAY 25  0.0036612174
    0.59844749   2   -5    5
    0.20153888   2   -24    24
    0.073875185   2    21    21
    0.068740245   2   -15    15
    0.029661305   2   -4    4
    0.023572096   2    23    23
    0.0023443438   2    22    22
    0.0013562595   2    22    23
    0.00023841354   2   -13    13
    0.00022500277   2   -3    3
    6.221106e-07   2   -1    1
    1.5285717e-07   2   -2    2
    5.3598233e-09   2   -11    11

DECAY 35  84.22473
    0.54705371   2   -5    5
    0.10597044   2   -1000024    1000037
    0.10597044   2   -1000037    1000024
    0.10366847   2   -15    15
    0.066545979   2    1000023    1000025
    0.037993234   2    1000022    1000025
    0.014947366   2    1000023    1000035
    0.0059093256   2    1000022    1000035
    0.0047038682   2   -1000024    1000024
    0.0022565972   2    1000022    1000022
    0.0017070457   2   -6    6
    0.0010473152   2   -1000037    1000037
    0.001007993   2    1000022    1000023
    0.00051423332   2    1000025    1000025
    0.00035845654   2   -13    13
    0.000235334   2   -3    3
    6.3280807e-05   2    1000023    1000023
    4.0832007e-05   2    1000025    1000035
    2.5615191e-06   2    25    25
    2.5438787e-06   2    21    21
    6.5067726e-07   2   -1    1
    1.8229339e-07   2    23    23
    5.9297292e-08   2    22    23
    3.6391016e-08   2   -24    24
    2.3127057e-08   2   -4    4
    1.8565506e-08   2    22    22
    8.049836e-09   2   -11    11
    1.1920784e-13   2   -2    2

DECAY 36  81.324988
    0.53657459   2   -5    5
    0.10811365   2   -1000024    1000037
    0.10811365   2   -1000037    1000024
    0.10168496   2   -15    15
    0.06620036   2    1000022    1000025
    0.040801003   2    1000023    1000025
    0.015225857   2    1000022    1000035
    0.0068061989   2   -1000024    1000024
    0.0061729654   2    1000023    1000035
    0.0031538205   2    1000022    1000022
    0.0025244321   2   -1000037    1000037
    0.0016445722   2   -6    6
    0.0012403919   2    1000025    1000025
    0.00081333123   2    1000022    1000023
    0.00035159784   2   -13    13
    0.00023082728   2   -3    3
    0.00022538682   2    1000025    1000035
    0.00011343555   2    1000023    1000023
    7.8448853e-06   2    21    21
    6.3821821e-07   2   -1    1
    4.2087303e-07   2    23    25
    3.8078384e-08   2    22    23
    2.2095261e-08   2   -4    4
    7.8959097e-09   2   -11    11
    5.0533925e-09   2    22    22
    1.1389172e-13   2   -2    2
    1.905574e-14   2    23    35
    1.254898e-36   2    25    25

DECAY 37  82.658183
    0.53359384   2   -5    6
    0.11164834   2   -15    16
    0.11113828   2    1000024    1000025
    0.11104345   2    1000022    1000037
    0.10857133   2    1000023    1000037
    0.020339555   2    1000024    1000035
    0.0019796489   2    1000023    1000024
    0.00078920026   2   -5    4
    0.00039471662   2   -13    14
    0.00026110353   2    1000035    1000037
    0.00021901495   2   -3    4
    1.0295515e-05   2   -3    2
    5.6357032e-06   2   -5    2
    2.8406991e-06   2   -3    6
    1.4955752e-06   2    1000022    1000024
    6.0777505e-07   2   -1    2
    4.1422753e-07   2    24    25
    1.1531136e-07   2   -1    6
    7.2765957e-08   2    1000025    1000037
    2.9540132e-08   2   -1    4
    9.2324628e-09   2   -11    12
    2.7965096e-14   2    24    35

DECAY 6  2.43
    1   2    5    24

DECAY 15 -1
