BLOCK SPINFO
   1   SPheno
   2   v4.0.5be

BLOCK SPHENOINFO
   1   2
   2   2

BLOCK MODSEL
   1   0

BLOCK MINPAR
   3    14.17612
   4    1

BLOCK EXTPAR
   0    4053.8343
   1   -1888.7967
   2   -1585.8895
   3    4000
   11    5810.5133
   12   -1126.5112
   13   -456.73877
   23    289.19898
   25    13.477172
   26    2000
   31    1864.9248
   32    1864.9248
   33    2000
   34    1100.7655
   35    1100.7655
   36    2000
   41    4000
   42    4000
   43    4000
   44    4000
   45    4000
   46    4000
   47    4000
   48    4000
   49    4000

BLOCK SMINPUTS
   1    127.90897
   2    1.1663787e-05
   3    0.1184
   4    91.1876
   5    4.18
   6    173.2
   7    1.777
   8    0
   11    0.00051099893
   12    0
   13    0.10565837
   14    0
   21    0.005
   22    0.0025
   23    0.095
   24    1.27

BLOCK GAUGE Q=  4053.8343
   1    0.35536298
   2    0.66519887
   3    1.219778

BLOCK YU Q=  4053.8343
   1   1    8.4074208e-06
   2   2    0.0042709698
   3   3    1.015684

BLOCK YD Q=  4053.8343
   1   1    0.00022768888
   2   2    0.0043260886
   3   3    0.22579602

BLOCK YE Q=  4053.8343
   1   1    3.9733374e-05
   2   2    0.0082156015
   3   3    0.1381729

BLOCK AU Q=  4053.8343
   1   1    0
   2   2    0
   3   3    5810.5133

BLOCK AD Q=  4053.8343
   1   1    0
   2   2    0
   3   3   -1126.5112

BLOCK AE Q=  4053.8343
   1   1    0
   2   2    0
   3   3   -456.73877

BLOCK MSOFT Q=  4053.8343
   1   -1888.7967
   2   -1585.8895
   3    4000
   21    3855635.2
   22    252255.19
   31    1864.9248
   32    1864.9248
   33    2000
   34    1100.7655
   35    1100.7655
   36    2000
   41    4000
   42    4000
   43    4000
   44    4000
   45    4000
   46    4000
   47    4000
   48    4000
   49    4000

BLOCK MASS
   6    173.2
   23    91.1876
   24    80.429995
   15    1.777
   25    125.24014
   35    2000.0185
   36    2000
   37    2001.8505
   1000001    4157.9513
   2000001    4143.909
   1000002    4157.196
   2000002    4143.9367
   1000003    4157.9503
   2000003    4143.9079
   1000004    4157.1951
   2000004    4143.9359
   1000005    4091.2305
   2000005    4141.188
   1000006    3957.966
   2000006    4152.0247
   1000011    1885.401
   2000011    1125.9102
   1000012    1883.333
   1000013    1885.3979
   2000013    1125.9012
   1000014    1883.3297
   1000015    2012.3876
   2000015    2018.4957
   1000016    2015.8682
   1000021    4249.2415
   1000022   -303.46565
   1000023    308.47938
   1000025   -1640.6041
   1000035   -1858.0112
   1000024    306.06608
   1000037    1640.6842
   1000039    1e-09

BLOCK ALPHA
      -0.070818835

BLOCK HMIX Q=  4053.8343
   1    289.19898
   2    13.477172
   3    242.92167
   4    4000000

BLOCK STOPMIX
   1   1   -0.56631387
   1   2    0.82418966
   2   1   -0.82418966
   2   2   -0.56631387

BLOCK SBOTMIX
   1   1    0.99967992
   1   2    0.025299215
   2   1   -0.025299215
   2   2    0.99967992

BLOCK STAUMIX
   1   1    0.33752053
   1   2    0.94131817
   2   1   -0.94131817
   2   2    0.33752053

BLOCK NMIX
   1   1   -0.018521723
   1   2    0.038481497
   1   3   -0.70988907
   1   4   -0.70301751
   2   1    0.015496712
   2   2   -0.031097871
   2   3   -0.70428906
   2   4    0.70906255
   3   1    0.0089839486
   3   2    0.99874499
   3   3    0.0054047201
   3   4    0.048974673
   4   1   -0.99966799
   4   2    0.0077805985
   4   3    0.0022835181
   4   4    0.02445734

BLOCK UMIX
   1   1   -0.0077139641
   1   2    0.99997025
   2   1   -0.99997025
   2   2   -0.0077139641

BLOCK VMIX
   1   1    0.06971128
   1   2    0.99756721
   2   1    0.99756721
   2   2   -0.06971128

BLOCK HIGGSBOUNDSINPUTHIGGSCOUPLINGSFERMIONS
       0, 181.63417,3,36,15,15

BLOCK HIGGSBOUNDSINPUTHIGGSCOUPLINGSBOSONS
       0,4,36,21,21,23

BLOCK SPHENOLOWENERGY
   1    0.00033521377
   2    1.5889896e-06
   3    3.5260481e-05
   4    2.4884521e-15
   5    1.0630388e-10
   6    2.2255137e-08
   7    8.3644888e-14
   8    3.5733078e-09
   9    7.5798208e-07
   10    9.649449e-05
   11    0.99675114
   12    0.54206198
   13    19.36672
   14    0
   15    0
   16    0.0021576157
   17    2.2816535e-15
   18    2.4803492e-11
   19    8.29147e-11
   20   -1.13928e-15
   21   -4.8707926e-11
   22   -1.2498608e-08
   23    0
   24    0
   25    0
   26    0
   27    0
   28    0
   29    0
   30    0
   31    0
   39    1.9931062e-05
   40    0
   41    0
   42    0

BLOCK FWCOEF Q=  160
   305   4422   0   0   -0.18881911
   305   4422   0   2   -0.20426374
   305   4322   0   2   -0.00030592424
   305   6421   0   0   -0.095227835
   305   6421   0   2   -0.11281935
   305   6321   0   2   -0.00034708207
   3051111   4133   0   0    1.6267327
   3051111   4133   0   2    1.6270076
   3051111   4233   0   2    3.3291272e-05
   3051111   4137   0   0   -4.4494248
   3051111   4137   0   2   -4.4485175
   3051111   4237   0   2   -0.00024635617
   3051313   4133   0   0    1.6267327
   3051313   4133   0   2    1.6270074
   3051313   4233   0   2    3.3291243e-05
   3051313   4137   0   0   -4.4494248
   3051313   4137   0   2   -4.4485176
   3051313   4237   0   2   -0.00024635617
   3051212   4137   0   0    1.5053501
   3051212   4137   0   2    1.5051588
   3051212   4237   0   2    5.327097e-05
   3051414   4137   0   0    1.5053501
   3051414   4137   0   2    1.5051588
   3051414   4237   0   2    5.3270974e-05
   3051616   4137   0   0    1.5053501
   3051616   4137   0   2    1.5051588
   3051616   4237   0   2    5.3272219e-05

BLOCK IMFWCOEF Q=  160
   305   4422   0   0    3.8581783e-07
   305   4422   0   2   -2.1978759e-06
   305   4322   0   2   -9.1453717e-07
   305   6421   0   0    3.3047849e-07
   305   6421   0   2   -3.5770347e-06
   305   6321   0   2   -4.7230204e-07
   3051111   4133   0   2    2.7950205e-07
   3051111   4233   0   2    7.7025464e-07
   3051111   4137   0   2   -1.831442e-06
   3051111   4237   0   2   -5.7006083e-06
   3051313   4133   0   2    2.795007e-07
   3051313   4233   0   2    7.702545e-07
   3051313   4137   0   2   -1.8314422e-06
   3051313   4237   0   2   -5.7006087e-06
   3051212   4137   0   2    4.8404946e-07
   3051212   4237   0   2    1.2326743e-06
   3051414   4137   0   2    4.8404944e-07
   3051414   4237   0   2    1.2326743e-06
   3051616   4137   0   2    4.8438984e-07
   3051616   4237   0   2    1.2326743e-06

DECAY 23  2.4952


DECAY 24  2.085


DECAY 2000011  0.0028334307
    0.58905189   2    1000022    11
    0.41020566   2    1000023    11
    0.00073174343   2    1000039    11

DECAY 1000011  1.4841053
    0.65893793   2   -1000037    12
    0.33203067   2    1000025    11
    0.0043358736   2    1000022    11
    0.0027578929   2    1000023    11
    0.0012883815   2    1000035    11
    0.00063085688   2   -1000024    12

DECAY 2000013  0.0054266687
    0.42827384   2    1000022    13
    0.33241553   2    1000023    13
    0.23892858   2   -1000024    14
    0.00038205047   2    1000039    13

DECAY 1000013  1.4864915
    0.65786582   2   -1000037    14
    0.33149044   2    1000025    13
    0.0051432053   2    1000022    13
    0.0035536683   2    1000023    13
    0.0012860206   2    1000035    13
    0.00062984306   2   -1000024    14

DECAY 1000015  1.9496059
    0.34036887   2   -1000024    16
    0.21836673   2    1000022    15
    0.16429234   2    1000023    15
    0.11533076   2   -1000037    16
    0.10345429   2    1000035    15
    0.058167614   2    1000025    15

DECAY 2000015  3.6050443
    0.5033881   2   -1000037    16
    0.25358276   2    1000025    15
    0.11396609   2    1000023    15
    0.089108757   2    1000022    15
    0.021361668   2    1000035    15
    0.018581973   2   -1000024    16

DECAY 1000012  1.5438619
    0.62109766   2    1000037    11
    0.3084877   2    1000025    12
    0.049466369   2    1000024    11
    0.011921624   2    1000022    12
    0.0078845238   2    1000023    12
    0.0011245336   2    1000035    12

DECAY 1000014  1.546225
    0.62013385   2    1000037    13
    0.30800905   2    1000025    14
    0.050941171   2    1000024    13
    0.011903382   2    1000022    14
    0.0078724591   2    1000023    14
    0.0011225315   2    1000035    14

DECAY 1000016  3.917129
    0.51378892   2    1000037    15
    0.25513664   2    1000025    16
    0.20759301   2    1000024    15
    0.015058617   2    1000035    16
    0.0050634948   2    1000022    16
    0.003349584   2    1000023    16

DECAY 2000001  1.4787083
    0.998055   2    1000035    1
    0.0009469372   2    1000039    1
    0.00053242512   2    1000022    1
    0.0003729893   2    1000023    1

DECAY 1000001  39.522921
    0.66013125   2   -1000037    2
    0.32821512   2    1000025    1
    0.010238289   2    1000035    1
    0.00079975128   2    1000022    1
    0.00052503877   2    1000023    1

DECAY 2000003  1.4817512
    0.99600488   2    1000035    3
    0.0010490031   2    1000022    3
    0.0010298608   2   -1000024    4
    0.00094499133   2    1000039    3
    0.00088159202   2    1000023    3

DECAY 1000003  39.525922
    0.66008098   2   -1000037    4
    0.32819007   2    1000025    3
    0.010237507   2    1000035    3
    0.00081916237   2    1000022    3
    0.00054416156   2    1000023    3

DECAY 1000005  127.12955
    0.64714019   2   -1000024    6
    0.20228273   2   -1000037    6
    0.099111021   2    1000025    5
    0.016629344   2    1000022    5
    0.016073842   2    1000023    5
    0.015669472   2    1000006   -24
    0.0030830635   2    1000035    5

DECAY 2000005  9.8546979
    0.42532576   2   -1000024    6
    0.21105059   2    1000022    5
    0.21037133   2    1000023    5
    0.14953433   2    1000035    5
    0.0020732591   2   -1000037    6
    0.0010301593   2    1000025    5
    0.00047295341   2    1000006   -24
    0.00014162251   2    1000039    5

DECAY 2000002  5.910678
    0.99877003   2    1000035    2
    0.00053136184   2    1000022    2
    0.0003718355   2    1000023    2
    0.00023690865   2    1000039    2

DECAY 1000002  39.562028
    0.65610577   2    1000037    1
    0.32989415   2    1000025    2
    0.0085834877   2    1000035    2
    0.0044468332   2    1000024    1
    0.00056644368   2    1000022    2
    0.00036734781   2    1000023    2

DECAY 2000004  5.9136438
    0.99826821   2    1000035    4
    0.000655458   2    1000022    4
    0.0004981101   2    1000023    4
    0.00025030764   2    1000024    3
    0.0002367895   2    1000039    4

DECAY 1000004  39.565024
    0.65605583   2    1000037    3
    0.32986891   2    1000025    4
    0.0085828541   2    1000035    4
    0.0044850907   2    1000024    3
    0.00058505574   2    1000022    4
    0.0003862885   2    1000023    4

DECAY 1000006  153.21682
    0.38505568   2    1000024    5
    0.27036169   2    1000023    6
    0.2673586   2    1000022    6
    0.035518177   2    1000037    5
    0.022082246   2    1000035    6
    0.017935757   2    1000025    6
    0.0016766463   3    1000022    24    5

DECAY 2000006  143.76712
    0.28504565   2    1000023    6
    0.27872888   2    1000022    6
    0.18268417   2    1000024    5
    0.14098125   2    1000037    5
    0.07055802   2    1000025    6
    0.019307017   2    1000006    23
    0.017499441   2    1000035    6
    0.0051857945   2    1000006    25

DECAY 1000024  1.494114e-09
    0.77745646   2    1000039    24
    0.11145505   3    1000022   -1    2
    0.037152352   3    1000022   -11    12
    0.036848647   3    1000022   -13    14
    0.034176453   3    1000022   -3    4
    0.0029110468   3    1000022   -15    16

DECAY 1000037  13.647335
    0.24642305   2    1000024    25
    0.24416472   2    1000023    24
    0.24211453   2    1000024    23
    0.24048049   2    1000022    24
    0.010036248   3    1000024    6   -6
    0.0088680818   3    1000022   -5    6
    0.0078536833   3    1000023   -5    6

DECAY 1000022  8.2307828e-10
    0.52057253   2    1000039    23
    0.47941592   2    1000039    25

DECAY 1000023  2.9453474e-08
    0.68973409   2    1000022    22
    0.074224794   3    1000022    12   -12
    0.055503565   3    1000022    1   -1
    0.055271858   3    1000022    3   -3
    0.043287839   3    1000022    2   -2
    0.021819173   2    1000039    23
    0.017463971   3    1000022    4   -4
    0.01252552   3    1000022    11   -11
    0.01244337   3    1000022    13   -13
    0.011427279   2    1000039    25
    0.0013039352   3    1000022    15   -15
    0.0012961575   3    1000024    1   -2
    0.0012961575   3   -1000024   -1    2
    0.0004320659   3    1000024    11   -12
    0.0004320659   3   -1000024   -11    12
    0.00042796752   3    1000024    13   -14
    0.00042796752   3   -1000024   -13    14
    0.00032190231   3    1000024    3   -4
    0.00032190231   3   -1000024   -3    4

DECAY 1000025  15.192745
    0.22161819   2    1000024   -24
    0.22161819   2   -1000024    24
    0.18037988   2    1000023    25
    0.13255029   2    1000022    25
    0.13227433   2    1000023    23
    0.083672081   2    1000022    23
    0.0092518038   3    1000024    5   -6
    0.0092518038   3   -1000024   -5    6
    0.0049319557   3    1000023    6   -6
    0.0043424157   3    1000022    6   -6

DECAY 1000035  12.682825
    0.14728208   2    2000013   -13
    0.14728208   2   -2000013    13
    0.14727934   2    2000011   -11
    0.14727934   2   -2000011    11
    0.089263514   2    1000024   -24
    0.089263514   2   -1000024    24
    0.070811319   2    1000023    25
    0.056958374   2    1000023    23
    0.05205723   2    1000022    25
    0.038569712   2    1000022    23
    0.0037858451   3    1000024    5   -6
    0.0037858451   3   -1000024   -5    6
    0.0024049074   3    1000023    6   -6
    0.0021336456   3    1000022    6   -6
    0.00061269937   2    1000037   -24
    0.00061269937   2   -1000037    24
    0.00052091842   2    1000025    25

DECAY 1000021  6.525801
    0.21553649   2    1000006   -6
    0.21553649   2   -1000006    6
    0.051251974   2    1000005   -5
    0.051251974   2   -1000005    5
    0.027180241   3    1000023    6   -6
    0.026574793   3    1000022    6   -6
    0.024326641   2    2000005   -5
    0.024326641   2   -2000005    5
    0.02310345   2    2000003   -3
    0.02310345   2   -2000003    3
    0.023102983   2    2000001   -1
    0.023102983   2   -2000001    1
    0.023090968   2    2000002   -2
    0.023090968   2   -2000002    2
    0.023089703   2    2000004   -4
    0.023089703   2   -2000004    4
    0.017697911   2    1000002   -2
    0.017697911   2   -1000002    2
    0.017696605   2    1000004   -4
    0.017696605   2   -1000004    4
    0.017412154   2    1000003   -3
    0.017412154   2   -1000003    3
    0.017411809   2    1000001   -1
    0.017411809   2   -1000001    1
    0.0076714249   3    1000024    5   -6
    0.0076714249   3   -1000024   -5    6
    0.0050281314   3    1000025    6   -6
    0.0043258036   3    1000037    5   -6
    0.0043258036   3   -1000037   -5    6
    0.0029389394   2    1000006   -4
    0.0029389394   2   -1000006    4
    0.0013546132   2    1000022    21
    0.0013079419   2    1000023    21
    0.00099181688   3    1000035    6   -6
    0.00024326289   2    1000039    21

DECAY 25  0.0039210856
    0.56995609   2   -5    5
    0.23181953   2   -24    24
    0.072165271   2    21    21
    0.065595619   2   -15    15
    0.028196229   2    23    23
    0.027979564   2   -4    4
    0.002333093   2    22    22
    0.0015123248   2    22    23
    0.00022748896   2   -13    13
    0.000214045   2   -3    3
    5.918121e-07   2   -1    1
    1.4418426e-07   2   -2    2
    5.1142014e-09   2   -11    11

DECAY 35  7.9191346
    0.58151413   2   -5    5
    0.10371558   2   -15    15
    0.084221352   2   -1000024    1000037
    0.084221352   2   -1000037    1000024
    0.064952865   2    1000023    1000025
    0.048492304   2   -6    6
    0.018427427   2    1000022    1000025
    0.0097202727   2   -1000024    1000024
    0.0025744097   2    1000022    1000022
    0.0012566117   2    1000023    1000023
    0.00035850391   2   -13    13
    0.00025160846   2    25    25
    0.00022310475   2   -3    3
    3.7532167e-05   2    23    23
    1.9897329e-05   2   -24    24
    8.7206105e-06   2    21    21
    2.9796359e-06   2    1000022    1000023
    6.6656079e-07   2   -4    4
    6.1682548e-07   2   -1    1
    5.3858393e-08   2    22    23
    8.0528086e-09   2   -11    11
    9.9155548e-10   2    22    22
    3.4364285e-12   2   -2    2

DECAY 36  7.8249231
    0.57786648   2   -5    5
    0.10306516   2   -15    15
    0.085155551   2   -1000024    1000037
    0.085155551   2   -1000037    1000024
    0.067797859   2    1000022    1000025
    0.048405801   2   -6    6
    0.017347745   2    1000023    1000025
    0.010397578   2   -1000024    1000024
    0.0021445254   2    1000022    1000022
    0.0018494947   2    1000023    1000023
    0.00035625543   2   -13    13
    0.00022170421   2   -3    3
    0.00010530708   2    1000022    1000023
    7.8306209e-05   2    21    21
    5.123248e-05   2    23    25
    6.437464e-07   2   -4    4
    6.1295391e-07   2   -1    1
    1.3798111e-07   2    22    23
    4.7584109e-08   2    22    22
    8.0023032e-09   2   -11    11
    3.3191842e-12   2   -2    2
    1.149558e-34   2    25    25

DECAY 37  7.6305327
    0.62411897   2   -5    6
    0.10543538   2   -15    16
    0.090765372   2    1000022    1000037
    0.089417493   2    1000024    1000025
    0.087125999   2    1000023    1000037
    0.0010425066   2    1000023    1000024
    0.00084916568   2   -5    4
    0.00051703598   2    1000022    1000024
    0.00037275202   2   -13    14
    0.00020654375   2   -3    4
    7.6247091e-05   2   -3    6
    5.2759541e-05   2    24    25
    9.5958165e-06   2   -3    2
    6.0639146e-06   2   -5    2
    3.4832478e-06   2   -1    6
    5.7121831e-07   2   -1    2
    5.8654359e-08   2   -1    4
    8.7187086e-09   2   -11    12
    3.8690101e-12   2    24    36
    3.6792164e-12   2    24    35

DECAY 6  2.43
    1   2    5    24

DECAY 15 -1


DECAY 1000039 -1
