BLOCK DCINFO
   1   SDECAY/HDECAY
   2   1.3b /3.4

BLOCK SPINFO
   1   SOFTSUSY
   2   3.4.0

BLOCK MODSEL
   1   0

BLOCK SMINPUTS
   1    127.90897
   2    1.1663787e-05
   3    0.1184
   4    91.1876
   5    4.18
   6    173.2
   7    1.777

BLOCK MINPAR
   3    7.91

BLOCK EXTPAR
   0   -1
   1    752.29
   2   -771
   3    3836.41
   11    4283.7
   12    1216.3
   13   -2277.53
   23    751.28
   26    3407.96
   31    1423.57
   32    1423.57
   33    3104.95
   34    3379.07
   35    3379.07
   36    3910.75
   41    1363.34
   42    1363.34
   43    2341.39
   44    3645.7
   45    3645.7
   46    3662.64
   47    3201.82
   48    3201.82
   49    1524.18

BLOCK MASS
   24    80.392154
   25    126.60814
   35    3408.089
   36    3407.9599
   37    3409.2991
   5    4.8187603
   1000001    1502.6427
   2000001    3307.6265
   1000002    1500.6619
   2000002    3744.8991
   1000003    1502.6427
   2000003    3307.6265
   1000004    1500.6619
   2000004    3744.8991
   1000005    1651.4539
   2000005    2431.6087
   1000006    2425.578
   2000006    3689.311
   1000011    1430.3855
   2000011    3383.3783
   1000012    1427.9703
   1000013    1430.3855
   2000013    3383.3783
   1000014    1427.9703
   1000015    3111.2598
   2000015    3914.8286
   1000016    3109.9708
   1000021    3866.6627
   1000022    725.67139
   1000023   -739.78771
   1000025    801.98908
   1000035   -837.25837
   1000024    741.31362
   1000037    838.40249

BLOCK NMIX
   1   1    0.84326263
   1   2    0.021674239
   1   3    0.38962021
   1   4   -0.36964098
   2   1   -0.013270149
   2   2   -0.62562822
   2   3    0.56934459
   2   4    0.53316036
   3   1    0.53722302
   3   2   -0.033360722
   3   3   -0.58880086
   3   4    0.60298594
   4   1   -0.011111586
   4   2    0.7791063
   4   3    0.42113701
   4   4    0.46423434

BLOCK UMIX
   1   1   -0.60407438
   1   2    0.79692794
   2   1   -0.79692794
   2   2   -0.60407438

BLOCK VMIX
   1   1    0.6654748
   1   2    0.74642031
   2   1    0.74642031
   2   2   -0.6654748

BLOCK STOPMIX
   1   1    0.99712488
   1   2   -0.075775786
   2   1    0.075775786
   2   2    0.99712488

BLOCK SBOTMIX
   1   1    0.0032972529
   1   2    0.99999456
   2   1   -0.99999456
   2   2    0.0032972529

BLOCK STAUMIX
   1   1    0.9999969
   1   2    0.002489978
   2   1   -0.002489978
   2   2    0.9999969

BLOCK ALPHA
      -0.1323891

BLOCK HMIX Q=  2928.301
   1    762.82325
   2    7.5247027
   3    241.87197
   4    11462078

BLOCK GAUGE Q=  2928.301
   1    0.36468425
   2    0.63965669
   3    1.0074222

BLOCK AU Q=  2928.301
   1   1    0
   2   2    0
   3   3    4283.7

BLOCK AD Q=  2928.301
   1   1    0
   2   2    0
   3   3    1216.3

BLOCK AE Q=  2928.301
   1   1    0
   2   2    0
   3   3   -2277.53

BLOCK YU Q=  2928.301
   1   1    0
   2   2    0
   3   3    0.84204198

BLOCK YD Q=  2928.301
   1   1    0
   2   2    0
   3   3    0.098985669

BLOCK YE Q=  2928.301
   1   1    0
   2   2    0
   3   3    0.07737258

BLOCK MSOFT Q=  2928.301
   1    752.29
   2   -771
   3    3836.41
   21    10801891
   22   -232417.22
   31    1423.57
   32    1423.57
   33    3104.95
   34    3379.07
   35    3379.07
   36    3910.75
   41    1363.34
   42    1363.34
   43    2341.39
   44    3645.7
   45    3645.7
   46    3662.64
   47    3201.82
   48    3201.82
   49    1524.18

BLOCK HIGGSBOUNDSINPUTHIGGSCOUPLINGSFERMIONS
       0, 56.62115,3,36,15,15

BLOCK HIGGSBOUNDSINPUTHIGGSCOUPLINGSBOSONS
       0,4,36,21,21,23

DECAY 6  1.4409026
    1   2    5    24

DECAY 1000021  332.13013
    0.081202341   2    1000002   -2
    0.081202341   2   -1000002    2
    0.081202335   2    1000004   -4
    0.081202335   2   -1000004    4
    0.081126282   2    1000001   -1
    0.081126282   2   -1000001    1
    0.081126282   2    1000003   -3
    0.081126282   2   -1000003    3
    0.074966454   2    1000005   -5
    0.074966454   2   -1000005    5
    0.042037838   2    1000006   -6
    0.042037838   2   -1000006    6
    0.041114032   2    2000005   -5
    0.041114032   2   -2000005    5
    0.0080995457   2    2000001   -1
    0.0080995457   2   -2000001    1
    0.0080995457   2    2000003   -3
    0.0080995457   2   -2000003    3
    0.00043251904   2    2000002   -2
    0.00043251904   2   -2000002    2
    0.00043248129   2    2000004   -4
    0.00043248129   2   -2000004    4
    0.00016034323   2    2000006   -6
    0.00016034323   2   -2000006    6

DECAY 1000006  51.537745
    0.21836805   2    1000023    6
    0.19882887   2    1000025    6
    0.19263798   2    1000035    6
    0.17633981   2    1000024    5
    0.13901657   2    1000037    5
    0.074522599   2    1000022    6
    0.00028611866   2    1000005    24

DECAY 2000006  170.12665
    0.19187524   2    2000005    24
    0.14040434   2    1000024    5
    0.13733831   2    1000037    5
    0.11033676   2    1000025    6
    0.1065003   2    1000006    25
    0.099188264   2    1000006    23
    0.074041398   2    1000022    6
    0.072664181   2    1000023    6
    0.06764529   2    1000035    6
    5.9168878e-06   2    1000005    24

DECAY 1000005  0.99644209
    0.48345974   2    1000022    5
    0.22925361   2    1000025    5
    0.12972249   2   -1000024    6
    0.069208367   2    1000023    5
    0.058425113   2   -1000037    6
    0.029930677   2    1000035    5

DECAY 2000005  51.493796
    0.43629237   2   -1000037    6
    0.39755803   2   -1000024    6
    0.092435085   2    1000035    5
    0.063853765   2    1000023    5
    0.0053874744   2    1000025    5
    0.0041764064   2    1000022    5
    0.0001506608   2    1000005    23
    0.00014621353   2    1000005    25

DECAY 1000002  9.8628778
    0.33650863   2    1000037    1
    0.32267459   2    1000024    1
    0.18276882   2    1000035    2
    0.14412652   2    1000023    2
    0.012383349   2    1000022    2
    0.001538092   2    1000025    2

DECAY 2000002  7.8758641
    0.71458117   2    1000022    2
    0.28512146   2    1000025    2
    0.00017642878   2    1000023    2
    0.00012094031   2    1000035    2

DECAY 1000001  9.7890982
    0.38788775   2   -1000037    2
    0.26867314   2   -1000024    2
    0.18682935   2    1000035    1
    0.14331092   2    1000023    1
    0.0072600733   2    1000022    1
    0.0060387669   2    1000025    1

DECAY 2000001  1.7212538
    0.71563509   2    1000022    1
    0.2840682   2    1000025    1
    0.00017652812   2    1000023    1
    0.00012018022   2    1000035    1

DECAY 1000004  9.5751174
    0.33630922   2    1000037    3
    0.32287786   2    1000024    3
    0.18266288   2    1000035    4
    0.14421903   2    1000023    4
    0.012393043   2    1000022    4
    0.0015379668   2    1000025    4

DECAY 2000004  8.1179408
    0.71464217   2    1000022    4
    0.2850605   2    1000025    4
    0.00017643399   2    1000023    4
    0.00012089795   2    1000035    4

DECAY 1000003  9.5035034
    0.38768568   2   -1000037    4
    0.26886019   2   -1000024    4
    0.18673584   2    1000035    3
    0.14341328   2    1000023    3
    0.0072662766   2    1000022    3
    0.0060387361   2    1000025    3

DECAY 2000003  1.7507265
    0.71569439   2    1000022    3
    0.28400894   2    1000025    3
    0.00017653317   2    1000023    3
    0.0001201391   2    1000035    3

DECAY 1000011  9.2284772
    0.34528616   2   -1000037    12
    0.24628839   2   -1000024    12
    0.1627991   2    1000035    11
    0.1357117   2    1000023    11
    0.087825035   2    1000022    11
    0.02208962   2    1000025    11

DECAY 2000011  16.194489
    0.71548061   2    1000022    11
    0.28422258   2    1000025    11
    0.00017651304   2    1000023    11
    0.00012029318   2    1000035    11

DECAY 1000013  9.2284771
    0.34528616   2   -1000037    14
    0.24628839   2   -1000024    14
    0.1627991   2    1000035    13
    0.1357117   2    1000023    13
    0.087825034   2    1000022    13
    0.02208962   2    1000025    13

DECAY 2000013  16.194489
    0.71548061   2    1000022    13
    0.28422258   2    1000025    13
    0.00017651304   2    1000023    13
    0.00012029318   2    1000035    13

DECAY 1000015  37.086769
    0.3728186   2   -1000037    16
    0.22186981   2   -1000024    16
    0.17686551   2    1000035    15
    0.12483609   2    1000023    15
    0.07848115   2    1000022    15
    0.025128839   2    1000025    15

DECAY 2000015  20.113214
    0.68608698   2    1000022    15
    0.28034789   2    1000025    15
    0.013261526   2   -1000024    16
    0.0081247012   2   -1000037    16
    0.00693645   2    1000023    15
    0.0040652909   2    1000035    15
    0.00057594378   2    1000016   -24
    0.00030722003   2    1000015    25
    0.00029400039   2    1000015    23

DECAY 1000012  9.2480819
    0.30068514   2    1000037    11
    0.29702306   2    1000024    11
    0.16695056   2    1000035    12
    0.12849277   2    1000023    12
    0.072874063   2    1000022    12
    0.033974396   2    1000025    12

DECAY 1000014  9.2480818
    0.30068514   2    1000037    13
    0.29702306   2    1000024    13
    0.16695057   2    1000035    14
    0.12849278   2    1000023    14
    0.072874064   2    1000022    14
    0.033974397   2    1000025    14

DECAY 1000016  37.106151
    0.32997251   2    1000037    15
    0.2744363   2    1000024    15
    0.18104241   2    1000035    16
    0.1159778   2    1000023    16
    0.064279753   2    1000022    16
    0.034291233   2    1000025    16

DECAY 1000024  1.9312788e-07
    0.3363103   3    1000022    2   -1
    0.3363103   3    1000022    4   -3
    0.11120242   3    1000022   -11    12
    0.11120242   3    1000022   -13    14
    0.10491836   3    1000022   -15    16
    3.3720777e-05   3    1000023    2   -1
    1.1243677e-05   3    1000023   -11    12
    1.1243677e-05   3    1000023   -13    14

DECAY 1000037  0.23179892
    0.52150009   2    1000022    24
    0.39471599   2    1000023    24
    0.083783917   2    1000024    23

DECAY 1000022 -1


DECAY 1000023  8.8656118e-08
    0.17039868   3    1000022   -1    1
    0.17039868   3    1000022   -3    3
    0.13140498   3    1000022   -2    2
    0.13140498   3    1000022   -4    4
    0.077985519   3    1000022   -16    16
    0.077619546   3    1000022   -12    12
    0.077619546   3    1000022   -14    14
    0.048216705   3    1000022   -5    5
    0.038792405   3    1000022   -11    11
    0.038792405   3    1000022   -13    13
    0.035579926   3    1000022   -15    15
    0.0017866292   2    1000022    22

DECAY 1000025  0.0016823414
    0.11633638   3    1000024   -2    1
    0.11633638   3   -1000024   -1    2
    0.11633638   3    1000024   -4    3
    0.11633638   3   -1000024   -3    4
    0.045927323   3    1000023   -1    1
    0.045927323   3    1000023   -3    3
    0.043444396   3    1000023   -5    5
    0.038884972   3    1000024   -12    11
    0.038884972   3   -1000024    12   -11
    0.038884972   3    1000024   -14    13
    0.038884972   3   -1000024    14   -13
    0.038656689   3    1000024   -16    15
    0.038656689   3   -1000024    16   -15
    0.035408889   3    1000023   -2    2
    0.035408889   3    1000023   -4    4
    0.021144029   3    1000023   -12    12
    0.021144029   3    1000023   -14    14
    0.021102565   3    1000023   -16    16
    0.010571805   3    1000023   -11    11
    0.010571805   3    1000023   -13    13
    0.010479937   3    1000023   -15    15
    7.8036569e-05   3    1000022   -5    5
    7.6605222e-05   3    1000022   -1    1
    7.6605222e-05   3    1000022   -3    3
    7.6378987e-05   2    1000023    22
    7.6146759e-05   2    1000022    22
    6.126783e-05   3    1000022   -2    2
    6.126783e-05   3    1000022   -4    4
    3.9907494e-05   3    1000022   -12    12
    3.9907494e-05   3    1000022   -14    14
    3.6353011e-05   3    1000022   -16    16
    1.7446181e-05   3    1000022   -15    15
    1.5151663e-05   3    1000022   -11    11
    1.5151663e-05   3    1000022   -13    13

DECAY 1000035  0.22780625
    0.36024355   2    1000024   -24
    0.36024355   2   -1000024    24
    0.27900286   2    1000022    23
    0.00051004385   2    1000023    23

DECAY 25  0.004309715
    0.5757676   2    5   -5
    0.23186863   2    24   -24
    0.076883071   2    21    21
    0.061057866   2   -15    15
    0.029669849   2    23    23
    0.02033043   2    4   -4
    0.0023019521   2    22    22
    0.0016691966   2    22    23
    0.00023529267   2    3   -3
    0.00021611907   2   -13    13

DECAY 35  41.508595
    0.17414154   2    1000024   -1000024
    0.12282604   2    1000037   -1000037
    0.11874466   2    1000024   -1000037
    0.11874466   2    1000037   -1000024
    0.092136492   2    1000025    1000035
    0.078488243   2    1000023    1000023
    0.072893544   2    1000022    1000023
    0.065003937   2    1000035    1000035
    0.057879511   2    6   -6
    0.048291026   2    5   -5
    0.012522689   2    1000025    1000025
    0.01084914   2    1000022    1000022
    0.0099157882   2    1000023    1000035
    0.0096881679   2   -15    15
    0.0036236046   2    1000023    1000025
    0.0029185139   2    1000022    1000025
    0.0010809677   2    1000022    1000035
    8.597276e-05   2    25    25
    3.4511719e-05   2   -13    13
    2.3791472e-05   2    21    21
    2.1974993e-05   2    24   -24
    2.0070108e-05   2    3   -3
    1.1245431e-05   2    1000001   -1000001
    1.1245431e-05   2    1000003   -1000003
    1.0966357e-05   2    23    23
    7.7001616e-06   2    1000002   -1000002
    7.7001616e-06   2    1000004   -1000004
    5.9821377e-06   2    1000012   -1000012
    5.9821377e-06   2    1000014   -1000014
    1.8318543e-06   2    1000011   -1000011
    1.8318543e-06   2    1000013   -1000013
    5.8750545e-07   2    4   -4
    3.8180446e-08   2    23    22
    3.6899838e-08   2    1000005   -1000005
    1.0028386e-08   2    22    22

DECAY 36  41.515843
    0.15595897   2    1000024   -1000037
    0.15595897   2    1000037   -1000024
    0.13634785   2    1000024   -1000024
    0.094588686   2    1000025    1000035
    0.086212777   2    1000037   -1000037
    0.059374205   2    1000022    1000023
    0.058603372   2    1000023    1000023
    0.058018191   2    6   -6
    0.04831009   2    5   -5
    0.047457613   2    1000035    1000035
    0.02783269   2    1000025    1000025
    0.022013333   2    1000022    1000022
    0.015624177   2    1000023    1000025
    0.0096868081   2   -15    15
    0.0086594215   2    1000022    1000035
    0.0086541796   2    1000023    1000035
    0.0065741763   2    1000022    1000025
    4.695244e-05   2    21    21
    3.4506828e-05   2   -13    13
    2.2273004e-05   2    23    25
    2.0092287e-05   2    3   -3
    5.9045283e-07   2    4   -4
    6.0716765e-08   2    23    22
    2.1769991e-08   2    22    22

DECAY 37  41.394193
    0.28052364   2    1000037    1000023
    0.25490483   2    1000024    1000035
    0.1751712   2    1000037    1000025
    0.14173377   2    1000024    1000022
    0.10406355   2    6   -5
    0.025672069   2    1000024    1000025
    0.0097190936   2   -15    16
    0.0078844016   2    1000037    1000022
    9.7672501e-05   2    1000024    1000023
    7.8802832e-05   2    4   -5
    3.4621838e-05   2   -13    14
    2.2375662e-05   2    24    25
    2.0403056e-05   2    4   -3
    1.9696098e-05   2    1000037    1000035
    1.881365e-05   2    1000002   -1000001
    1.881365e-05   2    1000004   -1000003
    7.222382e-06   2   -1000011    1000012
    7.222382e-06   2   -1000013    1000014
    1.00772e-06   2    2   -3
    7.8801805e-07   2    2   -5
    1.3693078e-13   2    24    36

DECAY 5 -1


DECAY 15 -1


DECAY 23  2.4952


DECAY 24  2.085
