BLOCK SPINFO
   1   SPheno
   2   v4.0.5be

BLOCK SPHENOINFO
   1   2
   2   2

BLOCK MODSEL
   1   0

BLOCK MINPAR
   3    58.757336
   4    1

BLOCK EXTPAR
   0    3752.118
   1   -1039.7723
   2   -1457.8536
   3    4414.6453
   11    12.895545
   12    6341.3079
   13    3402.8306
   23    2499.8597
   25    57.654972
   26    2680.6644
   31    3715.7009
   32    3715.7009
   33    2997.7437
   34    1118.7725
   35    1118.7725
   36    1213.9361
   41    3665.7088
   42    3665.7088
   43    3224.7695
   44    1481.1411
   45    1481.1411
   46    4074.1541
   47    2295.4
   48    2295.4
   49    4151.9022

BLOCK SMINPUTS
   1    127.90897
   2    1.1663787e-05
   3    0.1184
   4    91.1876
   5    4.18
   6    173.2
   7    1.777
   8    0
   11    0.00051099893
   12    0
   13    0.10565837
   14    0
   21    0.005
   22    0.0025
   23    0.095
   24    1.27

BLOCK GAUGE Q=  3752.118
   1    0.35536298
   2    0.66519887
   3    1.219778

BLOCK YU Q=  3752.118
   1   1    8.3856332e-06
   2   2    0.0042599017
   3   3    1.0130518

BLOCK YD Q=  3752.118
   1   1    0.00097152252
   2   2    0.018458928
   3   3    0.96344591

BLOCK YE Q=  3752.118
   1   1    0.00016953778
   2   2    0.035055037
   3   3    0.58956805

BLOCK AU Q=  3752.118
   1   1    0
   2   2    0
   3   3    12.895545

BLOCK AD Q=  3752.118
   1   1    0
   2   2    0
   3   3    6341.3082

BLOCK AE Q=  3752.118
   1   1    0
   2   2    0
   3   3    3402.8306

BLOCK MSOFT Q=  3752.118
   1   -1039.7723
   2   -1457.8536
   3    4414.6453
   21    1148952.4
   22   -6027055.4
   31    3715.7009
   32    3715.7009
   33    2997.7437
   34    1118.7725
   35    1118.7725
   36    1213.9361
   41    3665.7088
   42    3665.7088
   43    3224.7695
   44    1481.1411
   45    1481.1411
   46    4074.1541
   47    2295.4
   48    2295.4
   49    4151.9022

BLOCK MASS
   6    173.2
   23    91.1876
   24    80.429995
   15    1.777
   25    120.01646
   35    2680.093
   36    2680.6644
   37    2681.77
   1000001    3826.1918
   2000001    2466.827
   1000002    3825.3308
   2000002    1679.9008
   1000003    3826.1877
   2000003    2466.8208
   1000004    3825.3263
   2000004    1679.901
   1000005    3365.0373
   2000005    4248.3235
   1000006    3368.2306
   2000006    4179.7581
   1000011    3725.3953
   2000011    1132.6158
   1000012    3724.1321
   1000013    3725.356
   2000013    1132.5329
   1000014    3724.0805
   1000015    1188.2532
   2000015    2989.9273
   1000016    2984.0635
   1000021    4489.1241
   1000022   -1021.6562
   1000023   -1515.2276
   1000025    2505.4467
   1000035   -2508.0628
   1000024    1515.1521
   1000037    2508.5808

BLOCK ALPHA
      -0.017046015

BLOCK HMIX Q=  3752.118
   1    2499.8597
   2    57.654972
   3    243.03956
   4    7185961.6

BLOCK STOPMIX
   1   1    0.99999293
   1   2    0.0037607106
   2   1   -0.0037607106
   2   2    0.99999293

BLOCK SBOTMIX
   1   1    0.9994437
   1   2    0.033351033
   2   1   -0.033351033
   2   2    0.9994437

BLOCK STAUMIX
   1   1    0.033032369
   1   2    0.99945428
   2   1   -0.99945428
   2   2    0.033032369

BLOCK NMIX
   1   1   -0.9997414
   1   2    0.0012561574
   1   3   -0.021108613
   1   4   -0.008365347
   2   1    0.0025005907
   2   2    0.99845527
   2   3   -0.047905155
   2   4   -0.028034187
   3   1    0.0089899714
   3   2   -0.014082202
   3   3   -0.70686367
   3   4    0.70715247
   4   1    0.020737839
   4   2   -0.053732543
   4   3   -0.70541
   4   4   -0.70645558

BLOCK UMIX
   1   1   -0.99766972
   1   2    0.068228531
   2   1   -0.068228531
   2   2   -0.99766972

BLOCK VMIX
   1   1    0.99919274
   1   2    0.040172899
   2   1    0.040172899
   2   2   -0.99919274

BLOCK HIGGSBOUNDSINPUTHIGGSCOUPLINGSFERMIONS
       0, 3324.0958,3,36,15,15

BLOCK HIGGSBOUNDSINPUTHIGGSCOUPLINGSBOSONS
       0,4,36,21,21,23

BLOCK SPHENOLOWENERGY
   1    0.00032466518
   2    1.5898048e-06
   3    3.5255019e-05
   4    2.7176877e-15
   5    1.1609587e-10
   6    2.4266117e-08
   7    9.0381439e-14
   8    3.8610754e-09
   9    8.180181e-07
   10    9.4435252e-05
   11    0.97548
   12    0.54177003
   13    19.34437
   14    0
   15    0
   16    0.0021566882
   17    2.2816549e-15
   18    2.4801615e-11
   19    8.2908031e-11
   20   -1.8993888e-15
   21   -8.1197309e-11
   22   -3.2406321e-08
   23    0
   24    0
   25    0
   26    0
   27    0
   28    0
   29    0
   30    0
   31    0
   39    7.4033251e-05
   40    0
   41    0
   42    0

BLOCK FWCOEF Q=  160
   305   4422   0   0   -0.18881911
   305   4422   0   2   -0.19273551
   305   4322   0   2   -0.00010063666
   305   6421   0   0   -0.095227835
   305   6421   0   2   -0.10345805
   305   6321   0   2   -0.00017968467
   3051111   4133   0   0    1.6256923
   3051111   4133   0   2    1.6258106
   3051111   4233   0   2    0.00028303873
   3051111   4137   0   0   -4.4483844
   3051111   4137   0   2   -4.4470245
   3051111   4237   0   2   -0.0020981299
   3051313   4133   0   0    1.6256923
   3051313   4133   0   2    1.6258096
   3051313   4233   0   2    0.00028303596
   3051313   4137   0   0   -4.4483844
   3051313   4137   0   2   -4.4470255
   3051313   4237   0   2   -0.0020981301
   3051212   4137   0   0    1.5053501
   3051212   4137   0   2    1.5050582
   3051212   4237   0   2    0.00045379712
   3051414   4137   0   0    1.5053501
   3051414   4137   0   2    1.5050582
   3051414   4237   0   2    0.00045379751
   3051616   4137   0   0    1.5053501
   3051616   4137   0   2    1.5050582
   3051616   4237   0   2    0.00045390961

BLOCK IMFWCOEF Q=  160
   305   4422   0   0    3.8581755e-07
   305   4422   0   2   -5.6231149e-06
   305   4322   0   2    1.0002906e-06
   305   6421   0   0    3.3047825e-07
   305   6421   0   2   -8.3891164e-06
   305   6321   0   2    3.978178e-07
   3051111   4133   0   2   -4.0361777e-08
   3051111   4233   0   2    6.8310217e-06
   3051111   4137   0   2    1.1918184e-06
   3051111   4237   0   2   -5.0641527e-05
   3051313   4133   0   2   -4.0363218e-08
   3051313   4233   0   2    6.8310053e-06
   3051313   4137   0   2    1.1918232e-06
   3051313   4237   0   2   -5.0641562e-05
   3051212   4137   0   2   -2.1751554e-07
   3051212   4237   0   2    1.0953072e-05
   3051414   4137   0   2   -2.1751549e-07
   3051414   4237   0   2    1.0953072e-05
   3051616   4137   0   2   -2.1712212e-07
   3051616   4237   0   2    1.0953073e-05

DECAY 23  2.4952


DECAY 24  2.085


DECAY 2000011  0.19749797
    1   2    1000022    11

DECAY 1000011  38.188997
    0.59536711   2   -1000024    12
    0.29893907   2    1000023    11
    0.10425494   2    1000022    11
    0.0011942324   2   -1000037    12
    0.00023353851   2    1000035    11

DECAY 2000013  0.19723109
    1   2    1000022    13

DECAY 1000013  38.234248
    0.59465122   2   -1000024    14
    0.29858336   2    1000023    13
    0.10413101   2    1000022    13
    0.0011927646   2   -1000037    14
    0.00058760795   2    1000035    13
    0.00048592843   2    2000013    25
    0.00036810389   2    1000025    13

DECAY 1000015  0.40588491
    1   2    1000022    15

DECAY 2000015  38.076547
    0.37810113   2   -1000024    16
    0.19052004   2    1000023    15
    0.15470773   2    1000015    23
    0.15133956   2    1000015    25
    0.076735982   2    1000022    15
    0.024107843   2    1000025    15
    0.023912921   2    1000035    15
    0.00057479766   2   -1000037    16

DECAY 1000012  38.195746
    0.59671776   2    1000024    11
    0.29711022   2    1000023    12
    0.10517452   2    1000022    12
    0.00053828312   2    1000035    12
    0.0004133591   2    1000037    11

DECAY 1000014  38.222156
    0.59629844   2    1000024    13
    0.29689754   2    1000023    14
    0.10509991   2    1000022    14
    0.0011203954   2    1000037    13
    0.00053787894   2    1000035    14

DECAY 1000016  38.113324
    0.38047437   2    1000024    15
    0.30726178   2    1000015    24
    0.1887258   2    1000023    16
    0.076965978   2    1000022    16
    0.046436605   2    1000037    15
    0.00012476637   2    1000035    16

DECAY 2000001  0.94478826
    0.99999633   2    1000022    1

DECAY 1000001  36.298083
    0.65665725   2   -1000024    2
    0.32854045   2    1000023    1
    0.012862358   2    1000022    1
    0.0014041639   2   -1000037    2
    0.00049798428   2    1000035    1

DECAY 2000003  0.94483354
    0.99994876   2    1000022    3

DECAY 1000003  36.310126
    0.65643788   2   -1000024    4
    0.32843195   2    1000023    3
    0.012858343   2    1000022    3
    0.0014162602   2   -1000037    4
    0.0006131743   2    1000035    3
    0.00015369521   2    1000025    3

DECAY 1000005  54.055521
    0.34452954   2   -1000024    6
    0.24457074   2   -1000037    6
    0.17603124   2    1000023    5
    0.11396189   2    1000025    5
    0.11285783   2    1000035    5
    0.0080487652   2    1000022    5

DECAY 2000005  77.727688
    0.42642714   2   -1000037    6
    0.21472761   2    1000025    5
    0.21382833   2    1000035    5
    0.058817613   2    1000005    25
    0.037763828   2    1000006   -24
    0.027117148   2    1000022    5
    0.01897596   2    1000005    23
    0.0015699787   2   -1000024    6
    0.00077239248   2    1000023    5

DECAY 2000002  1.488845
    0.99999945   2    1000022    2

DECAY 1000002  36.326826
    0.65788421   2    1000024    1
    0.32873756   2    1000023    2
    0.012490832   2    1000022    2
    0.0004866132   2    1000037    1
    0.00037724111   2    1000035    2

DECAY 2000004  1.488841
    0.99999942   2    1000022    4

DECAY 1000004  36.335646
    0.65772568   2    1000024    3
    0.32865705   2    1000023    4
    0.012487777   2    1000022    4
    0.00071650337   2    1000037    3
    0.00038323134   2    1000035    4

DECAY 1000006  59.364796
    0.32030981   2    1000024    5
    0.20694593   2    1000037    5
    0.15882254   2    1000023    6
    0.11267905   2    1000025    6
    0.11043167   2    1000035    6
    0.079159047   2    1000023    4
    0.0064071933   2    1000022    6
    0.0032125354   2    1000022    4
    0.0020322173   3    1000022    24    5

DECAY 2000006  77.988615
    0.44710123   2    1000037    5
    0.22303323   2    1000025    6
    0.22151274   2    1000035    6
    0.10553758   2    1000022    6
    0.0015010685   2    1000024    5
    0.00072790361   2    1000023    6
    0.00038623685   2    1000005    24
    0.0001904658   2    1000006    23

DECAY 1000024  0.011606987
    0.74267413   2   -1000015    16
    0.25271556   2    1000022    24
    0.0030605202   3    1000022   -5    6
    0.001446475   2   -2000013    14

DECAY 1000037  20.35031
    0.25363992   2   -1000015    16
    0.22342864   2    1000024    25
    0.21686465   2    1000023    24
    0.2089935   2    1000024    23
    0.077859172   2    1000022    24
    0.0079074077   3    1000024    6   -6
    0.0069111925   3    1000023   -5    6
    0.0032513986   3    1000022   -5    6
    0.00095072492   2   -2000013    14
    0.00012854277   3    1000024    5   -5

DECAY 1000022 -1


DECAY 1000023  0.011226735
    0.38111973   2    1000015   -15
    0.38111973   2   -1000015    15
    0.22321691   2    1000022    25
    0.010809338   2    1000022    23
    0.0011501003   2    2000013   -13
    0.0011501003   2   -2000013    13
    0.00041284979   2    2000011   -11
    0.00041284979   2   -2000011    11
    0.0002791378   3    1000022    6   -6
    0.00013510897   3    1000022    12   -12

DECAY 1000025  25.363697
    0.18123084   2    1000023    25
    0.16754589   2    1000024   -24
    0.16754589   2   -1000024    24
    0.15696947   2    1000023    23
    0.10239253   2    1000015   -15
    0.10239253   2   -1000015    15
    0.053321346   2    1000022    23
    0.053006222   2    1000022    25
    0.0051611344   3    1000024    5   -6
    0.0051611344   3   -1000024   -5    6
    0.0026967835   3    1000023    6   -6
    0.0015687787   3    1000022    6   -6
    0.00039463729   2    2000013   -13
    0.00039463729   2   -2000013    13

DECAY 1000035  20.046316
    0.21270502   2    1000023    25
    0.20922989   2    1000024   -24
    0.20922989   2   -1000024    24
    0.12892659   2    1000015   -15
    0.12892659   2   -1000015    15
    0.062356592   2    1000022    25
    0.013572433   2    1000023    23
    0.012587016   2    1000022    23
    0.0077959717   3    1000024    5   -6
    0.0077959717   3   -1000024   -5    6
    0.0032234896   3    1000023    6   -6
    0.0019261323   3    1000022    6   -6
    0.00056793093   2    2000013   -13
    0.00056793093   2   -2000013    13

DECAY 1000021  432.57609
    0.11358473   2    2000002   -2
    0.11358473   2   -2000002    2
    0.11358471   2    2000004   -4
    0.11358471   2   -2000004    4
    0.074837487   2    2000003   -3
    0.074837487   2   -2000003    3
    0.074837161   2    2000001   -1
    0.074837161   2   -2000001    1
    0.029470559   2    1000005   -5
    0.029470559   2   -1000005    5
    0.029036496   2    1000006   -6
    0.029036496   2   -1000006    6
    0.014647917   2    1000006   -4
    0.014647917   2   -1000006    4
    0.011519996   2    1000004   -4
    0.011519996   2   -1000004    4
    0.011519872   2    1000002   -2
    0.011519872   2   -1000002    2
    0.011492517   2    1000003   -3
    0.011492517   2   -1000003    3
    0.011492385   2    1000001   -1
    0.011492385   2   -1000001    1
    0.0022884368   2    2000006   -6
    0.0022884368   2   -2000006    6
    0.0016759176   2    2000005   -5
    0.0016759176   2   -2000005    5

DECAY 25  0.0033281233
    0.6452081   2   -5    5
    0.15322847   2   -24    24
    0.07512657   2    21    21
    0.073793959   2   -15    15
    0.031968094   2   -4    4
    0.016780677   2    23    23
    0.0023121789   2    22    22
    0.0010828154   2    22    23
    0.00025592666   2   -13    13
    0.00024236442   2   -3    3
    6.70114e-07   2   -1    1
    1.6475611e-07   2   -2    2
    5.7535836e-09   2   -11    11

DECAY 35  63.622586
    0.7529309   2   -5    5
    0.24537949   2   -15    15
    0.00086594275   2   -13    13
    0.00048114239   2   -1000015    1000015
    0.0002516966   2   -3    3
    4.9427822e-05   2   -6    6
    1.8169569e-05   2    1000022    1000023
    1.095468e-05   2    21    21
    1.087912e-05   2    1000022    1000022
    6.9587959e-07   2   -1    1
    5.7017293e-07   2    25    25
    5.2850029e-08   2    23    23
    1.9449273e-08   2   -11    11
    1.856194e-08   2   -24    24
    1.6263753e-08   2   -1000011    1000011
    1.5761455e-08   2   -1000013    1000013
    7.1760614e-09   2    22    22
    4.5945932e-10   2   -4    4
    3.8093252e-10   2    22    23
    2.375949e-15   2   -2    2

DECAY 36  59.783943
    0.75319812   2   -5    5
    0.24547659   2   -15    15
    0.00086627729   2   -13    13
    0.00025177783   2   -3    3
    0.0001371237   2    1000022    1000023
    2.8295258e-05   2    1000022    1000022
    2.2109278e-05   2   -6    6
    1.8774638e-05   2    21    21
    6.9610451e-07   2   -1    1
    8.5112799e-08   2    23    25
    7.9046982e-08   2    22    23
    5.4426558e-08   2    22    22
    1.9456753e-08   2   -11    11
    1.610327e-10   2   -4    4
    8.3559979e-16   2   -2    2
    6.292928e-41   2    25    25

DECAY 37  69.626447
    0.73166933   2   -5    6
    0.26592956   2   -15    16
    0.0010850179   2   -5    4
    0.0009401561   2   -13    14
    0.00022182918   2   -3    4
    0.00013425478   2    1000022    1000024
    1.0376336e-05   2   -3    2
    7.748148e-06   2   -5    2
    9.6076712e-07   2   -3    6
    6.1551016e-07   2   -1    2
    7.3229152e-08   2    24    25
    2.90462e-08   2   -1    6
    2.8973488e-08   2   -1    4
    2.1990349e-08   2   -11    12
    2.5932775e-13   2    24    35
    3.2299847e-14   2    24    36

DECAY 6  2.43
    1   2    5    24

DECAY 15 -1
