BLOCK SPINFO
   1   SPheno
   2   v4.0.5be

BLOCK SPHENOINFO
   1   2
   2   2

BLOCK MODSEL
   1   0

BLOCK MINPAR
   3    33.97436
   4    1

BLOCK EXTPAR
   0    1785.3145
   1   -3913.4487
   2   -2512.884
   3    4390.7705
   11   -5134.0839
   12   -5291.7128
   13    3622.963
   23    196.07746
   25    33.048185
   26    1949.4361
   31    2817.0228
   32    2817.0228
   33    4367.1673
   34    4304.0796
   35    4304.0796
   36    1480.6515
   41    4333.6309
   42    4333.6309
   43    2764.8195
   44    2301.8441
   45    2301.8441
   46    1383.9316
   47    4648.2151
   48    4648.2151
   49    2017.1494

BLOCK SMINPUTS
   1    127.90897
   2    1.1663787e-05
   3    0.1184
   4    91.1876
   5    4.18
   6    173.2
   7    1.777
   8    0
   11    0.00051099893
   12    0
   13    0.10565837
   14    0
   21    0.005
   22    0.0025
   23    0.095
   24    1.27

BLOCK GAUGE Q=  1785.3145
   1    0.35536298
   2    0.66519887
   3    1.219778

BLOCK YU Q=  1785.3145
   1   1    8.3882096e-06
   2   2    0.0042612105
   3   3    1.0133631

BLOCK YD Q=  1785.3145
   1   1    0.00055705378
   2   2    0.010584022
   3   3    0.5524228

BLOCK YE Q=  1785.3145
   1   1    9.7209959e-05
   2   2    0.020099936
   3   3    0.33804787

BLOCK AU Q=  1785.3145
   1   1    0
   2   2    0
   3   3   -5134.0838

BLOCK AD Q=  1785.3145
   1   1    0
   2   2    0
   3   3   -5291.713

BLOCK AE Q=  1785.3145
   1   1    0
   2   2    0
   3   3    3622.963

BLOCK MSOFT Q=  1785.3145
   1   -3913.4487
   2   -2512.884
   3    4390.7705
   21    3746254.9
   22   -83652.459
   31    2817.0228
   32    2817.0228
   33    4367.1673
   34    4304.0796
   35    4304.0796
   36    1480.6515
   41    4333.6309
   42    4333.6309
   43    2764.8195
   44    2301.8441
   45    2301.8441
   46    1383.9316
   47    4648.2151
   48    4648.2151
   49    2017.1494

BLOCK MASS
   6    173.2
   23    91.1876
   24    80.429995
   15    1.777
   25    124.43584
   35    1949.3563
   36    1949.4361
   37    1951.7141
   1000001    4378.8096
   2000001    4682.3518
   1000002    4378.26
   2000002    2272.8372
   1000003    4378.8097
   2000003    4682.3519
   1000004    4378.2602
   2000004    2272.8374
   1000005    1982.1375
   2000005    2723.5326
   1000006    1162.4682
   2000006    2741.8794
   1000011    2824.1464
   2000011    4315.829
   1000012    2822.6592
   1000013    2824.1448
   2000013    4315.8207
   1000014    2822.6519
   1000015    1510.4828
   2000015    4368.2858
   1000016    4367.2248
   1000021    4386.3266
   1000022   -204.03463
   1000023    206.30772
   1000025   -2571.1406
   1000035   -3897.6046
   1000024    205.331
   1000037    2571.1334

BLOCK ALPHA
      -0.029602562

BLOCK HMIX Q=  1785.3145
   1    196.07746
   2    33.048185
   3    243.70864
   4    3800301.1

BLOCK STOPMIX
   1   1    0.1192467
   1   2    0.99286466
   2   1   -0.99286466
   2   2    0.1192467

BLOCK SBOTMIX
   1   1    0.007365415
   1   2    0.99997287
   2   1   -0.99997287
   2   2    0.007365415

BLOCK STAUMIX
   1   1    0.00030324867
   1   2    0.99999995
   2   1   -0.99999995
   2   2    0.00030324867

BLOCK NMIX
   1   1   -0.0082423772
   1   2    0.022413507
   1   3   -0.70902974
   1   4   -0.7047741
   2   1    0.0079222793
   2   2   -0.020574343
   2   3   -0.70517718
   2   4    0.70868828
   3   1    0.0010998825
   3   2    0.99953678
   3   3    0.0013837318
   3   4    0.030382716
   4   1   -0.99993404
   4   2    0.00075168636
   4   3    0.00025901905
   4   4    0.011457614

BLOCK UMIX
   1   1   -0.001960659
   1   2    0.99999808
   2   1   -0.99999808
   2   2   -0.001960659

BLOCK VMIX
   1   1    0.043000101
   1   2    0.99907507
   2   1    0.99907507
   2   2   -0.043000101

BLOCK HIGGSBOUNDSINPUTHIGGSCOUPLINGSFERMIONS
       0, 1092.1825,3,36,15,15

BLOCK HIGGSBOUNDSINPUTHIGGSCOUPLINGSBOSONS
       0,4,36,21,21,23

BLOCK SPHENOLOWENERGY
   1    0.00031053412
   2    1.5915338e-06
   3    3.5248084e-05
   4    3.1247152e-15
   5    1.334828e-10
   6    2.7855585e-08
   7    1.0486412e-13
   8    4.4797445e-09
   9    9.4734872e-07
   10    9.526926e-05
   11    0.98409498
   12    0.5421734
   13    19.362946
   14    0
   15    0
   16    0.0021582338
   17    2.2816694e-15
   18    2.4805582e-11
   19    8.2907853e-11
   20   -1.567368e-15
   21   -6.7009949e-11
   22   -9.9593756e-09
   23    0
   24    0
   25    0
   26    0
   27    0
   28    0
   29    0
   30    0
   31    0
   39    6.529252e-05
   40    0
   41    0
   42    0

BLOCK FWCOEF Q=  160
   305   4422   0   0   -0.18881911
   305   4422   0   2   -0.17470621
   305   4322   0   2    9.9926726e-05
   305   6421   0   0   -0.095227835
   305   6421   0   2   -0.097866338
   305   6321   0   2   -0.00015438118
   3051111   4133   0   0    1.5983226
   3051111   4133   0   2    1.5988326
   3051111   4233   0   2    0.00013120468
   3051111   4137   0   0   -4.4210147
   3051111   4137   0   2   -4.4189433
   3051111   4237   0   2   -0.0010117187
   3051313   4133   0   0    1.5983226
   3051313   4133   0   2    1.5988318
   3051313   4233   0   2    0.00013120386
   3051313   4137   0   0   -4.4210147
   3051313   4137   0   2   -4.4189441
   3051313   4237   0   2   -0.0010117185
   3051212   4137   0   0    1.5053501
   3051212   4137   0   2    1.5049009
   3051212   4237   0   2    0.00022017572
   3051414   4137   0   0    1.5053501
   3051414   4137   0   2    1.5049009
   3051414   4237   0   2    0.00022017587
   3051616   4137   0   0    1.5053501
   3051616   4137   0   2    1.504901
   3051616   4237   0   2    0.00022021882

BLOCK IMFWCOEF Q=  160
   305   4422   0   0    3.8584367e-07
   305   4422   0   2   -4.7324643e-06
   305   4322   0   2    6.1992538e-06
   305   6421   0   0    3.3050062e-07
   305   6421   0   2   -7.5217466e-06
   305   6321   0   2    2.8037006e-06
   3051111   4133   0   2   -2.3183902e-06
   3051111   4233   0   2    3.3220746e-06
   3051111   4137   0   2    1.8428253e-05
   3051111   4237   0   2   -2.5626954e-05
   3051313   4133   0   2   -2.3183835e-06
   3051313   4233   0   2    3.3220726e-06
   3051313   4137   0   2    1.8428264e-05
   3051313   4237   0   2   -2.5626962e-05
   3051212   4137   0   2   -3.9822171e-06
   3051212   4237   0   2    5.5770743e-06
   3051414   4137   0   2   -3.9822172e-06
   3051414   4237   0   2    5.5770743e-06
   3051616   4137   0   2   -3.9800754e-06
   3051616   4237   0   2    5.5770735e-06

DECAY 23  2.4952


DECAY 24  2.085


DECAY 1000011  1.0998243
    0.66215581   2   -1000037    12
    0.33114347   2    1000025    11
    0.0036281912   2    1000022    11
    0.0029865484   2    1000023    11

DECAY 2000011  0.74026733
    0.99617163   2    1000035    11
    0.0019818093   2    1000022    11
    0.0018307207   2    1000023    11

DECAY 1000013  1.1222715
    0.64890439   2   -1000037    14
    0.32451643   2    1000025    13
    0.013617495   2    1000022    13
    0.012877424   2    1000023    13

DECAY 2000013  0.80932262
    0.91114079   2    1000035    13
    0.042666918   2   -1000024    14
    0.023263134   2    1000022    13
    0.022890392   2    1000023    13

DECAY 1000015  6.6176842
    0.49991344   2   -1000024    16
    0.25151714   2    1000022    15
    0.24856942   2    1000023    15

DECAY 2000015  38.928702
    0.42193418   2   -1000037    16
    0.21101947   2    1000025    15
    0.12784583   2    1000022    15
    0.12642988   2    1000023    15
    0.05341681   2    1000015    35
    0.053416333   2    1000015    36
    0.0058423537   2    1000035    15

DECAY 1000012  1.1404507
    0.63056706   2    1000037    11
    0.31518679   2    1000025    12
    0.03986122   2    1000024    11
    0.0077525972   2    1000022    12
    0.0066323377   2    1000023    12

DECAY 1000014  1.1628406
    0.61839299   2    1000037    13
    0.30910167   2    1000025    14
    0.058397421   2    1000024    13
    0.0076033048   2    1000022    14
    0.0065046182   2    1000023    14

DECAY 1000016  38.937623
    0.42073932   2    1000037    15
    0.25568176   2    1000024    15
    0.21031566   2    1000025    16
    0.10666578   2    1000015    37
    0.0058503774   2    1000035    16
    0.00035347098   2    1000022    16
    0.00030243554   2    1000023    16

DECAY 1000001  24.859292
    0.66569962   2   -1000037    2
    0.33241051   2    1000025    1
    0.0010695261   2    1000035    1
    0.00044079168   2    1000022    1
    0.00037361396   2    1000023    1

DECAY 2000001  5.7882387
    0.95734214   2    1000021    1
    0.04258884   2    1000035    1

DECAY 1000003  24.870554
    0.66539817   2   -1000037    4
    0.33226001   2    1000025    3
    0.0010690422   2    1000035    3
    0.00063644596   2    1000022    3
    0.00056716264   2    1000023    3

DECAY 2000003  5.8089752
    0.9539252   2    1000021    3
    0.042436818   2    1000035    3
    0.001789462   2   -1000024    4
    0.00093010633   2    1000022    3
    0.00091796119   2    1000023    3

DECAY 1000005  23.368463
    0.49595637   2   -1000024    6
    0.25354561   2    1000022    5
    0.25044939   2    1000023    5

DECAY 2000005  177.47724
    0.59959253   2    1000006   -24
    0.30685412   2   -1000024    6
    0.046328487   2    1000022    5
    0.045852564   2    1000023    5
    0.00079787471   2    1000025    5
    0.00036091616   2    1000005    25
    0.00021350419   2    1000005    23

DECAY 2000002  0.0006526249
    0.51988285   2    1000022    2
    0.48011236   2    1000023    2

DECAY 1000002  24.891127
    0.66336285   2    1000037    1
    0.33211621   2    1000025    2
    0.0028515523   2    1000024    1
    0.0010481306   2    1000035    2
    0.00033819255   2    1000022    2
    0.00028306328   2    1000023    2

DECAY 2000004  0.0022658419
    0.35580578   2    1000024    3
    0.32687134   2    1000022    4
    0.31732289   2    1000023    4

DECAY 1000004  24.902386
    0.66306301   2    1000037    3
    0.33196586   2    1000025    4
    0.0032392947   2    1000024    3
    0.0010476561   2    1000035    4
    0.00036945569   2    1000022    4
    0.00031469768   2    1000023    4

DECAY 1000006  42.743624
    0.51173698   2    1000024    5
    0.24532235   2    1000023    6
    0.24294284   2    1000022    6

DECAY 2000006  202.96726
    0.37411001   2    1000006    25
    0.26572923   2    1000006    23
    0.13682458   2    1000023    6
    0.13540015   2    1000022    6
    0.085864495   2    1000024    5
    0.001676379   2    1000037    5
    0.00039515919   2    1000005    24

DECAY 1000024  8.502044e-12
    0.60387077   3    1000022   -1    2
    0.20130901   3    1000022   -11    12
    0.19482022   3    1000022   -13    14

DECAY 1000037  27.048899
    0.20585445   2    1000024    25
    0.19518634   2    1000023    24
    0.19391348   2    1000024    23
    0.19307156   2    1000022    24
    0.036929115   2    1000024    36
    0.036915213   2    1000024    35
    0.036537505   2    37    1000023
    0.035359911   2    37    1000022
    0.026948754   2    1000006   -5
    0.016407189   3    1000024    6   -6
    0.011204112   3    1000022   -5    6
    0.011146035   3    1000023   -5    6
    0.00051026862   3    1000024    5   -5

DECAY 1000022 -1


DECAY 1000023  1.6334112e-09
    0.91142993   2    1000022    22
    0.025834232   3    1000022    12   -12
    0.019317274   3    1000022    1   -1
    0.018929796   3    1000022    3   -3
    0.015066367   3    1000022    2   -2
    0.0043596056   3    1000022    11   -11
    0.0042226867   3    1000022    13   -13
    0.00025486506   3    1000024    1   -2
    0.00025486506   3   -1000024   -1    2

DECAY 1000025  27.779211
    0.18947023   2    1000024   -24
    0.18947023   2   -1000024    24
    0.12452173   2    1000023    25
    0.10918299   2    1000022    25
    0.10349116   2    1000023    23
    0.085317881   2    1000022    23
    0.034220288   2    37   -1000024
    0.034220288   2   -37    1000024
    0.025616627   2    1000022    35
    0.022558088   2    1000023    35
    0.013272053   2    1000006   -6
    0.013272053   2   -1000006    6
    0.011645456   2    1000023    36
    0.010507775   2    1000022    36
    0.0097640768   3    1000024    5   -6
    0.0097640768   3   -1000024   -5    6
    0.0066432536   3    1000023    6   -6
    0.0065068814   3    1000022    6   -6
    0.00025914254   3    1000022    5   -5
    0.00025644951   3    1000023    5   -5

DECAY 1000035  84.01515
    0.12825904   2    1000006   -6
    0.12825904   2   -1000006    6
    0.084159365   2    1000015   -15
    0.084159365   2   -1000015    15
    0.0676737   2    2000002   -2
    0.0676737   2   -2000002    2
    0.067673699   2    2000004   -4
    0.067673699   2   -2000004    4
    0.030923163   2    1000024   -24
    0.030923163   2   -1000024    24
    0.021349718   2    1000005   -5
    0.021349718   2   -1000005    5
    0.017118867   2    1000023    25
    0.016391314   2    1000023    23
    0.016130437   2    37   -1000024
    0.016130437   2   -37    1000024
    0.015018314   2    1000022    25
    0.014810773   2    1000022    23
    0.0099352352   2    1000022    35
    0.0087426138   2    1000023    35
    0.007427347   2    1000023    36
    0.0066654945   2    1000022    36
    0.0066066006   2    1000014   -14
    0.0066066006   2   -1000014    14
    0.0066065253   2    1000012   -12
    0.0066065253   2   -1000012    12
    0.0065541949   2    1000013   -13
    0.0065541949   2   -1000013    13
    0.006554179   2    1000011   -11
    0.006554179   2   -1000011    11
    0.0030612797   2    2000006   -6
    0.0030612797   2   -2000006    6
    0.0025647257   2    2000005   -5
    0.0025647257   2   -2000005    5
    0.0020308916   3    1000024    5   -6
    0.0020308916   3   -1000024   -5    6
    0.001561136   3    1000023    6   -6
    0.0015350479   3    1000022    6   -6
    0.00015406075   2    1000037   -24
    0.00015406075   2   -1000037    24
    0.00012089781   2    1000025    25

DECAY 1000021  431.09011
    0.12753206   2    1000006   -6
    0.12753206   2   -1000006    6
    0.095363425   2    1000005   -5
    0.095363425   2   -1000005    5
    0.080580562   2    2000002   -2
    0.080580562   2   -2000002    2
    0.080580547   2    2000004   -4
    0.080580547   2   -2000004    4
    0.057417867   2    2000006   -6
    0.057417867   2   -2000006    6
    0.056860239   2    2000005   -5
    0.056860239   2   -2000005    5
    0.0012636474   2    1000006   -4
    0.0012636474   2   -1000006    4
    0.00039133196   3    1000025    6   -6
    0.00017401115   3    1000037    5   -6
    0.00017401115   3   -1000037   -5    6

DECAY 25  0.0038177248
    0.58334342   2   -5    5
    0.21871908   2   -24    24
    0.071815504   2    21    21
    0.067081112   2   -15    15
    0.028617406   2   -4    4
    0.026181065   2    23    23
    0.0023442421   2    22    22
    0.0014456376   2    22    23
    0.00023264776   2   -13    13
    0.00021912739   2   -3    3
    6.0586431e-07   2   -1    1
    1.4747386e-07   2   -2    2
    5.2301871e-09   2   -11    11

DECAY 35  30.489466
    0.84784819   2   -5    5
    0.1477301   2   -15    15
    0.0021949736   2   -6    6
    0.0010133947   2   -1000024    1000024
    0.00050982607   2   -13    13
    0.00031497582   2   -3    3
    0.00020451214   2    1000022    1000022
    0.00015189183   2    1000023    1000023
    1.7442914e-05   2    21    21
    1.0893608e-05   2    25    25
    1.8280571e-06   2    23    23
    1.0054842e-06   2   -24    24
    8.7077288e-07   2   -1    1
    3.0978292e-08   2   -4    4
    1.9899163e-08   2    22    22
    1.7582908e-08   2    1000022    1000023
    1.5086071e-08   2    22    23
    1.1451934e-08   2   -11    11
    1.5971174e-13   2   -2    2

DECAY 36  29.301057
    0.84774602   2   -5    5
    0.14771217   2   -15    15
    0.0021996457   2   -6    6
    0.0010927166   2   -1000024    1000024
    0.00050976238   2   -13    13
    0.00031493476   2   -3    3
    0.00019714902   2    1000022    1000022
    0.00018566289   2    1000023    1000023
    3.6835634e-05   2    21    21
    2.5535091e-06   2    23    25
    1.5991653e-06   2    1000022    1000023
    8.7066062e-07   2   -1    1
    3.0001466e-08   2   -4    4
    2.1172664e-08   2    22    22
    1.4097924e-08   2    22    23
    1.14505e-08   2   -11    11
    1.5468761e-13   2   -2    2
    6.3701682e-40   2    25    25

DECAY 37  30.278279
    0.84892879   2   -5    6
    0.14879296   2   -15    16
    0.0012608898   2   -5    4
    0.00052603673   2   -13    14
    0.00028774853   2   -3    4
    9.8650129e-05   2    1000023    1000024
    7.5362391e-05   2    1000022    1000024
    1.3407741e-05   2   -3    2
    9.0040588e-06   2   -5    2
    3.6767367e-06   2   -3    6
    2.4835528e-06   2    24    25
    7.9826757e-07   2   -1    2
    1.4937007e-07   2   -1    6
    3.846808e-08   2   -1    4
    1.2304054e-08   2   -11    12
    3.2739237e-12   2    24    35
    2.7559583e-12   2    24    36

DECAY 6  2.43
    1   2    5    24

DECAY 15 -1
