BLOCK SPINFO
   1   SPheno
   2   v4.0.5be

BLOCK SPHENOINFO
   1   2
   2   2

BLOCK MODSEL
   1   0

BLOCK MINPAR
   3    34.905551
   4    1

BLOCK EXTPAR
   0    1254.8927
   1    573.40204
   2    566.52053
   3    3000
   11    4067.0095
   12    1142.1891
   13    1531.4688
   23    671.24259
   25    33.75759
   26    1896.567
   31    792.52738
   32    792.52738
   33    1188.0269
   34    1835.9323
   35    1835.9323
   36    918.05689
   41    5000
   42    5000
   43    1434.2495
   44    5000
   45    5000
   46    1360.5458
   47    5000
   48    5000
   49    1273.5338

BLOCK SMINPUTS
   1    127.90897
   2    1.1663787e-05
   3    0.1184
   4    91.1876
   5    4.18
   6    173.2
   7    1.777
   8    0
   11    0.00051099893
   12    0
   13    0.10565837
   14    0
   21    0.005
   22    0.0025
   23    0.095
   24    1.27

BLOCK GAUGE Q=  1254.8927
   1    0.35536298
   2    0.66519887
   3    1.219778

BLOCK YU Q=  1254.8927
   1   1    8.3880501e-06
   2   2    0.0042611294
   3   3    1.0133438

BLOCK YD Q=  1254.8927
   1   1    0.00056900057
   2   2    0.010811011
   3   3    0.56427027

BLOCK YE Q=  1254.8927
   1   1    9.929476e-05
   2   2    0.020531007
   3   3    0.34529777

BLOCK AU Q=  1254.8927
   1   1    0
   2   2    0
   3   3    4067.0095

BLOCK AD Q=  1254.8927
   1   1    0
   2   2    0
   3   3    1142.1891

BLOCK AE Q=  1254.8927
   1   1    0
   2   2    0
   3   3    1531.4688

BLOCK MSOFT Q=  1254.8927
   1    573.40204
   2    566.52053
   3    3000
   21    3166467.4
   22   -367707.34
   31    792.52738
   32    792.52738
   33    1188.0269
   34    1835.9323
   35    1835.9323
   36    918.05689
   41    5000
   42    5000
   43    1434.2495
   44    5000
   45    5000
   46    1360.5458
   47    5000
   48    5000
   49    1273.5338

BLOCK MASS
   6    173.2
   23    91.1876
   24    80.429995
   15    1.777
   25    123.51797
   35    1895.9585
   36    1896.567
   37    1898.416
   1000001    5022.0109
   2000001    5011.6997
   1000002    5021.5915
   2000002    5013.0038
   1000003    5022.0152
   2000003    5011.7044
   1000004    5021.5949
   2000004    5013.0048
   1000005    1246.5972
   2000005    1353.7324
   1000006    1038.938
   2000006    1515.736
   1000011    799.16598
   2000011    1838.3848
   1000012    794.98668
   1000013    799.15897
   2000013    1838.3735
   1000014    794.98138
   1000015    916.82753
   2000015    1191.5172
   1000016    1187.5005
   1000021    3176.0504
   1000022    555.06069
   1000023    582.24079
   1000025   -678.54934
   1000035    713.91075
   1000024    569.78636
   1000037    708.96816

BLOCK ALPHA
      -0.028724805

BLOCK HMIX Q=  1254.8927
   1    671.24259
   2    33.75759
   3    244.13983
   4    3596966.5

BLOCK STOPMIX
   1   1   -0.61409788
   1   2    0.78922987
   2   1   -0.78922987
   2   2   -0.61409788

BLOCK SBOTMIX
   1   1    0.12823447
   1   2    0.99174388
   2   1   -0.99174388
   2   2    0.12823447

BLOCK STAUMIX
   1   1    0.065782213
   1   2    0.997834
   2   1   -0.997834
   2   2    0.065782213

BLOCK NMIX
   1   1   -0.70162411
   1   2    0.55510888
   1   3   -0.34416514
   1   4    0.28482995
   2   1    0.6805828
   2   2    0.70774311
   2   3   -0.14371952
   2   4    0.12349674
   3   1   -0.02440966
   3   2    0.043160869
   3   3    0.7049333
   3   4    0.70753823
   4   1   -0.20960637
   4   2    0.43484591
   4   3    0.60329437
   4   4   -0.63483077

BLOCK UMIX
   1   1   -0.86797365
   1   2    0.49661025
   2   1    0.49661025
   2   2    0.86797365

BLOCK VMIX
   1   1   -0.9074946
   1   2    0.42006375
   2   1    0.42006375
   2   2    0.9074946

BLOCK HIGGSBOUNDSINPUTHIGGSCOUPLINGSFERMIONS
       0, 1139.5749,3,36,15,15

BLOCK HIGGSBOUNDSINPUTHIGGSCOUPLINGSBOSONS
       0,4,36,21,21,23

BLOCK SPHENOLOWENERGY
   1    0.00037982944
   2    1.5852857e-06
   3    3.5201057e-05
   4    3.2796681e-15
   5    1.4010358e-10
   6    2.9318335e-08
   7    1.0964908e-13
   8    4.6841996e-09
   9    9.9309433e-07
   10    9.380296e-05
   11    0.96894867
   12    0.54415381
   13    19.430925
   14    0
   15    0
   16    0.0021719041
   17    2.2818089e-15
   18    2.4777639e-11
   19    8.2845641e-11
   20    1.3973928e-14
   21    5.9745063e-10
   22    1.2039344e-07
   23    0
   24    0
   25    0
   26    0
   27    0
   28    0
   29    0
   30    0
   31    0
   39    8.319441e-05
   40    0
   41    0
   42    0

BLOCK FWCOEF Q=  160
   305   4422   0   0   -0.18881911
   305   4422   0   2   -0.25453613
   305   4322   0   2   -0.00052897073
   305   6421   0   0   -0.095227835
   305   6421   0   2   -0.1388997
   305   6321   0   2   -0.00044694044
   3051111   4133   0   0    1.5857637
   3051111   4133   0   2    1.586637
   3051111   4233   0   2    0.00013773611
   3051111   4137   0   0   -4.4084558
   3051111   4137   0   2   -4.4016987
   3051111   4237   0   2   -0.0010808161
   3051313   4133   0   0    1.5857637
   3051313   4133   0   2    1.586633
   3051313   4233   0   2    0.00013773488
   3051313   4137   0   0   -4.4084558
   3051313   4137   0   2   -4.4017027
   3051313   4237   0   2   -0.001080817
   3051212   4137   0   0    1.5053501
   3051212   4137   0   2    1.5038974
   3051212   4237   0   2    0.00023587865
   3051414   4137   0   0    1.5053501
   3051414   4137   0   2    1.5038974
   3051414   4237   0   2    0.00023587883
   3051616   4137   0   0    1.5053501
   3051616   4137   0   2    1.5038972
   3051616   4237   0   2    0.00023592929

BLOCK IMFWCOEF Q=  160
   305   4422   0   0    3.8566135e-07
   305   4422   0   2    2.7691643e-05
   305   4322   0   2   -4.9469178e-06
   305   6421   0   0    3.3034445e-07
   305   6421   0   2   -3.3834294e-06
   305   6321   0   2   -2.3333779e-06
   3051111   4133   0   2   -2.4443469e-06
   3051111   4233   0   2    3.4843852e-06
   3051111   4137   0   2    1.7826632e-05
   3051111   4237   0   2   -2.7367236e-05
   3051313   4133   0   2   -2.444356e-06
   3051313   4233   0   2    3.4843781e-06
   3051313   4137   0   2    1.782672e-05
   3051313   4237   0   2   -2.7367266e-05
   3051212   4137   0   2   -3.4727602e-06
   3051212   4237   0   2    5.9726909e-06
   3051414   4137   0   2   -3.4727601e-06
   3051414   4237   0   2    5.9726909e-06
   3051616   4137   0   2   -3.4763988e-06
   3051616   4237   0   2    5.9726917e-06

DECAY 23  2.4952


DECAY 24  2.085


DECAY 1000011  2.2945479
    0.55837305   2   -1000024    12
    0.38734706   2    1000023    11
    0.034302711   2   -1000037    12
    0.013349348   2    1000022    11
    0.0065194972   2    1000035    11
    0.00010832595   2    1000025    11

DECAY 2000011  7.5160638
    0.49972788   2    1000022    11
    0.46078763   2    1000023    11
    0.038938091   2    1000035    11
    0.00054635992   2    1000025    11

DECAY 1000013  2.2950317
    0.5582302   2   -1000024    14
    0.387258   2    1000023    13
    0.034290734   2   -1000037    14
    0.013437849   2    1000022    13
    0.0065617511   2    1000035    13
    0.00022147317   2    1000025    13

DECAY 2000013  7.5398747
    0.4983447   2    1000022    13
    0.45936287   2    1000023    13
    0.039351833   2    1000035    13
    0.0013027376   2    1000025    13
    0.0011162781   2   -1000037    14
    0.00041202907   2   -1000024    14
    0.00010954502   2    1000013    25

DECAY 1000015  2.7256987
    0.38786415   2    1000022    15
    0.28906711   2    1000023    15
    0.11020618   2   -1000024    16
    0.083186396   2   -1000037    16
    0.080121496   2    1000025    15
    0.049554674   2    1000035    15

DECAY 2000015  11.071741
    0.4063909   2   -1000024    16
    0.31586394   2    1000023    15
    0.10902681   2   -1000037    16
    0.064780504   2    1000035    15
    0.058972267   2    1000025    15
    0.019650298   2    1000022    15
    0.012723997   2    1000015    23
    0.012591281   2    1000015    25

DECAY 1000012  2.3386902
    0.58281117   2    1000024    11
    0.3398638   2    1000022    12
    0.038089892   2    1000023    12
    0.022124061   2    1000037    11
    0.016762782   2    1000035    12
    0.00034829338   2    1000025    12

DECAY 1000014  2.3391922
    0.58282423   2    1000024    13
    0.33978   2    1000022    14
    0.038080291   2    1000023    14
    0.022210078   2    1000037    13
    0.016757213   2    1000035    14
    0.00034819143   2    1000025    14

DECAY 1000016  11.199807
    0.49174737   2    1000024    15
    0.24649443   2    1000022    16
    0.14709269   2    1000037    15
    0.056903611   2    1000035    16
    0.031894769   2    1000023    16
    0.025198505   2    1000015    24
    0.00066861822   2    1000025    16

DECAY 2000001  144.37385
    0.98112728   2    1000021    1
    0.0093078311   2    1000022    1
    0.0087360984   2    1000023    1
    0.00081733971   2    1000035    1

DECAY 1000001  207.80522
    0.68681245   2    1000021    1
    0.15617581   2   -1000024    2
    0.050396489   2   -1000037    2
    0.047998727   2    1000022    1
    0.035618783   2    1000023    1
    0.022766271   2    1000035    1
    0.00023146574   2    1000025    1

DECAY 2000003  144.39674
    0.98097511   2    1000021    3
    0.009315659   2    1000022    3
    0.0087363425   2    1000023    3
    0.00084532998   2    1000035    3

DECAY 1000003  207.81869
    0.68677005   2    1000021    3
    0.15616724   2   -1000024    4
    0.05040026   2   -1000037    4
    0.048002122   2    1000022    3
    0.035617628   2    1000023    3
    0.022784412   2    1000035    3
    0.00025829052   2    1000025    3

DECAY 1000005  8.3932977
    0.22956275   2   -1000037    6
    0.2273422   2    1000025    5
    0.20919814   2   -1000024    6
    0.14118151   2    1000022    5
    0.12757568   2    1000035    5
    0.043439305   2    1000023    5
    0.021700422   2    1000006   -24

DECAY 2000005  69.795766
    0.56186117   2    1000006   -24
    0.21330119   2   -1000037    6
    0.1008891   2   -1000024    6
    0.037708075   2    1000035    5
    0.034965231   2    1000025    5
    0.031146583   2    1000022    5
    0.020029448   2    1000023    5

DECAY 2000002  152.68659
    0.92860114   2    1000021    2
    0.035213854   2    1000022    2
    0.033050963   2    1000023    2
    0.0030919398   2    1000035    2

DECAY 1000002  207.80325
    0.68660868   2    1000021    2
    0.17070838   2    1000024    1
    0.071134258   2    1000023    2
    0.036055008   2    1000037    1
    0.019203971   2    1000022    2
    0.016135254   2    1000035    2
    0.0001544423   2    1000025    2

DECAY 2000004  152.69012
    0.92857994   2    1000021    4
    0.035213957   2    1000022    4
    0.033050387   2    1000023    4
    0.0030964755   2    1000035    4

DECAY 1000004  207.81655
    0.68656611   2    1000021    4
    0.17071101   2    1000024    3
    0.07112986   2    1000023    4
    0.036093303   2    1000037    3
    0.019203428   2    1000022    4
    0.016137645   2    1000035    4
    0.00015864002   2    1000025    4

DECAY 1000006  14.272779
    0.37268177   2    1000037    5
    0.27270225   2    1000035    6
    0.27193203   2    1000025    6
    0.039211916   2    1000023    6
    0.021764969   2    1000024    5
    0.011483831   2    1000023    4
    0.0068224034   2    1000022    6
    0.0033562057   2    1000022    4

DECAY 2000006  90.344942
    0.43326126   2    1000006    23
    0.14581281   2    1000024    5
    0.095208487   2    1000025    6
    0.08695704   2    2000005    24
    0.054933925   2    1000022    6
    0.054382664   2    1000037    5
    0.047333293   2    1000035    6
    0.038447004   2    1000006    25
    0.035762697   2    1000023    6
    0.0079008174   2    1000005    24

DECAY 1000024  1.3426688e-06
    0.33852273   3    1000022   -1    2
    0.32642422   3    1000022   -3    4
    0.114705   3    1000022   -11    12
    0.11467669   3    1000022   -13    14
    0.10567136   3    1000022   -15    16

DECAY 1000037  1.0575128
    0.43653821   2    1000023    24
    0.36912433   2    1000024    23
    0.13785616   2    1000024    25
    0.056380175   2    1000022    24

DECAY 1000022 -1


DECAY 1000023  1.4845433e-06
    0.16883083   3    1000024    1   -2
    0.16883083   3   -1000024   -1    2
    0.16044618   3    1000024    3   -4
    0.16044618   3   -1000024   -3    4
    0.05735015   3    1000024    11   -12
    0.05735015   3   -1000024   -11    12
    0.057329625   3    1000024    13   -14
    0.057329625   3   -1000024   -13    14
    0.051204034   3    1000024    15   -16
    0.051204034   3   -1000024   -15    16
    0.0029477396   2    1000022    22
    0.0011562616   3    1000022    5   -5
    0.0011143559   3    1000022    1   -1
    0.0011142322   3    1000022    3   -3
    0.00084680588   3    1000022    2   -2
    0.00082669182   3    1000022    4   -4
    0.00066917539   3    1000022    12   -12
    0.00039602616   3    1000022    13   -13
    0.00039586872   3    1000022    11   -11
    0.00021121128   3    1000022    15   -15

DECAY 1000025  2.7384469
    0.38771412   2    1000022    23
    0.29467387   2    1000024   -24
    0.29467387   2   -1000024    24
    0.02259805   2    1000023    23
    0.00013210209   2    1000022    22
    0.00010229667   3    1000022    5   -5

DECAY 1000035  1.2293679
    0.39288792   2    1000024   -24
    0.39288792   2   -1000024    24
    0.19614265   2    1000022    25
    0.011519972   2    1000023    25
    0.0060373476   2    1000022    23
    0.00036585902   2    1000023    23

DECAY 1000021  270.63984
    0.15471831   2    1000006   -6
    0.15471831   2   -1000006    6
    0.12419292   2    1000005   -5
    0.12419292   2   -1000005    5
    0.11640341   2    2000005   -5
    0.11640341   2   -2000005    5
    0.089245577   2    2000006   -6
    0.089245577   2   -2000006    6
    0.0153553   2    1000006   -4
    0.0153553   2   -1000006    4

DECAY 25  0.0037023239
    0.59964908   2   -5    5
    0.20438486   2   -24    24
    0.069793845   2    21    21
    0.068501564   2   -15    15
    0.029445607   2   -4    4
    0.024017455   2    23    23
    0.0023707811   2    22    22
    0.0013745605   2    22    23
    0.00023760919   2   -13    13
    0.00022385805   2   -3    3
    6.1894435e-07   2   -1    1
    1.517452e-07   2   -2    2
    5.3417386e-09   2   -11    11

DECAY 35  37.153855
    0.44659128   2   -5    5
    0.13865238   2   -15    15
    0.1006954   2   -1000024    1000037
    0.1006954   2   -1000037    1000024
    0.081096298   2    1000022    1000025
    0.038160162   2   -1000024    1000024
    0.027294248   2    1000022    1000022
    0.022965117   2    1000025    1000035
    0.017031109   2    1000022    1000035
    0.012792997   2   -1000037    1000037
    0.011501351   2    1000035    1000035
    0.00051183077   2   -6    6
    0.00049245341   2   -13    13
    0.00039450469   2    1000023    1000025
    0.00034838236   2    1000022    1000023
    0.00026493363   2   -3    3
    0.00024929327   2    1000025    1000025
    0.00019195429   2   -1000015    1000015
    6.231238e-05   2    1000023    1000035
    2.2683202e-06   2    25    25
    2.1070813e-06   2    21    21
    1.069999e-06   2    1000023    1000023
    7.3252726e-07   2   -1    1
    3.4902725e-07   2    22    23
    3.1088681e-07   2    23    23
    1.7795724e-07   2   -24    24
    1.7145649e-07   2   -1000011    1000011
    1.7028102e-07   2   -1000013    1000013
    9.235449e-08   2    22    22
    1.3642821e-08   2   -4    4
    1.1061786e-08   2   -11    11
    7.0347019e-14   2   -2    2

DECAY 36  36.38361
    0.44019212   2   -5    5
    0.13662425   2   -15    15
    0.080402267   2   -1000024    1000037
    0.080402267   2   -1000037    1000024
    0.063494394   2   -1000024    1000024
    0.045154165   2    1000022    1000022
    0.04362225   2    1000022    1000025
    0.034479866   2    1000022    1000035
    0.033242414   2   -1000037    1000037
    0.029574256   2    1000035    1000035
    0.01007637   2    1000025    1000035
    0.00059616814   2    1000022    1000023
    0.00057416152   2   -6    6
    0.00048525213   2   -13    13
    0.00045957979   2    1000025    1000025
    0.0002610478   2   -3    3
    0.00020297809   2    1000023    1000025
    0.00013227431   2    1000023    1000035
    2.0153213e-05   2    21    21
    1.8976214e-06   2    1000023    1000023
    7.2178145e-07   2   -1    1
    4.6393738e-07   2    22    23
    4.2464305e-07   2    23    25
    2.4092628e-07   2    22    22
    1.3718061e-08   2   -4    4
    1.0900031e-08   2   -11    11
    7.0742757e-14   2   -2    2
    5.1316062e-36   2    25    25

DECAY 37  35.574815
    0.43795626   2   -5    6
    0.13002668   2   -15    16
    0.11004435   2    1000024    1000025
    0.10625363   2    1000024    1000035
    0.080704796   2    1000022    1000037
    0.078579748   2    1000023    1000037
    0.029192508   2    1000023    1000024
    0.019789929   2    1000025    1000037
    0.0036470251   2    1000022    1000024
    0.0024244522   2    1000035    1000037
    0.00064992886   2   -5    4
    0.00045969123   2   -13    14
    0.00024912944   2   -3    4
    1.1604421e-05   2   -3    2
    4.6411651e-06   2   -5    2
    2.9232386e-06   2   -3    6
    7.0748888e-07   2   -1000011    1000012
    7.0575547e-07   2   -1000013    1000014
    6.9154586e-07   2   -1    2
    4.3626825e-07   2    24    25
    1.1741699e-07   2   -1    6
    3.3204696e-08   2   -1    4
    1.0752226e-08   2   -11    12
    3.4267785e-12   2    24    35
    8.2639265e-13   2    24    36

DECAY 6  2.43
    1   2    5    24

DECAY 15 -1
