BLOCK SPINFO
   1   SPheno
   2   v4.0.5be

BLOCK SPHENOINFO
   1   2
   2   2

BLOCK MODSEL
   1   0

BLOCK MINPAR
   3    14.131539
   4    1

BLOCK EXTPAR
   0    3150.59
   1   -702.53886
   2    2087.1919
   3    4594.6772
   11   -5341.0451
   12    5076.5028
   13   -1737.1666
   23    524.35339
   25    13.50123
   26    4777.4755
   31    2567.3099
   32    2567.3099
   33    4100.9606
   34    3806.5682
   35    3806.5682
   36    3820.7754
   41    1992.331
   42    1992.331
   43    3955.1327
   44    3718.3406
   45    3718.3406
   46    2425.2974
   47    3143.2017
   48    3143.2017
   49    1203.2525

BLOCK SMINPUTS
   1    127.90897
   2    1.1663787e-05
   3    0.1184
   4    91.1876
   5    4.18
   6    173.2
   7    1.777
   8    0
   11    0.00051099893
   12    0
   13    0.10565837
   14    0
   21    0.005
   22    0.0025
   23    0.095
   24    1.27

BLOCK GAUGE Q=  3150.59
   1    0.35536298
   2    0.66519887
   3    1.219778

BLOCK YU Q=  3150.59
   1   1    8.4073389e-06
   2   2    0.0042709281
   3   3    1.0156741

BLOCK YD Q=  3150.59
   1   1    0.0002280931
   2   2    0.0043337688
   3   3    0.22619688

BLOCK YE Q=  3150.59
   1   1    3.9803913e-05
   2   2    0.0082301868
   3   3    0.1384182

BLOCK AU Q=  3150.59
   1   1    0
   2   2    0
   3   3   -5341.045

BLOCK AD Q=  3150.59
   1   1    0
   2   2    0
   3   3    5076.5031

BLOCK AE Q=  3150.59
   1   1    0
   2   2    0
   3   3   -1737.1666

BLOCK MSOFT Q=  3150.59
   1   -702.53886
   2    2087.1919
   3    4594.6772
   21    22375872
   22   -50471.149
   31    2567.3099
   32    2567.3099
   33    4100.9606
   34    3806.5682
   35    3806.5682
   36    3820.7754
   41    1992.331
   42    1992.331
   43    3955.1327
   44    3718.3406
   45    3718.3406
   46    2425.2974
   47    3143.2017
   48    3143.2017
   49    1203.2525

BLOCK MASS
   6    173.2
   23    91.1876
   24    80.429995
   15    1.777
   25    124.41445
   35    4777.0073
   36    4777.4755
   37    4777.8765
   1000001    2138.4938
   2000001    3262.1485
   1000002    2136.9837
   2000002    3835.061
   1000003    2138.493
   2000003    3262.1478
   1000004    2136.9829
   2000004    3835.0605
   1000005    1330.1341
   2000005    4030.2279
   1000006    2456.988
   2000006    4039.9942
   1000011    2584.7348
   2000011    3811.1964
   1000012    2583.1284
   1000013    2584.7325
   2000013    3811.1923
   1000014    2583.126
   1000015    3824.3562
   2000015    4111.8764
   1000016    4110.6991
   1000021    4568.0701
   1000022   -530.76835
   1000023    533.35785
   1000025   -704.34773
   1000035    2121.7139
   1000024    533.3989
   1000037    2121.9049

BLOCK ALPHA
      -0.070716255

BLOCK HMIX Q=  3150.59
   1    524.35339
   2    13.50123
   3    243.18777
   4    22824272

BLOCK STOPMIX
   1   1    0.075458047
   1   2    0.99714898
   2   1   -0.99714898
   2   2    0.075458047

BLOCK SBOTMIX
   1   1    0.00032151948
   1   2    0.99999995
   2   1   -0.99999995
   2   2    0.00032151948

BLOCK STAUMIX
   1   1    0.0069205494
   1   2    0.99997605
   2   1   -0.99997605
   2   2    0.0069205494

BLOCK NMIX
   1   1    0.17020284
   1   2    0.019004391
   1   3    0.69966829
   1   4    0.69363832
   2   1   -0.027328787
   2   2   -0.037265418
   2   3    0.70714065
   2   4   -0.70556114
   3   1    0.98502981
   3   2   -0.0036655664
   3   3   -0.10126807
   3   4   -0.13945473
   4   1    0.00064289481
   4   2   -0.99911795
   4   3   -0.012695115
   4   4    0.040021686

BLOCK UMIX
   1   1   -0.017956378
   1   2    0.99983877
   2   1    0.99983877
   2   2    0.017956378

BLOCK VMIX
   1   1   -0.056626373
   1   2    0.99839544
   2   1    0.99839544
   2   2    0.056626373

BLOCK HIGGSBOUNDSINPUTHIGGSCOUPLINGSFERMIONS
       0, 182.28321,3,36,15,15

BLOCK HIGGSBOUNDSINPUTHIGGSCOUPLINGSBOSONS
       0,4,36,21,21,23

BLOCK SPHENOLOWENERGY
   1    0.00031817563
   2    1.5912235e-06
   3    3.5266741e-05
   4    2.6470668e-15
   5    1.1307966e-10
   6    2.3670191e-08
   7    8.9103521e-14
   8    3.8064986e-09
   9    8.0732838e-07
   10    9.6758124e-05
   11    0.99947438
   12    0.5420357
   13    19.367094
   14    0
   15    0
   16    0.0021575136
   17    2.2816602e-15
   18    2.4809569e-11
   19    8.2927169e-11
   20    5.9386623e-16
   21    2.538961e-11
   22    5.0113895e-09
   23    0
   24    0
   25    0
   26    0
   27    0
   28    0
   29    0
   30    0
   31    0
   39    6.0368099e-06
   40    0
   41    0
   42    0

BLOCK FWCOEF Q=  160
   305   4422   0   0   -0.18881911
   305   4422   0   2   -0.1858971
   305   4322   0   2    0.00010790442
   305   6421   0   0   -0.095227835
   305   6421   0   2   -0.096449351
   305   6321   0   2    7.9268663e-06
   3051111   4133   0   0    1.6179311
   3051111   4133   0   2    1.6183517
   3051111   4233   0   2    3.3943105e-05
   3051111   4137   0   0   -4.4406232
   3051111   4137   0   2   -4.440344
   3051111   4237   0   2   -0.00025414993
   3051313   4133   0   0    1.6179311
   3051313   4133   0   2    1.6183516
   3051313   4233   0   2    3.39431e-05
   3051313   4137   0   0   -4.4406232
   3051313   4137   0   2   -4.4403442
   3051313   4237   0   2   -0.00025414994
   3051212   4137   0   0    1.5053501
   3051212   4137   0   2    1.5052925
   3051212   4237   0   2    5.5064197e-05
   3051414   4137   0   0    1.5053501
   3051414   4137   0   2    1.5052925
   3051414   4237   0   2    5.5064197e-05
   3051616   4137   0   0    1.5053501
   3051616   4137   0   2    1.5052925
   3051616   4237   0   2    5.5064327e-05

BLOCK IMFWCOEF Q=  160
   305   4422   0   0    3.8583314e-07
   305   4422   0   2    4.7042221e-06
   305   4322   0   2    2.9463297e-06
   305   6421   0   0    3.304916e-07
   305   6421   0   2    1.962178e-07
   305   6321   0   2    1.548361e-06
   3051111   4133   0   2    3.5474984e-07
   3051111   4233   0   2    6.4856736e-07
   3051111   4137   0   2   -1.898473e-06
   3051111   4237   0   2   -4.8566386e-06
   3051313   4133   0   2    3.5474688e-07
   3051313   4233   0   2    6.485673e-07
   3051313   4137   0   2   -1.8984738e-06
   3051313   4237   0   2   -4.8566388e-06
   3051212   4137   0   2    4.6247709e-07
   3051212   4237   0   2    1.0522419e-06
   3051414   4137   0   2    4.6247708e-07
   3051414   4237   0   2    1.0522419e-06
   3051616   4137   0   2    4.6219147e-07
   3051616   4237   0   2    1.0522433e-06

DECAY 23  2.4952


DECAY 24  2.085


DECAY 1000011  6.4490504
    0.41283069   2    1000025    11
    0.37498521   2   -1000037    12
    0.18723287   2    1000035    11
    0.019558572   2    1000022    11
    0.0043498881   2    1000023    11
    0.0010427733   2   -1000024    12

DECAY 2000011  17.880429
    0.96939703   2    1000025    11
    0.029833886   2    1000022    11
    0.00076886603   2    1000023    11

DECAY 1000013  6.4522081
    0.41263283   2    1000025    13
    0.37479856   2   -1000037    14
    0.1871397   2    1000035    13
    0.019791499   2    1000022    13
    0.0045951542   2    1000023    13
    0.0010422619   2   -1000024    14

DECAY 2000013  17.890305
    0.96886352   2    1000025    13
    0.029952482   2    1000022    13
    0.00090642529   2    1000023    13
    0.00027584819   2   -1000024    14

DECAY 1000015  20.755265
    0.83890116   2    1000025    15
    0.067583581   2   -1000024    16
    0.059018909   2    1000022    15
    0.03448439   2    1000023    15

DECAY 2000015  35.642959
    0.54650948   2   -1000037    16
    0.27271384   2    1000035    15
    0.13118387   2    1000025    15
    0.026650695   2    1000022    15
    0.022541805   2    1000023    15
    0.00026777776   2   -1000024    16

DECAY 1000012  6.4611043
    0.42335562   2    1000025    12
    0.37105806   2    1000037    11
    0.18606428   2    1000035    12
    0.010343353   2    1000024    11
    0.0083500903   2    1000022    12
    0.0008285945   2    1000023    12

DECAY 1000014  6.4642594
    0.42314848   2    1000025    14
    0.37087385   2    1000037    13
    0.18597188   2    1000035    14
    0.010831589   2    1000024    13
    0.0083460059   2    1000022    14
    0.00082818919   2    1000023    14

DECAY 1000016  35.653146
    0.54440229   2    1000037    15
    0.27281349   2    1000035    16
    0.13424796   2    1000025    16
    0.045609571   2    1000024    15
    0.0025382556   2    1000022    16
    0.00025200941   2    1000023    16
    0.00013642931   2    1000015    24

DECAY 1000001  0.26178105
    0.91642065   2    1000025    1
    0.033196914   2    1000023    1
    0.020391449   2   -1000024    2
    0.017169338   2   -1000037    2
    0.0087719769   2    1000035    1
    0.0040496689   2    1000022    1

DECAY 2000001  1.6574886
    0.96905076   2    1000025    1
    0.03016882   2    1000022    1
    0.00077832333   2    1000023    1

DECAY 1000003  0.26314344
    0.9117009   2    1000025    3
    0.034355954   2    1000023    3
    0.022866004   2   -1000024    4
    0.017018144   2   -1000037    4
    0.0087251981   2    1000035    3
    0.0053338035   2    1000022    3

DECAY 2000003  1.6597993
    0.96770841   2    1000025    3
    0.030466433   2    1000022    3
    0.0011241457   2    1000023    3
    0.00069539369   2   -1000024    4

DECAY 1000005  2.2485746
    0.40349   2   -1000024    6
    0.21492204   2    1000022    5
    0.21226901   2    1000023    5
    0.16931896   2    1000025    5

DECAY 2000005  174.43078
    0.45443977   2   -1000024    6
    0.35918742   2    1000006   -24
    0.10741067   2   -1000037    6
    0.053059558   2    1000035    5
    0.011453961   2    1000023    5
    0.011128026   2    1000022    5
    0.0032938886   2    1000025    5

DECAY 1000002  0.31390122
    0.70222453   2    1000025    2
    0.16897427   2    1000024    1
    0.064154645   2    1000022    2
    0.046770223   2    1000023    2
    0.011812643   2    1000037    1
    0.0060636938   2    1000035    2

DECAY 2000002  8.0035422
    0.9694085   2    1000025    2
    0.029822705   2    1000022    2
    0.00076857883   2    1000023    2

DECAY 1000004  0.31526936
    0.69921906   2    1000025    4
    0.17045876   2    1000024    3
    0.064912411   2    1000022    4
    0.047638922   2    1000023    4
    0.01175937   2    1000037    3
    0.0060114792   2    1000035    4

DECAY 2000004  8.0062107
    0.96908762   2    1000025    4
    0.029893534   2    1000022    4
    0.00085159412   2    1000023    4
    0.0001666318   2    1000024    3

DECAY 1000006  95.225402
    0.4793228   2    1000024    5
    0.23634241   2    1000023    6
    0.22893599   2    1000022    6
    0.055395902   2    1000025    6

DECAY 2000006  188.871
    0.23771621   2    1000006    25
    0.21010257   2    1000023    6
    0.20510247   2    1000022    6
    0.1673594   2    1000006    23
    0.099154785   2    1000037    5
    0.050186279   2    1000035    6
    0.021519672   2    1000024    5
    0.0088413367   2    1000025    6

DECAY 1000024  3.4497215e-10
    0.49805139   3    1000022   -1    2
    0.16601734   3    1000022   -11    12
    0.16469078   3    1000022   -13    14
    0.15722744   3    1000022   -3    4
    0.014013053   3    1000022   -15    16

DECAY 1000037  19.658099
    0.24938349   2    1000024    25
    0.23890479   2    1000023    24
    0.23870741   2    1000024    23
    0.23323993   2    1000022    24
    0.014188106   3    1000024    6   -6
    0.010136523   3    1000023   -5    6
    0.0084598799   3    1000022   -5    6
    0.0065887255   2    1000025    24
    0.00022947677   3    1000025   -5    6

DECAY 1000022 -1


DECAY 1000023  3.8324315e-09
    0.92967553   2    1000022    22
    0.0206793   3    1000022    12   -12
    0.015463007   3    1000022    1   -1
    0.015223324   3    1000022    3   -3
    0.01206036   3    1000022    2   -2
    0.0034896496   3    1000022    11   -11
    0.0034048104   3    1000022    13   -13

DECAY 1000025  1.4231291
    0.24670242   2    1000023    23
    0.24075271   2    1000024   -24
    0.24075271   2   -1000024    24
    0.15696713   2    1000023    25
    0.10886644   2    1000022    25
    0.0059125503   2    1000022    23

DECAY 1000035  21.516303
    0.21882848   2    1000024   -24
    0.21882848   2   -1000024    24
    0.17909642   2    1000023    25
    0.16756078   2    1000022    23
    0.13145833   2    1000022    25
    0.046204556   2    1000023    23
    0.0089078807   3    1000024    5   -6
    0.0089078807   3   -1000024   -5    6
    0.0058445702   3    1000023    6   -6
    0.0050397962   2    1000025    23
    0.004906206   3    1000022    6   -6
    0.0041360829   2    1000025    25
    0.00012755575   3    1000025    6   -6

DECAY 1000021  611.82855
    0.092556985   2    1000005   -5
    0.092556985   2   -1000005    5
    0.067427829   2    1000004   -4
    0.067427829   2   -1000004    4
    0.067427806   2    1000002   -2
    0.067427806   2   -1000002    2
    0.067374429   2    1000003   -3
    0.067374429   2   -1000003    3
    0.0673744   2    1000001   -1
    0.0673744   2   -1000001    1
    0.054828609   2    1000006   -6
    0.054828609   2   -1000006    6
    0.026534817   2    2000003   -3
    0.026534817   2   -2000003    3
    0.026534792   2    2000001   -1
    0.026534792   2   -2000001    1
    0.0096279702   2    2000004   -4
    0.0096279702   2   -2000004    4
    0.0096279686   2    2000002   -2
    0.0096279686   2   -2000002    2
    0.0054269931   2    2000005   -5
    0.0054269931   2   -2000005    5
    0.0052447557   2    2000006   -6
    0.0052447557   2   -2000006    6

DECAY 25  0.0037947805
    0.58116338   2   -5    5
    0.21954165   2   -24    24
    0.07314756   2    21    21
    0.066824663   2   -15    15
    0.028799131   2   -4    4
    0.026268284   2    23    23
    0.0023518233   2    22    22
    0.0014526591   2    22    23
    0.00023176821   2   -13    13
    0.00021832081   2   -3    3
    6.0363457e-07   2   -1    1
    1.4841046e-07   2   -2    2
    5.2104139e-09   2   -11    11

DECAY 35  54.992451
    0.22693365   2   -1000024    1000037
    0.22693365   2   -1000037    1000024
    0.17038942   2   -5    5
    0.14013876   2    1000022    1000035
    0.084483445   2    1000023    1000035
    0.049396957   2    1000022    1000025
    0.041195858   2    1000023    1000025
    0.035113534   2   -15    15
    0.015782043   2   -6    6
    0.0027171345   2    1000025    1000035
    0.0021781988   2   -1000024    1000024
    0.00169874   2    1000025    1000025
    0.0014258423   2    1000022    1000022
    0.0012097248   2    1000022    1000023
    0.00017102874   2    1000023    1000023
    0.00012277055   2   -13    13
    6.5971984e-05   2   -3    3
    1.6593741e-05   2   -1000037    1000037
    9.1711889e-06   2    25    25
    8.3234058e-06   2    1000035    1000035
    1.9824067e-06   2   -1000001    1000001
    1.9822064e-06   2   -1000003    1000003
    1.3532946e-06   2   -1000002    1000002
    1.352522e-06   2   -1000004    1000004
    1.2295104e-06   2    23    23
    5.6788528e-07   2    21    21
    2.1327175e-07   2   -24    24
    2.0758819e-07   2   -4    4
    1.8237878e-07   2   -1    1
    5.4111384e-08   2    22    23
    4.052284e-08   2    22    22
    1.4801124e-08   2   -1000005    1000005
    2.7569688e-09   2   -11    11
    1.0699403e-12   2   -2    2

DECAY 36  54.492987
    0.22879694   2   -1000024    1000037
    0.22879694   2   -1000037    1000024
    0.16554454   2   -5    5
    0.14406905   2    1000023    1000035
    0.083778104   2    1000022    1000035
    0.051802073   2    1000023    1000025
    0.040297129   2    1000022    1000025
    0.034115819   2   -15    15
    0.014410541   2   -6    6
    0.0025249197   2   -1000024    1000024
    0.0014465486   2    1000025    1000035
    0.0013158148   2    1000022    1000023
    0.0012576408   2    1000025    1000025
    0.0011401556   2    1000022    1000022
    0.00024060416   2    1000023    1000023
    0.0001785971   2   -1000037    1000037
    0.00011928197   2   -13    13
    8.9424635e-05   2    1000035    1000035
    6.4097614e-05   2   -3    3
    7.9763975e-06   2    21    21
    3.2366146e-06   2    23    25
    1.8869065e-07   2   -4    4
    1.7719753e-07   2   -1    1
    1.0313515e-07   2    22    23
    8.5029908e-08   2    22    22
    2.6786262e-09   2   -11    11
    9.7257942e-13   2   -2    2
    4.2563196e-40   2    25    25

DECAY 37  55.48885
    0.22613631   2    1000023    1000037
    0.22521529   2    1000024    1000035
    0.22107356   2    1000022    1000037
    0.19286594   2   -5    6
    0.089548124   2    1000024    1000025
    0.034387729   2   -15    16
    0.0048245868   2    1000022    1000024
    0.0041101174   2    1000025    1000037
    0.00074481578   2   -1000005    1000006
    0.00039242627   2    1000023    1000024
    0.00026231908   2   -5    4
    0.00021306054   2   -1000005    1000004
    0.00012157285   2   -13    14
    6.0400719e-05   2   -3    4
    2.3198637e-05   2   -3    6
    3.194128e-06   2   -1000003    1000006
    3.1801051e-06   2    24    25
    3.1077905e-06   2   -1000001    1000002
    3.1022386e-06   2   -1000003    1000004
    2.8338458e-06   2   -3    2
    1.8732263e-06   2   -5    2
    1.5214719e-06   2   -1000005    1000002
    1.0598707e-06   2   -1    6
    1.6702268e-07   2   -1    2
    1.6617821e-07   2   -1000003    1000002
    1.659773e-07   2   -1000001    1000004
    1.464973e-07   2   -1000001    1000006
    1.7488473e-08   2   -1    4
    2.8436015e-09   2   -11    12
    3.2132215e-11   2    1000035    1000037

DECAY 6  2.43
    1   2    5    24

DECAY 15 -1
