BLOCK DCINFO
   1   SDECAY/HDECAY
   2   1.3b /3.4

BLOCK SPINFO
   1   SOFTSUSY
   2   3.4.0

BLOCK MODSEL
   1   0

BLOCK SMINPUTS
   1    127.90897
   2    1.1663787e-05
   3    0.1184
   4    91.1876
   5    4.18
   6    173.2
   7    1.777

BLOCK MINPAR
   3    33.13

BLOCK EXTPAR
   0   -1
   1    436.42
   2   -2289.28
   3    3444.67
   11   -3912.72
   12    3728.95
   13   -1448.3
   23    300.95
   26    2620.69
   31    3985.45
   32    3985.45
   33    966.58
   34    2183.06
   35    2183.06
   36    2194.38
   41    3054.4
   42    3054.4
   43    3832.68
   44    1114.75
   45    1114.75
   46    2175.93
   47    2556.66
   48    2556.66
   49    3631.98

BLOCK MASS
   24    80.383005
   25    126.20408
   35    2620.7074
   36    2620.69
   37    2622.2964
   5    4.8187603
   1000001    3172.7627
   2000001    2668.5286
   1000002    3171.8993
   2000002    1271.7925
   1000003    3172.7627
   2000003    2668.5286
   1000004    3171.8993
   2000004    1271.7925
   1000005    3711.2898
   2000005    3889.7159
   1000006    2243.7335
   2000006    3895.9484
   1000011    3998.2718
   2000011    2182.1785
   1000012    3997.1577
   1000013    3998.2718
   2000013    2182.1785
   1000014    3997.1577
   1000015    1002.1192
   2000015    2185.9407
   1000016    998.76188
   1000021    3537.2486
   1000022    308.37658
   1000023   -315.85638
   1000025    439.92415
   1000035   -2334.1304
   1000024    316.06304
   1000037    2334.2945

BLOCK NMIX
   1   1    0.25435286
   1   2    0.020663512
   1   3    0.69134036
   1   4   -0.67596312
   2   1   -0.040830614
   2   2   -0.026339207
   2   3    0.70632215
   2   4    0.70622102
   3   1    0.96624901
   3   2   -0.005960777
   3   3   -0.15213768
   3   4    0.20780145
   4   1   -0.00057200522
   4   2    0.9994217
   4   3    0.0034135611
   4   4    0.033827294

BLOCK UMIX
   1   1   -0.0048302118
   1   2    0.99998833
   2   1   -0.99998833
   2   2   -0.0048302118

BLOCK VMIX
   1   1    0.047841051
   1   2    0.99885496
   2   1    0.99885496
   2   2   -0.047841051

BLOCK STOPMIX
   1   1    0.054971458
   1   2    0.99848793
   2   1   -0.99848793
   2   2    0.054971458

BLOCK SBOTMIX
   1   1    0.010742083
   1   2    0.9999423
   2   1   -0.9999423
   2   2    0.010742083

BLOCK STAUMIX
   1   1    0.99998696
   1   2    0.0051066457
   2   1   -0.0051066457
   2   2    0.99998696

BLOCK ALPHA
      -0.031237375

BLOCK HMIX Q=  2888.337
   1    306.50409
   2    32.104164
   3    242.59178
   4    6614605.2

BLOCK GAUGE Q=  2888.337
   1    0.36515175
   2    0.63707624
   3    1.0086281

BLOCK AU Q=  2888.337
   1   1    0
   2   2    0
   3   3   -3912.72

BLOCK AD Q=  2888.337
   1   1    0
   2   2    0
   3   3    3728.95

BLOCK AE Q=  2888.337
   1   1    0
   2   2    0
   3   3   -1448.3

BLOCK YU Q=  2888.337
   1   1    0
   2   2    0
   3   3    0.81504897

BLOCK YD Q=  2888.337
   1   1    0
   2   2    0
   3   3    0.42700764

BLOCK YE Q=  2888.337
   1   1    0
   2   2    0
   3   3    0.31818963

BLOCK MSOFT Q=  2888.337
   1    436.42
   2   -2289.28
   3    3444.67
   21    6761091.6
   22    11820.981
   31    3985.45
   32    3985.45
   33    966.58
   34    2183.06
   35    2183.06
   36    2194.38
   41    3054.4
   42    3054.4
   43    3832.68
   44    1114.75
   45    1114.75
   46    2175.93
   47    2556.66
   48    2556.66
   49    3631.98

BLOCK HIGGSBOUNDSINPUTHIGGSCOUPLINGSFERMIONS
       0, 1030.6773,3,36,15,15

BLOCK HIGGSBOUNDSINPUTHIGGSCOUPLINGSBOSONS
       0,4,36,21,21,23

DECAY 6  1.4297066
    1   2    5    24

DECAY 1000021  161.53409
    0.15866537   2    2000002   -2
    0.15866537   2   -2000002    2
    0.15866535   2    2000004   -4
    0.15866535   2   -2000004    4
    0.072911799   2    1000006   -6
    0.072911799   2   -1000006    6
    0.038851325   2    2000001   -1
    0.038851325   2   -2000001    1
    0.038851325   2    2000003   -3
    0.038851325   2   -2000003    3
    0.0080316562   2    1000002   -2
    0.0080316562   2   -1000002    2
    0.0080315833   2    1000004   -4
    0.0080315833   2   -1000004    4
    0.0079957959   2    1000001   -1
    0.0079957959   2   -1000001    1
    0.0079957959   2    1000003   -3
    0.0079957959   2   -1000003    3

DECAY 1000006  61.179373
    0.46163968   2    1000024    5
    0.23026839   2    1000023    6
    0.21626873   2    1000022    6
    0.091823195   2    1000025    6

DECAY 2000006  124.32494
    0.20298779   2    1000023    6
    0.18493321   2    1000022    6
    0.13808528   2    1000006    25
    0.13728356   2    1000006    23
    0.11532582   2    1000024    5
    0.1027176   2    1000037    5
    0.051633974   2    1000035    6
    0.042870297   2    1000021    6
    0.024142701   2    1000025    6
    1.9773015e-05   2    1000005    24

DECAY 1000005  30.293279
    0.43609827   2   -1000024    6
    0.21864734   2    1000023    5
    0.21493314   2    1000022    5
    0.074718751   2    1000025    5
    0.05547825   2    1000021    5
    9.3463885e-05   2    1000006   -24
    2.0606532e-05   2   -1000037    6
    1.0176504e-05   2    1000035    5

DECAY 2000005  123.40352
    0.40846697   2   -1000024    6
    0.26645275   2    1000006   -24
    0.10462896   2   -1000037    6
    0.05633063   2    1000023    5
    0.053839333   2    1000022    5
    0.052056458   2    1000035    5
    0.050906603   2    1000021    5
    0.0073016278   2    1000025    5
    8.557647e-06   2    1000005    25
    8.115029e-06   2    1000005    23

DECAY 1000002  8.5278802
    0.6262411   2    1000037    1
    0.31351007   2    1000035    2
    0.045079994   2    1000025    2
    0.0069069399   2    1000022    2
    0.0065851295   2    1000024    1
    0.0016767632   2    1000023    2

DECAY 2000002  2.4198122
    0.92491642   2    1000025    2
    0.073208547   2    1000022    2
    0.0018750332   2    1000023    2

DECAY 1000001  8.4915168
    0.63130808   2   -1000037    2
    0.31546855   2    1000035    1
    0.051530783   2    1000025    1
    0.001128513   2    1000022    1
    0.00049664599   2    1000023    1
    6.7431459e-05   2   -1000024    2

DECAY 2000001  1.4783851
    0.93191126   2    1000025    1
    0.066380362   2    1000022    1
    0.0017083542   2    1000023    1
    1.9735678e-08   2    1000035    1

DECAY 1000004  8.5832068
    0.62559221   2    1000037    3
    0.31318595   2    1000035    4
    0.045800745   2    1000025    4
    0.0070219544   2    1000022    4
    0.0066945231   2    1000024    3
    0.0017046185   2    1000023    4

DECAY 2000004  2.3460949
    0.92486885   2    1000025    4
    0.073254996   2    1000022    4
    0.0018761507   2    1000023    4

DECAY 1000003  8.5458477
    0.63073441   2   -1000037    4
    0.3151839   2    1000035    3
    0.052360734   2    1000025    3
    0.0011474379   2    1000022    3
    0.00050495501   2    1000023    3
    6.8559533e-05   2   -1000024    4

DECAY 2000003  1.4915106
    0.9318696   2    1000025    3
    0.066421044   2    1000022    3
    0.0017093337   2    1000023    3
    1.9043732e-08   2    1000035    3

DECAY 1000011  26.238337
    0.53456913   2   -1000037    12
    0.26684539   2    1000035    11
    0.18021139   2    1000025    11
    0.0168425   2    1000022    11
    0.001503239   2    1000023    11
    2.834904e-05   2   -1000024    12

DECAY 2000011  10.685887
    0.93094959   2    1000025    11
    0.067319124   2    1000022    11
    0.001731281   2    1000023    11

DECAY 1000013  26.238337
    0.53456913   2   -1000037    14
    0.26684539   2    1000035    13
    0.18021139   2    1000025    13
    0.0168425   2    1000022    13
    0.001503239   2    1000023    13
    2.834904e-05   2   -1000024    14

DECAY 2000013  10.685886
    0.93094959   2    1000025    13
    0.067319124   2    1000022    13
    0.001731281   2    1000023    13

DECAY 1000015  2.5305561
    0.34982354   2    1000022    15
    0.32610658   2    1000023    15
    0.32392862   2    1000025    15
    0.00014126334   2   -1000024    16

DECAY 2000015  19.319094
    0.52110735   2    1000025    15
    0.2184461   2   -1000024    16
    0.14163667   2    1000022    15
    0.10994904   2    1000023    15
    0.0043298273   2    1000016   -24
    0.00231315   2    1000015    25
    0.002217872   2    1000015    23

DECAY 1000012  26.245002
    0.5327667   2    1000037    11
    0.26689954   2    1000035    12
    0.18803681   2    1000025    12
    0.0095121703   2    1000022    12
    0.0027795407   2    1000024    11
    5.2357447e-06   2    1000023    12

DECAY 1000014  26.245002
    0.5327667   2    1000037    13
    0.26689954   2    1000035    14
    0.18803681   2    1000025    14
    0.0095121703   2    1000022    14
    0.0027795407   2    1000024    13
    5.2357447e-06   2    1000023    14

DECAY 1000016  2.5168664
    0.65333831   2    1000024    15
    0.32612279   2    1000025    16
    0.020527707   2    1000022    16
    1.118894e-05   2    1000023    16

DECAY 1000024  2.7355468e-08
    0.3420283   3    1000022    2   -1
    0.3420283   3    1000022    4   -3
    0.11400886   3    1000022   -11    12
    0.11400886   3    1000022   -13    14
    0.087925685   3    1000022   -15    16
    4.3362819e-10   3    1000023   -11    12
    4.3362819e-10   3    1000023   -13    14

DECAY 1000037  30.303598
    0.20707482   2    1000016   -15
    0.20690558   2   -1000015    16
    0.15157881   2    1000024    25
    0.14767233   2    1000024    23
    0.14346135   2    1000023    24
    0.13308565   2    1000022    24
    0.010148575   2    1000025    24
    7.2617837e-05   2    1000006   -5
    2.6629508e-07   2   -2000015    16

DECAY 1000022 -1


DECAY 1000023  1.8587859e-08
    0.17471629   3    1000022   -1    1
    0.17471629   3    1000022   -3    3
    0.13454118   3    1000022   -2    2
    0.13454118   3    1000022   -4    4
    0.080368828   3    1000022   -12    12
    0.080368828   3    1000022   -14    14
    0.080368428   3    1000022   -16    16
    0.040187392   3    1000022   -11    11
    0.040187392   3    1000022   -13    13
    0.032549819   2    1000022    22
    0.027454379   3    1000022   -15    15

DECAY 1000025  0.3054113
    0.3081121   2    1000024   -24
    0.3081121   2   -1000024    24
    0.21048538   2    1000023    23
    0.15293091   2    1000022    25
    0.020359509   2    1000022    23

DECAY 1000035  30.290701
    0.1434156   2    1000024   -24
    0.1434156   2   -1000024    24
    0.10375179   2    1000016   -16
    0.10375179   2   -1000016    16
    0.10329944   2    1000015   -15
    0.10329944   2   -1000015    15
    0.091471412   2    1000023    25
    0.081624664   2    1000022    23
    0.059169459   2    1000023    23
    0.056219034   2    1000022    25
    0.0069091859   2    1000025    23
    0.0036721458   2    1000025    25
    1.3405146e-07   2    2000015   -15
    1.3405146e-07   2   -2000015    15
    4.4284592e-08   2    2000002   -2
    4.4284592e-08   2   -2000002    2
    4.4284568e-08   2    2000004   -4
    4.4284568e-08   2   -2000004    4
    1.0611385e-09   2    2000011   -11
    1.0611385e-09   2   -2000011    11
    1.0611385e-09   2    2000013   -13
    1.0611385e-09   2   -2000013    13

DECAY 25  0.004237052
    0.58058878   2    5   -5
    0.22615314   2    24   -24
    0.077430081   2    21    21
    0.062058311   2   -15    15
    0.028730855   2    23    23
    0.020627397   2    4   -4
    0.0023136034   2    22    22
    0.0016389648   2    22    23
    0.00023923634   2    3   -3
    0.00021963473   2   -13    13

DECAY 35  39.793307
    0.77405971   2    5   -5
    0.14750393   2   -15    15
    0.03858359   2    1000023    1000025
    0.027368725   2    1000022    1000025
    0.0030739487   2    1000022    1000022
    0.0027113677   2    1000025    1000025
    0.0026315313   2    6   -6
    0.0020594884   2    1000022    1000023
    0.0011747551   2    1000024   -1000024
    0.00050418443   2   -13    13
    0.00029938517   2    3   -3
    1.3639304e-05   2    21    21
    5.7911932e-06   2    25    25
    5.4058665e-06   2    1000023    1000023
    1.7262519e-06   2    1000015   -1000015
    1.4177592e-06   2    24   -24
    7.0702447e-07   2    23    23
    5.4726436e-07   2    1000016   -1000016
    5.396415e-08   2    2000002   -2000002
    5.396415e-08   2    2000004   -2000004
    2.6871678e-08   2    4   -4
    7.3575788e-09   2    23    22
    4.6560343e-09   2    22    22

DECAY 36  39.798028
    0.77399195   2    5   -5
    0.14748661   2   -15    15
    0.033494748   2    1000022    1000025
    0.031273344   2    1000023    1000025
    0.0036762043   2    1000022    1000022
    0.0036236693   2    1000025    1000025
    0.0026451543   2    6   -6
    0.0017300245   2    1000022    1000023
    0.0012315523   2    1000024   -1000024
    0.00050412436   2   -13    13
    0.00029937027   2    3   -3
    3.6692277e-05   2    21    21
    5.0653151e-06   2    1000023    1000023
    1.4344459e-06   2    23    25
    2.6945365e-08   2    4   -4
    2.5991311e-08   2    23    22
    8.4433157e-09   2    22    22

DECAY 37  38.920892
    0.77101744   2    6   -5
    0.15090286   2   -15    16
    0.068381721   2    1000024    1000025
    0.0070484886   2    1000024    1000022
    0.0012941618   2    4   -5
    0.00051580146   2   -13    14
    0.00050627258   2    1000024    1000023
    0.00030137932   2    4   -3
    1.5310287e-05   2    2   -3
    1.2941598e-05   2    2   -5
    2.1541951e-06   2   -1000015    1000016
    1.4706897e-06   2    24    25
    3.6151227e-13   2    24    36

DECAY 5 -1


DECAY 15 -1


DECAY 23  2.4952


DECAY 24  2.085
