BLOCK SPINFO
   1   SPheno
   2   v4.0.5be

BLOCK SPHENOINFO
   1   2
   2   2

BLOCK MODSEL
   1   0

BLOCK MINPAR
   3    14.607648
   4   -1

BLOCK EXTPAR
   0    4060.7348
   1    1344.1025
   2   -1341.9059
   3    4000
   11   -5860.3754
   12   -1408.7808
   13    1444.0664
   23   -1697.933
   25    13.923708
   26    2000
   31    473.73044
   32    473.73044
   33    1666.1279
   34    1532.225
   35    1532.225
   36    1035.9251
   41    4000
   42    4000
   43    4000
   44    4000
   45    4000
   46    4000
   47    4000
   48    4000
   49    4000

BLOCK SMINPUTS
   1    127.90897
   2    1.1663787e-05
   3    0.1184
   4    91.1876
   5    4.18
   6    173.2
   7    1.777
   8    0
   11    0.00051099893
   12    0
   13    0.10565837
   14    0
   21    0.005
   22    0.0025
   23    0.095
   24    1.27

BLOCK GAUGE Q=  4060.7348
   1    0.35536298
   2    0.66519887
   3    1.219778

BLOCK YU Q=  4060.7348
   1   1    8.4059681e-06
   2   2    0.0042702318
   3   3    1.0155085

BLOCK YD Q=  4060.7348
   1   1    0.00023519219
   2   2    0.0044686516
   3   3    0.23323696

BLOCK YE Q=  4060.7348
   1   1    4.1042757e-05
   2   2    0.0084863405
   3   3    0.14272629

BLOCK AU Q=  4060.7348
   1   1    0
   2   2    0
   3   3   -5860.3816

BLOCK AD Q=  4060.7348
   1   1    0
   2   2    0
   3   3   -1408.7799

BLOCK AE Q=  4060.7348
   1   1    0
   2   2    0
   3   3    1444.0658

BLOCK MSOFT Q=  4060.7348
   1    1344.1025
   2   -1341.9059
   3    4000
   21    995110.68
   22   -2561652.5
   31    473.73044
   32    473.73044
   33    1666.1279
   34    1532.225
   35    1532.225
   36    1035.9251
   41    4000
   42    4000
   43    4000
   44    4000
   45    4000
   46    4000
   47    4000
   48    4000
   49    4000

BLOCK MASS
   6    173.2
   23    91.1876
   24    80.429995
   15    1.777
   25    124.3719
   35    2000.0455
   36    2000
   37    2001.903
   1000001    4156.6504
   2000001    4143.1524
   1000002    4155.9004
   2000002    4144.7603
   1000003    4156.6506
   2000003    4143.1498
   1000004    4155.8994
   2000004    4144.7595
   1000005    4093.4591
   2000005    4140.7319
   1000006    3960.4438
   2000006    4163.5655
   1000011    529.24844
   2000011    1541.3651
   1000012    523.03768
   1000013    529.24062
   2000013    1541.3618
   1000014    523.03402
   1000015    1046.4167
   2000015    1684.3568
   1000016    1681.6153
   1000021    4248.945
   1000022    1318.3231
   1000023   -1373.0708
   1000025    1718.284
   1000035   -1725.9429
   1000024    1373.2156
   1000037    1726.1853
   1000039    1e-09

BLOCK ALPHA
      -0.068776166

BLOCK HMIX Q=  4060.7348
   1   -1697.933
   2    13.923708
   3    242.9251
   4    4000000

BLOCK STOPMIX
   1   1    0.58743231
   1   2    0.8092733
   2   1   -0.8092733
   2   2    0.58743231

BLOCK SBOTMIX
   1   1   -0.9925401
   1   2    0.12191862
   2   1   -0.12191862
   2   2   -0.9925401

BLOCK STAUMIX
   1   1   -0.026454421
   1   2    0.99965002
   2   1   -0.99965002
   2   2   -0.026454421

BLOCK NMIX
   1   1    0.99723904
   1   2    0.0011717296
   1   3   -0.059671395
   1   4   -0.044184243
   2   1   -0.0018678966
   2   2   -0.98602945
   2   3   -0.12878788
   2   4    0.10562256
   3   1    0.073440201
   3   2   -0.016542382
   3   3    0.70441841
   3   4    0.70578154
   4   1   -0.010832519
   4   2    0.1657435
   4   3   -0.69544785
   4   4    0.69911662

BLOCK UMIX
   1   1   -0.98318802
   1   2   -0.18259604
   2   1   -0.18259604
   2   2    0.98318802

BLOCK VMIX
   1   1    0.98869821
   1   2    0.1499195
   2   1    0.1499195
   2   2   -0.98869821

BLOCK HIGGSBOUNDSINPUTHIGGSCOUPLINGSFERMIONS
       0, 193.86965,3,36,15,15

BLOCK HIGGSBOUNDSINPUTHIGGSCOUPLINGSBOSONS
       0,4,36,21,21,23

BLOCK SPHENOLOWENERGY
   1    0.00033615556
   2    1.5887067e-06
   3    3.5257344e-05
   4    2.4825351e-15
   5    1.0605115e-10
   6    2.2204339e-08
   7    8.3929635e-14
   8    3.5854734e-09
   9    7.6063023e-07
   10    9.645026e-05
   11    0.99629426
   12    0.54205128
   13    19.366029
   14    0
   15    0
   16    0.0021575794
   17    2.2816612e-15
   18    2.4805599e-11
   19    8.2912993e-11
   20   -1.6957476e-16
   21   -7.2520513e-12
   22    4.038806e-09
   23    0
   24    0
   25    0
   26    0
   27    0
   28    0
   29    0
   30    0
   31    0
   39    2.6862655e-05
   40    0
   41    0
   42    0

BLOCK FWCOEF Q=  160
   305   4422   0   0   -0.18881911
   305   4422   0   2   -0.20541132
   305   4322   0   2   -0.0003285882
   305   6421   0   0   -0.095227835
   305   6421   0   2   -0.11323248
   305   6321   0   2   -0.00035546247
   3051111   4133   0   0    1.6267992
   3051111   4133   0   2    1.6268897
   3051111   4233   0   2    3.897953e-05
   3051111   4137   0   0   -4.4494913
   3051111   4137   0   2   -4.448257
   3051111   4237   0   2   -0.00028848972
   3051313   4133   0   0    1.6267992
   3051313   4133   0   2    1.6268895
   3051313   4233   0   2    3.8979501e-05
   3051313   4137   0   0   -4.4494913
   3051313   4137   0   2   -4.4482572
   3051313   4237   0   2   -0.00028848971
   3051212   4137   0   0    1.5053501
   3051212   4137   0   2    1.5050922
   3051212   4237   0   2    6.2380828e-05
   3051414   4137   0   0    1.5053501
   3051414   4137   0   2    1.5050922
   3051414   4237   0   2    6.2380833e-05
   3051616   4137   0   0    1.5053501
   3051616   4137   0   2    1.5050924
   3051616   4237   0   2    6.2382253e-05

BLOCK IMFWCOEF Q=  160
   305   4422   0   0    3.8580041e-07
   305   4422   0   2    2.760674e-06
   305   4322   0   2   -1.320685e-06
   305   6421   0   0    3.3046356e-07
   305   6421   0   2    5.4205679e-06
   305   6321   0   2   -6.2648315e-07
   3051111   4133   0   2   -1.3400197e-06
   3051111   4233   0   2    8.8342007e-07
   3051111   4137   0   2    9.261541e-06
   3051111   4237   0   2   -6.5386868e-06
   3051313   4133   0   2   -1.3400169e-06
   3051313   4233   0   2    8.8341996e-07
   3051313   4137   0   2    9.2615427e-06
   3051313   4237   0   2   -6.5386872e-06
   3051212   4137   0   2   -1.8399539e-06
   3051212   4237   0   2    1.4138759e-06
   3051414   4137   0   2   -1.839954e-06
   3051414   4237   0   2    1.4138759e-06
   3051616   4137   0   2   -1.8359678e-06
   3051616   4237   0   2    1.4138759e-06

DECAY 23  2.4952


DECAY 24  2.085


DECAY 1000011  7.084665e-08
    0.6716318   2    1000039    11
    0.12127652   3    1000012    1   -2
    0.099066141   3    1000012    3   -4
    0.040367355   3    1000012    13   -14
    0.040316123   3    1000012    11   -12
    0.02733522   3    1000012    15   -16

DECAY 2000011  0.55514392
    0.99997992   2    1000022    11

DECAY 1000013  7.0762579e-08
    0.67237996   2    1000039    13
    0.12101526   3    1000014    1   -2
    0.098826178   3    1000014    3   -4
    0.040338582   3    1000014    11   -12
    0.040171154   3    1000014    13   -14
    0.02726207   3    1000014    15   -16

DECAY 2000013  0.55630116
    0.99787677   2    1000022    13
    0.0020948018   2    1000013    25

DECAY 1000015  0.00022017122
    0.18256446   3    1000014    15   -14
    0.18255953   3    1000012    15   -12
    0.17442931   3    1000013    15   -13
    0.17441888   3    1000011    15   -11
    0.069102687   3   -1000014    15    14
    0.069101092   3   -1000012    15    12
    0.067017933   3   -1000013    15    13
    0.067012853   3   -1000011    15    11
    0.0065299585   2    1000039    15
    0.003632467   3   -1000014    13    16
    0.0036308418   3   -1000012    11    16

DECAY 2000015  3.223559
    0.49855899   2   -1000024    16
    0.25193706   2    1000023    15
    0.098552363   2    1000022    15
    0.079033918   2    1000015    23
    0.071912854   2    1000015    25

DECAY 1000012  4.4855687e-08
    1   2    1000039    12

DECAY 1000014  4.4854118e-08
    1   2    1000039    14

DECAY 1000016  3.2243266
    0.498699   2    1000024    15
    0.24743056   2    1000023    16
    0.15751642   2    1000015    24
    0.096349249   2    1000022    16

DECAY 2000001  1.8682634
    0.99456712   2    1000022    1
    0.0045789053   2    1000025    1
    0.00074880554   2    1000039    1
    0.00010003968   2    1000035    1

DECAY 1000001  43.840664
    0.64030961   2   -1000024    2
    0.3218074   2    1000023    1
    0.019057259   2   -1000037    2
    0.010505864   2    1000022    1
    0.0080357056   2    1000035    1
    0.00025172986   2    1000025    1

DECAY 2000003  1.8705156
    0.99337138   2    1000022    3
    0.0048717758   2    1000025    3
    0.00074790168   2    1000039    3
    0.00058092663   2   -1000037    4
    0.00038978412   2    1000035    3

DECAY 1000003  43.842834
    0.64027807   2   -1000024    4
    0.32179202   2    1000023    3
    0.019079786   2   -1000037    4
    0.010505455   2    1000022    3
    0.0080477154   2    1000035    3
    0.00026452315   2    1000025    3

DECAY 1000005  103.22571
    0.5356071   2   -1000037    6
    0.27501595   2   -1000024    6
    0.13425365   2    1000023    5
    0.020290816   2    1000006   -24
    0.015600594   2    1000035    5
    0.013998286   2    1000025    5
    0.0052208401   2    1000022    5

DECAY 2000005  9.5818851
    0.44525423   2   -1000037    6
    0.18708904   2    1000022    5
    0.17352935   2    1000035    5
    0.16599883   2    1000025    5
    0.011558327   2   -1000024    6
    0.01145649   2    1000006   -24
    0.0049681437   2    1000023    5
    0.00014557454   2    1000039    5

DECAY 2000002  7.4730432
    0.99512837   2    1000022    2
    0.0045813389   2    1000025    2
    0.00018756519   2    1000039    2

DECAY 1000002  43.876529
    0.64680359   2    1000024    1
    0.32189195   2    1000023    2
    0.012832095   2    1000037    1
    0.010775208   2    1000022    2
    0.0076613364   2    1000035    2

DECAY 2000004  7.4751019
    0.9948538   2    1000022    4
    0.0046491717   2    1000025    4
    0.00018751329   2    1000039    4
    0.00016639598   2    1000035    4
    0.00013433223   2    1000037    3

DECAY 1000004  43.878677
    0.64677262   2    1000024    3
    0.32187645   2    1000023    4
    0.012856358   2    1000037    3
    0.01077474   2    1000022    4
    0.0076722535   2    1000035    4

DECAY 1000006  104.56792
    0.38427867   2    1000037    5
    0.26347928   2    1000035    6
    0.23419574   2    1000025    6
    0.052460599   2    1000022    6
    0.040739502   2    1000024    5
    0.022835762   2    1000023    6
    0.0015674359   2    1000023    4
    0.00037983615   3    1000022    24    5

DECAY 2000006  119.59975
    0.2621387   2    1000025    6
    0.22232731   2    1000035    6
    0.21323574   2    1000024    5
    0.13935849   2    1000037    5
    0.11067756   2    1000023    6
    0.028549309   2    1000006    23
    0.018764121   2    1000022    6
    0.004936873   2    1000006    25

DECAY 1000024  17.113265
    0.25234736   2    1000014   -13
    0.25234455   2    1000012   -11
    0.24752311   2   -1000013    14
    0.24752055   2   -1000011    12
    0.00026379347   2   -1000015    16

DECAY 1000037  8.2989794
    0.30611436   2    1000023    24
    0.25915648   2    1000024    25
    0.25577785   2    1000024    23
    0.077415895   2    1000022    24
    0.025055566   2   -1000013    14
    0.025055412   2   -1000011    12
    0.01709056   2    1000014   -13
    0.016972094   2    1000012   -11
    0.015551063   2   -1000015    16
    0.0011093335   3    1000023   -5    6
    0.00046286715   3    1000022   -5    6
    0.00015312782   2    1000016   -15

DECAY 1000022  5.5578573
    0.1047258   2    1000014   -14
    0.1047258   2   -1000014    14
    0.10472525   2    1000012   -12
    0.10472525   2   -1000012    12
    0.10471144   2    1000013   -13
    0.10471144   2   -1000013    13
    0.10470975   2    1000011   -11
    0.10470975   2   -1000011    11
    0.081127355   2    1000015   -15
    0.081127355   2   -1000015    15

DECAY 1000023  17.112556
    0.12522179   2    1000014   -14
    0.12522179   2   -1000014    14
    0.1252212   2    1000012   -12
    0.1252212   2   -1000012    12
    0.12471342   2    1000013   -13
    0.12471342   2   -1000013    13
    0.12471155   2    1000011   -11
    0.12471155   2   -1000011    11
    0.00013187206   2    1000015   -15
    0.00013187206   2   -1000015    15

DECAY 1000025  9.1560236
    0.26686196   2    1000023    23
    0.22777307   2    1000024   -24
    0.22777307   2   -1000024    24
    0.19129848   2    1000023    25
    0.060333204   2    1000022    25
    0.0083881545   2    1000015   -15
    0.0083881545   2   -1000015    15
    0.0016578075   2    1000022    23
    0.0010577797   2    1000014   -14
    0.0010577797   2   -1000014    14
    0.0010577767   2    1000012   -12
    0.0010577767   2   -1000012    12
    0.00097486417   3    1000024    5   -6
    0.00097486417   3   -1000024   -5    6
    0.00022884293   2    1000013   -13
    0.00022884293   2   -1000013    13
    0.00017421651   2    1000011   -11
    0.00017421651   2   -1000011    11

DECAY 1000035  9.4468384
    0.26312947   2    1000024   -24
    0.26312947   2   -1000024    24
    0.2268067   2    1000023    25
    0.080398583   2    1000022    25
    0.075095946   2    1000022    23
    0.0097572039   2    1000014   -14
    0.0097572039   2   -1000014    14
    0.0097571763   2    1000012   -12
    0.0097571763   2   -1000012    12
    0.0084961212   2    1000013   -13
    0.0084961212   2   -1000013    13
    0.0084439351   2    1000011   -11
    0.0084439351   2   -1000011    11
    0.0068789719   2    1000015   -15
    0.0068789719   2   -1000015    15
    0.0024764136   2    1000023    23
    0.0010331777   3    1000024    5   -6
    0.0010331777   3   -1000024   -5    6

DECAY 1000021  4.5944525
    0.079445343   2    1000006   -6
    0.079445343   2   -1000006    6
    0.07109952   2    1000005   -5
    0.07109952   2   -1000005    5
    0.045470977   3    1000025    6   -6
    0.038173125   3    1000035    6   -6
    0.034259978   2    2000005   -5
    0.034259978   2   -2000005    5
    0.033102172   2    2000003   -3
    0.033102172   2   -2000003    3
    0.033100634   2    2000001   -1
    0.033100634   2   -2000001    1
    0.032114386   2    2000002   -2
    0.032114386   2   -2000002    2
    0.032112533   2    2000004   -4
    0.032112533   2   -2000004    4
    0.025681846   2    1000002   -2
    0.025681846   2   -1000002    2
    0.025680047   2    1000004   -4
    0.025680047   2   -1000004    4
    0.025273984   2    1000001   -1
    0.025273984   2   -1000001    1
    0.025273868   2    1000003   -3
    0.025273868   2   -1000003    3
    0.0196687   3    1000023    6   -6
    0.016394352   3    1000024    5   -6
    0.016394352   3   -1000024   -5    6
    0.0097382681   3    1000037    5   -6
    0.0097382681   3   -1000037   -5    6
    0.0029410099   2    1000006   -4
    0.0029410099   2   -1000006    4
    0.0026852685   3    1000022    6   -6
    0.00061603601   2    1000025    21
    0.00057947761   2    1000035    21
    0.00034540164   2    1000039    21

DECAY 25  0.0038121015
    0.5837716   2   -5    5
    0.21755665   2   -24    24
    0.07271358   2    21    21
    0.067111036   2   -15    15
    0.028615021   2   -4    4
    0.026008607   2    23    23
    0.0023311514   2    22    22
    0.001439398   2    22    23
    0.00023282545   2   -13    13
    0.00021936781   2   -3    3
    6.0652997e-07   2   -1    1
    1.4746155e-07   2   -2    2
    5.2341832e-09   2   -11    11

DECAY 35  6.8143966
    0.80485628   2   -5    5
    0.13836215   2   -15    15
    0.055378092   2   -6    6
    0.00050653253   2   -13    13
    0.00041638047   2    25    25
    0.00032225416   2   -3    3
    5.0791667e-05   2    23    23
    2.6926209e-05   2   -24    24
    9.5843054e-06   2    21    21
    8.1078405e-06   2   -1000011    1000011
    8.0879972e-06   2   -1000013    1000013
    8.9100533e-07   2   -1    1
    7.626085e-07   2   -4    4
    7.4278451e-08   2    22    22
    6.5525748e-08   2    22    23
    1.1377864e-08   2   -11    11
    3.9316191e-12   2   -2    2

DECAY 36  6.6650518
    0.80402799   2   -5    5
    0.13821951   2   -15    15
    0.056757835   2   -6    6
    0.00050601789   2   -13    13
    0.00032191985   2   -3    3
    9.478775e-05   2    21    21
    7.005114e-05   2    23    25
    8.9008127e-07   2   -1    1
    7.5664352e-07   2   -4    4
    1.5729963e-07   2    22    22
    7.7409252e-08   2    22    23
    1.1366306e-08   2   -11    11
    3.9010701e-12   2   -2    2
    7.0776883e-35   2    25    25

DECAY 37  6.2875482
    0.86189182   2   -5    6
    0.13586798   2   -15    16
    0.0011917065   2   -5    4
    0.00048034225   2   -13    14
    0.00030972736   2   -3    4
    8.7256709e-05   2   -3    6
    7.457652e-05   2    24    25
    3.4389367e-05   2   -1000011    1000012
    3.4359322e-05   2   -1000013    1000014
    1.4401091e-05   2   -3    2
    8.5100095e-06   2   -5    2
    3.9812914e-06   2   -1    6
    8.5735219e-07   2   -1    2
    7.6543742e-08   2   -1    4
    1.1235255e-08   2   -11    12
    5.399865e-12   2    24    36
    4.7846216e-12   2    24    35

DECAY 6  2.43
    1   2    5    24

DECAY 15 -1


DECAY 1000039 -1
