BLOCK SPINFO
   1   SPheno
   2   v4.0.5be

BLOCK SPHENOINFO
   1   2
   2   2

BLOCK MODSEL
   1   0

BLOCK MINPAR
   3    3.5185283
   4   -1

BLOCK EXTPAR
   0    3991.6367
   1   -1346.4324
   2   -831.51872
   3    4000
   11    7786.8939
   12   -1190.579
   13   -1602.2153
   23   -1282.9726
   25    3.3197533
   26    2000
   31    953.92515
   32    953.92515
   33    2000
   34    807.23576
   35    807.23576
   36    2000
   41    4000
   42    4000
   43    4000
   44    4000
   45    4000
   46    4000
   47    4000
   48    4000
   49    4000

BLOCK SMINPUTS
   1    127.90897
   2    1.1663787e-05
   3    0.1184
   4    91.1876
   5    4.18
   6    173.2
   7    1.777
   8    0
   11    0.00051099893
   12    0
   13    0.10565837
   14    0
   21    0.005
   22    0.0025
   23    0.095
   24    1.27

BLOCK GAUGE Q=  3991.6367
   1    0.35536298
   2    0.66519887
   3    1.219778

BLOCK YU Q=  3991.6367
   1   1    8.7565037e-06
   2   2    0.0044483039
   3   3    1.057856

BLOCK YD Q=  3991.6367
   1   1    5.8413979e-05
   2   2    0.0011098656
   3   3    0.057928363

BLOCK YE Q=  3991.6367
   1   1    1.0193667e-05
   2   2    0.0021077269
   3   3    0.0354485

BLOCK AU Q=  3991.6367
   1   1    0
   2   2    0
   3   3    7786.8939

BLOCK AD Q=  3991.6367
   1   1    0
   2   2    0
   3   3   -1190.579

BLOCK AE Q=  3991.6367
   1   1    0
   2   2    0
   3   3   -1602.2153

BLOCK MSOFT Q=  3991.6367
   1   -1346.4324
   2   -831.51872
   3    4000
   21    1973941
   22   -967974.1
   31    953.92515
   32    953.92515
   33    2000
   34    807.23576
   35    807.23576
   36    2000
   41    4000
   42    4000
   43    4000
   44    4000
   45    4000
   46    4000
   47    4000
   48    4000
   49    4000

BLOCK MASS
   6    173.2
   23    91.1876
   24    80.429995
   15    1.777
   25    121.00532
   35    2000.464
   36    2000
   37    2001.8128
   1000001    4155.4749
   2000001    4143.4178
   1000002    4154.8438
   2000002    4144.234
   1000003    4155.4744
   2000003    4143.4177
   1000004    4154.8434
   2000004    4144.2331
   1000005    4049.6686
   2000005    4143.2389
   1000006    3855.9771
   2000006    4132.0691
   1000011    969.60289
   2000011    827.20116
   1000012    966.52415
   1000013    969.60314
   2000013    827.20034
   1000014    966.52395
   1000015    2006.8153
   2000015    2009.2818
   1000016    2006.1747
   1000021    4249.4693
   1000022   -857.57078
   1000023   -1273.9055
   1000025    1297.169
   1000035   -1351.4987
   1000024    857.80571
   1000037    1307.6577
   1000039    1e-09

BLOCK ALPHA
      -0.27836212

BLOCK HMIX Q=  3991.6367
   1   -1282.9726
   2    3.3197533
   3    242.93618
   4    4000000

BLOCK STOPMIX
   1   1   -0.57266594
   1   2    0.81978883
   2   1   -0.81978883
   2   2   -0.57266594

BLOCK SBOTMIX
   1   1   -0.99997375
   1   2    0.0072456927
   2   1   -0.0072456927
   2   2   -0.99997375

BLOCK STAUMIX
   1   1   -0.76455526
   1   2    0.64455818
   2   1   -0.64455818
   2   2   -0.76455526

BLOCK NMIX
   1   1   -0.012361327
   1   2    0.98759336
   1   3    0.12225177
   1   4   -0.097780683
   2   1    0.60861837
   2   2    0.13095994
   2   3   -0.55556232
   2   4    0.55116575
   3   1    0.0080370044
   3   2   -0.017319623
   3   3    0.70653952
   3   4    0.70741596
   4   1    0.79332609
   4   2   -0.084905144
   4   3    0.42095951
   4   4   -0.43152974

BLOCK UMIX
   1   1   -0.98521962
   1   2   -0.17129593
   2   1   -0.17129593
   2   2    0.98521962

BLOCK VMIX
   1   1    0.99055763
   1   2    0.13709696
   2   1    0.13709696
   2   2   -0.99055763

BLOCK HIGGSBOUNDSINPUTHIGGSCOUPLINGSFERMIONS
       0, 11.020762,3,36,15,15

BLOCK HIGGSBOUNDSINPUTHIGGSCOUPLINGSBOSONS
       0,4,36,21,21,23

BLOCK SPHENOLOWENERGY
   1    0.00033226656
   2    1.5916258e-06
   3    3.5311347e-05
   4    2.5595151e-15
   5    1.0933958e-10
   6    2.2889302e-08
   7    8.6370998e-14
   8    3.6897662e-09
   9    7.8263857e-07
   10    9.6790266e-05
   11    0.9998064
   12    0.54369852
   13    19.426708
   14    0
   15    0
   16    0.0021641703
   17    2.2817217e-15
   18    2.4841489e-11
   19    8.3001561e-11
   20    7.6330377e-16
   21    3.2633632e-11
   22    3.2977925e-09
   23    0
   24    0
   25    0
   26    0
   27    0
   28    0
   29    0
   30    0
   31    0
   39   -0.0007649591
   40    0
   41    0
   42    0

BLOCK FWCOEF Q=  160
   305   4422   0   0   -0.18881911
   305   4422   0   2   -0.20082191
   305   4322   0   2   -0.00023595131
   305   6421   0   0   -0.095227835
   305   6421   0   2   -0.11099997
   305   6321   0   2   -0.00030957089
   3051111   4133   0   0    1.6262031
   3051111   4133   0   2    1.6266401
   3051111   4233   0   2    2.9450343e-06
   3051111   4137   0   0   -4.4488952
   3051111   4137   0   2   -4.4529409
   3051111   4237   0   2   -2.1815235e-05
   3051313   4133   0   0    1.6262031
   3051313   4133   0   2    1.6266401
   3051313   4233   0   2    2.9450342e-06
   3051313   4137   0   0   -4.4488952
   3051313   4137   0   2   -4.4529409
   3051313   4237   0   2   -2.1815235e-05
   3051212   4137   0   0    1.5053501
   3051212   4137   0   2    1.5062422
   3051212   4237   0   2    4.7177909e-06
   3051414   4137   0   0    1.5053501
   3051414   4137   0   2    1.5062422
   3051414   4237   0   2    4.7177909e-06
   3051616   4137   0   0    1.5053501
   3051616   4137   0   2    1.506242
   3051616   4237   0   2    4.7177958e-06

BLOCK IMFWCOEF Q=  160
   305   4422   0   0    3.8582839e-07
   305   4422   0   2    1.244539e-06
   305   4322   0   2    3.094797e-07
   305   6421   0   0    3.3048753e-07
   305   6421   0   2    1.1068055e-06
   305   6321   0   2    1.6732251e-07
   3051111   4133   0   2   -8.5156632e-07
   3051111   4233   0   2    6.3421131e-08
   3051111   4137   0   2    4.8507965e-06
   3051111   4237   0   2   -4.6981487e-07
   3051313   4133   0   2   -8.5156651e-07
   3051313   4233   0   2    6.3421131e-08
   3051313   4137   0   2    4.8507965e-06
   3051313   4237   0   2   -4.6981487e-07
   3051212   4137   0   2   -7.4390841e-07
   3051212   4237   0   2    1.0160277e-07
   3051414   4137   0   2   -7.4390841e-07
   3051414   4237   0   2    1.0160277e-07
   3051616   4137   0   2   -7.4703027e-07
   3051616   4237   0   2    1.0160277e-07

DECAY 23  2.4952


DECAY 24  2.085


DECAY 2000011  4.4382147e-07
    1   2    1000039    11

DECAY 1000011  0.58596056
    0.66770116   2   -1000024    12
    0.33229716   2    1000022    11

DECAY 2000013  4.4381923e-07
    1   2    1000039    13

DECAY 1000013  0.58597306
    0.66768967   2   -1000024    14
    0.3322917   2    1000022    13

DECAY 1000015  12.123734
    0.5609167   2   -1000024    16
    0.27831002   2    1000022    15
    0.079598892   2    1000023    15
    0.076167331   2    1000035    15
    0.0045510306   2   -1000037    16
    0.00045294777   2    1000025    15

DECAY 2000015  9.4473394
    0.49383781   2   -1000024    16
    0.24479591   2    1000022    15
    0.13617832   2    1000035    15
    0.10978524   2    1000023    15
    0.01410112   2   -1000037    16
    0.0012976235   2    1000025    15

DECAY 1000012  0.56665073
    0.66412865   2    1000024    11
    0.33586965   2    1000022    12

DECAY 1000014  0.56664838
    0.66412837   2    1000024    13
    0.33586992   2    1000022    14

DECAY 1000016  18.329776
    0.6313362   2    1000024    15
    0.31804905   2    1000022    16
    0.037189544   2    1000035    16
    0.0068778704   2    1000037    15
    0.0064690987   2    1000023    16

DECAY 2000001  1.8669347
    0.62271313   2    1000035    1
    0.37629854   2    1000023    1
    0.00074957854   2    1000039    1
    0.00017345964   2    1000022    1

DECAY 1000001  50.604846
    0.6431368   2   -1000024    2
    0.32457762   2    1000022    1
    0.017217926   2   -1000037    2
    0.014784784   2    1000035    1
    0.00015128725   2    1000023    1
    0.00010352133   2    1000025    1

DECAY 2000003  1.8670994
    0.62266564   2    1000035    3
    0.37627921   2    1000023    3
    0.00074951229   2    1000039    3
    0.00017418744   2    1000022    3

DECAY 1000003  50.606252
    0.64311907   2   -1000024    4
    0.3245686   2    1000022    3
    0.017243502   2   -1000037    4
    0.01478465   2    1000035    3
    0.0001517908   2    1000023    3
    0.00010433376   2    1000025    3

DECAY 1000005  130.63641
    0.55078356   2   -1000037    6
    0.25047655   2   -1000024    6
    0.12200467   2    1000022    5
    0.069503571   2    1000006   -24
    0.0057583171   2    1000035    5
    0.00086734825   2    1000025    5
    0.00059642031   2    1000023    5

DECAY 2000005  2.3247699
    0.51912023   2    1000035    5
    0.33116086   2    1000023    5
    0.098323571   2   -1000037    6
    0.048544814   2    1000025    5
    0.00090834667   2   -1000024    6
    0.00076042845   2    1000006   -24
    0.0006018258   2    1000039    5
    0.00057937726   2    1000022    5

DECAY 2000002  7.4656775
    0.62306618   2    1000035    2
    0.3765075   2    1000023    2
    0.00018763108   2    1000039    2
    0.00017354576   2    1000022    2

DECAY 1000002  50.639594
    0.6495625   2    1000024    1
    0.32141846   2    1000022    2
    0.016980187   2    1000023    2
    0.011019186   2    1000037    1
    0.00091738428   2    1000035    2

DECAY 2000004  7.4683257
    0.62287511   2    1000035    4
    0.37643027   2    1000023    4
    0.00018756427   2    1000039    4
    0.00017540301   2    1000022    4
    0.00017378237   2    1000037    3
    0.0001541109   2    1000025    4

DECAY 1000004  50.640996
    0.64954447   2    1000024    3
    0.32140981   2    1000022    4
    0.016987593   2    1000023    4
    0.011020469   2    1000037    3
    0.00092220022   2    1000035    4

DECAY 1000006  137.01118
    0.2858952   2    1000037    5
    0.25644371   2    1000025    6
    0.19270564   2    1000023    6
    0.12457885   2    1000024    5
    0.066317288   2    1000035    6
    0.064214092   2    1000022    6
    0.0098381238   3    1000022    24    5

DECAY 2000006  143.81635
    0.24871051   2    1000025    6
    0.2118148   2    1000037    5
    0.14832139   2    1000035    6
    0.14136003   2    1000023    6
    0.10939975   2    1000024    5
    0.066647826   2    1000006    23
    0.0576819   2    1000022    6
    0.015912416   2    1000006    25
    0.00014183969   2    1000005    24

DECAY 1000024  1.0132992e-06
    0.99460838   2    1000039    24
    0.0053915888   2   -2000013    14

DECAY 1000037  9.6599263
    0.35085347   2    1000022    24
    0.32206169   2    1000024    23
    0.31351319   2    1000024    25
    0.0035435692   2   -1000011    12
    0.0035435646   2   -1000013    14
    0.0023063251   2    1000014   -13
    0.0023051651   2    1000012   -11
    0.0010321209   3    1000022   -5    6
    0.00082369257   3    1000024    6   -6

DECAY 1000022  6.8841628e-06
    0.23181638   2    2000013   -13
    0.23181638   2   -2000013    13
    0.23147515   2    2000011   -11
    0.23147515   2   -2000011    11
    0.057342033   2    1000039    23
    0.015944855   2    1000039    22
    0.0001300495   2    1000039    25

DECAY 1000023  8.7843165
    0.26468699   2    1000024   -24
    0.26468699   2   -1000024    24
    0.23020038   2    1000022    25
    0.045142776   2    2000013   -13
    0.045142776   2   -2000013    13
    0.045142083   2    2000011   -11
    0.045142083   2   -2000011    11
    0.011750272   2    1000013   -13
    0.011750272   2   -1000013    13
    0.011749889   2    1000011   -11
    0.011749889   2   -1000011    11
    0.0027461202   2    1000022    23
    0.0021670323   2    1000014   -14
    0.0021670323   2   -1000014    14
    0.0021670298   2    1000012   -12
    0.0021670298   2   -1000012    12
    0.00069438006   3    1000024    5   -6
    0.00069438006   3   -1000024   -5    6

DECAY 1000025  10.528262
    0.32255411   2    1000022    23
    0.28856927   2    1000024   -24
    0.28856927   2   -1000024    24
    0.095177569   2    1000022    25
    0.0024363915   3    1000024    5   -6
    0.0024363915   3   -1000024   -5    6

DECAY 1000035  7.5227692
    0.14051268   2    1000024   -24
    0.14051268   2   -1000024    24
    0.13032975   2    1000022    25
    0.11109831   2    2000013   -13
    0.11109831   2   -2000013    13
    0.11109737   2    2000011   -11
    0.11109737   2   -2000011    11
    0.02442304   2    1000014   -14
    0.02442304   2   -1000014    14
    0.024423019   2    1000012   -12
    0.024423019   2   -1000012    12
    0.01069539   2    1000013   -13
    0.01069539   2   -1000013    13
    0.010695109   2    1000011   -11
    0.010695109   2   -1000011    11
    0.0021403269   2    1000022    23
    0.00063182706   3    1000024    5   -6
    0.00063182706   3   -1000024   -5    6
    0.00016550955   3    1000022    6   -6

DECAY 1000021  9.1609327
    0.27737853   2    1000006   -6
    0.27737853   2   -1000006    6
    0.057892461   2    1000005   -5
    0.057892461   2   -1000005    5
    0.016712452   2    2000005   -5
    0.016712452   2   -2000005    5
    0.016679178   2    2000003   -3
    0.016679178   2   -2000003    3
    0.01667915   2    2000001   -1
    0.01667915   2   -2000001    1
    0.016426589   2    2000002   -2
    0.016426589   2   -2000002    2
    0.0164257   2    2000004   -4
    0.0164257   2   -2000004    4
    0.015785246   3    1000025    6   -6
    0.013314901   2    1000002   -2
    0.013314901   2   -1000002    2
    0.01331386   2    1000004   -4
    0.01331386   2   -1000004    4
    0.013139998   2    1000003   -3
    0.013139998   2   -1000003    3
    0.013139874   2    1000001   -1
    0.013139874   2   -1000001    1
    0.0092281307   3    1000023    6   -6
    0.00902147   3    1000035    6   -6
    0.0057725235   3    1000037    5   -6
    0.0057725235   3   -1000037   -5    6
    0.0036167814   3    1000022    6   -6
    0.0033263672   3    1000024    5   -6
    0.0033263672   3   -1000024   -5    6
    0.000889585   2    1000025    21
    0.00058198377   2    1000023    21
    0.00027976997   2    1000035    21
    0.00017333505   2    1000039    21

DECAY 25  0.0034197464
    0.63213081   2   -5    5
    0.16726834   2   -24    24
    0.074688717   2    21    21
    0.072243142   2   -15    15
    0.030999337   2   -4    4
    0.018682008   2    23    23
    0.002331271   2    22    22
    0.0011677319   2    22    23
    0.00025058674   2   -13    13
    0.00023723942   2   -3    3
    6.5594251e-07   2   -1    1
    1.5975872e-07   2   -2    2
    5.6335235e-09   2   -11    11

DECAY 35  6.647114
    0.92992798   2   -6    6
    0.045793152   2   -5    5
    0.0077950918   2   -15    15
    0.0071248781   2   -1000024    1000024
    0.0038518199   2    25    25
    0.0036228563   2    1000022    1000022
    0.00060833638   2    23    23
    0.00042068671   2    21    21
    0.00032240085   2   -24    24
    5.3576075e-05   2   -1000011    1000011
    5.3544385e-05   2   -1000013    1000013
    4.1822873e-05   2   -2000013    2000013
    4.180855e-05   2   -2000011    2000011
    2.720854e-05   2   -13    13
    1.7210084e-05   2   -3    3
    1.2776415e-05   2   -4    4
    2.400519e-06   2    22    22
    1.4277268e-06   2    22    23
    2.0560917e-07   2   -2000013    1000013
    2.0560917e-07   2   -1000013    2000013
    4.7579742e-08   2   -1    1
    6.1116424e-10   2   -11    11
    6.5868225e-11   2   -2    2
    4.8092849e-12   2   -2000011    1000011
    4.8092849e-12   2   -1000011    2000011

DECAY 36  7.0308638
    0.8713383   2   -6    6
    0.051088523   2   -1000024    1000024
    0.042822554   2   -5    5
    0.026083836   2    1000022    1000022
    0.007288353   2   -15    15
    0.00077585805   2    23    25
    0.00053623086   2    21    21
    2.5438382e-05   2   -13    13
    1.609207e-05   2   -3    3
    1.1596966e-05   2   -4    4
    8.0679152e-06   2    22    23
    4.7194035e-06   2    22    22
    1.9480205e-07   2   -2000013    1000013
    1.9480205e-07   2   -1000013    2000013
    4.4488812e-08   2   -1    1
    5.7140363e-10   2   -11    11
    5.979104e-11   2   -2    2
    4.5564396e-12   2   -2000011    1000011
    4.5564396e-12   2   -1000011    2000011
    9.4802193e-36   2    25    25

DECAY 37  7.0203472
    0.990325   2   -5    6
    0.0070596276   2   -15    16
    0.0013399554   2   -3    6
    0.00078025547   2    24    25
    0.0001582853   2   -2000013    1000014
    0.0001582666   2   -2000011    1000012
    6.1875958e-05   2   -5    4
    6.1455535e-05   2   -1    6
    2.6619292e-05   2   -3    4
    2.4958326e-05   2   -13    14
    1.6165232e-06   2    1000022    1000024
    6.737116e-07   2   -3    2
    5.6830718e-07   2   -1    4
    4.4172423e-07   2   -5    2
    3.5779444e-07   2   -1000013    1000014
    4.0165764e-08   2   -1    2
    5.8377784e-10   2   -11    12
    8.368857e-12   2   -1000011    1000012
    3.7935448e-12   2    24    36
    8.6522438e-13   2    24    35

DECAY 6  2.43
    1   2    5    24

DECAY 15 -1


DECAY 1000039 -1
