BLOCK SPINFO
   1   SPheno
   2   v4.0.5be

BLOCK SPHENOINFO
   1   2
   2   2

BLOCK MODSEL
   1   0

BLOCK MINPAR
   3    41.293275
   4    1

BLOCK EXTPAR
   0    1502.4044
   1   -631.88824
   2   -619.78535
   3    3000
   11   -3161.4317
   12    103.86064
   13    367.83661
   23    361.90042
   25    40.446475
   26    3914.8945
   31    799.6993
   32    799.6993
   33    1418.1748
   34    1327.2364
   35    1327.2364
   36    696.43764
   41    5000
   42    5000
   43    1655.4696
   44    5000
   45    5000
   46    1439.2845
   47    5000
   48    5000
   49    968.07129

BLOCK SMINPUTS
   1    127.90897
   2    1.1663787e-05
   3    0.1184
   4    91.1876
   5    4.18
   6    173.2
   7    1.777
   8    0
   11    0.00051099893
   12    0
   13    0.10565837
   14    0
   21    0.005
   22    0.0025
   23    0.095
   24    1.27

BLOCK GAUGE Q=  1502.4044
   1    0.35536298
   2    0.66519887
   3    1.219778

BLOCK YU Q=  1502.4044
   1   1    8.3869343e-06
   2   2    0.0042605626
   3   3    1.013209

BLOCK YD Q=  1502.4044
   1   1    0.00068165427
   2   2    0.012951431
   3   3    0.67598744

BLOCK YE Q=  1502.4044
   1   1    0.00011895366
   2   2    0.024595843
   3   3    0.41366162

BLOCK AU Q=  1502.4044
   1   1    0
   2   2    0
   3   3   -3161.4317

BLOCK AD Q=  1502.4044
   1   1    0
   2   2    0
   3   3    103.86063

BLOCK AE Q=  1502.4044
   1   1    0
   2   2    0
   3   3    367.83662

BLOCK MSOFT Q=  1502.4044
   1   -631.88824
   2   -619.78535
   3    3000
   21    15167726
   22   -81437.087
   31    799.6993
   32    799.6993
   33    1418.1748
   34    1327.2364
   35    1327.2364
   36    696.43764
   41    5000
   42    5000
   43    1655.4696
   44    5000
   45    5000
   46    1439.2845
   47    5000
   48    5000
   49    968.07129

BLOCK MASS
   6    173.2
   23    91.1876
   24    80.429995
   15    1.777
   25    124.02098
   35    3912.599
   36    3914.8945
   37    3913.8322
   1000001    5029.0749
   2000001    5018.4448
   1000002    5028.6279
   2000002    5021.1289
   1000003    5029.08
   2000003    5018.4529
   1000004    5028.6327
   2000004    5021.1297
   1000005    969.35033
   2000005    1641.7792
   1000006    1321.5777
   2000006    1707.973
   1000011    811.4314
   2000011    1325.6768
   1000012    807.16159
   1000013    811.45016
   2000013    1325.6982
   1000014    807.18351
   1000015    707.16163
   2000015    1427.895
   1000016    1425.122
   1000021    3189.83
   1000022   -354.73266
   1000023    372.14655
   1000025   -632.84133
   1000035   -668.56783
   1000024    361.13406
   1000037    667.26267

BLOCK ALPHA
      -0.024241923

BLOCK HMIX Q=  1502.4044
   1    361.90042
   2    40.446475
   3    243.99226
   4    15326399

BLOCK STOPMIX
   1   1    0.42270112
   1   2    0.90626915
   2   1   -0.90626915
   2   2    0.42270112

BLOCK SBOTMIX
   1   1    0.01818517
   1   2    0.99983464
   2   1   -0.99983464
   2   2    0.01818517

BLOCK STAUMIX
   1   1    0.016330415
   1   2    0.99986665
   2   1   -0.99986665
   2   2    0.016330415

BLOCK NMIX
   1   1   -0.106501
   1   2    0.17653796
   1   3   -0.7047757
   1   4   -0.67881005
   2   1    0.032144
   2   2   -0.057025743
   2   3   -0.70209033
   2   4    0.70907263
   3   1    0.96001462
   3   2    0.27401534
   3   3   -0.028531996
   3   4   -0.04973372
   4   1    0.2568973
   4   2   -0.94366202
   4   3   -0.097705161
   4   4   -0.18428096

BLOCK UMIX
   1   1   -0.12679193
   1   2    0.99192934
   2   1   -0.99192934
   2   2   -0.12679193

BLOCK VMIX
   1   1    0.23851617
   1   2    0.97113853
   2   1    0.97113853
   2   2   -0.23851617

BLOCK HIGGSBOUNDSINPUTHIGGSCOUPLINGSFERMIONS
       0, 1635.9173,3,36,15,15

BLOCK HIGGSBOUNDSINPUTHIGGSCOUPLINGSBOSONS
       0,4,36,21,21,23

BLOCK SPHENOLOWENERGY
   1    0.00027096781
   2    1.5988492e-06
   3    3.5205091e-05
   4    2.6065943e-15
   5    1.1135008e-10
   6    2.3266554e-08
   7    8.7473818e-14
   8    3.7368575e-09
   9    7.9120369e-07
   10    9.6316976e-05
   11    0.99491749
   12    0.54258753
   13    19.383644
   14    0
   15    0
   16    0.002159405
   17    2.2816801e-15
   18    2.4783309e-11
   19    8.2856787e-11
   20   -1.5847223e-14
   21   -6.7765646e-10
   22   -1.1462664e-07
   23    0
   24    0
   25    0
   26    0
   27    0
   28    0
   29    0
   30    0
   31    0
   39    8.0724684e-05
   40    0
   41    0
   42    0

BLOCK FWCOEF Q=  160
   305   4422   0   0   -0.18881911
   305   4422   0   2   -0.12558691
   305   4322   0   2    0.00031253346
   305   6421   0   0   -0.095227835
   305   6421   0   2   -0.068366658
   305   6321   0   2    4.2858145e-05
   3051111   4133   0   0    1.5923822
   3051111   4133   0   2    1.5932695
   3051111   4233   0   2    0.0002589335
   3051111   4137   0   0   -4.4150743
   3051111   4137   0   2   -4.4087519
   3051111   4237   0   2   -0.002012896
   3051313   4133   0   0    1.5923822
   3051313   4133   0   2    1.5932642
   3051313   4233   0   2    0.00025893237
   3051313   4137   0   0   -4.4150743
   3051313   4137   0   2   -4.4087572
   3051313   4237   0   2   -0.0020128995
   3051212   4137   0   0    1.5053501
   3051212   4137   0   2    1.5039916
   3051212   4237   0   2    0.0004386418
   3051414   4137   0   0    1.5053501
   3051414   4137   0   2    1.5039916
   3051414   4237   0   2    0.00043864183
   3051616   4137   0   0    1.5053501
   3051616   4137   0   2    1.5039915
   3051616   4237   0   2    0.00043864944

BLOCK IMFWCOEF Q=  160
   305   4422   0   0    3.858665e-07
   305   4422   0   2   -1.975731e-05
   305   4322   0   2    6.9782914e-06
   305   6421   0   0    3.3052018e-07
   305   6421   0   2   -1.8238038e-05
   305   6321   0   2    2.6395084e-06
   3051111   4133   0   2   -2.9544286e-06
   3051111   4233   0   2    5.0956877e-06
   3051111   4137   0   2    2.148752e-05
   3051111   4237   0   2   -3.9619956e-05
   3051313   4133   0   2   -2.9545071e-06
   3051313   4233   0   2    5.0956704e-06
   3051313   4137   0   2    2.1487734e-05
   3051313   4237   0   2   -3.9620021e-05
   3051212   4137   0   2   -4.3160088e-06
   3051212   4237   0   2    8.6338216e-06
   3051414   4137   0   2   -4.3160098e-06
   3051414   4237   0   2    8.6338216e-06
   3051616   4137   0   2   -4.3190964e-06
   3051616   4237   0   2    8.6338211e-06

DECAY 23  2.4952


DECAY 24  2.085


DECAY 1000011  1.4265026
    0.51649418   2   -1000037    12
    0.23790286   2    1000025    11
    0.16790595   2    1000035    11
    0.051767997   2   -1000024    12
    0.02344926   2    1000022    11
    0.0024797532   2    1000023    11

DECAY 2000011  3.9752291
    0.92066252   2    1000025    11
    0.061486545   2    1000035    11
    0.016381607   2    1000022    11
    0.0014692468   2    1000023    11

DECAY 1000013  1.4329617
    0.51427726   2   -1000037    14
    0.23687032   2    1000025    13
    0.16719372   2    1000035    13
    0.051537019   2   -1000024    14
    0.025557484   2    1000022    13
    0.0045641991   2    1000023    13

DECAY 2000013  4.0029243
    0.91432711   2    1000025    13
    0.061084869   2    1000035    13
    0.017974535   2    1000022    13
    0.0033613187   2   -1000024    14
    0.0031265211   2    1000023    13

DECAY 1000015  2.7555108
    0.47274129   2   -1000024    16
    0.25388242   2    1000022    15
    0.22502027   2    1000023    15
    0.047211293   2    1000025    15
    0.0010381469   2    1000035    15
    0.00010658942   2   -1000037    16

DECAY 2000015  17.268825
    0.43856813   2   -1000037    16
    0.14660545   2    1000035    15
    0.14571182   2    1000025    15
    0.12613349   2    1000022    15
    0.12153106   2    1000023    15
    0.0086857057   2   -1000024    16
    0.0063990341   2    1000015    23
    0.0063653056   2    1000015    25

DECAY 1000012  1.5076253
    0.44554778   2    1000037    11
    0.27133239   2    1000035    12
    0.17152326   2    1000024    11
    0.083596233   2    1000022    12
    0.019956322   2    1000025    12
    0.0080440113   2    1000023    12

DECAY 1000014  1.5140741
    0.44377343   2    1000037    13
    0.27024821   2    1000035    14
    0.17484825   2    1000024    13
    0.0832446   2    1000022    14
    0.019875307   2    1000025    14
    0.0080102022   2    1000023    14

DECAY 1000016  17.305192
    0.41943982   2    1000037    15
    0.2777928   2    1000024    15
    0.25760121   2    1000035    16
    0.017379918   2    1000022    16
    0.013327042   2    1000025    16
    0.012726548   2    1000015    24
    0.0017326638   2    1000023    16

DECAY 2000001  143.41584
    0.9810793   2    1000021    1
    0.017436786   2    1000025    1
    0.0012439413   2    1000035    1
    0.00021953578   2    1000022    1

DECAY 1000001  206.61418
    0.68634591   2    1000021    1
    0.20346774   2   -1000037    2
    0.10120327   2    1000035    1
    0.0040543139   2    1000022    1
    0.0034092108   2   -1000024    2
    0.0011022126   2    1000025    1
    0.00041734949   2    1000023    1

DECAY 2000003  143.44974
    0.98085339   2    1000021    3
    0.017432788   2    1000025    3
    0.0012447227   2    1000035    3
    0.0002767337   2    1000022    3
    0.00011368092   2   -1000024    4

DECAY 1000003  206.63314
    0.68628552   2    1000021    3
    0.20344979   2   -1000037    4
    0.10119485   2    1000035    3
    0.0040937718   2    1000022    3
    0.0034170914   2   -1000024    4
    0.0011021763   2    1000025    3
    0.00045680146   2    1000023    3

DECAY 1000005  12.540959
    0.46752592   2   -1000024    6
    0.26424458   2    1000022    5
    0.25112554   2    1000023    5
    0.013269964   2    1000025    5
    0.0021642727   2    1000035    5
    0.0016697236   2   -1000037    6

DECAY 2000005  79.858193
    0.34905091   2   -1000024    6
    0.26614144   2    1000006   -24
    0.1459802   2   -1000037    6
    0.086766717   2    1000022    5
    0.083461167   2    1000023    5
    0.063252719   2    1000035    5
    0.0028434009   2    1000005    25
    0.0016722545   2    1000005    23
    0.00083119851   2    1000025    5

DECAY 2000002  151.84157
    0.92847856   2    1000021    2
    0.065914364   2    1000025    2
    0.0047023423   2    1000035    2
    0.00082926613   2    1000022    2

DECAY 1000002  206.6128
    0.68612523   2    1000021    2
    0.1950105   2    1000037    1
    0.083344222   2    1000035    2
    0.020544121   2    1000025    2
    0.01206362   2    1000024    1
    0.0026334536   2    1000022    2
    0.00027886216   2    1000023    2

DECAY 2000004  151.84517
    0.92845666   2    1000021    4
    0.065912823   2    1000025    4
    0.0047026155   2    1000035    4
    0.00083469952   2    1000022    4

DECAY 1000004  206.63165
    0.68606475   2    1000021    4
    0.19499415   2    1000037    3
    0.083336956   2    1000035    4
    0.020542288   2    1000025    4
    0.01214141   2    1000024    3
    0.0026372331   2    1000022    4
    0.00028321031   2    1000023    4

DECAY 1000006  42.457651
    0.40270399   2    1000024    5
    0.23494837   2    1000023    6
    0.20154285   2    1000022    6
    0.083635492   2    1000037    5
    0.040411215   2    1000035    6
    0.036100532   2    1000025    6
    0.00024178742   2    1000022    4
    0.00019854065   2    1000005    24
    0.00019198446   3    1000022    24    5

DECAY 2000006  88.822889
    0.23854825   2    1000024    5
    0.19037875   2    1000022    6
    0.18858815   2    1000023    6
    0.16582848   2    1000006    23
    0.10681239   2    1000006    25
    0.065768026   2    1000037    5
    0.027256905   2    1000035    6
    0.013651227   2    1000025    6
    0.0031678152   2    1000005    24

DECAY 1000024  4.265204e-08
    0.36687734   3    1000022   -1    2
    0.30326411   3    1000022   -3    4
    0.12239427   3    1000022   -11    12
    0.12222855   3    1000022   -13    14
    0.085235733   3    1000022   -15    16

DECAY 1000037  4.4898266
    0.27985345   2    1000022    24
    0.24843066   2    1000024    23
    0.24794253   2    1000023    24
    0.22261599   2    1000024    25
    0.00070428882   3    1000022   -5    6
    0.00042714838   3    1000023   -5    6

DECAY 1000022 -1


DECAY 1000023  5.9850295e-06
    0.17398941   3    1000022    12   -12
    0.14957658   2    1000022    22
    0.13006251   3    1000022    1   -1
    0.13001813   3    1000022    3   -3
    0.10143825   3    1000022    2   -2
    0.094544603   3    1000022    4   -4
    0.066457165   3    1000022    5   -5
    0.029347018   3    1000022    11   -11
    0.02933242   3    1000022    13   -13
    0.025673082   3    1000022    15   -15
    0.011996156   3    1000024    1   -2
    0.011996156   3   -1000024   -1    2
    0.011240081   3    1000024    3   -4
    0.011240081   3   -1000024   -3    4
    0.0039994081   3    1000024    11   -12
    0.0039994081   3   -1000024   -11    12
    0.0039976108   3    1000024    13   -14
    0.0039976108   3   -1000024   -13    14
    0.0035471641   3    1000024    15   -16
    0.0035471641   3   -1000024   -15    16

DECAY 1000025  1.6857917
    0.44255089   2    1000024   -24
    0.44255089   2   -1000024    24
    0.050427726   2    1000023    23
    0.033754107   2    1000023    25
    0.025901228   2    1000022    25
    0.003483714   2    1000022    23
    0.0005937117   3    1000024    5   -6
    0.0005937117   3   -1000024   -5    6

DECAY 1000035  5.8353452
    0.25438822   2    1000023    23
    0.22289845   2    1000023    25
    0.17249486   2    1000022    25
    0.16332681   2    1000024   -24
    0.16332681   2   -1000024    24
    0.022579812   2    1000022    23
    0.00046330904   3    1000024    5   -6
    0.00046330904   3   -1000024   -5    6

DECAY 1000021  245.85485
    0.15817711   2    1000005   -5
    0.15817711   2   -1000005    5
    0.11839262   2    1000006   -6
    0.11839262   2   -1000006    6
    0.10868155   2    2000006   -6
    0.10868155   2   -2000006    6
    0.10377432   2    2000005   -5
    0.10377432   2   -2000005    5
    0.010875652   2    1000006   -4
    0.010875652   2   -1000006    4

DECAY 25  0.0037218489
    0.58605926   2   -5    5
    0.21463417   2   -24    24
    0.073412557   2    21    21
    0.067186691   2   -15    15
    0.028983816   2   -4    4
    0.02547909   2    23    23
    0.0023635439   2    22    22
    0.0014273069   2    22    23
    0.00023297428   2   -13    13
    0.00021982609   2   -3    3
    6.0779619e-07   2   -1    1
    1.4936209e-07   2   -2    2
    5.2375316e-09   2   -11    11

DECAY 35  120.27614
    0.48289045   2   -5    5
    0.11317609   2   -1000024    1000037
    0.11317609   2   -1000037    1000024
    0.10148296   2   -15    15
    0.065965037   2    1000023    1000035
    0.062649983   2    1000022    1000035
    0.017080048   2   -1000024    1000024
    0.0085832316   2    1000023    1000025
    0.0081065038   2    1000022    1000025
    0.0080963984   2    1000022    1000022
    0.0047262769   2   -1000037    1000037
    0.0027724541   2    1000035    1000035
    0.0018708338   2   -1000006    1000006
    0.0017269963   2    1000022    1000023
    0.0013862397   2   -2000006    2000006
    0.0013674606   2   -2000006    1000006
    0.0013674606   2   -1000006    2000006
    0.00077660571   2    1000025    1000035
    0.00068180212   2    1000023    1000023
    0.00065566822   2   -6    6
    0.00042427187   2   -2000015    1000015
    0.00042427187   2   -1000015    2000015
    0.00033775218   2   -13    13
    0.00020882682   2   -3    3
    5.4242887e-05   2    1000025    1000025
    3.4032435e-06   2   -2000005    1000005
    3.4032435e-06   2   -1000005    2000005
    2.5875562e-06   2    21    21
    6.5206955e-07   2   -1000015    1000015
    5.7731819e-07   2   -1    1
    3.7483194e-07   2   -2000015    2000015
    2.5609741e-07   2    25    25
    2.2487734e-07   2   -1000005    1000005
    6.9394285e-08   2    23    23
    6.6249872e-08   2    22    23
    3.058389e-08   2   -1000011    1000011
    3.0302334e-08   2   -1000013    1000013
    2.2337105e-08   2    22    22
    1.5928294e-08   2   -2000011    2000011
    1.5784171e-08   2   -2000013    2000013
    1.5040694e-08   2   -24    24
    1.0760355e-08   2   -4    4
    7.5850379e-09   2   -11    11
    8.2255465e-10   2   -2000013    1000013
    8.2255465e-10   2   -1000013    2000013
    6.662178e-10   2   -2000005    2000005
    5.5469332e-14   2   -2    2
    1.9239791e-14   2   -2000011    1000011
    1.9239791e-14   2   -1000011    2000011

DECAY 36  114.8429
    0.46641809   2   -5    5
    0.11894436   2   -1000024    1000037
    0.11894436   2   -1000037    1000024
    0.098029537   2   -15    15
    0.071335998   2    1000023    1000035
    0.063753764   2    1000022    1000035
    0.017559664   2   -1000024    1000024
    0.0092954381   2    1000023    1000025
    0.0082372663   2    1000022    1000025
    0.0079835716   2    1000022    1000022
    0.0046267862   2   -1000037    1000037
    0.0032106035   2   -2000006    1000006
    0.0032106035   2   -1000006    2000006
    0.0027272855   2    1000035    1000035
    0.0021011481   2    1000022    1000023
    0.00081676244   2    1000023    1000023
    0.00076352607   2    1000025    1000035
    0.00055484988   2   -6    6
    0.00044471118   2   -2000015    1000015
    0.00044471118   2   -1000015    2000015
    0.00032625266   2   -13    13
    0.00020171045   2   -3    3
    5.3294709e-05   2    1000025    1000025
    7.7904611e-06   2    21    21
    3.5872073e-06   2   -2000005    1000005
    3.5872073e-06   2   -1000005    2000005
    5.5764344e-07   2   -1    1
    1.4990114e-07   2    23    25
    2.5927734e-08   2    22    23
    9.0807471e-09   2   -4    4
    7.3268465e-09   2   -11    11
    1.390356e-09   2    22    22
    8.5633716e-10   2   -2000013    1000013
    8.5633716e-10   2   -1000013    2000013
    6.0966966e-13   2    23    35
    4.6812324e-14   2   -2    2
    2.0029815e-14   2   -2000011    1000011
    2.0029815e-14   2   -1000011    2000011
    1.472059e-37   2    25    25

DECAY 37  127.97241
    0.50664414   2   -5    6
    0.13908178   2    1000024    1000025
    0.11789939   2    1000022    1000037
    0.11069192   2    1000023    1000037
    0.10428932   2   -15    16
    0.0086859844   2    1000024    1000035
    0.0041086226   2    1000023    1000024
    0.0032403045   2   -2000005    1000006
    0.0012729433   2    1000035    1000037
    0.0011579147   2    1000025    1000037
    0.00079835519   2   -1000015    1000016
    0.00075061533   2   -5    4
    0.00043711201   2   -1000005    1000006
    0.00036869989   2   -13    14
    0.00034900883   2   -2000005    2000006
    0.00018241983   2   -3    4
    2.2799545e-05   2   -1000005    2000006
    8.5690969e-06   2   -3    2
    5.3601673e-06   2   -5    2
    2.1676743e-06   2    1000022    1000024
    1.2527562e-06   2   -3    6
    5.060315e-07   2   -1    2
    3.6935091e-07   2   -2000015    1000016
    1.3446097e-07   2    24    25
    1.1292251e-07   2   -1000011    1000012
    1.125509e-07   2   -1000013    1000014
    4.4998759e-08   2   -1    6
    2.4112227e-08   2   -1    4
    8.6239287e-09   2   -11    12
    1.5737743e-09   2   -2000013    1000014
    3.6812061e-14   2   -2000011    1000012
    3.0342848e-14   2    24    35

DECAY 6  2.43
    1   2    5    24

DECAY 15 -1
