# SUSY Les Houches Accord 2 - MSSM spectrum + Decays
# SPheno v4.0.5be
# W. Porod, Comput. Phys. Commun. 153 (2003) 275-315, hep-ph/0301101;
# W. Porod, F.~Staub, Comput. Phys. Commun. 183 (2012) 2458
#                     arXiv:1104.1573 [hep-ph] 
# in case of problems send email to porod@physik.uni-wuerzburg.de
# Created: 12.05.2022,  13:42
Block SPINFO         # Program information
     1   SPheno      # spectrum calculator
     2   v4.0.5be    # version number
#
Block SPhenoINFO     # SPheno specific information
    1      2         # using 2-loop RGEs
    2      2         # using pole masses for boundary conditions at mZ
Block MODSEL  # Model selection
    1    0    # general MSSM
Block MINPAR  # Input parameters
    3    4.38753823E+01  # tanb at m_Z    
    4    1.00000000E+00  # Sign(mu)
Block EXTPAR  # non-universal input parameters
    0    4.54614902E+03  # scale for input parameters
    1   -9.28396227E+02  # M_1
    2    4.45390407E+02  # M_2
    3    4.74209609E+03  # M_3
   11   -3.30675772E+03  # A_t
   12    1.61193877E+03  # A_b
   13    1.60284367E+03  # A_tau
   23    1.77590380E+02  # mu
   25    4.28865344E+01  # tan(beta)
   26    3.71345116E+03  # m_A, pole mass
   31    1.00000000E+04  # M_L11
   32    1.00000000E+04  # M_L22
   33    1.00000000E+04  # M_L33
   34    1.00000000E+04  # M_E11
   35    1.00000000E+04  # M_E22
   36    1.00000000E+04  # M_E33
   41    1.00000000E+04  # M_Q11
   42    1.00000000E+04  # M_Q22
   43    4.65563845E+03  # M_Q33
   44    1.00000000E+04  # M_U11
   45    1.00000000E+04  # M_U22
   46    4.23152085E+03  # M_U33
   47    1.00000000E+04  # M_D11
   48    1.00000000E+04  # M_D22
   49    2.28524266E+03  # M_D33
Block SMINPUTS  # SM parameters
         1     1.27908970E+02  # alpha_em^-1(MZ)^MSbar
         2     1.16637870E-05  # G_mu [GeV^-2]
         3     1.18400000E-01  # alpha_s(MZ)^MSbar
         4     9.11876000E+01  # m_Z(pole)
         5     4.18000000E+00  # m_b(m_b), MSbar
         6     1.73200000E+02  # m_t(pole)
         7     1.77700000E+00  # m_tau(pole)
         8     0.00000000E+00  # m_nu_3
        11     5.10998930E-04  # m_e(pole)
        12     0.00000000E+00  # m_nu_1
        13     1.05658372E-01  # m_muon(pole)
        14     0.00000000E+00  # m_nu_2
        21     5.00000000E-03  # m_d(2 GeV), MSbar
        22     2.50000000E-03  # m_u(2 GeV), MSbar
        23     9.50000000E-02  # m_s(2 GeV), MSbar
        24     1.27000000E+00  # m_c(m_c), MSbar
Block gauge Q=  4.54614902E+03  # (SUSY scale)
   1    3.55362975E-01  # g'(Q)^DRbar
   2    6.65198874E-01  # g(Q)^DRbar
   3    1.21977796E+00  # g3(Q)^DRbar
Block Yu Q=  4.54614902E+03  # (SUSY scale)
  1  1     8.38665111E-06   # Y_u(Q)^DRbar
  2  2     4.26041876E-03   # Y_c(Q)^DRbar
  3  3     1.01317482E+00   # Y_t(Q)^DRbar
Block Yd Q=  4.54614902E+03  # (SUSY scale)
  1  1     7.22752790E-04   # Y_d(Q)^DRbar
  2  2     1.37323030E-02   # Y_s(Q)^DRbar
  3  3     7.16744290E-01   # Y_b(Q)^DRbar
Block Ye Q=  4.54614902E+03  # (SUSY scale)
  1  1     1.26125647E-04   # Y_e(Q)^DRbar
  2  2     2.60787836E-02   # Y_mu(Q)^DRbar
  3  3     4.38602239E-01   # Y_tau(Q)^DRbar
Block Au Q=  4.54614902E+03  # (SUSY scale)
  1  1     0.00000000E+00   # A_u(Q)^DRbar
  2  2     0.00000000E+00   # A_c(Q)^DRbar
  3  3    -3.30675893E+03   # A_t(Q)^DRbar
Block Ad Q=  4.54614902E+03  # (SUSY scale)
  1  1     0.00000000E+00   # A_d(Q)^DRbar
  2  2     0.00000000E+00   # A_s(Q)^DRbar
  3  3     1.61193868E+03   # A_b(Q)^DRbar
Block Ae Q=  4.54614902E+03  # (SUSY scale)
  1  1     0.00000000E+00   # A_e(Q)^DRbar
  2  2     0.00000000E+00   # A_mu(Q)^DRbar
  3  3     1.60284346E+03   # A_tau(Q)^DRbar
Block MSOFT Q=  4.54614902E+03  # soft SUSY breaking masses at Q
   1   -9.28396227E+02  # M_1
   2    4.45390407E+02  # M_2
   3    4.74209609E+03  # M_3
  21    1.39907548E+07  # M^2_(H,d)
  22    4.27776613E+05  # M^2_(H,u)
  31    1.00000000E+04  # M_(L,11)
  32    1.00000000E+04  # M_(L,22)
  33    1.00000000E+04  # M_(L,33)
  34    1.00000000E+04  # M_(E,11)
  35    1.00000000E+04  # M_(E,22)
  36    1.00000000E+04  # M_(E,33)
  41    1.00000000E+04  # M_(Q,11)
  42    1.00000000E+04  # M_(Q,22)
  43    4.65563845E+03  # M_(Q,33)
  44    1.00000000E+04  # M_(U,11)
  45    1.00000000E+04  # M_(U,22)
  46    4.23152085E+03  # M_(U,33)
  47    1.00000000E+04  # M_(D,11)
  48    1.00000000E+04  # M_(D,22)
  49    2.28524266E+03  # M_(D,33)
Block MASS  # Mass spectrum
#   PDG code      mass          particle
         6     1.73200000E+02  # m_t(pole)
        23     9.11876000E+01  # m_Z(pole)
        24     8.04299946E+01  # W+
        15     1.77700000E+00  # m_tau(pole)
        25     1.25289476E+02  # h0
        35     3.71171525E+03  # H0
        36     3.71345116E+03  # A0
        37     3.71053753E+03  # H+
   1000001     1.01079565E+04  # ~d_L
   2000001     1.00832361E+04  # ~d_R
   1000002     1.01075910E+04  # ~u_L
   2000002     1.00854707E+04  # ~u_R
   1000003     1.01079569E+04  # ~s_L
   2000003     1.00832366E+04  # ~s_R
   1000004     1.01075913E+04  # ~c_L
   2000004     1.00854709E+04  # ~c_R
   1000005     2.46477001E+03  # ~b_1
   2000005     4.77268653E+03  # ~b_2
   1000006     4.32341082E+03  # ~t_1
   2000006     4.78036248E+03  # ~t_2
   1000011     1.00210591E+04  # ~e_L-
   2000011     1.00096702E+04  # ~e_R-
   1000012     1.00202861E+04  # ~nu_eL
   1000013     1.00210604E+04  # ~mu_L-
   2000013     1.00096722E+04  # ~mu_R-
   1000014     1.00202873E+04  # ~nu_muL
   1000015     1.00104260E+04  # ~tau_1-
   2000015     1.00214893E+04  # ~tau_2-
   1000016     1.00206950E+04  # ~nu_tauL
   1000021     5.23972617E+03  # ~g
   1000022     1.90378175E+02  # ~chi_10
   1000023     2.03566504E+02  # ~chi_20
   1000025     5.05203955E+02  # ~chi_30
   1000035     9.33881274E+02  # ~chi_40
   1000024     1.93874931E+02  # ~chi_1+
   1000037     5.05110458E+02  # ~chi_2+
# Higgs mixing
Block alpha # Effective Higgs mixing angle
          -2.28301904E-02   # alpha
Block Hmix Q=  4.54614902E+03  # Higgs mixing parameters
   1    1.77590380E+02  # mu
   2    4.28865344E+01  # tan[beta](Q)
   3    2.42822648E+02  # v(Q)
   4    1.37897195E+07  # m^2_A(Q)
Block stopmix # stop mixing matrix
   1  1     1.18684408E-01   # Re[R_st(1,1)]
   1  2     9.92932028E-01   # Re[R_st(1,2)]
   2  1    -9.92932028E-01   # Re[R_st(2,1)]
   2  2     1.18684408E-01   # Re[R_st(2,2)]
Block sbotmix # sbottom mixing matrix
   1  1     7.60953944E-04   # Re[R_sb(1,1)]
   1  2     9.99999710E-01   # Re[R_sb(1,2)]
   2  1    -9.99999710E-01   # Re[R_sb(2,1)]
   2  2     7.60953944E-04   # Re[R_sb(2,2)]
Block staumix # stau mixing matrix
   1  1     4.57661954E-02   # Re[R_sta(1,1)]
   1  2     9.98952179E-01   # Re[R_sta(1,2)]
   2  1    -9.98952179E-01   # Re[R_sta(2,1)]
   2  2     4.57661954E-02   # Re[R_sta(2,2)]
Block Nmix # neutralino mixing matrix
   1  1     2.73939308E-02   # Re[N(1,1)]
   1  2     1.86170624E-01   # Re[N(1,2)]
   1  3    -7.11413868E-01   # Re[N(1,3)]
   1  4     6.77111793E-01   # Re[N(1,4)]
   2  1     4.21980448E-02   # Re[N(2,1)]
   2  2     8.08158288E-02   # Re[N(2,2)]
   2  3     6.98411794E-01   # Re[N(2,3)]
   2  4     7.09865546E-01   # Re[N(2,4)]
   3  1     5.86261912E-03   # Re[N(3,1)]
   3  2    -9.79184155E-01   # Re[N(3,2)]
   3  3    -7.75902854E-02   # Re[N(3,3)]
   3  4     1.87466710E-01   # Re[N(3,4)]
   4  1    -9.98716440E-01   # Re[N(4,1)]
   4  2     2.77319097E-03   # Re[N(4,2)]
   4  3     9.54055348E-03   # Re[N(4,3)]
   4  4     4.96664875E-02   # Re[N(4,4)]
Block Umix # chargino mixing matrix
   1  1    -1.10852380E-01   # Re[U(1,1)]
   1  2     9.93836883E-01   # Re[U(1,2)]
   2  1     9.93836883E-01   # Re[U(2,1)]
   2  2     1.10852380E-01   # Re[U(2,2)]
Block Vmix # chargino mixing matrix
   1  1    -2.68080146E-01   # Re[V(1,1)]
   1  2     9.63396614E-01   # Re[V(1,2)]
   2  1     9.63396614E-01   # Re[V(2,1)]
   2  2     2.68080146E-01   # Re[V(2,2)]
DECAY        23     2.49520000E+00   # Z
DECAY        24     2.08500000E+00   # W
DECAY   2000011     4.94252954E+01   # ~e^-_R
#    BR                NDA      ID1      ID2
     7.63111305E-04    2     1000022        11   # BR(~e^-_R -> chi^0_1 e^-)
     1.81053875E-03    2     1000023        11   # BR(~e^-_R -> chi^0_2 e^-)
     9.97391488E-01    2     1000035        11   # BR(~e^-_R -> chi^0_4 e^-)
DECAY   1000011     1.44038985E+02   # ~e^-_L
#    BR                NDA      ID1      ID2
     1.23387948E-02    2     1000022        11   # BR(~e^-_L -> chi^0_1 e^-)
     3.26870236E-03    2     1000023        11   # BR(~e^-_L -> chi^0_2 e^-)
     2.90250134E-01    2     1000025        11   # BR(~e^-_L -> chi^0_3 e^-)
     8.47733936E-02    2     1000035        11   # BR(~e^-_L -> chi^0_4 e^-)
     7.52023822E-03    2    -1000024        12   # BR(~e^-_L -> chi^-_1 nu_e)
     6.01848737E-01    2    -1000037        12   # BR(~e^-_L -> chi^-_2 nu_e)
#    BR                NDA      ID1      ID2       ID3
DECAY   2000013     4.96959481E+01   # ~mu^-_R
#    BR                NDA      ID1      ID2
     2.13719329E-03    2     1000022        13   # BR(~mu^-_R -> chi^0_1 mu^-)
     3.12885850E-03    2     1000023        13   # BR(~mu^-_R -> chi^0_2 mu^-)
     9.91959974E-01    2     1000035        13   # BR(~mu^-_R -> chi^0_4 mu^-)
     2.68972569E-03    2    -1000024        14   # BR(~mu^-_R -> chi^-_1 nu_mu)
DECAY   1000013     1.44174480E+02   # ~mu^-_L
#    BR                NDA      ID1      ID2
     1.28028085E-02    2     1000022        13   # BR(~mu^-_L -> chi^0_1 mu^-)
     3.72396855E-03    2     1000023        13   # BR(~mu^-_L -> chi^0_2 mu^-)
     2.89983031E-01    2     1000025        13   # BR(~mu^-_L -> chi^0_3 mu^-)
     8.46938190E-02    2     1000035        13   # BR(~mu^-_L -> chi^0_4 mu^-)
     7.51317171E-03    2    -1000024        14   # BR(~mu^-_L -> chi^-_1 nu_mu)
     6.01283201E-01    2    -1000037        14   # BR(~mu^-_L -> chi^-_2 nu_mu)
#    BR                NDA      ID1      ID2       ID3
DECAY   1000015     1.26111675E+02   # ~tau^-_1
#    BR                NDA      ID1      ID2
     1.57598856E-01    2     1000022        15   # BR(~tau^-_1 -> chi^0_1 tau^-)
     1.47562708E-01    2     1000023        15   # BR(~tau^-_1 -> chi^0_2 tau^-)
     2.67895866E-04    2     1000025        15   # BR(~tau^-_1 -> chi^0_3 tau^-)
     3.90187073E-01    2     1000035        15   # BR(~tau^-_1 -> chi^0_4 tau^-)
     3.03856553E-01    2    -1000024        16   # BR(~tau^-_1 -> chi^-_1 nu_tau)
     5.26914114E-04    2    -1000037        16   # BR(~tau^-_1 -> chi^-_2 nu_tau)
DECAY   2000015     1.82246082E+02   # ~tau^-_2
#    BR                NDA      ID1      ID2
     1.13648749E-01    2     1000022        15   # BR(~tau^-_2 -> chi^0_1 tau^-)
     1.05986304E-01    2     1000023        15   # BR(~tau^-_2 -> chi^0_2 tau^-)
     2.31755911E-01    2     1000025        15   # BR(~tau^-_2 -> chi^0_3 tau^-)
     6.75530067E-02    2     1000035        15   # BR(~tau^-_2 -> chi^0_4 tau^-)
     3.15372976E-03    2    -1000024        16   # BR(~tau^-_2 -> chi^-_1 nu_tau)
     4.77902300E-01    2    -1000037        16   # BR(~tau^-_2 -> chi^-_2 nu_tau)
#    BR                NDA      ID1      ID2       ID3
DECAY   1000012     1.44043831E+02   # ~nu_e
#    BR                NDA      ID1      ID2
     9.00298858E-03    2     1000022        12   # BR(~nu_e -> chi^0_1 nu_e)
     1.03887015E-03    2     1000023        12   # BR(~nu_e -> chi^0_2 nu_e)
     2.93954680E-01    2     1000025        12   # BR(~nu_e -> chi^0_3 nu_e)
     8.65445678E-02    2     1000035        12   # BR(~nu_e -> chi^0_4 nu_e)
     4.39767277E-02    2     1000024        11   # BR(~nu_e -> chi^+_1 e^-)
     5.65482166E-01    2     1000037        11   # BR(~nu_e -> chi^+_2 e^-)
#    BR                NDA      ID1      ID2       ID3
DECAY   1000014     1.44179313E+02   # ~nu_mu
#    BR                NDA      ID1      ID2
     8.99452974E-03    2     1000022        14   # BR(~nu_mu -> chi^0_1 nu_mu)
     1.03789407E-03    2     1000023        14   # BR(~nu_mu -> chi^0_2 nu_mu)
     2.93678493E-01    2     1000025        14   # BR(~nu_mu -> chi^0_3 nu_mu)
     8.64632544E-02    2     1000035        14   # BR(~nu_mu -> chi^0_4 nu_mu)
     4.48634655E-02    2     1000024        13   # BR(~nu_mu -> chi^+_1 mu^-)
     5.64962364E-01    2     1000037        13   # BR(~nu_mu -> chi^+_2 mu^-)
#    BR                NDA      ID1      ID2       ID3
DECAY   1000016     1.82369412E+02   # ~nu_tau
#    BR                NDA      ID1      ID2
     7.11126906E-03    2     1000022        16   # BR(~nu_tau -> chi^0_1 nu_tau)
     8.20581427E-04    2     1000023        16   # BR(~nu_tau -> chi^0_2 nu_tau)
     2.32188628E-01    2     1000025        16   # BR(~nu_tau -> chi^0_3 nu_tau)
     6.83598059E-02    2     1000035        16   # BR(~nu_tau -> chi^0_4 nu_tau)
     2.42285067E-01    2     1000024        15   # BR(~nu_tau -> chi^+_1 tau^-)
     4.49234648E-01    2     1000037        15   # BR(~nu_tau -> chi^+_2 tau^-)
#    BR                NDA      ID1      ID2       ID3
DECAY   2000001     4.29631935E+02   # ~d_R
#    BR                NDA      ID1      ID2
     1.28459703E-02    2     1000035         1   # BR(~d_R -> chi^0_4 d)
     9.87119956E-01    2     1000021         1   # BR(~d_R -> ~g d)
DECAY   1000001     5.60879754E+02   # ~d_L
#    BR                NDA      ID1      ID2
     2.60533754E-03    2     1000022         1   # BR(~d_L -> chi^0_1 d)
     4.25954185E-04    2     1000023         1   # BR(~d_L -> chi^0_2 d)
     7.58365505E-02    2     1000025         1   # BR(~d_L -> chi^0_3 d)
     2.54374466E-03    2     1000035         1   # BR(~d_L -> chi^0_4 d)
     1.94803700E-03    2    -1000024         2   # BR(~d_L -> chi^-_1 u)
     1.55914053E-01    2    -1000037         2   # BR(~d_L -> chi^-_2 u)
     7.60726323E-01    2     1000021         1   # BR(~d_L -> ~g d)
DECAY   2000003     4.29707374E+02   # ~s_R
#    BR                NDA      ID1      ID2
     1.28437236E-02    2     1000035         3   # BR(~s_R -> chi^0_4 s)
     9.86946777E-01    2     1000021         3   # BR(~s_R -> ~g s)
DECAY   1000003     5.60921233E+02   # ~s_L
#    BR                NDA      ID1      ID2
     2.63924100E-03    2     1000022         3   # BR(~s_L -> chi^0_1 s)
     4.58781170E-04    2     1000023         3   # BR(~s_L -> chi^0_2 s)
     7.58313501E-02    2     1000025         3   # BR(~s_L -> chi^0_3 s)
     2.54356272E-03    2     1000035         3   # BR(~s_L -> chi^0_4 s)
     1.95392690E-03    2    -1000024         4   # BR(~s_L -> chi^-_1 c)
     1.55902996E-01    2    -1000037         4   # BR(~s_L -> chi^-_2 c)
     7.60670142E-01    2     1000021         3   # BR(~s_L -> ~g s)
DECAY   1000005     5.04780407E+01   # ~b_1
#    BR                NDA      ID1      ID2
     2.49642595E-01    2     1000022         5   # BR(~b_1 -> chi^0_1 b)
     2.40134469E-01    2     1000023         5   # BR(~b_1 -> chi^0_2 b)
     2.72334757E-03    2     1000025         5   # BR(~b_1 -> chi^0_3 b)
     1.99779084E-02    2     1000035         5   # BR(~b_1 -> chi^0_4 b)
     4.82025278E-01    2    -1000024         6   # BR(~b_1 -> chi^-_1 t)
     5.49640139E-03    2    -1000037         6   # BR(~b_1 -> chi^-_2 t)
DECAY   2000005     2.13481552E+02   # ~b_2
#    BR                NDA      ID1      ID2
     1.18464871E-01    2     1000022         5   # BR(~b_2 -> chi^0_1 b)
     1.11583019E-01    2     1000023         5   # BR(~b_2 -> chi^0_2 b)
     9.38087212E-02    2     1000025         5   # BR(~b_2 -> chi^0_3 b)
     2.98955502E-03    2     1000035         5   # BR(~b_2 -> chi^0_4 b)
     4.23419028E-01    2    -1000024         6   # BR(~b_2 -> chi^-_1 t)
     2.22785369E-01    2    -1000037         6   # BR(~b_2 -> chi^-_2 t)
     2.68372823E-02    2     1000006       -24   # BR(~b_2 -> ~t_1 W^-)
DECAY   2000002     4.46470262E+02   # ~u_R
#    BR                NDA      ID1      ID2
     4.94573096E-02    2     1000035         2   # BR(~u_R -> chi^0_4 u)
     9.50413382E-01    2     1000021         2   # BR(~u_R -> ~g u)
DECAY   1000002     5.60861489E+02   # ~u_L
#    BR                NDA      ID1      ID2
     2.89317992E-03    2     1000022         2   # BR(~u_L -> chi^0_1 u)
     6.18388061E-04    2     1000023         2   # BR(~u_L -> chi^0_2 u)
     7.55135203E-02    2     1000025         2   # BR(~u_L -> chi^0_3 u)
     2.38990628E-03    2     1000035         2   # BR(~u_L -> chi^0_4 u)
     1.13931002E-02    2     1000024         1   # BR(~u_L -> chi^+_1 d)
     1.46508749E-01    2     1000037         1   # BR(~u_L -> chi^+_2 d)
     7.60683156E-01    2     1000021         2   # BR(~u_L -> ~g u)
DECAY   2000004     4.46477528E+02   # ~c_R
#    BR                NDA      ID1      ID2
     4.94565219E-02    2     1000035         4   # BR(~c_R -> chi^0_4 c)
     9.50397893E-01    2     1000021         4   # BR(~c_R -> ~g c)
DECAY   1000004     5.60902924E+02   # ~c_L
#    BR                NDA      ID1      ID2
     2.89594649E-03    2     1000022         4   # BR(~c_L -> chi^0_1 c)
     6.21618236E-04    2     1000023         4   # BR(~c_L -> chi^0_2 c)
     7.55081725E-02    2     1000025         4   # BR(~c_L -> chi^0_3 c)
     2.38974581E-03    2     1000035         4   # BR(~c_L -> chi^0_4 c)
     1.14587974E-02    2     1000024         3   # BR(~c_L -> chi^+_1 s)
     1.46498756E-01    2     1000037         3   # BR(~c_L -> chi^+_2 s)
     7.60626964E-01    2     1000021         4   # BR(~c_L -> ~g c)
DECAY   1000006     1.84231120E+02   # ~t_1
#    BR                NDA      ID1      ID2
     2.24144263E-01    2     1000022         6   # BR(~t_1 -> chi^0_1 t)
     2.41728304E-01    2     1000023         6   # BR(~t_1 -> chi^0_2 t)
     8.29565730E-03    2     1000025         6   # BR(~t_1 -> chi^0_3 t)
     4.88401202E-02    2     1000035         6   # BR(~t_1 -> chi^0_4 t)
     4.59380697E-01    2     1000024         5   # BR(~t_1 -> chi^+_1 b)
     1.70700335E-02    2     1000037         5   # BR(~t_1 -> chi^+_2 b)
#    BR                NDA      ID1      ID2       ID3
     5.20843181E-04    3     1000022        24         5   # BR(~t_1 -> chi^0_1 W^+ b)
DECAY   2000006     2.14817385E+02   # ~t_2
#    BR                NDA      ID1      ID2
     2.04899495E-01    2     1000022         6   # BR(~t_2 -> chi^0_1 t)
     2.26364028E-01    2     1000023         6   # BR(~t_2 -> chi^0_2 t)
     1.15207981E-01    2     1000025         6   # BR(~t_2 -> chi^0_3 t)
     3.19763634E-03    2     1000035         6   # BR(~t_2 -> chi^0_4 t)
     2.22394858E-01    2     1000024         5   # BR(~t_2 -> chi^+_1 b)
     1.96187179E-01    2     1000037         5   # BR(~t_2 -> chi^+_2 b)
     1.36347882E-02    2     1000006        23   # BR(~t_2 -> ~t_1 Z)
     1.80360282E-02    2     1000006        25   # BR(~t_2 -> ~t_1 h^0)
DECAY   1000024     5.85025132E-10   # chi^+_1
#    BR                NDA      ID1      ID2       ID3
     4.37152453E-01    3     1000022        -1         2   # BR(chi^+_1 -> chi^0_1 d_bar u)
     2.31285830E-01    3     1000022        -3         4   # BR(chi^+_1 -> chi^0_1 s_bar c)
     1.45717497E-01    3     1000022       -11        12   # BR(chi^+_1 -> chi^0_1 e^+ nu_e)
     1.45055951E-01    3     1000022       -13        14   # BR(chi^+_1 -> chi^0_1 mu^+ nu_mu)
     4.07882690E-02    3     1000022       -15        16   # BR(chi^+_1 -> chi^0_1 tau^+ nu_tau)
DECAY   1000037     4.00914019E+00   # chi^+_2
#    BR                NDA      ID1      ID2
     2.52114825E-01    2     1000022        24   # BR(chi^+_2 -> chi^0_1 W^+)
     2.91134335E-01    2     1000023        24   # BR(chi^+_2 -> chi^0_2 W^+)
     2.46746926E-01    2     1000024        23   # BR(chi^+_2 -> chi^+_1 Z)
     2.09081881E-01    2     1000024        25   # BR(chi^+_2 -> chi^+_1 h^0)
#    BR                NDA      ID1      ID2       ID3
     4.81306716E-04    3     1000022        -5         6   # BR(chi^+_2 -> chi^0_1 b_bar t)
     4.40613890E-04    3     1000023        -5         6   # BR(chi^+_2 -> chi^0_2 b_bar t)
DECAY   1000022     0.00000000E+00   # chi^0_1
DECAY   1000023     1.98879865E-06   # chi^0_2
#    BR                NDA      ID1      ID2
     1.45453799E-01    2     1000022        22   # BR(chi^0_2 -> chi^0_1 photon)
#    BR                NDA      ID1      ID2       ID3
     7.30358837E-02    3     1000022         2        -2   # BR(chi^0_2 -> chi^0_1 u u_bar)
     6.45604854E-02    3     1000022         4        -4   # BR(chi^0_2 -> chi^0_1 c c_bar)
     9.36462126E-02    3     1000022         1        -1   # BR(chi^0_2 -> chi^0_1 d d_bar)
     9.35900466E-02    3     1000022         3        -3   # BR(chi^0_2 -> chi^0_1 s s_bar)
     2.52523877E-02    3     1000022         5        -5   # BR(chi^0_2 -> chi^0_1 b b_bar)
     2.11332652E-02    3     1000022        11       -11   # BR(chi^0_2 -> chi^0_1 e^- e^+)
     2.11132929E-02    3     1000022        13       -13   # BR(chi^0_2 -> chi^0_1 mu^- mu^+)
     1.62114329E-02    3     1000022        15       -15   # BR(chi^0_2 -> chi^0_1 tau^- tau^+)
     1.25232271E-01    3     1000022        12       -12   # BR(chi^0_2 -> chi^0_1 nu_e nu_bar_e)
     5.58860935E-02    3     1000024         1        -2   # BR(chi^0_2 -> chi^+_1 d u_bar)
     5.58860935E-02    3    -1000024        -1         2   # BR(chi^0_2 -> chi^-_1 d_bar u)
     5.13990923E-02    3     1000024         3        -4   # BR(chi^0_2 -> chi^+_1 s c_bar)
     5.13990923E-02    3    -1000024        -3         4   # BR(chi^0_2 -> chi^-_1 s_bar c)
     1.86286843E-02    3     1000024        11       -12   # BR(chi^0_2 -> chi^+_1 e^- nu_bar_e)
     1.86286843E-02    3    -1000024       -11        12   # BR(chi^0_2 -> chi^-_1 e^+ nu_e)
     1.86177187E-02    3     1000024        13       -14   # BR(chi^0_2 -> chi^+_1 mu^- nu_bar_mu)
     1.86177187E-02    3    -1000024       -13        14   # BR(chi^0_2 -> chi^-_1 mu^+ nu_mu)
     1.58538728E-02    3     1000024        15       -16   # BR(chi^0_2 -> chi^+_1 tau^- nu_bar_tau)
     1.58538728E-02    3    -1000024       -15        16   # BR(chi^0_2 -> chi^-_1 tau^+ nu_tau)
DECAY   1000025     4.69588986E+00   # chi^0_3
#    BR                NDA      ID1      ID2
     2.30396144E-01    2     1000024       -24   # BR(chi^0_3 -> chi^+_1 W^-)
     2.30396144E-01    2    -1000024        24   # BR(chi^0_3 -> chi^-_1 W^+)
     3.30679117E-02    2     1000022        23   # BR(chi^0_3 -> chi^0_1 Z)
     2.11704390E-01    2     1000023        23   # BR(chi^0_3 -> chi^0_2 Z)
     1.41389378E-01    2     1000022        25   # BR(chi^0_3 -> chi^0_1 h^0)
     1.52187392E-01    2     1000023        25   # BR(chi^0_3 -> chi^0_2 h^0)
#    BR                NDA      ID1      ID2       ID3
     4.18770854E-04    3     1000024         5        -6   # BR(chi^0_3 -> chi^+_1 b t_bar)
     4.18770854E-04    3    -1000024        -5         6   # BR(chi^0_3 -> chi^-_1 b_bar t)
DECAY   1000035     2.67252235E+00   # chi^0_4
#    BR                NDA      ID1      ID2
     2.25419916E-01    2     1000024       -24   # BR(chi^0_4 -> chi^+_1 W^-)
     2.25419916E-01    2    -1000024        24   # BR(chi^0_4 -> chi^-_1 W^+)
     4.40051870E-03    2     1000037       -24   # BR(chi^0_4 -> chi^+_2 W^-)
     4.40051870E-03    2    -1000037        24   # BR(chi^0_4 -> chi^-_2 W^+)
     1.50938350E-01    2     1000022        23   # BR(chi^0_4 -> chi^0_1 Z)
     7.42191577E-02    2     1000023        23   # BR(chi^0_4 -> chi^0_2 Z)
     3.92613572E-03    2     1000025        23   # BR(chi^0_4 -> chi^0_3 Z)
     1.49406199E-01    2     1000022        25   # BR(chi^0_4 -> chi^0_1 h^0)
     1.47761120E-01    2     1000023        25   # BR(chi^0_4 -> chi^0_2 h^0)
     3.41795958E-03    2     1000025        25   # BR(chi^0_4 -> chi^0_3 h^0)
#    BR                NDA      ID1      ID2       ID3
     1.23296868E-03    3     1000022         6        -6   # BR(chi^0_4 -> chi^0_1 t t_bar)
     1.20814178E-03    3     1000023         6        -6   # BR(chi^0_4 -> chi^0_2 t t_bar)
     4.08386056E-03    3     1000024         5        -6   # BR(chi^0_4 -> chi^+_1 b t_bar)
     4.08386056E-03    3    -1000024        -5         6   # BR(chi^0_4 -> chi^-_1 b_bar t)
DECAY   1000021     1.17902407E+02   # ~g
#    BR                NDA      ID1      ID2
     2.84246102E-04    2     1000006        -4   # BR(~g -> ~t_1 c_bar)
     2.84246102E-04    2    -1000006         4   # BR(~g -> ~t^*_1 c)
     6.27994988E-02    2     1000006        -6   # BR(~g -> ~t_1 t_bar)
     6.27994988E-02    2    -1000006         6   # BR(~g -> ~t^*_1 t)
     1.88228693E-02    2     2000006        -6   # BR(~g -> ~t_2 t_bar)
     1.88228693E-02    2    -2000006         6   # BR(~g -> ~t^*_2 t)
     3.98852624E-01    2     1000005        -5   # BR(~g -> ~b_1 b_bar)
     3.98852624E-01    2    -1000005         5   # BR(~g -> ~b^*_1 b)
     1.90804503E-02    2     2000005        -5   # BR(~g -> ~b_2 b_bar)
     1.90804503E-02    2    -2000005         5   # BR(~g -> ~b^*_2 b)
#    BR                NDA      ID1      ID2       ID3
DECAY        25     3.67840502E-03   # Gamma(h0)
     2.50587295E-03   2        22        22   # BR(h0 -> photon photon)
     1.62245143E-03   2        22        23   # BR(h0 -> photon Z)
     3.02415390E-02   2        23        23   # BR(h0 -> Z Z)
     2.48393829E-01   2       -24        24   # BR(h0 -> W W)
     7.70744668E-02   2        21        21   # BR(h0 -> gluon gluon)
     4.93576022E-09   2       -11        11   # BR(h0 -> Electron electron)
     2.19551600E-04   2       -13        13   # BR(h0 -> Muon muon)
     6.33050510E-02   2       -15        15   # BR(h0 -> Tau tau)
     1.40219069E-07   2        -2         2   # BR(h0 -> Up up)
     2.72127130E-02   2        -4         4   # BR(h0 -> Charm charm)
     5.71070295E-07   2        -1         1   # BR(h0 -> Down down)
     2.06542757E-04   2        -3         3   # BR(h0 -> Strange strange)
     5.49217266E-01   2        -5         5   # BR(h0 -> Bottom bottom)
DECAY        35     1.27819568E+02   # Gamma(HH)
     6.99889399E-09   2        22        22   # BR(HH -> photon photon)
     3.09950362E-08   2        22        23   # BR(HH -> photon Z)
     1.19877346E-07   2        23        23   # BR(HH -> Z Z)
     2.76650593E-08   2       -24        24   # BR(HH -> W W)
     4.62509688E-06   2        21        21   # BR(HH -> gluon gluon)
     7.99528533E-09   2       -11        11   # BR(HH -> Electron electron)
     3.56009167E-04   2       -13        13   # BR(HH -> Muon muon)
     1.02823243E-01   2       -15        15   # BR(HH -> Tau tau)
     3.70614984E-14   2        -2         2   # BR(HH -> Up up)
     7.18985102E-09   2        -4         4   # BR(HH -> Charm charm)
     5.19729042E-04   2        -6         6   # BR(HH -> Top top)
     5.67805604E-07   2        -1         1   # BR(HH -> Down down)
     2.05382029E-04   2        -3         3   # BR(HH -> Strange strange)
     5.21634577E-01   2        -5         5   # BR(HH -> Bottom bottom)
     1.89574672E-02   2  -1000024   1000024   # BR(HH -> Chargino1 chargino1)
     1.04294081E-01   2  -1000024   1000037   # BR(HH -> Chargino1 chargino2)
     1.04294081E-01   2  -1000037   1000024   # BR(HH -> Chargino2 chargino1)
     2.36909523E-03   2  -1000037   1000037   # BR(HH -> Chargino2 chargino2)
     3.86543122E-03   2   1000022   1000022   # BR(HH -> neutralino1 neutralino1)
     8.27296797E-04   2   1000022   1000023   # BR(HH -> neutralino1 neutralino2)
     5.08244538E-02   2   1000022   1000025   # BR(HH -> neutralino1 neutralino3)
     1.48502165E-02   2   1000022   1000035   # BR(HH -> neutralino1 neutralino4)
     5.44685578E-04   2   1000023   1000023   # BR(HH -> neutralino2 neutralino2)
     5.72695566E-02   2   1000023   1000025   # BR(HH -> neutralino2 neutralino3)
     1.48641374E-02   2   1000023   1000035   # BR(HH -> neutralino2 neutralino4)
     1.21917808E-03   2   1000025   1000025   # BR(HH -> neutralino3 neutralino3)
     2.71642366E-04   2   1000025   1000035   # BR(HH -> neutralino3 neutralino4)
     3.76305793E-06   2   1000035   1000035   # BR(HH -> neutralino4 neutralino4)
     5.80059071E-07   2        25        25   # BR(HH -> h0 h0)
DECAY        36     1.21710673E+02   # Gamma(A0)
     5.16735509E-08   2        22        22   # BR(A0 -> photon photon)
     8.34812312E-08   2        22        23   # BR(A0 -> photon Z)
     8.69753625E-06   2        21        21   # BR(A0 -> gluon gluon)
     7.75297469E-09   2       -11        11   # BR(A0 -> Electron electron)
     3.45224950E-04   2       -13        13   # BR(A0 -> Muon muon)
     9.97086343E-02   2       -15        15   # BR(A0 -> Tau tau)
     3.38343816E-14   2        -2         2   # BR(A0 -> Up up)
     6.56355254E-09   2        -4         4   # BR(A0 -> Charm charm)
     4.78252446E-04   2        -6         6   # BR(A0 -> Top top)
     5.50574198E-07   2        -1         1   # BR(A0 -> Down down)
     1.99148483E-04   2        -3         3   # BR(A0 -> Strange strange)
     5.05809558E-01   2        -5         5   # BR(A0 -> Bottom bottom)
     2.08120638E-02   2  -1000024   1000024   # BR(A0 -> Chargino1 chargino1)
     1.08702524E-01   2  -1000024   1000037   # BR(A0 -> Chargino1 chargino2)
     1.08702524E-01   2  -1000037   1000024   # BR(A0 -> Chargino2 chargino1)
     3.35835704E-03   2  -1000037   1000037   # BR(A0 -> Chargino2 chargino2)
     4.46166389E-03   2   1000022   1000022   # BR(A0 -> neutralino1 neutralino1)
     7.03889389E-04   2   1000022   1000023   # BR(A0 -> neutralino1 neutralino2)
     5.93494212E-02   2   1000022   1000025   # BR(A0 -> neutralino1 neutralino3)
     1.62451850E-02   2   1000022   1000035   # BR(A0 -> neutralino1 neutralino4)
     5.26342468E-04   2   1000023   1000023   # BR(A0 -> neutralino2 neutralino2)
     5.36101876E-02   2   1000023   1000025   # BR(A0 -> neutralino2 neutralino3)
     1.49838397E-02   2   1000023   1000035   # BR(A0 -> neutralino2 neutralino4)
     1.71266383E-03   2   1000025   1000025   # BR(A0 -> neutralino3 neutralino3)
     2.77809657E-04   2   1000025   1000035   # BR(A0 -> neutralino3 neutralino4)
     3.06639533E-06   2   1000035   1000035   # BR(A0 -> neutralino4 neutralino4)
     2.45885870E-07   2        23        25   # BR(A0 -> Z h0)
     1.42282223E-13   2        23        35   # BR(A0 -> Z HH)
     3.08949206E-41   2        25        25   # BR(A0 -> h0 h0)
DECAY        37     1.35971654E+02   # Gamma(Hp)
     8.68742247E-09   2       -11        12   # BR(Hp -> Electron nu_e)
     3.71414444E-04   2       -13        14   # BR(Hp -> Muon nu_mu)
     1.05057150E-01   2       -15        16   # BR(Hp -> Tau nu_tau)
     5.37021684E-07   2        -1         2   # BR(Hp -> Down up)
     9.08663083E-06   2        -3         2   # BR(Hp -> Strange up)
     5.73511879E-06   2        -5         2   # BR(Hp -> Bottom up)
     2.54650335E-08   2        -1         4   # BR(Hp -> Down charm)
     1.93547772E-04   2        -3         4   # BR(Hp -> Strange charm)
     8.03121933E-04   2        -5         4   # BR(Hp -> Bottom charm)
     3.57604249E-08   2        -1         6   # BR(Hp -> Down top)
     1.06760805E-06   2        -3         6   # BR(Hp -> Strange top)
     5.41972155E-01   2        -5         6   # BR(Hp -> Bottom top)
     9.78649104E-04   2   1000022   1000024   # BR(Hp -> neutralino1 chargino1)
     1.13703887E-01   2   1000022   1000037   # BR(Hp -> neutralino1 chargino2)
     5.57031017E-03   2   1000023   1000024   # BR(Hp -> neutralino2 chargino1)
     1.00281011E-01   2   1000023   1000037   # BR(Hp -> neutralino2 chargino2)
     1.03449282E-01   2   1000024   1000025   # BR(Hp -> chargino1 neutralino3)
     1.39630879E-07   2   1000025   1000037   # BR(Hp -> neutralino3 chargino2)
     2.70965110E-02   2   1000024   1000035   # BR(Hp -> chargino1 neutralino4)
     5.06104200E-04   2   1000035   1000037   # BR(Hp -> neutralino4 chargino2)
     2.19666436E-07   2        24        25   # BR(Hp -> W h0)
DECAY         6     2.43000000E+00   # top
#    BR                NDA      ID1      ID2
     1.00000000E+00    2           5        24   # BR(t -> b W)
Block HiggsBoundsInputHiggsCouplingsFermions
# ScalarNormEffCoupSq PseudoSNormEffCoupSq NP IP1 IP2 IP2
    9.59006561E-01    0.00000000E+00        3  25   5   5  # h0-b-b eff. coupling^2, normalised to SM
    1.83929583E+03    0.00000000E+00        3  35   5   5  # H0-b-b eff. coupling^2, normalised to SM
    0.00000000E+00    1.83925483E+03        3  36   5   5  # A0-b-b eff. coupling^2, normalised to SM
#
    1.00002229E+00    0.00000000E+00        3  25   6   6  # h0-t-t eff. coupling^2, normalised to SM
    5.21410380E-04    0.00000000E+00        3  35   6   6  # H0-t-t eff. coupling^2, normalised to SM
    0.00000000E+00    5.43698449E-04        3  36   6   6  # A0-t-t eff. coupling^2, normalised to SM
#
    9.59006561E-01    0.00000000E+00        3  25  15  15  # h0-tau-tau eff. coupling^2, normalised to SM
    1.83929583E+03    0.00000000E+00        3  35  15  15  # H0-tau-tau eff. coupling^2, normalised to SM
    0.00000000E+00    1.83925483E+03        3  36  15  15  # A0-tau-tau eff. coupling^2, normalised to SM
#
Block HiggsBoundsInputHiggsCouplingsBosons
    9.99999767E-01        3  25  24  24  # h0-W-W eff. coupling^2, normalised to SM
    2.33218806E-07        3  35  24  24  # H0-W-W eff. coupling^2, normalised to SM
    0.00000000E+00        3  36  24  24  # A0-W-W eff. coupling^2, normalised to SM
#
    9.99999767E-01        3  25  23  23  # h0-Z-Z eff. coupling^2, normalised to SM
    2.33218806E-07        3  35  23  23  # H0-Z-Z eff. coupling^2, normalised to SM
    0.00000000E+00        3  36  23  23  # A0-Z-Z eff. coupling^2, normalised to SM
#
    1.26921056E+00        3  25  21  21  # h0-g-g eff. coupling^2, normalised to SM
    7.69222264E-03        3  35  21  21  # H0-g-g eff. coupling^2, normalised to SM
    1.23242256E-01        3  36  21  21  # A0-g-g eff. coupling^2, normalised to SM
#
    0.00000000E+00        3  25  25  23  # h0-h0-Z eff. coupling^2, normalised to SM
    0.00000000E+00        3  35  25  23  # H0-h0-Z eff. coupling^2, normalised to SM
    2.33218806E-07        3  36  25  23  # A0-h0-Z eff. coupling^2, normalised to SM
    0.00000000E+00        3  35  35  23  # H0-H0-Z eff. coupling^2, normalised to SM
    9.99999767E-01        3  36  35  23  # A0-H0-Z eff. coupling^2, normalised to SM
    0.00000000E+00        3  36  36  23  # A0-A0-Z eff. coupling^2, normalised to SM
#
    0.00000000E+00        4  25  21  21  23  # h0-g-g-Z eff. coupling^2, normalised to SM
    0.00000000E+00        4  35  21  21  23  # H0-g-g-Z eff. coupling^2, normalised to SM
    0.00000000E+00        4  36  21  21  23  # A0-g-g-Z eff. coupling^2, normalised to SM
Block SPhenoLowEnergy  # low energy observables
    1    3.18714977E-04   # BR(b -> s gamma)
    2    1.59054283E-06   # BR(b -> s mu+ mu-)
    3    3.52540515E-05   # BR(b -> s nu nu)
    4    2.82402038E-15   # BR(Bd -> e+ e-)
    5    1.20638290E-10   # BR(Bd -> mu+ mu-)
    6    2.52166063E-08   # BR(Bd -> tau+ tau-)
    7    9.45364725E-14   # BR(Bs -> e+ e-)
    8    4.03857467E-09   # BR(Bs -> mu+ mu-)
    9    8.55420219E-07   # BR(Bs -> tau+ tau-)
   10    9.60390625E-05   # BR(B_u -> tau nu)
   11    9.92046748E-01   # BR(B_u -> tau nu)/BR(B_u -> tau nu)_SM
   12    5.41837796E-01   # |Delta(M_Bd)| [ps^-1] 
   13    1.93553164E+01   # |Delta(M_Bs)| [ps^-1] 
   14    0.00000000E+00   # neutron EDM according to the chiral quark model
   15    0.00000000E+00   # neutron EDM according to the relativistic quark-parton model
   16    2.15680036E-03   # epsilon_K
   17    2.28165376E-15   # Delta(M_K)
   18    2.48004765E-11   # BR(K^0 -> pi^0 nu nu)
   19    8.29062665E-11   # BR(K^+ -> pi^+ nu nu)
   20    2.63817929E-16   # Delta(g-2)_electron/2
   21    1.12791921E-11   # Delta(g-2)_muon/2
   22    3.20273428E-09   # Delta(g-2)_tau/2
   23    0.00000000E+00   # electric dipole moment of the electron
   24    0.00000000E+00   # electric dipole moment of the muon
   25    0.00000000E+00   # electric dipole moment of the tau
   26    0.00000000E+00   # Br(mu -> e gamma)
   27    0.00000000E+00   # Br(tau -> e gamma)
   28    0.00000000E+00   # Br(tau -> mu gamma)
   29    0.00000000E+00   # Br(mu -> 3 e)
   30    0.00000000E+00   # Br(tau -> 3 e)
   31    0.00000000E+00   # Br(tau -> 3 mu)
   39    6.68649197E-05   # Delta(rho_parameter)
   40    0.00000000E+00   # BR(Z -> e mu)
   41    0.00000000E+00   # BR(Z -> e tau)
   42    0.00000000E+00   # BR(Z -> mu tau)
Block FWCOEF Q=  1.60000000E+02  # Wilson coefficients at scale Q
#    id        order  M        value         comment
     0305 4422   00   0    -1.88819110E-01   # C7
     0305 4422   00   2    -1.86026886E-01   # C7
     0305 4322   00   2    -2.78546810E-05   # C7'
     0305 6421   00   0    -9.52278348E-02   # C8
     0305 6421   00   2    -9.84607577E-02   # C8
     0305 6321   00   2    -1.07209041E-04   # C8'
 03051111 4133   00   0     1.63169952E+00   # C9 e+e-
 03051111 4133   00   2     1.63188232E+00   # C9 e+e-
 03051111 4233   00   2     3.91246687E-04   # C9' e+e-
 03051111 4137   00   0    -4.45439162E+00   # C10 e+e-
 03051111 4137   00   2    -4.45296891E+00   # C10 e+e-
 03051111 4237   00   2    -2.87472909E-03   # C10' e+e-
 03051313 4133   00   0     1.63169952E+00   # C9 mu+mu-
 03051313 4133   00   2     1.63188217E+00   # C9 mu+mu-
 03051313 4233   00   2     3.91246374E-04   # C9' mu+mu-
 03051313 4137   00   0    -4.45439162E+00   # C10 mu+mu-
 03051313 4137   00   2    -4.45296906E+00   # C10 mu+mu-
 03051313 4237   00   2    -2.87472924E-03   # C10' mu+mu-
 03051212 4137   00   0     1.50535012E+00   # C11 nu_1 nu_1
 03051212 4137   00   2     1.50504420E+00   # C11 nu_1 nu_1
 03051212 4237   00   2     6.20924728E-04   # C11' nu_1 nu_1
 03051414 4137   00   0     1.50535012E+00   # C11 nu_2 nu_2
 03051414 4137   00   2     1.50504420E+00   # C11 nu_2 nu_2
 03051414 4237   00   2     6.20924770E-04   # C11' nu_2 nu_2
 03051616 4137   00   0     1.50535012E+00   # C11 nu_3 nu_3
 03051616 4137   00   2     1.50504420E+00   # C11 nu_3 nu_3
 03051616 4237   00   2     6.20936840E-04   # C11' nu_3 nu_3
Block IMFWCOEF Q=  1.60000000E+02  # Im(Wilson coefficients) at scale Q
#    id        order  M        value         comment
     0305 4422   00   0     3.85822991E-07   # C7
     0305 4422   00   2     7.38856756E-06   # C7
     0305 4322   00   2     1.20385287E-06   # C7'
     0305 6421   00   0     3.30482908E-07   # C8
     0305 6421   00   2    -4.80584350E-06   # C8
     0305 6321   00   2     3.08119599E-07   # C8'
 03051111 4133   00   2     4.22440967E-07   # C9 e+e-
 03051111 4233   00   2     7.61149516E-06   # C9' e+e-
 03051111 4137   00   2     4.77312617E-07   # C10 e+e-
 03051111 4237   00   2    -5.59288157E-05   # C10' e+e-
 03051313 4133   00   2     4.22437017E-07   # C9 mu+mu-
 03051313 4233   00   2     7.61149312E-06   # C9' mu+mu-
 03051313 4137   00   2     4.77316669E-07   # C10 mu+mu-
 03051313 4237   00   2    -5.59288218E-05   # C10' mu+mu-
 03051212 4137   00   2    -7.85878059E-08   # C11 nu_1 nu_1
 03051212 4237   00   2     1.20802993E-05   # C11' nu_1 nu_1
 03051414 4137   00   2    -7.85876022E-08   # C11 nu_2 nu_2
 03051414 4237   00   2     1.20802993E-05   # C11' nu_2 nu_2
 03051616 4137   00   2    -7.85304450E-08   # C11 nu_3 nu_3
 03051616 4237   00   2     1.20802993E-05   # C11' nu_3 nu_3
