BLOCK SPINFO
   1   SPheno
   2   v4.0.5be

BLOCK SPHENOINFO
   1   2
   2   2

BLOCK MODSEL
   1   0

BLOCK MINPAR
   3    19.359038
   4    1

BLOCK EXTPAR
   0    2404.2916
   1    1336.9308
   2    3848.069
   3    1487.59
   11    4856.7574
   12    4770.75
   13   -6888.9107
   23    1665.3823
   25    18.511977
   26    952.12767
   31    4780.6101
   32    4780.6101
   33    2375.4258
   34    2774.6723
   35    2774.6723
   36    3215.1667
   41    3089.9214
   42    3089.9214
   43    1863.6159
   44    3584.3044
   45    3584.3044
   46    3101.6482
   47    2155.3391
   48    2155.3391
   49    1258.069

BLOCK SMINPUTS
   1    127.90897
   2    1.1663787e-05
   3    0.1184
   4    91.1876
   5    4.18
   6    173.2
   7    1.777
   8    0
   11    0.00051099893
   12    0
   13    0.10565837
   14    0
   21    0.005
   22    0.0025
   23    0.095
   24    1.27

BLOCK GAUGE Q=  2404.2916
   1    0.35536298
   2    0.66519887
   3    1.219778

BLOCK YU Q=  2404.2916
   1   1    8.3965963e-06
   2   2    0.0042654709
   3   3    1.0143763

BLOCK YD Q=  2404.2916
   1   1    0.00031234627
   2   2    0.0059345791
   3   3    0.30974962

BLOCK YE Q=  2404.2916
   1   1    5.4506708e-05
   2   2    0.011270258
   3   3    0.18954721

BLOCK AU Q=  2404.2916
   1   1    0
   2   2    0
   3   3    4856.7553

BLOCK AD Q=  2404.2916
   1   1    0
   2   2    0
   3   3    4770.7356

BLOCK AE Q=  2404.2916
   1   1    0
   2   2    0
   3   3   -6888.9124

BLOCK MSOFT Q=  2404.2916
   1    1336.9308
   2    3848.069
   3    1487.59
   21   -1883653.7
   22   -2684875.8
   31    4780.6101
   32    4780.6101
   33    2375.4258
   34    2774.6723
   35    2774.6723
   36    3215.1667
   41    3089.9214
   42    3089.9214
   43    1863.6159
   44    3584.3044
   45    3584.3044
   46    3101.6482
   47    2155.3391
   48    2155.3391
   49    1258.069

BLOCK MASS
   6    173.2
   23    91.1876
   24    80.429995
   15    1.777
   25    125.01651
   35    952.09405
   36    952.12767
   37    955.75151
   1000001    3152.4406
   2000001    2208.5592
   1000002    3151.5598
   2000002    3631.5162
   1000003    3152.4399
   2000003    2208.5584
   1000004    3151.5591
   2000004    3631.5158
   1000005    1341.319
   2000005    1914.2571
   1000006    1899.0787
   2000006    3043.9065
   1000011    4794.0911
   2000011    2773.2019
   1000012    4793.0355
   1000013    4794.0889
   2000013    2773.2016
   1000014    4793.0332
   1000015    2394.3468
   2000015    3205.5448
   1000016    2392.7822
   1000021    1708.3515
   1000022    1330.2289
   1000023   -1678.3514
   1000025    1679.7228
   1000035    3820.0344
   1000024    1677.2383
   1000037    3820.1149

BLOCK ALPHA
      -0.053085926

BLOCK HMIX Q=  2404.2916
   1    1665.3823
   2    18.511977
   3    243.46443
   4    906547.1

BLOCK STOPMIX
   1   1   -0.99366935
   1   2    0.11234418
   2   1   -0.11234418
   2   2   -0.99366935

BLOCK SBOTMIX
   1   1    0.025548563
   1   2    0.99967358
   2   1   -0.99967358
   2   2    0.025548563

BLOCK STAUMIX
   1   1    0.99989314
   1   2    0.014619053
   2   1   -0.014619053
   2   2    0.99989314

BLOCK NMIX
   1   1   -0.99547952
   1   2    0.0019338838
   1   3   -0.073695275
   1   4    0.059881522
   2   1   -0.0097756326
   2   2    0.0095063429
   2   3    0.70691328
   2   4    0.70716877
   3   1   -0.094470822
   3   2   -0.026445858
   3   3    0.70334767
   3   4   -0.70404398
   4   1   -0.00048048039
   4   2    0.99960317
   4   3    0.012027764
   4   4   -0.025467547

BLOCK UMIX
   1   1   -0.017031469
   1   2    0.99985495
   2   1    0.99985495
   2   2    0.017031469

BLOCK VMIX
   1   1   -0.03608193
   1   2    0.99934884
   2   1    0.99934884
   2   2    0.03608193

BLOCK HIGGSBOUNDSINPUTHIGGSCOUPLINGSFERMIONS
       0, 342.69329,3,36,15,15

BLOCK HIGGSBOUNDSINPUTHIGGSCOUPLINGSBOSONS
       0,4,36,21,21,23

BLOCK SPHENOLOWENERGY
   1    0.00036983119
   2    1.5876367e-06
   3    3.5261103e-05
   4    2.7344116e-15
   5    1.1681096e-10
   6    2.4453779e-08
   7    9.1155772e-14
   8    3.8941712e-09
   9    8.2598061e-07
   10    9.3870381e-05
   11    0.96964509
   12    0.54254084
   13    19.373338
   14    0
   15    0
   16    0.0021603393
   17    2.2816922e-15
   18    2.4811398e-11
   19    8.2924956e-11
   20    3.7147558e-16
   21    1.5881481e-11
   22    9.3907782e-09
   23    0
   24    0
   25    0
   26    0
   27    0
   28    0
   29    0
   30    0
   31    0
   39    5.6906493e-05
   40    0
   41    0
   42    0

BLOCK FWCOEF Q=  160
   305   4422   0   0   -0.18881911
   305   4422   0   2   -0.23811729
   305   4322   0   2   -0.00088664406
   305   6421   0   0   -0.095227835
   305   6421   0   2   -0.15074884
   305   6321   0   2   -0.001016419
   3051111   4133   0   0    1.6085212
   3051111   4133   0   2    1.6090809
   3051111   4233   0   2    5.0401545e-05
   3051111   4137   0   0   -4.4312133
   3051111   4137   0   2   -4.4303989
   3051111   4237   0   2   -0.00038063951
   3051313   4133   0   0    1.6085212
   3051313   4133   0   2    1.6090808
   3051313   4233   0   2    5.0400638e-05
   3051313   4137   0   0   -4.4312133
   3051313   4137   0   2   -4.430399
   3051313   4237   0   2   -0.0003806387
   3051212   4137   0   0    1.5053501
   3051212   4137   0   2    1.5051735
   3051212   4237   0   2    8.2646123e-05
   3051414   4137   0   0    1.5053501
   3051414   4137   0   2    1.5051735
   3051414   4237   0   2    8.2646313e-05
   3051616   4137   0   0    1.5053501
   3051616   4137   0   2    1.5051728
   3051616   4237   0   2    8.2699908e-05

BLOCK IMFWCOEF Q=  160
   305   4422   0   0    3.8576623e-07
   305   4422   0   2    3.1855296e-05
   305   4322   0   2   -2.7778138e-06
   305   6421   0   0    3.3043428e-07
   305   6421   0   2   -7.0047105e-05
   305   6321   0   2   -2.8564529e-06
   3051111   4133   0   2   -6.6649073e-07
   3051111   4233   0   2    1.8129822e-06
   3051111   4137   0   2    1.134686e-05
   3051111   4237   0   2   -1.3739463e-05
   3051313   4133   0   2   -6.6648984e-07
   3051313   4233   0   2    1.8129816e-06
   3051313   4137   0   2    1.1346861e-05
   3051313   4237   0   2   -1.3739465e-05
   3051212   4137   0   2   -2.4588816e-06
   3051212   4237   0   2    2.9831714e-06
   3051414   4137   0   2   -2.4588817e-06
   3051414   4237   0   2    2.9831714e-06
   3051616   4137   0   2   -2.471188e-06
   3051616   4237   0   2    2.9831724e-06

DECAY 23  2.4952


DECAY 24  2.085


DECAY 2000011  8.2356985
    0.9938821   2    1000022    11
    0.0060529475   2    1000025    11

DECAY 1000011  13.584167
    0.41388769   2   -1000037    12
    0.37156083   2    1000022    11
    0.20676373   2    1000035    11
    0.0070717081   2    1000025    11
    0.00069407291   2   -1000024    12

DECAY 2000013  8.241333
    0.99320495   2    1000022    13
    0.0062175698   2    1000025    13
    0.00034192279   2   -1000024    14
    0.00023556214   2    1000023    13

DECAY 1000013  13.593948
    0.41358837   2   -1000037    14
    0.37129743   2    1000022    13
    0.20661423   2    1000035    13
    0.0074058132   2    1000025    13
    0.00069357303   2   -1000024    14
    0.00036480173   2    1000023    13

DECAY 1000015  1.8792725
    0.75678002   2    1000022    15
    0.12432278   2    1000025    15
    0.11759033   2    1000023    15
    0.0013068756   2   -1000024    16

DECAY 2000015  14.236745
    0.7683835   2    1000022    15
    0.084688835   2   -1000024    16
    0.047337463   2    1000025    15
    0.042498667   2    1000023    15
    0.028774633   2    1000016   -24
    0.014250463   2    1000015    23
    0.014066436   2    1000015    25

DECAY 1000012  13.588453
    0.4126143   2    1000037    11
    0.37677541   2    1000022    12
    0.20654851   2    1000035    12
    0.0031131256   2    1000024    11
    0.00068937964   2    1000025    12
    0.00025926987   2    1000023    12

DECAY 1000014  13.597744
    0.41233084   2    1000037    13
    0.37651773   2    1000022    14
    0.20640659   2    1000035    14
    0.0037966639   2    1000024    13
    0.00068890808   2    1000025    14
    0.00025909253   2    1000023    14

DECAY 1000016  1.8837253
    0.76037011   2    1000022    16
    0.23848687   2    1000024    15
    0.00083001074   2    1000025    16
    0.00031300788   2    1000023    16

DECAY 2000001  28.625011
    0.9825977   2    1000021    1
    0.017333196   2    1000022    1

DECAY 1000001  124.44961
    0.99753523   2    1000021    1
    0.0024189557   2    1000022    1

DECAY 2000003  28.625495
    0.98257869   2    1000021    3
    0.017332984   2    1000022    3

DECAY 1000003  124.4514
    0.99752024   2    1000021    3
    0.0024189828   2    1000022    3

DECAY 1000005  0.00016896072
    1   2    1000022    5

DECAY 2000005  8.5880893
    0.72810895   2    1000021    5
    0.16073497   2   -1000024    6
    0.056905345   2    1000005    25
    0.022975767   2    1000005    23
    0.011415402   2    1000023    5
    0.011170779   2    1000025    5
    0.0086887869   2    1000022    5

DECAY 1000002  124.37083
    0.99742437   2    1000021    2
    0.002315923   2    1000022    2
    0.00014922883   2    1000024    1
    0.0001070282   2    1000025    2

DECAY 2000002  179.88615
    0.96625716   2    1000021    2
    0.033491572   2    1000022    2
    0.00024860799   2    1000025    2

DECAY 1000004  124.37237
    0.99741063   2    1000021    4
    0.0023159208   2    1000022    4
    0.00015831269   2    1000024    3
    0.00010933596   2    1000025    4

DECAY 2000004  179.88764
    0.96624842   2    1000021    4
    0.033491277   2    1000022    4
    0.00025086527   2    1000025    4

DECAY 1000006  3.6333247
    0.4780969   2    1000021    6
    0.17716156   2    1000023    6
    0.16771843   2    1000025    6
    0.10071555   2    1000005    24
    0.052234752   2    1000024    5
    0.023829418   2    1000022    6
    0.00024203051   3    1000022    24    5

DECAY 2000006  317.28234
    0.35776874   2    1000021    6
    0.16716919   2    2000005    24
    0.13842898   2    1000006    25
    0.094513475   2    1000024    5
    0.084996831   2    1000006    23
    0.046049067   2    1000023    6
    0.045806662   2    1000025    6
    0.024379822   2    2000005    37
    0.014208855   2    1000022    6
    0.013067866   2    1000006    36
    0.012360348   2    1000006    35
    0.00099045964   2    1000005    37
    0.00025971133   2    1000005    24

DECAY 1000024  1.2907187
    0.52924697   2    1000022    24
    0.46874049   2   -1000005    6
    0.0020118023   3    1000022   -5    6

DECAY 1000037  149.40094
    0.19107208   2    1000006   -5
    0.18697071   2   -2000005    6
    0.058096745   2    1000024    25
    0.053126242   2    1000023    24
    0.052997386   2    1000024    23
    0.052519491   2    1000025    24
    0.048979761   2    37    1000023
    0.041504684   2    1000016   -15
    0.04149589   2    1000024    36
    0.041483459   2    1000024    35
    0.041461491   2   -1000015    16
    0.041088341   2    37    1000025
    0.034397389   2    1000004   -3
    0.034397327   2    1000002   -1
    0.034350187   2   -1000001    2
    0.034350169   2   -1000003    4
    0.0049313165   3    1000024    6   -6
    0.0031656815   3    1000025   -5    6
    0.0027303538   3    1000023   -5    6
    0.00040867632   2    37    1000022
    0.00021658181   2    1000022    24
    0.00014930602   2    2000006   -5

DECAY 1000022 -1


DECAY 1000023  1.9604601
    0.41224898   2    1000022    23
    0.2683055   2    1000022    25
    0.15971399   2    1000005   -5
    0.15971399   2   -1000005    5

DECAY 1000025  1.2728088
    0.50182133   2    1000022    25
    0.24572114   2    1000005   -5
    0.24572114   2   -1000005    5
    0.0067299943   2    1000022    23

DECAY 1000035  154.7661
    0.091316482   2    2000005   -5
    0.091316482   2   -2000005    5
    0.091146131   2    1000006   -6
    0.091146131   2   -1000006    6
    0.051384486   2    1000024   -24
    0.051384486   2   -1000024    24
    0.049732189   2    1000025    25
    0.0453658   2    1000023    23
    0.042960231   2    1000023    35
    0.040445685   2    1000023    25
    0.039980649   2    37   -1000024
    0.039980649   2   -37    1000024
    0.034383977   2    1000025    35
    0.02005175   2    1000016   -16
    0.02005175   2   -1000016    16
    0.019990393   2    1000015   -15
    0.019990393   2   -1000015    15
    0.016604726   2    1000002   -2
    0.016604726   2   -1000002    2
    0.016604717   2    1000004   -4
    0.016604717   2   -1000004    4
    0.016570884   2    1000003   -3
    0.016570884   2   -1000003    3
    0.016570854   2    1000001   -1
    0.016570854   2   -1000001    1
    0.0057819409   2    1000025    23
    0.0053367854   2    1000025    36
    0.0043499636   2    1000023    36
    0.0030715503   3    1000024    5   -6
    0.0030715503   3   -1000024   -5    6
    0.0022580662   3    1000025    6   -6
    0.0019190144   3    1000023    6   -6
    0.00031869553   2    1000022    35
    0.00021458417   2    1000022    25

DECAY 1000021  7.4331228
    0.49999831   2    1000005   -5
    0.49999831   2   -1000005    5

DECAY 25  0.0039857373
    0.58067883   2   -5    5
    0.22276694   2   -24    24
    0.070339103   2    21    21
    0.067523654   2   -15    15
    0.027517081   2   -4    4
    0.026975707   2    23    23
    0.00228462   2    22    22
    0.0014599257   2    22    23
    0.00023401872   2   -13    13
    0.00021936283   2   -3    3
    6.0651711e-07   2   -1    1
    1.4180198e-07   2   -2    2
    5.2610004e-09   2   -11    11

DECAY 35  4.3119308
    0.79604756   2   -5    5
    0.18658449   2   -15    15
    0.014942542   2   -6    6
    0.0011634171   2    25    25
    0.00063081016   2   -13    13
    0.00037726833   2   -3    3
    0.0001265988   2   -24    24
    8.9417227e-05   2    23    23
    3.6482628e-05   2    21    21
    1.0431624e-06   2   -1    1
    2.6320963e-07   2   -4    4
    6.9305913e-08   2    22    22
    2.6970691e-08   2    22    23
    1.4172642e-08   2   -11    11
    1.3574073e-12   2   -2    2

DECAY 36  4.2399389
    0.79522809   2   -5    5
    0.18638338   2   -15    15
    0.017098751   2   -6    6
    0.00063012032   2   -13    13
    0.00037685513   2   -3    3
    0.00014692308   2    21    21
    0.0001342366   2    23    25
    1.04202e-06   2   -1    1
    2.586649e-07   2   -4    4
    2.5646276e-07   2    22    22
    7.5299487e-08   2    22    23
    1.4157139e-08   2   -11    11
    1.3342967e-12   2   -2    2
    1.2087685e-37   2    25    25

DECAY 37  3.6895563
    0.80334917   2   -5    6
    0.19414709   2   -15    16
    0.0012017401   2   -5    4
    0.00068638353   2   -13    14
    0.00038680121   2   -3    4
    0.00015714075   2    24    25
    4.2186077e-05   2   -3    6
    1.7838276e-05   2   -3    2
    8.581688e-06   2   -5    2
    1.9105084e-06   2   -1    6
    1.0724323e-06   2   -1    2
    6.7908392e-08   2   -1    4
    1.6054582e-08   2   -11    12
    2.4050378e-10   2    24    35
    2.2965999e-10   2    24    36

DECAY 6  2.43
    1   2    5    24

DECAY 15 -1
