BLOCK SPINFO
   1   SPheno
   2   v4.0.5be

BLOCK SPHENOINFO
   1   2
   2   2

BLOCK MODSEL
   1   0

BLOCK MINPAR
   3    33.272171
   4   -1

BLOCK EXTPAR
   0    1083.6731
   1   -637.51179
   2    1567.9783
   3    3000
   11   -2916.0884
   12   -495.64567
   13    716.17676
   23   -1832.029
   25    32.942217
   26    2314.9271
   31    1856.6697
   32    1856.6697
   33    1824.6222
   34    1342.0864
   35    1342.0864
   36    1038.3021
   41    5000
   42    5000
   43    1153.4182
   44    5000
   45    5000
   46    1272.0083
   47    5000
   48    5000
   49    890.3487

BLOCK SMINPUTS
   1    127.90897
   2    1.1663787e-05
   3    0.1184
   4    91.1876
   5    4.18
   6    173.2
   7    1.777
   8    0
   11    0.00051099893
   12    0
   13    0.10565837
   14    0
   21    0.005
   22    0.0025
   23    0.095
   24    1.27

BLOCK GAUGE Q=  1083.6731
   1    0.35536298
   2    0.66519887
   3    1.219778

BLOCK YU Q=  1083.6731
   1   1    8.3882343e-06
   2   2    0.004261223
   3   3    1.0133661

BLOCK YD Q=  1083.6731
   1   1    0.00055526925
   2   2    0.010550116
   3   3    0.5506531

BLOCK YE Q=  1083.6731
   1   1    9.6898545e-05
   2   2    0.020035546
   3   3    0.33696492

BLOCK AU Q=  1083.6731
   1   1    0
   2   2    0
   3   3   -2916.0884

BLOCK AD Q=  1083.6731
   1   1    0
   2   2    0
   3   3   -495.64561

BLOCK AE Q=  1083.6731
   1   1    0
   2   2    0
   3   3    716.17676

BLOCK MSOFT Q=  1083.6731
   1   -637.51179
   2    1567.9783
   3    3000
   21    2081993.9
   22   -3296411.6
   31    1856.6697
   32    1856.6697
   33    1824.6222
   34    1342.0864
   35    1342.0864
   36    1038.3021
   41    5000
   42    5000
   43    1153.4182
   44    5000
   45    5000
   46    1272.0083
   47    5000
   48    5000
   49    890.3487

BLOCK MASS
   6    173.2
   23    91.1876
   24    80.429995
   15    1.777
   25    122.03788
   35    2307.536
   36    2314.9271
   37    2316.5663
   1000001    5007.7621
   2000001    5000.615
   1000002    5007.3112
   2000002    5002.5178
   1000003    5007.778
   2000003    5000.6092
   1000004    5007.316
   2000004    5002.5191
   1000005    699.72743
   2000005    1088.8677
   1000006    914.77552
   2000006    1283.7547
   1000011    1864.6753
   2000011    1343.1743
   1000012    1862.6177
   1000013    1864.6776
   2000013    1343.168
   1000014    1862.6142
   1000015    1038.437
   2000015    1833.1211
   1000016    1829.8048
   1000021    3161.2378
   1000022   -640.01342
   1000023    1599.6709
   1000025   -1808.3848
   1000035    1821.7553
   1000024    1599.8505
   1000037    1822.5536

BLOCK ALPHA
      -0.030120027

BLOCK HMIX Q=  1083.6731
   1   -1832.029
   2    32.942217
   3    244.32015
   4    5358887.3

BLOCK STOPMIX
   1   1    0.80668153
   1   2    0.59098638
   2   1   -0.59098638
   2   2    0.80668153

BLOCK SBOTMIX
   1   1   -0.32543194
   1   2    0.94556547
   2   1   -0.94556547
   2   2   -0.32543194

BLOCK STAUMIX
   1   1   -0.043929873
   1   2    0.99903462
   2   1   -0.99903462
   2   2   -0.043929873

BLOCK NMIX
   1   1   -0.99954497
   1   2   -0.00035583528
   1   3    0.028290958
   1   4   -0.010456977
   2   1    0.0031158996
   2   2    0.97093412
   2   3    0.18042056
   2   4    0.15724393
   3   1   -0.027395227
   3   2    0.016802414
   3   3   -0.70629358
   3   4    0.7071892
   4   1   -0.012232987
   4   2    0.23875613
   4   3   -0.68395718
   4   4   -0.68923758

BLOCK UMIX
   1   1   -0.96182775
   1   2   -0.2736556
   2   1    0.2736556
   2   2   -0.96182775

BLOCK VMIX
   1   1   -0.9705336
   1   2    0.24096584
   2   1    0.24096584
   2   2    0.9705336

BLOCK HIGGSBOUNDSINPUTHIGGSCOUPLINGSFERMIONS
       0, 1085.1897,3,36,15,15

BLOCK HIGGSBOUNDSINPUTHIGGSCOUPLINGSBOSONS
       0,4,36,21,21,23

BLOCK SPHENOLOWENERGY
   1    0.00036770765
   2    1.5891861e-06
   3    3.5288242e-05
   4    2.020733e-15
   5    8.6316007e-11
   6    1.763606e-08
   7    6.8496128e-14
   8    2.9259115e-09
   9    6.0633591e-07
   10    9.4582593e-05
   11    0.97700197
   12    0.54353682
   13    19.400102
   14    0
   15    0
   16    0.0021700808
   17    2.2817896e-15
   18    2.4815326e-11
   19    8.2943947e-11
   20   -2.6289531e-15
   21   -1.1239459e-10
   22   -3.1170589e-08
   23    0
   24    0
   25    0
   26    0
   27    0
   28    0
   29    0
   30    0
   31    0
   39    7.2165883e-05
   40    0
   41    0
   42    0

BLOCK FWCOEF Q=  160
   305   4422   0   0   -0.18881911
   305   4422   0   2   -0.24075063
   305   4322   0   2   -0.00044398583
   305   6421   0   0   -0.095227835
   305   6421   0   2   -0.13350097
   305   6321   0   2   -0.00034820898
   3051111   4133   0   0    1.5804882
   3051111   4133   0   2    1.5815353
   3051111   4233   0   2    9.7526069e-05
   3051111   4137   0   0   -4.4031803
   3051111   4137   0   2   -4.405018
   3051111   4237   0   2   -0.00077221868
   3051313   4133   0   0    1.5804882
   3051313   4133   0   2    1.5815335
   3051313   4233   0   2    9.752548e-05
   3051313   4137   0   0   -4.4031803
   3051313   4137   0   2   -4.4050199
   3051313   4237   0   2   -0.00077221891
   3051212   4137   0   0    1.5053501
   3051212   4137   0   2    1.5057558
   3051212   4237   0   2    0.00016873066
   3051414   4137   0   0    1.5053501
   3051414   4137   0   2    1.5057558
   3051414   4237   0   2    0.00016873074
   3051616   4137   0   0    1.5053501
   3051616   4137   0   2    1.5057559
   3051616   4237   0   2    0.00016875321

BLOCK IMFWCOEF Q=  160
   305   4422   0   0    3.8559586e-07
   305   4422   0   2   -1.768467e-05
   305   4322   0   2   -4.7050435e-06
   305   6421   0   0    3.3028835e-07
   305   6421   0   2    8.8445732e-06
   305   6321   0   2   -2.0822187e-06
   3051111   4133   0   2   -1.2346181e-07
   3051111   4233   0   2    2.4497238e-06
   3051111   4137   0   2    2.3167699e-06
   3051111   4237   0   2   -1.9410983e-05
   3051313   4133   0   2   -1.2347736e-07
   3051313   4233   0   2    2.4497199e-06
   3051313   4137   0   2    2.3167571e-06
   3051313   4237   0   2   -1.9410994e-05
   3051212   4137   0   2   -4.3630737e-07
   3051212   4237   0   2    4.2413526e-06
   3051414   4137   0   2   -4.3630739e-07
   3051414   4237   0   2    4.2413526e-06
   3051616   4137   0   2   -4.3636648e-07
   3051616   4237   0   2    4.2413524e-06

DECAY 23  2.4952


DECAY 24  2.085


DECAY 2000011  4.0285533
    1   2    1000022    11

DECAY 1000011  3.4257145
    0.53236184   2    1000022    11
    0.30865404   2   -1000024    12
    0.15800056   2    1000023    11
    0.00071596801   2   -1000037    12
    0.00026753271   2    1000035    11

DECAY 2000013  4.0285184
    1   2    1000022    13

DECAY 1000013  3.4291838
    0.53182681   2    1000022    13
    0.30834626   2   -1000024    14
    0.15785376   2    1000023    13
    0.0009788211   2    2000013    25
    0.00071531769   2   -1000037    14
    0.00027133201   2    1000035    13

DECAY 1000015  2.0042405
    1   2    1000022    15

DECAY 2000015  5.7008233
    0.31281763   2    1000022    15
    0.24662946   2    1000015    25
    0.217046   2    1000015    23
    0.14656025   2   -1000024    16
    0.076598059   2    1000023    15
    0.00025932244   2    1000025    15

DECAY 1000012  3.4110186
    0.53232937   2    1000022    12
    0.31139604   2    1000024    11
    0.15548896   2    1000023    12
    0.00050549397   2    1000037    11
    0.00027232463   2    1000035    12

DECAY 1000014  3.411083
    0.53231776   2    1000022    14
    0.31140734   2    1000024    13
    0.15548242   2    1000023    14
    0.00051238342   2    1000037    13
    0.00027227359   2    1000035    14

DECAY 1000016  5.5127515
    0.44710561   2    1000015    24
    0.32044911   2    1000022    16
    0.15613037   2    1000024    15
    0.076265172   2    1000023    16

DECAY 2000001  144.96928
    0.98137122   2    1000021    1
    0.018615222   2    1000022    1

DECAY 1000001  196.76032
    0.72684146   2    1000021    1
    0.16711866   2   -1000024    2
    0.085056118   2    1000023    1
    0.012627883   2   -1000037    2
    0.0048956549   2    1000035    1
    0.003420346   2    1000022    1

DECAY 2000003  144.98537
    0.98125817   2    1000021    3
    0.018613193   2    1000022    3

DECAY 1000003  196.77196
    0.7268069   2    1000021    3
    0.16710984   2   -1000024    4
    0.085052978   2    1000023    3
    0.012633851   2   -1000037    4
    0.0049151582   2    1000035    3
    0.0034201991   2    1000022    3

DECAY 1000005  0.010896727
    1   2    1000022    5

DECAY 2000005  19.895038
    0.45522928   2    1000006   -24
    0.38702489   2    1000005    23
    0.15447833   2    1000005    25
    0.0032675037   2    1000022    5

DECAY 2000002  153.27357
    0.92949467   2    1000021    2
    0.070455214   2    1000022    2

DECAY 1000002  196.74977
    0.72664156   2    1000021    2
    0.17014451   2    1000024    1
    0.08524417   2    1000023    2
    0.0097903418   2    1000037    1
    0.0047197192   2    1000035    2
    0.0034476607   2    1000022    2

DECAY 2000004  153.27637
    0.92947814   2    1000021    4
    0.070453937   2    1000022    4

DECAY 1000004  196.76001
    0.72660595   2    1000021    4
    0.17013933   2    1000024    3
    0.085239968   2    1000023    4
    0.0098289255   2    1000037    3
    0.0047228261   2    1000035    4
    0.0034474849   2    1000022    4

DECAY 1000006  2.2342104
    0.91193698   2    1000005    24
    0.08668986   2    1000022    6
    0.0013731559   2    1000022    4

DECAY 2000006  46.800236
    0.38298939   2    1000005    24
    0.37829396   2    1000006    23
    0.16005199   2    2000005    24
    0.057346497   2    1000006    25
    0.021318157   2    1000022    6

DECAY 1000024  20.824784
    0.47345057   2    1000006   -5
    0.29386148   2   -2000005    6
    0.21435435   2   -1000005    6
    0.012068097   2    2000006   -5
    0.0036992755   2   -1000015    16
    0.0024618265   2    1000022    24

DECAY 1000037  61.462537
    0.2867913   2   -2000005    6
    0.23052918   2   -1000005    6
    0.2003337   2    2000006   -5
    0.19036334   2    1000006   -5
    0.023979905   2    1000023    24
    0.019223657   2    1000022    24
    0.019115017   2    1000024    23
    0.015659754   2    1000024    25
    0.013416728   2   -1000015    16
    0.00054990216   3    1000022   -5    6

DECAY 1000022 -1


DECAY 1000023  21.149295
    0.26902525   2    1000006   -6
    0.26902525   2   -1000006    6
    0.10890787   2    2000005   -5
    0.10890787   2   -2000005    5
    0.088132971   2    1000005   -5
    0.088132971   2   -1000005    5
    0.019620619   2    1000006   -4
    0.019620619   2   -1000006    4
    0.011071491   2    2000006   -6
    0.011071491   2   -2000006    6
    0.0017964026   2    1000022    23
    0.0016459021   2    1000015   -15
    0.0016459021   2   -1000015    15
    0.0013266616   2    1000022    25

DECAY 1000025  73.182572
    0.26334819   2    1000006   -6
    0.26334819   2   -1000006    6
    0.078511676   2    1000005   -5
    0.078511676   2   -1000005    5
    0.056113639   2    2000006   -6
    0.056113639   2   -2000006    6
    0.046630637   2    2000005   -5
    0.046630637   2   -2000005    5
    0.022409044   2    1000024   -24
    0.022409044   2   -1000024    24
    0.020001339   2    1000023    23
    0.017173008   2    1000023    25
    0.013020211   2    1000022    25
    0.0062419285   2    1000015   -15
    0.0062419285   2   -1000015    15
    0.0029355851   2    1000022    23
    0.00027915428   3    1000022    6   -6

DECAY 1000035  63.484901
    0.24222396   2    1000006   -6
    0.24222396   2   -1000006    6
    0.078257199   2    2000006   -6
    0.078257199   2   -2000006    6
    0.072218737   2    1000005   -5
    0.072218737   2   -1000005    5
    0.06411821   2    2000005   -5
    0.06411821   2   -2000005    5
    0.015854473   2    1000023    25
    0.015495976   2    1000022    23
    0.014202918   2    1000024   -24
    0.014202918   2   -1000024    24
    0.012940122   2    1000022    25
    0.0066132137   2    1000015   -15
    0.0066132137   2   -1000015    15
    0.00028335534   3    1000022    6   -6
    0.00010686493   2    1000023    23

DECAY 1000021  307.64452
    0.13777762   2    1000005   -5
    0.13777762   2   -1000005    5
    0.11910506   2    2000006   -6
    0.11910506   2   -2000006    6
    0.11791583   2    2000005   -5
    0.11791583   2   -2000005    5
    0.11309582   2    1000006   -6
    0.11309582   2   -1000006    6
    0.011735673   2    1000006   -4
    0.011735673   2   -1000006    4
    0.00011415293   3    1000037    5   -6
    0.00011415293   3   -1000037   -5    6

DECAY 25  0.0034916267
    0.62148165   2   -5    5
    0.18414784   2   -24    24
    0.071431214   2   -15    15
    0.066958886   2    21    21
    0.030836495   2   -4    4
    0.020999996   2    23    23
    0.0023923575   2    22    22
    0.0012686327   2    22    23
    0.00024774035   2   -13    13
    0.00023438534   2   -3    3
    6.4805394e-07   2   -1    1
    1.5891743e-07   2   -2    2
    5.5695177e-09   2   -11    11

DECAY 35  91.268561
    0.69283685   2   -5    5
    0.23605636   2   -1000006    1000006
    0.048557529   2   -15    15
    0.0089482908   2   -2000006    1000006
    0.0089482908   2   -1000006    2000006
    0.0029696087   2   -1000005    1000005
    0.00074990916   2   -6    6
    0.0002920982   2    1000022    1000023
    0.00021473335   2    21    21
    0.00016847281   2   -13    13
    0.00013722329   2   -3    3
    8.5107004e-05   2    25    25
    2.4378446e-05   2    1000022    1000022
    9.5278457e-06   2   -1000015    1000015
    5.3599022e-07   2    22    22
    4.5856457e-07   2    22    23
    3.7947528e-07   2   -1    1
    1.6923888e-07   2    23    23
    7.3178766e-08   2   -24    24
    3.7841048e-09   2   -11    11
    1.2190767e-09   2   -4    4
    6.28316e-15   2   -2    2

DECAY 36  84.621011
    0.70501787   2   -5    5
    0.12058445   2   -2000006    1000006
    0.12058445   2   -1000006    2000006
    0.049515114   2   -15    15
    0.0016556714   2   -6    6
    0.0011181964   2   -2000005    1000005
    0.0011181964   2   -1000005    2000005
    0.00017179561   2   -13    13
    0.00013991367   2   -3    3
    3.9748359e-05   2    1000022    1000022
    3.6636018e-05   2    1000022    1000023
    1.7221387e-05   2    21    21
    3.8691511e-07   2   -1    1
    2.5949534e-07   2    23    25
    4.1430918e-08   2    22    23
    3.2787013e-08   2    22    22
    4.1672594e-09   2   -4    4
    3.8587244e-09   2   -11    11
    2.8620396e-10   2    23    35
    2.1486612e-14   2   -2    2
    3.5641246e-35   2    25    25

DECAY 37  58.061681
    0.81225828   2   -5    6
    0.088330851   2   -15    16
    0.068018062   2   -2000005    1000006
    0.029024132   2   -1000005    2000006
    0.0012044631   2   -5    4
    0.00053201414   2    1000022    1000024
    0.00031228124   2   -13    14
    0.00019724061   2   -3    4
    0.00010144772   2   -1000005    1000006
    9.2096536e-06   2   -3    2
    8.6011116e-06   2   -5    2
    2.3610542e-06   2   -3    6
    5.4775106e-07   2   -1    2
    3.7940482e-07   2    24    25
    9.4996732e-08   2   -1    6
    2.637551e-08   2   -1    4
    7.3042907e-09   2   -11    12
    1.4106043e-09   2    24    35
    2.7738598e-13   2    24    36

DECAY 6  2.43
    1   2    5    24

DECAY 15 -1
