BLOCK SPINFO
   1   SPheno
   2   v4.0.5be

BLOCK SPHENOINFO
   1   2
   2   2

BLOCK MODSEL
   1   0

BLOCK MINPAR
   3    45.887386
   4    1

BLOCK EXTPAR
   0    1391.2707
   1   -242.39424
   2   -963.77015
   3    3000
   11    2386.0058
   12   -1935.8225
   13   -1636.3133
   23    1601.2895
   25    44.472507
   26    1488.0146
   31    225.58416
   32    225.58416
   33    1211.6836
   34    1080.0379
   35    1080.0379
   36    1108.5816
   41    5000
   42    5000
   43    1552.8666
   44    5000
   45    5000
   46    1307.045
   47    5000
   48    5000
   49    1113.3359

BLOCK SMINPUTS
   1    127.90897
   2    1.1663787e-05
   3    0.1184
   4    91.1876
   5    4.18
   6    173.2
   7    1.777
   8    0
   11    0.00051099893
   12    0
   13    0.10565837
   14    0
   21    0.005
   22    0.0025
   23    0.095
   24    1.27

BLOCK GAUGE Q=  1391.2707
   1    0.35536298
   2    0.66519887
   3    1.219778

BLOCK YU Q=  1391.2707
   1   1    8.3864915e-06
   2   2    0.0042603377
   3   3    1.0131555

BLOCK YD Q=  1391.2707
   1   1    0.00074946641
   2   2    0.014239862
   3   3    0.74323583

BLOCK YE Q=  1391.2707
   1   1    0.00013078737
   2   2    0.02704268
   3   3    0.45481339

BLOCK AU Q=  1391.2707
   1   1    0
   2   2    0
   3   3    2386.0044

BLOCK AD Q=  1391.2707
   1   1    0
   2   2    0
   3   3   -1935.817

BLOCK AE Q=  1391.2707
   1   1    0
   2   2    0
   3   3   -1636.3141

BLOCK MSOFT Q=  1391.2707
   1   -242.39424
   2   -963.77015
   3    3000
   21   -345519.71
   22   -2519598
   31    225.58416
   32    225.58416
   33    1211.6836
   34    1080.0379
   35    1080.0379
   36    1108.5816
   41    5000
   42    5000
   43    1552.8666
   44    5000
   45    5000
   46    1307.045
   47    5000
   48    5000
   49    1113.3359

BLOCK MASS
   6    173.2
   23    91.1876
   24    80.429995
   15    1.777
   25    120.75158
   35    1487.8025
   36    1488.0146
   37    1490.5116
   1000001    5022.641
   2000001    5013.0919
   1000002    5022.1963
   2000002    5014.6615
   1000003    5022.653
   2000003    5013.0908
   1000004    5022.2004
   2000004    5014.6624
   1000005    1077.6327
   2000005    1537.8814
   1000006    1219.9754
   2000006    1586.6173
   1000011    259.56209
   2000011    1081.5318
   1000012    246.89357
   1000013    259.42818
   2000013    1081.5299
   1000014    246.87242
   1000015    1079.9506
   2000015    1236.3345
   1000016    1212.719
   1000021    3178.8703
   1000022   -241.70525
   1000023   -998.44092
   1000025    1594.2593
   1000035   -1597.0338
   1000024    998.59907
   1000037    1598.7261

BLOCK ALPHA
      -0.022081212

BLOCK HMIX Q=  1391.2707
   1    1601.2895
   2    44.472507
   3    244.10292
   4    2214187.6

BLOCK STOPMIX
   1   1   -0.37636377
   1   2    0.92647197
   2   1   -0.92647197
   2   2   -0.37636377

BLOCK SBOTMIX
   1   1    0.082347418
   1   2    0.99660368
   2   1   -0.99660368
   2   2    0.082347418

BLOCK STAUMIX
   1   1    0.37339595
   1   2    0.92767207
   2   1   -0.92767207
   2   2    0.37339595

BLOCK NMIX
   1   1   -0.99958077
   1   2    0.00055045076
   1   3   -0.028679458
   1   4   -0.0039334397
   2   1   -0.0029599988
   2   2   -0.99588009
   2   3    0.077639571
   2   4    0.046756561
   3   1    0.017471851
   3   2   -0.021915277
   3   3   -0.70638084
   3   4    0.70727686
   4   1   -0.022896706
   4   2    0.087990103
   4   3    0.70297631
   4   4    0.70537776

BLOCK UMIX
   1   1   -0.99370251
   1   2    0.11205057
   2   1   -0.11205057
   2   2   -0.99370251

BLOCK VMIX
   1   1    0.99765437
   1   2    0.068452617
   2   1    0.068452617
   2   2   -0.99765437

BLOCK HIGGSBOUNDSINPUTHIGGSCOUPLINGSFERMIONS
       0, 1977.8039,3,36,15,15

BLOCK HIGGSBOUNDSINPUTHIGGSCOUPLINGSBOSONS
       0,4,36,21,21,23

BLOCK SPHENOLOWENERGY
   1    0.00035912619
   2    1.5866356e-06
   3    3.5235251e-05
   4    4.0759191e-15
   5    1.7411943e-10
   6    3.6477754e-08
   7    1.3629309e-13
   8    5.8224623e-09
   9    1.2358839e-06
   10    8.8323411e-05
   11    0.91234702
   12    0.54353464
   13    19.381805
   14    0
   15    0
   16    0.0021684997
   17    2.281778e-15
   18    2.4782707e-11
   19    8.2865359e-11
   20   -2.6419756e-14
   21   -1.12978e-09
   22   -1.0526889e-07
   23    0
   24    0
   25    0
   26    0
   27    0
   28    0
   29    0
   30    0
   31    0
   39    0.00012194066
   40    0
   41    0
   42    0

BLOCK FWCOEF Q=  160
   305   4422   0   0   -0.18881911
   305   4422   0   2   -0.23019916
   305   4322   0   2   -0.00052284929
   305   6421   0   0   -0.095227835
   305   6421   0   2   -0.13168575
   305   6321   0   2   -0.00054247218
   3051111   4133   0   0    1.5897547
   3051111   4133   0   2    1.5903428
   3051111   4233   0   2    9.4642113e-05
   3051111   4137   0   0   -4.4124468
   3051111   4137   0   2   -4.4090708
   3051111   4237   0   2   -0.00073784371
   3051313   4133   0   0    1.5897547
   3051313   4133   0   2    1.5903344
   3051313   4233   0   2    9.4635714e-05
   3051313   4137   0   0   -4.4124468
   3051313   4137   0   2   -4.4090792
   3051313   4237   0   2   -0.0007378411
   3051212   4137   0   0    1.5053501
   3051212   4137   0   2    1.5046242
   3051212   4237   0   2    0.00016087118
   3051414   4137   0   0    1.5053501
   3051414   4137   0   2    1.5046242
   3051414   4237   0   2    0.00016087239
   3051616   4137   0   0    1.5053501
   3051616   4137   0   2    1.5046253
   3051616   4237   0   2    0.00016121283

BLOCK IMFWCOEF Q=  160
   305   4422   0   0    3.8563346e-07
   305   4422   0   2   -8.2619415e-06
   305   4322   0   2   -2.814371e-06
   305   6421   0   0    3.3032056e-07
   305   6421   0   2   -1.8687342e-05
   305   6321   0   2   -1.6601246e-06
   3051111   4133   0   2   -1.1927607e-08
   3051111   4233   0   2    4.2165637e-06
   3051111   4137   0   2   -1.0411265e-06
   3051111   4237   0   2   -3.2942716e-05
   3051313   4133   0   2   -1.1961637e-08
   3051313   4233   0   2    4.2165488e-06
   3051313   4137   0   2   -1.04119e-06
   3051313   4237   0   2   -3.2942769e-05
   3051212   4137   0   2    4.0220059e-07
   3051212   4237   0   2    7.182835e-06
   3051414   4137   0   2    4.0219996e-07
   3051414   4237   0   2    7.182835e-06
   3051616   4137   0   2    4.2076019e-07
   3051616   4237   0   2    7.1828576e-06

DECAY 23  2.4952


DECAY 24  2.085


DECAY 1000011  0.0057392077
    0.99990143   2    1000022    11

DECAY 2000011  4.9009133
    0.99999971   2    1000022    11

DECAY 1000013  0.0056593152
    0.99990442   2    1000022    13

DECAY 2000013  4.9169246
    0.99674346   2    1000022    13
    0.003255031   2    1000013    25

DECAY 1000015  4.4874621
    0.98692491   2    1000022    15
    0.0087044918   2   -1000024    16
    0.004370601   2    1000023    15

DECAY 2000015  4.4617832
    0.44472722   2    1000022    15
    0.23515487   2   -1000024    16
    0.1230835   2    1000015    23
    0.11940114   2    1000023    15
    0.077630552   2    1000015    25

DECAY 1000012  0.00053703717
    1   2    1000022    12

DECAY 1000014  0.00053275988
    1   2    1000022    14

DECAY 1000016  3.817397
    0.36843451   2    1000022    16
    0.29053238   2    1000024    15
    0.19755518   2    1000015    24
    0.14347793   2    1000023    16

DECAY 2000001  144.24194
    0.98068919   2    1000021    1
    0.019297025   2    1000022    1

DECAY 1000001  204.24504
    0.69745165   2    1000021    1
    0.19719454   2   -1000024    2
    0.098927651   2    1000023    1
    0.0034346817   2    1000022    1
    0.0021951015   2   -1000037    2
    0.00074144668   2    1000035    1

DECAY 2000003  144.27443
    0.98046753   2    1000021    3
    0.019292789   2    1000022    3
    0.00011168883   2   -1000037    4

DECAY 1000003  204.26428
    0.69739209   2    1000021    3
    0.19717649   2   -1000024    4
    0.098919148   2    1000023    3
    0.0034344473   2    1000022    3
    0.0022020889   2   -1000037    4
    0.00078088878   2    1000035    3

DECAY 1000005  0.5687926
    0.99305861   2    1000022    5
    0.0069413939   2    1000023    5

DECAY 2000005  27.915171
    0.57462384   2    1000006   -24
    0.16431321   2    1000005    25
    0.13767995   2   -1000024    6
    0.079322615   2    1000023    5
    0.037003482   2    1000005    23
    0.0070568957   2    1000022    5

DECAY 2000002  152.76483
    0.92704556   2    1000021    2
    0.072904738   2    1000022    2

DECAY 1000002  204.236
    0.69725571   2    1000021    2
    0.19875441   2    1000024    1
    0.099131477   2    1000023    2
    0.0033923038   2    1000022    2
    0.000819381   2    1000037    1
    0.00061577722   2    1000035    2

DECAY 2000004  152.76778
    0.92702782   2    1000021    4
    0.07290333   2    1000022    4

DECAY 1000004  204.25422
    0.69719525   2    1000021    4
    0.19873802   2    1000024    3
    0.099122736   2    1000023    4
    0.0033920035   2    1000022    4
    0.00089817277   2    1000037    3
    0.00061927358   2    1000035    4

DECAY 1000006  2.4595836
    0.84469943   2    1000022    6
    0.10736433   2    1000024    5
    0.034113895   2    1000023    6
    0.0085039169   2    1000023    4
    0.002869854   2    1000005    24
    0.0022832472   2    1000022    4
    0.00010544861   3    1000022    24    5

DECAY 2000006  26.39616
    0.38782895   2    1000006    23
    0.26886175   2    1000006    25
    0.15396033   2    1000024    5
    0.090062912   2    1000005    24
    0.074977049   2    1000023    6
    0.024309013   2    1000022    6

DECAY 1000024  15.265511
    0.25262376   2    1000014   -13
    0.25261338   2    1000012   -11
    0.24722985   2   -1000013    14
    0.2471929   2   -1000011    12
    0.00031617714   2    1000022    24

DECAY 1000037  26.745494
    0.2996847   2   -1000005    6
    0.28506093   2    1000006   -5
    0.10832802   2    1000023    24
    0.10114549   2    1000024    25
    0.097638542   2    1000024    23
    0.039896237   2    1000022    24
    0.026929822   2   -1000015    16
    0.02214076   2    1000016   -15
    0.0054375159   2   -2000015    16
    0.0031316729   2   -1000013    14
    0.003131498   2   -1000011    12
    0.0015840761   2    1000014   -13
    0.0015840183   3    1000023   -5    6
    0.001489127   3    1000022   -5    6
    0.0011747467   2    1000012   -11
    0.0011516995   3    1000024    6   -6
    0.00032310765   2    2000006   -5
    0.00012629985   2   -2000013    14

DECAY 1000022 -1


DECAY 1000023  15.266558
    0.12542761   2    1000014   -14
    0.12542761   2   -1000014    14
    0.12542482   2    1000012   -12
    0.12542482   2   -1000012    12
    0.12452066   2    1000013   -13
    0.12452066   2   -1000013    13
    0.1244993   2    1000011   -11
    0.1244993   2   -1000011    11
    0.00015219028   2    1000022    25

DECAY 1000025  26.299373
    0.14661218   2    1000005   -5
    0.14661218   2   -1000005    5
    0.1085051   2    1000023    25
    0.099190423   2    1000024   -24
    0.099190423   2   -1000024    24
    0.094351702   2    1000006   -6
    0.094351702   2   -1000006    6
    0.093917975   2    1000023    23
    0.026031125   2    1000022    23
    0.025542163   2    1000022    25
    0.017707712   2    1000015   -15
    0.017707712   2   -1000015    15
    0.010165948   2    2000015   -15
    0.010165948   2   -2000015    15
    0.0023747658   2    2000005   -5
    0.0023747658   2   -2000005    5
    0.0012983795   3    1000024    5   -6
    0.0012983795   3   -1000024   -5    6
    0.00080166733   3    1000022    6   -6
    0.00038056464   3    1000023    6   -6
    0.0002285325   2    1000013   -13
    0.0002285325   2   -1000013    13
    0.00015220363   3    1000022    5   -5
    0.00012410243   2    1000014   -14
    0.00012410243   2   -1000014    14
    0.00012410138   2    1000012   -12
    0.00012410138   2   -1000012    12

DECAY 1000035  23.009551
    0.16551395   2    1000005   -5
    0.16551395   2   -1000005    5
    0.11134515   2    1000023    25
    0.10803088   2    1000024   -24
    0.10803088   2   -1000024    24
    0.10341876   2    1000006   -6
    0.10341876   2   -1000006    6
    0.026562875   2    1000022    25
    0.018774946   2    1000015   -15
    0.018774946   2   -1000015    15
    0.017034357   2    1000022    23
    0.012555746   2    2000015   -15
    0.012555746   2   -2000015    15
    0.0065546293   2    1000023    23
    0.0029755236   2    2000005   -5
    0.0029755236   2   -2000005    5
    0.0019800489   3    1000024    5   -6
    0.0019800489   3   -1000024   -5    6
    0.0014618331   2    1000014   -14
    0.0014618331   2   -1000014    14
    0.0014618209   2    1000012   -12
    0.0014618209   2   -1000012    12
    0.0010674125   2    1000013   -13
    0.0010674125   2   -1000013    13
    0.00093582194   3    1000022    6   -6
    0.00083097692   2    1000011   -11
    0.00083097692   2   -1000011    11
    0.00039444241   3    1000023    6   -6
    0.00027501671   2    1000016   -16
    0.00027501671   2   -1000016    16
    0.00018408238   3    1000022    5   -5

DECAY 1000021  254.09092
    0.14641113   2    1000006   -6
    0.14641113   2   -1000006    6
    0.14497672   2    1000005   -5
    0.14497672   2   -1000005    5
    0.10869149   2    2000005   -5
    0.10869149   2   -2000005    5
    0.093624189   2    2000006   -6
    0.093624189   2   -2000006    6
    0.0048445416   2    1000006   -4
    0.0048445416   2   -1000006    4
    0.00072133842   3    1000037    5   -6
    0.00072133842   3   -1000037   -5    6
    0.00040588334   3    1000025    6   -6
    0.00038695695   3    1000035    6   -6
    0.00026306071   3    1000025    5   -5
    0.00025927991   3    1000035    5   -5

DECAY 25  0.0034255272
    0.63718535   2   -5    5
    0.16218231   2   -24    24
    0.073781009   2   -15    15
    0.073647864   2    21    21
    0.031266628   2   -4    4
    0.018022197   2    23    23
    0.0022852345   2    22    22
    0.0011303477   2    22    23
    0.00025602742   2   -13    13
    0.00024218993   2   -3    3
    6.6963294e-07   2   -1    1
    1.6113862e-07   2   -2    2
    5.7558824e-09   2   -11    11

DECAY 35  16.11681
    0.66983119   2   -5    5
    0.32767579   2   -15    15
    0.001010156   2   -13    13
    0.00069608818   2   -3    3
    0.00032237596   2    1000022    1000023
    0.00016479515   2   -6    6
    0.00013855228   2    1000022    1000022
    0.00012517329   2    25    25
    2.1689073e-05   2    21    21
    4.1723713e-06   2    23    23
    3.3724324e-06   2   -24    24
    1.9244993e-06   2   -1    1
    5.1282406e-07   2   -1000011    1000011
    4.9567384e-07   2   -1000013    1000013
    1.5089625e-07   2   -2000013    1000013
    1.5089625e-07   2   -1000013    2000013
    2.2692362e-08   2   -11    11
    1.5023508e-08   2   -4    4
    6.3479782e-09   2    22    22
    1.6819602e-09   2    22    23
    3.5295851e-12   2   -2000011    1000011
    3.5295851e-12   2   -1000011    2000011
    7.748107e-14   2   -2    2

DECAY 36  15.654487
    0.66951011   2   -5    5
    0.32756453   2   -15    15
    0.0010098672   2   -13    13
    0.00070913994   2    1000022    1000023
    0.00069581537   2   -3    3
    0.00029967462   2   -6    6
    0.00015778627   2    1000022    1000022
    4.4807152e-05   2    21    21
    5.7142367e-06   2    23    25
    1.9237458e-06   2   -1    1
    1.5107395e-07   2    22    23
    1.5087779e-07   2   -2000013    1000013
    1.5087779e-07   2   -1000013    2000013
    1.3790413e-07   2    22    22
    2.2685849e-08   2   -11    11
    1.8699889e-08   2   -4    4
    3.5284701e-12   2   -2000011    1000011
    3.5284701e-12   2   -1000011    2000011
    9.6517463e-14   2   -2    2
    8.0104722e-36   2    25    25

DECAY 37  17.873428
    0.64509157   2   -5    6
    0.35116274   2   -15    16
    0.0012414883   2   -13    14
    0.00096595835   2   -5    4
    0.00091692291   2    1000022    1000024
    0.0005738884   2   -3    4
    2.6651628e-05   2   -3    2
    6.897947e-06   2   -5    2
    5.0435021e-06   2    24    25
    3.182305e-06   2   -3    6
    1.7970966e-06   2   -1000011    1000012
    1.7755438e-06   2   -1000013    1000014
    1.5933737e-06   2   -1    2
    2.7938366e-07   2   -2000013    1000014
    1.0809992e-07   2   -1    6
    7.4791143e-08   2   -1    4
    2.9038541e-08   2   -11    12
    1.1098127e-11   2    24    35
    7.3826455e-12   2    24    36
    6.5358982e-12   2   -2000011    1000012

DECAY 6  2.43
    1   2    5    24

DECAY 15 -1
