BLOCK SPINFO
   1   SPheno
   2   v4.0.5be

BLOCK SPHENOINFO
   1   2
   2   2

BLOCK MODSEL
   1   0

BLOCK MINPAR
   3    42.370284
   4   -1

BLOCK EXTPAR
   0    3003.3801
   1    2120.7637
   2    4047.3718
   3    3166.6471
   11   -5245.4617
   12    4481.2655
   13    5034.1373
   23   -431.20137
   25    41.491219
   26    2028.3378
   31    2949.6673
   32    2949.6673
   33    2421.8363
   34    1486.2831
   35    1486.2831
   36    1907.3975
   41    2530.8593
   42    2530.8593
   43    3780.5833
   44    2698.2879
   45    2698.2879
   46    2300.3351
   47    1302.4121
   48    1302.4121
   49    2671.7102

BLOCK SMINPUTS
   1    127.90897
   2    1.1663787e-05
   3    0.1184
   4    91.1876
   5    4.18
   6    173.2
   7    1.777
   8    0
   11    0.00051099893
   12    0
   13    0.10565837
   14    0
   21    0.005
   22    0.0025
   23    0.095
   24    1.27

BLOCK GAUGE Q=  3003.3801
   1    0.35536298
   2    0.66519887
   3    1.219778

BLOCK YU Q=  3003.3801
   1   1    8.3868069e-06
   2   2    0.0042604979
   3   3    1.0131936

BLOCK YD Q=  3003.3801
   1   1    0.00069925099
   2   2    0.013285769
   3   3    0.69343787

BLOCK YE Q=  3003.3801
   1   1    0.00012202441
   2   2    0.025230778
   3   3    0.42434018

BLOCK AU Q=  3003.3801
   1   1    0
   2   2    0
   3   3   -5245.4616

BLOCK AD Q=  3003.3801
   1   1    0
   2   2    0
   3   3    4481.2655

BLOCK AE Q=  3003.3801
   1   1    0
   2   2    0
   3   3    5034.1373

BLOCK MSOFT Q=  3003.3801
   1    2120.7637
   2    4047.3718
   3    3166.6471
   21    4019801.2
   22   -92779.045
   31    2949.6673
   32    2949.6673
   33    2421.8363
   34    1486.2831
   35    1486.2831
   36    1907.3975
   41    2530.8593
   42    2530.8593
   43    3780.5833
   44    2698.2879
   45    2698.2879
   46    2300.3351
   47    1302.4121
   48    1302.4121
   49    2671.7102

BLOCK MASS
   6    173.2
   23    91.1876
   24    80.429995
   15    1.777
   25    124.34095
   35    2028.128
   36    2028.3378
   37    2029.8257
   1000001    2687.8684
   2000001    1473.3419
   1000002    2686.6959
   2000002    2821.3524
   1000003    2687.8636
   2000003    1473.3285
   1000004    2686.6911
   2000004    2821.3518
   1000005    2772.6946
   2000005    3827.89
   1000006    2350.2311
   2000006    3838.0446
   1000011    2974.2767
   2000011    1506.1332
   1000012    2972.8008
   1000013    2974.2563
   2000013    1506.0721
   1000014    2972.7802
   1000015    1897.8825
   2000015    2434.2679
   1000016    2432.3653
   1000021    3277.9896
   1000022    437.98147
   1000023   -440.63842
   1000025    2088.8361
   1000035    4001.0502
   1000024    439.25195
   1000037    4001.1122

BLOCK ALPHA
      -0.023729843

BLOCK HMIX Q=  3003.3801
   1   -431.20137
   2    41.491219
   3    243.24407
   4    4114154.1

BLOCK STOPMIX
   1   1    0.080956308
   1   2    0.99671765
   2   1   -0.99671765
   2   2    0.080956308

BLOCK SBOTMIX
   1   1   -0.0071883388
   1   2    0.99997416
   2   1   -0.99997416
   2   2   -0.0071883388

BLOCK STAUMIX
   1   1   -0.017399686
   1   2    0.99984861
   2   1   -0.99984861
   2   2   -0.017399686

BLOCK NMIX
   1   1   -0.018731063
   1   2    0.014983615
   1   3    0.70813343
   1   4    0.70567109
   2   1   -0.012822629
   2   2    0.01269648
   2   3   -0.70606415
   2   4    0.70791792
   3   1   -0.99974224
   3   2   -0.00085625793
   3   3   -0.0042108981
   3   4   -0.022293003
   4   1    0.00041265568
   4   2   -0.99980676
   4   3    0.0016497935
   4   4    0.019584443

BLOCK UMIX
   1   1   -0.002333016
   1   2   -0.99999728
   2   1    0.99999728
   2   2   -0.002333016

BLOCK VMIX
   1   1   -0.027696582
   1   2    0.99961638
   2   1    0.99961638
   2   2    0.027696582

BLOCK HIGGSBOUNDSINPUTHIGGSCOUPLINGSFERMIONS
       0, 1721.5213,3,36,15,15

BLOCK HIGGSBOUNDSINPUTHIGGSCOUPLINGSBOSONS
       0,4,36,21,21,23

BLOCK SPHENOLOWENERGY
   1    0.00035517414
   2    1.5889164e-06
   3    3.5279075e-05
   4    1.307003e-15
   5    5.5829093e-11
   6    1.1422939e-08
   7    4.4281544e-14
   8    1.8915586e-09
   9    3.9261263e-07
   10    9.4057635e-05
   11    0.97157936
   12    0.54232739
   13    19.356756
   14    0
   15    0
   16    0.0021593528
   17    2.2816821e-15
   18    2.4816844e-11
   19    8.294825e-11
   20   -1.1565466e-15
   21   -4.9444162e-11
   22   -1.7631976e-08
   23    0
   24    0
   25    0
   26    0
   27    0
   28    0
   29    0
   30    0
   31    0
   39    6.7502596e-05
   40    0
   41    0
   42    0

BLOCK FWCOEF Q=  160
   305   4422   0   0   -0.18881911
   305   4422   0   2   -0.22766269
   305   4322   0   2   -0.00097388312
   305   6421   0   0   -0.095227835
   305   6421   0   2   -0.12319553
   305   6321   0   2   -0.00068301127
   3051111   4133   0   0    1.6170445
   3051111   4133   0   2    1.6178412
   3051111   4233   0   2    0.00026951155
   3051111   4137   0   0   -4.4397366
   3051111   4137   0   2   -4.440754
   3051111   4237   0   2   -0.002022853
   3051313   4133   0   0    1.6170445
   3051313   4133   0   2    1.6178398
   3051313   4233   0   2    0.0002695094
   3051313   4137   0   0   -4.4397366
   3051313   4137   0   2   -4.4407553
   3051313   4237   0   2   -0.0020228531
   3051212   4137   0   0    1.5053501
   3051212   4137   0   2    1.505571
   3051212   4237   0   2    0.00043836658
   3051414   4137   0   0    1.5053501
   3051414   4137   0   2    1.505571
   3051414   4237   0   2    0.00043836691
   3051616   4137   0   0    1.5053501
   3051616   4137   0   2    1.5055709
   3051616   4237   0   2    0.00043845808

BLOCK IMFWCOEF Q=  160
   305   4422   0   0    3.8578544e-07
   305   4422   0   2   -1.3801098e-05
   305   4322   0   2   -1.3154777e-05
   305   6421   0   0    3.3045074e-07
   305   6421   0   2    1.0575955e-05
   305   6321   0   2   -6.8040483e-06
   3051111   4133   0   2    1.0906274e-06
   3051111   4233   0   2    6.2959949e-06
   3051111   4137   0   2   -6.8235063e-06
   3051111   4237   0   2   -4.7260092e-05
   3051313   4133   0   2    1.0906085e-06
   3051313   4233   0   2    6.2959833e-06
   3051313   4137   0   2   -6.8235246e-06
   3051313   4237   0   2   -4.7260119e-05
   3051212   4137   0   2    1.4857513e-06
   3051212   4237   0   2    1.02416e-05
   3051414   4137   0   2    1.4857511e-06
   3051414   4237   0   2    1.02416e-05
   3051616   4137   0   2    1.4836603e-06
   3051616   4237   0   2    1.02416e-05

DECAY 23  2.4952


DECAY 24  2.085


DECAY 2000011  0.0032662454
    0.68129726   2    1000022    11
    0.3185884   2    1000023    11
    0.00011434722   2   -1000024    12

DECAY 1000011  0.96297947
    0.99909071   2    1000025    11
    0.00044492759   2    1000023    11
    0.00032275159   2    1000022    11
    0.00014160512   2   -1000024    12

DECAY 2000013  0.03519806
    0.45362753   2   -1000024    14
    0.29094213   2    1000022    13
    0.25543034   2    1000023    13

DECAY 1000013  0.99928107
    0.96276403   2    1000025    13
    0.018404312   2    1000023    13
    0.018401961   2    1000022    13
    0.00029323396   2    2000013    25
    0.00013645991   2   -1000024    14

DECAY 1000015  12.183786
    0.49974411   2   -1000024    16
    0.25140552   2    1000022    15
    0.24885037   2    1000023    15

DECAY 2000015  8.5461015
    0.4784513   2    1000022    15
    0.47643447   2    1000023    15
    0.024981795   2    1000025    15
    0.010022197   2    1000015    23
    0.0099298721   2    1000015    25
    0.00018037057   2   -1000024    16

DECAY 1000012  0.98544448
    0.96771871   2    1000025    12
    0.019492387   2    1000024    11
    0.007936204   2    1000022    12
    0.004852697   2    1000023    12

DECAY 1000014  1.0214344
    0.93358969   2    1000025    14
    0.054072115   2    1000024    13
    0.0076565162   2    1000022    14
    0.0046816782   2    1000023    14

DECAY 1000016  8.5611078
    0.95429913   2    1000024    15
    0.024504484   2    1000025    16
    0.020018283   2    1000015    24
    0.00073115635   2    1000022    16
    0.00044695201   2    1000023    16

DECAY 2000001  0.00037577111
    0.65417714   2    1000022    1
    0.31416205   2    1000023    1
    0.031660816   2   -1000024    2

DECAY 1000001  0.064676937
    0.90068743   2    1000025    1
    0.058361888   2    1000022    1
    0.039060694   2    1000023    1
    0.0018863735   2   -1000024    2

DECAY 2000003  0.0089414158
    0.48033027   2   -1000024    4
    0.26797666   2    1000022    3
    0.25169307   2    1000023    3

DECAY 1000003  0.074595265
    0.78092035   2    1000025    3
    0.11056346   2    1000022    3
    0.09343348   2    1000023    3
    0.013950818   2   -1000024    4
    0.0011318847   2    2000003    25

DECAY 1000005  50.494481
    0.49499132   2   -1000024    6
    0.25052806   2    1000022    5
    0.24875005   2    1000023    5
    0.0057285154   2    1000025    5

DECAY 2000005  193.65032
    0.39119422   2   -1000024    6
    0.31088374   2    1000006   -24
    0.11096792   2    1000021    5
    0.092354033   2    1000022    5
    0.091831008   2    1000023    5
    0.0013504029   2    1000025    5
    0.00087814999   2    1000005    25
    0.00054052208   2    1000005    23

DECAY 1000002  0.079146633
    0.74799697   2    1000025    2
    0.21745253   2    1000024    1
    0.019209029   2    1000022    2
    0.01534147   2    1000023    2

DECAY 2000002  1.2888426
    0.99760147   2    1000025    2
    0.0016334894   2    1000022    2
    0.00076504144   2    1000023    2

DECAY 1000004  0.088975924
    0.66535176   2    1000025    4
    0.29360112   2    1000024    3
    0.022228859   2    1000022    4
    0.018818263   2    1000023    4

DECAY 2000004  1.2907771
    0.99610369   2    1000025    4
    0.0020051359   2    1000022    4
    0.0011402282   2    1000023    4
    0.00075094923   2    1000024    3

DECAY 1000006  88.854867
    0.50248494   2    1000024    5
    0.24835835   2    1000023    6
    0.24712669   2    1000022    6
    0.0020907285   2    1000025    6

DECAY 2000006  206.83584
    0.21383015   2    1000006    25
    0.18408413   2    1000023    6
    0.18286671   2    1000022    6
    0.17320599   2    1000024    5
    0.1469563   2    1000006    23
    0.096458762   2    1000021    6
    0.0015637216   2    1000025    6
    0.0010342357   2    1000005    24

DECAY 1000024  2.5728847e-12
    0.60402716   3    1000022   -1    2
    0.20136188   3    1000022   -11    12
    0.19461095   3    1000022   -13    14

DECAY 1000037  146.5285
    0.10863328   2    1000004   -3
    0.10863264   2    1000002   -1
    0.10856019   2   -1000003    4
    0.10855963   2   -1000001    2
    0.059302939   2    1000024    25
    0.05548926   2    1000023    24
    0.055347171   2    1000024    23
    0.055134735   2    1000022    24
    0.04773155   2    1000016   -15
    0.047668072   2   -2000015    16
    0.033301215   2    37    1000022
    0.033215074   2    1000024    36
    0.033210083   2    1000024    35
    0.032185665   2    37    1000023
    0.024100319   2    1000014   -13
    0.024099495   2    1000012   -11
    0.024059678   2   -1000013    14
    0.024058864   2   -1000011    12
    0.0062666372   3    1000024    6   -6
    0.003927773   3    1000023   -5    6
    0.003806041   3    1000022   -5    6
    0.0022974094   2    2000006   -5
    0.00023380378   2    1000006   -5
    0.00010252806   2    1000025    24

DECAY 1000022 -1


DECAY 1000023  4.0911762e-09
    0.91697531   2    1000022    22
    0.022683559   3    1000022    12   -12
    0.016961645   3    1000022    1   -1
    0.016711842   3    1000022    3   -3
    0.013229104   3    1000022    2   -2
    0.0038279163   3    1000022    11   -11
    0.0037394927   3    1000022    13   -13
    0.0017634647   3    1000024    1   -2
    0.0017634647   3   -1000024   -1    2
    0.00058786943   3    1000024    11   -12
    0.00058786943   3   -1000024   -11    12
    0.00057125343   3    1000024    13   -14
    0.00057125343   3   -1000024   -13    14

DECAY 1000025  13.083554
    0.10665785   2    1000024   -24
    0.10665785   2   -1000024    24
    0.092421468   2    2000013   -13
    0.092421468   2   -2000013    13
    0.092405235   2    2000011   -11
    0.092405235   2   -2000011    11
    0.072908611   2    1000023    23
    0.072829999   2    1000023    25
    0.06565743   2    1000022    25
    0.033749906   2    1000022    23
    0.033743138   2    2000003   -3
    0.033743138   2   -2000003    3
    0.033741912   2    2000001   -1
    0.033741912   2   -2000001    1
    0.012202973   2    1000015   -15
    0.012202973   2   -1000015    15
    0.0037162788   3    1000024    5   -6
    0.0037162788   3   -1000024   -5    6
    0.0023200382   3    1000023    6   -6
    0.0022077188   3    1000022    6   -6
    0.00024505718   3    1000022    5   -5
    0.00022990147   3    1000023    5   -5

DECAY 1000035  148.76807
    0.054552998   2    1000024   -24
    0.054552998   2   -1000024    24
    0.053507877   2    1000004   -4
    0.053507877   2   -1000004    4
    0.053507601   2    1000002   -2
    0.053507601   2   -1000002    2
    0.053446929   2    1000003   -3
    0.053446929   2   -1000003    3
    0.053446614   2    1000001   -1
    0.053446614   2   -1000001    1
    0.037715417   2    1000023    25
    0.034031763   2    1000022    25
    0.032677025   2    37   -1000024
    0.032677025   2   -37    1000024
    0.031905462   2    1000023    23
    0.023524462   2    1000016   -16
    0.023524462   2   -1000016    16
    0.023454871   2    2000015   -15
    0.023454871   2   -2000015    15
    0.022620676   2    1000022    23
    0.021874101   2    1000022    35
    0.01980549   2    1000023    35
    0.011951526   2    1000023    36
    0.011877422   2    1000014   -14
    0.011877422   2   -1000014    14
    0.011877016   2    1000012   -12
    0.011877016   2   -1000012    12
    0.011837914   2    1000013   -13
    0.011837914   2   -1000013    13
    0.011837514   2    1000011   -11
    0.011837514   2   -1000011    11
    0.010943465   2    1000022    36
    0.0043458153   3    1000024    5   -6
    0.0043458153   3   -1000024   -5    6
    0.0031983393   3    1000023    6   -6
    0.0031378864   3    1000022    6   -6
    0.0012728793   2    2000005   -5
    0.0012728793   2   -2000005    5
    0.00011314502   2    1000006   -6
    0.00011314502   2   -1000006    6
    0.0001057605   2    1000025    25

DECAY 1000021  208.22241
    0.14836486   2    2000003   -3
    0.14836486   2   -2000003    3
    0.14836349   2    2000001   -1
    0.14836349   2   -2000001    1
    0.052441849   2    1000006   -6
    0.052441849   2   -1000006    6
    0.02510144   2    1000004   -4
    0.02510144   2   -1000004    4
    0.025101122   2    1000002   -2
    0.025101122   2   -1000002    2
    0.025011865   2    1000003   -3
    0.025011865   2   -1000003    3
    0.025011498   2    1000001   -1
    0.025011498   2   -1000001    1
    0.018864872   2    1000005   -5
    0.018864872   2   -1000005    5
    0.015653806   2    2000002   -2
    0.015653806   2   -2000002    2
    0.015653793   2    2000004   -4
    0.015653793   2   -2000004    4
    0.00020911691   3    1000024    5   -6
    0.00020911691   3   -1000024   -5    6
    0.00014124677   3    1000023    6   -6
    0.00014039609   3    1000022    6   -6

DECAY 25  0.0038074048
    0.58415924   2   -5    5
    0.21710827   2   -24    24
    0.072736926   2    21    21
    0.067148338   2   -15    15
    0.028681285   2   -4    4
    0.025938914   2    23    23
    0.0023359487   2    22    22
    0.0014377854   2    22    23
    0.00023288741   2   -13    13
    0.0002196482   2   -3    3
    6.0730571e-07   2   -1    1
    1.478035e-07   2   -2    2
    5.2355757e-09   2   -11    11

DECAY 35  48.592378
    0.85427747   2   -5    5
    0.14345859   2   -15    15
    0.0010342722   2   -6    6
    0.00049898864   2   -13    13
    0.00037374136   2   -3    3
    0.00020384387   2   -1000024    1000024
    8.1305531e-05   2    1000022    1000022
    4.5839603e-05   2    1000023    1000023
    1.6686544e-05   2    21    21
    5.8147589e-06   2    25    25
    1.2658223e-06   2    1000022    1000023
    1.0334559e-06   2   -1    1
    7.2129229e-07   2    23    23
    3.7480951e-07   2   -24    24
    1.3938761e-08   2   -4    4
    1.221803e-08   2    22    22
    1.1208351e-08   2   -11    11
    9.0110097e-09   2    22    23
    7.185966e-14   2   -2    2

DECAY 36  46.145957
    0.85416688   2   -5    5
    0.14344064   2   -15    15
    0.0010656395   2   -6    6
    0.00049892522   2   -13    13
    0.00037369012   2   -3    3
    0.00025998495   2   -1000024    1000024
    9.498122e-05   2    1000022    1000022
    6.4876202e-05   2    1000023    1000023
    2.9749706e-05   2    21    21
    2.5142634e-06   2    1000022    1000023
    1.033316e-06   2   -1    1
    1.0281217e-06   2    23    25
    2.5525457e-08   2    22    22
    1.6622305e-08   2    22    23
    1.3904137e-08   2   -4    4
    1.1206917e-08   2   -11    11
    7.1688229e-14   2   -2    2
    2.2359856e-39   2    25    25

DECAY 37  46.088857
    0.83967643   2   -5    6
    0.15811767   2   -15    16
    0.0012481268   2   -5    4
    0.00055900288   2   -13    14
    0.00035579824   2   -3    4
    1.6587614e-05   2   -3    2
    1.1405033e-05   2    1000023    1000024
    8.912917e-06   2   -5    2
    1.9744344e-06   2    1000022    1000024
    1.9471906e-06   2   -3    6
    1.0331006e-06   2    24    25
    9.8738807e-07   2   -1    2
    6.5447792e-08   2   -1    6
    4.6502478e-08   2   -1    4
    1.3075135e-08   2   -11    12
    4.1633153e-13   2    24    35
    2.1532072e-13   2    24    36

DECAY 6  2.43
    1   2    5    24

DECAY 15 -1
