BLOCK DCINFO
   1   SDECAY/HDECAY
   2   1.3b /3.4

BLOCK SPINFO
   1   SOFTSUSY
   2   3.4.0

BLOCK MODSEL
   1   0

BLOCK SMINPUTS
   1    127.90897
   2    1.1663787e-05
   3    0.1184
   4    91.1876
   5    4.18
   6    173.2
   7    1.777

BLOCK MINPAR
   3    15.09

BLOCK EXTPAR
   0   -1
   1    1073.05
   2    1031.87
   3    2434.42
   11    4308.97
   12   -3572.68
   13    2860.14
   23    1184.64
   26    3416.08
   31    2295.71
   32    2295.71
   33    2893.35
   34    2652.54
   35    2652.54
   36    1920.96
   41    3007.96
   42    3007.96
   43    3359.43
   44    1256.8
   45    1256.8
   46    2225.66
   47    1546.93
   48    1546.93
   49    3046.1

BLOCK MASS
   24    80.404603
   25    127.83609
   35    3416.1218
   36    3416.08
   37    3417.2134
   5    4.8187603
   1000001    3086.4944
   2000001    1668.995
   1000002    3085.636
   2000002    1394.0469
   1000003    3086.4944
   2000003    1668.995
   1000004    3085.636
   2000004    1394.0469
   1000005    3115.2385
   2000005    3386.0081
   1000006    2266.7364
   2000006    3395.801
   1000011    2303.8279
   2000011    2655.6787
   1000012    2302.1627
   1000013    2303.8279
   2000013    2655.6787
   1000014    2302.1627
   1000015    1923.3894
   2000015    2900.3654
   1000016    2898.9466
   1000021    2580.9744
   1000022    1044.1081
   1000023    1066.4341
   1000025   -1216.9716
   1000035    1242.5382
   1000024    1055.0973
   1000037    1238.0793

BLOCK NMIX
   1   1   -0.70342427
   1   2    0.62046273
   1   3   -0.26102255
   1   4    0.22822691
   2   1    0.68910419
   2   2    0.71485853
   2   3   -0.088989687
   2   4    0.078698997
   3   1   -0.012843094
   3   2    0.022451737
   3   3    0.70642522
   3   4    0.70731491
   4   1   -0.17368004
   4   2    0.32171293
   4   3    0.65185234
   4   4   -0.66439789

BLOCK UMIX
   1   1    0.93464088
   1   2   -0.35559306
   2   1    0.35559306
   2   2    0.93464088

BLOCK VMIX
   1   1    0.94965529
   1   2   -0.31329672
   2   1    0.31329672
   2   2    0.94965529

BLOCK STOPMIX
   1   1   -0.089581111
   1   2    0.99597953
   2   1   -0.99597953
   2   2   -0.089581111

BLOCK SBOTMIX
   1   1    0.025975266
   1   2    0.99966259
   2   1   -0.99966259
   2   2    0.025975266

BLOCK STAUMIX
   1   1    0.0056158642
   1   2    0.99998423
   2   1   -0.99998423
   2   2    0.0056158642

BLOCK ALPHA
      -0.069502941

BLOCK HMIX Q=  2733.658
   1    1203.8184
   2    14.397918
   3    242.18284
   4    11827209

BLOCK GAUGE Q=  2733.658
   1    0.36477331
   2    0.6377059
   3    1.0167327

BLOCK AU Q=  2733.658
   1   1    0
   2   2    0
   3   3    4308.97

BLOCK AD Q=  2733.658
   1   1    0
   2   2    0
   3   3   -3572.68

BLOCK AE Q=  2733.658
   1   1    0
   2   2    0
   3   3    2860.14

BLOCK YU Q=  2733.658
   1   1    0
   2   2    0
   3   3    0.843054

BLOCK YD Q=  2733.658
   1   1    0
   2   2    0
   3   3    0.18203231

BLOCK YE Q=  2733.658
   1   1    0
   2   2    0
   3   3    0.14960683

BLOCK MSOFT Q=  2733.658
   1    1073.05
   2    1031.87
   3    2434.42
   21    10145138
   22   -1286910.3
   31    2295.71
   32    2295.71
   33    2893.35
   34    2652.54
   35    2652.54
   36    1920.96
   41    3007.96
   42    3007.96
   43    3359.43
   44    1256.8
   45    1256.8
   46    2225.66
   47    1546.93
   48    1546.93
   49    3046.1

BLOCK HIGGSBOUNDSINPUTHIGGSCOUPLINGSFERMIONS
       0, 207.30003,3,36,15,15

BLOCK HIGGSBOUNDSINPUTHIGGSCOUPLINGSBOSONS
       0,4,36,21,21,23

DECAY 6  1.4315738
    1   2    5    24

DECAY 1000021  87.558038
    0.14505749   2    2000002   -2
    0.14505749   2   -2000002    2
    0.14505742   2    2000004   -4
    0.14505742   2   -2000004    4
    0.09789365   2    2000001   -1
    0.09789365   2   -2000001    1
    0.09789365   2    2000003   -3
    0.09789365   2   -2000003    3
    0.014097786   2    1000006   -6
    0.014097786   2   -1000006    6

DECAY 1000006  34.929911
    0.42269029   2    1000037    5
    0.22199017   2    1000025    6
    0.21674905   2    1000035    6
    0.057159954   2    1000022    6
    0.046837358   2    1000023    6
    0.034573185   2    1000024    5

DECAY 2000006  142.0201
    0.23451952   2    1000021    6
    0.15414104   2    1000024    5
    0.13897407   2    1000006    25
    0.1292704   2    1000025    6
    0.11953322   2    1000006    23
    0.11176165   2    1000035    6
    0.057516814   2    1000023    6
    0.037799926   2    1000022    6
    0.016079778   2    1000037    5
    0.0004035859   2    1000005    24

DECAY 1000005  21.224561
    0.79185832   2    1000021    5
    0.05547687   2   -1000037    6
    0.041595581   2    1000022    5
    0.034495008   2    1000025    5
    0.032927134   2    1000023    5
    0.028550925   2    1000035    5
    0.01460028   2   -1000024    6
    0.00049588584   2    1000006   -24

DECAY 2000005  136.36606
    0.26137312   2   -1000037    6
    0.23897532   2    1000021    5
    0.23813928   2    1000006   -24
    0.16469813   2   -1000024    6
    0.047246362   2    1000022    5
    0.027784376   2    1000023    5
    0.015121618   2    1000035    5
    0.0062735552   2    1000025    5
    0.00020105815   2    1000005    25
    0.00018718547   2    1000005    23

DECAY 1000002  49.138601
    0.43019528   2    1000021    2
    0.34184576   2    1000024    1
    0.13496155   2    1000023    2
    0.045071116   2    1000022    2
    0.033628347   2    1000037    1
    0.014228528   2    1000035    2
    6.9422368e-05   2    1000025    2

DECAY 2000002  0.60015886
    0.53428459   2    1000022    2
    0.45835358   2    1000023    2
    0.0073085646   2    1000035    2
    5.3267464e-05   2    1000025    2

DECAY 1000001  49.15803
    0.43126015   2    1000021    1
    0.33113269   2   -1000024    2
    0.10850373   2    1000022    1
    0.06415964   2    1000023    1
    0.043325455   2   -1000037    2
    0.021510743   2    1000035    1
    0.00010758888   2    1000025    1

DECAY 2000001  0.35217167
    0.51526661   2    1000022    1
    0.46766147   2    1000023    1
    0.016969616   2    1000035    1
    0.00010229969   2    1000025    1

DECAY 1000004  44.526894
    0.39429708   2    1000024    3
    0.34284724   2    1000021    4
    0.15565754   2    1000023    4
    0.051990401   2    1000022    4
    0.038737887   2    1000037    3
    0.016389865   2    1000035    4
    7.9983127e-05   2    1000025    4

DECAY 2000004  0.58504522
    0.5347356   2    1000022    4
    0.45806648   2    1000023    4
    0.0071455701   2    1000035    4
    5.2343111e-05   2    1000025    4

DECAY 1000003  44.526972
    0.38208939   2   -1000024    4
    0.34383324   2    1000021    3
    0.12521015   2    1000022    3
    0.074027324   2    1000023    3
    0.049927906   2   -1000037    4
    0.024787979   2    1000035    3
    0.00012400426   2    1000025    3

DECAY 2000003  0.34911479
    0.51546659   2    1000022    3
    0.46757686   2    1000023    3
    0.016854812   2    1000035    3
    0.00010173587   2    1000025    3

DECAY 1000011  18.949688
    0.53659497   2   -1000024    12
    0.37343955   2    1000023    11
    0.062908495   2   -1000037    12
    0.014770466   2    1000022    11
    0.012228196   2    1000035    11
    5.832822e-05   2    1000025    11

DECAY 2000011  9.9294885
    0.50077144   2    1000022    11
    0.47302394   2    1000023    11
    0.026058855   2    1000035    11
    0.00014576506   2    1000025    11

DECAY 1000013  18.949688
    0.53659497   2   -1000024    14
    0.37343954   2    1000023    13
    0.062908495   2   -1000037    14
    0.014770466   2    1000022    13
    0.012228196   2    1000035    13
    5.8328219e-05   2    1000025    13

DECAY 2000013  9.9294884
    0.50077144   2    1000022    13
    0.47302394   2    1000023    13
    0.026058855   2    1000035    13
    0.00014576506   2    1000025    13

DECAY 1000015  5.5533916
    0.4571197   2    1000022    15
    0.41838533   2    1000023    15
    0.04536845   2   -1000037    16
    0.040621686   2    1000035    15
    0.027737964   2    1000025    15
    0.010766872   2   -1000024    16

DECAY 2000015  29.979895
    0.51420542   2   -1000024    16
    0.36019422   2    1000023    15
    0.066644474   2   -1000037    16
    0.025384719   2    1000035    15
    0.016031815   2    1000022    15
    0.014674404   2    1000025    15
    0.0014370753   2    1000015    23
    0.0014278652   2    1000015    25

DECAY 1000012  18.976869
    0.55235571   2    1000024    11
    0.32391749   2    1000022    12
    0.048670673   2    1000037    11
    0.043697685   2    1000035    12
    0.031132203   2    1000023    12
    0.00022624013   2    1000025    12

DECAY 1000014  18.976869
    0.55235571   2    1000024    13
    0.32391749   2    1000022    14
    0.048670673   2    1000037    13
    0.043697685   2    1000035    14
    0.031132203   2    1000023    14
    0.00022624013   2    1000025    14

DECAY 1000016  30.003828
    0.53461192   2    1000024    15
    0.30968939   2    1000022    16
    0.076458781   2    1000037    15
    0.046171874   2    1000035    16
    0.030051388   2    1000023    16
    0.0027811494   2   -1000015   -24
    0.00023550131   2    1000025    16

DECAY 1000024  3.1132265e-07
    0.33775332   3    1000022    2   -1
    0.33775332   3    1000022    4   -3
    0.11266245   3    1000022   -11    12
    0.11266245   3    1000022   -13    14
    0.099168467   3    1000022   -15    16

DECAY 1000037  2.4373572
    0.39161818   2    1000023    24
    0.33610606   2    1000024    23
    0.23662921   2    1000024    25
    0.035646557   2    1000022    24

DECAY 1000022 -1


DECAY 1000023  1.3111835e-06
    0.3528612   2    1000022    22
    0.10913616   3    1000024   -2    1
    0.10913616   3   -1000024   -1    2
    0.10913616   3    1000024   -4    3
    0.10913616   3   -1000024   -3    4
    0.036405301   3    1000024   -12    11
    0.036405301   3   -1000024    12   -11
    0.036405301   3    1000024   -14    13
    0.036405301   3   -1000024    14   -13
    0.032286367   3    1000024   -16    15
    0.032286367   3   -1000024    16   -15
    6.8979999e-05   3    1000022   -2    2
    6.8979999e-05   3    1000022   -4    4
    6.2699357e-05   3    1000022   -1    1
    6.2699357e-05   3    1000022   -3    3
    3.8489597e-05   3    1000022   -5    5
    2.300986e-05   3    1000022   -16    16
    2.1177653e-05   3    1000022   -12    12
    2.1177653e-05   3    1000022   -14    14
    1.1920829e-05   3    1000022   -11    11
    1.1920829e-05   3    1000022   -13    13
    9.1493007e-06   3    1000022   -15    15

DECAY 1000025  2.1168977
    0.37137591   2    1000022    23
    0.30167519   2    1000024   -24
    0.30167519   2   -1000024    24
    0.024377252   2    1000023    23
    0.00086889261   2    1000022    25
    2.756342e-05   2    1000023    25

DECAY 1000035  2.4888821
    0.3396276   2    1000024   -24
    0.3396276   2   -1000024    24
    0.29478711   2    1000022    25
    0.02303395   2    1000023    25
    0.0027286908   2    1000022    23
    0.00019505811   2    1000023    23

DECAY 25  0.0045769257
    0.56314457   2    5   -5
    0.24828307   2    24   -24
    0.074391795   2    21    21
    0.058082201   2   -15    15
    0.032365838   2    23    23
    0.019293489   2    4   -4
    0.0022648364   2    22    22
    0.0017452537   2    22    23
    0.00022336635   2    3   -3
    0.00020557664   2   -13    13

DECAY 35  37.750101
    0.20150678   2    1000024   -1000037
    0.20150678   2    1000037   -1000024
    0.19072745   2    5   -5
    0.15881222   2    1000022    1000025
    0.039421067   2    1000022    1000035
    0.03815042   2   -15    15
    0.037420638   2    1000024   -1000024
    0.029065493   2    1000025    1000035
    0.022617195   2    1000022    1000022
    0.019033583   2    1000023    1000025
    0.018122722   2    1000037   -1000037
    0.017429229   2    6   -6
    0.015566061   2    1000035    1000035
    0.0052500082   2    1000022    1000023
    0.0046799463   2    1000023    1000035
    0.00030447917   2    1000023    1000023
    0.00013428581   2   -13    13
    0.00012963148   2    1000025    1000025
    7.4991684e-05   2    3   -3
    2.9544376e-05   2    25    25
    8.6752111e-06   2    24   -24
    4.3292743e-06   2    23    23
    3.0245798e-06   2    21    21
    5.1425703e-07   2    2000002   -2000002
    5.1425703e-07   2    2000004   -2000004
    1.7690832e-07   2    4   -4
    1.2935008e-07   2    22    22
    4.7313536e-08   2    2000001   -2000001
    4.7313536e-08   2    2000003   -2000003
    7.2141746e-09   2    23    22

DECAY 36  37.735152
    0.19083406   2    5   -5
    0.16435671   2    1000024   -1000037
    0.16435671   2    1000037   -1000024
    0.095365055   2    1000022    1000035
    0.077068055   2    1000024   -1000024
    0.067327482   2    1000022    1000025
    0.052684582   2    1000037   -1000037
    0.046085203   2    1000022    1000022
    0.043938037   2    1000035    1000035
    0.038165963   2   -15    15
    0.017470765   2    6   -6
    0.011504626   2    1000023    1000035
    0.010968959   2    1000025    1000035
    0.010851028   2    1000022    1000023
    0.0079400001   2    1000023    1000025
    0.00063861496   2    1000023    1000023
    0.00019928025   2    1000025    1000025
    0.00013434038   2   -13    13
    7.5047765e-05   2    3   -3
    2.6268576e-05   2    21    21
    8.797952e-06   2    23    25
    2.000959e-07   2    22    22
    1.777995e-07   2    4   -4
    2.8353818e-08   2    23    22

DECAY 37  37.223093
    0.2578782   2    1000037    1000023
    0.20729636   2    1000024    1000025
    0.20591016   2    1000024    1000035
    0.1973622   2    6   -5
    0.03870383   2   -15    16
    0.030039075   2    1000037    1000022
    0.02440424   2    1000037    1000025
    0.018150257   2    1000024    1000023
    0.017084024   2    1000024    1000022
    0.0026417631   2    1000037    1000035
    0.00030280042   2    4   -5
    0.00013623362   2   -13    14
    7.509581e-05   2    4   -3
    8.9321646e-06   2    24    25
    3.8064714e-06   2    2   -3
    3.0279985e-06   2    2   -5
    6.6113602e-14   2    24    36

DECAY 5 -1


DECAY 15 -1


DECAY 23  2.4952


DECAY 24  2.085
