{
    "Horizontal Step": 8,
    "Vertical Step": 8,
    "Prescale": 0,
    "Clock Divider": 0,
    "Counts per UI": 32,
    "Dwell BER": 1e-06,
    "Horizontal Range": "-0.500 UI to 0.500 UI",
    "Vertical Range": "100%",
    "Maximum Horizontal Range": 32,
    "Maximum Vertical Range": 124,
    "DFE Enabled": true,
    "Sample Scale": 0.5,
    "Internal Data Width": 32,
    "Dwell Time": null,
    "Line Rate": 10.31,
    "2d statistical": [
        -120,
        -112,
        -104,
        -96,
        -88,
        -80,
        -72,
        -64,
        -56,
        -48,
        -40,
        -32,
        -24,
        -16,
        -8,
        0,
        8,
        16,
        24,
        32,
        40,
        48,
        56,
        64,
        72,
        80,
        88,
        96,
        104,
        112,
        120
    ],
    "voltage_codes": [
        -32,
        -24,
        -16,
        -8,
        0,
        8,
        16,
        24,
        32
    ],
    "scan_data": [
        [
            0.2993366701836071,
            0.31764731660887446,
            0.3264663653619157,
            0.33841581635849327,
            0.34425327362372743,
            0.3413766826446286,
            0.34354209183187373,
            0.35274441924988775,
            0.35247392911555697,
            0.34502613427528106,
            0.3448434410521558,
            0.3449365178669348,
            0.34833141986249866,
            0.3502622539501267,
            0.3460064669015422,
            0.33901746074016204,
            0.3414586567926775,
            0.3455365841407412,
            0.34982707613829345,
            0.3473043986827561,
            0.34103248357095184,
            0.3425378908670721,
            0.34630243163613594,
            0.3523276136103341,
            0.35100600365162477,
            0.34976463700316157,
            0.34274181781434904,
            0.34534606186369615,
            0.3429243844930384,
            0.3314388618293533,
            0.32044971962266106
        ],
        [
            0.05986462291727565,
            0.042386968085106384,
            0.03156645935448072,
            0.02296546996949852,
            0.013349021515220874,
            0.010121976806286717,
            0.005008058670939193,
            0.0010576409552147707,
            0.00033379110399023423,
            0.00023603799496452278,
            0.00013256275272755015,
            4.863813229571985e-05,
            6.6758220798046845e-06,
            4.768444342717632e-07,
            4.768444342717632e-07,
            4.768444342717632e-07,
            4.768444342717632e-07,
            4.768444342717632e-07,
            4.768444342717632e-07,
            2.861066605630579e-06,
            2.408064393072404e-05,
            0.00016212710765239947,
            0.0002973125047684443,
            0.00040722514686808577,
            0.0009169718471046006,
            0.0046761749446860455,
            0.01015130273899443,
            0.012497854200045778,
            0.01962407771176696,
            0.03760915176111948,
            0.04592681983315393
        ],
        [
            4.768444342717632e-07,
            4.768444342717632e-07,
            4.768444342717632e-07,
            4.768444342717632e-07,
            4.768444342717632e-07,
            4.768444342717632e-07,
            4.768444342717632e-07,
            4.768444342717632e-07,
            4.768444342717632e-07,
            4.768444342717632e-07,
            4.768444342717632e-07,
            4.768444342717632e-07,
            4.768444342717632e-07,
            4.768444342717632e-07,
            4.768444342717632e-07,
            4.768444342717632e-07,
            4.768444342717632e-07,
            4.768444342717632e-07,
            4.768444342717632e-07,
            4.768444342717632e-07,
            4.768444342717632e-07,
            4.768444342717632e-07,
            4.768444342717632e-07,
            4.768444342717632e-07,
            4.768444342717632e-07,
            4.768444342717632e-07,
            4.768444342717632e-07,
            4.768444342717632e-07,
            4.768444342717632e-07,
            4.768444342717632e-07,
            4.768444342717632e-07
        ],
        [
            4.768444342717632e-07,
            4.768444342717632e-07,
            4.768444342717632e-07,
            4.768444342717632e-07,
            4.768444342717632e-07,
            4.768444342717632e-07,
            4.768444342717632e-07,
            4.768444342717632e-07,
            4.768444342717632e-07,
            4.768444342717632e-07,
            4.768444342717632e-07,
            4.768444342717632e-07,
            4.768444342717632e-07,
            4.768444342717632e-07,
            4.768444342717632e-07,
            4.768444342717632e-07,
            4.768444342717632e-07,
            4.768444342717632e-07,
            4.768444342717632e-07,
            4.768444342717632e-07,
            4.768444342717632e-07,
            4.768444342717632e-07,
            4.768444342717632e-07,
            4.768444342717632e-07,
            4.768444342717632e-07,
            4.768444342717632e-07,
            4.768444342717632e-07,
            4.768444342717632e-07,
            4.768444342717632e-07,
            4.768444342717632e-07,
            4.768444342717632e-07
        ],
        [
            4.768444342717632e-07,
            4.768444342717632e-07,
            4.768444342717632e-07,
            4.768444342717632e-07,
            4.768444342717632e-07,
            4.768444342717632e-07,
            4.768444342717632e-07,
            4.768444342717632e-07,
            4.768444342717632e-07,
            4.768444342717632e-07,
            4.768444342717632e-07,
            4.768444342717632e-07,
            4.768444342717632e-07,
            4.768444342717632e-07,
            4.768444342717632e-07,
            4.768444342717632e-07,
            4.768444342717632e-07,
            4.768444342717632e-07,
            4.768444342717632e-07,
            4.768444342717632e-07,
            4.768444342717632e-07,
            4.768444342717632e-07,
            4.768444342717632e-07,
            4.768444342717632e-07,
            4.768444342717632e-07,
            4.768444342717632e-07,
            4.768444342717632e-07,
            4.768444342717632e-07,
            4.768444342717632e-07,
            4.768444342717632e-07,
            4.768444342717632e-07
        ],
        [
            4.768444342717632e-07,
            4.768444342717632e-07,
            4.768444342717632e-07,
            4.768444342717632e-07,
            4.768444342717632e-07,
            4.768444342717632e-07,
            4.768444342717632e-07,
            4.768444342717632e-07,
            4.768444342717632e-07,
            4.768444342717632e-07,
            4.768444342717632e-07,
            4.768444342717632e-07,
            4.768444342717632e-07,
            4.768444342717632e-07,
            4.768444342717632e-07,
            4.768444342717632e-07,
            4.768444342717632e-07,
            4.768444342717632e-07,
            4.768444342717632e-07,
            4.768444342717632e-07,
            4.768444342717632e-07,
            4.768444342717632e-07,
            4.768444342717632e-07,
            4.768444342717632e-07,
            4.768444342717632e-07,
            4.768444342717632e-07,
            4.768444342717632e-07,
            4.768444342717632e-07,
            4.768444342717632e-07,
            4.768444342717632e-07,
            4.768444342717632e-07
        ],
        [
            4.768444342717632e-07,
            4.768444342717632e-07,
            4.768444342717632e-07,
            4.768444342717632e-07,
            4.768444342717632e-07,
            4.768444342717632e-07,
            4.768444342717632e-07,
            4.768444342717632e-07,
            4.768444342717632e-07,
            4.768444342717632e-07,
            4.768444342717632e-07,
            4.768444342717632e-07,
            4.768444342717632e-07,
            4.768444342717632e-07,
            4.768444342717632e-07,
            4.768444342717632e-07,
            4.768444342717632e-07,
            4.768444342717632e-07,
            4.768444342717632e-07,
            4.768444342717632e-07,
            4.768444342717632e-07,
            4.768444342717632e-07,
            4.768444342717632e-07,
            4.768444342717632e-07,
            4.768444342717632e-07,
            4.768444342717632e-07,
            4.768444342717632e-07,
            4.768444342717632e-07,
            4.768444342717632e-07,
            4.768444342717632e-07,
            4.768444342717632e-07
        ],
        [
            2.384222171358816e-07,
            4.768444342717632e-07,
            4.768444342717632e-07,
            4.768444342717632e-07,
            4.768444342717632e-07,
            4.768444342717632e-07,
            4.768444342717632e-07,
            4.768444342717632e-07,
            4.768444342717632e-07,
            4.768444342717632e-07,
            4.768444342717632e-07,
            4.768444342717632e-07,
            4.768444342717632e-07,
            4.768444342717632e-07,
            4.768444342717632e-07,
            4.768444342717632e-07,
            4.768444342717632e-07,
            4.768444342717632e-07,
            4.768444342717632e-07,
            4.768444342717632e-07,
            4.768444342717632e-07,
            4.768444342717632e-07,
            4.768444342717632e-07,
            4.768444342717632e-07,
            4.768444342717632e-07,
            4.768444342717632e-07,
            4.768444342717632e-07,
            4.768444342717632e-07,
            4.768444342717632e-07,
            4.768444342717632e-07,
            4.768444342717632e-07
        ],
        [
            0.16944423551922655,
            0.1569273903191897,
            0.1445853301391899,
            0.13652326010525812,
            0.1284152808210307,
            0.1272661592050328,
            0.12524107550293162,
            0.12341388647760618,
            0.12068932470998583,
            0.12144169837677472,
            0.12462234493595661,
            0.12487576913098866,
            0.12121654254390236,
            0.11819887714302879,
            0.11982452238207791,
            0.12234063697807701,
            0.12296643461307413,
            0.12178977205641596,
            0.1193727409990221,
            0.12135875835829021,
            0.12245325186351835,
            0.12369863946085902,
            0.1217321590252079,
            0.11961695068908404,
            0.12009840172291515,
            0.12396100658688639,
            0.1263593273933168,
            0.1273532180112542,
            0.13313759666076175,
            0.14133799568554334,
            0.15127368614054723
        ]
    ],
    "Date and Time Started": "2022-10-13 15:21:20.550638",
    "Date and Time Ended": "2022-10-13 15:21:21.081271",
    "Open UI percentage": 68.81720430107528,
    "Open Area": 11275
}