Merge branch 'avolio/tdaq-09-04-00/RCUtils' into 'tdaq-09-04-00'

avolio submitted RCUtils with tag RCUtils-07-06-00

See merge request !348
4 jobs for !348 with avolio/tdaq-09-04-00/RCUtils into tdaq-09-04-00 in 2 minutes and 19 seconds (queued for 1 second)
Name Stage Failure
failed
continuous/x86_64-centos7-gcc8-dbg Build
make[1]: *** [RCUtils/CMakeFiles/daq_eff_page.dir/all] Error 2
make[1]: *** Waiting for unfinished jobs....
[ 50%] Linking CXX executable rc_checkapps
[ 50%] Built target rc_checkapps
[ 51%] Linking CXX executable rc_timetest
[ 51%] Built target rc_timetest
make: *** [all] Error 2
Cleaning up project directory and file based variables
ERROR: Job failed: exit code 1

failed
continuous/x86_64-centos7-gcc11-opt Build
[ 51%] Linking CXX executable rc_checkapps
[ 51%] Built target rc_checkapps
[ 52%] Linking CXX executable rc_print_tree
[ 52%] Built target rc_print_tree
[ 54%] Linking CXX executable rc_timetest
[ 54%] Built target rc_timetest
make: *** [all] Error 2
Cleaning up project directory and file based variables
ERROR: Job failed: exit code 1

failed
continuous/x86_64-centos7-gcc8-opt Build
[ 51%] Building CXX object RCUtils/CMakeFiles/rc_timetest.dir/src/TimeTest.cc.o
[ 51%] Built target rc_checkapps
[ 52%] Linking CXX executable rc_print_tree
[ 52%] Built target rc_print_tree
[ 54%] Linking CXX executable rc_timetest
[ 54%] Built target rc_timetest
make: *** [all] Error 2
Cleaning up project directory and file based variables
ERROR: Job failed: exit code 1

failed
continuous/x86_64-centos7-gcc11-dbg Build
make[1]: *** [RCUtils/CMakeFiles/daq_eff_page.dir/all] Error 2
make[1]: *** Waiting for unfinished jobs....
[ 50%] Linking CXX executable rc_checkapps
[ 50%] Built target rc_checkapps
[ 51%] Linking CXX executable rc_timetest
[ 51%] Built target rc_timetest
make: *** [all] Error 2
Cleaning up project directory and file based variables
ERROR: Job failed: exit code 1