module gitlab.cern.ch/batch-team/infra/iac-cern-vm-tenant/scripts/batch-mm-notificator

require (
	github.com/blang/semver v3.5.1+incompatible // indirect
	github.com/dyatlov/go-opengraph v0.0.0-20180429202543-816b6608b3c8 // indirect
	github.com/go-ldap/ldap v3.0.3+incompatible // indirect
	github.com/gorilla/websocket v1.4.0 // indirect
	github.com/kelseyhightower/envconfig v1.4.0
	github.com/mattermost/mattermost-server v5.11.1+incompatible
	github.com/nicksnyder/go-i18n v0.0.0-20190519163303-3c6ee9071cf0 // indirect
	github.com/pborman/uuid v1.2.0 // indirect
	github.com/pkg/errors v0.8.1 // indirect
	go.uber.org/atomic v1.4.0 // indirect
	go.uber.org/multierr v1.1.0 // indirect
	go.uber.org/zap v1.10.0 // indirect
	golang.org/x/crypto v0.0.0-20190701094942-4def268fd1a4 // indirect
	golang.org/x/text v0.3.2 // indirect
	gopkg.in/asn1-ber.v1 v1.0.0-20181015200546-f715ec2f112d // indirect
	gopkg.in/natefinch/lumberjack.v2 v2.0.0 // indirect
	gopkg.in/yaml.v2 v2.2.2 // indirect
)
