{
  "board": {
    "active_layer": 0,
    "active_layer_preset": "",
    "auto_track_width": true,
    "hidden_netclasses": [
      "Default"
    ],
    "hidden_nets": [
      "",
      "P3V3",
      "GND",
      "P12V",
      "/SFP0/SFP_VCCR",
      "/SFP0/SFP_VCCT",
      "Net-(C15-Pad2)",
      "unconnected-(IC9-3B7-Pad27)",
      "unconnected-(IC9-3B8-Pad26)",
      "unconnected-(IC11-3A7-Pad22)",
      "unconnected-(IC11-3A8-Pad23)",
      "unconnected-(IC11-3B8-Pad26)",
      "unconnected-(IC11-3B7-Pad27)",
      "P3V3_CLK",
      "MGT_0V85",
      "P1V8",
      "MGT_1V8",
      "MGT_1V2",
      "VCC_PSDDR_PLL",
      "P0V85",
      "Net-(C48-Pad2)",
      "MGT_0V9",
      "Net-(IC3-VDD)",
      "Net-(C59-Pad1)",
      "Net-(IC60-XA)",
      "/SFP0/SFP_RD_C_P",
      "/SFP0.RX_P",
      "/SFP0/SFP_RD_C_N",
      "/SFP0.RX_N",
      "/SFP0/SFP_TD_C_P",
      "/SFP0.TX_P",
      "Net-(IC60-XB)",
      "Net-(IC18-XB)",
      "/clocks/PLLDAC_OUT2",
      "/clocks/PLLDAC_OUT1",
      "Net-(IC12-OUT)",
      "VCC_PSPLL",
      "/SFP0.TX_N",
      "/SFP0/SFP_TD_C_N",
      "P1V2",
      "PSADC_AGND",
      "VCC_PSADC",
      "Net-(C99-Pad1)",
      "/vme_interface/P0_OE_N",
      "VTT_DDR4-PS",
      "Net-(OSC4-VDD)",
      "Net-(C120-Pad1)",
      "CHASSIS",
      "Net-(IC31-BOOT_A)",
      "Net-(IC24-VOSNS)",
      "/vme_interface/F_HWBYTE.H2_5",
      "/vme_interface/F_HWBYTE.H2_3",
      "/vme_interface/F_HWBYTE.H2_2",
      "/vme_interface/F_HWBYTE.H2_4",
      "/vme_interface/F_HWBYTE.H2_6",
      "/vme_interface/F_HWBYTE.H2_7",
      "/vme_interface/F_HWBYTE.H2_0",
      "/vme_interface/I_HWBYTE2_RCLK",
      "/vme_interface/LVDS_TURNCLK2_P",
      "Net-(IC24-REFIN)",
      "/vme_interface/LVDS_TURNCLK1_N",
      "Net-(IC24-REFOUT)",
      "/vme_interface/LVDS_TURNCLK1_P",
      "/vme_interface/LVDS_TURNCLK2_N",
      "/vme_interface/TTC_DATA1_P",
      "/user_interface/USB_VBUS",
      "/vme_interface/TTC_DATA0_N",
      "P2V5",
      "/vme_interface/TTC_DATA1_N",
      "/vme_interface/TTC_DATA0_P",
      "Net-(C162-Pad2)",
      "Net-(C165-Pad2)",
      "5VREG",
      "/ddr4-ps/DDR4-PS_VREF0",
      "/ddr4-ps/DDR4-PS_VREF1",
      "/SFP1.TX_P",
      "/PCIE.PET_P",
      "/PCIE.PET_N",
      "/SFP1.TX_N",
      "/clocks/TRAFO1_P",
      "/WR_CLK.MAIN_P",
      "Net-(C247-Pad1)",
      "Net-(TR2-PDOT)",
      "/WR_CLK.MAIN_N",
      "/clocks/TRAFO1_N",
      "/clocks/WR_CLK_SFP_AC_P",
      "/WR_CLK.SFP_P",
      "/WR_CLK.SFP_N",
      "/clocks/WR_CLK_SFP_AC_N",
      "Net-(IC29-BOOT)",
      "Net-(IC29-PHASE)",
      "Net-(IC30-ISEN_A+)",
      "Net-(IC30-1V8)",
      "Net-(C282-Pad1)",
      "Net-(IC30-BOOT_C)",
      "Net-(IC30-VDRV)",
      "Net-(IC31-VDRV)",
      "Net-(IC30-BOOT_D)",
      "Net-(C289-Pad1)",
      "Net-(IC31-1V8)",
      "Net-(IC31-ADDR_PROT)",
      "Net-(IC30-ADDR_PROT)",
      "Net-(IC30-MTP)",
      "Net-(IC31-MTP)",
      "Net-(IC31-BOOT_B)",
      "Net-(C298-Pad1)",
      "Net-(IC31-BOOT_C)",
      "Net-(C299-Pad1)",
      "Net-(IC31-BOOT_D)",
      "Net-(C300-Pad1)",
      "/fpga/fpga-config/PS_PROG_B",
      "Net-(C353-Pad1)",
      "Net-(IC18-XA)",
      "/SFP1/SFP_VCCR",
      "/SFP1/SFP_VCCT",
      "/SFP1.RX_P",
      "/SFP1/SFP_RD_C_P",
      "/SFP1/SFP_RD_C_N",
      "/SFP1.RX_N",
      "/SFP1/SFP_TD_C_P",
      "/SFP1/SFP_TD_C_N",
      "/PP_VDD",
      "/PCIE.PER_P",
      "/PCIE.PER_N",
      "Net-(IC122-IN+)",
      "/fpga/fpga-mgts/SansDAC_BCLK_B2_P",
      "Net-(IC122-IN-)",
      "/fpga/fpga-mgts/SansDAC_BCLK_B2_N",
      "/vme_interface/F_HWBYTE.H1_2",
      "/vme_interface/F_HWBYTE.H1_3",
      "/vme_interface/I_HWBYTE2_D",
      "/vme_interface/F_HWBYTE.H1_6",
      "/vme_interface/F_HWBYTE.H1_5",
      "/vme_interface/F_HWBYTE.H1_7",
      "/vme_interface/F_HWBYTE.H1_0",
      "/vme_interface/F_HWBYTE.H1_4",
      "/vme_interface/F_HWBYTE.L2_0",
      "/vme_interface/F_HWBYTE.L2_3",
      "/vme_interface/F_HWBYTE.L2_5",
      "/vme_interface/F_HWBYTE.L2_7",
      "/vme_interface/F_HWBYTE.L2_4",
      "/vme_interface/I_HWBYTE2_Q",
      "/vme_interface/F_HWBYTE.L2_2",
      "/vme_interface/F_HWBYTE.L2_6",
      "/vme_interface/F_HWBYTE.L1_4",
      "/vme_interface/F_HWBYTE.L1_5",
      "/vme_interface/F_HWBYTE.L1_3",
      "/vme_interface/F_HWBYTE.L1_0",
      "/vme_interface/F_HWBYTE.L1_7",
      "/vme_interface/F_HWBYTE.L1_6",
      "/vme_interface/F_HWBYTE.L1_2",
      "/vme_interface/F_HWBYTE.L2_OE_N",
      "/vme_interface/F_HWBYTE.L1_OE_N",
      "/fpga/GTH_BCLK_B2_N",
      "/vme_interface/F_HWBYTE.H2_OE_N",
      "/fpga/GTH_BCLK_B2_P",
      "/vme_interface/F_HWBYTE.H1_OE_N",
      "unconnected-(IC66-QH'-Pad9)",
      "Net-(IC122-OUT2-)",
      "/fpga/fpga-mgts/BCLK_B2_DBG_N",
      "/fpga/fpga-mgts/BCLK_B2_DBG_P",
      "Net-(IC122-OUT2+)",
      "Net-(IC121-IN-)",
      "/fpga/fpga-mgts/SansDAC_BCLK_B1_N",
      "Net-(IC121-IN+)",
      "/fpga/fpga-mgts/SansDAC_BCLK_B1_P",
      "Net-(TR1-PDOT)",
      "Net-(C478-Pad1)",
      "/fpga/GTH_BCLK_B1_N",
      "/fpga/GTH_BCLK_B1_P",
      "/fpga/fpga-mgts/BCLK_B1_DBG_N",
      "Net-(IC121-OUT2-)",
      "Net-(IC121-OUT2+)",
      "/fpga/fpga-mgts/BCLK_B1_DBG_P",
      "Net-(C485-Pad1)",
      "Net-(TR3-PDOT)",
      "/pcie_connector/PCIE_PER_AC_P",
      "/pcie_connector/PCIE_PER_AC_N",
      "/pcie_connector/PCIE_PET_AC_P",
      "/pcie_connector/PCIE_PET_AC_N",
      "/fp_connectors/FP_VDD",
      "/fpga/fpga-config/PS_SRST_B",
      "/fpga/fpga-config/JTAG_TMS",
      "/fpga/fpga-config/JTAG_TCK",
      "/fpga/fpga-config/JTAG_TDO",
      "/fpga/fpga-config/JTAG_TDI",
      "/I2C.SDA",
      "/vme_interface/TTL_TURNCLK1",
      "/I2C.SCL",
      "Net-(D10-C)",
      "Net-(D11A-COMAC)",
      "Net-(D12A-COMAC)",
      "Net-(D15A-COMAC)",
      "Net-(D16A-COMAC)",
      "Net-(D19A-COMAC)",
      "Net-(D20A-COMAC)",
      "/vme_interface/TTL_TURNCLK2",
      "Net-(D23A-COMAC)",
      "Net-(D24A-COMAC)",
      "Net-(D27A-COMAC)",
      "P5V_VME",
      "Net-(D28A-COMAC)",
      "Net-(D31A-COMAC)",
      "Net-(D32A-COMAC)",
      "Net-(D35A-COMAC)",
      "Net-(D36A-COMAC)",
      "Net-(D39A-COMAC)",
      "Net-(D40A-COMAC)",
      "Net-(D43A-COMAC)",
      "Net-(D44A-COMAC)",
      "Net-(D47A-COMAC)",
      "Net-(D50A-COMAC)",
      "Net-(D53A-COMAC)",
      "Net-(D54A-COMAC)",
      "Net-(D57A-COMAC)",
      "Net-(D58A-COMAC)",
      "Net-(D61A-COMAC)",
      "Net-(D62A-COMAC)",
      "Net-(D65A-COMAC)",
      "Net-(D66A-COMAC)",
      "Net-(D67A-COMAC)",
      "Net-(D68A-COMAC)",
      "Net-(D71A-COMAC)",
      "Net-(D72A-COMAC)",
      "/fpga/USERIO_A.DIR2",
      "/IOEXP.VME_SCLK",
      "/IOEXP.ALL_RST_N",
      "/fpga/USERIO_A.DIR1",
      "/IOEXP.VME_RCLK",
      "/fpga/USERIO_A.DIR3",
      "/fpga/USERIO_A.DIR0",
      "/IOEXP.ALL_OE_N",
      "/io_drivers_fp/F_IO9",
      "/io_drivers_fp/bank1/OUT5",
      "/io_drivers_fp/bank1/OUT4",
      "/io_drivers_fp/F_IO12",
      "/io_drivers_fp/F_IO11",
      "/io_drivers_fp/bank1/OUT3",
      "/io_drivers_fp/F_IO14",
      "/io_drivers_fp/F_IO10",
      "/io_drivers_fp/F_IO15",
      "/io_drivers_fp/bank1/OUT7",
      "/io_drivers_fp/bank1/OUT0",
      "/io_drivers_fp/F_IO8",
      "/io_drivers_fp/bank1/OUT1",
      "/io_drivers_fp/F_IO13",
      "/io_drivers_fp/bank1/OUT6",
      "/io_drivers_fp/bank1/OUT2",
      "/user_interface/USB_D_P",
      "unconnected-(IC3-GPIO.2_SCI{slash}DSR_SCI-Pad22)",
      "unconnected-(IC3-CTS_ECI-Pad10)",
      "/fpga/PS_UART_RXD",
      "unconnected-(IC3-GPIO.0_SCI{slash}DCD_SCI-Pad24)",
      "unconnected-(IC3-GPIO.1_ECI{slash}DSR_ECI-Pad14)",
      "unconnected-(IC3-GPIO.1_SCI{slash}DTR_SCI-Pad23)",
      "unconnected-(IC3-RTS_ECI-Pad11)",
      "/user_interface/USB_D_N",
      "unconnected-(IC3-NC{slash}VPP{slash}DCD_ECI-Pad16)",
      "unconnected-(IC3-~{SUSPEND{slash}}RI_SCI-Pad1)",
      "unconnected-(IC3-CTS_SCI-Pad18)",
      "unconnected-(IC3-RTS_SCI-Pad19)",
      "unconnected-(IC3-~{SUSPEND{slash}}RI_ECI-Pad17)",
      "/fpga/PL_UART_RXD",
      "unconnected-(IC3-~{RST}-Pad9)",
      "/fpga/PL_UART_TXD",
      "unconnected-(IC3-GPIO.0_ECI{slash}DTR_ECI-Pad15)",
      "/fpga/PS_UART_TXD",
      "unconnected-(IC5-NC-PadT7)",
      "/ddr4-ps/DDR4-PS_ZQ1",
      "/DDR4-PS.ODT",
      "/DDR4-PS.RSTN",
      "/DDR4-PS.PAR",
      "/DDR4-PS.ALERTN",
      "/io_drivers_fp/bank1/TERM_EN0",
      "/IOEXP.FPIO_SCLK",
      "/IOEXP.FPIO_RCLK",
      "/io_drivers_fp/bank1/EN0",
      "/io_drivers_fp/bank1/EN2",
      "Net-(IC6-QH')",
      "/io_drivers_fp/bank1/TERM_EN1",
      "/io_drivers_fp/bank1/TERM_EN3",
      "/io_drivers_fp/bank1/TERM_EN2",
      "/io_drivers_fp/bank1/EN1",
      "/io_drivers_fp/bank1/EN3",
      "/io_drivers_fp/bank1/IOEXP_D",
      "/io_drivers_fp/bank1/EN5",
      "/io_drivers_fp/bank1/TERM_EN4",
      "/io_drivers_fp/bank1/EN6",
      "/io_drivers_fp/bank2/IOEXP_D",
      "/io_drivers_fp/bank1/TERM_EN6",
      "/io_drivers_fp/bank1/TERM_EN5",
      "/io_drivers_fp/bank1/TERM_EN7",
      "/io_drivers_fp/bank1/EN7",
      "/io_drivers_fp/bank1/EN4",
      "/io_drivers_pp/bank1/OUT4",
      "/io_drivers_pp/bank1/OUT3",
      "/io_drivers_pp/bank1/OUT0",
      "/io_drivers_pp/bank1/OUT6",
      "/vme_interface/HWBYTE.H1_6",
      "/vme_interface/HWBYTE.H1_7",
      "/vme_interface/HWBYTE.L1_6",
      "/vme_interface/HWBYTE.H2_6",
      "/vme_interface/HWBYTE.H1_2",
      "/vme_interface/HWBYTE.H1_4",
      "/vme_interface/HWBYTE.L1_7",
      "/vme_interface/HWBYTE.L1_5",
      "/vme_interface/HWBYTE.H2_7",
      "/vme_interface/HWBYTE.L1_4",
      "/vme_interface/HWBYTE.H1_3",
      "/vme_interface/HWBYTE.L2_1",
      "/vme_interface/HWBYTE.H2_1",
      "/vme_interface/HWBYTE.H2_3",
      "/vme_interface/HWBYTE.L2_7",
      "/vme_interface/HWBYTE.L2_6",
      "/vme_interface/HWBYTE.L2_0",
      "/vme_interface/HWBYTE.L1_3",
      "/vme_interface/HWBYTE.H2_5",
      "/vme_interface/HWBYTE.L1_1",
      "/vme_interface/HWBYTE.L2_3",
      "/vme_interface/HWBYTE.H1_1",
      "/vme_interface/HWBYTE.L1_0",
      "/vme_interface/HWBYTE.H2_4",
      "/vme_interface/HWBYTE.H2_0",
      "/vme_interface/HWBYTE.L2_4",
      "/vme_interface/HWBYTE.H1_5",
      "/vme_interface/HWBYTE.L2_2",
      "/vme_interface/HWBYTE.L1_2",
      "/vme_interface/HWBYTE.H1_0",
      "/vme_interface/HWBYTE.H2_2",
      "/vme_interface/HWBYTE.L2_5",
      "unconnected-(IC9-2B-Pad43)",
      "unconnected-(IC1-QH-Pad7)",
      "unconnected-(IC1-QE-Pad4)",
      "unconnected-(IC1-QF-Pad5)",
      "/VMEF.GA4",
      "/VMEF.SYSRESET_N",
      "Net-(IC1-SER)",
      "unconnected-(IC1-QG-Pad6)",
      "Net-(IC1-QH')",
      "/VMEF.GA2",
      "/VMEF.SYSRESET_N_DIR",
      "/VMEF.GAP",
      "unconnected-(IC9-2Y-Pad6)",
      "/VMEF.GA1",
      "/VMEF.GA0",
      "/VMEF.GA3",
      "Net-(IC10-VOUTB)",
      "/WR_DAC.SCLK",
      "Net-(IC10-VOUTA)",
      "/WR_DAC.SYNC",
      "/WR_DAC.DIN",
      "Net-(IC10-VREF)",
      "/VMEF.AM0",
      "/VMEF.AM4",
      "/VMEF.A_OE_N",
      "/VMEF.AM3",
      "/vme_interface/VMEPX_USERIO_A.IO4",
      "/vme_interface/VMEPX_USERIO_A.IO5",
      "/vme_interface/VMEPX_USERIO_A.IO7",
      "/vme_interface/VMEPX_USERIO_A.IO6",
      "/vme_interface/VMEPX_USERIO_A.IO1",
      "/vme_interface/VMEPX_USERIO_A.IO0",
      "/VMEF.AM2",
      "/VMEF.RETRY_OE",
      "/vme_interface/VMEPX_USERIO_A.IO3",
      "/VMEF.A_DIR",
      "/vme_interface/VMEPX_USERIO_A.IO2",
      "/VMEF.AM5",
      "/vme_interface/VMEPX_USERIO_A.IO12",
      "/vme_interface/VMEPX_USERIO_A.IO15",
      "/VMEF.BERR_OE",
      "/vme_interface/VMEPX_USERIO_A.IO11",
      "/vme_interface/VMEPX_USERIO_A.IO10",
      "/VMEF.AM1",
      "/vme_interface/VMEPX_USERIO_A.IO9",
      "unconnected-(IC12-TRIM-Pad5)",
      "unconnected-(IC12-NC-Pad8)",
      "unconnected-(IC12-NC-Pad1)",
      "/vme_interface/VMEPX_USERIO_A.IO14",
      "unconnected-(IC12-TEMP-Pad3)",
      "/vme_interface/VMEPX_USERIO_A.IO13",
      "/vme_interface/VMEPX_USERIO_A.IO8",
      "unconnected-(IC12-NC-Pad7)",
      "/vme_interface/VMEPX_USERIO_A.IO17",
      "/vme_interface/VMEPX_USERIO_A.IO20",
      "/vme_interface/VMEPX_USERIO_A.IO19",
      "/vme_interface/VMEPX_USERIO_A.IO22",
      "/vme_interface/VMEPX_USERIO_A.IO23",
      "/vme_interface/VMEPX_USERIO_A.IO21",
      "/vme_interface/VMEPX_USERIO_A.IO18",
      "/vme_interface/VMEPX_USERIO_A.IO16",
      "unconnected-(IC13-NC-PadT7)",
      "/vme_interface/VMEPX_USERIO_A.IO28",
      "/vme_interface/VMEPX_USERIO_A.IO29",
      "/vme_interface/VMEPX_USERIO_A.IO27",
      "/vme_interface/VMEPX_USERIO_A.IO24",
      "/vme_interface/VMEPX_USERIO_A.IO26",
      "/vme_interface/VMEPX_USERIO_A.IO31",
      "/vme_interface/VMEPX_USERIO_A.IO25",
      "/vme_interface/VMEPX_USERIO_A.IO30",
      "/ddr4-ps/DDR4-PS_ZQ0",
      "unconnected-(IC14Q-VREF_65-PadR9)",
      "/fpga/USERIO_A.IO7",
      "/fpga/fpga-hp-banks/F_PP_LED0_DATA",
      "unconnected-(IC14I-PS_MIO22-PadAB20)",
      "unconnected-(IC14K-PS_MIO59-PadE17)",
      "/VMEF.AS_N_DIR",
      "unconnected-(IC14L-PS_MGTRTXN3_505-PadB24)",
      "Net-(IC14L-PS_MGTRREF_505)",
      "/VMEF.IRQ_OUT_N4",
      "/VMEF.D7",
      "unconnected-(IC14M-PS_DDR_A17-PadAC22)",
      "/fpga/fpga-config/PS_MODE2",
      "unconnected-(IC14M-PS_DDR_DM7-PadH26)",
      "/VMEF.D26",
      "/fpga/USERIO_A.IO20",
      "unconnected-(IC14M-PS_DDR_DQ65-PadR28)",
      "/fpga/USERIO_A.IO5",
      "/VMEF.D1",
      "/fpga/USERIO_A.IO25",
      "/VMEF.A9",
      "/fpga/fpga-hp-banks/F_IOEXP_VME_RCLK",
      "/fpga/USERIO_A.IO1",
      "unconnected-(IC14M-PS_DDR_DQ62-PadK25)",
      "Net-(IC14F-IO_T0U_N12_VRP_65)",
      "/VMEF.D8",
      "/fpga/USERIO_A.IO4",
      "unconnected-(IC14M-PS_DDR_DQ58-PadH28)",
      "unconnected-(IC14M-PS_DDR_CK_N1-PadY25)",
      "unconnected-(IC14K-PS_MIO57-PadA16)",
      "unconnected-(IC14M-PS_DDR_DQ59-PadH27)",
      "/VMEF.D6",
      "/fpga/USERIO_A.IO12",
      "unconnected-(IC14M-PS_DDR_DQS_N8-PadT27)",
      "unconnected-(IC14K-PS_MIO65-PadA18)",
      "unconnected-(IC14M-PS_DDR_CS_N1-PadV26)",
      "/VMEF.D23",
      "/VMEF.A12",
      "/PS-QSPI.UWR_CSN",
      "/WR_CLK.HELPER_P",
      "/fpga/USERIO_A.IO16",
      "/fpga/fpga-config/PS_MODE1",
      "/VMEF.D9",
      "unconnected-(IC14M-PS_DDR_DQ46-PadK22)",
      "unconnected-(IC14L-PS_MGTREFCLK1P_505-PadE21)",
      "/fpga/fpga-hp-banks/F_PP_LED1_DATA",
      "/VMEF.D14",
      "/VMEF.IRQ_OUT_N3",
      "unconnected-(IC14L-PS_MGTRTXP3_505-PadB23)",
      "/fpga/fpga-hp-banks/F_IOEXP_VME_D",
      "unconnected-(IC14J-PS_MIO33-PadL16)",
      "unconnected-(IC14K-PS_MIO75-PadA19)",
      "unconnected-(IC14K-PS_MIO76-PadB20)",
      "unconnected-(IC14M-PS_DDR_DQ34-PadP22)",
      "unconnected-(IC14M-PS_DDR_DQ41-PadJ24)",
      "unconnected-(IC14I-PS_MIO18-PadAC19)",
      "/VMEF.A5",
      "/VMEF.DTACK_N_OUT",
      "unconnected-(IC14M-PS_DDR_DQ68-PadP26)",
      "unconnected-(IC14J-PS_MIO51-PadL21)",
      "/fpga/F_P0.TTC_DATA0",
      "unconnected-(IC14M-PS_DDR_CK1-PadY24)",
      "/io_drivers_pp/bank1/OUT2",
      "unconnected-(IC14Q-VREF_64-PadAA7)",
      "/VMEF.IRQ_IN_N6",
      "unconnected-(IC14M-PS_DDR_DQ64-PadT28)",
      "unconnected-(IC14K-PS_MIO55-PadB16)",
      "/VMEF.A18",
      "/io_drivers_pp/bank1/OUT1",
      "unconnected-(IC14M-PS_DDR_DQ35-PadN22)",
      "/fpga/USERIO_A.IO27",
      "unconnected-(IC14M-PS_DDR_DQ60-PadG26)",
      "unconnected-(IC14M-PS_DDR_DQS_N6-PadN27)",
      "/fpga/fpga-hp-banks/F_IOEXP_GPIO_SCLK",
      "/io_drivers_pp/bank1/OUT7",
      "unconnected-(IC14M-PS_DDR_DQS_P7-PadJ26)",
      "/vme_interface/F_HWBYTE.L1_1",
      "/vme_interface/F_HWBYTE.H1_1",
      "unconnected-(IC14J-PS_MIO38-PadH18)",
      "/WR_CLK.PPS",
      "/VMEF.D22",
      "/fpga/USERIO_A.IO3",
      "unconnected-(IC14M-PS_DDR_DQ70-PadP25)",
      "/VMEF.A2",
      "/VMEF.IRQ_IN_N1",
      "/VMEF.A30",
      "/VMEF.D30",
      "/VMEF.A8",
      "unconnected-(IC14M-PS_DDR_DQ66-PadP28)",
      "unconnected-(IC14J-PS_MIO28-PadK15)",
      "/fpga/fpga-hp-banks/F_IOEXP_ALL_OE_N",
      "unconnected-(IC14L-PS_MGTREFCLK3N_505-PadA22)",
      "/VMEF.D31",
      "/VMEF.AS_N_IN",
      "/PS-QSPI.UWR_DQ1",
      "/VMEF.DS_N_OE",
      "/VMEF.IRQ_OUT_N6",
      "/VMEF.D24",
      "/VMEF.IRQ_IN_N2",
      "unconnected-(IC14M-PS_DDR_DQS_P5-PadL23)",
      "/fpga/fpga-config/PS_INIT_B",
      "unconnected-(IC14J-PS_MIO43-PadK19)",
      "unconnected-(IC14I-PS_MIO25-PadAB21)",
      "/PCIE.REFCLK_P",
      "/fpga/fpga-hp-banks/F_IOEXP_VME_SCLK",
      "/VMEF.DTACK_OE",
      "unconnected-(IC14K-PS_MIO64-PadE19)",
      "/VMEF.A31",
      "unconnected-(IC14Q-VREF_66-PadG9)",
      "/PS-QSPI.UWR_DQ2",
      "unconnected-(IC14M-PS_DDR_DM4-PadR23)",
      "/fpga/fpga-hp-banks/F_IOEXP_GPIO_RCLK",
      "/VMEF.A13",
      "/VMEF.A28",
      "/fpga/USERIO_A.IO9",
      "unconnected-(IC14L-PS_MGTRRXP0_505-PadF27)",
      "/io_drivers_pp/bank1/OUT5",
      "/fpga/F_P0.TURNCLK1",
      "/io_drivers_fp/F_IO23",
      "/fpga/fpga-config/PS_ERR_OUT",
      "/VMEF.D0",
      "/fpga/fpga-config/PS_MODE3",
      "unconnected-(IC14J-PS_MIO45-PadK20)",
      "Net-(IC14E-IO_T0U_N12_VRP_64)",
      "/VMEF.D13",
      "unconnected-(IC14K-PS_MIO56-PadC16)",
      "/VMEF.DTACK_N_IN",
      "unconnected-(IC14M-PS_DDR_DQ50-PadL25)",
      "Net-(IC14M-PS_DDR_ZQ)",
      "/VMEF.D_OE_N",
      "unconnected-(IC14L-PS_MGTREFCLK0P_505-PadF23)",
      "unconnected-(IC14M-PS_DDR_BG1-PadV22)",
      "/VMEF.D5",
      "unconnected-(IC14M-PS_DDR_DQ69-PadR25)",
      "unconnected-(IC14M-PS_DDR_DQ49-PadM26)",
      "/io_drivers_fp/F_IO6",
      "/VMEF.D16",
      "Net-(IC14O-MGTRREF_R)",
      "unconnected-(IC14L-PS_MGTRTXN2_505-PadC26)",
      "/fpga/USERIO_A.IO23",
      "/VMEF.IRQ_IN_N5",
      "unconnected-(IC14K-PS_MIO73-PadG21)",
      "unconnected-(IC14M-PS_DDR_DQ54-PadM28)",
      "/VMEF.A27",
      "unconnected-(IC14N-PS_PADO_-PadN18)",
      "/WR_CLK.AUX_P",
      "/VMEF.D15",
      "unconnected-(IC14M-PS_DDR_ODT1-PadU26)",
      "/VMEF.LWORD_N",
      "unconnected-(IC14J-PS_MIO29-PadG16)",
      "/fpga/USERIO_A.IO14",
      "/PS-QSPI.LWR_CSN",
      "/VMEF.DS0_N_IN",
      "unconnected-(IC14I-PS_MIO14-PadAG18)",
      "unconnected-(IC14J-PS_MIO36-PadK17)",
      "/fpga/USERIO_A.IO19",
      "/PS-QSPI.UWR_CLK",
      "unconnected-(IC14J-PS_MIO34-PadL17)",
      "/fpga/F_P0.BUNCHCLK2",
      "/clocks/FPGA-PL_CLKSYS_P",
      "unconnected-(IC14M-PS_DDR_DQ38-PadR24)",
      "/fpga/fpga-config/PS_ERR_STATUS",
      "unconnected-(IC14M-PS_DDR_DQ61-PadG25)",
      "unconnected-(IC14L-PS_MGTRTXP1_505-PadD23)",
      "/io_drivers_fp/F_IO31",
      "unconnected-(IC14M-PS_DDR_CKE1-PadV27)",
      "unconnected-(IC14M-PS_DDR_DQ45-PadH22)",
      "unconnected-(IC14J-PS_MIO42-PadL18)",
      "/fpga/USERIO_A.IO17",
      "unconnected-(IC14L-PS_MGTRTXN1_505-PadD24)",
      "unconnected-(IC14K-PS_MIO71-PadB19)",
      "/VMEF.D19",
      "/VMEF.IACK_N_IN",
      "unconnected-(IC14M-PS_DDR_DQS_P8-PadR27)",
      "unconnected-(IC14J-PS_MIO26-PadL15)",
      "/io_drivers_fp/F_IO21",
      "/fpga/fpga-hp-banks/F_WR_UART_RXD",
      "/fpga/fpga-hp-banks/F_WR_DAC_DIN",
      "/fpga/USERIO_A.IO31",
      "/fpga/PS_POR_B",
      "unconnected-(IC14M-PS_DDR_DM8-PadT26)",
      "/PS-QSPI.LWR_DQ1",
      "/WR_CLK.AUX_N",
      "unconnected-(IC14M-PS_DDR_DQ67-PadP27)",
      "/fpga/fpga-hp-banks/F_IOEXP_FPIO_RCLK",
      "/VMEF.DS1_N_IN",
      "/VMEF.IRQ_OUT_N5",
      "unconnected-(IC14L-PS_MGTREFCLK2P_505-PadC21)",
      "/VMEF.A17",
      "unconnected-(IC14M-PS_DDR_DQS_N4-PadM23)",
      "/VMEF.SYSCLK",
      "/VMEF.D18",
      "unconnected-(IC14I-PS_MIO6-PadAF16)",
      "unconnected-(IC14J-PS_MIO50-PadM19)",
      "/fpga/fpga-hp-banks/F_FP_LED0_DATA",
      "/io_drivers_fp/F_IO25",
      "/fpga/USERIO_A.IO24",
      "unconnected-(IC14L-PS_MGTRTXP0_505-PadE25)",
      "/PS-QSPI.UWR_DQ3",
      "/io_drivers_fp/F_IO24",
      "unconnected-(IC14I-PS_MIO21-PadAC21)",
      "/WR_CLK.ABSCAL",
      "/clocks/FPGA-PS_CLKREF",
      "unconnected-(IC14M-PS_DDR_DQ57-PadK27)",
      "/VMEF.IACK_N_OUT",
      "/io_drivers_fp/F_IO5",
      "unconnected-(IC14M-PS_DDR_DQ56-PadJ28)",
      "unconnected-(IC14K-PS_MIO69-PadD19)",
      "/WR_CLK.SI5340_IRQ_N",
      "/VMEF.IRQ_IN_N7",
      "/VMEF.DS0_N_OUT",
      "/VMEF.A15",
      "/fpga/USERIO_A.IO28",
      "/VMEF.D21",
      "unconnected-(IC14M-PS_DDR_DQ40-PadH24)",
      "/fpga/fpga-hp-banks/F_FP_LED1_DATA",
      "/VMEF.A6",
      "/VMEF.AS_N_OUT",
      "/fpga/USERIO_A.IO22",
      "/VMEF.A20",
      "/VMEF.IRQ_IN_N3",
      "/fpga/USERIO_A.IO21",
      "unconnected-(IC14M-PS_DDR_DQ42-PadM24)",
      "/fpga/fpga-hp-banks/F_IOEXP_ALL_RST_N",
      "unconnected-(IC14J-PS_MIO44-PadJ20)",
      "unconnected-(IC14J-PS_MIO37-PadJ17)",
      "/PS-QSPI.LWR_DQ3",
      "/PS-QSPI.LWR_DQ0",
      "/fpga/fpga-hp-banks/F_WR_DAC_SCLK",
      "unconnected-(IC14I-PS_MIO23-PadAB18)",
      "/VMEF.IACKOUT_N_OUT",
      "/fpga/F_P0.TURNCLK2",
      "/VMEF.D12",
      "/PS-QSPI.LWR_CLK",
      "unconnected-(IC14K-PS_MIO58-PadF18)",
      "/fpga/fpga-hp-banks/F_IOEXP_GPIO_Q",
      "unconnected-(IC14L-PS_MGTRTXP2_505-PadC25)",
      "unconnected-(IC14M-PS_DDR_DQS_P6-PadN26)",
      "/VMEF.DS1_N_OUT",
      "unconnected-(IC14J-PS_MIO40-PadK18)",
      "unconnected-(IC14M-PS_DDR_DQS_N5-PadK23)",
      "/VMEF.D2",
      "/VMEF.D29",
      "unconnected-(IC14K-PS_MIO68-PadC18)",
      "/VMEF.IRQ_OUT_N1",
      "unconnected-(IC14M-PS_DDR_DQ44-PadJ22)",
      "/VMEF.D20",
      "unconnected-(IC14L-PS_MGTRRXN2_505-PadB28)",
      "unconnected-(IC14M-PS_DDR_DQ37-PadP24)",
      "unconnected-(IC14J-PS_MIO35-PadH17)",
      "/VMEF.A14",
      "/fpga/USERIO_A.IO10",
      "/VMEF.D4",
      "/fpga/USERIO_A.IO26",
      "/VMEF.D28",
      "unconnected-(IC14L-PS_MGTREFCLK3P_505-PadA21)",
      "/VMEF.A22",
      "unconnected-(IC14M-PS_DDR_DQ32-PadT22)",
      "unconnected-(IC14L-PS_MGTRRXN1_505-PadD28)",
      "unconnected-(IC14L-PS_MGTRTXN0_505-PadE26)",
      "/VMEF.D10",
      "/io_drivers_fp/F_IO4",
      "/fpga/fpga-hp-banks/F_WR_UART_TXD",
      "unconnected-(IC14L-PS_MGTREFCLK1N_505-PadE22)",
      "/VMEF.A1",
      "unconnected-(IC14M-PS_DDR_DQS_N7-PadJ27)",
      "unconnected-(IC14L-PS_MGTRRXP2_505-PadB27)",
      "unconnected-(IC14M-PS_DDR_DQ52-PadK28)",
      "unconnected-(IC14M-PS_DDR_DM6-PadL27)",
      "/VMEF.D25",
      "/io_drivers_fp/F_IO1",
      "unconnected-(IC14M-PS_DDR_DQ33-PadR22)",
      "unconnected-(IC14L-PS_MGTREFCLK2N_505-PadC22)",
      "unconnected-(IC14I-PS_MIO16-PadAF18)",
      "/fpga/USERIO_A.IO13",
      "/VMEF.A10",
      "unconnected-(IC14M-PS_DDR_DQS_P4-PadN23)",
      "unconnected-(IC14K-PS_MIO72-PadG20)",
      "unconnected-(IC14K-PS_MIO60-PadC17)",
      "unconnected-(IC14K-PS_MIO77-PadF20)",
      "unconnected-(IC14K-PS_MIO63-PadE18)",
      "/VMEF.A16",
      "/fpga/USERIO_A.IO18",
      "unconnected-(IC14K-PS_MIO67-PadB18)",
      "unconnected-(IC14L-PS_MGTREFCLK0N_505-PadF24)",
      "/fpga/USERIO_A.IO29",
      "/VMEF.IRQ_OUT_N2",
      "/VMEF.A19",
      "/WR_CLK.RSTN",
      "unconnected-(IC14K-PS_MIO66-PadG19)",
      "/fpga/USERIO_A.IO0",
      "/fpga/fpga-hp-banks/F_WR_DAC_SYNC",
      "/fpga/fpga-hp-banks/F_IOEXP_FPIO_SCLK",
      "unconnected-(IC14K-PS_MIO70-PadC19)",
      "unconnected-(IC14J-PS_MIO41-PadJ19)",
      "/fpga/fpga-hp-banks/F_IOEXP_GPIO_D",
      "unconnected-(IC14L-PS_MGTRRXP1_505-PadD27)",
      "/PS-QSPI.LWR_DQ2",
      "unconnected-(IC14M-PS_DDR_DQ36-PadT23)",
      "unconnected-(IC14M-PS_DDR_DQ63-PadJ25)",
      "/VMEF.A23",
      "/VMEF.D17",
      "/fpga/USERIO_A.IO11",
      "/WRFLASH_I2C.SCL",
      "unconnected-(IC14L-PS_MGTRRXN0_505-PadF28)",
      "/VMEF.D_DIR",
      "/VMEF.WRITE_N_DIR",
      "unconnected-(IC14J-PS_MIO49-PadM18)",
      "/io_drivers_fp/F_IO30",
      "unconnected-(IC14J-PS_MIO32-PadJ16)",
      "/WR_CLK.HELPER_N",
      "unconnected-(IC14M-PS_DDR_DQ55-PadN28)",
      "unconnected-(IC14K-PS_MIO61-PadD17)",
      "unconnected-(IC14M-PS_DDR_DQ43-PadK24)",
      "unconnected-(IC14J-PS_MIO39-PadH19)",
      "/fpga/USERIO_A.IO8",
      "/VMEF.D11",
      "/VMEF.IRQ_OUT_N7",
      "/VMEF.A26",
      "/VMEF.A3",
      "/VMEF.A11",
      "unconnected-(IC14M-PS_DDR_DQ47-PadL22)",
      "unconnected-(IC14M-PS_DDR_DQ48-PadM25)",
      "/io_drivers_fp/F_IO2",
      "/VMEF.A4",
      "unconnected-(IC14M-PS_DDR_DM5-PadH23)",
      "/PS-QSPI.UWR_DQ0",
      "/fpga/F_P0.BUNCHCLK1",
      "/io_drivers_fp/F_IO7",
      "/VMEF.IACKIN_N_IN",
      "/VMEF.IACK_OE_N",
      "/io_drivers_fp/F_IO22",
      "/fpga/fpga-hp-banks/F_PERST_N",
      "/io_drivers_fp/F_IO0",
      "unconnected-(IC14I-PS_MIO15-PadAE18)",
      "unconnected-(IC14K-PS_MIO74-PadD20)",
      "unconnected-(IC14K-PS_MIO62-PadA17)",
      "/VMEF.A24",
      "unconnected-(IC14K-PS_MIO54-PadF17)",
      "unconnected-(IC14I-PS_MIO24-PadAB19)",
      "/fpga/fpga-config/PS_DONE",
      "/fpga/fpga-hp-banks/F_IOEXP_FPIO_D",
      "/fpga/USERIO_A.IO2",
      "/fpga/F_P0.TTC_DATA1",
      "/io_drivers_fp/F_IO16",
      "unconnected-(IC14I-PS_MIO13-PadAH18)",
      "/fpga/USERIO_A.IO6",
      "/VMEF.A25",
      "unconnected-(IC14M-PS_DDR_DQ39-PadN24)",
      "unconnected-(IC14M-PS_DDR_DQ53-PadL28)",
      "unconnected-(IC14I-PS_MIO19-PadAE19)",
      "/VMEF.WRITE_N",
      "/VMEF.A7",
      "/fpga/USERIO_A.IO15",
      "unconnected-(IC14J-PS_MIO48-PadJ21)",
      "unconnected-(IC14L-PS_MGTRRXP3_505-PadA25)",
      "/PCIE.REFCLK_N",
      "/clocks/FPGA-PL_CLKSYS_N",
      "/WRFLASH_I2C.SDA",
      "unconnected-(IC14M-PS_DDR_DQ71-PadT25)",
      "unconnected-(IC14J-PS_MIO27-PadJ15)",
      "/io_drivers_fp/F_IO27",
      "/fpga/fpga-config/PS_MODE0",
      "Net-(IC14G-IO_T0U_N12_VRP_66)",
      "/VMEF.IRQ_IN_N4",
      "unconnected-(IC14I-PS_MIO17-PadAC18)",
      "unconnected-(IC14M-PS_DDR_DQ51-PadL26)",
      "/VMEF.A29",
      "/VMEF.D3",
      "/VMEF.D27",
      "/fpga/USERIO_A.IO30",
      "/VMEF.A21",
      "unconnected-(IC14I-PS_MIO20-PadAD19)",
      "unconnected-(IC14L-PS_MGTRRXN3_505-PadA26)",
      "/vme_interface/TTL_BUNCHCLK1",
      "/vme_interface/TTL_BUNCHCLK2",
      "/fpga/USERIO_A.OE_N3",
      "/fpga/USERIO_A.OE_N2",
      "unconnected-(IC18-~{LOL}-Pad27)",
      "unconnected-(IC18-NC-Pad22)",
      "unconnected-(IC18-~{OUT1}-Pad24)",
      "unconnected-(IC18-~{IN2}-Pad11)",
      "unconnected-(IC18-FB_IN-Pad41)",
      "unconnected-(IC18-~{INTR}-Pad33)",
      "/WR_CLK.SPI_MOSI",
      "unconnected-(IC18-OUT3-Pad36)",
      "unconnected-(IC18-X2-Pad7)",
      "unconnected-(IC18-~{IN0}-Pad44)",
      "/WR_CLK.SPI_HELPER_CS_N",
      "unconnected-(IC18-IN1-Pad1)",
      "unconnected-(IC18-OUT1-Pad25)",
      "unconnected-(IC18-~{IN1}-Pad2)",
      "unconnected-(IC18-IN0-Pad43)",
      "unconnected-(IC18-~{FB_IN}-Pad42)",
      "unconnected-(IC18-~{OUT3}-Pad35)",
      "unconnected-(IC18-~{OUT2}-Pad30)",
      "unconnected-(IC18-OUT2-Pad31)",
      "unconnected-(IC18-~{OE}-Pad12)",
      "unconnected-(IC18-X1-Pad4)",
      "unconnected-(IC18-IN2-Pad10)",
      "/WR_CLK.SPI_MISO",
      "unconnected-(IC18-~{LOS_XAXB}-Pad28)",
      "/WR_CLK.SPI_SCK",
      "unconnected-(IC19-~{RESET}-Pad3)",
      "unconnected-(IC19-DNU-Pad11)",
      "unconnected-(IC19-DNU-Pad14)",
      "unconnected-(IC19-DNU-Pad4)",
      "unconnected-(IC19-DNU-Pad13)",
      "unconnected-(IC19-DNU-Pad12)",
      "unconnected-(IC19-DNU-Pad5)",
      "unconnected-(IC19-DNU-Pad6)",
      "Net-(IC20A-1Y)",
      "Net-(IC20B-2Y)",
      "unconnected-(IC21-DNU-Pad5)",
      "unconnected-(IC21-DNU-Pad11)",
      "unconnected-(IC21-DNU-Pad13)",
      "unconnected-(IC21-~{RESET}-Pad3)",
      "unconnected-(IC21-DNU-Pad12)",
      "unconnected-(IC21-DNU-Pad14)",
      "unconnected-(IC21-DNU-Pad6)",
      "unconnected-(IC21-DNU-Pad4)",
      "unconnected-(IC22-SS-Pad7)",
      "unconnected-(IC22-PG-Pad3)",
      "Net-(IC22-FB)",
      "/power-supply-3/5VPG",
      "Net-(IC23-4Y)",
      "Net-(IC23-2Y)",
      "Net-(IC23-1Y)",
      "/io_drivers_fp/F_IO17",
      "/io_drivers_fp/F_IO3",
      "Net-(IC23-3Y)",
      "/fpga/F_P0.RS485_DATA0",
      "/fpga/F_P0.RS485_DATA1",
      "/VMEF.SYSCLK_DIR",
      "Net-(IC29-SW-Pad10)",
      "unconnected-(IC29-TMON{slash}FLT-Pad1)",
      "unconnected-(IC29-IMON-Pad25)",
      "unconnected-(IC29-IMONREF-Pad24)",
      "Net-(IC29-GL-Pad27)",
      "unconnected-(IC29-NC-Pad3)",
      "unconnected-(IC30-PHASE_B-Pad34)",
      "unconnected-(IC30-PG_A-Pad26)",
      "Net-(IC30-PWM_A)",
      "unconnected-(IC30-PHASE_A-Pad36)",
      "unconnected-(IC30-PG_C-Pad27)",
      "/power-supply-1/P1V8AUX_PG",
      "unconnected-(IC30-PG_B-Pad30)",
      "Net-(IC30-EN_A)",
      "unconnected-(IC30-FB_B-Pad31)",
      "unconnected-(IC30-BOOT_A-Pad38)",
      "unconnected-(IC30-~{ALERT}-Pad17)",
      "unconnected-(IC30-PG_L-Pad25)",
      "unconnected-(IC30-BOOT_B-Pad33)",
      "Net-(IC30-FB__L)",
      "unconnected-(IC31-PG_D-Pad16)",
      "unconnected-(IC31-PG_C-Pad27)",
      "unconnected-(IC31-PWM_A-Pad43)",
      "unconnected-(IC31-PG_B-Pad30)",
      "unconnected-(IC31-PG_L-Pad25)",
      "unconnected-(IC31-PG_A-Pad26)",
      "unconnected-(IC31-~{ALERT}-Pad17)",
      "Net-(IC31-FB__L)",
      "Net-(IC32-SW)",
      "Net-(IC32-FB)",
      "unconnected-(IC37-2Y-Pad6)",
      "GNDA",
      "unconnected-(IC40-OCP_SEL-Pad4)",
      "unconnected-(IC40-SS{slash}TR-Pad28)",
      "Net-(IC40-PH-Pad10)",
      "unconnected-(IC40-SYNC_OUT-Pad7)",
      "unconnected-(IC40-DNC-Pad5)",
      "unconnected-(IC40-ISHARE-Pad25)",
      "unconnected-(IC40-ILIM-Pad6)",
      "unconnected-(IC40-DNC-Pad9)",
      "Net-(IC40-RT{slash}CLK)",
      "unconnected-(IC40-PWRGD-Pad8)",
      "Net-(IC40-VADJ)",
      "unconnected-(IC40-INH{slash}UVLO-Pad30)",
      "unconnected-(IC40-DNC-Pad24)",
      "/fpga/USERIO_A.OE_N0",
      "/fpga/USERIO_A.OE_N1",
      "Net-(IC44-1Y)",
      "Net-(IC44-4Y)",
      "Net-(IC44-3Y)",
      "/io_drivers_fp/F_IO26",
      "/io_drivers_fp/F_IO19",
      "Net-(IC44-2Y)",
      "/IOEXP.VME_D",
      "unconnected-(IC48-QF-Pad5)",
      "/vme_interface/F_HWBYTE.H2_1",
      "/slow_gpio/GPIO_OUT5",
      "/SFP0_TXDIS",
      "/slow_gpio/GPIO_OUT7",
      "/SFP1_TXDIS",
      "/IOEXP.GPIO_SCLK",
      "/PP_OE_N",
      "/SFP0_MODABS",
      "unconnected-(IC51-QH'-Pad9)",
      "Net-(IC51-SER)",
      "/SFP1_MODABS",
      "/slow_gpio/GPIO_OUT6",
      "/IOEXP.GPIO_RCLK",
      "/SWITCH1_N",
      "/SWITCH0_N",
      "/SFP1_RSSI",
      "Net-(IC52-QH)",
      "/SFP0_RSSI",
      "/io_drivers_fp/F_IO29",
      "Net-(IC53-2Y)",
      "Net-(IC53-4Y)",
      "/io_drivers_fp/F_IO18",
      "Net-(IC53-1Y)",
      "Net-(IC53-3Y)",
      "Net-(IC55-SER)",
      "/IOEXP.GPIO_Q",
      "/PP_ID0",
      "/FP_ID2",
      "/FP_ID1",
      "/FP_ID0",
      "/PP_ID1",
      "/PP_ID2",
      "Net-(IC59-2B3)",
      "Net-(IC59-2B4)",
      "Net-(IC59-1B6)",
      "Net-(IC59-1B8)",
      "Net-(IC59-1B2)",
      "Net-(IC59-2B6)",
      "Net-(IC59-1B5)",
      "Net-(IC59-2B5)",
      "Net-(IC59-1B1)",
      "Net-(IC59-1B4)",
      "Net-(IC59-1B3)",
      "Net-(IC59-2B2)",
      "Net-(IC59-1B7)",
      "Net-(IC59-2B7)",
      "/vme_interface/F_HWBYTE.L2_1",
      "Net-(IC59-2B8)",
      "Net-(IC59-2B1)",
      "unconnected-(IC60-X1-Pad4)",
      "unconnected-(IC60-~{OE}-Pad12)",
      "unconnected-(IC60-IN2-Pad10)",
      "unconnected-(IC60-~{LOS_XAXB}-Pad28)",
      "unconnected-(IC60-~{IN0}-Pad44)",
      "unconnected-(IC60-FB_IN-Pad41)",
      "/WR_CLK.SPI_MAIN_CS_N",
      "unconnected-(IC60-~{FB_IN}-Pad42)",
      "unconnected-(IC60-IN1-Pad1)",
      "unconnected-(IC60-~{IN2}-Pad11)",
      "unconnected-(IC60-~{IN1}-Pad2)",
      "unconnected-(IC60-~{LOL}-Pad27)",
      "unconnected-(IC60-IN0-Pad43)",
      "unconnected-(IC60-X2-Pad7)",
      "unconnected-(IC60-NC-Pad22)",
      "/io_drivers_fp/F_IO28",
      "/io_drivers_fp/F_IO20",
      "/io_drivers_fp/bank0/EN1",
      "/io_drivers_fp/bank0/OUT0",
      "/io_drivers_fp/bank0/EN0",
      "/io_drivers_fp/bank0/OUT1",
      "/io_drivers_fp/bank0/OUT3",
      "/io_drivers_fp/bank0/EN3",
      "/io_drivers_fp/bank0/OUT2",
      "/io_drivers_fp/bank0/EN2",
      "/io_drivers_fp/bank0/EN4",
      "/io_drivers_fp/bank0/EN5",
      "/io_drivers_fp/bank0/OUT4",
      "/io_drivers_fp/bank0/OUT5",
      "/io_drivers_pp/bank0/OUT5",
      "/io_drivers_pp/bank0/OUT2",
      "Net-(IC62-3Y)",
      "Net-(IC62-4Y)",
      "Net-(IC62-1Y)",
      "Net-(IC62-2Y)",
      "/vme_interface/LVDS_BUNCHCLK1_N",
      "/vme_interface/LVDS_BUNCHCLK2_P",
      "/vme_interface/LVDS_BUNCHCLK1_P",
      "/vme_interface/LVDS_BUNCHCLK2_N",
      "Net-(IC69-2Y)",
      "Net-(IC69-1Y)",
      "Net-(IC69-3Y)",
      "Net-(IC69-4Y)",
      "Net-(IC72-3Y)",
      "Net-(IC72-4Y)",
      "Net-(IC72-1Y)",
      "Net-(IC72-2Y)",
      "/io_drivers_pp/bank0/OUT3",
      "Net-(IC76-QH')",
      "/io_drivers_pp/bank0/OUT6",
      "/io_drivers_pp/bank0/OUT4",
      "/io_drivers_pp/bank0/OUT7",
      "/io_drivers_pp/bank0/OUT1",
      "Net-(IC78-3Y)",
      "Net-(IC78-4Y)",
      "Net-(IC78-1Y)",
      "Net-(IC78-2Y)",
      "Net-(IC81-2Y)",
      "Net-(IC81-3Y)",
      "Net-(IC81-1Y)",
      "Net-(IC81-4Y)",
      "Net-(IC84-1Y)",
      "Net-(IC84-4Y)",
      "Net-(IC84-3Y)",
      "Net-(IC84-2Y)",
      "/io_drivers_pp/bank0/OUT0",
      "/io_drivers_fp/bank0/EN6",
      "/io_drivers_fp/bank0/OUT7",
      "/io_drivers_fp/bank0/OUT6",
      "/io_drivers_fp/bank0/EN7",
      "/io_drivers_fp/I_IOEXP_SCLK",
      "Net-(IC88-QH')",
      "/io_drivers_fp/bank0/TERM_EN3",
      "/io_drivers_fp/bank0/TERM_EN1",
      "/io_drivers_fp/bank0/TERM_EN0",
      "/io_drivers_fp/bank0/TERM_EN2",
      "/io_drivers_fp/bank0/TERM_EN7",
      "/io_drivers_fp/bank0/TERM_EN4",
      "/io_drivers_fp/bank0/TERM_EN6",
      "/io_drivers_fp/bank0/TERM_EN5",
      "/io_drivers_fp/bank2/OUT6",
      "Net-(IC90-4Y)",
      "Net-(IC90-3Y)",
      "Net-(IC90-2Y)",
      "Net-(IC90-1Y)",
      "Net-(IC93-1Y)",
      "Net-(IC93-3Y)",
      "Net-(IC93-2Y)",
      "Net-(IC93-4Y)",
      "Net-(IC96-4Y)",
      "Net-(IC96-1Y)",
      "Net-(IC96-3Y)",
      "Net-(IC96-2Y)",
      "Net-(IC99-3Y)",
      "Net-(IC99-2Y)",
      "Net-(IC99-1Y)",
      "Net-(IC99-4Y)",
      "/io_drivers_fp/bank2/OUT7",
      "/io_drivers_fp/bank2/OUT0",
      "/io_drivers_fp/bank2/OUT2",
      "/io_drivers_fp/bank2/OUT1",
      "/io_drivers_fp/bank2/OUT4",
      "/io_drivers_fp/bank2/OUT5",
      "/io_drivers_fp/bank2/OUT3",
      "/io_drivers_fp/bank2/TERM_EN1",
      "/io_drivers_fp/bank2/TERM_EN0",
      "/io_drivers_fp/bank2/EN1",
      "/io_drivers_fp/bank2/EN0",
      "Net-(IC103-QH')",
      "/io_drivers_fp/bank2/EN2",
      "/io_drivers_fp/bank2/EN3",
      "/io_drivers_fp/bank2/TERM_EN2",
      "/io_drivers_fp/bank2/TERM_EN3",
      "/io_drivers_fp/bank2/EN6",
      "/io_drivers_fp/bank2/TERM_EN7",
      "Net-(IC105-4Y)",
      "Net-(IC105-3Y)",
      "Net-(IC105-2Y)",
      "Net-(IC105-1Y)",
      "unconnected-(IC107-B8-Pad14)",
      "Net-(IC109-B8)",
      "Net-(IC109-B7)",
      "Net-(IC109-B5)",
      "Net-(IC109-B6)",
      "/IOEXP.GPIO_D",
      "/IOEXP.FPIO_D",
      "/PCIE.PERST_N",
      "unconnected-(IC110-A8-Pad10)",
      "unconnected-(IC110-A5-Pad7)",
      "unconnected-(IC110-A4-Pad6)",
      "unconnected-(IC110-A6-Pad8)",
      "Net-(IC112-1Y)",
      "Net-(IC112-2Y)",
      "Net-(IC112-4Y)",
      "Net-(IC112-3Y)",
      "Net-(IC115-4Y)",
      "Net-(IC115-3Y)",
      "Net-(IC115-1Y)",
      "Net-(IC115-2Y)",
      "Net-(IC118-3Y)",
      "Net-(IC118-4Y)",
      "Net-(IC118-1Y)",
      "Net-(IC118-2Y)",
      "Net-(IC123-2B5)",
      "Net-(IC123-1B2)",
      "Net-(IC123-1B7)",
      "Net-(IC123-2B6)",
      "Net-(IC123-1B8)",
      "Net-(IC123-2B2)",
      "Net-(IC123-2B3)",
      "Net-(IC123-1B5)",
      "Net-(IC123-2B1)",
      "Net-(IC123-1B3)",
      "Net-(IC123-2B8)",
      "Net-(IC123-2B7)",
      "Net-(IC123-1B6)",
      "Net-(IC123-1B4)",
      "Net-(IC123-1B1)",
      "Net-(IC123-2B4)",
      "Net-(IC124-4Y)",
      "Net-(IC124-1Y)",
      "Net-(IC124-3Y)",
      "Net-(IC124-2Y)",
      "Net-(IC125-4Y)",
      "Net-(IC125-3Y)",
      "Net-(IC125-1Y)",
      "Net-(IC125-2Y)",
      "Net-(IC126-2Y)",
      "Net-(IC126-4Y)",
      "Net-(IC126-3Y)",
      "Net-(IC126-1Y)",
      "Net-(IC127-3Y)",
      "Net-(IC127-1Y)",
      "Net-(IC127-2Y)",
      "Net-(IC127-4Y)",
      "Net-(IC128-1Y)",
      "Net-(IC128-3Y)",
      "Net-(IC128-2Y)",
      "Net-(IC128-4Y)",
      "Net-(IC129-3Y)",
      "Net-(IC129-2Y)",
      "Net-(IC129-1Y)",
      "Net-(IC129-4Y)",
      "Net-(IC130-3Y)",
      "Net-(IC130-2Y)",
      "Net-(IC130-1Y)",
      "Net-(IC130-4Y)",
      "/io_drivers_fp/bank2/EN7",
      "/io_drivers_fp/bank2/EN5",
      "/io_drivers_fp/bank2/TERM_EN5",
      "/io_drivers_fp/bank2/TERM_EN6",
      "/io_drivers_fp/bank2/EN4",
      "/io_drivers_fp/bank2/TERM_EN4",
      "/io_drivers_fp/bank3/IOEXP_D",
      "/io_drivers_fp/bank3/OUT2",
      "/io_drivers_fp/bank3/OUT6",
      "/io_drivers_fp/bank3/OUT4",
      "/io_drivers_fp/bank3/OUT3",
      "/io_drivers_fp/bank3/OUT1",
      "/io_drivers_fp/bank3/OUT5",
      "/io_drivers_fp/bank3/OUT0",
      "/io_drivers_fp/bank3/OUT7",
      "/io_drivers_fp/bank3/TERM_EN2",
      "Net-(IC132-1Y)",
      "Net-(IC132-2Y)",
      "Net-(IC132-3Y)",
      "Net-(IC132-4Y)",
      "Net-(IC133-1Y)",
      "Net-(IC133-3Y)",
      "Net-(IC133-4Y)",
      "Net-(IC133-2Y)",
      "Net-(IC134-3Y)",
      "Net-(IC134-2Y)",
      "Net-(IC134-1Y)",
      "Net-(IC134-4Y)",
      "Net-(IC135-3Y)",
      "Net-(IC135-2Y)",
      "Net-(IC135-1Y)",
      "Net-(IC135-4Y)",
      "/io_drivers_fp/bank3/TERM_EN1",
      "/io_drivers_fp/bank3/EN0",
      "/io_drivers_fp/bank3/TERM_EN0",
      "/io_drivers_fp/bank3/EN2",
      "/io_drivers_fp/bank3/TERM_EN3",
      "/io_drivers_fp/bank3/EN3",
      "/io_drivers_fp/bank3/EN1",
      "/io_drivers_fp/bank3/TERM_EN5",
      "/io_drivers_fp/bank3/TERM_EN6",
      "/io_drivers_fp/bank3/EN4",
      "/io_drivers_fp/bank3/IOEXP_Q",
      "/io_drivers_fp/bank3/EN6",
      "/io_drivers_fp/bank3/EN7",
      "/io_drivers_fp/bank3/EN5",
      "/io_drivers_fp/bank3/TERM_EN7",
      "/io_drivers_fp/bank3/TERM_EN4",
      "Net-(IC137-3Y)",
      "Net-(IC137-4Y)",
      "Net-(IC137-2Y)",
      "Net-(IC137-1Y)",
      "Net-(IC138-2Y)",
      "Net-(IC138-1Y)",
      "Net-(IC138-3Y)",
      "Net-(IC138-4Y)",
      "Net-(IC139-4Y)",
      "Net-(IC139-2Y)",
      "Net-(IC139-1Y)",
      "Net-(IC139-3Y)",
      "Net-(IC140-3Y)",
      "Net-(IC140-4Y)",
      "Net-(IC140-2Y)",
      "Net-(IC140-1Y)",
      "/SFP1_SDA",
      "/SFP1_SCL",
      "unconnected-(J1-TX_FAULT-Pad2)",
      "Net-(J1-RS1)",
      "Net-(J1-RS0)",
      "unconnected-(J2-ID-Pad4)",
      "Net-(J4-Pad1)",
      "Net-(J5-RS1)",
      "unconnected-(J5-TX_FAULT-Pad2)",
      "Net-(J5-RS0)",
      "/SFP0_SCL",
      "/SFP0_SDA",
      "/PP_LED1_DATA",
      "/PP_LED0_DATA",
      "unconnected-(J7-Pad12)",
      "Net-(J8-Pad1)",
      "unconnected-(J13A-a8-PadA8)",
      "unconnected-(J13B-b6-PadB6)",
      "unconnected-(J13B-b2-PadB2)",
      "unconnected-(J13C-c9-PadC9)",
      "unconnected-(J13D-d2-PadD2)",
      "unconnected-(J13B-b1-PadB1)",
      "unconnected-(J13D-d8-PadD8)",
      "unconnected-(J13C-c5-PadC5)",
      "unconnected-(J13C-c3-PadC3)",
      "unconnected-(J13C-c2-PadC2)",
      "unconnected-(J13C-c4-PadC4)",
      "unconnected-(J13A-a4-PadA4)",
      "unconnected-(J13D-d9-PadD9)",
      "unconnected-(J13D-d3-PadD3)",
      "unconnected-(J13B-b8-PadB8)",
      "unconnected-(J13D-d1-PadD1)",
      "unconnected-(J13C-c7-PadC7)",
      "unconnected-(J13A-a3-PadA3)",
      "unconnected-(J13B-b7-PadB7)",
      "unconnected-(J13D-d6-PadD6)",
      "unconnected-(J13B-b9-PadB9)",
      "unconnected-(J13C-c8-PadC8)",
      "unconnected-(J13A-a5-PadA5)",
      "unconnected-(J13A-a9-PadA9)",
      "unconnected-(J13D-d7-PadD7)",
      "unconnected-(J13C-c6-PadC6)",
      "unconnected-(J13B-b3-PadB3)",
      "unconnected-(J13A-a6-PadA6)",
      "unconnected-(J13A-a7-PadA7)",
      "/SFP_LED_DATA",
      "/FP_LED1_DATA",
      "/FP_LED0_DATA",
      "Net-(LD3-A)",
      "Net-(LD1-C)",
      "Net-(LD1-A)",
      "Net-(LD2-A)",
      "Net-(OSC1-OUT)",
      "unconnected-(OSC3-NC-Pad5)",
      "Net-(OSC4-OUT)",
      "Net-(PB1-Pad2)",
      "Net-(T40-D)",
      "Net-(IC14P-PUDC_B)",
      "/WR_CLK.25M_HELPER",
      "Net-(T41-D)",
      "Net-(T42-D)",
      "Net-(R165-Pad2)",
      "Net-(T43-D)",
      "Net-(T44-D)",
      "Net-(T45-D)",
      "Net-(T46-D)",
      "Net-(T47-D)",
      "Net-(T48-D)",
      "Net-(T49-D)",
      "Net-(T50-D)",
      "Net-(T51-D)",
      "Net-(T52-D)",
      "Net-(T53-D)",
      "Net-(T54-D)",
      "Net-(T55-D)",
      "Net-(T5-D)",
      "Net-(T7-D)",
      "Net-(T9-D)",
      "Net-(T11-D)",
      "Net-(T13-D)",
      "Net-(T15-D)",
      "Net-(T19-D)",
      "Net-(T21-D)",
      "Net-(T23-D)",
      "Net-(T25-D)",
      "Net-(T27-D)",
      "Net-(T29-D)",
      "Net-(T31-D)",
      "Net-(T35-D)",
      "Net-(T37-D)",
      "Net-(T39-D)",
      "unconnected-(TR1-SCT-Pad5)",
      "unconnected-(TR1-NC-Pad2)",
      "unconnected-(TR2-NC-Pad2)",
      "unconnected-(TR2-SCT-Pad5)",
      "unconnected-(TR3-SCT-Pad5)",
      "unconnected-(TR3-NC-Pad2)",
      "P3V3_VME",
      "unconnected-(P1E-d25-PadD25)",
      "unconnected-(P1E-d4-PadD4)",
      "unconnected-(P1E-d29-PadD29)",
      "unconnected-(P1A-z21-PadZ21)",
      "unconnected-(P1A-z19-PadZ19)",
      "unconnected-(P1E-d32-PadD32)",
      "unconnected-(P1E-d1-PadD1)",
      "unconnected-(P1E-d23-PadD23)",
      "unconnected-(P1E-d21-PadD21)",
      "unconnected-(P1E-d6-PadD6)",
      "P5V_STDBY_VME",
      "unconnected-(P1A-z17-PadZ17)",
      "unconnected-(P1A-z23-PadZ23)",
      "M12V_VME",
      "unconnected-(P1A-z11-PadZ11)",
      "unconnected-(P1E-d19-PadD19)",
      "unconnected-(P1A-z13-PadZ13)",
      "unconnected-(P1A-z27-PadZ27)",
      "unconnected-(P1E-d3-PadD3)",
      "unconnected-(P1E-d8-PadD8)",
      "unconnected-(P1E-d27-PadD27)",
      "unconnected-(P1A-z31-PadZ31)",
      "unconnected-(P1A-z29-PadZ29)",
      "unconnected-(P1E-d7-PadD7)",
      "/vme_interface/I_HWBYTE1_D",
      "unconnected-(P1A-z15-PadZ15)",
      "unconnected-(P1E-d5-PadD5)",
      "unconnected-(P1A-z25-PadZ25)",
      "/vme_interface/I_HWBYTE1_Q",
      "unconnected-(P2D-c27-PadC27)",
      "unconnected-(P2D-c15-PadC15)",
      "unconnected-(P2A-z19-PadZ19)",
      "unconnected-(P2D-c11-PadC11)",
      "unconnected-(P2A-z5-PadZ5)",
      "unconnected-(P2D-c19-PadC19)",
      "unconnected-(P2E-d9-PadD9)",
      "unconnected-(P2D-c23-PadC23)",
      "unconnected-(P2E-d1-PadD1)",
      "unconnected-(P2E-d20-PadD20)",
      "unconnected-(P2D-c8-PadC8)",
      "unconnected-(P2A-z11-PadZ11)",
      "unconnected-(P2D-c28-PadC28)",
      "unconnected-(P2A-z1-PadZ1)",
      "unconnected-(P2E-d14-PadD14)",
      "unconnected-(P2D-c5-PadC5)",
      "unconnected-(P2E-d18-PadD18)",
      "unconnected-(P2A-z27-PadZ27)",
      "unconnected-(P2D-c13-PadC13)",
      "unconnected-(P2D-c21-PadC21)",
      "unconnected-(P2E-d13-PadD13)",
      "unconnected-(P2D-c6-PadC6)",
      "unconnected-(P2D-c18-PadC18)",
      "unconnected-(P2E-d23-PadD23)",
      "unconnected-(P2E-d3-PadD3)",
      "unconnected-(P2A-z3-PadZ3)",
      "unconnected-(P2D-c20-PadC20)",
      "unconnected-(P2D-c31-PadC31)",
      "unconnected-(P2E-d11-PadD11)",
      "unconnected-(P2D-c22-PadC22)",
      "unconnected-(P2A-z9-PadZ9)",
      "unconnected-(P2D-c29-PadC29)",
      "unconnected-(P2A-z23-PadZ23)",
      "unconnected-(P2D-c30-PadC30)",
      "unconnected-(P2E-d4-PadD4)",
      "unconnected-(P2E-d21-PadD21)",
      "unconnected-(P2A-z21-PadZ21)",
      "unconnected-(P2E-d2-PadD2)",
      "unconnected-(P2D-c10-PadC10)",
      "unconnected-(P2D-c14-PadC14)",
      "unconnected-(P2A-z13-PadZ13)",
      "unconnected-(P2A-z15-PadZ15)",
      "unconnected-(P2E-d24-PadD24)",
      "unconnected-(P2E-d12-PadD12)",
      "unconnected-(P2A-z17-PadZ17)",
      "unconnected-(P2E-d7-PadD7)",
      "unconnected-(P2D-c25-PadC25)",
      "unconnected-(P2D-c17-PadC17)",
      "unconnected-(P2A-z31-PadZ31)",
      "unconnected-(P2E-d17-PadD17)",
      "unconnected-(P2E-d5-PadD5)",
      "unconnected-(P2A-z29-PadZ29)",
      "unconnected-(P2E-d6-PadD6)",
      "unconnected-(P2D-c12-PadC12)",
      "unconnected-(P2D-c32-PadC32)",
      "unconnected-(P2D-c7-PadC7)",
      "unconnected-(P2E-d22-PadD22)",
      "unconnected-(P2D-c26-PadC26)",
      "unconnected-(P2D-c16-PadC16)",
      "unconnected-(P2E-d8-PadD8)",
      "unconnected-(P2D-c24-PadC24)",
      "unconnected-(P2A-z25-PadZ25)",
      "unconnected-(P2D-c9-PadC9)",
      "unconnected-(P2E-d15-PadD15)",
      "unconnected-(P2E-d10-PadD10)",
      "unconnected-(P2E-d16-PadD16)",
      "unconnected-(P2A-z7-PadZ7)",
      "unconnected-(P2E-d32-PadD32)",
      "unconnected-(P2E-d19-PadD19)",
      "unconnected-(J15C-15-PadC15)",
      "unconnected-(J15A-10-PadA10)",
      "unconnected-(J15C-3-PadC3)",
      "unconnected-(J15A-9-PadA9)",
      "unconnected-(J15E-9-PadE9)",
      "unconnected-(J15D-4-PadD4)",
      "unconnected-(J15A-11-PadA11)",
      "unconnected-(J15E-11-PadE11)",
      "unconnected-(J15B-11-PadB11)",
      "unconnected-(J15E-10-PadE10)",
      "unconnected-(J15C-13-PadC13)",
      "unconnected-(J15C-19-PadC19)",
      "unconnected-(J15C-14-PadC14)",
      "unconnected-(J15D-8-PadD8)",
      "unconnected-(J15D-11-PadD11)",
      "unconnected-(J15D-3-PadD3)",
      "unconnected-(J15A-5-PadA5)",
      "unconnected-(J15C-18-PadC18)",
      "unconnected-(J15C-7-PadC7)",
      "unconnected-(J15C-17-PadC17)",
      "unconnected-(J15B-10-PadB10)",
      "unconnected-(J15C-12-PadC12)",
      "unconnected-(J15D-5-PadD5)",
      "unconnected-(J15C-5-PadC5)",
      "unconnected-(J15B-9-PadB9)",
      "unconnected-(J15A-7-PadA7)",
      "unconnected-(J15D-10-PadD10)",
      "unconnected-(J15A-2-PadA2)",
      "unconnected-(J15C-2-PadC2)",
      "unconnected-(J15C-16-PadC16)",
      "unconnected-(J15D-6-PadD6)",
      "unconnected-(J15C-9-PadC9)",
      "unconnected-(J15C-10-PadC10)",
      "unconnected-(J15A-4-PadA4)",
      "unconnected-(J15D-9-PadD9)",
      "unconnected-(J15A-8-PadA8)",
      "unconnected-(J15A-3-PadA3)",
      "unconnected-(J15C-4-PadC4)",
      "unconnected-(J15C-1-PadC1)",
      "unconnected-(J15A-6-PadA6)",
      "unconnected-(J15D-7-PadD7)",
      "unconnected-(J15D-1-PadD1)",
      "unconnected-(J15D-2-PadD2)",
      "unconnected-(J15A-1-PadA1)",
      "unconnected-(J15C-6-PadC6)",
      "unconnected-(J15C-8-PadC8)",
      "unconnected-(J15C-11-PadC11)",
      "Net-(IC33-A)",
      "Net-(IC43-A)",
      "Net-(IC45-A)",
      "Net-(IC46-A)",
      "Net-(IC54-A)",
      "Net-(IC68-A)",
      "Net-(IC70-A)",
      "Net-(IC71-A)",
      "Net-(IC73-A)",
      "Net-(IC74-A)",
      "Net-(IC79-A)",
      "Net-(IC80-A)",
      "Net-(IC82-A)",
      "Net-(IC83-A)",
      "Net-(IC85-A)",
      "Net-(IC86-A)",
      "Net-(IC91-A)",
      "Net-(IC92-A)",
      "Net-(IC94-A)",
      "Net-(IC95-A)",
      "Net-(IC97-A)",
      "Net-(IC98-A)",
      "Net-(IC100-A)",
      "Net-(IC101-A)",
      "Net-(IC106-A)",
      "Net-(IC111-A)",
      "Net-(IC113-A)",
      "Net-(IC114-A)",
      "Net-(IC116-A)",
      "Net-(IC117-A)",
      "Net-(IC119-A)",
      "Net-(IC120-A)",
      "/VMEF.NOGA_N1",
      "/VMEF.NOGA_N0",
      "/VMEF.NOGA_N3",
      "/VMEF.NOGA_N2",
      "/VMEF.USEGA_N",
      "/VMEF.NOGA_N4",
      "/vme_interface/RS485_DATA1_N",
      "/vme_interface/RS485_DATA1_P",
      "/vme_interface/RS485_DATA0_N",
      "/vme_interface/RS485_DATA0_P",
      "/io_drivers_pp/bank2/OUT0",
      "/io_drivers_pp/bank2/OUT1",
      "/io_drivers_pp/bank2/OUT6",
      "/io_drivers_pp/bank2/OUT2",
      "/io_drivers_pp/bank2/OUT5",
      "/io_drivers_pp/bank2/OUT4",
      "/io_drivers_pp/bank2/OUT3",
      "/io_drivers_pp/bank2/OUT7",
      "/io_drivers_pp/bank3/OUT0",
      "/io_drivers_pp/bank3/OUT3",
      "/io_drivers_pp/bank3/OUT5",
      "/io_drivers_pp/bank3/OUT1",
      "/io_drivers_pp/bank3/OUT2",
      "/io_drivers_pp/bank3/OUT4",
      "/io_drivers_pp/bank3/OUT7",
      "/io_drivers_pp/bank3/OUT6",
      "Net-(IC48-SER)",
      "/vme_interface/I_IOEXP_SCLK",
      "/vme_interface/I_IOEXP_RCLK",
      "/vme_interface/RS485_DATA1_DE",
      "/vme_interface/RS485_DATA1_RE_N",
      "/vme_interface/RS485_DATA0_DE",
      "/vme_interface/RS485_DATA0_RE_N",
      "Net-(LD2-C)",
      "Net-(LD4-A)",
      "Net-(LD4-C)",
      "/io_drivers_fp/I_IOEXP_RCLK",
      "/io_drivers_fp/I_IOEXP_D_IN",
      "/slow_gpio/I_IOEXP_SCLK",
      "/slow_gpio/I_IOEXP_RCLK",
      "/fpga/fpga-hp-banks/F_IOEXP_HWBYTE1_D",
      "/fpga/fpga-hp-banks/F_IOEXP_HWBYTE1_RCLK",
      "/fpga/fpga-hp-banks/F_IOEXP_HWBYTE2_D",
      "/fpga/fpga-hp-banks/F_IOEXP_HWBYTE2_RCLK",
      "/vme_interface/I_HWBYTE1_RCLK",
      "unconnected-(IC64-QH'-Pad9)",
      "/IOEXP.HWBYTE2_D",
      "/IOEXP.HWBYTE1_RCLK",
      "unconnected-(IC141-B7-Pad15)",
      "unconnected-(IC141-B5-Pad17)",
      "/fpga/fpga-mgts/IC122_O1_N",
      "/fpga/fpga-mgts/IC122_O1_P",
      "/fpga/fpga-mgts/IC121_O1_N",
      "/fpga/fpga-mgts/IC121_O1_P",
      "unconnected-(IC14H-MGTHRXN1_224-PadV1)",
      "unconnected-(IC14H-MGTHRXP0_224-PadY2)",
      "unconnected-(IC14H-MGTHRXN0_224-PadY1)",
      "unconnected-(IC14H-MGTHRXP1_224-PadV2)",
      "/IOEXP.HWBYTE2_RCLK",
      "/IOEXP.HWBYTE1_D",
      "unconnected-(IC141-B8-Pad14)",
      "unconnected-(IC141-B6-Pad16)",
      "/STRIP1_H",
      "/STRIP1_L",
      "/STRIP2_H",
      "/STRIP2_L",
      "/VMEF.BR3",
      "unconnected-(IC142-4Y-Pad11)",
      "/VMEF.BG3IN",
      "/VMEF.BG3OUT",
      "unconnected-(IC65-QH'-Pad9)",
      "/fpga/fpga-hp-banks/F_WRCLK_SPI_MISO",
      "/fpga/fpga-hd-banks/F_SFP_LED_DATA",
      "/fpga/fpga-hp-banks/F_WRCLK_SPI_MOSI",
      "/fpga/fpga-hp-banks/F_SPI_MAIN_CS_N",
      "/fpga/fpga-hp-banks/F_WRCLK_SPI_SCK",
      "/fpga/fpga-hp-banks/F_SPI_HELPER_CS_N",
      "/VMEF.BERR_OUT",
      "/VMEF.RETRY_OUT",
      "/VMEF.RETRY_IN",
      "/VMEF.BERR_IN"
    ],
    "high_contrast_mode": 0,
    "net_color_mode": 2,
    "opacity": {
      "images": 1.0,
      "pads": 1.0,
      "shapes": 1.0,
      "tracks": 1.0,
      "vias": 1.0,
      "zones": 1.0
    },
    "ratsnest_display_mode": 0,
    "selection_filter": {
      "dimensions": true,
      "footprints": true,
      "graphics": true,
      "keepouts": true,
      "lockedItems": true,
      "otherItems": true,
      "pads": true,
      "text": true,
      "tracks": true,
      "vias": true,
      "zones": true
    },
    "visible_items": [
      0,
      1,
      2,
      3,
      4,
      5,
      8,
      9,
      10,
      11,
      12,
      13,
      15,
      16,
      18,
      19,
      20,
      21,
      22,
      23,
      24,
      25,
      26,
      27,
      28,
      29,
      30,
      32,
      33,
      34,
      35,
      40,
      41
    ],
    "visible_layers": "0081230_ffffffff",
    "zone_display_mode": 0
  },
  "git": {
    "repo_password": "",
    "repo_type": "",
    "repo_username": "",
    "ssh_key": ""
  },
  "meta": {
    "filename": "vme-wren.kicad_prl",
    "version": 4
  },
  "net_inspector_panel": {
    "col_hidden": [
      false,
      false,
      false,
      false,
      false,
      false,
      false,
      false,
      false,
      false,
      false,
      false,
      false,
      false,
      false,
      false,
      false,
      false,
      false,
      false
    ],
    "col_order": [
      0,
      1,
      2,
      3,
      4,
      5,
      6,
      7,
      8,
      9,
      10,
      11,
      12,
      13,
      14,
      15,
      16,
      17,
      18,
      19
    ],
    "col_widths": [
      268,
      147,
      91,
      67,
      91,
      91,
      91,
      71,
      91,
      91,
      91,
      91,
      91,
      91,
      91,
      91,
      91,
      91,
      91,
      91
    ],
    "custom_group_rules": [],
    "expanded_rows": [],
    "filter_by_net_name": true,
    "filter_by_netclass": true,
    "filter_text": "",
    "group_by_constraint": false,
    "group_by_netclass": false,
    "show_unconnected_nets": false,
    "show_zero_pad_nets": false,
    "sort_ascending": true,
    "sorting_column": 0
  },
  "project": {
    "files": []
  },
  "schematic": {
    "selection_filter": {
      "graphics": true,
      "images": true,
      "labels": true,
      "lockedItems": false,
      "otherItems": true,
      "pins": true,
      "symbols": true,
      "text": true,
      "wires": true
    }
  }
}
