{
  "board": {
    "3dviewports": [],
    "design_settings": {
      "defaults": {
        "apply_defaults_to_fp_fields": false,
        "apply_defaults_to_fp_shapes": false,
        "apply_defaults_to_fp_text": false,
        "board_outline_line_width": 0.05,
        "copper_line_width": 0.2,
        "copper_text_italic": false,
        "copper_text_size_h": 1.5,
        "copper_text_size_v": 1.5,
        "copper_text_thickness": 0.3,
        "copper_text_upright": false,
        "courtyard_line_width": 0.05,
        "dimension_precision": 4,
        "dimension_units": 3,
        "dimensions": {
          "arrow_length": 1270000,
          "extension_offset": 500000,
          "keep_text_aligned": true,
          "suppress_zeroes": false,
          "text_position": 0,
          "units_format": 1
        },
        "fab_line_width": 0.1,
        "fab_text_italic": false,
        "fab_text_size_h": 0.6,
        "fab_text_size_v": 0.6,
        "fab_text_thickness": 0.15,
        "fab_text_upright": false,
        "other_line_width": 0.1,
        "other_text_italic": false,
        "other_text_size_h": 0.6,
        "other_text_size_v": 0.6,
        "other_text_thickness": 0.15,
        "other_text_upright": false,
        "pads": {
          "drill": 0.6,
          "height": 1.7,
          "width": 1.7
        },
        "silk_line_width": 0.15,
        "silk_text_italic": false,
        "silk_text_size_h": 0.6,
        "silk_text_size_v": 0.6,
        "silk_text_thickness": 0.15,
        "silk_text_upright": false,
        "zones": {
          "min_clearance": 0.125
        }
      },
      "diff_pair_dimensions": [
        {
          "gap": 0.0,
          "via_gap": 0.0,
          "width": 0.0
        }
      ],
      "drc_exclusions": [],
      "meta": {
        "version": 2
      },
      "rule_severities": {
        "annular_width": "error",
        "clearance": "error",
        "connection_width": "warning",
        "copper_edge_clearance": "error",
        "copper_sliver": "warning",
        "courtyards_overlap": "warning",
        "diff_pair_gap_out_of_range": "error",
        "diff_pair_uncoupled_length_too_long": "error",
        "drill_out_of_range": "error",
        "duplicate_footprints": "error",
        "extra_footprint": "error",
        "footprint": "error",
        "footprint_symbol_mismatch": "ignore",
        "footprint_type_mismatch": "ignore",
        "hole_clearance": "error",
        "hole_near_hole": "error",
        "hole_to_hole": "warning",
        "holes_co_located": "warning",
        "invalid_outline": "warning",
        "isolated_copper": "error",
        "item_on_disabled_layer": "warning",
        "items_not_allowed": "error",
        "length_out_of_range": "error",
        "lib_footprint_issues": "ignore",
        "lib_footprint_mismatch": "ignore",
        "malformed_courtyard": "ignore",
        "microvia_drill_out_of_range": "error",
        "missing_courtyard": "ignore",
        "missing_footprint": "error",
        "net_conflict": "error",
        "npth_inside_courtyard": "ignore",
        "padstack": "error",
        "pth_inside_courtyard": "ignore",
        "shorting_items": "error",
        "silk_edge_clearance": "ignore",
        "silk_over_copper": "ignore",
        "silk_overlap": "warning",
        "skew_out_of_range": "ignore",
        "solder_mask_bridge": "warning",
        "starved_thermal": "warning",
        "text_height": "warning",
        "text_thickness": "warning",
        "through_hole_pad_without_hole": "ignore",
        "too_many_vias": "ignore",
        "track_dangling": "warning",
        "track_width": "error",
        "tracks_crossing": "error",
        "unconnected_items": "error",
        "unresolved_variable": "warning",
        "via_dangling": "warning",
        "zones_intersect": "warning"
      },
      "rules": {
        "max_error": 0.005,
        "min_clearance": 0.15,
        "min_connection": 0.15,
        "min_copper_edge_clearance": 0.5,
        "min_hole_clearance": 0.15,
        "min_hole_to_hole": 0.25,
        "min_microvia_diameter": 0.2,
        "min_microvia_drill": 0.1,
        "min_resolved_spokes": 2,
        "min_silk_clearance": 0.0,
        "min_text_height": 0.5,
        "min_text_thickness": 0.1,
        "min_through_hole_diameter": 0.3,
        "min_track_width": 0.15,
        "min_via_annular_width": 0.15,
        "min_via_diameter": 0.6,
        "solder_mask_to_copper_clearance": 0.0,
        "use_height_for_length_calcs": true
      },
      "teardrop_options": [
        {
          "td_onpadsmd": true,
          "td_onroundshapesonly": false,
          "td_ontrackend": false,
          "td_onviapad": true
        }
      ],
      "teardrop_parameters": [
        {
          "td_allow_use_two_tracks": true,
          "td_curve_segcount": 0,
          "td_height_ratio": 1.0,
          "td_length_ratio": 0.5,
          "td_maxheight": 2.0,
          "td_maxlen": 1.0,
          "td_on_pad_in_zone": false,
          "td_target_name": "td_round_shape",
          "td_width_to_size_filter_ratio": 0.9
        },
        {
          "td_allow_use_two_tracks": true,
          "td_curve_segcount": 0,
          "td_height_ratio": 1.0,
          "td_length_ratio": 0.5,
          "td_maxheight": 2.0,
          "td_maxlen": 1.0,
          "td_on_pad_in_zone": false,
          "td_target_name": "td_rect_shape",
          "td_width_to_size_filter_ratio": 0.9
        },
        {
          "td_allow_use_two_tracks": true,
          "td_curve_segcount": 0,
          "td_height_ratio": 1.0,
          "td_length_ratio": 0.5,
          "td_maxheight": 2.0,
          "td_maxlen": 1.0,
          "td_on_pad_in_zone": false,
          "td_target_name": "td_track_end",
          "td_width_to_size_filter_ratio": 0.9
        }
      ],
      "track_widths": [
        0.0,
        0.125,
        0.15,
        0.2,
        0.4,
        0.5,
        0.6,
        1.0
      ],
      "tuning_pattern_settings": {
        "diff_pair_defaults": {
          "corner_radius_percentage": 100,
          "corner_style": 1,
          "max_amplitude": 1.0,
          "min_amplitude": 0.1,
          "single_sided": false,
          "spacing": 0.6
        },
        "diff_pair_skew_defaults": {
          "corner_radius_percentage": 100,
          "corner_style": 1,
          "max_amplitude": 1.0,
          "min_amplitude": 0.1,
          "single_sided": false,
          "spacing": 0.6
        },
        "single_track_defaults": {
          "corner_radius_percentage": 100,
          "corner_style": 1,
          "max_amplitude": 1.0,
          "min_amplitude": 0.1,
          "single_sided": false,
          "spacing": 0.6
        }
      },
      "via_dimensions": [
        {
          "diameter": 0.0,
          "drill": 0.0
        },
        {
          "diameter": 0.6,
          "drill": 0.3
        }
      ],
      "zones_allow_external_fillets": false
    },
    "ipc2581": {
      "dist": "",
      "distpn": "",
      "internal_id": "",
      "mfg": "",
      "mpn": ""
    },
    "layer_pairs": [],
    "layer_presets": [],
    "viewports": []
  },
  "boards": [],
  "cvpcb": {
    "equivalence_files": []
  },
  "erc": {
    "erc_exclusions": [],
    "meta": {
      "version": 0
    },
    "pin_map": [
      [
        0,
        0,
        0,
        0,
        0,
        0,
        1,
        0,
        0,
        0,
        0,
        2
      ],
      [
        0,
        2,
        0,
        1,
        0,
        0,
        1,
        0,
        2,
        2,
        2,
        2
      ],
      [
        0,
        0,
        0,
        0,
        0,
        0,
        1,
        0,
        1,
        0,
        1,
        2
      ],
      [
        0,
        1,
        0,
        0,
        0,
        0,
        1,
        1,
        2,
        1,
        1,
        2
      ],
      [
        0,
        0,
        0,
        0,
        0,
        0,
        1,
        0,
        0,
        0,
        0,
        2
      ],
      [
        0,
        0,
        0,
        0,
        0,
        0,
        0,
        0,
        0,
        0,
        0,
        2
      ],
      [
        1,
        1,
        1,
        1,
        1,
        0,
        1,
        1,
        1,
        1,
        1,
        2
      ],
      [
        0,
        0,
        0,
        1,
        0,
        0,
        1,
        0,
        0,
        0,
        0,
        2
      ],
      [
        0,
        2,
        1,
        2,
        0,
        0,
        1,
        0,
        2,
        2,
        2,
        2
      ],
      [
        0,
        2,
        0,
        1,
        0,
        0,
        1,
        0,
        2,
        0,
        0,
        2
      ],
      [
        0,
        2,
        1,
        1,
        0,
        0,
        1,
        0,
        2,
        0,
        0,
        2
      ],
      [
        2,
        2,
        2,
        2,
        2,
        2,
        2,
        2,
        2,
        2,
        2,
        2
      ]
    ],
    "rule_severities": {
      "bus_definition_conflict": "error",
      "bus_entry_needed": "error",
      "bus_label_syntax": "error",
      "bus_to_bus_conflict": "error",
      "bus_to_net_conflict": "error",
      "conflicting_netclasses": "error",
      "different_unit_footprint": "error",
      "different_unit_net": "error",
      "duplicate_reference": "error",
      "duplicate_sheet_names": "error",
      "endpoint_off_grid": "warning",
      "extra_units": "error",
      "footprint_link_issues": "warning",
      "four_way_junction": "ignore",
      "global_label_dangling": "warning",
      "hier_label_mismatch": "error",
      "label_dangling": "error",
      "lib_symbol_issues": "warning",
      "lib_symbol_mismatch": "warning",
      "missing_bidi_pin": "warning",
      "missing_input_pin": "warning",
      "missing_power_pin": "error",
      "missing_unit": "warning",
      "multiple_net_names": "warning",
      "net_not_bus_member": "warning",
      "no_connect_connected": "warning",
      "no_connect_dangling": "warning",
      "overlapping_rule_areas": "error",
      "pin_not_connected": "error",
      "pin_not_driven": "error",
      "pin_to_pin": "error",
      "power_pin_not_driven": "error",
      "similar_labels": "warning",
      "simulation_model_issue": "ignore",
      "single_global_label": "ignore",
      "unannotated": "error",
      "unit_value_mismatch": "error",
      "unresolved_variable": "error",
      "wire_dangling": "error"
    }
  },
  "libraries": {
    "pinned_footprint_libs": [],
    "pinned_symbol_libs": []
  },
  "meta": {
    "filename": "EDA-04949-V1-0.kicad_pro",
    "version": 1
  },
  "net_settings": {
    "classes": [
      {
        "bus_width": 12,
        "clearance": 0.15,
        "diff_pair_gap": 0.25,
        "diff_pair_via_gap": 0.25,
        "diff_pair_width": 0.33,
        "line_style": 0,
        "microvia_diameter": 0.3,
        "microvia_drill": 0.1,
        "name": "Default",
        "pcb_color": "rgba(0, 0, 0, 0.000)",
        "priority": 2147483647,
        "schematic_color": "rgba(0, 0, 0, 0.000)",
        "track_width": 0.15,
        "via_diameter": 0.6,
        "via_drill": 0.3,
        "wire_width": 6
      },
      {
        "bus_width": 12,
        "clearance": 0.15,
        "diff_pair_gap": 0.25,
        "diff_pair_via_gap": 0.25,
        "diff_pair_width": 0.33,
        "line_style": 0,
        "microvia_diameter": 0.3,
        "microvia_drill": 0.1,
        "name": "zse_50r",
        "pcb_color": "rgba(0, 0, 0, 0.000)",
        "priority": 0,
        "schematic_color": "rgba(0, 0, 0, 0.000)",
        "track_width": 0.245,
        "via_diameter": 0.6,
        "via_drill": 0.3,
        "wire_width": 6
      }
    ],
    "meta": {
      "version": 4
    },
    "net_colors": null,
    "netclass_assignments": null,
    "netclass_patterns": [
      {
        "netclass": "zse_50r",
        "pattern": "*FP_IO*"
      },
      {
        "netclass": "Default",
        "pattern": "/DDR4-PS.DQ2"
      },
      {
        "netclass": "Default",
        "pattern": "/DDR4-PS.DQ3"
      },
      {
        "netclass": "Default",
        "pattern": "/DDR4-PS.DQ4"
      },
      {
        "netclass": "Default",
        "pattern": "/DDR4-PS.DQ5"
      },
      {
        "netclass": "Default",
        "pattern": "/DDR4-PS.DQ6"
      },
      {
        "netclass": "Default",
        "pattern": "/DDR4-PS.DQ7"
      },
      {
        "netclass": "Default",
        "pattern": "/DDR4-PS.DM0"
      },
      {
        "netclass": "Default",
        "pattern": "/DDR4-PS.DQS_P0"
      },
      {
        "netclass": "Default",
        "pattern": "/DDR4-PS.DQS_N0"
      },
      {
        "netclass": "Default",
        "pattern": "/DDR4-PS.DQ8"
      },
      {
        "netclass": "Default",
        "pattern": "/DDR4-PS.DQ9"
      },
      {
        "netclass": "Default",
        "pattern": "/DDR4-PS.DQ10"
      },
      {
        "netclass": "Default",
        "pattern": "/DDR4-PS.DQ11"
      },
      {
        "netclass": "Default",
        "pattern": "/DDR4-PS.DQ12"
      },
      {
        "netclass": "Default",
        "pattern": "/DDR4-PS.DQ13"
      },
      {
        "netclass": "Default",
        "pattern": "/DDR4-PS.DQ14"
      },
      {
        "netclass": "Default",
        "pattern": "/DDR4-PS.DQ15"
      },
      {
        "netclass": "Default",
        "pattern": "/DDR4-PS.DM1"
      },
      {
        "netclass": "Default",
        "pattern": "/DDR4-PS.DQS_P1"
      },
      {
        "netclass": "Default",
        "pattern": "/DDR4-PS.DQS_N1"
      },
      {
        "netclass": "Default",
        "pattern": "/DDR4-PS.DQ16"
      },
      {
        "netclass": "Default",
        "pattern": "/DDR4-PS.DQ17"
      },
      {
        "netclass": "Default",
        "pattern": "/DDR4-PS.DQ18"
      },
      {
        "netclass": "Default",
        "pattern": "/DDR4-PS.DQ19"
      },
      {
        "netclass": "Default",
        "pattern": "/DDR4-PS.DQ20"
      },
      {
        "netclass": "Default",
        "pattern": "/DDR4-PS.DQ21"
      },
      {
        "netclass": "Default",
        "pattern": "/DDR4-PS.DQ22"
      },
      {
        "netclass": "Default",
        "pattern": "/DDR4-PS.DQ23"
      },
      {
        "netclass": "Default",
        "pattern": "/DDR4-PS.DM2"
      },
      {
        "netclass": "Default",
        "pattern": "/DDR4-PS.DQS_P2"
      },
      {
        "netclass": "Default",
        "pattern": "/DDR4-PS.DQS_N2"
      },
      {
        "netclass": "Default",
        "pattern": "/DDR4-PS.DQ24"
      },
      {
        "netclass": "Default",
        "pattern": "/DDR4-PS.DQ25"
      },
      {
        "netclass": "Default",
        "pattern": "/DDR4-PS.DQ26"
      },
      {
        "netclass": "Default",
        "pattern": "/DDR4-PS.DQ27"
      },
      {
        "netclass": "Default",
        "pattern": "/DDR4-PS.DQ28"
      },
      {
        "netclass": "Default",
        "pattern": "/DDR4-PS.DQ29"
      },
      {
        "netclass": "Default",
        "pattern": "/DDR4-PS.DQ30"
      },
      {
        "netclass": "Default",
        "pattern": "/DDR4-PS.DQ31"
      },
      {
        "netclass": "Default",
        "pattern": "/DDR4-PS.DM3"
      },
      {
        "netclass": "Default",
        "pattern": "/DDR4-PS.DQS_P3"
      },
      {
        "netclass": "Default",
        "pattern": "/DDR4-PS.DQS_N3"
      },
      {
        "netclass": "Default",
        "pattern": "*DDR4-PS.A1"
      },
      {
        "netclass": "Default",
        "pattern": "*DDR4-PS.A2"
      },
      {
        "netclass": "Default",
        "pattern": "*DDR4-PS.A3"
      },
      {
        "netclass": "Default",
        "pattern": "*DDR4-PS.A4"
      },
      {
        "netclass": "Default",
        "pattern": "*DDR4-PS.A5"
      },
      {
        "netclass": "Default",
        "pattern": "*DDR4-PS.A6"
      },
      {
        "netclass": "Default",
        "pattern": "*DDR4-PS.A7"
      },
      {
        "netclass": "Default",
        "pattern": "*DDR4-PS.A8"
      },
      {
        "netclass": "Default",
        "pattern": "*DDR4-PS.A9"
      },
      {
        "netclass": "Default",
        "pattern": "*DDR4-PS.A10"
      },
      {
        "netclass": "Default",
        "pattern": "*DDR4-PS.A11"
      },
      {
        "netclass": "Default",
        "pattern": "*DDR4-PS.A12"
      },
      {
        "netclass": "Default",
        "pattern": "*DDR4-PS.A13"
      },
      {
        "netclass": "Default",
        "pattern": "*DDR4-PS.ACTN"
      }
    ]
  },
  "pcbnew": {
    "last_paths": {
      "gencad": "EDA-04949-V1-0.cad",
      "idf": "",
      "netlist": "",
      "plot": "Manufacturing/Gbr",
      "pos_files": "",
      "specctra_dsn": "",
      "step": "EDA-04949-V1-0-3D.stp",
      "svg": "test",
      "vrml": ""
    },
    "page_layout_descr_file": "CERNv8.kicad_wks"
  },
  "schematic": {
    "annotate_start_num": 0,
    "bom_export_filename": "${PROJECTNAME}.csv",
    "bom_fmt_presets": [],
    "bom_fmt_settings": {
      "field_delimiter": ",",
      "keep_line_breaks": false,
      "keep_tabs": false,
      "name": "CSV",
      "ref_delimiter": ",",
      "ref_range_delimiter": "",
      "string_delimiter": "\""
    },
    "bom_presets": [],
    "bom_settings": {
      "exclude_dnp": false,
      "fields_ordered": [
        {
          "group_by": false,
          "label": "Reference",
          "name": "Reference",
          "show": true
        },
        {
          "group_by": true,
          "label": "Value",
          "name": "Value",
          "show": true
        },
        {
          "group_by": false,
          "label": "Datasheet",
          "name": "Datasheet",
          "show": true
        },
        {
          "group_by": true,
          "label": "Footprint",
          "name": "Footprint",
          "show": true
        },
        {
          "group_by": false,
          "label": "Qty",
          "name": "${QUANTITY}",
          "show": true
        },
        {
          "group_by": true,
          "label": "DNP",
          "name": "${DNP}",
          "show": true
        },
        {
          "group_by": false,
          "label": "Case",
          "name": "Case",
          "show": true
        },
        {
          "group_by": false,
          "label": "Color",
          "name": "Color",
          "show": true
        },
        {
          "group_by": false,
          "label": "Comment",
          "name": "Comment",
          "show": true
        },
        {
          "group_by": false,
          "label": "Component Kind",
          "name": "Component Kind",
          "show": true
        },
        {
          "group_by": false,
          "label": "Component Type",
          "name": "Component Type",
          "show": true
        },
        {
          "group_by": false,
          "label": "ComponentHeight",
          "name": "ComponentHeight",
          "show": true
        },
        {
          "group_by": false,
          "label": "ComponentLink1Description",
          "name": "ComponentLink1Description",
          "show": true
        },
        {
          "group_by": false,
          "label": "ComponentLink1URL",
          "name": "ComponentLink1URL",
          "show": true
        },
        {
          "group_by": false,
          "label": "ComponentLink2Description",
          "name": "ComponentLink2Description",
          "show": true
        },
        {
          "group_by": false,
          "label": "ComponentLink2URL",
          "name": "ComponentLink2URL",
          "show": true
        },
        {
          "group_by": false,
          "label": "CreateDate",
          "name": "CreateDate",
          "show": true
        },
        {
          "group_by": false,
          "label": "Database Table Name",
          "name": "Database Table Name",
          "show": true
        },
        {
          "group_by": false,
          "label": "Device",
          "name": "Device",
          "show": true
        },
        {
          "group_by": false,
          "label": "Family",
          "name": "Family",
          "show": true
        },
        {
          "group_by": false,
          "label": "Footprint Library",
          "name": "Footprint Library",
          "show": true
        },
        {
          "group_by": false,
          "label": "Footprint Path",
          "name": "Footprint Path",
          "show": true
        },
        {
          "group_by": false,
          "label": "Footprint Ref",
          "name": "Footprint Ref",
          "show": true
        },
        {
          "group_by": false,
          "label": "HelpURL",
          "name": "HelpURL",
          "show": true
        },
        {
          "group_by": false,
          "label": "LatestRevisionDate",
          "name": "LatestRevisionDate",
          "show": true
        },
        {
          "group_by": false,
          "label": "LatestRevisionDate1",
          "name": "LatestRevisionDate1",
          "show": true
        },
        {
          "group_by": false,
          "label": "Library Name",
          "name": "Library Name",
          "show": true
        },
        {
          "group_by": false,
          "label": "Library Path",
          "name": "Library Path",
          "show": true
        },
        {
          "group_by": false,
          "label": "Library Ref",
          "name": "Library Ref",
          "show": true
        },
        {
          "group_by": false,
          "label": "License",
          "name": "License",
          "show": true
        },
        {
          "group_by": false,
          "label": "Manufacturer",
          "name": "Manufacturer",
          "show": true
        },
        {
          "group_by": false,
          "label": "Manufacturer Part Number",
          "name": "Manufacturer Part Number",
          "show": true
        },
        {
          "group_by": false,
          "label": "Manufacturer1 ComponentHeight",
          "name": "Manufacturer1 ComponentHeight",
          "show": true
        },
        {
          "group_by": false,
          "label": "Manufacturer1 Example",
          "name": "Manufacturer1 Example",
          "show": true
        },
        {
          "group_by": false,
          "label": "Manufacturer1 Part Number",
          "name": "Manufacturer1 Part Number",
          "show": true
        },
        {
          "group_by": false,
          "label": "Mounted",
          "name": "Mounted",
          "show": true
        },
        {
          "group_by": false,
          "label": "PackageDescription",
          "name": "PackageDescription",
          "show": true
        },
        {
          "group_by": false,
          "label": "Part Description",
          "name": "Part Description",
          "show": true
        },
        {
          "group_by": false,
          "label": "Part Number",
          "name": "Part Number",
          "show": true
        },
        {
          "group_by": false,
          "label": "Pin Count",
          "name": "Pin Count",
          "show": true
        },
        {
          "group_by": false,
          "label": "Power",
          "name": "Power",
          "show": true
        },
        {
          "group_by": false,
          "label": "PressFit",
          "name": "PressFit",
          "show": true
        },
        {
          "group_by": false,
          "label": "Resistance",
          "name": "Resistance",
          "show": true
        },
        {
          "group_by": false,
          "label": "SCEM",
          "name": "SCEM",
          "show": true
        },
        {
          "group_by": false,
          "label": "SMD",
          "name": "SMD",
          "show": true
        },
        {
          "group_by": false,
          "label": "Sense",
          "name": "Sense",
          "show": true
        },
        {
          "group_by": false,
          "label": "Sense Comment",
          "name": "Sense Comment",
          "show": true
        },
        {
          "group_by": false,
          "label": "Socket",
          "name": "Socket",
          "show": true
        },
        {
          "group_by": false,
          "label": "Status",
          "name": "Status",
          "show": true
        },
        {
          "group_by": false,
          "label": "Status Comment",
          "name": "Status Comment",
          "show": true
        },
        {
          "group_by": false,
          "label": "Tolerance",
          "name": "Tolerance",
          "show": true
        },
        {
          "group_by": false,
          "label": "Val",
          "name": "Val",
          "show": true
        },
        {
          "group_by": false,
          "label": "Voltage",
          "name": "Voltage",
          "show": true
        },
        {
          "group_by": false,
          "label": "Description",
          "name": "Description",
          "show": true
        },
        {
          "group_by": false,
          "label": "#",
          "name": "${ITEM_NUMBER}",
          "show": false
        },
        {
          "group_by": false,
          "label": "Author",
          "name": "Author",
          "show": true
        },
        {
          "group_by": false,
          "label": "TC",
          "name": "TC",
          "show": true
        },
        {
          "group_by": false,
          "label": "Bonding",
          "name": "Bonding",
          "show": true
        }
      ],
      "filter_string": "",
      "group_symbols": true,
      "include_excluded_from_bom": false,
      "name": "",
      "sort_asc": true,
      "sort_field": "Reference"
    },
    "connection_grid_size": 50.0,
    "drawing": {
      "dashed_lines_dash_length_ratio": 12.0,
      "dashed_lines_gap_length_ratio": 3.0,
      "default_line_thickness": 6.0,
      "default_text_size": 50.0,
      "field_names": [],
      "intersheets_ref_own_page": false,
      "intersheets_ref_prefix": "",
      "intersheets_ref_short": false,
      "intersheets_ref_show": false,
      "intersheets_ref_suffix": "",
      "junction_size_choice": 3,
      "label_size_ratio": 0.375,
      "operating_point_overlay_i_precision": 3,
      "operating_point_overlay_i_range": "~A",
      "operating_point_overlay_v_precision": 3,
      "operating_point_overlay_v_range": "~V",
      "overbar_offset_ratio": 1.23,
      "pin_symbol_size": 25.0,
      "text_offset_ratio": 0.15
    },
    "legacy_lib_dir": "",
    "legacy_lib_list": [],
    "meta": {
      "version": 1
    },
    "net_format_name": "KiCad",
    "ngspice": {
      "fix_include_paths": true,
      "fix_passive_vals": false,
      "meta": {
        "version": 0
      },
      "model_mode": 0,
      "workbook_filename": ""
    },
    "page_layout_descr_file": "CERNv8.kicad_wks",
    "plot_directory": "output/",
    "space_save_all_events": true,
    "spice_adjust_passive_values": false,
    "spice_current_sheet_as_root": false,
    "spice_external_command": "spice \"%I\"",
    "spice_model_current_sheet_as_root": true,
    "spice_save_all_currents": false,
    "spice_save_all_dissipations": false,
    "spice_save_all_voltages": false,
    "subpart_first_id": 65,
    "subpart_id_separator": 0
  },
  "sheets": [
    [
      "8d5214a9-97b1-4893-af24-0c6156e158f8",
      "Root"
    ],
    [
      "3c220456-d02d-4a54-a01f-825062607efe",
      "LEDs"
    ]
  ],
  "text_variables": {
    "ADDRESS1": "European Organization for Nuclear Research",
    "ADDRESS2": "CH-1211 Genève 23 - Switzerland",
    "APPROVEDBY": "",
    "AUTHOR": "Paul Peronnard/Tomasz Wlostowski",
    "CHECKEDBY": "W. Billereau",
    "CHECKEDDATE": "03/07/2024",
    "CURRENTDATE": "CURRENTDATE",
    "CURRENTTIME": "CURRENTTIME",
    "DESIGNDATE": "",
    "DESIGNER": "PP/TW",
    "DIVGRP": "BE-CEM",
    "DRAWNBY": "PP/TW",
    "DRAWNDATE": "",
    "EDA_NUMBER": "EDA-04949-V1-0",
    "ENGINEER": "PP/TW",
    "MODIFIEDBY": "W. Billereau",
    "MODIFIEDDATE": "-",
    "OHL_Date": "2024",
    "OHL_License": "OHL-W v2.0+",
    "OHL_Version": "OHL v2.0",
    "ORGANIZATION": "CERN",
    "PROJECT": "White Rabbit Event Node",
    "PROJECTNAME": "WREN-V White Rabbit Event Node - VME Single",
    "TIME": "TIME",
    "TITLE1": "WREN-V Single",
    "project_source": "https://ohwr.org/project/xxxx/wikis"
  }
}
