(kicad_symbol_lib
	(version 20231120)
	(generator "kicad_symbol_editor")
	(generator_version "8.0")
	(symbol "LEDLP_BIVAR_VLP-350-R"
		(pin_names
			(offset 1.27)
		)
		(exclude_from_sim no)
		(in_bom yes)
		(on_board yes)
		(property "Reference" "LP1"
			(at 6.35 -0.345 0)
			(effects
				(font
					(size 1.27 1.27)
				)
				(justify left)
			)
		)
		(property "Value" "LEDLP_BIVAR_VLP-350-R"
			(at 0 -7.239 0)
			(effects
				(font
					(size 1.27 1.27)
				)
				(justify left)
				(hide yes)
			)
		)
		(property "Footprint" "vme-wren:BIVAR_VLP-350-F"
			(at 0 -9.144 0)
			(effects
				(font
					(size 1.27 1.27)
				)
				(justify left)
				(hide yes)
			)
		)
		(property "Datasheet" "\\\\cern.ch\\dfs\\Applications\\Altium\\Datasheets\\LEDLP_BIVAR_VLP.pdf"
			(at 0 -11.049 0)
			(effects
				(font
					(size 1.27 1.27)
				)
				(justify left)
				(hide yes)
			)
		)
		(property "Description" " "
			(at 0 -2.54 0)
			(effects
				(font
					(size 1.27 1.27)
				)
				(hide yes)
			)
		)
		(property "Library Ref" "LED Light Pipe x1 Type1"
			(at 0 -14.859 0)
			(effects
				(font
					(size 1.27 1.27)
				)
				(justify left)
				(hide yes)
			)
		)
		(property "Library Path" "SchLib\\LEDs & Displays.SchLib"
			(at 0 -16.764 0)
			(effects
				(font
					(size 1.27 1.27)
				)
				(justify left)
				(hide yes)
			)
		)
		(property "Comment" " "
			(at 0 -18.669 0)
			(effects
				(font
					(size 1.27 1.27)
				)
				(justify left)
				(hide yes)
			)
		)
		(property "Component Kind" "Accessories"
			(at 0 -20.574 0)
			(effects
				(font
					(size 1.27 1.27)
				)
				(justify left)
				(hide yes)
			)
		)
		(property "Component Type" "Standard"
			(at 0 -22.479 0)
			(effects
				(font
					(size 1.27 1.27)
				)
				(justify left)
				(hide yes)
			)
		)
		(property "Color" " "
			(at 0 -24.384 0)
			(effects
				(font
					(size 1.27 1.27)
				)
				(justify left)
				(hide yes)
			)
		)
		(property "Device" " "
			(at 0 -26.289 0)
			(effects
				(font
					(size 1.27 1.27)
				)
				(justify left)
				(hide yes)
			)
		)
		(property "PackageDescription" "3mm Dome Lens, Single Station Vertical Round Lightpipe Height 0.600 in. (15.2mm)"
			(at 0 -28.194 0)
			(effects
				(font
					(size 1.27 1.27)
				)
				(justify left)
				(hide yes)
			)
		)
		(property "Status" " "
			(at 0 -30.099 0)
			(effects
				(font
					(size 1.27 1.27)
				)
				(justify left)
				(hide yes)
			)
		)
		(property "Part Description" "3mm Dome Lens, Single Station Vertical Round Lightpipe Height 0.600 in. (15.2mm)"
			(at 0 -32.004 0)
			(effects
				(font
					(size 1.27 1.27)
				)
				(justify left)
				(hide yes)
			)
		)
		(property "Manufacturer" "BIVAR"
			(at 0 -33.909 0)
			(effects
				(font
					(size 1.27 1.27)
				)
				(justify left)
				(hide yes)
			)
		)
		(property "Manufacturer Part Number" "VLP-600-R"
			(at 0 -35.814 0)
			(effects
				(font
					(size 1.27 1.27)
				)
				(justify left)
				(hide yes)
			)
		)
		(property "Pin Count" "0"
			(at 0 -37.719 0)
			(effects
				(font
					(size 1.27 1.27)
				)
				(justify left)
				(hide yes)
			)
		)
		(property "Case" " "
			(at 0 -39.624 0)
			(effects
				(font
					(size 1.27 1.27)
				)
				(justify left)
				(hide yes)
			)
		)
		(property "Mounted" "Yes"
			(at 0 -41.529 0)
			(effects
				(font
					(size 1.27 1.27)
				)
				(justify left)
				(hide yes)
			)
		)
		(property "Socket" "No"
			(at 0 -43.434 0)
			(effects
				(font
					(size 1.27 1.27)
				)
				(justify left)
				(hide yes)
			)
		)
		(property "SMD" "No"
			(at 0 -45.339 0)
			(effects
				(font
					(size 1.27 1.27)
				)
				(justify left)
				(hide yes)
			)
		)
		(property "PressFit" "No"
			(at 0 -47.244 0)
			(effects
				(font
					(size 1.27 1.27)
				)
				(justify left)
				(hide yes)
			)
		)
		(property "Sense Comment" " "
			(at 0 -49.149 0)
			(effects
				(font
					(size 1.27 1.27)
				)
				(justify left)
				(hide yes)
			)
		)
		(property "Sense" "No"
			(at 0 -51.054 0)
			(effects
				(font
					(size 1.27 1.27)
				)
				(justify left)
				(hide yes)
			)
		)
		(property "Bonding" "No"
			(at 0 -52.959 0)
			(effects
				(font
					(size 1.27 1.27)
				)
				(justify left)
				(hide yes)
			)
		)
		(property "Status Comment" " "
			(at 0 -54.864 0)
			(effects
				(font
					(size 1.27 1.27)
				)
				(justify left)
				(hide yes)
			)
		)
		(property "ComponentHeight" "15.2mm"
			(at 0 -56.769 0)
			(effects
				(font
					(size 1.27 1.27)
				)
				(justify left)
				(hide yes)
			)
		)
		(property "Footprint Path" "PcbLib\\ICs And Semiconductors THD.PcbLib"
			(at 0 -58.674 0)
			(effects
				(font
					(size 1.27 1.27)
				)
				(justify left)
				(hide yes)
			)
		)
		(property "Footprint Ref" "LEDLP_BIVAR_VLP-600-R"
			(at 0 -60.579 0)
			(effects
				(font
					(size 1.27 1.27)
				)
				(justify left)
				(hide yes)
			)
		)
		(property "HelpURL" "\\\\cern.ch\\dfs\\Applications\\Altium\\Datasheets\\LEDLP_BIVAR_VLP.pdf"
			(at 0 -62.484 0)
			(effects
				(font
					(size 1.27 1.27)
				)
				(justify left)
				(hide yes)
			)
		)
		(property "ComponentLink1URL" " "
			(at 0 -64.389 0)
			(effects
				(font
					(size 1.27 1.27)
				)
				(justify left)
				(hide yes)
			)
		)
		(property "ComponentLink1Description" " "
			(at 0 -66.294 0)
			(effects
				(font
					(size 1.27 1.27)
				)
				(justify left)
				(hide yes)
			)
		)
		(property "ComponentLink2URL" " "
			(at 0 -68.199 0)
			(effects
				(font
					(size 1.27 1.27)
				)
				(justify left)
				(hide yes)
			)
		)
		(property "ComponentLink2Description" " "
			(at 0 -70.104 0)
			(effects
				(font
					(size 1.27 1.27)
				)
				(justify left)
				(hide yes)
			)
		)
		(property "Author" "CERN DEM HF"
			(at 0 -72.009 0)
			(effects
				(font
					(size 1.27 1.27)
				)
				(justify left)
				(hide yes)
			)
		)
		(property "CreateDate" "11/10/22 00:00:00"
			(at 0 -73.914 0)
			(effects
				(font
					(size 1.27 1.27)
				)
				(justify left)
				(hide yes)
			)
		)
		(property "LatestRevisionDate" "11/10/22 00:00:00"
			(at 0 -75.819 0)
			(effects
				(font
					(size 1.27 1.27)
				)
				(justify left)
				(hide yes)
			)
		)
		(property "Database Table Name" "ICs And Semiconductors"
			(at 0 -77.724 0)
			(effects
				(font
					(size 1.27 1.27)
				)
				(justify left)
				(hide yes)
			)
		)
		(property "Library Name" "LEDs & Displays"
			(at 0 -79.629 0)
			(effects
				(font
					(size 1.27 1.27)
				)
				(justify left)
				(hide yes)
			)
		)
		(property "Footprint Library" "ICs And Semiconductors THD"
			(at 0 -81.534 0)
			(effects
				(font
					(size 1.27 1.27)
				)
				(justify left)
				(hide yes)
			)
		)
		(property "License" "CC-BY-SA 4.0"
			(at 0 -83.439 0)
			(effects
				(font
					(size 1.27 1.27)
				)
				(justify left)
				(hide yes)
			)
		)
		(symbol "LEDLP_BIVAR_VLP-350-R_0_1"
			(bezier
				(pts
					(xy -0.508 2.921) (xy -0.508 2.286) (xy -0.2794 1.778) (xy 0 1.778)
				)
				(stroke
					(width 0)
					(type solid)
				)
				(fill
					(type none)
				)
			)
			(polyline
				(pts
					(xy 0 4.064) (xy 4.064 4.064)
				)
				(stroke
					(width 0)
					(type solid)
				)
				(fill
					(type none)
				)
			)
			(polyline
				(pts
					(xy 0.762 2.286) (xy 2.032 3.556)
				)
				(stroke
					(width 0.254)
					(type solid)
				)
				(fill
					(type none)
				)
			)
			(polyline
				(pts
					(xy 2.032 2.032) (xy 3.302 3.302)
				)
				(stroke
					(width 0.254)
					(type solid)
				)
				(fill
					(type none)
				)
			)
			(polyline
				(pts
					(xy 4.064 1.778) (xy 0 1.778)
				)
				(stroke
					(width 0)
					(type solid)
				)
				(fill
					(type none)
				)
			)
			(polyline
				(pts
					(xy 2.032 3.556) (xy 1.27 3.302) (xy 1.778 2.794) (xy 2.032 3.556)
				)
				(stroke
					(width 0.254)
					(type solid)
				)
				(fill
					(type outline)
				)
			)
			(polyline
				(pts
					(xy 3.302 3.302) (xy 2.54 3.048) (xy 3.048 2.54) (xy 3.302 3.302)
				)
				(stroke
					(width 0.254)
					(type solid)
				)
				(fill
					(type outline)
				)
			)
			(bezier
				(pts
					(xy 0 4.064) (xy -0.2794 4.064) (xy -0.508 3.556) (xy -0.508 2.921)
				)
				(stroke
					(width 0)
					(type solid)
				)
				(fill
					(type none)
				)
			)
			(bezier
				(pts
					(xy 3.683 2.921) (xy 3.683 1.397) (xy 4.445 1.397) (xy 4.445 2.921)
				)
				(stroke
					(width 0)
					(type solid)
				)
				(fill
					(type background)
				)
			)
			(bezier
				(pts
					(xy 3.683 2.921) (xy 3.683 4.445) (xy 4.445 4.445) (xy 4.445 2.921)
				)
				(stroke
					(width 0)
					(type solid)
				)
				(fill
					(type background)
				)
			)
			(text "+ Light Pipe"
				(at -0.254 -4.318 0)
				(effects
					(font
						(size 1.016 1.016)
					)
					(hide yes)
				)
			)
		)
		(symbol "LEDLP_BIVAR_VLP-350-R_0_2"
			(bezier
				(pts
					(xy -0.508 2.921) (xy -0.508 2.286) (xy -0.2794 1.778) (xy 0 1.778)
				)
				(stroke
					(width 0)
					(type solid)
				)
				(fill
					(type none)
				)
			)
			(polyline
				(pts
					(xy 0 4.064) (xy 4.064 4.064)
				)
				(stroke
					(width 0)
					(type solid)
				)
				(fill
					(type none)
				)
			)
			(polyline
				(pts
					(xy 0.762 2.286) (xy 2.032 3.556)
				)
				(stroke
					(width 0.254)
					(type solid)
				)
				(fill
					(type none)
				)
			)
			(polyline
				(pts
					(xy 2.032 2.032) (xy 3.302 3.302)
				)
				(stroke
					(width 0.254)
					(type solid)
				)
				(fill
					(type none)
				)
			)
			(polyline
				(pts
					(xy 4.064 1.778) (xy 0 1.778)
				)
				(stroke
					(width 0)
					(type solid)
				)
				(fill
					(type none)
				)
			)
			(polyline
				(pts
					(xy 2.032 3.556) (xy 1.27 3.302) (xy 1.778 2.794) (xy 2.032 3.556)
				)
				(stroke
					(width 0.254)
					(type solid)
				)
				(fill
					(type outline)
				)
			)
			(polyline
				(pts
					(xy 3.302 3.302) (xy 2.54 3.048) (xy 3.048 2.54) (xy 3.302 3.302)
				)
				(stroke
					(width 0.254)
					(type solid)
				)
				(fill
					(type outline)
				)
			)
			(bezier
				(pts
					(xy 0 4.064) (xy -0.2794 4.064) (xy -0.508 3.556) (xy -0.508 2.921)
				)
				(stroke
					(width 0)
					(type solid)
				)
				(fill
					(type none)
				)
			)
			(bezier
				(pts
					(xy 3.683 2.921) (xy 3.683 1.397) (xy 4.445 1.397) (xy 4.445 2.921)
				)
				(stroke
					(width 0)
					(type solid)
				)
				(fill
					(type background)
				)
			)
			(bezier
				(pts
					(xy 3.683 2.921) (xy 3.683 4.445) (xy 4.445 4.445) (xy 4.445 2.921)
				)
				(stroke
					(width 0)
					(type solid)
				)
				(fill
					(type background)
				)
			)
			(text "Light Pipe"
				(at 2.286 0.762 0)
				(effects
					(font
						(size 1.016 1.016)
					)
					(hide yes)
				)
			)
		)
	)
	(symbol "LED_EVERLIGHT_19-C47_RSGHBHC-5V01_2T"
		(pin_names
			(offset 1.27)
		)
		(exclude_from_sim no)
		(in_bom yes)
		(on_board yes)
		(property "Reference" "LD?"
			(at 13.97 -6.3499 0)
			(effects
				(font
					(size 1.27 1.27)
				)
				(justify left)
			)
		)
		(property "Value" "LED_EVERLIGHT_19-C47_RSGHBHC-5V01_2T"
			(at 0 -17.145 0)
			(effects
				(font
					(size 1.27 1.27)
				)
				(justify left)
				(hide yes)
			)
		)
		(property "Footprint" "vme-wren:LED_EVERLIGHT_19-C47_RSGHBHC-5V01_2T"
			(at 0 -19.05 0)
			(effects
				(font
					(size 1.27 1.27)
				)
				(justify left)
				(hide yes)
			)
		)
		(property "Datasheet" ""
			(at 0 -20.955 0)
			(effects
				(font
					(size 1.27 1.27)
				)
				(justify left)
				(hide yes)
			)
		)
		(property "Description" ""
			(at 0 -22.86 0)
			(effects
				(font
					(size 1.27 1.27)
				)
				(justify left)
				(hide yes)
			)
		)
		(property "Comment" " "
			(at 0 -28.575 0)
			(effects
				(font
					(size 1.27 1.27)
				)
				(justify left)
				(hide yes)
			)
		)
		(property "Component Kind" "Standard"
			(at 0 -30.48 0)
			(effects
				(font
					(size 1.27 1.27)
				)
				(justify left)
				(hide yes)
			)
		)
		(property "Component Type" "Standard"
			(at 0 -32.385 0)
			(effects
				(font
					(size 1.27 1.27)
				)
				(justify left)
				(hide yes)
			)
		)
		(property "Color" "Red/Green/Blue"
			(at 0 -34.29 0)
			(effects
				(font
					(size 1.27 1.27)
				)
				(justify left)
				(hide yes)
			)
		)
		(property "PackageDescription" "Surface Mount RGB LED with Intelligent Control, Body 5mm X 5mm"
			(at 0 -38.1 0)
			(effects
				(font
					(size 1.27 1.27)
				)
				(justify left)
				(hide yes)
			)
		)
		(property "Status" " "
			(at 0 -40.005 0)
			(effects
				(font
					(size 1.27 1.27)
				)
				(justify left)
				(hide yes)
			)
		)
		(property "Pin Count" "4"
			(at 0 -47.625 0)
			(effects
				(font
					(size 1.27 1.27)
				)
				(justify left)
				(hide yes)
			)
		)
		(property "Case" " "
			(at 0 -49.53 0)
			(effects
				(font
					(size 1.27 1.27)
				)
				(justify left)
				(hide yes)
			)
		)
		(property "Mounted" "Yes"
			(at 0 -51.435 0)
			(effects
				(font
					(size 1.27 1.27)
				)
				(justify left)
				(hide yes)
			)
		)
		(property "Socket" "No"
			(at 0 -53.34 0)
			(effects
				(font
					(size 1.27 1.27)
				)
				(justify left)
				(hide yes)
			)
		)
		(property "SMD" "Yes"
			(at 0 -55.245 0)
			(effects
				(font
					(size 1.27 1.27)
				)
				(justify left)
				(hide yes)
			)
		)
		(property "PressFit" "No"
			(at 0 -57.15 0)
			(effects
				(font
					(size 1.27 1.27)
				)
				(justify left)
				(hide yes)
			)
		)
		(property "Sense Comment" " "
			(at 0 -59.055 0)
			(effects
				(font
					(size 1.27 1.27)
				)
				(justify left)
				(hide yes)
			)
		)
		(property "Sense" "No"
			(at 0 -60.96 0)
			(effects
				(font
					(size 1.27 1.27)
				)
				(justify left)
				(hide yes)
			)
		)
		(property "Bonding" "No"
			(at 0 -62.865 0)
			(effects
				(font
					(size 1.27 1.27)
				)
				(justify left)
				(hide yes)
			)
		)
		(property "Status Comment" " "
			(at 0 -64.77 0)
			(effects
				(font
					(size 1.27 1.27)
				)
				(justify left)
				(hide yes)
			)
		)
		(property "ComponentHeight" "1.62mm"
			(at 0 -66.675 0)
			(effects
				(font
					(size 1.27 1.27)
				)
				(justify left)
				(hide yes)
			)
		)
		(property "Footprint Path" "PcbLib\\ICs And Semiconductors SMD.PcbLib"
			(at 0 -68.58 0)
			(effects
				(font
					(size 1.27 1.27)
				)
				(justify left)
				(hide yes)
			)
		)
		(property "ComponentLink1URL" " "
			(at 0 -74.295 0)
			(effects
				(font
					(size 1.27 1.27)
				)
				(justify left)
				(hide yes)
			)
		)
		(property "ComponentLink1Description" " "
			(at 0 -76.2 0)
			(effects
				(font
					(size 1.27 1.27)
				)
				(justify left)
				(hide yes)
			)
		)
		(property "ComponentLink2URL" " "
			(at 0 -78.105 0)
			(effects
				(font
					(size 1.27 1.27)
				)
				(justify left)
				(hide yes)
			)
		)
		(property "ComponentLink2Description" " "
			(at 0 -80.01 0)
			(effects
				(font
					(size 1.27 1.27)
				)
				(justify left)
				(hide yes)
			)
		)
		(property "Author" "CERN DEM JLC"
			(at 0 -81.915 0)
			(effects
				(font
					(size 1.27 1.27)
				)
				(justify left)
				(hide yes)
			)
		)
		(property "CreateDate" "11/27/18 00:00:00"
			(at 0 -83.82 0)
			(effects
				(font
					(size 1.27 1.27)
				)
				(justify left)
				(hide yes)
			)
		)
		(property "LatestRevisionDate" "11/27/18 00:00:00"
			(at 0 -85.725 0)
			(effects
				(font
					(size 1.27 1.27)
				)
				(justify left)
				(hide yes)
			)
		)
		(property "Database Table Name" "ICs And Semiconductors"
			(at 0 -87.63 0)
			(effects
				(font
					(size 1.27 1.27)
				)
				(justify left)
				(hide yes)
			)
		)
		(property "Library Name" "LEDs & Displays"
			(at 0 -89.535 0)
			(effects
				(font
					(size 1.27 1.27)
				)
				(justify left)
				(hide yes)
			)
		)
		(property "Footprint Library" "ICs And Semiconductors SMD"
			(at 0 -91.44 0)
			(effects
				(font
					(size 1.27 1.27)
				)
				(justify left)
				(hide yes)
			)
		)
		(property "License" "CC-BY-SA 4.0"
			(at 0 -93.345 0)
			(effects
				(font
					(size 1.27 1.27)
				)
				(justify left)
				(hide yes)
			)
		)
		(symbol "LED_EVERLIGHT_19-C47_RSGHBHC-5V01_2T_0_1"
			(rectangle
				(start 0 -12.7)
				(end 12.7 0)
				(stroke
					(width 0)
					(type solid)
				)
				(fill
					(type background)
				)
			)
			(polyline
				(pts
					(xy 7.874 -8.382) (xy 7.874 -4.318)
				)
				(stroke
					(width 0.254)
					(type solid)
				)
				(fill
					(type none)
				)
			)
			(polyline
				(pts
					(xy 8.382 -8.89) (xy 10.922 -8.89)
				)
				(stroke
					(width 0.254)
					(type solid)
				)
				(fill
					(type none)
				)
			)
			(polyline
				(pts
					(xy 8.382 -6.35) (xy 10.922 -6.35)
				)
				(stroke
					(width 0.254)
					(type solid)
				)
				(fill
					(type none)
				)
			)
			(polyline
				(pts
					(xy 8.382 -3.81) (xy 10.922 -3.81)
				)
				(stroke
					(width 0.254)
					(type solid)
				)
				(fill
					(type none)
				)
			)
			(polyline
				(pts
					(xy 10.541 -8.255) (xy 11.176 -7.62)
				)
				(stroke
					(width 0)
					(type solid)
				)
				(fill
					(type none)
				)
			)
			(polyline
				(pts
					(xy 10.541 -5.715) (xy 11.176 -5.08)
				)
				(stroke
					(width 0)
					(type solid)
				)
				(fill
					(type none)
				)
			)
			(polyline
				(pts
					(xy 10.541 -3.175) (xy 11.176 -2.54)
				)
				(stroke
					(width 0)
					(type solid)
				)
				(fill
					(type none)
				)
			)
			(polyline
				(pts
					(xy 10.668 -11.176) (xy 9.652 -11.176)
				)
				(stroke
					(width 0.254)
					(type solid)
				)
				(fill
					(type none)
				)
			)
			(polyline
				(pts
					(xy 10.668 -1.524) (xy 9.652 -1.524)
				)
				(stroke
					(width 0.254)
					(type solid)
				)
				(fill
					(type none)
				)
			)
			(polyline
				(pts
					(xy 11.049 -8.255) (xy 11.684 -7.62)
				)
				(stroke
					(width 0)
					(type solid)
				)
				(fill
					(type none)
				)
			)
			(polyline
				(pts
					(xy 11.049 -5.715) (xy 11.684 -5.08)
				)
				(stroke
					(width 0)
					(type solid)
				)
				(fill
					(type none)
				)
			)
			(polyline
				(pts
					(xy 11.049 -3.175) (xy 11.684 -2.54)
				)
				(stroke
					(width 0)
					(type solid)
				)
				(fill
					(type none)
				)
			)
			(polyline
				(pts
					(xy 12.446 -8.382) (xy 12.446 -4.318)
				)
				(stroke
					(width 0.254)
					(type solid)
				)
				(fill
					(type none)
				)
			)
			(polyline
				(pts
					(xy 9.144 -9.906) (xy 10.16 -8.89) (xy 9.144 -7.874) (xy 9.144 -9.906)
				)
				(stroke
					(width 0)
					(type solid)
				)
				(fill
					(type outline)
				)
			)
			(polyline
				(pts
					(xy 9.144 -7.366) (xy 10.16 -6.35) (xy 9.144 -5.334) (xy 9.144 -7.366)
				)
				(stroke
					(width 0)
					(type solid)
				)
				(fill
					(type outline)
				)
			)
			(polyline
				(pts
					(xy 9.144 -4.826) (xy 10.16 -3.81) (xy 9.144 -2.794) (xy 9.144 -4.826)
				)
				(stroke
					(width 0)
					(type solid)
				)
				(fill
					(type outline)
				)
			)
			(polyline
				(pts
					(xy 11.176 -7.62) (xy 10.922 -8.128) (xy 10.668 -7.874) (xy 11.176 -7.62)
				)
				(stroke
					(width 0)
					(type solid)
				)
				(fill
					(type outline)
				)
			)
			(polyline
				(pts
					(xy 11.176 -5.08) (xy 10.922 -5.588) (xy 10.668 -5.334) (xy 11.176 -5.08)
				)
				(stroke
					(width 0)
					(type solid)
				)
				(fill
					(type outline)
				)
			)
			(polyline
				(pts
					(xy 11.176 -2.54) (xy 10.922 -3.048) (xy 10.668 -2.794) (xy 11.176 -2.54)
				)
				(stroke
					(width 0)
					(type solid)
				)
				(fill
					(type outline)
				)
			)
			(polyline
				(pts
					(xy 11.684 -7.62) (xy 11.43 -8.128) (xy 11.176 -7.874) (xy 11.684 -7.62)
				)
				(stroke
					(width 0)
					(type solid)
				)
				(fill
					(type outline)
				)
			)
			(polyline
				(pts
					(xy 11.684 -5.08) (xy 11.43 -5.588) (xy 11.176 -5.334) (xy 11.684 -5.08)
				)
				(stroke
					(width 0)
					(type solid)
				)
				(fill
					(type outline)
				)
			)
			(polyline
				(pts
					(xy 11.684 -2.54) (xy 11.43 -3.048) (xy 11.176 -2.794) (xy 11.684 -2.54)
				)
				(stroke
					(width 0)
					(type solid)
				)
				(fill
					(type outline)
				)
			)
			(arc
				(start 7.874 -8.382)
				(mid 8.6923 -10.3577)
				(end 10.668 -11.176)
				(stroke
					(width 0.254)
					(type solid)
				)
				(fill
					(type none)
				)
			)
			(arc
				(start 9.652 -11.176)
				(mid 11.6277 -10.3577)
				(end 12.446 -8.382)
				(stroke
					(width 0.254)
					(type solid)
				)
				(fill
					(type none)
				)
			)
			(rectangle
				(start 10.033 -9.906)
				(end 10.287 -7.874)
				(stroke
					(width 0)
					(type solid)
				)
				(fill
					(type outline)
				)
			)
			(rectangle
				(start 10.033 -7.366)
				(end 10.287 -5.334)
				(stroke
					(width 0)
					(type solid)
				)
				(fill
					(type outline)
				)
			)
			(rectangle
				(start 10.033 -4.826)
				(end 10.287 -2.794)
				(stroke
					(width 0)
					(type solid)
				)
				(fill
					(type outline)
				)
			)
			(arc
				(start 10.668 -1.524)
				(mid 8.6923 -2.3423)
				(end 7.874 -4.318)
				(stroke
					(width 0.254)
					(type solid)
				)
				(fill
					(type none)
				)
			)
			(arc
				(start 12.446 -4.318)
				(mid 11.6277 -2.3423)
				(end 9.652 -1.524)
				(stroke
					(width 0.254)
					(type solid)
				)
				(fill
					(type none)
				)
			)
		)
		(symbol "LED_EVERLIGHT_19-C47_RSGHBHC-5V01_2T_1_1"
			(pin output line
				(at -5.08 -5.08 0)
				(length 5.08)
				(name "DOUT"
					(effects
						(font
							(size 1.524 1.524)
						)
					)
				)
				(number "1"
					(effects
						(font
							(size 1.524 1.524)
						)
					)
				)
			)
			(pin power_in line
				(at -5.08 -7.62 0)
				(length 5.08)
				(name "VDD"
					(effects
						(font
							(size 1.524 1.524)
						)
					)
				)
				(number "2"
					(effects
						(font
							(size 1.524 1.524)
						)
					)
				)
			)
			(pin input line
				(at -5.08 -2.54 0)
				(length 5.08)
				(name "DIN"
					(effects
						(font
							(size 1.524 1.524)
						)
					)
				)
				(number "3"
					(effects
						(font
							(size 1.524 1.524)
						)
					)
				)
			)
			(pin power_in line
				(at -5.08 -10.16 0)
				(length 5.08)
				(name "GND"
					(effects
						(font
							(size 1.524 1.524)
						)
					)
				)
				(number "4"
					(effects
						(font
							(size 1.524 1.524)
						)
					)
				)
			)
		)
	)
	(symbol "M12V_VME"
		(power)
		(exclude_from_sim no)
		(in_bom yes)
		(on_board yes)
		(property "Reference" "#PWR0667"
			(at 0 0 0)
			(effects
				(font
					(size 1.27 1.27)
				)
				(hide yes)
			)
		)
		(property "Value" "M12V_VME"
			(at 0 -3.81 90)
			(effects
				(font
					(size 1.27 1.27)
				)
				(justify right)
			)
		)
		(property "Footprint" ""
			(at 0 0 0)
			(effects
				(font
					(size 1.27 1.27)
				)
				(hide yes)
			)
		)
		(property "Datasheet" ""
			(at 0 0 0)
			(effects
				(font
					(size 1.27 1.27)
				)
				(hide yes)
			)
		)
		(property "Description" ""
			(at 0 0 0)
			(effects
				(font
					(size 1.27 1.27)
				)
				(hide yes)
			)
		)
		(property "ki_keywords" "power-flag"
			(at 0 0 0)
			(effects
				(font
					(size 1.27 1.27)
				)
				(hide yes)
			)
		)
		(symbol "M12V_VME_0_0"
			(polyline
				(pts
					(xy 0 0) (xy 0 -1.27)
				)
				(stroke
					(width 0.254)
					(type solid)
				)
				(fill
					(type none)
				)
			)
			(polyline
				(pts
					(xy -0.635 -1.27) (xy 0.635 -1.27) (xy 0 -2.54) (xy -0.635 -1.27)
				)
				(stroke
					(width 0.254)
					(type solid)
				)
				(fill
					(type none)
				)
			)
			(pin power_in line
				(at 0 0 0)
				(length 0) hide
				(name "M12V_VME"
					(effects
						(font
							(size 1.27 1.27)
						)
					)
				)
				(number ""
					(effects
						(font
							(size 1.27 1.27)
						)
					)
				)
			)
		)
	)
	(symbol "MGT_0V85"
		(power)
		(exclude_from_sim no)
		(in_bom yes)
		(on_board yes)
		(property "Reference" "#PWR0108"
			(at 0 0 0)
			(effects
				(font
					(size 1.27 1.27)
				)
				(hide yes)
			)
		)
		(property "Value" "MGT_0V85"
			(at 0 -3.81 90)
			(effects
				(font
					(size 1.27 1.27)
				)
				(justify right)
			)
		)
		(property "Footprint" ""
			(at 0 0 0)
			(effects
				(font
					(size 1.27 1.27)
				)
				(hide yes)
			)
		)
		(property "Datasheet" ""
			(at 0 0 0)
			(effects
				(font
					(size 1.27 1.27)
				)
				(hide yes)
			)
		)
		(property "Description" ""
			(at 0 0 0)
			(effects
				(font
					(size 1.27 1.27)
				)
				(hide yes)
			)
		)
		(property "ki_keywords" "power-flag"
			(at 0 0 0)
			(effects
				(font
					(size 1.27 1.27)
				)
				(hide yes)
			)
		)
		(symbol "MGT_0V85_0_0"
			(polyline
				(pts
					(xy -1.27 -2.54) (xy 1.27 -2.54)
				)
				(stroke
					(width 0.254)
					(type solid)
				)
				(fill
					(type none)
				)
			)
			(polyline
				(pts
					(xy 0 0) (xy 0 -2.54)
				)
				(stroke
					(width 0.254)
					(type solid)
				)
				(fill
					(type none)
				)
			)
			(pin power_in line
				(at 0 0 0)
				(length 0) hide
				(name "MGT_0V85"
					(effects
						(font
							(size 1.27 1.27)
						)
					)
				)
				(number ""
					(effects
						(font
							(size 1.27 1.27)
						)
					)
				)
			)
		)
	)
	(symbol "MGT_0V9"
		(power)
		(exclude_from_sim no)
		(in_bom yes)
		(on_board yes)
		(property "Reference" "#PWR0111"
			(at 0 0 0)
			(effects
				(font
					(size 1.27 1.27)
				)
				(hide yes)
			)
		)
		(property "Value" "MGT_0V9"
			(at 0 -3.81 90)
			(effects
				(font
					(size 1.27 1.27)
				)
				(justify right)
			)
		)
		(property "Footprint" ""
			(at 0 0 0)
			(effects
				(font
					(size 1.27 1.27)
				)
				(hide yes)
			)
		)
		(property "Datasheet" ""
			(at 0 0 0)
			(effects
				(font
					(size 1.27 1.27)
				)
				(hide yes)
			)
		)
		(property "Description" ""
			(at 0 0 0)
			(effects
				(font
					(size 1.27 1.27)
				)
				(hide yes)
			)
		)
		(property "ki_keywords" "power-flag"
			(at 0 0 0)
			(effects
				(font
					(size 1.27 1.27)
				)
				(hide yes)
			)
		)
		(symbol "MGT_0V9_0_0"
			(polyline
				(pts
					(xy -1.27 -2.54) (xy 1.27 -2.54)
				)
				(stroke
					(width 0.254)
					(type solid)
				)
				(fill
					(type none)
				)
			)
			(polyline
				(pts
					(xy 0 0) (xy 0 -2.54)
				)
				(stroke
					(width 0.254)
					(type solid)
				)
				(fill
					(type none)
				)
			)
			(pin power_in line
				(at 0 0 0)
				(length 0) hide
				(name "MGT_0V9"
					(effects
						(font
							(size 1.27 1.27)
						)
					)
				)
				(number ""
					(effects
						(font
							(size 1.27 1.27)
						)
					)
				)
			)
		)
	)
	(symbol "MGT_1V2"
		(power)
		(exclude_from_sim no)
		(in_bom yes)
		(on_board yes)
		(property "Reference" "#PWR0112"
			(at 0 0 0)
			(effects
				(font
					(size 1.27 1.27)
				)
				(hide yes)
			)
		)
		(property "Value" "MGT_1V2"
			(at 0 -3.81 90)
			(effects
				(font
					(size 1.27 1.27)
				)
				(justify right)
			)
		)
		(property "Footprint" ""
			(at 0 0 0)
			(effects
				(font
					(size 1.27 1.27)
				)
				(hide yes)
			)
		)
		(property "Datasheet" ""
			(at 0 0 0)
			(effects
				(font
					(size 1.27 1.27)
				)
				(hide yes)
			)
		)
		(property "Description" ""
			(at 0 0 0)
			(effects
				(font
					(size 1.27 1.27)
				)
				(hide yes)
			)
		)
		(property "ki_keywords" "power-flag"
			(at 0 0 0)
			(effects
				(font
					(size 1.27 1.27)
				)
				(hide yes)
			)
		)
		(symbol "MGT_1V2_0_0"
			(polyline
				(pts
					(xy -1.27 -2.54) (xy 1.27 -2.54)
				)
				(stroke
					(width 0.254)
					(type solid)
				)
				(fill
					(type none)
				)
			)
			(polyline
				(pts
					(xy 0 0) (xy 0 -2.54)
				)
				(stroke
					(width 0.254)
					(type solid)
				)
				(fill
					(type none)
				)
			)
			(pin power_in line
				(at 0 0 0)
				(length 0) hide
				(name "MGT_1V2"
					(effects
						(font
							(size 1.27 1.27)
						)
					)
				)
				(number ""
					(effects
						(font
							(size 1.27 1.27)
						)
					)
				)
			)
		)
	)
	(symbol "MGT_1V8"
		(power)
		(exclude_from_sim no)
		(in_bom yes)
		(on_board yes)
		(property "Reference" "#PWR0107"
			(at 0 0 0)
			(effects
				(font
					(size 1.27 1.27)
				)
				(hide yes)
			)
		)
		(property "Value" "MGT_1V8"
			(at 0 -3.81 90)
			(effects
				(font
					(size 1.27 1.27)
				)
				(justify right)
			)
		)
		(property "Footprint" ""
			(at 0 0 0)
			(effects
				(font
					(size 1.27 1.27)
				)
				(hide yes)
			)
		)
		(property "Datasheet" ""
			(at 0 0 0)
			(effects
				(font
					(size 1.27 1.27)
				)
				(hide yes)
			)
		)
		(property "Description" ""
			(at 0 0 0)
			(effects
				(font
					(size 1.27 1.27)
				)
				(hide yes)
			)
		)
		(property "ki_keywords" "power-flag"
			(at 0 0 0)
			(effects
				(font
					(size 1.27 1.27)
				)
				(hide yes)
			)
		)
		(symbol "MGT_1V8_0_0"
			(polyline
				(pts
					(xy -1.27 -2.54) (xy 1.27 -2.54)
				)
				(stroke
					(width 0.254)
					(type solid)
				)
				(fill
					(type none)
				)
			)
			(polyline
				(pts
					(xy 0 0) (xy 0 -2.54)
				)
				(stroke
					(width 0.254)
					(type solid)
				)
				(fill
					(type none)
				)
			)
			(pin power_in line
				(at 0 0 0)
				(length 0) hide
				(name "MGT_1V8"
					(effects
						(font
							(size 1.27 1.27)
						)
					)
				)
				(number ""
					(effects
						(font
							(size 1.27 1.27)
						)
					)
				)
			)
		)
	)
	(symbol "P0V85"
		(power)
		(exclude_from_sim no)
		(in_bom yes)
		(on_board yes)
		(property "Reference" "#PWR0199"
			(at 0 0 0)
			(effects
				(font
					(size 1.27 1.27)
				)
				(hide yes)
			)
		)
		(property "Value" "P0V85"
			(at 0 -3.81 0)
			(effects
				(font
					(size 1.27 1.27)
				)
			)
		)
		(property "Footprint" ""
			(at 0 0 0)
			(effects
				(font
					(size 1.27 1.27)
				)
				(hide yes)
			)
		)
		(property "Datasheet" ""
			(at 0 0 0)
			(effects
				(font
					(size 1.27 1.27)
				)
				(hide yes)
			)
		)
		(property "Description" ""
			(at 0 0 0)
			(effects
				(font
					(size 1.27 1.27)
				)
				(hide yes)
			)
		)
		(property "ki_keywords" "power-flag"
			(at 0 0 0)
			(effects
				(font
					(size 1.27 1.27)
				)
				(hide yes)
			)
		)
		(symbol "P0V85_0_0"
			(polyline
				(pts
					(xy -1.27 -2.54) (xy 1.27 -2.54)
				)
				(stroke
					(width 0.254)
					(type solid)
				)
				(fill
					(type none)
				)
			)
			(polyline
				(pts
					(xy 0 0) (xy 0 -2.54)
				)
				(stroke
					(width 0.254)
					(type solid)
				)
				(fill
					(type none)
				)
			)
			(pin power_in line
				(at 0 0 0)
				(length 0) hide
				(name "P0V85"
					(effects
						(font
							(size 1.27 1.27)
						)
					)
				)
				(number ""
					(effects
						(font
							(size 1.27 1.27)
						)
					)
				)
			)
		)
	)
	(symbol "P12V"
		(power)
		(exclude_from_sim no)
		(in_bom yes)
		(on_board yes)
		(property "Reference" "#PWR0678"
			(at 0 0 0)
			(effects
				(font
					(size 1.27 1.27)
				)
				(hide yes)
			)
		)
		(property "Value" "P12V"
			(at 0 -6.096 90)
			(effects
				(font
					(size 1.27 1.27)
				)
			)
		)
		(property "Footprint" ""
			(at 0 0 0)
			(effects
				(font
					(size 1.27 1.27)
				)
				(hide yes)
			)
		)
		(property "Datasheet" ""
			(at 0 0 0)
			(effects
				(font
					(size 1.27 1.27)
				)
				(hide yes)
			)
		)
		(property "Description" ""
			(at 0 0 0)
			(effects
				(font
					(size 1.27 1.27)
				)
				(hide yes)
			)
		)
		(property "ki_keywords" "power-flag"
			(at 0 0 0)
			(effects
				(font
					(size 1.27 1.27)
				)
				(hide yes)
			)
		)
		(symbol "P12V_0_0"
			(polyline
				(pts
					(xy -1.27 -2.54) (xy 1.27 -2.54)
				)
				(stroke
					(width 0.254)
					(type solid)
				)
				(fill
					(type none)
				)
			)
			(polyline
				(pts
					(xy 0 0) (xy 0 -2.54)
				)
				(stroke
					(width 0.254)
					(type solid)
				)
				(fill
					(type none)
				)
			)
			(pin power_in line
				(at 0 0 0)
				(length 0) hide
				(name "P12V"
					(effects
						(font
							(size 1.27 1.27)
						)
					)
				)
				(number ""
					(effects
						(font
							(size 1.27 1.27)
						)
					)
				)
			)
		)
	)
	(symbol "P1V2"
		(power)
		(exclude_from_sim no)
		(in_bom yes)
		(on_board yes)
		(property "Reference" "#PWR0587"
			(at 0 0 0)
			(effects
				(font
					(size 1.27 1.27)
				)
				(hide yes)
			)
		)
		(property "Value" "P1V2"
			(at 0 -3.81 0)
			(effects
				(font
					(size 1.27 1.27)
				)
			)
		)
		(property "Footprint" ""
			(at 0 0 0)
			(effects
				(font
					(size 1.27 1.27)
				)
				(hide yes)
			)
		)
		(property "Datasheet" ""
			(at 0 0 0)
			(effects
				(font
					(size 1.27 1.27)
				)
				(hide yes)
			)
		)
		(property "Description" ""
			(at 0 0 0)
			(effects
				(font
					(size 1.27 1.27)
				)
				(hide yes)
			)
		)
		(property "ki_keywords" "power-flag"
			(at 0 0 0)
			(effects
				(font
					(size 1.27 1.27)
				)
				(hide yes)
			)
		)
		(symbol "P1V2_0_0"
			(polyline
				(pts
					(xy -1.27 -2.54) (xy 1.27 -2.54)
				)
				(stroke
					(width 0.254)
					(type solid)
				)
				(fill
					(type none)
				)
			)
			(polyline
				(pts
					(xy 0 0) (xy 0 -2.54)
				)
				(stroke
					(width 0.254)
					(type solid)
				)
				(fill
					(type none)
				)
			)
			(pin power_in line
				(at 0 0 0)
				(length 0) hide
				(name "P1V2"
					(effects
						(font
							(size 1.27 1.27)
						)
					)
				)
				(number ""
					(effects
						(font
							(size 1.27 1.27)
						)
					)
				)
			)
		)
	)
	(symbol "P1V8"
		(power)
		(exclude_from_sim no)
		(in_bom yes)
		(on_board yes)
		(property "Reference" "#PWR0185"
			(at 0 0 0)
			(effects
				(font
					(size 1.27 1.27)
				)
				(hide yes)
			)
		)
		(property "Value" "P1V8"
			(at 0 -3.81 0)
			(effects
				(font
					(size 1.27 1.27)
				)
			)
		)
		(property "Footprint" ""
			(at 0 0 0)
			(effects
				(font
					(size 1.27 1.27)
				)
				(hide yes)
			)
		)
		(property "Datasheet" ""
			(at 0 0 0)
			(effects
				(font
					(size 1.27 1.27)
				)
				(hide yes)
			)
		)
		(property "Description" ""
			(at 0 0 0)
			(effects
				(font
					(size 1.27 1.27)
				)
				(hide yes)
			)
		)
		(property "ki_keywords" "power-flag"
			(at 0 0 0)
			(effects
				(font
					(size 1.27 1.27)
				)
				(hide yes)
			)
		)
		(symbol "P1V8_0_0"
			(polyline
				(pts
					(xy -1.27 -2.54) (xy 1.27 -2.54)
				)
				(stroke
					(width 0.254)
					(type solid)
				)
				(fill
					(type none)
				)
			)
			(polyline
				(pts
					(xy 0 0) (xy 0 -2.54)
				)
				(stroke
					(width 0.254)
					(type solid)
				)
				(fill
					(type none)
				)
			)
			(pin power_in line
				(at 0 0 0)
				(length 0) hide
				(name "P1V8"
					(effects
						(font
							(size 1.27 1.27)
						)
					)
				)
				(number ""
					(effects
						(font
							(size 1.27 1.27)
						)
					)
				)
			)
		)
	)
	(symbol "P2V5"
		(power)
		(exclude_from_sim no)
		(in_bom yes)
		(on_board yes)
		(property "Reference" "#PWR0616"
			(at 0 0 0)
			(effects
				(font
					(size 1.27 1.27)
				)
				(hide yes)
			)
		)
		(property "Value" "P2V5"
			(at 0 -3.81 0)
			(effects
				(font
					(size 1.27 1.27)
				)
			)
		)
		(property "Footprint" ""
			(at 0 0 0)
			(effects
				(font
					(size 1.27 1.27)
				)
				(hide yes)
			)
		)
		(property "Datasheet" ""
			(at 0 0 0)
			(effects
				(font
					(size 1.27 1.27)
				)
				(hide yes)
			)
		)
		(property "Description" ""
			(at 0 0 0)
			(effects
				(font
					(size 1.27 1.27)
				)
				(hide yes)
			)
		)
		(property "ki_keywords" "power-flag"
			(at 0 0 0)
			(effects
				(font
					(size 1.27 1.27)
				)
				(hide yes)
			)
		)
		(symbol "P2V5_0_0"
			(polyline
				(pts
					(xy -1.27 -2.54) (xy 1.27 -2.54)
				)
				(stroke
					(width 0.254)
					(type solid)
				)
				(fill
					(type none)
				)
			)
			(polyline
				(pts
					(xy 0 0) (xy 0 -2.54)
				)
				(stroke
					(width 0.254)
					(type solid)
				)
				(fill
					(type none)
				)
			)
			(pin power_in line
				(at 0 0 0)
				(length 0) hide
				(name "P2V5"
					(effects
						(font
							(size 1.27 1.27)
						)
					)
				)
				(number ""
					(effects
						(font
							(size 1.27 1.27)
						)
					)
				)
			)
		)
	)
	(symbol "P3V3"
		(power)
		(exclude_from_sim no)
		(in_bom yes)
		(on_board yes)
		(property "Reference" "#PWR0202"
			(at 0 0 0)
			(effects
				(font
					(size 1.27 1.27)
				)
				(hide yes)
			)
		)
		(property "Value" "P3V3"
			(at 0 -3.81 0)
			(effects
				(font
					(size 1.27 1.27)
				)
			)
		)
		(property "Footprint" ""
			(at 0 0 0)
			(effects
				(font
					(size 1.27 1.27)
				)
				(hide yes)
			)
		)
		(property "Datasheet" ""
			(at 0 0 0)
			(effects
				(font
					(size 1.27 1.27)
				)
				(hide yes)
			)
		)
		(property "Description" ""
			(at 0 0 0)
			(effects
				(font
					(size 1.27 1.27)
				)
				(hide yes)
			)
		)
		(property "ki_keywords" "power-flag"
			(at 0 0 0)
			(effects
				(font
					(size 1.27 1.27)
				)
				(hide yes)
			)
		)
		(symbol "P3V3_0_0"
			(polyline
				(pts
					(xy -1.27 -2.54) (xy 1.27 -2.54)
				)
				(stroke
					(width 0.254)
					(type solid)
				)
				(fill
					(type none)
				)
			)
			(polyline
				(pts
					(xy 0 0) (xy 0 -2.54)
				)
				(stroke
					(width 0.254)
					(type solid)
				)
				(fill
					(type none)
				)
			)
			(pin power_in line
				(at 0 0 0)
				(length 0) hide
				(name "P3V3"
					(effects
						(font
							(size 1.27 1.27)
						)
					)
				)
				(number ""
					(effects
						(font
							(size 1.27 1.27)
						)
					)
				)
			)
		)
	)
	(symbol "P3V3_CLK"
		(power)
		(exclude_from_sim no)
		(in_bom yes)
		(on_board yes)
		(property "Reference" "#PWR"
			(at 0 0 0)
			(effects
				(font
					(size 1.27 1.27)
				)
			)
		)
		(property "Value" "P3V3_CLK"
			(at 0 3.81 0)
			(effects
				(font
					(size 1.27 1.27)
				)
			)
		)
		(property "Footprint" ""
			(at 0 0 0)
			(effects
				(font
					(size 1.27 1.27)
				)
				(hide yes)
			)
		)
		(property "Datasheet" ""
			(at 0 0 0)
			(effects
				(font
					(size 1.27 1.27)
				)
				(hide yes)
			)
		)
		(property "Description" "Symbol zasilania tworzy globalną etykietę z nazwą 'P3V3_CLK'"
			(at 0 0 0)
			(effects
				(font
					(size 1.27 1.27)
				)
				(hide yes)
			)
		)
		(property "ki_keywords" "power-flag"
			(at 0 0 0)
			(effects
				(font
					(size 1.27 1.27)
				)
				(hide yes)
			)
		)
		(symbol "P3V3_CLK_0_0"
			(polyline
				(pts
					(xy -1.27 -2.54) (xy 1.27 -2.54)
				)
				(stroke
					(width 0.254)
					(type solid)
				)
				(fill
					(type none)
				)
			)
			(polyline
				(pts
					(xy 0 0) (xy 0 -2.54)
				)
				(stroke
					(width 0.254)
					(type solid)
				)
				(fill
					(type none)
				)
			)
			(pin power_in line
				(at 0 0 0)
				(length 0) hide
				(name "P3V3_CLK"
					(effects
						(font
							(size 1.27 1.27)
						)
					)
				)
				(number ""
					(effects
						(font
							(size 1.27 1.27)
						)
					)
				)
			)
		)
	)
	(symbol "P5V_STDBY_VME"
		(power)
		(exclude_from_sim no)
		(in_bom yes)
		(on_board yes)
		(property "Reference" "#PWR0671"
			(at 0 0 0)
			(effects
				(font
					(size 1.27 1.27)
				)
				(hide yes)
			)
		)
		(property "Value" "P5V_STDBY_VME"
			(at 0 -3.81 90)
			(effects
				(font
					(size 1.27 1.27)
				)
				(justify right)
			)
		)
		(property "Footprint" ""
			(at 0 0 0)
			(effects
				(font
					(size 1.27 1.27)
				)
				(hide yes)
			)
		)
		(property "Datasheet" ""
			(at 0 0 0)
			(effects
				(font
					(size 1.27 1.27)
				)
				(hide yes)
			)
		)
		(property "Description" ""
			(at 0 0 0)
			(effects
				(font
					(size 1.27 1.27)
				)
				(hide yes)
			)
		)
		(property "ki_keywords" "power-flag"
			(at 0 0 0)
			(effects
				(font
					(size 1.27 1.27)
				)
				(hide yes)
			)
		)
		(symbol "P5V_STDBY_VME_0_0"
			(polyline
				(pts
					(xy 0 0) (xy 0 -1.27)
				)
				(stroke
					(width 0.254)
					(type solid)
				)
				(fill
					(type none)
				)
			)
			(polyline
				(pts
					(xy -0.635 -1.27) (xy 0.635 -1.27) (xy 0 -2.54) (xy -0.635 -1.27)
				)
				(stroke
					(width 0.254)
					(type solid)
				)
				(fill
					(type none)
				)
			)
			(pin power_in line
				(at 0 0 0)
				(length 0) hide
				(name "P5V_STDBY_VME"
					(effects
						(font
							(size 1.27 1.27)
						)
					)
				)
				(number ""
					(effects
						(font
							(size 1.27 1.27)
						)
					)
				)
			)
		)
	)
	(symbol "P5V_VME"
		(power)
		(exclude_from_sim no)
		(in_bom yes)
		(on_board yes)
		(property "Reference" "#PWR0672"
			(at 0 0 0)
			(effects
				(font
					(size 1.27 1.27)
				)
				(hide yes)
			)
		)
		(property "Value" "P5V_VME"
			(at 0 -3.81 90)
			(effects
				(font
					(size 1.27 1.27)
				)
				(justify right)
			)
		)
		(property "Footprint" ""
			(at 0 0 0)
			(effects
				(font
					(size 1.27 1.27)
				)
				(hide yes)
			)
		)
		(property "Datasheet" ""
			(at 0 0 0)
			(effects
				(font
					(size 1.27 1.27)
				)
				(hide yes)
			)
		)
		(property "Description" ""
			(at 0 0 0)
			(effects
				(font
					(size 1.27 1.27)
				)
				(hide yes)
			)
		)
		(property "ki_keywords" "power-flag"
			(at 0 0 0)
			(effects
				(font
					(size 1.27 1.27)
				)
				(hide yes)
			)
		)
		(symbol "P5V_VME_0_0"
			(polyline
				(pts
					(xy 0 0) (xy 0 -1.27)
				)
				(stroke
					(width 0.254)
					(type solid)
				)
				(fill
					(type none)
				)
			)
			(polyline
				(pts
					(xy -0.635 -1.27) (xy 0.635 -1.27) (xy 0 -2.54) (xy -0.635 -1.27)
				)
				(stroke
					(width 0.254)
					(type solid)
				)
				(fill
					(type none)
				)
			)
			(pin power_in line
				(at 0 0 0)
				(length 0) hide
				(name "P5V_VME"
					(effects
						(font
							(size 1.27 1.27)
						)
					)
				)
				(number ""
					(effects
						(font
							(size 1.27 1.27)
						)
					)
				)
			)
		)
	)
	(symbol "SN74LXCH8T245PWR"
		(exclude_from_sim no)
		(in_bom yes)
		(on_board yes)
		(property "Reference" "IC"
			(at 8.89 3.937 0)
			(effects
				(font
					(size 1.27 1.27)
				)
			)
		)
		(property "Value" "SN74LXCH8T245PWR"
			(at 7.493 1.905 0)
			(effects
				(font
					(size 1.27 1.27)
				)
			)
		)
		(property "Footprint" "ICs And Semiconductors SMD:SOP65P640X120-24N"
			(at 0 0 0)
			(effects
				(font
					(size 1.27 1.27)
				)
				(hide yes)
			)
		)
		(property "Datasheet" ""
			(at 0 0 0)
			(effects
				(font
					(size 1.27 1.27)
				)
				(hide yes)
			)
		)
		(property "Description" ""
			(at 0 0 0)
			(effects
				(font
					(size 1.27 1.27)
				)
				(hide yes)
			)
		)
		(symbol "SN74LXCH8T245PWR_0_1"
			(rectangle
				(start 0 0)
				(end 15.24 -42.545)
				(stroke
					(width 0)
					(type solid)
				)
				(fill
					(type background)
				)
			)
			(pin bidirectional line
				(at -5.08 -27.94 0)
				(length 5.08)
				(name "A8"
					(effects
						(font
							(size 1.524 1.524)
						)
					)
				)
				(number "10"
					(effects
						(font
							(size 1.524 1.524)
						)
					)
				)
			)
			(pin power_in line
				(at -5.08 -40.64 0)
				(length 5.08)
				(name "GND"
					(effects
						(font
							(size 1.524 1.524)
						)
					)
				)
				(number "11"
					(effects
						(font
							(size 1.524 1.524)
						)
					)
				)
			)
			(pin power_in line
				(at -5.08 -38.1 0)
				(length 5.08)
				(name "GND"
					(effects
						(font
							(size 1.524 1.524)
						)
					)
				)
				(number "12"
					(effects
						(font
							(size 1.524 1.524)
						)
					)
				)
			)
			(pin power_in line
				(at 20.32 -40.64 180)
				(length 5.08)
				(name "GND"
					(effects
						(font
							(size 1.524 1.524)
						)
					)
				)
				(number "13"
					(effects
						(font
							(size 1.524 1.524)
						)
					)
				)
			)
			(pin bidirectional line
				(at 20.32 -27.94 180)
				(length 5.08)
				(name "B8"
					(effects
						(font
							(size 1.524 1.524)
						)
					)
				)
				(number "14"
					(effects
						(font
							(size 1.524 1.524)
						)
					)
				)
			)
			(pin bidirectional line
				(at 20.32 -25.4 180)
				(length 5.08)
				(name "B7"
					(effects
						(font
							(size 1.524 1.524)
						)
					)
				)
				(number "15"
					(effects
						(font
							(size 1.524 1.524)
						)
					)
				)
			)
			(pin bidirectional line
				(at 20.32 -22.86 180)
				(length 5.08)
				(name "B6"
					(effects
						(font
							(size 1.524 1.524)
						)
					)
				)
				(number "16"
					(effects
						(font
							(size 1.524 1.524)
						)
					)
				)
			)
			(pin bidirectional line
				(at 20.32 -20.32 180)
				(length 5.08)
				(name "B5"
					(effects
						(font
							(size 1.524 1.524)
						)
					)
				)
				(number "17"
					(effects
						(font
							(size 1.524 1.524)
						)
					)
				)
			)
			(pin bidirectional line
				(at 20.32 -17.78 180)
				(length 5.08)
				(name "B4"
					(effects
						(font
							(size 1.524 1.524)
						)
					)
				)
				(number "18"
					(effects
						(font
							(size 1.524 1.524)
						)
					)
				)
			)
			(pin bidirectional line
				(at 20.32 -15.24 180)
				(length 5.08)
				(name "B3"
					(effects
						(font
							(size 1.524 1.524)
						)
					)
				)
				(number "19"
					(effects
						(font
							(size 1.524 1.524)
						)
					)
				)
			)
			(pin bidirectional line
				(at 20.32 -12.7 180)
				(length 5.08)
				(name "B2"
					(effects
						(font
							(size 1.524 1.524)
						)
					)
				)
				(number "20"
					(effects
						(font
							(size 1.524 1.524)
						)
					)
				)
			)
			(pin bidirectional line
				(at 20.32 -10.16 180)
				(length 5.08)
				(name "B1"
					(effects
						(font
							(size 1.524 1.524)
						)
					)
				)
				(number "21"
					(effects
						(font
							(size 1.524 1.524)
						)
					)
				)
			)
			(pin input line
				(at -5.08 -2.54 0)
				(length 5.08)
				(name "~{OE}"
					(effects
						(font
							(size 1.524 1.524)
						)
					)
				)
				(number "22"
					(effects
						(font
							(size 1.524 1.524)
						)
					)
				)
			)
			(pin bidirectional line
				(at -5.08 -12.7 0)
				(length 5.08)
				(name "A2"
					(effects
						(font
							(size 1.524 1.524)
						)
					)
				)
				(number "3"
					(effects
						(font
							(size 1.524 1.524)
						)
					)
				)
			)
			(pin bidirectional line
				(at -5.08 -15.24 0)
				(length 5.08)
				(name "A3"
					(effects
						(font
							(size 1.524 1.524)
						)
					)
				)
				(number "5"
					(effects
						(font
							(size 1.524 1.524)
						)
					)
				)
			)
			(pin bidirectional line
				(at -5.08 -17.78 0)
				(length 5.08)
				(name "A4"
					(effects
						(font
							(size 1.524 1.524)
						)
					)
				)
				(number "6"
					(effects
						(font
							(size 1.524 1.524)
						)
					)
				)
			)
			(pin bidirectional line
				(at -5.08 -20.32 0)
				(length 5.08)
				(name "A5"
					(effects
						(font
							(size 1.524 1.524)
						)
					)
				)
				(number "7"
					(effects
						(font
							(size 1.524 1.524)
						)
					)
				)
			)
			(pin bidirectional line
				(at -5.08 -22.86 0)
				(length 5.08)
				(name "A6"
					(effects
						(font
							(size 1.524 1.524)
						)
					)
				)
				(number "8"
					(effects
						(font
							(size 1.524 1.524)
						)
					)
				)
			)
			(pin bidirectional line
				(at -5.08 -25.4 0)
				(length 5.08)
				(name "A7"
					(effects
						(font
							(size 1.524 1.524)
						)
					)
				)
				(number "9"
					(effects
						(font
							(size 1.524 1.524)
						)
					)
				)
			)
		)
		(symbol "SN74LXCH8T245PWR_1_1"
			(pin power_in line
				(at -5.08 -33.02 0)
				(length 5.08)
				(name "VCCA"
					(effects
						(font
							(size 1.524 1.524)
						)
					)
				)
				(number "1"
					(effects
						(font
							(size 1.524 1.524)
						)
					)
				)
			)
			(pin input line
				(at -5.08 -5.08 0)
				(length 5.08)
				(name "DIR"
					(effects
						(font
							(size 1.524 1.524)
						)
					)
				)
				(number "2"
					(effects
						(font
							(size 1.524 1.524)
						)
					)
				)
			)
			(pin power_in line
				(at 20.32 -33.02 180)
				(length 5.08)
				(name "VCCB"
					(effects
						(font
							(size 1.524 1.524)
						)
					)
				)
				(number "23"
					(effects
						(font
							(size 1.524 1.524)
						)
					)
				)
			)
			(pin power_in line
				(at 20.32 -35.56 180)
				(length 5.08)
				(name "VCCB"
					(effects
						(font
							(size 1.524 1.524)
						)
					)
				)
				(number "24"
					(effects
						(font
							(size 1.524 1.524)
						)
					)
				)
			)
			(pin bidirectional line
				(at -5.08 -10.16 0)
				(length 5.08)
				(name "A1"
					(effects
						(font
							(size 1.524 1.524)
						)
					)
				)
				(number "4"
					(effects
						(font
							(size 1.524 1.524)
						)
					)
				)
			)
		)
	)
	(symbol "VCC_PSDDR_PLL"
		(power)
		(exclude_from_sim no)
		(in_bom yes)
		(on_board yes)
		(property "Reference" "#PWR0197"
			(at 0 0 0)
			(effects
				(font
					(size 1.27 1.27)
				)
				(hide yes)
			)
		)
		(property "Value" "VCC_PSDDR_PLL"
			(at 0 -3.81 0)
			(effects
				(font
					(size 1.27 1.27)
				)
			)
		)
		(property "Footprint" ""
			(at 0 0 0)
			(effects
				(font
					(size 1.27 1.27)
				)
				(hide yes)
			)
		)
		(property "Datasheet" ""
			(at 0 0 0)
			(effects
				(font
					(size 1.27 1.27)
				)
				(hide yes)
			)
		)
		(property "Description" ""
			(at 0 0 0)
			(effects
				(font
					(size 1.27 1.27)
				)
				(hide yes)
			)
		)
		(property "ki_keywords" "power-flag"
			(at 0 0 0)
			(effects
				(font
					(size 1.27 1.27)
				)
				(hide yes)
			)
		)
		(symbol "VCC_PSDDR_PLL_0_0"
			(polyline
				(pts
					(xy -1.27 -2.54) (xy 1.27 -2.54)
				)
				(stroke
					(width 0.254)
					(type solid)
				)
				(fill
					(type none)
				)
			)
			(polyline
				(pts
					(xy 0 0) (xy 0 -2.54)
				)
				(stroke
					(width 0.254)
					(type solid)
				)
				(fill
					(type none)
				)
			)
			(pin power_in line
				(at 0 0 0)
				(length 0) hide
				(name "VCC_PSDDR_PLL"
					(effects
						(font
							(size 1.27 1.27)
						)
					)
				)
				(number ""
					(effects
						(font
							(size 1.27 1.27)
						)
					)
				)
			)
		)
	)
	(symbol "VCC_PSPLL"
		(power)
		(exclude_from_sim no)
		(in_bom yes)
		(on_board yes)
		(property "Reference" "#PWR0182"
			(at 0 0 0)
			(effects
				(font
					(size 1.27 1.27)
				)
				(hide yes)
			)
		)
		(property "Value" "VCC_PSPLL"
			(at 0 -3.81 0)
			(effects
				(font
					(size 1.27 1.27)
				)
			)
		)
		(property "Footprint" ""
			(at 0 0 0)
			(effects
				(font
					(size 1.27 1.27)
				)
				(hide yes)
			)
		)
		(property "Datasheet" ""
			(at 0 0 0)
			(effects
				(font
					(size 1.27 1.27)
				)
				(hide yes)
			)
		)
		(property "Description" ""
			(at 0 0 0)
			(effects
				(font
					(size 1.27 1.27)
				)
				(hide yes)
			)
		)
		(property "ki_keywords" "power-flag"
			(at 0 0 0)
			(effects
				(font
					(size 1.27 1.27)
				)
				(hide yes)
			)
		)
		(symbol "VCC_PSPLL_0_0"
			(polyline
				(pts
					(xy -1.27 -2.54) (xy 1.27 -2.54)
				)
				(stroke
					(width 0.254)
					(type solid)
				)
				(fill
					(type none)
				)
			)
			(polyline
				(pts
					(xy 0 0) (xy 0 -2.54)
				)
				(stroke
					(width 0.254)
					(type solid)
				)
				(fill
					(type none)
				)
			)
			(pin power_in line
				(at 0 0 0)
				(length 0) hide
				(name "VCC_PSPLL"
					(effects
						(font
							(size 1.27 1.27)
						)
					)
				)
				(number ""
					(effects
						(font
							(size 1.27 1.27)
						)
					)
				)
			)
		)
	)
	(symbol "VTT_DDR4-PS"
		(power)
		(exclude_from_sim no)
		(in_bom yes)
		(on_board yes)
		(property "Reference" "#PWR0304"
			(at 0 0 0)
			(effects
				(font
					(size 1.27 1.27)
				)
				(hide yes)
			)
		)
		(property "Value" "VTT_DDR4-PS"
			(at 0 -3.81 0)
			(effects
				(font
					(size 1.27 1.27)
				)
			)
		)
		(property "Footprint" ""
			(at 0 0 0)
			(effects
				(font
					(size 1.27 1.27)
				)
				(hide yes)
			)
		)
		(property "Datasheet" ""
			(at 0 0 0)
			(effects
				(font
					(size 1.27 1.27)
				)
				(hide yes)
			)
		)
		(property "Description" ""
			(at 0 0 0)
			(effects
				(font
					(size 1.27 1.27)
				)
				(hide yes)
			)
		)
		(property "ki_keywords" "power-flag"
			(at 0 0 0)
			(effects
				(font
					(size 1.27 1.27)
				)
				(hide yes)
			)
		)
		(symbol "VTT_DDR4-PS_0_0"
			(polyline
				(pts
					(xy -1.27 -2.54) (xy 1.27 -2.54)
				)
				(stroke
					(width 0.254)
					(type solid)
				)
				(fill
					(type none)
				)
			)
			(polyline
				(pts
					(xy 0 0) (xy 0 -2.54)
				)
				(stroke
					(width 0.254)
					(type solid)
				)
				(fill
					(type none)
				)
			)
			(pin power_in line
				(at 0 0 0)
				(length 0) hide
				(name "VTT_DDR4-PS"
					(effects
						(font
							(size 1.27 1.27)
						)
					)
				)
				(number ""
					(effects
						(font
							(size 1.27 1.27)
						)
					)
				)
			)
		)
	)
)
