<?xml version="1.0" encoding="UTF-8"?><svg xmlns="http://www.w3.org/2000/svg" xmlns:xlink="http://www.w3.org/1999/xlink" fill-opacity="1" color-rendering="auto" color-interpolation="auto" text-rendering="auto" stroke="black" stroke-linecap="square" width="256" stroke-miterlimit="10" shape-rendering="auto" stroke-opacity="1" fill="black" stroke-dasharray="none" font-weight="normal" stroke-width="1" height="214" font-family="'Dialog'" font-style="normal" stroke-linejoin="miter" font-size="12px" stroke-dashoffset="0" image-rendering="auto">
  <!--Generated by ySVG 2.5-->
  <defs id="genericDefs"/>
  <g>
    <defs id="defs1">
      <clipPath clipPathUnits="userSpaceOnUse" id="clipPath1">
        <path d="M0 0 L256 0 L256 214 L0 214 L0 0 Z"/>
      </clipPath>
      <clipPath clipPathUnits="userSpaceOnUse" id="clipPath2">
        <path d="M292 298 L548 298 L548 512 L292 512 L292 298 Z"/>
      </clipPath>
    </defs>
    <g fill="white" text-rendering="geometricPrecision" shape-rendering="geometricPrecision" transform="translate(-292,-298)" stroke="white">
      <rect x="292" width="256" height="214" y="298" clip-path="url(#clipPath2)" stroke="none"/>
    </g>
    <g fill="rgb(153,204,255)" text-rendering="geometricPrecision" shape-rendering="geometricPrecision" transform="matrix(1,0,0,1,-292,-298)" stroke="rgb(153,204,255)">
      <rect x="292" width="256" height="96" y="298" clip-path="url(#clipPath2)" stroke="none"/>
    </g>
    <g stroke-linecap="butt" transform="matrix(1,0,0,1,-292,-298)" fill="navy" text-rendering="geometricPrecision" shape-rendering="geometricPrecision" stroke="navy" stroke-width="3" stroke-miterlimit="1.45">
      <rect fill="none" x="292" width="256" height="96" y="298" clip-path="url(#clipPath2)"/>
    </g>
    <g text-rendering="geometricPrecision" stroke-miterlimit="1.45" shape-rendering="geometricPrecision" font-family="sans-serif" transform="matrix(1,0,0,1,-292,-298)" stroke-linecap="butt">
      <text x="486.6963" xml:space="preserve" y="350.1543" clip-path="url(#clipPath2)" stroke="none">library</text>
    </g>
    <g fill="rgb(153,204,255)" text-rendering="geometricPrecision" shape-rendering="geometricPrecision" transform="matrix(1,0,0,1,-292,-298)" stroke="rgb(153,204,255)">
      <rect x="292" width="128" height="64" y="330" clip-path="url(#clipPath2)" stroke="none"/>
    </g>
    <g stroke-linecap="butt" transform="matrix(1,0,0,1,-292,-298)" fill="navy" text-rendering="geometricPrecision" shape-rendering="geometricPrecision" stroke="navy" stroke-width="3" stroke-miterlimit="1.45">
      <rect fill="none" x="292" width="128" height="64" y="330" clip-path="url(#clipPath2)"/>
    </g>
    <g text-rendering="geometricPrecision" stroke-miterlimit="1.45" shape-rendering="geometricPrecision" font-family="sans-serif" transform="matrix(1,0,0,1,-292,-298)" stroke-linecap="butt">
      <text x="323.6885" xml:space="preserve" y="366.1543" clip-path="url(#clipPath2)" stroke="none">framework</text>
    </g>
    <g fill="silver" text-rendering="geometricPrecision" shape-rendering="geometricPrecision" transform="matrix(1,0,0,1,-292,-298)" stroke="silver">
      <rect x="298" width="250" height="64" y="448" clip-path="url(#clipPath2)" stroke="none"/>
    </g>
    <g stroke-linecap="butt" transform="matrix(1,0,0,1,-292,-298)" fill="gray" text-rendering="geometricPrecision" shape-rendering="geometricPrecision" stroke="gray" stroke-width="3" stroke-miterlimit="1.45">
      <rect fill="none" x="298" width="250" height="64" y="448" clip-path="url(#clipPath2)"/>
    </g>
    <g text-rendering="geometricPrecision" stroke-miterlimit="1.45" shape-rendering="geometricPrecision" font-family="sans-serif" transform="matrix(1,0,0,1,-292,-298)" stroke-linecap="butt">
      <text x="396.167" xml:space="preserve" y="484.1543" clip-path="url(#clipPath2)" stroke="none">firmware</text>
      <path fill="none" d="M356 440.0088 L356 402" clip-path="url(#clipPath2)"/>
      <path d="M356 448.0088 L361 436.0088 L356 439.0088 L351 436.0088 Z" clip-path="url(#clipPath2)" stroke="none"/>
      <path d="M356 394 L351 406 L356 403 L361 406 Z" clip-path="url(#clipPath2)" stroke="none"/>
      <path fill="none" d="M471 439.9773 L471 402.0345" clip-path="url(#clipPath2)"/>
      <path d="M471 447.9773 L476 435.9773 L471 438.9773 L466 435.9773 Z" clip-path="url(#clipPath2)" stroke="none"/>
      <path d="M471 394.0345 L466 406.0345 L471 403.0345 L476 406.0345 Z" clip-path="url(#clipPath2)" stroke="none"/>
    </g>
  </g>
</svg>
