<?xml version="1.0" encoding="UTF-8"?>
<!-- Do not edit this file with editors other than draw.io -->
<!DOCTYPE svg PUBLIC "-//W3C//DTD SVG 1.1//EN" "http://www.w3.org/Graphics/SVG/1.1/DTD/svg11.dtd">
<svg xmlns="http://www.w3.org/2000/svg" xmlns:xlink="http://www.w3.org/1999/xlink" version="1.1" width="942px" height="1042px" viewBox="-0.5 -0.5 942 1042" content="&lt;mxfile host=&quot;app.diagrams.net&quot; modified=&quot;2023-07-13T11:48:35.271Z&quot; agent=&quot;Mozilla/5.0 (Windows NT 10.0; Win64; x64) AppleWebKit/537.36 (KHTML, like Gecko) Chrome/114.0.0.0 Safari/537.36&quot; etag=&quot;Ly3xHsMSS5p2meI3mHb6&quot; version=&quot;21.6.1&quot; type=&quot;device&quot;&gt;&#10;  &lt;diagram name=&quot;Page-1&quot; id=&quot;1LtaJx2Kha7QrybLM8VD&quot;&gt;&#10;    &lt;mxGraphModel dx=&quot;3717&quot; dy=&quot;1309&quot; grid=&quot;1&quot; gridSize=&quot;10&quot; guides=&quot;1&quot; tooltips=&quot;1&quot; connect=&quot;1&quot; arrows=&quot;1&quot; fold=&quot;1&quot; page=&quot;1&quot; pageScale=&quot;1&quot; pageWidth=&quot;850&quot; pageHeight=&quot;1100&quot; math=&quot;0&quot; shadow=&quot;0&quot;&gt;&#10;      &lt;root&gt;&#10;        &lt;mxCell id=&quot;0&quot; /&gt;&#10;        &lt;mxCell id=&quot;1&quot; parent=&quot;0&quot; /&gt;&#10;        &lt;mxCell id=&quot;WSzhCSFJq9Se-K6iD0M2-1&quot; value=&quot;NF NODE&quot; style=&quot;shape=umlLifeline;perimeter=lifelinePerimeter;whiteSpace=wrap;html=1;container=1;dropTarget=0;collapsible=0;recursiveResize=0;outlineConnect=0;portConstraint=eastwest;newEdgeStyle={&amp;quot;edgeStyle&amp;quot;:&amp;quot;elbowEdgeStyle&amp;quot;,&amp;quot;elbow&amp;quot;:&amp;quot;vertical&amp;quot;,&amp;quot;curved&amp;quot;:0,&amp;quot;rounded&amp;quot;:0};&quot; vertex=&quot;1&quot; parent=&quot;1&quot;&gt;&#10;          &lt;mxGeometry x=&quot;-540&quot; y=&quot;230&quot; width=&quot;100&quot; height=&quot;950&quot; as=&quot;geometry&quot; /&gt;&#10;        &lt;/mxCell&gt;&#10;        &lt;mxCell id=&quot;WSzhCSFJq9Se-K6iD0M2-87&quot; value=&quot;&quot; style=&quot;html=1;points=[];perimeter=orthogonalPerimeter;outlineConnect=0;targetShapes=umlLifeline;portConstraint=eastwest;newEdgeStyle={&amp;quot;edgeStyle&amp;quot;:&amp;quot;elbowEdgeStyle&amp;quot;,&amp;quot;elbow&amp;quot;:&amp;quot;vertical&amp;quot;,&amp;quot;curved&amp;quot;:0,&amp;quot;rounded&amp;quot;:0};fillColor=#dae8fc;strokeColor=#6c8ebf;&quot; vertex=&quot;1&quot; parent=&quot;WSzhCSFJq9Se-K6iD0M2-1&quot;&gt;&#10;          &lt;mxGeometry x=&quot;45&quot; y=&quot;500&quot; width=&quot;10&quot; height=&quot;190&quot; as=&quot;geometry&quot; /&gt;&#10;        &lt;/mxCell&gt;&#10;        &lt;mxCell id=&quot;WSzhCSFJq9Se-K6iD0M2-104&quot; value=&quot;save &amp;lt;br&amp;gt;variable&quot; style=&quot;html=1;align=left;spacingLeft=2;endArrow=block;rounded=0;edgeStyle=orthogonalEdgeStyle;curved=0;rounded=0;&quot; edge=&quot;1&quot; parent=&quot;WSzhCSFJq9Se-K6iD0M2-1&quot; source=&quot;WSzhCSFJq9Se-K6iD0M2-87&quot; target=&quot;WSzhCSFJq9Se-K6iD0M2-87&quot;&gt;&#10;          &lt;mxGeometry y=&quot;-30&quot; relative=&quot;1&quot; as=&quot;geometry&quot;&gt;&#10;            &lt;mxPoint x=&quot;30&quot; y=&quot;620&quot; as=&quot;sourcePoint&quot; /&gt;&#10;            &lt;Array as=&quot;points&quot;&gt;&#10;              &lt;mxPoint x=&quot;20&quot; y=&quot;610&quot; /&gt;&#10;              &lt;mxPoint x=&quot;20&quot; y=&quot;650&quot; /&gt;&#10;            &lt;/Array&gt;&#10;            &lt;mxPoint x=&quot;-50&quot; y=&quot;650&quot; as=&quot;targetPoint&quot; /&gt;&#10;            &lt;mxPoint as=&quot;offset&quot; /&gt;&#10;          &lt;/mxGeometry&gt;&#10;        &lt;/mxCell&gt;&#10;        &lt;mxCell id=&quot;WSzhCSFJq9Se-K6iD0M2-3&quot; value=&quot;MQOSPI&quot; style=&quot;shape=umlLifeline;perimeter=lifelinePerimeter;whiteSpace=wrap;html=1;container=1;dropTarget=0;collapsible=0;recursiveResize=0;outlineConnect=0;portConstraint=eastwest;newEdgeStyle={&amp;quot;edgeStyle&amp;quot;:&amp;quot;elbowEdgeStyle&amp;quot;,&amp;quot;elbow&amp;quot;:&amp;quot;vertical&amp;quot;,&amp;quot;curved&amp;quot;:0,&amp;quot;rounded&amp;quot;:0};&quot; vertex=&quot;1&quot; parent=&quot;1&quot;&gt;&#10;          &lt;mxGeometry x=&quot;-1060&quot; y=&quot;230&quot; width=&quot;100&quot; height=&quot;950&quot; as=&quot;geometry&quot; /&gt;&#10;        &lt;/mxCell&gt;&#10;        &lt;mxCell id=&quot;WSzhCSFJq9Se-K6iD0M2-105&quot; value=&quot;&quot; style=&quot;html=1;points=[];perimeter=orthogonalPerimeter;outlineConnect=0;targetShapes=umlLifeline;portConstraint=eastwest;newEdgeStyle={&amp;quot;edgeStyle&amp;quot;:&amp;quot;elbowEdgeStyle&amp;quot;,&amp;quot;elbow&amp;quot;:&amp;quot;vertical&amp;quot;,&amp;quot;curved&amp;quot;:0,&amp;quot;rounded&amp;quot;:0};fillColor=#dae8fc;strokeColor=#6c8ebf;&quot; vertex=&quot;1&quot; parent=&quot;WSzhCSFJq9Se-K6iD0M2-3&quot;&gt;&#10;          &lt;mxGeometry x=&quot;45&quot; y=&quot;790.0000000000001&quot; width=&quot;10&quot; height=&quot;40&quot; as=&quot;geometry&quot; /&gt;&#10;        &lt;/mxCell&gt;&#10;        &lt;mxCell id=&quot;WSzhCSFJq9Se-K6iD0M2-106&quot; value=&quot;&quot; style=&quot;html=1;verticalAlign=bottom;endArrow=open;dashed=1;endSize=8;edgeStyle=elbowEdgeStyle;elbow=vertical;curved=0;rounded=0;dashPattern=1 4;&quot; edge=&quot;1&quot; parent=&quot;WSzhCSFJq9Se-K6iD0M2-3&quot; target=&quot;WSzhCSFJq9Se-K6iD0M2-102&quot;&gt;&#10;          &lt;mxGeometry relative=&quot;1&quot; as=&quot;geometry&quot;&gt;&#10;            &lt;mxPoint x=&quot;-85&quot; y=&quot;830.0000000000001&quot; as=&quot;targetPoint&quot; /&gt;&#10;            &lt;mxPoint x=&quot;49.5&quot; y=&quot;830.0000000000001&quot; as=&quot;sourcePoint&quot; /&gt;&#10;            &lt;Array as=&quot;points&quot;&gt;&#10;              &lt;mxPoint x=&quot;-20&quot; y=&quot;830.0000000000001&quot; /&gt;&#10;            &lt;/Array&gt;&#10;          &lt;/mxGeometry&gt;&#10;        &lt;/mxCell&gt;&#10;        &lt;mxCell id=&quot;WSzhCSFJq9Se-K6iD0M2-108&quot; value=&quot;spi_dma_send&quot; style=&quot;html=1;verticalAlign=bottom;endArrow=block;edgeStyle=elbowEdgeStyle;elbow=horizontal;curved=0;rounded=0;&quot; edge=&quot;1&quot; parent=&quot;WSzhCSFJq9Se-K6iD0M2-3&quot; source=&quot;WSzhCSFJq9Se-K6iD0M2-105&quot;&gt;&#10;          &lt;mxGeometry x=&quot;0.0031&quot; relative=&quot;1&quot; as=&quot;geometry&quot;&gt;&#10;            &lt;mxPoint x=&quot;80&quot; y=&quot;800.0000000000001&quot; as=&quot;sourcePoint&quot; /&gt;&#10;            &lt;Array as=&quot;points&quot;&gt;&#10;              &lt;mxPoint x=&quot;120&quot; y=&quot;800.0000000000001&quot; /&gt;&#10;              &lt;mxPoint x=&quot;50&quot; y=&quot;790.0000000000001&quot; /&gt;&#10;            &lt;/Array&gt;&#10;            &lt;mxPoint as=&quot;offset&quot; /&gt;&#10;            &lt;mxPoint x=&quot;164.99999999999977&quot; y=&quot;800&quot; as=&quot;targetPoint&quot; /&gt;&#10;          &lt;/mxGeometry&gt;&#10;        &lt;/mxCell&gt;&#10;        &lt;mxCell id=&quot;WSzhCSFJq9Se-K6iD0M2-109&quot; value=&quot;&quot; style=&quot;html=1;verticalAlign=bottom;endArrow=open;dashed=1;endSize=8;edgeStyle=elbowEdgeStyle;elbow=vertical;curved=0;rounded=0;dashPattern=1 4;&quot; edge=&quot;1&quot; parent=&quot;WSzhCSFJq9Se-K6iD0M2-3&quot; target=&quot;WSzhCSFJq9Se-K6iD0M2-105&quot;&gt;&#10;          &lt;mxGeometry relative=&quot;1&quot; as=&quot;geometry&quot;&gt;&#10;            &lt;mxPoint x=&quot;60&quot; y=&quot;820.0000000000001&quot; as=&quot;targetPoint&quot; /&gt;&#10;            &lt;mxPoint x=&quot;169.5&quot; y=&quot;820.0000000000001&quot; as=&quot;sourcePoint&quot; /&gt;&#10;            &lt;Array as=&quot;points&quot;&gt;&#10;              &lt;mxPoint x=&quot;95&quot; y=&quot;820.0000000000001&quot; /&gt;&#10;            &lt;/Array&gt;&#10;          &lt;/mxGeometry&gt;&#10;        &lt;/mxCell&gt;&#10;        &lt;mxCell id=&quot;WSzhCSFJq9Se-K6iD0M2-7&quot; value=&quot;LibMasterFip&quot; style=&quot;shape=umlLifeline;perimeter=lifelinePerimeter;whiteSpace=wrap;html=1;container=1;dropTarget=0;collapsible=0;recursiveResize=0;outlineConnect=0;portConstraint=eastwest;newEdgeStyle={&amp;quot;edgeStyle&amp;quot;:&amp;quot;elbowEdgeStyle&amp;quot;,&amp;quot;elbow&amp;quot;:&amp;quot;vertical&amp;quot;,&amp;quot;curved&amp;quot;:0,&amp;quot;rounded&amp;quot;:0};&quot; vertex=&quot;1&quot; parent=&quot;1&quot;&gt;&#10;          &lt;mxGeometry x=&quot;-1200&quot; y=&quot;230&quot; width=&quot;100&quot; height=&quot;940&quot; as=&quot;geometry&quot; /&gt;&#10;        &lt;/mxCell&gt;&#10;        &lt;mxCell id=&quot;WSzhCSFJq9Se-K6iD0M2-8&quot; value=&quot;&quot; style=&quot;html=1;points=[];perimeter=orthogonalPerimeter;outlineConnect=0;targetShapes=umlLifeline;portConstraint=eastwest;newEdgeStyle={&amp;quot;edgeStyle&amp;quot;:&amp;quot;elbowEdgeStyle&amp;quot;,&amp;quot;elbow&amp;quot;:&amp;quot;vertical&amp;quot;,&amp;quot;curved&amp;quot;:0,&amp;quot;rounded&amp;quot;:0};fillColor=#dae8fc;strokeColor=#6c8ebf;&quot; vertex=&quot;1&quot; parent=&quot;WSzhCSFJq9Se-K6iD0M2-7&quot;&gt;&#10;          &lt;mxGeometry x=&quot;45&quot; y=&quot;100&quot; width=&quot;10&quot; height=&quot;840&quot; as=&quot;geometry&quot; /&gt;&#10;        &lt;/mxCell&gt;&#10;        &lt;mxCell id=&quot;WSzhCSFJq9Se-K6iD0M2-80&quot; value=&quot;check if&amp;lt;br&amp;gt;message has IRQ&quot; style=&quot;html=1;align=left;spacingLeft=2;endArrow=block;rounded=0;edgeStyle=orthogonalEdgeStyle;curved=0;rounded=0;&quot; edge=&quot;1&quot; parent=&quot;WSzhCSFJq9Se-K6iD0M2-7&quot; source=&quot;WSzhCSFJq9Se-K6iD0M2-8&quot; target=&quot;WSzhCSFJq9Se-K6iD0M2-8&quot;&gt;&#10;          &lt;mxGeometry relative=&quot;1&quot; as=&quot;geometry&quot;&gt;&#10;            &lt;mxPoint x=&quot;60&quot; y=&quot;330&quot; as=&quot;sourcePoint&quot; /&gt;&#10;            &lt;Array as=&quot;points&quot;&gt;&#10;              &lt;mxPoint x=&quot;80&quot; y=&quot;330&quot; /&gt;&#10;              &lt;mxPoint x=&quot;80&quot; y=&quot;360&quot; /&gt;&#10;            &lt;/Array&gt;&#10;            &lt;mxPoint x=&quot;60&quot; y=&quot;359.9999999999999&quot; as=&quot;targetPoint&quot; /&gt;&#10;          &lt;/mxGeometry&gt;&#10;        &lt;/mxCell&gt;&#10;        &lt;mxCell id=&quot;WSzhCSFJq9Se-K6iD0M2-36&quot; value=&quot;GPIO&quot; style=&quot;shape=umlLifeline;perimeter=lifelinePerimeter;whiteSpace=wrap;html=1;container=1;dropTarget=0;collapsible=0;recursiveResize=0;outlineConnect=0;portConstraint=eastwest;newEdgeStyle={&amp;quot;edgeStyle&amp;quot;:&amp;quot;elbowEdgeStyle&amp;quot;,&amp;quot;elbow&amp;quot;:&amp;quot;vertical&amp;quot;,&amp;quot;curved&amp;quot;:0,&amp;quot;rounded&amp;quot;:0};&quot; vertex=&quot;1&quot; parent=&quot;1&quot;&gt;&#10;          &lt;mxGeometry x=&quot;-810&quot; y=&quot;230&quot; width=&quot;100&quot; height=&quot;960&quot; as=&quot;geometry&quot; /&gt;&#10;        &lt;/mxCell&gt;&#10;        &lt;mxCell id=&quot;WSzhCSFJq9Se-K6iD0M2-40&quot; value=&quot;MF_HANDLER&quot; style=&quot;shape=umlLifeline;perimeter=lifelinePerimeter;whiteSpace=wrap;html=1;container=1;dropTarget=0;collapsible=0;recursiveResize=0;outlineConnect=0;portConstraint=eastwest;newEdgeStyle={&amp;quot;edgeStyle&amp;quot;:&amp;quot;elbowEdgeStyle&amp;quot;,&amp;quot;elbow&amp;quot;:&amp;quot;vertical&amp;quot;,&amp;quot;curved&amp;quot;:0,&amp;quot;rounded&amp;quot;:0};&quot; vertex=&quot;1&quot; parent=&quot;1&quot;&gt;&#10;          &lt;mxGeometry x=&quot;-670&quot; y=&quot;230&quot; width=&quot;100&quot; height=&quot;950&quot; as=&quot;geometry&quot; /&gt;&#10;        &lt;/mxCell&gt;&#10;        &lt;mxCell id=&quot;WSzhCSFJq9Se-K6iD0M2-44&quot; value=&quot;MasterFip data exchange&quot; style=&quot;rounded=1;whiteSpace=wrap;html=1;&quot; vertex=&quot;1&quot; parent=&quot;1&quot;&gt;&#10;          &lt;mxGeometry x=&quot;-1380&quot; y=&quot;150&quot; width=&quot;940&quot; height=&quot;40&quot; as=&quot;geometry&quot; /&gt;&#10;        &lt;/mxCell&gt;&#10;        &lt;mxCell id=&quot;WSzhCSFJq9Se-K6iD0M2-45&quot; value=&quot;SPIDMA&quot; style=&quot;shape=umlLifeline;perimeter=lifelinePerimeter;whiteSpace=wrap;html=1;container=1;dropTarget=0;collapsible=0;recursiveResize=0;outlineConnect=0;portConstraint=eastwest;newEdgeStyle={&amp;quot;edgeStyle&amp;quot;:&amp;quot;elbowEdgeStyle&amp;quot;,&amp;quot;elbow&amp;quot;:&amp;quot;vertical&amp;quot;,&amp;quot;curved&amp;quot;:0,&amp;quot;rounded&amp;quot;:0};&quot; vertex=&quot;1&quot; parent=&quot;1&quot;&gt;&#10;          &lt;mxGeometry x=&quot;-940&quot; y=&quot;230&quot; width=&quot;100&quot; height=&quot;950&quot; as=&quot;geometry&quot; /&gt;&#10;        &lt;/mxCell&gt;&#10;        &lt;mxCell id=&quot;WSzhCSFJq9Se-K6iD0M2-4&quot; value=&quot;&quot; style=&quot;html=1;points=[];perimeter=orthogonalPerimeter;outlineConnect=0;targetShapes=umlLifeline;portConstraint=eastwest;newEdgeStyle={&amp;quot;edgeStyle&amp;quot;:&amp;quot;elbowEdgeStyle&amp;quot;,&amp;quot;elbow&amp;quot;:&amp;quot;vertical&amp;quot;,&amp;quot;curved&amp;quot;:0,&amp;quot;rounded&amp;quot;:0};fillColor=#dae8fc;strokeColor=#6c8ebf;&quot; vertex=&quot;1&quot; parent=&quot;WSzhCSFJq9Se-K6iD0M2-45&quot;&gt;&#10;          &lt;mxGeometry x=&quot;-75&quot; y=&quot;150&quot; width=&quot;10&quot; height=&quot;40&quot; as=&quot;geometry&quot; /&gt;&#10;        &lt;/mxCell&gt;&#10;        &lt;mxCell id=&quot;WSzhCSFJq9Se-K6iD0M2-67&quot; value=&quot;&quot; style=&quot;html=1;points=[];perimeter=orthogonalPerimeter;outlineConnect=0;targetShapes=umlLifeline;portConstraint=eastwest;newEdgeStyle={&amp;quot;edgeStyle&amp;quot;:&amp;quot;elbowEdgeStyle&amp;quot;,&amp;quot;elbow&amp;quot;:&amp;quot;vertical&amp;quot;,&amp;quot;curved&amp;quot;:0,&amp;quot;rounded&amp;quot;:0};fillColor=#dae8fc;strokeColor=#6c8ebf;&quot; vertex=&quot;1&quot; parent=&quot;WSzhCSFJq9Se-K6iD0M2-45&quot;&gt;&#10;          &lt;mxGeometry x=&quot;175&quot; y=&quot;160&quot; width=&quot;10&quot; height=&quot;20&quot; as=&quot;geometry&quot; /&gt;&#10;        &lt;/mxCell&gt;&#10;        &lt;mxCell id=&quot;WSzhCSFJq9Se-K6iD0M2-70&quot; value=&quot;&quot; style=&quot;html=1;points=[];perimeter=orthogonalPerimeter;outlineConnect=0;targetShapes=umlLifeline;portConstraint=eastwest;newEdgeStyle={&amp;quot;edgeStyle&amp;quot;:&amp;quot;elbowEdgeStyle&amp;quot;,&amp;quot;elbow&amp;quot;:&amp;quot;vertical&amp;quot;,&amp;quot;curved&amp;quot;:0,&amp;quot;rounded&amp;quot;:0};fillColor=#dae8fc;strokeColor=#6c8ebf;&quot; vertex=&quot;1&quot; parent=&quot;WSzhCSFJq9Se-K6iD0M2-45&quot;&gt;&#10;          &lt;mxGeometry x=&quot;-75&quot; y=&quot;230&quot; width=&quot;10&quot; height=&quot;40&quot; as=&quot;geometry&quot; /&gt;&#10;        &lt;/mxCell&gt;&#10;        &lt;mxCell id=&quot;WSzhCSFJq9Se-K6iD0M2-75&quot; value=&quot;&quot; style=&quot;html=1;verticalAlign=bottom;endArrow=open;dashed=1;endSize=8;edgeStyle=elbowEdgeStyle;elbow=vertical;curved=0;rounded=0;dashPattern=1 4;&quot; edge=&quot;1&quot; parent=&quot;WSzhCSFJq9Se-K6iD0M2-45&quot;&gt;&#10;          &lt;mxGeometry relative=&quot;1&quot; as=&quot;geometry&quot;&gt;&#10;            &lt;mxPoint x=&quot;-205&quot; y=&quot;270&quot; as=&quot;targetPoint&quot; /&gt;&#10;            &lt;mxPoint x=&quot;-70.5&quot; y=&quot;270&quot; as=&quot;sourcePoint&quot; /&gt;&#10;            &lt;Array as=&quot;points&quot;&gt;&#10;              &lt;mxPoint x=&quot;-140&quot; y=&quot;270&quot; /&gt;&#10;            &lt;/Array&gt;&#10;          &lt;/mxGeometry&gt;&#10;        &lt;/mxCell&gt;&#10;        &lt;mxCell id=&quot;WSzhCSFJq9Se-K6iD0M2-72&quot; value=&quot;&quot; style=&quot;html=1;points=[];perimeter=orthogonalPerimeter;outlineConnect=0;targetShapes=umlLifeline;portConstraint=eastwest;newEdgeStyle={&amp;quot;edgeStyle&amp;quot;:&amp;quot;elbowEdgeStyle&amp;quot;,&amp;quot;elbow&amp;quot;:&amp;quot;vertical&amp;quot;,&amp;quot;curved&amp;quot;:0,&amp;quot;rounded&amp;quot;:0};fillColor=#dae8fc;strokeColor=#6c8ebf;&quot; vertex=&quot;1&quot; parent=&quot;WSzhCSFJq9Se-K6iD0M2-45&quot;&gt;&#10;          &lt;mxGeometry x=&quot;45&quot; y=&quot;240&quot; width=&quot;10&quot; height=&quot;20&quot; as=&quot;geometry&quot; /&gt;&#10;        &lt;/mxCell&gt;&#10;        &lt;mxCell id=&quot;WSzhCSFJq9Se-K6iD0M2-73&quot; value=&quot;spi_dma_receive&quot; style=&quot;html=1;verticalAlign=bottom;endArrow=block;edgeStyle=elbowEdgeStyle;elbow=horizontal;curved=0;rounded=0;&quot; edge=&quot;1&quot; parent=&quot;WSzhCSFJq9Se-K6iD0M2-45&quot; source=&quot;WSzhCSFJq9Se-K6iD0M2-70&quot; target=&quot;WSzhCSFJq9Se-K6iD0M2-72&quot;&gt;&#10;          &lt;mxGeometry x=&quot;0.0031&quot; relative=&quot;1&quot; as=&quot;geometry&quot;&gt;&#10;            &lt;mxPoint x=&quot;-40&quot; y=&quot;240&quot; as=&quot;sourcePoint&quot; /&gt;&#10;            &lt;Array as=&quot;points&quot;&gt;&#10;              &lt;mxPoint y=&quot;240&quot; /&gt;&#10;              &lt;mxPoint x=&quot;-70&quot; y=&quot;230&quot; /&gt;&#10;            &lt;/Array&gt;&#10;            &lt;mxPoint as=&quot;offset&quot; /&gt;&#10;            &lt;mxPoint x=&quot;179.5&quot; y=&quot;240&quot; as=&quot;targetPoint&quot; /&gt;&#10;          &lt;/mxGeometry&gt;&#10;        &lt;/mxCell&gt;&#10;        &lt;mxCell id=&quot;WSzhCSFJq9Se-K6iD0M2-74&quot; value=&quot;&quot; style=&quot;html=1;verticalAlign=bottom;endArrow=open;dashed=1;endSize=8;edgeStyle=elbowEdgeStyle;elbow=vertical;curved=0;rounded=0;dashPattern=1 4;&quot; edge=&quot;1&quot; parent=&quot;WSzhCSFJq9Se-K6iD0M2-45&quot; target=&quot;WSzhCSFJq9Se-K6iD0M2-70&quot;&gt;&#10;          &lt;mxGeometry relative=&quot;1&quot; as=&quot;geometry&quot;&gt;&#10;            &lt;mxPoint x=&quot;-60&quot; y=&quot;260&quot; as=&quot;targetPoint&quot; /&gt;&#10;            &lt;mxPoint x=&quot;49.5&quot; y=&quot;260&quot; as=&quot;sourcePoint&quot; /&gt;&#10;            &lt;Array as=&quot;points&quot;&gt;&#10;              &lt;mxPoint x=&quot;-25&quot; y=&quot;260&quot; /&gt;&#10;            &lt;/Array&gt;&#10;          &lt;/mxGeometry&gt;&#10;        &lt;/mxCell&gt;&#10;        &lt;mxCell id=&quot;WSzhCSFJq9Se-K6iD0M2-66&quot; value=&quot;profip_gpio_read&quot; style=&quot;html=1;verticalAlign=bottom;endArrow=block;edgeStyle=elbowEdgeStyle;elbow=vertical;curved=0;rounded=0;&quot; edge=&quot;1&quot; parent=&quot;WSzhCSFJq9Se-K6iD0M2-45&quot; source=&quot;WSzhCSFJq9Se-K6iD0M2-4&quot; target=&quot;WSzhCSFJq9Se-K6iD0M2-67&quot;&gt;&#10;          &lt;mxGeometry x=&quot;-0.4583&quot; relative=&quot;1&quot; as=&quot;geometry&quot;&gt;&#10;            &lt;mxPoint x=&quot;-40&quot; y=&quot;160&quot; as=&quot;sourcePoint&quot; /&gt;&#10;            &lt;Array as=&quot;points&quot;&gt;&#10;              &lt;mxPoint x=&quot;80&quot; y=&quot;160&quot; /&gt;&#10;              &lt;mxPoint x=&quot;-70&quot; y=&quot;150&quot; /&gt;&#10;            &lt;/Array&gt;&#10;            &lt;mxPoint as=&quot;offset&quot; /&gt;&#10;            &lt;mxPoint x=&quot;179.5&quot; y=&quot;160&quot; as=&quot;targetPoint&quot; /&gt;&#10;          &lt;/mxGeometry&gt;&#10;        &lt;/mxCell&gt;&#10;        &lt;mxCell id=&quot;WSzhCSFJq9Se-K6iD0M2-68&quot; value=&quot;&quot; style=&quot;html=1;verticalAlign=bottom;endArrow=open;dashed=1;endSize=8;edgeStyle=elbowEdgeStyle;elbow=vertical;curved=0;rounded=0;dashPattern=1 4;&quot; edge=&quot;1&quot; parent=&quot;WSzhCSFJq9Se-K6iD0M2-45&quot; source=&quot;WSzhCSFJq9Se-K6iD0M2-67&quot; target=&quot;WSzhCSFJq9Se-K6iD0M2-4&quot;&gt;&#10;          &lt;mxGeometry relative=&quot;1&quot; as=&quot;geometry&quot;&gt;&#10;            &lt;mxPoint x=&quot;-60&quot; y=&quot;180&quot; as=&quot;targetPoint&quot; /&gt;&#10;            &lt;mxPoint x=&quot;185&quot; y=&quot;70&quot; as=&quot;sourcePoint&quot; /&gt;&#10;            &lt;Array as=&quot;points&quot;&gt;&#10;              &lt;mxPoint x=&quot;-25&quot; y=&quot;180&quot; /&gt;&#10;            &lt;/Array&gt;&#10;          &lt;/mxGeometry&gt;&#10;        &lt;/mxCell&gt;&#10;        &lt;mxCell id=&quot;WSzhCSFJq9Se-K6iD0M2-69&quot; value=&quot;&quot; style=&quot;html=1;verticalAlign=bottom;endArrow=open;dashed=1;endSize=8;edgeStyle=elbowEdgeStyle;elbow=vertical;curved=0;rounded=0;dashPattern=1 4;&quot; edge=&quot;1&quot; parent=&quot;WSzhCSFJq9Se-K6iD0M2-45&quot;&gt;&#10;          &lt;mxGeometry relative=&quot;1&quot; as=&quot;geometry&quot;&gt;&#10;            &lt;mxPoint x=&quot;-205&quot; y=&quot;190&quot; as=&quot;targetPoint&quot; /&gt;&#10;            &lt;mxPoint x=&quot;-70.5&quot; y=&quot;190&quot; as=&quot;sourcePoint&quot; /&gt;&#10;            &lt;Array as=&quot;points&quot;&gt;&#10;              &lt;mxPoint x=&quot;-140&quot; y=&quot;190&quot; /&gt;&#10;            &lt;/Array&gt;&#10;          &lt;/mxGeometry&gt;&#10;        &lt;/mxCell&gt;&#10;        &lt;mxCell id=&quot;WSzhCSFJq9Se-K6iD0M2-71&quot; value=&quot;mqospi_async_read&quot; style=&quot;html=1;verticalAlign=bottom;endArrow=block;edgeStyle=elbowEdgeStyle;elbow=vertical;curved=0;rounded=0;&quot; edge=&quot;1&quot; parent=&quot;WSzhCSFJq9Se-K6iD0M2-45&quot; target=&quot;WSzhCSFJq9Se-K6iD0M2-70&quot;&gt;&#10;          &lt;mxGeometry relative=&quot;1&quot; as=&quot;geometry&quot;&gt;&#10;            &lt;mxPoint x=&quot;-205&quot; y=&quot;230&quot; as=&quot;sourcePoint&quot; /&gt;&#10;            &lt;Array as=&quot;points&quot;&gt;&#10;              &lt;mxPoint x=&quot;-190&quot; y=&quot;230&quot; /&gt;&#10;            &lt;/Array&gt;&#10;            &lt;mxPoint as=&quot;offset&quot; /&gt;&#10;          &lt;/mxGeometry&gt;&#10;        &lt;/mxCell&gt;&#10;        &lt;mxCell id=&quot;WSzhCSFJq9Se-K6iD0M2-77&quot; value=&quot;for all RMQ&amp;#39;s&quot; style=&quot;shape=umlFrame;whiteSpace=wrap;html=1;pointerEvents=0;width=60;height=30;&quot; vertex=&quot;1&quot; parent=&quot;1&quot;&gt;&#10;          &lt;mxGeometry x=&quot;-1060&quot; y=&quot;320&quot; width=&quot;320&quot; height=&quot;110&quot; as=&quot;geometry&quot; /&gt;&#10;        &lt;/mxCell&gt;&#10;        &lt;mxCell id=&quot;WSzhCSFJq9Se-K6iD0M2-5&quot; value=&quot;mqospi_poll&quot; style=&quot;html=1;verticalAlign=bottom;endArrow=block;edgeStyle=elbowEdgeStyle;elbow=vertical;curved=0;rounded=0;&quot; edge=&quot;1&quot; parent=&quot;1&quot; target=&quot;WSzhCSFJq9Se-K6iD0M2-4&quot; source=&quot;WSzhCSFJq9Se-K6iD0M2-8&quot;&gt;&#10;          &lt;mxGeometry x=&quot;-0.3077&quot; relative=&quot;1&quot; as=&quot;geometry&quot;&gt;&#10;            &lt;mxPoint x=&quot;-1085&quot; y=&quot;380&quot; as=&quot;sourcePoint&quot; /&gt;&#10;            &lt;Array as=&quot;points&quot;&gt;&#10;              &lt;mxPoint x=&quot;-1140&quot; y=&quot;380&quot; /&gt;&#10;            &lt;/Array&gt;&#10;            &lt;mxPoint as=&quot;offset&quot; /&gt;&#10;          &lt;/mxGeometry&gt;&#10;        &lt;/mxCell&gt;&#10;        &lt;mxCell id=&quot;WSzhCSFJq9Se-K6iD0M2-79&quot; value=&quot;save message&amp;lt;br&amp;gt;to buffer&quot; style=&quot;html=1;align=left;spacingLeft=2;endArrow=block;rounded=0;edgeStyle=orthogonalEdgeStyle;curved=0;rounded=0;&quot; edge=&quot;1&quot; parent=&quot;1&quot; source=&quot;WSzhCSFJq9Se-K6iD0M2-8&quot;&gt;&#10;          &lt;mxGeometry relative=&quot;1&quot; as=&quot;geometry&quot;&gt;&#10;            &lt;mxPoint x=&quot;-1130&quot; y=&quot;510&quot; as=&quot;sourcePoint&quot; /&gt;&#10;            &lt;Array as=&quot;points&quot;&gt;&#10;              &lt;mxPoint x=&quot;-1120&quot; y=&quot;510&quot; /&gt;&#10;              &lt;mxPoint x=&quot;-1120&quot; y=&quot;540&quot; /&gt;&#10;            &lt;/Array&gt;&#10;            &lt;mxPoint x=&quot;-1145&quot; y=&quot;539.9999999999999&quot; as=&quot;targetPoint&quot; /&gt;&#10;          &lt;/mxGeometry&gt;&#10;        &lt;/mxCell&gt;&#10;        &lt;mxCell id=&quot;WSzhCSFJq9Se-K6iD0M2-81&quot; value=&quot;for each RMQ for which the poll function returned that &amp;quot;there are messages&amp;quot;&quot; style=&quot;shape=umlFrame;whiteSpace=wrap;html=1;pointerEvents=0;width=160;height=70;&quot; vertex=&quot;1&quot; parent=&quot;1&quot;&gt;&#10;          &lt;mxGeometry x=&quot;-1370&quot; y=&quot;440&quot; width=&quot;930&quot; height=&quot;720&quot; as=&quot;geometry&quot; /&gt;&#10;        &lt;/mxCell&gt;&#10;        &lt;mxCell id=&quot;WSzhCSFJq9Se-K6iD0M2-82&quot; value=&quot;&quot; style=&quot;html=1;points=[];perimeter=orthogonalPerimeter;outlineConnect=0;targetShapes=umlLifeline;portConstraint=eastwest;newEdgeStyle={&amp;quot;edgeStyle&amp;quot;:&amp;quot;elbowEdgeStyle&amp;quot;,&amp;quot;elbow&amp;quot;:&amp;quot;vertical&amp;quot;,&amp;quot;curved&amp;quot;:0,&amp;quot;rounded&amp;quot;:0};fillColor=#dae8fc;strokeColor=#6c8ebf;&quot; vertex=&quot;1&quot; parent=&quot;1&quot;&gt;&#10;          &lt;mxGeometry x=&quot;-625&quot; y=&quot;620&quot; width=&quot;10&quot; height=&quot;60&quot; as=&quot;geometry&quot; /&gt;&#10;        &lt;/mxCell&gt;&#10;        &lt;mxCell id=&quot;WSzhCSFJq9Se-K6iD0M2-83&quot; value=&quot;callback:&amp;amp;nbsp; my_prod_var_handler&quot; style=&quot;html=1;verticalAlign=bottom;endArrow=block;edgeStyle=elbowEdgeStyle;elbow=vertical;curved=0;rounded=0;&quot; edge=&quot;1&quot; parent=&quot;1&quot;&gt;&#10;          &lt;mxGeometry relative=&quot;1&quot; as=&quot;geometry&quot;&gt;&#10;            &lt;mxPoint x=&quot;-1145&quot; y=&quot;620&quot; as=&quot;sourcePoint&quot; /&gt;&#10;            &lt;Array as=&quot;points&quot;&gt;&#10;              &lt;mxPoint x=&quot;-1030&quot; y=&quot;620&quot; /&gt;&#10;              &lt;mxPoint x=&quot;-1135&quot; y=&quot;630&quot; /&gt;&#10;            &lt;/Array&gt;&#10;            &lt;mxPoint as=&quot;offset&quot; /&gt;&#10;            &lt;mxPoint x=&quot;-625&quot; y=&quot;620&quot; as=&quot;targetPoint&quot; /&gt;&#10;          &lt;/mxGeometry&gt;&#10;        &lt;/mxCell&gt;&#10;        &lt;mxCell id=&quot;WSzhCSFJq9Se-K6iD0M2-84&quot; value=&quot;&quot; style=&quot;html=1;verticalAlign=bottom;endArrow=open;dashed=1;endSize=8;edgeStyle=elbowEdgeStyle;elbow=vertical;curved=0;rounded=0;dashPattern=1 4;&quot; edge=&quot;1&quot; parent=&quot;1&quot; target=&quot;WSzhCSFJq9Se-K6iD0M2-8&quot;&gt;&#10;          &lt;mxGeometry relative=&quot;1&quot; as=&quot;geometry&quot;&gt;&#10;            &lt;mxPoint x=&quot;-1140.0000000000002&quot; y=&quot;640&quot; as=&quot;targetPoint&quot; /&gt;&#10;            &lt;mxPoint x=&quot;-615&quot; y=&quot;620&quot; as=&quot;sourcePoint&quot; /&gt;&#10;            &lt;Array as=&quot;points&quot;&gt;&#10;              &lt;mxPoint x=&quot;-790&quot; y=&quot;680&quot; /&gt;&#10;              &lt;mxPoint x=&quot;-935&quot; y=&quot;640&quot; /&gt;&#10;            &lt;/Array&gt;&#10;          &lt;/mxGeometry&gt;&#10;        &lt;/mxCell&gt;&#10;        &lt;mxCell id=&quot;WSzhCSFJq9Se-K6iD0M2-85&quot; value=&quot;callback:&amp;amp;nbsp; my_prod_var_handler&quot; style=&quot;html=1;verticalAlign=bottom;endArrow=block;edgeStyle=elbowEdgeStyle;elbow=vertical;curved=0;rounded=0;&quot; edge=&quot;1&quot; parent=&quot;1&quot;&gt;&#10;          &lt;mxGeometry relative=&quot;1&quot; as=&quot;geometry&quot;&gt;&#10;            &lt;mxPoint x=&quot;-1145&quot; y=&quot;720&quot; as=&quot;sourcePoint&quot; /&gt;&#10;            &lt;Array as=&quot;points&quot;&gt;&#10;              &lt;mxPoint x=&quot;-1030&quot; y=&quot;720&quot; /&gt;&#10;              &lt;mxPoint x=&quot;-1135&quot; y=&quot;730&quot; /&gt;&#10;            &lt;/Array&gt;&#10;            &lt;mxPoint as=&quot;offset&quot; /&gt;&#10;            &lt;mxPoint x=&quot;-625&quot; y=&quot;720&quot; as=&quot;targetPoint&quot; /&gt;&#10;          &lt;/mxGeometry&gt;&#10;        &lt;/mxCell&gt;&#10;        &lt;mxCell id=&quot;WSzhCSFJq9Se-K6iD0M2-86&quot; value=&quot;&quot; style=&quot;html=1;points=[];perimeter=orthogonalPerimeter;outlineConnect=0;targetShapes=umlLifeline;portConstraint=eastwest;newEdgeStyle={&amp;quot;edgeStyle&amp;quot;:&amp;quot;elbowEdgeStyle&amp;quot;,&amp;quot;elbow&amp;quot;:&amp;quot;vertical&amp;quot;,&amp;quot;curved&amp;quot;:0,&amp;quot;rounded&amp;quot;:0};fillColor=#dae8fc;strokeColor=#6c8ebf;&quot; vertex=&quot;1&quot; parent=&quot;1&quot;&gt;&#10;          &lt;mxGeometry x=&quot;-625&quot; y=&quot;720&quot; width=&quot;10&quot; height=&quot;420&quot; as=&quot;geometry&quot; /&gt;&#10;        &lt;/mxCell&gt;&#10;        &lt;mxCell id=&quot;WSzhCSFJq9Se-K6iD0M2-88&quot; value=&quot;nf_node_&amp;lt;br&amp;gt;update_all_cons_var&quot; style=&quot;html=1;verticalAlign=bottom;endArrow=block;edgeStyle=elbowEdgeStyle;elbow=vertical;curved=0;rounded=0;&quot; edge=&quot;1&quot; parent=&quot;1&quot; source=&quot;WSzhCSFJq9Se-K6iD0M2-86&quot; target=&quot;WSzhCSFJq9Se-K6iD0M2-87&quot;&gt;&#10;          &lt;mxGeometry relative=&quot;1&quot; as=&quot;geometry&quot;&gt;&#10;            &lt;mxPoint x=&quot;-1060&quot; y=&quot;750&quot; as=&quot;sourcePoint&quot; /&gt;&#10;            &lt;Array as=&quot;points&quot;&gt;&#10;              &lt;mxPoint x=&quot;-570&quot; y=&quot;730&quot; /&gt;&#10;              &lt;mxPoint x=&quot;-1050&quot; y=&quot;760&quot; /&gt;&#10;            &lt;/Array&gt;&#10;            &lt;mxPoint as=&quot;offset&quot; /&gt;&#10;            &lt;mxPoint x=&quot;-540&quot; y=&quot;750&quot; as=&quot;targetPoint&quot; /&gt;&#10;          &lt;/mxGeometry&gt;&#10;        &lt;/mxCell&gt;&#10;        &lt;mxCell id=&quot;WSzhCSFJq9Se-K6iD0M2-89&quot; value=&quot;mstrfip_var_update&quot; style=&quot;html=1;verticalAlign=bottom;endArrow=block;edgeStyle=elbowEdgeStyle;elbow=vertical;curved=0;rounded=0;&quot; edge=&quot;1&quot; parent=&quot;1&quot; source=&quot;WSzhCSFJq9Se-K6iD0M2-87&quot; target=&quot;WSzhCSFJq9Se-K6iD0M2-101&quot;&gt;&#10;          &lt;mxGeometry relative=&quot;1&quot; as=&quot;geometry&quot;&gt;&#10;            &lt;mxPoint x=&quot;-500&quot; y=&quot;760&quot; as=&quot;sourcePoint&quot; /&gt;&#10;            &lt;Array as=&quot;points&quot;&gt;&#10;              &lt;mxPoint x=&quot;-930&quot; y=&quot;760&quot; /&gt;&#10;              &lt;mxPoint x=&quot;-1410&quot; y=&quot;790&quot; /&gt;&#10;            &lt;/Array&gt;&#10;            &lt;mxPoint as=&quot;offset&quot; /&gt;&#10;            &lt;mxPoint x=&quot;-1145&quot; y=&quot;760&quot; as=&quot;targetPoint&quot; /&gt;&#10;          &lt;/mxGeometry&gt;&#10;        &lt;/mxCell&gt;&#10;        &lt;mxCell id=&quot;WSzhCSFJq9Se-K6iD0M2-90&quot; value=&quot;&quot; style=&quot;html=1;verticalAlign=bottom;endArrow=open;dashed=1;endSize=8;edgeStyle=elbowEdgeStyle;elbow=vertical;curved=0;rounded=0;dashPattern=1 4;&quot; edge=&quot;1&quot; parent=&quot;1&quot; source=&quot;WSzhCSFJq9Se-K6iD0M2-101&quot; target=&quot;WSzhCSFJq9Se-K6iD0M2-87&quot;&gt;&#10;          &lt;mxGeometry relative=&quot;1&quot; as=&quot;geometry&quot;&gt;&#10;            &lt;mxPoint x=&quot;-515&quot; y=&quot;740&quot; as=&quot;targetPoint&quot; /&gt;&#10;            &lt;mxPoint x=&quot;-1130&quot; y=&quot;780&quot; as=&quot;sourcePoint&quot; /&gt;&#10;            &lt;Array as=&quot;points&quot;&gt;&#10;              &lt;mxPoint x=&quot;-1060&quot; y=&quot;820&quot; /&gt;&#10;              &lt;mxPoint x=&quot;-1030&quot; y=&quot;830&quot; /&gt;&#10;              &lt;mxPoint x=&quot;-795&quot; y=&quot;780&quot; /&gt;&#10;            &lt;/Array&gt;&#10;          &lt;/mxGeometry&gt;&#10;        &lt;/mxCell&gt;&#10;        &lt;mxCell id=&quot;WSzhCSFJq9Se-K6iD0M2-91&quot; value=&quot;for all cons variables&quot; style=&quot;shape=umlFrame;whiteSpace=wrap;html=1;pointerEvents=0;width=90;height=30;&quot; vertex=&quot;1&quot; parent=&quot;1&quot;&gt;&#10;          &lt;mxGeometry x=&quot;-1260&quot; y=&quot;740&quot; width=&quot;790&quot; height=&quot;160&quot; as=&quot;geometry&quot; /&gt;&#10;        &lt;/mxCell&gt;&#10;        &lt;mxCell id=&quot;WSzhCSFJq9Se-K6iD0M2-92&quot; value=&quot;&quot; style=&quot;html=1;verticalAlign=bottom;endArrow=open;dashed=1;endSize=8;edgeStyle=elbowEdgeStyle;elbow=vertical;curved=0;rounded=0;dashPattern=1 4;&quot; edge=&quot;1&quot; parent=&quot;1&quot;&gt;&#10;          &lt;mxGeometry relative=&quot;1&quot; as=&quot;geometry&quot;&gt;&#10;            &lt;mxPoint x=&quot;-615&quot; y=&quot;920&quot; as=&quot;targetPoint&quot; /&gt;&#10;            &lt;mxPoint x=&quot;-495&quot; y=&quot;920&quot; as=&quot;sourcePoint&quot; /&gt;&#10;            &lt;Array as=&quot;points&quot;&gt;&#10;              &lt;mxPoint x=&quot;-560&quot; y=&quot;920&quot; /&gt;&#10;            &lt;/Array&gt;&#10;          &lt;/mxGeometry&gt;&#10;        &lt;/mxCell&gt;&#10;        &lt;mxCell id=&quot;WSzhCSFJq9Se-K6iD0M2-93&quot; value=&quot;&quot; style=&quot;html=1;points=[];perimeter=orthogonalPerimeter;outlineConnect=0;targetShapes=umlLifeline;portConstraint=eastwest;newEdgeStyle={&amp;quot;edgeStyle&amp;quot;:&amp;quot;elbowEdgeStyle&amp;quot;,&amp;quot;elbow&amp;quot;:&amp;quot;vertical&amp;quot;,&amp;quot;curved&amp;quot;:0,&amp;quot;rounded&amp;quot;:0};fillColor=#dae8fc;strokeColor=#6c8ebf;&quot; vertex=&quot;1&quot; parent=&quot;1&quot;&gt;&#10;          &lt;mxGeometry x=&quot;-495&quot; y=&quot;970&quot; width=&quot;10&quot; height=&quot;150&quot; as=&quot;geometry&quot; /&gt;&#10;        &lt;/mxCell&gt;&#10;        &lt;mxCell id=&quot;WSzhCSFJq9Se-K6iD0M2-94&quot; value=&quot;nf_node_&amp;lt;br&amp;gt;send_all_prod_var&quot; style=&quot;html=1;verticalAlign=bottom;endArrow=block;edgeStyle=elbowEdgeStyle;elbow=vertical;curved=0;rounded=0;&quot; edge=&quot;1&quot; parent=&quot;1&quot;&gt;&#10;          &lt;mxGeometry x=&quot;-0.0833&quot; relative=&quot;1&quot; as=&quot;geometry&quot;&gt;&#10;            &lt;mxPoint x=&quot;-615&quot; y=&quot;970&quot; as=&quot;sourcePoint&quot; /&gt;&#10;            &lt;Array as=&quot;points&quot;&gt;&#10;              &lt;mxPoint x=&quot;-570&quot; y=&quot;970&quot; /&gt;&#10;              &lt;mxPoint x=&quot;-1050&quot; y=&quot;1000&quot; /&gt;&#10;            &lt;/Array&gt;&#10;            &lt;mxPoint as=&quot;offset&quot; /&gt;&#10;            &lt;mxPoint x=&quot;-495&quot; y=&quot;970&quot; as=&quot;targetPoint&quot; /&gt;&#10;          &lt;/mxGeometry&gt;&#10;        &lt;/mxCell&gt;&#10;        &lt;mxCell id=&quot;WSzhCSFJq9Se-K6iD0M2-96&quot; value=&quot;mstrfip_var_write&quot; style=&quot;html=1;verticalAlign=bottom;endArrow=block;edgeStyle=elbowEdgeStyle;elbow=vertical;curved=0;rounded=0;&quot; edge=&quot;1&quot; parent=&quot;1&quot; target=&quot;WSzhCSFJq9Se-K6iD0M2-102&quot;&gt;&#10;          &lt;mxGeometry relative=&quot;1&quot; as=&quot;geometry&quot;&gt;&#10;            &lt;mxPoint x=&quot;-495&quot; y=&quot;1000&quot; as=&quot;sourcePoint&quot; /&gt;&#10;            &lt;Array as=&quot;points&quot;&gt;&#10;              &lt;mxPoint x=&quot;-930&quot; y=&quot;1000&quot; /&gt;&#10;              &lt;mxPoint x=&quot;-1410&quot; y=&quot;1030&quot; /&gt;&#10;            &lt;/Array&gt;&#10;            &lt;mxPoint as=&quot;offset&quot; /&gt;&#10;            &lt;mxPoint x=&quot;-1145&quot; y=&quot;1000&quot; as=&quot;targetPoint&quot; /&gt;&#10;          &lt;/mxGeometry&gt;&#10;        &lt;/mxCell&gt;&#10;        &lt;mxCell id=&quot;WSzhCSFJq9Se-K6iD0M2-97&quot; value=&quot;&quot; style=&quot;html=1;verticalAlign=bottom;endArrow=open;dashed=1;endSize=8;edgeStyle=elbowEdgeStyle;elbow=vertical;curved=0;rounded=0;dashPattern=1 4;&quot; edge=&quot;1&quot; parent=&quot;1&quot; target=&quot;WSzhCSFJq9Se-K6iD0M2-93&quot;&gt;&#10;          &lt;mxGeometry relative=&quot;1&quot; as=&quot;geometry&quot;&gt;&#10;            &lt;mxPoint x=&quot;-555&quot; y=&quot;1100&quot; as=&quot;targetPoint&quot; /&gt;&#10;            &lt;mxPoint x=&quot;-1140.0000000000002&quot; y=&quot;1060&quot; as=&quot;sourcePoint&quot; /&gt;&#10;            &lt;Array as=&quot;points&quot;&gt;&#10;              &lt;mxPoint x=&quot;-925&quot; y=&quot;1080&quot; /&gt;&#10;              &lt;mxPoint x=&quot;-1025&quot; y=&quot;1100&quot; /&gt;&#10;              &lt;mxPoint x=&quot;-790&quot; y=&quot;1000&quot; /&gt;&#10;            &lt;/Array&gt;&#10;          &lt;/mxGeometry&gt;&#10;        &lt;/mxCell&gt;&#10;        &lt;mxCell id=&quot;WSzhCSFJq9Se-K6iD0M2-98&quot; value=&quot;for all prod variables&quot; style=&quot;shape=umlFrame;whiteSpace=wrap;html=1;pointerEvents=0;width=90;height=30;&quot; vertex=&quot;1&quot; parent=&quot;1&quot;&gt;&#10;          &lt;mxGeometry x=&quot;-1260&quot; y=&quot;980&quot; width=&quot;790&quot; height=&quot;120&quot; as=&quot;geometry&quot; /&gt;&#10;        &lt;/mxCell&gt;&#10;        &lt;mxCell id=&quot;WSzhCSFJq9Se-K6iD0M2-99&quot; value=&quot;&quot; style=&quot;html=1;verticalAlign=bottom;endArrow=open;dashed=1;endSize=8;edgeStyle=elbowEdgeStyle;elbow=vertical;curved=0;rounded=0;dashPattern=1 4;&quot; edge=&quot;1&quot; parent=&quot;1&quot;&gt;&#10;          &lt;mxGeometry relative=&quot;1&quot; as=&quot;geometry&quot;&gt;&#10;            &lt;mxPoint x=&quot;-1144.9999999999998&quot; y=&quot;1140&quot; as=&quot;targetPoint&quot; /&gt;&#10;            &lt;mxPoint x=&quot;-625&quot; y=&quot;1140&quot; as=&quot;sourcePoint&quot; /&gt;&#10;            &lt;Array as=&quot;points&quot;&gt;&#10;              &lt;mxPoint x=&quot;-935&quot; y=&quot;1140&quot; /&gt;&#10;            &lt;/Array&gt;&#10;          &lt;/mxGeometry&gt;&#10;        &lt;/mxCell&gt;&#10;        &lt;mxCell id=&quot;WSzhCSFJq9Se-K6iD0M2-100&quot; value=&quot;message has IRQ&quot; style=&quot;shape=umlFrame;whiteSpace=wrap;html=1;pointerEvents=0;width=110;height=30;&quot; vertex=&quot;1&quot; parent=&quot;1&quot;&gt;&#10;          &lt;mxGeometry x=&quot;-1280&quot; y=&quot;600&quot; width=&quot;830&quot; height=&quot;550&quot; as=&quot;geometry&quot; /&gt;&#10;        &lt;/mxCell&gt;&#10;        &lt;mxCell id=&quot;WSzhCSFJq9Se-K6iD0M2-101&quot; value=&quot;&quot; style=&quot;html=1;points=[];perimeter=orthogonalPerimeter;outlineConnect=0;targetShapes=umlLifeline;portConstraint=eastwest;newEdgeStyle={&amp;quot;edgeStyle&amp;quot;:&amp;quot;elbowEdgeStyle&amp;quot;,&amp;quot;elbow&amp;quot;:&amp;quot;vertical&amp;quot;,&amp;quot;curved&amp;quot;:0,&amp;quot;rounded&amp;quot;:0};fillColor=#dae8fc;strokeColor=#6c8ebf;&quot; vertex=&quot;1&quot; parent=&quot;1&quot;&gt;&#10;          &lt;mxGeometry x=&quot;-1150&quot; y=&quot;760&quot; width=&quot;10&quot; height=&quot;60&quot; as=&quot;geometry&quot; /&gt;&#10;        &lt;/mxCell&gt;&#10;        &lt;mxCell id=&quot;WSzhCSFJq9Se-K6iD0M2-102&quot; value=&quot;&quot; style=&quot;html=1;points=[];perimeter=orthogonalPerimeter;outlineConnect=0;targetShapes=umlLifeline;portConstraint=eastwest;newEdgeStyle={&amp;quot;edgeStyle&amp;quot;:&amp;quot;elbowEdgeStyle&amp;quot;,&amp;quot;elbow&amp;quot;:&amp;quot;vertical&amp;quot;,&amp;quot;curved&amp;quot;:0,&amp;quot;rounded&amp;quot;:0};fillColor=#dae8fc;strokeColor=#6c8ebf;&quot; vertex=&quot;1&quot; parent=&quot;1&quot;&gt;&#10;          &lt;mxGeometry x=&quot;-1150&quot; y=&quot;1000&quot; width=&quot;10&quot; height=&quot;80&quot; as=&quot;geometry&quot; /&gt;&#10;        &lt;/mxCell&gt;&#10;        &lt;mxCell id=&quot;WSzhCSFJq9Se-K6iD0M2-103&quot; value=&quot;remove message&amp;lt;br&amp;gt;from buffer&quot; style=&quot;html=1;align=left;spacingLeft=2;endArrow=block;rounded=0;edgeStyle=orthogonalEdgeStyle;curved=0;rounded=0;&quot; edge=&quot;1&quot; parent=&quot;1&quot;&gt;&#10;          &lt;mxGeometry relative=&quot;1&quot; as=&quot;geometry&quot;&gt;&#10;            &lt;mxPoint x=&quot;-1140&quot; y=&quot;779.99&quot; as=&quot;sourcePoint&quot; /&gt;&#10;            &lt;Array as=&quot;points&quot;&gt;&#10;              &lt;mxPoint x=&quot;-1115&quot; y=&quot;779.99&quot; /&gt;&#10;              &lt;mxPoint x=&quot;-1115&quot; y=&quot;809.99&quot; /&gt;&#10;            &lt;/Array&gt;&#10;            &lt;mxPoint x=&quot;-1140&quot; y=&quot;809.99&quot; as=&quot;targetPoint&quot; /&gt;&#10;          &lt;/mxGeometry&gt;&#10;        &lt;/mxCell&gt;&#10;        &lt;mxCell id=&quot;WSzhCSFJq9Se-K6iD0M2-110&quot; value=&quot;mqospi_async_write&quot; style=&quot;html=1;verticalAlign=bottom;endArrow=block;edgeStyle=elbowEdgeStyle;elbow=vertical;curved=0;rounded=0;&quot; edge=&quot;1&quot; parent=&quot;1&quot; target=&quot;WSzhCSFJq9Se-K6iD0M2-105&quot; source=&quot;WSzhCSFJq9Se-K6iD0M2-102&quot;&gt;&#10;          &lt;mxGeometry relative=&quot;1&quot; as=&quot;geometry&quot;&gt;&#10;            &lt;mxPoint x=&quot;-1145&quot; y=&quot;1020.0000000000001&quot; as=&quot;sourcePoint&quot; /&gt;&#10;            &lt;Array as=&quot;points&quot;&gt;&#10;              &lt;mxPoint x=&quot;-1130&quot; y=&quot;1020.0000000000001&quot; /&gt;&#10;            &lt;/Array&gt;&#10;            &lt;mxPoint as=&quot;offset&quot; /&gt;&#10;          &lt;/mxGeometry&gt;&#10;        &lt;/mxCell&gt;&#10;        &lt;mxCell id=&quot;WSzhCSFJq9Se-K6iD0M2-111&quot; value=&quot;&quot; style=&quot;html=1;points=[];perimeter=orthogonalPerimeter;outlineConnect=0;targetShapes=umlLifeline;portConstraint=eastwest;newEdgeStyle={&amp;quot;edgeStyle&amp;quot;:&amp;quot;elbowEdgeStyle&amp;quot;,&amp;quot;elbow&amp;quot;:&amp;quot;vertical&amp;quot;,&amp;quot;curved&amp;quot;:0,&amp;quot;rounded&amp;quot;:0};fillColor=#dae8fc;strokeColor=#6c8ebf;&quot; vertex=&quot;1&quot; parent=&quot;1&quot;&gt;&#10;          &lt;mxGeometry x=&quot;-895&quot; y=&quot;1030&quot; width=&quot;10&quot; height=&quot;20&quot; as=&quot;geometry&quot; /&gt;&#10;        &lt;/mxCell&gt;&#10;        &lt;mxCell id=&quot;WSzhCSFJq9Se-K6iD0M2-112&quot; value=&quot;&quot; style=&quot;html=1;verticalAlign=bottom;endArrow=open;dashed=1;endSize=8;edgeStyle=elbowEdgeStyle;elbow=vertical;curved=0;rounded=0;dashPattern=1 4;&quot; edge=&quot;1&quot; parent=&quot;1&quot;&gt;&#10;          &lt;mxGeometry relative=&quot;1&quot; as=&quot;geometry&quot;&gt;&#10;            &lt;mxPoint x=&quot;-615&quot; y=&quot;1120&quot; as=&quot;targetPoint&quot; /&gt;&#10;            &lt;mxPoint x=&quot;-495&quot; y=&quot;1120&quot; as=&quot;sourcePoint&quot; /&gt;&#10;            &lt;Array as=&quot;points&quot;&gt;&#10;              &lt;mxPoint x=&quot;-560&quot; y=&quot;1120&quot; /&gt;&#10;            &lt;/Array&gt;&#10;          &lt;/mxGeometry&gt;&#10;        &lt;/mxCell&gt;&#10;        &lt;mxCell id=&quot;WSzhCSFJq9Se-K6iD0M2-113&quot; value=&quot;save &amp;lt;br&amp;gt;prod var&amp;lt;br&amp;gt;timestamp&quot; style=&quot;html=1;align=left;spacingLeft=2;endArrow=block;rounded=0;edgeStyle=orthogonalEdgeStyle;curved=0;rounded=0;&quot; edge=&quot;1&quot; parent=&quot;1&quot;&gt;&#10;          &lt;mxGeometry relative=&quot;1&quot; as=&quot;geometry&quot;&gt;&#10;            &lt;mxPoint x=&quot;-615&quot; y=&quot;634.99&quot; as=&quot;sourcePoint&quot; /&gt;&#10;            &lt;Array as=&quot;points&quot;&gt;&#10;              &lt;mxPoint x=&quot;-590&quot; y=&quot;634.99&quot; /&gt;&#10;              &lt;mxPoint x=&quot;-590&quot; y=&quot;664.99&quot; /&gt;&#10;            &lt;/Array&gt;&#10;            &lt;mxPoint x=&quot;-615&quot; y=&quot;664.99&quot; as=&quot;targetPoint&quot; /&gt;&#10;            &lt;mxPoint as=&quot;offset&quot; /&gt;&#10;          &lt;/mxGeometry&gt;&#10;        &lt;/mxCell&gt;&#10;        &lt;mxCell id=&quot;WSzhCSFJq9Se-K6iD0M2-114&quot; value=&quot;trigger every 3 ms,&amp;amp;nbsp;&amp;lt;br&amp;gt;or immediately if there &amp;lt;br&amp;gt;were messages in the &amp;lt;br&amp;gt;previous cycle&quot; style=&quot;html=1;verticalAlign=bottom;startArrow=oval;startFill=1;endArrow=block;startSize=8;edgeStyle=elbowEdgeStyle;elbow=vertical;curved=0;rounded=0;&quot; edge=&quot;1&quot; parent=&quot;1&quot; target=&quot;WSzhCSFJq9Se-K6iD0M2-8&quot;&gt;&#10;          &lt;mxGeometry x=&quot;-0.1515&quot; width=&quot;60&quot; relative=&quot;1&quot; as=&quot;geometry&quot;&gt;&#10;            &lt;mxPoint x=&quot;-1370&quot; y=&quot;330&quot; as=&quot;sourcePoint&quot; /&gt;&#10;            &lt;mxPoint x=&quot;-1260&quot; y=&quot;330&quot; as=&quot;targetPoint&quot; /&gt;&#10;            &lt;Array as=&quot;points&quot;&gt;&#10;              &lt;mxPoint x=&quot;-1280&quot; y=&quot;330&quot; /&gt;&#10;            &lt;/Array&gt;&#10;            &lt;mxPoint as=&quot;offset&quot; /&gt;&#10;          &lt;/mxGeometry&gt;&#10;        &lt;/mxCell&gt;&#10;      &lt;/root&gt;&#10;    &lt;/mxGraphModel&gt;&#10;  &lt;/diagram&gt;&#10;&lt;/mxfile&gt;&#10;"><defs/><g><rect x="840" y="80" width="100" height="40" fill="rgb(255, 255, 255)" stroke="rgb(0, 0, 0)" pointer-events="all"/><path d="M 890 120 L 890 1030" fill="none" stroke="rgb(0, 0, 0)" stroke-miterlimit="10" stroke-dasharray="3 3" pointer-events="all"/><g transform="translate(-0.5 -0.5)"><switch><foreignObject pointer-events="none" width="100%" height="100%" requiredFeatures="http://www.w3.org/TR/SVG11/feature#Extensibility" style="overflow: visible; text-align: left;"><div xmlns="http://www.w3.org/1999/xhtml" style="display: flex; align-items: unsafe center; justify-content: unsafe center; width: 98px; height: 1px; padding-top: 100px; margin-left: 841px;"><div data-drawio-colors="color: rgb(0, 0, 0); " style="box-sizing: border-box; font-size: 0px; text-align: center;"><div style="display: inline-block; font-size: 12px; font-family: Helvetica; color: rgb(0, 0, 0); line-height: 1.2; pointer-events: all; white-space: normal; overflow-wrap: normal;">NF NODE</div></div></div></foreignObject><text x="890" y="104" fill="rgb(0, 0, 0)" font-family="Helvetica" font-size="12px" text-anchor="middle">NF NODE</text></switch></g><rect x="885" y="580" width="10" height="190" fill="#dae8fc" stroke="#6c8ebf" pointer-events="all"/><path d="M 885 690 L 860 690 L 860 730 L 876.88 730" fill="none" stroke="rgb(0, 0, 0)" stroke-miterlimit="10" pointer-events="stroke"/><path d="M 883.88 730 L 876.88 733.5 L 876.88 726.5 Z" fill="rgb(0, 0, 0)" stroke="rgb(0, 0, 0)" stroke-miterlimit="10" pointer-events="all"/><g transform="translate(-0.5 -0.5)"><switch><foreignObject pointer-events="none" width="100%" height="100%" requiredFeatures="http://www.w3.org/TR/SVG11/feature#Extensibility" style="overflow: visible; text-align: left;"><div xmlns="http://www.w3.org/1999/xhtml" style="display: flex; align-items: unsafe center; justify-content: unsafe flex-start; width: 1px; height: 1px; padding-top: 709px; margin-left: 834px;"><div data-drawio-colors="color: rgb(0, 0, 0); background-color: rgb(255, 255, 255); " style="box-sizing: border-box; font-size: 0px; text-align: left;"><div style="display: inline-block; font-size: 11px; font-family: Helvetica; color: rgb(0, 0, 0); line-height: 1.2; pointer-events: all; background-color: rgb(255, 255, 255); white-space: nowrap;">save <br />variable</div></div></div></foreignObject><text x="834" y="713" fill="rgb(0, 0, 0)" font-family="Helvetica" font-size="11px">save...</text></switch></g><rect x="320" y="80" width="100" height="40" fill="rgb(255, 255, 255)" stroke="rgb(0, 0, 0)" pointer-events="all"/><path d="M 370 120 L 370 1030" fill="none" stroke="rgb(0, 0, 0)" stroke-miterlimit="10" stroke-dasharray="3 3" pointer-events="all"/><g transform="translate(-0.5 -0.5)"><switch><foreignObject pointer-events="none" width="100%" height="100%" requiredFeatures="http://www.w3.org/TR/SVG11/feature#Extensibility" style="overflow: visible; text-align: left;"><div xmlns="http://www.w3.org/1999/xhtml" style="display: flex; align-items: unsafe center; justify-content: unsafe center; width: 98px; height: 1px; padding-top: 100px; margin-left: 321px;"><div data-drawio-colors="color: rgb(0, 0, 0); " style="box-sizing: border-box; font-size: 0px; text-align: center;"><div style="display: inline-block; font-size: 12px; font-family: Helvetica; color: rgb(0, 0, 0); line-height: 1.2; pointer-events: all; white-space: normal; overflow-wrap: normal;">MQOSPI</div></div></div></foreignObject><text x="370" y="104" fill="rgb(0, 0, 0)" font-family="Helvetica" font-size="12px" text-anchor="middle">MQOSPI</text></switch></g><rect x="365" y="870" width="10" height="40" fill="#dae8fc" stroke="#6c8ebf" pointer-events="all"/><path d="M 369.5 910 L 300 910 L 242.24 910" fill="none" stroke="rgb(0, 0, 0)" stroke-miterlimit="10" stroke-dasharray="1 4" pointer-events="stroke"/><path d="M 250.12 905.5 L 241.12 910 L 250.12 914.5" fill="none" stroke="rgb(0, 0, 0)" stroke-miterlimit="10" pointer-events="all"/><path d="M 375 880 L 440 880 L 476.88 880" fill="none" stroke="rgb(0, 0, 0)" stroke-miterlimit="10" pointer-events="stroke"/><path d="M 483.88 880 L 476.88 883.5 L 476.88 876.5 Z" fill="rgb(0, 0, 0)" stroke="rgb(0, 0, 0)" stroke-miterlimit="10" pointer-events="all"/><g transform="translate(-0.5 -0.5)"><switch><foreignObject pointer-events="none" width="100%" height="100%" requiredFeatures="http://www.w3.org/TR/SVG11/feature#Extensibility" style="overflow: visible; text-align: left;"><div xmlns="http://www.w3.org/1999/xhtml" style="display: flex; align-items: unsafe flex-end; justify-content: unsafe center; width: 1px; height: 1px; padding-top: 877px; margin-left: 431px;"><div data-drawio-colors="color: rgb(0, 0, 0); background-color: rgb(255, 255, 255); " style="box-sizing: border-box; font-size: 0px; text-align: center;"><div style="display: inline-block; font-size: 11px; font-family: Helvetica; color: rgb(0, 0, 0); line-height: 1.2; pointer-events: all; background-color: rgb(255, 255, 255); white-space: nowrap;">spi_dma_send</div></div></div></foreignObject><text x="431" y="877" fill="rgb(0, 0, 0)" font-family="Helvetica" font-size="11px" text-anchor="middle">spi_dma_send</text></switch></g><path d="M 489.5 900 L 415 900 L 377.24 900" fill="none" stroke="rgb(0, 0, 0)" stroke-miterlimit="10" stroke-dasharray="1 4" pointer-events="stroke"/><path d="M 385.12 895.5 L 376.12 900 L 385.12 904.5" fill="none" stroke="rgb(0, 0, 0)" stroke-miterlimit="10" pointer-events="all"/><rect x="180" y="80" width="100" height="40" fill="rgb(255, 255, 255)" stroke="rgb(0, 0, 0)" pointer-events="all"/><path d="M 230 120 L 230 1020" fill="none" stroke="rgb(0, 0, 0)" stroke-miterlimit="10" stroke-dasharray="3 3" pointer-events="all"/><g transform="translate(-0.5 -0.5)"><switch><foreignObject pointer-events="none" width="100%" height="100%" requiredFeatures="http://www.w3.org/TR/SVG11/feature#Extensibility" style="overflow: visible; text-align: left;"><div xmlns="http://www.w3.org/1999/xhtml" style="display: flex; align-items: unsafe center; justify-content: unsafe center; width: 98px; height: 1px; padding-top: 100px; margin-left: 181px;"><div data-drawio-colors="color: rgb(0, 0, 0); " style="box-sizing: border-box; font-size: 0px; text-align: center;"><div style="display: inline-block; font-size: 12px; font-family: Helvetica; color: rgb(0, 0, 0); line-height: 1.2; pointer-events: all; white-space: normal; overflow-wrap: normal;">LibMasterFip</div></div></div></foreignObject><text x="230" y="104" fill="rgb(0, 0, 0)" font-family="Helvetica" font-size="12px" text-anchor="middle">LibMasterFip</text></switch></g><rect x="225" y="180" width="10" height="840" fill="#dae8fc" stroke="#6c8ebf" pointer-events="all"/><path d="M 235 410 L 260 410 L 260 440 L 243.12 440" fill="none" stroke="rgb(0, 0, 0)" stroke-miterlimit="10" pointer-events="stroke"/><path d="M 236.12 440 L 243.12 436.5 L 243.12 443.5 Z" fill="rgb(0, 0, 0)" stroke="rgb(0, 0, 0)" stroke-miterlimit="10" pointer-events="all"/><g transform="translate(-0.5 -0.5)"><switch><foreignObject pointer-events="none" width="100%" height="100%" requiredFeatures="http://www.w3.org/TR/SVG11/feature#Extensibility" style="overflow: visible; text-align: left;"><div xmlns="http://www.w3.org/1999/xhtml" style="display: flex; align-items: unsafe center; justify-content: unsafe flex-start; width: 1px; height: 1px; padding-top: 425px; margin-left: 264px;"><div data-drawio-colors="color: rgb(0, 0, 0); background-color: rgb(255, 255, 255); " style="box-sizing: border-box; font-size: 0px; text-align: left;"><div style="display: inline-block; font-size: 11px; font-family: Helvetica; color: rgb(0, 0, 0); line-height: 1.2; pointer-events: all; background-color: rgb(255, 255, 255); white-space: nowrap;">check if<br />message has IRQ</div></div></div></foreignObject><text x="264" y="428" fill="rgb(0, 0, 0)" font-family="Helvetica" font-size="11px">check if...</text></switch></g><rect x="570" y="80" width="100" height="40" fill="rgb(255, 255, 255)" stroke="rgb(0, 0, 0)" pointer-events="all"/><path d="M 620 120 L 620 1040" fill="none" stroke="rgb(0, 0, 0)" stroke-miterlimit="10" stroke-dasharray="3 3" pointer-events="all"/><g transform="translate(-0.5 -0.5)"><switch><foreignObject pointer-events="none" width="100%" height="100%" requiredFeatures="http://www.w3.org/TR/SVG11/feature#Extensibility" style="overflow: visible; text-align: left;"><div xmlns="http://www.w3.org/1999/xhtml" style="display: flex; align-items: unsafe center; justify-content: unsafe center; width: 98px; height: 1px; padding-top: 100px; margin-left: 571px;"><div data-drawio-colors="color: rgb(0, 0, 0); " style="box-sizing: border-box; font-size: 0px; text-align: center;"><div style="display: inline-block; font-size: 12px; font-family: Helvetica; color: rgb(0, 0, 0); line-height: 1.2; pointer-events: all; white-space: normal; overflow-wrap: normal;">GPIO</div></div></div></foreignObject><text x="620" y="104" fill="rgb(0, 0, 0)" font-family="Helvetica" font-size="12px" text-anchor="middle">GPIO</text></switch></g><rect x="710" y="80" width="100" height="40" fill="rgb(255, 255, 255)" stroke="rgb(0, 0, 0)" pointer-events="all"/><path d="M 760 120 L 760 1030" fill="none" stroke="rgb(0, 0, 0)" stroke-miterlimit="10" stroke-dasharray="3 3" pointer-events="all"/><g transform="translate(-0.5 -0.5)"><switch><foreignObject pointer-events="none" width="100%" height="100%" requiredFeatures="http://www.w3.org/TR/SVG11/feature#Extensibility" style="overflow: visible; text-align: left;"><div xmlns="http://www.w3.org/1999/xhtml" style="display: flex; align-items: unsafe center; justify-content: unsafe center; width: 98px; height: 1px; padding-top: 100px; margin-left: 711px;"><div data-drawio-colors="color: rgb(0, 0, 0); " style="box-sizing: border-box; font-size: 0px; text-align: center;"><div style="display: inline-block; font-size: 12px; font-family: Helvetica; color: rgb(0, 0, 0); line-height: 1.2; pointer-events: all; white-space: normal; overflow-wrap: normal;">MF_HANDLER</div></div></div></foreignObject><text x="760" y="104" fill="rgb(0, 0, 0)" font-family="Helvetica" font-size="12px" text-anchor="middle">MF_HANDLER</text></switch></g><rect x="0" y="0" width="940" height="40" rx="6" ry="6" fill="rgb(255, 255, 255)" stroke="rgb(0, 0, 0)" pointer-events="all"/><g transform="translate(-0.5 -0.5)"><switch><foreignObject pointer-events="none" width="100%" height="100%" requiredFeatures="http://www.w3.org/TR/SVG11/feature#Extensibility" style="overflow: visible; text-align: left;"><div xmlns="http://www.w3.org/1999/xhtml" style="display: flex; align-items: unsafe center; justify-content: unsafe center; width: 938px; height: 1px; padding-top: 20px; margin-left: 1px;"><div data-drawio-colors="color: rgb(0, 0, 0); " style="box-sizing: border-box; font-size: 0px; text-align: center;"><div style="display: inline-block; font-size: 12px; font-family: Helvetica; color: rgb(0, 0, 0); line-height: 1.2; pointer-events: all; white-space: normal; overflow-wrap: normal;">MasterFip data exchange</div></div></div></foreignObject><text x="470" y="24" fill="rgb(0, 0, 0)" font-family="Helvetica" font-size="12px" text-anchor="middle">MasterFip data exchange</text></switch></g><rect x="440" y="80" width="100" height="40" fill="rgb(255, 255, 255)" stroke="rgb(0, 0, 0)" pointer-events="all"/><path d="M 490 120 L 490 1030" fill="none" stroke="rgb(0, 0, 0)" stroke-miterlimit="10" stroke-dasharray="3 3" pointer-events="all"/><g transform="translate(-0.5 -0.5)"><switch><foreignObject pointer-events="none" width="100%" height="100%" requiredFeatures="http://www.w3.org/TR/SVG11/feature#Extensibility" style="overflow: visible; text-align: left;"><div xmlns="http://www.w3.org/1999/xhtml" style="display: flex; align-items: unsafe center; justify-content: unsafe center; width: 98px; height: 1px; padding-top: 100px; margin-left: 441px;"><div data-drawio-colors="color: rgb(0, 0, 0); " style="box-sizing: border-box; font-size: 0px; text-align: center;"><div style="display: inline-block; font-size: 12px; font-family: Helvetica; color: rgb(0, 0, 0); line-height: 1.2; pointer-events: all; white-space: normal; overflow-wrap: normal;">SPIDMA</div></div></div></foreignObject><text x="490" y="104" fill="rgb(0, 0, 0)" font-family="Helvetica" font-size="12px" text-anchor="middle">SPIDMA</text></switch></g><rect x="365" y="230" width="10" height="40" fill="#dae8fc" stroke="#6c8ebf" pointer-events="all"/><rect x="615" y="240" width="10" height="20" fill="#dae8fc" stroke="#6c8ebf" pointer-events="all"/><rect x="365" y="310" width="10" height="40" fill="#dae8fc" stroke="#6c8ebf" pointer-events="all"/><path d="M 369.5 350 L 300 350 L 237.24 350" fill="none" stroke="rgb(0, 0, 0)" stroke-miterlimit="10" stroke-dasharray="1 4" pointer-events="stroke"/><path d="M 245.12 345.5 L 236.12 350 L 245.12 354.5" fill="none" stroke="rgb(0, 0, 0)" stroke-miterlimit="10" pointer-events="all"/><rect x="485" y="320" width="10" height="20" fill="#dae8fc" stroke="#6c8ebf" pointer-events="all"/><path d="M 375 320 L 440 320 L 476.88 320" fill="none" stroke="rgb(0, 0, 0)" stroke-miterlimit="10" pointer-events="stroke"/><path d="M 483.88 320 L 476.88 323.5 L 476.88 316.5 Z" fill="rgb(0, 0, 0)" stroke="rgb(0, 0, 0)" stroke-miterlimit="10" pointer-events="all"/><g transform="translate(-0.5 -0.5)"><switch><foreignObject pointer-events="none" width="100%" height="100%" requiredFeatures="http://www.w3.org/TR/SVG11/feature#Extensibility" style="overflow: visible; text-align: left;"><div xmlns="http://www.w3.org/1999/xhtml" style="display: flex; align-items: unsafe flex-end; justify-content: unsafe center; width: 1px; height: 1px; padding-top: 317px; margin-left: 431px;"><div data-drawio-colors="color: rgb(0, 0, 0); background-color: rgb(255, 255, 255); " style="box-sizing: border-box; font-size: 0px; text-align: center;"><div style="display: inline-block; font-size: 11px; font-family: Helvetica; color: rgb(0, 0, 0); line-height: 1.2; pointer-events: all; background-color: rgb(255, 255, 255); white-space: nowrap;">spi_dma_receive</div></div></div></foreignObject><text x="431" y="317" fill="rgb(0, 0, 0)" font-family="Helvetica" font-size="11px" text-anchor="middle">spi_dma_receive</text></switch></g><path d="M 489.5 340 L 415 340 L 377.24 340" fill="none" stroke="rgb(0, 0, 0)" stroke-miterlimit="10" stroke-dasharray="1 4" pointer-events="stroke"/><path d="M 385.12 335.5 L 376.12 340 L 385.12 344.5" fill="none" stroke="rgb(0, 0, 0)" stroke-miterlimit="10" pointer-events="all"/><path d="M 375 240 L 520 240 L 606.88 240" fill="none" stroke="rgb(0, 0, 0)" stroke-miterlimit="10" pointer-events="stroke"/><path d="M 613.88 240 L 606.88 243.5 L 606.88 236.5 Z" fill="rgb(0, 0, 0)" stroke="rgb(0, 0, 0)" stroke-miterlimit="10" pointer-events="all"/><g transform="translate(-0.5 -0.5)"><switch><foreignObject pointer-events="none" width="100%" height="100%" requiredFeatures="http://www.w3.org/TR/SVG11/feature#Extensibility" style="overflow: visible; text-align: left;"><div xmlns="http://www.w3.org/1999/xhtml" style="display: flex; align-items: unsafe flex-end; justify-content: unsafe center; width: 1px; height: 1px; padding-top: 237px; margin-left: 441px;"><div data-drawio-colors="color: rgb(0, 0, 0); background-color: rgb(255, 255, 255); " style="box-sizing: border-box; font-size: 0px; text-align: center;"><div style="display: inline-block; font-size: 11px; font-family: Helvetica; color: rgb(0, 0, 0); line-height: 1.2; pointer-events: all; background-color: rgb(255, 255, 255); white-space: nowrap;">profip_gpio_read</div></div></div></foreignObject><text x="441" y="237" fill="rgb(0, 0, 0)" font-family="Helvetica" font-size="11px" text-anchor="middle">profip_gpio_read</text></switch></g><path d="M 615 260 L 415 260 L 377.24 260" fill="none" stroke="rgb(0, 0, 0)" stroke-miterlimit="10" stroke-dasharray="1 4" pointer-events="stroke"/><path d="M 385.12 255.5 L 376.12 260 L 385.12 264.5" fill="none" stroke="rgb(0, 0, 0)" stroke-miterlimit="10" pointer-events="all"/><path d="M 369.5 270 L 300 270 L 237.24 270" fill="none" stroke="rgb(0, 0, 0)" stroke-miterlimit="10" stroke-dasharray="1 4" pointer-events="stroke"/><path d="M 245.12 265.5 L 236.12 270 L 245.12 274.5" fill="none" stroke="rgb(0, 0, 0)" stroke-miterlimit="10" pointer-events="all"/><path d="M 235 310 L 250 310 L 356.88 310" fill="none" stroke="rgb(0, 0, 0)" stroke-miterlimit="10" pointer-events="stroke"/><path d="M 363.88 310 L 356.88 313.5 L 356.88 306.5 Z" fill="rgb(0, 0, 0)" stroke="rgb(0, 0, 0)" stroke-miterlimit="10" pointer-events="all"/><g transform="translate(-0.5 -0.5)"><switch><foreignObject pointer-events="none" width="100%" height="100%" requiredFeatures="http://www.w3.org/TR/SVG11/feature#Extensibility" style="overflow: visible; text-align: left;"><div xmlns="http://www.w3.org/1999/xhtml" style="display: flex; align-items: unsafe flex-end; justify-content: unsafe center; width: 1px; height: 1px; padding-top: 307px; margin-left: 301px;"><div data-drawio-colors="color: rgb(0, 0, 0); background-color: rgb(255, 255, 255); " style="box-sizing: border-box; font-size: 0px; text-align: center;"><div style="display: inline-block; font-size: 11px; font-family: Helvetica; color: rgb(0, 0, 0); line-height: 1.2; pointer-events: all; background-color: rgb(255, 255, 255); white-space: nowrap;">mqospi_async_read</div></div></div></foreignObject><text x="301" y="307" fill="rgb(0, 0, 0)" font-family="Helvetica" font-size="11px" text-anchor="middle">mqospi_async_read</text></switch></g><path d="M 320 170 L 380 170 L 380 185 L 370 200 L 320 200 Z" fill="rgb(255, 255, 255)" stroke="rgb(0, 0, 0)" stroke-miterlimit="10" pointer-events="all"/><path d="M 380 170 L 640 170 L 640 280 L 320 280 L 320 200" fill="none" stroke="rgb(0, 0, 0)" stroke-miterlimit="10" pointer-events="none"/><g transform="translate(-0.5 -0.5)"><switch><foreignObject pointer-events="none" width="100%" height="100%" requiredFeatures="http://www.w3.org/TR/SVG11/feature#Extensibility" style="overflow: visible; text-align: left;"><div xmlns="http://www.w3.org/1999/xhtml" style="display: flex; align-items: unsafe center; justify-content: unsafe center; width: 58px; height: 1px; padding-top: 185px; margin-left: 321px;"><div data-drawio-colors="color: rgb(0, 0, 0); " style="box-sizing: border-box; font-size: 0px; text-align: center;"><div style="display: inline-block; font-size: 12px; font-family: Helvetica; color: rgb(0, 0, 0); line-height: 1.2; pointer-events: none; white-space: normal; overflow-wrap: normal;">for all RMQ's</div></div></div></foreignObject><text x="350" y="189" fill="rgb(0, 0, 0)" font-family="Helvetica" font-size="12px" text-anchor="middle">for all RM...</text></switch></g><path d="M 235 230 L 240 230 L 356.88 230" fill="none" stroke="rgb(0, 0, 0)" stroke-miterlimit="10" pointer-events="none"/><path d="M 363.88 230 L 356.88 233.5 L 356.88 226.5 Z" fill="rgb(0, 0, 0)" stroke="rgb(0, 0, 0)" stroke-miterlimit="10" pointer-events="none"/><g transform="translate(-0.5 -0.5)"><switch><foreignObject pointer-events="none" width="100%" height="100%" requiredFeatures="http://www.w3.org/TR/SVG11/feature#Extensibility" style="overflow: visible; text-align: left;"><div xmlns="http://www.w3.org/1999/xhtml" style="display: flex; align-items: unsafe flex-end; justify-content: unsafe center; width: 1px; height: 1px; padding-top: 227px; margin-left: 279px;"><div data-drawio-colors="color: rgb(0, 0, 0); background-color: rgb(255, 255, 255); " style="box-sizing: border-box; font-size: 0px; text-align: center;"><div style="display: inline-block; font-size: 11px; font-family: Helvetica; color: rgb(0, 0, 0); line-height: 1.2; pointer-events: none; background-color: rgb(255, 255, 255); white-space: nowrap;">mqospi_poll</div></div></div></foreignObject><text x="279" y="227" fill="rgb(0, 0, 0)" font-family="Helvetica" font-size="11px" text-anchor="middle">mqospi_poll</text></switch></g><path d="M 235 360 L 260 360 L 260 390 L 243.12 390" fill="none" stroke="rgb(0, 0, 0)" stroke-miterlimit="10" pointer-events="none"/><path d="M 236.12 390 L 243.12 386.5 L 243.12 393.5 Z" fill="rgb(0, 0, 0)" stroke="rgb(0, 0, 0)" stroke-miterlimit="10" pointer-events="none"/><g transform="translate(-0.5 -0.5)"><switch><foreignObject pointer-events="none" width="100%" height="100%" requiredFeatures="http://www.w3.org/TR/SVG11/feature#Extensibility" style="overflow: visible; text-align: left;"><div xmlns="http://www.w3.org/1999/xhtml" style="display: flex; align-items: unsafe center; justify-content: unsafe flex-start; width: 1px; height: 1px; padding-top: 375px; margin-left: 264px;"><div data-drawio-colors="color: rgb(0, 0, 0); background-color: rgb(255, 255, 255); " style="box-sizing: border-box; font-size: 0px; text-align: left;"><div style="display: inline-block; font-size: 11px; font-family: Helvetica; color: rgb(0, 0, 0); line-height: 1.2; pointer-events: none; background-color: rgb(255, 255, 255); white-space: nowrap;">save message<br />to buffer</div></div></div></foreignObject><text x="264" y="378" fill="rgb(0, 0, 0)" font-family="Helvetica" font-size="11px">save message...</text></switch></g><path d="M 10 290 L 170 290 L 170 345 L 160 360 L 10 360 Z" fill="rgb(255, 255, 255)" stroke="rgb(0, 0, 0)" stroke-miterlimit="10" pointer-events="all"/><path d="M 170 290 L 940 290 L 940 1010 L 10 1010 L 10 360" fill="none" stroke="rgb(0, 0, 0)" stroke-miterlimit="10" pointer-events="none"/><g transform="translate(-0.5 -0.5)"><switch><foreignObject pointer-events="none" width="100%" height="100%" requiredFeatures="http://www.w3.org/TR/SVG11/feature#Extensibility" style="overflow: visible; text-align: left;"><div xmlns="http://www.w3.org/1999/xhtml" style="display: flex; align-items: unsafe center; justify-content: unsafe center; width: 158px; height: 1px; padding-top: 325px; margin-left: 11px;"><div data-drawio-colors="color: rgb(0, 0, 0); " style="box-sizing: border-box; font-size: 0px; text-align: center;"><div style="display: inline-block; font-size: 12px; font-family: Helvetica; color: rgb(0, 0, 0); line-height: 1.2; pointer-events: none; white-space: normal; overflow-wrap: normal;">for each RMQ for which the poll function returned that "there are messages"</div></div></div></foreignObject><text x="90" y="329" fill="rgb(0, 0, 0)" font-family="Helvetica" font-size="12px" text-anchor="middle">for each RMQ for which the...</text></switch></g><rect x="755" y="470" width="10" height="60" fill="#dae8fc" stroke="#6c8ebf" pointer-events="none"/><path d="M 235 470 L 350 470 L 746.88 470" fill="none" stroke="rgb(0, 0, 0)" stroke-miterlimit="10" pointer-events="none"/><path d="M 753.88 470 L 746.88 473.5 L 746.88 466.5 Z" fill="rgb(0, 0, 0)" stroke="rgb(0, 0, 0)" stroke-miterlimit="10" pointer-events="none"/><g transform="translate(-0.5 -0.5)"><switch><foreignObject pointer-events="none" width="100%" height="100%" requiredFeatures="http://www.w3.org/TR/SVG11/feature#Extensibility" style="overflow: visible; text-align: left;"><div xmlns="http://www.w3.org/1999/xhtml" style="display: flex; align-items: unsafe flex-end; justify-content: unsafe center; width: 1px; height: 1px; padding-top: 467px; margin-left: 495px;"><div data-drawio-colors="color: rgb(0, 0, 0); background-color: rgb(255, 255, 255); " style="box-sizing: border-box; font-size: 0px; text-align: center;"><div style="display: inline-block; font-size: 11px; font-family: Helvetica; color: rgb(0, 0, 0); line-height: 1.2; pointer-events: none; background-color: rgb(255, 255, 255); white-space: nowrap;">callback:  my_prod_var_handler</div></div></div></foreignObject><text x="495" y="467" fill="rgb(0, 0, 0)" font-family="Helvetica" font-size="11px" text-anchor="middle">callback:  my_prod_var_handler</text></switch></g><path d="M 765 470 L 765 530 L 237.24 530" fill="none" stroke="rgb(0, 0, 0)" stroke-miterlimit="10" stroke-dasharray="1 4" pointer-events="none"/><path d="M 245.12 525.5 L 236.12 530 L 245.12 534.5" fill="none" stroke="rgb(0, 0, 0)" stroke-miterlimit="10" pointer-events="none"/><path d="M 235 570 L 350 570 L 746.88 570" fill="none" stroke="rgb(0, 0, 0)" stroke-miterlimit="10" pointer-events="none"/><path d="M 753.88 570 L 746.88 573.5 L 746.88 566.5 Z" fill="rgb(0, 0, 0)" stroke="rgb(0, 0, 0)" stroke-miterlimit="10" pointer-events="none"/><g transform="translate(-0.5 -0.5)"><switch><foreignObject pointer-events="none" width="100%" height="100%" requiredFeatures="http://www.w3.org/TR/SVG11/feature#Extensibility" style="overflow: visible; text-align: left;"><div xmlns="http://www.w3.org/1999/xhtml" style="display: flex; align-items: unsafe flex-end; justify-content: unsafe center; width: 1px; height: 1px; padding-top: 567px; margin-left: 495px;"><div data-drawio-colors="color: rgb(0, 0, 0); background-color: rgb(255, 255, 255); " style="box-sizing: border-box; font-size: 0px; text-align: center;"><div style="display: inline-block; font-size: 11px; font-family: Helvetica; color: rgb(0, 0, 0); line-height: 1.2; pointer-events: none; background-color: rgb(255, 255, 255); white-space: nowrap;">callback:  my_prod_var_handler</div></div></div></foreignObject><text x="495" y="567" fill="rgb(0, 0, 0)" font-family="Helvetica" font-size="11px" text-anchor="middle">callback:  my_prod_var_handler</text></switch></g><rect x="755" y="570" width="10" height="420" fill="#dae8fc" stroke="#6c8ebf" pointer-events="none"/><path d="M 765 580 L 810 580 L 876.88 580" fill="none" stroke="rgb(0, 0, 0)" stroke-miterlimit="10" pointer-events="none"/><path d="M 883.88 580 L 876.88 583.5 L 876.88 576.5 Z" fill="rgb(0, 0, 0)" stroke="rgb(0, 0, 0)" stroke-miterlimit="10" pointer-events="none"/><g transform="translate(-0.5 -0.5)"><switch><foreignObject pointer-events="none" width="100%" height="100%" requiredFeatures="http://www.w3.org/TR/SVG11/feature#Extensibility" style="overflow: visible; text-align: left;"><div xmlns="http://www.w3.org/1999/xhtml" style="display: flex; align-items: unsafe flex-end; justify-content: unsafe center; width: 1px; height: 1px; padding-top: 577px; margin-left: 825px;"><div data-drawio-colors="color: rgb(0, 0, 0); background-color: rgb(255, 255, 255); " style="box-sizing: border-box; font-size: 0px; text-align: center;"><div style="display: inline-block; font-size: 11px; font-family: Helvetica; color: rgb(0, 0, 0); line-height: 1.2; pointer-events: none; background-color: rgb(255, 255, 255); white-space: nowrap;">nf_node_<br />update_all_cons_var</div></div></div></foreignObject><text x="825" y="577" fill="rgb(0, 0, 0)" font-family="Helvetica" font-size="11px" text-anchor="middle">nf_node_...</text></switch></g><path d="M 885 610 L 450 610 L 248.12 610" fill="none" stroke="rgb(0, 0, 0)" stroke-miterlimit="10" pointer-events="none"/><path d="M 241.12 610 L 248.12 606.5 L 248.12 613.5 Z" fill="rgb(0, 0, 0)" stroke="rgb(0, 0, 0)" stroke-miterlimit="10" pointer-events="none"/><g transform="translate(-0.5 -0.5)"><switch><foreignObject pointer-events="none" width="100%" height="100%" requiredFeatures="http://www.w3.org/TR/SVG11/feature#Extensibility" style="overflow: visible; text-align: left;"><div xmlns="http://www.w3.org/1999/xhtml" style="display: flex; align-items: unsafe flex-end; justify-content: unsafe center; width: 1px; height: 1px; padding-top: 607px; margin-left: 562px;"><div data-drawio-colors="color: rgb(0, 0, 0); background-color: rgb(255, 255, 255); " style="box-sizing: border-box; font-size: 0px; text-align: center;"><div style="display: inline-block; font-size: 11px; font-family: Helvetica; color: rgb(0, 0, 0); line-height: 1.2; pointer-events: none; background-color: rgb(255, 255, 255); white-space: nowrap;">mstrfip_var_update</div></div></div></foreignObject><text x="562" y="607" fill="rgb(0, 0, 0)" font-family="Helvetica" font-size="11px" text-anchor="middle">mstrfip_var_update</text></switch></g><path d="M 240 670 L 320 670 L 882.76 670" fill="none" stroke="rgb(0, 0, 0)" stroke-miterlimit="10" stroke-dasharray="1 4" pointer-events="none"/><path d="M 874.88 674.5 L 883.88 670 L 874.88 665.5" fill="none" stroke="rgb(0, 0, 0)" stroke-miterlimit="10" pointer-events="none"/><path d="M 120 590 L 210 590 L 210 605 L 200 620 L 120 620 Z" fill="rgb(255, 255, 255)" stroke="rgb(0, 0, 0)" stroke-miterlimit="10" pointer-events="all"/><path d="M 210 590 L 910 590 L 910 750 L 120 750 L 120 620" fill="none" stroke="rgb(0, 0, 0)" stroke-miterlimit="10" pointer-events="none"/><g transform="translate(-0.5 -0.5)"><switch><foreignObject pointer-events="none" width="100%" height="100%" requiredFeatures="http://www.w3.org/TR/SVG11/feature#Extensibility" style="overflow: visible; text-align: left;"><div xmlns="http://www.w3.org/1999/xhtml" style="display: flex; align-items: unsafe center; justify-content: unsafe center; width: 88px; height: 1px; padding-top: 605px; margin-left: 121px;"><div data-drawio-colors="color: rgb(0, 0, 0); " style="box-sizing: border-box; font-size: 0px; text-align: center;"><div style="display: inline-block; font-size: 12px; font-family: Helvetica; color: rgb(0, 0, 0); line-height: 1.2; pointer-events: none; white-space: normal; overflow-wrap: normal;">for all cons variables</div></div></div></foreignObject><text x="165" y="609" fill="rgb(0, 0, 0)" font-family="Helvetica" font-size="12px" text-anchor="middle">for all cons va...</text></switch></g><path d="M 885 770 L 820 770 L 767.24 770" fill="none" stroke="rgb(0, 0, 0)" stroke-miterlimit="10" stroke-dasharray="1 4" pointer-events="none"/><path d="M 775.12 765.5 L 766.12 770 L 775.12 774.5" fill="none" stroke="rgb(0, 0, 0)" stroke-miterlimit="10" pointer-events="none"/><rect x="885" y="820" width="10" height="150" fill="#dae8fc" stroke="#6c8ebf" pointer-events="none"/><path d="M 765 820 L 810 820 L 876.88 820" fill="none" stroke="rgb(0, 0, 0)" stroke-miterlimit="10" pointer-events="none"/><path d="M 883.88 820 L 876.88 823.5 L 876.88 816.5 Z" fill="rgb(0, 0, 0)" stroke="rgb(0, 0, 0)" stroke-miterlimit="10" pointer-events="none"/><g transform="translate(-0.5 -0.5)"><switch><foreignObject pointer-events="none" width="100%" height="100%" requiredFeatures="http://www.w3.org/TR/SVG11/feature#Extensibility" style="overflow: visible; text-align: left;"><div xmlns="http://www.w3.org/1999/xhtml" style="display: flex; align-items: unsafe flex-end; justify-content: unsafe center; width: 1px; height: 1px; padding-top: 817px; margin-left: 821px;"><div data-drawio-colors="color: rgb(0, 0, 0); background-color: rgb(255, 255, 255); " style="box-sizing: border-box; font-size: 0px; text-align: center;"><div style="display: inline-block; font-size: 11px; font-family: Helvetica; color: rgb(0, 0, 0); line-height: 1.2; pointer-events: none; background-color: rgb(255, 255, 255); white-space: nowrap;">nf_node_<br />send_all_prod_var</div></div></div></foreignObject><text x="821" y="817" fill="rgb(0, 0, 0)" font-family="Helvetica" font-size="11px" text-anchor="middle">nf_node_...</text></switch></g><path d="M 885 850 L 450 850 L 248.12 850" fill="none" stroke="rgb(0, 0, 0)" stroke-miterlimit="10" pointer-events="none"/><path d="M 241.12 850 L 248.12 846.5 L 248.12 853.5 Z" fill="rgb(0, 0, 0)" stroke="rgb(0, 0, 0)" stroke-miterlimit="10" pointer-events="none"/><g transform="translate(-0.5 -0.5)"><switch><foreignObject pointer-events="none" width="100%" height="100%" requiredFeatures="http://www.w3.org/TR/SVG11/feature#Extensibility" style="overflow: visible; text-align: left;"><div xmlns="http://www.w3.org/1999/xhtml" style="display: flex; align-items: unsafe flex-end; justify-content: unsafe center; width: 1px; height: 1px; padding-top: 847px; margin-left: 562px;"><div data-drawio-colors="color: rgb(0, 0, 0); background-color: rgb(255, 255, 255); " style="box-sizing: border-box; font-size: 0px; text-align: center;"><div style="display: inline-block; font-size: 11px; font-family: Helvetica; color: rgb(0, 0, 0); line-height: 1.2; pointer-events: none; background-color: rgb(255, 255, 255); white-space: nowrap;">mstrfip_var_write</div></div></div></foreignObject><text x="562" y="847" fill="rgb(0, 0, 0)" font-family="Helvetica" font-size="11px" text-anchor="middle">mstrfip_var_write</text></switch></g><path d="M 240 910 L 240 930 L 882.76 930" fill="none" stroke="rgb(0, 0, 0)" stroke-miterlimit="10" stroke-dasharray="1 4" pointer-events="none"/><path d="M 874.88 934.5 L 883.88 930 L 874.88 925.5" fill="none" stroke="rgb(0, 0, 0)" stroke-miterlimit="10" pointer-events="none"/><path d="M 120 830 L 210 830 L 210 845 L 200 860 L 120 860 Z" fill="rgb(255, 255, 255)" stroke="rgb(0, 0, 0)" stroke-miterlimit="10" pointer-events="all"/><path d="M 210 830 L 910 830 L 910 950 L 120 950 L 120 860" fill="none" stroke="rgb(0, 0, 0)" stroke-miterlimit="10" pointer-events="none"/><g transform="translate(-0.5 -0.5)"><switch><foreignObject pointer-events="none" width="100%" height="100%" requiredFeatures="http://www.w3.org/TR/SVG11/feature#Extensibility" style="overflow: visible; text-align: left;"><div xmlns="http://www.w3.org/1999/xhtml" style="display: flex; align-items: unsafe center; justify-content: unsafe center; width: 88px; height: 1px; padding-top: 845px; margin-left: 121px;"><div data-drawio-colors="color: rgb(0, 0, 0); " style="box-sizing: border-box; font-size: 0px; text-align: center;"><div style="display: inline-block; font-size: 12px; font-family: Helvetica; color: rgb(0, 0, 0); line-height: 1.2; pointer-events: none; white-space: normal; overflow-wrap: normal;">for all prod variables</div></div></div></foreignObject><text x="165" y="849" fill="rgb(0, 0, 0)" font-family="Helvetica" font-size="12px" text-anchor="middle">for all prod va...</text></switch></g><path d="M 755 990 L 445 990 L 237.24 990" fill="none" stroke="rgb(0, 0, 0)" stroke-miterlimit="10" stroke-dasharray="1 4" pointer-events="none"/><path d="M 245.12 985.5 L 236.12 990 L 245.12 994.5" fill="none" stroke="rgb(0, 0, 0)" stroke-miterlimit="10" pointer-events="none"/><path d="M 100 450 L 210 450 L 210 465 L 200 480 L 100 480 Z" fill="rgb(255, 255, 255)" stroke="rgb(0, 0, 0)" stroke-miterlimit="10" pointer-events="all"/><path d="M 210 450 L 930 450 L 930 1000 L 100 1000 L 100 480" fill="none" stroke="rgb(0, 0, 0)" stroke-miterlimit="10" pointer-events="none"/><g transform="translate(-0.5 -0.5)"><switch><foreignObject pointer-events="none" width="100%" height="100%" requiredFeatures="http://www.w3.org/TR/SVG11/feature#Extensibility" style="overflow: visible; text-align: left;"><div xmlns="http://www.w3.org/1999/xhtml" style="display: flex; align-items: unsafe center; justify-content: unsafe center; width: 108px; height: 1px; padding-top: 465px; margin-left: 101px;"><div data-drawio-colors="color: rgb(0, 0, 0); " style="box-sizing: border-box; font-size: 0px; text-align: center;"><div style="display: inline-block; font-size: 12px; font-family: Helvetica; color: rgb(0, 0, 0); line-height: 1.2; pointer-events: none; white-space: normal; overflow-wrap: normal;">message has IRQ</div></div></div></foreignObject><text x="155" y="469" fill="rgb(0, 0, 0)" font-family="Helvetica" font-size="12px" text-anchor="middle">message has IRQ</text></switch></g><rect x="230" y="610" width="10" height="60" fill="#dae8fc" stroke="#6c8ebf" pointer-events="none"/><rect x="230" y="850" width="10" height="80" fill="#dae8fc" stroke="#6c8ebf" pointer-events="none"/><path d="M 240 629.99 L 265 630 L 265 660 L 248.12 659.99" fill="none" stroke="rgb(0, 0, 0)" stroke-miterlimit="10" pointer-events="none"/><path d="M 241.12 659.99 L 248.12 656.49 L 248.12 663.49 Z" fill="rgb(0, 0, 0)" stroke="rgb(0, 0, 0)" stroke-miterlimit="10" pointer-events="none"/><g transform="translate(-0.5 -0.5)"><switch><foreignObject pointer-events="none" width="100%" height="100%" requiredFeatures="http://www.w3.org/TR/SVG11/feature#Extensibility" style="overflow: visible; text-align: left;"><div xmlns="http://www.w3.org/1999/xhtml" style="display: flex; align-items: unsafe center; justify-content: unsafe flex-start; width: 1px; height: 1px; padding-top: 645px; margin-left: 269px;"><div data-drawio-colors="color: rgb(0, 0, 0); background-color: rgb(255, 255, 255); " style="box-sizing: border-box; font-size: 0px; text-align: left;"><div style="display: inline-block; font-size: 11px; font-family: Helvetica; color: rgb(0, 0, 0); line-height: 1.2; pointer-events: none; background-color: rgb(255, 255, 255); white-space: nowrap;">remove message<br />from buffer</div></div></div></foreignObject><text x="269" y="648" fill="rgb(0, 0, 0)" font-family="Helvetica" font-size="11px">remove message...</text></switch></g><path d="M 240 870 L 250 870 L 356.88 870" fill="none" stroke="rgb(0, 0, 0)" stroke-miterlimit="10" pointer-events="none"/><path d="M 363.88 870 L 356.88 873.5 L 356.88 866.5 Z" fill="rgb(0, 0, 0)" stroke="rgb(0, 0, 0)" stroke-miterlimit="10" pointer-events="none"/><g transform="translate(-0.5 -0.5)"><switch><foreignObject pointer-events="none" width="100%" height="100%" requiredFeatures="http://www.w3.org/TR/SVG11/feature#Extensibility" style="overflow: visible; text-align: left;"><div xmlns="http://www.w3.org/1999/xhtml" style="display: flex; align-items: unsafe flex-end; justify-content: unsafe center; width: 1px; height: 1px; padding-top: 867px; margin-left: 303px;"><div data-drawio-colors="color: rgb(0, 0, 0); background-color: rgb(255, 255, 255); " style="box-sizing: border-box; font-size: 0px; text-align: center;"><div style="display: inline-block; font-size: 11px; font-family: Helvetica; color: rgb(0, 0, 0); line-height: 1.2; pointer-events: none; background-color: rgb(255, 255, 255); white-space: nowrap;">mqospi_async_write</div></div></div></foreignObject><text x="303" y="867" fill="rgb(0, 0, 0)" font-family="Helvetica" font-size="11px" text-anchor="middle">mqospi_async_write</text></switch></g><rect x="485" y="880" width="10" height="20" fill="#dae8fc" stroke="#6c8ebf" pointer-events="none"/><path d="M 885 970 L 820 970 L 767.24 970" fill="none" stroke="rgb(0, 0, 0)" stroke-miterlimit="10" stroke-dasharray="1 4" pointer-events="none"/><path d="M 775.12 965.5 L 766.12 970 L 775.12 974.5" fill="none" stroke="rgb(0, 0, 0)" stroke-miterlimit="10" pointer-events="none"/><path d="M 765 484.99 L 790 485 L 790 515 L 773.12 514.99" fill="none" stroke="rgb(0, 0, 0)" stroke-miterlimit="10" pointer-events="none"/><path d="M 766.12 514.99 L 773.12 511.49 L 773.12 518.49 Z" fill="rgb(0, 0, 0)" stroke="rgb(0, 0, 0)" stroke-miterlimit="10" pointer-events="none"/><g transform="translate(-0.5 -0.5)"><switch><foreignObject pointer-events="none" width="100%" height="100%" requiredFeatures="http://www.w3.org/TR/SVG11/feature#Extensibility" style="overflow: visible; text-align: left;"><div xmlns="http://www.w3.org/1999/xhtml" style="display: flex; align-items: unsafe center; justify-content: unsafe flex-start; width: 1px; height: 1px; padding-top: 500px; margin-left: 794px;"><div data-drawio-colors="color: rgb(0, 0, 0); background-color: rgb(255, 255, 255); " style="box-sizing: border-box; font-size: 0px; text-align: left;"><div style="display: inline-block; font-size: 11px; font-family: Helvetica; color: rgb(0, 0, 0); line-height: 1.2; pointer-events: none; background-color: rgb(255, 255, 255); white-space: nowrap;">save <br />prod var<br />timestamp</div></div></div></foreignObject><text x="794" y="503" fill="rgb(0, 0, 0)" font-family="Helvetica" font-size="11px">save...</text></switch></g><path d="M 14 180 L 100 180 L 216.88 180" fill="none" stroke="rgb(0, 0, 0)" stroke-miterlimit="10" pointer-events="none"/><ellipse cx="10" cy="180" rx="4" ry="4" fill="rgb(0, 0, 0)" stroke="rgb(0, 0, 0)" pointer-events="none"/><path d="M 223.88 180 L 216.88 183.5 L 216.88 176.5 Z" fill="rgb(0, 0, 0)" stroke="rgb(0, 0, 0)" stroke-miterlimit="10" pointer-events="none"/><g transform="translate(-0.5 -0.5)"><switch><foreignObject pointer-events="none" width="100%" height="100%" requiredFeatures="http://www.w3.org/TR/SVG11/feature#Extensibility" style="overflow: visible; text-align: left;"><div xmlns="http://www.w3.org/1999/xhtml" style="display: flex; align-items: unsafe flex-end; justify-content: unsafe center; width: 1px; height: 1px; padding-top: 177px; margin-left: 101px;"><div data-drawio-colors="color: rgb(0, 0, 0); background-color: rgb(255, 255, 255); " style="box-sizing: border-box; font-size: 0px; text-align: center;"><div style="display: inline-block; font-size: 11px; font-family: Helvetica; color: rgb(0, 0, 0); line-height: 1.2; pointer-events: none; background-color: rgb(255, 255, 255); white-space: nowrap;">trigger every 3 ms, <br />or immediately if there <br />were messages in the <br />previous cycle</div></div></div></foreignObject><text x="101" y="177" fill="rgb(0, 0, 0)" font-family="Helvetica" font-size="11px" text-anchor="middle">trigger eve...</text></switch></g></g><switch><g requiredFeatures="http://www.w3.org/TR/SVG11/feature#Extensibility"/><a transform="translate(0,-5)" xlink:href="https://www.drawio.com/doc/faq/svg-export-text-problems" target="_blank"><text text-anchor="middle" font-size="10px" x="50%" y="100%">Text is not SVG - cannot display</text></a></switch></svg>