﻿Ertec <-> FPGA pin mapping,,,,,,,,,,,,,,,,,,,
Ertec signal ,Port,Pin,GPIO ID,Direction,Alt,Pin name,Signal name on FMC-Profinet schematic ,FMC pin,Signal name on SVEC Schematic,Pin number on the FPGA,Description,,,,,,,,
UART_TX,0,14,14,OUT,2,GPIO14_INT,SPI_MOSI,h22,,,,,,,,,,,
UART_RX,0,15,15,IN,2,GPIO15_INT,SPI_MISO,h23,,,,,,,,,,,
LED_YELLOW,0,16,16,OUT,0,GPIO16,ERTEC.49,c19,FMC2_LA_N14,AA15,,ertec_gpio_16_i,led_profinet_y_o ,,Y19,FMC2_LA_N32,,h38,LED_YELLOW
LED_RED,0,17,17,OUT,0,GPIO17,ERTEC.50,c23,FMC2_LA_N18,AF21,,ertec_gpio_17_i,led_profinet_r_o ,,AC22,FMC2_LA_N28,,h32,LED_RED
LED_GREEN,0,18,18,OUT,0,GPIO18,ERTEC.51,c26,FMC2_LA_P27,AB20,,ertec_gpio_18_i,led_profinet_g_o ,,AA22,FMC2_LA_P28,,h31,LED_GREEN
SPI_CLKOUT,1,8,40,OUT,3,XHIF_A9,FMC.XHIF_36,d17,,,,,,,,,,,
SPI_TXD,1,10,42,OUT,3,XHIF_A11,FMC.XHIF_8,h25,,,,,,,,,,,
SPI_RXD,1,11,43,IN,3,XHIF_A12,FMC.XHIF_37,d18,,,,,,,,,,,
SPI_CTLOE,1,13,45,OUT,3,XHIF_A14,FMC.XHIF_31,g37,,,,,,,,,,,
MT_CPU_RESET_LOOPBACK,2,4,68,IN,0,XHIF_D4,FMC.XHIF_5,h14,FMC2_LA_N7,AE12,Loopback for MT_CPU_RESET,,,,,,,,
MT_CPU_RESET,2,5,69,OUT,0,XHIF_D5,FMC.XHIF_3,h11,FMC2_LA_N4,AK15,Resets all MockTurtle CPU's,reset cpus,,,,,,,
IP_RESET,2,6,70,OUT,0,XHIF_D6,FMC.XHIF_2,h10,FMC2_LA_P4,AJ15,Resets IP logic for 'SPI to RMQ',reset IP clogic,,,,,,,
RMQ0_C0_STATUS,2,7,71,IN,0,XHIF_D7,FMC.XHIF_16,g13,FMC2_LA_N8,AC12,,,,,,,,,
RMQ1_C0_STATUS,2,8,72,IN,0,XHIF_D8,FMC.XHIF_33,d12,FMC2_LA_N5,AF11,,,,,,,,,
RMQ2_C0_STATUS,2,9,73,IN,0,XHIF_D9,FMC.XHIF_32,d11,FMC2_LA_P5,AE11,,,,,,,,,
RMQ3_C0_STATUS,2,10,74,IN,0,XHIF_D10,FMC.XHIF_14,g10,FMC2_LA_N3,AF13,,,,,,,,,
RMQ4_C0_STATUS,2,11,75,IN,0,XHIF_D11,FMC.XHIF_4,h13,FMC2_LA_P7,AD12,,,,,,,,,
RMQ5_C0_STATUS,2,12,76,IN,0,XHIF_D12,FMC.XHIF_18,g16,FMC2_LA_N12,AF15,,,,,,,,,
RMQ0_C1_STATUS,2,13,77,IN,0,XHIF_D13,FMC.XHIF_13,g9,FMC2_LA_P3,AE13,,,,,,,,,
DATA_UART_TX,1,22,54,OUT,3,XHIF_XRDY,FMC.XHIF_44,c10,FMC2_LA_P6,AD10,,,,,,,,,
DATA_UART_RX,1,23,55,IN,3,XHIF_XRQ,FMC.XHIF_17,g15,FMC2_LA_P12,AE15,,,,,,,,,
