mc16_13TeV.700488.Sh_2211_WlvWqq.deriv.DAOD_STDM13.e8338_s3126_r9364_p5723
mc16_13TeV.700489.Sh_2211_WlvZqq.deriv.DAOD_STDM13.e8338_s3126_r9364_p5723
mc16_13TeV.700490.Sh_2211_WlvZbb.deriv.DAOD_STDM13.e8338_s3126_r9364_p5723
mc16_13TeV.700491.Sh_2211_WqqZvv.deriv.DAOD_STDM13.e8338_s3126_r9364_p5723
mc16_13TeV.700492.Sh_2211_WqqZll.deriv.DAOD_STDM13.e8338_s3126_r9364_p5723
mc16_13TeV.700493.Sh_2211_ZqqZll.deriv.DAOD_STDM13.e8338_s3126_r9364_p5723
mc16_13TeV.700494.Sh_2211_ZbbZll.deriv.DAOD_STDM13.e8338_s3126_r9364_p5723
mc16_13TeV.700495.Sh_2211_ZqqZvv.deriv.DAOD_STDM13.e8338_s3126_r9364_p5723
mc16_13TeV.700496.Sh_2211_ZbbZvv.deriv.DAOD_STDM13.e8338_s3126_r9364_p5723
mc16_13TeV.700587.Sh_2212_lllljj.deriv.DAOD_STDM13.e8433_s3126_r9364_p5723
mc16_13TeV.700588.Sh_2212_lllvjj.deriv.DAOD_STDM13.e8433_s3126_r9364_p5723
mc16_13TeV.700589.Sh_2212_llvvjj_os.deriv.DAOD_STDM13.e8433_s3126_r9364_p5723
mc16_13TeV.700590.Sh_2212_llvvjj_ss.deriv.DAOD_STDM13.e8433_s3126_r9364_p5723
mc16_13TeV.700591.Sh_2212_lllljj_Int.deriv.DAOD_STDM13.e8433_s3126_r9364_p5723
mc16_13TeV.700592.Sh_2212_lllvjj_Int.deriv.DAOD_STDM13.e8433_s3126_r9364_p5723
mc16_13TeV.700593.Sh_2212_llvvjj_os_Int.deriv.DAOD_STDM13.e8433_s3126_r9364_p5723
mc16_13TeV.700594.Sh_2212_llvvjj_ss_Int.deriv.DAOD_STDM13.e8433_s3126_r9364_p5723
mc16_13TeV.700600.Sh_2212_llll.deriv.DAOD_STDM13.e8433_s3126_r9364_p5723
mc16_13TeV.700601.Sh_2212_lllv.deriv.DAOD_STDM13.e8433_s3126_r9364_p5723
mc16_13TeV.700602.Sh_2212_llvv_os.deriv.DAOD_STDM13.e8433_s3126_r9364_p5723
mc16_13TeV.700603.Sh_2212_llvv_ss.deriv.DAOD_STDM13.e8433_s3126_r9364_p5723
mc16_13TeV.700604.Sh_2212_lvvv.deriv.DAOD_STDM13.e8433_s3126_r9364_p5723
mc16_13TeV.700605.Sh_2212_vvvv.deriv.DAOD_STDM13.e8433_s3126_r9364_p5723
