mc16_13TeV.700366.ShEG_2211_Wenu_01NLO_unbiased_ForcedD0Dplus.deriv.DAOD_STDM13.e8338_s3126_r10724_p5726
mc16_13TeV.700367.ShEG_2211_Wmunu_01NLO_unbiased_ForcedD0Dplus.deriv.DAOD_STDM13.e8338_s3126_r10724_p5726
mc16_13TeV.700368.ShEG_2211_Wtaunu_01NLO_unbiased_ForcedD0Dplus.deriv.DAOD_STDM13.e8338_s3126_r10724_p5726
