## W+jets
# MC16a
mc16_13TeV.508979.MGPy8EG_Wenu_FxFx_3jets_HT2bias_BFilter.recon.AOD.e8382_s3126_r9364
mc16_13TeV.508980.MGPy8EG_Wenu_FxFx_3jets_HT2bias_CFilterBVeto.recon.AOD.e8382_s3126_r9364
mc16_13TeV.508981.MGPy8EG_Wenu_FxFx_3jets_HT2bias_CVetoBVeto.recon.AOD.e8382_s3126_r9364
mc16_13TeV.508982.MGPy8EG_Wmunu_FxFx_3jets_HT2bias_BFilter.recon.AOD.e8382_s3126_r9364
mc16_13TeV.508983.MGPy8EG_Wmunu_FxFx_3jets_HT2bias_CFilterBVeto.recon.AOD.e8382_s3126_r9364
mc16_13TeV.508984.MGPy8EG_Wmunu_FxFx_3jets_HT2bias_CVetoBVeto.recon.AOD.e8382_s3126_r9364

# MC16d
mc16_13TeV.508979.MGPy8EG_Wenu_FxFx_3jets_HT2bias_BFilter.recon.AOD.e8382_s3126_r10201
mc16_13TeV.508980.MGPy8EG_Wenu_FxFx_3jets_HT2bias_CFilterBVeto.recon.AOD.e8382_s3126_r10201
mc16_13TeV.508981.MGPy8EG_Wenu_FxFx_3jets_HT2bias_CVetoBVeto.recon.AOD.e8382_s3126_r10201
mc16_13TeV.508982.MGPy8EG_Wmunu_FxFx_3jets_HT2bias_BFilter.recon.AOD.e8382_s3126_r10201
mc16_13TeV.508983.MGPy8EG_Wmunu_FxFx_3jets_HT2bias_CFilterBVeto.recon.AOD.e8382_s3126_r10201
mc16_13TeV.508984.MGPy8EG_Wmunu_FxFx_3jets_HT2bias_CVetoBVeto.recon.AOD.e8382_s3126_r10201

# MC16e
mc16_13TeV.508979.MGPy8EG_Wenu_FxFx_3jets_HT2bias_BFilter.recon.AOD.e8382_s3126_r10724
mc16_13TeV.508980.MGPy8EG_Wenu_FxFx_3jets_HT2bias_CFilterBVeto.recon.AOD.e8382_s3126_r10724
mc16_13TeV.508981.MGPy8EG_Wenu_FxFx_3jets_HT2bias_CVetoBVeto.recon.AOD.e8382_s3126_r10724
mc16_13TeV.508982.MGPy8EG_Wmunu_FxFx_3jets_HT2bias_BFilter.recon.AOD.e8382_s3126_r10724
mc16_13TeV.508983.MGPy8EG_Wmunu_FxFx_3jets_HT2bias_CFilterBVeto.recon.AOD.e8382_s3126_r10724
mc16_13TeV.508984.MGPy8EG_Wmunu_FxFx_3jets_HT2bias_CVetoBVeto.recon.AOD.e8382_s3126_r10724