mc16_13TeV:mc16_13TeV.800039.Py8EG_A14N23LO_jetjet_JZ2WithSW_mufilt.deriv.DAOD_FTAG4.e7947_s3126_r9364_p4416 
mc16_13TeV:mc16_13TeV.800038.Py8EG_A14N23LO_jetjet_JZ1WithSW_SoftQCD_mufilt.deriv.DAOD_FTAG4.e8188_s3126_r9364_p4416 
mc16_13TeV:mc16_13TeV.800037.Py8EG_A14N23LO_jetjet_JZ1WithSW_HardQCD_mufilt.deriv.DAOD_FTAG4.e7947_s3126_r9364_p4416 
mc16_13TeV:mc16_13TeV.800035.Py8EG_A14N23LO_jetjet_JZ7WithSW_mufilt.deriv.DAOD_FTAG4.e7876_s3126_r9364_p4416 
mc16_13TeV:mc16_13TeV.800034.Py8EG_A14N23LO_jetjet_JZ6WithSW_mufilt.deriv.DAOD_FTAG4.e7876_s3126_r9364_p4416 
mc16_13TeV:mc16_13TeV.800033.Py8EG_A14N23LO_jetjet_JZ5WithSW_mufilt.deriv.DAOD_FTAG4.e7876_s3126_r9364_p4416 
mc16_13TeV:mc16_13TeV.800032.Py8EG_A14N23LO_jetjet_JZ4WithSW_mufilt.deriv.DAOD_FTAG4.e7876_s3126_r9364_p4416 
mc16_13TeV:mc16_13TeV.800031.Py8EG_A14N23LO_jetjet_JZ3WithSW_mufilt.deriv.DAOD_FTAG4.e7876_s3126_r9364_p4416 