mc16_13TeV:mc16_13TeV.508979.MGPy8EG_Wenu_FxFx_3jets_HT2bias_BFilter.deriv.DAOD_STDM13.e8382_s3126_r9364_p4357
mc16_13TeV:mc16_13TeV.508980.MGPy8EG_Wenu_FxFx_3jets_HT2bias_CFilterBVeto.deriv.DAOD_STDM13.e8382_s3126_r9364_p4357
mc16_13TeV:mc16_13TeV.508981.MGPy8EG_Wenu_FxFx_3jets_HT2bias_CVetoBVeto.deriv.DAOD_STDM13.e8382_s3126_r9364_p4357
mc16_13TeV:mc16_13TeV.508982.MGPy8EG_Wmunu_FxFx_3jets_HT2bias_BFilter.deriv.DAOD_STDM13.e8382_s3126_r9364_p4357
mc16_13TeV:mc16_13TeV.508983.MGPy8EG_Wmunu_FxFx_3jets_HT2bias_CFilterBVeto.deriv.DAOD_STDM13.e8382_s3126_r9364_p4357
mc16_13TeV:mc16_13TeV.508984.MGPy8EG_Wmunu_FxFx_3jets_HT2bias_CVetoBVeto.deriv.DAOD_STDM13.e8382_s3126_r9364_p4357