mc16_13TeV.345053.PowhegPythia8EvtGen_NNPDF3_AZNLO_WmH125J_MINLO_lvbb_VpT.deriv.DAOD_HIGG2D4.e5706_s3126_r9364_p3641
mc16_13TeV.345054.PowhegPythia8EvtGen_NNPDF3_AZNLO_WpH125J_MINLO_lvbb_VpT.deriv.DAOD_HIGG2D4.e5706_s3126_r9364_p3641
mc16_13TeV.345055.PowhegPythia8EvtGen_NNPDF3_AZNLO_ZH125J_MINLO_llbb_VpT.deriv.DAOD_HIGG2D4.e5706_s3126_r9364_p3641
mc16_13TeV.345056.PowhegPythia8EvtGen_NNPDF3_AZNLO_ZH125J_MINLO_vvbb_VpT.deriv.DAOD_HIGG2D4.e5706_s3126_r9364_p3641
mc16_13TeV.345057.PowhegPythia8EvtGen_NNPDF3_AZNLO_ggZH125_llbb.deriv.DAOD_HIGG2D4.e5706_s3126_r9364_p3641
mc16_13TeV.345058.PowhegPythia8EvtGen_NNPDF3_AZNLO_ggZH125_vvbb.deriv.DAOD_HIGG2D4.e6004_s3126_r9364_p3641
mc16_13TeV.345109.PowhegPythia8EvtGen_NNPDF3_AZNLO_WmH125J_MINLO_lvcc_VpT.deriv.DAOD_HIGG2D4.e5765_s3126_r9364_p3641
mc16_13TeV.345110.PowhegPythia8EvtGen_NNPDF3_AZNLO_WpH125J_MINLO_lvcc_VpT.deriv.DAOD_HIGG2D4.e5765_s3126_r9364_p3641
mc16_13TeV.345111.PowhegPythia8EvtGen_NNPDF3_AZNLO_ZH125J_MINLO_llcc_VpT.deriv.DAOD_HIGG2D4.e5765_s3126_r9364_p3641
mc16_13TeV.345112.PowhegPythia8EvtGen_NNPDF3_AZNLO_ZH125J_MINLO_vvcc_VpT.deriv.DAOD_HIGG2D4.e5765_s3126_r9364_p3641
mc16_13TeV.345113.PowhegPythia8EvtGen_NNPDF3_AZNLO_ggZH125_llcc.deriv.DAOD_HIGG2D4.e5765_s3126_r9364_p3641
mc16_13TeV.345114.PowhegPythia8EvtGen_NNPDF3_AZNLO_ggZH125_vvcc.deriv.DAOD_HIGG2D4.e5765_s3126_r9364_p3641