(module DP1RD20JQ1R400 (layer F.Cu) (tedit 5A87FF55)
  (descr "Display Port Receptacle - Surface Mount, Right Angle Horizontal")
  (tags 670-2589-1-ND)
  (fp_text reference J2 (at 10.06348 4.03352) (layer F.SilkS)
    (effects (font (size 1.016 1.016) (thickness 0.254)))
  )
  (fp_text value DISPLAY_PORT (at 0 5.08) (layer F.SilkS) hide
    (effects (font (size 1.27 1.27) (thickness 0.254)))
  )
  (fp_line (start -8.5 -3) (end -8.5 -1.5) (layer F.SilkS) (width 0.15))
  (fp_line (start 8.5 -1.5) (end 8.5 -3) (layer F.SilkS) (width 0.15))
  (fp_line (start 8.5 5.5) (end 8.5 1.5) (layer F.SilkS) (width 0.15))
  (fp_line (start 8.5 8.5) (end 8.5 8) (layer F.SilkS) (width 0.15))
  (fp_line (start -8.5 8.5) (end -8.5 8) (layer F.SilkS) (width 0.15))
  (fp_line (start -8.5 1.5) (end -8.5 5.5) (layer F.SilkS) (width 0.15))
  (fp_line (start -8.5 -3) (end -4.5 -3) (layer F.SilkS) (width 0.15))
  (fp_line (start 6 -3) (end 8.5 -3) (layer F.SilkS) (width 0.15))
  (fp_line (start -8.5 10.96) (end -8.5 8.5) (layer F.SilkS) (width 0.15))
  (fp_line (start 8.5 10.96) (end 8.5 8.5) (layer F.SilkS) (width 0.15))
  (fp_line (start 8.45 10.96) (end -8.45 10.96) (layer F.SilkS) (width 0.15))
  (pad 12 smd rect (at 0 -2.6) (size 0.3302 2.75) (layers F.Cu F.Paste F.Mask))
  (pad 11 smd rect (at 0.5 -2.6) (size 0.3302 2.75) (layers F.Cu F.Paste F.Mask))
  (pad 10 smd rect (at 1 -2.6) (size 0.3302 2.75) (layers F.Cu F.Paste F.Mask))
  (pad 9 smd rect (at 1.5 -2.6) (size 0.3302 2.75) (layers F.Cu F.Paste F.Mask))
  (pad 8 smd rect (at 2 -2.6) (size 0.3302 2.75) (layers F.Cu F.Paste F.Mask))
  (pad 7 smd rect (at 2.5 -2.6) (size 0.3302 2.75) (layers F.Cu F.Paste F.Mask))
  (pad 6 smd rect (at 3 -2.6) (size 0.3302 2.75) (layers F.Cu F.Paste F.Mask))
  (pad 5 smd rect (at 3.5 -2.6) (size 0.3302 2.75) (layers F.Cu F.Paste F.Mask))
  (pad 4 smd rect (at 4 -2.6) (size 0.3302 2.75) (layers F.Cu F.Paste F.Mask))
  (pad 3 smd rect (at 4.5 -2.6) (size 0.3302 2.75) (layers F.Cu F.Paste F.Mask))
  (pad 13 smd rect (at -0.5 -2.6) (size 0.3302 2.75) (layers F.Cu F.Paste F.Mask))
  (pad 14 smd rect (at -1 -2.6) (size 0.3302 2.75) (layers F.Cu F.Paste F.Mask))
  (pad 15 smd rect (at -1.5 -2.6) (size 0.3302 2.75) (layers F.Cu F.Paste F.Mask))
  (pad 16 smd rect (at -2 -2.6) (size 0.3302 2.75) (layers F.Cu F.Paste F.Mask))
  (pad 17 smd rect (at -2.5 -2.6) (size 0.3302 2.75) (layers F.Cu F.Paste F.Mask))
  (pad 18 smd rect (at -3 -2.6) (size 0.3302 2.75) (layers F.Cu F.Paste F.Mask))
  (pad 19 smd rect (at -3.5 -2.6) (size 0.3302 2.75) (layers F.Cu F.Paste F.Mask))
  (pad 20 smd rect (at -4 -2.6) (size 0.3302 2.75) (layers F.Cu F.Paste F.Mask))
  (pad 21 thru_hole oval (at -8.25 0) (size 1.3 2.3) (drill oval 0.65 1.65) (layers *.Cu *.Mask))
  (pad 21 thru_hole oval (at 8.25 0) (size 1.3 2.3) (drill oval 0.65 1.65) (layers *.Cu *.Mask))
  (pad 21 thru_hole oval (at -8.25 6.78) (size 1.3 1.9) (drill oval 0.65 1.2) (layers *.Cu *.Mask))
  (pad 21 thru_hole oval (at 8.25 6.78) (size 1.3 1.9) (drill oval 0.65 1.2) (layers *.Cu *.Mask))
  (pad "" np_thru_hole circle (at 0 7.68) (size 1.45 1.45) (drill 1.45) (layers *.Cu *.Mask F.SilkS))
  (pad 2 smd rect (at 5 -2.6) (size 0.3302 2.75) (layers F.Cu F.Paste F.Mask))
  (pad 1 smd rect (at 5.5 -2.6) (size 0.3302 2.75) (layers F.Cu F.Paste F.Mask))
)
