(module lemo_epb00250ntn (layer F.Cu) (tedit 5907999A)
  (descr "LEMO connector, EPB.00.250.NTN")
  (fp_text reference J6 (at 0 5.10032) (layer F.SilkS) hide
    (effects (font (thickness 0.3048)))
  )
  (fp_text value LEMO2 (at 0 -4.8006) (layer F.SilkS) hide
    (effects (font (thickness 0.3048)))
  )
  (fp_circle (center 0 0) (end -1.30048 0) (layer F.SilkS) (width 0.381))
  (fp_circle (center 0 0) (end -3.50012 0) (layer F.SilkS) (width 0.381))
  (fp_line (start -3.59918 -3.59918) (end 3.59918 -3.59918) (layer F.SilkS) (width 0.381))
  (fp_line (start 3.59918 -3.59918) (end 3.59918 3.59918) (layer F.SilkS) (width 0.381))
  (fp_line (start 3.59918 3.59918) (end -3.59918 3.59918) (layer F.SilkS) (width 0.381))
  (fp_line (start -3.59918 3.59918) (end -3.59918 -3.59918) (layer F.SilkS) (width 0.381))
  (pad 1 thru_hole circle (at 0 0) (size 1.79832 1.79832) (drill 0.89916) (layers *.Cu *.Mask F.SilkS))
  (pad 2 thru_hole circle (at 2.54 -2.54) (size 1.79578 1.79578) (drill 0.89916) (layers *.Cu *.Mask F.SilkS))
  (pad 2 thru_hole circle (at -2.54 -2.54) (size 1.79578 1.79578) (drill 0.89916) (layers *.Cu *.Mask F.SilkS))
  (pad 2 thru_hole circle (at -2.54 2.54) (size 1.79578 1.79578) (drill 0.89916) (layers *.Cu *.Mask F.SilkS))
  (pad 2 thru_hole circle (at 2.54 2.54) (size 1.79578 1.79578) (drill 0.89916) (layers *.Cu *.Mask F.SilkS))
  (model walter/conn_rf/lemo_epb00250ntn.wrl
    (at (xyz 0 0 0))
    (scale (xyz 1 1 1))
    (rotate (xyz 0 0 0))
  )
)
