G04 #@! TF.GenerationSoftware,KiCad,Pcbnew,(5.1.4-0-10_14)*
G04 #@! TF.CreationDate,2020-06-05T14:08:43-07:00*
G04 #@! TF.ProjectId,cmd_fwd_brd,636d645f-6677-4645-9f62-72642e6b6963,rev?*
G04 #@! TF.SameCoordinates,Original*
G04 #@! TF.FileFunction,Soldermask,Top*
G04 #@! TF.FilePolarity,Negative*
%FSLAX46Y46*%
G04 Gerber Fmt 4.6, Leading zero omitted, Abs format (unit mm)*
G04 Created by KiCad (PCBNEW (5.1.4-0-10_14)) date 2020-06-05 14:08:43*
%MOMM*%
%LPD*%
G04 APERTURE LIST*
%ADD10C,0.100000*%
G04 APERTURE END LIST*
D10*
G36*
X136726348Y-103933820D02*
G01*
X136726350Y-103933821D01*
X136726351Y-103933821D01*
X136867574Y-103992317D01*
X136867577Y-103992319D01*
X136994669Y-104077239D01*
X137102761Y-104185331D01*
X137187681Y-104312423D01*
X137187683Y-104312426D01*
X137246179Y-104453649D01*
X137246180Y-104453652D01*
X137276000Y-104603569D01*
X137276000Y-104756431D01*
X137273131Y-104770857D01*
X137246179Y-104906351D01*
X137187683Y-105047574D01*
X137187681Y-105047577D01*
X137102761Y-105174669D01*
X136994669Y-105282761D01*
X136867577Y-105367681D01*
X136867574Y-105367683D01*
X136726351Y-105426179D01*
X136726350Y-105426179D01*
X136726348Y-105426180D01*
X136576431Y-105456000D01*
X136423569Y-105456000D01*
X136273652Y-105426180D01*
X136273650Y-105426179D01*
X136273649Y-105426179D01*
X136132426Y-105367683D01*
X136132423Y-105367681D01*
X136005331Y-105282761D01*
X135897239Y-105174669D01*
X135812319Y-105047577D01*
X135812317Y-105047574D01*
X135753821Y-104906351D01*
X135726870Y-104770857D01*
X135724000Y-104756431D01*
X135724000Y-104603569D01*
X135753820Y-104453652D01*
X135753821Y-104453649D01*
X135812317Y-104312426D01*
X135812319Y-104312423D01*
X135897239Y-104185331D01*
X136005331Y-104077239D01*
X136132423Y-103992319D01*
X136132426Y-103992317D01*
X136273649Y-103933821D01*
X136273650Y-103933821D01*
X136273652Y-103933820D01*
X136423569Y-103904000D01*
X136576431Y-103904000D01*
X136726348Y-103933820D01*
X136726348Y-103933820D01*
G37*
G36*
X113226348Y-103933820D02*
G01*
X113226350Y-103933821D01*
X113226351Y-103933821D01*
X113367574Y-103992317D01*
X113367577Y-103992319D01*
X113494669Y-104077239D01*
X113602761Y-104185331D01*
X113687681Y-104312423D01*
X113687683Y-104312426D01*
X113746179Y-104453649D01*
X113746180Y-104453652D01*
X113776000Y-104603569D01*
X113776000Y-104756431D01*
X113773131Y-104770857D01*
X113746179Y-104906351D01*
X113687683Y-105047574D01*
X113687681Y-105047577D01*
X113602761Y-105174669D01*
X113494669Y-105282761D01*
X113367577Y-105367681D01*
X113367574Y-105367683D01*
X113226351Y-105426179D01*
X113226350Y-105426179D01*
X113226348Y-105426180D01*
X113076431Y-105456000D01*
X112923569Y-105456000D01*
X112773652Y-105426180D01*
X112773650Y-105426179D01*
X112773649Y-105426179D01*
X112632426Y-105367683D01*
X112632423Y-105367681D01*
X112505331Y-105282761D01*
X112397239Y-105174669D01*
X112312319Y-105047577D01*
X112312317Y-105047574D01*
X112253821Y-104906351D01*
X112226870Y-104770857D01*
X112224000Y-104756431D01*
X112224000Y-104603569D01*
X112253820Y-104453652D01*
X112253821Y-104453649D01*
X112312317Y-104312426D01*
X112312319Y-104312423D01*
X112397239Y-104185331D01*
X112505331Y-104077239D01*
X112632423Y-103992319D01*
X112632426Y-103992317D01*
X112773649Y-103933821D01*
X112773650Y-103933821D01*
X112773652Y-103933820D01*
X112923569Y-103904000D01*
X113076431Y-103904000D01*
X113226348Y-103933820D01*
X113226348Y-103933820D01*
G37*
G36*
X104887420Y-102789143D02*
G01*
X105019556Y-102829227D01*
X105019558Y-102829228D01*
X105141338Y-102894320D01*
X105141340Y-102894321D01*
X105141339Y-102894321D01*
X105248080Y-102981920D01*
X105322360Y-103072430D01*
X105335680Y-103088661D01*
X105400772Y-103210441D01*
X105400773Y-103210443D01*
X105440857Y-103342579D01*
X105451000Y-103445568D01*
X105451000Y-104114432D01*
X105440857Y-104217421D01*
X105400773Y-104349557D01*
X105400772Y-104349559D01*
X105335680Y-104471339D01*
X105248080Y-104578080D01*
X105141339Y-104665680D01*
X105019559Y-104730772D01*
X105019557Y-104730773D01*
X104887421Y-104770857D01*
X104750000Y-104784391D01*
X104612580Y-104770857D01*
X104480444Y-104730773D01*
X104480442Y-104730772D01*
X104358662Y-104665680D01*
X104251921Y-104578080D01*
X104164321Y-104471339D01*
X104099228Y-104349559D01*
X104099227Y-104349558D01*
X104059143Y-104217421D01*
X104049000Y-104114432D01*
X104049000Y-103445569D01*
X104059143Y-103342580D01*
X104099227Y-103210444D01*
X104164321Y-103088661D01*
X104251920Y-102981920D01*
X104358660Y-102894321D01*
X104358659Y-102894321D01*
X104358661Y-102894320D01*
X104480441Y-102829228D01*
X104480443Y-102829227D01*
X104612579Y-102789143D01*
X104750000Y-102775609D01*
X104887420Y-102789143D01*
X104887420Y-102789143D01*
G37*
G36*
X121387420Y-102789143D02*
G01*
X121519556Y-102829227D01*
X121519558Y-102829228D01*
X121641338Y-102894320D01*
X121641340Y-102894321D01*
X121641339Y-102894321D01*
X121748080Y-102981920D01*
X121822360Y-103072430D01*
X121835680Y-103088661D01*
X121900772Y-103210441D01*
X121900773Y-103210443D01*
X121940857Y-103342579D01*
X121951000Y-103445568D01*
X121951000Y-104114432D01*
X121940857Y-104217421D01*
X121900773Y-104349557D01*
X121900772Y-104349559D01*
X121835680Y-104471339D01*
X121748080Y-104578080D01*
X121641339Y-104665680D01*
X121519559Y-104730772D01*
X121519557Y-104730773D01*
X121387421Y-104770857D01*
X121250000Y-104784391D01*
X121112580Y-104770857D01*
X120980444Y-104730773D01*
X120980442Y-104730772D01*
X120858662Y-104665680D01*
X120751921Y-104578080D01*
X120664321Y-104471339D01*
X120599228Y-104349559D01*
X120599227Y-104349558D01*
X120559143Y-104217421D01*
X120549000Y-104114432D01*
X120549000Y-103445569D01*
X120559143Y-103342580D01*
X120599227Y-103210444D01*
X120664321Y-103088661D01*
X120751920Y-102981920D01*
X120858660Y-102894321D01*
X120858659Y-102894321D01*
X120858661Y-102894320D01*
X120980441Y-102829228D01*
X120980443Y-102829227D01*
X121112579Y-102789143D01*
X121250000Y-102775609D01*
X121387420Y-102789143D01*
X121387420Y-102789143D01*
G37*
G36*
X128387420Y-102789143D02*
G01*
X128519556Y-102829227D01*
X128519558Y-102829228D01*
X128641338Y-102894320D01*
X128641340Y-102894321D01*
X128641339Y-102894321D01*
X128748080Y-102981920D01*
X128822360Y-103072430D01*
X128835680Y-103088661D01*
X128900772Y-103210441D01*
X128900773Y-103210443D01*
X128940857Y-103342579D01*
X128951000Y-103445568D01*
X128951000Y-104114432D01*
X128940857Y-104217421D01*
X128900773Y-104349557D01*
X128900772Y-104349559D01*
X128835680Y-104471339D01*
X128748080Y-104578080D01*
X128641339Y-104665680D01*
X128519559Y-104730772D01*
X128519557Y-104730773D01*
X128387421Y-104770857D01*
X128250000Y-104784391D01*
X128112580Y-104770857D01*
X127980444Y-104730773D01*
X127980442Y-104730772D01*
X127858662Y-104665680D01*
X127751921Y-104578080D01*
X127664321Y-104471339D01*
X127599228Y-104349559D01*
X127599227Y-104349558D01*
X127559143Y-104217421D01*
X127549000Y-104114432D01*
X127549000Y-103445569D01*
X127559143Y-103342580D01*
X127599227Y-103210444D01*
X127664321Y-103088661D01*
X127751920Y-102981920D01*
X127858660Y-102894321D01*
X127858659Y-102894321D01*
X127858661Y-102894320D01*
X127980441Y-102829228D01*
X127980443Y-102829227D01*
X128112579Y-102789143D01*
X128250000Y-102775609D01*
X128387420Y-102789143D01*
X128387420Y-102789143D01*
G37*
G36*
X144887420Y-102789143D02*
G01*
X145019556Y-102829227D01*
X145019558Y-102829228D01*
X145141338Y-102894320D01*
X145141340Y-102894321D01*
X145141339Y-102894321D01*
X145248080Y-102981920D01*
X145322360Y-103072430D01*
X145335680Y-103088661D01*
X145400772Y-103210441D01*
X145400773Y-103210443D01*
X145440857Y-103342579D01*
X145451000Y-103445568D01*
X145451000Y-104114432D01*
X145440857Y-104217421D01*
X145400773Y-104349557D01*
X145400772Y-104349559D01*
X145335680Y-104471339D01*
X145248080Y-104578080D01*
X145141339Y-104665680D01*
X145019559Y-104730772D01*
X145019557Y-104730773D01*
X144887421Y-104770857D01*
X144750000Y-104784391D01*
X144612580Y-104770857D01*
X144480444Y-104730773D01*
X144480442Y-104730772D01*
X144358662Y-104665680D01*
X144251921Y-104578080D01*
X144164321Y-104471339D01*
X144099228Y-104349559D01*
X144099227Y-104349558D01*
X144059143Y-104217421D01*
X144049000Y-104114432D01*
X144049000Y-103445569D01*
X144059143Y-103342580D01*
X144099227Y-103210444D01*
X144164321Y-103088661D01*
X144251920Y-102981920D01*
X144358660Y-102894321D01*
X144358659Y-102894321D01*
X144358661Y-102894320D01*
X144480441Y-102829228D01*
X144480443Y-102829227D01*
X144612579Y-102789143D01*
X144750000Y-102775609D01*
X144887420Y-102789143D01*
X144887420Y-102789143D01*
G37*
G36*
X95525331Y-98268211D02*
G01*
X95853092Y-98403974D01*
X96148070Y-98601072D01*
X96398928Y-98851930D01*
X96596026Y-99146908D01*
X96731789Y-99474669D01*
X96801000Y-99822616D01*
X96801000Y-100177384D01*
X96731789Y-100525331D01*
X96596026Y-100853092D01*
X96398928Y-101148070D01*
X96148070Y-101398928D01*
X95853092Y-101596026D01*
X95525331Y-101731789D01*
X95177384Y-101801000D01*
X94822616Y-101801000D01*
X94474669Y-101731789D01*
X94146908Y-101596026D01*
X93851930Y-101398928D01*
X93601072Y-101148070D01*
X93403974Y-100853092D01*
X93268211Y-100525331D01*
X93199000Y-100177384D01*
X93199000Y-99822616D01*
X93268211Y-99474669D01*
X93403974Y-99146908D01*
X93601072Y-98851930D01*
X93851930Y-98601072D01*
X94146908Y-98403974D01*
X94474669Y-98268211D01*
X94822616Y-98199000D01*
X95177384Y-98199000D01*
X95525331Y-98268211D01*
X95525331Y-98268211D01*
G37*
G36*
X156025331Y-97768211D02*
G01*
X156353092Y-97903974D01*
X156648070Y-98101072D01*
X156898928Y-98351930D01*
X157096026Y-98646908D01*
X157231789Y-98974669D01*
X157301000Y-99322616D01*
X157301000Y-99677384D01*
X157231789Y-100025331D01*
X157096026Y-100353092D01*
X156898928Y-100648070D01*
X156648070Y-100898928D01*
X156353092Y-101096026D01*
X156025331Y-101231789D01*
X155677384Y-101301000D01*
X155322616Y-101301000D01*
X154974669Y-101231789D01*
X154646908Y-101096026D01*
X154351930Y-100898928D01*
X154101072Y-100648070D01*
X153903974Y-100353092D01*
X153768211Y-100025331D01*
X153699000Y-99677384D01*
X153699000Y-99322616D01*
X153768211Y-98974669D01*
X153903974Y-98646908D01*
X154101072Y-98351930D01*
X154351930Y-98101072D01*
X154646908Y-97903974D01*
X154974669Y-97768211D01*
X155322616Y-97699000D01*
X155677384Y-97699000D01*
X156025331Y-97768211D01*
X156025331Y-97768211D01*
G37*
G36*
X104887420Y-95809143D02*
G01*
X105019556Y-95849227D01*
X105019558Y-95849228D01*
X105141338Y-95914320D01*
X105141340Y-95914321D01*
X105141339Y-95914321D01*
X105248080Y-96001920D01*
X105322360Y-96092430D01*
X105335680Y-96108661D01*
X105400772Y-96230441D01*
X105400773Y-96230443D01*
X105440857Y-96362579D01*
X105451000Y-96465568D01*
X105451000Y-97534432D01*
X105440857Y-97637421D01*
X105401181Y-97768211D01*
X105400772Y-97769559D01*
X105335680Y-97891339D01*
X105248080Y-97998080D01*
X105141339Y-98085680D01*
X105112542Y-98101072D01*
X105019557Y-98150773D01*
X104887421Y-98190857D01*
X104750000Y-98204391D01*
X104612580Y-98190857D01*
X104480444Y-98150773D01*
X104387459Y-98101072D01*
X104358662Y-98085680D01*
X104251921Y-97998080D01*
X104164321Y-97891339D01*
X104099229Y-97769559D01*
X104098820Y-97768211D01*
X104059144Y-97637421D01*
X104049001Y-97534432D01*
X104049000Y-96465569D01*
X104059143Y-96362580D01*
X104099227Y-96230444D01*
X104164321Y-96108661D01*
X104251920Y-96001920D01*
X104358660Y-95914321D01*
X104358659Y-95914321D01*
X104358661Y-95914320D01*
X104480441Y-95849228D01*
X104480443Y-95849227D01*
X104612579Y-95809143D01*
X104750000Y-95795609D01*
X104887420Y-95809143D01*
X104887420Y-95809143D01*
G37*
G36*
X121387420Y-95809143D02*
G01*
X121519556Y-95849227D01*
X121519558Y-95849228D01*
X121641338Y-95914320D01*
X121641340Y-95914321D01*
X121641339Y-95914321D01*
X121748080Y-96001920D01*
X121822360Y-96092430D01*
X121835680Y-96108661D01*
X121900772Y-96230441D01*
X121900773Y-96230443D01*
X121940857Y-96362579D01*
X121951000Y-96465568D01*
X121951000Y-97534432D01*
X121940857Y-97637421D01*
X121901181Y-97768211D01*
X121900772Y-97769559D01*
X121835680Y-97891339D01*
X121748080Y-97998080D01*
X121641339Y-98085680D01*
X121612542Y-98101072D01*
X121519557Y-98150773D01*
X121387421Y-98190857D01*
X121250000Y-98204391D01*
X121112580Y-98190857D01*
X120980444Y-98150773D01*
X120887459Y-98101072D01*
X120858662Y-98085680D01*
X120751921Y-97998080D01*
X120664321Y-97891339D01*
X120599229Y-97769559D01*
X120598820Y-97768211D01*
X120559144Y-97637421D01*
X120549001Y-97534432D01*
X120549000Y-96465569D01*
X120559143Y-96362580D01*
X120599227Y-96230444D01*
X120664321Y-96108661D01*
X120751920Y-96001920D01*
X120858660Y-95914321D01*
X120858659Y-95914321D01*
X120858661Y-95914320D01*
X120980441Y-95849228D01*
X120980443Y-95849227D01*
X121112579Y-95809143D01*
X121250000Y-95795609D01*
X121387420Y-95809143D01*
X121387420Y-95809143D01*
G37*
G36*
X128387420Y-95809143D02*
G01*
X128519556Y-95849227D01*
X128519558Y-95849228D01*
X128641338Y-95914320D01*
X128641340Y-95914321D01*
X128641339Y-95914321D01*
X128748080Y-96001920D01*
X128822360Y-96092430D01*
X128835680Y-96108661D01*
X128900772Y-96230441D01*
X128900773Y-96230443D01*
X128940857Y-96362579D01*
X128951000Y-96465568D01*
X128951000Y-97534432D01*
X128940857Y-97637421D01*
X128901181Y-97768211D01*
X128900772Y-97769559D01*
X128835680Y-97891339D01*
X128748080Y-97998080D01*
X128641339Y-98085680D01*
X128612542Y-98101072D01*
X128519557Y-98150773D01*
X128387421Y-98190857D01*
X128250000Y-98204391D01*
X128112580Y-98190857D01*
X127980444Y-98150773D01*
X127887459Y-98101072D01*
X127858662Y-98085680D01*
X127751921Y-97998080D01*
X127664321Y-97891339D01*
X127599229Y-97769559D01*
X127598820Y-97768211D01*
X127559144Y-97637421D01*
X127549001Y-97534432D01*
X127549000Y-96465569D01*
X127559143Y-96362580D01*
X127599227Y-96230444D01*
X127664321Y-96108661D01*
X127751920Y-96001920D01*
X127858660Y-95914321D01*
X127858659Y-95914321D01*
X127858661Y-95914320D01*
X127980441Y-95849228D01*
X127980443Y-95849227D01*
X128112579Y-95809143D01*
X128250000Y-95795609D01*
X128387420Y-95809143D01*
X128387420Y-95809143D01*
G37*
G36*
X144887420Y-95809143D02*
G01*
X145019556Y-95849227D01*
X145019558Y-95849228D01*
X145141338Y-95914320D01*
X145141340Y-95914321D01*
X145141339Y-95914321D01*
X145248080Y-96001920D01*
X145322360Y-96092430D01*
X145335680Y-96108661D01*
X145400772Y-96230441D01*
X145400773Y-96230443D01*
X145440857Y-96362579D01*
X145451000Y-96465568D01*
X145451000Y-97534432D01*
X145440857Y-97637421D01*
X145401181Y-97768211D01*
X145400772Y-97769559D01*
X145335680Y-97891339D01*
X145248080Y-97998080D01*
X145141339Y-98085680D01*
X145112542Y-98101072D01*
X145019557Y-98150773D01*
X144887421Y-98190857D01*
X144750000Y-98204391D01*
X144612580Y-98190857D01*
X144480444Y-98150773D01*
X144387459Y-98101072D01*
X144358662Y-98085680D01*
X144251921Y-97998080D01*
X144164321Y-97891339D01*
X144099229Y-97769559D01*
X144098820Y-97768211D01*
X144059144Y-97637421D01*
X144049001Y-97534432D01*
X144049000Y-96465569D01*
X144059143Y-96362580D01*
X144099227Y-96230444D01*
X144164321Y-96108661D01*
X144251920Y-96001920D01*
X144358660Y-95914321D01*
X144358659Y-95914321D01*
X144358661Y-95914320D01*
X144480441Y-95849228D01*
X144480443Y-95849227D01*
X144612579Y-95809143D01*
X144750000Y-95795609D01*
X144887420Y-95809143D01*
X144887420Y-95809143D01*
G37*
G36*
X118716100Y-95826000D02*
G01*
X108783900Y-95826000D01*
X108783900Y-92974000D01*
X118716100Y-92974000D01*
X118716100Y-95826000D01*
X118716100Y-95826000D01*
G37*
G36*
X142216100Y-95826000D02*
G01*
X132283900Y-95826000D01*
X132283900Y-92974000D01*
X142216100Y-92974000D01*
X142216100Y-95826000D01*
X142216100Y-95826000D01*
G37*
G36*
X96401000Y-86901000D02*
G01*
X94599000Y-86901000D01*
X94599000Y-85099000D01*
X96401000Y-85099000D01*
X96401000Y-86901000D01*
X96401000Y-86901000D01*
G37*
G36*
X123256938Y-83631716D02*
G01*
X123277557Y-83637971D01*
X123296553Y-83648124D01*
X123313208Y-83661792D01*
X123326876Y-83678447D01*
X123337029Y-83697443D01*
X123343284Y-83718062D01*
X123346000Y-83745640D01*
X123346000Y-84254360D01*
X123343284Y-84281938D01*
X123337029Y-84302557D01*
X123326876Y-84321553D01*
X123313208Y-84338208D01*
X123296553Y-84351876D01*
X123277557Y-84362029D01*
X123256938Y-84368284D01*
X123229360Y-84371000D01*
X122770640Y-84371000D01*
X122743062Y-84368284D01*
X122722443Y-84362029D01*
X122703447Y-84351876D01*
X122686792Y-84338208D01*
X122673124Y-84321553D01*
X122662971Y-84302557D01*
X122656716Y-84281938D01*
X122654000Y-84254360D01*
X122654000Y-83745640D01*
X122656716Y-83718062D01*
X122662971Y-83697443D01*
X122673124Y-83678447D01*
X122686792Y-83661792D01*
X122703447Y-83648124D01*
X122722443Y-83637971D01*
X122743062Y-83631716D01*
X122770640Y-83629000D01*
X123229360Y-83629000D01*
X123256938Y-83631716D01*
X123256938Y-83631716D01*
G37*
G36*
X115756938Y-83631716D02*
G01*
X115777557Y-83637971D01*
X115796553Y-83648124D01*
X115813208Y-83661792D01*
X115826876Y-83678447D01*
X115837029Y-83697443D01*
X115843284Y-83718062D01*
X115846000Y-83745640D01*
X115846000Y-84254360D01*
X115843284Y-84281938D01*
X115837029Y-84302557D01*
X115826876Y-84321553D01*
X115813208Y-84338208D01*
X115796553Y-84351876D01*
X115777557Y-84362029D01*
X115756938Y-84368284D01*
X115729360Y-84371000D01*
X115270640Y-84371000D01*
X115243062Y-84368284D01*
X115222443Y-84362029D01*
X115203447Y-84351876D01*
X115186792Y-84338208D01*
X115173124Y-84321553D01*
X115162971Y-84302557D01*
X115156716Y-84281938D01*
X115154000Y-84254360D01*
X115154000Y-83745640D01*
X115156716Y-83718062D01*
X115162971Y-83697443D01*
X115173124Y-83678447D01*
X115186792Y-83661792D01*
X115203447Y-83648124D01*
X115222443Y-83637971D01*
X115243062Y-83631716D01*
X115270640Y-83629000D01*
X115729360Y-83629000D01*
X115756938Y-83631716D01*
X115756938Y-83631716D01*
G37*
G36*
X114786938Y-83631716D02*
G01*
X114807557Y-83637971D01*
X114826553Y-83648124D01*
X114843208Y-83661792D01*
X114856876Y-83678447D01*
X114867029Y-83697443D01*
X114873284Y-83718062D01*
X114876000Y-83745640D01*
X114876000Y-84254360D01*
X114873284Y-84281938D01*
X114867029Y-84302557D01*
X114856876Y-84321553D01*
X114843208Y-84338208D01*
X114826553Y-84351876D01*
X114807557Y-84362029D01*
X114786938Y-84368284D01*
X114759360Y-84371000D01*
X114300640Y-84371000D01*
X114273062Y-84368284D01*
X114252443Y-84362029D01*
X114233447Y-84351876D01*
X114216792Y-84338208D01*
X114203124Y-84321553D01*
X114192971Y-84302557D01*
X114186716Y-84281938D01*
X114184000Y-84254360D01*
X114184000Y-83745640D01*
X114186716Y-83718062D01*
X114192971Y-83697443D01*
X114203124Y-83678447D01*
X114216792Y-83661792D01*
X114233447Y-83648124D01*
X114252443Y-83637971D01*
X114273062Y-83631716D01*
X114300640Y-83629000D01*
X114759360Y-83629000D01*
X114786938Y-83631716D01*
X114786938Y-83631716D01*
G37*
G36*
X119756938Y-83631716D02*
G01*
X119777557Y-83637971D01*
X119796553Y-83648124D01*
X119813208Y-83661792D01*
X119826876Y-83678447D01*
X119837029Y-83697443D01*
X119843284Y-83718062D01*
X119846000Y-83745640D01*
X119846000Y-84254360D01*
X119843284Y-84281938D01*
X119837029Y-84302557D01*
X119826876Y-84321553D01*
X119813208Y-84338208D01*
X119796553Y-84351876D01*
X119777557Y-84362029D01*
X119756938Y-84368284D01*
X119729360Y-84371000D01*
X119270640Y-84371000D01*
X119243062Y-84368284D01*
X119222443Y-84362029D01*
X119203447Y-84351876D01*
X119186792Y-84338208D01*
X119173124Y-84321553D01*
X119162971Y-84302557D01*
X119156716Y-84281938D01*
X119154000Y-84254360D01*
X119154000Y-83745640D01*
X119156716Y-83718062D01*
X119162971Y-83697443D01*
X119173124Y-83678447D01*
X119186792Y-83661792D01*
X119203447Y-83648124D01*
X119222443Y-83637971D01*
X119243062Y-83631716D01*
X119270640Y-83629000D01*
X119729360Y-83629000D01*
X119756938Y-83631716D01*
X119756938Y-83631716D01*
G37*
G36*
X118786938Y-83631716D02*
G01*
X118807557Y-83637971D01*
X118826553Y-83648124D01*
X118843208Y-83661792D01*
X118856876Y-83678447D01*
X118867029Y-83697443D01*
X118873284Y-83718062D01*
X118876000Y-83745640D01*
X118876000Y-84254360D01*
X118873284Y-84281938D01*
X118867029Y-84302557D01*
X118856876Y-84321553D01*
X118843208Y-84338208D01*
X118826553Y-84351876D01*
X118807557Y-84362029D01*
X118786938Y-84368284D01*
X118759360Y-84371000D01*
X118300640Y-84371000D01*
X118273062Y-84368284D01*
X118252443Y-84362029D01*
X118233447Y-84351876D01*
X118216792Y-84338208D01*
X118203124Y-84321553D01*
X118192971Y-84302557D01*
X118186716Y-84281938D01*
X118184000Y-84254360D01*
X118184000Y-83745640D01*
X118186716Y-83718062D01*
X118192971Y-83697443D01*
X118203124Y-83678447D01*
X118216792Y-83661792D01*
X118233447Y-83648124D01*
X118252443Y-83637971D01*
X118273062Y-83631716D01*
X118300640Y-83629000D01*
X118759360Y-83629000D01*
X118786938Y-83631716D01*
X118786938Y-83631716D01*
G37*
G36*
X122286938Y-83631716D02*
G01*
X122307557Y-83637971D01*
X122326553Y-83648124D01*
X122343208Y-83661792D01*
X122356876Y-83678447D01*
X122367029Y-83697443D01*
X122373284Y-83718062D01*
X122376000Y-83745640D01*
X122376000Y-84254360D01*
X122373284Y-84281938D01*
X122367029Y-84302557D01*
X122356876Y-84321553D01*
X122343208Y-84338208D01*
X122326553Y-84351876D01*
X122307557Y-84362029D01*
X122286938Y-84368284D01*
X122259360Y-84371000D01*
X121800640Y-84371000D01*
X121773062Y-84368284D01*
X121752443Y-84362029D01*
X121733447Y-84351876D01*
X121716792Y-84338208D01*
X121703124Y-84321553D01*
X121692971Y-84302557D01*
X121686716Y-84281938D01*
X121684000Y-84254360D01*
X121684000Y-83745640D01*
X121686716Y-83718062D01*
X121692971Y-83697443D01*
X121703124Y-83678447D01*
X121716792Y-83661792D01*
X121733447Y-83648124D01*
X121752443Y-83637971D01*
X121773062Y-83631716D01*
X121800640Y-83629000D01*
X122259360Y-83629000D01*
X122286938Y-83631716D01*
X122286938Y-83631716D01*
G37*
G36*
X135256938Y-83631716D02*
G01*
X135277557Y-83637971D01*
X135296553Y-83648124D01*
X135313208Y-83661792D01*
X135326876Y-83678447D01*
X135337029Y-83697443D01*
X135343284Y-83718062D01*
X135346000Y-83745640D01*
X135346000Y-84254360D01*
X135343284Y-84281938D01*
X135337029Y-84302557D01*
X135326876Y-84321553D01*
X135313208Y-84338208D01*
X135296553Y-84351876D01*
X135277557Y-84362029D01*
X135256938Y-84368284D01*
X135229360Y-84371000D01*
X134770640Y-84371000D01*
X134743062Y-84368284D01*
X134722443Y-84362029D01*
X134703447Y-84351876D01*
X134686792Y-84338208D01*
X134673124Y-84321553D01*
X134662971Y-84302557D01*
X134656716Y-84281938D01*
X134654000Y-84254360D01*
X134654000Y-83745640D01*
X134656716Y-83718062D01*
X134662971Y-83697443D01*
X134673124Y-83678447D01*
X134686792Y-83661792D01*
X134703447Y-83648124D01*
X134722443Y-83637971D01*
X134743062Y-83631716D01*
X134770640Y-83629000D01*
X135229360Y-83629000D01*
X135256938Y-83631716D01*
X135256938Y-83631716D01*
G37*
G36*
X134286938Y-83631716D02*
G01*
X134307557Y-83637971D01*
X134326553Y-83648124D01*
X134343208Y-83661792D01*
X134356876Y-83678447D01*
X134367029Y-83697443D01*
X134373284Y-83718062D01*
X134376000Y-83745640D01*
X134376000Y-84254360D01*
X134373284Y-84281938D01*
X134367029Y-84302557D01*
X134356876Y-84321553D01*
X134343208Y-84338208D01*
X134326553Y-84351876D01*
X134307557Y-84362029D01*
X134286938Y-84368284D01*
X134259360Y-84371000D01*
X133800640Y-84371000D01*
X133773062Y-84368284D01*
X133752443Y-84362029D01*
X133733447Y-84351876D01*
X133716792Y-84338208D01*
X133703124Y-84321553D01*
X133692971Y-84302557D01*
X133686716Y-84281938D01*
X133684000Y-84254360D01*
X133684000Y-83745640D01*
X133686716Y-83718062D01*
X133692971Y-83697443D01*
X133703124Y-83678447D01*
X133716792Y-83661792D01*
X133733447Y-83648124D01*
X133752443Y-83637971D01*
X133773062Y-83631716D01*
X133800640Y-83629000D01*
X134259360Y-83629000D01*
X134286938Y-83631716D01*
X134286938Y-83631716D01*
G37*
G36*
X95610443Y-82565519D02*
G01*
X95676627Y-82572037D01*
X95846466Y-82623557D01*
X96002991Y-82707222D01*
X96038729Y-82736552D01*
X96140186Y-82819814D01*
X96223448Y-82921271D01*
X96252778Y-82957009D01*
X96336443Y-83113534D01*
X96387963Y-83283373D01*
X96405359Y-83460000D01*
X96387963Y-83636627D01*
X96336443Y-83806466D01*
X96252778Y-83962991D01*
X96223448Y-83998729D01*
X96140186Y-84100186D01*
X96038729Y-84183448D01*
X96002991Y-84212778D01*
X95846466Y-84296443D01*
X95676627Y-84347963D01*
X95610443Y-84354481D01*
X95544260Y-84361000D01*
X95455740Y-84361000D01*
X95389557Y-84354481D01*
X95323373Y-84347963D01*
X95153534Y-84296443D01*
X94997009Y-84212778D01*
X94961271Y-84183448D01*
X94859814Y-84100186D01*
X94776552Y-83998729D01*
X94747222Y-83962991D01*
X94663557Y-83806466D01*
X94612037Y-83636627D01*
X94594641Y-83460000D01*
X94612037Y-83283373D01*
X94663557Y-83113534D01*
X94747222Y-82957009D01*
X94776552Y-82921271D01*
X94859814Y-82819814D01*
X94961271Y-82736552D01*
X94997009Y-82707222D01*
X95153534Y-82623557D01*
X95323373Y-82572037D01*
X95389557Y-82565519D01*
X95455740Y-82559000D01*
X95544260Y-82559000D01*
X95610443Y-82565519D01*
X95610443Y-82565519D01*
G37*
G36*
X95610442Y-80025518D02*
G01*
X95676627Y-80032037D01*
X95846466Y-80083557D01*
X96002991Y-80167222D01*
X96038729Y-80196552D01*
X96140186Y-80279814D01*
X96223448Y-80381271D01*
X96252778Y-80417009D01*
X96336443Y-80573534D01*
X96387963Y-80743373D01*
X96405359Y-80920000D01*
X96387963Y-81096627D01*
X96336443Y-81266466D01*
X96252778Y-81422991D01*
X96223448Y-81458729D01*
X96140186Y-81560186D01*
X96038729Y-81643448D01*
X96002991Y-81672778D01*
X95846466Y-81756443D01*
X95676627Y-81807963D01*
X95610443Y-81814481D01*
X95544260Y-81821000D01*
X95455740Y-81821000D01*
X95389557Y-81814481D01*
X95323373Y-81807963D01*
X95153534Y-81756443D01*
X94997009Y-81672778D01*
X94961271Y-81643448D01*
X94859814Y-81560186D01*
X94776552Y-81458729D01*
X94747222Y-81422991D01*
X94663557Y-81266466D01*
X94612037Y-81096627D01*
X94594641Y-80920000D01*
X94612037Y-80743373D01*
X94663557Y-80573534D01*
X94747222Y-80417009D01*
X94776552Y-80381271D01*
X94859814Y-80279814D01*
X94961271Y-80196552D01*
X94997009Y-80167222D01*
X95153534Y-80083557D01*
X95323373Y-80032037D01*
X95389558Y-80025518D01*
X95455740Y-80019000D01*
X95544260Y-80019000D01*
X95610442Y-80025518D01*
X95610442Y-80025518D01*
G37*
G36*
X95610443Y-77485519D02*
G01*
X95676627Y-77492037D01*
X95846466Y-77543557D01*
X96002991Y-77627222D01*
X96038729Y-77656552D01*
X96140186Y-77739814D01*
X96223448Y-77841271D01*
X96252778Y-77877009D01*
X96336443Y-78033534D01*
X96387963Y-78203373D01*
X96405359Y-78380000D01*
X96387963Y-78556627D01*
X96336443Y-78726466D01*
X96252778Y-78882991D01*
X96237998Y-78901000D01*
X96140186Y-79020186D01*
X96038729Y-79103448D01*
X96002991Y-79132778D01*
X95846466Y-79216443D01*
X95676627Y-79267963D01*
X95610443Y-79274481D01*
X95544260Y-79281000D01*
X95455740Y-79281000D01*
X95389557Y-79274481D01*
X95323373Y-79267963D01*
X95153534Y-79216443D01*
X94997009Y-79132778D01*
X94961271Y-79103448D01*
X94859814Y-79020186D01*
X94762002Y-78901000D01*
X94747222Y-78882991D01*
X94663557Y-78726466D01*
X94612037Y-78556627D01*
X94594641Y-78380000D01*
X94612037Y-78203373D01*
X94663557Y-78033534D01*
X94747222Y-77877009D01*
X94776552Y-77841271D01*
X94859814Y-77739814D01*
X94961271Y-77656552D01*
X94997009Y-77627222D01*
X95153534Y-77543557D01*
X95323373Y-77492037D01*
X95389557Y-77485519D01*
X95455740Y-77479000D01*
X95544260Y-77479000D01*
X95610443Y-77485519D01*
X95610443Y-77485519D01*
G37*
G36*
X156401000Y-78901000D02*
G01*
X154599000Y-78901000D01*
X154599000Y-77099000D01*
X156401000Y-77099000D01*
X156401000Y-78901000D01*
X156401000Y-78901000D01*
G37*
G36*
X155610443Y-74565519D02*
G01*
X155676627Y-74572037D01*
X155846466Y-74623557D01*
X156002991Y-74707222D01*
X156038729Y-74736552D01*
X156140186Y-74819814D01*
X156223448Y-74921271D01*
X156252778Y-74957009D01*
X156336443Y-75113534D01*
X156387963Y-75283373D01*
X156405359Y-75460000D01*
X156387963Y-75636627D01*
X156336443Y-75806466D01*
X156252778Y-75962991D01*
X156223448Y-75998729D01*
X156140186Y-76100186D01*
X156038729Y-76183448D01*
X156002991Y-76212778D01*
X155846466Y-76296443D01*
X155676627Y-76347963D01*
X155610443Y-76354481D01*
X155544260Y-76361000D01*
X155455740Y-76361000D01*
X155389557Y-76354481D01*
X155323373Y-76347963D01*
X155153534Y-76296443D01*
X154997009Y-76212778D01*
X154961271Y-76183448D01*
X154859814Y-76100186D01*
X154776552Y-75998729D01*
X154747222Y-75962991D01*
X154663557Y-75806466D01*
X154612037Y-75636627D01*
X154594641Y-75460000D01*
X154612037Y-75283373D01*
X154663557Y-75113534D01*
X154747222Y-74957009D01*
X154776552Y-74921271D01*
X154859814Y-74819814D01*
X154961271Y-74736552D01*
X154997009Y-74707222D01*
X155153534Y-74623557D01*
X155323373Y-74572037D01*
X155389557Y-74565519D01*
X155455740Y-74559000D01*
X155544260Y-74559000D01*
X155610443Y-74565519D01*
X155610443Y-74565519D01*
G37*
G36*
X96901000Y-69901000D02*
G01*
X95099000Y-69901000D01*
X95099000Y-68099000D01*
X96901000Y-68099000D01*
X96901000Y-69901000D01*
X96901000Y-69901000D01*
G37*
G36*
X96110443Y-65565519D02*
G01*
X96176627Y-65572037D01*
X96346466Y-65623557D01*
X96502991Y-65707222D01*
X96538729Y-65736552D01*
X96640186Y-65819814D01*
X96723448Y-65921271D01*
X96752778Y-65957009D01*
X96836443Y-66113534D01*
X96887963Y-66283373D01*
X96905359Y-66460000D01*
X96887963Y-66636627D01*
X96836443Y-66806466D01*
X96752778Y-66962991D01*
X96723448Y-66998729D01*
X96640186Y-67100186D01*
X96538729Y-67183448D01*
X96502991Y-67212778D01*
X96346466Y-67296443D01*
X96176627Y-67347963D01*
X96110442Y-67354482D01*
X96044260Y-67361000D01*
X95955740Y-67361000D01*
X95889558Y-67354482D01*
X95823373Y-67347963D01*
X95653534Y-67296443D01*
X95497009Y-67212778D01*
X95461271Y-67183448D01*
X95359814Y-67100186D01*
X95276552Y-66998729D01*
X95247222Y-66962991D01*
X95163557Y-66806466D01*
X95112037Y-66636627D01*
X95094641Y-66460000D01*
X95112037Y-66283373D01*
X95163557Y-66113534D01*
X95247222Y-65957009D01*
X95276552Y-65921271D01*
X95359814Y-65819814D01*
X95461271Y-65736552D01*
X95497009Y-65707222D01*
X95653534Y-65623557D01*
X95823373Y-65572037D01*
X95889557Y-65565519D01*
X95955740Y-65559000D01*
X96044260Y-65559000D01*
X96110443Y-65565519D01*
X96110443Y-65565519D01*
G37*
G36*
X96110442Y-63025518D02*
G01*
X96176627Y-63032037D01*
X96346466Y-63083557D01*
X96502991Y-63167222D01*
X96538729Y-63196552D01*
X96640186Y-63279814D01*
X96723448Y-63381271D01*
X96752778Y-63417009D01*
X96836443Y-63573534D01*
X96887963Y-63743373D01*
X96905359Y-63920000D01*
X96887963Y-64096627D01*
X96836443Y-64266466D01*
X96752778Y-64422991D01*
X96723448Y-64458729D01*
X96640186Y-64560186D01*
X96538729Y-64643448D01*
X96502991Y-64672778D01*
X96346466Y-64756443D01*
X96176627Y-64807963D01*
X96110443Y-64814481D01*
X96044260Y-64821000D01*
X95955740Y-64821000D01*
X95889557Y-64814481D01*
X95823373Y-64807963D01*
X95653534Y-64756443D01*
X95497009Y-64672778D01*
X95461271Y-64643448D01*
X95359814Y-64560186D01*
X95276552Y-64458729D01*
X95247222Y-64422991D01*
X95163557Y-64266466D01*
X95112037Y-64096627D01*
X95094641Y-63920000D01*
X95112037Y-63743373D01*
X95163557Y-63573534D01*
X95247222Y-63417009D01*
X95276552Y-63381271D01*
X95359814Y-63279814D01*
X95461271Y-63196552D01*
X95497009Y-63167222D01*
X95653534Y-63083557D01*
X95823373Y-63032037D01*
X95889558Y-63025518D01*
X95955740Y-63019000D01*
X96044260Y-63019000D01*
X96110442Y-63025518D01*
X96110442Y-63025518D01*
G37*
G36*
X155110442Y-62185518D02*
G01*
X155176627Y-62192037D01*
X155346466Y-62243557D01*
X155502991Y-62327222D01*
X155538729Y-62356552D01*
X155640186Y-62439814D01*
X155723448Y-62541271D01*
X155752778Y-62577009D01*
X155836443Y-62733534D01*
X155887963Y-62903373D01*
X155905359Y-63080000D01*
X155887963Y-63256627D01*
X155836443Y-63426466D01*
X155752778Y-63582991D01*
X155723448Y-63618729D01*
X155640186Y-63720186D01*
X155538729Y-63803448D01*
X155502991Y-63832778D01*
X155346466Y-63916443D01*
X155176627Y-63967963D01*
X155110443Y-63974481D01*
X155044260Y-63981000D01*
X154955740Y-63981000D01*
X154889557Y-63974481D01*
X154823373Y-63967963D01*
X154653534Y-63916443D01*
X154497009Y-63832778D01*
X154461271Y-63803448D01*
X154359814Y-63720186D01*
X154276552Y-63618729D01*
X154247222Y-63582991D01*
X154163557Y-63426466D01*
X154112037Y-63256627D01*
X154094641Y-63080000D01*
X154112037Y-62903373D01*
X154163557Y-62733534D01*
X154247222Y-62577009D01*
X154276552Y-62541271D01*
X154359814Y-62439814D01*
X154461271Y-62356552D01*
X154497009Y-62327222D01*
X154653534Y-62243557D01*
X154823373Y-62192037D01*
X154889558Y-62185518D01*
X154955740Y-62179000D01*
X155044260Y-62179000D01*
X155110442Y-62185518D01*
X155110442Y-62185518D01*
G37*
G36*
X96110442Y-60485518D02*
G01*
X96176627Y-60492037D01*
X96346466Y-60543557D01*
X96502991Y-60627222D01*
X96538729Y-60656552D01*
X96640186Y-60739814D01*
X96723448Y-60841271D01*
X96752778Y-60877009D01*
X96836443Y-61033534D01*
X96887963Y-61203373D01*
X96905359Y-61380000D01*
X96887963Y-61556627D01*
X96836443Y-61726466D01*
X96752778Y-61882991D01*
X96723448Y-61918729D01*
X96640186Y-62020186D01*
X96538729Y-62103448D01*
X96502991Y-62132778D01*
X96346466Y-62216443D01*
X96176627Y-62267963D01*
X96110442Y-62274482D01*
X96044260Y-62281000D01*
X95955740Y-62281000D01*
X95889558Y-62274482D01*
X95823373Y-62267963D01*
X95653534Y-62216443D01*
X95497009Y-62132778D01*
X95461271Y-62103448D01*
X95359814Y-62020186D01*
X95276552Y-61918729D01*
X95247222Y-61882991D01*
X95163557Y-61726466D01*
X95112037Y-61556627D01*
X95094641Y-61380000D01*
X95112037Y-61203373D01*
X95163557Y-61033534D01*
X95247222Y-60877009D01*
X95276552Y-60841271D01*
X95359814Y-60739814D01*
X95461271Y-60656552D01*
X95497009Y-60627222D01*
X95653534Y-60543557D01*
X95823373Y-60492037D01*
X95889558Y-60485518D01*
X95955740Y-60479000D01*
X96044260Y-60479000D01*
X96110442Y-60485518D01*
X96110442Y-60485518D01*
G37*
G36*
X155110443Y-59645519D02*
G01*
X155176627Y-59652037D01*
X155346466Y-59703557D01*
X155502991Y-59787222D01*
X155538729Y-59816552D01*
X155640186Y-59899814D01*
X155723448Y-60001271D01*
X155752778Y-60037009D01*
X155836443Y-60193534D01*
X155887963Y-60363373D01*
X155905359Y-60540000D01*
X155887963Y-60716627D01*
X155836443Y-60886466D01*
X155752778Y-61042991D01*
X155723448Y-61078729D01*
X155640186Y-61180186D01*
X155538729Y-61263448D01*
X155502991Y-61292778D01*
X155346466Y-61376443D01*
X155176627Y-61427963D01*
X155110442Y-61434482D01*
X155044260Y-61441000D01*
X154955740Y-61441000D01*
X154889558Y-61434482D01*
X154823373Y-61427963D01*
X154653534Y-61376443D01*
X154497009Y-61292778D01*
X154461271Y-61263448D01*
X154359814Y-61180186D01*
X154276552Y-61078729D01*
X154247222Y-61042991D01*
X154163557Y-60886466D01*
X154112037Y-60716627D01*
X154094641Y-60540000D01*
X154112037Y-60363373D01*
X154163557Y-60193534D01*
X154247222Y-60037009D01*
X154276552Y-60001271D01*
X154359814Y-59899814D01*
X154461271Y-59816552D01*
X154497009Y-59787222D01*
X154653534Y-59703557D01*
X154823373Y-59652037D01*
X154889557Y-59645519D01*
X154955740Y-59639000D01*
X155044260Y-59639000D01*
X155110443Y-59645519D01*
X155110443Y-59645519D01*
G37*
G36*
X96110443Y-57945519D02*
G01*
X96176627Y-57952037D01*
X96346466Y-58003557D01*
X96502991Y-58087222D01*
X96538729Y-58116552D01*
X96640186Y-58199814D01*
X96723448Y-58301271D01*
X96752778Y-58337009D01*
X96836443Y-58493534D01*
X96887963Y-58663373D01*
X96905359Y-58840000D01*
X96887963Y-59016627D01*
X96836443Y-59186466D01*
X96752778Y-59342991D01*
X96723448Y-59378729D01*
X96640186Y-59480186D01*
X96538729Y-59563448D01*
X96502991Y-59592778D01*
X96346466Y-59676443D01*
X96176627Y-59727963D01*
X96110443Y-59734481D01*
X96044260Y-59741000D01*
X95955740Y-59741000D01*
X95889557Y-59734481D01*
X95823373Y-59727963D01*
X95653534Y-59676443D01*
X95497009Y-59592778D01*
X95461271Y-59563448D01*
X95359814Y-59480186D01*
X95276552Y-59378729D01*
X95247222Y-59342991D01*
X95163557Y-59186466D01*
X95112037Y-59016627D01*
X95094641Y-58840000D01*
X95112037Y-58663373D01*
X95163557Y-58493534D01*
X95247222Y-58337009D01*
X95276552Y-58301271D01*
X95359814Y-58199814D01*
X95461271Y-58116552D01*
X95497009Y-58087222D01*
X95653534Y-58003557D01*
X95823373Y-57952037D01*
X95889557Y-57945519D01*
X95955740Y-57939000D01*
X96044260Y-57939000D01*
X96110443Y-57945519D01*
X96110443Y-57945519D01*
G37*
G36*
X155901000Y-58901000D02*
G01*
X154099000Y-58901000D01*
X154099000Y-57099000D01*
X155901000Y-57099000D01*
X155901000Y-58901000D01*
X155901000Y-58901000D01*
G37*
G36*
X96110443Y-55405519D02*
G01*
X96176627Y-55412037D01*
X96346466Y-55463557D01*
X96502991Y-55547222D01*
X96538729Y-55576552D01*
X96640186Y-55659814D01*
X96723448Y-55761271D01*
X96752778Y-55797009D01*
X96836443Y-55953534D01*
X96887963Y-56123373D01*
X96905359Y-56300000D01*
X96887963Y-56476627D01*
X96836443Y-56646466D01*
X96752778Y-56802991D01*
X96723448Y-56838729D01*
X96640186Y-56940186D01*
X96538729Y-57023448D01*
X96502991Y-57052778D01*
X96346466Y-57136443D01*
X96176627Y-57187963D01*
X96110443Y-57194481D01*
X96044260Y-57201000D01*
X95955740Y-57201000D01*
X95889557Y-57194481D01*
X95823373Y-57187963D01*
X95653534Y-57136443D01*
X95497009Y-57052778D01*
X95461271Y-57023448D01*
X95359814Y-56940186D01*
X95276552Y-56838729D01*
X95247222Y-56802991D01*
X95163557Y-56646466D01*
X95112037Y-56476627D01*
X95094641Y-56300000D01*
X95112037Y-56123373D01*
X95163557Y-55953534D01*
X95247222Y-55797009D01*
X95276552Y-55761271D01*
X95359814Y-55659814D01*
X95461271Y-55576552D01*
X95497009Y-55547222D01*
X95653534Y-55463557D01*
X95823373Y-55412037D01*
X95889557Y-55405519D01*
X95955740Y-55399000D01*
X96044260Y-55399000D01*
X96110443Y-55405519D01*
X96110443Y-55405519D01*
G37*
G36*
X114887420Y-45809143D02*
G01*
X115019556Y-45849227D01*
X115019558Y-45849228D01*
X115141338Y-45914320D01*
X115141340Y-45914321D01*
X115141339Y-45914321D01*
X115248080Y-46001920D01*
X115322360Y-46092430D01*
X115335680Y-46108661D01*
X115400772Y-46230441D01*
X115400773Y-46230443D01*
X115440857Y-46362579D01*
X115451000Y-46465568D01*
X115451000Y-47534432D01*
X115440857Y-47637421D01*
X115400773Y-47769557D01*
X115400772Y-47769559D01*
X115335680Y-47891339D01*
X115248080Y-47998080D01*
X115141339Y-48085680D01*
X115019559Y-48150772D01*
X115019557Y-48150773D01*
X114887421Y-48190857D01*
X114750000Y-48204391D01*
X114612580Y-48190857D01*
X114480444Y-48150773D01*
X114480442Y-48150772D01*
X114358662Y-48085680D01*
X114251921Y-47998080D01*
X114164321Y-47891339D01*
X114099229Y-47769559D01*
X114099228Y-47769557D01*
X114059144Y-47637421D01*
X114049001Y-47534432D01*
X114049000Y-46465569D01*
X114059143Y-46362580D01*
X114099227Y-46230444D01*
X114164321Y-46108661D01*
X114251920Y-46001920D01*
X114358660Y-45914321D01*
X114358659Y-45914321D01*
X114358661Y-45914320D01*
X114480441Y-45849228D01*
X114480443Y-45849227D01*
X114612579Y-45809143D01*
X114750000Y-45795609D01*
X114887420Y-45809143D01*
X114887420Y-45809143D01*
G37*
G36*
X131387420Y-45809143D02*
G01*
X131519556Y-45849227D01*
X131519558Y-45849228D01*
X131641338Y-45914320D01*
X131641340Y-45914321D01*
X131641339Y-45914321D01*
X131748080Y-46001920D01*
X131822360Y-46092430D01*
X131835680Y-46108661D01*
X131900772Y-46230441D01*
X131900773Y-46230443D01*
X131940857Y-46362579D01*
X131951000Y-46465568D01*
X131951000Y-47534432D01*
X131940857Y-47637421D01*
X131900773Y-47769557D01*
X131900772Y-47769559D01*
X131835680Y-47891339D01*
X131748080Y-47998080D01*
X131641339Y-48085680D01*
X131519559Y-48150772D01*
X131519557Y-48150773D01*
X131387421Y-48190857D01*
X131250000Y-48204391D01*
X131112580Y-48190857D01*
X130980444Y-48150773D01*
X130980442Y-48150772D01*
X130858662Y-48085680D01*
X130751921Y-47998080D01*
X130664321Y-47891339D01*
X130599229Y-47769559D01*
X130599228Y-47769557D01*
X130559144Y-47637421D01*
X130549001Y-47534432D01*
X130549000Y-46465569D01*
X130559143Y-46362580D01*
X130599227Y-46230444D01*
X130664321Y-46108661D01*
X130751920Y-46001920D01*
X130858660Y-45914321D01*
X130858659Y-45914321D01*
X130858661Y-45914320D01*
X130980441Y-45849228D01*
X130980443Y-45849227D01*
X131112579Y-45809143D01*
X131250000Y-45795609D01*
X131387420Y-45809143D01*
X131387420Y-45809143D01*
G37*
G36*
X95525331Y-42768211D02*
G01*
X95853092Y-42903974D01*
X96148070Y-43101072D01*
X96398928Y-43351930D01*
X96596026Y-43646908D01*
X96731789Y-43974669D01*
X96801000Y-44322616D01*
X96801000Y-44677384D01*
X96731789Y-45025331D01*
X96596026Y-45353092D01*
X96398928Y-45648070D01*
X96148070Y-45898928D01*
X95853092Y-46096026D01*
X95525331Y-46231789D01*
X95177384Y-46301000D01*
X94822616Y-46301000D01*
X94474669Y-46231789D01*
X94146908Y-46096026D01*
X93851930Y-45898928D01*
X93601072Y-45648070D01*
X93403974Y-45353092D01*
X93268211Y-45025331D01*
X93199000Y-44677384D01*
X93199000Y-44322616D01*
X93268211Y-43974669D01*
X93403974Y-43646908D01*
X93601072Y-43351930D01*
X93851930Y-43101072D01*
X94146908Y-42903974D01*
X94474669Y-42768211D01*
X94822616Y-42699000D01*
X95177384Y-42699000D01*
X95525331Y-42768211D01*
X95525331Y-42768211D01*
G37*
G36*
X155525331Y-42768211D02*
G01*
X155853092Y-42903974D01*
X156148070Y-43101072D01*
X156398928Y-43351930D01*
X156596026Y-43646908D01*
X156731789Y-43974669D01*
X156801000Y-44322616D01*
X156801000Y-44677384D01*
X156731789Y-45025331D01*
X156596026Y-45353092D01*
X156398928Y-45648070D01*
X156148070Y-45898928D01*
X155853092Y-46096026D01*
X155525331Y-46231789D01*
X155177384Y-46301000D01*
X154822616Y-46301000D01*
X154474669Y-46231789D01*
X154146908Y-46096026D01*
X153851930Y-45898928D01*
X153601072Y-45648070D01*
X153403974Y-45353092D01*
X153268211Y-45025331D01*
X153199000Y-44677384D01*
X153199000Y-44322616D01*
X153268211Y-43974669D01*
X153403974Y-43646908D01*
X153601072Y-43351930D01*
X153851930Y-43101072D01*
X154146908Y-42903974D01*
X154474669Y-42768211D01*
X154822616Y-42699000D01*
X155177384Y-42699000D01*
X155525331Y-42768211D01*
X155525331Y-42768211D01*
G37*
G36*
X114887420Y-39229143D02*
G01*
X115019556Y-39269227D01*
X115019558Y-39269228D01*
X115141338Y-39334320D01*
X115141340Y-39334321D01*
X115141339Y-39334321D01*
X115248080Y-39421920D01*
X115322360Y-39512430D01*
X115335680Y-39528661D01*
X115345135Y-39546351D01*
X115400773Y-39650443D01*
X115440857Y-39782579D01*
X115451000Y-39885568D01*
X115451000Y-40554432D01*
X115440857Y-40657421D01*
X115400773Y-40789557D01*
X115400772Y-40789559D01*
X115335680Y-40911339D01*
X115248080Y-41018080D01*
X115141339Y-41105680D01*
X115019559Y-41170772D01*
X115019557Y-41170773D01*
X114887421Y-41210857D01*
X114750000Y-41224391D01*
X114612580Y-41210857D01*
X114480444Y-41170773D01*
X114480442Y-41170772D01*
X114358662Y-41105680D01*
X114251921Y-41018080D01*
X114164321Y-40911339D01*
X114099228Y-40789559D01*
X114099227Y-40789558D01*
X114059143Y-40657421D01*
X114049000Y-40554432D01*
X114049000Y-39885569D01*
X114059143Y-39782580D01*
X114099227Y-39650444D01*
X114099229Y-39650441D01*
X114164320Y-39528662D01*
X114180029Y-39509520D01*
X114251920Y-39421920D01*
X114358660Y-39334321D01*
X114358659Y-39334321D01*
X114358661Y-39334320D01*
X114480441Y-39269228D01*
X114480443Y-39269227D01*
X114612579Y-39229143D01*
X114750000Y-39215609D01*
X114887420Y-39229143D01*
X114887420Y-39229143D01*
G37*
G36*
X131387420Y-39229143D02*
G01*
X131519556Y-39269227D01*
X131519558Y-39269228D01*
X131641338Y-39334320D01*
X131641340Y-39334321D01*
X131641339Y-39334321D01*
X131748080Y-39421920D01*
X131822360Y-39512430D01*
X131835680Y-39528661D01*
X131845135Y-39546351D01*
X131900773Y-39650443D01*
X131940857Y-39782579D01*
X131951000Y-39885568D01*
X131951000Y-40554432D01*
X131940857Y-40657421D01*
X131900773Y-40789557D01*
X131900772Y-40789559D01*
X131835680Y-40911339D01*
X131748080Y-41018080D01*
X131641339Y-41105680D01*
X131519559Y-41170772D01*
X131519557Y-41170773D01*
X131387421Y-41210857D01*
X131250000Y-41224391D01*
X131112580Y-41210857D01*
X130980444Y-41170773D01*
X130980442Y-41170772D01*
X130858662Y-41105680D01*
X130751921Y-41018080D01*
X130664321Y-40911339D01*
X130599228Y-40789559D01*
X130599227Y-40789558D01*
X130559143Y-40657421D01*
X130549000Y-40554432D01*
X130549000Y-39885569D01*
X130559143Y-39782580D01*
X130599227Y-39650444D01*
X130599229Y-39650441D01*
X130664320Y-39528662D01*
X130680029Y-39509520D01*
X130751920Y-39421920D01*
X130858660Y-39334321D01*
X130858659Y-39334321D01*
X130858661Y-39334320D01*
X130980441Y-39269228D01*
X130980443Y-39269227D01*
X131112579Y-39229143D01*
X131250000Y-39215609D01*
X131387420Y-39229143D01*
X131387420Y-39229143D01*
G37*
G36*
X123226348Y-38573820D02*
G01*
X123226350Y-38573821D01*
X123226351Y-38573821D01*
X123367574Y-38632317D01*
X123367577Y-38632319D01*
X123494669Y-38717239D01*
X123602761Y-38825331D01*
X123687681Y-38952423D01*
X123687683Y-38952426D01*
X123746179Y-39093649D01*
X123746180Y-39093652D01*
X123776000Y-39243569D01*
X123776000Y-39396431D01*
X123770930Y-39421921D01*
X123746179Y-39546351D01*
X123687683Y-39687574D01*
X123687681Y-39687577D01*
X123602761Y-39814669D01*
X123494669Y-39922761D01*
X123367577Y-40007681D01*
X123367574Y-40007683D01*
X123226351Y-40066179D01*
X123226350Y-40066179D01*
X123226348Y-40066180D01*
X123076431Y-40096000D01*
X122923569Y-40096000D01*
X122773652Y-40066180D01*
X122773650Y-40066179D01*
X122773649Y-40066179D01*
X122632426Y-40007683D01*
X122632423Y-40007681D01*
X122505331Y-39922761D01*
X122397239Y-39814669D01*
X122312319Y-39687577D01*
X122312317Y-39687574D01*
X122253821Y-39546351D01*
X122229071Y-39421921D01*
X122224000Y-39396431D01*
X122224000Y-39243569D01*
X122253820Y-39093652D01*
X122253821Y-39093649D01*
X122312317Y-38952426D01*
X122312319Y-38952423D01*
X122397239Y-38825331D01*
X122505331Y-38717239D01*
X122632423Y-38632319D01*
X122632426Y-38632317D01*
X122773649Y-38573821D01*
X122773650Y-38573821D01*
X122773652Y-38573820D01*
X122923569Y-38544000D01*
X123076431Y-38544000D01*
X123226348Y-38573820D01*
X123226348Y-38573820D01*
G37*
M02*
