M48
; DRILL file {KiCad (5.1.4-0-10_14)} date Friday, June 05, 2020 at 02:08:53 PM
; FORMAT={-:-/ absolute / inch / decimal}
; #@! TF.CreationDate,2020-06-05T14:08:53-07:00
; #@! TF.GenerationSoftware,Kicad,Pcbnew,(5.1.4-0-10_14)
; #@! TF.FileFunction,Plated,1,4,PTH
FMAT,2
INCH
T1C0.0100
T2C0.0256
T3C0.0276
T4C0.0394
%
G90
G05
T1
X4.3701Y-3.8189
X4.4685Y-3.5236
X4.4685Y-3.8189
X4.5079Y-3.5236
X4.5276Y-3.8189
X4.5866Y-3.8189
X4.626Y-2.0866
X4.6457Y-3.8189
X4.685Y-2.0866
X4.7244Y-2.0866
X4.7638Y-1.8504
X4.8622Y-1.8504
X4.9213Y-1.8504
X4.9803Y-1.8504
X5.0394Y-1.8504
X5.2953Y-3.8189
X5.3346Y-3.5827
X5.3543Y-3.563
X5.374Y-3.5827
X5.3937Y-3.8189
X5.4134Y-3.5827
X5.4331Y-3.563
X5.4528Y-3.8189
X5.4724Y-3.563
X5.4921Y-3.5827
X5.5118Y-3.8189
X5.5315Y-3.5827
X5.5512Y-3.563
X5.5709Y-3.8189
X5.5906Y-3.563
T4
X6.122Y-2.9709
X6.122Y-3.0709
X6.1024Y-2.2835
X6.1024Y-2.3835
X6.1024Y-2.4835
X3.7598Y-3.0858
X3.7598Y-3.1858
X3.7598Y-3.2858
X3.7598Y-3.3858
X3.7795Y-2.2165
X3.7795Y-2.3165
X3.7795Y-2.4165
X3.7795Y-2.5165
X3.7795Y-2.6165
X3.7795Y-2.7165
T2
G00X5.0492Y-3.7992
M15
G01X5.0492Y-3.8386
M16
G05
G00X5.6988Y-4.075
M15
G01X5.6988Y-4.0967
M16
G05
G00X4.124Y-3.7992
M15
G01X4.124Y-3.8386
M16
G05
G00X4.7736Y-4.075
M15
G01X4.7736Y-4.0967
M16
G05
G00X4.5177Y-1.8307
M15
G01X4.5177Y-1.8701
M16
G05
G00X5.1673Y-1.5726
M15
G01X5.1673Y-1.5943
M16
G05
T3
G00X5.0492Y-4.075
M15
G01X5.0492Y-4.0967
M16
G05
G00X5.6988Y-3.7992
M15
G01X5.6988Y-3.8386
M16
G05
G00X4.124Y-4.075
M15
G01X4.124Y-4.0967
M16
G05
G00X4.7736Y-3.7992
M15
G01X4.7736Y-3.8386
M16
G05
G00X4.5177Y-1.5726
M15
G01X4.5177Y-1.5943
M16
G05
G00X5.1673Y-1.8307
M15
G01X5.1673Y-1.8701
M16
G05
T0
M30
