EESchema Schematic File Version 4
LIBS:cmd_fwd_brd-cache
EELAYER 30 0
EELAYER END
$Descr A4 11693 8268
encoding utf-8
Sheet 1 1
Title ""
Date ""
Rev ""
Comp ""
Comment1 ""
Comment2 ""
Comment3 ""
Comment4 ""
$EndDescr
$Comp
L display_port:DISPLAY_PORT DP2
U 1 1 5EBAD88E
P 4050 5900
F 0 "DP2" V 4593 5742 60  0000 C CNN
F 1 "DISPLAY_PORT" V 4487 5742 60  0000 C CNN
F 2 "display_port:DP1RD20JQ1R400" V 4381 5742 60  0001 C CNN
F 3 "" H 4000 5900 60  0000 C CNN
	1    4050 5900
	0    1    1    0   
$EndComp
Wire Wire Line
	2700 5700 2450 5700
Text Label 2450 5700 2    50   ~ 0
SGND
Wire Wire Line
	4950 5050 4950 4800
Wire Wire Line
	4850 5050 4850 4800
Wire Wire Line
	4750 5050 4750 4800
Wire Wire Line
	4650 5050 4650 4800
Wire Wire Line
	4550 5050 4550 4800
Wire Wire Line
	4450 5050 4450 4800
Wire Wire Line
	4350 5050 4350 4800
Wire Wire Line
	4250 5050 4250 4800
Wire Wire Line
	4150 5050 4150 4800
Wire Wire Line
	4050 5050 4050 4800
Wire Wire Line
	3950 5050 3950 4800
Wire Wire Line
	3850 5050 3850 4800
Wire Wire Line
	3750 5050 3750 4800
Wire Wire Line
	3450 5050 3450 4800
NoConn ~ 3050 5050
$Comp
L display_port:DISPLAY_PORT DP3
U 1 1 5EBC053E
P 8200 5900
F 0 "DP3" V 8743 5742 60  0000 C CNN
F 1 "DISPLAY_PORT" V 8637 5742 60  0000 C CNN
F 2 "display_port:DP1RD20JQ1R400" V 8531 5742 60  0001 C CNN
F 3 "" H 8150 5900 60  0000 C CNN
	1    8200 5900
	0    1    1    0   
$EndComp
Wire Wire Line
	6850 5700 6600 5700
Text Label 6600 5700 2    50   ~ 0
SGND
Wire Wire Line
	9100 5050 9100 4800
Wire Wire Line
	9000 5050 9000 4800
Wire Wire Line
	8900 5050 8900 4800
Wire Wire Line
	8800 5050 8800 4800
Wire Wire Line
	8700 5050 8700 4800
Wire Wire Line
	8600 5050 8600 4800
Wire Wire Line
	8500 5050 8500 4800
Wire Wire Line
	8400 5050 8400 4800
Wire Wire Line
	8300 5050 8300 4800
Wire Wire Line
	8200 5050 8200 4800
Wire Wire Line
	8100 5050 8100 4800
Wire Wire Line
	8000 5050 8000 4800
Wire Wire Line
	7900 5050 7900 4800
Wire Wire Line
	7800 5050 7800 4800
Wire Wire Line
	7700 5050 7700 4800
Wire Wire Line
	7600 5050 7600 4800
Text Label 9000 4800 1    50   ~ 0
GND
Text Label 9100 4800 1    50   ~ 0
DP1_DO_0_P
Text Label 8900 4800 1    50   ~ 0
DP1_DO_0_N
Text Label 8800 4800 1    50   ~ 0
DP1_DO_1_P
Text Label 8700 4800 1    50   ~ 0
GND
Text Label 8600 4800 1    50   ~ 0
DP1_DO_1_N
Text Label 8500 4800 1    50   ~ 0
DP1_DO_2_P
Text Label 8400 4800 1    50   ~ 0
GND
Text Label 8300 4800 1    50   ~ 0
DP1_DO_2_N
Text Label 8200 4800 1    50   ~ 0
DP1_DO_3_P
Text Label 8100 4800 1    50   ~ 0
GND
Text Label 8000 4800 1    50   ~ 0
DP1_DO_3_N
Text Label 7900 4800 1    50   ~ 0
DP1_NTC1
Text Label 7600 4800 1    50   ~ 0
GND
$Comp
L display_port:DISPLAY_PORT DP1
U 1 1 5EBC2072
P 5700 1150
F 0 "DP1" V 6243 992 60  0000 C CNN
F 1 "DISPLAY_PORT" V 6137 992 60  0000 C CNN
F 2 "display_port:DP1RD20JQ1R400" V 6031 992 60  0001 C CNN
F 3 "" H 5650 1150 60  0000 C CNN
	1    5700 1150
	0    -1   -1   0   
$EndComp
Wire Wire Line
	7050 1350 7300 1350
Text Label 7300 1350 0    50   ~ 0
SGND
Wire Wire Line
	4800 2000 4800 2250
Wire Wire Line
	4900 2000 4900 2250
Wire Wire Line
	5000 2000 5000 2250
Wire Wire Line
	5100 2000 5100 2250
Wire Wire Line
	5200 2000 5200 2250
Wire Wire Line
	5300 2000 5300 2250
Wire Wire Line
	5400 2000 5400 2250
Wire Wire Line
	5500 2000 5500 2250
Wire Wire Line
	5600 2000 5600 2250
Wire Wire Line
	5700 2000 5700 2250
Wire Wire Line
	5800 2000 5800 2250
Wire Wire Line
	5900 2000 5900 2250
Wire Wire Line
	6000 2000 6000 2250
Wire Wire Line
	6100 2000 6100 2250
Wire Wire Line
	6200 2000 6200 2250
Wire Wire Line
	6300 2000 6300 2250
Wire Wire Line
	6400 2000 6400 2250
Text Label 4900 2250 3    50   ~ 0
GND
Text Label 4800 2250 3    50   ~ 0
DP1_DO_0_P
Text Label 5000 2250 3    50   ~ 0
DP1_DO_0_N
Text Label 5100 2250 3    50   ~ 0
DP1_DO_1_P
Text Label 5200 2250 3    50   ~ 0
GND
Text Label 5300 2250 3    50   ~ 0
DP1_DO_1_N
Text Label 5400 2250 3    50   ~ 0
DP1_DO_2_P
Text Label 5500 2250 3    50   ~ 0
GND
Text Label 5600 2250 3    50   ~ 0
DP1_DO_2_N
Text Label 5700 2250 3    50   ~ 0
DP1_DO_3_P
Text Label 5800 2250 3    50   ~ 0
GND
Text Label 5900 2250 3    50   ~ 0
DP1_DO_3_N
Text Label 6000 2250 3    50   ~ 0
DP1_NTC1
Text Label 6100 2250 3    50   ~ 0
DP1_NTC2
Text Label 6200 2250 3    50   ~ 0
DP2_GPO_0_N
Text Label 6300 2250 3    50   ~ 0
GND
Text Label 6400 2250 3    50   ~ 0
DP2_GPO_0_P
Text Label 4950 4800 1    50   ~ 0
DP2_GPO_3_N
Text Label 4850 4800 1    50   ~ 0
GND
Text Label 4750 4800 1    50   ~ 0
DP2_GPO_3_P
Text Label 4650 4800 1    50   ~ 0
DP2_GPO_2_N
Text Label 4550 4800 1    50   ~ 0
GND
Text Label 4450 4800 1    50   ~ 0
DP2_GPO_2_P
Text Label 4350 4800 1    50   ~ 0
DP2_GPO_1_N
Text Label 4150 4800 1    50   ~ 0
DP2_GPO_1_P
Text Label 4250 4800 1    50   ~ 0
GND
Text Label 4050 4800 1    50   ~ 0
DP2_GPO_0_N
Text Label 3950 4800 1    50   ~ 0
GND
Text Label 3850 4800 1    50   ~ 0
DP2_GPO_0_P
Text Label 3450 4800 1    50   ~ 0
GND
$Comp
L Connector:Conn_01x03_Female J2
U 1 1 5EBDE62C
P 8300 1000
F 0 "J2" V 8238 812 50  0000 R CNN
F 1 "Conn_01x03_Female" V 8147 812 50  0000 R CNN
F 2 "Connector_PinHeader_2.54mm:PinHeader_1x03_P2.54mm_Vertical" H 8300 1000 50  0001 C CNN
F 3 "~" H 8300 1000 50  0001 C CNN
	1    8300 1000
	0    -1   -1   0   
$EndComp
Wire Wire Line
	8200 1200 8200 1450
Wire Wire Line
	8300 1200 8300 1450
Wire Wire Line
	8400 1200 8400 1450
Text Label 8200 1450 1    50   ~ 0
SGND
Text Label 8300 1450 1    50   ~ 0
GND
Text Label 8400 1450 1    50   ~ 0
GND
Wire Wire Line
	2950 1700 2950 1900
Wire Wire Line
	3050 1700 3050 1900
Wire Wire Line
	3150 1700 3150 1900
Wire Wire Line
	3250 1700 3250 1900
Wire Wire Line
	3350 1700 3350 1900
Wire Wire Line
	3450 1700 3450 1900
$Comp
L Device:R R1
U 1 1 5EBF4AFF
P 2750 2900
F 0 "R1" V 2543 2900 50  0000 C CNN
F 1 "100" V 2634 2900 50  0000 C CNN
F 2 "Resistor_SMD:R_0402_1005Metric" V 2680 2900 50  0001 C CNN
F 3 "~" H 2750 2900 50  0001 C CNN
	1    2750 2900
	0    1    1    0   
$EndComp
$Comp
L Device:R R3
U 1 1 5EBF6289
P 2750 3500
F 0 "R3" V 2543 3500 50  0000 C CNN
F 1 "100" V 2634 3500 50  0000 C CNN
F 2 "Resistor_SMD:R_0402_1005Metric" V 2680 3500 50  0001 C CNN
F 3 "~" H 2750 3500 50  0001 C CNN
	1    2750 3500
	0    1    1    0   
$EndComp
$Comp
L Device:R R2
U 1 1 5EBF8BFF
P 2750 3200
F 0 "R2" V 2543 3200 50  0000 C CNN
F 1 "100" V 2634 3200 50  0000 C CNN
F 2 "Resistor_SMD:R_0402_1005Metric" V 2680 3200 50  0001 C CNN
F 3 "~" H 2750 3200 50  0001 C CNN
	1    2750 3200
	0    1    1    0   
$EndComp
Wire Wire Line
	2600 2900 2450 2900
Wire Wire Line
	2600 3200 2450 3200
Wire Wire Line
	2600 3500 2450 3500
Wire Wire Line
	2900 2900 3050 2900
Wire Wire Line
	2900 3200 3050 3200
Wire Wire Line
	2900 3500 3050 3500
Text Label 2950 1900 3    50   ~ 0
DP2_GPO_1_P
Text Label 3050 1900 3    50   ~ 0
DP2_GPO_1_N
Text Label 3150 1900 3    50   ~ 0
DP2_GPO_2_P
Text Label 3250 1900 3    50   ~ 0
DP2_GPO_2_N
Text Label 3350 1900 3    50   ~ 0
DP2_GPO_3_P
Text Label 3450 1900 3    50   ~ 0
DP2_GPO_3_N
$Comp
L Connector:Conn_01x02_Female J3
U 1 1 5EC42236
P 8250 1850
F 0 "J3" V 8188 1662 50  0000 R CNN
F 1 "Conn_01x02_Female" V 8097 1662 50  0000 R CNN
F 2 "Connector_PinHeader_2.54mm:PinHeader_1x02_P2.54mm_Vertical" H 8250 1850 50  0001 C CNN
F 3 "~" H 8250 1850 50  0001 C CNN
	1    8250 1850
	0    -1   -1   0   
$EndComp
Wire Wire Line
	7500 5050 7500 4800
Text Label 7500 4800 1    50   ~ 0
DP3_CMD_P
Text Label 7700 4800 1    50   ~ 0
DP3_CMD_N
$Comp
L Device:R R5
U 1 1 5EC4A8F1
P 8300 3150
F 0 "R5" V 8093 3150 50  0000 C CNN
F 1 "100" V 8184 3150 50  0000 C CNN
F 2 "Resistor_SMD:R_0402_1005Metric" V 8230 3150 50  0001 C CNN
F 3 "~" H 8300 3150 50  0001 C CNN
	1    8300 3150
	0    1    1    0   
$EndComp
Wire Wire Line
	8250 2050 8250 2250
Wire Wire Line
	8350 2050 8350 2250
Wire Wire Line
	8150 3150 8000 3150
Wire Wire Line
	8450 3150 8600 3150
Text Label 8000 3150 2    50   ~ 0
DP3_CMD_P
Text Label 8600 3150 0    50   ~ 0
DP3_CMD_N
Text Label 8250 2250 3    50   ~ 0
DP3_CMD_N
Text Label 8350 2250 3    50   ~ 0
DP3_CMD_P
Wire Wire Line
	3650 5050 3650 4800
Text Label 3750 4800 1    50   ~ 0
DP2_SDA
Text Label 3650 4800 1    50   ~ 0
DP2_SCL
NoConn ~ 3550 5050
NoConn ~ 3350 5050
Wire Wire Line
	3250 5050 3250 4800
Wire Wire Line
	3150 5050 3150 4800
Text Label 3250 4800 1    50   ~ 0
DP2_MATRIX_TEST
Text Label 3150 4800 1    50   ~ 0
DP2_VCC
Text Label 7800 4800 1    50   ~ 0
DP1_NTC2
Wire Wire Line
	6500 2000 6500 2250
Wire Wire Line
	6600 2000 6600 2250
Wire Wire Line
	6700 2000 6700 2250
Text Label 6500 2250 3    50   ~ 0
DP1_RST_B
Text Label 6600 2250 3    50   ~ 0
DP1_VDD_SENSE
Text Label 6700 2250 3    50   ~ 0
DP1_GND_SENSE
Wire Wire Line
	7200 5050 7200 4800
Wire Wire Line
	7300 5050 7300 4800
Wire Wire Line
	7400 5050 7400 4800
Text Label 7200 4800 1    50   ~ 0
DP1_GND_SENSE
Text Label 7300 4800 1    50   ~ 0
DP1_VDD_SENSE
Text Label 7400 4800 1    50   ~ 0
DP1_RST_B
$Comp
L Connector:Conn_01x06_Female J1
U 1 1 5ECA9E5A
P 3150 1500
F 0 "J1" V 3088 1112 50  0000 R CNN
F 1 "Conn_01x06_Female" V 2997 1112 50  0000 R CNN
F 2 "Connector_PinHeader_2.54mm:PinHeader_1x06_P2.54mm_Vertical" H 3150 1500 50  0001 C CNN
F 3 "~" H 3150 1500 50  0001 C CNN
	1    3150 1500
	0    -1   -1   0   
$EndComp
$Comp
L Connector:Conn_01x04_Female J4
U 1 1 5ECB28E1
P 1750 1450
F 0 "J4" V 1688 1162 50  0000 R CNN
F 1 "Conn_01x04_Female" V 1597 1162 50  0000 R CNN
F 2 "Connector_PinHeader_2.54mm:PinHeader_1x04_P2.54mm_Vertical" H 1750 1450 50  0001 C CNN
F 3 "~" H 1750 1450 50  0001 C CNN
	1    1750 1450
	0    -1   -1   0   
$EndComp
Wire Wire Line
	1950 1650 1950 1900
Wire Wire Line
	1850 1650 1850 1900
Wire Wire Line
	1750 1650 1750 1900
Wire Wire Line
	1650 1650 1650 1900
Text Label 1650 1900 3    50   ~ 0
DP2_VCC
Text Label 1750 1900 3    50   ~ 0
DP2_MATRIX_TEST
Text Label 1850 1900 3    50   ~ 0
DP2_SCL
Text Label 1950 1900 3    50   ~ 0
DP2_SDA
Text Label 3050 3500 0    50   ~ 0
DP2_GPO_3_N
Text Label 3050 3200 0    50   ~ 0
DP2_GPO_2_N
Text Label 2450 3500 2    50   ~ 0
DP2_GPO_3_P
Text Label 2450 3200 2    50   ~ 0
DP2_GPO_2_P
Text Label 3050 2900 0    50   ~ 0
DP2_GPO_1_N
Text Label 2450 2900 2    50   ~ 0
DP2_GPO_1_P
$EndSCHEMATC
