M48
; DRILL file {KiCad (5.1.4-0-10_14)} date Friday, June 05, 2020 at 02:08:53 PM
; FORMAT={-:-/ absolute / inch / decimal}
; #@! TF.CreationDate,2020-06-05T14:08:53-07:00
; #@! TF.GenerationSoftware,Kicad,Pcbnew,(5.1.4-0-10_14)
; #@! TF.FileFunction,NonPlated,1,4,NPTH
FMAT,2
INCH
T1C0.0571
T2C0.1378
%
G90
G05
T1
X5.374Y-4.1213
X4.4488Y-4.1213
X4.8425Y-1.548
T2
X3.7402Y-3.937
X6.1024Y-1.752
X6.122Y-3.9173
X3.7402Y-1.752
T0
M30
