G04 #@! TF.GenerationSoftware,KiCad,Pcbnew,(5.1.4-0-10_14)*
G04 #@! TF.CreationDate,2020-06-05T14:49:41-07:00*
G04 #@! TF.ProjectId,DP_spybrd,44505f73-7079-4627-9264-2e6b69636164,rev?*
G04 #@! TF.SameCoordinates,Original*
G04 #@! TF.FileFunction,Legend,Bot*
G04 #@! TF.FilePolarity,Positive*
%FSLAX46Y46*%
G04 Gerber Fmt 4.6, Leading zero omitted, Abs format (unit mm)*
G04 Created by KiCad (PCBNEW (5.1.4-0-10_14)) date 2020-06-05 14:49:41*
%MOMM*%
%LPD*%
G04 APERTURE LIST*
%ADD10C,0.150000*%
G04 APERTURE END LIST*
D10*
X83300000Y-115960000D02*
X100200000Y-115960000D01*
X83250000Y-115960000D02*
X83250000Y-113500000D01*
X100250000Y-115960000D02*
X100250000Y-113500000D01*
X85750000Y-102000000D02*
X83250000Y-102000000D01*
X100250000Y-102000000D02*
X96250000Y-102000000D01*
X100250000Y-106500000D02*
X100250000Y-110500000D01*
X100250000Y-113500000D02*
X100250000Y-113000000D01*
X83250000Y-113500000D02*
X83250000Y-113000000D01*
X83250000Y-110500000D02*
X83250000Y-106500000D01*
X83250000Y-103500000D02*
X83250000Y-102000000D01*
X100250000Y-102000000D02*
X100250000Y-103500000D01*
M02*
