(export (version D)
  (design
    (source /home/maia/linPOL12V_TestBoard/linPOL12V_TestBoard.sch)
    (date "Mon 27 Aug 2018 11:01:50 AM PDT")
    (tool "Eeschema 5.0.0-fee4fd1~66~ubuntu16.04.1")
    (sheet (number 1) (name /) (tstamps /)
      (title_block
        (title "linPOL12V Test Board")
        (company)
        (rev)
        (date)
        (source linPOL12V_TestBoard.sch)
        (comment (number 1) (value ""))
        (comment (number 2) (value ""))
        (comment (number 3) (value ""))
        (comment (number 4) (value "")))))
  (components
    (comp (ref C1)
      (value "10 p")
      (footprint digikey-footprints:0805)
      (datasheet ~)
      (libsource (lib Device) (part C) (description "Unpolarized capacitor"))
      (sheetpath (names /) (tstamps /))
      (tstamp 5B7C9A1C))
    (comp (ref C2)
      (value "22 u")
      (footprint digikey-footprints:0805)
      (datasheet ~)
      (libsource (lib Device) (part C) (description "Unpolarized capacitor"))
      (sheetpath (names /) (tstamps /))
      (tstamp 5B7C9AE7))
    (comp (ref C3)
      (value "10 u")
      (footprint digikey-footprints:0805)
      (datasheet ~)
      (libsource (lib Device) (part C) (description "Unpolarized capacitor"))
      (sheetpath (names /) (tstamps /))
      (tstamp 5B7C9B1D))
    (comp (ref C4)
      (value "10 u")
      (footprint digikey-footprints:0805)
      (datasheet ~)
      (libsource (lib Device) (part C) (description "Unpolarized capacitor"))
      (sheetpath (names /) (tstamps /))
      (tstamp 5B7C9B55))
    (comp (ref C5)
      (value "100 n")
      (footprint digikey-footprints:0805)
      (datasheet ~)
      (libsource (lib Device) (part C) (description "Unpolarized capacitor"))
      (sheetpath (names /) (tstamps /))
      (tstamp 5B7C9B87))
    (comp (ref R1)
      (value "10 k")
      (footprint digikey-footprints:0805)
      (datasheet ~)
      (libsource (lib Device) (part R) (description Resistor))
      (sheetpath (names /) (tstamps /))
      (tstamp 5B7C9C11))
    (comp (ref R8)
      (value "3 k")
      (footprint digikey-footprints:0805)
      (datasheet ~)
      (libsource (lib Device) (part R) (description Resistor))
      (sheetpath (names /) (tstamps /))
      (tstamp 5B7C9D2F))
    (comp (ref R6)
      (value "300 m")
      (footprint digikey-footprints:0805)
      (datasheet ~)
      (libsource (lib Device) (part R) (description Resistor))
      (sheetpath (names /) (tstamps /))
      (tstamp 5B7C9D81))
    (comp (ref R7)
      (value "300 m")
      (footprint digikey-footprints:0805)
      (datasheet ~)
      (libsource (lib Device) (part R) (description Resistor))
      (sheetpath (names /) (tstamps /))
      (tstamp 5B7C9DF3))
    (comp (ref C6)
      (value "4.7 u")
      (footprint digikey-footprints:0805)
      (datasheet ~)
      (libsource (lib Device) (part C) (description "Unpolarized capacitor"))
      (sheetpath (names /) (tstamps /))
      (tstamp 5B7C9E27))
    (comp (ref C7)
      (value "10 u")
      (footprint digikey-footprints:0805)
      (datasheet ~)
      (libsource (lib Device) (part C) (description "Unpolarized capacitor"))
      (sheetpath (names /) (tstamps /))
      (tstamp 5B7C9E9F))
    (comp (ref R2)
      (value R)
      (footprint digikey-footprints:0805)
      (datasheet ~)
      (libsource (lib Device) (part R) (description Resistor))
      (sheetpath (names /) (tstamps /))
      (tstamp 5B7C9F05))
    (comp (ref R3)
      (value R)
      (footprint digikey-footprints:0805)
      (datasheet ~)
      (libsource (lib Device) (part R) (description Resistor))
      (sheetpath (names /) (tstamps /))
      (tstamp 5B7C9F4F))
    (comp (ref R4)
      (value R)
      (footprint digikey-footprints:0805)
      (datasheet ~)
      (libsource (lib Device) (part R) (description Resistor))
      (sheetpath (names /) (tstamps /))
      (tstamp 5B7C9F8D))
    (comp (ref R5)
      (value R)
      (footprint digikey-footprints:0805)
      (datasheet ~)
      (libsource (lib Device) (part R) (description Resistor))
      (sheetpath (names /) (tstamps /))
      (tstamp 5B7C9FE1))
    (comp (ref L1)
      (value "12.3 n")
      (footprint pbv3:0806SQ-12N)
      (datasheet ~)
      (libsource (lib Device) (part L) (description Inductor))
      (sheetpath (names /) (tstamps /))
      (tstamp 5B7CA53F))
    (comp (ref R9)
      (value "3 k")
      (footprint digikey-footprints:0805)
      (datasheet ~)
      (libsource (lib Device) (part R) (description Resistor))
      (sheetpath (names /) (tstamps /))
      (tstamp 5B7CB48E))
    (comp (ref R10)
      (value "10 k")
      (footprint digikey-footprints:0805)
      (datasheet ~)
      (libsource (lib Device) (part R) (description Resistor))
      (sheetpath (names /) (tstamps /))
      (tstamp 5B802F65))
    (comp (ref J1)
      (value Conn_02x08_Odd_Even)
      (footprint Connector_Samtec_HLE_SMD:Samtec_HLE-116-02-xxx-DV_2x08_P2.54mm_Horizontal)
      (datasheet ~)
      (libsource (lib Connector_Generic) (part Conn_02x08_Odd_Even) (description "Generic connector, double row, 02x08, odd/even pin numbering scheme (row 1 odd numbers, row 2 even numbers), script generated (kicad-library-utils/schlib/autogen/connector/)"))
      (sheetpath (names /) (tstamps /))
      (tstamp 5B806806))
    (comp (ref U1)
      (value LINPOL12V)
      (footprint library:DFN-8_2x2mm_P0.5mm)
      (libsource (lib myLib) (part LINPOL12V) (description ""))
      (sheetpath (names /) (tstamps /))
      (tstamp 5B836EFB))
    (comp (ref MH1)
      (value MountingHole)
      (footprint library:z_MountPTH_5mm)
      (datasheet ~)
      (libsource (lib Mechanical) (part MountingHole) (description "Mounting Hole without connection"))
      (sheetpath (names /) (tstamps /))
      (tstamp 5B83FBAB))
    (comp (ref MH2)
      (value MountingHole)
      (footprint library:z_MountPTH_5mm)
      (datasheet ~)
      (libsource (lib Mechanical) (part MountingHole) (description "Mounting Hole without connection"))
      (sheetpath (names /) (tstamps /))
      (tstamp 5B83FD13)))
  (libparts
    (libpart (lib Connector_Generic) (part Conn_02x08_Odd_Even)
      (description "Generic connector, double row, 02x08, odd/even pin numbering scheme (row 1 odd numbers, row 2 even numbers), script generated (kicad-library-utils/schlib/autogen/connector/)")
      (docs ~)
      (footprints
        (fp Connector*:*_2x??_*))
      (fields
        (field (name Reference) J)
        (field (name Value) Conn_02x08_Odd_Even))
      (pins
        (pin (num 1) (name Pin_1) (type passive))
        (pin (num 2) (name Pin_2) (type passive))
        (pin (num 3) (name Pin_3) (type passive))
        (pin (num 4) (name Pin_4) (type passive))
        (pin (num 5) (name Pin_5) (type passive))
        (pin (num 6) (name Pin_6) (type passive))
        (pin (num 7) (name Pin_7) (type passive))
        (pin (num 8) (name Pin_8) (type passive))
        (pin (num 9) (name Pin_9) (type passive))
        (pin (num 10) (name Pin_10) (type passive))
        (pin (num 11) (name Pin_11) (type passive))
        (pin (num 12) (name Pin_12) (type passive))
        (pin (num 13) (name Pin_13) (type passive))
        (pin (num 14) (name Pin_14) (type passive))
        (pin (num 15) (name Pin_15) (type passive))
        (pin (num 16) (name Pin_16) (type passive))))
    (libpart (lib Device) (part C)
      (description "Unpolarized capacitor")
      (docs ~)
      (footprints
        (fp C_*))
      (fields
        (field (name Reference) C)
        (field (name Value) C))
      (pins
        (pin (num 1) (name ~) (type passive))
        (pin (num 2) (name ~) (type passive))))
    (libpart (lib Device) (part L)
      (description Inductor)
      (docs ~)
      (footprints
        (fp Choke_*)
        (fp *Coil*)
        (fp Inductor_*)
        (fp L_*))
      (fields
        (field (name Reference) L)
        (field (name Value) L))
      (pins
        (pin (num 1) (name 1) (type passive))
        (pin (num 2) (name 2) (type passive))))
    (libpart (lib Device) (part R)
      (description Resistor)
      (docs ~)
      (footprints
        (fp R_*))
      (fields
        (field (name Reference) R)
        (field (name Value) R))
      (pins
        (pin (num 1) (name ~) (type passive))
        (pin (num 2) (name ~) (type passive))))
    (libpart (lib Mechanical) (part MountingHole)
      (description "Mounting Hole without connection")
      (docs ~)
      (footprints
        (fp MountingHole*))
      (fields
        (field (name Reference) MH)
        (field (name Value) MountingHole)))
    (libpart (lib myLib) (part LINPOL12V)
      (fields
        (field (name Reference) U)
        (field (name Value) LINPOL12V))
      (pins
        (pin (num 1) (name VIN) (type input))
        (pin (num 2) (name EN1V4) (type input))
        (pin (num 3) (name EN3V3) (type input))
        (pin (num 4) (name FB1V4) (type output))
        (pin (num 5) (name FB3V3) (type output))
        (pin (num 6) (name GND) (type passive))
        (pin (num 7) (name 3V3) (type output))
        (pin (num 8) (name 1V4) (type output))
        (pin (num 9) (name Thermal) (type passive)))))
  (libraries
    (library (logical Connector_Generic)
      (uri /usr/share/kicad/library/Connector_Generic.lib))
    (library (logical Device)
      (uri /usr/share/kicad/library/Device.lib))
    (library (logical Mechanical)
      (uri /usr/share/kicad/library/Mechanical.lib))
    (library (logical myLib)
      (uri /home/maia/linPOL12V_TestBoard/library/myLib.lib)))
  (nets
    (net (code 1) (name GND)
      (node (ref R9) (pin 2))
      (node (ref R8) (pin 2))
      (node (ref C1) (pin 2))
      (node (ref J1) (pin 8))
      (node (ref J1) (pin 6))
      (node (ref J1) (pin 4))
      (node (ref J1) (pin 3))
      (node (ref J1) (pin 2))
      (node (ref C2) (pin 2))
      (node (ref R5) (pin 2))
      (node (ref U1) (pin 9))
      (node (ref U1) (pin 6))
      (node (ref J1) (pin 10))
      (node (ref R3) (pin 2))
      (node (ref R10) (pin 2))
      (node (ref J1) (pin 12))
      (node (ref C3) (pin 2))
      (node (ref C4) (pin 2))
      (node (ref C5) (pin 2))
      (node (ref J1) (pin 16))
      (node (ref R1) (pin 2))
      (node (ref C6) (pin 2))
      (node (ref C7) (pin 2))
      (node (ref J1) (pin 14)))
    (net (code 2) (name /EN3V3)
      (node (ref R10) (pin 1))
      (node (ref U1) (pin 3))
      (node (ref J1) (pin 7)))
    (net (code 3) (name /EN1V4)
      (node (ref R1) (pin 1))
      (node (ref U1) (pin 2))
      (node (ref J1) (pin 5)))
    (net (code 4) (name /VOUT3V3)
      (node (ref R7) (pin 1))
      (node (ref J1) (pin 15))
      (node (ref R4) (pin 2))
      (node (ref R9) (pin 1))
      (node (ref U1) (pin 7))
      (node (ref R5) (pin 1)))
    (net (code 5) (name /VIN)
      (node (ref J1) (pin 1))
      (node (ref C1) (pin 1))
      (node (ref C2) (pin 1))
      (node (ref L1) (pin 1)))
    (net (code 6) (name "Net-(C3-Pad1)")
      (node (ref L1) (pin 2))
      (node (ref U1) (pin 1))
      (node (ref C4) (pin 1))
      (node (ref C3) (pin 1))
      (node (ref C5) (pin 1)))
    (net (code 7) (name /FB3V3)
      (node (ref U1) (pin 5))
      (node (ref R4) (pin 1))
      (node (ref J1) (pin 13)))
    (net (code 8) (name "Net-(C6-Pad1)")
      (node (ref C6) (pin 1))
      (node (ref R6) (pin 2)))
    (net (code 9) (name "Net-(C7-Pad1)")
      (node (ref C7) (pin 1))
      (node (ref R7) (pin 2)))
    (net (code 10) (name /FB1V4)
      (node (ref U1) (pin 4))
      (node (ref R2) (pin 1))
      (node (ref J1) (pin 9)))
    (net (code 11) (name /VOUT1V4)
      (node (ref J1) (pin 11))
      (node (ref U1) (pin 8))
      (node (ref R8) (pin 1))
      (node (ref R6) (pin 1))
      (node (ref R2) (pin 2))
      (node (ref R3) (pin 1)))))