G04 #@! TF.GenerationSoftware,KiCad,Pcbnew,5.0.0-fee4fd1~66~ubuntu16.04.1*
G04 #@! TF.CreationDate,2018-08-28T11:28:21-07:00*
G04 #@! TF.ProjectId,linPOL12V_TestBoard,6C696E504F4C3132565F54657374426F,rev?*
G04 #@! TF.SameCoordinates,Original*
G04 #@! TF.FileFunction,Legend,Top*
G04 #@! TF.FilePolarity,Positive*
%FSLAX46Y46*%
G04 Gerber Fmt 4.6, Leading zero omitted, Abs format (unit mm)*
G04 Created by KiCad (PCBNEW 5.0.0-fee4fd1~66~ubuntu16.04.1) date Tue Aug 28 11:28:21 2018*
%MOMM*%
%LPD*%
G01*
G04 APERTURE LIST*
%ADD10C,0.254000*%
%ADD11C,0.200000*%
%ADD12C,0.120000*%
%ADD13C,0.150000*%
%ADD14C,0.010000*%
G04 APERTURE END LIST*
D10*
X135025674Y-96792566D02*
X134360436Y-96792566D01*
X134360436Y-95395566D01*
X135491340Y-96792566D02*
X135491340Y-95861232D01*
X135491340Y-95395566D02*
X135424817Y-95462090D01*
X135491340Y-95528613D01*
X135557864Y-95462090D01*
X135491340Y-95395566D01*
X135491340Y-95528613D01*
X136156579Y-95861232D02*
X136156579Y-96792566D01*
X136156579Y-95994280D02*
X136223102Y-95927756D01*
X136356150Y-95861232D01*
X136555721Y-95861232D01*
X136688769Y-95927756D01*
X136755293Y-96060804D01*
X136755293Y-96792566D01*
X137420531Y-96792566D02*
X137420531Y-95395566D01*
X137952721Y-95395566D01*
X138085769Y-95462090D01*
X138152293Y-95528613D01*
X138218817Y-95661661D01*
X138218817Y-95861232D01*
X138152293Y-95994280D01*
X138085769Y-96060804D01*
X137952721Y-96127328D01*
X137420531Y-96127328D01*
X139083626Y-95395566D02*
X139349721Y-95395566D01*
X139482769Y-95462090D01*
X139615817Y-95595137D01*
X139682340Y-95861232D01*
X139682340Y-96326899D01*
X139615817Y-96592994D01*
X139482769Y-96726042D01*
X139349721Y-96792566D01*
X139083626Y-96792566D01*
X138950579Y-96726042D01*
X138817531Y-96592994D01*
X138751007Y-96326899D01*
X138751007Y-95861232D01*
X138817531Y-95595137D01*
X138950579Y-95462090D01*
X139083626Y-95395566D01*
X140946293Y-96792566D02*
X140281055Y-96792566D01*
X140281055Y-95395566D01*
X141212388Y-95395566D02*
X141678055Y-96792566D01*
X142143721Y-95395566D01*
X143341150Y-96792566D02*
X142542864Y-96792566D01*
X142942007Y-96792566D02*
X142942007Y-95395566D01*
X142808960Y-95595137D01*
X142675912Y-95728185D01*
X142542864Y-95794709D01*
X143873340Y-95528613D02*
X143939864Y-95462090D01*
X144072912Y-95395566D01*
X144405531Y-95395566D01*
X144538579Y-95462090D01*
X144605102Y-95528613D01*
X144671626Y-95661661D01*
X144671626Y-95794709D01*
X144605102Y-95994280D01*
X143806817Y-96792566D01*
X144671626Y-96792566D01*
X134493483Y-97745066D02*
X135291769Y-97745066D01*
X134892626Y-99142066D02*
X134892626Y-97745066D01*
X136289626Y-99075542D02*
X136156579Y-99142066D01*
X135890483Y-99142066D01*
X135757436Y-99075542D01*
X135690912Y-98942494D01*
X135690912Y-98410304D01*
X135757436Y-98277256D01*
X135890483Y-98210732D01*
X136156579Y-98210732D01*
X136289626Y-98277256D01*
X136356150Y-98410304D01*
X136356150Y-98543351D01*
X135690912Y-98676399D01*
X136888340Y-99075542D02*
X137021388Y-99142066D01*
X137287483Y-99142066D01*
X137420531Y-99075542D01*
X137487055Y-98942494D01*
X137487055Y-98875970D01*
X137420531Y-98742923D01*
X137287483Y-98676399D01*
X137087912Y-98676399D01*
X136954864Y-98609875D01*
X136888340Y-98476828D01*
X136888340Y-98410304D01*
X136954864Y-98277256D01*
X137087912Y-98210732D01*
X137287483Y-98210732D01*
X137420531Y-98277256D01*
X137886198Y-98210732D02*
X138418388Y-98210732D01*
X138085769Y-97745066D02*
X138085769Y-98942494D01*
X138152293Y-99075542D01*
X138285340Y-99142066D01*
X138418388Y-99142066D01*
X140414102Y-98410304D02*
X140613674Y-98476828D01*
X140680198Y-98543351D01*
X140746721Y-98676399D01*
X140746721Y-98875970D01*
X140680198Y-99009018D01*
X140613674Y-99075542D01*
X140480626Y-99142066D01*
X139948436Y-99142066D01*
X139948436Y-97745066D01*
X140414102Y-97745066D01*
X140547150Y-97811590D01*
X140613674Y-97878113D01*
X140680198Y-98011161D01*
X140680198Y-98144209D01*
X140613674Y-98277256D01*
X140547150Y-98343780D01*
X140414102Y-98410304D01*
X139948436Y-98410304D01*
X141545007Y-99142066D02*
X141411960Y-99075542D01*
X141345436Y-99009018D01*
X141278912Y-98875970D01*
X141278912Y-98476828D01*
X141345436Y-98343780D01*
X141411960Y-98277256D01*
X141545007Y-98210732D01*
X141744579Y-98210732D01*
X141877626Y-98277256D01*
X141944150Y-98343780D01*
X142010674Y-98476828D01*
X142010674Y-98875970D01*
X141944150Y-99009018D01*
X141877626Y-99075542D01*
X141744579Y-99142066D01*
X141545007Y-99142066D01*
X143208102Y-99142066D02*
X143208102Y-98410304D01*
X143141579Y-98277256D01*
X143008531Y-98210732D01*
X142742436Y-98210732D01*
X142609388Y-98277256D01*
X143208102Y-99075542D02*
X143075055Y-99142066D01*
X142742436Y-99142066D01*
X142609388Y-99075542D01*
X142542864Y-98942494D01*
X142542864Y-98809447D01*
X142609388Y-98676399D01*
X142742436Y-98609875D01*
X143075055Y-98609875D01*
X143208102Y-98543351D01*
X143873340Y-99142066D02*
X143873340Y-98210732D01*
X143873340Y-98476828D02*
X143939864Y-98343780D01*
X144006388Y-98277256D01*
X144139436Y-98210732D01*
X144272483Y-98210732D01*
X145336864Y-99142066D02*
X145336864Y-97745066D01*
X145336864Y-99075542D02*
X145203817Y-99142066D01*
X144937721Y-99142066D01*
X144804674Y-99075542D01*
X144738150Y-99009018D01*
X144671626Y-98875970D01*
X144671626Y-98476828D01*
X144738150Y-98343780D01*
X144804674Y-98277256D01*
X144937721Y-98210732D01*
X145203817Y-98210732D01*
X145336864Y-98277256D01*
X133029960Y-101491566D02*
X133029960Y-100094566D01*
X133495626Y-101092423D01*
X133961293Y-100094566D01*
X133961293Y-101491566D01*
X135225245Y-101491566D02*
X135225245Y-100759804D01*
X135158721Y-100626756D01*
X135025674Y-100560232D01*
X134759579Y-100560232D01*
X134626531Y-100626756D01*
X135225245Y-101425042D02*
X135092198Y-101491566D01*
X134759579Y-101491566D01*
X134626531Y-101425042D01*
X134560007Y-101291994D01*
X134560007Y-101158947D01*
X134626531Y-101025899D01*
X134759579Y-100959375D01*
X135092198Y-100959375D01*
X135225245Y-100892851D01*
X135890483Y-101491566D02*
X135890483Y-100560232D01*
X135890483Y-100094566D02*
X135823960Y-100161090D01*
X135890483Y-100227613D01*
X135957007Y-100161090D01*
X135890483Y-100094566D01*
X135890483Y-100227613D01*
X137154436Y-101491566D02*
X137154436Y-100759804D01*
X137087912Y-100626756D01*
X136954864Y-100560232D01*
X136688769Y-100560232D01*
X136555721Y-100626756D01*
X137154436Y-101425042D02*
X137021388Y-101491566D01*
X136688769Y-101491566D01*
X136555721Y-101425042D01*
X136489198Y-101291994D01*
X136489198Y-101158947D01*
X136555721Y-101025899D01*
X136688769Y-100959375D01*
X137021388Y-100959375D01*
X137154436Y-100892851D01*
X138884055Y-101491566D02*
X138884055Y-100094566D01*
X139416245Y-100094566D01*
X139549293Y-100161090D01*
X139615817Y-100227613D01*
X139682340Y-100360661D01*
X139682340Y-100560232D01*
X139615817Y-100693280D01*
X139549293Y-100759804D01*
X139416245Y-100826328D01*
X138884055Y-100826328D01*
X140879769Y-101491566D02*
X140879769Y-100759804D01*
X140813245Y-100626756D01*
X140680198Y-100560232D01*
X140414102Y-100560232D01*
X140281055Y-100626756D01*
X140879769Y-101425042D02*
X140746721Y-101491566D01*
X140414102Y-101491566D01*
X140281055Y-101425042D01*
X140214531Y-101291994D01*
X140214531Y-101158947D01*
X140281055Y-101025899D01*
X140414102Y-100959375D01*
X140746721Y-100959375D01*
X140879769Y-100892851D01*
X142143721Y-101491566D02*
X142143721Y-100094566D01*
X142143721Y-101425042D02*
X142010674Y-101491566D01*
X141744579Y-101491566D01*
X141611531Y-101425042D01*
X141545007Y-101358518D01*
X141478483Y-101225470D01*
X141478483Y-100826328D01*
X141545007Y-100693280D01*
X141611531Y-100626756D01*
X141744579Y-100560232D01*
X142010674Y-100560232D01*
X142143721Y-100626756D01*
X143407674Y-101491566D02*
X143407674Y-100094566D01*
X143407674Y-101425042D02*
X143274626Y-101491566D01*
X143008531Y-101491566D01*
X142875483Y-101425042D01*
X142808960Y-101358518D01*
X142742436Y-101225470D01*
X142742436Y-100826328D01*
X142808960Y-100693280D01*
X142875483Y-100626756D01*
X143008531Y-100560232D01*
X143274626Y-100560232D01*
X143407674Y-100626756D01*
X144272483Y-101491566D02*
X144139436Y-101425042D01*
X144072912Y-101358518D01*
X144006388Y-101225470D01*
X144006388Y-100826328D01*
X144072912Y-100693280D01*
X144139436Y-100626756D01*
X144272483Y-100560232D01*
X144472055Y-100560232D01*
X144605102Y-100626756D01*
X144671626Y-100693280D01*
X144738150Y-100826328D01*
X144738150Y-101225470D01*
X144671626Y-101358518D01*
X144605102Y-101425042D01*
X144472055Y-101491566D01*
X144272483Y-101491566D01*
X145935579Y-101425042D02*
X145802531Y-101491566D01*
X145536436Y-101491566D01*
X145403388Y-101425042D01*
X145336864Y-101358518D01*
X145270340Y-101225470D01*
X145270340Y-100826328D01*
X145336864Y-100693280D01*
X145403388Y-100626756D01*
X145536436Y-100560232D01*
X145802531Y-100560232D01*
X145935579Y-100626756D01*
X146534293Y-101491566D02*
X146534293Y-100094566D01*
X146667340Y-100959375D02*
X147066483Y-101491566D01*
X147066483Y-100560232D02*
X146534293Y-101092423D01*
X133628674Y-103441923D02*
X134293912Y-103441923D01*
X133495626Y-103841066D02*
X133961293Y-102444066D01*
X134426960Y-103841066D01*
X135491340Y-102909732D02*
X135491340Y-103841066D01*
X134892626Y-102909732D02*
X134892626Y-103641494D01*
X134959150Y-103774542D01*
X135092198Y-103841066D01*
X135291769Y-103841066D01*
X135424817Y-103774542D01*
X135491340Y-103708018D01*
X136755293Y-102909732D02*
X136755293Y-104040637D01*
X136688769Y-104173685D01*
X136622245Y-104240209D01*
X136489198Y-104306732D01*
X136289626Y-104306732D01*
X136156579Y-104240209D01*
X136755293Y-103774542D02*
X136622245Y-103841066D01*
X136356150Y-103841066D01*
X136223102Y-103774542D01*
X136156579Y-103708018D01*
X136090055Y-103574970D01*
X136090055Y-103175828D01*
X136156579Y-103042780D01*
X136223102Y-102976256D01*
X136356150Y-102909732D01*
X136622245Y-102909732D01*
X136755293Y-102976256D01*
X138019245Y-102909732D02*
X138019245Y-103841066D01*
X137420531Y-102909732D02*
X137420531Y-103641494D01*
X137487055Y-103774542D01*
X137620102Y-103841066D01*
X137819674Y-103841066D01*
X137952721Y-103774542D01*
X138019245Y-103708018D01*
X138617960Y-103774542D02*
X138751007Y-103841066D01*
X139017102Y-103841066D01*
X139150150Y-103774542D01*
X139216674Y-103641494D01*
X139216674Y-103574970D01*
X139150150Y-103441923D01*
X139017102Y-103375399D01*
X138817531Y-103375399D01*
X138684483Y-103308875D01*
X138617960Y-103175828D01*
X138617960Y-103109304D01*
X138684483Y-102976256D01*
X138817531Y-102909732D01*
X139017102Y-102909732D01*
X139150150Y-102976256D01*
X139615817Y-102909732D02*
X140148007Y-102909732D01*
X139815388Y-102444066D02*
X139815388Y-103641494D01*
X139881912Y-103774542D01*
X140014960Y-103841066D01*
X140148007Y-103841066D01*
X141611531Y-102577113D02*
X141678055Y-102510590D01*
X141811102Y-102444066D01*
X142143721Y-102444066D01*
X142276769Y-102510590D01*
X142343293Y-102577113D01*
X142409817Y-102710161D01*
X142409817Y-102843209D01*
X142343293Y-103042780D01*
X141545007Y-103841066D01*
X142409817Y-103841066D01*
X143274626Y-102444066D02*
X143407674Y-102444066D01*
X143540721Y-102510590D01*
X143607245Y-102577113D01*
X143673769Y-102710161D01*
X143740293Y-102976256D01*
X143740293Y-103308875D01*
X143673769Y-103574970D01*
X143607245Y-103708018D01*
X143540721Y-103774542D01*
X143407674Y-103841066D01*
X143274626Y-103841066D01*
X143141579Y-103774542D01*
X143075055Y-103708018D01*
X143008531Y-103574970D01*
X142942007Y-103308875D01*
X142942007Y-102976256D01*
X143008531Y-102710161D01*
X143075055Y-102577113D01*
X143141579Y-102510590D01*
X143274626Y-102444066D01*
X145070769Y-103841066D02*
X144272483Y-103841066D01*
X144671626Y-103841066D02*
X144671626Y-102444066D01*
X144538579Y-102643637D01*
X144405531Y-102776685D01*
X144272483Y-102843209D01*
X145869055Y-103042780D02*
X145736007Y-102976256D01*
X145669483Y-102909732D01*
X145602960Y-102776685D01*
X145602960Y-102710161D01*
X145669483Y-102577113D01*
X145736007Y-102510590D01*
X145869055Y-102444066D01*
X146135150Y-102444066D01*
X146268198Y-102510590D01*
X146334721Y-102577113D01*
X146401245Y-102710161D01*
X146401245Y-102776685D01*
X146334721Y-102909732D01*
X146268198Y-102976256D01*
X146135150Y-103042780D01*
X145869055Y-103042780D01*
X145736007Y-103109304D01*
X145669483Y-103175828D01*
X145602960Y-103308875D01*
X145602960Y-103574970D01*
X145669483Y-103708018D01*
X145736007Y-103774542D01*
X145869055Y-103841066D01*
X146135150Y-103841066D01*
X146268198Y-103774542D01*
X146334721Y-103708018D01*
X146401245Y-103574970D01*
X146401245Y-103308875D01*
X146334721Y-103175828D01*
X146268198Y-103109304D01*
X146135150Y-103042780D01*
D11*
X105410000Y-92964000D02*
X105410000Y-95758000D01*
X148590000Y-92964000D02*
X105410000Y-92964000D01*
X148590000Y-95504000D02*
X148590000Y-92964000D01*
X105410000Y-156210000D02*
X105410000Y-95504000D01*
X148590000Y-156210000D02*
X148590000Y-95504000D01*
X105410000Y-156210000D02*
X148590000Y-156210000D01*
D10*
X135587619Y-136289142D02*
X136603619Y-135950476D01*
X135587619Y-135611809D01*
X135587619Y-135079619D02*
X135587619Y-134886095D01*
X135636000Y-134789333D01*
X135732761Y-134692571D01*
X135926285Y-134644190D01*
X136264952Y-134644190D01*
X136458476Y-134692571D01*
X136555238Y-134789333D01*
X136603619Y-134886095D01*
X136603619Y-135079619D01*
X136555238Y-135176380D01*
X136458476Y-135273142D01*
X136264952Y-135321523D01*
X135926285Y-135321523D01*
X135732761Y-135273142D01*
X135636000Y-135176380D01*
X135587619Y-135079619D01*
X135587619Y-134208761D02*
X136410095Y-134208761D01*
X136506857Y-134160380D01*
X136555238Y-134112000D01*
X136603619Y-134015238D01*
X136603619Y-133821714D01*
X136555238Y-133724952D01*
X136506857Y-133676571D01*
X136410095Y-133628190D01*
X135587619Y-133628190D01*
X135587619Y-133289523D02*
X135587619Y-132708952D01*
X136603619Y-132999238D02*
X135587619Y-132999238D01*
X135587619Y-132467047D02*
X135587619Y-131838095D01*
X135974666Y-132176761D01*
X135974666Y-132031619D01*
X136023047Y-131934857D01*
X136071428Y-131886476D01*
X136168190Y-131838095D01*
X136410095Y-131838095D01*
X136506857Y-131886476D01*
X136555238Y-131934857D01*
X136603619Y-132031619D01*
X136603619Y-132321904D01*
X136555238Y-132418666D01*
X136506857Y-132467047D01*
X135587619Y-131547809D02*
X136603619Y-131209142D01*
X135587619Y-130870476D01*
X135587619Y-130628571D02*
X135587619Y-129999619D01*
X135974666Y-130338285D01*
X135974666Y-130193142D01*
X136023047Y-130096380D01*
X136071428Y-130048000D01*
X136168190Y-129999619D01*
X136410095Y-129999619D01*
X136506857Y-130048000D01*
X136555238Y-130096380D01*
X136603619Y-130193142D01*
X136603619Y-130483428D01*
X136555238Y-130580190D01*
X136506857Y-130628571D01*
X133277428Y-135877904D02*
X133277428Y-136216571D01*
X133809619Y-136216571D02*
X132793619Y-136216571D01*
X132793619Y-135732761D01*
X133277428Y-135007047D02*
X133325809Y-134861904D01*
X133374190Y-134813523D01*
X133470952Y-134765142D01*
X133616095Y-134765142D01*
X133712857Y-134813523D01*
X133761238Y-134861904D01*
X133809619Y-134958666D01*
X133809619Y-135345714D01*
X132793619Y-135345714D01*
X132793619Y-135007047D01*
X132842000Y-134910285D01*
X132890380Y-134861904D01*
X132987142Y-134813523D01*
X133083904Y-134813523D01*
X133180666Y-134861904D01*
X133229047Y-134910285D01*
X133277428Y-135007047D01*
X133277428Y-135345714D01*
X132793619Y-134426476D02*
X132793619Y-133797523D01*
X133180666Y-134136190D01*
X133180666Y-133991047D01*
X133229047Y-133894285D01*
X133277428Y-133845904D01*
X133374190Y-133797523D01*
X133616095Y-133797523D01*
X133712857Y-133845904D01*
X133761238Y-133894285D01*
X133809619Y-133991047D01*
X133809619Y-134281333D01*
X133761238Y-134378095D01*
X133712857Y-134426476D01*
X132793619Y-133507238D02*
X133809619Y-133168571D01*
X132793619Y-132829904D01*
X132793619Y-132588000D02*
X132793619Y-131959047D01*
X133180666Y-132297714D01*
X133180666Y-132152571D01*
X133229047Y-132055809D01*
X133277428Y-132007428D01*
X133374190Y-131959047D01*
X133616095Y-131959047D01*
X133712857Y-132007428D01*
X133761238Y-132055809D01*
X133809619Y-132152571D01*
X133809619Y-132442857D01*
X133761238Y-132539619D01*
X133712857Y-132588000D01*
X130253619Y-136289142D02*
X131269619Y-135950476D01*
X130253619Y-135611809D01*
X130253619Y-135079619D02*
X130253619Y-134886095D01*
X130302000Y-134789333D01*
X130398761Y-134692571D01*
X130592285Y-134644190D01*
X130930952Y-134644190D01*
X131124476Y-134692571D01*
X131221238Y-134789333D01*
X131269619Y-134886095D01*
X131269619Y-135079619D01*
X131221238Y-135176380D01*
X131124476Y-135273142D01*
X130930952Y-135321523D01*
X130592285Y-135321523D01*
X130398761Y-135273142D01*
X130302000Y-135176380D01*
X130253619Y-135079619D01*
X130253619Y-134208761D02*
X131076095Y-134208761D01*
X131172857Y-134160380D01*
X131221238Y-134112000D01*
X131269619Y-134015238D01*
X131269619Y-133821714D01*
X131221238Y-133724952D01*
X131172857Y-133676571D01*
X131076095Y-133628190D01*
X130253619Y-133628190D01*
X130253619Y-133289523D02*
X130253619Y-132708952D01*
X131269619Y-132999238D02*
X130253619Y-132999238D01*
X131269619Y-131838095D02*
X131269619Y-132418666D01*
X131269619Y-132128380D02*
X130253619Y-132128380D01*
X130398761Y-132225142D01*
X130495523Y-132321904D01*
X130543904Y-132418666D01*
X130253619Y-131547809D02*
X131269619Y-131209142D01*
X130253619Y-130870476D01*
X130592285Y-130096380D02*
X131269619Y-130096380D01*
X130205238Y-130338285D02*
X130930952Y-130580190D01*
X130930952Y-129951238D01*
X128197428Y-135877904D02*
X128197428Y-136216571D01*
X128729619Y-136216571D02*
X127713619Y-136216571D01*
X127713619Y-135732761D01*
X128197428Y-135007047D02*
X128245809Y-134861904D01*
X128294190Y-134813523D01*
X128390952Y-134765142D01*
X128536095Y-134765142D01*
X128632857Y-134813523D01*
X128681238Y-134861904D01*
X128729619Y-134958666D01*
X128729619Y-135345714D01*
X127713619Y-135345714D01*
X127713619Y-135007047D01*
X127762000Y-134910285D01*
X127810380Y-134861904D01*
X127907142Y-134813523D01*
X128003904Y-134813523D01*
X128100666Y-134861904D01*
X128149047Y-134910285D01*
X128197428Y-135007047D01*
X128197428Y-135345714D01*
X128729619Y-133797523D02*
X128729619Y-134378095D01*
X128729619Y-134087809D02*
X127713619Y-134087809D01*
X127858761Y-134184571D01*
X127955523Y-134281333D01*
X128003904Y-134378095D01*
X127713619Y-133507238D02*
X128729619Y-133168571D01*
X127713619Y-132829904D01*
X128052285Y-132055809D02*
X128729619Y-132055809D01*
X127665238Y-132297714D02*
X128390952Y-132539619D01*
X128390952Y-131910666D01*
X125657428Y-136264952D02*
X125657428Y-135926285D01*
X126189619Y-135781142D02*
X126189619Y-136264952D01*
X125173619Y-136264952D01*
X125173619Y-135781142D01*
X126189619Y-135345714D02*
X125173619Y-135345714D01*
X126189619Y-134765142D01*
X125173619Y-134765142D01*
X125173619Y-134378095D02*
X125173619Y-133749142D01*
X125560666Y-134087809D01*
X125560666Y-133942666D01*
X125609047Y-133845904D01*
X125657428Y-133797523D01*
X125754190Y-133749142D01*
X125996095Y-133749142D01*
X126092857Y-133797523D01*
X126141238Y-133845904D01*
X126189619Y-133942666D01*
X126189619Y-134232952D01*
X126141238Y-134329714D01*
X126092857Y-134378095D01*
X125173619Y-133458857D02*
X126189619Y-133120190D01*
X125173619Y-132781523D01*
X125173619Y-132539619D02*
X125173619Y-131910666D01*
X125560666Y-132249333D01*
X125560666Y-132104190D01*
X125609047Y-132007428D01*
X125657428Y-131959047D01*
X125754190Y-131910666D01*
X125996095Y-131910666D01*
X126092857Y-131959047D01*
X126141238Y-132007428D01*
X126189619Y-132104190D01*
X126189619Y-132394476D01*
X126141238Y-132491238D01*
X126092857Y-132539619D01*
X123117428Y-136264952D02*
X123117428Y-135926285D01*
X123649619Y-135781142D02*
X123649619Y-136264952D01*
X122633619Y-136264952D01*
X122633619Y-135781142D01*
X123649619Y-135345714D02*
X122633619Y-135345714D01*
X123649619Y-134765142D01*
X122633619Y-134765142D01*
X123649619Y-133749142D02*
X123649619Y-134329714D01*
X123649619Y-134039428D02*
X122633619Y-134039428D01*
X122778761Y-134136190D01*
X122875523Y-134232952D01*
X122923904Y-134329714D01*
X122633619Y-133458857D02*
X123649619Y-133120190D01*
X122633619Y-132781523D01*
X122972285Y-132007428D02*
X123649619Y-132007428D01*
X122585238Y-132249333D02*
X123310952Y-132491238D01*
X123310952Y-131862285D01*
X120347619Y-136277047D02*
X121363619Y-135938380D01*
X120347619Y-135599714D01*
X121363619Y-135261047D02*
X120347619Y-135261047D01*
X121363619Y-134777238D02*
X120347619Y-134777238D01*
X121363619Y-134196666D01*
X120347619Y-134196666D01*
X121460380Y-133954761D02*
X121460380Y-133180666D01*
X121363619Y-132358190D02*
X120879809Y-132696857D01*
X121363619Y-132938761D02*
X120347619Y-132938761D01*
X120347619Y-132551714D01*
X120396000Y-132454952D01*
X120444380Y-132406571D01*
X120541142Y-132358190D01*
X120686285Y-132358190D01*
X120783047Y-132406571D01*
X120831428Y-132454952D01*
X120879809Y-132551714D01*
X120879809Y-132938761D01*
X120347619Y-132067904D02*
X120347619Y-131487333D01*
X121363619Y-131777619D02*
X120347619Y-131777619D01*
X121363619Y-131148666D02*
X120347619Y-131148666D01*
X121363619Y-130568095D01*
X120347619Y-130568095D01*
X117807619Y-136240761D02*
X118823619Y-135902095D01*
X117807619Y-135563428D01*
X118823619Y-135224761D02*
X117807619Y-135224761D01*
X118823619Y-134740952D02*
X117807619Y-134740952D01*
X118823619Y-134160380D01*
X117807619Y-134160380D01*
D12*
G04 #@! TO.C,C7*
X143498000Y-123660000D02*
X144098000Y-123660000D01*
X143478000Y-125260000D02*
X144078000Y-125260000D01*
G04 #@! TO.C,R5*
X139180000Y-132550000D02*
X139780000Y-132550000D01*
X139160000Y-134150000D02*
X139760000Y-134150000D01*
G04 #@! TO.C,R9*
X139296433Y-128030247D02*
X139896433Y-128030247D01*
X139276433Y-129630247D02*
X139876433Y-129630247D01*
G04 #@! TO.C,R7*
X139146000Y-119054000D02*
X139746000Y-119054000D01*
X139126000Y-120654000D02*
X139726000Y-120654000D01*
G04 #@! TO.C,R6*
X128232000Y-122142000D02*
X128232000Y-122742000D01*
X129832000Y-122162000D02*
X129832000Y-122762000D01*
G04 #@! TO.C,R10*
X121258000Y-115786000D02*
X120658000Y-115786000D01*
X121238000Y-117386000D02*
X120638000Y-117386000D01*
G04 #@! TO.C,C1*
X110458000Y-133388000D02*
X111058000Y-133388000D01*
X110478000Y-131788000D02*
X111078000Y-131788000D01*
G04 #@! TO.C,C2*
X110458000Y-129324000D02*
X111058000Y-129324000D01*
X110478000Y-127724000D02*
X111078000Y-127724000D01*
G04 #@! TO.C,C3*
X110732000Y-112992000D02*
X111332000Y-112992000D01*
X110712000Y-114592000D02*
X111312000Y-114592000D01*
G04 #@! TO.C,C4*
X110712000Y-119672000D02*
X111312000Y-119672000D01*
X110732000Y-118072000D02*
X111332000Y-118072000D01*
G04 #@! TO.C,C5*
X110732000Y-108420000D02*
X111332000Y-108420000D01*
X110712000Y-110020000D02*
X111312000Y-110020000D01*
G04 #@! TO.C,C6*
X128232000Y-127442000D02*
X128232000Y-128042000D01*
X129832000Y-127462000D02*
X129832000Y-128062000D01*
G04 #@! TO.C,R1*
X116906000Y-111468000D02*
X116306000Y-111468000D01*
X116886000Y-113068000D02*
X116286000Y-113068000D01*
G04 #@! TO.C,R2*
X125122000Y-114592000D02*
X125722000Y-114592000D01*
X125142000Y-112992000D02*
X125742000Y-112992000D01*
G04 #@! TO.C,R3*
X129823099Y-115630584D02*
X130423099Y-115630584D01*
X129803099Y-117230584D02*
X130403099Y-117230584D01*
G04 #@! TO.C,R4*
X133758000Y-114592000D02*
X134358000Y-114592000D01*
X133778000Y-112992000D02*
X134378000Y-112992000D01*
G04 #@! TO.C,R8*
X132576000Y-127978000D02*
X133176000Y-127978000D01*
X132556000Y-129578000D02*
X133156000Y-129578000D01*
G04 #@! TO.C,J1*
X117215000Y-137808000D02*
X117215000Y-138828000D01*
X117215000Y-138828000D02*
X116730000Y-138828000D01*
X116730000Y-138828000D02*
X116730000Y-144128000D01*
X116730000Y-144128000D02*
X117215000Y-144128000D01*
X136785000Y-138828000D02*
X137270000Y-138828000D01*
X137270000Y-138828000D02*
X137270000Y-144128000D01*
X137270000Y-144128000D02*
X136785000Y-144128000D01*
X119005000Y-138828000D02*
X119755000Y-138828000D01*
X119005000Y-144128000D02*
X119755000Y-144128000D01*
X121545000Y-138828000D02*
X122295000Y-138828000D01*
X121545000Y-144128000D02*
X122295000Y-144128000D01*
X124085000Y-138828000D02*
X124835000Y-138828000D01*
X124085000Y-144128000D02*
X124835000Y-144128000D01*
X126625000Y-138828000D02*
X127375000Y-138828000D01*
X126625000Y-144128000D02*
X127375000Y-144128000D01*
X129165000Y-138828000D02*
X129915000Y-138828000D01*
X129165000Y-144128000D02*
X129915000Y-144128000D01*
X131705000Y-138828000D02*
X132455000Y-138828000D01*
X131705000Y-144128000D02*
X132455000Y-144128000D01*
X134245000Y-138828000D02*
X134995000Y-138828000D01*
X134245000Y-144128000D02*
X134995000Y-144128000D01*
D13*
G04 #@! TO.C,L1*
X112228000Y-125060000D02*
X112228000Y-123860000D01*
X109428000Y-125060000D02*
X109428000Y-123860000D01*
D12*
G04 #@! TO.C,U1*
X126416000Y-108580000D02*
X127716000Y-108580000D01*
X125816000Y-106280000D02*
X127716000Y-106280000D01*
D14*
G04 #@! TO.C,G\002A\002A\002A*
G36*
X111945468Y-95927302D02*
X112011475Y-95959834D01*
X112104629Y-96008675D01*
X112216423Y-96069423D01*
X112268979Y-96098596D01*
X112596778Y-96281712D01*
X112580143Y-96370385D01*
X112563500Y-96430102D01*
X112532498Y-96476097D01*
X112475614Y-96521381D01*
X112410697Y-96561719D01*
X112363113Y-96586921D01*
X112342959Y-96580054D01*
X112334497Y-96535973D01*
X112325393Y-96506838D01*
X112301073Y-96476556D01*
X112254980Y-96440403D01*
X112180558Y-96393655D01*
X112071252Y-96331586D01*
X111986512Y-96285197D01*
X111646605Y-96100558D01*
X111288751Y-96260641D01*
X111164987Y-96315001D01*
X111058280Y-96359964D01*
X110976820Y-96392230D01*
X110928798Y-96408499D01*
X110919575Y-96409402D01*
X110918836Y-96389109D01*
X110947976Y-96372603D01*
X111014210Y-96338993D01*
X111109267Y-96292211D01*
X111224880Y-96236187D01*
X111352777Y-96174852D01*
X111484690Y-96112139D01*
X111612349Y-96051977D01*
X111727485Y-95998299D01*
X111821828Y-95955037D01*
X111887109Y-95926120D01*
X111915058Y-95915480D01*
X111915113Y-95915480D01*
X111945468Y-95927302D01*
X111945468Y-95927302D01*
G37*
X111945468Y-95927302D02*
X112011475Y-95959834D01*
X112104629Y-96008675D01*
X112216423Y-96069423D01*
X112268979Y-96098596D01*
X112596778Y-96281712D01*
X112580143Y-96370385D01*
X112563500Y-96430102D01*
X112532498Y-96476097D01*
X112475614Y-96521381D01*
X112410697Y-96561719D01*
X112363113Y-96586921D01*
X112342959Y-96580054D01*
X112334497Y-96535973D01*
X112325393Y-96506838D01*
X112301073Y-96476556D01*
X112254980Y-96440403D01*
X112180558Y-96393655D01*
X112071252Y-96331586D01*
X111986512Y-96285197D01*
X111646605Y-96100558D01*
X111288751Y-96260641D01*
X111164987Y-96315001D01*
X111058280Y-96359964D01*
X110976820Y-96392230D01*
X110928798Y-96408499D01*
X110919575Y-96409402D01*
X110918836Y-96389109D01*
X110947976Y-96372603D01*
X111014210Y-96338993D01*
X111109267Y-96292211D01*
X111224880Y-96236187D01*
X111352777Y-96174852D01*
X111484690Y-96112139D01*
X111612349Y-96051977D01*
X111727485Y-95998299D01*
X111821828Y-95955037D01*
X111887109Y-95926120D01*
X111915058Y-95915480D01*
X111915113Y-95915480D01*
X111945468Y-95927302D01*
G36*
X117913004Y-96561819D02*
X117943224Y-96619930D01*
X117986903Y-96712840D01*
X118041217Y-96834414D01*
X118103345Y-96978517D01*
X118152065Y-97094543D01*
X118226425Y-97274388D01*
X118283025Y-97414198D01*
X118324005Y-97520677D01*
X118351502Y-97600529D01*
X118367656Y-97660460D01*
X118374605Y-97707174D01*
X118374488Y-97747375D01*
X118370674Y-97779829D01*
X118355978Y-97848742D01*
X118338619Y-97890711D01*
X118330635Y-97896680D01*
X118308392Y-97878448D01*
X118308120Y-97875097D01*
X118298819Y-97846254D01*
X118272790Y-97777603D01*
X118232838Y-97676229D01*
X118181768Y-97549217D01*
X118122389Y-97403652D01*
X118096008Y-97339564D01*
X117883897Y-96825613D01*
X117708658Y-97221396D01*
X117636192Y-97382431D01*
X117580753Y-97499099D01*
X117540643Y-97574259D01*
X117514166Y-97610766D01*
X117499625Y-97611478D01*
X117495320Y-97580644D01*
X117504321Y-97547498D01*
X117529061Y-97476003D01*
X117566146Y-97374869D01*
X117612182Y-97252806D01*
X117663775Y-97118522D01*
X117717529Y-96980729D01*
X117770050Y-96848136D01*
X117817945Y-96729453D01*
X117857818Y-96633389D01*
X117886276Y-96568655D01*
X117899066Y-96544643D01*
X117913004Y-96561819D01*
X117913004Y-96561819D01*
G37*
X117913004Y-96561819D02*
X117943224Y-96619930D01*
X117986903Y-96712840D01*
X118041217Y-96834414D01*
X118103345Y-96978517D01*
X118152065Y-97094543D01*
X118226425Y-97274388D01*
X118283025Y-97414198D01*
X118324005Y-97520677D01*
X118351502Y-97600529D01*
X118367656Y-97660460D01*
X118374605Y-97707174D01*
X118374488Y-97747375D01*
X118370674Y-97779829D01*
X118355978Y-97848742D01*
X118338619Y-97890711D01*
X118330635Y-97896680D01*
X118308392Y-97878448D01*
X118308120Y-97875097D01*
X118298819Y-97846254D01*
X118272790Y-97777603D01*
X118232838Y-97676229D01*
X118181768Y-97549217D01*
X118122389Y-97403652D01*
X118096008Y-97339564D01*
X117883897Y-96825613D01*
X117708658Y-97221396D01*
X117636192Y-97382431D01*
X117580753Y-97499099D01*
X117540643Y-97574259D01*
X117514166Y-97610766D01*
X117499625Y-97611478D01*
X117495320Y-97580644D01*
X117504321Y-97547498D01*
X117529061Y-97476003D01*
X117566146Y-97374869D01*
X117612182Y-97252806D01*
X117663775Y-97118522D01*
X117717529Y-96980729D01*
X117770050Y-96848136D01*
X117817945Y-96729453D01*
X117857818Y-96633389D01*
X117886276Y-96568655D01*
X117899066Y-96544643D01*
X117913004Y-96561819D01*
G36*
X118249707Y-98047176D02*
X118268205Y-98063594D01*
X118284158Y-98088079D01*
X118295374Y-98129633D01*
X118302597Y-98196116D01*
X118306575Y-98295388D01*
X118308052Y-98435309D01*
X118308120Y-98484364D01*
X118306400Y-98625959D01*
X118301641Y-98749689D01*
X118294442Y-98845750D01*
X118285403Y-98904341D01*
X118281826Y-98914349D01*
X118239998Y-98950096D01*
X118179933Y-98964278D01*
X118127880Y-98951612D01*
X118121853Y-98946546D01*
X118113383Y-98913067D01*
X118107588Y-98839317D01*
X118104309Y-98735744D01*
X118103388Y-98612797D01*
X118104666Y-98480926D01*
X118107983Y-98350580D01*
X118113182Y-98232207D01*
X118120105Y-98136258D01*
X118128591Y-98073181D01*
X118135399Y-98054160D01*
X118190824Y-98025412D01*
X118249707Y-98047176D01*
X118249707Y-98047176D01*
G37*
X118249707Y-98047176D02*
X118268205Y-98063594D01*
X118284158Y-98088079D01*
X118295374Y-98129633D01*
X118302597Y-98196116D01*
X118306575Y-98295388D01*
X118308052Y-98435309D01*
X118308120Y-98484364D01*
X118306400Y-98625959D01*
X118301641Y-98749689D01*
X118294442Y-98845750D01*
X118285403Y-98904341D01*
X118281826Y-98914349D01*
X118239998Y-98950096D01*
X118179933Y-98964278D01*
X118127880Y-98951612D01*
X118121853Y-98946546D01*
X118113383Y-98913067D01*
X118107588Y-98839317D01*
X118104309Y-98735744D01*
X118103388Y-98612797D01*
X118104666Y-98480926D01*
X118107983Y-98350580D01*
X118113182Y-98232207D01*
X118120105Y-98136258D01*
X118128591Y-98073181D01*
X118135399Y-98054160D01*
X118190824Y-98025412D01*
X118249707Y-98047176D01*
G36*
X117946170Y-98039244D02*
X117963030Y-98055313D01*
X117975393Y-98084133D01*
X117984144Y-98133304D01*
X117990169Y-98210423D01*
X117994356Y-98323089D01*
X117997590Y-98478900D01*
X117997613Y-98480236D01*
X117999410Y-98649434D01*
X117997387Y-98774391D01*
X117990257Y-98861605D01*
X117976729Y-98917573D01*
X117955515Y-98948792D01*
X117925325Y-98961758D01*
X117901720Y-98963480D01*
X117847409Y-98945162D01*
X117827986Y-98928352D01*
X117815674Y-98889504D01*
X117807892Y-98806737D01*
X117804535Y-98677886D01*
X117805495Y-98500790D01*
X117805826Y-98480236D01*
X117809057Y-98324077D01*
X117813233Y-98211119D01*
X117819242Y-98133764D01*
X117827969Y-98084414D01*
X117840302Y-98055470D01*
X117857126Y-98039335D01*
X117857270Y-98039244D01*
X117911929Y-98024822D01*
X117946170Y-98039244D01*
X117946170Y-98039244D01*
G37*
X117946170Y-98039244D02*
X117963030Y-98055313D01*
X117975393Y-98084133D01*
X117984144Y-98133304D01*
X117990169Y-98210423D01*
X117994356Y-98323089D01*
X117997590Y-98478900D01*
X117997613Y-98480236D01*
X117999410Y-98649434D01*
X117997387Y-98774391D01*
X117990257Y-98861605D01*
X117976729Y-98917573D01*
X117955515Y-98948792D01*
X117925325Y-98961758D01*
X117901720Y-98963480D01*
X117847409Y-98945162D01*
X117827986Y-98928352D01*
X117815674Y-98889504D01*
X117807892Y-98806737D01*
X117804535Y-98677886D01*
X117805495Y-98500790D01*
X117805826Y-98480236D01*
X117809057Y-98324077D01*
X117813233Y-98211119D01*
X117819242Y-98133764D01*
X117827969Y-98084414D01*
X117840302Y-98055470D01*
X117857126Y-98039335D01*
X117857270Y-98039244D01*
X117911929Y-98024822D01*
X117946170Y-98039244D01*
G36*
X117626476Y-98037699D02*
X117643602Y-98046148D01*
X117655883Y-98063742D01*
X117663952Y-98097660D01*
X117668440Y-98155086D01*
X117669981Y-98243198D01*
X117669206Y-98369180D01*
X117667348Y-98501825D01*
X117660420Y-98950780D01*
X117595969Y-98958296D01*
X117540486Y-98957618D01*
X117513419Y-98947712D01*
X117507491Y-98917534D01*
X117502377Y-98845208D01*
X117498422Y-98739386D01*
X117495969Y-98608718D01*
X117495320Y-98492064D01*
X117495841Y-98331173D01*
X117497839Y-98213972D01*
X117501967Y-98133355D01*
X117508879Y-98082219D01*
X117519226Y-98053460D01*
X117533662Y-98039973D01*
X117536998Y-98038521D01*
X117596301Y-98032218D01*
X117626476Y-98037699D01*
X117626476Y-98037699D01*
G37*
X117626476Y-98037699D02*
X117643602Y-98046148D01*
X117655883Y-98063742D01*
X117663952Y-98097660D01*
X117668440Y-98155086D01*
X117669981Y-98243198D01*
X117669206Y-98369180D01*
X117667348Y-98501825D01*
X117660420Y-98950780D01*
X117595969Y-98958296D01*
X117540486Y-98957618D01*
X117513419Y-98947712D01*
X117507491Y-98917534D01*
X117502377Y-98845208D01*
X117498422Y-98739386D01*
X117495969Y-98608718D01*
X117495320Y-98492064D01*
X117495841Y-98331173D01*
X117497839Y-98213972D01*
X117501967Y-98133355D01*
X117508879Y-98082219D01*
X117519226Y-98053460D01*
X117533662Y-98039973D01*
X117536998Y-98038521D01*
X117596301Y-98032218D01*
X117626476Y-98037699D01*
G36*
X114631470Y-98860082D02*
X114709403Y-98879481D01*
X114762390Y-98898343D01*
X114777520Y-98909969D01*
X114754437Y-98922865D01*
X114693600Y-98939081D01*
X114607618Y-98955326D01*
X114597539Y-98956915D01*
X114506862Y-98972675D01*
X114437228Y-98987992D01*
X114402729Y-98999732D01*
X114401931Y-99000401D01*
X114389098Y-99035670D01*
X114375753Y-99108717D01*
X114363465Y-99206562D01*
X114353806Y-99316228D01*
X114348346Y-99424733D01*
X114347863Y-99447259D01*
X114345720Y-99588139D01*
X114167448Y-99618709D01*
X114075016Y-99633902D01*
X114001115Y-99644846D01*
X113961133Y-99649270D01*
X113960363Y-99649280D01*
X113947643Y-99632210D01*
X113941521Y-99577918D01*
X113941779Y-99481776D01*
X113946922Y-99362416D01*
X113954320Y-99243903D01*
X113962610Y-99142181D01*
X113970701Y-99069164D01*
X113976605Y-99038566D01*
X114026197Y-98974438D01*
X114114867Y-98920005D01*
X114231329Y-98878343D01*
X114364293Y-98852528D01*
X114502473Y-98845637D01*
X114631470Y-98860082D01*
X114631470Y-98860082D01*
G37*
X114631470Y-98860082D02*
X114709403Y-98879481D01*
X114762390Y-98898343D01*
X114777520Y-98909969D01*
X114754437Y-98922865D01*
X114693600Y-98939081D01*
X114607618Y-98955326D01*
X114597539Y-98956915D01*
X114506862Y-98972675D01*
X114437228Y-98987992D01*
X114402729Y-98999732D01*
X114401931Y-99000401D01*
X114389098Y-99035670D01*
X114375753Y-99108717D01*
X114363465Y-99206562D01*
X114353806Y-99316228D01*
X114348346Y-99424733D01*
X114347863Y-99447259D01*
X114345720Y-99588139D01*
X114167448Y-99618709D01*
X114075016Y-99633902D01*
X114001115Y-99644846D01*
X113961133Y-99649270D01*
X113960363Y-99649280D01*
X113947643Y-99632210D01*
X113941521Y-99577918D01*
X113941779Y-99481776D01*
X113946922Y-99362416D01*
X113954320Y-99243903D01*
X113962610Y-99142181D01*
X113970701Y-99069164D01*
X113976605Y-99038566D01*
X114026197Y-98974438D01*
X114114867Y-98920005D01*
X114231329Y-98878343D01*
X114364293Y-98852528D01*
X114502473Y-98845637D01*
X114631470Y-98860082D01*
G36*
X113399469Y-98867065D02*
X113531780Y-98875982D01*
X113619602Y-98889153D01*
X113661616Y-98905609D01*
X113656502Y-98924379D01*
X113602940Y-98944493D01*
X113526595Y-98960505D01*
X113436020Y-98975284D01*
X113362207Y-98985547D01*
X113324907Y-98988880D01*
X113299823Y-99013242D01*
X113279269Y-99082439D01*
X113264155Y-99190635D01*
X113255391Y-99331992D01*
X113253520Y-99447198D01*
X113253520Y-99593265D01*
X113092689Y-99621272D01*
X112979556Y-99639668D01*
X112907174Y-99646921D01*
X112866602Y-99642439D01*
X112848899Y-99625626D01*
X112845261Y-99604830D01*
X112844289Y-99510701D01*
X112847164Y-99393768D01*
X112852994Y-99273118D01*
X112860891Y-99167841D01*
X112868615Y-99104385D01*
X112883198Y-99045350D01*
X112910629Y-99003376D01*
X112963225Y-98964788D01*
X113025154Y-98930601D01*
X113095472Y-98895693D01*
X113154530Y-98874764D01*
X113218598Y-98865052D01*
X113303946Y-98863796D01*
X113399469Y-98867065D01*
X113399469Y-98867065D01*
G37*
X113399469Y-98867065D02*
X113531780Y-98875982D01*
X113619602Y-98889153D01*
X113661616Y-98905609D01*
X113656502Y-98924379D01*
X113602940Y-98944493D01*
X113526595Y-98960505D01*
X113436020Y-98975284D01*
X113362207Y-98985547D01*
X113324907Y-98988880D01*
X113299823Y-99013242D01*
X113279269Y-99082439D01*
X113264155Y-99190635D01*
X113255391Y-99331992D01*
X113253520Y-99447198D01*
X113253520Y-99593265D01*
X113092689Y-99621272D01*
X112979556Y-99639668D01*
X112907174Y-99646921D01*
X112866602Y-99642439D01*
X112848899Y-99625626D01*
X112845261Y-99604830D01*
X112844289Y-99510701D01*
X112847164Y-99393768D01*
X112852994Y-99273118D01*
X112860891Y-99167841D01*
X112868615Y-99104385D01*
X112883198Y-99045350D01*
X112910629Y-99003376D01*
X112963225Y-98964788D01*
X113025154Y-98930601D01*
X113095472Y-98895693D01*
X113154530Y-98874764D01*
X113218598Y-98865052D01*
X113303946Y-98863796D01*
X113399469Y-98867065D01*
G36*
X112275564Y-98866838D02*
X112403238Y-98877028D01*
X112485227Y-98891194D01*
X112520423Y-98908376D01*
X112507716Y-98927612D01*
X112445999Y-98947941D01*
X112383595Y-98960505D01*
X112293031Y-98975284D01*
X112219240Y-98985547D01*
X112181962Y-98988880D01*
X112158304Y-99013148D01*
X112138364Y-99081571D01*
X112123131Y-99187579D01*
X112113594Y-99324600D01*
X112110700Y-99462522D01*
X112110520Y-99593265D01*
X111949689Y-99621272D01*
X111842743Y-99640338D01*
X111771048Y-99648571D01*
X111728126Y-99638726D01*
X111707498Y-99603564D01*
X111702685Y-99535841D01*
X111707208Y-99428315D01*
X111711086Y-99354552D01*
X111718549Y-99224253D01*
X111727179Y-99134233D01*
X111739082Y-99073979D01*
X111756364Y-99032980D01*
X111781130Y-99000722D01*
X111782187Y-98999591D01*
X111879142Y-98925935D01*
X112006781Y-98881461D01*
X112170288Y-98864774D01*
X112275564Y-98866838D01*
X112275564Y-98866838D01*
G37*
X112275564Y-98866838D02*
X112403238Y-98877028D01*
X112485227Y-98891194D01*
X112520423Y-98908376D01*
X112507716Y-98927612D01*
X112445999Y-98947941D01*
X112383595Y-98960505D01*
X112293031Y-98975284D01*
X112219240Y-98985547D01*
X112181962Y-98988880D01*
X112158304Y-99013148D01*
X112138364Y-99081571D01*
X112123131Y-99187579D01*
X112113594Y-99324600D01*
X112110700Y-99462522D01*
X112110520Y-99593265D01*
X111949689Y-99621272D01*
X111842743Y-99640338D01*
X111771048Y-99648571D01*
X111728126Y-99638726D01*
X111707498Y-99603564D01*
X111702685Y-99535841D01*
X111707208Y-99428315D01*
X111711086Y-99354552D01*
X111718549Y-99224253D01*
X111727179Y-99134233D01*
X111739082Y-99073979D01*
X111756364Y-99032980D01*
X111781130Y-99000722D01*
X111782187Y-98999591D01*
X111879142Y-98925935D01*
X112006781Y-98881461D01*
X112170288Y-98864774D01*
X112275564Y-98866838D01*
G36*
X110037165Y-98865541D02*
X110166625Y-98874612D01*
X110249827Y-98888363D01*
X110285838Y-98905660D01*
X110273729Y-98925370D01*
X110212569Y-98946358D01*
X110118677Y-98964786D01*
X110025378Y-98981642D01*
X109953677Y-98997990D01*
X109916561Y-99010782D01*
X109914383Y-99012720D01*
X109908734Y-99043374D01*
X109901283Y-99113763D01*
X109893063Y-99212902D01*
X109886222Y-99311918D01*
X109868342Y-99594480D01*
X109711000Y-99621880D01*
X109605602Y-99640669D01*
X109534892Y-99648724D01*
X109492559Y-99638800D01*
X109472294Y-99603651D01*
X109467786Y-99536034D01*
X109472724Y-99428702D01*
X109477014Y-99353233D01*
X109485147Y-99222053D01*
X109494340Y-99131267D01*
X109506679Y-99070478D01*
X109524250Y-99029290D01*
X109548227Y-98998272D01*
X109644861Y-98925659D01*
X109773964Y-98881445D01*
X109940195Y-98864365D01*
X110037165Y-98865541D01*
X110037165Y-98865541D01*
G37*
X110037165Y-98865541D02*
X110166625Y-98874612D01*
X110249827Y-98888363D01*
X110285838Y-98905660D01*
X110273729Y-98925370D01*
X110212569Y-98946358D01*
X110118677Y-98964786D01*
X110025378Y-98981642D01*
X109953677Y-98997990D01*
X109916561Y-99010782D01*
X109914383Y-99012720D01*
X109908734Y-99043374D01*
X109901283Y-99113763D01*
X109893063Y-99212902D01*
X109886222Y-99311918D01*
X109868342Y-99594480D01*
X109711000Y-99621880D01*
X109605602Y-99640669D01*
X109534892Y-99648724D01*
X109492559Y-99638800D01*
X109472294Y-99603651D01*
X109467786Y-99536034D01*
X109472724Y-99428702D01*
X109477014Y-99353233D01*
X109485147Y-99222053D01*
X109494340Y-99131267D01*
X109506679Y-99070478D01*
X109524250Y-99029290D01*
X109548227Y-98998272D01*
X109644861Y-98925659D01*
X109773964Y-98881445D01*
X109940195Y-98864365D01*
X110037165Y-98865541D01*
G36*
X115731015Y-98873915D02*
X115792431Y-98886847D01*
X115857417Y-98909486D01*
X115874236Y-98929831D01*
X115842138Y-98948607D01*
X115760369Y-98966534D01*
X115700234Y-98975458D01*
X115614730Y-98989174D01*
X115556026Y-99009208D01*
X115518296Y-99044526D01*
X115495709Y-99104096D01*
X115482438Y-99196885D01*
X115473090Y-99324894D01*
X115463723Y-99450664D01*
X115453391Y-99533887D01*
X115440415Y-99582811D01*
X115423113Y-99605683D01*
X115415163Y-99609228D01*
X115373402Y-99618795D01*
X115302032Y-99633045D01*
X115218022Y-99648842D01*
X115138341Y-99663050D01*
X115079957Y-99672532D01*
X115061077Y-99674680D01*
X115057691Y-99650949D01*
X115057180Y-99586259D01*
X115059432Y-99490364D01*
X115064334Y-99373016D01*
X115064609Y-99367497D01*
X115073959Y-99230340D01*
X115086336Y-99120992D01*
X115100595Y-99047936D01*
X115111238Y-99022740D01*
X115191037Y-98959718D01*
X115306656Y-98910582D01*
X115444354Y-98878076D01*
X115590387Y-98864940D01*
X115731015Y-98873915D01*
X115731015Y-98873915D01*
G37*
X115731015Y-98873915D02*
X115792431Y-98886847D01*
X115857417Y-98909486D01*
X115874236Y-98929831D01*
X115842138Y-98948607D01*
X115760369Y-98966534D01*
X115700234Y-98975458D01*
X115614730Y-98989174D01*
X115556026Y-99009208D01*
X115518296Y-99044526D01*
X115495709Y-99104096D01*
X115482438Y-99196885D01*
X115473090Y-99324894D01*
X115463723Y-99450664D01*
X115453391Y-99533887D01*
X115440415Y-99582811D01*
X115423113Y-99605683D01*
X115415163Y-99609228D01*
X115373402Y-99618795D01*
X115302032Y-99633045D01*
X115218022Y-99648842D01*
X115138341Y-99663050D01*
X115079957Y-99672532D01*
X115061077Y-99674680D01*
X115057691Y-99650949D01*
X115057180Y-99586259D01*
X115059432Y-99490364D01*
X115064334Y-99373016D01*
X115064609Y-99367497D01*
X115073959Y-99230340D01*
X115086336Y-99120992D01*
X115100595Y-99047936D01*
X115111238Y-99022740D01*
X115191037Y-98959718D01*
X115306656Y-98910582D01*
X115444354Y-98878076D01*
X115590387Y-98864940D01*
X115731015Y-98873915D01*
G36*
X111183859Y-98879236D02*
X111288147Y-98889153D01*
X111369457Y-98904387D01*
X111416943Y-98923169D01*
X111424720Y-98934677D01*
X111401560Y-98947556D01*
X111340152Y-98964029D01*
X111252607Y-98980992D01*
X111229607Y-98984705D01*
X111136659Y-98999832D01*
X111065849Y-99012635D01*
X111029807Y-99020794D01*
X111027777Y-99021755D01*
X111023709Y-99048214D01*
X111017685Y-99115101D01*
X111010537Y-99212121D01*
X111003536Y-99321597D01*
X110986012Y-99614724D01*
X110811194Y-99644702D01*
X110719623Y-99659734D01*
X110646631Y-99670492D01*
X110607817Y-99674678D01*
X110607570Y-99674680D01*
X110595186Y-99657841D01*
X110588954Y-99604272D01*
X110588676Y-99509396D01*
X110594152Y-99368633D01*
X110594209Y-99367497D01*
X110602484Y-99245242D01*
X110613570Y-99140006D01*
X110626010Y-99063077D01*
X110638242Y-99025868D01*
X110711317Y-98968252D01*
X110819286Y-98920482D01*
X110946432Y-98888031D01*
X111067438Y-98876404D01*
X111183859Y-98879236D01*
X111183859Y-98879236D01*
G37*
X111183859Y-98879236D02*
X111288147Y-98889153D01*
X111369457Y-98904387D01*
X111416943Y-98923169D01*
X111424720Y-98934677D01*
X111401560Y-98947556D01*
X111340152Y-98964029D01*
X111252607Y-98980992D01*
X111229607Y-98984705D01*
X111136659Y-98999832D01*
X111065849Y-99012635D01*
X111029807Y-99020794D01*
X111027777Y-99021755D01*
X111023709Y-99048214D01*
X111017685Y-99115101D01*
X111010537Y-99212121D01*
X111003536Y-99321597D01*
X110986012Y-99614724D01*
X110811194Y-99644702D01*
X110719623Y-99659734D01*
X110646631Y-99670492D01*
X110607817Y-99674678D01*
X110607570Y-99674680D01*
X110595186Y-99657841D01*
X110588954Y-99604272D01*
X110588676Y-99509396D01*
X110594152Y-99368633D01*
X110594209Y-99367497D01*
X110602484Y-99245242D01*
X110613570Y-99140006D01*
X110626010Y-99063077D01*
X110638242Y-99025868D01*
X110711317Y-98968252D01*
X110819286Y-98920482D01*
X110946432Y-98888031D01*
X111067438Y-98876404D01*
X111183859Y-98879236D01*
G36*
X108971224Y-98869657D02*
X109076778Y-98879943D01*
X109155540Y-98896958D01*
X109176281Y-98905776D01*
X109195436Y-98921934D01*
X109181859Y-98935593D01*
X109128835Y-98950407D01*
X109073483Y-98961721D01*
X108982632Y-98979453D01*
X108905400Y-98994785D01*
X108869257Y-99002163D01*
X108835656Y-99018753D01*
X108814925Y-99059301D01*
X108800940Y-99136565D01*
X108799628Y-99147213D01*
X108790427Y-99251684D01*
X108784508Y-99372235D01*
X108783340Y-99437929D01*
X108783120Y-99594878D01*
X108637070Y-99623079D01*
X108546273Y-99640810D01*
X108468124Y-99656414D01*
X108433312Y-99663603D01*
X108381819Y-99660900D01*
X108362936Y-99642916D01*
X108359889Y-99605310D01*
X108361435Y-99529018D01*
X108367136Y-99425905D01*
X108374462Y-99331283D01*
X108385917Y-99208000D01*
X108396967Y-99124205D01*
X108410865Y-99068720D01*
X108430868Y-99030364D01*
X108460229Y-98997959D01*
X108475593Y-98983917D01*
X108551887Y-98932135D01*
X108642830Y-98891385D01*
X108661475Y-98885712D01*
X108746807Y-98871888D01*
X108855645Y-98866754D01*
X108971224Y-98869657D01*
X108971224Y-98869657D01*
G37*
X108971224Y-98869657D02*
X109076778Y-98879943D01*
X109155540Y-98896958D01*
X109176281Y-98905776D01*
X109195436Y-98921934D01*
X109181859Y-98935593D01*
X109128835Y-98950407D01*
X109073483Y-98961721D01*
X108982632Y-98979453D01*
X108905400Y-98994785D01*
X108869257Y-99002163D01*
X108835656Y-99018753D01*
X108814925Y-99059301D01*
X108800940Y-99136565D01*
X108799628Y-99147213D01*
X108790427Y-99251684D01*
X108784508Y-99372235D01*
X108783340Y-99437929D01*
X108783120Y-99594878D01*
X108637070Y-99623079D01*
X108546273Y-99640810D01*
X108468124Y-99656414D01*
X108433312Y-99663603D01*
X108381819Y-99660900D01*
X108362936Y-99642916D01*
X108359889Y-99605310D01*
X108361435Y-99529018D01*
X108367136Y-99425905D01*
X108374462Y-99331283D01*
X108385917Y-99208000D01*
X108396967Y-99124205D01*
X108410865Y-99068720D01*
X108430868Y-99030364D01*
X108460229Y-98997959D01*
X108475593Y-98983917D01*
X108551887Y-98932135D01*
X108642830Y-98891385D01*
X108661475Y-98885712D01*
X108746807Y-98871888D01*
X108855645Y-98866754D01*
X108971224Y-98869657D01*
G36*
X118523341Y-97682968D02*
X118551455Y-97747872D01*
X118571443Y-97805954D01*
X118579713Y-97835323D01*
X118586823Y-97872360D01*
X118592857Y-97920846D01*
X118597903Y-97984563D01*
X118602044Y-98067292D01*
X118605367Y-98172813D01*
X118607957Y-98304909D01*
X118609900Y-98467360D01*
X118611280Y-98663947D01*
X118612184Y-98898452D01*
X118612696Y-99174656D01*
X118612903Y-99496340D01*
X118612920Y-99641104D01*
X118612920Y-101351080D01*
X118409720Y-101351080D01*
X118409720Y-99615704D01*
X118409826Y-99271695D01*
X118410199Y-98974751D01*
X118410923Y-98721137D01*
X118412081Y-98507118D01*
X118413754Y-98328960D01*
X118416026Y-98182927D01*
X118418980Y-98065285D01*
X118422699Y-97972299D01*
X118427265Y-97900235D01*
X118432761Y-97845356D01*
X118439270Y-97803930D01*
X118446876Y-97772220D01*
X118450891Y-97759496D01*
X118477753Y-97690589D01*
X118500338Y-97664477D01*
X118523341Y-97682968D01*
X118523341Y-97682968D01*
G37*
X118523341Y-97682968D02*
X118551455Y-97747872D01*
X118571443Y-97805954D01*
X118579713Y-97835323D01*
X118586823Y-97872360D01*
X118592857Y-97920846D01*
X118597903Y-97984563D01*
X118602044Y-98067292D01*
X118605367Y-98172813D01*
X118607957Y-98304909D01*
X118609900Y-98467360D01*
X118611280Y-98663947D01*
X118612184Y-98898452D01*
X118612696Y-99174656D01*
X118612903Y-99496340D01*
X118612920Y-99641104D01*
X118612920Y-101351080D01*
X118409720Y-101351080D01*
X118409720Y-99615704D01*
X118409826Y-99271695D01*
X118410199Y-98974751D01*
X118410923Y-98721137D01*
X118412081Y-98507118D01*
X118413754Y-98328960D01*
X118416026Y-98182927D01*
X118418980Y-98065285D01*
X118422699Y-97972299D01*
X118427265Y-97900235D01*
X118432761Y-97845356D01*
X118439270Y-97803930D01*
X118446876Y-97772220D01*
X118450891Y-97759496D01*
X118477753Y-97690589D01*
X118500338Y-97664477D01*
X118523341Y-97682968D01*
G36*
X117343462Y-97708744D02*
X117357192Y-97756980D01*
X117363937Y-97798101D01*
X117369807Y-97865543D01*
X117374853Y-97962075D01*
X117379125Y-98090471D01*
X117382676Y-98253503D01*
X117385555Y-98453943D01*
X117387812Y-98694563D01*
X117389500Y-98978136D01*
X117390669Y-99307433D01*
X117391281Y-99617530D01*
X117393720Y-101351080D01*
X117241320Y-101351080D01*
X117241320Y-99663230D01*
X117241523Y-99307592D01*
X117242220Y-98999031D01*
X117243539Y-98733823D01*
X117245610Y-98508245D01*
X117248562Y-98318575D01*
X117252523Y-98161090D01*
X117257623Y-98032068D01*
X117263990Y-97927786D01*
X117271755Y-97844520D01*
X117281046Y-97778549D01*
X117291992Y-97726149D01*
X117304723Y-97683598D01*
X117310510Y-97668080D01*
X117324352Y-97666394D01*
X117343462Y-97708744D01*
X117343462Y-97708744D01*
G37*
X117343462Y-97708744D02*
X117357192Y-97756980D01*
X117363937Y-97798101D01*
X117369807Y-97865543D01*
X117374853Y-97962075D01*
X117379125Y-98090471D01*
X117382676Y-98253503D01*
X117385555Y-98453943D01*
X117387812Y-98694563D01*
X117389500Y-98978136D01*
X117390669Y-99307433D01*
X117391281Y-99617530D01*
X117393720Y-101351080D01*
X117241320Y-101351080D01*
X117241320Y-99663230D01*
X117241523Y-99307592D01*
X117242220Y-98999031D01*
X117243539Y-98733823D01*
X117245610Y-98508245D01*
X117248562Y-98318575D01*
X117252523Y-98161090D01*
X117257623Y-98032068D01*
X117263990Y-97927786D01*
X117271755Y-97844520D01*
X117281046Y-97778549D01*
X117291992Y-97726149D01*
X117304723Y-97683598D01*
X117310510Y-97668080D01*
X117324352Y-97666394D01*
X117343462Y-97708744D01*
G36*
X112489079Y-96664357D02*
X112957524Y-96733393D01*
X113073927Y-96757028D01*
X113462898Y-96858359D01*
X113858338Y-96994380D01*
X114251676Y-97160563D01*
X114634341Y-97352383D01*
X114997763Y-97565311D01*
X115333372Y-97794822D01*
X115632596Y-98036389D01*
X115805538Y-98199770D01*
X115982657Y-98379280D01*
X116555520Y-98379280D01*
X116555520Y-101554280D01*
X116301520Y-101554280D01*
X116301520Y-98607880D01*
X115788417Y-98607880D01*
X115606818Y-98447256D01*
X115206802Y-98118015D01*
X114789254Y-97821106D01*
X114360104Y-97559813D01*
X113925280Y-97337422D01*
X113490712Y-97157216D01*
X113062329Y-97022480D01*
X113011138Y-97009403D01*
X112497127Y-96905699D01*
X111977790Y-96849553D01*
X111450651Y-96841016D01*
X110913234Y-96880135D01*
X110363063Y-96966961D01*
X109911809Y-97070873D01*
X109615254Y-97155036D01*
X109321906Y-97250883D01*
X109047907Y-97352812D01*
X108823544Y-97448640D01*
X108732137Y-97488878D01*
X108659293Y-97517167D01*
X108616246Y-97529308D01*
X108609760Y-97528587D01*
X108603716Y-97520999D01*
X108606123Y-97512224D01*
X108623198Y-97498645D01*
X108661154Y-97476644D01*
X108726206Y-97442604D01*
X108824568Y-97392909D01*
X108954780Y-97327776D01*
X109276006Y-97176156D01*
X109602139Y-97038905D01*
X109922372Y-96919984D01*
X110225900Y-96823359D01*
X110501916Y-96752991D01*
X110548420Y-96743304D01*
X111017232Y-96670161D01*
X111505741Y-96632670D01*
X112000754Y-96630759D01*
X112489079Y-96664357D01*
X112489079Y-96664357D01*
G37*
X112489079Y-96664357D02*
X112957524Y-96733393D01*
X113073927Y-96757028D01*
X113462898Y-96858359D01*
X113858338Y-96994380D01*
X114251676Y-97160563D01*
X114634341Y-97352383D01*
X114997763Y-97565311D01*
X115333372Y-97794822D01*
X115632596Y-98036389D01*
X115805538Y-98199770D01*
X115982657Y-98379280D01*
X116555520Y-98379280D01*
X116555520Y-101554280D01*
X116301520Y-101554280D01*
X116301520Y-98607880D01*
X115788417Y-98607880D01*
X115606818Y-98447256D01*
X115206802Y-98118015D01*
X114789254Y-97821106D01*
X114360104Y-97559813D01*
X113925280Y-97337422D01*
X113490712Y-97157216D01*
X113062329Y-97022480D01*
X113011138Y-97009403D01*
X112497127Y-96905699D01*
X111977790Y-96849553D01*
X111450651Y-96841016D01*
X110913234Y-96880135D01*
X110363063Y-96966961D01*
X109911809Y-97070873D01*
X109615254Y-97155036D01*
X109321906Y-97250883D01*
X109047907Y-97352812D01*
X108823544Y-97448640D01*
X108732137Y-97488878D01*
X108659293Y-97517167D01*
X108616246Y-97529308D01*
X108609760Y-97528587D01*
X108603716Y-97520999D01*
X108606123Y-97512224D01*
X108623198Y-97498645D01*
X108661154Y-97476644D01*
X108726206Y-97442604D01*
X108824568Y-97392909D01*
X108954780Y-97327776D01*
X109276006Y-97176156D01*
X109602139Y-97038905D01*
X109922372Y-96919984D01*
X110225900Y-96823359D01*
X110501916Y-96752991D01*
X110548420Y-96743304D01*
X111017232Y-96670161D01*
X111505741Y-96632670D01*
X112000754Y-96630759D01*
X112489079Y-96664357D01*
G36*
X118304266Y-102069834D02*
X118462000Y-102093788D01*
X118578274Y-102136076D01*
X118656705Y-102198632D01*
X118700913Y-102283391D01*
X118714520Y-102390066D01*
X118699850Y-102507911D01*
X118667504Y-102571914D01*
X118639478Y-102610993D01*
X118636330Y-102642906D01*
X118659781Y-102687451D01*
X118680204Y-102717972D01*
X118728952Y-102828978D01*
X118737069Y-102947022D01*
X118707780Y-103059707D01*
X118644312Y-103154638D01*
X118549891Y-103219419D01*
X118549679Y-103219508D01*
X118462208Y-103240993D01*
X118325226Y-103253129D01*
X118181935Y-103256080D01*
X117901720Y-103256080D01*
X117901720Y-102748080D01*
X118155720Y-102748080D01*
X118155720Y-103052880D01*
X118270020Y-103052880D01*
X118368097Y-103041259D01*
X118433473Y-103003702D01*
X118435120Y-103002080D01*
X118479973Y-102931082D01*
X118479820Y-102861908D01*
X118440044Y-102802840D01*
X118366026Y-102762158D01*
X118270020Y-102748080D01*
X118155720Y-102748080D01*
X117901720Y-102748080D01*
X117901720Y-102290880D01*
X118155720Y-102290880D01*
X118155720Y-102544880D01*
X118251668Y-102544880D01*
X118331626Y-102534375D01*
X118398855Y-102508742D01*
X118404068Y-102505339D01*
X118454331Y-102449568D01*
X118460167Y-102391855D01*
X118426886Y-102340583D01*
X118359800Y-102304137D01*
X118268205Y-102290880D01*
X118155720Y-102290880D01*
X117901720Y-102290880D01*
X117901720Y-102062280D01*
X118101453Y-102062280D01*
X118304266Y-102069834D01*
X118304266Y-102069834D01*
G37*
X118304266Y-102069834D02*
X118462000Y-102093788D01*
X118578274Y-102136076D01*
X118656705Y-102198632D01*
X118700913Y-102283391D01*
X118714520Y-102390066D01*
X118699850Y-102507911D01*
X118667504Y-102571914D01*
X118639478Y-102610993D01*
X118636330Y-102642906D01*
X118659781Y-102687451D01*
X118680204Y-102717972D01*
X118728952Y-102828978D01*
X118737069Y-102947022D01*
X118707780Y-103059707D01*
X118644312Y-103154638D01*
X118549891Y-103219419D01*
X118549679Y-103219508D01*
X118462208Y-103240993D01*
X118325226Y-103253129D01*
X118181935Y-103256080D01*
X117901720Y-103256080D01*
X117901720Y-102748080D01*
X118155720Y-102748080D01*
X118155720Y-103052880D01*
X118270020Y-103052880D01*
X118368097Y-103041259D01*
X118433473Y-103003702D01*
X118435120Y-103002080D01*
X118479973Y-102931082D01*
X118479820Y-102861908D01*
X118440044Y-102802840D01*
X118366026Y-102762158D01*
X118270020Y-102748080D01*
X118155720Y-102748080D01*
X117901720Y-102748080D01*
X117901720Y-102290880D01*
X118155720Y-102290880D01*
X118155720Y-102544880D01*
X118251668Y-102544880D01*
X118331626Y-102534375D01*
X118398855Y-102508742D01*
X118404068Y-102505339D01*
X118454331Y-102449568D01*
X118460167Y-102391855D01*
X118426886Y-102340583D01*
X118359800Y-102304137D01*
X118268205Y-102290880D01*
X118155720Y-102290880D01*
X117901720Y-102290880D01*
X117901720Y-102062280D01*
X118101453Y-102062280D01*
X118304266Y-102069834D01*
G36*
X117645162Y-102614730D02*
X117691233Y-102776403D01*
X117733164Y-102923389D01*
X117768773Y-103048052D01*
X117795878Y-103142757D01*
X117812298Y-103199869D01*
X117815726Y-103211630D01*
X117816863Y-103237389D01*
X117793489Y-103250808D01*
X117735031Y-103255672D01*
X117691573Y-103256080D01*
X117554203Y-103256080D01*
X117522940Y-103116380D01*
X117491676Y-102976680D01*
X117166539Y-102976680D01*
X117085315Y-103256080D01*
X116960117Y-103256080D01*
X116887982Y-103252598D01*
X116842180Y-103243712D01*
X116833786Y-103237030D01*
X116839971Y-103208151D01*
X116857941Y-103137381D01*
X116885825Y-103031760D01*
X116921752Y-102898326D01*
X116962767Y-102748080D01*
X117220014Y-102748080D01*
X117319567Y-102748080D01*
X117382282Y-102743776D01*
X117416418Y-102733048D01*
X117418539Y-102729030D01*
X117412231Y-102696653D01*
X117396161Y-102629209D01*
X117373679Y-102540707D01*
X117371454Y-102532180D01*
X117324948Y-102354380D01*
X117294208Y-102468680D01*
X117269846Y-102559664D01*
X117246945Y-102645812D01*
X117241741Y-102665530D01*
X117220014Y-102748080D01*
X116962767Y-102748080D01*
X116963849Y-102744117D01*
X116992513Y-102640130D01*
X117152374Y-102062280D01*
X117487815Y-102062280D01*
X117645162Y-102614730D01*
X117645162Y-102614730D01*
G37*
X117645162Y-102614730D02*
X117691233Y-102776403D01*
X117733164Y-102923389D01*
X117768773Y-103048052D01*
X117795878Y-103142757D01*
X117812298Y-103199869D01*
X117815726Y-103211630D01*
X117816863Y-103237389D01*
X117793489Y-103250808D01*
X117735031Y-103255672D01*
X117691573Y-103256080D01*
X117554203Y-103256080D01*
X117522940Y-103116380D01*
X117491676Y-102976680D01*
X117166539Y-102976680D01*
X117085315Y-103256080D01*
X116960117Y-103256080D01*
X116887982Y-103252598D01*
X116842180Y-103243712D01*
X116833786Y-103237030D01*
X116839971Y-103208151D01*
X116857941Y-103137381D01*
X116885825Y-103031760D01*
X116921752Y-102898326D01*
X116962767Y-102748080D01*
X117220014Y-102748080D01*
X117319567Y-102748080D01*
X117382282Y-102743776D01*
X117416418Y-102733048D01*
X117418539Y-102729030D01*
X117412231Y-102696653D01*
X117396161Y-102629209D01*
X117373679Y-102540707D01*
X117371454Y-102532180D01*
X117324948Y-102354380D01*
X117294208Y-102468680D01*
X117269846Y-102559664D01*
X117246945Y-102645812D01*
X117241741Y-102665530D01*
X117220014Y-102748080D01*
X116962767Y-102748080D01*
X116963849Y-102744117D01*
X116992513Y-102640130D01*
X117152374Y-102062280D01*
X117487815Y-102062280D01*
X117645162Y-102614730D01*
G36*
X116276120Y-103027480D02*
X116758720Y-103027480D01*
X116758720Y-103256080D01*
X116022120Y-103256080D01*
X116022120Y-102062280D01*
X116276120Y-102062280D01*
X116276120Y-103027480D01*
X116276120Y-103027480D01*
G37*
X116276120Y-103027480D02*
X116758720Y-103027480D01*
X116758720Y-103256080D01*
X116022120Y-103256080D01*
X116022120Y-102062280D01*
X116276120Y-102062280D01*
X116276120Y-103027480D01*
G36*
X115012031Y-102557452D02*
X115136322Y-102309866D01*
X115260614Y-102062280D01*
X115387367Y-102062280D01*
X115459732Y-102066840D01*
X115505620Y-102078499D01*
X115514120Y-102087588D01*
X115502283Y-102117513D01*
X115469649Y-102183308D01*
X115420535Y-102276681D01*
X115359256Y-102389344D01*
X115323620Y-102453509D01*
X115133120Y-102794121D01*
X115133120Y-103256080D01*
X114879120Y-103256080D01*
X114879120Y-102787980D01*
X114688620Y-102440016D01*
X114623341Y-102319873D01*
X114567701Y-102215743D01*
X114525878Y-102135582D01*
X114502049Y-102087349D01*
X114498120Y-102077166D01*
X114521045Y-102068863D01*
X114579955Y-102063460D01*
X114632087Y-102062280D01*
X114766055Y-102062280D01*
X115012031Y-102557452D01*
X115012031Y-102557452D01*
G37*
X115012031Y-102557452D02*
X115136322Y-102309866D01*
X115260614Y-102062280D01*
X115387367Y-102062280D01*
X115459732Y-102066840D01*
X115505620Y-102078499D01*
X115514120Y-102087588D01*
X115502283Y-102117513D01*
X115469649Y-102183308D01*
X115420535Y-102276681D01*
X115359256Y-102389344D01*
X115323620Y-102453509D01*
X115133120Y-102794121D01*
X115133120Y-103256080D01*
X114879120Y-103256080D01*
X114879120Y-102787980D01*
X114688620Y-102440016D01*
X114623341Y-102319873D01*
X114567701Y-102215743D01*
X114525878Y-102135582D01*
X114502049Y-102087349D01*
X114498120Y-102077166D01*
X114521045Y-102068863D01*
X114579955Y-102063460D01*
X114632087Y-102062280D01*
X114766055Y-102062280D01*
X115012031Y-102557452D01*
G36*
X114447320Y-102290880D02*
X113964720Y-102290880D01*
X113964720Y-102544880D01*
X114371120Y-102544880D01*
X114371120Y-102773480D01*
X113964720Y-102773480D01*
X113964720Y-103027480D01*
X114472720Y-103027480D01*
X114472720Y-103256080D01*
X113710720Y-103256080D01*
X113710720Y-102062280D01*
X114447320Y-102062280D01*
X114447320Y-102290880D01*
X114447320Y-102290880D01*
G37*
X114447320Y-102290880D02*
X113964720Y-102290880D01*
X113964720Y-102544880D01*
X114371120Y-102544880D01*
X114371120Y-102773480D01*
X113964720Y-102773480D01*
X113964720Y-103027480D01*
X114472720Y-103027480D01*
X114472720Y-103256080D01*
X113710720Y-103256080D01*
X113710720Y-102062280D01*
X114447320Y-102062280D01*
X114447320Y-102290880D01*
G36*
X113126520Y-103027480D02*
X113609120Y-103027480D01*
X113609120Y-103256080D01*
X112872520Y-103256080D01*
X112872520Y-102062280D01*
X113126520Y-102062280D01*
X113126520Y-103027480D01*
X113126520Y-103027480D01*
G37*
X113126520Y-103027480D02*
X113609120Y-103027480D01*
X113609120Y-103256080D01*
X112872520Y-103256080D01*
X112872520Y-102062280D01*
X113126520Y-102062280D01*
X113126520Y-103027480D01*
G36*
X112745520Y-102290880D02*
X112262920Y-102290880D01*
X112262920Y-102544880D01*
X112669320Y-102544880D01*
X112669320Y-102773480D01*
X112262920Y-102773480D01*
X112262920Y-103027480D01*
X112770920Y-103027480D01*
X112770920Y-103256080D01*
X112008920Y-103256080D01*
X112008920Y-102062280D01*
X112745520Y-102062280D01*
X112745520Y-102290880D01*
X112745520Y-102290880D01*
G37*
X112745520Y-102290880D02*
X112262920Y-102290880D01*
X112262920Y-102544880D01*
X112669320Y-102544880D01*
X112669320Y-102773480D01*
X112262920Y-102773480D01*
X112262920Y-103027480D01*
X112770920Y-103027480D01*
X112770920Y-103256080D01*
X112008920Y-103256080D01*
X112008920Y-102062280D01*
X112745520Y-102062280D01*
X112745520Y-102290880D01*
G36*
X111894426Y-102065824D02*
X111911452Y-102080292D01*
X111902092Y-102112145D01*
X111865455Y-102168074D01*
X111800649Y-102254772D01*
X111750304Y-102321130D01*
X111686673Y-102407847D01*
X111636786Y-102480794D01*
X111607445Y-102529757D01*
X111602520Y-102543063D01*
X111614245Y-102573748D01*
X111646476Y-102640047D01*
X111694797Y-102733308D01*
X111754790Y-102844881D01*
X111780320Y-102891347D01*
X111843599Y-103007341D01*
X111896948Y-103107991D01*
X111935963Y-103184763D01*
X111956241Y-103229128D01*
X111958120Y-103235832D01*
X111935167Y-103246863D01*
X111875715Y-103252028D01*
X111812256Y-103250997D01*
X111666392Y-103243380D01*
X111536134Y-103006606D01*
X111405875Y-102769832D01*
X111351797Y-102838581D01*
X111320708Y-102889780D01*
X111303985Y-102953911D01*
X111297978Y-103047390D01*
X111297720Y-103081705D01*
X111297720Y-103256080D01*
X111043720Y-103256080D01*
X111043720Y-102062280D01*
X111295742Y-102062280D01*
X111310420Y-102506780D01*
X111472131Y-102284530D01*
X111633843Y-102062280D01*
X111784780Y-102062280D01*
X111851905Y-102062050D01*
X111894426Y-102065824D01*
X111894426Y-102065824D01*
G37*
X111894426Y-102065824D02*
X111911452Y-102080292D01*
X111902092Y-102112145D01*
X111865455Y-102168074D01*
X111800649Y-102254772D01*
X111750304Y-102321130D01*
X111686673Y-102407847D01*
X111636786Y-102480794D01*
X111607445Y-102529757D01*
X111602520Y-102543063D01*
X111614245Y-102573748D01*
X111646476Y-102640047D01*
X111694797Y-102733308D01*
X111754790Y-102844881D01*
X111780320Y-102891347D01*
X111843599Y-103007341D01*
X111896948Y-103107991D01*
X111935963Y-103184763D01*
X111956241Y-103229128D01*
X111958120Y-103235832D01*
X111935167Y-103246863D01*
X111875715Y-103252028D01*
X111812256Y-103250997D01*
X111666392Y-103243380D01*
X111536134Y-103006606D01*
X111405875Y-102769832D01*
X111351797Y-102838581D01*
X111320708Y-102889780D01*
X111303985Y-102953911D01*
X111297978Y-103047390D01*
X111297720Y-103081705D01*
X111297720Y-103256080D01*
X111043720Y-103256080D01*
X111043720Y-102062280D01*
X111295742Y-102062280D01*
X111310420Y-102506780D01*
X111472131Y-102284530D01*
X111633843Y-102062280D01*
X111784780Y-102062280D01*
X111851905Y-102062050D01*
X111894426Y-102065824D01*
G36*
X110338870Y-102062421D02*
X110503462Y-102065979D01*
X110627444Y-102078077D01*
X110720640Y-102101161D01*
X110792874Y-102137674D01*
X110853968Y-102190062D01*
X110854663Y-102190787D01*
X110898251Y-102243108D01*
X110920736Y-102295894D01*
X110928757Y-102369337D01*
X110929420Y-102418137D01*
X110926269Y-102507607D01*
X110911943Y-102567156D01*
X110879132Y-102617516D01*
X110846642Y-102652863D01*
X110763864Y-102738268D01*
X110865692Y-102973044D01*
X110908692Y-103074583D01*
X110942712Y-103159475D01*
X110963356Y-103216486D01*
X110967520Y-103233277D01*
X110944370Y-103246883D01*
X110883073Y-103252300D01*
X110835117Y-103251057D01*
X110702715Y-103243380D01*
X110602422Y-103008430D01*
X110555608Y-102901254D01*
X110521411Y-102832706D01*
X110493568Y-102794251D01*
X110465816Y-102777355D01*
X110431894Y-102773484D01*
X110430024Y-102773480D01*
X110357920Y-102773480D01*
X110357920Y-103256080D01*
X110078520Y-103256080D01*
X110078520Y-102290880D01*
X110357920Y-102290880D01*
X110357920Y-102544880D01*
X110483479Y-102544880D01*
X110567015Y-102539847D01*
X110617761Y-102520790D01*
X110648579Y-102488428D01*
X110681575Y-102432513D01*
X110679509Y-102392267D01*
X110640641Y-102345014D01*
X110637320Y-102341680D01*
X110572748Y-102303254D01*
X110475881Y-102290890D01*
X110472220Y-102290880D01*
X110357920Y-102290880D01*
X110078520Y-102290880D01*
X110078520Y-102062280D01*
X110338870Y-102062421D01*
X110338870Y-102062421D01*
G37*
X110338870Y-102062421D02*
X110503462Y-102065979D01*
X110627444Y-102078077D01*
X110720640Y-102101161D01*
X110792874Y-102137674D01*
X110853968Y-102190062D01*
X110854663Y-102190787D01*
X110898251Y-102243108D01*
X110920736Y-102295894D01*
X110928757Y-102369337D01*
X110929420Y-102418137D01*
X110926269Y-102507607D01*
X110911943Y-102567156D01*
X110879132Y-102617516D01*
X110846642Y-102652863D01*
X110763864Y-102738268D01*
X110865692Y-102973044D01*
X110908692Y-103074583D01*
X110942712Y-103159475D01*
X110963356Y-103216486D01*
X110967520Y-103233277D01*
X110944370Y-103246883D01*
X110883073Y-103252300D01*
X110835117Y-103251057D01*
X110702715Y-103243380D01*
X110602422Y-103008430D01*
X110555608Y-102901254D01*
X110521411Y-102832706D01*
X110493568Y-102794251D01*
X110465816Y-102777355D01*
X110431894Y-102773484D01*
X110430024Y-102773480D01*
X110357920Y-102773480D01*
X110357920Y-103256080D01*
X110078520Y-103256080D01*
X110078520Y-102290880D01*
X110357920Y-102290880D01*
X110357920Y-102544880D01*
X110483479Y-102544880D01*
X110567015Y-102539847D01*
X110617761Y-102520790D01*
X110648579Y-102488428D01*
X110681575Y-102432513D01*
X110679509Y-102392267D01*
X110640641Y-102345014D01*
X110637320Y-102341680D01*
X110572748Y-102303254D01*
X110475881Y-102290890D01*
X110472220Y-102290880D01*
X110357920Y-102290880D01*
X110078520Y-102290880D01*
X110078520Y-102062280D01*
X110338870Y-102062421D01*
G36*
X110002320Y-102290880D02*
X109519720Y-102290880D01*
X109519720Y-102544880D01*
X109926120Y-102544880D01*
X109926120Y-102773480D01*
X109519720Y-102773480D01*
X109519720Y-103027480D01*
X110027720Y-103027480D01*
X110027720Y-103256080D01*
X109265720Y-103256080D01*
X109265720Y-102062280D01*
X110002320Y-102062280D01*
X110002320Y-102290880D01*
X110002320Y-102290880D01*
G37*
X110002320Y-102290880D02*
X109519720Y-102290880D01*
X109519720Y-102544880D01*
X109926120Y-102544880D01*
X109926120Y-102773480D01*
X109519720Y-102773480D01*
X109519720Y-103027480D01*
X110027720Y-103027480D01*
X110027720Y-103256080D01*
X109265720Y-103256080D01*
X109265720Y-102062280D01*
X110002320Y-102062280D01*
X110002320Y-102290880D01*
G36*
X108637070Y-102067729D02*
X108809631Y-102078932D01*
X108939033Y-102098044D01*
X109032649Y-102127760D01*
X109097849Y-102170775D01*
X109142008Y-102229784D01*
X109154823Y-102257007D01*
X109181611Y-102373437D01*
X109168563Y-102485702D01*
X109117629Y-102578290D01*
X109113931Y-102582328D01*
X109061731Y-102637893D01*
X109113032Y-102684320D01*
X109171785Y-102769018D01*
X109197595Y-102876087D01*
X109190674Y-102989403D01*
X109151229Y-103092847D01*
X109107008Y-103148324D01*
X109048453Y-103193783D01*
X108979848Y-103224942D01*
X108890797Y-103244143D01*
X108770903Y-103253732D01*
X108629066Y-103256080D01*
X108351320Y-103256080D01*
X108351320Y-102748080D01*
X108605320Y-102748080D01*
X108605320Y-103052880D01*
X108713968Y-103052880D01*
X108796653Y-103043664D01*
X108866498Y-103020782D01*
X108879068Y-103013339D01*
X108924853Y-102953821D01*
X108932719Y-102877833D01*
X108901437Y-102804044D01*
X108893483Y-102794530D01*
X108839418Y-102761116D01*
X108750874Y-102748413D01*
X108728383Y-102748080D01*
X108605320Y-102748080D01*
X108351320Y-102748080D01*
X108351320Y-102290880D01*
X108605320Y-102290880D01*
X108605320Y-102544880D01*
X108701268Y-102544880D01*
X108781226Y-102534375D01*
X108848455Y-102508742D01*
X108853668Y-102505339D01*
X108898575Y-102449058D01*
X108908041Y-102380557D01*
X108879640Y-102321360D01*
X108837486Y-102303242D01*
X108765703Y-102292324D01*
X108727240Y-102290880D01*
X108605320Y-102290880D01*
X108351320Y-102290880D01*
X108351320Y-102055887D01*
X108637070Y-102067729D01*
X108637070Y-102067729D01*
G37*
X108637070Y-102067729D02*
X108809631Y-102078932D01*
X108939033Y-102098044D01*
X109032649Y-102127760D01*
X109097849Y-102170775D01*
X109142008Y-102229784D01*
X109154823Y-102257007D01*
X109181611Y-102373437D01*
X109168563Y-102485702D01*
X109117629Y-102578290D01*
X109113931Y-102582328D01*
X109061731Y-102637893D01*
X109113032Y-102684320D01*
X109171785Y-102769018D01*
X109197595Y-102876087D01*
X109190674Y-102989403D01*
X109151229Y-103092847D01*
X109107008Y-103148324D01*
X109048453Y-103193783D01*
X108979848Y-103224942D01*
X108890797Y-103244143D01*
X108770903Y-103253732D01*
X108629066Y-103256080D01*
X108351320Y-103256080D01*
X108351320Y-102748080D01*
X108605320Y-102748080D01*
X108605320Y-103052880D01*
X108713968Y-103052880D01*
X108796653Y-103043664D01*
X108866498Y-103020782D01*
X108879068Y-103013339D01*
X108924853Y-102953821D01*
X108932719Y-102877833D01*
X108901437Y-102804044D01*
X108893483Y-102794530D01*
X108839418Y-102761116D01*
X108750874Y-102748413D01*
X108728383Y-102748080D01*
X108605320Y-102748080D01*
X108351320Y-102748080D01*
X108351320Y-102290880D01*
X108605320Y-102290880D01*
X108605320Y-102544880D01*
X108701268Y-102544880D01*
X108781226Y-102534375D01*
X108848455Y-102508742D01*
X108853668Y-102505339D01*
X108898575Y-102449058D01*
X108908041Y-102380557D01*
X108879640Y-102321360D01*
X108837486Y-102303242D01*
X108765703Y-102292324D01*
X108727240Y-102290880D01*
X108605320Y-102290880D01*
X108351320Y-102290880D01*
X108351320Y-102055887D01*
X108637070Y-102067729D01*
G36*
X119959120Y-104373680D02*
X107233720Y-104373680D01*
X107233720Y-99398652D01*
X107459558Y-99398652D01*
X107459602Y-99817214D01*
X107459895Y-100233678D01*
X107460438Y-100644932D01*
X107461230Y-101047864D01*
X107462271Y-101439363D01*
X107463563Y-101816317D01*
X107465103Y-102175614D01*
X107466894Y-102514142D01*
X107468933Y-102828791D01*
X107471223Y-103116449D01*
X107473762Y-103374003D01*
X107476550Y-103598342D01*
X107479588Y-103786355D01*
X107482876Y-103934930D01*
X107486413Y-104040954D01*
X107490199Y-104101318D01*
X107492799Y-104114600D01*
X107507149Y-104118049D01*
X107544051Y-104121251D01*
X107605012Y-104124212D01*
X107691539Y-104126940D01*
X107805139Y-104129444D01*
X107947318Y-104131729D01*
X108119583Y-104133805D01*
X108323442Y-104135677D01*
X108560401Y-104137355D01*
X108831967Y-104138845D01*
X109139646Y-104140154D01*
X109484946Y-104141291D01*
X109869373Y-104142263D01*
X110294435Y-104143078D01*
X110761637Y-104143742D01*
X111272488Y-104144264D01*
X111828493Y-104144651D01*
X112431160Y-104144910D01*
X113081995Y-104145049D01*
X113600059Y-104145080D01*
X119676839Y-104145080D01*
X119716379Y-104088628D01*
X119721340Y-104077844D01*
X119725873Y-104058831D01*
X119729997Y-104029408D01*
X119733732Y-103987392D01*
X119737096Y-103930603D01*
X119740107Y-103856859D01*
X119742787Y-103763979D01*
X119745151Y-103649781D01*
X119747221Y-103512085D01*
X119749015Y-103348707D01*
X119750551Y-103157468D01*
X119751848Y-102936186D01*
X119752926Y-102682679D01*
X119753804Y-102394766D01*
X119754499Y-102070266D01*
X119755032Y-101706997D01*
X119755420Y-101302778D01*
X119755684Y-100855427D01*
X119755841Y-100362763D01*
X119755911Y-99822604D01*
X119755920Y-99524978D01*
X119755894Y-98961615D01*
X119755806Y-98446852D01*
X119755633Y-97978486D01*
X119755355Y-97554317D01*
X119754953Y-97172143D01*
X119754406Y-96829764D01*
X119753694Y-96524978D01*
X119752796Y-96255584D01*
X119751692Y-96019381D01*
X119750362Y-95814168D01*
X119748785Y-95637744D01*
X119746941Y-95487908D01*
X119744810Y-95362458D01*
X119742371Y-95259193D01*
X119739604Y-95175913D01*
X119736489Y-95110416D01*
X119733006Y-95060501D01*
X119729134Y-95023968D01*
X119724852Y-94998614D01*
X119720141Y-94982238D01*
X119714981Y-94972640D01*
X119713883Y-94971330D01*
X119708028Y-94966314D01*
X119698615Y-94961673D01*
X119683740Y-94957392D01*
X119661496Y-94953456D01*
X119629976Y-94949850D01*
X119587275Y-94946561D01*
X119531486Y-94943573D01*
X119460704Y-94940873D01*
X119373022Y-94938445D01*
X119266533Y-94936276D01*
X119139332Y-94934350D01*
X118989513Y-94932654D01*
X118815170Y-94931172D01*
X118614395Y-94929891D01*
X118385284Y-94928796D01*
X118125930Y-94927873D01*
X117834427Y-94927106D01*
X117508868Y-94926482D01*
X117147348Y-94925985D01*
X116747960Y-94925603D01*
X116308799Y-94925319D01*
X115827957Y-94925120D01*
X115303530Y-94924991D01*
X114733610Y-94924918D01*
X114116292Y-94924885D01*
X113597563Y-94924880D01*
X112909939Y-94924934D01*
X112271607Y-94925103D01*
X111681062Y-94925394D01*
X111136795Y-94925815D01*
X110637299Y-94926372D01*
X110181067Y-94927074D01*
X109766593Y-94927928D01*
X109392368Y-94928942D01*
X109056886Y-94930123D01*
X108758640Y-94931478D01*
X108496123Y-94933015D01*
X108267826Y-94934742D01*
X108072245Y-94936667D01*
X107907870Y-94938796D01*
X107773195Y-94941137D01*
X107666713Y-94943698D01*
X107586917Y-94946486D01*
X107532300Y-94949509D01*
X107501354Y-94952775D01*
X107492799Y-94955360D01*
X107488850Y-94984314D01*
X107485151Y-95060957D01*
X107481701Y-95182176D01*
X107478500Y-95344859D01*
X107475549Y-95545895D01*
X107472848Y-95782173D01*
X107470396Y-96050580D01*
X107468194Y-96348005D01*
X107466241Y-96671336D01*
X107464538Y-97017461D01*
X107463084Y-97383270D01*
X107461880Y-97765650D01*
X107460925Y-98161490D01*
X107460220Y-98567678D01*
X107459764Y-98981102D01*
X107459558Y-99398652D01*
X107233720Y-99398652D01*
X107233720Y-94696280D01*
X119959120Y-94696280D01*
X119959120Y-104373680D01*
X119959120Y-104373680D01*
G37*
X119959120Y-104373680D02*
X107233720Y-104373680D01*
X107233720Y-99398652D01*
X107459558Y-99398652D01*
X107459602Y-99817214D01*
X107459895Y-100233678D01*
X107460438Y-100644932D01*
X107461230Y-101047864D01*
X107462271Y-101439363D01*
X107463563Y-101816317D01*
X107465103Y-102175614D01*
X107466894Y-102514142D01*
X107468933Y-102828791D01*
X107471223Y-103116449D01*
X107473762Y-103374003D01*
X107476550Y-103598342D01*
X107479588Y-103786355D01*
X107482876Y-103934930D01*
X107486413Y-104040954D01*
X107490199Y-104101318D01*
X107492799Y-104114600D01*
X107507149Y-104118049D01*
X107544051Y-104121251D01*
X107605012Y-104124212D01*
X107691539Y-104126940D01*
X107805139Y-104129444D01*
X107947318Y-104131729D01*
X108119583Y-104133805D01*
X108323442Y-104135677D01*
X108560401Y-104137355D01*
X108831967Y-104138845D01*
X109139646Y-104140154D01*
X109484946Y-104141291D01*
X109869373Y-104142263D01*
X110294435Y-104143078D01*
X110761637Y-104143742D01*
X111272488Y-104144264D01*
X111828493Y-104144651D01*
X112431160Y-104144910D01*
X113081995Y-104145049D01*
X113600059Y-104145080D01*
X119676839Y-104145080D01*
X119716379Y-104088628D01*
X119721340Y-104077844D01*
X119725873Y-104058831D01*
X119729997Y-104029408D01*
X119733732Y-103987392D01*
X119737096Y-103930603D01*
X119740107Y-103856859D01*
X119742787Y-103763979D01*
X119745151Y-103649781D01*
X119747221Y-103512085D01*
X119749015Y-103348707D01*
X119750551Y-103157468D01*
X119751848Y-102936186D01*
X119752926Y-102682679D01*
X119753804Y-102394766D01*
X119754499Y-102070266D01*
X119755032Y-101706997D01*
X119755420Y-101302778D01*
X119755684Y-100855427D01*
X119755841Y-100362763D01*
X119755911Y-99822604D01*
X119755920Y-99524978D01*
X119755894Y-98961615D01*
X119755806Y-98446852D01*
X119755633Y-97978486D01*
X119755355Y-97554317D01*
X119754953Y-97172143D01*
X119754406Y-96829764D01*
X119753694Y-96524978D01*
X119752796Y-96255584D01*
X119751692Y-96019381D01*
X119750362Y-95814168D01*
X119748785Y-95637744D01*
X119746941Y-95487908D01*
X119744810Y-95362458D01*
X119742371Y-95259193D01*
X119739604Y-95175913D01*
X119736489Y-95110416D01*
X119733006Y-95060501D01*
X119729134Y-95023968D01*
X119724852Y-94998614D01*
X119720141Y-94982238D01*
X119714981Y-94972640D01*
X119713883Y-94971330D01*
X119708028Y-94966314D01*
X119698615Y-94961673D01*
X119683740Y-94957392D01*
X119661496Y-94953456D01*
X119629976Y-94949850D01*
X119587275Y-94946561D01*
X119531486Y-94943573D01*
X119460704Y-94940873D01*
X119373022Y-94938445D01*
X119266533Y-94936276D01*
X119139332Y-94934350D01*
X118989513Y-94932654D01*
X118815170Y-94931172D01*
X118614395Y-94929891D01*
X118385284Y-94928796D01*
X118125930Y-94927873D01*
X117834427Y-94927106D01*
X117508868Y-94926482D01*
X117147348Y-94925985D01*
X116747960Y-94925603D01*
X116308799Y-94925319D01*
X115827957Y-94925120D01*
X115303530Y-94924991D01*
X114733610Y-94924918D01*
X114116292Y-94924885D01*
X113597563Y-94924880D01*
X112909939Y-94924934D01*
X112271607Y-94925103D01*
X111681062Y-94925394D01*
X111136795Y-94925815D01*
X110637299Y-94926372D01*
X110181067Y-94927074D01*
X109766593Y-94927928D01*
X109392368Y-94928942D01*
X109056886Y-94930123D01*
X108758640Y-94931478D01*
X108496123Y-94933015D01*
X108267826Y-94934742D01*
X108072245Y-94936667D01*
X107907870Y-94938796D01*
X107773195Y-94941137D01*
X107666713Y-94943698D01*
X107586917Y-94946486D01*
X107532300Y-94949509D01*
X107501354Y-94952775D01*
X107492799Y-94955360D01*
X107488850Y-94984314D01*
X107485151Y-95060957D01*
X107481701Y-95182176D01*
X107478500Y-95344859D01*
X107475549Y-95545895D01*
X107472848Y-95782173D01*
X107470396Y-96050580D01*
X107468194Y-96348005D01*
X107466241Y-96671336D01*
X107464538Y-97017461D01*
X107463084Y-97383270D01*
X107461880Y-97765650D01*
X107460925Y-98161490D01*
X107460220Y-98567678D01*
X107459764Y-98981102D01*
X107459558Y-99398652D01*
X107233720Y-99398652D01*
X107233720Y-94696280D01*
X119959120Y-94696280D01*
X119959120Y-104373680D01*
G04 #@! TO.C,C7*
D13*
X143631333Y-122977142D02*
X143583714Y-123024761D01*
X143440857Y-123072380D01*
X143345619Y-123072380D01*
X143202761Y-123024761D01*
X143107523Y-122929523D01*
X143059904Y-122834285D01*
X143012285Y-122643809D01*
X143012285Y-122500952D01*
X143059904Y-122310476D01*
X143107523Y-122215238D01*
X143202761Y-122120000D01*
X143345619Y-122072380D01*
X143440857Y-122072380D01*
X143583714Y-122120000D01*
X143631333Y-122167619D01*
X143964666Y-122072380D02*
X144631333Y-122072380D01*
X144202761Y-123072380D01*
G04 #@! TO.C,R5*
X139313333Y-131962380D02*
X138980000Y-131486190D01*
X138741904Y-131962380D02*
X138741904Y-130962380D01*
X139122857Y-130962380D01*
X139218095Y-131010000D01*
X139265714Y-131057619D01*
X139313333Y-131152857D01*
X139313333Y-131295714D01*
X139265714Y-131390952D01*
X139218095Y-131438571D01*
X139122857Y-131486190D01*
X138741904Y-131486190D01*
X140218095Y-130962380D02*
X139741904Y-130962380D01*
X139694285Y-131438571D01*
X139741904Y-131390952D01*
X139837142Y-131343333D01*
X140075238Y-131343333D01*
X140170476Y-131390952D01*
X140218095Y-131438571D01*
X140265714Y-131533809D01*
X140265714Y-131771904D01*
X140218095Y-131867142D01*
X140170476Y-131914761D01*
X140075238Y-131962380D01*
X139837142Y-131962380D01*
X139741904Y-131914761D01*
X139694285Y-131867142D01*
G04 #@! TO.C,R9*
X139429766Y-127442627D02*
X139096433Y-126966437D01*
X138858337Y-127442627D02*
X138858337Y-126442627D01*
X139239290Y-126442627D01*
X139334528Y-126490247D01*
X139382147Y-126537866D01*
X139429766Y-126633104D01*
X139429766Y-126775961D01*
X139382147Y-126871199D01*
X139334528Y-126918818D01*
X139239290Y-126966437D01*
X138858337Y-126966437D01*
X139905956Y-127442627D02*
X140096433Y-127442627D01*
X140191671Y-127395008D01*
X140239290Y-127347389D01*
X140334528Y-127204532D01*
X140382147Y-127014056D01*
X140382147Y-126633104D01*
X140334528Y-126537866D01*
X140286909Y-126490247D01*
X140191671Y-126442627D01*
X140001194Y-126442627D01*
X139905956Y-126490247D01*
X139858337Y-126537866D01*
X139810718Y-126633104D01*
X139810718Y-126871199D01*
X139858337Y-126966437D01*
X139905956Y-127014056D01*
X140001194Y-127061675D01*
X140191671Y-127061675D01*
X140286909Y-127014056D01*
X140334528Y-126966437D01*
X140382147Y-126871199D01*
G04 #@! TO.C,R7*
X139279333Y-118466380D02*
X138946000Y-117990190D01*
X138707904Y-118466380D02*
X138707904Y-117466380D01*
X139088857Y-117466380D01*
X139184095Y-117514000D01*
X139231714Y-117561619D01*
X139279333Y-117656857D01*
X139279333Y-117799714D01*
X139231714Y-117894952D01*
X139184095Y-117942571D01*
X139088857Y-117990190D01*
X138707904Y-117990190D01*
X139612666Y-117466380D02*
X140279333Y-117466380D01*
X139850761Y-118466380D01*
G04 #@! TO.C,R6*
X131324380Y-122628666D02*
X130848190Y-122962000D01*
X131324380Y-123200095D02*
X130324380Y-123200095D01*
X130324380Y-122819142D01*
X130372000Y-122723904D01*
X130419619Y-122676285D01*
X130514857Y-122628666D01*
X130657714Y-122628666D01*
X130752952Y-122676285D01*
X130800571Y-122723904D01*
X130848190Y-122819142D01*
X130848190Y-123200095D01*
X130324380Y-121771523D02*
X130324380Y-121962000D01*
X130372000Y-122057238D01*
X130419619Y-122104857D01*
X130562476Y-122200095D01*
X130752952Y-122247714D01*
X131133904Y-122247714D01*
X131229142Y-122200095D01*
X131276761Y-122152476D01*
X131324380Y-122057238D01*
X131324380Y-121866761D01*
X131276761Y-121771523D01*
X131229142Y-121723904D01*
X131133904Y-121676285D01*
X130895809Y-121676285D01*
X130800571Y-121723904D01*
X130752952Y-121771523D01*
X130705333Y-121866761D01*
X130705333Y-122057238D01*
X130752952Y-122152476D01*
X130800571Y-122200095D01*
X130895809Y-122247714D01*
G04 #@! TO.C,R10*
X120295142Y-118878380D02*
X119961809Y-118402190D01*
X119723714Y-118878380D02*
X119723714Y-117878380D01*
X120104666Y-117878380D01*
X120199904Y-117926000D01*
X120247523Y-117973619D01*
X120295142Y-118068857D01*
X120295142Y-118211714D01*
X120247523Y-118306952D01*
X120199904Y-118354571D01*
X120104666Y-118402190D01*
X119723714Y-118402190D01*
X121247523Y-118878380D02*
X120676095Y-118878380D01*
X120961809Y-118878380D02*
X120961809Y-117878380D01*
X120866571Y-118021238D01*
X120771333Y-118116476D01*
X120676095Y-118164095D01*
X121866571Y-117878380D02*
X121961809Y-117878380D01*
X122057047Y-117926000D01*
X122104666Y-117973619D01*
X122152285Y-118068857D01*
X122199904Y-118259333D01*
X122199904Y-118497428D01*
X122152285Y-118687904D01*
X122104666Y-118783142D01*
X122057047Y-118830761D01*
X121961809Y-118878380D01*
X121866571Y-118878380D01*
X121771333Y-118830761D01*
X121723714Y-118783142D01*
X121676095Y-118687904D01*
X121628476Y-118497428D01*
X121628476Y-118259333D01*
X121676095Y-118068857D01*
X121723714Y-117973619D01*
X121771333Y-117926000D01*
X121866571Y-117878380D01*
G04 #@! TO.C,C1*
X110611333Y-131105142D02*
X110563714Y-131152761D01*
X110420857Y-131200380D01*
X110325619Y-131200380D01*
X110182761Y-131152761D01*
X110087523Y-131057523D01*
X110039904Y-130962285D01*
X109992285Y-130771809D01*
X109992285Y-130628952D01*
X110039904Y-130438476D01*
X110087523Y-130343238D01*
X110182761Y-130248000D01*
X110325619Y-130200380D01*
X110420857Y-130200380D01*
X110563714Y-130248000D01*
X110611333Y-130295619D01*
X111563714Y-131200380D02*
X110992285Y-131200380D01*
X111278000Y-131200380D02*
X111278000Y-130200380D01*
X111182761Y-130343238D01*
X111087523Y-130438476D01*
X110992285Y-130486095D01*
G04 #@! TO.C,C2*
X110611333Y-127041142D02*
X110563714Y-127088761D01*
X110420857Y-127136380D01*
X110325619Y-127136380D01*
X110182761Y-127088761D01*
X110087523Y-126993523D01*
X110039904Y-126898285D01*
X109992285Y-126707809D01*
X109992285Y-126564952D01*
X110039904Y-126374476D01*
X110087523Y-126279238D01*
X110182761Y-126184000D01*
X110325619Y-126136380D01*
X110420857Y-126136380D01*
X110563714Y-126184000D01*
X110611333Y-126231619D01*
X110992285Y-126231619D02*
X111039904Y-126184000D01*
X111135142Y-126136380D01*
X111373238Y-126136380D01*
X111468476Y-126184000D01*
X111516095Y-126231619D01*
X111563714Y-126326857D01*
X111563714Y-126422095D01*
X111516095Y-126564952D01*
X110944666Y-127136380D01*
X111563714Y-127136380D01*
G04 #@! TO.C,C3*
X110865333Y-112309142D02*
X110817714Y-112356761D01*
X110674857Y-112404380D01*
X110579619Y-112404380D01*
X110436761Y-112356761D01*
X110341523Y-112261523D01*
X110293904Y-112166285D01*
X110246285Y-111975809D01*
X110246285Y-111832952D01*
X110293904Y-111642476D01*
X110341523Y-111547238D01*
X110436761Y-111452000D01*
X110579619Y-111404380D01*
X110674857Y-111404380D01*
X110817714Y-111452000D01*
X110865333Y-111499619D01*
X111198666Y-111404380D02*
X111817714Y-111404380D01*
X111484380Y-111785333D01*
X111627238Y-111785333D01*
X111722476Y-111832952D01*
X111770095Y-111880571D01*
X111817714Y-111975809D01*
X111817714Y-112213904D01*
X111770095Y-112309142D01*
X111722476Y-112356761D01*
X111627238Y-112404380D01*
X111341523Y-112404380D01*
X111246285Y-112356761D01*
X111198666Y-112309142D01*
G04 #@! TO.C,C4*
X110865333Y-117389142D02*
X110817714Y-117436761D01*
X110674857Y-117484380D01*
X110579619Y-117484380D01*
X110436761Y-117436761D01*
X110341523Y-117341523D01*
X110293904Y-117246285D01*
X110246285Y-117055809D01*
X110246285Y-116912952D01*
X110293904Y-116722476D01*
X110341523Y-116627238D01*
X110436761Y-116532000D01*
X110579619Y-116484380D01*
X110674857Y-116484380D01*
X110817714Y-116532000D01*
X110865333Y-116579619D01*
X111722476Y-116817714D02*
X111722476Y-117484380D01*
X111484380Y-116436761D02*
X111246285Y-117151047D01*
X111865333Y-117151047D01*
G04 #@! TO.C,C5*
X110865333Y-107737142D02*
X110817714Y-107784761D01*
X110674857Y-107832380D01*
X110579619Y-107832380D01*
X110436761Y-107784761D01*
X110341523Y-107689523D01*
X110293904Y-107594285D01*
X110246285Y-107403809D01*
X110246285Y-107260952D01*
X110293904Y-107070476D01*
X110341523Y-106975238D01*
X110436761Y-106880000D01*
X110579619Y-106832380D01*
X110674857Y-106832380D01*
X110817714Y-106880000D01*
X110865333Y-106927619D01*
X111770095Y-106832380D02*
X111293904Y-106832380D01*
X111246285Y-107308571D01*
X111293904Y-107260952D01*
X111389142Y-107213333D01*
X111627238Y-107213333D01*
X111722476Y-107260952D01*
X111770095Y-107308571D01*
X111817714Y-107403809D01*
X111817714Y-107641904D01*
X111770095Y-107737142D01*
X111722476Y-107784761D01*
X111627238Y-107832380D01*
X111389142Y-107832380D01*
X111293904Y-107784761D01*
X111246285Y-107737142D01*
G04 #@! TO.C,C6*
X131229142Y-127928666D02*
X131276761Y-127976285D01*
X131324380Y-128119142D01*
X131324380Y-128214380D01*
X131276761Y-128357238D01*
X131181523Y-128452476D01*
X131086285Y-128500095D01*
X130895809Y-128547714D01*
X130752952Y-128547714D01*
X130562476Y-128500095D01*
X130467238Y-128452476D01*
X130372000Y-128357238D01*
X130324380Y-128214380D01*
X130324380Y-128119142D01*
X130372000Y-127976285D01*
X130419619Y-127928666D01*
X130324380Y-127071523D02*
X130324380Y-127262000D01*
X130372000Y-127357238D01*
X130419619Y-127404857D01*
X130562476Y-127500095D01*
X130752952Y-127547714D01*
X131133904Y-127547714D01*
X131229142Y-127500095D01*
X131276761Y-127452476D01*
X131324380Y-127357238D01*
X131324380Y-127166761D01*
X131276761Y-127071523D01*
X131229142Y-127023904D01*
X131133904Y-126976285D01*
X130895809Y-126976285D01*
X130800571Y-127023904D01*
X130752952Y-127071523D01*
X130705333Y-127166761D01*
X130705333Y-127357238D01*
X130752952Y-127452476D01*
X130800571Y-127500095D01*
X130895809Y-127547714D01*
G04 #@! TO.C,R1*
X116419333Y-114560380D02*
X116086000Y-114084190D01*
X115847904Y-114560380D02*
X115847904Y-113560380D01*
X116228857Y-113560380D01*
X116324095Y-113608000D01*
X116371714Y-113655619D01*
X116419333Y-113750857D01*
X116419333Y-113893714D01*
X116371714Y-113988952D01*
X116324095Y-114036571D01*
X116228857Y-114084190D01*
X115847904Y-114084190D01*
X117371714Y-114560380D02*
X116800285Y-114560380D01*
X117086000Y-114560380D02*
X117086000Y-113560380D01*
X116990761Y-113703238D01*
X116895523Y-113798476D01*
X116800285Y-113846095D01*
G04 #@! TO.C,R2*
X125275333Y-112404380D02*
X124942000Y-111928190D01*
X124703904Y-112404380D02*
X124703904Y-111404380D01*
X125084857Y-111404380D01*
X125180095Y-111452000D01*
X125227714Y-111499619D01*
X125275333Y-111594857D01*
X125275333Y-111737714D01*
X125227714Y-111832952D01*
X125180095Y-111880571D01*
X125084857Y-111928190D01*
X124703904Y-111928190D01*
X125656285Y-111499619D02*
X125703904Y-111452000D01*
X125799142Y-111404380D01*
X126037238Y-111404380D01*
X126132476Y-111452000D01*
X126180095Y-111499619D01*
X126227714Y-111594857D01*
X126227714Y-111690095D01*
X126180095Y-111832952D01*
X125608666Y-112404380D01*
X126227714Y-112404380D01*
G04 #@! TO.C,R3*
X129956432Y-115042964D02*
X129623099Y-114566774D01*
X129385003Y-115042964D02*
X129385003Y-114042964D01*
X129765956Y-114042964D01*
X129861194Y-114090584D01*
X129908813Y-114138203D01*
X129956432Y-114233441D01*
X129956432Y-114376298D01*
X129908813Y-114471536D01*
X129861194Y-114519155D01*
X129765956Y-114566774D01*
X129385003Y-114566774D01*
X130289765Y-114042964D02*
X130908813Y-114042964D01*
X130575479Y-114423917D01*
X130718337Y-114423917D01*
X130813575Y-114471536D01*
X130861194Y-114519155D01*
X130908813Y-114614393D01*
X130908813Y-114852488D01*
X130861194Y-114947726D01*
X130813575Y-114995345D01*
X130718337Y-115042964D01*
X130432622Y-115042964D01*
X130337384Y-114995345D01*
X130289765Y-114947726D01*
G04 #@! TO.C,R4*
X133911333Y-112404380D02*
X133578000Y-111928190D01*
X133339904Y-112404380D02*
X133339904Y-111404380D01*
X133720857Y-111404380D01*
X133816095Y-111452000D01*
X133863714Y-111499619D01*
X133911333Y-111594857D01*
X133911333Y-111737714D01*
X133863714Y-111832952D01*
X133816095Y-111880571D01*
X133720857Y-111928190D01*
X133339904Y-111928190D01*
X134768476Y-111737714D02*
X134768476Y-112404380D01*
X134530380Y-111356761D02*
X134292285Y-112071047D01*
X134911333Y-112071047D01*
G04 #@! TO.C,R8*
X132709333Y-127390380D02*
X132376000Y-126914190D01*
X132137904Y-127390380D02*
X132137904Y-126390380D01*
X132518857Y-126390380D01*
X132614095Y-126438000D01*
X132661714Y-126485619D01*
X132709333Y-126580857D01*
X132709333Y-126723714D01*
X132661714Y-126818952D01*
X132614095Y-126866571D01*
X132518857Y-126914190D01*
X132137904Y-126914190D01*
X133280761Y-126818952D02*
X133185523Y-126771333D01*
X133137904Y-126723714D01*
X133090285Y-126628476D01*
X133090285Y-126580857D01*
X133137904Y-126485619D01*
X133185523Y-126438000D01*
X133280761Y-126390380D01*
X133471238Y-126390380D01*
X133566476Y-126438000D01*
X133614095Y-126485619D01*
X133661714Y-126580857D01*
X133661714Y-126628476D01*
X133614095Y-126723714D01*
X133566476Y-126771333D01*
X133471238Y-126818952D01*
X133280761Y-126818952D01*
X133185523Y-126866571D01*
X133137904Y-126914190D01*
X133090285Y-127009428D01*
X133090285Y-127199904D01*
X133137904Y-127295142D01*
X133185523Y-127342761D01*
X133280761Y-127390380D01*
X133471238Y-127390380D01*
X133566476Y-127342761D01*
X133614095Y-127295142D01*
X133661714Y-127199904D01*
X133661714Y-127009428D01*
X133614095Y-126914190D01*
X133566476Y-126866571D01*
X133471238Y-126818952D01*
G04 #@! TO.C,J1*
X126666666Y-140930380D02*
X126666666Y-141644666D01*
X126619047Y-141787523D01*
X126523809Y-141882761D01*
X126380952Y-141930380D01*
X126285714Y-141930380D01*
X127666666Y-141930380D02*
X127095238Y-141930380D01*
X127380952Y-141930380D02*
X127380952Y-140930380D01*
X127285714Y-141073238D01*
X127190476Y-141168476D01*
X127095238Y-141216095D01*
G04 #@! TO.C,L1*
X113480380Y-124626666D02*
X113480380Y-125102857D01*
X112480380Y-125102857D01*
X113480380Y-123769523D02*
X113480380Y-124340952D01*
X113480380Y-124055238D02*
X112480380Y-124055238D01*
X112623238Y-124150476D01*
X112718476Y-124245714D01*
X112766095Y-124340952D01*
G04 #@! TO.C,U1*
X126304095Y-104807380D02*
X126304095Y-105616904D01*
X126351714Y-105712142D01*
X126399333Y-105759761D01*
X126494571Y-105807380D01*
X126685047Y-105807380D01*
X126780285Y-105759761D01*
X126827904Y-105712142D01*
X126875523Y-105616904D01*
X126875523Y-104807380D01*
X127875523Y-105807380D02*
X127304095Y-105807380D01*
X127589809Y-105807380D02*
X127589809Y-104807380D01*
X127494571Y-104950238D01*
X127399333Y-105045476D01*
X127304095Y-105093095D01*
G04 #@! TD*
M02*
