(module SMD_0306 (layer F.Cu) (tedit 59F4E24B)
  (fp_text reference REF** (at 0 1.5875) (layer F.SilkS)
    (effects (font (size 1 1) (thickness 0.15)))
  )
  (fp_text value SMD_0306 (at 0 -1.778) (layer F.Fab)
    (effects (font (size 1 1) (thickness 0.15)))
  )
  (fp_line (start 0.9 -0.3) (end 0.9 0.3) (layer F.SilkS) (width 0.15))
  (fp_line (start -0.9 -0.3) (end -0.9 0.3) (layer F.SilkS) (width 0.15))
  (pad 1 smd rect (at 0 0.55) (size 1.6 0.5) (layers F.Cu F.Paste F.Mask))
  (pad 2 smd rect (at 0 -0.55) (size 1.6 0.5) (layers F.Cu F.Paste F.Mask))
)
