EESchema Schematic File Version 4
LIBS:linPOL12V_TestBoard-cache
EELAYER 26 0
EELAYER END
$Descr A4 11693 8268
encoding utf-8
Sheet 1 1
Title "linPOL12V Test Board"
Date ""
Rev ""
Comp ""
Comment1 ""
Comment2 ""
Comment3 ""
Comment4 ""
$EndDescr
$Comp
L Device:C C1
U 1 1 5B7C9A1C
P 2700 1850
F 0 "C1" H 2815 1896 50  0000 L CNN
F 1 "10 p" H 2815 1805 50  0000 L CNN
F 2 "digikey-footprints:0805" H 2738 1700 50  0001 C CNN
F 3 "~" H 2700 1850 50  0001 C CNN
	1    2700 1850
	1    0    0    -1  
$EndComp
$Comp
L Device:C C2
U 1 1 5B7C9AE7
P 3100 1850
F 0 "C2" H 3215 1896 50  0000 L CNN
F 1 "22 u" H 3215 1805 50  0000 L CNN
F 2 "digikey-footprints:0805" H 3138 1700 50  0001 C CNN
F 3 "~" H 3100 1850 50  0001 C CNN
	1    3100 1850
	1    0    0    -1  
$EndComp
$Comp
L Device:C C3
U 1 1 5B7C9B1D
P 3900 1850
F 0 "C3" H 4015 1896 50  0000 L CNN
F 1 "10 u" H 4015 1805 50  0000 L CNN
F 2 "digikey-footprints:0805" H 3938 1700 50  0001 C CNN
F 3 "~" H 3900 1850 50  0001 C CNN
	1    3900 1850
	1    0    0    -1  
$EndComp
$Comp
L Device:C C4
U 1 1 5B7C9B55
P 4300 1850
F 0 "C4" H 4415 1896 50  0000 L CNN
F 1 "10 u" H 4415 1805 50  0000 L CNN
F 2 "digikey-footprints:0805" H 4338 1700 50  0001 C CNN
F 3 "~" H 4300 1850 50  0001 C CNN
	1    4300 1850
	1    0    0    -1  
$EndComp
$Comp
L Device:C C5
U 1 1 5B7C9B87
P 4700 1850
F 0 "C5" H 4815 1896 50  0000 L CNN
F 1 "100 n" H 4815 1805 50  0000 L CNN
F 2 "digikey-footprints:0805" H 4738 1700 50  0001 C CNN
F 3 "~" H 4700 1850 50  0001 C CNN
	1    4700 1850
	1    0    0    -1  
$EndComp
$Comp
L Device:R R1
U 1 1 5B7C9C11
P 4500 2350
F 0 "R1" H 4570 2396 50  0000 L CNN
F 1 "10 k" H 4570 2305 50  0000 L CNN
F 2 "digikey-footprints:0805" V 4430 2350 50  0001 C CNN
F 3 "~" H 4500 2350 50  0001 C CNN
	1    4500 2350
	1    0    0    -1  
$EndComp
$Comp
L Device:R R8
U 1 1 5B7C9D2F
P 7500 2350
F 0 "R8" H 7450 2550 50  0000 L CNN
F 1 "3 k" V 7400 2300 50  0000 L CNN
F 2 "digikey-footprints:0805" V 7430 2350 50  0001 C CNN
F 3 "~" H 7500 2350 50  0001 C CNN
	1    7500 2350
	1    0    0    -1  
$EndComp
$Comp
L Device:R R6
U 1 1 5B7C9D81
P 6900 2350
F 0 "R6" H 6850 2550 50  0000 L CNN
F 1 "300 m" V 6800 2250 50  0000 L CNN
F 2 "digikey-footprints:0805" V 6830 2350 50  0001 C CNN
F 3 "~" H 6900 2350 50  0001 C CNN
	1    6900 2350
	1    0    0    -1  
$EndComp
$Comp
L Device:R R7
U 1 1 5B7C9DF3
P 7200 2350
F 0 "R7" H 7150 2550 50  0000 L CNN
F 1 "300 m" V 7100 2250 50  0000 L CNN
F 2 "digikey-footprints:0805" V 7130 2350 50  0001 C CNN
F 3 "~" H 7200 2350 50  0001 C CNN
	1    7200 2350
	1    0    0    -1  
$EndComp
$Comp
L Device:C C6
U 1 1 5B7C9E27
P 6900 2850
F 0 "C6" H 7015 2896 50  0000 L CNN
F 1 "4.7 u" H 6950 2750 50  0000 L CNN
F 2 "digikey-footprints:0805" H 6938 2700 50  0001 C CNN
F 3 "~" H 6900 2850 50  0001 C CNN
	1    6900 2850
	1    0    0    -1  
$EndComp
$Comp
L Device:C C7
U 1 1 5B7C9E9F
P 7200 2850
F 0 "C7" H 7315 2896 50  0000 L CNN
F 1 "10 u" H 7300 2750 50  0000 L CNN
F 2 "digikey-footprints:0805" H 7238 2700 50  0001 C CNN
F 3 "~" H 7200 2850 50  0001 C CNN
	1    7200 2850
	1    0    0    -1  
$EndComp
$Comp
L Device:R R2
U 1 1 5B7C9F05
P 5550 2800
F 0 "R2" H 5620 2846 50  0000 L CNN
F 1 "R" H 5620 2755 50  0000 L CNN
F 2 "digikey-footprints:0805" V 5480 2800 50  0001 C CNN
F 3 "~" H 5550 2800 50  0001 C CNN
	1    5550 2800
	1    0    0    -1  
$EndComp
$Comp
L Device:R R3
U 1 1 5B7C9F4F
P 5550 3250
F 0 "R3" H 5620 3296 50  0000 L CNN
F 1 "R" H 5620 3205 50  0000 L CNN
F 2 "digikey-footprints:0805" V 5480 3250 50  0001 C CNN
F 3 "~" H 5550 3250 50  0001 C CNN
	1    5550 3250
	1    0    0    -1  
$EndComp
$Comp
L Device:R R4
U 1 1 5B7C9F8D
P 5950 2800
F 0 "R4" H 6020 2846 50  0000 L CNN
F 1 "R" H 6020 2755 50  0000 L CNN
F 2 "digikey-footprints:0805" V 5880 2800 50  0001 C CNN
F 3 "~" H 5950 2800 50  0001 C CNN
	1    5950 2800
	1    0    0    -1  
$EndComp
$Comp
L Device:R R5
U 1 1 5B7C9FE1
P 5950 3250
F 0 "R5" H 6020 3296 50  0000 L CNN
F 1 "R" H 6020 3205 50  0000 L CNN
F 2 "digikey-footprints:0805" V 5880 3250 50  0001 C CNN
F 3 "~" H 5950 3250 50  0001 C CNN
	1    5950 3250
	1    0    0    -1  
$EndComp
$Comp
L power:GND #PWR0101
U 1 1 5B7CA20B
P 6600 3300
F 0 "#PWR0101" H 6600 3050 50  0001 C CNN
F 1 "GND" H 6605 3127 50  0000 C CNN
F 2 "" H 6600 3300 50  0001 C CNN
F 3 "" H 6600 3300 50  0001 C CNN
	1    6600 3300
	1    0    0    -1  
$EndComp
$Comp
L power:GND #PWR0102
U 1 1 5B7CA2CD
P 4500 2750
F 0 "#PWR0102" H 4500 2500 50  0001 C CNN
F 1 "GND" H 4505 2577 50  0000 C CNN
F 2 "" H 4500 2750 50  0001 C CNN
F 3 "" H 4500 2750 50  0001 C CNN
	1    4500 2750
	1    0    0    -1  
$EndComp
$Comp
L Device:L L1
U 1 1 5B7CA53F
P 3500 1700
F 0 "L1" V 3690 1700 50  0000 C CNN
F 1 "12.3 n" V 3599 1700 50  0000 C CNN
F 2 "pbv3:0806SQ-12N" H 3500 1700 50  0001 C CNN
F 3 "~" H 3500 1700 50  0001 C CNN
	1    3500 1700
	0    -1   -1   0   
$EndComp
$Comp
L Device:R R9
U 1 1 5B7CB48E
P 7800 2350
F 0 "R9" H 7750 2550 50  0000 L CNN
F 1 "3 k" V 7700 2300 50  0000 L CNN
F 2 "digikey-footprints:0805" V 7730 2350 50  0001 C CNN
F 3 "~" H 7800 2350 50  0001 C CNN
	1    7800 2350
	1    0    0    -1  
$EndComp
Wire Wire Line
	2700 1700 3100 1700
Wire Wire Line
	3100 1700 3350 1700
Connection ~ 3100 1700
Wire Wire Line
	2700 2000 3100 2000
Wire Wire Line
	3100 2000 3900 2000
Connection ~ 3100 2000
Wire Wire Line
	3900 2000 4300 2000
Connection ~ 3900 2000
Wire Wire Line
	4300 2000 4700 2000
Connection ~ 4300 2000
Wire Wire Line
	3650 1700 3900 1700
Wire Wire Line
	3900 1700 4300 1700
Connection ~ 3900 1700
Wire Wire Line
	4300 1700 4700 1700
Connection ~ 4300 1700
Wire Wire Line
	4700 1700 5400 1700
Wire Wire Line
	5400 1700 5400 1900
Connection ~ 4700 1700
Wire Wire Line
	4500 2500 4500 2750
Wire Wire Line
	5550 2650 5550 2400
Wire Wire Line
	5550 2400 5400 2400
Wire Wire Line
	5400 2400 5400 2200
Wire Wire Line
	5950 2650 5950 2400
Wire Wire Line
	5950 2400 6250 2400
Wire Wire Line
	6250 2400 6250 2200
Wire Wire Line
	5550 2950 5550 3050
$Comp
L power:GND #PWR0103
U 1 1 5B7CD824
P 5550 3500
F 0 "#PWR0103" H 5550 3250 50  0001 C CNN
F 1 "GND" H 5555 3327 50  0000 C CNN
F 2 "" H 5550 3500 50  0001 C CNN
F 3 "" H 5550 3500 50  0001 C CNN
	1    5550 3500
	1    0    0    -1  
$EndComp
$Comp
L power:GND #PWR0104
U 1 1 5B7CD853
P 5950 3500
F 0 "#PWR0104" H 5950 3250 50  0001 C CNN
F 1 "GND" H 5955 3327 50  0000 C CNN
F 2 "" H 5950 3500 50  0001 C CNN
F 3 "" H 5950 3500 50  0001 C CNN
	1    5950 3500
	1    0    0    -1  
$EndComp
Wire Wire Line
	5950 3400 5950 3500
Wire Wire Line
	5550 3400 5550 3500
Wire Wire Line
	6250 2100 6600 2100
Wire Wire Line
	6600 2100 6600 3300
Connection ~ 5550 3050
Wire Wire Line
	5550 3050 5550 3100
Wire Wire Line
	5200 3050 5550 3050
Wire Wire Line
	6250 1900 6900 1900
Wire Wire Line
	6900 1900 6900 2200
Wire Wire Line
	6900 1900 7500 1900
Wire Wire Line
	7500 1900 7500 2200
Connection ~ 6900 1900
Wire Wire Line
	7500 1900 8300 1900
Connection ~ 7500 1900
Wire Wire Line
	6250 2000 7200 2000
Wire Wire Line
	7200 2000 7200 2200
Wire Wire Line
	7200 2000 7800 2000
Wire Wire Line
	7800 2000 7800 2200
Connection ~ 7200 2000
Wire Wire Line
	7800 2000 8300 2000
Connection ~ 7800 2000
Wire Wire Line
	6900 2500 6900 2700
Wire Wire Line
	7200 2500 7200 2700
Wire Wire Line
	6600 3300 6900 3300
Wire Wire Line
	7500 3300 7500 2500
Connection ~ 6600 3300
Wire Wire Line
	6900 3000 6900 3300
Connection ~ 6900 3300
Wire Wire Line
	6900 3300 7200 3300
Wire Wire Line
	7200 3000 7200 3300
Connection ~ 7200 3300
Wire Wire Line
	7200 3300 7500 3300
Wire Wire Line
	7500 3300 7800 3300
Wire Wire Line
	7800 3300 7800 2500
Connection ~ 7500 3300
Wire Wire Line
	4400 2150 4400 2550
Wire Wire Line
	2700 1700 2100 1700
Connection ~ 2700 1700
Wire Wire Line
	2700 2000 2400 2000
Connection ~ 2700 2000
Wire Wire Line
	2400 2000 2400 2150
Connection ~ 2400 2000
Wire Wire Line
	2400 2000 2100 2000
$Comp
L power:GND #PWR0105
U 1 1 5B7D917F
P 2400 2150
F 0 "#PWR0105" H 2400 1900 50  0001 C CNN
F 1 "GND" H 2405 1977 50  0000 C CNN
F 2 "" H 2400 2150 50  0001 C CNN
F 3 "" H 2400 2150 50  0001 C CNN
	1    2400 2150
	1    0    0    -1  
$EndComp
$Comp
L power:PWR_FLAG #FLG0101
U 1 1 5B7EE489
P 4150 3350
F 0 "#FLG0101" H 4150 3425 50  0001 C CNN
F 1 "PWR_FLAG" H 4150 3524 50  0000 C CNN
F 2 "" H 4150 3350 50  0001 C CNN
F 3 "~" H 4150 3350 50  0001 C CNN
	1    4150 3350
	1    0    0    -1  
$EndComp
$Comp
L power:PWR_FLAG #FLG0102
U 1 1 5B7EE533
P 4600 3350
F 0 "#FLG0102" H 4600 3425 50  0001 C CNN
F 1 "PWR_FLAG" H 4600 3524 50  0000 C CNN
F 2 "" H 4600 3350 50  0001 C CNN
F 3 "~" H 4600 3350 50  0001 C CNN
	1    4600 3350
	1    0    0    -1  
$EndComp
$Comp
L power:GND #PWR0106
U 1 1 5B7EE58A
P 4600 3350
F 0 "#PWR0106" H 4600 3100 50  0001 C CNN
F 1 "GND" H 4605 3177 50  0000 C CNN
F 2 "" H 4600 3350 50  0001 C CNN
F 3 "" H 4600 3350 50  0001 C CNN
	1    4600 3350
	1    0    0    -1  
$EndComp
Text Label 8250 1900 2    50   ~ 0
VOUT1V4
Text Label 8250 2000 2    50   ~ 0
VOUT3V3
Text Label 2250 1700 2    50   ~ 0
VIN
Text Label 2300 2000 2    50   ~ 0
VIN_RTN
Text Label 4400 2500 1    50   ~ 0
EN1V4
Wire Wire Line
	4150 3350 4150 3700
Text Label 4150 3550 1    50   ~ 0
VIN
Text Label 5250 3050 0    50   ~ 0
VOUT1V4
Wire Wire Line
	5950 2950 5950 3050
Wire Wire Line
	5950 3050 5600 3050
Connection ~ 5950 3050
Wire Wire Line
	5950 3050 5950 3100
Text Label 5650 3050 0    50   ~ 0
VOUT3V3
Wire Wire Line
	6250 2200 6500 2200
Connection ~ 6250 2200
Wire Wire Line
	5400 2200 5100 2200
Connection ~ 5400 2200
Text Label 5150 2200 0    50   ~ 0
FB1V4
Text Label 6300 2200 0    50   ~ 0
FB3V3
Wire Wire Line
	4900 2000 4400 2150
Wire Wire Line
	4900 2000 5400 2000
Connection ~ 4900 2000
Wire Wire Line
	4900 2000 4500 2200
Wire Wire Line
	5400 2100 5000 2100
Wire Wire Line
	5000 2100 5000 2200
Wire Wire Line
	5000 2100 4850 2150
Wire Wire Line
	4850 2150 4850 2550
Connection ~ 5000 2100
$Comp
L Device:R R10
U 1 1 5B802F65
P 5000 2350
F 0 "R10" H 5070 2396 50  0000 L CNN
F 1 "10 k" H 5070 2305 50  0000 L CNN
F 2 "digikey-footprints:0805" V 4930 2350 50  0001 C CNN
F 3 "~" H 5000 2350 50  0001 C CNN
	1    5000 2350
	1    0    0    -1  
$EndComp
$Comp
L power:GND #PWR0107
U 1 1 5B803026
P 5000 2750
F 0 "#PWR0107" H 5000 2500 50  0001 C CNN
F 1 "GND" H 5005 2577 50  0000 C CNN
F 2 "" H 5000 2750 50  0001 C CNN
F 3 "" H 5000 2750 50  0001 C CNN
	1    5000 2750
	1    0    0    -1  
$EndComp
Wire Wire Line
	5000 2500 5000 2750
Text Label 4850 2450 1    50   ~ 0
EN3V3
$Comp
L Connector_Generic:Conn_02x08_Odd_Even J1
U 1 1 5B806806
P 2350 3350
F 0 "J1" V 2354 2862 50  0000 R CNN
F 1 "Conn_02x08_Odd_Even" V 2445 2862 50  0000 R CNN
F 2 "Connector_Samtec_HLE_SMD:Samtec_HLE-116-02-xxx-DV_2x08_P2.54mm_Horizontal" H 2350 3350 50  0001 C CNN
F 3 "~" H 2350 3350 50  0001 C CNN
	1    2350 3350
	0    -1   1    0   
$EndComp
Wire Wire Line
	2150 3150 2150 2700
Wire Wire Line
	2050 2700 2050 3150
Wire Wire Line
	2250 3150 2250 2700
Wire Wire Line
	2350 3150 2350 2700
Wire Wire Line
	2450 3150 2450 2700
Wire Wire Line
	2550 3150 2550 2700
Wire Wire Line
	2650 3150 2650 2700
Wire Wire Line
	2750 3150 2750 2700
Wire Wire Line
	2750 3650 2750 4150
Wire Wire Line
	2650 3650 2650 4150
Wire Wire Line
	2550 3650 2550 4150
Wire Wire Line
	2450 3650 2450 4150
Wire Wire Line
	2350 3650 2350 4150
Wire Wire Line
	2250 3650 2250 4150
Wire Wire Line
	2150 3650 2150 4150
Wire Wire Line
	2050 3650 2050 4150
Text Label 2050 3050 1    50   ~ 0
VIN
Text Label 2150 3100 1    50   ~ 0
VIN_RTN
Text Label 2250 3100 1    50   ~ 0
EN1V4
Text Label 2350 3100 1    50   ~ 0
EN3V3
Text Label 2450 3100 1    50   ~ 0
FB1V4
Text Label 2050 3900 1    50   ~ 0
GND
Text Label 2150 3900 1    50   ~ 0
GND
Text Label 2250 3900 1    50   ~ 0
GND
Text Label 2350 3900 1    50   ~ 0
GND
Text Label 2450 3900 1    50   ~ 0
GND
Text Label 2550 3900 1    50   ~ 0
GND
Text Label 2650 3900 1    50   ~ 0
GND
Text Label 2750 3900 1    50   ~ 0
GND
$Comp
L myLib:LINPOL12V U1
U 1 1 5B836EFB
P 5850 1900
F 0 "U1" H 5800 2050 50  0000 C CNN
F 1 "LINPOL12V" H 5800 1500 50  0000 C CNN
F 2 "library:DFN-8_2x2mm_P0.5mm" H 5850 2050 50  0001 C CNN
F 3 "" H 5850 2050 50  0001 C CNN
	1    5850 1900
	1    0    0    -1  
$EndComp
Text Label 2750 3100 1    50   ~ 0
VOUT3V3
Text Label 2550 3100 1    50   ~ 0
VOUT1V4
Text Label 2650 3100 1    50   ~ 0
FB3V3
$Comp
L Mechanical:MountingHole MH1
U 1 1 5B83FBAB
P 5800 1350
F 0 "MH1" H 5900 1396 50  0000 L CNN
F 1 "MountingHole" H 5900 1305 50  0000 L CNN
F 2 "library:z_MountPTH_5mm" H 5800 1350 50  0001 C CNN
F 3 "~" H 5800 1350 50  0001 C CNN
	1    5800 1350
	1    0    0    -1  
$EndComp
$Comp
L Mechanical:MountingHole MH2
U 1 1 5B83FD13
P 6900 1400
F 0 "MH2" H 7000 1446 50  0000 L CNN
F 1 "MountingHole" H 7000 1355 50  0000 L CNN
F 2 "library:z_MountPTH_5mm" H 6900 1400 50  0001 C CNN
F 3 "~" H 6900 1400 50  0001 C CNN
	1    6900 1400
	1    0    0    -1  
$EndComp
Wire Wire Line
	5850 1950 5850 1850
Text Label 5850 1950 1    50   ~ 0
GND
$EndSCHEMATC
