G04 #@! TF.GenerationSoftware,KiCad,Pcbnew,5.0.0-fee4fd1~66~ubuntu16.04.1*
G04 #@! TF.CreationDate,2018-08-28T11:28:21-07:00*
G04 #@! TF.ProjectId,linPOL12V_TestBoard,6C696E504F4C3132565F54657374426F,rev?*
G04 #@! TF.SameCoordinates,Original*
G04 #@! TF.FileFunction,Copper,L2,Bot,Signal*
G04 #@! TF.FilePolarity,Positive*
%FSLAX46Y46*%
G04 Gerber Fmt 4.6, Leading zero omitted, Abs format (unit mm)*
G04 Created by KiCad (PCBNEW 5.0.0-fee4fd1~66~ubuntu16.04.1) date Tue Aug 28 11:28:21 2018*
%MOMM*%
%LPD*%
G01*
G04 APERTURE LIST*
G04 #@! TA.AperFunction,ComponentPad*
%ADD10C,6.350000*%
G04 #@! TD*
G04 #@! TA.AperFunction,ViaPad*
%ADD11C,1.016000*%
G04 #@! TD*
G04 #@! TA.AperFunction,Conductor*
%ADD12C,0.127000*%
G04 #@! TD*
G04 #@! TA.AperFunction,Conductor*
%ADD13C,0.254000*%
G04 #@! TD*
G04 APERTURE END LIST*
D10*
G04 #@! TO.P,MH1,1*
G04 #@! TO.N,N/C*
X126746000Y-150368000D03*
G04 #@! TD*
G04 #@! TO.P,MH2,1*
G04 #@! TO.N,N/C*
X126746000Y-99568000D03*
G04 #@! TD*
D11*
G04 #@! TO.N,GND*
X114554000Y-144018000D03*
X114950544Y-132606955D03*
X114808000Y-128524000D03*
X112151809Y-116597100D03*
X112147141Y-111562332D03*
X115570000Y-115316000D03*
X119888000Y-120142000D03*
X131105099Y-119732584D03*
X133858000Y-125222000D03*
X112170309Y-122127640D03*
X129032000Y-133096000D03*
X144829717Y-121304368D03*
X143510000Y-133350000D03*
X143914433Y-128830247D03*
X124968000Y-105664000D03*
X129032000Y-105664000D03*
X124460000Y-108458000D03*
X125984000Y-109220000D03*
X128016000Y-109220000D03*
X127000000Y-105664000D03*
X129035050Y-107699392D03*
G04 #@! TO.N,/VOUT1V4*
X129375585Y-110400415D03*
X132080000Y-107696000D03*
G04 #@! TD*
D12*
G04 #@! TO.N,/VOUT1V4*
X129375585Y-110400415D02*
X132080000Y-107696000D01*
G04 #@! TD*
D13*
G04 #@! TO.N,GND*
G36*
X147193000Y-154813000D02*
X107060470Y-154813000D01*
X107039018Y-149685930D01*
X123317000Y-149685930D01*
X123317000Y-151050070D01*
X123839034Y-152310372D01*
X124803628Y-153274966D01*
X126063930Y-153797000D01*
X127428070Y-153797000D01*
X128688372Y-153274966D01*
X129652966Y-152310372D01*
X130175000Y-151050070D01*
X130175000Y-149685930D01*
X129652966Y-148425628D01*
X128688372Y-147461034D01*
X127428070Y-146939000D01*
X126063930Y-146939000D01*
X124803628Y-147461034D01*
X123839034Y-148425628D01*
X123317000Y-149685930D01*
X107039018Y-149685930D01*
X106874010Y-110248844D01*
X128613585Y-110248844D01*
X128613585Y-110551986D01*
X128729593Y-110832053D01*
X128943947Y-111046407D01*
X129224014Y-111162415D01*
X129527156Y-111162415D01*
X129807223Y-111046407D01*
X130021577Y-110832053D01*
X130137585Y-110551986D01*
X130137585Y-110248844D01*
X130090307Y-110134705D01*
X131814291Y-108410722D01*
X131928429Y-108458000D01*
X132231571Y-108458000D01*
X132511638Y-108341992D01*
X132725992Y-108127638D01*
X132842000Y-107847571D01*
X132842000Y-107544429D01*
X132725992Y-107264362D01*
X132511638Y-107050008D01*
X132231571Y-106934000D01*
X131928429Y-106934000D01*
X131648362Y-107050008D01*
X131434008Y-107264362D01*
X131318000Y-107544429D01*
X131318000Y-107847571D01*
X131365278Y-107961709D01*
X129641295Y-109685693D01*
X129527156Y-109638415D01*
X129224014Y-109638415D01*
X128943947Y-109754423D01*
X128729593Y-109968777D01*
X128613585Y-110248844D01*
X106874010Y-110248844D01*
X106826466Y-98885930D01*
X123317000Y-98885930D01*
X123317000Y-100250070D01*
X123839034Y-101510372D01*
X124803628Y-102474966D01*
X126063930Y-102997000D01*
X127428070Y-102997000D01*
X128688372Y-102474966D01*
X129652966Y-101510372D01*
X130175000Y-100250070D01*
X130175000Y-98885930D01*
X129652966Y-97625628D01*
X128688372Y-96661034D01*
X127428070Y-96139000D01*
X126063930Y-96139000D01*
X124803628Y-96661034D01*
X123839034Y-97625628D01*
X123317000Y-98885930D01*
X106826466Y-98885930D01*
X106807533Y-94361000D01*
X147193000Y-94361000D01*
X147193000Y-154813000D01*
X147193000Y-154813000D01*
G37*
X147193000Y-154813000D02*
X107060470Y-154813000D01*
X107039018Y-149685930D01*
X123317000Y-149685930D01*
X123317000Y-151050070D01*
X123839034Y-152310372D01*
X124803628Y-153274966D01*
X126063930Y-153797000D01*
X127428070Y-153797000D01*
X128688372Y-153274966D01*
X129652966Y-152310372D01*
X130175000Y-151050070D01*
X130175000Y-149685930D01*
X129652966Y-148425628D01*
X128688372Y-147461034D01*
X127428070Y-146939000D01*
X126063930Y-146939000D01*
X124803628Y-147461034D01*
X123839034Y-148425628D01*
X123317000Y-149685930D01*
X107039018Y-149685930D01*
X106874010Y-110248844D01*
X128613585Y-110248844D01*
X128613585Y-110551986D01*
X128729593Y-110832053D01*
X128943947Y-111046407D01*
X129224014Y-111162415D01*
X129527156Y-111162415D01*
X129807223Y-111046407D01*
X130021577Y-110832053D01*
X130137585Y-110551986D01*
X130137585Y-110248844D01*
X130090307Y-110134705D01*
X131814291Y-108410722D01*
X131928429Y-108458000D01*
X132231571Y-108458000D01*
X132511638Y-108341992D01*
X132725992Y-108127638D01*
X132842000Y-107847571D01*
X132842000Y-107544429D01*
X132725992Y-107264362D01*
X132511638Y-107050008D01*
X132231571Y-106934000D01*
X131928429Y-106934000D01*
X131648362Y-107050008D01*
X131434008Y-107264362D01*
X131318000Y-107544429D01*
X131318000Y-107847571D01*
X131365278Y-107961709D01*
X129641295Y-109685693D01*
X129527156Y-109638415D01*
X129224014Y-109638415D01*
X128943947Y-109754423D01*
X128729593Y-109968777D01*
X128613585Y-110248844D01*
X106874010Y-110248844D01*
X106826466Y-98885930D01*
X123317000Y-98885930D01*
X123317000Y-100250070D01*
X123839034Y-101510372D01*
X124803628Y-102474966D01*
X126063930Y-102997000D01*
X127428070Y-102997000D01*
X128688372Y-102474966D01*
X129652966Y-101510372D01*
X130175000Y-100250070D01*
X130175000Y-98885930D01*
X129652966Y-97625628D01*
X128688372Y-96661034D01*
X127428070Y-96139000D01*
X126063930Y-96139000D01*
X124803628Y-96661034D01*
X123839034Y-97625628D01*
X123317000Y-98885930D01*
X106826466Y-98885930D01*
X106807533Y-94361000D01*
X147193000Y-94361000D01*
X147193000Y-154813000D01*
G04 #@! TD*
M02*
