(module pad (layer F.Cu) (tedit 59F37CCF)
  (fp_text reference REF** (at 0 0.5) (layer F.SilkS)
    (effects (font (size 0.254 0.254) (thickness 0.0508)))
  )
  (fp_text value pad (at 0 -0.5) (layer F.Fab) hide
    (effects (font (size 0.254 0.254) (thickness 0.0508)))
  )
  (pad 1 smd rect (at 0 0) (size 0.127 0.254) (layers F.Cu F.Mask))
)
