EESchema Schematic File Version 4
EELAYER 30 0
EELAYER END
$Descr A4 11693 8268
encoding utf-8
Sheet 1 1
Title "SCC analogue breakoutboard"
Date ""
Rev ""
Comp ""
Comment1 ""
Comment2 ""
Comment3 ""
Comment4 ""
$EndDescr
Text Notes 600  7550 0    50   ~ 0
==== Analogue signals sent to ADC ====\nVINA ,VIND: regulator input for analogue, digital power\nVDDA, VDDD: regulator output for analogue, digital power\nVREFA, VREFD: Reference voltage for the analogue, digital power shunt\nREXTA, REXTD: Voltage across the shunt resistor for the ana, digi power\nVOFS IN: Input to voltage offset buffer\nVOFS LP: Additional voltage offset for low power mode\nVREF ADC: pixel ADC reference voltage \nNTC: voltage drop over NTC (via voltage divider)\nVMUX OUT: Output of 8-bit voltage mux, see table 24 in manual\nR_IREF: Voltage of master reference current accross external R\nVDD_PRE: pre-regulator supply voltage (should be 1.2 V), see fig. 16\nVREF OVP: Reference for the overvoltage protection clamp\n\n==== Digital signals ====\nIREF TRIM: 4-bit trim for the reference current, trim handled by DAC\nBYPASS MODE: if set high can bypass clock data recovery\n\n==== Other signals ====\nSDA: Used only as an I2C reference in BDAQ, not used in YARR\nGNDA, GNDD REF: Analogue, digital ground reference\nVDD SHUNT: shunt-mode controller voltage (goes to transitor pull-down to VIND)\nVOFS: External voltage offset\nIMUX OUT: Output of 8-bit current mux, needs external resistor, see table 23\nGND_DAQ: DAQ GND reference\n
Text Label 8450 4650 0    50   ~ 0
IREF_TRIM3
Text Label 8450 4550 0    50   ~ 0
IREF_TRIM1
Text Label 8450 4350 0    50   ~ 0
VDD_PRE
Text Label 8450 4050 0    50   ~ 0
VDD_SHUNT
Text Label 8450 3950 0    50   ~ 0
VOFS_LP
Text Label 8450 3850 0    50   ~ 0
REXTD
Text Label 8450 3750 0    50   ~ 0
VREFD
Text Label 8450 3550 0    50   ~ 0
VDDD
Text Label 8450 3450 0    50   ~ 0
VIND
$Comp
L power:GND #PWR0101
U 1 1 5ED3FC47
P 5500 4850
F 0 "#PWR0101" H 5500 4600 50  0001 C CNN
F 1 "GND" H 5505 4677 50  0000 C CNN
F 2 "" H 5500 4850 50  0001 C CNN
F 3 "" H 5500 4850 50  0001 C CNN
	1    5500 4850
	1    0    0    -1  
$EndComp
$Comp
L Connector_Generic:Conn_02x15_Odd_Even J1
U 1 1 5ED392E1
P 6050 4150
F 0 "J1" H 6050 5150 50  0000 C CNN
F 1 "Conn_02x15_Odd_Even" H 6150 5050 50  0000 C CNN
F 2 "Connector_PinHeader_2.54mm:PinHeader_2x15_P2.54mm_Vertical" H 6050 4150 50  0001 C CNN
F 3 "~" H 6050 4150 50  0001 C CNN
	1    6050 4150
	1    0    0    -1  
$EndComp
Text Notes 6100 4000 3    50   ~ 0
SCC MONITOR
Text Notes 6400 4750 0    50   ~ 0
SCL
Text Notes 5950 4850 3    50   ~ 0
GND_DAQ
Text Label 7850 1700 2    50   ~ 0
VMUX_OUT
Text Label 7850 2200 2    50   ~ 0
TP_NTC1
Text Label 7850 1900 2    50   ~ 0
R_IREF
Text Label 7850 1600 2    50   ~ 0
VREF_ADC
Text Label 7850 2100 2    50   ~ 0
VDD_PRE
Text Label 7850 1800 2    50   ~ 0
VOFS_LP
Text Label 7850 2300 2    50   ~ 0
VREF_OVP
Text Label 7850 2000 2    50   ~ 0
VOFS
Text Notes 5800 4750 2    50   ~ 0
SDA
$Comp
L lbl_adafruit:adafruit_ft232h U1
U 1 1 5ED33E8F
P 5850 2050
F 0 "U1" H 5850 3047 60  0000 C CNN
F 1 "adafruit_ft232h" H 5850 2941 60  0000 C CNN
F 2 "lbl_adafruit:adafruit_ft232h_nohole" H 5850 2050 60  0001 C CNN
F 3 "https://www.adafruit.com/product/2264" H 5850 2050 60  0001 C CNN
	1    5850 2050
	1    0    0    -1  
$EndComp
$Comp
L Device:C C8
U 1 1 5EE19331
P 5000 5000
F 0 "C8" H 5000 5100 50  0000 L CNN
F 1 "100n" H 5000 4900 50  0000 L CNN
F 2 "Capacitor_SMD:C_0603_1608Metric" H 5038 4850 50  0001 C CNN
F 3 "~" H 5000 5000 50  0001 C CNN
	1    5000 5000
	1    0    0    -1  
$EndComp
$Comp
L Device:C C5
U 1 1 5EE197E9
P 4300 5000
F 0 "C5" H 4300 5100 50  0000 L CNN
F 1 "100n" H 4300 4900 50  0000 L CNN
F 2 "Capacitor_SMD:C_0603_1608Metric" H 4338 4850 50  0001 C CNN
F 3 "~" H 4300 5000 50  0001 C CNN
	1    4300 5000
	1    0    0    -1  
$EndComp
$Comp
L Device:C C9
U 1 1 5EE1AA0A
P 5300 5150
F 0 "C9" H 5300 5250 50  0000 L CNN
F 1 "100n" H 5350 5050 50  0000 L CNN
F 2 "Capacitor_SMD:C_0603_1608Metric" H 5338 5000 50  0001 C CNN
F 3 "~" H 5300 5150 50  0001 C CNN
	1    5300 5150
	1    0    0    -1  
$EndComp
$Comp
L Device:C C7
U 1 1 5EE1AE49
P 4750 5150
F 0 "C7" H 4750 5250 50  0000 L CNN
F 1 "100n" H 4800 5050 50  0000 L CNN
F 2 "Capacitor_SMD:C_0603_1608Metric" H 4788 5000 50  0001 C CNN
F 3 "~" H 4750 5150 50  0001 C CNN
	1    4750 5150
	1    0    0    -1  
$EndComp
$Comp
L Device:C C4
U 1 1 5EE1B56E
P 4000 5150
F 0 "C4" H 4000 5250 50  0000 L CNN
F 1 "100n" H 4050 5050 50  0000 L CNN
F 2 "Capacitor_SMD:C_0603_1608Metric" H 4038 5000 50  0001 C CNN
F 3 "~" H 4000 5150 50  0001 C CNN
	1    4000 5150
	1    0    0    -1  
$EndComp
$Comp
L Device:R R8
U 1 1 5EE80616
P 5700 3450
F 0 "R8" V 5600 3450 50  0000 C CNN
F 1 "1k" V 5700 3450 50  0000 C CNN
F 2 "Resistor_SMD:R_0603_1608Metric" V 5630 3450 50  0001 C CNN
F 3 "~" H 5700 3450 50  0001 C CNN
	1    5700 3450
	0    1    1    0   
$EndComp
$Comp
L Device:R R5
U 1 1 5EEE9747
P 5500 3550
F 0 "R5" V 5350 3550 50  0000 C CNN
F 1 "1k" V 5500 3550 50  0000 C CNN
F 2 "Resistor_SMD:R_0603_1608Metric" V 5430 3550 50  0001 C CNN
F 3 "~" H 5500 3550 50  0001 C CNN
	1    5500 3550
	0    1    1    0   
$EndComp
$Comp
L Device:R R9
U 1 1 5EEEA101
P 5700 3750
F 0 "R9" V 5550 3750 50  0000 C CNN
F 1 "1k" V 5700 3750 50  0000 C CNN
F 2 "Resistor_SMD:R_0603_1608Metric" V 5630 3750 50  0001 C CNN
F 3 "~" H 5700 3750 50  0001 C CNN
	1    5700 3750
	0    1    1    0   
$EndComp
$Comp
L Device:R R3
U 1 1 5EEEAD1C
P 5300 3950
F 0 "R3" V 5150 3950 50  0000 C CNN
F 1 "1k" V 5300 3950 50  0000 C CNN
F 2 "Resistor_SMD:R_0603_1608Metric" V 5230 3950 50  0001 C CNN
F 3 "~" H 5300 3950 50  0001 C CNN
	1    5300 3950
	0    1    1    0   
$EndComp
$Comp
L Device:R R7
U 1 1 5EEEC5B9
P 5500 4250
F 0 "R7" V 5350 4250 50  0000 C CNN
F 1 "1k" V 5500 4250 50  0000 C CNN
F 2 "Resistor_SMD:R_0603_1608Metric" V 5430 4250 50  0001 C CNN
F 3 "~" H 5500 4250 50  0001 C CNN
	1    5500 4250
	0    1    1    0   
$EndComp
$Comp
L Device:R R4
U 1 1 5EEFA612
P 5300 4350
F 0 "R4" V 5150 4350 50  0000 C CNN
F 1 "1k" V 5300 4350 50  0000 C CNN
F 2 "Resistor_SMD:R_0603_1608Metric" V 5230 4350 50  0001 C CNN
F 3 "~" H 5300 4350 50  0001 C CNN
	1    5300 4350
	0    1    1    0   
$EndComp
$Comp
L Device:R R11
U 1 1 5EEFAB58
P 5700 4450
F 0 "R11" V 5550 4450 50  0000 C CNN
F 1 "1k" V 5700 4450 50  0000 C CNN
F 2 "Resistor_SMD:R_0603_1608Metric" V 5630 4450 50  0001 C CNN
F 3 "~" H 5700 4450 50  0001 C CNN
	1    5700 4450
	0    1    1    0   
$EndComp
Wire Wire Line
	5850 3550 5650 3550
Wire Wire Line
	5850 3850 5650 3850
Wire Wire Line
	5850 3950 5450 3950
Wire Wire Line
	5850 4250 5650 4250
$Comp
L Device:R R10
U 1 1 5EF7AC3E
P 5700 4150
F 0 "R10" V 5550 4150 50  0000 C CNN
F 1 "1k" V 5700 4150 50  0000 C CNN
F 2 "Resistor_SMD:R_0603_1608Metric" V 5630 4150 50  0001 C CNN
F 3 "~" H 5700 4150 50  0001 C CNN
	1    5700 4150
	0    1    1    0   
$EndComp
Wire Wire Line
	5550 4150 4550 4150
Wire Wire Line
	5300 5000 5300 4450
Wire Wire Line
	5300 4450 5550 4450
Wire Wire Line
	5000 4350 5000 4850
Wire Wire Line
	4750 5000 4750 4250
Wire Wire Line
	4750 4250 5350 4250
Wire Wire Line
	4300 4850 4300 3950
Wire Wire Line
	4300 3950 5150 3950
Wire Wire Line
	4000 5000 4000 3850
Wire Wire Line
	4000 3850 5350 3850
$Comp
L Device:C C15
U 1 1 5F002A9B
P 8200 5100
F 0 "C15" H 8200 5200 50  0000 L CNN
F 1 "100n" H 8200 5000 50  0000 L CNN
F 2 "Capacitor_SMD:C_0603_1608Metric" H 8238 4950 50  0001 C CNN
F 3 "~" H 8200 5100 50  0001 C CNN
	1    8200 5100
	1    0    0    -1  
$EndComp
$Comp
L Device:C C14
U 1 1 5F002AAF
P 8000 4850
F 0 "C14" H 8000 4950 50  0000 L CNN
F 1 "100n" H 8000 4750 50  0000 L CNN
F 2 "Capacitor_SMD:C_0603_1608Metric" H 8038 4700 50  0001 C CNN
F 3 "~" H 8000 4850 50  0001 C CNN
	1    8000 4850
	1    0    0    -1  
$EndComp
$Comp
L Device:C C12
U 1 1 5F002AB9
P 7600 4850
F 0 "C12" H 7600 4950 50  0000 L CNN
F 1 "100n" H 7600 4750 50  0000 L CNN
F 2 "Capacitor_SMD:C_0603_1608Metric" H 7638 4700 50  0001 C CNN
F 3 "~" H 7600 4850 50  0001 C CNN
	1    7600 4850
	1    0    0    -1  
$EndComp
$Comp
L Device:C C13
U 1 1 5F002AEB
P 7800 5150
F 0 "C13" H 7800 5250 50  0000 L CNN
F 1 "100n" H 7850 5050 50  0000 L CNN
F 2 "Capacitor_SMD:C_0603_1608Metric" H 7838 5000 50  0001 C CNN
F 3 "~" H 7800 5150 50  0001 C CNN
	1    7800 5150
	1    0    0    -1  
$EndComp
$Comp
L Device:C C11
U 1 1 5F002AFF
P 7350 4950
F 0 "C11" H 7350 5050 50  0000 L CNN
F 1 "100n" H 7350 4850 50  0000 L CNN
F 2 "Capacitor_SMD:C_0603_1608Metric" H 7388 4800 50  0001 C CNN
F 3 "~" H 7350 4950 50  0001 C CNN
	1    7350 4950
	1    0    0    -1  
$EndComp
Wire Wire Line
	8200 4350 8200 4950
Wire Wire Line
	8000 4700 8000 3950
Wire Wire Line
	7600 4700 7600 3750
Wire Wire Line
	7350 4800 7350 3550
$Comp
L Device:C C10
U 1 1 5F002BB3
P 7150 5150
F 0 "C10" H 7150 5250 50  0000 L CNN
F 1 "100n" H 7150 5050 50  0000 L CNN
F 2 "Capacitor_SMD:C_0603_1608Metric" H 7188 5000 50  0001 C CNN
F 3 "~" H 7150 5150 50  0001 C CNN
	1    7150 5150
	1    0    0    -1  
$EndComp
Wire Wire Line
	6650 4350 8200 4350
Wire Wire Line
	6650 3750 7600 3750
Wire Wire Line
	6650 3450 7150 3450
Wire Wire Line
	7150 5000 7150 3450
Wire Wire Line
	7800 3850 7800 5000
$Comp
L Device:R R17
U 1 1 5F002B4F
P 6500 4350
F 0 "R17" V 6350 4350 50  0000 C CNN
F 1 "1k" V 6500 4350 50  0000 C CNN
F 2 "Resistor_SMD:R_0603_1608Metric" V 6430 4350 50  0001 C CNN
F 3 "~" H 6500 4350 50  0001 C CNN
	1    6500 4350
	0    1    1    0   
$EndComp
$Comp
L Device:R R18
U 1 1 5F002B3B
P 6900 3950
F 0 "R18" V 6750 3950 50  0000 C CNN
F 1 "1k" V 6900 3950 50  0000 C CNN
F 2 "Resistor_SMD:R_0603_1608Metric" V 6830 3950 50  0001 C CNN
F 3 "~" H 6900 3950 50  0001 C CNN
	1    6900 3950
	0    1    1    0   
$EndComp
$Comp
L Device:R R15
U 1 1 5F002B31
P 6700 3850
F 0 "R15" V 6550 3850 50  0000 C CNN
F 1 "1k" V 6700 3850 50  0000 C CNN
F 2 "Resistor_SMD:R_0603_1608Metric" V 6630 3850 50  0001 C CNN
F 3 "~" H 6700 3850 50  0001 C CNN
	1    6700 3850
	0    1    1    0   
$EndComp
$Comp
L Device:R R14
U 1 1 5F002B27
P 6500 3750
F 0 "R14" V 6350 3750 50  0000 C CNN
F 1 "1k" V 6500 3750 50  0000 C CNN
F 2 "Resistor_SMD:R_0603_1608Metric" V 6430 3750 50  0001 C CNN
F 3 "~" H 6500 3750 50  0001 C CNN
	1    6500 3750
	0    1    1    0   
$EndComp
$Comp
L Device:R R16
U 1 1 5F002B13
P 6700 3550
F 0 "R16" V 6550 3550 50  0000 C CNN
F 1 "1k" V 6700 3550 50  0000 C CNN
F 2 "Resistor_SMD:R_0603_1608Metric" V 6630 3550 50  0001 C CNN
F 3 "~" H 6700 3550 50  0001 C CNN
	1    6700 3550
	0    1    1    0   
$EndComp
$Comp
L Device:R R13
U 1 1 5F002B09
P 6500 3450
F 0 "R13" V 6400 3450 50  0000 C CNN
F 1 "1k" V 6500 3450 50  0000 C CNN
F 2 "Resistor_SMD:R_0603_1608Metric" V 6430 3450 50  0001 C CNN
F 3 "~" H 6500 3450 50  0001 C CNN
	1    6500 3450
	0    1    1    0   
$EndComp
Wire Wire Line
	7050 3950 8000 3950
Wire Wire Line
	6850 3850 7800 3850
Wire Wire Line
	6850 3550 7350 3550
Wire Wire Line
	6350 3550 6550 3550
Wire Wire Line
	6550 3850 6350 3850
$Comp
L power:GND #PWR0104
U 1 1 5F16EEE5
P 4000 5300
F 0 "#PWR0104" H 4000 5050 50  0001 C CNN
F 1 "GND" H 4005 5127 50  0000 C CNN
F 2 "" H 4000 5300 50  0001 C CNN
F 3 "" H 4000 5300 50  0001 C CNN
	1    4000 5300
	1    0    0    -1  
$EndComp
$Comp
L power:GND #PWR0105
U 1 1 5F16F25C
P 4300 5150
F 0 "#PWR0105" H 4300 4900 50  0001 C CNN
F 1 "GND" H 4305 4977 50  0000 C CNN
F 2 "" H 4300 5150 50  0001 C CNN
F 3 "" H 4300 5150 50  0001 C CNN
	1    4300 5150
	1    0    0    -1  
$EndComp
$Comp
L power:GND #PWR0106
U 1 1 5F16FDC0
P 4750 5300
F 0 "#PWR0106" H 4750 5050 50  0001 C CNN
F 1 "GND" H 4755 5127 50  0000 C CNN
F 2 "" H 4750 5300 50  0001 C CNN
F 3 "" H 4750 5300 50  0001 C CNN
	1    4750 5300
	1    0    0    -1  
$EndComp
$Comp
L power:GND #PWR0108
U 1 1 5F1703E2
P 5300 5300
F 0 "#PWR0108" H 5300 5050 50  0001 C CNN
F 1 "GND" H 5305 5127 50  0000 C CNN
F 2 "" H 5300 5300 50  0001 C CNN
F 3 "" H 5300 5300 50  0001 C CNN
	1    5300 5300
	1    0    0    -1  
$EndComp
$Comp
L power:GND #PWR0109
U 1 1 5F170D7B
P 7150 5300
F 0 "#PWR0109" H 7150 5050 50  0001 C CNN
F 1 "GND" H 7155 5127 50  0000 C CNN
F 2 "" H 7150 5300 50  0001 C CNN
F 3 "" H 7150 5300 50  0001 C CNN
	1    7150 5300
	1    0    0    -1  
$EndComp
$Comp
L power:GND #PWR0110
U 1 1 5F171517
P 7350 5100
F 0 "#PWR0110" H 7350 4850 50  0001 C CNN
F 1 "GND" H 7355 4927 50  0000 C CNN
F 2 "" H 7350 5100 50  0001 C CNN
F 3 "" H 7350 5100 50  0001 C CNN
	1    7350 5100
	1    0    0    -1  
$EndComp
$Comp
L power:GND #PWR0111
U 1 1 5F171D48
P 7600 5000
F 0 "#PWR0111" H 7600 4750 50  0001 C CNN
F 1 "GND" H 7605 4827 50  0000 C CNN
F 2 "" H 7600 5000 50  0001 C CNN
F 3 "" H 7600 5000 50  0001 C CNN
	1    7600 5000
	1    0    0    -1  
$EndComp
$Comp
L power:GND #PWR0112
U 1 1 5F1721AD
P 7800 5300
F 0 "#PWR0112" H 7800 5050 50  0001 C CNN
F 1 "GND" H 7805 5127 50  0000 C CNN
F 2 "" H 7800 5300 50  0001 C CNN
F 3 "" H 7800 5300 50  0001 C CNN
	1    7800 5300
	1    0    0    -1  
$EndComp
$Comp
L power:GND #PWR0113
U 1 1 5F172469
P 8000 5000
F 0 "#PWR0113" H 8000 4750 50  0001 C CNN
F 1 "GND" H 8005 4827 50  0000 C CNN
F 2 "" H 8000 5000 50  0001 C CNN
F 3 "" H 8000 5000 50  0001 C CNN
	1    8000 5000
	1    0    0    -1  
$EndComp
$Comp
L power:GND #PWR0114
U 1 1 5F173179
P 8200 5250
F 0 "#PWR0114" H 8200 5000 50  0001 C CNN
F 1 "GND" H 8300 5150 50  0000 C CNN
F 2 "" H 8200 5250 50  0001 C CNN
F 3 "" H 8200 5250 50  0001 C CNN
	1    8200 5250
	1    0    0    -1  
$EndComp
Text Label 8450 3650 0    50   ~ 0
GNDD_REF
$Comp
L Device:R R6
U 1 1 5EEEA5DE
P 5500 3850
F 0 "R6" V 5350 3850 50  0000 C CNN
F 1 "1k" V 5500 3850 50  0000 C CNN
F 2 "Resistor_SMD:R_0603_1608Metric" V 5430 3850 50  0001 C CNN
F 3 "~" H 5500 3850 50  0001 C CNN
	1    5500 3850
	0    1    1    0   
$EndComp
Wire Wire Line
	5150 4350 5000 4350
Wire Wire Line
	5450 4350 5850 4350
Text Label 3100 3450 2    50   ~ 0
VINA
Text Label 3100 3550 2    50   ~ 0
VDDA
Text Label 3100 3650 2    50   ~ 0
GNDA_REF
Text Label 3100 3950 2    50   ~ 0
VOFS
Text Label 3100 4250 2    50   ~ 0
VMUX_OUT
Text Label 3100 4150 2    50   ~ 0
VREF_ADC
Text Label 3100 4350 2    50   ~ 0
R_IREF
Text Label 3100 4450 2    50   ~ 0
VREF_OVP
Text Label 3100 4550 2    50   ~ 0
IREF_TRIM0
Text Label 3100 4650 2    50   ~ 0
IREF_TRIM2
$Comp
L Device:C C3
U 1 1 5EE19B14
P 3700 5000
F 0 "C3" H 3700 5100 50  0000 L CNN
F 1 "100n" H 3700 4900 50  0000 L CNN
F 2 "Capacitor_SMD:C_0603_1608Metric" H 3738 4850 50  0001 C CNN
F 3 "~" H 3700 5000 50  0001 C CNN
	1    3700 5000
	1    0    0    -1  
$EndComp
Wire Wire Line
	5550 3750 3700 3750
Wire Wire Line
	3700 4850 3700 3750
Wire Wire Line
	3450 3550 5350 3550
$Comp
L Device:C C2
U 1 1 5EE1BBDB
P 3450 4800
F 0 "C2" H 3450 4900 50  0000 L CNN
F 1 "100n" H 3450 4700 50  0000 L CNN
F 2 "Capacitor_SMD:C_0603_1608Metric" H 3488 4650 50  0001 C CNN
F 3 "~" H 3450 4800 50  0001 C CNN
	1    3450 4800
	1    0    0    -1  
$EndComp
Wire Wire Line
	3450 4650 3450 3550
$Comp
L Device:C C6
U 1 1 5EE1958D
P 4550 4850
F 0 "C6" H 4550 4950 50  0000 L CNN
F 1 "100n" H 4550 4750 50  0000 L CNN
F 2 "Capacitor_SMD:C_0603_1608Metric" H 4588 4700 50  0001 C CNN
F 3 "~" H 4550 4850 50  0001 C CNN
	1    4550 4850
	1    0    0    -1  
$EndComp
Wire Wire Line
	4550 4700 4550 4150
Wire Wire Line
	3250 3450 5550 3450
$Comp
L Device:C C1
U 1 1 5EFC77D4
P 3250 5150
F 0 "C1" H 3250 5250 50  0000 L CNN
F 1 "100n" H 3250 5050 50  0000 L CNN
F 2 "Capacitor_SMD:C_0603_1608Metric" H 3288 5000 50  0001 C CNN
F 3 "~" H 3250 5150 50  0001 C CNN
	1    3250 5150
	1    0    0    -1  
$EndComp
Wire Wire Line
	3250 5000 3250 3450
$Comp
L power:GND #PWR0118
U 1 1 5F16DC06
P 3250 5300
F 0 "#PWR0118" H 3250 5050 50  0001 C CNN
F 1 "GND" H 3255 5127 50  0000 C CNN
F 2 "" H 3250 5300 50  0001 C CNN
F 3 "" H 3250 5300 50  0001 C CNN
	1    3250 5300
	1    0    0    -1  
$EndComp
Wire Wire Line
	3100 3450 3250 3450
Connection ~ 3250 3450
Wire Wire Line
	3100 3550 3450 3550
Connection ~ 3450 3550
Wire Wire Line
	2950 3750 3700 3750
Connection ~ 3700 3750
Wire Wire Line
	2950 3850 4000 3850
Connection ~ 4000 3850
Wire Wire Line
	4300 3950 3100 3950
Connection ~ 4300 3950
Wire Wire Line
	4550 4150 3100 4150
Connection ~ 4550 4150
Wire Wire Line
	3100 4250 4750 4250
Connection ~ 4750 4250
Wire Wire Line
	5000 4350 3100 4350
Connection ~ 5000 4350
Wire Wire Line
	3100 4450 5300 4450
Connection ~ 5300 4450
Wire Wire Line
	5850 4550 3100 4550
Wire Wire Line
	7150 3450 8450 3450
Connection ~ 7150 3450
Wire Wire Line
	8450 3550 7350 3550
Connection ~ 7350 3550
Wire Wire Line
	8450 3750 7600 3750
Connection ~ 7600 3750
Wire Wire Line
	8450 3850 7800 3850
Connection ~ 7800 3850
Wire Wire Line
	8450 4050 6350 4050
Wire Wire Line
	8450 4350 8200 4350
Connection ~ 8200 4350
Wire Wire Line
	6350 4550 8450 4550
Wire Wire Line
	8450 4650 6350 4650
Wire Wire Line
	8000 3950 8450 3950
Connection ~ 8000 3950
Wire Wire Line
	6750 3950 6350 3950
$Comp
L power:GND #PWR0119
U 1 1 5F285E7B
P 2400 2950
F 0 "#PWR0119" H 2400 2700 50  0001 C CNN
F 1 "GND" H 2405 2777 50  0000 C CNN
F 2 "" H 2400 2950 50  0001 C CNN
F 3 "" H 2400 2950 50  0001 C CNN
	1    2400 2950
	1    0    0    -1  
$EndComp
NoConn ~ 6350 4250
NoConn ~ 6350 4750
NoConn ~ 5850 4750
Text Notes 8800 4250 2    50   ~ 0
IMUX OUT
NoConn ~ 5850 4050
NoConn ~ 6350 4150
$Comp
L Device:R R2
U 1 1 5F2D6ACB
P 5300 3650
F 0 "R2" V 5150 3650 50  0000 C CNN
F 1 "0" V 5300 3650 50  0000 C CNN
F 2 "Resistor_SMD:R_0603_1608Metric" V 5230 3650 50  0001 C CNN
F 3 "~" H 5300 3650 50  0001 C CNN
	1    5300 3650
	0    1    1    0   
$EndComp
$Comp
L power:GND #PWR0122
U 1 1 5F2D7967
P 1800 1200
F 0 "#PWR0122" H 1800 950 50  0001 C CNN
F 1 "GND" H 1800 1050 50  0000 C CNN
F 2 "" H 1800 1200 50  0001 C CNN
F 3 "" H 1800 1200 50  0001 C CNN
	1    1800 1200
	1    0    0    -1  
$EndComp
Wire Wire Line
	5850 3650 5450 3650
Wire Wire Line
	5150 3650 3100 3650
Text Label 2950 3750 2    50   ~ 0
VREFA
Text Label 2950 3850 2    50   ~ 0
REXTA
$Comp
L Device:R R19
U 1 1 5F2E8811
P 6900 3650
F 0 "R19" V 6750 3650 50  0000 C CNN
F 1 "0" V 6900 3650 50  0000 C CNN
F 2 "Resistor_SMD:R_0603_1608Metric" V 6830 3650 50  0001 C CNN
F 3 "~" H 6900 3650 50  0001 C CNN
	1    6900 3650
	0    1    1    0   
$EndComp
$Comp
L power:GND #PWR0123
U 1 1 5F2E8FCD
P 8350 3650
F 0 "#PWR0123" H 8350 3400 50  0001 C CNN
F 1 "GND" H 8350 3500 50  0000 C CNN
F 2 "" H 8350 3650 50  0001 C CNN
F 3 "" H 8350 3650 50  0001 C CNN
	1    8350 3650
	1    0    0    -1  
$EndComp
Wire Wire Line
	8350 3650 7050 3650
Wire Wire Line
	6750 3650 6350 3650
Text Notes 8600 4150 2    50   ~ 0
NTC
Text Notes 3100 4050 2    50   ~ 0
VOFS IN
$Comp
L Device:R R12
U 1 1 5F2F9B8C
P 5700 4850
F 0 "R12" V 5800 4850 50  0000 L CNN
F 1 "R" V 5700 4800 50  0000 L CNN
F 2 "Resistor_SMD:R_0603_1608Metric" V 5630 4850 50  0001 C CNN
F 3 "~" H 5700 4850 50  0001 C CNN
	1    5700 4850
	0    1    1    0   
$EndComp
Wire Wire Line
	5550 4850 5500 4850
Text Label 3750 2350 0    50   ~ 0
VINA
Text Label 3750 2250 0    50   ~ 0
REXTD
Text Label 3750 2150 0    50   ~ 0
VIND
Text Label 3750 2050 0    50   ~ 0
REXTA
Text Label 3750 1950 0    50   ~ 0
VDDA
Text Label 3750 2450 0    50   ~ 0
VREFD
Text Label 3750 1750 0    50   ~ 0
VDDD
Text Label 3750 1850 0    50   ~ 0
VREFA
NoConn ~ 3150 -1050
Wire Wire Line
	2000 2950 2400 2950
$Comp
L power:GND #PWR0120
U 1 1 5F3AA3C5
P 9050 2800
F 0 "#PWR0120" H 9050 2550 50  0001 C CNN
F 1 "GND" H 9055 2627 50  0000 C CNN
F 2 "" H 9050 2800 50  0001 C CNN
F 3 "" H 9050 2800 50  0001 C CNN
	1    9050 2800
	1    0    0    -1  
$EndComp
$Comp
L power:GND #PWR0125
U 1 1 5F3DE4CD
P 2200 1350
F 0 "#PWR0125" H 2200 1100 50  0001 C CNN
F 1 "GND" H 2300 1250 50  0000 C CNN
F 2 "" H 2200 1350 50  0001 C CNN
F 3 "" H 2200 1350 50  0001 C CNN
	1    2200 1350
	1    0    0    -1  
$EndComp
$Comp
L Device:C C21
U 1 1 5F3E3D1D
P 3150 1250
F 0 "C21" H 3100 1500 50  0000 L CNN
F 1 "1u" H 3265 1205 50  0000 L CNN
F 2 "Capacitor_SMD:C_0805_2012Metric" H 3188 1100 50  0001 C CNN
F 3 "~" H 3150 1250 50  0001 C CNN
	1    3150 1250
	1    0    0    -1  
$EndComp
$Comp
L power:GND #PWR0126
U 1 1 5F4179D2
P 3150 1400
F 0 "#PWR0126" H 3150 1150 50  0001 C CNN
F 1 "GND" H 3250 1300 50  0000 C CNN
F 2 "" H 3150 1400 50  0001 C CNN
F 3 "" H 3150 1400 50  0001 C CNN
	1    3150 1400
	1    0    0    -1  
$EndComp
$Comp
L Device:C C22
U 1 1 5F4201A8
P 3450 1250
F 0 "C22" H 3400 1500 50  0000 L CNN
F 1 "1u" H 3565 1205 50  0000 L CNN
F 2 "Capacitor_SMD:C_0805_2012Metric" H 3488 1100 50  0001 C CNN
F 3 "~" H 3450 1250 50  0001 C CNN
	1    3450 1250
	1    0    0    -1  
$EndComp
$Comp
L power:GND #PWR0127
U 1 1 5F420518
P 3450 1400
F 0 "#PWR0127" H 3450 1150 50  0001 C CNN
F 1 "GND" H 3550 1300 50  0000 C CNN
F 2 "" H 3450 1400 50  0001 C CNN
F 3 "" H 3450 1400 50  0001 C CNN
	1    3450 1400
	1    0    0    -1  
$EndComp
Wire Wire Line
	3150 1150 3150 1100
Wire Wire Line
	3450 1100 3150 1100
Connection ~ 3150 1100
Wire Wire Line
	3450 1100 3700 1100
Connection ~ 3450 1100
$Comp
L power:+5V #PWR0128
U 1 1 5F442664
P 3700 1100
F 0 "#PWR0128" H 3700 950 50  0001 C CNN
F 1 "+5V" H 3715 1273 50  0000 C CNN
F 2 "" H 3700 1100 50  0001 C CNN
F 3 "" H 3700 1100 50  0001 C CNN
	1    3700 1100
	1    0    0    -1  
$EndComp
Wire Wire Line
	2000 1950 1950 1950
Text Label 1950 1950 2    50   ~ 0
CONV
Text Label 1950 2150 2    50   ~ 0
SCL
Text Label 1950 2250 2    50   ~ 0
SDA
Wire Wire Line
	9650 1800 9750 1800
Text Label 9750 1800 0    50   ~ 0
CONV
Text Label 9750 2000 0    50   ~ 0
SCL
Text Label 9750 2100 0    50   ~ 0
SDA
$Comp
L Device:C C19
U 1 1 5F3C9617
P 1850 1200
F 0 "C19" H 1800 1450 50  0000 L CNN
F 1 "0.1u" H 1900 1100 50  0000 L CNN
F 2 "Capacitor_SMD:C_0603_1608Metric" H 1888 1050 50  0001 C CNN
F 3 "~" H 1850 1200 50  0001 C CNN
	1    1850 1200
	1    0    0    -1  
$EndComp
$Comp
L Device:C C20
U 1 1 5F3C856D
P 2200 1200
F 0 "C20" H 2150 1450 50  0000 L CNN
F 1 "1u" H 2250 1100 50  0000 L CNN
F 2 "Capacitor_SMD:C_0805_2012Metric" H 2238 1050 50  0001 C CNN
F 3 "~" H 2200 1200 50  0001 C CNN
	1    2200 1200
	1    0    0    -1  
$EndComp
Text Label 1700 1050 2    50   ~ 0
2V5
$Comp
L Device:C C26
U 1 1 5F4D3D6C
P 9550 1050
F 0 "C26" H 9500 1250 50  0000 L CNN
F 1 "0.1u" H 9550 950 50  0000 L CNN
F 2 "Capacitor_SMD:C_0603_1608Metric" H 9588 900 50  0001 C CNN
F 3 "~" H 9550 1050 50  0001 C CNN
	1    9550 1050
	-1   0    0    -1  
$EndComp
$Comp
L Device:C C25
U 1 1 5F4D3D78
P 9250 1050
F 0 "C25" H 9200 1250 50  0000 L CNN
F 1 "1u" H 9250 950 50  0000 L CNN
F 2 "Capacitor_SMD:C_0805_2012Metric" H 9288 900 50  0001 C CNN
F 3 "~" H 9250 1050 50  0001 C CNN
	1    9250 1050
	-1   0    0    -1  
$EndComp
Text Label 9800 900  0    50   ~ 0
2V5
$Comp
L lbl_adc:AD7997 U3
U 1 1 5ED37FD6
P 9650 1500
F 0 "U3" H 10900 2400 60  0000 C CNN
F 1 "AD7998" H 10550 2400 60  0000 C CNN
F 2 "Package_SO:TSSOP-20_4.4x6.5mm_P0.65mm" H 10950 450 60  0001 C CNN
F 3 "http://www.analog.com/media/en/technical-documentation/data-sheets/AD7997_7998.pdf" H 10550 2300 60  0000 C CNN
	1    9650 1500
	-1   0    0    -1  
$EndComp
$Comp
L Device:C C24
U 1 1 5F4E940F
P 8500 1100
F 0 "C24" H 8450 1350 50  0000 L CNN
F 1 "1u" H 8500 1000 50  0000 L CNN
F 2 "Capacitor_SMD:C_0805_2012Metric" H 8538 950 50  0001 C CNN
F 3 "~" H 8500 1100 50  0001 C CNN
	1    8500 1100
	-1   0    0    -1  
$EndComp
$Comp
L Device:C C23
U 1 1 5F4E9C59
P 8250 1100
F 0 "C23" H 8200 1350 50  0000 L CNN
F 1 "1u" H 8250 1000 50  0000 L CNN
F 2 "Capacitor_SMD:C_0805_2012Metric" H 8288 950 50  0001 C CNN
F 3 "~" H 8250 1100 50  0001 C CNN
	1    8250 1100
	-1   0    0    -1  
$EndComp
$Comp
L power:GND #PWR0131
U 1 1 5F4EA7E8
P 8500 1250
F 0 "#PWR0131" H 8500 1000 50  0001 C CNN
F 1 "GND" H 8600 1150 50  0000 C CNN
F 2 "" H 8500 1250 50  0001 C CNN
F 3 "" H 8500 1250 50  0001 C CNN
	1    8500 1250
	1    0    0    -1  
$EndComp
$Comp
L power:GND #PWR0132
U 1 1 5F4EADF1
P 8250 1250
F 0 "#PWR0132" H 8250 1000 50  0001 C CNN
F 1 "GND" H 8350 1150 50  0000 C CNN
F 2 "" H 8250 1250 50  0001 C CNN
F 3 "" H 8250 1250 50  0001 C CNN
	1    8250 1250
	1    0    0    -1  
$EndComp
Wire Wire Line
	8250 950  8500 950 
Connection ~ 8500 950 
Connection ~ 8250 950 
Wire Wire Line
	8050 950  8050 1050
Wire Wire Line
	8050 1050 7950 1050
Wire Wire Line
	8050 950  8250 950 
$Comp
L power:+5V #PWR0133
U 1 1 5F580BEF
P 7950 1050
F 0 "#PWR0133" H 7950 900 50  0001 C CNN
F 1 "+5V" H 7965 1223 50  0000 C CNN
F 2 "" H 7950 1050 50  0001 C CNN
F 3 "" H 7950 1050 50  0001 C CNN
	1    7950 1050
	1    0    0    -1  
$EndComp
Text Notes 8450 4450 0    50   ~ 0
BYPASS MODE
$Comp
L lbl_adc:AD7997 U2
U 1 1 5ED3638B
P 2000 1650
F 0 "U2" H 2500 2600 60  0000 C CNN
F 1 "AD7998" H 2850 2600 60  0000 C CNN
F 2 "Package_SO:TSSOP-20_4.4x6.5mm_P0.65mm" H 3300 600 60  0001 C CNN
F 3 "http://www.analog.com/media/en/technical-documentation/data-sheets/AD7997_7998.pdf" H 2850 2500 60  0000 C CNN
	1    2000 1650
	1    0    0    -1  
$EndComp
Wire Wire Line
	2000 1650 2000 1500
Wire Wire Line
	2000 1500 2550 1500
$Comp
L power:GND #PWR0134
U 1 1 5F5F69A7
P 1850 1350
F 0 "#PWR0134" H 1850 1100 50  0001 C CNN
F 1 "GND" H 1950 1250 50  0000 C CNN
F 2 "" H 1850 1350 50  0001 C CNN
F 3 "" H 1850 1350 50  0001 C CNN
	1    1850 1350
	1    0    0    -1  
$EndComp
Wire Wire Line
	2550 1050 2200 1050
Wire Wire Line
	2550 1050 2550 1500
Connection ~ 1850 1050
Wire Wire Line
	1850 1050 1700 1050
Connection ~ 2200 1050
Wire Wire Line
	2200 1050 1850 1050
Wire Wire Line
	9650 1500 9650 1350
Wire Wire Line
	9650 1350 9050 1350
Wire Wire Line
	9050 1350 9050 900 
Wire Wire Line
	9050 900  9250 900 
Connection ~ 9250 900 
Wire Wire Line
	9250 900  9550 900 
Connection ~ 9550 900 
Wire Wire Line
	9550 900  9800 900 
NoConn ~ 6350 4450
NoConn ~ 6450 1800
NoConn ~ 6450 1900
NoConn ~ 6450 2000
NoConn ~ 6450 2100
NoConn ~ 6450 2200
NoConn ~ 5250 2300
Text Label 5100 1500 2    50   ~ 0
CONV
Text Label 6900 1500 0    50   ~ 0
SCL
$Comp
L power:GND #PWR0138
U 1 1 5F73B0ED
P 5850 2800
F 0 "#PWR0138" H 5850 2550 50  0001 C CNN
F 1 "GND" H 5855 2627 50  0000 C CNN
F 2 "" H 5850 2800 50  0001 C CNN
F 3 "" H 5850 2800 50  0001 C CNN
	1    5850 2800
	1    0    0    -1  
$EndComp
$Comp
L Regulator_Linear:TL5209 U4
U 1 1 5EDC00CA
P 1950 3600
F 0 "U4" H 1925 3715 50  0000 C CNN
F 1 "TL5209" H 1925 3624 50  0000 C CNN
F 2 "Package_SO:SOIC-8-1EP_3.9x4.9mm_P1.27mm_EP2.29x3mm" H 1950 3600 50  0001 C CNN
F 3 "http://www.ti.com/lit/ds/symlink/tl5209.pdf?HQS=TI-null-null-digikeymode-df-pf-null-wwe&ts=1591332675075" H 1950 3600 50  0001 C CNN
	1    1950 3600
	1    0    0    -1  
$EndComp
Text Label 7800 2700 0    50   ~ 0
2V5
Wire Wire Line
	7500 2700 7800 2700
Connection ~ 7650 2800
Wire Wire Line
	7650 2800 7800 2800
Wire Wire Line
	7500 2800 7650 2800
$Comp
L Device:R R1
U 1 1 5F2CA695
P 7650 2950
F 0 "R1" H 7550 3000 50  0000 C CNN
F 1 "10k" H 7800 2950 50  0000 C CNN
F 2 "Resistor_SMD:R_0603_1608Metric" V 7580 2950 50  0001 C CNN
F 3 "~" H 7650 2950 50  0001 C CNN
	1    7650 2950
	-1   0    0    1   
$EndComp
$Comp
L power:GND #PWR0121
U 1 1 5F2BEC60
P 7650 3100
F 0 "#PWR0121" H 7650 2850 50  0001 C CNN
F 1 "GND" H 7750 3000 50  0000 C CNN
F 2 "" H 7650 3100 50  0001 C CNN
F 3 "" H 7650 3100 50  0001 C CNN
	1    7650 3100
	1    0    0    -1  
$EndComp
$Comp
L Connector:Conn_01x02_Male J3
U 1 1 5F2ABAC9
P 7300 2700
F 0 "J3" H 7350 2950 50  0000 C CNN
F 1 "Conn_1x2" H 7350 2850 50  0000 C CNN
F 2 "Connector_PinHeader_2.54mm:PinHeader_2x01_P2.54mm_Vertical" H 7300 2700 50  0001 C CNN
F 3 "~" H 7300 2700 50  0001 C CNN
	1    7300 2700
	1    0    0    -1  
$EndComp
Text Label 7800 2800 0    50   ~ 0
TP_NTC1
Wire Wire Line
	2350 3900 2450 3900
Connection ~ 2350 3900
$Comp
L power:GND #PWR0139
U 1 1 5EDE0C91
P 2450 3900
F 0 "#PWR0139" H 2450 3650 50  0001 C CNN
F 1 "GND" H 2455 3727 50  0000 C CNN
F 2 "" H 2450 3900 50  0001 C CNN
F 3 "" H 2450 3900 50  0001 C CNN
	1    2450 3900
	1    0    0    -1  
$EndComp
Wire Wire Line
	1500 3450 1350 3450
$Comp
L Device:C C17
U 1 1 5EDFF483
P 1350 3600
F 0 "C17" H 1300 3850 50  0000 L CNN
F 1 "1u" H 1150 3600 50  0000 L CNN
F 2 "Capacitor_SMD:C_0805_2012Metric" H 1388 3450 50  0001 C CNN
F 3 "~" H 1350 3600 50  0001 C CNN
	1    1350 3600
	1    0    0    -1  
$EndComp
Connection ~ 1350 3450
Wire Wire Line
	1350 3450 1150 3450
$Comp
L power:GND #PWR0140
U 1 1 5EE15B2A
P 1350 3750
F 0 "#PWR0140" H 1350 3500 50  0001 C CNN
F 1 "GND" H 1250 3750 50  0000 C CNN
F 2 "" H 1350 3750 50  0001 C CNN
F 3 "" H 1350 3750 50  0001 C CNN
	1    1350 3750
	1    0    0    -1  
$EndComp
$Comp
L power:+5V #PWR0141
U 1 1 5EE172D3
P 1150 3450
F 0 "#PWR0141" H 1150 3300 50  0001 C CNN
F 1 "+5V" H 1165 3623 50  0000 C CNN
F 2 "" H 1150 3450 50  0001 C CNN
F 3 "" H 1150 3450 50  0001 C CNN
	1    1150 3450
	1    0    0    -1  
$EndComp
Text Notes 800  5000 0    50   ~ 0
— Lin. reg —\nVout = 1.242 x (1 + R2/R1 )\nUse 0.1% tolerance 0805
Wire Wire Line
	1600 3950 1350 3950
$Comp
L Device:C C16
U 1 1 5EE20682
P 1150 4100
F 0 "C16" H 1100 4300 50  0000 L CNN
F 1 "2.2u" H 850 4100 50  0000 L CNN
F 2 "Capacitor_SMD:C_0805_2012Metric" H 1188 3950 50  0001 C CNN
F 3 "~" H 1150 4100 50  0001 C CNN
	1    1150 4100
	1    0    0    -1  
$EndComp
Connection ~ 1150 3950
Wire Wire Line
	1150 3950 1050 3950
$Comp
L Device:R R21
U 1 1 5EE21216
P 1350 4100
F 0 "R21" H 1400 4150 50  0000 L CNN
F 1 "100k" H 1400 4050 50  0000 L CNN
F 2 "Resistor_SMD:R_0603_1608Metric" V 1280 4100 50  0001 C CNN
F 3 "~" H 1350 4100 50  0001 C CNN
	1    1350 4100
	1    0    0    -1  
$EndComp
Connection ~ 1350 3950
Wire Wire Line
	1350 3950 1150 3950
$Comp
L Device:R R22
U 1 1 5EE2AA80
P 1350 4400
F 0 "R22" H 1150 4400 50  0000 L CNN
F 1 "101k" H 1100 4300 50  0000 L CNN
F 2 "Resistor_SMD:R_0603_1608Metric" V 1280 4400 50  0001 C CNN
F 3 "~" H 1350 4400 50  0001 C CNN
	1    1350 4400
	1    0    0    -1  
$EndComp
$Comp
L Device:C C18
U 1 1 5EE2BA9E
P 1600 4400
F 0 "C18" H 1650 4500 50  0000 L CNN
F 1 "450p" H 1600 4300 50  0000 L CNN
F 2 "Capacitor_SMD:C_0603_1608Metric" H 1638 4250 50  0001 C CNN
F 3 "~" H 1600 4400 50  0001 C CNN
	1    1600 4400
	1    0    0    -1  
$EndComp
Wire Wire Line
	1600 4050 1600 4250
Wire Wire Line
	1600 4250 1350 4250
Connection ~ 1600 4250
Connection ~ 1350 4250
$Comp
L power:GND #PWR0142
U 1 1 5EE349B9
P 1600 4550
F 0 "#PWR0142" H 1600 4300 50  0001 C CNN
F 1 "GND" H 1605 4377 50  0000 C CNN
F 2 "" H 1600 4550 50  0001 C CNN
F 3 "" H 1600 4550 50  0001 C CNN
	1    1600 4550
	1    0    0    -1  
$EndComp
$Comp
L power:GND #PWR0143
U 1 1 5EE34E4C
P 1350 4550
F 0 "#PWR0143" H 1350 4300 50  0001 C CNN
F 1 "GND" H 1355 4377 50  0000 C CNN
F 2 "" H 1350 4550 50  0001 C CNN
F 3 "" H 1350 4550 50  0001 C CNN
	1    1350 4550
	1    0    0    -1  
$EndComp
Text Label 1050 3950 2    50   ~ 0
2V5
$Comp
L power:GND #PWR0103
U 1 1 5ED525D3
P 4650 6650
F 0 "#PWR0103" H 4650 6400 50  0001 C CNN
F 1 "GND" H 4655 6477 50  0000 C CNN
F 2 "" H 4650 6650 50  0001 C CNN
F 3 "" H 4650 6650 50  0001 C CNN
	1    4650 6650
	1    0    0    -1  
$EndComp
Wire Wire Line
	5200 6550 5200 6350
Text Label 5200 5900 2    50   ~ 0
2V5
Text Label 4600 6150 2    50   ~ 0
EFUSE_EN
$Comp
L Connector:Conn_01x02_Male J2
U 1 1 5ED512D2
P 4450 6550
F 0 "J2" H 4250 6450 50  0000 C CNN
F 1 "Conn_1x2" H 4250 6350 50  0000 C CNN
F 2 "Connector_PinHeader_2.54mm:PinHeader_2x01_P2.54mm_Vertical" H 4450 6550 50  0001 C CNN
F 3 "~" H 4450 6550 50  0001 C CNN
	1    4450 6550
	1    0    0    -1  
$EndComp
$Comp
L Device:Q_NMOS_GDS Q2
U 1 1 5EF18D99
P 10150 3050
F 0 "Q2" H 10354 3096 50  0000 L CNN
F 1 "FDN357N" H 10354 3005 50  0000 L CNN
F 2 "Package_TO_SOT_SMD:SOT-23" H 10350 3150 50  0001 C CNN
F 3 "~" H 10150 3050 50  0001 C CNN
	1    10150 3050
	1    0    0    -1  
$EndComp
Text Label 9750 3050 2    50   ~ 0
TRIM0_EN
Text Label 10700 2800 0    50   ~ 0
IREF_TRIM0
$Comp
L Device:Q_NMOS_GDS Q3
U 1 1 5EF28F9F
P 10100 4000
F 0 "Q3" H 10304 4046 50  0000 L CNN
F 1 "FDN357N" H 10304 3955 50  0000 L CNN
F 2 "Package_TO_SOT_SMD:SOT-23" H 10300 4100 50  0001 C CNN
F 3 "~" H 10100 4000 50  0001 C CNN
	1    10100 4000
	1    0    0    -1  
$EndComp
Text Label 9700 4000 2    50   ~ 0
TRIM1_EN
Text Label 10750 3750 0    50   ~ 0
IREF_TRIM1
$Comp
L Device:Q_NMOS_GDS Q4
U 1 1 5EF316BB
P 10050 4950
F 0 "Q4" H 10254 4996 50  0000 L CNN
F 1 "FDN357N" H 10250 4900 50  0000 L CNN
F 2 "Package_TO_SOT_SMD:SOT-23" H 10250 5050 50  0001 C CNN
F 3 "~" H 10050 4950 50  0001 C CNN
	1    10050 4950
	1    0    0    -1  
$EndComp
Text Label 9650 4950 2    50   ~ 0
TRIM2_EN
Text Label 10650 4700 0    50   ~ 0
IREF_TRIM2
$Comp
L Device:R R25
U 1 1 5EFD331B
P 6550 1350
F 0 "R25" H 6400 1550 50  0000 L CNN
F 1 "4.7k" H 6300 1350 50  0000 L CNN
F 2 "Resistor_SMD:R_0603_1608Metric" V 6480 1350 50  0001 C CNN
F 3 "~" H 6550 1350 50  0001 C CNN
	1    6550 1350
	1    0    0    -1  
$EndComp
Connection ~ 6550 1500
Wire Wire Line
	6450 1500 6550 1500
Wire Wire Line
	6450 1300 6450 1200
$Comp
L power:+5V #PWR0137
U 1 1 5F6C04D9
P 6900 1200
F 0 "#PWR0137" H 6900 1050 50  0001 C CNN
F 1 "+5V" H 6915 1373 50  0000 C CNN
F 2 "" H 6900 1200 50  0001 C CNN
F 3 "" H 6900 1200 50  0001 C CNN
	1    6900 1200
	1    0    0    -1  
$EndComp
Wire Wire Line
	6450 1200 6550 1200
Connection ~ 6550 1200
Wire Wire Line
	6550 1200 6700 1200
Connection ~ 6700 1200
Wire Wire Line
	6700 1200 6900 1200
Text Label 6900 1850 0    50   ~ 0
SDA
Wire Wire Line
	6550 1500 6900 1500
Wire Wire Line
	6700 1850 6900 1850
Wire Wire Line
	6700 1550 6700 1200
$Comp
L Device:R R26
U 1 1 5EFC7E2A
P 6700 1700
F 0 "R26" H 6770 1746 50  0000 L CNN
F 1 "4.7k" H 6770 1655 50  0000 L CNN
F 2 "Resistor_SMD:R_0603_1608Metric" V 6630 1700 50  0001 C CNN
F 3 "~" H 6700 1700 50  0001 C CNN
	1    6700 1700
	1    0    0    -1  
$EndComp
Wire Wire Line
	6450 1600 6600 1600
Wire Wire Line
	6600 1600 6600 1850
Wire Wire Line
	6450 1700 6550 1700
Wire Wire Line
	6550 1700 6550 1850
Wire Wire Line
	6550 1850 6600 1850
Connection ~ 6700 1850
Connection ~ 6600 1850
Wire Wire Line
	6600 1850 6700 1850
Text Label 5200 1700 2    50   ~ 0
EFUSE_EN
Text Label 5200 1800 2    50   ~ 0
TRIM0_EN
Text Label 5200 1900 2    50   ~ 0
TRIM1_EN
Text Label 5200 2000 2    50   ~ 0
TRIM2_EN
Text Label 5200 2100 2    50   ~ 0
TRIM3_EN
Text Label 5450 7250 2    50   ~ 0
VDD_SHUNT_EN
Text Label 6400 7500 0    50   ~ 0
VDD_SHUNT
Text Label 5950 7000 2    50   ~ 0
VIND
Text Label 5200 2200 2    50   ~ 0
VDD_SHUNT_EN
Wire Wire Line
	5950 7450 5950 7500
Wire Wire Line
	9650 2300 9650 2500
Wire Wire Line
	9650 2500 9800 2500
$Comp
L power:+5V #PWR0124
U 1 1 5F0F451B
P 9800 2500
F 0 "#PWR0124" H 9800 2350 50  0001 C CNN
F 1 "+5V" H 9815 2673 50  0000 C CNN
F 2 "" H 9800 2500 50  0001 C CNN
F 3 "" H 9800 2500 50  0001 C CNN
	1    9800 2500
	1    0    0    -1  
$EndComp
Wire Wire Line
	3100 4650 5850 4650
$Comp
L power:GND #PWR0107
U 1 1 5F0FD316
P 5000 5150
F 0 "#PWR0107" H 5000 4900 50  0001 C CNN
F 1 "GND" H 5005 4977 50  0000 C CNN
F 2 "" H 5000 5150 50  0001 C CNN
F 3 "" H 5000 5150 50  0001 C CNN
	1    5000 5150
	1    0    0    -1  
$EndComp
$Comp
L power:GND #PWR0135
U 1 1 5F0FE81B
P 9250 1200
F 0 "#PWR0135" H 9250 950 50  0001 C CNN
F 1 "GND" H 9150 1100 50  0000 C CNN
F 2 "" H 9250 1200 50  0001 C CNN
F 3 "" H 9250 1200 50  0001 C CNN
	1    9250 1200
	1    0    0    -1  
$EndComp
$Comp
L power:GND #PWR0136
U 1 1 5F100870
P 9550 1200
F 0 "#PWR0136" H 9550 950 50  0001 C CNN
F 1 "GND" H 9450 1100 50  0000 C CNN
F 2 "" H 9550 1200 50  0001 C CNN
F 3 "" H 9550 1200 50  0001 C CNN
	1    9550 1200
	1    0    0    -1  
$EndComp
Text Label 9750 1700 0    50   ~ 0
ALERT
Text Label 5100 1600 2    50   ~ 0
ALERT
Text Label 1950 1850 2    50   ~ 0
ALERT
Connection ~ 2400 2950
Wire Wire Line
	1600 3850 1500 3850
Wire Wire Line
	1500 3450 1500 3750
Wire Wire Line
	1600 3750 1500 3750
Wire Wire Line
	2350 3900 2350 4050
Connection ~ 1500 3750
Wire Wire Line
	1500 3750 1500 3850
Wire Wire Line
	2350 4050 2250 4050
Wire Wire Line
	2350 3750 2250 3750
Wire Wire Line
	2350 3750 2350 3900
Wire Wire Line
	8500 950  8750 950 
Wire Wire Line
	8750 950  8750 1100
Wire Wire Line
	8750 950  8850 950 
Connection ~ 8750 950 
Wire Wire Line
	8850 950  8850 1100
Wire Wire Line
	2800 1100 2900 1100
Wire Wire Line
	2800 1250 2800 1100
Wire Wire Line
	2900 1250 2900 1100
Connection ~ 2900 1100
Wire Wire Line
	2900 1100 3150 1100
$Comp
L power:GND #PWR0148
U 1 1 5F25D1B6
P 1150 4250
F 0 "#PWR0148" H 1150 4000 50  0001 C CNN
F 1 "GND" H 1000 4200 50  0000 C CNN
F 2 "" H 1150 4250 50  0001 C CNN
F 3 "" H 1150 4250 50  0001 C CNN
	1    1150 4250
	1    0    0    -1  
$EndComp
$Comp
L power:GND #PWR0117
U 1 1 5F25ED42
P 4550 5000
F 0 "#PWR0117" H 4550 4750 50  0001 C CNN
F 1 "GND" H 4555 4827 50  0000 C CNN
F 2 "" H 4550 5000 50  0001 C CNN
F 3 "" H 4550 5000 50  0001 C CNN
	1    4550 5000
	1    0    0    -1  
$EndComp
$Comp
L power:GND #PWR0144
U 1 1 5F260267
P 10250 3350
F 0 "#PWR0144" H 10250 3100 50  0001 C CNN
F 1 "GND" H 10255 3177 50  0000 C CNN
F 2 "" H 10250 3350 50  0001 C CNN
F 3 "" H 10250 3350 50  0001 C CNN
	1    10250 3350
	1    0    0    -1  
$EndComp
$Comp
L power:GND #PWR0145
U 1 1 5F2617A5
P 10200 4250
F 0 "#PWR0145" H 10200 4000 50  0001 C CNN
F 1 "GND" H 10300 4050 50  0000 C CNN
F 2 "" H 10200 4250 50  0001 C CNN
F 3 "" H 10200 4250 50  0001 C CNN
	1    10200 4250
	1    0    0    -1  
$EndComp
$Comp
L power:GND #PWR0146
U 1 1 5F262434
P 10150 5200
F 0 "#PWR0146" H 10150 4950 50  0001 C CNN
F 1 "GND" H 10155 5027 50  0000 C CNN
F 2 "" H 10150 5200 50  0001 C CNN
F 3 "" H 10150 5200 50  0001 C CNN
	1    10150 5200
	1    0    0    -1  
$EndComp
$Comp
L power:GND #PWR0115
U 1 1 5F263DF3
P 3700 5150
F 0 "#PWR0115" H 3700 4900 50  0001 C CNN
F 1 "GND" H 3705 4977 50  0000 C CNN
F 2 "" H 3700 5150 50  0001 C CNN
F 3 "" H 3700 5150 50  0001 C CNN
	1    3700 5150
	1    0    0    -1  
$EndComp
$Comp
L power:GND #PWR0116
U 1 1 5F264A4E
P 3450 5000
F 0 "#PWR0116" H 3450 4750 50  0001 C CNN
F 1 "GND" H 3455 4827 50  0000 C CNN
F 2 "" H 3450 5000 50  0001 C CNN
F 3 "" H 3450 5000 50  0001 C CNN
	1    3450 5000
	1    0    0    -1  
$EndComp
Wire Wire Line
	2000 2450 2000 2950
$Comp
L Device:R R20
U 1 1 5F2DE3F6
P 4850 6000
F 0 "R20" H 4600 6050 50  0000 L CNN
F 1 "10k" H 4650 5950 50  0000 L CNN
F 2 "Resistor_SMD:R_0603_1608Metric" V 4780 6000 50  0001 C CNN
F 3 "~" H 4850 6000 50  0001 C CNN
	1    4850 6000
	1    0    0    -1  
$EndComp
Wire Wire Line
	4900 6150 4850 6150
Connection ~ 4850 6150
Wire Wire Line
	4850 6150 4600 6150
$Comp
L Device:R R23
U 1 1 5F300333
P 5550 7100
F 0 "R23" H 5300 7150 50  0000 L CNN
F 1 "10k" H 5600 7100 50  0000 L CNN
F 2 "Resistor_SMD:R_0603_1608Metric" V 5480 7100 50  0001 C CNN
F 3 "~" H 5550 7100 50  0001 C CNN
	1    5550 7100
	1    0    0    -1  
$EndComp
Wire Wire Line
	5650 7250 5550 7250
Connection ~ 5550 7250
Wire Wire Line
	5550 7250 5450 7250
Wire Wire Line
	9650 1700 9750 1700
Wire Wire Line
	9650 2000 9750 2000
Wire Wire Line
	9650 2100 9750 2100
Wire Wire Line
	1950 2250 2000 2250
Wire Wire Line
	1950 2150 2000 2150
Wire Wire Line
	1950 1850 2000 1850
Wire Wire Line
	5250 1600 5200 1600
Wire Wire Line
	5250 1500 5100 1500
$Comp
L Device:Q_NMOS_GDS Q5
U 1 1 5EF3A82B
P 10100 6000
F 0 "Q5" H 10304 6046 50  0000 L CNN
F 1 "FDN357N" H 10300 5950 50  0000 L CNN
F 2 "Package_TO_SOT_SMD:SOT-23" H 10300 6100 50  0001 C CNN
F 3 "~" H 10100 6000 50  0001 C CNN
	1    10100 6000
	1    0    0    -1  
$EndComp
Text Label 9700 6000 2    50   ~ 0
TRIM3_EN
Text Label 10650 5700 0    50   ~ 0
IREF_TRIM3
$Comp
L power:GND #PWR0147
U 1 1 5F26317E
P 10200 6250
F 0 "#PWR0147" H 10200 6000 50  0001 C CNN
F 1 "GND" H 10205 6077 50  0000 C CNN
F 2 "" H 10200 6250 50  0001 C CNN
F 3 "" H 10200 6250 50  0001 C CNN
	1    10200 6250
	1    0    0    -1  
$EndComp
Wire Wire Line
	9900 6000 9850 6000
$Comp
L Device:R R29
U 1 1 5F35F0DE
P 9850 5850
F 0 "R29" H 9900 5850 50  0000 L CNN
F 1 "10k" H 9650 5850 50  0000 L CNN
F 2 "Resistor_SMD:R_0603_1608Metric" V 9780 5850 50  0001 C CNN
F 3 "~" H 9850 5850 50  0001 C CNN
	1    9850 5850
	1    0    0    -1  
$EndComp
Connection ~ 9850 6000
Wire Wire Line
	9850 6000 9700 6000
$Comp
L power:+5V #PWR0129
U 1 1 5F36157E
P 9850 5700
F 0 "#PWR0129" H 9850 5550 50  0001 C CNN
F 1 "+5V" H 9865 5873 50  0000 C CNN
F 2 "" H 9850 5700 50  0001 C CNN
F 3 "" H 9850 5700 50  0001 C CNN
	1    9850 5700
	1    0    0    -1  
$EndComp
$Comp
L Device:R R28
U 1 1 5F38FCE1
P 9800 5100
F 0 "R28" H 9850 5100 50  0000 L CNN
F 1 "10k" H 9600 5100 50  0000 L CNN
F 2 "Resistor_SMD:R_0603_1608Metric" V 9730 5100 50  0001 C CNN
F 3 "~" H 9800 5100 50  0001 C CNN
	1    9800 5100
	1    0    0    -1  
$EndComp
Wire Wire Line
	9900 4000 9850 4000
Wire Wire Line
	9850 4950 9800 4950
Wire Wire Line
	9750 3050 9900 3050
Connection ~ 9800 4950
Wire Wire Line
	9800 4950 9650 4950
$Comp
L Device:R R27
U 1 1 5F3AC5A7
P 9850 4150
F 0 "R27" H 9950 4150 50  0000 L CNN
F 1 "10k" H 9650 4150 50  0000 L CNN
F 2 "Resistor_SMD:R_0603_1608Metric" V 9780 4150 50  0001 C CNN
F 3 "~" H 9850 4150 50  0001 C CNN
	1    9850 4150
	1    0    0    -1  
$EndComp
Connection ~ 9850 4000
Wire Wire Line
	9850 4000 9700 4000
$Comp
L Device:R R24
U 1 1 5F3ACA08
P 9900 3200
F 0 "R24" H 10000 3200 50  0000 L CNN
F 1 "10k" H 9700 3200 50  0000 L CNN
F 2 "Resistor_SMD:R_0603_1608Metric" V 9830 3200 50  0001 C CNN
F 3 "~" H 9900 3200 50  0001 C CNN
	1    9900 3200
	1    0    0    -1  
$EndComp
Connection ~ 9900 3050
Wire Wire Line
	9900 3050 9950 3050
$Comp
L power:GND #PWR0130
U 1 1 5F3ACEE7
P 9800 5250
F 0 "#PWR0130" H 9800 5000 50  0001 C CNN
F 1 "GND" H 9700 5150 50  0000 C CNN
F 2 "" H 9800 5250 50  0001 C CNN
F 3 "" H 9800 5250 50  0001 C CNN
	1    9800 5250
	1    0    0    -1  
$EndComp
$Comp
L power:GND #PWR0150
U 1 1 5F3AD725
P 9900 3350
F 0 "#PWR0150" H 9900 3100 50  0001 C CNN
F 1 "GND" H 9905 3177 50  0000 C CNN
F 2 "" H 9900 3350 50  0001 C CNN
F 3 "" H 9900 3350 50  0001 C CNN
	1    9900 3350
	1    0    0    -1  
$EndComp
$Comp
L Device:Q_PMOS_DGS Q6
U 1 1 5F3AECB2
P 5850 7250
F 0 "Q6" H 6050 7350 50  0000 L CNN
F 1 "FDN340P" H 6050 7250 50  0000 L CNN
F 2 "Package_TO_SOT_SMD:SOT-23" H 6050 7350 50  0001 C CNN
F 3 "~" H 5850 7250 50  0001 C CNN
	1    5850 7250
	1    0    0    -1  
$EndComp
$Comp
L Device:Q_PMOS_DGS Q1
U 1 1 5F3B173B
P 5100 6150
F 0 "Q1" H 5304 6196 50  0000 L CNN
F 1 "FDN340P" H 5304 6105 50  0000 L CNN
F 2 "Package_TO_SOT_SMD:SOT-23" H 5300 6250 50  0001 C CNN
F 3 "~" H 5100 6150 50  0001 C CNN
	1    5100 6150
	1    0    0    -1  
$EndComp
$Comp
L power:+5V #PWR0151
U 1 1 5F3BC1DF
P 5550 6950
F 0 "#PWR0151" H 5550 6800 50  0001 C CNN
F 1 "+5V" H 5565 7123 50  0000 C CNN
F 2 "" H 5550 6950 50  0001 C CNN
F 3 "" H 5550 6950 50  0001 C CNN
	1    5550 6950
	1    0    0    -1  
$EndComp
$Comp
L power:+5V #PWR0152
U 1 1 5F3C6387
P 4850 5850
F 0 "#PWR0152" H 4850 5700 50  0001 C CNN
F 1 "+5V" H 4865 6023 50  0000 C CNN
F 2 "" H 4850 5850 50  0001 C CNN
F 3 "" H 4850 5850 50  0001 C CNN
	1    4850 5850
	1    0    0    -1  
$EndComp
$Comp
L Jumper:Jumper_2_Open JP2
U 1 1 5F3D098E
P 6150 7500
F 0 "JP2" H 6150 7600 50  0000 C CNN
F 1 "2-pin jumper" H 6150 7400 50  0000 C CNN
F 2 "Connector_PinHeader_2.54mm:PinHeader_2x01_P2.54mm_Vertical" H 6150 7500 50  0001 C CNN
F 3 "~" H 6150 7500 50  0001 C CNN
	1    6150 7500
	1    0    0    -1  
$EndComp
$Comp
L Jumper:Jumper_2_Open JP5
U 1 1 5F408271
P 10450 4700
F 0 "JP5" H 10250 4750 50  0000 C CNN
F 1 "2-pin jumper" H 10650 4600 50  0000 C CNN
F 2 "Connector_PinHeader_2.54mm:PinHeader_2x01_P2.54mm_Vertical" H 10450 4700 50  0001 C CNN
F 3 "~" H 10450 4700 50  0001 C CNN
	1    10450 4700
	1    0    0    -1  
$EndComp
$Comp
L Jumper:Jumper_2_Open JP6
U 1 1 5F40928B
P 10400 5700
F 0 "JP6" H 10400 5850 50  0000 C CNN
F 1 "2-pin jumper" H 10550 5600 50  0000 C CNN
F 2 "Connector_PinHeader_2.54mm:PinHeader_2x01_P2.54mm_Vertical" H 10400 5700 50  0001 C CNN
F 3 "~" H 10400 5700 50  0001 C CNN
	1    10400 5700
	1    0    0    -1  
$EndComp
$Comp
L Jumper:Jumper_2_Open JP4
U 1 1 5F409A5F
P 10550 3750
F 0 "JP4" H 10550 3900 50  0000 C CNN
F 1 "2-pin jumper" H 10600 3650 50  0000 C CNN
F 2 "Connector_PinHeader_2.54mm:PinHeader_2x01_P2.54mm_Vertical" H 10550 3750 50  0001 C CNN
F 3 "~" H 10550 3750 50  0001 C CNN
	1    10550 3750
	1    0    0    -1  
$EndComp
$Comp
L Jumper:Jumper_2_Open JP1
U 1 1 5F409C9C
P 4900 6550
F 0 "JP1" H 4900 6450 50  0000 C CNN
F 1 "2-pin jumper" H 4900 6700 50  0000 C CNN
F 2 "Connector_PinHeader_2.54mm:PinHeader_2x01_P2.54mm_Vertical" H 4900 6550 50  0001 C CNN
F 3 "~" H 4900 6550 50  0001 C CNN
	1    4900 6550
	1    0    0    -1  
$EndComp
$Comp
L Jumper:Jumper_2_Open JP3
U 1 1 5F40A0F5
P 10500 2800
F 0 "JP3" H 10500 2950 50  0000 C CNN
F 1 "2-pin jumper" H 10650 2700 50  0000 C CNN
F 2 "Connector_PinHeader_2.54mm:PinHeader_2x01_P2.54mm_Vertical" H 10500 2800 50  0001 C CNN
F 3 "~" H 10500 2800 50  0001 C CNN
	1    10500 2800
	1    0    0    -1  
$EndComp
Wire Wire Line
	3450 5000 3450 4950
Wire Wire Line
	7950 1600 7850 1600
Wire Wire Line
	7950 1700 7850 1700
Wire Wire Line
	7950 1800 7850 1800
Wire Wire Line
	7950 1900 7850 1900
Wire Wire Line
	7950 2000 7850 2000
Wire Wire Line
	7950 2100 7850 2100
Wire Wire Line
	7950 2200 7850 2200
Wire Wire Line
	7950 2300 7850 2300
Wire Wire Line
	5250 1800 5200 1800
Wire Wire Line
	5250 1900 5200 1900
Wire Wire Line
	5250 2000 5200 2000
Wire Wire Line
	5250 2100 5200 2100
Wire Wire Line
	5250 2200 5200 2200
Wire Wire Line
	3700 2450 3750 2450
Wire Wire Line
	3700 2350 3750 2350
Wire Wire Line
	3700 2250 3750 2250
Wire Wire Line
	3750 2150 3700 2150
Wire Wire Line
	3700 2050 3750 2050
Wire Wire Line
	3750 1950 3700 1950
Wire Wire Line
	3700 1850 3750 1850
Wire Wire Line
	3750 1750 3700 1750
Wire Wire Line
	10250 2850 10250 2800
Wire Wire Line
	10200 3800 10200 3750
Wire Wire Line
	10150 4700 10150 4750
Wire Wire Line
	10200 5700 10200 5800
Wire Wire Line
	5950 7050 5950 7000
Wire Wire Line
	5200 5900 5200 5950
Wire Wire Line
	5200 1600 5200 1450
Connection ~ 5200 1600
Wire Wire Line
	5200 1600 5100 1600
$Comp
L Device:R R30
U 1 1 5F648570
P 5200 1300
F 0 "R30" H 5000 1300 50  0000 L CNN
F 1 "4.7k" H 5250 1300 50  0000 L CNN
F 2 "Resistor_SMD:R_0603_1608Metric" V 5130 1300 50  0001 C CNN
F 3 "~" H 5200 1300 50  0001 C CNN
	1    5200 1300
	1    0    0    -1  
$EndComp
$Comp
L power:+5V #PWR01
U 1 1 5F648E32
P 5200 1100
F 0 "#PWR01" H 5200 950 50  0001 C CNN
F 1 "+5V" H 5215 1273 50  0000 C CNN
F 2 "" H 5200 1100 50  0001 C CNN
F 3 "" H 5200 1100 50  0001 C CNN
	1    5200 1100
	1    0    0    -1  
$EndComp
Wire Wire Line
	5200 1100 5200 1150
Wire Wire Line
	10250 3350 10250 3250
Wire Wire Line
	10200 4200 10200 4250
Wire Wire Line
	10150 5150 10150 5200
Wire Wire Line
	10200 6200 10200 6250
Wire Wire Line
	6350 7500 6400 7500
Wire Wire Line
	4650 6550 4700 6550
Wire Wire Line
	5100 6550 5200 6550
Text Notes 4450 6550 2    50   ~ 0
VDD_EFUSE
Wire Wire Line
	10650 5700 10600 5700
Wire Wire Line
	10150 4700 10250 4700
Wire Wire Line
	10200 3750 10350 3750
Wire Wire Line
	10300 2800 10250 2800
Wire Wire Line
	5250 1700 5200 1700
NoConn ~ 5250 2400
NoConn ~ 6350 4850
NoConn ~ 5050 5200
Wire Wire Line
	2250 3750 2250 4050
Wire Wire Line
	2400 2950 3000 2950
Wire Wire Line
	8650 2800 9050 2800
$EndSCHEMATC
