{
  "setupname": "sourcebox",
  "datastreams": [
    {
      "name": "monitoring",
      "sinks": ["InfluxDB"]
    },
    {
      "name": "debug",
      "sinks": ["Console"]
    },
    {
      "name": "console",
      "sinks": ["Console"]
    }
  ],
  "datasinks": [
    {
      "name": "CSV",
      "sinktype": "CSVSink",
      "directory": "."
    },
    {
      "name": "InfluxDB",
      "sinktype": "InfluxDBSink",
      "host": "128.3.50.38",
      "port": 8086,
      "database": "pixel_module_qc",
      "username": "pixel_module_qc_rw",
      "password": "gLY341kD6Yp0",
      "precision": 4
    }
  ],
  "devices": [
    {
      "name": "HMP4040-shieldtoad",
      "hw-type": "PS",
      "hw-model": "RS_HMP4040",
      "communication": {
        "protocol": "TextSerialCom",
        "termination": "\n",
        "baudrate": "B9600",
        "interlock-file": "/tmp/intlck",
        "port": "/dev/ttyACM1"
      }
    },
    {
      "name": "DT5472N",
      "hw-type": "PS",
      "hw-model": "DT5472NPs",
      "communication": {
        "protocol": "TextSerialCom",
        "termination": "\r\n",
        "baudrate": "B9600",
        "interlock-file": "/tmp/intlck",
        "port": "/dev/ttyACM2"
      }
    },
    {
      "name": "NGP804",
      "hw-type": "PS",
      "hw-model": "RS_NGP804",
      "communication": {
        "protocol": "TextSerialCom",
        "termination": "\n",
        "baudrate": "B9600",
        "interlock-file": "/tmp/intlck",
        "port": "/dev/ttyACM0"
      }
    },
    {
      "name": "Keithley-DMM6500",
      "hw-type": "Meter",
      "hw-model": "DMM6500",
      "communication": {
        "protocol": "CharDeviceCom",
        "port": "/dev/usbtmc0"
      }
    }
  ],
  "channels": [
    {
      "name": "peltier",
      "hw-type": "PS",
      "device": "NGP804",
      "channel": 1,
      "program": {
        "maxvoltage": 14.5,
        "maxcurrent": 17,
        "voltage": 1
      }
    },
    {
      "name": "ModuleLV",
      "hw-type": "PS",
      "device": "HMP4040-shieldtoad",
      "channel": 1,
      "program": {
        "maxvoltage": 3,
        "maxcurrent": 6.0
      }
    },
    {
      "name": "ModuleHV",
      "hw-type": "PS",
      "device": "DT5472N",
      "channel": 1,
      "program": {
        "maxvoltage": 100.0,
        "maxcurrent": 0.1
      }
    }
  ],
  "monitorsensors": [
    {
      "name": "ft232_sourcebox",
      "type": "FT232",
      "mux0_address": "0x70"
    },
    {
      "name": "chuck_hyt_hw",
      "type": "HYT271_I2C",
      "quantity": "Box HYT",
      "prescale": 1,
      "ft232": "ft232_sourcebox",
      "device_address": "0x28",
      "channelnum": 0,
      "fields": {
        "T": "temperature",
        "H": "humidity",
        "D": "dewPoint"
      }
    },
    {
      "name": "chuck_hyt",
      "type": "DEWPOINTSENSOR",
      "sensor": "chuck_hyt_hw",
      "accuracy": 1.0,
      "quantity": "Chuck HYT",
      "prescale": 1,
      "fields": {
        "T": "temperature",
        "H": "humidity",
        "D": "dewPoint",
        "DL": "dewPointLimit"
      }
    },
    {
      "name": "vacuum",
      "type": "ADCSensor",
      "sensor": "MPX5100_ADC",
      "quantity": "Vacuum",
      "prescale": 1,
      "ft232": "ft232_sourcebox",
      "device_address": "0x48",
      "channelnum": 7,
      "adc_channel": 0,
      "gain": 1,
      "fields": {
        "p": "deltaP"
      }
    },
    {
      "name": "peltier",
      "type": "PSChannel",
      "quantity": "Peltier_IV",
      "prescale": 1,
      "fields": {
        "V": "measureVoltage",
        "I": "measureCurrent"
      }
    },
    {
      "name": "module_NTC",
      "type": "ADCSensor",
      "sensor": "NTC_ADC",
      "quantity": "Module NTC",
      "prescale": 1,
      "ft232": "ft232_sourcebox",
      "device_address": "0x48",
      "channelnum": 1,
      "adc_channel": 0,
      "gain": 1,
      "fields": {
        "T": "temperature"
      }
    },
    {
      "name": "chuck_NTC",
      "type": "ADCSensor",
      "sensor": "NTC_ADC",
      "quantity": "Chuck NTC",
      "prescale": 1,
      "ft232": "ft232_sourcebox",
      "device_address": "0x48",
      "channelnum": 4,
      "adc_channel": 0,
      "gain": 1,
      "fields": {
        "T": "temperature"
      }
    },
    {
      "name": "dryair_flow",
      "type": "ADCSensor",
      "sensor": "SFM3020_ADC",
      "quantity": "Dry air flow",
      "prescale": 1,
      "ft232": "ft232_sourcebox",
      "device_address": "0x48",
      "channelnum": 6,
      "adc_channel": 0,
      "gain": 1,
      "fields": {
        "lpm": "flow"
      }
    },
    {
      "name": "analog_humidity",
      "type": "ADCSensor",
      "sensor": "HIH4031_ADC",
      "quantity": "Analog Humidity",
      "prescale": 1,
      "ft232": "ft232_sourcebox",
      "device_address": "0x48",
      "channelnum": 7,
      "adc_channel": 2,
      "gain": 1,
      "fields": {
        "H": "humidity"
      }
    },
    {
      "name": "controller_setup1",
      "type": "CONTROLLER",
      "quantity": "Controller",
      "fields": {
        "wdStatus": "monWatchdogStatus",
        "monStatus": "monMonStatus",
        "ctrlStatus": "monCtrlStatus",
        "swintStatus": "monSWintStatus"
      }
    },
    {
      "name": "ModuleLV",
      "type": "PSChannel",
      "quantity": "Module_LV",
      "prescale": 1,
      "fields": {
        "V": "measureVoltage",
        "I": "measureCurrent"
      }
    },
    {
      "name": "ModuleHV",
      "type": "PSChannel",
      "quantity": "Module_HV",
      "prescale": 1,
      "fields": {
        "V": "measureVoltage",
        "I": "measureCurrent"
      }
    }
  ],
  "monitoring": {
    "groups": [
      {
        "name": "labequip",
        "enable": true,
        "measurementInterval": 1.0,
        "sensors": ["ModuleLV", "peltier"]
      },
      {
        "name": "hvps",
        "enable": true,
        "measurementInterval": 1.0,
        "sensors": ["ModuleHV"]
      },
      {
        "name": "ft232",
        "enable": true,
        "measurementInterval": 0.1,
        "sensors": [
          "module_NTC",
          "chuck_hyt",
          "chuck_NTC",
          "vacuum",
          "dryair_flow",
          "analog_humidity",
          "controller_setup1"
        ]
      }
    ],
    "allsensors": [
      "module_NTC",
      "ModuleLV",
      "ModuleHV",
      "chuck_hyt",
      "chuck_hyt_hw",
      "chuck_NTC",
      "vacuum",
      "controller_setup1"
    ],
    "measurementName": "sourcebox_test"
  },
  "watchdog": {
    "watchdogInterval": 3,
    "alertEmailList": "fhartanto@lbl.gov",
    "maxMonitoringHeartBeatInterval": 10,
    "maxControlHeartBeatInterval": 20,
    "maxSWintHeartBeatInterval": 10
  },
  "control": {
    "arduino": "arduino_setup1",
    "chillerTemperatureAccuracy": 1.0,
    "envSensor": "chuck_hyt",
    "interlocks": [],
    "ambientTemperature": 5,
    "temperatureAccuracy": 5.0,
    "maxAllowedTemperature": 65,
    "pidtunings": {
      "Kp": 0.4,
      "Ki": 0.002,
      "Kd": 1.0
    },
    "pidInterval": 1,
    "monRampInterval": 10,
    "moduleSetups": [
      {
        "name": "module1",
        "enabled": 1,
        "moduleNTC": "module_NTC",
        "peltierSensor": "chuck_NTC",
        "peltierPower": "peltier",
        "peltierMinVoltage": 0.8,
        "peltierMaxVoltage": 13,
        "peltierMaxCurrent": 17,
        "moduleLV": "ModuleLV",
        "monRampSensor": "chuck_NTC",
        "pidRampRatePerMin": 12
      }
    ]
  }
}
