{
    "version": "1.0",
    "devices": [
        {
            "name": "LV",
            "hw-type": "PS",
            "hw-model": "AgilentE3631APs",
            "communication": {
                "protocol": "GPIBSerialCom",
                "port": "/dev/ttyUSB0",
                "gpib_addr": 5,
                "read_tmo_ms": 1000
            }
        }
    ],
    "channels": [
        {
            "name": "FakePB",
            "hw-type": "PS",
            "device": "LV",
            "channel": 1
        }
    ]
}
