# from https://www.mouser.com/datasheet/2/315/AUA0000C8-1131141.pdf
# steinhart fit results: A=0.0008965385843868059,B=0.00025192882027716206,C=1.7286679951248717e-07
# Temp[C] Resistance[kOhm]
-40    205.2
-35    154.8
-30    117.9
-25    90.69
-20    70.37
-15    55.07
-10    43.44
-5     34.53
0      27.64
5      22.27
10     18.06
15     14.74
20     12.11
25     10.00
30     8.309
35     6.941
40     5.828
45     4.916
50     4.165
55     3.543
60     3.027
65     2.595
70     2.233
75     1.929
80     1.672
85     1.451
90     1.261
95     1.097
100    0.9563
105    0.8357
110    0.7317
115    0.6421
120    0.565
125    0.4986
