{
    "Data": [0.0, 0.0, 0.0, 0.0, 0.0, 0.0, 0.0, 0.0, 0.0, 1.0, 0.0, 1.0, 0.0, 0.0, 48.0, 30.0, 15.0, 31.0, 50.0, 30.0, 33.0, 117.0, 129.0, 94.0, 107.0, 226.0, 352.0, 300.0, 244.0, 365.0, 640.0, 836.0, 648.0, 564.0, 898.0, 1160.0, 868.0, 661.0, 1025.0, 1631.0, 1533.0, 1021.0, 1181.0, 2048.0, 1967.0, 1442.0, 1365.0, 1826.0, 2321.0, 1996.0, 1346.0, 1326.0, 1590.0, 1499.0, 1136.0, 1097.0, 1255.0, 1364.0, 1167.0, 914.0, 927.0, 969.0, 950.0, 812.0, 710.0, 737.0, 770.0, 713.0, 557.0, 541.0, 544.0, 609.0, 503.0, 449.0, 374.0, 366.0, 388.0, 360.0, 307.0, 258.0, 269.0, 276.0, 239.0, 202.0, 199.0, 170.0, 157.0, 156.0, 133.0, 132.0, 129.0, 102.0, 104.0, 104.0, 88.0, 100.0, 69.0, 73.0, 73.0, 64.0, 73.0, 46.0, 60.0, 56.0, 57.0, 49.0, 35.0, 51.0, 56.0, 47.0, 36.0, 39.0, 49.0, 38.0, 32.0, 34.0, 32.0, 19.0, 26.0, 26.0, 29.0, 25.0, 15.0, 25.0, 22.0, 20.0, 23.0, 20.0, 9.0, 21.0, 16.0, 13.0, 24.0, 13.0, 15.0, 13.0, 17.0, 11.0, 11.0, 8.0, 16.0, 19.0, 14.0, 10.0, 9.0, 9.0, 9.0, 9.0, 16.0, 14.0, 14.0, 8.0, 8.0, 15.0, 8.0, 10.0, 5.0, 5.0, 4.0, 8.0, 8.0, 6.0, 7.0, 6.0, 4.0, 7.0, 3.0, 6.0, 9.0, 5.0, 8.0, 11.0, 5.0, 3.0, 6.0, 6.0, 2.0, 4.0, 7.0, 5.0, 2.0, 4.0, 4.0, 5.0, 6.0, 4.0, 7.0, 5.0, 6.0, 6.0, 3.0, 2.0, 5.0, 6.0, 0.0, 6.0, 2.0, 5.0, 3.0, 6.0, 2.0],
    "Name": "TimePerFitDist-0",
    "Overflow": 307.0,
    "Type": "Histo1d",
    "Underflow": 0.0,
    "x": {
        "AxisTitle": "Fit Time [us]",
        "Bins": 201,
        "High": 401.0,
        "Low": -1.0
    },
    "y": {
        "AxisTitle": "Number of Pixels"
    },
    "z": {
        "AxisTitle": "z"
    }
}