{
    "Data": [0.0, 0.0, 0.0, 0.0, 0.0, 0.0, 0.0, 0.0, 0.0, 0.0, 0.0, 0.0, 0.0, 0.0, 2.0, 0.0, 0.0, 12.0, 584.0, 364.0, 23.0, 124.0, 3081.0, 3761.0, 402.0, 350.0, 2510.0, 3466.0, 620.0, 416.0, 1532.0, 2287.0, 835.0, 249.0, 425.0, 529.0, 340.0, 254.0, 447.0, 503.0, 419.0, 482.0, 998.0, 1664.0, 1313.0, 1195.0, 1974.0, 2867.0, 2909.0, 2488.0, 2406.0, 2608.0, 2817.0, 2227.0, 2100.0, 1985.0, 2283.0, 2033.0, 1826.0, 1766.0, 1625.0, 1454.0, 1039.0, 845.0, 805.0, 840.0, 834.0, 590.0, 586.0, 521.0, 581.0, 528.0, 388.0, 323.0, 266.0, 289.0, 259.0, 221.0, 187.0, 178.0, 177.0, 150.0, 119.0, 108.0, 98.0, 112.0, 86.0, 67.0, 69.0, 63.0, 63.0, 45.0, 50.0, 50.0, 41.0, 41.0, 32.0, 36.0, 39.0, 34.0, 24.0, 29.0, 20.0, 22.0, 21.0, 25.0, 17.0, 23.0, 22.0, 14.0, 12.0, 20.0, 16.0, 5.0, 13.0, 13.0, 20.0, 12.0, 14.0, 14.0, 11.0, 7.0, 7.0, 9.0, 9.0, 6.0, 8.0, 8.0, 6.0, 6.0, 6.0, 9.0, 1.0, 1.0, 7.0, 7.0, 6.0, 7.0, 7.0, 3.0, 1.0, 3.0, 1.0, 3.0, 6.0, 5.0, 1.0, 1.0, 4.0, 1.0, 1.0, 3.0, 1.0, 4.0, 2.0, 2.0, 4.0, 0.0, 2.0, 0.0, 3.0, 4.0, 1.0, 0.0, 0.0, 0.0, 0.0, 2.0, 0.0, 3.0, 2.0, 2.0, 1.0, 1.0, 0.0, 2.0, 0.0, 1.0, 0.0, 2.0, 0.0, 0.0, 0.0, 0.0, 2.0, 0.0, 0.0, 1.0, 0.0, 2.0, 1.0, 1.0, 1.0, 1.0, 2.0, 0.0, 1.0, 2.0, 0.0, 0.0, 2.0],
    "Name": "TimePerFitDist-0",
    "Overflow": 107.0,
    "Type": "Histo1d",
    "Underflow": 0.0,
    "x": {
        "AxisTitle": "Fit Time [us]",
        "Bins": 201,
        "High": 401.0,
        "Low": -1.0
    },
    "y": {
        "AxisTitle": "Number of Pixels"
    },
    "z": {
        "AxisTitle": "z"
    }
}