{
    "Data": [9.0, 60.0, 33.0, 9.0, 20.0, 42.0, 134.0, 510.0, 1486.0, 3099.0, 4822.0, 5440.0, 4918.0, 3911.0, 3193.0, 3234.0, 3280.0, 3044.0, 2666.0, 2280.0, 1967.0, 1840.0, 1685.0, 1510.0, 1202.0, 902.0, 648.0, 399.0, 296.0, 222.0, 238.0, 244.0, 271.0, 374.0, 404.0, 525.0, 604.0, 663.0, 805.0, 852.0, 907.0, 1045.0, 1035.0, 1100.0, 1068.0, 991.0, 962.0, 886.0, 821.0, 726.0, 677.0, 536.0, 523.0, 440.0, 395.0, 360.0, 296.0, 268.0, 227.0, 234.0, 227.0, 183.0, 159.0, 176.0, 128.0, 130.0, 114.0, 94.0, 98.0, 92.0, 82.0, 90.0, 72.0, 83.0, 58.0, 61.0, 45.0, 51.0, 51.0, 54.0, 32.0, 44.0, 33.0, 36.0, 30.0, 26.0, 39.0, 29.0, 31.0, 21.0, 30.0, 30.0, 32.0, 25.0, 24.0, 30.0, 16.0, 22.0, 22.0, 16.0, 18.0, 17.0, 16.0, 14.0, 16.0, 11.0, 10.0, 10.0, 12.0, 6.0, 7.0, 4.0, 7.0, 3.0, 3.0, 6.0],
    "Name": "NoiseDist-0",
    "Overflow": 334.0,
    "Type": "Histo1d",
    "Underflow": 0.0,
    "x": {
        "AxisTitle": "Noise [e]",
        "Bins": 116,
        "High": 581.0,
        "Low": -2.0
    },
    "y": {
        "AxisTitle": "Number of Pixels"
    },
    "z": {
        "AxisTitle": "z"
    }
}