{
    "Data": [0.0, 0.0, 0.0, 0.0, 0.0, 0.0, 0.0, 0.0, 0.0, 0.0, 0.0, 0.0, 0.0, 0.0, 1.0, 3.0, 0.0, 26.0, 308.0, 83.0, 25.0, 734.0, 3275.0, 1252.0, 264.0, 1583.0, 3777.0, 1780.0, 489.0, 1488.0, 2545.0, 1398.0, 448.0, 586.0, 743.0, 580.0, 366.0, 1012.0, 1365.0, 1086.0, 698.0, 2168.0, 3490.0, 4027.0, 2052.0, 1748.0, 3783.0, 3954.0, 3422.0, 1882.0, 2393.0, 2775.0, 2973.0, 1762.0, 1171.0, 1397.0, 1221.0, 1203.0, 765.0, 841.0, 775.0, 743.0, 607.0, 437.0, 488.0, 410.0, 435.0, 311.0, 336.0, 283.0, 263.0, 247.0, 191.0, 203.0, 167.0, 188.0, 130.0, 129.0, 110.0, 89.0, 127.0, 129.0, 86.0, 71.0, 69.0, 71.0, 60.0, 61.0, 47.0, 57.0, 34.0, 43.0, 41.0, 38.0, 42.0, 37.0, 23.0, 25.0, 20.0, 29.0, 21.0, 27.0, 17.0, 16.0, 19.0, 13.0, 12.0, 13.0, 13.0, 19.0, 6.0, 10.0, 8.0, 5.0, 8.0, 7.0, 10.0, 6.0, 9.0, 6.0, 7.0, 9.0, 4.0, 9.0, 11.0, 2.0, 4.0, 6.0, 5.0, 3.0, 7.0, 3.0, 10.0, 3.0, 4.0, 3.0, 2.0, 2.0, 1.0, 4.0, 1.0, 3.0, 5.0, 2.0, 3.0, 3.0, 4.0, 2.0, 1.0, 1.0, 3.0, 1.0, 1.0, 1.0, 2.0, 3.0, 0.0, 0.0, 2.0, 1.0, 4.0, 1.0, 1.0, 0.0, 1.0, 0.0, 0.0, 1.0, 0.0, 1.0, 1.0, 1.0, 1.0, 1.0, 4.0, 0.0, 0.0, 1.0, 0.0, 1.0, 1.0, 0.0, 1.0, 0.0, 0.0, 0.0, 0.0, 0.0, 2.0, 1.0, 0.0, 1.0, 0.0, 0.0, 0.0, 0.0, 0.0, 0.0, 1.0, 0.0, 0.0],
    "Name": "TimePerFitDist-0",
    "Overflow": 68.0,
    "Type": "Histo1d",
    "Underflow": 0.0,
    "x": {
        "AxisTitle": "Fit Time [us]",
        "Bins": 201,
        "High": 401.0,
        "Low": -1.0
    },
    "y": {
        "AxisTitle": "Number of Pixels"
    },
    "z": {
        "AxisTitle": "z"
    }
}