{
    "Data": [14.0, 66.0, 20.0, 11.0, 40.0, 40.0, 115.0, 374.0, 1104.0, 2644.0, 4626.0, 5571.0, 5165.0, 3918.0, 3189.0, 3178.0, 2986.0, 3115.0, 2757.0, 2424.0, 2137.0, 1941.0, 1902.0, 1575.0, 1351.0, 1002.0, 713.0, 521.0, 362.0, 318.0, 259.0, 273.0, 302.0, 350.0, 395.0, 436.0, 479.0, 576.0, 636.0, 655.0, 725.0, 844.0, 831.0, 885.0, 962.0, 925.0, 893.0, 855.0, 804.0, 747.0, 744.0, 670.0, 569.0, 510.0, 469.0, 422.0, 399.0, 354.0, 337.0, 299.0, 250.0, 238.0, 248.0, 178.0, 169.0, 140.0, 148.0, 137.0, 117.0, 136.0, 122.0, 90.0, 75.0, 84.0, 87.0, 83.0, 60.0, 76.0, 61.0, 72.0, 53.0, 36.0, 44.0, 36.0, 44.0, 38.0, 36.0, 32.0, 27.0, 23.0, 29.0, 24.0, 17.0, 11.0, 22.0, 19.0, 14.0, 17.0, 17.0, 21.0, 9.0, 13.0, 11.0, 23.0, 14.0, 19.0, 11.0, 16.0, 11.0, 17.0, 22.0, 19.0, 14.0, 8.0, 10.0, 11.0, 6.0, 9.0, 13.0, 9.0, 17.0],
    "Name": "NoiseDist-0",
    "Overflow": 286.0,
    "Type": "Histo1d",
    "Underflow": 0.0,
    "x": {
        "AxisTitle": "Noise [e]",
        "Bins": 121,
        "High": 606.0,
        "Low": -2.0
    },
    "y": {
        "AxisTitle": "Number of Pixels"
    },
    "z": {
        "AxisTitle": "z"
    }
}