{
    "Data": [0.0, 0.0, 0.0, 0.0, 0.0, 0.0, 0.0, 0.0, 0.0, 0.0, 0.0, 0.0, 0.0, 0.0, 0.0, 0.0, 0.0, 0.0, 0.0, 0.0, 0.0, 0.0, 0.0, 0.0, 0.0, 0.0, 0.0, 0.0, 0.0, 0.0, 0.0, 0.0, 0.0, 0.0, 0.0, 0.0, 0.0, 0.0, 0.0, 0.0, 0.0, 0.0, 0.0, 0.0, 0.0, 0.0, 0.0, 0.0, 0.0, 0.0, 3.0, 4.0, 5.0, 9.0, 3.0, 9.0, 9.0, 5.0, 13.0, 16.0, 12.0, 21.0, 25.0, 20.0, 28.0, 33.0, 52.0, 53.0, 69.0, 82.0, 101.0, 103.0, 151.0, 157.0, 196.0, 208.0, 257.0, 287.0, 338.0, 364.0, 428.0, 457.0, 489.0, 552.0, 641.0, 691.0, 724.0, 833.0, 865.0, 894.0, 992.0, 1000.0, 1076.0, 1031.0, 1096.0, 990.0, 1020.0, 1012.0, 948.0, 927.0, 886.0, 830.0, 874.0, 850.0, 801.0, 912.0, 1042.0, 1193.0, 1305.0, 1424.0, 1561.0, 1596.0, 1721.0, 1727.0, 1796.0, 1666.0, 1638.0, 1542.0, 1386.0, 1247.0, 1137.0, 998.0, 911.0, 755.0, 603.0, 453.0, 336.0, 308.0, 246.0, 168.0, 180.0, 146.0, 90.0, 72.0, 64.0, 55.0, 41.0, 32.0, 29.0, 15.0, 22.0, 23.0, 17.0, 16.0, 11.0, 12.0, 14.0, 15.0, 17.0, 13.0, 7.0, 9.0, 13.0, 6.0, 13.0, 12.0, 10.0, 13.0, 13.0, 17.0, 22.0, 29.0, 23.0, 27.0, 34.0, 34.0, 43.0, 48.0, 41.0, 45.0, 47.0, 83.0, 75.0, 64.0, 72.0, 86.0, 87.0, 114.0, 117.0, 102.0, 138.0, 140.0, 213.0, 183.0, 198.0, 175.0, 213.0, 234.0, 392.0, 268.0, 247.0, 279.0, 291.0, 426.0, 368.0, 335.0, 334.0, 353.0, 368.0, 488.0, 362.0, 388.0, 378.0, 385.0, 400.0, 429.0, 377.0, 345.0, 331.0, 331.0, 403.0, 299.0, 297.0, 264.0, 240.0, 299.0, 321.0, 200.0, 183.0, 162.0, 197.0, 255.0, 144.0, 114.0, 115.0, 114.0, 168.0, 118.0, 116.0, 119.0, 97.0, 110.0, 109.0, 93.0, 86.0, 86.0, 75.0, 91.0, 65.0, 77.0, 67.0, 52.0, 68.0, 59.0, 67.0, 63.0, 54.0, 55.0, 42.0, 51.0, 46.0, 49.0, 68.0, 47.0, 54.0, 65.0, 41.0, 45.0, 51.0, 49.0, 45.0, 38.0, 29.0, 34.0, 40.0, 36.0, 38.0, 36.0, 30.0, 34.0, 40.0, 26.0, 24.0, 23.0, 37.0, 26.0, 26.0, 24.0, 28.0, 27.0, 30.0, 36.0, 32.0, 25.0, 28.0, 30.0, 24.0, 20.0, 21.0, 22.0, 17.0, 24.0, 26.0, 21.0, 20.0, 19.0, 18.0, 11.0, 17.0, 36.0, 26.0, 19.0, 15.0, 12.0, 17.0, 20.0, 21.0, 17.0, 18.0, 16.0, 14.0, 17.0, 13.0, 11.0, 9.0, 14.0, 17.0, 18.0, 16.0, 11.0, 10.0, 11.0, 9.0, 13.0, 14.0, 5.0, 0.0, 0.0, 0.0, 0.0, 0.0, 0.0, 0.0, 0.0, 0.0, 0.0, 0.0, 0.0, 0.0, 0.0, 0.0, 0.0, 0.0, 0.0, 0.0, 0.0, 0.0, 0.0, 0.0, 0.0, 0.0, 0.0, 0.0, 0.0, 0.0, 0.0, 0.0, 0.0, 0.0, 0.0, 0.0, 0.0, 0.0, 0.0, 0.0, 0.0, 0.0, 0.0, 0.0, 0.0, 0.0, 0.0, 0.0, 0.0, 0.0, 0.0, 0.0, 0.0, 0.0, 0.0, 0.0, 0.0, 0.0],
    "Name": "ThresholdDist-0",
    "Overflow": 0.0,
    "Type": "Histo1d",
    "Underflow": 0.0,
    "x": {
        "AxisTitle": "Threshold [e]",
        "Bins": 383,
        "High": 3825.0,
        "Low": -5.0
    },
    "y": {
        "AxisTitle": "Number of Pixels"
    },
    "z": {
        "AxisTitle": "z"
    }
}