time,Hardware,Voltage,Current
1621626493865,high-voltage-3,1,0.0848526
time,Hardware,Voltage,Current
1621626493865,high-voltage-3,2,0.0926732
time,Hardware,Voltage,Current
1621626493865,high-voltage-3,3,0.0962309
time,Hardware,Voltage,Current
1621626493865,high-voltage-3,4,0.101235
time,Hardware,Voltage,Current
1621626493865,high-voltage-3,5,0.103858
time,Hardware,Voltage,Current
1621626493865,high-voltage-3,6,0.107987
time,Hardware,Voltage,Current
1621626493865,high-voltage-3,7,0.110948
time,Hardware,Voltage,Current
1621626493865,high-voltage-3,8,0.113511
time,Hardware,Voltage,Current
1621626493865,high-voltage-3,9,0.115131
time,Hardware,Voltage,Current
1621626493865,high-voltage-3,10,0.119305
time,Hardware,Voltage,Current
1621626493865,high-voltage-3,11,0.12272
time,Hardware,Voltage,Current
1621626493865,high-voltage-3,12,0.125243
time,Hardware,Voltage,Current
1621626493865,high-voltage-3,13,0.129679
time,Hardware,Voltage,Current
1621626493865,high-voltage-3,14,0.132038
time,Hardware,Voltage,Current
1621626493865,high-voltage-3,15,0.132889
time,Hardware,Voltage,Current
1621626493865,high-voltage-3,1.35879e-07,0.135439
time,Hardware,Voltage,Current
1621626493865,high-voltage-3,17,0.137242
time,Hardware,Voltage,Current
1621626493865,high-voltage-3,18,0.140643
time,Hardware,Voltage,Current
1621626493865,high-voltage-3,19,0.142117
time,Hardware,Voltage,Current
1621626493865,high-voltage-3,20,0.144753
time,Hardware,Voltage,Current
1621626493865,high-voltage-3,25,0.153161
time,Hardware,Voltage,Current
1621626493865,high-voltage-3,30,0.162879
time,Hardware,Voltage,Current
1621626493865,high-voltage-3,35,0.171465
time,Hardware,Voltage,Current
1621626493865,high-voltage-3,40,0.17976
time,Hardware,Voltage,Current
1621626493865,high-voltage-3,45,0.186502
time,Hardware,Voltage,Current
1621626493865,high-voltage-3,50,0.192165
time,Hardware,Voltage,Current
1621626493865,high-voltage-3,55,0.196826
time,Hardware,Voltage,Current
1621626493865,high-voltage-3,60,0.201664
time,Hardware,Voltage,Current
1621626493865,high-voltage-3,65,0.206072
time,Hardware,Voltage,Current
1621626493865,high-voltage-3,70,0.211241
