{
    "Data": [[5601.0, 3003.0, 2053.0, 1658.0, 1358.0, 1181.0, 1053.0, 925.0, 861.0, 715.0, 726.0, 694.0, 621.0, 626.0, 555.0, 528.0, 501.0, 517.0, 489.0, 431.0, 421.0, 403.0, 418.0, 425.0, 418.0, 428.0, 413.0, 434.0, 413.0, 423.0, 392.0, 373.0, 394.0, 375.0, 397.0, 390.0, 382.0, 369.0, 402.0, 408.0, 392.0, 411.0, 396.0, 387.0, 422.0, 447.0, 436.0, 470.0, 526.0], [5736.0, 3066.0, 2035.0, 1677.0, 1306.0, 1198.0, 1060.0, 970.0, 895.0, 790.0, 748.0, 660.0, 605.0, 616.0, 595.0, 519.0, 505.0, 512.0, 485.0, 434.0, 455.0, 418.0, 404.0, 441.0, 421.0, 406.0, 434.0, 430.0, 410.0, 414.0, 376.0, 376.0, 385.0, 394.0, 419.0, 382.0, 396.0, 384.0, 392.0, 419.0, 442.0, 414.0, 429.0, 455.0, 473.0, 463.0, 505.0, 606.0, 686.0], [5749.0, 3112.0, 2098.0, 1677.0, 1364.0, 1224.0, 1037.0, 943.0, 852.0, 810.0, 728.0, 685.0, 635.0, 647.0, 561.0, 545.0, 520.0, 497.0, 480.0, 491.0, 487.0, 452.0, 388.0, 417.0, 431.0, 457.0, 429.0, 394.0, 402.0, 437.0, 398.0, 434.0, 424.0, 402.0, 394.0, 389.0, 404.0, 438.0, 425.0, 429.0, 394.0, 416.0, 440.0, 493.0, 569.0, 512.0, 569.0, 634.0, 891.0], [5832.0, 3087.0, 2199.0, 1709.0, 1415.0, 1219.0, 1014.0, 924.0, 879.0, 808.0, 744.0, 679.0, 660.0, 621.0, 606.0, 559.0, 537.0, 498.0, 514.0, 501.0, 470.0, 482.0, 460.0, 450.0, 418.0, 443.0, 434.0, 410.0, 404.0, 392.0, 417.0, 369.0, 404.0, 398.0, 411.0, 428.0, 382.0, 403.0, 429.0, 405.0, 454.0, 442.0, 472.0, 537.0, 512.0, 582.0, 607.0, 757.0, 995.0], [5786.0, 3227.0, 2258.0, 1749.0, 1369.0, 1235.0, 1056.0, 975.0, 878.0, 822.0, 762.0, 728.0, 652.0, 593.0, 586.0, 563.0, 538.0, 521.0, 468.0, 491.0, 491.0, 438.0, 478.0, 429.0, 449.0, 419.0, 436.0, 442.0, 449.0, 410.0, 403.0, 411.0, 447.0, 415.0, 453.0, 409.0, 457.0, 462.0, 446.0, 407.0, 468.0, 476.0, 466.0, 497.0, 537.0, 601.0, 677.0, 778.0, 1129.0], [5956.0, 3195.0, 2244.0, 1721.0, 1486.0, 1206.0, 1088.0, 950.0, 891.0, 804.0, 800.0, 703.0, 649.0, 627.0, 584.0, 575.0, 542.0, 489.0, 510.0, 541.0, 514.0, 469.0, 489.0, 452.0, 432.0, 451.0, 453.0, 381.0, 420.0, 428.0, 452.0, 450.0, 406.0, 424.0, 428.0, 420.0, 440.0, 467.0, 465.0, 487.0, 440.0, 480.0, 476.0, 538.0, 547.0, 597.0, 679.0, 780.0, 1320.0], [5971.0, 3079.0, 2171.0, 1733.0, 1374.0, 1292.0, 1124.0, 980.0, 917.0, 802.0, 763.0, 682.0, 678.0, 706.0, 580.0, 585.0, 567.0, 547.0, 481.0, 481.0, 513.0, 504.0, 469.0, 480.0, 434.0, 471.0, 432.0, 452.0, 408.0, 410.0, 441.0, 504.0, 476.0, 446.0, 417.0, 426.0, 472.0, 427.0, 448.0, 455.0, 464.0, 473.0, 477.0, 538.0, 558.0, 623.0, 749.0, 877.0, 1361.0], [5791.0, 3182.0, 2232.0, 1766.0, 1443.0, 1240.0, 1110.0, 953.0, 853.0, 836.0, 745.0, 735.0, 704.0, 619.0, 603.0, 651.0, 548.0, 542.0, 510.0, 510.0, 489.0, 467.0, 444.0, 429.0, 471.0, 448.0, 436.0, 430.0, 446.0, 477.0, 452.0, 456.0, 428.0, 455.0, 426.0, 474.0, 505.0, 467.0, 448.0, 444.0, 487.0, 471.0, 510.0, 529.0, 554.0, 635.0, 717.0, 933.0, 1449.0], [5907.0, 3101.0, 2281.0, 1691.0, 1400.0, 1220.0, 1106.0, 1017.0, 888.0, 707.0, 754.0, 736.0, 679.0, 646.0, 582.0, 587.0, 573.0, 577.0, 495.0, 484.0, 493.0, 509.0, 455.0, 465.0, 492.0, 437.0, 403.0, 470.0, 436.0, 478.0, 450.0, 459.0, 463.0, 433.0, 454.0, 441.0, 453.0, 493.0, 469.0, 474.0, 521.0, 503.0, 542.0, 530.0, 568.0, 654.0, 820.0, 931.0, 1395.0], [5826.0, 3071.0, 2189.0, 1765.0, 1484.0, 1181.0, 1123.0, 936.0, 847.0, 851.0, 755.0, 680.0, 665.0, 648.0, 577.0, 554.0, 554.0, 556.0, 529.0, 470.0, 519.0, 472.0, 475.0, 466.0, 456.0, 471.0, 457.0, 417.0, 462.0, 419.0, 457.0, 409.0, 457.0, 435.0, 470.0, 452.0, 528.0, 468.0, 418.0, 469.0, 499.0, 487.0, 498.0, 546.0, 617.0, 700.0, 819.0, 1013.0, 1520.0], [5799.0, 3127.0, 2136.0, 1746.0, 1446.0, 1213.0, 1053.0, 945.0, 933.0, 786.0, 804.0, 660.0, 728.0, 603.0, 577.0, 553.0, 531.0, 536.0, 526.0, 502.0, 517.0, 470.0, 463.0, 485.0, 485.0, 469.0, 426.0, 434.0, 463.0, 424.0, 413.0, 437.0, 427.0, 430.0, 443.0, 429.0, 464.0, 462.0, 520.0, 445.0, 506.0, 492.0, 584.0, 552.0, 609.0, 618.0, 733.0, 983.0, 1573.0], [6086.0, 3201.0, 2113.0, 1674.0, 1367.0, 1174.0, 1039.0, 937.0, 884.0, 775.0, 741.0, 674.0, 674.0, 603.0, 573.0, 575.0, 539.0, 566.0, 509.0, 495.0, 468.0, 482.0, 469.0, 486.0, 418.0, 459.0, 462.0, 462.0, 461.0, 424.0, 432.0, 405.0, 441.0, 427.0, 463.0, 446.0, 445.0, 462.0, 428.0, 442.0, 517.0, 532.0, 528.0, 541.0, 614.0, 662.0, 757.0, 960.0, 1583.0], [6326.0, 3032.0, 2235.0, 1650.0, 1397.0, 1184.0, 1014.0, 991.0, 878.0, 794.0, 725.0, 665.0, 664.0, 578.0, 565.0, 507.0, 565.0, 531.0, 486.0, 528.0, 497.0, 479.0, 435.0, 456.0, 415.0, 418.0, 411.0, 428.0, 420.0, 431.0, 408.0, 411.0, 431.0, 444.0, 435.0, 460.0, 427.0, 429.0, 447.0, 451.0, 477.0, 573.0, 521.0, 522.0, 601.0, 654.0, 798.0, 952.0, 1525.0], [6953.0, 3273.0, 2098.0, 1636.0, 1366.0, 1180.0, 993.0, 919.0, 833.0, 738.0, 738.0, 673.0, 626.0, 567.0, 577.0, 582.0, 494.0, 523.0, 509.0, 490.0, 493.0, 424.0, 478.0, 447.0, 436.0, 430.0, 440.0, 394.0, 402.0, 402.0, 352.0, 434.0, 389.0, 390.0, 399.0, 445.0, 440.0, 444.0, 436.0, 427.0, 469.0, 512.0, 543.0, 522.0, 608.0, 651.0, 777.0, 976.0, 1509.0], [7613.0, 3628.0, 2221.0, 1703.0, 1316.0, 1171.0, 974.0, 856.0, 817.0, 741.0, 716.0, 642.0, 581.0, 607.0, 535.0, 480.0, 518.0, 516.0, 465.0, 444.0, 428.0, 465.0, 455.0, 398.0, 452.0, 432.0, 428.0, 407.0, 420.0, 377.0, 427.0, 424.0, 414.0, 399.0, 408.0, 425.0, 448.0, 403.0, 428.0, 451.0, 436.0, 454.0, 463.0, 511.0, 515.0, 630.0, 720.0, 957.0, 1461.0], [8542.0, 3974.0, 2549.0, 1729.0, 1428.0, 1181.0, 988.0, 889.0, 806.0, 707.0, 669.0, 618.0, 606.0, 559.0, 526.0, 517.0, 456.0, 470.0, 458.0, 446.0, 424.0, 435.0, 423.0, 419.0, 408.0, 415.0, 406.0, 419.0, 378.0, 408.0, 388.0, 379.0, 392.0, 400.0, 386.0, 416.0, 428.0, 450.0, 410.0, 418.0, 444.0, 425.0, 445.0, 505.0, 561.0, 602.0, 676.0, 910.0, 1398.0], [9173.0, 4707.0, 3026.0, 2000.0, 1561.0, 1203.0, 1080.0, 911.0, 767.0, 711.0, 721.0, 639.0, 564.0, 582.0, 504.0, 520.0, 454.0, 420.0, 452.0, 470.0, 442.0, 442.0, 414.0, 392.0, 407.0, 366.0, 379.0, 358.0, 396.0, 385.0, 381.0, 368.0, 385.0, 377.0, 393.0, 357.0, 385.0, 404.0, 389.0, 395.0, 411.0, 439.0, 446.0, 509.0, 564.0, 567.0, 602.0, 847.0, 1374.0], [9910.0, 5262.0, 3496.0, 2411.0, 1805.0, 1421.0, 1165.0, 988.0, 850.0, 750.0, 673.0, 647.0, 564.0, 571.0, 534.0, 497.0, 490.0, 447.0, 391.0, 389.0, 402.0, 411.0, 374.0, 408.0, 408.0, 360.0, 356.0, 368.0, 400.0, 386.0, 359.0, 354.0, 385.0, 379.0, 370.0, 372.0, 358.0, 400.0, 391.0, 422.0, 383.0, 422.0, 422.0, 420.0, 472.0, 535.0, 641.0, 789.0, 1249.0], [9885.0, 5889.0, 4055.0, 2993.0, 2123.0, 1724.0, 1432.0, 1116.0, 950.0, 858.0, 717.0, 689.0, 615.0, 533.0, 510.0, 541.0, 441.0, 491.0, 439.0, 472.0, 415.0, 396.0, 364.0, 381.0, 381.0, 367.0, 385.0, 390.0, 357.0, 352.0, 324.0, 352.0, 350.0, 343.0, 370.0, 313.0, 346.0, 350.0, 374.0, 374.0, 407.0, 412.0, 370.0, 395.0, 476.0, 519.0, 559.0, 731.0, 1151.0], [9313.0, 5908.0, 4450.0, 3382.0, 2613.0, 2113.0, 1693.0, 1445.0, 1204.0, 1002.0, 891.0, 763.0, 720.0, 625.0, 572.0, 561.0, 467.0, 480.0, 464.0, 429.0, 408.0, 391.0, 400.0, 369.0, 351.0, 362.0, 370.0, 366.0, 377.0, 370.0, 329.0, 331.0, 339.0, 310.0, 358.0, 351.0, 363.0, 317.0, 355.0, 394.0, 362.0, 408.0, 376.0, 373.0, 437.0, 472.0, 545.0, 680.0, 1051.0], [8418.0, 5568.0, 4401.0, 3628.0, 2848.0, 2472.0, 2071.0, 1726.0, 1568.0, 1260.0, 1184.0, 987.0, 861.0, 756.0, 684.0, 666.0, 619.0, 556.0, 488.0, 466.0, 470.0, 429.0, 378.0, 382.0, 379.0, 376.0, 402.0, 351.0, 331.0, 334.0, 339.0, 310.0, 318.0, 343.0, 334.0, 334.0, 321.0, 327.0, 345.0, 380.0, 349.0, 384.0, 364.0, 385.0, 422.0, 392.0, 489.0, 659.0, 966.0], [7262.0, 4914.0, 4122.0, 3537.0, 3044.0, 2565.0, 2270.0, 2085.0, 1784.0, 1681.0, 1392.0, 1290.0, 1100.0, 1011.0, 906.0, 789.0, 733.0, 707.0, 585.0, 609.0, 505.0, 528.0, 467.0, 455.0, 410.0, 403.0, 352.0, 394.0, 346.0, 346.0, 376.0, 344.0, 316.0, 335.0, 305.0, 296.0, 308.0, 322.0, 320.0, 334.0, 318.0, 357.0, 363.0, 405.0, 393.0, 422.0, 456.0, 565.0, 933.0], [6423.0, 4350.0, 3539.0, 2976.0, 2751.0, 2520.0, 2335.0, 2114.0, 1952.0, 1775.0, 1611.0, 1556.0, 1355.0, 1242.0, 1166.0, 1069.0, 935.0, 945.0, 863.0, 712.0, 699.0, 574.0, 583.0, 511.0, 498.0, 489.0, 496.0, 405.0, 387.0, 413.0, 356.0, 359.0, 383.0, 358.0, 359.0, 333.0, 332.0, 317.0, 322.0, 328.0, 333.0, 335.0, 384.0, 333.0, 370.0, 355.0, 455.0, 499.0, 847.0], [5715.0, 3752.0, 3047.0, 2703.0, 2372.0, 2166.0, 2147.0, 1974.0, 1835.0, 1782.0, 1688.0, 1513.0, 1544.0, 1469.0, 1306.0, 1241.0, 1172.0, 1110.0, 1015.0, 967.0, 990.0, 836.0, 796.0, 718.0, 652.0, 604.0, 604.0, 551.0, 532.0, 475.0, 443.0, 425.0, 396.0, 388.0, 357.0, 348.0, 350.0, 341.0, 357.0, 352.0, 334.0, 350.0, 349.0, 380.0, 343.0, 383.0, 396.0, 472.0, 754.0], [5394.0, 3270.0, 2620.0, 2222.0, 2016.0, 1931.0, 1784.0, 1703.0, 1732.0, 1624.0, 1522.0, 1565.0, 1458.0, 1382.0, 1404.0, 1392.0, 1311.0, 1197.0, 1208.0, 1111.0, 1068.0, 1023.0, 957.0, 953.0, 899.0, 821.0, 774.0, 747.0, 691.0, 658.0, 646.0, 546.0, 527.0, 490.0, 470.0, 485.0, 411.0, 420.0, 395.0, 357.0, 339.0, 358.0, 355.0, 369.0, 367.0, 388.0, 397.0, 499.0, 655.0], [5165.0, 2936.0, 2197.0, 1880.0, 1736.0, 1540.0, 1567.0, 1490.0, 1429.0, 1345.0, 1420.0, 1394.0, 1346.0, 1241.0, 1291.0, 1228.0, 1276.0, 1266.0, 1235.0, 1170.0, 1207.0, 1146.0, 1161.0, 1046.0, 1041.0, 955.0, 995.0, 918.0, 879.0, 885.0, 845.0, 767.0, 742.0, 683.0, 644.0, 616.0, 651.0, 517.0, 508.0, 468.0, 445.0, 391.0, 411.0, 432.0, 413.0, 399.0, 395.0, 460.0, 620.0], [4902.0, 2818.0, 2144.0, 1689.0, 1488.0, 1423.0, 1281.0, 1212.0, 1137.0, 1161.0, 1095.0, 1115.0, 1069.0, 1097.0, 1114.0, 1095.0, 1113.0, 1145.0, 1079.0, 1103.0, 1101.0, 1139.0, 1140.0, 1105.0, 1117.0, 1098.0, 1069.0, 1014.0, 1059.0, 1033.0, 966.0, 963.0, 925.0, 916.0, 883.0, 834.0, 824.0, 741.0, 718.0, 664.0, 607.0, 599.0, 548.0, 510.0, 516.0, 480.0, 468.0, 465.0, 639.0], [4854.0, 2718.0, 1953.0, 1600.0, 1320.0, 1247.0, 1171.0, 1014.0, 989.0, 906.0, 886.0, 882.0, 917.0, 900.0, 898.0, 947.0, 970.0, 962.0, 998.0, 919.0, 962.0, 977.0, 1010.0, 1087.0, 976.0, 1062.0, 1086.0, 1070.0, 1046.0, 1039.0, 1092.0, 1085.0, 1100.0, 1004.0, 1067.0, 1035.0, 999.0, 984.0, 963.0, 860.0, 916.0, 858.0, 800.0, 751.0, 714.0, 665.0, 626.0, 600.0, 709.0], [4717.0, 2703.0, 1974.0, 1531.0, 1308.0, 1120.0, 1002.0, 956.0, 838.0, 802.0, 794.0, 732.0, 720.0, 742.0, 736.0, 722.0, 745.0, 764.0, 777.0, 803.0, 774.0, 847.0, 844.0, 947.0, 917.0, 887.0, 956.0, 993.0, 1028.0, 958.0, 1083.0, 1049.0, 1098.0, 1074.0, 1173.0, 1136.0, 1170.0, 1117.0, 1113.0, 1136.0, 1125.0, 1173.0, 1061.0, 1034.0, 951.0, 995.0, 878.0, 828.0, 882.0], [4774.0, 2765.0, 1908.0, 1514.0, 1276.0, 1094.0, 959.0, 880.0, 821.0, 717.0, 680.0, 645.0, 642.0, 604.0, 583.0, 606.0, 572.0, 593.0, 645.0, 622.0, 625.0, 634.0, 667.0, 744.0, 752.0, 729.0, 804.0, 811.0, 820.0, 924.0, 914.0, 959.0, 994.0, 1083.0, 1100.0, 1107.0, 1149.0, 1188.0, 1227.0, 1312.0, 1321.0, 1360.0, 1334.0, 1350.0, 1338.0, 1334.0, 1232.0, 1257.0, 1293.0], [4872.0, 2615.0, 1910.0, 1552.0, 1189.0, 1088.0, 927.0, 878.0, 756.0, 746.0, 652.0, 578.0, 625.0, 535.0, 566.0, 525.0, 490.0, 537.0, 531.0, 507.0, 536.0, 511.0, 546.0, 597.0, 566.0, 635.0, 600.0, 664.0, 662.0, 710.0, 733.0, 732.0, 823.0, 906.0, 928.0, 979.0, 1109.0, 1116.0, 1143.0, 1252.0, 1354.0, 1508.0, 1514.0, 1537.0, 1634.0, 1719.0, 1735.0, 1793.0, 1902.0], [4727.0, 2604.0, 1864.0, 1497.0, 1225.0, 977.0, 1032.0, 798.0, 756.0, 686.0, 592.0, 587.0, 556.0, 530.0, 516.0, 471.0, 448.0, 473.0, 519.0, 474.0, 425.0, 452.0, 453.0, 458.0, 439.0, 456.0, 514.0, 480.0, 508.0, 573.0, 580.0, 608.0, 672.0, 692.0, 748.0, 827.0, 936.0, 946.0, 1019.0, 1111.0, 1191.0, 1368.0, 1463.0, 1605.0, 1772.0, 1926.0, 2150.0, 2451.0, 2704.0], [4817.0, 2677.0, 1940.0, 1523.0, 1298.0, 1086.0, 964.0, 752.0, 755.0, 643.0, 654.0, 578.0, 560.0, 514.0, 431.0, 442.0, 427.0, 394.0, 458.0, 432.0, 396.0, 411.0, 403.0, 421.0, 394.0, 394.0, 418.0, 423.0, 434.0, 438.0, 441.0, 510.0, 481.0, 529.0, 584.0, 633.0, 684.0, 753.0, 803.0, 898.0, 1092.0, 1084.0, 1294.0, 1484.0, 1696.0, 1907.0, 2339.0, 2781.0, 3487.0], [4782.0, 2546.0, 1917.0, 1482.0, 1238.0, 1075.0, 945.0, 879.0, 721.0, 642.0, 595.0, 571.0, 550.0, 476.0, 482.0, 496.0, 443.0, 456.0, 453.0, 423.0, 420.0, 396.0, 395.0, 401.0, 358.0, 391.0, 360.0, 397.0, 370.0, 401.0, 397.0, 355.0, 380.0, 440.0, 463.0, 485.0, 531.0, 524.0, 618.0, 726.0, 798.0, 909.0, 1066.0, 1297.0, 1476.0, 1794.0, 2328.0, 2905.0, 4074.0], [4651.0, 2598.0, 1911.0, 1490.0, 1209.0, 1092.0, 897.0, 823.0, 757.0, 672.0, 600.0, 564.0, 540.0, 504.0, 484.0, 468.0, 468.0, 422.0, 421.0, 386.0, 377.0, 361.0, 360.0, 352.0, 354.0, 373.0, 379.0, 384.0, 334.0, 334.0, 341.0, 374.0, 334.0, 325.0, 408.0, 394.0, 409.0, 475.0, 435.0, 495.0, 643.0, 660.0, 818.0, 976.0, 1208.0, 1567.0, 2004.0, 2726.0, 4355.0], [4769.0, 2635.0, 1935.0, 1497.0, 1231.0, 1046.0, 914.0, 799.0, 698.0, 631.0, 615.0, 561.0, 496.0, 470.0, 446.0, 392.0, 415.0, 440.0, 412.0, 373.0, 374.0, 357.0, 319.0, 357.0, 313.0, 330.0, 337.0, 343.0, 349.0, 294.0, 337.0, 307.0, 326.0, 319.0, 321.0, 315.0, 358.0, 351.0, 404.0, 412.0, 434.0, 525.0, 675.0, 732.0, 911.0, 1193.0, 1691.0, 2484.0, 4250.0], [4669.0, 2493.0, 1828.0, 1425.0, 1260.0, 1097.0, 980.0, 905.0, 765.0, 701.0, 596.0, 605.0, 570.0, 526.0, 405.0, 412.0, 410.0, 412.0, 377.0, 373.0, 377.0, 349.0, 327.0, 342.0, 369.0, 335.0, 317.0, 333.0, 346.0, 344.0, 352.0, 300.0, 300.0, 312.0, 314.0, 323.0, 334.0, 303.0, 317.0, 326.0, 340.0, 404.0, 438.0, 509.0, 601.0, 843.0, 1260.0, 1973.0, 3831.0], [4705.0, 2530.0, 1952.0, 1470.0, 1278.0, 1014.0, 952.0, 831.0, 739.0, 670.0, 619.0, 527.0, 484.0, 502.0, 469.0, 454.0, 478.0, 385.0, 405.0, 379.0, 327.0, 358.0, 332.0, 316.0, 316.0, 332.0, 310.0, 341.0, 321.0, 299.0, 313.0, 322.0, 324.0, 282.0, 267.0, 307.0, 276.0, 304.0, 319.0, 279.0, 318.0, 351.0, 355.0, 423.0, 476.0, 672.0, 956.0, 1509.0, 3263.0], [4617.0, 2477.0, 1870.0, 1460.0, 1265.0, 1045.0, 959.0, 867.0, 754.0, 680.0, 607.0, 562.0, 516.0, 501.0, 490.0, 432.0, 436.0, 413.0, 413.0, 386.0, 343.0, 332.0, 331.0, 322.0, 334.0, 295.0, 303.0, 332.0, 309.0, 290.0, 337.0, 318.0, 313.0, 302.0, 279.0, 304.0, 287.0, 272.0, 308.0, 293.0, 303.0, 310.0, 327.0, 311.0, 350.0, 447.0, 694.0, 1064.0, 2419.0], [4693.0, 2564.0, 1799.0, 1532.0, 1234.0, 1008.0, 969.0, 836.0, 778.0, 695.0, 625.0, 531.0, 499.0, 477.0, 450.0, 445.0, 390.0, 416.0, 344.0, 377.0, 364.0, 345.0, 284.0, 348.0, 306.0, 347.0, 297.0, 317.0, 312.0, 298.0, 323.0, 318.0, 264.0, 300.0, 319.0, 306.0, 282.0, 269.0, 275.0, 322.0, 280.0, 297.0, 263.0, 297.0, 330.0, 380.0, 524.0, 769.0, 1786.0], [4655.0, 2557.0, 1806.0, 1483.0, 1265.0, 1077.0, 940.0, 825.0, 756.0, 652.0, 601.0, 614.0, 522.0, 541.0, 501.0, 426.0, 421.0, 366.0, 358.0, 362.0, 345.0, 343.0, 350.0, 333.0, 317.0, 303.0, 300.0, 287.0, 318.0, 294.0, 303.0, 279.0, 320.0, 288.0, 320.0, 323.0, 335.0, 286.0, 298.0, 308.0, 240.0, 295.0, 342.0, 297.0, 295.0, 328.0, 446.0, 508.0, 1346.0], [4674.0, 2527.0, 1879.0, 1418.0, 1264.0, 1028.0, 952.0, 827.0, 744.0, 672.0, 629.0, 566.0, 508.0, 455.0, 431.0, 431.0, 455.0, 405.0, 395.0, 386.0, 313.0, 342.0, 408.0, 307.0, 324.0, 333.0, 349.0, 329.0, 324.0, 377.0, 285.0, 236.0, 294.0, 328.0, 282.0, 283.0, 272.0, 274.0, 237.0, 286.0, 268.0, 282.0, 288.0, 303.0, 276.0, 309.0, 371.0, 457.0, 959.0], [4654.0, 2575.0, 1815.0, 1422.0, 1304.0, 1036.0, 962.0, 862.0, 722.0, 663.0, 599.0, 577.0, 551.0, 516.0, 506.0, 422.0, 432.0, 392.0, 394.0, 339.0, 370.0, 328.0, 374.0, 332.0, 326.0, 354.0, 364.0, 312.0, 265.0, 333.0, 328.0, 277.0, 339.0, 285.0, 292.0, 286.0, 270.0, 270.0, 256.0, 268.0, 246.0, 271.0, 311.0, 284.0, 244.0, 282.0, 338.0, 405.0, 708.0], [4637.0, 2549.0, 1791.0, 1410.0, 1250.0, 1082.0, 968.0, 924.0, 782.0, 729.0, 643.0, 588.0, 534.0, 524.0, 489.0, 399.0, 406.0, 412.0, 399.0, 324.0, 348.0, 348.0, 355.0, 354.0, 291.0, 302.0, 326.0, 295.0, 348.0, 302.0, 307.0, 281.0, 320.0, 310.0, 274.0, 247.0, 259.0, 286.0, 266.0, 277.0, 284.0, 272.0, 273.0, 302.0, 252.0, 290.0, 267.0, 349.0, 539.0], [4581.0, 2568.0, 1820.0, 1446.0, 1285.0, 1096.0, 896.0, 876.0, 741.0, 735.0, 633.0, 536.0, 493.0, 504.0, 465.0, 451.0, 402.0, 413.0, 480.0, 391.0, 329.0, 332.0, 321.0, 351.0, 303.0, 292.0, 368.0, 315.0, 287.0, 281.0, 270.0, 295.0, 284.0, 304.0, 317.0, 306.0, 320.0, 280.0, 290.0, 293.0, 277.0, 286.0, 269.0, 254.0, 302.0, 263.0, 280.0, 306.0, 429.0], [4594.0, 2616.0, 1814.0, 1372.0, 1244.0, 1053.0, 918.0, 855.0, 765.0, 743.0, 629.0, 562.0, 574.0, 481.0, 487.0, 415.0, 445.0, 384.0, 394.0, 380.0, 386.0, 314.0, 323.0, 344.0, 339.0, 300.0, 315.0, 300.0, 335.0, 308.0, 281.0, 321.0, 309.0, 257.0, 312.0, 282.0, 279.0, 272.0, 261.0, 265.0, 257.0, 273.0, 263.0, 270.0, 280.0, 272.0, 290.0, 286.0, 448.0], [4597.0, 2455.0, 1814.0, 1409.0, 1216.0, 1062.0, 886.0, 847.0, 789.0, 726.0, 625.0, 639.0, 551.0, 489.0, 456.0, 422.0, 439.0, 402.0, 376.0, 358.0, 366.0, 313.0, 350.0, 333.0, 301.0, 333.0, 282.0, 271.0, 273.0, 314.0, 295.0, 274.0, 267.0, 272.0, 308.0, 259.0, 302.0, 304.0, 285.0, 279.0, 283.0, 330.0, 265.0, 308.0, 274.0, 233.0, 291.0, 315.0, 368.0], [4610.0, 2472.0, 1761.0, 1489.0, 1214.0, 1068.0, 945.0, 850.0, 772.0, 722.0, 650.0, 588.0, 511.0, 482.0, 450.0, 428.0, 396.0, 421.0, 361.0, 389.0, 369.0, 316.0, 303.0, 285.0, 323.0, 303.0, 346.0, 328.0, 301.0, 288.0, 291.0, 320.0, 250.0, 281.0, 263.0, 292.0, 274.0, 284.0, 274.0, 323.0, 292.0, 260.0, 236.0, 228.0, 271.0, 266.0, 271.0, 272.0, 380.0], [4615.0, 2522.0, 1820.0, 1376.0, 1215.0, 1033.0, 940.0, 909.0, 769.0, 690.0, 645.0, 592.0, 539.0, 486.0, 438.0, 481.0, 422.0, 380.0, 343.0, 381.0, 351.0, 329.0, 340.0, 320.0, 301.0, 327.0, 310.0, 293.0, 304.0, 294.0, 299.0, 291.0, 310.0, 286.0, 311.0, 314.0, 259.0, 302.0, 274.0, 244.0, 287.0, 257.0, 277.0, 247.0, 274.0, 286.0, 282.0, 310.0, 358.0], [4569.0, 2481.0, 1821.0, 1381.0, 1212.0, 1057.0, 881.0, 843.0, 784.0, 679.0, 642.0, 554.0, 565.0, 526.0, 469.0, 436.0, 402.0, 408.0, 377.0, 334.0, 376.0, 358.0, 339.0, 349.0, 317.0, 293.0, 320.0, 324.0, 295.0, 290.0, 284.0, 289.0, 278.0, 282.0, 286.0, 320.0, 246.0, 306.0, 222.0, 280.0, 292.0, 291.0, 265.0, 265.0, 261.0, 279.0, 277.0, 262.0, 332.0], [4674.0, 2467.0, 1768.0, 1410.0, 1212.0, 1088.0, 916.0, 853.0, 767.0, 704.0, 657.0, 598.0, 580.0, 538.0, 456.0, 428.0, 427.0, 410.0, 384.0, 362.0, 364.0, 315.0, 398.0, 341.0, 295.0, 304.0, 282.0, 306.0, 252.0, 257.0, 291.0, 302.0, 309.0, 301.0, 270.0, 265.0, 253.0, 290.0, 267.0, 306.0, 316.0, 250.0, 271.0, 272.0, 244.0, 239.0, 284.0, 304.0, 375.0]],
    "Name": "sCurve-0",
    "Overflow": 2670163.0,
    "Type": "Histo2d",
    "Underflow": 0.0,
    "x": {
        "AxisTitle": "Vcal",
        "Bins": 51,
        "High": 302.5,
        "Low": 47.5
    },
    "y": {
        "AxisTitle": "Occupancy",
        "Bins": 49,
        "High": 49.5,
        "Low": 0.5
    },
    "z": {
        "AxisTitle": "Number of pixels"
    }
}