time,Hardware,Voltage,Current
1621983432150,high-voltage,1,0.061929
time,Hardware,Voltage,Current
1621983432150,high-voltage,2,0.13086
time,Hardware,Voltage,Current
1621983432150,high-voltage,3,0.248803
time,Hardware,Voltage,Current
1621983432150,high-voltage,4,0.386734
time,Hardware,Voltage,Current
1621983432150,high-voltage,5,0.633467
time,Hardware,Voltage,Current
1621983432150,high-voltage,6,0.852652
time,Hardware,Voltage,Current
1621983432150,high-voltage,7,1.16701
time,Hardware,Voltage,Current
1621983432150,high-voltage,8,1.63215
time,Hardware,Voltage,Current
1621983432150,high-voltage,9,2.07534
time,Hardware,Voltage,Current
1621983432150,high-voltage,10,2.59525
time,Hardware,Voltage,Current
1621983432150,high-voltage,11,3.36289
time,Hardware,Voltage,Current
1621983432150,high-voltage,12,4.08518
time,Hardware,Voltage,Current
1621983432150,high-voltage,13,5.23249
time,Hardware,Voltage,Current
1621983432150,high-voltage,14,6.42803
time,Hardware,Voltage,Current
1621983432150,high-voltage,15,7.6391
time,Hardware,Voltage,Current
1621983432150,high-voltage,16,8.97586
time,Hardware,Voltage,Current
1621983432150,high-voltage,17,10.0001
