time,Hardware,Voltage,Current
1621549314558,high-voltage-3,1,0.0650084
time,Hardware,Voltage,Current
1621549314558,high-voltage-3,2,0.069874
time,Hardware,Voltage,Current
1621549314558,high-voltage-3,3,0.0739273
time,Hardware,Voltage,Current
1621549314558,high-voltage-3,4,0.0774097
time,Hardware,Voltage,Current
1621549314558,high-voltage-3,5,0.0782806
time,Hardware,Voltage,Current
1621549314558,high-voltage-3,6,0.0812992
time,Hardware,Voltage,Current
1621549314558,high-voltage-3,7,0.084067
time,Hardware,Voltage,Current
1621549314558,high-voltage-3,8,0.0867962
time,Hardware,Voltage,Current
1621549314558,high-voltage-3,9,0.0886731
time,Hardware,Voltage,Current
1621549314558,high-voltage-3,10,0.0896118
time,Hardware,Voltage,Current
1621549314558,high-voltage-3,11,0.0913806
time,Hardware,Voltage,Current
1621549314558,high-voltage-3,12,0.09467
time,Hardware,Voltage,Current
1621549314558,high-voltage-3,13,0.0985027
time,Hardware,Voltage,Current
1621549314558,high-voltage-3,14,0.0999806
time,Hardware,Voltage,Current
1621549314558,high-voltage-3,15,0.103741
time,Hardware,Voltage,Current
1621549314558,high-voltage-3,16,0.105888
time,Hardware,Voltage,Current
1621549314558,high-voltage-3,17,0.106029
time,Hardware,Voltage,Current
1621549314558,high-voltage-3,18,0.109409
time,Hardware,Voltage,Current
1621549314558,high-voltage-3,19,0.112151
time,Hardware,Voltage,Current
1621549314558,high-voltage-3,20,0.113442
time,Hardware,Voltage,Current
1621549314558,high-voltage-3,25,0.121145
time,Hardware,Voltage,Current
1621549314558,high-voltage-3,30,0.130799
