{
    "Data": [0.0, 0.0, 0.0, 0.0, 0.0, 0.0, 0.0, 0.0, 0.0, 0.0, 0.0, 0.0, 0.0, 0.0, 0.0, 0.0, 0.0, 0.0, 0.0, 0.0, 0.0, 0.0, 0.0, 0.0, 0.0, 0.0, 0.0, 0.0, 0.0, 0.0, 0.0, 0.0, 0.0, 0.0, 0.0, 0.0, 0.0, 0.0, 0.0, 0.0, 0.0, 0.0, 0.0, 0.0, 0.0, 0.0, 0.0, 0.0, 0.0, 0.0, 11.0, 10.0, 8.0, 10.0, 13.0, 10.0, 8.0, 10.0, 10.0, 12.0, 16.0, 31.0, 20.0, 36.0, 50.0, 51.0, 75.0, 71.0, 119.0, 137.0, 170.0, 202.0, 235.0, 304.0, 379.0, 405.0, 512.0, 595.0, 711.0, 782.0, 855.0, 1027.0, 980.0, 1138.0, 1135.0, 1207.0, 1274.0, 1305.0, 1460.0, 1597.0, 1904.0, 2330.0, 2907.0, 3494.0, 3959.0, 4205.0, 4006.0, 3241.0, 2522.0, 1927.0, 1301.0, 809.0, 535.0, 372.0, 256.0, 189.0, 123.0, 112.0, 80.0, 76.0, 51.0, 58.0, 48.0, 44.0, 32.0, 31.0, 25.0, 33.0, 16.0, 29.0, 37.0, 32.0, 11.0, 14.0, 16.0, 14.0, 12.0, 13.0, 14.0, 15.0, 6.0, 11.0, 6.0, 11.0, 17.0, 8.0, 15.0, 9.0, 6.0, 11.0, 6.0, 9.0, 11.0, 6.0, 6.0, 3.0, 7.0, 11.0, 7.0, 8.0, 13.0, 14.0, 17.0, 19.0, 29.0, 27.0, 52.0, 52.0, 58.0, 70.0, 103.0, 98.0, 146.0, 157.0, 165.0, 205.0, 241.0, 294.0, 342.0, 361.0, 424.0, 504.0, 475.0, 569.0, 610.0, 662.0, 709.0, 740.0, 774.0, 792.0, 834.0, 792.0, 831.0, 821.0, 782.0, 785.0, 808.0, 746.0, 656.0, 676.0, 581.0, 576.0, 564.0, 511.0, 452.0, 376.0, 394.0, 321.0, 249.0, 241.0, 226.0, 173.0, 176.0, 163.0, 103.0, 102.0, 91.0, 72.0, 65.0, 63.0, 54.0, 53.0, 42.0, 31.0, 13.0, 27.0, 18.0, 20.0, 13.0, 19.0, 16.0, 7.0, 10.0, 4.0, 7.0, 10.0, 1.0, 5.0, 8.0, 5.0, 4.0, 7.0, 5.0, 5.0, 2.0, 5.0, 4.0, 5.0, 3.0, 7.0, 9.0, 4.0, 3.0, 12.0, 2.0, 4.0, 6.0, 4.0, 4.0, 3.0, 1.0, 3.0, 2.0, 4.0, 1.0, 0.0, 1.0, 0.0, 0.0, 0.0, 0.0, 0.0, 0.0, 1.0, 0.0, 0.0, 2.0, 1.0, 0.0, 0.0, 0.0, 0.0, 0.0, 0.0, 1.0, 1.0, 1.0, 0.0, 1.0, 2.0, 1.0, 0.0, 0.0, 0.0, 2.0, 0.0, 0.0, 0.0, 0.0, 0.0, 0.0, 0.0, 1.0, 0.0, 0.0, 1.0, 0.0, 0.0, 0.0, 0.0, 1.0, 0.0, 0.0, 0.0, 0.0, 0.0, 0.0, 0.0, 0.0, 0.0, 0.0, 0.0, 0.0, 0.0, 0.0, 0.0, 0.0, 0.0, 0.0, 0.0, 0.0, 0.0, 0.0, 0.0, 0.0, 0.0, 0.0, 0.0, 0.0, 0.0, 0.0, 0.0, 0.0, 0.0, 0.0],
    "Name": "ThresholdDist-0",
    "Overflow": 0.0,
    "Type": "Histo1d",
    "Underflow": 0.0,
    "x": {
        "AxisTitle": "Threshold [e]",
        "Bins": 335,
        "High": 3345.0,
        "Low": -5.0
    },
    "y": {
        "AxisTitle": "Number of Pixels"
    },
    "z": {
        "AxisTitle": "z"
    }
}