{
    "Data": [0.0, 0.0, 0.0, 0.0, 0.0, 0.0, 0.0, 0.0, 0.0, 0.0, 0.0, 0.0, 0.0, 0.0, 4.0, 1.0, 1.0, 24.0, 124.0, 36.0, 67.0, 822.0, 2000.0, 649.0, 441.0, 1449.0, 2578.0, 1281.0, 700.0, 1097.0, 1569.0, 1103.0, 547.0, 553.0, 701.0, 626.0, 414.0, 543.0, 879.0, 848.0, 610.0, 909.0, 1888.0, 3172.0, 2110.0, 1488.0, 2324.0, 3453.0, 4074.0, 2879.0, 2249.0, 2489.0, 3002.0, 2586.0, 2059.0, 1691.0, 1664.0, 1875.0, 1571.0, 1259.0, 1265.0, 1126.0, 1027.0, 755.0, 637.0, 623.0, 633.0, 537.0, 429.0, 384.0, 373.0, 366.0, 315.0, 276.0, 257.0, 241.0, 230.0, 208.0, 165.0, 156.0, 146.0, 135.0, 129.0, 93.0, 123.0, 105.0, 92.0, 82.0, 77.0, 67.0, 78.0, 56.0, 46.0, 38.0, 56.0, 50.0, 26.0, 38.0, 36.0, 37.0, 25.0, 23.0, 37.0, 29.0, 25.0, 27.0, 18.0, 22.0, 18.0, 19.0, 16.0, 13.0, 16.0, 13.0, 12.0, 10.0, 9.0, 9.0, 14.0, 16.0, 19.0, 18.0, 19.0, 7.0, 12.0, 13.0, 10.0, 15.0, 8.0, 8.0, 9.0, 12.0, 5.0, 4.0, 5.0, 12.0, 4.0, 3.0, 6.0, 3.0, 1.0, 4.0, 5.0, 7.0, 3.0, 3.0, 0.0, 1.0, 2.0, 4.0, 3.0, 3.0, 1.0, 1.0, 3.0, 0.0, 1.0, 3.0, 4.0, 2.0, 2.0, 1.0, 2.0, 0.0, 2.0, 0.0, 1.0, 0.0, 4.0, 4.0, 4.0, 1.0, 2.0, 4.0, 1.0, 1.0, 2.0, 3.0, 4.0, 2.0, 1.0, 2.0, 2.0, 2.0, 2.0, 1.0, 0.0, 2.0, 0.0, 1.0, 0.0, 0.0, 0.0, 0.0, 0.0, 1.0, 1.0, 1.0, 2.0, 2.0, 0.0],
    "Name": "TimePerFitDist-0",
    "Overflow": 129.0,
    "Type": "Histo1d",
    "Underflow": 0.0,
    "x": {
        "AxisTitle": "Fit Time [us]",
        "Bins": 201,
        "High": 401.0,
        "Low": -1.0
    },
    "y": {
        "AxisTitle": "Number of Pixels"
    },
    "z": {
        "AxisTitle": "z"
    }
}