time,Hardware,Voltage,Current
1626313536710,high-voltage,1,0.0523351
time,Hardware,Voltage,Current
1626313536710,high-voltage,2,0.0743641
time,Hardware,Voltage,Current
1626313536710,high-voltage,3,0.0867829
time,Hardware,Voltage,Current
1626313536710,high-voltage,4,0.0953912
time,Hardware,Voltage,Current
1626313536710,high-voltage,5,0.104502
time,Hardware,Voltage,Current
1626313536710,high-voltage,6,0.113989
time,Hardware,Voltage,Current
1626313536710,high-voltage,7,0.124084
time,Hardware,Voltage,Current
1626313536710,high-voltage,8,0.134948
time,Hardware,Voltage,Current
1626313536710,high-voltage,9,0.147999
time,Hardware,Voltage,Current
1626313536710,high-voltage,10,0.161625
time,Hardware,Voltage,Current
1626313536710,high-voltage,11,0.174534
time,Hardware,Voltage,Current
1626313536710,high-voltage,12,0.187503
time,Hardware,Voltage,Current
1626313536710,high-voltage,13,0.200453
time,Hardware,Voltage,Current
1626313536710,high-voltage,14,0.211958
time,Hardware,Voltage,Current
1626313536710,high-voltage,15,0.220515
time,Hardware,Voltage,Current
1626313536710,high-voltage,16,0.229361
time,Hardware,Voltage,Current
1626313536710,high-voltage,17,0.237478
time,Hardware,Voltage,Current
1626313536710,high-voltage,18,0.243647
time,Hardware,Voltage,Current
1626313536710,high-voltage,19,0.251467
time,Hardware,Voltage,Current
1626313536710,high-voltage,20,0.258288
time,Hardware,Voltage,Current
1626313536710,high-voltage,25,0.288805
time,Hardware,Voltage,Current
1626313536710,high-voltage,30,0.323098
time,Hardware,Voltage,Current
1626313536710,high-voltage,35,0.382904
time,Hardware,Voltage,Current
1626313536710,high-voltage,40,0.528006
time,Hardware,Voltage,Current
1626313536710,high-voltage,45,0.807201
time,Hardware,Voltage,Current
1626313536710,high-voltage,50,1.26126
time,Hardware,Voltage,Current
1626313536710,high-voltage,55,1.98856
time,Hardware,Voltage,Current
1626313536710,high-voltage,60,3.0981
time,Hardware,Voltage,Current
1626313536710,high-voltage,65,4.62415
time,Hardware,Voltage,Current
1626313536710,high-voltage,70,6.72413
time,Hardware,Voltage,Current
1626313536710,high-voltage,75,9.54656
time,Hardware,Voltage,Current
1626313536710,high-voltage,80,10
