{
    "Data": [0.0, 0.0, 0.0, 0.0, 0.0, 0.0, 0.0, 0.0, 0.0, 0.0, 0.0, 0.0, 0.0, 0.0, 0.0, 0.0, 0.0, 0.0, 0.0, 0.0, 0.0, 0.0, 0.0, 0.0, 0.0, 0.0, 0.0, 0.0, 0.0, 0.0, 0.0, 0.0, 0.0, 0.0, 0.0, 0.0, 0.0, 0.0, 0.0, 0.0, 0.0, 0.0, 0.0, 0.0, 0.0, 0.0, 0.0, 0.0, 0.0, 0.0, 1.0, 4.0, 5.0, 1.0, 9.0, 9.0, 4.0, 8.0, 8.0, 9.0, 8.0, 7.0, 16.0, 7.0, 5.0, 8.0, 8.0, 4.0, 11.0, 3.0, 7.0, 14.0, 11.0, 17.0, 28.0, 31.0, 26.0, 31.0, 46.0, 81.0, 106.0, 99.0, 176.0, 177.0, 201.0, 241.0, 317.0, 361.0, 548.0, 740.0, 1199.0, 1865.0, 2852.0, 3823.0, 4939.0, 5311.0, 5221.0, 4939.0, 4088.0, 3205.0, 2363.0, 1681.0, 1199.0, 869.0, 661.0, 494.0, 432.0, 353.0, 262.0, 224.0, 171.0, 116.0, 95.0, 89.0, 81.0, 62.0, 34.0, 34.0, 39.0, 28.0, 22.0, 29.0, 23.0, 27.0, 22.0, 20.0, 20.0, 15.0, 18.0, 16.0, 18.0, 17.0, 11.0, 16.0, 16.0, 17.0, 12.0, 10.0, 8.0, 14.0, 10.0, 10.0, 8.0, 6.0, 6.0, 10.0, 3.0, 5.0, 5.0, 12.0, 5.0, 5.0, 7.0, 6.0, 4.0, 5.0, 5.0, 3.0, 5.0, 3.0, 11.0, 5.0, 10.0, 9.0, 17.0, 20.0, 23.0, 32.0, 28.0, 53.0, 63.0, 75.0, 97.0, 96.0, 139.0, 162.0, 177.0, 207.0, 236.0, 293.0, 324.0, 349.0, 363.0, 422.0, 502.0, 509.0, 548.0, 599.0, 661.0, 662.0, 702.0, 711.0, 742.0, 723.0, 751.0, 758.0, 761.0, 716.0, 684.0, 719.0, 703.0, 676.0, 705.0, 656.0, 593.0, 589.0, 549.0, 506.0, 450.0, 406.0, 382.0, 344.0, 332.0, 285.0, 233.0, 238.0, 230.0, 200.0, 185.0, 159.0, 162.0, 111.0, 106.0, 97.0, 79.0, 75.0, 57.0, 53.0, 42.0, 36.0, 38.0, 26.0, 22.0, 15.0, 19.0, 13.0, 10.0, 13.0, 8.0, 6.0, 4.0, 1.0, 5.0, 1.0, 1.0, 1.0, 1.0, 1.0, 0.0, 0.0, 0.0, 1.0, 1.0, 1.0, 1.0, 1.0, 0.0, 0.0, 1.0, 3.0, 0.0, 0.0, 0.0, 0.0, 0.0, 0.0, 1.0, 0.0, 0.0, 0.0, 0.0, 0.0, 1.0, 0.0, 1.0, 0.0, 0.0, 0.0, 0.0, 0.0, 1.0, 0.0, 1.0, 0.0, 0.0, 0.0, 1.0, 0.0, 0.0, 0.0, 0.0, 0.0, 1.0, 0.0, 0.0, 0.0, 0.0, 0.0, 0.0, 0.0, 0.0, 0.0, 1.0, 0.0, 1.0, 0.0, 0.0, 0.0, 0.0, 0.0, 0.0, 0.0, 0.0, 0.0, 0.0, 0.0, 0.0, 0.0, 0.0, 0.0, 0.0, 0.0, 0.0, 0.0, 0.0, 0.0, 0.0, 0.0, 0.0, 0.0, 0.0, 0.0, 0.0, 0.0, 0.0, 0.0, 0.0, 0.0, 0.0, 0.0, 0.0, 0.0, 0.0, 0.0, 0.0, 0.0, 0.0, 0.0, 0.0, 0.0, 0.0, 0.0, 0.0, 0.0, 0.0, 0.0, 0.0, 0.0, 0.0, 0.0, 0.0, 0.0, 0.0, 0.0],
    "Name": "ThresholdDist-0",
    "Overflow": 0.0,
    "Type": "Histo1d",
    "Underflow": 0.0,
    "x": {
        "AxisTitle": "Threshold [e]",
        "Bins": 364,
        "High": 3635.0,
        "Low": -5.0
    },
    "y": {
        "AxisTitle": "Number of Pixels"
    },
    "z": {
        "AxisTitle": "z"
    }
}