time,Hardware,Voltage,Current
1623286652351,high-voltage,1,0.0254953
time,Hardware,Voltage,Current
1623286652351,high-voltage,2,0.0322314
time,Hardware,Voltage,Current
1623286652351,high-voltage,3,0.0373825
time,Hardware,Voltage,Current
1623286652351,high-voltage,4,0.0428445
time,Hardware,Voltage,Current
1623286652351,high-voltage,5,0.0460841
time,Hardware,Voltage,Current
1623286652351,high-voltage,6,0.0502531
time,Hardware,Voltage,Current
1623286652351,high-voltage,7,0.0549047
time,Hardware,Voltage,Current
1623286652351,high-voltage,8,0.0588654
time,Hardware,Voltage,Current
1623286652351,high-voltage,9,0.0649636
time,Hardware,Voltage,Current
1623286652351,high-voltage,10,0.0699267
time,Hardware,Voltage,Current
1623286652351,high-voltage,11,0.0743425
time,Hardware,Voltage,Current
1623286652351,high-voltage,12,0.0799046
time,Hardware,Voltage,Current
1623286652351,high-voltage,13,0.0842881
time,Hardware,Voltage,Current
1623286652351,high-voltage,14,0.0878518
time,Hardware,Voltage,Current
1623286652351,high-voltage,15,0.0925176
time,Hardware,Voltage,Current
1623286652351,high-voltage,16,0.0955443
time,Hardware,Voltage,Current
1623286652351,high-voltage,17,0.0973228
time,Hardware,Voltage,Current
1623286652351,high-voltage,18,0.100237
time,Hardware,Voltage,Current
1623286652351,high-voltage,19,0.103535
time,Hardware,Voltage,Current
1623286652351,high-voltage,20,0.105229
time,Hardware,Voltage,Current
1623286652351,high-voltage,25,0.118035
time,Hardware,Voltage,Current
1623286652351,high-voltage,30,0.135458
time,Hardware,Voltage,Current
1623286652351,high-voltage,35,0.188872
time,Hardware,Voltage,Current
1623286652351,high-voltage,40,0.392287
time,Hardware,Voltage,Current
1623286652351,high-voltage,45,0.827807
time,Hardware,Voltage,Current
1623286652351,high-voltage,50,1.46759
time,Hardware,Voltage,Current
1623286652351,high-voltage,55,2.28744
time,Hardware,Voltage,Current
1623286652351,high-voltage,60,3.26398
time,Hardware,Voltage,Current
1623286652351,high-voltage,65,4.39468
time,Hardware,Voltage,Current
1623286652351,high-voltage,70,5.69799
time,Hardware,Voltage,Current
1623286652351,high-voltage,75,7.19728
time,Hardware,Voltage,Current
1623286652351,high-voltage,80,8.88789
time,Hardware,Voltage,Current
1623286652351,high-voltage,85,10
