{
    "Data": [0.0, 0.0, 0.0, 0.0, 0.0, 0.0, 0.0, 0.0, 0.0, 0.0, 0.0, 0.0, 0.0, 0.0, 0.0, 0.0, 0.0, 0.0, 0.0, 0.0, 0.0, 0.0, 0.0, 0.0, 0.0, 0.0, 0.0, 0.0, 0.0, 0.0, 0.0, 0.0, 0.0, 0.0, 0.0, 0.0, 0.0, 0.0, 0.0, 0.0, 0.0, 0.0, 0.0, 0.0, 0.0, 0.0, 0.0, 0.0, 0.0, 0.0, 3.0, 11.0, 5.0, 7.0, 5.0, 10.0, 6.0, 8.0, 7.0, 4.0, 11.0, 7.0, 12.0, 11.0, 14.0, 23.0, 21.0, 18.0, 37.0, 35.0, 48.0, 45.0, 49.0, 72.0, 85.0, 88.0, 104.0, 128.0, 155.0, 194.0, 206.0, 268.0, 347.0, 394.0, 438.0, 533.0, 634.0, 739.0, 1095.0, 1512.0, 2130.0, 2894.0, 3539.0, 4089.0, 4202.0, 4138.0, 3720.0, 3298.0, 2594.0, 2114.0, 1704.0, 1355.0, 1161.0, 1021.0, 880.0, 720.0, 720.0, 609.0, 511.0, 440.0, 369.0, 316.0, 298.0, 225.0, 185.0, 172.0, 125.0, 91.0, 96.0, 83.0, 63.0, 56.0, 63.0, 36.0, 45.0, 48.0, 21.0, 30.0, 27.0, 22.0, 25.0, 23.0, 23.0, 13.0, 18.0, 19.0, 20.0, 17.0, 12.0, 17.0, 8.0, 12.0, 16.0, 12.0, 7.0, 11.0, 13.0, 6.0, 4.0, 16.0, 9.0, 11.0, 4.0, 8.0, 9.0, 13.0, 9.0, 7.0, 3.0, 7.0, 9.0, 11.0, 10.0, 10.0, 16.0, 14.0, 11.0, 18.0, 15.0, 31.0, 55.0, 55.0, 58.0, 85.0, 87.0, 100.0, 142.0, 147.0, 182.0, 212.0, 255.0, 280.0, 292.0, 361.0, 436.0, 485.0, 466.0, 536.0, 574.0, 635.0, 660.0, 707.0, 719.0, 743.0, 696.0, 794.0, 797.0, 847.0, 858.0, 859.0, 839.0, 806.0, 722.0, 818.0, 720.0, 659.0, 627.0, 548.0, 566.0, 548.0, 486.0, 472.0, 410.0, 375.0, 366.0, 317.0, 273.0, 236.0, 199.0, 211.0, 189.0, 134.0, 123.0, 102.0, 112.0, 88.0, 59.0, 68.0, 56.0, 47.0, 42.0, 30.0, 24.0, 19.0, 20.0, 14.0, 7.0, 13.0, 8.0, 5.0, 5.0, 2.0, 3.0, 3.0, 1.0, 1.0, 1.0, 0.0, 2.0, 0.0, 2.0, 0.0, 0.0, 0.0, 1.0, 0.0, 1.0, 0.0, 0.0, 1.0, 0.0, 0.0, 0.0, 0.0, 0.0, 0.0, 0.0, 1.0, 0.0, 0.0, 0.0, 0.0, 0.0, 0.0, 0.0, 0.0, 0.0, 0.0, 0.0, 0.0, 0.0, 0.0, 0.0, 0.0, 0.0, 0.0, 0.0, 1.0, 0.0, 0.0, 0.0, 0.0, 0.0, 0.0, 0.0, 0.0, 0.0, 0.0, 0.0, 0.0, 0.0, 0.0, 0.0, 0.0, 0.0, 0.0, 0.0, 0.0, 0.0, 0.0, 0.0, 0.0, 0.0, 0.0, 0.0, 0.0, 0.0, 0.0, 1.0, 0.0, 0.0, 0.0, 0.0, 0.0, 0.0, 0.0, 0.0, 0.0, 0.0, 0.0, 0.0, 0.0, 0.0, 0.0, 0.0, 0.0, 0.0, 0.0, 0.0, 0.0, 0.0, 0.0, 0.0, 0.0, 0.0, 0.0, 0.0, 0.0, 0.0, 0.0, 0.0, 0.0, 0.0, 0.0, 0.0, 0.0, 0.0, 0.0, 0.0, 0.0, 0.0, 0.0, 0.0, 0.0, 0.0, 0.0, 0.0, 0.0, 0.0, 0.0, 0.0, 0.0, 0.0, 0.0],
    "Name": "ThresholdDist-0",
    "Overflow": 0.0,
    "Type": "Histo1d",
    "Underflow": 0.0,
    "x": {
        "AxisTitle": "Threshold [e]",
        "Bins": 374,
        "High": 3735.0,
        "Low": -5.0
    },
    "y": {
        "AxisTitle": "Number of Pixels"
    },
    "z": {
        "AxisTitle": "z"
    }
}