{
    "Data": [786.0, 17203.0, 20407.0, 9284.0, 3907.0, 2619.0, 2736.0, 2892.0, 2820.0, 2461.0, 2005.0, 1445.0, 1028.0, 687.0, 518.0, 360.0, 299.0, 230.0, 164.0, 162.0, 147.0, 138.0, 119.0, 126.0, 117.0, 135.0, 94.0, 90.0, 89.0, 83.0, 69.0, 76.0, 70.0, 56.0, 77.0, 65.0, 59.0, 50.0, 48.0, 48.0, 44.0, 35.0, 33.0, 35.0, 20.0, 20.0, 14.0, 23.0, 17.0, 11.0, 11.0],
    "Name": "Chi2Dist-0",
    "Overflow": 0.0,
    "Type": "Histo1d",
    "Underflow": 0.0,
    "x": {
        "AxisTitle": "Fit Chi/ndf",
        "Bins": 51,
        "High": 2.5250000953674318,
        "Low": -0.02500000037252903
    },
    "y": {
        "AxisTitle": "Number of Pixels"
    },
    "z": {
        "AxisTitle": "z"
    }
}