time,Hardware,Voltage,Current
1621474413887,high-voltage-2,1,0.260853
time,Hardware,Voltage,Current
1621474413887,high-voltage-2,2,0.299489
time,Hardware,Voltage,Current
1621474413887,high-voltage-2,3,0.32606
time,Hardware,Voltage,Current
1621474413887,high-voltage-2,4,0.349235
time,Hardware,Voltage,Current
1621474413887,high-voltage-2,5,0.372294
time,Hardware,Voltage,Current
1621474413887,high-voltage-2,6,0.40006
time,Hardware,Voltage,Current
1621474413887,high-voltage-2,7,0.430013
time,Hardware,Voltage,Current
1621474413887,high-voltage-2,8,0.461636
time,Hardware,Voltage,Current
1621474413887,high-voltage-2,9,0.497206
time,Hardware,Voltage,Current
1621474413887,high-voltage-2,10,0.534832
time,Hardware,Voltage,Current
1621474413887,high-voltage-2,11,0.572765
time,Hardware,Voltage,Current
1621474413887,high-voltage-2,12,0.613007
time,Hardware,Voltage,Current
1621474413887,high-voltage-2,13,0.654314
time,Hardware,Voltage,Current
1621474413887,high-voltage-2,14,0.691771
time,Hardware,Voltage,Current
1621474413887,high-voltage-2,15,0.72817
time,Hardware,Voltage,Current
1621474413887,high-voltage-2,16,0.767321
time,Hardware,Voltage,Current
1621474413887,high-voltage-2,17,0.80027
time,Hardware,Voltage,Current
1621474413887,high-voltage-2,18,0.828103
time,Hardware,Voltage,Current
1621474413887,high-voltage-2,19,0.856277
time,Hardware,Voltage,Current
1621474413887,high-voltage-2,20,0.87965
time,Hardware,Voltage,Current
1621474413887,high-voltage-2,25,0.984668
time,Hardware,Voltage,Current
1621474413887,high-voltage-2,30,1.08198
time,Hardware,Voltage,Current
1621474413887,high-voltage-2,35,1.175
time,Hardware,Voltage,Current
1621474413887,high-voltage-2,40,1.28057
time,Hardware,Voltage,Current
1621474413887,high-voltage-2,45,1.40648
time,Hardware,Voltage,Current
1621474413887,high-voltage-2,50,1.49693
time,Hardware,Voltage,Current
1621474413887,high-voltage-2,55,1.57721
time,Hardware,Voltage,Current
1621474413887,high-voltage-2,60,1.65275
time,Hardware,Voltage,Current
1621474413887,high-voltage-2,65,1.72586
time,Hardware,Voltage,Current
1621474413887,high-voltage-2,70,1.79865
time,Hardware,Voltage,Current
1621474413887,high-voltage-2,75,1.8665
time,Hardware,Voltage,Current
1621474413887,high-voltage-2,80,1.93572
time,Hardware,Voltage,Current
1621474413887,high-voltage-2,85,2.00006
time,Hardware,Voltage,Current
1621474413887,high-voltage-2,90,2.06658
time,Hardware,Voltage,Current
1621474413887,high-voltage-2,95,2.12911
time,Hardware,Voltage,Current
1621474413887,high-voltage-2,100,2.19304
