{
    "Data": [[603.0, 190.0, 104.0, 88.0, 54.0, 42.0, 28.0, 23.0, 16.0, 20.0, 19.0, 16.0, 12.0, 14.0, 25.0, 10.0, 11.0, 6.0, 7.0, 5.0, 10.0, 9.0, 8.0, 7.0, 5.0, 7.0, 6.0, 3.0, 11.0, 6.0, 7.0, 5.0, 7.0, 3.0, 5.0, 5.0, 3.0, 2.0, 5.0, 4.0, 3.0, 3.0, 3.0, 6.0, 8.0, 5.0, 5.0, 8.0, 6.0], [1216.0, 320.0, 166.0, 88.0, 62.0, 40.0, 37.0, 27.0, 19.0, 23.0, 21.0, 12.0, 21.0, 17.0, 22.0, 9.0, 16.0, 9.0, 9.0, 9.0, 8.0, 8.0, 7.0, 4.0, 12.0, 11.0, 9.0, 5.0, 5.0, 9.0, 10.0, 3.0, 9.0, 4.0, 4.0, 10.0, 5.0, 2.0, 5.0, 4.0, 4.0, 3.0, 7.0, 5.0, 5.0, 5.0, 8.0, 8.0, 10.0], [2437.0, 684.0, 325.0, 178.0, 91.0, 64.0, 48.0, 28.0, 27.0, 21.0, 21.0, 20.0, 13.0, 21.0, 8.0, 12.0, 8.0, 8.0, 9.0, 12.0, 13.0, 16.0, 8.0, 14.0, 8.0, 10.0, 9.0, 10.0, 7.0, 14.0, 10.0, 14.0, 10.0, 12.0, 7.0, 7.0, 8.0, 6.0, 5.0, 6.0, 7.0, 10.0, 3.0, 6.0, 9.0, 8.0, 5.0, 11.0, 10.0], [4465.0, 1532.0, 706.0, 374.0, 201.0, 165.0, 126.0, 86.0, 65.0, 37.0, 26.0, 34.0, 24.0, 26.0, 15.0, 22.0, 15.0, 10.0, 7.0, 9.0, 10.0, 12.0, 11.0, 15.0, 10.0, 6.0, 9.0, 15.0, 8.0, 9.0, 8.0, 16.0, 10.0, 10.0, 11.0, 7.0, 10.0, 12.0, 10.0, 9.0, 12.0, 9.0, 7.0, 9.0, 8.0, 7.0, 5.0, 8.0, 17.0], [7315.0, 3194.0, 1707.0, 999.0, 658.0, 439.0, 334.0, 215.0, 146.0, 140.0, 117.0, 93.0, 58.0, 57.0, 48.0, 38.0, 36.0, 23.0, 39.0, 22.0, 23.0, 18.0, 19.0, 10.0, 15.0, 13.0, 9.0, 9.0, 12.0, 13.0, 12.0, 11.0, 8.0, 6.0, 10.0, 5.0, 11.0, 10.0, 10.0, 12.0, 12.0, 12.0, 11.0, 11.0, 13.0, 13.0, 9.0, 16.0, 15.0], [10480.0, 5655.0, 3385.0, 2414.0, 1610.0, 1129.0, 871.0, 648.0, 491.0, 369.0, 299.0, 234.0, 230.0, 173.0, 133.0, 115.0, 91.0, 90.0, 86.0, 64.0, 57.0, 63.0, 37.0, 35.0, 33.0, 38.0, 28.0, 18.0, 14.0, 20.0, 22.0, 13.0, 19.0, 22.0, 15.0, 9.0, 12.0, 15.0, 5.0, 16.0, 6.0, 16.0, 10.0, 9.0, 12.0, 13.0, 21.0, 27.0, 19.0], [7486.0, 6766.0, 5766.0, 4696.0, 3761.0, 2944.0, 2324.0, 1891.0, 1584.0, 1264.0, 1004.0, 732.0, 644.0, 528.0, 441.0, 370.0, 317.0, 251.0, 252.0, 177.0, 174.0, 143.0, 125.0, 124.0, 102.0, 102.0, 89.0, 71.0, 68.0, 63.0, 58.0, 51.0, 42.0, 38.0, 28.0, 20.0, 22.0, 28.0, 22.0, 29.0, 13.0, 16.0, 13.0, 16.0, 11.0, 18.0, 15.0, 28.0, 39.0], [1359.0, 1729.0, 2181.0, 2607.0, 3036.0, 3104.0, 3310.0, 3246.0, 3126.0, 3002.0, 2846.0, 2545.0, 2396.0, 2079.0, 1848.0, 1626.0, 1388.0, 1272.0, 1026.0, 875.0, 757.0, 651.0, 540.0, 423.0, 362.0, 347.0, 314.0, 251.0, 218.0, 169.0, 171.0, 158.0, 130.0, 116.0, 112.0, 118.0, 108.0, 88.0, 83.0, 65.0, 49.0, 42.0, 39.0, 39.0, 40.0, 27.0, 24.0, 34.0, 40.0], [485.0, 362.0, 360.0, 362.0, 417.0, 548.0, 679.0, 760.0, 927.0, 1043.0, 1302.0, 1426.0, 1673.0, 1744.0, 1908.0, 2103.0, 2181.0, 2208.0, 2199.0, 2385.0, 2308.0, 2203.0, 2216.0, 2071.0, 2007.0, 1772.0, 1753.0, 1577.0, 1417.0, 1248.0, 1069.0, 969.0, 798.0, 690.0, 585.0, 465.0, 428.0, 347.0, 304.0, 230.0, 232.0, 182.0, 193.0, 109.0, 126.0, 85.0, 90.0, 68.0, 62.0], [413.0, 230.0, 187.0, 154.0, 124.0, 138.0, 163.0, 152.0, 176.0, 198.0, 221.0, 253.0, 285.0, 341.0, 358.0, 417.0, 482.0, 560.0, 673.0, 766.0, 891.0, 948.0, 1065.0, 1275.0, 1341.0, 1535.0, 1596.0, 1771.0, 1908.0, 2079.0, 2062.0, 2207.0, 2190.0, 2334.0, 2182.0, 2238.0, 2321.0, 2118.0, 2108.0, 1873.0, 1736.0, 1520.0, 1305.0, 1144.0, 896.0, 678.0, 512.0, 374.0, 287.0], [473.0, 171.0, 138.0, 98.0, 82.0, 62.0, 59.0, 63.0, 70.0, 79.0, 63.0, 89.0, 82.0, 96.0, 91.0, 119.0, 118.0, 136.0, 156.0, 186.0, 202.0, 228.0, 267.0, 294.0, 354.0, 360.0, 423.0, 452.0, 572.0, 666.0, 748.0, 915.0, 997.0, 1187.0, 1300.0, 1510.0, 1646.0, 1919.0, 2079.0, 2389.0, 2571.0, 2778.0, 3072.0, 3332.0, 3605.0, 3627.0, 3581.0, 3255.0, 2725.0], [513.0, 211.0, 139.0, 76.0, 63.0, 53.0, 40.0, 49.0, 31.0, 38.0, 36.0, 27.0, 37.0, 28.0, 43.0, 31.0, 55.0, 48.0, 59.0, 53.0, 59.0, 69.0, 78.0, 101.0, 86.0, 117.0, 119.0, 159.0, 175.0, 197.0, 224.0, 243.0, 273.0, 373.0, 427.0, 499.0, 628.0, 751.0, 918.0, 1107.0, 1375.0, 1591.0, 1872.0, 2308.0, 2975.0, 3666.0, 4436.0, 6148.0, 8293.0], [737.0, 243.0, 129.0, 75.0, 59.0, 40.0, 33.0, 38.0, 33.0, 23.0, 35.0, 25.0, 33.0, 25.0, 19.0, 22.0, 25.0, 16.0, 18.0, 21.0, 29.0, 32.0, 33.0, 33.0, 35.0, 41.0, 33.0, 52.0, 43.0, 64.0, 62.0, 63.0, 102.0, 118.0, 123.0, 137.0, 219.0, 209.0, 298.0, 363.0, 492.0, 643.0, 805.0, 1116.0, 1482.0, 2120.0, 3163.0, 4948.0, 8660.0], [1102.0, 319.0, 161.0, 75.0, 61.0, 51.0, 26.0, 29.0, 32.0, 20.0, 21.0, 20.0, 26.0, 25.0, 11.0, 23.0, 17.0, 14.0, 24.0, 28.0, 18.0, 17.0, 19.0, 22.0, 21.0, 26.0, 22.0, 21.0, 16.0, 23.0, 28.0, 34.0, 31.0, 31.0, 37.0, 48.0, 46.0, 64.0, 88.0, 115.0, 143.0, 162.0, 239.0, 366.0, 568.0, 930.0, 1549.0, 2989.0, 6909.0], [1724.0, 522.0, 214.0, 121.0, 53.0, 62.0, 35.0, 24.0, 24.0, 28.0, 25.0, 26.0, 15.0, 17.0, 23.0, 17.0, 17.0, 15.0, 23.0, 14.0, 12.0, 12.0, 20.0, 25.0, 13.0, 16.0, 21.0, 19.0, 14.0, 20.0, 15.0, 17.0, 22.0, 14.0, 26.0, 28.0, 21.0, 37.0, 30.0, 31.0, 41.0, 61.0, 59.0, 107.0, 162.0, 257.0, 567.0, 1258.0, 4169.0], [2565.0, 960.0, 411.0, 183.0, 94.0, 62.0, 40.0, 35.0, 20.0, 16.0, 17.0, 16.0, 18.0, 22.0, 19.0, 8.0, 17.0, 14.0, 14.0, 10.0, 14.0, 17.0, 14.0, 16.0, 10.0, 12.0, 23.0, 8.0, 14.0, 13.0, 17.0, 12.0, 17.0, 15.0, 23.0, 20.0, 22.0, 18.0, 15.0, 16.0, 28.0, 35.0, 44.0, 50.0, 66.0, 104.0, 176.0, 456.0, 2028.0], [3415.0, 1451.0, 723.0, 320.0, 195.0, 98.0, 63.0, 39.0, 31.0, 28.0, 22.0, 13.0, 14.0, 6.0, 12.0, 13.0, 19.0, 12.0, 12.0, 5.0, 11.0, 17.0, 8.0, 18.0, 12.0, 13.0, 16.0, 6.0, 12.0, 15.0, 16.0, 22.0, 12.0, 16.0, 9.0, 19.0, 18.0, 11.0, 23.0, 21.0, 23.0, 20.0, 21.0, 29.0, 30.0, 59.0, 90.0, 186.0, 836.0], [4121.0, 2047.0, 1155.0, 617.0, 359.0, 225.0, 136.0, 102.0, 66.0, 35.0, 36.0, 20.0, 24.0, 16.0, 22.0, 12.0, 9.0, 15.0, 15.0, 13.0, 10.0, 9.0, 11.0, 10.0, 8.0, 10.0, 8.0, 6.0, 15.0, 11.0, 10.0, 9.0, 14.0, 9.0, 10.0, 11.0, 15.0, 15.0, 22.0, 11.0, 20.0, 17.0, 26.0, 15.0, 27.0, 37.0, 44.0, 117.0, 331.0], [4602.0, 2614.0, 1689.0, 1036.0, 654.0, 450.0, 310.0, 234.0, 129.0, 76.0, 76.0, 58.0, 39.0, 38.0, 28.0, 29.0, 14.0, 10.0, 15.0, 12.0, 10.0, 10.0, 9.0, 7.0, 14.0, 9.0, 5.0, 4.0, 6.0, 12.0, 6.0, 6.0, 9.0, 9.0, 13.0, 16.0, 8.0, 10.0, 13.0, 8.0, 7.0, 20.0, 24.0, 27.0, 19.0, 29.0, 45.0, 60.0, 178.0], [4461.0, 3046.0, 2140.0, 1497.0, 1066.0, 832.0, 610.0, 437.0, 316.0, 232.0, 164.0, 121.0, 89.0, 80.0, 57.0, 44.0, 31.0, 22.0, 22.0, 23.0, 14.0, 20.0, 8.0, 6.0, 10.0, 10.0, 8.0, 12.0, 14.0, 10.0, 6.0, 12.0, 9.0, 3.0, 6.0, 11.0, 9.0, 8.0, 12.0, 10.0, 11.0, 13.0, 13.0, 11.0, 24.0, 17.0, 34.0, 57.0, 109.0], [3876.0, 2962.0, 2321.0, 1835.0, 1435.0, 1225.0, 981.0, 746.0, 558.0, 422.0, 355.0, 280.0, 213.0, 190.0, 148.0, 135.0, 94.0, 78.0, 53.0, 47.0, 31.0, 30.0, 23.0, 8.0, 18.0, 17.0, 11.0, 11.0, 10.0, 16.0, 10.0, 12.0, 8.0, 6.0, 10.0, 5.0, 4.0, 8.0, 12.0, 8.0, 11.0, 10.0, 13.0, 7.0, 17.0, 24.0, 13.0, 30.0, 94.0], [3083.0, 2571.0, 2321.0, 2026.0, 1572.0, 1453.0, 1179.0, 1025.0, 870.0, 720.0, 596.0, 519.0, 402.0, 353.0, 277.0, 226.0, 184.0, 171.0, 153.0, 109.0, 94.0, 73.0, 69.0, 45.0, 48.0, 19.0, 26.0, 21.0, 19.0, 12.0, 17.0, 10.0, 12.0, 11.0, 9.0, 6.0, 9.0, 4.0, 4.0, 7.0, 8.0, 12.0, 11.0, 15.0, 10.0, 10.0, 15.0, 38.0, 65.0], [2097.0, 1978.0, 1915.0, 1747.0, 1509.0, 1528.0, 1395.0, 1178.0, 1127.0, 973.0, 885.0, 774.0, 686.0, 617.0, 490.0, 497.0, 410.0, 294.0, 304.0, 251.0, 223.0, 185.0, 145.0, 127.0, 118.0, 77.0, 76.0, 67.0, 49.0, 48.0, 35.0, 19.0, 33.0, 19.0, 14.0, 9.0, 9.0, 6.0, 11.0, 6.0, 6.0, 12.0, 5.0, 13.0, 12.0, 10.0, 21.0, 17.0, 56.0], [1365.0, 1378.0, 1382.0, 1420.0, 1381.0, 1283.0, 1254.0, 1164.0, 1112.0, 1065.0, 1034.0, 975.0, 828.0, 791.0, 755.0, 708.0, 604.0, 537.0, 539.0, 469.0, 400.0, 326.0, 364.0, 275.0, 250.0, 180.0, 192.0, 139.0, 135.0, 112.0, 108.0, 92.0, 60.0, 54.0, 38.0, 33.0, 40.0, 22.0, 18.0, 24.0, 13.0, 10.0, 6.0, 11.0, 7.0, 10.0, 17.0, 13.0, 43.0], [857.0, 875.0, 927.0, 1023.0, 1015.0, 1029.0, 1004.0, 999.0, 1061.0, 996.0, 960.0, 992.0, 881.0, 936.0, 863.0, 794.0, 784.0, 749.0, 708.0, 641.0, 614.0, 536.0, 496.0, 498.0, 472.0, 381.0, 356.0, 319.0, 265.0, 255.0, 210.0, 195.0, 170.0, 128.0, 117.0, 82.0, 93.0, 55.0, 57.0, 59.0, 41.0, 30.0, 32.0, 29.0, 19.0, 17.0, 16.0, 16.0, 29.0], [560.0, 548.0, 630.0, 573.0, 687.0, 664.0, 744.0, 733.0, 768.0, 781.0, 832.0, 825.0, 848.0, 831.0, 809.0, 877.0, 830.0, 784.0, 772.0, 761.0, 807.0, 693.0, 740.0, 645.0, 641.0, 578.0, 547.0, 520.0, 465.0, 457.0, 382.0, 365.0, 339.0, 317.0, 245.0, 232.0, 211.0, 165.0, 132.0, 120.0, 123.0, 80.0, 70.0, 44.0, 55.0, 29.0, 33.0, 29.0, 35.0], [344.0, 344.0, 358.0, 378.0, 411.0, 433.0, 478.0, 515.0, 500.0, 525.0, 631.0, 613.0, 618.0, 674.0, 703.0, 713.0, 761.0, 801.0, 763.0, 746.0, 753.0, 751.0, 766.0, 773.0, 742.0, 764.0, 675.0, 657.0, 652.0, 631.0, 584.0, 546.0, 588.0, 483.0, 442.0, 470.0, 411.0, 372.0, 310.0, 295.0, 248.0, 191.0, 184.0, 137.0, 136.0, 81.0, 78.0, 40.0, 60.0], [271.0, 209.0, 196.0, 216.0, 234.0, 244.0, 251.0, 307.0, 302.0, 345.0, 377.0, 401.0, 461.0, 450.0, 577.0, 531.0, 560.0, 583.0, 606.0, 669.0, 673.0, 718.0, 709.0, 702.0, 745.0, 746.0, 758.0, 724.0, 715.0, 762.0, 734.0, 723.0, 766.0, 677.0, 703.0, 633.0, 597.0, 588.0, 555.0, 505.0, 496.0, 409.0, 389.0, 323.0, 316.0, 219.0, 190.0, 149.0, 105.0], [219.0, 159.0, 152.0, 119.0, 107.0, 148.0, 149.0, 168.0, 196.0, 190.0, 213.0, 255.0, 269.0, 286.0, 293.0, 353.0, 364.0, 409.0, 443.0, 491.0, 498.0, 490.0, 597.0, 590.0, 673.0, 645.0, 677.0, 716.0, 677.0, 776.0, 779.0, 806.0, 763.0, 816.0, 792.0, 828.0, 752.0, 799.0, 764.0, 814.0, 784.0, 717.0, 635.0, 605.0, 557.0, 468.0, 437.0, 349.0, 248.0], [263.0, 116.0, 128.0, 100.0, 80.0, 52.0, 92.0, 82.0, 90.0, 117.0, 135.0, 153.0, 174.0, 170.0, 199.0, 205.0, 229.0, 235.0, 282.0, 302.0, 339.0, 376.0, 371.0, 400.0, 417.0, 488.0, 516.0, 559.0, 548.0, 635.0, 677.0, 719.0, 753.0, 837.0, 870.0, 869.0, 893.0, 879.0, 941.0, 934.0, 911.0, 943.0, 964.0, 925.0, 948.0, 832.0, 781.0, 667.0, 583.0], [203.0, 147.0, 123.0, 103.0, 104.0, 50.0, 50.0, 40.0, 50.0, 54.0, 51.0, 83.0, 94.0, 100.0, 105.0, 103.0, 127.0, 161.0, 166.0, 170.0, 198.0, 210.0, 236.0, 261.0, 276.0, 299.0, 314.0, 396.0, 378.0, 528.0, 509.0, 535.0, 575.0, 645.0, 692.0, 786.0, 807.0, 893.0, 906.0, 977.0, 1078.0, 1134.0, 1108.0, 1218.0, 1206.0, 1236.0, 1290.0, 1184.0, 1196.0], [183.0, 155.0, 69.0, 57.0, 47.0, 38.0, 31.0, 24.0, 32.0, 44.0, 63.0, 42.0, 52.0, 42.0, 53.0, 66.0, 72.0, 87.0, 82.0, 92.0, 109.0, 146.0, 157.0, 175.0, 189.0, 196.0, 221.0, 259.0, 251.0, 304.0, 313.0, 366.0, 414.0, 486.0, 530.0, 584.0, 644.0, 735.0, 794.0, 875.0, 1008.0, 1110.0, 1222.0, 1280.0, 1424.0, 1570.0, 1669.0, 1785.0, 1857.0], [189.0, 113.0, 77.0, 62.0, 59.0, 41.0, 33.0, 31.0, 46.0, 25.0, 47.0, 23.0, 11.0, 27.0, 40.0, 35.0, 42.0, 38.0, 40.0, 62.0, 54.0, 73.0, 75.0, 71.0, 93.0, 102.0, 123.0, 125.0, 145.0, 172.0, 183.0, 235.0, 231.0, 265.0, 350.0, 434.0, 449.0, 506.0, 617.0, 648.0, 824.0, 975.0, 1113.0, 1254.0, 1500.0, 1615.0, 1984.0, 2331.0, 2795.0], [246.0, 109.0, 84.0, 49.0, 67.0, 46.0, 35.0, 29.0, 35.0, 49.0, 48.0, 40.0, 23.0, 21.0, 16.0, 26.0, 21.0, 53.0, 14.0, 33.0, 24.0, 31.0, 34.0, 39.0, 44.0, 50.0, 52.0, 72.0, 77.0, 94.0, 108.0, 133.0, 141.0, 167.0, 185.0, 226.0, 313.0, 313.0, 388.0, 452.0, 549.0, 756.0, 825.0, 1053.0, 1317.0, 1559.0, 1975.0, 2562.0, 3456.0], [218.0, 122.0, 65.0, 50.0, 43.0, 19.0, 21.0, 20.0, 18.0, 14.0, 10.0, 25.0, 20.0, 8.0, 10.0, 17.0, 22.0, 31.0, 20.0, 11.0, 19.0, 9.0, 20.0, 19.0, 27.0, 26.0, 30.0, 47.0, 31.0, 56.0, 59.0, 64.0, 89.0, 123.0, 117.0, 150.0, 183.0, 199.0, 239.0, 312.0, 328.0, 463.0, 611.0, 780.0, 1012.0, 1257.0, 1802.0, 2563.0, 3857.0], [197.0, 121.0, 74.0, 63.0, 42.0, 29.0, 42.0, 21.0, 8.0, 14.0, 12.0, 16.0, 15.0, 6.0, 6.0, 13.0, 13.0, 33.0, 14.0, 18.0, 7.0, 11.0, 15.0, 19.0, 19.0, 31.0, 19.0, 14.0, 24.0, 14.0, 24.0, 32.0, 42.0, 50.0, 46.0, 86.0, 96.0, 121.0, 118.0, 180.0, 217.0, 296.0, 369.0, 532.0, 674.0, 961.0, 1497.0, 2193.0, 3970.0], [190.0, 132.0, 83.0, 47.0, 38.0, 38.0, 50.0, 19.0, 40.0, 38.0, 32.0, 15.0, 7.0, 10.0, 4.0, 11.0, 8.0, 27.0, 30.0, 21.0, 11.0, 8.0, 8.0, 4.0, 7.0, 9.0, 7.0, 6.0, 33.0, 17.0, 10.0, 15.0, 17.0, 16.0, 29.0, 32.0, 32.0, 43.0, 66.0, 78.0, 129.0, 189.0, 197.0, 294.0, 429.0, 678.0, 1057.0, 1809.0, 3602.0], [196.0, 130.0, 79.0, 55.0, 54.0, 23.0, 21.0, 13.0, 7.0, 11.0, 15.0, 20.0, 27.0, 5.0, 7.0, 10.0, 13.0, 7.0, 9.0, 2.0, 24.0, 14.0, 10.0, 11.0, 14.0, 8.0, 3.0, 9.0, 8.0, 11.0, 24.0, 22.0, 14.0, 25.0, 30.0, 39.0, 19.0, 14.0, 29.0, 59.0, 58.0, 70.0, 92.0, 131.0, 217.0, 406.0, 758.0, 1305.0, 2972.0], [185.0, 140.0, 69.0, 59.0, 38.0, 44.0, 51.0, 23.0, 14.0, 13.0, 16.0, 49.0, 27.0, 21.0, 4.0, 7.0, 7.0, 7.0, 10.0, 6.0, 7.0, 26.0, 20.0, 14.0, 6.0, 5.0, 22.0, 8.0, 4.0, 6.0, 4.0, 6.0, 7.0, 4.0, 31.0, 14.0, 38.0, 23.0, 7.0, 12.0, 33.0, 29.0, 62.0, 73.0, 152.0, 233.0, 377.0, 825.0, 2227.0], [208.0, 109.0, 85.0, 69.0, 42.0, 32.0, 21.0, 7.0, 16.0, 31.0, 31.0, 18.0, 13.0, 9.0, 32.0, 5.0, 9.0, 10.0, 8.0, 10.0, 22.0, 29.0, 24.0, 34.0, 14.0, 6.0, 6.0, 3.0, 5.0, 26.0, 7.0, 7.0, 5.0, 8.0, 20.0, 7.0, 24.0, 4.0, 10.0, 26.0, 47.0, 19.0, 46.0, 42.0, 62.0, 97.0, 220.0, 541.0, 1586.0], [185.0, 106.0, 71.0, 62.0, 45.0, 30.0, 19.0, 12.0, 33.0, 38.0, 15.0, 9.0, 15.0, 21.0, 20.0, 25.0, 33.0, 6.0, 10.0, 5.0, 15.0, 19.0, 12.0, 28.0, 5.0, 2.0, 4.0, 28.0, 31.0, 13.0, 21.0, 6.0, 6.0, 5.0, 4.0, 28.0, 7.0, 21.0, 5.0, 25.0, 17.0, 7.0, 6.0, 11.0, 31.0, 60.0, 122.0, 287.0, 1009.0], [216.0, 108.0, 65.0, 82.0, 47.0, 31.0, 39.0, 21.0, 17.0, 18.0, 10.0, 7.0, 11.0, 64.0, 22.0, 27.0, 17.0, 5.0, 23.0, 12.0, 37.0, 40.0, 7.0, 6.0, 25.0, 10.0, 19.0, 10.0, 4.0, 2.0, 25.0, 29.0, 4.0, 2.0, 4.0, 4.0, 7.0, 2.0, 5.0, 8.0, 5.0, 9.0, 6.0, 10.0, 28.0, 35.0, 61.0, 159.0, 634.0], [194.0, 102.0, 84.0, 60.0, 29.0, 20.0, 39.0, 40.0, 14.0, 16.0, 7.0, 35.0, 35.0, 27.0, 18.0, 6.0, 9.0, 7.0, 7.0, 7.0, 8.0, 29.0, 6.0, 4.0, 1.0, 4.0, 19.0, 21.0, 16.0, 20.0, 5.0, 4.0, 3.0, 6.0, 4.0, 27.0, 2.0, 3.0, 11.0, 23.0, 3.0, 2.0, 20.0, 12.0, 21.0, 29.0, 30.0, 72.0, 419.0], [190.0, 102.0, 62.0, 64.0, 39.0, 34.0, 22.0, 55.0, 32.0, 31.0, 17.0, 20.0, 41.0, 8.0, 8.0, 4.0, 11.0, 4.0, 7.0, 24.0, 10.0, 5.0, 9.0, 6.0, 4.0, 25.0, 15.0, 26.0, 10.0, 4.0, 2.0, 3.0, 0.0, 46.0, 21.0, 5.0, 42.0, 11.0, 2.0, 3.0, 3.0, 6.0, 6.0, 23.0, 9.0, 24.0, 21.0, 49.0, 236.0], [180.0, 130.0, 75.0, 46.0, 27.0, 40.0, 73.0, 21.0, 10.0, 8.0, 22.0, 30.0, 7.0, 7.0, 8.0, 26.0, 10.0, 9.0, 10.0, 10.0, 5.0, 53.0, 8.0, 6.0, 4.0, 4.0, 3.0, 2.0, 19.0, 13.0, 5.0, 3.0, 8.0, 4.0, 4.0, 4.0, 3.0, 4.0, 4.0, 2.0, 6.0, 6.0, 34.0, 22.0, 7.0, 6.0, 7.0, 22.0, 124.0], [192.0, 120.0, 76.0, 61.0, 32.0, 37.0, 32.0, 25.0, 25.0, 27.0, 9.0, 11.0, 26.0, 17.0, 39.0, 25.0, 10.0, 11.0, 10.0, 4.0, 3.0, 5.0, 4.0, 7.0, 34.0, 34.0, 15.0, 4.0, 28.0, 27.0, 30.0, 12.0, 6.0, 1.0, 4.0, 1.0, 4.0, 3.0, 24.0, 7.0, 5.0, 6.0, 24.0, 6.0, 5.0, 27.0, 3.0, 17.0, 78.0], [205.0, 112.0, 68.0, 52.0, 48.0, 42.0, 34.0, 17.0, 18.0, 18.0, 27.0, 10.0, 21.0, 22.0, 5.0, 3.0, 29.0, 17.0, 48.0, 16.0, 7.0, 6.0, 19.0, 34.0, 27.0, 4.0, 5.0, 4.0, 6.0, 5.0, 2.0, 23.0, 24.0, 19.0, 5.0, 6.0, 7.0, 0.0, 28.0, 3.0, 3.0, 15.0, 15.0, 21.0, 9.0, 10.0, 5.0, 11.0, 61.0], [208.0, 105.0, 74.0, 48.0, 35.0, 46.0, 23.0, 16.0, 9.0, 10.0, 23.0, 45.0, 16.0, 10.0, 5.0, 12.0, 11.0, 7.0, 5.0, 5.0, 12.0, 24.0, 6.0, 2.0, 6.0, 32.0, 6.0, 5.0, 5.0, 4.0, 5.0, 10.0, 38.0, 9.0, 6.0, 6.0, 6.0, 0.0, 4.0, 5.0, 5.0, 4.0, 16.0, 22.0, 34.0, 41.0, 5.0, 4.0, 22.0], [235.0, 107.0, 92.0, 53.0, 30.0, 28.0, 24.0, 29.0, 24.0, 17.0, 7.0, 9.0, 32.0, 10.0, 25.0, 13.0, 7.0, 10.0, 7.0, 10.0, 7.0, 6.0, 7.0, 8.0, 25.0, 7.0, 7.0, 28.0, 4.0, 3.0, 4.0, 2.0, 18.0, 13.0, 2.0, 8.0, 4.0, 4.0, 7.0, 10.0, 22.0, 7.0, 26.0, 3.0, 3.0, 4.0, 8.0, 6.0, 18.0], [203.0, 99.0, 89.0, 42.0, 51.0, 27.0, 18.0, 22.0, 19.0, 43.0, 43.0, 35.0, 20.0, 32.0, 7.0, 7.0, 9.0, 4.0, 9.0, 2.0, 4.0, 26.0, 11.0, 25.0, 9.0, 4.0, 10.0, 25.0, 6.0, 4.0, 7.0, 21.0, 9.0, 3.0, 7.0, 4.0, 6.0, 4.0, 7.0, 1.0, 23.0, 7.0, 4.0, 3.0, 6.0, 5.0, 11.0, 5.0, 19.0], [182.0, 106.0, 65.0, 49.0, 50.0, 32.0, 23.0, 10.0, 13.0, 12.0, 9.0, 8.0, 12.0, 7.0, 6.0, 8.0, 8.0, 6.0, 3.0, 7.0, 8.0, 10.0, 6.0, 9.0, 7.0, 5.0, 7.0, 20.0, 21.0, 33.0, 13.0, 6.0, 7.0, 2.0, 2.0, 4.0, 4.0, 3.0, 5.0, 10.0, 3.0, 1.0, 7.0, 2.0, 4.0, 7.0, 6.0, 6.0, 20.0]],
    "Name": "sCurve-0",
    "Overflow": 2296754.0,
    "Type": "Histo2d",
    "Underflow": 0.0,
    "x": {
        "AxisTitle": "Vcal",
        "Bins": 51,
        "High": 302.5,
        "Low": 47.5
    },
    "y": {
        "AxisTitle": "Occupancy",
        "Bins": 49,
        "High": 49.5,
        "Low": 0.5
    },
    "z": {
        "AxisTitle": "Number of pixels"
    }
}