time,Hardware,Voltage,Current
1626320188536,high-voltage-3,1,0.282028
time,Hardware,Voltage,Current
1626320188536,high-voltage-3,2,0.301877
time,Hardware,Voltage,Current
1626320188536,high-voltage-3,3,0.32153
time,Hardware,Voltage,Current
1626320188536,high-voltage-3,4,0.335378
time,Hardware,Voltage,Current
1626320188536,high-voltage-3,5,0.349681
time,Hardware,Voltage,Current
1626320188536,high-voltage-3,6,0.361965
time,Hardware,Voltage,Current
1626320188536,high-voltage-3,7,0.376297
time,Hardware,Voltage,Current
1626320188536,high-voltage-3,8,0.39026
time,Hardware,Voltage,Current
1626320188536,high-voltage-3,9,0.407633
time,Hardware,Voltage,Current
1626320188536,high-voltage-3,10,0.42325
time,Hardware,Voltage,Current
1626320188536,high-voltage-3,11,0.439656
time,Hardware,Voltage,Current
1626320188536,high-voltage-3,12,0.457095
time,Hardware,Voltage,Current
1626320188536,high-voltage-3,13,0.470084
time,Hardware,Voltage,Current
1626320188536,high-voltage-3,14,0.484707
time,Hardware,Voltage,Current
1626320188536,high-voltage-3,15,0.495906
time,Hardware,Voltage,Current
1626320188536,high-voltage-3,16,0.508938
time,Hardware,Voltage,Current
1626320188536,high-voltage-3,17,0.519563
time,Hardware,Voltage,Current
1626320188536,high-voltage-3,18,0.529819
time,Hardware,Voltage,Current
1626320188536,high-voltage-3,19,0.539836
time,Hardware,Voltage,Current
1626320188536,high-voltage-3,20,0.551072
time,Hardware,Voltage,Current
1626320188536,high-voltage-3,25,0.593844
time,Hardware,Voltage,Current
1626320188536,high-voltage-3,30,0.633299
time,Hardware,Voltage,Current
1626320188536,high-voltage-3,35,0.66626
time,Hardware,Voltage,Current
1626320188536,high-voltage-3,40,0.695872
time,Hardware,Voltage,Current
1626320188536,high-voltage-3,45,0.720349
time,Hardware,Voltage,Current
1626320188536,high-voltage-3,50,0.747103
time,Hardware,Voltage,Current
1626320188536,high-voltage-3,55,0.769556
time,Hardware,Voltage,Current
1626320188536,high-voltage-3,60,0.79443
time,Hardware,Voltage,Current
1626320188536,high-voltage-3,65,0.817711
time,Hardware,Voltage,Current
1626320188536,high-voltage-3,70,0.84302
time,Hardware,Voltage,Current
1626320188536,high-voltage-3,75,0.867511
time,Hardware,Voltage,Current
1626320188536,high-voltage-3,80,0.893036
time,Hardware,Voltage,Current
1626320188536,high-voltage-3,85,0.918002
time,Hardware,Voltage,Current
1626320188536,high-voltage-3,90,0.938658
time,Hardware,Voltage,Current
1626320188536,high-voltage-3,95,0.964393
time,Hardware,Voltage,Current
1626320188536,high-voltage-3,100,0.986961
