{
    "Data": [0.0, 0.0, 0.0, 0.0, 0.0, 0.0, 0.0, 0.0, 0.0, 0.0, 0.0, 0.0, 0.0, 11.0, 6.0, 1.0, 2.0, 132.0, 440.0, 143.0, 86.0, 740.0, 2555.0, 1761.0, 448.0, 1473.0, 2702.0, 1970.0, 773.0, 1237.0, 1803.0, 1465.0, 804.0, 735.0, 678.0, 594.0, 477.0, 838.0, 1373.0, 1036.0, 698.0, 1282.0, 2540.0, 3596.0, 2515.0, 1908.0, 2285.0, 3889.0, 3586.0, 2967.0, 2163.0, 2241.0, 2519.0, 1927.0, 1630.0, 1364.0, 1768.0, 1386.0, 1506.0, 1038.0, 874.0, 980.0, 678.0, 644.0, 498.0, 501.0, 533.0, 438.0, 388.0, 325.0, 355.0, 364.0, 292.0, 242.0, 202.0, 192.0, 176.0, 179.0, 153.0, 130.0, 140.0, 102.0, 94.0, 79.0, 95.0, 76.0, 67.0, 51.0, 55.0, 54.0, 52.0, 34.0, 42.0, 41.0, 35.0, 29.0, 32.0, 14.0, 19.0, 24.0, 15.0, 29.0, 11.0, 22.0, 11.0, 15.0, 9.0, 10.0, 11.0, 15.0, 7.0, 8.0, 6.0, 8.0, 9.0, 6.0, 7.0, 6.0, 5.0, 5.0, 4.0, 3.0, 3.0, 3.0, 2.0, 2.0, 3.0, 4.0, 4.0, 3.0, 2.0, 2.0, 1.0, 3.0, 0.0, 1.0, 3.0, 1.0, 4.0, 2.0, 0.0, 1.0, 0.0, 2.0, 1.0, 2.0, 0.0, 1.0, 0.0, 1.0, 1.0, 0.0, 2.0, 2.0, 1.0, 2.0, 0.0, 0.0, 0.0, 0.0, 1.0, 0.0, 1.0, 1.0, 0.0, 1.0, 1.0, 0.0, 0.0, 1.0, 2.0, 0.0, 0.0, 0.0, 1.0, 0.0, 0.0, 0.0, 0.0, 0.0, 1.0, 0.0, 1.0, 1.0, 0.0, 0.0, 1.0, 0.0, 0.0, 1.0, 1.0, 0.0, 0.0, 0.0, 0.0, 0.0, 1.0, 0.0, 0.0, 1.0, 0.0],
    "Name": "TimePerFitDist-0",
    "Overflow": 111.0,
    "Type": "Histo1d",
    "Underflow": 0.0,
    "x": {
        "AxisTitle": "Fit Time [us]",
        "Bins": 201,
        "High": 401.0,
        "Low": -1.0
    },
    "y": {
        "AxisTitle": "Number of Pixels"
    },
    "z": {
        "AxisTitle": "z"
    }
}