time,Hardware,Voltage,Current
1626729898643,high-voltage,1,0.0539308
time,Hardware,Voltage,Current
1626729898643,high-voltage,2,0.0769068
time,Hardware,Voltage,Current
1626729898643,high-voltage,3,0.0905395
time,Hardware,Voltage,Current
1626729898643,high-voltage,4,0.101711
time,Hardware,Voltage,Current
1626729898643,high-voltage,5,0.111428
time,Hardware,Voltage,Current
1626729898643,high-voltage,6,0.122729
time,Hardware,Voltage,Current
1626729898643,high-voltage,7,0.135482
time,Hardware,Voltage,Current
1626729898643,high-voltage,8,0.148972
time,Hardware,Voltage,Current
1626729898643,high-voltage,9,0.162545
time,Hardware,Voltage,Current
1626729898643,high-voltage,10,0.176697
time,Hardware,Voltage,Current
1626729898643,high-voltage,11,0.190432
time,Hardware,Voltage,Current
1626729898643,high-voltage,12,0.204117
time,Hardware,Voltage,Current
1626729898643,high-voltage,13,0.21549
time,Hardware,Voltage,Current
1626729898643,high-voltage,14,0.224291
time,Hardware,Voltage,Current
1626729898643,high-voltage,15,0.233499
time,Hardware,Voltage,Current
1626729898643,high-voltage,16,0.240864
time,Hardware,Voltage,Current
1626729898643,high-voltage,17,0.248047
time,Hardware,Voltage,Current
1626729898643,high-voltage,18,0.253834
time,Hardware,Voltage,Current
1626729898643,high-voltage,19,0.261378
time,Hardware,Voltage,Current
1626729898643,high-voltage,20,0.268234
time,Hardware,Voltage,Current
1626729898643,high-voltage,25,0.297473
time,Hardware,Voltage,Current
1626729898643,high-voltage,30,0.334973
time,Hardware,Voltage,Current
1626729898643,high-voltage,35,0.409218
time,Hardware,Voltage,Current
1626729898643,high-voltage,40,0.587322
time,Hardware,Voltage,Current
1626729898643,high-voltage,45,0.947057
time,Hardware,Voltage,Current
1626729898643,high-voltage,50,1.57258
time,Hardware,Voltage,Current
1626729898643,high-voltage,55,2.59442
time,Hardware,Voltage,Current
1626729898643,high-voltage,60,4.11965
time,Hardware,Voltage,Current
1626729898643,high-voltage,65,6.27374
time,Hardware,Voltage,Current
1626729898643,high-voltage,70,9.11366
time,Hardware,Voltage,Current
1626729898643,high-voltage,75,10
