time,Hardware,Voltage,Current
1621537310090,high-voltage-2,1,0.182702
time,Hardware,Voltage,Current
1621537310090,high-voltage-2,2,0.245749
time,Hardware,Voltage,Current
1621537310090,high-voltage-2,3,0.283161
time,Hardware,Voltage,Current
1621537310090,high-voltage-2,4,0.312115
time,Hardware,Voltage,Current
1621537310090,high-voltage-2,5,0.337545
time,Hardware,Voltage,Current
1621537310090,high-voltage-2,6,0.359074
time,Hardware,Voltage,Current
1621537310090,high-voltage-2,7,0.37586
time,Hardware,Voltage,Current
1621537310090,high-voltage-2,8,0.392711
time,Hardware,Voltage,Current
1621537310090,high-voltage-2,9,0.409258
time,Hardware,Voltage,Current
1621537310090,high-voltage-2,10,0.421632
time,Hardware,Voltage,Current
1621537310090,high-voltage-2,11,0.435515
time,Hardware,Voltage,Current
1621537310090,high-voltage-2,12,0.445096
time,Hardware,Voltage,Current
1621537310090,high-voltage-2,13,0.454625
time,Hardware,Voltage,Current
1621537310090,high-voltage-2,14,0.465537
time,Hardware,Voltage,Current
1621537310090,high-voltage-2,15,0.475147
time,Hardware,Voltage,Current
1621537310090,high-voltage-2,16,0.484534
time,Hardware,Voltage,Current
1621537310090,high-voltage-2,17,0.495941
time,Hardware,Voltage,Current
1621537310090,high-voltage-2,18,0.503041
time,Hardware,Voltage,Current
1621537310090,high-voltage-2,19,0.510917
time,Hardware,Voltage,Current
1621537310090,high-voltage-2,20,0.520818
time,Hardware,Voltage,Current
1621537310090,high-voltage-2,25,0.562989
time,Hardware,Voltage,Current
1621537310090,high-voltage-2,30,0.604853
time,Hardware,Voltage,Current
1621537310090,high-voltage-2,35,0.64692
time,Hardware,Voltage,Current
1621537310090,high-voltage-2,40,0.698027
time,Hardware,Voltage,Current
1621537310090,high-voltage-2,45,0.762038
time,Hardware,Voltage,Current
1621537310090,high-voltage-2,50,0.808086
time,Hardware,Voltage,Current
1621537310090,high-voltage-2,55,0.847885
time,Hardware,Voltage,Current
1621537310090,high-voltage-2,60,0.886833
time,Hardware,Voltage,Current
1621537310090,high-voltage-2,65,0.923974
time,Hardware,Voltage,Current
1621537310090,high-voltage-2,70,0.960563
time,Hardware,Voltage,Current
1621537310090,high-voltage-2,75,0.995496
time,Hardware,Voltage,Current
1621537310090,high-voltage-2,80,1.03183
time,Hardware,Voltage,Current
1621537310090,high-voltage-2,85,1.06952
time,Hardware,Voltage,Current
1621537310090,high-voltage-2,90,1.10516
time,Hardware,Voltage,Current
1621537310090,high-voltage-2,95,1.13763
time,Hardware,Voltage,Current
1621537310090,high-voltage-2,100,1.17322
