time,Hardware,Voltage,Current
1623305220337,high-voltage,1,0.061951
time,Hardware,Voltage,Current
1623305220337,high-voltage,2,0.0782259
time,Hardware,Voltage,Current
1623305220337,high-voltage,3,0.0941738
time,Hardware,Voltage,Current
1623305220337,high-voltage,4,0.107282
time,Hardware,Voltage,Current
1623305220337,high-voltage,5,0.118422
time,Hardware,Voltage,Current
1623305220337,high-voltage,6,0.127988
time,Hardware,Voltage,Current
1623305220337,high-voltage,7,0.139122
time,Hardware,Voltage,Current
1623305220337,high-voltage,8,0.147385
time,Hardware,Voltage,Current
1623305220337,high-voltage,9,0.157221
time,Hardware,Voltage,Current
1623305220337,high-voltage,10,0.165797
time,Hardware,Voltage,Current
1623305220337,high-voltage,11,0.17444
time,Hardware,Voltage,Current
1623305220337,high-voltage,12,0.181254
time,Hardware,Voltage,Current
1623305220337,high-voltage,13,0.188778
time,Hardware,Voltage,Current
1623305220337,high-voltage,14,0.193998
time,Hardware,Voltage,Current
1623305220337,high-voltage,15,0.200076
time,Hardware,Voltage,Current
1623305220337,high-voltage,16,0.204787
time,Hardware,Voltage,Current
1623305220337,high-voltage,17,0.210339
time,Hardware,Voltage,Current
1623305220337,high-voltage,18,0.214297
time,Hardware,Voltage,Current
1623305220337,high-voltage,19,0.218396
time,Hardware,Voltage,Current
1623305220337,high-voltage,20,0.223603
time,Hardware,Voltage,Current
1623305220337,high-voltage,25,0.24664
time,Hardware,Voltage,Current
1623305220337,high-voltage,30,0.282267
time,Hardware,Voltage,Current
1623305220337,high-voltage,4.00203e-07,0.399705
time,Hardware,Voltage,Current
1623305220337,high-voltage,40,0.731815
