{
    "Data": [34.0, 65.0, 3.0, 11.0, 56.0, 152.0, 630.0, 1703.0, 3474.0, 4782.0, 4799.0, 3877.0, 3094.0, 2644.0, 2589.0, 2849.0, 3346.0, 3632.0, 3602.0, 3252.0, 2669.0, 1778.0, 1189.0, 677.0, 567.0, 611.0, 693.0, 995.0, 1290.0, 1654.0, 1903.0, 2203.0, 2205.0, 2260.0, 2096.0, 1930.0, 1636.0, 1368.0, 1037.0, 796.0, 524.0, 352.0, 286.0, 192.0, 110.0, 82.0, 48.0, 38.0, 28.0, 28.0, 19.0, 20.0, 10.0, 4.0, 11.0, 5.0, 4.0, 8.0, 1.0, 4.0, 3.0, 6.0, 6.0, 1.0, 0.0, 2.0, 1.0, 0.0, 3.0, 0.0, 1.0],
    "Name": "NoiseDist-0",
    "Overflow": 10.0,
    "Type": "Histo1d",
    "Underflow": 0.0,
    "x": {
        "AxisTitle": "Noise [e]",
        "Bins": 71,
        "High": 356.0,
        "Low": -2.0
    },
    "y": {
        "AxisTitle": "Number of Pixels"
    },
    "z": {
        "AxisTitle": "z"
    }
}