{
    "Data": [0.0, 0.0, 0.0, 0.0, 0.0, 0.0, 0.0, 0.0, 0.0, 0.0, 0.0, 0.0, 0.0, 0.0, 0.0, 0.0, 0.0, 20.0, 213.0, 147.0, 18.0, 177.0, 1422.0, 1425.0, 328.0, 567.0, 1720.0, 2116.0, 798.0, 756.0, 1344.0, 1621.0, 849.0, 637.0, 684.0, 748.0, 537.0, 448.0, 675.0, 780.0, 664.0, 675.0, 1397.0, 2823.0, 2220.0, 1408.0, 2006.0, 3312.0, 4301.0, 3068.0, 2299.0, 2365.0, 3219.0, 2799.0, 2039.0, 1796.0, 1781.0, 2029.0, 1752.0, 1477.0, 1296.0, 1189.0, 1084.0, 809.0, 755.0, 652.0, 678.0, 607.0, 519.0, 461.0, 414.0, 458.0, 387.0, 297.0, 271.0, 287.0, 272.0, 230.0, 186.0, 165.0, 169.0, 162.0, 161.0, 150.0, 116.0, 122.0, 100.0, 81.0, 78.0, 77.0, 100.0, 66.0, 49.0, 59.0, 56.0, 46.0, 42.0, 36.0, 43.0, 43.0, 27.0, 45.0, 25.0, 26.0, 30.0, 21.0, 29.0, 18.0, 21.0, 29.0, 9.0, 30.0, 13.0, 23.0, 18.0, 14.0, 15.0, 18.0, 17.0, 24.0, 22.0, 19.0, 19.0, 12.0, 8.0, 16.0, 18.0, 16.0, 8.0, 6.0, 14.0, 13.0, 17.0, 11.0, 9.0, 13.0, 18.0, 12.0, 10.0, 9.0, 7.0, 11.0, 4.0, 8.0, 10.0, 11.0, 15.0, 12.0, 6.0, 9.0, 6.0, 5.0, 5.0, 6.0, 7.0, 3.0, 8.0, 4.0, 7.0, 9.0, 5.0, 7.0, 4.0, 4.0, 4.0, 4.0, 2.0, 4.0, 4.0, 5.0, 3.0, 4.0, 2.0, 1.0, 2.0, 3.0, 3.0, 2.0, 3.0, 4.0, 2.0, 5.0, 4.0, 1.0, 1.0, 7.0, 2.0, 9.0, 4.0, 1.0, 4.0, 1.0, 2.0, 2.0, 3.0, 1.0, 4.0, 7.0, 5.0, 3.0, 6.0],
    "Name": "TimePerFitDist-0",
    "Overflow": 271.0,
    "Type": "Histo1d",
    "Underflow": 0.0,
    "x": {
        "AxisTitle": "Fit Time [us]",
        "Bins": 201,
        "High": 401.0,
        "Low": -1.0
    },
    "y": {
        "AxisTitle": "Number of Pixels"
    },
    "z": {
        "AxisTitle": "z"
    }
}