time,Hardware,Voltage,Current
1621275240569,high-voltage,1,0.0738795
time,Hardware,Voltage,Current
1621275240569,high-voltage,2,0.143333
time,Hardware,Voltage,Current
1621275240569,high-voltage,3,0.268729
time,Hardware,Voltage,Current
1621275240569,high-voltage,4,0.41956
time,Hardware,Voltage,Current
1621275240569,high-voltage,5,0.653382
time,Hardware,Voltage,Current
1621275240569,high-voltage,6,0.865611
time,Hardware,Voltage,Current
1621275240569,high-voltage,7,1.26897
time,Hardware,Voltage,Current
1621275240569,high-voltage,8,1.65278
time,Hardware,Voltage,Current
1621275240569,high-voltage,9,2.2066
time,Hardware,Voltage,Current
1621275240569,high-voltage,10,2.80389
time,Hardware,Voltage,Current
1621275240569,high-voltage,11,3.50876
time,Hardware,Voltage,Current
1621275240569,high-voltage,12,4.38183
time,Hardware,Voltage,Current
1621275240569,high-voltage,13,5.57375
time,Hardware,Voltage,Current
1621275240569,high-voltage,14,7.14074
time,Hardware,Voltage,Current
1621275240569,high-voltage,15,8.62096
time,Hardware,Voltage,Current
1621275240569,high-voltage,16,9.62522
time,Hardware,Voltage,Current
1621275240569,high-voltage,17,10.0001
