{
    "connectivity": [{
            "chipType": "RD53A",
            "chips": [{
                    "config": "/home/eresseguie/Yarr/configs/rd53a_3dmoduleB_A.json",
                    "enable": 1,
                    "locked": 0,
                    "rx": 0,
                    "tx": 0
                }, {
                    "config": "/home/eresseguie/Yarr/configs/rd53a_3dmoduleB_B.json",
                    "enable": 1,
                    "locked": 0,
                    "rx": 1,
                    "tx": 1
                }, {
                    "config": "/home/eresseguie/Yarr/configs/rd53a_3dmoduleB_C.json",
                    "enable": 1,
                    "locked": 0,
                    "rx": 2,
                    "tx": 2
                }]
        }],
    "ctrlCfg": {
        "ctrlCfg": {
            "cfg": {
                "cmdPeriod": 6.250000073038109e-9,
                "idle": {
                    "word": 1768515945
                },
                "pulse": {
                    "interval": 500,
                    "word": 1549575846
                },
                "rxPolarity": 65535,
                "specNum": 0,
                "spiConfig": 541200,
                "sync": {
                    "interval": 32,
                    "word": 2172551550
                },
                "trigConfig": null,
                "txPolarity": 15
            },
            "type": "spec"
        }
    },
    "exec": "-r configs/controller/specCfg_top.json -c configs/connectivity/rd53a_3dmodule_B.json -s configs/scans/rd53a/std_thresholdscan.json -o 3dmoduleB_HVoff -p ",
    "finishTime": 1620841657,
    "runNumber": 4863,
    "startTime": 1620841542,
    "stopwatch": {
        "analysis": 625,
        "config": 113,
        "processing": 4,
        "scan": 113515
    },
    "targetCharge": -1,
    "targetTot": -1,
    "testType": "std_thresholdscan",
    "timestamp": "2021-05-12_10:45:42"
}