time,Hardware,Voltage,Current
1625783610099,high-voltage-4,1,0.450434
time,Hardware,Voltage,Current
1625783610099,high-voltage-4,2,0.612786
time,Hardware,Voltage,Current
1625783610099,high-voltage-4,3,0.703781
time,Hardware,Voltage,Current
1625783610099,high-voltage-4,4,0.770734
time,Hardware,Voltage,Current
1625783610099,high-voltage-4,5,0.816825
time,Hardware,Voltage,Current
1625783610099,high-voltage-4,6,0.852494
time,Hardware,Voltage,Current
1625783610099,high-voltage-4,7,0.882583
time,Hardware,Voltage,Current
1625783610099,high-voltage-4,8,0.918071
time,Hardware,Voltage,Current
1625783610099,high-voltage-4,9,0.950721
time,Hardware,Voltage,Current
1625783610099,high-voltage-4,10,0.989005
time,Hardware,Voltage,Current
1625783610099,high-voltage-4,11,1.02559
time,Hardware,Voltage,Current
1625783610099,high-voltage-4,12,1.06954
time,Hardware,Voltage,Current
1625783610099,high-voltage-4,13,1.1095
time,Hardware,Voltage,Current
1625783610099,high-voltage-4,14,1.14681
time,Hardware,Voltage,Current
1625783610099,high-voltage-4,15,1.20549
time,Hardware,Voltage,Current
1625783610099,high-voltage-4,16,1.25321
time,Hardware,Voltage,Current
1625783610099,high-voltage-4,17,1.30311
time,Hardware,Voltage,Current
1625783610099,high-voltage-4,18,1.35429
time,Hardware,Voltage,Current
1625783610099,high-voltage-4,19,1.41077
time,Hardware,Voltage,Current
1625783610099,high-voltage-4,20,1.46761
time,Hardware,Voltage,Current
1625783610099,high-voltage-4,25,1.72471
time,Hardware,Voltage,Current
1625783610099,high-voltage-4,30,1.92758
time,Hardware,Voltage,Current
1625783610099,high-voltage-4,35,2.12672
time,Hardware,Voltage,Current
1625783610099,high-voltage-4,40,2.335
time,Hardware,Voltage,Current
1625783610099,high-voltage-4,45,2.56132
time,Hardware,Voltage,Current
1625783610099,high-voltage-4,50,2.82083
time,Hardware,Voltage,Current
1625783610099,high-voltage-4,55,3.129
time,Hardware,Voltage,Current
1625783610099,high-voltage-4,60,3.48558
time,Hardware,Voltage,Current
1625783610099,high-voltage-4,65,3.92741
time,Hardware,Voltage,Current
1625783610099,high-voltage-4,70,4.49341
time,Hardware,Voltage,Current
1625783610099,high-voltage-4,75,5.54121
time,Hardware,Voltage,Current
1625783610099,high-voltage-4,80,9.99978
time,Hardware,Voltage,Current
1625783610099,high-voltage-4,85,9.99976
time,Hardware,Voltage,Current
1625783610099,high-voltage-4,90,9.99969
time,Hardware,Voltage,Current
1625783610099,high-voltage-4,95,9.99975
time,Hardware,Voltage,Current
1625783610099,high-voltage-4,100,9.99977
