{
    "Data": [156.0, 9484.0, 18462.0, 13957.0, 8411.0, 5178.0, 3949.0, 3317.0, 3067.0, 2536.0, 2002.0, 1466.0, 1042.0, 680.0, 469.0, 315.0, 205.0, 164.0, 119.0, 120.0, 100.0, 85.0, 76.0, 49.0, 72.0, 71.0, 56.0, 47.0, 46.0, 50.0, 37.0, 35.0, 36.0, 44.0, 50.0, 31.0, 24.0, 26.0, 23.0, 19.0, 25.0, 19.0, 16.0, 20.0, 6.0, 7.0, 10.0, 8.0, 8.0, 8.0, 3.0],
    "Name": "Chi2Dist-0",
    "Overflow": 0.0,
    "Type": "Histo1d",
    "Underflow": 0.0,
    "x": {
        "AxisTitle": "Fit Chi/ndf",
        "Bins": 51,
        "High": 2.5250000953674318,
        "Low": -0.02500000037252903
    },
    "y": {
        "AxisTitle": "Number of Pixels"
    },
    "z": {
        "AxisTitle": "z"
    }
}