time,Hardware,Voltage,Current
1621538236332,high-voltage-2,1,0.159536
time,Hardware,Voltage,Current
1621538236332,high-voltage-2,2,0.208427
time,Hardware,Voltage,Current
1621538236332,high-voltage-2,3,0.23528
time,Hardware,Voltage,Current
1621538236332,high-voltage-2,4,0.258916
time,Hardware,Voltage,Current
1621538236332,high-voltage-2,5,0.276638
time,Hardware,Voltage,Current
1621538236332,high-voltage-2,6,0.294713
time,Hardware,Voltage,Current
1621538236332,high-voltage-2,7,0.314377
time,Hardware,Voltage,Current
1621538236332,high-voltage-2,8,0.331752
time,Hardware,Voltage,Current
1621538236332,high-voltage-2,9,0.349299
time,Hardware,Voltage,Current
1621538236332,high-voltage-2,10,0.368281
time,Hardware,Voltage,Current
1621538236332,high-voltage-2,11,0.385447
time,Hardware,Voltage,Current
1621538236332,high-voltage-2,12,0.403244
time,Hardware,Voltage,Current
1621538236332,high-voltage-2,13,0.420539
time,Hardware,Voltage,Current
1621538236332,high-voltage-2,14,0.437147
time,Hardware,Voltage,Current
1621538236332,high-voltage-2,15,0.456793
time,Hardware,Voltage,Current
1621538236332,high-voltage-2,16,0.473682
time,Hardware,Voltage,Current
1621538236332,high-voltage-2,17,0.488559
time,Hardware,Voltage,Current
1621538236332,high-voltage-2,18,0.502525
time,Hardware,Voltage,Current
1621538236332,high-voltage-2,19,0.51208
time,Hardware,Voltage,Current
1621538236332,high-voltage-2,20,0.523612
time,Hardware,Voltage,Current
1621538236332,high-voltage-2,25,0.571614
time,Hardware,Voltage,Current
1621538236332,high-voltage-2,30,0.618459
time,Hardware,Voltage,Current
1621538236332,high-voltage-2,35,0.664711
time,Hardware,Voltage,Current
1621538236332,high-voltage-2,40,0.719173
time,Hardware,Voltage,Current
1621538236332,high-voltage-2,45,0.782546
time,Hardware,Voltage,Current
1621538236332,high-voltage-2,50,0.829829
time,Hardware,Voltage,Current
1621538236332,high-voltage-2,55,0.870054
time,Hardware,Voltage,Current
1621538236332,high-voltage-2,60,0.91053
time,Hardware,Voltage,Current
1621538236332,high-voltage-2,65,0.95078
time,Hardware,Voltage,Current
1621538236332,high-voltage-2,70,0.990004
time,Hardware,Voltage,Current
1621538236332,high-voltage-2,75,1.02401
time,Hardware,Voltage,Current
1621538236332,high-voltage-2,80,1.06141
time,Hardware,Voltage,Current
1621538236332,high-voltage-2,85,1.09632
time,Hardware,Voltage,Current
1621538236332,high-voltage-2,90,1.12873
time,Hardware,Voltage,Current
1621538236332,high-voltage-2,95,1.16146
time,Hardware,Voltage,Current
1621538236332,high-voltage-2,100,1.19551
