{
    "Data": [0.0, 0.0, 0.0, 0.0, 0.0, 0.0, 0.0, 0.0, 0.0, 0.0, 0.0, 0.0, 0.0, 0.0, 4.0, 0.0, 0.0, 34.0, 168.0, 45.0, 55.0, 870.0, 1992.0, 694.0, 421.0, 1478.0, 2494.0, 1263.0, 720.0, 1148.0, 1588.0, 1098.0, 580.0, 568.0, 744.0, 690.0, 464.0, 591.0, 882.0, 870.0, 581.0, 987.0, 1964.0, 3017.0, 2129.0, 1505.0, 2410.0, 3581.0, 3941.0, 2826.0, 2207.0, 2673.0, 3202.0, 2513.0, 1950.0, 1819.0, 1780.0, 1997.0, 1585.0, 1375.0, 1203.0, 1198.0, 1057.0, 788.0, 694.0, 639.0, 600.0, 541.0, 484.0, 459.0, 404.0, 393.0, 331.0, 282.0, 259.0, 290.0, 251.0, 209.0, 171.0, 157.0, 153.0, 153.0, 123.0, 103.0, 104.0, 104.0, 84.0, 81.0, 82.0, 64.0, 52.0, 63.0, 49.0, 56.0, 60.0, 58.0, 41.0, 47.0, 35.0, 43.0, 39.0, 42.0, 50.0, 28.0, 33.0, 25.0, 17.0, 24.0, 30.0, 19.0, 14.0, 23.0, 14.0, 12.0, 11.0, 17.0, 9.0, 18.0, 24.0, 23.0, 17.0, 17.0, 16.0, 9.0, 7.0, 9.0, 5.0, 10.0, 10.0, 16.0, 12.0, 10.0, 9.0, 4.0, 9.0, 7.0, 8.0, 6.0, 6.0, 4.0, 4.0, 9.0, 8.0, 4.0, 8.0, 1.0, 6.0, 2.0, 5.0, 5.0, 7.0, 4.0, 3.0, 1.0, 3.0, 6.0, 3.0, 3.0, 3.0, 6.0, 4.0, 4.0, 3.0, 1.0, 3.0, 4.0, 2.0, 1.0, 2.0, 5.0, 5.0, 2.0, 3.0, 2.0, 1.0, 0.0, 3.0, 3.0, 0.0, 2.0, 3.0, 2.0, 1.0, 0.0, 0.0, 0.0, 2.0, 2.0, 3.0, 2.0, 1.0, 3.0, 1.0, 0.0, 2.0, 2.0, 4.0, 2.0, 0.0, 1.0, 3.0],
    "Name": "TimePerFitDist-0",
    "Overflow": 128.0,
    "Type": "Histo1d",
    "Underflow": 0.0,
    "x": {
        "AxisTitle": "Fit Time [us]",
        "Bins": 201,
        "High": 401.0,
        "Low": -1.0
    },
    "y": {
        "AxisTitle": "Number of Pixels"
    },
    "z": {
        "AxisTitle": "z"
    }
}