{
    "Data": [0.0, 0.0, 0.0, 0.0, 0.0, 0.0, 0.0, 0.0, 0.0, 1.0, 0.0, 0.0, 0.0, 5.0, 9.0, 2.0, 1.0, 219.0, 525.0, 152.0, 85.0, 869.0, 2034.0, 1234.0, 535.0, 1605.0, 2309.0, 1523.0, 853.0, 1366.0, 1612.0, 1324.0, 951.0, 856.0, 722.0, 627.0, 486.0, 656.0, 845.0, 840.0, 605.0, 659.0, 1360.0, 2635.0, 2158.0, 1471.0, 1829.0, 3011.0, 3667.0, 3265.0, 2467.0, 2123.0, 2672.0, 2337.0, 1911.0, 1789.0, 1829.0, 1904.0, 1943.0, 1659.0, 1325.0, 1300.0, 1031.0, 830.0, 735.0, 680.0, 655.0, 609.0, 497.0, 457.0, 485.0, 445.0, 373.0, 290.0, 286.0, 311.0, 265.0, 229.0, 201.0, 206.0, 173.0, 176.0, 141.0, 132.0, 132.0, 111.0, 106.0, 84.0, 93.0, 85.0, 79.0, 77.0, 70.0, 57.0, 36.0, 60.0, 40.0, 53.0, 42.0, 43.0, 32.0, 38.0, 33.0, 23.0, 25.0, 19.0, 21.0, 24.0, 22.0, 17.0, 17.0, 20.0, 11.0, 13.0, 15.0, 17.0, 13.0, 14.0, 12.0, 7.0, 9.0, 11.0, 7.0, 8.0, 4.0, 11.0, 6.0, 7.0, 4.0, 7.0, 9.0, 9.0, 3.0, 3.0, 2.0, 6.0, 7.0, 1.0, 3.0, 1.0, 3.0, 2.0, 5.0, 2.0, 3.0, 3.0, 1.0, 3.0, 3.0, 3.0, 2.0, 3.0, 3.0, 2.0, 2.0, 1.0, 0.0, 3.0, 2.0, 1.0, 1.0, 3.0, 2.0, 4.0, 0.0, 1.0, 1.0, 2.0, 0.0, 1.0, 1.0, 0.0, 1.0, 2.0, 0.0, 3.0, 0.0, 0.0, 1.0, 2.0, 2.0, 0.0, 0.0, 0.0, 2.0, 2.0, 0.0, 1.0, 0.0, 0.0, 0.0, 2.0, 2.0, 0.0, 0.0, 0.0, 1.0, 0.0, 0.0, 0.0, 2.0],
    "Name": "TimePerFitDist-0",
    "Overflow": 98.0,
    "Type": "Histo1d",
    "Underflow": 0.0,
    "x": {
        "AxisTitle": "Fit Time [us]",
        "Bins": 201,
        "High": 401.0,
        "Low": -1.0
    },
    "y": {
        "AxisTitle": "Number of Pixels"
    },
    "z": {
        "AxisTitle": "z"
    }
}