{
    "Data": [1304.0, 20213.0, 19935.0, 8605.0, 3872.0, 3202.0, 3186.0, 3320.0, 2976.0, 2427.0, 1807.0, 1240.0, 839.0, 571.0, 395.0, 327.0, 245.0, 179.0, 150.0, 156.0, 116.0, 106.0, 120.0, 84.0, 89.0, 98.0, 82.0, 89.0, 79.0, 75.0, 67.0, 70.0, 53.0, 63.0, 54.0, 57.0, 50.0, 60.0, 42.0, 31.0, 21.0, 17.0, 21.0, 19.0, 17.0, 17.0, 13.0, 16.0, 10.0, 5.0, 3.0],
    "Name": "Chi2Dist-0",
    "Overflow": 0.0,
    "Type": "Histo1d",
    "Underflow": 0.0,
    "x": {
        "AxisTitle": "Fit Chi/ndf",
        "Bins": 51,
        "High": 2.5250000953674318,
        "Low": -0.02500000037252903
    },
    "y": {
        "AxisTitle": "Number of Pixels"
    },
    "z": {
        "AxisTitle": "z"
    }
}