{
    "Data": [0.0, 0.0, 0.0, 0.0, 0.0, 0.0, 0.0, 0.0, 0.0, 1.0, 0.0, 0.0, 0.0, 4.0, 7.0, 0.0, 1.0, 92.0, 453.0, 180.0, 68.0, 710.0, 2653.0, 1850.0, 381.0, 1193.0, 2868.0, 2422.0, 799.0, 898.0, 1579.0, 1676.0, 784.0, 505.0, 622.0, 590.0, 432.0, 696.0, 1186.0, 977.0, 687.0, 1317.0, 2640.0, 3787.0, 2549.0, 1912.0, 2579.0, 3712.0, 3606.0, 3094.0, 2259.0, 2172.0, 2535.0, 1885.0, 1670.0, 1366.0, 1573.0, 1414.0, 1367.0, 1106.0, 856.0, 891.0, 728.0, 658.0, 496.0, 531.0, 526.0, 411.0, 418.0, 339.0, 346.0, 285.0, 266.0, 206.0, 201.0, 217.0, 185.0, 168.0, 142.0, 133.0, 149.0, 120.0, 102.0, 104.0, 83.0, 79.0, 62.0, 85.0, 72.0, 51.0, 50.0, 56.0, 53.0, 42.0, 48.0, 39.0, 44.0, 24.0, 30.0, 23.0, 23.0, 21.0, 20.0, 21.0, 24.0, 22.0, 13.0, 11.0, 8.0, 12.0, 13.0, 17.0, 12.0, 9.0, 11.0, 10.0, 11.0, 5.0, 8.0, 6.0, 9.0, 10.0, 4.0, 10.0, 5.0, 6.0, 5.0, 3.0, 6.0, 9.0, 5.0, 2.0, 5.0, 4.0, 5.0, 1.0, 6.0, 5.0, 4.0, 6.0, 4.0, 1.0, 4.0, 1.0, 3.0, 2.0, 1.0, 0.0, 1.0, 0.0, 2.0, 7.0, 0.0, 0.0, 2.0, 3.0, 0.0, 4.0, 1.0, 1.0, 2.0, 1.0, 1.0, 1.0, 3.0, 0.0, 1.0, 2.0, 1.0, 0.0, 0.0, 0.0, 1.0, 1.0, 0.0, 1.0, 3.0, 1.0, 2.0, 0.0, 3.0, 2.0, 0.0, 1.0, 1.0, 0.0, 0.0, 1.0, 0.0, 0.0, 0.0, 0.0, 1.0, 0.0, 0.0, 0.0, 0.0, 0.0, 0.0, 1.0, 0.0],
    "Name": "TimePerFitDist-0",
    "Overflow": 93.0,
    "Type": "Histo1d",
    "Underflow": 0.0,
    "x": {
        "AxisTitle": "Fit Time [us]",
        "Bins": 201,
        "High": 401.0,
        "Low": -1.0
    },
    "y": {
        "AxisTitle": "Number of Pixels"
    },
    "z": {
        "AxisTitle": "z"
    }
}