time,Hardware,Voltage,Current
1623284147102,high-voltage,1,0.0262682
time,Hardware,Voltage,Current
1623284147102,high-voltage,2,0.0339822
time,Hardware,Voltage,Current
1623284147102,high-voltage,3,0.0395564
time,Hardware,Voltage,Current
1623284147102,high-voltage,4,0.0454451
time,Hardware,Voltage,Current
1623284147102,high-voltage,5,0.050787
time,Hardware,Voltage,Current
1623284147102,high-voltage,6,0.0563877
time,Hardware,Voltage,Current
1623284147102,high-voltage,7,0.0611566
time,Hardware,Voltage,Current
1623284147102,high-voltage,8,0.0668885
time,Hardware,Voltage,Current
1623284147102,high-voltage,9,0.073106
time,Hardware,Voltage,Current
1623284147102,high-voltage,10,0.0764857
time,Hardware,Voltage,Current
1623284147102,high-voltage,11,0.0812046
time,Hardware,Voltage,Current
1623284147102,high-voltage,12,0.0853415
time,Hardware,Voltage,Current
1623284147102,high-voltage,13,0.0879571
time,Hardware,Voltage,Current
1623284147102,high-voltage,14,0.0911538
time,Hardware,Voltage,Current
1623284147102,high-voltage,15,0.0942694
time,Hardware,Voltage,Current
1623284147102,high-voltage,16,0.0958708
time,Hardware,Voltage,Current
1623284147102,high-voltage,17,0.0994911
time,Hardware,Voltage,Current
1623284147102,high-voltage,18,0.101749
time,Hardware,Voltage,Current
1623284147102,high-voltage,19,0.104487
time,Hardware,Voltage,Current
1623284147102,high-voltage,20,0.106508
time,Hardware,Voltage,Current
1623284147102,high-voltage,1.17045e-07,0.117717
time,Hardware,Voltage,Current
1623284147102,high-voltage,30,0.13366
