time,Hardware,Voltage,Current
1622014044964,high-voltage,1,0.173855
time,Hardware,Voltage,Current
1622014044964,high-voltage,2,0.295132
time,Hardware,Voltage,Current
1622014044964,high-voltage,3,0.433062
time,Hardware,Voltage,Current
1622014044964,high-voltage,4,0.565361
time,Hardware,Voltage,Current
1622014044964,high-voltage,5,0.727086
time,Hardware,Voltage,Current
1622014044964,high-voltage,6,0.914764
time,Hardware,Voltage,Current
1622014044964,high-voltage,7,1.15265
time,Hardware,Voltage,Current
1622014044964,high-voltage,8,1.44459
time,Hardware,Voltage,Current
1622014044964,high-voltage,9,1.80255
time,Hardware,Voltage,Current
1622014044964,high-voltage,10,2.23136
time,Hardware,Voltage,Current
1622014044964,high-voltage,11,2.76043
time,Hardware,Voltage,Current
1622014044964,high-voltage,12,3.33842
time,Hardware,Voltage,Current
1622014044964,high-voltage,13,4.11407
time,Hardware,Voltage,Current
1622014044964,high-voltage,14,4.95184
time,Hardware,Voltage,Current
1622014044964,high-voltage,15,5.977
time,Hardware,Voltage,Current
1622014044964,high-voltage,16,6.76886
time,Hardware,Voltage,Current
1622014044964,high-voltage,17,7.93241
time,Hardware,Voltage,Current
1622014044964,high-voltage,18,8.79343
time,Hardware,Voltage,Current
1622014044964,high-voltage,19,9.66354
time,Hardware,Voltage,Current
1622014044964,high-voltage,20,10.0001
