time,Hardware,Voltage,Current
1621992265262,high-voltage,1,0.0642569
time,Hardware,Voltage,Current
1621992265262,high-voltage,2,0.124035
time,Hardware,Voltage,Current
1621992265262,high-voltage,3,0.211443
time,Hardware,Voltage,Current
1621992265262,high-voltage,4,0.346735
time,Hardware,Voltage,Current
1621992265262,high-voltage,5,0.478695
time,Hardware,Voltage,Current
1621992265262,high-voltage,6,0.621528
time,Hardware,Voltage,Current
1621992265262,high-voltage,7,0.889019
time,Hardware,Voltage,Current
1621992265262,high-voltage,8,1.16684
time,Hardware,Voltage,Current
1621992265262,high-voltage,9,1.55419
time,Hardware,Voltage,Current
1621992265262,high-voltage,10,1.9646
time,Hardware,Voltage,Current
1621992265262,high-voltage,11,2.40807
time,Hardware,Voltage,Current
1621992265262,high-voltage,12,3.08472
time,Hardware,Voltage,Current
1621992265262,high-voltage,3.82634e-06,3.80257
time,Hardware,Voltage,Current
1621992265262,high-voltage,14,4.6273
time,Hardware,Voltage,Current
1621992265262,high-voltage,15,5.73278
time,Hardware,Voltage,Current
1621992265262,high-voltage,16,6.91685
time,Hardware,Voltage,Current
1621992265262,high-voltage,17,7.99746
time,Hardware,Voltage,Current
1621992265262,high-voltage,18,9.35376
time,Hardware,Voltage,Current
1621992265262,high-voltage,19,10.0001
