{
    "Data": [0.0, 0.0, 0.0, 0.0, 0.0, 0.0, 0.0, 0.0, 0.0, 0.0, 0.0, 0.0, 0.0, 7.0, 7.0, 1.0, 4.0, 255.0, 533.0, 149.0, 64.0, 847.0, 2075.0, 1372.0, 578.0, 1602.0, 2321.0, 1591.0, 837.0, 1334.0, 1637.0, 1374.0, 921.0, 863.0, 730.0, 606.0, 537.0, 646.0, 846.0, 841.0, 636.0, 760.0, 1382.0, 2625.0, 2109.0, 1519.0, 1863.0, 3002.0, 3575.0, 3227.0, 2616.0, 2203.0, 2708.0, 2182.0, 1927.0, 1804.0, 1839.0, 1902.0, 1922.0, 1625.0, 1227.0, 1263.0, 1025.0, 772.0, 701.0, 717.0, 680.0, 608.0, 505.0, 462.0, 530.0, 461.0, 404.0, 318.0, 301.0, 321.0, 276.0, 237.0, 181.0, 168.0, 191.0, 177.0, 149.0, 123.0, 129.0, 111.0, 100.0, 76.0, 82.0, 101.0, 66.0, 71.0, 56.0, 53.0, 52.0, 53.0, 51.0, 44.0, 44.0, 51.0, 41.0, 34.0, 26.0, 38.0, 31.0, 25.0, 29.0, 27.0, 23.0, 32.0, 16.0, 19.0, 18.0, 13.0, 14.0, 21.0, 15.0, 25.0, 16.0, 16.0, 11.0, 13.0, 12.0, 17.0, 7.0, 13.0, 8.0, 7.0, 7.0, 12.0, 7.0, 10.0, 6.0, 11.0, 5.0, 7.0, 4.0, 11.0, 6.0, 2.0, 4.0, 8.0, 9.0, 3.0, 4.0, 5.0, 4.0, 2.0, 4.0, 6.0, 4.0, 4.0, 4.0, 5.0, 6.0, 2.0, 2.0, 1.0, 2.0, 5.0, 4.0, 4.0, 1.0, 2.0, 2.0, 3.0, 4.0, 0.0, 2.0, 1.0, 0.0, 0.0, 2.0, 1.0, 3.0, 0.0, 2.0, 2.0, 2.0, 2.0, 3.0, 3.0, 1.0, 1.0, 2.0, 2.0, 0.0, 1.0, 2.0, 2.0, 0.0, 0.0, 0.0, 3.0, 0.0, 1.0, 1.0, 3.0, 1.0, 1.0, 2.0],
    "Name": "TimePerFitDist-0",
    "Overflow": 144.0,
    "Type": "Histo1d",
    "Underflow": 0.0,
    "x": {
        "AxisTitle": "Fit Time [us]",
        "Bins": 201,
        "High": 401.0,
        "Low": -1.0
    },
    "y": {
        "AxisTitle": "Number of Pixels"
    },
    "z": {
        "AxisTitle": "z"
    }
}