time,Hardware,Voltage,Current
1621382519383,high-voltage-2,1,0.246348
time,Hardware,Voltage,Current
1621382519383,high-voltage-2,2,0.287954
time,Hardware,Voltage,Current
1621382519383,high-voltage-2,3,0.314716
time,Hardware,Voltage,Current
1621382519383,high-voltage-2,4,0.337387
time,Hardware,Voltage,Current
1621382519383,high-voltage-2,5,0.362417
time,Hardware,Voltage,Current
1621382519383,high-voltage-2,6,0.389538
time,Hardware,Voltage,Current
1621382519383,high-voltage-2,7,0.420615
time,Hardware,Voltage,Current
1621382519383,high-voltage-2,8,0.455195
time,Hardware,Voltage,Current
1621382519383,high-voltage-2,9,0.492855
time,Hardware,Voltage,Current
1621382519383,high-voltage-2,10,0.530787
time,Hardware,Voltage,Current
1621382519383,high-voltage-2,11,0.56862
time,Hardware,Voltage,Current
1621382519383,high-voltage-2,12,0.608947
time,Hardware,Voltage,Current
1621382519383,high-voltage-2,13,0.646865
time,Hardware,Voltage,Current
1621382519383,high-voltage-2,14,0.685158
time,Hardware,Voltage,Current
1621382519383,high-voltage-2,15,0.717938
time,Hardware,Voltage,Current
1621382519383,high-voltage-2,16,0.746596
time,Hardware,Voltage,Current
1621382519383,high-voltage-2,17,0.773552
time,Hardware,Voltage,Current
1621382519383,high-voltage-2,18,0.800517
time,Hardware,Voltage,Current
1621382519383,high-voltage-2,19,0.821252
time,Hardware,Voltage,Current
1621382519383,high-voltage-2,20,0.845076
time,Hardware,Voltage,Current
1621382519383,high-voltage-2,25,0.941468
time,Hardware,Voltage,Current
1621382519383,high-voltage-2,30,1.03365
time,Hardware,Voltage,Current
1621382519383,high-voltage-2,35,1.12423
time,Hardware,Voltage,Current
1621382519383,high-voltage-2,40,1.22338
time,Hardware,Voltage,Current
1621382519383,high-voltage-2,45,1.34956
time,Hardware,Voltage,Current
1621382519383,high-voltage-2,50,1.44129
time,Hardware,Voltage,Current
1621382519383,high-voltage-2,55,1.52214
time,Hardware,Voltage,Current
1621382519383,high-voltage-2,60,1.59971
time,Hardware,Voltage,Current
1621382519383,high-voltage-2,65,1.67295
time,Hardware,Voltage,Current
1621382519383,high-voltage-2,70,1.74434
time,Hardware,Voltage,Current
1621382519383,high-voltage-2,75,1.81281
time,Hardware,Voltage,Current
1621382519383,high-voltage-2,80,1.88316
time,Hardware,Voltage,Current
1621382519383,high-voltage-2,85,1.94734
time,Hardware,Voltage,Current
1621382519383,high-voltage-2,90,2.01228
time,Hardware,Voltage,Current
1621382519383,high-voltage-2,95,2.0736
time,Hardware,Voltage,Current
1621382519383,high-voltage-2,100,2.13596
