time,Hardware,Voltage,Current
1621551667534,high-voltage-2,1,0.167407
time,Hardware,Voltage,Current
1621551667534,high-voltage-2,2,0.224618
time,Hardware,Voltage,Current
1621551667534,high-voltage-2,3,0.260711
time,Hardware,Voltage,Current
1621551667534,high-voltage-2,4,0.284893
time,Hardware,Voltage,Current
1621551667534,high-voltage-2,5,0.3054
time,Hardware,Voltage,Current
1621551667534,high-voltage-2,6,0.324636
time,Hardware,Voltage,Current
1621551667534,high-voltage-2,7,0.341984
time,Hardware,Voltage,Current
1621551667534,high-voltage-2,8,0.35876
time,Hardware,Voltage,Current
1621551667534,high-voltage-2,3.75331e-07,0.374615
time,Hardware,Voltage,Current
1621551667534,high-voltage-2,10,0.391381
time,Hardware,Voltage,Current
1621551667534,high-voltage-2,11,0.406963
time,Hardware,Voltage,Current
1621551667534,high-voltage-2,12,0.421981
time,Hardware,Voltage,Current
1621551667534,high-voltage-2,13,0.438828
time,Hardware,Voltage,Current
1621551667534,high-voltage-2,14,0.452147
time,Hardware,Voltage,Current
1621551667534,high-voltage-2,15,0.464323
time,Hardware,Voltage,Current
1621551667534,high-voltage-2,16,0.47724
time,Hardware,Voltage,Current
1621551667534,high-voltage-2,17,0.487157
time,Hardware,Voltage,Current
1621551667534,high-voltage-2,18,0.494595
time,Hardware,Voltage,Current
1621551667534,high-voltage-2,19,0.504352
time,Hardware,Voltage,Current
1621551667534,high-voltage-2,20,0.514779
time,Hardware,Voltage,Current
1621551667534,high-voltage-2,25,0.559679
time,Hardware,Voltage,Current
1621551667534,high-voltage-2,30,0.601079
time,Hardware,Voltage,Current
1621551667534,high-voltage-2,35,0.645108
time,Hardware,Voltage,Current
1621551667534,high-voltage-2,40,0.695064
time,Hardware,Voltage,Current
1621551667534,high-voltage-2,45,0.761007
time,Hardware,Voltage,Current
1621551667534,high-voltage-2,50,0.807161
time,Hardware,Voltage,Current
1621551667534,high-voltage-2,55,0.84865
time,Hardware,Voltage,Current
1621551667534,high-voltage-2,60,0.88652
time,Hardware,Voltage,Current
1621551667534,high-voltage-2,65,0.92201
time,Hardware,Voltage,Current
1621551667534,high-voltage-2,70,0.960725
time,Hardware,Voltage,Current
1621551667534,high-voltage-2,75,0.995583
time,Hardware,Voltage,Current
1621551667534,high-voltage-2,80,1.03017
time,Hardware,Voltage,Current
1621551667534,high-voltage-2,85,1.0637
time,Hardware,Voltage,Current
1621551667534,high-voltage-2,90,1.09509
time,Hardware,Voltage,Current
1621551667534,high-voltage-2,95,1.13034
time,Hardware,Voltage,Current
1621551667534,high-voltage-2,100,1.16118
