{
    "Data": [0.0, 0.0, 0.0, 0.0, 0.0, 0.0, 0.0, 0.0, 0.0, 0.0, 0.0, 0.0, 0.0, 0.0, 0.0, 0.0, 0.0, 0.0, 0.0, 0.0, 1.0, 0.0, 7.0, 4.0, 4.0, 11.0, 2.0, 31.0, 37.0, 43.0, 41.0, 25.0, 49.0, 30.0, 36.0, 48.0, 50.0, 50.0, 15.0, 5.0, 50.0, 50.0, 50.0, 50.0, 50.0, 50.0, 7.0, 50.0, 50.0, 43.0, 50.0],
    "Name": "Scurve-10-96",
    "Overflow": 0.0,
    "Type": "Histo1d",
    "Underflow": 0.0,
    "x": {
        "AxisTitle": "Vcal",
        "Bins": 51,
        "High": 302.5,
        "Low": 47.5
    },
    "y": {
        "AxisTitle": "Occupancy"
    },
    "z": {
        "AxisTitle": "z"
    }
}