time,Hardware,Voltage,Current
1621274031580,high-voltage-3,1,0.111011
time,Hardware,Voltage,Current
1621274031580,high-voltage-3,2,0.116691
time,Hardware,Voltage,Current
1621274031580,high-voltage-3,3,0.12152
time,Hardware,Voltage,Current
1621274031580,high-voltage-3,4,0.12714
time,Hardware,Voltage,Current
1621274031580,high-voltage-3,5,0.131521
time,Hardware,Voltage,Current
1621274031580,high-voltage-3,6,0.134248
time,Hardware,Voltage,Current
1621274031580,high-voltage-3,7,0.139569
time,Hardware,Voltage,Current
1621274031580,high-voltage-3,8,0.141521
time,Hardware,Voltage,Current
1621274031580,high-voltage-3,9,0.144831
time,Hardware,Voltage,Current
1621274031580,high-voltage-3,10,0.148401
time,Hardware,Voltage,Current
1621274031580,high-voltage-3,11,0.152008
time,Hardware,Voltage,Current
1621274031580,high-voltage-3,12,0.157422
time,Hardware,Voltage,Current
1621274031580,high-voltage-3,13,0.16184
time,Hardware,Voltage,Current
1621274031580,high-voltage-3,14,0.165005
time,Hardware,Voltage,Current
1621274031580,high-voltage-3,15,0.168429
time,Hardware,Voltage,Current
1621274031580,high-voltage-3,16,0.171085
time,Hardware,Voltage,Current
1621274031580,high-voltage-3,17,0.174925
time,Hardware,Voltage,Current
1621274031580,high-voltage-3,18,0.178716
time,Hardware,Voltage,Current
1621274031580,high-voltage-3,19,0.181511
time,Hardware,Voltage,Current
1621274031580,high-voltage-3,20,0.183256
time,Hardware,Voltage,Current
1621274031580,high-voltage-3,25,0.198061
time,Hardware,Voltage,Current
1621274031580,high-voltage-3,30,0.21141
time,Hardware,Voltage,Current
1621274031580,high-voltage-3,35,0.22395
time,Hardware,Voltage,Current
1621274031580,high-voltage-3,40,0.233921
time,Hardware,Voltage,Current
1621274031580,high-voltage-3,45,0.243914
time,Hardware,Voltage,Current
1621274031580,high-voltage-3,50,0.25282
time,Hardware,Voltage,Current
1621274031580,high-voltage-3,55,0.261959
time,Hardware,Voltage,Current
1621274031580,high-voltage-3,60,0.272274
time,Hardware,Voltage,Current
1621274031580,high-voltage-3,65,0.282604
time,Hardware,Voltage,Current
1621274031580,high-voltage-3,70,0.292855
time,Hardware,Voltage,Current
1621274031580,high-voltage-3,75,0.302683
time,Hardware,Voltage,Current
1621274031580,high-voltage-3,80,0.314664
time,Hardware,Voltage,Current
1621274031580,high-voltage-3,85,0.327887
time,Hardware,Voltage,Current
1621274031580,high-voltage-3,90,0.339353
time,Hardware,Voltage,Current
1621274031580,high-voltage-3,95,0.348655
time,Hardware,Voltage,Current
1621274031580,high-voltage-3,100,0.361787
