{
    "Data": [16.0, 29.0, 1.0, 0.0, 1.0, 11.0, 81.0, 242.0, 687.0, 1649.0, 3159.0, 4436.0, 5095.0, 4593.0, 3772.0, 3789.0, 4308.0, 4975.0, 4834.0, 3909.0, 2609.0, 1544.0, 797.0, 402.0, 205.0, 96.0, 62.0, 41.0, 37.0, 22.0, 18.0],
    "Name": "NoiseDist-0",
    "Overflow": 99.0,
    "Type": "Histo1d",
    "Underflow": 0.0,
    "x": {
        "AxisTitle": "Noise [e]",
        "Bins": 31,
        "High": 156.0,
        "Low": -2.0
    },
    "y": {
        "AxisTitle": "Number of Pixels"
    },
    "z": {
        "AxisTitle": "z"
    }
}