{
    "Data": [0.0, 0.0, 0.0, 0.0, 0.0, 0.0, 0.0, 0.0, 0.0, 0.0, 0.0, 0.0, 0.0, 0.0, 0.0, 0.0, 0.0, 0.0, 0.0, 0.0, 0.0, 0.0, 0.0, 0.0, 0.0, 0.0, 0.0, 0.0, 0.0, 0.0, 0.0, 0.0, 0.0, 0.0, 0.0, 0.0, 0.0, 0.0, 0.0, 0.0, 0.0, 0.0, 0.0, 0.0, 0.0, 0.0, 0.0, 0.0, 0.0, 0.0, 2.0, 9.0, 11.0, 15.0, 8.0, 7.0, 13.0, 8.0, 13.0, 15.0, 17.0, 17.0, 30.0, 28.0, 44.0, 42.0, 77.0, 83.0, 106.0, 107.0, 162.0, 193.0, 238.0, 230.0, 333.0, 412.0, 516.0, 569.0, 697.0, 735.0, 861.0, 943.0, 1027.0, 1099.0, 1124.0, 1164.0, 1311.0, 1297.0, 1440.0, 1528.0, 1829.0, 2379.0, 2923.0, 3373.0, 3976.0, 4274.0, 3960.0, 3412.0, 2687.0, 1943.0, 1279.0, 873.0, 585.0, 408.0, 260.0, 182.0, 157.0, 105.0, 100.0, 72.0, 71.0, 51.0, 43.0, 47.0, 34.0, 36.0, 24.0, 18.0, 26.0, 27.0, 32.0, 24.0, 26.0, 17.0, 6.0, 13.0, 20.0, 16.0, 8.0, 17.0, 11.0, 11.0, 9.0, 9.0, 15.0, 13.0, 8.0, 10.0, 9.0, 6.0, 8.0, 8.0, 9.0, 4.0, 11.0, 10.0, 6.0, 6.0, 9.0, 7.0, 16.0, 13.0, 21.0, 18.0, 23.0, 16.0, 36.0, 50.0, 55.0, 83.0, 76.0, 91.0, 124.0, 168.0, 196.0, 202.0, 230.0, 302.0, 327.0, 387.0, 403.0, 453.0, 544.0, 573.0, 628.0, 652.0, 701.0, 743.0, 751.0, 804.0, 784.0, 792.0, 749.0, 764.0, 832.0, 776.0, 732.0, 726.0, 663.0, 646.0, 578.0, 598.0, 522.0, 509.0, 480.0, 385.0, 350.0, 301.0, 289.0, 226.0, 214.0, 200.0, 158.0, 153.0, 133.0, 103.0, 88.0, 89.0, 80.0, 48.0, 51.0, 49.0, 43.0, 28.0, 37.0, 45.0, 30.0, 23.0, 26.0, 15.0, 24.0, 12.0, 12.0, 11.0, 17.0, 12.0, 11.0, 9.0, 11.0, 10.0, 9.0, 10.0, 9.0, 7.0, 5.0, 7.0, 8.0, 6.0, 1.0, 3.0, 2.0, 3.0, 4.0, 2.0, 4.0, 3.0, 0.0, 1.0, 2.0, 0.0, 0.0, 0.0, 1.0, 1.0, 1.0, 1.0, 1.0, 1.0, 0.0, 4.0, 1.0, 2.0, 1.0, 2.0, 0.0, 0.0, 1.0, 0.0, 0.0, 0.0, 0.0, 0.0, 1.0, 0.0, 0.0, 0.0, 0.0, 0.0, 1.0, 0.0, 1.0, 0.0, 0.0, 0.0, 0.0, 0.0, 0.0, 0.0, 1.0, 0.0, 0.0, 0.0, 0.0, 0.0, 0.0, 0.0, 1.0, 0.0, 0.0, 1.0, 0.0, 0.0, 0.0, 0.0, 0.0, 0.0, 0.0, 0.0, 0.0, 1.0, 0.0, 0.0, 0.0, 0.0, 1.0, 0.0, 0.0, 0.0, 0.0, 0.0, 0.0, 1.0, 0.0, 0.0, 0.0, 0.0, 0.0, 0.0, 0.0, 0.0, 0.0, 0.0, 0.0, 0.0, 0.0],
    "Name": "ThresholdDist-0",
    "Overflow": 0.0,
    "Type": "Histo1d",
    "Underflow": 0.0,
    "x": {
        "AxisTitle": "Threshold [e]",
        "Bins": 335,
        "High": 3345.0,
        "Low": -5.0
    },
    "y": {
        "AxisTitle": "Number of Pixels"
    },
    "z": {
        "AxisTitle": "z"
    }
}