time,Hardware,Voltage,Current
1625776500583,high-voltage-4,1,0.421797
time,Hardware,Voltage,Current
1625776500583,high-voltage-4,2,0.57756
time,Hardware,Voltage,Current
1625776500583,high-voltage-4,3,0.674697
time,Hardware,Voltage,Current
1625776500583,high-voltage-4,4,0.741287
time,Hardware,Voltage,Current
1625776500583,high-voltage-4,5,0.787903
time,Hardware,Voltage,Current
1625776500583,high-voltage-4,6,0.852046
time,Hardware,Voltage,Current
1625776500583,high-voltage-4,7,0.859013
time,Hardware,Voltage,Current
1625776500583,high-voltage-4,8,0.929651
time,Hardware,Voltage,Current
1625776500583,high-voltage-4,9,0.93267
time,Hardware,Voltage,Current
1625776500583,high-voltage-4,10,1.01037
time,Hardware,Voltage,Current
1625776500583,high-voltage-4,11,1.01108
time,Hardware,Voltage,Current
1625776500583,high-voltage-4,12,1.05419
time,Hardware,Voltage,Current
1625776500583,high-voltage-4,13,1.09934
time,Hardware,Voltage,Current
1625776500583,high-voltage-4,14,1.1484
time,Hardware,Voltage,Current
1625776500583,high-voltage-4,15,1.19884
time,Hardware,Voltage,Current
1625776500583,high-voltage-4,16,1.24983
time,Hardware,Voltage,Current
1625776500583,high-voltage-4,17,1.30234
time,Hardware,Voltage,Current
1625776500583,high-voltage-4,18,1.35702
time,Hardware,Voltage,Current
1625776500583,high-voltage-4,19,1.4132
time,Hardware,Voltage,Current
1625776500583,high-voltage-4,20,1.47364
time,Hardware,Voltage,Current
1625776500583,high-voltage-4,25,1.74976
time,Hardware,Voltage,Current
1625776500583,high-voltage-4,30,1.96508
time,Hardware,Voltage,Current
1625776500583,high-voltage-4,35,2.17666
time,Hardware,Voltage,Current
1625776500583,high-voltage-4,40,2.40174
time,Hardware,Voltage,Current
1625776500583,high-voltage-4,45,2.63946
time,Hardware,Voltage,Current
1625776500583,high-voltage-4,50,2.91726
time,Hardware,Voltage,Current
1625776500583,high-voltage-4,55,3.23318
time,Hardware,Voltage,Current
1625776500583,high-voltage-4,60,3.61237
time,Hardware,Voltage,Current
1625776500583,high-voltage-4,65,4.08294
time,Hardware,Voltage,Current
1625776500583,high-voltage-4,70,4.76017
time,Hardware,Voltage,Current
1625776500583,high-voltage-4,75,7.04373
time,Hardware,Voltage,Current
1625776500583,high-voltage-4,80,9.99974
time,Hardware,Voltage,Current
1625776500583,high-voltage-4,85,9.99971
time,Hardware,Voltage,Current
1625776500583,high-voltage-4,90,9.99972
time,Hardware,Voltage,Current
1625776500583,high-voltage-4,95,9.99973
time,Hardware,Voltage,Current
1625776500583,high-voltage-4,100,9.99975
