{
    "Data": [5.0, 5.0, 0.0, 1.0, 7.0, 8.0, 13.0, 32.0, 106.0, 313.0, 750.0, 1680.0, 2875.0, 4067.0, 4549.0, 4309.0, 3393.0, 2671.0, 2412.0, 2855.0, 3466.0, 4206.0, 4589.0, 4676.0, 4076.0, 3242.0, 2504.0, 1892.0, 1513.0, 1329.0, 1174.0, 1087.0, 1030.0, 1022.0, 981.0, 973.0, 1003.0, 867.0, 883.0, 807.0, 764.0, 655.0, 584.0, 475.0, 451.0, 365.0, 251.0, 249.0, 188.0, 135.0, 113.0, 112.0, 83.0, 63.0, 60.0, 49.0, 38.0, 38.0, 23.0, 19.0, 19.0, 17.0, 15.0, 10.0, 15.0, 12.0, 11.0, 6.0, 8.0],
    "Name": "NoiseDist-0",
    "Overflow": 99.0,
    "Type": "Histo1d",
    "Underflow": 0.0,
    "x": {
        "AxisTitle": "Noise [e]",
        "Bins": 69,
        "High": 346.0,
        "Low": -2.0
    },
    "y": {
        "AxisTitle": "Number of Pixels"
    },
    "z": {
        "AxisTitle": "z"
    }
}