{
    "Data": [0.0, 0.0, 0.0, 0.0, 0.0, 0.0, 0.0, 0.0, 0.0, 0.0, 0.0, 0.0, 0.0, 0.0, 0.0, 0.0, 0.0, 0.0, 0.0, 0.0, 0.0, 0.0, 0.0, 0.0, 0.0, 0.0, 0.0, 0.0, 0.0, 0.0, 0.0, 0.0, 0.0, 0.0, 0.0, 0.0, 0.0, 0.0, 0.0, 0.0, 0.0, 0.0, 0.0, 0.0, 0.0, 0.0, 0.0, 0.0, 0.0, 0.0, 3.0, 4.0, 8.0, 7.0, 11.0, 9.0, 8.0, 5.0, 12.0, 16.0, 29.0, 21.0, 9.0, 16.0, 18.0, 6.0, 6.0, 4.0, 7.0, 13.0, 10.0, 14.0, 23.0, 29.0, 33.0, 27.0, 52.0, 57.0, 92.0, 99.0, 122.0, 159.0, 206.0, 240.0, 288.0, 367.0, 421.0, 532.0, 660.0, 1064.0, 1778.0, 2690.0, 3982.0, 4692.0, 5370.0, 5594.0, 5157.0, 4363.0, 3336.0, 2489.0, 1805.0, 1299.0, 911.0, 730.0, 519.0, 426.0, 333.0, 272.0, 174.0, 187.0, 136.0, 103.0, 60.0, 66.0, 57.0, 39.0, 43.0, 48.0, 28.0, 29.0, 31.0, 37.0, 43.0, 30.0, 37.0, 22.0, 31.0, 28.0, 22.0, 26.0, 17.0, 21.0, 18.0, 25.0, 20.0, 21.0, 16.0, 12.0, 17.0, 15.0, 12.0, 11.0, 10.0, 2.0, 11.0, 11.0, 11.0, 7.0, 10.0, 7.0, 8.0, 3.0, 9.0, 6.0, 5.0, 5.0, 5.0, 6.0, 6.0, 7.0, 11.0, 8.0, 9.0, 12.0, 14.0, 19.0, 17.0, 34.0, 29.0, 33.0, 43.0, 56.0, 57.0, 66.0, 94.0, 113.0, 113.0, 141.0, 170.0, 176.0, 219.0, 213.0, 248.0, 308.0, 296.0, 391.0, 418.0, 452.0, 441.0, 516.0, 577.0, 551.0, 588.0, 653.0, 659.0, 682.0, 627.0, 720.0, 764.0, 692.0, 721.0, 734.0, 738.0, 718.0, 731.0, 702.0, 672.0, 634.0, 636.0, 574.0, 578.0, 552.0, 488.0, 460.0, 445.0, 432.0, 362.0, 349.0, 292.0, 269.0, 258.0, 261.0, 226.0, 180.0, 161.0, 141.0, 134.0, 115.0, 94.0, 75.0, 86.0, 68.0, 58.0, 50.0, 44.0, 33.0, 29.0, 32.0, 23.0, 25.0, 20.0, 19.0, 21.0, 11.0, 6.0, 10.0, 4.0, 8.0, 6.0, 4.0, 6.0, 2.0, 3.0, 4.0, 3.0, 0.0, 3.0, 1.0, 1.0, 0.0, 0.0, 1.0, 0.0, 0.0, 0.0, 0.0, 0.0, 0.0, 0.0, 0.0, 1.0, 0.0, 0.0, 0.0, 0.0, 0.0, 0.0, 0.0, 0.0, 0.0, 0.0, 0.0, 0.0, 0.0, 0.0, 0.0, 0.0, 0.0, 0.0, 0.0, 0.0, 0.0, 0.0, 0.0, 0.0, 0.0, 0.0, 0.0, 0.0, 0.0, 0.0, 0.0, 0.0, 0.0, 0.0, 0.0, 0.0, 0.0, 0.0, 0.0, 0.0, 0.0, 0.0, 0.0, 0.0, 0.0, 0.0, 0.0, 0.0, 0.0, 0.0, 0.0, 0.0, 0.0, 0.0, 0.0, 0.0, 0.0, 0.0, 0.0, 0.0, 0.0, 0.0, 0.0, 0.0, 0.0, 0.0, 0.0, 0.0, 0.0, 0.0, 0.0, 0.0, 0.0, 0.0, 0.0, 0.0, 0.0, 0.0, 0.0, 0.0, 0.0, 0.0, 0.0, 0.0, 0.0, 0.0, 0.0, 0.0, 0.0, 0.0, 0.0, 0.0, 0.0, 0.0, 0.0, 0.0, 0.0, 0.0, 0.0, 0.0, 0.0, 0.0, 0.0, 0.0, 0.0, 0.0, 0.0, 0.0, 0.0],
    "Name": "ThresholdDist-0",
    "Overflow": 0.0,
    "Type": "Histo1d",
    "Underflow": 0.0,
    "x": {
        "AxisTitle": "Threshold [e]",
        "Bins": 380,
        "High": 3795.0,
        "Low": -5.0
    },
    "y": {
        "AxisTitle": "Number of Pixels"
    },
    "z": {
        "AxisTitle": "z"
    }
}