{
    "Data": [0.0, 0.0, 0.0, 0.0, 0.0, 0.0, 0.0, 0.0, 0.0, 0.0, 0.0, 0.0, 0.0, 7.0, 8.0, 1.0, 4.0, 170.0, 459.0, 137.0, 75.0, 898.0, 2638.0, 1399.0, 510.0, 1535.0, 2683.0, 1723.0, 786.0, 1243.0, 1799.0, 1394.0, 781.0, 651.0, 697.0, 580.0, 541.0, 950.0, 1369.0, 1042.0, 608.0, 1483.0, 2778.0, 3521.0, 2473.0, 1892.0, 2627.0, 3970.0, 3445.0, 2976.0, 2181.0, 2099.0, 2471.0, 1832.0, 1619.0, 1417.0, 1554.0, 1440.0, 1456.0, 1058.0, 907.0, 906.0, 699.0, 608.0, 499.0, 563.0, 492.0, 380.0, 340.0, 334.0, 371.0, 285.0, 264.0, 247.0, 213.0, 202.0, 180.0, 170.0, 152.0, 163.0, 140.0, 134.0, 104.0, 62.0, 97.0, 77.0, 74.0, 67.0, 57.0, 48.0, 50.0, 47.0, 29.0, 52.0, 33.0, 38.0, 34.0, 39.0, 22.0, 20.0, 20.0, 24.0, 17.0, 25.0, 20.0, 21.0, 15.0, 14.0, 13.0, 13.0, 11.0, 7.0, 8.0, 13.0, 6.0, 8.0, 5.0, 9.0, 12.0, 11.0, 7.0, 10.0, 10.0, 8.0, 6.0, 3.0, 7.0, 6.0, 3.0, 4.0, 5.0, 3.0, 7.0, 4.0, 6.0, 12.0, 2.0, 6.0, 5.0, 6.0, 4.0, 4.0, 6.0, 5.0, 1.0, 0.0, 2.0, 2.0, 5.0, 3.0, 1.0, 2.0, 6.0, 5.0, 1.0, 2.0, 3.0, 0.0, 2.0, 2.0, 4.0, 0.0, 4.0, 2.0, 1.0, 3.0, 1.0, 1.0, 4.0, 0.0, 2.0, 1.0, 1.0, 2.0, 1.0, 3.0, 1.0, 0.0, 2.0, 3.0, 1.0, 0.0, 3.0, 1.0, 0.0, 0.0, 2.0, 1.0, 0.0, 1.0, 1.0, 0.0, 0.0, 2.0, 0.0, 0.0, 0.0, 0.0, 2.0, 1.0, 1.0],
    "Name": "TimePerFitDist-0",
    "Overflow": 93.0,
    "Type": "Histo1d",
    "Underflow": 0.0,
    "x": {
        "AxisTitle": "Fit Time [us]",
        "Bins": 201,
        "High": 401.0,
        "Low": -1.0
    },
    "y": {
        "AxisTitle": "Number of Pixels"
    },
    "z": {
        "AxisTitle": "z"
    }
}