time,Hardware,Voltage,Current
1623266233074,high-voltage-2,1,0.161301
time,Hardware,Voltage,Current
1623266233074,high-voltage-2,2,0.204163
time,Hardware,Voltage,Current
1623266233074,high-voltage-2,3,0.233259
time,Hardware,Voltage,Current
1623266233074,high-voltage-2,4,0.259004
time,Hardware,Voltage,Current
1623266233074,high-voltage-2,5,0.276335
time,Hardware,Voltage,Current
1623266233074,high-voltage-2,6,0.29114
time,Hardware,Voltage,Current
1623266233074,high-voltage-2,7,0.302634
time,Hardware,Voltage,Current
1623266233074,high-voltage-2,8,0.314997
time,Hardware,Voltage,Current
1623266233074,high-voltage-2,9,0.328316
time,Hardware,Voltage,Current
1623266233074,high-voltage-2,10,0.337861
time,Hardware,Voltage,Current
1623266233074,high-voltage-2,11,0.352061
time,Hardware,Voltage,Current
1623266233074,high-voltage-2,12,0.363791
time,Hardware,Voltage,Current
1623266233074,high-voltage-2,13,0.371193
time,Hardware,Voltage,Current
1623266233074,high-voltage-2,14,0.384655
time,Hardware,Voltage,Current
1623266233074,high-voltage-2,15,0.395571
time,Hardware,Voltage,Current
1623266233074,high-voltage-2,16,0.403905
time,Hardware,Voltage,Current
1623266233074,high-voltage-2,17,0.41463
time,Hardware,Voltage,Current
1623266233074,high-voltage-2,18,0.427289
time,Hardware,Voltage,Current
1623266233074,high-voltage-2,19,0.43785
time,Hardware,Voltage,Current
1623266233074,high-voltage-2,20,0.447772
time,Hardware,Voltage,Current
1623266233074,high-voltage-2,25,0.489686
time,Hardware,Voltage,Current
1623266233074,high-voltage-2,30,0.53808
time,Hardware,Voltage,Current
1623266233074,high-voltage-2,35,0.587899
time,Hardware,Voltage,Current
1623266233074,high-voltage-2,40,0.641913
time,Hardware,Voltage,Current
1623266233074,high-voltage-2,45,0.707421
time,Hardware,Voltage,Current
1623266233074,high-voltage-2,50,0.752654
time,Hardware,Voltage,Current
1623266233074,high-voltage-2,55,0.794141
time,Hardware,Voltage,Current
1623266233074,high-voltage-2,60,0.838825
time,Hardware,Voltage,Current
1623266233074,high-voltage-2,65,0.881761
time,Hardware,Voltage,Current
1623266233074,high-voltage-2,70,0.923857
time,Hardware,Voltage,Current
1623266233074,high-voltage-2,75,0.969148
time,Hardware,Voltage,Current
1623266233074,high-voltage-2,80,8e+07
time,Hardware,Voltage,Current
1623266233074,high-voltage-2,85,1.05752
time,Hardware,Voltage,Current
1623266233074,high-voltage-2,90,1.0955
time,Hardware,Voltage,Current
1623266233074,high-voltage-2,95,1.13053
time,Hardware,Voltage,Current
1623266233074,high-voltage-2,100,1.16593
