{
    "Data": [[1345.0, 419.0, 188.0, 111.0, 66.0, 55.0, 46.0, 40.0, 34.0, 35.0, 21.0, 12.0, 19.0, 16.0, 9.0, 20.0, 9.0, 14.0, 16.0, 11.0, 8.0, 9.0, 9.0, 6.0, 10.0, 8.0, 6.0, 4.0, 6.0, 7.0, 3.0, 5.0, 8.0, 3.0, 7.0, 6.0, 3.0, 4.0, 3.0, 6.0, 5.0, 7.0, 3.0, 6.0, 3.0, 7.0, 9.0, 16.0, 23.0], [2462.0, 847.0, 454.0, 304.0, 202.0, 141.0, 122.0, 79.0, 68.0, 44.0, 40.0, 41.0, 46.0, 35.0, 28.0, 18.0, 22.0, 21.0, 16.0, 15.0, 14.0, 22.0, 11.0, 16.0, 9.0, 9.0, 7.0, 13.0, 8.0, 15.0, 13.0, 8.0, 11.0, 10.0, 9.0, 6.0, 10.0, 10.0, 9.0, 7.0, 6.0, 10.0, 4.0, 9.0, 11.0, 6.0, 12.0, 17.0, 21.0], [3727.0, 1666.0, 976.0, 656.0, 492.0, 315.0, 240.0, 180.0, 170.0, 142.0, 132.0, 98.0, 72.0, 68.0, 67.0, 55.0, 50.0, 46.0, 35.0, 33.0, 28.0, 31.0, 29.0, 27.0, 21.0, 30.0, 15.0, 21.0, 19.0, 16.0, 19.0, 20.0, 17.0, 14.0, 19.0, 11.0, 13.0, 11.0, 18.0, 13.0, 11.0, 13.0, 13.0, 14.0, 11.0, 12.0, 17.0, 20.0, 18.0], [4222.0, 2389.0, 1613.0, 1117.0, 881.0, 652.0, 567.0, 426.0, 360.0, 318.0, 253.0, 221.0, 220.0, 175.0, 144.0, 135.0, 103.0, 109.0, 108.0, 91.0, 85.0, 71.0, 65.0, 63.0, 54.0, 54.0, 60.0, 40.0, 31.0, 31.0, 36.0, 43.0, 44.0, 23.0, 24.0, 25.0, 24.0, 31.0, 24.0, 28.0, 25.0, 21.0, 19.0, 23.0, 32.0, 25.0, 29.0, 25.0, 33.0], [4447.0, 2499.0, 1866.0, 1399.0, 1202.0, 1069.0, 899.0, 761.0, 705.0, 590.0, 524.0, 487.0, 397.0, 360.0, 330.0, 306.0, 303.0, 232.0, 214.0, 207.0, 188.0, 175.0, 143.0, 167.0, 163.0, 130.0, 113.0, 106.0, 110.0, 102.0, 76.0, 71.0, 84.0, 70.0, 65.0, 70.0, 58.0, 61.0, 43.0, 46.0, 55.0, 53.0, 54.0, 33.0, 39.0, 44.0, 53.0, 60.0, 59.0], [7190.0, 3460.0, 2094.0, 1628.0, 1228.0, 1129.0, 1011.0, 903.0, 876.0, 783.0, 761.0, 658.0, 632.0, 587.0, 561.0, 526.0, 480.0, 470.0, 466.0, 400.0, 382.0, 389.0, 331.0, 328.0, 279.0, 269.0, 252.0, 248.0, 253.0, 222.0, 205.0, 213.0, 189.0, 178.0, 145.0, 153.0, 149.0, 141.0, 130.0, 137.0, 100.0, 139.0, 102.0, 113.0, 101.0, 112.0, 79.0, 111.0, 117.0], [5458.0, 4710.0, 3888.0, 3183.0, 2527.0, 2101.0, 1718.0, 1536.0, 1303.0, 1178.0, 1001.0, 908.0, 833.0, 782.0, 713.0, 670.0, 635.0, 664.0, 600.0, 557.0, 551.0, 523.0, 540.0, 541.0, 484.0, 474.0, 479.0, 488.0, 435.0, 430.0, 412.0, 390.0, 392.0, 371.0, 376.0, 353.0, 328.0, 327.0, 316.0, 280.0, 283.0, 277.0, 266.0, 275.0, 253.0, 233.0, 261.0, 234.0, 248.0], [976.0, 1162.0, 1438.0, 1575.0, 1614.0, 1665.0, 1848.0, 1889.0, 1827.0, 1726.0, 1751.0, 1682.0, 1578.0, 1592.0, 1587.0, 1422.0, 1401.0, 1288.0, 1215.0, 1189.0, 1126.0, 1073.0, 936.0, 964.0, 860.0, 755.0, 720.0, 706.0, 665.0, 714.0, 631.0, 679.0, 629.0, 546.0, 640.0, 595.0, 591.0, 576.0, 590.0, 586.0, 529.0, 571.0, 551.0, 565.0, 583.0, 553.0, 549.0, 539.0, 671.0], [241.0, 195.0, 224.0, 207.0, 266.0, 319.0, 357.0, 398.0, 476.0, 533.0, 552.0, 638.0, 663.0, 753.0, 759.0, 879.0, 909.0, 988.0, 1018.0, 1090.0, 1188.0, 1249.0, 1244.0, 1335.0, 1294.0, 1354.0, 1411.0, 1469.0, 1408.0, 1465.0, 1416.0, 1515.0, 1478.0, 1408.0, 1444.0, 1379.0, 1310.0, 1295.0, 1211.0, 1265.0, 1218.0, 1157.0, 1104.0, 1149.0, 1136.0, 1126.0, 1217.0, 1271.0, 1432.0], [153.0, 99.0, 75.0, 67.0, 67.0, 78.0, 99.0, 75.0, 75.0, 105.0, 120.0, 116.0, 147.0, 143.0, 164.0, 191.0, 177.0, 231.0, 242.0, 271.0, 302.0, 357.0, 359.0, 393.0, 433.0, 474.0, 541.0, 592.0, 681.0, 751.0, 763.0, 890.0, 987.0, 1093.0, 1196.0, 1339.0, 1479.0, 1606.0, 1765.0, 1982.0, 2110.0, 2263.0, 2437.0, 2748.0, 2852.0, 2991.0, 3148.0, 3351.0, 3588.0], [112.0, 79.0, 42.0, 48.0, 33.0, 28.0, 33.0, 31.0, 33.0, 32.0, 37.0, 50.0, 44.0, 57.0, 40.0, 66.0, 49.0, 65.0, 61.0, 77.0, 97.0, 81.0, 87.0, 107.0, 96.0, 143.0, 147.0, 152.0, 146.0, 211.0, 216.0, 248.0, 273.0, 303.0, 381.0, 404.0, 508.0, 575.0, 688.0, 708.0, 920.0, 1186.0, 1440.0, 1741.0, 2247.0, 2980.0, 4075.0, 5776.0, 8733.0], [103.0, 64.0, 33.0, 28.0, 22.0, 24.0, 26.0, 24.0, 20.0, 18.0, 22.0, 10.0, 34.0, 17.0, 21.0, 20.0, 28.0, 33.0, 27.0, 24.0, 22.0, 25.0, 39.0, 38.0, 40.0, 32.0, 45.0, 64.0, 55.0, 71.0, 78.0, 90.0, 83.0, 99.0, 114.0, 125.0, 168.0, 201.0, 240.0, 269.0, 342.0, 438.0, 522.0, 643.0, 919.0, 1218.0, 1972.0, 3493.0, 7820.0], [84.0, 66.0, 27.0, 31.0, 22.0, 16.0, 16.0, 17.0, 13.0, 13.0, 14.0, 25.0, 14.0, 11.0, 15.0, 14.0, 14.0, 15.0, 13.0, 20.0, 5.0, 17.0, 20.0, 13.0, 14.0, 17.0, 21.0, 26.0, 30.0, 20.0, 34.0, 39.0, 38.0, 32.0, 44.0, 54.0, 46.0, 69.0, 79.0, 101.0, 107.0, 156.0, 190.0, 277.0, 346.0, 529.0, 829.0, 1579.0, 4156.0], [89.0, 48.0, 41.0, 19.0, 19.0, 17.0, 12.0, 12.0, 7.0, 8.0, 12.0, 12.0, 12.0, 14.0, 12.0, 10.0, 9.0, 5.0, 9.0, 7.0, 14.0, 13.0, 13.0, 13.0, 13.0, 10.0, 12.0, 22.0, 16.0, 12.0, 14.0, 16.0, 18.0, 18.0, 20.0, 27.0, 23.0, 25.0, 32.0, 35.0, 47.0, 53.0, 68.0, 113.0, 139.0, 199.0, 342.0, 669.0, 2141.0], [82.0, 33.0, 28.0, 31.0, 11.0, 18.0, 10.0, 8.0, 10.0, 10.0, 12.0, 9.0, 15.0, 8.0, 10.0, 11.0, 6.0, 6.0, 8.0, 8.0, 9.0, 9.0, 4.0, 4.0, 8.0, 13.0, 9.0, 4.0, 14.0, 14.0, 12.0, 8.0, 13.0, 11.0, 15.0, 10.0, 18.0, 17.0, 15.0, 26.0, 33.0, 22.0, 27.0, 39.0, 68.0, 74.0, 139.0, 300.0, 1008.0], [75.0, 38.0, 23.0, 24.0, 14.0, 14.0, 9.0, 11.0, 3.0, 3.0, 14.0, 5.0, 10.0, 10.0, 10.0, 10.0, 5.0, 11.0, 8.0, 1.0, 7.0, 2.0, 4.0, 6.0, 7.0, 8.0, 9.0, 6.0, 8.0, 9.0, 7.0, 15.0, 8.0, 4.0, 10.0, 11.0, 8.0, 11.0, 8.0, 9.0, 23.0, 21.0, 21.0, 22.0, 44.0, 39.0, 78.0, 141.0, 429.0], [83.0, 38.0, 22.0, 11.0, 15.0, 8.0, 5.0, 9.0, 10.0, 6.0, 11.0, 5.0, 6.0, 7.0, 3.0, 5.0, 4.0, 4.0, 6.0, 10.0, 5.0, 5.0, 3.0, 4.0, 9.0, 5.0, 3.0, 4.0, 5.0, 12.0, 5.0, 6.0, 8.0, 4.0, 9.0, 7.0, 9.0, 7.0, 9.0, 9.0, 7.0, 16.0, 13.0, 15.0, 24.0, 27.0, 56.0, 69.0, 239.0], [76.0, 31.0, 23.0, 15.0, 11.0, 6.0, 4.0, 4.0, 8.0, 6.0, 5.0, 4.0, 3.0, 4.0, 4.0, 4.0, 8.0, 3.0, 7.0, 7.0, 2.0, 4.0, 3.0, 4.0, 3.0, 7.0, 3.0, 8.0, 7.0, 6.0, 3.0, 7.0, 2.0, 0.0, 6.0, 13.0, 6.0, 5.0, 10.0, 4.0, 9.0, 11.0, 11.0, 10.0, 18.0, 11.0, 37.0, 56.0, 117.0], [77.0, 36.0, 15.0, 15.0, 10.0, 6.0, 6.0, 3.0, 2.0, 5.0, 6.0, 3.0, 4.0, 6.0, 1.0, 7.0, 6.0, 3.0, 5.0, 3.0, 2.0, 4.0, 5.0, 2.0, 7.0, 2.0, 3.0, 4.0, 3.0, 5.0, 5.0, 3.0, 3.0, 2.0, 2.0, 4.0, 6.0, 4.0, 4.0, 3.0, 9.0, 9.0, 11.0, 13.0, 12.0, 13.0, 22.0, 27.0, 79.0], [58.0, 33.0, 14.0, 18.0, 6.0, 7.0, 5.0, 7.0, 5.0, 4.0, 7.0, 4.0, 4.0, 2.0, 3.0, 1.0, 3.0, 8.0, 0.0, 3.0, 4.0, 1.0, 2.0, 2.0, 3.0, 3.0, 5.0, 3.0, 5.0, 1.0, 2.0, 3.0, 4.0, 6.0, 1.0, 2.0, 3.0, 8.0, 1.0, 3.0, 6.0, 2.0, 7.0, 5.0, 7.0, 16.0, 19.0, 25.0, 51.0], [62.0, 36.0, 20.0, 12.0, 5.0, 3.0, 7.0, 3.0, 2.0, 2.0, 3.0, 6.0, 3.0, 4.0, 5.0, 2.0, 4.0, 2.0, 5.0, 3.0, 4.0, 1.0, 1.0, 2.0, 5.0, 2.0, 0.0, 1.0, 0.0, 3.0, 4.0, 0.0, 1.0, 4.0, 4.0, 3.0, 6.0, 3.0, 2.0, 3.0, 5.0, 1.0, 4.0, 4.0, 10.0, 8.0, 9.0, 19.0, 43.0], [74.0, 30.0, 17.0, 13.0, 8.0, 8.0, 2.0, 5.0, 1.0, 4.0, 1.0, 4.0, 2.0, 3.0, 1.0, 3.0, 2.0, 2.0, 2.0, 3.0, 2.0, 4.0, 4.0, 3.0, 3.0, 1.0, 2.0, 5.0, 3.0, 2.0, 2.0, 0.0, 2.0, 2.0, 1.0, 0.0, 4.0, 1.0, 1.0, 2.0, 3.0, 2.0, 0.0, 4.0, 4.0, 9.0, 7.0, 21.0, 28.0], [71.0, 34.0, 18.0, 8.0, 6.0, 4.0, 3.0, 8.0, 4.0, 5.0, 2.0, 1.0, 0.0, 5.0, 4.0, 2.0, 3.0, 2.0, 0.0, 3.0, 6.0, 4.0, 0.0, 4.0, 2.0, 2.0, 0.0, 1.0, 2.0, 1.0, 1.0, 0.0, 1.0, 4.0, 4.0, 2.0, 3.0, 1.0, 2.0, 2.0, 1.0, 2.0, 0.0, 1.0, 3.0, 4.0, 4.0, 8.0, 26.0], [69.0, 36.0, 19.0, 14.0, 5.0, 7.0, 6.0, 2.0, 2.0, 2.0, 5.0, 2.0, 3.0, 2.0, 2.0, 4.0, 2.0, 1.0, 3.0, 1.0, 2.0, 4.0, 4.0, 1.0, 2.0, 0.0, 1.0, 1.0, 0.0, 1.0, 2.0, 0.0, 1.0, 0.0, 1.0, 0.0, 1.0, 2.0, 2.0, 2.0, 1.0, 2.0, 4.0, 5.0, 4.0, 1.0, 4.0, 4.0, 12.0], [70.0, 31.0, 25.0, 11.0, 2.0, 7.0, 4.0, 2.0, 1.0, 4.0, 4.0, 7.0, 1.0, 0.0, 1.0, 4.0, 3.0, 4.0, 2.0, 2.0, 1.0, 2.0, 3.0, 1.0, 0.0, 3.0, 3.0, 0.0, 0.0, 0.0, 1.0, 0.0, 1.0, 1.0, 0.0, 1.0, 1.0, 2.0, 1.0, 1.0, 2.0, 2.0, 0.0, 4.0, 3.0, 2.0, 2.0, 6.0, 6.0], [63.0, 31.0, 17.0, 9.0, 9.0, 4.0, 4.0, 4.0, 1.0, 4.0, 3.0, 1.0, 3.0, 4.0, 1.0, 3.0, 2.0, 3.0, 5.0, 1.0, 2.0, 2.0, 1.0, 1.0, 2.0, 0.0, 3.0, 2.0, 0.0, 0.0, 0.0, 0.0, 0.0, 0.0, 1.0, 2.0, 1.0, 1.0, 1.0, 3.0, 1.0, 0.0, 0.0, 0.0, 0.0, 5.0, 0.0, 2.0, 15.0], [68.0, 31.0, 21.0, 11.0, 6.0, 6.0, 0.0, 5.0, 3.0, 3.0, 4.0, 5.0, 4.0, 3.0, 3.0, 5.0, 3.0, 3.0, 2.0, 0.0, 0.0, 3.0, 3.0, 0.0, 0.0, 1.0, 3.0, 0.0, 0.0, 1.0, 0.0, 0.0, 3.0, 2.0, 1.0, 0.0, 1.0, 1.0, 0.0, 0.0, 0.0, 0.0, 1.0, 2.0, 2.0, 3.0, 2.0, 1.0, 5.0], [56.0, 30.0, 16.0, 14.0, 4.0, 6.0, 8.0, 4.0, 1.0, 2.0, 4.0, 5.0, 5.0, 6.0, 2.0, 3.0, 3.0, 1.0, 1.0, 2.0, 4.0, 2.0, 1.0, 2.0, 1.0, 1.0, 0.0, 0.0, 2.0, 1.0, 0.0, 0.0, 1.0, 2.0, 1.0, 0.0, 0.0, 0.0, 2.0, 0.0, 0.0, 1.0, 0.0, 1.0, 0.0, 1.0, 0.0, 1.0, 10.0], [63.0, 26.0, 24.0, 15.0, 5.0, 4.0, 1.0, 2.0, 3.0, 4.0, 3.0, 6.0, 1.0, 2.0, 8.0, 8.0, 0.0, 1.0, 2.0, 0.0, 1.0, 2.0, 2.0, 2.0, 2.0, 1.0, 2.0, 0.0, 0.0, 0.0, 1.0, 1.0, 3.0, 0.0, 0.0, 1.0, 0.0, 1.0, 1.0, 0.0, 1.0, 0.0, 0.0, 2.0, 0.0, 1.0, 1.0, 2.0, 3.0], [63.0, 28.0, 20.0, 15.0, 11.0, 5.0, 3.0, 2.0, 2.0, 1.0, 5.0, 5.0, 3.0, 2.0, 3.0, 2.0, 0.0, 2.0, 2.0, 2.0, 1.0, 1.0, 4.0, 3.0, 2.0, 1.0, 0.0, 0.0, 0.0, 1.0, 0.0, 3.0, 0.0, 0.0, 2.0, 2.0, 0.0, 0.0, 2.0, 2.0, 0.0, 0.0, 0.0, 1.0, 1.0, 0.0, 2.0, 1.0, 3.0], [54.0, 24.0, 23.0, 17.0, 9.0, 7.0, 1.0, 0.0, 4.0, 3.0, 3.0, 5.0, 2.0, 3.0, 2.0, 2.0, 5.0, 1.0, 0.0, 2.0, 2.0, 0.0, 2.0, 0.0, 0.0, 4.0, 4.0, 0.0, 2.0, 0.0, 0.0, 2.0, 3.0, 0.0, 1.0, 0.0, 0.0, 0.0, 1.0, 0.0, 1.0, 1.0, 1.0, 0.0, 1.0, 1.0, 0.0, 1.0, 2.0], [58.0, 34.0, 21.0, 11.0, 10.0, 5.0, 2.0, 4.0, 7.0, 4.0, 3.0, 5.0, 4.0, 2.0, 3.0, 2.0, 4.0, 1.0, 1.0, 3.0, 0.0, 1.0, 2.0, 0.0, 0.0, 2.0, 2.0, 0.0, 2.0, 1.0, 1.0, 1.0, 0.0, 0.0, 0.0, 0.0, 0.0, 1.0, 0.0, 1.0, 0.0, 1.0, 1.0, 0.0, 1.0, 1.0, 2.0, 1.0, 2.0], [70.0, 35.0, 18.0, 12.0, 8.0, 5.0, 3.0, 5.0, 4.0, 6.0, 3.0, 1.0, 3.0, 6.0, 2.0, 0.0, 5.0, 1.0, 1.0, 5.0, 1.0, 1.0, 2.0, 1.0, 0.0, 1.0, 2.0, 2.0, 1.0, 0.0, 0.0, 0.0, 1.0, 1.0, 0.0, 0.0, 0.0, 0.0, 0.0, 1.0, 0.0, 0.0, 0.0, 0.0, 3.0, 0.0, 1.0, 0.0, 2.0], [50.0, 36.0, 19.0, 8.0, 7.0, 1.0, 4.0, 3.0, 4.0, 4.0, 7.0, 3.0, 1.0, 4.0, 5.0, 3.0, 4.0, 1.0, 3.0, 2.0, 0.0, 1.0, 0.0, 2.0, 4.0, 0.0, 0.0, 0.0, 2.0, 0.0, 1.0, 4.0, 1.0, 0.0, 0.0, 0.0, 0.0, 0.0, 0.0, 1.0, 0.0, 1.0, 2.0, 0.0, 1.0, 0.0, 0.0, 1.0, 1.0], [65.0, 25.0, 21.0, 8.0, 8.0, 7.0, 2.0, 1.0, 3.0, 5.0, 0.0, 3.0, 4.0, 2.0, 3.0, 2.0, 2.0, 5.0, 2.0, 1.0, 3.0, 5.0, 2.0, 0.0, 1.0, 0.0, 1.0, 0.0, 0.0, 5.0, 3.0, 0.0, 0.0, 0.0, 2.0, 0.0, 0.0, 0.0, 0.0, 0.0, 0.0, 1.0, 0.0, 0.0, 0.0, 0.0, 0.0, 0.0, 0.0], [62.0, 33.0, 17.0, 17.0, 4.0, 4.0, 4.0, 4.0, 4.0, 2.0, 2.0, 3.0, 4.0, 1.0, 1.0, 1.0, 2.0, 4.0, 3.0, 3.0, 0.0, 4.0, 4.0, 0.0, 3.0, 2.0, 0.0, 1.0, 2.0, 1.0, 1.0, 1.0, 2.0, 0.0, 0.0, 1.0, 0.0, 1.0, 0.0, 0.0, 0.0, 0.0, 0.0, 1.0, 0.0, 0.0, 0.0, 1.0, 1.0], [70.0, 39.0, 19.0, 7.0, 6.0, 4.0, 4.0, 4.0, 1.0, 5.0, 1.0, 5.0, 7.0, 2.0, 2.0, 2.0, 0.0, 0.0, 2.0, 2.0, 1.0, 1.0, 5.0, 1.0, 3.0, 1.0, 0.0, 1.0, 0.0, 1.0, 2.0, 0.0, 2.0, 2.0, 1.0, 1.0, 0.0, 1.0, 1.0, 0.0, 0.0, 0.0, 1.0, 1.0, 0.0, 1.0, 0.0, 0.0, 0.0], [69.0, 28.0, 13.0, 12.0, 6.0, 6.0, 5.0, 6.0, 4.0, 2.0, 6.0, 3.0, 5.0, 4.0, 2.0, 1.0, 3.0, 1.0, 3.0, 2.0, 2.0, 3.0, 0.0, 0.0, 2.0, 2.0, 0.0, 0.0, 0.0, 0.0, 0.0, 1.0, 3.0, 0.0, 1.0, 0.0, 1.0, 0.0, 1.0, 0.0, 0.0, 0.0, 2.0, 0.0, 0.0, 0.0, 0.0, 0.0, 0.0], [71.0, 31.0, 14.0, 6.0, 10.0, 8.0, 4.0, 4.0, 1.0, 2.0, 4.0, 1.0, 7.0, 5.0, 2.0, 2.0, 2.0, 2.0, 1.0, 3.0, 2.0, 1.0, 5.0, 1.0, 0.0, 3.0, 2.0, 1.0, 0.0, 0.0, 1.0, 1.0, 0.0, 0.0, 1.0, 0.0, 0.0, 1.0, 2.0, 0.0, 0.0, 0.0, 0.0, 1.0, 0.0, 1.0, 0.0, 2.0, 0.0], [58.0, 32.0, 25.0, 13.0, 5.0, 6.0, 1.0, 3.0, 2.0, 1.0, 1.0, 9.0, 1.0, 6.0, 2.0, 3.0, 3.0, 2.0, 5.0, 2.0, 0.0, 2.0, 2.0, 1.0, 1.0, 1.0, 0.0, 1.0, 0.0, 0.0, 2.0, 1.0, 0.0, 0.0, 0.0, 0.0, 1.0, 0.0, 1.0, 0.0, 0.0, 1.0, 0.0, 2.0, 1.0, 2.0, 0.0, 0.0, 1.0], [55.0, 31.0, 20.0, 11.0, 6.0, 4.0, 5.0, 5.0, 5.0, 2.0, 2.0, 2.0, 7.0, 2.0, 4.0, 5.0, 4.0, 2.0, 1.0, 2.0, 4.0, 0.0, 1.0, 0.0, 0.0, 0.0, 2.0, 1.0, 2.0, 1.0, 0.0, 0.0, 1.0, 0.0, 0.0, 1.0, 0.0, 2.0, 0.0, 1.0, 1.0, 0.0, 0.0, 1.0, 0.0, 0.0, 0.0, 1.0, 0.0], [66.0, 30.0, 15.0, 13.0, 13.0, 5.0, 4.0, 4.0, 1.0, 5.0, 3.0, 4.0, 1.0, 3.0, 6.0, 2.0, 3.0, 2.0, 2.0, 1.0, 2.0, 1.0, 0.0, 2.0, 0.0, 2.0, 2.0, 0.0, 0.0, 1.0, 0.0, 1.0, 0.0, 0.0, 0.0, 2.0, 0.0, 2.0, 1.0, 0.0, 0.0, 0.0, 0.0, 1.0, 2.0, 1.0, 0.0, 0.0, 0.0], [81.0, 26.0, 21.0, 4.0, 7.0, 3.0, 4.0, 4.0, 1.0, 4.0, 4.0, 3.0, 3.0, 4.0, 5.0, 1.0, 5.0, 2.0, 4.0, 1.0, 1.0, 2.0, 1.0, 0.0, 1.0, 2.0, 2.0, 0.0, 2.0, 0.0, 0.0, 1.0, 0.0, 0.0, 1.0, 1.0, 0.0, 0.0, 0.0, 1.0, 1.0, 0.0, 2.0, 0.0, 0.0, 0.0, 2.0, 0.0, 1.0], [59.0, 25.0, 17.0, 13.0, 7.0, 3.0, 3.0, 2.0, 1.0, 4.0, 4.0, 2.0, 2.0, 2.0, 1.0, 3.0, 8.0, 3.0, 3.0, 1.0, 2.0, 0.0, 3.0, 2.0, 1.0, 0.0, 2.0, 1.0, 1.0, 0.0, 2.0, 0.0, 2.0, 1.0, 1.0, 1.0, 0.0, 0.0, 0.0, 0.0, 0.0, 0.0, 1.0, 0.0, 0.0, 0.0, 0.0, 1.0, 3.0], [69.0, 34.0, 20.0, 12.0, 5.0, 6.0, 2.0, 2.0, 4.0, 3.0, 7.0, 6.0, 0.0, 2.0, 2.0, 0.0, 1.0, 5.0, 4.0, 1.0, 1.0, 1.0, 3.0, 1.0, 0.0, 0.0, 0.0, 0.0, 2.0, 0.0, 0.0, 0.0, 1.0, 1.0, 2.0, 0.0, 1.0, 0.0, 2.0, 2.0, 0.0, 2.0, 1.0, 0.0, 0.0, 0.0, 3.0, 0.0, 0.0], [56.0, 29.0, 20.0, 12.0, 7.0, 6.0, 4.0, 2.0, 5.0, 2.0, 3.0, 5.0, 5.0, 2.0, 2.0, 5.0, 3.0, 2.0, 2.0, 1.0, 2.0, 1.0, 4.0, 0.0, 1.0, 1.0, 0.0, 0.0, 1.0, 1.0, 2.0, 1.0, 2.0, 0.0, 2.0, 0.0, 0.0, 0.0, 0.0, 0.0, 1.0, 2.0, 0.0, 0.0, 2.0, 0.0, 1.0, 0.0, 1.0], [61.0, 24.0, 12.0, 8.0, 8.0, 6.0, 3.0, 4.0, 5.0, 6.0, 4.0, 2.0, 5.0, 4.0, 1.0, 3.0, 3.0, 1.0, 2.0, 0.0, 3.0, 2.0, 2.0, 2.0, 1.0, 2.0, 1.0, 1.0, 0.0, 1.0, 0.0, 1.0, 0.0, 0.0, 0.0, 2.0, 1.0, 1.0, 1.0, 0.0, 0.0, 0.0, 0.0, 1.0, 0.0, 1.0, 1.0, 1.0, 1.0], [52.0, 30.0, 17.0, 9.0, 7.0, 7.0, 7.0, 2.0, 2.0, 4.0, 4.0, 4.0, 6.0, 3.0, 3.0, 3.0, 0.0, 1.0, 1.0, 4.0, 1.0, 0.0, 1.0, 2.0, 2.0, 0.0, 3.0, 0.0, 1.0, 0.0, 0.0, 1.0, 2.0, 1.0, 1.0, 1.0, 0.0, 0.0, 0.0, 0.0, 0.0, 1.0, 0.0, 2.0, 1.0, 1.0, 0.0, 1.0, 1.0], [62.0, 27.0, 24.0, 11.0, 1.0, 3.0, 2.0, 4.0, 3.0, 1.0, 4.0, 4.0, 5.0, 4.0, 3.0, 5.0, 3.0, 3.0, 0.0, 3.0, 1.0, 1.0, 0.0, 2.0, 1.0, 1.0, 0.0, 1.0, 2.0, 0.0, 1.0, 0.0, 0.0, 0.0, 1.0, 0.0, 1.0, 0.0, 2.0, 3.0, 2.0, 2.0, 0.0, 1.0, 0.0, 0.0, 2.0, 0.0, 1.0], [77.0, 24.0, 18.0, 8.0, 8.0, 8.0, 5.0, 3.0, 1.0, 0.0, 3.0, 4.0, 3.0, 0.0, 4.0, 3.0, 2.0, 6.0, 3.0, 4.0, 2.0, 1.0, 0.0, 4.0, 2.0, 0.0, 0.0, 2.0, 0.0, 0.0, 0.0, 0.0, 0.0, 1.0, 2.0, 0.0, 0.0, 1.0, 0.0, 0.0, 2.0, 0.0, 0.0, 0.0, 1.0, 0.0, 0.0, 1.0, 0.0], [61.0, 26.0, 19.0, 14.0, 2.0, 9.0, 4.0, 3.0, 3.0, 3.0, 4.0, 4.0, 2.0, 3.0, 4.0, 3.0, 7.0, 2.0, 1.0, 1.0, 0.0, 2.0, 0.0, 2.0, 2.0, 1.0, 0.0, 1.0, 0.0, 0.0, 0.0, 1.0, 0.0, 0.0, 0.0, 0.0, 0.0, 0.0, 0.0, 1.0, 1.0, 2.0, 1.0, 0.0, 1.0, 2.0, 0.0, 0.0, 0.0]],
    "Name": "sCurve-0",
    "Overflow": 2079142.0,
    "Type": "Histo2d",
    "Underflow": 0.0,
    "x": {
        "AxisTitle": "Vcal",
        "Bins": 51,
        "High": 302.5,
        "Low": 47.5
    },
    "y": {
        "AxisTitle": "Occupancy",
        "Bins": 49,
        "High": 49.5,
        "Low": 0.5
    },
    "z": {
        "AxisTitle": "Number of pixels"
    }
}