{
    "Data": [0.0, 0.0, 0.0, 0.0, 0.0, 0.0, 0.0, 0.0, 0.0, 0.0, 0.0, 0.0, 0.0, 0.0, 1.0, 1.0, 0.0, 0.0, 0.0, 0.0, 0.0, 1.0, 1.0, 0.0, 1.0, 1.0, 6.0, 2.0, 12.0, 18.0, 16.0, 12.0, 10.0, 6.0, 26.0, 39.0, 31.0, 123.0, 305.0, 381.0, 276.0, 341.0, 1391.0, 2425.0, 1995.0, 1232.0, 1890.0, 2660.0, 3653.0, 2982.0, 2330.0, 2291.0, 2475.0, 2370.0, 1918.0, 1532.0, 1513.0, 1862.0, 1534.0, 1470.0, 1175.0, 1144.0, 1009.0, 767.0, 657.0, 582.0, 608.0, 555.0, 475.0, 432.0, 401.0, 376.0, 336.0, 299.0, 247.0, 252.0, 231.0, 189.0, 193.0, 159.0, 160.0, 141.0, 116.0, 120.0, 99.0, 100.0, 108.0, 77.0, 76.0, 62.0, 63.0, 55.0, 48.0, 43.0, 41.0, 44.0, 37.0, 43.0, 29.0, 30.0, 32.0, 24.0, 20.0, 18.0, 18.0, 11.0, 22.0, 19.0, 14.0, 15.0, 13.0, 14.0, 11.0, 11.0, 10.0, 13.0, 8.0, 9.0, 9.0, 13.0, 9.0, 9.0, 11.0, 9.0, 6.0, 5.0, 6.0, 2.0, 6.0, 7.0, 10.0, 5.0, 6.0, 12.0, 8.0, 8.0, 5.0, 4.0, 4.0, 3.0, 3.0, 2.0, 2.0, 6.0, 3.0, 2.0, 1.0, 1.0, 6.0, 6.0, 3.0, 3.0, 0.0, 1.0, 5.0, 4.0, 3.0, 4.0, 1.0, 4.0, 4.0, 8.0, 1.0, 1.0, 1.0, 2.0, 1.0, 3.0, 1.0, 4.0, 3.0, 3.0, 3.0, 2.0, 1.0, 2.0, 4.0, 3.0, 2.0, 1.0, 5.0, 0.0, 4.0, 2.0, 1.0, 1.0, 4.0, 0.0, 0.0, 0.0, 0.0, 2.0, 3.0, 2.0, 4.0, 4.0, 1.0, 3.0, 4.0, 0.0, 2.0],
    "Name": "TimePerFitDist-0",
    "Overflow": 270.0,
    "Type": "Histo1d",
    "Underflow": 0.0,
    "x": {
        "AxisTitle": "Fit Time [us]",
        "Bins": 201,
        "High": 401.0,
        "Low": -1.0
    },
    "y": {
        "AxisTitle": "Number of Pixels"
    },
    "z": {
        "AxisTitle": "z"
    }
}