{
    "Data": [1504.0, 20139.0, 18360.0, 8558.0, 2806.0, 767.0, 366.0, 468.0, 615.0, 755.0, 807.0, 785.0, 761.0, 674.0, 622.0, 571.0, 613.0, 574.0, 562.0, 578.0, 610.0, 628.0, 654.0, 626.0, 602.0, 597.0, 624.0, 598.0, 587.0, 557.0, 510.0, 518.0, 505.0, 464.0, 468.0, 475.0, 422.0, 394.0, 359.0, 367.0, 364.0, 314.0, 287.0, 313.0, 285.0, 278.0, 258.0, 236.0, 183.0, 182.0, 87.0],
    "Name": "Chi2Dist-0",
    "Overflow": 0.0,
    "Type": "Histo1d",
    "Underflow": 0.0,
    "x": {
        "AxisTitle": "Fit Chi/ndf",
        "Bins": 51,
        "High": 2.5250000953674318,
        "Low": -0.02500000037252903
    },
    "y": {
        "AxisTitle": "Number of Pixels"
    },
    "z": {
        "AxisTitle": "z"
    }
}