{
    "Data": [0.0, 0.0, 0.0, 0.0, 0.0, 0.0, 0.0, 0.0, 0.0, 0.0, 0.0, 0.0, 0.0, 0.0, 4.0, 3.0, 0.0, 20.0, 299.0, 95.0, 24.0, 648.0, 3352.0, 1361.0, 272.0, 1486.0, 3840.0, 1961.0, 495.0, 1398.0, 2601.0, 1418.0, 430.0, 552.0, 721.0, 569.0, 329.0, 979.0, 1444.0, 1126.0, 749.0, 1998.0, 3383.0, 4121.0, 2075.0, 1655.0, 3587.0, 4031.0, 3588.0, 1861.0, 2321.0, 2624.0, 3159.0, 1839.0, 1108.0, 1367.0, 1204.0, 1300.0, 725.0, 786.0, 776.0, 802.0, 628.0, 482.0, 484.0, 374.0, 448.0, 326.0, 285.0, 278.0, 238.0, 278.0, 193.0, 205.0, 147.0, 155.0, 136.0, 107.0, 102.0, 76.0, 104.0, 80.0, 78.0, 62.0, 64.0, 60.0, 40.0, 38.0, 40.0, 37.0, 41.0, 39.0, 24.0, 20.0, 23.0, 17.0, 12.0, 16.0, 17.0, 22.0, 12.0, 14.0, 12.0, 12.0, 12.0, 5.0, 5.0, 10.0, 3.0, 6.0, 6.0, 5.0, 7.0, 7.0, 3.0, 3.0, 5.0, 4.0, 1.0, 2.0, 4.0, 4.0, 2.0, 0.0, 5.0, 3.0, 3.0, 3.0, 5.0, 3.0, 1.0, 0.0, 1.0, 1.0, 2.0, 0.0, 3.0, 1.0, 0.0, 0.0, 1.0, 3.0, 2.0, 2.0, 3.0, 0.0, 2.0, 1.0, 0.0, 1.0, 1.0, 0.0, 2.0, 1.0, 0.0, 0.0, 1.0, 1.0, 0.0, 1.0, 0.0, 2.0, 0.0, 0.0, 0.0, 0.0, 0.0, 1.0, 1.0, 1.0, 0.0, 1.0, 1.0, 0.0, 0.0, 1.0, 0.0, 0.0, 0.0, 1.0, 2.0, 0.0, 0.0, 0.0, 0.0, 1.0, 0.0, 0.0, 1.0, 0.0, 0.0, 1.0, 1.0, 1.0, 1.0, 0.0, 0.0, 1.0, 0.0, 0.0, 0.0],
    "Name": "TimePerFitDist-0",
    "Overflow": 73.0,
    "Type": "Histo1d",
    "Underflow": 0.0,
    "x": {
        "AxisTitle": "Fit Time [us]",
        "Bins": 201,
        "High": 401.0,
        "Low": -1.0
    },
    "y": {
        "AxisTitle": "Number of Pixels"
    },
    "z": {
        "AxisTitle": "z"
    }
}