{
    "Data": [42.0, 48.0, 0.0, 1.0, 3.0, 11.0, 36.0, 148.0, 446.0, 1149.0, 2383.0, 3986.0, 4843.0, 5080.0, 4413.0, 4146.0, 4301.0, 4836.0, 5292.0, 4765.0, 3853.0, 2860.0, 2278.0, 1834.0, 1672.0, 1810.0, 1713.0, 1712.0, 1733.0, 1617.0, 1543.0, 1289.0, 1175.0, 963.0, 797.0, 662.0, 538.0, 425.0, 358.0, 248.0, 215.0, 164.0, 145.0, 91.0, 92.0, 78.0, 63.0, 53.0, 44.0, 34.0, 39.0, 28.0, 30.0, 26.0, 28.0, 19.0, 13.0, 19.0, 12.0, 14.0],
    "Name": "NoiseDist-0",
    "Overflow": 108.0,
    "Type": "Histo1d",
    "Underflow": 0.0,
    "x": {
        "AxisTitle": "Noise [e]",
        "Bins": 60,
        "High": 301.0,
        "Low": -2.0
    },
    "y": {
        "AxisTitle": "Number of Pixels"
    },
    "z": {
        "AxisTitle": "z"
    }
}