{
    "Data": [1636.0, 20639.0, 18440.0, 8665.0, 2883.0, 819.0, 393.0, 426.0, 565.0, 725.0, 767.0, 801.0, 768.0, 670.0, 592.0, 567.0, 552.0, 557.0, 587.0, 593.0, 598.0, 601.0, 671.0, 599.0, 652.0, 619.0, 629.0, 554.0, 592.0, 572.0, 526.0, 525.0, 551.0, 514.0, 503.0, 481.0, 478.0, 475.0, 403.0, 414.0, 354.0, 331.0, 353.0, 322.0, 323.0, 293.0, 254.0, 239.0, 217.0, 211.0, 115.0],
    "Name": "Chi2Dist-0",
    "Overflow": 0.0,
    "Type": "Histo1d",
    "Underflow": 0.0,
    "x": {
        "AxisTitle": "Fit Chi/ndf",
        "Bins": 51,
        "High": 2.5250000953674318,
        "Low": -0.02500000037252903
    },
    "y": {
        "AxisTitle": "Number of Pixels"
    },
    "z": {
        "AxisTitle": "z"
    }
}