time,Hardware,Voltage,Current
1625765857429,high-voltage-4,1,1.45635
time,Hardware,Voltage,Current
1625765857429,high-voltage-4,2,1.77289
time,Hardware,Voltage,Current
1625765857429,high-voltage-4,3,1.99908
time,Hardware,Voltage,Current
1625765857429,high-voltage-4,4,2.16445
time,Hardware,Voltage,Current
1625765857429,high-voltage-4,5,2.27753
time,Hardware,Voltage,Current
1625765857429,high-voltage-4,6,2.37486
time,Hardware,Voltage,Current
1625765857429,high-voltage-4,7,2.46372
time,Hardware,Voltage,Current
1625765857429,high-voltage-4,8,2.55862
time,Hardware,Voltage,Current
1625765857429,high-voltage-4,9,2.66462
time,Hardware,Voltage,Current
1625765857429,high-voltage-4,10,2.7807
time,Hardware,Voltage,Current
1625765857429,high-voltage-4,11,2.90738
time,Hardware,Voltage,Current
1625765857429,high-voltage-4,12,3.04312
time,Hardware,Voltage,Current
1625765857429,high-voltage-4,13,3.18425
time,Hardware,Voltage,Current
1625765857429,high-voltage-4,14,3.33789
time,Hardware,Voltage,Current
1625765857429,high-voltage-4,15,3.4997
time,Hardware,Voltage,Current
1625765857429,high-voltage-4,16,3.66071
time,Hardware,Voltage,Current
1625765857429,high-voltage-4,17,3.82452
time,Hardware,Voltage,Current
1625765857429,high-voltage-4,18,3.99058
time,Hardware,Voltage,Current
1625765857429,high-voltage-4,19,4.15749
time,Hardware,Voltage,Current
1625765857429,high-voltage-4,20,4.33096
time,Hardware,Voltage,Current
1625765857429,high-voltage-4,25,5.06561
time,Hardware,Voltage,Current
1625765857429,high-voltage-4,30,5.59907
time,Hardware,Voltage,Current
1625765857429,high-voltage-4,35,6.07586
time,Hardware,Voltage,Current
1625765857429,high-voltage-4,40,6.53442
time,Hardware,Voltage,Current
1625765857429,high-voltage-4,45,7.01236
time,Hardware,Voltage,Current
1625765857429,high-voltage-4,50,7.52256
time,Hardware,Voltage,Current
1625765857429,high-voltage-4,55,8.08934
time,Hardware,Voltage,Current
1625765857429,high-voltage-4,60,8.75107
time,Hardware,Voltage,Current
1625765857429,high-voltage-4,65,9.53197
time,Hardware,Voltage,Current
1625765857429,high-voltage-4,70,9.99974
time,Hardware,Voltage,Current
1625765857429,high-voltage-4,75,9.99979
time,Hardware,Voltage,Current
1625765857429,high-voltage-4,80,9.99971
time,Hardware,Voltage,Current
1625765857429,high-voltage-4,85,9.99979
time,Hardware,Voltage,Current
1625765857429,high-voltage-4,90,9.99979
time,Hardware,Voltage,Current
1625765857429,high-voltage-4,95,9.99976
time,Hardware,Voltage,Current
1625765857429,high-voltage-4,100,9.99973
