{
    "Data": [[567.0, 211.0, 111.0, 66.0, 53.0, 39.0, 29.0, 45.0, 25.0, 27.0, 28.0, 21.0, 19.0, 30.0, 22.0, 16.0, 17.0, 19.0, 15.0, 17.0, 11.0, 9.0, 8.0, 10.0, 7.0, 14.0, 10.0, 7.0, 9.0, 1.0, 5.0, 6.0, 3.0, 3.0, 4.0, 5.0, 1.0, 2.0, 4.0, 2.0, 7.0, 6.0, 7.0, 2.0, 13.0, 4.0, 8.0, 14.0, 8.0], [1037.0, 318.0, 149.0, 72.0, 45.0, 38.0, 48.0, 29.0, 19.0, 28.0, 18.0, 21.0, 23.0, 23.0, 26.0, 26.0, 20.0, 28.0, 26.0, 26.0, 15.0, 21.0, 13.0, 13.0, 9.0, 8.0, 11.0, 10.0, 9.0, 9.0, 5.0, 3.0, 1.0, 6.0, 3.0, 2.0, 2.0, 2.0, 5.0, 5.0, 5.0, 1.0, 6.0, 5.0, 2.0, 7.0, 9.0, 12.0, 15.0], [2210.0, 553.0, 270.0, 146.0, 88.0, 56.0, 40.0, 35.0, 26.0, 24.0, 21.0, 17.0, 33.0, 27.0, 27.0, 32.0, 24.0, 25.0, 16.0, 16.0, 14.0, 20.0, 14.0, 16.0, 18.0, 14.0, 12.0, 18.0, 8.0, 11.0, 13.0, 4.0, 10.0, 9.0, 3.0, 6.0, 4.0, 5.0, 3.0, 3.0, 8.0, 4.0, 4.0, 6.0, 9.0, 5.0, 11.0, 11.0, 10.0], [4261.0, 1318.0, 612.0, 346.0, 184.0, 124.0, 97.0, 62.0, 58.0, 46.0, 41.0, 38.0, 30.0, 24.0, 31.0, 23.0, 23.0, 16.0, 19.0, 11.0, 16.0, 17.0, 12.0, 21.0, 16.0, 11.0, 13.0, 7.0, 8.0, 13.0, 6.0, 14.0, 14.0, 11.0, 13.0, 12.0, 12.0, 10.0, 11.0, 4.0, 7.0, 11.0, 9.0, 6.0, 6.0, 11.0, 9.0, 12.0, 11.0], [7347.0, 2903.0, 1492.0, 799.0, 568.0, 354.0, 273.0, 193.0, 137.0, 95.0, 102.0, 83.0, 73.0, 59.0, 38.0, 45.0, 29.0, 32.0, 33.0, 21.0, 18.0, 19.0, 21.0, 20.0, 19.0, 16.0, 9.0, 9.0, 12.0, 11.0, 4.0, 3.0, 4.0, 8.0, 9.0, 14.0, 8.0, 11.0, 11.0, 15.0, 16.0, 22.0, 19.0, 16.0, 14.0, 14.0, 11.0, 15.0, 14.0], [10812.0, 5614.0, 3376.0, 2103.0, 1421.0, 1014.0, 692.0, 487.0, 433.0, 305.0, 257.0, 206.0, 177.0, 126.0, 135.0, 111.0, 99.0, 90.0, 67.0, 67.0, 55.0, 39.0, 30.0, 28.0, 17.0, 26.0, 24.0, 20.0, 20.0, 12.0, 15.0, 18.0, 13.0, 5.0, 6.0, 10.0, 8.0, 9.0, 6.0, 9.0, 8.0, 12.0, 17.0, 11.0, 19.0, 19.0, 31.0, 35.0, 32.0], [8062.0, 7204.0, 6188.0, 4840.0, 3828.0, 2880.0, 2264.0, 1789.0, 1376.0, 1100.0, 829.0, 702.0, 565.0, 472.0, 368.0, 304.0, 281.0, 221.0, 206.0, 154.0, 161.0, 108.0, 102.0, 104.0, 82.0, 81.0, 69.0, 58.0, 59.0, 55.0, 38.0, 46.0, 31.0, 34.0, 35.0, 27.0, 24.0, 19.0, 19.0, 10.0, 16.0, 16.0, 14.0, 14.0, 14.0, 19.0, 17.0, 32.0, 53.0], [1596.0, 2001.0, 2572.0, 2960.0, 3238.0, 3323.0, 3449.0, 3457.0, 3225.0, 3101.0, 2757.0, 2528.0, 2393.0, 2045.0, 1745.0, 1605.0, 1192.0, 1081.0, 897.0, 776.0, 671.0, 558.0, 455.0, 387.0, 338.0, 288.0, 253.0, 196.0, 166.0, 169.0, 133.0, 120.0, 111.0, 91.0, 98.0, 93.0, 69.0, 61.0, 54.0, 71.0, 46.0, 41.0, 35.0, 22.0, 33.0, 33.0, 29.0, 34.0, 52.0], [576.0, 466.0, 427.0, 488.0, 544.0, 621.0, 757.0, 927.0, 1020.0, 1294.0, 1466.0, 1651.0, 1790.0, 1930.0, 2036.0, 2138.0, 2306.0, 2374.0, 2361.0, 2316.0, 2187.0, 2220.0, 2053.0, 2104.0, 1899.0, 1713.0, 1598.0, 1467.0, 1292.0, 1091.0, 961.0, 864.0, 726.0, 662.0, 490.0, 407.0, 381.0, 267.0, 249.0, 227.0, 181.0, 168.0, 130.0, 97.0, 95.0, 99.0, 77.0, 78.0, 64.0], [438.0, 275.0, 199.0, 208.0, 183.0, 175.0, 189.0, 210.0, 224.0, 263.0, 277.0, 307.0, 344.0, 412.0, 455.0, 527.0, 589.0, 659.0, 746.0, 820.0, 1009.0, 1115.0, 1240.0, 1358.0, 1470.0, 1603.0, 1785.0, 1827.0, 1977.0, 1926.0, 2077.0, 2131.0, 2238.0, 2216.0, 2187.0, 2205.0, 2064.0, 1986.0, 1912.0, 1761.0, 1642.0, 1480.0, 1249.0, 1019.0, 819.0, 628.0, 478.0, 349.0, 255.0], [477.0, 219.0, 131.0, 105.0, 99.0, 84.0, 72.0, 86.0, 78.0, 91.0, 99.0, 106.0, 118.0, 153.0, 156.0, 139.0, 166.0, 194.0, 211.0, 241.0, 241.0, 278.0, 266.0, 348.0, 393.0, 451.0, 536.0, 599.0, 688.0, 755.0, 880.0, 937.0, 1143.0, 1281.0, 1385.0, 1526.0, 1753.0, 1896.0, 2200.0, 2223.0, 2540.0, 2740.0, 2988.0, 3009.0, 3285.0, 3445.0, 3535.0, 3157.0, 2676.0], [555.0, 219.0, 133.0, 88.0, 78.0, 61.0, 43.0, 37.0, 45.0, 44.0, 38.0, 47.0, 44.0, 37.0, 55.0, 70.0, 55.0, 78.0, 70.0, 87.0, 76.0, 108.0, 105.0, 110.0, 106.0, 147.0, 178.0, 174.0, 186.0, 256.0, 265.0, 315.0, 375.0, 402.0, 491.0, 540.0, 702.0, 878.0, 1030.0, 1220.0, 1392.0, 1685.0, 2026.0, 2370.0, 2836.0, 3554.0, 4291.0, 5684.0, 8187.0], [786.0, 259.0, 126.0, 96.0, 68.0, 45.0, 30.0, 38.0, 31.0, 31.0, 44.0, 37.0, 36.0, 34.0, 43.0, 45.0, 33.0, 37.0, 25.0, 30.0, 31.0, 38.0, 37.0, 28.0, 52.0, 54.0, 49.0, 59.0, 48.0, 57.0, 97.0, 92.0, 98.0, 142.0, 151.0, 176.0, 251.0, 285.0, 344.0, 407.0, 550.0, 679.0, 940.0, 1247.0, 1754.0, 2204.0, 3287.0, 4904.0, 8319.0], [1126.0, 369.0, 187.0, 96.0, 48.0, 43.0, 32.0, 36.0, 29.0, 29.0, 28.0, 25.0, 26.0, 27.0, 29.0, 26.0, 40.0, 28.0, 35.0, 25.0, 27.0, 37.0, 19.0, 30.0, 20.0, 23.0, 23.0, 24.0, 28.0, 26.0, 36.0, 30.0, 28.0, 35.0, 49.0, 58.0, 62.0, 85.0, 100.0, 148.0, 174.0, 235.0, 314.0, 437.0, 606.0, 1057.0, 1722.0, 3332.0, 6982.0], [1684.0, 588.0, 220.0, 123.0, 73.0, 48.0, 38.0, 33.0, 36.0, 18.0, 24.0, 30.0, 33.0, 25.0, 32.0, 15.0, 24.0, 27.0, 28.0, 31.0, 18.0, 18.0, 27.0, 16.0, 11.0, 21.0, 15.0, 19.0, 20.0, 24.0, 22.0, 18.0, 28.0, 29.0, 22.0, 22.0, 25.0, 37.0, 35.0, 45.0, 51.0, 67.0, 99.0, 150.0, 208.0, 333.0, 655.0, 1457.0, 4515.0], [2480.0, 853.0, 402.0, 163.0, 92.0, 58.0, 55.0, 33.0, 33.0, 34.0, 24.0, 32.0, 25.0, 22.0, 30.0, 16.0, 32.0, 20.0, 31.0, 23.0, 26.0, 15.0, 19.0, 19.0, 16.0, 14.0, 11.0, 13.0, 17.0, 20.0, 16.0, 12.0, 15.0, 10.0, 18.0, 22.0, 23.0, 24.0, 25.0, 40.0, 27.0, 27.0, 48.0, 54.0, 60.0, 143.0, 261.0, 557.0, 2253.0], [3411.0, 1419.0, 671.0, 359.0, 165.0, 105.0, 66.0, 37.0, 32.0, 32.0, 28.0, 21.0, 24.0, 28.0, 21.0, 27.0, 21.0, 31.0, 32.0, 21.0, 19.0, 17.0, 16.0, 22.0, 19.0, 11.0, 17.0, 13.0, 17.0, 15.0, 27.0, 15.0, 3.0, 7.0, 13.0, 20.0, 13.0, 11.0, 11.0, 17.0, 17.0, 21.0, 35.0, 32.0, 53.0, 72.0, 90.0, 211.0, 947.0], [4146.0, 2056.0, 1128.0, 626.0, 389.0, 218.0, 132.0, 106.0, 62.0, 54.0, 27.0, 27.0, 30.0, 19.0, 25.0, 26.0, 16.0, 17.0, 23.0, 16.0, 23.0, 22.0, 13.0, 13.0, 13.0, 13.0, 9.0, 13.0, 20.0, 7.0, 7.0, 11.0, 19.0, 9.0, 11.0, 17.0, 22.0, 14.0, 14.0, 23.0, 12.0, 20.0, 26.0, 19.0, 26.0, 38.0, 62.0, 125.0, 430.0], [4503.0, 2585.0, 1747.0, 993.0, 663.0, 477.0, 319.0, 195.0, 131.0, 111.0, 93.0, 49.0, 47.0, 40.0, 26.0, 17.0, 24.0, 21.0, 22.0, 15.0, 17.0, 24.0, 16.0, 15.0, 12.0, 14.0, 6.0, 11.0, 8.0, 8.0, 6.0, 9.0, 6.0, 3.0, 14.0, 15.0, 10.0, 13.0, 9.0, 15.0, 9.0, 12.0, 14.0, 19.0, 29.0, 42.0, 58.0, 72.0, 252.0], [4523.0, 2885.0, 2156.0, 1496.0, 1079.0, 773.0, 595.0, 409.0, 309.0, 243.0, 176.0, 124.0, 99.0, 73.0, 50.0, 51.0, 40.0, 34.0, 29.0, 29.0, 21.0, 15.0, 16.0, 16.0, 12.0, 9.0, 16.0, 7.0, 6.0, 8.0, 11.0, 6.0, 10.0, 4.0, 7.0, 12.0, 7.0, 9.0, 10.0, 12.0, 12.0, 12.0, 7.0, 13.0, 19.0, 30.0, 49.0, 59.0, 148.0], [3909.0, 3060.0, 2392.0, 1846.0, 1455.0, 1123.0, 954.0, 733.0, 589.0, 460.0, 325.0, 297.0, 236.0, 165.0, 148.0, 125.0, 92.0, 79.0, 75.0, 50.0, 30.0, 41.0, 30.0, 24.0, 20.0, 12.0, 12.0, 8.0, 9.0, 11.0, 4.0, 5.0, 5.0, 6.0, 4.0, 5.0, 9.0, 7.0, 8.0, 9.0, 9.0, 11.0, 13.0, 13.0, 15.0, 20.0, 27.0, 43.0, 112.0], [3103.0, 2691.0, 2396.0, 1904.0, 1622.0, 1371.0, 1179.0, 1004.0, 857.0, 675.0, 650.0, 514.0, 443.0, 367.0, 288.0, 237.0, 220.0, 179.0, 143.0, 99.0, 87.0, 80.0, 60.0, 52.0, 44.0, 29.0, 25.0, 27.0, 14.0, 12.0, 9.0, 8.0, 10.0, 7.0, 11.0, 8.0, 10.0, 3.0, 6.0, 4.0, 9.0, 6.0, 5.0, 9.0, 17.0, 18.0, 19.0, 45.0, 78.0], [2280.0, 2024.0, 1933.0, 1742.0, 1645.0, 1465.0, 1344.0, 1212.0, 1047.0, 909.0, 925.0, 775.0, 679.0, 582.0, 535.0, 483.0, 431.0, 337.0, 302.0, 288.0, 222.0, 180.0, 142.0, 120.0, 95.0, 83.0, 76.0, 56.0, 39.0, 40.0, 30.0, 27.0, 26.0, 16.0, 14.0, 15.0, 14.0, 10.0, 16.0, 5.0, 7.0, 5.0, 10.0, 7.0, 9.0, 10.0, 17.0, 32.0, 64.0], [1566.0, 1488.0, 1470.0, 1303.0, 1423.0, 1312.0, 1252.0, 1222.0, 1134.0, 1046.0, 1013.0, 962.0, 865.0, 827.0, 748.0, 667.0, 648.0, 549.0, 522.0, 417.0, 422.0, 364.0, 290.0, 283.0, 230.0, 212.0, 179.0, 152.0, 124.0, 100.0, 94.0, 59.0, 75.0, 49.0, 38.0, 35.0, 34.0, 20.0, 17.0, 16.0, 13.0, 7.0, 9.0, 7.0, 6.0, 9.0, 20.0, 24.0, 48.0], [981.0, 948.0, 954.0, 999.0, 1017.0, 1033.0, 1018.0, 1028.0, 1018.0, 1010.0, 981.0, 951.0, 948.0, 933.0, 875.0, 861.0, 733.0, 719.0, 713.0, 625.0, 604.0, 536.0, 493.0, 475.0, 447.0, 419.0, 364.0, 341.0, 283.0, 221.0, 221.0, 205.0, 163.0, 146.0, 116.0, 86.0, 77.0, 59.0, 53.0, 39.0, 32.0, 18.0, 23.0, 16.0, 11.0, 23.0, 17.0, 21.0, 33.0], [643.0, 610.0, 625.0, 665.0, 681.0, 718.0, 718.0, 792.0, 829.0, 850.0, 811.0, 869.0, 787.0, 822.0, 857.0, 849.0, 768.0, 839.0, 810.0, 748.0, 737.0, 723.0, 656.0, 666.0, 620.0, 612.0, 522.0, 516.0, 449.0, 425.0, 379.0, 351.0, 320.0, 327.0, 274.0, 217.0, 189.0, 186.0, 167.0, 133.0, 96.0, 87.0, 70.0, 51.0, 31.0, 33.0, 32.0, 30.0, 36.0], [424.0, 384.0, 366.0, 413.0, 434.0, 456.0, 480.0, 527.0, 530.0, 552.0, 645.0, 620.0, 682.0, 666.0, 728.0, 700.0, 760.0, 763.0, 700.0, 753.0, 746.0, 721.0, 759.0, 756.0, 797.0, 754.0, 709.0, 709.0, 678.0, 638.0, 587.0, 540.0, 502.0, 486.0, 455.0, 449.0, 389.0, 364.0, 286.0, 292.0, 212.0, 208.0, 157.0, 159.0, 116.0, 101.0, 79.0, 66.0, 49.0], [328.0, 240.0, 201.0, 228.0, 257.0, 254.0, 292.0, 305.0, 360.0, 393.0, 367.0, 361.0, 450.0, 460.0, 498.0, 521.0, 547.0, 569.0, 690.0, 690.0, 686.0, 685.0, 692.0, 705.0, 807.0, 776.0, 770.0, 758.0, 760.0, 759.0, 729.0, 731.0, 656.0, 734.0, 668.0, 682.0, 606.0, 602.0, 562.0, 542.0, 441.0, 377.0, 378.0, 355.0, 281.0, 232.0, 196.0, 154.0, 123.0], [262.0, 196.0, 146.0, 144.0, 135.0, 152.0, 149.0, 169.0, 220.0, 233.0, 227.0, 276.0, 275.0, 303.0, 346.0, 399.0, 405.0, 406.0, 481.0, 480.0, 510.0, 478.0, 560.0, 577.0, 651.0, 673.0, 723.0, 669.0, 705.0, 762.0, 745.0, 776.0, 783.0, 817.0, 827.0, 765.0, 778.0, 773.0, 787.0, 715.0, 699.0, 644.0, 660.0, 650.0, 582.0, 476.0, 422.0, 344.0, 300.0], [249.0, 165.0, 131.0, 92.0, 89.0, 73.0, 99.0, 88.0, 119.0, 112.0, 139.0, 139.0, 168.0, 184.0, 192.0, 195.0, 218.0, 290.0, 294.0, 319.0, 323.0, 363.0, 396.0, 423.0, 451.0, 515.0, 557.0, 547.0, 615.0, 652.0, 668.0, 729.0, 771.0, 736.0, 875.0, 830.0, 822.0, 841.0, 931.0, 984.0, 1009.0, 914.0, 967.0, 934.0, 884.0, 904.0, 745.0, 692.0, 618.0], [234.0, 139.0, 99.0, 80.0, 80.0, 102.0, 55.0, 67.0, 72.0, 75.0, 75.0, 71.0, 89.0, 107.0, 104.0, 125.0, 137.0, 145.0, 188.0, 176.0, 199.0, 226.0, 242.0, 268.0, 275.0, 332.0, 357.0, 359.0, 469.0, 446.0, 507.0, 582.0, 641.0, 632.0, 714.0, 746.0, 830.0, 878.0, 921.0, 976.0, 996.0, 1097.0, 1167.0, 1155.0, 1224.0, 1321.0, 1326.0, 1188.0, 1153.0], [270.0, 176.0, 110.0, 74.0, 36.0, 33.0, 42.0, 37.0, 30.0, 34.0, 40.0, 50.0, 39.0, 68.0, 87.0, 84.0, 74.0, 93.0, 89.0, 113.0, 109.0, 115.0, 152.0, 183.0, 195.0, 178.0, 221.0, 239.0, 258.0, 314.0, 352.0, 344.0, 424.0, 477.0, 543.0, 616.0, 649.0, 750.0, 828.0, 891.0, 1007.0, 1048.0, 1206.0, 1269.0, 1389.0, 1559.0, 1735.0, 1730.0, 1973.0], [261.0, 135.0, 94.0, 70.0, 45.0, 48.0, 24.0, 23.0, 22.0, 28.0, 44.0, 39.0, 27.0, 27.0, 32.0, 31.0, 47.0, 41.0, 47.0, 61.0, 69.0, 61.0, 59.0, 101.0, 76.0, 128.0, 125.0, 120.0, 160.0, 207.0, 204.0, 220.0, 250.0, 294.0, 358.0, 433.0, 482.0, 514.0, 631.0, 726.0, 808.0, 930.0, 1085.0, 1313.0, 1505.0, 1623.0, 1946.0, 2286.0, 2719.0], [244.0, 123.0, 96.0, 80.0, 56.0, 47.0, 29.0, 22.0, 38.0, 21.0, 29.0, 19.0, 12.0, 24.0, 22.0, 32.0, 40.0, 39.0, 28.0, 53.0, 33.0, 40.0, 43.0, 60.0, 51.0, 77.0, 71.0, 77.0, 77.0, 103.0, 119.0, 129.0, 134.0, 179.0, 206.0, 232.0, 273.0, 338.0, 386.0, 521.0, 577.0, 662.0, 864.0, 1033.0, 1282.0, 1604.0, 1984.0, 2615.0, 3457.0], [240.0, 150.0, 106.0, 59.0, 52.0, 50.0, 22.0, 39.0, 14.0, 16.0, 41.0, 46.0, 19.0, 22.0, 27.0, 27.0, 39.0, 22.0, 28.0, 19.0, 38.0, 22.0, 18.0, 17.0, 29.0, 32.0, 39.0, 40.0, 40.0, 47.0, 52.0, 69.0, 78.0, 106.0, 126.0, 151.0, 164.0, 181.0, 244.0, 294.0, 371.0, 479.0, 584.0, 731.0, 1011.0, 1336.0, 1821.0, 2514.0, 3880.0], [229.0, 127.0, 85.0, 75.0, 44.0, 39.0, 26.0, 24.0, 42.0, 31.0, 24.0, 12.0, 22.0, 35.0, 30.0, 13.0, 14.0, 13.0, 14.0, 15.0, 20.0, 19.0, 23.0, 21.0, 22.0, 31.0, 20.0, 33.0, 19.0, 25.0, 41.0, 29.0, 47.0, 59.0, 58.0, 69.0, 83.0, 113.0, 125.0, 163.0, 202.0, 277.0, 373.0, 496.0, 677.0, 1043.0, 1511.0, 2242.0, 3848.0], [222.0, 142.0, 90.0, 69.0, 38.0, 35.0, 33.0, 45.0, 10.0, 16.0, 17.0, 13.0, 19.0, 19.0, 34.0, 39.0, 19.0, 12.0, 15.0, 18.0, 13.0, 12.0, 27.0, 19.0, 8.0, 12.0, 8.0, 21.0, 7.0, 10.0, 14.0, 32.0, 26.0, 43.0, 63.0, 35.0, 31.0, 62.0, 72.0, 84.0, 125.0, 149.0, 239.0, 281.0, 419.0, 633.0, 1063.0, 1845.0, 3538.0], [221.0, 139.0, 74.0, 57.0, 25.0, 36.0, 33.0, 40.0, 32.0, 18.0, 13.0, 12.0, 37.0, 22.0, 17.0, 12.0, 13.0, 15.0, 20.0, 19.0, 22.0, 13.0, 27.0, 9.0, 11.0, 8.0, 9.0, 11.0, 25.0, 11.0, 21.0, 6.0, 14.0, 9.0, 40.0, 27.0, 18.0, 18.0, 32.0, 36.0, 56.0, 68.0, 126.0, 166.0, 265.0, 459.0, 747.0, 1238.0, 2999.0], [271.0, 132.0, 77.0, 50.0, 27.0, 27.0, 24.0, 18.0, 35.0, 8.0, 20.0, 37.0, 15.0, 19.0, 8.0, 15.0, 26.0, 60.0, 20.0, 45.0, 31.0, 23.0, 31.0, 31.0, 9.0, 19.0, 20.0, 9.0, 4.0, 9.0, 10.0, 23.0, 31.0, 6.0, 7.0, 26.0, 4.0, 16.0, 25.0, 20.0, 22.0, 26.0, 45.0, 71.0, 134.0, 235.0, 414.0, 852.0, 2334.0], [217.0, 124.0, 88.0, 54.0, 32.0, 45.0, 27.0, 11.0, 18.0, 17.0, 18.0, 27.0, 21.0, 82.0, 25.0, 33.0, 19.0, 19.0, 15.0, 29.0, 35.0, 9.0, 14.0, 32.0, 9.0, 7.0, 46.0, 18.0, 20.0, 11.0, 10.0, 7.0, 7.0, 9.0, 5.0, 2.0, 1.0, 4.0, 9.0, 8.0, 14.0, 15.0, 26.0, 28.0, 52.0, 99.0, 230.0, 534.0, 1568.0], [236.0, 126.0, 85.0, 61.0, 22.0, 33.0, 42.0, 25.0, 14.0, 16.0, 12.0, 13.0, 12.0, 46.0, 26.0, 16.0, 14.0, 29.0, 17.0, 15.0, 47.0, 23.0, 6.0, 14.0, 13.0, 32.0, 9.0, 12.0, 5.0, 24.0, 39.0, 8.0, 24.0, 5.0, 21.0, 29.0, 3.0, 2.0, 3.0, 4.0, 13.0, 22.0, 29.0, 8.0, 30.0, 65.0, 93.0, 287.0, 1042.0], [247.0, 180.0, 126.0, 61.0, 47.0, 54.0, 51.0, 30.0, 42.0, 15.0, 9.0, 14.0, 33.0, 27.0, 32.0, 9.0, 40.0, 12.0, 15.0, 18.0, 10.0, 31.0, 14.0, 9.0, 5.0, 11.0, 7.0, 9.0, 19.0, 28.0, 13.0, 11.0, 8.0, 25.0, 4.0, 17.0, 28.0, 12.0, 9.0, 15.0, 33.0, 27.0, 6.0, 15.0, 29.0, 21.0, 57.0, 158.0, 629.0], [264.0, 149.0, 80.0, 52.0, 36.0, 36.0, 41.0, 27.0, 28.0, 16.0, 15.0, 7.0, 17.0, 20.0, 17.0, 17.0, 40.0, 18.0, 33.0, 27.0, 10.0, 12.0, 26.0, 20.0, 10.0, 27.0, 12.0, 10.0, 24.0, 1.0, 2.0, 5.0, 5.0, 2.0, 4.0, 7.0, 34.0, 14.0, 1.0, 38.0, 13.0, 2.0, 2.0, 2.0, 7.0, 57.0, 32.0, 85.0, 404.0], [243.0, 120.0, 97.0, 83.0, 58.0, 29.0, 15.0, 17.0, 62.0, 22.0, 12.0, 9.0, 52.0, 41.0, 17.0, 10.0, 15.0, 34.0, 28.0, 22.0, 18.0, 16.0, 12.0, 6.0, 8.0, 9.0, 9.0, 7.0, 9.0, 18.0, 49.0, 22.0, 6.0, 2.0, 5.0, 4.0, 4.0, 21.0, 6.0, 7.0, 19.0, 31.0, 8.0, 2.0, 1.0, 9.0, 14.0, 73.0, 213.0], [223.0, 125.0, 94.0, 62.0, 42.0, 30.0, 19.0, 18.0, 28.0, 19.0, 12.0, 22.0, 50.0, 16.0, 33.0, 20.0, 16.0, 17.0, 28.0, 20.0, 17.0, 6.0, 14.0, 13.0, 24.0, 24.0, 13.0, 13.0, 29.0, 18.0, 18.0, 4.0, 6.0, 19.0, 10.0, 2.0, 4.0, 2.0, 6.0, 2.0, 18.0, 13.0, 3.0, 2.0, 5.0, 7.0, 12.0, 25.0, 122.0], [234.0, 139.0, 95.0, 77.0, 22.0, 29.0, 20.0, 13.0, 18.0, 11.0, 11.0, 19.0, 10.0, 13.0, 23.0, 15.0, 12.0, 55.0, 23.0, 11.0, 11.0, 31.0, 14.0, 12.0, 8.0, 9.0, 10.0, 20.0, 13.0, 5.0, 29.0, 6.0, 5.0, 14.0, 17.0, 5.0, 3.0, 4.0, 9.0, 4.0, 2.0, 4.0, 3.0, 5.0, 2.0, 5.0, 8.0, 34.0, 84.0], [251.0, 140.0, 103.0, 66.0, 36.0, 25.0, 13.0, 56.0, 28.0, 33.0, 19.0, 13.0, 32.0, 16.0, 17.0, 12.0, 22.0, 18.0, 16.0, 12.0, 13.0, 12.0, 9.0, 5.0, 9.0, 14.0, 28.0, 10.0, 4.0, 7.0, 24.0, 13.0, 5.0, 3.0, 3.0, 5.0, 1.0, 16.0, 15.0, 2.0, 2.0, 10.0, 22.0, 2.0, 4.0, 8.0, 5.0, 7.0, 61.0], [224.0, 132.0, 98.0, 70.0, 39.0, 20.0, 17.0, 26.0, 31.0, 25.0, 27.0, 11.0, 37.0, 14.0, 21.0, 14.0, 13.0, 15.0, 14.0, 6.0, 16.0, 19.0, 16.0, 9.0, 8.0, 7.0, 9.0, 3.0, 3.0, 11.0, 41.0, 19.0, 5.0, 2.0, 5.0, 2.0, 2.0, 4.0, 7.0, 1.0, 0.0, 6.0, 5.0, 2.0, 3.0, 25.0, 5.0, 15.0, 27.0], [235.0, 108.0, 75.0, 67.0, 66.0, 23.0, 35.0, 13.0, 13.0, 17.0, 26.0, 20.0, 15.0, 30.0, 21.0, 20.0, 12.0, 11.0, 12.0, 9.0, 12.0, 10.0, 33.0, 19.0, 10.0, 8.0, 21.0, 13.0, 11.0, 6.0, 4.0, 13.0, 50.0, 7.0, 18.0, 16.0, 2.0, 3.0, 1.0, 2.0, 1.0, 4.0, 4.0, 4.0, 3.0, 1.0, 28.0, 32.0, 34.0], [220.0, 134.0, 93.0, 62.0, 41.0, 35.0, 19.0, 28.0, 23.0, 27.0, 44.0, 11.0, 17.0, 28.0, 10.0, 11.0, 32.0, 40.0, 27.0, 19.0, 12.0, 28.0, 12.0, 9.0, 8.0, 12.0, 14.0, 8.0, 15.0, 4.0, 4.0, 1.0, 5.0, 7.0, 3.0, 2.0, 2.0, 3.0, 4.0, 7.0, 1.0, 4.0, 4.0, 2.0, 24.0, 3.0, 6.0, 10.0, 18.0], [249.0, 131.0, 103.0, 53.0, 37.0, 49.0, 32.0, 24.0, 25.0, 23.0, 15.0, 12.0, 35.0, 23.0, 17.0, 11.0, 14.0, 17.0, 18.0, 10.0, 8.0, 13.0, 5.0, 12.0, 23.0, 9.0, 7.0, 6.0, 7.0, 7.0, 9.0, 22.0, 13.0, 2.0, 4.0, 6.0, 6.0, 3.0, 24.0, 9.0, 18.0, 11.0, 4.0, 5.0, 2.0, 8.0, 29.0, 8.0, 12.0]],
    "Name": "sCurve-0",
    "Overflow": 2332228.0,
    "Type": "Histo2d",
    "Underflow": 0.0,
    "x": {
        "AxisTitle": "Vcal",
        "Bins": 51,
        "High": 302.5,
        "Low": 47.5
    },
    "y": {
        "AxisTitle": "Occupancy",
        "Bins": 49,
        "High": 49.5,
        "Low": 0.5
    },
    "z": {
        "AxisTitle": "Number of pixels"
    }
}