time,Hardware,Voltage,Current
1625793328963,high-voltage-3,1,0.249081
time,Hardware,Voltage,Current
1625793328963,high-voltage-3,2,0.265498
time,Hardware,Voltage,Current
1625793328963,high-voltage-3,3,0.280161
time,Hardware,Voltage,Current
1625793328963,high-voltage-3,4,0.293911
time,Hardware,Voltage,Current
1625793328963,high-voltage-3,5,0.302542
time,Hardware,Voltage,Current
1625793328963,high-voltage-3,6,0.313057
time,Hardware,Voltage,Current
1625793328963,high-voltage-3,7,0.322022
time,Hardware,Voltage,Current
1625793328963,high-voltage-3,8,0.333299
time,Hardware,Voltage,Current
1625793328963,high-voltage-3,9,0.345713
time,Hardware,Voltage,Current
1625793328963,high-voltage-3,10,0.357517
time,Hardware,Voltage,Current
1625793328963,high-voltage-3,11,0.369067
time,Hardware,Voltage,Current
1625793328963,high-voltage-3,12,0.382785
time,Hardware,Voltage,Current
1625793328963,high-voltage-3,13,0.392375
time,Hardware,Voltage,Current
1625793328963,high-voltage-3,14,0.403636
time,Hardware,Voltage,Current
1625793328963,high-voltage-3,15,0.414669
time,Hardware,Voltage,Current
1625793328963,high-voltage-3,16,0.423273
time,Hardware,Voltage,Current
1625793328963,high-voltage-3,17,0.432015
time,Hardware,Voltage,Current
1625793328963,high-voltage-3,18,0.439477
time,Hardware,Voltage,Current
1625793328963,high-voltage-3,19,0.448459
time,Hardware,Voltage,Current
1625793328963,high-voltage-3,20,0.455531
time,Hardware,Voltage,Current
1625793328963,high-voltage-3,25,0.490547
time,Hardware,Voltage,Current
1625793328963,high-voltage-3,30,0.518054
time,Hardware,Voltage,Current
1625793328963,high-voltage-3,35,0.542718
time,Hardware,Voltage,Current
1625793328963,high-voltage-3,40,0.565811
time,Hardware,Voltage,Current
1625793328963,high-voltage-3,45,0.586405
time,Hardware,Voltage,Current
1625793328963,high-voltage-3,50,0.609138
time,Hardware,Voltage,Current
1625793328963,high-voltage-3,55,0.629603
time,Hardware,Voltage,Current
1625793328963,high-voltage-3,60,0.649344
time,Hardware,Voltage,Current
1625793328963,high-voltage-3,65,0.667821
time,Hardware,Voltage,Current
1625793328963,high-voltage-3,70,0.688643
time,Hardware,Voltage,Current
1625793328963,high-voltage-3,75,0.707656
time,Hardware,Voltage,Current
1625793328963,high-voltage-3,80,0.727347
time,Hardware,Voltage,Current
1625793328963,high-voltage-3,85,0.746511
time,Hardware,Voltage,Current
1625793328963,high-voltage-3,90,0.76616
time,Hardware,Voltage,Current
1625793328963,high-voltage-3,95,0.78468
time,Hardware,Voltage,Current
1625793328963,high-voltage-3,100,0.802266
