{
    "Data": [0.0, 0.0, 0.0, 0.0, 0.0, 0.0, 0.0, 0.0, 0.0, 0.0, 0.0, 0.0, 0.0, 0.0, 6.0, 0.0, 0.0, 16.0, 564.0, 375.0, 24.0, 127.0, 2879.0, 3959.0, 429.0, 337.0, 2346.0, 3667.0, 735.0, 389.0, 1461.0, 2361.0, 898.0, 262.0, 376.0, 505.0, 367.0, 247.0, 468.0, 523.0, 395.0, 506.0, 945.0, 1779.0, 1406.0, 1220.0, 1901.0, 3012.0, 2953.0, 2603.0, 2402.0, 2369.0, 2827.0, 2161.0, 2083.0, 2009.0, 2328.0, 2062.0, 1724.0, 1713.0, 1654.0, 1536.0, 1082.0, 841.0, 763.0, 808.0, 804.0, 597.0, 548.0, 470.0, 547.0, 476.0, 373.0, 323.0, 262.0, 263.0, 247.0, 266.0, 174.0, 176.0, 168.0, 148.0, 123.0, 115.0, 96.0, 101.0, 67.0, 63.0, 71.0, 57.0, 42.0, 45.0, 38.0, 46.0, 40.0, 44.0, 41.0, 35.0, 27.0, 36.0, 27.0, 26.0, 31.0, 35.0, 23.0, 17.0, 19.0, 9.0, 12.0, 15.0, 12.0, 8.0, 8.0, 14.0, 10.0, 9.0, 11.0, 12.0, 8.0, 12.0, 10.0, 15.0, 12.0, 7.0, 10.0, 7.0, 3.0, 4.0, 6.0, 3.0, 5.0, 2.0, 6.0, 2.0, 4.0, 3.0, 2.0, 7.0, 5.0, 5.0, 5.0, 5.0, 5.0, 7.0, 3.0, 3.0, 4.0, 0.0, 3.0, 2.0, 2.0, 1.0, 0.0, 0.0, 2.0, 0.0, 3.0, 2.0, 0.0, 0.0, 1.0, 4.0, 4.0, 2.0, 0.0, 2.0, 0.0, 4.0, 0.0, 0.0, 1.0, 2.0, 1.0, 0.0, 1.0, 2.0, 2.0, 1.0, 3.0, 0.0, 2.0, 2.0, 0.0, 0.0, 0.0, 0.0, 1.0, 0.0, 0.0, 0.0, 1.0, 0.0, 0.0, 1.0, 1.0, 0.0, 0.0, 0.0, 0.0, 1.0, 0.0],
    "Name": "TimePerFitDist-0",
    "Overflow": 105.0,
    "Type": "Histo1d",
    "Underflow": 0.0,
    "x": {
        "AxisTitle": "Fit Time [us]",
        "Bins": 201,
        "High": 401.0,
        "Low": -1.0
    },
    "y": {
        "AxisTitle": "Number of Pixels"
    },
    "z": {
        "AxisTitle": "z"
    }
}