time,Hardware,Voltage,Current
1626313114087,high-voltage,1,0.0529884
time,Hardware,Voltage,Current
1626313114087,high-voltage,2,0.0737481
time,Hardware,Voltage,Current
1626313114087,high-voltage,3,0.0870157
time,Hardware,Voltage,Current
1626313114087,high-voltage,4,0.0947063
time,Hardware,Voltage,Current
1626313114087,high-voltage,5,0.103383
time,Hardware,Voltage,Current
1626313114087,high-voltage,6,0.11313
time,Hardware,Voltage,Current
1626313114087,high-voltage,7,0.1229
time,Hardware,Voltage,Current
1626313114087,high-voltage,8,0.13335
time,Hardware,Voltage,Current
1626313114087,high-voltage,9,0.144651
time,Hardware,Voltage,Current
1626313114087,high-voltage,10,0.158001
time,Hardware,Voltage,Current
1626313114087,high-voltage,11,0.171389
time,Hardware,Voltage,Current
1626313114087,high-voltage,12,0.183669
time,Hardware,Voltage,Current
1626313114087,high-voltage,13,0.197308
time,Hardware,Voltage,Current
1626313114087,high-voltage,14,0.208378
time,Hardware,Voltage,Current
1626313114087,high-voltage,15,0.218655
time,Hardware,Voltage,Current
1626313114087,high-voltage,16,0.226887
time,Hardware,Voltage,Current
1626313114087,high-voltage,17,0.236122
time,Hardware,Voltage,Current
1626313114087,high-voltage,18,0.242829
time,Hardware,Voltage,Current
1626313114087,high-voltage,19,0.24936
time,Hardware,Voltage,Current
1626313114087,high-voltage,20,0.25695
time,Hardware,Voltage,Current
1626313114087,high-voltage,25,0.287156
time,Hardware,Voltage,Current
1626313114087,high-voltage,30,0.321702
time,Hardware,Voltage,Current
1626313114087,high-voltage,35,0.384884
time,Hardware,Voltage,Current
1626313114087,high-voltage,40,0.52939
time,Hardware,Voltage,Current
1626313114087,high-voltage,45,0.810024
time,Hardware,Voltage,Current
1626313114087,high-voltage,50,1.26437
time,Hardware,Voltage,Current
1626313114087,high-voltage,55,1.9916
time,Hardware,Voltage,Current
1626313114087,high-voltage,60,3.10438
time,Hardware,Voltage,Current
1626313114087,high-voltage,65,4.63827
time,Hardware,Voltage,Current
1626313114087,high-voltage,70,6.70504
time,Hardware,Voltage,Current
1626313114087,high-voltage,75,9.57316
time,Hardware,Voltage,Current
1626313114087,high-voltage,80,10
