{
    "Data": [[7188.0, 3927.0, 2815.0, 2190.0, 1769.0, 1490.0, 1418.0, 1197.0, 1137.0, 1013.0, 940.0, 896.0, 852.0, 797.0, 742.0, 739.0, 702.0, 634.0, 621.0, 605.0, 607.0, 578.0, 574.0, 573.0, 610.0, 557.0, 533.0, 528.0, 511.0, 503.0, 495.0, 508.0, 519.0, 492.0, 486.0, 486.0, 494.0, 521.0, 482.0, 502.0, 487.0, 490.0, 522.0, 550.0, 548.0, 576.0, 648.0, 699.0, 776.0], [7264.0, 3970.0, 2685.0, 2307.0, 1849.0, 1539.0, 1426.0, 1222.0, 1118.0, 1027.0, 952.0, 881.0, 876.0, 803.0, 835.0, 750.0, 749.0, 692.0, 618.0, 640.0, 615.0, 612.0, 557.0, 571.0, 541.0, 566.0, 533.0, 516.0, 552.0, 468.0, 586.0, 533.0, 488.0, 544.0, 528.0, 508.0, 507.0, 553.0, 474.0, 530.0, 530.0, 548.0, 572.0, 597.0, 621.0, 629.0, 685.0, 710.0, 949.0], [7266.0, 3951.0, 2845.0, 2203.0, 1891.0, 1596.0, 1365.0, 1236.0, 1169.0, 1069.0, 956.0, 893.0, 873.0, 841.0, 819.0, 741.0, 728.0, 701.0, 648.0, 667.0, 621.0, 596.0, 620.0, 571.0, 607.0, 601.0, 503.0, 524.0, 574.0, 519.0, 540.0, 521.0, 552.0, 514.0, 527.0, 511.0, 520.0, 524.0, 530.0, 549.0, 593.0, 604.0, 579.0, 628.0, 650.0, 730.0, 824.0, 894.0, 1128.0], [7248.0, 3887.0, 2774.0, 2106.0, 1849.0, 1607.0, 1368.0, 1263.0, 1155.0, 1114.0, 991.0, 951.0, 884.0, 771.0, 814.0, 786.0, 744.0, 758.0, 637.0, 641.0, 622.0, 630.0, 592.0, 576.0, 619.0, 558.0, 552.0, 560.0, 554.0, 562.0, 564.0, 553.0, 562.0, 541.0, 615.0, 524.0, 590.0, 524.0, 544.0, 546.0, 577.0, 592.0, 661.0, 644.0, 720.0, 754.0, 860.0, 1043.0, 1339.0], [7063.0, 3903.0, 2839.0, 2328.0, 1866.0, 1576.0, 1406.0, 1319.0, 1126.0, 1075.0, 956.0, 902.0, 843.0, 845.0, 827.0, 745.0, 728.0, 679.0, 727.0, 687.0, 691.0, 603.0, 582.0, 620.0, 533.0, 556.0, 596.0, 594.0, 553.0, 572.0, 577.0, 542.0, 563.0, 560.0, 572.0, 522.0, 521.0, 565.0, 583.0, 595.0, 624.0, 628.0, 663.0, 693.0, 742.0, 825.0, 886.0, 1154.0, 1607.0], [6904.0, 3942.0, 2775.0, 2230.0, 1831.0, 1567.0, 1370.0, 1249.0, 1157.0, 1049.0, 953.0, 961.0, 911.0, 853.0, 799.0, 785.0, 738.0, 685.0, 693.0, 634.0, 614.0, 626.0, 637.0, 632.0, 611.0, 601.0, 535.0, 584.0, 538.0, 587.0, 541.0, 530.0, 587.0, 560.0, 600.0, 590.0, 597.0, 601.0, 567.0, 621.0, 621.0, 642.0, 722.0, 724.0, 774.0, 796.0, 940.0, 1201.0, 1766.0], [6943.0, 3853.0, 2818.0, 2160.0, 1861.0, 1539.0, 1410.0, 1249.0, 1123.0, 1044.0, 1061.0, 919.0, 878.0, 831.0, 773.0, 780.0, 721.0, 749.0, 651.0, 668.0, 634.0, 605.0, 627.0, 618.0, 607.0, 566.0, 563.0, 545.0, 564.0, 572.0, 553.0, 560.0, 547.0, 559.0, 605.0, 560.0, 585.0, 602.0, 570.0, 617.0, 662.0, 711.0, 683.0, 715.0, 820.0, 869.0, 1038.0, 1255.0, 1932.0], [6984.0, 3853.0, 2722.0, 2184.0, 1794.0, 1526.0, 1362.0, 1224.0, 1118.0, 1051.0, 974.0, 903.0, 823.0, 792.0, 787.0, 755.0, 718.0, 706.0, 686.0, 681.0, 678.0, 627.0, 572.0, 631.0, 590.0, 629.0, 595.0, 537.0, 508.0, 540.0, 548.0, 568.0, 582.0, 562.0, 569.0, 526.0, 609.0, 599.0, 612.0, 572.0, 648.0, 705.0, 693.0, 733.0, 803.0, 913.0, 1004.0, 1332.0, 2052.0], [6677.0, 3761.0, 2666.0, 2123.0, 1783.0, 1589.0, 1351.0, 1225.0, 1123.0, 982.0, 951.0, 914.0, 859.0, 836.0, 825.0, 719.0, 723.0, 638.0, 642.0, 651.0, 665.0, 608.0, 583.0, 570.0, 611.0, 601.0, 584.0, 549.0, 565.0, 534.0, 561.0, 562.0, 557.0, 547.0, 562.0, 517.0, 586.0, 619.0, 619.0, 613.0, 664.0, 677.0, 739.0, 743.0, 809.0, 864.0, 995.0, 1414.0, 2115.0], [6544.0, 3784.0, 2704.0, 2091.0, 1770.0, 1504.0, 1329.0, 1211.0, 1125.0, 972.0, 893.0, 826.0, 798.0, 837.0, 749.0, 742.0, 695.0, 655.0, 618.0, 628.0, 641.0, 580.0, 608.0, 615.0, 586.0, 570.0, 593.0, 596.0, 553.0, 573.0, 549.0, 557.0, 539.0, 579.0, 499.0, 553.0, 596.0, 572.0, 634.0, 601.0, 626.0, 639.0, 681.0, 766.0, 796.0, 938.0, 1071.0, 1361.0, 2218.0], [6449.0, 3720.0, 2684.0, 2029.0, 1701.0, 1445.0, 1316.0, 1211.0, 1100.0, 944.0, 905.0, 866.0, 812.0, 757.0, 756.0, 739.0, 684.0, 685.0, 627.0, 663.0, 612.0, 629.0, 597.0, 548.0, 572.0, 577.0, 560.0, 550.0, 576.0, 535.0, 504.0, 519.0, 552.0, 515.0, 528.0, 571.0, 533.0, 564.0, 606.0, 613.0, 585.0, 668.0, 720.0, 736.0, 864.0, 870.0, 993.0, 1354.0, 2234.0], [6390.0, 3546.0, 2592.0, 2024.0, 1694.0, 1501.0, 1241.0, 1180.0, 1036.0, 940.0, 895.0, 849.0, 825.0, 750.0, 716.0, 712.0, 677.0, 623.0, 612.0, 645.0, 584.0, 587.0, 568.0, 586.0, 541.0, 532.0, 517.0, 577.0, 528.0, 507.0, 572.0, 557.0, 525.0, 538.0, 514.0, 515.0, 521.0, 547.0, 559.0, 558.0, 636.0, 666.0, 621.0, 757.0, 821.0, 932.0, 1104.0, 1323.0, 2182.0], [6400.0, 3527.0, 2592.0, 2028.0, 1658.0, 1385.0, 1280.0, 1120.0, 994.0, 901.0, 906.0, 856.0, 730.0, 781.0, 718.0, 670.0, 661.0, 655.0, 627.0, 567.0, 591.0, 577.0, 546.0, 559.0, 531.0, 576.0, 517.0, 526.0, 541.0, 508.0, 499.0, 492.0, 535.0, 517.0, 498.0, 513.0, 521.0, 579.0, 558.0, 546.0, 587.0, 610.0, 676.0, 682.0, 762.0, 876.0, 1018.0, 1292.0, 2189.0], [6280.0, 3543.0, 2520.0, 2005.0, 1604.0, 1423.0, 1212.0, 1071.0, 990.0, 945.0, 850.0, 774.0, 785.0, 685.0, 667.0, 652.0, 654.0, 651.0, 619.0, 560.0, 591.0, 546.0, 523.0, 584.0, 499.0, 581.0, 526.0, 528.0, 514.0, 480.0, 522.0, 504.0, 500.0, 508.0, 504.0, 518.0, 505.0, 518.0, 500.0, 567.0, 601.0, 606.0, 642.0, 682.0, 722.0, 876.0, 949.0, 1268.0, 2124.0], [6639.0, 3456.0, 2482.0, 1920.0, 1569.0, 1342.0, 1221.0, 1094.0, 986.0, 804.0, 820.0, 785.0, 730.0, 678.0, 704.0, 637.0, 653.0, 570.0, 634.0, 564.0, 585.0, 542.0, 555.0, 522.0, 526.0, 492.0, 500.0, 486.0, 481.0, 432.0, 471.0, 499.0, 494.0, 488.0, 527.0, 486.0, 528.0, 514.0, 505.0, 547.0, 546.0, 554.0, 651.0, 654.0, 712.0, 828.0, 913.0, 1202.0, 2062.0], [6861.0, 3475.0, 2358.0, 1801.0, 1598.0, 1307.0, 1165.0, 1042.0, 947.0, 849.0, 806.0, 785.0, 698.0, 744.0, 651.0, 646.0, 635.0, 608.0, 552.0, 528.0, 522.0, 547.0, 492.0, 499.0, 522.0, 478.0, 497.0, 483.0, 497.0, 434.0, 453.0, 459.0, 491.0, 412.0, 452.0, 456.0, 526.0, 477.0, 494.0, 506.0, 526.0, 582.0, 604.0, 673.0, 707.0, 767.0, 887.0, 1189.0, 1969.0], [7086.0, 3638.0, 2376.0, 1851.0, 1552.0, 1379.0, 1161.0, 1025.0, 991.0, 828.0, 791.0, 744.0, 727.0, 679.0, 590.0, 659.0, 593.0, 533.0, 523.0, 541.0, 532.0, 538.0, 465.0, 507.0, 481.0, 484.0, 475.0, 442.0, 398.0, 440.0, 402.0, 462.0, 455.0, 471.0, 458.0, 445.0, 444.0, 475.0, 493.0, 513.0, 541.0, 532.0, 573.0, 594.0, 665.0, 677.0, 849.0, 1121.0, 1877.0], [7709.0, 3674.0, 2463.0, 1843.0, 1519.0, 1231.0, 1172.0, 1039.0, 877.0, 845.0, 811.0, 710.0, 695.0, 611.0, 667.0, 576.0, 555.0, 558.0, 504.0, 537.0, 493.0, 483.0, 480.0, 495.0, 491.0, 468.0, 450.0, 473.0, 445.0, 464.0, 414.0, 458.0, 427.0, 441.0, 450.0, 428.0, 411.0, 462.0, 410.0, 476.0, 436.0, 499.0, 523.0, 581.0, 603.0, 688.0, 786.0, 1033.0, 1702.0], [8425.0, 3969.0, 2618.0, 1875.0, 1548.0, 1287.0, 1133.0, 980.0, 891.0, 829.0, 741.0, 720.0, 648.0, 628.0, 606.0, 604.0, 547.0, 555.0, 525.0, 511.0, 507.0, 493.0, 442.0, 479.0, 462.0, 471.0, 457.0, 392.0, 453.0, 447.0, 388.0, 404.0, 417.0, 429.0, 420.0, 402.0, 434.0, 428.0, 401.0, 399.0, 418.0, 470.0, 520.0, 513.0, 598.0, 638.0, 715.0, 966.0, 1668.0], [9281.0, 4501.0, 2852.0, 1966.0, 1586.0, 1331.0, 1061.0, 965.0, 888.0, 829.0, 757.0, 734.0, 654.0, 616.0, 566.0, 539.0, 562.0, 573.0, 479.0, 486.0, 490.0, 503.0, 446.0, 446.0, 419.0, 395.0, 413.0, 423.0, 452.0, 416.0, 435.0, 412.0, 363.0, 380.0, 390.0, 415.0, 401.0, 404.0, 388.0, 431.0, 415.0, 488.0, 467.0, 525.0, 546.0, 580.0, 680.0, 851.0, 1484.0], [9809.0, 4956.0, 3173.0, 2115.0, 1573.0, 1334.0, 1138.0, 998.0, 908.0, 758.0, 856.0, 659.0, 627.0, 601.0, 603.0, 559.0, 522.0, 545.0, 472.0, 468.0, 503.0, 478.0, 421.0, 448.0, 426.0, 423.0, 392.0, 385.0, 423.0, 419.0, 425.0, 401.0, 430.0, 379.0, 370.0, 365.0, 378.0, 398.0, 397.0, 397.0, 423.0, 446.0, 431.0, 507.0, 482.0, 553.0, 617.0, 781.0, 1395.0], [10325.0, 5476.0, 3518.0, 2334.0, 1688.0, 1377.0, 1141.0, 956.0, 831.0, 833.0, 772.0, 700.0, 677.0, 623.0, 615.0, 568.0, 477.0, 520.0, 491.0, 498.0, 472.0, 454.0, 425.0, 454.0, 384.0, 388.0, 426.0, 408.0, 391.0, 369.0, 355.0, 394.0, 391.0, 380.0, 409.0, 343.0, 375.0, 385.0, 361.0, 440.0, 387.0, 404.0, 425.0, 458.0, 470.0, 507.0, 588.0, 776.0, 1258.0], [10488.0, 5977.0, 3960.0, 2573.0, 2018.0, 1517.0, 1270.0, 1064.0, 897.0, 804.0, 712.0, 678.0, 645.0, 603.0, 575.0, 586.0, 526.0, 511.0, 484.0, 481.0, 442.0, 464.0, 418.0, 411.0, 453.0, 411.0, 392.0, 394.0, 392.0, 389.0, 349.0, 349.0, 381.0, 370.0, 326.0, 375.0, 317.0, 359.0, 369.0, 375.0, 419.0, 385.0, 438.0, 415.0, 450.0, 462.0, 534.0, 656.0, 1140.0], [10363.0, 6278.0, 4361.0, 3133.0, 2184.0, 1830.0, 1356.0, 1134.0, 1004.0, 922.0, 772.0, 690.0, 622.0, 591.0, 551.0, 535.0, 489.0, 519.0, 453.0, 470.0, 452.0, 475.0, 436.0, 407.0, 411.0, 400.0, 358.0, 406.0, 352.0, 394.0, 394.0, 341.0, 351.0, 387.0, 353.0, 377.0, 337.0, 383.0, 381.0, 348.0, 364.0, 359.0, 376.0, 401.0, 434.0, 468.0, 535.0, 634.0, 1079.0], [10156.0, 6265.0, 4595.0, 3451.0, 2601.0, 2002.0, 1591.0, 1278.0, 1058.0, 1003.0, 814.0, 757.0, 693.0, 612.0, 557.0, 569.0, 514.0, 480.0, 541.0, 451.0, 475.0, 438.0, 411.0, 421.0, 404.0, 352.0, 373.0, 364.0, 385.0, 378.0, 366.0, 362.0, 383.0, 347.0, 327.0, 352.0, 376.0, 334.0, 350.0, 316.0, 339.0, 360.0, 367.0, 371.0, 430.0, 446.0, 476.0, 616.0, 992.0], [9508.0, 6221.0, 4631.0, 3562.0, 2765.0, 2273.0, 1721.0, 1531.0, 1195.0, 1040.0, 924.0, 856.0, 708.0, 641.0, 665.0, 523.0, 552.0, 501.0, 477.0, 468.0, 453.0, 451.0, 440.0, 432.0, 410.0, 398.0, 395.0, 367.0, 341.0, 348.0, 353.0, 341.0, 322.0, 330.0, 324.0, 346.0, 320.0, 316.0, 313.0, 338.0, 368.0, 349.0, 389.0, 384.0, 385.0, 376.0, 480.0, 537.0, 902.0], [9204.0, 5991.0, 4633.0, 3574.0, 2926.0, 2457.0, 1954.0, 1704.0, 1396.0, 1228.0, 1034.0, 859.0, 795.0, 708.0, 615.0, 536.0, 519.0, 522.0, 511.0, 451.0, 401.0, 424.0, 425.0, 447.0, 383.0, 376.0, 370.0, 395.0, 398.0, 370.0, 347.0, 328.0, 377.0, 323.0, 354.0, 345.0, 346.0, 312.0, 312.0, 317.0, 318.0, 325.0, 358.0, 352.0, 361.0, 424.0, 445.0, 524.0, 801.0], [9003.0, 5780.0, 4695.0, 3532.0, 2970.0, 2570.0, 2146.0, 1694.0, 1453.0, 1287.0, 1115.0, 952.0, 905.0, 772.0, 707.0, 599.0, 610.0, 524.0, 498.0, 491.0, 506.0, 473.0, 412.0, 431.0, 397.0, 408.0, 343.0, 404.0, 373.0, 340.0, 361.0, 337.0, 343.0, 329.0, 339.0, 334.0, 308.0, 322.0, 310.0, 315.0, 347.0, 342.0, 366.0, 359.0, 380.0, 393.0, 405.0, 488.0, 729.0], [8509.0, 5555.0, 4528.0, 3522.0, 2946.0, 2520.0, 2225.0, 1916.0, 1685.0, 1441.0, 1249.0, 1069.0, 1011.0, 869.0, 807.0, 758.0, 685.0, 625.0, 584.0, 550.0, 491.0, 481.0, 433.0, 416.0, 406.0, 380.0, 410.0, 373.0, 371.0, 362.0, 328.0, 313.0, 321.0, 368.0, 322.0, 319.0, 290.0, 293.0, 349.0, 321.0, 333.0, 354.0, 329.0, 339.0, 329.0, 360.0, 385.0, 466.0, 694.0], [8614.0, 5429.0, 4468.0, 3430.0, 2917.0, 2417.0, 2078.0, 1849.0, 1702.0, 1400.0, 1248.0, 1098.0, 1040.0, 930.0, 838.0, 754.0, 691.0, 696.0, 625.0, 584.0, 513.0, 489.0, 486.0, 425.0, 462.0, 376.0, 385.0, 363.0, 390.0, 324.0, 342.0, 343.0, 320.0, 329.0, 301.0, 335.0, 314.0, 323.0, 326.0, 318.0, 344.0, 347.0, 338.0, 318.0, 356.0, 357.0, 448.0, 445.0, 682.0], [8038.0, 5311.0, 4191.0, 3440.0, 2939.0, 2609.0, 2139.0, 2082.0, 1742.0, 1535.0, 1444.0, 1325.0, 1137.0, 1088.0, 937.0, 856.0, 803.0, 728.0, 649.0, 641.0, 571.0, 559.0, 525.0, 498.0, 491.0, 400.0, 447.0, 420.0, 404.0, 359.0, 343.0, 332.0, 319.0, 357.0, 338.0, 324.0, 325.0, 315.0, 287.0, 299.0, 323.0, 332.0, 304.0, 322.0, 346.0, 351.0, 357.0, 423.0, 611.0], [8161.0, 5259.0, 4100.0, 3356.0, 2887.0, 2451.0, 2161.0, 1931.0, 1771.0, 1478.0, 1350.0, 1257.0, 1213.0, 984.0, 931.0, 918.0, 802.0, 783.0, 737.0, 666.0, 625.0, 582.0, 528.0, 553.0, 503.0, 494.0, 445.0, 458.0, 407.0, 394.0, 376.0, 345.0, 359.0, 360.0, 347.0, 315.0, 328.0, 317.0, 314.0, 292.0, 328.0, 324.0, 330.0, 311.0, 320.0, 317.0, 337.0, 423.0, 590.0], [7627.0, 4886.0, 4054.0, 3380.0, 2823.0, 2447.0, 2177.0, 1994.0, 1816.0, 1568.0, 1478.0, 1323.0, 1180.0, 1172.0, 1054.0, 956.0, 912.0, 843.0, 781.0, 769.0, 696.0, 654.0, 635.0, 587.0, 581.0, 590.0, 470.0, 486.0, 454.0, 411.0, 412.0, 407.0, 422.0, 363.0, 364.0, 333.0, 348.0, 373.0, 314.0, 325.0, 293.0, 291.0, 333.0, 327.0, 301.0, 316.0, 350.0, 365.0, 602.0], [7536.0, 4857.0, 4083.0, 3143.0, 2765.0, 2432.0, 2141.0, 1960.0, 1715.0, 1603.0, 1428.0, 1311.0, 1265.0, 1125.0, 1047.0, 1052.0, 966.0, 925.0, 850.0, 812.0, 712.0, 700.0, 709.0, 629.0, 609.0, 580.0, 539.0, 510.0, 501.0, 471.0, 457.0, 427.0, 422.0, 420.0, 407.0, 377.0, 348.0, 337.0, 367.0, 318.0, 323.0, 321.0, 313.0, 292.0, 294.0, 338.0, 367.0, 363.0, 528.0], [7242.0, 4788.0, 4002.0, 3270.0, 2652.0, 2529.0, 2138.0, 1928.0, 1789.0, 1594.0, 1435.0, 1345.0, 1226.0, 1145.0, 1084.0, 965.0, 923.0, 913.0, 798.0, 775.0, 723.0, 758.0, 690.0, 672.0, 659.0, 624.0, 574.0, 531.0, 529.0, 500.0, 556.0, 461.0, 439.0, 417.0, 422.0, 429.0, 358.0, 406.0, 346.0, 358.0, 333.0, 352.0, 329.0, 370.0, 378.0, 351.0, 346.0, 332.0, 493.0], [7217.0, 4719.0, 3548.0, 3110.0, 2584.0, 2296.0, 2092.0, 1848.0, 1690.0, 1551.0, 1426.0, 1360.0, 1193.0, 1204.0, 1066.0, 994.0, 974.0, 898.0, 896.0, 831.0, 811.0, 777.0, 787.0, 742.0, 742.0, 719.0, 659.0, 630.0, 558.0, 611.0, 580.0, 520.0, 491.0, 469.0, 481.0, 470.0, 432.0, 457.0, 404.0, 410.0, 386.0, 397.0, 403.0, 345.0, 364.0, 315.0, 317.0, 348.0, 497.0], [6943.0, 4404.0, 3647.0, 2911.0, 2523.0, 2305.0, 2119.0, 1892.0, 1728.0, 1627.0, 1447.0, 1379.0, 1216.0, 1228.0, 1165.0, 996.0, 989.0, 930.0, 887.0, 819.0, 813.0, 793.0, 725.0, 740.0, 713.0, 663.0, 591.0, 614.0, 630.0, 628.0, 606.0, 577.0, 537.0, 572.0, 532.0, 531.0, 498.0, 521.0, 473.0, 472.0, 427.0, 433.0, 386.0, 439.0, 387.0, 400.0, 348.0, 387.0, 457.0], [6859.0, 4318.0, 3348.0, 2810.0, 2498.0, 2213.0, 2022.0, 1870.0, 1783.0, 1613.0, 1496.0, 1319.0, 1385.0, 1149.0, 1067.0, 1026.0, 981.0, 909.0, 857.0, 738.0, 804.0, 782.0, 698.0, 728.0, 685.0, 645.0, 652.0, 650.0, 630.0, 646.0, 637.0, 647.0, 574.0, 625.0, 588.0, 608.0, 566.0, 544.0, 583.0, 515.0, 513.0, 504.0, 495.0, 453.0, 426.0, 456.0, 396.0, 411.0, 524.0], [6559.0, 4184.0, 3354.0, 2956.0, 2329.0, 2190.0, 2022.0, 1800.0, 1659.0, 1530.0, 1381.0, 1411.0, 1267.0, 1140.0, 1050.0, 1018.0, 893.0, 946.0, 903.0, 846.0, 752.0, 726.0, 733.0, 681.0, 665.0, 700.0, 617.0, 633.0, 653.0, 642.0, 607.0, 610.0, 623.0, 673.0, 610.0, 593.0, 638.0, 623.0, 595.0, 605.0, 636.0, 579.0, 575.0, 568.0, 546.0, 543.0, 489.0, 486.0, 569.0], [6561.0, 3987.0, 3157.0, 2615.0, 2193.0, 1996.0, 1932.0, 1927.0, 1553.0, 1445.0, 1368.0, 1258.0, 1239.0, 1061.0, 1122.0, 1062.0, 1027.0, 1025.0, 938.0, 886.0, 874.0, 792.0, 801.0, 753.0, 754.0, 689.0, 703.0, 693.0, 642.0, 686.0, 644.0, 642.0, 602.0, 585.0, 593.0, 578.0, 601.0, 605.0, 619.0, 634.0, 645.0, 641.0, 654.0, 674.0, 635.0, 584.0, 626.0, 636.0, 672.0], [6283.0, 3867.0, 2995.0, 2433.0, 2174.0, 1941.0, 1724.0, 1566.0, 1442.0, 1403.0, 1351.0, 1242.0, 1255.0, 1153.0, 1058.0, 971.0, 961.0, 924.0, 889.0, 879.0, 847.0, 773.0, 773.0, 803.0, 718.0, 764.0, 742.0, 731.0, 733.0, 598.0, 608.0, 607.0, 585.0, 593.0, 609.0, 612.0, 612.0, 641.0, 591.0, 651.0, 682.0, 752.0, 782.0, 785.0, 837.0, 743.0, 913.0, 801.0, 877.0], [6306.0, 3610.0, 2974.0, 2381.0, 1997.0, 1976.0, 1718.0, 1624.0, 1506.0, 1452.0, 1308.0, 1266.0, 1184.0, 1177.0, 1110.0, 1003.0, 917.0, 891.0, 810.0, 768.0, 763.0, 788.0, 737.0, 759.0, 748.0, 693.0, 691.0, 660.0, 626.0, 635.0, 649.0, 628.0, 625.0, 598.0, 597.0, 561.0, 542.0, 597.0, 603.0, 624.0, 611.0, 729.0, 746.0, 799.0, 886.0, 922.0, 1027.0, 999.0, 1143.0], [6009.0, 3660.0, 2838.0, 2348.0, 1825.0, 1683.0, 1630.0, 1489.0, 1363.0, 1374.0, 1260.0, 1256.0, 1146.0, 1203.0, 1098.0, 980.0, 925.0, 952.0, 916.0, 873.0, 928.0, 849.0, 691.0, 686.0, 689.0, 658.0, 648.0, 636.0, 635.0, 626.0, 570.0, 618.0, 591.0, 576.0, 584.0, 532.0, 589.0, 581.0, 576.0, 627.0, 672.0, 733.0, 738.0, 833.0, 880.0, 1011.0, 1089.0, 1302.0, 1531.0], [6013.0, 3676.0, 2820.0, 2347.0, 2018.0, 1752.0, 1589.0, 1440.0, 1415.0, 1297.0, 1113.0, 1053.0, 1129.0, 1139.0, 974.0, 940.0, 947.0, 928.0, 876.0, 865.0, 721.0, 726.0, 684.0, 654.0, 603.0, 678.0, 599.0, 594.0, 681.0, 663.0, 568.0, 593.0, 509.0, 491.0, 605.0, 580.0, 530.0, 578.0, 577.0, 578.0, 656.0, 684.0, 703.0, 819.0, 896.0, 1033.0, 1254.0, 1452.0, 1803.0], [5967.0, 3590.0, 2775.0, 2412.0, 1794.0, 1594.0, 1582.0, 1431.0, 1363.0, 1241.0, 1306.0, 1181.0, 1146.0, 1094.0, 1047.0, 929.0, 912.0, 872.0, 899.0, 957.0, 960.0, 812.0, 715.0, 792.0, 666.0, 646.0, 655.0, 693.0, 622.0, 548.0, 590.0, 576.0, 665.0, 495.0, 554.0, 550.0, 551.0, 527.0, 538.0, 498.0, 568.0, 606.0, 576.0, 699.0, 757.0, 862.0, 1204.0, 1413.0, 1865.0], [5742.0, 3377.0, 2613.0, 2164.0, 1915.0, 1568.0, 1572.0, 1440.0, 1345.0, 1383.0, 1426.0, 1204.0, 1128.0, 1134.0, 1058.0, 905.0, 891.0, 833.0, 777.0, 765.0, 811.0, 832.0, 673.0, 734.0, 820.0, 716.0, 656.0, 589.0, 702.0, 615.0, 691.0, 586.0, 543.0, 552.0, 629.0, 516.0, 557.0, 518.0, 551.0, 494.0, 560.0, 538.0, 609.0, 651.0, 708.0, 756.0, 954.0, 1367.0, 2009.0], [5908.0, 3550.0, 2665.0, 2268.0, 1948.0, 1791.0, 1546.0, 1499.0, 1429.0, 1228.0, 1283.0, 1111.0, 978.0, 1011.0, 943.0, 963.0, 940.0, 854.0, 832.0, 958.0, 748.0, 896.0, 836.0, 660.0, 707.0, 706.0, 718.0, 613.0, 619.0, 574.0, 540.0, 544.0, 477.0, 524.0, 508.0, 575.0, 408.0, 457.0, 472.0, 506.0, 553.0, 555.0, 473.0, 596.0, 576.0, 729.0, 882.0, 1260.0, 2007.0], [5721.0, 3416.0, 2765.0, 2266.0, 2106.0, 1861.0, 1516.0, 1362.0, 1308.0, 1286.0, 1108.0, 1068.0, 1136.0, 1228.0, 1011.0, 901.0, 1079.0, 895.0, 947.0, 845.0, 704.0, 736.0, 639.0, 821.0, 803.0, 881.0, 699.0, 682.0, 598.0, 584.0, 613.0, 532.0, 604.0, 529.0, 493.0, 553.0, 508.0, 533.0, 534.0, 500.0, 518.0, 537.0, 542.0, 523.0, 574.0, 579.0, 742.0, 1009.0, 1827.0], [5859.0, 3473.0, 2462.0, 2241.0, 1920.0, 1810.0, 1685.0, 1584.0, 1471.0, 1248.0, 1119.0, 1277.0, 1058.0, 1133.0, 1023.0, 1030.0, 935.0, 1015.0, 831.0, 935.0, 808.0, 668.0, 684.0, 643.0, 619.0, 630.0, 590.0, 589.0, 610.0, 586.0, 480.0, 594.0, 602.0, 462.0, 518.0, 545.0, 526.0, 486.0, 491.0, 569.0, 535.0, 541.0, 498.0, 387.0, 493.0, 593.0, 657.0, 863.0, 1607.0], [5834.0, 3732.0, 2577.0, 2309.0, 1856.0, 1800.0, 1803.0, 1578.0, 1441.0, 1212.0, 1451.0, 1085.0, 1066.0, 1151.0, 1083.0, 885.0, 990.0, 896.0, 901.0, 857.0, 769.0, 790.0, 545.0, 696.0, 750.0, 586.0, 590.0, 776.0, 567.0, 693.0, 511.0, 514.0, 567.0, 538.0, 669.0, 522.0, 516.0, 464.0, 439.0, 475.0, 508.0, 505.0, 405.0, 486.0, 597.0, 559.0, 553.0, 719.0, 1342.0], [6032.0, 3804.0, 2860.0, 2129.0, 1839.0, 1785.0, 1648.0, 1619.0, 1286.0, 1396.0, 1282.0, 1333.0, 1134.0, 1048.0, 968.0, 1064.0, 920.0, 913.0, 825.0, 804.0, 783.0, 726.0, 710.0, 608.0, 703.0, 617.0, 689.0, 608.0, 671.0, 573.0, 481.0, 537.0, 595.0, 541.0, 539.0, 422.0, 413.0, 411.0, 602.0, 527.0, 439.0, 543.0, 498.0, 486.0, 630.0, 545.0, 654.0, 662.0, 1199.0]],
    "Name": "sCurve-0",
    "Overflow": 2545460.0,
    "Type": "Histo2d",
    "Underflow": 0.0,
    "x": {
        "AxisTitle": "Vcal",
        "Bins": 51,
        "High": 302.5,
        "Low": 47.5
    },
    "y": {
        "AxisTitle": "Occupancy",
        "Bins": 49,
        "High": 49.5,
        "Low": 0.5
    },
    "z": {
        "AxisTitle": "Number of pixels"
    }
}