{
    "Data": [2.0, 7.0, 2.0, 0.0, 2.0, 25.0, 154.0, 439.0, 1136.0, 2231.0, 3571.0, 4534.0, 4837.0, 4174.0, 3418.0, 3123.0, 3562.0, 4408.0, 4552.0, 4301.0, 3155.0, 2021.0, 1179.0, 718.0, 539.0, 551.0, 745.0, 873.0, 1204.0, 1489.0, 1797.0, 1998.0, 2187.0, 2214.0, 2128.0, 1844.0, 1645.0, 1401.0, 1119.0, 853.0, 675.0, 467.0, 350.0, 244.0, 196.0, 137.0, 90.0, 64.0, 45.0, 33.0, 27.0, 24.0, 17.0, 11.0, 12.0, 8.0, 6.0, 6.0, 9.0, 4.0, 4.0, 4.0, 1.0, 1.0, 1.0, 1.0, 3.0],
    "Name": "NoiseDist-0",
    "Overflow": 16.0,
    "Type": "Histo1d",
    "Underflow": 0.0,
    "x": {
        "AxisTitle": "Noise [e]",
        "Bins": 67,
        "High": 336.0,
        "Low": -2.0
    },
    "y": {
        "AxisTitle": "Number of Pixels"
    },
    "z": {
        "AxisTitle": "z"
    }
}