time,Hardware,Voltage,Current
1621624901767,high-voltage-3,1,0.106702
time,Hardware,Voltage,Current
1621624901767,high-voltage-3,2,0.113515
time,Hardware,Voltage,Current
1621624901767,high-voltage-3,3,0.119056
time,Hardware,Voltage,Current
1621624901767,high-voltage-3,4,0.125849
time,Hardware,Voltage,Current
1621624901767,high-voltage-3,5,0.128988
time,Hardware,Voltage,Current
1621624901767,high-voltage-3,6,0.133337
time,Hardware,Voltage,Current
1621624901767,high-voltage-3,7,0.134749
time,Hardware,Voltage,Current
1621624901767,high-voltage-3,8,0.138715
time,Hardware,Voltage,Current
1621624901767,high-voltage-3,9,0.143321
time,Hardware,Voltage,Current
1621624901767,high-voltage-3,10,0.146449
time,Hardware,Voltage,Current
1621624901767,high-voltage-3,11,0.148624
time,Hardware,Voltage,Current
1621624901767,high-voltage-3,12,0.150418
time,Hardware,Voltage,Current
1621624901767,high-voltage-3,13,0.153075
time,Hardware,Voltage,Current
1621624901767,high-voltage-3,14,0.156286
time,Hardware,Voltage,Current
1621624901767,high-voltage-3,15,0.160447
time,Hardware,Voltage,Current
1621624901767,high-voltage-3,16,0.162078
time,Hardware,Voltage,Current
1621624901767,high-voltage-3,17,0.164927
time,Hardware,Voltage,Current
1621624901767,high-voltage-3,18,0.166597
time,Hardware,Voltage,Current
1621624901767,high-voltage-3,19,0.167641
time,Hardware,Voltage,Current
1621624901767,high-voltage-3,20,0.170107
time,Hardware,Voltage,Current
1621624901767,high-voltage-3,25,0.180219
time,Hardware,Voltage,Current
1621624901767,high-voltage-3,30,0.191026
time,Hardware,Voltage,Current
1621624901767,high-voltage-3,35,0.199146
time,Hardware,Voltage,Current
1621624901767,high-voltage-3,40,4e+07
time,Hardware,Voltage,Current
1621624901767,high-voltage-3,45,0.212807
time,Hardware,Voltage,Current
1621624901767,high-voltage-3,50,0.219009
time,Hardware,Voltage,Current
1621624901767,high-voltage-3,55,0.225567
time,Hardware,Voltage,Current
1621624901767,high-voltage-3,60,0.230809
time,Hardware,Voltage,Current
1621624901767,high-voltage-3,65,0.237377
time,Hardware,Voltage,Current
1621624901767,high-voltage-3,70,0.24209
time,Hardware,Voltage,Current
1621624901767,high-voltage-3,75,0.247218
time,Hardware,Voltage,Current
1621624901767,high-voltage-3,80,0.251949
time,Hardware,Voltage,Current
1621624901767,high-voltage-3,85,0.258556
time,Hardware,Voltage,Current
1621624901767,high-voltage-3,90,0.26269
time,Hardware,Voltage,Current
1621624901767,high-voltage-3,95,0.267705
time,Hardware,Voltage,Current
1621624901767,high-voltage-3,100,0.271149
