time,Hardware,Voltage,Current
1625776341158,high-voltage-4,1,0.424652
time,Hardware,Voltage,Current
1625776341158,high-voltage-4,2,0.580909
time,Hardware,Voltage,Current
1625776341158,high-voltage-4,3,0.674967
time,Hardware,Voltage,Current
1625776341158,high-voltage-4,4,0.740431
time,Hardware,Voltage,Current
1625776341158,high-voltage-4,5,0.78806
time,Hardware,Voltage,Current
1625776341158,high-voltage-4,6,0.825927
time,Hardware,Voltage,Current
1625776341158,high-voltage-4,7,0.860928
time,Hardware,Voltage,Current
1625776341158,high-voltage-4,8,0.894072
time,Hardware,Voltage,Current
1625776341158,high-voltage-4,9,0.931898
time,Hardware,Voltage,Current
1625776341158,high-voltage-4,10,0.998748
time,Hardware,Voltage,Current
1625776341158,high-voltage-4,11,1.01027
time,Hardware,Voltage,Current
1625776341158,high-voltage-4,12,1.05398
time,Hardware,Voltage,Current
1625776341158,high-voltage-4,13,1.09975
time,Hardware,Voltage,Current
1625776341158,high-voltage-4,14,1.14891
time,Hardware,Voltage,Current
1625776341158,high-voltage-4,15,1.1991
time,Hardware,Voltage,Current
1625776341158,high-voltage-4,16,1.24836
time,Hardware,Voltage,Current
1625776341158,high-voltage-4,17,1.3012
time,Hardware,Voltage,Current
1625776341158,high-voltage-4,18,1.35584
time,Hardware,Voltage,Current
1625776341158,high-voltage-4,19,1.41162
time,Hardware,Voltage,Current
1625776341158,high-voltage-4,20,1.47077
time,Hardware,Voltage,Current
1625776341158,high-voltage-4,25,1.74223
time,Hardware,Voltage,Current
1625776341158,high-voltage-4,30,1.95883
time,Hardware,Voltage,Current
1625776341158,high-voltage-4,35,2.17021
time,Hardware,Voltage,Current
1625776341158,high-voltage-4,40,2.38969
time,Hardware,Voltage,Current
1625776341158,high-voltage-4,45,2.6249
time,Hardware,Voltage,Current
1625776341158,high-voltage-4,50,2.8934
time,Hardware,Voltage,Current
1625776341158,high-voltage-4,55,3.21825
time,Hardware,Voltage,Current
1625776341158,high-voltage-4,60,3.59115
time,Hardware,Voltage,Current
1625776341158,high-voltage-4,65,4.06475
time,Hardware,Voltage,Current
1625776341158,high-voltage-4,70,4.78198
time,Hardware,Voltage,Current
1625776341158,high-voltage-4,75,7.46079
time,Hardware,Voltage,Current
1625776341158,high-voltage-4,80,9.99979
time,Hardware,Voltage,Current
1625776341158,high-voltage-4,85,9.9997
time,Hardware,Voltage,Current
1625776341158,high-voltage-4,90,9.99977
time,Hardware,Voltage,Current
1625776341158,high-voltage-4,95,9.99977
time,Hardware,Voltage,Current
1625776341158,high-voltage-4,100,9.99974
