time,Hardware,Voltage,Current
1623358477500,high-voltage,1,0.0250689
time,Hardware,Voltage,Current
1623358477500,high-voltage,3.26904e-08,0.0327137
time,Hardware,Voltage,Current
1623358477500,high-voltage,3,0.0379559
time,Hardware,Voltage,Current
1623358477500,high-voltage,4,0.0428066
time,Hardware,Voltage,Current
1623358477500,high-voltage,5,0.0464916
