time,Hardware,Voltage,Current
1625797527288,high-voltage-3,1,0.188024
time,Hardware,Voltage,Current
1625797527288,high-voltage-3,2,0.20144
time,Hardware,Voltage,Current
1625797527288,high-voltage-3,3,0.211684
time,Hardware,Voltage,Current
1625797527288,high-voltage-3,4,0.22264
time,Hardware,Voltage,Current
1625797527288,high-voltage-3,5,0.228269
time,Hardware,Voltage,Current
1625797527288,high-voltage-3,6,0.237604
time,Hardware,Voltage,Current
1625797527288,high-voltage-3,7,0.246985
time,Hardware,Voltage,Current
1625797527288,high-voltage-3,8,0.255753
time,Hardware,Voltage,Current
1625797527288,high-voltage-3,9,0.265649
time,Hardware,Voltage,Current
1625797527288,high-voltage-3,10,0.276545
time,Hardware,Voltage,Current
1625797527288,high-voltage-3,11,0.285021
time,Hardware,Voltage,Current
1625797527288,high-voltage-3,12,0.294449
time,Hardware,Voltage,Current
1625797527288,high-voltage-3,13,0.303671
time,Hardware,Voltage,Current
1625797527288,high-voltage-3,14,0.311361
time,Hardware,Voltage,Current
1625797527288,high-voltage-3,15,0.318188
time,Hardware,Voltage,Current
1625797527288,high-voltage-3,16,0.325013
time,Hardware,Voltage,Current
1625797527288,high-voltage-3,17,0.332964
time,Hardware,Voltage,Current
1625797527288,high-voltage-3,18,0.338069
time,Hardware,Voltage,Current
1625797527288,high-voltage-3,19,0.343618
time,Hardware,Voltage,Current
1625797527288,high-voltage-3,20,0.349875
time,Hardware,Voltage,Current
1625797527288,high-voltage-3,25,0.374873
time,Hardware,Voltage,Current
1625797527288,high-voltage-3,30,0.396896
time,Hardware,Voltage,Current
1625797527288,high-voltage-3,35,0.419723
time,Hardware,Voltage,Current
1625797527288,high-voltage-3,40,0.438777
time,Hardware,Voltage,Current
1625797527288,high-voltage-3,45,0.457464
time,Hardware,Voltage,Current
1625797527288,high-voltage-3,50,0.47692
time,Hardware,Voltage,Current
1625797527288,high-voltage-3,55,0.496307
time,Hardware,Voltage,Current
1625797527288,high-voltage-3,60,0.51567
time,Hardware,Voltage,Current
1625797527288,high-voltage-3,65,0.533102
time,Hardware,Voltage,Current
1625797527288,high-voltage-3,70,0.551184
time,Hardware,Voltage,Current
1625797527288,high-voltage-3,75,0.56988
time,Hardware,Voltage,Current
1625797527288,high-voltage-3,80,0.586763
time,Hardware,Voltage,Current
1625797527288,high-voltage-3,85,0.603748
time,Hardware,Voltage,Current
1625797527288,high-voltage-3,90,0.622878
time,Hardware,Voltage,Current
1625797527288,high-voltage-3,95,0.637935
time,Hardware,Voltage,Current
1625797527288,high-voltage-3,100,0.655776
