{
    "Data": [14.0, 28.0, 0.0, 0.0, 5.0, 93.0, 423.0, 1319.0, 2838.0, 4165.0, 4445.0, 3874.0, 2977.0, 2593.0, 2412.0, 2266.0, 2091.0, 1855.0, 1738.0, 1780.0, 1961.0, 2227.0, 2385.0, 2352.0, 2204.0, 1802.0, 1311.0, 878.0, 509.0, 357.0, 241.0, 210.0, 240.0, 290.0, 365.0, 542.0, 668.0, 847.0, 1082.0, 1200.0, 1404.0, 1565.0, 1705.0, 1688.0, 1678.0, 1571.0, 1512.0, 1332.0, 1234.0, 1117.0, 926.0, 705.0, 590.0, 472.0, 416.0, 290.0, 242.0, 192.0, 162.0, 125.0, 83.0, 78.0, 65.0, 50.0, 47.0, 36.0, 25.0, 19.0, 36.0, 19.0, 15.0, 19.0, 19.0, 15.0, 14.0, 12.0, 11.0, 5.0, 8.0, 6.0, 8.0, 7.0, 1.0, 3.0, 5.0, 7.0, 2.0, 4.0, 4.0, 2.0, 2.0, 3.0, 3.0, 2.0, 2.0, 1.0, 0.0, 1.0, 1.0, 0.0, 0.0],
    "Name": "NoiseDist-0",
    "Overflow": 10.0,
    "Type": "Histo1d",
    "Underflow": 0.0,
    "x": {
        "AxisTitle": "Noise [e]",
        "Bins": 101,
        "High": 506.0,
        "Low": -2.0
    },
    "y": {
        "AxisTitle": "Number of Pixels"
    },
    "z": {
        "AxisTitle": "z"
    }
}