{
    "Data": [0.0, 0.0, 0.0, 0.0, 0.0, 0.0, 0.0, 0.0, 0.0, 0.0, 0.0, 0.0, 0.0, 0.0, 0.0, 0.0, 1.0, 3.0, 0.0, 0.0, 4.0, 5.0, 0.0, 4.0, 13.0, 7.0, 22.0, 22.0, 32.0, 36.0, 45.0, 46.0, 19.0, 49.0, 47.0, 50.0, 48.0, 25.0, 49.0, 50.0, 50.0, 40.0, 18.0, 50.0, 29.0, 50.0, 14.0, 14.0, 36.0, 50.0, 50.0],
    "Name": "Scurve-20-96",
    "Overflow": 0.0,
    "Type": "Histo1d",
    "Underflow": 0.0,
    "x": {
        "AxisTitle": "Vcal",
        "Bins": 51,
        "High": 302.5,
        "Low": 47.5
    },
    "y": {
        "AxisTitle": "Occupancy"
    },
    "z": {
        "AxisTitle": "z"
    }
}