time,Hardware,Voltage,Current
1621616298791,high-voltage-3,1,0.246396
time,Hardware,Voltage,Current
1621616298791,high-voltage-3,2,0.258502
time,Hardware,Voltage,Current
1621616298791,high-voltage-3,3,0.270674
time,Hardware,Voltage,Current
1621616298791,high-voltage-3,4,0.283388
time,Hardware,Voltage,Current
1621616298791,high-voltage-3,5,0.290939
time,Hardware,Voltage,Current
1621616298791,high-voltage-3,6,0.300007
time,Hardware,Voltage,Current
1621616298791,high-voltage-3,7,0.306588
time,Hardware,Voltage,Current
1621616298791,high-voltage-3,8,0.316641
time,Hardware,Voltage,Current
1621616298791,high-voltage-3,9,0.324035
time,Hardware,Voltage,Current
1621616298791,high-voltage-3,10,0.334675
time,Hardware,Voltage,Current
1621616298791,high-voltage-3,11,0.343179
time,Hardware,Voltage,Current
1621616298791,high-voltage-3,12,0.352195
time,Hardware,Voltage,Current
1621616298791,high-voltage-3,13,0.359499
time,Hardware,Voltage,Current
1621616298791,high-voltage-3,14,0.367301
time,Hardware,Voltage,Current
1621616298791,high-voltage-3,15,0.375308
time,Hardware,Voltage,Current
1621616298791,high-voltage-3,16,0.38032
time,Hardware,Voltage,Current
1621616298791,high-voltage-3,17,0.387731
time,Hardware,Voltage,Current
1621616298791,high-voltage-3,18,0.391801
time,Hardware,Voltage,Current
1621616298791,high-voltage-3,19,0.398878
time,Hardware,Voltage,Current
1621616298791,high-voltage-3,20,0.403583
time,Hardware,Voltage,Current
1621616298791,high-voltage-3,25,0.429273
time,Hardware,Voltage,Current
1621616298791,high-voltage-3,30,0.453772
time,Hardware,Voltage,Current
1621616298791,high-voltage-3,35,0.476674
time,Hardware,Voltage,Current
1621616298791,high-voltage-3,40,0.494819
time,Hardware,Voltage,Current
1621616298791,high-voltage-3,45,0.51257
time,Hardware,Voltage,Current
1621616298791,high-voltage-3,50,0.529425
time,Hardware,Voltage,Current
1621616298791,high-voltage-3,55,0.545929
time,Hardware,Voltage,Current
1621616298791,high-voltage-3,60,0.561635
time,Hardware,Voltage,Current
1621616298791,high-voltage-3,65,0.577878
time,Hardware,Voltage,Current
1621616298791,high-voltage-3,70,0.592439
time,Hardware,Voltage,Current
1621616298791,high-voltage-3,75,0.60633
time,Hardware,Voltage,Current
1621616298791,high-voltage-3,80,0.622363
time,Hardware,Voltage,Current
1621616298791,high-voltage-3,85,0.635527
time,Hardware,Voltage,Current
1621616298791,high-voltage-3,90,0.648394
time,Hardware,Voltage,Current
1621616298791,high-voltage-3,95,0.662534
time,Hardware,Voltage,Current
1621616298791,high-voltage-3,100,0.675473
