{
    "Data": [160.0, 10421.0, 20322.0, 13183.0, 5239.0, 2027.0, 1632.0, 2111.0, 2614.0, 2867.0, 2720.0, 2337.0, 1830.0, 1406.0, 973.0, 611.0, 435.0, 304.0, 245.0, 179.0, 173.0, 160.0, 162.0, 144.0, 125.0, 115.0, 129.0, 126.0, 100.0, 92.0, 109.0, 96.0, 83.0, 90.0, 81.0, 51.0, 61.0, 50.0, 68.0, 60.0, 49.0, 35.0, 27.0, 32.0, 24.0, 34.0, 31.0, 25.0, 23.0, 19.0, 7.0],
    "Name": "Chi2Dist-0",
    "Overflow": 0.0,
    "Type": "Histo1d",
    "Underflow": 0.0,
    "x": {
        "AxisTitle": "Fit Chi/ndf",
        "Bins": 51,
        "High": 2.5250000953674318,
        "Low": -0.02500000037252903
    },
    "y": {
        "AxisTitle": "Number of Pixels"
    },
    "z": {
        "AxisTitle": "z"
    }
}