{
    "Data": [17.0, 70.0, 31.0, 32.0, 52.0, 54.0, 176.0, 577.0, 1604.0, 3241.0, 5075.0, 5700.0, 5053.0, 4024.0, 3975.0, 4125.0, 4308.0, 4230.0, 3512.0, 2789.0, 1864.0, 1160.0, 762.0, 497.0, 382.0, 390.0, 492.0, 531.0, 663.0, 758.0, 910.0, 999.0, 1065.0, 1144.0, 1142.0, 1079.0, 1081.0, 939.0, 809.0, 782.0, 659.0, 565.0, 497.0, 460.0, 330.0, 334.0, 287.0, 277.0, 244.0, 233.0, 224.0, 193.0, 205.0, 153.0, 162.0, 138.0, 134.0, 129.0, 136.0, 112.0, 105.0, 114.0, 105.0, 105.0, 88.0, 69.0, 62.0, 76.0, 62.0, 62.0, 77.0, 65.0, 49.0, 59.0, 49.0, 49.0, 66.0, 51.0, 50.0, 53.0, 44.0, 48.0, 52.0, 45.0, 37.0, 43.0, 47.0, 45.0, 42.0, 47.0, 39.0, 49.0, 49.0, 31.0, 40.0, 50.0, 45.0, 24.0, 43.0, 20.0, 30.0, 30.0, 27.0, 42.0, 30.0, 27.0, 20.0, 19.0, 22.0, 21.0, 26.0, 22.0, 24.0],
    "Name": "NoiseDist-0",
    "Overflow": 476.0,
    "Type": "Histo1d",
    "Underflow": 0.0,
    "x": {
        "AxisTitle": "Noise [e]",
        "Bins": 113,
        "High": 566.0,
        "Low": -2.0
    },
    "y": {
        "AxisTitle": "Number of Pixels"
    },
    "z": {
        "AxisTitle": "z"
    }
}