{
    "Data": [0.0, 0.0, 0.0, 0.0, 0.0, 0.0, 0.0, 0.0, 0.0, 0.0, 0.0, 0.0, 0.0, 0.0, 0.0, 0.0, 0.0, 0.0, 0.0, 0.0, 0.0, 0.0, 0.0, 0.0, 0.0, 0.0, 0.0, 0.0, 0.0, 0.0, 0.0, 0.0, 0.0, 0.0, 0.0, 0.0, 0.0, 0.0, 0.0, 0.0, 0.0, 0.0, 0.0, 0.0, 0.0, 0.0, 0.0, 0.0, 0.0, 0.0, 51.0, 125.0, 119.0, 156.0, 163.0, 204.0, 253.0, 296.0, 284.0, 347.0, 372.0, 448.0, 463.0, 525.0, 565.0, 619.0, 678.0, 764.0, 743.0, 813.0, 875.0, 854.0, 865.0, 855.0, 935.0, 843.0, 903.0, 972.0, 903.0, 847.0, 852.0, 815.0, 816.0, 851.0, 877.0, 967.0, 1191.0, 1438.0, 1726.0, 2097.0, 2277.0, 2674.0, 2931.0, 2843.0, 2657.0, 2222.0, 1890.0, 1447.0, 1064.0, 759.0, 506.0, 343.0, 275.0, 192.0, 100.0, 83.0, 74.0, 55.0, 45.0, 32.0, 23.0, 24.0, 30.0, 17.0, 13.0, 22.0, 12.0, 22.0, 14.0, 11.0, 13.0, 12.0, 13.0, 12.0, 20.0, 7.0, 7.0, 11.0, 4.0, 4.0, 5.0, 5.0, 6.0, 8.0, 6.0, 4.0, 6.0, 6.0, 4.0, 5.0, 2.0, 4.0, 0.0, 2.0, 3.0, 3.0, 1.0, 2.0, 4.0, 5.0, 2.0, 7.0, 4.0, 4.0, 12.0, 10.0, 14.0, 16.0, 30.0, 27.0, 36.0, 35.0, 55.0, 75.0, 83.0, 100.0, 122.0, 138.0, 183.0, 223.0, 238.0, 264.0, 343.0, 393.0, 454.0, 480.0, 553.0, 576.0, 622.0, 720.0, 704.0, 774.0, 736.0, 899.0, 805.0, 858.0, 937.0, 921.0, 925.0, 902.0, 884.0, 826.0, 788.0, 809.0, 717.0, 673.0, 618.0, 580.0, 542.0, 500.0, 402.0, 409.0, 348.0, 301.0, 272.0, 226.0, 224.0, 187.0, 177.0, 137.0, 125.0, 105.0, 82.0, 69.0, 72.0, 43.0, 48.0, 40.0, 29.0, 20.0, 20.0, 9.0, 5.0, 9.0, 7.0, 4.0, 1.0, 2.0, 2.0, 0.0, 1.0, 0.0, 1.0, 0.0, 0.0, 1.0, 1.0, 1.0, 0.0, 0.0, 0.0, 0.0, 0.0, 0.0, 0.0, 0.0, 0.0, 0.0, 1.0, 0.0, 0.0, 0.0, 1.0, 0.0, 0.0, 0.0, 0.0, 0.0, 1.0, 0.0, 0.0, 0.0, 0.0, 0.0, 0.0, 0.0, 0.0, 0.0, 0.0, 0.0, 0.0, 0.0, 0.0, 0.0, 0.0, 0.0, 0.0, 0.0, 0.0, 0.0, 0.0, 0.0, 0.0, 0.0, 0.0, 0.0, 0.0, 0.0, 0.0, 0.0, 0.0, 0.0, 0.0, 0.0, 0.0, 0.0, 0.0, 0.0, 0.0, 0.0, 0.0, 0.0, 0.0, 0.0, 0.0, 0.0, 0.0, 0.0, 0.0, 0.0, 0.0, 0.0, 0.0, 0.0, 0.0, 0.0, 0.0, 0.0, 0.0, 0.0, 0.0, 0.0, 0.0, 0.0, 0.0, 0.0, 0.0, 0.0, 0.0, 0.0, 0.0, 0.0, 0.0, 0.0, 0.0, 0.0, 0.0, 0.0, 0.0, 0.0, 0.0, 0.0, 0.0, 0.0, 0.0, 0.0, 0.0, 0.0, 0.0, 0.0, 0.0, 0.0, 0.0, 0.0, 0.0, 0.0, 0.0, 0.0, 0.0, 0.0, 0.0, 0.0, 0.0],
    "Name": "ThresholdDist-0",
    "Overflow": 0.0,
    "Type": "Histo1d",
    "Underflow": 0.0,
    "x": {
        "AxisTitle": "Threshold [e]",
        "Bins": 363,
        "High": 3625.0,
        "Low": -5.0
    },
    "y": {
        "AxisTitle": "Number of Pixels"
    },
    "z": {
        "AxisTitle": "z"
    }
}