{
    "Data": [0.0, 0.0, 0.0, 0.0, 0.0, 0.0, 0.0, 0.0, 0.0, 0.0, 0.0, 0.0, 0.0, 0.0, 0.0, 0.0, 0.0, 0.0, 0.0, 0.0, 0.0, 0.0, 0.0, 0.0, 0.0, 0.0, 0.0, 0.0, 0.0, 0.0, 0.0, 0.0, 0.0, 0.0, 0.0, 0.0, 0.0, 0.0, 0.0, 0.0, 0.0, 0.0, 0.0, 0.0, 0.0, 0.0, 0.0, 0.0, 0.0, 0.0, 8.0, 25.0, 25.0, 27.0, 26.0, 39.0, 46.0, 48.0, 80.0, 61.0, 107.0, 126.0, 132.0, 153.0, 185.0, 197.0, 231.0, 259.0, 282.0, 333.0, 351.0, 413.0, 484.0, 496.0, 573.0, 592.0, 710.0, 748.0, 778.0, 834.0, 804.0, 842.0, 975.0, 1038.0, 1119.0, 1217.0, 1440.0, 1775.0, 2028.0, 2456.0, 2802.0, 3069.0, 3176.0, 3058.0, 2916.0, 2769.0, 2245.0, 1981.0, 1546.0, 1187.0, 976.0, 743.0, 548.0, 441.0, 369.0, 315.0, 279.0, 198.0, 164.0, 136.0, 102.0, 103.0, 79.0, 89.0, 53.0, 49.0, 36.0, 31.0, 34.0, 33.0, 31.0, 31.0, 27.0, 21.0, 19.0, 11.0, 11.0, 13.0, 10.0, 12.0, 17.0, 13.0, 14.0, 15.0, 11.0, 15.0, 9.0, 4.0, 7.0, 6.0, 6.0, 14.0, 9.0, 13.0, 8.0, 12.0, 13.0, 17.0, 14.0, 26.0, 27.0, 31.0, 35.0, 58.0, 63.0, 72.0, 83.0, 79.0, 142.0, 129.0, 162.0, 200.0, 203.0, 237.0, 267.0, 284.0, 345.0, 411.0, 436.0, 505.0, 494.0, 574.0, 581.0, 636.0, 680.0, 716.0, 774.0, 790.0, 818.0, 810.0, 831.0, 847.0, 811.0, 772.0, 816.0, 757.0, 782.0, 712.0, 705.0, 661.0, 652.0, 616.0, 550.0, 510.0, 428.0, 406.0, 383.0, 332.0, 299.0, 241.0, 236.0, 216.0, 182.0, 126.0, 148.0, 116.0, 108.0, 106.0, 79.0, 57.0, 45.0, 36.0, 36.0, 39.0, 20.0, 11.0, 19.0, 17.0, 7.0, 5.0, 4.0, 7.0, 4.0, 0.0, 1.0, 2.0, 1.0, 0.0, 1.0, 0.0, 0.0, 0.0, 0.0, 1.0, 0.0, 0.0, 1.0, 0.0, 0.0, 0.0, 1.0, 0.0, 0.0, 0.0, 0.0, 0.0, 0.0, 0.0, 0.0, 0.0, 0.0, 1.0, 0.0, 0.0, 0.0, 0.0, 0.0, 0.0, 0.0, 0.0, 0.0, 0.0, 0.0, 0.0, 0.0, 0.0, 0.0, 0.0, 0.0, 0.0, 0.0, 0.0, 0.0, 0.0, 0.0, 0.0, 0.0, 0.0, 0.0, 0.0, 0.0, 0.0, 0.0, 0.0, 0.0, 0.0, 0.0, 0.0, 0.0, 0.0, 0.0, 0.0, 0.0, 0.0, 0.0, 0.0, 0.0, 0.0, 0.0, 0.0, 0.0, 0.0, 0.0, 0.0, 0.0, 0.0, 0.0, 0.0, 0.0, 0.0, 0.0, 0.0, 0.0, 0.0, 0.0, 0.0, 0.0, 0.0, 0.0, 0.0, 0.0, 0.0, 0.0, 0.0, 0.0, 0.0, 0.0, 0.0, 0.0, 0.0, 0.0, 0.0, 0.0, 0.0, 0.0, 0.0, 0.0, 0.0, 0.0],
    "Name": "ThresholdDist-0",
    "Overflow": 0.0,
    "Type": "Histo1d",
    "Underflow": 0.0,
    "x": {
        "AxisTitle": "Threshold [e]",
        "Bins": 339,
        "High": 3385.0,
        "Low": -5.0
    },
    "y": {
        "AxisTitle": "Number of Pixels"
    },
    "z": {
        "AxisTitle": "z"
    }
}