{
    "Data": [0.0, 0.0, 0.0, 0.0, 0.0, 0.0, 0.0, 0.0, 0.0, 0.0, 0.0, 0.0, 0.0, 0.0, 0.0, 0.0, 0.0, 0.0, 0.0, 0.0, 0.0, 1.0, 1.0, 1.0, 7.0, 1.0, 5.0, 4.0, 1.0, 10.0, 0.0, 32.0, 27.0, 31.0, 42.0, 41.0, 35.0, 45.0, 47.0, 46.0, 25.0, 50.0, 50.0, 50.0, 50.0, 50.0, 50.0, 50.0, 15.0, 11.0, 22.0],
    "Name": "Scurve-10-96",
    "Overflow": 0.0,
    "Type": "Histo1d",
    "Underflow": 0.0,
    "x": {
        "AxisTitle": "Vcal",
        "Bins": 51,
        "High": 302.5,
        "Low": 47.5
    },
    "y": {
        "AxisTitle": "Occupancy"
    },
    "z": {
        "AxisTitle": "z"
    }
}