{
    "Data": [0.0, 0.0, 0.0, 0.0, 0.0, 0.0, 0.0, 0.0, 0.0, 0.0, 0.0, 0.0, 0.0, 0.0, 0.0, 0.0, 0.0, 0.0, 0.0, 0.0, 0.0, 0.0, 0.0, 0.0, 0.0, 0.0, 0.0, 0.0, 0.0, 0.0, 0.0, 0.0, 0.0, 0.0, 0.0, 0.0, 0.0, 0.0, 0.0, 0.0, 0.0, 0.0, 0.0, 0.0, 0.0, 0.0, 0.0, 0.0, 0.0, 0.0, 2.0, 3.0, 6.0, 6.0, 7.0, 6.0, 12.0, 10.0, 6.0, 14.0, 13.0, 9.0, 11.0, 14.0, 20.0, 22.0, 17.0, 44.0, 43.0, 57.0, 70.0, 101.0, 108.0, 154.0, 183.0, 225.0, 311.0, 349.0, 450.0, 546.0, 659.0, 792.0, 872.0, 1002.0, 1110.0, 1267.0, 1313.0, 1361.0, 1488.0, 1567.0, 1791.0, 2174.0, 2631.0, 3368.0, 4104.0, 4459.0, 4443.0, 4041.0, 3159.0, 2391.0, 1589.0, 1036.0, 640.0, 415.0, 292.0, 186.0, 162.0, 126.0, 72.0, 68.0, 66.0, 44.0, 46.0, 36.0, 34.0, 39.0, 20.0, 21.0, 29.0, 28.0, 24.0, 20.0, 16.0, 25.0, 18.0, 10.0, 15.0, 10.0, 14.0, 15.0, 4.0, 10.0, 7.0, 10.0, 14.0, 15.0, 6.0, 8.0, 8.0, 14.0, 11.0, 7.0, 4.0, 9.0, 2.0, 7.0, 8.0, 7.0, 3.0, 0.0, 10.0, 5.0, 3.0, 2.0, 3.0, 2.0, 3.0, 2.0, 2.0, 3.0, 2.0, 6.0, 2.0, 7.0, 4.0, 6.0, 9.0, 10.0, 9.0, 15.0, 20.0, 27.0, 45.0, 41.0, 33.0, 71.0, 70.0, 79.0, 95.0, 100.0, 122.0, 164.0, 190.0, 190.0, 258.0, 312.0, 334.0, 357.0, 406.0, 454.0, 523.0, 562.0, 555.0, 625.0, 698.0, 716.0, 726.0, 784.0, 750.0, 805.0, 768.0, 747.0, 753.0, 764.0, 696.0, 714.0, 662.0, 635.0, 660.0, 556.0, 513.0, 493.0, 450.0, 357.0, 408.0, 314.0, 302.0, 294.0, 274.0, 216.0, 177.0, 163.0, 118.0, 102.0, 86.0, 73.0, 70.0, 56.0, 51.0, 44.0, 26.0, 30.0, 14.0, 19.0, 17.0, 17.0, 15.0, 7.0, 15.0, 16.0, 17.0, 17.0, 16.0, 13.0, 9.0, 6.0, 5.0, 6.0, 12.0, 5.0, 10.0, 6.0, 8.0, 5.0, 5.0, 4.0, 12.0, 6.0, 3.0, 4.0, 2.0, 4.0, 5.0, 2.0, 1.0, 0.0, 2.0, 2.0, 1.0, 2.0, 1.0, 1.0, 3.0, 2.0, 2.0, 0.0, 0.0, 1.0, 3.0, 3.0, 2.0, 2.0, 1.0, 1.0, 2.0, 1.0, 0.0, 2.0, 2.0, 2.0, 0.0, 1.0, 0.0, 1.0, 1.0, 0.0, 1.0, 0.0, 2.0, 1.0, 2.0, 0.0, 1.0, 1.0, 1.0, 1.0, 2.0, 0.0, 4.0, 0.0, 0.0, 0.0, 2.0, 1.0, 0.0, 1.0, 1.0, 0.0, 0.0, 0.0, 0.0, 1.0, 0.0, 0.0, 1.0, 0.0, 0.0, 0.0, 0.0, 0.0, 0.0, 0.0, 0.0, 0.0, 0.0, 0.0, 0.0, 0.0, 0.0, 0.0, 0.0, 0.0, 0.0, 0.0, 0.0, 0.0, 0.0, 0.0, 0.0, 0.0, 0.0, 0.0, 0.0, 0.0, 0.0, 0.0, 0.0, 0.0, 0.0, 0.0, 0.0, 0.0, 0.0, 0.0, 0.0, 0.0, 0.0, 0.0, 0.0, 0.0, 0.0, 0.0, 0.0, 0.0, 0.0, 0.0],
    "Name": "ThresholdDist-0",
    "Overflow": 0.0,
    "Type": "Histo1d",
    "Underflow": 0.0,
    "x": {
        "AxisTitle": "Threshold [e]",
        "Bins": 376,
        "High": 3755.0,
        "Low": -5.0
    },
    "y": {
        "AxisTitle": "Number of Pixels"
    },
    "z": {
        "AxisTitle": "z"
    }
}