{
    "Data": [0.0, 0.0, 0.0, 0.0, 0.0, 0.0, 0.0, 0.0, 0.0, 0.0, 0.0, 0.0, 0.0, 0.0, 2.0, 3.0, 1.0, 29.0, 403.0, 125.0, 47.0, 930.0, 4663.0, 1840.0, 343.0, 1296.0, 4060.0, 2351.0, 490.0, 1012.0, 2170.0, 1581.0, 382.0, 267.0, 452.0, 503.0, 292.0, 316.0, 604.0, 574.0, 431.0, 870.0, 1600.0, 2108.0, 1506.0, 1647.0, 2360.0, 3133.0, 3003.0, 2488.0, 2444.0, 2598.0, 2570.0, 2097.0, 1993.0, 1920.0, 2175.0, 1933.0, 1650.0, 1547.0, 1397.0, 1261.0, 906.0, 791.0, 735.0, 764.0, 668.0, 522.0, 465.0, 452.0, 457.0, 370.0, 326.0, 254.0, 267.0, 224.0, 212.0, 187.0, 148.0, 136.0, 149.0, 101.0, 76.0, 71.0, 62.0, 62.0, 52.0, 54.0, 37.0, 38.0, 32.0, 38.0, 36.0, 40.0, 23.0, 17.0, 21.0, 22.0, 28.0, 16.0, 10.0, 11.0, 12.0, 7.0, 3.0, 10.0, 6.0, 7.0, 6.0, 9.0, 7.0, 7.0, 3.0, 5.0, 2.0, 4.0, 3.0, 4.0, 3.0, 4.0, 3.0, 2.0, 0.0, 2.0, 3.0, 1.0, 3.0, 0.0, 2.0, 1.0, 4.0, 1.0, 2.0, 1.0, 0.0, 2.0, 2.0, 2.0, 1.0, 0.0, 0.0, 2.0, 0.0, 0.0, 0.0, 0.0, 0.0, 0.0, 1.0, 2.0, 0.0, 0.0, 0.0, 0.0, 0.0, 1.0, 1.0, 1.0, 0.0, 2.0, 0.0, 0.0, 0.0, 1.0, 0.0, 0.0, 0.0, 0.0, 0.0, 0.0, 0.0, 0.0, 0.0, 0.0, 0.0, 0.0, 0.0, 1.0, 0.0, 0.0, 0.0, 1.0, 0.0, 0.0, 0.0, 0.0, 0.0, 0.0, 0.0, 0.0, 0.0, 0.0, 0.0, 0.0, 0.0, 0.0, 0.0, 0.0, 0.0, 0.0, 0.0],
    "Name": "TimePerFitDist-0",
    "Overflow": 88.0,
    "Type": "Histo1d",
    "Underflow": 0.0,
    "x": {
        "AxisTitle": "Fit Time [us]",
        "Bins": 201,
        "High": 401.0,
        "Low": -1.0
    },
    "y": {
        "AxisTitle": "Number of Pixels"
    },
    "z": {
        "AxisTitle": "z"
    }
}