time,Hardware,Voltage,Current
1623305199359,high-voltage,1,0.0614559
time,Hardware,Voltage,Current
1623305199359,high-voltage,7.70517e-08,0.0770924
time,Hardware,Voltage,Current
1623305199359,high-voltage,3,0.0916952
