{
    "Data": [253.0, 12391.0, 20592.0, 13373.0, 6476.0, 3534.0, 2928.0, 2821.0, 2773.0, 2573.0, 2033.0, 1488.0, 1106.0, 776.0, 516.0, 330.0, 272.0, 184.0, 145.0, 126.0, 128.0, 97.0, 123.0, 101.0, 113.0, 78.0, 85.0, 96.0, 79.0, 51.0, 57.0, 52.0, 71.0, 64.0, 45.0, 55.0, 44.0, 34.0, 37.0, 22.0, 21.0, 22.0, 22.0, 31.0, 18.0, 16.0, 25.0, 12.0, 8.0, 9.0, 5.0],
    "Name": "Chi2Dist-0",
    "Overflow": 0.0,
    "Type": "Histo1d",
    "Underflow": 0.0,
    "x": {
        "AxisTitle": "Fit Chi/ndf",
        "Bins": 51,
        "High": 2.5250000953674318,
        "Low": -0.02500000037252903
    },
    "y": {
        "AxisTitle": "Number of Pixels"
    },
    "z": {
        "AxisTitle": "z"
    }
}