{
    "Data": [11.0, 23.0, 1.0, 2.0, 6.0, 101.0, 478.0, 1445.0, 2997.0, 4356.0, 4457.0, 3723.0, 2893.0, 2562.0, 2351.0, 2200.0, 2078.0, 2018.0, 1765.0, 1838.0, 2086.0, 2222.0, 2423.0, 2430.0, 2069.0, 1536.0, 1243.0, 727.0, 544.0, 414.0, 368.0, 427.0, 544.0, 700.0, 848.0, 1074.0, 1309.0, 1563.0, 1782.0, 1886.0, 1941.0, 1943.0, 1792.0, 1701.0, 1456.0, 1182.0, 996.0, 771.0, 618.0, 502.0, 352.0, 284.0, 181.0, 161.0, 113.0, 77.0, 57.0, 47.0, 37.0, 30.0, 36.0, 24.0, 26.0, 26.0, 16.0, 16.0, 11.0, 8.0, 12.0, 7.0, 4.0, 9.0, 6.0, 2.0, 7.0, 3.0, 7.0, 5.0, 4.0, 0.0, 3.0, 2.0, 6.0, 0.0, 3.0, 2.0, 2.0, 0.0, 1.0, 0.0],
    "Name": "NoiseDist-0",
    "Overflow": 15.0,
    "Type": "Histo1d",
    "Underflow": 0.0,
    "x": {
        "AxisTitle": "Noise [e]",
        "Bins": 90,
        "High": 451.0,
        "Low": -2.0
    },
    "y": {
        "AxisTitle": "Number of Pixels"
    },
    "z": {
        "AxisTitle": "z"
    }
}