time,Hardware,Voltage,Current
1626305990380,high-voltage,1,0.0643982
time,Hardware,Voltage,Current
1626305990380,high-voltage,2,0.0948829
time,Hardware,Voltage,Current
1626305990380,high-voltage,3,0.115636
time,Hardware,Voltage,Current
1626305990380,high-voltage,4,0.135369
time,Hardware,Voltage,Current
1626305990380,high-voltage,5,0.149756
time,Hardware,Voltage,Current
1626305990380,high-voltage,6,0.163198
time,Hardware,Voltage,Current
1626305990380,high-voltage,7,0.176213
time,Hardware,Voltage,Current
1626305990380,high-voltage,8,0.186739
time,Hardware,Voltage,Current
1626305990380,high-voltage,9,0.195448
time,Hardware,Voltage,Current
1626305990380,high-voltage,10,0.203773
time,Hardware,Voltage,Current
1626305990380,high-voltage,11,0.209999
time,Hardware,Voltage,Current
1626305990380,high-voltage,12,0.216523
time,Hardware,Voltage,Current
1626305990380,high-voltage,13,0.220786
time,Hardware,Voltage,Current
1626305990380,high-voltage,14,0.22841
time,Hardware,Voltage,Current
1626305990380,high-voltage,15,0.234752
time,Hardware,Voltage,Current
1626305990380,high-voltage,16,0.239807
time,Hardware,Voltage,Current
1626305990380,high-voltage,17,0.245665
time,Hardware,Voltage,Current
1626305990380,high-voltage,18,0.252474
time,Hardware,Voltage,Current
1626305990380,high-voltage,19,0.257718
time,Hardware,Voltage,Current
1626305990380,high-voltage,20,0.263158
time,Hardware,Voltage,Current
1626305990380,high-voltage,25,0.290652
time,Hardware,Voltage,Current
1626305990380,high-voltage,30,0.327007
time,Hardware,Voltage,Current
1626305990380,high-voltage,35,0.393734
time,Hardware,Voltage,Current
1626305990380,high-voltage,40,0.550082
time,Hardware,Voltage,Current
1626305990380,high-voltage,45,0.846341
time,Hardware,Voltage,Current
1626305990380,high-voltage,50,1.32976
time,Hardware,Voltage,Current
1626305990380,high-voltage,55,2.09388
time,Hardware,Voltage,Current
1626305990380,high-voltage,60,3.25102
time,Hardware,Voltage,Current
1626305990380,high-voltage,65,4.82623
time,Hardware,Voltage,Current
1626305990380,high-voltage,70,6.9117
time,Hardware,Voltage,Current
1626305990380,high-voltage,75,9.72855
time,Hardware,Voltage,Current
1626305990380,high-voltage,80,10
