time,Hardware,Voltage,Current
1622001153136,high-voltage-3,1,0.00324898
time,Hardware,Voltage,Current
1622001153136,high-voltage-3,2,0.00544702
time,Hardware,Voltage,Current
1622001153136,high-voltage-3,3,0.00771799
time,Hardware,Voltage,Current
1622001153136,high-voltage-3,4,0.0096501
time,Hardware,Voltage,Current
1622001153136,high-voltage-3,5,0.0105769
time,Hardware,Voltage,Current
1622001153136,high-voltage-3,6,0.0111817
time,Hardware,Voltage,Current
1622001153136,high-voltage-3,7,0.0140529
time,Hardware,Voltage,Current
1622001153136,high-voltage-3,8,0.0150512
time,Hardware,Voltage,Current
1622001153136,high-voltage-3,9,0.0170986
time,Hardware,Voltage,Current
1622001153136,high-voltage-3,10,0.0186812
time,Hardware,Voltage,Current
1622001153136,high-voltage-3,11,1.1e+07
time,Hardware,Voltage,Current
1622001153136,high-voltage-3,12,0.0215863
time,Hardware,Voltage,Current
1622001153136,high-voltage-3,13,0.024196
time,Hardware,Voltage,Current
1622001153136,high-voltage-3,14,0.0259815
time,Hardware,Voltage,Current
1622001153136,high-voltage-3,15,0.026826
time,Hardware,Voltage,Current
1622001153136,high-voltage-3,16,0.028296
time,Hardware,Voltage,Current
1622001153136,high-voltage-3,17,0.0302215
time,Hardware,Voltage,Current
1622001153136,high-voltage-3,18,0.0309559
time,Hardware,Voltage,Current
1622001153136,high-voltage-3,19,0.0319102
time,Hardware,Voltage,Current
1622001153136,high-voltage-3,20,0.0339094
time,Hardware,Voltage,Current
1622001153136,high-voltage-3,25,0.0403072
time,Hardware,Voltage,Current
1622001153136,high-voltage-3,30,0.0497599
time,Hardware,Voltage,Current
1622001153136,high-voltage-3,35,0.0559729
time,Hardware,Voltage,Current
1622001153136,high-voltage-3,40,0.0615702
time,Hardware,Voltage,Current
1622001153136,high-voltage-3,45,0.069557
time,Hardware,Voltage,Current
1622001153136,high-voltage-3,50,0.0736005
time,Hardware,Voltage,Current
1622001153136,high-voltage-3,55,0.0793193
time,Hardware,Voltage,Current
1622001153136,high-voltage-3,60,0.0863313
time,Hardware,Voltage,Current
1622001153136,high-voltage-3,65,0.0923841
time,Hardware,Voltage,Current
1622001153136,high-voltage-3,70,0.0990869
time,Hardware,Voltage,Current
1622001153136,high-voltage-3,75,0.105091
time,Hardware,Voltage,Current
1622001153136,high-voltage-3,80,0.111259
time,Hardware,Voltage,Current
1622001153136,high-voltage-3,85,0.119556
time,Hardware,Voltage,Current
1622001153136,high-voltage-3,90,0.130735
time,Hardware,Voltage,Current
1622001153136,high-voltage-3,95,0.136091
time,Hardware,Voltage,Current
1622001153136,high-voltage-3,100,0.14896
