time,Hardware,Voltage,Current
1626347526059,high-voltage,1,0.00976034
time,Hardware,Voltage,Current
1626347526059,high-voltage,2,0.0254417
time,Hardware,Voltage,Current
1626347526059,high-voltage,3,0.0325169
time,Hardware,Voltage,Current
1626347526059,high-voltage,4,0.0395843
time,Hardware,Voltage,Current
1626347526059,high-voltage,5,0.0443301
time,Hardware,Voltage,Current
1626347526059,high-voltage,6,0.0511087
time,Hardware,Voltage,Current
1626347526059,high-voltage,7,0.0574358
time,Hardware,Voltage,Current
1626347526059,high-voltage,8,0.0631426
time,Hardware,Voltage,Current
1626347526059,high-voltage,9,0.0709869
time,Hardware,Voltage,Current
1626347526059,high-voltage,10,0.0762869
time,Hardware,Voltage,Current
1626347526059,high-voltage,11,0.0836484
time,Hardware,Voltage,Current
1626347526059,high-voltage,12,0.0889995
time,Hardware,Voltage,Current
1626347526059,high-voltage,13,0.0930851
time,Hardware,Voltage,Current
1626347526059,high-voltage,14,0.0979444
time,Hardware,Voltage,Current
1626347526059,high-voltage,15,0.101304
time,Hardware,Voltage,Current
1626347526059,high-voltage,16,0.104384
time,Hardware,Voltage,Current
1626347526059,high-voltage,17,0.108456
time,Hardware,Voltage,Current
1626347526059,high-voltage,18,0.111148
time,Hardware,Voltage,Current
1626347526059,high-voltage,19,0.11448
time,Hardware,Voltage,Current
1626347526059,high-voltage,20,0.117401
time,Hardware,Voltage,Current
1626347526059,high-voltage,25,0.131809
time,Hardware,Voltage,Current
1626347526059,high-voltage,30,0.150067
time,Hardware,Voltage,Current
1626347526059,high-voltage,35,0.184616
time,Hardware,Voltage,Current
1626347526059,high-voltage,40,0.287644
time,Hardware,Voltage,Current
1626347526059,high-voltage,45,0.53261
time,Hardware,Voltage,Current
1626347526059,high-voltage,50,0.994499
time,Hardware,Voltage,Current
1626347526059,high-voltage,55,1.79251
time,Hardware,Voltage,Current
1626347526059,high-voltage,60,3.03875
time,Hardware,Voltage,Current
1626347526059,high-voltage,65,4.76582
time,Hardware,Voltage,Current
1626347526059,high-voltage,70,7.05544
time,Hardware,Voltage,Current
1626347526059,high-voltage,75,10
