{
    "Data": [[2083.0, 937.0, 555.0, 406.0, 293.0, 218.0, 172.0, 148.0, 144.0, 107.0, 106.0, 82.0, 70.0, 87.0, 67.0, 58.0, 60.0, 47.0, 37.0, 28.0, 34.0, 26.0, 24.0, 26.0, 16.0, 20.0, 17.0, 18.0, 17.0, 24.0, 18.0, 16.0, 18.0, 16.0, 14.0, 13.0, 13.0, 11.0, 8.0, 14.0, 6.0, 7.0, 5.0, 9.0, 11.0, 19.0, 6.0, 14.0, 9.0], [2657.0, 1355.0, 797.0, 583.0, 472.0, 394.0, 312.0, 291.0, 202.0, 209.0, 153.0, 165.0, 128.0, 114.0, 128.0, 106.0, 100.0, 85.0, 78.0, 79.0, 73.0, 71.0, 72.0, 55.0, 42.0, 48.0, 43.0, 49.0, 42.0, 39.0, 36.0, 27.0, 21.0, 19.0, 20.0, 24.0, 20.0, 24.0, 20.0, 27.0, 19.0, 19.0, 23.0, 24.0, 13.0, 20.0, 20.0, 25.0, 24.0], [3054.0, 1548.0, 1133.0, 870.0, 716.0, 601.0, 468.0, 396.0, 389.0, 326.0, 280.0, 273.0, 241.0, 202.0, 186.0, 194.0, 167.0, 169.0, 135.0, 134.0, 120.0, 112.0, 136.0, 112.0, 93.0, 89.0, 85.0, 83.0, 87.0, 69.0, 70.0, 72.0, 83.0, 64.0, 64.0, 56.0, 60.0, 50.0, 55.0, 56.0, 46.0, 40.0, 59.0, 36.0, 45.0, 45.0, 52.0, 43.0, 47.0], [3472.0, 1792.0, 1220.0, 1036.0, 772.0, 694.0, 647.0, 574.0, 521.0, 437.0, 415.0, 419.0, 384.0, 329.0, 332.0, 311.0, 286.0, 250.0, 237.0, 217.0, 197.0, 190.0, 180.0, 185.0, 173.0, 163.0, 166.0, 164.0, 132.0, 152.0, 141.0, 135.0, 111.0, 143.0, 116.0, 115.0, 125.0, 109.0, 116.0, 102.0, 101.0, 100.0, 114.0, 108.0, 111.0, 111.0, 100.0, 92.0, 116.0], [5340.0, 2493.0, 1507.0, 1206.0, 910.0, 827.0, 673.0, 659.0, 595.0, 543.0, 491.0, 483.0, 452.0, 419.0, 384.0, 354.0, 334.0, 355.0, 350.0, 337.0, 343.0, 313.0, 292.0, 300.0, 276.0, 260.0, 254.0, 266.0, 236.0, 220.0, 235.0, 223.0, 215.0, 196.0, 213.0, 216.0, 204.0, 207.0, 219.0, 186.0, 190.0, 178.0, 223.0, 179.0, 199.0, 204.0, 236.0, 248.0, 274.0], [6830.0, 4091.0, 2776.0, 2075.0, 1590.0, 1270.0, 1036.0, 961.0, 812.0, 736.0, 669.0, 612.0, 550.0, 517.0, 520.0, 435.0, 412.0, 454.0, 379.0, 403.0, 365.0, 391.0, 356.0, 322.0, 369.0, 361.0, 345.0, 315.0, 365.0, 323.0, 340.0, 331.0, 328.0, 309.0, 305.0, 350.0, 330.0, 323.0, 332.0, 297.0, 345.0, 334.0, 349.0, 331.0, 365.0, 328.0, 415.0, 442.0, 570.0], [3321.0, 3041.0, 2643.0, 2397.0, 2170.0, 1957.0, 1764.0, 1680.0, 1494.0, 1367.0, 1208.0, 1125.0, 1081.0, 1031.0, 931.0, 856.0, 800.0, 763.0, 691.0, 666.0, 641.0, 587.0, 515.0, 510.0, 492.0, 509.0, 481.0, 482.0, 467.0, 448.0, 430.0, 426.0, 405.0, 443.0, 410.0, 449.0, 414.0, 444.0, 462.0, 500.0, 484.0, 511.0, 533.0, 509.0, 572.0, 608.0, 699.0, 786.0, 1016.0], [923.0, 868.0, 890.0, 931.0, 961.0, 1058.0, 1046.0, 1013.0, 1066.0, 1035.0, 1053.0, 1100.0, 1100.0, 1094.0, 1131.0, 1084.0, 1099.0, 1125.0, 1087.0, 1078.0, 1077.0, 1043.0, 1000.0, 949.0, 1001.0, 1000.0, 941.0, 1000.0, 915.0, 899.0, 852.0, 805.0, 765.0, 823.0, 777.0, 716.0, 747.0, 741.0, 753.0, 763.0, 775.0, 742.0, 772.0, 780.0, 891.0, 927.0, 1082.0, 1241.0, 1674.0], [354.0, 273.0, 264.0, 287.0, 283.0, 327.0, 304.0, 346.0, 365.0, 355.0, 406.0, 409.0, 418.0, 422.0, 478.0, 522.0, 576.0, 606.0, 581.0, 581.0, 644.0, 644.0, 715.0, 708.0, 795.0, 852.0, 832.0, 877.0, 867.0, 1017.0, 1023.0, 1032.0, 1080.0, 1166.0, 1163.0, 1193.0, 1237.0, 1317.0, 1356.0, 1312.0, 1470.0, 1485.0, 1567.0, 1572.0, 1675.0, 1724.0, 1878.0, 2239.0, 2917.0], [228.0, 163.0, 126.0, 124.0, 131.0, 121.0, 111.0, 128.0, 142.0, 131.0, 131.0, 143.0, 157.0, 156.0, 167.0, 186.0, 183.0, 190.0, 197.0, 230.0, 230.0, 222.0, 241.0, 314.0, 279.0, 301.0, 360.0, 361.0, 397.0, 430.0, 478.0, 486.0, 548.0, 597.0, 646.0, 729.0, 782.0, 873.0, 1015.0, 1120.0, 1275.0, 1476.0, 1588.0, 1922.0, 2242.0, 2684.0, 3055.0, 4156.0, 5681.0], [162.0, 118.0, 86.0, 62.0, 61.0, 59.0, 66.0, 62.0, 63.0, 70.0, 75.0, 70.0, 64.0, 78.0, 71.0, 69.0, 79.0, 69.0, 83.0, 100.0, 107.0, 97.0, 116.0, 124.0, 127.0, 149.0, 134.0, 131.0, 154.0, 185.0, 169.0, 218.0, 217.0, 254.0, 275.0, 319.0, 349.0, 363.0, 400.0, 482.0, 554.0, 642.0, 849.0, 1011.0, 1225.0, 1662.0, 2440.0, 3772.0, 6964.0], [162.0, 82.0, 64.0, 50.0, 53.0, 42.0, 41.0, 24.0, 37.0, 50.0, 44.0, 40.0, 37.0, 45.0, 40.0, 42.0, 29.0, 30.0, 39.0, 48.0, 48.0, 39.0, 49.0, 51.0, 59.0, 56.0, 68.0, 68.0, 57.0, 78.0, 93.0, 93.0, 90.0, 121.0, 118.0, 136.0, 142.0, 178.0, 212.0, 238.0, 268.0, 318.0, 369.0, 467.0, 608.0, 789.0, 1215.0, 2101.0, 4791.0], [161.0, 74.0, 49.0, 47.0, 36.0, 36.0, 30.0, 32.0, 40.0, 36.0, 26.0, 34.0, 23.0, 21.0, 30.0, 21.0, 29.0, 21.0, 23.0, 18.0, 20.0, 23.0, 25.0, 24.0, 26.0, 33.0, 22.0, 35.0, 29.0, 47.0, 36.0, 36.0, 41.0, 53.0, 49.0, 57.0, 75.0, 99.0, 90.0, 97.0, 125.0, 151.0, 179.0, 260.0, 316.0, 445.0, 605.0, 1061.0, 2716.0], [187.0, 72.0, 52.0, 35.0, 39.0, 30.0, 35.0, 36.0, 31.0, 22.0, 26.0, 21.0, 23.0, 23.0, 19.0, 16.0, 23.0, 19.0, 24.0, 18.0, 15.0, 14.0, 14.0, 18.0, 16.0, 9.0, 16.0, 14.0, 20.0, 17.0, 24.0, 17.0, 27.0, 19.0, 19.0, 40.0, 23.0, 30.0, 39.0, 60.0, 56.0, 75.0, 112.0, 123.0, 176.0, 174.0, 337.0, 621.0, 1542.0], [249.0, 68.0, 56.0, 44.0, 23.0, 30.0, 29.0, 23.0, 21.0, 30.0, 19.0, 26.0, 25.0, 16.0, 19.0, 11.0, 24.0, 13.0, 16.0, 11.0, 15.0, 12.0, 18.0, 21.0, 12.0, 11.0, 7.0, 8.0, 8.0, 8.0, 14.0, 11.0, 12.0, 13.0, 13.0, 17.0, 18.0, 14.0, 24.0, 28.0, 28.0, 39.0, 54.0, 57.0, 66.0, 101.0, 156.0, 272.0, 907.0], [420.0, 106.0, 62.0, 42.0, 24.0, 25.0, 30.0, 25.0, 27.0, 24.0, 23.0, 18.0, 14.0, 17.0, 16.0, 13.0, 16.0, 13.0, 18.0, 5.0, 8.0, 15.0, 7.0, 19.0, 10.0, 5.0, 11.0, 8.0, 10.0, 12.0, 10.0, 8.0, 7.0, 9.0, 9.0, 11.0, 17.0, 12.0, 17.0, 14.0, 20.0, 17.0, 28.0, 27.0, 37.0, 58.0, 84.0, 145.0, 450.0], [677.0, 187.0, 95.0, 53.0, 34.0, 38.0, 28.0, 27.0, 26.0, 23.0, 25.0, 23.0, 16.0, 15.0, 14.0, 11.0, 8.0, 14.0, 16.0, 11.0, 8.0, 12.0, 5.0, 5.0, 4.0, 6.0, 4.0, 5.0, 9.0, 9.0, 6.0, 5.0, 5.0, 7.0, 11.0, 10.0, 8.0, 11.0, 10.0, 9.0, 16.0, 13.0, 16.0, 17.0, 27.0, 34.0, 44.0, 78.0, 235.0], [1236.0, 379.0, 188.0, 98.0, 63.0, 49.0, 42.0, 28.0, 24.0, 21.0, 14.0, 20.0, 20.0, 20.0, 15.0, 9.0, 11.0, 12.0, 7.0, 15.0, 5.0, 12.0, 7.0, 3.0, 3.0, 6.0, 4.0, 9.0, 6.0, 2.0, 2.0, 3.0, 7.0, 0.0, 8.0, 6.0, 6.0, 8.0, 6.0, 8.0, 9.0, 13.0, 15.0, 16.0, 15.0, 31.0, 35.0, 49.0, 151.0], [1766.0, 746.0, 377.0, 204.0, 120.0, 93.0, 54.0, 50.0, 46.0, 29.0, 41.0, 17.0, 25.0, 21.0, 17.0, 15.0, 9.0, 21.0, 11.0, 8.0, 6.0, 7.0, 5.0, 10.0, 5.0, 2.0, 7.0, 2.0, 3.0, 2.0, 3.0, 6.0, 4.0, 5.0, 2.0, 1.0, 6.0, 3.0, 4.0, 7.0, 6.0, 6.0, 10.0, 11.0, 16.0, 17.0, 24.0, 41.0, 104.0], [2433.0, 1100.0, 647.0, 380.0, 289.0, 183.0, 152.0, 104.0, 92.0, 64.0, 48.0, 50.0, 38.0, 23.0, 29.0, 27.0, 18.0, 25.0, 16.0, 14.0, 10.0, 7.0, 9.0, 5.0, 6.0, 7.0, 4.0, 5.0, 3.0, 3.0, 3.0, 5.0, 1.0, 2.0, 1.0, 5.0, 6.0, 4.0, 2.0, 3.0, 5.0, 3.0, 12.0, 4.0, 11.0, 12.0, 10.0, 21.0, 71.0], [3177.0, 1645.0, 1006.0, 657.0, 523.0, 334.0, 286.0, 234.0, 165.0, 139.0, 116.0, 107.0, 75.0, 75.0, 59.0, 48.0, 41.0, 29.0, 28.0, 28.0, 18.0, 19.0, 18.0, 15.0, 8.0, 15.0, 11.0, 6.0, 14.0, 5.0, 8.0, 2.0, 2.0, 4.0, 4.0, 3.0, 7.0, 1.0, 0.0, 4.0, 4.0, 4.0, 3.0, 6.0, 6.0, 7.0, 7.0, 11.0, 51.0], [3523.0, 1957.0, 1427.0, 964.0, 752.0, 557.0, 454.0, 333.0, 316.0, 270.0, 213.0, 170.0, 139.0, 132.0, 122.0, 82.0, 85.0, 80.0, 55.0, 52.0, 40.0, 42.0, 40.0, 25.0, 30.0, 21.0, 20.0, 19.0, 22.0, 12.0, 18.0, 9.0, 6.0, 7.0, 8.0, 10.0, 8.0, 4.0, 3.0, 4.0, 4.0, 9.0, 9.0, 3.0, 8.0, 6.0, 7.0, 15.0, 19.0], [3635.0, 2292.0, 1652.0, 1242.0, 1045.0, 814.0, 661.0, 537.0, 485.0, 419.0, 345.0, 313.0, 285.0, 242.0, 237.0, 189.0, 171.0, 147.0, 114.0, 109.0, 102.0, 92.0, 72.0, 69.0, 61.0, 56.0, 59.0, 50.0, 48.0, 42.0, 22.0, 29.0, 26.0, 24.0, 24.0, 19.0, 10.0, 17.0, 16.0, 12.0, 7.0, 6.0, 7.0, 10.0, 7.0, 14.0, 13.0, 8.0, 19.0], [3076.0, 2203.0, 1698.0, 1431.0, 1242.0, 1049.0, 892.0, 801.0, 705.0, 613.0, 518.0, 463.0, 417.0, 390.0, 372.0, 309.0, 263.0, 266.0, 220.0, 231.0, 193.0, 154.0, 138.0, 145.0, 148.0, 127.0, 98.0, 85.0, 108.0, 87.0, 63.0, 69.0, 78.0, 64.0, 74.0, 54.0, 33.0, 29.0, 35.0, 32.0, 23.0, 21.0, 21.0, 20.0, 16.0, 17.0, 19.0, 18.0, 21.0], [2210.0, 1898.0, 1598.0, 1374.0, 1221.0, 1115.0, 1011.0, 876.0, 835.0, 734.0, 685.0, 661.0, 618.0, 507.0, 508.0, 485.0, 426.0, 419.0, 362.0, 339.0, 304.0, 295.0, 297.0, 253.0, 236.0, 223.0, 251.0, 187.0, 191.0, 171.0, 151.0, 145.0, 135.0, 109.0, 116.0, 105.0, 84.0, 89.0, 94.0, 76.0, 84.0, 68.0, 58.0, 57.0, 49.0, 49.0, 36.0, 41.0, 46.0], [1312.0, 1270.0, 1193.0, 1063.0, 1065.0, 954.0, 894.0, 862.0, 827.0, 839.0, 806.0, 756.0, 673.0, 658.0, 615.0, 592.0, 543.0, 535.0, 533.0, 510.0, 435.0, 450.0, 428.0, 374.0, 393.0, 401.0, 315.0, 337.0, 309.0, 307.0, 268.0, 302.0, 247.0, 228.0, 205.0, 206.0, 218.0, 185.0, 167.0, 161.0, 164.0, 134.0, 133.0, 123.0, 130.0, 110.0, 95.0, 99.0, 79.0], [675.0, 680.0, 698.0, 714.0, 699.0, 770.0, 701.0, 681.0, 716.0, 663.0, 705.0, 731.0, 720.0, 666.0, 623.0, 619.0, 592.0, 587.0, 630.0, 606.0, 576.0, 539.0, 518.0, 501.0, 520.0, 473.0, 463.0, 481.0, 441.0, 428.0, 419.0, 430.0, 390.0, 358.0, 359.0, 346.0, 349.0, 298.0, 334.0, 290.0, 292.0, 277.0, 291.0, 267.0, 248.0, 225.0, 258.0, 185.0, 204.0], [355.0, 347.0, 351.0, 397.0, 426.0, 447.0, 451.0, 446.0, 452.0, 470.0, 521.0, 524.0, 515.0, 566.0, 553.0, 511.0, 528.0, 563.0, 539.0, 522.0, 540.0, 590.0, 565.0, 526.0, 588.0, 527.0, 560.0, 527.0, 548.0, 543.0, 558.0, 499.0, 553.0, 535.0, 497.0, 497.0, 509.0, 538.0, 469.0, 486.0, 491.0, 472.0, 432.0, 489.0, 421.0, 428.0, 465.0, 442.0, 453.0], [192.0, 168.0, 188.0, 177.0, 221.0, 198.0, 216.0, 245.0, 295.0, 285.0, 351.0, 329.0, 327.0, 342.0, 375.0, 341.0, 380.0, 411.0, 418.0, 400.0, 447.0, 438.0, 492.0, 483.0, 459.0, 534.0, 523.0, 564.0, 544.0, 545.0, 544.0, 589.0, 596.0, 625.0, 646.0, 593.0, 650.0, 616.0, 665.0, 650.0, 659.0, 666.0, 677.0, 712.0, 688.0, 753.0, 776.0, 731.0, 929.0], [122.0, 87.0, 82.0, 97.0, 114.0, 100.0, 103.0, 121.0, 134.0, 146.0, 163.0, 166.0, 180.0, 180.0, 200.0, 203.0, 223.0, 258.0, 253.0, 294.0, 283.0, 310.0, 335.0, 351.0, 353.0, 379.0, 370.0, 454.0, 493.0, 440.0, 507.0, 533.0, 565.0, 534.0, 593.0, 589.0, 637.0, 652.0, 761.0, 705.0, 745.0, 779.0, 878.0, 955.0, 1021.0, 1050.0, 1071.0, 1344.0, 1575.0], [114.0, 79.0, 51.0, 50.0, 57.0, 56.0, 58.0, 50.0, 72.0, 90.0, 68.0, 66.0, 89.0, 99.0, 104.0, 124.0, 111.0, 129.0, 134.0, 136.0, 141.0, 180.0, 172.0, 206.0, 203.0, 235.0, 245.0, 261.0, 299.0, 314.0, 317.0, 358.0, 367.0, 392.0, 480.0, 513.0, 535.0, 550.0, 623.0, 720.0, 755.0, 779.0, 908.0, 988.0, 1094.0, 1285.0, 1500.0, 1780.0, 2337.0], [123.0, 72.0, 54.0, 46.0, 58.0, 30.0, 27.0, 25.0, 38.0, 48.0, 60.0, 63.0, 61.0, 41.0, 46.0, 53.0, 63.0, 45.0, 72.0, 74.0, 76.0, 79.0, 92.0, 109.0, 109.0, 114.0, 129.0, 148.0, 136.0, 167.0, 181.0, 209.0, 229.0, 278.0, 323.0, 297.0, 317.0, 397.0, 455.0, 555.0, 563.0, 640.0, 770.0, 872.0, 1109.0, 1295.0, 1541.0, 2080.0, 2896.0], [154.0, 52.0, 32.0, 45.0, 37.0, 38.0, 26.0, 29.0, 17.0, 23.0, 31.0, 17.0, 20.0, 18.0, 30.0, 42.0, 28.0, 26.0, 29.0, 45.0, 35.0, 51.0, 26.0, 48.0, 57.0, 62.0, 74.0, 84.0, 98.0, 77.0, 91.0, 95.0, 122.0, 145.0, 160.0, 188.0, 213.0, 229.0, 262.0, 320.0, 354.0, 445.0, 536.0, 683.0, 785.0, 1084.0, 1405.0, 2036.0, 3159.0], [136.0, 65.0, 52.0, 24.0, 16.0, 24.0, 19.0, 19.0, 18.0, 6.0, 27.0, 19.0, 17.0, 24.0, 24.0, 14.0, 27.0, 15.0, 20.0, 32.0, 20.0, 15.0, 11.0, 21.0, 27.0, 32.0, 43.0, 37.0, 28.0, 46.0, 44.0, 55.0, 70.0, 84.0, 69.0, 91.0, 114.0, 132.0, 161.0, 180.0, 212.0, 232.0, 321.0, 395.0, 560.0, 783.0, 1097.0, 1617.0, 2983.0], [108.0, 38.0, 36.0, 22.0, 37.0, 28.0, 23.0, 12.0, 15.0, 22.0, 13.0, 22.0, 33.0, 25.0, 37.0, 8.0, 16.0, 13.0, 13.0, 24.0, 8.0, 10.0, 6.0, 9.0, 6.0, 7.0, 7.0, 24.0, 17.0, 17.0, 12.0, 34.0, 21.0, 25.0, 24.0, 50.0, 52.0, 48.0, 74.0, 100.0, 108.0, 118.0, 186.0, 229.0, 302.0, 462.0, 707.0, 1192.0, 2540.0], [94.0, 52.0, 72.0, 54.0, 23.0, 44.0, 48.0, 24.0, 19.0, 13.0, 40.0, 36.0, 21.0, 47.0, 20.0, 17.0, 11.0, 13.0, 22.0, 45.0, 24.0, 3.0, 4.0, 5.0, 5.0, 4.0, 4.0, 3.0, 3.0, 7.0, 4.0, 10.0, 12.0, 42.0, 22.0, 29.0, 44.0, 16.0, 19.0, 43.0, 48.0, 74.0, 77.0, 109.0, 163.0, 247.0, 413.0, 812.0, 1841.0], [118.0, 76.0, 34.0, 29.0, 32.0, 18.0, 18.0, 19.0, 16.0, 16.0, 17.0, 19.0, 9.0, 19.0, 10.0, 13.0, 20.0, 45.0, 19.0, 20.0, 17.0, 4.0, 2.0, 6.0, 15.0, 17.0, 14.0, 18.0, 21.0, 3.0, 4.0, 3.0, 3.0, 5.0, 2.0, 8.0, 11.0, 9.0, 23.0, 42.0, 25.0, 45.0, 44.0, 40.0, 68.0, 117.0, 229.0, 399.0, 1135.0], [116.0, 43.0, 26.0, 27.0, 23.0, 27.0, 23.0, 28.0, 41.0, 32.0, 11.0, 9.0, 14.0, 10.0, 25.0, 24.0, 13.0, 10.0, 11.0, 8.0, 12.0, 9.0, 5.0, 2.0, 1.0, 2.0, 3.0, 19.0, 18.0, 1.0, 0.0, 0.0, 4.0, 1.0, 1.0, 1.0, 3.0, 1.0, 1.0, 4.0, 4.0, 11.0, 18.0, 25.0, 27.0, 40.0, 116.0, 217.0, 725.0], [107.0, 39.0, 27.0, 20.0, 23.0, 26.0, 21.0, 19.0, 32.0, 23.0, 17.0, 22.0, 10.0, 23.0, 11.0, 16.0, 14.0, 33.0, 21.0, 10.0, 4.0, 7.0, 4.0, 3.0, 1.0, 8.0, 22.0, 4.0, 3.0, 1.0, 6.0, 20.0, 1.0, 2.0, 1.0, 3.0, 3.0, 1.0, 1.0, 1.0, 2.0, 6.0, 2.0, 10.0, 13.0, 14.0, 51.0, 100.0, 392.0], [103.0, 48.0, 29.0, 29.0, 38.0, 29.0, 23.0, 15.0, 20.0, 12.0, 16.0, 13.0, 27.0, 67.0, 11.0, 8.0, 13.0, 9.0, 12.0, 16.0, 6.0, 7.0, 9.0, 18.0, 12.0, 5.0, 5.0, 0.0, 1.0, 0.0, 3.0, 0.0, 0.0, 1.0, 3.0, 0.0, 0.0, 0.0, 1.0, 4.0, 4.0, 25.0, 2.0, 3.0, 4.0, 7.0, 18.0, 38.0, 201.0], [94.0, 44.0, 35.0, 20.0, 22.0, 21.0, 24.0, 27.0, 29.0, 15.0, 14.0, 13.0, 16.0, 19.0, 11.0, 21.0, 26.0, 8.0, 5.0, 7.0, 11.0, 11.0, 3.0, 7.0, 6.0, 4.0, 4.0, 2.0, 1.0, 0.0, 3.0, 0.0, 2.0, 22.0, 5.0, 1.0, 6.0, 1.0, 2.0, 1.0, 6.0, 20.0, 1.0, 2.0, 15.0, 13.0, 6.0, 22.0, 92.0], [103.0, 49.0, 29.0, 29.0, 29.0, 24.0, 16.0, 13.0, 18.0, 15.0, 12.0, 10.0, 11.0, 13.0, 11.0, 11.0, 14.0, 11.0, 12.0, 8.0, 8.0, 3.0, 5.0, 7.0, 8.0, 3.0, 7.0, 1.0, 2.0, 1.0, 1.0, 1.0, 4.0, 0.0, 2.0, 1.0, 2.0, 1.0, 9.0, 17.0, 0.0, 27.0, 2.0, 0.0, 4.0, 9.0, 21.0, 6.0, 46.0], [98.0, 42.0, 34.0, 27.0, 29.0, 18.0, 26.0, 19.0, 15.0, 19.0, 9.0, 11.0, 15.0, 15.0, 8.0, 11.0, 11.0, 14.0, 5.0, 5.0, 11.0, 14.0, 5.0, 2.0, 4.0, 4.0, 5.0, 2.0, 3.0, 0.0, 1.0, 0.0, 0.0, 2.0, 1.0, 0.0, 3.0, 1.0, 2.0, 1.0, 2.0, 2.0, 2.0, 0.0, 1.0, 3.0, 2.0, 7.0, 18.0], [104.0, 54.0, 26.0, 29.0, 23.0, 22.0, 19.0, 33.0, 13.0, 22.0, 13.0, 15.0, 13.0, 12.0, 21.0, 16.0, 6.0, 19.0, 23.0, 8.0, 10.0, 8.0, 5.0, 4.0, 3.0, 1.0, 3.0, 2.0, 2.0, 1.0, 1.0, 1.0, 1.0, 1.0, 1.0, 2.0, 1.0, 4.0, 24.0, 1.0, 1.0, 0.0, 3.0, 25.0, 1.0, 2.0, 1.0, 7.0, 16.0], [113.0, 47.0, 39.0, 22.0, 31.0, 17.0, 17.0, 15.0, 13.0, 21.0, 18.0, 11.0, 8.0, 10.0, 10.0, 10.0, 11.0, 13.0, 14.0, 11.0, 5.0, 8.0, 10.0, 7.0, 5.0, 2.0, 7.0, 2.0, 2.0, 0.0, 1.0, 1.0, 0.0, 0.0, 1.0, 3.0, 0.0, 0.0, 1.0, 0.0, 1.0, 1.0, 5.0, 4.0, 0.0, 3.0, 2.0, 4.0, 6.0], [115.0, 43.0, 36.0, 22.0, 26.0, 29.0, 21.0, 17.0, 14.0, 11.0, 12.0, 12.0, 11.0, 18.0, 12.0, 12.0, 13.0, 9.0, 10.0, 10.0, 11.0, 4.0, 8.0, 2.0, 4.0, 4.0, 4.0, 3.0, 1.0, 3.0, 3.0, 1.0, 2.0, 1.0, 0.0, 2.0, 2.0, 1.0, 1.0, 1.0, 2.0, 0.0, 2.0, 3.0, 1.0, 3.0, 1.0, 4.0, 4.0], [103.0, 50.0, 38.0, 16.0, 21.0, 16.0, 27.0, 21.0, 12.0, 14.0, 16.0, 18.0, 13.0, 15.0, 4.0, 18.0, 15.0, 6.0, 10.0, 8.0, 9.0, 1.0, 6.0, 6.0, 6.0, 5.0, 3.0, 2.0, 1.0, 4.0, 1.0, 14.0, 11.0, 0.0, 0.0, 1.0, 2.0, 4.0, 0.0, 1.0, 1.0, 0.0, 4.0, 1.0, 4.0, 1.0, 2.0, 1.0, 6.0], [100.0, 59.0, 24.0, 27.0, 18.0, 28.0, 20.0, 19.0, 16.0, 15.0, 22.0, 16.0, 11.0, 14.0, 5.0, 15.0, 11.0, 12.0, 10.0, 13.0, 8.0, 6.0, 6.0, 4.0, 4.0, 3.0, 1.0, 0.0, 1.0, 2.0, 0.0, 1.0, 15.0, 13.0, 0.0, 2.0, 1.0, 2.0, 2.0, 1.0, 0.0, 0.0, 1.0, 2.0, 5.0, 1.0, 3.0, 1.0, 5.0], [113.0, 50.0, 51.0, 29.0, 16.0, 11.0, 15.0, 19.0, 21.0, 17.0, 14.0, 11.0, 18.0, 11.0, 13.0, 8.0, 17.0, 6.0, 9.0, 12.0, 11.0, 5.0, 5.0, 7.0, 5.0, 2.0, 11.0, 18.0, 1.0, 2.0, 1.0, 2.0, 1.0, 1.0, 1.0, 1.0, 0.0, 0.0, 3.0, 1.0, 1.0, 1.0, 2.0, 2.0, 2.0, 2.0, 3.0, 6.0, 27.0], [111.0, 41.0, 27.0, 17.0, 26.0, 21.0, 19.0, 14.0, 15.0, 13.0, 20.0, 16.0, 12.0, 17.0, 6.0, 9.0, 16.0, 16.0, 12.0, 12.0, 10.0, 4.0, 4.0, 6.0, 7.0, 4.0, 5.0, 6.0, 1.0, 3.0, 1.0, 0.0, 2.0, 1.0, 0.0, 0.0, 1.0, 0.0, 0.0, 0.0, 1.0, 0.0, 1.0, 0.0, 1.0, 1.0, 0.0, 4.0, 4.0], [98.0, 59.0, 34.0, 19.0, 22.0, 18.0, 21.0, 16.0, 17.0, 16.0, 15.0, 9.0, 16.0, 14.0, 12.0, 18.0, 11.0, 6.0, 10.0, 5.0, 6.0, 8.0, 6.0, 5.0, 9.0, 6.0, 1.0, 3.0, 3.0, 5.0, 0.0, 3.0, 0.0, 1.0, 1.0, 2.0, 0.0, 0.0, 1.0, 0.0, 2.0, 2.0, 2.0, 2.0, 0.0, 2.0, 2.0, 2.0, 5.0]],
    "Name": "sCurve-0",
    "Overflow": 2565419.0,
    "Type": "Histo2d",
    "Underflow": 0.0,
    "x": {
        "AxisTitle": "Vcal",
        "Bins": 51,
        "High": 302.5,
        "Low": 47.5
    },
    "y": {
        "AxisTitle": "Occupancy",
        "Bins": 49,
        "High": 49.5,
        "Low": 0.5
    },
    "z": {
        "AxisTitle": "Number of pixels"
    }
}