time,Hardware,Voltage,Current
1621544355472,high-voltage-3,1,0.0721813
time,Hardware,Voltage,Current
1621544355472,high-voltage-3,2,0.0783417
time,Hardware,Voltage,Current
1621544355472,high-voltage-3,3,0.0834017
time,Hardware,Voltage,Current
1621544355472,high-voltage-3,4,0.0854137
time,Hardware,Voltage,Current
1621544355472,high-voltage-3,5,0.0870246
time,Hardware,Voltage,Current
1621544355472,high-voltage-3,6,0.089369
time,Hardware,Voltage,Current
1621544355472,high-voltage-3,7,0.0924407
time,Hardware,Voltage,Current
1621544355472,high-voltage-3,8,0.0989168
time,Hardware,Voltage,Current
1621544355472,high-voltage-3,9,0.101916
time,Hardware,Voltage,Current
1621544355472,high-voltage-3,10,0.106029
time,Hardware,Voltage,Current
1621544355472,high-voltage-3,11,0.1067
time,Hardware,Voltage,Current
1621544355472,high-voltage-3,12,0.112335
time,Hardware,Voltage,Current
1621544355472,high-voltage-3,13,0.10683
time,Hardware,Voltage,Current
1621544355472,high-voltage-3,14,0.112069
time,Hardware,Voltage,Current
1621544355472,high-voltage-3,15,0.113663
time,Hardware,Voltage,Current
1621544355472,high-voltage-3,16,0.115096
time,Hardware,Voltage,Current
1621544355472,high-voltage-3,17,0.119406
time,Hardware,Voltage,Current
1621544355472,high-voltage-3,1.20617e-07,0.121183
time,Hardware,Voltage,Current
1621544355472,high-voltage-3,19,0.123627
time,Hardware,Voltage,Current
1621544355472,high-voltage-3,20,0.126565
time,Hardware,Voltage,Current
1621544355472,high-voltage-3,25,0.134361
time,Hardware,Voltage,Current
1621544355472,high-voltage-3,30,0.140958
time,Hardware,Voltage,Current
1621544355472,high-voltage-3,35,0.148036
time,Hardware,Voltage,Current
1621544355472,high-voltage-3,40,0.154937
time,Hardware,Voltage,Current
1621544355472,high-voltage-3,45,0.160125
time,Hardware,Voltage,Current
1621544355472,high-voltage-3,50,0.16632
time,Hardware,Voltage,Current
1621544355472,high-voltage-3,55,0.172431
time,Hardware,Voltage,Current
1621544355472,high-voltage-3,60,0.177068
time,Hardware,Voltage,Current
1621544355472,high-voltage-3,65,0.18181
time,Hardware,Voltage,Current
1621544355472,high-voltage-3,70,0.186637
time,Hardware,Voltage,Current
1621544355472,high-voltage-3,75,0.192345
time,Hardware,Voltage,Current
1621544355472,high-voltage-3,80,0.199336
time,Hardware,Voltage,Current
1621544355472,high-voltage-3,85,0.203491
time,Hardware,Voltage,Current
1621544355472,high-voltage-3,90,0.209655
time,Hardware,Voltage,Current
1621544355472,high-voltage-3,95,0.215033
time,Hardware,Voltage,Current
1621544355472,high-voltage-3,100,0.219617
