{
    "Data": [0.0, 0.0, 0.0, 0.0, 0.0, 0.0, 0.0, 0.0, 0.0, 0.0, 0.0, 0.0, 0.0, 0.0, 0.0, 0.0, 4.0, 4.0, 8.0, 12.0, 13.0, 9.0, 15.0, 14.0, 0.0, 3.0, 32.0, 37.0, 36.0, 41.0, 0.0, 47.0, 19.0, 48.0, 31.0, 12.0, 18.0, 12.0, 23.0, 50.0, 30.0, 32.0, 50.0, 31.0, 36.0, 12.0, 50.0, 18.0, 20.0, 41.0, 10.0],
    "Name": "Scurve-120-96",
    "Overflow": 0.0,
    "Type": "Histo1d",
    "Underflow": 0.0,
    "x": {
        "AxisTitle": "Vcal",
        "Bins": 51,
        "High": 302.5,
        "Low": 47.5
    },
    "y": {
        "AxisTitle": "Occupancy"
    },
    "z": {
        "AxisTitle": "z"
    }
}