{
    "Data": [0.0, 0.0, 0.0, 0.0, 0.0, 0.0, 0.0, 0.0, 0.0, 0.0, 0.0, 0.0, 0.0, 0.0, 1.0, 0.0, 0.0, 1.0, 0.0, 0.0, 1.0, 0.0, 3.0, 0.0, 2.0, 2.0, 7.0, 5.0, 6.0, 8.0, 22.0, 27.0, 13.0, 14.0, 32.0, 43.0, 36.0, 289.0, 516.0, 441.0, 314.0, 845.0, 1912.0, 2918.0, 2081.0, 1440.0, 2529.0, 3277.0, 3791.0, 2823.0, 2421.0, 2347.0, 2642.0, 2104.0, 1618.0, 1523.0, 1511.0, 1707.0, 1396.0, 1315.0, 1073.0, 975.0, 852.0, 654.0, 571.0, 525.0, 543.0, 419.0, 414.0, 379.0, 324.0, 292.0, 276.0, 230.0, 177.0, 228.0, 167.0, 149.0, 154.0, 134.0, 114.0, 100.0, 86.0, 83.0, 70.0, 84.0, 66.0, 61.0, 61.0, 54.0, 59.0, 41.0, 47.0, 27.0, 24.0, 33.0, 20.0, 17.0, 15.0, 18.0, 20.0, 12.0, 14.0, 15.0, 10.0, 8.0, 10.0, 9.0, 10.0, 10.0, 6.0, 8.0, 7.0, 11.0, 5.0, 3.0, 8.0, 5.0, 6.0, 6.0, 8.0, 3.0, 3.0, 4.0, 3.0, 6.0, 1.0, 0.0, 2.0, 0.0, 2.0, 1.0, 1.0, 2.0, 3.0, 0.0, 0.0, 2.0, 0.0, 2.0, 1.0, 3.0, 2.0, 2.0, 2.0, 3.0, 0.0, 0.0, 1.0, 1.0, 0.0, 0.0, 1.0, 1.0, 0.0, 1.0, 2.0, 0.0, 2.0, 0.0, 1.0, 0.0, 0.0, 1.0, 0.0, 0.0, 0.0, 0.0, 2.0, 2.0, 2.0, 0.0, 1.0, 1.0, 0.0, 1.0, 0.0, 0.0, 0.0, 0.0, 0.0, 0.0, 0.0, 0.0, 0.0, 2.0, 1.0, 0.0, 0.0, 1.0, 0.0, 0.0, 0.0, 0.0, 1.0, 0.0, 2.0, 0.0, 0.0, 1.0, 1.0],
    "Name": "TimePerFitDist-0",
    "Overflow": 148.0,
    "Type": "Histo1d",
    "Underflow": 0.0,
    "x": {
        "AxisTitle": "Fit Time [us]",
        "Bins": 201,
        "High": 401.0,
        "Low": -1.0
    },
    "y": {
        "AxisTitle": "Number of Pixels"
    },
    "z": {
        "AxisTitle": "z"
    }
}