time,Hardware,Voltage,Current
1622018385075,high-voltage,1,0.157213
time,Hardware,Voltage,Current
1622018385075,high-voltage,2,0.263938
time,Hardware,Voltage,Current
1622018385075,high-voltage,3,0.38644
time,Hardware,Voltage,Current
1622018385075,high-voltage,4,0.506648
time,Hardware,Voltage,Current
1622018385075,high-voltage,5,0.644092
time,Hardware,Voltage,Current
1622018385075,high-voltage,6,0.83855
time,Hardware,Voltage,Current
1622018385075,high-voltage,7,1.08646
time,Hardware,Voltage,Current
1622018385075,high-voltage,8,1.41225
time,Hardware,Voltage,Current
1622018385075,high-voltage,9,1.67301
time,Hardware,Voltage,Current
1622018385075,high-voltage,10,2.12894
time,Hardware,Voltage,Current
1622018385075,high-voltage,11,2.61804
time,Hardware,Voltage,Current
1622018385075,high-voltage,12,3.22994
time,Hardware,Voltage,Current
1622018385075,high-voltage,13,4.00568
time,Hardware,Voltage,Current
1622018385075,high-voltage,14,4.86978
time,Hardware,Voltage,Current
1622018385075,high-voltage,15,5.83559
time,Hardware,Voltage,Current
1622018385075,high-voltage,16,6.79231
time,Hardware,Voltage,Current
1622018385075,high-voltage,17,7.6786
time,Hardware,Voltage,Current
1622018385075,high-voltage,18,8.79929
time,Hardware,Voltage,Current
1622018385075,high-voltage,19,9.66969
time,Hardware,Voltage,Current
1622018385075,high-voltage,1.00001e-05,10.0001
