{
    "Data": [0.0, 0.0, 0.0, 0.0, 0.0, 0.0, 0.0, 0.0, 0.0, 0.0, 0.0, 0.0, 0.0, 0.0, 0.0, 0.0, 0.0, 0.0, 0.0, 0.0, 0.0, 0.0, 0.0, 0.0, 0.0, 0.0, 0.0, 0.0, 0.0, 0.0, 0.0, 0.0, 0.0, 0.0, 0.0, 0.0, 0.0, 0.0, 0.0, 0.0, 0.0, 0.0, 0.0, 0.0, 0.0, 0.0, 0.0, 0.0, 0.0, 0.0, 47.0, 106.0, 112.0, 120.0, 141.0, 181.0, 185.0, 225.0, 272.0, 275.0, 308.0, 354.0, 434.0, 478.0, 497.0, 542.0, 559.0, 627.0, 654.0, 733.0, 712.0, 786.0, 823.0, 862.0, 881.0, 866.0, 848.0, 919.0, 879.0, 822.0, 861.0, 881.0, 867.0, 883.0, 883.0, 949.0, 1047.0, 1298.0, 1555.0, 1912.0, 2214.0, 2596.0, 2764.0, 2983.0, 2833.0, 2620.0, 2215.0, 1750.0, 1356.0, 960.0, 644.0, 483.0, 359.0, 246.0, 155.0, 110.0, 87.0, 77.0, 50.0, 46.0, 32.0, 33.0, 31.0, 22.0, 26.0, 27.0, 16.0, 20.0, 12.0, 9.0, 11.0, 16.0, 17.0, 12.0, 10.0, 16.0, 12.0, 10.0, 12.0, 8.0, 7.0, 5.0, 6.0, 5.0, 6.0, 6.0, 4.0, 7.0, 6.0, 7.0, 5.0, 5.0, 3.0, 5.0, 3.0, 1.0, 1.0, 2.0, 3.0, 3.0, 4.0, 4.0, 4.0, 4.0, 1.0, 5.0, 11.0, 5.0, 12.0, 15.0, 25.0, 19.0, 34.0, 46.0, 56.0, 61.0, 93.0, 101.0, 120.0, 150.0, 184.0, 243.0, 260.0, 312.0, 371.0, 422.0, 492.0, 548.0, 587.0, 632.0, 667.0, 719.0, 743.0, 815.0, 858.0, 944.0, 920.0, 937.0, 913.0, 923.0, 964.0, 979.0, 916.0, 846.0, 828.0, 749.0, 690.0, 641.0, 603.0, 548.0, 532.0, 440.0, 389.0, 321.0, 295.0, 276.0, 206.0, 221.0, 151.0, 171.0, 126.0, 102.0, 74.0, 68.0, 58.0, 34.0, 39.0, 19.0, 22.0, 21.0, 14.0, 9.0, 7.0, 4.0, 5.0, 1.0, 1.0, 0.0, 1.0, 0.0, 0.0, 1.0, 0.0, 0.0, 0.0, 0.0, 0.0, 0.0, 0.0, 0.0, 0.0, 0.0, 0.0, 0.0, 1.0, 0.0, 0.0, 0.0, 0.0, 0.0, 0.0, 0.0, 0.0, 0.0, 0.0, 0.0, 0.0, 0.0, 0.0, 0.0, 0.0, 0.0, 0.0, 0.0, 0.0, 0.0, 0.0, 0.0, 1.0, 0.0, 0.0, 0.0, 0.0, 1.0, 0.0, 0.0, 0.0, 0.0, 0.0, 0.0, 0.0, 0.0, 0.0, 0.0, 0.0, 0.0, 0.0, 0.0, 0.0, 0.0, 0.0, 0.0, 0.0, 0.0, 0.0, 0.0, 0.0, 0.0, 0.0, 0.0, 0.0, 0.0, 0.0, 0.0, 0.0, 0.0, 0.0, 0.0, 0.0, 0.0, 0.0, 0.0, 0.0, 0.0, 0.0, 0.0, 0.0, 0.0, 0.0, 0.0, 0.0, 0.0, 0.0, 0.0, 0.0, 0.0, 0.0, 0.0, 0.0, 0.0, 0.0, 0.0, 0.0, 0.0, 0.0, 0.0, 0.0, 0.0, 0.0, 0.0, 0.0, 0.0, 0.0, 0.0, 0.0, 0.0, 0.0, 0.0, 0.0, 0.0, 0.0, 0.0, 0.0, 0.0, 0.0, 0.0, 0.0, 0.0, 0.0, 0.0, 0.0, 0.0, 0.0, 0.0],
    "Name": "ThresholdDist-0",
    "Overflow": 0.0,
    "Type": "Histo1d",
    "Underflow": 0.0,
    "x": {
        "AxisTitle": "Threshold [e]",
        "Bins": 364,
        "High": 3635.0,
        "Low": -5.0
    },
    "y": {
        "AxisTitle": "Number of Pixels"
    },
    "z": {
        "AxisTitle": "z"
    }
}