time,Hardware,Voltage,Current
1626747842092,high-voltage,1,0.00787869
time,Hardware,Voltage,Current
1626747842092,high-voltage,2,0.0239625
time,Hardware,Voltage,Current
1626747842092,high-voltage,3,0.0346513
time,Hardware,Voltage,Current
1626747842092,high-voltage,4,0.0421853
time,Hardware,Voltage,Current
1626747842092,high-voltage,5,0.0489089
time,Hardware,Voltage,Current
1626747842092,high-voltage,6,0.05549
time,Hardware,Voltage,Current
1626747842092,high-voltage,7,0.0616661
time,Hardware,Voltage,Current
1626747842092,high-voltage,8,0.0689483
time,Hardware,Voltage,Current
1626747842092,high-voltage,9,0.0753859
time,Hardware,Voltage,Current
1626747842092,high-voltage,10,0.0808348
time,Hardware,Voltage,Current
1626747842092,high-voltage,11,0.0871948
time,Hardware,Voltage,Current
1626747842092,high-voltage,12,0.0908442
time,Hardware,Voltage,Current
1626747842092,high-voltage,13,0.0954705
time,Hardware,Voltage,Current
1626747842092,high-voltage,14,0.0988785
time,Hardware,Voltage,Current
1626747842092,high-voltage,15,0.101752
time,Hardware,Voltage,Current
1626747842092,high-voltage,16,0.104517
time,Hardware,Voltage,Current
1626747842092,high-voltage,17,0.108188
time,Hardware,Voltage,Current
1626747842092,high-voltage,18,0.110365
time,Hardware,Voltage,Current
1626747842092,high-voltage,19,0.113526
time,Hardware,Voltage,Current
1626747842092,high-voltage,20,0.115865
time,Hardware,Voltage,Current
1626747842092,high-voltage,25,0.130856
time,Hardware,Voltage,Current
1626747842092,high-voltage,30,0.148299
time,Hardware,Voltage,Current
1626747842092,high-voltage,35,0.191434
time,Hardware,Voltage,Current
1626747842092,high-voltage,40,0.320843
time,Hardware,Voltage,Current
1626747842092,high-voltage,45,0.625567
time,Hardware,Voltage,Current
1626747842092,high-voltage,50,1.21686
time,Hardware,Voltage,Current
1626747842092,high-voltage,55,2.2051
time,Hardware,Voltage,Current
1626747842092,high-voltage,60,3.69446
time,Hardware,Voltage,Current
1626747842092,high-voltage,65,5.78128
time,Hardware,Voltage,Current
1626747842092,high-voltage,70,8.60498
time,Hardware,Voltage,Current
1626747842092,high-voltage,75,10
