time,Hardware,Voltage,Current
1621611132337,high-voltage,1,0.141059
time,Hardware,Voltage,Current
1621611132337,high-voltage,2,0.241376
time,Hardware,Voltage,Current
1621611132337,high-voltage,3,0.378401
time,Hardware,Voltage,Current
1621611132337,high-voltage,4,0.544412
time,Hardware,Voltage,Current
1621611132337,high-voltage,5,0.754688
time,Hardware,Voltage,Current
1621611132337,high-voltage,6,1.02855
time,Hardware,Voltage,Current
1621611132337,high-voltage,7,1.31609
time,Hardware,Voltage,Current
1621611132337,high-voltage,8,1.74662
time,Hardware,Voltage,Current
1621611132337,high-voltage,9,2.29883
time,Hardware,Voltage,Current
1621611132337,high-voltage,10,2.90882
time,Hardware,Voltage,Current
1621611132337,high-voltage,11,3.63721
time,Hardware,Voltage,Current
1621611132337,high-voltage,12,4.38567
time,Hardware,Voltage,Current
1621611132337,high-voltage,13,5.27418
time,Hardware,Voltage,Current
1621611132337,high-voltage,14,6.27041
time,Hardware,Voltage,Current
1621611132337,high-voltage,15,7.39322
time,Hardware,Voltage,Current
1621611132337,high-voltage,16,8.54824
time,Hardware,Voltage,Current
1621611132337,high-voltage,17,9.61424
time,Hardware,Voltage,Current
1621611132337,high-voltage,18,10.0001
