time,Hardware,Voltage,Current
1626350811836,high-voltage,1,0.0104393
time,Hardware,Voltage,Current
1626350811836,high-voltage,2,0.0250081
time,Hardware,Voltage,Current
1626350811836,high-voltage,3,0.032663
time,Hardware,Voltage,Current
1626350811836,high-voltage,4,0.0400546
time,Hardware,Voltage,Current
1626350811836,high-voltage,5,0.0460475
time,Hardware,Voltage,Current
1626350811836,high-voltage,6,0.0523586
time,Hardware,Voltage,Current
1626350811836,high-voltage,7,0.0584398
time,Hardware,Voltage,Current
1626350811836,high-voltage,8,0.0653948
time,Hardware,Voltage,Current
1626350811836,high-voltage,9,0.0714563
time,Hardware,Voltage,Current
1626350811836,high-voltage,10,0.0791501
time,Hardware,Voltage,Current
1626350811836,high-voltage,11,0.0851192
time,Hardware,Voltage,Current
1626350811836,high-voltage,12,0.0903816
time,Hardware,Voltage,Current
1626350811836,high-voltage,13,0.0941197
time,Hardware,Voltage,Current
1626350811836,high-voltage,14,0.0977593
time,Hardware,Voltage,Current
1626350811836,high-voltage,15,0.10215
time,Hardware,Voltage,Current
1626350811836,high-voltage,16,0.105653
time,Hardware,Voltage,Current
1626350811836,high-voltage,17,0.107999
time,Hardware,Voltage,Current
1626350811836,high-voltage,18,0.111773
time,Hardware,Voltage,Current
1626350811836,high-voltage,19,0.114806
time,Hardware,Voltage,Current
1626350811836,high-voltage,20,0.118155
time,Hardware,Voltage,Current
1626350811836,high-voltage,25,0.13282
time,Hardware,Voltage,Current
1626350811836,high-voltage,30,0.149396
time,Hardware,Voltage,Current
1626350811836,high-voltage,35,0.183861
time,Hardware,Voltage,Current
1626350811836,high-voltage,40,0.285743
time,Hardware,Voltage,Current
1626350811836,high-voltage,45,0.535849
time,Hardware,Voltage,Current
1626350811836,high-voltage,50,1.0146
time,Hardware,Voltage,Current
1626350811836,high-voltage,55,1.83035
time,Hardware,Voltage,Current
1626350811836,high-voltage,60,3.07987
time,Hardware,Voltage,Current
1626350811836,high-voltage,65,4.81081
time,Hardware,Voltage,Current
1626350811836,high-voltage,70,7.12292
time,Hardware,Voltage,Current
1626350811836,high-voltage,75,10
