{
    "Data": [0.0, 0.0, 0.0, 0.0, 0.0, 0.0, 0.0, 0.0, 0.0, 0.0, 0.0, 0.0, 0.0, 0.0, 1.0, 0.0, 0.0, 33.0, 408.0, 137.0, 54.0, 751.0, 4280.0, 1859.0, 496.0, 1160.0, 3832.0, 2407.0, 643.0, 952.0, 2067.0, 1547.0, 506.0, 365.0, 453.0, 449.0, 269.0, 365.0, 674.0, 548.0, 435.0, 708.0, 1523.0, 2044.0, 1411.0, 1476.0, 2144.0, 3039.0, 2838.0, 2530.0, 2436.0, 2649.0, 2606.0, 2122.0, 1925.0, 1942.0, 2067.0, 1868.0, 1687.0, 1615.0, 1474.0, 1288.0, 953.0, 814.0, 729.0, 738.0, 705.0, 543.0, 508.0, 479.0, 470.0, 392.0, 299.0, 273.0, 248.0, 230.0, 221.0, 189.0, 187.0, 134.0, 135.0, 135.0, 118.0, 105.0, 101.0, 75.0, 52.0, 77.0, 58.0, 62.0, 41.0, 44.0, 45.0, 33.0, 29.0, 28.0, 25.0, 16.0, 20.0, 22.0, 24.0, 18.0, 15.0, 22.0, 19.0, 14.0, 10.0, 11.0, 8.0, 13.0, 7.0, 8.0, 5.0, 7.0, 11.0, 7.0, 9.0, 8.0, 7.0, 6.0, 12.0, 3.0, 7.0, 4.0, 7.0, 2.0, 1.0, 4.0, 0.0, 1.0, 2.0, 0.0, 3.0, 7.0, 5.0, 5.0, 5.0, 4.0, 2.0, 6.0, 2.0, 1.0, 1.0, 0.0, 1.0, 0.0, 1.0, 2.0, 0.0, 0.0, 2.0, 0.0, 0.0, 0.0, 2.0, 0.0, 2.0, 0.0, 0.0, 1.0, 1.0, 1.0, 0.0, 0.0, 2.0, 2.0, 0.0, 0.0, 1.0, 1.0, 0.0, 0.0, 1.0, 0.0, 2.0, 1.0, 0.0, 2.0, 2.0, 0.0, 1.0, 0.0, 2.0, 0.0, 1.0, 0.0, 1.0, 0.0, 0.0, 1.0, 3.0, 0.0, 3.0, 2.0, 1.0, 3.0, 0.0, 0.0, 0.0, 1.0, 3.0],
    "Name": "TimePerFitDist-0",
    "Overflow": 212.0,
    "Type": "Histo1d",
    "Underflow": 0.0,
    "x": {
        "AxisTitle": "Fit Time [us]",
        "Bins": 201,
        "High": 401.0,
        "Low": -1.0
    },
    "y": {
        "AxisTitle": "Number of Pixels"
    },
    "z": {
        "AxisTitle": "z"
    }
}