time,Hardware,Voltage,Current
1621478172760,high-voltage-2,1,0.120076
time,Hardware,Voltage,Current
1621478172760,high-voltage-2,2,0.151641
time,Hardware,Voltage,Current
1621478172760,high-voltage-2,3,0.167055
time,Hardware,Voltage,Current
1621478172760,high-voltage-2,4,0.179495
time,Hardware,Voltage,Current
1621478172760,high-voltage-2,5,0.19361
time,Hardware,Voltage,Current
1621478172760,high-voltage-2,6,0.209306
time,Hardware,Voltage,Current
1621478172760,high-voltage-2,7,0.228456
time,Hardware,Voltage,Current
1621478172760,high-voltage-2,8,0.245789
time,Hardware,Voltage,Current
1621478172760,high-voltage-2,9,0.266688
time,Hardware,Voltage,Current
1621478172760,high-voltage-2,10,0.289802
