time,Hardware,Voltage,Current
1621975582875,high-voltage,1,0.176468
time,Hardware,Voltage,Current
1621975582875,high-voltage,2,0.30164
time,Hardware,Voltage,Current
1621975582875,high-voltage,3,0.47177
time,Hardware,Voltage,Current
1621975582875,high-voltage,4,0.683316
time,Hardware,Voltage,Current
1621975582875,high-voltage,5,0.956782
time,Hardware,Voltage,Current
1621975582875,high-voltage,6,1.30444
time,Hardware,Voltage,Current
1621975582875,high-voltage,7,1.68441
time,Hardware,Voltage,Current
1621975582875,high-voltage,8,2.24838
time,Hardware,Voltage,Current
1621975582875,high-voltage,9,2.92092
time,Hardware,Voltage,Current
1621975582875,high-voltage,10,3.67052
time,Hardware,Voltage,Current
1621975582875,high-voltage,11,4.39182
time,Hardware,Voltage,Current
1621975582875,high-voltage,12,5.44452
time,Hardware,Voltage,Current
1621975582875,high-voltage,13,6.48324
time,Hardware,Voltage,Current
1621975582875,high-voltage,14,7.73918
time,Hardware,Voltage,Current
1621975582875,high-voltage,15,8.81086
time,Hardware,Voltage,Current
1621975582875,high-voltage,16,9.90005
time,Hardware,Voltage,Current
1621975582875,high-voltage,17,10.0001
