time,Hardware,Voltage,Current
1626320028784,high-voltage-3,1,0.281898
time,Hardware,Voltage,Current
1626320028784,high-voltage-3,2,0.303823
time,Hardware,Voltage,Current
1626320028784,high-voltage-3,3,0.320714
time,Hardware,Voltage,Current
1626320028784,high-voltage-3,4,0.335525
time,Hardware,Voltage,Current
1626320028784,high-voltage-3,5,0.350178
time,Hardware,Voltage,Current
1626320028784,high-voltage-3,6,0.361546
time,Hardware,Voltage,Current
1626320028784,high-voltage-3,7,0.37651
time,Hardware,Voltage,Current
1626320028784,high-voltage-3,8,0.391854
time,Hardware,Voltage,Current
1626320028784,high-voltage-3,9,0.407253
time,Hardware,Voltage,Current
1626320028784,high-voltage-3,10,0.42425
time,Hardware,Voltage,Current
1626320028784,high-voltage-3,11,0.440006
time,Hardware,Voltage,Current
1626320028784,high-voltage-3,12,0.457667
time,Hardware,Voltage,Current
1626320028784,high-voltage-3,13,0.471446
time,Hardware,Voltage,Current
1626320028784,high-voltage-3,14,0.483427
time,Hardware,Voltage,Current
1626320028784,high-voltage-3,15,0.497283
time,Hardware,Voltage,Current
1626320028784,high-voltage-3,16,0.507787
time,Hardware,Voltage,Current
1626320028784,high-voltage-3,17,0.518748
time,Hardware,Voltage,Current
1626320028784,high-voltage-3,18,0.529132
time,Hardware,Voltage,Current
1626320028784,high-voltage-3,19,0.539771
time,Hardware,Voltage,Current
1626320028784,high-voltage-3,20,0.549399
time,Hardware,Voltage,Current
1626320028784,high-voltage-3,25,0.594729
time,Hardware,Voltage,Current
1626320028784,high-voltage-3,30,0.632024
time,Hardware,Voltage,Current
1626320028784,high-voltage-3,35,0.664943
time,Hardware,Voltage,Current
1626320028784,high-voltage-3,40,0.696022
time,Hardware,Voltage,Current
1626320028784,high-voltage-3,45,0.721468
time,Hardware,Voltage,Current
1626320028784,high-voltage-3,50,0.746395
time,Hardware,Voltage,Current
1626320028784,high-voltage-3,55,0.770337
time,Hardware,Voltage,Current
1626320028784,high-voltage-3,60,0.79513
time,Hardware,Voltage,Current
1626320028784,high-voltage-3,65,0.817956
time,Hardware,Voltage,Current
1626320028784,high-voltage-3,70,0.843012
time,Hardware,Voltage,Current
1626320028784,high-voltage-3,75,0.868837
time,Hardware,Voltage,Current
1626320028784,high-voltage-3,80,0.893022
time,Hardware,Voltage,Current
1626320028784,high-voltage-3,85,0.917945
time,Hardware,Voltage,Current
1626320028784,high-voltage-3,90,0.941662
time,Hardware,Voltage,Current
1626320028784,high-voltage-3,95,0.968692
time,Hardware,Voltage,Current
1626320028784,high-voltage-3,100,0.982805
