{
    "Data": [0.0, 0.0, 0.0, 0.0, 0.0, 0.0, 0.0, 0.0, 0.0, 0.0, 0.0, 0.0, 0.0, 0.0, 0.0, 0.0, 0.0, 0.0, 0.0, 0.0, 0.0, 0.0, 0.0, 0.0, 0.0, 0.0, 0.0, 0.0, 0.0, 0.0, 0.0, 0.0, 0.0, 0.0, 0.0, 0.0, 0.0, 0.0, 0.0, 0.0, 0.0, 0.0, 0.0, 0.0, 0.0, 0.0, 0.0, 0.0, 0.0, 0.0, 25.0, 39.0, 38.0, 69.0, 65.0, 100.0, 109.0, 111.0, 130.0, 157.0, 180.0, 191.0, 206.0, 216.0, 240.0, 303.0, 296.0, 312.0, 381.0, 420.0, 470.0, 522.0, 523.0, 580.0, 618.0, 674.0, 663.0, 748.0, 723.0, 742.0, 752.0, 876.0, 931.0, 1002.0, 1184.0, 1332.0, 1546.0, 1928.0, 2164.0, 2486.0, 2779.0, 2931.0, 3027.0, 2702.0, 2718.0, 2294.0, 1995.0, 1716.0, 1401.0, 1070.0, 824.0, 702.0, 548.0, 427.0, 375.0, 278.0, 270.0, 211.0, 180.0, 150.0, 115.0, 129.0, 109.0, 90.0, 69.0, 55.0, 40.0, 47.0, 47.0, 32.0, 31.0, 22.0, 25.0, 26.0, 29.0, 27.0, 14.0, 15.0, 11.0, 14.0, 13.0, 11.0, 9.0, 16.0, 9.0, 18.0, 10.0, 13.0, 5.0, 11.0, 9.0, 6.0, 6.0, 6.0, 5.0, 5.0, 6.0, 4.0, 6.0, 5.0, 5.0, 1.0, 5.0, 3.0, 6.0, 2.0, 5.0, 9.0, 5.0, 13.0, 12.0, 18.0, 13.0, 20.0, 22.0, 31.0, 38.0, 52.0, 66.0, 67.0, 95.0, 112.0, 114.0, 134.0, 174.0, 221.0, 219.0, 240.0, 280.0, 323.0, 384.0, 418.0, 421.0, 444.0, 463.0, 533.0, 591.0, 595.0, 627.0, 673.0, 689.0, 727.0, 754.0, 817.0, 813.0, 846.0, 841.0, 799.0, 806.0, 766.0, 796.0, 692.0, 703.0, 752.0, 645.0, 622.0, 554.0, 521.0, 464.0, 458.0, 409.0, 368.0, 316.0, 268.0, 247.0, 206.0, 174.0, 157.0, 136.0, 125.0, 112.0, 81.0, 74.0, 64.0, 53.0, 41.0, 29.0, 40.0, 24.0, 11.0, 8.0, 10.0, 6.0, 7.0, 5.0, 1.0, 1.0, 2.0, 2.0, 0.0, 2.0, 1.0, 2.0, 0.0, 0.0, 0.0, 0.0, 0.0, 0.0, 0.0, 0.0, 0.0, 0.0, 0.0, 0.0, 0.0, 0.0, 0.0, 1.0, 1.0, 0.0, 0.0, 0.0, 1.0, 1.0, 0.0, 0.0, 0.0, 0.0, 0.0, 0.0, 0.0, 0.0, 0.0, 0.0, 0.0, 0.0, 0.0, 0.0, 0.0, 0.0, 0.0, 0.0, 0.0, 0.0, 0.0, 0.0, 0.0, 0.0, 0.0, 0.0, 0.0, 0.0, 0.0, 0.0, 0.0, 0.0, 0.0, 0.0, 0.0, 0.0, 0.0, 0.0, 0.0, 0.0, 0.0, 0.0, 0.0, 0.0, 0.0, 0.0, 0.0, 0.0, 0.0, 0.0, 0.0, 0.0, 0.0, 0.0, 0.0, 0.0, 0.0, 0.0, 0.0, 0.0, 0.0, 0.0, 0.0, 0.0, 0.0, 0.0, 0.0, 0.0, 0.0, 0.0, 0.0, 0.0, 0.0, 0.0, 0.0, 0.0, 0.0, 0.0, 0.0, 0.0, 0.0, 0.0, 0.0, 0.0, 0.0, 0.0, 0.0, 0.0, 0.0, 0.0, 0.0, 0.0, 0.0, 0.0, 0.0, 0.0, 0.0, 0.0, 0.0, 0.0, 0.0, 0.0, 0.0, 0.0, 0.0, 0.0, 0.0, 0.0, 0.0, 0.0, 0.0, 0.0, 0.0],
    "Name": "ThresholdDist-0",
    "Overflow": 0.0,
    "Type": "Histo1d",
    "Underflow": 0.0,
    "x": {
        "AxisTitle": "Threshold [e]",
        "Bins": 378,
        "High": 3775.0,
        "Low": -5.0
    },
    "y": {
        "AxisTitle": "Number of Pixels"
    },
    "z": {
        "AxisTitle": "z"
    }
}