time,Hardware,Voltage,Current
1623359333231,high-voltage,1,0.0260285
time,Hardware,Voltage,Current
1623359333231,high-voltage,2,0.0331547
time,Hardware,Voltage,Current
1623359333231,high-voltage,3,0.0387398
time,Hardware,Voltage,Current
1623359333231,high-voltage,4,0.0429528
time,Hardware,Voltage,Current
1623359333231,high-voltage,5,0.0468333
time,Hardware,Voltage,Current
1623359333231,high-voltage,6,0.0509323
time,Hardware,Voltage,Current
1623359333231,high-voltage,7,0.0547886
