{
    "Data": [0.0, 0.0, 0.0, 0.0, 0.0, 0.0, 0.0, 0.0, 0.0, 0.0, 0.0, 0.0, 0.0, 0.0, 1.0, 2.0, 0.0, 0.0, 0.0, 5.0, 11.0, 1.0, 18.0, 9.0, 5.0, 2.0, 15.0, 39.0, 8.0, 10.0, 3.0, 8.0, 44.0, 14.0, 6.0, 50.0, 50.0, 48.0, 15.0, 49.0, 50.0, 6.0, 2.0, 11.0, 11.0, 50.0, 27.0, 24.0, 50.0, 8.0, 46.0],
    "Name": "Scurve-90-96",
    "Overflow": 0.0,
    "Type": "Histo1d",
    "Underflow": 0.0,
    "x": {
        "AxisTitle": "Vcal",
        "Bins": 51,
        "High": 302.5,
        "Low": 47.5
    },
    "y": {
        "AxisTitle": "Occupancy"
    },
    "z": {
        "AxisTitle": "z"
    }
}