{
    "Data": [172.0, 9606.0, 19000.0, 13930.0, 6600.0, 2628.0, 1581.0, 1853.0, 2527.0, 3111.0, 3365.0, 3225.0, 2891.0, 2286.0, 1737.0, 1173.0, 721.0, 436.0, 261.0, 131.0, 56.0, 38.0, 30.0, 18.0, 30.0, 6.0, 15.0, 5.0, 1.0, 0.0, 3.0, 1.0, 0.0, 1.0, 0.0, 1.0, 0.0, 0.0, 0.0, 2.0, 0.0, 1.0, 0.0, 0.0, 1.0, 0.0, 0.0, 0.0, 0.0, 0.0, 0.0],
    "Name": "Chi2Dist-0",
    "Overflow": 0.0,
    "Type": "Histo1d",
    "Underflow": 0.0,
    "x": {
        "AxisTitle": "Fit Chi/ndf",
        "Bins": 51,
        "High": 2.5250000953674318,
        "Low": -0.02500000037252903
    },
    "y": {
        "AxisTitle": "Number of Pixels"
    },
    "z": {
        "AxisTitle": "z"
    }
}