{
    "Data": [3975.0, 25817.0, 16687.0, 6512.0, 4473.0, 4196.0, 4055.0, 3673.0, 2929.0, 2015.0, 1350.0, 867.0, 487.0, 290.0, 175.0, 113.0, 63.0, 36.0, 25.0, 28.0, 21.0, 25.0, 26.0, 8.0, 37.0, 3.0, 9.0, 3.0, 3.0, 1.0, 8.0, 5.0, 4.0, 0.0, 11.0, 1.0, 3.0, 1.0, 0.0, 3.0, 1.0, 1.0, 0.0, 0.0, 0.0, 0.0, 0.0, 5.0, 2.0, 0.0, 0.0],
    "Name": "Chi2Dist-0",
    "Overflow": 0.0,
    "Type": "Histo1d",
    "Underflow": 0.0,
    "x": {
        "AxisTitle": "Fit Chi/ndf",
        "Bins": 51,
        "High": 2.5250000953674318,
        "Low": -0.02500000037252903
    },
    "y": {
        "AxisTitle": "Number of Pixels"
    },
    "z": {
        "AxisTitle": "z"
    }
}