{
    "Data": [3.0, 2.0, 0.0, 0.0, 0.0, 1.0, 7.0, 22.0, 57.0, 258.0, 762.0, 1702.0, 3208.0, 4452.0, 5017.0, 4335.0, 3280.0, 2701.0, 2716.0, 3302.0, 4101.0, 4320.0, 4088.0, 3076.0, 2061.0, 1194.0, 645.0, 374.0, 278.0, 231.0, 306.0, 390.0, 516.0, 693.0, 915.0, 1064.0, 1396.0, 1655.0, 1764.0, 1866.0, 1882.0, 1823.0, 1735.0, 1583.0, 1399.0, 1113.0, 954.0, 712.0, 563.0, 419.0, 320.0, 246.0, 160.0, 134.0, 101.0, 80.0, 72.0, 57.0, 48.0, 41.0, 34.0, 22.0, 26.0, 16.0, 17.0, 17.0, 15.0, 10.0, 12.0, 6.0, 6.0, 4.0, 9.0, 4.0, 2.0, 6.0, 5.0, 8.0, 4.0, 2.0, 7.0, 5.0, 5.0, 2.0, 5.0, 3.0],
    "Name": "NoiseDist-0",
    "Overflow": 63.0,
    "Type": "Histo1d",
    "Underflow": 0.0,
    "x": {
        "AxisTitle": "Noise [e]",
        "Bins": 86,
        "High": 431.0,
        "Low": -2.0
    },
    "y": {
        "AxisTitle": "Number of Pixels"
    },
    "z": {
        "AxisTitle": "z"
    }
}