{
    "Data": [0.0, 0.0, 0.0, 0.0, 0.0, 0.0, 10.0, 9.0, 16.0, 18.0, 19.0, 33.0, 32.0, 33.0, 41.0, 40.0, 56.0, 53.0, 76.0, 69.0, 93.0, 95.0, 116.0, 152.0, 199.0, 189.0, 219.0, 278.0, 331.0, 375.0, 473.0, 526.0, 640.0, 801.0, 855.0, 926.0, 1007.0, 1064.0, 1185.0, 1258.0, 1323.0, 1421.0, 1467.0, 1697.0, 1889.0, 2394.0, 2800.0, 3288.0, 3582.0, 3522.0, 3363.0, 2908.0, 2437.0, 1851.0, 1406.0, 1009.0, 792.0, 602.0, 449.0, 323.0, 262.0, 201.0, 186.0, 140.0, 112.0, 92.0, 72.0, 59.0, 45.0, 44.0, 39.0, 36.0, 26.0, 33.0, 26.0, 23.0, 19.0, 18.0, 14.0, 16.0, 14.0, 18.0, 12.0, 13.0, 8.0, 6.0, 15.0, 9.0, 10.0, 11.0, 11.0],
    "Name": "ThresholdDist-0",
    "Overflow": 148.0,
    "Type": "Histo1d",
    "Underflow": 0.0,
    "x": {
        "AxisTitle": "Threshold [e]",
        "Bins": 91,
        "High": 1345.0,
        "Low": 435.0
    },
    "y": {
        "AxisTitle": "Number of Pixels"
    },
    "z": {
        "AxisTitle": "z"
    }
}