{
    "Data": [[3105.0, 1577.0, 995.0, 708.0, 547.0, 433.0, 337.0, 268.0, 261.0, 213.0, 192.0, 155.0, 155.0, 135.0, 123.0, 135.0, 92.0, 103.0, 79.0, 82.0, 67.0, 86.0, 64.0, 61.0, 66.0, 54.0, 51.0, 54.0, 56.0, 54.0, 49.0, 32.0, 38.0, 39.0, 34.0, 27.0, 28.0, 23.0, 25.0, 24.0, 18.0, 20.0, 34.0, 26.0, 26.0, 23.0, 25.0, 25.0, 27.0], [3263.0, 1835.0, 1249.0, 978.0, 844.0, 676.0, 566.0, 465.0, 414.0, 358.0, 344.0, 275.0, 279.0, 243.0, 233.0, 218.0, 190.0, 191.0, 149.0, 160.0, 119.0, 110.0, 131.0, 103.0, 113.0, 127.0, 104.0, 85.0, 82.0, 87.0, 74.0, 84.0, 82.0, 66.0, 70.0, 67.0, 61.0, 65.0, 65.0, 51.0, 50.0, 53.0, 51.0, 53.0, 47.0, 37.0, 61.0, 56.0, 63.0], [2926.0, 1884.0, 1382.0, 1097.0, 970.0, 795.0, 763.0, 645.0, 564.0, 529.0, 482.0, 428.0, 400.0, 393.0, 346.0, 339.0, 346.0, 296.0, 278.0, 269.0, 235.0, 243.0, 255.0, 246.0, 189.0, 192.0, 176.0, 181.0, 154.0, 150.0, 154.0, 141.0, 151.0, 144.0, 110.0, 126.0, 145.0, 112.0, 136.0, 126.0, 114.0, 100.0, 110.0, 102.0, 93.0, 105.0, 106.0, 95.0, 130.0], [2420.0, 1530.0, 1246.0, 1039.0, 865.0, 809.0, 755.0, 680.0, 638.0, 624.0, 522.0, 514.0, 518.0, 457.0, 459.0, 438.0, 424.0, 418.0, 380.0, 397.0, 392.0, 337.0, 320.0, 347.0, 339.0, 325.0, 288.0, 286.0, 296.0, 290.0, 266.0, 245.0, 257.0, 255.0, 278.0, 257.0, 212.0, 241.0, 219.0, 214.0, 224.0, 218.0, 197.0, 212.0, 228.0, 187.0, 237.0, 242.0, 245.0], [2083.0, 1243.0, 958.0, 820.0, 722.0, 667.0, 647.0, 616.0, 594.0, 534.0, 516.0, 502.0, 471.0, 510.0, 470.0, 474.0, 507.0, 454.0, 427.0, 397.0, 405.0, 440.0, 408.0, 415.0, 447.0, 398.0, 386.0, 384.0, 369.0, 401.0, 365.0, 402.0, 399.0, 407.0, 399.0, 367.0, 345.0, 347.0, 358.0, 406.0, 404.0, 407.0, 424.0, 368.0, 412.0, 439.0, 421.0, 525.0, 581.0], [3536.0, 1674.0, 1030.0, 769.0, 651.0, 590.0, 526.0, 450.0, 461.0, 427.0, 461.0, 437.0, 420.0, 407.0, 371.0, 413.0, 449.0, 424.0, 394.0, 435.0, 421.0, 392.0, 407.0, 420.0, 417.0, 402.0, 428.0, 402.0, 420.0, 436.0, 444.0, 427.0, 431.0, 451.0, 493.0, 496.0, 518.0, 554.0, 493.0, 528.0, 549.0, 549.0, 606.0, 651.0, 634.0, 742.0, 770.0, 952.0, 1122.0], [4957.0, 2999.0, 2069.0, 1629.0, 1300.0, 1056.0, 855.0, 815.0, 638.0, 578.0, 554.0, 495.0, 481.0, 437.0, 457.0, 410.0, 370.0, 375.0, 356.0, 395.0, 369.0, 365.0, 368.0, 367.0, 371.0, 388.0, 372.0, 368.0, 398.0, 405.0, 410.0, 439.0, 427.0, 455.0, 461.0, 468.0, 550.0, 517.0, 557.0, 572.0, 662.0, 674.0, 756.0, 789.0, 857.0, 1001.0, 1198.0, 1437.0, 2014.0], [1939.0, 1734.0, 1495.0, 1463.0, 1369.0, 1251.0, 1191.0, 1194.0, 1137.0, 1072.0, 991.0, 980.0, 871.0, 903.0, 836.0, 819.0, 729.0, 683.0, 696.0, 679.0, 648.0, 613.0, 595.0, 573.0, 552.0, 563.0, 547.0, 538.0, 529.0, 495.0, 482.0, 516.0, 544.0, 552.0, 463.0, 525.0, 534.0, 589.0, 534.0, 556.0, 687.0, 713.0, 784.0, 878.0, 962.0, 1106.0, 1445.0, 1807.0, 2751.0], [461.0, 333.0, 305.0, 322.0, 298.0, 356.0, 362.0, 451.0, 412.0, 431.0, 456.0, 488.0, 522.0, 515.0, 556.0, 540.0, 617.0, 659.0, 610.0, 662.0, 638.0, 717.0, 707.0, 712.0, 758.0, 769.0, 791.0, 839.0, 833.0, 848.0, 880.0, 897.0, 898.0, 917.0, 895.0, 862.0, 1005.0, 986.0, 1034.0, 964.0, 1110.0, 1078.0, 1083.0, 1181.0, 1242.0, 1516.0, 1767.0, 2245.0, 3425.0], [307.0, 147.0, 115.0, 83.0, 91.0, 78.0, 60.0, 63.0, 74.0, 80.0, 67.0, 82.0, 73.0, 106.0, 104.0, 138.0, 120.0, 113.0, 142.0, 142.0, 203.0, 191.0, 189.0, 222.0, 241.0, 259.0, 265.0, 317.0, 315.0, 401.0, 428.0, 474.0, 472.0, 516.0, 573.0, 647.0, 747.0, 778.0, 896.0, 1054.0, 1142.0, 1332.0, 1515.0, 1711.0, 1922.0, 2329.0, 2811.0, 3664.0, 5526.0], [308.0, 126.0, 87.0, 46.0, 58.0, 36.0, 54.0, 29.0, 26.0, 30.0, 36.0, 47.0, 35.0, 38.0, 35.0, 37.0, 32.0, 30.0, 36.0, 38.0, 45.0, 41.0, 37.0, 58.0, 43.0, 54.0, 65.0, 64.0, 68.0, 63.0, 97.0, 93.0, 117.0, 111.0, 157.0, 156.0, 190.0, 200.0, 264.0, 311.0, 329.0, 400.0, 548.0, 686.0, 929.0, 1270.0, 2011.0, 3153.0, 6409.0], [321.0, 131.0, 77.0, 59.0, 34.0, 24.0, 25.0, 22.0, 31.0, 25.0, 31.0, 24.0, 31.0, 24.0, 28.0, 20.0, 23.0, 34.0, 27.0, 22.0, 24.0, 19.0, 21.0, 22.0, 29.0, 25.0, 29.0, 22.0, 27.0, 31.0, 27.0, 39.0, 32.0, 40.0, 47.0, 44.0, 61.0, 50.0, 79.0, 73.0, 99.0, 128.0, 162.0, 199.0, 260.0, 392.0, 647.0, 1178.0, 3377.0], [404.0, 138.0, 61.0, 63.0, 48.0, 30.0, 26.0, 21.0, 25.0, 29.0, 20.0, 19.0, 23.0, 17.0, 15.0, 17.0, 14.0, 13.0, 17.0, 19.0, 15.0, 12.0, 20.0, 17.0, 20.0, 13.0, 25.0, 13.0, 14.0, 11.0, 22.0, 24.0, 19.0, 17.0, 23.0, 26.0, 32.0, 29.0, 32.0, 35.0, 51.0, 54.0, 75.0, 80.0, 109.0, 155.0, 205.0, 425.0, 1293.0], [568.0, 153.0, 88.0, 37.0, 30.0, 33.0, 27.0, 20.0, 14.0, 22.0, 17.0, 18.0, 18.0, 8.0, 26.0, 18.0, 23.0, 10.0, 14.0, 23.0, 20.0, 17.0, 18.0, 13.0, 10.0, 14.0, 15.0, 11.0, 10.0, 10.0, 10.0, 15.0, 13.0, 15.0, 11.0, 17.0, 23.0, 15.0, 24.0, 31.0, 20.0, 33.0, 36.0, 37.0, 35.0, 62.0, 124.0, 193.0, 527.0], [959.0, 242.0, 80.0, 52.0, 43.0, 27.0, 28.0, 23.0, 18.0, 25.0, 22.0, 24.0, 16.0, 16.0, 12.0, 16.0, 12.0, 13.0, 19.0, 10.0, 12.0, 6.0, 14.0, 9.0, 7.0, 19.0, 15.0, 11.0, 13.0, 12.0, 14.0, 11.0, 11.0, 23.0, 13.0, 10.0, 14.0, 12.0, 14.0, 13.0, 20.0, 18.0, 12.0, 36.0, 30.0, 45.0, 52.0, 85.0, 279.0], [1713.0, 490.0, 205.0, 68.0, 59.0, 34.0, 25.0, 26.0, 26.0, 12.0, 16.0, 23.0, 13.0, 12.0, 16.0, 19.0, 14.0, 7.0, 8.0, 10.0, 14.0, 12.0, 11.0, 8.0, 11.0, 7.0, 12.0, 14.0, 8.0, 14.0, 11.0, 9.0, 11.0, 14.0, 8.0, 12.0, 13.0, 12.0, 13.0, 13.0, 17.0, 23.0, 17.0, 27.0, 18.0, 28.0, 33.0, 57.0, 140.0], [2731.0, 956.0, 393.0, 228.0, 113.0, 72.0, 37.0, 41.0, 32.0, 36.0, 15.0, 9.0, 12.0, 11.0, 18.0, 19.0, 15.0, 10.0, 8.0, 8.0, 15.0, 6.0, 15.0, 9.0, 6.0, 8.0, 7.0, 4.0, 11.0, 4.0, 10.0, 6.0, 14.0, 6.0, 9.0, 8.0, 9.0, 9.0, 6.0, 10.0, 9.0, 11.0, 18.0, 29.0, 28.0, 40.0, 23.0, 42.0, 99.0], [3879.0, 1666.0, 899.0, 478.0, 259.0, 146.0, 93.0, 73.0, 61.0, 37.0, 30.0, 30.0, 23.0, 26.0, 31.0, 24.0, 23.0, 16.0, 14.0, 10.0, 13.0, 6.0, 10.0, 8.0, 8.0, 5.0, 5.0, 5.0, 7.0, 5.0, 7.0, 10.0, 6.0, 8.0, 6.0, 7.0, 10.0, 14.0, 9.0, 8.0, 12.0, 12.0, 12.0, 18.0, 9.0, 21.0, 26.0, 26.0, 80.0], [4747.0, 2538.0, 1550.0, 937.0, 558.0, 384.0, 270.0, 195.0, 132.0, 118.0, 80.0, 55.0, 48.0, 33.0, 32.0, 21.0, 22.0, 18.0, 19.0, 15.0, 16.0, 14.0, 13.0, 11.0, 21.0, 16.0, 14.0, 17.0, 17.0, 12.0, 10.0, 13.0, 8.0, 9.0, 10.0, 5.0, 7.0, 7.0, 6.0, 7.0, 7.0, 14.0, 14.0, 9.0, 10.0, 9.0, 11.0, 23.0, 42.0], [4703.0, 3064.0, 2142.0, 1495.0, 1122.0, 762.0, 599.0, 438.0, 360.0, 269.0, 192.0, 172.0, 117.0, 94.0, 78.0, 66.0, 66.0, 53.0, 39.0, 34.0, 27.0, 23.0, 25.0, 21.0, 15.0, 14.0, 9.0, 10.0, 11.0, 11.0, 6.0, 9.0, 9.0, 13.0, 11.0, 15.0, 17.0, 21.0, 11.0, 16.0, 15.0, 18.0, 16.0, 8.0, 8.0, 9.0, 16.0, 22.0, 34.0], [3990.0, 2919.0, 2350.0, 1864.0, 1518.0, 1235.0, 1076.0, 829.0, 698.0, 556.0, 441.0, 401.0, 314.0, 271.0, 204.0, 189.0, 148.0, 129.0, 115.0, 87.0, 76.0, 63.0, 61.0, 44.0, 45.0, 32.0, 24.0, 31.0, 22.0, 12.0, 17.0, 15.0, 13.0, 11.0, 10.0, 11.0, 9.0, 9.0, 13.0, 6.0, 11.0, 17.0, 10.0, 16.0, 21.0, 25.0, 27.0, 32.0, 29.0], [2738.0, 2475.0, 2187.0, 1873.0, 1617.0, 1493.0, 1296.0, 1087.0, 964.0, 872.0, 737.0, 635.0, 581.0, 541.0, 444.0, 385.0, 318.0, 276.0, 225.0, 198.0, 167.0, 151.0, 130.0, 116.0, 121.0, 100.0, 65.0, 57.0, 73.0, 53.0, 44.0, 41.0, 30.0, 29.0, 20.0, 20.0, 19.0, 19.0, 13.0, 23.0, 12.0, 13.0, 10.0, 14.0, 10.0, 8.0, 21.0, 24.0, 52.0], [1745.0, 1624.0, 1593.0, 1582.0, 1406.0, 1399.0, 1269.0, 1251.0, 1147.0, 1036.0, 959.0, 849.0, 825.0, 746.0, 674.0, 645.0, 562.0, 531.0, 499.0, 399.0, 388.0, 344.0, 323.0, 261.0, 231.0, 227.0, 199.0, 162.0, 167.0, 140.0, 114.0, 92.0, 75.0, 76.0, 66.0, 66.0, 51.0, 55.0, 44.0, 39.0, 27.0, 28.0, 26.0, 18.0, 20.0, 14.0, 16.0, 31.0, 32.0], [1033.0, 934.0, 1011.0, 1066.0, 1027.0, 1045.0, 1084.0, 1069.0, 948.0, 1047.0, 970.0, 985.0, 895.0, 928.0, 825.0, 789.0, 747.0, 743.0, 670.0, 613.0, 583.0, 538.0, 509.0, 484.0, 444.0, 401.0, 386.0, 351.0, 353.0, 313.0, 237.0, 247.0, 228.0, 194.0, 199.0, 135.0, 154.0, 122.0, 119.0, 80.0, 94.0, 53.0, 61.0, 51.0, 38.0, 37.0, 30.0, 35.0, 31.0], [577.0, 487.0, 550.0, 582.0, 592.0, 662.0, 672.0, 741.0, 798.0, 701.0, 769.0, 824.0, 784.0, 827.0, 824.0, 829.0, 796.0, 781.0, 804.0, 763.0, 690.0, 697.0, 679.0, 675.0, 681.0, 614.0, 602.0, 568.0, 546.0, 500.0, 486.0, 423.0, 387.0, 403.0, 386.0, 328.0, 316.0, 301.0, 278.0, 238.0, 201.0, 181.0, 169.0, 152.0, 143.0, 100.0, 83.0, 63.0, 50.0], [398.0, 273.0, 287.0, 274.0, 309.0, 367.0, 381.0, 449.0, 464.0, 524.0, 522.0, 483.0, 563.0, 582.0, 599.0, 686.0, 646.0, 696.0, 735.0, 732.0, 681.0, 724.0, 695.0, 698.0, 712.0, 706.0, 722.0, 705.0, 700.0, 694.0, 631.0, 645.0, 624.0, 661.0, 583.0, 547.0, 539.0, 531.0, 495.0, 471.0, 423.0, 392.0, 332.0, 329.0, 289.0, 279.0, 252.0, 202.0, 179.0], [299.0, 149.0, 127.0, 138.0, 177.0, 199.0, 179.0, 194.0, 235.0, 241.0, 289.0, 291.0, 369.0, 334.0, 368.0, 410.0, 445.0, 469.0, 497.0, 539.0, 549.0, 556.0, 620.0, 586.0, 637.0, 637.0, 672.0, 750.0, 692.0, 760.0, 740.0, 720.0, 777.0, 786.0, 737.0, 732.0, 734.0, 741.0, 762.0, 700.0, 724.0, 730.0, 712.0, 666.0, 574.0, 580.0, 504.0, 465.0, 408.0], [240.0, 113.0, 73.0, 75.0, 76.0, 63.0, 102.0, 92.0, 112.0, 128.0, 132.0, 176.0, 168.0, 198.0, 212.0, 210.0, 286.0, 259.0, 290.0, 316.0, 329.0, 354.0, 420.0, 421.0, 463.0, 514.0, 469.0, 551.0, 578.0, 632.0, 621.0, 675.0, 741.0, 786.0, 769.0, 784.0, 888.0, 836.0, 885.0, 951.0, 947.0, 921.0, 998.0, 968.0, 947.0, 995.0, 965.0, 982.0, 907.0], [254.0, 97.0, 49.0, 50.0, 38.0, 45.0, 35.0, 50.0, 52.0, 64.0, 61.0, 78.0, 82.0, 107.0, 96.0, 100.0, 158.0, 123.0, 141.0, 168.0, 171.0, 222.0, 221.0, 254.0, 290.0, 319.0, 331.0, 373.0, 404.0, 421.0, 453.0, 508.0, 543.0, 594.0, 592.0, 719.0, 781.0, 789.0, 909.0, 913.0, 1036.0, 1078.0, 1160.0, 1122.0, 1248.0, 1383.0, 1517.0, 1540.0, 1761.0], [254.0, 85.0, 49.0, 45.0, 29.0, 24.0, 23.0, 20.0, 18.0, 24.0, 22.0, 24.0, 45.0, 46.0, 53.0, 54.0, 63.0, 67.0, 75.0, 85.0, 85.0, 100.0, 129.0, 114.0, 144.0, 150.0, 188.0, 197.0, 226.0, 235.0, 286.0, 276.0, 327.0, 391.0, 415.0, 494.0, 566.0, 623.0, 745.0, 808.0, 887.0, 994.0, 1136.0, 1245.0, 1378.0, 1626.0, 1885.0, 2151.0, 2647.0], [255.0, 93.0, 44.0, 43.0, 20.0, 15.0, 19.0, 17.0, 21.0, 10.0, 19.0, 13.0, 16.0, 24.0, 28.0, 27.0, 24.0, 32.0, 34.0, 35.0, 45.0, 38.0, 50.0, 44.0, 68.0, 74.0, 97.0, 91.0, 94.0, 146.0, 140.0, 162.0, 211.0, 245.0, 231.0, 296.0, 318.0, 402.0, 435.0, 510.0, 636.0, 716.0, 869.0, 1081.0, 1283.0, 1627.0, 1963.0, 2511.0, 3484.0], [243.0, 87.0, 60.0, 37.0, 27.0, 17.0, 17.0, 10.0, 21.0, 14.0, 16.0, 14.0, 10.0, 14.0, 12.0, 12.0, 13.0, 16.0, 16.0, 19.0, 13.0, 18.0, 17.0, 29.0, 33.0, 41.0, 39.0, 37.0, 40.0, 46.0, 91.0, 71.0, 105.0, 98.0, 143.0, 168.0, 190.0, 195.0, 285.0, 302.0, 377.0, 477.0, 578.0, 754.0, 996.0, 1354.0, 1801.0, 2511.0, 3854.0], [225.0, 91.0, 53.0, 34.0, 23.0, 22.0, 17.0, 9.0, 14.0, 14.0, 18.0, 6.0, 11.0, 7.0, 10.0, 13.0, 14.0, 5.0, 11.0, 9.0, 10.0, 10.0, 14.0, 11.0, 12.0, 9.0, 11.0, 16.0, 17.0, 20.0, 32.0, 33.0, 45.0, 62.0, 57.0, 74.0, 94.0, 119.0, 149.0, 181.0, 187.0, 249.0, 343.0, 447.0, 599.0, 860.0, 1363.0, 2062.0, 3798.0], [275.0, 87.0, 48.0, 21.0, 34.0, 21.0, 16.0, 15.0, 10.0, 12.0, 11.0, 18.0, 9.0, 12.0, 10.0, 7.0, 10.0, 11.0, 3.0, 11.0, 9.0, 8.0, 7.0, 7.0, 15.0, 5.0, 7.0, 6.0, 6.0, 9.0, 12.0, 16.0, 12.0, 20.0, 24.0, 22.0, 29.0, 39.0, 62.0, 63.0, 86.0, 122.0, 185.0, 249.0, 369.0, 541.0, 842.0, 1538.0, 3274.0], [242.0, 93.0, 53.0, 28.0, 26.0, 19.0, 20.0, 14.0, 22.0, 10.0, 9.0, 15.0, 11.0, 5.0, 8.0, 12.0, 9.0, 9.0, 6.0, 8.0, 8.0, 9.0, 9.0, 8.0, 5.0, 4.0, 6.0, 5.0, 4.0, 6.0, 9.0, 4.0, 7.0, 10.0, 10.0, 9.0, 13.0, 28.0, 20.0, 45.0, 36.0, 47.0, 91.0, 119.0, 172.0, 295.0, 501.0, 991.0, 2402.0], [226.0, 97.0, 60.0, 38.0, 32.0, 16.0, 13.0, 13.0, 14.0, 8.0, 15.0, 10.0, 16.0, 11.0, 9.0, 12.0, 12.0, 8.0, 5.0, 7.0, 9.0, 8.0, 9.0, 6.0, 6.0, 4.0, 3.0, 8.0, 6.0, 3.0, 1.0, 2.0, 4.0, 9.0, 5.0, 5.0, 2.0, 8.0, 9.0, 11.0, 16.0, 23.0, 39.0, 69.0, 76.0, 158.0, 258.0, 556.0, 1665.0], [230.0, 91.0, 51.0, 35.0, 18.0, 24.0, 16.0, 14.0, 15.0, 16.0, 14.0, 10.0, 7.0, 10.0, 18.0, 8.0, 14.0, 7.0, 6.0, 10.0, 4.0, 7.0, 2.0, 10.0, 6.0, 9.0, 4.0, 7.0, 5.0, 4.0, 6.0, 3.0, 3.0, 6.0, 10.0, 3.0, 7.0, 4.0, 7.0, 4.0, 9.0, 9.0, 16.0, 16.0, 25.0, 53.0, 120.0, 297.0, 968.0], [260.0, 83.0, 62.0, 31.0, 17.0, 15.0, 16.0, 19.0, 16.0, 12.0, 10.0, 14.0, 10.0, 7.0, 15.0, 11.0, 7.0, 13.0, 5.0, 9.0, 8.0, 5.0, 7.0, 6.0, 7.0, 8.0, 4.0, 8.0, 6.0, 1.0, 2.0, 5.0, 8.0, 5.0, 5.0, 5.0, 5.0, 1.0, 6.0, 4.0, 7.0, 8.0, 11.0, 15.0, 9.0, 25.0, 45.0, 154.0, 516.0], [247.0, 92.0, 36.0, 30.0, 23.0, 17.0, 23.0, 22.0, 12.0, 8.0, 24.0, 14.0, 8.0, 4.0, 16.0, 11.0, 12.0, 7.0, 8.0, 12.0, 7.0, 9.0, 8.0, 9.0, 5.0, 7.0, 2.0, 1.0, 6.0, 4.0, 4.0, 7.0, 4.0, 9.0, 4.0, 4.0, 3.0, 8.0, 4.0, 1.0, 7.0, 6.0, 11.0, 3.0, 9.0, 8.0, 19.0, 62.0, 259.0], [230.0, 88.0, 58.0, 28.0, 28.0, 22.0, 15.0, 13.0, 13.0, 12.0, 14.0, 11.0, 8.0, 14.0, 8.0, 13.0, 6.0, 12.0, 11.0, 9.0, 10.0, 9.0, 6.0, 3.0, 2.0, 4.0, 6.0, 3.0, 5.0, 6.0, 8.0, 4.0, 6.0, 3.0, 4.0, 9.0, 6.0, 2.0, 7.0, 3.0, 7.0, 7.0, 3.0, 7.0, 12.0, 8.0, 13.0, 28.0, 138.0], [248.0, 114.0, 53.0, 33.0, 33.0, 15.0, 15.0, 13.0, 4.0, 10.0, 15.0, 14.0, 14.0, 11.0, 7.0, 6.0, 9.0, 11.0, 18.0, 11.0, 6.0, 5.0, 7.0, 6.0, 4.0, 7.0, 9.0, 4.0, 4.0, 8.0, 3.0, 7.0, 7.0, 3.0, 5.0, 5.0, 4.0, 7.0, 9.0, 7.0, 3.0, 2.0, 3.0, 3.0, 4.0, 9.0, 8.0, 21.0, 72.0], [227.0, 90.0, 50.0, 31.0, 24.0, 18.0, 19.0, 16.0, 13.0, 12.0, 12.0, 13.0, 13.0, 15.0, 10.0, 12.0, 7.0, 9.0, 4.0, 8.0, 6.0, 10.0, 11.0, 10.0, 7.0, 5.0, 0.0, 6.0, 5.0, 7.0, 6.0, 4.0, 2.0, 4.0, 5.0, 2.0, 8.0, 9.0, 1.0, 6.0, 2.0, 4.0, 5.0, 9.0, 3.0, 5.0, 6.0, 11.0, 50.0], [249.0, 83.0, 51.0, 34.0, 24.0, 24.0, 14.0, 15.0, 20.0, 15.0, 18.0, 8.0, 6.0, 11.0, 10.0, 10.0, 16.0, 5.0, 8.0, 9.0, 4.0, 6.0, 9.0, 7.0, 4.0, 6.0, 4.0, 6.0, 3.0, 4.0, 4.0, 2.0, 2.0, 4.0, 10.0, 3.0, 5.0, 4.0, 3.0, 5.0, 5.0, 9.0, 2.0, 3.0, 6.0, 8.0, 7.0, 6.0, 30.0], [238.0, 102.0, 52.0, 32.0, 21.0, 15.0, 17.0, 14.0, 15.0, 8.0, 15.0, 16.0, 12.0, 11.0, 14.0, 9.0, 10.0, 14.0, 9.0, 11.0, 8.0, 12.0, 4.0, 2.0, 7.0, 6.0, 7.0, 5.0, 4.0, 5.0, 2.0, 6.0, 3.0, 7.0, 4.0, 2.0, 4.0, 1.0, 5.0, 3.0, 0.0, 6.0, 6.0, 5.0, 8.0, 8.0, 6.0, 15.0, 13.0], [226.0, 87.0, 51.0, 40.0, 32.0, 12.0, 15.0, 11.0, 16.0, 11.0, 10.0, 12.0, 13.0, 8.0, 16.0, 13.0, 9.0, 8.0, 16.0, 9.0, 10.0, 12.0, 6.0, 6.0, 8.0, 3.0, 5.0, 3.0, 3.0, 4.0, 5.0, 4.0, 4.0, 3.0, 4.0, 6.0, 7.0, 2.0, 5.0, 2.0, 6.0, 6.0, 5.0, 5.0, 7.0, 10.0, 12.0, 8.0, 15.0], [242.0, 83.0, 51.0, 30.0, 17.0, 18.0, 15.0, 20.0, 14.0, 13.0, 12.0, 6.0, 14.0, 11.0, 17.0, 16.0, 11.0, 11.0, 8.0, 9.0, 5.0, 9.0, 9.0, 3.0, 5.0, 10.0, 2.0, 6.0, 6.0, 3.0, 1.0, 4.0, 3.0, 8.0, 7.0, 2.0, 6.0, 5.0, 7.0, 4.0, 7.0, 3.0, 4.0, 6.0, 4.0, 2.0, 8.0, 4.0, 11.0], [253.0, 88.0, 54.0, 33.0, 24.0, 17.0, 15.0, 17.0, 10.0, 14.0, 11.0, 18.0, 13.0, 9.0, 12.0, 13.0, 7.0, 10.0, 10.0, 3.0, 7.0, 11.0, 5.0, 3.0, 5.0, 9.0, 8.0, 4.0, 7.0, 6.0, 8.0, 5.0, 7.0, 2.0, 4.0, 3.0, 5.0, 3.0, 5.0, 7.0, 3.0, 4.0, 9.0, 4.0, 5.0, 7.0, 2.0, 5.0, 9.0], [261.0, 90.0, 35.0, 35.0, 28.0, 19.0, 12.0, 13.0, 22.0, 12.0, 12.0, 19.0, 7.0, 13.0, 11.0, 10.0, 7.0, 9.0, 9.0, 6.0, 8.0, 6.0, 11.0, 11.0, 7.0, 6.0, 5.0, 0.0, 6.0, 3.0, 3.0, 6.0, 4.0, 8.0, 2.0, 4.0, 3.0, 4.0, 5.0, 3.0, 4.0, 10.0, 7.0, 4.0, 5.0, 7.0, 1.0, 5.0, 11.0], [221.0, 95.0, 38.0, 48.0, 21.0, 26.0, 13.0, 17.0, 12.0, 11.0, 11.0, 13.0, 12.0, 14.0, 12.0, 8.0, 13.0, 14.0, 9.0, 10.0, 10.0, 7.0, 4.0, 3.0, 6.0, 6.0, 3.0, 4.0, 3.0, 6.0, 8.0, 2.0, 6.0, 3.0, 6.0, 4.0, 7.0, 3.0, 5.0, 6.0, 4.0, 4.0, 2.0, 6.0, 7.0, 4.0, 7.0, 6.0, 6.0], [244.0, 88.0, 41.0, 37.0, 27.0, 16.0, 17.0, 16.0, 13.0, 11.0, 9.0, 12.0, 14.0, 13.0, 13.0, 10.0, 11.0, 20.0, 6.0, 4.0, 8.0, 5.0, 8.0, 3.0, 5.0, 8.0, 7.0, 4.0, 8.0, 3.0, 8.0, 4.0, 5.0, 2.0, 6.0, 5.0, 3.0, 3.0, 3.0, 3.0, 6.0, 4.0, 8.0, 3.0, 9.0, 5.0, 4.0, 5.0, 3.0], [224.0, 84.0, 44.0, 42.0, 26.0, 17.0, 18.0, 12.0, 12.0, 13.0, 12.0, 16.0, 16.0, 13.0, 17.0, 13.0, 14.0, 13.0, 10.0, 10.0, 5.0, 6.0, 4.0, 5.0, 5.0, 5.0, 2.0, 6.0, 1.0, 8.0, 5.0, 1.0, 6.0, 2.0, 5.0, 3.0, 7.0, 3.0, 5.0, 7.0, 8.0, 5.0, 1.0, 5.0, 8.0, 5.0, 3.0, 4.0, 4.0]],
    "Name": "sCurve-0",
    "Overflow": 2707627.0,
    "Type": "Histo2d",
    "Underflow": 0.0,
    "x": {
        "AxisTitle": "Vcal",
        "Bins": 51,
        "High": 302.5,
        "Low": 47.5
    },
    "y": {
        "AxisTitle": "Occupancy",
        "Bins": 49,
        "High": 49.5,
        "Low": 0.5
    },
    "z": {
        "AxisTitle": "Number of pixels"
    }
}