time,Hardware,Voltage,Current
1621458563555,high-voltage-2,1,0.381372
time,Hardware,Voltage,Current
1621458563555,high-voltage-2,2,0.457002
time,Hardware,Voltage,Current
1621458563555,high-voltage-2,3,0.511874
time,Hardware,Voltage,Current
1621458563555,high-voltage-2,4,0.554509
time,Hardware,Voltage,Current
1621458563555,high-voltage-2,5,0.589599
time,Hardware,Voltage,Current
1621458563555,high-voltage-2,6,0.621873
time,Hardware,Voltage,Current
1621458563555,high-voltage-2,7,0.653463
time,Hardware,Voltage,Current
1621458563555,high-voltage-2,8,0.684867
time,Hardware,Voltage,Current
1621458563555,high-voltage-2,9,0.713281
time,Hardware,Voltage,Current
1621458563555,high-voltage-2,10,0.739789
time,Hardware,Voltage,Current
1621458563555,high-voltage-2,11,0.764836
time,Hardware,Voltage,Current
1621458563555,high-voltage-2,12,0.786938
time,Hardware,Voltage,Current
1621458563555,high-voltage-2,13,0.809196
time,Hardware,Voltage,Current
1621458563555,high-voltage-2,14,0.828525
time,Hardware,Voltage,Current
1621458563555,high-voltage-2,15,0.845195
time,Hardware,Voltage,Current
1621458563555,high-voltage-2,16,0.861037
time,Hardware,Voltage,Current
1621458563555,high-voltage-2,17,0.878224
time,Hardware,Voltage,Current
1621458563555,high-voltage-2,18,0.893423
time,Hardware,Voltage,Current
1621458563555,high-voltage-2,19,0.911547
time,Hardware,Voltage,Current
1621458563555,high-voltage-2,20,0.926249
time,Hardware,Voltage,Current
1621458563555,high-voltage-2,25,1.00232
time,Hardware,Voltage,Current
1621458563555,high-voltage-2,30,1.07864
time,Hardware,Voltage,Current
1621458563555,high-voltage-2,35,1.1582
time,Hardware,Voltage,Current
1621458563555,high-voltage-2,40,1.25074
time,Hardware,Voltage,Current
1621458563555,high-voltage-2,45,1.36991
time,Hardware,Voltage,Current
1621458563555,high-voltage-2,50,1.44734
time,Hardware,Voltage,Current
1621458563555,high-voltage-2,55,1.52152
time,Hardware,Voltage,Current
1621458563555,high-voltage-2,60,1.58686
time,Hardware,Voltage,Current
1621458563555,high-voltage-2,65,1.65242
time,Hardware,Voltage,Current
1621458563555,high-voltage-2,70,1.71818
time,Hardware,Voltage,Current
1621458563555,high-voltage-2,75,1.78109
time,Hardware,Voltage,Current
1621458563555,high-voltage-2,80,1.84332
time,Hardware,Voltage,Current
1621458563555,high-voltage-2,85,1.9026
time,Hardware,Voltage,Current
1621458563555,high-voltage-2,90,1.96149
time,Hardware,Voltage,Current
1621458563555,high-voltage-2,95,2.01801
time,Hardware,Voltage,Current
1621458563555,high-voltage-2,100,2.07661
