time,Hardware,Voltage,Current
1622063731310,high-voltage,1,0.175089
time,Hardware,Voltage,Current
1622063731310,high-voltage,2,0.293727
time,Hardware,Voltage,Current
1622063731310,high-voltage,3,0.430329
time,Hardware,Voltage,Current
1622063731310,high-voltage,4,0.581738
time,Hardware,Voltage,Current
1622063731310,high-voltage,5,0.791944
time,Hardware,Voltage,Current
1622063731310,high-voltage,6,1.03742
time,Hardware,Voltage,Current
1622063731310,high-voltage,7,1.37913
time,Hardware,Voltage,Current
1622063731310,high-voltage,8,1.82412
time,Hardware,Voltage,Current
1622063731310,high-voltage,9,2.30924
time,Hardware,Voltage,Current
1622063731310,high-voltage,10,2.94735
time,Hardware,Voltage,Current
1622063731310,high-voltage,11,3.59086
time,Hardware,Voltage,Current
1622063731310,high-voltage,12,4.48836
time,Hardware,Voltage,Current
1622063731310,high-voltage,13,5.54643
time,Hardware,Voltage,Current
1622063731310,high-voltage,14,6.5867
time,Hardware,Voltage,Current
1622063731310,high-voltage,15,7.67094
time,Hardware,Voltage,Current
1622063731310,high-voltage,16,8.85613
time,Hardware,Voltage,Current
1622063731310,high-voltage,17,9.55516
time,Hardware,Voltage,Current
1622063731310,high-voltage,18,10.0001
1622063795718,high-voltage,1,0.17107
1622063795718,high-voltage,2,0.282229
1622063795718,high-voltage,3,0.434785
1622063795718,high-voltage,4,0.572231
1622063795718,high-voltage,5,0.755399
1622063795718,high-voltage,6,1.05625
1622063795718,high-voltage,7,1.32613
1622063795718,high-voltage,8,1.7756
1622063795718,high-voltage,9,2.2392
1622063795718,high-voltage,10,2.84047
1622063795718,high-voltage,11,3.5665
1622063795718,high-voltage,12,4.32495
1622063795718,high-voltage,13,5.33425
1622063795718,high-voltage,14,6.51783
1622063795718,high-voltage,15,7.51642
1622063795718,high-voltage,16,8.80935
1622063795718,high-voltage,17,9.62854
1622063795718,high-voltage,18,10
1622063859685,high-voltage,1,0.160015
1622063859685,high-voltage,2,0.265601
1622063859685,high-voltage,3,0.413099
1622063859685,high-voltage,4,0.561678
1622063859685,high-voltage,5,0.80156
1622063859685,high-voltage,6,1.0038
1622063859685,high-voltage,7,1.35632
1622063859685,high-voltage,8,1.76604
1622063859685,high-voltage,9,2.22402
1622063859685,high-voltage,10,2.91436
1622063859685,high-voltage,11,3.52788
1622063859685,high-voltage,12,4.25697
1622063859685,high-voltage,13,5.37176
1622063859685,high-voltage,14,6.44575
1622063859685,high-voltage,15,7.39321
1622063859685,high-voltage,16,8.75221
1622063859685,high-voltage,17,9.61598
1622063859685,high-voltage,18,10.0001
1622063926216,high-voltage,1,0.166066
1622063926216,high-voltage,2,0.275354
1622063926216,high-voltage,3,0.410898
1622063926216,high-voltage,4,0.572191
1622063926216,high-voltage,5,0.783041
1622063926216,high-voltage,6,1.03156
1622063926216,high-voltage,7,1.34396
1622063926216,high-voltage,8,1.78167
1622063926216,high-voltage,9,2.26764
1622063926216,high-voltage,10,2.91967
1622063926216,high-voltage,11,3.67945
1622063926216,high-voltage,12,4.51835
1622063926216,high-voltage,13,5.40991
1622063926216,high-voltage,14,6.58619
1622063926216,high-voltage,15,7.53473
1622063926216,high-voltage,16,8.71348
1622063926216,high-voltage,17,9.8057
1622063926216,high-voltage,18,10.0001
1622063991959,high-voltage,1,0.172376
1622063991959,high-voltage,2,0.278342
1622063991959,high-voltage,3,0.429147
1622063991959,high-voltage,4,0.569655
1622063991959,high-voltage,5,0.749778
1622063991959,high-voltage,6,1.0131
1622063991959,high-voltage,7,1.37806
1622063991959,high-voltage,8,1.75331
1622063991959,high-voltage,9,2.29033
1622063991959,high-voltage,10,2.80413
1622063991959,high-voltage,11,3.5555
1622063991959,high-voltage,12,4.38528
1622063991959,high-voltage,13,5.3569
1622063991959,high-voltage,14,6.49179
1622063991959,high-voltage,15,7.60838
1622063991959,high-voltage,16,8.70164
1622063991959,high-voltage,17,9.77725
1622063991959,high-voltage,18,10.0001
1622064056642,high-voltage,1,0.16775
1622064056642,high-voltage,2,0.279494
1622064056642,high-voltage,3,0.411716
1622064056642,high-voltage,4,0.564296
1622064056642,high-voltage,5,0.781451
1622064056642,high-voltage,6,1.03969
1622064056642,high-voltage,7,1.36486
1622064056642,high-voltage,8,1.81677
1622064056642,high-voltage,9,2.22216
1622064056642,high-voltage,10,2.81034
1622064056642,high-voltage,11,3.54091
1622064056642,high-voltage,12,4.26121
1622064056642,high-voltage,13,5.11415
1622064056642,high-voltage,14,6.46468
1622064056642,high-voltage,15,7.44358
1622064056642,high-voltage,16,8.61575
1622064056642,high-voltage,17,9.61857
1622064056642,high-voltage,18,10.0001
1622064122794,high-voltage,1,0.165832
1622064122794,high-voltage,2,0.278678
1622064122794,high-voltage,3,0.41771
1622064122794,high-voltage,4,0.583794
1622064122794,high-voltage,5,0.767806
1622064122794,high-voltage,6,1.00627
1622064122794,high-voltage,7,1.30789
1622064122794,high-voltage,8,1.73545
1622064122794,high-voltage,9,2.18938
1622064122794,high-voltage,10,2.80812
1622064122794,high-voltage,3.41402e-06,3.49465
1622064122794,high-voltage,12,4.2207
1622064122794,high-voltage,13,5.36057
1622064122794,high-voltage,14,6.50786
1622064122794,high-voltage,15,7.44573
1622064122794,high-voltage,16,8.42835
1622064122794,high-voltage,17,9.74224
1622064122794,high-voltage,18,10.0001
