{
    "Data": [245.0, 209.0, 22.0, 11.0, 24.0, 56.0, 206.0, 762.0, 1959.0, 3826.0, 5109.0, 4849.0, 3442.0, 2244.0, 1836.0, 1875.0, 1923.0, 1845.0, 1459.0, 1046.0, 793.0, 643.0, 615.0, 663.0, 829.0, 972.0, 1202.0, 1238.0, 1304.0, 1409.0, 1324.0, 1390.0, 1319.0, 1357.0, 1160.0, 1085.0, 1046.0, 946.0, 834.0, 707.0, 634.0, 541.0, 454.0, 372.0, 306.0, 254.0, 230.0, 184.0, 135.0, 149.0, 129.0, 115.0, 93.0, 82.0, 83.0, 61.0, 62.0, 66.0, 69.0, 40.0, 48.0, 40.0, 37.0, 35.0, 29.0, 25.0, 20.0, 12.0, 25.0, 16.0, 15.0, 18.0, 9.0, 10.0, 9.0, 8.0, 11.0, 6.0, 4.0, 7.0, 9.0, 7.0, 9.0, 4.0, 8.0, 7.0, 4.0, 11.0, 8.0, 4.0, 9.0, 4.0, 6.0, 7.0, 5.0, 5.0, 4.0, 6.0, 7.0, 5.0, 4.0, 4.0, 5.0, 2.0, 5.0, 1.0, 4.0, 2.0, 1.0, 1.0, 0.0, 2.0, 5.0, 2.0, 1.0, 3.0, 0.0, 0.0, 0.0, 6.0, 3.0, 1.0, 2.0, 2.0, 0.0, 0.0, 3.0, 1.0, 1.0, 1.0, 0.0, 1.0, 0.0],
    "Name": "NoiseDist-0",
    "Overflow": 293.0,
    "Type": "Histo1d",
    "Underflow": 0.0,
    "x": {
        "AxisTitle": "Noise [e]",
        "Bins": 133,
        "High": 666.0,
        "Low": -2.0
    },
    "y": {
        "AxisTitle": "Number of Pixels"
    },
    "z": {
        "AxisTitle": "z"
    }
}