time,Hardware,Voltage,Current
1621991359318,high-voltage,1,0.0645481
time,Hardware,Voltage,Current
1621991359318,high-voltage,2,0.126089
time,Hardware,Voltage,Current
1621991359318,high-voltage,3,0.212558
time,Hardware,Voltage,Current
1621991359318,high-voltage,4,0.325914
time,Hardware,Voltage,Current
1621991359318,high-voltage,5,0.465836
time,Hardware,Voltage,Current
1621991359318,high-voltage,6,0.643791
time,Hardware,Voltage,Current
1621991359318,high-voltage,7,0.896666
time,Hardware,Voltage,Current
1621991359318,high-voltage,8,1.20985
time,Hardware,Voltage,Current
1621991359318,high-voltage,9,1.52916
time,Hardware,Voltage,Current
1621991359318,high-voltage,10,2.00536
time,Hardware,Voltage,Current
1621991359318,high-voltage,11,2.54458
time,Hardware,Voltage,Current
1621991359318,high-voltage,12,3.22788
time,Hardware,Voltage,Current
1621991359318,high-voltage,13,3.9772
time,Hardware,Voltage,Current
1621991359318,high-voltage,14,4.93831
time,Hardware,Voltage,Current
1621991359318,high-voltage,15,5.89264
time,Hardware,Voltage,Current
1621991359318,high-voltage,16,7.09425
time,Hardware,Voltage,Current
1621991359318,high-voltage,17,8.42488
time,Hardware,Voltage,Current
1621991359318,high-voltage,18,9.54903
time,Hardware,Voltage,Current
1621991359318,high-voltage,19,9.72476
