{
    "Data": [79.0, 7768.0, 21533.0, 14950.0, 5904.0, 1499.0, 342.0, 131.0, 101.0, 86.0, 131.0, 145.0, 181.0, 208.0, 242.0, 298.0, 315.0, 377.0, 402.0, 438.0, 515.0, 555.0, 541.0, 594.0, 594.0, 651.0, 651.0, 647.0, 626.0, 673.0, 628.0, 614.0, 617.0, 628.0, 542.0, 545.0, 529.0, 509.0, 502.0, 446.0, 487.0, 402.0, 396.0, 380.0, 375.0, 325.0, 281.0, 305.0, 320.0, 269.0, 130.0],
    "Name": "Chi2Dist-0",
    "Overflow": 0.0,
    "Type": "Histo1d",
    "Underflow": 0.0,
    "x": {
        "AxisTitle": "Fit Chi/ndf",
        "Bins": 51,
        "High": 2.5250000953674318,
        "Low": -0.02500000037252903
    },
    "y": {
        "AxisTitle": "Number of Pixels"
    },
    "z": {
        "AxisTitle": "z"
    }
}