time,Hardware,Voltage,Current
1626712298383,high-voltage-2,1,0.141815
time,Hardware,Voltage,Current
1626712298383,high-voltage-2,2,0.205122
time,Hardware,Voltage,Current
1626712298383,high-voltage-2,3,0.244099
time,Hardware,Voltage,Current
1626712298383,high-voltage-2,4,0.271625
time,Hardware,Voltage,Current
1626712298383,high-voltage-2,5,0.292547
time,Hardware,Voltage,Current
1626712298383,high-voltage-2,6,0.314634
time,Hardware,Voltage,Current
1626712298383,high-voltage-2,7,0.331427
time,Hardware,Voltage,Current
1626712298383,high-voltage-2,8,0.351633
time,Hardware,Voltage,Current
1626712298383,high-voltage-2,9,0.36907
time,Hardware,Voltage,Current
1626712298383,high-voltage-2,10,0.38931
time,Hardware,Voltage,Current
1626712298383,high-voltage-2,11,0.407265
time,Hardware,Voltage,Current
1626712298383,high-voltage-2,12,0.425873
time,Hardware,Voltage,Current
1626712298383,high-voltage-2,13,0.440798
time,Hardware,Voltage,Current
1626712298383,high-voltage-2,14,0.458684
time,Hardware,Voltage,Current
1626712298383,high-voltage-2,15,0.475139
time,Hardware,Voltage,Current
1626712298383,high-voltage-2,16,0.490572
time,Hardware,Voltage,Current
1626712298383,high-voltage-2,17,0.506329
time,Hardware,Voltage,Current
1626712298383,high-voltage-2,18,0.519791
time,Hardware,Voltage,Current
1626712298383,high-voltage-2,19,0.532981
time,Hardware,Voltage,Current
1626712298383,high-voltage-2,20,0.546784
time,Hardware,Voltage,Current
1626712298383,high-voltage-2,25,0.595513
time,Hardware,Voltage,Current
1626712298383,high-voltage-2,30,0.64526
time,Hardware,Voltage,Current
1626712298383,high-voltage-2,35,0.694501
time,Hardware,Voltage,Current
1626712298383,high-voltage-2,40,0.752838
time,Hardware,Voltage,Current
1626712298383,high-voltage-2,45,0.826052
time,Hardware,Voltage,Current
1626712298383,high-voltage-2,50,0.879226
time,Hardware,Voltage,Current
1626712298383,high-voltage-2,55,0.932327
time,Hardware,Voltage,Current
1626712298383,high-voltage-2,60,0.985366
time,Hardware,Voltage,Current
1626712298383,high-voltage-2,65,1.03722
time,Hardware,Voltage,Current
1626712298383,high-voltage-2,70,1.08501
time,Hardware,Voltage,Current
1626712298383,high-voltage-2,75,1.13143
time,Hardware,Voltage,Current
1626712298383,high-voltage-2,80,1.17719
time,Hardware,Voltage,Current
1626712298383,high-voltage-2,85,1.21904
time,Hardware,Voltage,Current
1626712298383,high-voltage-2,90,1.25497
time,Hardware,Voltage,Current
1626712298383,high-voltage-2,95,1.29069
time,Hardware,Voltage,Current
1626712298383,high-voltage-2,100,1.31917
