time,Hardware,Voltage,Current
1626379773375,high-voltage,1,0.0155692
time,Hardware,Voltage,Current
1626379773375,high-voltage,2,0.0341784
time,Hardware,Voltage,Current
1626379773375,high-voltage,3,0.0449766
time,Hardware,Voltage,Current
1626379773375,high-voltage,4,0.051155
time,Hardware,Voltage,Current
1626379773375,high-voltage,5,0.05808
time,Hardware,Voltage,Current
1626379773375,high-voltage,6,0.0640248
time,Hardware,Voltage,Current
1626379773375,high-voltage,7,0.0708056
time,Hardware,Voltage,Current
1626379773375,high-voltage,8,0.0771758
time,Hardware,Voltage,Current
1626379773375,high-voltage,9,0.082975
time,Hardware,Voltage,Current
1626379773375,high-voltage,10,0.0900719
time,Hardware,Voltage,Current
1626379773375,high-voltage,11,0.0957695
time,Hardware,Voltage,Current
1626379773375,high-voltage,12,0.100402
time,Hardware,Voltage,Current
1626379773375,high-voltage,13,0.105461
time,Hardware,Voltage,Current
1626379773375,high-voltage,14,0.108704
time,Hardware,Voltage,Current
1626379773375,high-voltage,15,0.113249
time,Hardware,Voltage,Current
1626379773375,high-voltage,16,0.114827
time,Hardware,Voltage,Current
1626379773375,high-voltage,17,0.118265
time,Hardware,Voltage,Current
1626379773375,high-voltage,18,0.121551
time,Hardware,Voltage,Current
1626379773375,high-voltage,19,0.123578
time,Hardware,Voltage,Current
1626379773375,high-voltage,20,0.126663
time,Hardware,Voltage,Current
1626379773375,high-voltage,25,0.140516
time,Hardware,Voltage,Current
1626379773375,high-voltage,30,0.155761
time,Hardware,Voltage,Current
1626379773375,high-voltage,35,0.184654
time,Hardware,Voltage,Current
1626379773375,high-voltage,40,0.275708
time,Hardware,Voltage,Current
1626379773375,high-voltage,45,0.495479
time,Hardware,Voltage,Current
1626379773375,high-voltage,50,0.91784
time,Hardware,Voltage,Current
1626379773375,high-voltage,55,1.64016
time,Hardware,Voltage,Current
1626379773375,high-voltage,60,2.75536
time,Hardware,Voltage,Current
1626379773375,high-voltage,65,4.34832
time,Hardware,Voltage,Current
1626379773375,high-voltage,70,6.49893
time,Hardware,Voltage,Current
1626379773375,high-voltage,75,9.38155
time,Hardware,Voltage,Current
1626379773375,high-voltage,80,10
