{
    "Data": [885.0, 18172.0, 20642.0, 8685.0, 2451.0, 477.0, 88.0, 23.0, 8.0, 4.0, 5.0, 3.0, 7.0, 6.0, 11.0, 9.0, 8.0, 8.0, 2.0, 1.0, 6.0, 5.0, 10.0, 3.0, 22.0, 2.0, 3.0, 0.0, 0.0, 0.0, 0.0, 0.0, 0.0, 0.0, 0.0, 0.0, 0.0, 0.0, 0.0, 0.0, 0.0, 0.0, 0.0, 0.0, 0.0, 0.0, 0.0, 0.0, 0.0, 0.0, 0.0],
    "Name": "Chi2Dist-0",
    "Overflow": 0.0,
    "Type": "Histo1d",
    "Underflow": 0.0,
    "x": {
        "AxisTitle": "Fit Chi/ndf",
        "Bins": 51,
        "High": 2.5250000953674318,
        "Low": -0.02500000037252903
    },
    "y": {
        "AxisTitle": "Number of Pixels"
    },
    "z": {
        "AxisTitle": "z"
    }
}