time,Hardware,Voltage,Current
1621609430436,high-voltage,1,0.144364
time,Hardware,Voltage,Current
1621609430436,high-voltage,2,0.25502
time,Hardware,Voltage,Current
1621609430436,high-voltage,3,0.418133
time,Hardware,Voltage,Current
1621609430436,high-voltage,4,0.640113
time,Hardware,Voltage,Current
1621609430436,high-voltage,5,0.892901
time,Hardware,Voltage,Current
1621609430436,high-voltage,6,1.21562
time,Hardware,Voltage,Current
1621609430436,high-voltage,7,1.56683
time,Hardware,Voltage,Current
1621609430436,high-voltage,8,2.07236
time,Hardware,Voltage,Current
1621609430436,high-voltage,9,2.63937
time,Hardware,Voltage,Current
1621609430436,high-voltage,10,3.25694
time,Hardware,Voltage,Current
1621609430436,high-voltage,11,3.97787
time,Hardware,Voltage,Current
1621609430436,high-voltage,12,4.74364
time,Hardware,Voltage,Current
1621609430436,high-voltage,13,5.79776
time,Hardware,Voltage,Current
1621609430436,high-voltage,14,6.91185
time,Hardware,Voltage,Current
1621609430436,high-voltage,15,8.1333
time,Hardware,Voltage,Current
1621609430436,high-voltage,16,9.23111
time,Hardware,Voltage,Current
1621609430436,high-voltage,17,9.87905
time,Hardware,Voltage,Current
1621609430436,high-voltage,18,10.0001
