{
    "Data": [0.0, 0.0, 0.0, 0.0, 0.0, 0.0, 0.0, 0.0, 0.0, 0.0, 0.0, 0.0, 0.0, 0.0, 0.0, 0.0, 0.0, 0.0, 0.0, 0.0, 0.0, 1.0, 0.0, 0.0, 0.0, 2.0, 2.0, 0.0, 7.0, 13.0, 15.0, 25.0, 34.0, 1.0, 0.0, 38.0, 3.0, 50.0, 44.0, 14.0, 12.0, 9.0, 50.0, 6.0, 27.0, 24.0, 23.0, 31.0, 50.0, 15.0, 39.0],
    "Name": "Scurve-80-96",
    "Overflow": 0.0,
    "Type": "Histo1d",
    "Underflow": 0.0,
    "x": {
        "AxisTitle": "Vcal",
        "Bins": 51,
        "High": 302.5,
        "Low": 47.5
    },
    "y": {
        "AxisTitle": "Occupancy"
    },
    "z": {
        "AxisTitle": "z"
    }
}