time,Hardware,Voltage,Current
1621991433289,high-voltage,1,0.0624462
time,Hardware,Voltage,Current
1621991433289,high-voltage,2,0.120282
time,Hardware,Voltage,Current
1621991433289,high-voltage,3,0.197458
time,Hardware,Voltage,Current
1621991433289,high-voltage,4,0.310587
time,Hardware,Voltage,Current
1621991433289,high-voltage,5,0.431778
time,Hardware,Voltage,Current
1621991433289,high-voltage,6,0.640413
time,Hardware,Voltage,Current
1621991433289,high-voltage,7,0.892083
time,Hardware,Voltage,Current
1621991433289,high-voltage,8,1.18857
time,Hardware,Voltage,Current
1621991433289,high-voltage,9,1.53439
time,Hardware,Voltage,Current
1621991433289,high-voltage,10,2.03861
time,Hardware,Voltage,Current
1621991433289,high-voltage,11,2.5315
time,Hardware,Voltage,Current
1621991433289,high-voltage,12,3.23401
time,Hardware,Voltage,Current
1621991433289,high-voltage,13,3.95555
time,Hardware,Voltage,Current
1621991433289,high-voltage,14,4.89922
time,Hardware,Voltage,Current
1621991433289,high-voltage,15,6.04402
time,Hardware,Voltage,Current
1621991433289,high-voltage,16,7.17949
time,Hardware,Voltage,Current
1621991433289,high-voltage,17,8.79243
time,Hardware,Voltage,Current
1621991433289,high-voltage,18,9.82559
time,Hardware,Voltage,Current
1621991433289,high-voltage,19,9.96137
