{
    "Data": [14.0, 51.0, 12.0, 16.0, 26.0, 53.0, 142.0, 500.0, 1419.0, 3034.0, 4801.0, 5555.0, 4975.0, 3870.0, 3306.0, 3194.0, 3307.0, 2916.0, 2708.0, 2308.0, 2080.0, 1804.0, 1802.0, 1445.0, 1214.0, 861.0, 562.0, 393.0, 300.0, 229.0, 252.0, 232.0, 295.0, 342.0, 431.0, 498.0, 572.0, 704.0, 830.0, 851.0, 976.0, 1102.0, 1089.0, 1090.0, 1044.0, 1010.0, 999.0, 840.0, 812.0, 714.0, 645.0, 570.0, 521.0, 417.0, 375.0, 324.0, 305.0, 277.0, 251.0, 217.0, 187.0, 177.0, 157.0, 124.0, 132.0, 132.0, 101.0, 90.0, 110.0, 94.0, 88.0, 105.0, 61.0, 84.0, 82.0, 62.0, 60.0, 51.0, 57.0, 45.0, 60.0, 36.0, 37.0, 39.0, 37.0, 34.0, 30.0, 26.0, 33.0, 29.0, 21.0, 22.0, 23.0, 25.0, 22.0, 23.0, 18.0, 24.0, 13.0, 17.0, 13.0, 12.0, 15.0, 13.0, 11.0, 9.0, 13.0, 17.0, 11.0, 7.0, 6.0, 16.0, 10.0, 12.0, 9.0],
    "Name": "NoiseDist-0",
    "Overflow": 202.0,
    "Type": "Histo1d",
    "Underflow": 0.0,
    "x": {
        "AxisTitle": "Noise [e]",
        "Bins": 115,
        "High": 576.0,
        "Low": -2.0
    },
    "y": {
        "AxisTitle": "Number of Pixels"
    },
    "z": {
        "AxisTitle": "z"
    }
}