{
    "Data": [246.0, 195.0, 10.0, 5.0, 6.0, 6.0, 14.0, 17.0, 51.0, 225.0, 573.0, 1430.0, 2647.0, 3878.0, 4487.0, 4018.0, 3000.0, 2013.0, 1549.0, 1566.0, 1578.0, 1610.0, 1470.0, 1264.0, 805.0, 490.0, 316.0, 198.0, 149.0, 117.0, 155.0, 159.0, 210.0, 292.0, 385.0, 522.0, 670.0, 857.0, 1022.0, 1195.0, 1343.0, 1493.0, 1579.0, 1578.0, 1510.0, 1429.0, 1328.0, 1193.0, 1041.0, 939.0, 724.0, 619.0, 513.0, 462.0, 343.0, 297.0, 237.0, 197.0, 188.0, 164.0, 156.0, 121.0, 113.0, 91.0, 77.0, 68.0, 51.0, 58.0, 70.0, 46.0, 42.0, 54.0, 48.0, 27.0, 35.0, 54.0, 24.0, 28.0, 31.0, 23.0, 19.0, 24.0, 19.0, 17.0, 22.0, 14.0, 16.0, 13.0, 13.0, 16.0, 12.0, 9.0, 15.0, 11.0, 6.0, 15.0, 13.0, 15.0, 11.0, 13.0, 4.0, 6.0, 9.0, 8.0, 9.0, 4.0, 6.0, 7.0, 4.0, 6.0, 3.0, 3.0, 10.0, 7.0, 6.0, 4.0, 7.0, 9.0, 4.0, 4.0, 2.0, 8.0, 7.0, 5.0, 3.0, 7.0, 1.0, 7.0, 2.0, 3.0, 4.0, 3.0, 4.0, 4.0, 5.0, 1.0, 2.0, 2.0, 7.0, 4.0, 5.0, 6.0, 4.0, 7.0, 0.0, 2.0, 6.0, 3.0, 3.0, 2.0, 5.0, 3.0, 1.0, 9.0, 4.0, 1.0, 4.0, 1.0, 2.0, 2.0, 5.0, 5.0, 2.0, 4.0, 6.0, 1.0, 2.0, 1.0, 1.0, 2.0, 2.0, 1.0, 3.0, 6.0, 2.0, 3.0, 2.0, 6.0, 1.0, 2.0, 4.0, 1.0, 2.0, 0.0, 2.0, 5.0, 3.0, 5.0, 6.0, 5.0, 4.0, 3.0],
    "Name": "NoiseDist-0",
    "Overflow": 503.0,
    "Type": "Histo1d",
    "Underflow": 0.0,
    "x": {
        "AxisTitle": "Noise [e]",
        "Bins": 192,
        "High": 961.0,
        "Low": -2.0
    },
    "y": {
        "AxisTitle": "Number of Pixels"
    },
    "z": {
        "AxisTitle": "z"
    }
}