{
    "Data": [0.0, 0.0, 0.0, 0.0, 0.0, 0.0, 0.0, 0.0, 0.0, 0.0, 0.0, 0.0, 0.0, 0.0, 0.0, 0.0, 0.0, 1.0, 0.0, 1.0, 1.0, 1.0, 0.0, 3.0, 7.0, 12.0, 14.0, 1.0, 24.0, 22.0, 33.0, 42.0, 41.0, 12.0, 43.0, 49.0, 50.0, 50.0, 18.0, 50.0, 50.0, 24.0, 50.0, 50.0, 50.0, 50.0, 50.0, 50.0, 50.0, 50.0, 45.0],
    "Name": "Scurve-10-96",
    "Overflow": 0.0,
    "Type": "Histo1d",
    "Underflow": 0.0,
    "x": {
        "AxisTitle": "Vcal",
        "Bins": 51,
        "High": 302.5,
        "Low": 47.5
    },
    "y": {
        "AxisTitle": "Occupancy"
    },
    "z": {
        "AxisTitle": "z"
    }
}