time,Hardware,Voltage,Current
1621991055021,high-voltage,1,0.0610636
time,Hardware,Voltage,Current
1621991055021,high-voltage,2,0.116124
time,Hardware,Voltage,Current
1621991055021,high-voltage,3,0.196193
time,Hardware,Voltage,Current
1621991055021,high-voltage,4,0.304092
time,Hardware,Voltage,Current
1621991055021,high-voltage,5,0.463432
time,Hardware,Voltage,Current
1621991055021,high-voltage,6,0.609608
time,Hardware,Voltage,Current
1621991055021,high-voltage,7,0.88432
time,Hardware,Voltage,Current
1621991055021,high-voltage,8,1.18642
time,Hardware,Voltage,Current
1621991055021,high-voltage,9,1.60597
time,Hardware,Voltage,Current
1621991055021,high-voltage,10,2.04583
time,Hardware,Voltage,Current
1621991055021,high-voltage,11,2.69286
time,Hardware,Voltage,Current
1621991055021,high-voltage,12,3.34417
time,Hardware,Voltage,Current
1621991055021,high-voltage,13,4.0925
time,Hardware,Voltage,Current
1621991055021,high-voltage,14,5.20689
time,Hardware,Voltage,Current
1621991055021,high-voltage,15,6.20336
time,Hardware,Voltage,Current
1621991055021,high-voltage,16,7.50587
time,Hardware,Voltage,Current
1621991055021,high-voltage,17,8.79484
time,Hardware,Voltage,Current
1621991055021,high-voltage,18,9.38772
time,Hardware,Voltage,Current
1621991055021,high-voltage,19,10.0001
time,Hardware,Voltage,Current
1621991055021,high-voltage,20,10.0001
