{
    "Data": [14.0, 38.0, 2.0, 0.0, 5.0, 86.0, 482.0, 1473.0, 2947.0, 4182.0, 4580.0, 3725.0, 2986.0, 2549.0, 2441.0, 2169.0, 2115.0, 1937.0, 1867.0, 1959.0, 2073.0, 2363.0, 2514.0, 2294.0, 2021.0, 1520.0, 1131.0, 715.0, 509.0, 388.0, 373.0, 465.0, 587.0, 731.0, 1008.0, 1177.0, 1446.0, 1684.0, 1747.0, 1917.0, 1922.0, 1937.0, 1761.0, 1609.0, 1353.0, 1129.0, 907.0, 740.0, 534.0, 440.0, 292.0, 243.0, 158.0, 138.0, 95.0, 79.0, 54.0, 31.0, 47.0, 36.0, 26.0, 22.0, 32.0, 20.0, 16.0, 14.0, 16.0, 9.0, 6.0, 11.0, 9.0, 7.0, 3.0, 6.0, 2.0, 5.0, 5.0, 2.0, 2.0, 3.0, 2.0, 0.0, 1.0, 0.0, 1.0, 4.0, 0.0, 2.0, 0.0, 2.0],
    "Name": "NoiseDist-0",
    "Overflow": 15.0,
    "Type": "Histo1d",
    "Underflow": 0.0,
    "x": {
        "AxisTitle": "Noise [e]",
        "Bins": 90,
        "High": 451.0,
        "Low": -2.0
    },
    "y": {
        "AxisTitle": "Number of Pixels"
    },
    "z": {
        "AxisTitle": "z"
    }
}