time,Hardware,Voltage,Current
1623350948138,high-voltage,1,0.0691804
time,Hardware,Voltage,Current
1623350948138,high-voltage,2,0.0879288
time,Hardware,Voltage,Current
1623350948138,high-voltage,3,0.103673
time,Hardware,Voltage,Current
1623350948138,high-voltage,4,0.116119
time,Hardware,Voltage,Current
1623350948138,high-voltage,5,0.127782
time,Hardware,Voltage,Current
1623350948138,high-voltage,6,0.137819
time,Hardware,Voltage,Current
1623350948138,high-voltage,7,0.146399
time,Hardware,Voltage,Current
1623350948138,high-voltage,8,0.155542
time,Hardware,Voltage,Current
1623350948138,high-voltage,9,0.164335
time,Hardware,Voltage,Current
1623350948138,high-voltage,10,0.172294
time,Hardware,Voltage,Current
1623350948138,high-voltage,11,0.180169
time,Hardware,Voltage,Current
1623350948138,high-voltage,12,0.187148
time,Hardware,Voltage,Current
1623350948138,high-voltage,13,0.194478
time,Hardware,Voltage,Current
1623350948138,high-voltage,14,0.201079
time,Hardware,Voltage,Current
1623350948138,high-voltage,15,0.20647
time,Hardware,Voltage,Current
1623350948138,high-voltage,16,0.211523
time,Hardware,Voltage,Current
1623350948138,high-voltage,17,0.215405
time,Hardware,Voltage,Current
1623350948138,high-voltage,18,0.220434
time,Hardware,Voltage,Current
1623350948138,high-voltage,19,0.226082
time,Hardware,Voltage,Current
1623350948138,high-voltage,20,0.229987
time,Hardware,Voltage,Current
1623350948138,high-voltage,25,0.253301
time,Hardware,Voltage,Current
1623350948138,high-voltage,30,0.284513
time,Hardware,Voltage,Current
1623350948138,high-voltage,35,0.374089
time,Hardware,Voltage,Current
1623350948138,high-voltage,40,0.647684
time,Hardware,Voltage,Current
1623350948138,high-voltage,45,1.13311
time,Hardware,Voltage,Current
1623350948138,high-voltage,50,1.77163
time,Hardware,Voltage,Current
1623350948138,high-voltage,55,2.54708
time,Hardware,Voltage,Current
1623350948138,high-voltage,60,3.45245
time,Hardware,Voltage,Current
1623350948138,high-voltage,65,4.48569
time,Hardware,Voltage,Current
1623350948138,high-voltage,70,5.65649
time,Hardware,Voltage,Current
1623350948138,high-voltage,75,6.97642
time,Hardware,Voltage,Current
1623350948138,high-voltage,80,8.44255
time,Hardware,Voltage,Current
1623350948138,high-voltage,85,10
