time,Hardware,Voltage,Current
1622071936984,high-voltage-3,1,0.0932277
time,Hardware,Voltage,Current
1622071936984,high-voltage-3,2,0.101706
time,Hardware,Voltage,Current
1622071936984,high-voltage-3,3,0.106727
time,Hardware,Voltage,Current
1622071936984,high-voltage-3,4,0.113266
time,Hardware,Voltage,Current
1622071936984,high-voltage-3,5,0.119097
time,Hardware,Voltage,Current
1622071936984,high-voltage-3,6,0.122614
time,Hardware,Voltage,Current
1622071936984,high-voltage-3,7,0.128239
time,Hardware,Voltage,Current
1622071936984,high-voltage-3,8,0.134212
time,Hardware,Voltage,Current
1622071936984,high-voltage-3,9,0.141769
time,Hardware,Voltage,Current
1622071936984,high-voltage-3,10,0.148406
time,Hardware,Voltage,Current
1622071936984,high-voltage-3,11,0.156428
time,Hardware,Voltage,Current
1622071936984,high-voltage-3,12,0.162556
time,Hardware,Voltage,Current
1622071936984,high-voltage-3,13,0.167946
time,Hardware,Voltage,Current
1622071936984,high-voltage-3,14,0.173567
time,Hardware,Voltage,Current
1622071936984,high-voltage-3,15,0.180107
time,Hardware,Voltage,Current
1622071936984,high-voltage-3,16,0.185183
time,Hardware,Voltage,Current
1622071936984,high-voltage-3,17,0.19001
time,Hardware,Voltage,Current
1622071936984,high-voltage-3,18,0.193272
time,Hardware,Voltage,Current
1622071936984,high-voltage-3,19,0.197127
time,Hardware,Voltage,Current
1622071936984,high-voltage-3,20,0.202909
time,Hardware,Voltage,Current
1622071936984,high-voltage-3,25,0.221388
time,Hardware,Voltage,Current
1622071936984,high-voltage-3,30,0.238171
time,Hardware,Voltage,Current
1622071936984,high-voltage-3,35,0.253528
time,Hardware,Voltage,Current
1622071936984,high-voltage-3,40,0.269138
time,Hardware,Voltage,Current
1622071936984,high-voltage-3,45,0.281632
time,Hardware,Voltage,Current
1622071936984,high-voltage-3,50,0.297425
time,Hardware,Voltage,Current
1622071936984,high-voltage-3,55,0.309262
time,Hardware,Voltage,Current
1622071936984,high-voltage-3,60,0.321084
time,Hardware,Voltage,Current
1622071936984,high-voltage-3,65,0.331337
time,Hardware,Voltage,Current
1622071936984,high-voltage-3,70,0.340566
time,Hardware,Voltage,Current
1622071936984,high-voltage-3,75,0.350431
time,Hardware,Voltage,Current
1622071936984,high-voltage-3,80,0.361538
time,Hardware,Voltage,Current
1622071936984,high-voltage-3,85,0.371722
time,Hardware,Voltage,Current
1622071936984,high-voltage-3,90,0.384077
time,Hardware,Voltage,Current
1622071936984,high-voltage-3,95,0.392711
time,Hardware,Voltage,Current
1622071936984,high-voltage-3,100,0.40465