time,Hardware,Voltage,Current
1621477384135,high-voltage-2,1,0.126867
time,Hardware,Voltage,Current
1621477384135,high-voltage-2,2,0.163158
time,Hardware,Voltage,Current
1621477384135,high-voltage-2,3,0.183044
time,Hardware,Voltage,Current
1621477384135,high-voltage-2,4,0.198648
time,Hardware,Voltage,Current
1621477384135,high-voltage-2,5,0.217073
time,Hardware,Voltage,Current
1621477384135,high-voltage-2,6,0.236293
time,Hardware,Voltage,Current
1621477384135,high-voltage-2,7,0.256551
time,Hardware,Voltage,Current
1621477384135,high-voltage-2,8,0.278869
time,Hardware,Voltage,Current
1621477384135,high-voltage-2,9,0.301166
time,Hardware,Voltage,Current
1621477384135,high-voltage-2,10,0.323179
time,Hardware,Voltage,Current
1621477384135,high-voltage-2,11,0.346673
time,Hardware,Voltage,Current
1621477384135,high-voltage-2,12,0.36669
time,Hardware,Voltage,Current
1621477384135,high-voltage-2,13,0.3864
time,Hardware,Voltage,Current
1621477384135,high-voltage-2,14,0.40435
time,Hardware,Voltage,Current
1621477384135,high-voltage-2,15,0.421834
time,Hardware,Voltage,Current
1621477384135,high-voltage-2,16,0.437296
time,Hardware,Voltage,Current
1621477384135,high-voltage-2,17,0.452904
time,Hardware,Voltage,Current
1621477384135,high-voltage-2,18,0.467659
time,Hardware,Voltage,Current
1621477384135,high-voltage-2,19,0.478617
time,Hardware,Voltage,Current
1621477384135,high-voltage-2,20,0.488691
time,Hardware,Voltage,Current
1621477384135,high-voltage-2,25,0.539371
time,Hardware,Voltage,Current
1621477384135,high-voltage-2,30,0.586354
time,Hardware,Voltage,Current
1621477384135,high-voltage-2,35,0.63353
time,Hardware,Voltage,Current
1621477384135,high-voltage-2,40,0.688495
time,Hardware,Voltage,Current
1621477384135,high-voltage-2,45,0.754304
time,Hardware,Voltage,Current
1621477384135,high-voltage-2,50,0.802566
time,Hardware,Voltage,Current
1621477384135,high-voltage-2,55,0.846933
time,Hardware,Voltage,Current
1621477384135,high-voltage-2,60,0.888521
time,Hardware,Voltage,Current
1621477384135,high-voltage-2,65,0.927488
time,Hardware,Voltage,Current
1621477384135,high-voltage-2,70,0.967887
time,Hardware,Voltage,Current
1621477384135,high-voltage-2,75,1.00508
time,Hardware,Voltage,Current
1621477384135,high-voltage-2,80,1.04333
time,Hardware,Voltage,Current
1621477384135,high-voltage-2,85,1.07784
time,Hardware,Voltage,Current
1621477384135,high-voltage-2,90,1.11426
time,Hardware,Voltage,Current
1621477384135,high-voltage-2,95,1.14783
time,Hardware,Voltage,Current
1621477384135,high-voltage-2,100,1.18318
