{
    "Data": [[267.0, 89.0, 41.0, 36.0, 13.0, 15.0, 11.0, 8.0, 9.0, 6.0, 8.0, 7.0, 10.0, 3.0, 5.0, 8.0, 4.0, 4.0, 6.0, 8.0, 10.0, 6.0, 7.0, 7.0, 4.0, 6.0, 5.0, 5.0, 5.0, 9.0, 3.0, 2.0, 3.0, 2.0, 8.0, 0.0, 2.0, 3.0, 4.0, 6.0, 6.0, 4.0, 2.0, 2.0, 6.0, 3.0, 5.0, 4.0, 5.0], [508.0, 166.0, 85.0, 42.0, 29.0, 21.0, 20.0, 11.0, 14.0, 13.0, 8.0, 10.0, 5.0, 9.0, 5.0, 10.0, 5.0, 4.0, 8.0, 9.0, 2.0, 4.0, 7.0, 6.0, 4.0, 2.0, 6.0, 2.0, 4.0, 5.0, 6.0, 5.0, 9.0, 6.0, 2.0, 5.0, 4.0, 5.0, 1.0, 7.0, 7.0, 2.0, 6.0, 6.0, 12.0, 8.0, 7.0, 1.0, 5.0], [1104.0, 369.0, 161.0, 90.0, 62.0, 44.0, 35.0, 24.0, 27.0, 21.0, 21.0, 8.0, 15.0, 17.0, 10.0, 9.0, 7.0, 5.0, 16.0, 4.0, 9.0, 5.0, 4.0, 9.0, 4.0, 3.0, 7.0, 6.0, 5.0, 3.0, 6.0, 3.0, 2.0, 5.0, 1.0, 2.0, 3.0, 5.0, 10.0, 6.0, 7.0, 5.0, 5.0, 7.0, 6.0, 12.0, 8.0, 11.0, 14.0], [2143.0, 734.0, 431.0, 234.0, 174.0, 105.0, 86.0, 71.0, 50.0, 48.0, 39.0, 22.0, 26.0, 19.0, 13.0, 17.0, 25.0, 11.0, 18.0, 14.0, 15.0, 13.0, 11.0, 15.0, 13.0, 8.0, 9.0, 8.0, 12.0, 4.0, 4.0, 8.0, 6.0, 10.0, 2.0, 2.0, 5.0, 11.0, 5.0, 4.0, 4.0, 2.0, 10.0, 6.0, 5.0, 9.0, 10.0, 16.0, 18.0], [3751.0, 1520.0, 846.0, 555.0, 395.0, 292.0, 210.0, 196.0, 162.0, 112.0, 84.0, 82.0, 62.0, 51.0, 52.0, 52.0, 37.0, 42.0, 40.0, 26.0, 28.0, 16.0, 28.0, 33.0, 24.0, 21.0, 18.0, 13.0, 16.0, 13.0, 10.0, 16.0, 10.0, 14.0, 9.0, 8.0, 5.0, 13.0, 12.0, 8.0, 9.0, 3.0, 6.0, 12.0, 9.0, 6.0, 14.0, 18.0, 22.0], [7425.0, 2986.0, 1710.0, 1092.0, 779.0, 636.0, 490.0, 436.0, 326.0, 323.0, 246.0, 205.0, 199.0, 154.0, 157.0, 102.0, 95.0, 107.0, 83.0, 80.0, 66.0, 66.0, 66.0, 52.0, 42.0, 49.0, 40.0, 27.0, 30.0, 42.0, 29.0, 32.0, 24.0, 30.0, 17.0, 24.0, 21.0, 33.0, 25.0, 18.0, 17.0, 7.0, 19.0, 18.0, 25.0, 23.0, 21.0, 16.0, 23.0], [9053.0, 6125.0, 4229.0, 3084.0, 2319.0, 1802.0, 1382.0, 1056.0, 880.0, 674.0, 616.0, 505.0, 499.0, 405.0, 326.0, 312.0, 278.0, 226.0, 234.0, 197.0, 198.0, 190.0, 170.0, 130.0, 125.0, 164.0, 142.0, 91.0, 121.0, 108.0, 71.0, 70.0, 65.0, 82.0, 61.0, 41.0, 60.0, 52.0, 49.0, 46.0, 43.0, 45.0, 43.0, 45.0, 38.0, 32.0, 34.0, 43.0, 50.0], [3281.0, 3169.0, 3041.0, 2890.0, 2753.0, 2655.0, 2720.0, 2422.0, 2221.0, 2041.0, 1908.0, 1768.0, 1608.0, 1458.0, 1335.0, 1192.0, 1114.0, 1011.0, 848.0, 837.0, 656.0, 617.0, 610.0, 536.0, 447.0, 403.0, 358.0, 353.0, 313.0, 269.0, 226.0, 269.0, 212.0, 199.0, 169.0, 165.0, 149.0, 139.0, 144.0, 140.0, 117.0, 115.0, 105.0, 102.0, 86.0, 99.0, 111.0, 96.0, 106.0], [1046.0, 1017.0, 905.0, 926.0, 960.0, 917.0, 985.0, 1103.0, 1099.0, 1041.0, 1197.0, 1106.0, 1162.0, 1229.0, 1280.0, 1332.0, 1332.0, 1336.0, 1392.0, 1392.0, 1415.0, 1412.0, 1414.0, 1413.0, 1420.0, 1397.0, 1324.0, 1301.0, 1330.0, 1282.0, 1291.0, 1204.0, 1159.0, 1123.0, 1060.0, 963.0, 889.0, 821.0, 757.0, 661.0, 607.0, 555.0, 491.0, 426.0, 416.0, 349.0, 281.0, 264.0, 282.0], [432.0, 391.0, 366.0, 368.0, 383.0, 406.0, 434.0, 401.0, 448.0, 475.0, 466.0, 492.0, 524.0, 525.0, 509.0, 499.0, 538.0, 566.0, 547.0, 617.0, 645.0, 652.0, 689.0, 665.0, 779.0, 831.0, 755.0, 858.0, 988.0, 982.0, 1131.0, 1114.0, 1173.0, 1283.0, 1322.0, 1413.0, 1522.0, 1640.0, 1733.0, 1778.0, 1999.0, 1951.0, 2034.0, 2081.0, 2182.0, 2281.0, 2058.0, 2099.0, 1690.0], [198.0, 162.0, 171.0, 142.0, 144.0, 132.0, 164.0, 144.0, 190.0, 188.0, 214.0, 237.0, 223.0, 254.0, 251.0, 269.0, 282.0, 281.0, 276.0, 333.0, 314.0, 356.0, 387.0, 420.0, 422.0, 386.0, 482.0, 454.0, 517.0, 476.0, 563.0, 544.0, 629.0, 645.0, 683.0, 723.0, 794.0, 830.0, 905.0, 1064.0, 1084.0, 1331.0, 1547.0, 1777.0, 2137.0, 2751.0, 3556.0, 4687.0, 6637.0], [168.0, 93.0, 88.0, 79.0, 61.0, 58.0, 57.0, 68.0, 83.0, 76.0, 77.0, 85.0, 86.0, 94.0, 100.0, 94.0, 117.0, 140.0, 127.0, 169.0, 163.0, 170.0, 189.0, 199.0, 188.0, 197.0, 215.0, 249.0, 254.0, 339.0, 323.0, 323.0, 388.0, 414.0, 403.0, 442.0, 535.0, 577.0, 661.0, 710.0, 746.0, 863.0, 956.0, 1117.0, 1324.0, 1659.0, 2146.0, 3391.0, 6501.0], [127.0, 59.0, 64.0, 39.0, 52.0, 25.0, 36.0, 27.0, 29.0, 38.0, 36.0, 40.0, 34.0, 45.0, 37.0, 44.0, 38.0, 49.0, 50.0, 62.0, 60.0, 59.0, 60.0, 54.0, 88.0, 80.0, 80.0, 114.0, 138.0, 149.0, 162.0, 160.0, 148.0, 212.0, 210.0, 242.0, 281.0, 327.0, 385.0, 367.0, 494.0, 592.0, 628.0, 817.0, 954.0, 1216.0, 1696.0, 2581.0, 4546.0], [119.0, 53.0, 36.0, 37.0, 24.0, 23.0, 15.0, 24.0, 22.0, 21.0, 13.0, 24.0, 27.0, 15.0, 16.0, 28.0, 23.0, 27.0, 25.0, 26.0, 19.0, 36.0, 27.0, 25.0, 32.0, 35.0, 55.0, 53.0, 49.0, 53.0, 63.0, 52.0, 74.0, 67.0, 77.0, 79.0, 108.0, 131.0, 156.0, 191.0, 212.0, 269.0, 332.0, 423.0, 591.0, 773.0, 1112.0, 1921.0, 3669.0], [102.0, 53.0, 31.0, 21.0, 19.0, 25.0, 16.0, 14.0, 17.0, 25.0, 12.0, 17.0, 15.0, 18.0, 13.0, 9.0, 17.0, 16.0, 13.0, 18.0, 17.0, 13.0, 16.0, 15.0, 13.0, 21.0, 30.0, 22.0, 17.0, 19.0, 30.0, 23.0, 26.0, 28.0, 41.0, 39.0, 56.0, 52.0, 53.0, 62.0, 84.0, 112.0, 133.0, 175.0, 241.0, 362.0, 531.0, 1047.0, 2644.0], [87.0, 44.0, 37.0, 22.0, 15.0, 14.0, 14.0, 14.0, 17.0, 11.0, 13.0, 18.0, 9.0, 13.0, 12.0, 11.0, 12.0, 11.0, 6.0, 11.0, 8.0, 7.0, 12.0, 13.0, 10.0, 16.0, 12.0, 13.0, 18.0, 15.0, 9.0, 23.0, 10.0, 20.0, 19.0, 25.0, 19.0, 29.0, 25.0, 34.0, 41.0, 48.0, 58.0, 66.0, 101.0, 146.0, 243.0, 452.0, 1492.0], [92.0, 36.0, 29.0, 21.0, 14.0, 16.0, 17.0, 12.0, 8.0, 11.0, 9.0, 10.0, 13.0, 7.0, 7.0, 9.0, 6.0, 11.0, 14.0, 4.0, 12.0, 9.0, 10.0, 6.0, 8.0, 12.0, 9.0, 10.0, 11.0, 9.0, 9.0, 15.0, 5.0, 12.0, 10.0, 15.0, 20.0, 13.0, 21.0, 23.0, 25.0, 27.0, 28.0, 38.0, 43.0, 65.0, 112.0, 223.0, 710.0], [80.0, 34.0, 36.0, 19.0, 15.0, 14.0, 6.0, 13.0, 4.0, 12.0, 9.0, 9.0, 4.0, 11.0, 7.0, 10.0, 12.0, 8.0, 9.0, 13.0, 8.0, 3.0, 5.0, 8.0, 12.0, 8.0, 4.0, 5.0, 8.0, 9.0, 6.0, 8.0, 16.0, 7.0, 15.0, 4.0, 11.0, 11.0, 8.0, 16.0, 22.0, 10.0, 24.0, 23.0, 27.0, 33.0, 52.0, 120.0, 318.0], [68.0, 36.0, 15.0, 20.0, 10.0, 7.0, 11.0, 15.0, 5.0, 9.0, 9.0, 7.0, 13.0, 8.0, 7.0, 8.0, 4.0, 7.0, 9.0, 4.0, 4.0, 7.0, 7.0, 6.0, 6.0, 4.0, 3.0, 7.0, 1.0, 7.0, 8.0, 12.0, 11.0, 9.0, 7.0, 8.0, 10.0, 4.0, 11.0, 9.0, 9.0, 11.0, 20.0, 17.0, 19.0, 31.0, 38.0, 62.0, 183.0], [74.0, 34.0, 17.0, 14.0, 7.0, 7.0, 8.0, 11.0, 11.0, 5.0, 7.0, 9.0, 4.0, 5.0, 6.0, 7.0, 16.0, 5.0, 7.0, 9.0, 5.0, 5.0, 6.0, 3.0, 2.0, 2.0, 5.0, 4.0, 4.0, 5.0, 6.0, 8.0, 4.0, 3.0, 3.0, 7.0, 9.0, 9.0, 4.0, 9.0, 11.0, 8.0, 11.0, 17.0, 12.0, 21.0, 22.0, 35.0, 124.0], [78.0, 29.0, 23.0, 15.0, 13.0, 8.0, 5.0, 5.0, 7.0, 3.0, 3.0, 7.0, 10.0, 6.0, 6.0, 5.0, 7.0, 4.0, 3.0, 4.0, 5.0, 5.0, 5.0, 6.0, 7.0, 6.0, 4.0, 3.0, 8.0, 3.0, 3.0, 4.0, 5.0, 4.0, 6.0, 4.0, 5.0, 6.0, 5.0, 5.0, 7.0, 8.0, 7.0, 15.0, 9.0, 18.0, 20.0, 35.0, 88.0], [70.0, 34.0, 23.0, 11.0, 7.0, 3.0, 7.0, 7.0, 6.0, 7.0, 7.0, 1.0, 7.0, 1.0, 1.0, 2.0, 4.0, 6.0, 3.0, 4.0, 6.0, 6.0, 8.0, 3.0, 7.0, 4.0, 3.0, 2.0, 3.0, 2.0, 5.0, 3.0, 5.0, 3.0, 3.0, 4.0, 7.0, 4.0, 5.0, 6.0, 10.0, 3.0, 6.0, 5.0, 7.0, 17.0, 27.0, 18.0, 66.0], [76.0, 31.0, 19.0, 8.0, 7.0, 3.0, 6.0, 9.0, 4.0, 7.0, 4.0, 1.0, 6.0, 6.0, 4.0, 3.0, 3.0, 3.0, 3.0, 6.0, 4.0, 5.0, 2.0, 2.0, 1.0, 4.0, 2.0, 3.0, 1.0, 2.0, 3.0, 4.0, 6.0, 2.0, 2.0, 3.0, 4.0, 3.0, 3.0, 7.0, 6.0, 8.0, 5.0, 7.0, 6.0, 7.0, 13.0, 22.0, 47.0], [55.0, 34.0, 15.0, 7.0, 11.0, 4.0, 4.0, 9.0, 0.0, 4.0, 4.0, 3.0, 5.0, 3.0, 6.0, 4.0, 3.0, 6.0, 3.0, 4.0, 5.0, 1.0, 3.0, 2.0, 3.0, 1.0, 4.0, 3.0, 4.0, 0.0, 3.0, 4.0, 3.0, 2.0, 2.0, 2.0, 1.0, 1.0, 2.0, 0.0, 6.0, 6.0, 4.0, 7.0, 5.0, 6.0, 7.0, 16.0, 34.0], [79.0, 27.0, 14.0, 12.0, 11.0, 6.0, 3.0, 4.0, 4.0, 4.0, 3.0, 5.0, 5.0, 4.0, 3.0, 6.0, 3.0, 2.0, 5.0, 2.0, 3.0, 3.0, 3.0, 3.0, 6.0, 4.0, 0.0, 2.0, 1.0, 1.0, 0.0, 0.0, 1.0, 1.0, 3.0, 3.0, 3.0, 3.0, 0.0, 5.0, 4.0, 2.0, 0.0, 2.0, 3.0, 5.0, 9.0, 11.0, 32.0], [72.0, 20.0, 17.0, 13.0, 4.0, 6.0, 8.0, 8.0, 4.0, 1.0, 9.0, 4.0, 4.0, 1.0, 0.0, 7.0, 3.0, 5.0, 1.0, 2.0, 3.0, 2.0, 1.0, 4.0, 1.0, 2.0, 0.0, 3.0, 1.0, 1.0, 3.0, 3.0, 3.0, 3.0, 2.0, 1.0, 1.0, 3.0, 3.0, 2.0, 1.0, 2.0, 1.0, 1.0, 3.0, 3.0, 3.0, 7.0, 15.0], [76.0, 31.0, 12.0, 12.0, 9.0, 4.0, 5.0, 6.0, 6.0, 3.0, 2.0, 2.0, 1.0, 6.0, 2.0, 7.0, 2.0, 2.0, 2.0, 1.0, 3.0, 3.0, 4.0, 3.0, 4.0, 3.0, 1.0, 1.0, 4.0, 2.0, 1.0, 0.0, 1.0, 2.0, 1.0, 0.0, 2.0, 3.0, 1.0, 1.0, 2.0, 3.0, 2.0, 6.0, 1.0, 3.0, 1.0, 6.0, 13.0], [56.0, 26.0, 20.0, 9.0, 11.0, 7.0, 1.0, 4.0, 3.0, 3.0, 5.0, 5.0, 3.0, 0.0, 3.0, 3.0, 4.0, 2.0, 6.0, 5.0, 3.0, 2.0, 1.0, 2.0, 5.0, 0.0, 1.0, 1.0, 3.0, 2.0, 1.0, 1.0, 1.0, 2.0, 3.0, 2.0, 1.0, 0.0, 0.0, 2.0, 0.0, 1.0, 3.0, 1.0, 1.0, 3.0, 1.0, 4.0, 7.0], [60.0, 33.0, 19.0, 4.0, 4.0, 5.0, 5.0, 6.0, 4.0, 8.0, 3.0, 1.0, 7.0, 3.0, 2.0, 4.0, 3.0, 3.0, 2.0, 4.0, 0.0, 4.0, 1.0, 3.0, 2.0, 1.0, 0.0, 2.0, 1.0, 0.0, 0.0, 3.0, 3.0, 1.0, 1.0, 1.0, 0.0, 3.0, 2.0, 1.0, 1.0, 2.0, 1.0, 2.0, 1.0, 3.0, 2.0, 1.0, 8.0], [62.0, 25.0, 18.0, 7.0, 4.0, 5.0, 4.0, 4.0, 4.0, 7.0, 1.0, 4.0, 4.0, 3.0, 2.0, 4.0, 3.0, 6.0, 1.0, 1.0, 2.0, 0.0, 1.0, 1.0, 4.0, 0.0, 6.0, 3.0, 0.0, 1.0, 1.0, 0.0, 0.0, 3.0, 0.0, 4.0, 2.0, 2.0, 2.0, 1.0, 0.0, 1.0, 0.0, 0.0, 2.0, 2.0, 3.0, 2.0, 6.0], [59.0, 20.0, 12.0, 15.0, 5.0, 2.0, 7.0, 6.0, 5.0, 0.0, 5.0, 4.0, 3.0, 5.0, 6.0, 5.0, 2.0, 3.0, 2.0, 1.0, 2.0, 1.0, 0.0, 2.0, 2.0, 2.0, 2.0, 2.0, 1.0, 0.0, 2.0, 1.0, 1.0, 1.0, 0.0, 3.0, 2.0, 1.0, 0.0, 2.0, 2.0, 0.0, 1.0, 0.0, 0.0, 2.0, 2.0, 3.0, 5.0], [67.0, 30.0, 15.0, 8.0, 7.0, 11.0, 1.0, 4.0, 4.0, 3.0, 4.0, 4.0, 7.0, 3.0, 2.0, 2.0, 4.0, 1.0, 1.0, 3.0, 3.0, 2.0, 3.0, 1.0, 0.0, 2.0, 2.0, 2.0, 2.0, 3.0, 1.0, 1.0, 0.0, 0.0, 1.0, 2.0, 0.0, 1.0, 1.0, 0.0, 2.0, 0.0, 2.0, 1.0, 1.0, 0.0, 2.0, 1.0, 3.0], [61.0, 29.0, 13.0, 9.0, 10.0, 6.0, 4.0, 2.0, 3.0, 3.0, 4.0, 1.0, 2.0, 4.0, 5.0, 2.0, 3.0, 2.0, 3.0, 3.0, 1.0, 2.0, 2.0, 4.0, 1.0, 2.0, 3.0, 1.0, 0.0, 1.0, 0.0, 0.0, 0.0, 2.0, 2.0, 1.0, 2.0, 2.0, 1.0, 1.0, 1.0, 1.0, 2.0, 0.0, 0.0, 1.0, 1.0, 2.0, 1.0], [54.0, 33.0, 16.0, 13.0, 7.0, 7.0, 1.0, 3.0, 5.0, 4.0, 6.0, 3.0, 4.0, 2.0, 3.0, 3.0, 3.0, 1.0, 0.0, 2.0, 2.0, 1.0, 1.0, 2.0, 2.0, 2.0, 2.0, 2.0, 2.0, 1.0, 3.0, 1.0, 0.0, 5.0, 1.0, 0.0, 2.0, 1.0, 0.0, 2.0, 0.0, 0.0, 0.0, 2.0, 0.0, 2.0, 2.0, 5.0, 1.0], [65.0, 31.0, 19.0, 10.0, 8.0, 2.0, 4.0, 4.0, 1.0, 4.0, 4.0, 0.0, 4.0, 4.0, 3.0, 3.0, 1.0, 2.0, 3.0, 1.0, 3.0, 1.0, 2.0, 8.0, 1.0, 2.0, 2.0, 0.0, 0.0, 0.0, 2.0, 2.0, 1.0, 5.0, 1.0, 2.0, 1.0, 1.0, 1.0, 1.0, 0.0, 0.0, 1.0, 1.0, 1.0, 1.0, 0.0, 2.0, 0.0], [63.0, 23.0, 12.0, 15.0, 8.0, 5.0, 5.0, 5.0, 2.0, 4.0, 4.0, 3.0, 4.0, 2.0, 4.0, 2.0, 1.0, 1.0, 1.0, 6.0, 4.0, 5.0, 2.0, 0.0, 0.0, 1.0, 1.0, 2.0, 1.0, 2.0, 2.0, 3.0, 0.0, 1.0, 2.0, 1.0, 1.0, 1.0, 1.0, 1.0, 1.0, 1.0, 0.0, 1.0, 1.0, 0.0, 1.0, 0.0, 1.0], [79.0, 23.0, 23.0, 10.0, 5.0, 3.0, 2.0, 5.0, 3.0, 4.0, 5.0, 1.0, 6.0, 0.0, 2.0, 2.0, 1.0, 4.0, 1.0, 6.0, 3.0, 2.0, 4.0, 1.0, 2.0, 0.0, 2.0, 2.0, 2.0, 2.0, 1.0, 3.0, 0.0, 0.0, 0.0, 0.0, 3.0, 0.0, 0.0, 0.0, 0.0, 0.0, 2.0, 1.0, 0.0, 3.0, 1.0, 3.0, 4.0], [68.0, 34.0, 12.0, 9.0, 5.0, 4.0, 4.0, 3.0, 3.0, 9.0, 4.0, 3.0, 3.0, 4.0, 4.0, 3.0, 4.0, 1.0, 0.0, 0.0, 3.0, 0.0, 1.0, 2.0, 1.0, 3.0, 4.0, 1.0, 1.0, 1.0, 3.0, 1.0, 0.0, 1.0, 1.0, 2.0, 1.0, 3.0, 1.0, 1.0, 0.0, 0.0, 0.0, 0.0, 0.0, 4.0, 2.0, 0.0, 2.0], [61.0, 35.0, 17.0, 5.0, 7.0, 3.0, 3.0, 4.0, 2.0, 2.0, 7.0, 2.0, 2.0, 4.0, 4.0, 3.0, 2.0, 1.0, 0.0, 4.0, 4.0, 1.0, 1.0, 4.0, 0.0, 3.0, 2.0, 7.0, 1.0, 0.0, 0.0, 1.0, 0.0, 1.0, 0.0, 2.0, 0.0, 3.0, 0.0, 0.0, 3.0, 1.0, 0.0, 1.0, 2.0, 1.0, 0.0, 1.0, 2.0], [75.0, 25.0, 14.0, 9.0, 5.0, 3.0, 6.0, 3.0, 2.0, 4.0, 0.0, 5.0, 1.0, 4.0, 4.0, 2.0, 2.0, 1.0, 0.0, 3.0, 1.0, 3.0, 1.0, 4.0, 3.0, 1.0, 2.0, 1.0, 6.0, 3.0, 2.0, 2.0, 0.0, 1.0, 1.0, 2.0, 0.0, 0.0, 0.0, 1.0, 1.0, 4.0, 0.0, 1.0, 0.0, 0.0, 0.0, 3.0, 3.0], [61.0, 27.0, 18.0, 7.0, 6.0, 1.0, 3.0, 3.0, 6.0, 3.0, 2.0, 5.0, 2.0, 3.0, 3.0, 4.0, 6.0, 1.0, 2.0, 3.0, 2.0, 1.0, 5.0, 3.0, 2.0, 0.0, 1.0, 3.0, 0.0, 1.0, 2.0, 2.0, 0.0, 1.0, 2.0, 1.0, 1.0, 0.0, 0.0, 2.0, 0.0, 2.0, 0.0, 0.0, 0.0, 1.0, 1.0, 0.0, 1.0], [57.0, 25.0, 14.0, 12.0, 7.0, 6.0, 8.0, 2.0, 1.0, 3.0, 3.0, 4.0, 4.0, 4.0, 3.0, 0.0, 6.0, 0.0, 2.0, 2.0, 2.0, 3.0, 3.0, 3.0, 1.0, 1.0, 1.0, 5.0, 1.0, 2.0, 3.0, 3.0, 1.0, 3.0, 1.0, 2.0, 1.0, 0.0, 0.0, 0.0, 0.0, 1.0, 0.0, 1.0, 0.0, 0.0, 0.0, 0.0, 1.0], [61.0, 31.0, 16.0, 14.0, 8.0, 4.0, 3.0, 2.0, 5.0, 9.0, 3.0, 0.0, 3.0, 1.0, 2.0, 0.0, 2.0, 2.0, 2.0, 3.0, 5.0, 2.0, 1.0, 2.0, 5.0, 0.0, 2.0, 2.0, 0.0, 0.0, 2.0, 0.0, 1.0, 3.0, 1.0, 3.0, 0.0, 3.0, 1.0, 1.0, 1.0, 0.0, 1.0, 1.0, 2.0, 0.0, 0.0, 0.0, 2.0], [64.0, 26.0, 24.0, 5.0, 5.0, 5.0, 6.0, 5.0, 4.0, 3.0, 1.0, 3.0, 4.0, 6.0, 5.0, 2.0, 2.0, 3.0, 1.0, 2.0, 2.0, 3.0, 0.0, 0.0, 4.0, 2.0, 1.0, 2.0, 0.0, 0.0, 3.0, 3.0, 1.0, 1.0, 5.0, 1.0, 0.0, 0.0, 0.0, 0.0, 0.0, 1.0, 1.0, 0.0, 0.0, 1.0, 1.0, 0.0, 1.0], [62.0, 31.0, 12.0, 6.0, 11.0, 4.0, 5.0, 0.0, 3.0, 5.0, 1.0, 3.0, 1.0, 5.0, 4.0, 4.0, 6.0, 2.0, 5.0, 1.0, 2.0, 1.0, 3.0, 0.0, 2.0, 1.0, 4.0, 1.0, 1.0, 0.0, 0.0, 2.0, 3.0, 2.0, 1.0, 1.0, 5.0, 1.0, 0.0, 1.0, 1.0, 3.0, 1.0, 0.0, 0.0, 0.0, 0.0, 1.0, 2.0], [80.0, 22.0, 11.0, 5.0, 10.0, 3.0, 6.0, 1.0, 3.0, 0.0, 5.0, 5.0, 3.0, 2.0, 5.0, 3.0, 3.0, 4.0, 2.0, 2.0, 2.0, 1.0, 1.0, 0.0, 2.0, 3.0, 3.0, 2.0, 0.0, 2.0, 2.0, 2.0, 1.0, 2.0, 2.0, 1.0, 2.0, 1.0, 1.0, 0.0, 1.0, 1.0, 1.0, 1.0, 0.0, 0.0, 0.0, 2.0, 1.0], [63.0, 25.0, 20.0, 13.0, 5.0, 1.0, 2.0, 7.0, 5.0, 1.0, 2.0, 5.0, 4.0, 3.0, 3.0, 3.0, 3.0, 1.0, 1.0, 5.0, 1.0, 0.0, 1.0, 2.0, 2.0, 3.0, 4.0, 3.0, 0.0, 2.0, 1.0, 0.0, 3.0, 0.0, 4.0, 1.0, 2.0, 0.0, 1.0, 0.0, 1.0, 2.0, 0.0, 1.0, 2.0, 0.0, 0.0, 1.0, 1.0], [81.0, 31.0, 13.0, 12.0, 6.0, 2.0, 3.0, 2.0, 3.0, 4.0, 2.0, 1.0, 4.0, 4.0, 4.0, 0.0, 4.0, 3.0, 2.0, 2.0, 1.0, 1.0, 4.0, 0.0, 1.0, 2.0, 4.0, 0.0, 4.0, 3.0, 0.0, 2.0, 0.0, 1.0, 2.0, 1.0, 3.0, 4.0, 0.0, 0.0, 0.0, 0.0, 2.0, 0.0, 2.0, 1.0, 0.0, 0.0, 3.0], [62.0, 23.0, 15.0, 8.0, 6.0, 8.0, 4.0, 5.0, 0.0, 1.0, 6.0, 4.0, 4.0, 2.0, 3.0, 3.0, 2.0, 3.0, 1.0, 2.0, 2.0, 6.0, 3.0, 2.0, 1.0, 1.0, 1.0, 1.0, 1.0, 3.0, 0.0, 0.0, 0.0, 2.0, 2.0, 2.0, 0.0, 0.0, 0.0, 0.0, 2.0, 2.0, 1.0, 1.0, 0.0, 1.0, 0.0, 1.0, 3.0], [70.0, 28.0, 13.0, 9.0, 8.0, 3.0, 3.0, 4.0, 4.0, 4.0, 7.0, 3.0, 1.0, 2.0, 2.0, 0.0, 5.0, 2.0, 2.0, 1.0, 2.0, 1.0, 3.0, 4.0, 1.0, 1.0, 2.0, 2.0, 0.0, 2.0, 1.0, 2.0, 5.0, 0.0, 0.0, 0.0, 1.0, 3.0, 0.0, 1.0, 1.0, 1.0, 1.0, 1.0, 1.0, 0.0, 2.0, 1.0, 0.0], [78.0, 23.0, 12.0, 16.0, 6.0, 5.0, 7.0, 3.0, 1.0, 1.0, 2.0, 4.0, 2.0, 3.0, 5.0, 4.0, 2.0, 4.0, 1.0, 1.0, 4.0, 4.0, 1.0, 4.0, 0.0, 1.0, 0.0, 3.0, 2.0, 3.0, 1.0, 0.0, 0.0, 1.0, 3.0, 1.0, 1.0, 1.0, 1.0, 2.0, 2.0, 1.0, 0.0, 1.0, 0.0, 1.0, 0.0, 2.0, 2.0]],
    "Name": "sCurve-0",
    "Overflow": 2031266.0,
    "Type": "Histo2d",
    "Underflow": 0.0,
    "x": {
        "AxisTitle": "Vcal",
        "Bins": 51,
        "High": 302.5,
        "Low": 47.5
    },
    "y": {
        "AxisTitle": "Occupancy",
        "Bins": 49,
        "High": 49.5,
        "Low": 0.5
    },
    "z": {
        "AxisTitle": "Number of pixels"
    }
}