time,Hardware,Voltage,Current
1621989906261,high-voltage,1,0.0626875
time,Hardware,Voltage,Current
1621989906261,high-voltage,2,0.125267
time,Hardware,Voltage,Current
1621989906261,high-voltage,3,0.223538
time,Hardware,Voltage,Current
1621989906261,high-voltage,4,0.349168
time,Hardware,Voltage,Current
1621989906261,high-voltage,5,0.524764
time,Hardware,Voltage,Current
1621989906261,high-voltage,6,0.754804
time,Hardware,Voltage,Current
1621989906261,high-voltage,7,1.02068
time,Hardware,Voltage,Current
1621989906261,high-voltage,8,1.45613
time,Hardware,Voltage,Current
1621989906261,high-voltage,9,1.85977
time,Hardware,Voltage,Current
1621989906261,high-voltage,10,2.40316
time,Hardware,Voltage,Current
1621989906261,high-voltage,11,3.06146
time,Hardware,Voltage,Current
1621989906261,high-voltage,12,3.84917
time,Hardware,Voltage,Current
1621989906261,high-voltage,13,4.87369
time,Hardware,Voltage,Current
1621989906261,high-voltage,14,5.97231
time,Hardware,Voltage,Current
1621989906261,high-voltage,15,7.33227
time,Hardware,Voltage,Current
1621989906261,high-voltage,16,8.51281
time,Hardware,Voltage,Current
1621989906261,high-voltage,17,9.72978
time,Hardware,Voltage,Current
1621989906261,high-voltage,18,10.0001
