{
    "Data": [9.0, 31.0, 0.0, 0.0, 1.0, 33.0, 148.0, 458.0, 1144.0, 2202.0, 3451.0, 4552.0, 4932.0, 4235.0, 3419.0, 3098.0, 3596.0, 4266.0, 4669.0, 4169.0, 3142.0, 2134.0, 1152.0, 710.0, 528.0, 530.0, 694.0, 889.0, 1261.0, 1529.0, 1797.0, 2012.0, 2130.0, 2183.0, 2084.0, 1853.0, 1594.0, 1417.0, 1150.0, 903.0, 696.0, 461.0, 367.0, 266.0, 183.0, 128.0, 90.0, 57.0, 45.0, 31.0, 27.0, 24.0, 11.0, 11.0, 11.0, 12.0, 5.0, 4.0, 8.0, 7.0, 2.0, 3.0, 4.0, 7.0, 1.0, 2.0, 0.0],
    "Name": "NoiseDist-0",
    "Overflow": 16.0,
    "Type": "Histo1d",
    "Underflow": 0.0,
    "x": {
        "AxisTitle": "Noise [e]",
        "Bins": 67,
        "High": 336.0,
        "Low": -2.0
    },
    "y": {
        "AxisTitle": "Number of Pixels"
    },
    "z": {
        "AxisTitle": "z"
    }
}