time,Hardware,Voltage,Current
1621381532315,high-voltage-2,1,0.258644
time,Hardware,Voltage,Current
1621381532315,high-voltage-2,2,0.307765
time,Hardware,Voltage,Current
1621381532315,high-voltage-2,3,0.338686
time,Hardware,Voltage,Current
1621381532315,high-voltage-2,4,0.364782
time,Hardware,Voltage,Current
1621381532315,high-voltage-2,5,0.395296
time,Hardware,Voltage,Current
1621381532315,high-voltage-2,6,0.428509
time,Hardware,Voltage,Current
1621381532315,high-voltage-2,7,0.463969
time,Hardware,Voltage,Current
1621381532315,high-voltage-2,8,0.497304
time,Hardware,Voltage,Current
1621381532315,high-voltage-2,9,0.537534
time,Hardware,Voltage,Current
1621381532315,high-voltage-2,10,0.576524
time,Hardware,Voltage,Current
1621381532315,high-voltage-2,11,0.613445
time,Hardware,Voltage,Current
1621381532315,high-voltage-2,12,0.650136
time,Hardware,Voltage,Current
1621381532315,high-voltage-2,13,0.685039
time,Hardware,Voltage,Current
1621381532315,high-voltage-2,14,0.720464
time,Hardware,Voltage,Current
1621381532315,high-voltage-2,15,0.749951
time,Hardware,Voltage,Current
1621381532315,high-voltage-2,16,0.779406
time,Hardware,Voltage,Current
1621381532315,high-voltage-2,17,0.802567
time,Hardware,Voltage,Current
1621381532315,high-voltage-2,18,0.827148
time,Hardware,Voltage,Current
1621381532315,high-voltage-2,19,0.849899
time,Hardware,Voltage,Current
1621381532315,high-voltage-2,20,0.871989
time,Hardware,Voltage,Current
1621381532315,high-voltage-2,25,0.962109
time,Hardware,Voltage,Current
1621381532315,high-voltage-2,30,1.04975
time,Hardware,Voltage,Current
1621381532315,high-voltage-2,35,1.1382
time,Hardware,Voltage,Current
1621381532315,high-voltage-2,40,1.23864
time,Hardware,Voltage,Current
1621381532315,high-voltage-2,45,1.36401
time,Hardware,Voltage,Current
1621381532315,high-voltage-2,50,1.45064
time,Hardware,Voltage,Current
1621381532315,high-voltage-2,55,1.52928
time,Hardware,Voltage,Current
1621381532315,high-voltage-2,60,1.60339
time,Hardware,Voltage,Current
1621381532315,high-voltage-2,65,1.678
time,Hardware,Voltage,Current
1621381532315,high-voltage-2,70,1.74683
time,Hardware,Voltage,Current
1621381532315,high-voltage-2,75,1.81699
time,Hardware,Voltage,Current
1621381532315,high-voltage-2,80,1.88168
time,Hardware,Voltage,Current
1621381532315,high-voltage-2,85,1.94463
time,Hardware,Voltage,Current
1621381532315,high-voltage-2,90,2.00676
time,Hardware,Voltage,Current
1621381532315,high-voltage-2,95,2.0681
time,Hardware,Voltage,Current
1621381532315,high-voltage-2,100,2.12779
