{
    "Data": [193.0, 10305.0, 19554.0, 13513.0, 5805.0, 1817.0, 413.0, 122.0, 44.0, 25.0, 26.0, 19.0, 27.0, 20.0, 32.0, 18.0, 13.0, 10.0, 9.0, 11.0, 6.0, 4.0, 4.0, 4.0, 3.0, 1.0, 0.0, 4.0, 1.0, 1.0, 2.0, 0.0, 0.0, 0.0, 0.0, 0.0, 0.0, 0.0, 0.0, 0.0, 0.0, 0.0, 0.0, 0.0, 1.0, 0.0, 1.0, 0.0, 0.0, 0.0, 0.0],
    "Name": "Chi2Dist-0",
    "Overflow": 0.0,
    "Type": "Histo1d",
    "Underflow": 0.0,
    "x": {
        "AxisTitle": "Fit Chi/ndf",
        "Bins": 51,
        "High": 2.5250000953674318,
        "Low": -0.02500000037252903
    },
    "y": {
        "AxisTitle": "Number of Pixels"
    },
    "z": {
        "AxisTitle": "z"
    }
}