{
    "Data": [2955.0, 20353.0, 16263.0, 8268.0, 3096.0, 1515.0, 1762.0, 2503.0, 3255.0, 3538.0, 3539.0, 2938.0, 2187.0, 1615.0, 1002.0, 626.0, 423.0, 244.0, 109.0, 64.0, 49.0, 23.0, 22.0, 7.0, 18.0, 1.0, 3.0, 3.0, 3.0, 3.0, 2.0, 3.0, 1.0, 0.0, 2.0, 3.0, 1.0, 0.0, 0.0, 1.0, 2.0, 3.0, 0.0, 0.0, 0.0, 0.0, 1.0, 1.0, 2.0, 0.0, 0.0],
    "Name": "Chi2Dist-0",
    "Overflow": 0.0,
    "Type": "Histo1d",
    "Underflow": 0.0,
    "x": {
        "AxisTitle": "Fit Chi/ndf",
        "Bins": 51,
        "High": 2.5250000953674318,
        "Low": -0.02500000037252903
    },
    "y": {
        "AxisTitle": "Number of Pixels"
    },
    "z": {
        "AxisTitle": "z"
    }
}