{
    "Data": [0.0, 0.0, 0.0, 0.0, 0.0, 0.0, 0.0, 0.0, 0.0, 0.0, 0.0, 0.0, 0.0, 0.0, 0.0, 0.0, 0.0, 0.0, 0.0, 0.0, 0.0, 0.0, 0.0, 0.0, 0.0, 0.0, 0.0, 0.0, 0.0, 0.0, 0.0, 0.0, 0.0, 0.0, 0.0, 0.0, 0.0, 0.0, 0.0, 0.0, 0.0, 0.0, 0.0, 0.0, 0.0, 0.0, 0.0, 0.0, 0.0, 0.0, 23.0, 40.0, 42.0, 69.0, 61.0, 80.0, 114.0, 126.0, 141.0, 159.0, 180.0, 190.0, 240.0, 268.0, 280.0, 299.0, 302.0, 378.0, 426.0, 482.0, 508.0, 533.0, 566.0, 634.0, 661.0, 744.0, 757.0, 832.0, 750.0, 837.0, 898.0, 967.0, 1069.0, 1234.0, 1462.0, 1677.0, 2095.0, 2424.0, 2629.0, 2947.0, 2876.0, 2969.0, 2791.0, 2498.0, 2230.0, 1791.0, 1543.0, 1215.0, 965.0, 738.0, 680.0, 455.0, 426.0, 367.0, 304.0, 232.0, 186.0, 186.0, 153.0, 122.0, 116.0, 89.0, 77.0, 65.0, 60.0, 45.0, 43.0, 44.0, 32.0, 24.0, 24.0, 24.0, 19.0, 21.0, 21.0, 19.0, 13.0, 11.0, 18.0, 20.0, 15.0, 20.0, 11.0, 11.0, 8.0, 12.0, 9.0, 7.0, 8.0, 6.0, 4.0, 7.0, 5.0, 5.0, 6.0, 6.0, 2.0, 6.0, 1.0, 3.0, 2.0, 2.0, 3.0, 6.0, 5.0, 3.0, 8.0, 7.0, 7.0, 10.0, 14.0, 14.0, 12.0, 22.0, 17.0, 27.0, 37.0, 39.0, 47.0, 63.0, 60.0, 75.0, 101.0, 111.0, 132.0, 145.0, 202.0, 215.0, 193.0, 242.0, 278.0, 275.0, 338.0, 335.0, 454.0, 440.0, 466.0, 488.0, 554.0, 569.0, 626.0, 662.0, 767.0, 736.0, 789.0, 756.0, 782.0, 801.0, 805.0, 859.0, 825.0, 792.0, 804.0, 784.0, 708.0, 690.0, 629.0, 606.0, 589.0, 506.0, 498.0, 452.0, 405.0, 352.0, 316.0, 277.0, 240.0, 222.0, 184.0, 168.0, 140.0, 125.0, 116.0, 106.0, 70.0, 59.0, 47.0, 39.0, 32.0, 37.0, 23.0, 20.0, 15.0, 12.0, 4.0, 2.0, 6.0, 4.0, 3.0, 0.0, 4.0, 1.0, 0.0, 1.0, 0.0, 1.0, 0.0, 0.0, 0.0, 0.0, 0.0, 0.0, 0.0, 0.0, 0.0, 0.0, 0.0, 0.0, 0.0, 1.0, 0.0, 0.0, 0.0, 0.0, 0.0, 0.0, 0.0, 0.0, 0.0, 0.0, 0.0, 0.0, 0.0, 0.0, 0.0, 0.0, 0.0, 0.0, 0.0, 0.0, 0.0, 0.0, 0.0, 0.0, 0.0, 0.0, 0.0, 0.0, 0.0, 0.0, 0.0, 0.0, 0.0, 0.0, 0.0, 0.0, 0.0, 0.0, 0.0, 0.0, 0.0, 0.0, 0.0, 0.0, 0.0, 0.0, 0.0, 0.0, 0.0, 0.0, 0.0, 0.0, 0.0, 0.0, 0.0, 0.0, 0.0, 0.0, 0.0, 0.0, 0.0, 1.0, 0.0, 0.0, 0.0, 0.0, 0.0, 0.0, 0.0, 0.0, 0.0, 0.0, 0.0, 0.0, 0.0, 0.0, 0.0, 0.0, 0.0, 0.0, 0.0, 0.0, 0.0, 0.0, 0.0, 0.0, 0.0, 0.0, 0.0, 0.0, 0.0, 0.0, 0.0, 0.0, 0.0, 0.0, 0.0, 0.0, 0.0, 0.0, 0.0, 0.0, 0.0, 0.0, 0.0, 0.0, 0.0, 0.0, 0.0, 0.0, 0.0, 0.0, 0.0, 0.0, 0.0, 0.0, 0.0, 0.0, 0.0, 0.0, 0.0, 0.0, 0.0],
    "Name": "ThresholdDist-0",
    "Overflow": 0.0,
    "Type": "Histo1d",
    "Underflow": 0.0,
    "x": {
        "AxisTitle": "Threshold [e]",
        "Bins": 383,
        "High": 3825.0,
        "Low": -5.0
    },
    "y": {
        "AxisTitle": "Number of Pixels"
    },
    "z": {
        "AxisTitle": "z"
    }
}