{
    "Data": [0.0, 0.0, 0.0, 0.0, 0.0, 0.0, 0.0, 0.0, 0.0, 0.0, 0.0, 0.0, 0.0, 14.0, 9.0, 1.0, 4.0, 263.0, 519.0, 143.0, 97.0, 984.0, 2166.0, 1260.0, 536.0, 1671.0, 2297.0, 1444.0, 876.0, 1349.0, 1628.0, 1336.0, 858.0, 823.0, 694.0, 592.0, 550.0, 677.0, 847.0, 862.0, 561.0, 792.0, 1482.0, 2598.0, 2091.0, 1402.0, 2141.0, 3156.0, 3624.0, 3167.0, 2553.0, 2226.0, 2542.0, 2204.0, 1929.0, 1737.0, 1863.0, 1850.0, 1865.0, 1560.0, 1289.0, 1259.0, 892.0, 837.0, 682.0, 661.0, 691.0, 529.0, 462.0, 430.0, 463.0, 390.0, 348.0, 294.0, 238.0, 251.0, 237.0, 224.0, 184.0, 174.0, 131.0, 128.0, 112.0, 88.0, 103.0, 95.0, 83.0, 77.0, 83.0, 58.0, 54.0, 54.0, 45.0, 52.0, 45.0, 30.0, 37.0, 42.0, 23.0, 38.0, 27.0, 26.0, 20.0, 22.0, 19.0, 19.0, 20.0, 9.0, 20.0, 7.0, 18.0, 15.0, 10.0, 13.0, 9.0, 3.0, 11.0, 6.0, 7.0, 7.0, 3.0, 10.0, 2.0, 5.0, 2.0, 8.0, 6.0, 4.0, 7.0, 7.0, 2.0, 4.0, 5.0, 5.0, 3.0, 4.0, 3.0, 5.0, 2.0, 2.0, 2.0, 1.0, 1.0, 0.0, 2.0, 1.0, 1.0, 5.0, 2.0, 3.0, 3.0, 1.0, 2.0, 1.0, 4.0, 2.0, 0.0, 2.0, 0.0, 0.0, 3.0, 1.0, 1.0, 1.0, 0.0, 2.0, 0.0, 0.0, 2.0, 0.0, 0.0, 1.0, 0.0, 0.0, 0.0, 1.0, 1.0, 1.0, 0.0, 0.0, 2.0, 0.0, 0.0, 1.0, 0.0, 0.0, 0.0, 0.0, 0.0, 1.0, 0.0, 0.0, 1.0, 0.0, 0.0, 1.0, 0.0, 0.0, 0.0, 1.0, 0.0],
    "Name": "TimePerFitDist-0",
    "Overflow": 116.0,
    "Type": "Histo1d",
    "Underflow": 0.0,
    "x": {
        "AxisTitle": "Fit Time [us]",
        "Bins": 201,
        "High": 401.0,
        "Low": -1.0
    },
    "y": {
        "AxisTitle": "Number of Pixels"
    },
    "z": {
        "AxisTitle": "z"
    }
}