{
    "Data": [0.0, 0.0, 0.0, 0.0, 0.0, 0.0, 0.0, 0.0, 0.0, 0.0, 0.0, 0.0, 0.0, 0.0, 0.0, 0.0, 0.0, 0.0, 0.0, 0.0, 0.0, 0.0, 0.0, 0.0, 0.0, 0.0, 0.0, 0.0, 0.0, 0.0, 0.0, 0.0, 0.0, 0.0, 0.0, 0.0, 0.0, 0.0, 0.0, 0.0, 0.0, 0.0, 0.0, 0.0, 0.0, 0.0, 0.0, 0.0, 0.0, 0.0, 2.0, 12.0, 16.0, 8.0, 9.0, 14.0, 12.0, 6.0, 16.0, 9.0, 20.0, 19.0, 20.0, 43.0, 38.0, 42.0, 66.0, 70.0, 106.0, 118.0, 156.0, 203.0, 195.0, 246.0, 342.0, 418.0, 461.0, 576.0, 705.0, 748.0, 871.0, 963.0, 1001.0, 1129.0, 1183.0, 1209.0, 1221.0, 1360.0, 1450.0, 1620.0, 1964.0, 2332.0, 2912.0, 3537.0, 4036.0, 4193.0, 3870.0, 3392.0, 2632.0, 1882.0, 1301.0, 799.0, 552.0, 395.0, 262.0, 164.0, 149.0, 115.0, 66.0, 64.0, 75.0, 55.0, 43.0, 53.0, 30.0, 31.0, 35.0, 23.0, 24.0, 34.0, 23.0, 27.0, 19.0, 10.0, 17.0, 13.0, 18.0, 12.0, 20.0, 12.0, 4.0, 11.0, 8.0, 10.0, 12.0, 12.0, 14.0, 7.0, 9.0, 10.0, 6.0, 6.0, 5.0, 13.0, 9.0, 4.0, 10.0, 7.0, 6.0, 7.0, 13.0, 18.0, 19.0, 16.0, 20.0, 35.0, 36.0, 57.0, 48.0, 72.0, 113.0, 94.0, 134.0, 122.0, 178.0, 211.0, 271.0, 303.0, 303.0, 382.0, 435.0, 516.0, 501.0, 574.0, 622.0, 655.0, 714.0, 741.0, 788.0, 812.0, 837.0, 785.0, 805.0, 777.0, 805.0, 777.0, 753.0, 716.0, 725.0, 657.0, 597.0, 623.0, 547.0, 469.0, 435.0, 414.0, 368.0, 327.0, 273.0, 250.0, 210.0, 210.0, 182.0, 168.0, 129.0, 102.0, 79.0, 73.0, 71.0, 56.0, 45.0, 32.0, 30.0, 35.0, 21.0, 23.0, 21.0, 22.0, 12.0, 7.0, 14.0, 13.0, 4.0, 6.0, 6.0, 1.0, 5.0, 0.0, 1.0, 4.0, 2.0, 5.0, 1.0, 2.0, 1.0, 0.0, 5.0, 2.0, 0.0, 2.0, 0.0, 0.0, 0.0, 1.0, 1.0, 0.0, 1.0, 0.0, 2.0, 0.0, 0.0, 1.0, 0.0, 0.0, 1.0, 0.0, 1.0, 1.0, 2.0, 3.0, 3.0, 1.0, 2.0, 2.0, 0.0, 0.0, 1.0, 1.0, 3.0, 0.0, 0.0, 0.0, 2.0, 1.0, 0.0, 1.0, 1.0, 0.0, 0.0, 1.0, 1.0, 0.0, 2.0, 0.0, 1.0, 0.0, 1.0, 0.0, 0.0, 0.0, 0.0, 1.0, 0.0, 1.0, 0.0, 1.0, 0.0, 4.0, 0.0, 1.0, 0.0, 0.0, 0.0, 1.0, 0.0, 1.0, 0.0, 0.0, 1.0, 0.0, 2.0, 0.0, 0.0, 0.0, 0.0, 0.0, 0.0, 0.0, 0.0, 0.0, 0.0, 0.0, 0.0, 0.0, 0.0, 0.0, 0.0, 0.0, 0.0, 0.0, 0.0, 0.0, 0.0, 0.0, 0.0],
    "Name": "ThresholdDist-0",
    "Overflow": 0.0,
    "Type": "Histo1d",
    "Underflow": 0.0,
    "x": {
        "AxisTitle": "Threshold [e]",
        "Bins": 335,
        "High": 3345.0,
        "Low": -5.0
    },
    "y": {
        "AxisTitle": "Number of Pixels"
    },
    "z": {
        "AxisTitle": "z"
    }
}