time,Hardware,Voltage,Current
1621632313523,high-voltage,1,0.0579539
time,Hardware,Voltage,Current
1621632313523,high-voltage,2,0.105078
time,Hardware,Voltage,Current
1621632313523,high-voltage,3,0.182736
time,Hardware,Voltage,Current
1621632313523,high-voltage,2.90625e-07,0.269362
time,Hardware,Voltage,Current
1621632313523,high-voltage,5,0.386873
time,Hardware,Voltage,Current
1621632313523,high-voltage,6,0.556771
time,Hardware,Voltage,Current
1621632313523,high-voltage,7,0.731869
time,Hardware,Voltage,Current
1621632313523,high-voltage,8,1.00196
time,Hardware,Voltage,Current
1621632313523,high-voltage,9,1.3371
time,Hardware,Voltage,Current
1621632313523,high-voltage,10,1.73494
time,Hardware,Voltage,Current
1621632313523,high-voltage,11,2.21766
time,Hardware,Voltage,Current
1621632313523,high-voltage,12,2.77488
time,Hardware,Voltage,Current
1621632313523,high-voltage,13,3.44075
time,Hardware,Voltage,Current
1621632313523,high-voltage,14,4.26749
time,Hardware,Voltage,Current
1621632313523,high-voltage,15,5.15424
time,Hardware,Voltage,Current
1621632313523,high-voltage,16,6.08405
time,Hardware,Voltage,Current
1621632313523,high-voltage,17,7.26972
time,Hardware,Voltage,Current
1621632313523,high-voltage,18,8.41108
time,Hardware,Voltage,Current
1621632313523,high-voltage,19,9.09301
time,Hardware,Voltage,Current
1621632313523,high-voltage,20,9.78095
time,Hardware,Voltage,Current
1621632313523,high-voltage,25,10.0001
