time,Hardware,Voltage,Current
1621609855513,high-voltage,1,0.134214
time,Hardware,Voltage,Current
1621609855513,high-voltage,2,0.227906
time,Hardware,Voltage,Current
1621609855513,high-voltage,3,0.356312
time,Hardware,Voltage,Current
1621609855513,high-voltage,4,0.525326
time,Hardware,Voltage,Current
1621609855513,high-voltage,5,0.720357
time,Hardware,Voltage,Current
1621609855513,high-voltage,6,1.0449
time,Hardware,Voltage,Current
1621609855513,high-voltage,7,1.28398
time,Hardware,Voltage,Current
1621609855513,high-voltage,8,1.71923
time,Hardware,Voltage,Current
1621609855513,high-voltage,9,2.305
time,Hardware,Voltage,Current
1621609855513,high-voltage,10,2.82228
time,Hardware,Voltage,Current
1621609855513,high-voltage,11,3.48457
time,Hardware,Voltage,Current
1621609855513,high-voltage,12,4.30862
time,Hardware,Voltage,Current
1621609855513,high-voltage,13,5.23985
time,Hardware,Voltage,Current
1621609855513,high-voltage,14,6.41301
time,Hardware,Voltage,Current
1621609855513,high-voltage,15,7.64516
time,Hardware,Voltage,Current
1621609855513,high-voltage,16,8.9364
time,Hardware,Voltage,Current
1621609855513,high-voltage,17,9.53022
time,Hardware,Voltage,Current
1621609855513,high-voltage,18,10.0001
