{
    "Data": [0.0, 0.0, 0.0, 0.0, 0.0, 0.0, 0.0, 0.0, 0.0, 0.0, 0.0, 0.0, 0.0, 0.0, 0.0, 0.0, 0.0, 0.0, 0.0, 0.0, 0.0, 0.0, 0.0, 0.0, 0.0, 0.0, 0.0, 0.0, 0.0, 0.0, 0.0, 0.0, 0.0, 0.0, 0.0, 0.0, 0.0, 0.0, 0.0, 0.0, 0.0, 0.0, 0.0, 0.0, 0.0, 0.0, 0.0, 0.0, 0.0, 0.0, 1.0, 3.0, 3.0, 6.0, 9.0, 3.0, 9.0, 7.0, 12.0, 9.0, 11.0, 16.0, 21.0, 27.0, 32.0, 37.0, 46.0, 51.0, 62.0, 76.0, 84.0, 112.0, 143.0, 150.0, 172.0, 219.0, 236.0, 314.0, 300.0, 368.0, 398.0, 451.0, 467.0, 535.0, 582.0, 670.0, 740.0, 811.0, 841.0, 880.0, 1007.0, 1042.0, 1081.0, 1074.0, 991.0, 1041.0, 1046.0, 1001.0, 957.0, 947.0, 909.0, 885.0, 854.0, 784.0, 855.0, 958.0, 1056.0, 1208.0, 1274.0, 1456.0, 1516.0, 1598.0, 1725.0, 1661.0, 1786.0, 1766.0, 1659.0, 1471.0, 1377.0, 1352.0, 1108.0, 1025.0, 866.0, 782.0, 616.0, 492.0, 333.0, 318.0, 245.0, 194.0, 165.0, 144.0, 84.0, 79.0, 66.0, 54.0, 42.0, 32.0, 15.0, 18.0, 19.0, 27.0, 17.0, 10.0, 17.0, 10.0, 19.0, 17.0, 8.0, 4.0, 8.0, 4.0, 16.0, 9.0, 6.0, 7.0, 11.0, 13.0, 6.0, 18.0, 20.0, 16.0, 20.0, 17.0, 28.0, 26.0, 19.0, 34.0, 44.0, 44.0, 42.0, 49.0, 63.0, 72.0, 76.0, 83.0, 94.0, 115.0, 115.0, 122.0, 127.0, 151.0, 198.0, 192.0, 197.0, 187.0, 206.0, 241.0, 413.0, 270.0, 283.0, 297.0, 296.0, 430.0, 463.0, 325.0, 333.0, 340.0, 343.0, 598.0, 359.0, 354.0, 353.0, 362.0, 449.0, 383.0, 318.0, 346.0, 349.0, 339.0, 564.0, 316.0, 261.0, 282.0, 259.0, 362.0, 312.0, 217.0, 218.0, 175.0, 186.0, 246.0, 165.0, 152.0, 135.0, 147.0, 191.0, 145.0, 107.0, 93.0, 79.0, 89.0, 112.0, 84.0, 74.0, 86.0, 90.0, 111.0, 83.0, 73.0, 74.0, 69.0, 62.0, 59.0, 62.0, 42.0, 72.0, 47.0, 63.0, 64.0, 44.0, 61.0, 37.0, 49.0, 37.0, 61.0, 42.0, 51.0, 52.0, 32.0, 41.0, 31.0, 32.0, 37.0, 36.0, 26.0, 36.0, 40.0, 28.0, 31.0, 17.0, 24.0, 14.0, 19.0, 27.0, 20.0, 17.0, 21.0, 14.0, 24.0, 24.0, 17.0, 24.0, 12.0, 19.0, 27.0, 22.0, 29.0, 16.0, 22.0, 18.0, 15.0, 15.0, 19.0, 15.0, 20.0, 26.0, 31.0, 20.0, 18.0, 24.0, 15.0, 18.0, 11.0, 9.0, 20.0, 13.0, 12.0, 12.0, 18.0, 12.0, 13.0, 15.0, 12.0, 8.0, 12.0, 9.0, 15.0, 8.0, 7.0, 7.0, 11.0, 7.0, 6.0, 11.0, 4.0, 0.0, 0.0, 0.0, 0.0, 0.0, 0.0, 0.0, 0.0, 0.0, 0.0, 0.0, 0.0, 0.0, 0.0, 0.0, 0.0, 0.0, 0.0, 0.0, 0.0, 0.0, 0.0, 0.0, 0.0, 0.0, 0.0, 0.0, 0.0, 0.0, 0.0, 0.0, 0.0, 0.0, 0.0, 0.0, 0.0, 0.0, 0.0, 0.0, 0.0, 0.0, 0.0, 0.0, 0.0, 0.0, 0.0, 0.0, 0.0, 0.0, 0.0, 0.0, 0.0, 0.0, 0.0, 0.0, 0.0, 0.0],
    "Name": "ThresholdDist-0",
    "Overflow": 0.0,
    "Type": "Histo1d",
    "Underflow": 0.0,
    "x": {
        "AxisTitle": "Threshold [e]",
        "Bins": 383,
        "High": 3825.0,
        "Low": -5.0
    },
    "y": {
        "AxisTitle": "Number of Pixels"
    },
    "z": {
        "AxisTitle": "z"
    }
}