time,Hardware,Voltage,Current
1626754702492,high-voltage-3,1,0.00186506
time,Hardware,Voltage,Current
1626754702492,high-voltage-3,2,0.00505645
time,Hardware,Voltage,Current
1626754702492,high-voltage-3,3,0.0071427
time,Hardware,Voltage,Current
1626754702492,high-voltage-3,4,0.00787308
time,Hardware,Voltage,Current
1626754702492,high-voltage-3,5,0.0095875
time,Hardware,Voltage,Current
1626754702492,high-voltage-3,6,0.0117968
time,Hardware,Voltage,Current
1626754702492,high-voltage-3,7,0.0134613
time,Hardware,Voltage,Current
1626754702492,high-voltage-3,8,0.0136321
time,Hardware,Voltage,Current
1626754702492,high-voltage-3,9,0.0149567
time,Hardware,Voltage,Current
1626754702492,high-voltage-3,10,0.0170855
time,Hardware,Voltage,Current
1626754702492,high-voltage-3,11,0.0178275
time,Hardware,Voltage,Current
1626754702492,high-voltage-3,12,0.0197787
time,Hardware,Voltage,Current
1626754702492,high-voltage-3,13,0.021809
time,Hardware,Voltage,Current
1626754702492,high-voltage-3,14,0.0230062
time,Hardware,Voltage,Current
1626754702492,high-voltage-3,15,0.02359
time,Hardware,Voltage,Current
1626754702492,high-voltage-3,16,0.0253882
time,Hardware,Voltage,Current
1626754702492,high-voltage-3,17,0.0278551
time,Hardware,Voltage,Current
1626754702492,high-voltage-3,18,0.0277286
time,Hardware,Voltage,Current
1626754702492,high-voltage-3,19,0.0300397
time,Hardware,Voltage,Current
1626754702492,high-voltage-3,20,0.0296843
time,Hardware,Voltage,Current
1626754702492,high-voltage-3,25,0.0366493
time,Hardware,Voltage,Current
1626754702492,high-voltage-3,30,0.043681
time,Hardware,Voltage,Current
1626754702492,high-voltage-3,35,0.0500038
time,Hardware,Voltage,Current
1626754702492,high-voltage-3,40,0.0572387
time,Hardware,Voltage,Current
1626754702492,high-voltage-3,45,0.0600575
time,Hardware,Voltage,Current
1626754702492,high-voltage-3,50,0.0638054
time,Hardware,Voltage,Current
1626754702492,high-voltage-3,55,0.0688662
time,Hardware,Voltage,Current
1626754702492,high-voltage-3,60,0.0734539
time,Hardware,Voltage,Current
1626754702492,high-voltage-3,65,0.0773358
time,Hardware,Voltage,Current
1626754702492,high-voltage-3,70,0.082037
time,Hardware,Voltage,Current
1626754702492,high-voltage-3,75,0.0896345
time,Hardware,Voltage,Current
1626754702492,high-voltage-3,80,0.0943499
time,Hardware,Voltage,Current
1626754702492,high-voltage-3,85,0.10083
time,Hardware,Voltage,Current
1626754702492,high-voltage-3,90,0.10632
time,Hardware,Voltage,Current
1626754702492,high-voltage-3,95,0.113208
time,Hardware,Voltage,Current
1626754702492,high-voltage-3,100,0.121888
