time,Hardware,Voltage,Current
1626722931781,high-voltage-2,1,0.257559
time,Hardware,Voltage,Current
1626722931781,high-voltage-2,2,0.308371
time,Hardware,Voltage,Current
1626722931781,high-voltage-2,3,0.335453
time,Hardware,Voltage,Current
1626722931781,high-voltage-2,4,0.359307
time,Hardware,Voltage,Current
1626722931781,high-voltage-2,5,0.385406
time,Hardware,Voltage,Current
1626722931781,high-voltage-2,6,0.41545
time,Hardware,Voltage,Current
1626722931781,high-voltage-2,7,0.449405
time,Hardware,Voltage,Current
1626722931781,high-voltage-2,8,0.484829
time,Hardware,Voltage,Current
1626722931781,high-voltage-2,9,0.526707
time,Hardware,Voltage,Current
1626722931781,high-voltage-2,10,0.569791
time,Hardware,Voltage,Current
1626722931781,high-voltage-2,11,0.612319
time,Hardware,Voltage,Current
1626722931781,high-voltage-2,12,0.65496
time,Hardware,Voltage,Current
1626722931781,high-voltage-2,13,0.695508
time,Hardware,Voltage,Current
1626722931781,high-voltage-2,14,0.731522
time,Hardware,Voltage,Current
1626722931781,high-voltage-2,15,0.76445
time,Hardware,Voltage,Current
1626722931781,high-voltage-2,16,0.790961
time,Hardware,Voltage,Current
1626722931781,high-voltage-2,17,0.816965
time,Hardware,Voltage,Current
1626722931781,high-voltage-2,18,0.842098
time,Hardware,Voltage,Current
1626722931781,high-voltage-2,19,0.863809
time,Hardware,Voltage,Current
1626722931781,high-voltage-2,20,0.887096
time,Hardware,Voltage,Current
1626722931781,high-voltage-2,25,0.983176
time,Hardware,Voltage,Current
1626722931781,high-voltage-2,30,1.08099
time,Hardware,Voltage,Current
1626722931781,high-voltage-2,35,1.17965
time,Hardware,Voltage,Current
1626722931781,high-voltage-2,40,1.28942
time,Hardware,Voltage,Current
1626722931781,high-voltage-2,45,1.42921
time,Hardware,Voltage,Current
1626722931781,high-voltage-2,50,1.52886
time,Hardware,Voltage,Current
1626722931781,high-voltage-2,55,1.62396
time,Hardware,Voltage,Current
1626722931781,high-voltage-2,60,1.71602
time,Hardware,Voltage,Current
1626722931781,high-voltage-2,65,1.80238
time,Hardware,Voltage,Current
1626722931781,high-voltage-2,70,1.88476
time,Hardware,Voltage,Current
1626722931781,high-voltage-2,75,1.96424
time,Hardware,Voltage,Current
1626722931781,high-voltage-2,80,2.04177
time,Hardware,Voltage,Current
1626722931781,high-voltage-2,85,2.1154
time,Hardware,Voltage,Current
1626722931781,high-voltage-2,90,2.1858
time,Hardware,Voltage,Current
1626722931781,high-voltage-2,95,2.25407
time,Hardware,Voltage,Current
1626722931781,high-voltage-2,100,2.31771
