{
    "Data": [0.0, 0.0, 0.0, 0.0, 0.0, 0.0, 0.0, 0.0, 0.0, 0.0, 0.0, 0.0, 0.0, 12.0, 11.0, 0.0, 7.0, 219.0, 519.0, 130.0, 84.0, 937.0, 2026.0, 1197.0, 585.0, 1667.0, 2251.0, 1436.0, 894.0, 1380.0, 1578.0, 1244.0, 903.0, 826.0, 712.0, 609.0, 532.0, 656.0, 835.0, 804.0, 572.0, 704.0, 1347.0, 2561.0, 2030.0, 1405.0, 1862.0, 3019.0, 3538.0, 3142.0, 2492.0, 2046.0, 2587.0, 2160.0, 1892.0, 1666.0, 1916.0, 1934.0, 2049.0, 1547.0, 1285.0, 1228.0, 1002.0, 835.0, 764.0, 755.0, 694.0, 548.0, 480.0, 521.0, 514.0, 457.0, 413.0, 312.0, 319.0, 306.0, 292.0, 225.0, 198.0, 192.0, 187.0, 158.0, 156.0, 114.0, 108.0, 109.0, 84.0, 87.0, 102.0, 77.0, 80.0, 75.0, 59.0, 82.0, 63.0, 63.0, 50.0, 46.0, 46.0, 54.0, 37.0, 46.0, 38.0, 33.0, 39.0, 21.0, 37.0, 30.0, 26.0, 24.0, 23.0, 24.0, 19.0, 21.0, 27.0, 26.0, 22.0, 16.0, 15.0, 20.0, 9.0, 8.0, 15.0, 15.0, 11.0, 13.0, 6.0, 11.0, 8.0, 5.0, 8.0, 6.0, 12.0, 9.0, 8.0, 13.0, 7.0, 6.0, 5.0, 15.0, 6.0, 5.0, 5.0, 5.0, 5.0, 6.0, 2.0, 4.0, 0.0, 4.0, 4.0, 2.0, 3.0, 0.0, 1.0, 1.0, 3.0, 2.0, 2.0, 2.0, 1.0, 3.0, 2.0, 3.0, 4.0, 2.0, 1.0, 1.0, 1.0, 1.0, 1.0, 1.0, 0.0, 0.0, 1.0, 0.0, 2.0, 1.0, 0.0, 2.0, 1.0, 1.0, 1.0, 1.0, 1.0, 0.0, 1.0, 1.0, 0.0, 1.0, 0.0, 0.0, 0.0, 1.0, 1.0, 0.0, 1.0, 0.0, 0.0, 0.0, 0.0],
    "Name": "TimePerFitDist-0",
    "Overflow": 85.0,
    "Type": "Histo1d",
    "Underflow": 0.0,
    "x": {
        "AxisTitle": "Fit Time [us]",
        "Bins": 201,
        "High": 401.0,
        "Low": -1.0
    },
    "y": {
        "AxisTitle": "Number of Pixels"
    },
    "z": {
        "AxisTitle": "z"
    }
}