{
    "Data": [0.0, 0.0, 0.0, 0.0, 0.0, 0.0, 0.0, 0.0, 0.0, 0.0, 0.0, 0.0, 0.0, 0.0, 0.0, 0.0, 0.0, 4.0, 0.0, 4.0, 1.0, 9.0, 1.0, 20.0, 11.0, 26.0, 14.0, 8.0, 14.0, 18.0, 50.0, 30.0, 6.0, 5.0, 0.0, 27.0, 12.0, 50.0, 2.0, 9.0, 0.0, 21.0, 50.0, 23.0, 50.0, 28.0, 50.0, 50.0, 50.0, 50.0, 50.0],
    "Name": "Scurve-90-96",
    "Overflow": 0.0,
    "Type": "Histo1d",
    "Underflow": 0.0,
    "x": {
        "AxisTitle": "Vcal",
        "Bins": 51,
        "High": 302.5,
        "Low": 47.5
    },
    "y": {
        "AxisTitle": "Occupancy"
    },
    "z": {
        "AxisTitle": "z"
    }
}