time,Hardware,Voltage,Current
1621384002187,high-voltage-2,1,0.241948
time,Hardware,Voltage,Current
1621384002187,high-voltage-2,2,0.277096
time,Hardware,Voltage,Current
1621384002187,high-voltage-2,3,0.302712
time,Hardware,Voltage,Current
1621384002187,high-voltage-2,4,0.322841
time,Hardware,Voltage,Current
1621384002187,high-voltage-2,5,0.341693
time,Hardware,Voltage,Current
1621384002187,high-voltage-2,6,0.365615
time,Hardware,Voltage,Current
1621384002187,high-voltage-2,7,0.39196
time,Hardware,Voltage,Current
1621384002187,high-voltage-2,8,0.422584
time,Hardware,Voltage,Current
1621384002187,high-voltage-2,9,0.453609
time,Hardware,Voltage,Current
1621384002187,high-voltage-2,10,0.48971
time,Hardware,Voltage,Current
1621384002187,high-voltage-2,11,0.52971
time,Hardware,Voltage,Current
1621384002187,high-voltage-2,12,0.569437
time,Hardware,Voltage,Current
1621384002187,high-voltage-2,13,0.609481
time,Hardware,Voltage,Current
1621384002187,high-voltage-2,14,0.646844
time,Hardware,Voltage,Current
1621384002187,high-voltage-2,15,0.68404
time,Hardware,Voltage,Current
1621384002187,high-voltage-2,16,0.718325
time,Hardware,Voltage,Current
1621384002187,high-voltage-2,17,0.747623
time,Hardware,Voltage,Current
1621384002187,high-voltage-2,18,0.772411
time,Hardware,Voltage,Current
1621384002187,high-voltage-2,19,0.798389
time,Hardware,Voltage,Current
1621384002187,high-voltage-2,20,0.822075
time,Hardware,Voltage,Current
1621384002187,high-voltage-2,25,0.923536
time,Hardware,Voltage,Current
1621384002187,high-voltage-2,30,1.02081
time,Hardware,Voltage,Current
1621384002187,high-voltage-2,35,1.11392
time,Hardware,Voltage,Current
1621384002187,high-voltage-2,40,1.21916
time,Hardware,Voltage,Current
1621384002187,high-voltage-2,45,1.34936
time,Hardware,Voltage,Current
1621384002187,high-voltage-2,50,1.4416
time,Hardware,Voltage,Current
1621384002187,high-voltage-2,55,1.52551
time,Hardware,Voltage,Current
1621384002187,high-voltage-2,60,1.60413
time,Hardware,Voltage,Current
1621384002187,high-voltage-2,65,1.68013
time,Hardware,Voltage,Current
1621384002187,high-voltage-2,70,1.7527
time,Hardware,Voltage,Current
1621384002187,high-voltage-2,75,1.82423
time,Hardware,Voltage,Current
1621384002187,high-voltage-2,80,1.89379
time,Hardware,Voltage,Current
1621384002187,high-voltage-2,85,1.95935
time,Hardware,Voltage,Current
1621384002187,high-voltage-2,90,2.02481
time,Hardware,Voltage,Current
1621384002187,high-voltage-2,95,2.08852
time,Hardware,Voltage,Current
1621384002187,high-voltage-2,100,2.15253
