{
    "Data": [254.0, 12204.0, 21205.0, 13611.0, 6619.0, 3704.0, 2948.0, 2957.0, 2779.0, 2450.0, 2146.0, 1567.0, 1117.0, 753.0, 536.0, 365.0, 289.0, 192.0, 153.0, 170.0, 140.0, 118.0, 139.0, 115.0, 144.0, 114.0, 104.0, 91.0, 77.0, 86.0, 87.0, 60.0, 60.0, 64.0, 49.0, 50.0, 50.0, 20.0, 53.0, 46.0, 26.0, 31.0, 30.0, 30.0, 13.0, 29.0, 21.0, 21.0, 22.0, 5.0, 4.0],
    "Name": "Chi2Dist-0",
    "Overflow": 0.0,
    "Type": "Histo1d",
    "Underflow": 0.0,
    "x": {
        "AxisTitle": "Fit Chi/ndf",
        "Bins": 51,
        "High": 2.5250000953674318,
        "Low": -0.02500000037252903
    },
    "y": {
        "AxisTitle": "Number of Pixels"
    },
    "z": {
        "AxisTitle": "z"
    }
}