time,Hardware,Voltage,Current
1621472268053,high-voltage-2,1,0.278966
time,Hardware,Voltage,Current
1621472268053,high-voltage-2,2,0.323216
time,Hardware,Voltage,Current
1621472268053,high-voltage-2,3,0.354372
time,Hardware,Voltage,Current
1621472268053,high-voltage-2,4,0.384236
time,Hardware,Voltage,Current
1621472268053,high-voltage-2,5,0.416116
time,Hardware,Voltage,Current
1621472268053,high-voltage-2,6,0.449372
time,Hardware,Voltage,Current
1621472268053,high-voltage-2,7,0.484225
time,Hardware,Voltage,Current
1621472268053,high-voltage-2,8,0.523775
time,Hardware,Voltage,Current
1621472268053,high-voltage-2,9,0.563947
time,Hardware,Voltage,Current
1621472268053,high-voltage-2,10,0.603042
time,Hardware,Voltage,Current
1621472268053,high-voltage-2,11,0.638836
time,Hardware,Voltage,Current
1621472268053,high-voltage-2,12,0.676903
time,Hardware,Voltage,Current
1621472268053,high-voltage-2,13,0.713336
time,Hardware,Voltage,Current
1621472268053,high-voltage-2,14,0.749394
time,Hardware,Voltage,Current
1621472268053,high-voltage-2,15,0.783195
time,Hardware,Voltage,Current
1621472268053,high-voltage-2,16,0.815539
time,Hardware,Voltage,Current
1621472268053,high-voltage-2,17,0.843542
time,Hardware,Voltage,Current
1621472268053,high-voltage-2,18,0.871158
time,Hardware,Voltage,Current
1621472268053,high-voltage-2,19,0.893103
time,Hardware,Voltage,Current
1621472268053,high-voltage-2,20,0.914431
time,Hardware,Voltage,Current
1621472268053,high-voltage-2,25,1.01203
time,Hardware,Voltage,Current
1621472268053,high-voltage-2,30,1.10223
time,Hardware,Voltage,Current
1621472268053,high-voltage-2,35,1.18866
time,Hardware,Voltage,Current
1621472268053,high-voltage-2,40,1.28865
time,Hardware,Voltage,Current
1621472268053,high-voltage-2,45,1.4123
time,Hardware,Voltage,Current
1621472268053,high-voltage-2,50,1.49825
time,Hardware,Voltage,Current
1621472268053,high-voltage-2,55,1.57692
time,Hardware,Voltage,Current
1621472268053,high-voltage-2,60,1.64754
time,Hardware,Voltage,Current
1621472268053,high-voltage-2,65,1.72086
time,Hardware,Voltage,Current
1621472268053,high-voltage-2,70,1.78875
time,Hardware,Voltage,Current
1621472268053,high-voltage-2,75,1.85515
time,Hardware,Voltage,Current
1621472268053,high-voltage-2,80,1.92029
time,Hardware,Voltage,Current
1621472268053,high-voltage-2,85,1.98428
time,Hardware,Voltage,Current
1621472268053,high-voltage-2,90,2.04895
time,Hardware,Voltage,Current
1621472268053,high-voltage-2,95,2.10819
time,Hardware,Voltage,Current
1621472268053,high-voltage-2,100,2.16863
