{
    "Data": [0.0, 0.0, 0.0, 0.0, 0.0, 0.0, 0.0, 0.0, 0.0, 0.0, 0.0, 0.0, 0.0, 3.0, 0.0, 3.0, 0.0, 2.0, 3.0, 1.0, 2.0, 9.0, 6.0, 14.0, 19.0, 7.0, 13.0, 25.0, 26.0, 28.0, 29.0, 37.0, 28.0, 35.0, 36.0, 42.0, 43.0, 45.0, 44.0, 47.0, 47.0, 50.0, 50.0, 50.0, 50.0, 49.0, 50.0, 50.0, 50.0, 50.0, 50.0],
    "Name": "Scurve-70-96",
    "Overflow": 0.0,
    "Type": "Histo1d",
    "Underflow": 0.0,
    "x": {
        "AxisTitle": "Vcal",
        "Bins": 51,
        "High": 302.5,
        "Low": 47.5
    },
    "y": {
        "AxisTitle": "Occupancy"
    },
    "z": {
        "AxisTitle": "z"
    }
}