time,Hardware,Voltage,Current
1623356627837,high-voltage,1,0.0285294
time,Hardware,Voltage,Current
1623356627837,high-voltage,2,0.0365582
time,Hardware,Voltage,Current
1623356627837,high-voltage,3,0.0448097
time,Hardware,Voltage,Current
1623356627837,high-voltage,4,0.0527818
time,Hardware,Voltage,Current
1623356627837,high-voltage,5,0.0587834
time,Hardware,Voltage,Current
1623356627837,high-voltage,6,0.0641155
time,Hardware,Voltage,Current
1623356627837,high-voltage,7,0.0704588
time,Hardware,Voltage,Current
1623356627837,high-voltage,8,0.0754675
time,Hardware,Voltage,Current
1623356627837,high-voltage,9,0.0811185
time,Hardware,Voltage,Current
1623356627837,high-voltage,8.46166e-08,0.0849477
time,Hardware,Voltage,Current
1623356627837,high-voltage,11,0.089358
time,Hardware,Voltage,Current
1623356627837,high-voltage,12,0.0925427
time,Hardware,Voltage,Current
1623356627837,high-voltage,13,0.0957461
time,Hardware,Voltage,Current
1623356627837,high-voltage,14,0.0988062
time,Hardware,Voltage,Current
1623356627837,high-voltage,15,0.101577
time,Hardware,Voltage,Current
1623356627837,high-voltage,16,0.103826
time,Hardware,Voltage,Current
1623356627837,high-voltage,17,0.105671
time,Hardware,Voltage,Current
1623356627837,high-voltage,1.07857e-07,0.107714
time,Hardware,Voltage,Current
1623356627837,high-voltage,19,0.110552
