time,Hardware,Voltage,Current
1626354980696,high-voltage-3,1,0.00439453
time,Hardware,Voltage,Current
1626354980696,high-voltage-3,2,0.00716073
time,Hardware,Voltage,Current
1626354980696,high-voltage-3,3,0.00833907
time,Hardware,Voltage,Current
1626354980696,high-voltage-3,4,0.0106388
time,Hardware,Voltage,Current
1626354980696,high-voltage-3,5,0.0124208
time,Hardware,Voltage,Current
1626354980696,high-voltage-3,6,0.013033
time,Hardware,Voltage,Current
1626354980696,high-voltage-3,7,0.0153061
time,Hardware,Voltage,Current
1626354980696,high-voltage-3,8,0.0162
time,Hardware,Voltage,Current
1626354980696,high-voltage-3,9,0.0167803
time,Hardware,Voltage,Current
1626354980696,high-voltage-3,10,0.018589
time,Hardware,Voltage,Current
1626354980696,high-voltage-3,11,0.0200668
time,Hardware,Voltage,Current
1626354980696,high-voltage-3,12,0.0218205
time,Hardware,Voltage,Current
1626354980696,high-voltage-3,13,0.0227872
time,Hardware,Voltage,Current
1626354980696,high-voltage-3,14,0.0244568
time,Hardware,Voltage,Current
1626354980696,high-voltage-3,15,0.0259459
time,Hardware,Voltage,Current
1626354980696,high-voltage-3,16,0.0286754
time,Hardware,Voltage,Current
1626354980696,high-voltage-3,17,0.0287959
time,Hardware,Voltage,Current
1626354980696,high-voltage-3,18,0.0295374
time,Hardware,Voltage,Current
1626354980696,high-voltage-3,19,0.0306614
time,Hardware,Voltage,Current
1626354980696,high-voltage-3,20,0.0328662
time,Hardware,Voltage,Current
1626354980696,high-voltage-3,25,0.0387216
time,Hardware,Voltage,Current
1626354980696,high-voltage-3,30,0.0446722
time,Hardware,Voltage,Current
1626354980696,high-voltage-3,35,0.0509064
time,Hardware,Voltage,Current
1626354980696,high-voltage-3,40,0.0576462
time,Hardware,Voltage,Current
1626354980696,high-voltage-3,45,0.0616998
time,Hardware,Voltage,Current
1626354980696,high-voltage-3,50,0.0665236
time,Hardware,Voltage,Current
1626354980696,high-voltage-3,55,0.0710975
time,Hardware,Voltage,Current
1626354980696,high-voltage-3,60,0.076734
time,Hardware,Voltage,Current
1626354980696,high-voltage-3,65,0.0814259
time,Hardware,Voltage,Current
1626354980696,high-voltage-3,70,0.0860782
time,Hardware,Voltage,Current
1626354980696,high-voltage-3,75,0.0906635
time,Hardware,Voltage,Current
1626354980696,high-voltage-3,80,0.0957346
time,Hardware,Voltage,Current
1626354980696,high-voltage-3,85,0.102072
time,Hardware,Voltage,Current
1626354980696,high-voltage-3,90,0.108361
time,Hardware,Voltage,Current
1626354980696,high-voltage-3,95,0.115095
time,Hardware,Voltage,Current
1626354980696,high-voltage-3,100,0.120717
