time,Hardware,Voltage,Current
1621982757013,high-voltage-3,1,0.0575784
time,Hardware,Voltage,Current
1621982757013,high-voltage-3,2,0.0626662
time,Hardware,Voltage,Current
1621982757013,high-voltage-3,3,0.065439
time,Hardware,Voltage,Current
1621982757013,high-voltage-3,4,0.0656041
time,Hardware,Voltage,Current
1621982757013,high-voltage-3,5,0.0682141
time,Hardware,Voltage,Current
1621982757013,high-voltage-3,6,0.0682144
time,Hardware,Voltage,Current
1621982757013,high-voltage-3,7,0.0722834
time,Hardware,Voltage,Current
1621982757013,high-voltage-3,8,0.0728981
time,Hardware,Voltage,Current
1621982757013,high-voltage-3,9,0.0743814
time,Hardware,Voltage,Current
1621982757013,high-voltage-3,10,0.0759137
time,Hardware,Voltage,Current
1621982757013,high-voltage-3,11,0.0820375
time,Hardware,Voltage,Current
1621982757013,high-voltage-3,12,0.0841776
time,Hardware,Voltage,Current
1621982757013,high-voltage-3,13,0.0864547
time,Hardware,Voltage,Current
1621982757013,high-voltage-3,14,0.0883107
time,Hardware,Voltage,Current
1621982757013,high-voltage-3,15,0.0918263
time,Hardware,Voltage,Current
1621982757013,high-voltage-3,16,0.0920458
time,Hardware,Voltage,Current
1621982757013,high-voltage-3,17,0.0951924
time,Hardware,Voltage,Current
1621982757013,high-voltage-3,18,0.0962914
time,Hardware,Voltage,Current
1621982757013,high-voltage-3,19,0.0983863
time,Hardware,Voltage,Current
1621982757013,high-voltage-3,20,0.101249
time,Hardware,Voltage,Current
1621982757013,high-voltage-3,25,0.114446
time,Hardware,Voltage,Current
1621982757013,high-voltage-3,30,0.130993
time,Hardware,Voltage,Current
1621982757013,high-voltage-3,35,0.139719
time,Hardware,Voltage,Current
1621982757013,high-voltage-3,40,0.149386
time,Hardware,Voltage,Current
1621982757013,high-voltage-3,45,0.159681
time,Hardware,Voltage,Current
1621982757013,high-voltage-3,50,0.165126
time,Hardware,Voltage,Current
1621982757013,high-voltage-3,55,0.171571
time,Hardware,Voltage,Current
1621982757013,high-voltage-3,60,0.181042
time,Hardware,Voltage,Current
1621982757013,high-voltage-3,65,0.187241
time,Hardware,Voltage,Current
1621982757013,high-voltage-3,70,0.193176
time,Hardware,Voltage,Current
1621982757013,high-voltage-3,75,0.20163
time,Hardware,Voltage,Current
1621982757013,high-voltage-3,80,0.208435
time,Hardware,Voltage,Current
1621982757013,high-voltage-3,85,0.215044
time,Hardware,Voltage,Current
1621982757013,high-voltage-3,90,0.224614
time,Hardware,Voltage,Current
1621982757013,high-voltage-3,95,0.231517
time,Hardware,Voltage,Current
1621982757013,high-voltage-3,100,0.239045
