time,Hardware,Voltage,Current
1625777295199,high-voltage-4,1,0.425918
time,Hardware,Voltage,Current
1625777295199,high-voltage-4,2,0.583346
time,Hardware,Voltage,Current
1625777295199,high-voltage-4,3,0.678973
time,Hardware,Voltage,Current
1625777295199,high-voltage-4,4,0.746626
time,Hardware,Voltage,Current
1625777295199,high-voltage-4,5,0.793104
time,Hardware,Voltage,Current
1625777295199,high-voltage-4,6,0.865215
time,Hardware,Voltage,Current
1625777295199,high-voltage-4,7,0.863972
time,Hardware,Voltage,Current
1625777295199,high-voltage-4,8,0.900123
time,Hardware,Voltage,Current
1625777295199,high-voltage-4,9,0.937565
time,Hardware,Voltage,Current
1625777295199,high-voltage-4,10,0.975464
time,Hardware,Voltage,Current
1625777295199,high-voltage-4,11,1.01358
time,Hardware,Voltage,Current
1625777295199,high-voltage-4,12,1.05631
time,Hardware,Voltage,Current
1625777295199,high-voltage-4,13,1.10135
time,Hardware,Voltage,Current
1625777295199,high-voltage-4,14,1.15026
time,Hardware,Voltage,Current
1625777295199,high-voltage-4,15,1.20179
time,Hardware,Voltage,Current
1625777295199,high-voltage-4,16,1.25248
time,Hardware,Voltage,Current
1625777295199,high-voltage-4,17,1.30599
time,Hardware,Voltage,Current
1625777295199,high-voltage-4,18,1.35738
time,Hardware,Voltage,Current
1625777295199,high-voltage-4,19,1.41508
time,Hardware,Voltage,Current
1625777295199,high-voltage-4,20,1.47428
time,Hardware,Voltage,Current
1625777295199,high-voltage-4,25,1.75444
time,Hardware,Voltage,Current
1625777295199,high-voltage-4,30,1.97821
time,Hardware,Voltage,Current
1625777295199,high-voltage-4,35,2.19565
time,Hardware,Voltage,Current
1625777295199,high-voltage-4,40,2.42305
time,Hardware,Voltage,Current
1625777295199,high-voltage-4,45,2.66314
time,Hardware,Voltage,Current
1625777295199,high-voltage-4,50,2.93974
time,Hardware,Voltage,Current
1625777295199,high-voltage-4,55,3.26639
time,Hardware,Voltage,Current
1625777295199,high-voltage-4,60,3.64977
time,Hardware,Voltage,Current
1625777295199,high-voltage-4,65,4.11913
time,Hardware,Voltage,Current
1625777295199,high-voltage-4,70,4.74333
time,Hardware,Voltage,Current
1625777295199,high-voltage-4,75,6.36412
time,Hardware,Voltage,Current
1625777295199,high-voltage-4,80,9.99976
time,Hardware,Voltage,Current
1625777295199,high-voltage-4,85,9.9998
time,Hardware,Voltage,Current
1625777295199,high-voltage-4,90,9.99973
time,Hardware,Voltage,Current
1625777295199,high-voltage-4,95,9.99972
time,Hardware,Voltage,Current
1625777295199,high-voltage-4,100,9.9997
