{
    "Data": [[3171.0, 1569.0, 1013.0, 779.0, 552.0, 451.0, 351.0, 287.0, 268.0, 208.0, 209.0, 139.0, 153.0, 163.0, 136.0, 106.0, 98.0, 93.0, 101.0, 73.0, 81.0, 67.0, 78.0, 65.0, 51.0, 53.0, 36.0, 51.0, 46.0, 33.0, 41.0, 36.0, 44.0, 36.0, 42.0, 25.0, 37.0, 25.0, 29.0, 25.0, 26.0, 40.0, 22.0, 26.0, 16.0, 27.0, 23.0, 27.0, 23.0], [3186.0, 1849.0, 1315.0, 1035.0, 846.0, 638.0, 575.0, 496.0, 411.0, 366.0, 340.0, 326.0, 285.0, 249.0, 243.0, 210.0, 196.0, 182.0, 160.0, 166.0, 131.0, 142.0, 123.0, 113.0, 117.0, 102.0, 98.0, 88.0, 86.0, 76.0, 88.0, 90.0, 63.0, 69.0, 69.0, 80.0, 68.0, 59.0, 53.0, 52.0, 46.0, 54.0, 49.0, 38.0, 62.0, 32.0, 38.0, 50.0, 50.0], [2832.0, 1766.0, 1372.0, 1098.0, 886.0, 816.0, 732.0, 619.0, 608.0, 491.0, 541.0, 504.0, 437.0, 402.0, 361.0, 336.0, 310.0, 334.0, 272.0, 248.0, 267.0, 229.0, 231.0, 240.0, 198.0, 199.0, 194.0, 168.0, 182.0, 160.0, 176.0, 150.0, 138.0, 136.0, 127.0, 131.0, 128.0, 111.0, 111.0, 107.0, 114.0, 121.0, 99.0, 105.0, 89.0, 106.0, 92.0, 115.0, 103.0], [2268.0, 1382.0, 1163.0, 983.0, 839.0, 792.0, 763.0, 680.0, 654.0, 626.0, 538.0, 545.0, 481.0, 489.0, 456.0, 429.0, 398.0, 415.0, 410.0, 399.0, 347.0, 382.0, 354.0, 344.0, 341.0, 311.0, 329.0, 292.0, 283.0, 264.0, 293.0, 268.0, 281.0, 234.0, 249.0, 232.0, 255.0, 233.0, 228.0, 237.0, 248.0, 200.0, 208.0, 202.0, 203.0, 255.0, 232.0, 210.0, 250.0], [2051.0, 1144.0, 883.0, 799.0, 661.0, 636.0, 597.0, 578.0, 542.0, 540.0, 510.0, 523.0, 496.0, 488.0, 457.0, 453.0, 404.0, 425.0, 454.0, 462.0, 456.0, 408.0, 447.0, 406.0, 432.0, 430.0, 369.0, 370.0, 393.0, 387.0, 399.0, 400.0, 409.0, 365.0, 429.0, 389.0, 342.0, 376.0, 346.0, 386.0, 406.0, 414.0, 417.0, 394.0, 413.0, 427.0, 463.0, 463.0, 545.0], [3661.0, 1649.0, 1007.0, 758.0, 626.0, 540.0, 502.0, 426.0, 443.0, 404.0, 443.0, 440.0, 394.0, 429.0, 381.0, 373.0, 376.0, 361.0, 335.0, 387.0, 382.0, 425.0, 399.0, 429.0, 408.0, 402.0, 411.0, 419.0, 398.0, 441.0, 450.0, 437.0, 488.0, 475.0, 429.0, 502.0, 483.0, 518.0, 500.0, 541.0, 547.0, 606.0, 570.0, 679.0, 652.0, 715.0, 811.0, 963.0, 1122.0], [4759.0, 2975.0, 2164.0, 1612.0, 1315.0, 1005.0, 921.0, 786.0, 670.0, 607.0, 535.0, 463.0, 424.0, 451.0, 398.0, 401.0, 372.0, 372.0, 356.0, 352.0, 354.0, 341.0, 332.0, 356.0, 348.0, 356.0, 347.0, 378.0, 366.0, 412.0, 360.0, 406.0, 453.0, 456.0, 449.0, 475.0, 493.0, 487.0, 617.0, 582.0, 671.0, 663.0, 755.0, 796.0, 901.0, 996.0, 1219.0, 1438.0, 2033.0], [1755.0, 1552.0, 1447.0, 1391.0, 1310.0, 1300.0, 1255.0, 1160.0, 1082.0, 1027.0, 983.0, 980.0, 964.0, 867.0, 873.0, 806.0, 755.0, 708.0, 697.0, 665.0, 640.0, 668.0, 588.0, 530.0, 513.0, 571.0, 539.0, 517.0, 468.0, 537.0, 493.0, 457.0, 525.0, 508.0, 496.0, 492.0, 497.0, 544.0, 547.0, 580.0, 645.0, 678.0, 740.0, 824.0, 990.0, 1125.0, 1393.0, 1823.0, 2827.0], [413.0, 244.0, 278.0, 266.0, 301.0, 291.0, 324.0, 347.0, 386.0, 400.0, 458.0, 462.0, 494.0, 496.0, 525.0, 525.0, 604.0, 549.0, 643.0, 647.0, 615.0, 722.0, 730.0, 716.0, 754.0, 790.0, 752.0, 796.0, 808.0, 868.0, 851.0, 849.0, 910.0, 917.0, 930.0, 915.0, 958.0, 974.0, 1021.0, 990.0, 950.0, 1082.0, 1083.0, 1190.0, 1313.0, 1416.0, 1664.0, 2152.0, 3497.0], [300.0, 107.0, 96.0, 61.0, 52.0, 72.0, 55.0, 58.0, 57.0, 77.0, 76.0, 82.0, 96.0, 104.0, 85.0, 97.0, 114.0, 123.0, 143.0, 145.0, 149.0, 182.0, 192.0, 214.0, 199.0, 249.0, 267.0, 289.0, 322.0, 323.0, 400.0, 412.0, 456.0, 502.0, 544.0, 616.0, 697.0, 804.0, 844.0, 972.0, 1112.0, 1255.0, 1422.0, 1610.0, 1931.0, 2230.0, 2774.0, 3667.0, 5544.0], [272.0, 122.0, 77.0, 58.0, 39.0, 36.0, 25.0, 26.0, 40.0, 25.0, 41.0, 29.0, 24.0, 36.0, 40.0, 36.0, 23.0, 39.0, 27.0, 46.0, 41.0, 36.0, 44.0, 43.0, 38.0, 53.0, 70.0, 61.0, 71.0, 71.0, 78.0, 79.0, 105.0, 108.0, 128.0, 150.0, 171.0, 233.0, 248.0, 267.0, 348.0, 366.0, 495.0, 664.0, 803.0, 1153.0, 1826.0, 3116.0, 6217.0], [303.0, 109.0, 76.0, 47.0, 48.0, 31.0, 19.0, 25.0, 29.0, 32.0, 29.0, 22.0, 27.0, 30.0, 27.0, 23.0, 23.0, 24.0, 17.0, 20.0, 9.0, 24.0, 26.0, 25.0, 26.0, 23.0, 22.0, 21.0, 20.0, 23.0, 38.0, 24.0, 35.0, 42.0, 47.0, 40.0, 45.0, 60.0, 81.0, 66.0, 102.0, 115.0, 148.0, 194.0, 227.0, 387.0, 564.0, 1119.0, 3090.0], [399.0, 133.0, 66.0, 44.0, 32.0, 30.0, 23.0, 31.0, 28.0, 27.0, 26.0, 36.0, 22.0, 28.0, 17.0, 11.0, 24.0, 14.0, 12.0, 17.0, 15.0, 17.0, 14.0, 16.0, 19.0, 18.0, 16.0, 15.0, 18.0, 17.0, 23.0, 24.0, 18.0, 21.0, 21.0, 24.0, 22.0, 18.0, 37.0, 34.0, 43.0, 45.0, 54.0, 54.0, 92.0, 125.0, 216.0, 382.0, 1234.0], [568.0, 132.0, 74.0, 41.0, 30.0, 22.0, 29.0, 22.0, 25.0, 23.0, 28.0, 19.0, 18.0, 21.0, 23.0, 23.0, 27.0, 17.0, 15.0, 15.0, 17.0, 15.0, 16.0, 12.0, 9.0, 7.0, 17.0, 14.0, 18.0, 22.0, 12.0, 12.0, 17.0, 19.0, 13.0, 18.0, 16.0, 11.0, 19.0, 24.0, 17.0, 20.0, 35.0, 39.0, 38.0, 46.0, 91.0, 150.0, 511.0], [986.0, 243.0, 82.0, 57.0, 38.0, 33.0, 36.0, 20.0, 16.0, 28.0, 24.0, 19.0, 22.0, 13.0, 21.0, 18.0, 22.0, 8.0, 11.0, 10.0, 14.0, 16.0, 12.0, 6.0, 14.0, 20.0, 6.0, 12.0, 12.0, 19.0, 18.0, 20.0, 8.0, 9.0, 15.0, 21.0, 9.0, 14.0, 14.0, 10.0, 18.0, 14.0, 21.0, 18.0, 34.0, 38.0, 38.0, 77.0, 202.0], [1757.0, 479.0, 199.0, 73.0, 43.0, 30.0, 24.0, 27.0, 23.0, 24.0, 22.0, 13.0, 20.0, 13.0, 22.0, 9.0, 18.0, 19.0, 14.0, 18.0, 11.0, 11.0, 9.0, 11.0, 12.0, 11.0, 12.0, 7.0, 10.0, 10.0, 10.0, 14.0, 15.0, 14.0, 9.0, 14.0, 6.0, 11.0, 27.0, 14.0, 11.0, 14.0, 12.0, 21.0, 15.0, 24.0, 31.0, 57.0, 137.0], [2773.0, 962.0, 395.0, 173.0, 130.0, 62.0, 51.0, 34.0, 23.0, 25.0, 26.0, 21.0, 20.0, 10.0, 24.0, 16.0, 17.0, 16.0, 12.0, 12.0, 15.0, 7.0, 11.0, 14.0, 20.0, 12.0, 11.0, 6.0, 8.0, 8.0, 12.0, 16.0, 12.0, 11.0, 12.0, 10.0, 7.0, 10.0, 8.0, 15.0, 13.0, 8.0, 10.0, 11.0, 17.0, 19.0, 22.0, 35.0, 87.0], [3981.0, 1782.0, 817.0, 446.0, 292.0, 159.0, 107.0, 68.0, 65.0, 44.0, 34.0, 40.0, 29.0, 15.0, 20.0, 18.0, 10.0, 17.0, 14.0, 12.0, 8.0, 10.0, 9.0, 8.0, 9.0, 7.0, 13.0, 9.0, 13.0, 6.0, 11.0, 14.0, 11.0, 16.0, 16.0, 2.0, 10.0, 12.0, 4.0, 15.0, 12.0, 16.0, 10.0, 13.0, 8.0, 18.0, 15.0, 30.0, 54.0], [4719.0, 2501.0, 1522.0, 907.0, 586.0, 385.0, 288.0, 213.0, 140.0, 125.0, 84.0, 80.0, 64.0, 47.0, 34.0, 31.0, 25.0, 21.0, 14.0, 18.0, 15.0, 11.0, 20.0, 10.0, 14.0, 14.0, 8.0, 12.0, 6.0, 10.0, 8.0, 7.0, 13.0, 6.0, 12.0, 9.0, 8.0, 6.0, 14.0, 11.0, 9.0, 15.0, 9.0, 6.0, 9.0, 9.0, 23.0, 21.0, 48.0], [4688.0, 2990.0, 2080.0, 1502.0, 1099.0, 803.0, 582.0, 449.0, 348.0, 282.0, 200.0, 147.0, 122.0, 103.0, 80.0, 69.0, 67.0, 56.0, 58.0, 37.0, 38.0, 27.0, 20.0, 26.0, 14.0, 17.0, 9.0, 15.0, 6.0, 6.0, 11.0, 14.0, 16.0, 7.0, 14.0, 10.0, 1.0, 6.0, 4.0, 3.0, 13.0, 9.0, 8.0, 13.0, 14.0, 8.0, 14.0, 28.0, 45.0], [3956.0, 2891.0, 2450.0, 1809.0, 1511.0, 1231.0, 1024.0, 858.0, 677.0, 576.0, 475.0, 375.0, 304.0, 262.0, 248.0, 186.0, 170.0, 143.0, 95.0, 89.0, 72.0, 73.0, 56.0, 40.0, 37.0, 32.0, 37.0, 36.0, 31.0, 26.0, 19.0, 18.0, 15.0, 13.0, 19.0, 14.0, 8.0, 15.0, 7.0, 8.0, 7.0, 12.0, 7.0, 8.0, 12.0, 6.0, 15.0, 14.0, 25.0], [2884.0, 2362.0, 2117.0, 1948.0, 1673.0, 1394.0, 1267.0, 1111.0, 980.0, 869.0, 751.0, 664.0, 570.0, 529.0, 429.0, 346.0, 308.0, 278.0, 250.0, 181.0, 175.0, 182.0, 138.0, 145.0, 105.0, 102.0, 87.0, 71.0, 66.0, 39.0, 48.0, 36.0, 27.0, 39.0, 26.0, 35.0, 20.0, 23.0, 12.0, 15.0, 11.0, 8.0, 11.0, 13.0, 10.0, 20.0, 10.0, 18.0, 22.0], [1726.0, 1622.0, 1580.0, 1506.0, 1373.0, 1397.0, 1268.0, 1208.0, 1097.0, 1068.0, 941.0, 933.0, 834.0, 745.0, 745.0, 613.0, 587.0, 497.0, 458.0, 416.0, 387.0, 332.0, 310.0, 300.0, 231.0, 248.0, 207.0, 170.0, 156.0, 165.0, 108.0, 113.0, 91.0, 100.0, 70.0, 71.0, 55.0, 54.0, 50.0, 30.0, 24.0, 24.0, 28.0, 21.0, 19.0, 22.0, 25.0, 16.0, 25.0], [982.0, 913.0, 974.0, 1035.0, 1081.0, 1024.0, 1107.0, 1054.0, 996.0, 986.0, 1036.0, 905.0, 886.0, 885.0, 863.0, 809.0, 746.0, 708.0, 700.0, 653.0, 647.0, 525.0, 514.0, 463.0, 448.0, 463.0, 395.0, 325.0, 302.0, 276.0, 279.0, 251.0, 216.0, 203.0, 189.0, 146.0, 132.0, 127.0, 108.0, 110.0, 88.0, 75.0, 58.0, 56.0, 50.0, 39.0, 32.0, 38.0, 21.0], [551.0, 510.0, 498.0, 580.0, 633.0, 648.0, 699.0, 736.0, 792.0, 760.0, 798.0, 793.0, 748.0, 831.0, 829.0, 875.0, 736.0, 723.0, 760.0, 757.0, 701.0, 737.0, 670.0, 672.0, 679.0, 616.0, 589.0, 556.0, 578.0, 548.0, 513.0, 460.0, 408.0, 379.0, 338.0, 339.0, 307.0, 291.0, 262.0, 214.0, 229.0, 206.0, 164.0, 124.0, 131.0, 101.0, 80.0, 89.0, 66.0], [382.0, 250.0, 258.0, 306.0, 313.0, 371.0, 369.0, 441.0, 431.0, 514.0, 494.0, 521.0, 557.0, 603.0, 633.0, 627.0, 635.0, 682.0, 682.0, 710.0, 703.0, 709.0, 736.0, 744.0, 728.0, 752.0, 726.0, 761.0, 683.0, 642.0, 633.0, 645.0, 662.0, 575.0, 623.0, 610.0, 562.0, 522.0, 466.0, 453.0, 427.0, 419.0, 361.0, 327.0, 299.0, 258.0, 206.0, 209.0, 159.0], [279.0, 150.0, 125.0, 109.0, 136.0, 163.0, 194.0, 209.0, 255.0, 258.0, 274.0, 297.0, 331.0, 367.0, 401.0, 437.0, 416.0, 480.0, 437.0, 541.0, 561.0, 613.0, 588.0, 657.0, 620.0, 686.0, 709.0, 709.0, 680.0, 717.0, 733.0, 735.0, 735.0, 760.0, 743.0, 797.0, 757.0, 742.0, 742.0, 714.0, 689.0, 712.0, 685.0, 658.0, 601.0, 541.0, 518.0, 481.0, 419.0], [259.0, 99.0, 75.0, 51.0, 51.0, 61.0, 82.0, 102.0, 128.0, 126.0, 139.0, 180.0, 190.0, 188.0, 216.0, 250.0, 244.0, 270.0, 305.0, 289.0, 318.0, 392.0, 366.0, 489.0, 440.0, 488.0, 525.0, 581.0, 580.0, 597.0, 624.0, 711.0, 709.0, 769.0, 782.0, 804.0, 830.0, 861.0, 917.0, 931.0, 942.0, 949.0, 1003.0, 937.0, 927.0, 1015.0, 980.0, 907.0, 948.0], [249.0, 106.0, 61.0, 33.0, 45.0, 30.0, 38.0, 38.0, 66.0, 62.0, 72.0, 65.0, 95.0, 91.0, 100.0, 99.0, 135.0, 119.0, 151.0, 158.0, 166.0, 211.0, 229.0, 247.0, 253.0, 323.0, 330.0, 329.0, 371.0, 424.0, 482.0, 520.0, 578.0, 639.0, 656.0, 689.0, 769.0, 812.0, 890.0, 924.0, 975.0, 1085.0, 1163.0, 1154.0, 1326.0, 1391.0, 1437.0, 1524.0, 1732.0], [256.0, 76.0, 48.0, 44.0, 16.0, 25.0, 26.0, 30.0, 29.0, 28.0, 49.0, 35.0, 39.0, 44.0, 38.0, 38.0, 64.0, 76.0, 86.0, 75.0, 75.0, 107.0, 108.0, 122.0, 168.0, 142.0, 171.0, 209.0, 220.0, 253.0, 266.0, 348.0, 332.0, 391.0, 472.0, 521.0, 537.0, 593.0, 664.0, 807.0, 827.0, 989.0, 1147.0, 1249.0, 1443.0, 1650.0, 1894.0, 2059.0, 2589.0], [263.0, 93.0, 47.0, 31.0, 16.0, 23.0, 22.0, 17.0, 33.0, 21.0, 12.0, 17.0, 23.0, 24.0, 17.0, 20.0, 22.0, 19.0, 29.0, 34.0, 47.0, 54.0, 54.0, 67.0, 55.0, 73.0, 82.0, 112.0, 102.0, 109.0, 144.0, 157.0, 163.0, 207.0, 240.0, 308.0, 330.0, 377.0, 478.0, 506.0, 628.0, 745.0, 880.0, 1050.0, 1267.0, 1543.0, 1965.0, 2520.0, 3553.0], [245.0, 85.0, 49.0, 21.0, 27.0, 16.0, 19.0, 23.0, 20.0, 24.0, 22.0, 25.0, 20.0, 23.0, 13.0, 9.0, 13.0, 9.0, 11.0, 20.0, 16.0, 19.0, 18.0, 26.0, 31.0, 32.0, 39.0, 41.0, 52.0, 62.0, 61.0, 79.0, 102.0, 118.0, 106.0, 160.0, 201.0, 214.0, 260.0, 314.0, 388.0, 481.0, 595.0, 757.0, 968.0, 1279.0, 1741.0, 2472.0, 3852.0], [264.0, 75.0, 42.0, 32.0, 25.0, 18.0, 22.0, 23.0, 19.0, 17.0, 19.0, 12.0, 17.0, 17.0, 12.0, 12.0, 11.0, 8.0, 13.0, 21.0, 13.0, 11.0, 14.0, 14.0, 20.0, 10.0, 19.0, 22.0, 21.0, 25.0, 34.0, 30.0, 38.0, 55.0, 61.0, 65.0, 74.0, 98.0, 105.0, 169.0, 195.0, 262.0, 315.0, 471.0, 663.0, 840.0, 1272.0, 2123.0, 3812.0], [258.0, 79.0, 65.0, 29.0, 13.0, 17.0, 17.0, 23.0, 23.0, 17.0, 14.0, 25.0, 21.0, 13.0, 15.0, 15.0, 16.0, 13.0, 9.0, 11.0, 4.0, 11.0, 11.0, 8.0, 9.0, 13.0, 12.0, 12.0, 13.0, 14.0, 19.0, 16.0, 17.0, 21.0, 16.0, 29.0, 39.0, 44.0, 54.0, 73.0, 87.0, 113.0, 178.0, 244.0, 365.0, 525.0, 872.0, 1474.0, 3146.0], [261.0, 81.0, 50.0, 27.0, 25.0, 25.0, 25.0, 15.0, 12.0, 17.0, 18.0, 21.0, 12.0, 18.0, 16.0, 13.0, 16.0, 10.0, 14.0, 10.0, 12.0, 8.0, 5.0, 7.0, 6.0, 9.0, 10.0, 5.0, 9.0, 10.0, 6.0, 9.0, 11.0, 12.0, 18.0, 14.0, 16.0, 17.0, 24.0, 37.0, 32.0, 44.0, 71.0, 112.0, 165.0, 312.0, 488.0, 939.0, 2382.0], [223.0, 102.0, 46.0, 32.0, 22.0, 15.0, 22.0, 21.0, 15.0, 15.0, 18.0, 24.0, 24.0, 13.0, 21.0, 9.0, 11.0, 13.0, 3.0, 9.0, 10.0, 7.0, 10.0, 11.0, 11.0, 11.0, 12.0, 10.0, 7.0, 13.0, 8.0, 6.0, 8.0, 12.0, 4.0, 12.0, 11.0, 8.0, 13.0, 16.0, 12.0, 28.0, 24.0, 48.0, 62.0, 122.0, 268.0, 552.0, 1588.0], [274.0, 101.0, 42.0, 26.0, 23.0, 19.0, 19.0, 20.0, 12.0, 28.0, 18.0, 16.0, 12.0, 12.0, 13.0, 19.0, 16.0, 8.0, 11.0, 14.0, 9.0, 9.0, 11.0, 10.0, 9.0, 12.0, 11.0, 6.0, 9.0, 6.0, 7.0, 11.0, 11.0, 5.0, 8.0, 2.0, 7.0, 9.0, 9.0, 4.0, 10.0, 10.0, 13.0, 15.0, 28.0, 59.0, 114.0, 269.0, 1014.0], [238.0, 81.0, 42.0, 33.0, 22.0, 19.0, 20.0, 21.0, 18.0, 21.0, 19.0, 15.0, 15.0, 12.0, 17.0, 12.0, 14.0, 10.0, 10.0, 12.0, 9.0, 9.0, 7.0, 10.0, 12.0, 7.0, 8.0, 8.0, 4.0, 10.0, 11.0, 13.0, 9.0, 16.0, 9.0, 9.0, 5.0, 4.0, 7.0, 9.0, 4.0, 7.0, 6.0, 7.0, 10.0, 22.0, 46.0, 141.0, 539.0], [243.0, 73.0, 41.0, 36.0, 16.0, 29.0, 15.0, 22.0, 17.0, 23.0, 10.0, 19.0, 11.0, 17.0, 12.0, 6.0, 9.0, 17.0, 11.0, 13.0, 6.0, 7.0, 11.0, 12.0, 9.0, 11.0, 12.0, 8.0, 8.0, 12.0, 12.0, 7.0, 5.0, 8.0, 6.0, 5.0, 9.0, 5.0, 9.0, 3.0, 7.0, 11.0, 7.0, 5.0, 11.0, 12.0, 17.0, 50.0, 264.0], [237.0, 85.0, 49.0, 37.0, 24.0, 25.0, 17.0, 19.0, 18.0, 20.0, 17.0, 15.0, 15.0, 11.0, 10.0, 12.0, 9.0, 18.0, 12.0, 10.0, 11.0, 6.0, 9.0, 7.0, 15.0, 6.0, 10.0, 8.0, 10.0, 14.0, 12.0, 8.0, 4.0, 9.0, 9.0, 5.0, 5.0, 7.0, 4.0, 4.0, 4.0, 7.0, 4.0, 7.0, 6.0, 9.0, 11.0, 23.0, 134.0], [260.0, 79.0, 52.0, 31.0, 23.0, 22.0, 13.0, 21.0, 24.0, 12.0, 14.0, 17.0, 23.0, 20.0, 13.0, 17.0, 11.0, 14.0, 5.0, 9.0, 13.0, 13.0, 9.0, 8.0, 5.0, 7.0, 9.0, 11.0, 10.0, 6.0, 4.0, 9.0, 8.0, 7.0, 8.0, 7.0, 7.0, 12.0, 5.0, 3.0, 8.0, 7.0, 10.0, 8.0, 6.0, 3.0, 10.0, 15.0, 68.0], [228.0, 97.0, 34.0, 36.0, 23.0, 19.0, 21.0, 15.0, 25.0, 15.0, 18.0, 19.0, 21.0, 12.0, 20.0, 10.0, 14.0, 9.0, 6.0, 13.0, 10.0, 5.0, 7.0, 9.0, 12.0, 5.0, 10.0, 17.0, 5.0, 13.0, 9.0, 10.0, 10.0, 11.0, 5.0, 4.0, 2.0, 8.0, 10.0, 6.0, 12.0, 6.0, 4.0, 2.0, 5.0, 2.0, 8.0, 12.0, 31.0], [242.0, 79.0, 50.0, 34.0, 22.0, 19.0, 23.0, 16.0, 22.0, 18.0, 20.0, 15.0, 20.0, 17.0, 12.0, 16.0, 15.0, 11.0, 6.0, 14.0, 7.0, 10.0, 16.0, 9.0, 8.0, 7.0, 9.0, 10.0, 2.0, 7.0, 11.0, 7.0, 9.0, 4.0, 9.0, 7.0, 6.0, 6.0, 6.0, 3.0, 10.0, 8.0, 7.0, 5.0, 6.0, 5.0, 5.0, 14.0, 17.0], [261.0, 84.0, 43.0, 28.0, 31.0, 18.0, 16.0, 25.0, 18.0, 17.0, 24.0, 13.0, 12.0, 11.0, 17.0, 13.0, 14.0, 14.0, 11.0, 14.0, 14.0, 6.0, 10.0, 6.0, 7.0, 8.0, 4.0, 9.0, 9.0, 11.0, 10.0, 4.0, 11.0, 7.0, 8.0, 9.0, 9.0, 5.0, 6.0, 3.0, 7.0, 10.0, 7.0, 3.0, 5.0, 5.0, 5.0, 7.0, 15.0], [248.0, 96.0, 46.0, 26.0, 17.0, 19.0, 17.0, 20.0, 17.0, 21.0, 24.0, 20.0, 22.0, 17.0, 14.0, 11.0, 10.0, 9.0, 12.0, 11.0, 15.0, 10.0, 8.0, 5.0, 8.0, 8.0, 8.0, 9.0, 11.0, 10.0, 5.0, 3.0, 11.0, 7.0, 9.0, 9.0, 6.0, 3.0, 5.0, 6.0, 4.0, 7.0, 6.0, 6.0, 4.0, 7.0, 5.0, 8.0, 12.0], [246.0, 98.0, 57.0, 43.0, 17.0, 14.0, 22.0, 20.0, 17.0, 18.0, 19.0, 14.0, 19.0, 16.0, 15.0, 9.0, 8.0, 10.0, 13.0, 8.0, 11.0, 9.0, 11.0, 9.0, 13.0, 5.0, 7.0, 8.0, 8.0, 12.0, 13.0, 13.0, 5.0, 9.0, 4.0, 6.0, 9.0, 5.0, 7.0, 7.0, 10.0, 6.0, 9.0, 4.0, 6.0, 6.0, 6.0, 5.0, 5.0], [243.0, 100.0, 43.0, 32.0, 22.0, 19.0, 14.0, 15.0, 15.0, 17.0, 24.0, 20.0, 16.0, 16.0, 12.0, 16.0, 10.0, 12.0, 12.0, 13.0, 10.0, 9.0, 10.0, 8.0, 6.0, 10.0, 12.0, 13.0, 12.0, 10.0, 12.0, 8.0, 8.0, 4.0, 8.0, 9.0, 9.0, 5.0, 6.0, 5.0, 8.0, 7.0, 4.0, 8.0, 2.0, 5.0, 7.0, 5.0, 8.0], [268.0, 94.0, 47.0, 31.0, 16.0, 25.0, 12.0, 16.0, 16.0, 19.0, 16.0, 26.0, 31.0, 11.0, 14.0, 15.0, 13.0, 10.0, 9.0, 10.0, 5.0, 9.0, 10.0, 12.0, 9.0, 12.0, 11.0, 5.0, 5.0, 4.0, 11.0, 12.0, 9.0, 13.0, 5.0, 6.0, 4.0, 10.0, 5.0, 3.0, 12.0, 4.0, 3.0, 6.0, 3.0, 7.0, 4.0, 6.0, 6.0], [225.0, 90.0, 44.0, 31.0, 24.0, 20.0, 23.0, 19.0, 14.0, 25.0, 13.0, 18.0, 17.0, 18.0, 16.0, 8.0, 8.0, 11.0, 13.0, 6.0, 5.0, 5.0, 10.0, 7.0, 4.0, 8.0, 11.0, 15.0, 13.0, 9.0, 7.0, 13.0, 5.0, 8.0, 10.0, 16.0, 8.0, 8.0, 7.0, 8.0, 4.0, 6.0, 5.0, 5.0, 7.0, 2.0, 11.0, 3.0, 7.0], [263.0, 84.0, 39.0, 34.0, 15.0, 18.0, 14.0, 20.0, 16.0, 16.0, 28.0, 19.0, 20.0, 12.0, 19.0, 16.0, 15.0, 9.0, 7.0, 12.0, 4.0, 5.0, 12.0, 9.0, 8.0, 7.0, 9.0, 12.0, 12.0, 15.0, 9.0, 9.0, 10.0, 13.0, 7.0, 4.0, 5.0, 8.0, 10.0, 7.0, 9.0, 8.0, 3.0, 3.0, 4.0, 6.0, 3.0, 1.0, 9.0], [270.0, 91.0, 51.0, 31.0, 21.0, 23.0, 19.0, 24.0, 21.0, 20.0, 12.0, 22.0, 10.0, 17.0, 13.0, 10.0, 11.0, 12.0, 7.0, 8.0, 12.0, 6.0, 8.0, 11.0, 9.0, 10.0, 10.0, 11.0, 5.0, 13.0, 9.0, 11.0, 9.0, 13.0, 4.0, 4.0, 9.0, 7.0, 4.0, 8.0, 9.0, 8.0, 3.0, 3.0, 1.0, 4.0, 8.0, 4.0, 6.0]],
    "Name": "sCurve-0",
    "Overflow": 2651685.0,
    "Type": "Histo2d",
    "Underflow": 0.0,
    "x": {
        "AxisTitle": "Vcal",
        "Bins": 51,
        "High": 302.5,
        "Low": 47.5
    },
    "y": {
        "AxisTitle": "Occupancy",
        "Bins": 49,
        "High": 49.5,
        "Low": 0.5
    },
    "z": {
        "AxisTitle": "Number of pixels"
    }
}