time,Hardware,Voltage,Current
1626744058921,high-voltage-2,1,0.107503
time,Hardware,Voltage,Current
1626744058921,high-voltage-2,2,0.158091
time,Hardware,Voltage,Current
1626744058921,high-voltage-2,3,0.188829
time,Hardware,Voltage,Current
1626744058921,high-voltage-2,4,0.213581
time,Hardware,Voltage,Current
1626744058921,high-voltage-2,5,0.236363
time,Hardware,Voltage,Current
1626744058921,high-voltage-2,6,0.26232
time,Hardware,Voltage,Current
1626744058921,high-voltage-2,7,0.288675
time,Hardware,Voltage,Current
1626744058921,high-voltage-2,8,0.31452
time,Hardware,Voltage,Current
1626744058921,high-voltage-2,9,0.340489
time,Hardware,Voltage,Current
1626744058921,high-voltage-2,10,0.363139
time,Hardware,Voltage,Current
1626744058921,high-voltage-2,11,0.385799
time,Hardware,Voltage,Current
1626744058921,high-voltage-2,12,0.405376
time,Hardware,Voltage,Current
1626744058921,high-voltage-2,13,0.420659
time,Hardware,Voltage,Current
1626744058921,high-voltage-2,14,0.434962
time,Hardware,Voltage,Current
1626744058921,high-voltage-2,15,0.449015
time,Hardware,Voltage,Current
1626744058921,high-voltage-2,16,0.459849
time,Hardware,Voltage,Current
1626744058921,high-voltage-2,17,0.471905
time,Hardware,Voltage,Current
1626744058921,high-voltage-2,18,0.483357
time,Hardware,Voltage,Current
1626744058921,high-voltage-2,19,0.493332
time,Hardware,Voltage,Current
1626744058921,high-voltage-2,20,0.50202
time,Hardware,Voltage,Current
1626744058921,high-voltage-2,25,0.554497
time,Hardware,Voltage,Current
1626744058921,high-voltage-2,30,0.608061
time,Hardware,Voltage,Current
1626744058921,high-voltage-2,35,0.660608
time,Hardware,Voltage,Current
1626744058921,high-voltage-2,40,0.722334
time,Hardware,Voltage,Current
1626744058921,high-voltage-2,45,0.800914
time,Hardware,Voltage,Current
1626744058921,high-voltage-2,50,0.860106
time,Hardware,Voltage,Current
1626744058921,high-voltage-2,55,0.918477
time,Hardware,Voltage,Current
1626744058921,high-voltage-2,60,0.972026
time,Hardware,Voltage,Current
1626744058921,high-voltage-2,65,1.0265
time,Hardware,Voltage,Current
1626744058921,high-voltage-2,70,1.07763
time,Hardware,Voltage,Current
1626744058921,high-voltage-2,75,1.12689
time,Hardware,Voltage,Current
1626744058921,high-voltage-2,80,1.17427
time,Hardware,Voltage,Current
1626744058921,high-voltage-2,85,1.21544
time,Hardware,Voltage,Current
1626744058921,high-voltage-2,90,1.2541
time,Hardware,Voltage,Current
1626744058921,high-voltage-2,95,1.28446
time,Hardware,Voltage,Current
1626744058921,high-voltage-2,100,1.31262
