{
    "chipType" : "RD53A",
    "chips" : [
        {
            "config" : "/home/eresseguie/Yarr/configs/rd53a_3dmodule_A.json",
            "tx" : 0,
            "rx" : 0,
            "enable" : 1,
            "locked" : 0
        },
	{
            "config" : "/home/eresseguie/Yarr/configs/rd53a_3dmodule_B.json",
            "tx" : 1,
            "rx" : 1,
            "enable" : 1,
            "locked" : 0
        },
        {
            "config" : "/home/eresseguie/Yarr/configs/rd53a_3dmodule_C.json",
            "tx" : 2,
            "rx" : 2,
            "enable" : 1,
            "locked" : 0
        },
        {
            "config" : "/home/eresseguie/Yarr/configs/rd53a_Triplet1107_IndCmdChipC.json",
            "tx" : 3,
            "rx" : 3,
            "enable" : 0,
            "locked" : 0
        }
    ]
}
