time,Hardware,Voltage,Current
1625779721950,high-voltage-3,1,0.0633378
time,Hardware,Voltage,Current
1625779721950,high-voltage-3,2,0.0681977
time,Hardware,Voltage,Current
1625779721950,high-voltage-3,3,0.0739407
time,Hardware,Voltage,Current
1625779721950,high-voltage-3,4,0.0764875
time,Hardware,Voltage,Current
1625779721950,high-voltage-3,5,0.0814236
time,Hardware,Voltage,Current
1625779721950,high-voltage-3,6,0.0832801
time,Hardware,Voltage,Current
1625779721950,high-voltage-3,7,0.0855375
time,Hardware,Voltage,Current
1625779721950,high-voltage-3,8,0.0892378
time,Hardware,Voltage,Current
1625779721950,high-voltage-3,9,0.091877
time,Hardware,Voltage,Current
1625779721950,high-voltage-3,10,0.0946672
time,Hardware,Voltage,Current
1625779721950,high-voltage-3,11,0.0974077
time,Hardware,Voltage,Current
1625779721950,high-voltage-3,12,0.0996094
time,Hardware,Voltage,Current
1625779721950,high-voltage-3,13,0.102864
time,Hardware,Voltage,Current
1625779721950,high-voltage-3,14,0.105051
time,Hardware,Voltage,Current
1625779721950,high-voltage-3,15,0.107246
time,Hardware,Voltage,Current
1625779721950,high-voltage-3,16,0.109983
time,Hardware,Voltage,Current
1625779721950,high-voltage-3,17,0.113327
time,Hardware,Voltage,Current
1625779721950,high-voltage-3,18,0.11534
time,Hardware,Voltage,Current
1625779721950,high-voltage-3,19,0.11775
time,Hardware,Voltage,Current
1625779721950,high-voltage-3,20,0.11977
time,Hardware,Voltage,Current
1625779721950,high-voltage-3,25,0.129081
time,Hardware,Voltage,Current
1625779721950,high-voltage-3,30,0.136877
time,Hardware,Voltage,Current
1625779721950,high-voltage-3,35,0.146247
time,Hardware,Voltage,Current
1625779721950,high-voltage-3,40,0.154709
time,Hardware,Voltage,Current
1625779721950,high-voltage-3,45,0.162526
time,Hardware,Voltage,Current
1625779721950,high-voltage-3,50,0.17212
time,Hardware,Voltage,Current
1625779721950,high-voltage-3,55,0.179947
time,Hardware,Voltage,Current
1625779721950,high-voltage-3,60,0.189323
time,Hardware,Voltage,Current
1625779721950,high-voltage-3,65,0.199982
time,Hardware,Voltage,Current
1625779721950,high-voltage-3,70,0.210387
time,Hardware,Voltage,Current
1625779721950,high-voltage-3,75,0.22064
time,Hardware,Voltage,Current
1625779721950,high-voltage-3,80,0.231772
time,Hardware,Voltage,Current
1625779721950,high-voltage-3,85,0.241604
time,Hardware,Voltage,Current
1625779721950,high-voltage-3,90,0.251777
time,Hardware,Voltage,Current
1625779721950,high-voltage-3,95,0.262195
time,Hardware,Voltage,Current
1625779721950,high-voltage-3,100,0.27206
