{
    "Data": [0.0, 0.0, 0.0, 0.0, 0.0, 0.0, 0.0, 0.0, 0.0, 0.0, 0.0, 0.0, 0.0, 0.0, 1.0, 0.0, 2.0, 1.0, 1.0, 17.0, 3.0, 0.0, 8.0, 18.0, 2.0, 2.0, 32.0, 7.0, 5.0, 11.0, 16.0, 48.0, 39.0, 16.0, 9.0, 14.0, 7.0, 31.0, 50.0, 5.0, 36.0, 14.0, 6.0, 7.0, 50.0, 50.0, 2.0, 50.0, 50.0, 50.0, 50.0],
    "Name": "Scurve-90-96",
    "Overflow": 0.0,
    "Type": "Histo1d",
    "Underflow": 0.0,
    "x": {
        "AxisTitle": "Vcal",
        "Bins": 51,
        "High": 302.5,
        "Low": 47.5
    },
    "y": {
        "AxisTitle": "Occupancy"
    },
    "z": {
        "AxisTitle": "z"
    }
}