{
    "Data": [0.0, 0.0, 0.0, 0.0, 0.0, 0.0, 0.0, 0.0, 0.0, 0.0, 0.0, 0.0, 0.0, 0.0, 0.0, 0.0, 0.0, 0.0, 0.0, 0.0, 0.0, 0.0, 0.0, 0.0, 0.0, 0.0, 0.0, 0.0, 0.0, 0.0, 0.0, 0.0, 0.0, 0.0, 0.0, 0.0, 0.0, 0.0, 0.0, 0.0, 0.0, 0.0, 0.0, 0.0, 0.0, 0.0, 0.0, 0.0, 0.0, 0.0, 1.0, 10.0, 2.0, 2.0, 7.0, 7.0, 10.0, 13.0, 12.0, 14.0, 14.0, 18.0, 17.0, 18.0, 15.0, 6.0, 11.0, 6.0, 5.0, 11.0, 13.0, 11.0, 15.0, 26.0, 20.0, 35.0, 40.0, 63.0, 67.0, 78.0, 118.0, 138.0, 164.0, 196.0, 251.0, 272.0, 353.0, 416.0, 484.0, 653.0, 948.0, 1455.0, 2149.0, 3228.0, 4226.0, 5027.0, 5401.0, 5416.0, 4923.0, 3985.0, 3177.0, 2156.0, 1367.0, 941.0, 701.0, 548.0, 443.0, 384.0, 272.0, 212.0, 172.0, 148.0, 104.0, 102.0, 67.0, 63.0, 48.0, 43.0, 49.0, 49.0, 32.0, 43.0, 39.0, 33.0, 28.0, 21.0, 30.0, 26.0, 19.0, 27.0, 28.0, 17.0, 11.0, 24.0, 18.0, 13.0, 19.0, 12.0, 18.0, 13.0, 7.0, 10.0, 10.0, 12.0, 6.0, 8.0, 11.0, 10.0, 11.0, 6.0, 12.0, 5.0, 4.0, 11.0, 6.0, 5.0, 3.0, 7.0, 9.0, 5.0, 9.0, 9.0, 13.0, 18.0, 15.0, 23.0, 30.0, 27.0, 34.0, 55.0, 69.0, 67.0, 92.0, 120.0, 124.0, 167.0, 170.0, 247.0, 244.0, 294.0, 329.0, 375.0, 434.0, 423.0, 534.0, 547.0, 590.0, 631.0, 664.0, 690.0, 725.0, 739.0, 782.0, 836.0, 803.0, 749.0, 770.0, 814.0, 819.0, 707.0, 732.0, 747.0, 704.0, 657.0, 639.0, 556.0, 541.0, 506.0, 466.0, 415.0, 369.0, 381.0, 331.0, 298.0, 297.0, 281.0, 226.0, 212.0, 162.0, 150.0, 128.0, 120.0, 108.0, 91.0, 83.0, 64.0, 57.0, 55.0, 54.0, 31.0, 31.0, 23.0, 27.0, 24.0, 21.0, 15.0, 16.0, 11.0, 9.0, 5.0, 3.0, 12.0, 3.0, 3.0, 5.0, 1.0, 2.0, 2.0, 1.0, 0.0, 0.0, 0.0, 4.0, 0.0, 0.0, 0.0, 1.0, 0.0, 0.0, 0.0, 1.0, 1.0, 0.0, 0.0, 0.0, 0.0, 0.0, 0.0, 0.0, 0.0, 0.0, 0.0, 0.0, 0.0, 0.0, 0.0, 0.0, 0.0, 0.0, 0.0, 0.0, 0.0, 0.0, 0.0, 0.0, 0.0, 0.0, 0.0, 0.0, 0.0, 0.0, 0.0, 0.0, 0.0, 0.0, 0.0, 0.0, 0.0, 0.0, 0.0, 0.0, 0.0, 0.0, 0.0, 0.0, 0.0, 0.0, 0.0, 0.0, 0.0, 0.0, 0.0, 0.0, 0.0, 0.0, 0.0, 0.0, 0.0, 0.0, 0.0, 0.0, 0.0, 0.0, 0.0, 0.0, 0.0, 0.0, 0.0, 0.0, 0.0, 0.0, 0.0, 0.0, 0.0, 0.0, 0.0, 0.0, 0.0, 0.0, 0.0, 0.0, 0.0, 0.0, 0.0, 0.0, 0.0, 0.0, 0.0, 0.0, 0.0, 0.0, 0.0, 0.0, 0.0, 0.0, 0.0, 0.0, 0.0, 0.0, 0.0, 0.0, 0.0, 0.0, 0.0],
    "Name": "ThresholdDist-0",
    "Overflow": 0.0,
    "Type": "Histo1d",
    "Underflow": 0.0,
    "x": {
        "AxisTitle": "Threshold [e]",
        "Bins": 364,
        "High": 3635.0,
        "Low": -5.0
    },
    "y": {
        "AxisTitle": "Number of Pixels"
    },
    "z": {
        "AxisTitle": "z"
    }
}