time,Hardware,Voltage,Current
1626394168805,high-voltage-2,1,0.295916
time,Hardware,Voltage,Current
1626394168805,high-voltage-2,2,0.392548
time,Hardware,Voltage,Current
1626394168805,high-voltage-2,3,0.448107
time,Hardware,Voltage,Current
1626394168805,high-voltage-2,4,0.496193
time,Hardware,Voltage,Current
1626394168805,high-voltage-2,5,0.541206
time,Hardware,Voltage,Current
1626394168805,high-voltage-2,6,0.585362
time,Hardware,Voltage,Current
1626394168805,high-voltage-2,7,0.624659
time,Hardware,Voltage,Current
1626394168805,high-voltage-2,8,0.666065
time,Hardware,Voltage,Current
1626394168805,high-voltage-2,9,0.706686
time,Hardware,Voltage,Current
1626394168805,high-voltage-2,10,0.740374
time,Hardware,Voltage,Current
1626394168805,high-voltage-2,11,0.770848
time,Hardware,Voltage,Current
1626394168805,high-voltage-2,12,0.797767
time,Hardware,Voltage,Current
1626394168805,high-voltage-2,13,0.822635
time,Hardware,Voltage,Current
1626394168805,high-voltage-2,14,0.843882
time,Hardware,Voltage,Current
1626394168805,high-voltage-2,15,0.86633
time,Hardware,Voltage,Current
1626394168805,high-voltage-2,16,0.883382
time,Hardware,Voltage,Current
1626394168805,high-voltage-2,17,0.901751
time,Hardware,Voltage,Current
1626394168805,high-voltage-2,18,0.919121
time,Hardware,Voltage,Current
1626394168805,high-voltage-2,19,0.937337
time,Hardware,Voltage,Current
1626394168805,high-voltage-2,20,0.954549
time,Hardware,Voltage,Current
1626394168805,high-voltage-2,25,1.03424
time,Hardware,Voltage,Current
1626394168805,high-voltage-2,30,1.11532
time,Hardware,Voltage,Current
1626394168805,high-voltage-2,35,1.19944
time,Hardware,Voltage,Current
1626394168805,high-voltage-2,40,1.29693
time,Hardware,Voltage,Current
1626394168805,high-voltage-2,45,1.42103
time,Hardware,Voltage,Current
1626394168805,high-voltage-2,50,1.51011
time,Hardware,Voltage,Current
1626394168805,high-voltage-2,55,1.59064
time,Hardware,Voltage,Current
1626394168805,high-voltage-2,60,1.67045
time,Hardware,Voltage,Current
1626394168805,high-voltage-2,65,1.74724
time,Hardware,Voltage,Current
1626394168805,high-voltage-2,70,1.82022
time,Hardware,Voltage,Current
1626394168805,high-voltage-2,75,1.88819
time,Hardware,Voltage,Current
1626394168805,high-voltage-2,80,1.95835
time,Hardware,Voltage,Current
1626394168805,high-voltage-2,85,2.02365
time,Hardware,Voltage,Current
1626394168805,high-voltage-2,90,2.08741
time,Hardware,Voltage,Current
1626394168805,high-voltage-2,95,2.1506
time,Hardware,Voltage,Current
1626394168805,high-voltage-2,100,2.21031
