time,Hardware,Voltage,Current
1621618881029,high-voltage-3,1,0.231447
time,Hardware,Voltage,Current
1621618881029,high-voltage-3,2,0.244534
time,Hardware,Voltage,Current
1621618881029,high-voltage-3,3,0.254635
time,Hardware,Voltage,Current
1621618881029,high-voltage-3,4,0.265097
time,Hardware,Voltage,Current
1621618881029,high-voltage-3,5,0.273539
time,Hardware,Voltage,Current
1621618881029,high-voltage-3,6,0.283147
time,Hardware,Voltage,Current
1621618881029,high-voltage-3,7,0.290049
time,Hardware,Voltage,Current
1621618881029,high-voltage-3,8,0.298354
time,Hardware,Voltage,Current
1621618881029,high-voltage-3,9,0.308119
time,Hardware,Voltage,Current
1621618881029,high-voltage-3,10,0.315772
time,Hardware,Voltage,Current
1621618881029,high-voltage-3,11,0.326239
time,Hardware,Voltage,Current
1621618881029,high-voltage-3,12,0.334988
time,Hardware,Voltage,Current
1621618881029,high-voltage-3,13,0.343521
time,Hardware,Voltage,Current
1621618881029,high-voltage-3,14,0.349842
time,Hardware,Voltage,Current
1621618881029,high-voltage-3,15,0.356806
time,Hardware,Voltage,Current
1621618881029,high-voltage-3,16,0.362228
time,Hardware,Voltage,Current
1621618881029,high-voltage-3,17,0.369892
time,Hardware,Voltage,Current
1621618881029,high-voltage-3,18,0.375369
time,Hardware,Voltage,Current
1621618881029,high-voltage-3,19,0.379507
time,Hardware,Voltage,Current
1621618881029,high-voltage-3,20,0.384347
time,Hardware,Voltage,Current
1621618881029,high-voltage-3,25,0.411551
time,Hardware,Voltage,Current
1621618881029,high-voltage-3,30,0.435074
time,Hardware,Voltage,Current
1621618881029,high-voltage-3,35,0.45593
time,Hardware,Voltage,Current
1621618881029,high-voltage-3,40,0.47481
time,Hardware,Voltage,Current
1621618881029,high-voltage-3,45,0.493171
time,Hardware,Voltage,Current
1621618881029,high-voltage-3,50,0.509914
time,Hardware,Voltage,Current
1621618881029,high-voltage-3,55,0.52473
time,Hardware,Voltage,Current
1621618881029,high-voltage-3,60,0.540374
time,Hardware,Voltage,Current
1621618881029,high-voltage-3,65,0.555089
time,Hardware,Voltage,Current
1621618881029,high-voltage-3,70,0.569536
time,Hardware,Voltage,Current
1621618881029,high-voltage-3,75,0.583361
time,Hardware,Voltage,Current
1621618881029,high-voltage-3,80,0.598206
time,Hardware,Voltage,Current
1621618881029,high-voltage-3,85,0.611459
time,Hardware,Voltage,Current
1621618881029,high-voltage-3,90,0.624682
time,Hardware,Voltage,Current
1621618881029,high-voltage-3,95,0.636911
time,Hardware,Voltage,Current
1621618881029,high-voltage-3,100,0.650042
