{
    "Data": [14.0, 24.0, 1.0, 0.0, 5.0, 96.0, 467.0, 1501.0, 3015.0, 4373.0, 4449.0, 3737.0, 2922.0, 2556.0, 2381.0, 2210.0, 2014.0, 1872.0, 1807.0, 1831.0, 2135.0, 2329.0, 2393.0, 2338.0, 2037.0, 1572.0, 1129.0, 768.0, 492.0, 432.0, 385.0, 458.0, 595.0, 778.0, 973.0, 1150.0, 1455.0, 1634.0, 1835.0, 1907.0, 1910.0, 1866.0, 1782.0, 1538.0, 1352.0, 1189.0, 892.0, 746.0, 576.0, 460.0, 321.0, 220.0, 167.0, 126.0, 103.0, 65.0, 59.0, 56.0, 27.0, 34.0, 32.0, 24.0, 15.0, 14.0, 18.0, 15.0, 12.0, 12.0, 7.0, 12.0, 6.0, 5.0, 2.0, 6.0, 5.0, 4.0, 1.0, 3.0, 0.0, 2.0, 4.0, 0.0, 3.0, 2.0, 2.0, 1.0, 3.0, 2.0, 0.0, 3.0],
    "Name": "NoiseDist-0",
    "Overflow": 16.0,
    "Type": "Histo1d",
    "Underflow": 0.0,
    "x": {
        "AxisTitle": "Noise [e]",
        "Bins": 90,
        "High": 451.0,
        "Low": -2.0
    },
    "y": {
        "AxisTitle": "Number of Pixels"
    },
    "z": {
        "AxisTitle": "z"
    }
}