time,Hardware,Voltage,Current
1623304219787,high-voltage,1,0.0633618
time,Hardware,Voltage,Current
1623304219787,high-voltage,2,0.0830631
time,Hardware,Voltage,Current
1623304219787,high-voltage,3,0.101718
time,Hardware,Voltage,Current
1623304219787,high-voltage,4,0.115975
time,Hardware,Voltage,Current
1623304219787,high-voltage,5,0.126209
time,Hardware,Voltage,Current
1623304219787,high-voltage,6,0.137005
time,Hardware,Voltage,Current
1623304219787,high-voltage,7,0.145863
time,Hardware,Voltage,Current
1623304219787,high-voltage,8,0.154412
time,Hardware,Voltage,Current
1623304219787,high-voltage,9,0.163047
time,Hardware,Voltage,Current
1623304219787,high-voltage,10,0.170227
time,Hardware,Voltage,Current
1623304219787,high-voltage,11,0.177434
time,Hardware,Voltage,Current
1623304219787,high-voltage,12,0.183372
time,Hardware,Voltage,Current
1623304219787,high-voltage,13,0.188888
time,Hardware,Voltage,Current
1623304219787,high-voltage,14,0.192884
time,Hardware,Voltage,Current
1623304219787,high-voltage,15,0.198175
time,Hardware,Voltage,Current
1623304219787,high-voltage,16,0.203799
time,Hardware,Voltage,Current
1623304219787,high-voltage,17,0.208053
time,Hardware,Voltage,Current
1623304219787,high-voltage,18,0.21105
time,Hardware,Voltage,Current
1623304219787,high-voltage,19,0.216757
time,Hardware,Voltage,Current
1623304219787,high-voltage,20,0.221078
time,Hardware,Voltage,Current
1623304219787,high-voltage,25,0.242544
time,Hardware,Voltage,Current
1623304219787,high-voltage,30,0.281062
time,Hardware,Voltage,Current
1623304219787,high-voltage,35,0.405309
time,Hardware,Voltage,Current
1623304219787,high-voltage,40,0.725887
time,Hardware,Voltage,Current
1623304219787,high-voltage,45,1.22765
time,Hardware,Voltage,Current
1623304219787,high-voltage,50,1.86279
time,Hardware,Voltage,Current
1623304219787,high-voltage,55,2.6232
time,Hardware,Voltage,Current
1623304219787,high-voltage,60,3.51668
time,Hardware,Voltage,Current
1623304219787,high-voltage,65,4.5513
time,Hardware,Voltage,Current
1623304219787,high-voltage,70,5.74646
time,Hardware,Voltage,Current
1623304219787,high-voltage,75,7.11518
time,Hardware,Voltage,Current
1623304219787,high-voltage,80,8.70066
time,Hardware,Voltage,Current
1623304219787,high-voltage,85,10
