time,Hardware,Voltage,Current
1623358506507,high-voltage,1,0.0262602
time,Hardware,Voltage,Current
1623358506507,high-voltage,2,0.0330718
time,Hardware,Voltage,Current
1623358506507,high-voltage,3,0.0404373
time,Hardware,Voltage,Current
1623358506507,high-voltage,4,0.0452401
time,Hardware,Voltage,Current
1623358506507,high-voltage,5,0.0498068
time,Hardware,Voltage,Current
1623358506507,high-voltage,6,0.0543187
time,Hardware,Voltage,Current
1623358506507,high-voltage,7,0.0581183
time,Hardware,Voltage,Current
1623358506507,high-voltage,8,0.0629719
time,Hardware,Voltage,Current
1623358506507,high-voltage,9,0.0681329
time,Hardware,Voltage,Current
1623358506507,high-voltage,10,0.0736038
time,Hardware,Voltage,Current
1623358506507,high-voltage,11,0.0778772
time,Hardware,Voltage,Current
1623358506507,high-voltage,12,0.0822598
time,Hardware,Voltage,Current
1623358506507,high-voltage,13,0.0868334
time,Hardware,Voltage,Current
1623358506507,high-voltage,14,0.0909836
time,Hardware,Voltage,Current
1623358506507,high-voltage,15,0.0940836
time,Hardware,Voltage,Current
1623358506507,high-voltage,16,0.0970718
time,Hardware,Voltage,Current
1623358506507,high-voltage,17,0.0988878
time,Hardware,Voltage,Current
1623358506507,high-voltage,18,0.102753
time,Hardware,Voltage,Current
1623358506507,high-voltage,19,0.104375
time,Hardware,Voltage,Current
1623358506507,high-voltage,20,0.106739
time,Hardware,Voltage,Current
1623358506507,high-voltage,1.19082e-07,0.119144
time,Hardware,Voltage,Current
1623358506507,high-voltage,30,0.13134
time,Hardware,Voltage,Current
1623358506507,high-voltage,1.58741e-07,0.159554
time,Hardware,Voltage,Current
1623358506507,high-voltage,40,0.2623
time,Hardware,Voltage,Current
1623358506507,high-voltage,45,0.561791
time,Hardware,Voltage,Current
1623358506507,high-voltage,50,1.05326
time,Hardware,Voltage,Current
1623358506507,high-voltage,55,1.74384
time,Hardware,Voltage,Current
1623358506507,high-voltage,60,2.54039
time,Hardware,Voltage,Current
1623358506507,high-voltage,65,3.50635
time,Hardware,Voltage,Current
1623358506507,high-voltage,70,4.60922
