{
    "Data": [[648.0, 174.0, 130.0, 70.0, 44.0, 33.0, 29.0, 24.0, 19.0, 23.0, 17.0, 13.0, 10.0, 18.0, 12.0, 12.0, 15.0, 11.0, 13.0, 5.0, 9.0, 10.0, 13.0, 7.0, 10.0, 4.0, 7.0, 6.0, 2.0, 6.0, 6.0, 10.0, 3.0, 5.0, 4.0, 3.0, 4.0, 3.0, 10.0, 3.0, 5.0, 7.0, 1.0, 2.0, 5.0, 9.0, 6.0, 6.0, 8.0], [1338.0, 315.0, 162.0, 96.0, 50.0, 38.0, 32.0, 24.0, 24.0, 15.0, 26.0, 14.0, 11.0, 18.0, 13.0, 15.0, 12.0, 13.0, 13.0, 13.0, 10.0, 12.0, 8.0, 14.0, 10.0, 8.0, 10.0, 9.0, 9.0, 8.0, 8.0, 6.0, 5.0, 4.0, 6.0, 7.0, 6.0, 4.0, 3.0, 3.0, 10.0, 10.0, 3.0, 4.0, 7.0, 5.0, 8.0, 7.0, 8.0], [2575.0, 742.0, 355.0, 191.0, 116.0, 60.0, 51.0, 37.0, 33.0, 22.0, 16.0, 10.0, 17.0, 5.0, 13.0, 12.0, 11.0, 11.0, 11.0, 11.0, 14.0, 12.0, 6.0, 8.0, 17.0, 15.0, 13.0, 10.0, 12.0, 8.0, 11.0, 12.0, 10.0, 7.0, 8.0, 13.0, 4.0, 3.0, 7.0, 6.0, 9.0, 5.0, 4.0, 7.0, 6.0, 6.0, 9.0, 11.0, 12.0], [4764.0, 1644.0, 809.0, 411.0, 277.0, 153.0, 124.0, 79.0, 64.0, 43.0, 38.0, 41.0, 22.0, 24.0, 15.0, 15.0, 29.0, 6.0, 7.0, 16.0, 20.0, 16.0, 11.0, 7.0, 5.0, 12.0, 8.0, 15.0, 12.0, 15.0, 3.0, 4.0, 9.0, 7.0, 10.0, 19.0, 7.0, 9.0, 18.0, 8.0, 8.0, 5.0, 14.0, 9.0, 11.0, 9.0, 8.0, 6.0, 14.0], [7360.0, 3368.0, 1845.0, 1112.0, 731.0, 477.0, 329.0, 231.0, 191.0, 136.0, 114.0, 91.0, 87.0, 78.0, 57.0, 42.0, 32.0, 27.0, 22.0, 40.0, 25.0, 13.0, 15.0, 16.0, 15.0, 12.0, 10.0, 10.0, 13.0, 14.0, 7.0, 13.0, 10.0, 11.0, 7.0, 13.0, 10.0, 10.0, 4.0, 11.0, 15.0, 10.0, 8.0, 12.0, 12.0, 21.0, 12.0, 12.0, 22.0], [10349.0, 5556.0, 3537.0, 2440.0, 1676.0, 1267.0, 957.0, 736.0, 558.0, 373.0, 303.0, 272.0, 222.0, 189.0, 150.0, 149.0, 114.0, 88.0, 79.0, 73.0, 82.0, 50.0, 51.0, 35.0, 37.0, 28.0, 35.0, 28.0, 26.0, 23.0, 19.0, 10.0, 13.0, 14.0, 11.0, 14.0, 15.0, 7.0, 12.0, 12.0, 12.0, 8.0, 7.0, 17.0, 15.0, 16.0, 17.0, 22.0, 27.0], [7206.0, 6685.0, 5570.0, 4603.0, 3730.0, 2986.0, 2427.0, 1967.0, 1600.0, 1273.0, 1045.0, 911.0, 720.0, 584.0, 486.0, 400.0, 328.0, 283.0, 226.0, 206.0, 182.0, 163.0, 162.0, 147.0, 103.0, 104.0, 112.0, 72.0, 77.0, 63.0, 62.0, 63.0, 59.0, 33.0, 46.0, 28.0, 28.0, 23.0, 14.0, 18.0, 22.0, 21.0, 17.0, 20.0, 10.0, 15.0, 17.0, 28.0, 34.0], [1214.0, 1634.0, 2074.0, 2538.0, 2876.0, 2933.0, 3106.0, 3234.0, 3083.0, 2970.0, 2780.0, 2641.0, 2388.0, 2124.0, 1874.0, 1716.0, 1453.0, 1324.0, 1072.0, 939.0, 866.0, 704.0, 590.0, 509.0, 454.0, 383.0, 324.0, 276.0, 220.0, 204.0, 173.0, 171.0, 153.0, 129.0, 107.0, 105.0, 105.0, 89.0, 91.0, 69.0, 79.0, 46.0, 51.0, 35.0, 35.0, 33.0, 26.0, 33.0, 41.0], [509.0, 342.0, 359.0, 362.0, 388.0, 505.0, 572.0, 714.0, 835.0, 1066.0, 1215.0, 1344.0, 1561.0, 1674.0, 1937.0, 1993.0, 2137.0, 2246.0, 2210.0, 2259.0, 2304.0, 2256.0, 2171.0, 2154.0, 1893.0, 1894.0, 1766.0, 1659.0, 1451.0, 1265.0, 1147.0, 1027.0, 907.0, 757.0, 625.0, 531.0, 479.0, 352.0, 336.0, 294.0, 240.0, 174.0, 154.0, 159.0, 134.0, 109.0, 94.0, 74.0, 72.0], [411.0, 192.0, 170.0, 125.0, 131.0, 134.0, 146.0, 155.0, 179.0, 180.0, 234.0, 231.0, 265.0, 292.0, 337.0, 377.0, 453.0, 564.0, 581.0, 697.0, 831.0, 901.0, 1076.0, 1190.0, 1326.0, 1498.0, 1622.0, 1747.0, 1936.0, 2102.0, 2106.0, 2157.0, 2142.0, 2283.0, 2322.0, 2356.0, 2277.0, 2260.0, 2081.0, 1945.0, 1774.0, 1572.0, 1355.0, 1135.0, 957.0, 711.0, 556.0, 420.0, 283.0], [408.0, 195.0, 136.0, 104.0, 62.0, 56.0, 68.0, 54.0, 59.0, 68.0, 63.0, 75.0, 84.0, 82.0, 116.0, 101.0, 119.0, 128.0, 139.0, 159.0, 189.0, 212.0, 226.0, 252.0, 299.0, 346.0, 385.0, 463.0, 517.0, 598.0, 660.0, 828.0, 914.0, 1071.0, 1338.0, 1408.0, 1668.0, 1890.0, 2070.0, 2302.0, 2682.0, 2909.0, 3094.0, 3456.0, 3531.0, 3751.0, 3750.0, 3400.0, 2831.0], [528.0, 188.0, 120.0, 94.0, 57.0, 45.0, 41.0, 37.0, 33.0, 39.0, 29.0, 32.0, 27.0, 31.0, 30.0, 39.0, 37.0, 48.0, 39.0, 56.0, 54.0, 79.0, 77.0, 80.0, 89.0, 104.0, 124.0, 142.0, 145.0, 165.0, 213.0, 236.0, 282.0, 332.0, 402.0, 459.0, 530.0, 690.0, 806.0, 950.0, 1267.0, 1522.0, 1885.0, 2361.0, 2912.0, 3733.0, 4608.0, 6317.0, 8402.0], [775.0, 228.0, 138.0, 88.0, 49.0, 51.0, 30.0, 30.0, 29.0, 29.0, 22.0, 26.0, 24.0, 25.0, 28.0, 27.0, 23.0, 24.0, 17.0, 16.0, 25.0, 27.0, 28.0, 25.0, 30.0, 40.0, 30.0, 36.0, 41.0, 44.0, 66.0, 53.0, 74.0, 95.0, 115.0, 143.0, 169.0, 201.0, 254.0, 345.0, 439.0, 577.0, 744.0, 959.0, 1477.0, 2053.0, 3071.0, 4738.0, 8884.0], [1137.0, 326.0, 166.0, 96.0, 59.0, 49.0, 42.0, 30.0, 25.0, 24.0, 13.0, 14.0, 19.0, 21.0, 17.0, 21.0, 21.0, 23.0, 17.0, 20.0, 19.0, 20.0, 21.0, 15.0, 24.0, 19.0, 20.0, 27.0, 22.0, 16.0, 27.0, 34.0, 26.0, 24.0, 28.0, 41.0, 50.0, 70.0, 86.0, 85.0, 132.0, 161.0, 226.0, 340.0, 536.0, 857.0, 1490.0, 2852.0, 6777.0], [1801.0, 523.0, 240.0, 114.0, 67.0, 47.0, 29.0, 35.0, 32.0, 17.0, 23.0, 16.0, 15.0, 27.0, 18.0, 16.0, 15.0, 13.0, 12.0, 15.0, 19.0, 23.0, 13.0, 25.0, 17.0, 9.0, 12.0, 21.0, 24.0, 16.0, 16.0, 23.0, 29.0, 22.0, 22.0, 20.0, 17.0, 30.0, 36.0, 23.0, 36.0, 50.0, 65.0, 108.0, 129.0, 239.0, 503.0, 1177.0, 3942.0], [2598.0, 789.0, 406.0, 192.0, 97.0, 62.0, 38.0, 20.0, 27.0, 22.0, 13.0, 15.0, 11.0, 18.0, 21.0, 19.0, 14.0, 17.0, 20.0, 12.0, 12.0, 13.0, 12.0, 7.0, 16.0, 10.0, 18.0, 18.0, 12.0, 13.0, 14.0, 13.0, 16.0, 18.0, 18.0, 18.0, 24.0, 12.0, 24.0, 27.0, 30.0, 36.0, 37.0, 43.0, 73.0, 88.0, 189.0, 424.0, 1834.0], [3344.0, 1463.0, 728.0, 326.0, 214.0, 123.0, 71.0, 50.0, 29.0, 21.0, 21.0, 10.0, 15.0, 14.0, 12.0, 16.0, 10.0, 11.0, 13.0, 9.0, 16.0, 12.0, 6.0, 14.0, 13.0, 10.0, 11.0, 13.0, 12.0, 14.0, 15.0, 9.0, 17.0, 15.0, 8.0, 14.0, 16.0, 16.0, 23.0, 23.0, 19.0, 24.0, 38.0, 24.0, 42.0, 44.0, 70.0, 163.0, 765.0], [4119.0, 2030.0, 1176.0, 694.0, 393.0, 243.0, 134.0, 91.0, 58.0, 42.0, 28.0, 25.0, 15.0, 13.0, 15.0, 21.0, 10.0, 12.0, 10.0, 20.0, 6.0, 12.0, 11.0, 4.0, 10.0, 9.0, 10.0, 13.0, 10.0, 11.0, 6.0, 9.0, 14.0, 9.0, 10.0, 16.0, 16.0, 16.0, 10.0, 11.0, 21.0, 23.0, 14.0, 26.0, 33.0, 41.0, 41.0, 108.0, 319.0], [4610.0, 2519.0, 1778.0, 1050.0, 749.0, 464.0, 288.0, 186.0, 136.0, 100.0, 87.0, 62.0, 34.0, 31.0, 25.0, 13.0, 14.0, 13.0, 16.0, 19.0, 12.0, 10.0, 9.0, 11.0, 10.0, 4.0, 11.0, 7.0, 10.0, 9.0, 6.0, 11.0, 10.0, 9.0, 8.0, 10.0, 7.0, 8.0, 7.0, 17.0, 13.0, 8.0, 25.0, 25.0, 21.0, 24.0, 41.0, 62.0, 212.0], [4365.0, 2920.0, 2217.0, 1510.0, 1121.0, 829.0, 605.0, 460.0, 328.0, 212.0, 169.0, 136.0, 110.0, 72.0, 55.0, 48.0, 31.0, 29.0, 27.0, 20.0, 13.0, 11.0, 8.0, 11.0, 12.0, 15.0, 7.0, 11.0, 10.0, 3.0, 7.0, 10.0, 10.0, 7.0, 7.0, 7.0, 4.0, 9.0, 8.0, 9.0, 7.0, 7.0, 15.0, 16.0, 26.0, 18.0, 38.0, 58.0, 116.0], [3852.0, 2902.0, 2336.0, 1803.0, 1530.0, 1178.0, 912.0, 770.0, 567.0, 476.0, 369.0, 291.0, 232.0, 216.0, 127.0, 120.0, 89.0, 76.0, 49.0, 53.0, 35.0, 16.0, 17.0, 30.0, 22.0, 13.0, 14.0, 12.0, 4.0, 10.0, 10.0, 8.0, 5.0, 8.0, 4.0, 7.0, 9.0, 8.0, 9.0, 8.0, 6.0, 8.0, 16.0, 12.0, 14.0, 21.0, 17.0, 38.0, 90.0], [3099.0, 2524.0, 2267.0, 1975.0, 1670.0, 1473.0, 1185.0, 1047.0, 856.0, 717.0, 603.0, 513.0, 430.0, 339.0, 287.0, 265.0, 183.0, 176.0, 127.0, 100.0, 99.0, 76.0, 79.0, 61.0, 47.0, 28.0, 31.0, 23.0, 19.0, 13.0, 9.0, 13.0, 10.0, 8.0, 5.0, 5.0, 3.0, 8.0, 5.0, 9.0, 6.0, 10.0, 9.0, 14.0, 8.0, 14.0, 12.0, 32.0, 64.0], [2197.0, 1968.0, 1839.0, 1742.0, 1609.0, 1472.0, 1357.0, 1217.0, 1107.0, 990.0, 868.0, 810.0, 708.0, 604.0, 543.0, 442.0, 397.0, 353.0, 311.0, 294.0, 199.0, 169.0, 152.0, 106.0, 106.0, 94.0, 73.0, 73.0, 54.0, 43.0, 36.0, 36.0, 32.0, 14.0, 13.0, 10.0, 12.0, 10.0, 9.0, 10.0, 6.0, 4.0, 9.0, 9.0, 9.0, 19.0, 13.0, 25.0, 52.0], [1335.0, 1379.0, 1386.0, 1401.0, 1339.0, 1298.0, 1289.0, 1176.0, 1179.0, 1033.0, 974.0, 968.0, 897.0, 801.0, 818.0, 708.0, 614.0, 587.0, 518.0, 474.0, 391.0, 331.0, 297.0, 293.0, 234.0, 219.0, 164.0, 140.0, 130.0, 110.0, 91.0, 89.0, 63.0, 51.0, 50.0, 40.0, 23.0, 31.0, 28.0, 18.0, 12.0, 11.0, 11.0, 3.0, 15.0, 7.0, 8.0, 17.0, 45.0], [866.0, 869.0, 954.0, 987.0, 993.0, 977.0, 1041.0, 1012.0, 993.0, 975.0, 1012.0, 1006.0, 971.0, 913.0, 867.0, 863.0, 752.0, 675.0, 760.0, 622.0, 591.0, 535.0, 513.0, 526.0, 450.0, 398.0, 375.0, 327.0, 262.0, 259.0, 201.0, 165.0, 169.0, 130.0, 115.0, 106.0, 93.0, 71.0, 70.0, 52.0, 38.0, 25.0, 23.0, 24.0, 11.0, 15.0, 17.0, 17.0, 34.0], [572.0, 538.0, 548.0, 594.0, 603.0, 733.0, 733.0, 807.0, 760.0, 765.0, 829.0, 852.0, 865.0, 882.0, 846.0, 846.0, 824.0, 783.0, 761.0, 795.0, 727.0, 748.0, 719.0, 661.0, 631.0, 562.0, 569.0, 482.0, 446.0, 491.0, 415.0, 402.0, 329.0, 301.0, 244.0, 225.0, 218.0, 179.0, 158.0, 115.0, 86.0, 88.0, 63.0, 54.0, 47.0, 29.0, 30.0, 37.0, 34.0], [361.0, 365.0, 326.0, 348.0, 377.0, 412.0, 473.0, 507.0, 527.0, 538.0, 560.0, 608.0, 634.0, 699.0, 709.0, 733.0, 732.0, 756.0, 767.0, 742.0, 757.0, 768.0, 762.0, 723.0, 754.0, 685.0, 726.0, 702.0, 707.0, 603.0, 576.0, 609.0, 579.0, 505.0, 469.0, 450.0, 399.0, 347.0, 327.0, 286.0, 244.0, 200.0, 205.0, 151.0, 125.0, 112.0, 81.0, 60.0, 56.0], [281.0, 205.0, 217.0, 210.0, 218.0, 230.0, 255.0, 288.0, 340.0, 388.0, 347.0, 414.0, 433.0, 446.0, 507.0, 548.0, 557.0, 591.0, 652.0, 627.0, 659.0, 685.0, 719.0, 721.0, 727.0, 762.0, 709.0, 744.0, 788.0, 737.0, 781.0, 757.0, 688.0, 720.0, 650.0, 642.0, 614.0, 609.0, 565.0, 528.0, 470.0, 457.0, 376.0, 356.0, 290.0, 229.0, 189.0, 125.0, 114.0], [211.0, 183.0, 161.0, 118.0, 123.0, 150.0, 137.0, 170.0, 171.0, 184.0, 230.0, 240.0, 273.0, 304.0, 333.0, 377.0, 339.0, 434.0, 435.0, 488.0, 505.0, 496.0, 535.0, 575.0, 633.0, 644.0, 657.0, 704.0, 725.0, 734.0, 793.0, 774.0, 817.0, 785.0, 832.0, 814.0, 790.0, 803.0, 765.0, 725.0, 744.0, 686.0, 688.0, 580.0, 572.0, 507.0, 440.0, 373.0, 270.0], [180.0, 131.0, 82.0, 82.0, 82.0, 81.0, 89.0, 99.0, 101.0, 110.0, 140.0, 146.0, 142.0, 157.0, 162.0, 195.0, 241.0, 248.0, 283.0, 272.0, 329.0, 369.0, 360.0, 386.0, 446.0, 497.0, 541.0, 552.0, 569.0, 689.0, 662.0, 681.0, 741.0, 807.0, 865.0, 871.0, 892.0, 849.0, 884.0, 958.0, 995.0, 1030.0, 1004.0, 917.0, 931.0, 811.0, 806.0, 679.0, 591.0], [219.0, 126.0, 85.0, 62.0, 45.0, 53.0, 47.0, 37.0, 40.0, 45.0, 65.0, 77.0, 65.0, 87.0, 89.0, 108.0, 116.0, 139.0, 140.0, 194.0, 195.0, 207.0, 242.0, 271.0, 283.0, 352.0, 320.0, 344.0, 401.0, 496.0, 514.0, 606.0, 593.0, 637.0, 681.0, 756.0, 796.0, 850.0, 961.0, 1007.0, 1048.0, 1133.0, 1153.0, 1214.0, 1232.0, 1255.0, 1281.0, 1223.0, 1232.0], [216.0, 121.0, 93.0, 54.0, 54.0, 36.0, 30.0, 29.0, 19.0, 20.0, 36.0, 30.0, 42.0, 30.0, 62.0, 67.0, 64.0, 70.0, 75.0, 74.0, 99.0, 99.0, 129.0, 161.0, 144.0, 213.0, 218.0, 237.0, 268.0, 303.0, 338.0, 386.0, 413.0, 483.0, 520.0, 578.0, 645.0, 775.0, 792.0, 842.0, 1049.0, 1091.0, 1202.0, 1333.0, 1453.0, 1516.0, 1794.0, 1759.0, 1955.0], [189.0, 134.0, 112.0, 52.0, 49.0, 35.0, 36.0, 28.0, 28.0, 27.0, 18.0, 39.0, 25.0, 41.0, 35.0, 39.0, 29.0, 45.0, 50.0, 37.0, 55.0, 63.0, 71.0, 70.0, 104.0, 105.0, 119.0, 133.0, 157.0, 155.0, 170.0, 249.0, 250.0, 286.0, 331.0, 393.0, 466.0, 512.0, 620.0, 657.0, 827.0, 910.0, 1058.0, 1237.0, 1454.0, 1692.0, 1998.0, 2293.0, 2836.0], [228.0, 102.0, 79.0, 43.0, 29.0, 23.0, 19.0, 19.0, 27.0, 14.0, 11.0, 15.0, 21.0, 14.0, 12.0, 21.0, 17.0, 18.0, 20.0, 26.0, 26.0, 39.0, 41.0, 46.0, 61.0, 50.0, 59.0, 74.0, 70.0, 88.0, 110.0, 118.0, 145.0, 194.0, 214.0, 235.0, 285.0, 356.0, 416.0, 482.0, 543.0, 734.0, 826.0, 1026.0, 1323.0, 1575.0, 2000.0, 2588.0, 3473.0], [204.0, 142.0, 64.0, 77.0, 62.0, 52.0, 27.0, 37.0, 13.0, 12.0, 12.0, 13.0, 25.0, 12.0, 13.0, 9.0, 4.0, 7.0, 14.0, 14.0, 11.0, 21.0, 15.0, 25.0, 17.0, 28.0, 29.0, 30.0, 32.0, 39.0, 56.0, 62.0, 77.0, 87.0, 106.0, 145.0, 139.0, 182.0, 261.0, 253.0, 366.0, 465.0, 630.0, 744.0, 979.0, 1353.0, 1890.0, 2548.0, 3911.0], [180.0, 117.0, 77.0, 54.0, 31.0, 55.0, 21.0, 11.0, 14.0, 10.0, 11.0, 9.0, 7.0, 9.0, 24.0, 11.0, 9.0, 12.0, 14.0, 22.0, 10.0, 14.0, 12.0, 22.0, 9.0, 11.0, 18.0, 17.0, 24.0, 20.0, 26.0, 51.0, 29.0, 47.0, 47.0, 75.0, 79.0, 110.0, 133.0, 180.0, 237.0, 292.0, 416.0, 518.0, 687.0, 955.0, 1472.0, 2304.0, 3859.0], [189.0, 133.0, 97.0, 43.0, 40.0, 39.0, 31.0, 18.0, 11.0, 22.0, 14.0, 11.0, 25.0, 15.0, 5.0, 8.0, 28.0, 5.0, 9.0, 8.0, 7.0, 15.0, 6.0, 9.0, 15.0, 33.0, 8.0, 8.0, 15.0, 11.0, 13.0, 14.0, 18.0, 29.0, 43.0, 32.0, 68.0, 60.0, 89.0, 108.0, 119.0, 142.0, 240.0, 290.0, 423.0, 644.0, 1075.0, 1767.0, 3532.0], [212.0, 103.0, 77.0, 75.0, 60.0, 31.0, 15.0, 20.0, 33.0, 21.0, 15.0, 39.0, 62.0, 8.0, 9.0, 6.0, 9.0, 7.0, 11.0, 5.0, 10.0, 27.0, 32.0, 14.0, 5.0, 8.0, 22.0, 14.0, 9.0, 24.0, 18.0, 20.0, 6.0, 13.0, 14.0, 30.0, 14.0, 17.0, 35.0, 35.0, 57.0, 73.0, 107.0, 158.0, 259.0, 418.0, 704.0, 1335.0, 2879.0], [185.0, 157.0, 88.0, 48.0, 30.0, 28.0, 27.0, 44.0, 29.0, 22.0, 17.0, 8.0, 6.0, 8.0, 7.0, 7.0, 10.0, 52.0, 46.0, 37.0, 27.0, 8.0, 4.0, 8.0, 3.0, 11.0, 8.0, 9.0, 2.0, 4.0, 3.0, 4.0, 42.0, 12.0, 10.0, 13.0, 70.0, 19.0, 17.0, 39.0, 47.0, 39.0, 46.0, 71.0, 142.0, 206.0, 443.0, 834.0, 2237.0], [213.0, 114.0, 56.0, 47.0, 30.0, 25.0, 41.0, 18.0, 11.0, 29.0, 20.0, 7.0, 15.0, 29.0, 29.0, 14.0, 11.0, 9.0, 41.0, 21.0, 8.0, 28.0, 39.0, 19.0, 2.0, 9.0, 2.0, 4.0, 8.0, 9.0, 4.0, 4.0, 8.0, 5.0, 25.0, 5.0, 3.0, 7.0, 4.0, 6.0, 17.0, 38.0, 24.0, 31.0, 46.0, 114.0, 235.0, 487.0, 1634.0], [184.0, 116.0, 70.0, 65.0, 37.0, 30.0, 25.0, 17.0, 13.0, 10.0, 21.0, 33.0, 15.0, 21.0, 20.0, 6.0, 24.0, 17.0, 9.0, 8.0, 24.0, 11.0, 8.0, 30.0, 5.0, 8.0, 14.0, 30.0, 20.0, 27.0, 25.0, 8.0, 49.0, 29.0, 5.0, 5.0, 6.0, 9.0, 14.0, 12.0, 22.0, 21.0, 11.0, 16.0, 32.0, 53.0, 147.0, 272.0, 1013.0], [198.0, 120.0, 75.0, 47.0, 62.0, 44.0, 35.0, 33.0, 18.0, 10.0, 11.0, 15.0, 10.0, 8.0, 10.0, 52.0, 7.0, 8.0, 48.0, 13.0, 5.0, 6.0, 4.0, 7.0, 6.0, 10.0, 2.0, 5.0, 25.0, 21.0, 36.0, 8.0, 3.0, 2.0, 7.0, 24.0, 9.0, 7.0, 4.0, 3.0, 6.0, 27.0, 7.0, 6.0, 11.0, 20.0, 45.0, 173.0, 613.0], [205.0, 113.0, 122.0, 66.0, 38.0, 26.0, 13.0, 38.0, 20.0, 24.0, 20.0, 17.0, 6.0, 7.0, 10.0, 12.0, 24.0, 33.0, 30.0, 15.0, 7.0, 4.0, 19.0, 21.0, 3.0, 4.0, 24.0, 14.0, 3.0, 7.0, 44.0, 11.0, 5.0, 5.0, 2.0, 3.0, 23.0, 6.0, 1.0, 6.0, 27.0, 3.0, 24.0, 12.0, 8.0, 10.0, 45.0, 92.0, 403.0], [178.0, 120.0, 83.0, 71.0, 35.0, 47.0, 22.0, 45.0, 23.0, 14.0, 11.0, 11.0, 26.0, 9.0, 9.0, 13.0, 5.0, 5.0, 6.0, 5.0, 3.0, 5.0, 11.0, 4.0, 11.0, 7.0, 6.0, 6.0, 10.0, 26.0, 5.0, 5.0, 11.0, 6.0, 2.0, 6.0, 3.0, 1.0, 4.0, 3.0, 9.0, 5.0, 5.0, 21.0, 16.0, 14.0, 14.0, 73.0, 213.0], [242.0, 109.0, 73.0, 79.0, 50.0, 29.0, 14.0, 10.0, 7.0, 5.0, 11.0, 7.0, 13.0, 15.0, 7.0, 7.0, 9.0, 19.0, 14.0, 6.0, 5.0, 6.0, 7.0, 2.0, 36.0, 22.0, 8.0, 3.0, 6.0, 30.0, 11.0, 4.0, 3.0, 13.0, 19.0, 5.0, 23.0, 8.0, 7.0, 6.0, 3.0, 4.0, 24.0, 8.0, 5.0, 11.0, 26.0, 32.0, 119.0], [188.0, 92.0, 96.0, 59.0, 28.0, 28.0, 16.0, 25.0, 26.0, 7.0, 10.0, 17.0, 32.0, 13.0, 7.0, 5.0, 6.0, 7.0, 2.0, 22.0, 18.0, 7.0, 8.0, 34.0, 6.0, 22.0, 35.0, 12.0, 8.0, 4.0, 5.0, 2.0, 3.0, 3.0, 8.0, 20.0, 16.0, 3.0, 4.0, 2.0, 20.0, 13.0, 8.0, 22.0, 15.0, 4.0, 6.0, 11.0, 82.0], [220.0, 116.0, 60.0, 61.0, 74.0, 23.0, 10.0, 19.0, 17.0, 9.0, 10.0, 13.0, 24.0, 25.0, 8.0, 27.0, 18.0, 2.0, 3.0, 7.0, 7.0, 17.0, 23.0, 8.0, 8.0, 7.0, 62.0, 16.0, 3.0, 5.0, 12.0, 18.0, 4.0, 2.0, 1.0, 4.0, 2.0, 24.0, 11.0, 2.0, 6.0, 4.0, 14.0, 21.0, 3.0, 5.0, 33.0, 13.0, 37.0], [188.0, 101.0, 84.0, 46.0, 36.0, 25.0, 37.0, 39.0, 25.0, 9.0, 9.0, 44.0, 20.0, 36.0, 18.0, 10.0, 6.0, 10.0, 5.0, 18.0, 19.0, 10.0, 6.0, 4.0, 9.0, 23.0, 17.0, 24.0, 5.0, 12.0, 22.0, 4.0, 6.0, 4.0, 4.0, 8.0, 6.0, 13.0, 20.0, 7.0, 5.0, 5.0, 2.0, 6.0, 5.0, 5.0, 6.0, 4.0, 44.0], [179.0, 104.0, 74.0, 52.0, 38.0, 17.0, 22.0, 16.0, 14.0, 9.0, 10.0, 10.0, 11.0, 13.0, 5.0, 6.0, 10.0, 3.0, 13.0, 22.0, 19.0, 7.0, 6.0, 3.0, 5.0, 42.0, 18.0, 3.0, 4.0, 22.0, 37.0, 7.0, 8.0, 7.0, 3.0, 2.0, 2.0, 4.0, 26.0, 3.0, 2.0, 28.0, 20.0, 14.0, 7.0, 4.0, 5.0, 11.0, 14.0], [205.0, 115.0, 109.0, 82.0, 31.0, 22.0, 22.0, 11.0, 38.0, 11.0, 9.0, 5.0, 30.0, 10.0, 8.0, 12.0, 7.0, 8.0, 13.0, 11.0, 8.0, 8.0, 5.0, 7.0, 25.0, 12.0, 21.0, 11.0, 6.0, 2.0, 4.0, 5.0, 0.0, 3.0, 2.0, 4.0, 2.0, 4.0, 16.0, 20.0, 2.0, 6.0, 6.0, 7.0, 5.0, 8.0, 5.0, 7.0, 55.0], [170.0, 94.0, 83.0, 56.0, 34.0, 23.0, 23.0, 15.0, 16.0, 6.0, 28.0, 7.0, 5.0, 10.0, 12.0, 9.0, 8.0, 5.0, 6.0, 7.0, 12.0, 8.0, 8.0, 10.0, 7.0, 10.0, 6.0, 9.0, 2.0, 3.0, 7.0, 5.0, 5.0, 6.0, 1.0, 4.0, 0.0, 5.0, 9.0, 19.0, 3.0, 6.0, 4.0, 47.0, 9.0, 3.0, 2.0, 13.0, 33.0]],
    "Name": "sCurve-0",
    "Overflow": 2299842.0,
    "Type": "Histo2d",
    "Underflow": 0.0,
    "x": {
        "AxisTitle": "Vcal",
        "Bins": 51,
        "High": 302.5,
        "Low": 47.5
    },
    "y": {
        "AxisTitle": "Occupancy",
        "Bins": 49,
        "High": 49.5,
        "Low": 0.5
    },
    "z": {
        "AxisTitle": "Number of pixels"
    }
}