time,Hardware,Voltage,Current
1623285244453,high-voltage,1,0.025564
time,Hardware,Voltage,Current
1623285244453,high-voltage,2,0.0321751
time,Hardware,Voltage,Current
1623285244453,high-voltage,3,0.0369695
time,Hardware,Voltage,Current
1623285244453,high-voltage,4,0.041286
time,Hardware,Voltage,Current
1623285244453,high-voltage,5,0.0466111
time,Hardware,Voltage,Current
1623285244453,high-voltage,6,0.0495576
time,Hardware,Voltage,Current
1623285244453,high-voltage,7,0.0552513
time,Hardware,Voltage,Current
1623285244453,high-voltage,8,0.0597994
time,Hardware,Voltage,Current
1623285244453,high-voltage,9,0.0636109
time,Hardware,Voltage,Current
1623285244453,high-voltage,10,0.0687244
time,Hardware,Voltage,Current
1623285244453,high-voltage,11,0.0737852
time,Hardware,Voltage,Current
1623285244453,high-voltage,12,0.0789163
time,Hardware,Voltage,Current
1623285244453,high-voltage,13,0.0841324
time,Hardware,Voltage,Current
1623285244453,high-voltage,14,0.0872606
time,Hardware,Voltage,Current
1623285244453,high-voltage,15,0.0905754
time,Hardware,Voltage,Current
1623285244453,high-voltage,16,0.0942636
