time,Hardware,Voltage,Current
1623696608859,high-voltage,1,-0.0373468
time,Hardware,Voltage,Current
1623696608859,high-voltage,2,-0.0150202
time,Hardware,Voltage,Current
1623696608859,high-voltage,3,0.00427059
time,Hardware,Voltage,Current
1623696608859,high-voltage,4,0.0222974
time,Hardware,Voltage,Current
1623696608859,high-voltage,5,0.0387833
time,Hardware,Voltage,Current
1623696608859,high-voltage,5.35165e-08,0.0540514
time,Hardware,Voltage,Current
1623696608859,high-voltage,7,0.066892
time,Hardware,Voltage,Current
1623696608859,high-voltage,8,0.0803159
time,Hardware,Voltage,Current
1623696608859,high-voltage,9.31045e-08,0.0929033
time,Hardware,Voltage,Current
1623696608859,high-voltage,10,0.105024
time,Hardware,Voltage,Current
1623696608859,high-voltage,11,0.114154
time,Hardware,Voltage,Current
1623696608859,high-voltage,12,0.121746
time,Hardware,Voltage,Current
1623696608859,high-voltage,13,0.13051
time,Hardware,Voltage,Current
1623696608859,high-voltage,14,0.140164
time,Hardware,Voltage,Current
1623696608859,high-voltage,15,0.149767
time,Hardware,Voltage,Current
1623696608859,high-voltage,16,0.157992
time,Hardware,Voltage,Current
1623696608859,high-voltage,17,0.168689
time,Hardware,Voltage,Current
1623696608859,high-voltage,18,0.178315
time,Hardware,Voltage,Current
1623696608859,high-voltage,19,0.186357
time,Hardware,Voltage,Current
1623696608859,high-voltage,20,0.195835
time,Hardware,Voltage,Current
1623696608859,high-voltage,25,0.246652
time,Hardware,Voltage,Current
1623696608859,high-voltage,30,0.303098
time,Hardware,Voltage,Current
1623696608859,high-voltage,35,0.412592
time,Hardware,Voltage,Current
1623696608859,high-voltage,40,0.705751
time,Hardware,Voltage,Current
1623696608859,high-voltage,45,1.2607
time,Hardware,Voltage,Current
1623696608859,high-voltage,50,2.04104
time,Hardware,Voltage,Current
1623696608859,high-voltage,55,3.0105
time,Hardware,Voltage,Current
1623696608859,high-voltage,60,4.13849
time,Hardware,Voltage,Current
1623696608859,high-voltage,65,5.42509
time,Hardware,Voltage,Current
1623696608859,high-voltage,70,6.8625
time,Hardware,Voltage,Current
1623696608859,high-voltage,75,8.47811
time,Hardware,Voltage,Current
1623696608859,high-voltage,80,10
