{
    "Data": [0.0, 0.0, 0.0, 0.0, 0.0, 0.0, 0.0, 0.0, 0.0, 0.0, 0.0, 0.0, 0.0, 0.0, 3.0, 0.0, 0.0, 27.0, 175.0, 42.0, 176.0, 1381.0, 2955.0, 1288.0, 1356.0, 2578.0, 3410.0, 1515.0, 870.0, 1521.0, 1843.0, 1042.0, 432.0, 492.0, 570.0, 502.0, 527.0, 1321.0, 1901.0, 1167.0, 706.0, 1986.0, 4010.0, 4332.0, 1952.0, 1672.0, 3387.0, 3932.0, 3204.0, 1720.0, 2048.0, 2210.0, 2873.0, 1452.0, 1019.0, 1215.0, 1138.0, 1160.0, 750.0, 758.0, 712.0, 728.0, 589.0, 388.0, 408.0, 393.0, 438.0, 307.0, 262.0, 254.0, 261.0, 269.0, 201.0, 153.0, 158.0, 170.0, 163.0, 119.0, 119.0, 116.0, 98.0, 76.0, 66.0, 65.0, 99.0, 88.0, 80.0, 52.0, 40.0, 48.0, 48.0, 39.0, 30.0, 48.0, 43.0, 38.0, 29.0, 27.0, 27.0, 22.0, 25.0, 15.0, 21.0, 22.0, 26.0, 19.0, 14.0, 17.0, 17.0, 16.0, 9.0, 11.0, 11.0, 14.0, 12.0, 12.0, 13.0, 12.0, 7.0, 6.0, 10.0, 9.0, 12.0, 6.0, 9.0, 4.0, 10.0, 5.0, 10.0, 10.0, 14.0, 6.0, 4.0, 5.0, 4.0, 3.0, 3.0, 3.0, 6.0, 4.0, 6.0, 7.0, 11.0, 5.0, 2.0, 6.0, 7.0, 1.0, 1.0, 1.0, 4.0, 0.0, 1.0, 2.0, 0.0, 3.0, 2.0, 3.0, 3.0, 2.0, 1.0, 3.0, 1.0, 1.0, 0.0, 2.0, 0.0, 4.0, 0.0, 0.0, 4.0, 1.0, 4.0, 5.0, 0.0, 0.0, 1.0, 1.0, 2.0, 1.0, 2.0, 2.0, 0.0, 1.0, 0.0, 1.0, 0.0, 0.0, 1.0, 1.0, 0.0, 0.0, 1.0, 1.0, 1.0, 0.0, 2.0, 3.0, 1.0, 0.0, 1.0],
    "Name": "TimePerFitDist-0",
    "Overflow": 78.0,
    "Type": "Histo1d",
    "Underflow": 0.0,
    "x": {
        "AxisTitle": "Fit Time [us]",
        "Bins": 201,
        "High": 401.0,
        "Low": -1.0
    },
    "y": {
        "AxisTitle": "Number of Pixels"
    },
    "z": {
        "AxisTitle": "z"
    }
}