{
    "Data": [0.0, 0.0, 0.0, 0.0, 0.0, 0.0, 0.0, 0.0, 0.0, 0.0, 0.0, 0.0, 0.0, 0.0, 0.0, 0.0, 0.0, 0.0, 0.0, 0.0, 0.0, 0.0, 0.0, 0.0, 0.0, 0.0, 0.0, 0.0, 0.0, 0.0, 0.0, 0.0, 0.0, 0.0, 0.0, 0.0, 0.0, 0.0, 0.0, 0.0, 0.0, 0.0, 0.0, 0.0, 0.0, 0.0, 0.0, 0.0, 0.0, 0.0, 53.0, 91.0, 115.0, 120.0, 121.0, 150.0, 199.0, 233.0, 227.0, 255.0, 320.0, 371.0, 394.0, 441.0, 506.0, 529.0, 545.0, 640.0, 690.0, 740.0, 724.0, 761.0, 810.0, 851.0, 862.0, 831.0, 948.0, 879.0, 861.0, 921.0, 899.0, 888.0, 892.0, 909.0, 878.0, 1012.0, 1110.0, 1389.0, 1575.0, 2000.0, 2307.0, 2616.0, 3012.0, 3016.0, 2842.0, 2463.0, 2087.0, 1671.0, 1213.0, 887.0, 645.0, 448.0, 287.0, 220.0, 150.0, 99.0, 74.0, 78.0, 57.0, 45.0, 38.0, 26.0, 20.0, 25.0, 23.0, 24.0, 14.0, 15.0, 15.0, 14.0, 21.0, 16.0, 15.0, 11.0, 13.0, 8.0, 13.0, 12.0, 7.0, 5.0, 10.0, 2.0, 5.0, 4.0, 7.0, 7.0, 6.0, 6.0, 5.0, 7.0, 7.0, 4.0, 3.0, 4.0, 3.0, 4.0, 1.0, 1.0, 0.0, 5.0, 2.0, 2.0, 4.0, 7.0, 4.0, 8.0, 5.0, 6.0, 15.0, 17.0, 15.0, 25.0, 38.0, 42.0, 65.0, 61.0, 90.0, 91.0, 150.0, 161.0, 174.0, 236.0, 264.0, 314.0, 394.0, 435.0, 480.0, 516.0, 602.0, 654.0, 699.0, 745.0, 777.0, 876.0, 862.0, 850.0, 914.0, 970.0, 961.0, 971.0, 975.0, 912.0, 869.0, 852.0, 794.0, 765.0, 695.0, 674.0, 577.0, 514.0, 473.0, 429.0, 388.0, 339.0, 293.0, 245.0, 226.0, 195.0, 171.0, 141.0, 133.0, 103.0, 74.0, 75.0, 46.0, 43.0, 16.0, 19.0, 19.0, 22.0, 9.0, 9.0, 5.0, 9.0, 1.0, 0.0, 1.0, 1.0, 2.0, 0.0, 1.0, 0.0, 0.0, 0.0, 0.0, 0.0, 0.0, 0.0, 0.0, 0.0, 0.0, 0.0, 0.0, 1.0, 0.0, 0.0, 0.0, 0.0, 0.0, 0.0, 0.0, 0.0, 1.0, 0.0, 0.0, 0.0, 0.0, 0.0, 1.0, 0.0, 0.0, 0.0, 0.0, 0.0, 1.0, 0.0, 0.0, 0.0, 0.0, 0.0, 0.0, 0.0, 0.0, 0.0, 0.0, 0.0, 0.0, 0.0, 0.0, 0.0, 0.0, 0.0, 0.0, 0.0, 0.0, 0.0, 0.0, 0.0, 0.0, 0.0, 0.0, 0.0, 0.0, 0.0, 0.0, 0.0, 0.0, 0.0, 0.0, 0.0, 0.0, 0.0, 0.0, 0.0, 0.0, 0.0, 0.0, 0.0, 0.0, 0.0, 0.0, 0.0, 0.0, 0.0, 0.0, 0.0, 0.0, 0.0, 0.0, 0.0, 0.0, 0.0, 0.0, 0.0, 0.0, 0.0, 0.0, 0.0, 0.0, 0.0, 0.0, 0.0, 0.0, 0.0, 0.0, 0.0, 0.0, 0.0, 0.0, 0.0, 0.0, 0.0, 0.0, 0.0, 0.0, 0.0, 0.0, 0.0, 0.0, 0.0, 0.0, 0.0, 0.0, 0.0, 0.0, 0.0, 0.0, 0.0, 0.0, 0.0, 0.0, 0.0, 0.0, 0.0],
    "Name": "ThresholdDist-0",
    "Overflow": 0.0,
    "Type": "Histo1d",
    "Underflow": 0.0,
    "x": {
        "AxisTitle": "Threshold [e]",
        "Bins": 364,
        "High": 3635.0,
        "Low": -5.0
    },
    "y": {
        "AxisTitle": "Number of Pixels"
    },
    "z": {
        "AxisTitle": "z"
    }
}