time,Hardware,Voltage,Current
1626347937212,high-voltage,1,0.00980522
time,Hardware,Voltage,Current
1626347937212,high-voltage,2,0.0241081
time,Hardware,Voltage,Current
1626347937212,high-voltage,3,0.033086
time,Hardware,Voltage,Current
1626347937212,high-voltage,4,0.0396274
time,Hardware,Voltage,Current
1626347937212,high-voltage,5,0.0448155
time,Hardware,Voltage,Current
1626347937212,high-voltage,6,0.0515019
time,Hardware,Voltage,Current
1626347937212,high-voltage,7,0.0580383
time,Hardware,Voltage,Current
1626347937212,high-voltage,8,0.0650032
time,Hardware,Voltage,Current
1626347937212,high-voltage,9,0.0713916
time,Hardware,Voltage,Current
1626347937212,high-voltage,10,0.0783515
time,Hardware,Voltage,Current
1626347937212,high-voltage,11,0.0845
time,Hardware,Voltage,Current
1626347937212,high-voltage,12,0.0893808
time,Hardware,Voltage,Current
1626347937212,high-voltage,13,0.0935875
time,Hardware,Voltage,Current
1626347937212,high-voltage,14,0.098004
time,Hardware,Voltage,Current
1626347937212,high-voltage,15,0.101848
time,Hardware,Voltage,Current
1626347937212,high-voltage,16,0.105147
time,Hardware,Voltage,Current
1626347937212,high-voltage,17,0.107833
time,Hardware,Voltage,Current
1626347937212,high-voltage,18,0.112098
time,Hardware,Voltage,Current
1626347937212,high-voltage,19,0.115191
time,Hardware,Voltage,Current
1626347937212,high-voltage,20,0.11727
time,Hardware,Voltage,Current
1626347937212,high-voltage,25,0.132841
time,Hardware,Voltage,Current
1626347937212,high-voltage,30,0.149414
time,Hardware,Voltage,Current
1626347937212,high-voltage,35,0.184189
time,Hardware,Voltage,Current
1626347937212,high-voltage,40,0.28775
time,Hardware,Voltage,Current
1626347937212,high-voltage,45,0.534523
time,Hardware,Voltage,Current
1626347937212,high-voltage,50,1.00359
time,Hardware,Voltage,Current
1626347937212,high-voltage,55,1.80071
time,Hardware,Voltage,Current
1626347937212,high-voltage,60,3.03577
time,Hardware,Voltage,Current
1626347937212,high-voltage,65,4.77147
time,Hardware,Voltage,Current
1626347937212,high-voltage,70,7.06841
time,Hardware,Voltage,Current
1626347937212,high-voltage,75,10
