time,Hardware,Voltage,Current
1625776660397,high-voltage-4,1,0.422766
time,Hardware,Voltage,Current
1625776660397,high-voltage-4,2,0.579378
time,Hardware,Voltage,Current
1625776660397,high-voltage-4,3,0.675626
time,Hardware,Voltage,Current
1625776660397,high-voltage-4,4,0.742486
time,Hardware,Voltage,Current
1625776660397,high-voltage-4,5,0.791836
time,Hardware,Voltage,Current
1625776660397,high-voltage-4,6,0.829157
time,Hardware,Voltage,Current
1625776660397,high-voltage-4,7,0.862206
time,Hardware,Voltage,Current
1625776660397,high-voltage-4,8,0.897158
time,Hardware,Voltage,Current
1625776660397,high-voltage-4,9,0.933046
time,Hardware,Voltage,Current
1625776660397,high-voltage-4,10,0.970511
time,Hardware,Voltage,Current
1625776660397,high-voltage-4,11,1.0092
time,Hardware,Voltage,Current
1625776660397,high-voltage-4,12,1.05606
time,Hardware,Voltage,Current
1625776660397,high-voltage-4,13,1.10029
time,Hardware,Voltage,Current
1625776660397,high-voltage-4,14,1.14871
time,Hardware,Voltage,Current
1625776660397,high-voltage-4,15,1.1978
time,Hardware,Voltage,Current
1625776660397,high-voltage-4,16,1.24896
time,Hardware,Voltage,Current
1625776660397,high-voltage-4,17,1.2999
time,Hardware,Voltage,Current
1625776660397,high-voltage-4,18,1.35659
time,Hardware,Voltage,Current
1625776660397,high-voltage-4,19,1.41331
time,Hardware,Voltage,Current
1625776660397,high-voltage-4,20,1.46967
time,Hardware,Voltage,Current
1625776660397,high-voltage-4,25,1.74957
time,Hardware,Voltage,Current
1625776660397,high-voltage-4,30,1.96667
time,Hardware,Voltage,Current
1625776660397,high-voltage-4,35,2.18377
time,Hardware,Voltage,Current
1625776660397,high-voltage-4,40,2.40497
time,Hardware,Voltage,Current
1625776660397,high-voltage-4,45,2.6468
time,Hardware,Voltage,Current
1625776660397,high-voltage-4,50,2.92083
time,Hardware,Voltage,Current
1625776660397,high-voltage-4,55,3.24711
time,Hardware,Voltage,Current
1625776660397,high-voltage-4,60,3.62367
time,Hardware,Voltage,Current
1625776660397,high-voltage-4,65,4.08913
time,Hardware,Voltage,Current
1625776660397,high-voltage-4,70,4.74439
time,Hardware,Voltage,Current
1625776660397,high-voltage-4,75,6.82762
time,Hardware,Voltage,Current
1625776660397,high-voltage-4,80,9.99969
time,Hardware,Voltage,Current
1625776660397,high-voltage-4,85,9.9997
time,Hardware,Voltage,Current
1625776660397,high-voltage-4,90,9.9997
time,Hardware,Voltage,Current
1625776660397,high-voltage-4,95,9.99968
time,Hardware,Voltage,Current
1625776660397,high-voltage-4,100,9.99966
