time,Hardware,Voltage,Current
1626310159039,high-voltage-2,1,0.242808
time,Hardware,Voltage,Current
1626310159039,high-voltage-2,2,0.289323
time,Hardware,Voltage,Current
1626310159039,high-voltage-2,3,0.312724
time,Hardware,Voltage,Current
1626310159039,high-voltage-2,4,0.332878
time,Hardware,Voltage,Current
1626310159039,high-voltage-2,5,0.352959
time,Hardware,Voltage,Current
1626310159039,high-voltage-2,6,0.379848
time,Hardware,Voltage,Current
1626310159039,high-voltage-2,7,0.409846
time,Hardware,Voltage,Current
1626310159039,high-voltage-2,8,0.441796
time,Hardware,Voltage,Current
1626310159039,high-voltage-2,9,0.47806
time,Hardware,Voltage,Current
1626310159039,high-voltage-2,10,0.520323
time,Hardware,Voltage,Current
1626310159039,high-voltage-2,11,0.562567
time,Hardware,Voltage,Current
1626310159039,high-voltage-2,12,0.602359
time,Hardware,Voltage,Current
1626310159039,high-voltage-2,13,0.645023
time,Hardware,Voltage,Current
1626310159039,high-voltage-2,14,0.681764
time,Hardware,Voltage,Current
1626310159039,high-voltage-2,15,0.717291
time,Hardware,Voltage,Current
1626310159039,high-voltage-2,16,0.744727
time,Hardware,Voltage,Current
1626310159039,high-voltage-2,17,0.774417
time,Hardware,Voltage,Current
1626310159039,high-voltage-2,18,0.797254
time,Hardware,Voltage,Current
1626310159039,high-voltage-2,19,0.822688
time,Hardware,Voltage,Current
1626310159039,high-voltage-2,20,0.844599
time,Hardware,Voltage,Current
1626310159039,high-voltage-2,25,0.940442
time,Hardware,Voltage,Current
1626310159039,high-voltage-2,30,1.03974
time,Hardware,Voltage,Current
1626310159039,high-voltage-2,35,1.1392
time,Hardware,Voltage,Current
1626310159039,high-voltage-2,40,1.25086
time,Hardware,Voltage,Current
1626310159039,high-voltage-2,45,1.38996
time,Hardware,Voltage,Current
1626310159039,high-voltage-2,50,1.49272
time,Hardware,Voltage,Current
1626310159039,high-voltage-2,55,1.5843
time,Hardware,Voltage,Current
1626310159039,high-voltage-2,60,1.67633
time,Hardware,Voltage,Current
1626310159039,high-voltage-2,65,1.76386
time,Hardware,Voltage,Current
1626310159039,high-voltage-2,70,1.8458
time,Hardware,Voltage,Current
1626310159039,high-voltage-2,75,1.92544
time,Hardware,Voltage,Current
1626310159039,high-voltage-2,80,2.00069
time,Hardware,Voltage,Current
1626310159039,high-voltage-2,85,2.07587
time,Hardware,Voltage,Current
1626310159039,high-voltage-2,90,2.14589
time,Hardware,Voltage,Current
1626310159039,high-voltage-2,95,2.21468
time,Hardware,Voltage,Current
1626310159039,high-voltage-2,100,2.28224
