time,Hardware,Voltage,Current
1621473880759,high-voltage-2,1,0.267352
time,Hardware,Voltage,Current
1621473880759,high-voltage-2,2,0.307665
time,Hardware,Voltage,Current
1621473880759,high-voltage-2,3,0.334094
time,Hardware,Voltage,Current
1621473880759,high-voltage-2,4,0.356206
time,Hardware,Voltage,Current
1621473880759,high-voltage-2,5,0.381054
time,Hardware,Voltage,Current
1621473880759,high-voltage-2,6,0.412434
time,Hardware,Voltage,Current
1621473880759,high-voltage-2,7,0.444751
time,Hardware,Voltage,Current
1621473880759,high-voltage-2,8,0.476686
time,Hardware,Voltage,Current
1621473880759,high-voltage-2,9,0.514059
time,Hardware,Voltage,Current
1621473880759,high-voltage-2,10,0.550898
time,Hardware,Voltage,Current
1621473880759,high-voltage-2,11,0.591922
time,Hardware,Voltage,Current
1621473880759,high-voltage-2,12,0.634272
time,Hardware,Voltage,Current
1621473880759,high-voltage-2,13,0.672202
time,Hardware,Voltage,Current
1621473880759,high-voltage-2,14,0.709911
time,Hardware,Voltage,Current
1621473880759,high-voltage-2,15,0.745026
time,Hardware,Voltage,Current
1621473880759,high-voltage-2,16,0.783148
time,Hardware,Voltage,Current
1621473880759,high-voltage-2,17,0.816725
time,Hardware,Voltage,Current
1621473880759,high-voltage-2,18,0.844371
time,Hardware,Voltage,Current
1621473880759,high-voltage-2,19,0.867257
time,Hardware,Voltage,Current
1621473880759,high-voltage-2,20,0.892427
time,Hardware,Voltage,Current
1621473880759,high-voltage-2,25,0.99308
time,Hardware,Voltage,Current
1621473880759,high-voltage-2,30,1.08876
time,Hardware,Voltage,Current
1621473880759,high-voltage-2,35,1.17955
time,Hardware,Voltage,Current
1621473880759,high-voltage-2,40,1.28488
time,Hardware,Voltage,Current
1621473880759,high-voltage-2,45,1.41137
time,Hardware,Voltage,Current
1621473880759,high-voltage-2,50,1.49775
time,Hardware,Voltage,Current
1621473880759,high-voltage-2,55,1.57754
time,Hardware,Voltage,Current
1621473880759,high-voltage-2,60,1.64996
time,Hardware,Voltage,Current
1621473880759,high-voltage-2,65,1.72606
time,Hardware,Voltage,Current
1621473880759,high-voltage-2,70,1.7959
time,Hardware,Voltage,Current
1621473880759,high-voltage-2,75,1.86455
time,Hardware,Voltage,Current
1621473880759,high-voltage-2,80,1.93158
time,Hardware,Voltage,Current
1621473880759,high-voltage-2,85,1.997
time,Hardware,Voltage,Current
1621473880759,high-voltage-2,90,2.05946
time,Hardware,Voltage,Current
1621473880759,high-voltage-2,95,2.12538
time,Hardware,Voltage,Current
1621473880759,high-voltage-2,100,2.18729
