time,Hardware,Voltage,Current
1626722616938,high-voltage-2,1,0.256522
time,Hardware,Voltage,Current
1626722616938,high-voltage-2,2,0.310997
time,Hardware,Voltage,Current
1626722616938,high-voltage-2,3,0.336807
time,Hardware,Voltage,Current
1626722616938,high-voltage-2,4,0.362918
time,Hardware,Voltage,Current
1626722616938,high-voltage-2,5,0.388797
time,Hardware,Voltage,Current
1626722616938,high-voltage-2,6,0.422198
time,Hardware,Voltage,Current
1626722616938,high-voltage-2,7,0.45583
time,Hardware,Voltage,Current
1626722616938,high-voltage-2,8,0.493361
time,Hardware,Voltage,Current
1626722616938,high-voltage-2,9,0.534058
time,Hardware,Voltage,Current
1626722616938,high-voltage-2,10,0.578173
time,Hardware,Voltage,Current
1626722616938,high-voltage-2,11,0.622936
time,Hardware,Voltage,Current
1626722616938,high-voltage-2,12,0.66583
time,Hardware,Voltage,Current
1626722616938,high-voltage-2,13,0.704211
time,Hardware,Voltage,Current
1626722616938,high-voltage-2,14,0.740793
time,Hardware,Voltage,Current
1626722616938,high-voltage-2,15,0.771111
time,Hardware,Voltage,Current
1626722616938,high-voltage-2,16,0.798815
time,Hardware,Voltage,Current
1626722616938,high-voltage-2,17,0.82189
time,Hardware,Voltage,Current
1626722616938,high-voltage-2,18,0.846943
time,Hardware,Voltage,Current
1626722616938,high-voltage-2,19,0.869326
time,Hardware,Voltage,Current
1626722616938,high-voltage-2,20,0.892804
time,Hardware,Voltage,Current
1626722616938,high-voltage-2,25,0.988625
time,Hardware,Voltage,Current
1626722616938,high-voltage-2,30,1.08452
time,Hardware,Voltage,Current
1626722616938,high-voltage-2,35,1.18102
time,Hardware,Voltage,Current
1626722616938,high-voltage-2,40,1.29357
time,Hardware,Voltage,Current
1626722616938,high-voltage-2,45,1.43063
time,Hardware,Voltage,Current
1626722616938,high-voltage-2,50,1.53053
time,Hardware,Voltage,Current
1626722616938,high-voltage-2,55,1.62567
time,Hardware,Voltage,Current
1626722616938,high-voltage-2,60,1.71487
time,Hardware,Voltage,Current
1626722616938,high-voltage-2,65,1.8017
time,Hardware,Voltage,Current
1626722616938,high-voltage-2,70,1.88221
time,Hardware,Voltage,Current
1626722616938,high-voltage-2,75,1.96167
time,Hardware,Voltage,Current
1626722616938,high-voltage-2,80,2.03821
time,Hardware,Voltage,Current
1626722616938,high-voltage-2,85,2.1112
time,Hardware,Voltage,Current
1626722616938,high-voltage-2,90,2.18217
time,Hardware,Voltage,Current
1626722616938,high-voltage-2,95,2.24858
time,Hardware,Voltage,Current
1626722616938,high-voltage-2,100,2.31347
