{
    "Data": [0.0, 0.0, 0.0, 0.0, 0.0, 0.0, 0.0, 0.0, 0.0, 0.0, 0.0, 0.0, 0.0, 0.0, 0.0, 0.0, 0.0, 0.0, 0.0, 0.0, 0.0, 0.0, 0.0, 0.0, 0.0, 0.0, 0.0, 0.0, 0.0, 0.0, 0.0, 0.0, 0.0, 0.0, 0.0, 0.0, 0.0, 0.0, 0.0, 0.0, 0.0, 0.0, 0.0, 0.0, 0.0, 0.0, 0.0, 0.0, 0.0, 0.0, 71.0, 110.0, 138.0, 139.0, 170.0, 202.0, 233.0, 268.0, 272.0, 356.0, 351.0, 401.0, 495.0, 578.0, 538.0, 595.0, 640.0, 752.0, 798.0, 753.0, 818.0, 836.0, 877.0, 858.0, 915.0, 924.0, 855.0, 983.0, 922.0, 879.0, 834.0, 771.0, 866.0, 848.0, 894.0, 987.0, 1140.0, 1361.0, 1700.0, 2086.0, 2439.0, 2711.0, 2850.0, 2966.0, 2591.0, 2326.0, 1937.0, 1446.0, 1057.0, 713.0, 512.0, 381.0, 273.0, 168.0, 133.0, 89.0, 60.0, 61.0, 37.0, 37.0, 30.0, 24.0, 23.0, 17.0, 17.0, 26.0, 14.0, 12.0, 17.0, 15.0, 12.0, 11.0, 15.0, 11.0, 11.0, 9.0, 9.0, 9.0, 8.0, 5.0, 7.0, 6.0, 4.0, 6.0, 7.0, 8.0, 6.0, 5.0, 4.0, 4.0, 3.0, 4.0, 2.0, 0.0, 3.0, 4.0, 2.0, 3.0, 1.0, 3.0, 3.0, 7.0, 5.0, 9.0, 14.0, 8.0, 10.0, 23.0, 19.0, 30.0, 39.0, 42.0, 45.0, 61.0, 105.0, 106.0, 123.0, 157.0, 189.0, 206.0, 233.0, 266.0, 345.0, 391.0, 433.0, 539.0, 530.0, 609.0, 629.0, 687.0, 735.0, 751.0, 805.0, 907.0, 884.0, 849.0, 866.0, 896.0, 874.0, 937.0, 889.0, 881.0, 802.0, 728.0, 756.0, 689.0, 615.0, 616.0, 511.0, 477.0, 408.0, 342.0, 371.0, 319.0, 278.0, 234.0, 196.0, 190.0, 152.0, 138.0, 112.0, 105.0, 89.0, 78.0, 51.0, 41.0, 37.0, 38.0, 24.0, 20.0, 24.0, 9.0, 11.0, 9.0, 5.0, 4.0, 2.0, 0.0, 3.0, 0.0, 0.0, 0.0, 2.0, 0.0, 1.0, 0.0, 1.0, 0.0, 0.0, 0.0, 0.0, 0.0, 0.0, 0.0, 0.0, 0.0, 0.0, 0.0, 0.0, 1.0, 0.0, 0.0, 0.0, 0.0, 1.0, 0.0, 0.0, 0.0, 0.0, 0.0, 0.0, 0.0, 0.0, 0.0, 0.0, 0.0, 0.0, 0.0, 0.0, 0.0, 0.0, 0.0, 0.0, 0.0, 0.0, 0.0, 0.0, 0.0, 0.0, 0.0, 0.0, 0.0, 0.0, 0.0, 0.0, 0.0, 0.0, 0.0, 0.0, 0.0, 0.0, 0.0, 0.0, 0.0, 0.0, 0.0, 0.0, 0.0, 0.0, 0.0, 0.0, 0.0, 0.0, 0.0, 0.0, 0.0, 0.0, 0.0, 0.0, 0.0, 0.0, 0.0, 0.0, 0.0, 0.0, 0.0, 0.0, 0.0, 0.0, 0.0, 0.0, 1.0, 0.0, 0.0, 0.0, 0.0, 0.0, 0.0, 0.0, 0.0, 0.0, 0.0, 0.0, 0.0, 0.0, 0.0, 0.0, 0.0, 0.0, 0.0, 0.0, 0.0, 0.0, 0.0, 0.0, 0.0, 0.0, 0.0, 0.0, 0.0, 0.0, 0.0, 0.0, 0.0, 0.0, 0.0, 0.0, 0.0, 0.0, 0.0, 0.0, 0.0, 0.0],
    "Name": "ThresholdDist-0",
    "Overflow": 0.0,
    "Type": "Histo1d",
    "Underflow": 0.0,
    "x": {
        "AxisTitle": "Threshold [e]",
        "Bins": 363,
        "High": 3625.0,
        "Low": -5.0
    },
    "y": {
        "AxisTitle": "Number of Pixels"
    },
    "z": {
        "AxisTitle": "z"
    }
}