{
    "Data": [[387.0, 82.0, 52.0, 39.0, 19.0, 22.0, 29.0, 22.0, 14.0, 12.0, 18.0, 15.0, 12.0, 8.0, 8.0, 8.0, 8.0, 6.0, 6.0, 5.0, 7.0, 8.0, 4.0, 4.0, 5.0, 3.0, 6.0, 4.0, 7.0, 0.0, 0.0, 2.0, 6.0, 0.0, 4.0, 7.0, 2.0, 2.0, 2.0, 4.0, 5.0, 1.0, 2.0, 2.0, 3.0, 3.0, 1.0, 9.0, 4.0], [820.0, 211.0, 91.0, 37.0, 32.0, 20.0, 13.0, 9.0, 14.0, 9.0, 11.0, 19.0, 12.0, 19.0, 12.0, 9.0, 12.0, 15.0, 10.0, 8.0, 8.0, 6.0, 10.0, 7.0, 6.0, 7.0, 3.0, 5.0, 4.0, 5.0, 4.0, 10.0, 3.0, 5.0, 2.0, 3.0, 2.0, 1.0, 7.0, 5.0, 2.0, 5.0, 6.0, 4.0, 3.0, 3.0, 6.0, 2.0, 7.0], [1751.0, 458.0, 188.0, 99.0, 70.0, 45.0, 26.0, 21.0, 16.0, 6.0, 8.0, 5.0, 10.0, 7.0, 12.0, 14.0, 11.0, 8.0, 8.0, 9.0, 9.0, 13.0, 10.0, 9.0, 11.0, 10.0, 8.0, 9.0, 12.0, 7.0, 13.0, 7.0, 8.0, 8.0, 5.0, 9.0, 3.0, 2.0, 0.0, 9.0, 2.0, 3.0, 6.0, 8.0, 5.0, 5.0, 5.0, 9.0, 6.0], [3486.0, 1109.0, 490.0, 281.0, 154.0, 134.0, 94.0, 65.0, 40.0, 30.0, 25.0, 25.0, 27.0, 14.0, 12.0, 24.0, 9.0, 7.0, 8.0, 6.0, 7.0, 7.0, 9.0, 11.0, 3.0, 6.0, 6.0, 4.0, 15.0, 9.0, 10.0, 7.0, 7.0, 10.0, 8.0, 13.0, 12.0, 11.0, 6.0, 8.0, 9.0, 5.0, 5.0, 13.0, 8.0, 7.0, 8.0, 7.0, 12.0], [6532.0, 2651.0, 1243.0, 721.0, 479.0, 337.0, 227.0, 185.0, 148.0, 127.0, 81.0, 78.0, 66.0, 39.0, 51.0, 30.0, 33.0, 22.0, 18.0, 18.0, 27.0, 13.0, 18.0, 19.0, 6.0, 10.0, 9.0, 4.0, 4.0, 6.0, 9.0, 3.0, 5.0, 4.0, 3.0, 9.0, 3.0, 10.0, 7.0, 17.0, 19.0, 12.0, 7.0, 16.0, 17.0, 15.0, 19.0, 13.0, 21.0], [9510.0, 4814.0, 2939.0, 1966.0, 1267.0, 926.0, 648.0, 498.0, 374.0, 302.0, 238.0, 209.0, 173.0, 149.0, 122.0, 114.0, 88.0, 86.0, 75.0, 74.0, 52.0, 58.0, 45.0, 42.0, 30.0, 15.0, 26.0, 18.0, 19.0, 20.0, 15.0, 16.0, 15.0, 13.0, 16.0, 11.0, 4.0, 9.0, 7.0, 8.0, 9.0, 8.0, 8.0, 14.0, 20.0, 24.0, 19.0, 27.0, 40.0], [8859.0, 7048.0, 5222.0, 3986.0, 3107.0, 2465.0, 2021.0, 1564.0, 1268.0, 956.0, 831.0, 624.0, 520.0, 424.0, 352.0, 290.0, 250.0, 241.0, 207.0, 147.0, 148.0, 134.0, 130.0, 116.0, 112.0, 84.0, 85.0, 81.0, 58.0, 80.0, 57.0, 49.0, 34.0, 29.0, 38.0, 34.0, 25.0, 34.0, 26.0, 19.0, 20.0, 17.0, 10.0, 11.0, 9.0, 13.0, 25.0, 26.0, 54.0], [2124.0, 2752.0, 3250.0, 3378.0, 3507.0, 3535.0, 3392.0, 3122.0, 2940.0, 2691.0, 2453.0, 2257.0, 1949.0, 1775.0, 1485.0, 1297.0, 1110.0, 983.0, 818.0, 694.0, 606.0, 450.0, 427.0, 359.0, 293.0, 278.0, 241.0, 214.0, 190.0, 179.0, 160.0, 148.0, 138.0, 121.0, 107.0, 115.0, 63.0, 84.0, 95.0, 54.0, 66.0, 67.0, 57.0, 39.0, 42.0, 32.0, 38.0, 25.0, 58.0], [443.0, 320.0, 446.0, 545.0, 635.0, 846.0, 956.0, 1133.0, 1352.0, 1514.0, 1622.0, 1883.0, 2056.0, 1975.0, 2217.0, 2355.0, 2249.0, 2329.0, 2247.0, 2286.0, 2190.0, 2149.0, 1984.0, 1868.0, 1716.0, 1512.0, 1384.0, 1222.0, 1142.0, 964.0, 789.0, 725.0, 593.0, 551.0, 397.0, 355.0, 354.0, 272.0, 268.0, 239.0, 173.0, 190.0, 177.0, 132.0, 137.0, 106.0, 104.0, 92.0, 93.0], [268.0, 156.0, 115.0, 137.0, 118.0, 169.0, 169.0, 205.0, 229.0, 260.0, 267.0, 316.0, 332.0, 393.0, 422.0, 549.0, 569.0, 674.0, 758.0, 935.0, 1044.0, 1224.0, 1316.0, 1451.0, 1608.0, 1694.0, 1870.0, 1996.0, 2056.0, 2130.0, 2213.0, 2294.0, 2265.0, 2245.0, 2247.0, 2118.0, 2035.0, 1928.0, 1905.0, 1665.0, 1406.0, 1245.0, 988.0, 907.0, 699.0, 648.0, 462.0, 363.0, 308.0], [280.0, 121.0, 70.0, 69.0, 39.0, 49.0, 57.0, 51.0, 62.0, 66.0, 68.0, 94.0, 101.0, 103.0, 110.0, 100.0, 144.0, 142.0, 176.0, 181.0, 230.0, 260.0, 278.0, 311.0, 303.0, 383.0, 406.0, 495.0, 580.0, 608.0, 747.0, 954.0, 1030.0, 1188.0, 1424.0, 1568.0, 1875.0, 2086.0, 2346.0, 2590.0, 2785.0, 3032.0, 3234.0, 3458.0, 3483.0, 3381.0, 3395.0, 2998.0, 2569.0], [303.0, 130.0, 75.0, 60.0, 45.0, 33.0, 43.0, 39.0, 29.0, 29.0, 31.0, 32.0, 33.0, 45.0, 30.0, 39.0, 43.0, 53.0, 50.0, 60.0, 62.0, 72.0, 85.0, 80.0, 95.0, 102.0, 112.0, 146.0, 162.0, 210.0, 236.0, 240.0, 273.0, 337.0, 388.0, 459.0, 538.0, 698.0, 774.0, 962.0, 1218.0, 1544.0, 1904.0, 2543.0, 3021.0, 3941.0, 4882.0, 6256.0, 8569.0], [460.0, 145.0, 98.0, 52.0, 39.0, 33.0, 36.0, 35.0, 30.0, 20.0, 21.0, 16.0, 20.0, 20.0, 25.0, 24.0, 29.0, 28.0, 30.0, 25.0, 21.0, 24.0, 23.0, 29.0, 33.0, 48.0, 37.0, 50.0, 46.0, 41.0, 67.0, 80.0, 89.0, 96.0, 120.0, 142.0, 169.0, 210.0, 265.0, 287.0, 385.0, 567.0, 680.0, 939.0, 1344.0, 1914.0, 3050.0, 4991.0, 9172.0], [727.0, 194.0, 75.0, 65.0, 46.0, 33.0, 34.0, 21.0, 19.0, 21.0, 20.0, 13.0, 15.0, 28.0, 12.0, 17.0, 26.0, 22.0, 19.0, 28.0, 24.0, 28.0, 21.0, 18.0, 19.0, 21.0, 17.0, 21.0, 26.0, 24.0, 26.0, 27.0, 20.0, 34.0, 39.0, 41.0, 60.0, 59.0, 91.0, 103.0, 123.0, 184.0, 247.0, 301.0, 455.0, 771.0, 1302.0, 2644.0, 6518.0], [1305.0, 358.0, 140.0, 57.0, 42.0, 34.0, 25.0, 19.0, 20.0, 19.0, 14.0, 15.0, 15.0, 22.0, 16.0, 7.0, 16.0, 15.0, 19.0, 9.0, 18.0, 20.0, 21.0, 14.0, 19.0, 20.0, 15.0, 13.0, 15.0, 25.0, 15.0, 19.0, 16.0, 27.0, 19.0, 22.0, 22.0, 36.0, 38.0, 45.0, 38.0, 70.0, 77.0, 102.0, 149.0, 215.0, 484.0, 1060.0, 3567.0], [2032.0, 577.0, 229.0, 100.0, 59.0, 35.0, 19.0, 23.0, 19.0, 15.0, 11.0, 13.0, 19.0, 14.0, 8.0, 16.0, 14.0, 18.0, 10.0, 15.0, 11.0, 13.0, 8.0, 13.0, 14.0, 14.0, 12.0, 15.0, 17.0, 9.0, 10.0, 12.0, 13.0, 16.0, 15.0, 23.0, 24.0, 26.0, 19.0, 17.0, 30.0, 33.0, 39.0, 58.0, 57.0, 114.0, 176.0, 409.0, 1658.0], [2999.0, 1104.0, 501.0, 211.0, 114.0, 67.0, 32.0, 27.0, 31.0, 17.0, 15.0, 10.0, 11.0, 12.0, 11.0, 9.0, 9.0, 10.0, 7.0, 9.0, 12.0, 9.0, 7.0, 12.0, 10.0, 19.0, 8.0, 11.0, 6.0, 9.0, 15.0, 6.0, 10.0, 11.0, 17.0, 14.0, 15.0, 15.0, 14.0, 15.0, 26.0, 20.0, 24.0, 24.0, 57.0, 46.0, 78.0, 187.0, 720.0], [4036.0, 1748.0, 970.0, 492.0, 245.0, 166.0, 80.0, 64.0, 44.0, 17.0, 19.0, 23.0, 13.0, 12.0, 12.0, 15.0, 9.0, 6.0, 8.0, 8.0, 8.0, 10.0, 8.0, 9.0, 5.0, 8.0, 6.0, 7.0, 12.0, 6.0, 10.0, 6.0, 9.0, 4.0, 9.0, 10.0, 13.0, 9.0, 13.0, 11.0, 18.0, 28.0, 20.0, 28.0, 28.0, 37.0, 47.0, 91.0, 347.0], [4687.0, 2497.0, 1491.0, 847.0, 541.0, 348.0, 240.0, 138.0, 90.0, 75.0, 65.0, 49.0, 24.0, 20.0, 16.0, 16.0, 13.0, 14.0, 11.0, 7.0, 10.0, 6.0, 4.0, 6.0, 9.0, 12.0, 9.0, 2.0, 5.0, 8.0, 5.0, 7.0, 9.0, 6.0, 5.0, 9.0, 4.0, 11.0, 6.0, 16.0, 12.0, 13.0, 12.0, 20.0, 19.0, 22.0, 33.0, 81.0, 203.0], [4614.0, 3058.0, 1950.0, 1388.0, 1004.0, 696.0, 524.0, 372.0, 244.0, 176.0, 149.0, 88.0, 88.0, 66.0, 41.0, 30.0, 29.0, 27.0, 15.0, 14.0, 7.0, 10.0, 6.0, 9.0, 8.0, 6.0, 11.0, 6.0, 5.0, 5.0, 2.0, 3.0, 8.0, 4.0, 13.0, 5.0, 5.0, 5.0, 5.0, 12.0, 7.0, 14.0, 11.0, 11.0, 20.0, 19.0, 22.0, 47.0, 116.0], [4207.0, 2976.0, 2427.0, 1842.0, 1503.0, 1039.0, 815.0, 661.0, 529.0, 397.0, 326.0, 295.0, 208.0, 150.0, 126.0, 105.0, 78.0, 57.0, 54.0, 40.0, 35.0, 21.0, 25.0, 13.0, 20.0, 13.0, 10.0, 11.0, 12.0, 3.0, 4.0, 5.0, 8.0, 2.0, 4.0, 4.0, 6.0, 9.0, 2.0, 4.0, 9.0, 7.0, 9.0, 16.0, 12.0, 12.0, 22.0, 27.0, 87.0], [3200.0, 2870.0, 2353.0, 2017.0, 1714.0, 1381.0, 1110.0, 997.0, 798.0, 717.0, 556.0, 464.0, 419.0, 313.0, 292.0, 257.0, 202.0, 156.0, 131.0, 98.0, 95.0, 59.0, 60.0, 49.0, 34.0, 26.0, 23.0, 17.0, 20.0, 19.0, 12.0, 6.0, 12.0, 14.0, 4.0, 9.0, 3.0, 4.0, 5.0, 4.0, 7.0, 4.0, 8.0, 5.0, 5.0, 15.0, 13.0, 32.0, 55.0], [2265.0, 2126.0, 2024.0, 1795.0, 1646.0, 1534.0, 1369.0, 1257.0, 1032.0, 997.0, 862.0, 768.0, 620.0, 561.0, 488.0, 433.0, 359.0, 337.0, 291.0, 232.0, 222.0, 153.0, 149.0, 136.0, 99.0, 108.0, 62.0, 60.0, 53.0, 42.0, 37.0, 30.0, 20.0, 19.0, 17.0, 14.0, 6.0, 9.0, 7.0, 4.0, 8.0, 6.0, 8.0, 5.0, 7.0, 7.0, 9.0, 15.0, 56.0], [1411.0, 1480.0, 1455.0, 1417.0, 1462.0, 1382.0, 1309.0, 1264.0, 1178.0, 1111.0, 970.0, 931.0, 893.0, 780.0, 746.0, 681.0, 617.0, 506.0, 509.0, 411.0, 413.0, 383.0, 309.0, 265.0, 242.0, 210.0, 184.0, 157.0, 151.0, 127.0, 104.0, 69.0, 75.0, 59.0, 53.0, 42.0, 35.0, 41.0, 24.0, 17.0, 12.0, 6.0, 11.0, 15.0, 8.0, 10.0, 6.0, 18.0, 23.0], [849.0, 884.0, 956.0, 994.0, 990.0, 1007.0, 1074.0, 1031.0, 1035.0, 1121.0, 1024.0, 937.0, 966.0, 906.0, 887.0, 845.0, 810.0, 787.0, 688.0, 639.0, 589.0, 576.0, 521.0, 475.0, 444.0, 404.0, 366.0, 327.0, 308.0, 245.0, 207.0, 221.0, 178.0, 144.0, 136.0, 120.0, 101.0, 74.0, 75.0, 50.0, 48.0, 37.0, 25.0, 30.0, 17.0, 13.0, 16.0, 11.0, 29.0], [441.0, 449.0, 600.0, 610.0, 621.0, 718.0, 722.0, 769.0, 779.0, 813.0, 835.0, 844.0, 891.0, 889.0, 808.0, 891.0, 833.0, 843.0, 836.0, 748.0, 748.0, 778.0, 667.0, 714.0, 597.0, 567.0, 594.0, 517.0, 496.0, 446.0, 471.0, 389.0, 387.0, 306.0, 316.0, 255.0, 224.0, 188.0, 159.0, 145.0, 134.0, 101.0, 96.0, 83.0, 65.0, 49.0, 30.0, 25.0, 23.0], [258.0, 277.0, 282.0, 316.0, 394.0, 431.0, 510.0, 506.0, 473.0, 600.0, 601.0, 625.0, 673.0, 669.0, 710.0, 746.0, 760.0, 788.0, 713.0, 729.0, 767.0, 776.0, 793.0, 762.0, 766.0, 718.0, 741.0, 691.0, 683.0, 629.0, 650.0, 590.0, 550.0, 536.0, 492.0, 456.0, 447.0, 394.0, 405.0, 318.0, 288.0, 270.0, 214.0, 202.0, 168.0, 114.0, 85.0, 65.0, 54.0], [183.0, 165.0, 164.0, 169.0, 213.0, 250.0, 280.0, 313.0, 328.0, 344.0, 380.0, 420.0, 433.0, 466.0, 541.0, 537.0, 575.0, 585.0, 612.0, 613.0, 649.0, 692.0, 676.0, 713.0, 717.0, 698.0, 762.0, 718.0, 748.0, 795.0, 758.0, 754.0, 727.0, 719.0, 685.0, 707.0, 650.0, 634.0, 572.0, 580.0, 555.0, 512.0, 466.0, 378.0, 355.0, 315.0, 239.0, 184.0, 124.0], [110.0, 73.0, 104.0, 99.0, 103.0, 110.0, 150.0, 153.0, 165.0, 200.0, 215.0, 238.0, 234.0, 290.0, 331.0, 376.0, 380.0, 376.0, 412.0, 436.0, 493.0, 507.0, 565.0, 558.0, 586.0, 603.0, 636.0, 712.0, 707.0, 719.0, 816.0, 766.0, 850.0, 870.0, 769.0, 807.0, 822.0, 867.0, 803.0, 875.0, 820.0, 764.0, 737.0, 702.0, 680.0, 610.0, 542.0, 449.0, 369.0], [109.0, 70.0, 75.0, 54.0, 94.0, 91.0, 68.0, 87.0, 67.0, 112.0, 105.0, 120.0, 140.0, 164.0, 176.0, 204.0, 191.0, 225.0, 244.0, 297.0, 300.0, 331.0, 391.0, 408.0, 454.0, 483.0, 489.0, 485.0, 559.0, 587.0, 627.0, 708.0, 789.0, 726.0, 801.0, 848.0, 858.0, 934.0, 896.0, 976.0, 1009.0, 1025.0, 1066.0, 1038.0, 1057.0, 1001.0, 984.0, 868.0, 793.0], [94.0, 55.0, 50.0, 54.0, 32.0, 40.0, 61.0, 35.0, 50.0, 55.0, 63.0, 62.0, 67.0, 92.0, 108.0, 110.0, 121.0, 133.0, 180.0, 143.0, 180.0, 191.0, 223.0, 233.0, 286.0, 296.0, 295.0, 365.0, 420.0, 432.0, 482.0, 507.0, 620.0, 629.0, 644.0, 678.0, 827.0, 861.0, 936.0, 963.0, 1046.0, 1150.0, 1239.0, 1308.0, 1301.0, 1387.0, 1418.0, 1406.0, 1426.0], [73.0, 43.0, 33.0, 20.0, 24.0, 31.0, 19.0, 30.0, 18.0, 40.0, 36.0, 33.0, 46.0, 52.0, 43.0, 62.0, 67.0, 69.0, 70.0, 100.0, 107.0, 118.0, 127.0, 143.0, 155.0, 185.0, 168.0, 240.0, 244.0, 262.0, 300.0, 343.0, 369.0, 417.0, 508.0, 561.0, 607.0, 650.0, 735.0, 881.0, 990.0, 1046.0, 1191.0, 1341.0, 1490.0, 1635.0, 1851.0, 2101.0, 2244.0], [70.0, 26.0, 25.0, 13.0, 9.0, 14.0, 13.0, 13.0, 26.0, 25.0, 27.0, 37.0, 23.0, 13.0, 17.0, 26.0, 30.0, 45.0, 50.0, 55.0, 45.0, 58.0, 77.0, 78.0, 84.0, 85.0, 102.0, 108.0, 160.0, 165.0, 174.0, 181.0, 218.0, 266.0, 299.0, 380.0, 368.0, 484.0, 551.0, 640.0, 762.0, 850.0, 1015.0, 1232.0, 1481.0, 1705.0, 1999.0, 2484.0, 3151.0], [74.0, 33.0, 34.0, 19.0, 14.0, 21.0, 51.0, 10.0, 9.0, 9.0, 26.0, 14.0, 11.0, 16.0, 21.0, 23.0, 15.0, 19.0, 15.0, 15.0, 38.0, 28.0, 31.0, 27.0, 44.0, 32.0, 47.0, 55.0, 71.0, 74.0, 93.0, 104.0, 120.0, 149.0, 180.0, 206.0, 237.0, 302.0, 324.0, 382.0, 485.0, 601.0, 774.0, 963.0, 1252.0, 1578.0, 1986.0, 2622.0, 3820.0], [88.0, 34.0, 21.0, 14.0, 29.0, 13.0, 8.0, 10.0, 18.0, 10.0, 13.0, 17.0, 4.0, 8.0, 5.0, 3.0, 5.0, 9.0, 8.0, 8.0, 10.0, 15.0, 19.0, 24.0, 30.0, 22.0, 32.0, 32.0, 48.0, 47.0, 49.0, 57.0, 44.0, 69.0, 100.0, 106.0, 143.0, 188.0, 194.0, 248.0, 320.0, 466.0, 511.0, 634.0, 860.0, 1195.0, 1777.0, 2435.0, 3974.0], [94.0, 37.0, 36.0, 22.0, 36.0, 12.0, 12.0, 44.0, 26.0, 5.0, 1.0, 5.0, 24.0, 3.0, 2.0, 2.0, 1.0, 8.0, 3.0, 8.0, 7.0, 7.0, 12.0, 11.0, 8.0, 14.0, 14.0, 17.0, 50.0, 47.0, 32.0, 31.0, 35.0, 30.0, 47.0, 56.0, 77.0, 90.0, 123.0, 128.0, 194.0, 193.0, 321.0, 414.0, 568.0, 817.0, 1340.0, 2069.0, 3950.0], [92.0, 26.0, 21.0, 15.0, 24.0, 38.0, 6.0, 5.0, 24.0, 12.0, 2.0, 8.0, 21.0, 3.0, 6.0, 22.0, 8.0, 12.0, 13.0, 5.0, 6.0, 2.0, 3.0, 5.0, 4.0, 23.0, 9.0, 8.0, 7.0, 6.0, 11.0, 8.0, 11.0, 16.0, 10.0, 22.0, 35.0, 57.0, 60.0, 69.0, 95.0, 109.0, 168.0, 240.0, 374.0, 536.0, 904.0, 1532.0, 3306.0], [98.0, 41.0, 59.0, 19.0, 7.0, 8.0, 3.0, 9.0, 5.0, 4.0, 3.0, 2.0, 2.0, 2.0, 8.0, 1.0, 4.0, 2.0, 6.0, 23.0, 9.0, 24.0, 23.0, 5.0, 5.0, 21.0, 9.0, 20.0, 8.0, 3.0, 5.0, 10.0, 4.0, 5.0, 10.0, 14.0, 16.0, 19.0, 29.0, 33.0, 60.0, 59.0, 84.0, 112.0, 174.0, 351.0, 600.0, 1075.0, 2588.0], [83.0, 33.0, 14.0, 21.0, 23.0, 17.0, 51.0, 7.0, 6.0, 29.0, 17.0, 9.0, 4.0, 9.0, 17.0, 27.0, 50.0, 10.0, 3.0, 1.0, 2.0, 2.0, 19.0, 7.0, 4.0, 23.0, 6.0, 11.0, 38.0, 4.0, 4.0, 25.0, 24.0, 7.0, 5.0, 5.0, 3.0, 30.0, 7.0, 10.0, 18.0, 33.0, 42.0, 58.0, 113.0, 173.0, 324.0, 662.0, 1835.0], [81.0, 32.0, 13.0, 17.0, 4.0, 22.0, 14.0, 4.0, 6.0, 21.0, 9.0, 10.0, 17.0, 25.0, 4.0, 2.0, 3.0, 5.0, 3.0, 3.0, 3.0, 1.0, 3.0, 2.0, 16.0, 16.0, 2.0, 5.0, 12.0, 14.0, 1.0, 1.0, 15.0, 12.0, 13.0, 13.0, 5.0, 1.0, 5.0, 30.0, 24.0, 19.0, 19.0, 20.0, 64.0, 105.0, 162.0, 424.0, 1299.0], [77.0, 38.0, 17.0, 33.0, 9.0, 8.0, 21.0, 8.0, 26.0, 8.0, 28.0, 30.0, 17.0, 11.0, 5.0, 2.0, 3.0, 19.0, 10.0, 33.0, 22.0, 1.0, 5.0, 2.0, 2.0, 4.0, 3.0, 5.0, 0.0, 3.0, 20.0, 3.0, 22.0, 24.0, 5.0, 0.0, 0.0, 5.0, 3.0, 3.0, 25.0, 15.0, 31.0, 13.0, 40.0, 64.0, 126.0, 252.0, 786.0], [80.0, 35.0, 15.0, 17.0, 14.0, 3.0, 8.0, 43.0, 16.0, 7.0, 2.0, 1.0, 3.0, 3.0, 4.0, 4.0, 1.0, 2.0, 1.0, 6.0, 3.0, 46.0, 24.0, 9.0, 2.0, 2.0, 21.0, 5.0, 2.0, 15.0, 12.0, 2.0, 25.0, 0.0, 3.0, 12.0, 14.0, 2.0, 12.0, 32.0, 4.0, 4.0, 4.0, 5.0, 28.0, 18.0, 44.0, 119.0, 490.0], [84.0, 51.0, 25.0, 33.0, 7.0, 9.0, 6.0, 3.0, 22.0, 11.0, 3.0, 3.0, 2.0, 19.0, 12.0, 5.0, 25.0, 6.0, 1.0, 0.0, 4.0, 5.0, 4.0, 4.0, 2.0, 2.0, 4.0, 1.0, 0.0, 3.0, 1.0, 17.0, 15.0, 17.0, 2.0, 0.0, 10.0, 16.0, 0.0, 0.0, 2.0, 2.0, 3.0, 1.0, 26.0, 32.0, 17.0, 67.0, 277.0], [64.0, 32.0, 21.0, 16.0, 30.0, 7.0, 23.0, 15.0, 6.0, 19.0, 29.0, 4.0, 12.0, 39.0, 6.0, 1.0, 5.0, 4.0, 25.0, 14.0, 18.0, 3.0, 1.0, 21.0, 6.0, 2.0, 3.0, 3.0, 0.0, 2.0, 1.0, 0.0, 22.0, 5.0, 23.0, 17.0, 7.0, 11.0, 18.0, 1.0, 0.0, 2.0, 0.0, 21.0, 32.0, 3.0, 12.0, 31.0, 158.0], [74.0, 54.0, 43.0, 13.0, 11.0, 8.0, 8.0, 48.0, 7.0, 24.0, 6.0, 27.0, 17.0, 14.0, 1.0, 5.0, 3.0, 8.0, 25.0, 1.0, 2.0, 0.0, 1.0, 0.0, 4.0, 2.0, 1.0, 2.0, 3.0, 26.0, 2.0, 1.0, 2.0, 17.0, 9.0, 23.0, 1.0, 21.0, 26.0, 9.0, 18.0, 2.0, 1.0, 0.0, 2.0, 2.0, 7.0, 9.0, 99.0], [60.0, 44.0, 20.0, 18.0, 11.0, 32.0, 3.0, 29.0, 8.0, 5.0, 4.0, 1.0, 5.0, 20.0, 11.0, 29.0, 23.0, 2.0, 3.0, 15.0, 14.0, 2.0, 14.0, 12.0, 1.0, 21.0, 9.0, 1.0, 0.0, 2.0, 2.0, 0.0, 1.0, 20.0, 5.0, 0.0, 0.0, 0.0, 14.0, 13.0, 1.0, 0.0, 0.0, 15.0, 12.0, 2.0, 8.0, 10.0, 54.0], [84.0, 36.0, 17.0, 7.0, 13.0, 4.0, 7.0, 7.0, 6.0, 4.0, 1.0, 23.0, 27.0, 10.0, 2.0, 3.0, 3.0, 5.0, 7.0, 1.0, 2.0, 3.0, 2.0, 5.0, 19.0, 11.0, 0.0, 0.0, 1.0, 0.0, 2.0, 1.0, 3.0, 0.0, 1.0, 0.0, 19.0, 6.0, 1.0, 0.0, 0.0, 0.0, 1.0, 0.0, 2.0, 0.0, 2.0, 7.0, 31.0], [76.0, 38.0, 20.0, 11.0, 7.0, 6.0, 8.0, 6.0, 28.0, 7.0, 3.0, 1.0, 5.0, 3.0, 1.0, 3.0, 2.0, 3.0, 14.0, 17.0, 4.0, 4.0, 4.0, 2.0, 2.0, 1.0, 1.0, 12.0, 14.0, 0.0, 0.0, 28.0, 64.0, 7.0, 0.0, 3.0, 0.0, 0.0, 1.0, 0.0, 0.0, 24.0, 3.0, 2.0, 6.0, 21.0, 0.0, 4.0, 14.0], [91.0, 55.0, 23.0, 8.0, 13.0, 2.0, 5.0, 5.0, 9.0, 22.0, 9.0, 2.0, 8.0, 2.0, 6.0, 3.0, 10.0, 20.0, 2.0, 10.0, 18.0, 2.0, 2.0, 1.0, 2.0, 2.0, 2.0, 12.0, 15.0, 1.0, 16.0, 9.0, 2.0, 0.0, 0.0, 1.0, 0.0, 0.0, 0.0, 2.0, 0.0, 1.0, 2.0, 0.0, 0.0, 1.0, 2.0, 4.0, 29.0], [74.0, 33.0, 20.0, 10.0, 10.0, 6.0, 6.0, 8.0, 5.0, 23.0, 9.0, 2.0, 2.0, 3.0, 4.0, 28.0, 21.0, 7.0, 3.0, 3.0, 1.0, 1.0, 1.0, 0.0, 7.0, 3.0, 4.0, 1.0, 0.0, 2.0, 0.0, 1.0, 1.0, 2.0, 26.0, 0.0, 0.0, 0.0, 1.0, 0.0, 1.0, 0.0, 1.0, 0.0, 2.0, 13.0, 11.0, 3.0, 6.0], [76.0, 70.0, 21.0, 10.0, 8.0, 6.0, 8.0, 6.0, 7.0, 2.0, 2.0, 3.0, 3.0, 3.0, 2.0, 4.0, 0.0, 10.0, 3.0, 3.0, 2.0, 0.0, 29.0, 21.0, 1.0, 26.0, 3.0, 0.0, 4.0, 0.0, 2.0, 0.0, 23.0, 4.0, 0.0, 0.0, 1.0, 0.0, 1.0, 1.0, 0.0, 0.0, 0.0, 1.0, 0.0, 24.0, 2.0, 3.0, 7.0]],
    "Name": "sCurve-0",
    "Overflow": 2383372.0,
    "Type": "Histo2d",
    "Underflow": 0.0,
    "x": {
        "AxisTitle": "Vcal",
        "Bins": 51,
        "High": 302.5,
        "Low": 47.5
    },
    "y": {
        "AxisTitle": "Occupancy",
        "Bins": 49,
        "High": 49.5,
        "Low": 0.5
    },
    "z": {
        "AxisTitle": "Number of pixels"
    }
}