{
    "Data": [5.0, 16.0, 3.0, 3.0, 11.0, 6.0, 8.0, 13.0, 42.0, 180.0, 541.0, 1368.0, 2684.0, 4027.0, 4449.0, 4433.0, 3473.0, 2602.0, 2284.0, 2669.0, 3292.0, 4025.0, 4505.0, 4504.0, 3831.0, 2991.0, 2355.0, 1725.0, 1404.0, 1216.0, 1063.0, 1045.0, 895.0, 910.0, 817.0, 885.0, 811.0, 812.0, 856.0, 806.0, 851.0, 768.0, 753.0, 742.0, 690.0, 611.0, 518.0, 508.0, 425.0, 374.0, 319.0, 275.0, 238.0, 230.0, 190.0, 167.0, 126.0, 119.0, 101.0, 89.0, 72.0, 62.0, 54.0, 55.0, 40.0, 27.0, 40.0, 23.0, 19.0, 19.0, 19.0, 21.0, 14.0, 29.0, 14.0, 12.0, 14.0, 8.0, 13.0, 13.0],
    "Name": "NoiseDist-0",
    "Overflow": 150.0,
    "Type": "Histo1d",
    "Underflow": 0.0,
    "x": {
        "AxisTitle": "Noise [e]",
        "Bins": 80,
        "High": 401.0,
        "Low": -2.0
    },
    "y": {
        "AxisTitle": "Number of Pixels"
    },
    "z": {
        "AxisTitle": "z"
    }
}