{
    "Data": [0.0, 0.0, 0.0, 0.0, 0.0, 0.0, 0.0, 0.0, 0.0, 0.0, 0.0, 0.0, 0.0, 0.0, 0.0, 0.0, 0.0, 0.0, 0.0, 0.0, 0.0, 0.0, 0.0, 0.0, 0.0, 0.0, 0.0, 0.0, 0.0, 0.0, 0.0, 0.0, 0.0, 0.0, 0.0, 0.0, 0.0, 0.0, 0.0, 0.0, 0.0, 0.0, 0.0, 0.0, 0.0, 0.0, 0.0, 0.0, 0.0, 0.0, 47.0, 104.0, 123.0, 132.0, 144.0, 185.0, 235.0, 220.0, 243.0, 311.0, 323.0, 345.0, 437.0, 483.0, 527.0, 535.0, 584.0, 681.0, 672.0, 721.0, 793.0, 795.0, 828.0, 801.0, 894.0, 909.0, 862.0, 931.0, 879.0, 874.0, 851.0, 894.0, 890.0, 868.0, 866.0, 951.0, 1095.0, 1410.0, 1607.0, 1896.0, 2300.0, 2597.0, 2987.0, 3083.0, 2711.0, 2488.0, 2097.0, 1627.0, 1194.0, 864.0, 633.0, 438.0, 301.0, 226.0, 116.0, 110.0, 64.0, 70.0, 58.0, 36.0, 36.0, 25.0, 27.0, 16.0, 24.0, 18.0, 18.0, 16.0, 12.0, 14.0, 14.0, 20.0, 9.0, 12.0, 18.0, 14.0, 10.0, 6.0, 16.0, 4.0, 6.0, 1.0, 6.0, 7.0, 6.0, 4.0, 7.0, 6.0, 5.0, 5.0, 8.0, 1.0, 5.0, 4.0, 2.0, 3.0, 0.0, 3.0, 2.0, 4.0, 2.0, 3.0, 2.0, 9.0, 2.0, 3.0, 4.0, 14.0, 13.0, 11.0, 18.0, 38.0, 38.0, 56.0, 47.0, 68.0, 86.0, 123.0, 133.0, 161.0, 187.0, 236.0, 258.0, 359.0, 398.0, 436.0, 480.0, 565.0, 581.0, 648.0, 666.0, 738.0, 810.0, 862.0, 835.0, 921.0, 945.0, 960.0, 956.0, 944.0, 960.0, 877.0, 865.0, 904.0, 806.0, 763.0, 712.0, 634.0, 593.0, 511.0, 481.0, 413.0, 411.0, 320.0, 261.0, 246.0, 233.0, 176.0, 142.0, 145.0, 112.0, 91.0, 84.0, 72.0, 42.0, 31.0, 33.0, 14.0, 17.0, 19.0, 14.0, 11.0, 6.0, 5.0, 1.0, 3.0, 2.0, 3.0, 0.0, 0.0, 0.0, 0.0, 0.0, 0.0, 0.0, 0.0, 0.0, 0.0, 0.0, 0.0, 0.0, 0.0, 0.0, 1.0, 0.0, 0.0, 0.0, 1.0, 0.0, 0.0, 0.0, 0.0, 0.0, 0.0, 0.0, 0.0, 0.0, 0.0, 0.0, 0.0, 0.0, 0.0, 0.0, 0.0, 1.0, 0.0, 0.0, 0.0, 0.0, 0.0, 0.0, 0.0, 0.0, 0.0, 0.0, 0.0, 0.0, 0.0, 0.0, 0.0, 0.0, 0.0, 0.0, 0.0, 0.0, 0.0, 0.0, 0.0, 0.0, 0.0, 0.0, 0.0, 0.0, 0.0, 0.0, 0.0, 0.0, 0.0, 0.0, 0.0, 0.0, 0.0, 0.0, 0.0, 0.0, 0.0, 0.0, 0.0, 0.0, 0.0, 0.0, 0.0, 0.0, 0.0, 0.0, 0.0, 1.0, 0.0, 0.0, 0.0, 0.0, 0.0, 0.0, 0.0, 0.0, 0.0, 0.0, 0.0, 0.0, 0.0, 0.0, 0.0, 0.0, 0.0, 0.0, 0.0, 0.0, 0.0, 0.0, 0.0, 0.0, 0.0, 0.0, 0.0, 0.0, 0.0, 0.0, 0.0, 0.0, 0.0, 0.0, 0.0, 0.0, 0.0, 0.0, 0.0, 0.0, 0.0, 0.0, 0.0, 0.0, 0.0, 0.0, 0.0],
    "Name": "ThresholdDist-0",
    "Overflow": 0.0,
    "Type": "Histo1d",
    "Underflow": 0.0,
    "x": {
        "AxisTitle": "Threshold [e]",
        "Bins": 364,
        "High": 3635.0,
        "Low": -5.0
    },
    "y": {
        "AxisTitle": "Number of Pixels"
    },
    "z": {
        "AxisTitle": "z"
    }
}