{
    "Data": [0.0, 0.0, 0.0, 0.0, 0.0, 0.0, 0.0, 0.0, 0.0, 0.0, 0.0, 0.0, 0.0, 0.0, 0.0, 0.0, 0.0, 0.0, 0.0, 0.0, 0.0, 0.0, 0.0, 0.0, 0.0, 0.0, 0.0, 0.0, 0.0, 0.0, 0.0, 0.0, 0.0, 0.0, 0.0, 0.0, 0.0, 0.0, 0.0, 0.0, 0.0, 0.0, 0.0, 0.0, 0.0, 0.0, 0.0, 0.0, 0.0, 0.0, 3.0, 8.0, 4.0, 9.0, 4.0, 6.0, 6.0, 11.0, 6.0, 5.0, 8.0, 9.0, 6.0, 3.0, 9.0, 12.0, 15.0, 21.0, 17.0, 20.0, 26.0, 32.0, 33.0, 37.0, 47.0, 45.0, 68.0, 88.0, 75.0, 105.0, 128.0, 133.0, 177.0, 226.0, 220.0, 307.0, 358.0, 422.0, 521.0, 769.0, 1076.0, 1474.0, 2252.0, 2966.0, 3663.0, 4036.0, 4044.0, 4117.0, 3558.0, 2986.0, 2394.0, 1906.0, 1468.0, 1280.0, 1105.0, 1015.0, 937.0, 862.0, 783.0, 740.0, 640.0, 598.0, 539.0, 470.0, 421.0, 348.0, 310.0, 270.0, 228.0, 185.0, 152.0, 118.0, 98.0, 102.0, 80.0, 50.0, 55.0, 47.0, 45.0, 42.0, 31.0, 32.0, 32.0, 28.0, 28.0, 23.0, 25.0, 19.0, 12.0, 21.0, 15.0, 13.0, 17.0, 8.0, 16.0, 18.0, 22.0, 11.0, 11.0, 11.0, 7.0, 3.0, 6.0, 6.0, 13.0, 6.0, 16.0, 8.0, 13.0, 5.0, 10.0, 9.0, 5.0, 9.0, 10.0, 15.0, 8.0, 13.0, 23.0, 29.0, 30.0, 23.0, 44.0, 52.0, 67.0, 71.0, 101.0, 130.0, 164.0, 144.0, 212.0, 258.0, 287.0, 329.0, 398.0, 433.0, 459.0, 560.0, 562.0, 655.0, 690.0, 761.0, 764.0, 835.0, 903.0, 925.0, 955.0, 880.0, 906.0, 918.0, 928.0, 912.0, 864.0, 824.0, 778.0, 695.0, 698.0, 627.0, 580.0, 562.0, 431.0, 423.0, 383.0, 365.0, 301.0, 265.0, 239.0, 207.0, 168.0, 153.0, 109.0, 101.0, 72.0, 57.0, 63.0, 46.0, 42.0, 33.0, 28.0, 22.0, 19.0, 13.0, 11.0, 6.0, 6.0, 9.0, 7.0, 2.0, 1.0, 2.0, 0.0, 2.0, 0.0, 1.0, 1.0, 1.0, 0.0, 0.0, 0.0, 0.0, 0.0, 1.0, 0.0, 0.0, 0.0, 0.0, 1.0, 1.0, 0.0, 0.0, 0.0, 0.0, 1.0, 0.0, 0.0, 0.0, 0.0, 0.0, 0.0, 0.0, 0.0, 0.0, 0.0, 0.0, 0.0, 0.0, 0.0, 0.0, 0.0, 0.0, 0.0, 0.0, 1.0, 0.0, 0.0, 1.0, 0.0, 0.0, 0.0, 0.0, 0.0, 0.0, 0.0, 0.0, 0.0, 0.0, 0.0, 0.0, 0.0, 0.0, 0.0, 0.0, 0.0, 0.0, 0.0, 0.0, 0.0, 0.0, 0.0, 0.0, 0.0, 0.0, 0.0, 0.0, 0.0, 0.0, 0.0, 0.0, 0.0, 0.0, 0.0, 0.0, 0.0, 0.0, 0.0, 0.0, 0.0, 0.0, 0.0, 0.0, 0.0, 0.0, 0.0, 0.0, 0.0, 0.0, 0.0, 0.0, 0.0, 0.0, 0.0, 0.0, 0.0, 0.0, 0.0, 0.0, 0.0, 0.0, 0.0, 0.0, 0.0, 0.0, 0.0, 0.0, 0.0, 0.0, 0.0, 0.0, 0.0, 0.0, 0.0, 0.0, 0.0, 0.0, 0.0, 0.0],
    "Name": "ThresholdDist-0",
    "Overflow": 0.0,
    "Type": "Histo1d",
    "Underflow": 0.0,
    "x": {
        "AxisTitle": "Threshold [e]",
        "Bins": 366,
        "High": 3655.0,
        "Low": -5.0
    },
    "y": {
        "AxisTitle": "Number of Pixels"
    },
    "z": {
        "AxisTitle": "z"
    }
}