{
    "Data": [[2059.0, 836.0, 525.0, 356.0, 266.0, 223.0, 152.0, 153.0, 126.0, 127.0, 109.0, 85.0, 80.0, 81.0, 61.0, 54.0, 50.0, 43.0, 38.0, 36.0, 26.0, 27.0, 23.0, 25.0, 19.0, 24.0, 12.0, 17.0, 14.0, 23.0, 15.0, 13.0, 13.0, 16.0, 12.0, 14.0, 16.0, 5.0, 10.0, 5.0, 14.0, 11.0, 6.0, 15.0, 11.0, 9.0, 12.0, 10.0, 11.0], [2601.0, 1312.0, 835.0, 611.0, 516.0, 373.0, 319.0, 209.0, 255.0, 191.0, 209.0, 131.0, 157.0, 132.0, 106.0, 81.0, 105.0, 89.0, 84.0, 79.0, 52.0, 78.0, 78.0, 62.0, 46.0, 53.0, 47.0, 45.0, 39.0, 38.0, 24.0, 25.0, 26.0, 30.0, 26.0, 31.0, 28.0, 20.0, 15.0, 10.0, 20.0, 29.0, 22.0, 15.0, 14.0, 18.0, 21.0, 32.0, 25.0], [2984.0, 1667.0, 1153.0, 845.0, 752.0, 547.0, 488.0, 442.0, 349.0, 286.0, 279.0, 281.0, 229.0, 200.0, 185.0, 165.0, 180.0, 146.0, 140.0, 136.0, 118.0, 115.0, 97.0, 106.0, 105.0, 113.0, 88.0, 96.0, 80.0, 72.0, 74.0, 68.0, 69.0, 60.0, 57.0, 64.0, 55.0, 53.0, 65.0, 56.0, 43.0, 47.0, 39.0, 38.0, 42.0, 39.0, 43.0, 53.0, 53.0], [3372.0, 1811.0, 1249.0, 999.0, 833.0, 670.0, 624.0, 563.0, 519.0, 468.0, 452.0, 364.0, 346.0, 337.0, 311.0, 299.0, 283.0, 249.0, 257.0, 228.0, 236.0, 202.0, 183.0, 168.0, 155.0, 154.0, 142.0, 156.0, 155.0, 159.0, 124.0, 132.0, 123.0, 118.0, 115.0, 109.0, 118.0, 102.0, 99.0, 115.0, 106.0, 99.0, 108.0, 113.0, 121.0, 88.0, 96.0, 96.0, 108.0], [5237.0, 2427.0, 1527.0, 1119.0, 937.0, 772.0, 692.0, 693.0, 607.0, 569.0, 493.0, 443.0, 455.0, 438.0, 384.0, 364.0, 391.0, 329.0, 384.0, 337.0, 320.0, 318.0, 295.0, 287.0, 256.0, 284.0, 259.0, 233.0, 227.0, 248.0, 216.0, 245.0, 218.0, 195.0, 214.0, 211.0, 194.0, 178.0, 198.0, 196.0, 193.0, 180.0, 191.0, 184.0, 203.0, 232.0, 217.0, 227.0, 255.0], [6655.0, 4214.0, 2790.0, 1981.0, 1589.0, 1284.0, 1097.0, 946.0, 812.0, 712.0, 607.0, 581.0, 545.0, 491.0, 495.0, 470.0, 441.0, 416.0, 386.0, 444.0, 389.0, 379.0, 366.0, 323.0, 371.0, 339.0, 333.0, 332.0, 348.0, 326.0, 325.0, 315.0, 349.0, 328.0, 340.0, 311.0, 295.0, 337.0, 333.0, 316.0, 313.0, 283.0, 308.0, 358.0, 358.0, 375.0, 428.0, 472.0, 557.0], [3406.0, 3038.0, 2704.0, 2486.0, 2094.0, 2016.0, 1823.0, 1628.0, 1514.0, 1344.0, 1249.0, 1093.0, 1074.0, 1041.0, 960.0, 868.0, 760.0, 729.0, 634.0, 626.0, 608.0, 617.0, 539.0, 489.0, 517.0, 489.0, 458.0, 500.0, 428.0, 440.0, 438.0, 376.0, 451.0, 425.0, 455.0, 454.0, 405.0, 404.0, 467.0, 468.0, 458.0, 479.0, 516.0, 531.0, 590.0, 611.0, 709.0, 807.0, 968.0], [908.0, 914.0, 890.0, 890.0, 954.0, 1018.0, 1100.0, 1104.0, 1082.0, 1126.0, 1154.0, 1096.0, 1135.0, 1037.0, 1108.0, 1064.0, 1085.0, 1086.0, 1065.0, 1003.0, 1117.0, 1026.0, 985.0, 965.0, 1018.0, 1003.0, 916.0, 902.0, 852.0, 894.0, 834.0, 844.0, 793.0, 830.0, 749.0, 779.0, 801.0, 762.0, 697.0, 702.0, 789.0, 743.0, 795.0, 775.0, 914.0, 882.0, 1056.0, 1287.0, 1677.0], [364.0, 246.0, 293.0, 268.0, 276.0, 324.0, 334.0, 342.0, 358.0, 376.0, 436.0, 365.0, 444.0, 485.0, 497.0, 506.0, 516.0, 602.0, 581.0, 655.0, 626.0, 718.0, 741.0, 717.0, 786.0, 780.0, 823.0, 941.0, 883.0, 1007.0, 1040.0, 1056.0, 1064.0, 1141.0, 1106.0, 1175.0, 1276.0, 1398.0, 1332.0, 1377.0, 1420.0, 1468.0, 1528.0, 1534.0, 1673.0, 1682.0, 1929.0, 2238.0, 2976.0], [245.0, 142.0, 132.0, 110.0, 112.0, 138.0, 127.0, 122.0, 137.0, 132.0, 131.0, 155.0, 161.0, 148.0, 158.0, 184.0, 186.0, 216.0, 232.0, 246.0, 213.0, 235.0, 291.0, 257.0, 309.0, 344.0, 348.0, 344.0, 405.0, 472.0, 482.0, 511.0, 567.0, 629.0, 689.0, 746.0, 824.0, 922.0, 975.0, 1058.0, 1286.0, 1445.0, 1602.0, 1934.0, 2289.0, 2527.0, 3200.0, 4015.0, 5595.0], [159.0, 99.0, 73.0, 65.0, 75.0, 58.0, 54.0, 80.0, 62.0, 52.0, 54.0, 87.0, 77.0, 77.0, 82.0, 65.0, 88.0, 84.0, 83.0, 111.0, 80.0, 113.0, 90.0, 123.0, 112.0, 124.0, 164.0, 141.0, 172.0, 165.0, 186.0, 212.0, 215.0, 227.0, 279.0, 312.0, 325.0, 349.0, 425.0, 535.0, 588.0, 667.0, 866.0, 1026.0, 1282.0, 1696.0, 2467.0, 3785.0, 7058.0], [169.0, 82.0, 51.0, 53.0, 47.0, 48.0, 45.0, 41.0, 45.0, 42.0, 42.0, 33.0, 42.0, 39.0, 41.0, 36.0, 35.0, 40.0, 47.0, 52.0, 41.0, 40.0, 50.0, 49.0, 69.0, 55.0, 69.0, 58.0, 79.0, 80.0, 88.0, 94.0, 94.0, 124.0, 109.0, 143.0, 168.0, 180.0, 199.0, 228.0, 322.0, 327.0, 367.0, 499.0, 582.0, 803.0, 1220.0, 2017.0, 4990.0], [150.0, 81.0, 52.0, 50.0, 37.0, 36.0, 23.0, 27.0, 38.0, 30.0, 28.0, 33.0, 28.0, 23.0, 21.0, 27.0, 30.0, 33.0, 23.0, 24.0, 23.0, 27.0, 19.0, 30.0, 19.0, 31.0, 29.0, 36.0, 36.0, 34.0, 40.0, 40.0, 60.0, 53.0, 46.0, 74.0, 65.0, 89.0, 94.0, 109.0, 120.0, 156.0, 188.0, 248.0, 339.0, 425.0, 625.0, 1067.0, 2691.0], [175.0, 85.0, 46.0, 42.0, 28.0, 36.0, 38.0, 30.0, 26.0, 34.0, 22.0, 35.0, 20.0, 27.0, 21.0, 14.0, 20.0, 17.0, 17.0, 6.0, 17.0, 18.0, 16.0, 9.0, 13.0, 13.0, 19.0, 21.0, 19.0, 22.0, 11.0, 25.0, 25.0, 22.0, 28.0, 35.0, 36.0, 32.0, 48.0, 59.0, 56.0, 66.0, 92.0, 141.0, 153.0, 237.0, 367.0, 584.0, 1531.0], [241.0, 64.0, 46.0, 40.0, 30.0, 28.0, 29.0, 30.0, 26.0, 25.0, 23.0, 19.0, 28.0, 17.0, 20.0, 16.0, 18.0, 10.0, 17.0, 15.0, 13.0, 11.0, 20.0, 6.0, 7.0, 16.0, 7.0, 12.0, 15.0, 4.0, 11.0, 11.0, 13.0, 20.0, 13.0, 11.0, 22.0, 18.0, 28.0, 18.0, 25.0, 43.0, 53.0, 54.0, 65.0, 111.0, 148.0, 327.0, 926.0], [399.0, 96.0, 48.0, 36.0, 31.0, 24.0, 27.0, 28.0, 27.0, 27.0, 17.0, 15.0, 20.0, 19.0, 20.0, 10.0, 12.0, 10.0, 13.0, 11.0, 12.0, 11.0, 8.0, 14.0, 9.0, 12.0, 13.0, 10.0, 22.0, 7.0, 6.0, 6.0, 9.0, 14.0, 6.0, 11.0, 12.0, 7.0, 12.0, 17.0, 15.0, 16.0, 30.0, 21.0, 44.0, 52.0, 71.0, 182.0, 460.0], [688.0, 217.0, 80.0, 54.0, 37.0, 30.0, 14.0, 30.0, 28.0, 20.0, 17.0, 23.0, 18.0, 19.0, 16.0, 15.0, 19.0, 10.0, 10.0, 7.0, 11.0, 6.0, 5.0, 9.0, 9.0, 2.0, 3.0, 4.0, 4.0, 10.0, 5.0, 6.0, 8.0, 8.0, 14.0, 10.0, 16.0, 11.0, 9.0, 8.0, 12.0, 14.0, 22.0, 22.0, 25.0, 27.0, 52.0, 99.0, 250.0], [1141.0, 378.0, 179.0, 98.0, 64.0, 36.0, 44.0, 28.0, 25.0, 21.0, 25.0, 18.0, 13.0, 20.0, 20.0, 5.0, 11.0, 14.0, 8.0, 7.0, 7.0, 8.0, 10.0, 5.0, 9.0, 4.0, 5.0, 7.0, 5.0, 9.0, 3.0, 4.0, 0.0, 5.0, 7.0, 8.0, 5.0, 5.0, 7.0, 9.0, 12.0, 17.0, 14.0, 11.0, 24.0, 14.0, 33.0, 63.0, 132.0], [1686.0, 672.0, 326.0, 212.0, 142.0, 88.0, 61.0, 50.0, 43.0, 35.0, 30.0, 34.0, 19.0, 15.0, 19.0, 17.0, 11.0, 13.0, 12.0, 8.0, 6.0, 10.0, 8.0, 8.0, 6.0, 3.0, 1.0, 2.0, 4.0, 5.0, 4.0, 3.0, 2.0, 5.0, 4.0, 7.0, 6.0, 6.0, 5.0, 5.0, 6.0, 4.0, 10.0, 7.0, 9.0, 20.0, 33.0, 29.0, 87.0], [2473.0, 1067.0, 648.0, 427.0, 267.0, 181.0, 141.0, 101.0, 69.0, 74.0, 61.0, 41.0, 38.0, 21.0, 16.0, 31.0, 18.0, 17.0, 15.0, 17.0, 13.0, 9.0, 6.0, 6.0, 9.0, 7.0, 2.0, 4.0, 6.0, 3.0, 3.0, 6.0, 4.0, 1.0, 2.0, 3.0, 4.0, 2.0, 0.0, 7.0, 3.0, 4.0, 8.0, 5.0, 7.0, 9.0, 15.0, 30.0, 77.0], [3078.0, 1626.0, 966.0, 699.0, 419.0, 327.0, 285.0, 205.0, 163.0, 141.0, 109.0, 100.0, 73.0, 62.0, 62.0, 54.0, 43.0, 23.0, 35.0, 22.0, 19.0, 23.0, 16.0, 8.0, 11.0, 8.0, 10.0, 14.0, 6.0, 8.0, 3.0, 4.0, 4.0, 6.0, 5.0, 4.0, 0.0, 4.0, 4.0, 5.0, 5.0, 6.0, 4.0, 2.0, 4.0, 5.0, 14.0, 17.0, 46.0], [3558.0, 1899.0, 1303.0, 900.0, 684.0, 571.0, 469.0, 324.0, 303.0, 260.0, 192.0, 164.0, 153.0, 110.0, 116.0, 103.0, 74.0, 77.0, 59.0, 54.0, 33.0, 37.0, 44.0, 34.0, 28.0, 14.0, 21.0, 19.0, 10.0, 16.0, 9.0, 11.0, 6.0, 6.0, 9.0, 8.0, 9.0, 5.0, 6.0, 5.0, 6.0, 5.0, 5.0, 4.0, 3.0, 12.0, 5.0, 11.0, 38.0], [3532.0, 2240.0, 1681.0, 1244.0, 954.0, 822.0, 669.0, 562.0, 478.0, 452.0, 347.0, 287.0, 272.0, 217.0, 197.0, 203.0, 168.0, 149.0, 119.0, 123.0, 119.0, 65.0, 88.0, 61.0, 64.0, 58.0, 37.0, 51.0, 35.0, 43.0, 35.0, 22.0, 22.0, 22.0, 21.0, 18.0, 16.0, 23.0, 17.0, 15.0, 10.0, 12.0, 8.0, 6.0, 6.0, 19.0, 7.0, 8.0, 14.0], [3085.0, 2196.0, 1779.0, 1472.0, 1265.0, 989.0, 918.0, 739.0, 651.0, 600.0, 507.0, 456.0, 449.0, 398.0, 329.0, 301.0, 268.0, 247.0, 238.0, 215.0, 208.0, 169.0, 148.0, 149.0, 129.0, 113.0, 132.0, 84.0, 75.0, 67.0, 70.0, 72.0, 67.0, 54.0, 51.0, 52.0, 41.0, 48.0, 45.0, 26.0, 28.0, 24.0, 22.0, 16.0, 23.0, 18.0, 17.0, 24.0, 26.0], [2313.0, 1939.0, 1630.0, 1433.0, 1189.0, 1076.0, 978.0, 903.0, 785.0, 772.0, 662.0, 672.0, 575.0, 499.0, 493.0, 418.0, 423.0, 399.0, 345.0, 354.0, 320.0, 288.0, 266.0, 271.0, 220.0, 210.0, 209.0, 198.0, 178.0, 162.0, 164.0, 134.0, 129.0, 130.0, 112.0, 107.0, 93.0, 85.0, 70.0, 94.0, 73.0, 56.0, 59.0, 46.0, 48.0, 45.0, 40.0, 40.0, 40.0], [1417.0, 1230.0, 1157.0, 1172.0, 1078.0, 1019.0, 962.0, 890.0, 821.0, 782.0, 738.0, 732.0, 676.0, 657.0, 627.0, 579.0, 513.0, 516.0, 485.0, 509.0, 458.0, 421.0, 453.0, 376.0, 370.0, 384.0, 354.0, 304.0, 341.0, 293.0, 270.0, 274.0, 257.0, 226.0, 228.0, 183.0, 194.0, 210.0, 144.0, 167.0, 153.0, 130.0, 131.0, 134.0, 88.0, 91.0, 109.0, 93.0, 92.0], [742.0, 673.0, 766.0, 724.0, 717.0, 681.0, 726.0, 697.0, 712.0, 748.0, 698.0, 702.0, 643.0, 666.0, 622.0, 627.0, 635.0, 602.0, 590.0, 580.0, 558.0, 575.0, 535.0, 491.0, 482.0, 498.0, 487.0, 431.0, 444.0, 429.0, 412.0, 375.0, 401.0, 349.0, 396.0, 308.0, 326.0, 320.0, 309.0, 277.0, 304.0, 274.0, 271.0, 269.0, 252.0, 219.0, 209.0, 218.0, 181.0], [337.0, 342.0, 373.0, 377.0, 405.0, 417.0, 483.0, 466.0, 515.0, 549.0, 512.0, 533.0, 520.0, 576.0, 565.0, 571.0, 533.0, 578.0, 570.0, 549.0, 574.0, 543.0, 553.0, 533.0, 587.0, 525.0, 515.0, 553.0, 510.0, 494.0, 557.0, 539.0, 517.0, 503.0, 506.0, 498.0, 498.0, 455.0, 475.0, 504.0, 486.0, 458.0, 447.0, 450.0, 444.0, 419.0, 474.0, 404.0, 467.0], [205.0, 200.0, 163.0, 214.0, 210.0, 205.0, 228.0, 273.0, 249.0, 276.0, 302.0, 308.0, 345.0, 364.0, 379.0, 419.0, 404.0, 404.0, 392.0, 460.0, 437.0, 431.0, 514.0, 478.0, 529.0, 517.0, 513.0, 547.0, 559.0, 545.0, 577.0, 577.0, 554.0, 579.0, 580.0, 581.0, 568.0, 608.0, 675.0, 662.0, 681.0, 639.0, 732.0, 660.0, 711.0, 756.0, 766.0, 793.0, 880.0], [155.0, 104.0, 102.0, 118.0, 112.0, 113.0, 119.0, 143.0, 134.0, 182.0, 156.0, 197.0, 178.0, 208.0, 219.0, 225.0, 229.0, 253.0, 237.0, 259.0, 315.0, 318.0, 330.0, 350.0, 377.0, 367.0, 363.0, 396.0, 422.0, 499.0, 501.0, 519.0, 557.0, 574.0, 589.0, 584.0, 642.0, 652.0, 655.0, 737.0, 805.0, 820.0, 839.0, 931.0, 944.0, 1078.0, 1120.0, 1180.0, 1504.0], [117.0, 66.0, 63.0, 44.0, 80.0, 60.0, 75.0, 77.0, 74.0, 85.0, 79.0, 95.0, 94.0, 98.0, 96.0, 114.0, 122.0, 158.0, 142.0, 160.0, 185.0, 163.0, 196.0, 194.0, 201.0, 241.0, 240.0, 261.0, 290.0, 304.0, 300.0, 371.0, 408.0, 446.0, 479.0, 494.0, 539.0, 545.0, 637.0, 663.0, 752.0, 838.0, 896.0, 984.0, 1048.0, 1239.0, 1456.0, 1770.0, 2306.0], [131.0, 65.0, 34.0, 37.0, 78.0, 53.0, 44.0, 48.0, 35.0, 57.0, 45.0, 55.0, 58.0, 44.0, 47.0, 65.0, 54.0, 70.0, 63.0, 66.0, 79.0, 88.0, 102.0, 109.0, 114.0, 123.0, 126.0, 159.0, 164.0, 169.0, 191.0, 194.0, 227.0, 266.0, 257.0, 360.0, 401.0, 403.0, 492.0, 514.0, 562.0, 657.0, 803.0, 863.0, 1070.0, 1348.0, 1511.0, 2037.0, 2914.0], [112.0, 39.0, 36.0, 52.0, 46.0, 59.0, 23.0, 21.0, 10.0, 17.0, 30.0, 25.0, 28.0, 29.0, 27.0, 32.0, 35.0, 39.0, 44.0, 42.0, 31.0, 38.0, 48.0, 37.0, 65.0, 83.0, 79.0, 75.0, 100.0, 82.0, 87.0, 106.0, 127.0, 158.0, 162.0, 195.0, 205.0, 270.0, 310.0, 319.0, 342.0, 495.0, 554.0, 680.0, 843.0, 1004.0, 1394.0, 1967.0, 3208.0], [146.0, 94.0, 51.0, 26.0, 19.0, 25.0, 46.0, 31.0, 25.0, 34.0, 47.0, 30.0, 41.0, 18.0, 32.0, 50.0, 46.0, 15.0, 15.0, 15.0, 7.0, 16.0, 16.0, 29.0, 17.0, 37.0, 24.0, 43.0, 38.0, 49.0, 46.0, 57.0, 51.0, 81.0, 88.0, 110.0, 99.0, 124.0, 149.0, 179.0, 226.0, 268.0, 316.0, 425.0, 577.0, 695.0, 1078.0, 1623.0, 2990.0], [114.0, 62.0, 30.0, 25.0, 19.0, 15.0, 22.0, 27.0, 52.0, 24.0, 38.0, 39.0, 23.0, 29.0, 20.0, 13.0, 16.0, 20.0, 16.0, 10.0, 17.0, 22.0, 7.0, 12.0, 16.0, 40.0, 45.0, 35.0, 34.0, 16.0, 18.0, 28.0, 20.0, 37.0, 30.0, 40.0, 58.0, 77.0, 94.0, 83.0, 108.0, 134.0, 177.0, 255.0, 312.0, 475.0, 713.0, 1258.0, 2492.0], [135.0, 77.0, 34.0, 19.0, 24.0, 41.0, 21.0, 13.0, 23.0, 28.0, 36.0, 11.0, 29.0, 26.0, 11.0, 14.0, 16.0, 27.0, 8.0, 5.0, 5.0, 8.0, 11.0, 19.0, 27.0, 30.0, 6.0, 8.0, 18.0, 32.0, 26.0, 16.0, 10.0, 2.0, 13.0, 17.0, 15.0, 15.0, 32.0, 66.0, 73.0, 74.0, 93.0, 127.0, 161.0, 272.0, 420.0, 751.0, 1778.0], [145.0, 85.0, 63.0, 31.0, 15.0, 16.0, 20.0, 7.0, 19.0, 36.0, 23.0, 36.0, 37.0, 13.0, 10.0, 15.0, 26.0, 18.0, 26.0, 10.0, 6.0, 11.0, 8.0, 6.0, 6.0, 2.0, 2.0, 1.0, 1.0, 40.0, 14.0, 2.0, 25.0, 1.0, 7.0, 10.0, 5.0, 20.0, 19.0, 9.0, 23.0, 26.0, 45.0, 70.0, 72.0, 117.0, 217.0, 422.0, 1158.0], [129.0, 68.0, 43.0, 28.0, 42.0, 27.0, 25.0, 22.0, 16.0, 15.0, 20.0, 10.0, 32.0, 17.0, 12.0, 11.0, 30.0, 18.0, 27.0, 18.0, 7.0, 5.0, 3.0, 4.0, 2.0, 3.0, 0.0, 3.0, 0.0, 3.0, 2.0, 1.0, 2.0, 10.0, 30.0, 11.0, 3.0, 3.0, 4.0, 4.0, 8.0, 10.0, 10.0, 26.0, 47.0, 55.0, 120.0, 235.0, 689.0], [109.0, 58.0, 26.0, 25.0, 22.0, 20.0, 16.0, 16.0, 22.0, 45.0, 14.0, 18.0, 18.0, 10.0, 15.0, 15.0, 15.0, 15.0, 6.0, 5.0, 7.0, 3.0, 7.0, 5.0, 8.0, 0.0, 17.0, 9.0, 1.0, 2.0, 3.0, 2.0, 0.0, 23.0, 7.0, 20.0, 1.0, 2.0, 1.0, 0.0, 3.0, 22.0, 9.0, 13.0, 16.0, 27.0, 58.0, 114.0, 405.0], [101.0, 51.0, 29.0, 23.0, 23.0, 26.0, 49.0, 39.0, 14.0, 16.0, 13.0, 11.0, 12.0, 14.0, 44.0, 31.0, 14.0, 10.0, 11.0, 13.0, 11.0, 4.0, 4.0, 5.0, 4.0, 6.0, 24.0, 2.0, 1.0, 1.0, 1.0, 2.0, 2.0, 3.0, 2.0, 1.0, 0.0, 0.0, 2.0, 0.0, 4.0, 2.0, 2.0, 1.0, 3.0, 10.0, 17.0, 51.0, 196.0], [108.0, 53.0, 65.0, 50.0, 35.0, 16.0, 20.0, 41.0, 16.0, 9.0, 20.0, 17.0, 39.0, 22.0, 19.0, 10.0, 16.0, 7.0, 13.0, 9.0, 6.0, 2.0, 4.0, 2.0, 6.0, 26.0, 3.0, 4.0, 21.0, 0.0, 1.0, 1.0, 2.0, 0.0, 9.0, 17.0, 1.0, 1.0, 2.0, 0.0, 0.0, 2.0, 1.0, 1.0, 1.0, 9.0, 5.0, 25.0, 87.0], [126.0, 65.0, 33.0, 18.0, 19.0, 27.0, 21.0, 22.0, 16.0, 17.0, 43.0, 14.0, 17.0, 18.0, 33.0, 10.0, 13.0, 13.0, 8.0, 5.0, 9.0, 3.0, 5.0, 6.0, 2.0, 5.0, 24.0, 0.0, 1.0, 3.0, 1.0, 1.0, 1.0, 3.0, 2.0, 1.0, 1.0, 25.0, 0.0, 1.0, 3.0, 0.0, 1.0, 0.0, 2.0, 3.0, 3.0, 11.0, 41.0], [113.0, 47.0, 53.0, 24.0, 20.0, 20.0, 21.0, 21.0, 10.0, 22.0, 16.0, 18.0, 11.0, 13.0, 13.0, 32.0, 6.0, 23.0, 18.0, 10.0, 12.0, 9.0, 29.0, 8.0, 26.0, 6.0, 4.0, 2.0, 5.0, 3.0, 2.0, 2.0, 0.0, 2.0, 1.0, 0.0, 1.0, 1.0, 0.0, 1.0, 1.0, 2.0, 1.0, 2.0, 0.0, 2.0, 0.0, 4.0, 21.0], [110.0, 53.0, 35.0, 26.0, 15.0, 21.0, 19.0, 16.0, 16.0, 17.0, 16.0, 10.0, 17.0, 44.0, 10.0, 6.0, 17.0, 11.0, 7.0, 31.0, 7.0, 7.0, 7.0, 2.0, 9.0, 4.0, 2.0, 1.0, 0.0, 3.0, 1.0, 4.0, 1.0, 1.0, 1.0, 0.0, 2.0, 0.0, 2.0, 0.0, 1.0, 0.0, 1.0, 0.0, 2.0, 4.0, 4.0, 5.0, 10.0], [121.0, 43.0, 30.0, 24.0, 16.0, 16.0, 16.0, 23.0, 23.0, 19.0, 14.0, 15.0, 14.0, 18.0, 7.0, 6.0, 11.0, 6.0, 11.0, 10.0, 9.0, 8.0, 5.0, 5.0, 4.0, 2.0, 7.0, 3.0, 1.0, 1.0, 3.0, 1.0, 1.0, 2.0, 1.0, 2.0, 2.0, 0.0, 6.0, 0.0, 1.0, 2.0, 0.0, 1.0, 3.0, 1.0, 2.0, 4.0, 4.0], [112.0, 39.0, 42.0, 23.0, 20.0, 12.0, 17.0, 14.0, 23.0, 24.0, 14.0, 30.0, 13.0, 12.0, 9.0, 11.0, 7.0, 12.0, 6.0, 11.0, 9.0, 6.0, 4.0, 4.0, 2.0, 6.0, 5.0, 1.0, 3.0, 1.0, 1.0, 0.0, 2.0, 1.0, 0.0, 1.0, 0.0, 0.0, 0.0, 2.0, 1.0, 1.0, 2.0, 3.0, 0.0, 3.0, 2.0, 2.0, 6.0], [106.0, 49.0, 31.0, 18.0, 27.0, 15.0, 20.0, 20.0, 15.0, 12.0, 23.0, 15.0, 10.0, 13.0, 13.0, 10.0, 9.0, 7.0, 11.0, 8.0, 6.0, 10.0, 7.0, 7.0, 6.0, 2.0, 1.0, 1.0, 1.0, 2.0, 2.0, 1.0, 0.0, 2.0, 2.0, 0.0, 2.0, 2.0, 0.0, 4.0, 1.0, 0.0, 0.0, 3.0, 1.0, 1.0, 2.0, 5.0, 2.0], [95.0, 50.0, 30.0, 29.0, 18.0, 15.0, 16.0, 16.0, 14.0, 19.0, 16.0, 16.0, 28.0, 15.0, 17.0, 5.0, 9.0, 12.0, 13.0, 2.0, 5.0, 5.0, 6.0, 5.0, 7.0, 0.0, 3.0, 0.0, 3.0, 0.0, 1.0, 3.0, 1.0, 1.0, 2.0, 1.0, 1.0, 0.0, 2.0, 0.0, 0.0, 2.0, 2.0, 2.0, 0.0, 1.0, 2.0, 1.0, 3.0], [111.0, 50.0, 31.0, 22.0, 19.0, 19.0, 15.0, 16.0, 16.0, 15.0, 17.0, 18.0, 24.0, 15.0, 8.0, 9.0, 13.0, 7.0, 14.0, 10.0, 6.0, 9.0, 0.0, 4.0, 3.0, 4.0, 4.0, 1.0, 1.0, 2.0, 2.0, 2.0, 2.0, 0.0, 1.0, 1.0, 1.0, 0.0, 2.0, 1.0, 0.0, 0.0, 0.0, 16.0, 11.0, 0.0, 1.0, 3.0, 4.0], [118.0, 45.0, 31.0, 25.0, 14.0, 23.0, 19.0, 23.0, 10.0, 15.0, 17.0, 15.0, 15.0, 17.0, 6.0, 10.0, 14.0, 11.0, 9.0, 5.0, 2.0, 7.0, 9.0, 8.0, 5.0, 5.0, 3.0, 3.0, 3.0, 1.0, 0.0, 0.0, 3.0, 3.0, 0.0, 0.0, 0.0, 0.0, 1.0, 0.0, 6.0, 23.0, 1.0, 2.0, 0.0, 1.0, 2.0, 0.0, 4.0], [112.0, 57.0, 33.0, 20.0, 19.0, 17.0, 17.0, 11.0, 18.0, 21.0, 10.0, 16.0, 11.0, 19.0, 15.0, 12.0, 15.0, 8.0, 3.0, 14.0, 10.0, 3.0, 5.0, 9.0, 4.0, 4.0, 4.0, 4.0, 2.0, 2.0, 1.0, 0.0, 2.0, 2.0, 1.0, 0.0, 0.0, 2.0, 0.0, 2.0, 3.0, 1.0, 1.0, 1.0, 0.0, 1.0, 3.0, 2.0, 3.0]],
    "Name": "sCurve-0",
    "Overflow": 2563028.0,
    "Type": "Histo2d",
    "Underflow": 0.0,
    "x": {
        "AxisTitle": "Vcal",
        "Bins": 51,
        "High": 302.5,
        "Low": 47.5
    },
    "y": {
        "AxisTitle": "Occupancy",
        "Bins": 49,
        "High": 49.5,
        "Low": 0.5
    },
    "z": {
        "AxisTitle": "Number of pixels"
    }
}