{
    "Data": [0.0, 0.0, 0.0, 0.0, 0.0, 0.0, 0.0, 0.0, 0.0, 0.0, 0.0, 0.0, 0.0, 0.0, 0.0, 0.0, 0.0, 0.0, 0.0, 0.0, 0.0, 0.0, 0.0, 0.0, 0.0, 0.0, 0.0, 0.0, 0.0, 0.0, 0.0, 0.0, 0.0, 0.0, 0.0, 0.0, 0.0, 0.0, 0.0, 0.0, 0.0, 0.0, 0.0, 0.0, 0.0, 0.0, 0.0, 0.0, 0.0, 0.0, 7.0, 7.0, 10.0, 12.0, 13.0, 20.0, 16.0, 24.0, 9.0, 19.0, 20.0, 29.0, 23.0, 29.0, 31.0, 29.0, 47.0, 41.0, 43.0, 80.0, 98.0, 102.0, 115.0, 146.0, 173.0, 215.0, 237.0, 299.0, 349.0, 392.0, 444.0, 472.0, 567.0, 656.0, 717.0, 771.0, 814.0, 953.0, 1002.0, 1092.0, 1385.0, 1686.0, 2171.0, 2718.0, 3386.0, 3863.0, 4022.0, 3950.0, 3647.0, 3215.0, 2655.0, 2049.0, 1465.0, 1049.0, 825.0, 609.0, 473.0, 380.0, 334.0, 297.0, 218.0, 171.0, 160.0, 116.0, 105.0, 79.0, 76.0, 58.0, 35.0, 47.0, 38.0, 38.0, 29.0, 38.0, 14.0, 29.0, 23.0, 19.0, 19.0, 18.0, 21.0, 19.0, 18.0, 15.0, 15.0, 11.0, 10.0, 12.0, 10.0, 14.0, 12.0, 19.0, 11.0, 9.0, 11.0, 8.0, 6.0, 7.0, 5.0, 8.0, 8.0, 5.0, 6.0, 5.0, 7.0, 9.0, 5.0, 4.0, 6.0, 0.0, 8.0, 5.0, 3.0, 2.0, 2.0, 8.0, 13.0, 4.0, 12.0, 21.0, 24.0, 26.0, 35.0, 46.0, 53.0, 84.0, 115.0, 119.0, 128.0, 143.0, 187.0, 204.0, 239.0, 296.0, 353.0, 383.0, 437.0, 505.0, 488.0, 565.0, 604.0, 611.0, 642.0, 689.0, 727.0, 738.0, 743.0, 775.0, 749.0, 782.0, 768.0, 705.0, 698.0, 696.0, 637.0, 584.0, 569.0, 534.0, 554.0, 472.0, 446.0, 443.0, 381.0, 395.0, 356.0, 317.0, 251.0, 250.0, 237.0, 231.0, 205.0, 211.0, 219.0, 151.0, 166.0, 152.0, 151.0, 146.0, 130.0, 123.0, 126.0, 91.0, 97.0, 98.0, 92.0, 85.0, 70.0, 65.0, 70.0, 66.0, 55.0, 50.0, 42.0, 36.0, 46.0, 35.0, 40.0, 34.0, 40.0, 32.0, 32.0, 29.0, 28.0, 24.0, 31.0, 23.0, 14.0, 13.0, 25.0, 17.0, 15.0, 17.0, 9.0, 10.0, 10.0, 9.0, 12.0, 8.0, 4.0, 8.0, 7.0, 12.0, 7.0, 10.0, 7.0, 4.0, 12.0, 7.0, 6.0, 4.0, 10.0, 5.0, 2.0, 7.0, 2.0, 4.0, 5.0, 0.0, 5.0, 4.0, 5.0, 2.0, 7.0, 3.0, 0.0, 4.0, 3.0, 2.0, 2.0, 1.0, 0.0, 4.0, 0.0, 2.0, 3.0, 2.0, 1.0, 0.0, 3.0, 3.0, 0.0, 1.0, 2.0, 1.0, 4.0, 1.0, 2.0, 1.0, 0.0, 1.0, 1.0, 1.0, 1.0, 1.0, 1.0, 0.0, 0.0, 0.0, 0.0, 0.0, 0.0, 0.0, 0.0, 0.0, 0.0, 0.0, 0.0, 0.0, 0.0, 0.0, 0.0, 0.0, 0.0, 0.0, 0.0, 0.0, 0.0, 0.0, 0.0, 0.0, 0.0, 0.0, 0.0, 0.0, 0.0, 0.0, 0.0, 0.0, 0.0, 0.0, 0.0, 0.0, 0.0, 0.0, 0.0, 0.0, 0.0, 0.0, 0.0, 0.0, 0.0, 0.0, 0.0, 0.0, 0.0, 0.0, 0.0, 0.0, 0.0, 0.0, 0.0, 0.0, 0.0, 0.0, 0.0, 0.0, 0.0, 0.0, 0.0, 0.0],
    "Name": "ThresholdDist-0",
    "Overflow": 0.0,
    "Type": "Histo1d",
    "Underflow": 0.0,
    "x": {
        "AxisTitle": "Threshold [e]",
        "Bins": 390,
        "High": 3895.0,
        "Low": -5.0
    },
    "y": {
        "AxisTitle": "Number of Pixels"
    },
    "z": {
        "AxisTitle": "z"
    }
}