time,Hardware,Voltage,Current
1626743109370,high-voltage-2,1,0.105822
time,Hardware,Voltage,Current
1626743109370,high-voltage-2,2,0.158473
time,Hardware,Voltage,Current
1626743109370,high-voltage-2,3,0.187861
time,Hardware,Voltage,Current
1626743109370,high-voltage-2,4,0.211812
time,Hardware,Voltage,Current
1626743109370,high-voltage-2,5,0.237857
time,Hardware,Voltage,Current
1626743109370,high-voltage-2,6,0.261836
time,Hardware,Voltage,Current
1626743109370,high-voltage-2,7,0.286924
time,Hardware,Voltage,Current
1626743109370,high-voltage-2,8,0.312471
time,Hardware,Voltage,Current
1626743109370,high-voltage-2,9,0.337377
time,Hardware,Voltage,Current
1626743109370,high-voltage-2,10,0.360964
time,Hardware,Voltage,Current
1626743109370,high-voltage-2,11,0.382799
time,Hardware,Voltage,Current
1626743109370,high-voltage-2,12,0.403467
time,Hardware,Voltage,Current
1626743109370,high-voltage-2,13,0.420048
time,Hardware,Voltage,Current
1626743109370,high-voltage-2,14,0.433461
time,Hardware,Voltage,Current
1626743109370,high-voltage-2,15,0.447165
time,Hardware,Voltage,Current
1626743109370,high-voltage-2,16,0.457197
time,Hardware,Voltage,Current
1626743109370,high-voltage-2,17,0.470791
time,Hardware,Voltage,Current
1626743109370,high-voltage-2,18,0.479493
time,Hardware,Voltage,Current
1626743109370,high-voltage-2,19,0.491802
time,Hardware,Voltage,Current
1626743109370,high-voltage-2,20,0.501351
time,Hardware,Voltage,Current
1626743109370,high-voltage-2,25,0.551924
time,Hardware,Voltage,Current
1626743109370,high-voltage-2,30,0.604935
time,Hardware,Voltage,Current
1626743109370,high-voltage-2,35,0.660313
time,Hardware,Voltage,Current
1626743109370,high-voltage-2,40,0.72139
time,Hardware,Voltage,Current
1626743109370,high-voltage-2,45,0.797887
time,Hardware,Voltage,Current
1626743109370,high-voltage-2,50,0.858067
time,Hardware,Voltage,Current
1626743109370,high-voltage-2,55,0.917011
time,Hardware,Voltage,Current
1626743109370,high-voltage-2,60,0.971556
time,Hardware,Voltage,Current
1626743109370,high-voltage-2,65,1.02512
time,Hardware,Voltage,Current
1626743109370,high-voltage-2,70,1.07551
time,Hardware,Voltage,Current
1626743109370,high-voltage-2,75,1.12592
time,Hardware,Voltage,Current
1626743109370,high-voltage-2,80,1.17033
time,Hardware,Voltage,Current
1626743109370,high-voltage-2,85,1.21379
time,Hardware,Voltage,Current
1626743109370,high-voltage-2,90,1.25112
time,Hardware,Voltage,Current
1626743109370,high-voltage-2,95,1.28221
time,Hardware,Voltage,Current
1626743109370,high-voltage-2,100,1.31135
