{
    "Data": [396.0, 9172.0, 14833.0, 10073.0, 5342.0, 3068.0, 2287.0, 2443.0, 2688.0, 2715.0, 2596.0, 2155.0, 1623.0, 1227.0, 848.0, 606.0, 428.0, 322.0, 233.0, 212.0, 185.0, 206.0, 202.0, 202.0, 186.0, 196.0, 156.0, 156.0, 181.0, 171.0, 137.0, 140.0, 125.0, 153.0, 151.0, 127.0, 97.0, 97.0, 128.0, 122.0, 115.0, 68.0, 59.0, 62.0, 60.0, 72.0, 69.0, 88.0, 54.0, 29.0, 20.0],
    "Name": "Chi2Dist-0",
    "Overflow": 0.0,
    "Type": "Histo1d",
    "Underflow": 0.0,
    "x": {
        "AxisTitle": "Fit Chi/ndf",
        "Bins": 51,
        "High": 2.5250000953674318,
        "Low": -0.02500000037252903
    },
    "y": {
        "AxisTitle": "Number of Pixels"
    },
    "z": {
        "AxisTitle": "z"
    }
}