{
    "Data": [0.0, 0.0, 0.0, 0.0, 0.0, 0.0, 0.0, 0.0, 0.0, 0.0, 0.0, 0.0, 0.0, 0.0, 2.0, 0.0, 1.0, 36.0, 431.0, 119.0, 27.0, 917.0, 4704.0, 1800.0, 368.0, 1220.0, 4167.0, 2358.0, 502.0, 826.0, 2213.0, 1602.0, 410.0, 229.0, 369.0, 460.0, 234.0, 331.0, 565.0, 551.0, 405.0, 720.0, 1605.0, 2069.0, 1363.0, 1504.0, 2277.0, 3243.0, 2885.0, 2499.0, 2317.0, 2685.0, 2555.0, 2052.0, 1999.0, 1998.0, 2136.0, 1915.0, 1639.0, 1497.0, 1458.0, 1265.0, 912.0, 686.0, 725.0, 771.0, 674.0, 483.0, 492.0, 474.0, 466.0, 394.0, 298.0, 223.0, 221.0, 226.0, 206.0, 158.0, 148.0, 171.0, 143.0, 103.0, 93.0, 86.0, 68.0, 67.0, 64.0, 50.0, 45.0, 49.0, 48.0, 44.0, 31.0, 42.0, 28.0, 33.0, 34.0, 36.0, 44.0, 31.0, 31.0, 19.0, 18.0, 23.0, 16.0, 15.0, 11.0, 14.0, 19.0, 20.0, 11.0, 19.0, 9.0, 10.0, 15.0, 16.0, 10.0, 19.0, 13.0, 18.0, 15.0, 10.0, 12.0, 2.0, 7.0, 8.0, 9.0, 6.0, 5.0, 3.0, 4.0, 5.0, 6.0, 4.0, 3.0, 9.0, 10.0, 9.0, 11.0, 8.0, 5.0, 6.0, 1.0, 10.0, 6.0, 3.0, 1.0, 1.0, 0.0, 2.0, 4.0, 1.0, 3.0, 1.0, 2.0, 5.0, 4.0, 2.0, 7.0, 2.0, 4.0, 0.0, 1.0, 1.0, 0.0, 4.0, 2.0, 1.0, 2.0, 2.0, 3.0, 0.0, 1.0, 3.0, 4.0, 0.0, 1.0, 3.0, 0.0, 0.0, 0.0, 1.0, 0.0, 1.0, 1.0, 1.0, 1.0, 6.0, 0.0, 0.0, 0.0, 1.0, 2.0, 0.0, 1.0, 0.0, 2.0, 0.0, 1.0, 2.0, 0.0],
    "Name": "TimePerFitDist-0",
    "Overflow": 140.0,
    "Type": "Histo1d",
    "Underflow": 0.0,
    "x": {
        "AxisTitle": "Fit Time [us]",
        "Bins": 201,
        "High": 401.0,
        "Low": -1.0
    },
    "y": {
        "AxisTitle": "Number of Pixels"
    },
    "z": {
        "AxisTitle": "z"
    }
}