time,Hardware,Voltage,Current
1626747297057,high-voltage,1,0.00762139
time,Hardware,Voltage,Current
1626747297057,high-voltage,2,0.0258313
time,Hardware,Voltage,Current
1626747297057,high-voltage,3,0.0352712
time,Hardware,Voltage,Current
1626747297057,high-voltage,4,0.0414684
time,Hardware,Voltage,Current
1626747297057,high-voltage,5,0.0486492
time,Hardware,Voltage,Current
1626747297057,high-voltage,6,0.0555482
time,Hardware,Voltage,Current
1626747297057,high-voltage,7,0.0605509
time,Hardware,Voltage,Current
1626747297057,high-voltage,8,0.0681539
time,Hardware,Voltage,Current
1626747297057,high-voltage,9,0.0747767
time,Hardware,Voltage,Current
1626747297057,high-voltage,10,0.0808811
time,Hardware,Voltage,Current
1626747297057,high-voltage,11,0.0850726
time,Hardware,Voltage,Current
1626747297057,high-voltage,12,0.0900214
time,Hardware,Voltage,Current
1626747297057,high-voltage,13,0.0952494
time,Hardware,Voltage,Current
1626747297057,high-voltage,14,0.0985188
time,Hardware,Voltage,Current
1626747297057,high-voltage,15,0.101187
time,Hardware,Voltage,Current
1626747297057,high-voltage,16,0.105244
time,Hardware,Voltage,Current
1626747297057,high-voltage,17,0.107081
time,Hardware,Voltage,Current
1626747297057,high-voltage,18,0.110288
time,Hardware,Voltage,Current
1626747297057,high-voltage,19,0.112788
time,Hardware,Voltage,Current
1626747297057,high-voltage,20,0.116697
time,Hardware,Voltage,Current
1626747297057,high-voltage,25,0.130709
time,Hardware,Voltage,Current
1626747297057,high-voltage,30,0.148516
time,Hardware,Voltage,Current
1626747297057,high-voltage,35,0.190048
time,Hardware,Voltage,Current
1626747297057,high-voltage,40,0.319157
time,Hardware,Voltage,Current
1626747297057,high-voltage,45,0.62598
time,Hardware,Voltage,Current
1626747297057,high-voltage,50,1.21348
time,Hardware,Voltage,Current
1626747297057,high-voltage,55,2.20228
time,Hardware,Voltage,Current
1626747297057,high-voltage,60,3.68403
time,Hardware,Voltage,Current
1626747297057,high-voltage,65,5.79542
time,Hardware,Voltage,Current
1626747297057,high-voltage,70,8.59866
time,Hardware,Voltage,Current
1626747297057,high-voltage,75,10
