{
    "Data": [[3760.0, 1889.0, 1238.0, 894.0, 631.0, 529.0, 437.0, 394.0, 312.0, 270.0, 233.0, 198.0, 186.0, 157.0, 114.0, 125.0, 102.0, 97.0, 82.0, 81.0, 66.0, 71.0, 60.0, 56.0, 40.0, 42.0, 40.0, 47.0, 45.0, 45.0, 32.0, 48.0, 28.0, 32.0, 18.0, 19.0, 22.0, 24.0, 22.0, 22.0, 34.0, 25.0, 30.0, 21.0, 19.0, 25.0, 19.0, 12.0, 14.0], [3809.0, 2092.0, 1501.0, 1173.0, 905.0, 778.0, 619.0, 578.0, 492.0, 384.0, 381.0, 315.0, 319.0, 292.0, 251.0, 240.0, 197.0, 174.0, 180.0, 161.0, 131.0, 155.0, 120.0, 109.0, 119.0, 107.0, 86.0, 91.0, 64.0, 70.0, 75.0, 59.0, 68.0, 61.0, 57.0, 52.0, 34.0, 52.0, 46.0, 41.0, 46.0, 32.0, 46.0, 41.0, 37.0, 41.0, 26.0, 35.0, 37.0], [3305.0, 2014.0, 1527.0, 1242.0, 1003.0, 924.0, 823.0, 674.0, 636.0, 593.0, 578.0, 491.0, 477.0, 454.0, 402.0, 343.0, 337.0, 342.0, 309.0, 255.0, 247.0, 245.0, 221.0, 208.0, 222.0, 180.0, 163.0, 174.0, 179.0, 143.0, 126.0, 137.0, 94.0, 116.0, 129.0, 109.0, 116.0, 86.0, 96.0, 70.0, 72.0, 80.0, 85.0, 73.0, 72.0, 59.0, 60.0, 80.0, 74.0], [2541.0, 1742.0, 1237.0, 1202.0, 956.0, 889.0, 836.0, 750.0, 699.0, 640.0, 646.0, 584.0, 536.0, 557.0, 540.0, 472.0, 480.0, 472.0, 409.0, 380.0, 410.0, 347.0, 371.0, 353.0, 345.0, 304.0, 314.0, 267.0, 277.0, 288.0, 243.0, 249.0, 212.0, 229.0, 212.0, 195.0, 219.0, 194.0, 167.0, 178.0, 162.0, 179.0, 153.0, 139.0, 135.0, 134.0, 148.0, 137.0, 139.0], [2620.0, 1314.0, 1056.0, 914.0, 779.0, 708.0, 718.0, 662.0, 621.0, 599.0, 584.0, 542.0, 562.0, 539.0, 520.0, 523.0, 495.0, 534.0, 477.0, 516.0, 456.0, 479.0, 487.0, 459.0, 464.0, 432.0, 424.0, 415.0, 401.0, 412.0, 394.0, 367.0, 400.0, 390.0, 379.0, 335.0, 365.0, 339.0, 314.0, 320.0, 329.0, 328.0, 335.0, 332.0, 301.0, 306.0, 336.0, 286.0, 310.0], [4210.0, 1876.0, 1205.0, 861.0, 799.0, 629.0, 562.0, 570.0, 506.0, 500.0, 488.0, 492.0, 450.0, 466.0, 462.0, 473.0, 448.0, 468.0, 487.0, 446.0, 485.0, 468.0, 416.0, 483.0, 495.0, 489.0, 493.0, 494.0, 493.0, 514.0, 478.0, 467.0, 463.0, 457.0, 496.0, 500.0, 530.0, 509.0, 493.0, 514.0, 519.0, 556.0, 517.0, 534.0, 574.0, 611.0, 572.0, 625.0, 706.0], [5275.0, 3299.0, 2279.0, 1698.0, 1440.0, 1162.0, 965.0, 859.0, 707.0, 650.0, 580.0, 576.0, 563.0, 453.0, 447.0, 498.0, 429.0, 448.0, 408.0, 380.0, 455.0, 416.0, 439.0, 397.0, 429.0, 467.0, 467.0, 455.0, 498.0, 450.0, 539.0, 511.0, 532.0, 506.0, 520.0, 608.0, 589.0, 544.0, 607.0, 692.0, 686.0, 729.0, 742.0, 814.0, 836.0, 896.0, 975.0, 1142.0, 1448.0], [2067.0, 1761.0, 1558.0, 1439.0, 1443.0, 1357.0, 1356.0, 1295.0, 1252.0, 1143.0, 1134.0, 1072.0, 975.0, 928.0, 862.0, 853.0, 803.0, 792.0, 741.0, 713.0, 721.0, 671.0, 624.0, 641.0, 653.0, 556.0, 580.0, 562.0, 598.0, 555.0, 575.0, 585.0, 598.0, 558.0, 575.0, 590.0, 608.0, 655.0, 726.0, 744.0, 772.0, 766.0, 870.0, 966.0, 1080.0, 1257.0, 1332.0, 1701.0, 2293.0], [803.0, 394.0, 294.0, 311.0, 315.0, 351.0, 355.0, 404.0, 454.0, 470.0, 470.0, 497.0, 522.0, 602.0, 580.0, 618.0, 680.0, 667.0, 700.0, 734.0, 723.0, 761.0, 792.0, 789.0, 808.0, 911.0, 867.0, 858.0, 991.0, 964.0, 978.0, 961.0, 1004.0, 983.0, 1007.0, 1083.0, 1018.0, 1005.0, 1055.0, 1153.0, 1195.0, 1147.0, 1272.0, 1357.0, 1455.0, 1619.0, 1911.0, 2365.0, 3337.0], [700.0, 255.0, 124.0, 104.0, 87.0, 79.0, 87.0, 79.0, 73.0, 75.0, 82.0, 78.0, 85.0, 112.0, 108.0, 118.0, 137.0, 143.0, 156.0, 162.0, 194.0, 205.0, 215.0, 224.0, 295.0, 300.0, 333.0, 348.0, 428.0, 450.0, 450.0, 541.0, 616.0, 642.0, 661.0, 783.0, 875.0, 954.0, 1095.0, 1188.0, 1321.0, 1452.0, 1709.0, 1930.0, 2227.0, 2542.0, 3144.0, 4005.0, 5643.0], [831.0, 275.0, 127.0, 108.0, 69.0, 58.0, 45.0, 44.0, 34.0, 32.0, 37.0, 28.0, 35.0, 38.0, 36.0, 36.0, 25.0, 42.0, 38.0, 42.0, 51.0, 35.0, 56.0, 57.0, 57.0, 65.0, 58.0, 54.0, 79.0, 97.0, 125.0, 127.0, 113.0, 167.0, 186.0, 203.0, 255.0, 286.0, 348.0, 387.0, 451.0, 647.0, 726.0, 930.0, 1281.0, 1685.0, 2435.0, 3944.0, 7286.0], [944.0, 269.0, 142.0, 86.0, 76.0, 46.0, 40.0, 38.0, 41.0, 41.0, 23.0, 20.0, 28.0, 24.0, 22.0, 31.0, 31.0, 17.0, 25.0, 17.0, 24.0, 20.0, 25.0, 25.0, 21.0, 33.0, 26.0, 27.0, 21.0, 36.0, 35.0, 37.0, 40.0, 40.0, 58.0, 65.0, 79.0, 77.0, 107.0, 119.0, 148.0, 183.0, 219.0, 328.0, 432.0, 636.0, 1012.0, 1866.0, 4646.0], [1354.0, 315.0, 137.0, 75.0, 66.0, 47.0, 37.0, 41.0, 25.0, 31.0, 34.0, 31.0, 23.0, 31.0, 20.0, 22.0, 21.0, 22.0, 15.0, 22.0, 22.0, 21.0, 17.0, 16.0, 12.0, 19.0, 17.0, 14.0, 19.0, 18.0, 15.0, 21.0, 25.0, 18.0, 25.0, 20.0, 39.0, 40.0, 36.0, 50.0, 57.0, 70.0, 103.0, 94.0, 155.0, 233.0, 363.0, 745.0, 2350.0], [1846.0, 510.0, 194.0, 101.0, 69.0, 44.0, 43.0, 25.0, 26.0, 28.0, 24.0, 12.0, 23.0, 15.0, 19.0, 26.0, 19.0, 21.0, 12.0, 15.0, 15.0, 15.0, 20.0, 13.0, 15.0, 19.0, 20.0, 14.0, 20.0, 20.0, 10.0, 20.0, 21.0, 19.0, 16.0, 16.0, 15.0, 20.0, 36.0, 23.0, 34.0, 35.0, 50.0, 37.0, 74.0, 87.0, 163.0, 350.0, 1028.0], [2877.0, 825.0, 353.0, 139.0, 84.0, 44.0, 36.0, 38.0, 21.0, 18.0, 22.0, 13.0, 19.0, 21.0, 12.0, 18.0, 13.0, 14.0, 17.0, 20.0, 16.0, 13.0, 7.0, 12.0, 16.0, 13.0, 8.0, 11.0, 9.0, 24.0, 18.0, 11.0, 16.0, 12.0, 13.0, 15.0, 19.0, 25.0, 16.0, 16.0, 18.0, 25.0, 29.0, 34.0, 49.0, 51.0, 83.0, 121.0, 534.0], [4066.0, 1479.0, 609.0, 267.0, 132.0, 90.0, 47.0, 38.0, 31.0, 27.0, 24.0, 22.0, 16.0, 19.0, 16.0, 10.0, 17.0, 10.0, 14.0, 11.0, 8.0, 9.0, 12.0, 10.0, 13.0, 14.0, 8.0, 12.0, 9.0, 12.0, 10.0, 11.0, 14.0, 5.0, 9.0, 13.0, 11.0, 11.0, 19.0, 11.0, 20.0, 12.0, 19.0, 24.0, 31.0, 33.0, 48.0, 104.0, 287.0], [5097.0, 2339.0, 1157.0, 570.0, 335.0, 188.0, 117.0, 65.0, 50.0, 23.0, 25.0, 18.0, 17.0, 12.0, 19.0, 18.0, 11.0, 10.0, 10.0, 15.0, 16.0, 13.0, 12.0, 11.0, 13.0, 10.0, 8.0, 6.0, 3.0, 10.0, 10.0, 8.0, 10.0, 5.0, 10.0, 11.0, 10.0, 6.0, 12.0, 12.0, 10.0, 15.0, 5.0, 25.0, 19.0, 22.0, 39.0, 58.0, 153.0], [5900.0, 3090.0, 1948.0, 1146.0, 653.0, 419.0, 271.0, 182.0, 107.0, 65.0, 50.0, 39.0, 33.0, 29.0, 17.0, 19.0, 11.0, 15.0, 10.0, 8.0, 16.0, 11.0, 5.0, 8.0, 4.0, 8.0, 8.0, 5.0, 4.0, 14.0, 17.0, 12.0, 12.0, 9.0, 8.0, 9.0, 5.0, 7.0, 8.0, 4.0, 12.0, 11.0, 11.0, 17.0, 15.0, 17.0, 30.0, 41.0, 107.0], [5501.0, 3686.0, 2580.0, 1765.0, 1228.0, 844.0, 585.0, 426.0, 286.0, 210.0, 142.0, 119.0, 86.0, 69.0, 41.0, 37.0, 21.0, 24.0, 22.0, 9.0, 15.0, 12.0, 13.0, 8.0, 10.0, 7.0, 4.0, 10.0, 7.0, 8.0, 5.0, 9.0, 10.0, 11.0, 4.0, 8.0, 5.0, 6.0, 9.0, 5.0, 6.0, 8.0, 10.0, 7.0, 15.0, 8.0, 16.0, 27.0, 64.0], [4615.0, 3512.0, 2873.0, 2212.0, 1775.0, 1378.0, 1091.0, 795.0, 664.0, 496.0, 362.0, 270.0, 202.0, 185.0, 131.0, 109.0, 90.0, 58.0, 51.0, 46.0, 28.0, 29.0, 14.0, 12.0, 8.0, 12.0, 10.0, 10.0, 20.0, 10.0, 7.0, 9.0, 7.0, 2.0, 9.0, 8.0, 6.0, 7.0, 6.0, 5.0, 3.0, 1.0, 6.0, 7.0, 14.0, 18.0, 13.0, 21.0, 51.0], [3240.0, 2890.0, 2530.0, 2262.0, 2077.0, 1775.0, 1556.0, 1278.0, 1047.0, 878.0, 745.0, 632.0, 509.0, 407.0, 328.0, 296.0, 205.0, 176.0, 125.0, 113.0, 102.0, 58.0, 67.0, 56.0, 39.0, 39.0, 34.0, 32.0, 22.0, 11.0, 13.0, 12.0, 4.0, 8.0, 5.0, 4.0, 8.0, 7.0, 6.0, 7.0, 5.0, 6.0, 7.0, 4.0, 7.0, 11.0, 17.0, 16.0, 43.0], [2211.0, 1981.0, 2000.0, 1942.0, 1915.0, 1812.0, 1739.0, 1444.0, 1319.0, 1152.0, 1027.0, 890.0, 803.0, 745.0, 585.0, 523.0, 440.0, 358.0, 345.0, 269.0, 252.0, 197.0, 134.0, 143.0, 101.0, 92.0, 65.0, 58.0, 47.0, 42.0, 32.0, 29.0, 25.0, 18.0, 18.0, 16.0, 16.0, 9.0, 10.0, 12.0, 8.0, 3.0, 2.0, 8.0, 9.0, 7.0, 5.0, 8.0, 45.0], [1373.0, 1152.0, 1257.0, 1339.0, 1458.0, 1469.0, 1442.0, 1431.0, 1352.0, 1322.0, 1289.0, 1157.0, 1034.0, 1013.0, 899.0, 830.0, 705.0, 681.0, 576.0, 524.0, 446.0, 447.0, 386.0, 341.0, 270.0, 228.0, 202.0, 166.0, 138.0, 130.0, 108.0, 88.0, 58.0, 66.0, 40.0, 36.0, 29.0, 27.0, 23.0, 20.0, 22.0, 12.0, 10.0, 18.0, 11.0, 9.0, 10.0, 11.0, 20.0], [921.0, 646.0, 644.0, 774.0, 871.0, 971.0, 1005.0, 1061.0, 1179.0, 1169.0, 1116.0, 1222.0, 1128.0, 1101.0, 1067.0, 1040.0, 992.0, 922.0, 808.0, 771.0, 732.0, 653.0, 590.0, 590.0, 507.0, 440.0, 430.0, 401.0, 365.0, 303.0, 229.0, 229.0, 183.0, 170.0, 120.0, 130.0, 92.0, 67.0, 67.0, 54.0, 39.0, 35.0, 30.0, 23.0, 29.0, 22.0, 13.0, 11.0, 17.0], [729.0, 396.0, 375.0, 394.0, 477.0, 548.0, 570.0, 709.0, 703.0, 773.0, 830.0, 909.0, 926.0, 961.0, 926.0, 999.0, 1035.0, 1022.0, 919.0, 913.0, 931.0, 906.0, 829.0, 834.0, 757.0, 718.0, 638.0, 641.0, 591.0, 505.0, 471.0, 446.0, 395.0, 344.0, 375.0, 275.0, 268.0, 225.0, 186.0, 150.0, 115.0, 84.0, 86.0, 57.0, 51.0, 32.0, 45.0, 24.0, 25.0], [647.0, 291.0, 180.0, 213.0, 225.0, 234.0, 328.0, 337.0, 383.0, 439.0, 485.0, 569.0, 609.0, 645.0, 708.0, 708.0, 777.0, 832.0, 868.0, 894.0, 879.0, 921.0, 899.0, 942.0, 864.0, 898.0, 890.0, 821.0, 785.0, 766.0, 747.0, 717.0, 649.0, 659.0, 583.0, 536.0, 487.0, 449.0, 439.0, 379.0, 300.0, 267.0, 233.0, 190.0, 143.0, 138.0, 81.0, 58.0, 48.0], [531.0, 228.0, 161.0, 81.0, 115.0, 120.0, 124.0, 154.0, 184.0, 242.0, 246.0, 305.0, 316.0, 381.0, 416.0, 448.0, 475.0, 537.0, 564.0, 603.0, 718.0, 747.0, 777.0, 782.0, 799.0, 840.0, 910.0, 924.0, 939.0, 917.0, 936.0, 877.0, 863.0, 830.0, 901.0, 833.0, 747.0, 700.0, 684.0, 646.0, 615.0, 580.0, 515.0, 430.0, 343.0, 297.0, 281.0, 202.0, 150.0], [654.0, 227.0, 101.0, 85.0, 56.0, 63.0, 60.0, 50.0, 86.0, 95.0, 110.0, 139.0, 143.0, 162.0, 198.0, 220.0, 295.0, 318.0, 358.0, 369.0, 409.0, 470.0, 515.0, 547.0, 646.0, 671.0, 727.0, 730.0, 799.0, 810.0, 965.0, 852.0, 1001.0, 942.0, 977.0, 979.0, 989.0, 971.0, 993.0, 982.0, 931.0, 850.0, 820.0, 799.0, 753.0, 630.0, 525.0, 471.0, 388.0], [626.0, 203.0, 102.0, 73.0, 55.0, 36.0, 41.0, 45.0, 36.0, 30.0, 52.0, 49.0, 67.0, 63.0, 72.0, 103.0, 121.0, 150.0, 150.0, 179.0, 226.0, 245.0, 271.0, 338.0, 391.0, 414.0, 463.0, 509.0, 583.0, 630.0, 706.0, 706.0, 814.0, 850.0, 919.0, 986.0, 1002.0, 1087.0, 1105.0, 1130.0, 1183.0, 1171.0, 1216.0, 1123.0, 1169.0, 1147.0, 1024.0, 974.0, 855.0], [654.0, 211.0, 119.0, 67.0, 40.0, 39.0, 28.0, 32.0, 17.0, 25.0, 24.0, 27.0, 29.0, 35.0, 39.0, 41.0, 44.0, 51.0, 65.0, 59.0, 85.0, 117.0, 138.0, 161.0, 179.0, 221.0, 233.0, 303.0, 352.0, 362.0, 430.0, 475.0, 518.0, 545.0, 702.0, 780.0, 848.0, 984.0, 1056.0, 1123.0, 1235.0, 1303.0, 1379.0, 1439.0, 1579.0, 1623.0, 1631.0, 1675.0, 1559.0], [592.0, 208.0, 115.0, 83.0, 40.0, 36.0, 21.0, 23.0, 23.0, 15.0, 20.0, 19.0, 16.0, 12.0, 15.0, 18.0, 25.0, 24.0, 27.0, 39.0, 30.0, 47.0, 56.0, 57.0, 75.0, 89.0, 113.0, 123.0, 185.0, 208.0, 219.0, 293.0, 314.0, 364.0, 417.0, 543.0, 571.0, 649.0, 755.0, 902.0, 1025.0, 1205.0, 1302.0, 1488.0, 1676.0, 1969.0, 2144.0, 2394.0, 2579.0], [636.0, 212.0, 105.0, 65.0, 39.0, 41.0, 23.0, 31.0, 23.0, 19.0, 11.0, 10.0, 18.0, 11.0, 7.0, 8.0, 18.0, 9.0, 13.0, 12.0, 14.0, 23.0, 16.0, 22.0, 37.0, 44.0, 34.0, 54.0, 75.0, 81.0, 103.0, 125.0, 143.0, 175.0, 202.0, 290.0, 315.0, 416.0, 450.0, 551.0, 691.0, 927.0, 1161.0, 1315.0, 1521.0, 1944.0, 2420.0, 2868.0, 3535.0], [607.0, 216.0, 97.0, 53.0, 54.0, 41.0, 26.0, 19.0, 15.0, 19.0, 18.0, 13.0, 17.0, 14.0, 11.0, 10.0, 15.0, 14.0, 10.0, 9.0, 12.0, 8.0, 11.0, 12.0, 12.0, 13.0, 16.0, 23.0, 25.0, 35.0, 34.0, 55.0, 67.0, 68.0, 93.0, 135.0, 154.0, 207.0, 250.0, 370.0, 433.0, 546.0, 739.0, 928.0, 1255.0, 1593.0, 2180.0, 2926.0, 4341.0], [629.0, 188.0, 101.0, 78.0, 53.0, 46.0, 32.0, 24.0, 29.0, 14.0, 14.0, 6.0, 17.0, 11.0, 3.0, 10.0, 4.0, 9.0, 15.0, 11.0, 11.0, 9.0, 8.0, 12.0, 9.0, 6.0, 7.0, 14.0, 14.0, 21.0, 13.0, 10.0, 10.0, 22.0, 30.0, 45.0, 63.0, 100.0, 111.0, 175.0, 218.0, 272.0, 427.0, 560.0, 860.0, 1136.0, 1794.0, 2629.0, 4567.0], [653.0, 197.0, 118.0, 56.0, 53.0, 29.0, 27.0, 21.0, 18.0, 20.0, 20.0, 17.0, 12.0, 11.0, 10.0, 15.0, 6.0, 9.0, 11.0, 11.0, 5.0, 14.0, 6.0, 6.0, 8.0, 3.0, 8.0, 9.0, 7.0, 13.0, 8.0, 9.0, 12.0, 10.0, 16.0, 16.0, 29.0, 41.0, 44.0, 73.0, 100.0, 159.0, 186.0, 344.0, 459.0, 738.0, 1279.0, 2080.0, 4048.0], [615.0, 186.0, 121.0, 85.0, 53.0, 35.0, 28.0, 17.0, 12.0, 22.0, 19.0, 9.0, 18.0, 6.0, 13.0, 9.0, 11.0, 16.0, 14.0, 5.0, 8.0, 8.0, 10.0, 6.0, 10.0, 13.0, 5.0, 4.0, 6.0, 4.0, 8.0, 8.0, 5.0, 5.0, 8.0, 9.0, 10.0, 13.0, 17.0, 23.0, 36.0, 48.0, 87.0, 138.0, 265.0, 403.0, 761.0, 1473.0, 3417.0], [625.0, 214.0, 100.0, 67.0, 55.0, 33.0, 28.0, 26.0, 15.0, 21.0, 18.0, 15.0, 5.0, 15.0, 15.0, 17.0, 15.0, 9.0, 13.0, 3.0, 6.0, 4.0, 6.0, 8.0, 4.0, 6.0, 9.0, 8.0, 5.0, 8.0, 2.0, 4.0, 5.0, 6.0, 8.0, 4.0, 7.0, 8.0, 12.0, 7.0, 17.0, 23.0, 33.0, 65.0, 124.0, 220.0, 417.0, 901.0, 2505.0], [631.0, 191.0, 116.0, 68.0, 48.0, 35.0, 27.0, 26.0, 10.0, 17.0, 12.0, 18.0, 15.0, 11.0, 10.0, 14.0, 13.0, 11.0, 9.0, 9.0, 9.0, 8.0, 12.0, 9.0, 6.0, 9.0, 4.0, 3.0, 8.0, 3.0, 11.0, 3.0, 5.0, 6.0, 5.0, 3.0, 6.0, 6.0, 6.0, 8.0, 10.0, 11.0, 13.0, 29.0, 47.0, 88.0, 207.0, 528.0, 1641.0], [638.0, 189.0, 106.0, 75.0, 54.0, 43.0, 24.0, 18.0, 17.0, 19.0, 15.0, 17.0, 11.0, 8.0, 15.0, 9.0, 8.0, 13.0, 12.0, 5.0, 9.0, 4.0, 14.0, 5.0, 5.0, 9.0, 6.0, 7.0, 8.0, 8.0, 11.0, 6.0, 5.0, 3.0, 5.0, 3.0, 2.0, 4.0, 4.0, 7.0, 3.0, 5.0, 10.0, 14.0, 17.0, 33.0, 111.0, 279.0, 1036.0], [676.0, 207.0, 104.0, 75.0, 48.0, 40.0, 30.0, 18.0, 23.0, 11.0, 11.0, 16.0, 9.0, 11.0, 14.0, 16.0, 12.0, 14.0, 5.0, 14.0, 9.0, 5.0, 7.0, 1.0, 8.0, 8.0, 5.0, 10.0, 6.0, 9.0, 3.0, 1.0, 4.0, 2.0, 3.0, 9.0, 3.0, 10.0, 4.0, 2.0, 9.0, 5.0, 7.0, 5.0, 13.0, 19.0, 59.0, 140.0, 617.0], [590.0, 221.0, 86.0, 72.0, 40.0, 43.0, 26.0, 24.0, 19.0, 21.0, 15.0, 11.0, 12.0, 11.0, 13.0, 7.0, 8.0, 13.0, 13.0, 9.0, 15.0, 4.0, 7.0, 7.0, 9.0, 10.0, 3.0, 5.0, 8.0, 3.0, 11.0, 7.0, 5.0, 3.0, 0.0, 7.0, 10.0, 4.0, 2.0, 1.0, 5.0, 1.0, 5.0, 7.0, 11.0, 16.0, 30.0, 79.0, 355.0], [626.0, 210.0, 109.0, 52.0, 57.0, 48.0, 32.0, 29.0, 15.0, 11.0, 11.0, 12.0, 12.0, 17.0, 10.0, 12.0, 14.0, 13.0, 6.0, 12.0, 11.0, 6.0, 11.0, 5.0, 4.0, 5.0, 6.0, 7.0, 7.0, 8.0, 8.0, 8.0, 5.0, 4.0, 4.0, 6.0, 2.0, 6.0, 3.0, 8.0, 4.0, 5.0, 3.0, 6.0, 4.0, 8.0, 18.0, 44.0, 200.0], [609.0, 210.0, 103.0, 68.0, 46.0, 45.0, 23.0, 25.0, 16.0, 18.0, 21.0, 19.0, 8.0, 16.0, 9.0, 8.0, 10.0, 8.0, 9.0, 8.0, 6.0, 12.0, 6.0, 7.0, 10.0, 8.0, 7.0, 5.0, 3.0, 5.0, 8.0, 9.0, 6.0, 4.0, 7.0, 7.0, 5.0, 3.0, 5.0, 1.0, 7.0, 5.0, 4.0, 1.0, 5.0, 9.0, 10.0, 16.0, 115.0], [620.0, 213.0, 92.0, 69.0, 41.0, 31.0, 32.0, 28.0, 25.0, 11.0, 21.0, 12.0, 12.0, 13.0, 7.0, 20.0, 10.0, 9.0, 11.0, 4.0, 4.0, 14.0, 4.0, 7.0, 8.0, 5.0, 8.0, 7.0, 8.0, 5.0, 7.0, 9.0, 5.0, 4.0, 3.0, 5.0, 5.0, 8.0, 6.0, 3.0, 3.0, 5.0, 4.0, 4.0, 4.0, 6.0, 2.0, 20.0, 73.0], [627.0, 195.0, 112.0, 73.0, 45.0, 47.0, 26.0, 18.0, 15.0, 21.0, 17.0, 9.0, 14.0, 17.0, 8.0, 8.0, 7.0, 10.0, 10.0, 9.0, 6.0, 13.0, 11.0, 13.0, 10.0, 3.0, 7.0, 5.0, 5.0, 7.0, 7.0, 7.0, 7.0, 4.0, 6.0, 5.0, 1.0, 4.0, 3.0, 6.0, 2.0, 3.0, 3.0, 7.0, 5.0, 5.0, 8.0, 8.0, 52.0], [647.0, 212.0, 99.0, 65.0, 55.0, 37.0, 22.0, 28.0, 26.0, 13.0, 14.0, 16.0, 17.0, 12.0, 10.0, 14.0, 13.0, 10.0, 6.0, 8.0, 10.0, 6.0, 5.0, 7.0, 4.0, 11.0, 7.0, 7.0, 10.0, 9.0, 6.0, 9.0, 7.0, 5.0, 1.0, 3.0, 5.0, 5.0, 4.0, 1.0, 4.0, 5.0, 11.0, 3.0, 3.0, 10.0, 5.0, 8.0, 20.0], [623.0, 201.0, 116.0, 74.0, 48.0, 41.0, 30.0, 28.0, 15.0, 9.0, 8.0, 12.0, 10.0, 14.0, 11.0, 7.0, 15.0, 12.0, 10.0, 4.0, 7.0, 11.0, 11.0, 8.0, 10.0, 8.0, 11.0, 5.0, 7.0, 6.0, 7.0, 5.0, 7.0, 8.0, 2.0, 2.0, 3.0, 5.0, 4.0, 4.0, 2.0, 5.0, 5.0, 5.0, 9.0, 6.0, 4.0, 11.0, 10.0], [630.0, 211.0, 105.0, 64.0, 67.0, 32.0, 25.0, 20.0, 19.0, 14.0, 16.0, 13.0, 18.0, 13.0, 4.0, 13.0, 14.0, 10.0, 14.0, 6.0, 9.0, 9.0, 7.0, 10.0, 12.0, 11.0, 10.0, 12.0, 5.0, 6.0, 4.0, 0.0, 5.0, 9.0, 3.0, 6.0, 2.0, 4.0, 3.0, 1.0, 2.0, 4.0, 5.0, 3.0, 3.0, 4.0, 8.0, 4.0, 15.0], [640.0, 205.0, 118.0, 80.0, 47.0, 28.0, 26.0, 26.0, 20.0, 22.0, 8.0, 9.0, 12.0, 13.0, 8.0, 12.0, 15.0, 11.0, 6.0, 3.0, 8.0, 10.0, 8.0, 7.0, 6.0, 8.0, 5.0, 6.0, 12.0, 9.0, 5.0, 5.0, 4.0, 8.0, 5.0, 9.0, 6.0, 5.0, 4.0, 3.0, 6.0, 2.0, 1.0, 7.0, 4.0, 6.0, 1.0, 8.0, 15.0], [586.0, 222.0, 103.0, 66.0, 45.0, 35.0, 29.0, 23.0, 26.0, 12.0, 13.0, 16.0, 17.0, 9.0, 13.0, 10.0, 11.0, 15.0, 8.0, 7.0, 7.0, 12.0, 8.0, 10.0, 7.0, 5.0, 6.0, 8.0, 6.0, 7.0, 7.0, 5.0, 8.0, 9.0, 5.0, 2.0, 7.0, 3.0, 2.0, 4.0, 6.0, 4.0, 4.0, 1.0, 5.0, 3.0, 7.0, 4.0, 13.0], [679.0, 209.0, 119.0, 78.0, 50.0, 41.0, 24.0, 21.0, 13.0, 16.0, 14.0, 11.0, 12.0, 11.0, 13.0, 11.0, 11.0, 8.0, 14.0, 12.0, 5.0, 8.0, 7.0, 8.0, 5.0, 6.0, 9.0, 6.0, 9.0, 10.0, 7.0, 5.0, 8.0, 4.0, 3.0, 8.0, 3.0, 3.0, 5.0, 6.0, 2.0, 3.0, 2.0, 5.0, 1.0, 8.0, 6.0, 7.0, 10.0]],
    "Name": "sCurve-0",
    "Overflow": 2580153.0,
    "Type": "Histo2d",
    "Underflow": 0.0,
    "x": {
        "AxisTitle": "Vcal",
        "Bins": 51,
        "High": 302.5,
        "Low": 47.5
    },
    "y": {
        "AxisTitle": "Occupancy",
        "Bins": 49,
        "High": 49.5,
        "Low": 0.5
    },
    "z": {
        "AxisTitle": "Number of pixels"
    }
}