{
    "Data": [0.0, 0.0, 0.0, 0.0, 0.0, 0.0, 0.0, 0.0, 0.0, 0.0, 0.0, 0.0, 0.0, 0.0, 0.0, 1.0, 0.0, 7.0, 1.0, 3.0, 4.0, 2.0, 5.0, 12.0, 10.0, 26.0, 19.0, 34.0, 18.0, 37.0, 37.0, 38.0, 9.0, 50.0, 48.0, 50.0, 9.0, 49.0, 50.0, 49.0, 50.0, 50.0, 50.0, 6.0, 15.0, 50.0, 50.0, 29.0, 50.0, 50.0, 50.0],
    "Name": "Scurve-20-96",
    "Overflow": 0.0,
    "Type": "Histo1d",
    "Underflow": 0.0,
    "x": {
        "AxisTitle": "Vcal",
        "Bins": 51,
        "High": 302.5,
        "Low": 47.5
    },
    "y": {
        "AxisTitle": "Occupancy"
    },
    "z": {
        "AxisTitle": "z"
    }
}