{
    "Data": [0.0, 0.0, 0.0, 0.0, 0.0, 0.0, 0.0, 0.0, 0.0, 0.0, 0.0, 0.0, 0.0, 0.0, 0.0, 0.0, 0.0, 0.0, 0.0, 0.0, 0.0, 0.0, 0.0, 0.0, 0.0, 0.0, 0.0, 0.0, 0.0, 0.0, 0.0, 0.0, 0.0, 0.0, 0.0, 0.0, 0.0, 0.0, 0.0, 0.0, 0.0, 0.0, 0.0, 0.0, 0.0, 0.0, 0.0, 0.0, 0.0, 0.0, 2.0, 2.0, 11.0, 9.0, 9.0, 7.0, 13.0, 11.0, 14.0, 8.0, 8.0, 13.0, 12.0, 17.0, 19.0, 23.0, 38.0, 44.0, 50.0, 78.0, 105.0, 116.0, 139.0, 189.0, 231.0, 280.0, 373.0, 423.0, 523.0, 596.0, 764.0, 870.0, 974.0, 1088.0, 1158.0, 1220.0, 1350.0, 1440.0, 1482.0, 1728.0, 1908.0, 2438.0, 2981.0, 3610.0, 4289.0, 4436.0, 4202.0, 3594.0, 2767.0, 1948.0, 1329.0, 809.0, 503.0, 315.0, 239.0, 171.0, 149.0, 87.0, 89.0, 66.0, 57.0, 48.0, 42.0, 45.0, 45.0, 24.0, 25.0, 19.0, 25.0, 33.0, 23.0, 23.0, 12.0, 23.0, 12.0, 21.0, 10.0, 14.0, 16.0, 8.0, 10.0, 12.0, 10.0, 9.0, 14.0, 9.0, 7.0, 13.0, 5.0, 7.0, 12.0, 11.0, 2.0, 9.0, 9.0, 6.0, 8.0, 9.0, 7.0, 10.0, 9.0, 7.0, 16.0, 21.0, 25.0, 23.0, 38.0, 36.0, 60.0, 56.0, 90.0, 110.0, 111.0, 111.0, 178.0, 189.0, 222.0, 243.0, 271.0, 370.0, 366.0, 447.0, 492.0, 505.0, 585.0, 642.0, 653.0, 696.0, 673.0, 784.0, 756.0, 768.0, 757.0, 750.0, 782.0, 743.0, 684.0, 770.0, 693.0, 641.0, 624.0, 543.0, 521.0, 485.0, 481.0, 429.0, 377.0, 312.0, 284.0, 272.0, 208.0, 214.0, 154.0, 128.0, 108.0, 110.0, 88.0, 83.0, 61.0, 60.0, 42.0, 42.0, 38.0, 30.0, 31.0, 22.0, 17.0, 27.0, 21.0, 20.0, 21.0, 13.0, 10.0, 10.0, 14.0, 18.0, 12.0, 15.0, 14.0, 9.0, 13.0, 12.0, 6.0, 12.0, 7.0, 3.0, 10.0, 9.0, 6.0, 7.0, 6.0, 3.0, 6.0, 6.0, 1.0, 9.0, 1.0, 2.0, 0.0, 2.0, 2.0, 4.0, 4.0, 2.0, 2.0, 1.0, 1.0, 4.0, 0.0, 3.0, 1.0, 2.0, 3.0, 2.0, 2.0, 1.0, 0.0, 2.0, 0.0, 1.0, 1.0, 2.0, 1.0, 2.0, 1.0, 0.0, 1.0, 0.0, 0.0, 1.0, 1.0, 1.0, 0.0, 0.0, 3.0, 0.0, 0.0, 3.0, 2.0, 0.0, 1.0, 0.0, 2.0, 2.0, 2.0, 0.0, 0.0, 1.0, 0.0, 0.0, 0.0, 1.0, 0.0, 1.0, 0.0, 0.0, 2.0, 2.0, 1.0, 3.0, 0.0, 1.0, 3.0, 0.0, 1.0, 0.0, 0.0, 0.0, 0.0, 1.0, 0.0, 0.0, 0.0, 1.0, 1.0, 0.0, 0.0, 0.0, 0.0, 0.0, 0.0, 0.0, 0.0, 0.0],
    "Name": "ThresholdDist-0",
    "Overflow": 0.0,
    "Type": "Histo1d",
    "Underflow": 0.0,
    "x": {
        "AxisTitle": "Threshold [e]",
        "Bins": 334,
        "High": 3335.0,
        "Low": -5.0
    },
    "y": {
        "AxisTitle": "Number of Pixels"
    },
    "z": {
        "AxisTitle": "z"
    }
}