time,Hardware,Voltage,Current
1623307396023,high-voltage,1,0.0605153
time,Hardware,Voltage,Current
1623307396023,high-voltage,2,0.0744347
time,Hardware,Voltage,Current
1623307396023,high-voltage,3,0.0889466
time,Hardware,Voltage,Current
1623307396023,high-voltage,4,0.0992499
time,Hardware,Voltage,Current
1623307396023,high-voltage,5,0.111612
time,Hardware,Voltage,Current
1623307396023,high-voltage,6,0.121906
time,Hardware,Voltage,Current
1623307396023,high-voltage,7,0.132764
time,Hardware,Voltage,Current
1623307396023,high-voltage,8,0.145183
time,Hardware,Voltage,Current
1623307396023,high-voltage,9,0.154044
time,Hardware,Voltage,Current
1623307396023,high-voltage,10,0.163647
time,Hardware,Voltage,Current
1623307396023,high-voltage,11,0.17222
time,Hardware,Voltage,Current
1623307396023,high-voltage,12,0.181103
time,Hardware,Voltage,Current
1623307396023,high-voltage,13,0.187073
time,Hardware,Voltage,Current
1623307396023,high-voltage,14,0.19343
time,Hardware,Voltage,Current
1623307396023,high-voltage,15,0.198158
time,Hardware,Voltage,Current
1623307396023,high-voltage,16,0.203219
time,Hardware,Voltage,Current
1623307396023,high-voltage,17,0.207966
time,Hardware,Voltage,Current
1623307396023,high-voltage,18,0.21219
time,Hardware,Voltage,Current
1623307396023,high-voltage,19,0.217343
time,Hardware,Voltage,Current
1623307396023,high-voltage,20,0.222047
time,Hardware,Voltage,Current
1623307396023,high-voltage,25,0.243671
time,Hardware,Voltage,Current
1623307396023,high-voltage,30,0.278216
time,Hardware,Voltage,Current
1623307396023,high-voltage,35,0.389327
time,Hardware,Voltage,Current
1623307396023,high-voltage,40,0.715676
time,Hardware,Voltage,Current
1623307396023,high-voltage,45,1.26963
time,Hardware,Voltage,Current
1623307396023,high-voltage,50,1.98952
time,Hardware,Voltage,Current
1623307396023,high-voltage,55,2.85994
time,Hardware,Voltage,Current
1623307396023,high-voltage,60,3.87561
time,Hardware,Voltage,Current
1623307396023,high-voltage,65,5.04501
time,Hardware,Voltage,Current
1623307396023,high-voltage,70,6.3809
time,Hardware,Voltage,Current
1623307396023,high-voltage,75,7.91095
time,Hardware,Voltage,Current
1623307396023,high-voltage,80,9.65028
time,Hardware,Voltage,Current
1623307396023,high-voltage,85,10
