{
    "Data": [[2578.0, 713.0, 337.0, 182.0, 121.0, 80.0, 45.0, 37.0, 28.0, 20.0, 13.0, 14.0, 8.0, 7.0, 10.0, 8.0, 5.0, 5.0, 2.0, 5.0, 6.0, 5.0, 5.0, 1.0, 3.0, 1.0, 2.0, 3.0, 2.0, 3.0, 1.0, 3.0, 1.0, 2.0, 5.0, 1.0, 3.0, 2.0, 1.0, 1.0, 1.0, 1.0, 3.0, 3.0, 4.0, 0.0, 1.0, 1.0, 0.0], [3693.0, 1299.0, 640.0, 358.0, 237.0, 163.0, 110.0, 90.0, 71.0, 57.0, 31.0, 21.0, 18.0, 20.0, 17.0, 17.0, 16.0, 16.0, 11.0, 4.0, 7.0, 2.0, 2.0, 6.0, 2.0, 5.0, 4.0, 0.0, 3.0, 4.0, 3.0, 3.0, 3.0, 1.0, 2.0, 4.0, 3.0, 2.0, 2.0, 2.0, 1.0, 2.0, 0.0, 2.0, 5.0, 3.0, 7.0, 4.0, 1.0], [5026.0, 2228.0, 1205.0, 713.0, 460.0, 327.0, 222.0, 187.0, 137.0, 123.0, 97.0, 61.0, 58.0, 55.0, 48.0, 40.0, 29.0, 18.0, 23.0, 16.0, 6.0, 17.0, 10.0, 11.0, 12.0, 6.0, 5.0, 7.0, 11.0, 3.0, 4.0, 4.0, 10.0, 2.0, 3.0, 3.0, 0.0, 3.0, 1.0, 3.0, 2.0, 2.0, 5.0, 5.0, 3.0, 3.0, 5.0, 7.0, 5.0], [5308.0, 3056.0, 1925.0, 1258.0, 908.0, 636.0, 460.0, 371.0, 281.0, 228.0, 171.0, 158.0, 124.0, 113.0, 92.0, 78.0, 73.0, 52.0, 52.0, 44.0, 40.0, 27.0, 23.0, 29.0, 15.0, 22.0, 14.0, 18.0, 14.0, 13.0, 10.0, 11.0, 7.0, 2.0, 2.0, 4.0, 9.0, 6.0, 9.0, 3.0, 6.0, 2.0, 3.0, 4.0, 4.0, 3.0, 5.0, 8.0, 11.0], [4950.0, 3276.0, 2432.0, 1867.0, 1474.0, 1115.0, 976.0, 712.0, 579.0, 488.0, 410.0, 331.0, 280.0, 216.0, 197.0, 181.0, 157.0, 121.0, 115.0, 115.0, 89.0, 92.0, 60.0, 62.0, 44.0, 54.0, 47.0, 45.0, 33.0, 25.0, 17.0, 19.0, 22.0, 19.0, 21.0, 14.0, 11.0, 9.0, 13.0, 9.0, 4.0, 6.0, 14.0, 5.0, 10.0, 7.0, 9.0, 5.0, 15.0], [4787.0, 2793.0, 2316.0, 1980.0, 1830.0, 1451.0, 1346.0, 1124.0, 951.0, 855.0, 729.0, 675.0, 557.0, 529.0, 417.0, 380.0, 301.0, 298.0, 239.0, 214.0, 207.0, 184.0, 166.0, 145.0, 117.0, 90.0, 108.0, 80.0, 90.0, 71.0, 66.0, 63.0, 48.0, 33.0, 52.0, 35.0, 42.0, 30.0, 26.0, 24.0, 31.0, 20.0, 15.0, 12.0, 12.0, 8.0, 13.0, 15.0, 14.0], [6282.0, 3000.0, 2075.0, 1787.0, 1539.0, 1410.0, 1329.0, 1326.0, 1167.0, 1164.0, 1007.0, 1020.0, 845.0, 841.0, 694.0, 701.0, 594.0, 517.0, 522.0, 447.0, 394.0, 379.0, 349.0, 303.0, 277.0, 256.0, 232.0, 169.0, 181.0, 158.0, 172.0, 152.0, 113.0, 111.0, 106.0, 91.0, 68.0, 70.0, 58.0, 58.0, 61.0, 47.0, 39.0, 47.0, 31.0, 35.0, 20.0, 26.0, 30.0], [7136.0, 4463.0, 3012.0, 2183.0, 1687.0, 1387.0, 1319.0, 1123.0, 1141.0, 1171.0, 998.0, 1026.0, 953.0, 933.0, 896.0, 932.0, 854.0, 828.0, 751.0, 761.0, 668.0, 676.0, 606.0, 561.0, 524.0, 497.0, 471.0, 438.0, 349.0, 354.0, 330.0, 302.0, 302.0, 223.0, 243.0, 216.0, 165.0, 189.0, 152.0, 172.0, 132.0, 115.0, 120.0, 101.0, 69.0, 78.0, 66.0, 58.0, 49.0], [4487.0, 3738.0, 3305.0, 2953.0, 2514.0, 2167.0, 1915.0, 1631.0, 1503.0, 1296.0, 1199.0, 1065.0, 1004.0, 962.0, 946.0, 918.0, 896.0, 835.0, 882.0, 856.0, 797.0, 857.0, 818.0, 767.0, 786.0, 728.0, 767.0, 723.0, 667.0, 637.0, 636.0, 553.0, 551.0, 556.0, 492.0, 407.0, 401.0, 393.0, 346.0, 364.0, 281.0, 259.0, 258.0, 216.0, 194.0, 189.0, 168.0, 136.0, 131.0], [1906.0, 1465.0, 1591.0, 1584.0, 1695.0, 1828.0, 1767.0, 1902.0, 1808.0, 1830.0, 1803.0, 1633.0, 1553.0, 1494.0, 1387.0, 1279.0, 1309.0, 1136.0, 1105.0, 1090.0, 981.0, 988.0, 945.0, 947.0, 941.0, 905.0, 870.0, 841.0, 897.0, 896.0, 858.0, 872.0, 786.0, 846.0, 725.0, 773.0, 746.0, 779.0, 670.0, 633.0, 612.0, 591.0, 540.0, 527.0, 442.0, 418.0, 376.0, 329.0, 306.0], [1710.0, 553.0, 351.0, 365.0, 470.0, 489.0, 633.0, 714.0, 824.0, 864.0, 987.0, 1072.0, 1106.0, 1200.0, 1249.0, 1347.0, 1340.0, 1421.0, 1491.0, 1433.0, 1481.0, 1496.0, 1436.0, 1421.0, 1420.0, 1449.0, 1375.0, 1279.0, 1268.0, 1261.0, 1210.0, 1166.0, 1187.0, 1121.0, 1078.0, 1124.0, 1132.0, 1109.0, 1070.0, 1081.0, 1069.0, 1063.0, 1030.0, 1004.0, 931.0, 932.0, 902.0, 772.0, 682.0], [2153.0, 626.0, 231.0, 114.0, 105.0, 114.0, 114.0, 124.0, 142.0, 173.0, 205.0, 251.0, 301.0, 307.0, 360.0, 417.0, 452.0, 565.0, 660.0, 733.0, 826.0, 891.0, 1025.0, 1013.0, 1197.0, 1256.0, 1415.0, 1403.0, 1549.0, 1606.0, 1544.0, 1726.0, 1711.0, 1754.0, 1791.0, 1809.0, 1877.0, 1828.0, 1746.0, 1834.0, 1833.0, 1706.0, 1764.0, 1687.0, 1733.0, 1692.0, 1637.0, 1701.0, 1583.0], [3027.0, 933.0, 368.0, 147.0, 76.0, 58.0, 43.0, 36.0, 39.0, 36.0, 53.0, 41.0, 54.0, 62.0, 74.0, 82.0, 92.0, 113.0, 100.0, 146.0, 162.0, 173.0, 233.0, 255.0, 318.0, 367.0, 412.0, 502.0, 624.0, 600.0, 783.0, 940.0, 1041.0, 1254.0, 1331.0, 1560.0, 1741.0, 1887.0, 2162.0, 2325.0, 2560.0, 2826.0, 3041.0, 3086.0, 3231.0, 3367.0, 3342.0, 3467.0, 3511.0], [3972.0, 1441.0, 617.0, 271.0, 119.0, 72.0, 31.0, 26.0, 23.0, 23.0, 20.0, 21.0, 26.0, 23.0, 17.0, 15.0, 21.0, 28.0, 33.0, 37.0, 31.0, 40.0, 46.0, 40.0, 61.0, 63.0, 96.0, 81.0, 97.0, 140.0, 146.0, 211.0, 234.0, 286.0, 335.0, 423.0, 553.0, 693.0, 913.0, 1124.0, 1424.0, 1845.0, 2300.0, 3003.0, 3580.0, 4668.0, 5740.0, 6804.0, 7610.0], [4684.0, 2146.0, 1087.0, 462.0, 262.0, 131.0, 71.0, 44.0, 28.0, 22.0, 15.0, 19.0, 17.0, 17.0, 13.0, 18.0, 15.0, 9.0, 11.0, 20.0, 13.0, 15.0, 16.0, 22.0, 15.0, 29.0, 18.0, 13.0, 28.0, 38.0, 36.0, 39.0, 51.0, 55.0, 79.0, 90.0, 107.0, 123.0, 206.0, 265.0, 310.0, 522.0, 671.0, 959.0, 1574.0, 2459.0, 3982.0, 6941.0, 11696.0], [5265.0, 2760.0, 1560.0, 781.0, 445.0, 243.0, 137.0, 66.0, 37.0, 23.0, 17.0, 16.0, 12.0, 16.0, 13.0, 8.0, 8.0, 7.0, 15.0, 5.0, 10.0, 12.0, 13.0, 13.0, 13.0, 16.0, 7.0, 10.0, 6.0, 15.0, 20.0, 16.0, 20.0, 23.0, 27.0, 28.0, 43.0, 39.0, 51.0, 63.0, 104.0, 136.0, 176.0, 259.0, 437.0, 781.0, 1497.0, 3461.0, 9625.0], [5250.0, 3308.0, 2163.0, 1339.0, 742.0, 450.0, 260.0, 157.0, 116.0, 66.0, 47.0, 30.0, 13.0, 20.0, 13.0, 11.0, 9.0, 8.0, 14.0, 7.0, 5.0, 6.0, 4.0, 9.0, 7.0, 7.0, 7.0, 8.0, 6.0, 6.0, 11.0, 16.0, 11.0, 16.0, 13.0, 17.0, 17.0, 18.0, 16.0, 28.0, 33.0, 62.0, 63.0, 97.0, 140.0, 260.0, 487.0, 1206.0, 4971.0], [4916.0, 3531.0, 2646.0, 1748.0, 1161.0, 812.0, 529.0, 351.0, 217.0, 158.0, 110.0, 71.0, 49.0, 31.0, 15.0, 17.0, 9.0, 9.0, 5.0, 15.0, 5.0, 5.0, 6.0, 3.0, 7.0, 6.0, 10.0, 4.0, 6.0, 3.0, 6.0, 7.0, 8.0, 15.0, 11.0, 3.0, 12.0, 6.0, 17.0, 16.0, 19.0, 28.0, 46.0, 33.0, 59.0, 94.0, 182.0, 463.0, 2281.0], [4335.0, 3428.0, 2747.0, 2059.0, 1493.0, 1124.0, 822.0, 609.0, 390.0, 280.0, 217.0, 161.0, 86.0, 69.0, 40.0, 39.0, 18.0, 14.0, 17.0, 11.0, 11.0, 10.0, 4.0, 5.0, 5.0, 5.0, 3.0, 0.0, 6.0, 8.0, 7.0, 6.0, 7.0, 3.0, 7.0, 6.0, 7.0, 10.0, 8.0, 8.0, 15.0, 15.0, 21.0, 17.0, 30.0, 46.0, 98.0, 198.0, 1019.0], [3711.0, 2998.0, 2511.0, 2115.0, 1798.0, 1502.0, 1121.0, 888.0, 635.0, 549.0, 368.0, 321.0, 215.0, 162.0, 113.0, 95.0, 60.0, 40.0, 37.0, 25.0, 20.0, 14.0, 13.0, 14.0, 9.0, 6.0, 5.0, 3.0, 9.0, 7.0, 5.0, 2.0, 3.0, 5.0, 7.0, 11.0, 4.0, 10.0, 6.0, 6.0, 10.0, 5.0, 17.0, 13.0, 23.0, 28.0, 43.0, 113.0, 502.0], [2976.0, 2639.0, 2359.0, 2071.0, 1896.0, 1631.0, 1380.0, 1122.0, 945.0, 803.0, 620.0, 487.0, 418.0, 344.0, 221.0, 190.0, 138.0, 113.0, 70.0, 61.0, 45.0, 22.0, 27.0, 23.0, 23.0, 15.0, 7.0, 4.0, 5.0, 4.0, 7.0, 8.0, 5.0, 4.0, 8.0, 4.0, 3.0, 7.0, 5.0, 8.0, 4.0, 11.0, 11.0, 12.0, 14.0, 20.0, 31.0, 56.0, 236.0], [2612.0, 2227.0, 2185.0, 1891.0, 1725.0, 1522.0, 1285.0, 1216.0, 1129.0, 936.0, 813.0, 692.0, 586.0, 482.0, 396.0, 322.0, 270.0, 211.0, 174.0, 134.0, 97.0, 90.0, 70.0, 48.0, 25.0, 26.0, 24.0, 10.0, 15.0, 14.0, 7.0, 7.0, 4.0, 1.0, 1.0, 4.0, 6.0, 6.0, 12.0, 1.0, 16.0, 6.0, 7.0, 8.0, 12.0, 15.0, 22.0, 46.0, 156.0], [2211.0, 1867.0, 1860.0, 1711.0, 1609.0, 1489.0, 1299.0, 1220.0, 1100.0, 1062.0, 877.0, 828.0, 728.0, 654.0, 552.0, 517.0, 386.0, 341.0, 296.0, 255.0, 189.0, 161.0, 147.0, 110.0, 84.0, 75.0, 55.0, 45.0, 30.0, 23.0, 20.0, 12.0, 11.0, 9.0, 5.0, 5.0, 5.0, 6.0, 5.0, 2.0, 6.0, 6.0, 4.0, 6.0, 17.0, 14.0, 19.0, 26.0, 92.0], [2092.0, 1762.0, 1716.0, 1572.0, 1357.0, 1349.0, 1235.0, 1206.0, 1113.0, 964.0, 906.0, 844.0, 784.0, 730.0, 621.0, 558.0, 509.0, 452.0, 420.0, 342.0, 303.0, 265.0, 238.0, 207.0, 173.0, 136.0, 112.0, 110.0, 65.0, 58.0, 41.0, 41.0, 27.0, 21.0, 13.0, 7.0, 13.0, 9.0, 8.0, 4.0, 0.0, 8.0, 7.0, 4.0, 6.0, 13.0, 15.0, 22.0, 73.0], [1813.0, 1493.0, 1484.0, 1319.0, 1160.0, 1146.0, 1093.0, 1075.0, 991.0, 940.0, 893.0, 834.0, 784.0, 758.0, 776.0, 684.0, 619.0, 579.0, 564.0, 519.0, 423.0, 393.0, 367.0, 314.0, 313.0, 263.0, 203.0, 171.0, 160.0, 144.0, 99.0, 101.0, 58.0, 45.0, 49.0, 44.0, 33.0, 22.0, 18.0, 12.0, 8.0, 3.0, 7.0, 6.0, 9.0, 6.0, 9.0, 23.0, 50.0], [1478.0, 1278.0, 1351.0, 1273.0, 1192.0, 1103.0, 1077.0, 959.0, 915.0, 860.0, 842.0, 749.0, 739.0, 774.0, 760.0, 615.0, 639.0, 611.0, 654.0, 561.0, 525.0, 505.0, 468.0, 446.0, 352.0, 371.0, 301.0, 289.0, 256.0, 227.0, 204.0, 163.0, 131.0, 108.0, 94.0, 95.0, 71.0, 59.0, 52.0, 29.0, 17.0, 17.0, 15.0, 10.0, 6.0, 6.0, 9.0, 14.0, 40.0], [1332.0, 1293.0, 1272.0, 1070.0, 1058.0, 1046.0, 932.0, 882.0, 790.0, 782.0, 735.0, 654.0, 692.0, 694.0, 646.0, 621.0, 635.0, 585.0, 620.0, 503.0, 520.0, 570.0, 495.0, 486.0, 460.0, 453.0, 415.0, 385.0, 361.0, 330.0, 321.0, 297.0, 250.0, 228.0, 160.0, 189.0, 138.0, 106.0, 82.0, 77.0, 75.0, 32.0, 49.0, 31.0, 19.0, 14.0, 11.0, 7.0, 29.0], [1352.0, 1082.0, 1049.0, 945.0, 956.0, 846.0, 791.0, 726.0, 721.0, 695.0, 650.0, 669.0, 671.0, 575.0, 652.0, 614.0, 626.0, 571.0, 616.0, 557.0, 570.0, 547.0, 523.0, 524.0, 501.0, 491.0, 491.0, 472.0, 459.0, 413.0, 446.0, 392.0, 331.0, 347.0, 302.0, 242.0, 240.0, 201.0, 178.0, 147.0, 127.0, 113.0, 82.0, 57.0, 40.0, 40.0, 26.0, 24.0, 25.0], [1161.0, 1052.0, 1021.0, 909.0, 857.0, 815.0, 748.0, 744.0, 724.0, 621.0, 622.0, 621.0, 579.0, 542.0, 564.0, 556.0, 568.0, 518.0, 505.0, 519.0, 497.0, 503.0, 496.0, 533.0, 459.0, 467.0, 479.0, 482.0, 482.0, 466.0, 454.0, 423.0, 417.0, 407.0, 431.0, 363.0, 372.0, 337.0, 314.0, 281.0, 227.0, 200.0, 196.0, 151.0, 112.0, 79.0, 58.0, 39.0, 34.0], [1076.0, 873.0, 814.0, 794.0, 757.0, 729.0, 731.0, 611.0, 552.0, 631.0, 529.0, 514.0, 561.0, 512.0, 518.0, 493.0, 449.0, 454.0, 453.0, 442.0, 450.0, 414.0, 411.0, 415.0, 473.0, 459.0, 424.0, 474.0, 481.0, 427.0, 462.0, 480.0, 540.0, 470.0, 520.0, 541.0, 513.0, 506.0, 483.0, 451.0, 432.0, 412.0, 397.0, 311.0, 248.0, 222.0, 175.0, 130.0, 68.0], [859.0, 598.0, 606.0, 642.0, 647.0, 695.0, 628.0, 573.0, 572.0, 563.0, 616.0, 536.0, 519.0, 479.0, 536.0, 489.0, 463.0, 474.0, 446.0, 461.0, 422.0, 421.0, 402.0, 450.0, 394.0, 452.0, 389.0, 372.0, 424.0, 422.0, 452.0, 446.0, 457.0, 479.0, 472.0, 495.0, 516.0, 542.0, 542.0, 586.0, 541.0, 584.0, 509.0, 449.0, 418.0, 368.0, 295.0, 257.0, 186.0], [916.0, 697.0, 718.0, 591.0, 630.0, 560.0, 531.0, 580.0, 535.0, 557.0, 510.0, 449.0, 444.0, 474.0, 424.0, 417.0, 431.0, 410.0, 367.0, 379.0, 358.0, 367.0, 319.0, 339.0, 328.0, 331.0, 340.0, 342.0, 365.0, 432.0, 383.0, 384.0, 397.0, 468.0, 470.0, 505.0, 563.0, 545.0, 590.0, 581.0, 631.0, 632.0, 623.0, 604.0, 635.0, 597.0, 576.0, 451.0, 391.0], [582.0, 596.0, 476.0, 625.0, 522.0, 511.0, 488.0, 494.0, 467.0, 451.0, 346.0, 320.0, 332.0, 409.0, 358.0, 365.0, 440.0, 337.0, 349.0, 359.0, 303.0, 302.0, 324.0, 307.0, 317.0, 327.0, 365.0, 359.0, 347.0, 353.0, 378.0, 367.0, 383.0, 392.0, 441.0, 427.0, 526.0, 555.0, 595.0, 592.0, 693.0, 731.0, 740.0, 822.0, 869.0, 906.0, 902.0, 820.0, 751.0], [588.0, 526.0, 445.0, 491.0, 432.0, 437.0, 517.0, 378.0, 363.0, 409.0, 401.0, 375.0, 393.0, 312.0, 394.0, 343.0, 309.0, 328.0, 346.0, 305.0, 294.0, 266.0, 297.0, 309.0, 308.0, 282.0, 265.0, 273.0, 284.0, 304.0, 278.0, 305.0, 282.0, 312.0, 300.0, 348.0, 418.0, 460.0, 456.0, 526.0, 629.0, 705.0, 762.0, 830.0, 1013.0, 1117.0, 1191.0, 1305.0, 1205.0], [595.0, 282.0, 366.0, 482.0, 419.0, 356.0, 321.0, 331.0, 354.0, 357.0, 324.0, 299.0, 261.0, 296.0, 319.0, 346.0, 380.0, 303.0, 211.0, 247.0, 334.0, 308.0, 293.0, 305.0, 325.0, 264.0, 258.0, 321.0, 257.0, 232.0, 232.0, 274.0, 255.0, 271.0, 291.0, 329.0, 274.0, 357.0, 359.0, 413.0, 502.0, 552.0, 703.0, 809.0, 1032.0, 1192.0, 1408.0, 1544.0, 1747.0], [525.0, 405.0, 393.0, 473.0, 462.0, 367.0, 354.0, 325.0, 384.0, 405.0, 282.0, 315.0, 290.0, 299.0, 375.0, 285.0, 265.0, 285.0, 350.0, 375.0, 300.0, 239.0, 205.0, 161.0, 165.0, 183.0, 188.0, 193.0, 224.0, 276.0, 289.0, 261.0, 253.0, 254.0, 227.0, 226.0, 258.0, 276.0, 316.0, 377.0, 341.0, 417.0, 530.0, 677.0, 869.0, 1046.0, 1457.0, 1732.0, 2233.0], [612.0, 372.0, 411.0, 336.0, 212.0, 367.0, 366.0, 405.0, 334.0, 351.0, 237.0, 337.0, 290.0, 223.0, 296.0, 238.0, 228.0, 216.0, 203.0, 229.0, 231.0, 308.0, 264.0, 330.0, 347.0, 152.0, 214.0, 204.0, 201.0, 170.0, 166.0, 195.0, 183.0, 117.0, 130.0, 188.0, 216.0, 199.0, 199.0, 260.0, 317.0, 311.0, 406.0, 538.0, 720.0, 972.0, 1236.0, 1759.0, 2841.0], [499.0, 313.0, 279.0, 305.0, 402.0, 379.0, 433.0, 364.0, 377.0, 279.0, 275.0, 230.0, 298.0, 235.0, 221.0, 215.0, 304.0, 312.0, 332.0, 282.0, 199.0, 184.0, 247.0, 299.0, 313.0, 191.0, 211.0, 242.0, 244.0, 281.0, 253.0, 255.0, 224.0, 159.0, 193.0, 156.0, 170.0, 201.0, 273.0, 323.0, 308.0, 258.0, 322.0, 346.0, 423.0, 635.0, 986.0, 1467.0, 2729.0], [591.0, 334.0, 309.0, 560.0, 245.0, 273.0, 528.0, 366.0, 302.0, 253.0, 267.0, 263.0, 314.0, 186.0, 398.0, 264.0, 190.0, 184.0, 297.0, 241.0, 231.0, 250.0, 225.0, 234.0, 224.0, 191.0, 221.0, 226.0, 228.0, 286.0, 199.0, 212.0, 191.0, 167.0, 156.0, 211.0, 140.0, 187.0, 223.0, 166.0, 181.0, 273.0, 280.0, 307.0, 337.0, 542.0, 835.0, 1357.0, 2432.0], [501.0, 508.0, 260.0, 314.0, 380.0, 354.0, 385.0, 376.0, 329.0, 230.0, 343.0, 280.0, 396.0, 267.0, 286.0, 173.0, 233.0, 405.0, 156.0, 225.0, 320.0, 238.0, 157.0, 343.0, 247.0, 207.0, 211.0, 212.0, 312.0, 167.0, 173.0, 168.0, 248.0, 153.0, 160.0, 173.0, 186.0, 258.0, 172.0, 152.0, 161.0, 202.0, 181.0, 257.0, 281.0, 390.0, 603.0, 993.0, 2133.0], [499.0, 420.0, 369.0, 180.0, 358.0, 352.0, 364.0, 254.0, 224.0, 451.0, 498.0, 307.0, 305.0, 316.0, 365.0, 320.0, 309.0, 245.0, 324.0, 255.0, 244.0, 295.0, 197.0, 270.0, 221.0, 140.0, 163.0, 246.0, 258.0, 174.0, 258.0, 212.0, 149.0, 172.0, 198.0, 320.0, 181.0, 93.0, 129.0, 160.0, 165.0, 203.0, 151.0, 223.0, 238.0, 328.0, 431.0, 719.0, 1597.0], [623.0, 427.0, 535.0, 560.0, 497.0, 438.0, 295.0, 275.0, 284.0, 211.0, 254.0, 288.0, 346.0, 346.0, 276.0, 204.0, 258.0, 386.0, 238.0, 280.0, 282.0, 236.0, 170.0, 187.0, 221.0, 227.0, 329.0, 91.0, 107.0, 191.0, 176.0, 189.0, 196.0, 200.0, 274.0, 225.0, 172.0, 255.0, 158.0, 168.0, 142.0, 197.0, 256.0, 188.0, 202.0, 187.0, 274.0, 441.0, 1253.0], [645.0, 406.0, 275.0, 436.0, 356.0, 293.0, 369.0, 296.0, 339.0, 245.0, 306.0, 267.0, 214.0, 213.0, 355.0, 222.0, 320.0, 262.0, 307.0, 252.0, 293.0, 335.0, 212.0, 290.0, 233.0, 216.0, 325.0, 288.0, 249.0, 234.0, 290.0, 169.0, 233.0, 252.0, 189.0, 207.0, 268.0, 168.0, 257.0, 192.0, 160.0, 83.0, 111.0, 155.0, 261.0, 249.0, 277.0, 421.0, 919.0], [556.0, 428.0, 363.0, 290.0, 494.0, 495.0, 386.0, 299.0, 398.0, 332.0, 349.0, 379.0, 389.0, 389.0, 406.0, 230.0, 264.0, 332.0, 225.0, 416.0, 207.0, 303.0, 168.0, 282.0, 302.0, 133.0, 139.0, 240.0, 157.0, 143.0, 78.0, 166.0, 151.0, 215.0, 136.0, 186.0, 241.0, 261.0, 232.0, 292.0, 158.0, 149.0, 146.0, 144.0, 163.0, 244.0, 225.0, 265.0, 616.0], [563.0, 391.0, 359.0, 460.0, 398.0, 279.0, 380.0, 300.0, 212.0, 377.0, 294.0, 342.0, 248.0, 233.0, 353.0, 388.0, 380.0, 203.0, 267.0, 287.0, 343.0, 220.0, 203.0, 254.0, 236.0, 279.0, 328.0, 197.0, 199.0, 361.0, 158.0, 197.0, 268.0, 270.0, 215.0, 231.0, 146.0, 189.0, 84.0, 156.0, 125.0, 269.0, 263.0, 163.0, 206.0, 176.0, 223.0, 189.0, 479.0], [647.0, 486.0, 350.0, 454.0, 322.0, 369.0, 502.0, 327.0, 253.0, 415.0, 345.0, 337.0, 240.0, 398.0, 182.0, 205.0, 314.0, 269.0, 284.0, 306.0, 222.0, 220.0, 283.0, 167.0, 202.0, 231.0, 207.0, 244.0, 246.0, 299.0, 196.0, 244.0, 125.0, 251.0, 228.0, 309.0, 189.0, 170.0, 146.0, 248.0, 159.0, 214.0, 254.0, 229.0, 191.0, 214.0, 196.0, 165.0, 423.0], [549.0, 492.0, 551.0, 565.0, 343.0, 236.0, 416.0, 409.0, 275.0, 574.0, 282.0, 242.0, 374.0, 317.0, 275.0, 170.0, 316.0, 289.0, 314.0, 231.0, 207.0, 373.0, 320.0, 216.0, 249.0, 224.0, 166.0, 208.0, 209.0, 210.0, 218.0, 166.0, 216.0, 145.0, 252.0, 175.0, 214.0, 149.0, 152.0, 405.0, 174.0, 101.0, 145.0, 276.0, 239.0, 196.0, 138.0, 114.0, 361.0], [709.0, 397.0, 343.0, 413.0, 456.0, 379.0, 333.0, 459.0, 415.0, 338.0, 399.0, 393.0, 367.0, 167.0, 468.0, 342.0, 328.0, 365.0, 228.0, 288.0, 343.0, 174.0, 160.0, 265.0, 311.0, 222.0, 172.0, 141.0, 163.0, 162.0, 271.0, 249.0, 247.0, 292.0, 271.0, 236.0, 233.0, 219.0, 222.0, 184.0, 224.0, 135.0, 313.0, 244.0, 149.0, 161.0, 182.0, 207.0, 288.0], [649.0, 506.0, 445.0, 529.0, 465.0, 401.0, 376.0, 360.0, 181.0, 322.0, 360.0, 330.0, 326.0, 390.0, 383.0, 336.0, 313.0, 340.0, 324.0, 279.0, 309.0, 333.0, 330.0, 220.0, 292.0, 307.0, 268.0, 232.0, 223.0, 203.0, 227.0, 335.0, 252.0, 279.0, 192.0, 217.0, 124.0, 151.0, 233.0, 217.0, 141.0, 158.0, 150.0, 139.0, 156.0, 164.0, 290.0, 119.0, 136.0], [500.0, 335.0, 558.0, 353.0, 361.0, 325.0, 404.0, 388.0, 263.0, 374.0, 460.0, 510.0, 242.0, 331.0, 336.0, 318.0, 467.0, 379.0, 248.0, 323.0, 353.0, 319.0, 257.0, 303.0, 238.0, 230.0, 318.0, 258.0, 136.0, 229.0, 244.0, 185.0, 162.0, 215.0, 187.0, 287.0, 270.0, 142.0, 233.0, 136.0, 102.0, 212.0, 225.0, 156.0, 199.0, 192.0, 158.0, 246.0, 211.0], [625.0, 383.0, 338.0, 540.0, 462.0, 271.0, 411.0, 577.0, 375.0, 373.0, 445.0, 246.0, 204.0, 352.0, 433.0, 307.0, 176.0, 232.0, 275.0, 245.0, 202.0, 170.0, 373.0, 241.0, 334.0, 272.0, 202.0, 213.0, 323.0, 183.0, 166.0, 228.0, 336.0, 176.0, 162.0, 208.0, 287.0, 177.0, 273.0, 173.0, 210.0, 167.0, 212.0, 181.0, 119.0, 132.0, 283.0, 184.0, 136.0]],
    "Name": "sCurve-0",
    "Overflow": 2036138.0,
    "Type": "Histo2d",
    "Underflow": 0.0,
    "x": {
        "AxisTitle": "Vcal",
        "Bins": 51,
        "High": 302.5,
        "Low": 47.5
    },
    "y": {
        "AxisTitle": "Occupancy",
        "Bins": 49,
        "High": 49.5,
        "Low": 0.5
    },
    "z": {
        "AxisTitle": "Number of pixels"
    }
}