{
    "Data": [0.0, 0.0, 0.0, 0.0, 0.0, 0.0, 0.0, 0.0, 0.0, 0.0, 0.0, 0.0, 0.0, 13.0, 7.0, 0.0, 4.0, 202.0, 523.0, 134.0, 111.0, 896.0, 1980.0, 1289.0, 513.0, 1746.0, 2430.0, 1543.0, 853.0, 1484.0, 1764.0, 1366.0, 984.0, 976.0, 829.0, 715.0, 640.0, 746.0, 843.0, 928.0, 664.0, 704.0, 1444.0, 2794.0, 2238.0, 1472.0, 1873.0, 3107.0, 3701.0, 3364.0, 2428.0, 2175.0, 2660.0, 2354.0, 1948.0, 1765.0, 1926.0, 1871.0, 1953.0, 1608.0, 1333.0, 1294.0, 1052.0, 818.0, 691.0, 631.0, 742.0, 565.0, 515.0, 456.0, 532.0, 458.0, 394.0, 333.0, 292.0, 325.0, 306.0, 213.0, 187.0, 175.0, 198.0, 172.0, 148.0, 100.0, 120.0, 107.0, 98.0, 75.0, 82.0, 81.0, 97.0, 63.0, 54.0, 37.0, 49.0, 63.0, 63.0, 45.0, 44.0, 28.0, 29.0, 24.0, 35.0, 26.0, 33.0, 29.0, 27.0, 17.0, 24.0, 15.0, 20.0, 29.0, 11.0, 18.0, 14.0, 14.0, 20.0, 11.0, 12.0, 11.0, 10.0, 14.0, 12.0, 9.0, 14.0, 7.0, 5.0, 11.0, 3.0, 7.0, 8.0, 11.0, 11.0, 3.0, 7.0, 4.0, 11.0, 11.0, 6.0, 8.0, 6.0, 7.0, 8.0, 8.0, 3.0, 1.0, 3.0, 3.0, 2.0, 5.0, 2.0, 0.0, 2.0, 11.0, 9.0, 5.0, 3.0, 8.0, 5.0, 2.0, 3.0, 2.0, 2.0, 3.0, 2.0, 1.0, 6.0, 3.0, 2.0, 5.0, 4.0, 6.0, 7.0, 3.0, 5.0, 5.0, 3.0, 7.0, 5.0, 3.0, 3.0, 3.0, 1.0, 1.0, 4.0, 5.0, 1.0, 2.0, 2.0, 2.0, 3.0, 2.0, 1.0, 2.0, 0.0, 1.0, 4.0, 6.0, 2.0, 2.0, 1.0],
    "Name": "TimePerFitDist-0",
    "Overflow": 171.0,
    "Type": "Histo1d",
    "Underflow": 0.0,
    "x": {
        "AxisTitle": "Fit Time [us]",
        "Bins": 201,
        "High": 401.0,
        "Low": -1.0
    },
    "y": {
        "AxisTitle": "Number of Pixels"
    },
    "z": {
        "AxisTitle": "z"
    }
}