{
    "Data": [793.0, 17015.0, 20275.0, 9505.0, 3973.0, 2646.0, 2647.0, 2901.0, 2877.0, 2459.0, 1970.0, 1398.0, 1049.0, 688.0, 469.0, 354.0, 245.0, 206.0, 212.0, 193.0, 150.0, 139.0, 141.0, 133.0, 132.0, 136.0, 123.0, 95.0, 107.0, 97.0, 81.0, 98.0, 79.0, 73.0, 67.0, 44.0, 50.0, 74.0, 50.0, 38.0, 28.0, 29.0, 35.0, 22.0, 33.0, 29.0, 23.0, 25.0, 20.0, 16.0, 1.0],
    "Name": "Chi2Dist-0",
    "Overflow": 0.0,
    "Type": "Histo1d",
    "Underflow": 0.0,
    "x": {
        "AxisTitle": "Fit Chi/ndf",
        "Bins": 51,
        "High": 2.5250000953674318,
        "Low": -0.02500000037252903
    },
    "y": {
        "AxisTitle": "Number of Pixels"
    },
    "z": {
        "AxisTitle": "z"
    }
}