{
    "Data": [0.0, 0.0, 0.0, 0.0, 0.0, 0.0, 0.0, 0.0, 0.0, 0.0, 0.0, 0.0, 0.0, 0.0, 0.0, 0.0, 0.0, 0.0, 0.0, 0.0, 0.0, 0.0, 0.0, 0.0, 0.0, 0.0, 0.0, 0.0, 0.0, 0.0, 0.0, 0.0, 0.0, 0.0, 0.0, 0.0, 0.0, 0.0, 0.0, 0.0, 0.0, 0.0, 0.0, 0.0, 0.0, 0.0, 0.0, 0.0, 0.0, 0.0, 18.0, 46.0, 32.0, 44.0, 42.0, 58.0, 76.0, 98.0, 132.0, 133.0, 132.0, 133.0, 188.0, 202.0, 234.0, 241.0, 265.0, 289.0, 352.0, 376.0, 391.0, 402.0, 496.0, 525.0, 574.0, 584.0, 655.0, 708.0, 731.0, 747.0, 756.0, 848.0, 920.0, 1033.0, 1222.0, 1376.0, 1673.0, 1991.0, 2235.0, 2590.0, 2838.0, 2980.0, 3009.0, 2786.0, 2666.0, 2377.0, 2085.0, 1643.0, 1325.0, 1036.0, 887.0, 688.0, 577.0, 449.0, 378.0, 322.0, 280.0, 238.0, 199.0, 178.0, 165.0, 134.0, 106.0, 104.0, 80.0, 67.0, 66.0, 50.0, 53.0, 46.0, 29.0, 25.0, 38.0, 29.0, 26.0, 22.0, 22.0, 22.0, 7.0, 15.0, 14.0, 15.0, 11.0, 12.0, 11.0, 8.0, 19.0, 14.0, 13.0, 6.0, 6.0, 9.0, 6.0, 6.0, 7.0, 8.0, 5.0, 9.0, 2.0, 4.0, 3.0, 2.0, 7.0, 6.0, 5.0, 6.0, 3.0, 10.0, 2.0, 10.0, 18.0, 13.0, 22.0, 16.0, 19.0, 45.0, 32.0, 54.0, 78.0, 64.0, 99.0, 105.0, 130.0, 154.0, 168.0, 203.0, 226.0, 238.0, 307.0, 332.0, 374.0, 409.0, 429.0, 472.0, 479.0, 559.0, 608.0, 585.0, 620.0, 709.0, 675.0, 787.0, 752.0, 837.0, 807.0, 807.0, 817.0, 804.0, 757.0, 791.0, 774.0, 764.0, 694.0, 673.0, 638.0, 624.0, 554.0, 522.0, 473.0, 422.0, 410.0, 328.0, 303.0, 290.0, 245.0, 224.0, 190.0, 153.0, 124.0, 109.0, 104.0, 81.0, 69.0, 46.0, 50.0, 38.0, 23.0, 26.0, 20.0, 19.0, 8.0, 6.0, 9.0, 4.0, 3.0, 4.0, 0.0, 3.0, 8.0, 3.0, 8.0, 1.0, 1.0, 1.0, 1.0, 1.0, 1.0, 1.0, 1.0, 0.0, 0.0, 0.0, 0.0, 0.0, 0.0, 0.0, 0.0, 0.0, 1.0, 0.0, 0.0, 0.0, 0.0, 0.0, 0.0, 0.0, 0.0, 0.0, 0.0, 0.0, 0.0, 0.0, 0.0, 0.0, 0.0, 0.0, 0.0, 0.0, 0.0, 0.0, 0.0, 0.0, 0.0, 0.0, 0.0, 0.0, 0.0, 0.0, 0.0, 0.0, 0.0, 0.0, 0.0, 0.0, 0.0, 0.0, 0.0, 0.0, 0.0, 0.0, 0.0, 0.0, 0.0, 0.0, 0.0, 0.0, 0.0, 0.0, 0.0, 0.0, 0.0, 0.0, 0.0, 0.0, 1.0, 0.0, 0.0, 0.0, 0.0, 0.0, 0.0, 0.0, 0.0, 0.0, 0.0, 0.0, 0.0, 0.0, 0.0, 0.0, 0.0, 0.0, 0.0, 0.0, 0.0, 0.0, 0.0, 0.0, 0.0, 0.0, 0.0, 0.0, 0.0, 0.0, 0.0, 0.0, 0.0, 0.0, 0.0, 0.0, 0.0, 0.0, 0.0, 0.0, 0.0, 0.0, 0.0, 0.0, 0.0, 0.0, 0.0, 0.0, 0.0, 0.0, 0.0, 0.0, 0.0, 0.0, 0.0, 0.0, 0.0, 0.0, 0.0, 0.0, 0.0, 0.0, 0.0, 0.0, 0.0],
    "Name": "ThresholdDist-0",
    "Overflow": 0.0,
    "Type": "Histo1d",
    "Underflow": 0.0,
    "x": {
        "AxisTitle": "Threshold [e]",
        "Bins": 379,
        "High": 3785.0,
        "Low": -5.0
    },
    "y": {
        "AxisTitle": "Number of Pixels"
    },
    "z": {
        "AxisTitle": "z"
    }
}