{
    "Data": [[2053.0, 860.0, 515.0, 335.0, 270.0, 183.0, 182.0, 139.0, 120.0, 99.0, 90.0, 92.0, 77.0, 80.0, 62.0, 48.0, 48.0, 41.0, 41.0, 30.0, 27.0, 27.0, 17.0, 21.0, 23.0, 23.0, 18.0, 23.0, 15.0, 7.0, 12.0, 11.0, 11.0, 12.0, 13.0, 9.0, 7.0, 13.0, 10.0, 6.0, 10.0, 11.0, 8.0, 13.0, 8.0, 11.0, 5.0, 13.0, 7.0], [2746.0, 1323.0, 808.0, 559.0, 450.0, 327.0, 272.0, 248.0, 212.0, 204.0, 164.0, 172.0, 141.0, 113.0, 111.0, 98.0, 100.0, 86.0, 83.0, 91.0, 78.0, 51.0, 58.0, 56.0, 37.0, 46.0, 31.0, 33.0, 32.0, 32.0, 29.0, 26.0, 21.0, 23.0, 15.0, 22.0, 28.0, 27.0, 20.0, 17.0, 23.0, 19.0, 19.0, 13.0, 18.0, 14.0, 16.0, 24.0, 15.0], [3066.0, 1707.0, 1171.0, 878.0, 708.0, 580.0, 460.0, 424.0, 359.0, 306.0, 254.0, 235.0, 215.0, 225.0, 184.0, 175.0, 153.0, 169.0, 126.0, 151.0, 126.0, 132.0, 108.0, 109.0, 91.0, 104.0, 83.0, 84.0, 77.0, 79.0, 79.0, 55.0, 77.0, 62.0, 52.0, 47.0, 45.0, 36.0, 49.0, 42.0, 42.0, 39.0, 33.0, 40.0, 42.0, 31.0, 34.0, 42.0, 50.0], [3434.0, 1827.0, 1285.0, 1061.0, 807.0, 697.0, 606.0, 590.0, 494.0, 452.0, 451.0, 420.0, 372.0, 340.0, 315.0, 293.0, 261.0, 238.0, 254.0, 227.0, 219.0, 202.0, 197.0, 186.0, 161.0, 169.0, 133.0, 136.0, 125.0, 109.0, 120.0, 127.0, 146.0, 101.0, 116.0, 119.0, 118.0, 99.0, 99.0, 90.0, 95.0, 96.0, 81.0, 98.0, 83.0, 79.0, 95.0, 84.0, 87.0], [5169.0, 2454.0, 1528.0, 1187.0, 944.0, 811.0, 703.0, 624.0, 647.0, 574.0, 538.0, 446.0, 434.0, 422.0, 430.0, 405.0, 351.0, 382.0, 366.0, 349.0, 325.0, 303.0, 294.0, 308.0, 264.0, 270.0, 279.0, 250.0, 221.0, 220.0, 230.0, 202.0, 203.0, 191.0, 212.0, 217.0, 192.0, 184.0, 195.0, 184.0, 184.0, 194.0, 175.0, 170.0, 203.0, 192.0, 202.0, 198.0, 253.0], [6850.0, 4130.0, 2745.0, 2020.0, 1592.0, 1316.0, 1071.0, 895.0, 807.0, 741.0, 672.0, 595.0, 590.0, 532.0, 473.0, 450.0, 438.0, 406.0, 413.0, 395.0, 427.0, 397.0, 373.0, 355.0, 369.0, 360.0, 344.0, 290.0, 338.0, 330.0, 360.0, 329.0, 330.0, 302.0, 326.0, 327.0, 355.0, 283.0, 333.0, 287.0, 320.0, 313.0, 320.0, 329.0, 306.0, 385.0, 365.0, 405.0, 539.0], [3452.0, 3063.0, 2751.0, 2390.0, 2189.0, 1983.0, 1826.0, 1667.0, 1444.0, 1352.0, 1184.0, 1123.0, 1039.0, 1016.0, 889.0, 850.0, 828.0, 700.0, 736.0, 661.0, 632.0, 590.0, 552.0, 492.0, 510.0, 482.0, 499.0, 433.0, 462.0, 435.0, 468.0, 431.0, 407.0, 440.0, 440.0, 437.0, 469.0, 437.0, 432.0, 487.0, 485.0, 515.0, 513.0, 550.0, 573.0, 601.0, 677.0, 767.0, 1021.0], [896.0, 870.0, 961.0, 958.0, 1047.0, 1043.0, 1078.0, 1097.0, 1098.0, 1106.0, 1161.0, 1151.0, 1189.0, 1121.0, 1164.0, 1084.0, 1128.0, 1091.0, 1070.0, 1078.0, 1012.0, 1047.0, 1031.0, 978.0, 1044.0, 950.0, 882.0, 961.0, 857.0, 866.0, 831.0, 813.0, 825.0, 790.0, 800.0, 724.0, 741.0, 749.0, 700.0, 699.0, 780.0, 743.0, 771.0, 804.0, 852.0, 874.0, 1109.0, 1259.0, 1628.0], [353.0, 312.0, 274.0, 249.0, 274.0, 322.0, 329.0, 324.0, 351.0, 345.0, 402.0, 424.0, 423.0, 512.0, 520.0, 542.0, 521.0, 593.0, 637.0, 656.0, 652.0, 689.0, 730.0, 753.0, 801.0, 847.0, 891.0, 918.0, 966.0, 994.0, 1051.0, 1057.0, 1105.0, 1114.0, 1238.0, 1238.0, 1232.0, 1315.0, 1339.0, 1345.0, 1417.0, 1514.0, 1558.0, 1579.0, 1643.0, 1724.0, 1870.0, 2151.0, 2821.0], [226.0, 135.0, 113.0, 118.0, 116.0, 116.0, 105.0, 116.0, 127.0, 127.0, 143.0, 146.0, 146.0, 173.0, 167.0, 223.0, 191.0, 198.0, 208.0, 220.0, 225.0, 243.0, 265.0, 244.0, 340.0, 322.0, 338.0, 386.0, 455.0, 457.0, 490.0, 513.0, 570.0, 646.0, 676.0, 796.0, 856.0, 917.0, 1054.0, 1160.0, 1269.0, 1485.0, 1739.0, 1927.0, 2250.0, 2665.0, 3116.0, 4041.0, 5572.0], [184.0, 85.0, 74.0, 58.0, 46.0, 53.0, 69.0, 67.0, 64.0, 69.0, 73.0, 74.0, 62.0, 64.0, 71.0, 79.0, 97.0, 79.0, 81.0, 89.0, 106.0, 95.0, 113.0, 125.0, 110.0, 139.0, 139.0, 148.0, 166.0, 177.0, 192.0, 245.0, 195.0, 257.0, 299.0, 286.0, 338.0, 378.0, 446.0, 534.0, 585.0, 690.0, 853.0, 1044.0, 1265.0, 1837.0, 2498.0, 3899.0, 7219.0], [161.0, 76.0, 68.0, 34.0, 34.0, 45.0, 44.0, 40.0, 31.0, 30.0, 34.0, 31.0, 39.0, 43.0, 46.0, 40.0, 51.0, 45.0, 55.0, 32.0, 39.0, 59.0, 59.0, 42.0, 59.0, 59.0, 66.0, 58.0, 85.0, 77.0, 88.0, 99.0, 111.0, 117.0, 121.0, 116.0, 162.0, 202.0, 216.0, 233.0, 273.0, 342.0, 353.0, 504.0, 651.0, 822.0, 1304.0, 2140.0, 5099.0], [153.0, 70.0, 51.0, 34.0, 30.0, 36.0, 20.0, 30.0, 21.0, 37.0, 44.0, 38.0, 28.0, 27.0, 21.0, 26.0, 31.0, 20.0, 29.0, 22.0, 25.0, 17.0, 29.0, 22.0, 18.0, 26.0, 35.0, 26.0, 40.0, 33.0, 40.0, 46.0, 37.0, 59.0, 63.0, 62.0, 63.0, 93.0, 94.0, 116.0, 142.0, 150.0, 190.0, 264.0, 309.0, 430.0, 611.0, 1089.0, 2858.0], [168.0, 79.0, 41.0, 29.0, 29.0, 26.0, 19.0, 18.0, 36.0, 33.0, 30.0, 20.0, 34.0, 22.0, 23.0, 20.0, 28.0, 24.0, 19.0, 23.0, 20.0, 16.0, 15.0, 9.0, 11.0, 15.0, 18.0, 15.0, 21.0, 11.0, 20.0, 21.0, 23.0, 35.0, 28.0, 31.0, 24.0, 38.0, 43.0, 44.0, 53.0, 83.0, 104.0, 122.0, 146.0, 220.0, 337.0, 593.0, 1571.0], [272.0, 69.0, 48.0, 28.0, 18.0, 14.0, 23.0, 19.0, 19.0, 19.0, 26.0, 23.0, 24.0, 29.0, 23.0, 30.0, 23.0, 22.0, 20.0, 16.0, 17.0, 23.0, 9.0, 10.0, 13.0, 20.0, 13.0, 11.0, 9.0, 6.0, 13.0, 14.0, 11.0, 12.0, 8.0, 22.0, 14.0, 13.0, 25.0, 28.0, 25.0, 27.0, 44.0, 58.0, 73.0, 98.0, 174.0, 311.0, 857.0], [372.0, 108.0, 39.0, 38.0, 36.0, 13.0, 20.0, 20.0, 21.0, 27.0, 20.0, 24.0, 25.0, 12.0, 18.0, 16.0, 20.0, 19.0, 13.0, 11.0, 12.0, 15.0, 21.0, 9.0, 8.0, 6.0, 8.0, 15.0, 9.0, 12.0, 9.0, 11.0, 9.0, 9.0, 10.0, 10.0, 11.0, 8.0, 12.0, 12.0, 17.0, 21.0, 26.0, 32.0, 46.0, 51.0, 90.0, 166.0, 458.0], [754.0, 187.0, 98.0, 46.0, 26.0, 23.0, 17.0, 22.0, 26.0, 19.0, 22.0, 24.0, 25.0, 19.0, 11.0, 18.0, 16.0, 13.0, 12.0, 13.0, 9.0, 11.0, 9.0, 5.0, 8.0, 8.0, 8.0, 7.0, 6.0, 10.0, 10.0, 9.0, 9.0, 6.0, 10.0, 11.0, 11.0, 7.0, 13.0, 10.0, 8.0, 20.0, 19.0, 20.0, 17.0, 28.0, 54.0, 83.0, 254.0], [1223.0, 384.0, 178.0, 99.0, 52.0, 42.0, 32.0, 31.0, 21.0, 28.0, 18.0, 20.0, 16.0, 22.0, 26.0, 16.0, 19.0, 6.0, 11.0, 11.0, 15.0, 5.0, 7.0, 7.0, 8.0, 4.0, 5.0, 4.0, 6.0, 6.0, 5.0, 7.0, 3.0, 4.0, 5.0, 3.0, 8.0, 9.0, 6.0, 7.0, 6.0, 8.0, 14.0, 16.0, 23.0, 15.0, 35.0, 50.0, 166.0], [1805.0, 753.0, 354.0, 230.0, 129.0, 100.0, 69.0, 59.0, 32.0, 36.0, 35.0, 21.0, 24.0, 23.0, 21.0, 19.0, 12.0, 16.0, 14.0, 11.0, 10.0, 8.0, 9.0, 2.0, 5.0, 3.0, 3.0, 8.0, 1.0, 0.0, 1.0, 4.0, 2.0, 6.0, 7.0, 2.0, 5.0, 6.0, 0.0, 7.0, 8.0, 9.0, 8.0, 7.0, 11.0, 17.0, 34.0, 36.0, 94.0], [2549.0, 1124.0, 615.0, 429.0, 257.0, 201.0, 110.0, 109.0, 94.0, 61.0, 48.0, 44.0, 38.0, 46.0, 32.0, 26.0, 18.0, 29.0, 21.0, 10.0, 17.0, 17.0, 12.0, 12.0, 3.0, 3.0, 3.0, 8.0, 1.0, 4.0, 2.0, 1.0, 3.0, 4.0, 3.0, 5.0, 1.0, 4.0, 1.0, 6.0, 1.0, 5.0, 7.0, 6.0, 5.0, 13.0, 13.0, 21.0, 56.0], [3215.0, 1612.0, 1022.0, 644.0, 436.0, 385.0, 260.0, 242.0, 181.0, 152.0, 117.0, 98.0, 81.0, 84.0, 64.0, 49.0, 40.0, 28.0, 34.0, 32.0, 16.0, 22.0, 18.0, 16.0, 11.0, 11.0, 6.0, 10.0, 7.0, 14.0, 6.0, 5.0, 3.0, 5.0, 3.0, 6.0, 4.0, 1.0, 3.0, 7.0, 5.0, 5.0, 2.0, 5.0, 5.0, 3.0, 9.0, 13.0, 45.0], [3431.0, 2016.0, 1346.0, 1001.0, 685.0, 580.0, 453.0, 386.0, 267.0, 246.0, 239.0, 186.0, 146.0, 140.0, 104.0, 99.0, 88.0, 84.0, 66.0, 55.0, 50.0, 37.0, 30.0, 22.0, 25.0, 19.0, 20.0, 22.0, 22.0, 16.0, 17.0, 10.0, 10.0, 9.0, 7.0, 7.0, 6.0, 7.0, 4.0, 1.0, 4.0, 3.0, 10.0, 8.0, 8.0, 2.0, 6.0, 14.0, 25.0], [3491.0, 2332.0, 1702.0, 1261.0, 1022.0, 843.0, 684.0, 540.0, 488.0, 428.0, 365.0, 303.0, 260.0, 243.0, 190.0, 209.0, 172.0, 145.0, 141.0, 133.0, 110.0, 93.0, 74.0, 85.0, 69.0, 55.0, 47.0, 41.0, 35.0, 38.0, 26.0, 33.0, 29.0, 25.0, 16.0, 13.0, 13.0, 24.0, 8.0, 6.0, 9.0, 9.0, 9.0, 9.0, 11.0, 15.0, 8.0, 10.0, 25.0], [3125.0, 2152.0, 1765.0, 1405.0, 1261.0, 1008.0, 868.0, 816.0, 642.0, 595.0, 522.0, 480.0, 379.0, 412.0, 356.0, 329.0, 261.0, 266.0, 265.0, 209.0, 212.0, 173.0, 167.0, 156.0, 155.0, 104.0, 100.0, 125.0, 101.0, 97.0, 83.0, 74.0, 59.0, 62.0, 41.0, 48.0, 43.0, 37.0, 32.0, 26.0, 33.0, 21.0, 27.0, 14.0, 21.0, 18.0, 18.0, 22.0, 16.0], [2232.0, 1789.0, 1602.0, 1392.0, 1203.0, 1126.0, 1000.0, 918.0, 861.0, 720.0, 712.0, 626.0, 595.0, 524.0, 517.0, 486.0, 453.0, 423.0, 411.0, 316.0, 334.0, 285.0, 302.0, 247.0, 253.0, 214.0, 208.0, 185.0, 183.0, 182.0, 156.0, 163.0, 140.0, 124.0, 118.0, 111.0, 117.0, 96.0, 85.0, 75.0, 64.0, 63.0, 55.0, 56.0, 51.0, 39.0, 36.0, 46.0, 44.0], [1375.0, 1170.0, 1164.0, 1079.0, 1031.0, 969.0, 939.0, 831.0, 830.0, 851.0, 758.0, 772.0, 745.0, 641.0, 619.0, 586.0, 586.0, 540.0, 509.0, 519.0, 496.0, 439.0, 426.0, 434.0, 374.0, 331.0, 337.0, 329.0, 320.0, 270.0, 292.0, 254.0, 225.0, 244.0, 236.0, 213.0, 204.0, 209.0, 186.0, 176.0, 146.0, 144.0, 139.0, 137.0, 127.0, 106.0, 93.0, 88.0, 86.0], [668.0, 718.0, 712.0, 688.0, 719.0, 743.0, 697.0, 695.0, 704.0, 688.0, 685.0, 668.0, 719.0, 687.0, 630.0, 633.0, 627.0, 570.0, 602.0, 565.0, 540.0, 569.0, 540.0, 528.0, 520.0, 516.0, 436.0, 441.0, 451.0, 425.0, 429.0, 372.0, 420.0, 403.0, 349.0, 357.0, 372.0, 340.0, 326.0, 297.0, 284.0, 281.0, 266.0, 283.0, 253.0, 206.0, 208.0, 200.0, 182.0], [383.0, 358.0, 367.0, 378.0, 409.0, 449.0, 457.0, 428.0, 471.0, 485.0, 511.0, 541.0, 545.0, 520.0, 509.0, 582.0, 507.0, 548.0, 534.0, 503.0, 552.0, 538.0, 567.0, 533.0, 547.0, 580.0, 535.0, 599.0, 537.0, 591.0, 553.0, 532.0, 518.0, 546.0, 508.0, 490.0, 491.0, 498.0, 501.0, 479.0, 499.0, 441.0, 476.0, 454.0, 448.0, 434.0, 443.0, 432.0, 459.0], [217.0, 168.0, 153.0, 161.0, 200.0, 202.0, 250.0, 252.0, 241.0, 305.0, 299.0, 352.0, 343.0, 377.0, 370.0, 361.0, 378.0, 411.0, 407.0, 420.0, 457.0, 449.0, 437.0, 458.0, 487.0, 543.0, 521.0, 547.0, 570.0, 562.0, 646.0, 573.0, 586.0, 606.0, 605.0, 631.0, 589.0, 600.0, 681.0, 679.0, 669.0, 682.0, 696.0, 677.0, 726.0, 743.0, 763.0, 800.0, 853.0], [159.0, 97.0, 61.0, 81.0, 85.0, 87.0, 112.0, 136.0, 140.0, 130.0, 192.0, 177.0, 195.0, 202.0, 223.0, 192.0, 238.0, 260.0, 284.0, 295.0, 304.0, 308.0, 312.0, 346.0, 395.0, 386.0, 411.0, 432.0, 445.0, 503.0, 482.0, 503.0, 515.0, 560.0, 572.0, 605.0, 602.0, 703.0, 737.0, 738.0, 789.0, 832.0, 870.0, 907.0, 906.0, 1025.0, 1162.0, 1265.0, 1488.0], [113.0, 57.0, 51.0, 51.0, 38.0, 62.0, 54.0, 73.0, 58.0, 123.0, 83.0, 94.0, 92.0, 123.0, 105.0, 126.0, 121.0, 137.0, 139.0, 146.0, 153.0, 171.0, 197.0, 175.0, 191.0, 242.0, 265.0, 254.0, 304.0, 319.0, 347.0, 357.0, 345.0, 409.0, 449.0, 486.0, 534.0, 573.0, 615.0, 682.0, 745.0, 774.0, 915.0, 1020.0, 1095.0, 1364.0, 1459.0, 1683.0, 2258.0], [133.0, 69.0, 61.0, 62.0, 49.0, 33.0, 31.0, 24.0, 30.0, 43.0, 65.0, 46.0, 31.0, 52.0, 53.0, 46.0, 63.0, 79.0, 67.0, 62.0, 74.0, 99.0, 106.0, 109.0, 118.0, 121.0, 125.0, 167.0, 170.0, 180.0, 197.0, 246.0, 233.0, 236.0, 269.0, 308.0, 365.0, 446.0, 457.0, 496.0, 597.0, 665.0, 744.0, 898.0, 1093.0, 1275.0, 1592.0, 1986.0, 2955.0], [95.0, 49.0, 35.0, 46.0, 65.0, 31.0, 51.0, 56.0, 23.0, 27.0, 28.0, 26.0, 27.0, 26.0, 39.0, 38.0, 29.0, 45.0, 36.0, 35.0, 37.0, 29.0, 31.0, 38.0, 45.0, 63.0, 76.0, 64.0, 83.0, 85.0, 83.0, 132.0, 131.0, 143.0, 153.0, 170.0, 241.0, 218.0, 250.0, 369.0, 407.0, 442.0, 549.0, 600.0, 829.0, 1043.0, 1444.0, 2059.0, 3296.0], [102.0, 42.0, 32.0, 24.0, 16.0, 13.0, 41.0, 12.0, 22.0, 40.0, 30.0, 20.0, 29.0, 25.0, 17.0, 29.0, 24.0, 24.0, 18.0, 18.0, 15.0, 23.0, 32.0, 22.0, 29.0, 25.0, 31.0, 27.0, 45.0, 47.0, 52.0, 51.0, 52.0, 78.0, 81.0, 139.0, 102.0, 125.0, 173.0, 166.0, 236.0, 296.0, 323.0, 406.0, 528.0, 732.0, 1088.0, 1607.0, 3164.0], [112.0, 57.0, 51.0, 25.0, 16.0, 36.0, 7.0, 12.0, 21.0, 17.0, 16.0, 21.0, 32.0, 32.0, 51.0, 11.0, 20.0, 39.0, 30.0, 15.0, 13.0, 23.0, 11.0, 10.0, 11.0, 10.0, 9.0, 23.0, 36.0, 20.0, 23.0, 26.0, 20.0, 20.0, 40.0, 24.0, 45.0, 51.0, 66.0, 83.0, 102.0, 129.0, 177.0, 238.0, 326.0, 497.0, 712.0, 1218.0, 2521.0], [118.0, 44.0, 33.0, 31.0, 36.0, 28.0, 16.0, 30.0, 31.0, 12.0, 5.0, 19.0, 18.0, 19.0, 20.0, 10.0, 20.0, 35.0, 45.0, 10.0, 4.0, 29.0, 5.0, 6.0, 2.0, 7.0, 2.0, 2.0, 4.0, 2.0, 5.0, 4.0, 15.0, 5.0, 33.0, 24.0, 16.0, 15.0, 54.0, 38.0, 41.0, 60.0, 84.0, 133.0, 163.0, 258.0, 483.0, 789.0, 1786.0], [92.0, 36.0, 30.0, 21.0, 24.0, 11.0, 15.0, 46.0, 43.0, 49.0, 35.0, 15.0, 45.0, 45.0, 13.0, 30.0, 27.0, 15.0, 32.0, 8.0, 6.0, 8.0, 16.0, 33.0, 12.0, 3.0, 4.0, 5.0, 5.0, 24.0, 5.0, 4.0, 18.0, 8.0, 3.0, 3.0, 5.0, 25.0, 38.0, 9.0, 20.0, 13.0, 25.0, 50.0, 87.0, 133.0, 202.0, 420.0, 1145.0], [98.0, 70.0, 43.0, 26.0, 15.0, 14.0, 42.0, 26.0, 32.0, 16.0, 14.0, 13.0, 13.0, 35.0, 11.0, 18.0, 14.0, 20.0, 8.0, 9.0, 11.0, 14.0, 30.0, 4.0, 5.0, 11.0, 26.0, 19.0, 3.0, 17.0, 9.0, 0.0, 3.0, 1.0, 18.0, 8.0, 3.0, 27.0, 2.0, 3.0, 28.0, 11.0, 25.0, 12.0, 45.0, 52.0, 88.0, 233.0, 714.0], [112.0, 52.0, 25.0, 15.0, 14.0, 17.0, 19.0, 29.0, 16.0, 19.0, 17.0, 8.0, 13.0, 18.0, 28.0, 31.0, 15.0, 18.0, 25.0, 14.0, 6.0, 13.0, 10.0, 18.0, 18.0, 4.0, 1.0, 2.0, 3.0, 3.0, 3.0, 0.0, 1.0, 18.0, 5.0, 5.0, 20.0, 2.0, 0.0, 1.0, 1.0, 23.0, 34.0, 7.0, 8.0, 22.0, 33.0, 124.0, 346.0], [100.0, 54.0, 31.0, 27.0, 15.0, 38.0, 13.0, 35.0, 13.0, 19.0, 18.0, 16.0, 15.0, 11.0, 22.0, 40.0, 12.0, 11.0, 40.0, 26.0, 11.0, 11.0, 6.0, 8.0, 2.0, 17.0, 13.0, 2.0, 0.0, 1.0, 13.0, 12.0, 1.0, 1.0, 0.0, 0.0, 1.0, 1.0, 1.0, 0.0, 3.0, 4.0, 5.0, 3.0, 13.0, 21.0, 25.0, 37.0, 168.0], [93.0, 38.0, 32.0, 30.0, 11.0, 22.0, 33.0, 10.0, 14.0, 12.0, 9.0, 19.0, 13.0, 17.0, 12.0, 24.0, 13.0, 8.0, 13.0, 14.0, 12.0, 8.0, 6.0, 5.0, 4.0, 3.0, 2.0, 4.0, 2.0, 2.0, 2.0, 2.0, 0.0, 2.0, 0.0, 0.0, 2.0, 24.0, 1.0, 1.0, 1.0, 0.0, 2.0, 1.0, 1.0, 0.0, 11.0, 17.0, 77.0], [98.0, 36.0, 31.0, 31.0, 19.0, 16.0, 7.0, 16.0, 12.0, 15.0, 11.0, 17.0, 28.0, 26.0, 16.0, 12.0, 15.0, 10.0, 12.0, 10.0, 13.0, 10.0, 5.0, 10.0, 4.0, 3.0, 24.0, 6.0, 0.0, 1.0, 2.0, 0.0, 2.0, 2.0, 0.0, 2.0, 2.0, 1.0, 0.0, 1.0, 0.0, 4.0, 0.0, 0.0, 4.0, 0.0, 2.0, 7.0, 37.0], [102.0, 73.0, 42.0, 17.0, 19.0, 11.0, 12.0, 14.0, 18.0, 16.0, 13.0, 13.0, 14.0, 21.0, 17.0, 19.0, 13.0, 17.0, 8.0, 8.0, 10.0, 8.0, 5.0, 4.0, 1.0, 4.0, 2.0, 2.0, 2.0, 2.0, 2.0, 1.0, 1.0, 1.0, 1.0, 1.0, 1.0, 2.0, 1.0, 2.0, 0.0, 1.0, 2.0, 23.0, 0.0, 2.0, 1.0, 5.0, 17.0], [121.0, 42.0, 30.0, 16.0, 16.0, 7.0, 9.0, 16.0, 25.0, 20.0, 14.0, 25.0, 9.0, 8.0, 8.0, 10.0, 12.0, 16.0, 12.0, 19.0, 27.0, 10.0, 5.0, 4.0, 5.0, 2.0, 6.0, 0.0, 3.0, 3.0, 3.0, 3.0, 1.0, 0.0, 1.0, 0.0, 4.0, 1.0, 1.0, 2.0, 1.0, 1.0, 0.0, 1.0, 0.0, 2.0, 3.0, 1.0, 6.0], [99.0, 41.0, 29.0, 23.0, 13.0, 16.0, 21.0, 11.0, 10.0, 15.0, 10.0, 16.0, 10.0, 25.0, 20.0, 20.0, 11.0, 11.0, 11.0, 11.0, 3.0, 9.0, 8.0, 6.0, 2.0, 7.0, 1.0, 1.0, 4.0, 4.0, 1.0, 0.0, 2.0, 2.0, 0.0, 1.0, 2.0, 1.0, 0.0, 24.0, 0.0, 1.0, 0.0, 1.0, 1.0, 0.0, 0.0, 4.0, 12.0], [93.0, 43.0, 30.0, 41.0, 14.0, 14.0, 21.0, 8.0, 11.0, 14.0, 16.0, 24.0, 14.0, 13.0, 10.0, 15.0, 12.0, 12.0, 15.0, 7.0, 10.0, 8.0, 6.0, 8.0, 26.0, 3.0, 2.0, 4.0, 3.0, 2.0, 14.0, 13.0, 0.0, 1.0, 2.0, 4.0, 1.0, 0.0, 0.0, 0.0, 1.0, 1.0, 1.0, 1.0, 0.0, 1.0, 1.0, 0.0, 7.0], [112.0, 44.0, 30.0, 26.0, 17.0, 17.0, 29.0, 18.0, 16.0, 16.0, 13.0, 15.0, 20.0, 7.0, 8.0, 12.0, 15.0, 11.0, 14.0, 10.0, 8.0, 9.0, 2.0, 10.0, 9.0, 1.0, 7.0, 1.0, 2.0, 1.0, 0.0, 3.0, 1.0, 2.0, 1.0, 1.0, 0.0, 25.0, 0.0, 1.0, 1.0, 3.0, 0.0, 0.0, 0.0, 0.0, 2.0, 3.0, 2.0], [96.0, 49.0, 28.0, 12.0, 15.0, 15.0, 7.0, 19.0, 19.0, 16.0, 16.0, 13.0, 18.0, 18.0, 10.0, 13.0, 9.0, 14.0, 7.0, 12.0, 13.0, 7.0, 10.0, 32.0, 4.0, 5.0, 2.0, 2.0, 4.0, 4.0, 0.0, 1.0, 0.0, 1.0, 2.0, 0.0, 2.0, 2.0, 0.0, 0.0, 2.0, 1.0, 0.0, 0.0, 3.0, 2.0, 0.0, 2.0, 2.0], [112.0, 47.0, 22.0, 16.0, 21.0, 14.0, 11.0, 14.0, 18.0, 16.0, 12.0, 15.0, 15.0, 13.0, 20.0, 14.0, 7.0, 13.0, 16.0, 7.0, 8.0, 8.0, 6.0, 11.0, 5.0, 3.0, 5.0, 3.0, 2.0, 0.0, 1.0, 0.0, 2.0, 2.0, 0.0, 4.0, 1.0, 0.0, 1.0, 1.0, 1.0, 0.0, 0.0, 4.0, 1.0, 0.0, 3.0, 1.0, 2.0], [109.0, 46.0, 20.0, 25.0, 20.0, 13.0, 12.0, 13.0, 13.0, 11.0, 22.0, 16.0, 19.0, 17.0, 21.0, 18.0, 12.0, 6.0, 11.0, 8.0, 7.0, 11.0, 6.0, 6.0, 5.0, 4.0, 5.0, 2.0, 4.0, 2.0, 5.0, 0.0, 0.0, 0.0, 0.0, 2.0, 1.0, 2.0, 1.0, 1.0, 1.0, 0.0, 1.0, 0.0, 0.0, 1.0, 0.0, 2.0, 1.0], [100.0, 52.0, 30.0, 19.0, 15.0, 19.0, 15.0, 16.0, 7.0, 12.0, 15.0, 16.0, 16.0, 15.0, 15.0, 11.0, 14.0, 11.0, 7.0, 11.0, 8.0, 13.0, 6.0, 2.0, 6.0, 7.0, 1.0, 5.0, 7.0, 3.0, 2.0, 2.0, 3.0, 1.0, 1.0, 0.0, 1.0, 0.0, 0.0, 0.0, 1.0, 0.0, 1.0, 0.0, 0.0, 2.0, 2.0, 3.0, 3.0]],
    "Name": "sCurve-0",
    "Overflow": 2560670.0,
    "Type": "Histo2d",
    "Underflow": 0.0,
    "x": {
        "AxisTitle": "Vcal",
        "Bins": 51,
        "High": 302.5,
        "Low": 47.5
    },
    "y": {
        "AxisTitle": "Occupancy",
        "Bins": 49,
        "High": 49.5,
        "Low": 0.5
    },
    "z": {
        "AxisTitle": "Number of pixels"
    }
}