{
    "Data": [0.0, 0.0, 0.0, 0.0, 0.0, 0.0, 0.0, 0.0, 0.0, 0.0, 0.0, 0.0, 0.0, 0.0, 2.0, 0.0, 1.0, 0.0, 0.0, 1.0, 0.0, 0.0, 0.0, 0.0, 1.0, 2.0, 4.0, 6.0, 11.0, 6.0, 14.0, 19.0, 9.0, 11.0, 22.0, 37.0, 36.0, 173.0, 425.0, 431.0, 309.0, 579.0, 1479.0, 2990.0, 2217.0, 1406.0, 1962.0, 3045.0, 3758.0, 2840.0, 2316.0, 2159.0, 2691.0, 2138.0, 1757.0, 1592.0, 1506.0, 1682.0, 1434.0, 1327.0, 1116.0, 1040.0, 893.0, 695.0, 579.0, 544.0, 633.0, 498.0, 415.0, 374.0, 372.0, 390.0, 269.0, 246.0, 235.0, 225.0, 222.0, 182.0, 182.0, 150.0, 157.0, 141.0, 129.0, 106.0, 104.0, 106.0, 92.0, 79.0, 76.0, 68.0, 52.0, 51.0, 41.0, 48.0, 56.0, 35.0, 48.0, 30.0, 32.0, 32.0, 36.0, 23.0, 23.0, 32.0, 26.0, 22.0, 28.0, 19.0, 26.0, 21.0, 14.0, 16.0, 11.0, 12.0, 13.0, 10.0, 18.0, 21.0, 7.0, 13.0, 8.0, 2.0, 5.0, 8.0, 10.0, 7.0, 7.0, 14.0, 9.0, 6.0, 7.0, 5.0, 5.0, 3.0, 5.0, 5.0, 4.0, 5.0, 4.0, 1.0, 7.0, 3.0, 7.0, 5.0, 3.0, 3.0, 3.0, 2.0, 4.0, 5.0, 4.0, 0.0, 0.0, 4.0, 0.0, 0.0, 2.0, 4.0, 2.0, 1.0, 2.0, 1.0, 2.0, 0.0, 2.0, 0.0, 2.0, 0.0, 1.0, 0.0, 1.0, 1.0, 0.0, 3.0, 1.0, 0.0, 2.0, 4.0, 0.0, 2.0, 1.0, 0.0, 0.0, 1.0, 0.0, 0.0, 0.0, 0.0, 1.0, 1.0, 2.0, 2.0, 1.0, 0.0, 5.0, 3.0, 3.0, 3.0, 0.0, 4.0, 0.0],
    "Name": "TimePerFitDist-0",
    "Overflow": 237.0,
    "Type": "Histo1d",
    "Underflow": 0.0,
    "x": {
        "AxisTitle": "Fit Time [us]",
        "Bins": 201,
        "High": 401.0,
        "Low": -1.0
    },
    "y": {
        "AxisTitle": "Number of Pixels"
    },
    "z": {
        "AxisTitle": "z"
    }
}