{
    "Data": [0.0, 0.0, 0.0, 0.0, 0.0, 0.0, 0.0, 0.0, 0.0, 0.0, 0.0, 0.0, 0.0, 0.0, 0.0, 0.0, 0.0, 0.0, 0.0, 0.0, 0.0, 0.0, 0.0, 0.0, 0.0, 0.0, 0.0, 0.0, 0.0, 0.0, 0.0, 0.0, 0.0, 0.0, 0.0, 0.0, 0.0, 0.0, 0.0, 0.0, 0.0, 0.0, 0.0, 0.0, 0.0, 0.0, 0.0, 0.0, 0.0, 0.0, 1.0, 3.0, 1.0, 3.0, 8.0, 6.0, 8.0, 11.0, 5.0, 11.0, 7.0, 11.0, 9.0, 4.0, 14.0, 10.0, 7.0, 5.0, 10.0, 6.0, 8.0, 10.0, 13.0, 14.0, 25.0, 24.0, 33.0, 33.0, 45.0, 69.0, 72.0, 123.0, 118.0, 143.0, 196.0, 246.0, 299.0, 356.0, 459.0, 723.0, 1097.0, 1816.0, 2859.0, 3805.0, 4744.0, 5230.0, 5388.0, 4807.0, 4210.0, 3234.0, 2432.0, 1779.0, 1237.0, 906.0, 701.0, 596.0, 424.0, 331.0, 305.0, 220.0, 233.0, 148.0, 107.0, 97.0, 68.0, 47.0, 39.0, 34.0, 41.0, 22.0, 21.0, 28.0, 22.0, 31.0, 20.0, 30.0, 31.0, 11.0, 20.0, 22.0, 13.0, 14.0, 17.0, 15.0, 17.0, 11.0, 11.0, 12.0, 14.0, 9.0, 11.0, 7.0, 11.0, 7.0, 7.0, 7.0, 6.0, 10.0, 8.0, 9.0, 2.0, 7.0, 4.0, 3.0, 10.0, 4.0, 3.0, 7.0, 7.0, 4.0, 7.0, 7.0, 13.0, 16.0, 13.0, 24.0, 18.0, 28.0, 46.0, 54.0, 58.0, 70.0, 79.0, 116.0, 139.0, 156.0, 161.0, 209.0, 259.0, 295.0, 302.0, 332.0, 356.0, 432.0, 475.0, 544.0, 527.0, 646.0, 642.0, 623.0, 659.0, 693.0, 717.0, 774.0, 743.0, 745.0, 749.0, 757.0, 698.0, 756.0, 741.0, 643.0, 691.0, 605.0, 593.0, 567.0, 532.0, 506.0, 474.0, 398.0, 403.0, 346.0, 354.0, 309.0, 244.0, 287.0, 213.0, 200.0, 168.0, 171.0, 139.0, 123.0, 89.0, 108.0, 87.0, 66.0, 60.0, 51.0, 50.0, 26.0, 37.0, 25.0, 22.0, 27.0, 13.0, 12.0, 14.0, 9.0, 10.0, 8.0, 6.0, 3.0, 4.0, 6.0, 2.0, 3.0, 1.0, 1.0, 0.0, 0.0, 0.0, 0.0, 0.0, 1.0, 3.0, 0.0, 1.0, 1.0, 0.0, 0.0, 1.0, 0.0, 0.0, 2.0, 0.0, 0.0, 0.0, 0.0, 0.0, 1.0, 1.0, 0.0, 0.0, 0.0, 1.0, 0.0, 0.0, 0.0, 0.0, 0.0, 0.0, 0.0, 1.0, 1.0, 1.0, 0.0, 1.0, 0.0, 0.0, 0.0, 0.0, 0.0, 1.0, 0.0, 0.0, 1.0, 0.0, 1.0, 0.0, 1.0, 0.0, 0.0, 0.0, 0.0, 0.0, 0.0, 0.0, 0.0, 1.0, 0.0, 0.0, 0.0, 0.0, 0.0, 0.0, 0.0, 0.0, 0.0, 0.0, 0.0, 0.0, 0.0, 0.0, 2.0, 0.0, 0.0, 0.0, 0.0, 0.0, 0.0, 0.0, 0.0, 0.0, 0.0, 0.0, 0.0, 0.0, 0.0, 0.0, 0.0, 0.0, 0.0, 0.0, 0.0, 0.0, 0.0, 0.0, 0.0, 0.0, 0.0, 0.0, 0.0, 0.0, 0.0, 0.0, 0.0, 0.0, 0.0, 0.0, 0.0, 0.0, 0.0, 0.0, 0.0],
    "Name": "ThresholdDist-0",
    "Overflow": 0.0,
    "Type": "Histo1d",
    "Underflow": 0.0,
    "x": {
        "AxisTitle": "Threshold [e]",
        "Bins": 364,
        "High": 3635.0,
        "Low": -5.0
    },
    "y": {
        "AxisTitle": "Number of Pixels"
    },
    "z": {
        "AxisTitle": "z"
    }
}