time,Hardware,Voltage,Current
1621633448567,high-voltage,1,0.0606497
time,Hardware,Voltage,Current
1621633448567,high-voltage,2,0.113043
time,Hardware,Voltage,Current
1621633448567,high-voltage,3,0.194747
time,Hardware,Voltage,Current
1621633448567,high-voltage,4,0.284589
time,Hardware,Voltage,Current
1621633448567,high-voltage,5,0.413807
time,Hardware,Voltage,Current
1621633448567,high-voltage,6,0.522742
time,Hardware,Voltage,Current
1621633448567,high-voltage,7,0.76327
time,Hardware,Voltage,Current
1621633448567,high-voltage,8,0.99415
time,Hardware,Voltage,Current
1621633448567,high-voltage,9,1.30614
time,Hardware,Voltage,Current
1621633448567,high-voltage,10,1.68546
time,Hardware,Voltage,Current
1621633448567,high-voltage,11,2.13742
time,Hardware,Voltage,Current
1621633448567,high-voltage,2.78714e-06,2.78374
time,Hardware,Voltage,Current
1621633448567,high-voltage,13,3.42731
time,Hardware,Voltage,Current
1621633448567,high-voltage,14,4.06926
time,Hardware,Voltage,Current
1621633448567,high-voltage,15,5.14605
time,Hardware,Voltage,Current
1621633448567,high-voltage,16,6.21862
time,Hardware,Voltage,Current
1621633448567,high-voltage,17,7.43773
time,Hardware,Voltage,Current
1621633448567,high-voltage,18,8.57028
time,Hardware,Voltage,Current
1621633448567,high-voltage,19,9.50034
time,Hardware,Voltage,Current
1621633448567,high-voltage,20,9.69851
time,Hardware,Voltage,Current
1621633448567,high-voltage,25,10.0001
