{
    "Data": [24.0, 37.0, 3.0, 12.0, 10.0, 12.0, 48.0, 142.0, 448.0, 1246.0, 2597.0, 4116.0, 4905.0, 5058.0, 4302.0, 3937.0, 4251.0, 4988.0, 5233.0, 4932.0, 3812.0, 2882.0, 2209.0, 1807.0, 1782.0, 1670.0, 1788.0, 1698.0, 1697.0, 1535.0, 1436.0, 1263.0, 1171.0, 957.0, 782.0, 659.0, 530.0, 432.0, 314.0, 278.0, 182.0, 143.0, 135.0, 112.0, 88.0, 64.0, 46.0, 48.0, 36.0, 39.0, 23.0, 25.0, 28.0, 24.0, 21.0, 19.0, 12.0, 13.0, 13.0, 8.0],
    "Name": "NoiseDist-0",
    "Overflow": 172.0,
    "Type": "Histo1d",
    "Underflow": 0.0,
    "x": {
        "AxisTitle": "Noise [e]",
        "Bins": 60,
        "High": 301.0,
        "Low": -2.0
    },
    "y": {
        "AxisTitle": "Number of Pixels"
    },
    "z": {
        "AxisTitle": "z"
    }
}