{
    "Data": [0.0, 0.0, 0.0, 0.0, 0.0, 0.0, 0.0, 0.0, 0.0, 0.0, 0.0, 0.0, 0.0, 2.0, 47.0, 24.0, 4.0, 94.0, 466.0, 219.0, 49.0, 499.0, 3438.0, 2666.0, 477.0, 1076.0, 3449.0, 3656.0, 877.0, 953.0, 2202.0, 3243.0, 1472.0, 678.0, 1097.0, 1973.0, 1495.0, 611.0, 1248.0, 2210.0, 2074.0, 975.0, 1079.0, 2336.0, 2242.0, 1333.0, 1082.0, 1732.0, 2385.0, 1722.0, 983.0, 991.0, 1294.0, 1182.0, 826.0, 671.0, 862.0, 996.0, 738.0, 529.0, 483.0, 578.0, 555.0, 447.0, 333.0, 351.0, 478.0, 385.0, 300.0, 259.0, 255.0, 282.0, 232.0, 174.0, 147.0, 184.0, 141.0, 135.0, 124.0, 94.0, 120.0, 106.0, 79.0, 59.0, 61.0, 54.0, 45.0, 37.0, 32.0, 50.0, 31.0, 37.0, 28.0, 20.0, 24.0, 16.0, 10.0, 15.0, 16.0, 11.0, 14.0, 9.0, 9.0, 13.0, 5.0, 10.0, 6.0, 4.0, 4.0, 7.0, 6.0, 5.0, 6.0, 2.0, 4.0, 1.0, 2.0, 2.0, 3.0, 2.0, 3.0, 4.0, 2.0, 3.0, 0.0, 2.0, 1.0, 2.0, 0.0, 0.0, 1.0, 2.0, 1.0, 1.0, 1.0, 3.0, 0.0, 1.0, 1.0, 1.0, 4.0, 1.0, 1.0, 0.0, 0.0, 2.0, 0.0, 1.0, 0.0, 1.0, 1.0, 0.0, 0.0, 0.0, 0.0, 0.0, 0.0, 0.0, 1.0, 0.0, 0.0, 0.0, 0.0, 0.0, 0.0, 0.0, 3.0, 0.0, 0.0, 0.0, 0.0, 2.0, 0.0, 0.0, 0.0, 1.0, 0.0, 1.0, 0.0, 0.0, 0.0, 1.0, 0.0, 0.0, 0.0, 0.0, 0.0, 0.0, 0.0, 0.0, 1.0, 0.0, 0.0, 0.0, 0.0, 0.0, 0.0, 0.0, 0.0, 0.0, 0.0],
    "Name": "TimePerFitDist-0",
    "Overflow": 107.0,
    "Type": "Histo1d",
    "Underflow": 0.0,
    "x": {
        "AxisTitle": "Fit Time [us]",
        "Bins": 201,
        "High": 401.0,
        "Low": -1.0
    },
    "y": {
        "AxisTitle": "Number of Pixels"
    },
    "z": {
        "AxisTitle": "z"
    }
}