{
    "Data": [3.0, 7.0, 9.0, 5.0, 2.0, 9.0, 4.0, 9.0, 5.0, 13.0, 3.0, 10.0, 5.0, 12.0, 17.0, 12.0, 17.0, 27.0, 27.0, 33.0, 34.0, 38.0, 63.0, 48.0, 69.0, 82.0, 103.0, 120.0, 115.0, 153.0, 217.0, 250.0, 341.0, 338.0, 415.0, 480.0, 602.0, 760.0, 1067.0, 1570.0, 2275.0, 3172.0, 3862.0, 4228.0, 4225.0, 4036.0, 3566.0, 3098.0, 2418.0, 1920.0, 1611.0, 1340.0, 1127.0, 994.0, 898.0, 847.0, 721.0, 626.0, 540.0, 503.0, 377.0, 344.0, 333.0, 230.0, 193.0, 163.0, 148.0, 107.0, 95.0, 89.0, 68.0, 61.0, 56.0, 40.0, 47.0, 37.0, 41.0, 19.0, 33.0, 26.0, 25.0, 24.0, 16.0, 17.0, 15.0, 23.0, 14.0, 16.0, 17.0, 18.0, 9.0],
    "Name": "ThresholdDist-0",
    "Overflow": 262.0,
    "Type": "Histo1d",
    "Underflow": 0.0,
    "x": {
        "AxisTitle": "Threshold [e]",
        "Bins": 91,
        "High": 1405.0,
        "Low": 495.0
    },
    "y": {
        "AxisTitle": "Number of Pixels"
    },
    "z": {
        "AxisTitle": "z"
    }
}