time,Hardware,Voltage,Current
1626721982859,high-voltage-2,1,0.249371
time,Hardware,Voltage,Current
1626721982859,high-voltage-2,2,0.312202
time,Hardware,Voltage,Current
1626721982859,high-voltage-2,3,0.343406
time,Hardware,Voltage,Current
1626721982859,high-voltage-2,4,0.373509
time,Hardware,Voltage,Current
1626721982859,high-voltage-2,5,0.405042
time,Hardware,Voltage,Current
1626721982859,high-voltage-2,6,0.440849
time,Hardware,Voltage,Current
1626721982859,high-voltage-2,7,0.480206
time,Hardware,Voltage,Current
1626721982859,high-voltage-2,8,0.521307
time,Hardware,Voltage,Current
1626721982859,high-voltage-2,9,0.56295
time,Hardware,Voltage,Current
1626721982859,high-voltage-2,10,0.604636
time,Hardware,Voltage,Current
1626721982859,high-voltage-2,11,0.642581
time,Hardware,Voltage,Current
1626721982859,high-voltage-2,12,0.685018
time,Hardware,Voltage,Current
1626721982859,high-voltage-2,13,0.724671
time,Hardware,Voltage,Current
1626721982859,high-voltage-2,14,0.756236
time,Hardware,Voltage,Current
1626721982859,high-voltage-2,15,0.785261
time,Hardware,Voltage,Current
1626721982859,high-voltage-2,16,0.807387
time,Hardware,Voltage,Current
1626721982859,high-voltage-2,17,0.831712
time,Hardware,Voltage,Current
1626721982859,high-voltage-2,18,0.859256
time,Hardware,Voltage,Current
1626721982859,high-voltage-2,19,0.882661
time,Hardware,Voltage,Current
1626721982859,high-voltage-2,20,0.900642
time,Hardware,Voltage,Current
1626721982859,high-voltage-2,25,0.991633
time,Hardware,Voltage,Current
1626721982859,high-voltage-2,30,1.07933
time,Hardware,Voltage,Current
1626721982859,high-voltage-2,35,1.17493
time,Hardware,Voltage,Current
1626721982859,high-voltage-2,40,1.28626
time,Hardware,Voltage,Current
1626721982859,high-voltage-2,45,1.42361
time,Hardware,Voltage,Current
1626721982859,high-voltage-2,50,1.52323
time,Hardware,Voltage,Current
1626721982859,high-voltage-2,55,1.61214
time,Hardware,Voltage,Current
1626721982859,high-voltage-2,60,1.7004
time,Hardware,Voltage,Current
1626721982859,high-voltage-2,65,1.7905
time,Hardware,Voltage,Current
1626721982859,high-voltage-2,70,1.87385
time,Hardware,Voltage,Current
1626721982859,high-voltage-2,75,1.94516
time,Hardware,Voltage,Current
1626721982859,high-voltage-2,80,2.01912
time,Hardware,Voltage,Current
1626721982859,high-voltage-2,85,2.09486
time,Hardware,Voltage,Current
1626721982859,high-voltage-2,90,2.16908
time,Hardware,Voltage,Current
1626721982859,high-voltage-2,95,2.23833
time,Hardware,Voltage,Current
1626721982859,high-voltage-2,100,2.30182
