{
    "Data": [10.0, 8.0, 9.0, 2.0, 9.0, 4.0, 6.0, 5.0, 6.0, 9.0, 5.0, 10.0, 6.0, 10.0, 16.0, 16.0, 33.0, 23.0, 26.0, 30.0, 29.0, 40.0, 51.0, 52.0, 79.0, 57.0, 100.0, 110.0, 122.0, 154.0, 195.0, 234.0, 258.0, 308.0, 427.0, 548.0, 739.0, 1148.0, 1737.0, 2468.0, 3163.0, 3918.0, 4156.0, 4260.0, 3851.0, 3309.0, 2741.0, 2157.0, 1654.0, 1405.0, 1240.0, 1041.0, 969.0, 948.0, 901.0, 832.0, 786.0, 723.0, 615.0, 557.0, 464.0, 409.0, 381.0, 313.0, 254.0, 246.0, 182.0, 176.0, 142.0, 103.0, 93.0, 92.0, 71.0, 61.0, 54.0, 31.0, 37.0, 42.0, 39.0, 28.0, 28.0, 27.0, 20.0, 23.0, 15.0, 19.0, 16.0, 25.0, 12.0, 13.0, 14.0],
    "Name": "ThresholdDist-0",
    "Overflow": 304.0,
    "Type": "Histo1d",
    "Underflow": 21.0,
    "x": {
        "AxisTitle": "Threshold [e]",
        "Bins": 91,
        "High": 1435.0,
        "Low": 525.0
    },
    "y": {
        "AxisTitle": "Number of Pixels"
    },
    "z": {
        "AxisTitle": "z"
    }
}