time,Hardware,Voltage,Current
1626350674309,high-voltage,1,0.0105277
time,Hardware,Voltage,Current
1626350674309,high-voltage,2,0.0245582
time,Hardware,Voltage,Current
1626350674309,high-voltage,3,0.0325931
time,Hardware,Voltage,Current
1626350674309,high-voltage,4,0.0399471
time,Hardware,Voltage,Current
1626350674309,high-voltage,5,0.0455218
time,Hardware,Voltage,Current
1626350674309,high-voltage,6,0.0514811
time,Hardware,Voltage,Current
1626350674309,high-voltage,7,0.0592567
time,Hardware,Voltage,Current
1626350674309,high-voltage,8,0.065327
time,Hardware,Voltage,Current
1626350674309,high-voltage,9,0.0731966
time,Hardware,Voltage,Current
1626350674309,high-voltage,10,0.0791945
time,Hardware,Voltage,Current
1626350674309,high-voltage,11,0.0839765
time,Hardware,Voltage,Current
1626350674309,high-voltage,12,0.0890006
time,Hardware,Voltage,Current
1626350674309,high-voltage,13,0.0939646
time,Hardware,Voltage,Current
1626350674309,high-voltage,14,0.0984153
time,Hardware,Voltage,Current
1626350674309,high-voltage,15,0.101678
time,Hardware,Voltage,Current
1626350674309,high-voltage,16,0.105646
time,Hardware,Voltage,Current
1626350674309,high-voltage,17,0.1085
time,Hardware,Voltage,Current
1626350674309,high-voltage,18,0.111418
time,Hardware,Voltage,Current
1626350674309,high-voltage,19,0.114688
time,Hardware,Voltage,Current
1626350674309,high-voltage,20,0.118133
time,Hardware,Voltage,Current
1626350674309,high-voltage,25,0.132858
time,Hardware,Voltage,Current
1626350674309,high-voltage,30,0.149977
time,Hardware,Voltage,Current
1626350674309,high-voltage,35,0.183271
time,Hardware,Voltage,Current
1626350674309,high-voltage,40,0.285216
time,Hardware,Voltage,Current
1626350674309,high-voltage,45,0.535228
time,Hardware,Voltage,Current
1626350674309,high-voltage,50,1.0105
time,Hardware,Voltage,Current
1626350674309,high-voltage,55,1.82642
time,Hardware,Voltage,Current
1626350674309,high-voltage,60,3.07438
time,Hardware,Voltage,Current
1626350674309,high-voltage,65,4.83301
time,Hardware,Voltage,Current
1626350674309,high-voltage,70,7.17212
time,Hardware,Voltage,Current
1626350674309,high-voltage,75,10
