{
    "Data": [0.0, 0.0, 0.0, 0.0, 0.0, 0.0, 0.0, 0.0, 0.0, 0.0, 0.0, 0.0, 0.0, 0.0, 1.0, 2.0, 0.0, 32.0, 209.0, 59.0, 47.0, 1121.0, 2771.0, 1011.0, 410.0, 1894.0, 3418.0, 1594.0, 578.0, 1444.0, 2165.0, 1280.0, 474.0, 551.0, 698.0, 532.0, 452.0, 1164.0, 1461.0, 1034.0, 790.0, 2256.0, 3393.0, 3959.0, 2247.0, 1900.0, 3116.0, 3619.0, 3236.0, 2019.0, 2255.0, 2519.0, 2993.0, 1708.0, 1368.0, 1250.0, 1089.0, 1088.0, 739.0, 837.0, 744.0, 736.0, 609.0, 482.0, 421.0, 411.0, 433.0, 295.0, 299.0, 264.0, 283.0, 246.0, 200.0, 191.0, 151.0, 143.0, 143.0, 121.0, 126.0, 101.0, 88.0, 89.0, 63.0, 46.0, 70.0, 74.0, 72.0, 41.0, 54.0, 39.0, 47.0, 48.0, 42.0, 55.0, 50.0, 44.0, 28.0, 33.0, 23.0, 27.0, 23.0, 29.0, 28.0, 24.0, 27.0, 17.0, 15.0, 14.0, 21.0, 19.0, 12.0, 12.0, 11.0, 18.0, 9.0, 11.0, 7.0, 4.0, 3.0, 5.0, 9.0, 7.0, 6.0, 10.0, 4.0, 1.0, 4.0, 1.0, 11.0, 3.0, 3.0, 5.0, 3.0, 4.0, 1.0, 5.0, 0.0, 3.0, 1.0, 3.0, 5.0, 3.0, 1.0, 1.0, 5.0, 1.0, 1.0, 2.0, 0.0, 1.0, 1.0, 1.0, 2.0, 2.0, 0.0, 1.0, 1.0, 0.0, 2.0, 1.0, 2.0, 1.0, 0.0, 1.0, 1.0, 0.0, 0.0, 1.0, 1.0, 2.0, 0.0, 2.0, 0.0, 0.0, 0.0, 0.0, 0.0, 0.0, 0.0, 2.0, 0.0, 2.0, 0.0, 0.0, 1.0, 0.0, 0.0, 0.0, 0.0, 1.0, 0.0, 0.0, 0.0, 0.0, 0.0, 0.0, 0.0, 0.0, 1.0, 0.0, 0.0],
    "Name": "TimePerFitDist-0",
    "Overflow": 46.0,
    "Type": "Histo1d",
    "Underflow": 0.0,
    "x": {
        "AxisTitle": "Fit Time [us]",
        "Bins": 201,
        "High": 401.0,
        "Low": -1.0
    },
    "y": {
        "AxisTitle": "Number of Pixels"
    },
    "z": {
        "AxisTitle": "z"
    }
}