{
    "Data": [0.0, 0.0, 0.0, 0.0, 0.0, 0.0, 0.0, 0.0, 0.0, 0.0, 0.0, 0.0, 0.0, 1.0, 10.0, 1.0, 0.0, 2.0, 5.0, 0.0, 0.0, 4.0, 4.0, 5.0, 2.0, 1.0, 11.0, 20.0, 8.0, 1.0, 34.0, 76.0, 53.0, 118.0, 210.0, 212.0, 150.0, 951.0, 1670.0, 1360.0, 627.0, 1477.0, 2703.0, 3462.0, 2016.0, 1650.0, 2627.0, 3349.0, 3163.0, 2059.0, 1905.0, 2140.0, 2710.0, 1818.0, 1281.0, 1260.0, 1161.0, 1193.0, 903.0, 865.0, 817.0, 845.0, 668.0, 472.0, 489.0, 480.0, 410.0, 354.0, 352.0, 293.0, 302.0, 252.0, 208.0, 209.0, 189.0, 208.0, 184.0, 155.0, 135.0, 129.0, 134.0, 103.0, 121.0, 83.0, 85.0, 56.0, 79.0, 50.0, 72.0, 68.0, 64.0, 46.0, 34.0, 32.0, 27.0, 48.0, 29.0, 27.0, 26.0, 28.0, 20.0, 18.0, 22.0, 9.0, 20.0, 23.0, 16.0, 12.0, 17.0, 14.0, 10.0, 5.0, 11.0, 8.0, 7.0, 7.0, 11.0, 9.0, 5.0, 6.0, 2.0, 4.0, 5.0, 3.0, 4.0, 2.0, 5.0, 2.0, 5.0, 2.0, 6.0, 1.0, 1.0, 3.0, 3.0, 3.0, 2.0, 1.0, 4.0, 0.0, 0.0, 1.0, 2.0, 1.0, 2.0, 3.0, 2.0, 1.0, 2.0, 0.0, 3.0, 1.0, 0.0, 0.0, 1.0, 0.0, 1.0, 0.0, 1.0, 0.0, 1.0, 1.0, 2.0, 1.0, 0.0, 0.0, 2.0, 2.0, 0.0, 1.0, 0.0, 0.0, 0.0, 0.0, 0.0, 1.0, 0.0, 0.0, 0.0, 0.0, 0.0, 0.0, 0.0, 1.0, 1.0, 0.0, 0.0, 0.0, 0.0, 0.0, 0.0, 1.0, 0.0, 0.0, 0.0, 0.0, 1.0, 1.0, 1.0, 1.0, 0.0],
    "Name": "TimePerFitDist-0",
    "Overflow": 83.0,
    "Type": "Histo1d",
    "Underflow": 0.0,
    "x": {
        "AxisTitle": "Fit Time [us]",
        "Bins": 201,
        "High": 401.0,
        "Low": -1.0
    },
    "y": {
        "AxisTitle": "Number of Pixels"
    },
    "z": {
        "AxisTitle": "z"
    }
}