{
    "Data": [12.0, 27.0, 0.0, 1.0, 7.0, 62.0, 416.0, 1315.0, 2835.0, 4064.0, 4515.0, 3817.0, 3044.0, 2540.0, 2335.0, 2289.0, 2108.0, 1947.0, 1752.0, 1808.0, 1929.0, 2197.0, 2350.0, 2421.0, 2135.0, 1773.0, 1262.0, 951.0, 570.0, 340.0, 246.0, 240.0, 229.0, 292.0, 349.0, 482.0, 630.0, 822.0, 960.0, 1190.0, 1309.0, 1468.0, 1671.0, 1729.0, 1719.0, 1693.0, 1536.0, 1390.0, 1255.0, 1146.0, 915.0, 766.0, 627.0, 503.0, 419.0, 305.0, 282.0, 199.0, 173.0, 128.0, 92.0, 60.0, 69.0, 47.0, 34.0, 41.0, 25.0, 22.0, 25.0, 21.0, 19.0, 17.0, 10.0, 16.0, 8.0, 13.0, 8.0, 7.0, 7.0, 6.0, 6.0, 9.0, 7.0, 5.0, 5.0, 5.0, 3.0, 4.0, 1.0, 5.0, 1.0, 0.0, 2.0, 2.0, 3.0, 0.0, 1.0, 1.0, 1.0, 3.0, 2.0],
    "Name": "NoiseDist-0",
    "Overflow": 9.0,
    "Type": "Histo1d",
    "Underflow": 0.0,
    "x": {
        "AxisTitle": "Noise [e]",
        "Bins": 101,
        "High": 506.0,
        "Low": -2.0
    },
    "y": {
        "AxisTitle": "Number of Pixels"
    },
    "z": {
        "AxisTitle": "z"
    }
}