{
    "Data": [257.0, 11996.0, 20892.0, 13688.0, 6532.0, 3615.0, 3026.0, 2945.0, 2832.0, 2412.0, 2054.0, 1487.0, 1102.0, 771.0, 522.0, 348.0, 296.0, 197.0, 142.0, 158.0, 127.0, 106.0, 114.0, 118.0, 119.0, 81.0, 87.0, 77.0, 66.0, 58.0, 67.0, 50.0, 49.0, 41.0, 41.0, 30.0, 27.0, 31.0, 27.0, 30.0, 29.0, 21.0, 17.0, 16.0, 19.0, 5.0, 12.0, 12.0, 12.0, 7.0, 4.0],
    "Name": "Chi2Dist-0",
    "Overflow": 0.0,
    "Type": "Histo1d",
    "Underflow": 0.0,
    "x": {
        "AxisTitle": "Fit Chi/ndf",
        "Bins": 51,
        "High": 2.5250000953674318,
        "Low": -0.02500000037252903
    },
    "y": {
        "AxisTitle": "Number of Pixels"
    },
    "z": {
        "AxisTitle": "z"
    }
}