time,Hardware,Voltage,Current
1621619422782,high-voltage-3,1,0.22558
time,Hardware,Voltage,Current
1621619422782,high-voltage-3,2,0.238624
time,Hardware,Voltage,Current
1621619422782,high-voltage-3,3,0.250161
time,Hardware,Voltage,Current
1621619422782,high-voltage-3,4,0.260811
time,Hardware,Voltage,Current
1621619422782,high-voltage-3,5,0.270091
time,Hardware,Voltage,Current
1621619422782,high-voltage-3,6,0.277626
time,Hardware,Voltage,Current
1621619422782,high-voltage-3,7,0.28521
time,Hardware,Voltage,Current
1621619422782,high-voltage-3,8,0.294323
time,Hardware,Voltage,Current
1621619422782,high-voltage-3,9,0.302814
time,Hardware,Voltage,Current
1621619422782,high-voltage-3,10,0.311483
time,Hardware,Voltage,Current
1621619422782,high-voltage-3,11,0.320432
time,Hardware,Voltage,Current
1621619422782,high-voltage-3,12,0.329763
time,Hardware,Voltage,Current
1621619422782,high-voltage-3,13,0.337703
time,Hardware,Voltage,Current
1621619422782,high-voltage-3,14,0.345078
time,Hardware,Voltage,Current
1621619422782,high-voltage-3,15,0.350881
time,Hardware,Voltage,Current
1621619422782,high-voltage-3,16,0.358336
time,Hardware,Voltage,Current
1621619422782,high-voltage-3,17,0.362544
time,Hardware,Voltage,Current
1621619422782,high-voltage-3,18,0.368267
time,Hardware,Voltage,Current
1621619422782,high-voltage-3,19,0.374653
time,Hardware,Voltage,Current
1621619422782,high-voltage-3,20,0.379882
time,Hardware,Voltage,Current
1621619422782,high-voltage-3,25,0.405865
time,Hardware,Voltage,Current
1621619422782,high-voltage-3,30,0.428623
time,Hardware,Voltage,Current
1621619422782,high-voltage-3,35,0.449594
time,Hardware,Voltage,Current
1621619422782,high-voltage-3,40,0.469864
time,Hardware,Voltage,Current
1621619422782,high-voltage-3,45,0.486045
time,Hardware,Voltage,Current
1621619422782,high-voltage-3,50,0.503867
time,Hardware,Voltage,Current
1621619422782,high-voltage-3,55,0.519215
time,Hardware,Voltage,Current
1621619422782,high-voltage-3,60,0.535164
time,Hardware,Voltage,Current
1621619422782,high-voltage-3,65,0.549017
time,Hardware,Voltage,Current
1621619422782,high-voltage-3,70,0.563637
time,Hardware,Voltage,Current
1621619422782,high-voltage-3,75,0.57828
time,Hardware,Voltage,Current
1621619422782,high-voltage-3,80,0.591156
time,Hardware,Voltage,Current
1621619422782,high-voltage-3,85,0.605866
time,Hardware,Voltage,Current
1621619422782,high-voltage-3,90,0.617244
time,Hardware,Voltage,Current
1621619422782,high-voltage-3,95,0.629939
time,Hardware,Voltage,Current
1621619422782,high-voltage-3,100,0.641562
