time,Hardware,Voltage,Current
1626736555657,high-voltage-3,1,0.294875
time,Hardware,Voltage,Current
1626736555657,high-voltage-3,2,0.317272
time,Hardware,Voltage,Current
1626736555657,high-voltage-3,3,0.334898
time,Hardware,Voltage,Current
1626736555657,high-voltage-3,4,0.34876
time,Hardware,Voltage,Current
1626736555657,high-voltage-3,5,0.362443
time,Hardware,Voltage,Current
1626736555657,high-voltage-3,6,0.372762
time,Hardware,Voltage,Current
1626736555657,high-voltage-3,7,0.386773
time,Hardware,Voltage,Current
1626736555657,high-voltage-3,8,0.401951
time,Hardware,Voltage,Current
1626736555657,high-voltage-3,9,0.416914
time,Hardware,Voltage,Current
1626736555657,high-voltage-3,10,0.430872
time,Hardware,Voltage,Current
1626736555657,high-voltage-3,11,0.445992
time,Hardware,Voltage,Current
1626736555657,high-voltage-3,12,0.461793
time,Hardware,Voltage,Current
1626736555657,high-voltage-3,13,0.474102
time,Hardware,Voltage,Current
1626736555657,high-voltage-3,14,0.486602
time,Hardware,Voltage,Current
1626736555657,high-voltage-3,15,0.499612
time,Hardware,Voltage,Current
1626736555657,high-voltage-3,16,0.509571
time,Hardware,Voltage,Current
1626736555657,high-voltage-3,17,0.521944
time,Hardware,Voltage,Current
1626736555657,high-voltage-3,18,0.531232
time,Hardware,Voltage,Current
1626736555657,high-voltage-3,19,0.540424
time,Hardware,Voltage,Current
1626736555657,high-voltage-3,20,0.551088
time,Hardware,Voltage,Current
1626736555657,high-voltage-3,25,0.593091
time,Hardware,Voltage,Current
1626736555657,high-voltage-3,30,0.62892
time,Hardware,Voltage,Current
1626736555657,high-voltage-3,35,0.65742
time,Hardware,Voltage,Current
1626736555657,high-voltage-3,40,0.682769
time,Hardware,Voltage,Current
1626736555657,high-voltage-3,45,0.70826
time,Hardware,Voltage,Current
1626736555657,high-voltage-3,50,0.732559
time,Hardware,Voltage,Current
1626736555657,high-voltage-3,55,0.754053
time,Hardware,Voltage,Current
1626736555657,high-voltage-3,60,0.774348
time,Hardware,Voltage,Current
1626736555657,high-voltage-3,65,0.795888
time,Hardware,Voltage,Current
1626736555657,high-voltage-3,70,0.819798
time,Hardware,Voltage,Current
1626736555657,high-voltage-3,75,0.842837
time,Hardware,Voltage,Current
1626736555657,high-voltage-3,80,0.866752
time,Hardware,Voltage,Current
1626736555657,high-voltage-3,85,0.890872
time,Hardware,Voltage,Current
1626736555657,high-voltage-3,90,0.912349
time,Hardware,Voltage,Current
1626736555657,high-voltage-3,95,0.936765
time,Hardware,Voltage,Current
1626736555657,high-voltage-3,100,0.95469
