time,Hardware,Voltage,Current
1626610664885,high-voltage,1,0.0511465
time,Hardware,Voltage,Current
1626610664885,high-voltage,2,0.0734374
time,Hardware,Voltage,Current
1626610664885,high-voltage,3,0.0874173
time,Hardware,Voltage,Current
1626610664885,high-voltage,4,0.0984897
time,Hardware,Voltage,Current
1626610664885,high-voltage,5,0.107971
time,Hardware,Voltage,Current
1626610664885,high-voltage,6,0.119257
time,Hardware,Voltage,Current
1626610664885,high-voltage,7,0.132112
time,Hardware,Voltage,Current
1626610664885,high-voltage,8,0.143537
time,Hardware,Voltage,Current
1626610664885,high-voltage,9,0.158148
time,Hardware,Voltage,Current
1626610664885,high-voltage,10,0.171826
time,Hardware,Voltage,Current
1626610664885,high-voltage,11,0.18488
time,Hardware,Voltage,Current
1626610664885,high-voltage,12,0.197103
time,Hardware,Voltage,Current
1626610664885,high-voltage,13,0.20775
time,Hardware,Voltage,Current
1626610664885,high-voltage,14,0.217727
time,Hardware,Voltage,Current
1626610664885,high-voltage,15,0.226583
time,Hardware,Voltage,Current
1626610664885,high-voltage,16,0.232738
time,Hardware,Voltage,Current
1626610664885,high-voltage,17,0.240716
time,Hardware,Voltage,Current
1626610664885,high-voltage,18,0.247205
time,Hardware,Voltage,Current
1626610664885,high-voltage,19,0.253645
time,Hardware,Voltage,Current
1626610664885,high-voltage,20,0.258947
time,Hardware,Voltage,Current
1626610664885,high-voltage,25,0.288907
time,Hardware,Voltage,Current
1626610664885,high-voltage,30,0.322781
time,Hardware,Voltage,Current
1626610664885,high-voltage,35,0.391939
time,Hardware,Voltage,Current
1626610664885,high-voltage,40,0.553065
time,Hardware,Voltage,Current
1626610664885,high-voltage,45,0.870703
time,Hardware,Voltage,Current
1626610664885,high-voltage,50,1.42934
time,Hardware,Voltage,Current
1626610664885,high-voltage,55,2.32969
time,Hardware,Voltage,Current
1626610664885,high-voltage,60,3.69157
time,Hardware,Voltage,Current
1626610664885,high-voltage,65,5.61618
time,Hardware,Voltage,Current
1626610664885,high-voltage,70,8.22432
time,Hardware,Voltage,Current
1626610664885,high-voltage,75,10
