time,Hardware,Voltage,Current
1625767972122,high-voltage,1,0.0523429
time,Hardware,Voltage,Current
1625767972122,high-voltage,2,0.0756027
time,Hardware,Voltage,Current
1625767972122,high-voltage,3,0.0916004
time,Hardware,Voltage,Current
1625767972122,high-voltage,4,0.103376
time,Hardware,Voltage,Current
1625767972122,high-voltage,5,0.113007
time,Hardware,Voltage,Current
1625767972122,high-voltage,6,0.121399
time,Hardware,Voltage,Current
1625767972122,high-voltage,7,0.129965
time,Hardware,Voltage,Current
1625767972122,high-voltage,8,0.137209
time,Hardware,Voltage,Current
1625767972122,high-voltage,9,0.144316
time,Hardware,Voltage,Current
1625767972122,high-voltage,10,0.149907
time,Hardware,Voltage,Current
1625767972122,high-voltage,11,0.157619
time,Hardware,Voltage,Current
1625767972122,high-voltage,12,0.163612
time,Hardware,Voltage,Current
1625767972122,high-voltage,13,0.171521
time,Hardware,Voltage,Current
1625767972122,high-voltage,14,0.178274
time,Hardware,Voltage,Current
1625767972122,high-voltage,15,0.184481
time,Hardware,Voltage,Current
1625767972122,high-voltage,16,0.190774
time,Hardware,Voltage,Current
1625767972122,high-voltage,17,0.198556
time,Hardware,Voltage,Current
1625767972122,high-voltage,18,0.205323
time,Hardware,Voltage,Current
1625767972122,high-voltage,19,0.210782
time,Hardware,Voltage,Current
1625767972122,high-voltage,20,0.21849
time,Hardware,Voltage,Current
1625767972122,high-voltage,25,0.245094
time,Hardware,Voltage,Current
1625767972122,high-voltage,30,0.273968
time,Hardware,Voltage,Current
1625767972122,high-voltage,35,0.306029
time,Hardware,Voltage,Current
1625767972122,high-voltage,40,0.351787
time,Hardware,Voltage,Current
1625767972122,high-voltage,45,0.431232
time,Hardware,Voltage,Current
1625767972122,high-voltage,50,0.561272
time,Hardware,Voltage,Current
1625767972122,high-voltage,55,0.795484
time,Hardware,Voltage,Current
1625767972122,high-voltage,60,1.19544
time,Hardware,Voltage,Current
1625767972122,high-voltage,65,1.81452
time,Hardware,Voltage,Current
1625767972122,high-voltage,70,2.72323
time,Hardware,Voltage,Current
1625767972122,high-voltage,75,3.97084
time,Hardware,Voltage,Current
1625767972122,high-voltage,80,5.58096
time,Hardware,Voltage,Current
1625767972122,high-voltage,85,7.77451
time,Hardware,Voltage,Current
1625767972122,high-voltage,90,10
