time,Hardware,Voltage,Current
1626395519419,high-voltage,1,0.0576314
time,Hardware,Voltage,Current
1626395519419,high-voltage,2,0.0902085
time,Hardware,Voltage,Current
1626395519419,high-voltage,3,0.110742
time,Hardware,Voltage,Current
1626395519419,high-voltage,4,0.129073
time,Hardware,Voltage,Current
1626395519419,high-voltage,5,0.143437
time,Hardware,Voltage,Current
1626395519419,high-voltage,6,0.158035
time,Hardware,Voltage,Current
1626395519419,high-voltage,7,0.17151
time,Hardware,Voltage,Current
1626395519419,high-voltage,8,0.185309
time,Hardware,Voltage,Current
1626395519419,high-voltage,9,0.196631
time,Hardware,Voltage,Current
1626395519419,high-voltage,10,0.208228
time,Hardware,Voltage,Current
1626395519419,high-voltage,11,0.218683
time,Hardware,Voltage,Current
1626395519419,high-voltage,12,0.227857
time,Hardware,Voltage,Current
1626395519419,high-voltage,13,0.234427
time,Hardware,Voltage,Current
1626395519419,high-voltage,14,0.241586
time,Hardware,Voltage,Current
1626395519419,high-voltage,15,0.248489
time,Hardware,Voltage,Current
1626395519419,high-voltage,16,0.255886
time,Hardware,Voltage,Current
1626395519419,high-voltage,17,0.262233
time,Hardware,Voltage,Current
1626395519419,high-voltage,18,0.268146
time,Hardware,Voltage,Current
1626395519419,high-voltage,19,0.274161
time,Hardware,Voltage,Current
1626395519419,high-voltage,20,0.279815
time,Hardware,Voltage,Current
1626395519419,high-voltage,25,0.307053
time,Hardware,Voltage,Current
1626395519419,high-voltage,30,0.336076
time,Hardware,Voltage,Current
1626395519419,high-voltage,35,0.381485
time,Hardware,Voltage,Current
1626395519419,high-voltage,40,0.491589
time,Hardware,Voltage,Current
1626395519419,high-voltage,45,0.711817
time,Hardware,Voltage,Current
1626395519419,high-voltage,50,1.08888
time,Hardware,Voltage,Current
1626395519419,high-voltage,55,1.72303
time,Hardware,Voltage,Current
1626395519419,high-voltage,60,2.71922
time,Hardware,Voltage,Current
1626395519419,high-voltage,65,4.17868
time,Hardware,Voltage,Current
1626395519419,high-voltage,70,6.24585
time,Hardware,Voltage,Current
1626395519419,high-voltage,75,8.92627
time,Hardware,Voltage,Current
1626395519419,high-voltage,80,10
