{
    "Data": [0.0, 0.0, 0.0, 0.0, 0.0, 0.0, 0.0, 0.0, 0.0, 0.0, 0.0, 0.0, 0.0, 0.0, 4.0, 1.0, 0.0, 31.0, 153.0, 40.0, 62.0, 874.0, 2067.0, 576.0, 418.0, 1518.0, 2653.0, 1262.0, 703.0, 1202.0, 1551.0, 1011.0, 529.0, 592.0, 715.0, 615.0, 406.0, 545.0, 854.0, 811.0, 556.0, 925.0, 1990.0, 2916.0, 2206.0, 1546.0, 2439.0, 3346.0, 3849.0, 2819.0, 2292.0, 2647.0, 2945.0, 2577.0, 1999.0, 1723.0, 1696.0, 1834.0, 1470.0, 1315.0, 1160.0, 1088.0, 1044.0, 749.0, 702.0, 564.0, 581.0, 542.0, 438.0, 412.0, 379.0, 339.0, 319.0, 273.0, 242.0, 233.0, 196.0, 161.0, 186.0, 149.0, 149.0, 119.0, 124.0, 100.0, 91.0, 101.0, 85.0, 83.0, 59.0, 72.0, 61.0, 47.0, 56.0, 50.0, 64.0, 50.0, 49.0, 32.0, 27.0, 38.0, 21.0, 29.0, 16.0, 19.0, 27.0, 24.0, 26.0, 16.0, 17.0, 23.0, 8.0, 12.0, 16.0, 16.0, 13.0, 9.0, 11.0, 12.0, 10.0, 7.0, 7.0, 11.0, 5.0, 7.0, 4.0, 4.0, 8.0, 6.0, 11.0, 5.0, 7.0, 3.0, 10.0, 7.0, 1.0, 3.0, 5.0, 1.0, 4.0, 5.0, 6.0, 5.0, 4.0, 1.0, 1.0, 3.0, 3.0, 4.0, 3.0, 2.0, 4.0, 3.0, 4.0, 1.0, 3.0, 1.0, 0.0, 2.0, 4.0, 3.0, 1.0, 0.0, 1.0, 3.0, 2.0, 0.0, 3.0, 1.0, 3.0, 1.0, 0.0, 2.0, 2.0, 1.0, 3.0, 0.0, 2.0, 1.0, 0.0, 0.0, 0.0, 0.0, 3.0, 0.0, 0.0, 1.0, 1.0, 0.0, 0.0, 0.0, 1.0, 0.0, 0.0, 2.0, 2.0, 0.0, 0.0, 0.0, 2.0, 1.0, 1.0],
    "Name": "TimePerFitDist-0",
    "Overflow": 86.0,
    "Type": "Histo1d",
    "Underflow": 0.0,
    "x": {
        "AxisTitle": "Fit Time [us]",
        "Bins": 201,
        "High": 401.0,
        "Low": -1.0
    },
    "y": {
        "AxisTitle": "Number of Pixels"
    },
    "z": {
        "AxisTitle": "z"
    }
}