{
    "Data": [0.0, 0.0, 0.0, 0.0, 0.0, 0.0, 0.0, 0.0, 0.0, 0.0, 0.0, 0.0, 0.0, 1.0, 13.0, 0.0, 0.0, 69.0, 452.0, 263.0, 58.0, 465.0, 2399.0, 2334.0, 492.0, 935.0, 2831.0, 2713.0, 978.0, 772.0, 1425.0, 1794.0, 1023.0, 503.0, 553.0, 670.0, 507.0, 666.0, 1155.0, 1087.0, 734.0, 1149.0, 2509.0, 3929.0, 2688.0, 1877.0, 2397.0, 4025.0, 3682.0, 3196.0, 2177.0, 2259.0, 2644.0, 1986.0, 1672.0, 1328.0, 1561.0, 1481.0, 1398.0, 1033.0, 792.0, 929.0, 740.0, 619.0, 489.0, 508.0, 526.0, 416.0, 382.0, 312.0, 355.0, 348.0, 264.0, 200.0, 177.0, 201.0, 175.0, 137.0, 121.0, 114.0, 103.0, 110.0, 86.0, 76.0, 70.0, 78.0, 70.0, 63.0, 39.0, 59.0, 60.0, 44.0, 53.0, 43.0, 37.0, 39.0, 32.0, 26.0, 35.0, 35.0, 33.0, 38.0, 21.0, 21.0, 21.0, 16.0, 20.0, 13.0, 17.0, 24.0, 12.0, 16.0, 19.0, 15.0, 16.0, 16.0, 12.0, 10.0, 11.0, 13.0, 13.0, 17.0, 5.0, 9.0, 8.0, 13.0, 4.0, 7.0, 3.0, 3.0, 9.0, 6.0, 6.0, 5.0, 8.0, 1.0, 9.0, 8.0, 6.0, 8.0, 4.0, 3.0, 6.0, 5.0, 3.0, 3.0, 5.0, 3.0, 1.0, 2.0, 6.0, 6.0, 6.0, 3.0, 6.0, 5.0, 8.0, 7.0, 7.0, 4.0, 2.0, 1.0, 0.0, 7.0, 3.0, 2.0, 4.0, 1.0, 3.0, 2.0, 3.0, 6.0, 3.0, 5.0, 7.0, 2.0, 5.0, 1.0, 3.0, 1.0, 3.0, 1.0, 3.0, 1.0, 1.0, 2.0, 0.0, 1.0, 1.0, 4.0, 2.0, 3.0, 1.0, 1.0, 2.0, 2.0, 2.0, 1.0, 1.0, 0.0, 0.0],
    "Name": "TimePerFitDist-0",
    "Overflow": 134.0,
    "Type": "Histo1d",
    "Underflow": 0.0,
    "x": {
        "AxisTitle": "Fit Time [us]",
        "Bins": 201,
        "High": 401.0,
        "Low": -1.0
    },
    "y": {
        "AxisTitle": "Number of Pixels"
    },
    "z": {
        "AxisTitle": "z"
    }
}