{
    "Data": [[4196.0, 2391.0, 1710.0, 1269.0, 1075.0, 907.0, 778.0, 670.0, 648.0, 642.0, 597.0, 540.0, 522.0, 533.0, 472.0, 493.0, 439.0, 412.0, 398.0, 367.0, 391.0, 386.0, 346.0, 319.0, 393.0, 360.0, 327.0, 321.0, 312.0, 318.0, 337.0, 335.0, 331.0, 358.0, 346.0, 326.0, 324.0, 353.0, 371.0, 365.0, 350.0, 356.0, 371.0, 415.0, 376.0, 458.0, 468.0, 502.0, 599.0], [4393.0, 2400.0, 1703.0, 1276.0, 1094.0, 919.0, 810.0, 754.0, 649.0, 619.0, 617.0, 539.0, 464.0, 494.0, 461.0, 479.0, 449.0, 445.0, 405.0, 420.0, 414.0, 417.0, 389.0, 374.0, 350.0, 342.0, 361.0, 323.0, 343.0, 339.0, 324.0, 325.0, 357.0, 337.0, 378.0, 371.0, 334.0, 329.0, 357.0, 356.0, 339.0, 353.0, 384.0, 391.0, 420.0, 456.0, 525.0, 613.0, 811.0], [4327.0, 2487.0, 1704.0, 1284.0, 1053.0, 926.0, 795.0, 742.0, 679.0, 663.0, 615.0, 532.0, 502.0, 536.0, 479.0, 479.0, 485.0, 431.0, 424.0, 400.0, 362.0, 402.0, 412.0, 385.0, 362.0, 349.0, 352.0, 327.0, 344.0, 312.0, 379.0, 374.0, 347.0, 322.0, 355.0, 355.0, 355.0, 334.0, 342.0, 351.0, 376.0, 384.0, 419.0, 390.0, 458.0, 450.0, 523.0, 647.0, 898.0], [4517.0, 2421.0, 1751.0, 1272.0, 1076.0, 943.0, 862.0, 757.0, 686.0, 638.0, 566.0, 571.0, 559.0, 475.0, 483.0, 488.0, 469.0, 427.0, 418.0, 397.0, 383.0, 411.0, 386.0, 381.0, 369.0, 366.0, 333.0, 365.0, 372.0, 376.0, 367.0, 348.0, 357.0, 353.0, 367.0, 327.0, 332.0, 357.0, 354.0, 369.0, 366.0, 405.0, 401.0, 413.0, 461.0, 452.0, 532.0, 694.0, 1064.0], [4496.0, 2398.0, 1668.0, 1351.0, 1114.0, 982.0, 800.0, 700.0, 747.0, 638.0, 600.0, 593.0, 533.0, 515.0, 468.0, 466.0, 471.0, 458.0, 401.0, 420.0, 404.0, 405.0, 372.0, 367.0, 415.0, 409.0, 354.0, 386.0, 337.0, 327.0, 357.0, 347.0, 345.0, 358.0, 344.0, 370.0, 353.0, 393.0, 385.0, 369.0, 396.0, 401.0, 429.0, 424.0, 463.0, 504.0, 535.0, 673.0, 1090.0], [4494.0, 2431.0, 1761.0, 1344.0, 1132.0, 972.0, 802.0, 728.0, 702.0, 664.0, 608.0, 599.0, 511.0, 535.0, 488.0, 504.0, 478.0, 437.0, 438.0, 455.0, 405.0, 402.0, 372.0, 362.0, 384.0, 415.0, 351.0, 383.0, 369.0, 405.0, 362.0, 340.0, 328.0, 347.0, 358.0, 361.0, 390.0, 395.0, 363.0, 406.0, 385.0, 349.0, 364.0, 467.0, 445.0, 505.0, 606.0, 750.0, 1113.0], [4395.0, 2498.0, 1713.0, 1311.0, 1102.0, 988.0, 824.0, 785.0, 761.0, 662.0, 575.0, 583.0, 596.0, 527.0, 518.0, 492.0, 475.0, 479.0, 463.0, 405.0, 397.0, 359.0, 358.0, 373.0, 412.0, 375.0, 376.0, 345.0, 327.0, 379.0, 356.0, 371.0, 395.0, 340.0, 412.0, 371.0, 351.0, 360.0, 373.0, 389.0, 383.0, 431.0, 414.0, 461.0, 458.0, 504.0, 609.0, 756.0, 1150.0], [4486.0, 2486.0, 1673.0, 1376.0, 1141.0, 966.0, 804.0, 754.0, 694.0, 672.0, 597.0, 558.0, 517.0, 579.0, 531.0, 468.0, 440.0, 475.0, 480.0, 426.0, 414.0, 384.0, 430.0, 337.0, 417.0, 392.0, 369.0, 391.0, 363.0, 364.0, 366.0, 366.0, 383.0, 364.0, 376.0, 342.0, 361.0, 367.0, 393.0, 405.0, 390.0, 398.0, 427.0, 492.0, 514.0, 577.0, 571.0, 761.0, 1174.0], [4504.0, 2539.0, 1763.0, 1284.0, 1097.0, 945.0, 833.0, 781.0, 706.0, 653.0, 616.0, 587.0, 518.0, 524.0, 483.0, 505.0, 451.0, 433.0, 467.0, 452.0, 406.0, 405.0, 420.0, 399.0, 424.0, 332.0, 371.0, 342.0, 376.0, 348.0, 356.0, 406.0, 378.0, 385.0, 369.0, 408.0, 366.0, 361.0, 389.0, 384.0, 436.0, 415.0, 462.0, 483.0, 478.0, 560.0, 623.0, 752.0, 1196.0], [4382.0, 2451.0, 1740.0, 1366.0, 1095.0, 904.0, 837.0, 719.0, 665.0, 642.0, 639.0, 548.0, 545.0, 503.0, 548.0, 498.0, 500.0, 482.0, 440.0, 420.0, 435.0, 401.0, 413.0, 370.0, 350.0, 393.0, 327.0, 349.0, 353.0, 391.0, 377.0, 364.0, 381.0, 363.0, 347.0, 392.0, 377.0, 395.0, 353.0, 419.0, 461.0, 403.0, 402.0, 472.0, 506.0, 527.0, 691.0, 827.0, 1261.0], [4251.0, 2371.0, 1694.0, 1324.0, 1108.0, 928.0, 794.0, 731.0, 631.0, 671.0, 619.0, 558.0, 575.0, 539.0, 460.0, 488.0, 462.0, 469.0, 448.0, 420.0, 401.0, 442.0, 409.0, 359.0, 375.0, 385.0, 369.0, 358.0, 399.0, 361.0, 335.0, 382.0, 345.0, 363.0, 349.0, 358.0, 378.0, 401.0, 390.0, 402.0, 397.0, 448.0, 467.0, 434.0, 488.0, 555.0, 597.0, 757.0, 1271.0], [4265.0, 2431.0, 1674.0, 1260.0, 1110.0, 868.0, 820.0, 727.0, 667.0, 661.0, 585.0, 554.0, 488.0, 524.0, 466.0, 513.0, 454.0, 466.0, 439.0, 385.0, 421.0, 430.0, 412.0, 388.0, 341.0, 357.0, 401.0, 366.0, 356.0, 356.0, 323.0, 323.0, 368.0, 329.0, 367.0, 372.0, 394.0, 394.0, 405.0, 405.0, 416.0, 389.0, 451.0, 509.0, 513.0, 517.0, 612.0, 750.0, 1247.0], [4231.0, 2385.0, 1631.0, 1269.0, 998.0, 873.0, 806.0, 738.0, 654.0, 614.0, 582.0, 547.0, 532.0, 507.0, 483.0, 488.0, 422.0, 451.0, 417.0, 411.0, 419.0, 420.0, 402.0, 371.0, 362.0, 373.0, 337.0, 322.0, 345.0, 355.0, 337.0, 346.0, 335.0, 346.0, 354.0, 397.0, 367.0, 352.0, 382.0, 368.0, 385.0, 391.0, 420.0, 455.0, 479.0, 552.0, 625.0, 768.0, 1253.0], [4196.0, 2368.0, 1569.0, 1228.0, 1079.0, 851.0, 765.0, 706.0, 639.0, 633.0, 553.0, 529.0, 508.0, 484.0, 455.0, 446.0, 447.0, 415.0, 437.0, 404.0, 387.0, 358.0, 404.0, 386.0, 319.0, 347.0, 327.0, 368.0, 349.0, 376.0, 348.0, 342.0, 343.0, 329.0, 374.0, 332.0, 344.0, 345.0, 335.0, 360.0, 370.0, 439.0, 416.0, 398.0, 450.0, 526.0, 591.0, 740.0, 1203.0], [4231.0, 2245.0, 1689.0, 1204.0, 969.0, 866.0, 762.0, 675.0, 663.0, 563.0, 535.0, 510.0, 501.0, 474.0, 450.0, 424.0, 433.0, 448.0, 404.0, 411.0, 357.0, 359.0, 358.0, 343.0, 381.0, 338.0, 314.0, 332.0, 330.0, 343.0, 333.0, 341.0, 344.0, 335.0, 333.0, 332.0, 349.0, 349.0, 345.0, 343.0, 371.0, 351.0, 399.0, 392.0, 448.0, 511.0, 557.0, 703.0, 1137.0], [4429.0, 2355.0, 1568.0, 1243.0, 1013.0, 815.0, 772.0, 669.0, 585.0, 590.0, 543.0, 484.0, 476.0, 486.0, 432.0, 426.0, 410.0, 396.0, 383.0, 367.0, 393.0, 398.0, 346.0, 369.0, 370.0, 353.0, 323.0, 329.0, 296.0, 298.0, 313.0, 319.0, 338.0, 299.0, 319.0, 301.0, 327.0, 347.0, 353.0, 322.0, 319.0, 343.0, 393.0, 409.0, 426.0, 499.0, 518.0, 671.0, 1040.0], [4833.0, 2415.0, 1585.0, 1227.0, 967.0, 855.0, 756.0, 610.0, 565.0, 525.0, 532.0, 526.0, 474.0, 470.0, 433.0, 433.0, 407.0, 408.0, 397.0, 372.0, 372.0, 339.0, 348.0, 343.0, 323.0, 336.0, 349.0, 336.0, 328.0, 330.0, 317.0, 308.0, 318.0, 316.0, 306.0, 331.0, 282.0, 270.0, 312.0, 333.0, 319.0, 332.0, 347.0, 384.0, 381.0, 431.0, 510.0, 646.0, 931.0], [5480.0, 2735.0, 1657.0, 1207.0, 1053.0, 916.0, 748.0, 617.0, 598.0, 596.0, 499.0, 471.0, 491.0, 434.0, 422.0, 422.0, 379.0, 389.0, 371.0, 369.0, 320.0, 367.0, 329.0, 320.0, 340.0, 341.0, 296.0, 286.0, 312.0, 337.0, 297.0, 281.0, 281.0, 310.0, 307.0, 302.0, 329.0, 323.0, 275.0, 307.0, 306.0, 349.0, 351.0, 356.0, 372.0, 396.0, 476.0, 619.0, 890.0], [6539.0, 3067.0, 2016.0, 1309.0, 1103.0, 881.0, 825.0, 654.0, 592.0, 536.0, 507.0, 474.0, 507.0, 382.0, 396.0, 401.0, 402.0, 372.0, 385.0, 370.0, 347.0, 318.0, 341.0, 351.0, 321.0, 302.0, 286.0, 325.0, 326.0, 288.0, 286.0, 280.0, 289.0, 319.0, 295.0, 282.0, 300.0, 296.0, 317.0, 286.0, 288.0, 299.0, 316.0, 367.0, 381.0, 412.0, 470.0, 522.0, 841.0], [7270.0, 3856.0, 2359.0, 1646.0, 1296.0, 1011.0, 843.0, 687.0, 633.0, 580.0, 501.0, 458.0, 450.0, 375.0, 419.0, 414.0, 379.0, 407.0, 378.0, 348.0, 346.0, 339.0, 330.0, 358.0, 335.0, 305.0, 271.0, 296.0, 321.0, 290.0, 299.0, 307.0, 292.0, 279.0, 267.0, 278.0, 310.0, 285.0, 263.0, 276.0, 305.0, 293.0, 309.0, 338.0, 355.0, 367.0, 416.0, 514.0, 736.0], [7718.0, 4429.0, 3019.0, 2074.0, 1534.0, 1237.0, 1021.0, 884.0, 736.0, 645.0, 550.0, 510.0, 462.0, 472.0, 481.0, 403.0, 398.0, 387.0, 373.0, 361.0, 363.0, 315.0, 307.0, 316.0, 296.0, 310.0, 300.0, 305.0, 315.0, 270.0, 308.0, 265.0, 291.0, 258.0, 301.0, 288.0, 273.0, 250.0, 269.0, 265.0, 276.0, 303.0, 280.0, 300.0, 363.0, 340.0, 392.0, 443.0, 742.0], [7647.0, 4679.0, 3454.0, 2472.0, 1957.0, 1583.0, 1382.0, 1071.0, 920.0, 775.0, 742.0, 636.0, 567.0, 544.0, 466.0, 480.0, 408.0, 403.0, 385.0, 384.0, 400.0, 338.0, 330.0, 312.0, 308.0, 325.0, 286.0, 309.0, 303.0, 299.0, 272.0, 268.0, 284.0, 268.0, 286.0, 253.0, 269.0, 308.0, 247.0, 293.0, 284.0, 274.0, 296.0, 279.0, 311.0, 345.0, 368.0, 481.0, 659.0], [7150.0, 4540.0, 3471.0, 2915.0, 2240.0, 1830.0, 1652.0, 1379.0, 1208.0, 1048.0, 929.0, 873.0, 757.0, 639.0, 609.0, 594.0, 516.0, 479.0, 481.0, 414.0, 374.0, 384.0, 356.0, 339.0, 344.0, 350.0, 318.0, 316.0, 302.0, 280.0, 276.0, 264.0, 283.0, 280.0, 286.0, 266.0, 265.0, 256.0, 262.0, 281.0, 293.0, 275.0, 266.0, 282.0, 295.0, 304.0, 351.0, 398.0, 619.0], [6224.0, 4106.0, 3332.0, 2701.0, 2330.0, 2059.0, 1804.0, 1665.0, 1435.0, 1332.0, 1241.0, 1080.0, 974.0, 920.0, 845.0, 722.0, 699.0, 659.0, 634.0, 564.0, 523.0, 482.0, 451.0, 452.0, 425.0, 407.0, 387.0, 347.0, 376.0, 358.0, 293.0, 295.0, 263.0, 299.0, 300.0, 288.0, 276.0, 243.0, 261.0, 296.0, 253.0, 293.0, 283.0, 259.0, 312.0, 346.0, 362.0, 400.0, 559.0], [5354.0, 3687.0, 2928.0, 2438.0, 2105.0, 1843.0, 1785.0, 1691.0, 1489.0, 1394.0, 1277.0, 1252.0, 1124.0, 1094.0, 1011.0, 1018.0, 913.0, 855.0, 786.0, 752.0, 688.0, 635.0, 678.0, 573.0, 542.0, 502.0, 465.0, 464.0, 438.0, 401.0, 365.0, 395.0, 410.0, 350.0, 315.0, 308.0, 327.0, 330.0, 304.0, 272.0, 309.0, 293.0, 299.0, 321.0, 289.0, 338.0, 328.0, 379.0, 495.0], [4780.0, 2967.0, 2448.0, 2046.0, 1810.0, 1727.0, 1566.0, 1469.0, 1415.0, 1373.0, 1242.0, 1226.0, 1161.0, 1170.0, 1120.0, 1096.0, 1034.0, 992.0, 970.0, 916.0, 853.0, 865.0, 787.0, 831.0, 730.0, 692.0, 596.0, 649.0, 613.0, 572.0, 533.0, 463.0, 488.0, 489.0, 450.0, 495.0, 395.0, 408.0, 356.0, 352.0, 349.0, 340.0, 346.0, 338.0, 342.0, 317.0, 343.0, 380.0, 478.0], [4271.0, 2615.0, 1959.0, 1684.0, 1494.0, 1434.0, 1321.0, 1231.0, 1180.0, 1190.0, 1122.0, 1116.0, 1170.0, 1093.0, 1061.0, 1051.0, 1022.0, 1048.0, 980.0, 917.0, 954.0, 898.0, 922.0, 961.0, 845.0, 854.0, 759.0, 776.0, 775.0, 765.0, 710.0, 719.0, 692.0, 643.0, 591.0, 607.0, 577.0, 561.0, 529.0, 507.0, 492.0, 480.0, 456.0, 431.0, 416.0, 389.0, 418.0, 431.0, 539.0], [4041.0, 2269.0, 1733.0, 1423.0, 1287.0, 1197.0, 1131.0, 1049.0, 970.0, 918.0, 944.0, 915.0, 896.0, 922.0, 868.0, 830.0, 890.0, 876.0, 890.0, 868.0, 896.0, 918.0, 922.0, 916.0, 893.0, 820.0, 896.0, 918.0, 853.0, 869.0, 862.0, 857.0, 863.0, 822.0, 794.0, 745.0, 739.0, 738.0, 752.0, 718.0, 721.0, 697.0, 695.0, 633.0, 604.0, 589.0, 561.0, 561.0, 690.0], [3847.0, 2256.0, 1684.0, 1361.0, 1195.0, 996.0, 836.0, 815.0, 815.0, 754.0, 768.0, 743.0, 765.0, 777.0, 753.0, 766.0, 757.0, 813.0, 750.0, 707.0, 809.0, 808.0, 754.0, 787.0, 810.0, 801.0, 772.0, 851.0, 783.0, 862.0, 889.0, 892.0, 882.0, 837.0, 877.0, 921.0, 895.0, 902.0, 928.0, 892.0, 894.0, 933.0, 893.0, 908.0, 833.0, 860.0, 865.0, 880.0, 935.0], [3810.0, 2177.0, 1552.0, 1166.0, 1075.0, 910.0, 802.0, 771.0, 684.0, 700.0, 652.0, 652.0, 641.0, 592.0, 630.0, 568.0, 616.0, 637.0, 633.0, 641.0, 606.0, 637.0, 654.0, 669.0, 672.0, 651.0, 668.0, 688.0, 734.0, 780.0, 789.0, 760.0, 831.0, 818.0, 854.0, 825.0, 934.0, 951.0, 950.0, 996.0, 1037.0, 1082.0, 1146.0, 1110.0, 1186.0, 1182.0, 1275.0, 1317.0, 1498.0], [3733.0, 2123.0, 1486.0, 1132.0, 939.0, 801.0, 770.0, 663.0, 606.0, 548.0, 534.0, 544.0, 537.0, 473.0, 531.0, 450.0, 486.0, 454.0, 467.0, 511.0, 488.0, 585.0, 531.0, 503.0, 544.0, 570.0, 552.0, 594.0, 574.0, 563.0, 655.0, 682.0, 680.0, 751.0, 742.0, 812.0, 814.0, 836.0, 912.0, 997.0, 1049.0, 1101.0, 1175.0, 1293.0, 1394.0, 1480.0, 1759.0, 1867.0, 2273.0], [3802.0, 2009.0, 1557.0, 1207.0, 976.0, 867.0, 715.0, 686.0, 602.0, 543.0, 497.0, 528.0, 507.0, 465.0, 448.0, 499.0, 456.0, 426.0, 417.0, 426.0, 401.0, 407.0, 411.0, 403.0, 420.0, 397.0, 435.0, 427.0, 444.0, 473.0, 499.0, 487.0, 537.0, 546.0, 546.0, 633.0, 629.0, 668.0, 800.0, 803.0, 911.0, 1002.0, 1089.0, 1241.0, 1443.0, 1527.0, 1846.0, 2297.0, 2966.0], [3756.0, 2003.0, 1467.0, 1197.0, 845.0, 802.0, 721.0, 620.0, 523.0, 513.0, 470.0, 425.0, 428.0, 458.0, 444.0, 389.0, 397.0, 392.0, 383.0, 385.0, 366.0, 363.0, 359.0, 345.0, 345.0, 353.0, 368.0, 355.0, 364.0, 366.0, 389.0, 403.0, 450.0, 437.0, 433.0, 467.0, 539.0, 547.0, 564.0, 603.0, 743.0, 794.0, 875.0, 1000.0, 1205.0, 1465.0, 1879.0, 2337.0, 3624.0], [3705.0, 2023.0, 1431.0, 1113.0, 912.0, 829.0, 712.0, 590.0, 510.0, 549.0, 445.0, 489.0, 432.0, 405.0, 403.0, 365.0, 367.0, 337.0, 379.0, 345.0, 300.0, 307.0, 367.0, 350.0, 316.0, 320.0, 305.0, 333.0, 342.0, 326.0, 319.0, 367.0, 350.0, 313.0, 363.0, 364.0, 348.0, 418.0, 460.0, 458.0, 506.0, 547.0, 629.0, 759.0, 943.0, 1166.0, 1562.0, 2119.0, 3591.0], [3836.0, 2064.0, 1448.0, 1150.0, 901.0, 734.0, 696.0, 577.0, 555.0, 530.0, 456.0, 458.0, 435.0, 409.0, 397.0, 410.0, 357.0, 353.0, 328.0, 337.0, 335.0, 354.0, 317.0, 319.0, 361.0, 316.0, 285.0, 259.0, 319.0, 285.0, 274.0, 321.0, 282.0, 294.0, 283.0, 305.0, 339.0, 293.0, 332.0, 373.0, 399.0, 429.0, 477.0, 555.0, 651.0, 830.0, 1211.0, 1726.0, 3084.0], [3737.0, 2074.0, 1459.0, 1166.0, 839.0, 715.0, 642.0, 619.0, 543.0, 530.0, 476.0, 475.0, 439.0, 393.0, 369.0, 423.0, 333.0, 357.0, 325.0, 314.0, 314.0, 318.0, 312.0, 290.0, 248.0, 294.0, 233.0, 268.0, 260.0, 247.0, 265.0, 305.0, 256.0, 283.0, 271.0, 253.0, 257.0, 298.0, 257.0, 290.0, 285.0, 311.0, 372.0, 426.0, 491.0, 607.0, 811.0, 1287.0, 2636.0], [3740.0, 2035.0, 1432.0, 1083.0, 919.0, 749.0, 656.0, 612.0, 512.0, 467.0, 471.0, 451.0, 417.0, 340.0, 409.0, 367.0, 386.0, 357.0, 308.0, 319.0, 320.0, 316.0, 310.0, 308.0, 322.0, 261.0, 269.0, 251.0, 284.0, 273.0, 232.0, 252.0, 254.0, 236.0, 250.0, 249.0, 232.0, 250.0, 239.0, 247.0, 266.0, 277.0, 283.0, 315.0, 360.0, 402.0, 615.0, 842.0, 1819.0], [3701.0, 2027.0, 1461.0, 1119.0, 903.0, 741.0, 689.0, 589.0, 529.0, 501.0, 468.0, 413.0, 406.0, 426.0, 348.0, 374.0, 359.0, 336.0, 325.0, 310.0, 271.0, 320.0, 287.0, 295.0, 307.0, 254.0, 281.0, 260.0, 264.0, 258.0, 230.0, 232.0, 237.0, 263.0, 219.0, 230.0, 215.0, 234.0, 279.0, 249.0, 249.0, 251.0, 236.0, 320.0, 275.0, 329.0, 401.0, 559.0, 1355.0], [3731.0, 2105.0, 1430.0, 1178.0, 884.0, 775.0, 657.0, 647.0, 563.0, 501.0, 431.0, 460.0, 407.0, 390.0, 357.0, 391.0, 353.0, 331.0, 332.0, 281.0, 301.0, 293.0, 283.0, 302.0, 285.0, 248.0, 259.0, 270.0, 282.0, 241.0, 261.0, 247.0, 273.0, 257.0, 268.0, 217.0, 247.0, 214.0, 221.0, 219.0, 204.0, 237.0, 234.0, 259.0, 255.0, 309.0, 310.0, 404.0, 861.0], [3607.0, 2077.0, 1407.0, 1142.0, 929.0, 783.0, 652.0, 594.0, 578.0, 440.0, 456.0, 472.0, 434.0, 394.0, 384.0, 339.0, 332.0, 337.0, 335.0, 276.0, 277.0, 312.0, 288.0, 293.0, 279.0, 247.0, 257.0, 262.0, 278.0, 259.0, 242.0, 276.0, 234.0, 260.0, 238.0, 227.0, 207.0, 243.0, 234.0, 235.0, 241.0, 227.0, 231.0, 253.0, 240.0, 263.0, 247.0, 321.0, 558.0], [3685.0, 2088.0, 1448.0, 1124.0, 903.0, 758.0, 623.0, 623.0, 564.0, 474.0, 466.0, 412.0, 420.0, 397.0, 379.0, 344.0, 333.0, 324.0, 292.0, 340.0, 325.0, 317.0, 284.0, 279.0, 262.0, 273.0, 278.0, 254.0, 266.0, 260.0, 230.0, 230.0, 237.0, 266.0, 285.0, 213.0, 228.0, 210.0, 240.0, 234.0, 245.0, 237.0, 218.0, 236.0, 251.0, 224.0, 242.0, 283.0, 416.0], [3644.0, 2081.0, 1486.0, 1118.0, 865.0, 739.0, 670.0, 648.0, 529.0, 511.0, 441.0, 412.0, 407.0, 402.0, 384.0, 387.0, 340.0, 337.0, 333.0, 333.0, 263.0, 295.0, 263.0, 274.0, 293.0, 283.0, 248.0, 246.0, 261.0, 268.0, 260.0, 239.0, 246.0, 239.0, 222.0, 228.0, 227.0, 220.0, 234.0, 211.0, 221.0, 258.0, 205.0, 203.0, 221.0, 238.0, 258.0, 279.0, 385.0], [3711.0, 2061.0, 1459.0, 1155.0, 862.0, 808.0, 640.0, 600.0, 508.0, 460.0, 477.0, 416.0, 450.0, 362.0, 378.0, 355.0, 328.0, 386.0, 355.0, 288.0, 291.0, 293.0, 309.0, 320.0, 282.0, 271.0, 264.0, 227.0, 247.0, 226.0, 214.0, 239.0, 227.0, 234.0, 229.0, 224.0, 243.0, 232.0, 202.0, 235.0, 223.0, 216.0, 215.0, 213.0, 251.0, 229.0, 279.0, 271.0, 304.0], [3644.0, 2132.0, 1439.0, 1164.0, 932.0, 777.0, 662.0, 578.0, 492.0, 514.0, 455.0, 429.0, 436.0, 376.0, 383.0, 371.0, 323.0, 307.0, 294.0, 331.0, 295.0, 305.0, 309.0, 263.0, 272.0, 287.0, 288.0, 263.0, 264.0, 251.0, 252.0, 249.0, 238.0, 230.0, 234.0, 241.0, 243.0, 223.0, 194.0, 237.0, 236.0, 224.0, 239.0, 226.0, 245.0, 249.0, 244.0, 265.0, 288.0], [3696.0, 2031.0, 1497.0, 1109.0, 939.0, 794.0, 633.0, 571.0, 528.0, 454.0, 464.0, 488.0, 417.0, 348.0, 333.0, 335.0, 365.0, 341.0, 326.0, 316.0, 309.0, 284.0, 309.0, 332.0, 271.0, 271.0, 251.0, 248.0, 236.0, 249.0, 279.0, 247.0, 230.0, 214.0, 266.0, 249.0, 217.0, 237.0, 219.0, 216.0, 201.0, 259.0, 216.0, 210.0, 246.0, 223.0, 253.0, 271.0, 273.0], [3658.0, 2066.0, 1454.0, 1114.0, 945.0, 754.0, 685.0, 596.0, 488.0, 471.0, 484.0, 428.0, 426.0, 379.0, 381.0, 361.0, 352.0, 315.0, 352.0, 325.0, 315.0, 285.0, 317.0, 281.0, 268.0, 244.0, 260.0, 262.0, 246.0, 245.0, 233.0, 240.0, 232.0, 227.0, 261.0, 218.0, 220.0, 229.0, 230.0, 244.0, 220.0, 221.0, 226.0, 225.0, 233.0, 228.0, 219.0, 251.0, 297.0], [3742.0, 2120.0, 1477.0, 1131.0, 908.0, 723.0, 648.0, 643.0, 517.0, 499.0, 480.0, 425.0, 399.0, 393.0, 379.0, 399.0, 324.0, 322.0, 354.0, 323.0, 279.0, 320.0, 301.0, 289.0, 257.0, 234.0, 268.0, 278.0, 219.0, 270.0, 235.0, 243.0, 242.0, 229.0, 238.0, 242.0, 223.0, 220.0, 218.0, 232.0, 222.0, 207.0, 252.0, 240.0, 234.0, 238.0, 231.0, 231.0, 269.0], [3628.0, 2074.0, 1457.0, 1175.0, 888.0, 795.0, 630.0, 605.0, 566.0, 508.0, 453.0, 434.0, 378.0, 424.0, 382.0, 359.0, 338.0, 354.0, 312.0, 287.0, 300.0, 302.0, 293.0, 294.0, 277.0, 277.0, 259.0, 244.0, 281.0, 243.0, 222.0, 256.0, 246.0, 214.0, 218.0, 220.0, 228.0, 227.0, 231.0, 238.0, 196.0, 228.0, 251.0, 231.0, 250.0, 233.0, 272.0, 249.0, 311.0], [3575.0, 2058.0, 1472.0, 1099.0, 947.0, 765.0, 697.0, 620.0, 564.0, 503.0, 446.0, 451.0, 393.0, 389.0, 394.0, 346.0, 345.0, 334.0, 321.0, 331.0, 305.0, 267.0, 286.0, 283.0, 263.0, 259.0, 258.0, 279.0, 255.0, 245.0, 251.0, 276.0, 241.0, 232.0, 239.0, 231.0, 244.0, 214.0, 232.0, 199.0, 226.0, 244.0, 221.0, 224.0, 222.0, 235.0, 255.0, 261.0, 293.0], [3589.0, 2033.0, 1475.0, 1199.0, 903.0, 789.0, 666.0, 603.0, 578.0, 503.0, 467.0, 453.0, 413.0, 385.0, 373.0, 388.0, 329.0, 315.0, 314.0, 314.0, 302.0, 294.0, 282.0, 275.0, 274.0, 278.0, 247.0, 254.0, 259.0, 267.0, 240.0, 257.0, 239.0, 234.0, 229.0, 239.0, 221.0, 231.0, 228.0, 204.0, 220.0, 231.0, 241.0, 231.0, 214.0, 236.0, 245.0, 244.0, 318.0], [3641.0, 2039.0, 1453.0, 1174.0, 955.0, 781.0, 693.0, 604.0, 527.0, 524.0, 471.0, 418.0, 448.0, 403.0, 369.0, 359.0, 318.0, 319.0, 333.0, 271.0, 297.0, 324.0, 292.0, 272.0, 262.0, 275.0, 275.0, 254.0, 239.0, 258.0, 257.0, 260.0, 245.0, 224.0, 250.0, 245.0, 235.0, 229.0, 215.0, 198.0, 217.0, 199.0, 223.0, 253.0, 230.0, 266.0, 227.0, 262.0, 284.0]],
    "Name": "sCurve-0",
    "Overflow": 2536053.0,
    "Type": "Histo2d",
    "Underflow": 0.0,
    "x": {
        "AxisTitle": "Vcal",
        "Bins": 51,
        "High": 302.5,
        "Low": 47.5
    },
    "y": {
        "AxisTitle": "Occupancy",
        "Bins": 49,
        "High": 49.5,
        "Low": 0.5
    },
    "z": {
        "AxisTitle": "Number of pixels"
    }
}