{
    "Data": [0.0, 0.0, 0.0, 0.0, 0.0, 0.0, 0.0, 0.0, 0.0, 0.0, 0.0, 0.0, 0.0, 0.0, 1.0, 0.0, 0.0, 0.0, 0.0, 0.0, 0.0, 1.0, 0.0, 0.0, 1.0, 1.0, 4.0, 4.0, 13.0, 6.0, 11.0, 19.0, 9.0, 11.0, 32.0, 44.0, 26.0, 192.0, 417.0, 437.0, 276.0, 610.0, 1409.0, 2793.0, 1964.0, 1349.0, 1956.0, 2973.0, 3481.0, 2874.0, 2276.0, 2064.0, 2557.0, 2084.0, 1729.0, 1515.0, 1515.0, 1660.0, 1497.0, 1336.0, 1071.0, 1033.0, 846.0, 701.0, 599.0, 630.0, 625.0, 537.0, 460.0, 398.0, 408.0, 371.0, 336.0, 306.0, 249.0, 270.0, 232.0, 228.0, 199.0, 183.0, 170.0, 185.0, 178.0, 131.0, 122.0, 111.0, 103.0, 96.0, 91.0, 91.0, 109.0, 82.0, 86.0, 67.0, 53.0, 65.0, 53.0, 47.0, 81.0, 57.0, 50.0, 50.0, 33.0, 37.0, 33.0, 35.0, 47.0, 45.0, 37.0, 41.0, 39.0, 21.0, 28.0, 17.0, 20.0, 20.0, 26.0, 24.0, 31.0, 18.0, 19.0, 26.0, 19.0, 6.0, 9.0, 6.0, 22.0, 11.0, 13.0, 9.0, 14.0, 7.0, 8.0, 11.0, 10.0, 9.0, 5.0, 12.0, 2.0, 8.0, 4.0, 5.0, 6.0, 7.0, 9.0, 5.0, 6.0, 7.0, 6.0, 3.0, 2.0, 12.0, 2.0, 4.0, 5.0, 4.0, 1.0, 4.0, 3.0, 4.0, 4.0, 4.0, 3.0, 1.0, 1.0, 2.0, 2.0, 3.0, 0.0, 3.0, 0.0, 1.0, 1.0, 2.0, 2.0, 5.0, 2.0, 2.0, 0.0, 0.0, 1.0, 1.0, 0.0, 2.0, 0.0, 1.0, 0.0, 2.0, 1.0, 2.0, 2.0, 3.0, 2.0, 4.0, 3.0, 1.0, 3.0, 1.0, 1.0, 2.0, 1.0],
    "Name": "TimePerFitDist-0",
    "Overflow": 150.0,
    "Type": "Histo1d",
    "Underflow": 0.0,
    "x": {
        "AxisTitle": "Fit Time [us]",
        "Bins": 201,
        "High": 401.0,
        "Low": -1.0
    },
    "y": {
        "AxisTitle": "Number of Pixels"
    },
    "z": {
        "AxisTitle": "z"
    }
}