{
    "Data": [21.0, 27.0, 1.0, 1.0, 8.0, 93.0, 484.0, 1487.0, 3014.0, 4310.0, 4466.0, 3790.0, 2897.0, 2547.0, 2321.0, 2215.0, 2063.0, 1966.0, 1857.0, 1902.0, 2007.0, 2409.0, 2391.0, 2276.0, 2047.0, 1540.0, 1129.0, 733.0, 513.0, 400.0, 370.0, 433.0, 574.0, 723.0, 1018.0, 1220.0, 1461.0, 1717.0, 1789.0, 1901.0, 2006.0, 1834.0, 1712.0, 1565.0, 1353.0, 1101.0, 917.0, 743.0, 588.0, 423.0, 318.0, 244.0, 192.0, 126.0, 90.0, 66.0, 76.0, 47.0, 48.0, 35.0, 27.0, 18.0, 20.0, 22.0, 15.0, 11.0, 13.0, 8.0, 14.0, 6.0, 9.0, 7.0, 2.0, 3.0, 4.0, 3.0, 2.0, 4.0, 6.0, 4.0, 2.0, 1.0, 1.0, 3.0, 2.0, 1.0, 0.0, 1.0, 0.0, 0.0],
    "Name": "NoiseDist-0",
    "Overflow": 15.0,
    "Type": "Histo1d",
    "Underflow": 0.0,
    "x": {
        "AxisTitle": "Noise [e]",
        "Bins": 90,
        "High": 451.0,
        "Low": -2.0
    },
    "y": {
        "AxisTitle": "Number of Pixels"
    },
    "z": {
        "AxisTitle": "z"
    }
}