{
    "Data": [[2397.0, 768.0, 381.0, 235.0, 136.0, 111.0, 86.0, 66.0, 63.0, 42.0, 38.0, 35.0, 17.0, 22.0, 28.0, 12.0, 15.0, 8.0, 10.0, 14.0, 13.0, 11.0, 11.0, 8.0, 12.0, 15.0, 6.0, 7.0, 12.0, 6.0, 7.0, 9.0, 7.0, 7.0, 8.0, 10.0, 3.0, 3.0, 7.0, 4.0, 11.0, 7.0, 5.0, 9.0, 8.0, 23.0, 14.0, 7.0, 12.0], [3376.0, 1299.0, 706.0, 440.0, 266.0, 185.0, 150.0, 109.0, 87.0, 62.0, 56.0, 61.0, 49.0, 36.0, 30.0, 19.0, 28.0, 25.0, 14.0, 18.0, 15.0, 13.0, 8.0, 17.0, 14.0, 9.0, 9.0, 15.0, 13.0, 12.0, 6.0, 9.0, 10.0, 11.0, 14.0, 7.0, 11.0, 10.0, 7.0, 10.0, 8.0, 9.0, 11.0, 7.0, 6.0, 7.0, 18.0, 14.0, 28.0], [4607.0, 2149.0, 1224.0, 750.0, 529.0, 390.0, 277.0, 196.0, 168.0, 144.0, 118.0, 97.0, 86.0, 80.0, 50.0, 40.0, 33.0, 31.0, 37.0, 19.0, 32.0, 26.0, 23.0, 21.0, 18.0, 16.0, 15.0, 14.0, 15.0, 12.0, 16.0, 14.0, 16.0, 12.0, 18.0, 16.0, 12.0, 8.0, 14.0, 14.0, 11.0, 8.0, 10.0, 14.0, 11.0, 12.0, 13.0, 18.0, 15.0], [5470.0, 2870.0, 1852.0, 1387.0, 943.0, 704.0, 584.0, 457.0, 350.0, 292.0, 249.0, 197.0, 165.0, 141.0, 120.0, 103.0, 89.0, 78.0, 70.0, 53.0, 47.0, 55.0, 54.0, 42.0, 32.0, 32.0, 28.0, 33.0, 29.0, 23.0, 23.0, 24.0, 26.0, 26.0, 26.0, 15.0, 20.0, 23.0, 17.0, 15.0, 12.0, 18.0, 16.0, 18.0, 15.0, 19.0, 14.0, 21.0, 27.0], [6087.0, 3321.0, 2390.0, 1780.0, 1436.0, 1199.0, 945.0, 869.0, 672.0, 551.0, 481.0, 452.0, 372.0, 339.0, 317.0, 262.0, 223.0, 173.0, 162.0, 162.0, 113.0, 119.0, 100.0, 102.0, 90.0, 90.0, 54.0, 64.0, 68.0, 53.0, 44.0, 47.0, 57.0, 31.0, 32.0, 34.0, 27.0, 35.0, 29.0, 30.0, 28.0, 31.0, 27.0, 22.0, 33.0, 27.0, 29.0, 31.0, 42.0], [8071.0, 4261.0, 2705.0, 2103.0, 1820.0, 1460.0, 1348.0, 1208.0, 965.0, 873.0, 811.0, 733.0, 660.0, 629.0, 520.0, 496.0, 436.0, 416.0, 385.0, 338.0, 316.0, 302.0, 235.0, 215.0, 201.0, 206.0, 154.0, 146.0, 141.0, 123.0, 114.0, 91.0, 126.0, 95.0, 84.0, 100.0, 65.0, 60.0, 53.0, 56.0, 57.0, 48.0, 44.0, 52.0, 49.0, 48.0, 46.0, 59.0, 63.0], [6317.0, 5307.0, 4300.0, 3479.0, 2840.0, 2244.0, 2023.0, 1637.0, 1420.0, 1260.0, 1202.0, 1068.0, 921.0, 863.0, 813.0, 773.0, 713.0, 630.0, 669.0, 563.0, 542.0, 534.0, 492.0, 428.0, 448.0, 372.0, 374.0, 355.0, 330.0, 327.0, 267.0, 298.0, 266.0, 235.0, 229.0, 207.0, 178.0, 156.0, 159.0, 143.0, 137.0, 122.0, 108.0, 103.0, 92.0, 85.0, 90.0, 85.0, 117.0], [1450.0, 1697.0, 2063.0, 2300.0, 2367.0, 2417.0, 2582.0, 2298.0, 2419.0, 2198.0, 2047.0, 2006.0, 1830.0, 1618.0, 1625.0, 1432.0, 1325.0, 1199.0, 1165.0, 1004.0, 976.0, 867.0, 825.0, 782.0, 704.0, 702.0, 670.0, 613.0, 586.0, 557.0, 573.0, 485.0, 470.0, 468.0, 434.0, 369.0, 442.0, 397.0, 337.0, 356.0, 341.0, 321.0, 291.0, 262.0, 258.0, 218.0, 207.0, 205.0, 213.0], [537.0, 357.0, 364.0, 400.0, 441.0, 495.0, 596.0, 802.0, 867.0, 1013.0, 995.0, 1186.0, 1321.0, 1439.0, 1466.0, 1580.0, 1600.0, 1587.0, 1628.0, 1648.0, 1696.0, 1730.0, 1657.0, 1672.0, 1590.0, 1545.0, 1548.0, 1522.0, 1449.0, 1350.0, 1229.0, 1167.0, 1143.0, 1064.0, 1002.0, 892.0, 883.0, 883.0, 751.0, 716.0, 718.0, 677.0, 643.0, 672.0, 560.0, 568.0, 504.0, 543.0, 502.0], [487.0, 194.0, 148.0, 136.0, 139.0, 144.0, 152.0, 177.0, 200.0, 213.0, 246.0, 244.0, 285.0, 334.0, 373.0, 428.0, 461.0, 484.0, 583.0, 671.0, 725.0, 792.0, 856.0, 943.0, 1071.0, 1135.0, 1230.0, 1275.0, 1407.0, 1522.0, 1533.0, 1640.0, 1725.0, 1803.0, 1885.0, 1925.0, 1951.0, 1966.0, 2058.0, 1987.0, 1991.0, 1925.0, 1858.0, 1747.0, 1595.0, 1542.0, 1473.0, 1394.0, 1320.0], [414.0, 173.0, 110.0, 85.0, 96.0, 69.0, 58.0, 73.0, 69.0, 68.0, 93.0, 83.0, 114.0, 118.0, 127.0, 149.0, 150.0, 167.0, 184.0, 184.0, 237.0, 232.0, 251.0, 282.0, 336.0, 365.0, 389.0, 484.0, 497.0, 523.0, 610.0, 667.0, 745.0, 884.0, 989.0, 1067.0, 1233.0, 1373.0, 1588.0, 1828.0, 2052.0, 2318.0, 2646.0, 2876.0, 3203.0, 3678.0, 4112.0, 4337.0, 4576.0], [413.0, 170.0, 100.0, 90.0, 48.0, 51.0, 41.0, 51.0, 35.0, 32.0, 44.0, 39.0, 46.0, 42.0, 50.0, 47.0, 67.0, 61.0, 83.0, 94.0, 73.0, 110.0, 101.0, 105.0, 131.0, 150.0, 173.0, 156.0, 194.0, 267.0, 248.0, 292.0, 292.0, 383.0, 376.0, 475.0, 535.0, 599.0, 694.0, 799.0, 945.0, 1079.0, 1346.0, 1638.0, 2225.0, 2880.0, 4032.0, 5636.0, 8808.0], [387.0, 156.0, 92.0, 66.0, 46.0, 59.0, 42.0, 31.0, 31.0, 23.0, 25.0, 31.0, 17.0, 22.0, 14.0, 22.0, 32.0, 27.0, 27.0, 31.0, 45.0, 42.0, 49.0, 74.0, 77.0, 63.0, 72.0, 70.0, 95.0, 97.0, 100.0, 154.0, 144.0, 176.0, 174.0, 222.0, 242.0, 271.0, 361.0, 406.0, 457.0, 578.0, 669.0, 914.0, 1162.0, 1550.0, 2233.0, 3670.0, 7752.0], [390.0, 147.0, 82.0, 60.0, 44.0, 37.0, 39.0, 33.0, 34.0, 24.0, 29.0, 22.0, 19.0, 7.0, 21.0, 12.0, 21.0, 16.0, 24.0, 18.0, 15.0, 16.0, 22.0, 27.0, 30.0, 31.0, 37.0, 33.0, 43.0, 54.0, 53.0, 68.0, 76.0, 93.0, 97.0, 108.0, 134.0, 134.0, 158.0, 212.0, 221.0, 285.0, 359.0, 458.0, 674.0, 880.0, 1340.0, 2211.0, 5213.0], [386.0, 138.0, 79.0, 56.0, 50.0, 32.0, 29.0, 38.0, 24.0, 25.0, 9.0, 21.0, 11.0, 17.0, 15.0, 20.0, 12.0, 19.0, 15.0, 11.0, 15.0, 14.0, 12.0, 12.0, 20.0, 16.0, 19.0, 16.0, 25.0, 32.0, 28.0, 25.0, 32.0, 34.0, 52.0, 47.0, 51.0, 86.0, 105.0, 91.0, 125.0, 156.0, 187.0, 231.0, 345.0, 470.0, 731.0, 1395.0, 3371.0], [392.0, 127.0, 79.0, 59.0, 52.0, 33.0, 34.0, 26.0, 16.0, 12.0, 13.0, 22.0, 16.0, 11.0, 12.0, 13.0, 10.0, 11.0, 10.0, 11.0, 4.0, 8.0, 15.0, 12.0, 9.0, 16.0, 18.0, 17.0, 8.0, 17.0, 22.0, 24.0, 23.0, 26.0, 23.0, 29.0, 41.0, 38.0, 41.0, 47.0, 83.0, 65.0, 106.0, 120.0, 202.0, 241.0, 420.0, 821.0, 2180.0], [342.0, 127.0, 73.0, 66.0, 43.0, 36.0, 33.0, 29.0, 22.0, 17.0, 21.0, 10.0, 10.0, 11.0, 8.0, 6.0, 9.0, 11.0, 7.0, 5.0, 13.0, 11.0, 7.0, 9.0, 4.0, 12.0, 4.0, 7.0, 18.0, 13.0, 20.0, 12.0, 22.0, 21.0, 28.0, 24.0, 20.0, 30.0, 34.0, 33.0, 37.0, 38.0, 65.0, 79.0, 89.0, 140.0, 224.0, 472.0, 1406.0], [375.0, 119.0, 61.0, 66.0, 50.0, 31.0, 31.0, 25.0, 19.0, 14.0, 20.0, 12.0, 12.0, 8.0, 5.0, 13.0, 7.0, 7.0, 10.0, 8.0, 6.0, 10.0, 7.0, 6.0, 6.0, 11.0, 7.0, 10.0, 7.0, 12.0, 10.0, 11.0, 9.0, 10.0, 10.0, 19.0, 16.0, 24.0, 29.0, 25.0, 19.0, 40.0, 30.0, 43.0, 64.0, 85.0, 127.0, 288.0, 853.0], [367.0, 119.0, 77.0, 54.0, 43.0, 23.0, 22.0, 22.0, 17.0, 16.0, 15.0, 12.0, 9.0, 6.0, 6.0, 5.0, 7.0, 6.0, 11.0, 6.0, 7.0, 12.0, 7.0, 7.0, 10.0, 1.0, 6.0, 8.0, 9.0, 7.0, 5.0, 5.0, 11.0, 8.0, 6.0, 12.0, 10.0, 13.0, 18.0, 24.0, 19.0, 22.0, 34.0, 32.0, 48.0, 77.0, 94.0, 158.0, 521.0], [371.0, 123.0, 70.0, 57.0, 47.0, 30.0, 20.0, 16.0, 18.0, 11.0, 18.0, 7.0, 12.0, 5.0, 3.0, 3.0, 3.0, 3.0, 6.0, 9.0, 5.0, 8.0, 6.0, 7.0, 5.0, 6.0, 10.0, 6.0, 9.0, 7.0, 7.0, 7.0, 8.0, 8.0, 13.0, 9.0, 10.0, 11.0, 9.0, 13.0, 12.0, 15.0, 18.0, 30.0, 41.0, 62.0, 55.0, 102.0, 359.0], [349.0, 135.0, 71.0, 53.0, 31.0, 36.0, 32.0, 19.0, 14.0, 18.0, 9.0, 5.0, 8.0, 5.0, 7.0, 6.0, 5.0, 6.0, 3.0, 6.0, 3.0, 3.0, 3.0, 3.0, 10.0, 4.0, 4.0, 6.0, 16.0, 5.0, 5.0, 4.0, 8.0, 6.0, 8.0, 7.0, 6.0, 12.0, 11.0, 7.0, 6.0, 15.0, 16.0, 22.0, 27.0, 35.0, 39.0, 88.0, 228.0], [385.0, 122.0, 78.0, 39.0, 38.0, 24.0, 27.0, 17.0, 17.0, 12.0, 10.0, 14.0, 10.0, 9.0, 11.0, 3.0, 4.0, 3.0, 4.0, 5.0, 5.0, 2.0, 5.0, 4.0, 2.0, 9.0, 3.0, 6.0, 6.0, 1.0, 6.0, 4.0, 8.0, 10.0, 6.0, 10.0, 7.0, 10.0, 7.0, 5.0, 8.0, 5.0, 16.0, 14.0, 18.0, 32.0, 31.0, 66.0, 150.0], [354.0, 121.0, 62.0, 60.0, 41.0, 28.0, 22.0, 23.0, 14.0, 11.0, 11.0, 8.0, 10.0, 3.0, 4.0, 8.0, 3.0, 4.0, 5.0, 3.0, 5.0, 2.0, 5.0, 4.0, 6.0, 1.0, 4.0, 2.0, 4.0, 6.0, 3.0, 6.0, 6.0, 3.0, 12.0, 5.0, 6.0, 5.0, 6.0, 8.0, 7.0, 3.0, 16.0, 14.0, 17.0, 16.0, 28.0, 51.0, 115.0], [352.0, 162.0, 68.0, 50.0, 35.0, 29.0, 22.0, 20.0, 14.0, 10.0, 14.0, 7.0, 10.0, 4.0, 3.0, 2.0, 6.0, 3.0, 6.0, 3.0, 2.0, 1.0, 5.0, 3.0, 3.0, 1.0, 4.0, 1.0, 3.0, 6.0, 5.0, 5.0, 4.0, 6.0, 1.0, 5.0, 5.0, 6.0, 4.0, 12.0, 5.0, 6.0, 10.0, 6.0, 10.0, 8.0, 30.0, 38.0, 106.0], [332.0, 141.0, 68.0, 52.0, 43.0, 31.0, 25.0, 16.0, 14.0, 9.0, 12.0, 7.0, 6.0, 7.0, 5.0, 5.0, 0.0, 4.0, 3.0, 4.0, 2.0, 5.0, 8.0, 2.0, 1.0, 4.0, 2.0, 3.0, 4.0, 6.0, 4.0, 11.0, 4.0, 2.0, 5.0, 3.0, 3.0, 5.0, 2.0, 4.0, 5.0, 3.0, 5.0, 10.0, 4.0, 8.0, 13.0, 32.0, 90.0], [375.0, 135.0, 79.0, 50.0, 47.0, 32.0, 25.0, 14.0, 17.0, 16.0, 9.0, 5.0, 2.0, 2.0, 2.0, 3.0, 4.0, 5.0, 2.0, 2.0, 3.0, 1.0, 6.0, 3.0, 2.0, 2.0, 1.0, 2.0, 3.0, 2.0, 5.0, 9.0, 4.0, 5.0, 1.0, 2.0, 3.0, 2.0, 5.0, 4.0, 5.0, 5.0, 10.0, 5.0, 6.0, 6.0, 8.0, 26.0, 75.0], [365.0, 145.0, 80.0, 36.0, 38.0, 26.0, 21.0, 13.0, 13.0, 15.0, 11.0, 12.0, 13.0, 6.0, 4.0, 5.0, 6.0, 0.0, 4.0, 4.0, 3.0, 1.0, 3.0, 4.0, 3.0, 2.0, 6.0, 0.0, 2.0, 2.0, 2.0, 1.0, 3.0, 6.0, 0.0, 4.0, 4.0, 6.0, 4.0, 2.0, 5.0, 6.0, 10.0, 5.0, 5.0, 7.0, 5.0, 16.0, 52.0], [365.0, 134.0, 61.0, 42.0, 39.0, 33.0, 25.0, 19.0, 16.0, 12.0, 13.0, 9.0, 8.0, 4.0, 4.0, 2.0, 2.0, 3.0, 4.0, 2.0, 3.0, 2.0, 4.0, 5.0, 1.0, 1.0, 2.0, 6.0, 2.0, 1.0, 6.0, 1.0, 2.0, 5.0, 1.0, 3.0, 4.0, 6.0, 6.0, 2.0, 4.0, 0.0, 4.0, 4.0, 5.0, 8.0, 6.0, 15.0, 39.0], [331.0, 128.0, 90.0, 47.0, 46.0, 33.0, 22.0, 15.0, 13.0, 10.0, 10.0, 5.0, 4.0, 5.0, 5.0, 0.0, 6.0, 5.0, 9.0, 1.0, 1.0, 2.0, 4.0, 5.0, 3.0, 2.0, 3.0, 3.0, 1.0, 1.0, 2.0, 6.0, 5.0, 5.0, 4.0, 2.0, 3.0, 7.0, 1.0, 0.0, 4.0, 5.0, 1.0, 3.0, 5.0, 7.0, 3.0, 14.0, 23.0], [374.0, 128.0, 89.0, 46.0, 40.0, 17.0, 24.0, 16.0, 20.0, 9.0, 10.0, 6.0, 5.0, 11.0, 8.0, 2.0, 4.0, 2.0, 3.0, 3.0, 3.0, 3.0, 6.0, 4.0, 3.0, 0.0, 1.0, 3.0, 5.0, 2.0, 3.0, 3.0, 5.0, 2.0, 1.0, 6.0, 2.0, 3.0, 6.0, 1.0, 1.0, 5.0, 2.0, 3.0, 3.0, 3.0, 3.0, 10.0, 20.0], [364.0, 110.0, 74.0, 55.0, 36.0, 28.0, 21.0, 25.0, 22.0, 9.0, 11.0, 10.0, 5.0, 5.0, 3.0, 7.0, 6.0, 2.0, 2.0, 3.0, 2.0, 2.0, 1.0, 2.0, 5.0, 2.0, 4.0, 2.0, 2.0, 3.0, 1.0, 5.0, 3.0, 4.0, 2.0, 3.0, 1.0, 1.0, 6.0, 1.0, 1.0, 4.0, 3.0, 3.0, 2.0, 3.0, 2.0, 5.0, 16.0], [381.0, 119.0, 81.0, 54.0, 35.0, 28.0, 25.0, 9.0, 11.0, 14.0, 15.0, 5.0, 9.0, 4.0, 4.0, 10.0, 3.0, 2.0, 4.0, 1.0, 6.0, 0.0, 6.0, 2.0, 1.0, 3.0, 2.0, 4.0, 1.0, 3.0, 1.0, 3.0, 3.0, 2.0, 5.0, 4.0, 4.0, 0.0, 2.0, 0.0, 3.0, 5.0, 2.0, 4.0, 3.0, 3.0, 1.0, 7.0, 22.0], [359.0, 145.0, 67.0, 56.0, 41.0, 25.0, 23.0, 19.0, 14.0, 9.0, 13.0, 9.0, 8.0, 5.0, 6.0, 5.0, 2.0, 1.0, 1.0, 3.0, 1.0, 2.0, 2.0, 2.0, 2.0, 6.0, 2.0, 1.0, 4.0, 0.0, 2.0, 4.0, 3.0, 4.0, 4.0, 5.0, 2.0, 2.0, 4.0, 2.0, 4.0, 2.0, 2.0, 2.0, 1.0, 5.0, 3.0, 3.0, 13.0], [334.0, 111.0, 88.0, 48.0, 43.0, 25.0, 33.0, 19.0, 14.0, 11.0, 9.0, 7.0, 11.0, 6.0, 1.0, 4.0, 4.0, 4.0, 2.0, 5.0, 1.0, 1.0, 1.0, 2.0, 2.0, 2.0, 5.0, 1.0, 5.0, 6.0, 3.0, 3.0, 5.0, 2.0, 1.0, 3.0, 1.0, 1.0, 5.0, 1.0, 1.0, 1.0, 2.0, 5.0, 2.0, 3.0, 3.0, 4.0, 11.0], [355.0, 126.0, 76.0, 42.0, 42.0, 26.0, 29.0, 21.0, 17.0, 16.0, 6.0, 6.0, 5.0, 5.0, 8.0, 5.0, 3.0, 1.0, 1.0, 5.0, 5.0, 4.0, 1.0, 4.0, 2.0, 4.0, 3.0, 6.0, 1.0, 2.0, 3.0, 1.0, 4.0, 1.0, 4.0, 0.0, 3.0, 2.0, 3.0, 3.0, 3.0, 1.0, 2.0, 3.0, 0.0, 2.0, 1.0, 2.0, 18.0], [353.0, 120.0, 67.0, 40.0, 44.0, 31.0, 25.0, 19.0, 20.0, 11.0, 14.0, 7.0, 9.0, 9.0, 5.0, 5.0, 4.0, 4.0, 2.0, 5.0, 1.0, 3.0, 1.0, 2.0, 0.0, 7.0, 2.0, 3.0, 4.0, 0.0, 2.0, 2.0, 1.0, 0.0, 3.0, 3.0, 2.0, 4.0, 4.0, 1.0, 2.0, 3.0, 4.0, 2.0, 5.0, 4.0, 0.0, 3.0, 18.0], [376.0, 131.0, 66.0, 48.0, 44.0, 23.0, 24.0, 22.0, 17.0, 16.0, 16.0, 7.0, 8.0, 2.0, 4.0, 0.0, 5.0, 0.0, 5.0, 4.0, 2.0, 3.0, 2.0, 1.0, 3.0, 2.0, 1.0, 6.0, 2.0, 6.0, 3.0, 1.0, 4.0, 1.0, 1.0, 3.0, 3.0, 5.0, 2.0, 2.0, 3.0, 2.0, 2.0, 0.0, 0.0, 3.0, 2.0, 3.0, 18.0], [383.0, 116.0, 74.0, 57.0, 45.0, 27.0, 30.0, 18.0, 11.0, 11.0, 10.0, 7.0, 7.0, 8.0, 5.0, 5.0, 3.0, 2.0, 2.0, 4.0, 0.0, 0.0, 1.0, 2.0, 3.0, 7.0, 4.0, 1.0, 3.0, 3.0, 1.0, 3.0, 1.0, 4.0, 2.0, 4.0, 0.0, 2.0, 6.0, 4.0, 4.0, 2.0, 2.0, 2.0, 0.0, 5.0, 3.0, 4.0, 6.0], [366.0, 129.0, 74.0, 53.0, 37.0, 30.0, 22.0, 21.0, 13.0, 19.0, 13.0, 7.0, 7.0, 4.0, 3.0, 5.0, 1.0, 9.0, 3.0, 2.0, 1.0, 3.0, 2.0, 2.0, 5.0, 1.0, 1.0, 1.0, 5.0, 0.0, 2.0, 1.0, 2.0, 3.0, 9.0, 3.0, 0.0, 2.0, 2.0, 2.0, 3.0, 1.0, 3.0, 3.0, 1.0, 2.0, 1.0, 4.0, 9.0], [392.0, 130.0, 69.0, 49.0, 32.0, 38.0, 16.0, 14.0, 21.0, 16.0, 17.0, 2.0, 11.0, 6.0, 5.0, 5.0, 6.0, 2.0, 1.0, 3.0, 3.0, 0.0, 2.0, 4.0, 1.0, 4.0, 2.0, 1.0, 4.0, 2.0, 6.0, 2.0, 2.0, 2.0, 3.0, 1.0, 1.0, 4.0, 4.0, 2.0, 2.0, 4.0, 1.0, 3.0, 2.0, 2.0, 2.0, 4.0, 15.0], [356.0, 108.0, 71.0, 58.0, 44.0, 24.0, 24.0, 23.0, 8.0, 9.0, 11.0, 6.0, 8.0, 4.0, 4.0, 6.0, 3.0, 1.0, 4.0, 3.0, 2.0, 2.0, 3.0, 6.0, 1.0, 7.0, 2.0, 3.0, 4.0, 4.0, 2.0, 2.0, 3.0, 3.0, 3.0, 2.0, 2.0, 5.0, 1.0, 1.0, 0.0, 2.0, 5.0, 1.0, 3.0, 3.0, 1.0, 7.0, 9.0], [359.0, 133.0, 73.0, 52.0, 40.0, 28.0, 27.0, 12.0, 12.0, 11.0, 17.0, 8.0, 7.0, 6.0, 3.0, 6.0, 3.0, 3.0, 0.0, 4.0, 1.0, 4.0, 2.0, 1.0, 1.0, 1.0, 3.0, 5.0, 5.0, 2.0, 6.0, 4.0, 4.0, 3.0, 2.0, 1.0, 0.0, 5.0, 2.0, 2.0, 3.0, 2.0, 3.0, 5.0, 5.0, 4.0, 1.0, 4.0, 9.0], [379.0, 130.0, 59.0, 76.0, 27.0, 21.0, 32.0, 24.0, 15.0, 15.0, 5.0, 6.0, 10.0, 8.0, 4.0, 1.0, 4.0, 0.0, 2.0, 2.0, 2.0, 1.0, 1.0, 2.0, 3.0, 3.0, 2.0, 5.0, 1.0, 2.0, 6.0, 4.0, 1.0, 6.0, 1.0, 6.0, 4.0, 4.0, 0.0, 3.0, 2.0, 4.0, 4.0, 1.0, 3.0, 4.0, 3.0, 2.0, 20.0], [364.0, 125.0, 78.0, 49.0, 33.0, 34.0, 24.0, 17.0, 16.0, 11.0, 10.0, 6.0, 5.0, 8.0, 6.0, 8.0, 2.0, 5.0, 3.0, 0.0, 2.0, 4.0, 4.0, 2.0, 1.0, 1.0, 2.0, 1.0, 10.0, 0.0, 4.0, 3.0, 3.0, 1.0, 1.0, 2.0, 3.0, 2.0, 4.0, 4.0, 3.0, 3.0, 2.0, 5.0, 2.0, 2.0, 1.0, 8.0, 14.0], [346.0, 129.0, 69.0, 59.0, 40.0, 26.0, 20.0, 25.0, 9.0, 12.0, 9.0, 7.0, 14.0, 4.0, 3.0, 2.0, 0.0, 1.0, 2.0, 2.0, 2.0, 1.0, 4.0, 4.0, 2.0, 2.0, 4.0, 3.0, 7.0, 3.0, 0.0, 1.0, 4.0, 2.0, 1.0, 4.0, 5.0, 5.0, 4.0, 5.0, 2.0, 5.0, 1.0, 4.0, 3.0, 3.0, 2.0, 4.0, 11.0], [384.0, 114.0, 73.0, 52.0, 31.0, 32.0, 24.0, 23.0, 16.0, 18.0, 14.0, 5.0, 7.0, 3.0, 5.0, 0.0, 4.0, 3.0, 4.0, 4.0, 2.0, 4.0, 3.0, 5.0, 5.0, 5.0, 2.0, 3.0, 0.0, 2.0, 3.0, 2.0, 4.0, 2.0, 2.0, 3.0, 0.0, 4.0, 5.0, 1.0, 4.0, 5.0, 6.0, 2.0, 3.0, 3.0, 2.0, 6.0, 14.0], [359.0, 126.0, 80.0, 40.0, 33.0, 33.0, 13.0, 27.0, 14.0, 6.0, 11.0, 8.0, 5.0, 5.0, 7.0, 8.0, 5.0, 1.0, 1.0, 6.0, 1.0, 4.0, 3.0, 3.0, 4.0, 1.0, 3.0, 2.0, 2.0, 5.0, 5.0, 1.0, 1.0, 2.0, 3.0, 4.0, 4.0, 2.0, 4.0, 2.0, 1.0, 2.0, 1.0, 3.0, 2.0, 2.0, 4.0, 1.0, 14.0], [331.0, 146.0, 60.0, 53.0, 33.0, 31.0, 13.0, 16.0, 14.0, 18.0, 11.0, 12.0, 8.0, 7.0, 6.0, 3.0, 3.0, 7.0, 2.0, 2.0, 1.0, 1.0, 3.0, 5.0, 2.0, 3.0, 4.0, 2.0, 5.0, 3.0, 3.0, 0.0, 3.0, 7.0, 1.0, 3.0, 4.0, 1.0, 4.0, 3.0, 2.0, 2.0, 4.0, 2.0, 2.0, 2.0, 2.0, 4.0, 15.0], [361.0, 134.0, 66.0, 60.0, 39.0, 19.0, 16.0, 19.0, 19.0, 8.0, 10.0, 7.0, 5.0, 4.0, 10.0, 5.0, 5.0, 3.0, 2.0, 1.0, 0.0, 3.0, 3.0, 1.0, 3.0, 1.0, 2.0, 4.0, 3.0, 5.0, 4.0, 3.0, 2.0, 2.0, 3.0, 5.0, 4.0, 3.0, 2.0, 3.0, 3.0, 8.0, 2.0, 1.0, 3.0, 2.0, 3.0, 1.0, 16.0], [352.0, 120.0, 77.0, 50.0, 40.0, 29.0, 21.0, 17.0, 11.0, 14.0, 5.0, 15.0, 5.0, 2.0, 6.0, 3.0, 3.0, 2.0, 7.0, 1.0, 4.0, 2.0, 2.0, 3.0, 3.0, 2.0, 3.0, 4.0, 4.0, 4.0, 4.0, 0.0, 4.0, 7.0, 3.0, 2.0, 2.0, 3.0, 1.0, 3.0, 1.0, 1.0, 5.0, 1.0, 4.0, 1.0, 7.0, 5.0, 12.0], [382.0, 136.0, 76.0, 45.0, 32.0, 32.0, 31.0, 21.0, 4.0, 20.0, 2.0, 7.0, 5.0, 1.0, 6.0, 6.0, 3.0, 6.0, 6.0, 3.0, 1.0, 3.0, 2.0, 6.0, 1.0, 4.0, 5.0, 2.0, 4.0, 5.0, 2.0, 1.0, 5.0, 3.0, 3.0, 4.0, 4.0, 3.0, 1.0, 2.0, 5.0, 2.0, 1.0, 2.0, 0.0, 3.0, 1.0, 4.0, 13.0]],
    "Name": "sCurve-0",
    "Overflow": 1994328.0,
    "Type": "Histo2d",
    "Underflow": 0.0,
    "x": {
        "AxisTitle": "Vcal",
        "Bins": 51,
        "High": 302.5,
        "Low": 47.5
    },
    "y": {
        "AxisTitle": "Occupancy",
        "Bins": 49,
        "High": 49.5,
        "Low": 0.5
    },
    "z": {
        "AxisTitle": "Number of pixels"
    }
}