time,Hardware,Voltage,Current
1621993056081,high-voltage,5.99543e-08,0.0604543
time,Hardware,Voltage,Current
1621993056081,high-voltage,2,0.116634
time,Hardware,Voltage,Current
1621993056081,high-voltage,3,0.204262
time,Hardware,Voltage,Current
1621993056081,high-voltage,4,0.320068
time,Hardware,Voltage,Current
1621993056081,high-voltage,5,0.456381
time,Hardware,Voltage,Current
1621993056081,high-voltage,6,0.606586
time,Hardware,Voltage,Current
1621993056081,high-voltage,7,0.845531
time,Hardware,Voltage,Current
1621993056081,high-voltage,8,1.1237
time,Hardware,Voltage,Current
1621993056081,high-voltage,9,1.53757
time,Hardware,Voltage,Current
1621993056081,high-voltage,10,1.81227
time,Hardware,Voltage,Current
1621993056081,high-voltage,11,2.34251
time,Hardware,Voltage,Current
1621993056081,high-voltage,12,3.00685
time,Hardware,Voltage,Current
1621993056081,high-voltage,13,3.7031
time,Hardware,Voltage,Current
1621993056081,high-voltage,14,4.51116
time,Hardware,Voltage,Current
1621993056081,high-voltage,15,5.35785
time,Hardware,Voltage,Current
1621993056081,high-voltage,16,6.48251
time,Hardware,Voltage,Current
1621993056081,high-voltage,17,7.65109
time,Hardware,Voltage,Current
1621993056081,high-voltage,18,8.75963
time,Hardware,Voltage,Current
1621993056081,high-voltage,19,9.60695
time,Hardware,Voltage,Current
1621993056081,high-voltage,20,10.0001
