time,Hardware,Voltage,Current
1623307609088,high-voltage,1,0.0607294
time,Hardware,Voltage,Current
1623307609088,high-voltage,2,0.0756286
time,Hardware,Voltage,Current
1623307609088,high-voltage,3,0.0893305
time,Hardware,Voltage,Current
1623307609088,high-voltage,4,0.100551
time,Hardware,Voltage,Current
1623307609088,high-voltage,5,0.110982
time,Hardware,Voltage,Current
1623307609088,high-voltage,6,0.122035
time,Hardware,Voltage,Current
1623307609088,high-voltage,7,0.133758
time,Hardware,Voltage,Current
1623307609088,high-voltage,8,0.145044
time,Hardware,Voltage,Current
1623307609088,high-voltage,9,0.155193
time,Hardware,Voltage,Current
1623307609088,high-voltage,10,0.163745
time,Hardware,Voltage,Current
1623307609088,high-voltage,11,0.171718
time,Hardware,Voltage,Current
1623307609088,high-voltage,12,0.179679
time,Hardware,Voltage,Current
1623307609088,high-voltage,13,0.185031
time,Hardware,Voltage,Current
1623307609088,high-voltage,14,0.19189
time,Hardware,Voltage,Current
1623307609088,high-voltage,15,0.197673
