{
    "Data": [0.0, 0.0, 0.0, 0.0, 0.0, 0.0, 0.0, 0.0, 0.0, 0.0, 0.0, 0.0, 0.0, 0.0, 4.0, 0.0, 0.0, 36.0, 163.0, 50.0, 179.0, 1525.0, 2805.0, 1311.0, 1574.0, 2813.0, 3454.0, 1616.0, 1062.0, 1664.0, 1881.0, 981.0, 553.0, 586.0, 678.0, 453.0, 474.0, 1351.0, 1737.0, 1096.0, 717.0, 2128.0, 3958.0, 4196.0, 1896.0, 1844.0, 3582.0, 3929.0, 3165.0, 1720.0, 2008.0, 2367.0, 2916.0, 1485.0, 1127.0, 1264.0, 1172.0, 1197.0, 708.0, 717.0, 682.0, 823.0, 597.0, 413.0, 435.0, 392.0, 473.0, 317.0, 289.0, 255.0, 238.0, 253.0, 193.0, 164.0, 146.0, 161.0, 128.0, 107.0, 95.0, 82.0, 93.0, 82.0, 76.0, 50.0, 50.0, 64.0, 50.0, 33.0, 26.0, 30.0, 36.0, 31.0, 43.0, 29.0, 26.0, 24.0, 13.0, 16.0, 12.0, 16.0, 16.0, 14.0, 9.0, 13.0, 4.0, 13.0, 6.0, 13.0, 7.0, 10.0, 6.0, 4.0, 4.0, 6.0, 6.0, 5.0, 0.0, 1.0, 2.0, 2.0, 3.0, 6.0, 3.0, 3.0, 2.0, 6.0, 0.0, 1.0, 2.0, 0.0, 1.0, 1.0, 2.0, 2.0, 3.0, 1.0, 1.0, 0.0, 0.0, 2.0, 3.0, 3.0, 1.0, 1.0, 1.0, 0.0, 1.0, 0.0, 2.0, 1.0, 4.0, 0.0, 0.0, 0.0, 0.0, 0.0, 1.0, 2.0, 0.0, 0.0, 0.0, 1.0, 0.0, 2.0, 0.0, 0.0, 0.0, 0.0, 0.0, 2.0, 0.0, 1.0, 1.0, 0.0, 0.0, 1.0, 0.0, 0.0, 1.0, 0.0, 0.0, 1.0, 0.0, 0.0, 0.0, 0.0, 0.0, 1.0, 0.0, 0.0, 0.0, 0.0, 0.0, 0.0, 0.0, 0.0, 0.0, 0.0, 0.0, 0.0, 0.0],
    "Name": "TimePerFitDist-0",
    "Overflow": 47.0,
    "Type": "Histo1d",
    "Underflow": 0.0,
    "x": {
        "AxisTitle": "Fit Time [us]",
        "Bins": 201,
        "High": 401.0,
        "Low": -1.0
    },
    "y": {
        "AxisTitle": "Number of Pixels"
    },
    "z": {
        "AxisTitle": "z"
    }
}