time,Hardware,Voltage,Current
1623350826983,high-voltage,1,0.0701136
time,Hardware,Voltage,Current
1623350826983,high-voltage,2,0.0890941
time,Hardware,Voltage,Current
1623350826983,high-voltage,3,0.105186
time,Hardware,Voltage,Current
1623350826983,high-voltage,4,0.118088
time,Hardware,Voltage,Current
1623350826983,high-voltage,5,0.1295
time,Hardware,Voltage,Current
1623350826983,high-voltage,6,0.13961
time,Hardware,Voltage,Current
1623350826983,high-voltage,7,0.148976
time,Hardware,Voltage,Current
1623350826983,high-voltage,8,0.15805
time,Hardware,Voltage,Current
1623350826983,high-voltage,9,0.166804
time,Hardware,Voltage,Current
1623350826983,high-voltage,10,0.174642
time,Hardware,Voltage,Current
1623350826983,high-voltage,11,0.182916
time,Hardware,Voltage,Current
1623350826983,high-voltage,12,0.189777
time,Hardware,Voltage,Current
1623350826983,high-voltage,13,0.196307
time,Hardware,Voltage,Current
1623350826983,high-voltage,14,0.201509
time,Hardware,Voltage,Current
1623350826983,high-voltage,15,0.20755
time,Hardware,Voltage,Current
1623350826983,high-voltage,16,0.211815
time,Hardware,Voltage,Current
1623350826983,high-voltage,17,0.216969
time,Hardware,Voltage,Current
1623350826983,high-voltage,18,0.22048
time,Hardware,Voltage,Current
1623350826983,high-voltage,19,0.224378
time,Hardware,Voltage,Current
1623350826983,high-voltage,20,0.230115
time,Hardware,Voltage,Current
1623350826983,high-voltage,2.51743e-07,0.251517
time,Hardware,Voltage,Current
1623350826983,high-voltage,30,0.284052
time,Hardware,Voltage,Current
1623350826983,high-voltage,35,0.374482
time,Hardware,Voltage,Current
1623350826983,high-voltage,40,0.6462
time,Hardware,Voltage,Current
1623350826983,high-voltage,45,1.1307
time,Hardware,Voltage,Current
1623350826983,high-voltage,50,1.76583
time,Hardware,Voltage,Current
1623350826983,high-voltage,55,2.53641
time,Hardware,Voltage,Current
1623350826983,high-voltage,60,3.4353
time,Hardware,Voltage,Current
1623350826983,high-voltage,4.46552e-06,4.46733
time,Hardware,Voltage,Current
1623350826983,high-voltage,70,5.63192
time,Hardware,Voltage,Current
1623350826983,high-voltage,75,6.94287
time,Hardware,Voltage,Current
1623350826983,high-voltage,80,8.4006
time,Hardware,Voltage,Current
1623350826983,high-voltage,85,10
