time,Hardware,Voltage,Current
1625794439696,high-voltage-4,1,1.39776
time,Hardware,Voltage,Current
1625794439696,high-voltage-4,2,1.73957
time,Hardware,Voltage,Current
1625794439696,high-voltage-4,3,2.00209
time,Hardware,Voltage,Current
1625794439696,high-voltage-4,4,2.19009
time,Hardware,Voltage,Current
1625794439696,high-voltage-4,5,2.3198
time,Hardware,Voltage,Current
1625794439696,high-voltage-4,6,2.41755
time,Hardware,Voltage,Current
1625794439696,high-voltage-4,7,2.50454
time,Hardware,Voltage,Current
1625794439696,high-voltage-4,8,2.59867
time,Hardware,Voltage,Current
1625794439696,high-voltage-4,9,2.69861
time,Hardware,Voltage,Current
1625794439696,high-voltage-4,10,2.80765
time,Hardware,Voltage,Current
1625794439696,high-voltage-4,11,2.93036
time,Hardware,Voltage,Current
1625794439696,high-voltage-4,12,3.06592
time,Hardware,Voltage,Current
1625794439696,high-voltage-4,13,3.21265
time,Hardware,Voltage,Current
1625794439696,high-voltage-4,14,3.37033
time,Hardware,Voltage,Current
1625794439696,high-voltage-4,15,3.5378
time,Hardware,Voltage,Current
1625794439696,high-voltage-4,16,3.70829
time,Hardware,Voltage,Current
1625794439696,high-voltage-4,17,3.88264
time,Hardware,Voltage,Current
1625794439696,high-voltage-4,18,4.05841
time,Hardware,Voltage,Current
1625794439696,high-voltage-4,19,4.23942
time,Hardware,Voltage,Current
1625794439696,high-voltage-4,20,4.42559
time,Hardware,Voltage,Current
1625794439696,high-voltage-4,25,5.16029
time,Hardware,Voltage,Current
1625794439696,high-voltage-4,30,5.68987
time,Hardware,Voltage,Current
1625794439696,high-voltage-4,35,6.15357
time,Hardware,Voltage,Current
1625794439696,high-voltage-4,40,6.59891
time,Hardware,Voltage,Current
1625794439696,high-voltage-4,45,7.05698
time,Hardware,Voltage,Current
1625794439696,high-voltage-4,50,7.54277
time,Hardware,Voltage,Current
1625794439696,high-voltage-4,55,8.07897
time,Hardware,Voltage,Current
1625794439696,high-voltage-4,60,8.67158
time,Hardware,Voltage,Current
1625794439696,high-voltage-4,65,9.34919
time,Hardware,Voltage,Current
1625794439696,high-voltage-4,70,9.99974
time,Hardware,Voltage,Current
1625794439696,high-voltage-4,75,9.99978
time,Hardware,Voltage,Current
1625794439696,high-voltage-4,80,9.9998
time,Hardware,Voltage,Current
1625794439696,high-voltage-4,85,9.99976
time,Hardware,Voltage,Current
1625794439696,high-voltage-4,90,9.99971
time,Hardware,Voltage,Current
1625794439696,high-voltage-4,95,9.99976
time,Hardware,Voltage,Current
1625794439696,high-voltage-4,100,9.99972
