{
    "Data": [731.0, 17761.0, 21394.0, 10383.0, 5169.0, 3824.0, 3559.0, 3258.0, 2747.0, 2093.0, 1489.0, 983.0, 667.0, 432.0, 288.0, 182.0, 160.0, 109.0, 99.0, 86.0, 64.0, 88.0, 76.0, 78.0, 89.0, 67.0, 53.0, 61.0, 57.0, 48.0, 39.0, 41.0, 41.0, 43.0, 35.0, 23.0, 15.0, 17.0, 13.0, 26.0, 11.0, 14.0, 14.0, 13.0, 10.0, 14.0, 15.0, 14.0, 4.0, 4.0, 3.0],
    "Name": "Chi2Dist-0",
    "Overflow": 0.0,
    "Type": "Histo1d",
    "Underflow": 0.0,
    "x": {
        "AxisTitle": "Fit Chi/ndf",
        "Bins": 51,
        "High": 2.5250000953674318,
        "Low": -0.02500000037252903
    },
    "y": {
        "AxisTitle": "Number of Pixels"
    },
    "z": {
        "AxisTitle": "z"
    }
}