{
    "Data": [[318.0, 147.0, 111.0, 62.0, 38.0, 37.0, 23.0, 20.0, 9.0, 13.0, 8.0, 11.0, 7.0, 15.0, 8.0, 7.0, 10.0, 16.0, 4.0, 7.0, 6.0, 4.0, 6.0, 7.0, 10.0, 5.0, 4.0, 2.0, 8.0, 5.0, 5.0, 5.0, 5.0, 4.0, 4.0, 2.0, 4.0, 6.0, 1.0, 4.0, 4.0, 3.0, 6.0, 1.0, 7.0, 2.0, 5.0, 6.0, 14.0], [615.0, 206.0, 117.0, 67.0, 36.0, 30.0, 17.0, 24.0, 11.0, 17.0, 6.0, 14.0, 9.0, 15.0, 12.0, 16.0, 8.0, 11.0, 11.0, 10.0, 4.0, 10.0, 5.0, 8.0, 4.0, 8.0, 15.0, 4.0, 9.0, 4.0, 2.0, 5.0, 6.0, 4.0, 3.0, 3.0, 10.0, 0.0, 5.0, 6.0, 3.0, 4.0, 7.0, 3.0, 3.0, 3.0, 10.0, 7.0, 13.0], [1367.0, 393.0, 193.0, 117.0, 64.0, 52.0, 32.0, 26.0, 17.0, 20.0, 13.0, 11.0, 6.0, 12.0, 15.0, 8.0, 8.0, 7.0, 8.0, 4.0, 8.0, 4.0, 12.0, 12.0, 11.0, 6.0, 10.0, 8.0, 9.0, 13.0, 6.0, 9.0, 12.0, 7.0, 9.0, 4.0, 4.0, 9.0, 7.0, 3.0, 3.0, 5.0, 5.0, 8.0, 4.0, 9.0, 6.0, 5.0, 12.0], [2997.0, 889.0, 426.0, 233.0, 151.0, 107.0, 71.0, 55.0, 52.0, 23.0, 27.0, 24.0, 24.0, 12.0, 15.0, 9.0, 13.0, 17.0, 13.0, 5.0, 10.0, 5.0, 12.0, 7.0, 7.0, 9.0, 7.0, 13.0, 5.0, 4.0, 6.0, 9.0, 4.0, 9.0, 5.0, 3.0, 10.0, 10.0, 12.0, 6.0, 10.0, 15.0, 8.0, 3.0, 8.0, 10.0, 7.0, 9.0, 13.0], [5718.0, 2390.0, 1149.0, 657.0, 452.0, 272.0, 211.0, 152.0, 114.0, 106.0, 63.0, 62.0, 45.0, 49.0, 33.0, 40.0, 18.0, 24.0, 18.0, 22.0, 26.0, 15.0, 17.0, 9.0, 16.0, 12.0, 15.0, 8.0, 10.0, 5.0, 7.0, 6.0, 6.0, 8.0, 3.0, 9.0, 7.0, 3.0, 10.0, 2.0, 11.0, 13.0, 12.0, 14.0, 10.0, 14.0, 23.0, 13.0, 22.0], [9697.0, 4767.0, 2842.0, 1844.0, 1273.0, 833.0, 699.0, 478.0, 339.0, 301.0, 262.0, 191.0, 174.0, 136.0, 132.0, 91.0, 106.0, 69.0, 86.0, 65.0, 61.0, 49.0, 41.0, 25.0, 30.0, 28.0, 31.0, 29.0, 25.0, 18.0, 14.0, 12.0, 13.0, 15.0, 7.0, 11.0, 11.0, 11.0, 13.0, 8.0, 5.0, 11.0, 9.0, 7.0, 9.0, 11.0, 16.0, 23.0, 35.0], [7492.0, 6617.0, 5557.0, 4471.0, 3412.0, 2811.0, 2232.0, 1756.0, 1475.0, 1143.0, 963.0, 739.0, 605.0, 528.0, 390.0, 377.0, 304.0, 236.0, 220.0, 208.0, 205.0, 149.0, 125.0, 115.0, 118.0, 91.0, 88.0, 96.0, 87.0, 68.0, 73.0, 47.0, 48.0, 42.0, 33.0, 40.0, 38.0, 27.0, 20.0, 29.0, 23.0, 20.0, 19.0, 24.0, 17.0, 18.0, 21.0, 18.0, 38.0], [1469.0, 1624.0, 1972.0, 2279.0, 2413.0, 2709.0, 2738.0, 2784.0, 2660.0, 2647.0, 2569.0, 2481.0, 2349.0, 2139.0, 1988.0, 1787.0, 1600.0, 1422.0, 1254.0, 1179.0, 1002.0, 858.0, 698.0, 641.0, 561.0, 494.0, 403.0, 345.0, 289.0, 238.0, 251.0, 206.0, 172.0, 161.0, 164.0, 109.0, 118.0, 106.0, 88.0, 99.0, 78.0, 94.0, 66.0, 69.0, 45.0, 59.0, 35.0, 42.0, 43.0], [430.0, 363.0, 346.0, 413.0, 412.0, 484.0, 487.0, 587.0, 675.0, 786.0, 867.0, 963.0, 1051.0, 1240.0, 1303.0, 1403.0, 1511.0, 1578.0, 1722.0, 1784.0, 1729.0, 1914.0, 1980.0, 1885.0, 1849.0, 1951.0, 1896.0, 1856.0, 1776.0, 1626.0, 1600.0, 1431.0, 1357.0, 1295.0, 1171.0, 1042.0, 939.0, 823.0, 726.0, 604.0, 500.0, 429.0, 350.0, 303.0, 223.0, 210.0, 176.0, 144.0, 137.0], [269.0, 192.0, 168.0, 155.0, 119.0, 112.0, 139.0, 135.0, 182.0, 170.0, 176.0, 191.0, 251.0, 252.0, 266.0, 270.0, 296.0, 358.0, 388.0, 490.0, 465.0, 621.0, 618.0, 713.0, 795.0, 911.0, 995.0, 1074.0, 1165.0, 1325.0, 1413.0, 1438.0, 1601.0, 1709.0, 1836.0, 1909.0, 2088.0, 2147.0, 2200.0, 2309.0, 2291.0, 2371.0, 2299.0, 2326.0, 2256.0, 2033.0, 1816.0, 1534.0, 1166.0], [213.0, 164.0, 135.0, 87.0, 71.0, 52.0, 51.0, 49.0, 49.0, 55.0, 61.0, 45.0, 76.0, 71.0, 81.0, 75.0, 78.0, 118.0, 111.0, 123.0, 140.0, 157.0, 155.0, 169.0, 220.0, 238.0, 234.0, 284.0, 311.0, 348.0, 377.0, 407.0, 518.0, 630.0, 717.0, 833.0, 926.0, 1150.0, 1288.0, 1497.0, 1697.0, 2021.0, 2260.0, 2670.0, 2985.0, 3484.0, 4274.0, 5237.0, 6291.0], [268.0, 142.0, 100.0, 72.0, 48.0, 40.0, 44.0, 45.0, 33.0, 28.0, 22.0, 29.0, 26.0, 28.0, 25.0, 32.0, 30.0, 33.0, 24.0, 37.0, 42.0, 40.0, 45.0, 51.0, 56.0, 67.0, 80.0, 65.0, 90.0, 100.0, 94.0, 126.0, 155.0, 181.0, 235.0, 259.0, 266.0, 337.0, 434.0, 517.0, 659.0, 866.0, 1015.0, 1338.0, 1802.0, 2476.0, 3355.0, 4854.0, 8240.0], [284.0, 139.0, 101.0, 58.0, 52.0, 42.0, 29.0, 23.0, 28.0, 30.0, 19.0, 17.0, 25.0, 19.0, 16.0, 13.0, 23.0, 20.0, 24.0, 22.0, 17.0, 15.0, 17.0, 20.0, 33.0, 17.0, 21.0, 30.0, 31.0, 25.0, 35.0, 36.0, 44.0, 54.0, 61.0, 63.0, 97.0, 89.0, 121.0, 153.0, 202.0, 255.0, 339.0, 461.0, 679.0, 1004.0, 1647.0, 3105.0, 6749.0], [373.0, 177.0, 115.0, 50.0, 48.0, 37.0, 26.0, 27.0, 19.0, 11.0, 17.0, 19.0, 13.0, 10.0, 19.0, 21.0, 20.0, 15.0, 17.0, 17.0, 8.0, 12.0, 26.0, 19.0, 18.0, 16.0, 27.0, 15.0, 14.0, 12.0, 17.0, 19.0, 21.0, 21.0, 21.0, 26.0, 26.0, 31.0, 38.0, 39.0, 57.0, 90.0, 100.0, 147.0, 181.0, 315.0, 606.0, 1245.0, 3999.0], [596.0, 193.0, 112.0, 73.0, 43.0, 33.0, 17.0, 20.0, 22.0, 9.0, 17.0, 8.0, 19.0, 15.0, 14.0, 10.0, 18.0, 13.0, 14.0, 19.0, 11.0, 17.0, 11.0, 19.0, 14.0, 11.0, 11.0, 12.0, 16.0, 12.0, 17.0, 18.0, 9.0, 12.0, 18.0, 20.0, 18.0, 24.0, 23.0, 23.0, 30.0, 26.0, 41.0, 37.0, 66.0, 98.0, 174.0, 425.0, 1657.0], [927.0, 275.0, 154.0, 77.0, 54.0, 39.0, 20.0, 27.0, 12.0, 13.0, 11.0, 13.0, 11.0, 18.0, 8.0, 10.0, 9.0, 14.0, 4.0, 20.0, 14.0, 12.0, 18.0, 10.0, 17.0, 14.0, 10.0, 12.0, 13.0, 11.0, 13.0, 12.0, 12.0, 7.0, 13.0, 15.0, 12.0, 13.0, 5.0, 22.0, 23.0, 31.0, 30.0, 31.0, 46.0, 49.0, 78.0, 159.0, 659.0], [1433.0, 513.0, 261.0, 121.0, 65.0, 36.0, 25.0, 22.0, 16.0, 11.0, 10.0, 11.0, 13.0, 16.0, 14.0, 9.0, 9.0, 8.0, 10.0, 11.0, 8.0, 9.0, 6.0, 7.0, 3.0, 11.0, 8.0, 10.0, 6.0, 7.0, 17.0, 12.0, 17.0, 8.0, 9.0, 15.0, 9.0, 18.0, 12.0, 7.0, 16.0, 15.0, 16.0, 26.0, 33.0, 47.0, 40.0, 86.0, 276.0], [2086.0, 886.0, 422.0, 227.0, 142.0, 86.0, 59.0, 30.0, 19.0, 27.0, 7.0, 11.0, 7.0, 4.0, 9.0, 7.0, 12.0, 9.0, 11.0, 10.0, 11.0, 6.0, 16.0, 15.0, 13.0, 9.0, 4.0, 6.0, 9.0, 6.0, 8.0, 3.0, 8.0, 6.0, 8.0, 5.0, 3.0, 10.0, 12.0, 14.0, 16.0, 10.0, 19.0, 20.0, 25.0, 21.0, 28.0, 72.0, 177.0], [2844.0, 1323.0, 735.0, 421.0, 247.0, 160.0, 115.0, 82.0, 54.0, 33.0, 22.0, 17.0, 11.0, 18.0, 17.0, 12.0, 14.0, 11.0, 6.0, 9.0, 7.0, 7.0, 8.0, 6.0, 10.0, 8.0, 10.0, 4.0, 7.0, 7.0, 7.0, 7.0, 6.0, 11.0, 15.0, 9.0, 8.0, 6.0, 5.0, 11.0, 8.0, 9.0, 9.0, 16.0, 9.0, 19.0, 25.0, 51.0, 105.0], [3446.0, 1834.0, 1110.0, 786.0, 464.0, 305.0, 239.0, 183.0, 136.0, 87.0, 57.0, 49.0, 39.0, 43.0, 25.0, 20.0, 14.0, 12.0, 11.0, 17.0, 7.0, 8.0, 15.0, 6.0, 3.0, 7.0, 9.0, 8.0, 8.0, 10.0, 7.0, 7.0, 6.0, 4.0, 7.0, 5.0, 4.0, 9.0, 4.0, 7.0, 6.0, 7.0, 5.0, 11.0, 19.0, 14.0, 25.0, 27.0, 74.0], [3603.0, 2174.0, 1552.0, 1135.0, 742.0, 608.0, 457.0, 349.0, 269.0, 186.0, 147.0, 124.0, 103.0, 79.0, 68.0, 54.0, 52.0, 43.0, 31.0, 26.0, 15.0, 21.0, 5.0, 16.0, 11.0, 9.0, 7.0, 4.0, 8.0, 6.0, 11.0, 9.0, 8.0, 2.0, 7.0, 4.0, 6.0, 5.0, 9.0, 5.0, 5.0, 5.0, 11.0, 9.0, 13.0, 13.0, 16.0, 24.0, 58.0], [3544.0, 2393.0, 1795.0, 1289.0, 1061.0, 842.0, 655.0, 546.0, 506.0, 396.0, 276.0, 251.0, 193.0, 158.0, 169.0, 132.0, 92.0, 83.0, 74.0, 56.0, 49.0, 42.0, 36.0, 25.0, 17.0, 25.0, 20.0, 14.0, 17.0, 11.0, 8.0, 15.0, 13.0, 5.0, 6.0, 10.0, 7.0, 10.0, 3.0, 6.0, 6.0, 5.0, 17.0, 4.0, 5.0, 7.0, 14.0, 23.0, 37.0], [3152.0, 2326.0, 1800.0, 1427.0, 1210.0, 1034.0, 898.0, 832.0, 685.0, 589.0, 461.0, 409.0, 348.0, 375.0, 294.0, 237.0, 232.0, 160.0, 178.0, 146.0, 136.0, 98.0, 94.0, 70.0, 65.0, 62.0, 52.0, 41.0, 30.0, 39.0, 25.0, 25.0, 12.0, 22.0, 15.0, 12.0, 13.0, 15.0, 8.0, 11.0, 9.0, 6.0, 6.0, 7.0, 10.0, 7.0, 14.0, 18.0, 42.0], [2529.0, 1979.0, 1686.0, 1456.0, 1308.0, 1125.0, 1070.0, 874.0, 846.0, 732.0, 647.0, 561.0, 543.0, 515.0, 441.0, 410.0, 388.0, 344.0, 288.0, 317.0, 231.0, 241.0, 167.0, 161.0, 160.0, 147.0, 114.0, 105.0, 103.0, 75.0, 74.0, 69.0, 49.0, 54.0, 44.0, 34.0, 19.0, 29.0, 25.0, 18.0, 15.0, 12.0, 15.0, 12.0, 6.0, 10.0, 12.0, 12.0, 32.0], [1830.0, 1529.0, 1431.0, 1262.0, 1182.0, 1025.0, 985.0, 935.0, 849.0, 782.0, 753.0, 745.0, 659.0, 636.0, 580.0, 566.0, 528.0, 535.0, 433.0, 429.0, 392.0, 374.0, 350.0, 356.0, 284.0, 264.0, 249.0, 209.0, 180.0, 182.0, 131.0, 142.0, 137.0, 114.0, 97.0, 76.0, 82.0, 59.0, 58.0, 51.0, 54.0, 36.0, 28.0, 33.0, 25.0, 23.0, 20.0, 20.0, 27.0], [1254.0, 1148.0, 1090.0, 994.0, 955.0, 877.0, 867.0, 798.0, 759.0, 758.0, 733.0, 731.0, 667.0, 701.0, 709.0, 674.0, 578.0, 615.0, 532.0, 465.0, 521.0, 530.0, 504.0, 445.0, 450.0, 373.0, 373.0, 342.0, 347.0, 343.0, 304.0, 259.0, 258.0, 250.0, 197.0, 184.0, 149.0, 166.0, 156.0, 123.0, 104.0, 98.0, 84.0, 61.0, 53.0, 54.0, 53.0, 42.0, 45.0], [796.0, 694.0, 708.0, 634.0, 685.0, 681.0, 635.0, 621.0, 644.0, 665.0, 696.0, 665.0, 619.0, 630.0, 647.0, 624.0, 624.0, 601.0, 575.0, 632.0, 583.0, 579.0, 500.0, 577.0, 540.0, 545.0, 501.0, 504.0, 502.0, 460.0, 458.0, 435.0, 379.0, 384.0, 365.0, 375.0, 312.0, 320.0, 289.0, 268.0, 234.0, 245.0, 197.0, 189.0, 132.0, 130.0, 118.0, 84.0, 91.0], [508.0, 469.0, 429.0, 464.0, 411.0, 425.0, 431.0, 464.0, 450.0, 495.0, 489.0, 496.0, 520.0, 523.0, 564.0, 555.0, 563.0, 537.0, 548.0, 589.0, 605.0, 548.0, 597.0, 565.0, 544.0, 557.0, 613.0, 584.0, 571.0, 549.0, 560.0, 582.0, 503.0, 518.0, 455.0, 506.0, 499.0, 494.0, 495.0, 490.0, 442.0, 409.0, 423.0, 348.0, 317.0, 268.0, 260.0, 234.0, 217.0], [313.0, 300.0, 249.0, 281.0, 269.0, 285.0, 276.0, 318.0, 291.0, 291.0, 330.0, 342.0, 402.0, 380.0, 377.0, 385.0, 421.0, 450.0, 471.0, 443.0, 467.0, 477.0, 515.0, 541.0, 507.0, 600.0, 555.0, 561.0, 565.0, 538.0, 578.0, 631.0, 671.0, 613.0, 618.0, 625.0, 659.0, 622.0, 644.0, 645.0, 581.0, 603.0, 641.0, 587.0, 593.0, 554.0, 579.0, 507.0, 442.0], [211.0, 203.0, 177.0, 145.0, 174.0, 188.0, 180.0, 186.0, 155.0, 165.0, 186.0, 223.0, 242.0, 232.0, 279.0, 267.0, 281.0, 259.0, 319.0, 346.0, 338.0, 390.0, 400.0, 413.0, 412.0, 425.0, 470.0, 497.0, 505.0, 537.0, 588.0, 574.0, 602.0, 614.0, 657.0, 660.0, 684.0, 739.0, 750.0, 761.0, 779.0, 789.0, 815.0, 861.0, 885.0, 864.0, 905.0, 875.0, 898.0], [212.0, 129.0, 102.0, 118.0, 112.0, 86.0, 130.0, 116.0, 152.0, 115.0, 120.0, 145.0, 141.0, 144.0, 168.0, 175.0, 171.0, 174.0, 199.0, 183.0, 225.0, 232.0, 253.0, 281.0, 286.0, 288.0, 293.0, 330.0, 389.0, 416.0, 440.0, 457.0, 507.0, 582.0, 540.0, 617.0, 668.0, 668.0, 723.0, 771.0, 815.0, 870.0, 979.0, 1033.0, 1075.0, 1181.0, 1256.0, 1415.0, 1514.0], [212.0, 138.0, 115.0, 73.0, 81.0, 52.0, 54.0, 51.0, 61.0, 44.0, 85.0, 69.0, 96.0, 69.0, 93.0, 98.0, 109.0, 93.0, 132.0, 141.0, 122.0, 143.0, 138.0, 177.0, 171.0, 224.0, 201.0, 213.0, 226.0, 290.0, 327.0, 338.0, 357.0, 381.0, 437.0, 468.0, 489.0, 572.0, 601.0, 696.0, 753.0, 863.0, 974.0, 1047.0, 1189.0, 1417.0, 1552.0, 1833.0, 2294.0], [182.0, 102.0, 73.0, 62.0, 49.0, 50.0, 32.0, 25.0, 33.0, 39.0, 31.0, 31.0, 37.0, 57.0, 52.0, 64.0, 45.0, 72.0, 58.0, 80.0, 76.0, 99.0, 98.0, 89.0, 99.0, 105.0, 145.0, 143.0, 143.0, 151.0, 201.0, 208.0, 221.0, 228.0, 293.0, 291.0, 356.0, 430.0, 505.0, 541.0, 597.0, 723.0, 795.0, 977.0, 1163.0, 1388.0, 1669.0, 2014.0, 2992.0], [183.0, 102.0, 73.0, 71.0, 62.0, 29.0, 35.0, 21.0, 33.0, 38.0, 26.0, 40.0, 23.0, 18.0, 37.0, 21.0, 38.0, 32.0, 45.0, 45.0, 57.0, 48.0, 67.0, 89.0, 54.0, 64.0, 62.0, 75.0, 106.0, 107.0, 122.0, 129.0, 176.0, 182.0, 188.0, 186.0, 218.0, 233.0, 329.0, 372.0, 393.0, 509.0, 589.0, 771.0, 948.0, 1156.0, 1562.0, 2172.0, 3328.0], [157.0, 115.0, 92.0, 86.0, 34.0, 53.0, 20.0, 16.0, 9.0, 9.0, 9.0, 11.0, 13.0, 12.0, 25.0, 25.0, 38.0, 20.0, 20.0, 37.0, 40.0, 49.0, 52.0, 25.0, 51.0, 42.0, 39.0, 45.0, 51.0, 39.0, 81.0, 78.0, 75.0, 83.0, 105.0, 111.0, 124.0, 143.0, 179.0, 211.0, 257.0, 318.0, 427.0, 479.0, 657.0, 899.0, 1263.0, 1956.0, 3284.0], [177.0, 113.0, 70.0, 51.0, 37.0, 45.0, 16.0, 32.0, 12.0, 11.0, 20.0, 20.0, 20.0, 11.0, 13.0, 23.0, 10.0, 11.0, 24.0, 21.0, 49.0, 28.0, 14.0, 18.0, 22.0, 23.0, 17.0, 15.0, 20.0, 26.0, 39.0, 50.0, 40.0, 33.0, 65.0, 69.0, 81.0, 79.0, 87.0, 123.0, 138.0, 208.0, 247.0, 324.0, 419.0, 630.0, 946.0, 1515.0, 3043.0], [173.0, 105.0, 85.0, 72.0, 37.0, 26.0, 25.0, 10.0, 15.0, 21.0, 32.0, 12.0, 10.0, 6.0, 23.0, 15.0, 3.0, 13.0, 10.0, 39.0, 23.0, 16.0, 46.0, 36.0, 9.0, 14.0, 45.0, 15.0, 9.0, 10.0, 13.0, 32.0, 29.0, 27.0, 17.0, 41.0, 53.0, 56.0, 46.0, 66.0, 71.0, 133.0, 135.0, 205.0, 289.0, 386.0, 612.0, 1020.0, 2375.0], [161.0, 95.0, 74.0, 69.0, 49.0, 22.0, 20.0, 13.0, 70.0, 10.0, 21.0, 14.0, 8.0, 8.0, 5.0, 7.0, 4.0, 20.0, 30.0, 14.0, 7.0, 8.0, 50.0, 24.0, 60.0, 25.0, 9.0, 28.0, 9.0, 25.0, 50.0, 11.0, 2.0, 13.0, 11.0, 15.0, 8.0, 11.0, 14.0, 32.0, 32.0, 46.0, 69.0, 89.0, 104.0, 230.0, 352.0, 714.0, 1824.0], [145.0, 108.0, 68.0, 53.0, 49.0, 47.0, 24.0, 10.0, 8.0, 9.0, 7.0, 7.0, 8.0, 21.0, 10.0, 9.0, 7.0, 7.0, 7.0, 37.0, 36.0, 6.0, 5.0, 22.0, 38.0, 4.0, 5.0, 7.0, 21.0, 25.0, 14.0, 9.0, 17.0, 56.0, 37.0, 12.0, 7.0, 25.0, 12.0, 13.0, 21.0, 41.0, 28.0, 35.0, 54.0, 129.0, 202.0, 440.0, 1181.0], [150.0, 121.0, 104.0, 81.0, 32.0, 44.0, 26.0, 17.0, 10.0, 7.0, 6.0, 20.0, 38.0, 8.0, 8.0, 3.0, 5.0, 5.0, 5.0, 8.0, 8.0, 3.0, 6.0, 48.0, 7.0, 6.0, 8.0, 4.0, 27.0, 14.0, 23.0, 4.0, 5.0, 1.0, 3.0, 17.0, 12.0, 5.0, 6.0, 7.0, 30.0, 15.0, 8.0, 20.0, 22.0, 67.0, 109.0, 225.0, 692.0], [129.0, 101.0, 75.0, 60.0, 29.0, 26.0, 20.0, 17.0, 9.0, 7.0, 27.0, 9.0, 8.0, 6.0, 7.0, 8.0, 5.0, 4.0, 27.0, 21.0, 16.0, 3.0, 7.0, 4.0, 21.0, 28.0, 20.0, 3.0, 28.0, 46.0, 9.0, 17.0, 14.0, 2.0, 26.0, 7.0, 2.0, 27.0, 3.0, 50.0, 4.0, 8.0, 24.0, 14.0, 9.0, 36.0, 47.0, 125.0, 420.0], [144.0, 112.0, 82.0, 57.0, 38.0, 26.0, 21.0, 9.0, 12.0, 5.0, 7.0, 4.0, 7.0, 8.0, 29.0, 50.0, 12.0, 27.0, 8.0, 6.0, 8.0, 50.0, 4.0, 19.0, 33.0, 17.0, 2.0, 3.0, 4.0, 7.0, 24.0, 4.0, 3.0, 1.0, 3.0, 22.0, 55.0, 23.0, 2.0, 5.0, 2.0, 4.0, 11.0, 24.0, 20.0, 18.0, 23.0, 46.0, 220.0], [187.0, 113.0, 97.0, 38.0, 40.0, 27.0, 18.0, 10.0, 4.0, 4.0, 12.0, 5.0, 10.0, 8.0, 7.0, 4.0, 5.0, 8.0, 5.0, 6.0, 4.0, 3.0, 7.0, 4.0, 7.0, 5.0, 24.0, 11.0, 3.0, 26.0, 4.0, 24.0, 21.0, 20.0, 28.0, 17.0, 3.0, 2.0, 3.0, 4.0, 1.0, 4.0, 3.0, 3.0, 6.0, 8.0, 14.0, 23.0, 148.0], [188.0, 102.0, 65.0, 49.0, 33.0, 22.0, 15.0, 13.0, 23.0, 29.0, 19.0, 5.0, 6.0, 5.0, 6.0, 7.0, 6.0, 17.0, 26.0, 16.0, 4.0, 18.0, 16.0, 29.0, 2.0, 6.0, 13.0, 5.0, 2.0, 4.0, 4.0, 2.0, 5.0, 2.0, 5.0, 6.0, 4.0, 3.0, 1.0, 3.0, 3.0, 4.0, 13.0, 20.0, 4.0, 3.0, 9.0, 16.0, 67.0], [213.0, 94.0, 67.0, 57.0, 32.0, 21.0, 19.0, 17.0, 12.0, 7.0, 4.0, 15.0, 5.0, 3.0, 10.0, 7.0, 24.0, 12.0, 18.0, 5.0, 2.0, 6.0, 20.0, 6.0, 45.0, 15.0, 1.0, 6.0, 6.0, 2.0, 1.0, 7.0, 1.0, 20.0, 4.0, 4.0, 4.0, 5.0, 4.0, 3.0, 3.0, 2.0, 7.0, 3.0, 2.0, 1.0, 10.0, 27.0, 55.0], [157.0, 122.0, 72.0, 46.0, 34.0, 26.0, 13.0, 6.0, 8.0, 7.0, 7.0, 12.0, 11.0, 19.0, 14.0, 9.0, 17.0, 13.0, 5.0, 2.0, 9.0, 7.0, 2.0, 21.0, 9.0, 9.0, 2.0, 2.0, 0.0, 5.0, 5.0, 3.0, 4.0, 13.0, 16.0, 5.0, 6.0, 6.0, 3.0, 0.0, 2.0, 3.0, 3.0, 3.0, 2.0, 6.0, 9.0, 14.0, 17.0], [145.0, 173.0, 83.0, 52.0, 30.0, 16.0, 15.0, 19.0, 11.0, 12.0, 23.0, 10.0, 6.0, 7.0, 3.0, 20.0, 19.0, 8.0, 25.0, 30.0, 9.0, 3.0, 4.0, 19.0, 11.0, 5.0, 5.0, 4.0, 4.0, 6.0, 2.0, 6.0, 1.0, 0.0, 2.0, 3.0, 5.0, 2.0, 2.0, 3.0, 32.0, 22.0, 1.0, 7.0, 3.0, 15.0, 23.0, 7.0, 14.0], [161.0, 103.0, 83.0, 50.0, 39.0, 19.0, 20.0, 16.0, 6.0, 29.0, 14.0, 13.0, 4.0, 4.0, 8.0, 10.0, 8.0, 9.0, 3.0, 19.0, 18.0, 6.0, 3.0, 3.0, 8.0, 15.0, 21.0, 2.0, 2.0, 4.0, 4.0, 6.0, 1.0, 0.0, 4.0, 6.0, 2.0, 2.0, 4.0, 3.0, 2.0, 3.0, 5.0, 7.0, 3.0, 4.0, 7.0, 3.0, 33.0], [158.0, 97.0, 72.0, 65.0, 36.0, 31.0, 14.0, 13.0, 9.0, 6.0, 8.0, 9.0, 5.0, 4.0, 11.0, 28.0, 11.0, 6.0, 3.0, 6.0, 10.0, 3.0, 6.0, 2.0, 5.0, 9.0, 5.0, 24.0, 6.0, 2.0, 2.0, 4.0, 2.0, 2.0, 3.0, 4.0, 2.0, 3.0, 22.0, 6.0, 4.0, 7.0, 1.0, 14.0, 17.0, 7.0, 6.0, 6.0, 18.0], [156.0, 88.0, 80.0, 46.0, 37.0, 17.0, 24.0, 24.0, 5.0, 7.0, 10.0, 8.0, 5.0, 10.0, 4.0, 5.0, 6.0, 11.0, 2.0, 9.0, 6.0, 7.0, 8.0, 7.0, 29.0, 39.0, 26.0, 19.0, 3.0, 3.0, 3.0, 3.0, 7.0, 3.0, 5.0, 2.0, 1.0, 3.0, 2.0, 4.0, 5.0, 3.0, 1.0, 4.0, 27.0, 6.0, 5.0, 6.0, 17.0], [163.0, 105.0, 58.0, 54.0, 34.0, 22.0, 18.0, 14.0, 7.0, 7.0, 7.0, 5.0, 12.0, 8.0, 6.0, 4.0, 4.0, 6.0, 6.0, 9.0, 6.0, 3.0, 4.0, 7.0, 6.0, 5.0, 4.0, 6.0, 3.0, 5.0, 1.0, 6.0, 4.0, 2.0, 6.0, 3.0, 1.0, 4.0, 1.0, 4.0, 0.0, 30.0, 1.0, 1.0, 5.0, 4.0, 11.0, 7.0, 10.0]],
    "Name": "sCurve-0",
    "Overflow": 2366659.0,
    "Type": "Histo2d",
    "Underflow": 0.0,
    "x": {
        "AxisTitle": "Vcal",
        "Bins": 51,
        "High": 302.5,
        "Low": 47.5
    },
    "y": {
        "AxisTitle": "Occupancy",
        "Bins": 49,
        "High": 49.5,
        "Low": 0.5
    },
    "z": {
        "AxisTitle": "Number of pixels"
    }
}