time,Hardware,Voltage,Current
1626356719346,high-voltage-3,1,0.00849902
time,Hardware,Voltage,Current
1626356719346,high-voltage-3,2,0.0115667
time,Hardware,Voltage,Current
1626356719346,high-voltage-3,3,0.0143347
time,Hardware,Voltage,Current
1626356719346,high-voltage-3,4,0.0152828
time,Hardware,Voltage,Current
1626356719346,high-voltage-3,5,0.0151579
time,Hardware,Voltage,Current
1626356719346,high-voltage-3,6,0.016613
time,Hardware,Voltage,Current
1626356719346,high-voltage-3,7,0.0187628
time,Hardware,Voltage,Current
1626356719346,high-voltage-3,8,0.019925
time,Hardware,Voltage,Current
1626356719346,high-voltage-3,9,0.0231832
time,Hardware,Voltage,Current
1626356719346,high-voltage-3,10,0.024632
time,Hardware,Voltage,Current
1626356719346,high-voltage-3,11,0.0263751
time,Hardware,Voltage,Current
1626356719346,high-voltage-3,12,0.0281894
time,Hardware,Voltage,Current
1626356719346,high-voltage-3,13,0.0280559
time,Hardware,Voltage,Current
1626356719346,high-voltage-3,14,0.0304024
time,Hardware,Voltage,Current
1626356719346,high-voltage-3,15,0.0319567
time,Hardware,Voltage,Current
1626356719346,high-voltage-3,16,0.0332198
time,Hardware,Voltage,Current
1626356719346,high-voltage-3,17,0.0344245
time,Hardware,Voltage,Current
1626356719346,high-voltage-3,18,0.0360488
time,Hardware,Voltage,Current
1626356719346,high-voltage-3,19,0.0378633
time,Hardware,Voltage,Current
1626356719346,high-voltage-3,20,0.0391524
time,Hardware,Voltage,Current
1626356719346,high-voltage-3,25,0.0452646
time,Hardware,Voltage,Current
1626356719346,high-voltage-3,30,0.0507955
time,Hardware,Voltage,Current
1626356719346,high-voltage-3,35,0.0582778
time,Hardware,Voltage,Current
1626356719346,high-voltage-3,40,0.0643521
time,Hardware,Voltage,Current
1626356719346,high-voltage-3,45,0.0683088
time,Hardware,Voltage,Current
1626356719346,high-voltage-3,50,0.0740705
time,Hardware,Voltage,Current
1626356719346,high-voltage-3,55,0.0773933
time,Hardware,Voltage,Current
1626356719346,high-voltage-3,60,0.0831097
time,Hardware,Voltage,Current
1626356719346,high-voltage-3,65,0.0873405
time,Hardware,Voltage,Current
1626356719346,high-voltage-3,70,0.0926658
time,Hardware,Voltage,Current
1626356719346,high-voltage-3,75,0.0990778
time,Hardware,Voltage,Current
1626356719346,high-voltage-3,80,0.106479
time,Hardware,Voltage,Current
1626356719346,high-voltage-3,85,0.112263
time,Hardware,Voltage,Current
1626356719346,high-voltage-3,90,0.117636
time,Hardware,Voltage,Current
1626356719346,high-voltage-3,95,0.123579
time,Hardware,Voltage,Current
1626356719346,high-voltage-3,100,0.131336
