time,Hardware,Voltage,Current
1626346977214,high-voltage,1,0.0107414
time,Hardware,Voltage,Current
1626346977214,high-voltage,2,0.0248053
time,Hardware,Voltage,Current
1626346977214,high-voltage,3,0.0323251
time,Hardware,Voltage,Current
1626346977214,high-voltage,4,0.0383711
time,Hardware,Voltage,Current
1626346977214,high-voltage,5,0.043496
time,Hardware,Voltage,Current
1626346977214,high-voltage,6,0.0487844
time,Hardware,Voltage,Current
1626346977214,high-voltage,7,0.0552648
time,Hardware,Voltage,Current
1626346977214,high-voltage,8,0.0608058
time,Hardware,Voltage,Current
1626346977214,high-voltage,9,0.0676879
time,Hardware,Voltage,Current
1626346977214,high-voltage,10,0.0742003
time,Hardware,Voltage,Current
1626346977214,high-voltage,11,0.079853
time,Hardware,Voltage,Current
1626346977214,high-voltage,12,0.0854703
time,Hardware,Voltage,Current
1626346977214,high-voltage,13,0.0906523
time,Hardware,Voltage,Current
1626346977214,high-voltage,14,0.0961854
time,Hardware,Voltage,Current
1626346977214,high-voltage,15,0.0991973
time,Hardware,Voltage,Current
1626346977214,high-voltage,16,0.10333
time,Hardware,Voltage,Current
1626346977214,high-voltage,17,0.106592
time,Hardware,Voltage,Current
1626346977214,high-voltage,18,0.11082
time,Hardware,Voltage,Current
1626346977214,high-voltage,19,0.112855
time,Hardware,Voltage,Current
1626346977214,high-voltage,20,0.11558
time,Hardware,Voltage,Current
1626346977214,high-voltage,25,0.131943
time,Hardware,Voltage,Current
1626346977214,high-voltage,30,0.148263
time,Hardware,Voltage,Current
1626346977214,high-voltage,35,0.184719
time,Hardware,Voltage,Current
1626346977214,high-voltage,40,0.288638
time,Hardware,Voltage,Current
1626346977214,high-voltage,45,0.533985
time,Hardware,Voltage,Current
1626346977214,high-voltage,50,0.991233
time,Hardware,Voltage,Current
1626346977214,high-voltage,55,1.78065
time,Hardware,Voltage,Current
1626346977214,high-voltage,60,3.01852
time,Hardware,Voltage,Current
1626346977214,high-voltage,65,4.74325
time,Hardware,Voltage,Current
1626346977214,high-voltage,70,7.04136
time,Hardware,Voltage,Current
1626346977214,high-voltage,75,10
