{
    "Data": [0.0, 0.0, 0.0, 0.0, 0.0, 0.0, 0.0, 0.0, 0.0, 0.0, 0.0, 0.0, 0.0, 0.0, 4.0, 0.0, 0.0, 16.0, 68.0, 11.0, 48.0, 594.0, 1226.0, 360.0, 471.0, 1444.0, 1796.0, 860.0, 708.0, 1182.0, 1379.0, 899.0, 572.0, 690.0, 795.0, 683.0, 425.0, 733.0, 994.0, 887.0, 611.0, 999.0, 2223.0, 3336.0, 2449.0, 1418.0, 2459.0, 3655.0, 4147.0, 2774.0, 2229.0, 2751.0, 3305.0, 2871.0, 1912.0, 1727.0, 1736.0, 1916.0, 1514.0, 1236.0, 1153.0, 1041.0, 1034.0, 720.0, 690.0, 633.0, 551.0, 508.0, 437.0, 440.0, 384.0, 381.0, 308.0, 285.0, 234.0, 236.0, 238.0, 202.0, 167.0, 159.0, 123.0, 155.0, 122.0, 120.0, 112.0, 98.0, 81.0, 82.0, 86.0, 68.0, 82.0, 61.0, 59.0, 55.0, 39.0, 54.0, 49.0, 37.0, 33.0, 25.0, 39.0, 34.0, 27.0, 29.0, 27.0, 25.0, 21.0, 20.0, 18.0, 21.0, 20.0, 16.0, 20.0, 17.0, 7.0, 16.0, 12.0, 12.0, 12.0, 3.0, 8.0, 8.0, 12.0, 6.0, 7.0, 7.0, 7.0, 5.0, 5.0, 7.0, 9.0, 9.0, 6.0, 9.0, 5.0, 3.0, 6.0, 4.0, 5.0, 2.0, 3.0, 6.0, 6.0, 1.0, 9.0, 4.0, 3.0, 4.0, 3.0, 4.0, 1.0, 3.0, 3.0, 3.0, 2.0, 4.0, 5.0, 2.0, 7.0, 0.0, 2.0, 2.0, 5.0, 3.0, 0.0, 2.0, 3.0, 2.0, 2.0, 5.0, 5.0, 3.0, 5.0, 1.0, 1.0, 2.0, 1.0, 4.0, 5.0, 3.0, 1.0, 0.0, 3.0, 0.0, 4.0, 3.0, 2.0, 0.0, 5.0, 1.0, 4.0, 3.0, 1.0, 1.0, 3.0, 3.0, 2.0, 1.0, 3.0, 1.0, 2.0],
    "Name": "TimePerFitDist-0",
    "Overflow": 194.0,
    "Type": "Histo1d",
    "Underflow": 0.0,
    "x": {
        "AxisTitle": "Fit Time [us]",
        "Bins": 201,
        "High": 401.0,
        "Low": -1.0
    },
    "y": {
        "AxisTitle": "Number of Pixels"
    },
    "z": {
        "AxisTitle": "z"
    }
}