time,Hardware,Voltage,Current
1626755332160,high-voltage-3,1,0.00102533
time,Hardware,Voltage,Current
1626755332160,high-voltage-3,2,0.00499102
time,Hardware,Voltage,Current
1626755332160,high-voltage-3,3,0.00714697
time,Hardware,Voltage,Current
1626755332160,high-voltage-3,4,0.00761742
time,Hardware,Voltage,Current
1626755332160,high-voltage-3,5,0.00991838
time,Hardware,Voltage,Current
1626755332160,high-voltage-3,6,0.011845
time,Hardware,Voltage,Current
1626755332160,high-voltage-3,7,0.0132162
time,Hardware,Voltage,Current
1626755332160,high-voltage-3,8,0.0147455
time,Hardware,Voltage,Current
1626755332160,high-voltage-3,9,0.0162939
time,Hardware,Voltage,Current
1626755332160,high-voltage-3,10,0.0179486
time,Hardware,Voltage,Current
1626755332160,high-voltage-3,11,0.0187761
time,Hardware,Voltage,Current
1626755332160,high-voltage-3,12,0.0196859
time,Hardware,Voltage,Current
1626755332160,high-voltage-3,13,0.022121
time,Hardware,Voltage,Current
1626755332160,high-voltage-3,14,0.0234937
time,Hardware,Voltage,Current
1626755332160,high-voltage-3,15,0.0246233
time,Hardware,Voltage,Current
1626755332160,high-voltage-3,16,0.0263597
time,Hardware,Voltage,Current
1626755332160,high-voltage-3,17,0.0267605
time,Hardware,Voltage,Current
1626755332160,high-voltage-3,18,0.027643
time,Hardware,Voltage,Current
1626755332160,high-voltage-3,19,0.0289734
time,Hardware,Voltage,Current
1626755332160,high-voltage-3,20,0.0304133
time,Hardware,Voltage,Current
1626755332160,high-voltage-3,25,0.0372344
time,Hardware,Voltage,Current
1626755332160,high-voltage-3,30,0.0435092
time,Hardware,Voltage,Current
1626755332160,high-voltage-3,35,0.0504387
time,Hardware,Voltage,Current
1626755332160,high-voltage-3,40,0.0549668
time,Hardware,Voltage,Current
1626755332160,high-voltage-3,45,0.0578839
time,Hardware,Voltage,Current
1626755332160,high-voltage-3,50,0.0643795
time,Hardware,Voltage,Current
1626755332160,high-voltage-3,55,0.0676489
time,Hardware,Voltage,Current
1626755332160,high-voltage-3,60,0.0708794
time,Hardware,Voltage,Current
1626755332160,high-voltage-3,65,0.0768767
time,Hardware,Voltage,Current
1626755332160,high-voltage-3,70,0.0841796
time,Hardware,Voltage,Current
1626755332160,high-voltage-3,75,0.0897633
time,Hardware,Voltage,Current
1626755332160,high-voltage-3,80,0.0958541
time,Hardware,Voltage,Current
1626755332160,high-voltage-3,85,0.103643
time,Hardware,Voltage,Current
1626755332160,high-voltage-3,90,0.108327
time,Hardware,Voltage,Current
1626755332160,high-voltage-3,95,0.114459
time,Hardware,Voltage,Current
1626755332160,high-voltage-3,100,0.122952
