time,Hardware,Voltage,Current
1621543743464,high-voltage-3,1,0.0739819
time,Hardware,Voltage,Current
1621543743464,high-voltage-3,2,0.0788325
time,Hardware,Voltage,Current
1621543743464,high-voltage-3,3,0.0844431
time,Hardware,Voltage,Current
1621543743464,high-voltage-3,4,0.0856286
time,Hardware,Voltage,Current
1621543743464,high-voltage-3,5,0.0894724
time,Hardware,Voltage,Current
1621543743464,high-voltage-3,6,0.0927675
time,Hardware,Voltage,Current
1621543743464,high-voltage-3,7,0.094434
time,Hardware,Voltage,Current
1621543743464,high-voltage-3,8,0.0954207
time,Hardware,Voltage,Current
1621543743464,high-voltage-3,9,0.0987384
time,Hardware,Voltage,Current
1621543743464,high-voltage-3,10,0.100611
time,Hardware,Voltage,Current
1621543743464,high-voltage-3,11,0.101477
time,Hardware,Voltage,Current
1621543743464,high-voltage-3,12,0.102781
time,Hardware,Voltage,Current
1621543743464,high-voltage-3,13,0.104915
time,Hardware,Voltage,Current
1621543743464,high-voltage-3,14,0.107684
time,Hardware,Voltage,Current
1621543743464,high-voltage-3,15,0.111248
time,Hardware,Voltage,Current
1621543743464,high-voltage-3,16,0.113525
time,Hardware,Voltage,Current
1621543743464,high-voltage-3,17,0.111176
time,Hardware,Voltage,Current
1621543743464,high-voltage-3,18,0.118605
time,Hardware,Voltage,Current
1621543743464,high-voltage-3,19,0.118478
