time,Hardware,Voltage,Current
1626382598411,high-voltage-3,1,0.0685511
time,Hardware,Voltage,Current
1626382598411,high-voltage-3,2,0.07616
time,Hardware,Voltage,Current
1626382598411,high-voltage-3,3,0.0786439
time,Hardware,Voltage,Current
1626382598411,high-voltage-3,4,0.0841881
time,Hardware,Voltage,Current
1626382598411,high-voltage-3,5,0.086462
time,Hardware,Voltage,Current
1626382598411,high-voltage-3,6,0.0892038
time,Hardware,Voltage,Current
1626382598411,high-voltage-3,7,0.0914959
time,Hardware,Voltage,Current
1626382598411,high-voltage-3,8,0.0928839
time,Hardware,Voltage,Current
1626382598411,high-voltage-3,9,0.0948005
time,Hardware,Voltage,Current
1626382598411,high-voltage-3,10,0.0976405
time,Hardware,Voltage,Current
1626382598411,high-voltage-3,11,0.0999752
time,Hardware,Voltage,Current
1626382598411,high-voltage-3,12,0.102209
time,Hardware,Voltage,Current
1626382598411,high-voltage-3,13,0.10657
time,Hardware,Voltage,Current
1626382598411,high-voltage-3,14,0.108728
time,Hardware,Voltage,Current
1626382598411,high-voltage-3,15,0.112015
time,Hardware,Voltage,Current
1626382598411,high-voltage-3,16,0.113502
time,Hardware,Voltage,Current
1626382598411,high-voltage-3,17,0.115197
time,Hardware,Voltage,Current
1626382598411,high-voltage-3,18,0.117031
time,Hardware,Voltage,Current
1626382598411,high-voltage-3,19,0.11824
time,Hardware,Voltage,Current
1626382598411,high-voltage-3,20,0.121417
time,Hardware,Voltage,Current
1626382598411,high-voltage-3,25,0.12968
time,Hardware,Voltage,Current
1626382598411,high-voltage-3,30,0.138578
time,Hardware,Voltage,Current
1626382598411,high-voltage-3,35,0.146954
time,Hardware,Voltage,Current
1626382598411,high-voltage-3,40,0.15314
time,Hardware,Voltage,Current
1626382598411,high-voltage-3,45,0.160694
time,Hardware,Voltage,Current
1626382598411,high-voltage-3,50,0.167954
time,Hardware,Voltage,Current
1626382598411,high-voltage-3,55,0.174569
time,Hardware,Voltage,Current
1626382598411,high-voltage-3,60,0.183627
time,Hardware,Voltage,Current
1626382598411,high-voltage-3,65,0.191203
time,Hardware,Voltage,Current
1626382598411,high-voltage-3,70,0.202247
time,Hardware,Voltage,Current
1626382598411,high-voltage-3,75,0.212739
time,Hardware,Voltage,Current
1626382598411,high-voltage-3,80,0.223376
time,Hardware,Voltage,Current
1626382598411,high-voltage-3,85,0.232198
time,Hardware,Voltage,Current
1626382598411,high-voltage-3,90,0.241323
time,Hardware,Voltage,Current
1626382598411,high-voltage-3,95,0.250416
time,Hardware,Voltage,Current
1626382598411,high-voltage-3,100,0.260663
