{
    "Data": [0.0, 0.0, 0.0, 0.0, 0.0, 0.0, 0.0, 0.0, 0.0, 0.0, 0.0, 0.0, 0.0, 0.0, 3.0, 2.0, 0.0, 19.0, 548.0, 357.0, 51.0, 139.0, 3090.0, 3532.0, 508.0, 437.0, 2444.0, 3180.0, 761.0, 531.0, 1552.0, 2074.0, 861.0, 376.0, 433.0, 450.0, 348.0, 293.0, 445.0, 488.0, 457.0, 606.0, 1123.0, 1657.0, 1313.0, 1295.0, 2072.0, 2704.0, 2948.0, 2501.0, 2475.0, 2475.0, 2683.0, 2213.0, 2026.0, 2191.0, 2118.0, 2122.0, 1804.0, 1798.0, 1541.0, 1450.0, 1122.0, 865.0, 879.0, 795.0, 811.0, 576.0, 587.0, 500.0, 495.0, 499.0, 377.0, 321.0, 293.0, 303.0, 235.0, 242.0, 195.0, 167.0, 167.0, 139.0, 129.0, 117.0, 111.0, 110.0, 107.0, 80.0, 78.0, 75.0, 68.0, 61.0, 68.0, 72.0, 51.0, 44.0, 51.0, 40.0, 22.0, 23.0, 40.0, 40.0, 48.0, 28.0, 27.0, 22.0, 23.0, 26.0, 29.0, 30.0, 16.0, 12.0, 13.0, 8.0, 8.0, 11.0, 8.0, 10.0, 10.0, 12.0, 9.0, 8.0, 8.0, 5.0, 6.0, 10.0, 13.0, 11.0, 6.0, 4.0, 7.0, 3.0, 3.0, 3.0, 2.0, 5.0, 2.0, 5.0, 3.0, 5.0, 7.0, 6.0, 2.0, 3.0, 2.0, 2.0, 2.0, 2.0, 3.0, 2.0, 1.0, 1.0, 1.0, 1.0, 1.0, 1.0, 2.0, 4.0, 2.0, 3.0, 1.0, 1.0, 1.0, 0.0, 0.0, 0.0, 0.0, 0.0, 2.0, 0.0, 0.0, 0.0, 1.0, 0.0, 0.0, 0.0, 0.0, 0.0, 0.0, 0.0, 0.0, 1.0, 0.0, 0.0, 0.0, 0.0, 0.0, 0.0, 0.0, 0.0, 1.0, 0.0, 2.0, 0.0, 0.0, 3.0, 0.0, 0.0, 0.0, 0.0, 0.0],
    "Name": "TimePerFitDist-0",
    "Overflow": 87.0,
    "Type": "Histo1d",
    "Underflow": 0.0,
    "x": {
        "AxisTitle": "Fit Time [us]",
        "Bins": 201,
        "High": 401.0,
        "Low": -1.0
    },
    "y": {
        "AxisTitle": "Number of Pixels"
    },
    "z": {
        "AxisTitle": "z"
    }
}