{
    "Data": [6.0, 10.0, 0.0, 0.0, 3.0, 7.0, 31.0, 148.0, 459.0, 1198.0, 2502.0, 3900.0, 4882.0, 4646.0, 3852.0, 3467.0, 3782.0, 4245.0, 4387.0, 4166.0, 3250.0, 2426.0, 1592.0, 1075.0, 756.0, 720.0, 755.0, 939.0, 1201.0, 1392.0, 1543.0, 1663.0, 1671.0, 1580.0, 1526.0, 1448.0, 1291.0, 1132.0, 1052.0, 859.0, 753.0, 645.0, 555.0, 467.0, 380.0, 324.0, 239.0, 198.0, 139.0, 115.0, 100.0, 80.0, 57.0, 55.0, 37.0, 32.0, 28.0, 30.0, 22.0, 20.0, 15.0, 13.0, 14.0, 13.0, 12.0, 12.0, 8.0, 8.0, 2.0, 4.0, 3.0, 10.0],
    "Name": "NoiseDist-0",
    "Overflow": 80.0,
    "Type": "Histo1d",
    "Underflow": 0.0,
    "x": {
        "AxisTitle": "Noise [e]",
        "Bins": 72,
        "High": 361.0,
        "Low": -2.0
    },
    "y": {
        "AxisTitle": "Number of Pixels"
    },
    "z": {
        "AxisTitle": "z"
    }
}