time,Hardware,Voltage,Current
1622099524277,high-voltage-2,1,0.326807
time,Hardware,Voltage,Current
1622099524277,high-voltage-2,2,0.393708
time,Hardware,Voltage,Current
1622099524277,high-voltage-2,3,0.441208
time,Hardware,Voltage,Current
1622099524277,high-voltage-2,4,0.478058
time,Hardware,Voltage,Current
1622099524277,high-voltage-2,5,0.512049
time,Hardware,Voltage,Current
1622099524277,high-voltage-2,6,0.547255
time,Hardware,Voltage,Current
1622099524277,high-voltage-2,7,0.575876
time,Hardware,Voltage,Current
1622099524277,high-voltage-2,8,0.607855
time,Hardware,Voltage,Current
1622099524277,high-voltage-2,9,0.639008
time,Hardware,Voltage,Current
1622099524277,high-voltage-2,10,0.666907
time,Hardware,Voltage,Current
1622099524277,high-voltage-2,11,0.69593
time,Hardware,Voltage,Current
1622099524277,high-voltage-2,12,0.726663
time,Hardware,Voltage,Current
1622099524277,high-voltage-2,13,0.749687
time,Hardware,Voltage,Current
1622099524277,high-voltage-2,14,0.773647
time,Hardware,Voltage,Current
1622099524277,high-voltage-2,15,0.793918
time,Hardware,Voltage,Current
1622099524277,high-voltage-2,16,0.813092
time,Hardware,Voltage,Current
1622099524277,high-voltage-2,17,0.831035
time,Hardware,Voltage,Current
1622099524277,high-voltage-2,18,0.850227
time,Hardware,Voltage,Current
1622099524277,high-voltage-2,19,0.866608
time,Hardware,Voltage,Current
1622099524277,high-voltage-2,20,0.881686
time,Hardware,Voltage,Current
1622099524277,high-voltage-2,25,0.957539
time,Hardware,Voltage,Current
1622099524277,high-voltage-2,30,1.03661
time,Hardware,Voltage,Current
1622099524277,high-voltage-2,35,1.11312
time,Hardware,Voltage,Current
1622099524277,high-voltage-2,40,1.20701
time,Hardware,Voltage,Current
1622099524277,high-voltage-2,45,1.32463
time,Hardware,Voltage,Current
1622099524277,high-voltage-2,50,1.40329
time,Hardware,Voltage,Current
1622099524277,high-voltage-2,55,1.47647
time,Hardware,Voltage,Current
1622099524277,high-voltage-2,60,1.54506
time,Hardware,Voltage,Current
1622099524277,high-voltage-2,65,1.61031
time,Hardware,Voltage,Current
1622099524277,high-voltage-2,70,1.67657
time,Hardware,Voltage,Current
1622099524277,high-voltage-2,75,1.74196
time,Hardware,Voltage,Current
1622099524277,high-voltage-2,80,1.80141
time,Hardware,Voltage,Current
1622099524277,high-voltage-2,85,1.86217
time,Hardware,Voltage,Current
1622099524277,high-voltage-2,90,1.92151
time,Hardware,Voltage,Current
1622099524277,high-voltage-2,95,1.97965
time,Hardware,Voltage,Current
1622099524277,high-voltage-2,100,2.03447
