{
    "Data": [[3106.0, 1503.0, 993.0, 729.0, 539.0, 415.0, 332.0, 272.0, 247.0, 212.0, 167.0, 165.0, 138.0, 122.0, 127.0, 109.0, 99.0, 89.0, 82.0, 66.0, 68.0, 62.0, 54.0, 63.0, 58.0, 44.0, 39.0, 43.0, 36.0, 41.0, 34.0, 32.0, 35.0, 22.0, 30.0, 25.0, 25.0, 26.0, 35.0, 24.0, 23.0, 15.0, 13.0, 25.0, 22.0, 32.0, 23.0, 16.0, 27.0], [3149.0, 1833.0, 1328.0, 945.0, 765.0, 694.0, 569.0, 461.0, 411.0, 375.0, 306.0, 314.0, 242.0, 268.0, 210.0, 187.0, 184.0, 173.0, 183.0, 154.0, 139.0, 131.0, 134.0, 110.0, 99.0, 82.0, 96.0, 83.0, 90.0, 82.0, 79.0, 70.0, 59.0, 66.0, 53.0, 59.0, 50.0, 46.0, 50.0, 46.0, 59.0, 51.0, 43.0, 27.0, 37.0, 41.0, 39.0, 48.0, 42.0], [2826.0, 1853.0, 1320.0, 1069.0, 885.0, 825.0, 695.0, 631.0, 555.0, 511.0, 476.0, 455.0, 411.0, 374.0, 357.0, 331.0, 322.0, 291.0, 265.0, 272.0, 221.0, 258.0, 238.0, 226.0, 193.0, 187.0, 174.0, 160.0, 167.0, 142.0, 157.0, 134.0, 153.0, 158.0, 125.0, 131.0, 126.0, 108.0, 107.0, 108.0, 87.0, 99.0, 93.0, 104.0, 84.0, 88.0, 102.0, 84.0, 87.0], [2242.0, 1429.0, 1194.0, 1012.0, 919.0, 801.0, 737.0, 705.0, 627.0, 537.0, 557.0, 516.0, 511.0, 466.0, 483.0, 407.0, 394.0, 391.0, 390.0, 357.0, 378.0, 313.0, 340.0, 337.0, 355.0, 284.0, 318.0, 255.0, 287.0, 276.0, 298.0, 242.0, 248.0, 279.0, 261.0, 226.0, 212.0, 201.0, 196.0, 202.0, 229.0, 210.0, 207.0, 223.0, 201.0, 178.0, 186.0, 221.0, 206.0], [2152.0, 1123.0, 931.0, 756.0, 723.0, 630.0, 625.0, 611.0, 493.0, 540.0, 496.0, 481.0, 526.0, 467.0, 450.0, 480.0, 446.0, 478.0, 423.0, 426.0, 421.0, 384.0, 433.0, 424.0, 409.0, 398.0, 405.0, 383.0, 368.0, 360.0, 354.0, 366.0, 407.0, 382.0, 407.0, 407.0, 375.0, 373.0, 367.0, 355.0, 394.0, 367.0, 386.0, 389.0, 423.0, 430.0, 408.0, 469.0, 534.0], [3676.0, 1738.0, 1036.0, 741.0, 650.0, 570.0, 485.0, 507.0, 416.0, 420.0, 420.0, 447.0, 402.0, 383.0, 376.0, 381.0, 428.0, 371.0, 384.0, 408.0, 397.0, 416.0, 384.0, 409.0, 414.0, 390.0, 419.0, 404.0, 409.0, 422.0, 441.0, 450.0, 461.0, 453.0, 498.0, 470.0, 442.0, 514.0, 481.0, 549.0, 568.0, 549.0, 566.0, 590.0, 672.0, 733.0, 796.0, 887.0, 1030.0], [4845.0, 2977.0, 2142.0, 1660.0, 1346.0, 1095.0, 936.0, 770.0, 654.0, 625.0, 585.0, 536.0, 475.0, 458.0, 417.0, 368.0, 419.0, 367.0, 352.0, 368.0, 363.0, 349.0, 339.0, 363.0, 354.0, 378.0, 355.0, 354.0, 396.0, 382.0, 403.0, 431.0, 406.0, 418.0, 478.0, 482.0, 491.0, 599.0, 521.0, 582.0, 626.0, 661.0, 769.0, 828.0, 832.0, 1008.0, 1117.0, 1358.0, 1917.0], [1712.0, 1464.0, 1437.0, 1378.0, 1314.0, 1242.0, 1209.0, 1122.0, 1153.0, 1031.0, 1047.0, 973.0, 908.0, 925.0, 853.0, 794.0, 790.0, 800.0, 695.0, 676.0, 648.0, 616.0, 608.0, 615.0, 592.0, 567.0, 522.0, 538.0, 529.0, 495.0, 503.0, 487.0, 531.0, 520.0, 543.0, 480.0, 557.0, 533.0, 575.0, 561.0, 650.0, 692.0, 793.0, 926.0, 962.0, 1139.0, 1348.0, 1822.0, 2607.0], [385.0, 243.0, 248.0, 254.0, 251.0, 289.0, 326.0, 360.0, 362.0, 378.0, 434.0, 424.0, 468.0, 489.0, 531.0, 513.0, 550.0, 592.0, 605.0, 613.0, 690.0, 651.0, 687.0, 660.0, 785.0, 776.0, 784.0, 865.0, 835.0, 819.0, 836.0, 835.0, 889.0, 952.0, 926.0, 977.0, 919.0, 947.0, 1056.0, 1042.0, 1086.0, 1106.0, 1191.0, 1162.0, 1253.0, 1522.0, 1773.0, 2189.0, 3487.0], [305.0, 98.0, 65.0, 75.0, 52.0, 44.0, 53.0, 54.0, 59.0, 72.0, 72.0, 67.0, 76.0, 98.0, 89.0, 99.0, 110.0, 134.0, 128.0, 132.0, 155.0, 161.0, 172.0, 188.0, 218.0, 238.0, 252.0, 259.0, 302.0, 318.0, 368.0, 399.0, 416.0, 510.0, 514.0, 632.0, 650.0, 768.0, 849.0, 1012.0, 1128.0, 1218.0, 1424.0, 1617.0, 1972.0, 2297.0, 2822.0, 3687.0, 5573.0], [250.0, 118.0, 65.0, 52.0, 45.0, 31.0, 37.0, 29.0, 22.0, 25.0, 31.0, 29.0, 19.0, 28.0, 34.0, 31.0, 24.0, 31.0, 31.0, 33.0, 26.0, 31.0, 36.0, 34.0, 46.0, 50.0, 67.0, 55.0, 62.0, 75.0, 78.0, 74.0, 105.0, 116.0, 133.0, 143.0, 161.0, 198.0, 217.0, 296.0, 306.0, 394.0, 497.0, 619.0, 867.0, 1216.0, 1800.0, 2996.0, 6246.0], [301.0, 117.0, 45.0, 42.0, 37.0, 27.0, 23.0, 19.0, 21.0, 43.0, 21.0, 22.0, 20.0, 23.0, 22.0, 21.0, 14.0, 20.0, 13.0, 19.0, 19.0, 12.0, 19.0, 19.0, 13.0, 16.0, 27.0, 25.0, 21.0, 28.0, 31.0, 42.0, 29.0, 37.0, 44.0, 55.0, 50.0, 56.0, 61.0, 76.0, 92.0, 105.0, 148.0, 166.0, 268.0, 368.0, 603.0, 1098.0, 3120.0], [367.0, 112.0, 55.0, 43.0, 38.0, 33.0, 24.0, 23.0, 25.0, 21.0, 25.0, 23.0, 21.0, 12.0, 15.0, 11.0, 27.0, 13.0, 16.0, 11.0, 12.0, 12.0, 11.0, 13.0, 11.0, 12.0, 15.0, 8.0, 15.0, 13.0, 24.0, 9.0, 17.0, 16.0, 22.0, 25.0, 24.0, 18.0, 31.0, 34.0, 36.0, 45.0, 48.0, 67.0, 75.0, 135.0, 191.0, 369.0, 1232.0], [542.0, 148.0, 78.0, 30.0, 37.0, 27.0, 14.0, 22.0, 13.0, 25.0, 20.0, 16.0, 19.0, 19.0, 12.0, 20.0, 11.0, 6.0, 13.0, 9.0, 10.0, 14.0, 13.0, 11.0, 10.0, 8.0, 16.0, 16.0, 12.0, 17.0, 5.0, 18.0, 9.0, 13.0, 13.0, 18.0, 14.0, 19.0, 18.0, 15.0, 24.0, 21.0, 26.0, 30.0, 48.0, 49.0, 79.0, 160.0, 520.0], [922.0, 210.0, 93.0, 58.0, 28.0, 32.0, 33.0, 22.0, 21.0, 12.0, 17.0, 19.0, 11.0, 9.0, 7.0, 19.0, 13.0, 15.0, 14.0, 8.0, 10.0, 10.0, 9.0, 16.0, 10.0, 12.0, 13.0, 8.0, 11.0, 10.0, 9.0, 10.0, 8.0, 13.0, 3.0, 13.0, 10.0, 13.0, 10.0, 16.0, 12.0, 14.0, 26.0, 23.0, 23.0, 35.0, 49.0, 83.0, 230.0], [1735.0, 463.0, 185.0, 86.0, 47.0, 34.0, 19.0, 26.0, 18.0, 18.0, 17.0, 14.0, 14.0, 16.0, 14.0, 15.0, 14.0, 11.0, 16.0, 8.0, 6.0, 8.0, 4.0, 6.0, 11.0, 5.0, 6.0, 12.0, 8.0, 9.0, 9.0, 10.0, 7.0, 8.0, 5.0, 5.0, 13.0, 13.0, 12.0, 14.0, 15.0, 17.0, 17.0, 14.0, 16.0, 24.0, 26.0, 42.0, 133.0], [2798.0, 943.0, 416.0, 177.0, 96.0, 64.0, 41.0, 24.0, 24.0, 22.0, 21.0, 19.0, 22.0, 12.0, 5.0, 11.0, 6.0, 5.0, 9.0, 12.0, 11.0, 5.0, 13.0, 12.0, 8.0, 7.0, 11.0, 9.0, 3.0, 10.0, 8.0, 12.0, 9.0, 6.0, 7.0, 7.0, 5.0, 7.0, 8.0, 9.0, 14.0, 11.0, 12.0, 15.0, 10.0, 20.0, 24.0, 27.0, 62.0], [4060.0, 1696.0, 841.0, 483.0, 287.0, 197.0, 95.0, 79.0, 42.0, 38.0, 35.0, 27.0, 23.0, 13.0, 25.0, 12.0, 12.0, 9.0, 6.0, 5.0, 10.0, 7.0, 12.0, 12.0, 5.0, 13.0, 5.0, 6.0, 8.0, 5.0, 9.0, 5.0, 5.0, 7.0, 8.0, 7.0, 4.0, 7.0, 9.0, 9.0, 12.0, 6.0, 10.0, 13.0, 9.0, 9.0, 15.0, 25.0, 44.0], [4686.0, 2615.0, 1495.0, 978.0, 594.0, 427.0, 307.0, 185.0, 131.0, 127.0, 75.0, 67.0, 47.0, 40.0, 31.0, 19.0, 24.0, 19.0, 12.0, 19.0, 11.0, 15.0, 8.0, 11.0, 10.0, 4.0, 3.0, 3.0, 7.0, 10.0, 8.0, 3.0, 2.0, 8.0, 3.0, 4.0, 8.0, 12.0, 6.0, 8.0, 8.0, 9.0, 10.0, 7.0, 5.0, 16.0, 13.0, 21.0, 38.0], [4733.0, 3047.0, 2119.0, 1525.0, 1118.0, 809.0, 567.0, 449.0, 346.0, 277.0, 239.0, 171.0, 147.0, 125.0, 94.0, 67.0, 58.0, 46.0, 32.0, 33.0, 24.0, 26.0, 16.0, 20.0, 15.0, 14.0, 16.0, 8.0, 13.0, 12.0, 7.0, 8.0, 9.0, 7.0, 6.0, 9.0, 7.0, 7.0, 4.0, 5.0, 9.0, 8.0, 5.0, 4.0, 2.0, 9.0, 13.0, 14.0, 26.0], [3839.0, 2920.0, 2288.0, 1923.0, 1535.0, 1272.0, 1033.0, 851.0, 644.0, 589.0, 479.0, 416.0, 332.0, 251.0, 215.0, 188.0, 131.0, 134.0, 98.0, 107.0, 81.0, 88.0, 47.0, 53.0, 45.0, 43.0, 35.0, 21.0, 19.0, 13.0, 22.0, 22.0, 15.0, 11.0, 13.0, 8.0, 11.0, 12.0, 7.0, 5.0, 6.0, 5.0, 5.0, 8.0, 6.0, 11.0, 11.0, 9.0, 18.0], [2778.0, 2344.0, 2116.0, 1839.0, 1720.0, 1453.0, 1289.0, 1148.0, 918.0, 867.0, 764.0, 678.0, 612.0, 486.0, 427.0, 352.0, 296.0, 292.0, 241.0, 220.0, 202.0, 170.0, 173.0, 108.0, 103.0, 85.0, 83.0, 61.0, 58.0, 60.0, 51.0, 36.0, 35.0, 24.0, 29.0, 17.0, 18.0, 25.0, 16.0, 10.0, 6.0, 12.0, 15.0, 5.0, 8.0, 12.0, 11.0, 6.0, 19.0], [1647.0, 1590.0, 1597.0, 1473.0, 1425.0, 1339.0, 1318.0, 1214.0, 1108.0, 1032.0, 965.0, 877.0, 809.0, 728.0, 655.0, 610.0, 582.0, 531.0, 485.0, 426.0, 416.0, 396.0, 316.0, 296.0, 269.0, 219.0, 204.0, 150.0, 137.0, 139.0, 109.0, 111.0, 81.0, 85.0, 74.0, 65.0, 61.0, 57.0, 50.0, 41.0, 30.0, 28.0, 25.0, 17.0, 18.0, 13.0, 13.0, 18.0, 27.0], [939.0, 886.0, 934.0, 931.0, 997.0, 1008.0, 1031.0, 1129.0, 974.0, 1004.0, 957.0, 959.0, 923.0, 862.0, 811.0, 820.0, 779.0, 734.0, 695.0, 594.0, 579.0, 581.0, 544.0, 502.0, 473.0, 410.0, 404.0, 362.0, 345.0, 295.0, 266.0, 247.0, 255.0, 211.0, 169.0, 150.0, 143.0, 139.0, 118.0, 104.0, 83.0, 83.0, 63.0, 61.0, 63.0, 35.0, 25.0, 27.0, 29.0], [525.0, 437.0, 496.0, 567.0, 552.0, 652.0, 645.0, 686.0, 740.0, 772.0, 822.0, 798.0, 711.0, 813.0, 825.0, 779.0, 783.0, 797.0, 735.0, 774.0, 778.0, 686.0, 722.0, 642.0, 623.0, 617.0, 588.0, 579.0, 576.0, 506.0, 482.0, 488.0, 441.0, 388.0, 362.0, 321.0, 318.0, 318.0, 259.0, 259.0, 238.0, 204.0, 167.0, 132.0, 126.0, 111.0, 102.0, 62.0, 69.0], [332.0, 248.0, 244.0, 280.0, 306.0, 351.0, 342.0, 384.0, 417.0, 457.0, 517.0, 552.0, 507.0, 550.0, 631.0, 610.0, 691.0, 634.0, 654.0, 747.0, 731.0, 692.0, 684.0, 745.0, 706.0, 682.0, 717.0, 711.0, 721.0, 668.0, 630.0, 685.0, 635.0, 622.0, 608.0, 546.0, 582.0, 543.0, 511.0, 453.0, 450.0, 398.0, 400.0, 325.0, 326.0, 282.0, 228.0, 209.0, 174.0], [253.0, 144.0, 109.0, 123.0, 141.0, 152.0, 197.0, 191.0, 241.0, 237.0, 235.0, 300.0, 331.0, 341.0, 371.0, 372.0, 434.0, 437.0, 502.0, 513.0, 542.0, 555.0, 583.0, 580.0, 616.0, 649.0, 662.0, 710.0, 707.0, 696.0, 726.0, 767.0, 745.0, 789.0, 758.0, 763.0, 761.0, 787.0, 738.0, 701.0, 698.0, 724.0, 652.0, 693.0, 610.0, 633.0, 552.0, 472.0, 426.0], [233.0, 98.0, 73.0, 62.0, 59.0, 75.0, 88.0, 94.0, 76.0, 123.0, 133.0, 144.0, 161.0, 183.0, 163.0, 212.0, 255.0, 266.0, 286.0, 315.0, 342.0, 334.0, 345.0, 419.0, 423.0, 501.0, 505.0, 518.0, 599.0, 595.0, 645.0, 675.0, 727.0, 735.0, 826.0, 822.0, 876.0, 858.0, 903.0, 861.0, 923.0, 958.0, 1018.0, 974.0, 976.0, 968.0, 995.0, 1002.0, 927.0], [224.0, 78.0, 52.0, 33.0, 35.0, 33.0, 36.0, 38.0, 56.0, 51.0, 51.0, 70.0, 78.0, 89.0, 95.0, 100.0, 128.0, 134.0, 122.0, 170.0, 150.0, 190.0, 207.0, 210.0, 257.0, 304.0, 285.0, 353.0, 348.0, 406.0, 452.0, 496.0, 543.0, 607.0, 656.0, 711.0, 723.0, 864.0, 873.0, 979.0, 999.0, 1045.0, 1082.0, 1179.0, 1383.0, 1354.0, 1550.0, 1540.0, 1709.0], [187.0, 90.0, 49.0, 29.0, 26.0, 24.0, 25.0, 22.0, 26.0, 18.0, 35.0, 30.0, 31.0, 37.0, 33.0, 39.0, 48.0, 66.0, 79.0, 69.0, 90.0, 89.0, 111.0, 117.0, 115.0, 143.0, 166.0, 176.0, 234.0, 223.0, 258.0, 296.0, 339.0, 359.0, 422.0, 484.0, 533.0, 655.0, 693.0, 737.0, 905.0, 1009.0, 1071.0, 1249.0, 1384.0, 1622.0, 1876.0, 2134.0, 2690.0], [227.0, 69.0, 48.0, 27.0, 30.0, 23.0, 13.0, 16.0, 13.0, 22.0, 16.0, 20.0, 21.0, 19.0, 11.0, 24.0, 22.0, 19.0, 30.0, 34.0, 38.0, 42.0, 38.0, 45.0, 61.0, 82.0, 81.0, 95.0, 100.0, 94.0, 132.0, 150.0, 179.0, 205.0, 223.0, 291.0, 299.0, 354.0, 435.0, 494.0, 628.0, 761.0, 895.0, 1068.0, 1206.0, 1546.0, 1974.0, 2458.0, 3522.0], [218.0, 82.0, 46.0, 29.0, 27.0, 11.0, 13.0, 16.0, 15.0, 17.0, 16.0, 11.0, 12.0, 9.0, 16.0, 16.0, 10.0, 17.0, 10.0, 11.0, 17.0, 15.0, 21.0, 24.0, 16.0, 15.0, 33.0, 33.0, 53.0, 58.0, 51.0, 68.0, 79.0, 97.0, 109.0, 122.0, 174.0, 223.0, 240.0, 306.0, 393.0, 438.0, 554.0, 702.0, 965.0, 1237.0, 1686.0, 2497.0, 3986.0], [224.0, 71.0, 38.0, 34.0, 25.0, 18.0, 26.0, 15.0, 18.0, 13.0, 12.0, 14.0, 12.0, 7.0, 7.0, 7.0, 8.0, 8.0, 9.0, 6.0, 9.0, 3.0, 16.0, 16.0, 6.0, 19.0, 8.0, 19.0, 10.0, 16.0, 22.0, 21.0, 33.0, 50.0, 48.0, 74.0, 71.0, 99.0, 116.0, 153.0, 182.0, 260.0, 330.0, 428.0, 621.0, 840.0, 1362.0, 2068.0, 3682.0], [193.0, 78.0, 41.0, 28.0, 32.0, 16.0, 27.0, 14.0, 9.0, 17.0, 8.0, 18.0, 13.0, 6.0, 5.0, 12.0, 10.0, 1.0, 8.0, 9.0, 9.0, 9.0, 8.0, 6.0, 6.0, 6.0, 5.0, 7.0, 6.0, 5.0, 9.0, 17.0, 13.0, 23.0, 20.0, 26.0, 33.0, 39.0, 47.0, 73.0, 83.0, 126.0, 147.0, 201.0, 338.0, 495.0, 850.0, 1491.0, 3148.0], [213.0, 71.0, 43.0, 30.0, 23.0, 21.0, 10.0, 24.0, 15.0, 10.0, 20.0, 13.0, 8.0, 6.0, 12.0, 9.0, 11.0, 9.0, 6.0, 12.0, 6.0, 6.0, 5.0, 6.0, 6.0, 6.0, 9.0, 4.0, 4.0, 11.0, 9.0, 12.0, 5.0, 6.0, 8.0, 11.0, 13.0, 16.0, 20.0, 21.0, 37.0, 41.0, 70.0, 105.0, 157.0, 268.0, 482.0, 971.0, 2324.0], [193.0, 90.0, 48.0, 19.0, 20.0, 26.0, 15.0, 24.0, 23.0, 10.0, 15.0, 16.0, 10.0, 9.0, 7.0, 7.0, 3.0, 8.0, 4.0, 6.0, 11.0, 7.0, 8.0, 3.0, 4.0, 4.0, 3.0, 10.0, 9.0, 8.0, 3.0, 5.0, 9.0, 3.0, 6.0, 8.0, 3.0, 5.0, 4.0, 12.0, 19.0, 22.0, 28.0, 40.0, 82.0, 131.0, 248.0, 527.0, 1526.0], [224.0, 75.0, 47.0, 34.0, 16.0, 26.0, 18.0, 11.0, 13.0, 13.0, 16.0, 13.0, 13.0, 7.0, 5.0, 12.0, 8.0, 9.0, 6.0, 8.0, 7.0, 4.0, 5.0, 10.0, 3.0, 7.0, 7.0, 6.0, 4.0, 7.0, 7.0, 7.0, 7.0, 7.0, 1.0, 4.0, 6.0, 7.0, 2.0, 5.0, 3.0, 9.0, 6.0, 15.0, 30.0, 54.0, 97.0, 272.0, 941.0], [220.0, 63.0, 51.0, 32.0, 19.0, 27.0, 9.0, 21.0, 21.0, 17.0, 8.0, 11.0, 12.0, 11.0, 9.0, 9.0, 3.0, 8.0, 6.0, 13.0, 0.0, 7.0, 5.0, 4.0, 6.0, 11.0, 5.0, 5.0, 5.0, 4.0, 2.0, 8.0, 4.0, 7.0, 1.0, 8.0, 5.0, 4.0, 6.0, 5.0, 7.0, 6.0, 4.0, 5.0, 10.0, 19.0, 59.0, 144.0, 503.0], [215.0, 91.0, 41.0, 28.0, 25.0, 21.0, 10.0, 19.0, 16.0, 17.0, 8.0, 16.0, 14.0, 9.0, 12.0, 10.0, 4.0, 10.0, 9.0, 2.0, 4.0, 7.0, 5.0, 7.0, 9.0, 3.0, 6.0, 4.0, 5.0, 5.0, 4.0, 5.0, 5.0, 5.0, 6.0, 4.0, 7.0, 6.0, 5.0, 7.0, 4.0, 4.0, 6.0, 5.0, 6.0, 9.0, 16.0, 57.0, 257.0], [232.0, 79.0, 47.0, 32.0, 16.0, 20.0, 16.0, 15.0, 17.0, 11.0, 15.0, 10.0, 14.0, 8.0, 6.0, 11.0, 11.0, 6.0, 6.0, 11.0, 6.0, 3.0, 8.0, 4.0, 8.0, 3.0, 6.0, 2.0, 7.0, 4.0, 5.0, 8.0, 4.0, 1.0, 8.0, 8.0, 2.0, 7.0, 1.0, 5.0, 4.0, 3.0, 6.0, 5.0, 6.0, 5.0, 11.0, 21.0, 151.0], [217.0, 65.0, 43.0, 29.0, 30.0, 32.0, 10.0, 14.0, 9.0, 14.0, 13.0, 14.0, 14.0, 11.0, 7.0, 5.0, 13.0, 7.0, 12.0, 11.0, 9.0, 4.0, 10.0, 4.0, 1.0, 6.0, 5.0, 2.0, 7.0, 6.0, 6.0, 4.0, 3.0, 3.0, 5.0, 5.0, 5.0, 5.0, 5.0, 4.0, 3.0, 7.0, 1.0, 2.0, 3.0, 8.0, 10.0, 14.0, 59.0], [264.0, 73.0, 38.0, 33.0, 35.0, 12.0, 20.0, 17.0, 14.0, 22.0, 12.0, 11.0, 15.0, 7.0, 9.0, 8.0, 8.0, 8.0, 8.0, 4.0, 9.0, 5.0, 3.0, 4.0, 6.0, 4.0, 6.0, 12.0, 6.0, 7.0, 4.0, 5.0, 4.0, 5.0, 9.0, 5.0, 3.0, 5.0, 2.0, 3.0, 5.0, 6.0, 3.0, 3.0, 4.0, 4.0, 8.0, 7.0, 34.0], [228.0, 70.0, 43.0, 34.0, 20.0, 19.0, 13.0, 17.0, 16.0, 17.0, 10.0, 13.0, 10.0, 13.0, 5.0, 7.0, 11.0, 10.0, 13.0, 9.0, 5.0, 3.0, 12.0, 6.0, 7.0, 2.0, 5.0, 5.0, 6.0, 9.0, 7.0, 5.0, 6.0, 1.0, 7.0, 3.0, 5.0, 1.0, 3.0, 3.0, 2.0, 5.0, 4.0, 4.0, 9.0, 7.0, 3.0, 10.0, 19.0], [219.0, 87.0, 37.0, 34.0, 20.0, 22.0, 19.0, 17.0, 15.0, 12.0, 11.0, 7.0, 13.0, 7.0, 14.0, 7.0, 11.0, 16.0, 9.0, 9.0, 6.0, 8.0, 6.0, 7.0, 2.0, 7.0, 6.0, 5.0, 4.0, 7.0, 3.0, 5.0, 4.0, 6.0, 4.0, 10.0, 2.0, 3.0, 5.0, 5.0, 7.0, 1.0, 2.0, 6.0, 5.0, 3.0, 5.0, 6.0, 14.0], [192.0, 80.0, 41.0, 23.0, 27.0, 16.0, 23.0, 19.0, 11.0, 18.0, 16.0, 9.0, 9.0, 9.0, 15.0, 9.0, 11.0, 6.0, 6.0, 6.0, 6.0, 7.0, 9.0, 4.0, 4.0, 6.0, 3.0, 3.0, 3.0, 12.0, 4.0, 5.0, 4.0, 7.0, 5.0, 6.0, 7.0, 5.0, 5.0, 5.0, 2.0, 5.0, 3.0, 3.0, 3.0, 3.0, 10.0, 6.0, 9.0], [209.0, 83.0, 36.0, 31.0, 14.0, 12.0, 23.0, 20.0, 18.0, 16.0, 17.0, 15.0, 18.0, 11.0, 4.0, 8.0, 9.0, 7.0, 8.0, 8.0, 10.0, 4.0, 10.0, 5.0, 9.0, 4.0, 3.0, 4.0, 2.0, 2.0, 8.0, 9.0, 2.0, 5.0, 8.0, 4.0, 2.0, 2.0, 4.0, 7.0, 5.0, 3.0, 2.0, 4.0, 4.0, 3.0, 6.0, 7.0, 13.0], [211.0, 75.0, 38.0, 28.0, 27.0, 20.0, 18.0, 18.0, 12.0, 18.0, 14.0, 17.0, 16.0, 6.0, 7.0, 8.0, 4.0, 10.0, 4.0, 12.0, 6.0, 5.0, 9.0, 6.0, 6.0, 5.0, 7.0, 8.0, 3.0, 6.0, 6.0, 9.0, 4.0, 4.0, 5.0, 3.0, 8.0, 5.0, 5.0, 3.0, 4.0, 5.0, 5.0, 5.0, 3.0, 4.0, 5.0, 7.0, 4.0], [215.0, 81.0, 45.0, 37.0, 16.0, 17.0, 21.0, 19.0, 14.0, 16.0, 11.0, 9.0, 9.0, 11.0, 13.0, 6.0, 10.0, 17.0, 8.0, 6.0, 8.0, 5.0, 6.0, 1.0, 4.0, 6.0, 11.0, 5.0, 7.0, 6.0, 4.0, 5.0, 3.0, 3.0, 4.0, 3.0, 7.0, 3.0, 4.0, 5.0, 8.0, 8.0, 5.0, 1.0, 2.0, 5.0, 6.0, 8.0, 3.0], [240.0, 95.0, 39.0, 30.0, 20.0, 19.0, 14.0, 22.0, 21.0, 16.0, 11.0, 12.0, 5.0, 14.0, 11.0, 9.0, 7.0, 9.0, 10.0, 5.0, 4.0, 5.0, 13.0, 4.0, 6.0, 2.0, 7.0, 8.0, 5.0, 7.0, 6.0, 5.0, 2.0, 6.0, 3.0, 7.0, 6.0, 1.0, 3.0, 0.0, 5.0, 9.0, 5.0, 7.0, 5.0, 4.0, 6.0, 9.0, 2.0], [206.0, 77.0, 32.0, 25.0, 34.0, 18.0, 14.0, 15.0, 18.0, 16.0, 15.0, 7.0, 11.0, 12.0, 9.0, 14.0, 8.0, 9.0, 5.0, 7.0, 6.0, 7.0, 6.0, 6.0, 3.0, 8.0, 8.0, 2.0, 4.0, 11.0, 4.0, 5.0, 4.0, 5.0, 4.0, 5.0, 5.0, 4.0, 7.0, 3.0, 7.0, 5.0, 4.0, 4.0, 3.0, 5.0, 4.0, 3.0, 8.0], [217.0, 82.0, 54.0, 21.0, 26.0, 22.0, 17.0, 18.0, 13.0, 11.0, 11.0, 10.0, 12.0, 5.0, 9.0, 12.0, 10.0, 10.0, 6.0, 6.0, 7.0, 10.0, 4.0, 6.0, 5.0, 6.0, 5.0, 9.0, 5.0, 3.0, 7.0, 7.0, 4.0, 10.0, 1.0, 7.0, 7.0, 4.0, 3.0, 3.0, 3.0, 2.0, 5.0, 7.0, 4.0, 5.0, 4.0, 5.0, 8.0]],
    "Name": "sCurve-0",
    "Overflow": 2636230.0,
    "Type": "Histo2d",
    "Underflow": 0.0,
    "x": {
        "AxisTitle": "Vcal",
        "Bins": 51,
        "High": 302.5,
        "Low": 47.5
    },
    "y": {
        "AxisTitle": "Occupancy",
        "Bins": 49,
        "High": 49.5,
        "Low": 0.5
    },
    "z": {
        "AxisTitle": "Number of pixels"
    }
}