time,Hardware,Voltage,Current
1622071936984,high-voltage-3,1,0.0932277
time,Hardware,Voltage,Current
1622071936984,high-voltage-3,2,0.101706
time,Hardware,Voltage,Current
1622071936984,high-voltage-3,3,0.106727
time,Hardware,Voltage,Current
1622071936984,high-voltage-3,4,0.113266
time,Hardware,Voltage,Current
1622071936984,high-voltage-3,5,0.119097
time,Hardware,Voltage,Current
1622071936984,high-voltage-3,6,0.122614
time,Hardware,Voltage,Current
1622071936984,high-voltage-3,7,0.128239
time,Hardware,Voltage,Current
1622071936984,high-voltage-3,8,0.134212
time,Hardware,Voltage,Current
1622071936984,high-voltage-3,9,0.141769
time,Hardware,Voltage,Current
1622071936984,high-voltage-3,10,0.148406
time,Hardware,Voltage,Current
1622071936984,high-voltage-3,11,0.156428
time,Hardware,Voltage,Current
1622071936984,high-voltage-3,12,0.162556
time,Hardware,Voltage,Current
1622071936984,high-voltage-3,13,0.167946
time,Hardware,Voltage,Current
1622071936984,high-voltage-3,14,0.173567
time,Hardware,Voltage,Current
1622071936984,high-voltage-3,15,0.180107
time,Hardware,Voltage,Current
1622071936984,high-voltage-3,16,0.185183
time,Hardware,Voltage,Current
1622071936984,high-voltage-3,17,0.19001
time,Hardware,Voltage,Current
1622071936984,high-voltage-3,18,0.193272
time,Hardware,Voltage,Current
1622071936984,high-voltage-3,19,0.197127
time,Hardware,Voltage,Current
1622071936984,high-voltage-3,20,0.202909
time,Hardware,Voltage,Current
1622071936984,high-voltage-3,25,0.221388
time,Hardware,Voltage,Current
1622071936984,high-voltage-3,30,0.238171
time,Hardware,Voltage,Current
1622071936984,high-voltage-3,35,0.253528
time,Hardware,Voltage,Current
1622071936984,high-voltage-3,40,0.269138
time,Hardware,Voltage,Current
1622071936984,high-voltage-3,45,0.281632
time,Hardware,Voltage,Current
1622071936984,high-voltage-3,50,0.297425
time,Hardware,Voltage,Current
1622071936984,high-voltage-3,55,0.309262
time,Hardware,Voltage,Current
1622071936984,high-voltage-3,60,0.321084
time,Hardware,Voltage,Current
1622071936984,high-voltage-3,65,0.331337
time,Hardware,Voltage,Current
1622071936984,high-voltage-3,70,0.340566
time,Hardware,Voltage,Current
1622071936984,high-voltage-3,75,0.350431
time,Hardware,Voltage,Current
1622071936984,high-voltage-3,80,0.361538
time,Hardware,Voltage,Current
1622071936984,high-voltage-3,85,0.371722
time,Hardware,Voltage,Current
1622071936984,high-voltage-3,90,0.384077
time,Hardware,Voltage,Current
1622071936984,high-voltage-3,95,0.392711
time,Hardware,Voltage,Current
1622071936984,high-voltage-3,100,0.40465
1622072066249,high-voltage-3,1,0.0916764
1622072066249,high-voltage-3,2,0.100139
1622072066249,high-voltage-3,3,0.106659
1622072066249,high-voltage-3,4,0.112367
1622072066249,high-voltage-3,5,0.118615
1622072066249,high-voltage-3,6,0.123438
1622072066249,high-voltage-3,7,0.128035
1622072066249,high-voltage-3,8,0.134922
1622072066249,high-voltage-3,9,0.141733
1622072066249,high-voltage-3,10,0.14904
1622072066249,high-voltage-3,11,0.155917
1622072066249,high-voltage-3,12,0.162258
1622072066249,high-voltage-3,13,0.168347
1622072066249,high-voltage-3,14,0.174985
1622072066249,high-voltage-3,15,0.179311
1622072066249,high-voltage-3,16,0.184048
1622072066249,high-voltage-3,17,0.190001
1622072066249,high-voltage-3,18,0.193023
1622072066249,high-voltage-3,19,0.198421
1622072066249,high-voltage-3,20,0.20181
1622072066249,high-voltage-3,25,0.220492
1622072066249,high-voltage-3,30,0.237077
1622072066249,high-voltage-3,35,0.253989
1622072066249,high-voltage-3,40,0.268141
1622072066249,high-voltage-3,45,0.283283
1622072066249,high-voltage-3,50,0.294356
1622072066249,high-voltage-3,55,0.308675
1622072066249,high-voltage-3,60,0.320176
1622072066249,high-voltage-3,65,0.329918
1622072066249,high-voltage-3,70,0.341695
1622072066249,high-voltage-3,75,0.350114
1622072066249,high-voltage-3,80,0.360563
1622072066249,high-voltage-3,85,0.371031
1622072066249,high-voltage-3,90,0.381978
1622072066249,high-voltage-3,95,0.391125
1622072066249,high-voltage-3,100,0.402309
1622072195352,high-voltage-3,1,0.0917942
1622072195352,high-voltage-3,2,0.0988229
1622072195352,high-voltage-3,3,0.106784
1622072195352,high-voltage-3,4,0.112202
1622072195352,high-voltage-3,5,0.118551
1622072195352,high-voltage-3,6,0.122751
1622072195352,high-voltage-3,7,0.128375
1622072195352,high-voltage-3,8,0.134893
1622072195352,high-voltage-3,9,0.141871
1622072195352,high-voltage-3,10,0.148836
1622072195352,high-voltage-3,11,0.156146
1622072195352,high-voltage-3,12,0.161874
1622072195352,high-voltage-3,13,0.168819
1622072195352,high-voltage-3,14,0.173477
1622072195352,high-voltage-3,15,0.179181
1622072195352,high-voltage-3,16,0.184291
1622072195352,high-voltage-3,17,0.190102
1622072195352,high-voltage-3,18,0.193745
1622072195352,high-voltage-3,19,0.198708
1622072195352,high-voltage-3,20,0.202476
1622072195352,high-voltage-3,25,0.220899
1622072195352,high-voltage-3,30,0.238872
1622072195352,high-voltage-3,35,0.253189
1622072195352,high-voltage-3,40,0.269793
1622072195352,high-voltage-3,45,0.284504
1622072195352,high-voltage-3,50,0.296856
1622072195352,high-voltage-3,55,0.309235
1622072195352,high-voltage-3,60,0.319163
1622072195352,high-voltage-3,65,0.330761
1622072195352,high-voltage-3,70,0.340843
1622072195352,high-voltage-3,75,0.350438
1622072195352,high-voltage-3,80,0.362393
1622072195352,high-voltage-3,85,0.373623
1622072195352,high-voltage-3,90,0.382197
1622072195352,high-voltage-3,95,0.394701
1622072195352,high-voltage-3,100,0.405762
1622072322882,high-voltage-3,1,0.0906106
1622072322882,high-voltage-3,2,0.100094
1622072322882,high-voltage-3,3,0.107505
1622072322882,high-voltage-3,4,0.113247
1622072322882,high-voltage-3,5,0.119097
1622072322882,high-voltage-3,6,0.124058
1622072322882,high-voltage-3,7,0.128677
1622072322882,high-voltage-3,8,0.135477
1622072322882,high-voltage-3,9,0.141748
1622072322882,high-voltage-3,10,0.14789
1622072322882,high-voltage-3,11,0.156485
1622072322882,high-voltage-3,12,0.161904
1622072322882,high-voltage-3,13,0.168681
1622072322882,high-voltage-3,14,0.174299
1622072322882,high-voltage-3,15,0.179895
1622072322882,high-voltage-3,16,0.185544
1622072322882,high-voltage-3,17,0.190426
1622072322882,high-voltage-3,18,0.195096
1622072322882,high-voltage-3,19,0.198639
1622072322882,high-voltage-3,20,0.202184
1622072322882,high-voltage-3,25,0.221818
1622072322882,high-voltage-3,30,0.238863
1622072322882,high-voltage-3,35,0.253559
1622072322882,high-voltage-3,40,0.268502
1622072322882,high-voltage-3,45,0.282511
1622072322882,high-voltage-3,50,0.295265
1622072322882,high-voltage-3,55,0.309338
1622072322882,high-voltage-3,60,0.31954
1622072322882,high-voltage-3,65,0.330431
1622072322882,high-voltage-3,70,0.341773
1622072322882,high-voltage-3,75,0.353314
1622072322882,high-voltage-3,80,0.364583
1622072322882,high-voltage-3,85,0.375374
1622072322882,high-voltage-3,90,0.384124
1622072322882,high-voltage-3,95,0.395627
1622072322882,high-voltage-3,100,0.406392
