{
    "Data": [0.0, 0.0, 0.0, 0.0, 0.0, 0.0, 0.0, 0.0, 0.0, 0.0, 0.0, 0.0, 0.0, 0.0, 2.0, 1.0, 1.0, 0.0, 0.0, 1.0, 0.0, 1.0, 2.0, 6.0, 3.0, 5.0, 20.0, 21.0, 13.0, 14.0, 34.0, 68.0, 67.0, 110.0, 115.0, 115.0, 251.0, 759.0, 1263.0, 768.0, 575.0, 1321.0, 2552.0, 3736.0, 2113.0, 1572.0, 2210.0, 3357.0, 3307.0, 2208.0, 1937.0, 1903.0, 2570.0, 1763.0, 1358.0, 1218.0, 1212.0, 1276.0, 943.0, 840.0, 758.0, 875.0, 722.0, 545.0, 467.0, 402.0, 514.0, 415.0, 331.0, 303.0, 323.0, 342.0, 285.0, 219.0, 207.0, 214.0, 186.0, 171.0, 140.0, 140.0, 125.0, 113.0, 90.0, 80.0, 97.0, 83.0, 76.0, 53.0, 67.0, 60.0, 54.0, 41.0, 51.0, 40.0, 47.0, 48.0, 43.0, 43.0, 39.0, 29.0, 33.0, 16.0, 27.0, 20.0, 27.0, 28.0, 30.0, 32.0, 28.0, 17.0, 10.0, 15.0, 23.0, 11.0, 17.0, 12.0, 11.0, 17.0, 10.0, 14.0, 17.0, 13.0, 5.0, 5.0, 5.0, 7.0, 11.0, 13.0, 13.0, 1.0, 12.0, 6.0, 9.0, 9.0, 2.0, 4.0, 3.0, 7.0, 3.0, 6.0, 7.0, 5.0, 4.0, 8.0, 4.0, 4.0, 5.0, 3.0, 2.0, 5.0, 3.0, 4.0, 2.0, 4.0, 7.0, 3.0, 3.0, 4.0, 3.0, 4.0, 3.0, 3.0, 2.0, 0.0, 0.0, 1.0, 2.0, 2.0, 2.0, 5.0, 5.0, 2.0, 5.0, 6.0, 3.0, 5.0, 1.0, 2.0, 3.0, 3.0, 1.0, 0.0, 3.0, 0.0, 4.0, 2.0, 0.0, 1.0, 4.0, 8.0, 8.0, 10.0, 13.0, 11.0, 11.0, 17.0, 6.0, 6.0, 3.0, 8.0, 2.0],
    "Name": "TimePerFitDist-0",
    "Overflow": 324.0,
    "Type": "Histo1d",
    "Underflow": 0.0,
    "x": {
        "AxisTitle": "Fit Time [us]",
        "Bins": 201,
        "High": 401.0,
        "Low": -1.0
    },
    "y": {
        "AxisTitle": "Number of Pixels"
    },
    "z": {
        "AxisTitle": "z"
    }
}