{
    "Data": [3.0, 5.0, 5.0, 6.0, 14.0, 15.0, 22.0, 33.0, 63.0, 219.0, 545.0, 1327.0, 2601.0, 3934.0, 4665.0, 4259.0, 3419.0, 2608.0, 2294.0, 2433.0, 3240.0, 4003.0, 4366.0, 4482.0, 3780.0, 3129.0, 2389.0, 1733.0, 1503.0, 1337.0, 1079.0, 1002.0, 938.0, 835.0, 841.0, 890.0, 793.0, 781.0, 793.0, 767.0, 799.0, 765.0, 753.0, 699.0, 648.0, 588.0, 550.0, 530.0, 441.0, 389.0, 369.0, 327.0, 232.0, 216.0, 204.0, 174.0, 170.0, 119.0, 103.0, 106.0, 92.0, 77.0, 61.0, 70.0, 62.0, 49.0, 43.0, 46.0, 36.0, 20.0, 36.0, 26.0, 25.0, 21.0, 20.0, 25.0, 23.0, 15.0, 25.0, 21.0],
    "Name": "NoiseDist-0",
    "Overflow": 185.0,
    "Type": "Histo1d",
    "Underflow": 0.0,
    "x": {
        "AxisTitle": "Noise [e]",
        "Bins": 80,
        "High": 401.0,
        "Low": -2.0
    },
    "y": {
        "AxisTitle": "Number of Pixels"
    },
    "z": {
        "AxisTitle": "z"
    }
}