{
    "Data": [0.0, 0.0, 0.0, 0.0, 0.0, 0.0, 0.0, 0.0, 0.0, 0.0, 0.0, 0.0, 0.0, 1.0, 0.0, 1.0, 0.0, 0.0, 5.0, 0.0, 1.0, 0.0, 1.0, 11.0, 6.0, 16.0, 13.0, 20.0, 29.0, 31.0, 34.0, 38.0, 42.0, 46.0, 48.0, 50.0, 50.0, 48.0, 50.0, 50.0, 50.0, 15.0, 50.0, 50.0, 50.0, 43.0, 50.0, 50.0, 50.0, 50.0, 50.0],
    "Name": "Scurve-120-96",
    "Overflow": 0.0,
    "Type": "Histo1d",
    "Underflow": 0.0,
    "x": {
        "AxisTitle": "Vcal",
        "Bins": 51,
        "High": 302.5,
        "Low": 47.5
    },
    "y": {
        "AxisTitle": "Occupancy"
    },
    "z": {
        "AxisTitle": "z"
    }
}