time,Hardware,Voltage,Current
1621381933548,high-voltage-2,1,0.253357
time,Hardware,Voltage,Current
1621381933548,high-voltage-2,2,0.29709
time,Hardware,Voltage,Current
1621381933548,high-voltage-2,3,0.325083
time,Hardware,Voltage,Current
1621381933548,high-voltage-2,4,0.350273
time,Hardware,Voltage,Current
1621381933548,high-voltage-2,5,0.375957
time,Hardware,Voltage,Current
1621381933548,high-voltage-2,6,0.405399
time,Hardware,Voltage,Current
1621381933548,high-voltage-2,7,0.437804
time,Hardware,Voltage,Current
1621381933548,high-voltage-2,8,0.469478
time,Hardware,Voltage,Current
1621381933548,high-voltage-2,9,0.507014
time,Hardware,Voltage,Current
1621381933548,high-voltage-2,10,0.545012
time,Hardware,Voltage,Current
1621381933548,high-voltage-2,11,0.585241
time,Hardware,Voltage,Current
1621381933548,high-voltage-2,12,0.621039
time,Hardware,Voltage,Current
1621381933548,high-voltage-2,13,0.657179
time,Hardware,Voltage,Current
1621381933548,high-voltage-2,14,0.693921
time,Hardware,Voltage,Current
1621381933548,high-voltage-2,15,0.72532
time,Hardware,Voltage,Current
1621381933548,high-voltage-2,16,0.752746
time,Hardware,Voltage,Current
1621381933548,high-voltage-2,17,0.781563
time,Hardware,Voltage,Current
1621381933548,high-voltage-2,18,0.805174
time,Hardware,Voltage,Current
1621381933548,high-voltage-2,19,0.829261
time,Hardware,Voltage,Current
1621381933548,high-voltage-2,20,0.849061
time,Hardware,Voltage,Current
1621381933548,high-voltage-2,25,0.943569
time,Hardware,Voltage,Current
1621381933548,high-voltage-2,30,1.03647
time,Hardware,Voltage,Current
1621381933548,high-voltage-2,35,1.12739
time,Hardware,Voltage,Current
1621381933548,high-voltage-2,40,1.22863
time,Hardware,Voltage,Current
1621381933548,high-voltage-2,45,1.35243
time,Hardware,Voltage,Current
1621381933548,high-voltage-2,50,1.44267
time,Hardware,Voltage,Current
1621381933548,high-voltage-2,55,1.52412
time,Hardware,Voltage,Current
1621381933548,high-voltage-2,60,1.59913
time,Hardware,Voltage,Current
1621381933548,high-voltage-2,65,1.67294
time,Hardware,Voltage,Current
1621381933548,high-voltage-2,70,1.7435
time,Hardware,Voltage,Current
1621381933548,high-voltage-2,75,1.81574
time,Hardware,Voltage,Current
1621381933548,high-voltage-2,80,1.87996
time,Hardware,Voltage,Current
1621381933548,high-voltage-2,85,1.94569
time,Hardware,Voltage,Current
1621381933548,high-voltage-2,90,2.00846
time,Hardware,Voltage,Current
1621381933548,high-voltage-2,95,2.07273
time,Hardware,Voltage,Current
1621381933548,high-voltage-2,100,2.1331
