{
    "Data": [312.0, 1545.0, 313.0, 76.0, 163.0, 160.0, 109.0, 124.0, 94.0, 172.0, 328.0, 775.0, 1522.0, 2795.0, 3939.0, 4667.0, 4462.0, 3847.0, 3158.0, 3255.0, 3744.0, 4219.0, 4432.0, 4235.0, 3354.0, 2367.0, 1582.0, 985.0, 637.0, 460.0, 334.0, 252.0, 275.0, 259.0, 268.0, 249.0, 253.0, 244.0, 261.0, 237.0, 235.0, 256.0, 223.0, 231.0, 193.0, 226.0, 199.0, 209.0, 177.0, 199.0, 172.0, 176.0, 145.0, 179.0, 137.0, 161.0, 141.0, 134.0, 138.0, 120.0, 122.0, 119.0, 124.0, 123.0, 100.0, 94.0, 104.0, 98.0, 98.0, 84.0, 80.0, 85.0, 83.0, 91.0, 87.0, 87.0, 67.0, 62.0, 77.0, 71.0, 72.0, 87.0, 80.0, 74.0, 66.0, 65.0, 71.0, 46.0, 73.0, 65.0, 72.0, 61.0, 55.0, 58.0, 65.0, 56.0, 59.0, 69.0, 54.0, 59.0, 59.0, 45.0, 41.0, 54.0, 48.0, 46.0, 45.0, 41.0, 51.0, 53.0, 43.0, 35.0, 34.0, 48.0, 31.0, 32.0, 52.0, 42.0, 27.0, 47.0, 35.0, 27.0, 43.0, 28.0, 35.0, 42.0, 40.0, 40.0, 37.0, 33.0, 42.0, 42.0, 31.0, 30.0, 44.0, 39.0, 38.0, 32.0, 38.0, 23.0, 34.0, 31.0, 33.0, 39.0, 31.0, 27.0, 38.0, 23.0, 34.0, 29.0, 32.0, 28.0, 32.0, 31.0, 21.0, 25.0, 23.0, 22.0, 32.0, 27.0, 27.0, 28.0, 26.0, 20.0, 27.0, 24.0, 29.0, 22.0, 16.0, 20.0, 26.0, 21.0, 17.0, 22.0, 15.0, 14.0, 24.0, 23.0, 20.0],
    "Name": "NoiseDist-0",
    "Overflow": 524.0,
    "Type": "Histo1d",
    "Underflow": 0.0,
    "x": {
        "AxisTitle": "Noise [e]",
        "Bins": 179,
        "High": 896.0,
        "Low": -2.0
    },
    "y": {
        "AxisTitle": "Number of Pixels"
    },
    "z": {
        "AxisTitle": "z"
    }
}