{
    "Data": [0.0, 0.0, 0.0, 0.0, 0.0, 0.0, 0.0, 0.0, 0.0, 0.0, 0.0, 0.0, 0.0, 0.0, 2.0, 0.0, 0.0, 46.0, 408.0, 119.0, 44.0, 1044.0, 4415.0, 1560.0, 396.0, 1396.0, 4026.0, 2182.0, 556.0, 1109.0, 2113.0, 1383.0, 435.0, 265.0, 460.0, 495.0, 296.0, 411.0, 629.0, 607.0, 428.0, 846.0, 1590.0, 1925.0, 1387.0, 1566.0, 2406.0, 3171.0, 2773.0, 2402.0, 2370.0, 2614.0, 2436.0, 2006.0, 1923.0, 2041.0, 2070.0, 1841.0, 1653.0, 1525.0, 1442.0, 1249.0, 925.0, 872.0, 790.0, 718.0, 721.0, 515.0, 480.0, 455.0, 479.0, 395.0, 333.0, 277.0, 231.0, 239.0, 204.0, 188.0, 152.0, 153.0, 124.0, 106.0, 100.0, 85.0, 76.0, 87.0, 71.0, 61.0, 60.0, 53.0, 53.0, 45.0, 38.0, 39.0, 48.0, 37.0, 32.0, 29.0, 32.0, 24.0, 22.0, 22.0, 17.0, 17.0, 25.0, 15.0, 20.0, 11.0, 13.0, 13.0, 7.0, 15.0, 14.0, 17.0, 11.0, 11.0, 13.0, 7.0, 4.0, 8.0, 3.0, 16.0, 16.0, 9.0, 11.0, 6.0, 9.0, 4.0, 6.0, 7.0, 11.0, 5.0, 3.0, 3.0, 6.0, 6.0, 5.0, 6.0, 2.0, 2.0, 3.0, 4.0, 2.0, 3.0, 3.0, 3.0, 3.0, 3.0, 2.0, 1.0, 0.0, 1.0, 1.0, 1.0, 4.0, 3.0, 1.0, 4.0, 2.0, 2.0, 1.0, 0.0, 2.0, 0.0, 0.0, 0.0, 1.0, 0.0, 1.0, 2.0, 1.0, 0.0, 1.0, 0.0, 1.0, 0.0, 2.0, 0.0, 0.0, 1.0, 0.0, 0.0, 1.0, 1.0, 1.0, 1.0, 1.0, 0.0, 0.0, 1.0, 0.0, 1.0, 0.0, 1.0, 2.0, 0.0, 0.0, 0.0, 0.0, 0.0, 0.0],
    "Name": "TimePerFitDist-0",
    "Overflow": 63.0,
    "Type": "Histo1d",
    "Underflow": 0.0,
    "x": {
        "AxisTitle": "Fit Time [us]",
        "Bins": 201,
        "High": 401.0,
        "Low": -1.0
    },
    "y": {
        "AxisTitle": "Number of Pixels"
    },
    "z": {
        "AxisTitle": "z"
    }
}