time,Hardware,Voltage,Current
1625775037539,high-voltage-3,1,0.0722471
time,Hardware,Voltage,Current
1625775037539,high-voltage-3,2,0.0793929
time,Hardware,Voltage,Current
1625775037539,high-voltage-3,3,0.0848085
time,Hardware,Voltage,Current
1625775037539,high-voltage-3,4,0.0874584
time,Hardware,Voltage,Current
1625775037539,high-voltage-3,5,0.0916752
time,Hardware,Voltage,Current
1625775037539,high-voltage-3,6,0.0952677
time,Hardware,Voltage,Current
1625775037539,high-voltage-3,7,0.0970975
time,Hardware,Voltage,Current
1625775037539,high-voltage-3,8,0.0986723
time,Hardware,Voltage,Current
1625775037539,high-voltage-3,9,0.102136
time,Hardware,Voltage,Current
1625775037539,high-voltage-3,10,0.10598
time,Hardware,Voltage,Current
1625775037539,high-voltage-3,11,0.109095
time,Hardware,Voltage,Current
1625775037539,high-voltage-3,12,0.110764
time,Hardware,Voltage,Current
1625775037539,high-voltage-3,13,0.113719
time,Hardware,Voltage,Current
1625775037539,high-voltage-3,14,0.1173
time,Hardware,Voltage,Current
1625775037539,high-voltage-3,15,0.120247
time,Hardware,Voltage,Current
1625775037539,high-voltage-3,16,0.122753
time,Hardware,Voltage,Current
1625775037539,high-voltage-3,17,0.123992
time,Hardware,Voltage,Current
1625775037539,high-voltage-3,18,0.126068
time,Hardware,Voltage,Current
1625775037539,high-voltage-3,19,0.128376
time,Hardware,Voltage,Current
1625775037539,high-voltage-3,20,0.131462
time,Hardware,Voltage,Current
1625775037539,high-voltage-3,25,0.142644
time,Hardware,Voltage,Current
1625775037539,high-voltage-3,30,0.15073
time,Hardware,Voltage,Current
1625775037539,high-voltage-3,35,0.159295
time,Hardware,Voltage,Current
1625775037539,high-voltage-3,40,0.167624
time,Hardware,Voltage,Current
1625775037539,high-voltage-3,45,0.173821
time,Hardware,Voltage,Current
1625775037539,high-voltage-3,50,0.181426
time,Hardware,Voltage,Current
1625775037539,high-voltage-3,55,0.189184
time,Hardware,Voltage,Current
1625775037539,high-voltage-3,60,0.197231
time,Hardware,Voltage,Current
1625775037539,high-voltage-3,65,0.205251
time,Hardware,Voltage,Current
1625775037539,high-voltage-3,70,0.212825
time,Hardware,Voltage,Current
1625775037539,high-voltage-3,75,0.222088
time,Hardware,Voltage,Current
1625775037539,high-voltage-3,80,0.228363
time,Hardware,Voltage,Current
1625775037539,high-voltage-3,85,0.238145
time,Hardware,Voltage,Current
1625775037539,high-voltage-3,90,0.246374
time,Hardware,Voltage,Current
1625775037539,high-voltage-3,95,0.256464
time,Hardware,Voltage,Current
1625775037539,high-voltage-3,100,0.264756
