{
    "Data": [152.0, 557.0, 123.0, 42.0, 106.0, 92.0, 100.0, 76.0, 114.0, 194.0, 437.0, 979.0, 1940.0, 3180.0, 4271.0, 4576.0, 4084.0, 3573.0, 3054.0, 3350.0, 3795.0, 4272.0, 4439.0, 3907.0, 2984.0, 2173.0, 1427.0, 923.0, 607.0, 473.0, 368.0, 370.0, 374.0, 329.0, 343.0, 313.0, 322.0, 291.0, 324.0, 331.0, 335.0, 337.0, 315.0, 316.0, 284.0, 285.0, 277.0, 276.0, 268.0, 253.0, 227.0, 224.0, 234.0, 226.0, 211.0, 206.0, 216.0, 203.0, 210.0, 188.0, 189.0, 162.0, 154.0, 137.0, 152.0, 173.0, 151.0, 144.0, 130.0, 116.0, 136.0, 120.0, 107.0, 130.0, 117.0, 117.0, 103.0, 111.0, 111.0, 94.0, 83.0, 95.0, 91.0, 91.0, 90.0, 99.0, 69.0, 85.0, 78.0, 75.0, 57.0, 84.0, 72.0, 71.0, 82.0, 78.0, 70.0, 82.0, 74.0, 71.0, 65.0, 61.0, 68.0, 54.0, 69.0, 53.0, 60.0, 60.0, 63.0, 56.0, 61.0, 39.0, 45.0, 48.0, 47.0, 44.0, 24.0, 38.0, 41.0, 40.0, 33.0, 41.0, 17.0, 34.0, 26.0, 29.0, 29.0, 31.0, 26.0, 29.0, 19.0, 28.0, 16.0, 16.0, 22.0, 22.0, 22.0, 13.0, 17.0, 22.0, 22.0, 14.0, 16.0, 17.0, 14.0, 11.0, 12.0, 19.0, 20.0, 20.0, 17.0, 14.0, 20.0, 17.0, 16.0, 16.0, 10.0, 15.0, 16.0],
    "Name": "NoiseDist-0",
    "Overflow": 501.0,
    "Type": "Histo1d",
    "Underflow": 0.0,
    "x": {
        "AxisTitle": "Noise [e]",
        "Bins": 159,
        "High": 796.0,
        "Low": -2.0
    },
    "y": {
        "AxisTitle": "Number of Pixels"
    },
    "z": {
        "AxisTitle": "z"
    }
}