{
    "Data": [5.0, 2.0, 0.0, 0.0, 0.0, 2.0, 9.0, 29.0, 85.0, 255.0, 633.0, 1361.0, 2561.0, 3606.0, 4126.0, 3715.0, 3017.0, 2276.0, 2186.0, 2480.0, 2967.0, 3383.0, 3579.0, 3178.0, 2665.0, 2035.0, 1371.0, 997.0, 722.0, 600.0, 530.0, 495.0, 463.0, 412.0, 310.0, 273.0, 246.0, 152.0, 144.0, 107.0, 89.0, 61.0, 55.0, 43.0, 26.0, 26.0, 25.0, 7.0, 16.0, 6.0, 9.0, 10.0, 9.0, 12.0, 12.0, 10.0],
    "Name": "NoiseDist-0",
    "Overflow": 190.0,
    "Type": "Histo1d",
    "Underflow": 0.0,
    "x": {
        "AxisTitle": "Noise [e]",
        "Bins": 56,
        "High": 281.0,
        "Low": -2.0
    },
    "y": {
        "AxisTitle": "Number of Pixels"
    },
    "z": {
        "AxisTitle": "z"
    }
}