{
    "Data": [142.0, 1043.0, 176.0, 59.0, 114.0, 142.0, 129.0, 113.0, 107.0, 95.0, 118.0, 145.0, 291.0, 505.0, 904.0, 1605.0, 2428.0, 3136.0, 3659.0, 3887.0, 3536.0, 2872.0, 2323.0, 2011.0, 2104.0, 2534.0, 3154.0, 3604.0, 3777.0, 3491.0, 2893.0, 2177.0, 1589.0, 1112.0, 790.0, 573.0, 483.0, 398.0, 336.0, 345.0, 310.0, 295.0, 309.0, 357.0, 321.0, 322.0, 324.0, 295.0, 347.0, 364.0, 300.0, 315.0, 320.0, 344.0, 317.0, 288.0, 310.0, 278.0, 301.0, 289.0, 330.0, 272.0, 272.0, 278.0, 254.0, 243.0, 243.0, 223.0, 212.0, 209.0, 203.0, 191.0, 203.0, 196.0, 162.0, 146.0, 140.0, 151.0, 132.0, 121.0, 132.0, 117.0, 120.0, 99.0, 105.0, 89.0, 82.0, 97.0, 85.0, 88.0, 72.0, 86.0, 68.0, 60.0, 57.0, 70.0, 58.0, 57.0, 51.0, 49.0, 50.0, 46.0, 39.0, 44.0, 46.0, 35.0, 40.0, 42.0, 41.0, 34.0, 44.0, 39.0, 27.0, 38.0, 31.0, 24.0, 24.0, 22.0, 28.0, 23.0, 28.0, 18.0, 19.0, 29.0, 31.0, 23.0, 24.0, 30.0, 18.0, 25.0, 24.0, 16.0, 11.0, 20.0, 20.0, 14.0, 14.0, 14.0, 17.0, 21.0, 19.0, 14.0, 15.0, 15.0, 8.0, 6.0, 11.0, 10.0],
    "Name": "NoiseDist-0",
    "Overflow": 432.0,
    "Type": "Histo1d",
    "Underflow": 0.0,
    "x": {
        "AxisTitle": "Noise [e]",
        "Bins": 148,
        "High": 741.0,
        "Low": -2.0
    },
    "y": {
        "AxisTitle": "Number of Pixels"
    },
    "z": {
        "AxisTitle": "z"
    }
}