{
    "Data": [136.0, 952.0, 177.0, 43.0, 138.0, 118.0, 110.0, 97.0, 66.0, 72.0, 91.0, 140.0, 259.0, 465.0, 927.0, 1554.0, 2272.0, 3121.0, 3672.0, 3770.0, 3605.0, 2936.0, 2429.0, 2026.0, 2155.0, 2657.0, 3188.0, 3654.0, 3860.0, 3431.0, 2986.0, 2174.0, 1560.0, 1114.0, 690.0, 544.0, 415.0, 384.0, 351.0, 326.0, 333.0, 310.0, 345.0, 306.0, 314.0, 315.0, 314.0, 319.0, 324.0, 321.0, 321.0, 276.0, 407.0, 311.0, 296.0, 317.0, 308.0, 283.0, 252.0, 268.0, 276.0, 271.0, 237.0, 257.0, 260.0, 241.0, 239.0, 210.0, 207.0, 218.0, 205.0, 198.0, 208.0, 177.0, 163.0, 162.0, 150.0, 116.0, 137.0, 111.0, 114.0, 115.0, 111.0, 103.0, 104.0, 95.0, 82.0, 91.0, 80.0, 92.0, 77.0, 68.0, 80.0, 68.0, 72.0, 66.0, 60.0, 69.0, 65.0, 45.0, 52.0, 43.0, 72.0, 60.0, 43.0, 50.0, 45.0, 36.0, 37.0, 38.0, 52.0, 35.0, 38.0, 37.0, 45.0, 22.0, 33.0, 26.0, 35.0, 35.0, 36.0, 18.0, 31.0, 20.0, 27.0, 18.0, 19.0, 31.0, 27.0, 13.0, 23.0, 18.0, 24.0, 19.0, 20.0, 10.0, 18.0, 11.0, 10.0, 17.0, 7.0, 12.0, 9.0],
    "Name": "NoiseDist-0",
    "Overflow": 362.0,
    "Type": "Histo1d",
    "Underflow": 0.0,
    "x": {
        "AxisTitle": "Noise [e]",
        "Bins": 143,
        "High": 716.0,
        "Low": -2.0
    },
    "y": {
        "AxisTitle": "Number of Pixels"
    },
    "z": {
        "AxisTitle": "z"
    }
}