time,Hardware,Voltage,Current
1623282668894,high-voltage,1,0.0262499
time,Hardware,Voltage,Current
1623282668894,high-voltage,2,0.0345581
time,Hardware,Voltage,Current
1623282668894,high-voltage,3,0.0416354
time,Hardware,Voltage,Current
1623282668894,high-voltage,4,0.0478335
time,Hardware,Voltage,Current
1623282668894,high-voltage,5,0.053691
time,Hardware,Voltage,Current
1623282668894,high-voltage,6,0.0581587
time,Hardware,Voltage,Current
1623282668894,high-voltage,7,0.0641662
time,Hardware,Voltage,Current
1623282668894,high-voltage,8,0.0685412
time,Hardware,Voltage,Current
1623282668894,high-voltage,9,0.0737052
time,Hardware,Voltage,Current
1623282668894,high-voltage,10,0.0783138
time,Hardware,Voltage,Current
1623282668894,high-voltage,11,0.081992
time,Hardware,Voltage,Current
1623282668894,high-voltage,12,0.0851628
time,Hardware,Voltage,Current
1623282668894,high-voltage,13,0.0886104
time,Hardware,Voltage,Current
1623282668894,high-voltage,14,0.0930945
time,Hardware,Voltage,Current
1623282668894,high-voltage,15,0.0952515
time,Hardware,Voltage,Current
1623282668894,high-voltage,16,0.097987
time,Hardware,Voltage,Current
1623282668894,high-voltage,17,0.099769
time,Hardware,Voltage,Current
1623282668894,high-voltage,18,0.102177
time,Hardware,Voltage,Current
1623282668894,high-voltage,1.04782e-07,0.105575
time,Hardware,Voltage,Current
1623282668894,high-voltage,20,0.107729
time,Hardware,Voltage,Current
1623282668894,high-voltage,25,0.119437
time,Hardware,Voltage,Current
1623282668894,high-voltage,30,0.134984
time,Hardware,Voltage,Current
1623282668894,high-voltage,35,0.185054
time,Hardware,Voltage,Current
1623282668894,high-voltage,40,0.363937
