{
    "chipType" : "RD53A",
    "chips" : [
        {
            "config" : "configs/rd53a_Triplet1012_IndCmdChipA.json",
            "tx" : 0,
            "rx" : 0,
            "enable" : 1,
            "locked" : 0
        },
        {
            "config" : "configs/rd53a_Triplet1012_IndCmdChipB.json",
            "tx" : 1,
            "rx" : 1,
            "enable" : 1,
            "locked" : 0
        },
        {
            "config" : "configs/rd53a_Triplet1012_IndCmdChipC.json",
            "tx" : 2,
            "rx" : 2,
            "enable" : 1,
            "locked" : 0
        }
    ]
}
