{
    "Data": [0.0, 0.0, 0.0, 0.0, 0.0, 0.0, 0.0, 0.0, 0.0, 0.0, 0.0, 0.0, 0.0, 1.0, 1.0, 0.0, 0.0, 27.0, 414.0, 215.0, 28.0, 156.0, 2503.0, 2175.0, 308.0, 666.0, 2957.0, 2421.0, 515.0, 975.0, 2401.0, 2177.0, 606.0, 643.0, 854.0, 605.0, 333.0, 698.0, 1162.0, 1134.0, 663.0, 976.0, 1913.0, 3233.0, 2262.0, 1448.0, 2298.0, 3478.0, 3818.0, 2769.0, 2198.0, 2208.0, 2858.0, 2263.0, 1722.0, 1587.0, 1467.0, 1656.0, 1331.0, 1223.0, 1136.0, 1034.0, 855.0, 668.0, 617.0, 541.0, 608.0, 477.0, 431.0, 382.0, 367.0, 336.0, 284.0, 267.0, 257.0, 227.0, 211.0, 171.0, 159.0, 144.0, 129.0, 119.0, 135.0, 113.0, 98.0, 108.0, 69.0, 52.0, 59.0, 53.0, 72.0, 70.0, 58.0, 52.0, 47.0, 39.0, 44.0, 28.0, 34.0, 34.0, 32.0, 35.0, 35.0, 25.0, 26.0, 28.0, 15.0, 17.0, 17.0, 28.0, 29.0, 21.0, 12.0, 19.0, 13.0, 8.0, 12.0, 6.0, 7.0, 9.0, 9.0, 12.0, 12.0, 11.0, 8.0, 5.0, 9.0, 5.0, 8.0, 2.0, 8.0, 3.0, 2.0, 4.0, 4.0, 6.0, 2.0, 1.0, 5.0, 4.0, 5.0, 4.0, 0.0, 2.0, 0.0, 3.0, 1.0, 0.0, 3.0, 1.0, 2.0, 2.0, 2.0, 2.0, 1.0, 5.0, 5.0, 0.0, 0.0, 2.0, 1.0, 1.0, 3.0, 4.0, 0.0, 0.0, 1.0, 1.0, 1.0, 0.0, 0.0, 1.0, 1.0, 0.0, 0.0, 3.0, 1.0, 1.0, 1.0, 3.0, 1.0, 0.0, 1.0, 1.0, 1.0, 0.0, 1.0, 1.0, 1.0, 0.0, 0.0, 2.0, 0.0, 1.0, 1.0, 1.0, 0.0, 0.0, 0.0, 0.0, 1.0],
    "Name": "TimePerFitDist-0",
    "Overflow": 116.0,
    "Type": "Histo1d",
    "Underflow": 0.0,
    "x": {
        "AxisTitle": "Fit Time [us]",
        "Bins": 201,
        "High": 401.0,
        "Low": -1.0
    },
    "y": {
        "AxisTitle": "Number of Pixels"
    },
    "z": {
        "AxisTitle": "z"
    }
}