{
    "Data": [0.0, 0.0, 0.0, 0.0, 0.0, 0.0, 0.0, 0.0, 0.0, 0.0, 0.0, 0.0, 0.0, 12.0, 9.0, 2.0, 3.0, 133.0, 401.0, 161.0, 66.0, 669.0, 2504.0, 1637.0, 528.0, 1420.0, 2629.0, 1968.0, 731.0, 1183.0, 1795.0, 1582.0, 750.0, 691.0, 662.0, 666.0, 552.0, 811.0, 1350.0, 1009.0, 646.0, 1165.0, 2461.0, 3638.0, 2438.0, 1760.0, 2374.0, 3942.0, 3565.0, 3005.0, 2123.0, 2221.0, 2666.0, 1844.0, 1570.0, 1412.0, 1683.0, 1515.0, 1500.0, 1011.0, 971.0, 1014.0, 696.0, 616.0, 499.0, 624.0, 533.0, 441.0, 356.0, 341.0, 377.0, 352.0, 309.0, 190.0, 235.0, 228.0, 213.0, 195.0, 137.0, 165.0, 152.0, 125.0, 85.0, 86.0, 104.0, 89.0, 84.0, 47.0, 55.0, 62.0, 67.0, 37.0, 45.0, 44.0, 39.0, 30.0, 32.0, 25.0, 38.0, 23.0, 25.0, 19.0, 25.0, 16.0, 21.0, 20.0, 8.0, 18.0, 20.0, 9.0, 14.0, 12.0, 7.0, 10.0, 17.0, 11.0, 10.0, 7.0, 7.0, 9.0, 10.0, 6.0, 4.0, 4.0, 3.0, 5.0, 3.0, 5.0, 6.0, 5.0, 3.0, 1.0, 3.0, 6.0, 2.0, 6.0, 2.0, 5.0, 6.0, 1.0, 7.0, 6.0, 3.0, 1.0, 3.0, 1.0, 1.0, 1.0, 2.0, 2.0, 3.0, 3.0, 0.0, 2.0, 1.0, 4.0, 0.0, 2.0, 1.0, 1.0, 2.0, 3.0, 1.0, 1.0, 1.0, 1.0, 3.0, 1.0, 0.0, 0.0, 1.0, 3.0, 3.0, 1.0, 0.0, 5.0, 1.0, 2.0, 0.0, 0.0, 2.0, 1.0, 1.0, 1.0, 0.0, 1.0, 1.0, 1.0, 1.0, 0.0, 3.0, 2.0, 1.0, 0.0, 0.0, 2.0, 0.0, 1.0, 2.0, 3.0, 0.0],
    "Name": "TimePerFitDist-0",
    "Overflow": 141.0,
    "Type": "Histo1d",
    "Underflow": 0.0,
    "x": {
        "AxisTitle": "Fit Time [us]",
        "Bins": 201,
        "High": 401.0,
        "Low": -1.0
    },
    "y": {
        "AxisTitle": "Number of Pixels"
    },
    "z": {
        "AxisTitle": "z"
    }
}