{
    "Data": [0.0, 0.0, 0.0, 0.0, 0.0, 0.0, 0.0, 0.0, 0.0, 0.0, 0.0, 0.0, 0.0, 0.0, 53.0, 17.0, 8.0, 19.0, 21.0, 12.0, 13.0, 24.0, 30.0, 58.0, 88.0, 167.0, 213.0, 219.0, 310.0, 362.0, 418.0, 451.0, 393.0, 463.0, 785.0, 850.0, 692.0, 1233.0, 2396.0, 2998.0, 2442.0, 2390.0, 3649.0, 4869.0, 3969.0, 2696.0, 2929.0, 4402.0, 3942.0, 2552.0, 1766.0, 1853.0, 1831.0, 1531.0, 1246.0, 1115.0, 1313.0, 1184.0, 901.0, 783.0, 812.0, 765.0, 692.0, 605.0, 518.0, 531.0, 491.0, 424.0, 401.0, 345.0, 319.0, 318.0, 261.0, 224.0, 189.0, 214.0, 179.0, 160.0, 129.0, 125.0, 160.0, 129.0, 99.0, 106.0, 118.0, 92.0, 94.0, 87.0, 84.0, 71.0, 78.0, 60.0, 51.0, 60.0, 49.0, 51.0, 46.0, 29.0, 42.0, 45.0, 37.0, 38.0, 34.0, 23.0, 34.0, 37.0, 23.0, 30.0, 27.0, 27.0, 26.0, 18.0, 17.0, 22.0, 25.0, 12.0, 22.0, 28.0, 23.0, 31.0, 18.0, 20.0, 13.0, 17.0, 21.0, 19.0, 19.0, 11.0, 17.0, 16.0, 18.0, 12.0, 13.0, 11.0, 7.0, 16.0, 17.0, 9.0, 8.0, 8.0, 12.0, 10.0, 14.0, 13.0, 12.0, 10.0, 14.0, 5.0, 11.0, 9.0, 6.0, 5.0, 12.0, 6.0, 10.0, 5.0, 11.0, 6.0, 11.0, 8.0, 6.0, 8.0, 3.0, 7.0, 9.0, 5.0, 5.0, 5.0, 9.0, 6.0, 7.0, 4.0, 3.0, 5.0, 1.0, 2.0, 7.0, 6.0, 7.0, 5.0, 4.0, 6.0, 5.0, 4.0, 7.0, 2.0, 1.0, 2.0, 4.0, 4.0, 2.0, 5.0, 6.0, 2.0, 3.0, 0.0, 1.0, 3.0, 1.0, 3.0, 0.0],
    "Name": "TimePerFitDist-0",
    "Overflow": 309.0,
    "Type": "Histo1d",
    "Underflow": 0.0,
    "x": {
        "AxisTitle": "Fit Time [us]",
        "Bins": 201,
        "High": 401.0,
        "Low": -1.0
    },
    "y": {
        "AxisTitle": "Number of Pixels"
    },
    "z": {
        "AxisTitle": "z"
    }
}