{
    "Data": [0.0, 0.0, 0.0, 0.0, 0.0, 0.0, 0.0, 0.0, 0.0, 0.0, 0.0, 0.0, 0.0, 0.0, 0.0, 0.0, 0.0, 0.0, 0.0, 0.0, 0.0, 0.0, 0.0, 0.0, 0.0, 0.0, 0.0, 0.0, 0.0, 0.0, 0.0, 0.0, 0.0, 0.0, 0.0, 0.0, 0.0, 0.0, 0.0, 0.0, 0.0, 0.0, 0.0, 0.0, 0.0, 0.0, 0.0, 0.0, 0.0, 0.0, 1.0, 8.0, 7.0, 14.0, 10.0, 14.0, 12.0, 17.0, 17.0, 18.0, 20.0, 19.0, 27.0, 27.0, 22.0, 29.0, 31.0, 34.0, 46.0, 56.0, 62.0, 79.0, 95.0, 114.0, 173.0, 152.0, 154.0, 265.0, 275.0, 321.0, 380.0, 433.0, 441.0, 581.0, 639.0, 720.0, 794.0, 829.0, 960.0, 1051.0, 1302.0, 1578.0, 2003.0, 2787.0, 3194.0, 3795.0, 4080.0, 4084.0, 3746.0, 3272.0, 2906.0, 2183.0, 1615.0, 1222.0, 879.0, 712.0, 553.0, 451.0, 355.0, 339.0, 266.0, 216.0, 201.0, 146.0, 123.0, 107.0, 84.0, 71.0, 63.0, 45.0, 28.0, 45.0, 52.0, 39.0, 25.0, 20.0, 17.0, 23.0, 25.0, 17.0, 18.0, 19.0, 25.0, 17.0, 14.0, 17.0, 12.0, 8.0, 15.0, 16.0, 5.0, 13.0, 12.0, 12.0, 6.0, 13.0, 6.0, 8.0, 12.0, 11.0, 7.0, 4.0, 4.0, 9.0, 3.0, 3.0, 6.0, 7.0, 5.0, 4.0, 7.0, 1.0, 5.0, 7.0, 6.0, 7.0, 7.0, 17.0, 18.0, 20.0, 23.0, 22.0, 33.0, 54.0, 65.0, 70.0, 104.0, 109.0, 114.0, 166.0, 181.0, 229.0, 258.0, 340.0, 365.0, 383.0, 494.0, 513.0, 487.0, 566.0, 638.0, 669.0, 700.0, 761.0, 775.0, 772.0, 803.0, 806.0, 795.0, 827.0, 798.0, 763.0, 759.0, 748.0, 662.0, 625.0, 633.0, 577.0, 575.0, 495.0, 480.0, 415.0, 431.0, 355.0, 313.0, 291.0, 263.0, 242.0, 236.0, 211.0, 195.0, 167.0, 149.0, 151.0, 129.0, 110.0, 107.0, 93.0, 74.0, 85.0, 76.0, 80.0, 65.0, 61.0, 63.0, 70.0, 51.0, 55.0, 35.0, 34.0, 35.0, 30.0, 30.0, 26.0, 26.0, 26.0, 24.0, 23.0, 20.0, 18.0, 23.0, 20.0, 22.0, 10.0, 13.0, 13.0, 9.0, 9.0, 17.0, 11.0, 12.0, 15.0, 6.0, 12.0, 9.0, 6.0, 6.0, 8.0, 8.0, 7.0, 7.0, 5.0, 5.0, 1.0, 7.0, 2.0, 4.0, 4.0, 3.0, 6.0, 3.0, 2.0, 4.0, 2.0, 3.0, 5.0, 4.0, 4.0, 3.0, 3.0, 4.0, 5.0, 3.0, 2.0, 2.0, 1.0, 1.0, 1.0, 1.0, 2.0, 2.0, 1.0, 4.0, 1.0, 0.0, 0.0, 2.0, 3.0, 1.0, 1.0, 0.0, 1.0, 1.0, 0.0, 3.0, 3.0, 2.0, 1.0, 0.0, 1.0, 2.0, 0.0, 0.0, 1.0, 3.0, 0.0, 0.0, 0.0, 0.0, 0.0, 0.0, 0.0, 0.0, 0.0, 0.0, 0.0, 0.0, 0.0, 0.0, 0.0, 0.0, 0.0, 0.0, 0.0, 0.0, 0.0, 0.0, 0.0, 0.0, 0.0, 0.0, 0.0, 0.0, 0.0, 0.0, 0.0, 0.0, 0.0, 0.0, 0.0, 0.0, 0.0, 0.0, 0.0, 0.0, 0.0, 0.0, 0.0, 0.0, 0.0, 0.0, 0.0, 0.0, 0.0, 0.0, 0.0, 0.0, 0.0, 0.0, 0.0],
    "Name": "ThresholdDist-0",
    "Overflow": 0.0,
    "Type": "Histo1d",
    "Underflow": 0.0,
    "x": {
        "AxisTitle": "Threshold [e]",
        "Bins": 380,
        "High": 3795.0,
        "Low": -5.0
    },
    "y": {
        "AxisTitle": "Number of Pixels"
    },
    "z": {
        "AxisTitle": "z"
    }
}