{
    "Data": [3475.0, 23551.0, 16820.0, 6135.0, 2568.0, 2214.0, 2866.0, 3547.0, 3643.0, 3362.0, 2739.0, 2011.0, 1392.0, 889.0, 575.0, 346.0, 179.0, 131.0, 75.0, 33.0, 23.0, 10.0, 14.0, 6.0, 12.0, 1.0, 4.0, 4.0, 0.0, 2.0, 2.0, 1.0, 1.0, 0.0, 4.0, 1.0, 1.0, 0.0, 0.0, 0.0, 4.0, 0.0, 0.0, 4.0, 0.0, 0.0, 0.0, 3.0, 1.0, 0.0, 1.0],
    "Name": "Chi2Dist-0",
    "Overflow": 0.0,
    "Type": "Histo1d",
    "Underflow": 0.0,
    "x": {
        "AxisTitle": "Fit Chi/ndf",
        "Bins": 51,
        "High": 2.5250000953674318,
        "Low": -0.02500000037252903
    },
    "y": {
        "AxisTitle": "Number of Pixels"
    },
    "z": {
        "AxisTitle": "z"
    }
}