time,Hardware,Voltage,Current
1626618421903,high-voltage-3,1,0.377226
time,Hardware,Voltage,Current
1626618421903,high-voltage-3,2,0.395936
time,Hardware,Voltage,Current
1626618421903,high-voltage-3,3,0.416117
time,Hardware,Voltage,Current
1626618421903,high-voltage-3,4,0.433213
time,Hardware,Voltage,Current
1626618421903,high-voltage-3,5,0.447088
time,Hardware,Voltage,Current
1626618421903,high-voltage-3,6,0.458525
time,Hardware,Voltage,Current
1626618421903,high-voltage-3,7,0.47271
time,Hardware,Voltage,Current
1626618421903,high-voltage-3,8,0.488733
time,Hardware,Voltage,Current
1626618421903,high-voltage-3,9,0.507263
time,Hardware,Voltage,Current
1626618421903,high-voltage-3,10,0.522798
time,Hardware,Voltage,Current
1626618421903,high-voltage-3,11,0.540117
time,Hardware,Voltage,Current
1626618421903,high-voltage-3,12,0.556215
time,Hardware,Voltage,Current
1626618421903,high-voltage-3,13,0.571816
time,Hardware,Voltage,Current
1626618421903,high-voltage-3,14,0.587077
time,Hardware,Voltage,Current
1626618421903,high-voltage-3,15,0.600684
time,Hardware,Voltage,Current
1626618421903,high-voltage-3,16,0.612819
time,Hardware,Voltage,Current
1626618421903,high-voltage-3,17,0.623523
time,Hardware,Voltage,Current
1626618421903,high-voltage-3,18,0.632958
time,Hardware,Voltage,Current
1626618421903,high-voltage-3,19,0.64175
time,Hardware,Voltage,Current
1626618421903,high-voltage-3,20,0.652292
time,Hardware,Voltage,Current
1626618421903,high-voltage-3,25,0.697619
time,Hardware,Voltage,Current
1626618421903,high-voltage-3,30,0.735657
time,Hardware,Voltage,Current
1626618421903,high-voltage-3,35,0.771527
time,Hardware,Voltage,Current
1626618421903,high-voltage-3,40,0.805303
time,Hardware,Voltage,Current
1626618421903,high-voltage-3,45,0.835151
time,Hardware,Voltage,Current
1626618421903,high-voltage-3,50,0.864164
time,Hardware,Voltage,Current
1626618421903,high-voltage-3,55,0.89068
time,Hardware,Voltage,Current
1626618421903,high-voltage-3,60,0.916859
time,Hardware,Voltage,Current
1626618421903,high-voltage-3,65,0.940703
time,Hardware,Voltage,Current
1626618421903,high-voltage-3,70,0.964836
time,Hardware,Voltage,Current
1626618421903,high-voltage-3,75,0.99524
time,Hardware,Voltage,Current
1626618421903,high-voltage-3,80,1.01373
time,Hardware,Voltage,Current
1626618421903,high-voltage-3,85,1.03972
time,Hardware,Voltage,Current
1626618421903,high-voltage-3,90,1.06814
time,Hardware,Voltage,Current
1626618421903,high-voltage-3,95,1.094
time,Hardware,Voltage,Current
1626618421903,high-voltage-3,100,1.11839
