{
    "Data": [0.0, 0.0, 0.0, 0.0, 0.0, 0.0, 0.0, 0.0, 0.0, 0.0, 0.0, 0.0, 0.0, 0.0, 1.0, 4.0, 1.0, 3.0, 3.0, 6.0, 7.0, 13.0, 10.0, 24.0, 22.0, 39.0, 10.0, 38.0, 43.0, 46.0, 31.0, 48.0, 48.0, 50.0, 50.0, 50.0, 33.0, 50.0, 50.0, 50.0, 50.0, 50.0, 50.0, 50.0, 33.0, 50.0, 50.0, 50.0, 50.0, 50.0, 50.0],
    "Name": "Scurve-100-96",
    "Overflow": 0.0,
    "Type": "Histo1d",
    "Underflow": 0.0,
    "x": {
        "AxisTitle": "Vcal",
        "Bins": 51,
        "High": 302.5,
        "Low": 47.5
    },
    "y": {
        "AxisTitle": "Occupancy"
    },
    "z": {
        "AxisTitle": "z"
    }
}