{
    "Data": [[7068.0, 4013.0, 2822.0, 2154.0, 1917.0, 1550.0, 1364.0, 1265.0, 1070.0, 1010.0, 965.0, 888.0, 844.0, 802.0, 755.0, 748.0, 711.0, 691.0, 665.0, 633.0, 600.0, 591.0, 567.0, 549.0, 580.0, 488.0, 516.0, 537.0, 523.0, 511.0, 515.0, 524.0, 509.0, 511.0, 478.0, 488.0, 504.0, 478.0, 509.0, 458.0, 482.0, 544.0, 563.0, 532.0, 549.0, 606.0, 601.0, 637.0, 802.0], [7160.0, 4031.0, 2867.0, 2195.0, 1812.0, 1593.0, 1349.0, 1288.0, 1067.0, 1041.0, 1012.0, 967.0, 871.0, 810.0, 745.0, 810.0, 704.0, 647.0, 678.0, 688.0, 640.0, 641.0, 561.0, 542.0, 554.0, 562.0, 513.0, 566.0, 494.0, 483.0, 489.0, 509.0, 520.0, 533.0, 502.0, 537.0, 517.0, 537.0, 524.0, 571.0, 539.0, 554.0, 569.0, 553.0, 620.0, 635.0, 727.0, 755.0, 903.0], [7208.0, 3988.0, 2790.0, 2189.0, 1888.0, 1630.0, 1380.0, 1275.0, 1092.0, 1082.0, 990.0, 896.0, 881.0, 855.0, 754.0, 779.0, 744.0, 683.0, 683.0, 632.0, 676.0, 596.0, 614.0, 614.0, 571.0, 597.0, 552.0, 548.0, 534.0, 551.0, 500.0, 532.0, 549.0, 512.0, 514.0, 505.0, 509.0, 548.0, 608.0, 514.0, 576.0, 543.0, 632.0, 634.0, 644.0, 741.0, 784.0, 904.0, 1173.0], [7178.0, 4009.0, 2904.0, 2185.0, 1832.0, 1619.0, 1379.0, 1249.0, 1141.0, 1042.0, 964.0, 911.0, 926.0, 848.0, 823.0, 744.0, 741.0, 679.0, 718.0, 632.0, 687.0, 593.0, 585.0, 588.0, 603.0, 546.0, 544.0, 575.0, 544.0, 510.0, 556.0, 583.0, 511.0, 538.0, 571.0, 575.0, 550.0, 588.0, 584.0, 575.0, 628.0, 592.0, 625.0, 624.0, 703.0, 756.0, 872.0, 1010.0, 1308.0], [7021.0, 4002.0, 2815.0, 2212.0, 1802.0, 1567.0, 1468.0, 1225.0, 1191.0, 1040.0, 987.0, 931.0, 893.0, 877.0, 762.0, 733.0, 760.0, 717.0, 697.0, 657.0, 646.0, 694.0, 631.0, 599.0, 595.0, 587.0, 573.0, 600.0, 503.0, 570.0, 553.0, 564.0, 517.0, 562.0, 553.0, 587.0, 519.0, 546.0, 639.0, 591.0, 641.0, 615.0, 655.0, 709.0, 730.0, 831.0, 897.0, 1133.0, 1566.0], [6955.0, 3930.0, 2884.0, 2263.0, 1897.0, 1565.0, 1336.0, 1318.0, 1083.0, 1097.0, 987.0, 935.0, 856.0, 817.0, 811.0, 732.0, 725.0, 657.0, 671.0, 709.0, 677.0, 664.0, 638.0, 583.0, 553.0, 606.0, 596.0, 594.0, 558.0, 608.0, 571.0, 534.0, 553.0, 512.0, 584.0, 553.0, 583.0, 570.0, 613.0, 600.0, 624.0, 643.0, 704.0, 701.0, 806.0, 875.0, 970.0, 1268.0, 1724.0], [6890.0, 3894.0, 2780.0, 2181.0, 1787.0, 1548.0, 1452.0, 1202.0, 1134.0, 1033.0, 976.0, 943.0, 914.0, 799.0, 801.0, 761.0, 704.0, 749.0, 685.0, 697.0, 681.0, 620.0, 593.0, 637.0, 567.0, 540.0, 577.0, 559.0, 603.0, 581.0, 518.0, 581.0, 562.0, 570.0, 545.0, 519.0, 611.0, 610.0, 637.0, 612.0, 635.0, 672.0, 708.0, 727.0, 790.0, 866.0, 1039.0, 1224.0, 1965.0], [6868.0, 3841.0, 2791.0, 2175.0, 1816.0, 1517.0, 1373.0, 1217.0, 1138.0, 1030.0, 965.0, 903.0, 878.0, 802.0, 789.0, 740.0, 759.0, 669.0, 722.0, 677.0, 627.0, 636.0, 630.0, 585.0, 572.0, 596.0, 580.0, 571.0, 548.0, 578.0, 536.0, 563.0, 555.0, 551.0, 552.0, 545.0, 569.0, 573.0, 637.0, 647.0, 685.0, 649.0, 747.0, 754.0, 807.0, 883.0, 1062.0, 1299.0, 2017.0], [6759.0, 3877.0, 2706.0, 2183.0, 1800.0, 1510.0, 1335.0, 1194.0, 1127.0, 964.0, 923.0, 866.0, 890.0, 789.0, 732.0, 753.0, 760.0, 736.0, 662.0, 659.0, 663.0, 612.0, 588.0, 602.0, 597.0, 567.0, 561.0, 578.0, 547.0, 554.0, 547.0, 557.0, 577.0, 605.0, 563.0, 572.0, 578.0, 618.0, 610.0, 595.0, 628.0, 675.0, 736.0, 737.0, 780.0, 934.0, 980.0, 1317.0, 2138.0], [6611.0, 3700.0, 2601.0, 2161.0, 1739.0, 1506.0, 1444.0, 1182.0, 1065.0, 936.0, 956.0, 867.0, 805.0, 801.0, 748.0, 728.0, 715.0, 633.0, 686.0, 634.0, 620.0, 645.0, 577.0, 615.0, 566.0, 567.0, 546.0, 579.0, 571.0, 579.0, 586.0, 518.0, 529.0, 539.0, 555.0, 571.0, 582.0, 626.0, 615.0, 589.0, 661.0, 644.0, 688.0, 751.0, 807.0, 924.0, 1051.0, 1375.0, 2192.0], [6534.0, 3761.0, 2592.0, 2106.0, 1705.0, 1473.0, 1261.0, 1208.0, 1012.0, 959.0, 906.0, 830.0, 855.0, 845.0, 695.0, 739.0, 656.0, 704.0, 609.0, 638.0, 613.0, 597.0, 594.0, 524.0, 598.0, 580.0, 569.0, 529.0, 565.0, 539.0, 531.0, 546.0, 569.0, 526.0, 497.0, 577.0, 553.0, 599.0, 604.0, 593.0, 672.0, 680.0, 708.0, 729.0, 858.0, 872.0, 1063.0, 1324.0, 2126.0], [6405.0, 3669.0, 2596.0, 2005.0, 1764.0, 1409.0, 1238.0, 1140.0, 1077.0, 968.0, 919.0, 850.0, 792.0, 740.0, 726.0, 688.0, 669.0, 645.0, 697.0, 595.0, 617.0, 579.0, 545.0, 558.0, 556.0, 544.0, 563.0, 538.0, 527.0, 530.0, 533.0, 501.0, 539.0, 580.0, 527.0, 547.0, 543.0, 546.0, 553.0, 612.0, 596.0, 617.0, 656.0, 709.0, 850.0, 905.0, 1088.0, 1326.0, 2189.0], [6542.0, 3598.0, 2551.0, 1979.0, 1713.0, 1412.0, 1196.0, 1103.0, 1040.0, 918.0, 877.0, 838.0, 772.0, 779.0, 738.0, 688.0, 606.0, 652.0, 597.0, 655.0, 559.0, 557.0, 554.0, 599.0, 504.0, 533.0, 563.0, 548.0, 489.0, 538.0, 529.0, 513.0, 520.0, 524.0, 508.0, 532.0, 514.0, 523.0, 548.0, 521.0, 607.0, 604.0, 686.0, 713.0, 729.0, 894.0, 1022.0, 1328.0, 2132.0], [6528.0, 3452.0, 2496.0, 2063.0, 1663.0, 1373.0, 1194.0, 1117.0, 1009.0, 947.0, 860.0, 759.0, 806.0, 721.0, 661.0, 634.0, 660.0, 646.0, 589.0, 571.0, 624.0, 570.0, 519.0, 562.0, 462.0, 519.0, 523.0, 513.0, 510.0, 498.0, 547.0, 485.0, 456.0, 492.0, 488.0, 501.0, 555.0, 527.0, 552.0, 532.0, 578.0, 596.0, 652.0, 703.0, 755.0, 809.0, 966.0, 1314.0, 2136.0], [6612.0, 3437.0, 2473.0, 1947.0, 1580.0, 1321.0, 1212.0, 1068.0, 993.0, 896.0, 846.0, 797.0, 669.0, 722.0, 657.0, 652.0, 620.0, 605.0, 607.0, 560.0, 556.0, 535.0, 573.0, 510.0, 559.0, 523.0, 497.0, 485.0, 451.0, 522.0, 462.0, 504.0, 493.0, 465.0, 485.0, 501.0, 510.0, 533.0, 541.0, 573.0, 541.0, 586.0, 637.0, 638.0, 694.0, 784.0, 895.0, 1120.0, 2003.0], [6837.0, 3483.0, 2521.0, 1918.0, 1540.0, 1355.0, 1155.0, 1046.0, 916.0, 861.0, 804.0, 752.0, 765.0, 678.0, 662.0, 673.0, 615.0, 584.0, 564.0, 558.0, 555.0, 519.0, 505.0, 503.0, 488.0, 537.0, 480.0, 480.0, 428.0, 475.0, 492.0, 408.0, 454.0, 415.0, 489.0, 495.0, 478.0, 479.0, 537.0, 513.0, 546.0, 571.0, 651.0, 603.0, 724.0, 716.0, 922.0, 1186.0, 1925.0], [7305.0, 3569.0, 2480.0, 1829.0, 1481.0, 1332.0, 1158.0, 1023.0, 921.0, 834.0, 808.0, 738.0, 706.0, 697.0, 593.0, 632.0, 601.0, 605.0, 526.0, 533.0, 549.0, 510.0, 490.0, 492.0, 481.0, 476.0, 485.0, 453.0, 440.0, 467.0, 426.0, 475.0, 417.0, 466.0, 438.0, 450.0, 432.0, 476.0, 486.0, 490.0, 550.0, 553.0, 528.0, 591.0, 635.0, 726.0, 834.0, 1092.0, 1910.0], [7637.0, 3839.0, 2464.0, 1876.0, 1474.0, 1314.0, 1112.0, 986.0, 917.0, 802.0, 838.0, 728.0, 710.0, 679.0, 666.0, 622.0, 581.0, 564.0, 511.0, 507.0, 487.0, 515.0, 465.0, 472.0, 457.0, 444.0, 452.0, 424.0, 475.0, 426.0, 415.0, 432.0, 418.0, 415.0, 432.0, 436.0, 465.0, 429.0, 435.0, 492.0, 494.0, 471.0, 541.0, 598.0, 632.0, 685.0, 820.0, 1027.0, 1751.0], [8452.0, 4027.0, 2672.0, 1975.0, 1526.0, 1245.0, 1095.0, 975.0, 918.0, 826.0, 755.0, 726.0, 674.0, 602.0, 666.0, 584.0, 571.0, 517.0, 533.0, 504.0, 489.0, 461.0, 467.0, 484.0, 482.0, 465.0, 411.0, 440.0, 439.0, 443.0, 410.0, 403.0, 418.0, 381.0, 409.0, 429.0, 442.0, 439.0, 442.0, 442.0, 467.0, 481.0, 486.0, 519.0, 566.0, 631.0, 740.0, 941.0, 1590.0], [9293.0, 4456.0, 2825.0, 2047.0, 1556.0, 1345.0, 1139.0, 962.0, 897.0, 787.0, 773.0, 696.0, 635.0, 624.0, 608.0, 579.0, 570.0, 529.0, 506.0, 484.0, 489.0, 483.0, 491.0, 480.0, 409.0, 392.0, 419.0, 393.0, 385.0, 394.0, 394.0, 386.0, 409.0, 380.0, 408.0, 399.0, 404.0, 416.0, 433.0, 418.0, 440.0, 480.0, 504.0, 496.0, 577.0, 590.0, 679.0, 863.0, 1494.0], [10009.0, 5071.0, 3193.0, 2186.0, 1637.0, 1355.0, 1178.0, 1019.0, 879.0, 773.0, 737.0, 729.0, 631.0, 616.0, 556.0, 545.0, 549.0, 543.0, 524.0, 449.0, 479.0, 444.0, 500.0, 467.0, 452.0, 378.0, 418.0, 394.0, 395.0, 416.0, 380.0, 376.0, 422.0, 430.0, 384.0, 371.0, 399.0, 397.0, 403.0, 390.0, 421.0, 414.0, 451.0, 475.0, 508.0, 558.0, 634.0, 824.0, 1392.0], [10470.0, 5461.0, 3626.0, 2322.0, 1738.0, 1427.0, 1163.0, 1024.0, 873.0, 792.0, 741.0, 679.0, 673.0, 604.0, 543.0, 557.0, 581.0, 508.0, 505.0, 505.0, 440.0, 434.0, 456.0, 417.0, 430.0, 450.0, 420.0, 390.0, 376.0, 374.0, 368.0, 363.0, 374.0, 375.0, 366.0, 362.0, 355.0, 395.0, 427.0, 392.0, 426.0, 434.0, 394.0, 446.0, 493.0, 532.0, 618.0, 749.0, 1313.0], [10609.0, 6010.0, 4040.0, 2873.0, 1965.0, 1567.0, 1232.0, 1059.0, 940.0, 851.0, 765.0, 674.0, 636.0, 644.0, 526.0, 517.0, 531.0, 509.0, 507.0, 477.0, 490.0, 457.0, 401.0, 405.0, 439.0, 423.0, 408.0, 381.0, 389.0, 352.0, 363.0, 363.0, 354.0, 340.0, 376.0, 377.0, 353.0, 381.0, 399.0, 409.0, 369.0, 396.0, 405.0, 416.0, 462.0, 496.0, 543.0, 678.0, 1153.0], [10337.0, 6191.0, 4371.0, 3143.0, 2285.0, 1778.0, 1433.0, 1095.0, 973.0, 841.0, 772.0, 743.0, 648.0, 624.0, 611.0, 528.0, 502.0, 535.0, 473.0, 488.0, 395.0, 410.0, 441.0, 435.0, 400.0, 414.0, 373.0, 400.0, 346.0, 336.0, 383.0, 386.0, 351.0, 363.0, 360.0, 348.0, 355.0, 371.0, 371.0, 395.0, 370.0, 425.0, 367.0, 386.0, 397.0, 478.0, 514.0, 623.0, 1030.0], [10038.0, 6291.0, 4546.0, 3428.0, 2563.0, 1998.0, 1594.0, 1266.0, 1043.0, 929.0, 829.0, 766.0, 657.0, 619.0, 599.0, 561.0, 526.0, 488.0, 453.0, 460.0, 437.0, 431.0, 446.0, 437.0, 391.0, 383.0, 422.0, 374.0, 383.0, 354.0, 377.0, 364.0, 336.0, 291.0, 364.0, 348.0, 370.0, 352.0, 338.0, 407.0, 357.0, 375.0, 359.0, 397.0, 380.0, 447.0, 503.0, 608.0, 971.0], [9691.0, 6194.0, 4735.0, 3585.0, 2692.0, 2193.0, 1826.0, 1436.0, 1179.0, 1062.0, 906.0, 766.0, 732.0, 625.0, 624.0, 601.0, 514.0, 527.0, 472.0, 498.0, 459.0, 445.0, 413.0, 403.0, 400.0, 413.0, 366.0, 350.0, 377.0, 376.0, 333.0, 330.0, 327.0, 337.0, 361.0, 357.0, 355.0, 305.0, 370.0, 342.0, 304.0, 383.0, 392.0, 392.0, 364.0, 422.0, 460.0, 560.0, 858.0], [9101.0, 5915.0, 4669.0, 3593.0, 2860.0, 2415.0, 1935.0, 1627.0, 1417.0, 1209.0, 1035.0, 931.0, 795.0, 709.0, 640.0, 569.0, 556.0, 496.0, 471.0, 482.0, 464.0, 435.0, 415.0, 394.0, 384.0, 387.0, 416.0, 340.0, 380.0, 356.0, 372.0, 359.0, 309.0, 351.0, 320.0, 342.0, 337.0, 330.0, 326.0, 358.0, 337.0, 339.0, 358.0, 396.0, 359.0, 379.0, 416.0, 524.0, 802.0], [8899.0, 5804.0, 4630.0, 3499.0, 2875.0, 2515.0, 2060.0, 1732.0, 1491.0, 1294.0, 1135.0, 971.0, 846.0, 769.0, 693.0, 648.0, 582.0, 552.0, 513.0, 468.0, 515.0, 416.0, 426.0, 416.0, 379.0, 371.0, 366.0, 394.0, 330.0, 364.0, 328.0, 326.0, 359.0, 334.0, 324.0, 340.0, 331.0, 338.0, 354.0, 355.0, 342.0, 317.0, 384.0, 331.0, 346.0, 401.0, 422.0, 460.0, 760.0], [8555.0, 5636.0, 4493.0, 3579.0, 2979.0, 2544.0, 2183.0, 1927.0, 1702.0, 1421.0, 1200.0, 1091.0, 1041.0, 832.0, 783.0, 752.0, 665.0, 592.0, 605.0, 525.0, 513.0, 462.0, 427.0, 426.0, 397.0, 368.0, 405.0, 312.0, 392.0, 375.0, 324.0, 318.0, 331.0, 329.0, 379.0, 312.0, 325.0, 316.0, 343.0, 314.0, 355.0, 330.0, 334.0, 361.0, 383.0, 392.0, 400.0, 445.0, 690.0], [8572.0, 5451.0, 4330.0, 3561.0, 3064.0, 2533.0, 2184.0, 1971.0, 1641.0, 1452.0, 1300.0, 1108.0, 1060.0, 916.0, 909.0, 779.0, 746.0, 652.0, 612.0, 539.0, 504.0, 499.0, 456.0, 437.0, 430.0, 422.0, 339.0, 356.0, 398.0, 360.0, 329.0, 289.0, 356.0, 323.0, 315.0, 322.0, 324.0, 308.0, 335.0, 319.0, 353.0, 366.0, 366.0, 310.0, 357.0, 389.0, 390.0, 434.0, 665.0], [8212.0, 5441.0, 4284.0, 3461.0, 2990.0, 2481.0, 2226.0, 1926.0, 1623.0, 1524.0, 1336.0, 1243.0, 1171.0, 978.0, 926.0, 846.0, 786.0, 705.0, 669.0, 637.0, 541.0, 561.0, 524.0, 480.0, 437.0, 426.0, 432.0, 369.0, 359.0, 361.0, 344.0, 337.0, 323.0, 345.0, 325.0, 309.0, 303.0, 340.0, 336.0, 323.0, 313.0, 337.0, 377.0, 353.0, 287.0, 358.0, 344.0, 433.0, 625.0], [7945.0, 5262.0, 4277.0, 3350.0, 2881.0, 2583.0, 2280.0, 1946.0, 1725.0, 1610.0, 1432.0, 1249.0, 1205.0, 1069.0, 958.0, 911.0, 867.0, 775.0, 747.0, 684.0, 599.0, 604.0, 533.0, 505.0, 505.0, 506.0, 453.0, 414.0, 386.0, 405.0, 362.0, 373.0, 328.0, 327.0, 314.0, 334.0, 334.0, 303.0, 313.0, 340.0, 331.0, 320.0, 321.0, 323.0, 353.0, 356.0, 350.0, 430.0, 569.0], [7687.0, 5243.0, 4104.0, 3417.0, 2829.0, 2484.0, 2249.0, 2009.0, 1749.0, 1604.0, 1436.0, 1284.0, 1215.0, 1147.0, 1011.0, 936.0, 877.0, 783.0, 785.0, 712.0, 617.0, 650.0, 607.0, 527.0, 523.0, 515.0, 496.0, 422.0, 408.0, 463.0, 397.0, 405.0, 351.0, 352.0, 375.0, 338.0, 303.0, 345.0, 313.0, 296.0, 341.0, 322.0, 329.0, 300.0, 315.0, 351.0, 336.0, 381.0, 573.0], [7629.0, 4825.0, 3855.0, 3226.0, 2847.0, 2687.0, 2188.0, 2004.0, 1751.0, 1582.0, 1470.0, 1323.0, 1194.0, 1125.0, 1048.0, 1032.0, 891.0, 876.0, 805.0, 715.0, 709.0, 655.0, 675.0, 609.0, 626.0, 575.0, 541.0, 481.0, 457.0, 468.0, 473.0, 442.0, 407.0, 414.0, 363.0, 337.0, 358.0, 356.0, 333.0, 326.0, 343.0, 327.0, 308.0, 354.0, 338.0, 322.0, 330.0, 391.0, 574.0], [7533.0, 4898.0, 3812.0, 3180.0, 2786.0, 2487.0, 2183.0, 1907.0, 1783.0, 1617.0, 1490.0, 1304.0, 1238.0, 1136.0, 1094.0, 979.0, 973.0, 876.0, 806.0, 781.0, 753.0, 669.0, 631.0, 677.0, 641.0, 596.0, 575.0, 605.0, 511.0, 566.0, 500.0, 489.0, 460.0, 421.0, 421.0, 412.0, 398.0, 358.0, 342.0, 373.0, 364.0, 329.0, 313.0, 358.0, 338.0, 326.0, 373.0, 378.0, 517.0], [7268.0, 4517.0, 3795.0, 3093.0, 2616.0, 2406.0, 2104.0, 1834.0, 1777.0, 1523.0, 1483.0, 1427.0, 1253.0, 1109.0, 1073.0, 1081.0, 1036.0, 931.0, 877.0, 852.0, 773.0, 731.0, 744.0, 685.0, 704.0, 641.0, 637.0, 660.0, 608.0, 586.0, 548.0, 528.0, 586.0, 524.0, 491.0, 473.0, 443.0, 407.0, 421.0, 422.0, 344.0, 383.0, 372.0, 318.0, 357.0, 344.0, 305.0, 362.0, 508.0], [7189.0, 4608.0, 3501.0, 2885.0, 2392.0, 2230.0, 2203.0, 1934.0, 1744.0, 1676.0, 1558.0, 1418.0, 1301.0, 1207.0, 1075.0, 1044.0, 944.0, 871.0, 816.0, 871.0, 802.0, 779.0, 777.0, 765.0, 718.0, 681.0, 639.0, 587.0, 563.0, 542.0, 566.0, 532.0, 537.0, 482.0, 501.0, 545.0, 502.0, 502.0, 511.0, 456.0, 444.0, 436.0, 451.0, 384.0, 415.0, 365.0, 341.0, 391.0, 481.0], [6824.0, 4280.0, 3422.0, 2864.0, 2525.0, 2232.0, 2047.0, 1896.0, 1675.0, 1545.0, 1398.0, 1373.0, 1307.0, 1130.0, 1071.0, 1043.0, 1007.0, 961.0, 946.0, 881.0, 854.0, 812.0, 703.0, 719.0, 700.0, 684.0, 652.0, 592.0, 620.0, 595.0, 604.0, 576.0, 568.0, 545.0, 577.0, 590.0, 574.0, 513.0, 488.0, 552.0, 533.0, 484.0, 516.0, 473.0, 427.0, 427.0, 383.0, 387.0, 536.0], [6472.0, 4219.0, 3170.0, 2713.0, 2359.0, 2141.0, 2022.0, 1760.0, 1628.0, 1410.0, 1408.0, 1266.0, 1234.0, 1098.0, 1073.0, 1123.0, 1029.0, 1027.0, 976.0, 883.0, 824.0, 835.0, 822.0, 809.0, 696.0, 733.0, 689.0, 710.0, 663.0, 648.0, 647.0, 590.0, 648.0, 560.0, 606.0, 617.0, 584.0, 581.0, 611.0, 567.0, 629.0, 614.0, 579.0, 618.0, 578.0, 532.0, 537.0, 502.0, 545.0], [6605.0, 4123.0, 3173.0, 2678.0, 2364.0, 2031.0, 1809.0, 1652.0, 1565.0, 1436.0, 1361.0, 1284.0, 1217.0, 1150.0, 1141.0, 1060.0, 965.0, 972.0, 894.0, 885.0, 774.0, 765.0, 779.0, 681.0, 669.0, 675.0, 605.0, 687.0, 603.0, 655.0, 610.0, 595.0, 621.0, 618.0, 627.0, 615.0, 614.0, 621.0, 666.0, 649.0, 703.0, 668.0, 669.0, 646.0, 673.0, 668.0, 671.0, 641.0, 743.0], [6281.0, 3868.0, 3009.0, 2531.0, 2224.0, 1962.0, 1855.0, 1868.0, 1582.0, 1446.0, 1350.0, 1173.0, 1212.0, 1122.0, 1088.0, 1066.0, 1051.0, 968.0, 970.0, 806.0, 866.0, 725.0, 714.0, 660.0, 669.0, 680.0, 603.0, 618.0, 585.0, 620.0, 599.0, 585.0, 596.0, 587.0, 620.0, 606.0, 643.0, 644.0, 649.0, 680.0, 743.0, 773.0, 753.0, 756.0, 790.0, 815.0, 830.0, 824.0, 876.0], [6393.0, 3888.0, 2961.0, 2311.0, 2091.0, 1880.0, 1648.0, 1616.0, 1433.0, 1474.0, 1300.0, 1254.0, 1204.0, 1145.0, 1078.0, 1010.0, 1000.0, 922.0, 868.0, 892.0, 853.0, 814.0, 812.0, 738.0, 747.0, 687.0, 639.0, 671.0, 588.0, 587.0, 632.0, 578.0, 619.0, 629.0, 590.0, 591.0, 661.0, 613.0, 601.0, 619.0, 682.0, 738.0, 743.0, 797.0, 815.0, 880.0, 956.0, 972.0, 1135.0], [5962.0, 3767.0, 2989.0, 2421.0, 2168.0, 1747.0, 1689.0, 1668.0, 1409.0, 1281.0, 1322.0, 1234.0, 1181.0, 1182.0, 1135.0, 994.0, 932.0, 866.0, 826.0, 847.0, 763.0, 740.0, 685.0, 740.0, 738.0, 651.0, 550.0, 591.0, 642.0, 578.0, 614.0, 608.0, 612.0, 550.0, 506.0, 536.0, 557.0, 561.0, 620.0, 609.0, 689.0, 675.0, 758.0, 819.0, 894.0, 996.0, 1076.0, 1275.0, 1517.0], [6188.0, 3767.0, 2765.0, 2309.0, 2084.0, 1768.0, 1472.0, 1513.0, 1345.0, 1171.0, 1092.0, 1112.0, 1117.0, 1188.0, 1024.0, 1013.0, 982.0, 992.0, 825.0, 750.0, 818.0, 790.0, 726.0, 683.0, 628.0, 653.0, 553.0, 631.0, 652.0, 640.0, 629.0, 573.0, 526.0, 520.0, 517.0, 521.0, 539.0, 590.0, 615.0, 574.0, 590.0, 632.0, 699.0, 767.0, 881.0, 1044.0, 1237.0, 1422.0, 1848.0], [6164.0, 3436.0, 2700.0, 2310.0, 1989.0, 1805.0, 1441.0, 1487.0, 1360.0, 1345.0, 1170.0, 1202.0, 1031.0, 964.0, 902.0, 1003.0, 1000.0, 930.0, 901.0, 881.0, 822.0, 740.0, 722.0, 661.0, 714.0, 669.0, 662.0, 734.0, 606.0, 549.0, 617.0, 620.0, 655.0, 620.0, 570.0, 529.0, 508.0, 547.0, 502.0, 508.0, 591.0, 606.0, 632.0, 701.0, 765.0, 920.0, 1061.0, 1411.0, 1979.0], [5955.0, 3634.0, 2701.0, 2322.0, 1980.0, 1697.0, 1565.0, 1580.0, 1417.0, 1416.0, 1160.0, 1166.0, 1183.0, 1278.0, 1116.0, 903.0, 754.0, 828.0, 814.0, 881.0, 817.0, 697.0, 590.0, 608.0, 688.0, 620.0, 529.0, 557.0, 668.0, 588.0, 570.0, 560.0, 623.0, 610.0, 565.0, 610.0, 554.0, 527.0, 435.0, 524.0, 492.0, 596.0, 597.0, 659.0, 710.0, 785.0, 953.0, 1364.0, 2086.0], [5899.0, 3629.0, 2548.0, 2273.0, 2119.0, 1940.0, 1618.0, 1417.0, 1418.0, 1322.0, 1099.0, 1049.0, 1115.0, 893.0, 993.0, 898.0, 991.0, 908.0, 944.0, 785.0, 705.0, 644.0, 614.0, 715.0, 646.0, 617.0, 695.0, 642.0, 675.0, 579.0, 604.0, 520.0, 523.0, 701.0, 608.0, 493.0, 522.0, 539.0, 542.0, 528.0, 616.0, 498.0, 547.0, 560.0, 601.0, 742.0, 844.0, 1140.0, 1925.0], [6066.0, 3539.0, 2831.0, 1971.0, 2170.0, 1907.0, 1554.0, 1411.0, 1335.0, 1486.0, 1179.0, 1054.0, 994.0, 870.0, 984.0, 1037.0, 950.0, 854.0, 974.0, 926.0, 812.0, 712.0, 774.0, 708.0, 751.0, 670.0, 711.0, 682.0, 713.0, 549.0, 508.0, 489.0, 523.0, 582.0, 606.0, 595.0, 569.0, 558.0, 483.0, 509.0, 505.0, 565.0, 590.0, 535.0, 533.0, 645.0, 836.0, 960.0, 1732.0], [5946.0, 3641.0, 2830.0, 2376.0, 2103.0, 1677.0, 1654.0, 1490.0, 1444.0, 1504.0, 1386.0, 1114.0, 1028.0, 1185.0, 1028.0, 953.0, 923.0, 943.0, 924.0, 1030.0, 724.0, 718.0, 707.0, 701.0, 748.0, 702.0, 609.0, 505.0, 551.0, 574.0, 509.0, 533.0, 479.0, 571.0, 525.0, 545.0, 580.0, 488.0, 533.0, 551.0, 539.0, 489.0, 504.0, 451.0, 438.0, 487.0, 590.0, 917.0, 1478.0], [6074.0, 3694.0, 2755.0, 2227.0, 1949.0, 1845.0, 1745.0, 1639.0, 1457.0, 1440.0, 1357.0, 1066.0, 1207.0, 1119.0, 897.0, 941.0, 947.0, 710.0, 851.0, 888.0, 940.0, 681.0, 706.0, 693.0, 719.0, 632.0, 706.0, 608.0, 554.0, 517.0, 619.0, 604.0, 492.0, 497.0, 468.0, 532.0, 588.0, 620.0, 475.0, 501.0, 564.0, 451.0, 423.0, 446.0, 509.0, 421.0, 555.0, 692.0, 1327.0], [5732.0, 3532.0, 2772.0, 2307.0, 1977.0, 1944.0, 1549.0, 1650.0, 1266.0, 1319.0, 1384.0, 1288.0, 1020.0, 1210.0, 1228.0, 1012.0, 949.0, 1005.0, 854.0, 908.0, 793.0, 723.0, 786.0, 848.0, 660.0, 609.0, 655.0, 641.0, 642.0, 724.0, 610.0, 416.0, 544.0, 521.0, 488.0, 515.0, 478.0, 536.0, 563.0, 471.0, 428.0, 464.0, 497.0, 418.0, 564.0, 422.0, 487.0, 649.0, 1117.0]],
    "Name": "sCurve-0",
    "Overflow": 2547208.0,
    "Type": "Histo2d",
    "Underflow": 0.0,
    "x": {
        "AxisTitle": "Vcal",
        "Bins": 51,
        "High": 302.5,
        "Low": 47.5
    },
    "y": {
        "AxisTitle": "Occupancy",
        "Bins": 49,
        "High": 49.5,
        "Low": 0.5
    },
    "z": {
        "AxisTitle": "Number of pixels"
    }
}