{
    "Data": [[1136.0, 353.0, 158.0, 88.0, 59.0, 61.0, 38.0, 27.0, 34.0, 25.0, 19.0, 24.0, 15.0, 16.0, 13.0, 4.0, 16.0, 8.0, 13.0, 9.0, 12.0, 5.0, 8.0, 5.0, 8.0, 3.0, 8.0, 3.0, 9.0, 1.0, 6.0, 7.0, 4.0, 7.0, 6.0, 6.0, 2.0, 6.0, 3.0, 5.0, 11.0, 6.0, 5.0, 5.0, 5.0, 11.0, 2.0, 15.0, 17.0], [2217.0, 817.0, 387.0, 230.0, 176.0, 114.0, 71.0, 65.0, 49.0, 44.0, 39.0, 37.0, 28.0, 33.0, 22.0, 24.0, 20.0, 20.0, 12.0, 15.0, 14.0, 10.0, 17.0, 15.0, 8.0, 10.0, 12.0, 14.0, 17.0, 9.0, 8.0, 11.0, 10.0, 9.0, 8.0, 10.0, 4.0, 5.0, 3.0, 4.0, 8.0, 4.0, 7.0, 7.0, 13.0, 8.0, 8.0, 10.0, 20.0], [3367.0, 1555.0, 788.0, 543.0, 380.0, 259.0, 221.0, 154.0, 128.0, 130.0, 88.0, 70.0, 73.0, 49.0, 42.0, 43.0, 44.0, 32.0, 32.0, 30.0, 25.0, 26.0, 35.0, 20.0, 14.0, 16.0, 17.0, 18.0, 15.0, 15.0, 21.0, 20.0, 21.0, 17.0, 17.0, 11.0, 8.0, 17.0, 9.0, 11.0, 10.0, 13.0, 7.0, 12.0, 16.0, 16.0, 9.0, 19.0, 16.0], [4106.0, 2215.0, 1496.0, 1022.0, 730.0, 589.0, 469.0, 367.0, 320.0, 262.0, 220.0, 189.0, 161.0, 143.0, 119.0, 106.0, 115.0, 72.0, 82.0, 81.0, 69.0, 53.0, 57.0, 57.0, 43.0, 39.0, 32.0, 44.0, 38.0, 34.0, 28.0, 23.0, 22.0, 22.0, 21.0, 20.0, 25.0, 26.0, 16.0, 17.0, 26.0, 18.0, 22.0, 23.0, 22.0, 24.0, 26.0, 23.0, 46.0], [4414.0, 2465.0, 1834.0, 1448.0, 1116.0, 944.0, 830.0, 673.0, 618.0, 524.0, 459.0, 457.0, 383.0, 305.0, 286.0, 261.0, 234.0, 227.0, 204.0, 157.0, 160.0, 145.0, 139.0, 121.0, 123.0, 112.0, 95.0, 88.0, 99.0, 83.0, 78.0, 66.0, 74.0, 56.0, 58.0, 37.0, 52.0, 47.0, 39.0, 53.0, 39.0, 36.0, 41.0, 37.0, 40.0, 32.0, 46.0, 56.0, 60.0], [7184.0, 3357.0, 2131.0, 1642.0, 1288.0, 1107.0, 1005.0, 932.0, 787.0, 758.0, 721.0, 651.0, 608.0, 538.0, 542.0, 483.0, 446.0, 420.0, 410.0, 356.0, 337.0, 315.0, 290.0, 257.0, 255.0, 247.0, 239.0, 195.0, 200.0, 173.0, 177.0, 161.0, 172.0, 169.0, 154.0, 149.0, 120.0, 122.0, 117.0, 83.0, 111.0, 88.0, 100.0, 91.0, 84.0, 76.0, 84.0, 85.0, 115.0], [6063.0, 4978.0, 4032.0, 3135.0, 2522.0, 2005.0, 1700.0, 1499.0, 1216.0, 1140.0, 957.0, 827.0, 788.0, 693.0, 667.0, 651.0, 624.0, 604.0, 581.0, 557.0, 522.0, 479.0, 498.0, 510.0, 425.0, 459.0, 421.0, 404.0, 415.0, 409.0, 365.0, 343.0, 325.0, 340.0, 324.0, 280.0, 284.0, 271.0, 278.0, 273.0, 247.0, 253.0, 218.0, 230.0, 230.0, 220.0, 209.0, 187.0, 199.0], [1205.0, 1443.0, 1567.0, 1716.0, 1892.0, 1943.0, 1969.0, 1897.0, 1948.0, 1933.0, 1781.0, 1791.0, 1677.0, 1586.0, 1485.0, 1467.0, 1348.0, 1273.0, 1162.0, 1107.0, 1057.0, 983.0, 855.0, 789.0, 796.0, 736.0, 699.0, 670.0, 666.0, 611.0, 605.0, 577.0, 578.0, 578.0, 540.0, 529.0, 536.0, 532.0, 549.0, 506.0, 525.0, 471.0, 502.0, 507.0, 455.0, 502.0, 490.0, 523.0, 526.0], [272.0, 234.0, 270.0, 303.0, 362.0, 391.0, 424.0, 451.0, 525.0, 591.0, 661.0, 731.0, 807.0, 834.0, 886.0, 983.0, 1090.0, 1142.0, 1206.0, 1219.0, 1183.0, 1373.0, 1351.0, 1310.0, 1400.0, 1333.0, 1419.0, 1436.0, 1413.0, 1474.0, 1467.0, 1470.0, 1394.0, 1355.0, 1365.0, 1288.0, 1258.0, 1204.0, 1204.0, 1077.0, 1072.0, 1054.0, 1003.0, 1001.0, 985.0, 1011.0, 1080.0, 1096.0, 1193.0], [151.0, 94.0, 66.0, 86.0, 92.0, 92.0, 97.0, 119.0, 111.0, 132.0, 141.0, 152.0, 162.0, 192.0, 194.0, 229.0, 262.0, 277.0, 316.0, 312.0, 323.0, 381.0, 406.0, 486.0, 546.0, 545.0, 623.0, 615.0, 771.0, 819.0, 871.0, 1000.0, 1167.0, 1236.0, 1267.0, 1434.0, 1548.0, 1728.0, 1807.0, 1911.0, 2133.0, 2314.0, 2411.0, 2581.0, 2709.0, 2876.0, 2936.0, 3021.0, 3196.0], [121.0, 71.0, 43.0, 46.0, 39.0, 31.0, 33.0, 33.0, 44.0, 40.0, 44.0, 53.0, 57.0, 61.0, 53.0, 67.0, 77.0, 74.0, 83.0, 100.0, 102.0, 96.0, 118.0, 130.0, 146.0, 164.0, 181.0, 200.0, 216.0, 229.0, 253.0, 304.0, 358.0, 399.0, 465.0, 487.0, 569.0, 634.0, 727.0, 909.0, 1034.0, 1322.0, 1528.0, 1954.0, 2461.0, 3189.0, 4169.0, 5699.0, 8243.0], [96.0, 55.0, 37.0, 42.0, 30.0, 30.0, 19.0, 20.0, 19.0, 18.0, 14.0, 26.0, 20.0, 19.0, 28.0, 24.0, 30.0, 31.0, 28.0, 32.0, 35.0, 34.0, 47.0, 44.0, 54.0, 45.0, 59.0, 67.0, 69.0, 82.0, 61.0, 116.0, 117.0, 129.0, 144.0, 170.0, 194.0, 256.0, 272.0, 342.0, 402.0, 490.0, 598.0, 721.0, 1047.0, 1435.0, 2162.0, 3732.0, 8077.0], [85.0, 59.0, 42.0, 16.0, 17.0, 24.0, 14.0, 16.0, 20.0, 19.0, 16.0, 18.0, 14.0, 16.0, 15.0, 18.0, 11.0, 17.0, 22.0, 16.0, 8.0, 18.0, 23.0, 15.0, 16.0, 19.0, 20.0, 26.0, 30.0, 31.0, 25.0, 39.0, 45.0, 56.0, 61.0, 70.0, 78.0, 87.0, 96.0, 93.0, 132.0, 181.0, 248.0, 320.0, 424.0, 652.0, 905.0, 1817.0, 4557.0], [95.0, 53.0, 29.0, 18.0, 25.0, 17.0, 13.0, 11.0, 11.0, 8.0, 15.0, 14.0, 12.0, 11.0, 10.0, 10.0, 14.0, 11.0, 17.0, 12.0, 11.0, 6.0, 13.0, 13.0, 14.0, 12.0, 10.0, 15.0, 9.0, 17.0, 19.0, 20.0, 15.0, 19.0, 19.0, 29.0, 30.0, 29.0, 38.0, 42.0, 55.0, 93.0, 74.0, 117.0, 157.0, 244.0, 426.0, 848.0, 2404.0], [86.0, 30.0, 31.0, 12.0, 17.0, 16.0, 9.0, 10.0, 8.0, 9.0, 9.0, 15.0, 17.0, 10.0, 4.0, 8.0, 6.0, 7.0, 14.0, 8.0, 10.0, 13.0, 7.0, 10.0, 7.0, 12.0, 7.0, 8.0, 8.0, 18.0, 10.0, 7.0, 11.0, 10.0, 19.0, 14.0, 11.0, 17.0, 25.0, 19.0, 33.0, 21.0, 37.0, 55.0, 63.0, 118.0, 164.0, 337.0, 1193.0], [76.0, 39.0, 28.0, 12.0, 10.0, 11.0, 10.0, 11.0, 11.0, 12.0, 4.0, 11.0, 4.0, 10.0, 5.0, 12.0, 9.0, 3.0, 9.0, 7.0, 4.0, 8.0, 6.0, 9.0, 5.0, 10.0, 4.0, 8.0, 8.0, 9.0, 8.0, 5.0, 9.0, 9.0, 10.0, 10.0, 6.0, 16.0, 14.0, 16.0, 19.0, 22.0, 28.0, 34.0, 28.0, 60.0, 74.0, 136.0, 538.0], [71.0, 28.0, 28.0, 9.0, 14.0, 10.0, 9.0, 2.0, 7.0, 9.0, 5.0, 13.0, 6.0, 6.0, 2.0, 8.0, 7.0, 6.0, 3.0, 10.0, 5.0, 8.0, 7.0, 7.0, 7.0, 8.0, 6.0, 7.0, 1.0, 3.0, 6.0, 5.0, 9.0, 6.0, 11.0, 5.0, 14.0, 7.0, 13.0, 10.0, 10.0, 15.0, 16.0, 19.0, 25.0, 28.0, 44.0, 97.0, 234.0], [62.0, 31.0, 17.0, 19.0, 8.0, 7.0, 3.0, 10.0, 6.0, 6.0, 10.0, 3.0, 4.0, 4.0, 6.0, 6.0, 3.0, 8.0, 4.0, 4.0, 2.0, 10.0, 4.0, 1.0, 7.0, 4.0, 3.0, 2.0, 2.0, 4.0, 4.0, 7.0, 7.0, 5.0, 7.0, 3.0, 4.0, 14.0, 10.0, 12.0, 6.0, 8.0, 13.0, 16.0, 11.0, 22.0, 38.0, 42.0, 148.0], [76.0, 37.0, 15.0, 13.0, 9.0, 5.0, 5.0, 1.0, 7.0, 3.0, 6.0, 8.0, 6.0, 5.0, 2.0, 4.0, 6.0, 4.0, 4.0, 4.0, 1.0, 4.0, 1.0, 1.0, 4.0, 7.0, 4.0, 2.0, 4.0, 1.0, 4.0, 5.0, 4.0, 4.0, 4.0, 5.0, 9.0, 7.0, 5.0, 8.0, 11.0, 7.0, 9.0, 9.0, 11.0, 12.0, 27.0, 27.0, 90.0], [56.0, 39.0, 17.0, 14.0, 12.0, 3.0, 5.0, 3.0, 3.0, 2.0, 3.0, 4.0, 4.0, 8.0, 5.0, 6.0, 3.0, 4.0, 3.0, 2.0, 1.0, 2.0, 1.0, 2.0, 2.0, 4.0, 3.0, 2.0, 5.0, 6.0, 2.0, 2.0, 3.0, 3.0, 2.0, 1.0, 2.0, 3.0, 4.0, 4.0, 7.0, 4.0, 8.0, 12.0, 16.0, 8.0, 16.0, 29.0, 65.0], [52.0, 25.0, 15.0, 13.0, 4.0, 8.0, 3.0, 5.0, 4.0, 2.0, 8.0, 3.0, 6.0, 4.0, 2.0, 2.0, 3.0, 7.0, 5.0, 3.0, 0.0, 2.0, 5.0, 3.0, 1.0, 1.0, 2.0, 2.0, 2.0, 2.0, 2.0, 1.0, 1.0, 3.0, 3.0, 0.0, 2.0, 6.0, 5.0, 3.0, 3.0, 5.0, 2.0, 6.0, 7.0, 8.0, 14.0, 27.0, 49.0], [68.0, 29.0, 17.0, 11.0, 6.0, 6.0, 2.0, 2.0, 5.0, 4.0, 3.0, 2.0, 4.0, 2.0, 0.0, 4.0, 8.0, 2.0, 5.0, 6.0, 4.0, 1.0, 2.0, 2.0, 1.0, 2.0, 2.0, 4.0, 1.0, 0.0, 0.0, 2.0, 2.0, 2.0, 4.0, 1.0, 0.0, 2.0, 2.0, 2.0, 1.0, 1.0, 0.0, 4.0, 9.0, 10.0, 8.0, 11.0, 44.0], [55.0, 29.0, 15.0, 9.0, 12.0, 4.0, 2.0, 4.0, 5.0, 3.0, 2.0, 3.0, 2.0, 4.0, 3.0, 5.0, 1.0, 5.0, 3.0, 2.0, 3.0, 1.0, 2.0, 2.0, 0.0, 1.0, 1.0, 4.0, 3.0, 1.0, 2.0, 2.0, 2.0, 3.0, 2.0, 0.0, 2.0, 2.0, 3.0, 3.0, 1.0, 1.0, 0.0, 3.0, 4.0, 3.0, 2.0, 10.0, 23.0], [53.0, 23.0, 26.0, 17.0, 4.0, 2.0, 5.0, 4.0, 6.0, 6.0, 1.0, 3.0, 3.0, 3.0, 4.0, 3.0, 0.0, 4.0, 1.0, 2.0, 0.0, 3.0, 1.0, 2.0, 1.0, 2.0, 2.0, 0.0, 1.0, 2.0, 2.0, 0.0, 0.0, 2.0, 1.0, 3.0, 4.0, 0.0, 2.0, 1.0, 5.0, 2.0, 2.0, 2.0, 3.0, 1.0, 4.0, 4.0, 15.0], [63.0, 21.0, 21.0, 13.0, 6.0, 4.0, 3.0, 3.0, 2.0, 2.0, 5.0, 3.0, 2.0, 2.0, 1.0, 4.0, 3.0, 3.0, 0.0, 2.0, 2.0, 4.0, 2.0, 0.0, 2.0, 2.0, 3.0, 0.0, 2.0, 2.0, 0.0, 0.0, 2.0, 2.0, 3.0, 1.0, 1.0, 1.0, 1.0, 2.0, 0.0, 1.0, 2.0, 1.0, 6.0, 1.0, 2.0, 5.0, 14.0], [51.0, 28.0, 16.0, 9.0, 8.0, 8.0, 1.0, 3.0, 5.0, 2.0, 2.0, 6.0, 5.0, 1.0, 1.0, 3.0, 2.0, 2.0, 2.0, 2.0, 4.0, 1.0, 3.0, 1.0, 0.0, 3.0, 3.0, 0.0, 2.0, 0.0, 1.0, 1.0, 0.0, 0.0, 1.0, 2.0, 2.0, 0.0, 1.0, 2.0, 1.0, 0.0, 1.0, 0.0, 2.0, 2.0, 3.0, 2.0, 9.0], [63.0, 29.0, 18.0, 9.0, 7.0, 8.0, 6.0, 4.0, 3.0, 3.0, 1.0, 4.0, 2.0, 3.0, 4.0, 1.0, 2.0, 3.0, 2.0, 0.0, 1.0, 1.0, 0.0, 1.0, 3.0, 1.0, 3.0, 2.0, 0.0, 3.0, 1.0, 0.0, 1.0, 1.0, 2.0, 1.0, 2.0, 2.0, 1.0, 0.0, 0.0, 0.0, 0.0, 2.0, 0.0, 1.0, 1.0, 2.0, 6.0], [64.0, 26.0, 19.0, 11.0, 2.0, 5.0, 0.0, 1.0, 4.0, 7.0, 4.0, 6.0, 2.0, 2.0, 3.0, 2.0, 3.0, 4.0, 0.0, 1.0, 1.0, 2.0, 3.0, 2.0, 1.0, 0.0, 1.0, 1.0, 0.0, 1.0, 1.0, 1.0, 1.0, 2.0, 0.0, 1.0, 2.0, 1.0, 2.0, 0.0, 1.0, 1.0, 1.0, 0.0, 1.0, 1.0, 2.0, 2.0, 1.0], [67.0, 29.0, 15.0, 8.0, 6.0, 4.0, 3.0, 5.0, 6.0, 2.0, 4.0, 7.0, 2.0, 2.0, 1.0, 3.0, 3.0, 3.0, 1.0, 1.0, 0.0, 0.0, 1.0, 0.0, 1.0, 0.0, 2.0, 0.0, 1.0, 3.0, 1.0, 1.0, 2.0, 0.0, 0.0, 0.0, 1.0, 1.0, 0.0, 0.0, 1.0, 1.0, 3.0, 1.0, 0.0, 0.0, 0.0, 1.0, 7.0], [39.0, 32.0, 19.0, 8.0, 8.0, 4.0, 4.0, 1.0, 1.0, 4.0, 6.0, 4.0, 2.0, 1.0, 3.0, 5.0, 1.0, 2.0, 0.0, 0.0, 2.0, 0.0, 1.0, 2.0, 2.0, 2.0, 1.0, 1.0, 3.0, 1.0, 2.0, 0.0, 0.0, 1.0, 3.0, 0.0, 0.0, 1.0, 0.0, 0.0, 1.0, 3.0, 2.0, 0.0, 0.0, 0.0, 0.0, 3.0, 3.0], [63.0, 19.0, 19.0, 9.0, 5.0, 6.0, 2.0, 6.0, 0.0, 4.0, 1.0, 2.0, 5.0, 1.0, 2.0, 1.0, 1.0, 4.0, 4.0, 2.0, 1.0, 4.0, 2.0, 2.0, 0.0, 0.0, 3.0, 1.0, 0.0, 1.0, 2.0, 2.0, 0.0, 0.0, 2.0, 1.0, 0.0, 0.0, 2.0, 1.0, 2.0, 0.0, 1.0, 0.0, 0.0, 0.0, 0.0, 3.0, 1.0], [68.0, 36.0, 10.0, 11.0, 5.0, 4.0, 5.0, 4.0, 2.0, 1.0, 10.0, 1.0, 5.0, 4.0, 3.0, 2.0, 3.0, 2.0, 1.0, 0.0, 0.0, 2.0, 0.0, 1.0, 0.0, 0.0, 0.0, 1.0, 0.0, 2.0, 1.0, 0.0, 1.0, 1.0, 1.0, 1.0, 1.0, 2.0, 0.0, 0.0, 1.0, 1.0, 0.0, 0.0, 1.0, 0.0, 2.0, 2.0, 0.0], [60.0, 27.0, 18.0, 11.0, 10.0, 5.0, 1.0, 0.0, 7.0, 3.0, 1.0, 2.0, 2.0, 4.0, 6.0, 5.0, 4.0, 1.0, 0.0, 2.0, 0.0, 1.0, 1.0, 2.0, 0.0, 0.0, 0.0, 0.0, 0.0, 0.0, 2.0, 1.0, 0.0, 1.0, 0.0, 0.0, 1.0, 2.0, 1.0, 0.0, 1.0, 1.0, 2.0, 1.0, 0.0, 1.0, 2.0, 2.0, 0.0], [69.0, 31.0, 14.0, 11.0, 2.0, 6.0, 4.0, 2.0, 5.0, 2.0, 2.0, 2.0, 3.0, 2.0, 2.0, 5.0, 3.0, 2.0, 0.0, 0.0, 2.0, 1.0, 2.0, 1.0, 1.0, 2.0, 1.0, 0.0, 0.0, 1.0, 1.0, 1.0, 0.0, 1.0, 1.0, 1.0, 1.0, 0.0, 1.0, 0.0, 0.0, 1.0, 1.0, 0.0, 1.0, 0.0, 0.0, 1.0, 2.0], [66.0, 30.0, 19.0, 6.0, 9.0, 3.0, 2.0, 3.0, 6.0, 8.0, 1.0, 2.0, 3.0, 1.0, 4.0, 1.0, 4.0, 2.0, 3.0, 2.0, 1.0, 1.0, 1.0, 2.0, 2.0, 1.0, 1.0, 0.0, 0.0, 0.0, 1.0, 0.0, 0.0, 0.0, 0.0, 0.0, 4.0, 3.0, 1.0, 0.0, 0.0, 1.0, 1.0, 2.0, 0.0, 0.0, 2.0, 0.0, 0.0], [64.0, 37.0, 14.0, 9.0, 3.0, 10.0, 3.0, 2.0, 2.0, 3.0, 3.0, 4.0, 3.0, 4.0, 3.0, 5.0, 3.0, 3.0, 2.0, 1.0, 0.0, 0.0, 1.0, 0.0, 0.0, 1.0, 1.0, 2.0, 2.0, 0.0, 1.0, 1.0, 1.0, 1.0, 1.0, 1.0, 0.0, 0.0, 2.0, 0.0, 0.0, 0.0, 0.0, 0.0, 1.0, 0.0, 1.0, 1.0, 0.0], [56.0, 27.0, 16.0, 8.0, 8.0, 5.0, 3.0, 6.0, 6.0, 4.0, 2.0, 5.0, 5.0, 5.0, 2.0, 4.0, 2.0, 2.0, 1.0, 0.0, 3.0, 0.0, 0.0, 0.0, 1.0, 0.0, 1.0, 0.0, 0.0, 1.0, 1.0, 1.0, 1.0, 1.0, 1.0, 0.0, 1.0, 1.0, 0.0, 0.0, 0.0, 0.0, 1.0, 1.0, 1.0, 0.0, 1.0, 1.0, 2.0], [63.0, 18.0, 12.0, 8.0, 11.0, 5.0, 5.0, 2.0, 4.0, 3.0, 2.0, 8.0, 3.0, 1.0, 2.0, 2.0, 3.0, 0.0, 4.0, 2.0, 2.0, 2.0, 1.0, 0.0, 0.0, 0.0, 1.0, 0.0, 1.0, 0.0, 1.0, 0.0, 1.0, 1.0, 0.0, 0.0, 0.0, 2.0, 0.0, 1.0, 0.0, 1.0, 1.0, 0.0, 0.0, 1.0, 0.0, 2.0, 1.0], [71.0, 26.0, 11.0, 10.0, 7.0, 5.0, 5.0, 4.0, 0.0, 6.0, 3.0, 5.0, 5.0, 0.0, 3.0, 3.0, 4.0, 0.0, 1.0, 1.0, 1.0, 3.0, 0.0, 1.0, 0.0, 1.0, 0.0, 1.0, 1.0, 0.0, 1.0, 1.0, 0.0, 0.0, 0.0, 0.0, 2.0, 0.0, 2.0, 1.0, 1.0, 1.0, 0.0, 1.0, 0.0, 1.0, 0.0, 1.0, 2.0], [60.0, 28.0, 13.0, 16.0, 13.0, 2.0, 3.0, 6.0, 2.0, 3.0, 5.0, 5.0, 1.0, 1.0, 4.0, 0.0, 3.0, 1.0, 3.0, 1.0, 3.0, 1.0, 1.0, 0.0, 3.0, 3.0, 1.0, 1.0, 1.0, 1.0, 1.0, 0.0, 0.0, 1.0, 3.0, 0.0, 1.0, 0.0, 1.0, 0.0, 1.0, 0.0, 0.0, 1.0, 0.0, 0.0, 0.0, 0.0, 0.0], [53.0, 27.0, 21.0, 6.0, 10.0, 5.0, 7.0, 2.0, 3.0, 1.0, 4.0, 5.0, 3.0, 4.0, 4.0, 2.0, 0.0, 1.0, 2.0, 0.0, 0.0, 2.0, 1.0, 1.0, 1.0, 1.0, 2.0, 2.0, 0.0, 1.0, 0.0, 2.0, 2.0, 1.0, 0.0, 0.0, 0.0, 0.0, 0.0, 0.0, 2.0, 1.0, 0.0, 0.0, 0.0, 2.0, 0.0, 0.0, 1.0], [51.0, 32.0, 13.0, 6.0, 7.0, 3.0, 1.0, 1.0, 2.0, 4.0, 3.0, 5.0, 2.0, 5.0, 4.0, 1.0, 2.0, 2.0, 3.0, 4.0, 0.0, 3.0, 1.0, 0.0, 1.0, 3.0, 1.0, 2.0, 0.0, 0.0, 2.0, 2.0, 1.0, 0.0, 0.0, 0.0, 0.0, 0.0, 1.0, 0.0, 0.0, 0.0, 0.0, 0.0, 2.0, 0.0, 0.0, 0.0, 1.0], [70.0, 23.0, 18.0, 9.0, 4.0, 8.0, 4.0, 4.0, 2.0, 6.0, 0.0, 3.0, 0.0, 5.0, 2.0, 3.0, 0.0, 4.0, 0.0, 3.0, 3.0, 0.0, 1.0, 2.0, 1.0, 1.0, 1.0, 0.0, 2.0, 1.0, 0.0, 0.0, 1.0, 1.0, 0.0, 1.0, 0.0, 0.0, 1.0, 2.0, 1.0, 0.0, 1.0, 0.0, 0.0, 2.0, 2.0, 1.0, 0.0], [63.0, 35.0, 15.0, 7.0, 7.0, 5.0, 3.0, 3.0, 5.0, 6.0, 2.0, 0.0, 1.0, 4.0, 3.0, 3.0, 1.0, 3.0, 1.0, 3.0, 4.0, 1.0, 0.0, 1.0, 2.0, 0.0, 1.0, 0.0, 0.0, 1.0, 0.0, 1.0, 0.0, 2.0, 1.0, 1.0, 0.0, 1.0, 3.0, 0.0, 0.0, 0.0, 1.0, 1.0, 0.0, 0.0, 0.0, 1.0, 1.0], [52.0, 31.0, 16.0, 11.0, 4.0, 1.0, 3.0, 6.0, 3.0, 8.0, 4.0, 3.0, 5.0, 3.0, 0.0, 5.0, 3.0, 2.0, 2.0, 0.0, 1.0, 1.0, 1.0, 0.0, 1.0, 0.0, 1.0, 2.0, 1.0, 0.0, 1.0, 1.0, 3.0, 0.0, 0.0, 0.0, 0.0, 0.0, 1.0, 1.0, 0.0, 1.0, 0.0, 1.0, 0.0, 0.0, 0.0, 0.0, 2.0], [66.0, 25.0, 15.0, 17.0, 10.0, 2.0, 3.0, 2.0, 0.0, 2.0, 2.0, 8.0, 4.0, 4.0, 2.0, 4.0, 1.0, 2.0, 2.0, 2.0, 2.0, 1.0, 2.0, 1.0, 1.0, 1.0, 0.0, 0.0, 0.0, 0.0, 0.0, 0.0, 1.0, 1.0, 0.0, 0.0, 1.0, 1.0, 1.0, 0.0, 0.0, 0.0, 1.0, 1.0, 2.0, 0.0, 0.0, 1.0, 0.0], [61.0, 22.0, 22.0, 12.0, 8.0, 4.0, 2.0, 7.0, 4.0, 3.0, 3.0, 3.0, 3.0, 2.0, 1.0, 1.0, 2.0, 5.0, 1.0, 1.0, 5.0, 4.0, 0.0, 1.0, 1.0, 0.0, 1.0, 0.0, 0.0, 0.0, 0.0, 1.0, 1.0, 1.0, 0.0, 0.0, 1.0, 1.0, 2.0, 0.0, 0.0, 1.0, 0.0, 0.0, 0.0, 2.0, 1.0, 2.0, 1.0], [74.0, 23.0, 18.0, 14.0, 7.0, 3.0, 3.0, 1.0, 6.0, 4.0, 2.0, 6.0, 2.0, 2.0, 5.0, 3.0, 0.0, 0.0, 1.0, 0.0, 5.0, 3.0, 0.0, 0.0, 1.0, 1.0, 2.0, 2.0, 1.0, 0.0, 0.0, 0.0, 1.0, 0.0, 0.0, 0.0, 0.0, 1.0, 1.0, 2.0, 1.0, 0.0, 0.0, 0.0, 0.0, 0.0, 0.0, 1.0, 3.0], [53.0, 36.0, 21.0, 7.0, 10.0, 2.0, 5.0, 1.0, 4.0, 4.0, 4.0, 2.0, 4.0, 4.0, 6.0, 1.0, 1.0, 0.0, 2.0, 2.0, 2.0, 1.0, 1.0, 0.0, 2.0, 1.0, 0.0, 0.0, 1.0, 0.0, 2.0, 1.0, 1.0, 0.0, 0.0, 0.0, 0.0, 0.0, 2.0, 0.0, 0.0, 1.0, 0.0, 0.0, 2.0, 0.0, 2.0, 1.0, 1.0], [67.0, 23.0, 16.0, 5.0, 11.0, 8.0, 11.0, 2.0, 5.0, 6.0, 4.0, 2.0, 2.0, 2.0, 3.0, 2.0, 1.0, 0.0, 1.0, 0.0, 1.0, 0.0, 1.0, 1.0, 2.0, 1.0, 0.0, 1.0, 0.0, 2.0, 1.0, 1.0, 1.0, 1.0, 0.0, 2.0, 0.0, 0.0, 1.0, 1.0, 0.0, 1.0, 0.0, 0.0, 0.0, 1.0, 1.0, 1.0, 2.0], [79.0, 24.0, 15.0, 8.0, 7.0, 4.0, 5.0, 3.0, 2.0, 5.0, 1.0, 4.0, 3.0, 4.0, 2.0, 3.0, 3.0, 0.0, 3.0, 1.0, 0.0, 2.0, 0.0, 1.0, 2.0, 3.0, 0.0, 0.0, 2.0, 2.0, 0.0, 0.0, 0.0, 2.0, 0.0, 1.0, 0.0, 0.0, 1.0, 0.0, 0.0, 2.0, 0.0, 0.0, 2.0, 0.0, 0.0, 0.0, 0.0]],
    "Name": "sCurve-0",
    "Overflow": 2071361.0,
    "Type": "Histo2d",
    "Underflow": 0.0,
    "x": {
        "AxisTitle": "Vcal",
        "Bins": 51,
        "High": 302.5,
        "Low": 47.5
    },
    "y": {
        "AxisTitle": "Occupancy",
        "Bins": 49,
        "High": 49.5,
        "Low": 0.5
    },
    "z": {
        "AxisTitle": "Number of pixels"
    }
}