{
    "Data": [[2316.0, 769.0, 391.0, 230.0, 150.0, 104.0, 95.0, 78.0, 49.0, 40.0, 31.0, 25.0, 20.0, 20.0, 18.0, 12.0, 16.0, 6.0, 19.0, 12.0, 13.0, 10.0, 5.0, 10.0, 9.0, 8.0, 8.0, 12.0, 10.0, 9.0, 7.0, 8.0, 9.0, 5.0, 4.0, 5.0, 7.0, 10.0, 8.0, 9.0, 2.0, 1.0, 7.0, 10.0, 11.0, 13.0, 6.0, 14.0, 18.0], [3431.0, 1280.0, 661.0, 430.0, 273.0, 198.0, 151.0, 100.0, 110.0, 70.0, 53.0, 55.0, 28.0, 35.0, 23.0, 28.0, 24.0, 17.0, 15.0, 23.0, 15.0, 12.0, 13.0, 10.0, 6.0, 8.0, 4.0, 17.0, 11.0, 10.0, 10.0, 6.0, 13.0, 6.0, 18.0, 14.0, 11.0, 12.0, 6.0, 15.0, 6.0, 6.0, 4.0, 8.0, 8.0, 10.0, 11.0, 14.0, 22.0], [4794.0, 2116.0, 1195.0, 769.0, 500.0, 378.0, 289.0, 236.0, 174.0, 134.0, 113.0, 103.0, 72.0, 75.0, 67.0, 43.0, 50.0, 38.0, 29.0, 32.0, 30.0, 22.0, 21.0, 20.0, 19.0, 13.0, 12.0, 18.0, 18.0, 23.0, 12.0, 15.0, 11.0, 13.0, 17.0, 13.0, 11.0, 20.0, 10.0, 10.0, 13.0, 10.0, 23.0, 9.0, 9.0, 6.0, 12.0, 20.0, 10.0], [5462.0, 2999.0, 1891.0, 1301.0, 1004.0, 707.0, 551.0, 485.0, 336.0, 315.0, 222.0, 178.0, 176.0, 169.0, 142.0, 90.0, 100.0, 65.0, 91.0, 64.0, 55.0, 47.0, 41.0, 40.0, 38.0, 40.0, 23.0, 26.0, 31.0, 29.0, 20.0, 21.0, 24.0, 14.0, 27.0, 13.0, 10.0, 23.0, 21.0, 23.0, 15.0, 18.0, 17.0, 16.0, 16.0, 15.0, 16.0, 14.0, 25.0], [6093.0, 3324.0, 2343.0, 1903.0, 1405.0, 1109.0, 1044.0, 791.0, 690.0, 591.0, 501.0, 430.0, 378.0, 322.0, 283.0, 240.0, 215.0, 195.0, 154.0, 171.0, 126.0, 112.0, 104.0, 106.0, 97.0, 86.0, 53.0, 63.0, 64.0, 54.0, 41.0, 43.0, 35.0, 36.0, 36.0, 30.0, 31.0, 32.0, 28.0, 37.0, 35.0, 25.0, 26.0, 23.0, 31.0, 26.0, 27.0, 40.0, 44.0], [8131.0, 4134.0, 2856.0, 2144.0, 1693.0, 1491.0, 1386.0, 1184.0, 1003.0, 854.0, 842.0, 740.0, 664.0, 619.0, 550.0, 477.0, 438.0, 418.0, 374.0, 328.0, 300.0, 281.0, 257.0, 242.0, 205.0, 188.0, 201.0, 169.0, 144.0, 143.0, 125.0, 107.0, 104.0, 86.0, 78.0, 61.0, 79.0, 66.0, 61.0, 43.0, 57.0, 52.0, 43.0, 47.0, 57.0, 41.0, 52.0, 55.0, 68.0], [6396.0, 5296.0, 4231.0, 3423.0, 2860.0, 2352.0, 1899.0, 1689.0, 1479.0, 1319.0, 1088.0, 1104.0, 978.0, 883.0, 791.0, 785.0, 696.0, 650.0, 616.0, 624.0, 580.0, 517.0, 466.0, 440.0, 431.0, 401.0, 365.0, 359.0, 328.0, 302.0, 302.0, 263.0, 259.0, 212.0, 218.0, 198.0, 189.0, 184.0, 151.0, 155.0, 132.0, 108.0, 124.0, 101.0, 98.0, 102.0, 66.0, 126.0, 113.0], [1478.0, 1622.0, 1957.0, 2211.0, 2337.0, 2430.0, 2347.0, 2373.0, 2292.0, 2271.0, 2098.0, 2005.0, 1770.0, 1693.0, 1613.0, 1503.0, 1371.0, 1228.0, 1123.0, 1084.0, 984.0, 939.0, 823.0, 813.0, 771.0, 707.0, 694.0, 597.0, 570.0, 563.0, 581.0, 509.0, 474.0, 465.0, 473.0, 434.0, 421.0, 403.0, 372.0, 305.0, 351.0, 321.0, 278.0, 256.0, 257.0, 235.0, 224.0, 194.0, 227.0], [517.0, 373.0, 342.0, 363.0, 468.0, 553.0, 617.0, 711.0, 821.0, 959.0, 1019.0, 1227.0, 1311.0, 1325.0, 1444.0, 1584.0, 1560.0, 1565.0, 1660.0, 1615.0, 1692.0, 1644.0, 1785.0, 1670.0, 1623.0, 1562.0, 1513.0, 1477.0, 1442.0, 1387.0, 1243.0, 1203.0, 1168.0, 1074.0, 1057.0, 978.0, 905.0, 823.0, 799.0, 790.0, 678.0, 657.0, 608.0, 665.0, 609.0, 561.0, 491.0, 527.0, 516.0], [437.0, 226.0, 167.0, 129.0, 136.0, 141.0, 151.0, 160.0, 194.0, 198.0, 228.0, 287.0, 307.0, 288.0, 378.0, 430.0, 439.0, 497.0, 516.0, 579.0, 705.0, 771.0, 856.0, 917.0, 1012.0, 1055.0, 1197.0, 1314.0, 1358.0, 1489.0, 1542.0, 1646.0, 1739.0, 1749.0, 1852.0, 1869.0, 2004.0, 1917.0, 2051.0, 2025.0, 2045.0, 2000.0, 1921.0, 1735.0, 1773.0, 1597.0, 1494.0, 1440.0, 1352.0], [432.0, 167.0, 113.0, 91.0, 79.0, 70.0, 75.0, 64.0, 81.0, 79.0, 70.0, 104.0, 93.0, 119.0, 115.0, 132.0, 155.0, 153.0, 176.0, 211.0, 244.0, 234.0, 230.0, 263.0, 304.0, 381.0, 396.0, 449.0, 458.0, 624.0, 580.0, 691.0, 718.0, 844.0, 887.0, 1062.0, 1195.0, 1377.0, 1597.0, 1731.0, 1913.0, 2252.0, 2624.0, 2945.0, 3313.0, 3796.0, 4157.0, 4412.0, 4654.0], [399.0, 157.0, 99.0, 74.0, 70.0, 65.0, 44.0, 38.0, 40.0, 35.0, 35.0, 36.0, 42.0, 51.0, 46.0, 45.0, 62.0, 55.0, 74.0, 79.0, 90.0, 98.0, 90.0, 112.0, 148.0, 146.0, 163.0, 211.0, 209.0, 235.0, 236.0, 290.0, 341.0, 363.0, 411.0, 421.0, 494.0, 587.0, 648.0, 801.0, 897.0, 1140.0, 1351.0, 1663.0, 2164.0, 2882.0, 3912.0, 5585.0, 8852.0], [358.0, 149.0, 102.0, 78.0, 51.0, 40.0, 47.0, 38.0, 24.0, 36.0, 41.0, 20.0, 19.0, 18.0, 27.0, 24.0, 28.0, 27.0, 37.0, 31.0, 39.0, 38.0, 42.0, 51.0, 51.0, 65.0, 71.0, 89.0, 91.0, 99.0, 112.0, 143.0, 159.0, 180.0, 184.0, 217.0, 242.0, 280.0, 327.0, 411.0, 466.0, 598.0, 745.0, 903.0, 1116.0, 1609.0, 2264.0, 3744.0, 7703.0], [405.0, 133.0, 90.0, 67.0, 42.0, 49.0, 33.0, 40.0, 24.0, 27.0, 23.0, 21.0, 16.0, 14.0, 18.0, 20.0, 23.0, 12.0, 12.0, 16.0, 20.0, 30.0, 22.0, 22.0, 22.0, 27.0, 37.0, 35.0, 37.0, 43.0, 57.0, 61.0, 74.0, 81.0, 92.0, 128.0, 112.0, 142.0, 188.0, 223.0, 222.0, 280.0, 326.0, 476.0, 637.0, 897.0, 1314.0, 2286.0, 5160.0], [375.0, 131.0, 74.0, 65.0, 42.0, 38.0, 41.0, 23.0, 28.0, 26.0, 18.0, 17.0, 14.0, 12.0, 11.0, 21.0, 10.0, 13.0, 12.0, 13.0, 12.0, 13.0, 17.0, 18.0, 20.0, 22.0, 15.0, 18.0, 29.0, 20.0, 26.0, 32.0, 26.0, 44.0, 44.0, 45.0, 49.0, 87.0, 77.0, 118.0, 101.0, 174.0, 190.0, 236.0, 352.0, 492.0, 745.0, 1307.0, 3470.0], [356.0, 145.0, 76.0, 64.0, 33.0, 39.0, 29.0, 22.0, 24.0, 22.0, 8.0, 18.0, 12.0, 11.0, 10.0, 8.0, 14.0, 9.0, 11.0, 13.0, 10.0, 13.0, 6.0, 14.0, 10.0, 22.0, 13.0, 14.0, 7.0, 24.0, 27.0, 14.0, 20.0, 25.0, 21.0, 38.0, 35.0, 36.0, 43.0, 51.0, 54.0, 79.0, 86.0, 135.0, 183.0, 287.0, 421.0, 803.0, 2204.0], [365.0, 151.0, 74.0, 67.0, 37.0, 24.0, 28.0, 20.0, 31.0, 17.0, 12.0, 15.0, 14.0, 8.0, 6.0, 12.0, 11.0, 9.0, 7.0, 13.0, 6.0, 6.0, 12.0, 8.0, 7.0, 10.0, 11.0, 7.0, 13.0, 10.0, 14.0, 19.0, 16.0, 21.0, 24.0, 25.0, 19.0, 26.0, 28.0, 35.0, 34.0, 38.0, 64.0, 59.0, 99.0, 148.0, 247.0, 446.0, 1371.0], [378.0, 130.0, 72.0, 50.0, 38.0, 29.0, 18.0, 23.0, 19.0, 21.0, 13.0, 10.0, 12.0, 11.0, 9.0, 7.0, 11.0, 8.0, 9.0, 10.0, 5.0, 7.0, 11.0, 11.0, 7.0, 13.0, 9.0, 11.0, 10.0, 7.0, 14.0, 5.0, 9.0, 10.0, 12.0, 14.0, 14.0, 19.0, 21.0, 31.0, 31.0, 33.0, 34.0, 36.0, 59.0, 93.0, 152.0, 251.0, 840.0], [351.0, 144.0, 75.0, 56.0, 44.0, 26.0, 21.0, 22.0, 22.0, 15.0, 11.0, 8.0, 14.0, 8.0, 4.0, 11.0, 4.0, 6.0, 2.0, 13.0, 4.0, 9.0, 6.0, 6.0, 6.0, 3.0, 5.0, 11.0, 10.0, 12.0, 7.0, 12.0, 8.0, 13.0, 12.0, 11.0, 16.0, 13.0, 21.0, 19.0, 15.0, 20.0, 30.0, 39.0, 40.0, 59.0, 76.0, 168.0, 518.0], [371.0, 115.0, 83.0, 47.0, 33.0, 30.0, 26.0, 21.0, 21.0, 18.0, 11.0, 16.0, 6.0, 5.0, 6.0, 8.0, 7.0, 6.0, 3.0, 3.0, 5.0, 6.0, 2.0, 6.0, 5.0, 7.0, 9.0, 8.0, 7.0, 6.0, 8.0, 6.0, 10.0, 4.0, 12.0, 9.0, 7.0, 4.0, 10.0, 21.0, 17.0, 18.0, 26.0, 32.0, 25.0, 36.0, 56.0, 104.0, 353.0], [350.0, 127.0, 60.0, 63.0, 45.0, 38.0, 26.0, 22.0, 14.0, 16.0, 8.0, 7.0, 8.0, 5.0, 6.0, 8.0, 3.0, 3.0, 10.0, 5.0, 3.0, 4.0, 4.0, 4.0, 4.0, 8.0, 4.0, 5.0, 3.0, 3.0, 11.0, 9.0, 7.0, 6.0, 6.0, 7.0, 8.0, 6.0, 10.0, 12.0, 6.0, 10.0, 14.0, 14.0, 34.0, 32.0, 53.0, 79.0, 194.0], [372.0, 137.0, 79.0, 43.0, 38.0, 31.0, 31.0, 9.0, 16.0, 23.0, 12.0, 5.0, 8.0, 9.0, 8.0, 3.0, 7.0, 3.0, 8.0, 4.0, 2.0, 7.0, 1.0, 5.0, 5.0, 7.0, 4.0, 6.0, 2.0, 5.0, 6.0, 7.0, 8.0, 5.0, 5.0, 4.0, 4.0, 4.0, 9.0, 8.0, 7.0, 12.0, 13.0, 16.0, 25.0, 25.0, 36.0, 65.0, 162.0], [328.0, 130.0, 72.0, 55.0, 40.0, 21.0, 18.0, 15.0, 19.0, 16.0, 15.0, 12.0, 4.0, 9.0, 2.0, 5.0, 1.0, 2.0, 4.0, 4.0, 5.0, 7.0, 4.0, 6.0, 2.0, 4.0, 4.0, 4.0, 8.0, 5.0, 6.0, 5.0, 3.0, 4.0, 2.0, 6.0, 4.0, 1.0, 7.0, 7.0, 9.0, 6.0, 8.0, 11.0, 16.0, 21.0, 26.0, 42.0, 122.0], [400.0, 144.0, 82.0, 41.0, 36.0, 29.0, 19.0, 18.0, 16.0, 19.0, 12.0, 5.0, 10.0, 3.0, 1.0, 5.0, 4.0, 4.0, 4.0, 3.0, 2.0, 1.0, 1.0, 7.0, 4.0, 4.0, 3.0, 1.0, 4.0, 7.0, 2.0, 4.0, 9.0, 5.0, 2.0, 1.0, 8.0, 4.0, 9.0, 6.0, 13.0, 6.0, 6.0, 3.0, 8.0, 13.0, 25.0, 43.0, 96.0], [375.0, 135.0, 69.0, 53.0, 44.0, 22.0, 24.0, 15.0, 9.0, 14.0, 11.0, 10.0, 3.0, 10.0, 5.0, 1.0, 3.0, 7.0, 2.0, 2.0, 2.0, 4.0, 3.0, 4.0, 1.0, 3.0, 7.0, 5.0, 2.0, 7.0, 2.0, 3.0, 4.0, 2.0, 5.0, 2.0, 6.0, 1.0, 2.0, 4.0, 5.0, 4.0, 4.0, 15.0, 6.0, 15.0, 18.0, 30.0, 80.0], [367.0, 143.0, 64.0, 47.0, 34.0, 23.0, 23.0, 19.0, 8.0, 15.0, 9.0, 9.0, 5.0, 6.0, 6.0, 4.0, 4.0, 4.0, 1.0, 2.0, 5.0, 1.0, 3.0, 3.0, 4.0, 5.0, 2.0, 3.0, 3.0, 3.0, 4.0, 7.0, 4.0, 3.0, 3.0, 2.0, 3.0, 2.0, 2.0, 3.0, 4.0, 4.0, 3.0, 6.0, 12.0, 3.0, 11.0, 23.0, 51.0], [372.0, 148.0, 68.0, 35.0, 35.0, 29.0, 22.0, 17.0, 16.0, 10.0, 11.0, 9.0, 5.0, 6.0, 8.0, 6.0, 4.0, 0.0, 0.0, 6.0, 5.0, 2.0, 3.0, 6.0, 2.0, 4.0, 2.0, 0.0, 1.0, 1.0, 1.0, 3.0, 1.0, 3.0, 6.0, 0.0, 5.0, 1.0, 3.0, 4.0, 2.0, 8.0, 1.0, 5.0, 6.0, 8.0, 5.0, 21.0, 47.0], [327.0, 123.0, 68.0, 41.0, 42.0, 31.0, 23.0, 22.0, 16.0, 13.0, 11.0, 6.0, 5.0, 6.0, 7.0, 2.0, 3.0, 5.0, 1.0, 0.0, 3.0, 2.0, 5.0, 3.0, 3.0, 5.0, 1.0, 3.0, 3.0, 1.0, 0.0, 4.0, 6.0, 2.0, 3.0, 4.0, 3.0, 5.0, 3.0, 4.0, 5.0, 3.0, 4.0, 5.0, 3.0, 5.0, 7.0, 7.0, 28.0], [378.0, 113.0, 76.0, 37.0, 34.0, 22.0, 28.0, 17.0, 24.0, 8.0, 6.0, 7.0, 9.0, 2.0, 6.0, 5.0, 1.0, 2.0, 7.0, 1.0, 2.0, 1.0, 2.0, 6.0, 5.0, 2.0, 5.0, 2.0, 2.0, 1.0, 5.0, 9.0, 1.0, 1.0, 1.0, 4.0, 4.0, 4.0, 3.0, 0.0, 3.0, 3.0, 0.0, 4.0, 3.0, 3.0, 8.0, 10.0, 28.0], [378.0, 125.0, 74.0, 56.0, 33.0, 33.0, 15.0, 21.0, 19.0, 14.0, 8.0, 5.0, 4.0, 3.0, 6.0, 2.0, 3.0, 7.0, 3.0, 2.0, 5.0, 3.0, 3.0, 4.0, 1.0, 1.0, 1.0, 3.0, 3.0, 3.0, 4.0, 1.0, 2.0, 1.0, 4.0, 1.0, 4.0, 3.0, 1.0, 2.0, 3.0, 4.0, 2.0, 3.0, 5.0, 4.0, 6.0, 8.0, 17.0], [389.0, 113.0, 75.0, 45.0, 36.0, 18.0, 16.0, 21.0, 24.0, 12.0, 9.0, 9.0, 6.0, 2.0, 10.0, 2.0, 0.0, 4.0, 3.0, 3.0, 2.0, 3.0, 4.0, 2.0, 0.0, 3.0, 2.0, 4.0, 2.0, 1.0, 7.0, 2.0, 2.0, 4.0, 2.0, 1.0, 4.0, 2.0, 1.0, 2.0, 1.0, 4.0, 3.0, 3.0, 2.0, 4.0, 4.0, 4.0, 24.0], [331.0, 136.0, 65.0, 52.0, 30.0, 28.0, 19.0, 17.0, 15.0, 11.0, 15.0, 10.0, 6.0, 8.0, 9.0, 3.0, 2.0, 2.0, 2.0, 4.0, 4.0, 2.0, 2.0, 1.0, 0.0, 3.0, 1.0, 2.0, 5.0, 2.0, 2.0, 2.0, 3.0, 5.0, 1.0, 2.0, 2.0, 1.0, 0.0, 0.0, 3.0, 3.0, 1.0, 5.0, 6.0, 2.0, 4.0, 5.0, 21.0], [393.0, 139.0, 65.0, 39.0, 38.0, 27.0, 22.0, 13.0, 27.0, 11.0, 13.0, 11.0, 6.0, 7.0, 2.0, 6.0, 3.0, 4.0, 3.0, 2.0, 1.0, 4.0, 5.0, 2.0, 2.0, 1.0, 0.0, 1.0, 2.0, 2.0, 3.0, 0.0, 3.0, 6.0, 1.0, 2.0, 6.0, 4.0, 0.0, 2.0, 4.0, 2.0, 3.0, 5.0, 1.0, 1.0, 3.0, 11.0, 16.0], [380.0, 125.0, 67.0, 68.0, 32.0, 23.0, 28.0, 22.0, 15.0, 9.0, 6.0, 6.0, 7.0, 6.0, 8.0, 3.0, 2.0, 3.0, 3.0, 4.0, 4.0, 4.0, 1.0, 2.0, 3.0, 1.0, 4.0, 3.0, 1.0, 0.0, 3.0, 4.0, 3.0, 3.0, 2.0, 2.0, 2.0, 2.0, 1.0, 2.0, 0.0, 2.0, 2.0, 1.0, 4.0, 5.0, 3.0, 7.0, 8.0], [344.0, 120.0, 85.0, 50.0, 32.0, 23.0, 24.0, 9.0, 14.0, 18.0, 12.0, 5.0, 10.0, 5.0, 3.0, 6.0, 4.0, 3.0, 2.0, 1.0, 5.0, 3.0, 2.0, 1.0, 4.0, 2.0, 2.0, 2.0, 2.0, 3.0, 3.0, 2.0, 2.0, 3.0, 3.0, 7.0, 3.0, 4.0, 3.0, 2.0, 1.0, 2.0, 3.0, 0.0, 3.0, 2.0, 3.0, 3.0, 13.0], [351.0, 109.0, 72.0, 41.0, 42.0, 30.0, 21.0, 15.0, 22.0, 13.0, 12.0, 5.0, 7.0, 12.0, 4.0, 2.0, 3.0, 4.0, 1.0, 1.0, 2.0, 3.0, 2.0, 3.0, 2.0, 2.0, 4.0, 1.0, 1.0, 2.0, 4.0, 3.0, 5.0, 2.0, 4.0, 2.0, 2.0, 2.0, 4.0, 0.0, 4.0, 0.0, 5.0, 1.0, 3.0, 4.0, 2.0, 1.0, 9.0], [313.0, 134.0, 77.0, 50.0, 39.0, 22.0, 29.0, 18.0, 19.0, 10.0, 15.0, 7.0, 8.0, 4.0, 3.0, 6.0, 2.0, 1.0, 3.0, 0.0, 2.0, 1.0, 1.0, 3.0, 4.0, 4.0, 1.0, 3.0, 4.0, 7.0, 3.0, 6.0, 3.0, 1.0, 2.0, 3.0, 2.0, 2.0, 4.0, 0.0, 1.0, 1.0, 4.0, 2.0, 4.0, 3.0, 1.0, 1.0, 13.0], [356.0, 130.0, 80.0, 57.0, 39.0, 23.0, 21.0, 14.0, 13.0, 16.0, 17.0, 5.0, 6.0, 2.0, 8.0, 3.0, 3.0, 5.0, 1.0, 2.0, 2.0, 1.0, 4.0, 3.0, 4.0, 5.0, 5.0, 6.0, 2.0, 2.0, 3.0, 2.0, 2.0, 1.0, 2.0, 2.0, 4.0, 7.0, 0.0, 3.0, 2.0, 2.0, 1.0, 4.0, 0.0, 2.0, 1.0, 1.0, 12.0], [387.0, 129.0, 74.0, 41.0, 43.0, 31.0, 19.0, 18.0, 14.0, 13.0, 8.0, 6.0, 11.0, 11.0, 2.0, 1.0, 3.0, 1.0, 3.0, 3.0, 4.0, 4.0, 1.0, 4.0, 2.0, 2.0, 3.0, 0.0, 0.0, 1.0, 2.0, 1.0, 6.0, 1.0, 2.0, 3.0, 2.0, 5.0, 1.0, 6.0, 5.0, 4.0, 2.0, 2.0, 3.0, 1.0, 4.0, 1.0, 9.0], [357.0, 127.0, 74.0, 43.0, 35.0, 27.0, 18.0, 24.0, 15.0, 15.0, 9.0, 9.0, 9.0, 8.0, 5.0, 3.0, 2.0, 4.0, 2.0, 1.0, 2.0, 1.0, 4.0, 2.0, 3.0, 2.0, 2.0, 4.0, 5.0, 4.0, 4.0, 3.0, 3.0, 4.0, 0.0, 2.0, 1.0, 0.0, 6.0, 0.0, 3.0, 3.0, 4.0, 4.0, 2.0, 3.0, 0.0, 2.0, 9.0], [388.0, 118.0, 69.0, 43.0, 36.0, 22.0, 21.0, 20.0, 17.0, 12.0, 10.0, 10.0, 8.0, 1.0, 7.0, 3.0, 5.0, 3.0, 3.0, 4.0, 2.0, 1.0, 4.0, 4.0, 2.0, 0.0, 4.0, 5.0, 4.0, 2.0, 2.0, 4.0, 2.0, 0.0, 3.0, 3.0, 3.0, 4.0, 4.0, 3.0, 5.0, 2.0, 0.0, 1.0, 2.0, 0.0, 2.0, 3.0, 15.0], [357.0, 131.0, 95.0, 52.0, 37.0, 28.0, 19.0, 18.0, 7.0, 10.0, 11.0, 12.0, 3.0, 4.0, 3.0, 6.0, 5.0, 4.0, 1.0, 5.0, 5.0, 0.0, 5.0, 2.0, 2.0, 2.0, 2.0, 3.0, 4.0, 6.0, 0.0, 0.0, 1.0, 6.0, 1.0, 2.0, 3.0, 3.0, 0.0, 6.0, 1.0, 3.0, 1.0, 0.0, 9.0, 1.0, 1.0, 2.0, 15.0], [380.0, 117.0, 60.0, 53.0, 40.0, 30.0, 20.0, 24.0, 11.0, 11.0, 12.0, 7.0, 7.0, 3.0, 5.0, 4.0, 1.0, 5.0, 2.0, 0.0, 3.0, 4.0, 4.0, 1.0, 4.0, 1.0, 3.0, 2.0, 1.0, 3.0, 4.0, 0.0, 5.0, 3.0, 3.0, 2.0, 0.0, 2.0, 1.0, 3.0, 5.0, 5.0, 4.0, 2.0, 3.0, 3.0, 3.0, 5.0, 10.0], [361.0, 127.0, 80.0, 53.0, 34.0, 29.0, 28.0, 15.0, 9.0, 17.0, 8.0, 7.0, 6.0, 6.0, 1.0, 6.0, 3.0, 2.0, 3.0, 4.0, 3.0, 2.0, 4.0, 0.0, 2.0, 1.0, 4.0, 8.0, 1.0, 3.0, 1.0, 1.0, 2.0, 7.0, 3.0, 4.0, 5.0, 2.0, 3.0, 3.0, 4.0, 1.0, 4.0, 1.0, 0.0, 2.0, 3.0, 5.0, 8.0], [367.0, 119.0, 94.0, 44.0, 43.0, 25.0, 23.0, 16.0, 15.0, 6.0, 6.0, 10.0, 4.0, 4.0, 1.0, 4.0, 7.0, 2.0, 7.0, 2.0, 2.0, 2.0, 2.0, 2.0, 3.0, 3.0, 2.0, 3.0, 2.0, 9.0, 4.0, 2.0, 4.0, 1.0, 6.0, 0.0, 1.0, 4.0, 0.0, 3.0, 4.0, 3.0, 2.0, 1.0, 2.0, 2.0, 1.0, 2.0, 9.0], [370.0, 140.0, 65.0, 52.0, 37.0, 21.0, 18.0, 20.0, 24.0, 6.0, 9.0, 6.0, 8.0, 9.0, 3.0, 5.0, 3.0, 3.0, 2.0, 4.0, 1.0, 2.0, 4.0, 2.0, 1.0, 3.0, 3.0, 3.0, 1.0, 1.0, 5.0, 5.0, 3.0, 1.0, 4.0, 4.0, 3.0, 6.0, 1.0, 4.0, 1.0, 1.0, 2.0, 3.0, 1.0, 5.0, 2.0, 2.0, 15.0], [338.0, 133.0, 74.0, 54.0, 42.0, 35.0, 16.0, 17.0, 15.0, 11.0, 10.0, 4.0, 8.0, 3.0, 5.0, 3.0, 3.0, 7.0, 4.0, 0.0, 3.0, 2.0, 3.0, 1.0, 4.0, 4.0, 1.0, 4.0, 5.0, 2.0, 2.0, 3.0, 4.0, 3.0, 3.0, 1.0, 2.0, 5.0, 1.0, 4.0, 4.0, 1.0, 2.0, 3.0, 2.0, 1.0, 2.0, 6.0, 10.0], [375.0, 128.0, 64.0, 56.0, 40.0, 40.0, 23.0, 12.0, 17.0, 9.0, 8.0, 5.0, 8.0, 8.0, 5.0, 1.0, 5.0, 6.0, 4.0, 5.0, 3.0, 2.0, 4.0, 6.0, 1.0, 1.0, 2.0, 0.0, 0.0, 1.0, 1.0, 2.0, 2.0, 4.0, 3.0, 2.0, 1.0, 2.0, 4.0, 6.0, 5.0, 1.0, 4.0, 5.0, 1.0, 2.0, 2.0, 3.0, 13.0], [373.0, 121.0, 83.0, 40.0, 29.0, 21.0, 32.0, 21.0, 9.0, 14.0, 9.0, 9.0, 9.0, 6.0, 4.0, 2.0, 5.0, 2.0, 3.0, 4.0, 3.0, 5.0, 4.0, 2.0, 2.0, 5.0, 2.0, 1.0, 1.0, 0.0, 2.0, 3.0, 3.0, 2.0, 2.0, 7.0, 1.0, 5.0, 5.0, 3.0, 2.0, 5.0, 2.0, 6.0, 2.0, 1.0, 4.0, 3.0, 15.0], [360.0, 133.0, 79.0, 51.0, 43.0, 25.0, 17.0, 21.0, 17.0, 8.0, 6.0, 7.0, 9.0, 3.0, 5.0, 2.0, 8.0, 1.0, 2.0, 2.0, 6.0, 7.0, 2.0, 4.0, 3.0, 5.0, 3.0, 2.0, 2.0, 5.0, 2.0, 3.0, 1.0, 2.0, 3.0, 1.0, 3.0, 6.0, 1.0, 2.0, 4.0, 1.0, 1.0, 1.0, 2.0, 0.0, 0.0, 4.0, 16.0], [381.0, 138.0, 68.0, 58.0, 28.0, 30.0, 20.0, 13.0, 20.0, 13.0, 10.0, 6.0, 7.0, 4.0, 7.0, 4.0, 1.0, 3.0, 2.0, 3.0, 3.0, 4.0, 6.0, 3.0, 4.0, 2.0, 2.0, 1.0, 1.0, 4.0, 4.0, 5.0, 4.0, 2.0, 3.0, 3.0, 1.0, 3.0, 4.0, 1.0, 3.0, 5.0, 7.0, 2.0, 1.0, 1.0, 1.0, 4.0, 14.0]],
    "Name": "sCurve-0",
    "Overflow": 1994863.0,
    "Type": "Histo2d",
    "Underflow": 0.0,
    "x": {
        "AxisTitle": "Vcal",
        "Bins": 51,
        "High": 302.5,
        "Low": 47.5
    },
    "y": {
        "AxisTitle": "Occupancy",
        "Bins": 49,
        "High": 49.5,
        "Low": 0.5
    },
    "z": {
        "AxisTitle": "Number of pixels"
    }
}