time,Hardware,Voltage,Current
1621999135324,high-voltage-3,1,0.00698886
time,Hardware,Voltage,Current
1621999135324,high-voltage-3,2,0.00974135
time,Hardware,Voltage,Current
1621999135324,high-voltage-3,3,0.0127662
time,Hardware,Voltage,Current
1621999135324,high-voltage-3,4,0.0139286
time,Hardware,Voltage,Current
1621999135324,high-voltage-3,5,0.0141213
time,Hardware,Voltage,Current
1621999135324,high-voltage-3,6,0.0173908
time,Hardware,Voltage,Current
1621999135324,high-voltage-3,7,0.0176368
time,Hardware,Voltage,Current
1621999135324,high-voltage-3,8,0.0192784
time,Hardware,Voltage,Current
1621999135324,high-voltage-3,9,0.0215559
time,Hardware,Voltage,Current
1621999135324,high-voltage-3,10,0.024204
time,Hardware,Voltage,Current
1621999135324,high-voltage-3,11,0.0261695
time,Hardware,Voltage,Current
1621999135324,high-voltage-3,12,0.0278536
time,Hardware,Voltage,Current
1621999135324,high-voltage-3,13,0.0291719
time,Hardware,Voltage,Current
1621999135324,high-voltage-3,14,0.0305838
time,Hardware,Voltage,Current
1621999135324,high-voltage-3,15,0.0323272
time,Hardware,Voltage,Current
1621999135324,high-voltage-3,16,0.0326835
time,Hardware,Voltage,Current
1621999135324,high-voltage-3,17,0.0344604
time,Hardware,Voltage,Current
1621999135324,high-voltage-3,18,0.0352258
time,Hardware,Voltage,Current
1621999135324,high-voltage-3,19,0.0377355
time,Hardware,Voltage,Current
1621999135324,high-voltage-3,20,0.0391931
time,Hardware,Voltage,Current
1621999135324,high-voltage-3,25,0.0473435
time,Hardware,Voltage,Current
1621999135324,high-voltage-3,30,0.0537607
time,Hardware,Voltage,Current
1621999135324,high-voltage-3,35,0.0607038
time,Hardware,Voltage,Current
1621999135324,high-voltage-3,40,0.0690604
time,Hardware,Voltage,Current
1621999135324,high-voltage-3,45,0.0766209
time,Hardware,Voltage,Current
1621999135324,high-voltage-3,50,0.0831599
time,Hardware,Voltage,Current
1621999135324,high-voltage-3,55,0.0874262
time,Hardware,Voltage,Current
1621999135324,high-voltage-3,60,0.0939493
time,Hardware,Voltage,Current
1621999135324,high-voltage-3,65,0.100403
time,Hardware,Voltage,Current
1621999135324,high-voltage-3,70,0.107432
time,Hardware,Voltage,Current
1621999135324,high-voltage-3,75,0.113755
time,Hardware,Voltage,Current
1621999135324,high-voltage-3,80,0.118449
time,Hardware,Voltage,Current
1621999135324,high-voltage-3,85,0.12826
time,Hardware,Voltage,Current
1621999135324,high-voltage-3,90,0.135187
time,Hardware,Voltage,Current
1621999135324,high-voltage-3,95,0.145786
time,Hardware,Voltage,Current
1621999135324,high-voltage-3,100,0.156086
