{
    "Data": [0.0, 0.0, 0.0, 0.0, 0.0, 0.0, 0.0, 0.0, 0.0, 0.0, 0.0, 0.0, 0.0, 0.0, 5.0, 0.0, 1.0, 12.0, 184.0, 144.0, 28.0, 185.0, 1299.0, 1609.0, 343.0, 605.0, 1850.0, 2117.0, 782.0, 775.0, 1331.0, 1588.0, 767.0, 526.0, 719.0, 748.0, 583.0, 430.0, 642.0, 790.0, 741.0, 730.0, 1513.0, 2681.0, 2199.0, 1364.0, 2062.0, 3106.0, 4172.0, 3137.0, 2334.0, 2500.0, 3151.0, 2804.0, 2013.0, 1813.0, 1708.0, 2091.0, 1728.0, 1381.0, 1228.0, 1144.0, 1117.0, 808.0, 725.0, 581.0, 593.0, 599.0, 489.0, 470.0, 422.0, 441.0, 326.0, 318.0, 239.0, 293.0, 216.0, 193.0, 169.0, 179.0, 161.0, 176.0, 120.0, 100.0, 99.0, 110.0, 88.0, 90.0, 73.0, 75.0, 91.0, 56.0, 65.0, 50.0, 56.0, 55.0, 45.0, 36.0, 45.0, 48.0, 33.0, 33.0, 29.0, 24.0, 24.0, 27.0, 22.0, 26.0, 24.0, 29.0, 16.0, 19.0, 21.0, 18.0, 15.0, 17.0, 19.0, 17.0, 17.0, 18.0, 15.0, 14.0, 26.0, 13.0, 6.0, 10.0, 15.0, 6.0, 6.0, 12.0, 9.0, 12.0, 12.0, 7.0, 10.0, 6.0, 9.0, 13.0, 4.0, 6.0, 3.0, 6.0, 6.0, 4.0, 9.0, 4.0, 3.0, 5.0, 8.0, 6.0, 5.0, 3.0, 5.0, 6.0, 6.0, 2.0, 2.0, 2.0, 1.0, 1.0, 3.0, 4.0, 1.0, 2.0, 4.0, 3.0, 2.0, 1.0, 3.0, 4.0, 2.0, 3.0, 5.0, 1.0, 4.0, 7.0, 2.0, 2.0, 4.0, 5.0, 2.0, 1.0, 3.0, 4.0, 4.0, 4.0, 3.0, 3.0, 2.0, 2.0, 2.0, 2.0, 8.0, 6.0, 4.0, 3.0, 6.0, 4.0, 5.0, 4.0, 0.0],
    "Name": "TimePerFitDist-0",
    "Overflow": 278.0,
    "Type": "Histo1d",
    "Underflow": 0.0,
    "x": {
        "AxisTitle": "Fit Time [us]",
        "Bins": 201,
        "High": 401.0,
        "Low": -1.0
    },
    "y": {
        "AxisTitle": "Number of Pixels"
    },
    "z": {
        "AxisTitle": "z"
    }
}