{
    "Data": [3027.0, 20336.0, 16081.0, 8381.0, 3052.0, 1471.0, 1708.0, 2513.0, 3351.0, 3606.0, 3369.0, 2868.0, 2203.0, 1589.0, 1087.0, 668.0, 409.0, 232.0, 124.0, 59.0, 29.0, 8.0, 18.0, 9.0, 19.0, 7.0, 7.0, 1.0, 1.0, 0.0, 0.0, 0.0, 1.0, 1.0, 0.0, 0.0, 0.0, 0.0, 2.0, 0.0, 0.0, 0.0, 0.0, 0.0, 0.0, 0.0, 0.0, 0.0, 0.0, 0.0, 0.0],
    "Name": "Chi2Dist-0",
    "Overflow": 0.0,
    "Type": "Histo1d",
    "Underflow": 0.0,
    "x": {
        "AxisTitle": "Fit Chi/ndf",
        "Bins": 51,
        "High": 2.5250000953674318,
        "Low": -0.02500000037252903
    },
    "y": {
        "AxisTitle": "Number of Pixels"
    },
    "z": {
        "AxisTitle": "z"
    }
}