time,Hardware,Voltage,Current
1626716137149,high-voltage-3,1,0.132903
time,Hardware,Voltage,Current
1626716137149,high-voltage-3,2,0.142093
time,Hardware,Voltage,Current
1626716137149,high-voltage-3,3,0.150619
time,Hardware,Voltage,Current
1626716137149,high-voltage-3,4,0.158588
time,Hardware,Voltage,Current
1626716137149,high-voltage-3,5,0.162916
time,Hardware,Voltage,Current
1626716137149,high-voltage-3,6,0.167422
time,Hardware,Voltage,Current
1626716137149,high-voltage-3,7,0.170773
time,Hardware,Voltage,Current
1626716137149,high-voltage-3,8,0.17351
time,Hardware,Voltage,Current
1626716137149,high-voltage-3,9,0.177471
time,Hardware,Voltage,Current
1626716137149,high-voltage-3,10,0.181307
time,Hardware,Voltage,Current
1626716137149,high-voltage-3,11,0.186503
time,Hardware,Voltage,Current
1626716137149,high-voltage-3,12,0.191091
time,Hardware,Voltage,Current
1626716137149,high-voltage-3,13,0.193543
time,Hardware,Voltage,Current
1626716137149,high-voltage-3,14,0.19746
time,Hardware,Voltage,Current
1626716137149,high-voltage-3,15,0.203047
time,Hardware,Voltage,Current
1626716137149,high-voltage-3,16,0.205396
time,Hardware,Voltage,Current
1626716137149,high-voltage-3,17,0.208641
time,Hardware,Voltage,Current
1626716137149,high-voltage-3,18,0.212031
time,Hardware,Voltage,Current
1626716137149,high-voltage-3,19,0.214612
time,Hardware,Voltage,Current
1626716137149,high-voltage-3,20,0.218887
time,Hardware,Voltage,Current
1626716137149,high-voltage-3,25,0.234672
time,Hardware,Voltage,Current
1626716137149,high-voltage-3,30,0.248295
time,Hardware,Voltage,Current
1626716137149,high-voltage-3,35,0.260187
time,Hardware,Voltage,Current
1626716137149,high-voltage-3,40,0.271163
time,Hardware,Voltage,Current
1626716137149,high-voltage-3,45,0.282037
time,Hardware,Voltage,Current
1626716137149,high-voltage-3,50,0.292942
time,Hardware,Voltage,Current
1626716137149,high-voltage-3,55,0.304186
time,Hardware,Voltage,Current
1626716137149,high-voltage-3,60,0.31633
time,Hardware,Voltage,Current
1626716137149,high-voltage-3,65,0.326438
time,Hardware,Voltage,Current
1626716137149,high-voltage-3,70,0.337892
time,Hardware,Voltage,Current
1626716137149,high-voltage-3,75,0.348085
time,Hardware,Voltage,Current
1626716137149,high-voltage-3,80,0.359108
time,Hardware,Voltage,Current
1626716137149,high-voltage-3,85,0.371947
time,Hardware,Voltage,Current
1626716137149,high-voltage-3,90,0.380366
time,Hardware,Voltage,Current
1626716137149,high-voltage-3,95,0.391919
time,Hardware,Voltage,Current
1626716137149,high-voltage-3,100,0.403975
