{
    "Data": [31.0, 50.0, 9.0, 4.0, 4.0, 14.0, 67.0, 203.0, 563.0, 1375.0, 2757.0, 4138.0, 5080.0, 4770.0, 4192.0, 3718.0, 4311.0, 4858.0, 5211.0, 4731.0, 4030.0, 2999.0, 2273.0, 1996.0, 1898.0, 1801.0, 1856.0, 1850.0, 1803.0, 1619.0, 1585.0, 1345.0, 1122.0, 927.0, 689.0, 541.0, 407.0, 266.0, 194.0, 142.0, 122.0, 78.0, 63.0, 63.0, 40.0, 34.0, 19.0, 18.0, 21.0, 10.0, 9.0, 12.0, 7.0, 9.0, 10.0],
    "Name": "NoiseDist-0",
    "Overflow": 61.0,
    "Type": "Histo1d",
    "Underflow": 0.0,
    "x": {
        "AxisTitle": "Noise [e]",
        "Bins": 55,
        "High": 276.0,
        "Low": -2.0
    },
    "y": {
        "AxisTitle": "Number of Pixels"
    },
    "z": {
        "AxisTitle": "z"
    }
}