time,Hardware,Voltage,Current
1626374803969,high-voltage-2,1,0.139238
time,Hardware,Voltage,Current
1626374803969,high-voltage-2,2,0.18919
time,Hardware,Voltage,Current
1626374803969,high-voltage-2,3,0.2134
time,Hardware,Voltage,Current
1626374803969,high-voltage-2,4,0.233826
time,Hardware,Voltage,Current
1626374803969,high-voltage-2,5,0.253946
time,Hardware,Voltage,Current
1626374803969,high-voltage-2,6,0.277721
time,Hardware,Voltage,Current
1626374803969,high-voltage-2,7,0.301348
time,Hardware,Voltage,Current
1626374803969,high-voltage-2,8,0.32662
time,Hardware,Voltage,Current
1626374803969,high-voltage-2,9,0.352182
time,Hardware,Voltage,Current
1626374803969,high-voltage-2,10,0.377621
time,Hardware,Voltage,Current
1626374803969,high-voltage-2,11,0.400151
time,Hardware,Voltage,Current
1626374803969,high-voltage-2,12,0.422139
time,Hardware,Voltage,Current
1626374803969,high-voltage-2,13,0.441681
time,Hardware,Voltage,Current
1626374803969,high-voltage-2,14,0.458833
time,Hardware,Voltage,Current
1626374803969,high-voltage-2,15,0.476473
time,Hardware,Voltage,Current
1626374803969,high-voltage-2,16,0.489493
time,Hardware,Voltage,Current
1626374803969,high-voltage-2,17,0.500823
time,Hardware,Voltage,Current
1626374803969,high-voltage-2,18,0.511919
time,Hardware,Voltage,Current
1626374803969,high-voltage-2,19,0.520673
time,Hardware,Voltage,Current
1626374803969,high-voltage-2,20,0.532246
time,Hardware,Voltage,Current
1626374803969,high-voltage-2,25,0.589037
time,Hardware,Voltage,Current
1626374803969,high-voltage-2,30,0.643215
time,Hardware,Voltage,Current
1626374803969,high-voltage-2,35,0.697665
time,Hardware,Voltage,Current
1626374803969,high-voltage-2,40,0.76002
time,Hardware,Voltage,Current
1626374803969,high-voltage-2,45,0.839855
time,Hardware,Voltage,Current
1626374803969,high-voltage-2,50,0.90231
time,Hardware,Voltage,Current
1626374803969,high-voltage-2,55,0.96017
time,Hardware,Voltage,Current
1626374803969,high-voltage-2,60,1.01507
time,Hardware,Voltage,Current
1626374803969,high-voltage-2,65,1.0615
time,Hardware,Voltage,Current
1626374803969,high-voltage-2,70,1.10629
time,Hardware,Voltage,Current
1626374803969,high-voltage-2,75,1.14837
time,Hardware,Voltage,Current
1626374803969,high-voltage-2,80,1.1938
time,Hardware,Voltage,Current
1626374803969,high-voltage-2,85,1.23718
time,Hardware,Voltage,Current
1626374803969,high-voltage-2,90,1.27778
time,Hardware,Voltage,Current
1626374803969,high-voltage-2,95,1.31241
time,Hardware,Voltage,Current
1626374803969,high-voltage-2,100,1.34475
