{
    "Data": [33.0, 45.0, 1.0, 8.0, 14.0, 20.0, 67.0, 161.0, 489.0, 1232.0, 2510.0, 3988.0, 5012.0, 4945.0, 4421.0, 3954.0, 4359.0, 4936.0, 5227.0, 4747.0, 3913.0, 2768.0, 2221.0, 1808.0, 1598.0, 1751.0, 1759.0, 1758.0, 1734.0, 1622.0, 1517.0, 1310.0, 1226.0, 904.0, 820.0, 673.0, 525.0, 397.0, 348.0, 237.0, 215.0, 149.0, 117.0, 101.0, 73.0, 62.0, 58.0, 54.0, 23.0, 24.0, 25.0, 34.0, 26.0, 20.0, 15.0],
    "Name": "NoiseDist-0",
    "Overflow": 158.0,
    "Type": "Histo1d",
    "Underflow": 0.0,
    "x": {
        "AxisTitle": "Noise [e]",
        "Bins": 55,
        "High": 276.0,
        "Low": -2.0
    },
    "y": {
        "AxisTitle": "Number of Pixels"
    },
    "z": {
        "AxisTitle": "z"
    }
}