{
    "Data": [0.0, 0.0, 0.0, 0.0, 0.0, 0.0, 0.0, 0.0, 0.0, 0.0, 0.0, 0.0, 0.0, 0.0, 0.0, 0.0, 0.0, 0.0, 1.0, 0.0, 1.0, 0.0, 2.0, 2.0, 0.0, 2.0, 4.0, 1.0, 9.0, 12.0, 16.0, 17.0, 18.0, 11.0, 29.0, 29.0, 21.0, 110.0, 292.0, 414.0, 247.0, 285.0, 1070.0, 2546.0, 2101.0, 1299.0, 1623.0, 2427.0, 3954.0, 3257.0, 2346.0, 2185.0, 2452.0, 2494.0, 1850.0, 1520.0, 1461.0, 1782.0, 1539.0, 1481.0, 1237.0, 1148.0, 1026.0, 741.0, 611.0, 573.0, 653.0, 568.0, 486.0, 412.0, 386.0, 442.0, 345.0, 295.0, 270.0, 226.0, 248.0, 210.0, 177.0, 155.0, 136.0, 139.0, 127.0, 104.0, 100.0, 87.0, 95.0, 81.0, 72.0, 71.0, 55.0, 69.0, 51.0, 29.0, 40.0, 45.0, 52.0, 43.0, 38.0, 49.0, 33.0, 23.0, 27.0, 28.0, 32.0, 30.0, 27.0, 27.0, 18.0, 18.0, 18.0, 13.0, 9.0, 15.0, 16.0, 18.0, 10.0, 18.0, 14.0, 12.0, 8.0, 12.0, 14.0, 11.0, 14.0, 9.0, 7.0, 9.0, 9.0, 8.0, 5.0, 5.0, 4.0, 4.0, 8.0, 6.0, 9.0, 6.0, 6.0, 7.0, 5.0, 3.0, 4.0, 2.0, 2.0, 0.0, 5.0, 4.0, 5.0, 1.0, 2.0, 4.0, 5.0, 2.0, 4.0, 2.0, 1.0, 2.0, 1.0, 4.0, 5.0, 2.0, 0.0, 0.0, 1.0, 0.0, 3.0, 0.0, 0.0, 1.0, 3.0, 2.0, 6.0, 4.0, 3.0, 4.0, 2.0, 1.0, 2.0, 0.0, 1.0, 3.0, 0.0, 4.0, 3.0, 2.0, 2.0, 2.0, 2.0, 1.0, 2.0, 2.0, 1.0, 2.0, 3.0, 2.0, 1.0, 1.0, 3.0, 1.0, 0.0],
    "Name": "TimePerFitDist-0",
    "Overflow": 263.0,
    "Type": "Histo1d",
    "Underflow": 0.0,
    "x": {
        "AxisTitle": "Fit Time [us]",
        "Bins": 201,
        "High": 401.0,
        "Low": -1.0
    },
    "y": {
        "AxisTitle": "Number of Pixels"
    },
    "z": {
        "AxisTitle": "z"
    }
}