time,Hardware,Voltage,Current
1626604299611,high-voltage-2,1,0.233959
time,Hardware,Voltage,Current
1626604299611,high-voltage-2,2,0.299749
time,Hardware,Voltage,Current
1626604299611,high-voltage-2,3,0.332179
time,Hardware,Voltage,Current
1626604299611,high-voltage-2,4,0.362984
time,Hardware,Voltage,Current
1626604299611,high-voltage-2,5,0.393643
time,Hardware,Voltage,Current
1626604299611,high-voltage-2,6,0.426558
time,Hardware,Voltage,Current
1626604299611,high-voltage-2,7,0.461586
time,Hardware,Voltage,Current
1626604299611,high-voltage-2,8,0.500395
time,Hardware,Voltage,Current
1626604299611,high-voltage-2,9,0.543378
time,Hardware,Voltage,Current
1626604299611,high-voltage-2,10,0.584283
time,Hardware,Voltage,Current
1626604299611,high-voltage-2,11,0.622958
time,Hardware,Voltage,Current
1626604299611,high-voltage-2,12,0.661908
time,Hardware,Voltage,Current
1626604299611,high-voltage-2,13,0.698272
time,Hardware,Voltage,Current
1626604299611,high-voltage-2,14,0.72934
time,Hardware,Voltage,Current
1626604299611,high-voltage-2,15,0.759542
time,Hardware,Voltage,Current
1626604299611,high-voltage-2,16,0.784886
time,Hardware,Voltage,Current
1626604299611,high-voltage-2,17,0.810347
time,Hardware,Voltage,Current
1626604299611,high-voltage-2,18,0.834514
time,Hardware,Voltage,Current
1626604299611,high-voltage-2,19,0.853655
time,Hardware,Voltage,Current
1626604299611,high-voltage-2,20,0.876608
time,Hardware,Voltage,Current
1626604299611,high-voltage-2,25,0.966629
time,Hardware,Voltage,Current
1626604299611,high-voltage-2,30,1.05851
time,Hardware,Voltage,Current
1626604299611,high-voltage-2,35,1.14931
time,Hardware,Voltage,Current
1626604299611,high-voltage-2,40,1.25685
time,Hardware,Voltage,Current
1626604299611,high-voltage-2,45,1.38639
time,Hardware,Voltage,Current
1626604299611,high-voltage-2,50,1.48154
time,Hardware,Voltage,Current
1626604299611,high-voltage-2,55,1.56716
time,Hardware,Voltage,Current
1626604299611,high-voltage-2,60,1.64839
time,Hardware,Voltage,Current
1626604299611,high-voltage-2,65,1.72774
time,Hardware,Voltage,Current
1626604299611,high-voltage-2,70,1.80311
time,Hardware,Voltage,Current
1626604299611,high-voltage-2,75,1.8787
time,Hardware,Voltage,Current
1626604299611,high-voltage-2,80,1.94813
time,Hardware,Voltage,Current
1626604299611,high-voltage-2,85,2.01674
time,Hardware,Voltage,Current
1626604299611,high-voltage-2,90,2.08419
time,Hardware,Voltage,Current
1626604299611,high-voltage-2,95,2.14813
time,Hardware,Voltage,Current
1626604299611,high-voltage-2,100,2.21206
