{
    "Data": [313.0, 1308.0, 213.0, 89.0, 112.0, 105.0, 105.0, 142.0, 135.0, 137.0, 179.0, 274.0, 415.0, 654.0, 950.0, 1228.0, 1558.0, 1879.0, 2252.0, 2328.0, 2364.0, 2238.0, 2003.0, 1829.0, 1576.0, 1503.0, 1489.0, 1667.0, 1803.0, 1787.0, 1679.0, 1449.0, 1146.0, 861.0, 680.0, 494.0, 406.0, 350.0, 314.0, 253.0, 265.0, 251.0, 282.0, 225.0, 230.0, 253.0, 264.0, 234.0, 261.0, 224.0, 231.0, 242.0, 248.0, 235.0, 274.0, 243.0, 248.0, 250.0, 240.0, 225.0, 221.0, 213.0, 242.0, 213.0, 229.0, 220.0, 233.0, 228.0, 221.0, 231.0, 234.0, 186.0, 169.0, 204.0, 154.0, 197.0, 168.0, 189.0, 175.0, 163.0, 170.0, 156.0, 171.0, 151.0, 142.0, 113.0, 113.0, 125.0, 121.0, 119.0, 117.0, 106.0, 115.0, 116.0, 128.0, 100.0, 109.0, 114.0, 89.0, 89.0, 82.0, 98.0, 100.0, 96.0, 85.0, 82.0, 84.0, 74.0, 69.0, 77.0, 68.0, 63.0, 55.0, 65.0, 54.0, 55.0, 58.0, 63.0, 60.0, 60.0, 59.0, 45.0, 37.0, 50.0, 47.0, 41.0, 46.0, 35.0, 63.0, 44.0, 39.0, 46.0, 33.0, 42.0, 34.0, 41.0, 25.0, 34.0, 32.0, 36.0, 28.0, 35.0, 25.0, 26.0, 24.0, 29.0, 27.0, 18.0, 27.0, 12.0, 21.0, 23.0, 15.0, 12.0, 12.0, 19.0, 8.0, 13.0, 16.0, 11.0, 9.0, 10.0, 12.0, 12.0, 8.0, 14.0, 8.0, 8.0, 12.0, 14.0, 15.0, 7.0, 12.0, 7.0, 5.0, 10.0, 5.0, 12.0, 7.0, 6.0, 12.0, 9.0, 4.0, 2.0, 3.0, 4.0, 3.0, 6.0, 3.0, 5.0, 5.0, 3.0, 1.0, 6.0, 8.0, 2.0, 4.0, 3.0, 7.0, 2.0, 4.0, 1.0, 4.0, 3.0, 2.0, 4.0, 6.0, 3.0, 3.0, 1.0, 6.0, 2.0, 0.0, 1.0, 4.0, 2.0, 5.0, 1.0, 0.0],
    "Name": "NoiseDist-0",
    "Overflow": 277.0,
    "Type": "Histo1d",
    "Underflow": 0.0,
    "x": {
        "AxisTitle": "Noise [e]",
        "Bins": 219,
        "High": 1096.0,
        "Low": -2.0
    },
    "y": {
        "AxisTitle": "Number of Pixels"
    },
    "z": {
        "AxisTitle": "z"
    }
}