{
    "Data": [0.0, 0.0, 0.0, 0.0, 0.0, 0.0, 0.0, 0.0, 0.0, 0.0, 0.0, 0.0, 0.0, 0.0, 1.0, 0.0, 1.0, 1.0, 2.0, 0.0, 0.0, 1.0, 1.0, 0.0, 0.0, 0.0, 5.0, 9.0, 8.0, 6.0, 23.0, 23.0, 10.0, 17.0, 35.0, 51.0, 38.0, 317.0, 453.0, 455.0, 332.0, 869.0, 2097.0, 2833.0, 2021.0, 1438.0, 2851.0, 3280.0, 3646.0, 2773.0, 2480.0, 2480.0, 2462.0, 2000.0, 1642.0, 1685.0, 1582.0, 1615.0, 1351.0, 1299.0, 1043.0, 987.0, 794.0, 598.0, 569.0, 520.0, 505.0, 457.0, 401.0, 342.0, 322.0, 284.0, 290.0, 208.0, 193.0, 189.0, 180.0, 182.0, 133.0, 129.0, 124.0, 104.0, 104.0, 85.0, 68.0, 67.0, 49.0, 57.0, 55.0, 50.0, 56.0, 56.0, 32.0, 24.0, 36.0, 22.0, 31.0, 34.0, 26.0, 17.0, 21.0, 20.0, 13.0, 15.0, 15.0, 14.0, 13.0, 14.0, 8.0, 11.0, 7.0, 13.0, 3.0, 7.0, 11.0, 1.0, 7.0, 9.0, 8.0, 6.0, 12.0, 8.0, 5.0, 2.0, 0.0, 3.0, 4.0, 2.0, 3.0, 5.0, 9.0, 9.0, 5.0, 4.0, 3.0, 2.0, 3.0, 1.0, 1.0, 5.0, 2.0, 3.0, 4.0, 1.0, 2.0, 1.0, 1.0, 2.0, 2.0, 0.0, 0.0, 1.0, 0.0, 0.0, 0.0, 1.0, 3.0, 2.0, 1.0, 0.0, 2.0, 0.0, 0.0, 1.0, 0.0, 0.0, 1.0, 0.0, 2.0, 0.0, 1.0, 1.0, 0.0, 0.0, 0.0, 0.0, 0.0, 0.0, 1.0, 0.0, 0.0, 0.0, 0.0, 0.0, 0.0, 0.0, 0.0, 0.0, 0.0, 1.0, 0.0, 0.0, 0.0, 0.0, 0.0, 1.0, 0.0, 0.0, 0.0, 0.0, 0.0],
    "Name": "TimePerFitDist-0",
    "Overflow": 57.0,
    "Type": "Histo1d",
    "Underflow": 0.0,
    "x": {
        "AxisTitle": "Fit Time [us]",
        "Bins": 201,
        "High": 401.0,
        "Low": -1.0
    },
    "y": {
        "AxisTitle": "Number of Pixels"
    },
    "z": {
        "AxisTitle": "z"
    }
}