{
    "Data": [0.0, 0.0, 0.0, 0.0, 0.0, 0.0, 0.0, 0.0, 0.0, 0.0, 0.0, 0.0, 0.0, 0.0, 0.0, 0.0, 0.0, 0.0, 0.0, 0.0, 0.0, 0.0, 0.0, 0.0, 0.0, 0.0, 0.0, 0.0, 0.0, 0.0, 0.0, 0.0, 0.0, 0.0, 0.0, 0.0, 0.0, 0.0, 0.0, 0.0, 0.0, 0.0, 0.0, 0.0, 0.0, 0.0, 0.0, 0.0, 0.0, 0.0, 38.0, 76.0, 96.0, 108.0, 132.0, 133.0, 126.0, 220.0, 201.0, 213.0, 276.0, 317.0, 361.0, 415.0, 421.0, 510.0, 557.0, 588.0, 641.0, 708.0, 756.0, 754.0, 800.0, 860.0, 902.0, 849.0, 951.0, 952.0, 901.0, 928.0, 886.0, 900.0, 921.0, 889.0, 849.0, 950.0, 1009.0, 1150.0, 1355.0, 1683.0, 2072.0, 2417.0, 2812.0, 3035.0, 3096.0, 2823.0, 2427.0, 2023.0, 1496.0, 1030.0, 771.0, 502.0, 406.0, 270.0, 157.0, 111.0, 106.0, 74.0, 57.0, 37.0, 29.0, 32.0, 27.0, 35.0, 18.0, 14.0, 17.0, 20.0, 12.0, 15.0, 17.0, 14.0, 12.0, 18.0, 7.0, 10.0, 8.0, 7.0, 14.0, 12.0, 6.0, 3.0, 8.0, 5.0, 5.0, 3.0, 5.0, 7.0, 8.0, 7.0, 3.0, 6.0, 4.0, 5.0, 1.0, 3.0, 1.0, 2.0, 1.0, 4.0, 1.0, 1.0, 2.0, 3.0, 5.0, 1.0, 2.0, 1.0, 5.0, 4.0, 9.0, 4.0, 6.0, 3.0, 7.0, 11.0, 14.0, 19.0, 17.0, 36.0, 42.0, 46.0, 58.0, 54.0, 82.0, 102.0, 127.0, 138.0, 200.0, 199.0, 270.0, 315.0, 328.0, 387.0, 440.0, 498.0, 497.0, 565.0, 596.0, 648.0, 684.0, 746.0, 815.0, 800.0, 847.0, 822.0, 863.0, 892.0, 886.0, 904.0, 808.0, 834.0, 822.0, 835.0, 705.0, 722.0, 666.0, 661.0, 517.0, 518.0, 446.0, 427.0, 347.0, 312.0, 288.0, 266.0, 238.0, 204.0, 177.0, 131.0, 121.0, 112.0, 90.0, 81.0, 66.0, 58.0, 37.0, 24.0, 17.0, 28.0, 17.0, 14.0, 9.0, 4.0, 7.0, 4.0, 4.0, 4.0, 1.0, 1.0, 2.0, 0.0, 0.0, 0.0, 0.0, 1.0, 0.0, 0.0, 0.0, 0.0, 1.0, 0.0, 0.0, 0.0, 0.0, 0.0, 0.0, 0.0, 0.0, 0.0, 0.0, 0.0, 0.0, 0.0, 1.0, 0.0, 1.0, 1.0, 0.0, 0.0, 0.0, 0.0, 0.0, 1.0, 0.0, 0.0, 0.0, 0.0, 0.0, 0.0, 0.0, 0.0, 0.0, 0.0, 0.0, 0.0, 0.0, 1.0, 0.0, 0.0, 0.0, 0.0, 0.0, 0.0, 0.0, 0.0, 0.0, 0.0, 0.0, 0.0, 0.0, 0.0, 0.0, 0.0, 0.0, 0.0, 0.0, 0.0, 0.0, 0.0, 0.0, 0.0, 0.0, 0.0, 0.0, 0.0, 0.0, 0.0, 0.0, 0.0, 0.0, 0.0, 0.0, 0.0, 0.0, 0.0, 0.0, 0.0, 0.0, 0.0, 0.0, 0.0, 0.0, 0.0, 0.0, 0.0, 0.0, 0.0, 0.0, 0.0, 0.0, 0.0, 0.0, 0.0, 0.0, 0.0, 0.0, 0.0, 0.0, 0.0, 0.0, 0.0, 0.0, 0.0, 0.0, 0.0, 0.0, 0.0, 0.0, 0.0, 0.0, 0.0, 0.0, 0.0, 0.0, 0.0, 0.0, 0.0, 0.0, 0.0, 0.0, 0.0, 0.0, 0.0, 0.0, 0.0, 0.0, 0.0, 0.0, 0.0, 0.0, 0.0, 0.0, 0.0, 0.0, 0.0, 0.0, 0.0],
    "Name": "ThresholdDist-0",
    "Overflow": 0.0,
    "Type": "Histo1d",
    "Underflow": 0.0,
    "x": {
        "AxisTitle": "Threshold [e]",
        "Bins": 388,
        "High": 3875.0,
        "Low": -5.0
    },
    "y": {
        "AxisTitle": "Number of Pixels"
    },
    "z": {
        "AxisTitle": "z"
    }
}