{
    "Data": [0.0, 0.0, 0.0, 0.0, 0.0, 0.0, 0.0, 0.0, 0.0, 0.0, 0.0, 0.0, 1.0, 0.0, 0.0, 0.0, 4.0, 5.0, 2.0, 2.0, 13.0, 9.0, 0.0, 30.0, 1.0, 8.0, 35.0, 23.0, 21.0, 33.0, 3.0, 43.0, 15.0, 49.0, 18.0, 50.0, 50.0, 37.0, 22.0, 6.0, 1.0, 50.0, 11.0, 44.0, 50.0, 2.0, 8.0, 23.0, 50.0, 10.0, 37.0],
    "Name": "Scurve-120-96",
    "Overflow": 0.0,
    "Type": "Histo1d",
    "Underflow": 0.0,
    "x": {
        "AxisTitle": "Vcal",
        "Bins": 51,
        "High": 302.5,
        "Low": 47.5
    },
    "y": {
        "AxisTitle": "Occupancy"
    },
    "z": {
        "AxisTitle": "z"
    }
}