time,Hardware,Voltage,Current
1623308551145,high-voltage,1,0.0578147
time,Hardware,Voltage,Current
1623308551145,high-voltage,2,0.0706305
time,Hardware,Voltage,Current
1623308551145,high-voltage,3,0.0827926
time,Hardware,Voltage,Current
1623308551145,high-voltage,4,0.0913063
time,Hardware,Voltage,Current
1623308551145,high-voltage,5,0.1018
time,Hardware,Voltage,Current
1623308551145,high-voltage,6,0.112434
time,Hardware,Voltage,Current
1623308551145,high-voltage,7,0.121078
time,Hardware,Voltage,Current
1623308551145,high-voltage,8,0.132065
time,Hardware,Voltage,Current
1623308551145,high-voltage,9,0.141198
time,Hardware,Voltage,Current
1623308551145,high-voltage,10,0.151047
time,Hardware,Voltage,Current
1623308551145,high-voltage,11,0.161974
time,Hardware,Voltage,Current
1623308551145,high-voltage,12,0.169935
time,Hardware,Voltage,Current
1623308551145,high-voltage,13,0.179786
time,Hardware,Voltage,Current
1623308551145,high-voltage,14,0.186014
time,Hardware,Voltage,Current
1623308551145,high-voltage,15,0.193057
time,Hardware,Voltage,Current
1623308551145,high-voltage,16,0.198842
time,Hardware,Voltage,Current
1623308551145,high-voltage,17,0.204173
time,Hardware,Voltage,Current
1623308551145,high-voltage,18,0.210724
time,Hardware,Voltage,Current
1623308551145,high-voltage,19,0.21463
time,Hardware,Voltage,Current
1623308551145,high-voltage,20,0.219915
time,Hardware,Voltage,Current
1623308551145,high-voltage,25,0.243812
time,Hardware,Voltage,Current
1623308551145,high-voltage,30,0.277885
time,Hardware,Voltage,Current
1623308551145,high-voltage,35,0.385266
time,Hardware,Voltage,Current
1623308551145,high-voltage,7.03841e-07,0.703934
time,Hardware,Voltage,Current
1623308551145,high-voltage,45,1.25541
time,Hardware,Voltage,Current
1623308551145,high-voltage,50,1.97676
time,Hardware,Voltage,Current
1623308551145,high-voltage,55,2.84917
time,Hardware,Voltage,Current
1623308551145,high-voltage,3.8717e-06,3.87327
time,Hardware,Voltage,Current
1623308551145,high-voltage,65,5.04754
time,Hardware,Voltage,Current
1623308551145,high-voltage,70,6.39168
time,Hardware,Voltage,Current
1623308551145,high-voltage,75,7.91902
time,Hardware,Voltage,Current
1623308551145,high-voltage,9.66615e-06,9.66497
time,Hardware,Voltage,Current
1623308551145,high-voltage,85,10
