time,Hardware,Voltage,Current
1621988943534,high-voltage,1,0.0638755
time,Hardware,Voltage,Current
1621988943534,high-voltage,2,0.141841
time,Hardware,Voltage,Current
1621988943534,high-voltage,3,0.259477
time,Hardware,Voltage,Current
1621988943534,high-voltage,4,0.418436
time,Hardware,Voltage,Current
1621988943534,high-voltage,5,0.631496
time,Hardware,Voltage,Current
1621988943534,high-voltage,6,0.904135
time,Hardware,Voltage,Current
1621988943534,high-voltage,7,1.28168
time,Hardware,Voltage,Current
1621988943534,high-voltage,8,1.74265
time,Hardware,Voltage,Current
1621988943534,high-voltage,9,2.21634
time,Hardware,Voltage,Current
1621988943534,high-voltage,10,2.90137
time,Hardware,Voltage,Current
1621988943534,high-voltage,11,3.58798
time,Hardware,Voltage,Current
1621988943534,high-voltage,12,4.60947
time,Hardware,Voltage,Current
1621988943534,high-voltage,13,5.72629
time,Hardware,Voltage,Current
1621988943534,high-voltage,14,6.8559
time,Hardware,Voltage,Current
1621988943534,high-voltage,15,8.17484
time,Hardware,Voltage,Current
1621988943534,high-voltage,16,9.3197
time,Hardware,Voltage,Current
1621988943534,high-voltage,17,9.98036
