time,Hardware,Voltage,Current
1625783132531,high-voltage-3,1,0.0548637
time,Hardware,Voltage,Current
1625783132531,high-voltage-3,2,0.062311
time,Hardware,Voltage,Current
1625783132531,high-voltage-3,3,0.0662819
time,Hardware,Voltage,Current
1625783132531,high-voltage-3,4,0.0697443
time,Hardware,Voltage,Current
1625783132531,high-voltage-3,5,0.0730596
time,Hardware,Voltage,Current
1625783132531,high-voltage-3,6,0.0740504
time,Hardware,Voltage,Current
1625783132531,high-voltage-3,7,0.0760673
time,Hardware,Voltage,Current
1625783132531,high-voltage-3,8,0.0795333
time,Hardware,Voltage,Current
1625783132531,high-voltage-3,9,0.0817805
time,Hardware,Voltage,Current
1625783132531,high-voltage-3,10,0.0851257
time,Hardware,Voltage,Current
1625783132531,high-voltage-3,11,0.0886476
time,Hardware,Voltage,Current
1625783132531,high-voltage-3,12,0.0925008
time,Hardware,Voltage,Current
1625783132531,high-voltage-3,13,0.0951246
time,Hardware,Voltage,Current
1625783132531,high-voltage-3,14,0.0974623
time,Hardware,Voltage,Current
1625783132531,high-voltage-3,15,0.0987269
time,Hardware,Voltage,Current
1625783132531,high-voltage-3,16,0.101708
time,Hardware,Voltage,Current
1625783132531,high-voltage-3,17,0.102957
time,Hardware,Voltage,Current
1625783132531,high-voltage-3,18,0.105213
time,Hardware,Voltage,Current
1625783132531,high-voltage-3,19,0.108442
time,Hardware,Voltage,Current
1625783132531,high-voltage-3,20,0.110686
time,Hardware,Voltage,Current
1625783132531,high-voltage-3,25,0.120069
time,Hardware,Voltage,Current
1625783132531,high-voltage-3,30,0.128417
time,Hardware,Voltage,Current
1625783132531,high-voltage-3,35,0.137851
time,Hardware,Voltage,Current
1625783132531,high-voltage-3,40,0.146085
time,Hardware,Voltage,Current
1625783132531,high-voltage-3,45,0.154086
time,Hardware,Voltage,Current
1625783132531,high-voltage-3,50,0.164123
time,Hardware,Voltage,Current
1625783132531,high-voltage-3,55,0.174591
time,Hardware,Voltage,Current
1625783132531,high-voltage-3,60,0.184135
time,Hardware,Voltage,Current
1625783132531,high-voltage-3,65,0.194457
time,Hardware,Voltage,Current
1625783132531,high-voltage-3,70,0.203312
time,Hardware,Voltage,Current
1625783132531,high-voltage-3,75,0.212985
time,Hardware,Voltage,Current
1625783132531,high-voltage-3,80,0.2221
time,Hardware,Voltage,Current
1625783132531,high-voltage-3,85,0.231811
time,Hardware,Voltage,Current
1625783132531,high-voltage-3,90,0.242793
time,Hardware,Voltage,Current
1625783132531,high-voltage-3,95,0.252597
time,Hardware,Voltage,Current
1625783132531,high-voltage-3,100,0.262802
