{
    "Data": [0.0, 0.0, 0.0, 0.0, 0.0, 0.0, 0.0, 0.0, 0.0, 0.0, 0.0, 0.0, 0.0, 0.0, 0.0, 0.0, 0.0, 0.0, 0.0, 0.0, 0.0, 0.0, 0.0, 0.0, 0.0, 0.0, 0.0, 0.0, 0.0, 0.0, 0.0, 0.0, 0.0, 0.0, 0.0, 0.0, 0.0, 0.0, 0.0, 0.0, 0.0, 0.0, 0.0, 0.0, 0.0, 0.0, 0.0, 0.0, 0.0, 0.0, 24.0, 46.0, 64.0, 89.0, 99.0, 103.0, 133.0, 129.0, 155.0, 168.0, 184.0, 248.0, 247.0, 261.0, 310.0, 328.0, 351.0, 403.0, 455.0, 463.0, 572.0, 571.0, 596.0, 629.0, 704.0, 714.0, 659.0, 832.0, 823.0, 863.0, 896.0, 943.0, 1102.0, 1227.0, 1459.0, 1691.0, 2157.0, 2404.0, 2689.0, 2858.0, 3006.0, 2830.0, 2644.0, 2435.0, 2137.0, 1758.0, 1433.0, 1194.0, 946.0, 733.0, 596.0, 505.0, 412.0, 334.0, 280.0, 256.0, 201.0, 166.0, 120.0, 122.0, 108.0, 90.0, 88.0, 61.0, 55.0, 63.0, 48.0, 37.0, 32.0, 27.0, 23.0, 26.0, 28.0, 13.0, 19.0, 14.0, 11.0, 22.0, 20.0, 14.0, 13.0, 11.0, 15.0, 14.0, 14.0, 4.0, 11.0, 16.0, 4.0, 5.0, 6.0, 6.0, 5.0, 5.0, 4.0, 6.0, 5.0, 3.0, 4.0, 1.0, 1.0, 5.0, 6.0, 5.0, 3.0, 4.0, 7.0, 12.0, 3.0, 15.0, 12.0, 19.0, 15.0, 17.0, 17.0, 27.0, 22.0, 35.0, 53.0, 52.0, 63.0, 86.0, 103.0, 106.0, 101.0, 148.0, 173.0, 211.0, 195.0, 234.0, 235.0, 293.0, 304.0, 366.0, 389.0, 425.0, 507.0, 490.0, 545.0, 563.0, 597.0, 686.0, 692.0, 751.0, 741.0, 752.0, 774.0, 822.0, 817.0, 821.0, 776.0, 795.0, 814.0, 801.0, 733.0, 734.0, 635.0, 632.0, 569.0, 555.0, 506.0, 477.0, 438.0, 371.0, 341.0, 289.0, 259.0, 220.0, 179.0, 183.0, 151.0, 136.0, 94.0, 103.0, 80.0, 62.0, 48.0, 47.0, 44.0, 27.0, 23.0, 11.0, 17.0, 10.0, 11.0, 7.0, 4.0, 2.0, 3.0, 3.0, 0.0, 2.0, 1.0, 1.0, 0.0, 0.0, 0.0, 0.0, 0.0, 1.0, 0.0, 0.0, 0.0, 0.0, 1.0, 0.0, 0.0, 0.0, 0.0, 1.0, 0.0, 0.0, 0.0, 0.0, 0.0, 0.0, 1.0, 0.0, 0.0, 0.0, 0.0, 0.0, 0.0, 0.0, 0.0, 0.0, 0.0, 0.0, 0.0, 1.0, 0.0, 0.0, 0.0, 0.0, 0.0, 0.0, 0.0, 0.0, 0.0, 0.0, 0.0, 0.0, 0.0, 0.0, 0.0, 0.0, 0.0, 0.0, 0.0, 0.0, 0.0, 0.0, 0.0, 0.0, 0.0, 0.0, 0.0, 0.0, 0.0, 0.0, 0.0, 0.0, 0.0, 0.0, 0.0, 0.0, 0.0, 0.0, 0.0, 0.0, 0.0, 0.0, 0.0, 0.0, 0.0, 0.0, 0.0, 0.0, 0.0, 0.0, 0.0, 0.0, 0.0, 0.0, 0.0, 0.0, 0.0, 0.0, 0.0, 0.0, 0.0, 0.0, 0.0, 0.0, 0.0, 0.0, 0.0, 0.0, 0.0, 0.0, 0.0, 0.0, 0.0, 0.0, 0.0, 0.0, 0.0, 0.0, 0.0, 0.0, 0.0, 0.0, 0.0, 0.0, 0.0, 0.0, 0.0, 0.0, 0.0, 0.0, 0.0, 0.0, 0.0, 0.0, 0.0, 0.0, 0.0, 0.0, 0.0, 0.0, 0.0, 0.0, 0.0, 0.0, 0.0, 0.0, 0.0, 0.0],
    "Name": "ThresholdDist-0",
    "Overflow": 0.0,
    "Type": "Histo1d",
    "Underflow": 0.0,
    "x": {
        "AxisTitle": "Threshold [e]",
        "Bins": 388,
        "High": 3875.0,
        "Low": -5.0
    },
    "y": {
        "AxisTitle": "Number of Pixels"
    },
    "z": {
        "AxisTitle": "z"
    }
}