{
    "Data": [0.0, 0.0, 0.0, 0.0, 0.0, 0.0, 0.0, 0.0, 0.0, 0.0, 0.0, 0.0, 0.0, 0.0, 0.0, 0.0, 0.0, 0.0, 0.0, 0.0, 0.0, 0.0, 0.0, 0.0, 0.0, 0.0, 0.0, 0.0, 0.0, 0.0, 0.0, 0.0, 0.0, 0.0, 0.0, 0.0, 0.0, 0.0, 0.0, 0.0, 0.0, 0.0, 0.0, 0.0, 0.0, 0.0, 0.0, 0.0, 0.0, 0.0, 8.0, 22.0, 18.0, 25.0, 32.0, 36.0, 46.0, 61.0, 54.0, 82.0, 86.0, 100.0, 146.0, 152.0, 183.0, 188.0, 216.0, 266.0, 285.0, 328.0, 369.0, 412.0, 449.0, 510.0, 551.0, 634.0, 667.0, 746.0, 768.0, 811.0, 877.0, 851.0, 914.0, 973.0, 1123.0, 1281.0, 1447.0, 1727.0, 2094.0, 2490.0, 2807.0, 3083.0, 3166.0, 3123.0, 2888.0, 2702.0, 2268.0, 1937.0, 1581.0, 1213.0, 980.0, 741.0, 555.0, 466.0, 360.0, 293.0, 247.0, 216.0, 174.0, 138.0, 120.0, 98.0, 82.0, 74.0, 54.0, 48.0, 47.0, 26.0, 37.0, 38.0, 34.0, 21.0, 22.0, 22.0, 21.0, 9.0, 18.0, 14.0, 13.0, 14.0, 12.0, 9.0, 18.0, 13.0, 14.0, 17.0, 12.0, 1.0, 8.0, 8.0, 3.0, 7.0, 10.0, 13.0, 9.0, 17.0, 17.0, 13.0, 17.0, 23.0, 24.0, 30.0, 35.0, 53.0, 65.0, 73.0, 79.0, 101.0, 113.0, 155.0, 167.0, 184.0, 218.0, 232.0, 285.0, 325.0, 373.0, 394.0, 417.0, 497.0, 543.0, 557.0, 611.0, 622.0, 719.0, 718.0, 719.0, 810.0, 798.0, 815.0, 849.0, 850.0, 827.0, 794.0, 793.0, 758.0, 741.0, 737.0, 682.0, 679.0, 653.0, 588.0, 566.0, 517.0, 438.0, 385.0, 360.0, 324.0, 289.0, 275.0, 237.0, 205.0, 168.0, 163.0, 126.0, 138.0, 99.0, 61.0, 83.0, 60.0, 47.0, 44.0, 33.0, 22.0, 16.0, 14.0, 11.0, 11.0, 5.0, 8.0, 4.0, 2.0, 3.0, 2.0, 1.0, 0.0, 0.0, 1.0, 0.0, 0.0, 0.0, 0.0, 0.0, 0.0, 0.0, 0.0, 0.0, 0.0, 0.0, 1.0, 0.0, 1.0, 0.0, 0.0, 0.0, 0.0, 0.0, 0.0, 0.0, 0.0, 0.0, 0.0, 0.0, 0.0, 0.0, 0.0, 0.0, 0.0, 0.0, 0.0, 0.0, 0.0, 0.0, 0.0, 0.0, 0.0, 0.0, 0.0, 0.0, 0.0, 0.0, 0.0, 0.0, 0.0, 0.0, 0.0, 0.0, 0.0, 0.0, 0.0, 0.0, 0.0, 0.0, 0.0, 0.0, 0.0, 0.0, 0.0, 0.0, 0.0, 0.0, 0.0, 0.0, 0.0, 0.0, 0.0, 0.0, 0.0, 0.0, 0.0, 0.0, 0.0, 0.0, 0.0, 0.0, 0.0, 0.0, 0.0, 0.0, 0.0, 0.0, 0.0, 0.0, 0.0, 0.0, 0.0, 0.0, 0.0, 0.0, 0.0, 0.0, 0.0, 0.0, 0.0, 0.0, 0.0, 0.0, 0.0, 0.0, 0.0, 0.0, 0.0, 0.0, 0.0, 0.0, 0.0, 0.0, 0.0, 0.0],
    "Name": "ThresholdDist-0",
    "Overflow": 0.0,
    "Type": "Histo1d",
    "Underflow": 0.0,
    "x": {
        "AxisTitle": "Threshold [e]",
        "Bins": 339,
        "High": 3385.0,
        "Low": -5.0
    },
    "y": {
        "AxisTitle": "Number of Pixels"
    },
    "z": {
        "AxisTitle": "z"
    }
}