{
    "Data": [0.0, 0.0, 0.0, 0.0, 0.0, 0.0, 0.0, 0.0, 0.0, 0.0, 0.0, 0.0, 0.0, 0.0, 0.0, 0.0, 0.0, 0.0, 0.0, 0.0, 0.0, 0.0, 0.0, 0.0, 0.0, 0.0, 0.0, 0.0, 0.0, 0.0, 0.0, 0.0, 0.0, 0.0, 0.0, 0.0, 0.0, 0.0, 0.0, 0.0, 0.0, 0.0, 0.0, 0.0, 0.0, 0.0, 0.0, 0.0, 0.0, 0.0, 53.0, 97.0, 126.0, 135.0, 148.0, 183.0, 209.0, 231.0, 255.0, 298.0, 339.0, 387.0, 386.0, 433.0, 492.0, 537.0, 572.0, 599.0, 733.0, 710.0, 706.0, 803.0, 803.0, 794.0, 888.0, 856.0, 875.0, 879.0, 815.0, 860.0, 890.0, 887.0, 882.0, 853.0, 912.0, 957.0, 1114.0, 1320.0, 1603.0, 2002.0, 2233.0, 2589.0, 2938.0, 2953.0, 2815.0, 2503.0, 2105.0, 1708.0, 1265.0, 916.0, 686.0, 461.0, 377.0, 197.0, 172.0, 103.0, 83.0, 65.0, 64.0, 36.0, 38.0, 37.0, 33.0, 21.0, 24.0, 27.0, 23.0, 11.0, 14.0, 13.0, 15.0, 6.0, 21.0, 11.0, 10.0, 13.0, 8.0, 16.0, 11.0, 7.0, 6.0, 6.0, 4.0, 7.0, 6.0, 7.0, 6.0, 6.0, 9.0, 4.0, 1.0, 6.0, 4.0, 7.0, 2.0, 2.0, 4.0, 0.0, 2.0, 1.0, 5.0, 1.0, 8.0, 6.0, 7.0, 2.0, 6.0, 8.0, 10.0, 19.0, 22.0, 33.0, 36.0, 43.0, 57.0, 64.0, 87.0, 114.0, 136.0, 165.0, 183.0, 229.0, 309.0, 355.0, 378.0, 424.0, 474.0, 561.0, 578.0, 671.0, 722.0, 744.0, 807.0, 816.0, 876.0, 939.0, 954.0, 916.0, 933.0, 1024.0, 923.0, 918.0, 898.0, 810.0, 868.0, 707.0, 656.0, 655.0, 568.0, 575.0, 458.0, 399.0, 377.0, 350.0, 279.0, 221.0, 205.0, 194.0, 152.0, 137.0, 127.0, 92.0, 62.0, 74.0, 48.0, 40.0, 34.0, 24.0, 14.0, 16.0, 8.0, 10.0, 2.0, 1.0, 5.0, 4.0, 1.0, 0.0, 0.0, 0.0, 0.0, 0.0, 0.0, 0.0, 1.0, 0.0, 0.0, 0.0, 0.0, 0.0, 0.0, 1.0, 0.0, 0.0, 0.0, 0.0, 0.0, 0.0, 1.0, 0.0, 0.0, 0.0, 0.0, 0.0, 0.0, 0.0, 0.0, 0.0, 0.0, 0.0, 0.0, 0.0, 0.0, 0.0, 0.0, 0.0, 0.0, 0.0, 0.0, 0.0, 0.0, 0.0, 0.0, 0.0, 0.0, 0.0, 1.0, 0.0, 1.0, 0.0, 0.0, 0.0, 0.0, 0.0, 0.0, 0.0, 0.0, 0.0, 0.0, 0.0, 0.0, 0.0, 0.0, 0.0, 0.0, 0.0, 0.0, 0.0, 0.0, 0.0, 0.0, 0.0, 0.0, 0.0, 0.0, 0.0, 0.0, 0.0, 0.0, 0.0, 0.0, 0.0, 0.0, 0.0, 0.0, 0.0, 0.0, 0.0, 0.0, 0.0, 0.0, 0.0, 0.0, 0.0, 0.0, 0.0, 0.0, 0.0, 0.0, 0.0, 0.0, 0.0, 0.0, 0.0, 0.0, 0.0, 0.0, 0.0, 0.0, 0.0, 0.0, 0.0, 0.0, 0.0, 0.0, 0.0, 0.0, 0.0, 0.0, 0.0, 0.0, 0.0, 0.0, 0.0, 0.0, 0.0, 0.0, 0.0, 0.0, 0.0, 0.0, 0.0, 0.0, 0.0],
    "Name": "ThresholdDist-0",
    "Overflow": 0.0,
    "Type": "Histo1d",
    "Underflow": 0.0,
    "x": {
        "AxisTitle": "Threshold [e]",
        "Bins": 364,
        "High": 3635.0,
        "Low": -5.0
    },
    "y": {
        "AxisTitle": "Number of Pixels"
    },
    "z": {
        "AxisTitle": "z"
    }
}