{
    "Data": [275.0, 12435.0, 21264.0, 13570.0, 6411.0, 3501.0, 2929.0, 3024.0, 2921.0, 2468.0, 2019.0, 1645.0, 1124.0, 715.0, 566.0, 378.0, 255.0, 224.0, 161.0, 137.0, 118.0, 99.0, 132.0, 98.0, 101.0, 91.0, 87.0, 108.0, 69.0, 82.0, 75.0, 65.0, 62.0, 49.0, 63.0, 52.0, 42.0, 37.0, 39.0, 42.0, 33.0, 30.0, 27.0, 17.0, 11.0, 22.0, 31.0, 26.0, 14.0, 7.0, 6.0],
    "Name": "Chi2Dist-0",
    "Overflow": 0.0,
    "Type": "Histo1d",
    "Underflow": 0.0,
    "x": {
        "AxisTitle": "Fit Chi/ndf",
        "Bins": 51,
        "High": 2.5250000953674318,
        "Low": -0.02500000037252903
    },
    "y": {
        "AxisTitle": "Number of Pixels"
    },
    "z": {
        "AxisTitle": "z"
    }
}