{
    "Data": [0.0, 0.0, 0.0, 0.0, 0.0, 0.0, 0.0, 0.0, 0.0, 0.0, 0.0, 0.0, 0.0, 0.0, 0.0, 0.0, 0.0, 0.0, 0.0, 0.0, 0.0, 0.0, 0.0, 0.0, 0.0, 0.0, 0.0, 0.0, 0.0, 0.0, 0.0, 0.0, 0.0, 0.0, 0.0, 0.0, 0.0, 0.0, 0.0, 0.0, 0.0, 0.0, 0.0, 0.0, 0.0, 0.0, 0.0, 0.0, 0.0, 0.0, 3.0, 7.0, 11.0, 5.0, 4.0, 8.0, 5.0, 12.0, 3.0, 6.0, 7.0, 6.0, 7.0, 6.0, 9.0, 17.0, 8.0, 22.0, 19.0, 24.0, 15.0, 28.0, 33.0, 39.0, 33.0, 66.0, 51.0, 75.0, 77.0, 86.0, 121.0, 129.0, 161.0, 196.0, 242.0, 290.0, 346.0, 413.0, 525.0, 722.0, 1044.0, 1576.0, 2268.0, 3042.0, 3601.0, 4018.0, 4181.0, 3977.0, 3466.0, 3041.0, 2324.0, 1873.0, 1514.0, 1270.0, 1131.0, 972.0, 947.0, 915.0, 782.0, 775.0, 650.0, 593.0, 536.0, 468.0, 443.0, 361.0, 333.0, 249.0, 216.0, 210.0, 148.0, 121.0, 122.0, 96.0, 83.0, 64.0, 63.0, 54.0, 43.0, 37.0, 36.0, 41.0, 28.0, 32.0, 26.0, 25.0, 14.0, 21.0, 20.0, 18.0, 18.0, 10.0, 17.0, 14.0, 16.0, 23.0, 7.0, 14.0, 16.0, 6.0, 10.0, 8.0, 6.0, 10.0, 7.0, 7.0, 11.0, 11.0, 9.0, 9.0, 8.0, 8.0, 13.0, 11.0, 9.0, 7.0, 12.0, 11.0, 19.0, 22.0, 30.0, 36.0, 40.0, 57.0, 61.0, 81.0, 97.0, 118.0, 142.0, 174.0, 179.0, 255.0, 273.0, 352.0, 388.0, 463.0, 527.0, 509.0, 556.0, 634.0, 661.0, 781.0, 815.0, 841.0, 866.0, 848.0, 965.0, 918.0, 923.0, 953.0, 936.0, 863.0, 817.0, 829.0, 775.0, 745.0, 705.0, 615.0, 561.0, 540.0, 496.0, 447.0, 350.0, 359.0, 342.0, 269.0, 234.0, 183.0, 155.0, 149.0, 109.0, 107.0, 79.0, 75.0, 54.0, 53.0, 37.0, 31.0, 27.0, 26.0, 16.0, 5.0, 16.0, 4.0, 3.0, 7.0, 5.0, 4.0, 2.0, 2.0, 3.0, 1.0, 1.0, 0.0, 0.0, 0.0, 0.0, 0.0, 0.0, 2.0, 0.0, 0.0, 0.0, 0.0, 0.0, 1.0, 0.0, 0.0, 1.0, 0.0, 0.0, 1.0, 0.0, 0.0, 0.0, 0.0, 0.0, 0.0, 0.0, 0.0, 0.0, 0.0, 0.0, 0.0, 0.0, 0.0, 0.0, 0.0, 0.0, 0.0, 1.0, 0.0, 0.0, 1.0, 0.0, 0.0, 0.0, 0.0, 0.0, 0.0, 0.0, 0.0, 0.0, 0.0, 0.0, 0.0, 0.0, 0.0, 0.0, 0.0, 0.0, 0.0, 0.0, 0.0, 0.0, 0.0, 0.0, 0.0, 0.0, 0.0, 0.0, 0.0, 0.0, 0.0, 0.0, 0.0, 0.0, 0.0, 0.0, 0.0, 0.0, 0.0, 0.0, 0.0, 0.0, 0.0, 0.0, 0.0, 0.0, 0.0, 0.0, 0.0, 0.0, 0.0, 0.0, 0.0, 0.0, 0.0, 0.0, 0.0, 0.0, 0.0, 0.0, 0.0, 0.0, 0.0, 0.0, 0.0, 0.0, 0.0, 0.0, 0.0, 0.0, 0.0, 0.0, 0.0, 0.0, 0.0, 0.0, 0.0, 0.0, 0.0, 0.0, 0.0, 0.0, 0.0],
    "Name": "ThresholdDist-0",
    "Overflow": 0.0,
    "Type": "Histo1d",
    "Underflow": 0.0,
    "x": {
        "AxisTitle": "Threshold [e]",
        "Bins": 366,
        "High": 3655.0,
        "Low": -5.0
    },
    "y": {
        "AxisTitle": "Number of Pixels"
    },
    "z": {
        "AxisTitle": "z"
    }
}