{
    "Data": [[300.0, 80.0, 49.0, 35.0, 20.0, 16.0, 8.0, 6.0, 3.0, 8.0, 5.0, 8.0, 7.0, 6.0, 7.0, 15.0, 6.0, 8.0, 4.0, 4.0, 4.0, 5.0, 5.0, 5.0, 5.0, 3.0, 6.0, 10.0, 5.0, 9.0, 5.0, 3.0, 3.0, 2.0, 1.0, 4.0, 6.0, 7.0, 3.0, 2.0, 4.0, 3.0, 10.0, 5.0, 3.0, 0.0, 4.0, 2.0, 4.0], [545.0, 178.0, 95.0, 44.0, 31.0, 30.0, 13.0, 22.0, 10.0, 10.0, 9.0, 10.0, 3.0, 6.0, 4.0, 7.0, 5.0, 7.0, 4.0, 7.0, 4.0, 6.0, 5.0, 11.0, 4.0, 3.0, 4.0, 4.0, 6.0, 4.0, 2.0, 4.0, 9.0, 5.0, 6.0, 8.0, 1.0, 3.0, 7.0, 3.0, 4.0, 7.0, 5.0, 5.0, 7.0, 7.0, 8.0, 7.0, 6.0], [1154.0, 338.0, 208.0, 95.0, 65.0, 46.0, 39.0, 33.0, 23.0, 23.0, 13.0, 20.0, 13.0, 14.0, 13.0, 20.0, 10.0, 5.0, 6.0, 8.0, 8.0, 2.0, 5.0, 6.0, 8.0, 5.0, 9.0, 8.0, 5.0, 2.0, 5.0, 2.0, 5.0, 3.0, 9.0, 5.0, 2.0, 6.0, 7.0, 5.0, 0.0, 5.0, 10.0, 3.0, 5.0, 7.0, 5.0, 17.0, 19.0], [2279.0, 766.0, 447.0, 217.0, 159.0, 123.0, 81.0, 63.0, 61.0, 60.0, 34.0, 28.0, 32.0, 20.0, 15.0, 18.0, 21.0, 15.0, 23.0, 12.0, 15.0, 20.0, 8.0, 7.0, 13.0, 6.0, 11.0, 7.0, 7.0, 8.0, 10.0, 11.0, 3.0, 5.0, 5.0, 3.0, 5.0, 5.0, 7.0, 5.0, 6.0, 5.0, 8.0, 10.0, 9.0, 2.0, 7.0, 17.0, 21.0], [3814.0, 1553.0, 900.0, 602.0, 458.0, 289.0, 235.0, 191.0, 146.0, 125.0, 104.0, 89.0, 68.0, 55.0, 54.0, 41.0, 36.0, 40.0, 42.0, 33.0, 24.0, 25.0, 35.0, 31.0, 19.0, 17.0, 12.0, 16.0, 13.0, 11.0, 18.0, 12.0, 16.0, 15.0, 10.0, 11.0, 11.0, 6.0, 11.0, 10.0, 12.0, 10.0, 7.0, 11.0, 5.0, 9.0, 7.0, 19.0, 27.0], [7405.0, 3037.0, 1704.0, 1141.0, 829.0, 610.0, 517.0, 417.0, 340.0, 300.0, 268.0, 227.0, 212.0, 148.0, 149.0, 142.0, 130.0, 81.0, 97.0, 92.0, 84.0, 66.0, 61.0, 55.0, 58.0, 48.0, 29.0, 38.0, 41.0, 30.0, 43.0, 27.0, 35.0, 27.0, 34.0, 36.0, 16.0, 21.0, 26.0, 18.0, 20.0, 21.0, 12.0, 16.0, 22.0, 14.0, 21.0, 15.0, 23.0], [8858.0, 6112.0, 4343.0, 3124.0, 2300.0, 1828.0, 1381.0, 1051.0, 884.0, 757.0, 638.0, 493.0, 455.0, 390.0, 343.0, 331.0, 290.0, 262.0, 237.0, 217.0, 199.0, 168.0, 175.0, 172.0, 146.0, 133.0, 116.0, 122.0, 114.0, 76.0, 96.0, 100.0, 77.0, 63.0, 71.0, 70.0, 46.0, 54.0, 51.0, 44.0, 48.0, 44.0, 45.0, 37.0, 41.0, 34.0, 46.0, 40.0, 52.0], [3216.0, 3006.0, 2956.0, 2903.0, 2929.0, 2644.0, 2548.0, 2375.0, 2206.0, 2085.0, 1878.0, 1775.0, 1651.0, 1425.0, 1363.0, 1229.0, 1136.0, 959.0, 880.0, 769.0, 739.0, 653.0, 573.0, 539.0, 466.0, 416.0, 412.0, 359.0, 306.0, 298.0, 268.0, 244.0, 243.0, 212.0, 196.0, 176.0, 148.0, 155.0, 160.0, 126.0, 149.0, 118.0, 91.0, 108.0, 107.0, 108.0, 93.0, 100.0, 106.0], [1080.0, 973.0, 946.0, 955.0, 927.0, 921.0, 969.0, 1074.0, 967.0, 1064.0, 1080.0, 1181.0, 1219.0, 1219.0, 1311.0, 1264.0, 1343.0, 1316.0, 1434.0, 1361.0, 1342.0, 1429.0, 1440.0, 1482.0, 1454.0, 1380.0, 1368.0, 1369.0, 1344.0, 1322.0, 1297.0, 1213.0, 1122.0, 1119.0, 1074.0, 948.0, 877.0, 790.0, 705.0, 687.0, 598.0, 558.0, 503.0, 440.0, 395.0, 353.0, 330.0, 278.0, 293.0], [381.0, 349.0, 330.0, 397.0, 411.0, 411.0, 384.0, 416.0, 437.0, 432.0, 489.0, 455.0, 468.0, 511.0, 512.0, 545.0, 550.0, 566.0, 555.0, 627.0, 638.0, 620.0, 678.0, 704.0, 755.0, 763.0, 806.0, 815.0, 983.0, 1046.0, 1086.0, 1142.0, 1165.0, 1222.0, 1304.0, 1463.0, 1482.0, 1629.0, 1712.0, 1786.0, 1914.0, 2130.0, 2042.0, 2152.0, 2256.0, 2197.0, 2124.0, 2007.0, 1750.0], [227.0, 165.0, 140.0, 151.0, 142.0, 158.0, 151.0, 158.0, 177.0, 204.0, 204.0, 218.0, 207.0, 252.0, 258.0, 244.0, 266.0, 261.0, 266.0, 321.0, 321.0, 345.0, 350.0, 398.0, 408.0, 443.0, 461.0, 455.0, 495.0, 498.0, 510.0, 544.0, 579.0, 644.0, 670.0, 744.0, 789.0, 844.0, 948.0, 1060.0, 1190.0, 1349.0, 1562.0, 1860.0, 2206.0, 2608.0, 3556.0, 4850.0, 6648.0], [159.0, 113.0, 93.0, 58.0, 66.0, 57.0, 63.0, 82.0, 57.0, 64.0, 76.0, 80.0, 99.0, 83.0, 100.0, 98.0, 134.0, 130.0, 124.0, 137.0, 140.0, 153.0, 184.0, 190.0, 190.0, 223.0, 255.0, 240.0, 253.0, 270.0, 318.0, 336.0, 375.0, 388.0, 452.0, 516.0, 475.0, 578.0, 595.0, 633.0, 770.0, 838.0, 969.0, 1089.0, 1302.0, 1683.0, 2263.0, 3291.0, 6500.0], [127.0, 68.0, 63.0, 44.0, 40.0, 28.0, 34.0, 39.0, 28.0, 29.0, 36.0, 28.0, 40.0, 38.0, 51.0, 38.0, 54.0, 40.0, 39.0, 49.0, 62.0, 66.0, 68.0, 69.0, 83.0, 72.0, 111.0, 103.0, 83.0, 111.0, 149.0, 170.0, 167.0, 195.0, 217.0, 228.0, 265.0, 276.0, 345.0, 416.0, 462.0, 557.0, 650.0, 768.0, 951.0, 1171.0, 1618.0, 2476.0, 4720.0], [110.0, 63.0, 37.0, 29.0, 28.0, 23.0, 27.0, 26.0, 17.0, 21.0, 22.0, 17.0, 18.0, 26.0, 16.0, 25.0, 25.0, 31.0, 22.0, 31.0, 22.0, 30.0, 28.0, 42.0, 38.0, 25.0, 36.0, 51.0, 39.0, 40.0, 46.0, 53.0, 68.0, 67.0, 94.0, 91.0, 115.0, 128.0, 154.0, 163.0, 216.0, 260.0, 348.0, 394.0, 517.0, 794.0, 1124.0, 1786.0, 3737.0], [118.0, 51.0, 41.0, 21.0, 19.0, 13.0, 16.0, 20.0, 14.0, 18.0, 17.0, 14.0, 16.0, 14.0, 18.0, 12.0, 14.0, 11.0, 19.0, 23.0, 25.0, 14.0, 12.0, 18.0, 15.0, 15.0, 23.0, 14.0, 27.0, 14.0, 22.0, 24.0, 26.0, 29.0, 23.0, 35.0, 55.0, 58.0, 50.0, 78.0, 80.0, 104.0, 126.0, 168.0, 253.0, 338.0, 557.0, 1005.0, 2554.0], [91.0, 48.0, 30.0, 26.0, 19.0, 10.0, 22.0, 17.0, 6.0, 11.0, 15.0, 15.0, 10.0, 12.0, 13.0, 15.0, 13.0, 14.0, 16.0, 8.0, 11.0, 5.0, 8.0, 9.0, 17.0, 14.0, 15.0, 15.0, 19.0, 9.0, 6.0, 19.0, 17.0, 17.0, 21.0, 14.0, 29.0, 20.0, 29.0, 29.0, 48.0, 48.0, 51.0, 72.0, 87.0, 155.0, 234.0, 477.0, 1428.0], [111.0, 41.0, 26.0, 27.0, 19.0, 12.0, 17.0, 5.0, 13.0, 12.0, 8.0, 8.0, 9.0, 7.0, 10.0, 9.0, 11.0, 9.0, 5.0, 15.0, 8.0, 8.0, 6.0, 9.0, 8.0, 11.0, 10.0, 11.0, 6.0, 12.0, 14.0, 15.0, 7.0, 14.0, 12.0, 18.0, 10.0, 9.0, 16.0, 24.0, 18.0, 23.0, 39.0, 29.0, 41.0, 66.0, 108.0, 193.0, 697.0], [79.0, 41.0, 28.0, 15.0, 14.0, 8.0, 12.0, 12.0, 13.0, 6.0, 8.0, 7.0, 11.0, 12.0, 12.0, 6.0, 3.0, 11.0, 7.0, 9.0, 10.0, 7.0, 7.0, 6.0, 9.0, 6.0, 7.0, 5.0, 11.0, 6.0, 7.0, 11.0, 6.0, 7.0, 6.0, 11.0, 14.0, 12.0, 11.0, 15.0, 21.0, 15.0, 17.0, 23.0, 27.0, 44.0, 57.0, 116.0, 313.0], [81.0, 32.0, 30.0, 13.0, 13.0, 17.0, 9.0, 5.0, 13.0, 3.0, 8.0, 11.0, 8.0, 12.0, 6.0, 7.0, 4.0, 5.0, 11.0, 8.0, 5.0, 6.0, 3.0, 7.0, 7.0, 6.0, 6.0, 6.0, 5.0, 4.0, 10.0, 5.0, 15.0, 2.0, 5.0, 1.0, 6.0, 12.0, 15.0, 13.0, 6.0, 15.0, 12.0, 9.0, 26.0, 24.0, 39.0, 70.0, 194.0], [74.0, 40.0, 17.0, 12.0, 13.0, 14.0, 7.0, 9.0, 5.0, 4.0, 9.0, 6.0, 10.0, 6.0, 3.0, 12.0, 7.0, 5.0, 7.0, 3.0, 10.0, 4.0, 4.0, 7.0, 3.0, 5.0, 7.0, 4.0, 6.0, 12.0, 2.0, 7.0, 4.0, 4.0, 5.0, 5.0, 7.0, 8.0, 5.0, 6.0, 14.0, 8.0, 12.0, 8.0, 16.0, 25.0, 20.0, 46.0, 120.0], [67.0, 29.0, 27.0, 16.0, 8.0, 8.0, 7.0, 6.0, 3.0, 9.0, 5.0, 6.0, 6.0, 6.0, 7.0, 7.0, 7.0, 5.0, 7.0, 4.0, 5.0, 8.0, 6.0, 6.0, 1.0, 5.0, 1.0, 6.0, 1.0, 7.0, 3.0, 5.0, 3.0, 2.0, 4.0, 10.0, 4.0, 5.0, 12.0, 5.0, 4.0, 7.0, 10.0, 8.0, 13.0, 13.0, 22.0, 25.0, 81.0], [83.0, 38.0, 17.0, 8.0, 6.0, 9.0, 3.0, 4.0, 4.0, 4.0, 6.0, 2.0, 5.0, 5.0, 6.0, 1.0, 4.0, 8.0, 7.0, 2.0, 4.0, 6.0, 3.0, 4.0, 2.0, 5.0, 5.0, 2.0, 4.0, 3.0, 4.0, 4.0, 6.0, 4.0, 7.0, 6.0, 4.0, 5.0, 4.0, 1.0, 7.0, 6.0, 6.0, 8.0, 12.0, 12.0, 15.0, 36.0, 51.0], [70.0, 24.0, 16.0, 17.0, 10.0, 4.0, 5.0, 5.0, 3.0, 2.0, 7.0, 2.0, 4.0, 3.0, 5.0, 3.0, 6.0, 3.0, 5.0, 6.0, 2.0, 6.0, 2.0, 6.0, 2.0, 1.0, 0.0, 5.0, 1.0, 3.0, 3.0, 3.0, 5.0, 1.0, 4.0, 6.0, 5.0, 2.0, 2.0, 2.0, 6.0, 4.0, 10.0, 9.0, 8.0, 7.0, 10.0, 17.0, 41.0], [84.0, 42.0, 17.0, 14.0, 11.0, 6.0, 2.0, 4.0, 6.0, 2.0, 2.0, 2.0, 6.0, 7.0, 5.0, 1.0, 6.0, 4.0, 5.0, 4.0, 1.0, 1.0, 2.0, 6.0, 2.0, 4.0, 1.0, 1.0, 1.0, 1.0, 2.0, 2.0, 3.0, 0.0, 4.0, 4.0, 3.0, 3.0, 3.0, 4.0, 3.0, 6.0, 5.0, 2.0, 5.0, 2.0, 5.0, 19.0, 40.0], [66.0, 34.0, 20.0, 12.0, 14.0, 6.0, 1.0, 6.0, 5.0, 4.0, 1.0, 7.0, 4.0, 5.0, 2.0, 4.0, 4.0, 5.0, 0.0, 5.0, 3.0, 2.0, 5.0, 0.0, 6.0, 1.0, 0.0, 1.0, 1.0, 2.0, 1.0, 2.0, 1.0, 0.0, 1.0, 3.0, 2.0, 3.0, 0.0, 3.0, 3.0, 1.0, 4.0, 2.0, 4.0, 9.0, 6.0, 12.0, 18.0], [77.0, 33.0, 15.0, 11.0, 5.0, 6.0, 6.0, 6.0, 6.0, 4.0, 3.0, 3.0, 6.0, 5.0, 5.0, 5.0, 6.0, 4.0, 3.0, 4.0, 2.0, 3.0, 0.0, 1.0, 1.0, 3.0, 2.0, 1.0, 0.0, 0.0, 1.0, 1.0, 2.0, 1.0, 2.0, 1.0, 0.0, 5.0, 4.0, 2.0, 0.0, 2.0, 3.0, 5.0, 1.0, 4.0, 3.0, 3.0, 23.0], [64.0, 28.0, 14.0, 7.0, 14.0, 2.0, 6.0, 3.0, 1.0, 4.0, 6.0, 7.0, 2.0, 3.0, 6.0, 3.0, 4.0, 3.0, 2.0, 3.0, 3.0, 1.0, 2.0, 4.0, 1.0, 1.0, 2.0, 2.0, 2.0, 4.0, 2.0, 2.0, 0.0, 4.0, 1.0, 0.0, 0.0, 1.0, 2.0, 0.0, 2.0, 2.0, 2.0, 1.0, 1.0, 1.0, 5.0, 4.0, 15.0], [73.0, 34.0, 15.0, 10.0, 6.0, 5.0, 4.0, 4.0, 2.0, 3.0, 4.0, 8.0, 4.0, 4.0, 0.0, 3.0, 3.0, 4.0, 3.0, 2.0, 1.0, 3.0, 1.0, 4.0, 2.0, 3.0, 2.0, 1.0, 1.0, 2.0, 2.0, 1.0, 1.0, 1.0, 4.0, 0.0, 0.0, 0.0, 1.0, 0.0, 3.0, 4.0, 1.0, 1.0, 1.0, 2.0, 4.0, 5.0, 6.0], [59.0, 31.0, 17.0, 9.0, 8.0, 3.0, 7.0, 4.0, 4.0, 6.0, 1.0, 4.0, 1.0, 4.0, 2.0, 3.0, 2.0, 1.0, 3.0, 4.0, 3.0, 8.0, 2.0, 2.0, 2.0, 1.0, 1.0, 1.0, 1.0, 4.0, 1.0, 0.0, 0.0, 2.0, 1.0, 1.0, 2.0, 2.0, 0.0, 2.0, 0.0, 0.0, 1.0, 3.0, 0.0, 2.0, 4.0, 4.0, 4.0], [57.0, 25.0, 11.0, 12.0, 10.0, 5.0, 0.0, 5.0, 7.0, 5.0, 6.0, 3.0, 1.0, 3.0, 2.0, 0.0, 4.0, 4.0, 1.0, 3.0, 2.0, 5.0, 4.0, 7.0, 2.0, 2.0, 0.0, 1.0, 0.0, 0.0, 1.0, 0.0, 0.0, 1.0, 4.0, 0.0, 2.0, 1.0, 2.0, 0.0, 1.0, 0.0, 1.0, 0.0, 1.0, 2.0, 3.0, 4.0, 7.0], [79.0, 22.0, 15.0, 16.0, 8.0, 5.0, 5.0, 7.0, 2.0, 1.0, 3.0, 0.0, 5.0, 4.0, 3.0, 1.0, 3.0, 5.0, 4.0, 4.0, 1.0, 7.0, 0.0, 4.0, 1.0, 0.0, 2.0, 1.0, 0.0, 2.0, 1.0, 2.0, 1.0, 1.0, 0.0, 0.0, 0.0, 2.0, 3.0, 1.0, 0.0, 0.0, 0.0, 1.0, 0.0, 1.0, 3.0, 1.0, 2.0], [82.0, 25.0, 19.0, 8.0, 4.0, 6.0, 2.0, 2.0, 7.0, 5.0, 2.0, 2.0, 6.0, 1.0, 2.0, 2.0, 4.0, 2.0, 2.0, 1.0, 3.0, 2.0, 3.0, 1.0, 4.0, 5.0, 4.0, 1.0, 0.0, 5.0, 0.0, 1.0, 0.0, 0.0, 0.0, 1.0, 1.0, 1.0, 1.0, 2.0, 0.0, 2.0, 1.0, 0.0, 1.0, 0.0, 2.0, 2.0, 7.0], [73.0, 28.0, 15.0, 9.0, 14.0, 4.0, 5.0, 4.0, 2.0, 7.0, 8.0, 3.0, 0.0, 1.0, 1.0, 5.0, 1.0, 3.0, 3.0, 1.0, 4.0, 2.0, 0.0, 2.0, 7.0, 2.0, 3.0, 0.0, 0.0, 4.0, 0.0, 0.0, 2.0, 0.0, 0.0, 1.0, 1.0, 0.0, 1.0, 0.0, 1.0, 0.0, 0.0, 0.0, 1.0, 1.0, 1.0, 0.0, 3.0], [71.0, 28.0, 9.0, 9.0, 8.0, 4.0, 4.0, 1.0, 6.0, 4.0, 6.0, 2.0, 2.0, 2.0, 3.0, 3.0, 3.0, 2.0, 4.0, 3.0, 3.0, 3.0, 3.0, 3.0, 3.0, 2.0, 3.0, 1.0, 1.0, 2.0, 1.0, 1.0, 0.0, 0.0, 1.0, 0.0, 0.0, 0.0, 2.0, 1.0, 1.0, 0.0, 2.0, 1.0, 1.0, 2.0, 0.0, 1.0, 0.0], [66.0, 32.0, 20.0, 10.0, 10.0, 3.0, 5.0, 5.0, 1.0, 0.0, 7.0, 4.0, 5.0, 0.0, 4.0, 3.0, 1.0, 4.0, 3.0, 3.0, 5.0, 1.0, 3.0, 4.0, 1.0, 1.0, 0.0, 0.0, 1.0, 0.0, 0.0, 1.0, 1.0, 2.0, 3.0, 0.0, 3.0, 1.0, 0.0, 0.0, 0.0, 0.0, 1.0, 2.0, 1.0, 1.0, 0.0, 1.0, 1.0], [66.0, 33.0, 11.0, 15.0, 9.0, 6.0, 4.0, 5.0, 1.0, 1.0, 4.0, 2.0, 5.0, 1.0, 3.0, 2.0, 5.0, 2.0, 3.0, 1.0, 1.0, 4.0, 2.0, 1.0, 3.0, 2.0, 3.0, 0.0, 0.0, 1.0, 1.0, 1.0, 4.0, 1.0, 0.0, 1.0, 1.0, 1.0, 0.0, 1.0, 0.0, 0.0, 2.0, 2.0, 1.0, 0.0, 1.0, 1.0, 2.0], [82.0, 26.0, 18.0, 12.0, 2.0, 4.0, 3.0, 2.0, 5.0, 4.0, 1.0, 5.0, 6.0, 1.0, 2.0, 5.0, 2.0, 2.0, 5.0, 3.0, 3.0, 0.0, 3.0, 3.0, 5.0, 2.0, 1.0, 0.0, 1.0, 2.0, 0.0, 1.0, 0.0, 0.0, 2.0, 1.0, 0.0, 0.0, 1.0, 0.0, 1.0, 0.0, 0.0, 0.0, 1.0, 0.0, 0.0, 0.0, 3.0], [60.0, 35.0, 14.0, 12.0, 10.0, 4.0, 2.0, 3.0, 4.0, 1.0, 5.0, 4.0, 2.0, 2.0, 1.0, 5.0, 1.0, 2.0, 2.0, 4.0, 2.0, 3.0, 4.0, 1.0, 1.0, 1.0, 2.0, 4.0, 0.0, 3.0, 3.0, 1.0, 2.0, 1.0, 1.0, 0.0, 1.0, 1.0, 2.0, 1.0, 0.0, 2.0, 0.0, 0.0, 0.0, 0.0, 1.0, 1.0, 2.0], [75.0, 32.0, 19.0, 3.0, 5.0, 4.0, 1.0, 6.0, 5.0, 4.0, 4.0, 2.0, 2.0, 2.0, 2.0, 3.0, 3.0, 3.0, 4.0, 4.0, 1.0, 2.0, 1.0, 5.0, 2.0, 0.0, 0.0, 1.0, 2.0, 2.0, 1.0, 1.0, 2.0, 1.0, 0.0, 0.0, 0.0, 0.0, 2.0, 3.0, 1.0, 1.0, 3.0, 2.0, 0.0, 0.0, 1.0, 0.0, 1.0], [77.0, 37.0, 14.0, 8.0, 3.0, 6.0, 1.0, 3.0, 0.0, 3.0, 5.0, 7.0, 5.0, 4.0, 4.0, 5.0, 4.0, 3.0, 2.0, 4.0, 3.0, 4.0, 3.0, 1.0, 0.0, 2.0, 0.0, 0.0, 0.0, 0.0, 0.0, 2.0, 3.0, 1.0, 1.0, 0.0, 1.0, 1.0, 0.0, 1.0, 1.0, 1.0, 2.0, 1.0, 1.0, 0.0, 0.0, 1.0, 1.0], [66.0, 28.0, 19.0, 7.0, 4.0, 4.0, 2.0, 2.0, 4.0, 4.0, 5.0, 6.0, 2.0, 4.0, 3.0, 2.0, 2.0, 2.0, 2.0, 2.0, 4.0, 2.0, 1.0, 1.0, 5.0, 3.0, 4.0, 0.0, 3.0, 1.0, 1.0, 1.0, 0.0, 1.0, 1.0, 0.0, 1.0, 0.0, 2.0, 0.0, 1.0, 1.0, 0.0, 3.0, 0.0, 1.0, 1.0, 1.0, 0.0], [57.0, 26.0, 18.0, 11.0, 6.0, 2.0, 2.0, 7.0, 4.0, 5.0, 2.0, 3.0, 3.0, 2.0, 1.0, 4.0, 5.0, 3.0, 1.0, 2.0, 3.0, 5.0, 2.0, 3.0, 4.0, 4.0, 1.0, 3.0, 1.0, 0.0, 2.0, 0.0, 0.0, 0.0, 2.0, 1.0, 0.0, 3.0, 1.0, 0.0, 0.0, 0.0, 1.0, 0.0, 1.0, 0.0, 1.0, 0.0, 2.0], [71.0, 35.0, 15.0, 9.0, 5.0, 5.0, 0.0, 4.0, 2.0, 4.0, 5.0, 9.0, 3.0, 1.0, 3.0, 1.0, 3.0, 2.0, 0.0, 1.0, 3.0, 7.0, 2.0, 2.0, 1.0, 2.0, 4.0, 1.0, 1.0, 0.0, 0.0, 0.0, 0.0, 0.0, 2.0, 3.0, 2.0, 0.0, 1.0, 1.0, 1.0, 1.0, 1.0, 1.0, 1.0, 1.0, 0.0, 1.0, 1.0], [73.0, 27.0, 13.0, 15.0, 5.0, 3.0, 3.0, 6.0, 4.0, 4.0, 3.0, 7.0, 3.0, 1.0, 3.0, 2.0, 2.0, 7.0, 3.0, 3.0, 3.0, 2.0, 0.0, 0.0, 1.0, 0.0, 5.0, 1.0, 0.0, 0.0, 1.0, 1.0, 0.0, 0.0, 1.0, 1.0, 2.0, 0.0, 0.0, 1.0, 1.0, 1.0, 1.0, 0.0, 0.0, 0.0, 2.0, 0.0, 0.0], [79.0, 31.0, 15.0, 11.0, 9.0, 4.0, 1.0, 5.0, 3.0, 2.0, 4.0, 0.0, 5.0, 2.0, 2.0, 7.0, 3.0, 3.0, 3.0, 1.0, 2.0, 4.0, 4.0, 0.0, 2.0, 2.0, 2.0, 0.0, 0.0, 0.0, 1.0, 0.0, 0.0, 2.0, 0.0, 1.0, 1.0, 1.0, 1.0, 3.0, 1.0, 1.0, 2.0, 1.0, 2.0, 0.0, 0.0, 1.0, 2.0], [60.0, 23.0, 18.0, 8.0, 8.0, 8.0, 2.0, 4.0, 5.0, 4.0, 2.0, 1.0, 1.0, 2.0, 7.0, 2.0, 5.0, 2.0, 3.0, 4.0, 1.0, 6.0, 3.0, 3.0, 2.0, 0.0, 0.0, 1.0, 1.0, 0.0, 0.0, 0.0, 0.0, 2.0, 0.0, 3.0, 0.0, 1.0, 1.0, 1.0, 1.0, 1.0, 1.0, 1.0, 1.0, 0.0, 2.0, 2.0, 0.0], [69.0, 24.0, 17.0, 5.0, 8.0, 4.0, 3.0, 6.0, 1.0, 4.0, 7.0, 1.0, 5.0, 8.0, 0.0, 4.0, 6.0, 2.0, 3.0, 0.0, 2.0, 2.0, 2.0, 1.0, 2.0, 1.0, 2.0, 2.0, 0.0, 1.0, 3.0, 1.0, 2.0, 1.0, 1.0, 0.0, 0.0, 2.0, 1.0, 1.0, 0.0, 0.0, 0.0, 0.0, 0.0, 1.0, 0.0, 1.0, 3.0], [70.0, 34.0, 14.0, 5.0, 6.0, 5.0, 5.0, 3.0, 4.0, 3.0, 0.0, 3.0, 2.0, 3.0, 7.0, 3.0, 2.0, 5.0, 2.0, 1.0, 4.0, 4.0, 1.0, 2.0, 2.0, 1.0, 1.0, 0.0, 3.0, 2.0, 2.0, 1.0, 2.0, 1.0, 1.0, 1.0, 0.0, 0.0, 0.0, 0.0, 1.0, 1.0, 2.0, 1.0, 0.0, 0.0, 0.0, 1.0, 0.0], [75.0, 22.0, 17.0, 11.0, 5.0, 5.0, 1.0, 2.0, 1.0, 7.0, 6.0, 4.0, 3.0, 5.0, 4.0, 2.0, 2.0, 6.0, 5.0, 3.0, 5.0, 0.0, 2.0, 2.0, 0.0, 2.0, 1.0, 2.0, 0.0, 0.0, 3.0, 0.0, 1.0, 0.0, 0.0, 2.0, 0.0, 0.0, 3.0, 0.0, 0.0, 0.0, 1.0, 1.0, 1.0, 0.0, 0.0, 1.0, 1.0], [64.0, 30.0, 20.0, 11.0, 9.0, 4.0, 4.0, 3.0, 3.0, 4.0, 2.0, 3.0, 4.0, 1.0, 3.0, 3.0, 4.0, 5.0, 2.0, 6.0, 3.0, 2.0, 3.0, 2.0, 3.0, 0.0, 1.0, 0.0, 1.0, 0.0, 1.0, 2.0, 1.0, 2.0, 1.0, 2.0, 0.0, 3.0, 0.0, 1.0, 1.0, 2.0, 1.0, 0.0, 0.0, 0.0, 0.0, 0.0, 2.0], [75.0, 29.0, 17.0, 10.0, 11.0, 5.0, 5.0, 0.0, 4.0, 4.0, 1.0, 6.0, 1.0, 4.0, 4.0, 1.0, 3.0, 1.0, 3.0, 3.0, 2.0, 5.0, 3.0, 2.0, 3.0, 1.0, 1.0, 1.0, 2.0, 1.0, 2.0, 0.0, 1.0, 1.0, 3.0, 0.0, 0.0, 1.0, 1.0, 0.0, 1.0, 1.0, 0.0, 0.0, 0.0, 0.0, 1.0, 0.0, 0.0]],
    "Name": "sCurve-0",
    "Overflow": 2032081.0,
    "Type": "Histo2d",
    "Underflow": 0.0,
    "x": {
        "AxisTitle": "Vcal",
        "Bins": 51,
        "High": 302.5,
        "Low": 47.5
    },
    "y": {
        "AxisTitle": "Occupancy",
        "Bins": 49,
        "High": 49.5,
        "Low": 0.5
    },
    "z": {
        "AxisTitle": "Number of pixels"
    }
}