time,Hardware,Voltage,Current
1625799139446,high-voltage,1,0.0477965
time,Hardware,Voltage,Current
1625799139446,high-voltage,2,0.0768164
time,Hardware,Voltage,Current
1625799139446,high-voltage,3,0.0964052
time,Hardware,Voltage,Current
1625799139446,high-voltage,4,0.111192
time,Hardware,Voltage,Current
1625799139446,high-voltage,5,0.123664
time,Hardware,Voltage,Current
1625799139446,high-voltage,6,0.13538
time,Hardware,Voltage,Current
1625799139446,high-voltage,7,0.14482
time,Hardware,Voltage,Current
1625799139446,high-voltage,8,0.155764
time,Hardware,Voltage,Current
1625799139446,high-voltage,9,0.166638
time,Hardware,Voltage,Current
1625799139446,high-voltage,10,0.17519
time,Hardware,Voltage,Current
1625799139446,high-voltage,11,0.183826
time,Hardware,Voltage,Current
1625799139446,high-voltage,12,0.192593
time,Hardware,Voltage,Current
1625799139446,high-voltage,13,0.198598
time,Hardware,Voltage,Current
1625799139446,high-voltage,14,0.205538
time,Hardware,Voltage,Current
1625799139446,high-voltage,15,0.211091
time,Hardware,Voltage,Current
1625799139446,high-voltage,16,0.216279
time,Hardware,Voltage,Current
1625799139446,high-voltage,17,0.222624
time,Hardware,Voltage,Current
1625799139446,high-voltage,18,0.227597
time,Hardware,Voltage,Current
1625799139446,high-voltage,19,0.231813
time,Hardware,Voltage,Current
1625799139446,high-voltage,20,0.237723
time,Hardware,Voltage,Current
1625799139446,high-voltage,25,0.260987
time,Hardware,Voltage,Current
1625799139446,high-voltage,30,0.286633
time,Hardware,Voltage,Current
1625799139446,high-voltage,35,0.318616
time,Hardware,Voltage,Current
1625799139446,high-voltage,40,0.382276
time,Hardware,Voltage,Current
1625799139446,high-voltage,45,0.489935
time,Hardware,Voltage,Current
1625799139446,high-voltage,50,0.657494
time,Hardware,Voltage,Current
1625799139446,high-voltage,55,0.903903
time,Hardware,Voltage,Current
1625799139446,high-voltage,60,1.30439
time,Hardware,Voltage,Current
1625799139446,high-voltage,65,1.91905
time,Hardware,Voltage,Current
1625799139446,high-voltage,70,2.80612
time,Hardware,Voltage,Current
1625799139446,high-voltage,75,4.0279
time,Hardware,Voltage,Current
1625799139446,high-voltage,80,5.6376
time,Hardware,Voltage,Current
1625799139446,high-voltage,85,7.80166
time,Hardware,Voltage,Current
1625799139446,high-voltage,90,10
