{
    "Data": [0.0, 0.0, 0.0, 0.0, 0.0, 0.0, 0.0, 0.0, 0.0, 0.0, 0.0, 0.0, 0.0, 0.0, 1.0, 1.0, 0.0, 17.0, 503.0, 349.0, 40.0, 125.0, 2747.0, 3704.0, 453.0, 359.0, 2346.0, 3516.0, 708.0, 483.0, 1417.0, 2237.0, 904.0, 350.0, 438.0, 591.0, 426.0, 273.0, 420.0, 503.0, 448.0, 505.0, 949.0, 1647.0, 1318.0, 1203.0, 1818.0, 2882.0, 2927.0, 2511.0, 2388.0, 2485.0, 2771.0, 2214.0, 1984.0, 1970.0, 2156.0, 2076.0, 1828.0, 1767.0, 1586.0, 1514.0, 1155.0, 890.0, 843.0, 787.0, 840.0, 677.0, 554.0, 563.0, 596.0, 499.0, 384.0, 344.0, 298.0, 310.0, 269.0, 258.0, 205.0, 190.0, 194.0, 151.0, 144.0, 130.0, 121.0, 119.0, 93.0, 78.0, 100.0, 79.0, 67.0, 64.0, 61.0, 66.0, 63.0, 50.0, 44.0, 36.0, 30.0, 36.0, 37.0, 41.0, 43.0, 38.0, 37.0, 30.0, 23.0, 23.0, 18.0, 18.0, 16.0, 19.0, 24.0, 26.0, 20.0, 19.0, 19.0, 15.0, 9.0, 12.0, 24.0, 16.0, 17.0, 13.0, 15.0, 11.0, 10.0, 5.0, 5.0, 8.0, 11.0, 11.0, 8.0, 4.0, 3.0, 3.0, 8.0, 5.0, 5.0, 4.0, 10.0, 8.0, 3.0, 6.0, 3.0, 2.0, 6.0, 6.0, 5.0, 2.0, 2.0, 5.0, 4.0, 3.0, 2.0, 0.0, 2.0, 2.0, 3.0, 3.0, 1.0, 0.0, 2.0, 1.0, 0.0, 1.0, 1.0, 1.0, 0.0, 1.0, 4.0, 2.0, 2.0, 0.0, 0.0, 1.0, 1.0, 1.0, 1.0, 2.0, 0.0, 0.0, 1.0, 0.0, 1.0, 1.0, 0.0, 0.0, 1.0, 0.0, 0.0, 0.0, 1.0, 0.0, 1.0, 0.0, 1.0, 0.0, 1.0, 0.0, 0.0],
    "Name": "TimePerFitDist-0",
    "Overflow": 96.0,
    "Type": "Histo1d",
    "Underflow": 0.0,
    "x": {
        "AxisTitle": "Fit Time [us]",
        "Bins": 201,
        "High": 401.0,
        "Low": -1.0
    },
    "y": {
        "AxisTitle": "Number of Pixels"
    },
    "z": {
        "AxisTitle": "z"
    }
}