time,Hardware,Voltage,Current
1622016913842,high-voltage,1,0.155843
time,Hardware,Voltage,Current
1622016913842,high-voltage,2,0.289183
time,Hardware,Voltage,Current
1622016913842,high-voltage,3,0.408328
time,Hardware,Voltage,Current
1622016913842,high-voltage,4,0.551121
time,Hardware,Voltage,Current
1622016913842,high-voltage,5,0.694857
time,Hardware,Voltage,Current
1622016913842,high-voltage,6,0.886725
time,Hardware,Voltage,Current
1622016913842,high-voltage,7,1.14834
time,Hardware,Voltage,Current
1622016913842,high-voltage,8,1.47219
time,Hardware,Voltage,Current
1622016913842,high-voltage,9,1.82415
time,Hardware,Voltage,Current
1622016913842,high-voltage,10,2.28991
time,Hardware,Voltage,Current
1622016913842,high-voltage,11,2.83367
time,Hardware,Voltage,Current
1622016913842,high-voltage,12,3.36768
time,Hardware,Voltage,Current
1622016913842,high-voltage,13,4.13167
time,Hardware,Voltage,Current
1622016913842,high-voltage,14,4.91672
time,Hardware,Voltage,Current
1622016913842,high-voltage,15,5.89338
time,Hardware,Voltage,Current
1622016913842,high-voltage,16,6.78321
time,Hardware,Voltage,Current
1622016913842,high-voltage,17,7.86591
time,Hardware,Voltage,Current
1622016913842,high-voltage,18,8.9807
time,Hardware,Voltage,Current
1622016913842,high-voltage,19,9.77109
time,Hardware,Voltage,Current
1622016913842,high-voltage,20,10.0001
