{
    "Data": [1.0, 1.0, 0.0, 2.0, 2.0, 0.0, 1.0, 2.0, 0.0, 0.0, 3.0, 1.0, 3.0, 0.0, 0.0, 0.0, 1.0, 1.0, 3.0, 2.0, 1.0, 2.0, 1.0, 2.0, 3.0, 3.0, 4.0, 4.0, 0.0, 4.0, 2.0, 2.0, 0.0, 2.0, 6.0, 7.0, 2.0, 4.0, 4.0, 3.0, 8.0, 8.0, 6.0, 3.0, 8.0, 8.0, 4.0, 7.0, 7.0, 7.0, 11.0],
    "Name": "Scurve-260-96",
    "Overflow": 0.0,
    "Type": "Histo1d",
    "Underflow": 0.0,
    "x": {
        "AxisTitle": "Vcal",
        "Bins": 51,
        "High": 302.5,
        "Low": 47.5
    },
    "y": {
        "AxisTitle": "Occupancy"
    },
    "z": {
        "AxisTitle": "z"
    }
}