time,Hardware,Voltage,Current
1626612443979,high-voltage,1,0.0497466
time,Hardware,Voltage,Current
1626612443979,high-voltage,2,0.0739681
time,Hardware,Voltage,Current
1626612443979,high-voltage,3,0.0862209
time,Hardware,Voltage,Current
1626612443979,high-voltage,4,0.0982075
time,Hardware,Voltage,Current
1626612443979,high-voltage,5,0.108312
time,Hardware,Voltage,Current
1626612443979,high-voltage,6,0.120538
time,Hardware,Voltage,Current
1626612443979,high-voltage,7,0.131843
time,Hardware,Voltage,Current
1626612443979,high-voltage,8,0.145121
time,Hardware,Voltage,Current
1626612443979,high-voltage,9,0.158592
time,Hardware,Voltage,Current
1626612443979,high-voltage,10,0.171776
time,Hardware,Voltage,Current
1626612443979,high-voltage,11,0.186319
time,Hardware,Voltage,Current
1626612443979,high-voltage,12,0.19726
time,Hardware,Voltage,Current
1626612443979,high-voltage,13,0.208995
time,Hardware,Voltage,Current
1626612443979,high-voltage,14,0.218235
time,Hardware,Voltage,Current
1626612443979,high-voltage,15,0.225605
time,Hardware,Voltage,Current
1626612443979,high-voltage,16,0.233838
time,Hardware,Voltage,Current
1626612443979,high-voltage,17,0.239373
time,Hardware,Voltage,Current
1626612443979,high-voltage,18,0.247176
time,Hardware,Voltage,Current
1626612443979,high-voltage,19,0.253144
time,Hardware,Voltage,Current
1626612443979,high-voltage,20,0.258568
time,Hardware,Voltage,Current
1626612443979,high-voltage,25,0.288198
time,Hardware,Voltage,Current
1626612443979,high-voltage,30,0.322403
time,Hardware,Voltage,Current
1626612443979,high-voltage,35,0.389878
time,Hardware,Voltage,Current
1626612443979,high-voltage,40,0.552303
time,Hardware,Voltage,Current
1626612443979,high-voltage,45,0.875036
time,Hardware,Voltage,Current
1626612443979,high-voltage,50,1.43626
time,Hardware,Voltage,Current
1626612443979,high-voltage,55,2.35233
time,Hardware,Voltage,Current
1626612443979,high-voltage,60,3.74605
time,Hardware,Voltage,Current
1626612443979,high-voltage,65,5.68644
time,Hardware,Voltage,Current
1626612443979,high-voltage,70,8.37465
time,Hardware,Voltage,Current
1626612443979,high-voltage,75,10
