time,Hardware,Voltage,Current
1626615105603,high-voltage-3,1,0.248308
time,Hardware,Voltage,Current
1626615105603,high-voltage-3,2,0.266544
time,Hardware,Voltage,Current
1626615105603,high-voltage-3,3,0.282349
time,Hardware,Voltage,Current
1626615105603,high-voltage-3,4,0.295177
time,Hardware,Voltage,Current
1626615105603,high-voltage-3,5,0.305722
time,Hardware,Voltage,Current
1626615105603,high-voltage-3,6,0.317583
time,Hardware,Voltage,Current
1626615105603,high-voltage-3,7,0.329842
time,Hardware,Voltage,Current
1626615105603,high-voltage-3,8,0.343215
time,Hardware,Voltage,Current
1626615105603,high-voltage-3,9,0.356166
time,Hardware,Voltage,Current
1626615105603,high-voltage-3,10,0.369243
time,Hardware,Voltage,Current
1626615105603,high-voltage-3,11,0.382029
time,Hardware,Voltage,Current
1626615105603,high-voltage-3,12,0.396379
time,Hardware,Voltage,Current
1626615105603,high-voltage-3,13,0.407464
time,Hardware,Voltage,Current
1626615105603,high-voltage-3,14,0.419086
time,Hardware,Voltage,Current
1626615105603,high-voltage-3,15,0.431466
time,Hardware,Voltage,Current
1626615105603,high-voltage-3,16,0.442547
time,Hardware,Voltage,Current
1626615105603,high-voltage-3,17,0.450891
time,Hardware,Voltage,Current
1626615105603,high-voltage-3,18,0.460022
time,Hardware,Voltage,Current
1626615105603,high-voltage-3,19,0.468809
time,Hardware,Voltage,Current
1626615105603,high-voltage-3,20,0.478089
time,Hardware,Voltage,Current
1626615105603,high-voltage-3,25,0.515045
time,Hardware,Voltage,Current
1626615105603,high-voltage-3,30,0.543707
time,Hardware,Voltage,Current
1626615105603,high-voltage-3,35,0.570125
time,Hardware,Voltage,Current
1626615105603,high-voltage-3,40,0.593929
time,Hardware,Voltage,Current
1626615105603,high-voltage-3,45,0.618337
time,Hardware,Voltage,Current
1626615105603,high-voltage-3,50,0.641317
time,Hardware,Voltage,Current
1626615105603,high-voltage-3,55,0.661766
time,Hardware,Voltage,Current
1626615105603,high-voltage-3,60,0.682261
time,Hardware,Voltage,Current
1626615105603,high-voltage-3,65,0.70341
time,Hardware,Voltage,Current
1626615105603,high-voltage-3,70,0.726011
time,Hardware,Voltage,Current
1626615105603,high-voltage-3,75,0.748544
time,Hardware,Voltage,Current
1626615105603,high-voltage-3,80,0.771186
time,Hardware,Voltage,Current
1626615105603,high-voltage-3,85,0.793435
time,Hardware,Voltage,Current
1626615105603,high-voltage-3,90,0.813902
time,Hardware,Voltage,Current
1626615105603,high-voltage-3,95,0.837394
time,Hardware,Voltage,Current
1626615105603,high-voltage-3,100,0.85748
