{
    "Data": [0.0, 0.0, 0.0, 0.0, 0.0, 0.0, 0.0, 0.0, 0.0, 0.0, 0.0, 0.0, 0.0, 0.0, 0.0, 0.0, 0.0, 0.0, 0.0, 0.0, 0.0, 0.0, 0.0, 0.0, 0.0, 0.0, 0.0, 0.0, 0.0, 0.0, 0.0, 0.0, 0.0, 0.0, 0.0, 0.0, 0.0, 0.0, 0.0, 0.0, 0.0, 0.0, 0.0, 0.0, 0.0, 0.0, 0.0, 0.0, 0.0, 0.0, 6.0, 5.0, 3.0, 6.0, 4.0, 7.0, 9.0, 8.0, 6.0, 4.0, 9.0, 6.0, 6.0, 5.0, 7.0, 6.0, 19.0, 18.0, 19.0, 22.0, 23.0, 34.0, 28.0, 33.0, 45.0, 58.0, 57.0, 72.0, 82.0, 93.0, 121.0, 135.0, 168.0, 194.0, 237.0, 306.0, 313.0, 395.0, 559.0, 693.0, 1078.0, 1522.0, 2274.0, 3046.0, 3611.0, 4078.0, 4223.0, 3963.0, 3500.0, 2923.0, 2391.0, 1813.0, 1492.0, 1259.0, 1084.0, 1062.0, 951.0, 879.0, 801.0, 759.0, 645.0, 574.0, 540.0, 505.0, 421.0, 370.0, 305.0, 277.0, 247.0, 192.0, 141.0, 121.0, 111.0, 95.0, 74.0, 68.0, 51.0, 52.0, 52.0, 37.0, 41.0, 33.0, 30.0, 27.0, 27.0, 21.0, 23.0, 12.0, 18.0, 30.0, 14.0, 13.0, 18.0, 14.0, 16.0, 11.0, 12.0, 15.0, 15.0, 9.0, 5.0, 10.0, 6.0, 6.0, 9.0, 11.0, 13.0, 11.0, 11.0, 8.0, 4.0, 8.0, 14.0, 10.0, 12.0, 4.0, 9.0, 16.0, 20.0, 27.0, 32.0, 25.0, 45.0, 52.0, 61.0, 81.0, 106.0, 111.0, 137.0, 184.0, 207.0, 265.0, 299.0, 338.0, 365.0, 442.0, 501.0, 543.0, 576.0, 592.0, 727.0, 776.0, 777.0, 803.0, 871.0, 929.0, 895.0, 919.0, 970.0, 931.0, 960.0, 859.0, 865.0, 824.0, 763.0, 712.0, 652.0, 615.0, 583.0, 553.0, 459.0, 424.0, 402.0, 366.0, 333.0, 252.0, 218.0, 196.0, 165.0, 138.0, 130.0, 94.0, 78.0, 72.0, 50.0, 50.0, 39.0, 37.0, 35.0, 13.0, 12.0, 13.0, 14.0, 8.0, 6.0, 5.0, 3.0, 4.0, 4.0, 2.0, 1.0, 3.0, 2.0, 0.0, 0.0, 0.0, 0.0, 0.0, 0.0, 0.0, 1.0, 1.0, 1.0, 0.0, 0.0, 0.0, 0.0, 0.0, 1.0, 0.0, 1.0, 0.0, 0.0, 0.0, 0.0, 0.0, 0.0, 0.0, 0.0, 0.0, 0.0, 0.0, 0.0, 0.0, 0.0, 0.0, 0.0, 0.0, 0.0, 0.0, 0.0, 0.0, 0.0, 1.0, 0.0, 0.0, 0.0, 0.0, 0.0, 0.0, 0.0, 0.0, 0.0, 0.0, 1.0, 0.0, 0.0, 0.0, 0.0, 0.0, 0.0, 0.0, 0.0, 0.0, 0.0, 0.0, 0.0, 0.0, 0.0, 0.0, 0.0, 0.0, 0.0, 0.0, 0.0, 0.0, 0.0, 0.0, 0.0, 0.0, 0.0, 0.0, 0.0, 0.0, 0.0, 0.0, 0.0, 0.0, 0.0, 0.0, 0.0, 0.0, 0.0, 0.0, 0.0, 0.0, 0.0, 0.0, 0.0, 0.0, 0.0, 0.0, 0.0, 0.0, 0.0, 0.0, 0.0, 0.0, 0.0, 0.0, 0.0, 0.0, 0.0, 0.0, 0.0, 0.0, 0.0, 0.0, 0.0, 0.0, 0.0, 0.0, 0.0, 0.0, 0.0, 0.0],
    "Name": "ThresholdDist-0",
    "Overflow": 0.0,
    "Type": "Histo1d",
    "Underflow": 0.0,
    "x": {
        "AxisTitle": "Threshold [e]",
        "Bins": 366,
        "High": 3655.0,
        "Low": -5.0
    },
    "y": {
        "AxisTitle": "Number of Pixels"
    },
    "z": {
        "AxisTitle": "z"
    }
}