time,Hardware,Voltage,Current
1625766016359,high-voltage-4,1,1.43566
time,Hardware,Voltage,Current
1625766016359,high-voltage-4,2,1.75685
time,Hardware,Voltage,Current
1625766016359,high-voltage-4,3,1.99282
time,Hardware,Voltage,Current
1625766016359,high-voltage-4,4,2.15855
time,Hardware,Voltage,Current
1625766016359,high-voltage-4,5,2.27497
time,Hardware,Voltage,Current
1625766016359,high-voltage-4,6,2.37227
time,Hardware,Voltage,Current
1625766016359,high-voltage-4,7,2.46188
time,Hardware,Voltage,Current
1625766016359,high-voltage-4,8,2.55622
time,Hardware,Voltage,Current
1625766016359,high-voltage-4,9,2.65689
time,Hardware,Voltage,Current
1625766016359,high-voltage-4,10,2.76635
time,Hardware,Voltage,Current
1625766016359,high-voltage-4,11,2.89119
time,Hardware,Voltage,Current
1625766016359,high-voltage-4,12,3.02523
time,Hardware,Voltage,Current
1625766016359,high-voltage-4,13,3.17004
time,Hardware,Voltage,Current
1625766016359,high-voltage-4,14,3.32664
time,Hardware,Voltage,Current
1625766016359,high-voltage-4,15,3.48984
time,Hardware,Voltage,Current
1625766016359,high-voltage-4,16,3.65011
time,Hardware,Voltage,Current
1625766016359,high-voltage-4,17,3.81262
time,Hardware,Voltage,Current
1625766016359,high-voltage-4,18,3.98485
time,Hardware,Voltage,Current
1625766016359,high-voltage-4,19,4.15151
time,Hardware,Voltage,Current
1625766016359,high-voltage-4,20,4.32763
time,Hardware,Voltage,Current
1625766016359,high-voltage-4,25,5.06402
time,Hardware,Voltage,Current
1625766016359,high-voltage-4,30,5.60018
time,Hardware,Voltage,Current
1625766016359,high-voltage-4,35,6.08093
time,Hardware,Voltage,Current
1625766016359,high-voltage-4,40,6.5396
time,Hardware,Voltage,Current
1625766016359,high-voltage-4,45,7.02277
time,Hardware,Voltage,Current
1625766016359,high-voltage-4,50,7.52554
time,Hardware,Voltage,Current
1625766016359,high-voltage-4,55,8.08657
time,Hardware,Voltage,Current
1625766016359,high-voltage-4,60,8.73941
time,Hardware,Voltage,Current
1625766016359,high-voltage-4,65,9.50811
time,Hardware,Voltage,Current
1625766016359,high-voltage-4,70,9.99977
time,Hardware,Voltage,Current
1625766016359,high-voltage-4,75,9.99978
time,Hardware,Voltage,Current
1625766016359,high-voltage-4,80,9.9997
time,Hardware,Voltage,Current
1625766016359,high-voltage-4,85,9.99972
time,Hardware,Voltage,Current
1625766016359,high-voltage-4,90,9.99969
time,Hardware,Voltage,Current
1625766016359,high-voltage-4,95,9.99965
time,Hardware,Voltage,Current
1625766016359,high-voltage-4,100,9.99975
