{
    "Data": [0.0, 0.0, 0.0, 0.0, 0.0, 0.0, 0.0, 0.0, 0.0, 0.0, 0.0, 0.0, 0.0, 0.0, 0.0, 0.0, 0.0, 0.0, 0.0, 0.0, 0.0, 0.0, 0.0, 0.0, 0.0, 0.0, 0.0, 0.0, 0.0, 0.0, 0.0, 0.0, 0.0, 0.0, 0.0, 0.0, 0.0, 0.0, 0.0, 0.0, 0.0, 0.0, 0.0, 0.0, 0.0, 0.0, 0.0, 0.0, 0.0, 0.0, 42.0, 68.0, 91.0, 117.0, 153.0, 159.0, 160.0, 210.0, 234.0, 276.0, 322.0, 362.0, 400.0, 468.0, 524.0, 613.0, 592.0, 669.0, 723.0, 783.0, 818.0, 837.0, 895.0, 879.0, 907.0, 893.0, 1044.0, 1057.0, 935.0, 888.0, 946.0, 882.0, 884.0, 913.0, 933.0, 1038.0, 1157.0, 1384.0, 1664.0, 2068.0, 2348.0, 2572.0, 2901.0, 2819.0, 2685.0, 2381.0, 2049.0, 1548.0, 1107.0, 817.0, 569.0, 443.0, 305.0, 183.0, 152.0, 89.0, 86.0, 61.0, 40.0, 41.0, 26.0, 27.0, 28.0, 24.0, 14.0, 18.0, 13.0, 21.0, 13.0, 12.0, 21.0, 10.0, 10.0, 9.0, 18.0, 11.0, 7.0, 6.0, 6.0, 8.0, 6.0, 3.0, 5.0, 8.0, 8.0, 7.0, 6.0, 5.0, 2.0, 6.0, 3.0, 2.0, 3.0, 2.0, 1.0, 0.0, 4.0, 1.0, 2.0, 4.0, 5.0, 3.0, 1.0, 4.0, 3.0, 5.0, 0.0, 1.0, 3.0, 3.0, 2.0, 5.0, 6.0, 4.0, 3.0, 11.0, 7.0, 12.0, 12.0, 19.0, 27.0, 21.0, 35.0, 30.0, 35.0, 45.0, 62.0, 68.0, 74.0, 93.0, 103.0, 108.0, 124.0, 157.0, 192.0, 212.0, 217.0, 268.0, 244.0, 308.0, 372.0, 367.0, 377.0, 445.0, 451.0, 500.0, 542.0, 513.0, 583.0, 604.0, 687.0, 629.0, 685.0, 657.0, 649.0, 688.0, 687.0, 632.0, 688.0, 683.0, 658.0, 659.0, 626.0, 672.0, 608.0, 567.0, 585.0, 574.0, 529.0, 484.0, 424.0, 444.0, 361.0, 379.0, 326.0, 280.0, 312.0, 263.0, 243.0, 198.0, 182.0, 179.0, 163.0, 127.0, 118.0, 110.0, 91.0, 77.0, 74.0, 57.0, 36.0, 42.0, 43.0, 26.0, 26.0, 18.0, 24.0, 16.0, 15.0, 9.0, 7.0, 7.0, 2.0, 2.0, 1.0, 2.0, 2.0, 1.0, 0.0, 0.0, 1.0, 0.0, 1.0, 0.0, 0.0, 0.0, 0.0, 0.0, 1.0, 1.0, 0.0, 0.0, 0.0, 0.0, 0.0, 0.0, 0.0, 0.0, 0.0, 0.0, 0.0, 0.0, 0.0, 0.0, 0.0, 0.0, 0.0, 0.0, 0.0, 0.0, 0.0, 0.0, 0.0, 0.0, 0.0, 0.0, 0.0, 0.0, 0.0, 0.0, 0.0, 0.0, 0.0, 0.0, 0.0, 0.0, 0.0, 0.0, 0.0, 0.0, 0.0, 0.0, 0.0, 0.0, 0.0, 0.0, 0.0, 0.0, 0.0, 0.0, 0.0, 0.0, 0.0, 0.0, 0.0, 0.0, 0.0, 0.0, 0.0, 0.0, 0.0, 0.0, 0.0, 0.0, 0.0, 0.0, 0.0, 0.0, 0.0, 0.0, 0.0, 0.0, 0.0, 0.0, 0.0, 0.0, 0.0, 0.0, 0.0, 0.0, 0.0, 0.0, 0.0, 0.0, 0.0, 0.0, 0.0, 0.0, 0.0, 0.0, 0.0, 0.0, 0.0, 0.0, 0.0, 0.0, 0.0, 0.0, 0.0, 0.0, 0.0, 0.0, 0.0, 0.0, 0.0, 0.0, 0.0, 0.0, 0.0, 0.0, 0.0, 0.0, 0.0, 0.0, 0.0, 0.0, 0.0, 0.0, 0.0, 0.0, 0.0, 0.0, 0.0, 0.0, 0.0, 0.0, 0.0, 0.0, 0.0, 0.0, 0.0, 0.0, 0.0, 0.0, 0.0, 0.0, 0.0, 0.0, 0.0, 0.0, 0.0, 0.0, 0.0, 0.0, 0.0],
    "Name": "ThresholdDist-0",
    "Overflow": 0.0,
    "Type": "Histo1d",
    "Underflow": 0.0,
    "x": {
        "AxisTitle": "Threshold [e]",
        "Bins": 415,
        "High": 4145.0,
        "Low": -5.0
    },
    "y": {
        "AxisTitle": "Number of Pixels"
    },
    "z": {
        "AxisTitle": "z"
    }
}