{
    "Data": [0.0, 11.0, 3.0, 4.0, 9.0, 11.0, 15.0, 16.0, 71.0, 175.0, 565.0, 1336.0, 2611.0, 3952.0, 4951.0, 4600.0, 3626.0, 2484.0, 2134.0, 2422.0, 3175.0, 4096.0, 4321.0, 3955.0, 3093.0, 2067.0, 1202.0, 691.0, 478.0, 342.0, 355.0, 362.0, 474.0, 580.0, 765.0, 892.0, 1065.0, 1251.0, 1448.0, 1558.0, 1620.0, 1542.0, 1462.0, 1428.0, 1160.0, 1090.0, 933.0, 768.0, 658.0, 558.0, 447.0, 375.0, 321.0, 277.0, 246.0, 206.0, 175.0, 134.0, 142.0, 113.0, 104.0, 92.0, 96.0, 80.0, 68.0, 61.0, 49.0, 51.0, 42.0, 35.0, 44.0, 33.0, 26.0, 23.0, 23.0, 23.0, 21.0, 15.0, 20.0, 17.0, 14.0, 16.0, 8.0, 13.0, 14.0, 12.0, 7.0, 11.0, 2.0, 11.0, 7.0, 7.0],
    "Name": "NoiseDist-0",
    "Overflow": 112.0,
    "Type": "Histo1d",
    "Underflow": 0.0,
    "x": {
        "AxisTitle": "Noise [e]",
        "Bins": 92,
        "High": 461.0,
        "Low": -2.0
    },
    "y": {
        "AxisTitle": "Number of Pixels"
    },
    "z": {
        "AxisTitle": "z"
    }
}