{
    "Data": [4.0, 6.0, 1.0, 2.0, 5.0, 4.0, 9.0, 21.0, 92.0, 266.0, 732.0, 1589.0, 2856.0, 4194.0, 4628.0, 4292.0, 3295.0, 2639.0, 2399.0, 2727.0, 3583.0, 4315.0, 4755.0, 4607.0, 3999.0, 3197.0, 2431.0, 1873.0, 1537.0, 1310.0, 1206.0, 1084.0, 1020.0, 957.0, 1030.0, 927.0, 928.0, 876.0, 833.0, 821.0, 756.0, 676.0, 591.0, 492.0, 447.0, 405.0, 284.0, 256.0, 202.0, 154.0, 142.0, 127.0, 92.0, 97.0, 83.0, 61.0, 42.0, 44.0, 35.0, 34.0, 20.0, 20.0, 24.0, 14.0, 10.0, 10.0, 7.0, 14.0, 12.0],
    "Name": "NoiseDist-0",
    "Overflow": 124.0,
    "Type": "Histo1d",
    "Underflow": 0.0,
    "x": {
        "AxisTitle": "Noise [e]",
        "Bins": 69,
        "High": 346.0,
        "Low": -2.0
    },
    "y": {
        "AxisTitle": "Number of Pixels"
    },
    "z": {
        "AxisTitle": "z"
    }
}