{
    "Data": [34.0, 54.0, 4.0, 8.0, 6.0, 12.0, 59.0, 174.0, 490.0, 1205.0, 2451.0, 3974.0, 4861.0, 4877.0, 4407.0, 4052.0, 4328.0, 4959.0, 5143.0, 4821.0, 3869.0, 2948.0, 2151.0, 1828.0, 1727.0, 1741.0, 1688.0, 1699.0, 1741.0, 1601.0, 1503.0, 1374.0, 1086.0, 1026.0, 805.0, 670.0, 578.0, 452.0, 349.0, 283.0, 197.0, 156.0, 125.0, 100.0, 100.0, 73.0, 50.0, 56.0, 40.0, 42.0, 35.0, 19.0, 26.0, 11.0, 23.0, 18.0, 14.0, 4.0, 4.0, 8.0],
    "Name": "NoiseDist-0",
    "Overflow": 138.0,
    "Type": "Histo1d",
    "Underflow": 0.0,
    "x": {
        "AxisTitle": "Noise [e]",
        "Bins": 60,
        "High": 301.0,
        "Low": -2.0
    },
    "y": {
        "AxisTitle": "Number of Pixels"
    },
    "z": {
        "AxisTitle": "z"
    }
}