{
    "Data": [33.0, 66.0, 1.0, 0.0, 7.0, 112.0, 536.0, 1677.0, 3379.0, 4717.0, 4794.0, 4076.0, 3155.0, 2640.0, 2625.0, 2943.0, 3307.0, 3686.0, 3604.0, 3341.0, 2606.0, 1852.0, 1122.0, 766.0, 569.0, 616.0, 721.0, 981.0, 1282.0, 1654.0, 1932.0, 2222.0, 2305.0, 2232.0, 2141.0, 1825.0, 1626.0, 1283.0, 995.0, 784.0, 569.0, 349.0, 259.0, 191.0, 124.0, 76.0, 51.0, 46.0, 24.0, 27.0, 20.0, 18.0, 12.0, 6.0, 4.0, 10.0, 4.0, 6.0, 6.0, 5.0, 2.0, 3.0, 0.0, 4.0, 1.0, 3.0, 0.0, 0.0, 2.0, 2.0, 1.0],
    "Name": "NoiseDist-0",
    "Overflow": 13.0,
    "Type": "Histo1d",
    "Underflow": 0.0,
    "x": {
        "AxisTitle": "Noise [e]",
        "Bins": 71,
        "High": 356.0,
        "Low": -2.0
    },
    "y": {
        "AxisTitle": "Number of Pixels"
    },
    "z": {
        "AxisTitle": "z"
    }
}