{
    "Data": [3949.0, 25692.0, 16606.0, 6358.0, 4280.0, 4226.0, 4220.0, 3600.0, 2873.0, 2038.0, 1350.0, 860.0, 496.0, 283.0, 191.0, 95.0, 56.0, 26.0, 19.0, 6.0, 7.0, 5.0, 4.0, 2.0, 10.0, 4.0, 3.0, 1.0, 1.0, 2.0, 0.0, 1.0, 0.0, 0.0, 0.0, 2.0, 0.0, 1.0, 0.0, 0.0, 1.0, 0.0, 1.0, 3.0, 0.0, 1.0, 0.0, 2.0, 1.0, 0.0, 0.0],
    "Name": "Chi2Dist-0",
    "Overflow": 0.0,
    "Type": "Histo1d",
    "Underflow": 0.0,
    "x": {
        "AxisTitle": "Fit Chi/ndf",
        "Bins": 51,
        "High": 2.5250000953674318,
        "Low": -0.02500000037252903
    },
    "y": {
        "AxisTitle": "Number of Pixels"
    },
    "z": {
        "AxisTitle": "z"
    }
}