{
    "Data": [0.0, 0.0, 0.0, 0.0, 0.0, 0.0, 0.0, 0.0, 0.0, 0.0, 0.0, 0.0, 0.0, 0.0, 3.0, 2.0, 0.0, 30.0, 355.0, 146.0, 25.0, 304.0, 2146.0, 1505.0, 271.0, 788.0, 2654.0, 1879.0, 521.0, 1012.0, 2249.0, 1630.0, 666.0, 714.0, 821.0, 653.0, 448.0, 793.0, 1100.0, 1007.0, 668.0, 1226.0, 2002.0, 3520.0, 2235.0, 1694.0, 2338.0, 3421.0, 3647.0, 2888.0, 2532.0, 2362.0, 3079.0, 2242.0, 1691.0, 1338.0, 1334.0, 1516.0, 1267.0, 1226.0, 1013.0, 1066.0, 790.0, 636.0, 531.0, 473.0, 538.0, 430.0, 418.0, 348.0, 346.0, 331.0, 234.0, 239.0, 211.0, 220.0, 192.0, 131.0, 131.0, 120.0, 137.0, 108.0, 95.0, 72.0, 77.0, 85.0, 65.0, 54.0, 57.0, 39.0, 50.0, 44.0, 32.0, 33.0, 32.0, 29.0, 26.0, 23.0, 19.0, 27.0, 19.0, 21.0, 15.0, 19.0, 11.0, 13.0, 7.0, 12.0, 7.0, 18.0, 7.0, 6.0, 10.0, 4.0, 10.0, 4.0, 5.0, 5.0, 4.0, 4.0, 5.0, 10.0, 7.0, 4.0, 3.0, 5.0, 3.0, 6.0, 7.0, 6.0, 3.0, 4.0, 9.0, 6.0, 4.0, 5.0, 4.0, 5.0, 9.0, 5.0, 9.0, 3.0, 5.0, 4.0, 11.0, 9.0, 3.0, 7.0, 5.0, 4.0, 4.0, 6.0, 1.0, 0.0, 2.0, 4.0, 4.0, 3.0, 3.0, 4.0, 4.0, 2.0, 1.0, 1.0, 1.0, 1.0, 1.0, 0.0, 3.0, 0.0, 3.0, 2.0, 3.0, 1.0, 1.0, 2.0, 0.0, 1.0, 1.0, 3.0, 0.0, 1.0, 0.0, 0.0, 1.0, 2.0, 0.0, 0.0, 1.0, 0.0, 1.0, 1.0, 1.0, 0.0, 0.0, 0.0, 0.0, 1.0, 2.0, 1.0, 0.0],
    "Name": "TimePerFitDist-0",
    "Overflow": 106.0,
    "Type": "Histo1d",
    "Underflow": 0.0,
    "x": {
        "AxisTitle": "Fit Time [us]",
        "Bins": 201,
        "High": 401.0,
        "Low": -1.0
    },
    "y": {
        "AxisTitle": "Number of Pixels"
    },
    "z": {
        "AxisTitle": "z"
    }
}