time,Hardware,Voltage,Current
1626394327700,high-voltage-2,1,0.268646
time,Hardware,Voltage,Current
1626394327700,high-voltage-2,2,0.349023
time,Hardware,Voltage,Current
1626394327700,high-voltage-2,3,0.395337
time,Hardware,Voltage,Current
1626394327700,high-voltage-2,4,0.43601
time,Hardware,Voltage,Current
1626394327700,high-voltage-2,5,0.473301
time,Hardware,Voltage,Current
1626394327700,high-voltage-2,6,0.513132
time,Hardware,Voltage,Current
1626394327700,high-voltage-2,7,0.553959
time,Hardware,Voltage,Current
1626394327700,high-voltage-2,8,0.597016
time,Hardware,Voltage,Current
1626394327700,high-voltage-2,9,0.639894
time,Hardware,Voltage,Current
1626394327700,high-voltage-2,10,0.677476
time,Hardware,Voltage,Current
1626394327700,high-voltage-2,11,0.714844
time,Hardware,Voltage,Current
1626394327700,high-voltage-2,12,0.747497
time,Hardware,Voltage,Current
1626394327700,high-voltage-2,13,0.777764
time,Hardware,Voltage,Current
1626394327700,high-voltage-2,14,0.802975
time,Hardware,Voltage,Current
1626394327700,high-voltage-2,15,0.826408
time,Hardware,Voltage,Current
1626394327700,high-voltage-2,16,0.849761
time,Hardware,Voltage,Current
1626394327700,high-voltage-2,17,0.871654
time,Hardware,Voltage,Current
1626394327700,high-voltage-2,18,0.890779
time,Hardware,Voltage,Current
1626394327700,high-voltage-2,19,0.909339
time,Hardware,Voltage,Current
1626394327700,high-voltage-2,20,0.929041
time,Hardware,Voltage,Current
1626394327700,high-voltage-2,25,1.01564
time,Hardware,Voltage,Current
1626394327700,high-voltage-2,30,1.09875
time,Hardware,Voltage,Current
1626394327700,high-voltage-2,35,1.18719
time,Hardware,Voltage,Current
1626394327700,high-voltage-2,40,1.2906
time,Hardware,Voltage,Current
1626394327700,high-voltage-2,45,1.41725
time,Hardware,Voltage,Current
1626394327700,high-voltage-2,50,1.50821
time,Hardware,Voltage,Current
1626394327700,high-voltage-2,55,1.59082
time,Hardware,Voltage,Current
1626394327700,high-voltage-2,60,1.67195
time,Hardware,Voltage,Current
1626394327700,high-voltage-2,65,1.7498
time,Hardware,Voltage,Current
1626394327700,high-voltage-2,70,1.82347
time,Hardware,Voltage,Current
1626394327700,high-voltage-2,75,1.89304
time,Hardware,Voltage,Current
1626394327700,high-voltage-2,80,1.963
time,Hardware,Voltage,Current
1626394327700,high-voltage-2,85,2.02966
time,Hardware,Voltage,Current
1626394327700,high-voltage-2,90,2.09519
time,Hardware,Voltage,Current
1626394327700,high-voltage-2,95,2.16036
time,Hardware,Voltage,Current
1626394327700,high-voltage-2,100,2.22324
