time,Hardware,Voltage,Current
1626609156248,high-voltage,1,0.0505627
time,Hardware,Voltage,Current
1626609156248,high-voltage,2,0.0714715
time,Hardware,Voltage,Current
1626609156248,high-voltage,3,0.0846425
time,Hardware,Voltage,Current
1626609156248,high-voltage,4,0.0948797
time,Hardware,Voltage,Current
1626609156248,high-voltage,5,0.103028
time,Hardware,Voltage,Current
1626609156248,high-voltage,6,0.113292
time,Hardware,Voltage,Current
1626609156248,high-voltage,7,0.123639
time,Hardware,Voltage,Current
1626609156248,high-voltage,8,0.134217
time,Hardware,Voltage,Current
1626609156248,high-voltage,9,0.145473
time,Hardware,Voltage,Current
1626609156248,high-voltage,10,0.158214
time,Hardware,Voltage,Current
1626609156248,high-voltage,11,0.170101
time,Hardware,Voltage,Current
1626609156248,high-voltage,12,0.183667
time,Hardware,Voltage,Current
1626609156248,high-voltage,13,0.195399
time,Hardware,Voltage,Current
1626609156248,high-voltage,14,0.206314
time,Hardware,Voltage,Current
1626609156248,high-voltage,15,0.216427
time,Hardware,Voltage,Current
1626609156248,high-voltage,16,0.224191
time,Hardware,Voltage,Current
1626609156248,high-voltage,17,0.233234
time,Hardware,Voltage,Current
1626609156248,high-voltage,18,0.239656
time,Hardware,Voltage,Current
1626609156248,high-voltage,19,0.247721
time,Hardware,Voltage,Current
1626609156248,high-voltage,20,0.253479
time,Hardware,Voltage,Current
1626609156248,high-voltage,25,0.2838
time,Hardware,Voltage,Current
1626609156248,high-voltage,30,0.321271
time,Hardware,Voltage,Current
1626609156248,high-voltage,35,0.390656
time,Hardware,Voltage,Current
1626609156248,high-voltage,40,0.555081
time,Hardware,Voltage,Current
1626609156248,high-voltage,45,0.87418
time,Hardware,Voltage,Current
1626609156248,high-voltage,50,1.41774
time,Hardware,Voltage,Current
1626609156248,high-voltage,55,2.28194
time,Hardware,Voltage,Current
1626609156248,high-voltage,60,3.60797
time,Hardware,Voltage,Current
1626609156248,high-voltage,65,5.50396
time,Hardware,Voltage,Current
1626609156248,high-voltage,70,8.13316
time,Hardware,Voltage,Current
1626609156248,high-voltage,75,10
