{
    "Data": [37.0, 65.0, 2.0, 1.0, 7.0, 91.0, 568.0, 1673.0, 3490.0, 4697.0, 4825.0, 4023.0, 3183.0, 2550.0, 2589.0, 2875.0, 3309.0, 3618.0, 3621.0, 3080.0, 2670.0, 1814.0, 1228.0, 765.0, 589.0, 568.0, 775.0, 1010.0, 1284.0, 1659.0, 2014.0, 2162.0, 2350.0, 2262.0, 2051.0, 1890.0, 1607.0, 1307.0, 922.0, 753.0, 528.0, 391.0, 303.0, 184.0, 131.0, 76.0, 53.0, 45.0, 27.0, 21.0, 16.0, 16.0, 15.0, 4.0, 10.0, 8.0, 2.0, 2.0, 6.0, 2.0, 7.0, 2.0, 2.0, 1.0, 0.0, 2.0, 1.0, 1.0, 1.0, 3.0, 0.0],
    "Name": "NoiseDist-0",
    "Overflow": 14.0,
    "Type": "Histo1d",
    "Underflow": 0.0,
    "x": {
        "AxisTitle": "Noise [e]",
        "Bins": 71,
        "High": 356.0,
        "Low": -2.0
    },
    "y": {
        "AxisTitle": "Number of Pixels"
    },
    "z": {
        "AxisTitle": "z"
    }
}