{
    "Data": [10.0, 4.0, 2.0, 2.0, 8.0, 6.0, 8.0, 28.0, 86.0, 273.0, 763.0, 1659.0, 2964.0, 4113.0, 4634.0, 4297.0, 3389.0, 2572.0, 2433.0, 2822.0, 3770.0, 4436.0, 4616.0, 4572.0, 3889.0, 3052.0, 2419.0, 1841.0, 1518.0, 1271.0, 1232.0, 1076.0, 1079.0, 980.0, 961.0, 986.0, 960.0, 907.0, 894.0, 843.0, 715.0, 630.0, 525.0, 502.0, 439.0, 317.0, 287.0, 236.0, 212.0, 136.0, 128.0, 105.0, 89.0, 72.0, 63.0, 61.0, 47.0, 26.0, 35.0, 31.0, 26.0, 23.0, 9.0, 14.0, 14.0, 12.0, 13.0, 6.0, 7.0],
    "Name": "NoiseDist-0",
    "Overflow": 85.0,
    "Type": "Histo1d",
    "Underflow": 0.0,
    "x": {
        "AxisTitle": "Noise [e]",
        "Bins": 69,
        "High": 346.0,
        "Low": -2.0
    },
    "y": {
        "AxisTitle": "Number of Pixels"
    },
    "z": {
        "AxisTitle": "z"
    }
}