time,Hardware,Voltage,Current
1623354398727,high-voltage,1,0.0642099
time,Hardware,Voltage,Current
1623354398727,high-voltage,2,0.0793676
time,Hardware,Voltage,Current
1623354398727,high-voltage,3,0.0931987
time,Hardware,Voltage,Current
1623354398727,high-voltage,4,0.104339
time,Hardware,Voltage,Current
1623354398727,high-voltage,5,0.114548
time,Hardware,Voltage,Current
1623354398727,high-voltage,6,0.124183
time,Hardware,Voltage,Current
1623354398727,high-voltage,7,0.134316
time,Hardware,Voltage,Current
1623354398727,high-voltage,8,0.143946
time,Hardware,Voltage,Current
1623354398727,high-voltage,9,0.15283
time,Hardware,Voltage,Current
1623354398727,high-voltage,10,0.16372
time,Hardware,Voltage,Current
1623354398727,high-voltage,11,0.172794
time,Hardware,Voltage,Current
1623354398727,high-voltage,12,0.181748
time,Hardware,Voltage,Current
1623354398727,high-voltage,13,0.190027
time,Hardware,Voltage,Current
1623354398727,high-voltage,14,0.19687
time,Hardware,Voltage,Current
1623354398727,high-voltage,15,0.203949
time,Hardware,Voltage,Current
1623354398727,high-voltage,16,0.209539
time,Hardware,Voltage,Current
1623354398727,high-voltage,17,0.214262
time,Hardware,Voltage,Current
1623354398727,high-voltage,18,0.220473
time,Hardware,Voltage,Current
1623354398727,high-voltage,19,0.224575
time,Hardware,Voltage,Current
1623354398727,high-voltage,20,0.229658
time,Hardware,Voltage,Current
1623354398727,high-voltage,25,0.252306
time,Hardware,Voltage,Current
1623354398727,high-voltage,30,0.285217
time,Hardware,Voltage,Current
1623354398727,high-voltage,35,0.375581
time,Hardware,Voltage,Current
1623354398727,high-voltage,40,0.656151
time,Hardware,Voltage,Current
1623354398727,high-voltage,45,1.16584
time,Hardware,Voltage,Current
1623354398727,high-voltage,50,1.8424
time,Hardware,Voltage,Current
1623354398727,high-voltage,2.66958e-06,2.66976
time,Hardware,Voltage,Current
1623354398727,high-voltage,60,3.63485
time,Hardware,Voltage,Current
1623354398727,high-voltage,65,4.74335
time,Hardware,Voltage,Current
1623354398727,high-voltage,70,6.00922
time,Hardware,Voltage,Current
1623354398727,high-voltage,7.44458e-06,7.44419
time,Hardware,Voltage,Current
1623354398727,high-voltage,80,9.03429
time,Hardware,Voltage,Current
1623354398727,high-voltage,85,10
