time,Hardware,Voltage,Current
1625770604064,high-voltage-2,1,0.119242
time,Hardware,Voltage,Current
1625770604064,high-voltage-2,2,0.175591
time,Hardware,Voltage,Current
1625770604064,high-voltage-2,3,0.211912
time,Hardware,Voltage,Current
1625770604064,high-voltage-2,4,0.236386
time,Hardware,Voltage,Current
1625770604064,high-voltage-2,5,0.263484
time,Hardware,Voltage,Current
1625770604064,high-voltage-2,6,0.291478
time,Hardware,Voltage,Current
1625770604064,high-voltage-2,7,0.318763
time,Hardware,Voltage,Current
1625770604064,high-voltage-2,8,0.344796
time,Hardware,Voltage,Current
1625770604064,high-voltage-2,9,0.368411
time,Hardware,Voltage,Current
1625770604064,high-voltage-2,10,0.392449
time,Hardware,Voltage,Current
1625770604064,high-voltage-2,11,0.41125
time,Hardware,Voltage,Current
1625770604064,high-voltage-2,12,0.427932
time,Hardware,Voltage,Current
1625770604064,high-voltage-2,13,0.443197
time,Hardware,Voltage,Current
1625770604064,high-voltage-2,14,0.456746
time,Hardware,Voltage,Current
1625770604064,high-voltage-2,15,0.470228
time,Hardware,Voltage,Current
1625770604064,high-voltage-2,16,0.478036
time,Hardware,Voltage,Current
1625770604064,high-voltage-2,17,0.490266
time,Hardware,Voltage,Current
1625770604064,high-voltage-2,18,0.501376
time,Hardware,Voltage,Current
1625770604064,high-voltage-2,19,0.510682
time,Hardware,Voltage,Current
1625770604064,high-voltage-2,20,0.519322
time,Hardware,Voltage,Current
1625770604064,high-voltage-2,25,0.571773
time,Hardware,Voltage,Current
1625770604064,high-voltage-2,30,0.62451
time,Hardware,Voltage,Current
1625770604064,high-voltage-2,35,0.678514
time,Hardware,Voltage,Current
1625770604064,high-voltage-2,40,0.740366
time,Hardware,Voltage,Current
1625770604064,high-voltage-2,45,0.818191
time,Hardware,Voltage,Current
1625770604064,high-voltage-2,50,0.88037
time,Hardware,Voltage,Current
1625770604064,high-voltage-2,55,0.939217
time,Hardware,Voltage,Current
1625770604064,high-voltage-2,60,0.994501
time,Hardware,Voltage,Current
1625770604064,high-voltage-2,65,1.0489
time,Hardware,Voltage,Current
1625770604064,high-voltage-2,70,1.10143
time,Hardware,Voltage,Current
1625770604064,high-voltage-2,75,1.15182
time,Hardware,Voltage,Current
1625770604064,high-voltage-2,80,1.19849
time,Hardware,Voltage,Current
1625770604064,high-voltage-2,85,1.23847
time,Hardware,Voltage,Current
1625770604064,high-voltage-2,90,1.27371
time,Hardware,Voltage,Current
1625770604064,high-voltage-2,95,1.30314
time,Hardware,Voltage,Current
1625770604064,high-voltage-2,100,1.32812
