{
    "Data": [0.0, 0.0, 0.0, 0.0, 0.0, 0.0, 0.0, 0.0, 0.0, 0.0, 0.0, 0.0, 0.0, 0.0, 1.0, 2.0, 0.0, 16.0, 597.0, 417.0, 30.0, 138.0, 2687.0, 4175.0, 423.0, 338.0, 2201.0, 3680.0, 707.0, 380.0, 1317.0, 2479.0, 895.0, 285.0, 400.0, 518.0, 353.0, 275.0, 488.0, 565.0, 485.0, 542.0, 887.0, 1854.0, 1424.0, 1269.0, 1739.0, 2936.0, 3120.0, 2634.0, 2404.0, 2420.0, 2904.0, 2108.0, 2026.0, 2038.0, 2250.0, 2182.0, 1772.0, 1682.0, 1634.0, 1539.0, 1083.0, 814.0, 841.0, 828.0, 836.0, 583.0, 539.0, 524.0, 550.0, 520.0, 369.0, 299.0, 281.0, 309.0, 260.0, 243.0, 180.0, 185.0, 202.0, 176.0, 138.0, 100.0, 143.0, 121.0, 99.0, 83.0, 84.0, 73.0, 76.0, 87.0, 60.0, 70.0, 54.0, 54.0, 39.0, 57.0, 50.0, 33.0, 31.0, 33.0, 39.0, 40.0, 31.0, 34.0, 13.0, 29.0, 10.0, 15.0, 21.0, 15.0, 18.0, 13.0, 10.0, 11.0, 4.0, 8.0, 7.0, 10.0, 9.0, 5.0, 9.0, 6.0, 5.0, 7.0, 5.0, 4.0, 8.0, 3.0, 6.0, 4.0, 8.0, 3.0, 4.0, 4.0, 4.0, 4.0, 3.0, 3.0, 2.0, 2.0, 1.0, 2.0, 2.0, 2.0, 1.0, 1.0, 2.0, 2.0, 0.0, 1.0, 3.0, 1.0, 2.0, 5.0, 1.0, 3.0, 3.0, 1.0, 1.0, 1.0, 0.0, 0.0, 0.0, 1.0, 2.0, 0.0, 1.0, 1.0, 0.0, 2.0, 0.0, 0.0, 0.0, 0.0, 1.0, 2.0, 0.0, 0.0, 2.0, 2.0, 0.0, 0.0, 0.0, 0.0, 1.0, 1.0, 0.0, 0.0, 0.0, 0.0, 1.0, 0.0, 1.0, 0.0, 0.0, 0.0, 1.0, 0.0, 0.0],
    "Name": "TimePerFitDist-0",
    "Overflow": 72.0,
    "Type": "Histo1d",
    "Underflow": 0.0,
    "x": {
        "AxisTitle": "Fit Time [us]",
        "Bins": 201,
        "High": 401.0,
        "Low": -1.0
    },
    "y": {
        "AxisTitle": "Number of Pixels"
    },
    "z": {
        "AxisTitle": "z"
    }
}