{
    "Data": [[4170.0, 2367.0, 1696.0, 1225.0, 1079.0, 890.0, 869.0, 729.0, 625.0, 639.0, 557.0, 549.0, 501.0, 507.0, 454.0, 482.0, 423.0, 439.0, 397.0, 437.0, 387.0, 386.0, 351.0, 377.0, 353.0, 358.0, 358.0, 324.0, 359.0, 318.0, 326.0, 332.0, 335.0, 335.0, 348.0, 341.0, 331.0, 361.0, 339.0, 352.0, 354.0, 373.0, 361.0, 356.0, 442.0, 399.0, 439.0, 576.0, 564.0], [4244.0, 2360.0, 1673.0, 1247.0, 1078.0, 947.0, 764.0, 774.0, 693.0, 625.0, 580.0, 546.0, 538.0, 498.0, 478.0, 481.0, 412.0, 459.0, 413.0, 426.0, 370.0, 399.0, 358.0, 376.0, 370.0, 338.0, 337.0, 370.0, 319.0, 372.0, 341.0, 373.0, 324.0, 343.0, 305.0, 352.0, 356.0, 301.0, 381.0, 353.0, 383.0, 386.0, 384.0, 411.0, 412.0, 439.0, 488.0, 613.0, 833.0], [4345.0, 2410.0, 1666.0, 1369.0, 1048.0, 908.0, 862.0, 764.0, 639.0, 645.0, 556.0, 561.0, 572.0, 507.0, 464.0, 478.0, 443.0, 462.0, 433.0, 414.0, 426.0, 386.0, 417.0, 359.0, 370.0, 348.0, 366.0, 340.0, 350.0, 359.0, 356.0, 310.0, 349.0, 350.0, 368.0, 344.0, 321.0, 349.0, 373.0, 372.0, 347.0, 355.0, 376.0, 415.0, 429.0, 463.0, 539.0, 648.0, 939.0], [4265.0, 2423.0, 1694.0, 1318.0, 1121.0, 957.0, 864.0, 764.0, 736.0, 612.0, 561.0, 594.0, 548.0, 477.0, 462.0, 474.0, 425.0, 463.0, 399.0, 383.0, 387.0, 422.0, 418.0, 395.0, 363.0, 360.0, 409.0, 359.0, 362.0, 370.0, 350.0, 361.0, 358.0, 344.0, 359.0, 351.0, 353.0, 331.0, 373.0, 354.0, 366.0, 394.0, 417.0, 384.0, 453.0, 513.0, 560.0, 659.0, 1066.0], [4373.0, 2370.0, 1750.0, 1287.0, 1163.0, 927.0, 894.0, 783.0, 655.0, 618.0, 586.0, 546.0, 542.0, 505.0, 514.0, 494.0, 455.0, 463.0, 419.0, 426.0, 375.0, 399.0, 361.0, 371.0, 386.0, 392.0, 339.0, 376.0, 359.0, 372.0, 369.0, 378.0, 330.0, 335.0, 315.0, 359.0, 379.0, 378.0, 368.0, 406.0, 407.0, 426.0, 374.0, 432.0, 452.0, 530.0, 599.0, 755.0, 1054.0], [4395.0, 2404.0, 1683.0, 1334.0, 1099.0, 1000.0, 852.0, 740.0, 695.0, 644.0, 658.0, 607.0, 552.0, 504.0, 513.0, 478.0, 455.0, 435.0, 451.0, 380.0, 378.0, 414.0, 400.0, 395.0, 366.0, 431.0, 375.0, 373.0, 377.0, 343.0, 387.0, 341.0, 390.0, 358.0, 373.0, 339.0, 357.0, 361.0, 381.0, 366.0, 378.0, 415.0, 424.0, 461.0, 457.0, 505.0, 608.0, 746.0, 1152.0], [4448.0, 2489.0, 1707.0, 1320.0, 1135.0, 971.0, 833.0, 763.0, 736.0, 665.0, 647.0, 569.0, 576.0, 526.0, 510.0, 498.0, 491.0, 483.0, 451.0, 413.0, 424.0, 390.0, 364.0, 391.0, 366.0, 374.0, 347.0, 385.0, 351.0, 354.0, 360.0, 386.0, 378.0, 362.0, 377.0, 378.0, 385.0, 400.0, 397.0, 372.0, 371.0, 436.0, 425.0, 444.0, 469.0, 484.0, 612.0, 728.0, 1196.0], [4412.0, 2413.0, 1684.0, 1363.0, 1156.0, 957.0, 880.0, 825.0, 714.0, 647.0, 589.0, 566.0, 545.0, 517.0, 494.0, 519.0, 486.0, 458.0, 418.0, 433.0, 417.0, 372.0, 383.0, 408.0, 378.0, 396.0, 389.0, 379.0, 384.0, 412.0, 387.0, 354.0, 388.0, 362.0, 351.0, 380.0, 356.0, 360.0, 394.0, 368.0, 423.0, 424.0, 409.0, 430.0, 498.0, 547.0, 633.0, 758.0, 1160.0], [4425.0, 2420.0, 1696.0, 1280.0, 1155.0, 1030.0, 827.0, 790.0, 685.0, 687.0, 602.0, 553.0, 558.0, 485.0, 547.0, 505.0, 501.0, 466.0, 464.0, 441.0, 413.0, 389.0, 361.0, 352.0, 391.0, 370.0, 386.0, 354.0, 381.0, 372.0, 359.0, 384.0, 369.0, 356.0, 377.0, 384.0, 403.0, 373.0, 431.0, 381.0, 394.0, 429.0, 440.0, 446.0, 473.0, 520.0, 670.0, 713.0, 1265.0], [4326.0, 2446.0, 1647.0, 1406.0, 1124.0, 904.0, 836.0, 777.0, 677.0, 668.0, 610.0, 571.0, 530.0, 562.0, 505.0, 473.0, 473.0, 441.0, 467.0, 447.0, 443.0, 408.0, 364.0, 369.0, 392.0, 365.0, 389.0, 345.0, 374.0, 369.0, 352.0, 369.0, 365.0, 400.0, 343.0, 405.0, 379.0, 411.0, 386.0, 418.0, 389.0, 417.0, 422.0, 466.0, 521.0, 557.0, 630.0, 767.0, 1285.0], [4384.0, 2340.0, 1682.0, 1307.0, 1089.0, 919.0, 837.0, 726.0, 725.0, 611.0, 592.0, 571.0, 572.0, 531.0, 515.0, 499.0, 488.0, 445.0, 409.0, 431.0, 390.0, 426.0, 392.0, 397.0, 392.0, 403.0, 362.0, 350.0, 379.0, 379.0, 383.0, 364.0, 351.0, 343.0, 374.0, 384.0, 373.0, 355.0, 390.0, 407.0, 385.0, 453.0, 439.0, 471.0, 497.0, 523.0, 657.0, 774.0, 1244.0], [4373.0, 2301.0, 1702.0, 1310.0, 1041.0, 897.0, 839.0, 758.0, 705.0, 613.0, 565.0, 546.0, 503.0, 511.0, 456.0, 455.0, 455.0, 463.0, 464.0, 429.0, 382.0, 404.0, 417.0, 346.0, 380.0, 392.0, 384.0, 360.0, 366.0, 395.0, 333.0, 370.0, 335.0, 412.0, 389.0, 420.0, 367.0, 369.0, 367.0, 379.0, 414.0, 418.0, 412.0, 465.0, 500.0, 508.0, 627.0, 755.0, 1225.0], [4090.0, 2387.0, 1585.0, 1294.0, 1120.0, 879.0, 822.0, 713.0, 689.0, 610.0, 584.0, 549.0, 572.0, 502.0, 489.0, 495.0, 421.0, 447.0, 428.0, 375.0, 427.0, 375.0, 370.0, 347.0, 344.0, 388.0, 347.0, 324.0, 370.0, 384.0, 347.0, 342.0, 381.0, 342.0, 366.0, 367.0, 365.0, 397.0, 368.0, 372.0, 365.0, 398.0, 422.0, 464.0, 491.0, 534.0, 606.0, 788.0, 1218.0], [4264.0, 2309.0, 1617.0, 1250.0, 1054.0, 924.0, 785.0, 726.0, 608.0, 590.0, 543.0, 545.0, 482.0, 498.0, 492.0, 461.0, 454.0, 409.0, 414.0, 415.0, 394.0, 336.0, 356.0, 379.0, 383.0, 340.0, 372.0, 369.0, 374.0, 367.0, 327.0, 339.0, 367.0, 340.0, 329.0, 322.0, 365.0, 387.0, 341.0, 347.0, 382.0, 364.0, 371.0, 437.0, 483.0, 520.0, 590.0, 700.0, 1211.0], [4220.0, 2320.0, 1565.0, 1239.0, 1021.0, 875.0, 754.0, 731.0, 635.0, 573.0, 538.0, 529.0, 478.0, 459.0, 446.0, 474.0, 453.0, 422.0, 429.0, 385.0, 420.0, 377.0, 358.0, 333.0, 350.0, 343.0, 328.0, 338.0, 323.0, 333.0, 330.0, 310.0, 325.0, 307.0, 333.0, 342.0, 326.0, 354.0, 367.0, 384.0, 385.0, 373.0, 375.0, 410.0, 441.0, 481.0, 563.0, 704.0, 1118.0], [4401.0, 2269.0, 1493.0, 1181.0, 1038.0, 862.0, 772.0, 703.0, 617.0, 570.0, 562.0, 548.0, 505.0, 491.0, 399.0, 413.0, 426.0, 379.0, 406.0, 403.0, 356.0, 359.0, 366.0, 383.0, 342.0, 323.0, 331.0, 325.0, 325.0, 328.0, 322.0, 335.0, 306.0, 324.0, 347.0, 334.0, 345.0, 318.0, 371.0, 344.0, 359.0, 367.0, 374.0, 361.0, 407.0, 470.0, 532.0, 635.0, 1029.0], [4742.0, 2415.0, 1562.0, 1229.0, 1005.0, 868.0, 750.0, 655.0, 602.0, 527.0, 496.0, 519.0, 488.0, 460.0, 462.0, 427.0, 401.0, 382.0, 388.0, 385.0, 369.0, 342.0, 372.0, 342.0, 338.0, 297.0, 303.0, 301.0, 308.0, 333.0, 326.0, 356.0, 292.0, 298.0, 293.0, 345.0, 312.0, 298.0, 321.0, 347.0, 355.0, 359.0, 342.0, 370.0, 398.0, 465.0, 504.0, 634.0, 923.0], [5367.0, 2610.0, 1730.0, 1243.0, 938.0, 834.0, 717.0, 681.0, 609.0, 586.0, 552.0, 499.0, 465.0, 427.0, 429.0, 418.0, 379.0, 350.0, 412.0, 339.0, 349.0, 346.0, 334.0, 327.0, 316.0, 309.0, 321.0, 294.0, 321.0, 321.0, 306.0, 292.0, 336.0, 291.0, 309.0, 332.0, 318.0, 301.0, 316.0, 316.0, 324.0, 322.0, 358.0, 368.0, 383.0, 414.0, 474.0, 612.0, 900.0], [6294.0, 2995.0, 1967.0, 1374.0, 1029.0, 900.0, 766.0, 704.0, 597.0, 550.0, 503.0, 517.0, 431.0, 435.0, 403.0, 420.0, 406.0, 398.0, 348.0, 318.0, 347.0, 352.0, 341.0, 315.0, 309.0, 317.0, 290.0, 311.0, 331.0, 292.0, 294.0, 292.0, 289.0, 295.0, 323.0, 314.0, 272.0, 300.0, 313.0, 301.0, 318.0, 325.0, 338.0, 365.0, 351.0, 391.0, 442.0, 606.0, 770.0], [7282.0, 3626.0, 2313.0, 1639.0, 1234.0, 955.0, 843.0, 729.0, 625.0, 586.0, 530.0, 522.0, 478.0, 426.0, 429.0, 401.0, 377.0, 397.0, 360.0, 322.0, 322.0, 346.0, 334.0, 287.0, 323.0, 333.0, 305.0, 267.0, 309.0, 329.0, 277.0, 279.0, 268.0, 299.0, 287.0, 303.0, 278.0, 291.0, 295.0, 313.0, 304.0, 328.0, 330.0, 316.0, 362.0, 335.0, 420.0, 499.0, 744.0], [7746.0, 4293.0, 2901.0, 2048.0, 1576.0, 1235.0, 1017.0, 895.0, 720.0, 653.0, 617.0, 514.0, 509.0, 447.0, 457.0, 391.0, 411.0, 374.0, 349.0, 340.0, 326.0, 338.0, 304.0, 321.0, 306.0, 284.0, 308.0, 292.0, 307.0, 305.0, 277.0, 230.0, 285.0, 310.0, 291.0, 289.0, 286.0, 281.0, 303.0, 293.0, 299.0, 283.0, 302.0, 301.0, 336.0, 361.0, 376.0, 487.0, 676.0], [7767.0, 4568.0, 3345.0, 2489.0, 1984.0, 1549.0, 1345.0, 1094.0, 945.0, 820.0, 723.0, 643.0, 631.0, 551.0, 469.0, 435.0, 437.0, 399.0, 375.0, 366.0, 363.0, 291.0, 315.0, 302.0, 312.0, 298.0, 295.0, 300.0, 249.0, 296.0, 289.0, 279.0, 297.0, 311.0, 271.0, 254.0, 274.0, 274.0, 291.0, 280.0, 272.0, 306.0, 289.0, 320.0, 283.0, 322.0, 373.0, 428.0, 681.0], [7155.0, 4618.0, 3405.0, 2655.0, 2263.0, 1910.0, 1633.0, 1344.0, 1234.0, 1064.0, 938.0, 893.0, 759.0, 643.0, 605.0, 552.0, 557.0, 516.0, 479.0, 411.0, 409.0, 379.0, 338.0, 332.0, 323.0, 325.0, 294.0, 302.0, 324.0, 294.0, 293.0, 273.0, 269.0, 252.0, 268.0, 279.0, 282.0, 293.0, 265.0, 271.0, 264.0, 256.0, 296.0, 295.0, 328.0, 298.0, 355.0, 398.0, 617.0], [6134.0, 4175.0, 3295.0, 2809.0, 2349.0, 2009.0, 1815.0, 1643.0, 1431.0, 1348.0, 1182.0, 1136.0, 983.0, 909.0, 787.0, 728.0, 707.0, 630.0, 584.0, 578.0, 522.0, 460.0, 478.0, 407.0, 421.0, 377.0, 374.0, 361.0, 315.0, 310.0, 321.0, 331.0, 295.0, 249.0, 298.0, 292.0, 275.0, 258.0, 278.0, 283.0, 294.0, 273.0, 300.0, 281.0, 277.0, 315.0, 371.0, 381.0, 553.0], [5323.0, 3478.0, 2892.0, 2426.0, 2113.0, 1995.0, 1787.0, 1684.0, 1561.0, 1427.0, 1370.0, 1244.0, 1159.0, 1093.0, 1022.0, 944.0, 924.0, 870.0, 776.0, 713.0, 657.0, 684.0, 632.0, 594.0, 536.0, 479.0, 453.0, 443.0, 410.0, 429.0, 428.0, 410.0, 355.0, 326.0, 339.0, 340.0, 280.0, 293.0, 288.0, 328.0, 320.0, 298.0, 306.0, 276.0, 272.0, 322.0, 322.0, 369.0, 526.0], [4731.0, 2990.0, 2398.0, 2098.0, 1817.0, 1647.0, 1616.0, 1501.0, 1386.0, 1431.0, 1340.0, 1319.0, 1222.0, 1166.0, 1053.0, 1047.0, 1020.0, 955.0, 1044.0, 876.0, 868.0, 831.0, 825.0, 749.0, 741.0, 678.0, 629.0, 598.0, 558.0, 583.0, 530.0, 496.0, 490.0, 454.0, 418.0, 435.0, 422.0, 418.0, 408.0, 319.0, 339.0, 342.0, 321.0, 319.0, 339.0, 357.0, 335.0, 387.0, 500.0], [4326.0, 2520.0, 2001.0, 1796.0, 1533.0, 1441.0, 1383.0, 1348.0, 1115.0, 1154.0, 1196.0, 1111.0, 1066.0, 1034.0, 1064.0, 1081.0, 1013.0, 1011.0, 943.0, 986.0, 920.0, 910.0, 932.0, 891.0, 876.0, 863.0, 815.0, 753.0, 814.0, 762.0, 678.0, 663.0, 665.0, 619.0, 618.0, 601.0, 567.0, 524.0, 554.0, 498.0, 549.0, 444.0, 469.0, 440.0, 389.0, 410.0, 411.0, 420.0, 498.0], [4040.0, 2463.0, 1753.0, 1463.0, 1242.0, 1124.0, 1063.0, 1030.0, 1007.0, 1030.0, 979.0, 904.0, 959.0, 925.0, 892.0, 879.0, 895.0, 925.0, 845.0, 943.0, 844.0, 882.0, 872.0, 970.0, 858.0, 884.0, 804.0, 859.0, 866.0, 844.0, 821.0, 883.0, 828.0, 858.0, 806.0, 811.0, 812.0, 766.0, 785.0, 667.0, 695.0, 653.0, 656.0, 622.0, 585.0, 570.0, 560.0, 531.0, 660.0], [3805.0, 2247.0, 1612.0, 1296.0, 1174.0, 1034.0, 944.0, 922.0, 851.0, 813.0, 752.0, 780.0, 742.0, 770.0, 728.0, 786.0, 730.0, 784.0, 780.0, 741.0, 781.0, 846.0, 739.0, 718.0, 816.0, 830.0, 811.0, 781.0, 815.0, 881.0, 814.0, 853.0, 867.0, 861.0, 872.0, 925.0, 854.0, 907.0, 912.0, 885.0, 912.0, 892.0, 906.0, 859.0, 930.0, 903.0, 875.0, 859.0, 936.0], [3909.0, 2194.0, 1528.0, 1200.0, 1062.0, 917.0, 806.0, 773.0, 739.0, 671.0, 646.0, 637.0, 563.0, 585.0, 635.0, 570.0, 602.0, 622.0, 595.0, 640.0, 598.0, 607.0, 639.0, 667.0, 629.0, 736.0, 684.0, 758.0, 747.0, 712.0, 798.0, 764.0, 790.0, 807.0, 936.0, 918.0, 911.0, 969.0, 993.0, 1019.0, 1030.0, 1091.0, 1081.0, 1181.0, 1153.0, 1224.0, 1285.0, 1300.0, 1453.0], [3787.0, 2077.0, 1462.0, 1177.0, 1075.0, 875.0, 749.0, 714.0, 598.0, 638.0, 579.0, 556.0, 581.0, 527.0, 532.0, 471.0, 518.0, 506.0, 497.0, 465.0, 517.0, 494.0, 489.0, 499.0, 481.0, 572.0, 531.0, 553.0, 590.0, 623.0, 645.0, 680.0, 690.0, 686.0, 742.0, 812.0, 782.0, 867.0, 976.0, 983.0, 1032.0, 1161.0, 1165.0, 1220.0, 1378.0, 1511.0, 1597.0, 1829.0, 2244.0], [3752.0, 2123.0, 1389.0, 1085.0, 900.0, 785.0, 757.0, 665.0, 627.0, 614.0, 574.0, 504.0, 503.0, 446.0, 443.0, 402.0, 446.0, 421.0, 409.0, 418.0, 387.0, 394.0, 402.0, 425.0, 410.0, 418.0, 484.0, 481.0, 469.0, 463.0, 567.0, 513.0, 574.0, 548.0, 627.0, 648.0, 691.0, 702.0, 758.0, 789.0, 892.0, 963.0, 1115.0, 1255.0, 1423.0, 1610.0, 1983.0, 2237.0, 2893.0], [3646.0, 2083.0, 1489.0, 1130.0, 938.0, 759.0, 713.0, 670.0, 544.0, 553.0, 523.0, 407.0, 465.0, 417.0, 422.0, 461.0, 410.0, 407.0, 388.0, 352.0, 368.0, 410.0, 391.0, 335.0, 377.0, 370.0, 347.0, 383.0, 366.0, 373.0, 365.0, 392.0, 421.0, 405.0, 458.0, 481.0, 507.0, 558.0, 584.0, 662.0, 718.0, 783.0, 904.0, 1004.0, 1166.0, 1514.0, 1891.0, 2377.0, 3453.0], [3730.0, 2029.0, 1458.0, 1139.0, 883.0, 775.0, 636.0, 618.0, 551.0, 472.0, 476.0, 482.0, 417.0, 381.0, 381.0, 392.0, 398.0, 389.0, 358.0, 336.0, 377.0, 370.0, 340.0, 328.0, 332.0, 308.0, 334.0, 304.0, 319.0, 309.0, 304.0, 387.0, 334.0, 329.0, 342.0, 366.0, 391.0, 416.0, 422.0, 485.0, 549.0, 567.0, 688.0, 796.0, 1026.0, 1205.0, 1530.0, 2112.0, 3622.0], [3754.0, 2078.0, 1415.0, 1097.0, 1017.0, 835.0, 693.0, 589.0, 518.0, 532.0, 436.0, 474.0, 459.0, 413.0, 384.0, 418.0, 401.0, 318.0, 359.0, 322.0, 370.0, 311.0, 302.0, 271.0, 310.0, 285.0, 322.0, 282.0, 309.0, 275.0, 301.0, 280.0, 345.0, 322.0, 318.0, 287.0, 283.0, 298.0, 354.0, 340.0, 404.0, 399.0, 491.0, 583.0, 707.0, 864.0, 1227.0, 1788.0, 3162.0], [3698.0, 1971.0, 1421.0, 1141.0, 897.0, 814.0, 695.0, 625.0, 573.0, 458.0, 439.0, 471.0, 421.0, 377.0, 421.0, 410.0, 371.0, 357.0, 337.0, 352.0, 292.0, 314.0, 343.0, 244.0, 313.0, 325.0, 281.0, 264.0, 253.0, 289.0, 279.0, 284.0, 234.0, 281.0, 267.0, 293.0, 309.0, 298.0, 320.0, 290.0, 324.0, 330.0, 370.0, 396.0, 497.0, 568.0, 850.0, 1338.0, 2637.0], [3644.0, 2046.0, 1429.0, 1088.0, 912.0, 800.0, 699.0, 614.0, 502.0, 468.0, 450.0, 475.0, 421.0, 385.0, 383.0, 341.0, 355.0, 316.0, 298.0, 324.0, 366.0, 294.0, 291.0, 278.0, 315.0, 289.0, 298.0, 261.0, 282.0, 262.0, 264.0, 255.0, 244.0, 247.0, 241.0, 255.0, 244.0, 278.0, 247.0, 256.0, 257.0, 288.0, 278.0, 312.0, 337.0, 453.0, 595.0, 906.0, 1868.0], [3587.0, 2132.0, 1377.0, 1137.0, 937.0, 788.0, 652.0, 595.0, 549.0, 516.0, 494.0, 423.0, 400.0, 382.0, 341.0, 390.0, 373.0, 354.0, 298.0, 281.0, 256.0, 291.0, 312.0, 302.0, 275.0, 297.0, 242.0, 269.0, 282.0, 280.0, 238.0, 247.0, 247.0, 272.0, 255.0, 261.0, 251.0, 201.0, 251.0, 227.0, 275.0, 252.0, 287.0, 251.0, 294.0, 312.0, 397.0, 606.0, 1340.0], [3599.0, 2067.0, 1533.0, 1058.0, 916.0, 799.0, 649.0, 610.0, 551.0, 495.0, 465.0, 410.0, 400.0, 415.0, 362.0, 371.0, 337.0, 368.0, 327.0, 326.0, 307.0, 299.0, 270.0, 330.0, 273.0, 276.0, 291.0, 241.0, 242.0, 248.0, 262.0, 248.0, 261.0, 289.0, 220.0, 230.0, 225.0, 235.0, 237.0, 231.0, 217.0, 247.0, 230.0, 227.0, 250.0, 259.0, 312.0, 440.0, 834.0], [3655.0, 2081.0, 1452.0, 1095.0, 891.0, 726.0, 692.0, 621.0, 555.0, 511.0, 482.0, 422.0, 418.0, 379.0, 376.0, 357.0, 352.0, 381.0, 304.0, 324.0, 326.0, 282.0, 302.0, 282.0, 268.0, 271.0, 256.0, 235.0, 278.0, 236.0, 266.0, 229.0, 257.0, 230.0, 235.0, 247.0, 236.0, 228.0, 221.0, 211.0, 247.0, 218.0, 236.0, 281.0, 292.0, 227.0, 244.0, 340.0, 601.0], [3713.0, 2045.0, 1484.0, 1091.0, 932.0, 747.0, 620.0, 624.0, 534.0, 496.0, 478.0, 418.0, 416.0, 377.0, 381.0, 380.0, 331.0, 347.0, 325.0, 300.0, 320.0, 300.0, 277.0, 275.0, 281.0, 263.0, 291.0, 281.0, 246.0, 247.0, 249.0, 246.0, 251.0, 230.0, 250.0, 224.0, 225.0, 244.0, 239.0, 238.0, 208.0, 258.0, 230.0, 236.0, 257.0, 254.0, 218.0, 287.0, 453.0], [3523.0, 2065.0, 1475.0, 1104.0, 924.0, 769.0, 636.0, 628.0, 543.0, 482.0, 470.0, 478.0, 434.0, 371.0, 362.0, 369.0, 316.0, 375.0, 341.0, 333.0, 274.0, 302.0, 297.0, 248.0, 263.0, 272.0, 257.0, 257.0, 244.0, 249.0, 234.0, 245.0, 231.0, 236.0, 226.0, 235.0, 253.0, 238.0, 259.0, 226.0, 235.0, 212.0, 254.0, 229.0, 265.0, 245.0, 203.0, 253.0, 367.0], [3637.0, 2067.0, 1451.0, 1112.0, 939.0, 798.0, 627.0, 587.0, 538.0, 472.0, 490.0, 432.0, 412.0, 421.0, 388.0, 313.0, 386.0, 344.0, 321.0, 323.0, 257.0, 296.0, 273.0, 291.0, 278.0, 277.0, 252.0, 258.0, 267.0, 256.0, 235.0, 217.0, 232.0, 265.0, 219.0, 235.0, 224.0, 244.0, 249.0, 210.0, 216.0, 238.0, 245.0, 256.0, 252.0, 222.0, 253.0, 239.0, 309.0], [3663.0, 2011.0, 1451.0, 1139.0, 898.0, 747.0, 680.0, 607.0, 501.0, 517.0, 473.0, 437.0, 394.0, 404.0, 416.0, 363.0, 362.0, 341.0, 319.0, 289.0, 304.0, 309.0, 267.0, 297.0, 328.0, 280.0, 237.0, 271.0, 275.0, 230.0, 254.0, 250.0, 242.0, 252.0, 227.0, 221.0, 219.0, 245.0, 212.0, 205.0, 234.0, 259.0, 204.0, 271.0, 234.0, 253.0, 220.0, 253.0, 308.0], [3650.0, 2038.0, 1462.0, 1087.0, 952.0, 777.0, 674.0, 554.0, 514.0, 500.0, 513.0, 459.0, 441.0, 390.0, 363.0, 353.0, 376.0, 321.0, 314.0, 324.0, 321.0, 285.0, 248.0, 282.0, 264.0, 294.0, 268.0, 250.0, 258.0, 245.0, 238.0, 252.0, 234.0, 244.0, 251.0, 236.0, 229.0, 264.0, 243.0, 234.0, 248.0, 246.0, 201.0, 222.0, 263.0, 224.0, 232.0, 268.0, 267.0], [3673.0, 2082.0, 1425.0, 1208.0, 926.0, 762.0, 648.0, 630.0, 506.0, 518.0, 478.0, 440.0, 408.0, 355.0, 418.0, 347.0, 327.0, 320.0, 324.0, 330.0, 306.0, 289.0, 281.0, 270.0, 258.0, 289.0, 267.0, 267.0, 240.0, 247.0, 260.0, 241.0, 216.0, 252.0, 232.0, 238.0, 227.0, 200.0, 247.0, 221.0, 247.0, 245.0, 235.0, 216.0, 214.0, 220.0, 223.0, 271.0, 298.0], [3631.0, 1971.0, 1444.0, 1168.0, 971.0, 788.0, 641.0, 638.0, 565.0, 493.0, 453.0, 431.0, 403.0, 410.0, 390.0, 356.0, 372.0, 331.0, 326.0, 281.0, 317.0, 276.0, 300.0, 235.0, 282.0, 268.0, 267.0, 258.0, 264.0, 245.0, 267.0, 237.0, 245.0, 276.0, 221.0, 222.0, 253.0, 216.0, 228.0, 223.0, 235.0, 212.0, 215.0, 224.0, 218.0, 230.0, 234.0, 269.0, 301.0], [3577.0, 2122.0, 1509.0, 1120.0, 904.0, 826.0, 637.0, 607.0, 542.0, 488.0, 440.0, 407.0, 410.0, 391.0, 378.0, 334.0, 355.0, 332.0, 321.0, 287.0, 297.0, 334.0, 286.0, 255.0, 296.0, 278.0, 276.0, 266.0, 246.0, 242.0, 221.0, 290.0, 254.0, 241.0, 234.0, 233.0, 246.0, 246.0, 258.0, 201.0, 200.0, 236.0, 227.0, 248.0, 206.0, 226.0, 245.0, 282.0, 275.0], [3844.0, 1970.0, 1488.0, 1147.0, 884.0, 810.0, 651.0, 600.0, 606.0, 475.0, 472.0, 451.0, 400.0, 390.0, 360.0, 318.0, 330.0, 306.0, 315.0, 299.0, 331.0, 304.0, 312.0, 309.0, 277.0, 265.0, 275.0, 244.0, 250.0, 272.0, 237.0, 229.0, 266.0, 224.0, 242.0, 240.0, 267.0, 241.0, 220.0, 228.0, 215.0, 213.0, 234.0, 227.0, 212.0, 241.0, 240.0, 244.0, 305.0], [3593.0, 2091.0, 1461.0, 1182.0, 900.0, 751.0, 643.0, 546.0, 602.0, 519.0, 501.0, 446.0, 395.0, 353.0, 390.0, 348.0, 325.0, 322.0, 287.0, 300.0, 309.0, 293.0, 304.0, 294.0, 279.0, 311.0, 256.0, 249.0, 298.0, 254.0, 257.0, 222.0, 242.0, 285.0, 246.0, 228.0, 216.0, 231.0, 229.0, 221.0, 197.0, 232.0, 210.0, 236.0, 216.0, 232.0, 265.0, 245.0, 255.0], [3616.0, 1981.0, 1524.0, 1115.0, 917.0, 756.0, 670.0, 625.0, 559.0, 461.0, 447.0, 464.0, 428.0, 398.0, 342.0, 360.0, 336.0, 326.0, 327.0, 346.0, 285.0, 322.0, 285.0, 255.0, 294.0, 272.0, 262.0, 272.0, 276.0, 271.0, 265.0, 245.0, 236.0, 226.0, 225.0, 227.0, 244.0, 230.0, 244.0, 238.0, 199.0, 229.0, 215.0, 206.0, 252.0, 259.0, 221.0, 274.0, 306.0]],
    "Name": "sCurve-0",
    "Overflow": 2536242.0,
    "Type": "Histo2d",
    "Underflow": 0.0,
    "x": {
        "AxisTitle": "Vcal",
        "Bins": 51,
        "High": 302.5,
        "Low": 47.5
    },
    "y": {
        "AxisTitle": "Occupancy",
        "Bins": 49,
        "High": 49.5,
        "Low": 0.5
    },
    "z": {
        "AxisTitle": "Number of pixels"
    }
}