{
    "Data": [778.0, 2610.0, 453.0, 126.0, 224.0, 237.0, 205.0, 176.0, 232.0, 350.0, 610.0, 1332.0, 2405.0, 3663.0, 4323.0, 4257.0, 3592.0, 2829.0, 2505.0, 2384.0, 2403.0, 2340.0, 1912.0, 1623.0, 1089.0, 763.0, 535.0, 415.0, 368.0, 317.0, 321.0, 254.0, 262.0, 288.0, 270.0, 303.0, 271.0, 246.0, 265.0, 225.0, 269.0, 257.0, 216.0, 246.0, 256.0, 270.0, 235.0, 252.0, 216.0, 185.0, 194.0, 183.0, 183.0, 175.0, 188.0, 145.0, 175.0, 172.0, 175.0, 140.0, 140.0, 142.0, 160.0, 128.0, 141.0, 140.0, 109.0, 104.0, 122.0, 126.0, 104.0, 106.0, 89.0, 74.0, 86.0, 104.0, 84.0, 81.0, 78.0, 70.0, 78.0, 72.0, 71.0, 64.0, 68.0, 69.0, 62.0, 64.0, 65.0, 48.0, 60.0, 58.0, 43.0, 48.0, 54.0, 46.0, 40.0, 50.0, 32.0, 38.0, 41.0, 28.0, 40.0, 38.0, 43.0, 38.0, 32.0, 39.0, 42.0, 35.0, 32.0, 35.0, 35.0, 37.0, 32.0, 33.0, 26.0, 31.0, 33.0, 34.0, 28.0, 23.0, 29.0, 24.0, 18.0, 30.0, 12.0, 26.0, 30.0, 20.0, 22.0, 18.0, 24.0, 27.0, 17.0, 18.0, 15.0, 19.0, 15.0, 22.0, 11.0, 15.0, 11.0, 14.0, 12.0, 17.0, 12.0, 12.0, 12.0, 12.0, 12.0, 14.0, 17.0, 8.0, 13.0, 16.0, 5.0, 7.0, 4.0, 5.0, 3.0, 6.0, 10.0, 10.0, 13.0, 9.0, 8.0, 6.0, 4.0, 5.0, 5.0, 4.0, 2.0, 9.0, 4.0, 6.0, 5.0, 6.0, 1.0, 6.0, 7.0, 4.0, 2.0, 6.0, 3.0, 3.0, 0.0],
    "Name": "NoiseDist-0",
    "Overflow": 290.0,
    "Type": "Histo1d",
    "Underflow": 0.0,
    "x": {
        "AxisTitle": "Noise [e]",
        "Bins": 187,
        "High": 936.0,
        "Low": -2.0
    },
    "y": {
        "AxisTitle": "Number of Pixels"
    },
    "z": {
        "AxisTitle": "z"
    }
}