time,Hardware,Voltage,Current
1623285308156,high-voltage,1,0.0262146
time,Hardware,Voltage,Current
1623285308156,high-voltage,2,0.0338014
time,Hardware,Voltage,Current
1623285308156,high-voltage,3,0.0417132
time,Hardware,Voltage,Current
1623285308156,high-voltage,4,0.0461129
time,Hardware,Voltage,Current
1623285308156,high-voltage,5,0.0528254
time,Hardware,Voltage,Current
1623285308156,high-voltage,6,0.0576998
time,Hardware,Voltage,Current
1623285308156,high-voltage,7,0.0624412
time,Hardware,Voltage,Current
1623285308156,high-voltage,8,0.067987
time,Hardware,Voltage,Current
1623285308156,high-voltage,9,0.0724707
time,Hardware,Voltage,Current
1623285308156,high-voltage,10,0.0777969
time,Hardware,Voltage,Current
1623285308156,high-voltage,11,0.0814614
time,Hardware,Voltage,Current
1623285308156,high-voltage,12,0.0858267
time,Hardware,Voltage,Current
1623285308156,high-voltage,13,0.0884406
time,Hardware,Voltage,Current
1623285308156,high-voltage,14,0.0916363
time,Hardware,Voltage,Current
1623285308156,high-voltage,15,0.0933525
time,Hardware,Voltage,Current
1623285308156,high-voltage,16,0.097079
time,Hardware,Voltage,Current
1623285308156,high-voltage,17,0.0990546
time,Hardware,Voltage,Current
1623285308156,high-voltage,18,0.101321
time,Hardware,Voltage,Current
1623285308156,high-voltage,19,0.104245
time,Hardware,Voltage,Current
1623285308156,high-voltage,20,0.106153
time,Hardware,Voltage,Current
1623285308156,high-voltage,25,0.118154
time,Hardware,Voltage,Current
1623285308156,high-voltage,30,0.133784
time,Hardware,Voltage,Current
1623285308156,high-voltage,35,0.187904
time,Hardware,Voltage,Current
1623285308156,high-voltage,40,0.387359
time,Hardware,Voltage,Current
1623285308156,high-voltage,8.13992e-07,0.81457
time,Hardware,Voltage,Current
1623285308156,high-voltage,50,1.43833
time,Hardware,Voltage,Current
1623285308156,high-voltage,55,2.2387
time,Hardware,Voltage,Current
1623285308156,high-voltage,60,3.19152
time,Hardware,Voltage,Current
1623285308156,high-voltage,65,4.29805
time,Hardware,Voltage,Current
1623285308156,high-voltage,70,5.56633
time,Hardware,Voltage,Current
1623285308156,high-voltage,75,7.02238
time,Hardware,Voltage,Current
1623285308156,high-voltage,80,8.67495
time,Hardware,Voltage,Current
1623285308156,high-voltage,85,10
