time,Hardware,Voltage,Current
1626731130179,high-voltage,1,0.054202
time,Hardware,Voltage,Current
1626731130179,high-voltage,2,0.0764076
time,Hardware,Voltage,Current
1626731130179,high-voltage,3,0.0898222
time,Hardware,Voltage,Current
1626731130179,high-voltage,4,0.101343
time,Hardware,Voltage,Current
1626731130179,high-voltage,5,0.111124
time,Hardware,Voltage,Current
1626731130179,high-voltage,6,0.122044
time,Hardware,Voltage,Current
1626731130179,high-voltage,7,0.134751
time,Hardware,Voltage,Current
1626731130179,high-voltage,8,0.14799
time,Hardware,Voltage,Current
1626731130179,high-voltage,9,0.162706
time,Hardware,Voltage,Current
1626731130179,high-voltage,10,0.177711
time,Hardware,Voltage,Current
1626731130179,high-voltage,11,0.190069
time,Hardware,Voltage,Current
1626731130179,high-voltage,12,0.203292
time,Hardware,Voltage,Current
1626731130179,high-voltage,13,0.214883
time,Hardware,Voltage,Current
1626731130179,high-voltage,14,0.224752
time,Hardware,Voltage,Current
1626731130179,high-voltage,15,0.233109
time,Hardware,Voltage,Current
1626731130179,high-voltage,16,0.240405
time,Hardware,Voltage,Current
1626731130179,high-voltage,17,0.247644
time,Hardware,Voltage,Current
1626731130179,high-voltage,18,0.254728
time,Hardware,Voltage,Current
1626731130179,high-voltage,19,0.260401
time,Hardware,Voltage,Current
1626731130179,high-voltage,20,0.26777
time,Hardware,Voltage,Current
1626731130179,high-voltage,25,0.296887
time,Hardware,Voltage,Current
1626731130179,high-voltage,30,0.33566
time,Hardware,Voltage,Current
1626731130179,high-voltage,35,0.409327
time,Hardware,Voltage,Current
1626731130179,high-voltage,40,0.585127
time,Hardware,Voltage,Current
1626731130179,high-voltage,45,0.942967
time,Hardware,Voltage,Current
1626731130179,high-voltage,50,1.58128
time,Hardware,Voltage,Current
1626731130179,high-voltage,55,2.62048
time,Hardware,Voltage,Current
1626731130179,high-voltage,60,4.16649
time,Hardware,Voltage,Current
1626731130179,high-voltage,65,6.35419
time,Hardware,Voltage,Current
1626731130179,high-voltage,70,9.24862
time,Hardware,Voltage,Current
1626731130179,high-voltage,75,10
time,Hardware,Voltage,Current
1626731130179,high-voltage,80,10
time,Hardware,Voltage,Current
1626731130179,high-voltage,85,10
