{
    "Data": [0.0, 0.0, 8.0, 11.0, 12.0, 7.0, 13.0, 14.0, 22.0, 20.0, 25.0, 19.0, 25.0, 29.0, 32.0, 42.0, 43.0, 49.0, 45.0, 67.0, 73.0, 87.0, 101.0, 130.0, 164.0, 170.0, 213.0, 198.0, 282.0, 366.0, 409.0, 480.0, 527.0, 570.0, 653.0, 761.0, 777.0, 879.0, 938.0, 1093.0, 1260.0, 1456.0, 1777.0, 2279.0, 2702.0, 3358.0, 3852.0, 3962.0, 3876.0, 3520.0, 2951.0, 2337.0, 1802.0, 1418.0, 982.0, 793.0, 575.0, 486.0, 400.0, 342.0, 283.0, 251.0, 186.0, 146.0, 142.0, 122.0, 107.0, 92.0, 84.0, 61.0, 37.0, 47.0, 34.0, 24.0, 27.0, 31.0, 18.0, 27.0, 18.0, 21.0, 9.0, 20.0, 19.0, 18.0, 8.0, 14.0, 16.0, 7.0, 10.0, 9.0, 10.0],
    "Name": "ThresholdDist-0",
    "Overflow": 192.0,
    "Type": "Histo1d",
    "Underflow": 0.0,
    "x": {
        "AxisTitle": "Threshold [e]",
        "Bins": 91,
        "High": 1385.0,
        "Low": 475.0
    },
    "y": {
        "AxisTitle": "Number of Pixels"
    },
    "z": {
        "AxisTitle": "z"
    }
}