{
    "Data": [0.0, 0.0, 0.0, 0.0, 0.0, 0.0, 0.0, 0.0, 0.0, 0.0, 0.0, 0.0, 0.0, 0.0, 0.0, 0.0, 0.0, 0.0, 0.0, 0.0, 0.0, 0.0, 0.0, 0.0, 0.0, 0.0, 0.0, 0.0, 0.0, 0.0, 0.0, 0.0, 0.0, 0.0, 0.0, 0.0, 0.0, 0.0, 0.0, 0.0, 0.0, 0.0, 0.0, 0.0, 0.0, 0.0, 0.0, 0.0, 0.0, 0.0, 10.0, 18.0, 22.0, 34.0, 43.0, 22.0, 47.0, 72.0, 47.0, 84.0, 97.0, 115.0, 161.0, 155.0, 177.0, 220.0, 229.0, 283.0, 281.0, 335.0, 405.0, 430.0, 433.0, 545.0, 592.0, 646.0, 704.0, 750.0, 787.0, 845.0, 830.0, 927.0, 942.0, 1007.0, 1089.0, 1303.0, 1458.0, 1724.0, 2022.0, 2388.0, 2847.0, 2965.0, 3183.0, 3167.0, 2888.0, 2621.0, 2312.0, 1935.0, 1577.0, 1218.0, 937.0, 713.0, 550.0, 448.0, 393.0, 280.0, 225.0, 212.0, 132.0, 139.0, 106.0, 92.0, 72.0, 61.0, 62.0, 42.0, 35.0, 32.0, 38.0, 36.0, 33.0, 26.0, 22.0, 22.0, 9.0, 21.0, 13.0, 9.0, 11.0, 18.0, 12.0, 13.0, 12.0, 12.0, 14.0, 12.0, 12.0, 6.0, 10.0, 1.0, 7.0, 8.0, 14.0, 10.0, 8.0, 14.0, 19.0, 12.0, 16.0, 20.0, 28.0, 31.0, 36.0, 38.0, 58.0, 65.0, 97.0, 92.0, 113.0, 130.0, 141.0, 182.0, 216.0, 241.0, 296.0, 299.0, 351.0, 390.0, 409.0, 456.0, 568.0, 510.0, 640.0, 625.0, 682.0, 673.0, 736.0, 807.0, 752.0, 840.0, 851.0, 775.0, 803.0, 840.0, 803.0, 777.0, 737.0, 804.0, 711.0, 674.0, 672.0, 569.0, 551.0, 541.0, 478.0, 416.0, 404.0, 321.0, 286.0, 246.0, 206.0, 200.0, 185.0, 169.0, 137.0, 109.0, 106.0, 79.0, 80.0, 54.0, 47.0, 35.0, 33.0, 22.0, 16.0, 18.0, 15.0, 8.0, 8.0, 7.0, 4.0, 12.0, 7.0, 5.0, 5.0, 2.0, 5.0, 4.0, 6.0, 2.0, 4.0, 0.0, 2.0, 2.0, 0.0, 0.0, 0.0, 0.0, 0.0, 0.0, 0.0, 0.0, 0.0, 0.0, 0.0, 0.0, 0.0, 2.0, 0.0, 0.0, 0.0, 0.0, 0.0, 0.0, 0.0, 0.0, 0.0, 0.0, 0.0, 0.0, 0.0, 0.0, 0.0, 0.0, 0.0, 0.0, 0.0, 0.0, 0.0, 0.0, 0.0, 0.0, 0.0, 0.0, 0.0, 0.0, 0.0, 0.0, 0.0, 0.0, 0.0, 0.0, 0.0, 0.0, 0.0, 0.0, 0.0, 0.0, 0.0, 0.0, 0.0, 0.0, 0.0, 0.0, 0.0, 0.0, 0.0, 0.0, 0.0, 0.0, 0.0, 0.0, 0.0, 0.0, 0.0, 0.0, 0.0, 0.0, 0.0, 0.0, 0.0, 0.0, 0.0, 0.0, 0.0, 0.0, 0.0, 0.0, 0.0, 0.0, 0.0, 0.0, 0.0, 0.0, 0.0, 0.0, 0.0, 0.0, 0.0, 0.0, 0.0, 0.0, 0.0, 0.0, 0.0, 0.0, 0.0, 0.0, 0.0],
    "Name": "ThresholdDist-0",
    "Overflow": 0.0,
    "Type": "Histo1d",
    "Underflow": 0.0,
    "x": {
        "AxisTitle": "Threshold [e]",
        "Bins": 339,
        "High": 3385.0,
        "Low": -5.0
    },
    "y": {
        "AxisTitle": "Number of Pixels"
    },
    "z": {
        "AxisTitle": "z"
    }
}