time,Hardware,Voltage,Current
1622015402810,high-voltage,1,0.147752
time,Hardware,Voltage,Current
1622015402810,high-voltage,2,0.269348
time,Hardware,Voltage,Current
1622015402810,high-voltage,3,0.391557
time,Hardware,Voltage,Current
1622015402810,high-voltage,4,0.513503
time,Hardware,Voltage,Current
1622015402810,high-voltage,5,0.675912
time,Hardware,Voltage,Current
1622015402810,high-voltage,6,0.859432
time,Hardware,Voltage,Current
1622015402810,high-voltage,7,1.1128
time,Hardware,Voltage,Current
1622015402810,high-voltage,8,1.38865
time,Hardware,Voltage,Current
1622015402810,high-voltage,9,1.72561
time,Hardware,Voltage,Current
1622015402810,high-voltage,10,2.17069
time,Hardware,Voltage,Current
1622015402810,high-voltage,11,2.73277
time,Hardware,Voltage,Current
1622015402810,high-voltage,12,3.33849
time,Hardware,Voltage,Current
1622015402810,high-voltage,13,3.96054
time,Hardware,Voltage,Current
1622015402810,high-voltage,14,4.82834
time,Hardware,Voltage,Current
1622015402810,high-voltage,15,5.6942
time,Hardware,Voltage,Current
1622015402810,high-voltage,16,6.69793
time,Hardware,Voltage,Current
1622015402810,high-voltage,17,7.82493
time,Hardware,Voltage,Current
1622015402810,high-voltage,18,8.95951
time,Hardware,Voltage,Current
1622015402810,high-voltage,19,9.97465
time,Hardware,Voltage,Current
1622015402810,high-voltage,20,10.0001
