time,Hardware,Voltage,Current
1626390069637,high-voltage-2,1,0.103466
time,Hardware,Voltage,Current
1626390069637,high-voltage-2,2,0.153876
time,Hardware,Voltage,Current
1626390069637,high-voltage-2,3,0.17886
time,Hardware,Voltage,Current
1626390069637,high-voltage-2,4,0.201515
time,Hardware,Voltage,Current
1626390069637,high-voltage-2,5,0.224608
time,Hardware,Voltage,Current
1626390069637,high-voltage-2,6,0.250205
time,Hardware,Voltage,Current
1626390069637,high-voltage-2,7,0.276019
time,Hardware,Voltage,Current
1626390069637,high-voltage-2,8,0.302029
time,Hardware,Voltage,Current
1626390069637,high-voltage-2,9,0.328098
time,Hardware,Voltage,Current
1626390069637,high-voltage-2,10,0.35395
time,Hardware,Voltage,Current
1626390069637,high-voltage-2,11,0.37623
time,Hardware,Voltage,Current
1626390069637,high-voltage-2,12,0.395266
time,Hardware,Voltage,Current
1626390069637,high-voltage-2,13,0.411509
time,Hardware,Voltage,Current
1626390069637,high-voltage-2,14,0.425671
time,Hardware,Voltage,Current
1626390069637,high-voltage-2,15,0.438553
time,Hardware,Voltage,Current
1626390069637,high-voltage-2,16,0.450677
time,Hardware,Voltage,Current
1626390069637,high-voltage-2,17,0.462439
time,Hardware,Voltage,Current
1626390069637,high-voltage-2,18,0.472775
time,Hardware,Voltage,Current
1626390069637,high-voltage-2,19,0.484343
time,Hardware,Voltage,Current
1626390069637,high-voltage-2,20,0.49511
time,Hardware,Voltage,Current
1626390069637,high-voltage-2,25,0.547129
time,Hardware,Voltage,Current
1626390069637,high-voltage-2,30,0.599742
time,Hardware,Voltage,Current
1626390069637,high-voltage-2,35,0.652994
time,Hardware,Voltage,Current
1626390069637,high-voltage-2,40,0.714587
time,Hardware,Voltage,Current
1626390069637,high-voltage-2,45,0.791426
time,Hardware,Voltage,Current
1626390069637,high-voltage-2,50,0.850301
time,Hardware,Voltage,Current
1626390069637,high-voltage-2,55,0.905471
time,Hardware,Voltage,Current
1626390069637,high-voltage-2,60,0.958143
time,Hardware,Voltage,Current
1626390069637,high-voltage-2,65,1.00855
time,Hardware,Voltage,Current
1626390069637,high-voltage-2,70,1.05782
time,Hardware,Voltage,Current
1626390069637,high-voltage-2,75,1.1059
time,Hardware,Voltage,Current
1626390069637,high-voltage-2,80,1.15177
time,Hardware,Voltage,Current
1626390069637,high-voltage-2,85,1.19371
time,Hardware,Voltage,Current
1626390069637,high-voltage-2,90,1.23258
time,Hardware,Voltage,Current
1626390069637,high-voltage-2,95,1.26736
time,Hardware,Voltage,Current
1626390069637,high-voltage-2,100,1.29834
