{
    "Data": [0.0, 0.0, 0.0, 0.0, 0.0, 0.0, 0.0, 0.0, 0.0, 0.0, 0.0, 0.0, 0.0, 0.0, 2.0, 0.0, 1.0, 11.0, 48.0, 18.0, 50.0, 650.0, 1031.0, 376.0, 446.0, 1467.0, 1844.0, 872.0, 691.0, 1231.0, 1304.0, 872.0, 613.0, 772.0, 751.0, 669.0, 520.0, 661.0, 1037.0, 908.0, 691.0, 1067.0, 2176.0, 3340.0, 2365.0, 1567.0, 2400.0, 3483.0, 4129.0, 2865.0, 2245.0, 2596.0, 3157.0, 2695.0, 2110.0, 1729.0, 1595.0, 1927.0, 1477.0, 1276.0, 1176.0, 1103.0, 1134.0, 743.0, 724.0, 644.0, 636.0, 608.0, 493.0, 476.0, 371.0, 433.0, 319.0, 310.0, 262.0, 243.0, 224.0, 217.0, 191.0, 174.0, 157.0, 137.0, 127.0, 96.0, 100.0, 106.0, 127.0, 97.0, 86.0, 88.0, 82.0, 57.0, 57.0, 66.0, 55.0, 47.0, 48.0, 42.0, 34.0, 39.0, 33.0, 28.0, 29.0, 28.0, 27.0, 34.0, 17.0, 19.0, 21.0, 19.0, 22.0, 13.0, 12.0, 21.0, 19.0, 12.0, 17.0, 12.0, 9.0, 12.0, 10.0, 7.0, 11.0, 11.0, 13.0, 9.0, 3.0, 4.0, 14.0, 10.0, 5.0, 9.0, 9.0, 6.0, 4.0, 4.0, 6.0, 5.0, 5.0, 4.0, 0.0, 3.0, 6.0, 0.0, 1.0, 2.0, 4.0, 4.0, 4.0, 2.0, 3.0, 3.0, 2.0, 3.0, 3.0, 4.0, 0.0, 2.0, 0.0, 3.0, 2.0, 3.0, 3.0, 2.0, 2.0, 1.0, 3.0, 3.0, 3.0, 1.0, 2.0, 0.0, 4.0, 2.0, 0.0, 3.0, 2.0, 0.0, 6.0, 1.0, 3.0, 3.0, 0.0, 2.0, 2.0, 1.0, 0.0, 0.0, 0.0, 2.0, 1.0, 0.0, 0.0, 2.0, 2.0, 0.0, 0.0, 0.0, 0.0, 0.0, 1.0],
    "Name": "TimePerFitDist-0",
    "Overflow": 150.0,
    "Type": "Histo1d",
    "Underflow": 0.0,
    "x": {
        "AxisTitle": "Fit Time [us]",
        "Bins": 201,
        "High": 401.0,
        "Low": -1.0
    },
    "y": {
        "AxisTitle": "Number of Pixels"
    },
    "z": {
        "AxisTitle": "z"
    }
}