time,Hardware,Voltage,Current
1626604140972,high-voltage-2,1,0.242543
time,Hardware,Voltage,Current
1626604140972,high-voltage-2,2,0.308363
time,Hardware,Voltage,Current
1626604140972,high-voltage-2,3,0.344783
time,Hardware,Voltage,Current
1626604140972,high-voltage-2,4,0.376501
time,Hardware,Voltage,Current
1626604140972,high-voltage-2,5,0.409931
time,Hardware,Voltage,Current
1626604140972,high-voltage-2,6,0.443799
time,Hardware,Voltage,Current
1626604140972,high-voltage-2,7,0.48247
time,Hardware,Voltage,Current
1626604140972,high-voltage-2,8,0.52045
time,Hardware,Voltage,Current
1626604140972,high-voltage-2,9,0.56115
time,Hardware,Voltage,Current
1626604140972,high-voltage-2,10,0.600944
time,Hardware,Voltage,Current
1626604140972,high-voltage-2,11,0.64143
time,Hardware,Voltage,Current
1626604140972,high-voltage-2,12,0.680141
time,Hardware,Voltage,Current
1626604140972,high-voltage-2,13,0.71494
time,Hardware,Voltage,Current
1626604140972,high-voltage-2,14,0.745836
time,Hardware,Voltage,Current
1626604140972,high-voltage-2,15,0.774473
time,Hardware,Voltage,Current
1626604140972,high-voltage-2,16,0.798409
time,Hardware,Voltage,Current
1626604140972,high-voltage-2,17,0.819975
time,Hardware,Voltage,Current
1626604140972,high-voltage-2,18,0.843804
time,Hardware,Voltage,Current
1626604140972,high-voltage-2,19,0.865555
time,Hardware,Voltage,Current
1626604140972,high-voltage-2,20,0.884734
time,Hardware,Voltage,Current
1626604140972,high-voltage-2,25,0.974453
time,Hardware,Voltage,Current
1626604140972,high-voltage-2,30,1.06466
time,Hardware,Voltage,Current
1626604140972,high-voltage-2,35,1.15619
time,Hardware,Voltage,Current
1626604140972,high-voltage-2,40,1.26036
time,Hardware,Voltage,Current
1626604140972,high-voltage-2,45,1.39066
time,Hardware,Voltage,Current
1626604140972,high-voltage-2,50,1.48372
time,Hardware,Voltage,Current
1626604140972,high-voltage-2,55,1.56779
time,Hardware,Voltage,Current
1626604140972,high-voltage-2,60,1.64937
time,Hardware,Voltage,Current
1626604140972,high-voltage-2,65,1.72875
time,Hardware,Voltage,Current
1626604140972,high-voltage-2,70,1.80519
time,Hardware,Voltage,Current
1626604140972,high-voltage-2,75,1.87693
time,Hardware,Voltage,Current
1626604140972,high-voltage-2,80,1.94717
time,Hardware,Voltage,Current
1626604140972,high-voltage-2,85,2.01483
time,Hardware,Voltage,Current
1626604140972,high-voltage-2,90,2.08107
time,Hardware,Voltage,Current
1626604140972,high-voltage-2,95,2.14665
time,Hardware,Voltage,Current
1626604140972,high-voltage-2,100,2.20922
