time,Hardware,Voltage,Current
1626349444053,high-voltage,1,0.00943576
time,Hardware,Voltage,Current
1626349444053,high-voltage,2,0.0252678
time,Hardware,Voltage,Current
1626349444053,high-voltage,3,0.0333177
time,Hardware,Voltage,Current
1626349444053,high-voltage,4,0.0393216
time,Hardware,Voltage,Current
1626349444053,high-voltage,5,0.0457402
time,Hardware,Voltage,Current
1626349444053,high-voltage,6,0.0524694
time,Hardware,Voltage,Current
1626349444053,high-voltage,7,0.0585552
time,Hardware,Voltage,Current
1626349444053,high-voltage,8,0.0652056
time,Hardware,Voltage,Current
1626349444053,high-voltage,9,0.0724481
time,Hardware,Voltage,Current
1626349444053,high-voltage,10,0.0783028
time,Hardware,Voltage,Current
1626349444053,high-voltage,11,0.0849526
time,Hardware,Voltage,Current
1626349444053,high-voltage,12,0.089062
time,Hardware,Voltage,Current
1626349444053,high-voltage,13,0.0947618
time,Hardware,Voltage,Current
1626349444053,high-voltage,14,0.098033
time,Hardware,Voltage,Current
1626349444053,high-voltage,15,0.102527
time,Hardware,Voltage,Current
1626349444053,high-voltage,16,0.10459
time,Hardware,Voltage,Current
1626349444053,high-voltage,17,0.108204
time,Hardware,Voltage,Current
1626349444053,high-voltage,18,0.112187
time,Hardware,Voltage,Current
1626349444053,high-voltage,19,0.114318
time,Hardware,Voltage,Current
1626349444053,high-voltage,20,0.118321
time,Hardware,Voltage,Current
1626349444053,high-voltage,25,0.131956
time,Hardware,Voltage,Current
1626349444053,high-voltage,30,0.150379
time,Hardware,Voltage,Current
1626349444053,high-voltage,35,0.184672
time,Hardware,Voltage,Current
1626349444053,high-voltage,40,0.287522
time,Hardware,Voltage,Current
1626349444053,high-voltage,45,0.53738
time,Hardware,Voltage,Current
1626349444053,high-voltage,50,1.01369
time,Hardware,Voltage,Current
1626349444053,high-voltage,55,1.82436
time,Hardware,Voltage,Current
1626349444053,high-voltage,60,3.06842
time,Hardware,Voltage,Current
1626349444053,high-voltage,65,4.81205
time,Hardware,Voltage,Current
1626349444053,high-voltage,70,7.11294
time,Hardware,Voltage,Current
1626349444053,high-voltage,75,10
