{
    "Data": [0.0, 0.0, 0.0, 0.0, 0.0, 0.0, 0.0, 0.0, 0.0, 0.0, 0.0, 0.0, 0.0, 0.0, 0.0, 0.0, 0.0, 0.0, 0.0, 0.0, 0.0, 0.0, 0.0, 0.0, 0.0, 0.0, 0.0, 0.0, 0.0, 0.0, 0.0, 0.0, 0.0, 0.0, 0.0, 0.0, 0.0, 0.0, 0.0, 0.0, 0.0, 0.0, 0.0, 0.0, 0.0, 0.0, 0.0, 0.0, 0.0, 0.0, 8.0, 8.0, 10.0, 12.0, 13.0, 17.0, 20.0, 18.0, 13.0, 16.0, 22.0, 20.0, 22.0, 26.0, 37.0, 32.0, 38.0, 32.0, 63.0, 61.0, 75.0, 104.0, 135.0, 144.0, 157.0, 221.0, 253.0, 261.0, 323.0, 371.0, 430.0, 506.0, 565.0, 611.0, 693.0, 736.0, 900.0, 925.0, 991.0, 1141.0, 1303.0, 1730.0, 2037.0, 2703.0, 3316.0, 3783.0, 4085.0, 4019.0, 3641.0, 3249.0, 2727.0, 2057.0, 1532.0, 1146.0, 796.0, 659.0, 481.0, 366.0, 316.0, 277.0, 220.0, 192.0, 181.0, 135.0, 87.0, 95.0, 63.0, 61.0, 48.0, 39.0, 44.0, 37.0, 40.0, 28.0, 18.0, 24.0, 28.0, 22.0, 14.0, 19.0, 24.0, 19.0, 13.0, 22.0, 14.0, 10.0, 7.0, 11.0, 12.0, 11.0, 9.0, 13.0, 15.0, 11.0, 8.0, 11.0, 7.0, 8.0, 7.0, 4.0, 10.0, 8.0, 7.0, 6.0, 5.0, 4.0, 5.0, 4.0, 6.0, 6.0, 4.0, 2.0, 4.0, 4.0, 3.0, 7.0, 4.0, 15.0, 14.0, 25.0, 26.0, 31.0, 37.0, 46.0, 64.0, 78.0, 88.0, 105.0, 130.0, 166.0, 183.0, 237.0, 240.0, 327.0, 371.0, 385.0, 401.0, 513.0, 520.0, 611.0, 628.0, 630.0, 687.0, 730.0, 717.0, 788.0, 714.0, 764.0, 826.0, 778.0, 759.0, 727.0, 659.0, 708.0, 643.0, 583.0, 615.0, 557.0, 513.0, 521.0, 454.0, 406.0, 379.0, 377.0, 334.0, 322.0, 288.0, 265.0, 226.0, 231.0, 208.0, 186.0, 169.0, 164.0, 143.0, 130.0, 130.0, 131.0, 120.0, 110.0, 102.0, 98.0, 112.0, 86.0, 75.0, 75.0, 61.0, 61.0, 53.0, 56.0, 35.0, 37.0, 50.0, 33.0, 51.0, 35.0, 33.0, 37.0, 33.0, 25.0, 29.0, 21.0, 21.0, 20.0, 22.0, 14.0, 17.0, 10.0, 10.0, 15.0, 15.0, 11.0, 12.0, 8.0, 10.0, 11.0, 16.0, 4.0, 6.0, 15.0, 9.0, 9.0, 11.0, 8.0, 6.0, 4.0, 5.0, 3.0, 10.0, 2.0, 3.0, 3.0, 8.0, 5.0, 1.0, 7.0, 1.0, 4.0, 2.0, 2.0, 3.0, 2.0, 3.0, 1.0, 1.0, 1.0, 0.0, 2.0, 2.0, 2.0, 3.0, 3.0, 2.0, 4.0, 0.0, 0.0, 1.0, 1.0, 3.0, 1.0, 2.0, 0.0, 1.0, 1.0, 1.0, 0.0, 1.0, 0.0, 1.0, 1.0, 4.0, 3.0, 1.0, 1.0, 2.0, 1.0, 0.0, 0.0, 0.0, 0.0, 0.0, 0.0, 0.0, 0.0, 0.0, 0.0, 0.0, 0.0, 0.0, 0.0, 0.0, 0.0, 0.0, 0.0, 0.0, 0.0, 0.0, 0.0, 0.0, 0.0, 0.0, 0.0, 0.0, 0.0, 0.0, 0.0, 0.0, 0.0, 0.0, 0.0, 0.0, 0.0, 0.0, 0.0, 0.0, 0.0, 0.0, 0.0, 0.0, 0.0, 0.0, 0.0, 0.0, 0.0, 0.0, 0.0, 0.0, 0.0, 0.0, 0.0, 0.0, 0.0, 0.0, 0.0, 0.0],
    "Name": "ThresholdDist-0",
    "Overflow": 0.0,
    "Type": "Histo1d",
    "Underflow": 0.0,
    "x": {
        "AxisTitle": "Threshold [e]",
        "Bins": 385,
        "High": 3845.0,
        "Low": -5.0
    },
    "y": {
        "AxisTitle": "Number of Pixels"
    },
    "z": {
        "AxisTitle": "z"
    }
}