time,Hardware,Voltage,Current
1626314107698,high-voltage,1,0.0510426
time,Hardware,Voltage,Current
1626314107698,high-voltage,2,0.0721296
time,Hardware,Voltage,Current
1626314107698,high-voltage,3,0.0854951
time,Hardware,Voltage,Current
1626314107698,high-voltage,4,0.0940796
time,Hardware,Voltage,Current
1626314107698,high-voltage,5,0.104063
time,Hardware,Voltage,Current
1626314107698,high-voltage,6,0.112356
time,Hardware,Voltage,Current
1626314107698,high-voltage,7,0.124347
time,Hardware,Voltage,Current
1626314107698,high-voltage,8,0.134428
time,Hardware,Voltage,Current
1626314107698,high-voltage,9,0.147169
time,Hardware,Voltage,Current
1626314107698,high-voltage,10,0.161351
time,Hardware,Voltage,Current
1626314107698,high-voltage,11,0.175706
time,Hardware,Voltage,Current
1626314107698,high-voltage,12,0.188829
time,Hardware,Voltage,Current
1626314107698,high-voltage,13,0.200982
time,Hardware,Voltage,Current
1626314107698,high-voltage,14,0.211604
time,Hardware,Voltage,Current
1626314107698,high-voltage,15,0.221596
time,Hardware,Voltage,Current
1626314107698,high-voltage,16,0.228547
time,Hardware,Voltage,Current
1626314107698,high-voltage,17,0.237093
time,Hardware,Voltage,Current
1626314107698,high-voltage,18,0.243031
time,Hardware,Voltage,Current
1626314107698,high-voltage,19,0.249759
time,Hardware,Voltage,Current
1626314107698,high-voltage,20,0.257949
time,Hardware,Voltage,Current
1626314107698,high-voltage,25,0.288079
time,Hardware,Voltage,Current
1626314107698,high-voltage,30,0.321521
time,Hardware,Voltage,Current
1626314107698,high-voltage,35,0.382675
time,Hardware,Voltage,Current
1626314107698,high-voltage,40,0.525209
time,Hardware,Voltage,Current
1626314107698,high-voltage,45,0.799817
time,Hardware,Voltage,Current
1626314107698,high-voltage,50,1.25042
time,Hardware,Voltage,Current
1626314107698,high-voltage,55,1.9799
time,Hardware,Voltage,Current
1626314107698,high-voltage,60,3.07245
time,Hardware,Voltage,Current
1626314107698,high-voltage,65,4.60286
time,Hardware,Voltage,Current
1626314107698,high-voltage,70,6.6437
time,Hardware,Voltage,Current
1626314107698,high-voltage,75,9.4472
time,Hardware,Voltage,Current
1626314107698,high-voltage,80,10
