{
    "Data": [34.0, 69.0, 0.0, 1.0, 3.0, 97.0, 545.0, 1750.0, 3380.0, 4625.0, 4855.0, 4074.0, 3097.0, 2552.0, 2669.0, 2835.0, 3199.0, 3569.0, 3671.0, 3333.0, 2649.0, 1827.0, 1194.0, 789.0, 547.0, 603.0, 764.0, 1048.0, 1291.0, 1658.0, 1919.0, 2234.0, 2248.0, 2277.0, 2059.0, 1847.0, 1596.0, 1288.0, 1034.0, 764.0, 540.0, 377.0, 247.0, 158.0, 131.0, 97.0, 63.0, 38.0, 29.0, 17.0, 11.0, 15.0, 17.0, 9.0, 13.0, 9.0, 6.0, 3.0, 2.0, 5.0, 3.0, 4.0, 3.0, 1.0, 2.0, 4.0, 2.0, 1.0, 1.0, 0.0, 0.0],
    "Name": "NoiseDist-0",
    "Overflow": 13.0,
    "Type": "Histo1d",
    "Underflow": 0.0,
    "x": {
        "AxisTitle": "Noise [e]",
        "Bins": 71,
        "High": 356.0,
        "Low": -2.0
    },
    "y": {
        "AxisTitle": "Number of Pixels"
    },
    "z": {
        "AxisTitle": "z"
    }
}