{
    "connectivity": [{
            "chipType": "RD53A",
            "chips": [{
                    "config": "/home/eresseguie/Yarr/configs/rd53a_3dmoduleB_A.json",
                    "enable": 1,
                    "locked": 0,
                    "rx": 0,
                    "tx": 0
                }, {
                    "config": "/home/eresseguie/Yarr/configs/rd53a_3dmoduleB_B.json",
                    "enable": 1,
                    "locked": 0,
                    "rx": 1,
                    "tx": 1
                }, {
                    "config": "/home/eresseguie/Yarr/configs/rd53a_3dmoduleB_C.json",
                    "enable": 1,
                    "locked": 0,
                    "rx": 2,
                    "tx": 2
                }]
        }],
    "ctrlCfg": {
        "ctrlCfg": {
            "cfg": {
                "cmdPeriod": 6.250000073038109e-9,
                "idle": {
                    "word": 1768515945
                },
                "pulse": {
                    "interval": 500,
                    "word": 1549575846
                },
                "rxPolarity": 65535,
                "specNum": 2,
                "spiConfig": 541200,
                "sync": {
                    "interval": 32,
                    "word": 2172551550
                },
                "trigConfig": null,
                "txPolarity": 15
            },
            "type": "spec"
        }
    },
    "exec": "-r /home/eresseguie/Yarr/configs/controller/specCfg_bottom.json -c /home/eresseguie/Yarr/configs/connectivity/rd53a_3dmodule_B.json -s /home/eresseguie/Yarr/configs/scans/rd53a/std_thresholdscan.json -o /home/eresseguie/3dmoduleB_orderBC_HVon ",
    "finishTime": 1620949029,
    "runNumber": 4927,
    "startTime": 1620948910,
    "stopwatch": {
        "analysis": 697,
        "config": 128,
        "processing": 4,
        "scan": 117979
    },
    "targetCharge": -1,
    "targetTot": -1,
    "testType": "std_thresholdscan",
    "timestamp": "2021-05-13_16:35:10"
}