{
    "Data": [0.0, 0.0, 0.0, 0.0, 0.0, 0.0, 0.0, 0.0, 0.0, 0.0, 0.0, 0.0, 0.0, 0.0, 4.0, 2.0, 1.0, 13.0, 72.0, 21.0, 43.0, 551.0, 1028.0, 290.0, 527.0, 1391.0, 1623.0, 784.0, 796.0, 1189.0, 1182.0, 851.0, 666.0, 803.0, 876.0, 685.0, 494.0, 770.0, 1068.0, 887.0, 653.0, 1135.0, 2330.0, 3153.0, 2286.0, 1527.0, 2532.0, 3533.0, 3962.0, 2850.0, 2142.0, 2748.0, 3118.0, 2712.0, 1958.0, 1874.0, 1751.0, 1869.0, 1513.0, 1224.0, 1163.0, 1146.0, 1059.0, 850.0, 743.0, 651.0, 689.0, 640.0, 544.0, 467.0, 445.0, 422.0, 396.0, 347.0, 264.0, 271.0, 252.0, 224.0, 232.0, 223.0, 190.0, 153.0, 167.0, 139.0, 116.0, 112.0, 103.0, 103.0, 105.0, 112.0, 99.0, 97.0, 71.0, 65.0, 58.0, 76.0, 64.0, 61.0, 62.0, 58.0, 49.0, 47.0, 53.0, 49.0, 37.0, 27.0, 47.0, 37.0, 35.0, 30.0, 33.0, 26.0, 18.0, 13.0, 12.0, 20.0, 15.0, 30.0, 18.0, 24.0, 19.0, 12.0, 18.0, 14.0, 12.0, 6.0, 7.0, 13.0, 13.0, 9.0, 14.0, 11.0, 5.0, 8.0, 11.0, 11.0, 10.0, 8.0, 4.0, 11.0, 8.0, 9.0, 3.0, 7.0, 4.0, 6.0, 5.0, 1.0, 5.0, 3.0, 7.0, 1.0, 1.0, 5.0, 2.0, 7.0, 4.0, 5.0, 3.0, 3.0, 3.0, 1.0, 3.0, 5.0, 3.0, 4.0, 4.0, 3.0, 3.0, 1.0, 1.0, 2.0, 0.0, 3.0, 1.0, 0.0, 4.0, 4.0, 2.0, 3.0, 1.0, 3.0, 0.0, 2.0, 1.0, 2.0, 0.0, 1.0, 1.0, 1.0, 1.0, 1.0, 1.0, 3.0, 1.0, 0.0, 0.0, 0.0, 1.0, 0.0, 0.0],
    "Name": "TimePerFitDist-0",
    "Overflow": 93.0,
    "Type": "Histo1d",
    "Underflow": 0.0,
    "x": {
        "AxisTitle": "Fit Time [us]",
        "Bins": 201,
        "High": 401.0,
        "Low": -1.0
    },
    "y": {
        "AxisTitle": "Number of Pixels"
    },
    "z": {
        "AxisTitle": "z"
    }
}