{
    "Data": [[2409.0, 789.0, 403.0, 247.0, 145.0, 121.0, 92.0, 68.0, 59.0, 34.0, 29.0, 38.0, 23.0, 36.0, 25.0, 13.0, 18.0, 11.0, 10.0, 8.0, 13.0, 7.0, 8.0, 7.0, 9.0, 12.0, 9.0, 11.0, 11.0, 7.0, 11.0, 6.0, 6.0, 3.0, 7.0, 12.0, 4.0, 6.0, 5.0, 6.0, 16.0, 8.0, 8.0, 10.0, 9.0, 9.0, 3.0, 14.0, 15.0], [3510.0, 1302.0, 710.0, 428.0, 309.0, 231.0, 168.0, 102.0, 91.0, 71.0, 69.0, 46.0, 44.0, 43.0, 34.0, 21.0, 32.0, 21.0, 21.0, 13.0, 15.0, 13.0, 15.0, 14.0, 10.0, 12.0, 11.0, 7.0, 10.0, 9.0, 9.0, 11.0, 9.0, 13.0, 9.0, 10.0, 10.0, 14.0, 10.0, 9.0, 5.0, 8.0, 6.0, 11.0, 16.0, 7.0, 13.0, 18.0, 25.0], [4807.0, 2128.0, 1224.0, 810.0, 521.0, 418.0, 307.0, 219.0, 177.0, 134.0, 118.0, 118.0, 111.0, 60.0, 59.0, 69.0, 33.0, 45.0, 40.0, 29.0, 15.0, 23.0, 23.0, 20.0, 26.0, 18.0, 17.0, 20.0, 12.0, 16.0, 13.0, 13.0, 17.0, 16.0, 13.0, 18.0, 12.0, 8.0, 12.0, 19.0, 12.0, 16.0, 6.0, 11.0, 15.0, 17.0, 16.0, 17.0, 25.0], [5399.0, 2926.0, 1801.0, 1266.0, 990.0, 802.0, 561.0, 461.0, 379.0, 285.0, 254.0, 245.0, 189.0, 150.0, 116.0, 116.0, 102.0, 91.0, 72.0, 62.0, 62.0, 57.0, 39.0, 44.0, 46.0, 29.0, 23.0, 39.0, 28.0, 27.0, 23.0, 23.0, 19.0, 23.0, 16.0, 16.0, 18.0, 24.0, 24.0, 8.0, 17.0, 22.0, 10.0, 18.0, 22.0, 25.0, 20.0, 31.0, 21.0], [5916.0, 3220.0, 2257.0, 1827.0, 1421.0, 1184.0, 940.0, 832.0, 732.0, 633.0, 514.0, 457.0, 409.0, 332.0, 289.0, 248.0, 228.0, 188.0, 208.0, 149.0, 134.0, 129.0, 100.0, 105.0, 116.0, 58.0, 79.0, 77.0, 60.0, 61.0, 48.0, 49.0, 43.0, 43.0, 38.0, 34.0, 25.0, 34.0, 33.0, 27.0, 40.0, 25.0, 25.0, 30.0, 34.0, 33.0, 33.0, 32.0, 48.0], [8029.0, 4122.0, 2766.0, 2053.0, 1734.0, 1518.0, 1337.0, 1097.0, 975.0, 921.0, 789.0, 691.0, 655.0, 603.0, 559.0, 480.0, 443.0, 408.0, 400.0, 362.0, 340.0, 265.0, 261.0, 242.0, 215.0, 202.0, 163.0, 160.0, 145.0, 139.0, 127.0, 108.0, 121.0, 94.0, 95.0, 93.0, 68.0, 64.0, 64.0, 67.0, 53.0, 56.0, 50.0, 53.0, 56.0, 62.0, 60.0, 46.0, 68.0], [6377.0, 5354.0, 4308.0, 3325.0, 2867.0, 2195.0, 1937.0, 1645.0, 1398.0, 1241.0, 1104.0, 1094.0, 929.0, 906.0, 791.0, 748.0, 700.0, 661.0, 646.0, 605.0, 530.0, 495.0, 452.0, 448.0, 433.0, 410.0, 420.0, 384.0, 324.0, 338.0, 255.0, 259.0, 252.0, 266.0, 221.0, 215.0, 186.0, 187.0, 187.0, 138.0, 141.0, 141.0, 123.0, 103.0, 102.0, 110.0, 85.0, 101.0, 134.0], [1556.0, 1784.0, 2049.0, 2106.0, 2404.0, 2458.0, 2536.0, 2395.0, 2311.0, 2148.0, 2030.0, 1909.0, 1782.0, 1692.0, 1528.0, 1361.0, 1353.0, 1176.0, 1079.0, 1025.0, 954.0, 847.0, 861.0, 770.0, 764.0, 729.0, 692.0, 635.0, 586.0, 511.0, 526.0, 540.0, 488.0, 465.0, 467.0, 412.0, 407.0, 425.0, 371.0, 355.0, 341.0, 346.0, 313.0, 281.0, 260.0, 232.0, 242.0, 224.0, 236.0], [588.0, 360.0, 361.0, 394.0, 453.0, 544.0, 660.0, 744.0, 856.0, 1006.0, 1113.0, 1220.0, 1298.0, 1379.0, 1424.0, 1459.0, 1557.0, 1569.0, 1666.0, 1677.0, 1711.0, 1795.0, 1623.0, 1635.0, 1613.0, 1527.0, 1425.0, 1505.0, 1389.0, 1309.0, 1268.0, 1160.0, 1123.0, 1037.0, 947.0, 999.0, 933.0, 804.0, 767.0, 736.0, 721.0, 678.0, 630.0, 636.0, 588.0, 623.0, 567.0, 509.0, 555.0], [442.0, 207.0, 167.0, 139.0, 148.0, 120.0, 145.0, 197.0, 172.0, 215.0, 261.0, 272.0, 283.0, 347.0, 371.0, 427.0, 489.0, 488.0, 590.0, 631.0, 695.0, 773.0, 891.0, 903.0, 1005.0, 1068.0, 1231.0, 1328.0, 1343.0, 1476.0, 1583.0, 1652.0, 1750.0, 1798.0, 1834.0, 1865.0, 1984.0, 2092.0, 2016.0, 1901.0, 1940.0, 1883.0, 1841.0, 1769.0, 1685.0, 1570.0, 1442.0, 1382.0, 1382.0], [409.0, 184.0, 108.0, 80.0, 90.0, 89.0, 70.0, 83.0, 67.0, 70.0, 93.0, 95.0, 109.0, 93.0, 126.0, 145.0, 161.0, 149.0, 186.0, 194.0, 231.0, 254.0, 251.0, 321.0, 286.0, 348.0, 369.0, 440.0, 478.0, 514.0, 592.0, 695.0, 815.0, 823.0, 946.0, 1069.0, 1260.0, 1362.0, 1515.0, 1770.0, 2057.0, 2427.0, 2539.0, 2898.0, 3224.0, 3635.0, 4023.0, 4433.0, 4588.0], [419.0, 152.0, 95.0, 73.0, 52.0, 53.0, 49.0, 52.0, 34.0, 37.0, 32.0, 36.0, 44.0, 45.0, 56.0, 64.0, 69.0, 49.0, 80.0, 82.0, 93.0, 98.0, 130.0, 97.0, 127.0, 152.0, 187.0, 178.0, 206.0, 231.0, 256.0, 281.0, 310.0, 386.0, 385.0, 453.0, 512.0, 559.0, 708.0, 769.0, 982.0, 1035.0, 1340.0, 1729.0, 2150.0, 2839.0, 3879.0, 5667.0, 8826.0], [400.0, 131.0, 99.0, 76.0, 56.0, 31.0, 41.0, 36.0, 32.0, 24.0, 23.0, 26.0, 27.0, 29.0, 28.0, 22.0, 33.0, 31.0, 30.0, 40.0, 33.0, 37.0, 40.0, 53.0, 64.0, 71.0, 73.0, 88.0, 100.0, 111.0, 130.0, 121.0, 145.0, 162.0, 197.0, 222.0, 255.0, 288.0, 360.0, 416.0, 459.0, 591.0, 643.0, 892.0, 1064.0, 1532.0, 2260.0, 3754.0, 7594.0], [401.0, 169.0, 95.0, 56.0, 56.0, 40.0, 40.0, 33.0, 20.0, 24.0, 18.0, 20.0, 25.0, 10.0, 18.0, 23.0, 8.0, 21.0, 19.0, 30.0, 16.0, 21.0, 18.0, 25.0, 30.0, 35.0, 38.0, 41.0, 42.0, 44.0, 44.0, 56.0, 74.0, 102.0, 83.0, 117.0, 118.0, 140.0, 156.0, 201.0, 257.0, 328.0, 355.0, 491.0, 598.0, 925.0, 1271.0, 2227.0, 5179.0], [354.0, 135.0, 83.0, 70.0, 64.0, 31.0, 31.0, 22.0, 26.0, 22.0, 17.0, 19.0, 24.0, 17.0, 17.0, 11.0, 11.0, 12.0, 12.0, 10.0, 9.0, 14.0, 20.0, 20.0, 22.0, 22.0, 15.0, 15.0, 24.0, 25.0, 29.0, 28.0, 32.0, 37.0, 50.0, 55.0, 63.0, 72.0, 92.0, 117.0, 106.0, 141.0, 185.0, 244.0, 345.0, 468.0, 764.0, 1332.0, 3372.0], [384.0, 130.0, 73.0, 54.0, 42.0, 35.0, 34.0, 21.0, 26.0, 16.0, 15.0, 16.0, 18.0, 11.0, 17.0, 7.0, 7.0, 8.0, 14.0, 13.0, 10.0, 14.0, 6.0, 10.0, 14.0, 11.0, 11.0, 10.0, 26.0, 18.0, 23.0, 25.0, 16.0, 18.0, 31.0, 33.0, 35.0, 35.0, 37.0, 64.0, 60.0, 97.0, 104.0, 143.0, 180.0, 283.0, 440.0, 823.0, 2213.0], [377.0, 132.0, 84.0, 46.0, 39.0, 37.0, 20.0, 18.0, 28.0, 21.0, 15.0, 14.0, 17.0, 14.0, 4.0, 10.0, 12.0, 14.0, 4.0, 12.0, 7.0, 8.0, 12.0, 7.0, 15.0, 16.0, 9.0, 7.0, 7.0, 11.0, 11.0, 18.0, 15.0, 11.0, 25.0, 27.0, 31.0, 23.0, 28.0, 38.0, 33.0, 46.0, 47.0, 76.0, 89.0, 141.0, 252.0, 469.0, 1323.0], [381.0, 145.0, 77.0, 51.0, 44.0, 30.0, 23.0, 23.0, 20.0, 11.0, 19.0, 13.0, 12.0, 10.0, 17.0, 7.0, 7.0, 8.0, 5.0, 9.0, 10.0, 8.0, 13.0, 6.0, 8.0, 5.0, 8.0, 10.0, 7.0, 7.0, 18.0, 8.0, 12.0, 18.0, 15.0, 13.0, 8.0, 24.0, 24.0, 31.0, 25.0, 25.0, 41.0, 44.0, 50.0, 93.0, 148.0, 268.0, 847.0], [393.0, 133.0, 63.0, 42.0, 52.0, 39.0, 22.0, 17.0, 15.0, 13.0, 10.0, 13.0, 11.0, 9.0, 11.0, 9.0, 9.0, 12.0, 5.0, 8.0, 8.0, 9.0, 4.0, 7.0, 9.0, 7.0, 3.0, 7.0, 4.0, 6.0, 6.0, 11.0, 12.0, 11.0, 13.0, 11.0, 7.0, 15.0, 16.0, 19.0, 22.0, 28.0, 25.0, 37.0, 52.0, 50.0, 76.0, 176.0, 532.0], [352.0, 149.0, 72.0, 51.0, 32.0, 32.0, 19.0, 19.0, 18.0, 7.0, 10.0, 12.0, 15.0, 12.0, 5.0, 9.0, 8.0, 10.0, 5.0, 4.0, 2.0, 6.0, 4.0, 7.0, 8.0, 5.0, 7.0, 7.0, 7.0, 9.0, 6.0, 9.0, 2.0, 8.0, 9.0, 5.0, 9.0, 12.0, 10.0, 8.0, 17.0, 20.0, 26.0, 23.0, 37.0, 48.0, 67.0, 95.0, 353.0], [375.0, 138.0, 56.0, 57.0, 37.0, 31.0, 22.0, 19.0, 16.0, 9.0, 11.0, 12.0, 7.0, 10.0, 6.0, 5.0, 3.0, 9.0, 7.0, 7.0, 1.0, 6.0, 1.0, 2.0, 6.0, 4.0, 6.0, 4.0, 5.0, 3.0, 8.0, 6.0, 7.0, 7.0, 8.0, 7.0, 10.0, 8.0, 15.0, 8.0, 12.0, 15.0, 14.0, 18.0, 21.0, 41.0, 56.0, 81.0, 217.0], [356.0, 135.0, 64.0, 42.0, 38.0, 29.0, 24.0, 17.0, 19.0, 16.0, 10.0, 16.0, 13.0, 5.0, 6.0, 5.0, 2.0, 8.0, 7.0, 5.0, 3.0, 7.0, 4.0, 6.0, 3.0, 3.0, 5.0, 4.0, 6.0, 2.0, 4.0, 5.0, 10.0, 5.0, 4.0, 8.0, 7.0, 10.0, 4.0, 13.0, 10.0, 13.0, 9.0, 8.0, 21.0, 32.0, 41.0, 51.0, 168.0], [385.0, 117.0, 73.0, 43.0, 36.0, 41.0, 21.0, 22.0, 21.0, 12.0, 14.0, 4.0, 12.0, 10.0, 10.0, 1.0, 2.0, 4.0, 1.0, 3.0, 5.0, 6.0, 2.0, 3.0, 4.0, 5.0, 3.0, 3.0, 4.0, 4.0, 2.0, 8.0, 6.0, 5.0, 5.0, 5.0, 5.0, 8.0, 9.0, 5.0, 8.0, 14.0, 8.0, 5.0, 15.0, 24.0, 39.0, 58.0, 120.0], [373.0, 127.0, 73.0, 47.0, 30.0, 29.0, 23.0, 20.0, 12.0, 13.0, 16.0, 12.0, 14.0, 4.0, 13.0, 4.0, 3.0, 5.0, 2.0, 3.0, 1.0, 3.0, 4.0, 4.0, 1.0, 5.0, 1.0, 3.0, 9.0, 2.0, 2.0, 4.0, 4.0, 10.0, 5.0, 2.0, 4.0, 3.0, 4.0, 5.0, 12.0, 10.0, 7.0, 7.0, 16.0, 13.0, 25.0, 31.0, 92.0], [362.0, 124.0, 65.0, 46.0, 30.0, 32.0, 16.0, 19.0, 12.0, 14.0, 10.0, 7.0, 9.0, 9.0, 3.0, 3.0, 4.0, 6.0, 4.0, 5.0, 4.0, 0.0, 4.0, 3.0, 3.0, 5.0, 3.0, 4.0, 4.0, 4.0, 3.0, 5.0, 4.0, 2.0, 7.0, 7.0, 3.0, 6.0, 3.0, 7.0, 5.0, 7.0, 1.0, 11.0, 8.0, 12.0, 17.0, 34.0, 68.0], [346.0, 126.0, 70.0, 44.0, 33.0, 33.0, 31.0, 18.0, 16.0, 11.0, 10.0, 8.0, 5.0, 7.0, 7.0, 2.0, 7.0, 4.0, 6.0, 4.0, 0.0, 1.0, 2.0, 4.0, 2.0, 2.0, 4.0, 2.0, 6.0, 3.0, 2.0, 3.0, 6.0, 4.0, 0.0, 4.0, 5.0, 3.0, 3.0, 5.0, 5.0, 5.0, 5.0, 5.0, 11.0, 10.0, 9.0, 24.0, 61.0], [369.0, 138.0, 73.0, 49.0, 32.0, 28.0, 20.0, 20.0, 18.0, 20.0, 10.0, 5.0, 14.0, 9.0, 5.0, 4.0, 2.0, 5.0, 3.0, 2.0, 1.0, 3.0, 2.0, 2.0, 2.0, 1.0, 5.0, 2.0, 1.0, 4.0, 3.0, 4.0, 3.0, 4.0, 1.0, 4.0, 3.0, 3.0, 2.0, 7.0, 5.0, 5.0, 7.0, 5.0, 5.0, 7.0, 5.0, 8.0, 57.0], [360.0, 141.0, 74.0, 44.0, 40.0, 18.0, 25.0, 26.0, 22.0, 9.0, 19.0, 4.0, 10.0, 5.0, 7.0, 2.0, 2.0, 2.0, 2.0, 4.0, 5.0, 2.0, 2.0, 4.0, 0.0, 2.0, 2.0, 2.0, 2.0, 1.0, 4.0, 4.0, 4.0, 2.0, 3.0, 3.0, 5.0, 2.0, 6.0, 4.0, 3.0, 2.0, 3.0, 3.0, 7.0, 5.0, 12.0, 7.0, 41.0], [370.0, 149.0, 61.0, 54.0, 36.0, 26.0, 29.0, 19.0, 12.0, 15.0, 8.0, 9.0, 8.0, 7.0, 5.0, 6.0, 5.0, 3.0, 2.0, 3.0, 1.0, 3.0, 0.0, 2.0, 4.0, 2.0, 1.0, 2.0, 4.0, 6.0, 2.0, 3.0, 3.0, 3.0, 3.0, 6.0, 6.0, 1.0, 5.0, 6.0, 1.0, 1.0, 5.0, 6.0, 2.0, 5.0, 3.0, 6.0, 33.0], [372.0, 136.0, 59.0, 38.0, 47.0, 34.0, 21.0, 19.0, 18.0, 10.0, 6.0, 8.0, 9.0, 6.0, 9.0, 7.0, 3.0, 2.0, 1.0, 6.0, 1.0, 2.0, 0.0, 3.0, 0.0, 2.0, 3.0, 1.0, 3.0, 1.0, 5.0, 3.0, 4.0, 2.0, 5.0, 0.0, 0.0, 5.0, 4.0, 5.0, 1.0, 2.0, 5.0, 1.0, 5.0, 4.0, 5.0, 10.0, 27.0], [372.0, 125.0, 61.0, 32.0, 37.0, 27.0, 30.0, 21.0, 19.0, 15.0, 12.0, 10.0, 6.0, 6.0, 8.0, 3.0, 4.0, 2.0, 3.0, 3.0, 0.0, 4.0, 2.0, 2.0, 0.0, 2.0, 1.0, 3.0, 3.0, 1.0, 3.0, 3.0, 2.0, 2.0, 2.0, 2.0, 4.0, 5.0, 4.0, 7.0, 4.0, 2.0, 4.0, 7.0, 2.0, 2.0, 4.0, 5.0, 22.0], [359.0, 126.0, 74.0, 44.0, 35.0, 26.0, 21.0, 26.0, 20.0, 15.0, 18.0, 8.0, 5.0, 5.0, 3.0, 5.0, 3.0, 4.0, 5.0, 2.0, 2.0, 4.0, 2.0, 0.0, 2.0, 1.0, 3.0, 1.0, 1.0, 2.0, 6.0, 1.0, 2.0, 2.0, 3.0, 1.0, 3.0, 3.0, 0.0, 3.0, 8.0, 6.0, 1.0, 4.0, 2.0, 4.0, 3.0, 7.0, 13.0], [379.0, 135.0, 80.0, 47.0, 32.0, 27.0, 19.0, 18.0, 11.0, 13.0, 9.0, 14.0, 13.0, 1.0, 12.0, 7.0, 3.0, 2.0, 3.0, 4.0, 2.0, 4.0, 1.0, 3.0, 1.0, 3.0, 0.0, 3.0, 7.0, 0.0, 3.0, 2.0, 2.0, 1.0, 3.0, 2.0, 4.0, 3.0, 7.0, 3.0, 1.0, 2.0, 3.0, 1.0, 0.0, 2.0, 7.0, 4.0, 17.0], [378.0, 135.0, 76.0, 33.0, 30.0, 31.0, 22.0, 25.0, 21.0, 12.0, 8.0, 15.0, 5.0, 3.0, 9.0, 3.0, 2.0, 3.0, 4.0, 2.0, 3.0, 4.0, 0.0, 3.0, 1.0, 1.0, 0.0, 2.0, 4.0, 2.0, 3.0, 2.0, 4.0, 2.0, 2.0, 1.0, 3.0, 2.0, 3.0, 2.0, 4.0, 6.0, 6.0, 2.0, 2.0, 1.0, 4.0, 2.0, 12.0], [345.0, 152.0, 64.0, 44.0, 37.0, 27.0, 19.0, 16.0, 19.0, 16.0, 11.0, 6.0, 14.0, 9.0, 4.0, 3.0, 4.0, 7.0, 2.0, 4.0, 3.0, 1.0, 2.0, 3.0, 0.0, 0.0, 3.0, 3.0, 1.0, 2.0, 1.0, 4.0, 2.0, 4.0, 3.0, 4.0, 5.0, 3.0, 1.0, 2.0, 2.0, 4.0, 2.0, 4.0, 4.0, 2.0, 2.0, 4.0, 11.0], [374.0, 133.0, 68.0, 60.0, 37.0, 31.0, 17.0, 22.0, 13.0, 12.0, 15.0, 11.0, 3.0, 3.0, 8.0, 7.0, 4.0, 2.0, 4.0, 5.0, 2.0, 4.0, 0.0, 3.0, 1.0, 2.0, 2.0, 2.0, 2.0, 1.0, 4.0, 1.0, 2.0, 6.0, 2.0, 2.0, 5.0, 5.0, 4.0, 1.0, 2.0, 3.0, 3.0, 2.0, 1.0, 3.0, 0.0, 4.0, 10.0], [370.0, 126.0, 75.0, 50.0, 52.0, 26.0, 16.0, 12.0, 14.0, 11.0, 14.0, 11.0, 6.0, 8.0, 6.0, 4.0, 5.0, 5.0, 2.0, 5.0, 2.0, 1.0, 2.0, 6.0, 2.0, 0.0, 2.0, 1.0, 5.0, 3.0, 3.0, 1.0, 1.0, 2.0, 0.0, 3.0, 2.0, 3.0, 2.0, 2.0, 1.0, 2.0, 3.0, 3.0, 3.0, 1.0, 3.0, 4.0, 12.0], [371.0, 133.0, 71.0, 44.0, 42.0, 23.0, 23.0, 21.0, 20.0, 16.0, 10.0, 6.0, 4.0, 6.0, 8.0, 3.0, 4.0, 1.0, 4.0, 6.0, 3.0, 4.0, 3.0, 2.0, 4.0, 1.0, 1.0, 2.0, 2.0, 0.0, 1.0, 2.0, 4.0, 2.0, 0.0, 1.0, 3.0, 4.0, 4.0, 3.0, 8.0, 4.0, 5.0, 1.0, 1.0, 3.0, 1.0, 4.0, 13.0], [347.0, 134.0, 83.0, 40.0, 32.0, 26.0, 22.0, 14.0, 20.0, 14.0, 8.0, 8.0, 10.0, 7.0, 9.0, 4.0, 5.0, 3.0, 3.0, 3.0, 2.0, 2.0, 4.0, 0.0, 1.0, 2.0, 1.0, 2.0, 1.0, 3.0, 6.0, 1.0, 4.0, 1.0, 1.0, 1.0, 8.0, 2.0, 1.0, 2.0, 1.0, 6.0, 2.0, 6.0, 2.0, 3.0, 4.0, 4.0, 10.0], [375.0, 132.0, 58.0, 39.0, 39.0, 35.0, 27.0, 13.0, 13.0, 9.0, 17.0, 14.0, 9.0, 8.0, 6.0, 2.0, 1.0, 8.0, 3.0, 3.0, 2.0, 2.0, 3.0, 1.0, 2.0, 3.0, 4.0, 3.0, 3.0, 2.0, 3.0, 1.0, 4.0, 1.0, 5.0, 0.0, 3.0, 2.0, 5.0, 5.0, 3.0, 1.0, 1.0, 1.0, 5.0, 2.0, 2.0, 3.0, 13.0], [355.0, 128.0, 80.0, 42.0, 37.0, 24.0, 26.0, 16.0, 20.0, 15.0, 5.0, 10.0, 11.0, 6.0, 3.0, 3.0, 7.0, 2.0, 3.0, 7.0, 3.0, 0.0, 1.0, 1.0, 2.0, 4.0, 1.0, 0.0, 1.0, 2.0, 3.0, 4.0, 1.0, 0.0, 3.0, 5.0, 4.0, 7.0, 2.0, 1.0, 5.0, 2.0, 4.0, 5.0, 2.0, 3.0, 2.0, 1.0, 12.0], [351.0, 146.0, 73.0, 42.0, 49.0, 18.0, 27.0, 20.0, 11.0, 16.0, 13.0, 11.0, 5.0, 5.0, 10.0, 5.0, 0.0, 2.0, 2.0, 3.0, 3.0, 2.0, 3.0, 6.0, 1.0, 0.0, 3.0, 2.0, 1.0, 5.0, 2.0, 0.0, 2.0, 3.0, 3.0, 2.0, 3.0, 5.0, 7.0, 6.0, 2.0, 0.0, 3.0, 2.0, 2.0, 3.0, 4.0, 0.0, 11.0], [376.0, 141.0, 70.0, 50.0, 36.0, 30.0, 18.0, 17.0, 16.0, 16.0, 11.0, 12.0, 11.0, 6.0, 7.0, 2.0, 3.0, 3.0, 1.0, 1.0, 2.0, 0.0, 1.0, 4.0, 3.0, 1.0, 3.0, 2.0, 2.0, 3.0, 3.0, 1.0, 5.0, 3.0, 3.0, 4.0, 3.0, 3.0, 2.0, 3.0, 2.0, 2.0, 4.0, 0.0, 6.0, 2.0, 2.0, 1.0, 18.0], [376.0, 143.0, 71.0, 55.0, 24.0, 35.0, 25.0, 18.0, 10.0, 14.0, 10.0, 12.0, 10.0, 6.0, 3.0, 3.0, 8.0, 6.0, 2.0, 2.0, 0.0, 0.0, 0.0, 5.0, 4.0, 2.0, 1.0, 2.0, 0.0, 2.0, 4.0, 2.0, 7.0, 2.0, 6.0, 1.0, 1.0, 3.0, 1.0, 2.0, 5.0, 2.0, 6.0, 1.0, 2.0, 1.0, 1.0, 3.0, 9.0], [407.0, 125.0, 69.0, 52.0, 34.0, 21.0, 22.0, 14.0, 14.0, 15.0, 9.0, 5.0, 15.0, 8.0, 8.0, 10.0, 3.0, 3.0, 3.0, 0.0, 4.0, 2.0, 2.0, 2.0, 2.0, 3.0, 3.0, 3.0, 2.0, 3.0, 1.0, 4.0, 2.0, 2.0, 5.0, 0.0, 6.0, 4.0, 1.0, 5.0, 0.0, 1.0, 2.0, 2.0, 6.0, 1.0, 0.0, 4.0, 13.0], [374.0, 126.0, 69.0, 40.0, 53.0, 23.0, 17.0, 19.0, 21.0, 13.0, 8.0, 15.0, 9.0, 3.0, 8.0, 5.0, 5.0, 4.0, 4.0, 3.0, 3.0, 3.0, 4.0, 1.0, 2.0, 3.0, 1.0, 1.0, 0.0, 4.0, 2.0, 4.0, 1.0, 4.0, 4.0, 1.0, 1.0, 3.0, 0.0, 1.0, 2.0, 4.0, 8.0, 3.0, 4.0, 4.0, 1.0, 4.0, 13.0], [366.0, 140.0, 68.0, 43.0, 41.0, 26.0, 24.0, 21.0, 17.0, 17.0, 13.0, 11.0, 8.0, 6.0, 3.0, 7.0, 5.0, 0.0, 2.0, 3.0, 6.0, 3.0, 3.0, 3.0, 2.0, 3.0, 1.0, 2.0, 2.0, 1.0, 4.0, 2.0, 1.0, 1.0, 2.0, 0.0, 1.0, 3.0, 5.0, 6.0, 4.0, 4.0, 2.0, 0.0, 2.0, 1.0, 3.0, 5.0, 10.0], [404.0, 140.0, 64.0, 50.0, 37.0, 30.0, 21.0, 24.0, 19.0, 10.0, 11.0, 9.0, 8.0, 3.0, 10.0, 7.0, 3.0, 7.0, 5.0, 1.0, 2.0, 2.0, 1.0, 0.0, 4.0, 0.0, 2.0, 4.0, 1.0, 1.0, 3.0, 4.0, 2.0, 2.0, 3.0, 4.0, 4.0, 2.0, 3.0, 2.0, 7.0, 4.0, 2.0, 1.0, 0.0, 7.0, 0.0, 5.0, 15.0], [373.0, 121.0, 71.0, 69.0, 36.0, 33.0, 14.0, 18.0, 16.0, 16.0, 8.0, 8.0, 5.0, 11.0, 5.0, 6.0, 6.0, 4.0, 3.0, 5.0, 4.0, 1.0, 4.0, 2.0, 1.0, 1.0, 0.0, 1.0, 4.0, 2.0, 2.0, 5.0, 2.0, 3.0, 2.0, 1.0, 1.0, 3.0, 8.0, 5.0, 1.0, 5.0, 3.0, 3.0, 6.0, 0.0, 4.0, 2.0, 16.0], [350.0, 123.0, 81.0, 47.0, 39.0, 29.0, 19.0, 20.0, 22.0, 18.0, 9.0, 9.0, 8.0, 10.0, 4.0, 6.0, 2.0, 3.0, 1.0, 2.0, 4.0, 5.0, 3.0, 1.0, 3.0, 0.0, 0.0, 3.0, 2.0, 2.0, 2.0, 1.0, 4.0, 1.0, 3.0, 5.0, 3.0, 0.0, 4.0, 2.0, 5.0, 3.0, 4.0, 4.0, 0.0, 1.0, 1.0, 4.0, 7.0], [374.0, 136.0, 69.0, 50.0, 39.0, 28.0, 26.0, 17.0, 18.0, 15.0, 11.0, 9.0, 7.0, 6.0, 2.0, 5.0, 6.0, 2.0, 2.0, 3.0, 1.0, 4.0, 4.0, 3.0, 3.0, 5.0, 1.0, 4.0, 0.0, 0.0, 4.0, 3.0, 6.0, 4.0, 3.0, 3.0, 1.0, 4.0, 2.0, 3.0, 2.0, 2.0, 3.0, 1.0, 0.0, 3.0, 3.0, 7.0, 17.0]],
    "Name": "sCurve-0",
    "Overflow": 1995581.0,
    "Type": "Histo2d",
    "Underflow": 0.0,
    "x": {
        "AxisTitle": "Vcal",
        "Bins": 51,
        "High": 302.5,
        "Low": 47.5
    },
    "y": {
        "AxisTitle": "Occupancy",
        "Bins": 49,
        "High": 49.5,
        "Low": 0.5
    },
    "z": {
        "AxisTitle": "Number of pixels"
    }
}