time,Hardware,Voltage,Current
1625781754889,high-voltage-2,1,0.105517
time,Hardware,Voltage,Current
1625781754889,high-voltage-2,2,0.17032
time,Hardware,Voltage,Current
1625781754889,high-voltage-2,3,0.209916
time,Hardware,Voltage,Current
1625781754889,high-voltage-2,4,0.244918
time,Hardware,Voltage,Current
1625781754889,high-voltage-2,5,0.274213
time,Hardware,Voltage,Current
1625781754889,high-voltage-2,6,0.303291
time,Hardware,Voltage,Current
1625781754889,high-voltage-2,7,0.330253
time,Hardware,Voltage,Current
1625781754889,high-voltage-2,8,0.357219
time,Hardware,Voltage,Current
1625781754889,high-voltage-2,9,0.379834
time,Hardware,Voltage,Current
1625781754889,high-voltage-2,10,0.399371
time,Hardware,Voltage,Current
1625781754889,high-voltage-2,11,0.415791
time,Hardware,Voltage,Current
1625781754889,high-voltage-2,12,0.429161
time,Hardware,Voltage,Current
1625781754889,high-voltage-2,13,0.441089
time,Hardware,Voltage,Current
1625781754889,high-voltage-2,14,0.453144
time,Hardware,Voltage,Current
1625781754889,high-voltage-2,15,0.463853
time,Hardware,Voltage,Current
1625781754889,high-voltage-2,16,0.474408
time,Hardware,Voltage,Current
1625781754889,high-voltage-2,17,0.484461
time,Hardware,Voltage,Current
1625781754889,high-voltage-2,18,0.494147
time,Hardware,Voltage,Current
1625781754889,high-voltage-2,19,0.503631
time,Hardware,Voltage,Current
1625781754889,high-voltage-2,20,0.513058
time,Hardware,Voltage,Current
1625781754889,high-voltage-2,25,0.56306
time,Hardware,Voltage,Current
1625781754889,high-voltage-2,30,0.614081
time,Hardware,Voltage,Current
1625781754889,high-voltage-2,35,0.666569
time,Hardware,Voltage,Current
1625781754889,high-voltage-2,40,0.726576
time,Hardware,Voltage,Current
1625781754889,high-voltage-2,45,0.805792
time,Hardware,Voltage,Current
1625781754889,high-voltage-2,50,0.865718
time,Hardware,Voltage,Current
1625781754889,high-voltage-2,55,0.926783
time,Hardware,Voltage,Current
1625781754889,high-voltage-2,60,0.985811
time,Hardware,Voltage,Current
1625781754889,high-voltage-2,65,1.04136
time,Hardware,Voltage,Current
1625781754889,high-voltage-2,70,1.09736
time,Hardware,Voltage,Current
1625781754889,high-voltage-2,75,1.14837
time,Hardware,Voltage,Current
1625781754889,high-voltage-2,80,1.19313
time,Hardware,Voltage,Current
1625781754889,high-voltage-2,85,1.23081
time,Hardware,Voltage,Current
1625781754889,high-voltage-2,90,1.26013
time,Hardware,Voltage,Current
1625781754889,high-voltage-2,95,1.28792
time,Hardware,Voltage,Current
1625781754889,high-voltage-2,100,1.31029
