{
    "Data": [0.0, 0.0, 0.0, 0.0, 0.0, 0.0, 0.0, 0.0, 0.0, 0.0, 0.0, 0.0, 0.0, 0.0, 0.0, 0.0, 0.0, 0.0, 0.0, 0.0, 0.0, 0.0, 0.0, 0.0, 0.0, 0.0, 0.0, 0.0, 0.0, 0.0, 0.0, 0.0, 0.0, 0.0, 0.0, 0.0, 0.0, 0.0, 0.0, 0.0, 0.0, 0.0, 0.0, 0.0, 0.0, 0.0, 0.0, 0.0, 0.0, 0.0, 12.0, 9.0, 19.0, 11.0, 15.0, 19.0, 19.0, 22.0, 28.0, 25.0, 31.0, 36.0, 48.0, 42.0, 58.0, 64.0, 61.0, 90.0, 104.0, 103.0, 138.0, 150.0, 178.0, 238.0, 247.0, 330.0, 378.0, 420.0, 459.0, 585.0, 630.0, 689.0, 710.0, 813.0, 863.0, 1001.0, 1016.0, 1156.0, 1215.0, 1287.0, 1634.0, 1994.0, 2454.0, 2925.0, 3411.0, 3709.0, 3630.0, 3520.0, 3080.0, 2579.0, 2015.0, 1486.0, 1129.0, 809.0, 590.0, 471.0, 399.0, 304.0, 277.0, 219.0, 171.0, 159.0, 146.0, 107.0, 89.0, 74.0, 88.0, 62.0, 66.0, 33.0, 44.0, 32.0, 47.0, 30.0, 24.0, 23.0, 25.0, 16.0, 19.0, 17.0, 13.0, 20.0, 15.0, 10.0, 12.0, 11.0, 11.0, 7.0, 8.0, 7.0, 7.0, 12.0, 10.0, 9.0, 10.0, 7.0, 3.0, 4.0, 6.0, 10.0, 5.0, 4.0, 8.0, 9.0, 10.0, 7.0, 4.0, 7.0, 9.0, 8.0, 9.0, 15.0, 11.0, 12.0, 21.0, 22.0, 27.0, 54.0, 28.0, 42.0, 63.0, 70.0, 80.0, 105.0, 127.0, 153.0, 173.0, 174.0, 218.0, 237.0, 256.0, 321.0, 336.0, 387.0, 433.0, 492.0, 548.0, 574.0, 583.0, 663.0, 696.0, 739.0, 750.0, 800.0, 815.0, 803.0, 849.0, 886.0, 832.0, 862.0, 840.0, 806.0, 787.0, 749.0, 708.0, 664.0, 617.0, 547.0, 534.0, 507.0, 440.0, 375.0, 393.0, 343.0, 280.0, 232.0, 219.0, 200.0, 148.0, 132.0, 118.0, 114.0, 102.0, 80.0, 52.0, 69.0, 45.0, 38.0, 30.0, 24.0, 17.0, 7.0, 8.0, 15.0, 6.0, 12.0, 5.0, 5.0, 2.0, 4.0, 4.0, 3.0, 1.0, 1.0, 1.0, 0.0, 0.0, 0.0, 2.0, 0.0, 0.0, 0.0, 1.0, 0.0, 0.0, 0.0, 0.0, 0.0, 0.0, 0.0, 0.0, 0.0, 0.0, 0.0, 0.0, 0.0, 0.0, 0.0, 0.0, 0.0, 0.0, 0.0, 0.0, 0.0, 0.0, 0.0, 0.0, 0.0, 1.0, 0.0, 0.0, 0.0, 0.0, 0.0, 0.0, 0.0, 0.0, 0.0, 0.0, 1.0, 0.0, 0.0, 0.0, 0.0, 0.0, 0.0, 0.0, 0.0, 0.0, 0.0, 0.0, 0.0, 0.0, 0.0, 0.0, 0.0, 0.0, 0.0, 0.0, 0.0, 0.0, 0.0, 0.0, 0.0, 0.0, 0.0, 0.0, 0.0, 0.0, 0.0, 0.0, 0.0, 0.0, 0.0, 0.0, 0.0, 0.0, 0.0, 0.0, 0.0, 0.0, 0.0, 0.0, 0.0, 0.0, 0.0, 0.0, 0.0, 0.0, 0.0, 0.0, 0.0, 0.0, 0.0, 0.0, 0.0, 0.0, 0.0, 0.0, 0.0, 0.0, 0.0, 0.0, 0.0, 0.0, 0.0, 0.0, 0.0, 0.0, 0.0, 0.0, 0.0, 0.0, 0.0, 0.0, 0.0, 0.0, 0.0, 0.0, 0.0, 0.0, 0.0],
    "Name": "ThresholdDist-0",
    "Overflow": 0.0,
    "Type": "Histo1d",
    "Underflow": 0.0,
    "x": {
        "AxisTitle": "Threshold [e]",
        "Bins": 372,
        "High": 3715.0,
        "Low": -5.0
    },
    "y": {
        "AxisTitle": "Number of Pixels"
    },
    "z": {
        "AxisTitle": "z"
    }
}