time,Hardware,Voltage,Current
1622009714345,high-voltage-3,1,0.058255
time,Hardware,Voltage,Current
1622009714345,high-voltage-3,2,0.0649124
time,Hardware,Voltage,Current
1622009714345,high-voltage-3,3,0.0700383
time,Hardware,Voltage,Current
1622009714345,high-voltage-3,4,0.0748401
