time,Hardware,Voltage,Current
1626348074706,high-voltage,1,0.010214
time,Hardware,Voltage,Current
1626348074706,high-voltage,2,0.0252535
time,Hardware,Voltage,Current
1626348074706,high-voltage,3,0.0324482
time,Hardware,Voltage,Current
1626348074706,high-voltage,4,0.0397199
time,Hardware,Voltage,Current
1626348074706,high-voltage,5,0.0455498
time,Hardware,Voltage,Current
1626348074706,high-voltage,6,0.051767
time,Hardware,Voltage,Current
1626348074706,high-voltage,7,0.0576009
time,Hardware,Voltage,Current
1626348074706,high-voltage,8,0.0645533
time,Hardware,Voltage,Current
1626348074706,high-voltage,9,0.0721202
time,Hardware,Voltage,Current
1626348074706,high-voltage,10,0.0778228
time,Hardware,Voltage,Current
1626348074706,high-voltage,11,0.0844307
time,Hardware,Voltage,Current
1626348074706,high-voltage,12,0.0887624
time,Hardware,Voltage,Current
1626348074706,high-voltage,13,0.0936512
time,Hardware,Voltage,Current
1626348074706,high-voltage,14,0.0977965
time,Hardware,Voltage,Current
1626348074706,high-voltage,15,0.10193
time,Hardware,Voltage,Current
1626348074706,high-voltage,16,0.104819
time,Hardware,Voltage,Current
1626348074706,high-voltage,17,0.108315
time,Hardware,Voltage,Current
1626348074706,high-voltage,18,0.111373
time,Hardware,Voltage,Current
1626348074706,high-voltage,19,0.114771
time,Hardware,Voltage,Current
1626348074706,high-voltage,20,0.116976
time,Hardware,Voltage,Current
1626348074706,high-voltage,25,0.132935
time,Hardware,Voltage,Current
1626348074706,high-voltage,30,0.149748
time,Hardware,Voltage,Current
1626348074706,high-voltage,35,0.184741
time,Hardware,Voltage,Current
1626348074706,high-voltage,40,0.287196
time,Hardware,Voltage,Current
1626348074706,high-voltage,45,0.53342
time,Hardware,Voltage,Current
1626348074706,high-voltage,50,1.00324
time,Hardware,Voltage,Current
1626348074706,high-voltage,55,1.81221
time,Hardware,Voltage,Current
1626348074706,high-voltage,60,3.04574
time,Hardware,Voltage,Current
1626348074706,high-voltage,65,4.75976
time,Hardware,Voltage,Current
1626348074706,high-voltage,70,7.06136
time,Hardware,Voltage,Current
1626348074706,high-voltage,75,10
