{
    "Data": [0.0, 0.0, 0.0, 0.0, 0.0, 0.0, 0.0, 0.0, 0.0, 0.0, 0.0, 0.0, 0.0, 0.0, 0.0, 0.0, 0.0, 0.0, 0.0, 0.0, 0.0, 0.0, 0.0, 0.0, 0.0, 0.0, 0.0, 0.0, 0.0, 0.0, 0.0, 0.0, 0.0, 0.0, 0.0, 0.0, 0.0, 0.0, 0.0, 0.0, 0.0, 0.0, 0.0, 0.0, 0.0, 0.0, 0.0, 0.0, 0.0, 0.0, 0.0, 0.0, 1.0, 5.0, 5.0, 9.0, 8.0, 9.0, 7.0, 12.0, 11.0, 11.0, 9.0, 12.0, 9.0, 6.0, 8.0, 4.0, 8.0, 8.0, 6.0, 11.0, 10.0, 16.0, 17.0, 24.0, 35.0, 30.0, 43.0, 70.0, 80.0, 100.0, 122.0, 172.0, 225.0, 231.0, 347.0, 479.0, 792.0, 1286.0, 2115.0, 3169.0, 4114.0, 4878.0, 5140.0, 5007.0, 4430.0, 3610.0, 3011.0, 2417.0, 1854.0, 1395.0, 1021.0, 798.0, 602.0, 447.0, 434.0, 335.0, 265.0, 178.0, 179.0, 108.0, 83.0, 72.0, 50.0, 52.0, 46.0, 29.0, 30.0, 28.0, 23.0, 25.0, 30.0, 18.0, 23.0, 22.0, 22.0, 16.0, 14.0, 20.0, 20.0, 13.0, 15.0, 17.0, 15.0, 16.0, 16.0, 7.0, 10.0, 6.0, 12.0, 12.0, 7.0, 4.0, 6.0, 11.0, 6.0, 5.0, 6.0, 6.0, 6.0, 2.0, 8.0, 7.0, 2.0, 7.0, 6.0, 7.0, 7.0, 4.0, 5.0, 8.0, 9.0, 10.0, 11.0, 26.0, 15.0, 29.0, 36.0, 28.0, 46.0, 57.0, 67.0, 84.0, 80.0, 129.0, 130.0, 152.0, 168.0, 184.0, 236.0, 260.0, 310.0, 339.0, 352.0, 404.0, 398.0, 462.0, 473.0, 543.0, 556.0, 567.0, 638.0, 597.0, 655.0, 696.0, 672.0, 642.0, 702.0, 659.0, 683.0, 693.0, 670.0, 659.0, 645.0, 633.0, 630.0, 576.0, 589.0, 494.0, 514.0, 518.0, 414.0, 415.0, 347.0, 371.0, 308.0, 333.0, 287.0, 233.0, 223.0, 181.0, 187.0, 173.0, 153.0, 128.0, 127.0, 123.0, 98.0, 82.0, 82.0, 60.0, 62.0, 44.0, 34.0, 38.0, 25.0, 29.0, 13.0, 18.0, 15.0, 10.0, 16.0, 7.0, 6.0, 5.0, 3.0, 6.0, 2.0, 3.0, 0.0, 1.0, 2.0, 2.0, 1.0, 1.0, 3.0, 1.0, 0.0, 0.0, 2.0, 1.0, 1.0, 2.0, 1.0, 1.0, 0.0, 0.0, 0.0, 0.0, 0.0, 0.0, 0.0, 0.0, 0.0, 0.0, 0.0, 0.0, 0.0, 0.0, 0.0, 0.0, 0.0, 0.0, 3.0, 0.0, 0.0, 0.0, 1.0, 1.0, 1.0, 1.0, 0.0, 0.0, 0.0, 0.0, 0.0, 0.0, 2.0, 0.0, 0.0, 0.0, 0.0, 0.0, 0.0, 0.0, 0.0, 0.0, 0.0, 0.0, 0.0, 0.0, 0.0, 0.0, 0.0, 0.0, 1.0, 0.0, 0.0, 0.0, 0.0, 0.0, 0.0, 0.0, 0.0, 0.0, 0.0, 0.0, 0.0, 0.0, 0.0, 0.0, 0.0, 0.0, 0.0, 0.0, 0.0, 0.0, 0.0, 0.0, 0.0, 0.0, 0.0, 0.0, 0.0, 0.0, 0.0, 0.0, 0.0, 0.0, 0.0, 0.0, 0.0, 0.0, 0.0, 0.0, 0.0, 0.0, 0.0, 0.0, 0.0, 0.0, 0.0, 0.0, 0.0, 0.0, 0.0, 0.0, 0.0, 0.0, 0.0, 0.0, 0.0, 0.0],
    "Name": "ThresholdDist-0",
    "Overflow": 0.0,
    "Type": "Histo1d",
    "Underflow": 0.0,
    "x": {
        "AxisTitle": "Threshold [e]",
        "Bins": 374,
        "High": 3735.0,
        "Low": -5.0
    },
    "y": {
        "AxisTitle": "Number of Pixels"
    },
    "z": {
        "AxisTitle": "z"
    }
}