time,Hardware,Voltage,Current
1626384497543,high-voltage-3,1,0.0591645
time,Hardware,Voltage,Current
1626384497543,high-voltage-3,2,0.0641559
time,Hardware,Voltage,Current
1626384497543,high-voltage-3,3,0.0669895
time,Hardware,Voltage,Current
1626384497543,high-voltage-3,4,0.0697359
time,Hardware,Voltage,Current
1626384497543,high-voltage-3,5,0.0742445
time,Hardware,Voltage,Current
1626384497543,high-voltage-3,6,0.0746306
time,Hardware,Voltage,Current
1626384497543,high-voltage-3,7,0.0770852
time,Hardware,Voltage,Current
1626384497543,high-voltage-3,8,0.080171
time,Hardware,Voltage,Current
1626384497543,high-voltage-3,9,0.0826672
time,Hardware,Voltage,Current
1626384497543,high-voltage-3,10,0.0839117
time,Hardware,Voltage,Current
1626384497543,high-voltage-3,11,0.0865742
time,Hardware,Voltage,Current
1626384497543,high-voltage-3,12,0.0902602
time,Hardware,Voltage,Current
1626384497543,high-voltage-3,13,0.0935951
time,Hardware,Voltage,Current
1626384497543,high-voltage-3,14,0.0955507
time,Hardware,Voltage,Current
1626384497543,high-voltage-3,15,0.0969694
time,Hardware,Voltage,Current
1626384497543,high-voltage-3,16,0.100747
time,Hardware,Voltage,Current
1626384497543,high-voltage-3,17,0.101717
time,Hardware,Voltage,Current
1626384497543,high-voltage-3,18,0.103351
time,Hardware,Voltage,Current
1626384497543,high-voltage-3,19,0.106833
time,Hardware,Voltage,Current
1626384497543,high-voltage-3,20,0.108551
time,Hardware,Voltage,Current
1626384497543,high-voltage-3,25,0.116419
time,Hardware,Voltage,Current
1626384497543,high-voltage-3,30,0.125013
time,Hardware,Voltage,Current
1626384497543,high-voltage-3,35,0.131735
time,Hardware,Voltage,Current
1626384497543,high-voltage-3,40,0.139014
time,Hardware,Voltage,Current
1626384497543,high-voltage-3,45,0.145649
time,Hardware,Voltage,Current
1626384497543,high-voltage-3,50,0.151558
time,Hardware,Voltage,Current
1626384497543,high-voltage-3,55,0.158593
time,Hardware,Voltage,Current
1626384497543,high-voltage-3,60,0.166131
time,Hardware,Voltage,Current
1626384497543,high-voltage-3,65,0.175766
time,Hardware,Voltage,Current
1626384497543,high-voltage-3,70,0.185182
time,Hardware,Voltage,Current
1626384497543,high-voltage-3,75,0.193814
time,Hardware,Voltage,Current
1626384497543,high-voltage-3,80,0.20524
time,Hardware,Voltage,Current
1626384497543,high-voltage-3,85,0.213079
time,Hardware,Voltage,Current
1626384497543,high-voltage-3,90,0.223532
time,Hardware,Voltage,Current
1626384497543,high-voltage-3,95,0.235108
time,Hardware,Voltage,Current
1626384497543,high-voltage-3,100,0.24389
