{
    "Data": [0.0, 0.0, 0.0, 0.0, 0.0, 0.0, 0.0, 0.0, 0.0, 0.0, 0.0, 0.0, 0.0, 0.0, 0.0, 0.0, 0.0, 0.0, 0.0, 4.0, 2.0, 3.0, 9.0, 7.0, 0.0, 12.0, 22.0, 25.0, 26.0, 37.0, 31.0, 29.0, 4.0, 32.0, 50.0, 5.0, 49.0, 30.0, 30.0, 50.0, 19.0, 33.0, 50.0, 50.0, 50.0, 38.0, 14.0, 50.0, 50.0, 33.0, 7.0],
    "Name": "Scurve-70-96",
    "Overflow": 0.0,
    "Type": "Histo1d",
    "Underflow": 0.0,
    "x": {
        "AxisTitle": "Vcal",
        "Bins": 51,
        "High": 302.5,
        "Low": 47.5
    },
    "y": {
        "AxisTitle": "Occupancy"
    },
    "z": {
        "AxisTitle": "z"
    }
}