time,Hardware,Voltage,Current
1626607145962,high-voltage-2,1,0.215011
time,Hardware,Voltage,Current
1626607145962,high-voltage-2,2,0.265168
time,Hardware,Voltage,Current
1626607145962,high-voltage-2,3,0.289803
time,Hardware,Voltage,Current
1626607145962,high-voltage-2,4,0.306328
time,Hardware,Voltage,Current
1626607145962,high-voltage-2,5,0.328609
time,Hardware,Voltage,Current
1626607145962,high-voltage-2,6,0.354386
time,Hardware,Voltage,Current
1626607145962,high-voltage-2,7,0.380913
time,Hardware,Voltage,Current
1626607145962,high-voltage-2,8,0.411013
time,Hardware,Voltage,Current
1626607145962,high-voltage-2,9,0.44808
time,Hardware,Voltage,Current
1626607145962,high-voltage-2,10,0.487181
time,Hardware,Voltage,Current
1626607145962,high-voltage-2,11,0.526124
time,Hardware,Voltage,Current
1626607145962,high-voltage-2,12,0.567465
time,Hardware,Voltage,Current
1626607145962,high-voltage-2,13,0.610881
time,Hardware,Voltage,Current
1626607145962,high-voltage-2,14,0.6506
time,Hardware,Voltage,Current
1626607145962,high-voltage-2,15,0.685564
time,Hardware,Voltage,Current
1626607145962,high-voltage-2,16,0.716228
time,Hardware,Voltage,Current
1626607145962,high-voltage-2,17,0.746688
time,Hardware,Voltage,Current
1626607145962,high-voltage-2,18,0.772898
time,Hardware,Voltage,Current
1626607145962,high-voltage-2,19,0.796773
time,Hardware,Voltage,Current
1626607145962,high-voltage-2,20,0.819618
time,Hardware,Voltage,Current
1626607145962,high-voltage-2,25,0.918246
time,Hardware,Voltage,Current
1626607145962,high-voltage-2,30,1.0156
time,Hardware,Voltage,Current
1626607145962,high-voltage-2,35,1.11572
time,Hardware,Voltage,Current
1626607145962,high-voltage-2,40,1.22767
time,Hardware,Voltage,Current
1626607145962,high-voltage-2,45,1.36128
time,Hardware,Voltage,Current
1626607145962,high-voltage-2,50,1.46119
time,Hardware,Voltage,Current
1626607145962,high-voltage-2,55,1.55277
time,Hardware,Voltage,Current
1626607145962,high-voltage-2,60,1.63931
time,Hardware,Voltage,Current
1626607145962,high-voltage-2,65,1.72385
time,Hardware,Voltage,Current
1626607145962,high-voltage-2,70,1.80464
time,Hardware,Voltage,Current
1626607145962,high-voltage-2,75,1.88193
time,Hardware,Voltage,Current
1626607145962,high-voltage-2,80,1.95894
time,Hardware,Voltage,Current
1626607145962,high-voltage-2,85,2.03019
time,Hardware,Voltage,Current
1626607145962,high-voltage-2,90,2.10057
time,Hardware,Voltage,Current
1626607145962,high-voltage-2,95,2.16812
time,Hardware,Voltage,Current
1626607145962,high-voltage-2,100,2.23475
