{
    "Data": [[4400.0, 2372.0, 1611.0, 1228.0, 998.0, 881.0, 809.0, 760.0, 677.0, 607.0, 576.0, 567.0, 490.0, 495.0, 473.0, 499.0, 486.0, 437.0, 395.0, 394.0, 375.0, 398.0, 363.0, 363.0, 364.0, 377.0, 362.0, 359.0, 335.0, 341.0, 372.0, 320.0, 343.0, 345.0, 319.0, 343.0, 348.0, 316.0, 329.0, 363.0, 349.0, 352.0, 386.0, 376.0, 435.0, 437.0, 505.0, 545.0, 573.0], [4306.0, 2279.0, 1742.0, 1280.0, 1092.0, 905.0, 792.0, 739.0, 674.0, 624.0, 578.0, 511.0, 557.0, 513.0, 457.0, 490.0, 414.0, 437.0, 429.0, 388.0, 372.0, 405.0, 398.0, 392.0, 362.0, 350.0, 386.0, 350.0, 354.0, 380.0, 363.0, 317.0, 338.0, 344.0, 317.0, 329.0, 364.0, 321.0, 359.0, 347.0, 375.0, 366.0, 386.0, 361.0, 437.0, 438.0, 498.0, 578.0, 774.0], [4359.0, 2368.0, 1667.0, 1345.0, 1082.0, 958.0, 841.0, 723.0, 716.0, 616.0, 555.0, 557.0, 513.0, 456.0, 496.0, 468.0, 433.0, 462.0, 438.0, 422.0, 438.0, 401.0, 391.0, 385.0, 383.0, 361.0, 339.0, 333.0, 362.0, 358.0, 327.0, 346.0, 357.0, 344.0, 364.0, 330.0, 338.0, 339.0, 378.0, 373.0, 397.0, 395.0, 366.0, 395.0, 453.0, 455.0, 566.0, 648.0, 939.0], [4401.0, 2303.0, 1697.0, 1323.0, 1074.0, 935.0, 810.0, 743.0, 707.0, 629.0, 582.0, 563.0, 494.0, 541.0, 508.0, 444.0, 465.0, 431.0, 418.0, 439.0, 422.0, 379.0, 376.0, 381.0, 358.0, 361.0, 378.0, 397.0, 379.0, 372.0, 327.0, 398.0, 355.0, 352.0, 350.0, 388.0, 352.0, 359.0, 364.0, 351.0, 389.0, 364.0, 422.0, 427.0, 477.0, 497.0, 533.0, 682.0, 1072.0], [4451.0, 2455.0, 1639.0, 1336.0, 1070.0, 980.0, 860.0, 751.0, 678.0, 637.0, 578.0, 587.0, 520.0, 567.0, 475.0, 448.0, 426.0, 439.0, 427.0, 401.0, 419.0, 410.0, 390.0, 417.0, 399.0, 378.0, 392.0, 379.0, 379.0, 392.0, 343.0, 287.0, 384.0, 330.0, 342.0, 387.0, 367.0, 349.0, 359.0, 366.0, 421.0, 402.0, 405.0, 428.0, 439.0, 527.0, 544.0, 701.0, 1076.0], [4451.0, 2533.0, 1730.0, 1339.0, 1156.0, 955.0, 855.0, 767.0, 704.0, 640.0, 580.0, 557.0, 536.0, 558.0, 447.0, 501.0, 468.0, 473.0, 459.0, 437.0, 418.0, 435.0, 391.0, 348.0, 375.0, 340.0, 391.0, 372.0, 358.0, 381.0, 390.0, 355.0, 345.0, 364.0, 375.0, 361.0, 355.0, 371.0, 360.0, 350.0, 424.0, 412.0, 431.0, 453.0, 468.0, 520.0, 570.0, 698.0, 1099.0], [4512.0, 2434.0, 1695.0, 1381.0, 1090.0, 935.0, 828.0, 772.0, 673.0, 679.0, 579.0, 596.0, 572.0, 493.0, 502.0, 504.0, 451.0, 461.0, 457.0, 421.0, 448.0, 416.0, 360.0, 461.0, 406.0, 363.0, 361.0, 372.0, 397.0, 367.0, 381.0, 329.0, 365.0, 402.0, 389.0, 382.0, 366.0, 357.0, 352.0, 398.0, 388.0, 395.0, 431.0, 435.0, 453.0, 495.0, 606.0, 787.0, 1124.0], [4371.0, 2415.0, 1755.0, 1402.0, 1122.0, 1012.0, 855.0, 743.0, 724.0, 686.0, 641.0, 544.0, 459.0, 505.0, 493.0, 497.0, 460.0, 464.0, 463.0, 420.0, 430.0, 408.0, 431.0, 380.0, 386.0, 380.0, 384.0, 351.0, 389.0, 382.0, 399.0, 347.0, 398.0, 377.0, 362.0, 370.0, 382.0, 386.0, 380.0, 369.0, 427.0, 437.0, 447.0, 458.0, 511.0, 541.0, 668.0, 701.0, 1136.0], [4347.0, 2431.0, 1746.0, 1290.0, 1131.0, 965.0, 864.0, 780.0, 735.0, 628.0, 572.0, 598.0, 564.0, 552.0, 455.0, 468.0, 434.0, 492.0, 408.0, 435.0, 445.0, 401.0, 378.0, 385.0, 377.0, 381.0, 412.0, 375.0, 379.0, 375.0, 367.0, 386.0, 372.0, 341.0, 381.0, 372.0, 392.0, 387.0, 378.0, 420.0, 362.0, 425.0, 473.0, 443.0, 532.0, 545.0, 612.0, 779.0, 1221.0], [4490.0, 2442.0, 1757.0, 1269.0, 1101.0, 930.0, 854.0, 728.0, 712.0, 653.0, 620.0, 564.0, 520.0, 525.0, 523.0, 480.0, 469.0, 478.0, 436.0, 425.0, 421.0, 417.0, 424.0, 398.0, 361.0, 346.0, 364.0, 340.0, 373.0, 348.0, 363.0, 359.0, 362.0, 405.0, 365.0, 372.0, 371.0, 378.0, 393.0, 413.0, 424.0, 406.0, 446.0, 491.0, 504.0, 553.0, 615.0, 777.0, 1265.0], [4287.0, 2399.0, 1653.0, 1382.0, 1059.0, 910.0, 862.0, 730.0, 687.0, 649.0, 607.0, 566.0, 581.0, 494.0, 510.0, 486.0, 459.0, 461.0, 457.0, 424.0, 399.0, 383.0, 360.0, 385.0, 391.0, 361.0, 430.0, 382.0, 401.0, 355.0, 386.0, 350.0, 354.0, 345.0, 380.0, 340.0, 369.0, 372.0, 368.0, 402.0, 413.0, 394.0, 437.0, 437.0, 516.0, 569.0, 660.0, 792.0, 1276.0], [4227.0, 2439.0, 1707.0, 1229.0, 1032.0, 965.0, 837.0, 718.0, 700.0, 652.0, 559.0, 541.0, 504.0, 496.0, 460.0, 471.0, 478.0, 446.0, 443.0, 408.0, 407.0, 419.0, 407.0, 366.0, 362.0, 375.0, 388.0, 335.0, 353.0, 387.0, 339.0, 397.0, 336.0, 362.0, 380.0, 386.0, 354.0, 406.0, 416.0, 382.0, 391.0, 429.0, 416.0, 455.0, 480.0, 494.0, 612.0, 788.0, 1240.0], [4331.0, 2203.0, 1623.0, 1264.0, 1052.0, 937.0, 741.0, 732.0, 671.0, 668.0, 597.0, 570.0, 507.0, 507.0, 484.0, 475.0, 411.0, 448.0, 415.0, 385.0, 385.0, 406.0, 368.0, 386.0, 374.0, 379.0, 352.0, 349.0, 354.0, 351.0, 355.0, 363.0, 317.0, 338.0, 355.0, 370.0, 365.0, 370.0, 360.0, 353.0, 394.0, 418.0, 414.0, 435.0, 475.0, 578.0, 629.0, 794.0, 1243.0], [4191.0, 2329.0, 1581.0, 1175.0, 1057.0, 909.0, 771.0, 698.0, 650.0, 605.0, 573.0, 515.0, 480.0, 458.0, 462.0, 432.0, 444.0, 390.0, 441.0, 441.0, 399.0, 387.0, 360.0, 407.0, 380.0, 345.0, 366.0, 339.0, 335.0, 368.0, 338.0, 360.0, 342.0, 364.0, 367.0, 361.0, 357.0, 340.0, 349.0, 357.0, 369.0, 390.0, 423.0, 414.0, 428.0, 513.0, 573.0, 749.0, 1196.0], [4240.0, 2348.0, 1581.0, 1211.0, 998.0, 918.0, 777.0, 690.0, 677.0, 561.0, 553.0, 501.0, 464.0, 449.0, 429.0, 430.0, 439.0, 418.0, 450.0, 385.0, 367.0, 386.0, 355.0, 373.0, 369.0, 371.0, 316.0, 339.0, 360.0, 346.0, 317.0, 317.0, 318.0, 345.0, 312.0, 334.0, 340.0, 349.0, 338.0, 367.0, 374.0, 382.0, 375.0, 438.0, 455.0, 513.0, 567.0, 697.0, 1100.0], [4285.0, 2361.0, 1545.0, 1281.0, 970.0, 866.0, 760.0, 705.0, 613.0, 555.0, 539.0, 498.0, 484.0, 475.0, 450.0, 459.0, 422.0, 399.0, 386.0, 364.0, 360.0, 380.0, 364.0, 347.0, 347.0, 325.0, 321.0, 297.0, 333.0, 336.0, 319.0, 310.0, 338.0, 332.0, 336.0, 317.0, 322.0, 327.0, 313.0, 318.0, 346.0, 346.0, 394.0, 385.0, 434.0, 460.0, 546.0, 724.0, 1051.0], [4722.0, 2391.0, 1580.0, 1168.0, 1032.0, 858.0, 728.0, 678.0, 584.0, 554.0, 526.0, 499.0, 458.0, 477.0, 461.0, 424.0, 412.0, 370.0, 414.0, 364.0, 349.0, 358.0, 337.0, 350.0, 349.0, 335.0, 313.0, 309.0, 348.0, 287.0, 337.0, 310.0, 310.0, 299.0, 323.0, 297.0, 336.0, 310.0, 343.0, 332.0, 340.0, 345.0, 346.0, 346.0, 440.0, 422.0, 512.0, 617.0, 964.0], [5371.0, 2591.0, 1676.0, 1294.0, 967.0, 815.0, 719.0, 660.0, 638.0, 572.0, 531.0, 471.0, 451.0, 456.0, 441.0, 413.0, 397.0, 376.0, 392.0, 381.0, 349.0, 326.0, 303.0, 341.0, 346.0, 293.0, 273.0, 322.0, 317.0, 317.0, 290.0, 313.0, 302.0, 333.0, 296.0, 295.0, 298.0, 312.0, 331.0, 301.0, 329.0, 361.0, 359.0, 345.0, 382.0, 414.0, 507.0, 541.0, 909.0], [6356.0, 3093.0, 1881.0, 1378.0, 1100.0, 847.0, 757.0, 673.0, 617.0, 547.0, 519.0, 485.0, 453.0, 415.0, 416.0, 377.0, 395.0, 359.0, 361.0, 378.0, 366.0, 338.0, 330.0, 337.0, 291.0, 325.0, 316.0, 310.0, 289.0, 287.0, 306.0, 294.0, 269.0, 292.0, 303.0, 288.0, 315.0, 281.0, 315.0, 306.0, 306.0, 342.0, 323.0, 363.0, 319.0, 404.0, 435.0, 543.0, 865.0], [7194.0, 3631.0, 2395.0, 1576.0, 1207.0, 929.0, 843.0, 701.0, 695.0, 562.0, 532.0, 496.0, 474.0, 458.0, 426.0, 354.0, 362.0, 403.0, 367.0, 369.0, 340.0, 343.0, 349.0, 315.0, 294.0, 279.0, 312.0, 268.0, 313.0, 275.0, 287.0, 314.0, 254.0, 268.0, 256.0, 303.0, 296.0, 316.0, 295.0, 297.0, 289.0, 313.0, 306.0, 345.0, 338.0, 379.0, 416.0, 531.0, 793.0], [7743.0, 4323.0, 2864.0, 2047.0, 1599.0, 1245.0, 1000.0, 818.0, 758.0, 626.0, 593.0, 581.0, 496.0, 458.0, 428.0, 417.0, 377.0, 375.0, 318.0, 346.0, 352.0, 342.0, 344.0, 312.0, 330.0, 300.0, 306.0, 304.0, 279.0, 274.0, 294.0, 282.0, 280.0, 258.0, 298.0, 277.0, 273.0, 284.0, 289.0, 285.0, 270.0, 287.0, 287.0, 307.0, 355.0, 351.0, 369.0, 452.0, 721.0], [7697.0, 4638.0, 3265.0, 2457.0, 1963.0, 1565.0, 1308.0, 1071.0, 889.0, 818.0, 743.0, 629.0, 616.0, 496.0, 496.0, 479.0, 442.0, 430.0, 389.0, 363.0, 393.0, 339.0, 316.0, 301.0, 339.0, 275.0, 286.0, 310.0, 294.0, 297.0, 272.0, 274.0, 281.0, 264.0, 289.0, 241.0, 280.0, 288.0, 267.0, 255.0, 262.0, 302.0, 289.0, 308.0, 297.0, 376.0, 348.0, 437.0, 629.0], [7116.0, 4558.0, 3522.0, 2777.0, 2247.0, 1857.0, 1588.0, 1361.0, 1226.0, 1060.0, 925.0, 864.0, 764.0, 658.0, 656.0, 577.0, 514.0, 459.0, 441.0, 493.0, 397.0, 405.0, 349.0, 328.0, 334.0, 316.0, 318.0, 307.0, 292.0, 305.0, 265.0, 263.0, 267.0, 280.0, 258.0, 289.0, 253.0, 260.0, 254.0, 279.0, 282.0, 269.0, 293.0, 290.0, 295.0, 309.0, 364.0, 428.0, 581.0], [6216.0, 4090.0, 3247.0, 2777.0, 2250.0, 1984.0, 1813.0, 1621.0, 1432.0, 1314.0, 1207.0, 1105.0, 1002.0, 879.0, 797.0, 765.0, 734.0, 673.0, 653.0, 543.0, 508.0, 526.0, 448.0, 393.0, 406.0, 389.0, 386.0, 349.0, 359.0, 376.0, 320.0, 327.0, 255.0, 313.0, 287.0, 258.0, 263.0, 252.0, 305.0, 286.0, 254.0, 278.0, 272.0, 305.0, 288.0, 321.0, 389.0, 395.0, 566.0], [5321.0, 3624.0, 2940.0, 2446.0, 2176.0, 1889.0, 1824.0, 1620.0, 1494.0, 1374.0, 1355.0, 1224.0, 1123.0, 1072.0, 992.0, 1017.0, 875.0, 836.0, 783.0, 760.0, 703.0, 663.0, 664.0, 550.0, 548.0, 510.0, 459.0, 466.0, 470.0, 395.0, 412.0, 373.0, 354.0, 361.0, 347.0, 307.0, 310.0, 315.0, 295.0, 322.0, 276.0, 263.0, 273.0, 280.0, 301.0, 289.0, 343.0, 384.0, 505.0], [4687.0, 2969.0, 2396.0, 2089.0, 1827.0, 1728.0, 1688.0, 1445.0, 1386.0, 1380.0, 1291.0, 1249.0, 1230.0, 1099.0, 1143.0, 1070.0, 1052.0, 981.0, 961.0, 899.0, 811.0, 826.0, 783.0, 777.0, 730.0, 692.0, 631.0, 595.0, 607.0, 550.0, 517.0, 554.0, 513.0, 464.0, 444.0, 438.0, 429.0, 428.0, 349.0, 376.0, 287.0, 379.0, 324.0, 322.0, 314.0, 340.0, 370.0, 386.0, 494.0], [4216.0, 2577.0, 2019.0, 1752.0, 1476.0, 1487.0, 1283.0, 1229.0, 1285.0, 1178.0, 1144.0, 1165.0, 1117.0, 1071.0, 1090.0, 1003.0, 997.0, 1046.0, 1002.0, 971.0, 959.0, 916.0, 922.0, 785.0, 827.0, 844.0, 835.0, 801.0, 819.0, 686.0, 708.0, 704.0, 682.0, 633.0, 603.0, 585.0, 556.0, 525.0, 510.0, 501.0, 463.0, 493.0, 447.0, 416.0, 397.0, 402.0, 433.0, 423.0, 538.0], [4035.0, 2294.0, 1794.0, 1496.0, 1244.0, 1184.0, 1087.0, 1014.0, 958.0, 967.0, 935.0, 927.0, 849.0, 917.0, 882.0, 904.0, 940.0, 915.0, 905.0, 928.0, 891.0, 846.0, 912.0, 864.0, 857.0, 913.0, 910.0, 891.0, 841.0, 890.0, 872.0, 826.0, 862.0, 812.0, 803.0, 779.0, 745.0, 704.0, 702.0, 699.0, 701.0, 706.0, 676.0, 631.0, 653.0, 596.0, 566.0, 574.0, 644.0], [3822.0, 2115.0, 1585.0, 1228.0, 1126.0, 1019.0, 909.0, 857.0, 801.0, 758.0, 787.0, 773.0, 763.0, 727.0, 684.0, 715.0, 749.0, 752.0, 784.0, 740.0, 776.0, 795.0, 804.0, 797.0, 802.0, 898.0, 833.0, 825.0, 881.0, 865.0, 839.0, 898.0, 883.0, 911.0, 907.0, 946.0, 944.0, 913.0, 874.0, 897.0, 925.0, 892.0, 945.0, 875.0, 901.0, 879.0, 923.0, 865.0, 922.0], [3797.0, 2198.0, 1598.0, 1179.0, 1029.0, 880.0, 786.0, 735.0, 715.0, 642.0, 651.0, 627.0, 623.0, 598.0, 641.0, 603.0, 631.0, 593.0, 560.0, 622.0, 602.0, 643.0, 665.0, 666.0, 684.0, 646.0, 652.0, 663.0, 766.0, 750.0, 799.0, 785.0, 838.0, 866.0, 927.0, 865.0, 947.0, 965.0, 959.0, 1045.0, 988.0, 1088.0, 1145.0, 1136.0, 1187.0, 1191.0, 1270.0, 1257.0, 1448.0], [3690.0, 2059.0, 1564.0, 1206.0, 1031.0, 843.0, 753.0, 673.0, 652.0, 616.0, 583.0, 490.0, 532.0, 511.0, 495.0, 491.0, 508.0, 499.0, 453.0, 460.0, 479.0, 480.0, 524.0, 505.0, 590.0, 514.0, 532.0, 631.0, 591.0, 649.0, 657.0, 689.0, 735.0, 748.0, 782.0, 724.0, 862.0, 868.0, 896.0, 956.0, 1061.0, 1102.0, 1222.0, 1282.0, 1338.0, 1483.0, 1617.0, 1829.0, 2219.0], [3599.0, 2096.0, 1460.0, 1191.0, 962.0, 789.0, 725.0, 692.0, 634.0, 535.0, 539.0, 478.0, 483.0, 435.0, 424.0, 421.0, 396.0, 437.0, 434.0, 429.0, 405.0, 429.0, 457.0, 461.0, 445.0, 428.0, 455.0, 438.0, 487.0, 421.0, 489.0, 522.0, 522.0, 570.0, 616.0, 643.0, 679.0, 718.0, 763.0, 813.0, 946.0, 1010.0, 1085.0, 1250.0, 1375.0, 1569.0, 1888.0, 2257.0, 2936.0], [3634.0, 2098.0, 1415.0, 1196.0, 947.0, 791.0, 671.0, 632.0, 580.0, 516.0, 492.0, 509.0, 466.0, 442.0, 460.0, 357.0, 384.0, 368.0, 379.0, 333.0, 360.0, 344.0, 346.0, 378.0, 339.0, 340.0, 334.0, 358.0, 402.0, 338.0, 394.0, 427.0, 372.0, 436.0, 448.0, 482.0, 495.0, 581.0, 612.0, 684.0, 780.0, 808.0, 917.0, 992.0, 1237.0, 1449.0, 1746.0, 2463.0, 3448.0], [3765.0, 2108.0, 1437.0, 1104.0, 888.0, 799.0, 700.0, 653.0, 574.0, 528.0, 488.0, 443.0, 467.0, 441.0, 358.0, 405.0, 405.0, 393.0, 364.0, 345.0, 336.0, 344.0, 332.0, 343.0, 353.0, 288.0, 332.0, 324.0, 349.0, 343.0, 341.0, 307.0, 330.0, 312.0, 347.0, 378.0, 390.0, 432.0, 417.0, 483.0, 505.0, 637.0, 657.0, 796.0, 891.0, 1182.0, 1592.0, 2140.0, 3517.0], [3803.0, 2044.0, 1461.0, 1104.0, 921.0, 754.0, 714.0, 648.0, 528.0, 527.0, 505.0, 422.0, 452.0, 403.0, 370.0, 362.0, 332.0, 334.0, 326.0, 353.0, 337.0, 291.0, 319.0, 306.0, 294.0, 316.0, 276.0, 259.0, 296.0, 287.0, 287.0, 286.0, 292.0, 318.0, 315.0, 315.0, 314.0, 344.0, 378.0, 369.0, 345.0, 455.0, 482.0, 530.0, 723.0, 863.0, 1220.0, 1771.0, 3246.0], [3656.0, 2093.0, 1361.0, 1152.0, 918.0, 867.0, 686.0, 589.0, 525.0, 504.0, 426.0, 450.0, 435.0, 418.0, 383.0, 343.0, 389.0, 340.0, 322.0, 300.0, 304.0, 305.0, 304.0, 287.0, 297.0, 326.0, 288.0, 261.0, 289.0, 259.0, 283.0, 253.0, 243.0, 249.0, 240.0, 280.0, 294.0, 296.0, 260.0, 284.0, 332.0, 340.0, 344.0, 454.0, 536.0, 630.0, 811.0, 1365.0, 2528.0], [3663.0, 2014.0, 1418.0, 1140.0, 901.0, 759.0, 713.0, 631.0, 581.0, 498.0, 476.0, 429.0, 403.0, 353.0, 358.0, 355.0, 357.0, 344.0, 314.0, 325.0, 306.0, 324.0, 306.0, 335.0, 253.0, 270.0, 281.0, 270.0, 254.0, 275.0, 283.0, 210.0, 257.0, 226.0, 235.0, 222.0, 218.0, 260.0, 254.0, 269.0, 247.0, 292.0, 281.0, 331.0, 328.0, 408.0, 576.0, 934.0, 1916.0], [3660.0, 2040.0, 1416.0, 1071.0, 928.0, 764.0, 694.0, 654.0, 527.0, 536.0, 482.0, 451.0, 399.0, 388.0, 341.0, 355.0, 344.0, 321.0, 341.0, 321.0, 325.0, 291.0, 281.0, 255.0, 263.0, 299.0, 254.0, 306.0, 248.0, 269.0, 310.0, 226.0, 282.0, 267.0, 268.0, 231.0, 239.0, 244.0, 245.0, 260.0, 219.0, 244.0, 269.0, 269.0, 279.0, 324.0, 397.0, 601.0, 1287.0], [3683.0, 1972.0, 1483.0, 1123.0, 925.0, 810.0, 674.0, 588.0, 499.0, 468.0, 490.0, 430.0, 452.0, 397.0, 382.0, 325.0, 369.0, 341.0, 342.0, 307.0, 283.0, 319.0, 305.0, 282.0, 235.0, 272.0, 278.0, 277.0, 260.0, 225.0, 245.0, 249.0, 276.0, 282.0, 268.0, 243.0, 230.0, 211.0, 250.0, 238.0, 235.0, 227.0, 236.0, 235.0, 241.0, 284.0, 294.0, 403.0, 848.0], [3758.0, 1904.0, 1411.0, 1194.0, 913.0, 755.0, 678.0, 585.0, 559.0, 516.0, 421.0, 405.0, 405.0, 405.0, 379.0, 380.0, 344.0, 349.0, 339.0, 322.0, 304.0, 284.0, 290.0, 268.0, 294.0, 281.0, 282.0, 268.0, 253.0, 248.0, 270.0, 252.0, 277.0, 245.0, 239.0, 244.0, 206.0, 228.0, 223.0, 229.0, 215.0, 223.0, 245.0, 228.0, 247.0, 247.0, 286.0, 348.0, 586.0], [3698.0, 1995.0, 1475.0, 1143.0, 940.0, 724.0, 701.0, 585.0, 567.0, 498.0, 505.0, 445.0, 396.0, 366.0, 361.0, 355.0, 333.0, 347.0, 284.0, 321.0, 345.0, 285.0, 307.0, 259.0, 263.0, 275.0, 244.0, 248.0, 241.0, 253.0, 243.0, 249.0, 235.0, 240.0, 228.0, 240.0, 246.0, 241.0, 252.0, 219.0, 242.0, 233.0, 238.0, 212.0, 237.0, 230.0, 238.0, 301.0, 436.0], [3700.0, 1959.0, 1373.0, 1132.0, 962.0, 761.0, 666.0, 635.0, 543.0, 494.0, 500.0, 427.0, 411.0, 375.0, 340.0, 342.0, 340.0, 326.0, 326.0, 289.0, 286.0, 287.0, 281.0, 286.0, 271.0, 256.0, 285.0, 257.0, 268.0, 240.0, 282.0, 266.0, 245.0, 228.0, 235.0, 253.0, 258.0, 244.0, 250.0, 214.0, 207.0, 203.0, 240.0, 241.0, 228.0, 239.0, 231.0, 249.0, 344.0], [3642.0, 1973.0, 1438.0, 1144.0, 894.0, 782.0, 697.0, 581.0, 603.0, 518.0, 467.0, 451.0, 400.0, 384.0, 418.0, 332.0, 352.0, 333.0, 308.0, 288.0, 265.0, 323.0, 255.0, 277.0, 302.0, 248.0, 257.0, 219.0, 260.0, 278.0, 244.0, 241.0, 247.0, 257.0, 234.0, 239.0, 248.0, 238.0, 233.0, 220.0, 218.0, 244.0, 227.0, 218.0, 236.0, 207.0, 247.0, 259.0, 318.0], [3493.0, 2065.0, 1519.0, 1126.0, 925.0, 758.0, 699.0, 600.0, 512.0, 533.0, 477.0, 430.0, 413.0, 352.0, 414.0, 362.0, 353.0, 318.0, 327.0, 286.0, 303.0, 271.0, 271.0, 270.0, 257.0, 272.0, 262.0, 287.0, 267.0, 256.0, 245.0, 264.0, 235.0, 249.0, 223.0, 247.0, 228.0, 221.0, 227.0, 218.0, 235.0, 230.0, 263.0, 228.0, 244.0, 227.0, 262.0, 248.0, 302.0], [3638.0, 2078.0, 1482.0, 1119.0, 892.0, 787.0, 660.0, 594.0, 576.0, 521.0, 447.0, 428.0, 417.0, 376.0, 405.0, 379.0, 341.0, 330.0, 343.0, 304.0, 288.0, 290.0, 292.0, 250.0, 252.0, 240.0, 268.0, 252.0, 269.0, 218.0, 259.0, 258.0, 256.0, 298.0, 224.0, 265.0, 213.0, 212.0, 235.0, 259.0, 220.0, 233.0, 216.0, 240.0, 210.0, 220.0, 224.0, 227.0, 283.0], [3604.0, 2048.0, 1425.0, 1167.0, 875.0, 795.0, 684.0, 592.0, 576.0, 492.0, 439.0, 441.0, 435.0, 404.0, 373.0, 353.0, 334.0, 334.0, 335.0, 320.0, 307.0, 293.0, 268.0, 302.0, 273.0, 250.0, 272.0, 244.0, 275.0, 227.0, 240.0, 258.0, 251.0, 230.0, 227.0, 242.0, 250.0, 229.0, 238.0, 202.0, 208.0, 231.0, 233.0, 210.0, 236.0, 229.0, 228.0, 254.0, 281.0], [3657.0, 2017.0, 1396.0, 1125.0, 887.0, 798.0, 680.0, 585.0, 577.0, 548.0, 488.0, 407.0, 394.0, 368.0, 389.0, 354.0, 352.0, 308.0, 329.0, 308.0, 291.0, 287.0, 302.0, 234.0, 280.0, 280.0, 245.0, 250.0, 269.0, 264.0, 278.0, 261.0, 258.0, 253.0, 254.0, 228.0, 205.0, 233.0, 230.0, 238.0, 234.0, 232.0, 237.0, 235.0, 188.0, 254.0, 206.0, 250.0, 286.0], [3636.0, 2046.0, 1466.0, 1137.0, 891.0, 812.0, 714.0, 589.0, 546.0, 506.0, 473.0, 431.0, 391.0, 373.0, 388.0, 358.0, 370.0, 341.0, 336.0, 304.0, 279.0, 288.0, 283.0, 289.0, 269.0, 275.0, 266.0, 232.0, 253.0, 276.0, 245.0, 246.0, 270.0, 255.0, 262.0, 228.0, 219.0, 225.0, 191.0, 242.0, 245.0, 204.0, 229.0, 211.0, 236.0, 230.0, 246.0, 276.0, 261.0], [3705.0, 2010.0, 1444.0, 1141.0, 929.0, 779.0, 689.0, 605.0, 590.0, 485.0, 453.0, 407.0, 412.0, 389.0, 408.0, 347.0, 337.0, 357.0, 340.0, 297.0, 289.0, 296.0, 279.0, 274.0, 274.0, 300.0, 255.0, 256.0, 258.0, 244.0, 237.0, 268.0, 236.0, 250.0, 232.0, 264.0, 226.0, 242.0, 227.0, 221.0, 216.0, 224.0, 213.0, 223.0, 205.0, 226.0, 217.0, 236.0, 307.0], [3609.0, 2045.0, 1459.0, 1164.0, 938.0, 772.0, 667.0, 614.0, 559.0, 481.0, 454.0, 409.0, 418.0, 422.0, 392.0, 380.0, 348.0, 308.0, 347.0, 333.0, 316.0, 243.0, 277.0, 272.0, 271.0, 272.0, 270.0, 267.0, 245.0, 269.0, 266.0, 262.0, 229.0, 260.0, 233.0, 236.0, 251.0, 206.0, 218.0, 233.0, 192.0, 212.0, 225.0, 241.0, 236.0, 198.0, 219.0, 251.0, 293.0], [3718.0, 2105.0, 1429.0, 1082.0, 918.0, 797.0, 655.0, 636.0, 528.0, 534.0, 480.0, 456.0, 409.0, 386.0, 377.0, 362.0, 362.0, 299.0, 314.0, 328.0, 302.0, 280.0, 292.0, 272.0, 289.0, 239.0, 274.0, 265.0, 273.0, 268.0, 248.0, 245.0, 243.0, 246.0, 244.0, 250.0, 233.0, 256.0, 192.0, 205.0, 229.0, 210.0, 250.0, 229.0, 234.0, 241.0, 206.0, 239.0, 303.0]],
    "Name": "sCurve-0",
    "Overflow": 2534658.0,
    "Type": "Histo2d",
    "Underflow": 0.0,
    "x": {
        "AxisTitle": "Vcal",
        "Bins": 51,
        "High": 302.5,
        "Low": 47.5
    },
    "y": {
        "AxisTitle": "Occupancy",
        "Bins": 49,
        "High": 49.5,
        "Low": 0.5
    },
    "z": {
        "AxisTitle": "Number of pixels"
    }
}