{
    "Data": [0.0, 0.0, 0.0, 0.0, 0.0, 0.0, 0.0, 0.0, 0.0, 0.0, 0.0, 1.0, 3.0, 3.0, 1.0, 0.0, 1.0, 1.0, 9.0, 1.0, 0.0, 13.0, 1.0, 8.0, 32.0, 6.0, 43.0, 24.0, 11.0, 23.0, 34.0, 14.0, 44.0, 20.0, 6.0, 37.0, 1.0, 37.0, 1.0, 7.0, 5.0, 50.0, 0.0, 31.0, 23.0, 33.0, 26.0, 12.0, 3.0, 50.0, 17.0],
    "Name": "Scurve-90-96",
    "Overflow": 0.0,
    "Type": "Histo1d",
    "Underflow": 0.0,
    "x": {
        "AxisTitle": "Vcal",
        "Bins": 51,
        "High": 302.5,
        "Low": 47.5
    },
    "y": {
        "AxisTitle": "Occupancy"
    },
    "z": {
        "AxisTitle": "z"
    }
}