{
    "Data": [0.0, 0.0, 0.0, 0.0, 0.0, 0.0, 0.0, 0.0, 0.0, 0.0, 0.0, 0.0, 1.0, 2.0, 0.0, 0.0, 1.0, 1.0, 2.0, 0.0, 1.0, 7.0, 5.0, 0.0, 0.0, 19.0, 0.0, 25.0, 3.0, 12.0, 3.0, 9.0, 27.0, 15.0, 12.0, 46.0, 45.0, 25.0, 10.0, 33.0, 27.0, 9.0, 50.0, 37.0, 50.0, 50.0, 45.0, 18.0, 50.0, 51.0, 50.0],
    "Name": "Scurve-70-96",
    "Overflow": 0.0,
    "Type": "Histo1d",
    "Underflow": 0.0,
    "x": {
        "AxisTitle": "Vcal",
        "Bins": 51,
        "High": 302.5,
        "Low": 47.5
    },
    "y": {
        "AxisTitle": "Occupancy"
    },
    "z": {
        "AxisTitle": "z"
    }
}