{
    "Data": [0.0, 0.0, 0.0, 0.0, 0.0, 0.0, 0.0, 0.0, 0.0, 0.0, 0.0, 0.0, 0.0, 0.0, 0.0, 0.0, 1.0, 2.0, 4.0, 8.0, 6.0, 8.0, 20.0, 13.0, 17.0, 10.0, 11.0, 14.0, 24.0, 44.0, 32.0, 49.0, 42.0, 0.0, 3.0, 50.0, 50.0, 50.0, 45.0, 50.0, 50.0, 50.0, 50.0, 50.0, 1.0, 7.0, 50.0, 50.0, 50.0, 50.0, 50.0],
    "Name": "Scurve-70-96",
    "Overflow": 0.0,
    "Type": "Histo1d",
    "Underflow": 0.0,
    "x": {
        "AxisTitle": "Vcal",
        "Bins": 51,
        "High": 302.5,
        "Low": 47.5
    },
    "y": {
        "AxisTitle": "Occupancy"
    },
    "z": {
        "AxisTitle": "z"
    }
}