{
    "Data": [0.0, 0.0, 0.0, 0.0, 0.0, 0.0, 0.0, 0.0, 0.0, 0.0, 0.0, 0.0, 0.0, 0.0, 0.0, 0.0, 0.0, 0.0, 0.0, 0.0, 0.0, 0.0, 0.0, 0.0, 0.0, 0.0, 0.0, 0.0, 0.0, 0.0, 0.0, 0.0, 0.0, 0.0, 0.0, 0.0, 0.0, 0.0, 0.0, 0.0, 0.0, 0.0, 0.0, 0.0, 0.0, 0.0, 0.0, 0.0, 0.0, 0.0, 59.0, 109.0, 101.0, 141.0, 149.0, 160.0, 220.0, 220.0, 275.0, 317.0, 330.0, 371.0, 415.0, 484.0, 507.0, 591.0, 623.0, 638.0, 726.0, 743.0, 766.0, 862.0, 789.0, 872.0, 862.0, 873.0, 941.0, 948.0, 897.0, 898.0, 871.0, 871.0, 837.0, 912.0, 883.0, 970.0, 1182.0, 1378.0, 1666.0, 1987.0, 2350.0, 2623.0, 2883.0, 2947.0, 2654.0, 2360.0, 2039.0, 1622.0, 1158.0, 815.0, 644.0, 441.0, 322.0, 218.0, 126.0, 113.0, 82.0, 74.0, 57.0, 42.0, 32.0, 27.0, 28.0, 21.0, 25.0, 19.0, 18.0, 21.0, 13.0, 6.0, 17.0, 17.0, 15.0, 9.0, 15.0, 11.0, 13.0, 10.0, 6.0, 5.0, 6.0, 5.0, 6.0, 2.0, 8.0, 6.0, 10.0, 2.0, 6.0, 4.0, 5.0, 5.0, 1.0, 6.0, 1.0, 0.0, 3.0, 2.0, 4.0, 3.0, 6.0, 1.0, 4.0, 8.0, 5.0, 13.0, 15.0, 25.0, 19.0, 35.0, 22.0, 44.0, 54.0, 64.0, 73.0, 106.0, 111.0, 144.0, 193.0, 199.0, 261.0, 266.0, 317.0, 374.0, 413.0, 479.0, 539.0, 561.0, 649.0, 695.0, 683.0, 806.0, 782.0, 798.0, 876.0, 878.0, 928.0, 963.0, 889.0, 845.0, 891.0, 877.0, 800.0, 765.0, 690.0, 698.0, 665.0, 557.0, 535.0, 501.0, 468.0, 385.0, 368.0, 336.0, 261.0, 242.0, 222.0, 197.0, 169.0, 135.0, 136.0, 113.0, 92.0, 77.0, 39.0, 51.0, 47.0, 36.0, 25.0, 20.0, 24.0, 10.0, 15.0, 9.0, 6.0, 5.0, 4.0, 3.0, 2.0, 0.0, 1.0, 0.0, 0.0, 0.0, 0.0, 0.0, 0.0, 0.0, 1.0, 0.0, 0.0, 0.0, 1.0, 0.0, 0.0, 0.0, 0.0, 0.0, 0.0, 0.0, 0.0, 0.0, 0.0, 0.0, 0.0, 1.0, 0.0, 0.0, 0.0, 0.0, 0.0, 0.0, 0.0, 0.0, 0.0, 0.0, 0.0, 0.0, 0.0, 0.0, 0.0, 0.0, 0.0, 0.0, 1.0, 0.0, 0.0, 0.0, 0.0, 0.0, 0.0, 0.0, 0.0, 0.0, 0.0, 0.0, 0.0, 0.0, 0.0, 0.0, 0.0, 0.0, 0.0, 0.0, 0.0, 0.0, 0.0, 0.0, 0.0, 0.0, 0.0, 0.0, 0.0, 0.0, 0.0, 0.0, 0.0, 0.0, 0.0, 0.0, 0.0, 0.0, 0.0, 0.0, 0.0, 0.0, 0.0, 0.0, 0.0, 0.0, 0.0, 0.0, 0.0, 0.0, 0.0, 0.0, 0.0, 0.0, 0.0, 0.0, 0.0, 0.0, 0.0, 0.0, 0.0, 0.0, 0.0, 0.0, 0.0, 0.0, 0.0, 0.0, 0.0, 0.0, 0.0, 0.0, 0.0, 0.0, 0.0, 0.0, 0.0, 0.0, 0.0, 0.0, 0.0, 0.0, 0.0, 0.0, 0.0, 0.0, 0.0, 0.0, 0.0, 0.0],
    "Name": "ThresholdDist-0",
    "Overflow": 0.0,
    "Type": "Histo1d",
    "Underflow": 0.0,
    "x": {
        "AxisTitle": "Threshold [e]",
        "Bins": 364,
        "High": 3635.0,
        "Low": -5.0
    },
    "y": {
        "AxisTitle": "Number of Pixels"
    },
    "z": {
        "AxisTitle": "z"
    }
}