time,Hardware,Voltage,Current
1626714151995,high-voltage,1,0.0232168
time,Hardware,Voltage,Current
1626714151995,high-voltage,2,0.0354114
time,Hardware,Voltage,Current
1626714151995,high-voltage,3,0.0454103
time,Hardware,Voltage,Current
1626714151995,high-voltage,4,0.051618
time,Hardware,Voltage,Current
1626714151995,high-voltage,5,0.0580834
time,Hardware,Voltage,Current
1626714151995,high-voltage,6,0.063612
time,Hardware,Voltage,Current
1626714151995,high-voltage,7,0.068058
time,Hardware,Voltage,Current
1626714151995,high-voltage,8,0.0736793
time,Hardware,Voltage,Current
1626714151995,high-voltage,9,0.0799248
time,Hardware,Voltage,Current
1626714151995,high-voltage,10,0.0845997
time,Hardware,Voltage,Current
1626714151995,high-voltage,11,0.0904347
time,Hardware,Voltage,Current
1626714151995,high-voltage,12,0.095583
time,Hardware,Voltage,Current
1626714151995,high-voltage,13,0.101944
time,Hardware,Voltage,Current
1626714151995,high-voltage,14,0.107138
time,Hardware,Voltage,Current
1626714151995,high-voltage,15,0.112321
time,Hardware,Voltage,Current
1626714151995,high-voltage,16,0.11821
time,Hardware,Voltage,Current
1626714151995,high-voltage,17,0.123271
time,Hardware,Voltage,Current
1626714151995,high-voltage,18,0.129718
time,Hardware,Voltage,Current
1626714151995,high-voltage,19,0.134785
time,Hardware,Voltage,Current
1626714151995,high-voltage,20,0.140462
time,Hardware,Voltage,Current
1626714151995,high-voltage,25,0.161442
time,Hardware,Voltage,Current
1626714151995,high-voltage,30,0.190004
time,Hardware,Voltage,Current
1626714151995,high-voltage,35,0.248293
time,Hardware,Voltage,Current
1626714151995,high-voltage,40,0.413291
time,Hardware,Voltage,Current
1626714151995,high-voltage,45,0.794418
time,Hardware,Voltage,Current
1626714151995,high-voltage,50,1.46385
time,Hardware,Voltage,Current
1626714151995,high-voltage,55,2.5665
time,Hardware,Voltage,Current
1626714151995,high-voltage,60,4.26103
time,Hardware,Voltage,Current
1626714151995,high-voltage,65,6.38097
time,Hardware,Voltage,Current
1626714151995,high-voltage,70,9.12359
time,Hardware,Voltage,Current
1626714151995,high-voltage,75,10
