time,Hardware,Voltage,Current
1621384940912,high-voltage-2,1,0.243396
time,Hardware,Voltage,Current
1621384940912,high-voltage-2,2,0.277098
time,Hardware,Voltage,Current
1621384940912,high-voltage-2,3,0.301605
time,Hardware,Voltage,Current
1621384940912,high-voltage-2,4,0.318933
time,Hardware,Voltage,Current
1621384940912,high-voltage-2,5,0.339778
time,Hardware,Voltage,Current
1621384940912,high-voltage-2,6,0.359434
time,Hardware,Voltage,Current
1621384940912,high-voltage-2,7,0.38486
time,Hardware,Voltage,Current
1621384940912,high-voltage-2,8,0.412573
time,Hardware,Voltage,Current
1621384940912,high-voltage-2,9,0.442392
time,Hardware,Voltage,Current
1621384940912,high-voltage-2,10,0.478012
time,Hardware,Voltage,Current
1621384940912,high-voltage-2,11,0.513452
time,Hardware,Voltage,Current
1621384940912,high-voltage-2,12,0.554615
time,Hardware,Voltage,Current
1621384940912,high-voltage-2,13,0.591916
time,Hardware,Voltage,Current
1621384940912,high-voltage-2,14,0.632669
time,Hardware,Voltage,Current
1621384940912,high-voltage-2,15,0.669093
time,Hardware,Voltage,Current
1621384940912,high-voltage-2,16,0.700581
time,Hardware,Voltage,Current
1621384940912,high-voltage-2,17,0.733201
time,Hardware,Voltage,Current
1621384940912,high-voltage-2,18,0.761814
time,Hardware,Voltage,Current
1621384940912,high-voltage-2,19,0.785835
time,Hardware,Voltage,Current
1621384940912,high-voltage-2,20,0.810398
time,Hardware,Voltage,Current
1621384940912,high-voltage-2,25,0.914383
time,Hardware,Voltage,Current
1621384940912,high-voltage-2,30,1.00917
time,Hardware,Voltage,Current
1621384940912,high-voltage-2,35,1.10529
time,Hardware,Voltage,Current
1621384940912,high-voltage-2,40,1.21288
time,Hardware,Voltage,Current
1621384940912,high-voltage-2,45,1.34364
time,Hardware,Voltage,Current
1621384940912,high-voltage-2,50,1.43667
time,Hardware,Voltage,Current
1621384940912,high-voltage-2,55,1.52286
time,Hardware,Voltage,Current
1621384940912,high-voltage-2,60,1.60034
time,Hardware,Voltage,Current
1621384940912,high-voltage-2,65,1.67906
time,Hardware,Voltage,Current
1621384940912,high-voltage-2,70,1.75507
time,Hardware,Voltage,Current
1621384940912,high-voltage-2,75,1.82587
time,Hardware,Voltage,Current
1621384940912,high-voltage-2,80,1.89538
time,Hardware,Voltage,Current
1621384940912,high-voltage-2,85,1.96238
time,Hardware,Voltage,Current
1621384940912,high-voltage-2,90,2.02848
time,Hardware,Voltage,Current
1621384940912,high-voltage-2,95,2.09383
time,Hardware,Voltage,Current
1621384940912,high-voltage-2,100,2.15813
