{
    "Data": [221.0, 11669.0, 20899.0, 13569.0, 6647.0, 3609.0, 2876.0, 2872.0, 2860.0, 2425.0, 2029.0, 1500.0, 1055.0, 821.0, 486.0, 357.0, 267.0, 187.0, 151.0, 126.0, 109.0, 106.0, 96.0, 83.0, 81.0, 99.0, 91.0, 92.0, 82.0, 62.0, 77.0, 80.0, 70.0, 77.0, 53.0, 52.0, 52.0, 49.0, 53.0, 40.0, 27.0, 29.0, 33.0, 19.0, 16.0, 23.0, 17.0, 14.0, 25.0, 12.0, 4.0],
    "Name": "Chi2Dist-0",
    "Overflow": 0.0,
    "Type": "Histo1d",
    "Underflow": 0.0,
    "x": {
        "AxisTitle": "Fit Chi/ndf",
        "Bins": 51,
        "High": 2.5250000953674318,
        "Low": -0.02500000037252903
    },
    "y": {
        "AxisTitle": "Number of Pixels"
    },
    "z": {
        "AxisTitle": "z"
    }
}