{
    "Data": [145.0, 9319.0, 18507.0, 14260.0, 8513.0, 5104.0, 3793.0, 3395.0, 3117.0, 2554.0, 1999.0, 1433.0, 999.0, 668.0, 417.0, 284.0, 184.0, 135.0, 73.0, 86.0, 67.0, 71.0, 65.0, 53.0, 55.0, 54.0, 42.0, 69.0, 51.0, 36.0, 36.0, 43.0, 25.0, 45.0, 32.0, 26.0, 40.0, 33.0, 21.0, 13.0, 24.0, 18.0, 19.0, 16.0, 11.0, 14.0, 19.0, 13.0, 8.0, 11.0, 1.0],
    "Name": "Chi2Dist-0",
    "Overflow": 0.0,
    "Type": "Histo1d",
    "Underflow": 0.0,
    "x": {
        "AxisTitle": "Fit Chi/ndf",
        "Bins": 51,
        "High": 2.5250000953674318,
        "Low": -0.02500000037252903
    },
    "y": {
        "AxisTitle": "Number of Pixels"
    },
    "z": {
        "AxisTitle": "z"
    }
}