{
    "Data": [43.0, 78.0, 1.0, 1.0, 7.0, 115.0, 656.0, 1910.0, 3849.0, 5253.0, 5342.0, 4002.0, 3190.0, 2774.0, 3351.0, 4180.0, 4535.0, 4369.0, 3374.0, 2321.0, 1447.0, 990.0, 934.0, 1033.0, 1379.0, 1740.0, 2121.0, 2326.0, 2443.0, 2332.0, 2246.0, 1878.0, 1577.0, 1230.0, 907.0, 662.0, 443.0, 298.0, 241.0, 146.0, 110.0, 83.0, 59.0, 37.0, 28.0, 18.0, 13.0, 10.0, 13.0, 4.0, 3.0, 2.0, 4.0, 6.0, 4.0, 4.0, 3.0, 1.0, 1.0],
    "Name": "NoiseDist-0",
    "Overflow": 44.0,
    "Type": "Histo1d",
    "Underflow": 0.0,
    "x": {
        "AxisTitle": "Noise [e]",
        "Bins": 59,
        "High": 296.0,
        "Low": -2.0
    },
    "y": {
        "AxisTitle": "Number of Pixels"
    },
    "z": {
        "AxisTitle": "z"
    }
}