{
    "Data": [0.0, 0.0, 0.0, 0.0, 0.0, 0.0, 0.0, 0.0, 0.0, 0.0, 0.0, 0.0, 0.0, 0.0, 0.0, 1.0, 0.0, 2.0, 5.0, 2.0, 0.0, 12.0, 7.0, 16.0, 22.0, 27.0, 35.0, 42.0, 42.0, 18.0, 47.0, 48.0, 50.0, 49.0, 49.0, 50.0, 15.0, 11.0, 50.0, 50.0, 37.0, 50.0, 38.0, 50.0, 50.0, 21.0, 50.0, 50.0, 50.0, 50.0, 50.0],
    "Name": "Scurve-110-96",
    "Overflow": 0.0,
    "Type": "Histo1d",
    "Underflow": 0.0,
    "x": {
        "AxisTitle": "Vcal",
        "Bins": 51,
        "High": 302.5,
        "Low": 47.5
    },
    "y": {
        "AxisTitle": "Occupancy"
    },
    "z": {
        "AxisTitle": "z"
    }
}