{
    "Data": [0.0, 0.0, 0.0, 0.0, 0.0, 0.0, 0.0, 0.0, 0.0, 0.0, 0.0, 0.0, 0.0, 0.0, 0.0, 0.0, 0.0, 0.0, 0.0, 0.0, 0.0, 0.0, 0.0, 0.0, 0.0, 0.0, 0.0, 0.0, 0.0, 0.0, 0.0, 0.0, 0.0, 0.0, 0.0, 0.0, 0.0, 0.0, 0.0, 0.0, 0.0, 0.0, 0.0, 0.0, 0.0, 0.0, 0.0, 0.0, 0.0, 0.0, 147.0, 299.0, 272.0, 314.0, 280.0, 248.0, 319.0, 330.0, 312.0, 309.0, 328.0, 356.0, 327.0, 337.0, 309.0, 363.0, 343.0, 358.0, 344.0, 383.0, 360.0, 411.0, 370.0, 403.0, 387.0, 362.0, 393.0, 384.0, 385.0, 369.0, 448.0, 403.0, 413.0, 425.0, 413.0, 398.0, 412.0, 422.0, 436.0, 415.0, 397.0, 397.0, 383.0, 399.0, 388.0, 410.0, 408.0, 407.0, 393.0, 372.0, 363.0, 396.0, 427.0, 420.0, 376.0, 364.0, 365.0, 366.0, 396.0, 368.0, 384.0, 340.0, 357.0, 313.0, 310.0, 356.0, 328.0, 357.0, 326.0, 322.0, 301.0, 316.0, 342.0, 310.0, 301.0, 273.0, 251.0, 229.0, 246.0, 226.0, 240.0, 228.0, 262.0, 243.0, 243.0, 219.0, 207.0, 203.0, 203.0, 225.0, 165.0, 189.0, 201.0, 162.0, 157.0, 164.0, 144.0, 154.0, 143.0, 142.0, 141.0, 146.0, 121.0, 127.0, 110.0, 116.0, 106.0, 114.0, 95.0, 99.0, 100.0, 95.0, 104.0, 87.0, 74.0, 94.0, 64.0, 67.0, 78.0, 74.0, 80.0, 62.0, 80.0, 73.0, 72.0, 61.0, 65.0, 62.0, 82.0, 47.0, 59.0, 64.0, 65.0, 70.0, 63.0, 67.0, 61.0, 63.0, 102.0, 92.0, 65.0, 60.0, 78.0, 104.0, 109.0, 67.0, 74.0, 75.0, 83.0, 117.0, 79.0, 77.0, 83.0, 109.0, 114.0, 113.0, 101.0, 117.0, 129.0, 114.0, 160.0, 146.0, 163.0, 180.0, 182.0, 251.0, 219.0, 222.0, 199.0, 220.0, 212.0, 326.0, 270.0, 275.0, 297.0, 292.0, 415.0, 409.0, 308.0, 318.0, 339.0, 364.0, 574.0, 355.0, 345.0, 317.0, 369.0, 482.0, 441.0, 391.0, 354.0, 317.0, 380.0, 699.0, 363.0, 369.0, 326.0, 326.0, 533.0, 413.0, 315.0, 289.0, 287.0, 296.0, 400.0, 258.0, 228.0, 195.0, 200.0, 279.0, 278.0, 201.0, 185.0, 146.0, 143.0, 238.0, 158.0, 116.0, 93.0, 104.0, 146.0, 93.0, 109.0, 89.0, 79.0, 70.0, 108.0, 69.0, 52.0, 43.0, 42.0, 70.0, 48.0, 37.0, 46.0, 45.0, 44.0, 45.0, 41.0, 37.0, 35.0, 29.0, 30.0, 33.0, 33.0, 29.0, 40.0, 27.0, 23.0, 20.0, 18.0, 21.0, 12.0, 19.0, 22.0, 10.0, 47.0, 23.0, 11.0, 22.0, 11.0, 24.0, 20.0, 21.0, 14.0, 16.0, 11.0, 12.0, 10.0, 14.0, 7.0, 12.0, 14.0, 5.0, 10.0, 6.0, 0.0, 0.0, 0.0, 0.0, 0.0, 0.0, 0.0, 0.0, 0.0, 0.0, 0.0, 0.0, 0.0, 0.0, 0.0, 0.0, 0.0, 0.0, 0.0, 0.0, 0.0, 0.0, 0.0, 0.0, 0.0, 0.0, 0.0, 0.0, 0.0, 0.0, 0.0, 0.0, 0.0, 0.0, 0.0, 0.0, 0.0, 0.0, 0.0, 0.0, 0.0, 0.0, 0.0, 0.0, 0.0, 0.0, 0.0, 0.0, 0.0, 0.0, 0.0, 0.0, 0.0, 0.0, 0.0, 0.0, 0.0, 0.0, 0.0, 0.0, 0.0, 0.0, 0.0, 0.0, 0.0, 0.0, 0.0, 0.0, 0.0, 0.0, 0.0, 0.0, 0.0, 0.0, 0.0, 0.0, 0.0, 0.0, 0.0, 0.0, 0.0, 0.0, 0.0, 0.0, 0.0, 0.0, 0.0, 0.0, 0.0, 0.0, 0.0, 0.0, 0.0, 0.0, 0.0, 0.0, 0.0, 0.0, 0.0, 0.0, 0.0, 0.0, 0.0, 0.0, 0.0, 0.0, 0.0, 0.0, 0.0, 0.0, 0.0, 0.0, 0.0, 0.0, 0.0, 0.0, 0.0, 0.0, 0.0, 0.0, 0.0, 0.0, 0.0, 0.0, 0.0, 0.0, 0.0, 0.0, 0.0, 0.0, 0.0, 0.0, 0.0, 0.0, 0.0, 0.0, 0.0, 0.0, 0.0, 0.0, 0.0, 0.0, 0.0, 0.0, 0.0, 0.0, 0.0, 0.0, 0.0, 0.0, 0.0, 0.0, 0.0, 0.0, 0.0, 0.0, 0.0, 0.0, 0.0, 0.0, 0.0, 0.0, 0.0, 0.0, 0.0, 0.0, 0.0, 0.0, 0.0, 0.0, 0.0, 0.0, 0.0, 0.0, 0.0, 0.0, 0.0, 0.0, 0.0, 0.0, 0.0, 0.0, 0.0, 0.0, 0.0, 0.0, 0.0, 0.0],
    "Name": "ThresholdDist-0",
    "Overflow": 0.0,
    "Type": "Histo1d",
    "Underflow": 0.0,
    "x": {
        "AxisTitle": "Threshold [e]",
        "Bins": 514,
        "High": 5135.0,
        "Low": -5.0
    },
    "y": {
        "AxisTitle": "Number of Pixels"
    },
    "z": {
        "AxisTitle": "z"
    }
}