{
    "Data": [30.0, 68.0, 0.0, 0.0, 12.0, 88.0, 581.0, 1743.0, 3402.0, 4666.0, 4802.0, 4041.0, 3094.0, 2688.0, 2576.0, 2939.0, 3403.0, 3614.0, 3692.0, 3257.0, 2625.0, 1808.0, 1180.0, 727.0, 574.0, 580.0, 729.0, 1024.0, 1295.0, 1616.0, 1969.0, 2214.0, 2336.0, 2187.0, 2127.0, 1955.0, 1576.0, 1324.0, 964.0, 782.0, 519.0, 362.0, 247.0, 178.0, 114.0, 89.0, 52.0, 44.0, 33.0, 23.0, 18.0, 11.0, 7.0, 5.0, 7.0, 3.0, 3.0, 2.0, 8.0, 4.0, 7.0, 3.0, 0.0, 4.0, 3.0, 0.0, 4.0, 0.0, 2.0, 1.0, 1.0],
    "Name": "NoiseDist-0",
    "Overflow": 14.0,
    "Type": "Histo1d",
    "Underflow": 0.0,
    "x": {
        "AxisTitle": "Noise [e]",
        "Bins": 71,
        "High": 356.0,
        "Low": -2.0
    },
    "y": {
        "AxisTitle": "Number of Pixels"
    },
    "z": {
        "AxisTitle": "z"
    }
}