time,Hardware,Voltage,Current
1626733226555,high-voltage-3,1,0.312746
time,Hardware,Voltage,Current
1626733226555,high-voltage-3,2,0.332474
time,Hardware,Voltage,Current
1626733226555,high-voltage-3,3,0.350139
time,Hardware,Voltage,Current
1626733226555,high-voltage-3,4,0.366324
time,Hardware,Voltage,Current
1626733226555,high-voltage-3,5,0.378965
time,Hardware,Voltage,Current
1626733226555,high-voltage-3,6,0.390719
time,Hardware,Voltage,Current
1626733226555,high-voltage-3,7,0.40306
time,Hardware,Voltage,Current
1626733226555,high-voltage-3,8,0.419013
time,Hardware,Voltage,Current
1626733226555,high-voltage-3,9,0.432329
time,Hardware,Voltage,Current
1626733226555,high-voltage-3,10,0.448189
time,Hardware,Voltage,Current
1626733226555,high-voltage-3,11,0.464165
time,Hardware,Voltage,Current
1626733226555,high-voltage-3,12,0.47721
time,Hardware,Voltage,Current
1626733226555,high-voltage-3,13,0.490809
time,Hardware,Voltage,Current
1626733226555,high-voltage-3,14,0.504352
time,Hardware,Voltage,Current
1626733226555,high-voltage-3,15,0.516206
time,Hardware,Voltage,Current
1626733226555,high-voltage-3,16,0.528083
time,Hardware,Voltage,Current
1626733226555,high-voltage-3,17,0.538509
time,Hardware,Voltage,Current
1626733226555,high-voltage-3,18,0.547905
time,Hardware,Voltage,Current
1626733226555,high-voltage-3,19,0.559219
time,Hardware,Voltage,Current
1626733226555,high-voltage-3,20,0.567273
time,Hardware,Voltage,Current
1626733226555,high-voltage-3,25,0.609892
time,Hardware,Voltage,Current
1626733226555,high-voltage-3,30,0.647822
time,Hardware,Voltage,Current
1626733226555,high-voltage-3,35,0.677669
time,Hardware,Voltage,Current
1626733226555,high-voltage-3,40,0.706382
time,Hardware,Voltage,Current
1626733226555,high-voltage-3,45,0.732714
time,Hardware,Voltage,Current
1626733226555,high-voltage-3,50,0.755532
time,Hardware,Voltage,Current
1626733226555,high-voltage-3,55,0.7773
time,Hardware,Voltage,Current
1626733226555,high-voltage-3,60,0.80073
time,Hardware,Voltage,Current
1626733226555,high-voltage-3,65,0.822773
time,Hardware,Voltage,Current
1626733226555,high-voltage-3,70,0.848025
time,Hardware,Voltage,Current
1626733226555,high-voltage-3,75,0.870096
time,Hardware,Voltage,Current
1626733226555,high-voltage-3,80,0.894788
time,Hardware,Voltage,Current
1626733226555,high-voltage-3,85,0.91853
time,Hardware,Voltage,Current
1626733226555,high-voltage-3,90,0.941781
time,Hardware,Voltage,Current
1626733226555,high-voltage-3,95,0.964053
time,Hardware,Voltage,Current
1626733226555,high-voltage-3,100,0.986088
