{
    "Data": [0.0, 0.0, 0.0, 0.0, 0.0, 0.0, 0.0, 0.0, 0.0, 0.0, 0.0, 0.0, 0.0, 1.0, 4.0, 2.0, 3.0, 0.0, 15.0, 12.0, 2.0, 0.0, 8.0, 4.0, 37.0, 10.0, 35.0, 18.0, 18.0, 0.0, 13.0, 34.0, 42.0, 25.0, 29.0, 49.0, 7.0, 4.0, 33.0, 47.0, 32.0, 15.0, 42.0, 26.0, 50.0, 1.0, 50.0, 42.0, 17.0, 9.0, 29.0],
    "Name": "Scurve-90-96",
    "Overflow": 0.0,
    "Type": "Histo1d",
    "Underflow": 0.0,
    "x": {
        "AxisTitle": "Vcal",
        "Bins": 51,
        "High": 302.5,
        "Low": 47.5
    },
    "y": {
        "AxisTitle": "Occupancy"
    },
    "z": {
        "AxisTitle": "z"
    }
}