{
    "Data": [0.0, 0.0, 0.0, 0.0, 0.0, 0.0, 0.0, 0.0, 0.0, 0.0, 0.0, 0.0, 0.0, 0.0, 0.0, 2.0, 0.0, 33.0, 201.0, 50.0, 36.0, 956.0, 2582.0, 796.0, 428.0, 1682.0, 3061.0, 1327.0, 634.0, 1384.0, 1966.0, 1111.0, 516.0, 637.0, 824.0, 581.0, 347.0, 981.0, 1699.0, 1144.0, 795.0, 1809.0, 3333.0, 4375.0, 2280.0, 1925.0, 2689.0, 3802.0, 3252.0, 2048.0, 2194.0, 2322.0, 3274.0, 1800.0, 1332.0, 1136.0, 1223.0, 1133.0, 755.0, 718.0, 695.0, 911.0, 650.0, 514.0, 439.0, 430.0, 494.0, 367.0, 292.0, 287.0, 310.0, 295.0, 211.0, 204.0, 163.0, 168.0, 130.0, 143.0, 168.0, 144.0, 136.0, 111.0, 97.0, 62.0, 73.0, 90.0, 68.0, 66.0, 42.0, 46.0, 34.0, 38.0, 40.0, 37.0, 36.0, 35.0, 26.0, 22.0, 34.0, 43.0, 26.0, 23.0, 27.0, 24.0, 20.0, 20.0, 15.0, 15.0, 19.0, 15.0, 18.0, 9.0, 9.0, 6.0, 8.0, 20.0, 9.0, 9.0, 20.0, 12.0, 13.0, 11.0, 6.0, 4.0, 4.0, 6.0, 7.0, 7.0, 7.0, 4.0, 12.0, 9.0, 5.0, 3.0, 9.0, 8.0, 8.0, 9.0, 10.0, 7.0, 13.0, 6.0, 5.0, 8.0, 2.0, 3.0, 3.0, 3.0, 5.0, 5.0, 3.0, 4.0, 5.0, 4.0, 6.0, 4.0, 1.0, 4.0, 2.0, 5.0, 6.0, 2.0, 1.0, 2.0, 2.0, 1.0, 1.0, 4.0, 2.0, 1.0, 2.0, 3.0, 2.0, 3.0, 1.0, 1.0, 3.0, 0.0, 1.0, 2.0, 0.0, 4.0, 1.0, 1.0, 0.0, 2.0, 4.0, 2.0, 1.0, 2.0, 1.0, 2.0, 3.0, 2.0, 4.0, 1.0, 1.0, 1.0, 0.0, 1.0, 1.0],
    "Name": "TimePerFitDist-0",
    "Overflow": 124.0,
    "Type": "Histo1d",
    "Underflow": 0.0,
    "x": {
        "AxisTitle": "Fit Time [us]",
        "Bins": 201,
        "High": 401.0,
        "Low": -1.0
    },
    "y": {
        "AxisTitle": "Number of Pixels"
    },
    "z": {
        "AxisTitle": "z"
    }
}