{
    "Data": [0.0, 0.0, 0.0, 0.0, 0.0, 0.0, 0.0, 0.0, 0.0, 0.0, 0.0, 0.0, 0.0, 0.0, 3.0, 2.0, 2.0, 20.0, 302.0, 95.0, 23.0, 595.0, 3477.0, 1495.0, 331.0, 1236.0, 3913.0, 2104.0, 492.0, 1266.0, 2451.0, 1578.0, 465.0, 429.0, 694.0, 659.0, 362.0, 823.0, 1379.0, 1123.0, 802.0, 1841.0, 3330.0, 4280.0, 2143.0, 1746.0, 3182.0, 4074.0, 3598.0, 2014.0, 2294.0, 2517.0, 3394.0, 1922.0, 1211.0, 1330.0, 1219.0, 1313.0, 764.0, 839.0, 764.0, 774.0, 631.0, 483.0, 526.0, 445.0, 502.0, 336.0, 317.0, 269.0, 282.0, 280.0, 183.0, 189.0, 143.0, 176.0, 147.0, 124.0, 128.0, 107.0, 114.0, 79.0, 71.0, 65.0, 68.0, 61.0, 39.0, 47.0, 49.0, 47.0, 42.0, 41.0, 32.0, 28.0, 32.0, 26.0, 36.0, 24.0, 29.0, 29.0, 15.0, 10.0, 13.0, 11.0, 14.0, 14.0, 7.0, 7.0, 9.0, 9.0, 10.0, 4.0, 8.0, 8.0, 8.0, 6.0, 7.0, 12.0, 10.0, 7.0, 5.0, 4.0, 5.0, 8.0, 4.0, 6.0, 4.0, 2.0, 4.0, 2.0, 3.0, 0.0, 2.0, 3.0, 4.0, 7.0, 5.0, 4.0, 7.0, 6.0, 8.0, 7.0, 5.0, 2.0, 0.0, 2.0, 0.0, 1.0, 1.0, 0.0, 2.0, 0.0, 4.0, 5.0, 6.0, 9.0, 4.0, 5.0, 5.0, 6.0, 7.0, 5.0, 1.0, 2.0, 2.0, 2.0, 0.0, 1.0, 2.0, 3.0, 2.0, 4.0, 2.0, 1.0, 9.0, 1.0, 6.0, 3.0, 3.0, 3.0, 1.0, 4.0, 1.0, 2.0, 0.0, 2.0, 4.0, 6.0, 1.0, 2.0, 4.0, 11.0, 7.0, 5.0, 7.0, 3.0, 2.0, 3.0, 2.0, 5.0, 0.0],
    "Name": "TimePerFitDist-0",
    "Overflow": 207.0,
    "Type": "Histo1d",
    "Underflow": 0.0,
    "x": {
        "AxisTitle": "Fit Time [us]",
        "Bins": 201,
        "High": 401.0,
        "Low": -1.0
    },
    "y": {
        "AxisTitle": "Number of Pixels"
    },
    "z": {
        "AxisTitle": "z"
    }
}