{
    "Data": [[677.0, 189.0, 77.0, 53.0, 35.0, 10.0, 13.0, 18.0, 9.0, 11.0, 8.0, 7.0, 6.0, 2.0, 7.0, 7.0, 5.0, 9.0, 7.0, 3.0, 7.0, 5.0, 6.0, 3.0, 2.0, 1.0, 0.0, 2.0, 1.0, 2.0, 3.0, 1.0, 5.0, 1.0, 3.0, 5.0, 2.0, 2.0, 5.0, 1.0, 1.0, 7.0, 1.0, 3.0, 3.0, 4.0, 3.0, 3.0, 2.0], [1554.0, 528.0, 266.0, 146.0, 88.0, 67.0, 45.0, 43.0, 22.0, 22.0, 19.0, 16.0, 7.0, 8.0, 8.0, 6.0, 5.0, 3.0, 6.0, 7.0, 7.0, 8.0, 4.0, 6.0, 1.0, 3.0, 3.0, 5.0, 11.0, 5.0, 6.0, 4.0, 2.0, 7.0, 4.0, 1.0, 5.0, 4.0, 8.0, 4.0, 6.0, 2.0, 1.0, 6.0, 5.0, 5.0, 3.0, 6.0, 8.0], [2829.0, 1161.0, 645.0, 391.0, 273.0, 231.0, 162.0, 126.0, 91.0, 63.0, 53.0, 60.0, 47.0, 28.0, 33.0, 26.0, 24.0, 12.0, 23.0, 21.0, 19.0, 19.0, 11.0, 15.0, 7.0, 5.0, 6.0, 2.0, 5.0, 10.0, 8.0, 4.0, 3.0, 9.0, 5.0, 6.0, 7.0, 6.0, 3.0, 4.0, 7.0, 8.0, 10.0, 5.0, 12.0, 11.0, 6.0, 14.0, 16.0], [3823.0, 1955.0, 1283.0, 916.0, 668.0, 454.0, 376.0, 315.0, 273.0, 261.0, 184.0, 163.0, 126.0, 128.0, 94.0, 89.0, 79.0, 86.0, 67.0, 47.0, 59.0, 51.0, 31.0, 31.0, 34.0, 27.0, 29.0, 26.0, 19.0, 18.0, 24.0, 15.0, 20.0, 14.0, 11.0, 16.0, 13.0, 7.0, 11.0, 11.0, 7.0, 10.0, 5.0, 16.0, 10.0, 12.0, 17.0, 18.0, 26.0], [3666.0, 2250.0, 1723.0, 1384.0, 1053.0, 916.0, 718.0, 666.0, 570.0, 511.0, 443.0, 404.0, 334.0, 313.0, 303.0, 265.0, 248.0, 211.0, 183.0, 174.0, 158.0, 137.0, 126.0, 111.0, 114.0, 104.0, 82.0, 87.0, 71.0, 78.0, 73.0, 55.0, 59.0, 45.0, 56.0, 43.0, 37.0, 34.0, 34.0, 21.0, 30.0, 28.0, 25.0, 27.0, 31.0, 24.0, 18.0, 21.0, 30.0], [4271.0, 2108.0, 1593.0, 1376.0, 1195.0, 1024.0, 882.0, 842.0, 740.0, 774.0, 674.0, 564.0, 609.0, 589.0, 507.0, 513.0, 456.0, 476.0, 407.0, 421.0, 316.0, 335.0, 320.0, 291.0, 264.0, 278.0, 263.0, 241.0, 214.0, 218.0, 208.0, 160.0, 152.0, 138.0, 157.0, 134.0, 144.0, 137.0, 116.0, 113.0, 119.0, 98.0, 99.0, 75.0, 74.0, 68.0, 58.0, 62.0, 78.0], [6898.0, 3901.0, 2541.0, 1869.0, 1432.0, 1113.0, 1019.0, 939.0, 788.0, 771.0, 706.0, 703.0, 647.0, 645.0, 620.0, 602.0, 614.0, 543.0, 535.0, 544.0, 531.0, 573.0, 476.0, 475.0, 492.0, 457.0, 423.0, 464.0, 447.0, 436.0, 421.0, 416.0, 384.0, 382.0, 347.0, 368.0, 323.0, 349.0, 330.0, 335.0, 297.0, 265.0, 266.0, 265.0, 255.0, 217.0, 242.0, 213.0, 237.0], [2367.0, 2607.0, 2642.0, 2544.0, 2327.0, 2150.0, 1999.0, 1867.0, 1687.0, 1464.0, 1311.0, 1236.0, 1141.0, 1033.0, 969.0, 804.0, 855.0, 791.0, 720.0, 648.0, 681.0, 696.0, 675.0, 592.0, 564.0, 575.0, 592.0, 592.0, 565.0, 565.0, 550.0, 565.0, 579.0, 631.0, 629.0, 598.0, 587.0, 573.0, 578.0, 613.0, 642.0, 610.0, 637.0, 671.0, 618.0, 635.0, 651.0, 686.0, 675.0], [279.0, 251.0, 312.0, 312.0, 454.0, 498.0, 615.0, 691.0, 748.0, 856.0, 897.0, 916.0, 999.0, 1108.0, 1108.0, 1102.0, 1204.0, 1195.0, 1216.0, 1286.0, 1237.0, 1247.0, 1263.0, 1222.0, 1238.0, 1195.0, 1173.0, 1121.0, 1164.0, 1119.0, 1045.0, 995.0, 1017.0, 976.0, 1007.0, 1024.0, 963.0, 973.0, 944.0, 1003.0, 995.0, 950.0, 1057.0, 1097.0, 1140.0, 1169.0, 1370.0, 1441.0, 1741.0], [170.0, 94.0, 65.0, 54.0, 60.0, 73.0, 49.0, 78.0, 84.0, 71.0, 113.0, 114.0, 122.0, 159.0, 156.0, 161.0, 182.0, 217.0, 272.0, 312.0, 356.0, 382.0, 398.0, 474.0, 503.0, 592.0, 640.0, 708.0, 784.0, 819.0, 923.0, 1017.0, 1127.0, 1233.0, 1257.0, 1352.0, 1519.0, 1650.0, 1739.0, 1791.0, 1910.0, 2056.0, 2173.0, 2253.0, 2446.0, 2556.0, 2749.0, 3142.0, 3822.0], [214.0, 54.0, 60.0, 44.0, 42.0, 31.0, 25.0, 25.0, 27.0, 26.0, 22.0, 27.0, 28.0, 27.0, 30.0, 35.0, 33.0, 52.0, 47.0, 38.0, 50.0, 72.0, 58.0, 63.0, 76.0, 89.0, 98.0, 101.0, 127.0, 139.0, 150.0, 194.0, 223.0, 245.0, 286.0, 321.0, 422.0, 540.0, 575.0, 770.0, 852.0, 1105.0, 1321.0, 1664.0, 2256.0, 2833.0, 3894.0, 5638.0, 8484.0], [313.0, 85.0, 51.0, 30.0, 27.0, 24.0, 23.0, 23.0, 12.0, 20.0, 15.0, 18.0, 17.0, 12.0, 16.0, 17.0, 22.0, 21.0, 14.0, 12.0, 27.0, 22.0, 15.0, 25.0, 24.0, 29.0, 35.0, 27.0, 31.0, 26.0, 50.0, 42.0, 53.0, 58.0, 69.0, 67.0, 104.0, 106.0, 115.0, 171.0, 233.0, 247.0, 341.0, 434.0, 655.0, 949.0, 1569.0, 2898.0, 6935.0], [583.0, 121.0, 63.0, 23.0, 22.0, 25.0, 22.0, 10.0, 13.0, 10.0, 14.0, 12.0, 9.0, 14.0, 10.0, 10.0, 12.0, 9.0, 14.0, 17.0, 15.0, 12.0, 11.0, 16.0, 14.0, 15.0, 12.0, 15.0, 13.0, 17.0, 12.0, 17.0, 24.0, 26.0, 21.0, 24.0, 34.0, 32.0, 39.0, 47.0, 73.0, 72.0, 109.0, 134.0, 179.0, 319.0, 450.0, 1039.0, 3050.0], [1154.0, 277.0, 104.0, 37.0, 26.0, 23.0, 13.0, 7.0, 10.0, 12.0, 8.0, 10.0, 8.0, 10.0, 7.0, 5.0, 14.0, 10.0, 8.0, 15.0, 9.0, 4.0, 9.0, 6.0, 6.0, 14.0, 11.0, 11.0, 16.0, 9.0, 7.0, 11.0, 5.0, 20.0, 15.0, 17.0, 19.0, 24.0, 13.0, 28.0, 34.0, 41.0, 42.0, 46.0, 66.0, 100.0, 193.0, 367.0, 1290.0], [2129.0, 619.0, 230.0, 95.0, 56.0, 37.0, 31.0, 17.0, 9.0, 11.0, 8.0, 4.0, 7.0, 4.0, 5.0, 4.0, 6.0, 9.0, 6.0, 5.0, 1.0, 7.0, 7.0, 4.0, 6.0, 6.0, 7.0, 8.0, 8.0, 10.0, 12.0, 9.0, 5.0, 3.0, 9.0, 13.0, 13.0, 15.0, 13.0, 20.0, 23.0, 20.0, 21.0, 35.0, 33.0, 40.0, 61.0, 151.0, 501.0], [3111.0, 1226.0, 563.0, 276.0, 130.0, 74.0, 36.0, 34.0, 22.0, 12.0, 11.0, 9.0, 7.0, 6.0, 5.0, 7.0, 6.0, 4.0, 2.0, 9.0, 6.0, 1.0, 1.0, 10.0, 2.0, 4.0, 6.0, 3.0, 2.0, 4.0, 10.0, 7.0, 3.0, 7.0, 4.0, 12.0, 8.0, 8.0, 12.0, 12.0, 10.0, 19.0, 18.0, 23.0, 19.0, 33.0, 44.0, 74.0, 212.0], [4182.0, 2005.0, 1081.0, 603.0, 358.0, 186.0, 148.0, 86.0, 61.0, 45.0, 30.0, 17.0, 20.0, 6.0, 9.0, 12.0, 10.0, 3.0, 5.0, 10.0, 4.0, 4.0, 4.0, 5.0, 7.0, 2.0, 4.0, 7.0, 4.0, 3.0, 3.0, 2.0, 9.0, 6.0, 4.0, 9.0, 3.0, 5.0, 6.0, 8.0, 9.0, 10.0, 14.0, 14.0, 19.0, 21.0, 33.0, 51.0, 136.0], [4606.0, 2674.0, 1700.0, 1083.0, 776.0, 498.0, 360.0, 245.0, 163.0, 129.0, 81.0, 74.0, 48.0, 38.0, 36.0, 26.0, 18.0, 18.0, 10.0, 6.0, 9.0, 5.0, 9.0, 6.0, 2.0, 6.0, 7.0, 6.0, 7.0, 3.0, 6.0, 3.0, 5.0, 5.0, 7.0, 6.0, 4.0, 8.0, 9.0, 5.0, 5.0, 7.0, 11.0, 8.0, 15.0, 13.0, 17.0, 39.0, 82.0], [4340.0, 3003.0, 2218.0, 1569.0, 1186.0, 940.0, 661.0, 504.0, 419.0, 326.0, 242.0, 196.0, 138.0, 107.0, 88.0, 87.0, 60.0, 43.0, 36.0, 45.0, 31.0, 23.0, 11.0, 13.0, 10.0, 15.0, 7.0, 5.0, 8.0, 4.0, 5.0, 3.0, 6.0, 5.0, 2.0, 2.0, 8.0, 6.0, 13.0, 4.0, 5.0, 5.0, 10.0, 10.0, 17.0, 19.0, 16.0, 20.0, 52.0], [3540.0, 2751.0, 2401.0, 1806.0, 1564.0, 1286.0, 1019.0, 840.0, 755.0, 606.0, 495.0, 389.0, 377.0, 297.0, 268.0, 199.0, 155.0, 130.0, 118.0, 94.0, 89.0, 60.0, 63.0, 54.0, 47.0, 35.0, 19.0, 15.0, 19.0, 14.0, 15.0, 10.0, 15.0, 9.0, 5.0, 7.0, 0.0, 11.0, 7.0, 8.0, 5.0, 6.0, 8.0, 10.0, 5.0, 8.0, 23.0, 13.0, 46.0], [2471.0, 2128.0, 2019.0, 1775.0, 1620.0, 1423.0, 1316.0, 1096.0, 968.0, 828.0, 791.0, 669.0, 584.0, 551.0, 457.0, 365.0, 350.0, 308.0, 270.0, 222.0, 201.0, 189.0, 160.0, 138.0, 100.0, 101.0, 75.0, 91.0, 50.0, 67.0, 42.0, 46.0, 27.0, 34.0, 15.0, 21.0, 13.0, 10.0, 10.0, 8.0, 14.0, 10.0, 5.0, 8.0, 8.0, 13.0, 10.0, 19.0, 41.0], [1572.0, 1477.0, 1531.0, 1470.0, 1383.0, 1276.0, 1267.0, 1176.0, 1075.0, 949.0, 916.0, 862.0, 716.0, 749.0, 666.0, 626.0, 542.0, 479.0, 477.0, 419.0, 344.0, 331.0, 321.0, 262.0, 274.0, 211.0, 188.0, 162.0, 136.0, 121.0, 121.0, 97.0, 82.0, 61.0, 69.0, 53.0, 46.0, 47.0, 23.0, 28.0, 24.0, 25.0, 21.0, 19.0, 18.0, 10.0, 10.0, 14.0, 34.0], [995.0, 967.0, 1000.0, 950.0, 1039.0, 1010.0, 992.0, 989.0, 921.0, 979.0, 888.0, 850.0, 883.0, 836.0, 719.0, 751.0, 716.0, 700.0, 611.0, 606.0, 593.0, 493.0, 474.0, 457.0, 429.0, 395.0, 379.0, 343.0, 285.0, 287.0, 282.0, 221.0, 186.0, 182.0, 167.0, 156.0, 127.0, 116.0, 107.0, 81.0, 77.0, 70.0, 41.0, 47.0, 27.0, 22.0, 23.0, 22.0, 30.0], [745.0, 701.0, 704.0, 760.0, 717.0, 730.0, 781.0, 736.0, 773.0, 746.0, 720.0, 750.0, 773.0, 728.0, 684.0, 730.0, 691.0, 729.0, 647.0, 647.0, 683.0, 631.0, 591.0, 535.0, 576.0, 577.0, 513.0, 497.0, 464.0, 472.0, 427.0, 375.0, 354.0, 355.0, 311.0, 291.0, 240.0, 239.0, 225.0, 208.0, 148.0, 153.0, 129.0, 125.0, 97.0, 91.0, 64.0, 48.0, 47.0], [484.0, 452.0, 461.0, 492.0, 522.0, 468.0, 483.0, 478.0, 495.0, 512.0, 499.0, 556.0, 534.0, 542.0, 552.0, 560.0, 603.0, 621.0, 624.0, 621.0, 640.0, 658.0, 658.0, 620.0, 665.0, 649.0, 661.0, 599.0, 627.0, 600.0, 618.0, 589.0, 515.0, 530.0, 528.0, 500.0, 484.0, 445.0, 446.0, 373.0, 336.0, 338.0, 298.0, 267.0, 243.0, 220.0, 162.0, 141.0, 117.0], [423.0, 351.0, 345.0, 333.0, 335.0, 334.0, 355.0, 385.0, 345.0, 340.0, 363.0, 383.0, 429.0, 423.0, 420.0, 428.0, 492.0, 468.0, 532.0, 481.0, 507.0, 532.0, 583.0, 562.0, 552.0, 588.0, 562.0, 594.0, 622.0, 608.0, 605.0, 634.0, 635.0, 639.0, 606.0, 629.0, 633.0, 628.0, 619.0, 594.0, 599.0, 625.0, 514.0, 506.0, 492.0, 447.0, 420.0, 330.0, 289.0], [347.0, 286.0, 292.0, 252.0, 272.0, 275.0, 225.0, 231.0, 219.0, 228.0, 274.0, 250.0, 284.0, 284.0, 276.0, 295.0, 315.0, 362.0, 334.0, 355.0, 350.0, 385.0, 405.0, 452.0, 466.0, 443.0, 447.0, 489.0, 531.0, 547.0, 551.0, 584.0, 604.0, 647.0, 672.0, 709.0, 685.0, 692.0, 747.0, 766.0, 798.0, 762.0, 809.0, 808.0, 760.0, 786.0, 770.0, 750.0, 690.0], [188.0, 165.0, 146.0, 155.0, 160.0, 204.0, 235.0, 210.0, 243.0, 230.0, 209.0, 228.0, 249.0, 233.0, 218.0, 197.0, 183.0, 191.0, 237.0, 196.0, 267.0, 245.0, 286.0, 302.0, 310.0, 306.0, 318.0, 408.0, 401.0, 442.0, 451.0, 504.0, 471.0, 581.0, 550.0, 614.0, 630.0, 677.0, 773.0, 825.0, 795.0, 926.0, 956.0, 1012.0, 1086.0, 1138.0, 1143.0, 1279.0, 1278.0], [163.0, 158.0, 206.0, 136.0, 167.0, 183.0, 148.0, 154.0, 172.0, 169.0, 172.0, 170.0, 151.0, 138.0, 155.0, 151.0, 146.0, 169.0, 205.0, 188.0, 201.0, 225.0, 178.0, 200.0, 186.0, 211.0, 222.0, 240.0, 265.0, 282.0, 297.0, 324.0, 333.0, 433.0, 412.0, 486.0, 480.0, 542.0, 617.0, 687.0, 780.0, 798.0, 966.0, 1084.0, 1159.0, 1332.0, 1521.0, 1754.0, 2085.0], [205.0, 157.0, 164.0, 143.0, 179.0, 140.0, 154.0, 206.0, 164.0, 167.0, 151.0, 127.0, 132.0, 129.0, 150.0, 133.0, 169.0, 159.0, 185.0, 158.0, 138.0, 119.0, 112.0, 156.0, 162.0, 125.0, 99.0, 155.0, 181.0, 177.0, 202.0, 206.0, 222.0, 313.0, 296.0, 306.0, 331.0, 348.0, 391.0, 473.0, 559.0, 631.0, 819.0, 883.0, 1080.0, 1302.0, 1655.0, 1951.0, 2798.0], [163.0, 177.0, 118.0, 86.0, 114.0, 139.0, 134.0, 113.0, 125.0, 133.0, 164.0, 116.0, 115.0, 185.0, 145.0, 164.0, 153.0, 164.0, 141.0, 140.0, 83.0, 107.0, 73.0, 71.0, 81.0, 66.0, 72.0, 102.0, 100.0, 103.0, 151.0, 131.0, 136.0, 150.0, 191.0, 234.0, 232.0, 302.0, 284.0, 341.0, 446.0, 472.0, 533.0, 691.0, 832.0, 1046.0, 1498.0, 2070.0, 3259.0], [163.0, 83.0, 105.0, 131.0, 179.0, 188.0, 128.0, 227.0, 117.0, 102.0, 118.0, 73.0, 72.0, 82.0, 77.0, 90.0, 97.0, 132.0, 128.0, 142.0, 176.0, 133.0, 126.0, 105.0, 182.0, 118.0, 105.0, 68.0, 78.0, 183.0, 107.0, 88.0, 144.0, 128.0, 163.0, 157.0, 139.0, 181.0, 194.0, 197.0, 204.0, 280.0, 387.0, 468.0, 580.0, 735.0, 1177.0, 1732.0, 3124.0], [50.0, 121.0, 164.0, 166.0, 95.0, 115.0, 101.0, 156.0, 93.0, 125.0, 105.0, 109.0, 68.0, 99.0, 118.0, 104.0, 133.0, 90.0, 111.0, 76.0, 63.0, 84.0, 87.0, 52.0, 91.0, 78.0, 129.0, 95.0, 87.0, 44.0, 95.0, 75.0, 60.0, 79.0, 52.0, 67.0, 151.0, 135.0, 163.0, 152.0, 161.0, 190.0, 249.0, 257.0, 320.0, 544.0, 757.0, 1342.0, 2896.0], [133.0, 123.0, 97.0, 171.0, 140.0, 129.0, 135.0, 125.0, 98.0, 139.0, 147.0, 149.0, 159.0, 115.0, 117.0, 105.0, 109.0, 144.0, 126.0, 105.0, 127.0, 155.0, 86.0, 133.0, 74.0, 66.0, 32.0, 81.0, 72.0, 89.0, 42.0, 29.0, 82.0, 74.0, 60.0, 48.0, 108.0, 100.0, 179.0, 80.0, 76.0, 78.0, 143.0, 168.0, 222.0, 304.0, 492.0, 931.0, 2123.0], [242.0, 162.0, 78.0, 69.0, 81.0, 96.0, 59.0, 87.0, 72.0, 68.0, 46.0, 137.0, 226.0, 82.0, 131.0, 96.0, 60.0, 118.0, 106.0, 41.0, 89.0, 73.0, 80.0, 123.0, 79.0, 45.0, 82.0, 33.0, 124.0, 98.0, 91.0, 75.0, 35.0, 25.0, 7.0, 24.0, 35.0, 56.0, 85.0, 36.0, 87.0, 95.0, 102.0, 107.0, 238.0, 235.0, 369.0, 544.0, 1463.0], [131.0, 146.0, 174.0, 144.0, 115.0, 75.0, 93.0, 79.0, 74.0, 95.0, 61.0, 95.0, 124.0, 61.0, 55.0, 118.0, 151.0, 161.0, 110.0, 120.0, 111.0, 72.0, 93.0, 124.0, 85.0, 49.0, 56.0, 116.0, 174.0, 13.0, 23.0, 78.0, 100.0, 81.0, 82.0, 102.0, 16.0, 42.0, 50.0, 34.0, 110.0, 79.0, 100.0, 80.0, 75.0, 89.0, 136.0, 312.0, 965.0], [99.0, 183.0, 103.0, 69.0, 77.0, 75.0, 124.0, 91.0, 132.0, 132.0, 102.0, 101.0, 91.0, 134.0, 233.0, 108.0, 34.0, 23.0, 73.0, 136.0, 122.0, 111.0, 116.0, 188.0, 114.0, 98.0, 88.0, 56.0, 26.0, 76.0, 98.0, 28.0, 110.0, 97.0, 15.0, 10.0, 51.0, 40.0, 69.0, 140.0, 108.0, 34.0, 42.0, 66.0, 26.0, 78.0, 95.0, 206.0, 607.0], [140.0, 67.0, 95.0, 67.0, 76.0, 112.0, 34.0, 109.0, 66.0, 57.0, 130.0, 94.0, 54.0, 60.0, 100.0, 157.0, 108.0, 83.0, 140.0, 69.0, 62.0, 133.0, 161.0, 66.0, 86.0, 62.0, 66.0, 137.0, 72.0, 87.0, 79.0, 155.0, 90.0, 59.0, 40.0, 46.0, 51.0, 41.0, 47.0, 83.0, 151.0, 116.0, 84.0, 78.0, 86.0, 89.0, 73.0, 74.0, 286.0], [107.0, 166.0, 91.0, 65.0, 106.0, 55.0, 84.0, 78.0, 106.0, 68.0, 74.0, 35.0, 39.0, 33.0, 99.0, 119.0, 49.0, 61.0, 69.0, 125.0, 73.0, 74.0, 73.0, 102.0, 117.0, 128.0, 101.0, 68.0, 64.0, 91.0, 68.0, 46.0, 48.0, 44.0, 91.0, 127.0, 29.0, 53.0, 29.0, 38.0, 69.0, 51.0, 27.0, 74.0, 142.0, 78.0, 49.0, 116.0, 238.0], [114.0, 94.0, 72.0, 75.0, 99.0, 225.0, 137.0, 108.0, 143.0, 89.0, 26.0, 81.0, 25.0, 67.0, 82.0, 64.0, 30.0, 124.0, 78.0, 104.0, 76.0, 74.0, 82.0, 94.0, 53.0, 42.0, 62.0, 87.0, 69.0, 39.0, 20.0, 8.0, 31.0, 99.0, 35.0, 59.0, 117.0, 32.0, 61.0, 71.0, 53.0, 105.0, 139.0, 88.0, 95.0, 90.0, 49.0, 77.0, 160.0], [63.0, 10.0, 24.0, 36.0, 36.0, 16.0, 2.0, 17.0, 31.0, 58.0, 91.0, 121.0, 68.0, 65.0, 76.0, 36.0, 29.0, 105.0, 79.0, 36.0, 71.0, 13.0, 12.0, 82.0, 60.0, 94.0, 41.0, 23.0, 1.0, 19.0, 114.0, 57.0, 92.0, 155.0, 69.0, 42.0, 81.0, 41.0, 21.0, 101.0, 27.0, 24.0, 16.0, 76.0, 68.0, 64.0, 63.0, 92.0, 67.0], [105.0, 48.0, 62.0, 61.0, 51.0, 52.0, 176.0, 41.0, 44.0, 42.0, 68.0, 65.0, 40.0, 8.0, 38.0, 73.0, 49.0, 130.0, 75.0, 78.0, 97.0, 15.0, 47.0, 23.0, 23.0, 70.0, 87.0, 22.0, 17.0, 1.0, 40.0, 33.0, 15.0, 57.0, 39.0, 96.0, 137.0, 40.0, 56.0, 33.0, 9.0, 23.0, 25.0, 60.0, 35.0, 18.0, 83.0, 31.0, 36.0], [41.0, 54.0, 140.0, 65.0, 14.0, 33.0, 50.0, 50.0, 41.0, 15.0, 32.0, 12.0, 21.0, 13.0, 59.0, 35.0, 36.0, 43.0, 52.0, 53.0, 73.0, 3.0, 54.0, 43.0, 80.0, 22.0, 52.0, 30.0, 32.0, 7.0, 37.0, 53.0, 58.0, 35.0, 48.0, 3.0, 8.0, 40.0, 48.0, 39.0, 61.0, 63.0, 57.0, 47.0, 15.0, 13.0, 21.0, 36.0, 33.0], [127.0, 63.0, 58.0, 34.0, 14.0, 40.0, 12.0, 48.0, 15.0, 24.0, 27.0, 47.0, 45.0, 56.0, 46.0, 38.0, 28.0, 7.0, 55.0, 33.0, 69.0, 37.0, 36.0, 7.0, 0.0, 0.0, 21.0, 23.0, 29.0, 12.0, 30.0, 6.0, 37.0, 51.0, 29.0, 51.0, 2.0, 34.0, 14.0, 40.0, 72.0, 10.0, 0.0, 9.0, 71.0, 59.0, 8.0, 27.0, 29.0], [66.0, 38.0, 53.0, 51.0, 29.0, 1.0, 3.0, 41.0, 47.0, 11.0, 23.0, 2.0, 0.0, 4.0, 57.0, 28.0, 51.0, 9.0, 48.0, 35.0, 57.0, 0.0, 18.0, 29.0, 3.0, 24.0, 32.0, 17.0, 34.0, 34.0, 66.0, 60.0, 22.0, 0.0, 30.0, 38.0, 11.0, 54.0, 84.0, 2.0, 2.0, 23.0, 54.0, 44.0, 23.0, 1.0, 1.0, 1.0, 23.0], [81.0, 48.0, 22.0, 37.0, 48.0, 72.0, 98.0, 42.0, 31.0, 20.0, 35.0, 33.0, 17.0, 41.0, 21.0, 21.0, 0.0, 5.0, 35.0, 27.0, 29.0, 16.0, 44.0, 14.0, 23.0, 44.0, 50.0, 3.0, 0.0, 13.0, 32.0, 49.0, 29.0, 25.0, 0.0, 25.0, 23.0, 0.0, 0.0, 13.0, 35.0, 1.0, 0.0, 1.0, 7.0, 85.0, 17.0, 56.0, 13.0], [46.0, 10.0, 35.0, 28.0, 15.0, 35.0, 3.0, 22.0, 3.0, 11.0, 34.0, 25.0, 3.0, 0.0, 1.0, 0.0, 23.0, 27.0, 24.0, 1.0, 0.0, 0.0, 0.0, 0.0, 0.0, 15.0, 11.0, 0.0, 19.0, 14.0, 15.0, 0.0, 24.0, 57.0, 15.0, 12.0, 49.0, 12.0, 3.0, 38.0, 78.0, 51.0, 39.0, 79.0, 26.0, 3.0, 0.0, 1.0, 26.0], [24.0, 14.0, 28.0, 9.0, 0.0, 16.0, 39.0, 1.0, 1.0, 0.0, 0.0, 0.0, 0.0, 0.0, 0.0, 0.0, 0.0, 0.0, 0.0, 1.0, 0.0, 43.0, 6.0, 0.0, 27.0, 22.0, 0.0, 0.0, 1.0, 23.0, 2.0, 4.0, 39.0, 6.0, 12.0, 12.0, 47.0, 41.0, 10.0, 0.0, 23.0, 2.0, 26.0, 24.0, 0.0, 1.0, 37.0, 72.0, 15.0], [55.0, 10.0, 7.0, 23.0, 7.0, 12.0, 18.0, 3.0, 13.0, 39.0, 36.0, 11.0, 16.0, 27.0, 51.0, 38.0, 21.0, 15.0, 0.0, 7.0, 17.0, 0.0, 0.0, 0.0, 1.0, 0.0, 0.0, 19.0, 22.0, 14.0, 19.0, 5.0, 19.0, 0.0, 7.0, 17.0, 0.0, 6.0, 19.0, 34.0, 14.0, 0.0, 23.0, 2.0, 1.0, 0.0, 1.0, 0.0, 1.0], [24.0, 18.0, 30.0, 6.0, 1.0, 1.0, 35.0, 18.0, 0.0, 1.0, 1.0, 24.0, 0.0, 1.0, 0.0, 22.0, 2.0, 0.0, 0.0, 1.0, 1.0, 0.0, 0.0, 0.0, 0.0, 1.0, 19.0, 4.0, 1.0, 4.0, 21.0, 22.0, 3.0, 0.0, 19.0, 5.0, 0.0, 2.0, 24.0, 22.0, 3.0, 1.0, 16.0, 8.0, 0.0, 8.0, 17.0, 1.0, 25.0], [20.0, 14.0, 5.0, 8.0, 18.0, 13.0, 2.0, 0.0, 0.0, 1.0, 24.0, 1.0, 0.0, 0.0, 3.0, 21.0, 0.0, 12.0, 34.0, 4.0, 0.0, 0.0, 0.0, 0.0, 24.0, 0.0, 0.0, 0.0, 0.0, 1.0, 0.0, 0.0, 0.0, 0.0, 0.0, 23.0, 15.0, 11.0, 0.0, 0.0, 2.0, 24.0, 1.0, 0.0, 17.0, 30.0, 2.0, 2.0, 1.0]],
    "Name": "sCurve-0",
    "Overflow": 2523586.0,
    "Type": "Histo2d",
    "Underflow": 0.0,
    "x": {
        "AxisTitle": "Vcal",
        "Bins": 51,
        "High": 302.5,
        "Low": 47.5
    },
    "y": {
        "AxisTitle": "Occupancy",
        "Bins": 49,
        "High": 49.5,
        "Low": 0.5
    },
    "z": {
        "AxisTitle": "Number of pixels"
    }
}