{
    "Data": [[747.0, 226.0, 116.0, 59.0, 44.0, 37.0, 21.0, 15.0, 8.0, 7.0, 8.0, 12.0, 9.0, 9.0, 8.0, 4.0, 9.0, 6.0, 3.0, 6.0, 12.0, 5.0, 4.0, 3.0, 3.0, 2.0, 7.0, 8.0, 3.0, 9.0, 8.0, 7.0, 8.0, 6.0, 3.0, 4.0, 10.0, 8.0, 8.0, 5.0, 7.0, 5.0, 6.0, 3.0, 9.0, 3.0, 2.0, 2.0, 10.0], [1218.0, 379.0, 184.0, 120.0, 72.0, 46.0, 44.0, 29.0, 30.0, 14.0, 15.0, 13.0, 13.0, 11.0, 8.0, 3.0, 9.0, 11.0, 1.0, 5.0, 3.0, 9.0, 5.0, 8.0, 4.0, 5.0, 2.0, 6.0, 3.0, 5.0, 5.0, 8.0, 7.0, 6.0, 11.0, 5.0, 11.0, 7.0, 4.0, 6.0, 4.0, 16.0, 4.0, 6.0, 7.0, 5.0, 4.0, 9.0, 9.0], [2321.0, 700.0, 357.0, 194.0, 139.0, 94.0, 88.0, 60.0, 43.0, 39.0, 33.0, 28.0, 17.0, 19.0, 19.0, 11.0, 4.0, 6.0, 6.0, 8.0, 11.0, 13.0, 4.0, 8.0, 9.0, 5.0, 4.0, 7.0, 4.0, 3.0, 8.0, 9.0, 7.0, 4.0, 13.0, 4.0, 6.0, 9.0, 7.0, 4.0, 8.0, 13.0, 8.0, 6.0, 5.0, 15.0, 4.0, 11.0, 10.0], [3535.0, 1386.0, 708.0, 449.0, 309.0, 203.0, 142.0, 96.0, 94.0, 77.0, 59.0, 50.0, 38.0, 42.0, 33.0, 26.0, 23.0, 26.0, 25.0, 16.0, 10.0, 18.0, 9.0, 9.0, 12.0, 9.0, 12.0, 11.0, 8.0, 7.0, 9.0, 9.0, 12.0, 8.0, 6.0, 7.0, 3.0, 8.0, 6.0, 5.0, 6.0, 11.0, 8.0, 6.0, 12.0, 6.0, 12.0, 16.0, 13.0], [5232.0, 2212.0, 1326.0, 879.0, 583.0, 436.0, 359.0, 266.0, 225.0, 172.0, 145.0, 129.0, 97.0, 81.0, 57.0, 63.0, 58.0, 36.0, 34.0, 35.0, 34.0, 29.0, 25.0, 29.0, 27.0, 21.0, 26.0, 21.0, 14.0, 19.0, 14.0, 13.0, 15.0, 15.0, 13.0, 10.0, 9.0, 10.0, 7.0, 13.0, 8.0, 12.0, 8.0, 11.0, 9.0, 15.0, 12.0, 15.0, 18.0], [8976.0, 4009.0, 2268.0, 1525.0, 1071.0, 822.0, 650.0, 583.0, 454.0, 348.0, 317.0, 300.0, 267.0, 205.0, 197.0, 151.0, 140.0, 124.0, 104.0, 96.0, 70.0, 69.0, 69.0, 64.0, 55.0, 49.0, 43.0, 39.0, 41.0, 25.0, 37.0, 28.0, 31.0, 36.0, 26.0, 23.0, 20.0, 19.0, 16.0, 11.0, 13.0, 24.0, 21.0, 14.0, 18.0, 10.0, 19.0, 22.0, 24.0], [9105.0, 6680.0, 4869.0, 3645.0, 2662.0, 2138.0, 1629.0, 1221.0, 960.0, 838.0, 638.0, 586.0, 543.0, 461.0, 394.0, 366.0, 333.0, 295.0, 254.0, 230.0, 194.0, 201.0, 179.0, 154.0, 139.0, 139.0, 114.0, 125.0, 107.0, 81.0, 80.0, 60.0, 54.0, 58.0, 52.0, 52.0, 67.0, 46.0, 34.0, 50.0, 30.0, 39.0, 36.0, 33.0, 29.0, 32.0, 29.0, 28.0, 41.0], [3003.0, 3096.0, 3224.0, 3313.0, 3190.0, 3119.0, 2931.0, 2725.0, 2559.0, 2289.0, 2085.0, 1866.0, 1786.0, 1463.0, 1336.0, 1264.0, 1033.0, 949.0, 827.0, 694.0, 641.0, 578.0, 521.0, 435.0, 416.0, 368.0, 326.0, 276.0, 277.0, 242.0, 202.0, 204.0, 172.0, 174.0, 150.0, 136.0, 121.0, 118.0, 110.0, 82.0, 94.0, 86.0, 77.0, 79.0, 75.0, 65.0, 51.0, 72.0, 64.0], [1083.0, 987.0, 976.0, 947.0, 1044.0, 1034.0, 1193.0, 1187.0, 1242.0, 1337.0, 1420.0, 1553.0, 1522.0, 1639.0, 1670.0, 1723.0, 1651.0, 1730.0, 1732.0, 1769.0, 1705.0, 1618.0, 1588.0, 1550.0, 1534.0, 1463.0, 1486.0, 1237.0, 1268.0, 1131.0, 1125.0, 938.0, 921.0, 744.0, 706.0, 602.0, 569.0, 485.0, 455.0, 397.0, 345.0, 282.0, 222.0, 229.0, 202.0, 180.0, 154.0, 141.0, 154.0], [525.0, 427.0, 428.0, 417.0, 447.0, 428.0, 436.0, 515.0, 527.0, 508.0, 573.0, 521.0, 554.0, 606.0, 645.0, 664.0, 678.0, 732.0, 717.0, 779.0, 823.0, 862.0, 935.0, 1005.0, 1099.0, 1171.0, 1253.0, 1198.0, 1345.0, 1343.0, 1463.0, 1577.0, 1611.0, 1702.0, 1705.0, 1808.0, 1800.0, 1819.0, 1791.0, 1828.0, 1857.0, 1732.0, 1700.0, 1529.0, 1338.0, 1186.0, 1013.0, 849.0, 639.0], [347.0, 194.0, 202.0, 185.0, 172.0, 217.0, 209.0, 235.0, 253.0, 248.0, 267.0, 295.0, 286.0, 319.0, 341.0, 356.0, 365.0, 378.0, 405.0, 423.0, 461.0, 452.0, 520.0, 520.0, 547.0, 543.0, 555.0, 583.0, 651.0, 682.0, 700.0, 724.0, 760.0, 879.0, 938.0, 947.0, 1128.0, 1186.0, 1320.0, 1602.0, 1740.0, 1899.0, 2198.0, 2585.0, 2850.0, 3292.0, 3605.0, 4050.0, 4274.0], [278.0, 159.0, 119.0, 86.0, 65.0, 84.0, 100.0, 101.0, 72.0, 109.0, 105.0, 107.0, 158.0, 149.0, 143.0, 154.0, 169.0, 186.0, 194.0, 219.0, 252.0, 255.0, 285.0, 288.0, 294.0, 354.0, 343.0, 354.0, 420.0, 437.0, 468.0, 464.0, 523.0, 557.0, 658.0, 674.0, 705.0, 730.0, 800.0, 860.0, 1010.0, 1190.0, 1256.0, 1478.0, 1761.0, 2272.0, 3110.0, 4566.0, 7628.0], [263.0, 112.0, 82.0, 65.0, 49.0, 56.0, 53.0, 54.0, 50.0, 37.0, 43.0, 53.0, 53.0, 58.0, 53.0, 66.0, 57.0, 69.0, 81.0, 84.0, 89.0, 101.0, 113.0, 140.0, 159.0, 175.0, 166.0, 221.0, 222.0, 218.0, 262.0, 302.0, 316.0, 280.0, 388.0, 446.0, 448.0, 507.0, 600.0, 682.0, 755.0, 872.0, 989.0, 1090.0, 1307.0, 1609.0, 2191.0, 2997.0, 5970.0], [242.0, 106.0, 67.0, 44.0, 42.0, 51.0, 44.0, 32.0, 31.0, 31.0, 22.0, 24.0, 25.0, 28.0, 30.0, 25.0, 27.0, 37.0, 29.0, 43.0, 51.0, 51.0, 47.0, 49.0, 53.0, 52.0, 66.0, 74.0, 93.0, 97.0, 93.0, 124.0, 138.0, 167.0, 202.0, 212.0, 255.0, 271.0, 299.0, 402.0, 436.0, 518.0, 658.0, 802.0, 975.0, 1307.0, 1740.0, 2633.0, 4664.0], [246.0, 106.0, 64.0, 52.0, 38.0, 29.0, 26.0, 25.0, 24.0, 23.0, 17.0, 19.0, 13.0, 22.0, 15.0, 21.0, 20.0, 17.0, 22.0, 24.0, 18.0, 29.0, 17.0, 26.0, 18.0, 32.0, 36.0, 34.0, 38.0, 33.0, 50.0, 45.0, 60.0, 51.0, 60.0, 76.0, 86.0, 119.0, 142.0, 165.0, 206.0, 273.0, 304.0, 443.0, 585.0, 807.0, 1232.0, 2038.0, 3990.0], [229.0, 97.0, 56.0, 37.0, 26.0, 26.0, 32.0, 20.0, 19.0, 19.0, 13.0, 17.0, 11.0, 16.0, 14.0, 21.0, 9.0, 10.0, 11.0, 13.0, 17.0, 24.0, 12.0, 16.0, 14.0, 13.0, 17.0, 14.0, 27.0, 25.0, 15.0, 36.0, 30.0, 24.0, 37.0, 29.0, 51.0, 59.0, 66.0, 67.0, 90.0, 93.0, 142.0, 177.0, 293.0, 402.0, 651.0, 1234.0, 3158.0], [217.0, 90.0, 63.0, 48.0, 26.0, 30.0, 14.0, 19.0, 9.0, 14.0, 12.0, 14.0, 17.0, 14.0, 9.0, 9.0, 7.0, 12.0, 11.0, 13.0, 12.0, 9.0, 13.0, 15.0, 7.0, 17.0, 8.0, 16.0, 17.0, 9.0, 13.0, 16.0, 24.0, 20.0, 18.0, 35.0, 17.0, 32.0, 29.0, 30.0, 33.0, 59.0, 55.0, 89.0, 112.0, 162.0, 271.0, 633.0, 1952.0], [202.0, 79.0, 60.0, 33.0, 39.0, 23.0, 24.0, 15.0, 17.0, 16.0, 16.0, 8.0, 4.0, 12.0, 13.0, 8.0, 7.0, 6.0, 11.0, 6.0, 6.0, 11.0, 5.0, 11.0, 12.0, 6.0, 9.0, 13.0, 5.0, 20.0, 14.0, 13.0, 15.0, 14.0, 15.0, 16.0, 8.0, 16.0, 20.0, 27.0, 19.0, 42.0, 28.0, 28.0, 58.0, 90.0, 144.0, 307.0, 1043.0], [202.0, 70.0, 49.0, 40.0, 25.0, 21.0, 17.0, 15.0, 12.0, 18.0, 12.0, 13.0, 13.0, 6.0, 11.0, 5.0, 1.0, 8.0, 5.0, 11.0, 12.0, 1.0, 4.0, 6.0, 7.0, 10.0, 12.0, 10.0, 1.0, 10.0, 12.0, 14.0, 12.0, 8.0, 15.0, 10.0, 11.0, 16.0, 24.0, 17.0, 14.0, 23.0, 17.0, 31.0, 39.0, 39.0, 70.0, 139.0, 499.0], [192.0, 79.0, 56.0, 32.0, 25.0, 10.0, 23.0, 14.0, 12.0, 13.0, 9.0, 13.0, 4.0, 5.0, 5.0, 10.0, 6.0, 5.0, 3.0, 9.0, 10.0, 4.0, 13.0, 6.0, 10.0, 9.0, 6.0, 8.0, 10.0, 7.0, 8.0, 5.0, 1.0, 7.0, 9.0, 9.0, 5.0, 6.0, 16.0, 15.0, 12.0, 21.0, 18.0, 20.0, 25.0, 34.0, 46.0, 89.0, 296.0], [194.0, 76.0, 42.0, 28.0, 23.0, 20.0, 13.0, 16.0, 3.0, 11.0, 8.0, 11.0, 8.0, 6.0, 2.0, 8.0, 5.0, 4.0, 5.0, 5.0, 7.0, 7.0, 9.0, 5.0, 6.0, 7.0, 7.0, 6.0, 8.0, 9.0, 8.0, 5.0, 13.0, 7.0, 10.0, 8.0, 10.0, 12.0, 12.0, 9.0, 12.0, 11.0, 6.0, 12.0, 20.0, 22.0, 38.0, 66.0, 169.0], [204.0, 64.0, 29.0, 28.0, 18.0, 17.0, 16.0, 13.0, 10.0, 9.0, 8.0, 6.0, 3.0, 8.0, 3.0, 5.0, 4.0, 12.0, 8.0, 3.0, 3.0, 5.0, 2.0, 3.0, 4.0, 10.0, 6.0, 6.0, 4.0, 5.0, 11.0, 6.0, 9.0, 6.0, 13.0, 7.0, 6.0, 8.0, 13.0, 12.0, 14.0, 8.0, 12.0, 15.0, 12.0, 20.0, 26.0, 48.0, 126.0], [205.0, 68.0, 61.0, 19.0, 15.0, 16.0, 8.0, 10.0, 9.0, 10.0, 4.0, 5.0, 8.0, 2.0, 3.0, 2.0, 4.0, 4.0, 5.0, 1.0, 1.0, 4.0, 8.0, 2.0, 4.0, 4.0, 7.0, 9.0, 1.0, 7.0, 2.0, 7.0, 5.0, 4.0, 6.0, 10.0, 9.0, 6.0, 10.0, 8.0, 9.0, 8.0, 7.0, 14.0, 15.0, 18.0, 22.0, 35.0, 84.0], [208.0, 69.0, 36.0, 24.0, 25.0, 13.0, 13.0, 10.0, 8.0, 4.0, 6.0, 7.0, 7.0, 3.0, 5.0, 3.0, 2.0, 3.0, 1.0, 4.0, 0.0, 6.0, 3.0, 1.0, 3.0, 4.0, 1.0, 4.0, 4.0, 6.0, 7.0, 3.0, 4.0, 7.0, 3.0, 4.0, 13.0, 2.0, 8.0, 4.0, 5.0, 7.0, 13.0, 12.0, 9.0, 12.0, 18.0, 22.0, 70.0], [212.0, 71.0, 37.0, 31.0, 18.0, 11.0, 13.0, 11.0, 8.0, 10.0, 7.0, 1.0, 6.0, 1.0, 2.0, 4.0, 4.0, 5.0, 2.0, 2.0, 4.0, 2.0, 2.0, 2.0, 1.0, 6.0, 3.0, 3.0, 0.0, 4.0, 2.0, 3.0, 3.0, 4.0, 3.0, 5.0, 2.0, 5.0, 10.0, 5.0, 5.0, 4.0, 9.0, 12.0, 10.0, 8.0, 10.0, 25.0, 56.0], [192.0, 65.0, 36.0, 29.0, 20.0, 15.0, 12.0, 11.0, 9.0, 10.0, 2.0, 7.0, 5.0, 0.0, 6.0, 4.0, 0.0, 2.0, 3.0, 3.0, 2.0, 1.0, 3.0, 3.0, 2.0, 6.0, 3.0, 3.0, 1.0, 2.0, 5.0, 3.0, 7.0, 3.0, 6.0, 2.0, 3.0, 2.0, 10.0, 7.0, 6.0, 3.0, 7.0, 6.0, 6.0, 7.0, 7.0, 18.0, 44.0], [195.0, 70.0, 34.0, 23.0, 25.0, 11.0, 4.0, 12.0, 8.0, 9.0, 3.0, 3.0, 6.0, 5.0, 3.0, 2.0, 1.0, 4.0, 1.0, 3.0, 4.0, 2.0, 4.0, 0.0, 4.0, 4.0, 3.0, 2.0, 2.0, 5.0, 2.0, 5.0, 4.0, 1.0, 5.0, 6.0, 4.0, 6.0, 5.0, 3.0, 1.0, 4.0, 2.0, 2.0, 7.0, 3.0, 9.0, 13.0, 29.0], [213.0, 64.0, 35.0, 21.0, 19.0, 13.0, 10.0, 9.0, 12.0, 7.0, 5.0, 1.0, 5.0, 2.0, 2.0, 2.0, 0.0, 1.0, 1.0, 1.0, 3.0, 4.0, 3.0, 4.0, 3.0, 5.0, 2.0, 1.0, 4.0, 4.0, 3.0, 1.0, 2.0, 4.0, 1.0, 3.0, 5.0, 2.0, 6.0, 4.0, 9.0, 4.0, 3.0, 5.0, 1.0, 2.0, 4.0, 9.0, 23.0], [181.0, 63.0, 40.0, 28.0, 14.0, 11.0, 16.0, 8.0, 9.0, 10.0, 5.0, 5.0, 3.0, 4.0, 1.0, 3.0, 3.0, 1.0, 4.0, 2.0, 1.0, 1.0, 5.0, 1.0, 1.0, 1.0, 1.0, 2.0, 0.0, 4.0, 2.0, 0.0, 6.0, 4.0, 5.0, 6.0, 2.0, 5.0, 3.0, 3.0, 4.0, 2.0, 5.0, 2.0, 1.0, 5.0, 6.0, 8.0, 13.0], [163.0, 67.0, 42.0, 29.0, 12.0, 14.0, 14.0, 9.0, 7.0, 8.0, 5.0, 3.0, 2.0, 4.0, 3.0, 3.0, 2.0, 4.0, 3.0, 1.0, 4.0, 2.0, 1.0, 4.0, 1.0, 1.0, 4.0, 3.0, 0.0, 0.0, 4.0, 2.0, 3.0, 2.0, 0.0, 3.0, 2.0, 5.0, 4.0, 5.0, 2.0, 3.0, 1.0, 1.0, 4.0, 1.0, 6.0, 4.0, 10.0], [172.0, 69.0, 32.0, 25.0, 19.0, 18.0, 10.0, 10.0, 8.0, 8.0, 3.0, 4.0, 4.0, 3.0, 1.0, 4.0, 1.0, 3.0, 4.0, 0.0, 1.0, 7.0, 3.0, 3.0, 3.0, 2.0, 2.0, 2.0, 2.0, 4.0, 4.0, 2.0, 2.0, 0.0, 3.0, 2.0, 1.0, 4.0, 1.0, 4.0, 4.0, 4.0, 3.0, 3.0, 2.0, 3.0, 2.0, 1.0, 10.0], [198.0, 70.0, 33.0, 24.0, 18.0, 14.0, 15.0, 10.0, 7.0, 2.0, 10.0, 0.0, 4.0, 3.0, 4.0, 1.0, 0.0, 3.0, 3.0, 4.0, 2.0, 2.0, 5.0, 0.0, 2.0, 3.0, 3.0, 4.0, 1.0, 3.0, 3.0, 4.0, 2.0, 3.0, 3.0, 2.0, 1.0, 2.0, 2.0, 2.0, 5.0, 3.0, 3.0, 1.0, 2.0, 2.0, 5.0, 0.0, 11.0], [181.0, 69.0, 25.0, 27.0, 15.0, 9.0, 16.0, 9.0, 6.0, 4.0, 7.0, 7.0, 6.0, 0.0, 3.0, 2.0, 1.0, 3.0, 0.0, 0.0, 5.0, 1.0, 5.0, 3.0, 5.0, 0.0, 4.0, 2.0, 2.0, 2.0, 3.0, 1.0, 3.0, 2.0, 2.0, 1.0, 2.0, 1.0, 5.0, 1.0, 1.0, 3.0, 3.0, 2.0, 1.0, 1.0, 2.0, 3.0, 8.0], [179.0, 57.0, 36.0, 26.0, 20.0, 19.0, 8.0, 3.0, 7.0, 6.0, 9.0, 5.0, 6.0, 4.0, 2.0, 3.0, 4.0, 0.0, 2.0, 3.0, 3.0, 2.0, 1.0, 1.0, 4.0, 2.0, 2.0, 5.0, 3.0, 0.0, 1.0, 5.0, 1.0, 1.0, 3.0, 3.0, 1.0, 2.0, 4.0, 1.0, 1.0, 4.0, 1.0, 6.0, 5.0, 3.0, 2.0, 3.0, 4.0], [188.0, 70.0, 27.0, 13.0, 14.0, 20.0, 10.0, 17.0, 10.0, 6.0, 6.0, 4.0, 5.0, 1.0, 0.0, 5.0, 3.0, 2.0, 2.0, 2.0, 2.0, 1.0, 1.0, 3.0, 4.0, 2.0, 3.0, 7.0, 4.0, 2.0, 2.0, 2.0, 2.0, 3.0, 3.0, 3.0, 1.0, 2.0, 1.0, 0.0, 2.0, 2.0, 5.0, 3.0, 3.0, 1.0, 1.0, 3.0, 9.0], [194.0, 57.0, 38.0, 19.0, 27.0, 11.0, 6.0, 11.0, 6.0, 7.0, 7.0, 4.0, 1.0, 2.0, 3.0, 5.0, 4.0, 3.0, 5.0, 0.0, 2.0, 0.0, 2.0, 2.0, 3.0, 3.0, 7.0, 1.0, 4.0, 2.0, 2.0, 5.0, 4.0, 5.0, 2.0, 4.0, 2.0, 1.0, 1.0, 1.0, 2.0, 1.0, 2.0, 1.0, 3.0, 0.0, 2.0, 1.0, 7.0], [181.0, 80.0, 36.0, 32.0, 15.0, 14.0, 13.0, 8.0, 9.0, 4.0, 4.0, 6.0, 3.0, 2.0, 5.0, 3.0, 3.0, 0.0, 4.0, 0.0, 1.0, 3.0, 1.0, 4.0, 1.0, 2.0, 5.0, 3.0, 4.0, 0.0, 1.0, 3.0, 5.0, 2.0, 2.0, 4.0, 2.0, 7.0, 0.0, 2.0, 4.0, 7.0, 4.0, 0.0, 0.0, 0.0, 2.0, 3.0, 5.0], [207.0, 62.0, 42.0, 24.0, 20.0, 13.0, 4.0, 9.0, 5.0, 5.0, 9.0, 4.0, 5.0, 4.0, 4.0, 1.0, 2.0, 0.0, 5.0, 1.0, 0.0, 2.0, 4.0, 7.0, 2.0, 4.0, 1.0, 3.0, 2.0, 1.0, 2.0, 4.0, 2.0, 5.0, 1.0, 5.0, 2.0, 1.0, 1.0, 2.0, 2.0, 1.0, 2.0, 0.0, 2.0, 4.0, 2.0, 2.0, 4.0], [199.0, 74.0, 31.0, 26.0, 20.0, 11.0, 12.0, 11.0, 3.0, 10.0, 6.0, 5.0, 3.0, 2.0, 3.0, 1.0, 5.0, 0.0, 4.0, 1.0, 3.0, 2.0, 6.0, 3.0, 1.0, 2.0, 2.0, 0.0, 3.0, 4.0, 1.0, 8.0, 2.0, 1.0, 1.0, 0.0, 1.0, 4.0, 8.0, 0.0, 3.0, 4.0, 1.0, 0.0, 3.0, 0.0, 3.0, 3.0, 3.0], [204.0, 55.0, 30.0, 31.0, 22.0, 14.0, 10.0, 13.0, 3.0, 5.0, 7.0, 4.0, 0.0, 3.0, 3.0, 3.0, 2.0, 1.0, 3.0, 3.0, 2.0, 0.0, 0.0, 1.0, 2.0, 3.0, 3.0, 1.0, 2.0, 3.0, 2.0, 2.0, 4.0, 4.0, 3.0, 3.0, 3.0, 3.0, 3.0, 2.0, 4.0, 2.0, 2.0, 2.0, 1.0, 4.0, 3.0, 0.0, 3.0], [215.0, 81.0, 41.0, 13.0, 20.0, 14.0, 9.0, 8.0, 5.0, 8.0, 7.0, 2.0, 3.0, 4.0, 0.0, 5.0, 1.0, 2.0, 1.0, 1.0, 2.0, 4.0, 1.0, 1.0, 4.0, 0.0, 4.0, 1.0, 1.0, 2.0, 3.0, 3.0, 4.0, 6.0, 3.0, 2.0, 2.0, 2.0, 1.0, 4.0, 1.0, 2.0, 2.0, 1.0, 2.0, 2.0, 2.0, 1.0, 6.0], [216.0, 68.0, 40.0, 20.0, 17.0, 21.0, 12.0, 7.0, 9.0, 5.0, 2.0, 6.0, 5.0, 3.0, 1.0, 5.0, 1.0, 2.0, 1.0, 2.0, 2.0, 4.0, 2.0, 0.0, 1.0, 3.0, 3.0, 4.0, 3.0, 2.0, 1.0, 2.0, 1.0, 10.0, 3.0, 4.0, 1.0, 3.0, 3.0, 1.0, 1.0, 2.0, 3.0, 0.0, 1.0, 3.0, 0.0, 1.0, 2.0], [173.0, 72.0, 35.0, 23.0, 30.0, 11.0, 14.0, 9.0, 13.0, 8.0, 3.0, 3.0, 2.0, 3.0, 4.0, 1.0, 3.0, 2.0, 2.0, 4.0, 0.0, 7.0, 1.0, 3.0, 3.0, 2.0, 1.0, 1.0, 2.0, 2.0, 1.0, 0.0, 0.0, 1.0, 4.0, 3.0, 4.0, 4.0, 0.0, 3.0, 3.0, 2.0, 1.0, 2.0, 3.0, 4.0, 2.0, 1.0, 10.0], [185.0, 69.0, 41.0, 17.0, 24.0, 8.0, 12.0, 10.0, 7.0, 4.0, 10.0, 4.0, 4.0, 3.0, 4.0, 1.0, 1.0, 1.0, 3.0, 0.0, 2.0, 0.0, 2.0, 8.0, 0.0, 1.0, 7.0, 1.0, 1.0, 1.0, 3.0, 1.0, 4.0, 5.0, 2.0, 2.0, 2.0, 5.0, 2.0, 2.0, 0.0, 4.0, 1.0, 3.0, 4.0, 2.0, 0.0, 1.0, 5.0], [199.0, 58.0, 40.0, 22.0, 16.0, 18.0, 9.0, 10.0, 7.0, 1.0, 2.0, 4.0, 6.0, 6.0, 3.0, 1.0, 5.0, 1.0, 2.0, 1.0, 1.0, 4.0, 2.0, 1.0, 5.0, 1.0, 4.0, 5.0, 3.0, 1.0, 3.0, 1.0, 1.0, 4.0, 3.0, 2.0, 3.0, 3.0, 2.0, 1.0, 3.0, 2.0, 3.0, 1.0, 2.0, 0.0, 3.0, 1.0, 2.0], [195.0, 66.0, 33.0, 30.0, 30.0, 23.0, 8.0, 4.0, 11.0, 8.0, 2.0, 4.0, 3.0, 1.0, 0.0, 1.0, 2.0, 2.0, 3.0, 3.0, 2.0, 1.0, 2.0, 1.0, 2.0, 4.0, 2.0, 6.0, 3.0, 4.0, 2.0, 1.0, 3.0, 0.0, 3.0, 1.0, 4.0, 3.0, 1.0, 4.0, 5.0, 1.0, 1.0, 0.0, 0.0, 0.0, 5.0, 3.0, 5.0], [193.0, 74.0, 38.0, 25.0, 18.0, 11.0, 13.0, 15.0, 8.0, 3.0, 7.0, 2.0, 4.0, 1.0, 5.0, 3.0, 5.0, 1.0, 2.0, 4.0, 1.0, 3.0, 3.0, 0.0, 1.0, 0.0, 3.0, 4.0, 1.0, 5.0, 1.0, 1.0, 2.0, 2.0, 1.0, 2.0, 5.0, 2.0, 3.0, 4.0, 1.0, 2.0, 2.0, 6.0, 2.0, 1.0, 1.0, 1.0, 2.0], [209.0, 54.0, 24.0, 20.0, 15.0, 21.0, 13.0, 9.0, 11.0, 3.0, 8.0, 7.0, 3.0, 2.0, 4.0, 1.0, 3.0, 4.0, 1.0, 1.0, 1.0, 3.0, 2.0, 3.0, 0.0, 2.0, 2.0, 4.0, 6.0, 0.0, 5.0, 0.0, 3.0, 2.0, 2.0, 1.0, 2.0, 4.0, 5.0, 2.0, 1.0, 2.0, 1.0, 1.0, 4.0, 1.0, 1.0, 2.0, 6.0], [179.0, 73.0, 31.0, 22.0, 15.0, 16.0, 10.0, 14.0, 11.0, 9.0, 5.0, 0.0, 4.0, 3.0, 2.0, 4.0, 2.0, 5.0, 1.0, 4.0, 2.0, 2.0, 3.0, 5.0, 2.0, 2.0, 2.0, 3.0, 2.0, 0.0, 1.0, 2.0, 2.0, 4.0, 1.0, 0.0, 3.0, 1.0, 8.0, 1.0, 3.0, 5.0, 4.0, 1.0, 1.0, 2.0, 1.0, 1.0, 1.0], [213.0, 74.0, 32.0, 22.0, 22.0, 15.0, 12.0, 5.0, 4.0, 6.0, 4.0, 4.0, 6.0, 6.0, 6.0, 0.0, 1.0, 2.0, 3.0, 2.0, 1.0, 2.0, 3.0, 3.0, 2.0, 1.0, 3.0, 3.0, 2.0, 4.0, 2.0, 3.0, 1.0, 3.0, 4.0, 3.0, 1.0, 2.0, 2.0, 2.0, 1.0, 5.0, 2.0, 2.0, 2.0, 1.0, 2.0, 3.0, 3.0], [193.0, 69.0, 42.0, 18.0, 18.0, 5.0, 17.0, 11.0, 9.0, 6.0, 2.0, 1.0, 2.0, 2.0, 5.0, 1.0, 2.0, 4.0, 3.0, 4.0, 2.0, 3.0, 3.0, 2.0, 4.0, 3.0, 3.0, 1.0, 3.0, 1.0, 0.0, 4.0, 2.0, 5.0, 2.0, 0.0, 0.0, 2.0, 0.0, 6.0, 3.0, 1.0, 5.0, 4.0, 1.0, 0.0, 2.0, 1.0, 4.0]],
    "Name": "sCurve-0",
    "Overflow": 1988241.0,
    "Type": "Histo2d",
    "Underflow": 0.0,
    "x": {
        "AxisTitle": "Vcal",
        "Bins": 51,
        "High": 302.5,
        "Low": 47.5
    },
    "y": {
        "AxisTitle": "Occupancy",
        "Bins": 49,
        "High": 49.5,
        "Low": 0.5
    },
    "z": {
        "AxisTitle": "Number of pixels"
    }
}