{
    "Data": [[619.0, 158.0, 78.0, 36.0, 23.0, 24.0, 16.0, 9.0, 6.0, 4.0, 5.0, 4.0, 6.0, 9.0, 3.0, 2.0, 8.0, 6.0, 9.0, 3.0, 5.0, 6.0, 5.0, 3.0, 4.0, 2.0, 1.0, 1.0, 1.0, 4.0, 4.0, 2.0, 3.0, 5.0, 3.0, 5.0, 2.0, 6.0, 2.0, 0.0, 2.0, 2.0, 4.0, 4.0, 5.0, 3.0, 2.0, 2.0, 1.0], [1450.0, 489.0, 234.0, 129.0, 85.0, 59.0, 36.0, 27.0, 32.0, 23.0, 16.0, 15.0, 10.0, 9.0, 9.0, 5.0, 7.0, 4.0, 7.0, 7.0, 3.0, 1.0, 4.0, 6.0, 5.0, 4.0, 3.0, 4.0, 4.0, 4.0, 6.0, 4.0, 7.0, 7.0, 4.0, 3.0, 2.0, 5.0, 4.0, 5.0, 4.0, 4.0, 6.0, 4.0, 3.0, 4.0, 7.0, 7.0, 6.0], [2607.0, 1131.0, 600.0, 397.0, 266.0, 191.0, 139.0, 89.0, 74.0, 68.0, 76.0, 41.0, 28.0, 36.0, 29.0, 24.0, 25.0, 20.0, 19.0, 17.0, 11.0, 15.0, 9.0, 6.0, 8.0, 8.0, 2.0, 11.0, 3.0, 5.0, 7.0, 6.0, 5.0, 4.0, 7.0, 8.0, 3.0, 7.0, 4.0, 4.0, 7.0, 6.0, 6.0, 10.0, 12.0, 6.0, 5.0, 9.0, 17.0], [3749.0, 1913.0, 1197.0, 878.0, 645.0, 457.0, 375.0, 315.0, 286.0, 184.0, 162.0, 142.0, 129.0, 112.0, 90.0, 72.0, 66.0, 53.0, 62.0, 55.0, 55.0, 31.0, 33.0, 37.0, 26.0, 20.0, 26.0, 25.0, 26.0, 21.0, 13.0, 24.0, 15.0, 11.0, 13.0, 14.0, 9.0, 9.0, 6.0, 12.0, 6.0, 7.0, 11.0, 9.0, 14.0, 9.0, 15.0, 16.0, 25.0], [3707.0, 2410.0, 1647.0, 1310.0, 1029.0, 906.0, 734.0, 621.0, 595.0, 481.0, 389.0, 385.0, 299.0, 294.0, 277.0, 245.0, 195.0, 188.0, 162.0, 159.0, 136.0, 135.0, 124.0, 105.0, 106.0, 89.0, 106.0, 70.0, 73.0, 74.0, 78.0, 38.0, 56.0, 46.0, 34.0, 35.0, 28.0, 43.0, 28.0, 28.0, 34.0, 28.0, 21.0, 33.0, 19.0, 13.0, 22.0, 21.0, 39.0], [4446.0, 2168.0, 1614.0, 1399.0, 1180.0, 1081.0, 982.0, 816.0, 767.0, 700.0, 683.0, 608.0, 511.0, 519.0, 488.0, 509.0, 430.0, 427.0, 368.0, 381.0, 358.0, 339.0, 299.0, 257.0, 262.0, 256.0, 231.0, 225.0, 230.0, 188.0, 178.0, 177.0, 142.0, 113.0, 134.0, 146.0, 125.0, 90.0, 93.0, 102.0, 92.0, 83.0, 81.0, 91.0, 68.0, 62.0, 63.0, 69.0, 65.0], [7038.0, 3983.0, 2577.0, 1800.0, 1528.0, 1192.0, 948.0, 852.0, 819.0, 781.0, 738.0, 706.0, 720.0, 662.0, 684.0, 626.0, 610.0, 541.0, 545.0, 545.0, 512.0, 511.0, 489.0, 471.0, 473.0, 473.0, 401.0, 451.0, 396.0, 409.0, 401.0, 357.0, 382.0, 350.0, 365.0, 325.0, 330.0, 316.0, 316.0, 281.0, 284.0, 253.0, 255.0, 242.0, 239.0, 215.0, 217.0, 167.0, 235.0], [2516.0, 2628.0, 2701.0, 2521.0, 2382.0, 2220.0, 2045.0, 1795.0, 1658.0, 1534.0, 1371.0, 1212.0, 1067.0, 966.0, 964.0, 907.0, 820.0, 823.0, 749.0, 705.0, 674.0, 683.0, 634.0, 628.0, 631.0, 627.0, 552.0, 582.0, 614.0, 585.0, 575.0, 586.0, 579.0, 602.0, 555.0, 581.0, 599.0, 620.0, 599.0, 591.0, 582.0, 581.0, 562.0, 618.0, 613.0, 637.0, 546.0, 546.0, 662.0], [293.0, 269.0, 333.0, 368.0, 447.0, 572.0, 589.0, 704.0, 803.0, 885.0, 950.0, 949.0, 1025.0, 1081.0, 1141.0, 1226.0, 1201.0, 1198.0, 1222.0, 1290.0, 1242.0, 1350.0, 1260.0, 1226.0, 1216.0, 1242.0, 1191.0, 1144.0, 1088.0, 1074.0, 1051.0, 1061.0, 944.0, 979.0, 1019.0, 999.0, 1028.0, 936.0, 1010.0, 968.0, 991.0, 977.0, 1027.0, 1026.0, 1095.0, 1134.0, 1314.0, 1405.0, 1638.0], [160.0, 97.0, 92.0, 70.0, 77.0, 72.0, 80.0, 79.0, 80.0, 110.0, 99.0, 124.0, 149.0, 187.0, 162.0, 201.0, 227.0, 262.0, 285.0, 348.0, 361.0, 403.0, 437.0, 527.0, 522.0, 556.0, 691.0, 751.0, 866.0, 870.0, 1001.0, 1041.0, 1075.0, 1211.0, 1312.0, 1380.0, 1519.0, 1590.0, 1634.0, 1927.0, 2022.0, 2044.0, 2160.0, 2212.0, 2320.0, 2596.0, 2799.0, 2979.0, 3618.0], [210.0, 91.0, 51.0, 44.0, 33.0, 24.0, 38.0, 30.0, 40.0, 24.0, 26.0, 29.0, 24.0, 24.0, 33.0, 28.0, 38.0, 40.0, 49.0, 45.0, 47.0, 69.0, 54.0, 75.0, 79.0, 83.0, 91.0, 128.0, 134.0, 147.0, 182.0, 190.0, 226.0, 238.0, 320.0, 348.0, 442.0, 496.0, 569.0, 761.0, 862.0, 1115.0, 1373.0, 1758.0, 2207.0, 2864.0, 3916.0, 5609.0, 8552.0], [337.0, 80.0, 42.0, 30.0, 32.0, 20.0, 21.0, 22.0, 19.0, 17.0, 12.0, 15.0, 14.0, 14.0, 23.0, 17.0, 21.0, 20.0, 19.0, 17.0, 18.0, 18.0, 22.0, 15.0, 23.0, 36.0, 27.0, 21.0, 34.0, 52.0, 49.0, 61.0, 39.0, 51.0, 73.0, 78.0, 102.0, 110.0, 138.0, 188.0, 214.0, 238.0, 343.0, 469.0, 668.0, 999.0, 1540.0, 2974.0, 7256.0], [616.0, 139.0, 51.0, 27.0, 20.0, 25.0, 17.0, 15.0, 17.0, 18.0, 6.0, 14.0, 13.0, 5.0, 11.0, 14.0, 14.0, 18.0, 13.0, 12.0, 8.0, 10.0, 13.0, 9.0, 16.0, 14.0, 14.0, 16.0, 23.0, 16.0, 10.0, 24.0, 24.0, 24.0, 21.0, 33.0, 31.0, 40.0, 46.0, 64.0, 62.0, 76.0, 100.0, 159.0, 201.0, 314.0, 518.0, 1003.0, 3216.0], [1212.0, 272.0, 101.0, 45.0, 40.0, 12.0, 12.0, 7.0, 8.0, 9.0, 8.0, 14.0, 7.0, 11.0, 7.0, 10.0, 11.0, 8.0, 5.0, 8.0, 6.0, 6.0, 6.0, 14.0, 9.0, 17.0, 9.0, 12.0, 9.0, 15.0, 11.0, 12.0, 9.0, 17.0, 20.0, 20.0, 17.0, 19.0, 26.0, 23.0, 32.0, 25.0, 37.0, 60.0, 66.0, 119.0, 166.0, 374.0, 1307.0], [2100.0, 626.0, 267.0, 113.0, 45.0, 27.0, 25.0, 17.0, 16.0, 13.0, 7.0, 6.0, 5.0, 4.0, 3.0, 6.0, 5.0, 3.0, 11.0, 2.0, 3.0, 10.0, 4.0, 4.0, 7.0, 9.0, 7.0, 9.0, 10.0, 7.0, 9.0, 7.0, 8.0, 9.0, 5.0, 10.0, 15.0, 19.0, 16.0, 21.0, 19.0, 15.0, 24.0, 33.0, 44.0, 49.0, 78.0, 150.0, 508.0], [3183.0, 1160.0, 561.0, 275.0, 145.0, 69.0, 56.0, 37.0, 20.0, 20.0, 15.0, 14.0, 7.0, 5.0, 3.0, 7.0, 7.0, 4.0, 6.0, 7.0, 4.0, 6.0, 3.0, 5.0, 4.0, 1.0, 2.0, 5.0, 11.0, 8.0, 1.0, 7.0, 5.0, 13.0, 6.0, 6.0, 8.0, 9.0, 7.0, 12.0, 14.0, 9.0, 17.0, 18.0, 30.0, 27.0, 45.0, 89.0, 235.0], [4175.0, 1951.0, 1118.0, 579.0, 395.0, 216.0, 117.0, 102.0, 58.0, 41.0, 28.0, 28.0, 20.0, 15.0, 15.0, 3.0, 9.0, 7.0, 3.0, 6.0, 5.0, 2.0, 5.0, 5.0, 2.0, 4.0, 3.0, 4.0, 6.0, 7.0, 4.0, 8.0, 6.0, 8.0, 5.0, 10.0, 3.0, 4.0, 11.0, 14.0, 5.0, 11.0, 9.0, 8.0, 16.0, 27.0, 24.0, 62.0, 130.0], [4668.0, 2692.0, 1748.0, 1088.0, 786.0, 476.0, 349.0, 262.0, 196.0, 141.0, 96.0, 87.0, 53.0, 46.0, 28.0, 19.0, 19.0, 17.0, 15.0, 11.0, 11.0, 12.0, 10.0, 6.0, 4.0, 7.0, 5.0, 2.0, 3.0, 5.0, 4.0, 6.0, 8.0, 5.0, 2.0, 7.0, 10.0, 6.0, 10.0, 4.0, 7.0, 9.0, 7.0, 11.0, 14.0, 18.0, 20.0, 42.0, 74.0], [4318.0, 3000.0, 2206.0, 1592.0, 1241.0, 930.0, 699.0, 568.0, 409.0, 332.0, 224.0, 189.0, 159.0, 126.0, 104.0, 83.0, 58.0, 54.0, 38.0, 28.0, 24.0, 23.0, 12.0, 16.0, 11.0, 8.0, 15.0, 10.0, 5.0, 6.0, 8.0, 8.0, 4.0, 4.0, 4.0, 5.0, 6.0, 9.0, 2.0, 8.0, 9.0, 7.0, 8.0, 5.0, 13.0, 14.0, 14.0, 34.0, 51.0], [3427.0, 2830.0, 2242.0, 1864.0, 1542.0, 1241.0, 1027.0, 872.0, 753.0, 621.0, 495.0, 406.0, 349.0, 273.0, 246.0, 203.0, 167.0, 134.0, 117.0, 104.0, 72.0, 75.0, 56.0, 56.0, 48.0, 36.0, 25.0, 17.0, 16.0, 21.0, 18.0, 8.0, 8.0, 12.0, 13.0, 11.0, 4.0, 3.0, 10.0, 9.0, 6.0, 6.0, 6.0, 1.0, 9.0, 14.0, 12.0, 25.0, 46.0], [2409.0, 2120.0, 2011.0, 1774.0, 1536.0, 1431.0, 1251.0, 1182.0, 1038.0, 861.0, 778.0, 716.0, 632.0, 514.0, 454.0, 441.0, 355.0, 315.0, 285.0, 270.0, 193.0, 174.0, 180.0, 140.0, 113.0, 89.0, 83.0, 64.0, 71.0, 53.0, 52.0, 37.0, 39.0, 31.0, 32.0, 27.0, 14.0, 11.0, 19.0, 8.0, 8.0, 10.0, 8.0, 9.0, 11.0, 8.0, 17.0, 17.0, 40.0], [1555.0, 1486.0, 1457.0, 1466.0, 1402.0, 1317.0, 1221.0, 1115.0, 1061.0, 976.0, 909.0, 821.0, 780.0, 700.0, 691.0, 624.0, 571.0, 504.0, 456.0, 452.0, 406.0, 368.0, 303.0, 299.0, 236.0, 205.0, 180.0, 160.0, 135.0, 117.0, 113.0, 120.0, 99.0, 79.0, 64.0, 65.0, 45.0, 52.0, 33.0, 31.0, 26.0, 19.0, 15.0, 14.0, 10.0, 12.0, 13.0, 16.0, 33.0], [996.0, 1056.0, 1025.0, 987.0, 997.0, 999.0, 996.0, 956.0, 972.0, 946.0, 893.0, 881.0, 867.0, 818.0, 734.0, 730.0, 736.0, 661.0, 599.0, 582.0, 531.0, 529.0, 479.0, 464.0, 417.0, 397.0, 359.0, 332.0, 301.0, 310.0, 287.0, 244.0, 203.0, 193.0, 176.0, 132.0, 126.0, 119.0, 111.0, 85.0, 80.0, 56.0, 39.0, 55.0, 35.0, 27.0, 27.0, 17.0, 29.0], [660.0, 623.0, 687.0, 725.0, 700.0, 692.0, 779.0, 733.0, 794.0, 716.0, 774.0, 722.0, 754.0, 717.0, 757.0, 709.0, 706.0, 738.0, 713.0, 693.0, 668.0, 643.0, 620.0, 594.0, 599.0, 550.0, 518.0, 479.0, 446.0, 451.0, 415.0, 424.0, 382.0, 340.0, 353.0, 292.0, 280.0, 256.0, 233.0, 177.0, 179.0, 160.0, 137.0, 105.0, 98.0, 86.0, 66.0, 63.0, 47.0], [423.0, 378.0, 444.0, 482.0, 481.0, 469.0, 476.0, 519.0, 507.0, 546.0, 579.0, 604.0, 535.0, 618.0, 607.0, 584.0, 617.0, 637.0, 628.0, 647.0, 664.0, 623.0, 628.0, 685.0, 614.0, 620.0, 599.0, 637.0, 564.0, 567.0, 581.0, 572.0, 557.0, 523.0, 523.0, 490.0, 487.0, 428.0, 413.0, 425.0, 343.0, 339.0, 296.0, 278.0, 257.0, 202.0, 171.0, 148.0, 118.0], [397.0, 312.0, 332.0, 293.0, 310.0, 325.0, 361.0, 312.0, 375.0, 335.0, 353.0, 391.0, 396.0, 395.0, 402.0, 455.0, 448.0, 467.0, 494.0, 456.0, 518.0, 519.0, 528.0, 551.0, 611.0, 587.0, 609.0, 578.0, 633.0, 658.0, 650.0, 639.0, 668.0, 656.0, 644.0, 666.0, 651.0, 642.0, 605.0, 577.0, 582.0, 574.0, 543.0, 509.0, 522.0, 416.0, 408.0, 341.0, 318.0], [255.0, 286.0, 158.0, 242.0, 238.0, 252.0, 226.0, 250.0, 249.0, 246.0, 241.0, 287.0, 261.0, 306.0, 284.0, 283.0, 288.0, 333.0, 345.0, 334.0, 352.0, 424.0, 408.0, 404.0, 410.0, 465.0, 466.0, 477.0, 545.0, 562.0, 621.0, 637.0, 597.0, 677.0, 679.0, 700.0, 673.0, 721.0, 763.0, 735.0, 769.0, 818.0, 770.0, 867.0, 807.0, 826.0, 761.0, 712.0, 706.0], [230.0, 243.0, 217.0, 250.0, 223.0, 207.0, 230.0, 166.0, 171.0, 172.0, 181.0, 196.0, 235.0, 201.0, 200.0, 197.0, 217.0, 181.0, 211.0, 178.0, 219.0, 233.0, 240.0, 266.0, 273.0, 326.0, 305.0, 361.0, 352.0, 374.0, 426.0, 432.0, 482.0, 542.0, 626.0, 602.0, 645.0, 686.0, 750.0, 812.0, 885.0, 940.0, 929.0, 1010.0, 1018.0, 1154.0, 1175.0, 1303.0, 1387.0], [181.0, 161.0, 152.0, 201.0, 131.0, 127.0, 154.0, 168.0, 201.0, 162.0, 197.0, 208.0, 224.0, 216.0, 205.0, 227.0, 191.0, 172.0, 201.0, 213.0, 179.0, 160.0, 159.0, 195.0, 182.0, 219.0, 229.0, 260.0, 232.0, 275.0, 346.0, 316.0, 375.0, 366.0, 384.0, 435.0, 529.0, 510.0, 571.0, 657.0, 772.0, 829.0, 922.0, 1042.0, 1124.0, 1344.0, 1599.0, 1735.0, 1956.0], [222.0, 145.0, 122.0, 96.0, 117.0, 183.0, 110.0, 170.0, 102.0, 156.0, 111.0, 104.0, 117.0, 78.0, 114.0, 125.0, 114.0, 135.0, 115.0, 103.0, 98.0, 144.0, 133.0, 119.0, 160.0, 145.0, 149.0, 146.0, 153.0, 160.0, 179.0, 181.0, 242.0, 295.0, 329.0, 351.0, 364.0, 362.0, 451.0, 526.0, 542.0, 677.0, 813.0, 938.0, 1150.0, 1359.0, 1628.0, 2099.0, 2842.0], [138.0, 90.0, 159.0, 141.0, 74.0, 106.0, 147.0, 102.0, 116.0, 169.0, 159.0, 99.0, 95.0, 105.0, 97.0, 133.0, 111.0, 128.0, 115.0, 134.0, 106.0, 136.0, 112.0, 142.0, 128.0, 108.0, 103.0, 111.0, 128.0, 153.0, 137.0, 124.0, 158.0, 125.0, 194.0, 185.0, 245.0, 259.0, 293.0, 296.0, 370.0, 471.0, 504.0, 632.0, 828.0, 1113.0, 1557.0, 2096.0, 3176.0], [162.0, 137.0, 132.0, 161.0, 141.0, 172.0, 118.0, 104.0, 92.0, 69.0, 109.0, 105.0, 113.0, 73.0, 98.0, 181.0, 101.0, 120.0, 111.0, 73.0, 58.0, 112.0, 77.0, 70.0, 90.0, 85.0, 119.0, 64.0, 82.0, 158.0, 131.0, 113.0, 119.0, 139.0, 129.0, 170.0, 145.0, 200.0, 187.0, 242.0, 252.0, 277.0, 331.0, 454.0, 554.0, 780.0, 1179.0, 1845.0, 3128.0], [136.0, 127.0, 181.0, 122.0, 148.0, 66.0, 98.0, 166.0, 73.0, 149.0, 87.0, 165.0, 172.0, 90.0, 98.0, 88.0, 50.0, 84.0, 110.0, 121.0, 171.0, 106.0, 74.0, 111.0, 133.0, 103.0, 56.0, 91.0, 86.0, 66.0, 76.0, 89.0, 69.0, 101.0, 127.0, 121.0, 76.0, 71.0, 69.0, 123.0, 168.0, 188.0, 200.0, 258.0, 394.0, 529.0, 759.0, 1372.0, 2707.0], [146.0, 78.0, 182.0, 143.0, 49.0, 78.0, 164.0, 78.0, 144.0, 179.0, 87.0, 109.0, 108.0, 185.0, 192.0, 87.0, 88.0, 77.0, 66.0, 65.0, 127.0, 186.0, 87.0, 47.0, 105.0, 121.0, 75.0, 47.0, 87.0, 63.0, 91.0, 52.0, 105.0, 109.0, 107.0, 114.0, 72.0, 81.0, 71.0, 108.0, 79.0, 113.0, 162.0, 202.0, 240.0, 298.0, 508.0, 970.0, 2120.0], [76.0, 64.0, 125.0, 196.0, 146.0, 67.0, 87.0, 201.0, 95.0, 178.0, 106.0, 83.0, 126.0, 58.0, 72.0, 70.0, 28.0, 27.0, 88.0, 115.0, 128.0, 133.0, 72.0, 75.0, 68.0, 88.0, 116.0, 176.0, 129.0, 77.0, 121.0, 149.0, 133.0, 49.0, 79.0, 42.0, 48.0, 92.0, 83.0, 121.0, 98.0, 93.0, 62.0, 103.0, 160.0, 181.0, 307.0, 562.0, 1420.0], [133.0, 77.0, 147.0, 73.0, 106.0, 114.0, 62.0, 80.0, 107.0, 100.0, 97.0, 87.0, 86.0, 166.0, 53.0, 90.0, 116.0, 63.0, 77.0, 102.0, 44.0, 69.0, 57.0, 53.0, 66.0, 132.0, 102.0, 124.0, 77.0, 113.0, 149.0, 87.0, 79.0, 53.0, 40.0, 66.0, 88.0, 52.0, 52.0, 62.0, 81.0, 84.0, 147.0, 98.0, 67.0, 81.0, 167.0, 337.0, 959.0], [180.0, 145.0, 142.0, 82.0, 59.0, 47.0, 69.0, 107.0, 82.0, 94.0, 137.0, 130.0, 95.0, 65.0, 101.0, 63.0, 30.0, 66.0, 101.0, 80.0, 48.0, 104.0, 60.0, 79.0, 82.0, 46.0, 89.0, 50.0, 134.0, 23.0, 49.0, 90.0, 134.0, 108.0, 118.0, 118.0, 101.0, 90.0, 50.0, 18.0, 82.0, 58.0, 69.0, 43.0, 45.0, 41.0, 137.0, 174.0, 595.0], [88.0, 81.0, 96.0, 141.0, 136.0, 96.0, 89.0, 42.0, 56.0, 50.0, 121.0, 121.0, 73.0, 96.0, 122.0, 135.0, 128.0, 100.0, 145.0, 85.0, 95.0, 71.0, 108.0, 76.0, 48.0, 61.0, 34.0, 20.0, 74.0, 66.0, 69.0, 81.0, 28.0, 84.0, 53.0, 83.0, 41.0, 99.0, 95.0, 80.0, 90.0, 45.0, 56.0, 42.0, 20.0, 40.0, 38.0, 107.0, 339.0], [67.0, 73.0, 116.0, 83.0, 130.0, 84.0, 53.0, 105.0, 112.0, 88.0, 128.0, 81.0, 74.0, 42.0, 43.0, 113.0, 107.0, 89.0, 65.0, 70.0, 100.0, 66.0, 34.0, 105.0, 50.0, 17.0, 36.0, 57.0, 72.0, 113.0, 89.0, 108.0, 50.0, 64.0, 109.0, 51.0, 85.0, 96.0, 90.0, 53.0, 35.0, 39.0, 123.0, 117.0, 88.0, 22.0, 26.0, 49.0, 170.0], [67.0, 89.0, 70.0, 146.0, 42.0, 67.0, 56.0, 62.0, 62.0, 12.0, 40.0, 82.0, 62.0, 130.0, 79.0, 98.0, 87.0, 41.0, 41.0, 37.0, 45.0, 103.0, 76.0, 71.0, 82.0, 4.0, 80.0, 38.0, 0.0, 16.0, 15.0, 54.0, 55.0, 68.0, 113.0, 64.0, 26.0, 39.0, 63.0, 58.0, 56.0, 16.0, 38.0, 27.0, 79.0, 85.0, 74.0, 60.0, 87.0], [107.0, 74.0, 87.0, 95.0, 87.0, 89.0, 55.0, 28.0, 47.0, 29.0, 33.0, 108.0, 122.0, 55.0, 47.0, 19.0, 14.0, 60.0, 46.0, 45.0, 88.0, 35.0, 45.0, 29.0, 24.0, 35.0, 41.0, 40.0, 27.0, 52.0, 94.0, 24.0, 16.0, 99.0, 42.0, 62.0, 133.0, 58.0, 20.0, 49.0, 99.0, 55.0, 49.0, 30.0, 77.0, 43.0, 105.0, 90.0, 107.0], [106.0, 34.0, 67.0, 21.0, 28.0, 69.0, 148.0, 65.0, 97.0, 34.0, 41.0, 77.0, 76.0, 25.0, 55.0, 76.0, 50.0, 26.0, 67.0, 81.0, 84.0, 66.0, 69.0, 19.0, 32.0, 66.0, 55.0, 15.0, 22.0, 67.0, 50.0, 20.0, 65.0, 21.0, 12.0, 63.0, 53.0, 61.0, 105.0, 23.0, 36.0, 32.0, 42.0, 2.0, 27.0, 30.0, 36.0, 90.0, 139.0], [188.0, 87.0, 47.0, 39.0, 25.0, 9.0, 19.0, 74.0, 75.0, 54.0, 63.0, 9.0, 20.0, 47.0, 7.0, 42.0, 22.0, 27.0, 5.0, 54.0, 52.0, 40.0, 1.0, 38.0, 88.0, 105.0, 40.0, 17.0, 79.0, 30.0, 31.0, 58.0, 51.0, 55.0, 17.0, 72.0, 59.0, 8.0, 22.0, 17.0, 13.0, 54.0, 20.0, 1.0, 22.0, 18.0, 34.0, 44.0, 82.0], [72.0, 26.0, 28.0, 12.0, 38.0, 18.0, 100.0, 50.0, 89.0, 26.0, 23.0, 42.0, 52.0, 33.0, 50.0, 16.0, 4.0, 20.0, 1.0, 22.0, 13.0, 69.0, 24.0, 18.0, 0.0, 10.0, 54.0, 36.0, 23.0, 40.0, 20.0, 55.0, 20.0, 32.0, 35.0, 14.0, 24.0, 21.0, 29.0, 22.0, 3.0, 3.0, 3.0, 11.0, 43.0, 88.0, 64.0, 52.0, 31.0], [29.0, 12.0, 8.0, 5.0, 36.0, 49.0, 31.0, 11.0, 66.0, 43.0, 25.0, 28.0, 9.0, 0.0, 0.0, 0.0, 27.0, 55.0, 31.0, 33.0, 47.0, 25.0, 0.0, 16.0, 8.0, 1.0, 25.0, 23.0, 0.0, 2.0, 0.0, 44.0, 40.0, 34.0, 54.0, 43.0, 72.0, 90.0, 37.0, 1.0, 0.0, 64.0, 9.0, 0.0, 0.0, 4.0, 23.0, 24.0, 4.0], [35.0, 18.0, 10.0, 4.0, 42.0, 9.0, 51.0, 24.0, 17.0, 9.0, 0.0, 24.0, 0.0, 0.0, 0.0, 15.0, 18.0, 21.0, 43.0, 9.0, 63.0, 0.0, 1.0, 2.0, 6.0, 23.0, 39.0, 5.0, 36.0, 51.0, 10.0, 25.0, 2.0, 18.0, 50.0, 6.0, 25.0, 46.0, 18.0, 8.0, 2.0, 20.0, 21.0, 8.0, 20.0, 66.0, 22.0, 31.0, 36.0], [51.0, 40.0, 27.0, 24.0, 60.0, 2.0, 1.0, 7.0, 38.0, 14.0, 21.0, 22.0, 14.0, 56.0, 2.0, 12.0, 32.0, 31.0, 21.0, 25.0, 7.0, 36.0, 5.0, 0.0, 0.0, 0.0, 32.0, 37.0, 28.0, 1.0, 0.0, 0.0, 40.0, 10.0, 1.0, 0.0, 0.0, 2.0, 19.0, 41.0, 21.0, 18.0, 0.0, 0.0, 0.0, 3.0, 40.0, 33.0, 40.0], [65.0, 13.0, 23.0, 42.0, 5.0, 21.0, 6.0, 0.0, 0.0, 0.0, 0.0, 0.0, 20.0, 9.0, 20.0, 23.0, 3.0, 22.0, 1.0, 15.0, 9.0, 0.0, 20.0, 49.0, 13.0, 52.0, 12.0, 12.0, 13.0, 0.0, 24.0, 0.0, 0.0, 31.0, 17.0, 33.0, 43.0, 0.0, 0.0, 2.0, 2.0, 17.0, 9.0, 13.0, 51.0, 17.0, 18.0, 0.0, 19.0], [32.0, 16.0, 17.0, 37.0, 11.0, 3.0, 1.0, 22.0, 18.0, 8.0, 13.0, 12.0, 1.0, 22.0, 26.0, 0.0, 0.0, 24.0, 0.0, 0.0, 0.0, 22.0, 3.0, 0.0, 0.0, 9.0, 15.0, 20.0, 30.0, 2.0, 1.0, 34.0, 17.0, 15.0, 10.0, 1.0, 1.0, 0.0, 0.0, 4.0, 20.0, 13.0, 11.0, 24.0, 0.0, 1.0, 0.0, 1.0, 3.0], [32.0, 9.0, 12.0, 8.0, 22.0, 26.0, 27.0, 0.0, 2.0, 11.0, 14.0, 0.0, 1.0, 0.0, 0.0, 0.0, 2.0, 0.0, 15.0, 22.0, 18.0, 17.0, 0.0, 0.0, 0.0, 0.0, 0.0, 23.0, 2.0, 0.0, 0.0, 1.0, 21.0, 4.0, 1.0, 0.0, 18.0, 6.0, 9.0, 31.0, 28.0, 27.0, 7.0, 0.0, 0.0, 1.0, 1.0, 1.0, 3.0], [30.0, 14.0, 7.0, 8.0, 4.0, 3.0, 1.0, 0.0, 1.0, 16.0, 33.0, 1.0, 23.0, 0.0, 0.0, 0.0, 1.0, 24.0, 1.0, 1.0, 21.0, 3.0, 0.0, 0.0, 0.0, 23.0, 4.0, 25.0, 23.0, 1.0, 24.0, 1.0, 22.0, 2.0, 0.0, 0.0, 0.0, 1.0, 7.0, 37.0, 28.0, 37.0, 36.0, 1.0, 23.0, 3.0, 0.0, 17.0, 12.0]],
    "Name": "sCurve-0",
    "Overflow": 2523588.0,
    "Type": "Histo2d",
    "Underflow": 0.0,
    "x": {
        "AxisTitle": "Vcal",
        "Bins": 51,
        "High": 302.5,
        "Low": 47.5
    },
    "y": {
        "AxisTitle": "Occupancy",
        "Bins": 49,
        "High": 49.5,
        "Low": 0.5
    },
    "z": {
        "AxisTitle": "Number of pixels"
    }
}