time,Hardware,Voltage,Current
1625797843496,high-voltage-3,1,0.186845
time,Hardware,Voltage,Current
1625797843496,high-voltage-3,2,0.200639
time,Hardware,Voltage,Current
1625797843496,high-voltage-3,3,0.21433
time,Hardware,Voltage,Current
1625797843496,high-voltage-3,4,0.222949
time,Hardware,Voltage,Current
1625797843496,high-voltage-3,5,0.23216
time,Hardware,Voltage,Current
1625797843496,high-voltage-3,6,0.239247
time,Hardware,Voltage,Current
1625797843496,high-voltage-3,7,0.247673
time,Hardware,Voltage,Current
1625797843496,high-voltage-3,8,0.259049
time,Hardware,Voltage,Current
1625797843496,high-voltage-3,9,0.268577
time,Hardware,Voltage,Current
1625797843496,high-voltage-3,10,0.279164
time,Hardware,Voltage,Current
1625797843496,high-voltage-3,11,0.291165
time,Hardware,Voltage,Current
1625797843496,high-voltage-3,12,0.302486
time,Hardware,Voltage,Current
1625797843496,high-voltage-3,13,0.311049
time,Hardware,Voltage,Current
1625797843496,high-voltage-3,14,0.320829
time,Hardware,Voltage,Current
1625797843496,high-voltage-3,15,0.328937
time,Hardware,Voltage,Current
1625797843496,high-voltage-3,16,0.335674
time,Hardware,Voltage,Current
1625797843496,high-voltage-3,17,0.343432
time,Hardware,Voltage,Current
1625797843496,high-voltage-3,18,0.350478
time,Hardware,Voltage,Current
1625797843496,high-voltage-3,19,0.355053
time,Hardware,Voltage,Current
1625797843496,high-voltage-3,20,0.361103
time,Hardware,Voltage,Current
1625797843496,high-voltage-3,25,0.387907
time,Hardware,Voltage,Current
1625797843496,high-voltage-3,30,0.410282
time,Hardware,Voltage,Current
1625797843496,high-voltage-3,35,0.431177
time,Hardware,Voltage,Current
1625797843496,high-voltage-3,40,0.451797
time,Hardware,Voltage,Current
1625797843496,high-voltage-3,45,0.471429
time,Hardware,Voltage,Current
1625797843496,high-voltage-3,50,0.491911
time,Hardware,Voltage,Current
1625797843496,high-voltage-3,55,0.509857
time,Hardware,Voltage,Current
1625797843496,high-voltage-3,60,0.529193
time,Hardware,Voltage,Current
1625797843496,high-voltage-3,65,0.548873
time,Hardware,Voltage,Current
1625797843496,high-voltage-3,70,0.565218
time,Hardware,Voltage,Current
1625797843496,high-voltage-3,75,0.584121
time,Hardware,Voltage,Current
1625797843496,high-voltage-3,80,0.60193
time,Hardware,Voltage,Current
1625797843496,high-voltage-3,85,0.619244
time,Hardware,Voltage,Current
1625797843496,high-voltage-3,90,0.635703
time,Hardware,Voltage,Current
1625797843496,high-voltage-3,95,0.651954
time,Hardware,Voltage,Current
1625797843496,high-voltage-3,100,0.669937
