{
    "Data": [1205.0, 18361.0, 20110.0, 9804.0, 4303.0, 3101.0, 3436.0, 3770.0, 3740.0, 3110.0, 2468.0, 1673.0, 1143.0, 669.0, 466.0, 238.0, 123.0, 82.0, 30.0, 12.0, 17.0, 10.0, 14.0, 6.0, 18.0, 1.0, 1.0, 7.0, 2.0, 3.0, 4.0, 4.0, 2.0, 1.0, 6.0, 2.0, 2.0, 0.0, 0.0, 2.0, 4.0, 0.0, 0.0, 0.0, 1.0, 0.0, 0.0, 4.0, 1.0, 0.0, 0.0],
    "Name": "Chi2Dist-0",
    "Overflow": 0.0,
    "Type": "Histo1d",
    "Underflow": 0.0,
    "x": {
        "AxisTitle": "Fit Chi/ndf",
        "Bins": 51,
        "High": 2.5250000953674318,
        "Low": -0.02500000037252903
    },
    "y": {
        "AxisTitle": "Number of Pixels"
    },
    "z": {
        "AxisTitle": "z"
    }
}