{
    "Data": [0.0, 0.0, 0.0, 0.0, 9.0, 10.0, 26.0, 14.0, 13.0, 27.0, 14.0, 31.0, 39.0, 34.0, 28.0, 42.0, 55.0, 53.0, 59.0, 68.0, 81.0, 100.0, 122.0, 159.0, 176.0, 188.0, 260.0, 273.0, 336.0, 399.0, 418.0, 554.0, 610.0, 615.0, 787.0, 812.0, 921.0, 953.0, 1054.0, 1085.0, 1159.0, 1352.0, 1679.0, 2196.0, 2818.0, 3513.0, 3778.0, 4041.0, 3928.0, 3533.0, 3057.0, 2355.0, 1788.0, 1363.0, 1027.0, 769.0, 574.0, 470.0, 361.0, 260.0, 223.0, 150.0, 155.0, 123.0, 101.0, 89.0, 62.0, 49.0, 50.0, 34.0, 31.0, 36.0, 28.0, 25.0, 20.0, 23.0, 27.0, 23.0, 21.0, 18.0, 14.0, 8.0, 17.0, 7.0, 12.0, 14.0, 10.0, 11.0, 12.0, 12.0, 8.0],
    "Name": "ThresholdDist-0",
    "Overflow": 153.0,
    "Type": "Histo1d",
    "Underflow": 0.0,
    "x": {
        "AxisTitle": "Threshold [e]",
        "Bins": 91,
        "High": 1365.0,
        "Low": 455.0
    },
    "y": {
        "AxisTitle": "Number of Pixels"
    },
    "z": {
        "AxisTitle": "z"
    }
}