{
    "Data": [0.0, 0.0, 0.0, 0.0, 0.0, 0.0, 0.0, 0.0, 0.0, 0.0, 0.0, 0.0, 0.0, 0.0, 1.0, 0.0, 1.0, 0.0, 0.0, 0.0, 0.0, 1.0, 1.0, 2.0, 0.0, 1.0, 2.0, 4.0, 14.0, 9.0, 20.0, 25.0, 8.0, 7.0, 21.0, 34.0, 49.0, 127.0, 419.0, 454.0, 353.0, 498.0, 1149.0, 2909.0, 2244.0, 1517.0, 1754.0, 2939.0, 3913.0, 3159.0, 2372.0, 1972.0, 2626.0, 2299.0, 1844.0, 1507.0, 1487.0, 1713.0, 1585.0, 1299.0, 1082.0, 1067.0, 969.0, 670.0, 580.0, 588.0, 649.0, 488.0, 422.0, 365.0, 398.0, 366.0, 326.0, 288.0, 203.0, 260.0, 237.0, 196.0, 168.0, 138.0, 145.0, 120.0, 124.0, 86.0, 101.0, 118.0, 100.0, 79.0, 73.0, 69.0, 53.0, 51.0, 50.0, 43.0, 27.0, 53.0, 47.0, 46.0, 51.0, 28.0, 19.0, 29.0, 23.0, 26.0, 28.0, 23.0, 25.0, 24.0, 14.0, 21.0, 23.0, 17.0, 13.0, 11.0, 7.0, 13.0, 12.0, 16.0, 20.0, 7.0, 10.0, 6.0, 4.0, 4.0, 7.0, 5.0, 8.0, 9.0, 4.0, 8.0, 10.0, 8.0, 8.0, 5.0, 8.0, 9.0, 5.0, 6.0, 4.0, 4.0, 5.0, 4.0, 5.0, 6.0, 2.0, 6.0, 2.0, 4.0, 6.0, 1.0, 3.0, 4.0, 4.0, 1.0, 4.0, 0.0, 2.0, 7.0, 4.0, 2.0, 6.0, 4.0, 3.0, 3.0, 3.0, 6.0, 4.0, 2.0, 2.0, 2.0, 4.0, 3.0, 1.0, 3.0, 2.0, 2.0, 2.0, 4.0, 3.0, 0.0, 1.0, 3.0, 1.0, 2.0, 3.0, 1.0, 3.0, 3.0, 1.0, 1.0, 6.0, 10.0, 10.0, 6.0, 7.0, 10.0, 9.0, 4.0, 8.0, 9.0, 3.0],
    "Name": "TimePerFitDist-0",
    "Overflow": 407.0,
    "Type": "Histo1d",
    "Underflow": 0.0,
    "x": {
        "AxisTitle": "Fit Time [us]",
        "Bins": 201,
        "High": 401.0,
        "Low": -1.0
    },
    "y": {
        "AxisTitle": "Number of Pixels"
    },
    "z": {
        "AxisTitle": "z"
    }
}