{
    "Data": [4.0, 1.0, 0.0, 0.0, 0.0, 0.0, 9.0, 17.0, 47.0, 144.0, 451.0, 1027.0, 2096.0, 3332.0, 4419.0, 4562.0, 3934.0, 2760.0, 1831.0, 1434.0, 1505.0, 2111.0, 2897.0, 3405.0, 3703.0, 3404.0, 2925.0, 2081.0, 1371.0, 826.0, 502.0, 375.0, 295.0, 281.0, 276.0, 397.0, 455.0, 584.0, 693.0, 825.0, 980.0, 1098.0, 1158.0, 1283.0, 1272.0, 1313.0, 1112.0, 990.0, 996.0, 875.0, 741.0, 603.0, 532.0, 433.0, 391.0, 305.0, 297.0, 285.0, 251.0, 246.0, 230.0, 189.0, 206.0, 218.0, 193.0, 211.0, 237.0, 223.0, 217.0, 235.0, 215.0, 213.0, 214.0, 202.0, 185.0, 204.0, 167.0, 203.0, 196.0, 173.0, 142.0, 153.0, 131.0, 114.0, 106.0, 99.0, 93.0, 83.0, 71.0, 84.0, 58.0, 54.0, 57.0, 46.0, 44.0, 61.0, 34.0, 30.0, 39.0, 35.0, 31.0, 24.0, 29.0, 24.0, 38.0, 29.0, 25.0, 21.0, 28.0, 15.0, 17.0, 10.0, 20.0, 15.0, 16.0, 13.0, 14.0, 15.0, 9.0, 13.0, 11.0, 9.0, 7.0, 19.0, 12.0, 13.0],
    "Name": "NoiseDist-0",
    "Overflow": 190.0,
    "Type": "Histo1d",
    "Underflow": 0.0,
    "x": {
        "AxisTitle": "Noise [e]",
        "Bins": 126,
        "High": 631.0,
        "Low": -2.0
    },
    "y": {
        "AxisTitle": "Number of Pixels"
    },
    "z": {
        "AxisTitle": "z"
    }
}