time,Hardware,Voltage,Current
1626387025602,high-voltage-3,1,0.0528833
time,Hardware,Voltage,Current
1626387025602,high-voltage-3,2,0.0560511
time,Hardware,Voltage,Current
1626387025602,high-voltage-3,3,0.0589103
time,Hardware,Voltage,Current
1626387025602,high-voltage-3,4,0.0639925
time,Hardware,Voltage,Current
1626387025602,high-voltage-3,5,0.0659012
time,Hardware,Voltage,Current
1626387025602,high-voltage-3,6,0.0686027
time,Hardware,Voltage,Current
1626387025602,high-voltage-3,7,0.0704329
time,Hardware,Voltage,Current
1626387025602,high-voltage-3,8,0.0725897
time,Hardware,Voltage,Current
1626387025602,high-voltage-3,9,0.0735239
time,Hardware,Voltage,Current
1626387025602,high-voltage-3,10,0.0754581
time,Hardware,Voltage,Current
1626387025602,high-voltage-3,11,0.0782328
time,Hardware,Voltage,Current
1626387025602,high-voltage-3,12,0.0823693
time,Hardware,Voltage,Current
1626387025602,high-voltage-3,13,0.0835739
time,Hardware,Voltage,Current
1626387025602,high-voltage-3,14,0.0859776
time,Hardware,Voltage,Current
1626387025602,high-voltage-3,15,0.0891783
time,Hardware,Voltage,Current
1626387025602,high-voltage-3,16,0.0907288
time,Hardware,Voltage,Current
1626387025602,high-voltage-3,17,0.0931295
time,Hardware,Voltage,Current
1626387025602,high-voltage-3,18,0.0951779
time,Hardware,Voltage,Current
1626387025602,high-voltage-3,19,0.0969949
time,Hardware,Voltage,Current
1626387025602,high-voltage-3,20,0.0991605
time,Hardware,Voltage,Current
1626387025602,high-voltage-3,25,0.107637
time,Hardware,Voltage,Current
1626387025602,high-voltage-3,30,0.115742
time,Hardware,Voltage,Current
1626387025602,high-voltage-3,35,0.123112
time,Hardware,Voltage,Current
1626387025602,high-voltage-3,40,0.128924
time,Hardware,Voltage,Current
1626387025602,high-voltage-3,45,0.136397
time,Hardware,Voltage,Current
1626387025602,high-voltage-3,50,0.14121
time,Hardware,Voltage,Current
1626387025602,high-voltage-3,55,0.150101
time,Hardware,Voltage,Current
1626387025602,high-voltage-3,60,0.157777
time,Hardware,Voltage,Current
1626387025602,high-voltage-3,65,0.166618
time,Hardware,Voltage,Current
1626387025602,high-voltage-3,70,0.176853
time,Hardware,Voltage,Current
1626387025602,high-voltage-3,75,0.18848
time,Hardware,Voltage,Current
1626387025602,high-voltage-3,80,0.200093
time,Hardware,Voltage,Current
1626387025602,high-voltage-3,85,0.210353
time,Hardware,Voltage,Current
1626387025602,high-voltage-3,90,0.21703
time,Hardware,Voltage,Current
1626387025602,high-voltage-3,95,0.225481
time,Hardware,Voltage,Current
1626387025602,high-voltage-3,100,0.23461
