time,Hardware,Voltage,Current
1623354518164,high-voltage,1,0.0651603
time,Hardware,Voltage,Current
1623354518164,high-voltage,2,0.078949
time,Hardware,Voltage,Current
1623354518164,high-voltage,3,0.0917944
time,Hardware,Voltage,Current
1623354518164,high-voltage,4,0.102599
time,Hardware,Voltage,Current
1623354518164,high-voltage,5,0.11336
time,Hardware,Voltage,Current
1623354518164,high-voltage,6,0.122351
time,Hardware,Voltage,Current
1623354518164,high-voltage,7,0.132727
time,Hardware,Voltage,Current
1623354518164,high-voltage,8,0.141762
time,Hardware,Voltage,Current
1623354518164,high-voltage,9,0.152385
time,Hardware,Voltage,Current
1623354518164,high-voltage,10,0.1613
time,Hardware,Voltage,Current
1623354518164,high-voltage,11,0.171104
time,Hardware,Voltage,Current
1623354518164,high-voltage,12,0.180776
time,Hardware,Voltage,Current
1623354518164,high-voltage,13,0.188401
time,Hardware,Voltage,Current
1623354518164,high-voltage,14,0.196128
time,Hardware,Voltage,Current
1623354518164,high-voltage,15,0.202761
time,Hardware,Voltage,Current
1623354518164,high-voltage,16,0.208379
time,Hardware,Voltage,Current
1623354518164,high-voltage,17,0.213593
time,Hardware,Voltage,Current
1623354518164,high-voltage,18,0.219598
time,Hardware,Voltage,Current
1623354518164,high-voltage,19,0.222829
time,Hardware,Voltage,Current
1623354518164,high-voltage,20,0.2287
time,Hardware,Voltage,Current
1623354518164,high-voltage,25,0.252824
time,Hardware,Voltage,Current
1623354518164,high-voltage,30,0.284763
time,Hardware,Voltage,Current
1623354518164,high-voltage,35,0.375741
time,Hardware,Voltage,Current
1623354518164,high-voltage,6.55196e-07,0.655665
time,Hardware,Voltage,Current
1623354518164,high-voltage,45,1.16632
time,Hardware,Voltage,Current
1623354518164,high-voltage,50,1.84497
time,Hardware,Voltage,Current
1623354518164,high-voltage,55,2.67137
time,Hardware,Voltage,Current
1623354518164,high-voltage,3.63882e-06,3.6407
time,Hardware,Voltage,Current
1623354518164,high-voltage,65,4.75244
time,Hardware,Voltage,Current
1623354518164,high-voltage,70,6.01835
time,Hardware,Voltage,Current
1623354518164,high-voltage,75,7.45157
time,Hardware,Voltage,Current
1623354518164,high-voltage,80,9.04216
time,Hardware,Voltage,Current
1623354518164,high-voltage,85,10
