{
    "Data": [[2688.0, 944.0, 455.0, 274.0, 178.0, 138.0, 110.0, 89.0, 48.0, 60.0, 51.0, 33.0, 31.0, 32.0, 23.0, 14.0, 15.0, 8.0, 12.0, 12.0, 7.0, 15.0, 9.0, 10.0, 12.0, 5.0, 13.0, 9.0, 10.0, 9.0, 3.0, 8.0, 9.0, 8.0, 4.0, 9.0, 6.0, 8.0, 6.0, 10.0, 5.0, 8.0, 6.0, 5.0, 9.0, 9.0, 12.0, 10.0, 29.0], [3835.0, 1522.0, 815.0, 504.0, 353.0, 269.0, 196.0, 134.0, 100.0, 83.0, 85.0, 57.0, 53.0, 42.0, 34.0, 33.0, 27.0, 20.0, 23.0, 19.0, 19.0, 18.0, 14.0, 13.0, 18.0, 15.0, 10.0, 8.0, 13.0, 14.0, 12.0, 6.0, 16.0, 4.0, 10.0, 8.0, 7.0, 12.0, 9.0, 6.0, 8.0, 7.0, 11.0, 6.0, 11.0, 16.0, 13.0, 16.0, 15.0], [4933.0, 2348.0, 1404.0, 922.0, 623.0, 448.0, 370.0, 273.0, 214.0, 162.0, 131.0, 127.0, 101.0, 81.0, 79.0, 63.0, 49.0, 33.0, 55.0, 39.0, 38.0, 38.0, 31.0, 25.0, 17.0, 22.0, 19.0, 17.0, 17.0, 10.0, 15.0, 9.0, 15.0, 11.0, 14.0, 9.0, 18.0, 16.0, 13.0, 17.0, 13.0, 10.0, 14.0, 11.0, 12.0, 17.0, 15.0, 17.0, 26.0], [5336.0, 3061.0, 1978.0, 1462.0, 1089.0, 835.0, 661.0, 557.0, 482.0, 352.0, 278.0, 264.0, 207.0, 195.0, 139.0, 118.0, 122.0, 106.0, 99.0, 80.0, 60.0, 68.0, 53.0, 51.0, 46.0, 39.0, 40.0, 38.0, 24.0, 40.0, 36.0, 24.0, 31.0, 27.0, 20.0, 16.0, 17.0, 16.0, 21.0, 16.0, 22.0, 20.0, 22.0, 15.0, 15.0, 22.0, 28.0, 26.0, 32.0], [5861.0, 3207.0, 2302.0, 1746.0, 1517.0, 1294.0, 1115.0, 851.0, 766.0, 669.0, 622.0, 490.0, 423.0, 391.0, 361.0, 318.0, 273.0, 230.0, 209.0, 159.0, 174.0, 134.0, 145.0, 103.0, 122.0, 112.0, 82.0, 82.0, 76.0, 85.0, 72.0, 55.0, 35.0, 56.0, 44.0, 50.0, 37.0, 32.0, 32.0, 23.0, 38.0, 37.0, 30.0, 32.0, 32.0, 33.0, 32.0, 32.0, 45.0], [7909.0, 4129.0, 2685.0, 2059.0, 1668.0, 1504.0, 1247.0, 1168.0, 1051.0, 862.0, 897.0, 769.0, 697.0, 670.0, 566.0, 543.0, 523.0, 491.0, 427.0, 404.0, 352.0, 334.0, 313.0, 275.0, 271.0, 213.0, 228.0, 234.0, 175.0, 172.0, 152.0, 129.0, 129.0, 109.0, 115.0, 116.0, 78.0, 78.0, 89.0, 53.0, 72.0, 47.0, 67.0, 53.0, 68.0, 51.0, 63.0, 65.0, 65.0], [6006.0, 5095.0, 4214.0, 3447.0, 2779.0, 2279.0, 1867.0, 1635.0, 1373.0, 1315.0, 1075.0, 982.0, 943.0, 915.0, 857.0, 763.0, 746.0, 692.0, 617.0, 642.0, 621.0, 512.0, 519.0, 472.0, 529.0, 473.0, 410.0, 419.0, 386.0, 340.0, 339.0, 319.0, 299.0, 304.0, 290.0, 258.0, 211.0, 195.0, 215.0, 169.0, 167.0, 184.0, 144.0, 134.0, 134.0, 118.0, 113.0, 117.0, 144.0], [1395.0, 1565.0, 1774.0, 2096.0, 2312.0, 2335.0, 2306.0, 2232.0, 2259.0, 2226.0, 2049.0, 1942.0, 1777.0, 1661.0, 1510.0, 1429.0, 1333.0, 1233.0, 1153.0, 1048.0, 960.0, 889.0, 840.0, 820.0, 774.0, 744.0, 697.0, 640.0, 612.0, 613.0, 600.0, 584.0, 520.0, 501.0, 525.0, 490.0, 464.0, 440.0, 443.0, 415.0, 401.0, 362.0, 338.0, 369.0, 323.0, 300.0, 286.0, 264.0, 261.0], [580.0, 344.0, 322.0, 328.0, 423.0, 480.0, 569.0, 694.0, 787.0, 873.0, 973.0, 1112.0, 1226.0, 1229.0, 1393.0, 1454.0, 1532.0, 1512.0, 1578.0, 1624.0, 1645.0, 1672.0, 1591.0, 1663.0, 1575.0, 1626.0, 1448.0, 1479.0, 1425.0, 1376.0, 1283.0, 1290.0, 1143.0, 1134.0, 1029.0, 983.0, 902.0, 895.0, 854.0, 820.0, 773.0, 757.0, 713.0, 702.0, 697.0, 689.0, 677.0, 660.0, 636.0], [466.0, 202.0, 170.0, 116.0, 125.0, 144.0, 141.0, 128.0, 167.0, 171.0, 181.0, 254.0, 261.0, 287.0, 348.0, 402.0, 419.0, 458.0, 492.0, 573.0, 643.0, 740.0, 795.0, 907.0, 957.0, 1048.0, 1196.0, 1279.0, 1276.0, 1406.0, 1532.0, 1574.0, 1705.0, 1717.0, 1767.0, 1916.0, 1939.0, 2053.0, 2017.0, 2021.0, 2003.0, 1944.0, 1907.0, 1841.0, 1818.0, 1725.0, 1713.0, 1549.0, 1569.0], [435.0, 174.0, 117.0, 85.0, 82.0, 70.0, 67.0, 65.0, 75.0, 74.0, 82.0, 78.0, 86.0, 107.0, 114.0, 92.0, 133.0, 141.0, 176.0, 167.0, 183.0, 202.0, 264.0, 275.0, 283.0, 338.0, 372.0, 391.0, 423.0, 481.0, 579.0, 596.0, 681.0, 748.0, 907.0, 965.0, 1109.0, 1363.0, 1436.0, 1735.0, 2008.0, 2256.0, 2455.0, 2848.0, 3276.0, 3804.0, 4270.0, 4557.0, 5022.0], [438.0, 191.0, 106.0, 84.0, 56.0, 52.0, 45.0, 37.0, 47.0, 37.0, 37.0, 39.0, 34.0, 46.0, 49.0, 48.0, 60.0, 49.0, 48.0, 71.0, 75.0, 92.0, 94.0, 113.0, 111.0, 131.0, 128.0, 168.0, 157.0, 211.0, 227.0, 248.0, 292.0, 309.0, 363.0, 398.0, 498.0, 535.0, 639.0, 721.0, 856.0, 1033.0, 1275.0, 1606.0, 2074.0, 2830.0, 3851.0, 5604.0, 9093.0], [402.0, 186.0, 109.0, 75.0, 62.0, 43.0, 34.0, 40.0, 26.0, 33.0, 17.0, 28.0, 31.0, 22.0, 31.0, 24.0, 22.0, 26.0, 30.0, 27.0, 34.0, 35.0, 46.0, 55.0, 49.0, 64.0, 55.0, 84.0, 88.0, 100.0, 99.0, 115.0, 115.0, 125.0, 166.0, 197.0, 196.0, 254.0, 301.0, 367.0, 396.0, 543.0, 650.0, 824.0, 1040.0, 1430.0, 2111.0, 3504.0, 7700.0], [395.0, 186.0, 89.0, 54.0, 48.0, 49.0, 42.0, 34.0, 26.0, 30.0, 20.0, 13.0, 18.0, 27.0, 15.0, 21.0, 19.0, 16.0, 17.0, 16.0, 16.0, 31.0, 14.0, 23.0, 29.0, 35.0, 36.0, 28.0, 35.0, 26.0, 50.0, 57.0, 58.0, 79.0, 88.0, 101.0, 116.0, 139.0, 156.0, 173.0, 193.0, 265.0, 307.0, 446.0, 586.0, 835.0, 1262.0, 2145.0, 4997.0], [409.0, 152.0, 94.0, 57.0, 41.0, 33.0, 30.0, 33.0, 28.0, 22.0, 17.0, 18.0, 24.0, 11.0, 14.0, 19.0, 12.0, 16.0, 11.0, 13.0, 12.0, 11.0, 16.0, 17.0, 16.0, 16.0, 18.0, 13.0, 28.0, 25.0, 33.0, 22.0, 27.0, 42.0, 42.0, 39.0, 74.0, 60.0, 79.0, 63.0, 99.0, 136.0, 158.0, 259.0, 327.0, 422.0, 707.0, 1255.0, 3113.0], [405.0, 148.0, 89.0, 57.0, 44.0, 30.0, 30.0, 20.0, 20.0, 22.0, 14.0, 20.0, 11.0, 19.0, 13.0, 16.0, 9.0, 11.0, 13.0, 8.0, 11.0, 12.0, 13.0, 11.0, 11.0, 6.0, 16.0, 19.0, 17.0, 16.0, 16.0, 18.0, 24.0, 19.0, 21.0, 33.0, 34.0, 34.0, 49.0, 38.0, 71.0, 69.0, 99.0, 130.0, 184.0, 238.0, 377.0, 712.0, 2045.0], [371.0, 136.0, 80.0, 58.0, 54.0, 30.0, 30.0, 31.0, 25.0, 15.0, 9.0, 12.0, 19.0, 14.0, 8.0, 16.0, 16.0, 11.0, 6.0, 11.0, 9.0, 10.0, 6.0, 9.0, 10.0, 8.0, 8.0, 6.0, 9.0, 7.0, 11.0, 14.0, 14.0, 17.0, 25.0, 16.0, 23.0, 24.0, 34.0, 40.0, 33.0, 52.0, 59.0, 72.0, 88.0, 139.0, 216.0, 438.0, 1275.0], [361.0, 141.0, 85.0, 42.0, 47.0, 41.0, 23.0, 12.0, 19.0, 17.0, 13.0, 16.0, 14.0, 16.0, 14.0, 9.0, 8.0, 11.0, 10.0, 13.0, 11.0, 11.0, 7.0, 11.0, 6.0, 7.0, 3.0, 14.0, 10.0, 7.0, 10.0, 6.0, 7.0, 7.0, 14.0, 18.0, 18.0, 15.0, 22.0, 25.0, 26.0, 31.0, 41.0, 44.0, 60.0, 82.0, 130.0, 242.0, 773.0], [387.0, 148.0, 74.0, 39.0, 47.0, 30.0, 30.0, 25.0, 22.0, 24.0, 14.0, 14.0, 16.0, 9.0, 11.0, 11.0, 5.0, 7.0, 2.0, 7.0, 8.0, 7.0, 7.0, 10.0, 7.0, 8.0, 4.0, 9.0, 5.0, 12.0, 3.0, 5.0, 4.0, 6.0, 4.0, 10.0, 16.0, 15.0, 17.0, 18.0, 16.0, 15.0, 32.0, 34.0, 40.0, 59.0, 88.0, 146.0, 489.0], [378.0, 147.0, 86.0, 58.0, 53.0, 32.0, 27.0, 16.0, 19.0, 22.0, 13.0, 19.0, 8.0, 11.0, 9.0, 9.0, 5.0, 3.0, 7.0, 9.0, 6.0, 5.0, 1.0, 6.0, 4.0, 1.0, 9.0, 3.0, 8.0, 6.0, 11.0, 10.0, 2.0, 7.0, 6.0, 5.0, 8.0, 5.0, 14.0, 10.0, 19.0, 18.0, 27.0, 27.0, 36.0, 41.0, 55.0, 115.0, 282.0], [414.0, 134.0, 92.0, 39.0, 33.0, 39.0, 18.0, 21.0, 19.0, 19.0, 17.0, 16.0, 10.0, 8.0, 10.0, 5.0, 5.0, 8.0, 9.0, 2.0, 5.0, 4.0, 4.0, 8.0, 7.0, 0.0, 7.0, 7.0, 2.0, 4.0, 3.0, 8.0, 6.0, 6.0, 5.0, 8.0, 8.0, 6.0, 7.0, 5.0, 10.0, 13.0, 15.0, 18.0, 28.0, 32.0, 59.0, 82.0, 215.0], [404.0, 143.0, 77.0, 46.0, 34.0, 27.0, 24.0, 26.0, 17.0, 17.0, 19.0, 18.0, 6.0, 9.0, 6.0, 9.0, 7.0, 3.0, 7.0, 6.0, 3.0, 2.0, 4.0, 8.0, 8.0, 2.0, 2.0, 4.0, 2.0, 5.0, 2.0, 6.0, 4.0, 5.0, 6.0, 6.0, 5.0, 8.0, 5.0, 9.0, 7.0, 7.0, 14.0, 17.0, 16.0, 18.0, 45.0, 51.0, 169.0], [404.0, 117.0, 80.0, 56.0, 43.0, 32.0, 22.0, 23.0, 20.0, 12.0, 21.0, 10.0, 10.0, 6.0, 12.0, 5.0, 4.0, 7.0, 7.0, 3.0, 8.0, 4.0, 2.0, 3.0, 3.0, 2.0, 1.0, 3.0, 3.0, 3.0, 2.0, 1.0, 5.0, 7.0, 6.0, 5.0, 8.0, 8.0, 8.0, 4.0, 7.0, 5.0, 9.0, 8.0, 14.0, 16.0, 36.0, 52.0, 119.0], [402.0, 137.0, 69.0, 47.0, 35.0, 32.0, 22.0, 22.0, 17.0, 16.0, 16.0, 11.0, 12.0, 10.0, 15.0, 5.0, 4.0, 6.0, 2.0, 2.0, 2.0, 5.0, 2.0, 4.0, 5.0, 4.0, 2.0, 2.0, 1.0, 7.0, 1.0, 4.0, 5.0, 2.0, 4.0, 4.0, 7.0, 4.0, 3.0, 1.0, 10.0, 4.0, 7.0, 8.0, 8.0, 14.0, 25.0, 45.0, 106.0], [386.0, 135.0, 81.0, 56.0, 38.0, 23.0, 25.0, 19.0, 17.0, 17.0, 16.0, 10.0, 8.0, 7.0, 5.0, 8.0, 4.0, 6.0, 3.0, 4.0, 7.0, 4.0, 5.0, 2.0, 3.0, 9.0, 3.0, 6.0, 1.0, 2.0, 2.0, 4.0, 3.0, 3.0, 4.0, 4.0, 2.0, 0.0, 3.0, 5.0, 0.0, 5.0, 7.0, 7.0, 10.0, 10.0, 21.0, 20.0, 69.0], [353.0, 149.0, 79.0, 53.0, 36.0, 28.0, 17.0, 21.0, 23.0, 14.0, 8.0, 23.0, 8.0, 8.0, 10.0, 6.0, 7.0, 3.0, 4.0, 3.0, 5.0, 1.0, 2.0, 2.0, 2.0, 2.0, 1.0, 3.0, 1.0, 3.0, 6.0, 4.0, 1.0, 2.0, 3.0, 1.0, 4.0, 3.0, 3.0, 2.0, 7.0, 2.0, 6.0, 5.0, 6.0, 8.0, 10.0, 23.0, 63.0], [403.0, 130.0, 82.0, 63.0, 39.0, 19.0, 25.0, 18.0, 15.0, 14.0, 12.0, 12.0, 20.0, 5.0, 9.0, 6.0, 5.0, 6.0, 6.0, 6.0, 3.0, 4.0, 1.0, 1.0, 2.0, 1.0, 6.0, 5.0, 2.0, 2.0, 2.0, 2.0, 1.0, 1.0, 1.0, 1.0, 3.0, 1.0, 4.0, 3.0, 6.0, 3.0, 2.0, 3.0, 1.0, 6.0, 12.0, 22.0, 56.0], [372.0, 171.0, 78.0, 51.0, 38.0, 28.0, 31.0, 23.0, 10.0, 10.0, 19.0, 10.0, 9.0, 5.0, 3.0, 5.0, 4.0, 5.0, 10.0, 5.0, 2.0, 4.0, 4.0, 1.0, 0.0, 0.0, 2.0, 5.0, 2.0, 3.0, 2.0, 1.0, 2.0, 1.0, 3.0, 2.0, 2.0, 0.0, 6.0, 1.0, 3.0, 3.0, 6.0, 3.0, 5.0, 7.0, 6.0, 14.0, 40.0], [402.0, 141.0, 79.0, 54.0, 47.0, 30.0, 19.0, 18.0, 18.0, 11.0, 10.0, 10.0, 5.0, 7.0, 4.0, 11.0, 5.0, 6.0, 3.0, 4.0, 7.0, 3.0, 6.0, 5.0, 6.0, 0.0, 2.0, 1.0, 6.0, 2.0, 0.0, 2.0, 2.0, 2.0, 2.0, 0.0, 0.0, 3.0, 1.0, 6.0, 1.0, 5.0, 1.0, 2.0, 4.0, 3.0, 5.0, 9.0, 26.0], [396.0, 143.0, 73.0, 45.0, 33.0, 35.0, 23.0, 22.0, 18.0, 15.0, 10.0, 11.0, 8.0, 10.0, 10.0, 4.0, 5.0, 3.0, 2.0, 4.0, 3.0, 8.0, 3.0, 4.0, 2.0, 2.0, 2.0, 2.0, 4.0, 2.0, 3.0, 0.0, 2.0, 1.0, 4.0, 1.0, 0.0, 3.0, 3.0, 2.0, 3.0, 1.0, 2.0, 3.0, 5.0, 2.0, 1.0, 4.0, 32.0], [410.0, 123.0, 92.0, 56.0, 50.0, 15.0, 24.0, 19.0, 10.0, 9.0, 12.0, 14.0, 10.0, 8.0, 8.0, 9.0, 7.0, 0.0, 5.0, 4.0, 2.0, 5.0, 1.0, 3.0, 3.0, 5.0, 1.0, 2.0, 1.0, 2.0, 0.0, 1.0, 3.0, 2.0, 1.0, 3.0, 0.0, 0.0, 5.0, 4.0, 4.0, 1.0, 5.0, 3.0, 9.0, 5.0, 4.0, 5.0, 18.0], [379.0, 142.0, 73.0, 45.0, 51.0, 32.0, 23.0, 15.0, 14.0, 17.0, 12.0, 7.0, 11.0, 10.0, 6.0, 6.0, 1.0, 8.0, 3.0, 6.0, 3.0, 1.0, 1.0, 5.0, 3.0, 2.0, 3.0, 3.0, 2.0, 2.0, 1.0, 4.0, 3.0, 0.0, 0.0, 4.0, 2.0, 2.0, 0.0, 2.0, 0.0, 1.0, 1.0, 3.0, 5.0, 2.0, 3.0, 7.0, 18.0], [428.0, 140.0, 79.0, 51.0, 27.0, 33.0, 22.0, 18.0, 12.0, 10.0, 16.0, 13.0, 8.0, 14.0, 4.0, 7.0, 4.0, 6.0, 4.0, 7.0, 4.0, 0.0, 2.0, 4.0, 8.0, 3.0, 4.0, 2.0, 0.0, 2.0, 0.0, 1.0, 0.0, 1.0, 0.0, 1.0, 0.0, 2.0, 3.0, 1.0, 1.0, 3.0, 3.0, 2.0, 0.0, 1.0, 4.0, 7.0, 11.0], [380.0, 122.0, 80.0, 48.0, 39.0, 46.0, 24.0, 24.0, 17.0, 12.0, 9.0, 14.0, 9.0, 4.0, 7.0, 7.0, 7.0, 6.0, 4.0, 1.0, 2.0, 5.0, 1.0, 3.0, 4.0, 1.0, 4.0, 2.0, 2.0, 5.0, 2.0, 0.0, 2.0, 2.0, 2.0, 1.0, 2.0, 2.0, 0.0, 0.0, 0.0, 1.0, 3.0, 3.0, 1.0, 5.0, 5.0, 4.0, 11.0], [393.0, 148.0, 72.0, 68.0, 31.0, 25.0, 31.0, 15.0, 18.0, 14.0, 9.0, 12.0, 4.0, 12.0, 11.0, 10.0, 4.0, 8.0, 4.0, 1.0, 4.0, 5.0, 3.0, 2.0, 1.0, 6.0, 4.0, 0.0, 2.0, 2.0, 2.0, 2.0, 1.0, 3.0, 0.0, 2.0, 0.0, 0.0, 2.0, 2.0, 1.0, 2.0, 1.0, 2.0, 2.0, 4.0, 1.0, 4.0, 12.0], [357.0, 135.0, 85.0, 52.0, 42.0, 29.0, 23.0, 19.0, 17.0, 9.0, 11.0, 12.0, 10.0, 9.0, 4.0, 14.0, 1.0, 4.0, 8.0, 5.0, 2.0, 4.0, 0.0, 1.0, 6.0, 3.0, 0.0, 2.0, 1.0, 2.0, 4.0, 1.0, 1.0, 2.0, 4.0, 4.0, 4.0, 3.0, 1.0, 0.0, 1.0, 2.0, 2.0, 1.0, 1.0, 2.0, 3.0, 1.0, 13.0], [396.0, 149.0, 79.0, 57.0, 47.0, 17.0, 25.0, 22.0, 12.0, 16.0, 8.0, 8.0, 15.0, 8.0, 3.0, 7.0, 6.0, 7.0, 4.0, 6.0, 5.0, 2.0, 5.0, 4.0, 3.0, 3.0, 0.0, 1.0, 0.0, 2.0, 3.0, 3.0, 0.0, 2.0, 2.0, 2.0, 2.0, 2.0, 3.0, 1.0, 3.0, 0.0, 0.0, 4.0, 2.0, 6.0, 1.0, 3.0, 12.0], [399.0, 154.0, 73.0, 52.0, 41.0, 25.0, 25.0, 18.0, 10.0, 9.0, 18.0, 9.0, 9.0, 11.0, 5.0, 5.0, 6.0, 6.0, 9.0, 4.0, 4.0, 4.0, 3.0, 5.0, 5.0, 4.0, 2.0, 3.0, 1.0, 1.0, 3.0, 1.0, 5.0, 1.0, 1.0, 4.0, 2.0, 1.0, 0.0, 1.0, 1.0, 3.0, 3.0, 1.0, 4.0, 2.0, 2.0, 2.0, 10.0], [401.0, 144.0, 86.0, 40.0, 43.0, 32.0, 27.0, 20.0, 19.0, 12.0, 8.0, 15.0, 15.0, 3.0, 6.0, 6.0, 8.0, 7.0, 9.0, 2.0, 4.0, 1.0, 4.0, 4.0, 2.0, 0.0, 5.0, 4.0, 0.0, 3.0, 2.0, 1.0, 2.0, 2.0, 1.0, 5.0, 3.0, 2.0, 1.0, 3.0, 2.0, 2.0, 1.0, 2.0, 3.0, 3.0, 2.0, 2.0, 7.0], [392.0, 147.0, 65.0, 52.0, 44.0, 29.0, 26.0, 18.0, 10.0, 8.0, 10.0, 11.0, 12.0, 14.0, 5.0, 7.0, 7.0, 7.0, 4.0, 4.0, 3.0, 0.0, 5.0, 3.0, 5.0, 2.0, 4.0, 1.0, 2.0, 3.0, 2.0, 1.0, 1.0, 1.0, 2.0, 0.0, 4.0, 2.0, 1.0, 5.0, 2.0, 1.0, 1.0, 5.0, 1.0, 2.0, 2.0, 3.0, 8.0], [415.0, 129.0, 67.0, 48.0, 40.0, 25.0, 24.0, 22.0, 18.0, 12.0, 13.0, 11.0, 12.0, 10.0, 7.0, 10.0, 6.0, 5.0, 3.0, 2.0, 2.0, 4.0, 5.0, 0.0, 2.0, 3.0, 1.0, 4.0, 1.0, 2.0, 1.0, 1.0, 4.0, 2.0, 2.0, 2.0, 4.0, 4.0, 2.0, 2.0, 1.0, 4.0, 2.0, 1.0, 1.0, 3.0, 1.0, 2.0, 14.0], [427.0, 132.0, 70.0, 54.0, 36.0, 30.0, 25.0, 18.0, 28.0, 10.0, 13.0, 8.0, 10.0, 6.0, 11.0, 3.0, 8.0, 3.0, 3.0, 3.0, 1.0, 8.0, 0.0, 3.0, 6.0, 0.0, 2.0, 4.0, 0.0, 3.0, 2.0, 2.0, 3.0, 1.0, 2.0, 2.0, 2.0, 1.0, 3.0, 3.0, 2.0, 0.0, 2.0, 2.0, 2.0, 4.0, 1.0, 4.0, 17.0], [429.0, 137.0, 72.0, 48.0, 37.0, 28.0, 22.0, 22.0, 28.0, 19.0, 12.0, 7.0, 6.0, 14.0, 9.0, 2.0, 6.0, 5.0, 3.0, 4.0, 2.0, 3.0, 2.0, 5.0, 1.0, 3.0, 1.0, 2.0, 0.0, 5.0, 1.0, 2.0, 3.0, 0.0, 1.0, 2.0, 2.0, 1.0, 1.0, 2.0, 2.0, 1.0, 4.0, 4.0, 3.0, 3.0, 2.0, 6.0, 12.0], [421.0, 120.0, 69.0, 55.0, 42.0, 32.0, 26.0, 17.0, 19.0, 9.0, 14.0, 9.0, 9.0, 7.0, 5.0, 6.0, 4.0, 3.0, 6.0, 8.0, 4.0, 1.0, 6.0, 4.0, 3.0, 3.0, 1.0, 2.0, 0.0, 3.0, 0.0, 5.0, 1.0, 1.0, 0.0, 2.0, 4.0, 2.0, 4.0, 2.0, 1.0, 1.0, 2.0, 2.0, 0.0, 4.0, 3.0, 4.0, 13.0], [420.0, 154.0, 69.0, 55.0, 25.0, 35.0, 22.0, 24.0, 20.0, 16.0, 11.0, 8.0, 7.0, 5.0, 11.0, 6.0, 7.0, 8.0, 7.0, 3.0, 5.0, 2.0, 0.0, 3.0, 5.0, 3.0, 0.0, 0.0, 3.0, 1.0, 1.0, 1.0, 0.0, 3.0, 3.0, 0.0, 2.0, 6.0, 1.0, 3.0, 2.0, 2.0, 1.0, 1.0, 4.0, 1.0, 4.0, 5.0, 11.0], [406.0, 140.0, 81.0, 50.0, 29.0, 36.0, 24.0, 16.0, 19.0, 16.0, 17.0, 7.0, 11.0, 7.0, 6.0, 6.0, 6.0, 8.0, 4.0, 2.0, 2.0, 3.0, 0.0, 6.0, 3.0, 4.0, 0.0, 2.0, 2.0, 0.0, 3.0, 3.0, 3.0, 2.0, 0.0, 1.0, 1.0, 2.0, 1.0, 1.0, 2.0, 4.0, 3.0, 2.0, 0.0, 4.0, 2.0, 5.0, 16.0], [425.0, 141.0, 83.0, 69.0, 46.0, 24.0, 21.0, 13.0, 17.0, 12.0, 10.0, 15.0, 5.0, 10.0, 10.0, 12.0, 4.0, 2.0, 2.0, 3.0, 1.0, 3.0, 10.0, 1.0, 5.0, 1.0, 1.0, 1.0, 3.0, 1.0, 3.0, 2.0, 2.0, 1.0, 3.0, 3.0, 4.0, 1.0, 3.0, 0.0, 4.0, 4.0, 3.0, 3.0, 2.0, 1.0, 3.0, 0.0, 13.0], [376.0, 142.0, 76.0, 50.0, 39.0, 36.0, 24.0, 23.0, 14.0, 17.0, 14.0, 11.0, 7.0, 5.0, 7.0, 11.0, 5.0, 3.0, 3.0, 2.0, 5.0, 1.0, 2.0, 4.0, 5.0, 0.0, 4.0, 2.0, 1.0, 5.0, 3.0, 3.0, 1.0, 1.0, 2.0, 4.0, 3.0, 1.0, 3.0, 4.0, 1.0, 2.0, 0.0, 1.0, 4.0, 0.0, 3.0, 7.0, 15.0], [389.0, 151.0, 82.0, 64.0, 38.0, 34.0, 26.0, 11.0, 18.0, 7.0, 13.0, 9.0, 7.0, 6.0, 11.0, 9.0, 4.0, 5.0, 5.0, 4.0, 3.0, 6.0, 2.0, 3.0, 1.0, 2.0, 5.0, 4.0, 3.0, 4.0, 1.0, 2.0, 0.0, 2.0, 2.0, 4.0, 1.0, 2.0, 3.0, 2.0, 4.0, 5.0, 4.0, 1.0, 1.0, 1.0, 5.0, 3.0, 19.0], [426.0, 140.0, 64.0, 44.0, 41.0, 35.0, 19.0, 19.0, 19.0, 14.0, 12.0, 6.0, 9.0, 7.0, 12.0, 4.0, 7.0, 8.0, 4.0, 6.0, 2.0, 5.0, 1.0, 1.0, 3.0, 3.0, 5.0, 1.0, 2.0, 1.0, 1.0, 3.0, 3.0, 3.0, 3.0, 2.0, 2.0, 3.0, 1.0, 1.0, 3.0, 1.0, 3.0, 4.0, 4.0, 2.0, 5.0, 4.0, 13.0], [422.0, 141.0, 90.0, 57.0, 32.0, 28.0, 25.0, 15.0, 21.0, 16.0, 12.0, 3.0, 12.0, 8.0, 7.0, 5.0, 10.0, 4.0, 2.0, 7.0, 5.0, 0.0, 4.0, 2.0, 2.0, 1.0, 4.0, 5.0, 2.0, 2.0, 4.0, 0.0, 0.0, 1.0, 2.0, 2.0, 2.0, 2.0, 1.0, 2.0, 4.0, 3.0, 6.0, 3.0, 3.0, 3.0, 0.0, 5.0, 13.0]],
    "Name": "sCurve-0",
    "Overflow": 2001633.0,
    "Type": "Histo2d",
    "Underflow": 0.0,
    "x": {
        "AxisTitle": "Vcal",
        "Bins": 51,
        "High": 302.5,
        "Low": 47.5
    },
    "y": {
        "AxisTitle": "Occupancy",
        "Bins": 49,
        "High": 49.5,
        "Low": 0.5
    },
    "z": {
        "AxisTitle": "Number of pixels"
    }
}