time,Hardware,Voltage,Current
1626387817058,high-voltage-3,1,0.0503065
time,Hardware,Voltage,Current
1626387817058,high-voltage-3,2,0.0547642
time,Hardware,Voltage,Current
1626387817058,high-voltage-3,3,0.0568939
time,Hardware,Voltage,Current
1626387817058,high-voltage-3,4,0.0604358
time,Hardware,Voltage,Current
1626387817058,high-voltage-3,5,0.0623688
time,Hardware,Voltage,Current
1626387817058,high-voltage-3,6,0.0659194
time,Hardware,Voltage,Current
1626387817058,high-voltage-3,7,0.0676157
time,Hardware,Voltage,Current
1626387817058,high-voltage-3,8,0.0700904
time,Hardware,Voltage,Current
1626387817058,high-voltage-3,9,0.0720609
time,Hardware,Voltage,Current
1626387817058,high-voltage-3,10,0.0743429
time,Hardware,Voltage,Current
1626387817058,high-voltage-3,11,0.0761258
time,Hardware,Voltage,Current
1626387817058,high-voltage-3,12,0.0797593
time,Hardware,Voltage,Current
1626387817058,high-voltage-3,13,0.0814781
time,Hardware,Voltage,Current
1626387817058,high-voltage-3,14,0.0834428
time,Hardware,Voltage,Current
1626387817058,high-voltage-3,15,0.0868366
time,Hardware,Voltage,Current
1626387817058,high-voltage-3,16,0.0877788
time,Hardware,Voltage,Current
1626387817058,high-voltage-3,17,0.0901987
time,Hardware,Voltage,Current
1626387817058,high-voltage-3,18,0.0917145
time,Hardware,Voltage,Current
1626387817058,high-voltage-3,19,0.0950746
time,Hardware,Voltage,Current
1626387817058,high-voltage-3,20,0.096151
time,Hardware,Voltage,Current
1626387817058,high-voltage-3,25,0.104912
time,Hardware,Voltage,Current
1626387817058,high-voltage-3,30,0.112626
time,Hardware,Voltage,Current
1626387817058,high-voltage-3,35,0.119185
time,Hardware,Voltage,Current
1626387817058,high-voltage-3,40,0.125506
time,Hardware,Voltage,Current
1626387817058,high-voltage-3,45,0.133325
time,Hardware,Voltage,Current
1626387817058,high-voltage-3,50,0.140534
time,Hardware,Voltage,Current
1626387817058,high-voltage-3,55,0.150014
time,Hardware,Voltage,Current
1626387817058,high-voltage-3,60,0.154906
time,Hardware,Voltage,Current
1626387817058,high-voltage-3,65,0.165823
time,Hardware,Voltage,Current
1626387817058,high-voltage-3,70,0.173581
time,Hardware,Voltage,Current
1626387817058,high-voltage-3,75,0.184228
time,Hardware,Voltage,Current
1626387817058,high-voltage-3,80,0.194366
time,Hardware,Voltage,Current
1626387817058,high-voltage-3,85,0.205037
time,Hardware,Voltage,Current
1626387817058,high-voltage-3,90,0.212758
time,Hardware,Voltage,Current
1626387817058,high-voltage-3,95,0.222428
time,Hardware,Voltage,Current
1626387817058,high-voltage-3,100,0.230716
