{
    "Data": [0.0, 0.0, 0.0, 0.0, 0.0, 0.0, 0.0, 0.0, 0.0, 0.0, 0.0, 0.0, 0.0, 0.0, 0.0, 0.0, 0.0, 0.0, 0.0, 0.0, 0.0, 0.0, 1.0, 1.0, 11.0, 2.0, 2.0, 17.0, 6.0, 17.0, 40.0, 1.0, 3.0, 1.0, 3.0, 0.0, 3.0, 14.0, 32.0, 26.0, 1.0, 3.0, 8.0, 10.0, 4.0, 18.0, 7.0, 22.0, 4.0, 4.0, 20.0],
    "Name": "Scurve-50-96",
    "Overflow": 0.0,
    "Type": "Histo1d",
    "Underflow": 0.0,
    "x": {
        "AxisTitle": "Vcal",
        "Bins": 51,
        "High": 302.5,
        "Low": 47.5
    },
    "y": {
        "AxisTitle": "Occupancy"
    },
    "z": {
        "AxisTitle": "z"
    }
}