time,Hardware,Voltage,Current
1621613255984,high-voltage,1,0.128355
time,Hardware,Voltage,Current
1621613255984,high-voltage,2,0.19833
time,Hardware,Voltage,Current
1621613255984,high-voltage,3,0.290262
time,Hardware,Voltage,Current
1621613255984,high-voltage,4,0.41144
time,Hardware,Voltage,Current
1621613255984,high-voltage,5,0.584086
time,Hardware,Voltage,Current
1621613255984,high-voltage,6,0.771335
time,Hardware,Voltage,Current
1621613255984,high-voltage,7,1.08528
time,Hardware,Voltage,Current
1621613255984,high-voltage,8,1.4036
time,Hardware,Voltage,Current
1621613255984,high-voltage,9,1.81198
time,Hardware,Voltage,Current
1621613255984,high-voltage,10,2.30262
time,Hardware,Voltage,Current
1621613255984,high-voltage,11,2.89394
time,Hardware,Voltage,Current
1621613255984,high-voltage,12,3.70944
time,Hardware,Voltage,Current
1621613255984,high-voltage,13,4.71514
time,Hardware,Voltage,Current
1621613255984,high-voltage,14,5.67273
time,Hardware,Voltage,Current
1621613255984,high-voltage,15,6.91694
time,Hardware,Voltage,Current
1621613255984,high-voltage,16,8.06895
time,Hardware,Voltage,Current
1621613255984,high-voltage,17,9.27221
time,Hardware,Voltage,Current
1621613255984,high-voltage,18,9.97695
time,Hardware,Voltage,Current
1621613255984,high-voltage,19,10
