time,Hardware,Voltage,Current
1622014121646,high-voltage,1,0.157737
time,Hardware,Voltage,Current
1622014121646,high-voltage,2,0.265751
time,Hardware,Voltage,Current
1622014121646,high-voltage,3,0.37533
time,Hardware,Voltage,Current
1622014121646,high-voltage,4,0.510297
time,Hardware,Voltage,Current
1622014121646,high-voltage,5,0.639939
time,Hardware,Voltage,Current
1622014121646,high-voltage,6,0.839703
time,Hardware,Voltage,Current
1622014121646,high-voltage,7,1.01455
time,Hardware,Voltage,Current
1622014121646,high-voltage,8,1.382
time,Hardware,Voltage,Current
1622014121646,high-voltage,9,1.73291
time,Hardware,Voltage,Current
1622014121646,high-voltage,10,2.11417
time,Hardware,Voltage,Current
1622014121646,high-voltage,11,2.6765
time,Hardware,Voltage,Current
1622014121646,high-voltage,12,3.24332
time,Hardware,Voltage,Current
1622014121646,high-voltage,13,3.94741
time,Hardware,Voltage,Current
1622014121646,high-voltage,14,4.89794
time,Hardware,Voltage,Current
1622014121646,high-voltage,15,5.79157
time,Hardware,Voltage,Current
1622014121646,high-voltage,16,6.67281
time,Hardware,Voltage,Current
1622014121646,high-voltage,17,7.74109
time,Hardware,Voltage,Current
1622014121646,high-voltage,18,8.7418
time,Hardware,Voltage,Current
1622014121646,high-voltage,19,9.76197
time,Hardware,Voltage,Current
1622014121646,high-voltage,20,10.0001
