time,Hardware,Voltage,Current
1625782073347,high-voltage,1,0.00839751
time,Hardware,Voltage,Current
1625782073347,high-voltage,2,0.0303445
time,Hardware,Voltage,Current
1625782073347,high-voltage,3,0.0450954
time,Hardware,Voltage,Current
1625782073347,high-voltage,4,0.0591801
time,Hardware,Voltage,Current
1625782073347,high-voltage,5,0.0708618
time,Hardware,Voltage,Current
1625782073347,high-voltage,6,0.0800764
time,Hardware,Voltage,Current
1625782073347,high-voltage,7,0.0880621
time,Hardware,Voltage,Current
1625782073347,high-voltage,8,0.0967657
time,Hardware,Voltage,Current
1625782073347,high-voltage,9,0.103518
time,Hardware,Voltage,Current
1625782073347,high-voltage,10,0.10995
time,Hardware,Voltage,Current
1625782073347,high-voltage,11,0.116141
time,Hardware,Voltage,Current
1625782073347,high-voltage,12,0.123024
time,Hardware,Voltage,Current
1625782073347,high-voltage,13,0.128411
time,Hardware,Voltage,Current
1625782073347,high-voltage,14,0.134099
time,Hardware,Voltage,Current
1625782073347,high-voltage,15,0.140272
time,Hardware,Voltage,Current
1625782073347,high-voltage,16,0.145745
time,Hardware,Voltage,Current
1625782073347,high-voltage,17,0.150203
time,Hardware,Voltage,Current
1625782073347,high-voltage,18,0.156034
time,Hardware,Voltage,Current
1625782073347,high-voltage,19,0.160116
time,Hardware,Voltage,Current
1625782073347,high-voltage,20,0.16517
time,Hardware,Voltage,Current
1625782073347,high-voltage,25,0.190797
time,Hardware,Voltage,Current
1625782073347,high-voltage,30,0.217845
time,Hardware,Voltage,Current
1625782073347,high-voltage,35,0.251489
time,Hardware,Voltage,Current
1625782073347,high-voltage,40,0.305429
time,Hardware,Voltage,Current
1625782073347,high-voltage,45,0.413568
time,Hardware,Voltage,Current
1625782073347,high-voltage,50,0.623957
time,Hardware,Voltage,Current
1625782073347,high-voltage,55,1.00038
time,Hardware,Voltage,Current
1625782073347,high-voltage,60,1.60545
time,Hardware,Voltage,Current
1625782073347,high-voltage,65,2.49058
time,Hardware,Voltage,Current
1625782073347,high-voltage,70,3.73219
time,Hardware,Voltage,Current
1625782073347,high-voltage,75,5.33256
time,Hardware,Voltage,Current
1625782073347,high-voltage,80,7.46703
time,Hardware,Voltage,Current
1625782073347,high-voltage,85,10.0001
