{
    "Data": [0.0, 0.0, 0.0, 0.0, 0.0, 0.0, 0.0, 0.0, 0.0, 0.0, 0.0, 0.0, 0.0, 0.0, 0.0, 0.0, 0.0, 0.0, 0.0, 0.0, 0.0, 0.0, 0.0, 0.0, 0.0, 0.0, 0.0, 0.0, 0.0, 0.0, 0.0, 0.0, 0.0, 0.0, 0.0, 0.0, 0.0, 0.0, 0.0, 0.0, 0.0, 0.0, 0.0, 0.0, 0.0, 0.0, 0.0, 0.0, 0.0, 0.0, 4.0, 13.0, 11.0, 12.0, 11.0, 5.0, 16.0, 7.0, 10.0, 20.0, 13.0, 22.0, 32.0, 33.0, 35.0, 67.0, 73.0, 86.0, 118.0, 132.0, 150.0, 219.0, 224.0, 316.0, 361.0, 477.0, 536.0, 685.0, 725.0, 809.0, 960.0, 1018.0, 1099.0, 1169.0, 1153.0, 1249.0, 1341.0, 1407.0, 1446.0, 1601.0, 1990.0, 2385.0, 2875.0, 3564.0, 3910.0, 4132.0, 3807.0, 3206.0, 2511.0, 1795.0, 1126.0, 808.0, 549.0, 333.0, 198.0, 172.0, 145.0, 87.0, 80.0, 74.0, 42.0, 45.0, 39.0, 35.0, 30.0, 31.0, 38.0, 29.0, 27.0, 23.0, 19.0, 17.0, 22.0, 16.0, 18.0, 21.0, 14.0, 7.0, 14.0, 14.0, 5.0, 5.0, 14.0, 13.0, 3.0, 12.0, 6.0, 18.0, 5.0, 7.0, 7.0, 10.0, 9.0, 8.0, 12.0, 11.0, 5.0, 8.0, 10.0, 13.0, 7.0, 18.0, 25.0, 19.0, 30.0, 28.0, 46.0, 57.0, 66.0, 79.0, 78.0, 117.0, 120.0, 142.0, 163.0, 193.0, 211.0, 287.0, 319.0, 337.0, 404.0, 407.0, 446.0, 488.0, 476.0, 515.0, 548.0, 619.0, 564.0, 595.0, 668.0, 654.0, 686.0, 684.0, 674.0, 680.0, 628.0, 605.0, 660.0, 598.0, 549.0, 555.0, 513.0, 512.0, 476.0, 490.0, 399.0, 380.0, 366.0, 294.0, 309.0, 281.0, 299.0, 239.0, 232.0, 225.0, 196.0, 165.0, 171.0, 140.0, 131.0, 130.0, 128.0, 105.0, 111.0, 110.0, 75.0, 94.0, 68.0, 70.0, 80.0, 60.0, 52.0, 47.0, 37.0, 31.0, 22.0, 33.0, 31.0, 37.0, 36.0, 16.0, 23.0, 34.0, 34.0, 15.0, 15.0, 16.0, 17.0, 30.0, 20.0, 20.0, 9.0, 9.0, 7.0, 8.0, 14.0, 6.0, 4.0, 7.0, 6.0, 4.0, 6.0, 5.0, 3.0, 6.0, 8.0, 2.0, 5.0, 4.0, 3.0, 2.0, 5.0, 1.0, 3.0, 0.0, 4.0, 2.0, 4.0, 5.0, 1.0, 1.0, 1.0, 1.0, 0.0, 2.0, 2.0, 1.0, 3.0, 3.0, 2.0, 1.0, 3.0, 1.0, 3.0, 1.0, 3.0, 2.0, 0.0, 1.0, 1.0, 1.0, 4.0, 0.0, 1.0, 1.0, 1.0, 3.0, 1.0, 3.0, 4.0, 2.0, 1.0, 1.0, 0.0, 3.0, 1.0, 0.0, 1.0, 1.0, 1.0, 0.0, 2.0, 1.0, 0.0, 0.0, 0.0, 0.0, 0.0, 1.0, 0.0, 0.0, 0.0, 0.0, 0.0, 0.0, 0.0, 0.0, 0.0, 0.0, 0.0, 0.0, 0.0, 0.0, 0.0, 0.0, 0.0, 0.0, 0.0, 0.0, 0.0, 0.0, 0.0, 0.0, 0.0, 0.0],
    "Name": "ThresholdDist-0",
    "Overflow": 0.0,
    "Type": "Histo1d",
    "Underflow": 0.0,
    "x": {
        "AxisTitle": "Threshold [e]",
        "Bins": 346,
        "High": 3455.0,
        "Low": -5.0
    },
    "y": {
        "AxisTitle": "Number of Pixels"
    },
    "z": {
        "AxisTitle": "z"
    }
}