time,Hardware,Voltage,Current
1626727981856,high-voltage,1,0.0527471
time,Hardware,Voltage,Current
1626727981856,high-voltage,2,0.0756363
time,Hardware,Voltage,Current
1626727981856,high-voltage,3,0.08951
time,Hardware,Voltage,Current
1626727981856,high-voltage,4,0.0995676
time,Hardware,Voltage,Current
1626727981856,high-voltage,5,0.110256
time,Hardware,Voltage,Current
1626727981856,high-voltage,6,0.120632
time,Hardware,Voltage,Current
1626727981856,high-voltage,7,0.132899
time,Hardware,Voltage,Current
1626727981856,high-voltage,8,0.145264
time,Hardware,Voltage,Current
1626727981856,high-voltage,9,0.158584
time,Hardware,Voltage,Current
1626727981856,high-voltage,10,0.174236
time,Hardware,Voltage,Current
1626727981856,high-voltage,11,0.187775
time,Hardware,Voltage,Current
1626727981856,high-voltage,12,0.201014
time,Hardware,Voltage,Current
1626727981856,high-voltage,13,0.211829
time,Hardware,Voltage,Current
1626727981856,high-voltage,14,0.22261
time,Hardware,Voltage,Current
1626727981856,high-voltage,15,0.230868
time,Hardware,Voltage,Current
1626727981856,high-voltage,16,0.238871
time,Hardware,Voltage,Current
1626727981856,high-voltage,17,0.247033
time,Hardware,Voltage,Current
1626727981856,high-voltage,18,0.254405
time,Hardware,Voltage,Current
1626727981856,high-voltage,19,0.260663
time,Hardware,Voltage,Current
1626727981856,high-voltage,20,0.267128
time,Hardware,Voltage,Current
1626727981856,high-voltage,25,0.297026
time,Hardware,Voltage,Current
1626727981856,high-voltage,30,0.334925
time,Hardware,Voltage,Current
1626727981856,high-voltage,35,0.411577
time,Hardware,Voltage,Current
1626727981856,high-voltage,40,0.593492
time,Hardware,Voltage,Current
1626727981856,high-voltage,45,0.957414
time,Hardware,Voltage,Current
1626727981856,high-voltage,50,1.59715
time,Hardware,Voltage,Current
1626727981856,high-voltage,55,2.61481
time,Hardware,Voltage,Current
1626727981856,high-voltage,60,4.17187
time,Hardware,Voltage,Current
1626727981856,high-voltage,65,6.28585
time,Hardware,Voltage,Current
1626727981856,high-voltage,70,9.22291
time,Hardware,Voltage,Current
1626727981856,high-voltage,75,10
