{
    "Data": [810.0, 18865.0, 21148.0, 9704.0, 4826.0, 3481.0, 3393.0, 3093.0, 2698.0, 2069.0, 1493.0, 991.0, 657.0, 452.0, 316.0, 206.0, 163.0, 149.0, 125.0, 106.0, 101.0, 84.0, 103.0, 86.0, 63.0, 80.0, 63.0, 85.0, 72.0, 60.0, 54.0, 72.0, 66.0, 51.0, 45.0, 41.0, 34.0, 38.0, 43.0, 42.0, 35.0, 32.0, 29.0, 18.0, 15.0, 25.0, 30.0, 21.0, 14.0, 6.0, 1.0],
    "Name": "Chi2Dist-0",
    "Overflow": 0.0,
    "Type": "Histo1d",
    "Underflow": 0.0,
    "x": {
        "AxisTitle": "Fit Chi/ndf",
        "Bins": 51,
        "High": 2.5250000953674318,
        "Low": -0.02500000037252903
    },
    "y": {
        "AxisTitle": "Number of Pixels"
    },
    "z": {
        "AxisTitle": "z"
    }
}