{
    "Data": [[2955.0, 1057.0, 569.0, 320.0, 205.0, 181.0, 127.0, 104.0, 72.0, 65.0, 58.0, 33.0, 28.0, 45.0, 31.0, 29.0, 22.0, 16.0, 15.0, 13.0, 23.0, 8.0, 10.0, 12.0, 14.0, 8.0, 7.0, 12.0, 12.0, 6.0, 12.0, 8.0, 10.0, 7.0, 4.0, 5.0, 6.0, 3.0, 8.0, 3.0, 7.0, 7.0, 8.0, 6.0, 3.0, 7.0, 11.0, 17.0, 16.0], [4233.0, 1820.0, 925.0, 617.0, 400.0, 281.0, 233.0, 184.0, 107.0, 90.0, 94.0, 76.0, 63.0, 64.0, 58.0, 47.0, 33.0, 26.0, 24.0, 29.0, 22.0, 31.0, 18.0, 20.0, 10.0, 17.0, 12.0, 13.0, 13.0, 4.0, 8.0, 10.0, 12.0, 7.0, 8.0, 8.0, 11.0, 10.0, 10.0, 12.0, 7.0, 8.0, 6.0, 12.0, 7.0, 13.0, 9.0, 9.0, 29.0], [5179.0, 2579.0, 1526.0, 1074.0, 737.0, 572.0, 427.0, 336.0, 232.0, 229.0, 186.0, 157.0, 130.0, 127.0, 89.0, 66.0, 54.0, 57.0, 57.0, 42.0, 42.0, 35.0, 41.0, 23.0, 30.0, 32.0, 21.0, 16.0, 21.0, 28.0, 17.0, 21.0, 13.0, 14.0, 13.0, 14.0, 16.0, 12.0, 11.0, 16.0, 9.0, 8.0, 17.0, 16.0, 12.0, 11.0, 19.0, 19.0, 18.0], [5311.0, 3012.0, 2125.0, 1593.0, 1254.0, 920.0, 737.0, 649.0, 577.0, 437.0, 362.0, 330.0, 277.0, 221.0, 184.0, 165.0, 159.0, 121.0, 113.0, 96.0, 76.0, 97.0, 72.0, 64.0, 58.0, 61.0, 54.0, 32.0, 33.0, 41.0, 33.0, 37.0, 19.0, 29.0, 26.0, 20.0, 19.0, 25.0, 15.0, 23.0, 20.0, 19.0, 26.0, 15.0, 25.0, 10.0, 26.0, 33.0, 23.0], [5471.0, 3082.0, 2229.0, 1834.0, 1558.0, 1300.0, 1152.0, 919.0, 815.0, 747.0, 675.0, 592.0, 534.0, 457.0, 406.0, 385.0, 339.0, 268.0, 260.0, 255.0, 213.0, 191.0, 140.0, 162.0, 119.0, 118.0, 109.0, 94.0, 94.0, 83.0, 77.0, 72.0, 48.0, 58.0, 56.0, 54.0, 43.0, 48.0, 37.0, 42.0, 37.0, 30.0, 34.0, 33.0, 31.0, 41.0, 34.0, 41.0, 48.0], [7258.0, 3689.0, 2456.0, 1898.0, 1621.0, 1396.0, 1250.0, 1066.0, 1083.0, 974.0, 900.0, 817.0, 802.0, 678.0, 651.0, 578.0, 552.0, 539.0, 461.0, 431.0, 409.0, 346.0, 353.0, 304.0, 306.0, 330.0, 241.0, 227.0, 211.0, 187.0, 200.0, 165.0, 167.0, 130.0, 115.0, 105.0, 103.0, 102.0, 93.0, 85.0, 92.0, 71.0, 62.0, 55.0, 66.0, 63.0, 54.0, 68.0, 86.0], [6386.0, 5048.0, 3907.0, 3147.0, 2440.0, 2058.0, 1746.0, 1478.0, 1338.0, 1145.0, 1096.0, 919.0, 913.0, 856.0, 780.0, 730.0, 814.0, 707.0, 681.0, 652.0, 621.0, 588.0, 621.0, 557.0, 468.0, 475.0, 446.0, 442.0, 424.0, 395.0, 395.0, 346.0, 350.0, 339.0, 298.0, 298.0, 260.0, 232.0, 248.0, 233.0, 226.0, 174.0, 157.0, 150.0, 158.0, 135.0, 116.0, 133.0, 145.0], [1809.0, 1860.0, 2209.0, 2284.0, 2423.0, 2412.0, 2366.0, 2245.0, 2198.0, 2013.0, 1851.0, 1704.0, 1612.0, 1459.0, 1391.0, 1235.0, 1153.0, 1113.0, 995.0, 977.0, 903.0, 840.0, 762.0, 726.0, 724.0, 621.0, 700.0, 677.0, 715.0, 659.0, 614.0, 608.0, 558.0, 551.0, 576.0, 486.0, 493.0, 500.0, 451.0, 443.0, 429.0, 426.0, 394.0, 392.0, 332.0, 332.0, 300.0, 304.0, 327.0], [629.0, 362.0, 374.0, 455.0, 521.0, 596.0, 686.0, 827.0, 930.0, 991.0, 1151.0, 1282.0, 1365.0, 1414.0, 1469.0, 1526.0, 1570.0, 1539.0, 1524.0, 1570.0, 1587.0, 1627.0, 1549.0, 1446.0, 1426.0, 1401.0, 1361.0, 1377.0, 1246.0, 1183.0, 1127.0, 1129.0, 1060.0, 1014.0, 963.0, 914.0, 852.0, 855.0, 857.0, 811.0, 764.0, 768.0, 747.0, 802.0, 720.0, 698.0, 747.0, 707.0, 704.0], [548.0, 213.0, 166.0, 136.0, 135.0, 138.0, 152.0, 167.0, 202.0, 215.0, 239.0, 258.0, 306.0, 302.0, 407.0, 421.0, 550.0, 538.0, 639.0, 699.0, 719.0, 811.0, 869.0, 975.0, 1058.0, 1123.0, 1251.0, 1283.0, 1432.0, 1510.0, 1539.0, 1585.0, 1645.0, 1759.0, 1719.0, 1828.0, 1827.0, 1866.0, 1868.0, 1834.0, 1809.0, 1772.0, 1777.0, 1667.0, 1590.0, 1614.0, 1579.0, 1635.0, 1688.0], [515.0, 196.0, 134.0, 91.0, 80.0, 82.0, 75.0, 58.0, 70.0, 92.0, 95.0, 93.0, 93.0, 127.0, 117.0, 126.0, 145.0, 164.0, 148.0, 204.0, 238.0, 202.0, 273.0, 271.0, 324.0, 322.0, 375.0, 437.0, 470.0, 553.0, 640.0, 694.0, 735.0, 846.0, 997.0, 1069.0, 1277.0, 1454.0, 1661.0, 1826.0, 2031.0, 2338.0, 2597.0, 2887.0, 3075.0, 3467.0, 3922.0, 4224.0, 4587.0], [494.0, 209.0, 111.0, 106.0, 49.0, 58.0, 41.0, 41.0, 46.0, 34.0, 49.0, 47.0, 46.0, 58.0, 50.0, 63.0, 69.0, 82.0, 79.0, 93.0, 96.0, 87.0, 97.0, 118.0, 122.0, 125.0, 145.0, 173.0, 207.0, 214.0, 229.0, 269.0, 300.0, 362.0, 358.0, 436.0, 481.0, 546.0, 618.0, 743.0, 917.0, 1145.0, 1369.0, 1783.0, 2249.0, 2985.0, 3995.0, 5787.0, 8676.0], [551.0, 182.0, 97.0, 72.0, 62.0, 48.0, 50.0, 31.0, 23.0, 33.0, 30.0, 33.0, 26.0, 36.0, 29.0, 36.0, 34.0, 49.0, 30.0, 53.0, 50.0, 43.0, 56.0, 61.0, 62.0, 71.0, 73.0, 82.0, 110.0, 103.0, 109.0, 125.0, 146.0, 162.0, 181.0, 187.0, 211.0, 291.0, 311.0, 383.0, 407.0, 509.0, 652.0, 830.0, 1082.0, 1493.0, 2274.0, 3603.0, 7970.0], [607.0, 210.0, 114.0, 66.0, 51.0, 49.0, 33.0, 33.0, 28.0, 27.0, 27.0, 27.0, 29.0, 30.0, 21.0, 18.0, 32.0, 22.0, 25.0, 17.0, 19.0, 32.0, 32.0, 35.0, 32.0, 36.0, 40.0, 44.0, 49.0, 55.0, 62.0, 71.0, 66.0, 87.0, 98.0, 105.0, 129.0, 136.0, 150.0, 186.0, 229.0, 289.0, 346.0, 446.0, 573.0, 790.0, 1264.0, 2172.0, 5159.0], [796.0, 237.0, 126.0, 68.0, 52.0, 54.0, 26.0, 38.0, 24.0, 32.0, 16.0, 17.0, 20.0, 20.0, 21.0, 14.0, 22.0, 12.0, 15.0, 23.0, 14.0, 24.0, 15.0, 25.0, 22.0, 26.0, 23.0, 26.0, 27.0, 38.0, 38.0, 37.0, 38.0, 39.0, 49.0, 53.0, 73.0, 74.0, 88.0, 112.0, 132.0, 165.0, 175.0, 253.0, 321.0, 487.0, 663.0, 1239.0, 3209.0], [1051.0, 324.0, 156.0, 77.0, 55.0, 38.0, 39.0, 27.0, 24.0, 19.0, 26.0, 27.0, 22.0, 20.0, 17.0, 8.0, 14.0, 20.0, 6.0, 18.0, 13.0, 14.0, 18.0, 16.0, 7.0, 15.0, 24.0, 22.0, 15.0, 20.0, 27.0, 29.0, 31.0, 27.0, 28.0, 47.0, 43.0, 46.0, 45.0, 58.0, 83.0, 74.0, 116.0, 151.0, 198.0, 261.0, 438.0, 789.0, 2064.0], [1460.0, 520.0, 209.0, 101.0, 78.0, 34.0, 47.0, 32.0, 26.0, 20.0, 19.0, 16.0, 21.0, 12.0, 17.0, 16.0, 13.0, 11.0, 16.0, 4.0, 14.0, 6.0, 8.0, 10.0, 10.0, 14.0, 18.0, 12.0, 21.0, 9.0, 17.0, 17.0, 17.0, 17.0, 29.0, 22.0, 32.0, 27.0, 35.0, 41.0, 45.0, 64.0, 74.0, 82.0, 117.0, 163.0, 312.0, 493.0, 1323.0], [2116.0, 743.0, 386.0, 195.0, 124.0, 85.0, 45.0, 49.0, 26.0, 24.0, 34.0, 19.0, 16.0, 11.0, 16.0, 9.0, 12.0, 16.0, 9.0, 10.0, 8.0, 10.0, 8.0, 12.0, 8.0, 5.0, 14.0, 4.0, 12.0, 8.0, 11.0, 13.0, 10.0, 13.0, 20.0, 18.0, 20.0, 33.0, 27.0, 34.0, 31.0, 37.0, 44.0, 64.0, 78.0, 93.0, 164.0, 308.0, 885.0], [2750.0, 1184.0, 605.0, 362.0, 239.0, 150.0, 106.0, 67.0, 58.0, 39.0, 27.0, 32.0, 25.0, 15.0, 22.0, 6.0, 16.0, 11.0, 7.0, 5.0, 11.0, 10.0, 9.0, 4.0, 7.0, 4.0, 5.0, 10.0, 6.0, 15.0, 10.0, 9.0, 8.0, 9.0, 17.0, 12.0, 19.0, 16.0, 17.0, 18.0, 27.0, 39.0, 32.0, 41.0, 55.0, 75.0, 93.0, 200.0, 605.0], [3313.0, 1720.0, 969.0, 639.0, 386.0, 296.0, 212.0, 159.0, 119.0, 95.0, 67.0, 47.0, 43.0, 32.0, 22.0, 25.0, 14.0, 13.0, 12.0, 8.0, 9.0, 6.0, 16.0, 12.0, 6.0, 6.0, 9.0, 8.0, 3.0, 8.0, 9.0, 8.0, 11.0, 10.0, 6.0, 16.0, 8.0, 14.0, 11.0, 18.0, 22.0, 20.0, 23.0, 30.0, 62.0, 52.0, 83.0, 128.0, 431.0], [3835.0, 2139.0, 1375.0, 973.0, 706.0, 548.0, 432.0, 303.0, 229.0, 175.0, 137.0, 114.0, 101.0, 81.0, 59.0, 48.0, 46.0, 26.0, 22.0, 26.0, 16.0, 20.0, 11.0, 17.0, 12.0, 7.0, 11.0, 9.0, 8.0, 12.0, 10.0, 9.0, 6.0, 10.0, 6.0, 5.0, 10.0, 8.0, 12.0, 14.0, 11.0, 13.0, 18.0, 31.0, 35.0, 40.0, 53.0, 103.0, 262.0], [4034.0, 2507.0, 1798.0, 1304.0, 943.0, 805.0, 623.0, 465.0, 421.0, 309.0, 270.0, 227.0, 200.0, 163.0, 143.0, 114.0, 102.0, 84.0, 66.0, 53.0, 36.0, 53.0, 33.0, 18.0, 15.0, 15.0, 14.0, 16.0, 16.0, 8.0, 13.0, 8.0, 8.0, 10.0, 10.0, 8.0, 10.0, 11.0, 20.0, 17.0, 13.0, 9.0, 20.0, 23.0, 30.0, 33.0, 37.0, 68.0, 190.0], [3737.0, 2468.0, 1880.0, 1545.0, 1217.0, 1058.0, 893.0, 757.0, 630.0, 547.0, 514.0, 404.0, 350.0, 336.0, 265.0, 222.0, 204.0, 180.0, 168.0, 131.0, 117.0, 102.0, 93.0, 84.0, 55.0, 45.0, 57.0, 44.0, 37.0, 30.0, 28.0, 30.0, 23.0, 20.0, 13.0, 10.0, 10.0, 20.0, 8.0, 20.0, 13.0, 22.0, 17.0, 21.0, 18.0, 23.0, 37.0, 78.0, 146.0], [3025.0, 2312.0, 1847.0, 1605.0, 1338.0, 1169.0, 1054.0, 947.0, 844.0, 773.0, 675.0, 615.0, 548.0, 500.0, 457.0, 403.0, 374.0, 321.0, 296.0, 243.0, 255.0, 223.0, 172.0, 152.0, 157.0, 137.0, 125.0, 111.0, 80.0, 94.0, 65.0, 79.0, 61.0, 59.0, 31.0, 49.0, 32.0, 30.0, 47.0, 20.0, 26.0, 25.0, 22.0, 18.0, 15.0, 31.0, 47.0, 61.0, 124.0], [2082.0, 1634.0, 1493.0, 1402.0, 1257.0, 1162.0, 1125.0, 1002.0, 926.0, 955.0, 781.0, 769.0, 756.0, 670.0, 628.0, 604.0, 506.0, 489.0, 472.0, 429.0, 418.0, 324.0, 309.0, 325.0, 306.0, 257.0, 253.0, 210.0, 223.0, 197.0, 173.0, 140.0, 132.0, 140.0, 111.0, 99.0, 94.0, 76.0, 55.0, 65.0, 68.0, 63.0, 59.0, 36.0, 50.0, 47.0, 48.0, 72.0, 112.0], [1390.0, 981.0, 1073.0, 969.0, 970.0, 982.0, 923.0, 950.0, 943.0, 836.0, 807.0, 820.0, 811.0, 723.0, 740.0, 673.0, 646.0, 659.0, 630.0, 577.0, 549.0, 500.0, 484.0, 512.0, 472.0, 418.0, 403.0, 378.0, 377.0, 341.0, 313.0, 301.0, 272.0, 239.0, 217.0, 173.0, 204.0, 183.0, 179.0, 164.0, 127.0, 107.0, 111.0, 105.0, 90.0, 97.0, 81.0, 97.0, 144.0], [844.0, 634.0, 582.0, 631.0, 582.0, 628.0, 623.0, 626.0, 639.0, 661.0, 707.0, 695.0, 702.0, 693.0, 659.0, 645.0, 674.0, 677.0, 627.0, 629.0, 619.0, 654.0, 657.0, 636.0, 592.0, 576.0, 587.0, 509.0, 560.0, 475.0, 519.0, 451.0, 446.0, 433.0, 401.0, 394.0, 370.0, 346.0, 344.0, 305.0, 279.0, 269.0, 256.0, 214.0, 223.0, 223.0, 189.0, 194.0, 216.0], [591.0, 349.0, 333.0, 309.0, 349.0, 337.0, 339.0, 430.0, 437.0, 439.0, 467.0, 497.0, 486.0, 498.0, 560.0, 506.0, 524.0, 580.0, 598.0, 594.0, 589.0, 600.0, 605.0, 641.0, 633.0, 596.0, 597.0, 622.0, 632.0, 655.0, 582.0, 627.0, 583.0, 604.0, 619.0, 559.0, 559.0, 558.0, 503.0, 497.0, 472.0, 506.0, 502.0, 468.0, 423.0, 396.0, 368.0, 396.0, 410.0], [481.0, 219.0, 176.0, 174.0, 149.0, 208.0, 213.0, 194.0, 208.0, 259.0, 245.0, 248.0, 298.0, 320.0, 352.0, 348.0, 349.0, 421.0, 436.0, 391.0, 446.0, 452.0, 506.0, 498.0, 559.0, 554.0, 580.0, 539.0, 579.0, 615.0, 668.0, 650.0, 661.0, 671.0, 689.0, 727.0, 667.0, 737.0, 732.0, 767.0, 714.0, 716.0, 738.0, 647.0, 668.0, 732.0, 772.0, 688.0, 800.0], [466.0, 189.0, 133.0, 103.0, 95.0, 96.0, 92.0, 105.0, 114.0, 104.0, 153.0, 139.0, 151.0, 175.0, 180.0, 181.0, 197.0, 247.0, 239.0, 244.0, 310.0, 315.0, 304.0, 327.0, 365.0, 399.0, 383.0, 441.0, 509.0, 527.0, 501.0, 567.0, 586.0, 622.0, 619.0, 705.0, 682.0, 761.0, 766.0, 775.0, 875.0, 973.0, 964.0, 1042.0, 1011.0, 1033.0, 1116.0, 1141.0, 1328.0], [472.0, 170.0, 99.0, 85.0, 74.0, 81.0, 67.0, 76.0, 58.0, 54.0, 58.0, 80.0, 64.0, 84.0, 90.0, 82.0, 105.0, 104.0, 111.0, 118.0, 148.0, 150.0, 171.0, 176.0, 222.0, 224.0, 239.0, 265.0, 307.0, 302.0, 359.0, 422.0, 439.0, 447.0, 498.0, 575.0, 616.0, 665.0, 702.0, 787.0, 840.0, 907.0, 998.0, 1095.0, 1238.0, 1302.0, 1495.0, 1714.0, 2061.0], [449.0, 136.0, 100.0, 71.0, 45.0, 48.0, 48.0, 28.0, 25.0, 33.0, 33.0, 34.0, 32.0, 33.0, 36.0, 38.0, 41.0, 55.0, 63.0, 63.0, 73.0, 83.0, 78.0, 96.0, 122.0, 113.0, 121.0, 155.0, 175.0, 190.0, 207.0, 231.0, 258.0, 316.0, 334.0, 396.0, 438.0, 503.0, 533.0, 608.0, 707.0, 784.0, 912.0, 974.0, 1264.0, 1384.0, 1711.0, 2053.0, 2750.0], [421.0, 169.0, 84.0, 51.0, 47.0, 56.0, 36.0, 41.0, 28.0, 45.0, 18.0, 11.0, 40.0, 20.0, 15.0, 25.0, 25.0, 43.0, 27.0, 26.0, 30.0, 37.0, 44.0, 38.0, 39.0, 48.0, 53.0, 74.0, 84.0, 90.0, 102.0, 107.0, 122.0, 170.0, 199.0, 240.0, 255.0, 267.0, 343.0, 378.0, 482.0, 579.0, 651.0, 832.0, 1017.0, 1261.0, 1595.0, 2073.0, 3348.0], [420.0, 151.0, 72.0, 47.0, 34.0, 47.0, 50.0, 22.0, 16.0, 22.0, 20.0, 25.0, 18.0, 29.0, 13.0, 9.0, 21.0, 26.0, 25.0, 22.0, 33.0, 20.0, 18.0, 15.0, 19.0, 29.0, 23.0, 34.0, 37.0, 57.0, 44.0, 49.0, 67.0, 96.0, 103.0, 106.0, 130.0, 155.0, 190.0, 210.0, 314.0, 345.0, 429.0, 537.0, 677.0, 988.0, 1334.0, 1848.0, 3234.0], [415.0, 152.0, 80.0, 44.0, 45.0, 34.0, 28.0, 19.0, 19.0, 20.0, 18.0, 24.0, 9.0, 10.0, 12.0, 11.0, 10.0, 6.0, 11.0, 5.0, 10.0, 8.0, 10.0, 6.0, 18.0, 14.0, 7.0, 15.0, 23.0, 49.0, 19.0, 22.0, 24.0, 32.0, 41.0, 53.0, 57.0, 74.0, 104.0, 123.0, 171.0, 202.0, 252.0, 332.0, 454.0, 651.0, 947.0, 1508.0, 2881.0], [460.0, 159.0, 78.0, 60.0, 34.0, 45.0, 17.0, 24.0, 15.0, 16.0, 13.0, 18.0, 15.0, 11.0, 13.0, 9.0, 8.0, 5.0, 9.0, 28.0, 19.0, 4.0, 3.0, 2.0, 6.0, 7.0, 4.0, 4.0, 5.0, 7.0, 9.0, 8.0, 12.0, 9.0, 26.0, 25.0, 33.0, 24.0, 36.0, 46.0, 62.0, 99.0, 149.0, 196.0, 258.0, 376.0, 646.0, 1113.0, 2293.0], [425.0, 146.0, 79.0, 56.0, 32.0, 32.0, 27.0, 28.0, 28.0, 47.0, 20.0, 11.0, 12.0, 7.0, 14.0, 8.0, 13.0, 28.0, 1.0, 29.0, 3.0, 6.0, 4.0, 1.0, 4.0, 3.0, 1.0, 1.0, 3.0, 2.0, 5.0, 7.0, 7.0, 10.0, 24.0, 9.0, 13.0, 14.0, 20.0, 22.0, 36.0, 53.0, 64.0, 85.0, 136.0, 239.0, 395.0, 713.0, 1646.0], [436.0, 150.0, 76.0, 70.0, 46.0, 27.0, 35.0, 16.0, 19.0, 19.0, 12.0, 9.0, 8.0, 8.0, 10.0, 11.0, 7.0, 5.0, 6.0, 4.0, 5.0, 5.0, 4.0, 4.0, 4.0, 2.0, 1.0, 2.0, 4.0, 19.0, 5.0, 4.0, 5.0, 6.0, 2.0, 2.0, 1.0, 11.0, 4.0, 35.0, 11.0, 22.0, 24.0, 45.0, 81.0, 115.0, 240.0, 411.0, 1145.0], [425.0, 137.0, 87.0, 46.0, 47.0, 36.0, 21.0, 24.0, 23.0, 15.0, 23.0, 8.0, 7.0, 12.0, 27.0, 6.0, 15.0, 3.0, 6.0, 1.0, 4.0, 4.0, 8.0, 2.0, 3.0, 8.0, 3.0, 23.0, 0.0, 1.0, 0.0, 2.0, 3.0, 3.0, 3.0, 2.0, 4.0, 22.0, 31.0, 5.0, 5.0, 5.0, 8.0, 21.0, 32.0, 51.0, 115.0, 238.0, 769.0], [427.0, 126.0, 96.0, 67.0, 45.0, 30.0, 20.0, 68.0, 18.0, 11.0, 17.0, 7.0, 12.0, 10.0, 14.0, 9.0, 7.0, 7.0, 10.0, 4.0, 5.0, 4.0, 3.0, 5.0, 4.0, 1.0, 0.0, 2.0, 0.0, 3.0, 1.0, 2.0, 1.0, 4.0, 2.0, 1.0, 0.0, 3.0, 3.0, 1.0, 3.0, 2.0, 10.0, 6.0, 10.0, 26.0, 54.0, 124.0, 444.0], [439.0, 193.0, 83.0, 49.0, 50.0, 35.0, 30.0, 25.0, 15.0, 18.0, 8.0, 10.0, 10.0, 9.0, 8.0, 7.0, 5.0, 10.0, 7.0, 11.0, 6.0, 27.0, 6.0, 2.0, 4.0, 4.0, 1.0, 2.0, 2.0, 1.0, 2.0, 2.0, 1.0, 0.0, 2.0, 2.0, 2.0, 2.0, 1.0, 2.0, 26.0, 2.0, 4.0, 3.0, 4.0, 10.0, 28.0, 55.0, 259.0], [429.0, 138.0, 68.0, 50.0, 51.0, 29.0, 27.0, 23.0, 16.0, 18.0, 17.0, 8.0, 14.0, 5.0, 12.0, 6.0, 11.0, 9.0, 8.0, 5.0, 3.0, 4.0, 7.0, 1.0, 1.0, 2.0, 5.0, 4.0, 3.0, 2.0, 3.0, 1.0, 2.0, 1.0, 2.0, 2.0, 3.0, 26.0, 0.0, 1.0, 2.0, 2.0, 1.0, 1.0, 4.0, 6.0, 16.0, 29.0, 157.0], [399.0, 139.0, 89.0, 46.0, 46.0, 31.0, 25.0, 24.0, 19.0, 20.0, 8.0, 12.0, 8.0, 10.0, 9.0, 15.0, 11.0, 8.0, 4.0, 4.0, 2.0, 3.0, 3.0, 5.0, 5.0, 6.0, 2.0, 1.0, 1.0, 2.0, 1.0, 0.0, 0.0, 0.0, 2.0, 3.0, 2.0, 45.0, 10.0, 1.0, 1.0, 0.0, 1.0, 4.0, 4.0, 4.0, 34.0, 11.0, 89.0], [454.0, 166.0, 65.0, 52.0, 43.0, 25.0, 29.0, 26.0, 21.0, 12.0, 11.0, 16.0, 23.0, 27.0, 14.0, 5.0, 6.0, 5.0, 4.0, 4.0, 6.0, 2.0, 4.0, 5.0, 0.0, 1.0, 3.0, 3.0, 1.0, 1.0, 1.0, 1.0, 3.0, 2.0, 1.0, 6.0, 22.0, 4.0, 2.0, 3.0, 0.0, 3.0, 2.0, 2.0, 3.0, 3.0, 3.0, 9.0, 53.0], [464.0, 152.0, 71.0, 47.0, 28.0, 33.0, 31.0, 24.0, 24.0, 21.0, 14.0, 15.0, 12.0, 5.0, 11.0, 11.0, 2.0, 7.0, 9.0, 1.0, 7.0, 4.0, 4.0, 3.0, 1.0, 4.0, 0.0, 6.0, 1.0, 2.0, 3.0, 1.0, 3.0, 3.0, 2.0, 2.0, 1.0, 0.0, 3.0, 0.0, 3.0, 2.0, 2.0, 1.0, 2.0, 4.0, 3.0, 4.0, 30.0], [421.0, 128.0, 84.0, 58.0, 40.0, 33.0, 33.0, 18.0, 10.0, 15.0, 17.0, 14.0, 17.0, 11.0, 13.0, 11.0, 5.0, 3.0, 4.0, 5.0, 27.0, 5.0, 4.0, 3.0, 2.0, 1.0, 2.0, 1.0, 5.0, 2.0, 2.0, 2.0, 1.0, 3.0, 23.0, 2.0, 3.0, 0.0, 1.0, 5.0, 0.0, 2.0, 2.0, 2.0, 2.0, 0.0, 3.0, 7.0, 29.0], [409.0, 168.0, 72.0, 64.0, 36.0, 25.0, 26.0, 18.0, 26.0, 19.0, 10.0, 10.0, 15.0, 8.0, 15.0, 9.0, 7.0, 4.0, 6.0, 3.0, 3.0, 7.0, 2.0, 2.0, 4.0, 4.0, 2.0, 2.0, 3.0, 3.0, 2.0, 3.0, 2.0, 1.0, 0.0, 1.0, 2.0, 2.0, 0.0, 2.0, 0.0, 0.0, 3.0, 2.0, 3.0, 5.0, 6.0, 5.0, 25.0], [428.0, 142.0, 84.0, 54.0, 48.0, 30.0, 25.0, 24.0, 24.0, 10.0, 12.0, 11.0, 35.0, 15.0, 6.0, 9.0, 8.0, 5.0, 5.0, 4.0, 3.0, 28.0, 3.0, 3.0, 4.0, 6.0, 2.0, 1.0, 2.0, 1.0, 1.0, 3.0, 1.0, 1.0, 2.0, 1.0, 2.0, 1.0, 3.0, 0.0, 2.0, 0.0, 3.0, 3.0, 1.0, 3.0, 2.0, 5.0, 20.0], [415.0, 144.0, 86.0, 61.0, 47.0, 33.0, 23.0, 20.0, 20.0, 23.0, 19.0, 9.0, 4.0, 11.0, 8.0, 8.0, 7.0, 5.0, 8.0, 3.0, 5.0, 3.0, 5.0, 4.0, 0.0, 2.0, 2.0, 6.0, 1.0, 3.0, 3.0, 5.0, 2.0, 1.0, 1.0, 1.0, 1.0, 0.0, 2.0, 3.0, 6.0, 2.0, 0.0, 21.0, 9.0, 2.0, 5.0, 4.0, 18.0], [477.0, 130.0, 76.0, 49.0, 45.0, 38.0, 28.0, 32.0, 18.0, 20.0, 28.0, 15.0, 12.0, 13.0, 10.0, 8.0, 11.0, 5.0, 3.0, 5.0, 3.0, 5.0, 2.0, 3.0, 3.0, 4.0, 3.0, 1.0, 26.0, 2.0, 2.0, 2.0, 1.0, 3.0, 1.0, 0.0, 0.0, 2.0, 0.0, 3.0, 3.0, 4.0, 1.0, 4.0, 4.0, 2.0, 2.0, 5.0, 20.0], [421.0, 151.0, 78.0, 55.0, 38.0, 31.0, 30.0, 24.0, 23.0, 16.0, 13.0, 13.0, 6.0, 12.0, 12.0, 7.0, 5.0, 4.0, 7.0, 9.0, 4.0, 4.0, 4.0, 4.0, 3.0, 3.0, 1.0, 3.0, 3.0, 24.0, 5.0, 0.0, 2.0, 2.0, 0.0, 0.0, 1.0, 1.0, 0.0, 3.0, 4.0, 2.0, 0.0, 2.0, 5.0, 2.0, 2.0, 5.0, 14.0]],
    "Name": "sCurve-0",
    "Overflow": 2430997.0,
    "Type": "Histo2d",
    "Underflow": 0.0,
    "x": {
        "AxisTitle": "Vcal",
        "Bins": 51,
        "High": 302.5,
        "Low": 47.5
    },
    "y": {
        "AxisTitle": "Occupancy",
        "Bins": 49,
        "High": 49.5,
        "Low": 0.5
    },
    "z": {
        "AxisTitle": "Number of pixels"
    }
}