{
    "Data": [0.0, 0.0, 0.0, 0.0, 0.0, 0.0, 0.0, 0.0, 0.0, 0.0, 0.0, 0.0, 0.0, 0.0, 0.0, 0.0, 0.0, 0.0, 0.0, 0.0, 0.0, 0.0, 0.0, 0.0, 0.0, 0.0, 0.0, 0.0, 0.0, 0.0, 0.0, 0.0, 0.0, 0.0, 0.0, 0.0, 0.0, 0.0, 0.0, 0.0, 0.0, 0.0, 0.0, 0.0, 0.0, 0.0, 0.0, 0.0, 0.0, 0.0, 73.0, 110.0, 152.0, 147.0, 170.0, 192.0, 230.0, 269.0, 272.0, 332.0, 401.0, 403.0, 458.0, 480.0, 533.0, 583.0, 620.0, 647.0, 701.0, 774.0, 752.0, 843.0, 871.0, 824.0, 856.0, 808.0, 843.0, 911.0, 867.0, 866.0, 860.0, 834.0, 799.0, 844.0, 865.0, 952.0, 1019.0, 1297.0, 1558.0, 1775.0, 2301.0, 2610.0, 2835.0, 2931.0, 2731.0, 2485.0, 2117.0, 1696.0, 1250.0, 890.0, 636.0, 486.0, 323.0, 203.0, 135.0, 107.0, 82.0, 65.0, 48.0, 38.0, 44.0, 26.0, 22.0, 36.0, 19.0, 17.0, 17.0, 14.0, 15.0, 13.0, 14.0, 10.0, 15.0, 14.0, 14.0, 11.0, 10.0, 10.0, 10.0, 5.0, 6.0, 5.0, 3.0, 6.0, 5.0, 4.0, 12.0, 5.0, 4.0, 4.0, 5.0, 4.0, 5.0, 6.0, 3.0, 2.0, 0.0, 0.0, 1.0, 4.0, 5.0, 2.0, 4.0, 8.0, 5.0, 4.0, 6.0, 7.0, 13.0, 11.0, 24.0, 21.0, 41.0, 45.0, 64.0, 63.0, 89.0, 104.0, 111.0, 156.0, 183.0, 247.0, 300.0, 314.0, 366.0, 442.0, 492.0, 560.0, 576.0, 641.0, 679.0, 764.0, 789.0, 811.0, 846.0, 941.0, 933.0, 946.0, 943.0, 976.0, 927.0, 958.0, 909.0, 850.0, 823.0, 723.0, 716.0, 632.0, 600.0, 521.0, 510.0, 409.0, 355.0, 320.0, 306.0, 251.0, 198.0, 190.0, 150.0, 130.0, 121.0, 94.0, 96.0, 73.0, 50.0, 38.0, 20.0, 26.0, 20.0, 16.0, 10.0, 12.0, 9.0, 5.0, 2.0, 1.0, 1.0, 0.0, 0.0, 1.0, 0.0, 0.0, 0.0, 0.0, 0.0, 0.0, 0.0, 0.0, 0.0, 0.0, 1.0, 0.0, 0.0, 0.0, 0.0, 0.0, 0.0, 0.0, 0.0, 1.0, 1.0, 0.0, 1.0, 1.0, 0.0, 0.0, 0.0, 0.0, 0.0, 0.0, 0.0, 0.0, 0.0, 0.0, 0.0, 0.0, 0.0, 0.0, 0.0, 0.0, 0.0, 0.0, 0.0, 0.0, 0.0, 0.0, 0.0, 0.0, 0.0, 0.0, 0.0, 0.0, 0.0, 0.0, 0.0, 0.0, 0.0, 0.0, 0.0, 0.0, 0.0, 0.0, 0.0, 0.0, 0.0, 0.0, 0.0, 0.0, 0.0, 0.0, 0.0, 0.0, 0.0, 0.0, 0.0, 0.0, 0.0, 0.0, 0.0, 0.0, 0.0, 0.0, 0.0, 0.0, 0.0, 0.0, 0.0, 0.0, 0.0, 0.0, 0.0, 0.0, 0.0, 0.0, 0.0, 0.0, 0.0, 0.0, 0.0, 0.0, 0.0, 0.0, 0.0, 0.0, 0.0, 0.0, 0.0, 0.0, 0.0, 0.0, 0.0, 0.0, 0.0, 0.0, 0.0, 0.0, 0.0, 0.0, 0.0, 0.0, 0.0, 0.0, 0.0, 0.0, 0.0, 0.0, 0.0, 0.0, 0.0, 0.0, 0.0, 0.0, 0.0, 0.0],
    "Name": "ThresholdDist-0",
    "Overflow": 0.0,
    "Type": "Histo1d",
    "Underflow": 0.0,
    "x": {
        "AxisTitle": "Threshold [e]",
        "Bins": 364,
        "High": 3635.0,
        "Low": -5.0
    },
    "y": {
        "AxisTitle": "Number of Pixels"
    },
    "z": {
        "AxisTitle": "z"
    }
}