{
    "Data": [[862.0, 220.0, 93.0, 33.0, 26.0, 15.0, 13.0, 10.0, 13.0, 9.0, 7.0, 5.0, 4.0, 1.0, 8.0, 7.0, 6.0, 2.0, 5.0, 2.0, 6.0, 3.0, 4.0, 4.0, 2.0, 4.0, 4.0, 0.0, 0.0, 8.0, 2.0, 0.0, 1.0, 3.0, 3.0, 0.0, 2.0, 0.0, 0.0, 3.0, 2.0, 1.0, 0.0, 1.0, 0.0, 0.0, 1.0, 2.0, 4.0], [1784.0, 549.0, 241.0, 158.0, 63.0, 47.0, 34.0, 26.0, 13.0, 18.0, 4.0, 9.0, 9.0, 7.0, 5.0, 12.0, 6.0, 6.0, 3.0, 5.0, 3.0, 3.0, 0.0, 5.0, 5.0, 2.0, 8.0, 2.0, 5.0, 3.0, 4.0, 6.0, 5.0, 3.0, 2.0, 3.0, 0.0, 4.0, 1.0, 1.0, 7.0, 0.0, 3.0, 3.0, 3.0, 3.0, 3.0, 1.0, 2.0], [3065.0, 1258.0, 649.0, 370.0, 261.0, 184.0, 124.0, 76.0, 54.0, 51.0, 39.0, 26.0, 25.0, 15.0, 13.0, 11.0, 9.0, 4.0, 13.0, 6.0, 8.0, 7.0, 7.0, 5.0, 2.0, 7.0, 7.0, 7.0, 6.0, 4.0, 2.0, 6.0, 7.0, 4.0, 6.0, 3.0, 3.0, 6.0, 6.0, 7.0, 2.0, 3.0, 4.0, 1.0, 1.0, 8.0, 13.0, 5.0, 7.0], [4163.0, 2093.0, 1328.0, 853.0, 659.0, 446.0, 318.0, 284.0, 213.0, 181.0, 120.0, 114.0, 86.0, 81.0, 62.0, 48.0, 41.0, 28.0, 28.0, 30.0, 24.0, 19.0, 16.0, 14.0, 14.0, 7.0, 14.0, 10.0, 5.0, 5.0, 10.0, 10.0, 7.0, 4.0, 4.0, 7.0, 10.0, 8.0, 4.0, 11.0, 6.0, 5.0, 12.0, 6.0, 8.0, 5.0, 10.0, 8.0, 9.0], [4267.0, 2733.0, 1891.0, 1505.0, 1161.0, 916.0, 818.0, 643.0, 497.0, 451.0, 364.0, 345.0, 265.0, 215.0, 190.0, 187.0, 159.0, 131.0, 99.0, 93.0, 94.0, 74.0, 74.0, 67.0, 57.0, 48.0, 41.0, 35.0, 24.0, 34.0, 31.0, 20.0, 27.0, 18.0, 17.0, 14.0, 17.0, 10.0, 7.0, 21.0, 8.0, 12.0, 13.0, 9.0, 7.0, 16.0, 10.0, 28.0, 21.0], [4410.0, 2517.0, 1862.0, 1665.0, 1356.0, 1246.0, 1124.0, 1021.0, 906.0, 862.0, 730.0, 666.0, 614.0, 528.0, 491.0, 469.0, 365.0, 381.0, 355.0, 279.0, 287.0, 238.0, 219.0, 202.0, 176.0, 152.0, 148.0, 156.0, 127.0, 100.0, 90.0, 73.0, 81.0, 72.0, 73.0, 55.0, 59.0, 46.0, 32.0, 33.0, 37.0, 27.0, 37.0, 30.0, 17.0, 23.0, 19.0, 27.0, 39.0], [7460.0, 4069.0, 2557.0, 1835.0, 1503.0, 1318.0, 1109.0, 1063.0, 983.0, 1005.0, 898.0, 814.0, 845.0, 772.0, 774.0, 740.0, 692.0, 604.0, 625.0, 602.0, 536.0, 559.0, 510.0, 484.0, 480.0, 438.0, 428.0, 367.0, 367.0, 311.0, 278.0, 308.0, 268.0, 263.0, 220.0, 210.0, 190.0, 164.0, 153.0, 134.0, 118.0, 120.0, 109.0, 101.0, 78.0, 92.0, 78.0, 68.0, 68.0], [2879.0, 3122.0, 3052.0, 3006.0, 2672.0, 2306.0, 2152.0, 2037.0, 1754.0, 1553.0, 1448.0, 1319.0, 1119.0, 1068.0, 990.0, 947.0, 899.0, 859.0, 838.0, 776.0, 758.0, 753.0, 774.0, 732.0, 719.0, 727.0, 635.0, 650.0, 662.0, 666.0, 624.0, 598.0, 565.0, 579.0, 536.0, 497.0, 530.0, 482.0, 446.0, 444.0, 433.0, 373.0, 371.0, 337.0, 302.0, 274.0, 221.0, 256.0, 218.0], [355.0, 330.0, 393.0, 467.0, 581.0, 691.0, 734.0, 885.0, 1013.0, 1044.0, 1214.0, 1228.0, 1239.0, 1384.0, 1396.0, 1411.0, 1491.0, 1464.0, 1452.0, 1576.0, 1445.0, 1409.0, 1447.0, 1411.0, 1353.0, 1333.0, 1339.0, 1260.0, 1173.0, 1181.0, 1082.0, 1115.0, 1065.0, 1039.0, 1072.0, 1043.0, 999.0, 944.0, 910.0, 933.0, 887.0, 859.0, 838.0, 871.0, 807.0, 761.0, 745.0, 758.0, 698.0], [239.0, 80.0, 85.0, 55.0, 72.0, 60.0, 93.0, 73.0, 105.0, 105.0, 114.0, 138.0, 151.0, 173.0, 183.0, 232.0, 237.0, 335.0, 329.0, 390.0, 482.0, 489.0, 603.0, 668.0, 756.0, 798.0, 898.0, 1015.0, 1153.0, 1218.0, 1302.0, 1426.0, 1499.0, 1603.0, 1781.0, 1845.0, 1923.0, 1973.0, 2063.0, 2166.0, 2268.0, 2231.0, 2344.0, 2251.0, 2331.0, 2324.0, 2296.0, 2228.0, 2298.0], [330.0, 87.0, 62.0, 47.0, 38.0, 22.0, 45.0, 24.0, 27.0, 35.0, 33.0, 27.0, 35.0, 40.0, 42.0, 48.0, 44.0, 49.0, 47.0, 74.0, 66.0, 75.0, 76.0, 75.0, 87.0, 120.0, 140.0, 161.0, 203.0, 246.0, 252.0, 300.0, 327.0, 434.0, 461.0, 559.0, 685.0, 779.0, 957.0, 1143.0, 1399.0, 1634.0, 1980.0, 2526.0, 3091.0, 3889.0, 4769.0, 6258.0, 7833.0], [434.0, 87.0, 56.0, 38.0, 34.0, 27.0, 24.0, 10.0, 25.0, 23.0, 19.0, 14.0, 22.0, 21.0, 23.0, 23.0, 13.0, 13.0, 25.0, 22.0, 15.0, 30.0, 25.0, 31.0, 46.0, 43.0, 24.0, 48.0, 48.0, 51.0, 63.0, 69.0, 80.0, 90.0, 118.0, 116.0, 143.0, 196.0, 216.0, 305.0, 383.0, 504.0, 650.0, 833.0, 1130.0, 1681.0, 2539.0, 4372.0, 9144.0], [773.0, 157.0, 55.0, 38.0, 23.0, 13.0, 14.0, 24.0, 12.0, 12.0, 12.0, 13.0, 14.0, 12.0, 19.0, 11.0, 14.0, 16.0, 14.0, 11.0, 8.0, 20.0, 13.0, 12.0, 16.0, 29.0, 27.0, 17.0, 15.0, 16.0, 19.0, 24.0, 29.0, 32.0, 35.0, 49.0, 46.0, 66.0, 61.0, 64.0, 102.0, 147.0, 181.0, 267.0, 396.0, 624.0, 991.0, 1903.0, 4918.0], [1242.0, 285.0, 90.0, 33.0, 20.0, 15.0, 16.0, 15.0, 8.0, 9.0, 16.0, 10.0, 9.0, 13.0, 8.0, 13.0, 9.0, 12.0, 13.0, 8.0, 8.0, 13.0, 8.0, 10.0, 10.0, 10.0, 11.0, 8.0, 15.0, 14.0, 8.0, 22.0, 11.0, 22.0, 21.0, 25.0, 18.0, 28.0, 27.0, 27.0, 46.0, 46.0, 51.0, 86.0, 150.0, 207.0, 383.0, 830.0, 2517.0], [2078.0, 584.0, 187.0, 66.0, 31.0, 19.0, 14.0, 12.0, 6.0, 8.0, 8.0, 10.0, 8.0, 9.0, 6.0, 12.0, 11.0, 7.0, 4.0, 8.0, 4.0, 2.0, 11.0, 10.0, 11.0, 10.0, 12.0, 6.0, 8.0, 8.0, 6.0, 5.0, 11.0, 14.0, 10.0, 13.0, 19.0, 20.0, 18.0, 21.0, 27.0, 26.0, 25.0, 31.0, 58.0, 87.0, 130.0, 306.0, 1144.0], [3059.0, 953.0, 349.0, 132.0, 51.0, 25.0, 15.0, 12.0, 4.0, 6.0, 8.0, 12.0, 8.0, 5.0, 3.0, 9.0, 7.0, 7.0, 7.0, 12.0, 5.0, 5.0, 3.0, 6.0, 4.0, 6.0, 8.0, 6.0, 10.0, 6.0, 5.0, 11.0, 10.0, 7.0, 7.0, 15.0, 8.0, 14.0, 17.0, 9.0, 9.0, 20.0, 22.0, 23.0, 30.0, 45.0, 65.0, 144.0, 535.0], [4319.0, 1663.0, 708.0, 309.0, 127.0, 55.0, 31.0, 19.0, 12.0, 10.0, 11.0, 7.0, 7.0, 6.0, 8.0, 6.0, 1.0, 6.0, 8.0, 5.0, 6.0, 6.0, 6.0, 2.0, 3.0, 3.0, 6.0, 7.0, 4.0, 7.0, 7.0, 7.0, 8.0, 8.0, 4.0, 12.0, 6.0, 11.0, 9.0, 11.0, 10.0, 17.0, 18.0, 23.0, 20.0, 18.0, 40.0, 77.0, 248.0], [5143.0, 2464.0, 1263.0, 682.0, 313.0, 174.0, 86.0, 51.0, 34.0, 21.0, 9.0, 15.0, 14.0, 3.0, 6.0, 9.0, 6.0, 2.0, 3.0, 4.0, 3.0, 1.0, 2.0, 5.0, 8.0, 4.0, 2.0, 2.0, 4.0, 7.0, 6.0, 2.0, 5.0, 8.0, 9.0, 8.0, 6.0, 10.0, 8.0, 9.0, 9.0, 12.0, 11.0, 12.0, 14.0, 33.0, 25.0, 48.0, 140.0], [5492.0, 3139.0, 1982.0, 1184.0, 695.0, 422.0, 276.0, 144.0, 103.0, 59.0, 32.0, 17.0, 16.0, 10.0, 11.0, 7.0, 6.0, 4.0, 3.0, 4.0, 1.0, 3.0, 1.0, 4.0, 3.0, 2.0, 5.0, 5.0, 4.0, 1.0, 4.0, 8.0, 4.0, 4.0, 2.0, 3.0, 4.0, 3.0, 6.0, 7.0, 11.0, 7.0, 12.0, 9.0, 13.0, 20.0, 28.0, 36.0, 95.0], [5015.0, 3608.0, 2624.0, 1836.0, 1231.0, 783.0, 589.0, 382.0, 242.0, 159.0, 120.0, 93.0, 57.0, 31.0, 29.0, 15.0, 8.0, 11.0, 7.0, 7.0, 2.0, 4.0, 1.0, 1.0, 2.0, 3.0, 5.0, 2.0, 1.0, 3.0, 2.0, 6.0, 4.0, 1.0, 2.0, 3.0, 6.0, 4.0, 7.0, 3.0, 4.0, 8.0, 7.0, 6.0, 10.0, 10.0, 19.0, 27.0, 85.0], [4159.0, 3435.0, 2969.0, 2220.0, 1764.0, 1302.0, 949.0, 746.0, 560.0, 427.0, 313.0, 233.0, 155.0, 123.0, 82.0, 50.0, 42.0, 35.0, 22.0, 22.0, 9.0, 4.0, 3.0, 8.0, 5.0, 2.0, 5.0, 1.0, 2.0, 1.0, 2.0, 2.0, 0.0, 1.0, 2.0, 1.0, 4.0, 4.0, 7.0, 2.0, 5.0, 7.0, 6.0, 8.0, 11.0, 2.0, 10.0, 28.0, 50.0], [3114.0, 2962.0, 2779.0, 2381.0, 2030.0, 1697.0, 1394.0, 1130.0, 951.0, 719.0, 582.0, 468.0, 325.0, 269.0, 216.0, 165.0, 113.0, 106.0, 73.0, 56.0, 32.0, 29.0, 17.0, 11.0, 10.0, 9.0, 8.0, 6.0, 6.0, 2.0, 1.0, 3.0, 2.0, 5.0, 0.0, 2.0, 3.0, 1.0, 2.0, 0.0, 3.0, 2.0, 2.0, 3.0, 6.0, 14.0, 8.0, 23.0, 40.0], [2075.0, 2147.0, 2178.0, 2132.0, 1930.0, 1696.0, 1607.0, 1508.0, 1278.0, 1011.0, 895.0, 758.0, 632.0, 533.0, 414.0, 367.0, 299.0, 230.0, 210.0, 161.0, 105.0, 103.0, 69.0, 54.0, 41.0, 39.0, 29.0, 12.0, 16.0, 13.0, 7.0, 6.0, 2.0, 4.0, 2.0, 1.0, 3.0, 2.0, 4.0, 2.0, 4.0, 3.0, 2.0, 5.0, 5.0, 2.0, 13.0, 12.0, 26.0], [1327.0, 1393.0, 1595.0, 1636.0, 1592.0, 1590.0, 1548.0, 1487.0, 1333.0, 1229.0, 1182.0, 984.0, 911.0, 812.0, 705.0, 605.0, 613.0, 507.0, 421.0, 335.0, 316.0, 258.0, 198.0, 159.0, 132.0, 108.0, 79.0, 68.0, 53.0, 38.0, 37.0, 27.0, 21.0, 12.0, 17.0, 4.0, 8.0, 10.0, 4.0, 2.0, 3.0, 3.0, 2.0, 4.0, 3.0, 5.0, 9.0, 4.0, 18.0], [870.0, 923.0, 992.0, 1102.0, 1187.0, 1253.0, 1234.0, 1260.0, 1253.0, 1267.0, 1206.0, 1148.0, 1090.0, 987.0, 991.0, 904.0, 832.0, 718.0, 681.0, 594.0, 550.0, 428.0, 397.0, 356.0, 283.0, 257.0, 222.0, 178.0, 157.0, 129.0, 112.0, 67.0, 79.0, 47.0, 53.0, 28.0, 25.0, 17.0, 17.0, 18.0, 8.0, 6.0, 4.0, 4.0, 2.0, 4.0, 3.0, 5.0, 16.0], [716.0, 675.0, 795.0, 797.0, 843.0, 858.0, 929.0, 928.0, 1010.0, 1036.0, 1044.0, 1053.0, 995.0, 1022.0, 1024.0, 919.0, 922.0, 882.0, 856.0, 819.0, 682.0, 645.0, 592.0, 553.0, 534.0, 424.0, 422.0, 322.0, 313.0, 258.0, 234.0, 204.0, 149.0, 138.0, 107.0, 80.0, 74.0, 62.0, 35.0, 36.0, 22.0, 23.0, 21.0, 10.0, 9.0, 7.0, 6.0, 6.0, 10.0], [545.0, 510.0, 504.0, 491.0, 480.0, 517.0, 604.0, 677.0, 686.0, 716.0, 820.0, 765.0, 814.0, 874.0, 885.0, 954.0, 869.0, 895.0, 840.0, 835.0, 821.0, 883.0, 780.0, 743.0, 766.0, 698.0, 658.0, 554.0, 554.0, 499.0, 497.0, 403.0, 355.0, 294.0, 257.0, 215.0, 190.0, 180.0, 126.0, 109.0, 92.0, 64.0, 57.0, 49.0, 21.0, 19.0, 9.0, 10.0, 18.0], [382.0, 343.0, 341.0, 348.0, 355.0, 359.0, 359.0, 439.0, 443.0, 460.0, 536.0, 570.0, 607.0, 626.0, 683.0, 705.0, 698.0, 729.0, 752.0, 811.0, 786.0, 881.0, 833.0, 842.0, 874.0, 797.0, 777.0, 806.0, 800.0, 683.0, 731.0, 653.0, 584.0, 519.0, 541.0, 464.0, 399.0, 332.0, 345.0, 257.0, 230.0, 171.0, 157.0, 112.0, 91.0, 59.0, 44.0, 35.0, 21.0], [369.0, 360.0, 268.0, 267.0, 249.0, 297.0, 306.0, 289.0, 334.0, 328.0, 323.0, 369.0, 408.0, 428.0, 474.0, 484.0, 530.0, 561.0, 563.0, 643.0, 612.0, 682.0, 723.0, 759.0, 729.0, 754.0, 828.0, 830.0, 770.0, 820.0, 842.0, 820.0, 850.0, 784.0, 743.0, 670.0, 652.0, 593.0, 562.0, 507.0, 452.0, 352.0, 331.0, 266.0, 219.0, 177.0, 115.0, 91.0, 70.0], [334.0, 268.0, 266.0, 285.0, 264.0, 263.0, 246.0, 226.0, 217.0, 259.0, 233.0, 244.0, 269.0, 289.0, 259.0, 296.0, 295.0, 329.0, 355.0, 405.0, 483.0, 497.0, 538.0, 550.0, 602.0, 558.0, 670.0, 688.0, 731.0, 795.0, 837.0, 840.0, 800.0, 837.0, 864.0, 808.0, 869.0, 879.0, 825.0, 810.0, 755.0, 688.0, 596.0, 537.0, 514.0, 414.0, 312.0, 233.0, 171.0], [296.0, 216.0, 171.0, 187.0, 194.0, 200.0, 165.0, 161.0, 170.0, 162.0, 171.0, 179.0, 195.0, 189.0, 176.0, 214.0, 223.0, 223.0, 257.0, 277.0, 267.0, 324.0, 325.0, 405.0, 396.0, 423.0, 460.0, 550.0, 571.0, 591.0, 670.0, 712.0, 790.0, 840.0, 819.0, 934.0, 880.0, 999.0, 996.0, 1018.0, 1046.0, 960.0, 1018.0, 946.0, 865.0, 789.0, 691.0, 530.0, 406.0], [274.0, 152.0, 179.0, 210.0, 226.0, 233.0, 197.0, 164.0, 139.0, 145.0, 172.0, 144.0, 150.0, 160.0, 157.0, 175.0, 173.0, 181.0, 171.0, 172.0, 175.0, 197.0, 189.0, 215.0, 225.0, 249.0, 304.0, 335.0, 350.0, 404.0, 442.0, 543.0, 605.0, 647.0, 723.0, 764.0, 834.0, 855.0, 1030.0, 1104.0, 1150.0, 1144.0, 1204.0, 1245.0, 1288.0, 1166.0, 1117.0, 1034.0, 811.0], [137.0, 165.0, 153.0, 144.0, 170.0, 119.0, 139.0, 124.0, 143.0, 96.0, 148.0, 164.0, 190.0, 192.0, 143.0, 197.0, 165.0, 157.0, 128.0, 148.0, 162.0, 162.0, 153.0, 186.0, 191.0, 193.0, 208.0, 258.0, 268.0, 305.0, 296.0, 332.0, 384.0, 458.0, 454.0, 553.0, 616.0, 714.0, 802.0, 909.0, 1026.0, 1185.0, 1303.0, 1374.0, 1511.0, 1572.0, 1583.0, 1613.0, 1497.0], [160.0, 74.0, 100.0, 138.0, 113.0, 108.0, 104.0, 91.0, 120.0, 117.0, 118.0, 125.0, 113.0, 120.0, 157.0, 106.0, 136.0, 98.0, 79.0, 100.0, 100.0, 108.0, 101.0, 121.0, 125.0, 155.0, 175.0, 161.0, 183.0, 183.0, 217.0, 196.0, 185.0, 249.0, 268.0, 355.0, 399.0, 534.0, 574.0, 606.0, 833.0, 1004.0, 1166.0, 1404.0, 1559.0, 1748.0, 2065.0, 2248.0, 2531.0], [140.0, 224.0, 167.0, 222.0, 160.0, 159.0, 192.0, 90.0, 139.0, 121.0, 143.0, 105.0, 174.0, 145.0, 77.0, 81.0, 81.0, 79.0, 82.0, 95.0, 104.0, 161.0, 144.0, 123.0, 84.0, 120.0, 115.0, 101.0, 96.0, 76.0, 93.0, 92.0, 117.0, 136.0, 154.0, 185.0, 238.0, 312.0, 355.0, 465.0, 549.0, 668.0, 802.0, 1084.0, 1328.0, 1651.0, 2092.0, 2585.0, 3233.0], [121.0, 157.0, 140.0, 220.0, 147.0, 98.0, 76.0, 82.0, 68.0, 186.0, 173.0, 187.0, 136.0, 107.0, 67.0, 56.0, 57.0, 96.0, 104.0, 105.0, 85.0, 108.0, 121.0, 154.0, 87.0, 95.0, 47.0, 51.0, 68.0, 69.0, 82.0, 95.0, 162.0, 157.0, 114.0, 143.0, 176.0, 168.0, 216.0, 244.0, 356.0, 397.0, 541.0, 788.0, 973.0, 1413.0, 1965.0, 2704.0, 3906.0], [292.0, 93.0, 114.0, 138.0, 109.0, 193.0, 112.0, 183.0, 94.0, 151.0, 155.0, 76.0, 85.0, 166.0, 90.0, 92.0, 120.0, 128.0, 151.0, 119.0, 66.0, 40.0, 43.0, 104.0, 109.0, 84.0, 45.0, 86.0, 77.0, 81.0, 66.0, 81.0, 97.0, 89.0, 84.0, 60.0, 63.0, 112.0, 148.0, 149.0, 228.0, 302.0, 364.0, 454.0, 642.0, 946.0, 1491.0, 2361.0, 3947.0], [228.0, 136.0, 56.0, 112.0, 97.0, 153.0, 113.0, 93.0, 125.0, 90.0, 49.0, 26.0, 53.0, 82.0, 203.0, 108.0, 114.0, 114.0, 142.0, 90.0, 151.0, 112.0, 96.0, 124.0, 96.0, 128.0, 117.0, 81.0, 166.0, 91.0, 79.0, 128.0, 110.0, 57.0, 64.0, 109.0, 105.0, 50.0, 58.0, 132.0, 171.0, 202.0, 221.0, 195.0, 347.0, 592.0, 1064.0, 1839.0, 3654.0], [168.0, 141.0, 117.0, 196.0, 161.0, 192.0, 139.0, 115.0, 68.0, 100.0, 174.0, 94.0, 143.0, 187.0, 121.0, 155.0, 192.0, 107.0, 74.0, 132.0, 198.0, 73.0, 84.0, 82.0, 105.0, 98.0, 142.0, 80.0, 113.0, 144.0, 88.0, 64.0, 121.0, 56.0, 67.0, 46.0, 55.0, 47.0, 61.0, 52.0, 80.0, 91.0, 82.0, 109.0, 249.0, 398.0, 615.0, 1263.0, 3017.0], [248.0, 142.0, 278.0, 166.0, 89.0, 121.0, 173.0, 118.0, 115.0, 124.0, 73.0, 135.0, 69.0, 71.0, 119.0, 68.0, 109.0, 80.0, 147.0, 93.0, 75.0, 73.0, 61.0, 132.0, 83.0, 136.0, 110.0, 125.0, 182.0, 133.0, 98.0, 199.0, 122.0, 71.0, 30.0, 132.0, 77.0, 90.0, 149.0, 64.0, 77.0, 88.0, 62.0, 87.0, 178.0, 197.0, 400.0, 765.0, 2267.0], [203.0, 160.0, 170.0, 133.0, 146.0, 54.0, 139.0, 125.0, 132.0, 49.0, 71.0, 162.0, 116.0, 109.0, 67.0, 103.0, 119.0, 146.0, 76.0, 50.0, 75.0, 82.0, 120.0, 82.0, 59.0, 57.0, 102.0, 62.0, 92.0, 155.0, 160.0, 75.0, 10.0, 149.0, 111.0, 136.0, 56.0, 56.0, 65.0, 67.0, 159.0, 83.0, 62.0, 75.0, 51.0, 81.0, 264.0, 547.0, 1687.0], [183.0, 137.0, 65.0, 54.0, 106.0, 167.0, 214.0, 127.0, 56.0, 92.0, 200.0, 114.0, 131.0, 91.0, 131.0, 46.0, 85.0, 250.0, 143.0, 92.0, 113.0, 151.0, 110.0, 121.0, 43.0, 83.0, 46.0, 51.0, 113.0, 72.0, 153.0, 70.0, 41.0, 93.0, 92.0, 47.0, 61.0, 85.0, 43.0, 52.0, 136.0, 112.0, 147.0, 115.0, 57.0, 167.0, 167.0, 327.0, 1051.0], [113.0, 90.0, 209.0, 138.0, 45.0, 119.0, 97.0, 89.0, 73.0, 74.0, 129.0, 147.0, 136.0, 123.0, 61.0, 132.0, 135.0, 103.0, 53.0, 100.0, 153.0, 155.0, 185.0, 122.0, 148.0, 61.0, 63.0, 106.0, 144.0, 113.0, 69.0, 89.0, 121.0, 20.0, 62.0, 33.0, 74.0, 87.0, 53.0, 80.0, 56.0, 51.0, 61.0, 118.0, 104.0, 99.0, 116.0, 189.0, 731.0], [135.0, 156.0, 138.0, 83.0, 40.0, 101.0, 140.0, 108.0, 79.0, 157.0, 74.0, 125.0, 90.0, 41.0, 86.0, 141.0, 159.0, 112.0, 113.0, 82.0, 242.0, 124.0, 68.0, 105.0, 120.0, 73.0, 111.0, 187.0, 102.0, 98.0, 147.0, 67.0, 115.0, 97.0, 107.0, 100.0, 136.0, 57.0, 18.0, 23.0, 90.0, 119.0, 81.0, 49.0, 75.0, 118.0, 58.0, 127.0, 425.0], [129.0, 233.0, 155.0, 57.0, 155.0, 272.0, 189.0, 138.0, 127.0, 79.0, 82.0, 102.0, 133.0, 107.0, 99.0, 96.0, 119.0, 133.0, 86.0, 112.0, 149.0, 46.0, 129.0, 146.0, 152.0, 121.0, 144.0, 48.0, 112.0, 57.0, 124.0, 64.0, 85.0, 77.0, 83.0, 59.0, 83.0, 47.0, 134.0, 74.0, 105.0, 103.0, 73.0, 84.0, 70.0, 73.0, 75.0, 140.0, 330.0], [214.0, 177.0, 186.0, 188.0, 195.0, 68.0, 164.0, 188.0, 154.0, 56.0, 173.0, 92.0, 100.0, 127.0, 100.0, 80.0, 71.0, 108.0, 99.0, 143.0, 120.0, 92.0, 107.0, 104.0, 94.0, 114.0, 107.0, 65.0, 83.0, 73.0, 102.0, 55.0, 96.0, 122.0, 66.0, 131.0, 82.0, 101.0, 83.0, 103.0, 110.0, 69.0, 125.0, 52.0, 68.0, 109.0, 81.0, 85.0, 149.0], [128.0, 176.0, 175.0, 219.0, 149.0, 121.0, 197.0, 52.0, 105.0, 181.0, 127.0, 93.0, 83.0, 170.0, 117.0, 103.0, 66.0, 50.0, 155.0, 125.0, 48.0, 61.0, 45.0, 45.0, 99.0, 150.0, 118.0, 142.0, 66.0, 57.0, 105.0, 141.0, 26.0, 55.0, 40.0, 80.0, 62.0, 89.0, 128.0, 109.0, 81.0, 34.0, 69.0, 16.0, 15.0, 99.0, 135.0, 103.0, 174.0], [148.0, 125.0, 138.0, 139.0, 143.0, 165.0, 146.0, 61.0, 97.0, 145.0, 131.0, 56.0, 26.0, 39.0, 69.0, 136.0, 126.0, 92.0, 121.0, 101.0, 54.0, 73.0, 41.0, 116.0, 91.0, 72.0, 55.0, 82.0, 108.0, 69.0, 36.0, 122.0, 58.0, 75.0, 87.0, 61.0, 81.0, 72.0, 39.0, 37.0, 109.0, 145.0, 98.0, 120.0, 109.0, 94.0, 39.0, 62.0, 80.0], [118.0, 149.0, 51.0, 132.0, 136.0, 115.0, 95.0, 94.0, 100.0, 151.0, 180.0, 121.0, 103.0, 110.0, 108.0, 88.0, 48.0, 230.0, 140.0, 74.0, 50.0, 94.0, 134.0, 99.0, 72.0, 61.0, 37.0, 23.0, 82.0, 107.0, 139.0, 136.0, 86.0, 116.0, 96.0, 123.0, 61.0, 81.0, 66.0, 95.0, 65.0, 82.0, 28.0, 36.0, 16.0, 78.0, 55.0, 113.0, 117.0], [104.0, 113.0, 65.0, 78.0, 143.0, 114.0, 94.0, 121.0, 72.0, 78.0, 145.0, 68.0, 41.0, 77.0, 90.0, 153.0, 88.0, 138.0, 84.0, 73.0, 114.0, 73.0, 87.0, 159.0, 87.0, 33.0, 49.0, 103.0, 105.0, 100.0, 68.0, 70.0, 66.0, 158.0, 52.0, 42.0, 43.0, 94.0, 27.0, 79.0, 82.0, 21.0, 68.0, 72.0, 68.0, 79.0, 63.0, 42.0, 33.0], [94.0, 114.0, 129.0, 98.0, 32.0, 81.0, 128.0, 73.0, 61.0, 121.0, 37.0, 34.0, 72.0, 99.0, 150.0, 98.0, 93.0, 68.0, 74.0, 101.0, 110.0, 40.0, 68.0, 47.0, 88.0, 91.0, 60.0, 90.0, 88.0, 65.0, 119.0, 57.0, 62.0, 144.0, 87.0, 50.0, 27.0, 109.0, 75.0, 45.0, 37.0, 91.0, 21.0, 77.0, 78.0, 70.0, 91.0, 55.0, 146.0]],
    "Name": "sCurve-0",
    "Overflow": 2351654.0,
    "Type": "Histo2d",
    "Underflow": 0.0,
    "x": {
        "AxisTitle": "Vcal",
        "Bins": 51,
        "High": 302.5,
        "Low": 47.5
    },
    "y": {
        "AxisTitle": "Occupancy",
        "Bins": 49,
        "High": 49.5,
        "Low": 0.5
    },
    "z": {
        "AxisTitle": "Number of pixels"
    }
}