{
    "Data": [0.0, 0.0, 0.0, 0.0, 0.0, 0.0, 0.0, 0.0, 0.0, 0.0, 0.0, 0.0, 0.0, 0.0, 0.0, 0.0, 0.0, 0.0, 0.0, 0.0, 0.0, 0.0, 0.0, 0.0, 0.0, 0.0, 0.0, 0.0, 0.0, 0.0, 0.0, 0.0, 0.0, 0.0, 0.0, 0.0, 0.0, 0.0, 0.0, 0.0, 0.0, 0.0, 0.0, 0.0, 0.0, 0.0, 0.0, 0.0, 0.0, 0.0, 10.0, 18.0, 21.0, 19.0, 22.0, 33.0, 23.0, 33.0, 34.0, 29.0, 42.0, 52.0, 43.0, 67.0, 65.0, 77.0, 118.0, 135.0, 168.0, 168.0, 209.0, 234.0, 268.0, 305.0, 399.0, 474.0, 540.0, 598.0, 670.0, 733.0, 832.0, 921.0, 951.0, 1036.0, 1096.0, 1068.0, 1117.0, 1233.0, 1483.0, 1750.0, 2271.0, 2729.0, 3335.0, 3716.0, 3683.0, 3728.0, 3365.0, 2761.0, 2127.0, 1677.0, 1257.0, 907.0, 677.0, 495.0, 394.0, 276.0, 210.0, 169.0, 142.0, 93.0, 97.0, 72.0, 67.0, 52.0, 44.0, 32.0, 34.0, 36.0, 31.0, 21.0, 24.0, 16.0, 24.0, 19.0, 19.0, 20.0, 11.0, 8.0, 13.0, 20.0, 11.0, 12.0, 5.0, 10.0, 14.0, 9.0, 12.0, 11.0, 5.0, 7.0, 6.0, 9.0, 9.0, 13.0, 5.0, 3.0, 5.0, 5.0, 5.0, 3.0, 7.0, 6.0, 4.0, 2.0, 1.0, 5.0, 3.0, 0.0, 6.0, 7.0, 5.0, 9.0, 8.0, 12.0, 15.0, 25.0, 19.0, 33.0, 50.0, 45.0, 57.0, 75.0, 90.0, 89.0, 133.0, 150.0, 178.0, 233.0, 256.0, 304.0, 327.0, 349.0, 436.0, 463.0, 491.0, 532.0, 569.0, 581.0, 657.0, 710.0, 746.0, 770.0, 814.0, 779.0, 811.0, 860.0, 789.0, 835.0, 836.0, 754.0, 763.0, 715.0, 689.0, 689.0, 677.0, 645.0, 558.0, 560.0, 482.0, 467.0, 406.0, 373.0, 339.0, 313.0, 245.0, 241.0, 232.0, 188.0, 150.0, 140.0, 140.0, 119.0, 100.0, 69.0, 70.0, 48.0, 36.0, 49.0, 34.0, 19.0, 22.0, 13.0, 15.0, 14.0, 17.0, 11.0, 7.0, 4.0, 8.0, 4.0, 5.0, 1.0, 4.0, 1.0, 0.0, 0.0, 2.0, 0.0, 0.0, 0.0, 0.0, 0.0, 0.0, 0.0, 0.0, 0.0, 0.0, 0.0, 0.0, 0.0, 1.0, 0.0, 0.0, 0.0, 0.0, 0.0, 0.0, 0.0, 0.0, 0.0, 0.0, 0.0, 0.0, 0.0, 0.0, 0.0, 0.0, 0.0, 0.0, 1.0, 0.0, 0.0, 0.0, 0.0, 0.0, 1.0, 0.0, 0.0, 0.0, 0.0, 0.0, 0.0, 0.0, 0.0, 0.0, 0.0, 0.0, 0.0, 0.0, 0.0, 0.0, 0.0, 0.0, 0.0, 0.0, 0.0, 0.0, 0.0, 0.0, 0.0, 0.0, 0.0, 0.0, 0.0, 0.0, 0.0, 0.0, 0.0, 0.0, 0.0, 0.0, 0.0, 0.0, 0.0, 0.0, 0.0, 0.0, 0.0, 0.0, 0.0, 0.0, 0.0, 0.0, 0.0, 0.0, 0.0, 0.0, 0.0, 0.0, 0.0, 0.0, 0.0, 0.0, 0.0, 0.0, 0.0, 0.0, 0.0, 0.0, 0.0, 0.0, 0.0, 0.0, 0.0, 0.0, 0.0, 0.0, 0.0, 0.0, 0.0, 0.0, 0.0, 0.0, 0.0, 0.0, 0.0, 0.0, 0.0, 0.0, 0.0, 0.0, 0.0, 0.0, 0.0, 0.0, 0.0],
    "Name": "ThresholdDist-0",
    "Overflow": 0.0,
    "Type": "Histo1d",
    "Underflow": 0.0,
    "x": {
        "AxisTitle": "Threshold [e]",
        "Bins": 376,
        "High": 3755.0,
        "Low": -5.0
    },
    "y": {
        "AxisTitle": "Number of Pixels"
    },
    "z": {
        "AxisTitle": "z"
    }
}