{
    "Data": [7.0, 2126.0, 13691.0, 18369.0, 11783.0, 4612.0, 1262.0, 356.0, 143.0, 102.0, 114.0, 112.0, 144.0, 179.0, 243.0, 263.0, 355.0, 360.0, 450.0, 517.0, 503.0, 572.0, 620.0, 599.0, 691.0, 684.0, 707.0, 685.0, 663.0, 709.0, 670.0, 674.0, 651.0, 624.0, 634.0, 653.0, 586.0, 616.0, 645.0, 542.0, 492.0, 528.0, 449.0, 460.0, 427.0, 443.0, 400.0, 366.0, 351.0, 357.0, 162.0],
    "Name": "Chi2Dist-0",
    "Overflow": 0.0,
    "Type": "Histo1d",
    "Underflow": 0.0,
    "x": {
        "AxisTitle": "Fit Chi/ndf",
        "Bins": 51,
        "High": 2.5250000953674318,
        "Low": -0.02500000037252903
    },
    "y": {
        "AxisTitle": "Number of Pixels"
    },
    "z": {
        "AxisTitle": "z"
    }
}