{
    "Data": [0.0, 0.0, 0.0, 0.0, 0.0, 0.0, 0.0, 0.0, 0.0, 0.0, 0.0, 0.0, 0.0, 0.0, 0.0, 0.0, 0.0, 0.0, 1.0, 1.0, 0.0, 0.0, 3.0, 1.0, 4.0, 6.0, 1.0, 4.0, 10.0, 2.0, 1.0, 15.0, 5.0, 20.0, 28.0, 43.0, 2.0, 42.0, 16.0, 14.0, 3.0, 14.0, 9.0, 50.0, 4.0, 22.0, 3.0, 33.0, 6.0, 1.0, 6.0],
    "Name": "Scurve-90-96",
    "Overflow": 0.0,
    "Type": "Histo1d",
    "Underflow": 0.0,
    "x": {
        "AxisTitle": "Vcal",
        "Bins": 51,
        "High": 302.5,
        "Low": 47.5
    },
    "y": {
        "AxisTitle": "Occupancy"
    },
    "z": {
        "AxisTitle": "z"
    }
}