{
    "Data": [0.0, 0.0, 0.0, 0.0, 0.0, 0.0, 0.0, 0.0, 0.0, 0.0, 0.0, 0.0, 0.0, 0.0, 2.0, 0.0, 0.0, 1.0, 2.0, 0.0, 0.0, 2.0, 0.0, 0.0, 0.0, 2.0, 4.0, 10.0, 17.0, 15.0, 21.0, 30.0, 16.0, 7.0, 20.0, 40.0, 35.0, 118.0, 311.0, 362.0, 260.0, 490.0, 1051.0, 2548.0, 1960.0, 1344.0, 1829.0, 2744.0, 3518.0, 2949.0, 2503.0, 2106.0, 2639.0, 2210.0, 1830.0, 1720.0, 1574.0, 1796.0, 1629.0, 1393.0, 1197.0, 1129.0, 991.0, 775.0, 637.0, 569.0, 695.0, 577.0, 476.0, 417.0, 370.0, 455.0, 356.0, 268.0, 258.0, 226.0, 241.0, 202.0, 188.0, 145.0, 171.0, 134.0, 114.0, 83.0, 92.0, 118.0, 111.0, 86.0, 94.0, 68.0, 58.0, 59.0, 59.0, 49.0, 36.0, 34.0, 31.0, 37.0, 47.0, 38.0, 26.0, 23.0, 16.0, 25.0, 20.0, 17.0, 32.0, 20.0, 20.0, 15.0, 13.0, 11.0, 7.0, 12.0, 11.0, 9.0, 7.0, 10.0, 6.0, 14.0, 6.0, 7.0, 5.0, 7.0, 6.0, 2.0, 6.0, 2.0, 5.0, 10.0, 4.0, 4.0, 7.0, 4.0, 6.0, 4.0, 3.0, 5.0, 2.0, 6.0, 5.0, 6.0, 4.0, 4.0, 3.0, 4.0, 3.0, 2.0, 1.0, 1.0, 3.0, 0.0, 3.0, 3.0, 3.0, 1.0, 1.0, 1.0, 1.0, 2.0, 3.0, 3.0, 0.0, 2.0, 0.0, 0.0, 0.0, 0.0, 2.0, 1.0, 1.0, 1.0, 2.0, 3.0, 3.0, 1.0, 1.0, 0.0, 1.0, 2.0, 1.0, 2.0, 2.0, 1.0, 4.0, 0.0, 2.0, 0.0, 1.0, 2.0, 1.0, 1.0, 3.0, 4.0, 3.0, 4.0, 6.0, 6.0, 3.0, 5.0, 1.0],
    "Name": "TimePerFitDist-0",
    "Overflow": 383.0,
    "Type": "Histo1d",
    "Underflow": 0.0,
    "x": {
        "AxisTitle": "Fit Time [us]",
        "Bins": 201,
        "High": 401.0,
        "Low": -1.0
    },
    "y": {
        "AxisTitle": "Number of Pixels"
    },
    "z": {
        "AxisTitle": "z"
    }
}