time,Hardware,Voltage,Current
1621390402718,high-voltage-2,1,0.118159
time,Hardware,Voltage,Current
1621390402718,high-voltage-2,2,0.141856
time,Hardware,Voltage,Current
1621390402718,high-voltage-2,3,0.156184
time,Hardware,Voltage,Current
1621390402718,high-voltage-2,4,0.165999
time,Hardware,Voltage,Current
1621390402718,high-voltage-2,5,0.17644
time,Hardware,Voltage,Current
1621390402718,high-voltage-2,6,0.190857
time,Hardware,Voltage,Current
1621390402718,high-voltage-2,7,0.20401
time,Hardware,Voltage,Current
1621390402718,high-voltage-2,8,0.222033
time,Hardware,Voltage,Current
1621390402718,high-voltage-2,9,0.240126
time,Hardware,Voltage,Current
1621390402718,high-voltage-2,10,0.259454
time,Hardware,Voltage,Current
1621390402718,high-voltage-2,11,0.281741
time,Hardware,Voltage,Current
1621390402718,high-voltage-2,12,0.303924
time,Hardware,Voltage,Current
1621390402718,high-voltage-2,13,0.326582
time,Hardware,Voltage,Current
1621390402718,high-voltage-2,14,0.349019
time,Hardware,Voltage,Current
1621390402718,high-voltage-2,15,0.366045
time,Hardware,Voltage,Current
1621390402718,high-voltage-2,16,0.383383
time,Hardware,Voltage,Current
1621390402718,high-voltage-2,17,0.400616
time,Hardware,Voltage,Current
1621390402718,high-voltage-2,18,0.414973
time,Hardware,Voltage,Current
1621390402718,high-voltage-2,19,0.426019
time,Hardware,Voltage,Current
1621390402718,high-voltage-2,20,0.438265
time,Hardware,Voltage,Current
1621390402718,high-voltage-2,25,0.494127
time,Hardware,Voltage,Current
1621390402718,high-voltage-2,30,0.544896
time,Hardware,Voltage,Current
1621390402718,high-voltage-2,35,0.597634
time,Hardware,Voltage,Current
1621390402718,high-voltage-2,40,0.654243
time,Hardware,Voltage,Current
1621390402718,high-voltage-2,45,0.728154
time,Hardware,Voltage,Current
1621390402718,high-voltage-2,50,0.782512
time,Hardware,Voltage,Current
1621390402718,high-voltage-2,55,0.831591
time,Hardware,Voltage,Current
1621390402718,high-voltage-2,60,0.87628
time,Hardware,Voltage,Current
1621390402718,high-voltage-2,65,0.923004
time,Hardware,Voltage,Current
1621390402718,high-voltage-2,70,0.966046
time,Hardware,Voltage,Current
1621390402718,high-voltage-2,75,1.00661
time,Hardware,Voltage,Current
1621390402718,high-voltage-2,80,1.04857
time,Hardware,Voltage,Current
1621390402718,high-voltage-2,85,1.08732
time,Hardware,Voltage,Current
1621390402718,high-voltage-2,90,1.12433
time,Hardware,Voltage,Current
1621390402718,high-voltage-2,95,1.16292
time,Hardware,Voltage,Current
1621390402718,high-voltage-2,100,1.19693
