{
    "Data": [92.0, 657.0, 96.0, 38.0, 76.0, 86.0, 82.0, 83.0, 66.0, 116.0, 159.0, 314.0, 533.0, 825.0, 1256.0, 1670.0, 2287.0, 2597.0, 2957.0, 3023.0, 2958.0, 2718.0, 2418.0, 2302.0, 2331.0, 2655.0, 3191.0, 3436.0, 3618.0, 3482.0, 3058.0, 2386.0, 1705.0, 1125.0, 812.0, 608.0, 458.0, 366.0, 350.0, 295.0, 333.0, 321.0, 338.0, 326.0, 310.0, 340.0, 348.0, 347.0, 351.0, 382.0, 352.0, 342.0, 373.0, 323.0, 373.0, 360.0, 294.0, 312.0, 291.0, 310.0, 302.0, 259.0, 317.0, 261.0, 233.0, 245.0, 218.0, 226.0, 199.0, 229.0, 206.0, 218.0, 220.0, 188.0, 173.0, 211.0, 165.0, 160.0, 144.0, 122.0, 142.0, 123.0, 112.0, 117.0, 114.0, 104.0, 101.0, 105.0, 94.0, 73.0, 87.0, 66.0, 85.0, 82.0, 73.0, 67.0, 52.0, 66.0, 66.0, 58.0, 49.0, 58.0, 60.0, 54.0, 53.0, 46.0, 53.0, 41.0, 45.0, 53.0, 54.0, 35.0, 35.0, 25.0, 29.0, 32.0, 31.0, 28.0, 25.0, 32.0, 21.0, 27.0, 27.0, 32.0, 26.0, 35.0, 31.0, 20.0, 23.0, 18.0, 18.0, 24.0, 12.0, 23.0, 13.0, 20.0, 13.0, 16.0, 11.0, 14.0, 20.0, 13.0, 17.0, 13.0, 12.0, 21.0, 9.0, 12.0],
    "Name": "NoiseDist-0",
    "Overflow": 340.0,
    "Type": "Histo1d",
    "Underflow": 0.0,
    "x": {
        "AxisTitle": "Noise [e]",
        "Bins": 148,
        "High": 741.0,
        "Low": -2.0
    },
    "y": {
        "AxisTitle": "Number of Pixels"
    },
    "z": {
        "AxisTitle": "z"
    }
}