{
    "Data": [0.0, 0.0, 0.0, 0.0, 0.0, 0.0, 0.0, 0.0, 0.0, 0.0, 0.0, 0.0, 0.0, 0.0, 0.0, 0.0, 0.0, 0.0, 0.0, 0.0, 0.0, 0.0, 0.0, 0.0, 0.0, 0.0, 0.0, 0.0, 0.0, 0.0, 0.0, 0.0, 0.0, 0.0, 0.0, 0.0, 0.0, 0.0, 0.0, 0.0, 0.0, 0.0, 0.0, 0.0, 0.0, 0.0, 0.0, 0.0, 0.0, 0.0, 4.0, 9.0, 4.0, 3.0, 7.0, 7.0, 8.0, 10.0, 8.0, 14.0, 14.0, 10.0, 9.0, 15.0, 19.0, 15.0, 15.0, 36.0, 50.0, 56.0, 72.0, 81.0, 98.0, 144.0, 170.0, 237.0, 258.0, 368.0, 455.0, 510.0, 633.0, 780.0, 822.0, 971.0, 1095.0, 1240.0, 1318.0, 1360.0, 1502.0, 1620.0, 1792.0, 2096.0, 2687.0, 3392.0, 4057.0, 4567.0, 4505.0, 3922.0, 3311.0, 2384.0, 1582.0, 1005.0, 693.0, 420.0, 261.0, 213.0, 168.0, 121.0, 98.0, 66.0, 54.0, 53.0, 35.0, 45.0, 31.0, 33.0, 29.0, 31.0, 21.0, 30.0, 26.0, 15.0, 25.0, 17.0, 17.0, 16.0, 11.0, 14.0, 16.0, 8.0, 7.0, 10.0, 8.0, 15.0, 12.0, 8.0, 10.0, 7.0, 10.0, 12.0, 6.0, 9.0, 11.0, 7.0, 6.0, 3.0, 7.0, 6.0, 2.0, 4.0, 11.0, 1.0, 5.0, 1.0, 2.0, 5.0, 2.0, 2.0, 3.0, 3.0, 5.0, 3.0, 3.0, 6.0, 11.0, 7.0, 7.0, 8.0, 9.0, 17.0, 20.0, 22.0, 32.0, 38.0, 46.0, 52.0, 77.0, 79.0, 94.0, 126.0, 129.0, 162.0, 194.0, 204.0, 235.0, 293.0, 322.0, 349.0, 437.0, 485.0, 520.0, 581.0, 618.0, 639.0, 628.0, 730.0, 734.0, 778.0, 765.0, 830.0, 776.0, 777.0, 762.0, 728.0, 710.0, 738.0, 639.0, 649.0, 639.0, 533.0, 520.0, 478.0, 475.0, 413.0, 341.0, 346.0, 314.0, 253.0, 213.0, 185.0, 163.0, 153.0, 159.0, 124.0, 109.0, 85.0, 79.0, 59.0, 72.0, 53.0, 40.0, 36.0, 28.0, 40.0, 24.0, 26.0, 20.0, 25.0, 13.0, 14.0, 15.0, 10.0, 11.0, 22.0, 9.0, 13.0, 13.0, 10.0, 5.0, 8.0, 3.0, 6.0, 10.0, 5.0, 9.0, 1.0, 4.0, 4.0, 5.0, 5.0, 5.0, 2.0, 1.0, 3.0, 5.0, 4.0, 2.0, 6.0, 2.0, 1.0, 6.0, 1.0, 2.0, 5.0, 1.0, 1.0, 3.0, 0.0, 2.0, 0.0, 0.0, 0.0, 1.0, 1.0, 0.0, 2.0, 1.0, 4.0, 0.0, 3.0, 0.0, 2.0, 0.0, 2.0, 2.0, 3.0, 3.0, 3.0, 0.0, 1.0, 0.0, 1.0, 1.0, 1.0, 2.0, 0.0, 0.0, 2.0, 1.0, 2.0, 2.0, 1.0, 1.0, 1.0, 0.0, 2.0, 0.0, 0.0, 0.0, 1.0, 1.0, 0.0, 0.0, 0.0, 0.0, 1.0, 0.0, 0.0, 0.0, 0.0, 0.0, 0.0, 0.0, 0.0, 0.0, 0.0, 0.0, 0.0, 0.0, 0.0, 0.0, 0.0, 0.0, 0.0, 0.0, 0.0, 0.0, 0.0, 0.0, 0.0, 0.0, 0.0, 0.0, 0.0, 0.0, 0.0, 0.0, 0.0, 0.0, 0.0, 0.0, 0.0, 0.0, 0.0, 0.0, 0.0, 0.0, 0.0, 0.0, 0.0, 0.0, 0.0, 0.0, 0.0, 0.0, 0.0],
    "Name": "ThresholdDist-0",
    "Overflow": 0.0,
    "Type": "Histo1d",
    "Underflow": 0.0,
    "x": {
        "AxisTitle": "Threshold [e]",
        "Bins": 376,
        "High": 3755.0,
        "Low": -5.0
    },
    "y": {
        "AxisTitle": "Number of Pixels"
    },
    "z": {
        "AxisTitle": "z"
    }
}