{
    "Data": [0.0, 0.0, 0.0, 0.0, 0.0, 0.0, 0.0, 0.0, 0.0, 0.0, 0.0, 0.0, 0.0, 0.0, 0.0, 0.0, 0.0, 8.0, 2.0, 14.0, 3.0, 10.0, 21.0, 2.0, 26.0, 33.0, 36.0, 2.0, 34.0, 40.0, 22.0, 49.0, 50.0, 18.0, 50.0, 50.0, 17.0, 50.0, 50.0, 50.0, 9.0, 50.0, 50.0, 48.0, 50.0, 20.0, 42.0, 50.0, 50.0, 50.0, 50.0],
    "Name": "Scurve-70-96",
    "Overflow": 0.0,
    "Type": "Histo1d",
    "Underflow": 0.0,
    "x": {
        "AxisTitle": "Vcal",
        "Bins": 51,
        "High": 302.5,
        "Low": 47.5
    },
    "y": {
        "AxisTitle": "Occupancy"
    },
    "z": {
        "AxisTitle": "z"
    }
}