{
    "Data": [[630.0, 203.0, 71.0, 36.0, 34.0, 22.0, 11.0, 12.0, 5.0, 6.0, 8.0, 4.0, 4.0, 3.0, 8.0, 1.0, 5.0, 3.0, 9.0, 9.0, 1.0, 6.0, 2.0, 4.0, 6.0, 2.0, 6.0, 3.0, 2.0, 2.0, 4.0, 2.0, 4.0, 3.0, 2.0, 1.0, 1.0, 2.0, 1.0, 0.0, 4.0, 5.0, 2.0, 2.0, 7.0, 4.0, 1.0, 1.0, 2.0], [1573.0, 496.0, 242.0, 155.0, 90.0, 66.0, 47.0, 42.0, 35.0, 17.0, 21.0, 11.0, 10.0, 6.0, 9.0, 7.0, 2.0, 5.0, 4.0, 5.0, 4.0, 2.0, 7.0, 7.0, 8.0, 3.0, 3.0, 4.0, 5.0, 6.0, 2.0, 5.0, 8.0, 6.0, 4.0, 1.0, 6.0, 6.0, 5.0, 2.0, 3.0, 0.0, 4.0, 3.0, 4.0, 3.0, 11.0, 7.0, 5.0], [2846.0, 1200.0, 639.0, 448.0, 287.0, 222.0, 157.0, 124.0, 87.0, 78.0, 54.0, 47.0, 43.0, 39.0, 33.0, 30.0, 26.0, 22.0, 15.0, 16.0, 16.0, 12.0, 5.0, 11.0, 9.0, 8.0, 8.0, 9.0, 5.0, 5.0, 3.0, 8.0, 3.0, 13.0, 3.0, 8.0, 1.0, 5.0, 4.0, 12.0, 4.0, 11.0, 7.0, 7.0, 9.0, 5.0, 8.0, 9.0, 15.0], [3768.0, 1972.0, 1296.0, 904.0, 666.0, 511.0, 398.0, 352.0, 269.0, 252.0, 168.0, 139.0, 170.0, 116.0, 92.0, 82.0, 80.0, 68.0, 61.0, 61.0, 40.0, 44.0, 30.0, 44.0, 34.0, 26.0, 26.0, 18.0, 26.0, 26.0, 19.0, 24.0, 15.0, 13.0, 11.0, 13.0, 10.0, 13.0, 7.0, 5.0, 7.0, 17.0, 11.0, 7.0, 11.0, 9.0, 15.0, 23.0, 21.0], [3780.0, 2301.0, 1668.0, 1353.0, 1092.0, 835.0, 796.0, 688.0, 621.0, 500.0, 439.0, 393.0, 384.0, 320.0, 299.0, 248.0, 221.0, 196.0, 185.0, 170.0, 164.0, 147.0, 129.0, 111.0, 98.0, 114.0, 85.0, 86.0, 88.0, 55.0, 61.0, 65.0, 64.0, 55.0, 45.0, 35.0, 45.0, 45.0, 34.0, 30.0, 28.0, 32.0, 28.0, 20.0, 13.0, 20.0, 28.0, 27.0, 33.0], [4325.0, 2261.0, 1621.0, 1347.0, 1186.0, 1090.0, 958.0, 856.0, 801.0, 733.0, 744.0, 587.0, 589.0, 519.0, 520.0, 479.0, 446.0, 422.0, 417.0, 382.0, 422.0, 318.0, 327.0, 341.0, 260.0, 260.0, 226.0, 255.0, 214.0, 245.0, 188.0, 187.0, 177.0, 152.0, 163.0, 128.0, 123.0, 138.0, 112.0, 87.0, 96.0, 70.0, 82.0, 92.0, 84.0, 65.0, 66.0, 76.0, 74.0], [6968.0, 3943.0, 2592.0, 1864.0, 1425.0, 1191.0, 1044.0, 877.0, 851.0, 801.0, 758.0, 707.0, 695.0, 680.0, 630.0, 570.0, 580.0, 544.0, 557.0, 521.0, 530.0, 521.0, 478.0, 505.0, 484.0, 458.0, 462.0, 463.0, 468.0, 405.0, 400.0, 383.0, 388.0, 370.0, 378.0, 368.0, 383.0, 322.0, 345.0, 325.0, 279.0, 289.0, 273.0, 278.0, 244.0, 239.0, 212.0, 226.0, 214.0], [2423.0, 2511.0, 2581.0, 2453.0, 2467.0, 2248.0, 1933.0, 1862.0, 1632.0, 1512.0, 1256.0, 1325.0, 1140.0, 1078.0, 931.0, 873.0, 871.0, 769.0, 747.0, 761.0, 710.0, 652.0, 661.0, 647.0, 632.0, 603.0, 629.0, 561.0, 575.0, 551.0, 579.0, 615.0, 600.0, 599.0, 622.0, 589.0, 577.0, 592.0, 605.0, 602.0, 580.0, 643.0, 653.0, 615.0, 639.0, 654.0, 671.0, 700.0, 670.0], [260.0, 250.0, 320.0, 329.0, 406.0, 490.0, 583.0, 710.0, 724.0, 826.0, 896.0, 923.0, 1025.0, 1027.0, 1149.0, 1214.0, 1196.0, 1252.0, 1185.0, 1218.0, 1234.0, 1264.0, 1193.0, 1202.0, 1229.0, 1255.0, 1162.0, 1160.0, 1139.0, 1126.0, 1110.0, 1077.0, 1045.0, 988.0, 1021.0, 958.0, 946.0, 1045.0, 948.0, 988.0, 998.0, 1023.0, 1055.0, 1105.0, 1175.0, 1260.0, 1268.0, 1467.0, 1779.0], [186.0, 89.0, 84.0, 56.0, 58.0, 60.0, 64.0, 66.0, 90.0, 89.0, 107.0, 96.0, 95.0, 142.0, 148.0, 189.0, 195.0, 241.0, 255.0, 294.0, 299.0, 376.0, 418.0, 470.0, 483.0, 573.0, 639.0, 665.0, 795.0, 843.0, 898.0, 997.0, 1044.0, 1219.0, 1291.0, 1403.0, 1515.0, 1666.0, 1704.0, 1849.0, 1977.0, 2057.0, 2227.0, 2355.0, 2525.0, 2579.0, 2741.0, 3163.0, 3951.0], [198.0, 76.0, 83.0, 32.0, 30.0, 23.0, 26.0, 29.0, 29.0, 37.0, 27.0, 23.0, 18.0, 22.0, 33.0, 46.0, 40.0, 42.0, 37.0, 43.0, 56.0, 64.0, 57.0, 72.0, 68.0, 87.0, 109.0, 117.0, 136.0, 137.0, 172.0, 220.0, 200.0, 266.0, 306.0, 338.0, 395.0, 484.0, 573.0, 711.0, 886.0, 1048.0, 1301.0, 1690.0, 2255.0, 2749.0, 3799.0, 5767.0, 8625.0], [323.0, 99.0, 39.0, 26.0, 30.0, 20.0, 21.0, 26.0, 20.0, 17.0, 11.0, 14.0, 18.0, 20.0, 15.0, 17.0, 15.0, 21.0, 17.0, 13.0, 13.0, 29.0, 15.0, 28.0, 20.0, 36.0, 27.0, 29.0, 37.0, 38.0, 40.0, 45.0, 43.0, 50.0, 84.0, 78.0, 86.0, 106.0, 115.0, 163.0, 202.0, 267.0, 318.0, 478.0, 644.0, 1014.0, 1524.0, 2795.0, 7098.0], [600.0, 131.0, 49.0, 35.0, 26.0, 16.0, 18.0, 13.0, 8.0, 6.0, 14.0, 12.0, 14.0, 12.0, 14.0, 17.0, 15.0, 14.0, 12.0, 14.0, 17.0, 17.0, 13.0, 14.0, 12.0, 9.0, 10.0, 15.0, 17.0, 14.0, 29.0, 20.0, 21.0, 25.0, 28.0, 27.0, 18.0, 33.0, 43.0, 55.0, 58.0, 83.0, 87.0, 120.0, 191.0, 314.0, 517.0, 949.0, 3021.0], [1210.0, 300.0, 124.0, 53.0, 26.0, 20.0, 11.0, 15.0, 11.0, 9.0, 9.0, 3.0, 8.0, 10.0, 6.0, 6.0, 12.0, 7.0, 6.0, 9.0, 7.0, 10.0, 11.0, 10.0, 9.0, 8.0, 14.0, 10.0, 13.0, 14.0, 12.0, 8.0, 18.0, 17.0, 19.0, 12.0, 22.0, 26.0, 21.0, 27.0, 30.0, 33.0, 36.0, 51.0, 68.0, 87.0, 157.0, 368.0, 1252.0], [2225.0, 672.0, 231.0, 109.0, 51.0, 30.0, 33.0, 12.0, 13.0, 7.0, 10.0, 10.0, 10.0, 5.0, 3.0, 6.0, 7.0, 9.0, 2.0, 4.0, 3.0, 3.0, 3.0, 5.0, 7.0, 12.0, 8.0, 8.0, 8.0, 7.0, 7.0, 6.0, 9.0, 17.0, 9.0, 14.0, 12.0, 12.0, 15.0, 10.0, 17.0, 23.0, 32.0, 35.0, 32.0, 49.0, 79.0, 137.0, 493.0], [3255.0, 1227.0, 613.0, 281.0, 136.0, 91.0, 48.0, 28.0, 30.0, 16.0, 14.0, 6.0, 5.0, 4.0, 3.0, 4.0, 7.0, 7.0, 6.0, 5.0, 5.0, 5.0, 6.0, 7.0, 3.0, 8.0, 7.0, 6.0, 3.0, 4.0, 3.0, 11.0, 8.0, 9.0, 5.0, 8.0, 8.0, 10.0, 10.0, 9.0, 17.0, 11.0, 18.0, 18.0, 24.0, 28.0, 50.0, 71.0, 218.0], [4319.0, 2042.0, 1220.0, 688.0, 385.0, 232.0, 110.0, 96.0, 68.0, 44.0, 39.0, 25.0, 15.0, 14.0, 11.0, 4.0, 13.0, 7.0, 8.0, 2.0, 9.0, 4.0, 5.0, 3.0, 6.0, 4.0, 8.0, 5.0, 4.0, 3.0, 3.0, 3.0, 7.0, 6.0, 10.0, 5.0, 3.0, 4.0, 12.0, 4.0, 10.0, 11.0, 11.0, 17.0, 14.0, 26.0, 32.0, 49.0, 133.0], [4824.0, 2762.0, 1806.0, 1066.0, 830.0, 559.0, 367.0, 256.0, 180.0, 142.0, 88.0, 79.0, 54.0, 34.0, 36.0, 29.0, 20.0, 17.0, 14.0, 8.0, 7.0, 7.0, 4.0, 7.0, 6.0, 5.0, 7.0, 5.0, 5.0, 6.0, 6.0, 4.0, 3.0, 6.0, 5.0, 5.0, 4.0, 4.0, 10.0, 8.0, 8.0, 8.0, 6.0, 15.0, 14.0, 14.0, 26.0, 22.0, 81.0], [4423.0, 2968.0, 2290.0, 1656.0, 1242.0, 915.0, 707.0, 535.0, 459.0, 326.0, 279.0, 232.0, 177.0, 139.0, 79.0, 92.0, 68.0, 53.0, 48.0, 27.0, 37.0, 12.0, 21.0, 16.0, 15.0, 10.0, 8.0, 6.0, 3.0, 9.0, 8.0, 4.0, 5.0, 7.0, 14.0, 1.0, 6.0, 2.0, 5.0, 12.0, 8.0, 10.0, 5.0, 9.0, 10.0, 5.0, 31.0, 18.0, 53.0], [3554.0, 2889.0, 2296.0, 1935.0, 1507.0, 1379.0, 1109.0, 878.0, 742.0, 625.0, 505.0, 461.0, 337.0, 308.0, 246.0, 220.0, 175.0, 136.0, 124.0, 108.0, 92.0, 70.0, 53.0, 38.0, 36.0, 38.0, 25.0, 27.0, 18.0, 9.0, 17.0, 16.0, 6.0, 13.0, 11.0, 7.0, 4.0, 3.0, 3.0, 11.0, 2.0, 8.0, 7.0, 13.0, 10.0, 8.0, 11.0, 19.0, 54.0], [2482.0, 2173.0, 1976.0, 1824.0, 1612.0, 1474.0, 1292.0, 1164.0, 1042.0, 875.0, 741.0, 682.0, 627.0, 544.0, 484.0, 439.0, 332.0, 278.0, 279.0, 257.0, 224.0, 195.0, 168.0, 147.0, 126.0, 98.0, 84.0, 65.0, 59.0, 53.0, 42.0, 43.0, 34.0, 24.0, 23.0, 16.0, 15.0, 13.0, 7.0, 15.0, 10.0, 5.0, 7.0, 9.0, 11.0, 9.0, 11.0, 23.0, 36.0], [1643.0, 1586.0, 1461.0, 1553.0, 1324.0, 1293.0, 1253.0, 1175.0, 1121.0, 1078.0, 915.0, 871.0, 812.0, 738.0, 653.0, 624.0, 530.0, 512.0, 473.0, 401.0, 430.0, 328.0, 331.0, 274.0, 256.0, 223.0, 208.0, 158.0, 160.0, 135.0, 120.0, 115.0, 85.0, 75.0, 68.0, 70.0, 49.0, 38.0, 33.0, 33.0, 24.0, 16.0, 14.0, 11.0, 12.0, 7.0, 16.0, 16.0, 36.0], [972.0, 1023.0, 1065.0, 976.0, 1013.0, 1034.0, 1048.0, 977.0, 971.0, 954.0, 936.0, 908.0, 924.0, 812.0, 823.0, 742.0, 745.0, 673.0, 637.0, 637.0, 594.0, 562.0, 486.0, 501.0, 440.0, 387.0, 350.0, 370.0, 324.0, 306.0, 238.0, 230.0, 218.0, 206.0, 175.0, 149.0, 128.0, 134.0, 102.0, 93.0, 63.0, 59.0, 57.0, 38.0, 37.0, 34.0, 32.0, 30.0, 21.0], [675.0, 645.0, 717.0, 740.0, 719.0, 782.0, 740.0, 772.0, 712.0, 772.0, 767.0, 710.0, 797.0, 769.0, 773.0, 731.0, 765.0, 787.0, 702.0, 737.0, 661.0, 629.0, 624.0, 574.0, 566.0, 523.0, 530.0, 543.0, 441.0, 461.0, 436.0, 405.0, 394.0, 348.0, 359.0, 307.0, 293.0, 268.0, 226.0, 196.0, 164.0, 145.0, 140.0, 113.0, 121.0, 76.0, 63.0, 49.0, 53.0], [506.0, 470.0, 444.0, 429.0, 438.0, 474.0, 421.0, 466.0, 494.0, 536.0, 511.0, 532.0, 538.0, 576.0, 605.0, 649.0, 670.0, 631.0, 614.0, 666.0, 654.0, 650.0, 678.0, 675.0, 701.0, 686.0, 612.0, 676.0, 641.0, 626.0, 597.0, 548.0, 554.0, 526.0, 552.0, 520.0, 521.0, 478.0, 429.0, 419.0, 408.0, 345.0, 311.0, 286.0, 262.0, 216.0, 187.0, 136.0, 131.0], [315.0, 346.0, 359.0, 361.0, 418.0, 392.0, 355.0, 378.0, 333.0, 374.0, 376.0, 431.0, 434.0, 420.0, 418.0, 449.0, 439.0, 477.0, 523.0, 516.0, 522.0, 575.0, 551.0, 584.0, 602.0, 595.0, 624.0, 634.0, 609.0, 638.0, 660.0, 620.0, 673.0, 629.0, 632.0, 645.0, 646.0, 650.0, 640.0, 598.0, 587.0, 583.0, 584.0, 513.0, 488.0, 461.0, 455.0, 348.0, 301.0], [317.0, 208.0, 240.0, 233.0, 237.0, 255.0, 306.0, 254.0, 235.0, 242.0, 248.0, 264.0, 280.0, 317.0, 264.0, 293.0, 303.0, 351.0, 334.0, 377.0, 421.0, 374.0, 426.0, 443.0, 431.0, 498.0, 537.0, 536.0, 547.0, 588.0, 587.0, 589.0, 603.0, 670.0, 685.0, 707.0, 705.0, 717.0, 794.0, 779.0, 815.0, 813.0, 778.0, 830.0, 801.0, 829.0, 796.0, 762.0, 680.0], [246.0, 279.0, 212.0, 177.0, 212.0, 229.0, 191.0, 177.0, 187.0, 189.0, 199.0, 187.0, 211.0, 175.0, 251.0, 205.0, 233.0, 255.0, 251.0, 272.0, 235.0, 245.0, 297.0, 292.0, 300.0, 329.0, 315.0, 342.0, 406.0, 407.0, 436.0, 476.0, 504.0, 554.0, 551.0, 624.0, 653.0, 746.0, 752.0, 801.0, 828.0, 888.0, 973.0, 1004.0, 1119.0, 1170.0, 1185.0, 1361.0, 1372.0], [292.0, 154.0, 137.0, 173.0, 133.0, 161.0, 139.0, 119.0, 140.0, 163.0, 119.0, 149.0, 175.0, 169.0, 123.0, 158.0, 155.0, 143.0, 157.0, 141.0, 150.0, 156.0, 193.0, 206.0, 233.0, 255.0, 234.0, 242.0, 305.0, 332.0, 366.0, 351.0, 365.0, 397.0, 415.0, 487.0, 492.0, 582.0, 615.0, 649.0, 811.0, 867.0, 1005.0, 1139.0, 1175.0, 1336.0, 1609.0, 1806.0, 2113.0], [213.0, 184.0, 176.0, 201.0, 169.0, 181.0, 133.0, 173.0, 103.0, 99.0, 105.0, 84.0, 104.0, 106.0, 187.0, 160.0, 131.0, 133.0, 105.0, 120.0, 107.0, 132.0, 121.0, 107.0, 102.0, 137.0, 138.0, 137.0, 168.0, 161.0, 191.0, 174.0, 215.0, 265.0, 267.0, 337.0, 361.0, 397.0, 451.0, 455.0, 625.0, 686.0, 780.0, 937.0, 1100.0, 1377.0, 1660.0, 2159.0, 2924.0], [122.0, 162.0, 82.0, 108.0, 117.0, 151.0, 88.0, 122.0, 147.0, 136.0, 142.0, 124.0, 47.0, 93.0, 133.0, 112.0, 118.0, 186.0, 146.0, 132.0, 174.0, 155.0, 122.0, 92.0, 100.0, 124.0, 115.0, 123.0, 103.0, 98.0, 142.0, 169.0, 167.0, 168.0, 216.0, 163.0, 230.0, 271.0, 272.0, 377.0, 367.0, 412.0, 560.0, 713.0, 916.0, 1128.0, 1519.0, 2152.0, 3326.0], [194.0, 116.0, 122.0, 148.0, 130.0, 155.0, 190.0, 149.0, 180.0, 126.0, 151.0, 55.0, 87.0, 108.0, 116.0, 155.0, 118.0, 103.0, 153.0, 123.0, 68.0, 86.0, 83.0, 125.0, 123.0, 128.0, 174.0, 165.0, 127.0, 177.0, 88.0, 123.0, 156.0, 100.0, 98.0, 140.0, 157.0, 182.0, 167.0, 197.0, 191.0, 279.0, 309.0, 407.0, 594.0, 792.0, 1117.0, 1832.0, 3163.0], [135.0, 146.0, 133.0, 172.0, 192.0, 132.0, 114.0, 116.0, 98.0, 77.0, 130.0, 95.0, 168.0, 115.0, 88.0, 121.0, 118.0, 106.0, 237.0, 225.0, 83.0, 169.0, 96.0, 121.0, 103.0, 110.0, 111.0, 95.0, 88.0, 116.0, 86.0, 86.0, 99.0, 82.0, 92.0, 130.0, 101.0, 81.0, 102.0, 139.0, 163.0, 122.0, 218.0, 288.0, 315.0, 511.0, 803.0, 1339.0, 2784.0], [176.0, 129.0, 103.0, 112.0, 108.0, 82.0, 159.0, 171.0, 127.0, 142.0, 226.0, 163.0, 71.0, 134.0, 87.0, 77.0, 121.0, 119.0, 109.0, 103.0, 109.0, 141.0, 80.0, 124.0, 97.0, 100.0, 63.0, 89.0, 120.0, 104.0, 103.0, 75.0, 63.0, 82.0, 84.0, 116.0, 84.0, 71.0, 156.0, 86.0, 146.0, 153.0, 131.0, 113.0, 153.0, 273.0, 422.0, 886.0, 2167.0], [206.0, 170.0, 145.0, 121.0, 112.0, 119.0, 158.0, 55.0, 98.0, 156.0, 89.0, 34.0, 106.0, 114.0, 156.0, 152.0, 78.0, 83.0, 113.0, 108.0, 78.0, 77.0, 94.0, 82.0, 151.0, 67.0, 60.0, 75.0, 57.0, 96.0, 92.0, 70.0, 67.0, 77.0, 132.0, 87.0, 110.0, 135.0, 30.0, 60.0, 80.0, 88.0, 51.0, 91.0, 124.0, 164.0, 278.0, 582.0, 1481.0], [268.0, 185.0, 204.0, 141.0, 129.0, 95.0, 112.0, 92.0, 90.0, 166.0, 99.0, 131.0, 123.0, 94.0, 131.0, 178.0, 115.0, 172.0, 152.0, 75.0, 155.0, 64.0, 137.0, 140.0, 99.0, 61.0, 114.0, 96.0, 67.0, 44.0, 106.0, 127.0, 80.0, 98.0, 70.0, 92.0, 70.0, 61.0, 63.0, 98.0, 129.0, 168.0, 140.0, 73.0, 176.0, 92.0, 142.0, 295.0, 862.0], [105.0, 180.0, 145.0, 139.0, 199.0, 84.0, 74.0, 119.0, 150.0, 123.0, 112.0, 61.0, 80.0, 113.0, 22.0, 96.0, 108.0, 48.0, 131.0, 99.0, 89.0, 125.0, 36.0, 130.0, 105.0, 102.0, 103.0, 85.0, 121.0, 40.0, 63.0, 80.0, 93.0, 88.0, 145.0, 48.0, 40.0, 66.0, 80.0, 167.0, 117.0, 119.0, 73.0, 132.0, 101.0, 121.0, 147.0, 197.0, 605.0], [100.0, 159.0, 90.0, 193.0, 127.0, 55.0, 92.0, 36.0, 48.0, 99.0, 54.0, 131.0, 49.0, 119.0, 86.0, 97.0, 92.0, 64.0, 53.0, 161.0, 82.0, 127.0, 139.0, 67.0, 17.0, 92.0, 107.0, 157.0, 162.0, 134.0, 160.0, 82.0, 61.0, 115.0, 171.0, 71.0, 60.0, 105.0, 60.0, 86.0, 73.0, 29.0, 48.0, 65.0, 156.0, 43.0, 73.0, 132.0, 346.0], [105.0, 95.0, 130.0, 43.0, 82.0, 140.0, 142.0, 103.0, 50.0, 111.0, 134.0, 74.0, 52.0, 64.0, 19.0, 66.0, 107.0, 95.0, 86.0, 60.0, 94.0, 100.0, 48.0, 125.0, 98.0, 64.0, 58.0, 46.0, 30.0, 67.0, 50.0, 60.0, 77.0, 121.0, 14.0, 32.0, 30.0, 132.0, 89.0, 31.0, 46.0, 26.0, 32.0, 62.0, 60.0, 63.0, 31.0, 49.0, 235.0], [136.0, 138.0, 116.0, 80.0, 60.0, 129.0, 90.0, 51.0, 74.0, 144.0, 59.0, 60.0, 77.0, 110.0, 178.0, 196.0, 80.0, 55.0, 70.0, 82.0, 95.0, 15.0, 47.0, 41.0, 62.0, 68.0, 56.0, 109.0, 36.0, 47.0, 0.0, 47.0, 69.0, 33.0, 9.0, 31.0, 156.0, 122.0, 129.0, 47.0, 105.0, 104.0, 34.0, 36.0, 113.0, 70.0, 70.0, 83.0, 153.0], [150.0, 110.0, 71.0, 44.0, 43.0, 53.0, 44.0, 20.0, 68.0, 25.0, 59.0, 104.0, 69.0, 16.0, 32.0, 104.0, 68.0, 106.0, 55.0, 94.0, 91.0, 72.0, 43.0, 60.0, 64.0, 28.0, 40.0, 31.0, 33.0, 40.0, 60.0, 106.0, 94.0, 41.0, 18.0, 24.0, 60.0, 69.0, 53.0, 59.0, 42.0, 13.0, 52.0, 53.0, 55.0, 26.0, 31.0, 20.0, 82.0], [102.0, 53.0, 145.0, 40.0, 93.0, 45.0, 38.0, 4.0, 16.0, 32.0, 56.0, 119.0, 88.0, 111.0, 20.0, 43.0, 42.0, 34.0, 80.0, 110.0, 30.0, 25.0, 58.0, 79.0, 79.0, 57.0, 23.0, 72.0, 53.0, 25.0, 72.0, 26.0, 0.0, 101.0, 37.0, 44.0, 24.0, 55.0, 36.0, 84.0, 90.0, 41.0, 39.0, 39.0, 25.0, 67.0, 57.0, 32.0, 59.0], [143.0, 36.0, 31.0, 29.0, 66.0, 79.0, 35.0, 108.0, 118.0, 14.0, 87.0, 52.0, 46.0, 13.0, 56.0, 12.0, 23.0, 83.0, 72.0, 60.0, 9.0, 1.0, 10.0, 16.0, 24.0, 26.0, 23.0, 45.0, 37.0, 40.0, 50.0, 50.0, 84.0, 62.0, 49.0, 13.0, 44.0, 33.0, 41.0, 18.0, 54.0, 26.0, 75.0, 50.0, 46.0, 30.0, 61.0, 97.0, 93.0], [95.0, 64.0, 69.0, 107.0, 76.0, 58.0, 54.0, 36.0, 24.0, 22.0, 14.0, 23.0, 61.0, 10.0, 63.0, 53.0, 15.0, 16.0, 44.0, 5.0, 41.0, 73.0, 44.0, 12.0, 58.0, 60.0, 86.0, 49.0, 14.0, 18.0, 88.0, 60.0, 40.0, 18.0, 7.0, 18.0, 8.0, 39.0, 9.0, 24.0, 0.0, 62.0, 13.0, 28.0, 50.0, 25.0, 2.0, 1.0, 35.0], [47.0, 9.0, 9.0, 3.0, 42.0, 38.0, 13.0, 41.0, 20.0, 6.0, 44.0, 48.0, 26.0, 4.0, 5.0, 44.0, 26.0, 25.0, 38.0, 18.0, 62.0, 21.0, 47.0, 6.0, 13.0, 33.0, 33.0, 69.0, 34.0, 12.0, 49.0, 46.0, 43.0, 33.0, 27.0, 0.0, 58.0, 35.0, 88.0, 61.0, 0.0, 0.0, 0.0, 23.0, 77.0, 65.0, 21.0, 27.0, 12.0], [59.0, 83.0, 15.0, 16.0, 46.0, 45.0, 38.0, 15.0, 1.0, 0.0, 23.0, 36.0, 15.0, 24.0, 0.0, 0.0, 0.0, 10.0, 41.0, 21.0, 0.0, 0.0, 17.0, 31.0, 38.0, 12.0, 67.0, 6.0, 25.0, 1.0, 0.0, 0.0, 19.0, 48.0, 29.0, 46.0, 46.0, 25.0, 9.0, 0.0, 1.0, 6.0, 67.0, 25.0, 37.0, 35.0, 27.0, 41.0, 28.0], [35.0, 42.0, 37.0, 75.0, 40.0, 87.0, 36.0, 20.0, 14.0, 30.0, 22.0, 86.0, 24.0, 0.0, 0.0, 5.0, 34.0, 9.0, 1.0, 34.0, 16.0, 0.0, 1.0, 0.0, 1.0, 0.0, 1.0, 1.0, 37.0, 43.0, 38.0, 3.0, 24.0, 0.0, 6.0, 42.0, 0.0, 63.0, 36.0, 0.0, 0.0, 47.0, 1.0, 1.0, 1.0, 0.0, 1.0, 0.0, 4.0], [38.0, 36.0, 10.0, 29.0, 44.0, 41.0, 20.0, 1.0, 32.0, 18.0, 7.0, 28.0, 21.0, 17.0, 56.0, 44.0, 0.0, 0.0, 0.0, 1.0, 14.0, 35.0, 21.0, 10.0, 17.0, 34.0, 61.0, 5.0, 16.0, 11.0, 25.0, 0.0, 24.0, 0.0, 0.0, 18.0, 20.0, 12.0, 0.0, 0.0, 1.0, 0.0, 17.0, 34.0, 1.0, 1.0, 24.0, 2.0, 4.0], [23.0, 11.0, 6.0, 4.0, 6.0, 4.0, 49.0, 0.0, 0.0, 0.0, 5.0, 20.0, 0.0, 0.0, 0.0, 0.0, 21.0, 3.0, 1.0, 0.0, 17.0, 6.0, 18.0, 8.0, 5.0, 20.0, 24.0, 3.0, 22.0, 0.0, 20.0, 29.0, 48.0, 1.0, 0.0, 0.0, 1.0, 16.0, 8.0, 20.0, 4.0, 1.0, 1.0, 1.0, 22.0, 3.0, 1.0, 0.0, 5.0], [42.0, 24.0, 36.0, 34.0, 50.0, 97.0, 20.0, 0.0, 1.0, 14.0, 10.0, 1.0, 0.0, 1.0, 16.0, 8.0, 2.0, 34.0, 38.0, 1.0, 0.0, 0.0, 0.0, 19.0, 5.0, 0.0, 0.0, 1.0, 0.0, 14.0, 31.0, 3.0, 0.0, 0.0, 17.0, 7.0, 0.0, 2.0, 38.0, 10.0, 1.0, 18.0, 7.0, 0.0, 0.0, 27.0, 22.0, 0.0, 0.0], [26.0, 16.0, 4.0, 5.0, 1.0, 26.0, 2.0, 0.0, 0.0, 0.0, 0.0, 0.0, 20.0, 4.0, 43.0, 5.0, 1.0, 0.0, 0.0, 6.0, 18.0, 0.0, 0.0, 0.0, 20.0, 5.0, 1.0, 0.0, 0.0, 0.0, 0.0, 0.0, 19.0, 6.0, 0.0, 1.0, 0.0, 0.0, 1.0, 1.0, 3.0, 21.0, 2.0, 1.0, 0.0, 0.0, 0.0, 2.0, 2.0]],
    "Name": "sCurve-0",
    "Overflow": 2545928.0,
    "Type": "Histo2d",
    "Underflow": 0.0,
    "x": {
        "AxisTitle": "Vcal",
        "Bins": 51,
        "High": 302.5,
        "Low": 47.5
    },
    "y": {
        "AxisTitle": "Occupancy",
        "Bins": 49,
        "High": 49.5,
        "Low": 0.5
    },
    "z": {
        "AxisTitle": "Number of pixels"
    }
}