{
    "Data": [0.0, 0.0, 0.0, 0.0, 7.0, 10.0, 12.0, 18.0, 19.0, 23.0, 14.0, 27.0, 37.0, 33.0, 28.0, 31.0, 47.0, 55.0, 48.0, 60.0, 90.0, 90.0, 123.0, 143.0, 167.0, 194.0, 222.0, 268.0, 302.0, 359.0, 398.0, 528.0, 543.0, 642.0, 703.0, 751.0, 865.0, 962.0, 1022.0, 1069.0, 1195.0, 1332.0, 1777.0, 2253.0, 2778.0, 3525.0, 3955.0, 4030.0, 3936.0, 3526.0, 3058.0, 2377.0, 1816.0, 1357.0, 1018.0, 797.0, 612.0, 457.0, 369.0, 307.0, 221.0, 175.0, 170.0, 122.0, 98.0, 97.0, 59.0, 46.0, 52.0, 46.0, 36.0, 26.0, 29.0, 32.0, 27.0, 20.0, 22.0, 20.0, 19.0, 27.0, 11.0, 6.0, 17.0, 12.0, 13.0, 10.0, 13.0, 11.0, 12.0, 8.0, 12.0],
    "Name": "ThresholdDist-0",
    "Overflow": 154.0,
    "Type": "Histo1d",
    "Underflow": 0.0,
    "x": {
        "AxisTitle": "Threshold [e]",
        "Bins": 91,
        "High": 1365.0,
        "Low": 455.0
    },
    "y": {
        "AxisTitle": "Number of Pixels"
    },
    "z": {
        "AxisTitle": "z"
    }
}