{
    "Data": [0.0, 0.0, 0.0, 0.0, 0.0, 0.0, 0.0, 0.0, 0.0, 0.0, 0.0, 0.0, 0.0, 0.0, 0.0, 0.0, 2.0, 2.0, 85.0, 292.0, 35.0, 29.0, 362.0, 1975.0, 871.0, 257.0, 613.0, 2207.0, 1939.0, 564.0, 746.0, 1450.0, 1706.0, 702.0, 487.0, 698.0, 782.0, 579.0, 378.0, 559.0, 798.0, 665.0, 502.0, 1106.0, 2342.0, 2532.0, 1483.0, 1456.0, 2297.0, 4322.0, 3694.0, 2255.0, 2492.0, 2611.0, 3418.0, 2395.0, 1636.0, 1633.0, 2109.0, 2003.0, 1539.0, 1306.0, 1154.0, 1236.0, 1065.0, 729.0, 670.0, 658.0, 707.0, 531.0, 465.0, 371.0, 429.0, 397.0, 315.0, 274.0, 295.0, 266.0, 268.0, 212.0, 191.0, 187.0, 198.0, 126.0, 106.0, 119.0, 117.0, 143.0, 100.0, 102.0, 83.0, 79.0, 91.0, 64.0, 64.0, 60.0, 60.0, 57.0, 66.0, 58.0, 44.0, 49.0, 38.0, 35.0, 28.0, 38.0, 44.0, 36.0, 38.0, 26.0, 32.0, 24.0, 31.0, 15.0, 28.0, 13.0, 21.0, 31.0, 24.0, 26.0, 21.0, 16.0, 21.0, 18.0, 19.0, 18.0, 10.0, 10.0, 16.0, 19.0, 18.0, 15.0, 12.0, 7.0, 20.0, 10.0, 9.0, 12.0, 11.0, 8.0, 10.0, 12.0, 9.0, 8.0, 7.0, 9.0, 8.0, 7.0, 5.0, 4.0, 7.0, 11.0, 7.0, 5.0, 5.0, 3.0, 5.0, 6.0, 8.0, 6.0, 3.0, 5.0, 6.0, 5.0, 9.0, 2.0, 2.0, 2.0, 4.0, 3.0, 3.0, 5.0, 2.0, 2.0, 8.0, 3.0, 5.0, 0.0, 3.0, 4.0, 1.0, 2.0, 1.0, 7.0, 2.0, 2.0, 2.0, 2.0, 3.0, 3.0, 2.0, 2.0, 3.0, 2.0, 1.0, 2.0, 1.0, 1.0, 4.0, 1.0, 2.0],
    "Name": "TimePerFitDist-0",
    "Overflow": 205.0,
    "Type": "Histo1d",
    "Underflow": 0.0,
    "x": {
        "AxisTitle": "Fit Time [us]",
        "Bins": 201,
        "High": 401.0,
        "Low": -1.0
    },
    "y": {
        "AxisTitle": "Number of Pixels"
    },
    "z": {
        "AxisTitle": "z"
    }
}