time,Hardware,Voltage,Current
1626377792196,high-voltage,1,0.0171391
time,Hardware,Voltage,Current
1626377792196,high-voltage,2,0.034513
time,Hardware,Voltage,Current
1626377792196,high-voltage,3,0.0455227
time,Hardware,Voltage,Current
1626377792196,high-voltage,4,0.0512015
time,Hardware,Voltage,Current
1626377792196,high-voltage,5,0.0575493
time,Hardware,Voltage,Current
1626377792196,high-voltage,6,0.0630952
time,Hardware,Voltage,Current
1626377792196,high-voltage,7,0.0681819
time,Hardware,Voltage,Current
1626377792196,high-voltage,8,0.0749722
time,Hardware,Voltage,Current
1626377792196,high-voltage,9,0.081218
time,Hardware,Voltage,Current
1626377792196,high-voltage,10,0.087078
time,Hardware,Voltage,Current
1626377792196,high-voltage,11,0.0937361
time,Hardware,Voltage,Current
1626377792196,high-voltage,12,0.0992544
time,Hardware,Voltage,Current
1626377792196,high-voltage,13,0.103711
time,Hardware,Voltage,Current
1626377792196,high-voltage,14,0.108448
time,Hardware,Voltage,Current
1626377792196,high-voltage,15,0.112358
time,Hardware,Voltage,Current
1626377792196,high-voltage,16,0.115658
time,Hardware,Voltage,Current
1626377792196,high-voltage,17,0.119339
time,Hardware,Voltage,Current
1626377792196,high-voltage,18,0.12162
time,Hardware,Voltage,Current
1626377792196,high-voltage,19,0.124784
time,Hardware,Voltage,Current
1626377792196,high-voltage,20,0.127886
time,Hardware,Voltage,Current
1626377792196,high-voltage,25,0.14133
time,Hardware,Voltage,Current
1626377792196,high-voltage,30,0.158246
time,Hardware,Voltage,Current
1626377792196,high-voltage,35,0.188818
time,Hardware,Voltage,Current
1626377792196,high-voltage,40,0.281362
time,Hardware,Voltage,Current
1626377792196,high-voltage,45,0.504476
time,Hardware,Voltage,Current
1626377792196,high-voltage,50,0.931416
time,Hardware,Voltage,Current
1626377792196,high-voltage,55,1.65077
time,Hardware,Voltage,Current
1626377792196,high-voltage,60,2.77589
time,Hardware,Voltage,Current
1626377792196,high-voltage,65,4.35311
time,Hardware,Voltage,Current
1626377792196,high-voltage,70,6.49815
time,Hardware,Voltage,Current
1626377792196,high-voltage,75,9.44196
time,Hardware,Voltage,Current
1626377792196,high-voltage,80,10
