{
    "Data": [1861.0, 22465.0, 18952.0, 6758.0, 2011.0, 851.0, 719.0, 966.0, 1081.0, 1104.0, 893.0, 803.0, 663.0, 588.0, 481.0, 453.0, 402.0, 396.0, 395.0, 438.0, 446.0, 413.0, 423.0, 429.0, 467.0, 460.0, 502.0, 536.0, 511.0, 556.0, 526.0, 508.0, 544.0, 480.0, 483.0, 434.0, 504.0, 447.0, 419.0, 395.0, 415.0, 352.0, 352.0, 355.0, 308.0, 273.0, 240.0, 243.0, 265.0, 215.0, 79.0],
    "Name": "Chi2Dist-0",
    "Overflow": 0.0,
    "Type": "Histo1d",
    "Underflow": 0.0,
    "x": {
        "AxisTitle": "Fit Chi/ndf",
        "Bins": 51,
        "High": 2.5250000953674318,
        "Low": -0.02500000037252903
    },
    "y": {
        "AxisTitle": "Number of Pixels"
    },
    "z": {
        "AxisTitle": "z"
    }
}