{
    "Data": [0.0, 0.0, 0.0, 0.0, 0.0, 0.0, 0.0, 0.0, 0.0, 0.0, 0.0, 0.0, 0.0, 0.0, 0.0, 0.0, 0.0, 0.0, 0.0, 0.0, 0.0, 0.0, 0.0, 0.0, 0.0, 0.0, 0.0, 0.0, 0.0, 0.0, 0.0, 0.0, 0.0, 0.0, 0.0, 0.0, 0.0, 0.0, 0.0, 0.0, 0.0, 0.0, 0.0, 0.0, 0.0, 0.0, 0.0, 0.0, 0.0, 0.0, 7.0, 16.0, 22.0, 14.0, 16.0, 22.0, 15.0, 21.0, 41.0, 35.0, 26.0, 33.0, 52.0, 46.0, 52.0, 62.0, 74.0, 78.0, 105.0, 124.0, 161.0, 184.0, 220.0, 235.0, 273.0, 317.0, 400.0, 511.0, 507.0, 590.0, 695.0, 743.0, 804.0, 948.0, 978.0, 1073.0, 1075.0, 1247.0, 1474.0, 1811.0, 2386.0, 2945.0, 3504.0, 3801.0, 3906.0, 3821.0, 3382.0, 2945.0, 2221.0, 1735.0, 1301.0, 1001.0, 748.0, 604.0, 445.0, 342.0, 268.0, 224.0, 175.0, 128.0, 112.0, 95.0, 80.0, 56.0, 55.0, 49.0, 40.0, 26.0, 29.0, 38.0, 26.0, 24.0, 20.0, 19.0, 21.0, 18.0, 9.0, 18.0, 15.0, 11.0, 17.0, 18.0, 7.0, 14.0, 9.0, 8.0, 11.0, 8.0, 14.0, 6.0, 6.0, 7.0, 16.0, 5.0, 8.0, 3.0, 5.0, 4.0, 6.0, 5.0, 6.0, 6.0, 2.0, 7.0, 4.0, 3.0, 1.0, 4.0, 5.0, 3.0, 10.0, 9.0, 11.0, 17.0, 10.0, 19.0, 21.0, 37.0, 40.0, 48.0, 68.0, 69.0, 96.0, 112.0, 117.0, 147.0, 190.0, 230.0, 233.0, 311.0, 356.0, 387.0, 414.0, 452.0, 507.0, 538.0, 581.0, 621.0, 636.0, 715.0, 741.0, 771.0, 760.0, 832.0, 836.0, 800.0, 791.0, 837.0, 832.0, 784.0, 731.0, 765.0, 695.0, 723.0, 672.0, 605.0, 615.0, 505.0, 461.0, 439.0, 418.0, 398.0, 329.0, 280.0, 256.0, 259.0, 213.0, 189.0, 149.0, 147.0, 129.0, 109.0, 84.0, 80.0, 58.0, 51.0, 44.0, 25.0, 34.0, 28.0, 22.0, 19.0, 13.0, 12.0, 9.0, 14.0, 4.0, 6.0, 5.0, 4.0, 5.0, 4.0, 1.0, 0.0, 1.0, 1.0, 0.0, 0.0, 0.0, 1.0, 0.0, 0.0, 0.0, 0.0, 0.0, 0.0, 0.0, 0.0, 1.0, 0.0, 0.0, 0.0, 0.0, 0.0, 0.0, 0.0, 0.0, 0.0, 0.0, 0.0, 0.0, 0.0, 0.0, 0.0, 0.0, 0.0, 0.0, 1.0, 0.0, 0.0, 1.0, 0.0, 0.0, 0.0, 0.0, 0.0, 0.0, 0.0, 0.0, 0.0, 0.0, 0.0, 0.0, 0.0, 0.0, 0.0, 0.0, 0.0, 0.0, 0.0, 0.0, 0.0, 0.0, 0.0, 0.0, 0.0, 0.0, 0.0, 0.0, 0.0, 0.0, 0.0, 0.0, 0.0, 0.0, 0.0, 0.0, 0.0, 0.0, 0.0, 0.0, 0.0, 0.0, 0.0, 0.0, 0.0, 0.0, 0.0, 0.0, 0.0, 0.0, 0.0, 0.0, 0.0, 0.0, 0.0, 0.0, 0.0, 0.0, 0.0, 0.0, 0.0, 0.0, 0.0, 0.0, 0.0, 0.0, 0.0, 0.0, 0.0, 0.0, 0.0, 0.0, 0.0, 0.0, 0.0, 0.0, 0.0, 0.0, 0.0, 0.0, 0.0, 0.0, 0.0, 0.0, 0.0, 0.0, 0.0, 0.0, 0.0, 0.0],
    "Name": "ThresholdDist-0",
    "Overflow": 0.0,
    "Type": "Histo1d",
    "Underflow": 0.0,
    "x": {
        "AxisTitle": "Threshold [e]",
        "Bins": 371,
        "High": 3705.0,
        "Low": -5.0
    },
    "y": {
        "AxisTitle": "Number of Pixels"
    },
    "z": {
        "AxisTitle": "z"
    }
}