time,Hardware,Voltage,Current
1626748526681,high-voltage,1,0.00759622
time,Hardware,Voltage,Current
1626748526681,high-voltage,2,0.0238915
time,Hardware,Voltage,Current
1626748526681,high-voltage,3,0.0347635
time,Hardware,Voltage,Current
1626748526681,high-voltage,4,0.0426194
time,Hardware,Voltage,Current
1626748526681,high-voltage,5,0.0477936
time,Hardware,Voltage,Current
1626748526681,high-voltage,6,0.0555496
time,Hardware,Voltage,Current
1626748526681,high-voltage,7,0.0615737
time,Hardware,Voltage,Current
1626748526681,high-voltage,8,0.0684301
time,Hardware,Voltage,Current
1626748526681,high-voltage,9,0.0751945
time,Hardware,Voltage,Current
1626748526681,high-voltage,10,0.0811866
time,Hardware,Voltage,Current
1626748526681,high-voltage,11,0.087368
time,Hardware,Voltage,Current
1626748526681,high-voltage,12,0.09069
time,Hardware,Voltage,Current
1626748526681,high-voltage,13,0.0955872
time,Hardware,Voltage,Current
1626748526681,high-voltage,14,0.098863
time,Hardware,Voltage,Current
1626748526681,high-voltage,15,0.102496
time,Hardware,Voltage,Current
1626748526681,high-voltage,16,0.104723
time,Hardware,Voltage,Current
1626748526681,high-voltage,17,0.108506
time,Hardware,Voltage,Current
1626748526681,high-voltage,18,0.110419
time,Hardware,Voltage,Current
1626748526681,high-voltage,19,0.11435
time,Hardware,Voltage,Current
1626748526681,high-voltage,20,0.115877
time,Hardware,Voltage,Current
1626748526681,high-voltage,25,0.130649
time,Hardware,Voltage,Current
1626748526681,high-voltage,30,0.149259
time,Hardware,Voltage,Current
1626748526681,high-voltage,35,0.190462
time,Hardware,Voltage,Current
1626748526681,high-voltage,40,0.319824
time,Hardware,Voltage,Current
1626748526681,high-voltage,45,0.624971
time,Hardware,Voltage,Current
1626748526681,high-voltage,50,1.21884
time,Hardware,Voltage,Current
1626748526681,high-voltage,55,2.20322
time,Hardware,Voltage,Current
1626748526681,high-voltage,60,3.69816
time,Hardware,Voltage,Current
1626748526681,high-voltage,65,5.809
time,Hardware,Voltage,Current
1626748526681,high-voltage,70,8.62008
time,Hardware,Voltage,Current
1626748526681,high-voltage,75,10
