{
    "Data": [0.0, 0.0, 0.0, 0.0, 0.0, 0.0, 0.0, 0.0, 0.0, 0.0, 0.0, 0.0, 0.0, 0.0, 3.0, 0.0, 0.0, 24.0, 512.0, 390.0, 44.0, 139.0, 2811.0, 3907.0, 425.0, 316.0, 2265.0, 3574.0, 739.0, 467.0, 1376.0, 2330.0, 895.0, 284.0, 377.0, 479.0, 341.0, 290.0, 449.0, 572.0, 438.0, 497.0, 875.0, 1648.0, 1401.0, 1224.0, 1850.0, 2710.0, 2841.0, 2525.0, 2438.0, 2524.0, 2699.0, 2110.0, 2030.0, 2048.0, 2341.0, 2066.0, 1746.0, 1704.0, 1641.0, 1500.0, 1127.0, 876.0, 821.0, 810.0, 827.0, 626.0, 570.0, 525.0, 544.0, 511.0, 361.0, 347.0, 304.0, 278.0, 287.0, 243.0, 199.0, 195.0, 212.0, 184.0, 135.0, 123.0, 133.0, 114.0, 97.0, 76.0, 90.0, 62.0, 67.0, 47.0, 62.0, 58.0, 58.0, 46.0, 57.0, 54.0, 48.0, 48.0, 45.0, 36.0, 24.0, 33.0, 25.0, 21.0, 26.0, 23.0, 22.0, 18.0, 18.0, 17.0, 21.0, 24.0, 17.0, 13.0, 8.0, 6.0, 13.0, 8.0, 10.0, 15.0, 13.0, 14.0, 8.0, 7.0, 10.0, 7.0, 8.0, 3.0, 8.0, 5.0, 10.0, 8.0, 3.0, 2.0, 5.0, 6.0, 1.0, 6.0, 4.0, 7.0, 3.0, 2.0, 1.0, 5.0, 4.0, 3.0, 4.0, 1.0, 4.0, 3.0, 3.0, 1.0, 4.0, 3.0, 1.0, 5.0, 3.0, 2.0, 2.0, 3.0, 2.0, 2.0, 4.0, 2.0, 1.0, 3.0, 4.0, 4.0, 2.0, 5.0, 3.0, 4.0, 0.0, 3.0, 3.0, 1.0, 2.0, 4.0, 1.0, 4.0, 4.0, 0.0, 3.0, 7.0, 1.0, 3.0, 2.0, 4.0, 4.0, 3.0, 4.0, 5.0, 4.0, 0.0, 2.0, 1.0, 2.0, 1.0, 1.0],
    "Name": "TimePerFitDist-0",
    "Overflow": 136.0,
    "Type": "Histo1d",
    "Underflow": 0.0,
    "x": {
        "AxisTitle": "Fit Time [us]",
        "Bins": 201,
        "High": 401.0,
        "Low": -1.0
    },
    "y": {
        "AxisTitle": "Number of Pixels"
    },
    "z": {
        "AxisTitle": "z"
    }
}