{
    "Data": [7.0, 17.0, 5.0, 4.0, 6.0, 3.0, 6.0, 13.0, 4.0, 4.0, 10.0, 10.0, 8.0, 16.0, 16.0, 17.0, 19.0, 31.0, 29.0, 38.0, 29.0, 41.0, 41.0, 61.0, 81.0, 94.0, 109.0, 120.0, 160.0, 172.0, 211.0, 297.0, 322.0, 345.0, 473.0, 546.0, 686.0, 1067.0, 1494.0, 2202.0, 3132.0, 3731.0, 4165.0, 4268.0, 4126.0, 3533.0, 3081.0, 2445.0, 1911.0, 1635.0, 1324.0, 1194.0, 1037.0, 940.0, 865.0, 764.0, 666.0, 598.0, 527.0, 436.0, 410.0, 331.0, 287.0, 245.0, 171.0, 154.0, 124.0, 111.0, 102.0, 85.0, 60.0, 54.0, 65.0, 54.0, 38.0, 26.0, 39.0, 31.0, 21.0, 22.0, 26.0, 24.0, 19.0, 13.0, 22.0, 14.0, 19.0, 18.0, 15.0, 12.0, 16.0],
    "Name": "ThresholdDist-0",
    "Overflow": 254.0,
    "Type": "Histo1d",
    "Underflow": 2.0,
    "x": {
        "AxisTitle": "Threshold [e]",
        "Bins": 91,
        "High": 1415.0,
        "Low": 505.0
    },
    "y": {
        "AxisTitle": "Number of Pixels"
    },
    "z": {
        "AxisTitle": "z"
    }
}