time,Hardware,Voltage,Current
1621632156987,high-voltage,1,0.0624027
time,Hardware,Voltage,Current
1621632156987,high-voltage,2,0.10966
time,Hardware,Voltage,Current
1621632156987,high-voltage,3,0.199319
time,Hardware,Voltage,Current
1621632156987,high-voltage,4,0.310123
time,Hardware,Voltage,Current
1621632156987,high-voltage,5,0.406204
time,Hardware,Voltage,Current
1621632156987,high-voltage,6,0.56897
time,Hardware,Voltage,Current
1621632156987,high-voltage,7,0.765372
time,Hardware,Voltage,Current
1621632156987,high-voltage,8,1.07444
time,Hardware,Voltage,Current
1621632156987,high-voltage,9,1.41138
time,Hardware,Voltage,Current
1621632156987,high-voltage,10,1.81046
time,Hardware,Voltage,Current
1621632156987,high-voltage,11,2.25523
time,Hardware,Voltage,Current
1621632156987,high-voltage,12,2.82181
time,Hardware,Voltage,Current
1621632156987,high-voltage,13,3.50826
time,Hardware,Voltage,Current
1621632156987,high-voltage,14,4.18763
time,Hardware,Voltage,Current
1621632156987,high-voltage,15,5.12525
time,Hardware,Voltage,Current
1621632156987,high-voltage,16,6.10839
time,Hardware,Voltage,Current
1621632156987,high-voltage,17,7.27518
time,Hardware,Voltage,Current
1621632156987,high-voltage,18,8.64919
time,Hardware,Voltage,Current
1621632156987,high-voltage,19,9.20712
time,Hardware,Voltage,Current
1621632156987,high-voltage,20,9.94049
time,Hardware,Voltage,Current
1621632156987,high-voltage,25,10.0001
