{
    "Data": [0.0, 0.0, 0.0, 0.0, 0.0, 0.0, 0.0, 0.0, 0.0, 0.0, 0.0, 0.0, 0.0, 0.0, 0.0, 1.0, 2.0, 4.0, 3.0, 2.0, 2.0, 0.0, 0.0, 7.0, 14.0, 25.0, 26.0, 10.0, 28.0, 28.0, 37.0, 42.0, 18.0, 46.0, 21.0, 30.0, 48.0, 20.0, 43.0, 50.0, 18.0, 50.0, 26.0, 8.0, 50.0, 50.0, 50.0, 50.0, 50.0, 50.0, 15.0],
    "Name": "Scurve-10-96",
    "Overflow": 0.0,
    "Type": "Histo1d",
    "Underflow": 0.0,
    "x": {
        "AxisTitle": "Vcal",
        "Bins": 51,
        "High": 302.5,
        "Low": 47.5
    },
    "y": {
        "AxisTitle": "Occupancy"
    },
    "z": {
        "AxisTitle": "z"
    }
}