time,Hardware,Voltage,Current
1632260061754,high-voltage,1,0.0180056
time,Hardware,Voltage,Current
1632260061754,high-voltage,2,0.0340134
time,Hardware,Voltage,Current
1632260061754,high-voltage,3,0.0447393
time,Hardware,Voltage,Current
1632260061754,high-voltage,4,0.0533412
time,Hardware,Voltage,Current
1632260061754,high-voltage,5,0.0613664
time,Hardware,Voltage,Current
1632260061754,high-voltage,6,0.0687973
time,Hardware,Voltage,Current
1632260061754,high-voltage,7,0.0744116
time,Hardware,Voltage,Current
1632260061754,high-voltage,8,0.0802133
time,Hardware,Voltage,Current
1632260061754,high-voltage,9,0.0859642
time,Hardware,Voltage,Current
1632260061754,high-voltage,10,0.089689
time,Hardware,Voltage,Current
1632260061754,high-voltage,11,0.0944639
time,Hardware,Voltage,Current
1632260061754,high-voltage,12,0.0981124
time,Hardware,Voltage,Current
1632260061754,high-voltage,13,0.100156
time,Hardware,Voltage,Current
1632260061754,high-voltage,14,0.10293
time,Hardware,Voltage,Current
1632260061754,high-voltage,15,0.10591
time,Hardware,Voltage,Current
1632260061754,high-voltage,16,0.109132
time,Hardware,Voltage,Current
1632260061754,high-voltage,17,0.111934
time,Hardware,Voltage,Current
1632260061754,high-voltage,18,0.115229
time,Hardware,Voltage,Current
1632260061754,high-voltage,19,0.11759
time,Hardware,Voltage,Current
1632260061754,high-voltage,20,0.119692
time,Hardware,Voltage,Current
1632260061754,high-voltage,25,0.13507
time,Hardware,Voltage,Current
1632260061754,high-voltage,30,0.162706
time,Hardware,Voltage,Current
1632260061754,high-voltage,35,0.265616
time,Hardware,Voltage,Current
1632260061754,high-voltage,40,0.610786
time,Hardware,Voltage,Current
1632260061754,high-voltage,45,1.4364
time,Hardware,Voltage,Current
1632260061754,high-voltage,50,2.9343
time,Hardware,Voltage,Current
1632260061754,high-voltage,55,5.25354
time,Hardware,Voltage,Current
1632260061754,high-voltage,60,8.66703
time,Hardware,Voltage,Current
1632260061754,high-voltage,65,10
