{
    "Data": [0.0, 0.0, 0.0, 0.0, 0.0, 0.0, 0.0, 0.0, 0.0, 0.0, 0.0, 0.0, 0.0, 0.0, 0.0, 0.0, 0.0, 0.0, 0.0, 0.0, 0.0, 0.0, 0.0, 0.0, 0.0, 0.0, 0.0, 0.0, 0.0, 0.0, 0.0, 0.0, 0.0, 0.0, 0.0, 0.0, 0.0, 0.0, 0.0, 0.0, 0.0, 0.0, 0.0, 0.0, 0.0, 0.0, 0.0, 0.0, 0.0, 0.0, 102.0, 196.0, 186.0, 225.0, 208.0, 220.0, 248.0, 241.0, 264.0, 255.0, 284.0, 289.0, 288.0, 292.0, 274.0, 290.0, 337.0, 300.0, 337.0, 327.0, 343.0, 359.0, 325.0, 364.0, 361.0, 314.0, 347.0, 447.0, 386.0, 433.0, 393.0, 435.0, 419.0, 396.0, 414.0, 396.0, 461.0, 397.0, 444.0, 449.0, 466.0, 493.0, 448.0, 464.0, 436.0, 436.0, 452.0, 472.0, 474.0, 487.0, 459.0, 424.0, 480.0, 452.0, 484.0, 452.0, 475.0, 459.0, 477.0, 481.0, 421.0, 439.0, 508.0, 426.0, 440.0, 444.0, 414.0, 467.0, 473.0, 416.0, 400.0, 418.0, 377.0, 377.0, 391.0, 369.0, 323.0, 331.0, 371.0, 325.0, 337.0, 315.0, 328.0, 323.0, 331.0, 310.0, 304.0, 325.0, 318.0, 304.0, 254.0, 287.0, 265.0, 257.0, 230.0, 244.0, 243.0, 251.0, 260.0, 204.0, 226.0, 208.0, 212.0, 209.0, 211.0, 198.0, 204.0, 190.0, 186.0, 209.0, 190.0, 192.0, 209.0, 206.0, 201.0, 250.0, 220.0, 228.0, 271.0, 284.0, 296.0, 328.0, 367.0, 382.0, 406.0, 420.0, 508.0, 561.0, 546.0, 593.0, 595.0, 586.0, 683.0, 722.0, 745.0, 764.0, 786.0, 790.0, 810.0, 802.0, 768.0, 825.0, 799.0, 777.0, 793.0, 752.0, 776.0, 726.0, 648.0, 639.0, 613.0, 596.0, 528.0, 480.0, 459.0, 406.0, 377.0, 355.0, 306.0, 294.0, 260.0, 240.0, 211.0, 199.0, 199.0, 203.0, 169.0, 140.0, 123.0, 109.0, 89.0, 85.0, 74.0, 61.0, 65.0, 44.0, 41.0, 35.0, 47.0, 33.0, 41.0, 37.0, 26.0, 25.0, 18.0, 21.0, 17.0, 15.0, 17.0, 17.0, 22.0, 10.0, 8.0, 15.0, 11.0, 12.0, 7.0, 6.0, 13.0, 3.0, 9.0, 15.0, 9.0, 6.0, 9.0, 4.0, 6.0, 5.0, 6.0, 2.0, 8.0, 9.0, 8.0, 5.0, 5.0, 3.0, 4.0, 4.0, 4.0, 3.0, 2.0, 4.0, 3.0, 6.0, 0.0, 2.0, 1.0, 5.0, 3.0, 3.0, 1.0, 3.0, 4.0, 1.0, 1.0, 1.0, 0.0, 3.0, 4.0, 1.0, 4.0, 3.0, 0.0, 2.0, 3.0, 1.0, 0.0, 0.0, 1.0, 0.0, 1.0, 0.0, 2.0, 1.0, 0.0, 0.0, 0.0, 0.0, 1.0, 1.0, 2.0, 1.0, 2.0, 0.0, 1.0, 0.0, 0.0, 0.0, 0.0, 0.0, 0.0, 0.0, 0.0, 1.0, 1.0, 0.0, 0.0, 0.0, 0.0, 0.0, 0.0, 0.0, 0.0, 0.0, 0.0, 0.0, 0.0, 0.0, 0.0, 0.0, 0.0, 0.0, 0.0, 0.0, 0.0, 0.0, 0.0, 0.0, 0.0, 0.0, 0.0, 0.0, 0.0, 0.0, 0.0, 0.0, 0.0, 0.0, 0.0, 0.0, 0.0, 0.0, 0.0, 0.0, 0.0, 0.0, 0.0, 0.0, 0.0, 0.0, 0.0, 0.0, 0.0, 0.0, 0.0, 0.0, 0.0, 0.0, 0.0, 0.0, 0.0, 0.0, 0.0, 0.0, 0.0, 0.0],
    "Name": "ThresholdDist-0",
    "Overflow": 0.0,
    "Type": "Histo1d",
    "Underflow": 0.0,
    "x": {
        "AxisTitle": "Threshold [e]",
        "Bins": 386,
        "High": 3855.0,
        "Low": -5.0
    },
    "y": {
        "AxisTitle": "Number of Pixels"
    },
    "z": {
        "AxisTitle": "z"
    }
}