{
    "Data": [282.0, 12226.0, 20933.0, 13509.0, 6496.0, 3693.0, 2985.0, 2868.0, 2839.0, 2492.0, 2011.0, 1541.0, 1142.0, 740.0, 500.0, 367.0, 254.0, 163.0, 125.0, 99.0, 98.0, 94.0, 95.0, 77.0, 91.0, 71.0, 73.0, 71.0, 64.0, 76.0, 61.0, 49.0, 63.0, 60.0, 75.0, 49.0, 46.0, 39.0, 47.0, 50.0, 30.0, 14.0, 19.0, 5.0, 14.0, 23.0, 18.0, 17.0, 11.0, 9.0, 5.0],
    "Name": "Chi2Dist-0",
    "Overflow": 0.0,
    "Type": "Histo1d",
    "Underflow": 0.0,
    "x": {
        "AxisTitle": "Fit Chi/ndf",
        "Bins": 51,
        "High": 2.5250000953674318,
        "Low": -0.02500000037252903
    },
    "y": {
        "AxisTitle": "Number of Pixels"
    },
    "z": {
        "AxisTitle": "z"
    }
}