{
    "Data": [241.0, 12424.0, 20598.0, 13255.0, 6601.0, 3607.0, 2966.0, 2812.0, 2723.0, 2495.0, 1987.0, 1513.0, 1013.0, 742.0, 533.0, 357.0, 245.0, 209.0, 143.0, 135.0, 110.0, 96.0, 90.0, 84.0, 84.0, 84.0, 83.0, 68.0, 70.0, 65.0, 76.0, 70.0, 62.0, 80.0, 71.0, 59.0, 36.0, 31.0, 43.0, 50.0, 29.0, 29.0, 32.0, 24.0, 26.0, 32.0, 34.0, 27.0, 8.0, 6.0, 6.0],
    "Name": "Chi2Dist-0",
    "Overflow": 0.0,
    "Type": "Histo1d",
    "Underflow": 0.0,
    "x": {
        "AxisTitle": "Fit Chi/ndf",
        "Bins": 51,
        "High": 2.5250000953674318,
        "Low": -0.02500000037252903
    },
    "y": {
        "AxisTitle": "Number of Pixels"
    },
    "z": {
        "AxisTitle": "z"
    }
}