{
    "Data": [0.0, 0.0, 0.0, 0.0, 0.0, 0.0, 0.0, 0.0, 0.0, 0.0, 0.0, 0.0, 0.0, 0.0, 0.0, 0.0, 0.0, 0.0, 0.0, 0.0, 0.0, 0.0, 0.0, 0.0, 0.0, 0.0, 0.0, 0.0, 0.0, 0.0, 0.0, 0.0, 0.0, 0.0, 0.0, 0.0, 0.0, 0.0, 0.0, 0.0, 0.0, 0.0, 0.0, 0.0, 0.0, 0.0, 0.0, 0.0, 0.0, 0.0, 18.0, 33.0, 45.0, 48.0, 55.0, 68.0, 73.0, 101.0, 121.0, 148.0, 139.0, 160.0, 193.0, 196.0, 248.0, 273.0, 243.0, 308.0, 320.0, 366.0, 421.0, 442.0, 471.0, 515.0, 579.0, 625.0, 651.0, 715.0, 699.0, 778.0, 742.0, 848.0, 930.0, 1086.0, 1191.0, 1307.0, 1598.0, 1878.0, 2285.0, 2592.0, 2798.0, 2928.0, 2884.0, 2842.0, 2614.0, 2347.0, 2029.0, 1707.0, 1399.0, 1127.0, 851.0, 702.0, 593.0, 451.0, 387.0, 318.0, 303.0, 264.0, 227.0, 177.0, 160.0, 139.0, 105.0, 111.0, 81.0, 82.0, 76.0, 50.0, 45.0, 25.0, 43.0, 36.0, 26.0, 31.0, 26.0, 24.0, 20.0, 20.0, 13.0, 15.0, 15.0, 14.0, 15.0, 15.0, 10.0, 11.0, 9.0, 14.0, 11.0, 10.0, 11.0, 10.0, 6.0, 3.0, 7.0, 10.0, 3.0, 4.0, 5.0, 9.0, 5.0, 4.0, 3.0, 5.0, 3.0, 3.0, 8.0, 10.0, 9.0, 11.0, 14.0, 12.0, 20.0, 16.0, 27.0, 39.0, 43.0, 50.0, 61.0, 90.0, 90.0, 119.0, 131.0, 143.0, 173.0, 217.0, 230.0, 241.0, 284.0, 333.0, 424.0, 382.0, 418.0, 476.0, 463.0, 606.0, 577.0, 613.0, 648.0, 678.0, 732.0, 737.0, 796.0, 821.0, 791.0, 862.0, 795.0, 780.0, 793.0, 779.0, 722.0, 698.0, 721.0, 668.0, 664.0, 626.0, 523.0, 510.0, 481.0, 405.0, 386.0, 354.0, 328.0, 276.0, 262.0, 219.0, 168.0, 163.0, 160.0, 98.0, 109.0, 92.0, 71.0, 58.0, 49.0, 37.0, 28.0, 21.0, 18.0, 12.0, 10.0, 13.0, 7.0, 5.0, 2.0, 3.0, 2.0, 3.0, 5.0, 2.0, 0.0, 0.0, 1.0, 0.0, 1.0, 0.0, 0.0, 0.0, 0.0, 0.0, 0.0, 0.0, 0.0, 0.0, 0.0, 0.0, 0.0, 0.0, 0.0, 0.0, 1.0, 0.0, 0.0, 0.0, 0.0, 0.0, 0.0, 0.0, 0.0, 0.0, 0.0, 0.0, 0.0, 0.0, 0.0, 0.0, 0.0, 0.0, 1.0, 0.0, 0.0, 0.0, 0.0, 0.0, 0.0, 0.0, 0.0, 0.0, 0.0, 0.0, 0.0, 0.0, 0.0, 0.0, 0.0, 0.0, 0.0, 0.0, 0.0, 0.0, 0.0, 0.0, 0.0, 0.0, 0.0, 0.0, 0.0, 0.0, 0.0, 0.0, 0.0, 0.0, 0.0, 0.0, 0.0, 0.0, 0.0, 0.0, 0.0, 0.0, 0.0, 0.0, 0.0, 0.0, 0.0, 0.0, 0.0, 0.0, 0.0, 0.0, 0.0, 0.0, 0.0, 0.0, 0.0, 0.0, 0.0, 0.0, 0.0, 0.0, 0.0, 0.0, 0.0, 0.0, 0.0, 0.0, 0.0, 0.0, 0.0, 0.0, 0.0, 0.0, 0.0, 0.0, 0.0, 0.0, 0.0, 0.0, 0.0, 0.0, 0.0, 0.0, 0.0, 0.0, 0.0, 0.0, 0.0, 0.0, 0.0, 0.0, 0.0, 0.0, 0.0, 0.0, 0.0, 0.0, 0.0, 0.0, 0.0],
    "Name": "ThresholdDist-0",
    "Overflow": 0.0,
    "Type": "Histo1d",
    "Underflow": 0.0,
    "x": {
        "AxisTitle": "Threshold [e]",
        "Bins": 379,
        "High": 3785.0,
        "Low": -5.0
    },
    "y": {
        "AxisTitle": "Number of Pixels"
    },
    "z": {
        "AxisTitle": "z"
    }
}