time,Hardware,Voltage,Current
1626719035162,high-voltage-3,1,0.384054
time,Hardware,Voltage,Current
1626719035162,high-voltage-3,2,0.389121
time,Hardware,Voltage,Current
1626719035162,high-voltage-3,3,0.400895
time,Hardware,Voltage,Current
1626719035162,high-voltage-3,4,0.413128
time,Hardware,Voltage,Current
1626719035162,high-voltage-3,5,0.422809
time,Hardware,Voltage,Current
1626719035162,high-voltage-3,6,0.433042
time,Hardware,Voltage,Current
1626719035162,high-voltage-3,7,0.443468
time,Hardware,Voltage,Current
1626719035162,high-voltage-3,8,0.454299
time,Hardware,Voltage,Current
1626719035162,high-voltage-3,9,0.467648
time,Hardware,Voltage,Current
1626719035162,high-voltage-3,10,0.481492
time,Hardware,Voltage,Current
1626719035162,high-voltage-3,11,0.496256
time,Hardware,Voltage,Current
1626719035162,high-voltage-3,12,0.509626
time,Hardware,Voltage,Current
1626719035162,high-voltage-3,13,0.520466
time,Hardware,Voltage,Current
1626719035162,high-voltage-3,14,0.531818
time,Hardware,Voltage,Current
1626719035162,high-voltage-3,15,0.540818
time,Hardware,Voltage,Current
1626719035162,high-voltage-3,16,0.55093
time,Hardware,Voltage,Current
1626719035162,high-voltage-3,17,0.560389
time,Hardware,Voltage,Current
1626719035162,high-voltage-3,18,0.568722
time,Hardware,Voltage,Current
1626719035162,high-voltage-3,19,0.577247
time,Hardware,Voltage,Current
1626719035162,high-voltage-3,20,0.585557
time,Hardware,Voltage,Current
1626719035162,high-voltage-3,25,0.623245
time,Hardware,Voltage,Current
1626719035162,high-voltage-3,30,0.661563
time,Hardware,Voltage,Current
1626719035162,high-voltage-3,35,0.685161
time,Hardware,Voltage,Current
1626719035162,high-voltage-3,40,0.71347
time,Hardware,Voltage,Current
1626719035162,high-voltage-3,45,0.74076
time,Hardware,Voltage,Current
1626719035162,high-voltage-3,50,0.768968
time,Hardware,Voltage,Current
1626719035162,high-voltage-3,55,0.79678
time,Hardware,Voltage,Current
1626719035162,high-voltage-3,60,0.822708
time,Hardware,Voltage,Current
1626719035162,high-voltage-3,65,0.848912
time,Hardware,Voltage,Current
1626719035162,high-voltage-3,70,0.87476
time,Hardware,Voltage,Current
1626719035162,high-voltage-3,75,0.899594
time,Hardware,Voltage,Current
1626719035162,high-voltage-3,80,0.924615
time,Hardware,Voltage,Current
1626719035162,high-voltage-3,85,0.951418
time,Hardware,Voltage,Current
1626719035162,high-voltage-3,90,0.983223
time,Hardware,Voltage,Current
1626719035162,high-voltage-3,95,1.00188
time,Hardware,Voltage,Current
1626719035162,high-voltage-3,100,1.02708
