{
    "Data": [[2517.0, 1116.0, 735.0, 506.0, 381.0, 294.0, 251.0, 193.0, 164.0, 144.0, 110.0, 113.0, 93.0, 77.0, 75.0, 76.0, 65.0, 50.0, 44.0, 52.0, 45.0, 39.0, 50.0, 40.0, 33.0, 46.0, 28.0, 26.0, 27.0, 22.0, 24.0, 27.0, 21.0, 21.0, 17.0, 15.0, 21.0, 14.0, 18.0, 17.0, 19.0, 20.0, 13.0, 9.0, 15.0, 17.0, 23.0, 14.0, 20.0], [3014.0, 1637.0, 1133.0, 810.0, 683.0, 505.0, 397.0, 386.0, 324.0, 276.0, 253.0, 215.0, 193.0, 173.0, 159.0, 133.0, 125.0, 154.0, 118.0, 89.0, 89.0, 82.0, 96.0, 72.0, 72.0, 64.0, 69.0, 57.0, 57.0, 55.0, 47.0, 38.0, 59.0, 44.0, 54.0, 45.0, 40.0, 35.0, 28.0, 39.0, 33.0, 43.0, 25.0, 31.0, 31.0, 17.0, 27.0, 32.0, 40.0], [2985.0, 1761.0, 1355.0, 1025.0, 835.0, 742.0, 597.0, 563.0, 531.0, 485.0, 399.0, 389.0, 307.0, 302.0, 293.0, 257.0, 240.0, 237.0, 202.0, 183.0, 211.0, 233.0, 183.0, 146.0, 163.0, 153.0, 115.0, 137.0, 149.0, 154.0, 110.0, 86.0, 110.0, 98.0, 90.0, 109.0, 82.0, 87.0, 78.0, 57.0, 73.0, 73.0, 83.0, 66.0, 72.0, 66.0, 72.0, 78.0, 84.0], [2337.0, 1596.0, 1223.0, 1000.0, 937.0, 805.0, 722.0, 649.0, 630.0, 550.0, 525.0, 482.0, 439.0, 457.0, 393.0, 389.0, 370.0, 352.0, 386.0, 320.0, 330.0, 329.0, 295.0, 292.0, 269.0, 279.0, 265.0, 202.0, 224.0, 226.0, 226.0, 224.0, 225.0, 206.0, 204.0, 176.0, 205.0, 208.0, 165.0, 169.0, 161.0, 174.0, 168.0, 162.0, 182.0, 156.0, 137.0, 169.0, 184.0], [2019.0, 1244.0, 981.0, 824.0, 747.0, 672.0, 629.0, 617.0, 583.0, 559.0, 521.0, 505.0, 452.0, 474.0, 457.0, 427.0, 439.0, 444.0, 430.0, 427.0, 398.0, 395.0, 383.0, 366.0, 379.0, 366.0, 382.0, 383.0, 339.0, 361.0, 343.0, 336.0, 338.0, 326.0, 315.0, 346.0, 342.0, 331.0, 351.0, 348.0, 321.0, 298.0, 324.0, 320.0, 350.0, 398.0, 409.0, 395.0, 447.0], [3380.0, 1566.0, 1031.0, 759.0, 675.0, 562.0, 490.0, 549.0, 471.0, 455.0, 430.0, 392.0, 418.0, 391.0, 431.0, 378.0, 395.0, 412.0, 389.0, 370.0, 416.0, 402.0, 387.0, 399.0, 388.0, 420.0, 411.0, 442.0, 403.0, 420.0, 434.0, 431.0, 373.0, 409.0, 418.0, 465.0, 488.0, 467.0, 465.0, 490.0, 477.0, 538.0, 544.0, 646.0, 573.0, 646.0, 717.0, 800.0, 991.0], [4715.0, 2907.0, 1945.0, 1567.0, 1191.0, 1019.0, 852.0, 716.0, 670.0, 594.0, 554.0, 485.0, 458.0, 436.0, 401.0, 377.0, 340.0, 371.0, 385.0, 362.0, 363.0, 342.0, 358.0, 380.0, 375.0, 376.0, 324.0, 363.0, 380.0, 411.0, 403.0, 387.0, 448.0, 426.0, 450.0, 492.0, 479.0, 518.0, 518.0, 542.0, 620.0, 683.0, 699.0, 791.0, 846.0, 926.0, 1056.0, 1349.0, 1803.0], [1809.0, 1666.0, 1568.0, 1473.0, 1336.0, 1219.0, 1185.0, 1150.0, 1130.0, 1052.0, 945.0, 952.0, 877.0, 824.0, 776.0, 799.0, 733.0, 719.0, 668.0, 642.0, 612.0, 609.0, 601.0, 557.0, 579.0, 515.0, 544.0, 510.0, 522.0, 485.0, 490.0, 480.0, 486.0, 515.0, 463.0, 500.0, 505.0, 544.0, 570.0, 575.0, 601.0, 664.0, 775.0, 804.0, 893.0, 1111.0, 1289.0, 1682.0, 2683.0], [326.0, 265.0, 271.0, 283.0, 306.0, 342.0, 368.0, 415.0, 400.0, 439.0, 432.0, 467.0, 456.0, 499.0, 566.0, 552.0, 589.0, 612.0, 591.0, 631.0, 665.0, 720.0, 659.0, 696.0, 761.0, 728.0, 758.0, 718.0, 781.0, 813.0, 867.0, 859.0, 816.0, 932.0, 915.0, 964.0, 927.0, 893.0, 975.0, 937.0, 1092.0, 1024.0, 1138.0, 1185.0, 1273.0, 1494.0, 1580.0, 2150.0, 3357.0], [167.0, 81.0, 83.0, 66.0, 55.0, 67.0, 60.0, 55.0, 61.0, 81.0, 63.0, 97.0, 102.0, 101.0, 88.0, 115.0, 114.0, 132.0, 149.0, 148.0, 185.0, 160.0, 174.0, 189.0, 219.0, 246.0, 221.0, 302.0, 289.0, 335.0, 400.0, 409.0, 446.0, 525.0, 556.0, 573.0, 666.0, 756.0, 831.0, 882.0, 1009.0, 1221.0, 1290.0, 1576.0, 1884.0, 2226.0, 2716.0, 3611.0, 5604.0], [152.0, 84.0, 59.0, 44.0, 42.0, 37.0, 35.0, 28.0, 17.0, 23.0, 22.0, 24.0, 29.0, 27.0, 26.0, 22.0, 27.0, 22.0, 29.0, 47.0, 52.0, 36.0, 34.0, 47.0, 38.0, 50.0, 50.0, 55.0, 77.0, 68.0, 95.0, 95.0, 112.0, 108.0, 123.0, 116.0, 141.0, 177.0, 241.0, 259.0, 318.0, 372.0, 464.0, 576.0, 754.0, 1121.0, 1685.0, 2883.0, 5992.0], [152.0, 71.0, 46.0, 37.0, 30.0, 24.0, 26.0, 37.0, 20.0, 23.0, 17.0, 8.0, 20.0, 14.0, 14.0, 12.0, 15.0, 15.0, 22.0, 19.0, 19.0, 16.0, 24.0, 12.0, 25.0, 21.0, 22.0, 21.0, 26.0, 27.0, 22.0, 23.0, 32.0, 39.0, 36.0, 40.0, 45.0, 51.0, 66.0, 57.0, 82.0, 120.0, 138.0, 169.0, 238.0, 336.0, 517.0, 1010.0, 2750.0], [154.0, 71.0, 45.0, 33.0, 24.0, 24.0, 21.0, 21.0, 25.0, 25.0, 17.0, 14.0, 16.0, 11.0, 14.0, 11.0, 13.0, 16.0, 20.0, 14.0, 15.0, 12.0, 13.0, 13.0, 4.0, 15.0, 20.0, 13.0, 11.0, 10.0, 18.0, 12.0, 14.0, 14.0, 25.0, 16.0, 18.0, 27.0, 24.0, 27.0, 24.0, 35.0, 59.0, 68.0, 84.0, 118.0, 185.0, 305.0, 1007.0], [146.0, 72.0, 48.0, 31.0, 28.0, 34.0, 14.0, 24.0, 12.0, 6.0, 15.0, 13.0, 17.0, 14.0, 8.0, 5.0, 9.0, 10.0, 13.0, 14.0, 17.0, 8.0, 14.0, 5.0, 16.0, 11.0, 17.0, 11.0, 20.0, 15.0, 11.0, 11.0, 13.0, 11.0, 21.0, 11.0, 13.0, 9.0, 12.0, 15.0, 19.0, 17.0, 24.0, 28.0, 33.0, 50.0, 74.0, 132.0, 423.0], [134.0, 76.0, 36.0, 31.0, 34.0, 32.0, 19.0, 12.0, 23.0, 12.0, 11.0, 10.0, 11.0, 6.0, 12.0, 14.0, 11.0, 11.0, 11.0, 9.0, 3.0, 7.0, 18.0, 10.0, 9.0, 9.0, 10.0, 15.0, 10.0, 8.0, 12.0, 9.0, 8.0, 14.0, 12.0, 11.0, 13.0, 16.0, 10.0, 8.0, 7.0, 16.0, 6.0, 21.0, 30.0, 28.0, 38.0, 62.0, 194.0], [174.0, 75.0, 43.0, 28.0, 29.0, 26.0, 14.0, 16.0, 15.0, 16.0, 14.0, 9.0, 9.0, 5.0, 6.0, 9.0, 9.0, 9.0, 3.0, 9.0, 22.0, 10.0, 10.0, 11.0, 8.0, 12.0, 6.0, 9.0, 8.0, 5.0, 11.0, 6.0, 13.0, 5.0, 9.0, 8.0, 7.0, 13.0, 10.0, 10.0, 5.0, 18.0, 9.0, 14.0, 18.0, 25.0, 27.0, 45.0, 91.0], [245.0, 93.0, 51.0, 33.0, 29.0, 23.0, 19.0, 17.0, 13.0, 13.0, 14.0, 4.0, 6.0, 11.0, 10.0, 6.0, 10.0, 7.0, 8.0, 11.0, 6.0, 9.0, 11.0, 11.0, 13.0, 6.0, 5.0, 5.0, 7.0, 7.0, 9.0, 4.0, 11.0, 9.0, 12.0, 3.0, 5.0, 7.0, 11.0, 2.0, 6.0, 4.0, 12.0, 11.0, 24.0, 15.0, 19.0, 27.0, 59.0], [493.0, 130.0, 80.0, 37.0, 32.0, 26.0, 21.0, 15.0, 11.0, 18.0, 10.0, 14.0, 12.0, 11.0, 10.0, 16.0, 5.0, 14.0, 11.0, 4.0, 3.0, 6.0, 8.0, 6.0, 12.0, 10.0, 5.0, 6.0, 9.0, 8.0, 6.0, 4.0, 11.0, 3.0, 6.0, 5.0, 7.0, 6.0, 6.0, 4.0, 7.0, 10.0, 15.0, 6.0, 15.0, 13.0, 7.0, 20.0, 46.0], [832.0, 231.0, 105.0, 58.0, 47.0, 44.0, 32.0, 15.0, 16.0, 14.0, 18.0, 11.0, 10.0, 10.0, 8.0, 9.0, 5.0, 11.0, 9.0, 3.0, 9.0, 9.0, 9.0, 10.0, 6.0, 4.0, 10.0, 15.0, 7.0, 7.0, 6.0, 4.0, 2.0, 3.0, 6.0, 0.0, 6.0, 6.0, 3.0, 11.0, 5.0, 3.0, 3.0, 8.0, 12.0, 13.0, 12.0, 16.0, 29.0], [1398.0, 460.0, 223.0, 123.0, 78.0, 54.0, 42.0, 34.0, 24.0, 26.0, 16.0, 18.0, 13.0, 20.0, 18.0, 10.0, 6.0, 9.0, 11.0, 11.0, 6.0, 11.0, 6.0, 9.0, 4.0, 7.0, 9.0, 11.0, 5.0, 5.0, 3.0, 6.0, 9.0, 5.0, 5.0, 3.0, 5.0, 5.0, 5.0, 4.0, 9.0, 4.0, 7.0, 3.0, 6.0, 7.0, 13.0, 11.0, 17.0], [2138.0, 890.0, 480.0, 249.0, 175.0, 125.0, 93.0, 64.0, 42.0, 38.0, 29.0, 34.0, 27.0, 20.0, 17.0, 16.0, 11.0, 13.0, 16.0, 11.0, 5.0, 6.0, 14.0, 12.0, 4.0, 10.0, 11.0, 5.0, 12.0, 8.0, 8.0, 4.0, 5.0, 3.0, 6.0, 7.0, 4.0, 5.0, 4.0, 6.0, 6.0, 4.0, 6.0, 4.0, 6.0, 10.0, 8.0, 13.0, 18.0], [2912.0, 1354.0, 778.0, 462.0, 348.0, 230.0, 171.0, 143.0, 89.0, 103.0, 60.0, 46.0, 44.0, 38.0, 34.0, 25.0, 28.0, 23.0, 17.0, 20.0, 18.0, 18.0, 12.0, 15.0, 10.0, 10.0, 15.0, 8.0, 8.0, 11.0, 8.0, 12.0, 3.0, 4.0, 4.0, 9.0, 8.0, 5.0, 5.0, 3.0, 3.0, 5.0, 3.0, 7.0, 10.0, 8.0, 5.0, 10.0, 9.0], [3467.0, 1978.0, 1222.0, 835.0, 552.0, 413.0, 322.0, 253.0, 219.0, 153.0, 154.0, 117.0, 120.0, 70.0, 72.0, 57.0, 73.0, 46.0, 48.0, 37.0, 38.0, 37.0, 26.0, 31.0, 21.0, 16.0, 18.0, 15.0, 24.0, 16.0, 12.0, 11.0, 13.0, 7.0, 3.0, 6.0, 8.0, 10.0, 8.0, 10.0, 7.0, 6.0, 8.0, 10.0, 5.0, 6.0, 4.0, 10.0, 13.0], [3701.0, 2240.0, 1524.0, 1099.0, 864.0, 635.0, 555.0, 464.0, 403.0, 330.0, 259.0, 218.0, 183.0, 194.0, 175.0, 128.0, 96.0, 105.0, 89.0, 78.0, 73.0, 70.0, 57.0, 53.0, 58.0, 49.0, 50.0, 25.0, 29.0, 35.0, 28.0, 27.0, 12.0, 18.0, 18.0, 14.0, 22.0, 16.0, 9.0, 15.0, 11.0, 15.0, 10.0, 13.0, 5.0, 14.0, 5.0, 5.0, 14.0], [3369.0, 2279.0, 1827.0, 1319.0, 1057.0, 882.0, 751.0, 685.0, 575.0, 505.0, 443.0, 356.0, 348.0, 293.0, 264.0, 237.0, 250.0, 200.0, 175.0, 158.0, 150.0, 124.0, 119.0, 107.0, 109.0, 84.0, 97.0, 68.0, 71.0, 71.0, 59.0, 46.0, 47.0, 42.0, 42.0, 36.0, 48.0, 34.0, 23.0, 25.0, 28.0, 21.0, 17.0, 16.0, 16.0, 15.0, 21.0, 20.0, 18.0], [2775.0, 2027.0, 1709.0, 1517.0, 1192.0, 988.0, 957.0, 781.0, 692.0, 608.0, 596.0, 531.0, 489.0, 454.0, 419.0, 388.0, 356.0, 295.0, 267.0, 286.0, 289.0, 231.0, 225.0, 218.0, 207.0, 173.0, 156.0, 165.0, 124.0, 147.0, 97.0, 107.0, 109.0, 100.0, 89.0, 85.0, 66.0, 73.0, 62.0, 73.0, 56.0, 41.0, 48.0, 44.0, 37.0, 37.0, 22.0, 39.0, 27.0], [1927.0, 1570.0, 1391.0, 1265.0, 1133.0, 1009.0, 932.0, 875.0, 782.0, 716.0, 736.0, 644.0, 627.0, 523.0, 534.0, 510.0, 454.0, 471.0, 408.0, 429.0, 367.0, 352.0, 318.0, 326.0, 284.0, 277.0, 261.0, 253.0, 251.0, 217.0, 214.0, 221.0, 193.0, 194.0, 160.0, 183.0, 159.0, 149.0, 125.0, 121.0, 130.0, 103.0, 87.0, 89.0, 88.0, 90.0, 89.0, 83.0, 69.0], [1224.0, 1096.0, 1020.0, 1034.0, 930.0, 827.0, 794.0, 773.0, 773.0, 731.0, 684.0, 619.0, 603.0, 610.0, 584.0, 593.0, 533.0, 523.0, 491.0, 472.0, 496.0, 491.0, 463.0, 399.0, 439.0, 377.0, 383.0, 362.0, 379.0, 341.0, 383.0, 326.0, 310.0, 291.0, 287.0, 288.0, 262.0, 239.0, 258.0, 246.0, 205.0, 223.0, 199.0, 201.0, 167.0, 172.0, 178.0, 162.0, 146.0], [669.0, 671.0, 678.0, 641.0, 655.0, 648.0, 651.0, 636.0, 584.0, 578.0, 631.0, 602.0, 591.0, 597.0, 538.0, 585.0, 529.0, 541.0, 520.0, 528.0, 489.0, 521.0, 502.0, 483.0, 493.0, 453.0, 496.0, 467.0, 471.0, 417.0, 453.0, 395.0, 422.0, 448.0, 434.0, 407.0, 431.0, 333.0, 382.0, 396.0, 416.0, 367.0, 325.0, 336.0, 350.0, 315.0, 315.0, 323.0, 341.0], [408.0, 387.0, 382.0, 374.0, 424.0, 426.0, 409.0, 407.0, 465.0, 467.0, 421.0, 478.0, 478.0, 439.0, 439.0, 467.0, 509.0, 482.0, 495.0, 528.0, 475.0, 497.0, 460.0, 458.0, 505.0, 533.0, 450.0, 485.0, 477.0, 511.0, 474.0, 502.0, 510.0, 517.0, 519.0, 537.0, 542.0, 524.0, 539.0, 539.0, 518.0, 531.0, 520.0, 528.0, 537.0, 563.0, 548.0, 599.0, 616.0], [234.0, 166.0, 198.0, 212.0, 211.0, 249.0, 247.0, 288.0, 273.0, 286.0, 301.0, 312.0, 309.0, 330.0, 327.0, 352.0, 346.0, 413.0, 380.0, 412.0, 391.0, 385.0, 430.0, 403.0, 400.0, 456.0, 501.0, 492.0, 455.0, 446.0, 544.0, 516.0, 498.0, 530.0, 541.0, 559.0, 603.0, 593.0, 609.0, 664.0, 647.0, 675.0, 715.0, 701.0, 818.0, 823.0, 836.0, 916.0, 1172.0], [176.0, 99.0, 90.0, 100.0, 101.0, 123.0, 143.0, 156.0, 139.0, 166.0, 177.0, 176.0, 197.0, 197.0, 221.0, 255.0, 234.0, 246.0, 258.0, 285.0, 303.0, 305.0, 306.0, 331.0, 339.0, 346.0, 368.0, 387.0, 428.0, 404.0, 438.0, 455.0, 462.0, 491.0, 560.0, 524.0, 582.0, 580.0, 632.0, 696.0, 684.0, 744.0, 753.0, 857.0, 944.0, 1037.0, 1200.0, 1301.0, 1745.0], [109.0, 64.0, 69.0, 45.0, 52.0, 66.0, 61.0, 55.0, 73.0, 71.0, 105.0, 96.0, 114.0, 104.0, 139.0, 138.0, 127.0, 161.0, 159.0, 168.0, 187.0, 191.0, 214.0, 194.0, 228.0, 250.0, 293.0, 291.0, 289.0, 312.0, 335.0, 363.0, 401.0, 394.0, 413.0, 457.0, 484.0, 538.0, 539.0, 578.0, 672.0, 730.0, 775.0, 948.0, 1025.0, 1111.0, 1390.0, 1682.0, 2315.0], [116.0, 57.0, 42.0, 27.0, 28.0, 34.0, 35.0, 25.0, 34.0, 42.0, 35.0, 49.0, 55.0, 57.0, 53.0, 65.0, 72.0, 76.0, 101.0, 110.0, 119.0, 120.0, 110.0, 135.0, 138.0, 153.0, 177.0, 181.0, 192.0, 229.0, 227.0, 255.0, 241.0, 285.0, 272.0, 339.0, 363.0, 402.0, 424.0, 498.0, 580.0, 620.0, 730.0, 782.0, 949.0, 1128.0, 1437.0, 1899.0, 2778.0], [128.0, 50.0, 29.0, 32.0, 16.0, 31.0, 18.0, 16.0, 20.0, 16.0, 20.0, 23.0, 27.0, 21.0, 28.0, 39.0, 45.0, 50.0, 42.0, 51.0, 64.0, 64.0, 66.0, 73.0, 75.0, 94.0, 85.0, 90.0, 112.0, 113.0, 140.0, 157.0, 151.0, 179.0, 221.0, 232.0, 239.0, 275.0, 326.0, 339.0, 424.0, 487.0, 554.0, 683.0, 770.0, 990.0, 1353.0, 1865.0, 2915.0], [117.0, 48.0, 34.0, 28.0, 21.0, 23.0, 18.0, 13.0, 15.0, 23.0, 17.0, 8.0, 8.0, 12.0, 12.0, 14.0, 18.0, 24.0, 17.0, 28.0, 20.0, 29.0, 36.0, 33.0, 36.0, 40.0, 49.0, 59.0, 65.0, 61.0, 76.0, 93.0, 94.0, 107.0, 112.0, 127.0, 139.0, 171.0, 230.0, 266.0, 254.0, 328.0, 380.0, 494.0, 601.0, 815.0, 1066.0, 1586.0, 2834.0], [108.0, 52.0, 47.0, 26.0, 17.0, 24.0, 16.0, 10.0, 9.0, 12.0, 11.0, 9.0, 8.0, 7.0, 10.0, 7.0, 15.0, 13.0, 12.0, 7.0, 17.0, 10.0, 20.0, 18.0, 17.0, 12.0, 23.0, 31.0, 24.0, 34.0, 37.0, 44.0, 43.0, 43.0, 57.0, 74.0, 84.0, 99.0, 133.0, 159.0, 163.0, 189.0, 248.0, 322.0, 398.0, 558.0, 795.0, 1308.0, 2466.0], [119.0, 57.0, 37.0, 31.0, 12.0, 14.0, 15.0, 10.0, 7.0, 8.0, 14.0, 8.0, 9.0, 13.0, 11.0, 9.0, 14.0, 2.0, 6.0, 7.0, 3.0, 12.0, 12.0, 14.0, 6.0, 12.0, 11.0, 14.0, 9.0, 12.0, 13.0, 20.0, 20.0, 25.0, 29.0, 33.0, 37.0, 55.0, 52.0, 83.0, 84.0, 106.0, 133.0, 182.0, 263.0, 360.0, 561.0, 925.0, 1958.0], [108.0, 49.0, 37.0, 28.0, 12.0, 15.0, 8.0, 11.0, 8.0, 9.0, 6.0, 10.0, 7.0, 11.0, 10.0, 4.0, 10.0, 2.0, 6.0, 12.0, 8.0, 5.0, 8.0, 6.0, 7.0, 7.0, 4.0, 7.0, 10.0, 7.0, 15.0, 11.0, 10.0, 10.0, 7.0, 11.0, 15.0, 25.0, 27.0, 38.0, 40.0, 48.0, 87.0, 99.0, 155.0, 210.0, 310.0, 574.0, 1435.0], [129.0, 50.0, 31.0, 28.0, 27.0, 9.0, 11.0, 14.0, 10.0, 12.0, 6.0, 7.0, 6.0, 5.0, 9.0, 10.0, 12.0, 7.0, 7.0, 5.0, 5.0, 5.0, 4.0, 11.0, 5.0, 5.0, 5.0, 5.0, 7.0, 6.0, 5.0, 9.0, 3.0, 5.0, 6.0, 13.0, 10.0, 10.0, 11.0, 12.0, 26.0, 27.0, 26.0, 35.0, 76.0, 103.0, 190.0, 393.0, 907.0], [105.0, 54.0, 43.0, 19.0, 27.0, 17.0, 10.0, 9.0, 11.0, 12.0, 9.0, 7.0, 8.0, 7.0, 10.0, 5.0, 14.0, 8.0, 3.0, 8.0, 7.0, 10.0, 4.0, 5.0, 5.0, 3.0, 5.0, 4.0, 4.0, 4.0, 9.0, 4.0, 7.0, 8.0, 1.0, 8.0, 4.0, 5.0, 7.0, 6.0, 7.0, 13.0, 20.0, 24.0, 42.0, 44.0, 91.0, 196.0, 552.0], [114.0, 46.0, 38.0, 22.0, 31.0, 12.0, 7.0, 14.0, 14.0, 3.0, 6.0, 12.0, 9.0, 10.0, 3.0, 7.0, 8.0, 7.0, 8.0, 8.0, 12.0, 7.0, 6.0, 8.0, 8.0, 4.0, 3.0, 6.0, 3.0, 9.0, 3.0, 9.0, 3.0, 5.0, 2.0, 6.0, 2.0, 3.0, 5.0, 5.0, 3.0, 5.0, 9.0, 8.0, 17.0, 25.0, 48.0, 94.0, 316.0], [120.0, 44.0, 34.0, 24.0, 26.0, 18.0, 19.0, 4.0, 9.0, 13.0, 9.0, 9.0, 9.0, 7.0, 6.0, 5.0, 6.0, 12.0, 10.0, 4.0, 6.0, 4.0, 4.0, 4.0, 11.0, 3.0, 6.0, 6.0, 9.0, 3.0, 4.0, 6.0, 1.0, 8.0, 5.0, 3.0, 7.0, 3.0, 5.0, 6.0, 0.0, 5.0, 1.0, 10.0, 12.0, 15.0, 27.0, 47.0, 156.0], [121.0, 48.0, 33.0, 25.0, 17.0, 7.0, 9.0, 8.0, 12.0, 7.0, 12.0, 12.0, 2.0, 9.0, 12.0, 8.0, 11.0, 6.0, 11.0, 4.0, 3.0, 12.0, 8.0, 6.0, 9.0, 4.0, 2.0, 3.0, 0.0, 2.0, 8.0, 9.0, 5.0, 2.0, 5.0, 3.0, 3.0, 3.0, 7.0, 9.0, 2.0, 3.0, 8.0, 5.0, 9.0, 8.0, 9.0, 20.0, 75.0], [108.0, 66.0, 38.0, 19.0, 18.0, 14.0, 18.0, 11.0, 10.0, 5.0, 13.0, 9.0, 10.0, 7.0, 8.0, 4.0, 7.0, 10.0, 8.0, 0.0, 4.0, 8.0, 12.0, 4.0, 11.0, 10.0, 1.0, 2.0, 5.0, 6.0, 3.0, 6.0, 3.0, 4.0, 5.0, 5.0, 5.0, 5.0, 4.0, 3.0, 6.0, 5.0, 7.0, 3.0, 7.0, 5.0, 6.0, 16.0, 43.0], [102.0, 53.0, 35.0, 38.0, 16.0, 14.0, 10.0, 9.0, 9.0, 9.0, 4.0, 6.0, 8.0, 8.0, 7.0, 9.0, 12.0, 2.0, 6.0, 11.0, 7.0, 10.0, 15.0, 6.0, 5.0, 5.0, 4.0, 2.0, 5.0, 5.0, 2.0, 2.0, 5.0, 6.0, 3.0, 1.0, 2.0, 4.0, 9.0, 3.0, 2.0, 2.0, 5.0, 6.0, 6.0, 7.0, 9.0, 8.0, 28.0], [109.0, 54.0, 26.0, 20.0, 24.0, 16.0, 11.0, 17.0, 18.0, 11.0, 9.0, 7.0, 6.0, 4.0, 8.0, 6.0, 5.0, 11.0, 9.0, 7.0, 6.0, 5.0, 10.0, 7.0, 4.0, 8.0, 6.0, 7.0, 3.0, 5.0, 2.0, 3.0, 5.0, 6.0, 2.0, 6.0, 3.0, 5.0, 2.0, 3.0, 4.0, 1.0, 7.0, 6.0, 4.0, 3.0, 9.0, 6.0, 16.0], [115.0, 51.0, 28.0, 22.0, 18.0, 16.0, 10.0, 13.0, 10.0, 11.0, 12.0, 10.0, 7.0, 4.0, 14.0, 5.0, 9.0, 12.0, 2.0, 12.0, 3.0, 6.0, 7.0, 3.0, 6.0, 6.0, 4.0, 4.0, 4.0, 3.0, 2.0, 7.0, 10.0, 2.0, 5.0, 2.0, 8.0, 1.0, 2.0, 7.0, 5.0, 6.0, 2.0, 6.0, 5.0, 8.0, 8.0, 7.0, 9.0], [129.0, 45.0, 44.0, 22.0, 23.0, 7.0, 13.0, 16.0, 8.0, 9.0, 6.0, 10.0, 13.0, 7.0, 4.0, 8.0, 9.0, 4.0, 7.0, 9.0, 4.0, 6.0, 8.0, 6.0, 5.0, 1.0, 4.0, 7.0, 7.0, 7.0, 4.0, 3.0, 2.0, 3.0, 4.0, 4.0, 4.0, 6.0, 2.0, 2.0, 7.0, 5.0, 0.0, 9.0, 5.0, 4.0, 11.0, 9.0, 8.0], [107.0, 45.0, 35.0, 29.0, 25.0, 12.0, 15.0, 12.0, 10.0, 9.0, 11.0, 5.0, 7.0, 7.0, 7.0, 9.0, 4.0, 8.0, 4.0, 10.0, 11.0, 6.0, 8.0, 5.0, 6.0, 4.0, 2.0, 8.0, 4.0, 11.0, 3.0, 6.0, 6.0, 3.0, 6.0, 2.0, 2.0, 5.0, 8.0, 3.0, 3.0, 4.0, 4.0, 6.0, 7.0, 4.0, 8.0, 5.0, 11.0], [120.0, 43.0, 37.0, 28.0, 25.0, 15.0, 9.0, 11.0, 9.0, 8.0, 5.0, 10.0, 12.0, 8.0, 6.0, 9.0, 8.0, 5.0, 6.0, 10.0, 3.0, 11.0, 1.0, 9.0, 4.0, 3.0, 2.0, 6.0, 6.0, 5.0, 6.0, 5.0, 7.0, 5.0, 0.0, 6.0, 3.0, 5.0, 5.0, 1.0, 2.0, 9.0, 3.0, 4.0, 8.0, 5.0, 7.0, 8.0, 6.0]],
    "Name": "sCurve-0",
    "Overflow": 2566324.0,
    "Type": "Histo2d",
    "Underflow": 0.0,
    "x": {
        "AxisTitle": "Vcal",
        "Bins": 51,
        "High": 302.5,
        "Low": 47.5
    },
    "y": {
        "AxisTitle": "Occupancy",
        "Bins": 49,
        "High": 49.5,
        "Low": 0.5
    },
    "z": {
        "AxisTitle": "Number of pixels"
    }
}