{
    "Data": [21.0, 29.0, 2.0, 2.0, 8.0, 79.0, 465.0, 1439.0, 3047.0, 4310.0, 4467.0, 3809.0, 2944.0, 2489.0, 2380.0, 2282.0, 2050.0, 1901.0, 1739.0, 1918.0, 2126.0, 2330.0, 2376.0, 2259.0, 2018.0, 1572.0, 1152.0, 729.0, 552.0, 417.0, 362.0, 457.0, 588.0, 746.0, 970.0, 1163.0, 1362.0, 1662.0, 1833.0, 1882.0, 1959.0, 1932.0, 1775.0, 1571.0, 1290.0, 1159.0, 961.0, 769.0, 593.0, 418.0, 331.0, 210.0, 197.0, 136.0, 121.0, 75.0, 69.0, 53.0, 48.0, 24.0, 27.0, 24.0, 16.0, 16.0, 19.0, 18.0, 7.0, 6.0, 11.0, 11.0, 8.0, 6.0, 5.0, 5.0, 8.0, 9.0, 7.0, 3.0, 4.0, 1.0, 2.0, 0.0, 2.0, 2.0, 4.0, 0.0, 0.0, 1.0, 1.0, 1.0],
    "Name": "NoiseDist-0",
    "Overflow": 13.0,
    "Type": "Histo1d",
    "Underflow": 0.0,
    "x": {
        "AxisTitle": "Noise [e]",
        "Bins": 90,
        "High": 451.0,
        "Low": -2.0
    },
    "y": {
        "AxisTitle": "Number of Pixels"
    },
    "z": {
        "AxisTitle": "z"
    }
}