{
    "Data": [52.0, 51.0, 50.0, 53.0, 53.0, 54.0, 52.0, 51.0, 54.0, 56.0, 54.0, 52.0, 52.0, 54.0, 52.0, 54.0, 55.0, 51.0, 51.0, 53.0, 54.0, 50.0, 54.0, 54.0, 53.0, 55.0, 50.0, 57.0, 52.0, 52.0, 54.0, 58.0, 51.0, 57.0, 51.0, 52.0, 50.0, 52.0, 50.0, 51.0, 52.0, 51.0, 52.0, 53.0, 50.0, 51.0, 53.0, 51.0, 53.0, 50.0, 50.0],
    "Name": "Scurve-140-96",
    "Overflow": 0.0,
    "Type": "Histo1d",
    "Underflow": 0.0,
    "x": {
        "AxisTitle": "Vcal",
        "Bins": 51,
        "High": 302.5,
        "Low": 47.5
    },
    "y": {
        "AxisTitle": "Occupancy"
    },
    "z": {
        "AxisTitle": "z"
    }
}