{
    "Data": [0.0, 0.0, 0.0, 0.0, 0.0, 0.0, 0.0, 0.0, 0.0, 0.0, 0.0, 0.0, 0.0, 2.0, 7.0, 2.0, 0.0, 93.0, 371.0, 72.0, 26.0, 486.0, 1600.0, 616.0, 217.0, 1313.0, 2317.0, 844.0, 772.0, 1993.0, 1922.0, 1083.0, 1138.0, 1413.0, 844.0, 631.0, 845.0, 957.0, 749.0, 732.0, 698.0, 646.0, 983.0, 1795.0, 1515.0, 1243.0, 1805.0, 2821.0, 3199.0, 2586.0, 2373.0, 2505.0, 3030.0, 2336.0, 2138.0, 2184.0, 2304.0, 2274.0, 1859.0, 1857.0, 1677.0, 1605.0, 1166.0, 872.0, 870.0, 825.0, 852.0, 648.0, 580.0, 562.0, 551.0, 492.0, 417.0, 299.0, 258.0, 295.0, 288.0, 237.0, 190.0, 171.0, 177.0, 148.0, 135.0, 87.0, 101.0, 89.0, 84.0, 71.0, 66.0, 59.0, 54.0, 60.0, 45.0, 64.0, 53.0, 42.0, 39.0, 36.0, 34.0, 35.0, 27.0, 18.0, 13.0, 23.0, 29.0, 17.0, 17.0, 20.0, 25.0, 22.0, 19.0, 16.0, 6.0, 9.0, 8.0, 11.0, 7.0, 10.0, 7.0, 6.0, 9.0, 6.0, 12.0, 2.0, 3.0, 2.0, 9.0, 4.0, 10.0, 2.0, 5.0, 0.0, 10.0, 5.0, 3.0, 3.0, 4.0, 1.0, 5.0, 3.0, 3.0, 1.0, 5.0, 3.0, 4.0, 1.0, 6.0, 6.0, 1.0, 1.0, 3.0, 5.0, 2.0, 1.0, 3.0, 2.0, 3.0, 1.0, 4.0, 6.0, 1.0, 1.0, 0.0, 1.0, 1.0, 0.0, 0.0, 3.0, 2.0, 6.0, 0.0, 2.0, 2.0, 4.0, 2.0, 2.0, 2.0, 2.0, 1.0, 4.0, 0.0, 2.0, 2.0, 2.0, 2.0, 0.0, 3.0, 3.0, 5.0, 2.0, 2.0, 4.0, 2.0, 2.0, 0.0, 0.0, 0.0, 1.0, 1.0, 0.0, 0.0],
    "Name": "TimePerFitDist-0",
    "Overflow": 134.0,
    "Type": "Histo1d",
    "Underflow": 0.0,
    "x": {
        "AxisTitle": "Fit Time [us]",
        "Bins": 201,
        "High": 401.0,
        "Low": -1.0
    },
    "y": {
        "AxisTitle": "Number of Pixels"
    },
    "z": {
        "AxisTitle": "z"
    }
}