time,Hardware,Voltage,Current
1621458971824,high-voltage-2,1,0.368801
time,Hardware,Voltage,Current
1621458971824,high-voltage-2,2,0.438589
time,Hardware,Voltage,Current
1621458971824,high-voltage-2,3,0.489551
time,Hardware,Voltage,Current
1621458971824,high-voltage-2,4,0.533967
time,Hardware,Voltage,Current
1621458971824,high-voltage-2,5,0.569002
time,Hardware,Voltage,Current
1621458971824,high-voltage-2,6,0.604464
time,Hardware,Voltage,Current
1621458971824,high-voltage-2,7,0.637347
time,Hardware,Voltage,Current
1621458971824,high-voltage-2,8,0.669558
time,Hardware,Voltage,Current
1621458971824,high-voltage-2,9,0.698375
time,Hardware,Voltage,Current
1621458971824,high-voltage-2,10,0.730326
time,Hardware,Voltage,Current
1621458971824,high-voltage-2,11,0.757761
time,Hardware,Voltage,Current
1621458971824,high-voltage-2,12,0.785492
time,Hardware,Voltage,Current
1621458971824,high-voltage-2,13,0.813943
time,Hardware,Voltage,Current
1621458971824,high-voltage-2,14,0.83767
time,Hardware,Voltage,Current
1621458971824,high-voltage-2,15,0.859103
time,Hardware,Voltage,Current
1621458971824,high-voltage-2,16,0.880079
time,Hardware,Voltage,Current
1621458971824,high-voltage-2,17,0.897929
time,Hardware,Voltage,Current
1621458971824,high-voltage-2,18,0.916387
time,Hardware,Voltage,Current
1621458971824,high-voltage-2,19,0.931706
time,Hardware,Voltage,Current
1621458971824,high-voltage-2,20,0.950929
time,Hardware,Voltage,Current
1621458971824,high-voltage-2,25,1.03009
time,Hardware,Voltage,Current
1621458971824,high-voltage-2,30,1.10613
time,Hardware,Voltage,Current
1621458971824,high-voltage-2,35,1.18684
time,Hardware,Voltage,Current
1621458971824,high-voltage-2,40,1.27945
time,Hardware,Voltage,Current
1621458971824,high-voltage-2,45,1.39635
time,Hardware,Voltage,Current
1621458971824,high-voltage-2,50,1.47904
time,Hardware,Voltage,Current
1621458971824,high-voltage-2,55,1.54946
time,Hardware,Voltage,Current
1621458971824,high-voltage-2,60,1.61826
time,Hardware,Voltage,Current
1621458971824,high-voltage-2,65,1.68576
time,Hardware,Voltage,Current
1621458971824,high-voltage-2,70,1.74812
time,Hardware,Voltage,Current
1621458971824,high-voltage-2,75,1.81151
time,Hardware,Voltage,Current
1621458971824,high-voltage-2,80,1.87298
time,Hardware,Voltage,Current
1621458971824,high-voltage-2,85,1.93232
time,Hardware,Voltage,Current
1621458971824,high-voltage-2,90,1.98989
time,Hardware,Voltage,Current
1621458971824,high-voltage-2,95,2.04819
time,Hardware,Voltage,Current
1621458971824,high-voltage-2,100,2.10475
