time,Hardware,Voltage,Current
1625768271749,high-voltage,1,0.0552409
time,Hardware,Voltage,Current
1625768271749,high-voltage,2,0.0836095
time,Hardware,Voltage,Current
1625768271749,high-voltage,3,0.103834
time,Hardware,Voltage,Current
1625768271749,high-voltage,4,0.119265
time,Hardware,Voltage,Current
1625768271749,high-voltage,5,0.131695
time,Hardware,Voltage,Current
1625768271749,high-voltage,6,0.143715
time,Hardware,Voltage,Current
1625768271749,high-voltage,7,0.156199
time,Hardware,Voltage,Current
1625768271749,high-voltage,8,0.16745
time,Hardware,Voltage,Current
1625768271749,high-voltage,9,0.17896
time,Hardware,Voltage,Current
1625768271749,high-voltage,10,0.189986
time,Hardware,Voltage,Current
1625768271749,high-voltage,11,0.199325
time,Hardware,Voltage,Current
1625768271749,high-voltage,12,0.207951
time,Hardware,Voltage,Current
1625768271749,high-voltage,13,0.214394
time,Hardware,Voltage,Current
1625768271749,high-voltage,14,0.221467
time,Hardware,Voltage,Current
1625768271749,high-voltage,15,0.228374
time,Hardware,Voltage,Current
1625768271749,high-voltage,16,0.23475
time,Hardware,Voltage,Current
1625768271749,high-voltage,17,0.24075
time,Hardware,Voltage,Current
1625768271749,high-voltage,18,0.245793
time,Hardware,Voltage,Current
1625768271749,high-voltage,19,0.251408
time,Hardware,Voltage,Current
1625768271749,high-voltage,20,0.257654
time,Hardware,Voltage,Current
1625768271749,high-voltage,25,0.2833
time,Hardware,Voltage,Current
1625768271749,high-voltage,30,0.310096
time,Hardware,Voltage,Current
1625768271749,high-voltage,35,0.337937
time,Hardware,Voltage,Current
1625768271749,high-voltage,40,0.381723
time,Hardware,Voltage,Current
1625768271749,high-voltage,45,0.459386
time,Hardware,Voltage,Current
1625768271749,high-voltage,50,0.592546
time,Hardware,Voltage,Current
1625768271749,high-voltage,55,0.838198
time,Hardware,Voltage,Current
1625768271749,high-voltage,60,1.25097
time,Hardware,Voltage,Current
1625768271749,high-voltage,65,1.89678
time,Hardware,Voltage,Current
1625768271749,high-voltage,70,2.7962
time,Hardware,Voltage,Current
1625768271749,high-voltage,75,4.04191
time,Hardware,Voltage,Current
1625768271749,high-voltage,80,5.66959
time,Hardware,Voltage,Current
1625768271749,high-voltage,85,7.88331
time,Hardware,Voltage,Current
1625768271749,high-voltage,90,10
