time,Hardware,Voltage,Current
1621537970485,high-voltage-2,1,0.162361
time,Hardware,Voltage,Current
1621537970485,high-voltage-2,2,0.213045
time,Hardware,Voltage,Current
1621537970485,high-voltage-2,3,0.244064
time,Hardware,Voltage,Current
1621537970485,high-voltage-2,4,0.264379
time,Hardware,Voltage,Current
1621537970485,high-voltage-2,5,0.286001
time,Hardware,Voltage,Current
1621537970485,high-voltage-2,6,0.305014
time,Hardware,Voltage,Current
1621537970485,high-voltage-2,7,0.322466
time,Hardware,Voltage,Current
1621537970485,high-voltage-2,8,0.340415
time,Hardware,Voltage,Current
1621537970485,high-voltage-2,9,0.358095
time,Hardware,Voltage,Current
1621537970485,high-voltage-2,10,0.376926
time,Hardware,Voltage,Current
1621537970485,high-voltage-2,11,0.395168
time,Hardware,Voltage,Current
1621537970485,high-voltage-2,12,0.412818
time,Hardware,Voltage,Current
1621537970485,high-voltage-2,13,0.428089
time,Hardware,Voltage,Current
1621537970485,high-voltage-2,14,0.44563
time,Hardware,Voltage,Current
1621537970485,high-voltage-2,15,0.462315
time,Hardware,Voltage,Current
1621537970485,high-voltage-2,16,0.478257
time,Hardware,Voltage,Current
1621537970485,high-voltage-2,17,0.493822
time,Hardware,Voltage,Current
1621537970485,high-voltage-2,18,0.504228
time,Hardware,Voltage,Current
1621537970485,high-voltage-2,19,0.515328
time,Hardware,Voltage,Current
1621537970485,high-voltage-2,20,0.52746
time,Hardware,Voltage,Current
1621537970485,high-voltage-2,25,0.573685
time,Hardware,Voltage,Current
1621537970485,high-voltage-2,30,0.618877
time,Hardware,Voltage,Current
1621537970485,high-voltage-2,35,0.66511
time,Hardware,Voltage,Current
1621537970485,high-voltage-2,40,0.719012
time,Hardware,Voltage,Current
1621537970485,high-voltage-2,45,0.784503
time,Hardware,Voltage,Current
1621537970485,high-voltage-2,50,0.831253
time,Hardware,Voltage,Current
1621537970485,high-voltage-2,55,0.871513
time,Hardware,Voltage,Current
1621537970485,high-voltage-2,60,0.912393
time,Hardware,Voltage,Current
1621537970485,high-voltage-2,65,0.950717
time,Hardware,Voltage,Current
1621537970485,high-voltage-2,70,0.986591
time,Hardware,Voltage,Current
1621537970485,high-voltage-2,75,1.02437
time,Hardware,Voltage,Current
1621537970485,high-voltage-2,80,1.05761
time,Hardware,Voltage,Current
1621537970485,high-voltage-2,85,1.09326
time,Hardware,Voltage,Current
1621537970485,high-voltage-2,90,1.12743
time,Hardware,Voltage,Current
1621537970485,high-voltage-2,95,1.15917
time,Hardware,Voltage,Current
1621537970485,high-voltage-2,100,1.1924
