{
    "Data": [0.0, 0.0, 0.0, 0.0, 0.0, 0.0, 0.0, 0.0, 0.0, 0.0, 0.0, 0.0, 0.0, 0.0, 65.0, 16.0, 11.0, 35.0, 19.0, 12.0, 7.0, 15.0, 35.0, 55.0, 119.0, 175.0, 231.0, 288.0, 330.0, 367.0, 462.0, 498.0, 421.0, 510.0, 802.0, 909.0, 699.0, 1207.0, 2499.0, 3116.0, 2442.0, 2477.0, 3749.0, 5093.0, 4021.0, 2710.0, 2940.0, 4488.0, 3992.0, 2389.0, 1695.0, 1882.0, 1804.0, 1545.0, 1189.0, 1159.0, 1358.0, 1236.0, 910.0, 727.0, 793.0, 870.0, 690.0, 594.0, 535.0, 510.0, 514.0, 420.0, 405.0, 370.0, 374.0, 319.0, 277.0, 247.0, 237.0, 220.0, 189.0, 195.0, 164.0, 172.0, 141.0, 171.0, 132.0, 112.0, 107.0, 101.0, 81.0, 85.0, 92.0, 86.0, 77.0, 66.0, 54.0, 57.0, 56.0, 49.0, 41.0, 50.0, 49.0, 38.0, 38.0, 40.0, 33.0, 35.0, 29.0, 36.0, 23.0, 25.0, 34.0, 27.0, 22.0, 29.0, 16.0, 26.0, 33.0, 17.0, 18.0, 18.0, 13.0, 20.0, 10.0, 24.0, 12.0, 11.0, 10.0, 13.0, 9.0, 9.0, 9.0, 9.0, 15.0, 11.0, 11.0, 12.0, 16.0, 9.0, 11.0, 8.0, 4.0, 12.0, 12.0, 7.0, 8.0, 6.0, 9.0, 9.0, 8.0, 3.0, 4.0, 4.0, 5.0, 13.0, 5.0, 6.0, 5.0, 9.0, 8.0, 4.0, 4.0, 10.0, 8.0, 8.0, 4.0, 5.0, 4.0, 6.0, 3.0, 5.0, 4.0, 2.0, 3.0, 4.0, 4.0, 0.0, 4.0, 5.0, 2.0, 4.0, 1.0, 3.0, 0.0, 6.0, 1.0, 1.0, 1.0, 2.0, 3.0, 1.0, 3.0, 1.0, 7.0, 3.0, 4.0, 0.0, 7.0, 1.0, 2.0, 2.0, 0.0, 2.0, 0.0],
    "Name": "TimePerFitDist-0",
    "Overflow": 266.0,
    "Type": "Histo1d",
    "Underflow": 0.0,
    "x": {
        "AxisTitle": "Fit Time [us]",
        "Bins": 201,
        "High": 401.0,
        "Low": -1.0
    },
    "y": {
        "AxisTitle": "Number of Pixels"
    },
    "z": {
        "AxisTitle": "z"
    }
}