time,Hardware,Voltage,Current
1621474962439,high-voltage-2,1,0.26082
time,Hardware,Voltage,Current
1621474962439,high-voltage-2,2,0.297694
time,Hardware,Voltage,Current
1621474962439,high-voltage-2,3,0.321849
time,Hardware,Voltage,Current
1621474962439,high-voltage-2,4,0.34342
time,Hardware,Voltage,Current
1621474962439,high-voltage-2,5,0.366612
time,Hardware,Voltage,Current
1621474962439,high-voltage-2,6,0.39583
time,Hardware,Voltage,Current
1621474962439,high-voltage-2,7,0.422958
time,Hardware,Voltage,Current
1621474962439,high-voltage-2,8,0.453612
time,Hardware,Voltage,Current
1621474962439,high-voltage-2,9,0.490668
time,Hardware,Voltage,Current
1621474962439,high-voltage-2,10,0.525557
time,Hardware,Voltage,Current
1621474962439,high-voltage-2,11,0.566118
time,Hardware,Voltage,Current
1621474962439,high-voltage-2,12,0.604645
time,Hardware,Voltage,Current
1621474962439,high-voltage-2,13,0.645074
time,Hardware,Voltage,Current
1621474962439,high-voltage-2,14,0.682866
time,Hardware,Voltage,Current
1621474962439,high-voltage-2,15,0.718696
time,Hardware,Voltage,Current
1621474962439,high-voltage-2,16,0.759751
time,Hardware,Voltage,Current
1621474962439,high-voltage-2,17,0.793545
time,Hardware,Voltage,Current
1621474962439,high-voltage-2,18,0.819503
time,Hardware,Voltage,Current
1621474962439,high-voltage-2,19,0.845417
time,Hardware,Voltage,Current
1621474962439,high-voltage-2,20,0.869331
time,Hardware,Voltage,Current
1621474962439,high-voltage-2,25,0.974515
time,Hardware,Voltage,Current
1621474962439,high-voltage-2,30,1.07315
time,Hardware,Voltage,Current
1621474962439,high-voltage-2,35,1.16666
time,Hardware,Voltage,Current
1621474962439,high-voltage-2,40,1.27046
time,Hardware,Voltage,Current
1621474962439,high-voltage-2,45,1.39912
time,Hardware,Voltage,Current
1621474962439,high-voltage-2,50,1.49119
time,Hardware,Voltage,Current
1621474962439,high-voltage-2,55,1.57034
time,Hardware,Voltage,Current
1621474962439,high-voltage-2,60,1.64879
time,Hardware,Voltage,Current
1621474962439,high-voltage-2,65,1.72191
time,Hardware,Voltage,Current
1621474962439,high-voltage-2,70,1.79539
time,Hardware,Voltage,Current
1621474962439,high-voltage-2,75,1.86469
time,Hardware,Voltage,Current
1621474962439,high-voltage-2,80,1.93279
time,Hardware,Voltage,Current
1621474962439,high-voltage-2,85,1.99975
time,Hardware,Voltage,Current
1621474962439,high-voltage-2,90,2.06409
time,Hardware,Voltage,Current
1621474962439,high-voltage-2,95,2.12871
time,Hardware,Voltage,Current
1621474962439,high-voltage-2,100,2.19257
