{
    "Data": [2978.0, 20188.0, 16066.0, 8334.0, 3070.0, 1491.0, 1768.0, 2515.0, 3317.0, 3608.0, 3348.0, 3019.0, 2283.0, 1486.0, 1019.0, 613.0, 403.0, 212.0, 142.0, 58.0, 32.0, 10.0, 7.0, 6.0, 3.0, 1.0, 2.0, 2.0, 0.0, 1.0, 1.0, 1.0, 0.0, 0.0, 0.0, 1.0, 0.0, 1.0, 0.0, 0.0, 2.0, 1.0, 0.0, 0.0, 1.0, 0.0, 0.0, 0.0, 0.0, 0.0, 0.0],
    "Name": "Chi2Dist-0",
    "Overflow": 0.0,
    "Type": "Histo1d",
    "Underflow": 0.0,
    "x": {
        "AxisTitle": "Fit Chi/ndf",
        "Bins": 51,
        "High": 2.5250000953674318,
        "Low": -0.02500000037252903
    },
    "y": {
        "AxisTitle": "Number of Pixels"
    },
    "z": {
        "AxisTitle": "z"
    }
}