time,Hardware,Voltage,Current
1626342581457,high-voltage-2,1,0.0942996
time,Hardware,Voltage,Current
1626342581457,high-voltage-2,2,0.13805
time,Hardware,Voltage,Current
1626342581457,high-voltage-2,3,0.161213
time,Hardware,Voltage,Current
1626342581457,high-voltage-2,4,0.177098
time,Hardware,Voltage,Current
1626342581457,high-voltage-2,5,0.194757
time,Hardware,Voltage,Current
1626342581457,high-voltage-2,6,0.21776
time,Hardware,Voltage,Current
1626342581457,high-voltage-2,7,0.240422
time,Hardware,Voltage,Current
1626342581457,high-voltage-2,8,0.261095
time,Hardware,Voltage,Current
1626342581457,high-voltage-2,9,0.288096
time,Hardware,Voltage,Current
1626342581457,high-voltage-2,10,0.312665
time,Hardware,Voltage,Current
1626342581457,high-voltage-2,11,0.337176
time,Hardware,Voltage,Current
1626342581457,high-voltage-2,12,0.358676
time,Hardware,Voltage,Current
1626342581457,high-voltage-2,13,0.378977
time,Hardware,Voltage,Current
1626342581457,high-voltage-2,14,0.396049
time,Hardware,Voltage,Current
1626342581457,high-voltage-2,15,0.410006
time,Hardware,Voltage,Current
1626342581457,high-voltage-2,16,0.423911
time,Hardware,Voltage,Current
1626342581457,high-voltage-2,17,0.436069
time,Hardware,Voltage,Current
1626342581457,high-voltage-2,18,0.446484
time,Hardware,Voltage,Current
1626342581457,high-voltage-2,19,0.457689
time,Hardware,Voltage,Current
1626342581457,high-voltage-2,20,0.468791
time,Hardware,Voltage,Current
1626342581457,high-voltage-2,25,0.520954
time,Hardware,Voltage,Current
1626342581457,high-voltage-2,30,0.57249
time,Hardware,Voltage,Current
1626342581457,high-voltage-2,35,0.626172
time,Hardware,Voltage,Current
1626342581457,high-voltage-2,40,0.689006
time,Hardware,Voltage,Current
1626342581457,high-voltage-2,45,0.764668
time,Hardware,Voltage,Current
1626342581457,high-voltage-2,50,0.823602
time,Hardware,Voltage,Current
1626342581457,high-voltage-2,55,0.877371
time,Hardware,Voltage,Current
1626342581457,high-voltage-2,60,0.929382
time,Hardware,Voltage,Current
1626342581457,high-voltage-2,65,0.980097
time,Hardware,Voltage,Current
1626342581457,high-voltage-2,70,1.02764
time,Hardware,Voltage,Current
1626342581457,high-voltage-2,75,1.07381
time,Hardware,Voltage,Current
1626342581457,high-voltage-2,80,1.11916
time,Hardware,Voltage,Current
1626342581457,high-voltage-2,85,1.1613
time,Hardware,Voltage,Current
1626342581457,high-voltage-2,90,1.20024
time,Hardware,Voltage,Current
1626342581457,high-voltage-2,95,1.23659
time,Hardware,Voltage,Current
1626342581457,high-voltage-2,100,1.2683
