{
    "Data": [27.0, 53.0, 3.0, 5.0, 11.0, 13.0, 50.0, 156.0, 439.0, 1131.0, 2462.0, 4008.0, 4962.0, 5034.0, 4356.0, 4098.0, 4382.0, 4900.0, 5213.0, 4783.0, 3796.0, 2891.0, 2243.0, 1719.0, 1682.0, 1696.0, 1718.0, 1715.0, 1621.0, 1543.0, 1507.0, 1281.0, 1089.0, 977.0, 794.0, 700.0, 550.0, 470.0, 370.0, 293.0, 208.0, 195.0, 133.0, 108.0, 89.0, 86.0, 66.0, 69.0, 45.0, 38.0, 50.0, 27.0, 37.0, 30.0, 29.0, 20.0, 29.0, 25.0, 16.0, 19.0],
    "Name": "NoiseDist-0",
    "Overflow": 123.0,
    "Type": "Histo1d",
    "Underflow": 0.0,
    "x": {
        "AxisTitle": "Noise [e]",
        "Bins": 60,
        "High": 301.0,
        "Low": -2.0
    },
    "y": {
        "AxisTitle": "Number of Pixels"
    },
    "z": {
        "AxisTitle": "z"
    }
}