{
    "Data": [10.0, 7.0, 0.0, 0.0, 3.0, 4.0, 13.0, 24.0, 90.0, 287.0, 686.0, 1564.0, 2887.0, 4081.0, 4706.0, 4290.0, 3373.0, 2583.0, 2400.0, 2775.0, 3500.0, 4297.0, 4627.0, 4561.0, 4037.0, 3217.0, 2479.0, 1941.0, 1549.0, 1280.0, 1183.0, 1078.0, 1014.0, 976.0, 993.0, 899.0, 968.0, 896.0, 872.0, 812.0, 726.0, 721.0, 577.0, 475.0, 466.0, 359.0, 321.0, 250.0, 229.0, 162.0, 155.0, 106.0, 87.0, 82.0, 68.0, 63.0, 37.0, 27.0, 49.0, 30.0, 24.0, 28.0, 16.0, 18.0, 17.0, 25.0, 18.0, 10.0, 16.0, 10.0, 9.0, 6.0, 4.0, 7.0],
    "Name": "NoiseDist-0",
    "Overflow": 86.0,
    "Type": "Histo1d",
    "Underflow": 0.0,
    "x": {
        "AxisTitle": "Noise [e]",
        "Bins": 74,
        "High": 371.0,
        "Low": -2.0
    },
    "y": {
        "AxisTitle": "Number of Pixels"
    },
    "z": {
        "AxisTitle": "z"
    }
}