time,Hardware,Voltage,Current
1626341794096,high-voltage-2,1,0.0929381
time,Hardware,Voltage,Current
1626341794096,high-voltage-2,2,0.137925
time,Hardware,Voltage,Current
1626341794096,high-voltage-2,3,0.163584
time,Hardware,Voltage,Current
1626341794096,high-voltage-2,4,0.184422
time,Hardware,Voltage,Current
1626341794096,high-voltage-2,5,0.205094
time,Hardware,Voltage,Current
1626341794096,high-voltage-2,6,0.226745
time,Hardware,Voltage,Current
1626341794096,high-voltage-2,7,0.252215
time,Hardware,Voltage,Current
1626341794096,high-voltage-2,8,0.277358
time,Hardware,Voltage,Current
1626341794096,high-voltage-2,9,0.303635
time,Hardware,Voltage,Current
1626341794096,high-voltage-2,10,0.328825
time,Hardware,Voltage,Current
1626341794096,high-voltage-2,11,0.35302
time,Hardware,Voltage,Current
1626341794096,high-voltage-2,12,0.373526
time,Hardware,Voltage,Current
1626341794096,high-voltage-2,13,0.39057
time,Hardware,Voltage,Current
1626341794096,high-voltage-2,14,0.405345
time,Hardware,Voltage,Current
1626341794096,high-voltage-2,15,0.421189
time,Hardware,Voltage,Current
1626341794096,high-voltage-2,16,0.432885
time,Hardware,Voltage,Current
1626341794096,high-voltage-2,17,0.443262
time,Hardware,Voltage,Current
1626341794096,high-voltage-2,18,0.456293
time,Hardware,Voltage,Current
1626341794096,high-voltage-2,19,0.466883
time,Hardware,Voltage,Current
1626341794096,high-voltage-2,20,0.476653
time,Hardware,Voltage,Current
1626341794096,high-voltage-2,25,0.526497
time,Hardware,Voltage,Current
1626341794096,high-voltage-2,30,0.579279
time,Hardware,Voltage,Current
1626341794096,high-voltage-2,35,0.631724
time,Hardware,Voltage,Current
1626341794096,high-voltage-2,40,0.692478
time,Hardware,Voltage,Current
1626341794096,high-voltage-2,45,0.767147
time,Hardware,Voltage,Current
1626341794096,high-voltage-2,50,0.824663
time,Hardware,Voltage,Current
1626341794096,high-voltage-2,55,0.878662
time,Hardware,Voltage,Current
1626341794096,high-voltage-2,60,0.928563
time,Hardware,Voltage,Current
1626341794096,high-voltage-2,65,0.979431
time,Hardware,Voltage,Current
1626341794096,high-voltage-2,70,1.02596
time,Hardware,Voltage,Current
1626341794096,high-voltage-2,75,1.07088
time,Hardware,Voltage,Current
1626341794096,high-voltage-2,80,1.11496
time,Hardware,Voltage,Current
1626341794096,high-voltage-2,85,1.15729
time,Hardware,Voltage,Current
1626341794096,high-voltage-2,90,1.19647
time,Hardware,Voltage,Current
1626341794096,high-voltage-2,95,1.23234
time,Hardware,Voltage,Current
1626341794096,high-voltage-2,100,1.26476
