time,Hardware,Voltage,Current
1623351955317,high-voltage,1,0.0675025
time,Hardware,Voltage,Current
1623351955317,high-voltage,2,0.0844163
time,Hardware,Voltage,Current
1623351955317,high-voltage,3,0.098577
time,Hardware,Voltage,Current
1623351955317,high-voltage,4,0.109346
time,Hardware,Voltage,Current
1623351955317,high-voltage,5,0.119746
time,Hardware,Voltage,Current
1623351955317,high-voltage,6,0.129594
time,Hardware,Voltage,Current
1623351955317,high-voltage,7,0.138983
time,Hardware,Voltage,Current
1623351955317,high-voltage,8,0.147206
time,Hardware,Voltage,Current
1623351955317,high-voltage,9,0.157171
time,Hardware,Voltage,Current
1623351955317,high-voltage,10,0.166063
time,Hardware,Voltage,Current
1623351955317,high-voltage,11,0.175247
time,Hardware,Voltage,Current
1623351955317,high-voltage,12,0.182466
time,Hardware,Voltage,Current
1623351955317,high-voltage,13,0.190787
time,Hardware,Voltage,Current
1623351955317,high-voltage,14,0.197232
time,Hardware,Voltage,Current
1623351955317,high-voltage,15,0.203431
time,Hardware,Voltage,Current
1623351955317,high-voltage,16,0.209283
time,Hardware,Voltage,Current
1623351955317,high-voltage,17,0.214906
time,Hardware,Voltage,Current
1623351955317,high-voltage,2.20361e-07,0.220487
time,Hardware,Voltage,Current
1623351955317,high-voltage,19,0.224077
