{
    "Data": [0.0, 0.0, 0.0, 0.0, 0.0, 0.0, 0.0, 0.0, 0.0, 0.0, 0.0, 0.0, 0.0, 0.0, 0.0, 0.0, 0.0, 0.0, 0.0, 0.0, 0.0, 0.0, 0.0, 0.0, 0.0, 0.0, 0.0, 0.0, 0.0, 0.0, 0.0, 0.0, 0.0, 0.0, 0.0, 0.0, 0.0, 0.0, 0.0, 0.0, 0.0, 0.0, 0.0, 0.0, 0.0, 0.0, 0.0, 0.0, 0.0, 0.0, 54.0, 101.0, 132.0, 145.0, 159.0, 192.0, 217.0, 289.0, 265.0, 329.0, 390.0, 389.0, 481.0, 506.0, 548.0, 606.0, 644.0, 714.0, 739.0, 784.0, 773.0, 848.0, 816.0, 839.0, 858.0, 928.0, 860.0, 939.0, 926.0, 782.0, 891.0, 832.0, 859.0, 866.0, 891.0, 982.0, 1197.0, 1463.0, 1721.0, 2142.0, 2368.0, 2631.0, 2938.0, 2895.0, 2690.0, 2170.0, 1919.0, 1512.0, 1078.0, 775.0, 567.0, 396.0, 268.0, 188.0, 115.0, 97.0, 81.0, 49.0, 50.0, 52.0, 32.0, 31.0, 23.0, 18.0, 18.0, 19.0, 16.0, 9.0, 16.0, 16.0, 23.0, 10.0, 12.0, 16.0, 10.0, 10.0, 6.0, 12.0, 6.0, 5.0, 9.0, 5.0, 8.0, 5.0, 4.0, 9.0, 2.0, 8.0, 6.0, 3.0, 3.0, 5.0, 2.0, 2.0, 0.0, 4.0, 2.0, 4.0, 3.0, 3.0, 2.0, 6.0, 6.0, 8.0, 7.0, 11.0, 18.0, 17.0, 26.0, 26.0, 33.0, 46.0, 51.0, 62.0, 87.0, 105.0, 122.0, 160.0, 148.0, 226.0, 227.0, 305.0, 329.0, 406.0, 458.0, 502.0, 531.0, 609.0, 610.0, 689.0, 726.0, 786.0, 767.0, 830.0, 897.0, 872.0, 868.0, 881.0, 889.0, 893.0, 912.0, 843.0, 845.0, 761.0, 732.0, 688.0, 625.0, 579.0, 515.0, 476.0, 417.0, 401.0, 321.0, 317.0, 297.0, 242.0, 221.0, 193.0, 168.0, 136.0, 108.0, 102.0, 104.0, 61.0, 75.0, 43.0, 38.0, 35.0, 29.0, 24.0, 20.0, 13.0, 13.0, 8.0, 5.0, 2.0, 5.0, 2.0, 1.0, 1.0, 1.0, 1.0, 0.0, 1.0, 0.0, 1.0, 0.0, 1.0, 0.0, 0.0, 0.0, 0.0, 0.0, 0.0, 0.0, 0.0, 0.0, 0.0, 0.0, 0.0, 0.0, 0.0, 0.0, 0.0, 1.0, 0.0, 0.0, 0.0, 0.0, 0.0, 0.0, 1.0, 0.0, 0.0, 0.0, 0.0, 0.0, 0.0, 0.0, 0.0, 0.0, 0.0, 0.0, 0.0, 0.0, 0.0, 0.0, 0.0, 0.0, 0.0, 0.0, 0.0, 0.0, 0.0, 0.0, 0.0, 0.0, 0.0, 1.0, 0.0, 0.0, 0.0, 0.0, 0.0, 0.0, 0.0, 0.0, 0.0, 0.0, 0.0, 0.0, 0.0, 0.0, 0.0, 0.0, 0.0, 0.0, 0.0, 0.0, 0.0, 0.0, 0.0, 0.0, 0.0, 0.0, 0.0, 0.0, 0.0, 0.0, 0.0, 0.0, 0.0, 0.0, 0.0, 0.0, 0.0, 0.0, 0.0, 0.0, 0.0, 0.0, 0.0, 0.0, 0.0, 0.0, 0.0, 0.0, 0.0, 0.0, 0.0, 0.0, 0.0, 0.0, 0.0, 0.0, 0.0, 0.0, 0.0, 0.0, 0.0, 0.0, 0.0, 0.0, 0.0, 0.0, 0.0, 0.0, 0.0, 0.0, 0.0, 0.0, 0.0, 0.0],
    "Name": "ThresholdDist-0",
    "Overflow": 0.0,
    "Type": "Histo1d",
    "Underflow": 0.0,
    "x": {
        "AxisTitle": "Threshold [e]",
        "Bins": 363,
        "High": 3625.0,
        "Low": -5.0
    },
    "y": {
        "AxisTitle": "Number of Pixels"
    },
    "z": {
        "AxisTitle": "z"
    }
}