time,Hardware,Voltage,Current
1626614630148,high-voltage-3,1,0.248164
time,Hardware,Voltage,Current
1626614630148,high-voltage-3,2,0.264205
time,Hardware,Voltage,Current
1626614630148,high-voltage-3,3,0.280107
time,Hardware,Voltage,Current
1626614630148,high-voltage-3,4,0.292897
time,Hardware,Voltage,Current
1626614630148,high-voltage-3,5,0.304365
time,Hardware,Voltage,Current
1626614630148,high-voltage-3,6,0.315645
time,Hardware,Voltage,Current
1626614630148,high-voltage-3,7,0.327079
time,Hardware,Voltage,Current
1626614630148,high-voltage-3,8,0.33985
time,Hardware,Voltage,Current
1626614630148,high-voltage-3,9,0.352327
time,Hardware,Voltage,Current
1626614630148,high-voltage-3,10,0.365694
time,Hardware,Voltage,Current
1626614630148,high-voltage-3,11,0.379337
time,Hardware,Voltage,Current
1626614630148,high-voltage-3,12,0.393804
time,Hardware,Voltage,Current
1626614630148,high-voltage-3,13,0.406853
time,Hardware,Voltage,Current
1626614630148,high-voltage-3,14,0.417053
time,Hardware,Voltage,Current
1626614630148,high-voltage-3,15,0.428333
time,Hardware,Voltage,Current
1626614630148,high-voltage-3,16,0.438474
time,Hardware,Voltage,Current
1626614630148,high-voltage-3,17,0.44824
time,Hardware,Voltage,Current
1626614630148,high-voltage-3,18,0.458028
time,Hardware,Voltage,Current
1626614630148,high-voltage-3,19,0.467663
time,Hardware,Voltage,Current
1626614630148,high-voltage-3,20,0.475755
time,Hardware,Voltage,Current
1626614630148,high-voltage-3,25,0.511663
time,Hardware,Voltage,Current
1626614630148,high-voltage-3,30,0.539577
time,Hardware,Voltage,Current
1626614630148,high-voltage-3,35,0.565367
time,Hardware,Voltage,Current
1626614630148,high-voltage-3,40,0.590276
time,Hardware,Voltage,Current
1626614630148,high-voltage-3,45,0.613815
time,Hardware,Voltage,Current
1626614630148,high-voltage-3,50,0.636178
time,Hardware,Voltage,Current
1626614630148,high-voltage-3,55,0.657704
time,Hardware,Voltage,Current
1626614630148,high-voltage-3,60,0.679054
time,Hardware,Voltage,Current
1626614630148,high-voltage-3,65,0.702012
time,Hardware,Voltage,Current
1626614630148,high-voltage-3,70,0.723986
time,Hardware,Voltage,Current
1626614630148,high-voltage-3,75,0.74489
time,Hardware,Voltage,Current
1626614630148,high-voltage-3,80,0.768771
time,Hardware,Voltage,Current
1626614630148,high-voltage-3,85,0.791243
time,Hardware,Voltage,Current
1626614630148,high-voltage-3,90,0.812018
time,Hardware,Voltage,Current
1626614630148,high-voltage-3,95,0.833552
time,Hardware,Voltage,Current
1626614630148,high-voltage-3,100,0.853265
