{
    "Data": [[1436.0, 482.0, 258.0, 147.0, 122.0, 93.0, 85.0, 75.0, 52.0, 50.0, 35.0, 37.0, 30.0, 27.0, 13.0, 18.0, 12.0, 19.0, 15.0, 12.0, 10.0, 9.0, 5.0, 9.0, 9.0, 5.0, 10.0, 12.0, 18.0, 14.0, 11.0, 12.0, 15.0, 7.0, 10.0, 6.0, 8.0, 8.0, 10.0, 4.0, 5.0, 6.0, 11.0, 10.0, 11.0, 12.0, 24.0, 35.0, 46.0], [2586.0, 984.0, 547.0, 349.0, 248.0, 200.0, 141.0, 128.0, 97.0, 87.0, 77.0, 68.0, 67.0, 46.0, 37.0, 19.0, 31.0, 33.0, 25.0, 22.0, 30.0, 13.0, 23.0, 16.0, 10.0, 24.0, 14.0, 12.0, 10.0, 12.0, 12.0, 13.0, 5.0, 12.0, 8.0, 5.0, 7.0, 13.0, 10.0, 9.0, 20.0, 15.0, 19.0, 18.0, 17.0, 17.0, 23.0, 31.0, 44.0], [3794.0, 1780.0, 1083.0, 699.0, 507.0, 403.0, 327.0, 266.0, 215.0, 164.0, 141.0, 124.0, 116.0, 107.0, 96.0, 74.0, 63.0, 55.0, 63.0, 53.0, 44.0, 48.0, 40.0, 39.0, 35.0, 34.0, 33.0, 28.0, 26.0, 19.0, 21.0, 26.0, 25.0, 20.0, 20.0, 13.0, 17.0, 16.0, 14.0, 19.0, 18.0, 10.0, 18.0, 26.0, 19.0, 29.0, 20.0, 42.0, 74.0], [4171.0, 2389.0, 1634.0, 1208.0, 1005.0, 806.0, 638.0, 514.0, 434.0, 386.0, 342.0, 256.0, 247.0, 204.0, 204.0, 185.0, 171.0, 132.0, 139.0, 122.0, 111.0, 88.0, 80.0, 77.0, 83.0, 73.0, 60.0, 69.0, 69.0, 46.0, 51.0, 50.0, 37.0, 38.0, 58.0, 44.0, 48.0, 43.0, 38.0, 30.0, 27.0, 31.0, 33.0, 25.0, 43.0, 29.0, 39.0, 57.0, 73.0], [4270.0, 2447.0, 1848.0, 1476.0, 1255.0, 1009.0, 955.0, 836.0, 702.0, 671.0, 583.0, 516.0, 540.0, 402.0, 452.0, 353.0, 374.0, 314.0, 292.0, 286.0, 237.0, 229.0, 215.0, 209.0, 174.0, 162.0, 153.0, 175.0, 156.0, 137.0, 128.0, 130.0, 112.0, 88.0, 90.0, 83.0, 97.0, 76.0, 81.0, 69.0, 73.0, 71.0, 66.0, 94.0, 74.0, 75.0, 73.0, 81.0, 121.0], [6036.0, 2897.0, 1901.0, 1446.0, 1269.0, 1133.0, 1065.0, 899.0, 833.0, 838.0, 771.0, 694.0, 672.0, 640.0, 583.0, 539.0, 544.0, 506.0, 491.0, 492.0, 467.0, 438.0, 409.0, 365.0, 375.0, 349.0, 382.0, 306.0, 338.0, 338.0, 291.0, 262.0, 267.0, 238.0, 247.0, 229.0, 212.0, 200.0, 227.0, 179.0, 167.0, 174.0, 171.0, 150.0, 162.0, 129.0, 138.0, 172.0, 202.0], [5793.0, 4330.0, 3292.0, 2464.0, 1945.0, 1511.0, 1416.0, 1163.0, 1066.0, 923.0, 833.0, 791.0, 837.0, 730.0, 695.0, 649.0, 629.0, 623.0, 640.0, 576.0, 592.0, 609.0, 545.0, 571.0, 513.0, 534.0, 524.0, 486.0, 490.0, 512.0, 521.0, 491.0, 484.0, 446.0, 465.0, 464.0, 441.0, 460.0, 436.0, 400.0, 392.0, 434.0, 451.0, 436.0, 419.0, 387.0, 361.0, 409.0, 454.0], [1360.0, 1583.0, 1661.0, 1801.0, 1765.0, 1736.0, 1746.0, 1688.0, 1638.0, 1547.0, 1407.0, 1474.0, 1326.0, 1259.0, 1171.0, 1120.0, 1044.0, 979.0, 937.0, 881.0, 824.0, 799.0, 742.0, 732.0, 755.0, 713.0, 636.0, 667.0, 644.0, 678.0, 672.0, 679.0, 695.0, 619.0, 621.0, 648.0, 661.0, 679.0, 676.0, 703.0, 763.0, 720.0, 753.0, 729.0, 814.0, 818.0, 892.0, 978.0, 1085.0], [313.0, 254.0, 272.0, 293.0, 342.0, 382.0, 479.0, 513.0, 581.0, 552.0, 654.0, 648.0, 766.0, 745.0, 820.0, 839.0, 902.0, 963.0, 1028.0, 1079.0, 1069.0, 1103.0, 1107.0, 1129.0, 1110.0, 1133.0, 1152.0, 1223.0, 1126.0, 1200.0, 1159.0, 1197.0, 1094.0, 1186.0, 1145.0, 1137.0, 1055.0, 1039.0, 1109.0, 1100.0, 1127.0, 1104.0, 1204.0, 1195.0, 1269.0, 1436.0, 1554.0, 1792.0, 2247.0], [184.0, 100.0, 97.0, 109.0, 98.0, 124.0, 105.0, 100.0, 94.0, 129.0, 128.0, 158.0, 146.0, 190.0, 168.0, 187.0, 196.0, 219.0, 253.0, 282.0, 280.0, 363.0, 417.0, 395.0, 485.0, 482.0, 544.0, 577.0, 690.0, 748.0, 818.0, 869.0, 930.0, 1024.0, 1127.0, 1215.0, 1346.0, 1384.0, 1518.0, 1688.0, 1727.0, 1920.0, 1986.0, 2219.0, 2368.0, 2510.0, 2872.0, 3225.0, 4320.0], [170.0, 95.0, 75.0, 60.0, 66.0, 48.0, 58.0, 32.0, 52.0, 41.0, 47.0, 51.0, 47.0, 45.0, 48.0, 65.0, 48.0, 62.0, 62.0, 56.0, 72.0, 95.0, 94.0, 99.0, 110.0, 133.0, 134.0, 140.0, 169.0, 176.0, 205.0, 231.0, 257.0, 278.0, 342.0, 371.0, 477.0, 510.0, 603.0, 791.0, 845.0, 1113.0, 1367.0, 1679.0, 2023.0, 2728.0, 3566.0, 5020.0, 7780.0], [141.0, 71.0, 62.0, 43.0, 57.0, 48.0, 43.0, 35.0, 48.0, 30.0, 29.0, 21.0, 28.0, 22.0, 17.0, 18.0, 21.0, 26.0, 27.0, 27.0, 26.0, 35.0, 31.0, 27.0, 29.0, 44.0, 44.0, 40.0, 57.0, 61.0, 70.0, 86.0, 82.0, 84.0, 95.0, 121.0, 138.0, 195.0, 198.0, 243.0, 275.0, 341.0, 487.0, 573.0, 795.0, 1079.0, 1730.0, 3086.0, 7154.0], [144.0, 72.0, 54.0, 39.0, 44.0, 47.0, 35.0, 29.0, 35.0, 25.0, 26.0, 20.0, 25.0, 20.0, 8.0, 10.0, 10.0, 18.0, 18.0, 14.0, 13.0, 13.0, 13.0, 9.0, 12.0, 16.0, 23.0, 17.0, 21.0, 26.0, 30.0, 36.0, 30.0, 37.0, 36.0, 63.0, 49.0, 57.0, 61.0, 80.0, 99.0, 130.0, 158.0, 216.0, 313.0, 388.0, 696.0, 1292.0, 3630.0], [157.0, 66.0, 54.0, 49.0, 36.0, 34.0, 32.0, 35.0, 22.0, 27.0, 17.0, 14.0, 17.0, 25.0, 8.0, 7.0, 14.0, 10.0, 10.0, 10.0, 9.0, 9.0, 6.0, 8.0, 15.0, 11.0, 12.0, 11.0, 14.0, 10.0, 13.0, 14.0, 17.0, 10.0, 19.0, 20.0, 24.0, 35.0, 26.0, 28.0, 35.0, 59.0, 72.0, 86.0, 127.0, 173.0, 279.0, 518.0, 1773.0], [169.0, 67.0, 57.0, 31.0, 42.0, 39.0, 28.0, 27.0, 28.0, 26.0, 15.0, 18.0, 10.0, 13.0, 16.0, 9.0, 11.0, 6.0, 9.0, 5.0, 3.0, 7.0, 10.0, 9.0, 9.0, 9.0, 5.0, 4.0, 7.0, 9.0, 4.0, 8.0, 8.0, 15.0, 14.0, 14.0, 18.0, 19.0, 14.0, 21.0, 18.0, 32.0, 23.0, 35.0, 56.0, 66.0, 114.0, 243.0, 806.0], [233.0, 78.0, 30.0, 42.0, 36.0, 41.0, 26.0, 36.0, 26.0, 23.0, 18.0, 15.0, 12.0, 9.0, 5.0, 7.0, 13.0, 9.0, 4.0, 3.0, 3.0, 3.0, 5.0, 1.0, 7.0, 4.0, 7.0, 8.0, 11.0, 8.0, 9.0, 5.0, 6.0, 9.0, 6.0, 12.0, 5.0, 10.0, 17.0, 8.0, 15.0, 13.0, 25.0, 23.0, 37.0, 45.0, 75.0, 138.0, 379.0], [355.0, 108.0, 63.0, 25.0, 37.0, 38.0, 27.0, 31.0, 30.0, 21.0, 16.0, 24.0, 12.0, 11.0, 4.0, 4.0, 2.0, 2.0, 6.0, 4.0, 1.0, 4.0, 7.0, 7.0, 6.0, 12.0, 4.0, 4.0, 5.0, 6.0, 7.0, 7.0, 6.0, 4.0, 7.0, 5.0, 6.0, 5.0, 12.0, 7.0, 13.0, 18.0, 8.0, 16.0, 19.0, 33.0, 52.0, 80.0, 193.0], [732.0, 198.0, 95.0, 59.0, 46.0, 36.0, 32.0, 33.0, 20.0, 11.0, 21.0, 11.0, 13.0, 11.0, 6.0, 7.0, 7.0, 8.0, 2.0, 3.0, 0.0, 5.0, 5.0, 3.0, 6.0, 7.0, 7.0, 5.0, 2.0, 5.0, 7.0, 7.0, 7.0, 4.0, 3.0, 6.0, 6.0, 5.0, 8.0, 7.0, 9.0, 12.0, 4.0, 16.0, 18.0, 22.0, 29.0, 55.0, 104.0], [1261.0, 398.0, 233.0, 110.0, 77.0, 57.0, 50.0, 31.0, 27.0, 29.0, 23.0, 12.0, 10.0, 12.0, 10.0, 4.0, 7.0, 5.0, 3.0, 5.0, 3.0, 5.0, 5.0, 2.0, 6.0, 4.0, 9.0, 4.0, 4.0, 3.0, 8.0, 5.0, 5.0, 3.0, 4.0, 2.0, 6.0, 4.0, 7.0, 8.0, 10.0, 6.0, 6.0, 8.0, 15.0, 17.0, 17.0, 31.0, 82.0], [2111.0, 813.0, 399.0, 242.0, 158.0, 112.0, 80.0, 63.0, 45.0, 41.0, 36.0, 37.0, 16.0, 15.0, 13.0, 8.0, 5.0, 9.0, 9.0, 6.0, 7.0, 0.0, 5.0, 2.0, 5.0, 3.0, 7.0, 3.0, 3.0, 6.0, 5.0, 2.0, 4.0, 3.0, 5.0, 4.0, 4.0, 2.0, 4.0, 6.0, 13.0, 7.0, 6.0, 11.0, 11.0, 15.0, 22.0, 28.0, 56.0], [3109.0, 1333.0, 806.0, 481.0, 288.0, 255.0, 165.0, 139.0, 106.0, 81.0, 67.0, 58.0, 47.0, 29.0, 24.0, 18.0, 12.0, 14.0, 18.0, 13.0, 10.0, 13.0, 9.0, 15.0, 11.0, 4.0, 2.0, 6.0, 4.0, 5.0, 4.0, 6.0, 7.0, 3.0, 8.0, 4.0, 6.0, 3.0, 3.0, 5.0, 6.0, 4.0, 5.0, 5.0, 12.0, 10.0, 19.0, 31.0, 54.0], [3696.0, 1953.0, 1213.0, 828.0, 562.0, 449.0, 340.0, 255.0, 201.0, 157.0, 130.0, 104.0, 80.0, 78.0, 58.0, 43.0, 42.0, 42.0, 24.0, 34.0, 24.0, 23.0, 19.0, 14.0, 16.0, 9.0, 12.0, 12.0, 11.0, 9.0, 9.0, 8.0, 7.0, 6.0, 8.0, 7.0, 11.0, 8.0, 6.0, 6.0, 7.0, 4.0, 4.0, 4.0, 9.0, 16.0, 19.0, 25.0, 31.0], [3951.0, 2411.0, 1694.0, 1180.0, 993.0, 700.0, 552.0, 442.0, 376.0, 297.0, 254.0, 239.0, 196.0, 169.0, 145.0, 110.0, 115.0, 90.0, 62.0, 65.0, 62.0, 45.0, 49.0, 40.0, 46.0, 36.0, 40.0, 31.0, 24.0, 30.0, 14.0, 24.0, 9.0, 19.0, 18.0, 9.0, 8.0, 8.0, 7.0, 11.0, 10.0, 7.0, 15.0, 9.0, 15.0, 11.0, 17.0, 22.0, 43.0], [3501.0, 2409.0, 1898.0, 1534.0, 1273.0, 1051.0, 866.0, 753.0, 618.0, 525.0, 467.0, 435.0, 353.0, 295.0, 242.0, 225.0, 216.0, 192.0, 183.0, 135.0, 141.0, 117.0, 105.0, 107.0, 94.0, 86.0, 65.0, 78.0, 64.0, 51.0, 51.0, 50.0, 47.0, 41.0, 48.0, 35.0, 37.0, 36.0, 23.0, 26.0, 25.0, 17.0, 23.0, 19.0, 11.0, 19.0, 26.0, 25.0, 42.0], [2558.0, 2004.0, 1846.0, 1493.0, 1295.0, 1176.0, 1047.0, 938.0, 887.0, 748.0, 711.0, 652.0, 577.0, 522.0, 468.0, 428.0, 382.0, 327.0, 319.0, 337.0, 260.0, 249.0, 193.0, 204.0, 149.0, 183.0, 158.0, 123.0, 138.0, 140.0, 113.0, 102.0, 105.0, 78.0, 112.0, 69.0, 69.0, 67.0, 62.0, 55.0, 50.0, 46.0, 48.0, 35.0, 53.0, 39.0, 48.0, 40.0, 56.0], [1643.0, 1433.0, 1409.0, 1255.0, 1187.0, 1088.0, 976.0, 935.0, 909.0, 869.0, 789.0, 769.0, 718.0, 657.0, 653.0, 544.0, 557.0, 501.0, 492.0, 473.0, 437.0, 388.0, 411.0, 378.0, 335.0, 278.0, 293.0, 277.0, 259.0, 215.0, 219.0, 209.0, 201.0, 191.0, 190.0, 161.0, 149.0, 135.0, 142.0, 133.0, 119.0, 107.0, 113.0, 113.0, 109.0, 76.0, 85.0, 74.0, 102.0], [863.0, 777.0, 850.0, 858.0, 813.0, 816.0, 850.0, 770.0, 827.0, 721.0, 781.0, 724.0, 660.0, 694.0, 655.0, 639.0, 624.0, 643.0, 607.0, 569.0, 561.0, 540.0, 526.0, 511.0, 497.0, 459.0, 456.0, 450.0, 439.0, 441.0, 376.0, 353.0, 348.0, 326.0, 325.0, 334.0, 291.0, 280.0, 263.0, 258.0, 241.0, 209.0, 226.0, 236.0, 189.0, 187.0, 200.0, 186.0, 191.0], [448.0, 424.0, 434.0, 508.0, 530.0, 558.0, 536.0, 539.0, 499.0, 586.0, 557.0, 573.0, 565.0, 575.0, 613.0, 582.0, 569.0, 534.0, 553.0, 554.0, 601.0, 610.0, 557.0, 565.0, 567.0, 590.0, 566.0, 578.0, 540.0, 503.0, 556.0, 500.0, 525.0, 451.0, 483.0, 486.0, 433.0, 474.0, 474.0, 441.0, 467.0, 410.0, 384.0, 391.0, 370.0, 403.0, 363.0, 406.0, 396.0], [244.0, 214.0, 253.0, 234.0, 289.0, 306.0, 313.0, 330.0, 372.0, 344.0, 369.0, 371.0, 380.0, 390.0, 408.0, 390.0, 456.0, 411.0, 451.0, 464.0, 460.0, 487.0, 491.0, 503.0, 523.0, 547.0, 500.0, 562.0, 522.0, 611.0, 631.0, 594.0, 599.0, 578.0, 572.0, 626.0, 610.0, 660.0, 591.0, 650.0, 652.0, 608.0, 672.0, 670.0, 634.0, 680.0, 665.0, 705.0, 782.0], [141.0, 107.0, 128.0, 138.0, 148.0, 157.0, 191.0, 160.0, 190.0, 206.0, 210.0, 235.0, 219.0, 226.0, 233.0, 246.0, 224.0, 279.0, 297.0, 331.0, 300.0, 334.0, 329.0, 401.0, 422.0, 464.0, 398.0, 466.0, 479.0, 494.0, 561.0, 516.0, 533.0, 581.0, 584.0, 638.0, 650.0, 686.0, 682.0, 769.0, 787.0, 789.0, 854.0, 864.0, 955.0, 990.0, 1074.0, 1187.0, 1352.0], [144.0, 76.0, 64.0, 99.0, 100.0, 96.0, 97.0, 108.0, 100.0, 115.0, 92.0, 123.0, 128.0, 122.0, 115.0, 132.0, 142.0, 131.0, 167.0, 175.0, 210.0, 207.0, 229.0, 216.0, 237.0, 283.0, 294.0, 258.0, 317.0, 340.0, 383.0, 423.0, 447.0, 445.0, 484.0, 559.0, 588.0, 633.0, 649.0, 732.0, 716.0, 815.0, 922.0, 1060.0, 1080.0, 1243.0, 1421.0, 1657.0, 2059.0], [124.0, 75.0, 45.0, 36.0, 54.0, 51.0, 57.0, 43.0, 50.0, 48.0, 58.0, 57.0, 45.0, 55.0, 54.0, 67.0, 74.0, 85.0, 80.0, 105.0, 112.0, 129.0, 124.0, 124.0, 145.0, 168.0, 166.0, 167.0, 192.0, 224.0, 233.0, 249.0, 296.0, 320.0, 347.0, 387.0, 398.0, 469.0, 510.0, 564.0, 590.0, 755.0, 818.0, 894.0, 1070.0, 1286.0, 1556.0, 2017.0, 2776.0], [125.0, 59.0, 29.0, 42.0, 38.0, 37.0, 36.0, 33.0, 40.0, 33.0, 37.0, 25.0, 37.0, 47.0, 35.0, 40.0, 53.0, 42.0, 32.0, 44.0, 43.0, 35.0, 49.0, 78.0, 85.0, 78.0, 78.0, 82.0, 117.0, 111.0, 117.0, 161.0, 165.0, 168.0, 193.0, 233.0, 234.0, 300.0, 323.0, 382.0, 416.0, 527.0, 612.0, 726.0, 902.0, 1106.0, 1490.0, 2083.0, 3130.0], [129.0, 42.0, 67.0, 33.0, 42.0, 47.0, 54.0, 22.0, 40.0, 21.0, 21.0, 11.0, 22.0, 50.0, 24.0, 6.0, 20.0, 11.0, 18.0, 16.0, 25.0, 21.0, 35.0, 39.0, 39.0, 33.0, 32.0, 51.0, 50.0, 66.0, 62.0, 78.0, 107.0, 114.0, 116.0, 129.0, 139.0, 154.0, 182.0, 225.0, 257.0, 332.0, 429.0, 480.0, 613.0, 839.0, 1180.0, 1706.0, 2992.0], [105.0, 46.0, 42.0, 47.0, 26.0, 21.0, 22.0, 26.0, 21.0, 14.0, 13.0, 22.0, 6.0, 40.0, 15.0, 7.0, 10.0, 10.0, 24.0, 13.0, 14.0, 16.0, 29.0, 26.0, 21.0, 10.0, 10.0, 21.0, 15.0, 31.0, 31.0, 36.0, 39.0, 33.0, 61.0, 62.0, 75.0, 106.0, 100.0, 140.0, 182.0, 191.0, 206.0, 317.0, 379.0, 539.0, 828.0, 1336.0, 2655.0], [125.0, 52.0, 33.0, 35.0, 30.0, 27.0, 28.0, 27.0, 17.0, 17.0, 14.0, 32.0, 21.0, 22.0, 11.0, 5.0, 1.0, 3.0, 26.0, 10.0, 16.0, 9.0, 3.0, 4.0, 8.0, 5.0, 5.0, 25.0, 17.0, 10.0, 14.0, 23.0, 17.0, 17.0, 20.0, 30.0, 31.0, 32.0, 60.0, 54.0, 88.0, 93.0, 130.0, 155.0, 240.0, 366.0, 524.0, 880.0, 2055.0], [123.0, 52.0, 49.0, 31.0, 32.0, 32.0, 16.0, 20.0, 12.0, 44.0, 16.0, 15.0, 12.0, 5.0, 5.0, 7.0, 3.0, 6.0, 1.0, 18.0, 9.0, 1.0, 6.0, 0.0, 0.0, 3.0, 2.0, 14.0, 16.0, 2.0, 6.0, 9.0, 23.0, 6.0, 8.0, 12.0, 17.0, 14.0, 23.0, 23.0, 51.0, 54.0, 57.0, 83.0, 106.0, 194.0, 330.0, 593.0, 1413.0], [138.0, 58.0, 74.0, 31.0, 26.0, 25.0, 45.0, 21.0, 25.0, 20.0, 17.0, 9.0, 7.0, 6.0, 7.0, 4.0, 2.0, 0.0, 33.0, 2.0, 4.0, 1.0, 4.0, 1.0, 6.0, 0.0, 1.0, 2.0, 3.0, 3.0, 5.0, 4.0, 0.0, 2.0, 4.0, 3.0, 9.0, 4.0, 7.0, 8.0, 20.0, 18.0, 22.0, 48.0, 68.0, 81.0, 166.0, 350.0, 861.0], [108.0, 49.0, 38.0, 52.0, 37.0, 32.0, 23.0, 19.0, 20.0, 21.0, 10.0, 14.0, 7.0, 2.0, 4.0, 3.0, 3.0, 2.0, 0.0, 2.0, 3.0, 1.0, 0.0, 2.0, 0.0, 3.0, 3.0, 1.0, 1.0, 3.0, 0.0, 2.0, 17.0, 31.0, 2.0, 2.0, 5.0, 3.0, 4.0, 8.0, 9.0, 12.0, 25.0, 30.0, 25.0, 26.0, 71.0, 190.0, 535.0], [108.0, 56.0, 36.0, 30.0, 32.0, 39.0, 39.0, 17.0, 21.0, 22.0, 12.0, 11.0, 10.0, 32.0, 5.0, 3.0, 4.0, 5.0, 2.0, 25.0, 4.0, 0.0, 21.0, 9.0, 1.0, 2.0, 25.0, 3.0, 2.0, 0.0, 2.0, 1.0, 22.0, 25.0, 3.0, 25.0, 4.0, 1.0, 2.0, 4.0, 4.0, 3.0, 4.0, 5.0, 12.0, 22.0, 46.0, 99.0, 286.0], [107.0, 35.0, 44.0, 37.0, 33.0, 29.0, 32.0, 24.0, 14.0, 16.0, 10.0, 15.0, 8.0, 8.0, 25.0, 5.0, 2.0, 1.0, 1.0, 3.0, 1.0, 2.0, 5.0, 0.0, 0.0, 2.0, 2.0, 4.0, 1.0, 0.0, 1.0, 1.0, 1.0, 0.0, 2.0, 4.0, 5.0, 3.0, 0.0, 3.0, 2.0, 26.0, 2.0, 6.0, 5.0, 7.0, 11.0, 50.0, 141.0], [116.0, 42.0, 52.0, 32.0, 31.0, 37.0, 23.0, 21.0, 38.0, 21.0, 31.0, 11.0, 9.0, 2.0, 6.0, 4.0, 7.0, 1.0, 0.0, 22.0, 5.0, 1.0, 2.0, 6.0, 2.0, 1.0, 1.0, 2.0, 2.0, 1.0, 2.0, 2.0, 1.0, 26.0, 1.0, 2.0, 2.0, 1.0, 22.0, 5.0, 1.0, 29.0, 1.0, 1.0, 8.0, 8.0, 11.0, 32.0, 105.0], [104.0, 44.0, 44.0, 35.0, 30.0, 30.0, 28.0, 22.0, 12.0, 22.0, 19.0, 13.0, 5.0, 7.0, 0.0, 1.0, 1.0, 2.0, 2.0, 24.0, 3.0, 2.0, 2.0, 2.0, 1.0, 1.0, 3.0, 1.0, 2.0, 4.0, 25.0, 5.0, 1.0, 27.0, 3.0, 0.0, 4.0, 2.0, 0.0, 0.0, 4.0, 4.0, 2.0, 2.0, 4.0, 6.0, 10.0, 17.0, 40.0], [114.0, 52.0, 42.0, 30.0, 30.0, 26.0, 31.0, 28.0, 20.0, 30.0, 15.0, 9.0, 9.0, 5.0, 3.0, 4.0, 3.0, 7.0, 3.0, 3.0, 3.0, 2.0, 1.0, 2.0, 2.0, 22.0, 5.0, 1.0, 4.0, 2.0, 1.0, 1.0, 0.0, 21.0, 5.0, 0.0, 2.0, 1.0, 0.0, 4.0, 3.0, 1.0, 7.0, 3.0, 1.0, 6.0, 9.0, 16.0, 28.0], [116.0, 61.0, 22.0, 23.0, 33.0, 50.0, 39.0, 15.0, 16.0, 17.0, 12.0, 33.0, 23.0, 22.0, 21.0, 9.0, 0.0, 16.0, 15.0, 3.0, 1.0, 1.0, 3.0, 25.0, 3.0, 1.0, 0.0, 3.0, 2.0, 2.0, 0.0, 1.0, 0.0, 2.0, 4.0, 1.0, 3.0, 2.0, 25.0, 4.0, 1.0, 2.0, 4.0, 4.0, 0.0, 6.0, 6.0, 16.0, 18.0], [118.0, 47.0, 27.0, 37.0, 29.0, 30.0, 65.0, 30.0, 17.0, 17.0, 16.0, 13.0, 37.0, 4.0, 6.0, 2.0, 1.0, 2.0, 5.0, 5.0, 3.0, 2.0, 1.0, 1.0, 2.0, 2.0, 3.0, 2.0, 0.0, 1.0, 4.0, 0.0, 2.0, 0.0, 1.0, 3.0, 1.0, 1.0, 2.0, 2.0, 1.0, 1.0, 1.0, 5.0, 4.0, 3.0, 9.0, 7.0, 25.0], [114.0, 48.0, 32.0, 30.0, 27.0, 45.0, 31.0, 18.0, 15.0, 15.0, 10.0, 13.0, 7.0, 4.0, 2.0, 4.0, 2.0, 2.0, 3.0, 3.0, 1.0, 3.0, 2.0, 1.0, 1.0, 4.0, 5.0, 2.0, 3.0, 2.0, 3.0, 0.0, 0.0, 1.0, 1.0, 1.0, 2.0, 3.0, 1.0, 3.0, 21.0, 5.0, 3.0, 1.0, 3.0, 6.0, 4.0, 9.0, 16.0], [107.0, 45.0, 33.0, 30.0, 33.0, 28.0, 30.0, 22.0, 21.0, 18.0, 17.0, 9.0, 11.0, 3.0, 23.0, 6.0, 3.0, 23.0, 30.0, 2.0, 3.0, 4.0, 2.0, 2.0, 1.0, 2.0, 2.0, 1.0, 1.0, 2.0, 2.0, 3.0, 2.0, 0.0, 0.0, 2.0, 3.0, 0.0, 0.0, 4.0, 1.0, 2.0, 2.0, 2.0, 4.0, 4.0, 5.0, 10.0, 15.0], [130.0, 36.0, 40.0, 31.0, 31.0, 39.0, 20.0, 24.0, 17.0, 41.0, 14.0, 4.0, 12.0, 3.0, 4.0, 5.0, 3.0, 2.0, 2.0, 2.0, 2.0, 2.0, 3.0, 3.0, 3.0, 1.0, 1.0, 2.0, 1.0, 3.0, 2.0, 21.0, 7.0, 2.0, 2.0, 1.0, 1.0, 0.0, 0.0, 22.0, 5.0, 1.0, 1.0, 2.0, 4.0, 3.0, 5.0, 8.0, 14.0], [99.0, 54.0, 32.0, 44.0, 27.0, 26.0, 34.0, 24.0, 45.0, 18.0, 14.0, 12.0, 11.0, 4.0, 3.0, 3.0, 6.0, 0.0, 3.0, 1.0, 0.0, 1.0, 5.0, 3.0, 2.0, 5.0, 1.0, 1.0, 1.0, 0.0, 2.0, 1.0, 1.0, 0.0, 1.0, 1.0, 0.0, 3.0, 0.0, 2.0, 5.0, 2.0, 1.0, 3.0, 2.0, 2.0, 3.0, 13.0, 22.0], [95.0, 52.0, 31.0, 29.0, 33.0, 30.0, 22.0, 22.0, 21.0, 18.0, 14.0, 11.0, 13.0, 4.0, 8.0, 4.0, 2.0, 2.0, 4.0, 2.0, 3.0, 1.0, 0.0, 1.0, 2.0, 1.0, 21.0, 6.0, 2.0, 1.0, 2.0, 1.0, 2.0, 0.0, 3.0, 1.0, 2.0, 1.0, 2.0, 3.0, 1.0, 1.0, 2.0, 3.0, 3.0, 4.0, 3.0, 11.0, 22.0]],
    "Name": "sCurve-0",
    "Overflow": 2565584.0,
    "Type": "Histo2d",
    "Underflow": 0.0,
    "x": {
        "AxisTitle": "Vcal",
        "Bins": 51,
        "High": 302.5,
        "Low": 47.5
    },
    "y": {
        "AxisTitle": "Occupancy",
        "Bins": 49,
        "High": 49.5,
        "Low": 0.5
    },
    "z": {
        "AxisTitle": "Number of pixels"
    }
}