{
    "Data": [[688.0, 163.0, 86.0, 54.0, 24.0, 16.0, 19.0, 21.0, 18.0, 12.0, 20.0, 21.0, 19.0, 22.0, 23.0, 34.0, 18.0, 17.0, 29.0, 20.0, 22.0, 18.0, 27.0, 28.0, 17.0, 13.0, 14.0, 16.0, 6.0, 9.0, 7.0, 9.0, 10.0, 7.0, 10.0, 8.0, 12.0, 6.0, 10.0, 9.0, 9.0, 13.0, 8.0, 10.0, 10.0, 9.0, 12.0, 11.0, 11.0], [1490.0, 477.0, 238.0, 130.0, 98.0, 60.0, 39.0, 31.0, 33.0, 37.0, 25.0, 28.0, 28.0, 28.0, 23.0, 17.0, 23.0, 25.0, 27.0, 20.0, 29.0, 11.0, 31.0, 20.0, 16.0, 19.0, 18.0, 15.0, 23.0, 9.0, 9.0, 11.0, 16.0, 12.0, 10.0, 5.0, 9.0, 5.0, 3.0, 3.0, 8.0, 7.0, 9.0, 11.0, 15.0, 10.0, 13.0, 15.0, 33.0], [2817.0, 1195.0, 689.0, 404.0, 278.0, 200.0, 139.0, 108.0, 92.0, 70.0, 67.0, 55.0, 56.0, 48.0, 60.0, 45.0, 45.0, 38.0, 34.0, 48.0, 27.0, 23.0, 40.0, 21.0, 31.0, 21.0, 22.0, 17.0, 11.0, 14.0, 18.0, 16.0, 5.0, 8.0, 10.0, 4.0, 10.0, 3.0, 8.0, 6.0, 7.0, 10.0, 11.0, 14.0, 10.0, 13.0, 10.0, 15.0, 18.0], [3835.0, 2071.0, 1262.0, 927.0, 671.0, 531.0, 414.0, 319.0, 285.0, 220.0, 187.0, 159.0, 131.0, 139.0, 102.0, 113.0, 86.0, 85.0, 83.0, 80.0, 79.0, 52.0, 61.0, 46.0, 44.0, 38.0, 32.0, 40.0, 35.0, 25.0, 27.0, 17.0, 19.0, 12.0, 12.0, 24.0, 15.0, 15.0, 14.0, 5.0, 10.0, 14.0, 10.0, 10.0, 10.0, 24.0, 17.0, 18.0, 28.0], [3948.0, 2430.0, 1698.0, 1352.0, 1064.0, 921.0, 793.0, 672.0, 578.0, 512.0, 473.0, 411.0, 375.0, 343.0, 299.0, 267.0, 229.0, 212.0, 203.0, 174.0, 156.0, 165.0, 146.0, 139.0, 133.0, 102.0, 114.0, 79.0, 80.0, 76.0, 75.0, 53.0, 63.0, 42.0, 42.0, 43.0, 40.0, 29.0, 36.0, 39.0, 34.0, 35.0, 27.0, 26.0, 24.0, 28.0, 25.0, 23.0, 39.0], [4481.0, 2352.0, 1677.0, 1384.0, 1230.0, 1083.0, 964.0, 887.0, 805.0, 783.0, 757.0, 674.0, 602.0, 566.0, 539.0, 523.0, 490.0, 465.0, 425.0, 423.0, 360.0, 356.0, 296.0, 265.0, 309.0, 275.0, 285.0, 238.0, 248.0, 232.0, 196.0, 170.0, 184.0, 178.0, 155.0, 131.0, 144.0, 113.0, 110.0, 103.0, 102.0, 82.0, 95.0, 77.0, 77.0, 76.0, 67.0, 50.0, 71.0], [7160.0, 4093.0, 2663.0, 1933.0, 1539.0, 1228.0, 1045.0, 1006.0, 915.0, 825.0, 775.0, 708.0, 711.0, 698.0, 647.0, 641.0, 614.0, 588.0, 587.0, 585.0, 603.0, 552.0, 482.0, 536.0, 504.0, 485.0, 519.0, 475.0, 426.0, 468.0, 436.0, 390.0, 407.0, 392.0, 382.0, 402.0, 331.0, 339.0, 343.0, 284.0, 312.0, 263.0, 272.0, 274.0, 276.0, 206.0, 226.0, 207.0, 246.0], [2442.0, 2613.0, 2625.0, 2663.0, 2440.0, 2227.0, 2060.0, 1856.0, 1726.0, 1482.0, 1463.0, 1273.0, 1169.0, 1117.0, 1034.0, 901.0, 872.0, 788.0, 820.0, 763.0, 710.0, 731.0, 705.0, 660.0, 640.0, 622.0, 627.0, 646.0, 655.0, 597.0, 611.0, 657.0, 595.0, 625.0, 611.0, 650.0, 634.0, 655.0, 595.0, 610.0, 625.0, 627.0, 625.0, 627.0, 593.0, 657.0, 655.0, 665.0, 682.0], [272.0, 259.0, 296.0, 369.0, 448.0, 530.0, 608.0, 619.0, 792.0, 848.0, 912.0, 1010.0, 1087.0, 1069.0, 1158.0, 1162.0, 1188.0, 1312.0, 1278.0, 1307.0, 1300.0, 1298.0, 1240.0, 1248.0, 1239.0, 1245.0, 1271.0, 1259.0, 1183.0, 1192.0, 1123.0, 1054.0, 1077.0, 1020.0, 1018.0, 1045.0, 983.0, 1026.0, 1021.0, 1040.0, 1049.0, 1091.0, 1142.0, 1095.0, 1197.0, 1206.0, 1379.0, 1542.0, 1743.0], [186.0, 100.0, 86.0, 65.0, 72.0, 71.0, 76.0, 69.0, 83.0, 93.0, 120.0, 127.0, 142.0, 158.0, 174.0, 196.0, 217.0, 275.0, 274.0, 318.0, 328.0, 379.0, 478.0, 443.0, 527.0, 597.0, 669.0, 721.0, 779.0, 882.0, 958.0, 1087.0, 1140.0, 1238.0, 1365.0, 1396.0, 1538.0, 1569.0, 1761.0, 1944.0, 2034.0, 2046.0, 2270.0, 2350.0, 2551.0, 2662.0, 2912.0, 3313.0, 3997.0], [237.0, 91.0, 48.0, 46.0, 51.0, 29.0, 42.0, 35.0, 42.0, 50.0, 37.0, 38.0, 41.0, 49.0, 44.0, 44.0, 57.0, 62.0, 69.0, 63.0, 65.0, 100.0, 100.0, 81.0, 100.0, 101.0, 106.0, 109.0, 148.0, 163.0, 180.0, 210.0, 196.0, 261.0, 327.0, 348.0, 442.0, 495.0, 615.0, 728.0, 900.0, 1041.0, 1383.0, 1794.0, 2155.0, 3022.0, 3888.0, 5721.0, 8916.0], [329.0, 93.0, 55.0, 42.0, 30.0, 21.0, 34.0, 30.0, 27.0, 33.0, 30.0, 21.0, 30.0, 37.0, 55.0, 31.0, 32.0, 40.0, 39.0, 45.0, 40.0, 31.0, 41.0, 50.0, 41.0, 41.0, 58.0, 50.0, 40.0, 61.0, 72.0, 55.0, 68.0, 70.0, 76.0, 90.0, 115.0, 132.0, 151.0, 157.0, 211.0, 282.0, 359.0, 488.0, 663.0, 1029.0, 1642.0, 3037.0, 7193.0], [672.0, 155.0, 68.0, 40.0, 27.0, 22.0, 22.0, 19.0, 22.0, 23.0, 30.0, 30.0, 29.0, 28.0, 24.0, 27.0, 27.0, 35.0, 35.0, 33.0, 30.0, 26.0, 55.0, 31.0, 29.0, 36.0, 29.0, 32.0, 34.0, 28.0, 23.0, 30.0, 29.0, 27.0, 20.0, 37.0, 35.0, 49.0, 51.0, 61.0, 72.0, 103.0, 112.0, 135.0, 216.0, 328.0, 527.0, 1022.0, 3118.0], [1302.0, 291.0, 116.0, 44.0, 21.0, 28.0, 16.0, 12.0, 24.0, 13.0, 22.0, 23.0, 27.0, 28.0, 19.0, 39.0, 32.0, 28.0, 31.0, 38.0, 40.0, 33.0, 27.0, 20.0, 20.0, 31.0, 34.0, 21.0, 22.0, 14.0, 23.0, 16.0, 24.0, 15.0, 30.0, 18.0, 28.0, 22.0, 28.0, 31.0, 41.0, 42.0, 53.0, 70.0, 77.0, 117.0, 209.0, 359.0, 1291.0], [2186.0, 623.0, 278.0, 114.0, 71.0, 47.0, 20.0, 21.0, 12.0, 22.0, 19.0, 20.0, 29.0, 19.0, 16.0, 22.0, 23.0, 32.0, 22.0, 26.0, 22.0, 24.0, 29.0, 25.0, 27.0, 20.0, 15.0, 16.0, 14.0, 22.0, 25.0, 18.0, 17.0, 20.0, 23.0, 14.0, 15.0, 20.0, 22.0, 16.0, 32.0, 37.0, 41.0, 40.0, 50.0, 65.0, 82.0, 168.0, 500.0], [3344.0, 1255.0, 592.0, 257.0, 159.0, 74.0, 60.0, 45.0, 26.0, 23.0, 29.0, 32.0, 17.0, 25.0, 26.0, 20.0, 29.0, 28.0, 31.0, 25.0, 24.0, 23.0, 22.0, 21.0, 10.0, 17.0, 20.0, 16.0, 13.0, 17.0, 12.0, 11.0, 11.0, 11.0, 18.0, 11.0, 17.0, 14.0, 13.0, 12.0, 15.0, 18.0, 26.0, 26.0, 37.0, 56.0, 55.0, 107.0, 254.0], [4395.0, 1999.0, 1104.0, 633.0, 348.0, 254.0, 164.0, 94.0, 74.0, 68.0, 27.0, 25.0, 36.0, 29.0, 28.0, 28.0, 28.0, 30.0, 32.0, 24.0, 18.0, 31.0, 29.0, 27.0, 21.0, 22.0, 16.0, 25.0, 21.0, 15.0, 22.0, 8.0, 11.0, 10.0, 15.0, 10.0, 5.0, 8.0, 11.0, 9.0, 11.0, 17.0, 22.0, 10.0, 20.0, 32.0, 32.0, 50.0, 162.0], [4754.0, 2845.0, 1832.0, 1204.0, 743.0, 511.0, 370.0, 247.0, 185.0, 165.0, 109.0, 104.0, 61.0, 51.0, 52.0, 44.0, 39.0, 31.0, 32.0, 36.0, 29.0, 31.0, 24.0, 28.0, 30.0, 19.0, 16.0, 20.0, 14.0, 10.0, 10.0, 17.0, 9.0, 9.0, 8.0, 16.0, 14.0, 16.0, 10.0, 15.0, 15.0, 13.0, 10.0, 20.0, 21.0, 16.0, 28.0, 37.0, 103.0], [4439.0, 3016.0, 2260.0, 1645.0, 1261.0, 997.0, 745.0, 510.0, 444.0, 331.0, 273.0, 213.0, 167.0, 137.0, 127.0, 96.0, 94.0, 63.0, 57.0, 55.0, 58.0, 48.0, 27.0, 30.0, 26.0, 26.0, 18.0, 23.0, 13.0, 17.0, 11.0, 18.0, 9.0, 8.0, 9.0, 7.0, 5.0, 11.0, 7.0, 9.0, 12.0, 14.0, 8.0, 17.0, 27.0, 21.0, 30.0, 39.0, 65.0], [3452.0, 2854.0, 2401.0, 1922.0, 1551.0, 1319.0, 1060.0, 880.0, 775.0, 649.0, 557.0, 453.0, 360.0, 309.0, 268.0, 220.0, 206.0, 156.0, 134.0, 122.0, 108.0, 80.0, 83.0, 57.0, 59.0, 40.0, 41.0, 34.0, 35.0, 27.0, 26.0, 15.0, 16.0, 12.0, 17.0, 8.0, 7.0, 9.0, 11.0, 8.0, 13.0, 7.0, 6.0, 10.0, 13.0, 16.0, 16.0, 39.0, 75.0], [2378.0, 2075.0, 1967.0, 1813.0, 1640.0, 1460.0, 1284.0, 1153.0, 1065.0, 920.0, 820.0, 738.0, 654.0, 548.0, 523.0, 404.0, 390.0, 365.0, 273.0, 274.0, 214.0, 208.0, 186.0, 158.0, 129.0, 122.0, 89.0, 93.0, 76.0, 58.0, 41.0, 45.0, 52.0, 30.0, 26.0, 17.0, 23.0, 20.0, 13.0, 11.0, 13.0, 7.0, 11.0, 15.0, 8.0, 11.0, 16.0, 24.0, 46.0], [1619.0, 1537.0, 1488.0, 1460.0, 1345.0, 1266.0, 1175.0, 1177.0, 1089.0, 998.0, 962.0, 899.0, 766.0, 739.0, 693.0, 636.0, 616.0, 575.0, 481.0, 452.0, 427.0, 357.0, 345.0, 291.0, 267.0, 238.0, 222.0, 197.0, 162.0, 158.0, 136.0, 127.0, 98.0, 67.0, 57.0, 65.0, 51.0, 41.0, 36.0, 31.0, 29.0, 32.0, 23.0, 21.0, 20.0, 16.0, 12.0, 23.0, 33.0], [969.0, 992.0, 1012.0, 995.0, 1054.0, 1034.0, 996.0, 996.0, 976.0, 919.0, 922.0, 902.0, 840.0, 839.0, 834.0, 758.0, 752.0, 717.0, 625.0, 658.0, 569.0, 549.0, 530.0, 518.0, 482.0, 442.0, 393.0, 396.0, 360.0, 324.0, 269.0, 216.0, 230.0, 223.0, 181.0, 170.0, 151.0, 118.0, 105.0, 94.0, 88.0, 76.0, 58.0, 46.0, 32.0, 42.0, 18.0, 21.0, 41.0], [619.0, 611.0, 683.0, 701.0, 705.0, 772.0, 709.0, 696.0, 749.0, 758.0, 778.0, 775.0, 763.0, 729.0, 806.0, 747.0, 768.0, 716.0, 743.0, 745.0, 666.0, 698.0, 653.0, 650.0, 642.0, 643.0, 541.0, 530.0, 500.0, 462.0, 462.0, 404.0, 380.0, 356.0, 373.0, 320.0, 285.0, 277.0, 227.0, 210.0, 196.0, 186.0, 148.0, 128.0, 114.0, 87.0, 63.0, 77.0, 58.0], [553.0, 534.0, 528.0, 488.0, 468.0, 494.0, 473.0, 470.0, 519.0, 538.0, 576.0, 577.0, 542.0, 578.0, 606.0, 581.0, 607.0, 633.0, 613.0, 646.0, 703.0, 653.0, 649.0, 621.0, 660.0, 703.0, 636.0, 649.0, 619.0, 668.0, 568.0, 580.0, 538.0, 572.0, 530.0, 483.0, 464.0, 434.0, 417.0, 387.0, 405.0, 374.0, 308.0, 290.0, 258.0, 238.0, 184.0, 173.0, 147.0], [307.0, 322.0, 361.0, 368.0, 333.0, 364.0, 375.0, 327.0, 344.0, 361.0, 360.0, 398.0, 436.0, 451.0, 484.0, 519.0, 464.0, 467.0, 541.0, 577.0, 499.0, 555.0, 573.0, 561.0, 586.0, 612.0, 635.0, 619.0, 654.0, 670.0, 646.0, 622.0, 589.0, 647.0, 689.0, 693.0, 641.0, 631.0, 612.0, 641.0, 597.0, 627.0, 546.0, 506.0, 496.0, 474.0, 427.0, 390.0, 324.0], [296.0, 284.0, 271.0, 272.0, 240.0, 240.0, 231.0, 285.0, 291.0, 277.0, 301.0, 273.0, 309.0, 330.0, 302.0, 325.0, 316.0, 340.0, 365.0, 409.0, 402.0, 351.0, 387.0, 406.0, 451.0, 446.0, 486.0, 551.0, 525.0, 573.0, 584.0, 601.0, 619.0, 637.0, 647.0, 708.0, 714.0, 723.0, 752.0, 779.0, 783.0, 823.0, 865.0, 839.0, 818.0, 848.0, 812.0, 750.0, 717.0], [245.0, 179.0, 113.0, 180.0, 169.0, 173.0, 205.0, 186.0, 171.0, 156.0, 171.0, 187.0, 211.0, 229.0, 239.0, 244.0, 258.0, 256.0, 258.0, 248.0, 278.0, 295.0, 289.0, 270.0, 306.0, 316.0, 364.0, 357.0, 389.0, 416.0, 458.0, 459.0, 519.0, 549.0, 584.0, 684.0, 622.0, 730.0, 796.0, 796.0, 897.0, 938.0, 1023.0, 1054.0, 1164.0, 1117.0, 1233.0, 1337.0, 1368.0], [272.0, 193.0, 218.0, 245.0, 217.0, 222.0, 163.0, 187.0, 215.0, 161.0, 168.0, 159.0, 143.0, 142.0, 167.0, 148.0, 152.0, 159.0, 182.0, 159.0, 182.0, 214.0, 196.0, 181.0, 214.0, 200.0, 218.0, 246.0, 259.0, 249.0, 290.0, 305.0, 355.0, 399.0, 389.0, 468.0, 529.0, 556.0, 570.0, 664.0, 780.0, 810.0, 934.0, 1041.0, 1264.0, 1381.0, 1577.0, 1816.0, 2133.0], [228.0, 156.0, 249.0, 166.0, 149.0, 214.0, 210.0, 203.0, 136.0, 156.0, 200.0, 229.0, 151.0, 163.0, 153.0, 138.0, 154.0, 117.0, 140.0, 156.0, 165.0, 181.0, 185.0, 200.0, 206.0, 177.0, 203.0, 198.0, 210.0, 182.0, 225.0, 234.0, 258.0, 274.0, 303.0, 298.0, 317.0, 362.0, 431.0, 472.0, 500.0, 665.0, 779.0, 891.0, 1110.0, 1274.0, 1610.0, 2050.0, 2837.0], [146.0, 181.0, 145.0, 144.0, 183.0, 164.0, 105.0, 91.0, 158.0, 127.0, 120.0, 182.0, 221.0, 180.0, 182.0, 149.0, 173.0, 220.0, 150.0, 150.0, 149.0, 146.0, 112.0, 95.0, 150.0, 136.0, 109.0, 108.0, 117.0, 150.0, 150.0, 126.0, 102.0, 106.0, 155.0, 210.0, 184.0, 227.0, 298.0, 348.0, 349.0, 440.0, 497.0, 643.0, 846.0, 1076.0, 1474.0, 2113.0, 3350.0], [216.0, 196.0, 164.0, 189.0, 177.0, 147.0, 130.0, 87.0, 189.0, 144.0, 202.0, 195.0, 117.0, 130.0, 120.0, 143.0, 115.0, 100.0, 144.0, 147.0, 158.0, 166.0, 110.0, 100.0, 130.0, 220.0, 182.0, 104.0, 76.0, 90.0, 134.0, 108.0, 82.0, 105.0, 114.0, 147.0, 99.0, 135.0, 161.0, 148.0, 235.0, 266.0, 316.0, 432.0, 554.0, 786.0, 1156.0, 1775.0, 3244.0], [154.0, 51.0, 98.0, 168.0, 159.0, 85.0, 150.0, 110.0, 119.0, 75.0, 62.0, 146.0, 165.0, 161.0, 162.0, 126.0, 148.0, 104.0, 133.0, 183.0, 129.0, 162.0, 171.0, 78.0, 84.0, 169.0, 181.0, 110.0, 85.0, 85.0, 118.0, 150.0, 123.0, 115.0, 86.0, 105.0, 112.0, 59.0, 105.0, 112.0, 117.0, 148.0, 208.0, 287.0, 349.0, 519.0, 801.0, 1391.0, 2711.0], [224.0, 172.0, 189.0, 134.0, 175.0, 97.0, 114.0, 102.0, 71.0, 166.0, 201.0, 141.0, 136.0, 84.0, 162.0, 130.0, 86.0, 82.0, 114.0, 117.0, 155.0, 101.0, 106.0, 77.0, 171.0, 185.0, 159.0, 101.0, 85.0, 61.0, 66.0, 77.0, 64.0, 60.0, 108.0, 147.0, 89.0, 151.0, 78.0, 90.0, 69.0, 95.0, 133.0, 140.0, 209.0, 281.0, 467.0, 890.0, 2173.0], [212.0, 146.0, 190.0, 59.0, 65.0, 98.0, 116.0, 158.0, 93.0, 86.0, 114.0, 104.0, 60.0, 67.0, 92.0, 168.0, 57.0, 107.0, 135.0, 126.0, 69.0, 140.0, 143.0, 104.0, 79.0, 102.0, 53.0, 78.0, 183.0, 48.0, 48.0, 110.0, 103.0, 99.0, 102.0, 114.0, 87.0, 98.0, 154.0, 124.0, 148.0, 150.0, 128.0, 60.0, 139.0, 232.0, 290.0, 538.0, 1477.0], [187.0, 109.0, 101.0, 75.0, 98.0, 66.0, 65.0, 203.0, 225.0, 91.0, 87.0, 108.0, 130.0, 104.0, 68.0, 116.0, 112.0, 117.0, 58.0, 72.0, 143.0, 94.0, 70.0, 67.0, 117.0, 102.0, 145.0, 114.0, 118.0, 110.0, 104.0, 89.0, 139.0, 121.0, 56.0, 62.0, 81.0, 51.0, 68.0, 75.0, 96.0, 89.0, 44.0, 60.0, 104.0, 112.0, 147.0, 322.0, 911.0], [133.0, 167.0, 61.0, 72.0, 49.0, 82.0, 68.0, 98.0, 161.0, 116.0, 77.0, 57.0, 119.0, 133.0, 136.0, 109.0, 76.0, 119.0, 110.0, 127.0, 63.0, 103.0, 106.0, 135.0, 187.0, 168.0, 85.0, 154.0, 111.0, 94.0, 84.0, 38.0, 93.0, 53.0, 86.0, 93.0, 95.0, 78.0, 71.0, 81.0, 95.0, 24.0, 91.0, 32.0, 57.0, 121.0, 106.0, 143.0, 551.0], [104.0, 88.0, 104.0, 89.0, 109.0, 101.0, 126.0, 284.0, 87.0, 45.0, 65.0, 37.0, 127.0, 162.0, 88.0, 120.0, 97.0, 105.0, 141.0, 98.0, 73.0, 108.0, 92.0, 130.0, 43.0, 80.0, 76.0, 55.0, 81.0, 85.0, 147.0, 76.0, 88.0, 78.0, 25.0, 66.0, 100.0, 104.0, 86.0, 70.0, 92.0, 64.0, 18.0, 86.0, 32.0, 47.0, 77.0, 183.0, 366.0], [110.0, 142.0, 168.0, 102.0, 77.0, 122.0, 162.0, 106.0, 64.0, 99.0, 103.0, 129.0, 76.0, 100.0, 52.0, 44.0, 57.0, 104.0, 117.0, 116.0, 103.0, 74.0, 84.0, 113.0, 73.0, 75.0, 89.0, 60.0, 58.0, 92.0, 24.0, 40.0, 78.0, 68.0, 95.0, 157.0, 89.0, 40.0, 75.0, 171.0, 103.0, 57.0, 118.0, 143.0, 59.0, 33.0, 127.0, 152.0, 223.0], [150.0, 65.0, 168.0, 186.0, 83.0, 97.0, 69.0, 32.0, 79.0, 55.0, 35.0, 80.0, 40.0, 95.0, 73.0, 50.0, 106.0, 71.0, 123.0, 66.0, 76.0, 171.0, 61.0, 47.0, 78.0, 108.0, 93.0, 73.0, 43.0, 77.0, 57.0, 45.0, 20.0, 166.0, 32.0, 42.0, 103.0, 82.0, 37.0, 89.0, 20.0, 59.0, 44.0, 96.0, 111.0, 88.0, 89.0, 68.0, 166.0], [61.0, 119.0, 60.0, 132.0, 70.0, 30.0, 10.0, 33.0, 98.0, 90.0, 82.0, 61.0, 57.0, 53.0, 90.0, 99.0, 80.0, 123.0, 31.0, 33.0, 61.0, 67.0, 139.0, 92.0, 71.0, 76.0, 114.0, 74.0, 39.0, 23.0, 20.0, 45.0, 35.0, 18.0, 5.0, 45.0, 48.0, 56.0, 26.0, 67.0, 51.0, 27.0, 62.0, 82.0, 115.0, 106.0, 54.0, 54.0, 99.0], [41.0, 34.0, 20.0, 77.0, 77.0, 68.0, 94.0, 66.0, 96.0, 26.0, 65.0, 75.0, 91.0, 54.0, 122.0, 46.0, 38.0, 37.0, 30.0, 66.0, 87.0, 144.0, 122.0, 93.0, 95.0, 136.0, 27.0, 15.0, 33.0, 51.0, 57.0, 53.0, 78.0, 27.0, 24.0, 5.0, 2.0, 1.0, 26.0, 19.0, 23.0, 57.0, 62.0, 7.0, 43.0, 58.0, 34.0, 74.0, 70.0], [47.0, 50.0, 14.0, 31.0, 91.0, 74.0, 34.0, 61.0, 64.0, 34.0, 16.0, 63.0, 59.0, 59.0, 93.0, 99.0, 129.0, 88.0, 56.0, 60.0, 26.0, 20.0, 29.0, 60.0, 50.0, 58.0, 73.0, 51.0, 41.0, 47.0, 58.0, 37.0, 38.0, 10.0, 54.0, 36.0, 32.0, 26.0, 68.0, 60.0, 16.0, 49.0, 13.0, 35.0, 48.0, 35.0, 74.0, 22.0, 20.0], [100.0, 54.0, 41.0, 27.0, 197.0, 43.0, 19.0, 37.0, 37.0, 48.0, 20.0, 20.0, 45.0, 19.0, 39.0, 87.0, 72.0, 61.0, 44.0, 21.0, 29.0, 97.0, 44.0, 25.0, 23.0, 75.0, 67.0, 63.0, 24.0, 24.0, 50.0, 39.0, 63.0, 41.0, 68.0, 82.0, 92.0, 35.0, 47.0, 86.0, 33.0, 40.0, 56.0, 50.0, 31.0, 79.0, 48.0, 103.0, 64.0], [76.0, 17.0, 27.0, 15.0, 4.0, 8.0, 50.0, 46.0, 43.0, 10.0, 54.0, 99.0, 56.0, 19.0, 34.0, 40.0, 39.0, 17.0, 34.0, 98.0, 49.0, 32.0, 28.0, 57.0, 92.0, 61.0, 24.0, 52.0, 29.0, 95.0, 27.0, 6.0, 28.0, 11.0, 28.0, 4.0, 1.0, 15.0, 19.0, 38.0, 39.0, 5.0, 20.0, 15.0, 2.0, 66.0, 22.0, 33.0, 15.0], [29.0, 32.0, 79.0, 10.0, 50.0, 12.0, 41.0, 30.0, 45.0, 50.0, 40.0, 9.0, 53.0, 87.0, 64.0, 20.0, 17.0, 67.0, 66.0, 41.0, 51.0, 60.0, 40.0, 47.0, 57.0, 66.0, 37.0, 48.0, 80.0, 23.0, 31.0, 31.0, 11.0, 27.0, 17.0, 23.0, 1.0, 42.0, 28.0, 26.0, 29.0, 9.0, 7.0, 27.0, 50.0, 10.0, 5.0, 14.0, 67.0], [80.0, 57.0, 21.0, 22.0, 5.0, 3.0, 19.0, 42.0, 12.0, 63.0, 20.0, 29.0, 17.0, 11.0, 20.0, 15.0, 31.0, 39.0, 31.0, 20.0, 52.0, 31.0, 23.0, 34.0, 95.0, 27.0, 15.0, 55.0, 29.0, 40.0, 25.0, 28.0, 15.0, 18.0, 40.0, 22.0, 3.0, 3.0, 26.0, 64.0, 13.0, 3.0, 12.0, 40.0, 30.0, 13.0, 53.0, 46.0, 15.0], [70.0, 10.0, 5.0, 8.0, 26.0, 31.0, 26.0, 7.0, 5.0, 51.0, 27.0, 30.0, 46.0, 23.0, 35.0, 24.0, 14.0, 18.0, 41.0, 27.0, 24.0, 21.0, 41.0, 13.0, 12.0, 50.0, 35.0, 17.0, 27.0, 19.0, 5.0, 10.0, 31.0, 33.0, 25.0, 4.0, 1.0, 33.0, 25.0, 17.0, 19.0, 10.0, 40.0, 10.0, 23.0, 12.0, 7.0, 18.0, 38.0], [46.0, 16.0, 21.0, 10.0, 5.0, 2.0, 11.0, 26.0, 7.0, 21.0, 49.0, 28.0, 26.0, 27.0, 21.0, 34.0, 23.0, 13.0, 29.0, 18.0, 19.0, 33.0, 23.0, 18.0, 25.0, 23.0, 72.0, 32.0, 10.0, 9.0, 5.0, 8.0, 6.0, 8.0, 24.0, 38.0, 3.0, 2.0, 32.0, 50.0, 1.0, 7.0, 19.0, 12.0, 6.0, 4.0, 11.0, 46.0, 32.0], [30.0, 11.0, 6.0, 12.0, 50.0, 5.0, 23.0, 6.0, 8.0, 12.0, 31.0, 25.0, 21.0, 31.0, 21.0, 16.0, 17.0, 24.0, 34.0, 36.0, 26.0, 24.0, 14.0, 37.0, 23.0, 8.0, 11.0, 11.0, 9.0, 10.0, 9.0, 5.0, 4.0, 4.0, 3.0, 3.0, 4.0, 1.0, 3.0, 5.0, 4.0, 2.0, 3.0, 38.0, 13.0, 5.0, 8.0, 28.0, 6.0], [25.0, 18.0, 30.0, 31.0, 4.0, 3.0, 3.0, 7.0, 27.0, 12.0, 9.0, 12.0, 29.0, 23.0, 19.0, 18.0, 14.0, 18.0, 24.0, 25.0, 18.0, 13.0, 15.0, 32.0, 20.0, 15.0, 23.0, 39.0, 9.0, 33.0, 8.0, 25.0, 10.0, 2.0, 4.0, 27.0, 3.0, 4.0, 2.0, 3.0, 2.0, 4.0, 2.0, 19.0, 17.0, 3.0, 6.0, 6.0, 48.0]],
    "Name": "sCurve-0",
    "Overflow": 2606746.0,
    "Type": "Histo2d",
    "Underflow": 0.0,
    "x": {
        "AxisTitle": "Vcal",
        "Bins": 51,
        "High": 302.5,
        "Low": 47.5
    },
    "y": {
        "AxisTitle": "Occupancy",
        "Bins": 49,
        "High": 49.5,
        "Low": 0.5
    },
    "z": {
        "AxisTitle": "Number of pixels"
    }
}