time,Hardware,Voltage,Current
1626608882506,high-voltage,1,0.049546
time,Hardware,Voltage,Current
1626608882506,high-voltage,2,0.0711963
time,Hardware,Voltage,Current
1626608882506,high-voltage,3,0.0832815
time,Hardware,Voltage,Current
1626608882506,high-voltage,4,0.091798
time,Hardware,Voltage,Current
1626608882506,high-voltage,5,0.100131
time,Hardware,Voltage,Current
1626608882506,high-voltage,6,0.107869
time,Hardware,Voltage,Current
1626608882506,high-voltage,7,0.115839
time,Hardware,Voltage,Current
1626608882506,high-voltage,8,0.123853
time,Hardware,Voltage,Current
1626608882506,high-voltage,9,0.134345
time,Hardware,Voltage,Current
1626608882506,high-voltage,10,0.142733
time,Hardware,Voltage,Current
1626608882506,high-voltage,11,0.153694
time,Hardware,Voltage,Current
1626608882506,high-voltage,12,0.164319
time,Hardware,Voltage,Current
1626608882506,high-voltage,13,0.177022
time,Hardware,Voltage,Current
1626608882506,high-voltage,14,0.188256
time,Hardware,Voltage,Current
1626608882506,high-voltage,15,0.199719
time,Hardware,Voltage,Current
1626608882506,high-voltage,16,0.211026
time,Hardware,Voltage,Current
1626608882506,high-voltage,17,0.220886
time,Hardware,Voltage,Current
1626608882506,high-voltage,18,0.230057
time,Hardware,Voltage,Current
1626608882506,high-voltage,19,0.23904
time,Hardware,Voltage,Current
1626608882506,high-voltage,20,0.246183
time,Hardware,Voltage,Current
1626608882506,high-voltage,25,0.281273
time,Hardware,Voltage,Current
1626608882506,high-voltage,30,0.320243
time,Hardware,Voltage,Current
1626608882506,high-voltage,35,0.393291
time,Hardware,Voltage,Current
1626608882506,high-voltage,40,0.558483
time,Hardware,Voltage,Current
1626608882506,high-voltage,45,0.877816
time,Hardware,Voltage,Current
1626608882506,high-voltage,50,1.42108
time,Hardware,Voltage,Current
1626608882506,high-voltage,55,2.28564
time,Hardware,Voltage,Current
1626608882506,high-voltage,60,3.58726
time,Hardware,Voltage,Current
1626608882506,high-voltage,65,5.47357
time,Hardware,Voltage,Current
1626608882506,high-voltage,70,8.07741
time,Hardware,Voltage,Current
1626608882506,high-voltage,75,10
