{
    "Data": [1387.0, 19303.0, 19486.0, 8735.0, 2695.0, 669.0, 118.0, 28.0, 6.0, 5.0, 1.0, 2.0, 1.0, 0.0, 3.0, 1.0, 2.0, 3.0, 2.0, 1.0, 4.0, 1.0, 4.0, 0.0, 1.0, 1.0, 2.0, 3.0, 0.0, 1.0, 0.0, 0.0, 0.0, 1.0, 1.0, 0.0, 0.0, 1.0, 0.0, 0.0, 2.0, 0.0, 0.0, 1.0, 0.0, 0.0, 0.0, 0.0, 0.0, 0.0, 0.0],
    "Name": "Chi2Dist-0",
    "Overflow": 0.0,
    "Type": "Histo1d",
    "Underflow": 0.0,
    "x": {
        "AxisTitle": "Fit Chi/ndf",
        "Bins": 51,
        "High": 2.5250000953674318,
        "Low": -0.02500000037252903
    },
    "y": {
        "AxisTitle": "Number of Pixels"
    },
    "z": {
        "AxisTitle": "z"
    }
}