{
    "Data": [40.0, 55.0, 0.0, 0.0, 6.0, 91.0, 557.0, 1669.0, 3449.0, 4773.0, 4891.0, 4055.0, 3075.0, 2736.0, 2651.0, 2830.0, 3263.0, 3608.0, 3538.0, 3263.0, 2622.0, 1862.0, 1071.0, 725.0, 558.0, 603.0, 738.0, 1034.0, 1259.0, 1660.0, 1885.0, 2177.0, 2427.0, 2338.0, 2068.0, 1859.0, 1546.0, 1278.0, 1043.0, 785.0, 508.0, 389.0, 256.0, 171.0, 120.0, 92.0, 53.0, 47.0, 35.0, 19.0, 21.0, 12.0, 14.0, 11.0, 5.0, 7.0, 4.0, 6.0, 6.0, 2.0, 2.0, 3.0, 4.0, 2.0, 0.0, 4.0, 2.0, 2.0, 2.0, 1.0, 0.0],
    "Name": "NoiseDist-0",
    "Overflow": 14.0,
    "Type": "Histo1d",
    "Underflow": 0.0,
    "x": {
        "AxisTitle": "Noise [e]",
        "Bins": 71,
        "High": 356.0,
        "Low": -2.0
    },
    "y": {
        "AxisTitle": "Number of Pixels"
    },
    "z": {
        "AxisTitle": "z"
    }
}