{
    "connectivity": [{
            "chipType": "RD53A",
            "chips": [{
                    "config": "/home/eresseguie/Yarr/configs/rd53a_planarA_A.json",
                    "enable": 1,
                    "locked": 0,
                    "rx": 0,
                    "tx": 0
                }, {
                    "config": "/home/eresseguie/Yarr/configs/rd53a_planarA_B.json",
                    "enable": 1,
                    "locked": 0,
                    "rx": 1,
                    "tx": 1
                }, {
                    "config": "/home/eresseguie/Yarr/configs/rd53a_planarA_C.json",
                    "enable": 1,
                    "locked": 0,
                    "rx": 2,
                    "tx": 2
                }, {
                    "config": "/home/eresseguie/Yarr/configs/rd53a_3dmoduleC_B.json",
                    "enable": 0,
                    "locked": 0,
                    "rx": 3,
                    "tx": 3
                }]
        }],
    "ctrlCfg": {
        "ctrlCfg": {
            "cfg": {
                "cmdPeriod": 6.250000073038109e-9,
                "idle": {
                    "word": 1768515945
                },
                "pulse": {
                    "interval": 500,
                    "word": 1549575846
                },
                "rxPolarity": 65535,
                "specNum": 1,
                "spiConfig": 541200,
                "sync": {
                    "interval": 32,
                    "word": 2172551550
                },
                "trigConfig": null,
                "txPolarity": 15
            },
            "type": "spec"
        }
    },
    "exec": "-r /home/eresseguie/Yarr/configs/controller/specCfg_middle.json -c /home/eresseguie/Yarr/configs/connectivity/rd53a_planarmodule_A.json -s /home/eresseguie/Yarr/configs/scans/rd53a/std_thresholdscan.json -o /home/eresseguie/3dmoduleC_orderABC_HVon ",
    "finishTime": 1630699254,
    "runNumber": 5696,
    "startTime": 1630699132,
    "stopwatch": {
        "analysis": 775,
        "config": 102,
        "processing": 7,
        "scan": 120612
    },
    "targetCharge": -1,
    "targetTot": -1,
    "testType": "std_thresholdscan",
    "timestamp": "2021-09-03_12:58:52"
}