time,Hardware,Voltage,Current
1625791945754,high-voltage-2,1,0.243543
time,Hardware,Voltage,Current
1625791945754,high-voltage-2,2,0.30508
time,Hardware,Voltage,Current
1625791945754,high-voltage-2,3,0.343074
time,Hardware,Voltage,Current
1625791945754,high-voltage-2,4,0.376169
time,Hardware,Voltage,Current
1625791945754,high-voltage-2,5,0.412962
time,Hardware,Voltage,Current
1625791945754,high-voltage-2,6,0.449766
time,Hardware,Voltage,Current
1625791945754,high-voltage-2,7,0.492829
time,Hardware,Voltage,Current
1625791945754,high-voltage-2,8,0.538173
time,Hardware,Voltage,Current
1625791945754,high-voltage-2,9,0.580714
time,Hardware,Voltage,Current
1625791945754,high-voltage-2,10,0.624368
time,Hardware,Voltage,Current
1625791945754,high-voltage-2,11,0.665203
time,Hardware,Voltage,Current
1625791945754,high-voltage-2,12,0.703557
time,Hardware,Voltage,Current
1625791945754,high-voltage-2,13,0.733693
time,Hardware,Voltage,Current
1625791945754,high-voltage-2,14,0.763256
time,Hardware,Voltage,Current
1625791945754,high-voltage-2,15,0.786822
time,Hardware,Voltage,Current
1625791945754,high-voltage-2,16,0.810678
time,Hardware,Voltage,Current
1625791945754,high-voltage-2,17,0.834527
time,Hardware,Voltage,Current
1625791945754,high-voltage-2,18,0.858539
time,Hardware,Voltage,Current
1625791945754,high-voltage-2,19,0.879052
time,Hardware,Voltage,Current
1625791945754,high-voltage-2,20,0.897337
time,Hardware,Voltage,Current
1625791945754,high-voltage-2,25,0.988862
time,Hardware,Voltage,Current
1625791945754,high-voltage-2,30,1.07838
time,Hardware,Voltage,Current
1625791945754,high-voltage-2,35,1.17147
time,Hardware,Voltage,Current
1625791945754,high-voltage-2,40,1.27981
time,Hardware,Voltage,Current
1625791945754,high-voltage-2,45,1.40999
time,Hardware,Voltage,Current
1625791945754,high-voltage-2,50,1.5064
time,Hardware,Voltage,Current
1625791945754,high-voltage-2,55,1.59622
time,Hardware,Voltage,Current
1625791945754,high-voltage-2,60,1.68171
time,Hardware,Voltage,Current
1625791945754,high-voltage-2,65,1.7631
time,Hardware,Voltage,Current
1625791945754,high-voltage-2,70,1.84224
time,Hardware,Voltage,Current
1625791945754,high-voltage-2,75,1.91993
time,Hardware,Voltage,Current
1625791945754,high-voltage-2,80,1.99072
time,Hardware,Voltage,Current
1625791945754,high-voltage-2,85,2.05932
time,Hardware,Voltage,Current
1625791945754,high-voltage-2,90,2.12981
time,Hardware,Voltage,Current
1625791945754,high-voltage-2,95,2.19469
time,Hardware,Voltage,Current
1625791945754,high-voltage-2,100,2.25832
