{
    "Data": [8.0, 28.0, 0.0, 0.0, 1.0, 5.0, 37.0, 126.0, 351.0, 1012.0, 2051.0, 3580.0, 4731.0, 5084.0, 4248.0, 3304.0, 3053.0, 3535.0, 4301.0, 4604.0, 4211.0, 3185.0, 2078.0, 1245.0, 777.0, 572.0, 591.0, 729.0, 936.0, 1286.0, 1500.0, 1787.0, 2023.0, 2167.0, 2233.0, 2111.0, 1845.0, 1548.0, 1392.0, 1068.0, 834.0, 618.0, 469.0, 361.0, 229.0, 185.0, 103.0, 90.0, 61.0, 42.0, 37.0, 22.0, 18.0, 21.0, 17.0, 13.0, 12.0, 5.0, 8.0, 5.0, 3.0, 7.0, 6.0, 4.0, 1.0, 1.0, 0.0, 2.0],
    "Name": "NoiseDist-0",
    "Overflow": 31.0,
    "Type": "Histo1d",
    "Underflow": 0.0,
    "x": {
        "AxisTitle": "Noise [e]",
        "Bins": 68,
        "High": 341.0,
        "Low": -2.0
    },
    "y": {
        "AxisTitle": "Number of Pixels"
    },
    "z": {
        "AxisTitle": "z"
    }
}