{
    "Data": [0.0, 0.0, 0.0, 0.0, 0.0, 0.0, 0.0, 0.0, 0.0, 0.0, 0.0, 0.0, 0.0, 0.0, 0.0, 0.0, 0.0, 0.0, 0.0, 0.0, 0.0, 0.0, 0.0, 0.0, 0.0, 0.0, 0.0, 0.0, 0.0, 0.0, 0.0, 0.0, 0.0, 0.0, 0.0, 0.0, 0.0, 0.0, 0.0, 0.0, 0.0, 0.0, 0.0, 0.0, 0.0, 0.0, 0.0, 0.0, 0.0, 0.0, 123.0, 208.0, 231.0, 238.0, 244.0, 263.0, 244.0, 265.0, 218.0, 261.0, 245.0, 262.0, 296.0, 256.0, 276.0, 297.0, 287.0, 319.0, 282.0, 297.0, 305.0, 309.0, 300.0, 305.0, 310.0, 275.0, 356.0, 362.0, 314.0, 342.0, 331.0, 349.0, 346.0, 379.0, 356.0, 331.0, 366.0, 363.0, 370.0, 385.0, 361.0, 390.0, 336.0, 352.0, 377.0, 378.0, 372.0, 375.0, 353.0, 388.0, 349.0, 355.0, 371.0, 372.0, 363.0, 371.0, 374.0, 378.0, 342.0, 348.0, 344.0, 379.0, 343.0, 358.0, 356.0, 327.0, 329.0, 359.0, 314.0, 289.0, 299.0, 297.0, 316.0, 338.0, 341.0, 288.0, 240.0, 248.0, 271.0, 216.0, 255.0, 242.0, 212.0, 232.0, 237.0, 237.0, 230.0, 232.0, 210.0, 225.0, 214.0, 218.0, 221.0, 180.0, 149.0, 174.0, 188.0, 175.0, 175.0, 171.0, 146.0, 155.0, 159.0, 175.0, 133.0, 130.0, 132.0, 118.0, 144.0, 144.0, 122.0, 109.0, 132.0, 118.0, 150.0, 124.0, 165.0, 145.0, 183.0, 183.0, 205.0, 210.0, 222.0, 237.0, 262.0, 287.0, 309.0, 330.0, 395.0, 404.0, 458.0, 496.0, 527.0, 599.0, 618.0, 627.0, 696.0, 670.0, 729.0, 766.0, 731.0, 769.0, 815.0, 806.0, 794.0, 778.0, 801.0, 736.0, 742.0, 741.0, 642.0, 625.0, 587.0, 631.0, 576.0, 544.0, 528.0, 456.0, 449.0, 396.0, 397.0, 340.0, 318.0, 294.0, 259.0, 244.0, 220.0, 179.0, 165.0, 146.0, 118.0, 125.0, 113.0, 103.0, 93.0, 81.0, 69.0, 73.0, 48.0, 58.0, 50.0, 35.0, 35.0, 39.0, 21.0, 19.0, 19.0, 23.0, 25.0, 24.0, 9.0, 8.0, 11.0, 13.0, 15.0, 7.0, 15.0, 8.0, 7.0, 20.0, 11.0, 10.0, 13.0, 13.0, 12.0, 11.0, 14.0, 9.0, 4.0, 7.0, 8.0, 8.0, 10.0, 7.0, 8.0, 4.0, 12.0, 9.0, 5.0, 5.0, 9.0, 10.0, 3.0, 5.0, 5.0, 6.0, 7.0, 7.0, 6.0, 5.0, 6.0, 3.0, 6.0, 3.0, 4.0, 3.0, 4.0, 7.0, 10.0, 5.0, 0.0, 4.0, 1.0, 6.0, 7.0, 3.0, 3.0, 2.0, 3.0, 3.0, 3.0, 3.0, 1.0, 4.0, 7.0, 2.0, 2.0, 1.0, 2.0, 3.0, 6.0, 5.0, 1.0, 1.0, 0.0, 3.0, 0.0, 2.0, 3.0, 0.0, 1.0, 1.0, 2.0, 3.0, 2.0, 1.0, 0.0, 0.0, 0.0, 0.0, 0.0, 0.0, 0.0, 0.0, 0.0, 0.0, 0.0, 0.0, 0.0, 0.0, 0.0, 0.0, 0.0, 0.0, 0.0, 0.0, 0.0, 0.0, 0.0, 0.0, 0.0, 0.0, 0.0, 0.0, 0.0, 0.0, 0.0, 0.0, 0.0, 0.0, 0.0, 0.0, 0.0, 0.0, 0.0, 0.0, 0.0, 0.0, 0.0, 0.0, 0.0, 0.0, 0.0, 0.0, 0.0, 0.0, 0.0, 0.0, 0.0, 0.0, 0.0, 0.0, 0.0, 0.0, 0.0, 0.0, 0.0, 0.0, 0.0, 0.0, 0.0, 0.0, 0.0, 0.0, 0.0, 0.0, 0.0, 0.0, 0.0, 0.0, 0.0, 0.0, 0.0, 0.0, 0.0, 0.0],
    "Name": "ThresholdDist-0",
    "Overflow": 0.0,
    "Type": "Histo1d",
    "Underflow": 0.0,
    "x": {
        "AxisTitle": "Threshold [e]",
        "Bins": 406,
        "High": 4055.0,
        "Low": -5.0
    },
    "y": {
        "AxisTitle": "Number of Pixels"
    },
    "z": {
        "AxisTitle": "z"
    }
}