time,Hardware,Voltage,Current
1626349854395,high-voltage,1,0.00959096
time,Hardware,Voltage,Current
1626349854395,high-voltage,2,0.0245005
time,Hardware,Voltage,Current
1626349854395,high-voltage,3,0.0337009
time,Hardware,Voltage,Current
1626349854395,high-voltage,4,0.0398349
time,Hardware,Voltage,Current
1626349854395,high-voltage,5,0.0456066
time,Hardware,Voltage,Current
1626349854395,high-voltage,6,0.0511056
time,Hardware,Voltage,Current
1626349854395,high-voltage,7,0.0591331
time,Hardware,Voltage,Current
1626349854395,high-voltage,8,0.0645239
time,Hardware,Voltage,Current
1626349854395,high-voltage,9,0.0713941
time,Hardware,Voltage,Current
1626349854395,high-voltage,10,0.0791294
time,Hardware,Voltage,Current
1626349854395,high-voltage,11,0.0842447
time,Hardware,Voltage,Current
1626349854395,high-voltage,12,0.0900698
time,Hardware,Voltage,Current
1626349854395,high-voltage,13,0.0938141
time,Hardware,Voltage,Current
1626349854395,high-voltage,14,0.0987317
time,Hardware,Voltage,Current
1626349854395,high-voltage,15,0.102322
time,Hardware,Voltage,Current
1626349854395,high-voltage,16,0.104722
time,Hardware,Voltage,Current
1626349854395,high-voltage,17,0.109027
time,Hardware,Voltage,Current
1626349854395,high-voltage,18,0.111018
time,Hardware,Voltage,Current
1626349854395,high-voltage,19,0.114446
time,Hardware,Voltage,Current
1626349854395,high-voltage,20,0.118137
time,Hardware,Voltage,Current
1626349854395,high-voltage,25,0.132479
time,Hardware,Voltage,Current
1626349854395,high-voltage,30,0.150065
time,Hardware,Voltage,Current
1626349854395,high-voltage,35,0.184353
time,Hardware,Voltage,Current
1626349854395,high-voltage,40,0.285588
time,Hardware,Voltage,Current
1626349854395,high-voltage,45,0.534034
time,Hardware,Voltage,Current
1626349854395,high-voltage,50,1.00918
time,Hardware,Voltage,Current
1626349854395,high-voltage,55,1.82239
time,Hardware,Voltage,Current
1626349854395,high-voltage,60,3.07239
time,Hardware,Voltage,Current
1626349854395,high-voltage,65,4.82722
time,Hardware,Voltage,Current
1626349854395,high-voltage,70,7.15555
time,Hardware,Voltage,Current
1626349854395,high-voltage,75,10
