time,Hardware,Voltage,Current
1626382913865,high-voltage-3,1,0.0634171
time,Hardware,Voltage,Current
1626382913865,high-voltage-3,2,0.0664897
time,Hardware,Voltage,Current
1626382913865,high-voltage-3,3,0.0724248
time,Hardware,Voltage,Current
1626382913865,high-voltage-3,4,0.0762216
time,Hardware,Voltage,Current
1626382913865,high-voltage-3,5,0.0789991
time,Hardware,Voltage,Current
1626382913865,high-voltage-3,6,0.0813063
time,Hardware,Voltage,Current
1626382913865,high-voltage-3,7,0.0822977
time,Hardware,Voltage,Current
1626382913865,high-voltage-3,8,0.0853964
time,Hardware,Voltage,Current
1626382913865,high-voltage-3,9,0.0872122
time,Hardware,Voltage,Current
1626382913865,high-voltage-3,10,0.0893754
time,Hardware,Voltage,Current
1626382913865,high-voltage-3,11,0.0919593
time,Hardware,Voltage,Current
1626382913865,high-voltage-3,12,0.0956313
time,Hardware,Voltage,Current
1626382913865,high-voltage-3,13,0.0988807
time,Hardware,Voltage,Current
1626382913865,high-voltage-3,14,0.101249
time,Hardware,Voltage,Current
1626382913865,high-voltage-3,15,0.104175
time,Hardware,Voltage,Current
1626382913865,high-voltage-3,16,0.107464
time,Hardware,Voltage,Current
1626382913865,high-voltage-3,17,0.109559
time,Hardware,Voltage,Current
1626382913865,high-voltage-3,18,0.111259
time,Hardware,Voltage,Current
1626382913865,high-voltage-3,19,0.112489
time,Hardware,Voltage,Current
1626382913865,high-voltage-3,20,0.114492
time,Hardware,Voltage,Current
1626382913865,high-voltage-3,25,0.123839
time,Hardware,Voltage,Current
1626382913865,high-voltage-3,30,0.131857
time,Hardware,Voltage,Current
1626382913865,high-voltage-3,35,0.139872
time,Hardware,Voltage,Current
1626382913865,high-voltage-3,40,0.146584
time,Hardware,Voltage,Current
1626382913865,high-voltage-3,45,0.154545
time,Hardware,Voltage,Current
1626382913865,high-voltage-3,50,0.161038
time,Hardware,Voltage,Current
1626382913865,high-voltage-3,55,0.167453
time,Hardware,Voltage,Current
1626382913865,high-voltage-3,60,0.175809
time,Hardware,Voltage,Current
1626382913865,high-voltage-3,65,0.181687
time,Hardware,Voltage,Current
1626382913865,high-voltage-3,70,0.191481
time,Hardware,Voltage,Current
1626382913865,high-voltage-3,75,0.201071
time,Hardware,Voltage,Current
1626382913865,high-voltage-3,80,0.209239
time,Hardware,Voltage,Current
1626382913865,high-voltage-3,85,0.21897
time,Hardware,Voltage,Current
1626382913865,high-voltage-3,90,0.227724
time,Hardware,Voltage,Current
1626382913865,high-voltage-3,95,0.238442
time,Hardware,Voltage,Current
1626382913865,high-voltage-3,100,0.249218
