time,Hardware,Voltage,Current
1623089985779,high-voltage-3,1,0.0630844
time,Hardware,Voltage,Current
1623089985779,high-voltage-3,2,0.0664443
time,Hardware,Voltage,Current
1623089985779,high-voltage-3,3,0.067297
time,Hardware,Voltage,Current
1623089985779,high-voltage-3,4,0.0704416
time,Hardware,Voltage,Current
1623089985779,high-voltage-3,5,0.0718768
time,Hardware,Voltage,Current
1623089985779,high-voltage-3,6,0.0737998
time,Hardware,Voltage,Current
1623089985779,high-voltage-3,7,0.0758443
time,Hardware,Voltage,Current
1623089985779,high-voltage-3,8,0.0763963
time,Hardware,Voltage,Current
1623089985779,high-voltage-3,9,0.0778913
time,Hardware,Voltage,Current
1623089985779,high-voltage-3,10,0.0795476
time,Hardware,Voltage,Current
1623089985779,high-voltage-3,11,0.0810548
time,Hardware,Voltage,Current
1623089985779,high-voltage-3,12,0.0834556
time,Hardware,Voltage,Current
1623089985779,high-voltage-3,13,0.0845108
time,Hardware,Voltage,Current
1623089985779,high-voltage-3,14,0.0856186
time,Hardware,Voltage,Current
1623089985779,high-voltage-3,15,0.0874877
time,Hardware,Voltage,Current
1623089985779,high-voltage-3,16,0.0884108
time,Hardware,Voltage,Current
1623089985779,high-voltage-3,17,0.0889547
time,Hardware,Voltage,Current
1623089985779,high-voltage-3,18,0.0905457
time,Hardware,Voltage,Current
1623089985779,high-voltage-3,19,0.0907464
time,Hardware,Voltage,Current
1623089985779,high-voltage-3,20,0.0915893
time,Hardware,Voltage,Current
1623089985779,high-voltage-3,25,0.0967943
time,Hardware,Voltage,Current
1623089985779,high-voltage-3,30,0.101138
time,Hardware,Voltage,Current
1623089985779,high-voltage-3,35,0.105847
time,Hardware,Voltage,Current
1623089985779,high-voltage-3,40,0.110233
time,Hardware,Voltage,Current
1623089985779,high-voltage-3,45,0.113056
time,Hardware,Voltage,Current
1623089985779,high-voltage-3,50,0.117439
time,Hardware,Voltage,Current
1623089985779,high-voltage-3,55,0.120327
time,Hardware,Voltage,Current
1623089985779,high-voltage-3,60,0.123561
time,Hardware,Voltage,Current
1623089985779,high-voltage-3,65,0.126823
time,Hardware,Voltage,Current
1623089985779,high-voltage-3,70,0.13049
time,Hardware,Voltage,Current
1623089985779,high-voltage-3,75,0.133725
time,Hardware,Voltage,Current
1623089985779,high-voltage-3,80,0.13588
time,Hardware,Voltage,Current
1623089985779,high-voltage-3,85,0.138775
time,Hardware,Voltage,Current
1623089985779,high-voltage-3,90,0.141879
time,Hardware,Voltage,Current
1623089985779,high-voltage-3,95,0.144072
time,Hardware,Voltage,Current
1623089985779,high-voltage-3,100,0.146518
