time,Hardware,Voltage,Current
1625769969013,high-voltage-2,1,0.144129
time,Hardware,Voltage,Current
1625769969013,high-voltage-2,2,0.218038
time,Hardware,Voltage,Current
1625769969013,high-voltage-2,3,0.259332
time,Hardware,Voltage,Current
1625769969013,high-voltage-2,4,0.291836
time,Hardware,Voltage,Current
1625769969013,high-voltage-2,5,0.318034
time,Hardware,Voltage,Current
1625769969013,high-voltage-2,6,0.338506
time,Hardware,Voltage,Current
1625769969013,high-voltage-2,7,0.360547
time,Hardware,Voltage,Current
1625769969013,high-voltage-2,8,0.380823
time,Hardware,Voltage,Current
1625769969013,high-voltage-2,9,0.400565
time,Hardware,Voltage,Current
1625769969013,high-voltage-2,10,0.417728
time,Hardware,Voltage,Current
1625769969013,high-voltage-2,11,0.436291
time,Hardware,Voltage,Current
1625769969013,high-voltage-2,12,0.454469
time,Hardware,Voltage,Current
1625769969013,high-voltage-2,13,0.471215
time,Hardware,Voltage,Current
1625769969013,high-voltage-2,14,0.487627
time,Hardware,Voltage,Current
1625769969013,high-voltage-2,15,0.501722
time,Hardware,Voltage,Current
1625769969013,high-voltage-2,16,0.514808
time,Hardware,Voltage,Current
1625769969013,high-voltage-2,17,0.526563
time,Hardware,Voltage,Current
1625769969013,high-voltage-2,18,0.538293
time,Hardware,Voltage,Current
1625769969013,high-voltage-2,19,0.548377
time,Hardware,Voltage,Current
1625769969013,high-voltage-2,20,0.557665
time,Hardware,Voltage,Current
1625769969013,high-voltage-2,25,0.605043
time,Hardware,Voltage,Current
1625769969013,high-voltage-2,30,0.653772
time,Hardware,Voltage,Current
1625769969013,high-voltage-2,35,0.703346
time,Hardware,Voltage,Current
1625769969013,high-voltage-2,40,0.760132
time,Hardware,Voltage,Current
1625769969013,high-voltage-2,45,0.833725
time,Hardware,Voltage,Current
1625769969013,high-voltage-2,50,0.887718
time,Hardware,Voltage,Current
1625769969013,high-voltage-2,55,0.94261
time,Hardware,Voltage,Current
1625769969013,high-voltage-2,60,0.993152
time,Hardware,Voltage,Current
1625769969013,high-voltage-2,65,1.04329
time,Hardware,Voltage,Current
1625769969013,high-voltage-2,70,1.09247
time,Hardware,Voltage,Current
1625769969013,high-voltage-2,75,1.13872
time,Hardware,Voltage,Current
1625769969013,high-voltage-2,80,1.1822
time,Hardware,Voltage,Current
1625769969013,high-voltage-2,85,1.22375
time,Hardware,Voltage,Current
1625769969013,high-voltage-2,90,1.26178
time,Hardware,Voltage,Current
1625769969013,high-voltage-2,95,1.29699
time,Hardware,Voltage,Current
1625769969013,high-voltage-2,100,1.32946
