{
    "Data": [0.0, 0.0, 0.0, 0.0, 0.0, 0.0, 0.0, 0.0, 0.0, 0.0, 0.0, 0.0, 0.0, 0.0, 0.0, 0.0, 0.0, 0.0, 0.0, 0.0, 3.0, 6.0, 1.0, 7.0, 12.0, 13.0, 21.0, 26.0, 15.0, 19.0, 11.0, 40.0, 49.0, 28.0, 3.0, 27.0, 8.0, 50.0, 13.0, 17.0, 34.0, 33.0, 45.0, 50.0, 50.0, 50.0, 1.0, 22.0, 2.0, 20.0, 50.0],
    "Name": "Scurve-70-96",
    "Overflow": 0.0,
    "Type": "Histo1d",
    "Underflow": 0.0,
    "x": {
        "AxisTitle": "Vcal",
        "Bins": 51,
        "High": 302.5,
        "Low": 47.5
    },
    "y": {
        "AxisTitle": "Occupancy"
    },
    "z": {
        "AxisTitle": "z"
    }
}