{
    "Data": [241.0, 11849.0, 20966.0, 13701.0, 6746.0, 3599.0, 2929.0, 2867.0, 2681.0, 2443.0, 1906.0, 1489.0, 1083.0, 779.0, 540.0, 391.0, 311.0, 220.0, 178.0, 146.0, 117.0, 142.0, 129.0, 116.0, 135.0, 130.0, 117.0, 92.0, 73.0, 78.0, 74.0, 86.0, 80.0, 60.0, 59.0, 49.0, 56.0, 35.0, 65.0, 43.0, 43.0, 24.0, 24.0, 21.0, 32.0, 35.0, 28.0, 26.0, 26.0, 14.0, 5.0],
    "Name": "Chi2Dist-0",
    "Overflow": 0.0,
    "Type": "Histo1d",
    "Underflow": 0.0,
    "x": {
        "AxisTitle": "Fit Chi/ndf",
        "Bins": 51,
        "High": 2.5250000953674318,
        "Low": -0.02500000037252903
    },
    "y": {
        "AxisTitle": "Number of Pixels"
    },
    "z": {
        "AxisTitle": "z"
    }
}