time,Hardware,Voltage,Current
1621552010505,high-voltage-2,1,0.168049
time,Hardware,Voltage,Current
1621552010505,high-voltage-2,2,0.226722
time,Hardware,Voltage,Current
1621552010505,high-voltage-2,3,0.260575
time,Hardware,Voltage,Current
1621552010505,high-voltage-2,4,0.285855
time,Hardware,Voltage,Current
1621552010505,high-voltage-2,5,0.308695
time,Hardware,Voltage,Current
1621552010505,high-voltage-2,6,0.32821
time,Hardware,Voltage,Current
1621552010505,high-voltage-2,7,0.346618
time,Hardware,Voltage,Current
1621552010505,high-voltage-2,8,0.364102
time,Hardware,Voltage,Current
1621552010505,high-voltage-2,9,0.381567
time,Hardware,Voltage,Current
1621552010505,high-voltage-2,10,0.399623
time,Hardware,Voltage,Current
1621552010505,high-voltage-2,11,0.415928
time,Hardware,Voltage,Current
1621552010505,high-voltage-2,12,0.429652
time,Hardware,Voltage,Current
1621552010505,high-voltage-2,13,0.444577
time,Hardware,Voltage,Current
1621552010505,high-voltage-2,14,0.454884
time,Hardware,Voltage,Current
1621552010505,high-voltage-2,15,0.468558
time,Hardware,Voltage,Current
1621552010505,high-voltage-2,16,0.476638
time,Hardware,Voltage,Current
1621552010505,high-voltage-2,17,0.489565
time,Hardware,Voltage,Current
1621552010505,high-voltage-2,18,0.499493
time,Hardware,Voltage,Current
1621552010505,high-voltage-2,19,0.507745
time,Hardware,Voltage,Current
1621552010505,high-voltage-2,20,0.514794
time,Hardware,Voltage,Current
1621552010505,high-voltage-2,25,0.55994
time,Hardware,Voltage,Current
1621552010505,high-voltage-2,30,0.601938
time,Hardware,Voltage,Current
1621552010505,high-voltage-2,35,0.647414
time,Hardware,Voltage,Current
1621552010505,high-voltage-2,40,0.698979
time,Hardware,Voltage,Current
1621552010505,high-voltage-2,45,0.763885
time,Hardware,Voltage,Current
1621552010505,high-voltage-2,50,0.808889
time,Hardware,Voltage,Current
1621552010505,high-voltage-2,55,0.849654
time,Hardware,Voltage,Current
1621552010505,high-voltage-2,60,0.888302
time,Hardware,Voltage,Current
1621552010505,high-voltage-2,65,0.925547
time,Hardware,Voltage,Current
1621552010505,high-voltage-2,70,0.963592
time,Hardware,Voltage,Current
1621552010505,high-voltage-2,75,0.998271
time,Hardware,Voltage,Current
1621552010505,high-voltage-2,80,1.03439
time,Hardware,Voltage,Current
1621552010505,high-voltage-2,85,1.07046
time,Hardware,Voltage,Current
1621552010505,high-voltage-2,90,1.10315
time,Hardware,Voltage,Current
1621552010505,high-voltage-2,95,1.13941
time,Hardware,Voltage,Current
1621552010505,high-voltage-2,100,1.17261
