{
    "Data": [0.0, 0.0, 0.0, 0.0, 0.0, 0.0, 0.0, 0.0, 0.0, 0.0, 0.0, 0.0, 0.0, 0.0, 0.0, 0.0, 0.0, 0.0, 0.0, 0.0, 0.0, 0.0, 0.0, 0.0, 0.0, 0.0, 0.0, 0.0, 0.0, 0.0, 0.0, 0.0, 0.0, 0.0, 0.0, 0.0, 0.0, 0.0, 0.0, 0.0, 0.0, 0.0, 0.0, 0.0, 0.0, 0.0, 0.0, 0.0, 0.0, 0.0, 148.0, 220.0, 226.0, 194.0, 265.0, 248.0, 256.0, 244.0, 251.0, 233.0, 274.0, 282.0, 244.0, 271.0, 275.0, 294.0, 298.0, 332.0, 304.0, 276.0, 288.0, 298.0, 341.0, 276.0, 295.0, 304.0, 353.0, 357.0, 326.0, 324.0, 353.0, 359.0, 345.0, 333.0, 375.0, 370.0, 343.0, 353.0, 374.0, 376.0, 379.0, 352.0, 363.0, 405.0, 349.0, 371.0, 337.0, 352.0, 367.0, 364.0, 368.0, 371.0, 390.0, 349.0, 383.0, 368.0, 365.0, 358.0, 344.0, 348.0, 352.0, 371.0, 354.0, 368.0, 295.0, 360.0, 358.0, 334.0, 319.0, 324.0, 282.0, 281.0, 327.0, 326.0, 361.0, 267.0, 224.0, 258.0, 265.0, 237.0, 266.0, 218.0, 229.0, 237.0, 243.0, 235.0, 227.0, 203.0, 213.0, 245.0, 195.0, 226.0, 187.0, 197.0, 181.0, 184.0, 171.0, 179.0, 163.0, 161.0, 179.0, 160.0, 159.0, 136.0, 165.0, 115.0, 119.0, 162.0, 123.0, 113.0, 142.0, 124.0, 129.0, 110.0, 137.0, 155.0, 141.0, 162.0, 172.0, 175.0, 186.0, 236.0, 209.0, 227.0, 278.0, 298.0, 310.0, 351.0, 390.0, 399.0, 466.0, 486.0, 511.0, 563.0, 635.0, 675.0, 695.0, 715.0, 785.0, 709.0, 729.0, 763.0, 761.0, 770.0, 795.0, 781.0, 805.0, 733.0, 728.0, 682.0, 681.0, 641.0, 632.0, 579.0, 567.0, 541.0, 512.0, 454.0, 451.0, 410.0, 380.0, 368.0, 299.0, 270.0, 240.0, 232.0, 200.0, 180.0, 145.0, 122.0, 115.0, 136.0, 112.0, 107.0, 105.0, 91.0, 67.0, 67.0, 60.0, 57.0, 45.0, 45.0, 37.0, 28.0, 18.0, 28.0, 22.0, 16.0, 21.0, 16.0, 24.0, 18.0, 12.0, 16.0, 15.0, 19.0, 13.0, 8.0, 7.0, 15.0, 17.0, 7.0, 8.0, 11.0, 7.0, 9.0, 7.0, 10.0, 9.0, 7.0, 6.0, 9.0, 13.0, 12.0, 5.0, 9.0, 9.0, 1.0, 8.0, 9.0, 9.0, 3.0, 9.0, 5.0, 6.0, 4.0, 7.0, 9.0, 5.0, 4.0, 1.0, 3.0, 9.0, 5.0, 5.0, 7.0, 4.0, 6.0, 8.0, 5.0, 2.0, 6.0, 6.0, 6.0, 3.0, 3.0, 0.0, 3.0, 0.0, 3.0, 3.0, 5.0, 2.0, 6.0, 7.0, 0.0, 5.0, 2.0, 3.0, 5.0, 7.0, 5.0, 5.0, 1.0, 7.0, 3.0, 2.0, 3.0, 6.0, 4.0, 1.0, 3.0, 5.0, 3.0, 6.0, 0.0, 0.0, 0.0, 0.0, 0.0, 0.0, 0.0, 0.0, 0.0, 0.0, 0.0, 0.0, 0.0, 0.0, 0.0, 0.0, 0.0, 0.0, 0.0, 0.0, 0.0, 0.0, 0.0, 0.0, 0.0, 0.0, 0.0, 0.0, 0.0, 0.0, 0.0, 0.0, 0.0, 0.0, 0.0, 0.0, 0.0, 0.0, 0.0, 0.0, 0.0, 0.0, 0.0, 0.0, 0.0, 0.0, 0.0, 0.0, 0.0, 0.0, 0.0, 0.0, 0.0, 0.0, 0.0, 0.0, 0.0, 0.0, 0.0, 0.0, 0.0, 0.0, 0.0, 0.0, 0.0, 0.0, 0.0, 0.0, 0.0, 0.0, 0.0, 0.0, 0.0, 0.0, 0.0, 0.0, 0.0, 0.0, 0.0, 0.0, 0.0, 0.0, 0.0, 0.0, 0.0, 0.0],
    "Name": "ThresholdDist-0",
    "Overflow": 0.0,
    "Type": "Histo1d",
    "Underflow": 0.0,
    "x": {
        "AxisTitle": "Threshold [e]",
        "Bins": 411,
        "High": 4105.0,
        "Low": -5.0
    },
    "y": {
        "AxisTitle": "Number of Pixels"
    },
    "z": {
        "AxisTitle": "z"
    }
}