{
    "Data": [[2409.0, 682.0, 316.0, 171.0, 115.0, 80.0, 38.0, 33.0, 30.0, 18.0, 16.0, 7.0, 10.0, 7.0, 7.0, 4.0, 3.0, 6.0, 4.0, 3.0, 3.0, 4.0, 3.0, 2.0, 6.0, 1.0, 5.0, 0.0, 3.0, 2.0, 1.0, 1.0, 2.0, 4.0, 4.0, 3.0, 0.0, 1.0, 2.0, 1.0, 2.0, 3.0, 2.0, 2.0, 4.0, 0.0, 1.0, 1.0, 0.0], [3676.0, 1293.0, 593.0, 357.0, 224.0, 164.0, 116.0, 55.0, 65.0, 32.0, 36.0, 31.0, 27.0, 17.0, 12.0, 13.0, 16.0, 13.0, 8.0, 3.0, 4.0, 5.0, 3.0, 8.0, 2.0, 9.0, 1.0, 3.0, 1.0, 3.0, 5.0, 1.0, 0.0, 0.0, 3.0, 3.0, 3.0, 2.0, 0.0, 2.0, 5.0, 2.0, 2.0, 6.0, 3.0, 3.0, 1.0, 1.0, 3.0], [4998.0, 2129.0, 1205.0, 746.0, 432.0, 315.0, 216.0, 177.0, 142.0, 96.0, 84.0, 56.0, 58.0, 52.0, 31.0, 34.0, 37.0, 20.0, 14.0, 13.0, 17.0, 16.0, 11.0, 8.0, 6.0, 9.0, 7.0, 5.0, 9.0, 6.0, 1.0, 6.0, 7.0, 2.0, 3.0, 0.0, 3.0, 7.0, 4.0, 3.0, 2.0, 2.0, 4.0, 2.0, 2.0, 3.0, 5.0, 3.0, 6.0], [5503.0, 3016.0, 1896.0, 1212.0, 858.0, 597.0, 523.0, 353.0, 268.0, 229.0, 187.0, 147.0, 146.0, 113.0, 90.0, 72.0, 56.0, 49.0, 48.0, 41.0, 34.0, 29.0, 23.0, 20.0, 24.0, 18.0, 12.0, 9.0, 19.0, 13.0, 16.0, 7.0, 4.0, 5.0, 9.0, 11.0, 4.0, 3.0, 7.0, 4.0, 3.0, 4.0, 3.0, 2.0, 7.0, 2.0, 5.0, 10.0, 13.0], [5099.0, 3272.0, 2464.0, 1851.0, 1374.0, 1015.0, 864.0, 685.0, 567.0, 464.0, 404.0, 320.0, 264.0, 236.0, 192.0, 171.0, 140.0, 120.0, 94.0, 120.0, 82.0, 75.0, 68.0, 46.0, 48.0, 48.0, 31.0, 47.0, 39.0, 25.0, 25.0, 28.0, 19.0, 20.0, 18.0, 7.0, 13.0, 6.0, 11.0, 7.0, 13.0, 7.0, 7.0, 4.0, 4.0, 4.0, 5.0, 15.0, 12.0], [4995.0, 2895.0, 2411.0, 2034.0, 1792.0, 1466.0, 1261.0, 1132.0, 976.0, 841.0, 713.0, 612.0, 523.0, 421.0, 431.0, 344.0, 333.0, 283.0, 229.0, 209.0, 185.0, 177.0, 143.0, 127.0, 116.0, 96.0, 99.0, 89.0, 57.0, 69.0, 66.0, 57.0, 41.0, 40.0, 43.0, 35.0, 39.0, 39.0, 23.0, 22.0, 25.0, 20.0, 20.0, 10.0, 20.0, 16.0, 10.0, 8.0, 17.0], [6409.0, 3139.0, 2161.0, 1745.0, 1561.0, 1457.0, 1386.0, 1331.0, 1216.0, 1151.0, 1038.0, 927.0, 818.0, 780.0, 741.0, 618.0, 645.0, 543.0, 461.0, 411.0, 405.0, 356.0, 336.0, 288.0, 266.0, 232.0, 227.0, 200.0, 191.0, 167.0, 130.0, 119.0, 134.0, 99.0, 107.0, 70.0, 73.0, 80.0, 64.0, 57.0, 47.0, 44.0, 48.0, 36.0, 36.0, 29.0, 27.0, 15.0, 18.0], [7081.0, 4490.0, 3020.0, 2205.0, 1777.0, 1539.0, 1290.0, 1181.0, 1124.0, 1050.0, 1044.0, 998.0, 1025.0, 971.0, 933.0, 879.0, 812.0, 808.0, 761.0, 720.0, 661.0, 638.0, 562.0, 580.0, 538.0, 459.0, 459.0, 434.0, 370.0, 352.0, 340.0, 279.0, 301.0, 229.0, 212.0, 220.0, 156.0, 186.0, 170.0, 138.0, 127.0, 123.0, 109.0, 84.0, 76.0, 86.0, 58.0, 56.0, 50.0], [4442.0, 3802.0, 3313.0, 2983.0, 2616.0, 2224.0, 1913.0, 1736.0, 1440.0, 1281.0, 1288.0, 1108.0, 1011.0, 995.0, 936.0, 885.0, 915.0, 864.0, 889.0, 844.0, 862.0, 862.0, 805.0, 735.0, 780.0, 759.0, 682.0, 708.0, 637.0, 619.0, 581.0, 549.0, 523.0, 458.0, 467.0, 463.0, 404.0, 387.0, 355.0, 309.0, 332.0, 279.0, 208.0, 196.0, 207.0, 164.0, 167.0, 136.0, 124.0], [1978.0, 1459.0, 1594.0, 1647.0, 1717.0, 1832.0, 1858.0, 1856.0, 1810.0, 1805.0, 1719.0, 1718.0, 1557.0, 1515.0, 1402.0, 1346.0, 1296.0, 1226.0, 1157.0, 1089.0, 1021.0, 1029.0, 991.0, 1004.0, 938.0, 887.0, 864.0, 883.0, 851.0, 847.0, 907.0, 802.0, 800.0, 781.0, 798.0, 739.0, 690.0, 672.0, 677.0, 660.0, 640.0, 557.0, 545.0, 510.0, 458.0, 377.0, 372.0, 324.0, 287.0], [1675.0, 507.0, 411.0, 386.0, 448.0, 501.0, 606.0, 686.0, 789.0, 943.0, 981.0, 1036.0, 1187.0, 1225.0, 1320.0, 1396.0, 1458.0, 1451.0, 1451.0, 1507.0, 1472.0, 1536.0, 1406.0, 1470.0, 1460.0, 1332.0, 1369.0, 1367.0, 1297.0, 1287.0, 1225.0, 1203.0, 1199.0, 1193.0, 1122.0, 1122.0, 1055.0, 1087.0, 1066.0, 1033.0, 1084.0, 1029.0, 969.0, 997.0, 889.0, 879.0, 846.0, 755.0, 703.0], [2139.0, 623.0, 279.0, 120.0, 101.0, 101.0, 128.0, 121.0, 160.0, 203.0, 219.0, 262.0, 281.0, 320.0, 380.0, 433.0, 461.0, 548.0, 684.0, 703.0, 815.0, 903.0, 984.0, 1165.0, 1197.0, 1272.0, 1392.0, 1483.0, 1592.0, 1612.0, 1579.0, 1785.0, 1687.0, 1843.0, 1814.0, 1793.0, 1826.0, 1816.0, 1867.0, 1796.0, 1783.0, 1761.0, 1785.0, 1653.0, 1671.0, 1633.0, 1588.0, 1640.0, 1624.0], [3125.0, 958.0, 384.0, 136.0, 68.0, 43.0, 37.0, 45.0, 43.0, 43.0, 32.0, 48.0, 73.0, 60.0, 68.0, 78.0, 78.0, 108.0, 123.0, 135.0, 178.0, 182.0, 209.0, 263.0, 293.0, 355.0, 412.0, 484.0, 585.0, 739.0, 788.0, 900.0, 1087.0, 1213.0, 1361.0, 1615.0, 1781.0, 1961.0, 2150.0, 2499.0, 2650.0, 2839.0, 3037.0, 3146.0, 3352.0, 3222.0, 3308.0, 3448.0, 3395.0], [3964.0, 1493.0, 626.0, 244.0, 113.0, 64.0, 28.0, 28.0, 27.0, 24.0, 12.0, 21.0, 25.0, 26.0, 19.0, 26.0, 23.0, 23.0, 37.0, 36.0, 31.0, 41.0, 49.0, 49.0, 71.0, 66.0, 61.0, 108.0, 114.0, 117.0, 155.0, 209.0, 248.0, 296.0, 377.0, 463.0, 550.0, 766.0, 926.0, 1189.0, 1534.0, 1855.0, 2422.0, 3012.0, 3660.0, 4665.0, 5641.0, 6699.0, 7637.0], [4826.0, 2120.0, 1048.0, 484.0, 221.0, 126.0, 72.0, 48.0, 24.0, 15.0, 23.0, 23.0, 17.0, 13.0, 14.0, 6.0, 17.0, 8.0, 8.0, 15.0, 16.0, 12.0, 18.0, 17.0, 16.0, 19.0, 27.0, 22.0, 33.0, 35.0, 33.0, 47.0, 55.0, 66.0, 78.0, 98.0, 130.0, 184.0, 186.0, 247.0, 363.0, 468.0, 777.0, 1069.0, 1633.0, 2480.0, 4033.0, 6974.0, 11815.0], [5188.0, 2729.0, 1572.0, 830.0, 449.0, 247.0, 123.0, 93.0, 41.0, 28.0, 18.0, 15.0, 17.0, 11.0, 14.0, 13.0, 9.0, 6.0, 8.0, 6.0, 8.0, 15.0, 10.0, 13.0, 14.0, 8.0, 13.0, 14.0, 10.0, 8.0, 20.0, 19.0, 14.0, 23.0, 45.0, 28.0, 37.0, 51.0, 60.0, 62.0, 98.0, 136.0, 189.0, 299.0, 480.0, 770.0, 1592.0, 3564.0, 9748.0], [5374.0, 3247.0, 2208.0, 1279.0, 776.0, 437.0, 277.0, 175.0, 109.0, 79.0, 32.0, 22.0, 24.0, 16.0, 16.0, 13.0, 16.0, 9.0, 3.0, 10.0, 5.0, 2.0, 10.0, 1.0, 6.0, 8.0, 10.0, 10.0, 8.0, 11.0, 6.0, 11.0, 12.0, 15.0, 8.0, 19.0, 16.0, 16.0, 24.0, 32.0, 34.0, 48.0, 74.0, 91.0, 116.0, 281.0, 503.0, 1384.0, 5166.0], [4872.0, 3465.0, 2620.0, 1837.0, 1163.0, 831.0, 529.0, 333.0, 221.0, 142.0, 116.0, 57.0, 51.0, 37.0, 29.0, 12.0, 13.0, 14.0, 6.0, 3.0, 5.0, 2.0, 7.0, 7.0, 3.0, 4.0, 12.0, 7.0, 4.0, 7.0, 7.0, 6.0, 7.0, 6.0, 5.0, 12.0, 11.0, 13.0, 16.0, 14.0, 29.0, 20.0, 26.0, 39.0, 70.0, 112.0, 196.0, 489.0, 2274.0], [4388.0, 3464.0, 2767.0, 2112.0, 1612.0, 1127.0, 822.0, 596.0, 438.0, 319.0, 206.0, 133.0, 91.0, 72.0, 60.0, 25.0, 20.0, 19.0, 14.0, 7.0, 12.0, 10.0, 3.0, 9.0, 6.0, 7.0, 7.0, 8.0, 4.0, 7.0, 2.0, 6.0, 10.0, 5.0, 7.0, 5.0, 15.0, 4.0, 5.0, 16.0, 12.0, 17.0, 16.0, 30.0, 24.0, 47.0, 89.0, 213.0, 1057.0], [3690.0, 3038.0, 2573.0, 2200.0, 1749.0, 1447.0, 1166.0, 929.0, 671.0, 499.0, 405.0, 313.0, 224.0, 182.0, 124.0, 61.0, 57.0, 47.0, 40.0, 30.0, 29.0, 19.0, 12.0, 11.0, 14.0, 8.0, 10.0, 2.0, 2.0, 6.0, 3.0, 5.0, 3.0, 4.0, 8.0, 7.0, 9.0, 8.0, 6.0, 9.0, 10.0, 12.0, 18.0, 12.0, 16.0, 24.0, 49.0, 121.0, 494.0], [3134.0, 2610.0, 2425.0, 2015.0, 1745.0, 1544.0, 1261.0, 1095.0, 864.0, 782.0, 570.0, 478.0, 397.0, 308.0, 246.0, 188.0, 146.0, 101.0, 88.0, 76.0, 58.0, 41.0, 35.0, 24.0, 16.0, 11.0, 9.0, 4.0, 5.0, 9.0, 7.0, 6.0, 3.0, 8.0, 7.0, 3.0, 6.0, 5.0, 9.0, 6.0, 8.0, 12.0, 9.0, 7.0, 16.0, 21.0, 36.0, 77.0, 224.0], [2591.0, 2332.0, 2182.0, 1941.0, 1716.0, 1600.0, 1373.0, 1283.0, 1097.0, 937.0, 808.0, 686.0, 560.0, 489.0, 400.0, 330.0, 259.0, 201.0, 143.0, 133.0, 110.0, 80.0, 60.0, 43.0, 24.0, 22.0, 20.0, 13.0, 10.0, 6.0, 9.0, 4.0, 11.0, 7.0, 4.0, 6.0, 9.0, 3.0, 9.0, 3.0, 2.0, 7.0, 10.0, 13.0, 14.0, 18.0, 20.0, 41.0, 155.0], [2273.0, 1982.0, 1839.0, 1601.0, 1541.0, 1454.0, 1333.0, 1185.0, 1107.0, 1085.0, 988.0, 830.0, 735.0, 612.0, 569.0, 486.0, 421.0, 356.0, 298.0, 244.0, 196.0, 193.0, 130.0, 103.0, 89.0, 65.0, 55.0, 51.0, 20.0, 23.0, 19.0, 20.0, 17.0, 5.0, 10.0, 3.0, 9.0, 4.0, 3.0, 6.0, 8.0, 4.0, 6.0, 11.0, 5.0, 13.0, 16.0, 32.0, 79.0], [2011.0, 1767.0, 1657.0, 1519.0, 1380.0, 1325.0, 1204.0, 1134.0, 1050.0, 1038.0, 918.0, 878.0, 819.0, 756.0, 647.0, 631.0, 574.0, 520.0, 439.0, 358.0, 305.0, 252.0, 221.0, 199.0, 195.0, 152.0, 125.0, 97.0, 84.0, 51.0, 48.0, 40.0, 36.0, 19.0, 19.0, 9.0, 15.0, 8.0, 5.0, 7.0, 4.0, 7.0, 4.0, 3.0, 6.0, 11.0, 14.0, 27.0, 63.0], [1878.0, 1566.0, 1441.0, 1395.0, 1336.0, 1184.0, 1071.0, 1068.0, 988.0, 989.0, 940.0, 834.0, 790.0, 768.0, 716.0, 690.0, 630.0, 566.0, 528.0, 507.0, 437.0, 418.0, 375.0, 298.0, 272.0, 242.0, 222.0, 182.0, 163.0, 120.0, 110.0, 83.0, 70.0, 43.0, 40.0, 29.0, 30.0, 26.0, 17.0, 11.0, 9.0, 5.0, 5.0, 6.0, 4.0, 5.0, 11.0, 24.0, 44.0], [1656.0, 1415.0, 1414.0, 1172.0, 1165.0, 1141.0, 980.0, 981.0, 931.0, 853.0, 772.0, 785.0, 753.0, 704.0, 675.0, 685.0, 630.0, 561.0, 632.0, 515.0, 539.0, 484.0, 465.0, 430.0, 410.0, 375.0, 317.0, 295.0, 251.0, 218.0, 202.0, 186.0, 147.0, 105.0, 100.0, 74.0, 69.0, 61.0, 39.0, 35.0, 27.0, 24.0, 20.0, 19.0, 8.0, 7.0, 9.0, 11.0, 34.0], [1459.0, 1243.0, 1156.0, 1153.0, 1102.0, 971.0, 944.0, 817.0, 796.0, 761.0, 774.0, 741.0, 718.0, 682.0, 637.0, 627.0, 608.0, 605.0, 617.0, 592.0, 540.0, 516.0, 517.0, 448.0, 470.0, 452.0, 398.0, 388.0, 351.0, 307.0, 307.0, 289.0, 220.0, 213.0, 207.0, 191.0, 163.0, 128.0, 74.0, 97.0, 62.0, 57.0, 30.0, 37.0, 22.0, 13.0, 10.0, 9.0, 20.0], [1278.0, 1100.0, 1102.0, 1054.0, 944.0, 876.0, 730.0, 752.0, 735.0, 738.0, 759.0, 718.0, 653.0, 614.0, 637.0, 586.0, 629.0, 581.0, 526.0, 594.0, 543.0, 512.0, 529.0, 529.0, 491.0, 507.0, 488.0, 433.0, 432.0, 436.0, 398.0, 384.0, 345.0, 345.0, 277.0, 282.0, 243.0, 224.0, 184.0, 156.0, 128.0, 103.0, 78.0, 58.0, 33.0, 36.0, 20.0, 19.0, 27.0], [1283.0, 1027.0, 963.0, 911.0, 872.0, 795.0, 724.0, 676.0, 625.0, 606.0, 599.0, 584.0, 616.0, 596.0, 565.0, 514.0, 523.0, 522.0, 510.0, 474.0, 473.0, 496.0, 512.0, 521.0, 505.0, 537.0, 513.0, 498.0, 492.0, 502.0, 508.0, 457.0, 430.0, 405.0, 421.0, 411.0, 326.0, 330.0, 340.0, 323.0, 247.0, 229.0, 170.0, 152.0, 110.0, 90.0, 56.0, 36.0, 30.0], [935.0, 917.0, 796.0, 754.0, 729.0, 702.0, 690.0, 649.0, 599.0, 593.0, 549.0, 540.0, 555.0, 543.0, 543.0, 496.0, 512.0, 459.0, 482.0, 456.0, 440.0, 483.0, 443.0, 439.0, 480.0, 475.0, 453.0, 467.0, 487.0, 477.0, 520.0, 508.0, 524.0, 525.0, 524.0, 542.0, 471.0, 485.0, 496.0, 421.0, 394.0, 361.0, 358.0, 273.0, 229.0, 204.0, 154.0, 90.0, 81.0], [873.0, 869.0, 810.0, 684.0, 731.0, 758.0, 618.0, 577.0, 589.0, 569.0, 500.0, 495.0, 464.0, 436.0, 399.0, 358.0, 375.0, 385.0, 386.0, 378.0, 352.0, 360.0, 409.0, 401.0, 387.0, 397.0, 423.0, 421.0, 422.0, 467.0, 479.0, 488.0, 511.0, 507.0, 541.0, 538.0, 550.0, 604.0, 527.0, 541.0, 536.0, 500.0, 481.0, 472.0, 465.0, 345.0, 306.0, 233.0, 195.0], [798.0, 650.0, 709.0, 557.0, 541.0, 621.0, 608.0, 528.0, 493.0, 526.0, 516.0, 501.0, 507.0, 484.0, 455.0, 403.0, 390.0, 340.0, 346.0, 336.0, 324.0, 375.0, 348.0, 390.0, 375.0, 358.0, 409.0, 355.0, 365.0, 364.0, 393.0, 425.0, 437.0, 483.0, 437.0, 579.0, 516.0, 542.0, 627.0, 635.0, 610.0, 645.0, 671.0, 672.0, 653.0, 610.0, 545.0, 485.0, 361.0], [727.0, 542.0, 600.0, 499.0, 500.0, 544.0, 509.0, 384.0, 450.0, 472.0, 421.0, 398.0, 401.0, 374.0, 363.0, 392.0, 413.0, 419.0, 419.0, 439.0, 420.0, 340.0, 341.0, 310.0, 342.0, 299.0, 303.0, 261.0, 281.0, 291.0, 338.0, 359.0, 323.0, 374.0, 412.0, 495.0, 462.0, 517.0, 602.0, 678.0, 709.0, 692.0, 813.0, 830.0, 915.0, 839.0, 853.0, 769.0, 737.0], [558.0, 451.0, 442.0, 446.0, 474.0, 366.0, 357.0, 351.0, 388.0, 442.0, 395.0, 427.0, 399.0, 351.0, 411.0, 407.0, 436.0, 344.0, 361.0, 281.0, 288.0, 291.0, 293.0, 305.0, 289.0, 277.0, 302.0, 246.0, 260.0, 273.0, 284.0, 279.0, 267.0, 286.0, 294.0, 380.0, 393.0, 411.0, 523.0, 558.0, 615.0, 658.0, 785.0, 863.0, 970.0, 1175.0, 1266.0, 1251.0, 1273.0], [567.0, 436.0, 486.0, 505.0, 464.0, 466.0, 372.0, 259.0, 367.0, 378.0, 320.0, 363.0, 280.0, 404.0, 367.0, 335.0, 367.0, 330.0, 314.0, 253.0, 253.0, 184.0, 240.0, 282.0, 277.0, 324.0, 266.0, 265.0, 274.0, 262.0, 234.0, 209.0, 170.0, 209.0, 232.0, 233.0, 262.0, 318.0, 396.0, 425.0, 474.0, 571.0, 687.0, 822.0, 1059.0, 1202.0, 1446.0, 1588.0, 1761.0], [502.0, 456.0, 454.0, 349.0, 325.0, 376.0, 368.0, 369.0, 413.0, 366.0, 280.0, 343.0, 270.0, 397.0, 281.0, 238.0, 255.0, 308.0, 232.0, 265.0, 304.0, 238.0, 238.0, 178.0, 197.0, 190.0, 231.0, 259.0, 219.0, 196.0, 224.0, 228.0, 233.0, 286.0, 246.0, 252.0, 227.0, 277.0, 295.0, 313.0, 417.0, 434.0, 551.0, 708.0, 840.0, 1164.0, 1494.0, 1780.0, 2374.0], [435.0, 251.0, 375.0, 377.0, 248.0, 224.0, 312.0, 360.0, 370.0, 376.0, 298.0, 231.0, 277.0, 295.0, 265.0, 262.0, 337.0, 225.0, 257.0, 227.0, 235.0, 270.0, 334.0, 236.0, 200.0, 210.0, 194.0, 221.0, 179.0, 185.0, 164.0, 249.0, 248.0, 145.0, 104.0, 168.0, 185.0, 255.0, 208.0, 220.0, 260.0, 392.0, 439.0, 643.0, 772.0, 1030.0, 1324.0, 1911.0, 2736.0], [583.0, 469.0, 504.0, 335.0, 307.0, 281.0, 185.0, 342.0, 346.0, 273.0, 243.0, 446.0, 243.0, 226.0, 237.0, 252.0, 226.0, 198.0, 372.0, 420.0, 324.0, 260.0, 276.0, 342.0, 219.0, 177.0, 232.0, 133.0, 237.0, 185.0, 210.0, 263.0, 279.0, 251.0, 187.0, 215.0, 269.0, 231.0, 216.0, 230.0, 242.0, 251.0, 247.0, 316.0, 490.0, 603.0, 1037.0, 1569.0, 2620.0], [450.0, 349.0, 378.0, 373.0, 284.0, 278.0, 373.0, 298.0, 400.0, 495.0, 315.0, 221.0, 381.0, 305.0, 349.0, 314.0, 263.0, 312.0, 228.0, 272.0, 244.0, 253.0, 212.0, 173.0, 265.0, 294.0, 260.0, 361.0, 188.0, 215.0, 254.0, 161.0, 166.0, 162.0, 179.0, 202.0, 245.0, 176.0, 144.0, 178.0, 177.0, 265.0, 303.0, 355.0, 413.0, 554.0, 761.0, 1166.0, 2375.0], [498.0, 351.0, 404.0, 428.0, 385.0, 233.0, 374.0, 292.0, 245.0, 316.0, 324.0, 342.0, 303.0, 299.0, 257.0, 312.0, 263.0, 263.0, 281.0, 223.0, 261.0, 170.0, 278.0, 254.0, 172.0, 250.0, 280.0, 271.0, 211.0, 174.0, 173.0, 160.0, 218.0, 221.0, 280.0, 151.0, 101.0, 222.0, 220.0, 138.0, 199.0, 226.0, 229.0, 190.0, 280.0, 434.0, 568.0, 977.0, 2160.0], [486.0, 389.0, 322.0, 313.0, 283.0, 371.0, 297.0, 419.0, 385.0, 281.0, 279.0, 247.0, 222.0, 362.0, 318.0, 456.0, 423.0, 157.0, 302.0, 306.0, 249.0, 328.0, 190.0, 205.0, 205.0, 184.0, 222.0, 228.0, 177.0, 244.0, 288.0, 245.0, 140.0, 285.0, 234.0, 156.0, 196.0, 211.0, 263.0, 177.0, 257.0, 166.0, 212.0, 234.0, 244.0, 204.0, 375.0, 751.0, 1771.0], [537.0, 434.0, 422.0, 395.0, 335.0, 237.0, 384.0, 382.0, 291.0, 442.0, 275.0, 326.0, 313.0, 363.0, 362.0, 267.0, 274.0, 199.0, 249.0, 312.0, 186.0, 300.0, 233.0, 206.0, 308.0, 160.0, 206.0, 217.0, 257.0, 269.0, 238.0, 243.0, 267.0, 285.0, 211.0, 146.0, 198.0, 129.0, 221.0, 153.0, 202.0, 103.0, 183.0, 204.0, 223.0, 268.0, 202.0, 453.0, 1361.0], [405.0, 346.0, 481.0, 306.0, 429.0, 445.0, 305.0, 279.0, 483.0, 523.0, 397.0, 281.0, 427.0, 382.0, 255.0, 345.0, 282.0, 288.0, 339.0, 319.0, 314.0, 258.0, 216.0, 246.0, 284.0, 316.0, 261.0, 154.0, 197.0, 223.0, 182.0, 148.0, 249.0, 228.0, 238.0, 229.0, 122.0, 189.0, 164.0, 158.0, 189.0, 166.0, 234.0, 390.0, 212.0, 144.0, 280.0, 352.0, 900.0], [529.0, 468.0, 490.0, 498.0, 293.0, 269.0, 286.0, 334.0, 427.0, 380.0, 424.0, 263.0, 364.0, 244.0, 467.0, 343.0, 260.0, 295.0, 332.0, 279.0, 239.0, 248.0, 203.0, 244.0, 298.0, 292.0, 302.0, 157.0, 195.0, 189.0, 206.0, 203.0, 216.0, 118.0, 182.0, 232.0, 148.0, 274.0, 291.0, 196.0, 138.0, 100.0, 160.0, 165.0, 76.0, 173.0, 179.0, 245.0, 736.0], [384.0, 556.0, 605.0, 556.0, 399.0, 380.0, 484.0, 300.0, 416.0, 417.0, 379.0, 339.0, 375.0, 239.0, 214.0, 192.0, 309.0, 204.0, 299.0, 315.0, 182.0, 208.0, 240.0, 298.0, 287.0, 201.0, 197.0, 204.0, 262.0, 197.0, 138.0, 248.0, 163.0, 182.0, 169.0, 164.0, 254.0, 188.0, 174.0, 283.0, 218.0, 192.0, 278.0, 189.0, 186.0, 204.0, 154.0, 187.0, 499.0], [544.0, 456.0, 369.0, 325.0, 363.0, 484.0, 414.0, 389.0, 414.0, 289.0, 222.0, 339.0, 248.0, 251.0, 302.0, 322.0, 514.0, 379.0, 402.0, 260.0, 410.0, 252.0, 281.0, 271.0, 347.0, 256.0, 322.0, 166.0, 139.0, 262.0, 245.0, 137.0, 175.0, 97.0, 87.0, 296.0, 114.0, 139.0, 261.0, 244.0, 259.0, 196.0, 246.0, 143.0, 200.0, 202.0, 151.0, 158.0, 399.0], [428.0, 420.0, 617.0, 669.0, 483.0, 417.0, 578.0, 280.0, 423.0, 370.0, 353.0, 462.0, 310.0, 318.0, 257.0, 326.0, 346.0, 364.0, 235.0, 357.0, 313.0, 349.0, 246.0, 292.0, 362.0, 287.0, 150.0, 202.0, 221.0, 271.0, 175.0, 241.0, 348.0, 200.0, 323.0, 195.0, 260.0, 145.0, 244.0, 154.0, 135.0, 85.0, 163.0, 223.0, 136.0, 155.0, 231.0, 257.0, 263.0], [644.0, 524.0, 262.0, 539.0, 467.0, 342.0, 506.0, 424.0, 384.0, 455.0, 314.0, 317.0, 261.0, 297.0, 175.0, 169.0, 178.0, 380.0, 370.0, 379.0, 377.0, 256.0, 256.0, 127.0, 170.0, 197.0, 271.0, 198.0, 243.0, 207.0, 235.0, 261.0, 241.0, 230.0, 178.0, 149.0, 265.0, 170.0, 165.0, 316.0, 160.0, 166.0, 170.0, 252.0, 173.0, 63.0, 196.0, 76.0, 280.0], [613.0, 555.0, 464.0, 346.0, 330.0, 645.0, 401.0, 294.0, 381.0, 515.0, 488.0, 374.0, 325.0, 335.0, 384.0, 233.0, 305.0, 245.0, 158.0, 228.0, 417.0, 217.0, 363.0, 234.0, 188.0, 150.0, 224.0, 252.0, 155.0, 213.0, 220.0, 272.0, 128.0, 188.0, 226.0, 303.0, 205.0, 260.0, 234.0, 365.0, 258.0, 127.0, 181.0, 384.0, 220.0, 155.0, 145.0, 110.0, 134.0], [661.0, 609.0, 517.0, 465.0, 455.0, 471.0, 443.0, 398.0, 418.0, 336.0, 462.0, 390.0, 396.0, 263.0, 291.0, 338.0, 345.0, 285.0, 340.0, 213.0, 206.0, 204.0, 400.0, 463.0, 392.0, 397.0, 185.0, 166.0, 175.0, 197.0, 151.0, 179.0, 329.0, 234.0, 190.0, 243.0, 168.0, 212.0, 239.0, 140.0, 192.0, 218.0, 235.0, 250.0, 200.0, 272.0, 163.0, 138.0, 145.0], [701.0, 448.0, 388.0, 322.0, 457.0, 521.0, 494.0, 381.0, 334.0, 314.0, 222.0, 205.0, 254.0, 387.0, 404.0, 419.0, 282.0, 378.0, 359.0, 251.0, 301.0, 265.0, 327.0, 267.0, 185.0, 241.0, 255.0, 244.0, 166.0, 299.0, 118.0, 175.0, 189.0, 353.0, 204.0, 255.0, 309.0, 159.0, 206.0, 262.0, 89.0, 126.0, 215.0, 190.0, 186.0, 198.0, 118.0, 170.0, 114.0]],
    "Name": "sCurve-0",
    "Overflow": 2041107.0,
    "Type": "Histo2d",
    "Underflow": 0.0,
    "x": {
        "AxisTitle": "Vcal",
        "Bins": 51,
        "High": 302.5,
        "Low": 47.5
    },
    "y": {
        "AxisTitle": "Occupancy",
        "Bins": 49,
        "High": 49.5,
        "Low": 0.5
    },
    "z": {
        "AxisTitle": "Number of pixels"
    }
}