{
    "Data": [0.0, 0.0, 0.0, 0.0, 0.0, 0.0, 0.0, 0.0, 0.0, 0.0, 0.0, 0.0, 0.0, 0.0, 0.0, 0.0, 0.0, 0.0, 0.0, 0.0, 0.0, 0.0, 0.0, 0.0, 0.0, 0.0, 0.0, 0.0, 0.0, 0.0, 0.0, 0.0, 0.0, 0.0, 0.0, 0.0, 0.0, 0.0, 0.0, 0.0, 0.0, 0.0, 0.0, 0.0, 0.0, 0.0, 0.0, 0.0, 0.0, 0.0, 4.0, 7.0, 10.0, 12.0, 13.0, 5.0, 13.0, 15.0, 10.0, 12.0, 11.0, 20.0, 24.0, 37.0, 33.0, 56.0, 74.0, 71.0, 87.0, 118.0, 165.0, 197.0, 213.0, 259.0, 358.0, 468.0, 528.0, 607.0, 678.0, 823.0, 860.0, 1001.0, 1080.0, 1195.0, 1194.0, 1241.0, 1331.0, 1420.0, 1520.0, 1643.0, 1931.0, 2397.0, 3000.0, 3516.0, 4010.0, 4152.0, 3811.0, 3235.0, 2586.0, 1740.0, 1169.0, 780.0, 548.0, 350.0, 209.0, 177.0, 123.0, 101.0, 81.0, 66.0, 45.0, 45.0, 39.0, 33.0, 35.0, 34.0, 31.0, 32.0, 25.0, 26.0, 23.0, 22.0, 23.0, 11.0, 16.0, 18.0, 15.0, 13.0, 11.0, 9.0, 7.0, 11.0, 10.0, 13.0, 11.0, 7.0, 11.0, 7.0, 10.0, 11.0, 10.0, 7.0, 7.0, 8.0, 10.0, 9.0, 6.0, 7.0, 7.0, 14.0, 23.0, 23.0, 24.0, 22.0, 28.0, 31.0, 49.0, 49.0, 52.0, 90.0, 84.0, 103.0, 137.0, 170.0, 190.0, 204.0, 226.0, 258.0, 337.0, 333.0, 394.0, 406.0, 460.0, 505.0, 509.0, 531.0, 581.0, 575.0, 587.0, 666.0, 645.0, 698.0, 685.0, 702.0, 657.0, 693.0, 661.0, 611.0, 611.0, 603.0, 533.0, 517.0, 545.0, 521.0, 469.0, 453.0, 435.0, 396.0, 382.0, 313.0, 306.0, 264.0, 266.0, 247.0, 234.0, 192.0, 178.0, 178.0, 141.0, 127.0, 147.0, 126.0, 128.0, 105.0, 104.0, 79.0, 79.0, 79.0, 77.0, 68.0, 62.0, 50.0, 45.0, 31.0, 22.0, 29.0, 35.0, 25.0, 43.0, 24.0, 26.0, 35.0, 29.0, 32.0, 18.0, 32.0, 25.0, 23.0, 13.0, 5.0, 2.0, 7.0, 14.0, 10.0, 10.0, 14.0, 16.0, 9.0, 5.0, 10.0, 7.0, 3.0, 6.0, 6.0, 4.0, 3.0, 3.0, 2.0, 3.0, 2.0, 3.0, 4.0, 4.0, 6.0, 6.0, 3.0, 3.0, 7.0, 4.0, 7.0, 4.0, 2.0, 2.0, 1.0, 1.0, 4.0, 2.0, 4.0, 2.0, 5.0, 2.0, 2.0, 0.0, 1.0, 0.0, 1.0, 0.0, 0.0, 1.0, 1.0, 0.0, 0.0, 1.0, 1.0, 0.0, 1.0, 0.0, 0.0, 1.0, 0.0, 0.0, 2.0, 0.0, 0.0, 1.0, 0.0, 0.0, 0.0, 0.0, 0.0, 0.0, 0.0, 0.0, 0.0, 0.0, 1.0, 0.0, 0.0, 0.0, 0.0, 0.0, 2.0, 1.0, 1.0, 1.0, 1.0, 0.0, 0.0, 0.0, 0.0, 0.0, 0.0, 0.0, 0.0, 0.0, 0.0, 0.0, 0.0, 0.0, 0.0, 0.0, 0.0, 0.0, 0.0, 0.0, 0.0],
    "Name": "ThresholdDist-0",
    "Overflow": 0.0,
    "Type": "Histo1d",
    "Underflow": 0.0,
    "x": {
        "AxisTitle": "Threshold [e]",
        "Bins": 346,
        "High": 3455.0,
        "Low": -5.0
    },
    "y": {
        "AxisTitle": "Number of Pixels"
    },
    "z": {
        "AxisTitle": "z"
    }
}