{
    "Data": [[629.0, 185.0, 69.0, 48.0, 33.0, 31.0, 30.0, 22.0, 16.0, 10.0, 7.0, 8.0, 10.0, 5.0, 7.0, 8.0, 5.0, 8.0, 3.0, 3.0, 4.0, 4.0, 4.0, 10.0, 10.0, 5.0, 4.0, 10.0, 7.0, 6.0, 4.0, 10.0, 3.0, 4.0, 6.0, 3.0, 9.0, 3.0, 4.0, 6.0, 2.0, 5.0, 5.0, 4.0, 3.0, 2.0, 3.0, 5.0, 4.0], [1042.0, 320.0, 127.0, 90.0, 60.0, 57.0, 20.0, 26.0, 15.0, 10.0, 9.0, 13.0, 6.0, 7.0, 5.0, 10.0, 7.0, 8.0, 5.0, 5.0, 5.0, 3.0, 5.0, 11.0, 6.0, 5.0, 6.0, 6.0, 4.0, 9.0, 15.0, 2.0, 5.0, 5.0, 8.0, 6.0, 3.0, 4.0, 5.0, 8.0, 6.0, 8.0, 7.0, 5.0, 7.0, 5.0, 4.0, 1.0, 6.0], [1826.0, 569.0, 296.0, 171.0, 99.0, 70.0, 50.0, 51.0, 31.0, 32.0, 28.0, 19.0, 14.0, 15.0, 7.0, 11.0, 8.0, 10.0, 9.0, 5.0, 3.0, 3.0, 9.0, 10.0, 7.0, 11.0, 5.0, 3.0, 11.0, 6.0, 5.0, 6.0, 10.0, 5.0, 4.0, 4.0, 9.0, 7.0, 5.0, 7.0, 9.0, 6.0, 7.0, 8.0, 10.0, 10.0, 7.0, 12.0, 4.0], [3067.0, 1119.0, 566.0, 333.0, 213.0, 165.0, 117.0, 97.0, 61.0, 55.0, 59.0, 43.0, 13.0, 29.0, 22.0, 14.0, 23.0, 17.0, 16.0, 9.0, 12.0, 16.0, 8.0, 8.0, 9.0, 12.0, 11.0, 12.0, 12.0, 3.0, 5.0, 11.0, 4.0, 5.0, 4.0, 5.0, 8.0, 5.0, 7.0, 9.0, 9.0, 8.0, 2.0, 7.0, 15.0, 5.0, 11.0, 16.0, 18.0], [4845.0, 1931.0, 1120.0, 756.0, 498.0, 331.0, 268.0, 190.0, 176.0, 125.0, 120.0, 91.0, 65.0, 63.0, 62.0, 47.0, 41.0, 32.0, 29.0, 39.0, 32.0, 26.0, 13.0, 10.0, 19.0, 13.0, 19.0, 17.0, 19.0, 11.0, 16.0, 16.0, 11.0, 9.0, 9.0, 7.0, 11.0, 7.0, 14.0, 9.0, 3.0, 8.0, 10.0, 4.0, 10.0, 14.0, 14.0, 15.0, 22.0], [8756.0, 3697.0, 1906.0, 1312.0, 931.0, 745.0, 577.0, 433.0, 348.0, 286.0, 240.0, 208.0, 183.0, 181.0, 128.0, 118.0, 109.0, 92.0, 67.0, 77.0, 64.0, 44.0, 55.0, 42.0, 37.0, 37.0, 33.0, 31.0, 26.0, 29.0, 30.0, 24.0, 17.0, 20.0, 18.0, 21.0, 29.0, 17.0, 21.0, 10.0, 12.0, 13.0, 8.0, 15.0, 15.0, 9.0, 13.0, 16.0, 28.0], [9629.0, 6700.0, 4836.0, 3380.0, 2462.0, 1850.0, 1395.0, 1121.0, 814.0, 714.0, 580.0, 483.0, 418.0, 353.0, 323.0, 278.0, 244.0, 244.0, 208.0, 171.0, 155.0, 146.0, 116.0, 113.0, 103.0, 93.0, 98.0, 69.0, 66.0, 66.0, 71.0, 59.0, 42.0, 50.0, 35.0, 43.0, 40.0, 31.0, 29.0, 34.0, 42.0, 29.0, 28.0, 18.0, 23.0, 22.0, 29.0, 24.0, 37.0], [3683.0, 3612.0, 3594.0, 3489.0, 3324.0, 3219.0, 3057.0, 2614.0, 2490.0, 2207.0, 1994.0, 1696.0, 1488.0, 1366.0, 1201.0, 1032.0, 938.0, 774.0, 698.0, 596.0, 547.0, 462.0, 398.0, 392.0, 286.0, 307.0, 238.0, 205.0, 201.0, 204.0, 164.0, 147.0, 128.0, 138.0, 99.0, 88.0, 99.0, 80.0, 86.0, 59.0, 74.0, 64.0, 63.0, 56.0, 44.0, 41.0, 50.0, 57.0, 69.0], [1336.0, 1159.0, 1225.0, 1233.0, 1240.0, 1236.0, 1261.0, 1417.0, 1388.0, 1432.0, 1499.0, 1593.0, 1656.0, 1654.0, 1723.0, 1702.0, 1731.0, 1755.0, 1721.0, 1678.0, 1631.0, 1556.0, 1506.0, 1430.0, 1399.0, 1312.0, 1318.0, 1224.0, 1050.0, 1023.0, 949.0, 814.0, 734.0, 647.0, 607.0, 533.0, 472.0, 392.0, 334.0, 321.0, 260.0, 193.0, 204.0, 166.0, 149.0, 145.0, 121.0, 112.0, 115.0], [664.0, 559.0, 605.0, 613.0, 570.0, 621.0, 584.0, 631.0, 574.0, 647.0, 675.0, 674.0, 637.0, 677.0, 765.0, 683.0, 741.0, 817.0, 832.0, 823.0, 891.0, 897.0, 1024.0, 1028.0, 1076.0, 1121.0, 1175.0, 1250.0, 1301.0, 1462.0, 1456.0, 1534.0, 1535.0, 1649.0, 1673.0, 1764.0, 1668.0, 1711.0, 1646.0, 1675.0, 1623.0, 1499.0, 1429.0, 1327.0, 1227.0, 989.0, 796.0, 642.0, 497.0], [378.0, 277.0, 233.0, 249.0, 259.0, 280.0, 299.0, 311.0, 299.0, 344.0, 376.0, 367.0, 397.0, 393.0, 421.0, 428.0, 444.0, 465.0, 483.0, 499.0, 530.0, 548.0, 552.0, 633.0, 592.0, 578.0, 596.0, 643.0, 642.0, 673.0, 643.0, 780.0, 785.0, 877.0, 895.0, 998.0, 1122.0, 1181.0, 1359.0, 1476.0, 1683.0, 1936.0, 2095.0, 2352.0, 2725.0, 3050.0, 3483.0, 3695.0, 3886.0], [297.0, 149.0, 119.0, 106.0, 120.0, 123.0, 137.0, 113.0, 132.0, 163.0, 161.0, 179.0, 172.0, 189.0, 214.0, 230.0, 237.0, 268.0, 302.0, 276.0, 313.0, 338.0, 344.0, 372.0, 394.0, 397.0, 417.0, 452.0, 452.0, 506.0, 524.0, 563.0, 608.0, 659.0, 610.0, 691.0, 679.0, 839.0, 807.0, 911.0, 1002.0, 1097.0, 1224.0, 1374.0, 1677.0, 2209.0, 2967.0, 4277.0, 7239.0], [243.0, 108.0, 72.0, 71.0, 72.0, 68.0, 58.0, 54.0, 68.0, 57.0, 67.0, 65.0, 84.0, 88.0, 77.0, 86.0, 110.0, 104.0, 122.0, 124.0, 139.0, 154.0, 157.0, 194.0, 192.0, 237.0, 248.0, 259.0, 287.0, 298.0, 323.0, 346.0, 380.0, 385.0, 459.0, 472.0, 587.0, 608.0, 687.0, 755.0, 806.0, 915.0, 1025.0, 1126.0, 1343.0, 1568.0, 2107.0, 2817.0, 5771.0], [239.0, 92.0, 70.0, 47.0, 46.0, 50.0, 37.0, 30.0, 37.0, 32.0, 39.0, 37.0, 37.0, 37.0, 37.0, 35.0, 34.0, 41.0, 55.0, 52.0, 62.0, 65.0, 67.0, 74.0, 76.0, 81.0, 107.0, 123.0, 130.0, 154.0, 162.0, 171.0, 184.0, 222.0, 234.0, 267.0, 315.0, 393.0, 398.0, 469.0, 544.0, 623.0, 781.0, 863.0, 1153.0, 1367.0, 1849.0, 2556.0, 4588.0], [205.0, 95.0, 58.0, 28.0, 42.0, 38.0, 28.0, 21.0, 26.0, 21.0, 26.0, 27.0, 24.0, 25.0, 20.0, 21.0, 17.0, 31.0, 22.0, 26.0, 30.0, 26.0, 28.0, 30.0, 39.0, 39.0, 53.0, 47.0, 42.0, 59.0, 64.0, 90.0, 75.0, 92.0, 86.0, 118.0, 140.0, 168.0, 206.0, 224.0, 277.0, 346.0, 432.0, 596.0, 753.0, 997.0, 1422.0, 2230.0, 4201.0], [204.0, 87.0, 48.0, 46.0, 29.0, 36.0, 28.0, 24.0, 20.0, 14.0, 10.0, 14.0, 26.0, 13.0, 13.0, 14.0, 13.0, 16.0, 11.0, 18.0, 18.0, 22.0, 20.0, 25.0, 21.0, 21.0, 22.0, 23.0, 26.0, 28.0, 31.0, 33.0, 44.0, 38.0, 53.0, 51.0, 56.0, 73.0, 85.0, 94.0, 123.0, 137.0, 192.0, 303.0, 397.0, 599.0, 899.0, 1505.0, 3347.0], [218.0, 86.0, 44.0, 38.0, 28.0, 20.0, 29.0, 13.0, 21.0, 11.0, 23.0, 13.0, 12.0, 10.0, 11.0, 11.0, 10.0, 9.0, 13.0, 9.0, 19.0, 9.0, 14.0, 14.0, 20.0, 16.0, 15.0, 11.0, 11.0, 11.0, 21.0, 20.0, 16.0, 25.0, 31.0, 36.0, 27.0, 31.0, 40.0, 51.0, 58.0, 70.0, 85.0, 123.0, 168.0, 240.0, 447.0, 805.0, 2415.0], [192.0, 79.0, 45.0, 43.0, 27.0, 19.0, 16.0, 22.0, 11.0, 10.0, 12.0, 4.0, 7.0, 13.0, 15.0, 12.0, 10.0, 9.0, 7.0, 13.0, 9.0, 2.0, 14.0, 13.0, 15.0, 12.0, 15.0, 10.0, 11.0, 12.0, 11.0, 14.0, 14.0, 14.0, 15.0, 17.0, 20.0, 13.0, 27.0, 23.0, 30.0, 35.0, 49.0, 56.0, 80.0, 111.0, 186.0, 392.0, 1377.0], [188.0, 85.0, 33.0, 36.0, 28.0, 23.0, 23.0, 18.0, 7.0, 10.0, 17.0, 12.0, 6.0, 5.0, 5.0, 4.0, 4.0, 7.0, 8.0, 12.0, 2.0, 8.0, 11.0, 7.0, 8.0, 7.0, 12.0, 13.0, 9.0, 13.0, 10.0, 16.0, 11.0, 15.0, 14.0, 17.0, 13.0, 21.0, 9.0, 12.0, 12.0, 34.0, 20.0, 28.0, 38.0, 73.0, 90.0, 201.0, 691.0], [186.0, 76.0, 40.0, 23.0, 20.0, 21.0, 17.0, 19.0, 12.0, 15.0, 5.0, 4.0, 9.0, 5.0, 7.0, 7.0, 6.0, 3.0, 7.0, 11.0, 9.0, 6.0, 5.0, 9.0, 11.0, 11.0, 8.0, 11.0, 7.0, 9.0, 12.0, 2.0, 5.0, 11.0, 11.0, 9.0, 15.0, 10.0, 16.0, 16.0, 17.0, 13.0, 24.0, 21.0, 29.0, 26.0, 52.0, 103.0, 379.0], [154.0, 57.0, 40.0, 27.0, 20.0, 31.0, 13.0, 17.0, 8.0, 5.0, 8.0, 9.0, 11.0, 2.0, 9.0, 4.0, 9.0, 6.0, 8.0, 9.0, 5.0, 4.0, 6.0, 6.0, 7.0, 8.0, 5.0, 8.0, 6.0, 8.0, 8.0, 6.0, 8.0, 8.0, 4.0, 15.0, 8.0, 9.0, 10.0, 15.0, 10.0, 12.0, 10.0, 23.0, 12.0, 38.0, 39.0, 75.0, 183.0], [182.0, 58.0, 36.0, 31.0, 26.0, 13.0, 19.0, 9.0, 7.0, 7.0, 5.0, 6.0, 4.0, 4.0, 3.0, 3.0, 7.0, 6.0, 5.0, 4.0, 12.0, 3.0, 6.0, 4.0, 4.0, 9.0, 8.0, 5.0, 9.0, 9.0, 8.0, 6.0, 6.0, 7.0, 7.0, 3.0, 17.0, 8.0, 8.0, 7.0, 13.0, 11.0, 12.0, 15.0, 14.0, 23.0, 32.0, 48.0, 139.0], [162.0, 67.0, 32.0, 34.0, 23.0, 21.0, 9.0, 7.0, 6.0, 9.0, 5.0, 2.0, 4.0, 6.0, 4.0, 1.0, 3.0, 5.0, 4.0, 6.0, 7.0, 4.0, 6.0, 6.0, 5.0, 7.0, 7.0, 6.0, 4.0, 6.0, 3.0, 5.0, 8.0, 2.0, 5.0, 7.0, 7.0, 11.0, 11.0, 12.0, 9.0, 12.0, 8.0, 10.0, 10.0, 16.0, 26.0, 34.0, 90.0], [165.0, 62.0, 45.0, 33.0, 27.0, 13.0, 13.0, 8.0, 6.0, 4.0, 6.0, 3.0, 5.0, 2.0, 3.0, 3.0, 5.0, 5.0, 3.0, 3.0, 3.0, 4.0, 3.0, 5.0, 6.0, 9.0, 8.0, 3.0, 4.0, 6.0, 3.0, 6.0, 5.0, 3.0, 5.0, 5.0, 4.0, 3.0, 4.0, 12.0, 8.0, 11.0, 9.0, 10.0, 6.0, 17.0, 18.0, 18.0, 86.0], [181.0, 69.0, 36.0, 25.0, 19.0, 11.0, 16.0, 6.0, 4.0, 12.0, 0.0, 4.0, 4.0, 5.0, 3.0, 4.0, 4.0, 3.0, 1.0, 7.0, 6.0, 1.0, 4.0, 4.0, 3.0, 3.0, 4.0, 1.0, 4.0, 0.0, 5.0, 7.0, 2.0, 3.0, 6.0, 4.0, 4.0, 7.0, 5.0, 5.0, 4.0, 7.0, 8.0, 6.0, 6.0, 15.0, 15.0, 29.0, 51.0], [206.0, 68.0, 24.0, 16.0, 17.0, 17.0, 10.0, 13.0, 9.0, 5.0, 4.0, 4.0, 2.0, 3.0, 3.0, 2.0, 3.0, 2.0, 3.0, 2.0, 5.0, 4.0, 10.0, 2.0, 0.0, 6.0, 3.0, 4.0, 5.0, 3.0, 3.0, 3.0, 1.0, 3.0, 3.0, 2.0, 4.0, 4.0, 4.0, 2.0, 3.0, 7.0, 4.0, 8.0, 8.0, 13.0, 11.0, 14.0, 40.0], [184.0, 62.0, 38.0, 22.0, 14.0, 20.0, 5.0, 11.0, 5.0, 7.0, 3.0, 5.0, 3.0, 2.0, 4.0, 4.0, 4.0, 3.0, 3.0, 2.0, 2.0, 2.0, 3.0, 0.0, 3.0, 1.0, 3.0, 3.0, 2.0, 2.0, 6.0, 2.0, 5.0, 3.0, 3.0, 4.0, 0.0, 3.0, 0.0, 9.0, 6.0, 3.0, 4.0, 3.0, 6.0, 6.0, 5.0, 16.0, 31.0], [159.0, 64.0, 34.0, 30.0, 22.0, 16.0, 12.0, 10.0, 6.0, 1.0, 2.0, 3.0, 2.0, 0.0, 1.0, 6.0, 2.0, 2.0, 4.0, 5.0, 4.0, 5.0, 2.0, 0.0, 1.0, 2.0, 3.0, 1.0, 4.0, 3.0, 5.0, 3.0, 3.0, 1.0, 2.0, 4.0, 4.0, 6.0, 2.0, 4.0, 3.0, 3.0, 0.0, 1.0, 4.0, 1.0, 6.0, 11.0, 25.0], [182.0, 65.0, 28.0, 16.0, 16.0, 14.0, 11.0, 5.0, 8.0, 7.0, 3.0, 6.0, 2.0, 3.0, 4.0, 3.0, 2.0, 2.0, 4.0, 1.0, 4.0, 1.0, 6.0, 3.0, 3.0, 2.0, 2.0, 3.0, 2.0, 5.0, 3.0, 3.0, 3.0, 1.0, 1.0, 4.0, 0.0, 2.0, 2.0, 3.0, 3.0, 3.0, 2.0, 2.0, 2.0, 4.0, 8.0, 5.0, 24.0], [145.0, 63.0, 43.0, 17.0, 19.0, 10.0, 11.0, 7.0, 9.0, 6.0, 4.0, 2.0, 1.0, 5.0, 1.0, 2.0, 4.0, 2.0, 3.0, 3.0, 1.0, 5.0, 5.0, 1.0, 2.0, 3.0, 1.0, 3.0, 2.0, 3.0, 4.0, 0.0, 2.0, 2.0, 2.0, 5.0, 3.0, 0.0, 2.0, 1.0, 3.0, 1.0, 3.0, 4.0, 4.0, 4.0, 5.0, 2.0, 16.0], [165.0, 72.0, 41.0, 17.0, 16.0, 7.0, 14.0, 8.0, 7.0, 6.0, 5.0, 4.0, 3.0, 1.0, 2.0, 3.0, 2.0, 0.0, 3.0, 4.0, 3.0, 0.0, 1.0, 0.0, 2.0, 3.0, 0.0, 3.0, 7.0, 5.0, 1.0, 8.0, 5.0, 1.0, 2.0, 4.0, 2.0, 1.0, 1.0, 3.0, 0.0, 1.0, 1.0, 3.0, 1.0, 2.0, 3.0, 4.0, 9.0], [163.0, 70.0, 35.0, 21.0, 22.0, 13.0, 7.0, 12.0, 5.0, 2.0, 4.0, 3.0, 1.0, 1.0, 2.0, 0.0, 1.0, 3.0, 2.0, 0.0, 2.0, 1.0, 1.0, 6.0, 3.0, 2.0, 5.0, 6.0, 2.0, 3.0, 2.0, 3.0, 2.0, 3.0, 0.0, 3.0, 1.0, 1.0, 1.0, 2.0, 3.0, 3.0, 3.0, 1.0, 5.0, 3.0, 1.0, 6.0, 7.0], [154.0, 70.0, 26.0, 21.0, 15.0, 15.0, 11.0, 8.0, 5.0, 7.0, 4.0, 3.0, 1.0, 2.0, 1.0, 3.0, 2.0, 3.0, 1.0, 3.0, 5.0, 3.0, 1.0, 3.0, 3.0, 1.0, 4.0, 3.0, 1.0, 0.0, 1.0, 3.0, 3.0, 1.0, 1.0, 5.0, 0.0, 2.0, 3.0, 0.0, 3.0, 2.0, 0.0, 4.0, 3.0, 4.0, 2.0, 4.0, 5.0], [150.0, 62.0, 41.0, 20.0, 20.0, 15.0, 10.0, 8.0, 5.0, 4.0, 5.0, 3.0, 0.0, 2.0, 1.0, 1.0, 1.0, 3.0, 2.0, 1.0, 4.0, 2.0, 5.0, 4.0, 4.0, 1.0, 5.0, 0.0, 0.0, 2.0, 2.0, 2.0, 2.0, 7.0, 2.0, 1.0, 1.0, 0.0, 2.0, 0.0, 2.0, 1.0, 2.0, 2.0, 1.0, 2.0, 2.0, 4.0, 10.0], [168.0, 66.0, 37.0, 14.0, 12.0, 17.0, 12.0, 9.0, 7.0, 2.0, 3.0, 7.0, 2.0, 1.0, 1.0, 0.0, 0.0, 3.0, 0.0, 3.0, 1.0, 1.0, 2.0, 4.0, 3.0, 2.0, 2.0, 4.0, 3.0, 3.0, 4.0, 3.0, 0.0, 2.0, 4.0, 1.0, 0.0, 2.0, 0.0, 1.0, 2.0, 2.0, 1.0, 2.0, 1.0, 3.0, 2.0, 3.0, 5.0], [178.0, 65.0, 40.0, 18.0, 25.0, 12.0, 6.0, 4.0, 10.0, 2.0, 1.0, 3.0, 1.0, 2.0, 1.0, 2.0, 1.0, 1.0, 0.0, 3.0, 4.0, 1.0, 3.0, 5.0, 3.0, 5.0, 0.0, 4.0, 4.0, 1.0, 2.0, 2.0, 2.0, 3.0, 2.0, 2.0, 3.0, 1.0, 1.0, 1.0, 2.0, 3.0, 0.0, 0.0, 3.0, 2.0, 4.0, 0.0, 4.0], [205.0, 57.0, 29.0, 22.0, 11.0, 18.0, 8.0, 10.0, 6.0, 5.0, 3.0, 2.0, 2.0, 3.0, 2.0, 5.0, 2.0, 4.0, 0.0, 2.0, 3.0, 3.0, 3.0, 5.0, 1.0, 1.0, 4.0, 1.0, 2.0, 2.0, 1.0, 1.0, 2.0, 4.0, 3.0, 2.0, 0.0, 3.0, 1.0, 1.0, 1.0, 4.0, 3.0, 2.0, 3.0, 1.0, 1.0, 3.0, 2.0], [179.0, 51.0, 32.0, 19.0, 21.0, 13.0, 13.0, 12.0, 9.0, 4.0, 2.0, 0.0, 1.0, 2.0, 0.0, 4.0, 1.0, 0.0, 0.0, 2.0, 1.0, 2.0, 0.0, 5.0, 4.0, 4.0, 5.0, 2.0, 1.0, 1.0, 3.0, 2.0, 5.0, 2.0, 1.0, 0.0, 1.0, 0.0, 3.0, 6.0, 1.0, 1.0, 1.0, 6.0, 0.0, 1.0, 0.0, 4.0, 3.0], [150.0, 70.0, 33.0, 23.0, 15.0, 15.0, 13.0, 10.0, 6.0, 3.0, 5.0, 2.0, 4.0, 0.0, 2.0, 2.0, 2.0, 0.0, 0.0, 3.0, 2.0, 2.0, 6.0, 5.0, 1.0, 1.0, 3.0, 6.0, 1.0, 4.0, 3.0, 0.0, 1.0, 2.0, 3.0, 2.0, 0.0, 1.0, 3.0, 1.0, 4.0, 2.0, 2.0, 1.0, 0.0, 1.0, 0.0, 1.0, 9.0], [178.0, 64.0, 33.0, 19.0, 14.0, 13.0, 12.0, 5.0, 7.0, 2.0, 4.0, 6.0, 1.0, 4.0, 1.0, 1.0, 0.0, 1.0, 3.0, 2.0, 4.0, 2.0, 4.0, 3.0, 2.0, 2.0, 3.0, 4.0, 2.0, 2.0, 3.0, 3.0, 1.0, 1.0, 2.0, 2.0, 6.0, 0.0, 4.0, 2.0, 0.0, 3.0, 1.0, 3.0, 0.0, 2.0, 2.0, 3.0, 8.0], [149.0, 59.0, 39.0, 35.0, 18.0, 7.0, 9.0, 5.0, 5.0, 6.0, 2.0, 4.0, 2.0, 1.0, 1.0, 4.0, 0.0, 3.0, 1.0, 2.0, 1.0, 2.0, 2.0, 3.0, 7.0, 3.0, 5.0, 6.0, 1.0, 3.0, 1.0, 1.0, 2.0, 3.0, 3.0, 0.0, 3.0, 3.0, 3.0, 2.0, 0.0, 0.0, 2.0, 2.0, 1.0, 2.0, 1.0, 1.0, 6.0], [156.0, 67.0, 37.0, 19.0, 20.0, 10.0, 9.0, 13.0, 7.0, 6.0, 4.0, 2.0, 3.0, 2.0, 4.0, 1.0, 0.0, 1.0, 1.0, 2.0, 1.0, 2.0, 4.0, 5.0, 2.0, 3.0, 2.0, 3.0, 4.0, 4.0, 4.0, 3.0, 2.0, 2.0, 1.0, 3.0, 2.0, 3.0, 2.0, 1.0, 1.0, 2.0, 1.0, 2.0, 0.0, 0.0, 0.0, 1.0, 5.0], [181.0, 67.0, 30.0, 19.0, 23.0, 15.0, 11.0, 7.0, 7.0, 5.0, 5.0, 1.0, 1.0, 1.0, 3.0, 5.0, 3.0, 1.0, 2.0, 1.0, 2.0, 2.0, 4.0, 5.0, 3.0, 3.0, 1.0, 3.0, 5.0, 2.0, 4.0, 0.0, 1.0, 2.0, 2.0, 2.0, 3.0, 1.0, 1.0, 1.0, 3.0, 0.0, 1.0, 3.0, 1.0, 2.0, 2.0, 2.0, 4.0], [165.0, 66.0, 32.0, 27.0, 22.0, 11.0, 8.0, 10.0, 7.0, 7.0, 4.0, 0.0, 3.0, 4.0, 2.0, 0.0, 1.0, 2.0, 2.0, 3.0, 1.0, 2.0, 2.0, 0.0, 2.0, 0.0, 2.0, 5.0, 4.0, 1.0, 3.0, 3.0, 3.0, 1.0, 3.0, 0.0, 1.0, 2.0, 4.0, 2.0, 1.0, 1.0, 2.0, 1.0, 0.0, 1.0, 2.0, 0.0, 3.0], [202.0, 66.0, 33.0, 23.0, 16.0, 9.0, 8.0, 11.0, 10.0, 5.0, 3.0, 2.0, 1.0, 1.0, 1.0, 2.0, 1.0, 0.0, 0.0, 2.0, 4.0, 1.0, 3.0, 4.0, 4.0, 2.0, 1.0, 2.0, 3.0, 2.0, 2.0, 2.0, 1.0, 5.0, 4.0, 4.0, 2.0, 3.0, 0.0, 0.0, 1.0, 1.0, 2.0, 5.0, 0.0, 2.0, 3.0, 2.0, 4.0], [174.0, 60.0, 28.0, 30.0, 21.0, 13.0, 6.0, 7.0, 5.0, 4.0, 3.0, 6.0, 1.0, 2.0, 3.0, 2.0, 1.0, 2.0, 0.0, 2.0, 1.0, 5.0, 3.0, 4.0, 1.0, 4.0, 2.0, 3.0, 5.0, 2.0, 4.0, 4.0, 1.0, 1.0, 0.0, 1.0, 2.0, 4.0, 1.0, 2.0, 1.0, 2.0, 2.0, 0.0, 0.0, 0.0, 4.0, 4.0, 3.0], [183.0, 70.0, 37.0, 18.0, 18.0, 11.0, 12.0, 10.0, 6.0, 2.0, 4.0, 3.0, 4.0, 0.0, 2.0, 3.0, 2.0, 2.0, 0.0, 4.0, 2.0, 0.0, 3.0, 4.0, 4.0, 4.0, 3.0, 2.0, 2.0, 1.0, 1.0, 1.0, 6.0, 3.0, 2.0, 3.0, 0.0, 2.0, 6.0, 2.0, 0.0, 0.0, 1.0, 1.0, 2.0, 2.0, 0.0, 0.0, 3.0], [162.0, 71.0, 30.0, 23.0, 19.0, 16.0, 13.0, 14.0, 4.0, 5.0, 4.0, 2.0, 0.0, 1.0, 1.0, 1.0, 3.0, 1.0, 1.0, 2.0, 6.0, 6.0, 3.0, 0.0, 0.0, 4.0, 2.0, 0.0, 2.0, 0.0, 2.0, 4.0, 5.0, 1.0, 0.0, 2.0, 3.0, 0.0, 1.0, 3.0, 4.0, 1.0, 4.0, 3.0, 2.0, 1.0, 0.0, 0.0, 2.0], [163.0, 70.0, 35.0, 17.0, 19.0, 15.0, 9.0, 10.0, 6.0, 7.0, 5.0, 1.0, 1.0, 3.0, 2.0, 5.0, 1.0, 1.0, 3.0, 1.0, 3.0, 6.0, 3.0, 6.0, 0.0, 2.0, 1.0, 5.0, 2.0, 1.0, 1.0, 0.0, 0.0, 2.0, 2.0, 3.0, 3.0, 1.0, 2.0, 1.0, 1.0, 2.0, 1.0, 2.0, 2.0, 3.0, 3.0, 2.0, 4.0], [173.0, 56.0, 31.0, 28.0, 22.0, 13.0, 8.0, 16.0, 6.0, 3.0, 3.0, 3.0, 3.0, 2.0, 3.0, 2.0, 2.0, 1.0, 3.0, 2.0, 3.0, 0.0, 3.0, 2.0, 1.0, 6.0, 3.0, 3.0, 2.0, 2.0, 3.0, 2.0, 4.0, 3.0, 1.0, 3.0, 2.0, 0.0, 0.0, 3.0, 2.0, 2.0, 2.0, 2.0, 2.0, 1.0, 0.0, 3.0, 1.0], [158.0, 74.0, 46.0, 23.0, 15.0, 13.0, 7.0, 14.0, 4.0, 7.0, 3.0, 3.0, 3.0, 2.0, 0.0, 6.0, 0.0, 3.0, 1.0, 3.0, 2.0, 4.0, 1.0, 1.0, 4.0, 4.0, 3.0, 3.0, 5.0, 2.0, 5.0, 1.0, 4.0, 1.0, 1.0, 2.0, 3.0, 0.0, 0.0, 1.0, 0.0, 4.0, 2.0, 4.0, 1.0, 2.0, 1.0, 1.0, 2.0]],
    "Name": "sCurve-0",
    "Overflow": 1976947.0,
    "Type": "Histo2d",
    "Underflow": 0.0,
    "x": {
        "AxisTitle": "Vcal",
        "Bins": 51,
        "High": 302.5,
        "Low": 47.5
    },
    "y": {
        "AxisTitle": "Occupancy",
        "Bins": 49,
        "High": 49.5,
        "Low": 0.5
    },
    "z": {
        "AxisTitle": "Number of pixels"
    }
}