{
    "Data": [[291.0, 80.0, 51.0, 34.0, 19.0, 8.0, 9.0, 14.0, 7.0, 7.0, 5.0, 6.0, 4.0, 6.0, 10.0, 10.0, 6.0, 8.0, 4.0, 5.0, 3.0, 5.0, 8.0, 7.0, 6.0, 2.0, 4.0, 7.0, 7.0, 5.0, 2.0, 5.0, 4.0, 5.0, 5.0, 4.0, 2.0, 7.0, 6.0, 5.0, 6.0, 4.0, 2.0, 5.0, 4.0, 2.0, 4.0, 5.0, 3.0], [579.0, 160.0, 90.0, 55.0, 23.0, 23.0, 20.0, 14.0, 16.0, 10.0, 6.0, 8.0, 10.0, 10.0, 4.0, 6.0, 6.0, 13.0, 6.0, 6.0, 6.0, 3.0, 3.0, 8.0, 2.0, 7.0, 6.0, 6.0, 8.0, 3.0, 6.0, 2.0, 4.0, 5.0, 6.0, 4.0, 4.0, 5.0, 6.0, 4.0, 1.0, 7.0, 7.0, 7.0, 5.0, 11.0, 1.0, 11.0, 7.0], [1183.0, 383.0, 146.0, 111.0, 76.0, 51.0, 37.0, 22.0, 27.0, 23.0, 17.0, 20.0, 11.0, 15.0, 14.0, 7.0, 8.0, 10.0, 9.0, 6.0, 4.0, 7.0, 5.0, 8.0, 3.0, 4.0, 1.0, 6.0, 3.0, 8.0, 7.0, 4.0, 3.0, 3.0, 5.0, 3.0, 8.0, 8.0, 9.0, 4.0, 2.0, 4.0, 5.0, 6.0, 4.0, 9.0, 12.0, 9.0, 11.0], [2223.0, 788.0, 428.0, 250.0, 152.0, 139.0, 75.0, 65.0, 53.0, 37.0, 39.0, 31.0, 38.0, 33.0, 23.0, 30.0, 20.0, 16.0, 16.0, 11.0, 16.0, 9.0, 14.0, 9.0, 11.0, 15.0, 9.0, 4.0, 5.0, 8.0, 6.0, 9.0, 2.0, 5.0, 5.0, 2.0, 12.0, 2.0, 2.0, 3.0, 8.0, 4.0, 10.0, 8.0, 6.0, 12.0, 13.0, 12.0, 18.0], [3781.0, 1490.0, 920.0, 545.0, 415.0, 291.0, 249.0, 190.0, 162.0, 125.0, 85.0, 80.0, 63.0, 78.0, 61.0, 43.0, 52.0, 41.0, 35.0, 24.0, 26.0, 26.0, 26.0, 24.0, 24.0, 19.0, 23.0, 21.0, 17.0, 14.0, 16.0, 17.0, 12.0, 5.0, 8.0, 12.0, 12.0, 9.0, 13.0, 9.0, 9.0, 0.0, 10.0, 12.0, 7.0, 8.0, 15.0, 16.0, 26.0], [7442.0, 3022.0, 1732.0, 1117.0, 804.0, 635.0, 492.0, 429.0, 381.0, 294.0, 264.0, 244.0, 198.0, 173.0, 162.0, 140.0, 102.0, 104.0, 99.0, 71.0, 77.0, 66.0, 51.0, 56.0, 50.0, 54.0, 43.0, 43.0, 38.0, 41.0, 33.0, 28.0, 31.0, 22.0, 27.0, 26.0, 30.0, 29.0, 20.0, 12.0, 18.0, 18.0, 15.0, 27.0, 24.0, 14.0, 14.0, 17.0, 25.0], [8787.0, 6287.0, 4308.0, 3187.0, 2320.0, 1835.0, 1460.0, 1144.0, 899.0, 784.0, 614.0, 552.0, 423.0, 392.0, 390.0, 278.0, 297.0, 282.0, 248.0, 255.0, 190.0, 192.0, 178.0, 156.0, 143.0, 142.0, 130.0, 115.0, 104.0, 104.0, 82.0, 89.0, 80.0, 72.0, 65.0, 64.0, 66.0, 43.0, 61.0, 53.0, 44.0, 37.0, 49.0, 40.0, 33.0, 46.0, 45.0, 40.0, 52.0], [3337.0, 3046.0, 3004.0, 2817.0, 2758.0, 2593.0, 2531.0, 2335.0, 2250.0, 2070.0, 1920.0, 1746.0, 1668.0, 1462.0, 1357.0, 1287.0, 1082.0, 1014.0, 901.0, 779.0, 771.0, 629.0, 584.0, 491.0, 488.0, 425.0, 413.0, 342.0, 334.0, 313.0, 256.0, 241.0, 199.0, 206.0, 200.0, 180.0, 169.0, 166.0, 152.0, 146.0, 127.0, 136.0, 121.0, 109.0, 87.0, 101.0, 106.0, 86.0, 121.0], [1037.0, 936.0, 960.0, 849.0, 964.0, 902.0, 985.0, 1026.0, 1045.0, 1067.0, 1091.0, 1151.0, 1135.0, 1192.0, 1191.0, 1318.0, 1271.0, 1361.0, 1339.0, 1374.0, 1437.0, 1413.0, 1437.0, 1411.0, 1432.0, 1363.0, 1450.0, 1361.0, 1332.0, 1283.0, 1255.0, 1238.0, 1187.0, 1225.0, 1014.0, 977.0, 962.0, 837.0, 775.0, 712.0, 609.0, 603.0, 501.0, 458.0, 390.0, 356.0, 291.0, 300.0, 298.0], [403.0, 355.0, 353.0, 333.0, 383.0, 414.0, 403.0, 420.0, 435.0, 439.0, 429.0, 468.0, 503.0, 486.0, 509.0, 536.0, 508.0, 570.0, 581.0, 598.0, 622.0, 645.0, 681.0, 752.0, 720.0, 810.0, 826.0, 941.0, 903.0, 1012.0, 1018.0, 1085.0, 1211.0, 1240.0, 1319.0, 1484.0, 1527.0, 1608.0, 1630.0, 1842.0, 1932.0, 2038.0, 2140.0, 2249.0, 2195.0, 2194.0, 2097.0, 1990.0, 1774.0], [226.0, 155.0, 149.0, 127.0, 137.0, 177.0, 144.0, 163.0, 173.0, 214.0, 193.0, 201.0, 233.0, 228.0, 226.0, 307.0, 265.0, 273.0, 318.0, 311.0, 313.0, 327.0, 351.0, 345.0, 427.0, 391.0, 413.0, 455.0, 470.0, 540.0, 549.0, 579.0, 577.0, 616.0, 677.0, 727.0, 780.0, 867.0, 932.0, 1012.0, 1153.0, 1358.0, 1542.0, 1845.0, 2121.0, 2755.0, 3500.0, 4798.0, 6676.0], [151.0, 85.0, 79.0, 78.0, 63.0, 65.0, 50.0, 75.0, 72.0, 72.0, 81.0, 86.0, 76.0, 81.0, 78.0, 103.0, 90.0, 137.0, 126.0, 132.0, 163.0, 171.0, 186.0, 172.0, 212.0, 221.0, 215.0, 257.0, 273.0, 285.0, 309.0, 321.0, 357.0, 404.0, 402.0, 435.0, 497.0, 539.0, 612.0, 643.0, 766.0, 860.0, 930.0, 1170.0, 1338.0, 1652.0, 2186.0, 3266.0, 6363.0], [128.0, 60.0, 46.0, 41.0, 34.0, 35.0, 29.0, 41.0, 36.0, 36.0, 33.0, 43.0, 45.0, 37.0, 49.0, 35.0, 44.0, 56.0, 54.0, 57.0, 52.0, 52.0, 67.0, 59.0, 75.0, 80.0, 76.0, 101.0, 112.0, 114.0, 139.0, 157.0, 166.0, 190.0, 195.0, 240.0, 274.0, 300.0, 348.0, 385.0, 445.0, 562.0, 613.0, 802.0, 958.0, 1226.0, 1613.0, 2412.0, 4734.0], [112.0, 64.0, 39.0, 34.0, 28.0, 23.0, 23.0, 18.0, 27.0, 16.0, 21.0, 23.0, 25.0, 17.0, 23.0, 22.0, 23.0, 28.0, 18.0, 24.0, 22.0, 28.0, 30.0, 28.0, 27.0, 40.0, 44.0, 47.0, 32.0, 56.0, 52.0, 44.0, 75.0, 62.0, 74.0, 101.0, 95.0, 123.0, 166.0, 162.0, 202.0, 257.0, 328.0, 444.0, 568.0, 750.0, 1031.0, 1777.0, 3699.0], [95.0, 52.0, 33.0, 38.0, 21.0, 15.0, 17.0, 18.0, 15.0, 17.0, 16.0, 13.0, 11.0, 13.0, 19.0, 18.0, 12.0, 13.0, 9.0, 18.0, 17.0, 14.0, 21.0, 15.0, 18.0, 17.0, 18.0, 23.0, 14.0, 22.0, 24.0, 29.0, 20.0, 35.0, 25.0, 53.0, 48.0, 53.0, 51.0, 59.0, 101.0, 86.0, 128.0, 171.0, 240.0, 309.0, 569.0, 1019.0, 2492.0], [107.0, 55.0, 26.0, 28.0, 21.0, 14.0, 13.0, 12.0, 11.0, 11.0, 11.0, 21.0, 6.0, 6.0, 17.0, 12.0, 12.0, 14.0, 10.0, 11.0, 13.0, 12.0, 12.0, 12.0, 11.0, 13.0, 12.0, 19.0, 10.0, 11.0, 16.0, 19.0, 18.0, 16.0, 16.0, 15.0, 24.0, 20.0, 20.0, 35.0, 38.0, 46.0, 63.0, 69.0, 101.0, 139.0, 241.0, 452.0, 1409.0], [98.0, 47.0, 26.0, 26.0, 14.0, 15.0, 11.0, 12.0, 8.0, 8.0, 10.0, 5.0, 11.0, 14.0, 9.0, 12.0, 7.0, 10.0, 9.0, 5.0, 7.0, 10.0, 13.0, 12.0, 12.0, 11.0, 10.0, 8.0, 11.0, 7.0, 6.0, 5.0, 13.0, 10.0, 17.0, 15.0, 13.0, 19.0, 13.0, 20.0, 19.0, 29.0, 30.0, 39.0, 52.0, 63.0, 95.0, 213.0, 654.0], [65.0, 38.0, 26.0, 22.0, 16.0, 10.0, 10.0, 12.0, 5.0, 5.0, 12.0, 10.0, 8.0, 6.0, 8.0, 10.0, 5.0, 15.0, 4.0, 10.0, 7.0, 9.0, 9.0, 7.0, 11.0, 5.0, 10.0, 8.0, 10.0, 5.0, 13.0, 15.0, 7.0, 7.0, 12.0, 9.0, 9.0, 11.0, 12.0, 10.0, 11.0, 18.0, 18.0, 21.0, 28.0, 41.0, 57.0, 97.0, 316.0], [74.0, 33.0, 23.0, 19.0, 12.0, 8.0, 14.0, 7.0, 7.0, 8.0, 6.0, 8.0, 14.0, 8.0, 6.0, 6.0, 5.0, 5.0, 9.0, 4.0, 10.0, 4.0, 8.0, 10.0, 4.0, 10.0, 4.0, 7.0, 8.0, 4.0, 9.0, 12.0, 3.0, 5.0, 5.0, 8.0, 6.0, 15.0, 10.0, 9.0, 13.0, 15.0, 10.0, 22.0, 15.0, 28.0, 36.0, 61.0, 175.0], [80.0, 37.0, 24.0, 7.0, 8.0, 7.0, 8.0, 8.0, 5.0, 3.0, 7.0, 8.0, 11.0, 6.0, 0.0, 7.0, 6.0, 3.0, 8.0, 8.0, 4.0, 5.0, 8.0, 10.0, 9.0, 7.0, 4.0, 6.0, 4.0, 4.0, 9.0, 7.0, 8.0, 6.0, 3.0, 8.0, 4.0, 5.0, 7.0, 7.0, 9.0, 16.0, 5.0, 11.0, 17.0, 16.0, 23.0, 58.0, 105.0], [60.0, 20.0, 19.0, 13.0, 6.0, 8.0, 6.0, 7.0, 3.0, 7.0, 3.0, 7.0, 5.0, 8.0, 5.0, 3.0, 3.0, 6.0, 10.0, 2.0, 3.0, 6.0, 7.0, 7.0, 5.0, 4.0, 4.0, 7.0, 4.0, 5.0, 4.0, 8.0, 6.0, 3.0, 4.0, 8.0, 4.0, 6.0, 7.0, 7.0, 5.0, 6.0, 8.0, 12.0, 7.0, 12.0, 23.0, 39.0, 82.0], [84.0, 29.0, 14.0, 12.0, 4.0, 5.0, 5.0, 5.0, 1.0, 6.0, 8.0, 5.0, 3.0, 2.0, 5.0, 2.0, 4.0, 7.0, 5.0, 2.0, 2.0, 8.0, 5.0, 4.0, 5.0, 4.0, 4.0, 2.0, 2.0, 9.0, 3.0, 5.0, 4.0, 5.0, 3.0, 5.0, 1.0, 3.0, 5.0, 2.0, 8.0, 8.0, 11.0, 16.0, 5.0, 12.0, 16.0, 29.0, 58.0], [73.0, 26.0, 22.0, 8.0, 10.0, 6.0, 3.0, 2.0, 3.0, 1.0, 5.0, 7.0, 2.0, 3.0, 3.0, 3.0, 4.0, 6.0, 4.0, 2.0, 2.0, 4.0, 4.0, 3.0, 5.0, 6.0, 3.0, 1.0, 5.0, 5.0, 4.0, 6.0, 1.0, 3.0, 2.0, 5.0, 3.0, 5.0, 2.0, 3.0, 3.0, 4.0, 7.0, 8.0, 9.0, 7.0, 17.0, 21.0, 38.0], [74.0, 27.0, 21.0, 11.0, 8.0, 6.0, 8.0, 4.0, 3.0, 1.0, 3.0, 7.0, 5.0, 6.0, 2.0, 2.0, 4.0, 4.0, 1.0, 2.0, 7.0, 1.0, 4.0, 4.0, 5.0, 3.0, 5.0, 2.0, 2.0, 0.0, 1.0, 1.0, 2.0, 1.0, 2.0, 0.0, 4.0, 5.0, 4.0, 3.0, 1.0, 4.0, 4.0, 7.0, 10.0, 5.0, 10.0, 11.0, 28.0], [68.0, 32.0, 15.0, 16.0, 2.0, 5.0, 6.0, 1.0, 3.0, 6.0, 3.0, 2.0, 2.0, 3.0, 4.0, 2.0, 1.0, 3.0, 4.0, 4.0, 2.0, 2.0, 8.0, 3.0, 5.0, 2.0, 7.0, 1.0, 2.0, 3.0, 1.0, 4.0, 4.0, 1.0, 2.0, 3.0, 3.0, 2.0, 1.0, 3.0, 4.0, 3.0, 5.0, 3.0, 1.0, 6.0, 11.0, 10.0, 20.0], [74.0, 35.0, 19.0, 8.0, 5.0, 6.0, 1.0, 4.0, 1.0, 4.0, 2.0, 1.0, 1.0, 2.0, 4.0, 8.0, 4.0, 5.0, 1.0, 4.0, 5.0, 5.0, 1.0, 2.0, 5.0, 2.0, 2.0, 2.0, 4.0, 3.0, 5.0, 2.0, 0.0, 1.0, 4.0, 1.0, 3.0, 1.0, 3.0, 1.0, 2.0, 2.0, 2.0, 0.0, 4.0, 2.0, 2.0, 7.0, 23.0], [75.0, 22.0, 19.0, 7.0, 10.0, 8.0, 3.0, 7.0, 2.0, 3.0, 1.0, 4.0, 5.0, 2.0, 5.0, 6.0, 2.0, 4.0, 1.0, 2.0, 3.0, 2.0, 2.0, 3.0, 2.0, 1.0, 3.0, 3.0, 2.0, 2.0, 1.0, 1.0, 3.0, 4.0, 1.0, 1.0, 0.0, 1.0, 2.0, 0.0, 1.0, 3.0, 1.0, 3.0, 1.0, 3.0, 5.0, 5.0, 10.0], [60.0, 27.0, 11.0, 15.0, 6.0, 2.0, 7.0, 3.0, 1.0, 5.0, 3.0, 5.0, 3.0, 1.0, 4.0, 3.0, 4.0, 2.0, 2.0, 2.0, 5.0, 5.0, 1.0, 5.0, 2.0, 2.0, 2.0, 1.0, 1.0, 2.0, 5.0, 2.0, 0.0, 1.0, 2.0, 1.0, 2.0, 2.0, 1.0, 4.0, 2.0, 0.0, 1.0, 3.0, 0.0, 4.0, 2.0, 2.0, 5.0], [76.0, 27.0, 17.0, 10.0, 5.0, 2.0, 3.0, 3.0, 5.0, 3.0, 2.0, 0.0, 0.0, 6.0, 2.0, 5.0, 5.0, 3.0, 3.0, 4.0, 3.0, 5.0, 1.0, 1.0, 5.0, 2.0, 0.0, 1.0, 5.0, 1.0, 0.0, 0.0, 2.0, 4.0, 0.0, 3.0, 2.0, 0.0, 2.0, 3.0, 0.0, 3.0, 0.0, 1.0, 2.0, 1.0, 4.0, 3.0, 5.0], [65.0, 27.0, 14.0, 15.0, 7.0, 5.0, 4.0, 2.0, 3.0, 2.0, 1.0, 4.0, 1.0, 2.0, 6.0, 5.0, 4.0, 5.0, 1.0, 4.0, 1.0, 1.0, 5.0, 0.0, 2.0, 1.0, 2.0, 1.0, 1.0, 0.0, 1.0, 1.0, 3.0, 1.0, 3.0, 1.0, 1.0, 0.0, 2.0, 1.0, 0.0, 2.0, 1.0, 0.0, 2.0, 0.0, 2.0, 0.0, 9.0], [68.0, 28.0, 11.0, 6.0, 5.0, 7.0, 6.0, 3.0, 4.0, 4.0, 3.0, 3.0, 1.0, 2.0, 2.0, 3.0, 7.0, 3.0, 1.0, 4.0, 2.0, 2.0, 3.0, 2.0, 2.0, 1.0, 1.0, 3.0, 1.0, 1.0, 5.0, 0.0, 3.0, 0.0, 0.0, 0.0, 2.0, 1.0, 0.0, 0.0, 1.0, 3.0, 0.0, 1.0, 1.0, 1.0, 0.0, 2.0, 4.0], [63.0, 26.0, 17.0, 10.0, 2.0, 6.0, 1.0, 4.0, 4.0, 5.0, 2.0, 3.0, 3.0, 2.0, 3.0, 4.0, 3.0, 3.0, 1.0, 3.0, 2.0, 1.0, 2.0, 3.0, 2.0, 1.0, 2.0, 3.0, 2.0, 0.0, 1.0, 1.0, 1.0, 1.0, 0.0, 1.0, 3.0, 1.0, 0.0, 1.0, 1.0, 1.0, 1.0, 2.0, 1.0, 2.0, 3.0, 1.0, 1.0], [63.0, 23.0, 11.0, 8.0, 8.0, 7.0, 8.0, 0.0, 3.0, 2.0, 1.0, 4.0, 3.0, 5.0, 2.0, 2.0, 2.0, 3.0, 5.0, 2.0, 2.0, 6.0, 1.0, 5.0, 1.0, 0.0, 2.0, 1.0, 3.0, 1.0, 1.0, 0.0, 2.0, 1.0, 1.0, 1.0, 1.0, 1.0, 1.0, 2.0, 0.0, 0.0, 2.0, 1.0, 1.0, 2.0, 3.0, 1.0, 0.0], [70.0, 21.0, 18.0, 5.0, 5.0, 8.0, 5.0, 4.0, 2.0, 2.0, 2.0, 4.0, 6.0, 2.0, 1.0, 3.0, 4.0, 2.0, 3.0, 2.0, 4.0, 2.0, 2.0, 3.0, 3.0, 3.0, 0.0, 1.0, 2.0, 3.0, 0.0, 1.0, 0.0, 1.0, 1.0, 0.0, 2.0, 1.0, 1.0, 1.0, 2.0, 1.0, 1.0, 1.0, 1.0, 0.0, 0.0, 1.0, 4.0], [74.0, 21.0, 12.0, 12.0, 6.0, 4.0, 0.0, 4.0, 2.0, 2.0, 3.0, 3.0, 4.0, 2.0, 4.0, 2.0, 3.0, 3.0, 1.0, 3.0, 5.0, 0.0, 3.0, 3.0, 2.0, 3.0, 2.0, 1.0, 1.0, 2.0, 2.0, 0.0, 1.0, 3.0, 2.0, 1.0, 0.0, 2.0, 2.0, 0.0, 0.0, 1.0, 1.0, 1.0, 1.0, 1.0, 0.0, 0.0, 3.0], [72.0, 25.0, 10.0, 6.0, 6.0, 6.0, 2.0, 3.0, 2.0, 4.0, 3.0, 3.0, 2.0, 3.0, 5.0, 7.0, 1.0, 2.0, 1.0, 5.0, 2.0, 3.0, 2.0, 3.0, 1.0, 0.0, 1.0, 1.0, 2.0, 2.0, 2.0, 1.0, 2.0, 2.0, 1.0, 0.0, 0.0, 2.0, 1.0, 1.0, 0.0, 1.0, 2.0, 2.0, 0.0, 0.0, 1.0, 1.0, 1.0], [66.0, 29.0, 19.0, 8.0, 11.0, 6.0, 3.0, 2.0, 2.0, 6.0, 0.0, 3.0, 3.0, 3.0, 6.0, 2.0, 2.0, 1.0, 5.0, 3.0, 1.0, 2.0, 1.0, 3.0, 4.0, 0.0, 5.0, 1.0, 2.0, 1.0, 2.0, 0.0, 3.0, 1.0, 1.0, 0.0, 0.0, 1.0, 1.0, 1.0, 1.0, 1.0, 0.0, 0.0, 0.0, 2.0, 0.0, 1.0, 2.0], [67.0, 32.0, 16.0, 13.0, 10.0, 4.0, 5.0, 0.0, 2.0, 4.0, 4.0, 2.0, 3.0, 0.0, 2.0, 4.0, 2.0, 3.0, 3.0, 4.0, 2.0, 3.0, 1.0, 2.0, 3.0, 0.0, 1.0, 2.0, 4.0, 2.0, 0.0, 1.0, 2.0, 2.0, 1.0, 2.0, 0.0, 1.0, 1.0, 0.0, 1.0, 0.0, 1.0, 1.0, 0.0, 1.0, 2.0, 0.0, 1.0], [73.0, 27.0, 15.0, 8.0, 5.0, 4.0, 6.0, 8.0, 3.0, 2.0, 3.0, 2.0, 2.0, 3.0, 4.0, 4.0, 3.0, 1.0, 3.0, 2.0, 3.0, 2.0, 2.0, 3.0, 4.0, 1.0, 2.0, 1.0, 1.0, 1.0, 0.0, 0.0, 0.0, 2.0, 1.0, 1.0, 3.0, 0.0, 2.0, 0.0, 1.0, 1.0, 0.0, 0.0, 0.0, 2.0, 0.0, 0.0, 1.0], [58.0, 24.0, 13.0, 12.0, 3.0, 11.0, 6.0, 1.0, 4.0, 5.0, 0.0, 3.0, 5.0, 6.0, 4.0, 4.0, 3.0, 1.0, 3.0, 2.0, 2.0, 4.0, 3.0, 1.0, 1.0, 1.0, 1.0, 0.0, 1.0, 0.0, 1.0, 0.0, 0.0, 0.0, 2.0, 1.0, 2.0, 0.0, 1.0, 2.0, 1.0, 1.0, 1.0, 1.0, 2.0, 0.0, 1.0, 1.0, 1.0], [56.0, 24.0, 13.0, 10.0, 7.0, 6.0, 7.0, 5.0, 4.0, 5.0, 3.0, 2.0, 2.0, 2.0, 3.0, 6.0, 2.0, 2.0, 0.0, 2.0, 2.0, 2.0, 2.0, 2.0, 1.0, 4.0, 1.0, 4.0, 1.0, 1.0, 2.0, 0.0, 1.0, 2.0, 2.0, 1.0, 1.0, 1.0, 0.0, 1.0, 1.0, 0.0, 0.0, 3.0, 0.0, 0.0, 0.0, 1.0, 4.0], [70.0, 32.0, 13.0, 11.0, 8.0, 2.0, 2.0, 5.0, 2.0, 4.0, 1.0, 3.0, 6.0, 3.0, 5.0, 4.0, 3.0, 2.0, 4.0, 2.0, 2.0, 2.0, 1.0, 2.0, 0.0, 0.0, 3.0, 2.0, 2.0, 1.0, 1.0, 1.0, 0.0, 2.0, 2.0, 0.0, 2.0, 1.0, 1.0, 1.0, 1.0, 0.0, 0.0, 1.0, 0.0, 0.0, 0.0, 1.0, 2.0], [64.0, 21.0, 17.0, 11.0, 14.0, 7.0, 5.0, 3.0, 3.0, 2.0, 3.0, 4.0, 3.0, 0.0, 7.0, 1.0, 2.0, 1.0, 1.0, 2.0, 5.0, 4.0, 2.0, 1.0, 3.0, 6.0, 1.0, 2.0, 1.0, 1.0, 2.0, 1.0, 1.0, 1.0, 1.0, 0.0, 0.0, 1.0, 0.0, 0.0, 0.0, 0.0, 0.0, 0.0, 1.0, 0.0, 1.0, 4.0, 0.0], [75.0, 26.0, 13.0, 8.0, 5.0, 7.0, 4.0, 1.0, 6.0, 5.0, 5.0, 1.0, 1.0, 3.0, 4.0, 4.0, 3.0, 3.0, 1.0, 1.0, 0.0, 4.0, 2.0, 1.0, 3.0, 1.0, 3.0, 1.0, 0.0, 4.0, 1.0, 0.0, 2.0, 0.0, 0.0, 0.0, 0.0, 1.0, 1.0, 1.0, 1.0, 2.0, 2.0, 2.0, 0.0, 1.0, 1.0, 0.0, 1.0], [83.0, 21.0, 15.0, 10.0, 8.0, 3.0, 2.0, 2.0, 4.0, 3.0, 1.0, 2.0, 2.0, 3.0, 2.0, 2.0, 3.0, 6.0, 2.0, 3.0, 5.0, 1.0, 2.0, 1.0, 3.0, 3.0, 1.0, 0.0, 3.0, 2.0, 1.0, 0.0, 1.0, 0.0, 3.0, 1.0, 2.0, 0.0, 0.0, 1.0, 1.0, 1.0, 2.0, 0.0, 0.0, 0.0, 0.0, 2.0, 1.0], [70.0, 22.0, 22.0, 16.0, 5.0, 9.0, 1.0, 3.0, 2.0, 2.0, 3.0, 0.0, 2.0, 5.0, 5.0, 3.0, 2.0, 3.0, 4.0, 2.0, 2.0, 5.0, 2.0, 5.0, 1.0, 2.0, 0.0, 0.0, 4.0, 1.0, 1.0, 0.0, 0.0, 0.0, 0.0, 0.0, 1.0, 0.0, 1.0, 1.0, 0.0, 1.0, 1.0, 0.0, 0.0, 2.0, 2.0, 1.0, 1.0], [72.0, 32.0, 20.0, 7.0, 13.0, 5.0, 4.0, 4.0, 1.0, 0.0, 1.0, 4.0, 2.0, 3.0, 5.0, 4.0, 3.0, 3.0, 4.0, 4.0, 5.0, 4.0, 2.0, 0.0, 1.0, 1.0, 1.0, 1.0, 2.0, 2.0, 0.0, 2.0, 0.0, 1.0, 1.0, 3.0, 0.0, 0.0, 1.0, 1.0, 0.0, 3.0, 0.0, 0.0, 0.0, 0.0, 1.0, 1.0, 0.0], [67.0, 25.0, 17.0, 11.0, 10.0, 5.0, 2.0, 3.0, 4.0, 2.0, 1.0, 2.0, 4.0, 5.0, 6.0, 6.0, 2.0, 2.0, 3.0, 1.0, 5.0, 3.0, 4.0, 1.0, 2.0, 0.0, 1.0, 3.0, 2.0, 0.0, 1.0, 3.0, 0.0, 1.0, 3.0, 0.0, 0.0, 0.0, 0.0, 1.0, 1.0, 1.0, 1.0, 0.0, 1.0, 0.0, 0.0, 1.0, 1.0], [73.0, 20.0, 21.0, 11.0, 4.0, 8.0, 3.0, 7.0, 4.0, 3.0, 5.0, 2.0, 0.0, 0.0, 4.0, 8.0, 3.0, 1.0, 3.0, 4.0, 5.0, 1.0, 1.0, 0.0, 1.0, 1.0, 2.0, 1.0, 1.0, 1.0, 2.0, 0.0, 0.0, 1.0, 2.0, 2.0, 1.0, 2.0, 1.0, 2.0, 0.0, 1.0, 1.0, 0.0, 0.0, 0.0, 1.0, 2.0, 0.0], [82.0, 23.0, 16.0, 8.0, 7.0, 6.0, 4.0, 4.0, 5.0, 3.0, 4.0, 1.0, 2.0, 2.0, 2.0, 6.0, 2.0, 4.0, 5.0, 5.0, 3.0, 0.0, 0.0, 3.0, 0.0, 5.0, 1.0, 0.0, 2.0, 3.0, 1.0, 1.0, 0.0, 1.0, 0.0, 0.0, 0.0, 1.0, 0.0, 1.0, 2.0, 2.0, 0.0, 0.0, 1.0, 2.0, 1.0, 1.0, 2.0], [60.0, 29.0, 8.0, 15.0, 10.0, 5.0, 3.0, 2.0, 5.0, 2.0, 3.0, 0.0, 2.0, 3.0, 3.0, 5.0, 3.0, 2.0, 6.0, 1.0, 2.0, 3.0, 1.0, 2.0, 3.0, 4.0, 2.0, 1.0, 1.0, 2.0, 1.0, 2.0, 1.0, 0.0, 2.0, 2.0, 1.0, 0.0, 1.0, 1.0, 1.0, 0.0, 1.0, 0.0, 2.0, 0.0, 0.0, 1.0, 2.0]],
    "Name": "sCurve-0",
    "Overflow": 2033247.0,
    "Type": "Histo2d",
    "Underflow": 0.0,
    "x": {
        "AxisTitle": "Vcal",
        "Bins": 51,
        "High": 302.5,
        "Low": 47.5
    },
    "y": {
        "AxisTitle": "Occupancy",
        "Bins": 49,
        "High": 49.5,
        "Low": 0.5
    },
    "z": {
        "AxisTitle": "Number of pixels"
    }
}