time,Hardware,Voltage,Current
1623306147906,high-voltage,1,0.0610991
time,Hardware,Voltage,Current
1623306147906,high-voltage,2,0.0788975
time,Hardware,Voltage,Current
1623306147906,high-voltage,3,0.0948678
time,Hardware,Voltage,Current
1623306147906,high-voltage,4,0.107443
time,Hardware,Voltage,Current
1623306147906,high-voltage,5,0.119957
time,Hardware,Voltage,Current
1623306147906,high-voltage,1.30517e-07,0.130251
time,Hardware,Voltage,Current
1623306147906,high-voltage,7,0.142169
time,Hardware,Voltage,Current
1623306147906,high-voltage,8,0.15091
time,Hardware,Voltage,Current
1623306147906,high-voltage,9,0.160611
time,Hardware,Voltage,Current
1623306147906,high-voltage,10,0.169809
time,Hardware,Voltage,Current
1623306147906,high-voltage,11,0.177363
time,Hardware,Voltage,Current
1623306147906,high-voltage,12,0.182638
time,Hardware,Voltage,Current
1623306147906,high-voltage,13,0.189826
time,Hardware,Voltage,Current
1623306147906,high-voltage,14,0.194772
time,Hardware,Voltage,Current
1623306147906,high-voltage,15,0.199423
time,Hardware,Voltage,Current
1623306147906,high-voltage,16,0.205004
time,Hardware,Voltage,Current
1623306147906,high-voltage,17,0.208833
time,Hardware,Voltage,Current
1623306147906,high-voltage,18,0.21381
time,Hardware,Voltage,Current
1623306147906,high-voltage,19,0.218632
time,Hardware,Voltage,Current
1623306147906,high-voltage,2.22204e-07,0.223103
time,Hardware,Voltage,Current
1623306147906,high-voltage,25,0.243916
time,Hardware,Voltage,Current
1623306147906,high-voltage,30,0.2804
time,Hardware,Voltage,Current
1623306147906,high-voltage,35,0.39735
time,Hardware,Voltage,Current
1623306147906,high-voltage,7.30701e-07,0.730886
time,Hardware,Voltage,Current
1623306147906,high-voltage,45,1.2866
time,Hardware,Voltage,Current
1623306147906,high-voltage,2.00174e-06,2.00287
time,Hardware,Voltage,Current
1623306147906,high-voltage,55,2.86602
