{
    "Data": [300.0, 1356.0, 275.0, 77.0, 148.0, 157.0, 121.0, 137.0, 116.0, 167.0, 340.0, 816.0, 1614.0, 2786.0, 3913.0, 4575.0, 4556.0, 3848.0, 3238.0, 3209.0, 3722.0, 4241.0, 4543.0, 4114.0, 3375.0, 2382.0, 1582.0, 914.0, 578.0, 422.0, 357.0, 293.0, 308.0, 277.0, 267.0, 234.0, 273.0, 256.0, 241.0, 229.0, 263.0, 213.0, 209.0, 213.0, 219.0, 229.0, 212.0, 214.0, 203.0, 199.0, 211.0, 169.0, 183.0, 176.0, 151.0, 147.0, 148.0, 155.0, 152.0, 137.0, 110.0, 130.0, 112.0, 119.0, 126.0, 100.0, 125.0, 96.0, 85.0, 93.0, 83.0, 94.0, 85.0, 74.0, 72.0, 93.0, 76.0, 70.0, 61.0, 77.0, 67.0, 63.0, 71.0, 67.0, 61.0, 62.0, 61.0, 65.0, 46.0, 60.0, 59.0, 54.0, 51.0, 56.0, 51.0, 49.0, 54.0, 58.0, 58.0, 55.0, 50.0, 49.0, 45.0, 45.0, 59.0, 40.0, 48.0, 38.0, 44.0, 53.0, 47.0, 46.0, 43.0, 53.0, 43.0, 49.0, 38.0, 45.0, 44.0, 34.0, 51.0, 44.0, 37.0, 42.0, 33.0, 37.0, 53.0, 42.0, 42.0, 43.0, 29.0, 39.0, 28.0, 38.0, 37.0, 41.0, 30.0, 22.0, 36.0, 37.0, 43.0, 29.0, 33.0, 46.0, 35.0, 29.0, 38.0, 24.0, 26.0, 28.0, 31.0, 25.0, 34.0, 18.0, 29.0, 24.0, 25.0, 12.0, 27.0, 21.0, 25.0, 30.0, 24.0, 20.0, 22.0, 26.0, 28.0, 26.0, 24.0, 20.0, 25.0, 22.0, 19.0, 19.0],
    "Name": "NoiseDist-0",
    "Overflow": 591.0,
    "Type": "Histo1d",
    "Underflow": 0.0,
    "x": {
        "AxisTitle": "Noise [e]",
        "Bins": 174,
        "High": 871.0,
        "Low": -2.0
    },
    "y": {
        "AxisTitle": "Number of Pixels"
    },
    "z": {
        "AxisTitle": "z"
    }
}