{
    "Data": [0.0, 0.0, 0.0, 0.0, 0.0, 0.0, 0.0, 0.0, 0.0, 0.0, 0.0, 0.0, 0.0, 0.0, 0.0, 0.0, 0.0, 0.0, 0.0, 0.0, 0.0, 0.0, 0.0, 0.0, 0.0, 0.0, 0.0, 0.0, 0.0, 0.0, 0.0, 0.0, 0.0, 0.0, 0.0, 0.0, 0.0, 0.0, 0.0, 0.0, 0.0, 0.0, 0.0, 0.0, 0.0, 0.0, 0.0, 0.0, 0.0, 0.0, 18.0, 36.0, 51.0, 55.0, 43.0, 76.0, 103.0, 93.0, 126.0, 123.0, 141.0, 141.0, 189.0, 227.0, 221.0, 243.0, 291.0, 295.0, 314.0, 395.0, 421.0, 439.0, 479.0, 570.0, 584.0, 614.0, 687.0, 692.0, 716.0, 769.0, 781.0, 796.0, 954.0, 1000.0, 1239.0, 1385.0, 1621.0, 1923.0, 2209.0, 2588.0, 2808.0, 2975.0, 2876.0, 2901.0, 2647.0, 2383.0, 1996.0, 1728.0, 1373.0, 1064.0, 837.0, 712.0, 565.0, 483.0, 356.0, 283.0, 317.0, 233.0, 216.0, 163.0, 141.0, 139.0, 115.0, 83.0, 87.0, 68.0, 57.0, 42.0, 46.0, 40.0, 39.0, 33.0, 30.0, 29.0, 28.0, 23.0, 18.0, 17.0, 10.0, 14.0, 11.0, 11.0, 13.0, 12.0, 15.0, 13.0, 11.0, 15.0, 14.0, 10.0, 4.0, 6.0, 3.0, 7.0, 8.0, 4.0, 4.0, 8.0, 6.0, 4.0, 2.0, 6.0, 7.0, 3.0, 7.0, 3.0, 4.0, 5.0, 7.0, 12.0, 14.0, 11.0, 19.0, 22.0, 23.0, 28.0, 39.0, 61.0, 52.0, 82.0, 97.0, 118.0, 103.0, 130.0, 173.0, 205.0, 243.0, 251.0, 272.0, 323.0, 379.0, 396.0, 399.0, 447.0, 514.0, 561.0, 570.0, 617.0, 623.0, 713.0, 668.0, 752.0, 790.0, 791.0, 807.0, 811.0, 818.0, 787.0, 818.0, 767.0, 742.0, 756.0, 731.0, 702.0, 597.0, 632.0, 590.0, 512.0, 462.0, 481.0, 386.0, 352.0, 308.0, 289.0, 220.0, 224.0, 188.0, 181.0, 153.0, 119.0, 110.0, 95.0, 65.0, 55.0, 54.0, 40.0, 35.0, 32.0, 19.0, 16.0, 11.0, 10.0, 10.0, 8.0, 5.0, 3.0, 3.0, 4.0, 1.0, 2.0, 0.0, 1.0, 1.0, 2.0, 0.0, 0.0, 0.0, 0.0, 0.0, 1.0, 0.0, 0.0, 0.0, 1.0, 0.0, 0.0, 0.0, 0.0, 0.0, 0.0, 0.0, 0.0, 0.0, 0.0, 0.0, 0.0, 0.0, 0.0, 0.0, 0.0, 0.0, 0.0, 0.0, 0.0, 0.0, 0.0, 0.0, 0.0, 0.0, 0.0, 0.0, 0.0, 0.0, 0.0, 0.0, 0.0, 0.0, 0.0, 0.0, 0.0, 0.0, 0.0, 0.0, 0.0, 0.0, 0.0, 0.0, 0.0, 0.0, 0.0, 0.0, 0.0, 0.0, 0.0, 0.0, 0.0, 0.0, 0.0, 0.0, 0.0, 0.0, 0.0, 0.0, 0.0, 0.0, 0.0, 0.0, 0.0, 0.0, 0.0, 0.0, 0.0, 0.0, 0.0, 0.0, 0.0, 0.0, 0.0, 0.0, 0.0, 0.0, 0.0, 0.0, 0.0, 0.0, 0.0, 0.0, 0.0, 0.0, 0.0, 0.0, 0.0, 0.0, 0.0, 0.0, 0.0, 0.0, 0.0, 0.0, 0.0, 0.0, 0.0, 0.0, 0.0, 0.0, 0.0, 0.0, 0.0, 0.0, 0.0, 0.0, 0.0, 0.0, 0.0, 0.0, 0.0, 0.0, 0.0, 0.0, 0.0, 0.0, 0.0, 0.0, 0.0, 0.0, 0.0, 0.0, 0.0, 0.0],
    "Name": "ThresholdDist-0",
    "Overflow": 0.0,
    "Type": "Histo1d",
    "Underflow": 0.0,
    "x": {
        "AxisTitle": "Threshold [e]",
        "Bins": 379,
        "High": 3785.0,
        "Low": -5.0
    },
    "y": {
        "AxisTitle": "Number of Pixels"
    },
    "z": {
        "AxisTitle": "z"
    }
}