{
    "Data": [3.0, 1.0, 0.0, 0.0, 0.0, 1.0, 3.0, 20.0, 54.0, 140.0, 374.0, 1068.0, 2006.0, 3296.0, 4398.0, 4531.0, 4049.0, 2803.0, 1825.0, 1479.0, 1434.0, 2108.0, 2709.0, 3469.0, 3685.0, 3556.0, 3004.0, 2029.0, 1368.0, 854.0, 542.0, 349.0, 291.0, 285.0, 290.0, 362.0, 462.0, 529.0, 723.0, 902.0, 963.0, 1089.0, 1146.0, 1230.0, 1213.0, 1266.0, 1164.0, 1065.0, 931.0, 887.0, 730.0, 627.0, 519.0, 458.0, 365.0, 324.0, 278.0, 245.0, 207.0, 165.0, 189.0, 195.0, 186.0, 160.0, 210.0, 177.0, 188.0, 200.0, 209.0, 222.0, 215.0, 223.0, 220.0, 214.0, 234.0, 198.0, 211.0, 194.0, 212.0, 203.0, 185.0, 165.0, 144.0, 140.0, 146.0, 137.0, 86.0, 96.0, 96.0, 90.0, 79.0, 89.0, 80.0, 60.0, 61.0, 48.0, 44.0, 54.0, 41.0, 37.0, 35.0, 25.0, 31.0, 28.0, 24.0, 26.0, 21.0, 22.0, 18.0, 27.0, 25.0, 22.0, 16.0, 19.0, 14.0, 19.0, 13.0, 12.0, 7.0, 15.0, 11.0, 9.0, 12.0, 15.0, 10.0, 7.0, 7.0, 7.0, 4.0, 11.0, 11.0, 8.0],
    "Name": "NoiseDist-0",
    "Overflow": 156.0,
    "Type": "Histo1d",
    "Underflow": 0.0,
    "x": {
        "AxisTitle": "Noise [e]",
        "Bins": 132,
        "High": 661.0,
        "Low": -2.0
    },
    "y": {
        "AxisTitle": "Number of Pixels"
    },
    "z": {
        "AxisTitle": "z"
    }
}