time,Hardware,Voltage,Current
1626730172815,high-voltage,1,0.0539594
time,Hardware,Voltage,Current
1626730172815,high-voltage,2,0.0762305
time,Hardware,Voltage,Current
1626730172815,high-voltage,3,0.0894019
time,Hardware,Voltage,Current
1626730172815,high-voltage,4,0.101421
time,Hardware,Voltage,Current
1626730172815,high-voltage,5,0.111599
time,Hardware,Voltage,Current
1626730172815,high-voltage,6,0.122279
time,Hardware,Voltage,Current
1626730172815,high-voltage,7,0.135332
time,Hardware,Voltage,Current
1626730172815,high-voltage,8,0.147774
time,Hardware,Voltage,Current
1626730172815,high-voltage,9,0.161806
time,Hardware,Voltage,Current
1626730172815,high-voltage,10,0.177729
time,Hardware,Voltage,Current
1626730172815,high-voltage,11,0.191351
time,Hardware,Voltage,Current
1626730172815,high-voltage,12,0.203646
time,Hardware,Voltage,Current
1626730172815,high-voltage,13,0.214051
time,Hardware,Voltage,Current
1626730172815,high-voltage,14,0.224471
time,Hardware,Voltage,Current
1626730172815,high-voltage,15,0.233076
time,Hardware,Voltage,Current
1626730172815,high-voltage,16,0.24114
time,Hardware,Voltage,Current
1626730172815,high-voltage,17,0.247705
time,Hardware,Voltage,Current
1626730172815,high-voltage,18,0.254536
time,Hardware,Voltage,Current
1626730172815,high-voltage,19,0.26044
time,Hardware,Voltage,Current
1626730172815,high-voltage,20,0.266863
time,Hardware,Voltage,Current
1626730172815,high-voltage,25,0.298491
time,Hardware,Voltage,Current
1626730172815,high-voltage,30,0.336029
time,Hardware,Voltage,Current
1626730172815,high-voltage,35,0.409077
time,Hardware,Voltage,Current
1626730172815,high-voltage,40,0.587386
time,Hardware,Voltage,Current
1626730172815,high-voltage,45,0.945336
time,Hardware,Voltage,Current
1626730172815,high-voltage,50,1.57403
time,Hardware,Voltage,Current
1626730172815,high-voltage,55,2.60604
time,Hardware,Voltage,Current
1626730172815,high-voltage,60,4.15342
time,Hardware,Voltage,Current
1626730172815,high-voltage,65,6.29477
time,Hardware,Voltage,Current
1626730172815,high-voltage,70,9.02899
time,Hardware,Voltage,Current
1626730172815,high-voltage,75,10
