{
    "Data": [0.0, 0.0, 0.0, 0.0, 0.0, 0.0, 0.0, 0.0, 0.0, 0.0, 0.0, 0.0, 0.0, 0.0, 1.0, 0.0, 0.0, 28.0, 126.0, 38.0, 81.0, 844.0, 1985.0, 636.0, 481.0, 1464.0, 2532.0, 1247.0, 726.0, 1185.0, 1580.0, 1071.0, 534.0, 582.0, 683.0, 594.0, 432.0, 557.0, 887.0, 835.0, 579.0, 879.0, 1933.0, 3136.0, 2102.0, 1390.0, 2279.0, 3357.0, 3909.0, 2875.0, 2280.0, 2490.0, 3077.0, 2599.0, 1951.0, 1751.0, 1682.0, 2010.0, 1552.0, 1348.0, 1176.0, 1060.0, 992.0, 733.0, 673.0, 601.0, 623.0, 517.0, 402.0, 415.0, 388.0, 358.0, 298.0, 262.0, 228.0, 237.0, 207.0, 169.0, 159.0, 170.0, 142.0, 114.0, 100.0, 89.0, 107.0, 97.0, 73.0, 78.0, 55.0, 62.0, 61.0, 55.0, 46.0, 48.0, 37.0, 40.0, 27.0, 37.0, 29.0, 29.0, 23.0, 20.0, 12.0, 20.0, 21.0, 23.0, 13.0, 14.0, 11.0, 10.0, 11.0, 10.0, 13.0, 5.0, 10.0, 8.0, 4.0, 6.0, 8.0, 6.0, 8.0, 7.0, 8.0, 3.0, 7.0, 5.0, 4.0, 3.0, 7.0, 3.0, 9.0, 4.0, 7.0, 9.0, 8.0, 5.0, 2.0, 4.0, 3.0, 1.0, 4.0, 2.0, 2.0, 1.0, 5.0, 4.0, 4.0, 1.0, 4.0, 3.0, 3.0, 3.0, 2.0, 3.0, 1.0, 2.0, 1.0, 1.0, 4.0, 2.0, 1.0, 2.0, 0.0, 4.0, 0.0, 2.0, 0.0, 1.0, 4.0, 0.0, 0.0, 2.0, 0.0, 2.0, 0.0, 2.0, 1.0, 0.0, 0.0, 3.0, 1.0, 0.0, 1.0, 1.0, 1.0, 2.0, 1.0, 0.0, 2.0, 1.0, 0.0, 0.0, 0.0, 1.0, 1.0, 1.0, 0.0, 1.0, 0.0, 0.0, 0.0],
    "Name": "TimePerFitDist-0",
    "Overflow": 163.0,
    "Type": "Histo1d",
    "Underflow": 0.0,
    "x": {
        "AxisTitle": "Fit Time [us]",
        "Bins": 201,
        "High": 401.0,
        "Low": -1.0
    },
    "y": {
        "AxisTitle": "Number of Pixels"
    },
    "z": {
        "AxisTitle": "z"
    }
}