{
    "Data": [172.0, 9929.0, 18681.0, 13176.0, 6228.0, 2264.0, 716.0, 224.0, 96.0, 58.0, 49.0, 33.0, 31.0, 14.0, 12.0, 7.0, 5.0, 3.0, 5.0, 2.0, 17.0, 7.0, 21.0, 6.0, 30.0, 8.0, 6.0, 2.0, 4.0, 1.0, 1.0, 0.0, 0.0, 1.0, 1.0, 0.0, 1.0, 0.0, 1.0, 0.0, 0.0, 0.0, 0.0, 0.0, 1.0, 0.0, 0.0, 0.0, 0.0, 0.0, 0.0],
    "Name": "Chi2Dist-0",
    "Overflow": 0.0,
    "Type": "Histo1d",
    "Underflow": 0.0,
    "x": {
        "AxisTitle": "Fit Chi/ndf",
        "Bins": 51,
        "High": 2.5250000953674318,
        "Low": -0.02500000037252903
    },
    "y": {
        "AxisTitle": "Number of Pixels"
    },
    "z": {
        "AxisTitle": "z"
    }
}