time,Hardware,Voltage,Current
1622009740098,high-voltage-3,1,0.0593976
time,Hardware,Voltage,Current
1622009740098,high-voltage-3,2,0.064133
time,Hardware,Voltage,Current
1622009740098,high-voltage-3,3,0.0692046
time,Hardware,Voltage,Current
1622009740098,high-voltage-3,4,0.0745549
time,Hardware,Voltage,Current
1622009740098,high-voltage-3,5,5e+06
time,Hardware,Voltage,Current
1622009740098,high-voltage-3,6,0.082483
time,Hardware,Voltage,Current
1622009740098,high-voltage-3,7,0.0872759
time,Hardware,Voltage,Current
1622009740098,high-voltage-3,8,0.0928474
time,Hardware,Voltage,Current
1622009740098,high-voltage-3,9,0.0993198
time,Hardware,Voltage,Current
1622009740098,high-voltage-3,10,0.104641
time,Hardware,Voltage,Current
1622009740098,high-voltage-3,11,0.110364
time,Hardware,Voltage,Current
1622009740098,high-voltage-3,12,0.116306
time,Hardware,Voltage,Current
1622009740098,high-voltage-3,13,0.122222
time,Hardware,Voltage,Current
1622009740098,high-voltage-3,14,0.12711
time,Hardware,Voltage,Current
1622009740098,high-voltage-3,15,0.130853
time,Hardware,Voltage,Current
1622009740098,high-voltage-3,16,0.13578
time,Hardware,Voltage,Current
1622009740098,high-voltage-3,17,0.139448
time,Hardware,Voltage,Current
1622009740098,high-voltage-3,18,0.143895
time,Hardware,Voltage,Current
1622009740098,high-voltage-3,19,0.148346
time,Hardware,Voltage,Current
1622009740098,high-voltage-3,20,0.151524
time,Hardware,Voltage,Current
1622009740098,high-voltage-3,25,0.169042
time,Hardware,Voltage,Current
1622009740098,high-voltage-3,30,0.185505
time,Hardware,Voltage,Current
1622009740098,high-voltage-3,35,0.198532
time,Hardware,Voltage,Current
1622009740098,high-voltage-3,40,0.210785
time,Hardware,Voltage,Current
1622009740098,high-voltage-3,45,0.22346
time,Hardware,Voltage,Current
1622009740098,high-voltage-3,50,0.233367
time,Hardware,Voltage,Current
1622009740098,high-voltage-3,55,0.244007
time,Hardware,Voltage,Current
1622009740098,high-voltage-3,60,0.252983
time,Hardware,Voltage,Current
1622009740098,high-voltage-3,65,0.261802
time,Hardware,Voltage,Current
1622009740098,high-voltage-3,2.69929e-07,0.26914
time,Hardware,Voltage,Current
1622009740098,high-voltage-3,75,0.279162
time,Hardware,Voltage,Current
1622009740098,high-voltage-3,80,0.289626
time,Hardware,Voltage,Current
1622009740098,high-voltage-3,85,0.297524
time,Hardware,Voltage,Current
1622009740098,high-voltage-3,90,0.307907
time,Hardware,Voltage,Current
1622009740098,high-voltage-3,3.1857e-07,0.318311
time,Hardware,Voltage,Current
1622009740098,high-voltage-3,100,0.328326
