{
    "Data": [0.0, 0.0, 0.0, 0.0, 0.0, 0.0, 0.0, 0.0, 0.0, 0.0, 0.0, 0.0, 0.0, 0.0, 2.0, 1.0, 0.0, 0.0, 0.0, 2.0, 0.0, 1.0, 3.0, 1.0, 0.0, 1.0, 7.0, 3.0, 10.0, 4.0, 18.0, 23.0, 9.0, 8.0, 30.0, 36.0, 42.0, 196.0, 450.0, 428.0, 343.0, 614.0, 1467.0, 2899.0, 2166.0, 1424.0, 1912.0, 3065.0, 3750.0, 2856.0, 2347.0, 2106.0, 2730.0, 2112.0, 1813.0, 1476.0, 1455.0, 1625.0, 1481.0, 1330.0, 1088.0, 1061.0, 890.0, 698.0, 580.0, 534.0, 573.0, 508.0, 404.0, 375.0, 384.0, 354.0, 293.0, 278.0, 260.0, 234.0, 213.0, 191.0, 187.0, 149.0, 157.0, 143.0, 118.0, 110.0, 98.0, 93.0, 93.0, 97.0, 102.0, 72.0, 60.0, 59.0, 53.0, 65.0, 64.0, 44.0, 56.0, 42.0, 41.0, 30.0, 38.0, 23.0, 23.0, 28.0, 29.0, 25.0, 30.0, 24.0, 35.0, 24.0, 23.0, 15.0, 11.0, 16.0, 8.0, 14.0, 14.0, 15.0, 13.0, 10.0, 14.0, 14.0, 9.0, 9.0, 4.0, 12.0, 7.0, 10.0, 5.0, 6.0, 4.0, 6.0, 9.0, 9.0, 4.0, 6.0, 2.0, 9.0, 5.0, 7.0, 2.0, 3.0, 3.0, 4.0, 3.0, 2.0, 0.0, 2.0, 2.0, 1.0, 5.0, 1.0, 4.0, 2.0, 5.0, 2.0, 3.0, 3.0, 2.0, 2.0, 3.0, 2.0, 2.0, 5.0, 1.0, 2.0, 2.0, 1.0, 2.0, 2.0, 2.0, 4.0, 4.0, 2.0, 2.0, 1.0, 4.0, 3.0, 1.0, 1.0, 2.0, 1.0, 1.0, 1.0, 1.0, 3.0, 3.0, 5.0, 1.0, 1.0, 4.0, 3.0, 3.0, 3.0, 3.0, 8.0, 3.0, 3.0, 4.0, 2.0, 2.0],
    "Name": "TimePerFitDist-0",
    "Overflow": 189.0,
    "Type": "Histo1d",
    "Underflow": 0.0,
    "x": {
        "AxisTitle": "Fit Time [us]",
        "Bins": 201,
        "High": 401.0,
        "Low": -1.0
    },
    "y": {
        "AxisTitle": "Number of Pixels"
    },
    "z": {
        "AxisTitle": "z"
    }
}