{
    "Data": [38.0, 80.0, 2.0, 1.0, 7.0, 79.0, 578.0, 1732.0, 3406.0, 4686.0, 4848.0, 3949.0, 3173.0, 2638.0, 2561.0, 2899.0, 3308.0, 3672.0, 3626.0, 3299.0, 2595.0, 1828.0, 1172.0, 732.0, 559.0, 596.0, 775.0, 985.0, 1294.0, 1667.0, 1923.0, 2176.0, 2206.0, 2302.0, 2076.0, 1918.0, 1634.0, 1353.0, 1004.0, 693.0, 558.0, 397.0, 262.0, 185.0, 104.0, 78.0, 60.0, 48.0, 33.0, 25.0, 21.0, 12.0, 13.0, 7.0, 4.0, 11.0, 3.0, 3.0, 3.0, 2.0, 5.0, 1.0, 4.0, 1.0, 2.0, 1.0, 2.0, 1.0, 3.0, 1.0, 1.0],
    "Name": "NoiseDist-0",
    "Overflow": 15.0,
    "Type": "Histo1d",
    "Underflow": 0.0,
    "x": {
        "AxisTitle": "Noise [e]",
        "Bins": 71,
        "High": 356.0,
        "Low": -2.0
    },
    "y": {
        "AxisTitle": "Number of Pixels"
    },
    "z": {
        "AxisTitle": "z"
    }
}