{
    "Data": [3393.0, 23250.0, 17046.0, 6115.0, 2580.0, 2186.0, 2886.0, 3574.0, 3737.0, 3377.0, 2765.0, 2045.0, 1443.0, 935.0, 569.0, 321.0, 197.0, 120.0, 63.0, 28.0, 29.0, 14.0, 12.0, 2.0, 17.0, 0.0, 8.0, 2.0, 1.0, 1.0, 1.0, 0.0, 0.0, 0.0, 4.0, 3.0, 0.0, 1.0, 0.0, 1.0, 5.0, 1.0, 0.0, 1.0, 0.0, 0.0, 1.0, 6.0, 3.0, 0.0, 0.0],
    "Name": "Chi2Dist-0",
    "Overflow": 0.0,
    "Type": "Histo1d",
    "Underflow": 0.0,
    "x": {
        "AxisTitle": "Fit Chi/ndf",
        "Bins": 51,
        "High": 2.5250000953674318,
        "Low": -0.02500000037252903
    },
    "y": {
        "AxisTitle": "Number of Pixels"
    },
    "z": {
        "AxisTitle": "z"
    }
}