time,Hardware,Voltage,Current
1626613837517,high-voltage-3,1,0.241349
time,Hardware,Voltage,Current
1626613837517,high-voltage-3,2,0.25696
time,Hardware,Voltage,Current
1626613837517,high-voltage-3,3,0.272138
time,Hardware,Voltage,Current
1626613837517,high-voltage-3,4,0.284645
time,Hardware,Voltage,Current
1626613837517,high-voltage-3,5,0.295381
time,Hardware,Voltage,Current
1626613837517,high-voltage-3,6,0.306762
time,Hardware,Voltage,Current
1626613837517,high-voltage-3,7,0.318062
time,Hardware,Voltage,Current
1626613837517,high-voltage-3,8,0.330738
time,Hardware,Voltage,Current
1626613837517,high-voltage-3,9,0.343446
time,Hardware,Voltage,Current
1626613837517,high-voltage-3,10,0.357647
time,Hardware,Voltage,Current
1626613837517,high-voltage-3,11,0.370282
time,Hardware,Voltage,Current
1626613837517,high-voltage-3,12,0.383798
time,Hardware,Voltage,Current
1626613837517,high-voltage-3,13,0.396441
time,Hardware,Voltage,Current
1626613837517,high-voltage-3,14,0.408585
time,Hardware,Voltage,Current
1626613837517,high-voltage-3,15,0.42057
time,Hardware,Voltage,Current
1626613837517,high-voltage-3,16,0.431078
time,Hardware,Voltage,Current
1626613837517,high-voltage-3,17,0.440056
time,Hardware,Voltage,Current
1626613837517,high-voltage-3,18,0.44934
time,Hardware,Voltage,Current
1626613837517,high-voltage-3,19,0.457365
time,Hardware,Voltage,Current
1626613837517,high-voltage-3,20,0.465911
time,Hardware,Voltage,Current
1626613837517,high-voltage-3,25,0.499637
time,Hardware,Voltage,Current
1626613837517,high-voltage-3,30,0.529961
time,Hardware,Voltage,Current
1626613837517,high-voltage-3,35,0.556061
time,Hardware,Voltage,Current
1626613837517,high-voltage-3,40,0.578947
time,Hardware,Voltage,Current
1626613837517,high-voltage-3,45,0.602347
time,Hardware,Voltage,Current
1626613837517,high-voltage-3,50,0.624861
time,Hardware,Voltage,Current
1626613837517,high-voltage-3,55,0.646977
time,Hardware,Voltage,Current
1626613837517,high-voltage-3,60,0.669189
time,Hardware,Voltage,Current
1626613837517,high-voltage-3,65,0.689292
time,Hardware,Voltage,Current
1626613837517,high-voltage-3,70,0.710743
time,Hardware,Voltage,Current
1626613837517,high-voltage-3,75,0.733277
time,Hardware,Voltage,Current
1626613837517,high-voltage-3,80,0.75592
time,Hardware,Voltage,Current
1626613837517,high-voltage-3,85,0.778278
time,Hardware,Voltage,Current
1626613837517,high-voltage-3,90,0.799884
time,Hardware,Voltage,Current
1626613837517,high-voltage-3,95,0.821307
time,Hardware,Voltage,Current
1626613837517,high-voltage-3,100,0.841581
