{
    "Data": [[3647.0, 1921.0, 1172.0, 870.0, 657.0, 521.0, 483.0, 346.0, 309.0, 261.0, 229.0, 214.0, 172.0, 157.0, 136.0, 121.0, 124.0, 89.0, 96.0, 100.0, 78.0, 73.0, 80.0, 73.0, 44.0, 42.0, 46.0, 53.0, 41.0, 35.0, 33.0, 32.0, 33.0, 28.0, 31.0, 34.0, 21.0, 19.0, 14.0, 15.0, 28.0, 22.0, 21.0, 18.0, 18.0, 15.0, 15.0, 23.0, 28.0], [3667.0, 2058.0, 1453.0, 1171.0, 932.0, 748.0, 673.0, 555.0, 473.0, 387.0, 392.0, 340.0, 303.0, 296.0, 239.0, 230.0, 199.0, 201.0, 144.0, 163.0, 150.0, 148.0, 119.0, 135.0, 122.0, 100.0, 102.0, 84.0, 91.0, 92.0, 69.0, 70.0, 62.0, 69.0, 55.0, 53.0, 40.0, 53.0, 45.0, 35.0, 47.0, 43.0, 41.0, 35.0, 28.0, 27.0, 29.0, 30.0, 29.0], [3348.0, 1975.0, 1439.0, 1265.0, 1039.0, 915.0, 836.0, 734.0, 619.0, 597.0, 482.0, 554.0, 453.0, 433.0, 381.0, 314.0, 331.0, 289.0, 288.0, 312.0, 230.0, 238.0, 222.0, 225.0, 224.0, 200.0, 167.0, 168.0, 158.0, 146.0, 126.0, 140.0, 138.0, 118.0, 115.0, 126.0, 95.0, 110.0, 101.0, 91.0, 83.0, 57.0, 82.0, 62.0, 59.0, 65.0, 69.0, 59.0, 69.0], [2622.0, 1729.0, 1300.0, 1151.0, 958.0, 904.0, 844.0, 756.0, 692.0, 644.0, 594.0, 597.0, 538.0, 532.0, 504.0, 475.0, 440.0, 427.0, 390.0, 420.0, 366.0, 368.0, 330.0, 343.0, 322.0, 307.0, 294.0, 285.0, 285.0, 263.0, 260.0, 259.0, 236.0, 207.0, 215.0, 204.0, 214.0, 225.0, 198.0, 192.0, 192.0, 171.0, 166.0, 148.0, 136.0, 144.0, 129.0, 137.0, 132.0], [2709.0, 1381.0, 1038.0, 877.0, 843.0, 729.0, 678.0, 698.0, 613.0, 652.0, 604.0, 567.0, 577.0, 552.0, 526.0, 500.0, 504.0, 507.0, 490.0, 450.0, 481.0, 445.0, 453.0, 442.0, 435.0, 418.0, 394.0, 430.0, 409.0, 424.0, 376.0, 354.0, 379.0, 384.0, 321.0, 349.0, 345.0, 363.0, 333.0, 358.0, 336.0, 305.0, 334.0, 318.0, 337.0, 291.0, 319.0, 308.0, 317.0], [4383.0, 1779.0, 1187.0, 849.0, 724.0, 643.0, 627.0, 596.0, 521.0, 475.0, 492.0, 438.0, 500.0, 520.0, 436.0, 477.0, 454.0, 456.0, 506.0, 486.0, 480.0, 477.0, 455.0, 485.0, 424.0, 479.0, 470.0, 463.0, 489.0, 490.0, 505.0, 486.0, 464.0, 482.0, 475.0, 526.0, 488.0, 461.0, 499.0, 499.0, 515.0, 516.0, 528.0, 508.0, 557.0, 610.0, 616.0, 721.0, 733.0], [5339.0, 3290.0, 2273.0, 1692.0, 1349.0, 1110.0, 982.0, 845.0, 705.0, 683.0, 562.0, 567.0, 499.0, 501.0, 509.0, 442.0, 462.0, 431.0, 453.0, 411.0, 405.0, 418.0, 458.0, 439.0, 467.0, 451.0, 432.0, 448.0, 454.0, 458.0, 485.0, 499.0, 518.0, 534.0, 542.0, 558.0, 597.0, 594.0, 612.0, 662.0, 661.0, 695.0, 746.0, 770.0, 863.0, 851.0, 999.0, 1078.0, 1461.0], [2269.0, 1833.0, 1678.0, 1551.0, 1476.0, 1428.0, 1357.0, 1271.0, 1183.0, 1186.0, 1025.0, 1034.0, 997.0, 942.0, 920.0, 804.0, 794.0, 774.0, 734.0, 661.0, 697.0, 662.0, 630.0, 646.0, 618.0, 576.0, 633.0, 581.0, 559.0, 558.0, 571.0, 573.0, 589.0, 607.0, 591.0, 635.0, 592.0, 643.0, 678.0, 757.0, 753.0, 779.0, 863.0, 941.0, 1021.0, 1226.0, 1362.0, 1616.0, 2266.0], [829.0, 402.0, 363.0, 350.0, 356.0, 373.0, 405.0, 446.0, 475.0, 467.0, 563.0, 580.0, 527.0, 609.0, 636.0, 657.0, 691.0, 685.0, 754.0, 729.0, 767.0, 785.0, 828.0, 868.0, 877.0, 850.0, 916.0, 898.0, 943.0, 950.0, 918.0, 935.0, 942.0, 959.0, 1008.0, 999.0, 1042.0, 1055.0, 1046.0, 1084.0, 1127.0, 1196.0, 1259.0, 1351.0, 1449.0, 1611.0, 1875.0, 2295.0, 3204.0], [730.0, 254.0, 163.0, 101.0, 79.0, 85.0, 82.0, 79.0, 101.0, 89.0, 101.0, 93.0, 98.0, 120.0, 131.0, 125.0, 132.0, 150.0, 189.0, 202.0, 231.0, 200.0, 239.0, 244.0, 295.0, 329.0, 400.0, 380.0, 432.0, 448.0, 554.0, 605.0, 664.0, 637.0, 739.0, 871.0, 813.0, 989.0, 1131.0, 1175.0, 1368.0, 1523.0, 1659.0, 1918.0, 2197.0, 2530.0, 3013.0, 3964.0, 5654.0], [756.0, 275.0, 161.0, 99.0, 71.0, 57.0, 50.0, 38.0, 40.0, 37.0, 42.0, 39.0, 51.0, 55.0, 42.0, 37.0, 47.0, 37.0, 36.0, 62.0, 50.0, 44.0, 46.0, 50.0, 53.0, 82.0, 88.0, 83.0, 108.0, 122.0, 126.0, 130.0, 163.0, 189.0, 190.0, 224.0, 255.0, 285.0, 350.0, 434.0, 503.0, 633.0, 784.0, 1012.0, 1307.0, 1678.0, 2561.0, 3936.0, 7303.0], [1004.0, 270.0, 140.0, 89.0, 83.0, 54.0, 46.0, 46.0, 38.0, 24.0, 38.0, 35.0, 33.0, 36.0, 42.0, 32.0, 22.0, 26.0, 21.0, 28.0, 36.0, 25.0, 26.0, 28.0, 29.0, 29.0, 35.0, 33.0, 33.0, 33.0, 38.0, 49.0, 52.0, 54.0, 61.0, 55.0, 76.0, 102.0, 95.0, 129.0, 167.0, 191.0, 255.0, 337.0, 520.0, 676.0, 1009.0, 1846.0, 4698.0], [1298.0, 341.0, 158.0, 127.0, 62.0, 52.0, 50.0, 32.0, 34.0, 26.0, 28.0, 25.0, 24.0, 24.0, 21.0, 28.0, 15.0, 30.0, 32.0, 28.0, 26.0, 16.0, 27.0, 30.0, 25.0, 14.0, 18.0, 26.0, 31.0, 28.0, 29.0, 35.0, 30.0, 32.0, 38.0, 29.0, 38.0, 42.0, 43.0, 41.0, 51.0, 67.0, 96.0, 112.0, 168.0, 255.0, 436.0, 795.0, 2260.0], [1895.0, 475.0, 205.0, 89.0, 78.0, 46.0, 40.0, 38.0, 32.0, 28.0, 23.0, 35.0, 22.0, 16.0, 26.0, 33.0, 25.0, 18.0, 18.0, 23.0, 14.0, 23.0, 28.0, 19.0, 23.0, 22.0, 21.0, 19.0, 27.0, 20.0, 23.0, 25.0, 19.0, 18.0, 13.0, 23.0, 24.0, 28.0, 17.0, 33.0, 49.0, 45.0, 52.0, 55.0, 78.0, 110.0, 193.0, 382.0, 1100.0], [2880.0, 835.0, 300.0, 141.0, 85.0, 64.0, 38.0, 29.0, 21.0, 25.0, 16.0, 22.0, 20.0, 12.0, 20.0, 12.0, 22.0, 14.0, 15.0, 7.0, 16.0, 16.0, 17.0, 18.0, 24.0, 15.0, 22.0, 22.0, 23.0, 21.0, 22.0, 26.0, 37.0, 22.0, 30.0, 25.0, 18.0, 19.0, 18.0, 18.0, 23.0, 29.0, 24.0, 39.0, 46.0, 66.0, 98.0, 181.0, 522.0], [4017.0, 1421.0, 625.0, 265.0, 140.0, 85.0, 62.0, 30.0, 27.0, 22.0, 22.0, 20.0, 16.0, 19.0, 16.0, 15.0, 16.0, 17.0, 15.0, 7.0, 10.0, 15.0, 16.0, 7.0, 8.0, 9.0, 8.0, 7.0, 12.0, 20.0, 20.0, 19.0, 17.0, 19.0, 13.0, 17.0, 24.0, 11.0, 23.0, 20.0, 13.0, 23.0, 23.0, 36.0, 46.0, 62.0, 58.0, 115.0, 338.0], [5123.0, 2332.0, 1158.0, 582.0, 318.0, 195.0, 111.0, 76.0, 33.0, 29.0, 35.0, 12.0, 18.0, 23.0, 19.0, 17.0, 12.0, 11.0, 9.0, 17.0, 11.0, 13.0, 12.0, 11.0, 18.0, 7.0, 13.0, 3.0, 9.0, 9.0, 10.0, 10.0, 12.0, 8.0, 18.0, 13.0, 19.0, 15.0, 13.0, 18.0, 20.0, 20.0, 11.0, 18.0, 27.0, 25.0, 49.0, 58.0, 228.0], [5860.0, 3178.0, 1841.0, 1152.0, 676.0, 399.0, 248.0, 177.0, 101.0, 62.0, 50.0, 33.0, 35.0, 41.0, 15.0, 23.0, 24.0, 17.0, 8.0, 11.0, 7.0, 9.0, 8.0, 9.0, 13.0, 12.0, 10.0, 11.0, 10.0, 8.0, 11.0, 13.0, 5.0, 12.0, 9.0, 9.0, 9.0, 7.0, 5.0, 13.0, 16.0, 8.0, 22.0, 26.0, 26.0, 22.0, 25.0, 38.0, 95.0], [5758.0, 3706.0, 2602.0, 1754.0, 1230.0, 860.0, 583.0, 395.0, 295.0, 180.0, 151.0, 102.0, 69.0, 70.0, 56.0, 39.0, 37.0, 15.0, 24.0, 18.0, 17.0, 15.0, 14.0, 15.0, 10.0, 6.0, 9.0, 10.0, 10.0, 8.0, 8.0, 6.0, 8.0, 14.0, 3.0, 5.0, 5.0, 10.0, 10.0, 7.0, 11.0, 11.0, 8.0, 19.0, 18.0, 23.0, 22.0, 22.0, 64.0], [4706.0, 3524.0, 2953.0, 2280.0, 1831.0, 1365.0, 1091.0, 853.0, 625.0, 470.0, 386.0, 273.0, 253.0, 155.0, 126.0, 91.0, 94.0, 56.0, 47.0, 29.0, 30.0, 20.0, 22.0, 23.0, 14.0, 12.0, 12.0, 15.0, 5.0, 8.0, 10.0, 11.0, 5.0, 14.0, 8.0, 8.0, 4.0, 4.0, 8.0, 3.0, 9.0, 7.0, 13.0, 9.0, 18.0, 24.0, 17.0, 29.0, 54.0], [3261.0, 2958.0, 2701.0, 2438.0, 2092.0, 1748.0, 1541.0, 1227.0, 1104.0, 871.0, 716.0, 591.0, 456.0, 438.0, 316.0, 279.0, 222.0, 174.0, 138.0, 112.0, 90.0, 70.0, 64.0, 54.0, 40.0, 38.0, 28.0, 30.0, 17.0, 16.0, 16.0, 14.0, 8.0, 6.0, 7.0, 16.0, 5.0, 8.0, 8.0, 7.0, 5.0, 10.0, 6.0, 6.0, 13.0, 12.0, 13.0, 30.0, 46.0], [2245.0, 1994.0, 2109.0, 2014.0, 1954.0, 1817.0, 1670.0, 1516.0, 1378.0, 1251.0, 1041.0, 956.0, 806.0, 698.0, 608.0, 547.0, 414.0, 393.0, 318.0, 249.0, 221.0, 181.0, 172.0, 137.0, 107.0, 104.0, 79.0, 59.0, 47.0, 43.0, 38.0, 31.0, 24.0, 21.0, 17.0, 10.0, 15.0, 10.0, 5.0, 6.0, 5.0, 7.0, 6.0, 9.0, 7.0, 11.0, 12.0, 22.0, 35.0], [1414.0, 1186.0, 1352.0, 1462.0, 1483.0, 1495.0, 1441.0, 1425.0, 1384.0, 1363.0, 1247.0, 1192.0, 1086.0, 1072.0, 900.0, 828.0, 701.0, 674.0, 628.0, 562.0, 425.0, 406.0, 365.0, 309.0, 267.0, 207.0, 236.0, 157.0, 131.0, 124.0, 102.0, 70.0, 70.0, 63.0, 57.0, 30.0, 35.0, 29.0, 23.0, 21.0, 18.0, 8.0, 15.0, 13.0, 9.0, 10.0, 4.0, 19.0, 28.0], [944.0, 695.0, 690.0, 783.0, 934.0, 976.0, 1100.0, 1139.0, 1172.0, 1149.0, 1194.0, 1229.0, 1132.0, 1126.0, 1123.0, 1044.0, 950.0, 880.0, 887.0, 796.0, 739.0, 677.0, 695.0, 565.0, 510.0, 445.0, 394.0, 385.0, 297.0, 280.0, 255.0, 198.0, 194.0, 166.0, 132.0, 136.0, 92.0, 69.0, 63.0, 47.0, 39.0, 31.0, 31.0, 20.0, 18.0, 21.0, 12.0, 18.0, 21.0], [733.0, 402.0, 398.0, 400.0, 497.0, 563.0, 581.0, 728.0, 793.0, 856.0, 841.0, 912.0, 976.0, 979.0, 949.0, 974.0, 1001.0, 992.0, 975.0, 1012.0, 958.0, 855.0, 910.0, 784.0, 764.0, 730.0, 644.0, 673.0, 565.0, 524.0, 474.0, 449.0, 401.0, 380.0, 303.0, 300.0, 232.0, 216.0, 155.0, 169.0, 138.0, 95.0, 84.0, 68.0, 60.0, 37.0, 30.0, 26.0, 27.0], [668.0, 270.0, 196.0, 204.0, 244.0, 261.0, 304.0, 355.0, 416.0, 457.0, 512.0, 556.0, 614.0, 700.0, 752.0, 808.0, 821.0, 866.0, 854.0, 886.0, 931.0, 937.0, 940.0, 901.0, 940.0, 913.0, 815.0, 902.0, 780.0, 825.0, 740.0, 684.0, 677.0, 633.0, 567.0, 523.0, 506.0, 475.0, 372.0, 377.0, 308.0, 281.0, 226.0, 192.0, 144.0, 128.0, 86.0, 58.0, 44.0], [600.0, 218.0, 128.0, 94.0, 103.0, 137.0, 131.0, 159.0, 185.0, 242.0, 270.0, 313.0, 356.0, 384.0, 445.0, 492.0, 505.0, 591.0, 614.0, 656.0, 726.0, 754.0, 753.0, 846.0, 828.0, 894.0, 870.0, 947.0, 913.0, 966.0, 921.0, 920.0, 924.0, 867.0, 861.0, 799.0, 766.0, 718.0, 709.0, 643.0, 611.0, 547.0, 494.0, 417.0, 350.0, 291.0, 249.0, 202.0, 141.0], [630.0, 197.0, 124.0, 71.0, 71.0, 61.0, 60.0, 64.0, 93.0, 108.0, 103.0, 139.0, 153.0, 182.0, 215.0, 234.0, 267.0, 312.0, 384.0, 420.0, 462.0, 470.0, 537.0, 570.0, 613.0, 675.0, 725.0, 770.0, 833.0, 864.0, 908.0, 901.0, 967.0, 1010.0, 970.0, 1011.0, 1020.0, 1002.0, 1006.0, 974.0, 956.0, 854.0, 877.0, 761.0, 684.0, 673.0, 587.0, 473.0, 367.0], [617.0, 198.0, 105.0, 72.0, 49.0, 35.0, 43.0, 38.0, 31.0, 42.0, 55.0, 53.0, 60.0, 71.0, 76.0, 113.0, 125.0, 159.0, 174.0, 211.0, 267.0, 248.0, 278.0, 348.0, 403.0, 450.0, 530.0, 553.0, 573.0, 611.0, 712.0, 738.0, 820.0, 862.0, 941.0, 1020.0, 1013.0, 1062.0, 1117.0, 1161.0, 1188.0, 1159.0, 1175.0, 1202.0, 1172.0, 1173.0, 1043.0, 980.0, 832.0], [605.0, 170.0, 124.0, 73.0, 49.0, 43.0, 26.0, 24.0, 21.0, 20.0, 26.0, 35.0, 33.0, 35.0, 27.0, 54.0, 48.0, 58.0, 70.0, 102.0, 90.0, 115.0, 141.0, 181.0, 201.0, 212.0, 250.0, 310.0, 347.0, 365.0, 469.0, 525.0, 534.0, 619.0, 746.0, 788.0, 819.0, 967.0, 1071.0, 1169.0, 1275.0, 1341.0, 1405.0, 1438.0, 1572.0, 1597.0, 1697.0, 1664.0, 1599.0], [589.0, 200.0, 101.0, 63.0, 45.0, 50.0, 27.0, 32.0, 23.0, 13.0, 28.0, 15.0, 17.0, 14.0, 8.0, 28.0, 26.0, 24.0, 40.0, 32.0, 35.0, 51.0, 78.0, 70.0, 72.0, 113.0, 125.0, 138.0, 150.0, 200.0, 248.0, 283.0, 302.0, 370.0, 458.0, 498.0, 588.0, 705.0, 771.0, 928.0, 1067.0, 1215.0, 1435.0, 1575.0, 1661.0, 1891.0, 2114.0, 2446.0, 2600.0], [558.0, 222.0, 106.0, 91.0, 63.0, 33.0, 27.0, 29.0, 31.0, 15.0, 13.0, 15.0, 14.0, 14.0, 15.0, 19.0, 13.0, 16.0, 12.0, 17.0, 9.0, 33.0, 18.0, 28.0, 29.0, 42.0, 46.0, 52.0, 76.0, 89.0, 102.0, 133.0, 166.0, 190.0, 222.0, 274.0, 353.0, 401.0, 491.0, 595.0, 749.0, 943.0, 1125.0, 1340.0, 1612.0, 1998.0, 2494.0, 2814.0, 3590.0], [565.0, 211.0, 96.0, 87.0, 54.0, 38.0, 37.0, 22.0, 17.0, 27.0, 15.0, 16.0, 16.0, 16.0, 19.0, 19.0, 14.0, 12.0, 15.0, 9.0, 9.0, 14.0, 13.0, 11.0, 16.0, 21.0, 21.0, 21.0, 24.0, 30.0, 46.0, 54.0, 72.0, 72.0, 122.0, 131.0, 164.0, 209.0, 274.0, 373.0, 434.0, 561.0, 744.0, 930.0, 1251.0, 1722.0, 2272.0, 3031.0, 4335.0], [559.0, 209.0, 105.0, 61.0, 48.0, 39.0, 40.0, 31.0, 21.0, 21.0, 13.0, 8.0, 16.0, 18.0, 16.0, 11.0, 16.0, 20.0, 13.0, 17.0, 13.0, 12.0, 16.0, 12.0, 16.0, 11.0, 4.0, 17.0, 15.0, 15.0, 15.0, 14.0, 24.0, 27.0, 48.0, 34.0, 86.0, 108.0, 99.0, 171.0, 222.0, 294.0, 453.0, 580.0, 798.0, 1259.0, 1699.0, 2851.0, 4631.0], [611.0, 202.0, 122.0, 55.0, 51.0, 34.0, 31.0, 24.0, 24.0, 13.0, 14.0, 13.0, 8.0, 17.0, 11.0, 14.0, 14.0, 8.0, 14.0, 14.0, 9.0, 17.0, 17.0, 9.0, 16.0, 6.0, 11.0, 12.0, 21.0, 14.0, 10.0, 10.0, 13.0, 15.0, 16.0, 22.0, 30.0, 30.0, 57.0, 83.0, 105.0, 147.0, 198.0, 315.0, 502.0, 752.0, 1335.0, 2215.0, 4178.0], [568.0, 244.0, 102.0, 78.0, 33.0, 33.0, 30.0, 19.0, 14.0, 21.0, 14.0, 14.0, 16.0, 18.0, 16.0, 15.0, 15.0, 14.0, 8.0, 9.0, 7.0, 7.0, 8.0, 13.0, 8.0, 9.0, 9.0, 12.0, 5.0, 7.0, 9.0, 5.0, 8.0, 10.0, 7.0, 13.0, 15.0, 20.0, 20.0, 29.0, 53.0, 62.0, 105.0, 151.0, 230.0, 423.0, 779.0, 1446.0, 3578.0], [637.0, 194.0, 113.0, 66.0, 50.0, 28.0, 29.0, 22.0, 21.0, 23.0, 14.0, 12.0, 12.0, 9.0, 15.0, 11.0, 11.0, 16.0, 14.0, 11.0, 14.0, 13.0, 11.0, 11.0, 7.0, 12.0, 5.0, 5.0, 7.0, 5.0, 7.0, 4.0, 5.0, 8.0, 7.0, 6.0, 11.0, 12.0, 7.0, 7.0, 11.0, 23.0, 38.0, 69.0, 122.0, 216.0, 484.0, 900.0, 2707.0], [590.0, 211.0, 107.0, 63.0, 54.0, 29.0, 30.0, 21.0, 22.0, 14.0, 12.0, 20.0, 13.0, 11.0, 16.0, 13.0, 15.0, 16.0, 9.0, 11.0, 14.0, 4.0, 15.0, 6.0, 6.0, 6.0, 11.0, 9.0, 6.0, 10.0, 4.0, 13.0, 6.0, 8.0, 2.0, 4.0, 8.0, 6.0, 7.0, 8.0, 9.0, 14.0, 16.0, 30.0, 48.0, 97.0, 262.0, 589.0, 1854.0], [562.0, 181.0, 101.0, 73.0, 52.0, 35.0, 33.0, 20.0, 20.0, 20.0, 14.0, 18.0, 17.0, 12.0, 16.0, 13.0, 9.0, 12.0, 17.0, 13.0, 15.0, 18.0, 9.0, 11.0, 7.0, 11.0, 6.0, 8.0, 8.0, 8.0, 6.0, 6.0, 1.0, 5.0, 3.0, 2.0, 5.0, 4.0, 7.0, 3.0, 6.0, 5.0, 8.0, 12.0, 13.0, 44.0, 106.0, 263.0, 1129.0], [583.0, 182.0, 107.0, 66.0, 62.0, 34.0, 25.0, 19.0, 20.0, 29.0, 20.0, 10.0, 12.0, 10.0, 8.0, 12.0, 16.0, 19.0, 10.0, 13.0, 17.0, 8.0, 9.0, 12.0, 8.0, 5.0, 8.0, 10.0, 10.0, 5.0, 8.0, 10.0, 6.0, 3.0, 4.0, 4.0, 4.0, 5.0, 2.0, 10.0, 6.0, 3.0, 6.0, 8.0, 12.0, 19.0, 49.0, 144.0, 717.0], [629.0, 198.0, 131.0, 67.0, 40.0, 31.0, 34.0, 31.0, 14.0, 20.0, 16.0, 18.0, 11.0, 17.0, 22.0, 14.0, 11.0, 14.0, 16.0, 6.0, 6.0, 9.0, 14.0, 8.0, 7.0, 2.0, 8.0, 12.0, 8.0, 5.0, 10.0, 4.0, 8.0, 6.0, 7.0, 3.0, 4.0, 1.0, 8.0, 4.0, 4.0, 8.0, 7.0, 2.0, 8.0, 20.0, 26.0, 81.0, 371.0], [557.0, 194.0, 102.0, 65.0, 46.0, 36.0, 23.0, 21.0, 24.0, 31.0, 19.0, 19.0, 15.0, 17.0, 22.0, 10.0, 18.0, 13.0, 8.0, 7.0, 7.0, 12.0, 10.0, 8.0, 8.0, 10.0, 7.0, 9.0, 5.0, 5.0, 0.0, 7.0, 3.0, 2.0, 6.0, 5.0, 10.0, 2.0, 3.0, 9.0, 2.0, 7.0, 8.0, 5.0, 2.0, 12.0, 11.0, 31.0, 216.0], [578.0, 196.0, 114.0, 73.0, 46.0, 40.0, 21.0, 31.0, 21.0, 17.0, 13.0, 13.0, 18.0, 15.0, 16.0, 7.0, 10.0, 16.0, 13.0, 10.0, 10.0, 12.0, 7.0, 9.0, 5.0, 9.0, 7.0, 9.0, 11.0, 7.0, 5.0, 13.0, 2.0, 8.0, 5.0, 2.0, 3.0, 3.0, 5.0, 8.0, 8.0, 2.0, 4.0, 5.0, 0.0, 13.0, 16.0, 19.0, 117.0], [570.0, 184.0, 95.0, 74.0, 56.0, 50.0, 34.0, 25.0, 17.0, 20.0, 17.0, 16.0, 15.0, 9.0, 18.0, 10.0, 8.0, 14.0, 14.0, 14.0, 7.0, 10.0, 6.0, 6.0, 12.0, 2.0, 8.0, 13.0, 5.0, 7.0, 6.0, 8.0, 6.0, 8.0, 4.0, 2.0, 7.0, 2.0, 7.0, 4.0, 3.0, 4.0, 5.0, 5.0, 4.0, 8.0, 12.0, 21.0, 61.0], [552.0, 216.0, 101.0, 59.0, 60.0, 33.0, 33.0, 20.0, 28.0, 28.0, 21.0, 10.0, 17.0, 10.0, 18.0, 16.0, 15.0, 10.0, 8.0, 4.0, 12.0, 9.0, 10.0, 8.0, 12.0, 6.0, 8.0, 12.0, 4.0, 8.0, 8.0, 5.0, 9.0, 7.0, 6.0, 4.0, 5.0, 5.0, 3.0, 4.0, 5.0, 8.0, 6.0, 6.0, 8.0, 7.0, 7.0, 12.0, 48.0], [606.0, 187.0, 107.0, 82.0, 48.0, 36.0, 30.0, 21.0, 19.0, 23.0, 11.0, 14.0, 12.0, 11.0, 17.0, 12.0, 12.0, 12.0, 8.0, 11.0, 9.0, 16.0, 7.0, 8.0, 6.0, 9.0, 11.0, 6.0, 7.0, 7.0, 9.0, 3.0, 3.0, 11.0, 3.0, 10.0, 2.0, 5.0, 3.0, 1.0, 4.0, 9.0, 4.0, 8.0, 7.0, 7.0, 5.0, 13.0, 33.0], [576.0, 195.0, 102.0, 48.0, 51.0, 56.0, 30.0, 24.0, 24.0, 23.0, 24.0, 14.0, 11.0, 13.0, 10.0, 11.0, 8.0, 10.0, 12.0, 14.0, 16.0, 9.0, 8.0, 13.0, 10.0, 3.0, 6.0, 9.0, 7.0, 8.0, 10.0, 7.0, 5.0, 4.0, 6.0, 1.0, 4.0, 3.0, 6.0, 3.0, 5.0, 4.0, 9.0, 4.0, 10.0, 7.0, 6.0, 13.0, 20.0], [562.0, 221.0, 97.0, 76.0, 43.0, 28.0, 24.0, 24.0, 18.0, 16.0, 19.0, 17.0, 17.0, 19.0, 16.0, 23.0, 12.0, 10.0, 7.0, 11.0, 6.0, 10.0, 9.0, 9.0, 5.0, 9.0, 3.0, 11.0, 5.0, 7.0, 6.0, 9.0, 7.0, 8.0, 3.0, 10.0, 5.0, 2.0, 5.0, 4.0, 8.0, 1.0, 2.0, 4.0, 5.0, 5.0, 5.0, 9.0, 19.0], [576.0, 199.0, 101.0, 61.0, 58.0, 50.0, 31.0, 24.0, 28.0, 17.0, 14.0, 20.0, 14.0, 12.0, 9.0, 13.0, 16.0, 8.0, 10.0, 15.0, 4.0, 10.0, 4.0, 7.0, 11.0, 10.0, 6.0, 1.0, 8.0, 6.0, 7.0, 8.0, 6.0, 13.0, 2.0, 5.0, 6.0, 3.0, 3.0, 6.0, 5.0, 9.0, 4.0, 6.0, 6.0, 9.0, 4.0, 4.0, 9.0], [606.0, 212.0, 97.0, 65.0, 57.0, 36.0, 35.0, 23.0, 23.0, 22.0, 21.0, 21.0, 15.0, 16.0, 8.0, 6.0, 13.0, 18.0, 15.0, 7.0, 1.0, 5.0, 12.0, 13.0, 5.0, 6.0, 9.0, 9.0, 5.0, 7.0, 11.0, 8.0, 7.0, 8.0, 7.0, 8.0, 5.0, 4.0, 3.0, 4.0, 5.0, 2.0, 1.0, 3.0, 6.0, 7.0, 9.0, 9.0, 14.0], [598.0, 210.0, 110.0, 73.0, 46.0, 39.0, 35.0, 24.0, 21.0, 21.0, 19.0, 16.0, 9.0, 10.0, 12.0, 10.0, 14.0, 12.0, 15.0, 7.0, 9.0, 14.0, 6.0, 7.0, 11.0, 8.0, 7.0, 9.0, 6.0, 6.0, 9.0, 5.0, 5.0, 3.0, 4.0, 5.0, 2.0, 2.0, 5.0, 5.0, 6.0, 5.0, 4.0, 6.0, 7.0, 7.0, 4.0, 9.0, 15.0]],
    "Name": "sCurve-0",
    "Overflow": 2601652.0,
    "Type": "Histo2d",
    "Underflow": 0.0,
    "x": {
        "AxisTitle": "Vcal",
        "Bins": 51,
        "High": 302.5,
        "Low": 47.5
    },
    "y": {
        "AxisTitle": "Occupancy",
        "Bins": 49,
        "High": 49.5,
        "Low": 0.5
    },
    "z": {
        "AxisTitle": "Number of pixels"
    }
}