{
    "Data": [8.0, 2485.0, 14399.0, 18397.0, 11213.0, 4295.0, 1235.0, 327.0, 137.0, 125.0, 117.0, 116.0, 155.0, 231.0, 296.0, 335.0, 367.0, 438.0, 460.0, 486.0, 519.0, 606.0, 631.0, 625.0, 677.0, 692.0, 704.0, 719.0, 695.0, 682.0, 673.0, 654.0, 682.0, 630.0, 610.0, 623.0, 585.0, 531.0, 517.0, 482.0, 479.0, 438.0, 445.0, 395.0, 419.0, 407.0, 353.0, 348.0, 337.0, 298.0, 161.0],
    "Name": "Chi2Dist-0",
    "Overflow": 0.0,
    "Type": "Histo1d",
    "Underflow": 0.0,
    "x": {
        "AxisTitle": "Fit Chi/ndf",
        "Bins": 51,
        "High": 2.5250000953674318,
        "Low": -0.02500000037252903
    },
    "y": {
        "AxisTitle": "Number of Pixels"
    },
    "z": {
        "AxisTitle": "z"
    }
}