time,Hardware,Voltage,Current
1626355137936,high-voltage-3,1,0.00321548
time,Hardware,Voltage,Current
1626355137936,high-voltage-3,2,0.00654735
time,Hardware,Voltage,Current
1626355137936,high-voltage-3,3,0.00906275
time,Hardware,Voltage,Current
1626355137936,high-voltage-3,4,0.0107491
time,Hardware,Voltage,Current
1626355137936,high-voltage-3,5,0.0111813
time,Hardware,Voltage,Current
1626355137936,high-voltage-3,6,0.0126224
time,Hardware,Voltage,Current
1626355137936,high-voltage-3,7,0.0137015
time,Hardware,Voltage,Current
1626355137936,high-voltage-3,8,0.016821
time,Hardware,Voltage,Current
1626355137936,high-voltage-3,9,0.0182581
time,Hardware,Voltage,Current
1626355137936,high-voltage-3,10,0.0200585
time,Hardware,Voltage,Current
1626355137936,high-voltage-3,11,0.021652
time,Hardware,Voltage,Current
1626355137936,high-voltage-3,12,0.0233081
time,Hardware,Voltage,Current
1626355137936,high-voltage-3,13,0.0246752
time,Hardware,Voltage,Current
1626355137936,high-voltage-3,14,0.0259693
time,Hardware,Voltage,Current
1626355137936,high-voltage-3,15,0.0267082
time,Hardware,Voltage,Current
1626355137936,high-voltage-3,16,0.0278699
time,Hardware,Voltage,Current
1626355137936,high-voltage-3,17,0.030115
time,Hardware,Voltage,Current
1626355137936,high-voltage-3,18,0.0311509
time,Hardware,Voltage,Current
1626355137936,high-voltage-3,19,0.0323481
time,Hardware,Voltage,Current
1626355137936,high-voltage-3,20,0.0335969
time,Hardware,Voltage,Current
1626355137936,high-voltage-3,25,0.0396159
time,Hardware,Voltage,Current
1626355137936,high-voltage-3,30,0.0470696
time,Hardware,Voltage,Current
1626355137936,high-voltage-3,35,0.0527849
time,Hardware,Voltage,Current
1626355137936,high-voltage-3,40,0.0589433
time,Hardware,Voltage,Current
1626355137936,high-voltage-3,45,0.0630304
time,Hardware,Voltage,Current
1626355137936,high-voltage-3,50,0.0681131
time,Hardware,Voltage,Current
1626355137936,high-voltage-3,55,0.0714864
time,Hardware,Voltage,Current
1626355137936,high-voltage-3,60,0.0753345
time,Hardware,Voltage,Current
1626355137936,high-voltage-3,65,0.0807604
time,Hardware,Voltage,Current
1626355137936,high-voltage-3,70,0.0868891
time,Hardware,Voltage,Current
1626355137936,high-voltage-3,75,0.09256
time,Hardware,Voltage,Current
1626355137936,high-voltage-3,80,0.0969828
time,Hardware,Voltage,Current
1626355137936,high-voltage-3,85,0.102956
time,Hardware,Voltage,Current
1626355137936,high-voltage-3,90,0.109449
time,Hardware,Voltage,Current
1626355137936,high-voltage-3,95,0.116742
time,Hardware,Voltage,Current
1626355137936,high-voltage-3,100,0.125079
