time,Hardware,Voltage,Current
1621612162172,high-voltage,1,0.135333
time,Hardware,Voltage,Current
1621612162172,high-voltage,2,0.216183
time,Hardware,Voltage,Current
1621612162172,high-voltage,3,0.321636
time,Hardware,Voltage,Current
1621612162172,high-voltage,4,0.446244
time,Hardware,Voltage,Current
1621612162172,high-voltage,5,0.60499
time,Hardware,Voltage,Current
1621612162172,high-voltage,6,0.778629
time,Hardware,Voltage,Current
1621612162172,high-voltage,7,1.04375
time,Hardware,Voltage,Current
1621612162172,high-voltage,8,1.38324
time,Hardware,Voltage,Current
1621612162172,high-voltage,9,1.70206
time,Hardware,Voltage,Current
1621612162172,high-voltage,10,2.15016
time,Hardware,Voltage,Current
1621612162172,high-voltage,11,2.83997
time,Hardware,Voltage,Current
1621612162172,high-voltage,12,3.55552
time,Hardware,Voltage,Current
1621612162172,high-voltage,13,4.48606
time,Hardware,Voltage,Current
1621612162172,high-voltage,14,5.47842
time,Hardware,Voltage,Current
1621612162172,high-voltage,15,6.66885
time,Hardware,Voltage,Current
1621612162172,high-voltage,16,7.7896
time,Hardware,Voltage,Current
1621612162172,high-voltage,17,8.81238
time,Hardware,Voltage,Current
1621612162172,high-voltage,18,9.81414
time,Hardware,Voltage,Current
1621612162172,high-voltage,19,10.0001
