time,Hardware,Voltage,Current
1626312831235,high-voltage,1,0.0529425
time,Hardware,Voltage,Current
1626312831235,high-voltage,2,0.0740142
time,Hardware,Voltage,Current
1626312831235,high-voltage,3,0.0855797
time,Hardware,Voltage,Current
1626312831235,high-voltage,4,0.0930312
time,Hardware,Voltage,Current
1626312831235,high-voltage,5,0.101095
time,Hardware,Voltage,Current
1626312831235,high-voltage,6,0.109678
time,Hardware,Voltage,Current
1626312831235,high-voltage,7,0.117856
time,Hardware,Voltage,Current
1626312831235,high-voltage,8,0.126844
time,Hardware,Voltage,Current
1626312831235,high-voltage,9,0.13815
time,Hardware,Voltage,Current
1626312831235,high-voltage,10,0.14866
time,Hardware,Voltage,Current
1626312831235,high-voltage,11,0.161416
time,Hardware,Voltage,Current
1626312831235,high-voltage,12,0.17446
time,Hardware,Voltage,Current
1626312831235,high-voltage,13,0.186359
time,Hardware,Voltage,Current
1626312831235,high-voltage,14,0.198705
time,Hardware,Voltage,Current
1626312831235,high-voltage,15,0.210246
time,Hardware,Voltage,Current
1626312831235,high-voltage,16,0.220224
time,Hardware,Voltage,Current
1626312831235,high-voltage,17,0.228265
time,Hardware,Voltage,Current
1626312831235,high-voltage,18,0.237241
time,Hardware,Voltage,Current
1626312831235,high-voltage,19,0.245005
time,Hardware,Voltage,Current
1626312831235,high-voltage,20,0.250956
time,Hardware,Voltage,Current
1626312831235,high-voltage,25,0.284688
time,Hardware,Voltage,Current
1626312831235,high-voltage,30,0.319961
time,Hardware,Voltage,Current
1626312831235,high-voltage,35,0.384624
time,Hardware,Voltage,Current
1626312831235,high-voltage,40,0.532984
time,Hardware,Voltage,Current
1626312831235,high-voltage,45,0.81694
time,Hardware,Voltage,Current
1626312831235,high-voltage,50,1.28725
time,Hardware,Voltage,Current
1626312831235,high-voltage,55,2.02953
time,Hardware,Voltage,Current
1626312831235,high-voltage,60,3.13871
time,Hardware,Voltage,Current
1626312831235,high-voltage,65,4.70011
time,Hardware,Voltage,Current
1626312831235,high-voltage,70,6.80394
time,Hardware,Voltage,Current
1626312831235,high-voltage,75,9.66646
time,Hardware,Voltage,Current
1626312831235,high-voltage,80,10
