{
    "Data": [7.0, 19.0, 0.0, 0.0, 0.0, 5.0, 35.0, 119.0, 384.0, 1158.0, 2387.0, 3911.0, 4944.0, 4993.0, 4021.0, 3247.0, 3235.0, 3908.0, 4544.0, 4633.0, 3988.0, 2828.0, 1695.0, 895.0, 403.0, 230.0, 114.0, 76.0, 52.0, 48.0, 32.0, 18.0, 20.0, 5.0, 8.0, 7.0, 7.0],
    "Name": "NoiseDist-0",
    "Overflow": 32.0,
    "Type": "Histo1d",
    "Underflow": 0.0,
    "x": {
        "AxisTitle": "Noise [e]",
        "Bins": 37,
        "High": 186.0,
        "Low": -2.0
    },
    "y": {
        "AxisTitle": "Number of Pixels"
    },
    "z": {
        "AxisTitle": "z"
    }
}