{
    "Data": [0.0, 0.0, 0.0, 0.0, 0.0, 0.0, 0.0, 0.0, 0.0, 0.0, 0.0, 0.0, 0.0, 0.0, 0.0, 0.0, 0.0, 0.0, 0.0, 0.0, 0.0, 0.0, 0.0, 0.0, 0.0, 0.0, 0.0, 0.0, 0.0, 0.0, 0.0, 0.0, 0.0, 0.0, 0.0, 0.0, 0.0, 0.0, 0.0, 0.0, 0.0, 0.0, 0.0, 0.0, 0.0, 0.0, 0.0, 0.0, 0.0, 0.0, 3.0, 11.0, 10.0, 15.0, 7.0, 12.0, 10.0, 11.0, 3.0, 13.0, 18.0, 8.0, 18.0, 24.0, 36.0, 33.0, 55.0, 57.0, 69.0, 89.0, 128.0, 164.0, 166.0, 213.0, 289.0, 294.0, 467.0, 494.0, 571.0, 667.0, 759.0, 893.0, 939.0, 1049.0, 1075.0, 1192.0, 1380.0, 1345.0, 1426.0, 1605.0, 2007.0, 2461.0, 3070.0, 3576.0, 4192.0, 4248.0, 3974.0, 3444.0, 2649.0, 1914.0, 1288.0, 863.0, 587.0, 393.0, 288.0, 219.0, 141.0, 131.0, 98.0, 80.0, 65.0, 58.0, 44.0, 42.0, 48.0, 38.0, 25.0, 29.0, 27.0, 22.0, 36.0, 21.0, 30.0, 18.0, 10.0, 17.0, 15.0, 18.0, 14.0, 13.0, 9.0, 7.0, 9.0, 6.0, 19.0, 12.0, 9.0, 12.0, 6.0, 10.0, 8.0, 7.0, 7.0, 8.0, 10.0, 9.0, 7.0, 11.0, 8.0, 8.0, 15.0, 10.0, 19.0, 23.0, 31.0, 26.0, 42.0, 49.0, 78.0, 64.0, 88.0, 97.0, 135.0, 148.0, 183.0, 230.0, 243.0, 313.0, 307.0, 390.0, 419.0, 467.0, 542.0, 570.0, 607.0, 647.0, 683.0, 679.0, 764.0, 751.0, 759.0, 818.0, 787.0, 806.0, 729.0, 805.0, 746.0, 661.0, 644.0, 644.0, 600.0, 556.0, 512.0, 470.0, 440.0, 400.0, 367.0, 322.0, 294.0, 247.0, 205.0, 187.0, 147.0, 121.0, 119.0, 85.0, 89.0, 88.0, 56.0, 57.0, 49.0, 42.0, 43.0, 37.0, 30.0, 26.0, 21.0, 25.0, 19.0, 12.0, 18.0, 8.0, 16.0, 11.0, 14.0, 7.0, 9.0, 10.0, 10.0, 11.0, 5.0, 10.0, 6.0, 13.0, 10.0, 13.0, 11.0, 0.0, 5.0, 1.0, 2.0, 2.0, 0.0, 0.0, 1.0, 4.0, 1.0, 1.0, 1.0, 2.0, 0.0, 2.0, 0.0, 1.0, 0.0, 1.0, 0.0, 2.0, 0.0, 1.0, 1.0, 0.0, 1.0, 0.0, 0.0, 0.0, 1.0, 0.0, 1.0, 0.0, 1.0, 0.0, 0.0, 0.0, 0.0, 1.0, 0.0, 0.0, 0.0, 0.0, 0.0, 0.0, 0.0, 0.0, 0.0, 0.0, 0.0, 1.0, 0.0, 0.0, 0.0, 0.0, 0.0, 0.0, 0.0, 0.0, 0.0, 0.0, 0.0, 0.0, 0.0, 0.0, 0.0, 0.0, 0.0, 3.0, 0.0, 1.0, 0.0, 0.0, 0.0, 0.0, 0.0, 0.0, 1.0, 1.0, 0.0, 0.0, 0.0, 0.0, 1.0, 0.0, 0.0, 0.0, 0.0, 0.0, 0.0, 0.0, 0.0],
    "Name": "ThresholdDist-0",
    "Overflow": 0.0,
    "Type": "Histo1d",
    "Underflow": 0.0,
    "x": {
        "AxisTitle": "Threshold [e]",
        "Bins": 329,
        "High": 3285.0,
        "Low": -5.0
    },
    "y": {
        "AxisTitle": "Number of Pixels"
    },
    "z": {
        "AxisTitle": "z"
    }
}