{
    "Data": [0.0, 0.0, 0.0, 0.0, 0.0, 0.0, 0.0, 0.0, 0.0, 0.0, 0.0, 0.0, 0.0, 0.0, 3.0, 0.0, 1.0, 23.0, 209.0, 70.0, 41.0, 821.0, 2785.0, 1088.0, 409.0, 1651.0, 3395.0, 1684.0, 622.0, 1425.0, 2253.0, 1281.0, 497.0, 569.0, 687.0, 621.0, 371.0, 905.0, 1551.0, 1110.0, 822.0, 1757.0, 3181.0, 4081.0, 2344.0, 1803.0, 2465.0, 3816.0, 3409.0, 2264.0, 2163.0, 2175.0, 3177.0, 1864.0, 1348.0, 1168.0, 1191.0, 1160.0, 805.0, 695.0, 714.0, 827.0, 651.0, 483.0, 437.0, 435.0, 488.0, 315.0, 284.0, 253.0, 279.0, 281.0, 217.0, 174.0, 142.0, 168.0, 161.0, 130.0, 117.0, 123.0, 108.0, 76.0, 65.0, 48.0, 72.0, 56.0, 60.0, 51.0, 38.0, 33.0, 35.0, 47.0, 40.0, 25.0, 32.0, 28.0, 24.0, 16.0, 12.0, 18.0, 14.0, 17.0, 17.0, 15.0, 20.0, 22.0, 11.0, 12.0, 14.0, 10.0, 5.0, 7.0, 17.0, 10.0, 10.0, 11.0, 7.0, 4.0, 7.0, 8.0, 15.0, 8.0, 11.0, 5.0, 10.0, 6.0, 3.0, 2.0, 7.0, 2.0, 3.0, 4.0, 9.0, 5.0, 3.0, 6.0, 2.0, 5.0, 3.0, 7.0, 2.0, 6.0, 2.0, 2.0, 3.0, 5.0, 1.0, 4.0, 3.0, 4.0, 2.0, 5.0, 2.0, 1.0, 1.0, 1.0, 4.0, 3.0, 3.0, 3.0, 5.0, 4.0, 3.0, 2.0, 2.0, 0.0, 1.0, 0.0, 1.0, 2.0, 1.0, 0.0, 2.0, 1.0, 2.0, 2.0, 3.0, 1.0, 1.0, 2.0, 2.0, 0.0, 1.0, 0.0, 3.0, 0.0, 1.0, 2.0, 0.0, 0.0, 1.0, 1.0, 5.0, 2.0, 4.0, 2.0, 3.0, 4.0, 1.0, 2.0, 1.0],
    "Name": "TimePerFitDist-0",
    "Overflow": 193.0,
    "Type": "Histo1d",
    "Underflow": 0.0,
    "x": {
        "AxisTitle": "Fit Time [us]",
        "Bins": 201,
        "High": 401.0,
        "Low": -1.0
    },
    "y": {
        "AxisTitle": "Number of Pixels"
    },
    "z": {
        "AxisTitle": "z"
    }
}