time,Hardware,Voltage,Current
1621610840199,high-voltage,1.32757e-07,0.134549
time,Hardware,Voltage,Current
1621610840199,high-voltage,2,0.220477
time,Hardware,Voltage,Current
1621610840199,high-voltage,3,0.333875
time,Hardware,Voltage,Current
1621610840199,high-voltage,4,0.476608
time,Hardware,Voltage,Current
1621610840199,high-voltage,5,0.655298
time,Hardware,Voltage,Current
1621610840199,high-voltage,6,0.910864
time,Hardware,Voltage,Current
1621610840199,high-voltage,7,1.19592
time,Hardware,Voltage,Current
1621610840199,high-voltage,8,1.58521
time,Hardware,Voltage,Current
1621610840199,high-voltage,9,2.03749
time,Hardware,Voltage,Current
1621610840199,high-voltage,10,2.62231
time,Hardware,Voltage,Current
1621610840199,high-voltage,11,3.30807
time,Hardware,Voltage,Current
1621610840199,high-voltage,12,4.05715
time,Hardware,Voltage,Current
1621610840199,high-voltage,13,5.01692
time,Hardware,Voltage,Current
1621610840199,high-voltage,14,5.8349
time,Hardware,Voltage,Current
1621610840199,high-voltage,15,7.12219
time,Hardware,Voltage,Current
1621610840199,high-voltage,16,8.23748
time,Hardware,Voltage,Current
1621610840199,high-voltage,17,9.46206
time,Hardware,Voltage,Current
1621610840199,high-voltage,18,9.59241
time,Hardware,Voltage,Current
1621610840199,high-voltage,19,10.0001
