{
    "Data": [0.0, 0.0, 0.0, 0.0, 0.0, 0.0, 0.0, 0.0, 0.0, 0.0, 0.0, 0.0, 0.0, 0.0, 0.0, 0.0, 0.0, 0.0, 0.0, 0.0, 0.0, 0.0, 0.0, 0.0, 0.0, 0.0, 0.0, 0.0, 0.0, 0.0, 0.0, 0.0, 0.0, 0.0, 0.0, 0.0, 0.0, 0.0, 0.0, 0.0, 0.0, 0.0, 0.0, 0.0, 0.0, 0.0, 0.0, 0.0, 0.0, 0.0, 0.0, 9.0, 9.0, 7.0, 4.0, 6.0, 5.0, 7.0, 11.0, 14.0, 8.0, 5.0, 19.0, 7.0, 14.0, 19.0, 15.0, 17.0, 29.0, 35.0, 48.0, 54.0, 95.0, 117.0, 134.0, 168.0, 236.0, 272.0, 340.0, 402.0, 553.0, 611.0, 726.0, 848.0, 983.0, 1079.0, 1217.0, 1347.0, 1427.0, 1586.0, 1800.0, 2172.0, 2826.0, 3469.0, 4228.0, 4658.0, 4650.0, 4031.0, 3315.0, 2537.0, 1702.0, 1106.0, 754.0, 503.0, 317.0, 249.0, 201.0, 126.0, 120.0, 83.0, 71.0, 58.0, 46.0, 48.0, 46.0, 27.0, 40.0, 30.0, 15.0, 25.0, 35.0, 27.0, 19.0, 18.0, 19.0, 14.0, 9.0, 15.0, 13.0, 16.0, 14.0, 10.0, 12.0, 3.0, 9.0, 8.0, 16.0, 12.0, 5.0, 10.0, 12.0, 9.0, 5.0, 9.0, 6.0, 3.0, 4.0, 7.0, 4.0, 5.0, 8.0, 6.0, 6.0, 3.0, 4.0, 5.0, 1.0, 0.0, 4.0, 3.0, 1.0, 4.0, 7.0, 3.0, 4.0, 6.0, 9.0, 10.0, 17.0, 13.0, 16.0, 27.0, 36.0, 40.0, 50.0, 54.0, 65.0, 102.0, 92.0, 127.0, 132.0, 175.0, 217.0, 216.0, 261.0, 305.0, 320.0, 391.0, 422.0, 477.0, 537.0, 551.0, 567.0, 641.0, 677.0, 715.0, 704.0, 764.0, 739.0, 788.0, 764.0, 755.0, 731.0, 729.0, 762.0, 697.0, 689.0, 630.0, 609.0, 546.0, 540.0, 534.0, 442.0, 380.0, 355.0, 302.0, 275.0, 266.0, 250.0, 199.0, 178.0, 151.0, 118.0, 90.0, 97.0, 85.0, 76.0, 65.0, 44.0, 37.0, 32.0, 35.0, 35.0, 19.0, 26.0, 24.0, 18.0, 7.0, 7.0, 11.0, 13.0, 9.0, 9.0, 5.0, 6.0, 3.0, 4.0, 4.0, 3.0, 3.0, 8.0, 2.0, 5.0, 4.0, 2.0, 3.0, 3.0, 4.0, 5.0, 5.0, 3.0, 2.0, 0.0, 2.0, 3.0, 4.0, 0.0, 0.0, 4.0, 2.0, 2.0, 1.0, 3.0, 4.0, 1.0, 2.0, 4.0, 5.0, 1.0, 3.0, 4.0, 3.0, 4.0, 1.0, 0.0, 2.0, 2.0, 2.0, 2.0, 1.0, 4.0, 0.0, 4.0, 0.0, 1.0, 1.0, 0.0, 1.0, 1.0, 1.0, 0.0, 0.0, 1.0, 0.0, 1.0, 0.0, 1.0, 0.0, 1.0, 1.0, 0.0, 0.0, 1.0, 1.0, 0.0, 0.0, 0.0, 0.0, 0.0, 0.0, 0.0, 1.0, 0.0, 0.0, 0.0, 0.0, 0.0, 0.0, 0.0, 0.0, 0.0, 0.0, 0.0, 0.0, 0.0, 0.0, 0.0, 0.0, 0.0, 0.0, 0.0, 0.0, 0.0, 0.0, 0.0, 0.0, 0.0, 0.0, 0.0, 0.0, 0.0, 0.0, 0.0, 0.0, 0.0, 0.0, 0.0, 0.0, 0.0, 0.0, 0.0, 0.0, 0.0, 0.0, 0.0, 0.0, 0.0, 0.0, 0.0, 0.0, 0.0, 0.0, 0.0, 0.0, 0.0, 0.0],
    "Name": "ThresholdDist-0",
    "Overflow": 0.0,
    "Type": "Histo1d",
    "Underflow": 0.0,
    "x": {
        "AxisTitle": "Threshold [e]",
        "Bins": 376,
        "High": 3755.0,
        "Low": -5.0
    },
    "y": {
        "AxisTitle": "Number of Pixels"
    },
    "z": {
        "AxisTitle": "z"
    }
}