time,Hardware,Voltage,Current
1621608673372,high-voltage,1,0.12048
time,Hardware,Voltage,Current
1621608673372,high-voltage,2,0.157888
time,Hardware,Voltage,Current
1621608673372,high-voltage,3,0.211434
time,Hardware,Voltage,Current
1621608673372,high-voltage,4,0.286429
time,Hardware,Voltage,Current
1621608673372,high-voltage,5,0.395584
time,Hardware,Voltage,Current
1621608673372,high-voltage,6,0.55255
time,Hardware,Voltage,Current
1621608673372,high-voltage,7,0.78239
time,Hardware,Voltage,Current
1621608673372,high-voltage,8,1.22546
time,Hardware,Voltage,Current
1621608673372,high-voltage,9,1.86945
time,Hardware,Voltage,Current
1621608673372,high-voltage,10,2.6694
time,Hardware,Voltage,Current
1621608673372,high-voltage,11,3.83289
time,Hardware,Voltage,Current
1621608673372,high-voltage,12,5.10013
time,Hardware,Voltage,Current
1621608673372,high-voltage,13,6.42382
time,Hardware,Voltage,Current
1621608673372,high-voltage,14,7.61312
time,Hardware,Voltage,Current
1621608673372,high-voltage,15,8.73508
time,Hardware,Voltage,Current
1621608673372,high-voltage,16,9.10148
time,Hardware,Voltage,Current
1621608673372,high-voltage,17,8.88387
time,Hardware,Voltage,Current
1621608673372,high-voltage,18,10.0001
