{
    "Data": [0.0, 0.0, 0.0, 0.0, 0.0, 0.0, 0.0, 0.0, 0.0, 0.0, 0.0, 0.0, 3.0, 0.0, 1.0, 0.0, 6.0, 0.0, 2.0, 7.0, 8.0, 14.0, 25.0, 29.0, 25.0, 20.0, 33.0, 3.0, 37.0, 1.0, 12.0, 47.0, 47.0, 50.0, 28.0, 1.0, 47.0, 38.0, 50.0, 50.0, 50.0, 17.0, 28.0, 5.0, 6.0, 50.0, 23.0, 50.0, 31.0, 50.0, 44.0],
    "Name": "Scurve-100-96",
    "Overflow": 0.0,
    "Type": "Histo1d",
    "Underflow": 0.0,
    "x": {
        "AxisTitle": "Vcal",
        "Bins": 51,
        "High": 302.5,
        "Low": 47.5
    },
    "y": {
        "AxisTitle": "Occupancy"
    },
    "z": {
        "AxisTitle": "z"
    }
}