time,Hardware,Voltage,Current
1626613404724,high-voltage,1,0.0493716
time,Hardware,Voltage,Current
1626613404724,high-voltage,2,0.0728612
time,Hardware,Voltage,Current
1626613404724,high-voltage,3,0.0875543
time,Hardware,Voltage,Current
1626613404724,high-voltage,4,0.0978406
time,Hardware,Voltage,Current
1626613404724,high-voltage,5,0.107917
time,Hardware,Voltage,Current
1626613404724,high-voltage,6,0.120509
time,Hardware,Voltage,Current
1626613404724,high-voltage,7,0.132719
time,Hardware,Voltage,Current
1626613404724,high-voltage,8,0.144703
time,Hardware,Voltage,Current
1626613404724,high-voltage,9,0.159158
time,Hardware,Voltage,Current
1626613404724,high-voltage,10,0.172131
time,Hardware,Voltage,Current
1626613404724,high-voltage,11,0.185679
time,Hardware,Voltage,Current
1626613404724,high-voltage,12,0.198467
time,Hardware,Voltage,Current
1626613404724,high-voltage,13,0.208544
time,Hardware,Voltage,Current
1626613404724,high-voltage,14,0.218566
time,Hardware,Voltage,Current
1626613404724,high-voltage,15,0.226199
time,Hardware,Voltage,Current
1626613404724,high-voltage,16,0.234265
time,Hardware,Voltage,Current
1626613404724,high-voltage,17,0.240205
time,Hardware,Voltage,Current
1626613404724,high-voltage,18,0.246652
time,Hardware,Voltage,Current
1626613404724,high-voltage,19,0.253796
time,Hardware,Voltage,Current
1626613404724,high-voltage,20,0.259632
time,Hardware,Voltage,Current
1626613404724,high-voltage,25,0.288305
time,Hardware,Voltage,Current
1626613404724,high-voltage,30,0.323106
time,Hardware,Voltage,Current
1626613404724,high-voltage,35,0.389741
time,Hardware,Voltage,Current
1626613404724,high-voltage,40,0.552276
time,Hardware,Voltage,Current
1626613404724,high-voltage,45,0.873478
time,Hardware,Voltage,Current
1626613404724,high-voltage,50,1.43424
time,Hardware,Voltage,Current
1626613404724,high-voltage,55,2.34118
time,Hardware,Voltage,Current
1626613404724,high-voltage,60,3.7466
time,Hardware,Voltage,Current
1626613404724,high-voltage,65,5.72005
time,Hardware,Voltage,Current
1626613404724,high-voltage,70,8.40756
time,Hardware,Voltage,Current
1626613404724,high-voltage,75,10
