time,Hardware,Voltage,Current
1621619017047,high-voltage-3,1,0.230404
time,Hardware,Voltage,Current
1621619017047,high-voltage-3,2,0.242172
time,Hardware,Voltage,Current
1621619017047,high-voltage-3,3,0.253802
time,Hardware,Voltage,Current
1621619017047,high-voltage-3,4,0.265724
time,Hardware,Voltage,Current
1621619017047,high-voltage-3,5,0.2741
time,Hardware,Voltage,Current
1621619017047,high-voltage-3,6,0.280592
time,Hardware,Voltage,Current
1621619017047,high-voltage-3,7,0.290169
time,Hardware,Voltage,Current
1621619017047,high-voltage-3,8,0.298046
time,Hardware,Voltage,Current
1621619017047,high-voltage-3,9,0.306931
time,Hardware,Voltage,Current
1621619017047,high-voltage-3,10,0.31604
time,Hardware,Voltage,Current
1621619017047,high-voltage-3,11,0.32475
time,Hardware,Voltage,Current
1621619017047,high-voltage-3,12,0.333266
time,Hardware,Voltage,Current
1621619017047,high-voltage-3,13,0.340758
time,Hardware,Voltage,Current
1621619017047,high-voltage-3,14,0.349696
time,Hardware,Voltage,Current
1621619017047,high-voltage-3,15,0.356462
time,Hardware,Voltage,Current
1621619017047,high-voltage-3,16,0.362903
time,Hardware,Voltage,Current
1621619017047,high-voltage-3,17,0.367421
time,Hardware,Voltage,Current
1621619017047,high-voltage-3,18,0.374116
time,Hardware,Voltage,Current
1621619017047,high-voltage-3,19,0.379554
time,Hardware,Voltage,Current
1621619017047,high-voltage-3,20,0.385298
time,Hardware,Voltage,Current
1621619017047,high-voltage-3,25,0.411034
time,Hardware,Voltage,Current
1621619017047,high-voltage-3,30,0.434522
time,Hardware,Voltage,Current
1621619017047,high-voltage-3,35,0.455822
time,Hardware,Voltage,Current
1621619017047,high-voltage-3,40,0.476225
time,Hardware,Voltage,Current
1621619017047,high-voltage-3,45,0.493237
time,Hardware,Voltage,Current
1621619017047,high-voltage-3,50,0.509935
time,Hardware,Voltage,Current
1621619017047,high-voltage-3,55,0.524991
time,Hardware,Voltage,Current
1621619017047,high-voltage-3,60,0.540342
time,Hardware,Voltage,Current
1621619017047,high-voltage-3,65,0.555428
time,Hardware,Voltage,Current
1621619017047,high-voltage-3,70,0.569944
time,Hardware,Voltage,Current
1621619017047,high-voltage-3,75,0.583354
time,Hardware,Voltage,Current
1621619017047,high-voltage-3,80,0.597851
time,Hardware,Voltage,Current
1621619017047,high-voltage-3,85,0.611374
time,Hardware,Voltage,Current
1621619017047,high-voltage-3,90,0.622143
time,Hardware,Voltage,Current
1621619017047,high-voltage-3,95,0.635447
time,Hardware,Voltage,Current
1621619017047,high-voltage-3,100,0.647184
