time,Hardware,Voltage,Current
1626611623336,high-voltage,1,0.049894
time,Hardware,Voltage,Current
1626611623336,high-voltage,2,0.0728676
time,Hardware,Voltage,Current
1626611623336,high-voltage,3,0.0879262
time,Hardware,Voltage,Current
1626611623336,high-voltage,4,0.0986652
time,Hardware,Voltage,Current
1626611623336,high-voltage,5,0.10869
time,Hardware,Voltage,Current
1626611623336,high-voltage,6,0.120055
time,Hardware,Voltage,Current
1626611623336,high-voltage,7,0.132388
time,Hardware,Voltage,Current
1626611623336,high-voltage,8,0.145707
time,Hardware,Voltage,Current
1626611623336,high-voltage,9,0.158998
time,Hardware,Voltage,Current
1626611623336,high-voltage,10,0.172699
time,Hardware,Voltage,Current
1626611623336,high-voltage,11,0.186456
time,Hardware,Voltage,Current
1626611623336,high-voltage,12,0.197907
time,Hardware,Voltage,Current
1626611623336,high-voltage,13,0.209204
time,Hardware,Voltage,Current
1626611623336,high-voltage,14,0.218685
time,Hardware,Voltage,Current
1626611623336,high-voltage,15,0.226052
time,Hardware,Voltage,Current
1626611623336,high-voltage,16,0.233902
time,Hardware,Voltage,Current
1626611623336,high-voltage,17,0.241192
time,Hardware,Voltage,Current
1626611623336,high-voltage,18,0.247713
time,Hardware,Voltage,Current
1626611623336,high-voltage,19,0.254042
time,Hardware,Voltage,Current
1626611623336,high-voltage,20,0.259881
time,Hardware,Voltage,Current
1626611623336,high-voltage,25,0.288574
time,Hardware,Voltage,Current
1626611623336,high-voltage,30,0.323857
time,Hardware,Voltage,Current
1626611623336,high-voltage,35,0.38989
time,Hardware,Voltage,Current
1626611623336,high-voltage,40,0.55192
time,Hardware,Voltage,Current
1626611623336,high-voltage,45,0.876875
time,Hardware,Voltage,Current
1626611623336,high-voltage,50,1.44751
time,Hardware,Voltage,Current
1626611623336,high-voltage,55,2.36618
time,Hardware,Voltage,Current
1626611623336,high-voltage,60,3.74916
time,Hardware,Voltage,Current
1626611623336,high-voltage,65,5.66405
time,Hardware,Voltage,Current
1626611623336,high-voltage,70,8.30363
time,Hardware,Voltage,Current
1626611623336,high-voltage,75,10
