{
    "Data": [[3743.0, 1908.0, 1247.0, 891.0, 653.0, 494.0, 413.0, 320.0, 276.0, 270.0, 216.0, 159.0, 174.0, 135.0, 108.0, 101.0, 92.0, 72.0, 81.0, 80.0, 63.0, 56.0, 48.0, 45.0, 42.0, 35.0, 47.0, 29.0, 41.0, 27.0, 28.0, 26.0, 34.0, 17.0, 25.0, 24.0, 13.0, 16.0, 18.0, 11.0, 27.0, 11.0, 19.0, 22.0, 14.0, 17.0, 13.0, 10.0, 18.0], [3750.0, 2080.0, 1533.0, 1193.0, 967.0, 742.0, 613.0, 528.0, 453.0, 447.0, 351.0, 341.0, 302.0, 222.0, 230.0, 168.0, 184.0, 153.0, 153.0, 177.0, 122.0, 134.0, 107.0, 83.0, 102.0, 69.0, 65.0, 79.0, 72.0, 76.0, 58.0, 53.0, 44.0, 34.0, 50.0, 51.0, 56.0, 36.0, 34.0, 27.0, 31.0, 26.0, 28.0, 20.0, 40.0, 30.0, 20.0, 37.0, 26.0], [3300.0, 2090.0, 1537.0, 1300.0, 1058.0, 878.0, 831.0, 732.0, 654.0, 554.0, 532.0, 480.0, 449.0, 463.0, 393.0, 336.0, 334.0, 287.0, 272.0, 249.0, 238.0, 222.0, 208.0, 199.0, 173.0, 167.0, 153.0, 164.0, 133.0, 144.0, 142.0, 109.0, 86.0, 85.0, 105.0, 101.0, 80.0, 85.0, 86.0, 58.0, 70.0, 68.0, 59.0, 61.0, 60.0, 43.0, 45.0, 44.0, 28.0], [2615.0, 1678.0, 1307.0, 1204.0, 1024.0, 940.0, 851.0, 776.0, 716.0, 673.0, 699.0, 571.0, 568.0, 508.0, 538.0, 468.0, 457.0, 462.0, 418.0, 430.0, 362.0, 374.0, 376.0, 319.0, 315.0, 308.0, 276.0, 250.0, 281.0, 265.0, 250.0, 213.0, 233.0, 200.0, 183.0, 192.0, 192.0, 148.0, 180.0, 146.0, 130.0, 138.0, 140.0, 135.0, 93.0, 121.0, 114.0, 111.0, 86.0], [2522.0, 1347.0, 1077.0, 901.0, 836.0, 732.0, 708.0, 674.0, 705.0, 611.0, 633.0, 583.0, 569.0, 551.0, 546.0, 532.0, 518.0, 518.0, 517.0, 480.0, 479.0, 471.0, 453.0, 467.0, 467.0, 451.0, 435.0, 392.0, 409.0, 374.0, 395.0, 381.0, 385.0, 373.0, 342.0, 351.0, 338.0, 339.0, 304.0, 327.0, 307.0, 293.0, 243.0, 263.0, 249.0, 235.0, 234.0, 257.0, 260.0], [4095.0, 1789.0, 1069.0, 828.0, 735.0, 644.0, 598.0, 550.0, 516.0, 488.0, 469.0, 500.0, 495.0, 483.0, 506.0, 508.0, 499.0, 446.0, 490.0, 470.0, 462.0, 485.0, 552.0, 446.0, 491.0, 477.0, 522.0, 488.0, 500.0, 503.0, 513.0, 484.0, 468.0, 508.0, 512.0, 504.0, 538.0, 505.0, 525.0, 503.0, 470.0, 475.0, 485.0, 505.0, 552.0, 537.0, 500.0, 515.0, 609.0], [5428.0, 3231.0, 2162.0, 1706.0, 1313.0, 1074.0, 957.0, 754.0, 683.0, 572.0, 519.0, 510.0, 461.0, 456.0, 445.0, 445.0, 434.0, 399.0, 443.0, 435.0, 399.0, 456.0, 401.0, 474.0, 451.0, 445.0, 507.0, 460.0, 509.0, 514.0, 521.0, 484.0, 542.0, 564.0, 530.0, 602.0, 653.0, 604.0, 596.0, 653.0, 667.0, 718.0, 730.0, 803.0, 844.0, 853.0, 962.0, 1099.0, 1265.0], [2342.0, 1972.0, 1799.0, 1643.0, 1550.0, 1464.0, 1376.0, 1337.0, 1313.0, 1241.0, 1091.0, 962.0, 966.0, 956.0, 865.0, 805.0, 723.0, 764.0, 687.0, 688.0, 613.0, 609.0, 601.0, 578.0, 574.0, 575.0, 522.0, 505.0, 529.0, 511.0, 546.0, 551.0, 540.0, 582.0, 561.0, 603.0, 644.0, 623.0, 692.0, 742.0, 831.0, 819.0, 912.0, 947.0, 1087.0, 1219.0, 1351.0, 1659.0, 2145.0], [755.0, 367.0, 360.0, 375.0, 390.0, 394.0, 454.0, 460.0, 533.0, 560.0, 537.0, 580.0, 600.0, 652.0, 711.0, 703.0, 725.0, 784.0, 820.0, 783.0, 787.0, 881.0, 947.0, 886.0, 934.0, 992.0, 830.0, 907.0, 983.0, 948.0, 905.0, 950.0, 940.0, 982.0, 921.0, 976.0, 1030.0, 997.0, 1021.0, 1034.0, 1087.0, 1082.0, 1228.0, 1289.0, 1369.0, 1537.0, 1840.0, 2283.0, 3251.0], [633.0, 235.0, 144.0, 101.0, 99.0, 83.0, 76.0, 79.0, 84.0, 70.0, 108.0, 104.0, 113.0, 139.0, 114.0, 139.0, 154.0, 180.0, 159.0, 205.0, 213.0, 229.0, 272.0, 302.0, 345.0, 302.0, 384.0, 411.0, 490.0, 478.0, 581.0, 645.0, 721.0, 727.0, 824.0, 915.0, 984.0, 1066.0, 1191.0, 1279.0, 1438.0, 1564.0, 1741.0, 1975.0, 2263.0, 2614.0, 3004.0, 3815.0, 5592.0], [743.0, 221.0, 110.0, 77.0, 62.0, 57.0, 47.0, 36.0, 42.0, 31.0, 43.0, 38.0, 35.0, 26.0, 36.0, 31.0, 34.0, 38.0, 40.0, 49.0, 45.0, 48.0, 59.0, 55.0, 64.0, 79.0, 64.0, 91.0, 90.0, 106.0, 127.0, 159.0, 183.0, 179.0, 179.0, 244.0, 265.0, 327.0, 391.0, 494.0, 549.0, 697.0, 901.0, 1051.0, 1463.0, 1928.0, 2651.0, 4184.0, 7645.0], [860.0, 231.0, 137.0, 93.0, 70.0, 54.0, 46.0, 37.0, 22.0, 28.0, 20.0, 27.0, 23.0, 24.0, 27.0, 23.0, 22.0, 19.0, 20.0, 16.0, 27.0, 29.0, 27.0, 18.0, 25.0, 22.0, 31.0, 23.0, 35.0, 36.0, 35.0, 34.0, 46.0, 52.0, 55.0, 63.0, 88.0, 109.0, 109.0, 127.0, 173.0, 206.0, 269.0, 366.0, 474.0, 693.0, 1253.0, 2081.0, 5133.0], [1062.0, 255.0, 143.0, 85.0, 63.0, 50.0, 31.0, 33.0, 28.0, 22.0, 26.0, 26.0, 20.0, 27.0, 26.0, 16.0, 17.0, 18.0, 14.0, 19.0, 11.0, 19.0, 16.0, 18.0, 19.0, 16.0, 11.0, 9.0, 19.0, 12.0, 15.0, 25.0, 25.0, 20.0, 23.0, 30.0, 31.0, 49.0, 41.0, 50.0, 57.0, 73.0, 94.0, 115.0, 193.0, 249.0, 419.0, 862.0, 2519.0], [1488.0, 386.0, 177.0, 76.0, 62.0, 46.0, 28.0, 46.0, 24.0, 18.0, 26.0, 19.0, 19.0, 18.0, 22.0, 12.0, 19.0, 20.0, 17.0, 13.0, 12.0, 8.0, 8.0, 8.0, 15.0, 12.0, 17.0, 16.0, 16.0, 9.0, 20.0, 12.0, 15.0, 16.0, 18.0, 16.0, 18.0, 19.0, 24.0, 31.0, 38.0, 35.0, 38.0, 45.0, 88.0, 109.0, 178.0, 406.0, 1219.0], [2136.0, 612.0, 213.0, 123.0, 64.0, 51.0, 41.0, 30.0, 19.0, 22.0, 24.0, 25.0, 27.0, 13.0, 11.0, 16.0, 11.0, 18.0, 13.0, 10.0, 13.0, 7.0, 13.0, 9.0, 12.0, 10.0, 8.0, 12.0, 10.0, 13.0, 10.0, 7.0, 16.0, 13.0, 9.0, 10.0, 12.0, 15.0, 10.0, 25.0, 26.0, 26.0, 20.0, 36.0, 34.0, 69.0, 80.0, 174.0, 623.0], [3060.0, 942.0, 376.0, 177.0, 101.0, 51.0, 43.0, 27.0, 20.0, 24.0, 22.0, 24.0, 23.0, 16.0, 21.0, 13.0, 10.0, 14.0, 13.0, 8.0, 9.0, 9.0, 11.0, 12.0, 12.0, 7.0, 5.0, 5.0, 15.0, 8.0, 10.0, 13.0, 18.0, 11.0, 11.0, 10.0, 20.0, 11.0, 17.0, 10.0, 13.0, 12.0, 17.0, 22.0, 26.0, 34.0, 47.0, 89.0, 309.0], [4163.0, 1564.0, 749.0, 339.0, 161.0, 94.0, 55.0, 54.0, 40.0, 24.0, 16.0, 19.0, 22.0, 15.0, 9.0, 14.0, 10.0, 12.0, 9.0, 9.0, 9.0, 8.0, 9.0, 10.0, 12.0, 11.0, 11.0, 6.0, 10.0, 3.0, 10.0, 8.0, 13.0, 5.0, 9.0, 8.0, 11.0, 9.0, 7.0, 13.0, 13.0, 14.0, 12.0, 19.0, 17.0, 33.0, 29.0, 48.0, 184.0], [5228.0, 2410.0, 1270.0, 636.0, 363.0, 191.0, 107.0, 93.0, 69.0, 27.0, 23.0, 22.0, 18.0, 14.0, 14.0, 11.0, 11.0, 7.0, 10.0, 9.0, 9.0, 10.0, 6.0, 10.0, 4.0, 7.0, 7.0, 7.0, 10.0, 14.0, 11.0, 9.0, 7.0, 9.0, 12.0, 8.0, 6.0, 11.0, 8.0, 8.0, 7.0, 12.0, 12.0, 8.0, 15.0, 17.0, 27.0, 37.0, 106.0], [5678.0, 3053.0, 1936.0, 1122.0, 697.0, 450.0, 290.0, 178.0, 111.0, 69.0, 42.0, 41.0, 37.0, 13.0, 22.0, 26.0, 13.0, 9.0, 17.0, 14.0, 11.0, 6.0, 12.0, 6.0, 6.0, 7.0, 3.0, 4.0, 8.0, 7.0, 5.0, 8.0, 9.0, 7.0, 6.0, 8.0, 7.0, 12.0, 5.0, 5.0, 9.0, 11.0, 12.0, 10.0, 17.0, 17.0, 11.0, 27.0, 71.0], [5523.0, 3716.0, 2537.0, 1727.0, 1221.0, 789.0, 571.0, 405.0, 269.0, 184.0, 150.0, 88.0, 81.0, 57.0, 34.0, 26.0, 24.0, 15.0, 21.0, 8.0, 11.0, 9.0, 17.0, 11.0, 8.0, 6.0, 8.0, 3.0, 7.0, 10.0, 7.0, 10.0, 3.0, 5.0, 3.0, 5.0, 1.0, 10.0, 10.0, 6.0, 8.0, 14.0, 13.0, 10.0, 8.0, 6.0, 14.0, 26.0, 50.0], [4593.0, 3506.0, 2911.0, 2177.0, 1733.0, 1427.0, 991.0, 807.0, 558.0, 427.0, 364.0, 242.0, 177.0, 156.0, 116.0, 80.0, 52.0, 48.0, 41.0, 31.0, 16.0, 24.0, 12.0, 14.0, 18.0, 15.0, 6.0, 11.0, 3.0, 12.0, 4.0, 6.0, 11.0, 5.0, 8.0, 5.0, 6.0, 6.0, 8.0, 7.0, 10.0, 6.0, 4.0, 7.0, 4.0, 9.0, 12.0, 18.0, 42.0], [3480.0, 3027.0, 2788.0, 2261.0, 2085.0, 1739.0, 1354.0, 1195.0, 894.0, 762.0, 661.0, 508.0, 379.0, 336.0, 281.0, 219.0, 149.0, 119.0, 81.0, 84.0, 44.0, 62.0, 37.0, 43.0, 29.0, 21.0, 16.0, 18.0, 11.0, 9.0, 5.0, 8.0, 11.0, 9.0, 7.0, 6.0, 6.0, 4.0, 5.0, 7.0, 8.0, 9.0, 3.0, 7.0, 6.0, 9.0, 9.0, 15.0, 32.0], [2379.0, 2051.0, 2270.0, 2152.0, 1924.0, 1740.0, 1632.0, 1512.0, 1300.0, 1185.0, 976.0, 841.0, 752.0, 591.0, 465.0, 453.0, 396.0, 311.0, 248.0, 201.0, 186.0, 132.0, 127.0, 86.0, 77.0, 61.0, 52.0, 49.0, 31.0, 23.0, 20.0, 22.0, 16.0, 14.0, 11.0, 11.0, 9.0, 4.0, 11.0, 3.0, 8.0, 10.0, 9.0, 10.0, 6.0, 4.0, 10.0, 14.0, 22.0], [1575.0, 1440.0, 1485.0, 1593.0, 1594.0, 1595.0, 1626.0, 1523.0, 1329.0, 1330.0, 1240.0, 1107.0, 964.0, 895.0, 769.0, 714.0, 667.0, 535.0, 506.0, 387.0, 368.0, 345.0, 265.0, 231.0, 206.0, 159.0, 121.0, 114.0, 81.0, 73.0, 61.0, 51.0, 54.0, 48.0, 35.0, 34.0, 23.0, 14.0, 21.0, 16.0, 11.0, 4.0, 7.0, 6.0, 7.0, 7.0, 9.0, 9.0, 19.0], [1052.0, 804.0, 905.0, 1020.0, 1172.0, 1212.0, 1180.0, 1274.0, 1240.0, 1254.0, 1220.0, 1200.0, 1114.0, 1103.0, 1071.0, 943.0, 858.0, 818.0, 718.0, 689.0, 589.0, 571.0, 503.0, 441.0, 390.0, 336.0, 314.0, 258.0, 222.0, 204.0, 154.0, 125.0, 125.0, 99.0, 83.0, 71.0, 59.0, 54.0, 35.0, 19.0, 28.0, 24.0, 18.0, 14.0, 10.0, 8.0, 10.0, 15.0, 17.0], [758.0, 521.0, 490.0, 540.0, 640.0, 750.0, 757.0, 848.0, 919.0, 972.0, 1029.0, 1026.0, 1112.0, 1025.0, 1085.0, 1006.0, 983.0, 970.0, 917.0, 891.0, 877.0, 806.0, 737.0, 710.0, 642.0, 584.0, 563.0, 480.0, 464.0, 406.0, 331.0, 329.0, 279.0, 227.0, 197.0, 169.0, 166.0, 143.0, 107.0, 57.0, 74.0, 68.0, 40.0, 43.0, 32.0, 19.0, 20.0, 17.0, 17.0], [577.0, 303.0, 270.0, 290.0, 337.0, 373.0, 476.0, 502.0, 589.0, 620.0, 725.0, 678.0, 822.0, 867.0, 834.0, 899.0, 951.0, 935.0, 949.0, 985.0, 956.0, 919.0, 919.0, 931.0, 799.0, 810.0, 761.0, 702.0, 684.0, 608.0, 581.0, 523.0, 514.0, 477.0, 420.0, 363.0, 293.0, 301.0, 250.0, 228.0, 182.0, 157.0, 128.0, 114.0, 82.0, 63.0, 47.0, 32.0, 31.0], [553.0, 212.0, 197.0, 169.0, 143.0, 209.0, 208.0, 228.0, 314.0, 359.0, 391.0, 493.0, 512.0, 562.0, 622.0, 650.0, 699.0, 793.0, 815.0, 797.0, 825.0, 900.0, 869.0, 895.0, 910.0, 878.0, 901.0, 837.0, 876.0, 832.0, 829.0, 761.0, 681.0, 680.0, 659.0, 588.0, 607.0, 506.0, 519.0, 467.0, 370.0, 352.0, 299.0, 268.0, 188.0, 155.0, 112.0, 86.0, 76.0], [532.0, 193.0, 124.0, 93.0, 91.0, 91.0, 104.0, 119.0, 152.0, 181.0, 193.0, 231.0, 287.0, 305.0, 346.0, 367.0, 448.0, 464.0, 557.0, 592.0, 662.0, 688.0, 714.0, 745.0, 793.0, 860.0, 896.0, 871.0, 881.0, 887.0, 904.0, 943.0, 923.0, 911.0, 867.0, 820.0, 836.0, 804.0, 767.0, 677.0, 637.0, 583.0, 599.0, 506.0, 439.0, 371.0, 326.0, 246.0, 160.0], [563.0, 167.0, 103.0, 79.0, 54.0, 57.0, 51.0, 64.0, 70.0, 84.0, 90.0, 102.0, 133.0, 150.0, 193.0, 205.0, 233.0, 280.0, 325.0, 350.0, 402.0, 457.0, 448.0, 514.0, 591.0, 649.0, 698.0, 734.0, 787.0, 844.0, 807.0, 831.0, 917.0, 904.0, 975.0, 954.0, 1014.0, 983.0, 989.0, 1026.0, 975.0, 927.0, 885.0, 897.0, 807.0, 703.0, 634.0, 516.0, 424.0], [542.0, 186.0, 103.0, 68.0, 43.0, 35.0, 33.0, 42.0, 30.0, 40.0, 39.0, 62.0, 50.0, 56.0, 80.0, 92.0, 109.0, 126.0, 160.0, 181.0, 206.0, 233.0, 259.0, 315.0, 349.0, 360.0, 439.0, 524.0, 550.0, 567.0, 653.0, 697.0, 827.0, 821.0, 930.0, 998.0, 977.0, 1020.0, 1111.0, 1146.0, 1188.0, 1206.0, 1182.0, 1164.0, 1137.0, 1172.0, 1117.0, 1011.0, 895.0], [523.0, 185.0, 96.0, 68.0, 48.0, 48.0, 25.0, 20.0, 23.0, 27.0, 17.0, 23.0, 28.0, 29.0, 36.0, 37.0, 45.0, 57.0, 62.0, 85.0, 91.0, 122.0, 136.0, 157.0, 181.0, 231.0, 271.0, 296.0, 312.0, 372.0, 412.0, 492.0, 520.0, 620.0, 693.0, 790.0, 868.0, 984.0, 1033.0, 1146.0, 1213.0, 1215.0, 1391.0, 1461.0, 1484.0, 1597.0, 1654.0, 1552.0, 1606.0], [522.0, 179.0, 111.0, 72.0, 53.0, 39.0, 30.0, 16.0, 19.0, 18.0, 15.0, 21.0, 16.0, 17.0, 22.0, 20.0, 28.0, 18.0, 30.0, 32.0, 34.0, 52.0, 61.0, 86.0, 78.0, 113.0, 105.0, 152.0, 165.0, 171.0, 232.0, 273.0, 337.0, 393.0, 452.0, 487.0, 593.0, 685.0, 809.0, 840.0, 1066.0, 1276.0, 1353.0, 1526.0, 1693.0, 1844.0, 2124.0, 2214.0, 2402.0], [524.0, 176.0, 106.0, 59.0, 47.0, 37.0, 35.0, 29.0, 22.0, 14.0, 15.0, 12.0, 22.0, 12.0, 12.0, 6.0, 12.0, 11.0, 8.0, 17.0, 19.0, 23.0, 23.0, 32.0, 34.0, 31.0, 52.0, 70.0, 77.0, 78.0, 113.0, 128.0, 159.0, 200.0, 257.0, 283.0, 335.0, 468.0, 495.0, 685.0, 758.0, 895.0, 1104.0, 1416.0, 1600.0, 1996.0, 2167.0, 2689.0, 3433.0], [521.0, 177.0, 109.0, 66.0, 47.0, 39.0, 25.0, 29.0, 27.0, 13.0, 14.0, 14.0, 13.0, 13.0, 11.0, 8.0, 14.0, 6.0, 9.0, 11.0, 15.0, 7.0, 6.0, 19.0, 9.0, 15.0, 17.0, 32.0, 19.0, 35.0, 48.0, 57.0, 69.0, 123.0, 106.0, 157.0, 199.0, 276.0, 307.0, 364.0, 483.0, 622.0, 788.0, 1104.0, 1302.0, 1671.0, 2138.0, 2940.0, 4140.0], [509.0, 184.0, 106.0, 55.0, 43.0, 35.0, 21.0, 26.0, 18.0, 19.0, 15.0, 18.0, 15.0, 14.0, 13.0, 13.0, 6.0, 11.0, 5.0, 7.0, 6.0, 8.0, 13.0, 5.0, 11.0, 9.0, 8.0, 15.0, 17.0, 18.0, 19.0, 23.0, 23.0, 52.0, 58.0, 76.0, 92.0, 142.0, 159.0, 200.0, 288.0, 365.0, 495.0, 697.0, 944.0, 1266.0, 1914.0, 2752.0, 4372.0], [513.0, 191.0, 97.0, 73.0, 42.0, 34.0, 25.0, 25.0, 29.0, 19.0, 18.0, 22.0, 21.0, 10.0, 10.0, 9.0, 10.0, 4.0, 12.0, 5.0, 5.0, 4.0, 9.0, 4.0, 10.0, 7.0, 5.0, 5.0, 6.0, 10.0, 13.0, 13.0, 18.0, 19.0, 24.0, 34.0, 32.0, 51.0, 84.0, 93.0, 136.0, 198.0, 285.0, 407.0, 598.0, 864.0, 1450.0, 2304.0, 4245.0], [520.0, 177.0, 91.0, 63.0, 49.0, 38.0, 20.0, 26.0, 19.0, 15.0, 15.0, 17.0, 15.0, 13.0, 19.0, 13.0, 10.0, 10.0, 14.0, 4.0, 8.0, 5.0, 9.0, 3.0, 4.0, 11.0, 6.0, 6.0, 6.0, 3.0, 4.0, 10.0, 7.0, 5.0, 14.0, 11.0, 13.0, 13.0, 37.0, 42.0, 75.0, 109.0, 151.0, 212.0, 320.0, 542.0, 965.0, 1717.0, 3720.0], [521.0, 187.0, 99.0, 67.0, 42.0, 37.0, 21.0, 23.0, 23.0, 22.0, 12.0, 18.0, 14.0, 16.0, 13.0, 14.0, 9.0, 4.0, 6.0, 6.0, 3.0, 6.0, 6.0, 9.0, 9.0, 7.0, 7.0, 5.0, 10.0, 4.0, 4.0, 9.0, 6.0, 6.0, 5.0, 8.0, 7.0, 14.0, 14.0, 19.0, 34.0, 43.0, 76.0, 115.0, 182.0, 321.0, 583.0, 1189.0, 2902.0], [490.0, 194.0, 83.0, 59.0, 48.0, 17.0, 23.0, 32.0, 22.0, 14.0, 17.0, 16.0, 5.0, 9.0, 13.0, 7.0, 9.0, 9.0, 15.0, 11.0, 6.0, 6.0, 6.0, 7.0, 9.0, 5.0, 8.0, 5.0, 9.0, 6.0, 2.0, 4.0, 7.0, 7.0, 5.0, 8.0, 6.0, 10.0, 12.0, 11.0, 11.0, 12.0, 34.0, 65.0, 95.0, 143.0, 310.0, 718.0, 2166.0], [523.0, 179.0, 91.0, 71.0, 53.0, 39.0, 25.0, 18.0, 13.0, 12.0, 20.0, 17.0, 17.0, 7.0, 14.0, 15.0, 11.0, 8.0, 6.0, 7.0, 14.0, 7.0, 5.0, 3.0, 3.0, 13.0, 6.0, 3.0, 6.0, 8.0, 2.0, 5.0, 1.0, 6.0, 7.0, 6.0, 6.0, 6.0, 3.0, 9.0, 6.0, 10.0, 12.0, 16.0, 37.0, 66.0, 184.0, 446.0, 1453.0], [511.0, 201.0, 94.0, 66.0, 33.0, 34.0, 40.0, 23.0, 16.0, 20.0, 20.0, 13.0, 12.0, 19.0, 17.0, 8.0, 3.0, 4.0, 8.0, 7.0, 6.0, 7.0, 10.0, 6.0, 4.0, 9.0, 4.0, 8.0, 5.0, 7.0, 3.0, 7.0, 6.0, 1.0, 10.0, 4.0, 6.0, 6.0, 8.0, 7.0, 8.0, 9.0, 5.0, 15.0, 21.0, 42.0, 78.0, 252.0, 961.0], [519.0, 157.0, 97.0, 61.0, 48.0, 34.0, 36.0, 17.0, 17.0, 16.0, 14.0, 16.0, 17.0, 10.0, 10.0, 9.0, 12.0, 15.0, 10.0, 7.0, 7.0, 4.0, 6.0, 8.0, 5.0, 5.0, 5.0, 5.0, 6.0, 5.0, 2.0, 8.0, 3.0, 4.0, 9.0, 8.0, 6.0, 5.0, 5.0, 4.0, 8.0, 8.0, 4.0, 9.0, 12.0, 23.0, 50.0, 122.0, 630.0], [519.0, 153.0, 113.0, 70.0, 49.0, 29.0, 24.0, 23.0, 23.0, 17.0, 15.0, 23.0, 11.0, 7.0, 12.0, 10.0, 9.0, 7.0, 13.0, 6.0, 10.0, 4.0, 4.0, 8.0, 6.0, 5.0, 5.0, 10.0, 9.0, 7.0, 4.0, 5.0, 5.0, 3.0, 6.0, 2.0, 6.0, 5.0, 7.0, 5.0, 4.0, 3.0, 6.0, 6.0, 7.0, 10.0, 24.0, 65.0, 328.0], [558.0, 156.0, 78.0, 70.0, 45.0, 42.0, 29.0, 23.0, 14.0, 17.0, 17.0, 22.0, 9.0, 12.0, 9.0, 12.0, 4.0, 14.0, 7.0, 8.0, 11.0, 6.0, 6.0, 6.0, 7.0, 4.0, 7.0, 7.0, 7.0, 7.0, 1.0, 3.0, 4.0, 6.0, 6.0, 3.0, 3.0, 7.0, 7.0, 6.0, 2.0, 6.0, 7.0, 7.0, 7.0, 7.0, 16.0, 36.0, 222.0], [497.0, 173.0, 91.0, 59.0, 44.0, 32.0, 38.0, 19.0, 22.0, 20.0, 21.0, 12.0, 12.0, 24.0, 9.0, 8.0, 6.0, 3.0, 14.0, 6.0, 4.0, 11.0, 5.0, 5.0, 2.0, 6.0, 4.0, 4.0, 5.0, 5.0, 6.0, 6.0, 4.0, 6.0, 6.0, 5.0, 5.0, 4.0, 4.0, 10.0, 2.0, 7.0, 6.0, 6.0, 7.0, 4.0, 13.0, 28.0, 105.0], [509.0, 171.0, 92.0, 65.0, 39.0, 39.0, 41.0, 19.0, 17.0, 15.0, 19.0, 15.0, 14.0, 13.0, 11.0, 12.0, 11.0, 6.0, 10.0, 9.0, 4.0, 7.0, 4.0, 1.0, 5.0, 9.0, 10.0, 6.0, 11.0, 1.0, 10.0, 5.0, 5.0, 6.0, 3.0, 4.0, 4.0, 4.0, 5.0, 6.0, 4.0, 6.0, 4.0, 5.0, 8.0, 5.0, 7.0, 20.0, 80.0], [486.0, 203.0, 94.0, 62.0, 41.0, 32.0, 22.0, 33.0, 16.0, 22.0, 18.0, 19.0, 15.0, 13.0, 9.0, 9.0, 10.0, 5.0, 2.0, 9.0, 8.0, 9.0, 4.0, 5.0, 10.0, 4.0, 7.0, 5.0, 6.0, 1.0, 8.0, 1.0, 8.0, 7.0, 6.0, 4.0, 5.0, 2.0, 5.0, 8.0, 7.0, 1.0, 4.0, 6.0, 8.0, 5.0, 12.0, 17.0, 37.0], [494.0, 202.0, 88.0, 66.0, 49.0, 30.0, 26.0, 25.0, 16.0, 16.0, 21.0, 20.0, 8.0, 7.0, 14.0, 11.0, 9.0, 5.0, 12.0, 6.0, 5.0, 9.0, 6.0, 9.0, 5.0, 5.0, 8.0, 2.0, 5.0, 7.0, 3.0, 5.0, 4.0, 3.0, 4.0, 4.0, 4.0, 4.0, 5.0, 5.0, 7.0, 5.0, 12.0, 9.0, 5.0, 4.0, 8.0, 7.0, 29.0], [536.0, 193.0, 79.0, 56.0, 51.0, 37.0, 24.0, 26.0, 18.0, 18.0, 16.0, 20.0, 16.0, 9.0, 11.0, 13.0, 8.0, 3.0, 7.0, 7.0, 5.0, 10.0, 7.0, 3.0, 9.0, 6.0, 7.0, 5.0, 8.0, 4.0, 8.0, 8.0, 0.0, 8.0, 6.0, 5.0, 5.0, 5.0, 3.0, 4.0, 3.0, 3.0, 5.0, 5.0, 9.0, 8.0, 6.0, 10.0, 25.0], [530.0, 166.0, 90.0, 68.0, 48.0, 37.0, 30.0, 29.0, 18.0, 15.0, 19.0, 19.0, 14.0, 10.0, 11.0, 13.0, 7.0, 5.0, 8.0, 5.0, 5.0, 10.0, 5.0, 6.0, 4.0, 6.0, 7.0, 5.0, 7.0, 9.0, 8.0, 2.0, 6.0, 10.0, 2.0, 7.0, 3.0, 3.0, 4.0, 4.0, 9.0, 6.0, 6.0, 6.0, 5.0, 8.0, 5.0, 7.0, 15.0]],
    "Name": "sCurve-0",
    "Overflow": 2498945.0,
    "Type": "Histo2d",
    "Underflow": 0.0,
    "x": {
        "AxisTitle": "Vcal",
        "Bins": 51,
        "High": 302.5,
        "Low": 47.5
    },
    "y": {
        "AxisTitle": "Occupancy",
        "Bins": 49,
        "High": 49.5,
        "Low": 0.5
    },
    "z": {
        "AxisTitle": "Number of pixels"
    }
}