{
    "Data": [0.0, 0.0, 0.0, 0.0, 0.0, 0.0, 0.0, 0.0, 0.0, 0.0, 0.0, 0.0, 0.0, 0.0, 0.0, 0.0, 0.0, 0.0, 0.0, 0.0, 0.0, 0.0, 0.0, 0.0, 0.0, 0.0, 0.0, 0.0, 0.0, 0.0, 0.0, 0.0, 0.0, 0.0, 0.0, 0.0, 0.0, 0.0, 0.0, 0.0, 0.0, 0.0, 0.0, 0.0, 0.0, 0.0, 0.0, 0.0, 0.0, 0.0, 19.0, 42.0, 46.0, 70.0, 62.0, 98.0, 121.0, 110.0, 143.0, 168.0, 176.0, 206.0, 238.0, 248.0, 275.0, 305.0, 302.0, 389.0, 416.0, 448.0, 485.0, 579.0, 571.0, 605.0, 694.0, 711.0, 743.0, 830.0, 779.0, 797.0, 915.0, 964.0, 1079.0, 1279.0, 1395.0, 1657.0, 2128.0, 2375.0, 2659.0, 2834.0, 2969.0, 2756.0, 2734.0, 2534.0, 2198.0, 1876.0, 1515.0, 1237.0, 957.0, 804.0, 638.0, 519.0, 426.0, 361.0, 300.0, 282.0, 233.0, 172.0, 136.0, 136.0, 109.0, 105.0, 71.0, 62.0, 59.0, 46.0, 41.0, 33.0, 43.0, 33.0, 23.0, 25.0, 22.0, 25.0, 23.0, 18.0, 9.0, 14.0, 22.0, 11.0, 12.0, 15.0, 13.0, 18.0, 16.0, 10.0, 10.0, 5.0, 1.0, 8.0, 7.0, 7.0, 8.0, 7.0, 4.0, 6.0, 6.0, 2.0, 1.0, 5.0, 1.0, 3.0, 2.0, 3.0, 7.0, 4.0, 11.0, 6.0, 5.0, 19.0, 14.0, 7.0, 18.0, 19.0, 25.0, 23.0, 35.0, 54.0, 52.0, 52.0, 60.0, 76.0, 122.0, 111.0, 126.0, 156.0, 155.0, 199.0, 241.0, 266.0, 261.0, 277.0, 351.0, 398.0, 399.0, 429.0, 483.0, 544.0, 553.0, 612.0, 633.0, 684.0, 698.0, 743.0, 775.0, 813.0, 769.0, 809.0, 718.0, 847.0, 807.0, 870.0, 762.0, 733.0, 744.0, 682.0, 683.0, 584.0, 603.0, 487.0, 516.0, 420.0, 391.0, 354.0, 299.0, 284.0, 248.0, 214.0, 168.0, 149.0, 146.0, 135.0, 107.0, 85.0, 74.0, 58.0, 47.0, 39.0, 35.0, 24.0, 21.0, 22.0, 11.0, 9.0, 7.0, 10.0, 1.0, 4.0, 5.0, 3.0, 1.0, 2.0, 0.0, 0.0, 0.0, 0.0, 0.0, 0.0, 0.0, 0.0, 0.0, 0.0, 0.0, 0.0, 0.0, 0.0, 0.0, 0.0, 0.0, 0.0, 0.0, 0.0, 1.0, 0.0, 0.0, 0.0, 0.0, 0.0, 0.0, 0.0, 0.0, 0.0, 0.0, 0.0, 0.0, 0.0, 0.0, 0.0, 0.0, 0.0, 0.0, 0.0, 0.0, 0.0, 0.0, 0.0, 0.0, 0.0, 0.0, 0.0, 0.0, 0.0, 0.0, 0.0, 0.0, 0.0, 0.0, 0.0, 0.0, 0.0, 0.0, 0.0, 0.0, 0.0, 0.0, 0.0, 0.0, 0.0, 0.0, 0.0, 0.0, 0.0, 0.0, 0.0, 0.0, 0.0, 0.0, 0.0, 0.0, 0.0, 0.0, 0.0, 0.0, 0.0, 0.0, 0.0, 0.0, 0.0, 0.0, 0.0, 0.0, 0.0, 0.0, 0.0, 0.0, 0.0, 0.0, 0.0, 0.0, 0.0, 0.0, 0.0, 0.0, 0.0, 0.0, 0.0, 0.0, 0.0, 0.0, 0.0, 0.0, 0.0, 0.0, 0.0, 0.0, 0.0, 0.0, 0.0, 0.0, 0.0, 0.0, 0.0, 0.0, 0.0, 0.0, 0.0, 0.0, 0.0, 0.0, 0.0, 0.0, 0.0, 0.0, 0.0, 0.0, 0.0, 0.0, 0.0, 0.0, 0.0, 0.0, 0.0, 0.0],
    "Name": "ThresholdDist-0",
    "Overflow": 0.0,
    "Type": "Histo1d",
    "Underflow": 0.0,
    "x": {
        "AxisTitle": "Threshold [e]",
        "Bins": 383,
        "High": 3825.0,
        "Low": -5.0
    },
    "y": {
        "AxisTitle": "Number of Pixels"
    },
    "z": {
        "AxisTitle": "z"
    }
}