{
    "Data": [[1126.0, 367.0, 143.0, 93.0, 66.0, 56.0, 36.0, 34.0, 29.0, 19.0, 21.0, 24.0, 24.0, 14.0, 13.0, 11.0, 16.0, 12.0, 8.0, 10.0, 16.0, 4.0, 3.0, 2.0, 6.0, 2.0, 6.0, 3.0, 5.0, 6.0, 5.0, 9.0, 2.0, 9.0, 4.0, 8.0, 1.0, 3.0, 7.0, 8.0, 4.0, 11.0, 3.0, 3.0, 2.0, 7.0, 9.0, 8.0, 15.0], [2119.0, 739.0, 362.0, 226.0, 145.0, 110.0, 83.0, 62.0, 55.0, 40.0, 42.0, 33.0, 28.0, 29.0, 17.0, 20.0, 20.0, 26.0, 17.0, 20.0, 13.0, 10.0, 17.0, 9.0, 9.0, 9.0, 10.0, 12.0, 12.0, 11.0, 11.0, 5.0, 10.0, 6.0, 3.0, 10.0, 8.0, 4.0, 5.0, 10.0, 5.0, 6.0, 3.0, 11.0, 5.0, 10.0, 8.0, 13.0, 22.0], [3402.0, 1445.0, 785.0, 567.0, 336.0, 234.0, 203.0, 149.0, 121.0, 93.0, 88.0, 71.0, 58.0, 63.0, 58.0, 44.0, 45.0, 30.0, 29.0, 25.0, 26.0, 30.0, 11.0, 21.0, 15.0, 20.0, 19.0, 19.0, 22.0, 18.0, 16.0, 10.0, 14.0, 16.0, 10.0, 17.0, 10.0, 13.0, 10.0, 8.0, 14.0, 11.0, 10.0, 13.0, 12.0, 14.0, 16.0, 15.0, 25.0], [4147.0, 2191.0, 1369.0, 958.0, 724.0, 561.0, 386.0, 373.0, 311.0, 241.0, 179.0, 184.0, 148.0, 158.0, 112.0, 118.0, 103.0, 80.0, 71.0, 72.0, 63.0, 66.0, 50.0, 45.0, 31.0, 47.0, 28.0, 35.0, 23.0, 37.0, 29.0, 29.0, 24.0, 14.0, 23.0, 24.0, 25.0, 20.0, 21.0, 20.0, 27.0, 12.0, 18.0, 21.0, 21.0, 16.0, 27.0, 31.0, 30.0], [4486.0, 2477.0, 1761.0, 1429.0, 1148.0, 916.0, 777.0, 704.0, 573.0, 464.0, 462.0, 382.0, 352.0, 298.0, 287.0, 260.0, 233.0, 183.0, 180.0, 179.0, 145.0, 157.0, 142.0, 105.0, 103.0, 114.0, 75.0, 92.0, 83.0, 74.0, 68.0, 74.0, 62.0, 67.0, 57.0, 41.0, 41.0, 40.0, 36.0, 35.0, 34.0, 38.0, 38.0, 45.0, 41.0, 40.0, 38.0, 40.0, 59.0], [6679.0, 3216.0, 2021.0, 1578.0, 1321.0, 1112.0, 948.0, 944.0, 767.0, 780.0, 666.0, 671.0, 587.0, 520.0, 524.0, 448.0, 402.0, 413.0, 386.0, 337.0, 305.0, 306.0, 285.0, 285.0, 244.0, 219.0, 208.0, 183.0, 162.0, 181.0, 165.0, 170.0, 160.0, 126.0, 129.0, 124.0, 115.0, 97.0, 85.0, 88.0, 82.0, 86.0, 89.0, 86.0, 78.0, 100.0, 83.0, 81.0, 96.0], [6656.0, 5052.0, 3817.0, 2942.0, 2329.0, 1893.0, 1546.0, 1303.0, 1108.0, 1037.0, 908.0, 798.0, 704.0, 715.0, 614.0, 637.0, 596.0, 571.0, 546.0, 520.0, 546.0, 489.0, 454.0, 496.0, 440.0, 427.0, 412.0, 423.0, 396.0, 397.0, 337.0, 349.0, 306.0, 282.0, 311.0, 268.0, 276.0, 253.0, 268.0, 222.0, 215.0, 213.0, 208.0, 225.0, 172.0, 207.0, 183.0, 180.0, 213.0], [1563.0, 1900.0, 2055.0, 2107.0, 2261.0, 2087.0, 2124.0, 2023.0, 1902.0, 1854.0, 1822.0, 1647.0, 1533.0, 1469.0, 1413.0, 1264.0, 1214.0, 1141.0, 1055.0, 968.0, 963.0, 846.0, 787.0, 780.0, 650.0, 676.0, 587.0, 618.0, 591.0, 601.0, 579.0, 575.0, 523.0, 526.0, 490.0, 552.0, 497.0, 514.0, 503.0, 484.0, 446.0, 474.0, 482.0, 419.0, 443.0, 448.0, 466.0, 458.0, 445.0], [335.0, 338.0, 357.0, 369.0, 457.0, 533.0, 585.0, 648.0, 694.0, 764.0, 868.0, 921.0, 964.0, 1063.0, 1113.0, 1153.0, 1158.0, 1245.0, 1304.0, 1361.0, 1286.0, 1334.0, 1421.0, 1348.0, 1313.0, 1385.0, 1357.0, 1431.0, 1407.0, 1341.0, 1280.0, 1320.0, 1274.0, 1196.0, 1182.0, 1150.0, 1085.0, 1027.0, 997.0, 973.0, 909.0, 892.0, 923.0, 859.0, 960.0, 923.0, 923.0, 929.0, 1169.0], [177.0, 102.0, 128.0, 100.0, 96.0, 106.0, 137.0, 123.0, 135.0, 155.0, 179.0, 185.0, 236.0, 243.0, 245.0, 273.0, 297.0, 334.0, 417.0, 412.0, 471.0, 525.0, 546.0, 548.0, 667.0, 688.0, 762.0, 835.0, 922.0, 999.0, 1085.0, 1065.0, 1283.0, 1311.0, 1484.0, 1541.0, 1668.0, 1710.0, 1881.0, 1928.0, 2096.0, 2221.0, 2236.0, 2360.0, 2413.0, 2500.0, 2405.0, 2675.0, 2707.0], [131.0, 86.0, 68.0, 50.0, 39.0, 39.0, 43.0, 53.0, 42.0, 53.0, 46.0, 66.0, 56.0, 64.0, 60.0, 78.0, 61.0, 86.0, 105.0, 91.0, 92.0, 141.0, 150.0, 159.0, 185.0, 191.0, 198.0, 223.0, 238.0, 282.0, 312.0, 370.0, 406.0, 454.0, 498.0, 579.0, 647.0, 794.0, 930.0, 1032.0, 1267.0, 1465.0, 1819.0, 2251.0, 2616.0, 3331.0, 4209.0, 5628.0, 7675.0], [132.0, 72.0, 36.0, 48.0, 25.0, 25.0, 30.0, 26.0, 19.0, 28.0, 29.0, 21.0, 26.0, 20.0, 21.0, 35.0, 34.0, 28.0, 38.0, 37.0, 33.0, 38.0, 47.0, 52.0, 50.0, 70.0, 57.0, 81.0, 81.0, 90.0, 87.0, 121.0, 137.0, 142.0, 162.0, 202.0, 244.0, 279.0, 304.0, 351.0, 487.0, 524.0, 684.0, 895.0, 1143.0, 1659.0, 2491.0, 4259.0, 8532.0], [160.0, 71.0, 46.0, 28.0, 28.0, 27.0, 15.0, 16.0, 13.0, 16.0, 18.0, 17.0, 17.0, 19.0, 19.0, 18.0, 19.0, 8.0, 18.0, 16.0, 21.0, 19.0, 19.0, 29.0, 18.0, 17.0, 32.0, 27.0, 36.0, 23.0, 41.0, 39.0, 49.0, 45.0, 77.0, 64.0, 81.0, 98.0, 114.0, 132.0, 162.0, 185.0, 272.0, 344.0, 470.0, 711.0, 1086.0, 1979.0, 5082.0], [236.0, 73.0, 36.0, 38.0, 27.0, 13.0, 17.0, 24.0, 13.0, 10.0, 11.0, 9.0, 11.0, 9.0, 13.0, 11.0, 13.0, 23.0, 10.0, 12.0, 6.0, 13.0, 18.0, 13.0, 6.0, 11.0, 14.0, 18.0, 15.0, 15.0, 18.0, 15.0, 22.0, 19.0, 16.0, 35.0, 35.0, 39.0, 48.0, 48.0, 67.0, 83.0, 88.0, 135.0, 204.0, 277.0, 425.0, 898.0, 2761.0], [431.0, 94.0, 51.0, 29.0, 26.0, 25.0, 13.0, 7.0, 14.0, 9.0, 11.0, 5.0, 8.0, 13.0, 10.0, 13.0, 7.0, 10.0, 3.0, 13.0, 10.0, 8.0, 9.0, 8.0, 7.0, 10.0, 12.0, 8.0, 12.0, 13.0, 12.0, 13.0, 7.0, 11.0, 17.0, 22.0, 15.0, 20.0, 12.0, 32.0, 25.0, 34.0, 48.0, 56.0, 85.0, 113.0, 196.0, 370.0, 1267.0], [789.0, 186.0, 61.0, 29.0, 17.0, 22.0, 18.0, 9.0, 8.0, 11.0, 13.0, 11.0, 9.0, 11.0, 8.0, 9.0, 9.0, 7.0, 6.0, 3.0, 3.0, 8.0, 16.0, 1.0, 8.0, 10.0, 9.0, 10.0, 9.0, 4.0, 8.0, 10.0, 5.0, 9.0, 9.0, 10.0, 13.0, 13.0, 10.0, 11.0, 18.0, 23.0, 31.0, 25.0, 42.0, 59.0, 79.0, 176.0, 621.0], [1346.0, 436.0, 162.0, 59.0, 22.0, 27.0, 16.0, 10.0, 8.0, 7.0, 7.0, 8.0, 7.0, 9.0, 7.0, 7.0, 7.0, 6.0, 3.0, 9.0, 9.0, 9.0, 4.0, 7.0, 3.0, 4.0, 5.0, 7.0, 8.0, 8.0, 7.0, 7.0, 5.0, 11.0, 10.0, 4.0, 3.0, 10.0, 9.0, 12.0, 8.0, 17.0, 16.0, 20.0, 20.0, 42.0, 51.0, 85.0, 275.0], [2407.0, 794.0, 340.0, 163.0, 67.0, 63.0, 19.0, 17.0, 16.0, 15.0, 8.0, 10.0, 8.0, 5.0, 8.0, 3.0, 8.0, 6.0, 8.0, 1.0, 5.0, 4.0, 8.0, 4.0, 3.0, 6.0, 6.0, 2.0, 7.0, 5.0, 6.0, 6.0, 6.0, 5.0, 4.0, 6.0, 7.0, 7.0, 6.0, 15.0, 4.0, 9.0, 16.0, 14.0, 17.0, 18.0, 32.0, 53.0, 142.0], [3363.0, 1470.0, 770.0, 389.0, 224.0, 144.0, 77.0, 56.0, 33.0, 24.0, 23.0, 16.0, 10.0, 19.0, 9.0, 8.0, 6.0, 7.0, 3.0, 3.0, 8.0, 2.0, 6.0, 4.0, 6.0, 1.0, 5.0, 1.0, 4.0, 0.0, 4.0, 7.0, 6.0, 3.0, 9.0, 3.0, 4.0, 4.0, 5.0, 9.0, 10.0, 5.0, 9.0, 10.0, 13.0, 20.0, 20.0, 41.0, 97.0], [4191.0, 2151.0, 1305.0, 820.0, 504.0, 357.0, 205.0, 149.0, 99.0, 77.0, 54.0, 36.0, 41.0, 34.0, 19.0, 12.0, 16.0, 13.0, 11.0, 5.0, 3.0, 7.0, 2.0, 2.0, 5.0, 3.0, 1.0, 5.0, 6.0, 3.0, 3.0, 7.0, 2.0, 0.0, 2.0, 1.0, 5.0, 8.0, 4.0, 3.0, 3.0, 6.0, 5.0, 11.0, 13.0, 9.0, 25.0, 33.0, 60.0], [4414.0, 2649.0, 1901.0, 1281.0, 896.0, 703.0, 505.0, 364.0, 254.0, 213.0, 164.0, 135.0, 104.0, 96.0, 64.0, 45.0, 40.0, 37.0, 22.0, 18.0, 11.0, 17.0, 9.0, 7.0, 3.0, 9.0, 4.0, 6.0, 4.0, 2.0, 4.0, 3.0, 4.0, 3.0, 1.0, 3.0, 2.0, 3.0, 3.0, 3.0, 7.0, 4.0, 1.0, 7.0, 9.0, 14.0, 7.0, 19.0, 57.0], [4025.0, 2776.0, 2258.0, 1669.0, 1264.0, 1002.0, 812.0, 620.0, 508.0, 418.0, 324.0, 306.0, 233.0, 222.0, 164.0, 139.0, 107.0, 91.0, 91.0, 63.0, 51.0, 39.0, 32.0, 21.0, 21.0, 24.0, 19.0, 13.0, 8.0, 12.0, 8.0, 4.0, 7.0, 4.0, 2.0, 3.0, 5.0, 3.0, 3.0, 2.0, 1.0, 2.0, 3.0, 7.0, 5.0, 6.0, 10.0, 15.0, 29.0], [3126.0, 2496.0, 2236.0, 1771.0, 1487.0, 1287.0, 1158.0, 925.0, 809.0, 742.0, 613.0, 526.0, 441.0, 380.0, 333.0, 311.0, 252.0, 221.0, 213.0, 148.0, 128.0, 124.0, 94.0, 81.0, 63.0, 55.0, 58.0, 39.0, 42.0, 16.0, 29.0, 22.0, 19.0, 12.0, 10.0, 17.0, 10.0, 10.0, 9.0, 9.0, 0.0, 4.0, 4.0, 5.0, 2.0, 2.0, 3.0, 23.0, 25.0], [2060.0, 1967.0, 1740.0, 1624.0, 1563.0, 1324.0, 1242.0, 1081.0, 1010.0, 981.0, 816.0, 752.0, 654.0, 633.0, 561.0, 462.0, 459.0, 395.0, 365.0, 316.0, 309.0, 259.0, 236.0, 196.0, 175.0, 127.0, 140.0, 133.0, 93.0, 91.0, 87.0, 74.0, 56.0, 46.0, 40.0, 50.0, 32.0, 29.0, 19.0, 17.0, 18.0, 14.0, 9.0, 4.0, 10.0, 5.0, 6.0, 10.0, 22.0], [1261.0, 1242.0, 1157.0, 1273.0, 1203.0, 1124.0, 1136.0, 1065.0, 1034.0, 968.0, 951.0, 888.0, 812.0, 792.0, 759.0, 654.0, 667.0, 609.0, 540.0, 549.0, 486.0, 455.0, 388.0, 396.0, 365.0, 333.0, 298.0, 256.0, 242.0, 216.0, 157.0, 187.0, 137.0, 132.0, 130.0, 94.0, 104.0, 87.0, 65.0, 55.0, 58.0, 44.0, 36.0, 23.0, 38.0, 26.0, 18.0, 14.0, 26.0], [722.0, 709.0, 719.0, 795.0, 772.0, 852.0, 845.0, 859.0, 886.0, 841.0, 862.0, 884.0, 859.0, 817.0, 788.0, 841.0, 792.0, 694.0, 679.0, 708.0, 647.0, 582.0, 563.0, 559.0, 521.0, 478.0, 422.0, 460.0, 405.0, 384.0, 334.0, 344.0, 303.0, 280.0, 277.0, 254.0, 228.0, 184.0, 182.0, 162.0, 124.0, 144.0, 98.0, 74.0, 85.0, 56.0, 53.0, 40.0, 42.0], [353.0, 352.0, 431.0, 419.0, 491.0, 545.0, 560.0, 555.0, 621.0, 628.0, 610.0, 677.0, 617.0, 685.0, 718.0, 674.0, 714.0, 729.0, 749.0, 700.0, 713.0, 726.0, 658.0, 644.0, 682.0, 650.0, 599.0, 616.0, 627.0, 550.0, 553.0, 515.0, 509.0, 502.0, 483.0, 419.0, 435.0, 378.0, 338.0, 321.0, 273.0, 280.0, 237.0, 244.0, 206.0, 162.0, 132.0, 121.0, 100.0], [181.0, 163.0, 226.0, 193.0, 267.0, 278.0, 305.0, 339.0, 363.0, 391.0, 416.0, 422.0, 500.0, 490.0, 538.0, 520.0, 541.0, 597.0, 595.0, 599.0, 618.0, 629.0, 626.0, 703.0, 684.0, 692.0, 621.0, 677.0, 694.0, 710.0, 688.0, 661.0, 638.0, 678.0, 675.0, 649.0, 626.0, 581.0, 533.0, 518.0, 528.0, 524.0, 527.0, 470.0, 411.0, 367.0, 361.0, 271.0, 236.0], [111.0, 79.0, 82.0, 105.0, 143.0, 123.0, 153.0, 162.0, 161.0, 200.0, 219.0, 230.0, 278.0, 300.0, 341.0, 383.0, 392.0, 375.0, 430.0, 424.0, 477.0, 496.0, 502.0, 565.0, 560.0, 576.0, 583.0, 625.0, 634.0, 709.0, 672.0, 736.0, 720.0, 791.0, 749.0, 731.0, 764.0, 744.0, 797.0, 766.0, 781.0, 726.0, 773.0, 767.0, 757.0, 655.0, 669.0, 609.0, 560.0], [91.0, 46.0, 41.0, 38.0, 43.0, 65.0, 76.0, 84.0, 84.0, 89.0, 114.0, 113.0, 126.0, 137.0, 185.0, 194.0, 198.0, 252.0, 212.0, 252.0, 314.0, 311.0, 327.0, 369.0, 374.0, 430.0, 441.0, 490.0, 535.0, 535.0, 624.0, 619.0, 661.0, 675.0, 744.0, 765.0, 797.0, 775.0, 862.0, 916.0, 929.0, 1012.0, 989.0, 1059.0, 1046.0, 1056.0, 1094.0, 1130.0, 1163.0], [75.0, 43.0, 21.0, 16.0, 16.0, 39.0, 26.0, 37.0, 33.0, 40.0, 47.0, 61.0, 44.0, 63.0, 82.0, 89.0, 96.0, 119.0, 125.0, 151.0, 140.0, 158.0, 186.0, 226.0, 233.0, 284.0, 312.0, 297.0, 337.0, 357.0, 405.0, 459.0, 482.0, 523.0, 585.0, 585.0, 741.0, 748.0, 756.0, 866.0, 966.0, 977.0, 1168.0, 1197.0, 1281.0, 1425.0, 1547.0, 1719.0, 1966.0], [77.0, 22.0, 19.0, 15.0, 12.0, 11.0, 7.0, 24.0, 21.0, 12.0, 13.0, 23.0, 25.0, 33.0, 26.0, 51.0, 52.0, 55.0, 72.0, 63.0, 93.0, 78.0, 89.0, 116.0, 113.0, 141.0, 148.0, 186.0, 177.0, 233.0, 254.0, 311.0, 291.0, 365.0, 365.0, 463.0, 476.0, 531.0, 648.0, 711.0, 777.0, 928.0, 1048.0, 1202.0, 1369.0, 1596.0, 1881.0, 2170.0, 2648.0], [66.0, 31.0, 21.0, 11.0, 5.0, 6.0, 5.0, 11.0, 7.0, 10.0, 11.0, 14.0, 16.0, 8.0, 11.0, 17.0, 22.0, 25.0, 17.0, 25.0, 30.0, 32.0, 30.0, 47.0, 57.0, 54.0, 54.0, 81.0, 92.0, 117.0, 133.0, 146.0, 176.0, 205.0, 269.0, 259.0, 302.0, 376.0, 426.0, 484.0, 596.0, 668.0, 824.0, 950.0, 1175.0, 1478.0, 1916.0, 2464.0, 3410.0], [68.0, 39.0, 15.0, 6.0, 4.0, 6.0, 4.0, 2.0, 9.0, 3.0, 8.0, 6.0, 7.0, 3.0, 8.0, 5.0, 7.0, 6.0, 12.0, 14.0, 11.0, 16.0, 19.0, 13.0, 11.0, 30.0, 28.0, 39.0, 39.0, 55.0, 55.0, 62.0, 84.0, 88.0, 101.0, 143.0, 168.0, 187.0, 236.0, 293.0, 344.0, 435.0, 605.0, 715.0, 925.0, 1152.0, 1641.0, 2336.0, 3767.0], [63.0, 28.0, 20.0, 18.0, 4.0, 5.0, 5.0, 4.0, 3.0, 6.0, 5.0, 3.0, 7.0, 2.0, 3.0, 5.0, 4.0, 5.0, 4.0, 4.0, 5.0, 9.0, 9.0, 11.0, 6.0, 5.0, 16.0, 17.0, 19.0, 9.0, 18.0, 26.0, 35.0, 48.0, 50.0, 68.0, 75.0, 87.0, 134.0, 126.0, 192.0, 279.0, 320.0, 453.0, 562.0, 812.0, 1244.0, 1986.0, 3605.0], [63.0, 29.0, 20.0, 15.0, 1.0, 4.0, 3.0, 7.0, 1.0, 2.0, 3.0, 3.0, 6.0, 4.0, 2.0, 6.0, 3.0, 3.0, 3.0, 3.0, 1.0, 3.0, 3.0, 4.0, 3.0, 6.0, 3.0, 8.0, 3.0, 6.0, 6.0, 6.0, 13.0, 10.0, 18.0, 26.0, 27.0, 45.0, 51.0, 71.0, 96.0, 134.0, 179.0, 247.0, 342.0, 489.0, 848.0, 1477.0, 3095.0], [74.0, 31.0, 17.0, 7.0, 10.0, 3.0, 6.0, 6.0, 3.0, 4.0, 2.0, 1.0, 3.0, 3.0, 4.0, 7.0, 5.0, 2.0, 4.0, 2.0, 2.0, 2.0, 1.0, 0.0, 3.0, 0.0, 1.0, 3.0, 2.0, 2.0, 3.0, 4.0, 2.0, 10.0, 7.0, 14.0, 10.0, 16.0, 22.0, 27.0, 46.0, 54.0, 84.0, 127.0, 167.0, 268.0, 511.0, 972.0, 2306.0], [63.0, 24.0, 22.0, 11.0, 7.0, 5.0, 3.0, 3.0, 3.0, 5.0, 27.0, 6.0, 5.0, 4.0, 2.0, 3.0, 3.0, 4.0, 3.0, 1.0, 1.0, 0.0, 1.0, 1.0, 0.0, 2.0, 0.0, 1.0, 3.0, 1.0, 0.0, 1.0, 1.0, 2.0, 3.0, 4.0, 5.0, 11.0, 11.0, 10.0, 12.0, 18.0, 30.0, 49.0, 92.0, 146.0, 267.0, 571.0, 1583.0], [61.0, 32.0, 14.0, 8.0, 6.0, 7.0, 4.0, 3.0, 4.0, 5.0, 4.0, 7.0, 5.0, 2.0, 2.0, 4.0, 2.0, 3.0, 2.0, 1.0, 0.0, 2.0, 1.0, 3.0, 1.0, 2.0, 0.0, 0.0, 0.0, 0.0, 1.0, 1.0, 0.0, 1.0, 2.0, 2.0, 1.0, 1.0, 4.0, 4.0, 5.0, 13.0, 7.0, 22.0, 40.0, 58.0, 118.0, 320.0, 981.0], [59.0, 29.0, 17.0, 9.0, 10.0, 9.0, 3.0, 4.0, 4.0, 4.0, 4.0, 4.0, 3.0, 6.0, 6.0, 2.0, 2.0, 1.0, 2.0, 1.0, 2.0, 1.0, 0.0, 3.0, 0.0, 2.0, 1.0, 0.0, 0.0, 0.0, 0.0, 0.0, 0.0, 0.0, 0.0, 0.0, 0.0, 1.0, 0.0, 3.0, 3.0, 4.0, 5.0, 6.0, 18.0, 31.0, 52.0, 144.0, 598.0], [64.0, 23.0, 10.0, 6.0, 11.0, 1.0, 4.0, 8.0, 4.0, 6.0, 1.0, 4.0, 3.0, 4.0, 5.0, 0.0, 2.0, 1.0, 2.0, 2.0, 1.0, 1.0, 2.0, 1.0, 2.0, 1.0, 0.0, 0.0, 0.0, 3.0, 0.0, 0.0, 1.0, 2.0, 0.0, 0.0, 0.0, 0.0, 0.0, 2.0, 1.0, 5.0, 0.0, 2.0, 6.0, 11.0, 21.0, 67.0, 342.0], [66.0, 27.0, 11.0, 12.0, 10.0, 5.0, 6.0, 1.0, 4.0, 4.0, 5.0, 4.0, 9.0, 3.0, 3.0, 5.0, 3.0, 1.0, 4.0, 2.0, 1.0, 1.0, 0.0, 1.0, 1.0, 1.0, 1.0, 2.0, 1.0, 0.0, 0.0, 0.0, 0.0, 1.0, 0.0, 0.0, 0.0, 0.0, 1.0, 0.0, 1.0, 2.0, 1.0, 3.0, 1.0, 4.0, 19.0, 34.0, 164.0], [68.0, 23.0, 17.0, 11.0, 5.0, 7.0, 3.0, 2.0, 3.0, 3.0, 1.0, 7.0, 2.0, 3.0, 8.0, 2.0, 2.0, 4.0, 2.0, 0.0, 3.0, 1.0, 1.0, 1.0, 0.0, 2.0, 0.0, 3.0, 1.0, 1.0, 0.0, 0.0, 0.0, 0.0, 0.0, 0.0, 2.0, 2.0, 1.0, 1.0, 0.0, 0.0, 2.0, 2.0, 0.0, 2.0, 4.0, 13.0, 71.0], [63.0, 35.0, 15.0, 11.0, 4.0, 7.0, 1.0, 4.0, 2.0, 3.0, 7.0, 6.0, 1.0, 2.0, 6.0, 2.0, 6.0, 2.0, 2.0, 0.0, 2.0, 1.0, 0.0, 1.0, 0.0, 1.0, 3.0, 0.0, 0.0, 2.0, 1.0, 0.0, 0.0, 1.0, 0.0, 0.0, 2.0, 0.0, 1.0, 1.0, 0.0, 1.0, 0.0, 1.0, 3.0, 1.0, 1.0, 2.0, 44.0], [64.0, 24.0, 11.0, 13.0, 8.0, 6.0, 4.0, 1.0, 1.0, 5.0, 9.0, 2.0, 3.0, 6.0, 3.0, 1.0, 3.0, 1.0, 0.0, 2.0, 2.0, 1.0, 5.0, 2.0, 1.0, 0.0, 0.0, 0.0, 2.0, 0.0, 1.0, 0.0, 0.0, 0.0, 0.0, 1.0, 1.0, 0.0, 1.0, 3.0, 0.0, 1.0, 1.0, 0.0, 0.0, 3.0, 3.0, 3.0, 23.0], [55.0, 32.0, 13.0, 9.0, 11.0, 4.0, 4.0, 5.0, 3.0, 2.0, 5.0, 4.0, 4.0, 4.0, 3.0, 2.0, 2.0, 3.0, 1.0, 2.0, 1.0, 2.0, 2.0, 0.0, 0.0, 3.0, 0.0, 1.0, 0.0, 3.0, 1.0, 1.0, 1.0, 0.0, 0.0, 1.0, 1.0, 0.0, 0.0, 0.0, 1.0, 0.0, 1.0, 0.0, 1.0, 1.0, 3.0, 3.0, 10.0], [70.0, 25.0, 6.0, 9.0, 8.0, 0.0, 4.0, 3.0, 6.0, 6.0, 1.0, 3.0, 3.0, 2.0, 1.0, 0.0, 6.0, 0.0, 3.0, 4.0, 0.0, 1.0, 3.0, 1.0, 1.0, 2.0, 0.0, 2.0, 0.0, 2.0, 0.0, 2.0, 1.0, 1.0, 0.0, 0.0, 1.0, 0.0, 0.0, 0.0, 1.0, 2.0, 0.0, 2.0, 1.0, 0.0, 1.0, 1.0, 10.0], [69.0, 31.0, 14.0, 8.0, 10.0, 8.0, 3.0, 2.0, 2.0, 2.0, 2.0, 3.0, 2.0, 6.0, 3.0, 0.0, 3.0, 4.0, 0.0, 3.0, 4.0, 1.0, 1.0, 1.0, 2.0, 0.0, 0.0, 1.0, 0.0, 0.0, 1.0, 1.0, 0.0, 1.0, 0.0, 1.0, 1.0, 0.0, 1.0, 0.0, 2.0, 1.0, 1.0, 1.0, 3.0, 0.0, 3.0, 0.0, 4.0], [60.0, 22.0, 13.0, 11.0, 10.0, 13.0, 3.0, 3.0, 3.0, 3.0, 2.0, 3.0, 4.0, 6.0, 4.0, 1.0, 3.0, 2.0, 1.0, 1.0, 2.0, 2.0, 4.0, 1.0, 0.0, 0.0, 0.0, 3.0, 0.0, 0.0, 0.0, 0.0, 0.0, 2.0, 0.0, 0.0, 0.0, 0.0, 0.0, 1.0, 1.0, 1.0, 1.0, 0.0, 0.0, 1.0, 0.0, 3.0, 3.0], [62.0, 31.0, 28.0, 6.0, 9.0, 7.0, 0.0, 4.0, 2.0, 1.0, 3.0, 6.0, 5.0, 6.0, 2.0, 3.0, 4.0, 0.0, 4.0, 1.0, 3.0, 2.0, 0.0, 1.0, 1.0, 2.0, 1.0, 0.0, 1.0, 0.0, 0.0, 0.0, 0.0, 1.0, 0.0, 0.0, 0.0, 0.0, 0.0, 1.0, 0.0, 1.0, 2.0, 1.0, 0.0, 1.0, 0.0, 1.0, 8.0], [67.0, 30.0, 16.0, 11.0, 6.0, 7.0, 2.0, 5.0, 3.0, 3.0, 3.0, 2.0, 5.0, 3.0, 6.0, 3.0, 3.0, 3.0, 3.0, 1.0, 0.0, 0.0, 0.0, 1.0, 1.0, 4.0, 0.0, 0.0, 1.0, 1.0, 0.0, 2.0, 0.0, 0.0, 0.0, 0.0, 2.0, 1.0, 0.0, 0.0, 0.0, 0.0, 1.0, 1.0, 0.0, 0.0, 1.0, 2.0, 2.0]],
    "Name": "sCurve-0",
    "Overflow": 2481382.0,
    "Type": "Histo2d",
    "Underflow": 0.0,
    "x": {
        "AxisTitle": "Vcal",
        "Bins": 51,
        "High": 302.5,
        "Low": 47.5
    },
    "y": {
        "AxisTitle": "Occupancy",
        "Bins": 49,
        "High": 49.5,
        "Low": 0.5
    },
    "z": {
        "AxisTitle": "Number of pixels"
    }
}