{
    "Data": [0.0, 0.0, 0.0, 0.0, 0.0, 0.0, 0.0, 0.0, 0.0, 0.0, 0.0, 0.0, 0.0, 0.0, 2.0, 1.0, 0.0, 36.0, 204.0, 44.0, 48.0, 1216.0, 3701.0, 993.0, 545.0, 2384.0, 4285.0, 1446.0, 636.0, 1685.0, 2357.0, 1117.0, 353.0, 472.0, 571.0, 440.0, 247.0, 485.0, 827.0, 672.0, 428.0, 857.0, 1856.0, 2246.0, 1470.0, 1505.0, 2393.0, 3498.0, 3006.0, 2466.0, 2431.0, 2656.0, 2661.0, 2118.0, 1981.0, 1895.0, 2069.0, 1881.0, 1490.0, 1449.0, 1421.0, 1239.0, 935.0, 810.0, 684.0, 676.0, 628.0, 535.0, 463.0, 430.0, 437.0, 406.0, 311.0, 242.0, 220.0, 230.0, 209.0, 184.0, 172.0, 175.0, 136.0, 113.0, 115.0, 110.0, 106.0, 84.0, 93.0, 68.0, 60.0, 76.0, 64.0, 52.0, 57.0, 49.0, 48.0, 53.0, 45.0, 33.0, 32.0, 31.0, 29.0, 23.0, 30.0, 21.0, 24.0, 23.0, 16.0, 17.0, 27.0, 25.0, 8.0, 11.0, 11.0, 15.0, 11.0, 12.0, 17.0, 16.0, 17.0, 9.0, 13.0, 16.0, 16.0, 6.0, 4.0, 7.0, 5.0, 7.0, 11.0, 13.0, 14.0, 13.0, 12.0, 7.0, 6.0, 11.0, 7.0, 9.0, 10.0, 8.0, 4.0, 3.0, 8.0, 11.0, 7.0, 1.0, 4.0, 1.0, 6.0, 8.0, 1.0, 4.0, 4.0, 4.0, 4.0, 9.0, 6.0, 3.0, 4.0, 3.0, 0.0, 3.0, 1.0, 1.0, 4.0, 4.0, 1.0, 1.0, 3.0, 5.0, 4.0, 2.0, 0.0, 0.0, 4.0, 0.0, 0.0, 0.0, 0.0, 1.0, 2.0, 2.0, 3.0, 1.0, 2.0, 1.0, 1.0, 1.0, 1.0, 0.0, 1.0, 0.0, 0.0, 0.0, 1.0, 1.0, 1.0, 0.0, 0.0, 0.0, 0.0],
    "Name": "TimePerFitDist-0",
    "Overflow": 81.0,
    "Type": "Histo1d",
    "Underflow": 0.0,
    "x": {
        "AxisTitle": "Fit Time [us]",
        "Bins": 201,
        "High": 401.0,
        "Low": -1.0
    },
    "y": {
        "AxisTitle": "Number of Pixels"
    },
    "z": {
        "AxisTitle": "z"
    }
}