time,Hardware,Voltage,Current
1625781437027,high-voltage-2,1,0.105987
time,Hardware,Voltage,Current
1625781437027,high-voltage-2,2,0.177991
time,Hardware,Voltage,Current
1625781437027,high-voltage-2,3,0.21739
time,Hardware,Voltage,Current
1625781437027,high-voltage-2,4,0.253687
time,Hardware,Voltage,Current
1625781437027,high-voltage-2,5,0.287674
time,Hardware,Voltage,Current
1625781437027,high-voltage-2,6,0.321064
time,Hardware,Voltage,Current
1625781437027,high-voltage-2,7,0.34937
time,Hardware,Voltage,Current
1625781437027,high-voltage-2,8,0.374094
time,Hardware,Voltage,Current
1625781437027,high-voltage-2,9,0.395823
time,Hardware,Voltage,Current
1625781437027,high-voltage-2,10,0.413785
time,Hardware,Voltage,Current
1625781437027,high-voltage-2,11,0.428946
time,Hardware,Voltage,Current
1625781437027,high-voltage-2,12,0.441319
time,Hardware,Voltage,Current
1625781437027,high-voltage-2,13,0.450881
time,Hardware,Voltage,Current
1625781437027,high-voltage-2,14,0.462723
time,Hardware,Voltage,Current
1625781437027,high-voltage-2,15,0.474311
time,Hardware,Voltage,Current
1625781437027,high-voltage-2,16,0.482836
time,Hardware,Voltage,Current
1625781437027,high-voltage-2,17,0.491895
time,Hardware,Voltage,Current
1625781437027,high-voltage-2,18,0.501501
time,Hardware,Voltage,Current
1625781437027,high-voltage-2,19,0.510406
time,Hardware,Voltage,Current
1625781437027,high-voltage-2,20,0.51944
time,Hardware,Voltage,Current
1625781437027,high-voltage-2,25,0.571061
time,Hardware,Voltage,Current
1625781437027,high-voltage-2,30,0.622017
time,Hardware,Voltage,Current
1625781437027,high-voltage-2,35,0.672584
time,Hardware,Voltage,Current
1625781437027,high-voltage-2,40,0.731338
time,Hardware,Voltage,Current
1625781437027,high-voltage-2,45,0.806204
time,Hardware,Voltage,Current
1625781437027,high-voltage-2,50,0.867968
time,Hardware,Voltage,Current
1625781437027,high-voltage-2,55,0.926816
time,Hardware,Voltage,Current
1625781437027,high-voltage-2,60,0.984108
time,Hardware,Voltage,Current
1625781437027,high-voltage-2,65,1.03851
time,Hardware,Voltage,Current
1625781437027,high-voltage-2,70,1.09235
time,Hardware,Voltage,Current
1625781437027,high-voltage-2,75,1.14382
time,Hardware,Voltage,Current
1625781437027,high-voltage-2,80,1.18965
time,Hardware,Voltage,Current
1625781437027,high-voltage-2,85,1.22694
time,Hardware,Voltage,Current
1625781437027,high-voltage-2,90,1.25929
time,Hardware,Voltage,Current
1625781437027,high-voltage-2,95,1.2862
time,Hardware,Voltage,Current
1625781437027,high-voltage-2,100,1.31082
