time,Hardware,Voltage,Current
1621380864142,high-voltage-2,1,0.297032
time,Hardware,Voltage,Current
1621380864142,high-voltage-2,2,0.360828
time,Hardware,Voltage,Current
1621380864142,high-voltage-2,3,0.403917
time,Hardware,Voltage,Current
1621380864142,high-voltage-2,4,0.444219
time,Hardware,Voltage,Current
1621380864142,high-voltage-2,5,0.481372
time,Hardware,Voltage,Current
1621380864142,high-voltage-2,6,0.519709
time,Hardware,Voltage,Current
1621380864142,high-voltage-2,7,0.556657
time,Hardware,Voltage,Current
1621380864142,high-voltage-2,8,0.594273
time,Hardware,Voltage,Current
1621380864142,high-voltage-2,9,0.630358
time,Hardware,Voltage,Current
1621380864142,high-voltage-2,10,0.664222
time,Hardware,Voltage,Current
1621380864142,high-voltage-2,11,0.700041
time,Hardware,Voltage,Current
1621380864142,high-voltage-2,12,0.730993
time,Hardware,Voltage,Current
1621380864142,high-voltage-2,13,0.762883
time,Hardware,Voltage,Current
1621380864142,high-voltage-2,14,0.788392
time,Hardware,Voltage,Current
1621380864142,high-voltage-2,15,0.814278
time,Hardware,Voltage,Current
1621380864142,high-voltage-2,16,0.838496
time,Hardware,Voltage,Current
1621380864142,high-voltage-2,17,0.85717
time,Hardware,Voltage,Current
1621380864142,high-voltage-2,18,0.878997
time,Hardware,Voltage,Current
1621380864142,high-voltage-2,19,0.896213
time,Hardware,Voltage,Current
1621380864142,high-voltage-2,20,0.915974
time,Hardware,Voltage,Current
1621380864142,high-voltage-2,25,0.999346
time,Hardware,Voltage,Current
1621380864142,high-voltage-2,30,1.07812
time,Hardware,Voltage,Current
1621380864142,high-voltage-2,35,1.16203
time,Hardware,Voltage,Current
1621380864142,high-voltage-2,40,1.25426
time,Hardware,Voltage,Current
1621380864142,high-voltage-2,45,1.37536
time,Hardware,Voltage,Current
1621380864142,high-voltage-2,50,1.46022
time,Hardware,Voltage,Current
1621380864142,high-voltage-2,55,1.53381
time,Hardware,Voltage,Current
1621380864142,high-voltage-2,60,1.60611
time,Hardware,Voltage,Current
1621380864142,high-voltage-2,65,1.67747
time,Hardware,Voltage,Current
1621380864142,high-voltage-2,70,1.7421
time,Hardware,Voltage,Current
1621380864142,high-voltage-2,75,1.80824
time,Hardware,Voltage,Current
1621380864142,high-voltage-2,80,1.87176
time,Hardware,Voltage,Current
1621380864142,high-voltage-2,85,1.93412
time,Hardware,Voltage,Current
1621380864142,high-voltage-2,90,1.9945
time,Hardware,Voltage,Current
1621380864142,high-voltage-2,95,2.05218
time,Hardware,Voltage,Current
1621380864142,high-voltage-2,100,2.11114
