{
    "Data": [[849.0, 215.0, 86.0, 33.0, 36.0, 16.0, 16.0, 6.0, 12.0, 6.0, 8.0, 4.0, 6.0, 5.0, 6.0, 4.0, 5.0, 8.0, 3.0, 0.0, 2.0, 2.0, 6.0, 1.0, 5.0, 4.0, 3.0, 1.0, 0.0, 1.0, 4.0, 3.0, 2.0, 0.0, 3.0, 3.0, 2.0, 2.0, 2.0, 0.0, 3.0, 2.0, 1.0, 1.0, 0.0, 0.0, 4.0, 4.0, 2.0], [1803.0, 564.0, 230.0, 150.0, 82.0, 54.0, 37.0, 18.0, 13.0, 14.0, 18.0, 13.0, 13.0, 8.0, 3.0, 6.0, 5.0, 5.0, 5.0, 0.0, 5.0, 8.0, 2.0, 2.0, 3.0, 4.0, 2.0, 2.0, 3.0, 3.0, 6.0, 4.0, 4.0, 3.0, 5.0, 3.0, 2.0, 4.0, 3.0, 4.0, 6.0, 2.0, 0.0, 3.0, 1.0, 5.0, 1.0, 5.0, 4.0], [3060.0, 1224.0, 701.0, 385.0, 262.0, 163.0, 117.0, 79.0, 73.0, 42.0, 36.0, 30.0, 21.0, 21.0, 23.0, 14.0, 21.0, 10.0, 4.0, 7.0, 5.0, 2.0, 7.0, 10.0, 3.0, 7.0, 3.0, 5.0, 9.0, 8.0, 0.0, 4.0, 2.0, 6.0, 6.0, 5.0, 7.0, 4.0, 1.0, 5.0, 6.0, 2.0, 6.0, 5.0, 4.0, 5.0, 7.0, 2.0, 13.0], [4157.0, 2096.0, 1266.0, 899.0, 634.0, 475.0, 323.0, 281.0, 237.0, 165.0, 137.0, 108.0, 98.0, 67.0, 56.0, 48.0, 37.0, 35.0, 24.0, 29.0, 15.0, 23.0, 14.0, 17.0, 21.0, 11.0, 13.0, 8.0, 7.0, 6.0, 8.0, 12.0, 7.0, 8.0, 9.0, 5.0, 4.0, 6.0, 6.0, 7.0, 8.0, 10.0, 7.0, 8.0, 8.0, 3.0, 8.0, 11.0, 13.0], [4208.0, 2620.0, 1877.0, 1434.0, 1134.0, 965.0, 813.0, 614.0, 538.0, 470.0, 401.0, 336.0, 269.0, 239.0, 199.0, 183.0, 167.0, 137.0, 119.0, 110.0, 78.0, 80.0, 66.0, 65.0, 55.0, 49.0, 34.0, 37.0, 37.0, 24.0, 28.0, 16.0, 26.0, 17.0, 16.0, 17.0, 16.0, 13.0, 11.0, 22.0, 9.0, 14.0, 7.0, 10.0, 10.0, 15.0, 15.0, 15.0, 26.0], [4473.0, 2401.0, 1901.0, 1599.0, 1430.0, 1205.0, 1148.0, 954.0, 930.0, 805.0, 723.0, 640.0, 605.0, 537.0, 520.0, 468.0, 420.0, 365.0, 349.0, 326.0, 291.0, 267.0, 207.0, 194.0, 171.0, 177.0, 154.0, 146.0, 125.0, 110.0, 92.0, 93.0, 81.0, 68.0, 64.0, 59.0, 53.0, 46.0, 44.0, 31.0, 40.0, 31.0, 35.0, 36.0, 22.0, 19.0, 31.0, 18.0, 41.0], [7435.0, 4082.0, 2627.0, 1883.0, 1441.0, 1256.0, 1168.0, 993.0, 994.0, 938.0, 868.0, 878.0, 806.0, 783.0, 726.0, 743.0, 686.0, 650.0, 655.0, 613.0, 544.0, 534.0, 484.0, 484.0, 507.0, 441.0, 445.0, 394.0, 322.0, 375.0, 337.0, 282.0, 253.0, 268.0, 243.0, 181.0, 197.0, 162.0, 177.0, 149.0, 123.0, 112.0, 111.0, 98.0, 99.0, 79.0, 80.0, 70.0, 72.0], [2803.0, 2993.0, 3019.0, 2928.0, 2610.0, 2431.0, 2205.0, 1969.0, 1801.0, 1572.0, 1433.0, 1229.0, 1188.0, 1059.0, 1025.0, 971.0, 894.0, 878.0, 805.0, 788.0, 808.0, 741.0, 689.0, 704.0, 705.0, 717.0, 659.0, 680.0, 629.0, 660.0, 631.0, 613.0, 581.0, 574.0, 565.0, 501.0, 497.0, 466.0, 486.0, 451.0, 425.0, 387.0, 350.0, 324.0, 333.0, 266.0, 255.0, 233.0, 229.0], [308.0, 257.0, 339.0, 404.0, 506.0, 607.0, 742.0, 802.0, 895.0, 1013.0, 1141.0, 1194.0, 1292.0, 1307.0, 1402.0, 1419.0, 1450.0, 1488.0, 1458.0, 1518.0, 1482.0, 1391.0, 1473.0, 1422.0, 1452.0, 1378.0, 1229.0, 1297.0, 1204.0, 1181.0, 1177.0, 1087.0, 1060.0, 1075.0, 1061.0, 1019.0, 1010.0, 945.0, 890.0, 946.0, 948.0, 899.0, 891.0, 851.0, 846.0, 798.0, 776.0, 796.0, 755.0], [237.0, 119.0, 80.0, 62.0, 53.0, 54.0, 71.0, 80.0, 77.0, 96.0, 123.0, 135.0, 156.0, 179.0, 204.0, 240.0, 257.0, 299.0, 358.0, 401.0, 465.0, 526.0, 575.0, 598.0, 760.0, 738.0, 871.0, 969.0, 1078.0, 1153.0, 1291.0, 1454.0, 1484.0, 1624.0, 1606.0, 1794.0, 1875.0, 2001.0, 2101.0, 2160.0, 2175.0, 2298.0, 2323.0, 2444.0, 2251.0, 2370.0, 2283.0, 2284.0, 2361.0], [315.0, 101.0, 57.0, 45.0, 40.0, 31.0, 31.0, 37.0, 22.0, 27.0, 34.0, 29.0, 30.0, 45.0, 38.0, 34.0, 45.0, 38.0, 57.0, 63.0, 61.0, 70.0, 90.0, 87.0, 90.0, 126.0, 135.0, 160.0, 199.0, 212.0, 235.0, 309.0, 318.0, 406.0, 453.0, 562.0, 648.0, 764.0, 886.0, 1130.0, 1296.0, 1638.0, 1960.0, 2443.0, 2952.0, 3884.0, 4754.0, 6301.0, 7932.0], [480.0, 83.0, 44.0, 38.0, 27.0, 32.0, 26.0, 27.0, 22.0, 12.0, 17.0, 14.0, 20.0, 25.0, 25.0, 29.0, 13.0, 17.0, 28.0, 19.0, 23.0, 20.0, 22.0, 25.0, 26.0, 37.0, 34.0, 58.0, 46.0, 56.0, 69.0, 62.0, 76.0, 104.0, 107.0, 133.0, 178.0, 218.0, 252.0, 284.0, 395.0, 470.0, 622.0, 875.0, 1151.0, 1675.0, 2582.0, 4321.0, 8934.0], [801.0, 137.0, 43.0, 25.0, 28.0, 16.0, 21.0, 17.0, 15.0, 15.0, 18.0, 17.0, 9.0, 18.0, 17.0, 11.0, 10.0, 14.0, 12.0, 12.0, 13.0, 5.0, 13.0, 13.0, 14.0, 18.0, 15.0, 28.0, 29.0, 26.0, 26.0, 21.0, 25.0, 28.0, 27.0, 42.0, 58.0, 49.0, 83.0, 74.0, 102.0, 134.0, 173.0, 235.0, 374.0, 609.0, 978.0, 1917.0, 5034.0], [1349.0, 236.0, 75.0, 44.0, 24.0, 15.0, 11.0, 18.0, 12.0, 8.0, 10.0, 15.0, 9.0, 12.0, 6.0, 6.0, 7.0, 11.0, 8.0, 7.0, 10.0, 8.0, 15.0, 6.0, 10.0, 13.0, 12.0, 13.0, 12.0, 15.0, 17.0, 14.0, 19.0, 16.0, 19.0, 19.0, 20.0, 28.0, 22.0, 32.0, 44.0, 44.0, 68.0, 84.0, 102.0, 210.0, 395.0, 783.0, 2504.0], [2039.0, 521.0, 191.0, 59.0, 32.0, 17.0, 19.0, 8.0, 4.0, 7.0, 8.0, 11.0, 12.0, 9.0, 7.0, 11.0, 4.0, 10.0, 6.0, 6.0, 5.0, 10.0, 7.0, 7.0, 5.0, 8.0, 9.0, 8.0, 9.0, 7.0, 12.0, 8.0, 11.0, 8.0, 13.0, 14.0, 17.0, 15.0, 20.0, 16.0, 20.0, 31.0, 34.0, 37.0, 60.0, 68.0, 118.0, 296.0, 1201.0], [3071.0, 985.0, 336.0, 137.0, 54.0, 28.0, 20.0, 19.0, 14.0, 14.0, 6.0, 5.0, 10.0, 7.0, 5.0, 12.0, 3.0, 13.0, 6.0, 7.0, 5.0, 3.0, 6.0, 6.0, 4.0, 4.0, 7.0, 7.0, 6.0, 8.0, 8.0, 6.0, 8.0, 10.0, 14.0, 11.0, 8.0, 12.0, 9.0, 14.0, 11.0, 18.0, 19.0, 23.0, 30.0, 36.0, 53.0, 127.0, 552.0], [4205.0, 1660.0, 744.0, 304.0, 114.0, 50.0, 37.0, 22.0, 16.0, 12.0, 3.0, 7.0, 7.0, 10.0, 4.0, 5.0, 5.0, 3.0, 3.0, 5.0, 3.0, 6.0, 4.0, 6.0, 6.0, 6.0, 7.0, 3.0, 5.0, 8.0, 5.0, 11.0, 4.0, 9.0, 6.0, 9.0, 10.0, 10.0, 7.0, 7.0, 6.0, 19.0, 11.0, 22.0, 18.0, 39.0, 30.0, 75.0, 248.0], [5046.0, 2494.0, 1270.0, 643.0, 316.0, 193.0, 93.0, 48.0, 40.0, 15.0, 22.0, 8.0, 5.0, 8.0, 5.0, 7.0, 4.0, 3.0, 2.0, 1.0, 8.0, 8.0, 3.0, 2.0, 3.0, 4.0, 4.0, 6.0, 1.0, 5.0, 5.0, 6.0, 5.0, 5.0, 3.0, 4.0, 11.0, 11.0, 7.0, 10.0, 13.0, 12.0, 10.0, 13.0, 16.0, 21.0, 26.0, 45.0, 134.0], [5529.0, 3255.0, 1969.0, 1194.0, 662.0, 409.0, 258.0, 167.0, 117.0, 78.0, 33.0, 24.0, 13.0, 10.0, 3.0, 6.0, 4.0, 2.0, 6.0, 2.0, 4.0, 2.0, 5.0, 3.0, 7.0, 3.0, 2.0, 2.0, 2.0, 3.0, 3.0, 4.0, 7.0, 3.0, 5.0, 4.0, 3.0, 5.0, 3.0, 7.0, 7.0, 7.0, 16.0, 11.0, 15.0, 14.0, 23.0, 46.0, 88.0], [5206.0, 3613.0, 2680.0, 1760.0, 1198.0, 862.0, 534.0, 387.0, 240.0, 181.0, 112.0, 74.0, 64.0, 34.0, 30.0, 17.0, 15.0, 14.0, 4.0, 3.0, 4.0, 2.0, 1.0, 0.0, 1.0, 2.0, 3.0, 1.0, 1.0, 0.0, 4.0, 2.0, 11.0, 4.0, 4.0, 4.0, 6.0, 3.0, 6.0, 4.0, 5.0, 6.0, 10.0, 6.0, 11.0, 8.0, 17.0, 29.0, 73.0], [4173.0, 3435.0, 2832.0, 2267.0, 1831.0, 1351.0, 1050.0, 780.0, 571.0, 419.0, 267.0, 231.0, 180.0, 125.0, 84.0, 58.0, 42.0, 35.0, 20.0, 19.0, 15.0, 12.0, 7.0, 7.0, 2.0, 5.0, 2.0, 0.0, 2.0, 2.0, 2.0, 0.0, 4.0, 2.0, 1.0, 4.0, 4.0, 2.0, 4.0, 4.0, 5.0, 4.0, 8.0, 10.0, 4.0, 7.0, 16.0, 28.0, 42.0], [3102.0, 2905.0, 2657.0, 2347.0, 2023.0, 1700.0, 1344.0, 1112.0, 871.0, 769.0, 543.0, 454.0, 389.0, 273.0, 194.0, 164.0, 147.0, 87.0, 77.0, 54.0, 47.0, 39.0, 19.0, 18.0, 11.0, 10.0, 2.0, 10.0, 2.0, 9.0, 3.0, 1.0, 1.0, 1.0, 2.0, 1.0, 2.0, 2.0, 1.0, 2.0, 2.0, 0.0, 2.0, 8.0, 6.0, 7.0, 15.0, 19.0, 32.0], [2002.0, 2015.0, 2247.0, 2091.0, 1939.0, 1868.0, 1678.0, 1408.0, 1258.0, 1070.0, 920.0, 799.0, 634.0, 527.0, 452.0, 366.0, 289.0, 217.0, 207.0, 150.0, 125.0, 99.0, 85.0, 49.0, 59.0, 31.0, 29.0, 15.0, 17.0, 14.0, 10.0, 11.0, 3.0, 3.0, 0.0, 0.0, 2.0, 8.0, 2.0, 4.0, 5.0, 4.0, 3.0, 1.0, 2.0, 5.0, 5.0, 9.0, 37.0], [1364.0, 1538.0, 1578.0, 1647.0, 1600.0, 1589.0, 1473.0, 1534.0, 1318.0, 1255.0, 1196.0, 982.0, 887.0, 837.0, 738.0, 579.0, 558.0, 489.0, 379.0, 315.0, 294.0, 252.0, 194.0, 173.0, 129.0, 124.0, 92.0, 81.0, 51.0, 27.0, 28.0, 33.0, 19.0, 19.0, 12.0, 12.0, 6.0, 3.0, 2.0, 1.0, 5.0, 2.0, 2.0, 2.0, 5.0, 5.0, 3.0, 3.0, 20.0], [808.0, 902.0, 1041.0, 1064.0, 1125.0, 1258.0, 1245.0, 1296.0, 1259.0, 1185.0, 1170.0, 1200.0, 1175.0, 1062.0, 944.0, 892.0, 835.0, 702.0, 621.0, 608.0, 552.0, 466.0, 387.0, 341.0, 307.0, 253.0, 226.0, 168.0, 128.0, 126.0, 96.0, 75.0, 67.0, 57.0, 52.0, 37.0, 27.0, 21.0, 14.0, 15.0, 10.0, 5.0, 5.0, 3.0, 5.0, 6.0, 2.0, 6.0, 20.0], [556.0, 655.0, 691.0, 707.0, 747.0, 830.0, 859.0, 947.0, 971.0, 1024.0, 1042.0, 1029.0, 1038.0, 1001.0, 991.0, 993.0, 911.0, 877.0, 886.0, 837.0, 806.0, 687.0, 633.0, 615.0, 508.0, 495.0, 437.0, 380.0, 294.0, 315.0, 213.0, 218.0, 153.0, 116.0, 113.0, 96.0, 80.0, 64.0, 60.0, 42.0, 37.0, 22.0, 12.0, 13.0, 15.0, 6.0, 5.0, 8.0, 10.0], [482.0, 410.0, 507.0, 465.0, 521.0, 544.0, 601.0, 624.0, 707.0, 690.0, 783.0, 816.0, 825.0, 918.0, 936.0, 919.0, 895.0, 921.0, 917.0, 873.0, 844.0, 830.0, 845.0, 742.0, 756.0, 683.0, 630.0, 575.0, 536.0, 514.0, 452.0, 417.0, 354.0, 321.0, 281.0, 219.0, 186.0, 162.0, 134.0, 112.0, 95.0, 66.0, 54.0, 41.0, 25.0, 21.0, 10.0, 14.0, 13.0], [320.0, 346.0, 389.0, 399.0, 398.0, 433.0, 416.0, 477.0, 476.0, 546.0, 517.0, 551.0, 646.0, 655.0, 626.0, 722.0, 752.0, 778.0, 765.0, 796.0, 812.0, 812.0, 828.0, 796.0, 845.0, 785.0, 790.0, 768.0, 733.0, 688.0, 659.0, 641.0, 575.0, 500.0, 455.0, 429.0, 390.0, 386.0, 299.0, 282.0, 242.0, 180.0, 135.0, 107.0, 78.0, 65.0, 35.0, 29.0, 19.0], [416.0, 385.0, 334.0, 312.0, 262.0, 284.0, 293.0, 310.0, 313.0, 335.0, 358.0, 368.0, 398.0, 410.0, 446.0, 481.0, 491.0, 523.0, 564.0, 629.0, 617.0, 679.0, 742.0, 684.0, 688.0, 762.0, 778.0, 753.0, 838.0, 858.0, 827.0, 780.0, 748.0, 788.0, 741.0, 707.0, 699.0, 595.0, 561.0, 508.0, 453.0, 346.0, 336.0, 291.0, 189.0, 170.0, 129.0, 82.0, 65.0], [318.0, 228.0, 218.0, 204.0, 179.0, 176.0, 180.0, 196.0, 205.0, 224.0, 233.0, 246.0, 246.0, 296.0, 289.0, 294.0, 322.0, 298.0, 399.0, 404.0, 451.0, 495.0, 490.0, 563.0, 614.0, 610.0, 702.0, 749.0, 759.0, 811.0, 756.0, 825.0, 883.0, 868.0, 957.0, 864.0, 948.0, 884.0, 849.0, 800.0, 751.0, 744.0, 613.0, 600.0, 520.0, 404.0, 322.0, 247.0, 178.0], [242.0, 182.0, 240.0, 242.0, 240.0, 200.0, 202.0, 220.0, 206.0, 204.0, 176.0, 193.0, 196.0, 194.0, 208.0, 243.0, 228.0, 232.0, 257.0, 251.0, 248.0, 306.0, 312.0, 365.0, 404.0, 475.0, 444.0, 498.0, 608.0, 599.0, 682.0, 719.0, 794.0, 839.0, 836.0, 836.0, 912.0, 940.0, 977.0, 1009.0, 973.0, 951.0, 920.0, 907.0, 885.0, 751.0, 629.0, 535.0, 398.0], [208.0, 215.0, 167.0, 171.0, 142.0, 127.0, 152.0, 184.0, 191.0, 165.0, 185.0, 159.0, 168.0, 229.0, 210.0, 218.0, 249.0, 235.0, 226.0, 216.0, 209.0, 225.0, 248.0, 236.0, 256.0, 323.0, 344.0, 359.0, 374.0, 403.0, 434.0, 525.0, 583.0, 664.0, 674.0, 810.0, 796.0, 887.0, 958.0, 983.0, 1021.0, 1125.0, 1180.0, 1203.0, 1187.0, 1166.0, 1096.0, 993.0, 818.0], [232.0, 198.0, 135.0, 204.0, 170.0, 138.0, 127.0, 118.0, 144.0, 134.0, 183.0, 172.0, 158.0, 132.0, 107.0, 157.0, 143.0, 138.0, 157.0, 150.0, 153.0, 182.0, 166.0, 138.0, 150.0, 155.0, 197.0, 223.0, 229.0, 285.0, 284.0, 335.0, 383.0, 445.0, 490.0, 579.0, 631.0, 748.0, 862.0, 910.0, 960.0, 1229.0, 1261.0, 1370.0, 1407.0, 1542.0, 1657.0, 1609.0, 1456.0], [103.0, 136.0, 110.0, 133.0, 183.0, 122.0, 85.0, 134.0, 89.0, 150.0, 155.0, 144.0, 159.0, 99.0, 111.0, 87.0, 126.0, 93.0, 111.0, 86.0, 108.0, 109.0, 135.0, 166.0, 150.0, 165.0, 152.0, 144.0, 178.0, 167.0, 208.0, 197.0, 210.0, 228.0, 267.0, 311.0, 413.0, 519.0, 573.0, 672.0, 812.0, 963.0, 1113.0, 1341.0, 1534.0, 1876.0, 2018.0, 2257.0, 2483.0], [152.0, 115.0, 97.0, 132.0, 153.0, 96.0, 183.0, 70.0, 144.0, 103.0, 62.0, 144.0, 142.0, 133.0, 89.0, 67.0, 111.0, 140.0, 119.0, 126.0, 112.0, 114.0, 149.0, 131.0, 124.0, 127.0, 126.0, 84.0, 70.0, 83.0, 115.0, 102.0, 142.0, 160.0, 191.0, 193.0, 237.0, 320.0, 371.0, 467.0, 558.0, 713.0, 853.0, 1064.0, 1331.0, 1722.0, 2107.0, 2517.0, 3262.0], [188.0, 168.0, 126.0, 145.0, 116.0, 133.0, 107.0, 119.0, 137.0, 90.0, 132.0, 96.0, 99.0, 90.0, 93.0, 91.0, 104.0, 105.0, 112.0, 115.0, 102.0, 105.0, 120.0, 168.0, 110.0, 143.0, 148.0, 135.0, 105.0, 92.0, 68.0, 126.0, 121.0, 120.0, 111.0, 144.0, 159.0, 161.0, 228.0, 267.0, 352.0, 418.0, 522.0, 774.0, 985.0, 1376.0, 1897.0, 2632.0, 3732.0], [123.0, 164.0, 168.0, 82.0, 153.0, 149.0, 195.0, 170.0, 147.0, 107.0, 110.0, 91.0, 56.0, 84.0, 130.0, 86.0, 113.0, 79.0, 139.0, 71.0, 98.0, 67.0, 120.0, 72.0, 61.0, 57.0, 67.0, 45.0, 75.0, 132.0, 114.0, 120.0, 56.0, 71.0, 75.0, 77.0, 75.0, 110.0, 117.0, 178.0, 155.0, 251.0, 294.0, 465.0, 635.0, 949.0, 1564.0, 2445.0, 4042.0], [155.0, 92.0, 133.0, 126.0, 101.0, 123.0, 146.0, 95.0, 130.0, 77.0, 137.0, 68.0, 115.0, 23.0, 75.0, 117.0, 66.0, 71.0, 114.0, 131.0, 177.0, 144.0, 88.0, 179.0, 169.0, 61.0, 85.0, 56.0, 79.0, 106.0, 113.0, 52.0, 71.0, 127.0, 82.0, 46.0, 138.0, 98.0, 111.0, 80.0, 101.0, 135.0, 213.0, 334.0, 398.0, 650.0, 1069.0, 1760.0, 3692.0], [138.0, 67.0, 124.0, 134.0, 76.0, 46.0, 116.0, 152.0, 77.0, 110.0, 96.0, 116.0, 164.0, 192.0, 166.0, 132.0, 125.0, 125.0, 90.0, 65.0, 61.0, 86.0, 45.0, 123.0, 94.0, 202.0, 108.0, 102.0, 120.0, 77.0, 43.0, 64.0, 29.0, 67.0, 90.0, 97.0, 71.0, 29.0, 66.0, 105.0, 101.0, 163.0, 90.0, 168.0, 238.0, 374.0, 745.0, 1324.0, 2941.0], [194.0, 159.0, 159.0, 69.0, 217.0, 101.0, 121.0, 44.0, 104.0, 146.0, 118.0, 117.0, 97.0, 99.0, 161.0, 44.0, 32.0, 183.0, 169.0, 53.0, 107.0, 107.0, 157.0, 94.0, 123.0, 135.0, 117.0, 135.0, 87.0, 70.0, 115.0, 66.0, 56.0, 64.0, 58.0, 64.0, 95.0, 132.0, 102.0, 90.0, 122.0, 133.0, 81.0, 148.0, 152.0, 234.0, 442.0, 894.0, 2269.0], [150.0, 170.0, 178.0, 125.0, 164.0, 109.0, 40.0, 60.0, 223.0, 124.0, 152.0, 101.0, 139.0, 130.0, 131.0, 137.0, 138.0, 75.0, 27.0, 97.0, 225.0, 209.0, 165.0, 75.0, 119.0, 151.0, 106.0, 136.0, 91.0, 72.0, 109.0, 128.0, 73.0, 44.0, 76.0, 96.0, 142.0, 176.0, 119.0, 119.0, 72.0, 81.0, 91.0, 91.0, 121.0, 138.0, 181.0, 446.0, 1605.0], [101.0, 130.0, 208.0, 165.0, 175.0, 87.0, 231.0, 135.0, 139.0, 105.0, 106.0, 134.0, 86.0, 137.0, 114.0, 76.0, 95.0, 95.0, 21.0, 81.0, 137.0, 69.0, 70.0, 145.0, 95.0, 100.0, 45.0, 68.0, 52.0, 133.0, 160.0, 109.0, 88.0, 61.0, 23.0, 54.0, 83.0, 35.0, 59.0, 127.0, 127.0, 118.0, 57.0, 84.0, 76.0, 100.0, 135.0, 312.0, 1096.0], [226.0, 89.0, 206.0, 136.0, 156.0, 104.0, 143.0, 162.0, 129.0, 64.0, 65.0, 89.0, 91.0, 78.0, 59.0, 106.0, 127.0, 185.0, 180.0, 12.0, 65.0, 80.0, 104.0, 133.0, 198.0, 164.0, 98.0, 141.0, 57.0, 52.0, 70.0, 125.0, 134.0, 46.0, 91.0, 46.0, 9.0, 63.0, 30.0, 19.0, 115.0, 54.0, 66.0, 46.0, 71.0, 102.0, 117.0, 179.0, 780.0], [240.0, 59.0, 101.0, 169.0, 214.0, 47.0, 90.0, 140.0, 164.0, 89.0, 122.0, 252.0, 120.0, 85.0, 75.0, 160.0, 186.0, 172.0, 61.0, 80.0, 147.0, 142.0, 81.0, 67.0, 78.0, 119.0, 103.0, 86.0, 84.0, 129.0, 90.0, 79.0, 128.0, 164.0, 56.0, 65.0, 189.0, 135.0, 61.0, 114.0, 80.0, 105.0, 78.0, 86.0, 36.0, 110.0, 60.0, 82.0, 475.0], [209.0, 105.0, 139.0, 156.0, 164.0, 189.0, 164.0, 87.0, 95.0, 162.0, 145.0, 107.0, 81.0, 109.0, 127.0, 165.0, 97.0, 105.0, 135.0, 72.0, 108.0, 44.0, 164.0, 69.0, 46.0, 34.0, 83.0, 38.0, 57.0, 115.0, 64.0, 66.0, 44.0, 32.0, 170.0, 67.0, 57.0, 45.0, 179.0, 107.0, 44.0, 84.0, 102.0, 105.0, 107.0, 114.0, 82.0, 61.0, 252.0], [112.0, 50.0, 150.0, 192.0, 114.0, 147.0, 138.0, 196.0, 19.0, 130.0, 166.0, 95.0, 118.0, 118.0, 63.0, 192.0, 103.0, 83.0, 31.0, 42.0, 32.0, 28.0, 110.0, 127.0, 96.0, 105.0, 81.0, 142.0, 90.0, 53.0, 75.0, 82.0, 163.0, 60.0, 39.0, 96.0, 62.0, 72.0, 100.0, 107.0, 77.0, 139.0, 179.0, 63.0, 108.0, 90.0, 64.0, 113.0, 194.0], [200.0, 174.0, 163.0, 128.0, 120.0, 54.0, 124.0, 118.0, 102.0, 143.0, 140.0, 121.0, 79.0, 120.0, 115.0, 123.0, 71.0, 90.0, 39.0, 73.0, 67.0, 81.0, 167.0, 57.0, 167.0, 86.0, 28.0, 104.0, 91.0, 175.0, 99.0, 68.0, 169.0, 67.0, 67.0, 58.0, 34.0, 121.0, 27.0, 56.0, 44.0, 94.0, 63.0, 107.0, 74.0, 35.0, 52.0, 107.0, 162.0], [197.0, 249.0, 165.0, 118.0, 106.0, 104.0, 91.0, 129.0, 107.0, 128.0, 172.0, 194.0, 152.0, 82.0, 79.0, 139.0, 102.0, 88.0, 128.0, 74.0, 189.0, 64.0, 57.0, 45.0, 77.0, 56.0, 37.0, 73.0, 107.0, 23.0, 66.0, 38.0, 73.0, 48.0, 22.0, 48.0, 96.0, 73.0, 74.0, 66.0, 87.0, 53.0, 77.0, 94.0, 47.0, 45.0, 121.0, 98.0, 79.0], [125.0, 146.0, 102.0, 110.0, 79.0, 103.0, 110.0, 42.0, 42.0, 55.0, 95.0, 132.0, 70.0, 94.0, 46.0, 104.0, 135.0, 134.0, 105.0, 97.0, 40.0, 39.0, 77.0, 26.0, 92.0, 73.0, 102.0, 74.0, 92.0, 38.0, 118.0, 157.0, 148.0, 72.0, 69.0, 192.0, 116.0, 71.0, 100.0, 39.0, 82.0, 68.0, 53.0, 89.0, 78.0, 24.0, 51.0, 115.0, 88.0], [139.0, 100.0, 67.0, 128.0, 98.0, 141.0, 122.0, 159.0, 197.0, 126.0, 64.0, 184.0, 47.0, 38.0, 87.0, 46.0, 17.0, 51.0, 87.0, 94.0, 101.0, 48.0, 97.0, 63.0, 13.0, 55.0, 79.0, 73.0, 149.0, 73.0, 124.0, 155.0, 152.0, 94.0, 63.0, 72.0, 99.0, 67.0, 59.0, 88.0, 62.0, 82.0, 143.0, 111.0, 110.0, 41.0, 65.0, 75.0, 83.0], [82.0, 128.0, 120.0, 76.0, 60.0, 85.0, 97.0, 59.0, 101.0, 58.0, 17.0, 83.0, 146.0, 118.0, 155.0, 120.0, 36.0, 106.0, 125.0, 118.0, 87.0, 60.0, 77.0, 113.0, 81.0, 77.0, 62.0, 123.0, 145.0, 61.0, 93.0, 80.0, 46.0, 27.0, 40.0, 81.0, 57.0, 68.0, 83.0, 120.0, 16.0, 75.0, 106.0, 95.0, 54.0, 57.0, 106.0, 67.0, 62.0]],
    "Name": "sCurve-0",
    "Overflow": 2340358.0,
    "Type": "Histo2d",
    "Underflow": 0.0,
    "x": {
        "AxisTitle": "Vcal",
        "Bins": 51,
        "High": 302.5,
        "Low": 47.5
    },
    "y": {
        "AxisTitle": "Occupancy",
        "Bins": 49,
        "High": 49.5,
        "Low": 0.5
    },
    "z": {
        "AxisTitle": "Number of pixels"
    }
}