{
    "Data": [0.0, 0.0, 0.0, 0.0, 0.0, 0.0, 0.0, 0.0, 0.0, 0.0, 0.0, 0.0, 0.0, 0.0, 0.0, 0.0, 0.0, 0.0, 0.0, 0.0, 0.0, 0.0, 0.0, 0.0, 0.0, 0.0, 0.0, 0.0, 0.0, 0.0, 0.0, 0.0, 0.0, 0.0, 0.0, 0.0, 0.0, 0.0, 0.0, 0.0, 0.0, 0.0, 0.0, 0.0, 0.0, 0.0, 0.0, 0.0, 0.0, 0.0, 18.0, 66.0, 66.0, 77.0, 68.0, 101.0, 128.0, 135.0, 138.0, 206.0, 194.0, 235.0, 235.0, 285.0, 297.0, 349.0, 375.0, 394.0, 461.0, 503.0, 552.0, 568.0, 618.0, 632.0, 704.0, 721.0, 778.0, 855.0, 794.0, 828.0, 897.0, 981.0, 1076.0, 1216.0, 1396.0, 1719.0, 2012.0, 2291.0, 2653.0, 2908.0, 2969.0, 2895.0, 2678.0, 2512.0, 2181.0, 1845.0, 1462.0, 1187.0, 951.0, 746.0, 607.0, 475.0, 435.0, 308.0, 267.0, 223.0, 173.0, 168.0, 131.0, 122.0, 101.0, 83.0, 65.0, 53.0, 56.0, 40.0, 47.0, 33.0, 29.0, 25.0, 27.0, 24.0, 21.0, 24.0, 15.0, 10.0, 11.0, 15.0, 18.0, 10.0, 19.0, 18.0, 15.0, 14.0, 8.0, 8.0, 10.0, 4.0, 7.0, 8.0, 3.0, 6.0, 5.0, 8.0, 5.0, 5.0, 2.0, 2.0, 2.0, 2.0, 4.0, 4.0, 2.0, 5.0, 5.0, 7.0, 3.0, 7.0, 7.0, 11.0, 18.0, 10.0, 11.0, 30.0, 16.0, 30.0, 36.0, 35.0, 37.0, 53.0, 74.0, 95.0, 99.0, 114.0, 126.0, 142.0, 176.0, 206.0, 193.0, 257.0, 253.0, 305.0, 337.0, 372.0, 406.0, 409.0, 508.0, 503.0, 576.0, 584.0, 652.0, 645.0, 697.0, 737.0, 757.0, 780.0, 824.0, 771.0, 798.0, 877.0, 819.0, 815.0, 736.0, 781.0, 724.0, 718.0, 654.0, 602.0, 561.0, 529.0, 504.0, 453.0, 390.0, 357.0, 323.0, 284.0, 234.0, 225.0, 173.0, 171.0, 151.0, 124.0, 114.0, 82.0, 74.0, 62.0, 50.0, 51.0, 28.0, 20.0, 19.0, 19.0, 16.0, 9.0, 5.0, 3.0, 6.0, 4.0, 0.0, 2.0, 0.0, 0.0, 1.0, 2.0, 0.0, 0.0, 0.0, 0.0, 0.0, 0.0, 0.0, 0.0, 0.0, 0.0, 0.0, 0.0, 0.0, 0.0, 0.0, 1.0, 0.0, 0.0, 0.0, 0.0, 0.0, 0.0, 0.0, 0.0, 0.0, 0.0, 0.0, 0.0, 0.0, 0.0, 0.0, 0.0, 0.0, 0.0, 0.0, 0.0, 0.0, 0.0, 0.0, 0.0, 0.0, 0.0, 0.0, 0.0, 0.0, 0.0, 0.0, 0.0, 0.0, 0.0, 0.0, 0.0, 0.0, 0.0, 0.0, 0.0, 0.0, 0.0, 0.0, 0.0, 0.0, 0.0, 0.0, 0.0, 0.0, 0.0, 0.0, 0.0, 0.0, 0.0, 0.0, 0.0, 0.0, 0.0, 0.0, 0.0, 0.0, 0.0, 0.0, 0.0, 0.0, 0.0, 0.0, 0.0, 0.0, 0.0, 0.0, 0.0, 0.0, 0.0, 0.0, 0.0, 0.0, 0.0, 0.0, 0.0, 0.0, 0.0, 0.0, 0.0, 0.0, 0.0, 0.0, 0.0, 0.0, 0.0, 0.0, 0.0, 0.0, 0.0, 0.0, 0.0, 0.0, 0.0, 0.0, 0.0, 0.0, 0.0, 0.0, 0.0, 0.0, 0.0, 0.0, 0.0, 0.0, 0.0, 0.0, 0.0, 0.0, 0.0, 0.0, 0.0, 0.0, 0.0, 0.0, 0.0, 0.0, 0.0, 0.0, 0.0, 0.0, 0.0, 0.0, 0.0],
    "Name": "ThresholdDist-0",
    "Overflow": 0.0,
    "Type": "Histo1d",
    "Underflow": 0.0,
    "x": {
        "AxisTitle": "Threshold [e]",
        "Bins": 388,
        "High": 3875.0,
        "Low": -5.0
    },
    "y": {
        "AxisTitle": "Number of Pixels"
    },
    "z": {
        "AxisTitle": "z"
    }
}