{
    "Data": [1544.0, 20181.0, 18281.0, 8555.0, 2819.0, 760.0, 405.0, 487.0, 628.0, 775.0, 835.0, 832.0, 813.0, 665.0, 659.0, 593.0, 571.0, 542.0, 542.0, 542.0, 572.0, 637.0, 580.0, 537.0, 591.0, 578.0, 597.0, 553.0, 558.0, 541.0, 521.0, 525.0, 486.0, 525.0, 479.0, 469.0, 428.0, 414.0, 404.0, 362.0, 354.0, 369.0, 309.0, 284.0, 287.0, 314.0, 251.0, 248.0, 232.0, 220.0, 93.0],
    "Name": "Chi2Dist-0",
    "Overflow": 0.0,
    "Type": "Histo1d",
    "Underflow": 0.0,
    "x": {
        "AxisTitle": "Fit Chi/ndf",
        "Bins": 51,
        "High": 2.5250000953674318,
        "Low": -0.02500000037252903
    },
    "y": {
        "AxisTitle": "Number of Pixels"
    },
    "z": {
        "AxisTitle": "z"
    }
}