{
    "Data": [384.0, 1664.0, 275.0, 84.0, 143.0, 157.0, 117.0, 130.0, 126.0, 179.0, 362.0, 778.0, 1571.0, 2723.0, 4049.0, 4649.0, 4505.0, 3884.0, 3240.0, 3252.0, 3773.0, 4342.0, 4556.0, 4106.0, 3285.0, 2303.0, 1538.0, 963.0, 631.0, 423.0, 313.0, 296.0, 266.0, 268.0, 254.0, 233.0, 222.0, 235.0, 253.0, 223.0, 225.0, 221.0, 206.0, 190.0, 193.0, 195.0, 207.0, 161.0, 200.0, 170.0, 160.0, 169.0, 135.0, 162.0, 132.0, 129.0, 123.0, 104.0, 126.0, 110.0, 116.0, 124.0, 107.0, 113.0, 111.0, 102.0, 92.0, 92.0, 93.0, 88.0, 87.0, 88.0, 74.0, 80.0, 72.0, 72.0, 47.0, 69.0, 54.0, 69.0, 67.0, 51.0, 54.0, 47.0, 53.0, 55.0, 63.0, 61.0, 47.0, 62.0, 69.0, 62.0, 42.0, 55.0, 43.0, 62.0, 53.0, 53.0, 47.0, 49.0, 37.0, 41.0, 48.0, 42.0, 52.0, 49.0, 47.0, 55.0, 47.0, 44.0, 49.0, 52.0, 50.0, 48.0, 56.0, 39.0, 42.0, 42.0, 35.0, 37.0, 50.0, 50.0, 35.0, 31.0, 50.0, 39.0, 46.0, 42.0, 34.0, 33.0, 37.0, 39.0, 39.0, 37.0, 37.0, 38.0, 32.0, 28.0, 38.0, 35.0, 38.0, 31.0, 34.0, 33.0, 26.0, 38.0, 23.0, 23.0, 30.0, 29.0, 23.0, 23.0, 37.0, 24.0, 28.0, 31.0, 36.0, 23.0, 32.0, 19.0, 23.0, 24.0, 25.0, 23.0, 29.0, 27.0, 26.0, 22.0, 26.0, 25.0, 25.0, 20.0, 20.0, 21.0],
    "Name": "NoiseDist-0",
    "Overflow": 510.0,
    "Type": "Histo1d",
    "Underflow": 0.0,
    "x": {
        "AxisTitle": "Noise [e]",
        "Bins": 174,
        "High": 871.0,
        "Low": -2.0
    },
    "y": {
        "AxisTitle": "Number of Pixels"
    },
    "z": {
        "AxisTitle": "z"
    }
}