{
    "Data": [0.0, 0.0, 0.0, 0.0, 0.0, 0.0, 0.0, 0.0, 0.0, 0.0, 0.0, 0.0, 0.0, 0.0, 0.0, 0.0, 0.0, 0.0, 0.0, 0.0, 0.0, 0.0, 0.0, 2.0, 4.0, 11.0, 5.0, 1.0, 16.0, 20.0, 3.0, 0.0, 9.0, 43.0, 25.0, 44.0, 47.0, 23.0, 8.0, 50.0, 35.0, 50.0, 8.0, 10.0, 8.0, 18.0, 8.0, 17.0, 36.0, 50.0, 38.0],
    "Name": "Scurve-80-96",
    "Overflow": 0.0,
    "Type": "Histo1d",
    "Underflow": 0.0,
    "x": {
        "AxisTitle": "Vcal",
        "Bins": 51,
        "High": 302.5,
        "Low": 47.5
    },
    "y": {
        "AxisTitle": "Occupancy"
    },
    "z": {
        "AxisTitle": "z"
    }
}