{
    "Data": [0.0, 0.0, 0.0, 0.0, 0.0, 0.0, 0.0, 0.0, 0.0, 0.0, 0.0, 0.0, 0.0, 0.0, 0.0, 0.0, 0.0, 0.0, 0.0, 1.0, 2.0, 4.0, 1.0, 0.0, 9.0, 15.0, 2.0, 24.0, 6.0, 35.0, 12.0, 44.0, 36.0, 44.0, 20.0, 49.0, 6.0, 50.0, 50.0, 50.0, 50.0, 30.0, 14.0, 50.0, 32.0, 50.0, 50.0, 19.0, 50.0, 50.0, 50.0],
    "Name": "Scurve-110-96",
    "Overflow": 0.0,
    "Type": "Histo1d",
    "Underflow": 0.0,
    "x": {
        "AxisTitle": "Vcal",
        "Bins": 51,
        "High": 302.5,
        "Low": 47.5
    },
    "y": {
        "AxisTitle": "Occupancy"
    },
    "z": {
        "AxisTitle": "z"
    }
}