{
    "chipType" : "RD53A",
    "chips" : [
        {
            "config" : "/home/eresseguie/tripletspchainmon/conf/Yarr/rd53a_Triplet1011_IndCmdChipA.json",
            "tx" : 0,
            "rx" : 0,
            "enable" : 1,
            "locked" : 0
        },
        {
            "config" : "/home/eresseguie/tripletspchainmon/conf/Yarr/rd53a_Triplet1011_IndCmdChipB.json",
            "tx" : 1,
            "rx" : 1,
            "enable" : 1,
            "locked" : 0
        },
        {
            "config" : "/home/eresseguie/tripletspchainmon/conf/Yarr/rd53a_Triplet1011_IndCmdChipC.json",
            "tx" : 2,
            "rx" : 2,
            "enable" : 1,
            "locked" : 0
        },
	{
            "config" : "/home/eresseguie/tripletspchainmon/conf/Yarr/rd53a_Triplet1012_IndCmdChipA.json",
            "tx" : 3,
            "rx" : 3,
            "enable" : 0,
            "locked" : 0
        }
    ]
}
