{
    "Data": [[1056.0, 368.0, 154.0, 94.0, 69.0, 53.0, 41.0, 25.0, 23.0, 30.0, 23.0, 18.0, 12.0, 17.0, 14.0, 12.0, 9.0, 15.0, 16.0, 11.0, 8.0, 4.0, 7.0, 2.0, 11.0, 5.0, 3.0, 9.0, 2.0, 6.0, 4.0, 12.0, 5.0, 4.0, 6.0, 2.0, 5.0, 5.0, 2.0, 2.0, 9.0, 8.0, 2.0, 3.0, 6.0, 7.0, 15.0, 13.0, 14.0], [2192.0, 699.0, 369.0, 218.0, 139.0, 111.0, 87.0, 60.0, 56.0, 38.0, 41.0, 49.0, 39.0, 21.0, 15.0, 22.0, 18.0, 24.0, 14.0, 11.0, 23.0, 14.0, 18.0, 9.0, 13.0, 8.0, 7.0, 9.0, 12.0, 14.0, 6.0, 8.0, 8.0, 9.0, 6.0, 6.0, 10.0, 7.0, 5.0, 6.0, 7.0, 7.0, 6.0, 5.0, 6.0, 14.0, 11.0, 9.0, 20.0], [3348.0, 1505.0, 856.0, 525.0, 341.0, 246.0, 201.0, 159.0, 121.0, 110.0, 96.0, 86.0, 63.0, 59.0, 67.0, 35.0, 32.0, 28.0, 37.0, 33.0, 34.0, 21.0, 19.0, 17.0, 19.0, 25.0, 21.0, 16.0, 15.0, 14.0, 16.0, 16.0, 15.0, 17.0, 16.0, 13.0, 12.0, 11.0, 12.0, 12.0, 16.0, 13.0, 14.0, 13.0, 4.0, 10.0, 11.0, 24.0, 21.0], [4172.0, 2212.0, 1369.0, 990.0, 770.0, 564.0, 483.0, 367.0, 297.0, 237.0, 208.0, 182.0, 181.0, 159.0, 121.0, 102.0, 95.0, 86.0, 76.0, 72.0, 50.0, 58.0, 52.0, 53.0, 49.0, 42.0, 36.0, 43.0, 32.0, 31.0, 26.0, 29.0, 30.0, 25.0, 21.0, 20.0, 22.0, 13.0, 25.0, 23.0, 16.0, 19.0, 17.0, 21.0, 22.0, 30.0, 18.0, 26.0, 42.0], [4626.0, 2490.0, 1742.0, 1437.0, 1120.0, 965.0, 821.0, 650.0, 573.0, 501.0, 435.0, 428.0, 367.0, 297.0, 298.0, 216.0, 259.0, 214.0, 194.0, 167.0, 160.0, 164.0, 149.0, 125.0, 121.0, 108.0, 107.0, 97.0, 83.0, 72.0, 63.0, 62.0, 58.0, 50.0, 58.0, 49.0, 55.0, 38.0, 45.0, 35.0, 40.0, 40.0, 40.0, 35.0, 42.0, 42.0, 47.0, 34.0, 59.0], [7353.0, 3455.0, 2219.0, 1636.0, 1220.0, 1079.0, 1030.0, 903.0, 874.0, 770.0, 663.0, 676.0, 566.0, 555.0, 513.0, 422.0, 460.0, 392.0, 379.0, 349.0, 347.0, 298.0, 284.0, 272.0, 280.0, 242.0, 227.0, 237.0, 188.0, 184.0, 181.0, 165.0, 145.0, 175.0, 118.0, 126.0, 127.0, 133.0, 102.0, 114.0, 78.0, 83.0, 94.0, 93.0, 71.0, 83.0, 85.0, 85.0, 108.0], [5948.0, 4950.0, 3878.0, 3271.0, 2573.0, 2209.0, 1769.0, 1484.0, 1272.0, 1104.0, 1022.0, 893.0, 845.0, 729.0, 692.0, 627.0, 554.0, 556.0, 583.0, 526.0, 540.0, 459.0, 514.0, 473.0, 465.0, 416.0, 437.0, 412.0, 364.0, 358.0, 384.0, 360.0, 319.0, 308.0, 335.0, 298.0, 280.0, 266.0, 252.0, 273.0, 238.0, 249.0, 209.0, 201.0, 216.0, 194.0, 189.0, 211.0, 237.0], [1189.0, 1332.0, 1568.0, 1766.0, 1868.0, 1939.0, 1981.0, 1973.0, 1909.0, 1946.0, 1756.0, 1789.0, 1719.0, 1607.0, 1503.0, 1452.0, 1352.0, 1281.0, 1195.0, 1167.0, 1078.0, 1002.0, 919.0, 804.0, 830.0, 726.0, 718.0, 669.0, 679.0, 576.0, 583.0, 570.0, 545.0, 583.0, 550.0, 544.0, 533.0, 513.0, 498.0, 537.0, 509.0, 455.0, 487.0, 473.0, 504.0, 484.0, 436.0, 483.0, 501.0], [270.0, 261.0, 275.0, 298.0, 349.0, 356.0, 403.0, 493.0, 569.0, 577.0, 618.0, 735.0, 777.0, 820.0, 960.0, 997.0, 989.0, 1042.0, 1132.0, 1233.0, 1252.0, 1259.0, 1318.0, 1345.0, 1401.0, 1380.0, 1406.0, 1426.0, 1471.0, 1434.0, 1463.0, 1491.0, 1449.0, 1430.0, 1366.0, 1363.0, 1255.0, 1219.0, 1213.0, 1135.0, 1046.0, 1132.0, 1048.0, 970.0, 964.0, 982.0, 1088.0, 972.0, 1238.0], [155.0, 95.0, 94.0, 73.0, 90.0, 95.0, 110.0, 101.0, 128.0, 139.0, 135.0, 148.0, 169.0, 187.0, 204.0, 216.0, 247.0, 253.0, 295.0, 325.0, 367.0, 384.0, 422.0, 497.0, 507.0, 548.0, 630.0, 675.0, 725.0, 856.0, 904.0, 934.0, 1052.0, 1187.0, 1300.0, 1462.0, 1568.0, 1701.0, 1786.0, 1961.0, 2143.0, 2294.0, 2415.0, 2555.0, 2852.0, 2877.0, 2941.0, 3055.0, 3130.0], [122.0, 67.0, 67.0, 40.0, 48.0, 34.0, 33.0, 36.0, 40.0, 45.0, 37.0, 43.0, 56.0, 63.0, 69.0, 66.0, 83.0, 80.0, 89.0, 82.0, 89.0, 114.0, 110.0, 131.0, 134.0, 147.0, 163.0, 190.0, 227.0, 237.0, 267.0, 310.0, 330.0, 395.0, 430.0, 496.0, 552.0, 654.0, 765.0, 870.0, 1009.0, 1313.0, 1562.0, 1945.0, 2417.0, 3160.0, 4107.0, 5764.0, 8182.0], [101.0, 54.0, 41.0, 35.0, 24.0, 25.0, 20.0, 24.0, 15.0, 21.0, 29.0, 33.0, 21.0, 21.0, 25.0, 20.0, 25.0, 34.0, 23.0, 40.0, 32.0, 35.0, 48.0, 43.0, 42.0, 50.0, 59.0, 61.0, 92.0, 81.0, 97.0, 96.0, 108.0, 131.0, 150.0, 171.0, 199.0, 237.0, 273.0, 325.0, 401.0, 468.0, 600.0, 736.0, 1044.0, 1439.0, 2154.0, 3692.0, 7888.0], [105.0, 48.0, 35.0, 25.0, 31.0, 17.0, 13.0, 19.0, 16.0, 16.0, 13.0, 15.0, 11.0, 13.0, 18.0, 19.0, 15.0, 14.0, 20.0, 14.0, 25.0, 20.0, 16.0, 19.0, 16.0, 17.0, 24.0, 27.0, 31.0, 30.0, 33.0, 34.0, 37.0, 48.0, 55.0, 63.0, 84.0, 81.0, 94.0, 127.0, 167.0, 196.0, 266.0, 300.0, 452.0, 635.0, 995.0, 1750.0, 4686.0], [82.0, 48.0, 40.0, 17.0, 13.0, 14.0, 10.0, 17.0, 13.0, 16.0, 15.0, 9.0, 7.0, 14.0, 10.0, 13.0, 17.0, 13.0, 11.0, 12.0, 16.0, 15.0, 11.0, 11.0, 7.0, 16.0, 11.0, 9.0, 12.0, 12.0, 14.0, 18.0, 22.0, 22.0, 20.0, 33.0, 24.0, 39.0, 33.0, 43.0, 71.0, 69.0, 85.0, 139.0, 163.0, 244.0, 431.0, 870.0, 2420.0], [78.0, 46.0, 29.0, 25.0, 20.0, 13.0, 11.0, 11.0, 16.0, 7.0, 10.0, 10.0, 9.0, 7.0, 11.0, 13.0, 5.0, 12.0, 10.0, 5.0, 7.0, 8.0, 9.0, 6.0, 5.0, 17.0, 7.0, 11.0, 8.0, 14.0, 13.0, 8.0, 9.0, 11.0, 15.0, 16.0, 16.0, 14.0, 17.0, 32.0, 31.0, 24.0, 34.0, 51.0, 63.0, 101.0, 200.0, 350.0, 1178.0], [61.0, 37.0, 22.0, 18.0, 15.0, 12.0, 9.0, 11.0, 9.0, 8.0, 8.0, 13.0, 11.0, 4.0, 10.0, 12.0, 4.0, 9.0, 10.0, 7.0, 4.0, 5.0, 3.0, 6.0, 7.0, 5.0, 10.0, 11.0, 6.0, 5.0, 6.0, 11.0, 14.0, 13.0, 13.0, 10.0, 9.0, 7.0, 15.0, 16.0, 14.0, 20.0, 16.0, 34.0, 39.0, 67.0, 79.0, 164.0, 558.0], [68.0, 28.0, 23.0, 12.0, 15.0, 6.0, 10.0, 5.0, 8.0, 6.0, 9.0, 6.0, 6.0, 3.0, 12.0, 8.0, 5.0, 8.0, 8.0, 3.0, 7.0, 4.0, 3.0, 9.0, 7.0, 10.0, 5.0, 8.0, 8.0, 3.0, 5.0, 5.0, 6.0, 5.0, 5.0, 10.0, 11.0, 13.0, 12.0, 12.0, 8.0, 15.0, 17.0, 22.0, 23.0, 23.0, 48.0, 76.0, 253.0], [55.0, 30.0, 21.0, 15.0, 5.0, 6.0, 5.0, 10.0, 4.0, 5.0, 3.0, 11.0, 5.0, 5.0, 5.0, 3.0, 7.0, 8.0, 5.0, 7.0, 6.0, 3.0, 2.0, 7.0, 3.0, 4.0, 8.0, 6.0, 4.0, 7.0, 6.0, 8.0, 4.0, 5.0, 6.0, 8.0, 7.0, 8.0, 7.0, 8.0, 9.0, 12.0, 12.0, 10.0, 16.0, 26.0, 31.0, 53.0, 160.0], [62.0, 36.0, 14.0, 18.0, 14.0, 8.0, 7.0, 2.0, 4.0, 7.0, 2.0, 4.0, 8.0, 5.0, 7.0, 5.0, 2.0, 4.0, 3.0, 5.0, 4.0, 2.0, 3.0, 3.0, 2.0, 6.0, 1.0, 4.0, 5.0, 4.0, 3.0, 4.0, 7.0, 4.0, 3.0, 1.0, 8.0, 3.0, 11.0, 7.0, 3.0, 11.0, 11.0, 6.0, 16.0, 18.0, 22.0, 31.0, 82.0], [63.0, 27.0, 16.0, 14.0, 11.0, 10.0, 4.0, 4.0, 4.0, 6.0, 3.0, 2.0, 3.0, 5.0, 3.0, 4.0, 3.0, 9.0, 5.0, 4.0, 2.0, 3.0, 1.0, 3.0, 4.0, 2.0, 2.0, 3.0, 3.0, 2.0, 2.0, 5.0, 3.0, 4.0, 3.0, 3.0, 6.0, 1.0, 6.0, 2.0, 6.0, 7.0, 9.0, 6.0, 6.0, 15.0, 24.0, 31.0, 55.0], [62.0, 28.0, 13.0, 5.0, 9.0, 4.0, 7.0, 6.0, 9.0, 3.0, 5.0, 5.0, 9.0, 4.0, 4.0, 1.0, 2.0, 5.0, 2.0, 3.0, 0.0, 1.0, 3.0, 4.0, 0.0, 3.0, 3.0, 2.0, 0.0, 5.0, 2.0, 2.0, 0.0, 2.0, 2.0, 5.0, 1.0, 2.0, 2.0, 3.0, 2.0, 8.0, 4.0, 4.0, 7.0, 6.0, 8.0, 17.0, 57.0], [63.0, 33.0, 18.0, 10.0, 7.0, 3.0, 8.0, 2.0, 1.0, 1.0, 6.0, 14.0, 1.0, 7.0, 0.0, 4.0, 2.0, 2.0, 2.0, 2.0, 2.0, 0.0, 5.0, 4.0, 1.0, 4.0, 2.0, 3.0, 2.0, 1.0, 3.0, 2.0, 1.0, 3.0, 0.0, 1.0, 1.0, 2.0, 3.0, 0.0, 2.0, 0.0, 1.0, 4.0, 5.0, 8.0, 9.0, 20.0, 29.0], [65.0, 27.0, 10.0, 7.0, 6.0, 5.0, 6.0, 3.0, 4.0, 7.0, 5.0, 5.0, 3.0, 3.0, 0.0, 4.0, 2.0, 4.0, 1.0, 4.0, 1.0, 1.0, 1.0, 1.0, 3.0, 2.0, 1.0, 1.0, 2.0, 1.0, 2.0, 3.0, 3.0, 1.0, 3.0, 2.0, 1.0, 5.0, 1.0, 1.0, 0.0, 0.0, 2.0, 1.0, 4.0, 5.0, 5.0, 11.0, 30.0], [51.0, 24.0, 20.0, 11.0, 6.0, 7.0, 1.0, 3.0, 7.0, 5.0, 6.0, 3.0, 4.0, 5.0, 3.0, 0.0, 2.0, 3.0, 1.0, 3.0, 0.0, 2.0, 1.0, 1.0, 0.0, 1.0, 3.0, 4.0, 1.0, 2.0, 1.0, 2.0, 2.0, 0.0, 0.0, 0.0, 1.0, 1.0, 3.0, 4.0, 1.0, 4.0, 2.0, 0.0, 4.0, 3.0, 7.0, 4.0, 17.0], [62.0, 26.0, 16.0, 9.0, 6.0, 4.0, 7.0, 5.0, 3.0, 3.0, 5.0, 2.0, 6.0, 3.0, 2.0, 2.0, 3.0, 3.0, 1.0, 0.0, 1.0, 3.0, 2.0, 2.0, 2.0, 3.0, 1.0, 0.0, 1.0, 1.0, 0.0, 2.0, 1.0, 1.0, 1.0, 2.0, 1.0, 1.0, 1.0, 1.0, 1.0, 2.0, 0.0, 2.0, 3.0, 3.0, 2.0, 4.0, 17.0], [51.0, 29.0, 23.0, 10.0, 4.0, 7.0, 4.0, 3.0, 3.0, 7.0, 2.0, 4.0, 2.0, 2.0, 2.0, 3.0, 5.0, 0.0, 1.0, 2.0, 1.0, 3.0, 0.0, 2.0, 1.0, 1.0, 1.0, 3.0, 1.0, 2.0, 1.0, 2.0, 0.0, 0.0, 2.0, 3.0, 0.0, 1.0, 0.0, 2.0, 1.0, 1.0, 0.0, 1.0, 0.0, 4.0, 2.0, 4.0, 5.0], [67.0, 21.0, 17.0, 11.0, 12.0, 6.0, 3.0, 2.0, 2.0, 5.0, 2.0, 3.0, 4.0, 3.0, 3.0, 4.0, 1.0, 2.0, 2.0, 2.0, 2.0, 3.0, 1.0, 0.0, 0.0, 2.0, 0.0, 1.0, 3.0, 0.0, 1.0, 1.0, 1.0, 1.0, 0.0, 0.0, 0.0, 1.0, 1.0, 1.0, 0.0, 2.0, 0.0, 1.0, 0.0, 0.0, 1.0, 6.0, 8.0], [56.0, 26.0, 23.0, 11.0, 10.0, 3.0, 1.0, 3.0, 3.0, 6.0, 3.0, 1.0, 2.0, 3.0, 2.0, 4.0, 3.0, 3.0, 2.0, 0.0, 2.0, 1.0, 2.0, 0.0, 0.0, 3.0, 1.0, 1.0, 2.0, 0.0, 1.0, 2.0, 0.0, 0.0, 0.0, 0.0, 1.0, 0.0, 0.0, 1.0, 2.0, 2.0, 0.0, 2.0, 0.0, 1.0, 0.0, 0.0, 5.0], [48.0, 30.0, 12.0, 11.0, 3.0, 6.0, 3.0, 1.0, 4.0, 5.0, 5.0, 3.0, 6.0, 3.0, 2.0, 3.0, 4.0, 1.0, 4.0, 2.0, 1.0, 2.0, 1.0, 2.0, 1.0, 2.0, 0.0, 0.0, 1.0, 2.0, 0.0, 2.0, 0.0, 1.0, 2.0, 0.0, 0.0, 0.0, 1.0, 1.0, 0.0, 1.0, 1.0, 0.0, 1.0, 1.0, 1.0, 0.0, 1.0], [62.0, 30.0, 18.0, 7.0, 8.0, 6.0, 5.0, 3.0, 4.0, 2.0, 6.0, 3.0, 5.0, 6.0, 1.0, 1.0, 2.0, 3.0, 0.0, 4.0, 1.0, 1.0, 0.0, 1.0, 0.0, 1.0, 3.0, 1.0, 1.0, 0.0, 1.0, 1.0, 0.0, 1.0, 2.0, 2.0, 0.0, 0.0, 0.0, 0.0, 0.0, 1.0, 1.0, 0.0, 1.0, 0.0, 1.0, 3.0, 4.0], [47.0, 25.0, 15.0, 18.0, 13.0, 8.0, 3.0, 6.0, 2.0, 0.0, 8.0, 5.0, 4.0, 4.0, 3.0, 3.0, 0.0, 3.0, 2.0, 3.0, 0.0, 1.0, 3.0, 1.0, 1.0, 1.0, 2.0, 1.0, 0.0, 0.0, 1.0, 0.0, 1.0, 0.0, 0.0, 2.0, 0.0, 0.0, 0.0, 2.0, 0.0, 0.0, 0.0, 0.0, 0.0, 0.0, 1.0, 3.0, 3.0], [55.0, 28.0, 23.0, 10.0, 11.0, 4.0, 3.0, 5.0, 3.0, 4.0, 6.0, 3.0, 1.0, 5.0, 3.0, 3.0, 2.0, 5.0, 4.0, 0.0, 2.0, 0.0, 2.0, 0.0, 2.0, 0.0, 0.0, 0.0, 1.0, 1.0, 1.0, 0.0, 1.0, 1.0, 2.0, 0.0, 1.0, 1.0, 0.0, 0.0, 2.0, 0.0, 0.0, 0.0, 0.0, 0.0, 1.0, 0.0, 3.0], [64.0, 22.0, 17.0, 15.0, 4.0, 5.0, 3.0, 3.0, 9.0, 6.0, 3.0, 0.0, 6.0, 2.0, 5.0, 3.0, 3.0, 2.0, 1.0, 1.0, 2.0, 1.0, 2.0, 0.0, 0.0, 2.0, 0.0, 1.0, 0.0, 1.0, 2.0, 0.0, 2.0, 1.0, 0.0, 0.0, 1.0, 2.0, 1.0, 0.0, 0.0, 0.0, 0.0, 0.0, 0.0, 1.0, 1.0, 1.0, 1.0], [60.0, 29.0, 10.0, 10.0, 6.0, 5.0, 5.0, 4.0, 7.0, 2.0, 4.0, 3.0, 3.0, 3.0, 2.0, 3.0, 6.0, 2.0, 5.0, 0.0, 0.0, 0.0, 1.0, 2.0, 2.0, 2.0, 0.0, 0.0, 2.0, 0.0, 0.0, 1.0, 1.0, 0.0, 0.0, 2.0, 2.0, 0.0, 0.0, 0.0, 0.0, 0.0, 1.0, 0.0, 0.0, 1.0, 0.0, 0.0, 0.0], [72.0, 26.0, 11.0, 9.0, 7.0, 3.0, 6.0, 4.0, 6.0, 4.0, 2.0, 6.0, 2.0, 4.0, 2.0, 4.0, 2.0, 2.0, 2.0, 2.0, 2.0, 1.0, 0.0, 1.0, 2.0, 0.0, 1.0, 2.0, 1.0, 2.0, 1.0, 0.0, 0.0, 1.0, 0.0, 1.0, 0.0, 0.0, 0.0, 0.0, 1.0, 1.0, 0.0, 0.0, 0.0, 0.0, 1.0, 1.0, 1.0], [59.0, 22.0, 17.0, 15.0, 6.0, 4.0, 3.0, 4.0, 3.0, 3.0, 2.0, 2.0, 4.0, 2.0, 1.0, 5.0, 4.0, 3.0, 4.0, 0.0, 3.0, 3.0, 1.0, 0.0, 0.0, 2.0, 0.0, 0.0, 4.0, 0.0, 2.0, 1.0, 1.0, 1.0, 0.0, 0.0, 0.0, 0.0, 0.0, 0.0, 1.0, 0.0, 2.0, 0.0, 1.0, 0.0, 0.0, 0.0, 1.0], [57.0, 30.0, 9.0, 17.0, 7.0, 4.0, 4.0, 4.0, 2.0, 6.0, 6.0, 3.0, 7.0, 3.0, 1.0, 0.0, 5.0, 3.0, 1.0, 1.0, 1.0, 0.0, 0.0, 1.0, 1.0, 2.0, 1.0, 1.0, 1.0, 1.0, 0.0, 1.0, 1.0, 0.0, 2.0, 0.0, 1.0, 0.0, 1.0, 0.0, 1.0, 0.0, 0.0, 0.0, 0.0, 0.0, 1.0, 0.0, 3.0], [50.0, 31.0, 19.0, 10.0, 9.0, 5.0, 7.0, 2.0, 5.0, 4.0, 6.0, 2.0, 4.0, 1.0, 2.0, 1.0, 4.0, 4.0, 4.0, 3.0, 3.0, 3.0, 2.0, 1.0, 0.0, 0.0, 1.0, 0.0, 1.0, 2.0, 0.0, 1.0, 0.0, 0.0, 1.0, 0.0, 1.0, 1.0, 0.0, 1.0, 0.0, 1.0, 0.0, 0.0, 0.0, 1.0, 1.0, 1.0, 0.0], [51.0, 26.0, 15.0, 14.0, 4.0, 6.0, 3.0, 5.0, 2.0, 6.0, 2.0, 3.0, 6.0, 3.0, 3.0, 3.0, 0.0, 1.0, 5.0, 1.0, 3.0, 0.0, 2.0, 1.0, 3.0, 1.0, 1.0, 2.0, 1.0, 0.0, 0.0, 0.0, 1.0, 1.0, 0.0, 0.0, 1.0, 0.0, 0.0, 1.0, 0.0, 1.0, 0.0, 0.0, 1.0, 0.0, 0.0, 0.0, 1.0], [54.0, 47.0, 12.0, 10.0, 5.0, 5.0, 4.0, 4.0, 3.0, 4.0, 5.0, 3.0, 4.0, 2.0, 3.0, 2.0, 2.0, 1.0, 0.0, 3.0, 4.0, 0.0, 1.0, 1.0, 1.0, 2.0, 1.0, 1.0, 0.0, 1.0, 2.0, 1.0, 0.0, 1.0, 0.0, 0.0, 0.0, 0.0, 1.0, 0.0, 2.0, 1.0, 0.0, 0.0, 0.0, 1.0, 0.0, 0.0, 1.0], [63.0, 22.0, 15.0, 15.0, 8.0, 3.0, 7.0, 5.0, 6.0, 1.0, 6.0, 2.0, 2.0, 5.0, 3.0, 2.0, 2.0, 1.0, 0.0, 2.0, 2.0, 0.0, 4.0, 0.0, 0.0, 0.0, 1.0, 0.0, 0.0, 0.0, 1.0, 1.0, 2.0, 2.0, 0.0, 1.0, 0.0, 2.0, 0.0, 1.0, 1.0, 0.0, 0.0, 1.0, 0.0, 2.0, 0.0, 1.0, 2.0], [53.0, 36.0, 21.0, 8.0, 3.0, 4.0, 5.0, 3.0, 3.0, 3.0, 3.0, 5.0, 3.0, 3.0, 4.0, 2.0, 4.0, 1.0, 3.0, 2.0, 0.0, 1.0, 1.0, 1.0, 1.0, 3.0, 1.0, 1.0, 0.0, 1.0, 2.0, 1.0, 0.0, 1.0, 0.0, 1.0, 1.0, 0.0, 0.0, 0.0, 0.0, 0.0, 0.0, 0.0, 2.0, 1.0, 0.0, 0.0, 2.0], [58.0, 28.0, 13.0, 10.0, 3.0, 9.0, 4.0, 4.0, 1.0, 3.0, 4.0, 5.0, 5.0, 1.0, 6.0, 1.0, 3.0, 2.0, 1.0, 3.0, 1.0, 2.0, 1.0, 0.0, 1.0, 0.0, 2.0, 1.0, 1.0, 0.0, 0.0, 0.0, 1.0, 2.0, 1.0, 0.0, 0.0, 1.0, 1.0, 1.0, 1.0, 0.0, 0.0, 0.0, 1.0, 1.0, 0.0, 0.0, 1.0], [58.0, 23.0, 16.0, 16.0, 4.0, 9.0, 2.0, 4.0, 1.0, 6.0, 2.0, 6.0, 6.0, 3.0, 3.0, 0.0, 4.0, 1.0, 1.0, 1.0, 1.0, 1.0, 0.0, 1.0, 0.0, 0.0, 1.0, 0.0, 1.0, 0.0, 3.0, 1.0, 0.0, 2.0, 1.0, 0.0, 1.0, 1.0, 0.0, 1.0, 0.0, 1.0, 1.0, 1.0, 1.0, 0.0, 0.0, 0.0, 0.0], [54.0, 32.0, 12.0, 8.0, 11.0, 8.0, 1.0, 4.0, 5.0, 1.0, 0.0, 3.0, 6.0, 5.0, 2.0, 0.0, 1.0, 2.0, 0.0, 4.0, 1.0, 2.0, 3.0, 2.0, 2.0, 2.0, 1.0, 1.0, 0.0, 2.0, 0.0, 0.0, 1.0, 1.0, 0.0, 0.0, 2.0, 0.0, 0.0, 0.0, 0.0, 0.0, 1.0, 1.0, 0.0, 0.0, 2.0, 0.0, 3.0], [61.0, 23.0, 28.0, 11.0, 3.0, 2.0, 3.0, 8.0, 3.0, 2.0, 3.0, 2.0, 4.0, 4.0, 7.0, 4.0, 2.0, 0.0, 0.0, 0.0, 0.0, 0.0, 1.0, 2.0, 3.0, 0.0, 1.0, 1.0, 2.0, 1.0, 4.0, 1.0, 1.0, 1.0, 1.0, 0.0, 0.0, 0.0, 0.0, 0.0, 0.0, 1.0, 1.0, 0.0, 0.0, 0.0, 0.0, 0.0, 0.0], [58.0, 24.0, 17.0, 10.0, 10.0, 4.0, 5.0, 3.0, 3.0, 4.0, 1.0, 5.0, 0.0, 6.0, 3.0, 5.0, 2.0, 1.0, 2.0, 1.0, 1.0, 2.0, 2.0, 0.0, 2.0, 2.0, 0.0, 1.0, 0.0, 2.0, 0.0, 1.0, 2.0, 1.0, 1.0, 1.0, 0.0, 0.0, 0.0, 0.0, 0.0, 1.0, 1.0, 1.0, 1.0, 2.0, 1.0, 0.0, 0.0], [63.0, 32.0, 17.0, 8.0, 7.0, 8.0, 2.0, 5.0, 4.0, 2.0, 3.0, 2.0, 5.0, 5.0, 1.0, 5.0, 1.0, 2.0, 2.0, 1.0, 2.0, 0.0, 2.0, 1.0, 0.0, 0.0, 1.0, 2.0, 1.0, 0.0, 1.0, 1.0, 1.0, 1.0, 2.0, 1.0, 1.0, 1.0, 0.0, 1.0, 1.0, 0.0, 1.0, 0.0, 1.0, 0.0, 0.0, 0.0, 0.0], [59.0, 26.0, 20.0, 11.0, 14.0, 4.0, 3.0, 5.0, 3.0, 1.0, 3.0, 3.0, 4.0, 2.0, 2.0, 2.0, 6.0, 1.0, 0.0, 0.0, 2.0, 3.0, 1.0, 0.0, 2.0, 3.0, 2.0, 1.0, 0.0, 0.0, 2.0, 1.0, 1.0, 0.0, 0.0, 1.0, 0.0, 0.0, 0.0, 1.0, 0.0, 2.0, 1.0, 1.0, 0.0, 1.0, 0.0, 0.0, 0.0], [53.0, 25.0, 23.0, 8.0, 10.0, 4.0, 5.0, 4.0, 4.0, 0.0, 5.0, 4.0, 1.0, 4.0, 1.0, 2.0, 4.0, 2.0, 2.0, 2.0, 6.0, 1.0, 0.0, 3.0, 1.0, 1.0, 1.0, 0.0, 0.0, 1.0, 1.0, 1.0, 0.0, 2.0, 0.0, 1.0, 0.0, 1.0, 0.0, 1.0, 1.0, 0.0, 0.0, 0.0, 1.0, 1.0, 0.0, 0.0, 0.0], [58.0, 27.0, 10.0, 13.0, 3.0, 5.0, 7.0, 4.0, 2.0, 4.0, 1.0, 5.0, 2.0, 4.0, 3.0, 4.0, 3.0, 1.0, 5.0, 3.0, 2.0, 1.0, 3.0, 0.0, 0.0, 0.0, 2.0, 0.0, 1.0, 2.0, 0.0, 2.0, 0.0, 0.0, 0.0, 1.0, 2.0, 0.0, 0.0, 0.0, 1.0, 0.0, 0.0, 1.0, 2.0, 1.0, 1.0, 0.0, 1.0]],
    "Name": "sCurve-0",
    "Overflow": 2071168.0,
    "Type": "Histo2d",
    "Underflow": 0.0,
    "x": {
        "AxisTitle": "Vcal",
        "Bins": 51,
        "High": 302.5,
        "Low": 47.5
    },
    "y": {
        "AxisTitle": "Occupancy",
        "Bins": 49,
        "High": 49.5,
        "Low": 0.5
    },
    "z": {
        "AxisTitle": "Number of pixels"
    }
}