{
    "Data": [1.0, 3.0, 0.0, 0.0, 0.0, 1.0, 4.0, 13.0, 46.0, 192.0, 513.0, 1192.0, 2366.0, 3695.0, 4540.0, 4563.0, 3645.0, 2472.0, 1777.0, 1560.0, 1893.0, 2563.0, 3377.0, 3833.0, 3587.0, 3221.0, 2261.0, 1590.0, 984.0, 549.0, 322.0, 189.0, 130.0, 113.0, 72.0, 46.0, 40.0, 34.0, 18.0, 25.0, 23.0, 23.0, 16.0, 12.0, 15.0, 7.0, 9.0, 11.0, 15.0, 9.0, 10.0, 7.0, 15.0, 8.0, 10.0, 7.0, 4.0, 4.0, 5.0, 1.0, 2.0],
    "Name": "NoiseDist-0",
    "Overflow": 301.0,
    "Type": "Histo1d",
    "Underflow": 0.0,
    "x": {
        "AxisTitle": "Noise [e]",
        "Bins": 61,
        "High": 306.0,
        "Low": -2.0
    },
    "y": {
        "AxisTitle": "Number of Pixels"
    },
    "z": {
        "AxisTitle": "z"
    }
}