{
    "Data": [0.0, 0.0, 0.0, 0.0, 0.0, 6.0, 23.0, 14.0, 25.0, 15.0, 28.0, 24.0, 25.0, 30.0, 39.0, 36.0, 37.0, 55.0, 53.0, 65.0, 72.0, 98.0, 112.0, 146.0, 151.0, 176.0, 248.0, 263.0, 261.0, 365.0, 386.0, 467.0, 612.0, 624.0, 754.0, 754.0, 895.0, 884.0, 993.0, 1047.0, 1082.0, 1251.0, 1329.0, 1777.0, 2215.0, 2898.0, 3519.0, 3916.0, 4001.0, 3920.0, 3412.0, 2859.0, 2310.0, 1705.0, 1298.0, 949.0, 728.0, 523.0, 464.0, 346.0, 250.0, 208.0, 134.0, 147.0, 123.0, 84.0, 77.0, 64.0, 50.0, 36.0, 34.0, 34.0, 23.0, 31.0, 28.0, 26.0, 21.0, 26.0, 25.0, 25.0, 13.0, 9.0, 12.0, 12.0, 14.0, 10.0, 12.0, 9.0, 13.0, 6.0, 9.0],
    "Name": "ThresholdDist-0",
    "Overflow": 162.0,
    "Type": "Histo1d",
    "Underflow": 0.0,
    "x": {
        "AxisTitle": "Threshold [e]",
        "Bins": 91,
        "High": 1355.0,
        "Low": 445.0
    },
    "y": {
        "AxisTitle": "Number of Pixels"
    },
    "z": {
        "AxisTitle": "z"
    }
}