{
    "Data": [42.0, 60.0, 2.0, 2.0, 2.0, 117.0, 594.0, 1698.0, 3475.0, 4648.0, 4863.0, 3973.0, 3168.0, 2616.0, 2576.0, 2857.0, 3315.0, 3630.0, 3580.0, 3367.0, 2604.0, 1843.0, 1164.0, 727.0, 566.0, 575.0, 764.0, 974.0, 1281.0, 1610.0, 1989.0, 2070.0, 2359.0, 2302.0, 2172.0, 1938.0, 1589.0, 1361.0, 979.0, 728.0, 537.0, 365.0, 242.0, 190.0, 128.0, 82.0, 52.0, 40.0, 20.0, 28.0, 12.0, 14.0, 10.0, 5.0, 10.0, 5.0, 4.0, 5.0, 6.0, 4.0, 5.0, 3.0, 4.0, 2.0, 3.0, 1.0, 0.0, 1.0, 1.0, 1.0, 2.0],
    "Name": "NoiseDist-0",
    "Overflow": 13.0,
    "Type": "Histo1d",
    "Underflow": 0.0,
    "x": {
        "AxisTitle": "Noise [e]",
        "Bins": 71,
        "High": 356.0,
        "Low": -2.0
    },
    "y": {
        "AxisTitle": "Number of Pixels"
    },
    "z": {
        "AxisTitle": "z"
    }
}