{
    "Data": [0.0, 0.0, 0.0, 0.0, 0.0, 0.0, 0.0, 0.0, 0.0, 0.0, 0.0, 0.0, 0.0, 0.0, 0.0, 0.0, 0.0, 0.0, 0.0, 0.0, 0.0, 0.0, 0.0, 0.0, 0.0, 0.0, 0.0, 0.0, 0.0, 0.0, 0.0, 0.0, 0.0, 0.0, 0.0, 0.0, 0.0, 0.0, 0.0, 0.0, 0.0, 0.0, 0.0, 0.0, 0.0, 0.0, 0.0, 0.0, 0.0, 0.0, 166.0, 323.0, 302.0, 347.0, 296.0, 310.0, 337.0, 363.0, 356.0, 333.0, 332.0, 337.0, 360.0, 389.0, 361.0, 340.0, 385.0, 384.0, 354.0, 358.0, 350.0, 381.0, 367.0, 408.0, 372.0, 386.0, 443.0, 383.0, 378.0, 367.0, 389.0, 382.0, 367.0, 373.0, 379.0, 387.0, 426.0, 391.0, 405.0, 366.0, 403.0, 371.0, 368.0, 413.0, 374.0, 342.0, 365.0, 332.0, 375.0, 340.0, 359.0, 366.0, 357.0, 344.0, 342.0, 324.0, 328.0, 317.0, 330.0, 317.0, 317.0, 343.0, 287.0, 309.0, 303.0, 323.0, 317.0, 327.0, 256.0, 260.0, 280.0, 252.0, 259.0, 271.0, 248.0, 266.0, 230.0, 229.0, 202.0, 242.0, 195.0, 230.0, 185.0, 222.0, 213.0, 195.0, 189.0, 185.0, 160.0, 182.0, 151.0, 158.0, 176.0, 145.0, 179.0, 138.0, 137.0, 139.0, 120.0, 128.0, 123.0, 111.0, 119.0, 110.0, 118.0, 105.0, 103.0, 92.0, 91.0, 87.0, 79.0, 90.0, 64.0, 79.0, 62.0, 82.0, 90.0, 63.0, 63.0, 62.0, 72.0, 73.0, 81.0, 56.0, 44.0, 65.0, 43.0, 52.0, 45.0, 46.0, 51.0, 42.0, 41.0, 48.0, 47.0, 46.0, 50.0, 44.0, 65.0, 49.0, 41.0, 49.0, 50.0, 44.0, 47.0, 40.0, 37.0, 30.0, 44.0, 38.0, 42.0, 46.0, 37.0, 42.0, 71.0, 54.0, 55.0, 65.0, 54.0, 67.0, 84.0, 67.0, 61.0, 74.0, 93.0, 110.0, 111.0, 112.0, 97.0, 125.0, 124.0, 148.0, 140.0, 180.0, 186.0, 186.0, 195.0, 215.0, 222.0, 237.0, 271.0, 277.0, 316.0, 269.0, 295.0, 324.0, 331.0, 396.0, 375.0, 304.0, 382.0, 363.0, 374.0, 552.0, 407.0, 379.0, 342.0, 403.0, 510.0, 488.0, 413.0, 416.0, 372.0, 397.0, 509.0, 390.0, 372.0, 384.0, 400.0, 448.0, 417.0, 345.0, 290.0, 295.0, 250.0, 359.0, 229.0, 192.0, 207.0, 189.0, 283.0, 300.0, 233.0, 147.0, 127.0, 153.0, 182.0, 143.0, 113.0, 96.0, 78.0, 111.0, 91.0, 73.0, 82.0, 68.0, 67.0, 89.0, 76.0, 74.0, 62.0, 55.0, 55.0, 54.0, 41.0, 45.0, 36.0, 52.0, 43.0, 51.0, 37.0, 41.0, 32.0, 30.0, 30.0, 32.0, 35.0, 22.0, 38.0, 20.0, 27.0, 31.0, 24.0, 26.0, 28.0, 28.0, 21.0, 20.0, 24.0, 24.0, 24.0, 23.0, 24.0, 36.0, 18.0, 10.0, 0.0, 0.0, 0.0, 0.0, 0.0, 0.0, 0.0, 0.0, 0.0, 0.0, 0.0, 0.0, 0.0, 0.0, 0.0, 0.0, 0.0, 0.0, 0.0, 0.0, 0.0, 0.0, 0.0, 0.0, 0.0, 0.0, 0.0, 0.0, 0.0, 0.0, 0.0, 0.0, 0.0, 0.0, 0.0, 0.0, 0.0, 0.0, 0.0, 0.0, 0.0, 0.0, 0.0, 0.0, 0.0, 0.0, 0.0, 0.0, 0.0, 0.0, 0.0, 0.0, 0.0, 0.0, 0.0, 0.0, 0.0, 0.0, 0.0, 0.0, 0.0, 0.0, 0.0, 0.0, 0.0, 0.0, 0.0, 0.0, 0.0, 0.0, 0.0, 0.0, 0.0, 0.0, 0.0, 0.0, 0.0, 0.0, 0.0, 0.0, 0.0, 0.0, 0.0, 0.0, 0.0, 0.0, 0.0, 0.0, 0.0, 0.0, 0.0, 0.0, 0.0, 0.0, 0.0, 0.0, 0.0, 0.0, 0.0, 0.0, 0.0, 0.0, 0.0, 0.0, 0.0, 0.0, 0.0, 0.0, 0.0, 0.0, 0.0, 0.0, 0.0, 0.0, 0.0, 0.0, 0.0, 0.0, 0.0, 0.0, 0.0, 0.0, 0.0, 0.0, 0.0, 0.0, 0.0, 0.0, 0.0, 0.0, 0.0, 0.0, 0.0, 0.0, 0.0, 0.0, 0.0, 0.0, 0.0, 0.0, 0.0, 0.0, 0.0, 0.0, 0.0, 0.0, 0.0, 0.0, 0.0, 0.0, 0.0, 0.0, 0.0, 0.0, 0.0, 0.0, 0.0, 0.0, 0.0, 0.0, 0.0, 0.0, 0.0, 0.0, 0.0, 0.0, 0.0, 0.0, 0.0, 0.0, 0.0, 0.0, 0.0, 0.0, 0.0, 0.0, 0.0, 0.0, 0.0, 0.0, 0.0, 0.0, 0.0, 0.0, 0.0, 0.0, 0.0, 0.0, 0.0, 0.0, 0.0, 0.0, 0.0, 0.0, 0.0, 0.0, 0.0, 0.0, 0.0, 0.0, 0.0, 0.0, 0.0, 0.0, 0.0, 0.0, 0.0, 0.0, 0.0, 0.0, 0.0, 0.0, 0.0, 0.0, 0.0, 0.0, 0.0, 0.0, 0.0, 0.0, 0.0, 0.0, 0.0, 0.0],
    "Name": "ThresholdDist-0",
    "Overflow": 0.0,
    "Type": "Histo1d",
    "Underflow": 0.0,
    "x": {
        "AxisTitle": "Threshold [e]",
        "Bins": 550,
        "High": 5495.0,
        "Low": -5.0
    },
    "y": {
        "AxisTitle": "Number of Pixels"
    },
    "z": {
        "AxisTitle": "z"
    }
}