time,Hardware,Voltage,Current
1625779126663,high-voltage,1,0.00341494
time,Hardware,Voltage,Current
1625779126663,high-voltage,2,0.0244486
time,Hardware,Voltage,Current
1625779126663,high-voltage,3,0.0373869
time,Hardware,Voltage,Current
1625779126663,high-voltage,4,0.05024
time,Hardware,Voltage,Current
1625779126663,high-voltage,5,0.0605768
time,Hardware,Voltage,Current
1625779126663,high-voltage,6,0.0719499
time,Hardware,Voltage,Current
1625779126663,high-voltage,7,0.0820483
time,Hardware,Voltage,Current
1625779126663,high-voltage,8,0.0911165
time,Hardware,Voltage,Current
1625779126663,high-voltage,9,0.0997781
time,Hardware,Voltage,Current
1625779126663,high-voltage,10,0.107971
time,Hardware,Voltage,Current
1625779126663,high-voltage,11,0.114377
time,Hardware,Voltage,Current
1625779126663,high-voltage,12,0.12078
time,Hardware,Voltage,Current
1625779126663,high-voltage,13,0.126974
time,Hardware,Voltage,Current
1625779126663,high-voltage,14,0.131649
time,Hardware,Voltage,Current
1625779126663,high-voltage,15,0.137478
time,Hardware,Voltage,Current
1625779126663,high-voltage,16,0.142531
time,Hardware,Voltage,Current
1625779126663,high-voltage,17,0.148719
time,Hardware,Voltage,Current
1625779126663,high-voltage,18,0.153111
time,Hardware,Voltage,Current
1625779126663,high-voltage,19,0.158779
time,Hardware,Voltage,Current
1625779126663,high-voltage,20,0.164912
time,Hardware,Voltage,Current
1625779126663,high-voltage,25,0.190905
time,Hardware,Voltage,Current
1625779126663,high-voltage,30,0.218798
time,Hardware,Voltage,Current
1625779126663,high-voltage,35,0.253021
time,Hardware,Voltage,Current
1625779126663,high-voltage,40,0.305634
time,Hardware,Voltage,Current
1625779126663,high-voltage,45,0.410566
time,Hardware,Voltage,Current
1625779126663,high-voltage,50,0.623759
time,Hardware,Voltage,Current
1625779126663,high-voltage,55,0.99197
time,Hardware,Voltage,Current
1625779126663,high-voltage,60,1.58788
time,Hardware,Voltage,Current
1625779126663,high-voltage,65,2.471
time,Hardware,Voltage,Current
1625779126663,high-voltage,70,3.7345
time,Hardware,Voltage,Current
1625779126663,high-voltage,75,5.36832
time,Hardware,Voltage,Current
1625779126663,high-voltage,80,7.5055
time,Hardware,Voltage,Current
1625779126663,high-voltage,85,10
