{
    "Data": [[913.0, 195.0, 82.0, 43.0, 24.0, 15.0, 6.0, 17.0, 14.0, 11.0, 8.0, 10.0, 7.0, 2.0, 4.0, 3.0, 4.0, 1.0, 3.0, 1.0, 5.0, 2.0, 6.0, 5.0, 5.0, 2.0, 3.0, 3.0, 4.0, 0.0, 2.0, 3.0, 2.0, 3.0, 1.0, 3.0, 0.0, 1.0, 3.0, 1.0, 0.0, 0.0, 3.0, 0.0, 2.0, 1.0, 2.0, 2.0, 5.0], [1837.0, 581.0, 266.0, 141.0, 62.0, 70.0, 39.0, 25.0, 24.0, 21.0, 11.0, 7.0, 11.0, 7.0, 8.0, 12.0, 8.0, 2.0, 5.0, 7.0, 4.0, 2.0, 8.0, 4.0, 1.0, 5.0, 1.0, 2.0, 2.0, 2.0, 5.0, 1.0, 5.0, 3.0, 6.0, 4.0, 1.0, 3.0, 2.0, 4.0, 0.0, 2.0, 5.0, 1.0, 5.0, 2.0, 5.0, 1.0, 5.0], [3054.0, 1268.0, 664.0, 406.0, 266.0, 180.0, 131.0, 97.0, 68.0, 55.0, 44.0, 29.0, 22.0, 28.0, 17.0, 7.0, 8.0, 7.0, 7.0, 9.0, 5.0, 6.0, 8.0, 9.0, 5.0, 5.0, 7.0, 6.0, 6.0, 6.0, 11.0, 2.0, 7.0, 6.0, 2.0, 5.0, 4.0, 5.0, 6.0, 0.0, 6.0, 1.0, 8.0, 3.0, 5.0, 9.0, 1.0, 11.0, 7.0], [4194.0, 2168.0, 1389.0, 907.0, 657.0, 480.0, 367.0, 282.0, 244.0, 187.0, 147.0, 132.0, 94.0, 59.0, 64.0, 52.0, 42.0, 40.0, 41.0, 26.0, 34.0, 24.0, 13.0, 21.0, 10.0, 24.0, 14.0, 9.0, 4.0, 7.0, 6.0, 7.0, 7.0, 10.0, 2.0, 14.0, 4.0, 8.0, 5.0, 2.0, 2.0, 9.0, 12.0, 9.0, 9.0, 9.0, 8.0, 4.0, 15.0], [4190.0, 2665.0, 1888.0, 1520.0, 1182.0, 973.0, 818.0, 634.0, 565.0, 449.0, 421.0, 358.0, 276.0, 255.0, 206.0, 191.0, 179.0, 123.0, 127.0, 124.0, 109.0, 89.0, 59.0, 61.0, 62.0, 51.0, 42.0, 34.0, 34.0, 26.0, 30.0, 32.0, 19.0, 23.0, 14.0, 18.0, 17.0, 14.0, 8.0, 10.0, 11.0, 11.0, 12.0, 20.0, 7.0, 11.0, 12.0, 25.0, 21.0], [4331.0, 2386.0, 1927.0, 1623.0, 1352.0, 1234.0, 1148.0, 1018.0, 894.0, 876.0, 764.0, 653.0, 575.0, 557.0, 522.0, 479.0, 419.0, 361.0, 327.0, 346.0, 309.0, 272.0, 229.0, 199.0, 178.0, 175.0, 150.0, 166.0, 129.0, 99.0, 105.0, 90.0, 85.0, 56.0, 67.0, 65.0, 47.0, 45.0, 45.0, 41.0, 40.0, 36.0, 33.0, 33.0, 42.0, 22.0, 24.0, 22.0, 32.0], [7403.0, 4010.0, 2487.0, 1867.0, 1522.0, 1177.0, 1162.0, 1010.0, 984.0, 970.0, 820.0, 821.0, 830.0, 804.0, 777.0, 718.0, 736.0, 697.0, 669.0, 580.0, 557.0, 530.0, 525.0, 495.0, 443.0, 467.0, 426.0, 414.0, 394.0, 354.0, 354.0, 273.0, 275.0, 245.0, 216.0, 246.0, 222.0, 184.0, 174.0, 133.0, 148.0, 128.0, 104.0, 98.0, 92.0, 96.0, 86.0, 83.0, 69.0], [2777.0, 3030.0, 3100.0, 2889.0, 2665.0, 2348.0, 2191.0, 2018.0, 1735.0, 1572.0, 1416.0, 1203.0, 1135.0, 1084.0, 960.0, 963.0, 878.0, 808.0, 822.0, 769.0, 766.0, 751.0, 750.0, 761.0, 722.0, 725.0, 684.0, 636.0, 663.0, 608.0, 621.0, 598.0, 589.0, 589.0, 537.0, 530.0, 515.0, 501.0, 521.0, 451.0, 434.0, 417.0, 367.0, 345.0, 319.0, 294.0, 280.0, 248.0, 260.0], [326.0, 268.0, 334.0, 409.0, 529.0, 628.0, 727.0, 849.0, 958.0, 982.0, 1106.0, 1257.0, 1267.0, 1313.0, 1363.0, 1418.0, 1427.0, 1430.0, 1484.0, 1469.0, 1493.0, 1524.0, 1440.0, 1381.0, 1358.0, 1325.0, 1246.0, 1272.0, 1236.0, 1151.0, 1150.0, 1078.0, 1102.0, 1048.0, 1041.0, 1053.0, 954.0, 962.0, 956.0, 935.0, 907.0, 939.0, 866.0, 915.0, 871.0, 822.0, 831.0, 785.0, 782.0], [236.0, 100.0, 76.0, 67.0, 50.0, 56.0, 76.0, 90.0, 95.0, 101.0, 111.0, 134.0, 151.0, 185.0, 213.0, 217.0, 273.0, 281.0, 356.0, 352.0, 433.0, 522.0, 583.0, 659.0, 735.0, 807.0, 876.0, 974.0, 1027.0, 1184.0, 1304.0, 1380.0, 1441.0, 1605.0, 1682.0, 1759.0, 1943.0, 1949.0, 2130.0, 2173.0, 2263.0, 2262.0, 2363.0, 2384.0, 2322.0, 2239.0, 2313.0, 2354.0, 2299.0], [316.0, 88.0, 58.0, 34.0, 40.0, 34.0, 36.0, 28.0, 30.0, 27.0, 24.0, 25.0, 26.0, 29.0, 37.0, 43.0, 39.0, 44.0, 51.0, 69.0, 68.0, 82.0, 86.0, 87.0, 103.0, 117.0, 137.0, 155.0, 171.0, 211.0, 229.0, 295.0, 309.0, 375.0, 446.0, 541.0, 668.0, 761.0, 944.0, 1123.0, 1360.0, 1584.0, 2016.0, 2479.0, 2976.0, 3758.0, 4883.0, 6250.0, 7908.0], [429.0, 98.0, 50.0, 35.0, 32.0, 25.0, 21.0, 17.0, 19.0, 19.0, 16.0, 17.0, 21.0, 19.0, 21.0, 19.0, 10.0, 23.0, 24.0, 24.0, 24.0, 20.0, 24.0, 33.0, 24.0, 32.0, 35.0, 45.0, 44.0, 61.0, 57.0, 66.0, 77.0, 94.0, 108.0, 112.0, 127.0, 164.0, 237.0, 296.0, 355.0, 457.0, 569.0, 791.0, 1164.0, 1621.0, 2463.0, 4344.0, 9031.0], [723.0, 152.0, 54.0, 26.0, 17.0, 20.0, 18.0, 21.0, 6.0, 17.0, 16.0, 16.0, 11.0, 16.0, 13.0, 16.0, 16.0, 15.0, 12.0, 13.0, 13.0, 13.0, 15.0, 16.0, 17.0, 22.0, 12.0, 17.0, 25.0, 25.0, 18.0, 26.0, 31.0, 48.0, 37.0, 39.0, 46.0, 45.0, 59.0, 94.0, 97.0, 160.0, 197.0, 269.0, 385.0, 577.0, 1010.0, 1910.0, 4963.0], [1244.0, 262.0, 97.0, 37.0, 21.0, 19.0, 11.0, 14.0, 10.0, 10.0, 17.0, 11.0, 10.0, 6.0, 12.0, 9.0, 9.0, 5.0, 9.0, 15.0, 7.0, 9.0, 12.0, 15.0, 12.0, 10.0, 8.0, 18.0, 10.0, 14.0, 13.0, 15.0, 20.0, 17.0, 14.0, 32.0, 23.0, 29.0, 26.0, 28.0, 46.0, 44.0, 62.0, 79.0, 138.0, 181.0, 349.0, 775.0, 2508.0], [2037.0, 532.0, 181.0, 43.0, 31.0, 21.0, 20.0, 12.0, 11.0, 11.0, 7.0, 11.0, 4.0, 5.0, 13.0, 6.0, 2.0, 9.0, 5.0, 4.0, 5.0, 8.0, 9.0, 7.0, 7.0, 5.0, 5.0, 7.0, 14.0, 7.0, 7.0, 14.0, 13.0, 10.0, 11.0, 12.0, 14.0, 14.0, 17.0, 12.0, 26.0, 36.0, 29.0, 43.0, 43.0, 84.0, 137.0, 309.0, 1131.0], [3073.0, 943.0, 361.0, 110.0, 53.0, 23.0, 24.0, 13.0, 7.0, 10.0, 8.0, 3.0, 7.0, 8.0, 5.0, 6.0, 7.0, 6.0, 5.0, 7.0, 8.0, 3.0, 7.0, 1.0, 6.0, 2.0, 7.0, 6.0, 6.0, 11.0, 10.0, 9.0, 7.0, 10.0, 13.0, 11.0, 9.0, 13.0, 11.0, 9.0, 10.0, 15.0, 25.0, 24.0, 33.0, 39.0, 68.0, 106.0, 521.0], [4277.0, 1652.0, 713.0, 275.0, 123.0, 53.0, 34.0, 26.0, 5.0, 12.0, 10.0, 6.0, 14.0, 3.0, 7.0, 9.0, 2.0, 5.0, 6.0, 6.0, 4.0, 6.0, 4.0, 9.0, 4.0, 1.0, 4.0, 8.0, 5.0, 7.0, 11.0, 5.0, 3.0, 7.0, 5.0, 7.0, 8.0, 14.0, 9.0, 9.0, 9.0, 12.0, 17.0, 24.0, 29.0, 26.0, 34.0, 64.0, 243.0], [5077.0, 2508.0, 1294.0, 643.0, 323.0, 173.0, 86.0, 55.0, 33.0, 22.0, 16.0, 7.0, 5.0, 5.0, 5.0, 1.0, 1.0, 6.0, 5.0, 5.0, 2.0, 5.0, 4.0, 5.0, 6.0, 2.0, 2.0, 7.0, 7.0, 7.0, 5.0, 6.0, 7.0, 7.0, 9.0, 9.0, 2.0, 7.0, 6.0, 8.0, 11.0, 10.0, 10.0, 13.0, 10.0, 17.0, 27.0, 52.0, 138.0], [5474.0, 3122.0, 1918.0, 1149.0, 684.0, 434.0, 245.0, 157.0, 93.0, 71.0, 41.0, 27.0, 17.0, 10.0, 11.0, 10.0, 5.0, 0.0, 3.0, 3.0, 7.0, 3.0, 6.0, 3.0, 2.0, 1.0, 5.0, 4.0, 0.0, 4.0, 3.0, 5.0, 2.0, 6.0, 4.0, 4.0, 6.0, 14.0, 4.0, 2.0, 6.0, 8.0, 3.0, 15.0, 18.0, 12.0, 26.0, 43.0, 94.0], [5020.0, 3568.0, 2714.0, 1784.0, 1251.0, 863.0, 557.0, 399.0, 232.0, 184.0, 111.0, 76.0, 57.0, 40.0, 23.0, 17.0, 9.0, 13.0, 12.0, 12.0, 6.0, 7.0, 7.0, 3.0, 7.0, 3.0, 2.0, 1.0, 4.0, 2.0, 4.0, 3.0, 3.0, 4.0, 3.0, 4.0, 3.0, 7.0, 4.0, 5.0, 6.0, 6.0, 7.0, 6.0, 6.0, 10.0, 23.0, 36.0, 73.0], [4127.0, 3533.0, 2880.0, 2229.0, 1749.0, 1297.0, 943.0, 726.0, 534.0, 400.0, 269.0, 215.0, 177.0, 110.0, 74.0, 60.0, 41.0, 40.0, 29.0, 18.0, 10.0, 13.0, 6.0, 3.0, 4.0, 4.0, 3.0, 5.0, 1.0, 4.0, 3.0, 5.0, 6.0, 5.0, 7.0, 3.0, 4.0, 5.0, 3.0, 4.0, 3.0, 7.0, 10.0, 4.0, 7.0, 11.0, 10.0, 20.0, 44.0], [3107.0, 2990.0, 2688.0, 2436.0, 1998.0, 1680.0, 1356.0, 1161.0, 857.0, 753.0, 598.0, 439.0, 362.0, 255.0, 220.0, 153.0, 106.0, 80.0, 78.0, 57.0, 37.0, 35.0, 23.0, 11.0, 9.0, 7.0, 5.0, 11.0, 2.0, 5.0, 3.0, 4.0, 4.0, 7.0, 1.0, 2.0, 1.0, 5.0, 3.0, 5.0, 5.0, 5.0, 6.0, 12.0, 14.0, 10.0, 8.0, 25.0, 34.0], [2072.0, 2187.0, 2177.0, 2048.0, 1948.0, 1878.0, 1622.0, 1470.0, 1233.0, 1080.0, 920.0, 772.0, 680.0, 509.0, 409.0, 385.0, 285.0, 242.0, 170.0, 164.0, 115.0, 90.0, 80.0, 49.0, 48.0, 28.0, 25.0, 23.0, 14.0, 19.0, 7.0, 6.0, 2.0, 6.0, 2.0, 6.0, 3.0, 2.0, 4.0, 7.0, 4.0, 3.0, 4.0, 3.0, 5.0, 12.0, 10.0, 16.0, 32.0], [1291.0, 1414.0, 1581.0, 1624.0, 1716.0, 1570.0, 1581.0, 1573.0, 1377.0, 1243.0, 1175.0, 1032.0, 974.0, 871.0, 701.0, 646.0, 524.0, 454.0, 398.0, 318.0, 276.0, 260.0, 183.0, 143.0, 154.0, 101.0, 90.0, 88.0, 54.0, 41.0, 31.0, 29.0, 22.0, 11.0, 11.0, 8.0, 8.0, 7.0, 5.0, 4.0, 8.0, 3.0, 1.0, 2.0, 2.0, 4.0, 7.0, 14.0, 33.0], [908.0, 914.0, 1069.0, 1120.0, 1208.0, 1224.0, 1277.0, 1266.0, 1285.0, 1276.0, 1157.0, 1126.0, 1067.0, 1055.0, 936.0, 838.0, 771.0, 694.0, 665.0, 571.0, 531.0, 478.0, 398.0, 345.0, 303.0, 231.0, 203.0, 173.0, 147.0, 115.0, 97.0, 68.0, 59.0, 49.0, 37.0, 34.0, 26.0, 12.0, 13.0, 13.0, 5.0, 3.0, 3.0, 5.0, 7.0, 9.0, 5.0, 13.0, 23.0], [671.0, 590.0, 625.0, 728.0, 759.0, 828.0, 889.0, 967.0, 968.0, 986.0, 1048.0, 1045.0, 1078.0, 1055.0, 982.0, 993.0, 946.0, 943.0, 827.0, 806.0, 709.0, 708.0, 652.0, 579.0, 484.0, 435.0, 385.0, 370.0, 320.0, 300.0, 241.0, 206.0, 148.0, 137.0, 119.0, 97.0, 75.0, 64.0, 38.0, 45.0, 18.0, 29.0, 25.0, 13.0, 7.0, 7.0, 9.0, 3.0, 13.0], [414.0, 445.0, 454.0, 449.0, 528.0, 545.0, 557.0, 609.0, 685.0, 684.0, 794.0, 819.0, 866.0, 906.0, 921.0, 890.0, 970.0, 914.0, 905.0, 924.0, 869.0, 828.0, 851.0, 799.0, 727.0, 680.0, 672.0, 578.0, 529.0, 463.0, 448.0, 390.0, 346.0, 292.0, 264.0, 221.0, 234.0, 187.0, 136.0, 114.0, 84.0, 85.0, 47.0, 39.0, 28.0, 20.0, 15.0, 13.0, 13.0], [400.0, 333.0, 370.0, 345.0, 360.0, 414.0, 416.0, 432.0, 426.0, 519.0, 502.0, 576.0, 608.0, 679.0, 676.0, 740.0, 706.0, 794.0, 827.0, 801.0, 807.0, 812.0, 787.0, 861.0, 879.0, 803.0, 785.0, 763.0, 754.0, 687.0, 630.0, 651.0, 615.0, 549.0, 523.0, 481.0, 408.0, 343.0, 281.0, 243.0, 214.0, 178.0, 137.0, 103.0, 66.0, 60.0, 38.0, 36.0, 23.0], [308.0, 325.0, 318.0, 277.0, 294.0, 297.0, 319.0, 306.0, 326.0, 337.0, 369.0, 379.0, 347.0, 440.0, 439.0, 485.0, 488.0, 569.0, 565.0, 578.0, 673.0, 729.0, 714.0, 743.0, 705.0, 751.0, 807.0, 833.0, 812.0, 854.0, 851.0, 848.0, 778.0, 756.0, 752.0, 695.0, 664.0, 621.0, 526.0, 488.0, 448.0, 370.0, 317.0, 260.0, 212.0, 183.0, 117.0, 106.0, 56.0], [231.0, 219.0, 206.0, 208.0, 224.0, 232.0, 232.0, 256.0, 251.0, 236.0, 246.0, 233.0, 275.0, 281.0, 301.0, 345.0, 319.0, 381.0, 448.0, 385.0, 468.0, 468.0, 536.0, 533.0, 583.0, 684.0, 701.0, 756.0, 789.0, 773.0, 797.0, 841.0, 853.0, 925.0, 849.0, 882.0, 906.0, 833.0, 796.0, 779.0, 775.0, 663.0, 612.0, 526.0, 515.0, 397.0, 319.0, 217.0, 162.0], [278.0, 229.0, 218.0, 190.0, 164.0, 205.0, 169.0, 180.0, 152.0, 154.0, 169.0, 154.0, 191.0, 185.0, 182.0, 204.0, 220.0, 231.0, 268.0, 273.0, 303.0, 308.0, 338.0, 366.0, 388.0, 451.0, 489.0, 550.0, 592.0, 618.0, 676.0, 741.0, 788.0, 765.0, 839.0, 895.0, 938.0, 1022.0, 975.0, 972.0, 1053.0, 1003.0, 955.0, 912.0, 886.0, 786.0, 664.0, 545.0, 425.0], [256.0, 204.0, 193.0, 202.0, 162.0, 207.0, 215.0, 159.0, 173.0, 162.0, 188.0, 173.0, 172.0, 178.0, 182.0, 171.0, 160.0, 172.0, 173.0, 185.0, 189.0, 189.0, 226.0, 207.0, 264.0, 299.0, 304.0, 351.0, 389.0, 449.0, 476.0, 538.0, 626.0, 632.0, 684.0, 803.0, 809.0, 894.0, 1026.0, 1058.0, 1052.0, 1173.0, 1130.0, 1221.0, 1199.0, 1234.0, 1059.0, 1029.0, 822.0], [188.0, 151.0, 127.0, 147.0, 129.0, 136.0, 186.0, 153.0, 131.0, 160.0, 127.0, 137.0, 157.0, 125.0, 146.0, 118.0, 125.0, 130.0, 130.0, 135.0, 132.0, 131.0, 170.0, 178.0, 158.0, 142.0, 230.0, 213.0, 238.0, 227.0, 310.0, 335.0, 400.0, 411.0, 511.0, 587.0, 662.0, 712.0, 795.0, 998.0, 1027.0, 1185.0, 1264.0, 1448.0, 1507.0, 1592.0, 1689.0, 1610.0, 1517.0], [314.0, 231.0, 141.0, 133.0, 118.0, 97.0, 125.0, 116.0, 121.0, 125.0, 96.0, 114.0, 138.0, 123.0, 112.0, 73.0, 85.0, 109.0, 96.0, 95.0, 121.0, 115.0, 118.0, 144.0, 120.0, 141.0, 171.0, 166.0, 157.0, 137.0, 136.0, 229.0, 259.0, 262.0, 301.0, 360.0, 401.0, 522.0, 614.0, 688.0, 767.0, 941.0, 1147.0, 1334.0, 1501.0, 1790.0, 2039.0, 2259.0, 2477.0], [210.0, 146.0, 90.0, 138.0, 101.0, 147.0, 131.0, 130.0, 86.0, 104.0, 89.0, 80.0, 108.0, 136.0, 107.0, 141.0, 114.0, 110.0, 104.0, 123.0, 109.0, 107.0, 134.0, 77.0, 94.0, 101.0, 148.0, 109.0, 103.0, 98.0, 113.0, 117.0, 134.0, 180.0, 186.0, 218.0, 252.0, 286.0, 361.0, 475.0, 594.0, 680.0, 889.0, 1061.0, 1401.0, 1706.0, 2084.0, 2569.0, 3170.0], [109.0, 138.0, 141.0, 71.0, 124.0, 87.0, 100.0, 95.0, 114.0, 65.0, 127.0, 135.0, 120.0, 128.0, 95.0, 199.0, 84.0, 116.0, 89.0, 30.0, 36.0, 85.0, 52.0, 57.0, 106.0, 92.0, 96.0, 104.0, 89.0, 125.0, 106.0, 95.0, 154.0, 175.0, 118.0, 107.0, 142.0, 168.0, 169.0, 238.0, 301.0, 419.0, 606.0, 817.0, 1048.0, 1451.0, 1985.0, 2711.0, 3894.0], [130.0, 45.0, 73.0, 148.0, 32.0, 57.0, 134.0, 102.0, 91.0, 91.0, 140.0, 53.0, 98.0, 82.0, 93.0, 84.0, 134.0, 134.0, 114.0, 145.0, 180.0, 74.0, 121.0, 117.0, 117.0, 73.0, 101.0, 111.0, 91.0, 109.0, 142.0, 100.0, 78.0, 68.0, 117.0, 122.0, 131.0, 87.0, 123.0, 161.0, 177.0, 256.0, 298.0, 472.0, 636.0, 1024.0, 1621.0, 2388.0, 4060.0], [262.0, 115.0, 94.0, 87.0, 119.0, 143.0, 111.0, 118.0, 182.0, 78.0, 144.0, 62.0, 82.0, 40.0, 107.0, 120.0, 199.0, 145.0, 99.0, 92.0, 211.0, 176.0, 100.0, 81.0, 93.0, 75.0, 64.0, 38.0, 66.0, 39.0, 95.0, 122.0, 96.0, 56.0, 59.0, 74.0, 98.0, 55.0, 100.0, 128.0, 154.0, 175.0, 278.0, 233.0, 373.0, 615.0, 1109.0, 1880.0, 3720.0], [131.0, 214.0, 116.0, 212.0, 84.0, 107.0, 103.0, 175.0, 138.0, 52.0, 95.0, 156.0, 183.0, 86.0, 73.0, 49.0, 78.0, 64.0, 120.0, 139.0, 92.0, 137.0, 155.0, 179.0, 54.0, 39.0, 106.0, 32.0, 68.0, 66.0, 102.0, 58.0, 20.0, 17.0, 37.0, 76.0, 61.0, 63.0, 52.0, 74.0, 91.0, 102.0, 112.0, 138.0, 178.0, 370.0, 747.0, 1324.0, 3144.0], [178.0, 137.0, 208.0, 126.0, 63.0, 107.0, 150.0, 146.0, 90.0, 97.0, 151.0, 91.0, 95.0, 137.0, 89.0, 89.0, 120.0, 136.0, 37.0, 66.0, 88.0, 73.0, 128.0, 113.0, 123.0, 87.0, 135.0, 104.0, 151.0, 119.0, 127.0, 87.0, 77.0, 49.0, 39.0, 82.0, 97.0, 66.0, 95.0, 190.0, 153.0, 154.0, 91.0, 132.0, 221.0, 197.0, 411.0, 873.0, 2264.0], [171.0, 102.0, 89.0, 153.0, 105.0, 178.0, 143.0, 116.0, 48.0, 78.0, 124.0, 91.0, 155.0, 153.0, 90.0, 69.0, 64.0, 111.0, 101.0, 94.0, 176.0, 162.0, 132.0, 151.0, 124.0, 74.0, 94.0, 69.0, 144.0, 60.0, 81.0, 100.0, 115.0, 17.0, 108.0, 65.0, 138.0, 144.0, 72.0, 74.0, 125.0, 63.0, 55.0, 124.0, 90.0, 91.0, 218.0, 507.0, 1637.0], [220.0, 142.0, 102.0, 188.0, 105.0, 184.0, 215.0, 115.0, 173.0, 206.0, 168.0, 90.0, 118.0, 106.0, 35.0, 57.0, 87.0, 161.0, 134.0, 228.0, 80.0, 99.0, 78.0, 71.0, 64.0, 12.0, 45.0, 74.0, 78.0, 134.0, 64.0, 116.0, 141.0, 117.0, 102.0, 158.0, 91.0, 142.0, 114.0, 98.0, 146.0, 161.0, 187.0, 46.0, 28.0, 86.0, 173.0, 355.0, 1065.0], [240.0, 117.0, 193.0, 77.0, 100.0, 101.0, 66.0, 80.0, 114.0, 84.0, 145.0, 248.0, 136.0, 93.0, 71.0, 130.0, 159.0, 147.0, 28.0, 145.0, 220.0, 104.0, 34.0, 76.0, 71.0, 78.0, 113.0, 42.0, 138.0, 173.0, 166.0, 104.0, 117.0, 67.0, 129.0, 113.0, 95.0, 98.0, 128.0, 118.0, 84.0, 70.0, 124.0, 82.0, 74.0, 60.0, 114.0, 252.0, 658.0], [191.0, 190.0, 204.0, 112.0, 134.0, 75.0, 113.0, 143.0, 113.0, 70.0, 105.0, 87.0, 60.0, 74.0, 74.0, 120.0, 132.0, 89.0, 93.0, 81.0, 77.0, 152.0, 164.0, 55.0, 82.0, 79.0, 60.0, 77.0, 185.0, 29.0, 128.0, 94.0, 131.0, 89.0, 75.0, 122.0, 81.0, 67.0, 110.0, 81.0, 132.0, 116.0, 38.0, 35.0, 46.0, 113.0, 147.0, 139.0, 397.0], [159.0, 100.0, 21.0, 146.0, 137.0, 81.0, 165.0, 111.0, 125.0, 108.0, 191.0, 103.0, 53.0, 123.0, 83.0, 67.0, 101.0, 147.0, 56.0, 81.0, 75.0, 191.0, 155.0, 28.0, 42.0, 65.0, 116.0, 170.0, 131.0, 106.0, 87.0, 73.0, 86.0, 50.0, 132.0, 129.0, 70.0, 35.0, 78.0, 119.0, 82.0, 78.0, 46.0, 55.0, 71.0, 114.0, 130.0, 119.0, 236.0], [165.0, 101.0, 195.0, 232.0, 78.0, 91.0, 165.0, 80.0, 126.0, 143.0, 162.0, 119.0, 89.0, 98.0, 135.0, 84.0, 157.0, 163.0, 127.0, 148.0, 49.0, 147.0, 184.0, 94.0, 84.0, 46.0, 92.0, 60.0, 51.0, 135.0, 121.0, 59.0, 23.0, 61.0, 109.0, 168.0, 85.0, 62.0, 51.0, 60.0, 76.0, 78.0, 132.0, 118.0, 63.0, 59.0, 60.0, 156.0, 212.0], [155.0, 76.0, 75.0, 149.0, 184.0, 136.0, 132.0, 75.0, 114.0, 103.0, 122.0, 44.0, 97.0, 159.0, 158.0, 143.0, 117.0, 104.0, 135.0, 12.0, 75.0, 105.0, 127.0, 132.0, 124.0, 102.0, 69.0, 70.0, 101.0, 63.0, 75.0, 79.0, 57.0, 85.0, 133.0, 93.0, 149.0, 110.0, 33.0, 113.0, 101.0, 84.0, 65.0, 143.0, 18.0, 14.0, 58.0, 133.0, 140.0], [249.0, 171.0, 85.0, 156.0, 128.0, 94.0, 81.0, 73.0, 118.0, 113.0, 38.0, 146.0, 51.0, 69.0, 81.0, 45.0, 23.0, 134.0, 198.0, 114.0, 100.0, 36.0, 104.0, 138.0, 71.0, 85.0, 15.0, 34.0, 75.0, 119.0, 98.0, 57.0, 48.0, 23.0, 25.0, 7.0, 96.0, 48.0, 66.0, 57.0, 42.0, 59.0, 99.0, 97.0, 72.0, 129.0, 236.0, 111.0, 150.0], [158.0, 133.0, 118.0, 82.0, 39.0, 78.0, 99.0, 104.0, 65.0, 45.0, 124.0, 109.0, 185.0, 92.0, 66.0, 55.0, 87.0, 129.0, 62.0, 108.0, 99.0, 105.0, 143.0, 44.0, 62.0, 74.0, 94.0, 68.0, 126.0, 56.0, 29.0, 70.0, 73.0, 31.0, 97.0, 102.0, 67.0, 111.0, 73.0, 77.0, 68.0, 72.0, 67.0, 22.0, 93.0, 103.0, 68.0, 82.0, 77.0], [135.0, 186.0, 133.0, 89.0, 123.0, 74.0, 45.0, 98.0, 147.0, 128.0, 112.0, 143.0, 112.0, 127.0, 128.0, 72.0, 86.0, 56.0, 140.0, 116.0, 110.0, 109.0, 79.0, 64.0, 23.0, 106.0, 125.0, 42.0, 99.0, 104.0, 119.0, 87.0, 81.0, 111.0, 139.0, 124.0, 128.0, 44.0, 83.0, 103.0, 27.0, 114.0, 68.0, 96.0, 82.0, 30.0, 57.0, 40.0, 101.0], [201.0, 88.0, 120.0, 163.0, 109.0, 100.0, 149.0, 155.0, 83.0, 154.0, 91.0, 69.0, 140.0, 103.0, 34.0, 58.0, 77.0, 125.0, 135.0, 121.0, 48.0, 68.0, 68.0, 30.0, 67.0, 64.0, 68.0, 44.0, 54.0, 16.0, 32.0, 41.0, 73.0, 83.0, 46.0, 45.0, 92.0, 83.0, 46.0, 90.0, 13.0, 107.0, 82.0, 65.0, 11.0, 105.0, 83.0, 43.0, 62.0]],
    "Name": "sCurve-0",
    "Overflow": 2347753.0,
    "Type": "Histo2d",
    "Underflow": 0.0,
    "x": {
        "AxisTitle": "Vcal",
        "Bins": 51,
        "High": 302.5,
        "Low": 47.5
    },
    "y": {
        "AxisTitle": "Occupancy",
        "Bins": 49,
        "High": 49.5,
        "Low": 0.5
    },
    "z": {
        "AxisTitle": "Number of pixels"
    }
}