{
    "Data": [0.0, 0.0, 0.0, 0.0, 0.0, 0.0, 0.0, 0.0, 0.0, 0.0, 0.0, 0.0, 0.0, 0.0, 0.0, 0.0, 0.0, 2.0, 0.0, 1.0, 0.0, 0.0, 0.0, 6.0, 6.0, 9.0, 7.0, 0.0, 20.0, 28.0, 5.0, 23.0, 47.0, 45.0, 36.0, 46.0, 49.0, 49.0, 50.0, 50.0, 50.0, 36.0, 50.0, 50.0, 50.0, 50.0, 0.0, 50.0, 29.0, 50.0, 42.0],
    "Name": "Scurve-30-96",
    "Overflow": 0.0,
    "Type": "Histo1d",
    "Underflow": 0.0,
    "x": {
        "AxisTitle": "Vcal",
        "Bins": 51,
        "High": 302.5,
        "Low": 47.5
    },
    "y": {
        "AxisTitle": "Occupancy"
    },
    "z": {
        "AxisTitle": "z"
    }
}