{
    "Data": [[1152.0, 347.0, 139.0, 81.0, 72.0, 43.0, 33.0, 16.0, 12.0, 8.0, 11.0, 10.0, 11.0, 4.0, 5.0, 5.0, 8.0, 9.0, 6.0, 6.0, 3.0, 4.0, 4.0, 3.0, 4.0, 6.0, 4.0, 4.0, 1.0, 3.0, 0.0, 1.0, 2.0, 3.0, 5.0, 2.0, 3.0, 3.0, 3.0, 1.0, 5.0, 4.0, 2.0, 2.0, 3.0, 4.0, 0.0, 4.0, 4.0], [2195.0, 783.0, 382.0, 237.0, 155.0, 112.0, 96.0, 57.0, 46.0, 42.0, 24.0, 27.0, 14.0, 11.0, 12.0, 8.0, 8.0, 8.0, 9.0, 4.0, 4.0, 6.0, 6.0, 6.0, 4.0, 6.0, 2.0, 5.0, 4.0, 5.0, 6.0, 3.0, 4.0, 9.0, 6.0, 4.0, 7.0, 8.0, 2.0, 4.0, 2.0, 2.0, 4.0, 7.0, 8.0, 5.0, 2.0, 6.0, 5.0], [3284.0, 1554.0, 853.0, 580.0, 378.0, 278.0, 224.0, 159.0, 131.0, 136.0, 100.0, 74.0, 59.0, 47.0, 30.0, 33.0, 27.0, 32.0, 32.0, 15.0, 25.0, 15.0, 17.0, 12.0, 4.0, 7.0, 8.0, 9.0, 7.0, 9.0, 6.0, 7.0, 3.0, 6.0, 9.0, 4.0, 2.0, 9.0, 8.0, 9.0, 6.0, 6.0, 6.0, 9.0, 11.0, 4.0, 8.0, 7.0, 7.0], [3890.0, 2213.0, 1437.0, 1045.0, 819.0, 644.0, 527.0, 412.0, 336.0, 275.0, 251.0, 202.0, 155.0, 162.0, 109.0, 128.0, 87.0, 81.0, 69.0, 61.0, 53.0, 43.0, 37.0, 44.0, 25.0, 41.0, 38.0, 34.0, 28.0, 23.0, 15.0, 23.0, 16.0, 12.0, 13.0, 12.0, 6.0, 9.0, 11.0, 10.0, 9.0, 8.0, 18.0, 15.0, 8.0, 16.0, 11.0, 14.0, 22.0], [3745.0, 2383.0, 1770.0, 1393.0, 1120.0, 1022.0, 881.0, 736.0, 630.0, 585.0, 486.0, 445.0, 424.0, 361.0, 310.0, 310.0, 263.0, 235.0, 196.0, 206.0, 159.0, 170.0, 140.0, 128.0, 122.0, 103.0, 89.0, 75.0, 71.0, 67.0, 66.0, 62.0, 59.0, 54.0, 68.0, 34.0, 35.0, 37.0, 28.0, 30.0, 22.0, 27.0, 19.0, 22.0, 18.0, 24.0, 30.0, 23.0, 35.0], [4275.0, 2124.0, 1558.0, 1378.0, 1166.0, 1085.0, 991.0, 896.0, 824.0, 820.0, 715.0, 687.0, 630.0, 586.0, 575.0, 539.0, 496.0, 441.0, 456.0, 431.0, 404.0, 353.0, 319.0, 328.0, 319.0, 250.0, 257.0, 210.0, 252.0, 226.0, 189.0, 174.0, 170.0, 169.0, 134.0, 126.0, 117.0, 122.0, 106.0, 107.0, 95.0, 88.0, 74.0, 73.0, 73.0, 63.0, 60.0, 50.0, 71.0], [6994.0, 4099.0, 2685.0, 1792.0, 1464.0, 1147.0, 998.0, 934.0, 830.0, 841.0, 766.0, 712.0, 651.0, 667.0, 703.0, 619.0, 675.0, 601.0, 602.0, 582.0, 549.0, 522.0, 509.0, 517.0, 557.0, 495.0, 485.0, 476.0, 449.0, 432.0, 419.0, 401.0, 400.0, 391.0, 347.0, 331.0, 340.0, 323.0, 307.0, 264.0, 258.0, 244.0, 233.0, 222.0, 220.0, 237.0, 171.0, 188.0, 186.0], [2553.0, 2482.0, 2688.0, 2541.0, 2388.0, 2207.0, 2017.0, 1852.0, 1722.0, 1510.0, 1403.0, 1258.0, 1158.0, 1050.0, 941.0, 888.0, 858.0, 852.0, 816.0, 737.0, 697.0, 744.0, 687.0, 655.0, 638.0, 663.0, 597.0, 606.0, 575.0, 635.0, 674.0, 649.0, 610.0, 589.0, 592.0, 616.0, 580.0, 599.0, 612.0, 608.0, 585.0, 573.0, 525.0, 576.0, 522.0, 560.0, 557.0, 583.0, 536.0], [529.0, 319.0, 290.0, 377.0, 453.0, 507.0, 634.0, 709.0, 771.0, 860.0, 878.0, 1035.0, 1058.0, 1047.0, 1116.0, 1198.0, 1252.0, 1226.0, 1306.0, 1276.0, 1337.0, 1262.0, 1333.0, 1290.0, 1299.0, 1218.0, 1238.0, 1181.0, 1183.0, 1163.0, 1098.0, 1081.0, 1139.0, 1070.0, 980.0, 1042.0, 1001.0, 984.0, 1007.0, 1006.0, 1023.0, 1006.0, 1050.0, 1061.0, 1082.0, 1107.0, 1148.0, 1266.0, 1414.0], [605.0, 149.0, 85.0, 70.0, 84.0, 81.0, 79.0, 84.0, 101.0, 111.0, 115.0, 133.0, 144.0, 160.0, 184.0, 198.0, 236.0, 274.0, 265.0, 350.0, 365.0, 435.0, 447.0, 529.0, 549.0, 688.0, 747.0, 766.0, 853.0, 947.0, 1033.0, 1097.0, 1181.0, 1253.0, 1372.0, 1552.0, 1609.0, 1743.0, 1759.0, 1950.0, 2045.0, 2128.0, 2192.0, 2254.0, 2511.0, 2478.0, 2650.0, 2956.0, 3449.0], [939.0, 215.0, 92.0, 58.0, 45.0, 42.0, 36.0, 37.0, 32.0, 23.0, 36.0, 42.0, 30.0, 42.0, 40.0, 29.0, 44.0, 39.0, 46.0, 51.0, 59.0, 54.0, 73.0, 77.0, 91.0, 118.0, 109.0, 143.0, 137.0, 209.0, 211.0, 227.0, 252.0, 266.0, 343.0, 438.0, 509.0, 578.0, 679.0, 845.0, 1035.0, 1286.0, 1474.0, 1907.0, 2464.0, 3151.0, 4220.0, 5736.0, 8412.0], [1498.0, 348.0, 130.0, 51.0, 45.0, 42.0, 23.0, 26.0, 38.0, 13.0, 17.0, 16.0, 24.0, 21.0, 21.0, 18.0, 18.0, 21.0, 19.0, 20.0, 24.0, 38.0, 30.0, 23.0, 36.0, 39.0, 30.0, 40.0, 40.0, 39.0, 62.0, 61.0, 59.0, 95.0, 81.0, 104.0, 124.0, 159.0, 172.0, 197.0, 306.0, 331.0, 442.0, 651.0, 895.0, 1202.0, 1934.0, 3313.0, 7612.0], [2512.0, 738.0, 238.0, 102.0, 58.0, 41.0, 23.0, 22.0, 22.0, 18.0, 13.0, 16.0, 10.0, 10.0, 11.0, 14.0, 13.0, 18.0, 14.0, 16.0, 15.0, 13.0, 19.0, 8.0, 11.0, 16.0, 20.0, 17.0, 17.0, 21.0, 15.0, 25.0, 26.0, 27.0, 44.0, 31.0, 51.0, 58.0, 58.0, 77.0, 112.0, 97.0, 144.0, 195.0, 292.0, 451.0, 731.0, 1398.0, 3778.0], [3626.0, 1269.0, 479.0, 191.0, 93.0, 49.0, 41.0, 26.0, 22.0, 13.0, 14.0, 15.0, 11.0, 10.0, 13.0, 12.0, 7.0, 6.0, 9.0, 6.0, 4.0, 13.0, 7.0, 8.0, 5.0, 16.0, 8.0, 23.0, 17.0, 15.0, 14.0, 18.0, 11.0, 16.0, 18.0, 23.0, 21.0, 23.0, 23.0, 37.0, 34.0, 44.0, 65.0, 90.0, 112.0, 177.0, 313.0, 570.0, 1809.0], [4735.0, 2063.0, 1006.0, 483.0, 272.0, 139.0, 71.0, 45.0, 28.0, 20.0, 14.0, 18.0, 16.0, 14.0, 10.0, 4.0, 3.0, 5.0, 8.0, 7.0, 8.0, 3.0, 4.0, 3.0, 6.0, 8.0, 9.0, 12.0, 5.0, 6.0, 13.0, 9.0, 14.0, 9.0, 9.0, 14.0, 9.0, 13.0, 18.0, 18.0, 25.0, 29.0, 41.0, 25.0, 51.0, 71.0, 127.0, 250.0, 898.0], [5249.0, 2958.0, 1760.0, 973.0, 573.0, 308.0, 193.0, 123.0, 77.0, 45.0, 33.0, 16.0, 14.0, 14.0, 10.0, 8.0, 9.0, 11.0, 6.0, 9.0, 5.0, 5.0, 3.0, 7.0, 6.0, 7.0, 8.0, 5.0, 8.0, 8.0, 4.0, 7.0, 6.0, 8.0, 9.0, 8.0, 6.0, 10.0, 7.0, 13.0, 13.0, 19.0, 23.0, 26.0, 38.0, 43.0, 62.0, 112.0, 459.0], [5279.0, 3528.0, 2425.0, 1601.0, 1062.0, 702.0, 485.0, 309.0, 224.0, 132.0, 71.0, 69.0, 56.0, 42.0, 17.0, 16.0, 15.0, 11.0, 10.0, 9.0, 5.0, 3.0, 6.0, 1.0, 3.0, 8.0, 5.0, 8.0, 3.0, 9.0, 8.0, 8.0, 10.0, 8.0, 5.0, 2.0, 3.0, 10.0, 6.0, 11.0, 12.0, 19.0, 15.0, 17.0, 18.0, 25.0, 36.0, 70.0, 211.0], [4384.0, 3557.0, 2906.0, 2242.0, 1608.0, 1219.0, 911.0, 649.0, 509.0, 347.0, 256.0, 178.0, 153.0, 114.0, 71.0, 54.0, 41.0, 25.0, 21.0, 20.0, 17.0, 12.0, 5.0, 9.0, 5.0, 6.0, 7.0, 1.0, 3.0, 5.0, 4.0, 4.0, 5.0, 5.0, 6.0, 6.0, 2.0, 4.0, 6.0, 11.0, 14.0, 10.0, 17.0, 15.0, 14.0, 20.0, 29.0, 46.0, 142.0], [3162.0, 2869.0, 2761.0, 2422.0, 2029.0, 1654.0, 1380.0, 1116.0, 942.0, 680.0, 563.0, 441.0, 357.0, 286.0, 198.0, 171.0, 134.0, 86.0, 80.0, 58.0, 38.0, 29.0, 32.0, 26.0, 9.0, 10.0, 11.0, 3.0, 7.0, 7.0, 8.0, 5.0, 1.0, 6.0, 6.0, 7.0, 6.0, 4.0, 6.0, 5.0, 5.0, 9.0, 4.0, 12.0, 19.0, 21.0, 23.0, 34.0, 78.0], [1955.0, 2124.0, 2211.0, 2098.0, 1920.0, 1891.0, 1655.0, 1359.0, 1336.0, 1112.0, 944.0, 793.0, 650.0, 553.0, 468.0, 349.0, 292.0, 286.0, 206.0, 135.0, 146.0, 103.0, 97.0, 77.0, 45.0, 35.0, 33.0, 22.0, 17.0, 14.0, 17.0, 13.0, 7.0, 3.0, 8.0, 3.0, 5.0, 4.0, 6.0, 6.0, 3.0, 4.0, 5.0, 10.0, 16.0, 12.0, 11.0, 35.0, 50.0], [1163.0, 1322.0, 1453.0, 1627.0, 1582.0, 1642.0, 1512.0, 1441.0, 1431.0, 1282.0, 1229.0, 1080.0, 1056.0, 846.0, 802.0, 695.0, 598.0, 507.0, 439.0, 388.0, 308.0, 275.0, 231.0, 207.0, 163.0, 130.0, 98.0, 83.0, 54.0, 38.0, 39.0, 39.0, 30.0, 18.0, 12.0, 15.0, 10.0, 6.0, 7.0, 4.0, 6.0, 1.0, 7.0, 8.0, 13.0, 9.0, 10.0, 22.0, 51.0], [673.0, 807.0, 991.0, 1037.0, 1153.0, 1145.0, 1279.0, 1302.0, 1218.0, 1232.0, 1219.0, 1162.0, 1057.0, 1050.0, 986.0, 919.0, 865.0, 842.0, 708.0, 616.0, 567.0, 472.0, 422.0, 381.0, 329.0, 311.0, 248.0, 215.0, 161.0, 140.0, 112.0, 94.0, 89.0, 58.0, 56.0, 27.0, 21.0, 31.0, 15.0, 12.0, 11.0, 8.0, 8.0, 10.0, 11.0, 11.0, 13.0, 18.0, 32.0], [502.0, 495.0, 561.0, 657.0, 691.0, 755.0, 885.0, 911.0, 920.0, 928.0, 971.0, 1054.0, 1037.0, 968.0, 1025.0, 962.0, 1022.0, 939.0, 920.0, 865.0, 771.0, 733.0, 656.0, 614.0, 577.0, 528.0, 538.0, 433.0, 360.0, 342.0, 288.0, 255.0, 202.0, 212.0, 155.0, 126.0, 104.0, 76.0, 61.0, 50.0, 34.0, 38.0, 19.0, 13.0, 14.0, 9.0, 13.0, 14.0, 32.0], [379.0, 311.0, 382.0, 415.0, 432.0, 494.0, 523.0, 591.0, 616.0, 665.0, 752.0, 731.0, 772.0, 812.0, 875.0, 908.0, 893.0, 925.0, 926.0, 897.0, 850.0, 910.0, 801.0, 800.0, 772.0, 722.0, 632.0, 690.0, 611.0, 583.0, 574.0, 471.0, 468.0, 363.0, 357.0, 295.0, 238.0, 217.0, 188.0, 149.0, 124.0, 118.0, 84.0, 49.0, 36.0, 29.0, 19.0, 19.0, 20.0], [364.0, 326.0, 284.0, 299.0, 255.0, 296.0, 283.0, 330.0, 349.0, 365.0, 438.0, 461.0, 521.0, 586.0, 586.0, 607.0, 668.0, 712.0, 664.0, 738.0, 809.0, 854.0, 816.0, 809.0, 827.0, 857.0, 866.0, 801.0, 819.0, 836.0, 778.0, 724.0, 718.0, 632.0, 575.0, 513.0, 539.0, 446.0, 435.0, 366.0, 289.0, 235.0, 204.0, 155.0, 137.0, 121.0, 83.0, 55.0, 37.0], [221.0, 172.0, 156.0, 148.0, 159.0, 150.0, 205.0, 224.0, 232.0, 256.0, 289.0, 311.0, 371.0, 350.0, 371.0, 439.0, 423.0, 491.0, 500.0, 549.0, 590.0, 618.0, 713.0, 708.0, 746.0, 789.0, 818.0, 802.0, 826.0, 837.0, 935.0, 879.0, 830.0, 863.0, 854.0, 835.0, 723.0, 729.0, 667.0, 634.0, 647.0, 539.0, 501.0, 378.0, 332.0, 260.0, 186.0, 164.0, 117.0], [181.0, 166.0, 177.0, 197.0, 201.0, 164.0, 182.0, 153.0, 160.0, 161.0, 153.0, 169.0, 190.0, 175.0, 206.0, 234.0, 271.0, 273.0, 279.0, 316.0, 372.0, 383.0, 428.0, 495.0, 507.0, 542.0, 599.0, 653.0, 692.0, 713.0, 842.0, 849.0, 815.0, 877.0, 930.0, 993.0, 969.0, 923.0, 988.0, 948.0, 977.0, 864.0, 874.0, 765.0, 681.0, 587.0, 509.0, 352.0, 259.0], [239.0, 187.0, 206.0, 121.0, 141.0, 165.0, 126.0, 135.0, 133.0, 115.0, 112.0, 105.0, 124.0, 152.0, 135.0, 135.0, 166.0, 174.0, 204.0, 194.0, 210.0, 224.0, 263.0, 273.0, 360.0, 349.0, 410.0, 442.0, 490.0, 542.0, 602.0, 650.0, 710.0, 757.0, 823.0, 914.0, 958.0, 977.0, 1079.0, 1086.0, 1102.0, 1092.0, 1090.0, 1143.0, 1107.0, 1026.0, 926.0, 806.0, 620.0], [246.0, 164.0, 82.0, 84.0, 99.0, 101.0, 99.0, 90.0, 134.0, 117.0, 113.0, 118.0, 108.0, 132.0, 116.0, 147.0, 133.0, 156.0, 128.0, 126.0, 137.0, 135.0, 150.0, 160.0, 188.0, 229.0, 216.0, 263.0, 275.0, 297.0, 355.0, 419.0, 512.0, 538.0, 593.0, 664.0, 755.0, 804.0, 902.0, 1018.0, 1164.0, 1296.0, 1324.0, 1372.0, 1379.0, 1500.0, 1571.0, 1455.0, 1354.0], [84.0, 112.0, 156.0, 157.0, 99.0, 102.0, 120.0, 84.0, 90.0, 106.0, 89.0, 59.0, 42.0, 63.0, 75.0, 85.0, 60.0, 79.0, 83.0, 89.0, 123.0, 111.0, 92.0, 125.0, 138.0, 152.0, 153.0, 182.0, 175.0, 190.0, 195.0, 267.0, 292.0, 341.0, 380.0, 424.0, 500.0, 606.0, 694.0, 831.0, 947.0, 1025.0, 1195.0, 1417.0, 1674.0, 1769.0, 2039.0, 2156.0, 2198.0], [81.0, 155.0, 50.0, 64.0, 79.0, 108.0, 100.0, 51.0, 97.0, 100.0, 82.0, 106.0, 87.0, 92.0, 88.0, 61.0, 67.0, 53.0, 58.0, 67.0, 84.0, 73.0, 64.0, 97.0, 113.0, 68.0, 102.0, 91.0, 93.0, 111.0, 111.0, 113.0, 122.0, 177.0, 202.0, 252.0, 309.0, 361.0, 398.0, 532.0, 653.0, 807.0, 924.0, 1185.0, 1496.0, 1791.0, 2211.0, 2717.0, 3342.0], [147.0, 103.0, 121.0, 158.0, 88.0, 68.0, 97.0, 149.0, 116.0, 77.0, 85.0, 76.0, 71.0, 126.0, 95.0, 123.0, 80.0, 50.0, 93.0, 62.0, 68.0, 160.0, 73.0, 85.0, 94.0, 88.0, 62.0, 60.0, 88.0, 41.0, 46.0, 63.0, 89.0, 81.0, 129.0, 165.0, 182.0, 186.0, 234.0, 294.0, 366.0, 492.0, 573.0, 859.0, 1168.0, 1489.0, 2081.0, 2729.0, 3874.0], [142.0, 162.0, 156.0, 126.0, 97.0, 82.0, 100.0, 129.0, 96.0, 123.0, 110.0, 121.0, 78.0, 42.0, 123.0, 94.0, 86.0, 81.0, 60.0, 61.0, 34.0, 45.0, 59.0, 87.0, 48.0, 61.0, 48.0, 42.0, 58.0, 85.0, 75.0, 52.0, 72.0, 65.0, 49.0, 74.0, 62.0, 86.0, 112.0, 170.0, 190.0, 283.0, 413.0, 493.0, 739.0, 1078.0, 1583.0, 2502.0, 4197.0], [134.0, 70.0, 49.0, 110.0, 81.0, 128.0, 86.0, 95.0, 212.0, 84.0, 120.0, 79.0, 86.0, 108.0, 85.0, 115.0, 61.0, 128.0, 52.0, 110.0, 55.0, 71.0, 54.0, 67.0, 46.0, 31.0, 68.0, 71.0, 115.0, 121.0, 66.0, 61.0, 81.0, 78.0, 70.0, 56.0, 107.0, 110.0, 148.0, 117.0, 96.0, 171.0, 171.0, 231.0, 396.0, 651.0, 1125.0, 1983.0, 3668.0], [151.0, 110.0, 62.0, 58.0, 65.0, 119.0, 99.0, 82.0, 77.0, 30.0, 51.0, 86.0, 92.0, 80.0, 52.0, 21.0, 53.0, 19.0, 19.0, 27.0, 49.0, 102.0, 105.0, 71.0, 26.0, 50.0, 53.0, 102.0, 84.0, 121.0, 44.0, 50.0, 96.0, 31.0, 87.0, 92.0, 76.0, 57.0, 73.0, 144.0, 65.0, 90.0, 138.0, 151.0, 231.0, 392.0, 755.0, 1387.0, 3170.0], [191.0, 124.0, 92.0, 108.0, 71.0, 153.0, 136.0, 108.0, 134.0, 62.0, 91.0, 93.0, 103.0, 51.0, 76.0, 68.0, 87.0, 47.0, 47.0, 87.0, 79.0, 89.0, 54.0, 60.0, 122.0, 51.0, 62.0, 68.0, 19.0, 69.0, 52.0, 23.0, 92.0, 60.0, 41.0, 22.0, 44.0, 9.0, 44.0, 38.0, 63.0, 68.0, 62.0, 65.0, 188.0, 162.0, 395.0, 885.0, 2394.0], [194.0, 255.0, 137.0, 181.0, 118.0, 64.0, 96.0, 80.0, 112.0, 52.0, 56.0, 84.0, 38.0, 14.0, 34.0, 40.0, 69.0, 81.0, 23.0, 64.0, 76.0, 68.0, 75.0, 81.0, 66.0, 59.0, 92.0, 55.0, 115.0, 96.0, 33.0, 84.0, 78.0, 32.0, 29.0, 21.0, 73.0, 54.0, 49.0, 56.0, 92.0, 29.0, 50.0, 55.0, 91.0, 147.0, 207.0, 500.0, 1725.0], [152.0, 108.0, 96.0, 139.0, 104.0, 97.0, 81.0, 132.0, 77.0, 83.0, 42.0, 77.0, 68.0, 61.0, 37.0, 50.0, 86.0, 69.0, 72.0, 136.0, 47.0, 47.0, 172.0, 97.0, 88.0, 25.0, 24.0, 33.0, 46.0, 121.0, 108.0, 15.0, 55.0, 58.0, 48.0, 9.0, 24.0, 94.0, 66.0, 69.0, 53.0, 72.0, 20.0, 63.0, 71.0, 93.0, 202.0, 296.0, 1036.0], [121.0, 125.0, 82.0, 53.0, 46.0, 42.0, 157.0, 188.0, 110.0, 21.0, 93.0, 58.0, 118.0, 85.0, 41.0, 137.0, 31.0, 92.0, 114.0, 91.0, 34.0, 55.0, 102.0, 102.0, 104.0, 73.0, 77.0, 48.0, 26.0, 3.0, 42.0, 88.0, 122.0, 102.0, 43.0, 25.0, 69.0, 74.0, 80.0, 31.0, 89.0, 93.0, 86.0, 68.0, 23.0, 80.0, 40.0, 238.0, 665.0], [143.0, 101.0, 89.0, 84.0, 39.0, 53.0, 134.0, 148.0, 38.0, 19.0, 101.0, 99.0, 71.0, 199.0, 95.0, 71.0, 122.0, 66.0, 97.0, 7.0, 46.0, 25.0, 48.0, 66.0, 24.0, 40.0, 83.0, 115.0, 111.0, 39.0, 56.0, 113.0, 56.0, 55.0, 141.0, 86.0, 33.0, 107.0, 104.0, 114.0, 43.0, 73.0, 46.0, 69.0, 39.0, 43.0, 55.0, 113.0, 397.0], [186.0, 50.0, 84.0, 112.0, 67.0, 136.0, 101.0, 68.0, 36.0, 91.0, 81.0, 39.0, 30.0, 46.0, 57.0, 45.0, 15.0, 64.0, 69.0, 66.0, 56.0, 99.0, 57.0, 59.0, 86.0, 87.0, 123.0, 101.0, 100.0, 46.0, 30.0, 6.0, 93.0, 99.0, 63.0, 131.0, 48.0, 39.0, 27.0, 66.0, 74.0, 59.0, 45.0, 29.0, 40.0, 59.0, 34.0, 145.0, 282.0], [200.0, 63.0, 112.0, 99.0, 196.0, 97.0, 56.0, 10.0, 65.0, 76.0, 65.0, 104.0, 67.0, 37.0, 5.0, 0.0, 90.0, 31.0, 92.0, 81.0, 107.0, 90.0, 91.0, 85.0, 37.0, 90.0, 92.0, 103.0, 68.0, 49.0, 56.0, 65.0, 42.0, 86.0, 66.0, 58.0, 108.0, 72.0, 35.0, 62.0, 61.0, 43.0, 41.0, 43.0, 8.0, 8.0, 95.0, 74.0, 181.0], [193.0, 89.0, 85.0, 55.0, 77.0, 160.0, 47.0, 105.0, 46.0, 57.0, 55.0, 15.0, 20.0, 22.0, 31.0, 38.0, 71.0, 47.0, 86.0, 73.0, 84.0, 89.0, 45.0, 23.0, 56.0, 71.0, 126.0, 43.0, 85.0, 59.0, 25.0, 42.0, 13.0, 125.0, 43.0, 68.0, 63.0, 52.0, 58.0, 43.0, 111.0, 34.0, 14.0, 62.0, 42.0, 48.0, 83.0, 68.0, 93.0], [91.0, 40.0, 75.0, 101.0, 86.0, 132.0, 127.0, 35.0, 66.0, 87.0, 24.0, 45.0, 44.0, 84.0, 36.0, 77.0, 130.0, 96.0, 78.0, 55.0, 42.0, 20.0, 36.0, 82.0, 37.0, 47.0, 66.0, 79.0, 50.0, 41.0, 34.0, 57.0, 34.0, 51.0, 83.0, 169.0, 52.0, 101.0, 104.0, 56.0, 12.0, 2.0, 29.0, 58.0, 49.0, 51.0, 94.0, 42.0, 94.0], [138.0, 124.0, 71.0, 45.0, 39.0, 24.0, 38.0, 52.0, 70.0, 97.0, 61.0, 70.0, 44.0, 75.0, 93.0, 55.0, 85.0, 49.0, 79.0, 65.0, 29.0, 27.0, 28.0, 61.0, 12.0, 37.0, 30.0, 77.0, 79.0, 80.0, 34.0, 16.0, 27.0, 25.0, 23.0, 58.0, 47.0, 56.0, 66.0, 30.0, 79.0, 81.0, 58.0, 32.0, 82.0, 31.0, 65.0, 42.0, 73.0], [141.0, 61.0, 105.0, 86.0, 63.0, 40.0, 88.0, 73.0, 33.0, 34.0, 66.0, 46.0, 53.0, 11.0, 15.0, 1.0, 47.0, 65.0, 64.0, 104.0, 131.0, 49.0, 81.0, 83.0, 105.0, 41.0, 12.0, 53.0, 136.0, 100.0, 46.0, 81.0, 78.0, 23.0, 47.0, 25.0, 37.0, 44.0, 58.0, 40.0, 78.0, 16.0, 20.0, 33.0, 22.0, 34.0, 37.0, 38.0, 16.0], [90.0, 120.0, 112.0, 146.0, 63.0, 59.0, 47.0, 19.0, 85.0, 57.0, 53.0, 50.0, 47.0, 68.0, 45.0, 75.0, 39.0, 0.0, 15.0, 17.0, 44.0, 20.0, 61.0, 27.0, 29.0, 19.0, 82.0, 56.0, 63.0, 35.0, 13.0, 41.0, 9.0, 24.0, 29.0, 60.0, 8.0, 95.0, 67.0, 6.0, 34.0, 88.0, 24.0, 61.0, 10.0, 1.0, 6.0, 67.0, 31.0], [73.0, 77.0, 30.0, 16.0, 40.0, 99.0, 14.0, 5.0, 42.0, 59.0, 55.0, 68.0, 32.0, 43.0, 46.0, 28.0, 2.0, 49.0, 21.0, 23.0, 19.0, 25.0, 62.0, 54.0, 33.0, 3.0, 46.0, 42.0, 23.0, 30.0, 3.0, 18.0, 40.0, 56.0, 77.0, 48.0, 27.0, 28.0, 0.0, 50.0, 60.0, 33.0, 50.0, 42.0, 35.0, 43.0, 17.0, 8.0, 19.0], [112.0, 46.0, 109.0, 13.0, 51.0, 99.0, 48.0, 68.0, 65.0, 87.0, 55.0, 60.0, 11.0, 25.0, 43.0, 41.0, 11.0, 58.0, 37.0, 68.0, 36.0, 60.0, 7.0, 12.0, 28.0, 11.0, 63.0, 13.0, 61.0, 27.0, 5.0, 0.0, 22.0, 88.0, 10.0, 24.0, 49.0, 40.0, 73.0, 18.0, 37.0, 3.0, 34.0, 50.0, 23.0, 26.0, 13.0, 18.0, 73.0], [50.0, 27.0, 42.0, 37.0, 30.0, 26.0, 14.0, 4.0, 3.0, 16.0, 35.0, 3.0, 9.0, 17.0, 1.0, 41.0, 30.0, 18.0, 82.0, 41.0, 5.0, 0.0, 1.0, 0.0, 0.0, 90.0, 54.0, 15.0, 52.0, 89.0, 75.0, 23.0, 11.0, 39.0, 10.0, 63.0, 57.0, 74.0, 5.0, 19.0, 14.0, 12.0, 25.0, 27.0, 43.0, 60.0, 62.0, 23.0, 79.0], [91.0, 19.0, 11.0, 79.0, 38.0, 30.0, 45.0, 34.0, 29.0, 19.0, 27.0, 41.0, 18.0, 24.0, 47.0, 26.0, 17.0, 16.0, 42.0, 63.0, 42.0, 17.0, 0.0, 12.0, 16.0, 42.0, 41.0, 9.0, 19.0, 14.0, 57.0, 45.0, 23.0, 11.0, 0.0, 50.0, 39.0, 14.0, 23.0, 78.0, 34.0, 1.0, 16.0, 24.0, 57.0, 23.0, 1.0, 32.0, 71.0]],
    "Name": "sCurve-0",
    "Overflow": 2471141.0,
    "Type": "Histo2d",
    "Underflow": 0.0,
    "x": {
        "AxisTitle": "Vcal",
        "Bins": 51,
        "High": 302.5,
        "Low": 47.5
    },
    "y": {
        "AxisTitle": "Occupancy",
        "Bins": 49,
        "High": 49.5,
        "Low": 0.5
    },
    "z": {
        "AxisTitle": "Number of pixels"
    }
}