time,Hardware,Voltage,Current
1626748663636,high-voltage,1,0.00741261
time,Hardware,Voltage,Current
1626748663636,high-voltage,2,0.0242317
time,Hardware,Voltage,Current
1626748663636,high-voltage,3,0.0348102
time,Hardware,Voltage,Current
1626748663636,high-voltage,4,0.0417221
time,Hardware,Voltage,Current
1626748663636,high-voltage,5,0.0484832
time,Hardware,Voltage,Current
1626748663636,high-voltage,6,0.0556664
time,Hardware,Voltage,Current
1626748663636,high-voltage,7,0.0620265
time,Hardware,Voltage,Current
1626748663636,high-voltage,8,0.0694631
time,Hardware,Voltage,Current
1626748663636,high-voltage,9,0.07571
time,Hardware,Voltage,Current
1626748663636,high-voltage,10,0.0813481
time,Hardware,Voltage,Current
1626748663636,high-voltage,11,0.0872826
time,Hardware,Voltage,Current
1626748663636,high-voltage,12,0.0911892
time,Hardware,Voltage,Current
1626748663636,high-voltage,13,0.0946666
time,Hardware,Voltage,Current
1626748663636,high-voltage,14,0.098828
time,Hardware,Voltage,Current
1626748663636,high-voltage,15,0.102314
time,Hardware,Voltage,Current
1626748663636,high-voltage,16,0.105155
time,Hardware,Voltage,Current
1626748663636,high-voltage,17,0.108179
time,Hardware,Voltage,Current
1626748663636,high-voltage,18,0.110013
time,Hardware,Voltage,Current
1626748663636,high-voltage,19,0.113899
time,Hardware,Voltage,Current
1626748663636,high-voltage,20,0.115784
time,Hardware,Voltage,Current
1626748663636,high-voltage,25,0.129678
time,Hardware,Voltage,Current
1626748663636,high-voltage,30,0.148684
time,Hardware,Voltage,Current
1626748663636,high-voltage,35,0.193829
time,Hardware,Voltage,Current
1626748663636,high-voltage,40,0.325872
time,Hardware,Voltage,Current
1626748663636,high-voltage,45,0.634097
time,Hardware,Voltage,Current
1626748663636,high-voltage,50,1.22761
time,Hardware,Voltage,Current
1626748663636,high-voltage,55,2.21985
time,Hardware,Voltage,Current
1626748663636,high-voltage,60,3.68338
time,Hardware,Voltage,Current
1626748663636,high-voltage,65,5.78243
time,Hardware,Voltage,Current
1626748663636,high-voltage,70,8.60352
time,Hardware,Voltage,Current
1626748663636,high-voltage,75,10
