time,Hardware,Voltage,Current
1625797174553,high-voltage-4,1,1.49866
time,Hardware,Voltage,Current
1625797174553,high-voltage-4,2,1.82964
time,Hardware,Voltage,Current
1625797174553,high-voltage-4,3,2.06082
time,Hardware,Voltage,Current
1625797174553,high-voltage-4,4,2.22281
time,Hardware,Voltage,Current
1625797174553,high-voltage-4,5,2.33412
time,Hardware,Voltage,Current
1625797174553,high-voltage-4,6,2.43142
time,Hardware,Voltage,Current
1625797174553,high-voltage-4,7,2.52636
time,Hardware,Voltage,Current
1625797174553,high-voltage-4,8,2.62873
time,Hardware,Voltage,Current
1625797174553,high-voltage-4,9,2.74201
time,Hardware,Voltage,Current
1625797174553,high-voltage-4,10,2.86484
time,Hardware,Voltage,Current
1625797174553,high-voltage-4,11,3.00322
time,Hardware,Voltage,Current
1625797174553,high-voltage-4,12,3.15187
time,Hardware,Voltage,Current
1625797174553,high-voltage-4,13,3.30792
time,Hardware,Voltage,Current
1625797174553,high-voltage-4,14,3.47256
time,Hardware,Voltage,Current
1625797174553,high-voltage-4,15,3.6393
time,Hardware,Voltage,Current
1625797174553,high-voltage-4,16,3.80622
time,Hardware,Voltage,Current
1625797174553,high-voltage-4,17,3.9798
time,Hardware,Voltage,Current
1625797174553,high-voltage-4,18,4.14922
time,Hardware,Voltage,Current
1625797174553,high-voltage-4,19,4.3168
time,Hardware,Voltage,Current
1625797174553,high-voltage-4,20,4.49011
time,Hardware,Voltage,Current
1625797174553,high-voltage-4,25,5.23166
time,Hardware,Voltage,Current
1625797174553,high-voltage-4,30,5.76261
time,Hardware,Voltage,Current
1625797174553,high-voltage-4,35,6.23938
time,Hardware,Voltage,Current
1625797174553,high-voltage-4,40,6.69114
time,Hardware,Voltage,Current
1625797174553,high-voltage-4,45,7.15492
time,Hardware,Voltage,Current
1625797174553,high-voltage-4,50,7.65754
time,Hardware,Voltage,Current
1625797174553,high-voltage-4,55,8.19193
time,Hardware,Voltage,Current
1625797174553,high-voltage-4,60,8.79836
time,Hardware,Voltage,Current
1625797174553,high-voltage-4,65,9.47308
time,Hardware,Voltage,Current
1625797174553,high-voltage-4,70,9.99975
time,Hardware,Voltage,Current
1625797174553,high-voltage-4,75,9.99972
time,Hardware,Voltage,Current
1625797174553,high-voltage-4,80,9.99974
time,Hardware,Voltage,Current
1625797174553,high-voltage-4,85,9.99975
time,Hardware,Voltage,Current
1625797174553,high-voltage-4,90,9.99973
time,Hardware,Voltage,Current
1625797174553,high-voltage-4,95,9.9997
time,Hardware,Voltage,Current
1625797174553,high-voltage-4,100,9.99973
