time,Hardware,Voltage,Current
1625766710767,high-voltage-4,1,1.40104
time,Hardware,Voltage,Current
1625766710767,high-voltage-4,2,1.72887
time,Hardware,Voltage,Current
1625766710767,high-voltage-4,3,1.97585
time,Hardware,Voltage,Current
1625766710767,high-voltage-4,4,2.14895
time,Hardware,Voltage,Current
1625766710767,high-voltage-4,5,2.27243
time,Hardware,Voltage,Current
1625766710767,high-voltage-4,6,2.36791
time,Hardware,Voltage,Current
1625766710767,high-voltage-4,7,2.4554
time,Hardware,Voltage,Current
1625766710767,high-voltage-4,8,2.5467
time,Hardware,Voltage,Current
1625766710767,high-voltage-4,9,2.647
time,Hardware,Voltage,Current
1625766710767,high-voltage-4,10,2.75679
time,Hardware,Voltage,Current
1625766710767,high-voltage-4,11,2.88121
time,Hardware,Voltage,Current
1625766710767,high-voltage-4,12,3.01022
time,Hardware,Voltage,Current
1625766710767,high-voltage-4,13,3.15262
time,Hardware,Voltage,Current
1625766710767,high-voltage-4,14,3.30941
time,Hardware,Voltage,Current
1625766710767,high-voltage-4,15,3.47321
time,Hardware,Voltage,Current
1625766710767,high-voltage-4,16,3.63825
time,Hardware,Voltage,Current
1625766710767,high-voltage-4,17,3.80727
time,Hardware,Voltage,Current
1625766710767,high-voltage-4,18,3.97581
time,Hardware,Voltage,Current
1625766710767,high-voltage-4,19,4.14412
time,Hardware,Voltage,Current
1625766710767,high-voltage-4,20,4.32839
time,Hardware,Voltage,Current
1625766710767,high-voltage-4,25,5.07193
time,Hardware,Voltage,Current
1625766710767,high-voltage-4,30,5.61123
time,Hardware,Voltage,Current
1625766710767,high-voltage-4,35,6.08278
time,Hardware,Voltage,Current
1625766710767,high-voltage-4,40,6.54635
time,Hardware,Voltage,Current
1625766710767,high-voltage-4,45,7.01506
time,Hardware,Voltage,Current
1625766710767,high-voltage-4,50,7.52235
time,Hardware,Voltage,Current
1625766710767,high-voltage-4,55,8.07975
time,Hardware,Voltage,Current
1625766710767,high-voltage-4,60,8.71965
time,Hardware,Voltage,Current
1625766710767,high-voltage-4,65,9.50196
time,Hardware,Voltage,Current
1625766710767,high-voltage-4,70,9.99973
time,Hardware,Voltage,Current
1625766710767,high-voltage-4,75,9.99977
time,Hardware,Voltage,Current
1625766710767,high-voltage-4,80,9.99972
time,Hardware,Voltage,Current
1625766710767,high-voltage-4,85,9.99973
time,Hardware,Voltage,Current
1625766710767,high-voltage-4,90,9.9997
time,Hardware,Voltage,Current
1625766710767,high-voltage-4,95,9.99967
time,Hardware,Voltage,Current
1625766710767,high-voltage-4,100,9.99973
