time,Hardware,Voltage,Current
1621538102776,high-voltage-2,1,0.162013
time,Hardware,Voltage,Current
1621538102776,high-voltage-2,2,0.211806
time,Hardware,Voltage,Current
1621538102776,high-voltage-2,3,0.238212
time,Hardware,Voltage,Current
1621538102776,high-voltage-2,4,0.259746
time,Hardware,Voltage,Current
1621538102776,high-voltage-2,5,0.281998
time,Hardware,Voltage,Current
1621538102776,high-voltage-2,6,0.301501
time,Hardware,Voltage,Current
1621538102776,high-voltage-2,7,0.318012
time,Hardware,Voltage,Current
1621538102776,high-voltage-2,8,0.336093
time,Hardware,Voltage,Current
1621538102776,high-voltage-2,9,0.353771
time,Hardware,Voltage,Current
1621538102776,high-voltage-2,10,0.371901
time,Hardware,Voltage,Current
1621538102776,high-voltage-2,11,0.389231
time,Hardware,Voltage,Current
1621538102776,high-voltage-2,12,0.409054
time,Hardware,Voltage,Current
1621538102776,high-voltage-2,13,0.422979
time,Hardware,Voltage,Current
1621538102776,high-voltage-2,14,0.441935
time,Hardware,Voltage,Current
1621538102776,high-voltage-2,15,0.457007
time,Hardware,Voltage,Current
1621538102776,high-voltage-2,16,0.474602
time,Hardware,Voltage,Current
1621538102776,high-voltage-2,17,0.489709
time,Hardware,Voltage,Current
1621538102776,high-voltage-2,18,0.503473
time,Hardware,Voltage,Current
1621538102776,high-voltage-2,19,0.514321
time,Hardware,Voltage,Current
1621538102776,high-voltage-2,20,0.522928
time,Hardware,Voltage,Current
1621538102776,high-voltage-2,25,0.57348
time,Hardware,Voltage,Current
1621538102776,high-voltage-2,30,0.618519
time,Hardware,Voltage,Current
1621538102776,high-voltage-2,35,0.664701
time,Hardware,Voltage,Current
1621538102776,high-voltage-2,40,0.7173
time,Hardware,Voltage,Current
1621538102776,high-voltage-2,45,0.782602
time,Hardware,Voltage,Current
1621538102776,high-voltage-2,50,0.829263
time,Hardware,Voltage,Current
1621538102776,high-voltage-2,55,0.872388
time,Hardware,Voltage,Current
1621538102776,high-voltage-2,60,0.912314
time,Hardware,Voltage,Current
1621538102776,high-voltage-2,65,0.94912
time,Hardware,Voltage,Current
1621538102776,high-voltage-2,70,0.987113
time,Hardware,Voltage,Current
1621538102776,high-voltage-2,75,1.02574
time,Hardware,Voltage,Current
1621538102776,high-voltage-2,80,1.06031
time,Hardware,Voltage,Current
1621538102776,high-voltage-2,85,1.09231
time,Hardware,Voltage,Current
1621538102776,high-voltage-2,90,1.12637
time,Hardware,Voltage,Current
1621538102776,high-voltage-2,95,1.1617
time,Hardware,Voltage,Current
1621538102776,high-voltage-2,100,1.19284
