time,Hardware,Voltage,Current
1626349990624,high-voltage,1,0.0111086
time,Hardware,Voltage,Current
1626349990624,high-voltage,2,0.0239341
time,Hardware,Voltage,Current
1626349990624,high-voltage,3,0.0335828
time,Hardware,Voltage,Current
1626349990624,high-voltage,4,0.0393789
time,Hardware,Voltage,Current
1626349990624,high-voltage,5,0.0451758
time,Hardware,Voltage,Current
1626349990624,high-voltage,6,0.0525016
time,Hardware,Voltage,Current
1626349990624,high-voltage,7,0.0584047
time,Hardware,Voltage,Current
1626349990624,high-voltage,8,0.0650541
time,Hardware,Voltage,Current
1626349990624,high-voltage,9,0.0715173
time,Hardware,Voltage,Current
1626349990624,high-voltage,10,0.0789388
time,Hardware,Voltage,Current
1626349990624,high-voltage,11,0.0847853
time,Hardware,Voltage,Current
1626349990624,high-voltage,12,0.0893143
time,Hardware,Voltage,Current
1626349990624,high-voltage,13,0.0947735
time,Hardware,Voltage,Current
1626349990624,high-voltage,14,0.0978641
time,Hardware,Voltage,Current
1626349990624,high-voltage,15,0.101494
time,Hardware,Voltage,Current
1626349990624,high-voltage,16,0.105363
time,Hardware,Voltage,Current
1626349990624,high-voltage,17,0.109111
time,Hardware,Voltage,Current
1626349990624,high-voltage,18,0.111433
time,Hardware,Voltage,Current
1626349990624,high-voltage,19,0.115145
time,Hardware,Voltage,Current
1626349990624,high-voltage,20,0.11822
time,Hardware,Voltage,Current
1626349990624,high-voltage,25,0.132326
time,Hardware,Voltage,Current
1626349990624,high-voltage,30,0.149227
time,Hardware,Voltage,Current
1626349990624,high-voltage,35,0.184224
time,Hardware,Voltage,Current
1626349990624,high-voltage,40,0.284446
time,Hardware,Voltage,Current
1626349990624,high-voltage,45,0.531673
time,Hardware,Voltage,Current
1626349990624,high-voltage,50,1.0118
time,Hardware,Voltage,Current
1626349990624,high-voltage,55,1.82936
time,Hardware,Voltage,Current
1626349990624,high-voltage,60,3.07759
time,Hardware,Voltage,Current
1626349990624,high-voltage,65,4.84483
time,Hardware,Voltage,Current
1626349990624,high-voltage,70,7.16789
time,Hardware,Voltage,Current
1626349990624,high-voltage,75,10
