{
    "Data": [15.0, 15.0, 0.0, 0.0, 0.0, 4.0, 41.0, 152.0, 436.0, 1098.0, 2456.0, 3855.0, 4894.0, 4965.0, 4102.0, 3227.0, 3136.0, 3931.0, 4476.0, 4765.0, 3994.0, 2867.0, 1653.0, 878.0, 452.0, 190.0, 108.0, 87.0, 45.0, 37.0, 29.0, 27.0, 7.0, 14.0, 10.0, 9.0, 6.0],
    "Name": "NoiseDist-0",
    "Overflow": 28.0,
    "Type": "Histo1d",
    "Underflow": 0.0,
    "x": {
        "AxisTitle": "Noise [e]",
        "Bins": 37,
        "High": 186.0,
        "Low": -2.0
    },
    "y": {
        "AxisTitle": "Number of Pixels"
    },
    "z": {
        "AxisTitle": "z"
    }
}