{
    "Data": [234.0, 11582.0, 20791.0, 13875.0, 6494.0, 3551.0, 2888.0, 2924.0, 2776.0, 2528.0, 2021.0, 1601.0, 1146.0, 726.0, 513.0, 359.0, 264.0, 177.0, 152.0, 124.0, 122.0, 100.0, 105.0, 81.0, 94.0, 72.0, 68.0, 63.0, 85.0, 63.0, 53.0, 53.0, 63.0, 55.0, 45.0, 42.0, 42.0, 57.0, 39.0, 33.0, 30.0, 32.0, 38.0, 40.0, 20.0, 18.0, 14.0, 16.0, 10.0, 6.0, 3.0],
    "Name": "Chi2Dist-0",
    "Overflow": 0.0,
    "Type": "Histo1d",
    "Underflow": 0.0,
    "x": {
        "AxisTitle": "Fit Chi/ndf",
        "Bins": 51,
        "High": 2.5250000953674318,
        "Low": -0.02500000037252903
    },
    "y": {
        "AxisTitle": "Number of Pixels"
    },
    "z": {
        "AxisTitle": "z"
    }
}