time,Hardware,Voltage,Current
1626714288397,high-voltage,1,0.0167564
time,Hardware,Voltage,Current
1626714288397,high-voltage,2,0.0372486
time,Hardware,Voltage,Current
1626714288397,high-voltage,3,0.0515883
time,Hardware,Voltage,Current
1626714288397,high-voltage,4,0.0630043
time,Hardware,Voltage,Current
1626714288397,high-voltage,5,0.0744639
time,Hardware,Voltage,Current
1626714288397,high-voltage,6,0.082849
time,Hardware,Voltage,Current
1626714288397,high-voltage,7,0.0915408
time,Hardware,Voltage,Current
1626714288397,high-voltage,8,0.098388
time,Hardware,Voltage,Current
1626714288397,high-voltage,9,0.103647
time,Hardware,Voltage,Current
1626714288397,high-voltage,10,0.109446
time,Hardware,Voltage,Current
1626714288397,high-voltage,11,0.113462
time,Hardware,Voltage,Current
1626714288397,high-voltage,12,0.119583
time,Hardware,Voltage,Current
1626714288397,high-voltage,13,0.124075
time,Hardware,Voltage,Current
1626714288397,high-voltage,14,0.127184
time,Hardware,Voltage,Current
1626714288397,high-voltage,15,0.132336
time,Hardware,Voltage,Current
1626714288397,high-voltage,16,0.137083
time,Hardware,Voltage,Current
1626714288397,high-voltage,17,0.140382
time,Hardware,Voltage,Current
1626714288397,high-voltage,18,0.145469
time,Hardware,Voltage,Current
1626714288397,high-voltage,19,0.148971
time,Hardware,Voltage,Current
1626714288397,high-voltage,20,0.154121
time,Hardware,Voltage,Current
1626714288397,high-voltage,25,0.17449
time,Hardware,Voltage,Current
1626714288397,high-voltage,30,0.201169
time,Hardware,Voltage,Current
1626714288397,high-voltage,35,0.258246
time,Hardware,Voltage,Current
1626714288397,high-voltage,40,0.421389
time,Hardware,Voltage,Current
1626714288397,high-voltage,45,0.752052
time,Hardware,Voltage,Current
1626714288397,high-voltage,50,1.32462
time,Hardware,Voltage,Current
1626714288397,high-voltage,55,2.16285
time,Hardware,Voltage,Current
1626714288397,high-voltage,60,3.44598
time,Hardware,Voltage,Current
1626714288397,high-voltage,65,5.40433
time,Hardware,Voltage,Current
1626714288397,high-voltage,70,8.16696
time,Hardware,Voltage,Current
1626714288397,high-voltage,75,10
