time,Hardware,Voltage,Current
1626610253313,high-voltage,1,0.0499263
time,Hardware,Voltage,Current
1626610253313,high-voltage,2,0.0727703
time,Hardware,Voltage,Current
1626610253313,high-voltage,3,0.0876287
time,Hardware,Voltage,Current
1626610253313,high-voltage,4,0.0977798
time,Hardware,Voltage,Current
1626610253313,high-voltage,5,0.10797
time,Hardware,Voltage,Current
1626610253313,high-voltage,6,0.118765
time,Hardware,Voltage,Current
1626610253313,high-voltage,7,0.13076
time,Hardware,Voltage,Current
1626610253313,high-voltage,8,0.14254
time,Hardware,Voltage,Current
1626610253313,high-voltage,9,0.1571
time,Hardware,Voltage,Current
1626610253313,high-voltage,10,0.170136
time,Hardware,Voltage,Current
1626610253313,high-voltage,11,0.184327
time,Hardware,Voltage,Current
1626610253313,high-voltage,12,0.195407
time,Hardware,Voltage,Current
1626610253313,high-voltage,13,0.207676
time,Hardware,Voltage,Current
1626610253313,high-voltage,14,0.216628
time,Hardware,Voltage,Current
1626610253313,high-voltage,15,0.225312
time,Hardware,Voltage,Current
1626610253313,high-voltage,16,0.233302
time,Hardware,Voltage,Current
1626610253313,high-voltage,17,0.239151
time,Hardware,Voltage,Current
1626610253313,high-voltage,18,0.247535
time,Hardware,Voltage,Current
1626610253313,high-voltage,19,0.253363
time,Hardware,Voltage,Current
1626610253313,high-voltage,20,0.2583
time,Hardware,Voltage,Current
1626610253313,high-voltage,25,0.289075
time,Hardware,Voltage,Current
1626610253313,high-voltage,30,0.323916
time,Hardware,Voltage,Current
1626610253313,high-voltage,35,0.392005
time,Hardware,Voltage,Current
1626610253313,high-voltage,40,0.552919
time,Hardware,Voltage,Current
1626610253313,high-voltage,45,0.873474
time,Hardware,Voltage,Current
1626610253313,high-voltage,50,1.42576
time,Hardware,Voltage,Current
1626610253313,high-voltage,55,2.31209
time,Hardware,Voltage,Current
1626610253313,high-voltage,60,3.66322
time,Hardware,Voltage,Current
1626610253313,high-voltage,65,5.58215
time,Hardware,Voltage,Current
1626610253313,high-voltage,70,8.20663
time,Hardware,Voltage,Current
1626610253313,high-voltage,75,10
