{
    "Data": [0.0, 0.0, 0.0, 0.0, 0.0, 0.0, 0.0, 0.0, 0.0, 0.0, 0.0, 0.0, 0.0, 0.0, 1.0, 1.0, 0.0, 18.0, 70.0, 10.0, 33.0, 624.0, 1168.0, 398.0, 463.0, 1494.0, 1840.0, 889.0, 695.0, 1184.0, 1349.0, 889.0, 545.0, 662.0, 789.0, 695.0, 469.0, 648.0, 988.0, 863.0, 650.0, 1027.0, 2228.0, 3215.0, 2473.0, 1584.0, 2446.0, 3415.0, 4191.0, 2935.0, 2322.0, 2610.0, 3176.0, 2769.0, 2081.0, 1658.0, 1676.0, 1835.0, 1450.0, 1287.0, 1143.0, 1059.0, 1052.0, 714.0, 715.0, 656.0, 650.0, 577.0, 447.0, 445.0, 365.0, 413.0, 331.0, 302.0, 255.0, 283.0, 245.0, 204.0, 205.0, 182.0, 171.0, 143.0, 143.0, 113.0, 100.0, 128.0, 103.0, 84.0, 80.0, 94.0, 56.0, 88.0, 41.0, 74.0, 59.0, 74.0, 47.0, 41.0, 45.0, 39.0, 41.0, 32.0, 31.0, 29.0, 28.0, 28.0, 21.0, 24.0, 16.0, 18.0, 17.0, 15.0, 21.0, 18.0, 15.0, 10.0, 10.0, 12.0, 18.0, 9.0, 11.0, 10.0, 17.0, 10.0, 12.0, 8.0, 4.0, 11.0, 4.0, 1.0, 6.0, 7.0, 6.0, 5.0, 5.0, 5.0, 3.0, 2.0, 4.0, 6.0, 3.0, 5.0, 2.0, 7.0, 3.0, 2.0, 2.0, 1.0, 6.0, 4.0, 3.0, 4.0, 5.0, 1.0, 2.0, 2.0, 2.0, 1.0, 3.0, 4.0, 5.0, 4.0, 3.0, 1.0, 1.0, 5.0, 3.0, 3.0, 0.0, 3.0, 4.0, 1.0, 0.0, 1.0, 2.0, 1.0, 0.0, 1.0, 0.0, 3.0, 1.0, 3.0, 1.0, 0.0, 1.0, 1.0, 2.0, 2.0, 0.0, 0.0, 1.0, 2.0, 0.0, 2.0, 2.0, 0.0, 2.0, 1.0, 1.0, 1.0, 0.0],
    "Name": "TimePerFitDist-0",
    "Overflow": 135.0,
    "Type": "Histo1d",
    "Underflow": 0.0,
    "x": {
        "AxisTitle": "Fit Time [us]",
        "Bins": 201,
        "High": 401.0,
        "Low": -1.0
    },
    "y": {
        "AxisTitle": "Number of Pixels"
    },
    "z": {
        "AxisTitle": "z"
    }
}