{
    "Data": [0.0, 0.0, 0.0, 0.0, 0.0, 0.0, 0.0, 0.0, 0.0, 0.0, 0.0, 0.0, 0.0, 0.0, 0.0, 0.0, 0.0, 0.0, 0.0, 0.0, 0.0, 0.0, 0.0, 0.0, 0.0, 0.0, 0.0, 0.0, 0.0, 0.0, 0.0, 0.0, 0.0, 0.0, 0.0, 0.0, 0.0, 0.0, 0.0, 0.0, 0.0, 0.0, 0.0, 0.0, 0.0, 0.0, 0.0, 0.0, 0.0, 0.0, 4.0, 6.0, 4.0, 10.0, 2.0, 7.0, 4.0, 9.0, 13.0, 11.0, 8.0, 11.0, 15.0, 12.0, 16.0, 12.0, 12.0, 20.0, 31.0, 38.0, 48.0, 64.0, 86.0, 106.0, 140.0, 153.0, 224.0, 262.0, 310.0, 433.0, 539.0, 605.0, 701.0, 886.0, 953.0, 1109.0, 1179.0, 1320.0, 1484.0, 1630.0, 1828.0, 2076.0, 2794.0, 3457.0, 4097.0, 4691.0, 4641.0, 4223.0, 3288.0, 2528.0, 1757.0, 1146.0, 723.0, 498.0, 335.0, 256.0, 199.0, 122.0, 114.0, 74.0, 72.0, 59.0, 52.0, 47.0, 37.0, 35.0, 28.0, 35.0, 28.0, 26.0, 21.0, 24.0, 25.0, 19.0, 18.0, 14.0, 10.0, 21.0, 15.0, 15.0, 8.0, 9.0, 9.0, 11.0, 12.0, 11.0, 9.0, 9.0, 8.0, 7.0, 13.0, 5.0, 11.0, 9.0, 7.0, 7.0, 3.0, 6.0, 4.0, 9.0, 7.0, 4.0, 1.0, 6.0, 5.0, 1.0, 3.0, 2.0, 0.0, 3.0, 3.0, 2.0, 6.0, 7.0, 2.0, 5.0, 4.0, 11.0, 18.0, 16.0, 19.0, 24.0, 32.0, 39.0, 47.0, 68.0, 59.0, 86.0, 93.0, 108.0, 149.0, 146.0, 186.0, 226.0, 275.0, 283.0, 318.0, 371.0, 374.0, 443.0, 497.0, 531.0, 605.0, 610.0, 672.0, 625.0, 744.0, 728.0, 743.0, 791.0, 802.0, 748.0, 749.0, 730.0, 735.0, 723.0, 673.0, 597.0, 592.0, 580.0, 514.0, 447.0, 466.0, 426.0, 358.0, 339.0, 291.0, 234.0, 238.0, 182.0, 176.0, 158.0, 112.0, 127.0, 91.0, 85.0, 81.0, 64.0, 70.0, 62.0, 52.0, 49.0, 32.0, 46.0, 20.0, 24.0, 10.0, 15.0, 13.0, 14.0, 13.0, 8.0, 7.0, 9.0, 8.0, 9.0, 6.0, 6.0, 4.0, 7.0, 8.0, 8.0, 7.0, 10.0, 7.0, 9.0, 4.0, 7.0, 8.0, 8.0, 12.0, 6.0, 8.0, 6.0, 3.0, 6.0, 4.0, 6.0, 3.0, 2.0, 7.0, 5.0, 1.0, 5.0, 4.0, 2.0, 4.0, 1.0, 3.0, 2.0, 3.0, 1.0, 3.0, 2.0, 2.0, 2.0, 0.0, 0.0, 2.0, 1.0, 0.0, 1.0, 0.0, 1.0, 2.0, 0.0, 0.0, 0.0, 2.0, 0.0, 0.0, 0.0, 0.0, 0.0, 0.0, 0.0, 0.0, 0.0, 1.0, 0.0, 0.0, 1.0, 0.0, 1.0, 0.0, 0.0, 1.0, 0.0, 0.0, 1.0, 0.0, 0.0, 0.0, 0.0, 0.0, 0.0, 0.0, 0.0, 0.0, 0.0, 0.0, 0.0, 0.0, 0.0, 0.0, 0.0, 0.0, 0.0, 0.0, 0.0, 0.0, 0.0, 0.0, 0.0, 0.0, 0.0, 0.0, 0.0, 0.0, 0.0, 0.0, 0.0, 0.0, 0.0, 0.0, 0.0, 0.0, 0.0, 0.0, 0.0, 0.0, 0.0, 0.0, 0.0, 0.0, 0.0, 0.0, 0.0, 0.0, 0.0, 0.0, 0.0, 0.0, 0.0, 0.0, 0.0],
    "Name": "ThresholdDist-0",
    "Overflow": 0.0,
    "Type": "Histo1d",
    "Underflow": 0.0,
    "x": {
        "AxisTitle": "Threshold [e]",
        "Bins": 376,
        "High": 3755.0,
        "Low": -5.0
    },
    "y": {
        "AxisTitle": "Number of Pixels"
    },
    "z": {
        "AxisTitle": "z"
    }
}