{
    "Data": [0.0, 0.0, 0.0, 0.0, 0.0, 0.0, 0.0, 0.0, 0.0, 0.0, 0.0, 0.0, 0.0, 0.0, 0.0, 0.0, 0.0, 0.0, 0.0, 0.0, 0.0, 0.0, 0.0, 0.0, 0.0, 0.0, 0.0, 0.0, 0.0, 0.0, 0.0, 0.0, 0.0, 0.0, 0.0, 0.0, 0.0, 0.0, 0.0, 0.0, 0.0, 0.0, 0.0, 0.0, 0.0, 0.0, 0.0, 0.0, 0.0, 0.0, 2.0, 7.0, 5.0, 4.0, 8.0, 5.0, 7.0, 14.0, 8.0, 8.0, 12.0, 9.0, 20.0, 12.0, 8.0, 8.0, 21.0, 29.0, 36.0, 44.0, 48.0, 65.0, 93.0, 106.0, 158.0, 172.0, 228.0, 304.0, 347.0, 454.0, 556.0, 642.0, 773.0, 858.0, 1004.0, 1157.0, 1242.0, 1308.0, 1461.0, 1657.0, 1845.0, 2131.0, 2746.0, 3446.0, 4204.0, 4622.0, 4603.0, 4002.0, 3369.0, 2428.0, 1742.0, 1082.0, 694.0, 439.0, 338.0, 233.0, 190.0, 125.0, 127.0, 65.0, 71.0, 58.0, 43.0, 40.0, 36.0, 35.0, 30.0, 23.0, 17.0, 36.0, 29.0, 26.0, 22.0, 17.0, 19.0, 16.0, 12.0, 11.0, 16.0, 10.0, 10.0, 8.0, 14.0, 12.0, 10.0, 8.0, 9.0, 8.0, 12.0, 8.0, 12.0, 6.0, 8.0, 8.0, 6.0, 7.0, 5.0, 8.0, 4.0, 3.0, 3.0, 7.0, 6.0, 4.0, 5.0, 3.0, 0.0, 0.0, 1.0, 3.0, 5.0, 1.0, 4.0, 8.0, 4.0, 10.0, 11.0, 7.0, 17.0, 13.0, 13.0, 34.0, 45.0, 36.0, 55.0, 57.0, 68.0, 88.0, 102.0, 111.0, 132.0, 147.0, 196.0, 221.0, 265.0, 308.0, 338.0, 372.0, 404.0, 463.0, 493.0, 580.0, 607.0, 671.0, 664.0, 669.0, 750.0, 772.0, 742.0, 728.0, 783.0, 764.0, 774.0, 794.0, 705.0, 724.0, 653.0, 602.0, 621.0, 548.0, 489.0, 514.0, 444.0, 387.0, 346.0, 296.0, 301.0, 278.0, 222.0, 189.0, 179.0, 169.0, 121.0, 134.0, 87.0, 108.0, 75.0, 88.0, 62.0, 35.0, 44.0, 36.0, 39.0, 31.0, 36.0, 26.0, 22.0, 23.0, 21.0, 13.0, 9.0, 11.0, 10.0, 8.0, 7.0, 7.0, 5.0, 5.0, 8.0, 10.0, 4.0, 5.0, 7.0, 5.0, 3.0, 8.0, 1.0, 4.0, 2.0, 8.0, 4.0, 4.0, 1.0, 6.0, 0.0, 3.0, 4.0, 2.0, 2.0, 2.0, 0.0, 4.0, 2.0, 1.0, 2.0, 0.0, 1.0, 2.0, 3.0, 2.0, 3.0, 4.0, 0.0, 2.0, 2.0, 1.0, 2.0, 0.0, 3.0, 0.0, 0.0, 1.0, 1.0, 4.0, 0.0, 1.0, 1.0, 0.0, 1.0, 2.0, 0.0, 0.0, 0.0, 1.0, 0.0, 0.0, 0.0, 0.0, 1.0, 1.0, 0.0, 1.0, 0.0, 0.0, 2.0, 0.0, 0.0, 0.0, 0.0, 0.0, 0.0, 0.0, 1.0, 0.0, 1.0, 0.0, 0.0, 0.0, 0.0, 0.0, 0.0, 0.0, 0.0, 0.0, 0.0, 0.0, 0.0, 0.0, 0.0, 0.0, 0.0, 0.0, 0.0, 0.0, 0.0, 0.0, 0.0, 0.0, 0.0, 0.0, 0.0, 0.0, 0.0, 0.0, 0.0, 0.0, 0.0, 0.0, 0.0, 0.0, 0.0, 0.0, 0.0, 0.0, 0.0, 0.0, 0.0, 0.0, 0.0, 0.0, 0.0, 0.0, 0.0, 0.0, 0.0, 0.0],
    "Name": "ThresholdDist-0",
    "Overflow": 0.0,
    "Type": "Histo1d",
    "Underflow": 0.0,
    "x": {
        "AxisTitle": "Threshold [e]",
        "Bins": 376,
        "High": 3755.0,
        "Low": -5.0
    },
    "y": {
        "AxisTitle": "Number of Pixels"
    },
    "z": {
        "AxisTitle": "z"
    }
}