time,Hardware,Voltage,Current
1622016245516,high-voltage,1,0.153221
time,Hardware,Voltage,Current
1622016245516,high-voltage,2,0.266442
time,Hardware,Voltage,Current
1622016245516,high-voltage,3,0.395253
time,Hardware,Voltage,Current
1622016245516,high-voltage,4,0.505087
time,Hardware,Voltage,Current
1622016245516,high-voltage,5,0.658719
time,Hardware,Voltage,Current
1622016245516,high-voltage,6,0.845448
time,Hardware,Voltage,Current
1622016245516,high-voltage,7,1.04762
time,Hardware,Voltage,Current
1622016245516,high-voltage,8,1.40613
time,Hardware,Voltage,Current
1622016245516,high-voltage,9,1.77422
time,Hardware,Voltage,Current
1622016245516,high-voltage,10,2.16128
time,Hardware,Voltage,Current
1622016245516,high-voltage,11,2.78016
time,Hardware,Voltage,Current
1622016245516,high-voltage,12,3.3368
time,Hardware,Voltage,Current
1622016245516,high-voltage,13,4.13746
time,Hardware,Voltage,Current
1622016245516,high-voltage,14,4.97011
time,Hardware,Voltage,Current
1622016245516,high-voltage,15,5.99503
time,Hardware,Voltage,Current
1622016245516,high-voltage,16,6.8545
time,Hardware,Voltage,Current
1622016245516,high-voltage,17,7.96092
time,Hardware,Voltage,Current
1622016245516,high-voltage,9.02157e-06,9.08395
time,Hardware,Voltage,Current
1622016245516,high-voltage,19,10.0001
