time,Hardware,Voltage,Current
1623285088058,high-voltage,1,0.0253598
time,Hardware,Voltage,Current
1623285088058,high-voltage,2,0.0319255
time,Hardware,Voltage,Current
1623285088058,high-voltage,3,0.0369004
time,Hardware,Voltage,Current
1623285088058,high-voltage,4,0.0426201
time,Hardware,Voltage,Current
1623285088058,high-voltage,5,0.0461926
time,Hardware,Voltage,Current
1623285088058,high-voltage,6,0.0502187
time,Hardware,Voltage,Current
1623285088058,high-voltage,7,0.0535903
