{
    "Data": [0.0, 0.0, 0.0, 0.0, 0.0, 0.0, 0.0, 0.0, 0.0, 0.0, 0.0, 0.0, 0.0, 0.0, 0.0, 0.0, 0.0, 0.0, 0.0, 0.0, 0.0, 0.0, 0.0, 0.0, 0.0, 0.0, 0.0, 0.0, 0.0, 0.0, 0.0, 0.0, 0.0, 0.0, 0.0, 0.0, 0.0, 0.0, 0.0, 0.0, 0.0, 0.0, 0.0, 0.0, 0.0, 0.0, 0.0, 0.0, 0.0, 0.0, 25.0, 48.0, 60.0, 81.0, 101.0, 105.0, 123.0, 140.0, 150.0, 212.0, 207.0, 207.0, 228.0, 283.0, 322.0, 335.0, 368.0, 417.0, 460.0, 515.0, 539.0, 589.0, 601.0, 560.0, 737.0, 694.0, 738.0, 845.0, 780.0, 842.0, 907.0, 962.0, 1057.0, 1262.0, 1471.0, 1757.0, 2056.0, 2415.0, 2588.0, 2914.0, 2905.0, 2846.0, 2703.0, 2454.0, 2126.0, 1746.0, 1455.0, 1158.0, 932.0, 756.0, 615.0, 508.0, 410.0, 321.0, 313.0, 243.0, 200.0, 153.0, 138.0, 131.0, 105.0, 93.0, 75.0, 53.0, 49.0, 53.0, 44.0, 38.0, 28.0, 39.0, 23.0, 24.0, 19.0, 26.0, 15.0, 17.0, 15.0, 14.0, 22.0, 10.0, 18.0, 11.0, 15.0, 16.0, 10.0, 8.0, 8.0, 9.0, 9.0, 5.0, 4.0, 2.0, 10.0, 5.0, 4.0, 3.0, 5.0, 3.0, 3.0, 3.0, 2.0, 3.0, 5.0, 5.0, 4.0, 8.0, 3.0, 5.0, 14.0, 9.0, 10.0, 10.0, 17.0, 15.0, 21.0, 33.0, 28.0, 41.0, 49.0, 59.0, 67.0, 84.0, 93.0, 117.0, 104.0, 133.0, 165.0, 194.0, 239.0, 234.0, 280.0, 302.0, 314.0, 374.0, 394.0, 429.0, 486.0, 501.0, 538.0, 584.0, 590.0, 691.0, 716.0, 733.0, 739.0, 751.0, 816.0, 822.0, 807.0, 849.0, 799.0, 843.0, 804.0, 745.0, 710.0, 650.0, 677.0, 623.0, 588.0, 536.0, 469.0, 476.0, 449.0, 378.0, 345.0, 300.0, 220.0, 210.0, 210.0, 181.0, 118.0, 127.0, 107.0, 102.0, 74.0, 63.0, 57.0, 38.0, 33.0, 22.0, 19.0, 21.0, 9.0, 10.0, 7.0, 7.0, 5.0, 7.0, 3.0, 0.0, 3.0, 1.0, 2.0, 0.0, 0.0, 0.0, 0.0, 0.0, 1.0, 0.0, 0.0, 0.0, 0.0, 0.0, 0.0, 1.0, 0.0, 0.0, 1.0, 0.0, 0.0, 0.0, 0.0, 0.0, 0.0, 0.0, 1.0, 0.0, 0.0, 0.0, 0.0, 0.0, 0.0, 0.0, 0.0, 0.0, 0.0, 0.0, 0.0, 1.0, 0.0, 0.0, 0.0, 0.0, 0.0, 0.0, 0.0, 0.0, 0.0, 0.0, 0.0, 0.0, 0.0, 0.0, 0.0, 0.0, 0.0, 0.0, 0.0, 0.0, 0.0, 0.0, 0.0, 0.0, 0.0, 0.0, 0.0, 0.0, 0.0, 0.0, 0.0, 0.0, 0.0, 0.0, 0.0, 0.0, 0.0, 0.0, 0.0, 0.0, 0.0, 0.0, 0.0, 0.0, 0.0, 0.0, 0.0, 0.0, 0.0, 0.0, 0.0, 0.0, 0.0, 0.0, 0.0, 0.0, 0.0, 0.0, 0.0, 0.0, 0.0, 0.0, 0.0, 0.0, 0.0, 0.0, 0.0, 0.0, 0.0, 0.0, 0.0, 0.0, 0.0, 0.0, 0.0, 0.0, 0.0, 0.0, 0.0, 0.0, 0.0, 0.0, 0.0, 0.0, 0.0, 0.0, 0.0, 0.0, 0.0, 0.0, 0.0, 0.0, 0.0, 0.0, 0.0, 0.0, 0.0, 0.0, 0.0, 0.0, 0.0, 0.0, 0.0, 0.0, 0.0, 0.0, 0.0, 0.0],
    "Name": "ThresholdDist-0",
    "Overflow": 0.0,
    "Type": "Histo1d",
    "Underflow": 0.0,
    "x": {
        "AxisTitle": "Threshold [e]",
        "Bins": 388,
        "High": 3875.0,
        "Low": -5.0
    },
    "y": {
        "AxisTitle": "Number of Pixels"
    },
    "z": {
        "AxisTitle": "z"
    }
}