time,Hardware,Voltage,Current
1622000519101,high-voltage-3,1,0.00423631
time,Hardware,Voltage,Current
1622000519101,high-voltage-3,2,0.00663932
time,Hardware,Voltage,Current
1622000519101,high-voltage-3,3,0.00783818
time,Hardware,Voltage,Current
1622000519101,high-voltage-3,4,0.00935827
time,Hardware,Voltage,Current
1622000519101,high-voltage-3,5,0.0109341
time,Hardware,Voltage,Current
1622000519101,high-voltage-3,6,0.0129323
time,Hardware,Voltage,Current
1622000519101,high-voltage-3,1.35558e-08,0.0134437
time,Hardware,Voltage,Current
1622000519101,high-voltage-3,8,0.0161522
time,Hardware,Voltage,Current
1622000519101,high-voltage-3,9,0.016987
time,Hardware,Voltage,Current
1622000519101,high-voltage-3,10,0.0196808
time,Hardware,Voltage,Current
1622000519101,high-voltage-3,11,0.0215034
time,Hardware,Voltage,Current
1622000519101,high-voltage-3,12,0.0216613
time,Hardware,Voltage,Current
1622000519101,high-voltage-3,13,0.023262
time,Hardware,Voltage,Current
1622000519101,high-voltage-3,14,0.0245902
time,Hardware,Voltage,Current
1622000519101,high-voltage-3,15,0.0278598
time,Hardware,Voltage,Current
1622000519101,high-voltage-3,16,0.0285355
time,Hardware,Voltage,Current
1622000519101,high-voltage-3,17,0.0302516
time,Hardware,Voltage,Current
1622000519101,high-voltage-3,18,0.0307111
time,Hardware,Voltage,Current
1622000519101,high-voltage-3,19,0.0333103
time,Hardware,Voltage,Current
1622000519101,high-voltage-3,20,0.0322456
time,Hardware,Voltage,Current
1622000519101,high-voltage-3,25,0.041944
time,Hardware,Voltage,Current
1622000519101,high-voltage-3,30,0.0478133
time,Hardware,Voltage,Current
1622000519101,high-voltage-3,35,0.0549262
time,Hardware,Voltage,Current
1622000519101,high-voltage-3,40,0.0623691
time,Hardware,Voltage,Current
1622000519101,high-voltage-3,45,0.0705593
time,Hardware,Voltage,Current
1622000519101,high-voltage-3,50,0.0748993
time,Hardware,Voltage,Current
1622000519101,high-voltage-3,55,0.0809504
time,Hardware,Voltage,Current
1622000519101,high-voltage-3,60,0.0880963
time,Hardware,Voltage,Current
1622000519101,high-voltage-3,65,0.0936019
time,Hardware,Voltage,Current
1622000519101,high-voltage-3,70,0.100759
time,Hardware,Voltage,Current
1622000519101,high-voltage-3,75,0.106102
time,Hardware,Voltage,Current
1622000519101,high-voltage-3,80,0.114209
time,Hardware,Voltage,Current
1622000519101,high-voltage-3,85,0.122719
time,Hardware,Voltage,Current
1622000519101,high-voltage-3,90,0.130556
time,Hardware,Voltage,Current
1622000519101,high-voltage-3,95,0.139366
time,Hardware,Voltage,Current
1622000519101,high-voltage-3,100,0.149326
