time,Hardware,Voltage,Current
1621477779064,high-voltage-2,1,0.118905
time,Hardware,Voltage,Current
1621477779064,high-voltage-2,2,0.150543
time,Hardware,Voltage,Current
1621477779064,high-voltage-2,3,0.168913
time,Hardware,Voltage,Current
1621477779064,high-voltage-2,4,0.182645
time,Hardware,Voltage,Current
1621477779064,high-voltage-2,5,0.197449
time,Hardware,Voltage,Current
1621477779064,high-voltage-2,6,0.215123
time,Hardware,Voltage,Current
1621477779064,high-voltage-2,7,0.232319
time,Hardware,Voltage,Current
1621477779064,high-voltage-2,8,0.253196
time,Hardware,Voltage,Current
1621477779064,high-voltage-2,9,0.272848
time,Hardware,Voltage,Current
1621477779064,high-voltage-2,10,0.297147
time,Hardware,Voltage,Current
1621477779064,high-voltage-2,11,0.318011
time,Hardware,Voltage,Current
1621477779064,high-voltage-2,12,0.339818
time,Hardware,Voltage,Current
1621477779064,high-voltage-2,13,0.359537
time,Hardware,Voltage,Current
1621477779064,high-voltage-2,14,0.379694
time,Hardware,Voltage,Current
1621477779064,high-voltage-2,15,0.399145
time,Hardware,Voltage,Current
1621477779064,high-voltage-2,16,0.419026
time,Hardware,Voltage,Current
1621477779064,high-voltage-2,17,0.435645
time,Hardware,Voltage,Current
1621477779064,high-voltage-2,18,0.452147
time,Hardware,Voltage,Current
1621477779064,high-voltage-2,19,0.464555
time,Hardware,Voltage,Current
1621477779064,high-voltage-2,20,0.476142
time,Hardware,Voltage,Current
1621477779064,high-voltage-2,25,0.527789
time,Hardware,Voltage,Current
1621477779064,high-voltage-2,30,0.579833
time,Hardware,Voltage,Current
1621477779064,high-voltage-2,35,0.628332
time,Hardware,Voltage,Current
1621477779064,high-voltage-2,40,0.684409
time,Hardware,Voltage,Current
1621477779064,high-voltage-2,45,0.753954
time,Hardware,Voltage,Current
1621477779064,high-voltage-2,50,0.801477
time,Hardware,Voltage,Current
1621477779064,high-voltage-2,55,0.848166
time,Hardware,Voltage,Current
1621477779064,high-voltage-2,60,0.888825
time,Hardware,Voltage,Current
1621477779064,high-voltage-2,65,0.929444
time,Hardware,Voltage,Current
1621477779064,high-voltage-2,70,0.971715
time,Hardware,Voltage,Current
1621477779064,high-voltage-2,75,1.00926
time,Hardware,Voltage,Current
1621477779064,high-voltage-2,80,1.04897
time,Hardware,Voltage,Current
1621477779064,high-voltage-2,85,1.08518
time,Hardware,Voltage,Current
1621477779064,high-voltage-2,90,1.12099
