{
    "Data": [8.0, 62.0, 10.0, 7.0, 25.0, 31.0, 169.0, 503.0, 1435.0, 3034.0, 4921.0, 5481.0, 4948.0, 3854.0, 3264.0, 3373.0, 3244.0, 3016.0, 2639.0, 2284.0, 2057.0, 1827.0, 1754.0, 1471.0, 1166.0, 807.0, 582.0, 417.0, 312.0, 251.0, 246.0, 254.0, 325.0, 360.0, 463.0, 568.0, 658.0, 693.0, 887.0, 952.0, 979.0, 1034.0, 1052.0, 1065.0, 1076.0, 1003.0, 904.0, 860.0, 801.0, 684.0, 606.0, 546.0, 449.0, 379.0, 364.0, 335.0, 344.0, 263.0, 218.0, 181.0, 180.0, 182.0, 151.0, 141.0, 128.0, 122.0, 121.0, 112.0, 100.0, 108.0, 80.0, 80.0, 65.0, 84.0, 70.0, 61.0, 46.0, 54.0, 53.0, 41.0, 40.0, 38.0, 43.0, 49.0, 47.0, 48.0, 35.0, 27.0, 34.0, 41.0, 37.0, 29.0, 33.0, 33.0, 25.0, 23.0, 15.0, 11.0, 18.0, 16.0, 15.0, 12.0, 15.0, 16.0, 14.0, 18.0, 16.0, 10.0, 9.0, 12.0, 6.0, 8.0, 16.0, 8.0, 7.0],
    "Name": "NoiseDist-0",
    "Overflow": 183.0,
    "Type": "Histo1d",
    "Underflow": 0.0,
    "x": {
        "AxisTitle": "Noise [e]",
        "Bins": 115,
        "High": 576.0,
        "Low": -2.0
    },
    "y": {
        "AxisTitle": "Number of Pixels"
    },
    "z": {
        "AxisTitle": "z"
    }
}