{
    "Data": [0.0, 0.0, 0.0, 0.0, 0.0, 0.0, 0.0, 0.0, 0.0, 0.0, 0.0, 0.0, 0.0, 0.0, 0.0, 0.0, 0.0, 2.0, 2.0, 5.0, 9.0, 13.0, 18.0, 34.0, 25.0, 25.0, 35.0, 36.0, 44.0, 23.0, 32.0, 50.0, 50.0, 50.0, 3.0, 50.0, 8.0, 9.0, 50.0, 50.0, 50.0, 11.0, 50.0, 50.0, 50.0, 50.0, 49.0, 50.0, 50.0, 50.0, 50.0],
    "Name": "Scurve-70-96",
    "Overflow": 0.0,
    "Type": "Histo1d",
    "Underflow": 0.0,
    "x": {
        "AxisTitle": "Vcal",
        "Bins": 51,
        "High": 302.5,
        "Low": 47.5
    },
    "y": {
        "AxisTitle": "Occupancy"
    },
    "z": {
        "AxisTitle": "z"
    }
}