time,Hardware,Voltage,Current
1621392394272,high-voltage-2,1,0.119947
time,Hardware,Voltage,Current
1621392394272,high-voltage-2,2,0.142618
time,Hardware,Voltage,Current
1621392394272,high-voltage-2,3,0.153889
time,Hardware,Voltage,Current
1621392394272,high-voltage-2,4,0.165675
time,Hardware,Voltage,Current
1621392394272,high-voltage-2,5,0.178975
time,Hardware,Voltage,Current
1621392394272,high-voltage-2,6,0.190482
time,Hardware,Voltage,Current
1621392394272,high-voltage-2,7,0.20293
time,Hardware,Voltage,Current
1621392394272,high-voltage-2,8,0.220376
time,Hardware,Voltage,Current
1621392394272,high-voltage-2,9,0.23596
time,Hardware,Voltage,Current
1621392394272,high-voltage-2,10,0.255858
time,Hardware,Voltage,Current
1621392394272,high-voltage-2,11,0.278242
time,Hardware,Voltage,Current
1621392394272,high-voltage-2,12,0.30002
time,Hardware,Voltage,Current
1621392394272,high-voltage-2,13,0.320835
time,Hardware,Voltage,Current
1621392394272,high-voltage-2,14,0.342772
time,Hardware,Voltage,Current
1621392394272,high-voltage-2,15,0.35947
time,Hardware,Voltage,Current
1621392394272,high-voltage-2,16,0.376403
time,Hardware,Voltage,Current
1621392394272,high-voltage-2,17,0.393842
time,Hardware,Voltage,Current
1621392394272,high-voltage-2,18,0.408294
time,Hardware,Voltage,Current
1621392394272,high-voltage-2,19,0.421117
time,Hardware,Voltage,Current
1621392394272,high-voltage-2,20,0.431535
time,Hardware,Voltage,Current
1621392394272,high-voltage-2,25,0.486897
time,Hardware,Voltage,Current
1621392394272,high-voltage-2,30,0.53892
time,Hardware,Voltage,Current
1621392394272,high-voltage-2,35,0.590203
time,Hardware,Voltage,Current
1621392394272,high-voltage-2,6.48636e-07,0.649659
time,Hardware,Voltage,Current
1621392394272,high-voltage-2,45,0.722648
time,Hardware,Voltage,Current
1621392394272,high-voltage-2,50,0.77566
time,Hardware,Voltage,Current
1621392394272,high-voltage-2,55,0.823854
time,Hardware,Voltage,Current
1621392394272,high-voltage-2,60,0.871239
time,Hardware,Voltage,Current
1621392394272,high-voltage-2,65,0.916173
time,Hardware,Voltage,Current
1621392394272,high-voltage-2,70,0.95997
time,Hardware,Voltage,Current
1621392394272,high-voltage-2,75,1.00322
time,Hardware,Voltage,Current
1621392394272,high-voltage-2,80,1.04321
time,Hardware,Voltage,Current
1621392394272,high-voltage-2,85,1.08349
time,Hardware,Voltage,Current
1621392394272,high-voltage-2,90,1.121
time,Hardware,Voltage,Current
1621392394272,high-voltage-2,95,1.15943
time,Hardware,Voltage,Current
1621392394272,high-voltage-2,100,1.19666
