{
    "Data": [0.0, 0.0, 0.0, 0.0, 0.0, 0.0, 0.0, 0.0, 0.0, 0.0, 0.0, 0.0, 0.0, 0.0, 0.0, 0.0, 0.0, 0.0, 0.0, 0.0, 0.0, 0.0, 0.0, 0.0, 0.0, 0.0, 0.0, 0.0, 0.0, 0.0, 0.0, 0.0, 0.0, 0.0, 0.0, 0.0, 0.0, 0.0, 0.0, 0.0, 0.0, 0.0, 0.0, 0.0, 0.0, 0.0, 0.0, 0.0, 0.0, 0.0, 62.0, 108.0, 117.0, 164.0, 167.0, 172.0, 186.0, 262.0, 270.0, 282.0, 377.0, 385.0, 435.0, 487.0, 495.0, 578.0, 594.0, 639.0, 692.0, 733.0, 762.0, 762.0, 822.0, 892.0, 841.0, 872.0, 859.0, 889.0, 889.0, 840.0, 859.0, 814.0, 810.0, 886.0, 875.0, 951.0, 1047.0, 1229.0, 1521.0, 1873.0, 2214.0, 2503.0, 2865.0, 2901.0, 2826.0, 2561.0, 2097.0, 1752.0, 1385.0, 955.0, 678.0, 504.0, 340.0, 228.0, 154.0, 99.0, 105.0, 56.0, 68.0, 38.0, 31.0, 30.0, 36.0, 16.0, 24.0, 22.0, 19.0, 20.0, 14.0, 12.0, 10.0, 20.0, 10.0, 14.0, 8.0, 15.0, 10.0, 10.0, 9.0, 9.0, 3.0, 6.0, 5.0, 8.0, 6.0, 4.0, 5.0, 4.0, 11.0, 5.0, 8.0, 2.0, 5.0, 1.0, 4.0, 1.0, 4.0, 1.0, 2.0, 4.0, 2.0, 6.0, 1.0, 7.0, 5.0, 5.0, 2.0, 8.0, 11.0, 20.0, 31.0, 21.0, 43.0, 30.0, 47.0, 69.0, 73.0, 112.0, 121.0, 167.0, 203.0, 243.0, 267.0, 311.0, 350.0, 420.0, 438.0, 536.0, 631.0, 634.0, 677.0, 699.0, 773.0, 796.0, 825.0, 914.0, 890.0, 990.0, 945.0, 957.0, 890.0, 957.0, 922.0, 841.0, 861.0, 809.0, 681.0, 703.0, 562.0, 567.0, 469.0, 439.0, 367.0, 326.0, 311.0, 263.0, 223.0, 212.0, 176.0, 158.0, 133.0, 96.0, 78.0, 66.0, 47.0, 38.0, 36.0, 32.0, 25.0, 12.0, 12.0, 5.0, 10.0, 6.0, 4.0, 3.0, 0.0, 0.0, 0.0, 0.0, 0.0, 0.0, 1.0, 0.0, 0.0, 0.0, 0.0, 0.0, 0.0, 0.0, 0.0, 0.0, 0.0, 1.0, 0.0, 0.0, 0.0, 0.0, 0.0, 0.0, 0.0, 0.0, 0.0, 0.0, 0.0, 1.0, 0.0, 0.0, 0.0, 0.0, 0.0, 0.0, 0.0, 0.0, 0.0, 0.0, 0.0, 0.0, 0.0, 1.0, 0.0, 0.0, 0.0, 0.0, 0.0, 0.0, 0.0, 0.0, 0.0, 0.0, 0.0, 0.0, 0.0, 0.0, 0.0, 0.0, 0.0, 0.0, 0.0, 0.0, 0.0, 0.0, 0.0, 0.0, 0.0, 0.0, 0.0, 0.0, 0.0, 0.0, 0.0, 0.0, 0.0, 0.0, 0.0, 0.0, 0.0, 0.0, 0.0, 0.0, 0.0, 0.0, 0.0, 0.0, 0.0, 0.0, 0.0, 0.0, 0.0, 0.0, 0.0, 0.0, 0.0, 0.0, 0.0, 0.0, 0.0, 0.0, 0.0, 0.0, 0.0, 0.0, 0.0, 0.0, 0.0, 0.0, 0.0, 0.0, 0.0, 0.0, 0.0, 0.0, 0.0, 0.0, 0.0, 0.0, 0.0, 0.0, 0.0, 0.0, 0.0, 0.0, 0.0, 0.0, 0.0, 0.0, 0.0, 0.0, 0.0, 0.0, 0.0, 0.0, 0.0, 0.0],
    "Name": "ThresholdDist-0",
    "Overflow": 0.0,
    "Type": "Histo1d",
    "Underflow": 0.0,
    "x": {
        "AxisTitle": "Threshold [e]",
        "Bins": 364,
        "High": 3635.0,
        "Low": -5.0
    },
    "y": {
        "AxisTitle": "Number of Pixels"
    },
    "z": {
        "AxisTitle": "z"
    }
}