time,Hardware,Voltage,Current
1621549590224,high-voltage-3,1,0.0574524
time,Hardware,Voltage,Current
1621549590224,high-voltage-3,2,0.0637499
time,Hardware,Voltage,Current
1621549590224,high-voltage-3,3,0.0719603
time,Hardware,Voltage,Current
1621549590224,high-voltage-3,4,0.0753019
time,Hardware,Voltage,Current
1621549590224,high-voltage-3,5,0.0772659
time,Hardware,Voltage,Current
1621549590224,high-voltage-3,6,0.0775596
time,Hardware,Voltage,Current
1621549590224,high-voltage-3,7,0.0874115
time,Hardware,Voltage,Current
1621549590224,high-voltage-3,8,0.0904809
time,Hardware,Voltage,Current
1621549590224,high-voltage-3,9,0.0852406
time,Hardware,Voltage,Current
1621549590224,high-voltage-3,10,0.0872348
time,Hardware,Voltage,Current
1621549590224,high-voltage-3,11,0.0911131
time,Hardware,Voltage,Current
1621549590224,high-voltage-3,12,0.0958458
time,Hardware,Voltage,Current
1621549590224,high-voltage-3,13,0.0973663
time,Hardware,Voltage,Current
1621549590224,high-voltage-3,14,0.0995404
time,Hardware,Voltage,Current
1621549590224,high-voltage-3,15,0.101517
time,Hardware,Voltage,Current
1621549590224,high-voltage-3,16,0.103499
time,Hardware,Voltage,Current
1621549590224,high-voltage-3,17,0.104878
time,Hardware,Voltage,Current
1621549590224,high-voltage-3,18,0.107929
time,Hardware,Voltage,Current
1621549590224,high-voltage-3,19,0.10936
time,Hardware,Voltage,Current
1621549590224,high-voltage-3,20,0.111434
time,Hardware,Voltage,Current
1621549590224,high-voltage-3,25,0.121209
time,Hardware,Voltage,Current
1621549590224,high-voltage-3,30,0.12927
time,Hardware,Voltage,Current
1621549590224,high-voltage-3,35,0.137208
time,Hardware,Voltage,Current
1621549590224,high-voltage-3,40,0.143726
time,Hardware,Voltage,Current
1621549590224,high-voltage-3,45,0.151342
time,Hardware,Voltage,Current
1621549590224,high-voltage-3,50,0.15689
time,Hardware,Voltage,Current
1621549590224,high-voltage-3,55,0.161946
time,Hardware,Voltage,Current
1621549590224,high-voltage-3,60,0.16728
time,Hardware,Voltage,Current
1621549590224,high-voltage-3,65,0.174048
time,Hardware,Voltage,Current
1621549590224,high-voltage-3,70,0.17815
time,Hardware,Voltage,Current
1621549590224,high-voltage-3,75,0.182616
time,Hardware,Voltage,Current
1621549590224,high-voltage-3,80,0.188169
time,Hardware,Voltage,Current
1621549590224,high-voltage-3,85,0.192191
time,Hardware,Voltage,Current
1621549590224,high-voltage-3,90,0.19869
time,Hardware,Voltage,Current
1621549590224,high-voltage-3,95,0.205004
time,Hardware,Voltage,Current
1621549590224,high-voltage-3,100,0.208886
