{
    "Data": [0.0, 0.0, 0.0, 0.0, 0.0, 0.0, 0.0, 0.0, 0.0, 0.0, 0.0, 0.0, 0.0, 0.0, 0.0, 0.0, 1.0, 1.0, 0.0, 3.0, 3.0, 18.0, 11.0, 15.0, 9.0, 27.0, 16.0, 19.0, 10.0, 19.0, 48.0, 4.0, 24.0, 27.0, 21.0, 23.0, 36.0, 39.0, 12.0, 47.0, 50.0, 31.0, 11.0, 50.0, 50.0, 50.0, 50.0, 50.0, 50.0, 28.0, 50.0],
    "Name": "Scurve-90-96",
    "Overflow": 0.0,
    "Type": "Histo1d",
    "Underflow": 0.0,
    "x": {
        "AxisTitle": "Vcal",
        "Bins": 51,
        "High": 302.5,
        "Low": 47.5
    },
    "y": {
        "AxisTitle": "Occupancy"
    },
    "z": {
        "AxisTitle": "z"
    }
}