{
    "Data": [581.0, 10097.0, 13806.0, 7376.0, 2946.0, 1331.0, 848.0, 758.0, 742.0, 792.0, 886.0, 890.0, 919.0, 942.0, 958.0, 984.0, 963.0, 951.0, 905.0, 858.0, 787.0, 751.0, 663.0, 585.0, 539.0, 497.0, 465.0, 385.0, 363.0, 326.0, 327.0, 273.0, 237.0, 220.0, 238.0, 162.0, 164.0, 140.0, 146.0, 131.0, 89.0, 77.0, 73.0, 69.0, 70.0, 51.0, 45.0, 45.0, 37.0, 25.0, 19.0],
    "Name": "Chi2Dist-0",
    "Overflow": 0.0,
    "Type": "Histo1d",
    "Underflow": 0.0,
    "x": {
        "AxisTitle": "Fit Chi/ndf",
        "Bins": 51,
        "High": 2.5250000953674318,
        "Low": -0.02500000037252903
    },
    "y": {
        "AxisTitle": "Number of Pixels"
    },
    "z": {
        "AxisTitle": "z"
    }
}