{
    "Data": [[1309.0, 407.0, 202.0, 117.0, 65.0, 50.0, 36.0, 41.0, 20.0, 28.0, 27.0, 23.0, 21.0, 14.0, 13.0, 13.0, 13.0, 9.0, 14.0, 16.0, 8.0, 8.0, 11.0, 10.0, 8.0, 6.0, 8.0, 12.0, 6.0, 9.0, 3.0, 4.0, 8.0, 7.0, 4.0, 5.0, 3.0, 4.0, 3.0, 5.0, 5.0, 6.0, 3.0, 4.0, 4.0, 11.0, 6.0, 10.0, 13.0], [2454.0, 860.0, 461.0, 278.0, 192.0, 130.0, 103.0, 79.0, 65.0, 61.0, 34.0, 49.0, 19.0, 23.0, 29.0, 25.0, 29.0, 18.0, 20.0, 14.0, 19.0, 17.0, 11.0, 16.0, 11.0, 5.0, 13.0, 11.0, 19.0, 8.0, 9.0, 8.0, 12.0, 6.0, 4.0, 10.0, 4.0, 5.0, 12.0, 8.0, 7.0, 10.0, 8.0, 4.0, 11.0, 8.0, 13.0, 16.0, 18.0], [3669.0, 1660.0, 933.0, 629.0, 446.0, 324.0, 241.0, 186.0, 146.0, 125.0, 115.0, 92.0, 71.0, 70.0, 67.0, 64.0, 43.0, 47.0, 34.0, 39.0, 27.0, 31.0, 23.0, 19.0, 22.0, 28.0, 15.0, 16.0, 16.0, 22.0, 20.0, 10.0, 23.0, 22.0, 10.0, 17.0, 14.0, 13.0, 14.0, 12.0, 11.0, 8.0, 14.0, 13.0, 8.0, 11.0, 13.0, 27.0, 27.0], [4200.0, 2424.0, 1503.0, 1051.0, 825.0, 661.0, 546.0, 459.0, 332.0, 305.0, 254.0, 239.0, 207.0, 157.0, 151.0, 132.0, 105.0, 103.0, 99.0, 92.0, 78.0, 71.0, 66.0, 70.0, 40.0, 48.0, 42.0, 44.0, 35.0, 46.0, 33.0, 33.0, 18.0, 23.0, 22.0, 24.0, 22.0, 20.0, 32.0, 25.0, 22.0, 19.0, 19.0, 25.0, 22.0, 29.0, 35.0, 28.0, 34.0], [4337.0, 2385.0, 1809.0, 1493.0, 1224.0, 991.0, 881.0, 790.0, 662.0, 588.0, 504.0, 444.0, 381.0, 391.0, 322.0, 325.0, 290.0, 246.0, 234.0, 219.0, 186.0, 165.0, 166.0, 138.0, 138.0, 137.0, 109.0, 108.0, 95.0, 109.0, 84.0, 85.0, 72.0, 88.0, 53.0, 58.0, 56.0, 53.0, 60.0, 44.0, 49.0, 45.0, 40.0, 49.0, 41.0, 41.0, 41.0, 54.0, 63.0], [6910.0, 3395.0, 2084.0, 1547.0, 1330.0, 1136.0, 998.0, 923.0, 874.0, 813.0, 716.0, 688.0, 600.0, 602.0, 545.0, 559.0, 512.0, 489.0, 435.0, 392.0, 403.0, 333.0, 355.0, 306.0, 293.0, 291.0, 256.0, 246.0, 223.0, 236.0, 210.0, 195.0, 175.0, 173.0, 169.0, 158.0, 155.0, 145.0, 142.0, 138.0, 128.0, 100.0, 103.0, 110.0, 98.0, 81.0, 91.0, 99.0, 112.0], [5661.0, 4830.0, 3843.0, 3077.0, 2479.0, 2010.0, 1790.0, 1479.0, 1258.0, 1086.0, 987.0, 808.0, 799.0, 757.0, 679.0, 680.0, 666.0, 619.0, 584.0, 514.0, 576.0, 549.0, 481.0, 526.0, 519.0, 493.0, 419.0, 487.0, 464.0, 424.0, 361.0, 404.0, 412.0, 380.0, 352.0, 307.0, 362.0, 359.0, 281.0, 310.0, 272.0, 254.0, 273.0, 275.0, 241.0, 259.0, 261.0, 248.0, 251.0], [1125.0, 1356.0, 1520.0, 1591.0, 1787.0, 1823.0, 1864.0, 1896.0, 1813.0, 1787.0, 1809.0, 1736.0, 1626.0, 1589.0, 1473.0, 1332.0, 1312.0, 1264.0, 1148.0, 1126.0, 1002.0, 964.0, 909.0, 918.0, 766.0, 766.0, 723.0, 709.0, 677.0, 653.0, 619.0, 596.0, 623.0, 608.0, 607.0, 593.0, 595.0, 544.0, 580.0, 627.0, 549.0, 573.0, 559.0, 526.0, 508.0, 528.0, 532.0, 589.0, 643.0], [228.0, 197.0, 229.0, 261.0, 290.0, 326.0, 363.0, 414.0, 439.0, 505.0, 556.0, 662.0, 742.0, 799.0, 830.0, 909.0, 936.0, 1052.0, 1081.0, 1204.0, 1216.0, 1224.0, 1349.0, 1269.0, 1376.0, 1429.0, 1372.0, 1400.0, 1449.0, 1422.0, 1469.0, 1390.0, 1471.0, 1438.0, 1322.0, 1349.0, 1319.0, 1323.0, 1202.0, 1177.0, 1137.0, 1115.0, 1093.0, 1068.0, 1114.0, 1085.0, 1122.0, 1279.0, 1418.0], [143.0, 94.0, 79.0, 51.0, 76.0, 80.0, 86.0, 92.0, 108.0, 105.0, 108.0, 129.0, 117.0, 154.0, 169.0, 170.0, 237.0, 212.0, 257.0, 312.0, 290.0, 356.0, 392.0, 411.0, 446.0, 501.0, 538.0, 626.0, 720.0, 772.0, 871.0, 952.0, 1009.0, 1107.0, 1260.0, 1418.0, 1473.0, 1705.0, 1822.0, 1918.0, 2150.0, 2227.0, 2418.0, 2593.0, 2801.0, 2887.0, 3057.0, 3277.0, 3557.0], [106.0, 69.0, 52.0, 39.0, 34.0, 39.0, 37.0, 41.0, 33.0, 35.0, 34.0, 46.0, 41.0, 46.0, 45.0, 58.0, 58.0, 62.0, 61.0, 65.0, 87.0, 96.0, 110.0, 103.0, 108.0, 124.0, 129.0, 169.0, 184.0, 203.0, 204.0, 260.0, 280.0, 315.0, 394.0, 485.0, 487.0, 608.0, 726.0, 826.0, 948.0, 1193.0, 1509.0, 1849.0, 2364.0, 3152.0, 4232.0, 5809.0, 8523.0], [106.0, 66.0, 41.0, 25.0, 25.0, 28.0, 21.0, 24.0, 25.0, 17.0, 24.0, 13.0, 20.0, 15.0, 23.0, 24.0, 32.0, 21.0, 33.0, 33.0, 23.0, 18.0, 26.0, 42.0, 44.0, 57.0, 48.0, 46.0, 64.0, 58.0, 70.0, 81.0, 86.0, 120.0, 112.0, 136.0, 184.0, 202.0, 236.0, 259.0, 345.0, 445.0, 509.0, 685.0, 932.0, 1325.0, 2068.0, 3541.0, 7964.0], [106.0, 46.0, 38.0, 26.0, 22.0, 13.0, 19.0, 14.0, 12.0, 21.0, 12.0, 13.0, 11.0, 13.0, 19.0, 18.0, 19.0, 16.0, 14.0, 11.0, 14.0, 13.0, 17.0, 21.0, 20.0, 16.0, 22.0, 15.0, 28.0, 19.0, 28.0, 32.0, 31.0, 42.0, 41.0, 49.0, 66.0, 68.0, 78.0, 87.0, 103.0, 164.0, 210.0, 282.0, 371.0, 513.0, 871.0, 1618.0, 4353.0], [74.0, 41.0, 35.0, 29.0, 15.0, 12.0, 24.0, 10.0, 9.0, 17.0, 10.0, 5.0, 14.0, 2.0, 14.0, 10.0, 7.0, 9.0, 13.0, 12.0, 18.0, 14.0, 8.0, 13.0, 9.0, 14.0, 15.0, 13.0, 15.0, 20.0, 16.0, 11.0, 16.0, 19.0, 22.0, 23.0, 21.0, 30.0, 35.0, 38.0, 24.0, 74.0, 71.0, 94.0, 133.0, 231.0, 320.0, 685.0, 2219.0], [87.0, 42.0, 31.0, 20.0, 17.0, 12.0, 12.0, 11.0, 6.0, 8.0, 9.0, 11.0, 11.0, 12.0, 12.0, 11.0, 9.0, 11.0, 10.0, 8.0, 9.0, 4.0, 8.0, 9.0, 6.0, 8.0, 13.0, 8.0, 14.0, 11.0, 10.0, 5.0, 16.0, 11.0, 10.0, 7.0, 13.0, 14.0, 25.0, 26.0, 17.0, 27.0, 34.0, 46.0, 59.0, 70.0, 159.0, 310.0, 1002.0], [72.0, 40.0, 21.0, 14.0, 14.0, 8.0, 8.0, 15.0, 12.0, 8.0, 7.0, 8.0, 12.0, 7.0, 5.0, 8.0, 6.0, 9.0, 2.0, 9.0, 7.0, 8.0, 8.0, 4.0, 9.0, 9.0, 12.0, 8.0, 8.0, 4.0, 6.0, 5.0, 6.0, 9.0, 6.0, 13.0, 14.0, 6.0, 9.0, 16.0, 21.0, 20.0, 22.0, 25.0, 22.0, 52.0, 67.0, 153.0, 440.0], [61.0, 28.0, 19.0, 9.0, 15.0, 11.0, 6.0, 10.0, 6.0, 6.0, 4.0, 4.0, 11.0, 4.0, 7.0, 7.0, 4.0, 5.0, 7.0, 3.0, 5.0, 7.0, 12.0, 8.0, 3.0, 7.0, 13.0, 5.0, 5.0, 6.0, 2.0, 3.0, 5.0, 6.0, 4.0, 10.0, 4.0, 7.0, 12.0, 11.0, 14.0, 12.0, 17.0, 18.0, 25.0, 23.0, 49.0, 74.0, 228.0], [62.0, 37.0, 22.0, 16.0, 7.0, 10.0, 7.0, 5.0, 9.0, 6.0, 7.0, 1.0, 5.0, 8.0, 4.0, 8.0, 7.0, 9.0, 3.0, 6.0, 2.0, 4.0, 2.0, 6.0, 1.0, 2.0, 3.0, 3.0, 9.0, 4.0, 3.0, 3.0, 4.0, 6.0, 6.0, 4.0, 8.0, 15.0, 9.0, 6.0, 11.0, 9.0, 13.0, 7.0, 14.0, 16.0, 35.0, 41.0, 141.0], [64.0, 29.0, 25.0, 14.0, 11.0, 9.0, 3.0, 5.0, 1.0, 3.0, 8.0, 5.0, 2.0, 2.0, 5.0, 3.0, 7.0, 4.0, 4.0, 9.0, 2.0, 3.0, 0.0, 2.0, 3.0, 5.0, 3.0, 6.0, 3.0, 6.0, 1.0, 2.0, 2.0, 2.0, 6.0, 3.0, 5.0, 4.0, 2.0, 8.0, 7.0, 13.0, 11.0, 10.0, 19.0, 14.0, 14.0, 35.0, 80.0], [57.0, 31.0, 19.0, 15.0, 13.0, 4.0, 6.0, 9.0, 9.0, 5.0, 3.0, 4.0, 3.0, 4.0, 4.0, 5.0, 3.0, 3.0, 2.0, 0.0, 5.0, 4.0, 1.0, 2.0, 4.0, 4.0, 2.0, 0.0, 2.0, 2.0, 2.0, 4.0, 0.0, 3.0, 1.0, 7.0, 5.0, 7.0, 4.0, 2.0, 5.0, 4.0, 8.0, 9.0, 6.0, 11.0, 13.0, 22.0, 65.0], [60.0, 29.0, 11.0, 17.0, 9.0, 6.0, 5.0, 3.0, 5.0, 2.0, 4.0, 6.0, 4.0, 5.0, 4.0, 5.0, 6.0, 2.0, 3.0, 4.0, 3.0, 1.0, 5.0, 1.0, 3.0, 3.0, 1.0, 0.0, 2.0, 0.0, 2.0, 3.0, 1.0, 2.0, 4.0, 3.0, 3.0, 1.0, 2.0, 1.0, 5.0, 4.0, 4.0, 4.0, 6.0, 8.0, 11.0, 15.0, 45.0], [64.0, 27.0, 18.0, 15.0, 5.0, 10.0, 7.0, 3.0, 1.0, 3.0, 2.0, 4.0, 6.0, 0.0, 3.0, 4.0, 4.0, 4.0, 2.0, 3.0, 3.0, 3.0, 4.0, 1.0, 2.0, 5.0, 1.0, 1.0, 1.0, 1.0, 1.0, 1.0, 1.0, 1.0, 3.0, 2.0, 2.0, 2.0, 1.0, 2.0, 3.0, 5.0, 0.0, 0.0, 9.0, 2.0, 17.0, 12.0, 28.0], [64.0, 23.0, 16.0, 22.0, 10.0, 3.0, 4.0, 7.0, 3.0, 3.0, 5.0, 1.0, 1.0, 3.0, 2.0, 2.0, 5.0, 3.0, 3.0, 2.0, 4.0, 4.0, 1.0, 1.0, 2.0, 1.0, 1.0, 2.0, 1.0, 2.0, 1.0, 3.0, 3.0, 2.0, 0.0, 2.0, 1.0, 2.0, 1.0, 0.0, 3.0, 1.0, 7.0, 1.0, 2.0, 2.0, 8.0, 10.0, 21.0], [59.0, 30.0, 16.0, 13.0, 8.0, 7.0, 3.0, 4.0, 1.0, 5.0, 4.0, 3.0, 3.0, 1.0, 2.0, 4.0, 3.0, 2.0, 4.0, 3.0, 3.0, 1.0, 2.0, 2.0, 2.0, 1.0, 2.0, 2.0, 2.0, 2.0, 1.0, 2.0, 1.0, 0.0, 2.0, 1.0, 3.0, 1.0, 2.0, 1.0, 2.0, 2.0, 3.0, 1.0, 5.0, 1.0, 4.0, 4.0, 11.0], [61.0, 33.0, 17.0, 13.0, 4.0, 5.0, 3.0, 6.0, 5.0, 3.0, 2.0, 2.0, 6.0, 1.0, 2.0, 4.0, 3.0, 4.0, 1.0, 4.0, 2.0, 0.0, 3.0, 0.0, 6.0, 4.0, 0.0, 2.0, 3.0, 0.0, 3.0, 0.0, 0.0, 1.0, 1.0, 1.0, 3.0, 1.0, 0.0, 2.0, 1.0, 0.0, 4.0, 2.0, 0.0, 4.0, 4.0, 3.0, 9.0], [49.0, 28.0, 19.0, 14.0, 8.0, 4.0, 3.0, 4.0, 2.0, 4.0, 3.0, 3.0, 2.0, 3.0, 2.0, 2.0, 7.0, 2.0, 1.0, 4.0, 1.0, 2.0, 1.0, 1.0, 4.0, 1.0, 2.0, 1.0, 1.0, 1.0, 1.0, 2.0, 2.0, 0.0, 0.0, 1.0, 0.0, 1.0, 2.0, 2.0, 2.0, 1.0, 2.0, 0.0, 3.0, 1.0, 1.0, 4.0, 5.0], [63.0, 29.0, 17.0, 13.0, 5.0, 8.0, 6.0, 3.0, 2.0, 1.0, 1.0, 6.0, 2.0, 5.0, 2.0, 4.0, 4.0, 2.0, 1.0, 3.0, 3.0, 3.0, 2.0, 4.0, 1.0, 0.0, 2.0, 0.0, 0.0, 0.0, 0.0, 0.0, 0.0, 2.0, 1.0, 0.0, 1.0, 0.0, 0.0, 0.0, 0.0, 0.0, 2.0, 3.0, 2.0, 1.0, 0.0, 2.0, 9.0], [65.0, 24.0, 25.0, 6.0, 5.0, 5.0, 7.0, 4.0, 2.0, 2.0, 3.0, 6.0, 4.0, 7.0, 1.0, 1.0, 2.0, 2.0, 3.0, 5.0, 1.0, 0.0, 0.0, 1.0, 3.0, 4.0, 0.0, 1.0, 2.0, 0.0, 3.0, 0.0, 1.0, 1.0, 0.0, 1.0, 2.0, 1.0, 1.0, 1.0, 0.0, 2.0, 1.0, 1.0, 1.0, 1.0, 1.0, 1.0, 7.0], [65.0, 27.0, 11.0, 14.0, 9.0, 6.0, 4.0, 4.0, 5.0, 2.0, 4.0, 2.0, 3.0, 6.0, 3.0, 6.0, 3.0, 2.0, 5.0, 2.0, 1.0, 1.0, 1.0, 0.0, 1.0, 2.0, 1.0, 0.0, 1.0, 0.0, 2.0, 1.0, 1.0, 0.0, 0.0, 1.0, 2.0, 1.0, 0.0, 1.0, 1.0, 0.0, 0.0, 2.0, 1.0, 1.0, 1.0, 0.0, 4.0], [58.0, 24.0, 21.0, 8.0, 7.0, 5.0, 4.0, 5.0, 2.0, 4.0, 2.0, 1.0, 3.0, 0.0, 6.0, 4.0, 2.0, 3.0, 1.0, 3.0, 3.0, 2.0, 2.0, 1.0, 3.0, 0.0, 3.0, 3.0, 0.0, 0.0, 1.0, 1.0, 0.0, 2.0, 0.0, 1.0, 2.0, 0.0, 1.0, 0.0, 0.0, 0.0, 2.0, 0.0, 1.0, 2.0, 1.0, 0.0, 2.0], [62.0, 32.0, 26.0, 13.0, 4.0, 4.0, 4.0, 3.0, 2.0, 4.0, 5.0, 2.0, 2.0, 1.0, 1.0, 2.0, 4.0, 3.0, 2.0, 2.0, 1.0, 3.0, 1.0, 3.0, 3.0, 0.0, 2.0, 2.0, 0.0, 1.0, 1.0, 0.0, 0.0, 1.0, 0.0, 1.0, 0.0, 1.0, 2.0, 0.0, 3.0, 0.0, 3.0, 1.0, 1.0, 1.0, 1.0, 0.0, 0.0], [75.0, 19.0, 17.0, 8.0, 11.0, 3.0, 6.0, 2.0, 5.0, 4.0, 2.0, 2.0, 3.0, 4.0, 4.0, 5.0, 3.0, 1.0, 3.0, 2.0, 1.0, 2.0, 0.0, 2.0, 1.0, 1.0, 2.0, 2.0, 0.0, 2.0, 0.0, 0.0, 2.0, 0.0, 0.0, 2.0, 2.0, 0.0, 0.0, 0.0, 0.0, 2.0, 2.0, 0.0, 0.0, 2.0, 1.0, 1.0, 3.0], [66.0, 19.0, 18.0, 17.0, 5.0, 1.0, 1.0, 4.0, 7.0, 7.0, 4.0, 2.0, 8.0, 5.0, 5.0, 2.0, 3.0, 2.0, 1.0, 3.0, 1.0, 1.0, 0.0, 2.0, 1.0, 3.0, 1.0, 0.0, 0.0, 0.0, 2.0, 0.0, 1.0, 1.0, 0.0, 0.0, 0.0, 1.0, 2.0, 1.0, 0.0, 1.0, 1.0, 0.0, 1.0, 1.0, 0.0, 0.0, 2.0], [79.0, 21.0, 13.0, 11.0, 11.0, 5.0, 4.0, 7.0, 2.0, 3.0, 4.0, 4.0, 5.0, 2.0, 3.0, 5.0, 3.0, 2.0, 5.0, 0.0, 0.0, 0.0, 0.0, 0.0, 1.0, 2.0, 0.0, 0.0, 1.0, 1.0, 1.0, 2.0, 1.0, 0.0, 0.0, 0.0, 0.0, 0.0, 2.0, 0.0, 1.0, 0.0, 0.0, 3.0, 1.0, 2.0, 1.0, 2.0, 3.0], [56.0, 31.0, 23.0, 10.0, 4.0, 6.0, 8.0, 4.0, 2.0, 4.0, 3.0, 5.0, 3.0, 3.0, 2.0, 0.0, 3.0, 3.0, 3.0, 2.0, 4.0, 0.0, 3.0, 0.0, 0.0, 2.0, 0.0, 0.0, 0.0, 1.0, 2.0, 0.0, 2.0, 0.0, 1.0, 0.0, 0.0, 5.0, 0.0, 2.0, 0.0, 0.0, 0.0, 1.0, 2.0, 1.0, 1.0, 0.0, 1.0], [53.0, 23.0, 26.0, 8.0, 6.0, 9.0, 5.0, 2.0, 4.0, 6.0, 2.0, 0.0, 4.0, 0.0, 3.0, 5.0, 1.0, 3.0, 2.0, 4.0, 2.0, 2.0, 1.0, 3.0, 0.0, 2.0, 2.0, 2.0, 2.0, 0.0, 1.0, 0.0, 2.0, 0.0, 0.0, 1.0, 0.0, 1.0, 0.0, 0.0, 0.0, 0.0, 1.0, 1.0, 1.0, 1.0, 0.0, 0.0, 2.0], [74.0, 31.0, 19.0, 8.0, 7.0, 8.0, 3.0, 4.0, 4.0, 3.0, 6.0, 3.0, 6.0, 1.0, 6.0, 4.0, 3.0, 0.0, 1.0, 2.0, 1.0, 1.0, 2.0, 0.0, 0.0, 0.0, 0.0, 3.0, 1.0, 1.0, 0.0, 1.0, 1.0, 0.0, 0.0, 1.0, 2.0, 3.0, 0.0, 3.0, 1.0, 0.0, 0.0, 0.0, 1.0, 1.0, 0.0, 0.0, 0.0], [52.0, 23.0, 24.0, 10.0, 9.0, 6.0, 3.0, 5.0, 3.0, 5.0, 3.0, 4.0, 4.0, 4.0, 2.0, 4.0, 3.0, 0.0, 3.0, 3.0, 1.0, 3.0, 1.0, 1.0, 2.0, 1.0, 1.0, 2.0, 2.0, 0.0, 2.0, 0.0, 3.0, 1.0, 1.0, 0.0, 0.0, 1.0, 0.0, 0.0, 2.0, 0.0, 0.0, 0.0, 1.0, 1.0, 2.0, 1.0, 1.0], [55.0, 24.0, 20.0, 14.0, 5.0, 6.0, 3.0, 3.0, 2.0, 1.0, 2.0, 7.0, 5.0, 4.0, 2.0, 0.0, 3.0, 3.0, 2.0, 3.0, 2.0, 2.0, 4.0, 4.0, 0.0, 3.0, 1.0, 1.0, 1.0, 1.0, 1.0, 0.0, 0.0, 0.0, 0.0, 0.0, 3.0, 1.0, 1.0, 0.0, 0.0, 0.0, 1.0, 1.0, 1.0, 2.0, 0.0, 0.0, 0.0], [50.0, 27.0, 17.0, 20.0, 7.0, 7.0, 7.0, 2.0, 4.0, 1.0, 3.0, 2.0, 2.0, 4.0, 6.0, 3.0, 2.0, 4.0, 1.0, 1.0, 2.0, 1.0, 3.0, 0.0, 1.0, 1.0, 2.0, 0.0, 1.0, 3.0, 0.0, 1.0, 1.0, 1.0, 1.0, 1.0, 0.0, 0.0, 0.0, 1.0, 1.0, 0.0, 2.0, 1.0, 1.0, 1.0, 2.0, 0.0, 1.0], [69.0, 21.0, 15.0, 21.0, 9.0, 4.0, 3.0, 3.0, 4.0, 4.0, 1.0, 6.0, 6.0, 5.0, 1.0, 3.0, 4.0, 4.0, 1.0, 1.0, 3.0, 0.0, 2.0, 1.0, 1.0, 1.0, 0.0, 1.0, 0.0, 1.0, 0.0, 0.0, 0.0, 0.0, 1.0, 1.0, 0.0, 2.0, 0.0, 0.0, 1.0, 0.0, 0.0, 0.0, 1.0, 2.0, 1.0, 1.0, 0.0], [65.0, 25.0, 20.0, 18.0, 3.0, 5.0, 1.0, 10.0, 6.0, 2.0, 4.0, 4.0, 1.0, 0.0, 2.0, 3.0, 4.0, 2.0, 5.0, 3.0, 1.0, 1.0, 1.0, 2.0, 1.0, 3.0, 0.0, 0.0, 1.0, 1.0, 3.0, 0.0, 0.0, 0.0, 1.0, 1.0, 0.0, 1.0, 0.0, 0.0, 1.0, 0.0, 1.0, 2.0, 0.0, 3.0, 1.0, 0.0, 1.0], [71.0, 23.0, 23.0, 12.0, 9.0, 5.0, 3.0, 3.0, 5.0, 3.0, 4.0, 3.0, 3.0, 4.0, 1.0, 6.0, 3.0, 5.0, 4.0, 4.0, 0.0, 1.0, 0.0, 0.0, 0.0, 1.0, 1.0, 2.0, 0.0, 0.0, 0.0, 1.0, 0.0, 2.0, 0.0, 1.0, 1.0, 1.0, 0.0, 1.0, 1.0, 1.0, 2.0, 1.0, 1.0, 1.0, 0.0, 1.0, 0.0], [72.0, 20.0, 15.0, 12.0, 13.0, 8.0, 5.0, 4.0, 4.0, 3.0, 2.0, 2.0, 3.0, 5.0, 3.0, 3.0, 1.0, 4.0, 3.0, 2.0, 1.0, 1.0, 5.0, 2.0, 1.0, 1.0, 0.0, 1.0, 0.0, 0.0, 0.0, 1.0, 1.0, 2.0, 1.0, 1.0, 2.0, 0.0, 1.0, 1.0, 0.0, 1.0, 2.0, 0.0, 0.0, 1.0, 0.0, 0.0, 0.0], [61.0, 28.0, 14.0, 10.0, 9.0, 10.0, 4.0, 5.0, 1.0, 4.0, 8.0, 2.0, 5.0, 4.0, 3.0, 2.0, 3.0, 1.0, 0.0, 2.0, 2.0, 2.0, 3.0, 2.0, 1.0, 2.0, 0.0, 0.0, 0.0, 1.0, 0.0, 0.0, 0.0, 0.0, 1.0, 0.0, 0.0, 1.0, 1.0, 1.0, 0.0, 0.0, 0.0, 0.0, 2.0, 0.0, 1.0, 4.0, 0.0], [62.0, 24.0, 21.0, 10.0, 6.0, 6.0, 3.0, 6.0, 1.0, 1.0, 5.0, 5.0, 2.0, 6.0, 4.0, 2.0, 4.0, 4.0, 2.0, 3.0, 5.0, 1.0, 2.0, 2.0, 0.0, 0.0, 2.0, 0.0, 1.0, 0.0, 0.0, 1.0, 1.0, 0.0, 0.0, 0.0, 0.0, 0.0, 0.0, 1.0, 1.0, 0.0, 3.0, 0.0, 2.0, 2.0, 0.0, 1.0, 0.0], [54.0, 40.0, 14.0, 10.0, 10.0, 3.0, 6.0, 4.0, 1.0, 5.0, 3.0, 2.0, 0.0, 3.0, 6.0, 0.0, 2.0, 1.0, 2.0, 6.0, 5.0, 1.0, 6.0, 1.0, 1.0, 1.0, 0.0, 1.0, 0.0, 0.0, 1.0, 1.0, 2.0, 0.0, 0.0, 0.0, 0.0, 0.0, 0.0, 0.0, 1.0, 1.0, 2.0, 2.0, 2.0, 2.0, 1.0, 0.0, 0.0], [58.0, 36.0, 13.0, 12.0, 7.0, 4.0, 6.0, 5.0, 2.0, 2.0, 4.0, 5.0, 1.0, 3.0, 2.0, 0.0, 3.0, 4.0, 3.0, 2.0, 4.0, 0.0, 1.0, 3.0, 2.0, 2.0, 2.0, 3.0, 1.0, 0.0, 1.0, 2.0, 0.0, 0.0, 0.0, 0.0, 2.0, 1.0, 1.0, 1.0, 2.0, 1.0, 0.0, 0.0, 0.0, 1.0, 1.0, 0.0, 1.0], [64.0, 36.0, 19.0, 9.0, 3.0, 6.0, 4.0, 4.0, 0.0, 6.0, 2.0, 4.0, 5.0, 3.0, 1.0, 2.0, 2.0, 2.0, 1.0, 3.0, 4.0, 4.0, 2.0, 1.0, 1.0, 2.0, 1.0, 1.0, 1.0, 0.0, 1.0, 0.0, 0.0, 1.0, 2.0, 1.0, 1.0, 1.0, 2.0, 0.0, 1.0, 0.0, 2.0, 0.0, 1.0, 0.0, 1.0, 0.0, 1.0], [64.0, 28.0, 15.0, 10.0, 7.0, 9.0, 5.0, 5.0, 2.0, 4.0, 3.0, 4.0, 3.0, 3.0, 2.0, 1.0, 7.0, 0.0, 3.0, 3.0, 1.0, 0.0, 4.0, 1.0, 1.0, 0.0, 3.0, 1.0, 0.0, 2.0, 0.0, 1.0, 0.0, 1.0, 0.0, 0.0, 1.0, 0.0, 3.0, 3.0, 0.0, 0.0, 0.0, 0.0, 1.0, 2.0, 2.0, 1.0, 3.0], [56.0, 29.0, 19.0, 7.0, 7.0, 9.0, 6.0, 1.0, 5.0, 3.0, 4.0, 2.0, 4.0, 3.0, 1.0, 2.0, 4.0, 1.0, 8.0, 1.0, 1.0, 1.0, 2.0, 2.0, 1.0, 0.0, 2.0, 0.0, 2.0, 1.0, 0.0, 0.0, 1.0, 1.0, 0.0, 1.0, 1.0, 2.0, 1.0, 1.0, 1.0, 1.0, 2.0, 0.0, 1.0, 0.0, 0.0, 1.0, 2.0]],
    "Name": "sCurve-0",
    "Overflow": 2077017.0,
    "Type": "Histo2d",
    "Underflow": 0.0,
    "x": {
        "AxisTitle": "Vcal",
        "Bins": 51,
        "High": 302.5,
        "Low": 47.5
    },
    "y": {
        "AxisTitle": "Occupancy",
        "Bins": 49,
        "High": 49.5,
        "Low": 0.5
    },
    "z": {
        "AxisTitle": "Number of pixels"
    }
}