{
    "Data": [0.0, 0.0, 0.0, 0.0, 0.0, 0.0, 0.0, 0.0, 1.0, 0.0, 0.0, 0.0, 0.0, 3.0, 7.0, 1.0, 2.0, 43.0, 341.0, 136.0, 24.0, 291.0, 2206.0, 1618.0, 246.0, 712.0, 2613.0, 2071.0, 495.0, 1075.0, 2212.0, 1808.0, 639.0, 739.0, 963.0, 694.0, 436.0, 722.0, 1216.0, 1106.0, 828.0, 1090.0, 1972.0, 3832.0, 2470.0, 1833.0, 2221.0, 3717.0, 3850.0, 3020.0, 2530.0, 2159.0, 3135.0, 2260.0, 1682.0, 1355.0, 1382.0, 1542.0, 1365.0, 1194.0, 942.0, 1120.0, 835.0, 632.0, 512.0, 480.0, 543.0, 418.0, 425.0, 331.0, 417.0, 338.0, 280.0, 185.0, 173.0, 227.0, 178.0, 164.0, 137.0, 124.0, 146.0, 120.0, 90.0, 75.0, 83.0, 62.0, 63.0, 57.0, 40.0, 46.0, 45.0, 45.0, 37.0, 25.0, 33.0, 32.0, 29.0, 24.0, 28.0, 18.0, 21.0, 22.0, 16.0, 21.0, 13.0, 17.0, 13.0, 24.0, 23.0, 17.0, 14.0, 10.0, 9.0, 13.0, 17.0, 12.0, 11.0, 8.0, 10.0, 12.0, 6.0, 6.0, 9.0, 7.0, 2.0, 4.0, 7.0, 1.0, 11.0, 4.0, 4.0, 7.0, 2.0, 5.0, 3.0, 4.0, 1.0, 2.0, 4.0, 7.0, 3.0, 1.0, 1.0, 3.0, 0.0, 1.0, 2.0, 2.0, 3.0, 2.0, 1.0, 0.0, 2.0, 1.0, 3.0, 3.0, 0.0, 0.0, 1.0, 1.0, 1.0, 2.0, 1.0, 1.0, 0.0, 1.0, 0.0, 1.0, 0.0, 0.0, 2.0, 0.0, 1.0, 4.0, 0.0, 1.0, 0.0, 1.0, 0.0, 1.0, 0.0, 1.0, 0.0, 0.0, 0.0, 0.0, 0.0, 0.0, 0.0, 0.0, 0.0, 1.0, 0.0, 0.0, 0.0, 0.0, 0.0, 0.0, 1.0, 0.0, 0.0],
    "Name": "TimePerFitDist-0",
    "Overflow": 91.0,
    "Type": "Histo1d",
    "Underflow": 0.0,
    "x": {
        "AxisTitle": "Fit Time [us]",
        "Bins": 201,
        "High": 401.0,
        "Low": -1.0
    },
    "y": {
        "AxisTitle": "Number of Pixels"
    },
    "z": {
        "AxisTitle": "z"
    }
}