{
    "Data": [[3751.0, 2017.0, 1294.0, 978.0, 716.0, 595.0, 456.0, 443.0, 350.0, 289.0, 256.0, 233.0, 206.0, 165.0, 173.0, 133.0, 119.0, 115.0, 129.0, 88.0, 87.0, 99.0, 69.0, 64.0, 74.0, 78.0, 53.0, 50.0, 50.0, 53.0, 39.0, 48.0, 45.0, 37.0, 26.0, 30.0, 32.0, 25.0, 28.0, 39.0, 18.0, 26.0, 25.0, 19.0, 30.0, 19.0, 22.0, 23.0, 22.0], [3617.0, 2096.0, 1488.0, 1142.0, 932.0, 809.0, 690.0, 583.0, 544.0, 461.0, 448.0, 400.0, 311.0, 304.0, 251.0, 233.0, 246.0, 199.0, 199.0, 213.0, 169.0, 159.0, 159.0, 149.0, 135.0, 115.0, 114.0, 92.0, 84.0, 92.0, 76.0, 64.0, 93.0, 73.0, 79.0, 73.0, 64.0, 71.0, 54.0, 49.0, 43.0, 41.0, 38.0, 45.0, 30.0, 43.0, 39.0, 39.0, 38.0], [3194.0, 1910.0, 1423.0, 1212.0, 1029.0, 930.0, 799.0, 700.0, 670.0, 635.0, 523.0, 484.0, 467.0, 455.0, 433.0, 410.0, 375.0, 370.0, 307.0, 308.0, 303.0, 249.0, 244.0, 263.0, 239.0, 211.0, 192.0, 222.0, 180.0, 187.0, 184.0, 132.0, 155.0, 152.0, 128.0, 112.0, 121.0, 123.0, 102.0, 111.0, 109.0, 94.0, 90.0, 91.0, 91.0, 86.0, 85.0, 67.0, 69.0], [2541.0, 1620.0, 1204.0, 1074.0, 912.0, 828.0, 800.0, 742.0, 746.0, 592.0, 606.0, 580.0, 545.0, 482.0, 481.0, 461.0, 481.0, 497.0, 438.0, 406.0, 422.0, 409.0, 361.0, 376.0, 324.0, 360.0, 310.0, 322.0, 312.0, 314.0, 305.0, 263.0, 262.0, 251.0, 229.0, 237.0, 258.0, 235.0, 215.0, 226.0, 196.0, 219.0, 193.0, 197.0, 192.0, 162.0, 172.0, 184.0, 165.0], [2647.0, 1283.0, 1005.0, 766.0, 721.0, 698.0, 618.0, 609.0, 584.0, 565.0, 569.0, 556.0, 529.0, 534.0, 524.0, 508.0, 483.0, 505.0, 475.0, 473.0, 443.0, 456.0, 451.0, 421.0, 440.0, 439.0, 430.0, 405.0, 452.0, 408.0, 431.0, 384.0, 385.0, 429.0, 426.0, 403.0, 371.0, 389.0, 390.0, 412.0, 364.0, 365.0, 367.0, 353.0, 404.0, 352.0, 400.0, 405.0, 375.0], [4169.0, 1894.0, 1197.0, 797.0, 685.0, 587.0, 538.0, 514.0, 546.0, 447.0, 415.0, 399.0, 471.0, 449.0, 388.0, 400.0, 438.0, 438.0, 446.0, 460.0, 436.0, 423.0, 450.0, 480.0, 429.0, 483.0, 430.0, 445.0, 463.0, 469.0, 491.0, 505.0, 490.0, 487.0, 525.0, 488.0, 509.0, 489.0, 579.0, 533.0, 534.0, 554.0, 623.0, 645.0, 599.0, 655.0, 698.0, 737.0, 880.0], [5244.0, 3182.0, 2283.0, 1713.0, 1308.0, 1154.0, 920.0, 789.0, 715.0, 670.0, 572.0, 528.0, 484.0, 465.0, 425.0, 420.0, 407.0, 407.0, 395.0, 398.0, 362.0, 391.0, 396.0, 414.0, 414.0, 415.0, 445.0, 434.0, 411.0, 449.0, 497.0, 452.0, 516.0, 502.0, 557.0, 513.0, 574.0, 600.0, 605.0, 665.0, 688.0, 704.0, 803.0, 767.0, 908.0, 943.0, 1085.0, 1213.0, 1619.0], [2240.0, 1793.0, 1572.0, 1475.0, 1456.0, 1287.0, 1236.0, 1258.0, 1142.0, 1151.0, 1047.0, 995.0, 947.0, 902.0, 904.0, 837.0, 746.0, 712.0, 759.0, 693.0, 666.0, 676.0, 610.0, 595.0, 602.0, 631.0, 515.0, 554.0, 527.0, 540.0, 526.0, 545.0, 558.0, 546.0, 597.0, 584.0, 569.0, 599.0, 667.0, 692.0, 723.0, 786.0, 821.0, 984.0, 1098.0, 1185.0, 1404.0, 1770.0, 2445.0], [841.0, 427.0, 382.0, 314.0, 326.0, 328.0, 423.0, 392.0, 460.0, 474.0, 433.0, 523.0, 555.0, 532.0, 544.0, 607.0, 628.0, 642.0, 684.0, 739.0, 721.0, 749.0, 816.0, 806.0, 824.0, 848.0, 842.0, 875.0, 868.0, 891.0, 900.0, 908.0, 959.0, 971.0, 954.0, 966.0, 967.0, 1012.0, 1071.0, 1033.0, 1075.0, 1068.0, 1253.0, 1313.0, 1407.0, 1637.0, 1832.0, 2356.0, 3335.0], [793.0, 259.0, 169.0, 118.0, 95.0, 88.0, 96.0, 93.0, 68.0, 68.0, 75.0, 90.0, 95.0, 107.0, 129.0, 132.0, 141.0, 147.0, 166.0, 168.0, 200.0, 195.0, 240.0, 235.0, 280.0, 298.0, 339.0, 344.0, 418.0, 415.0, 488.0, 526.0, 563.0, 618.0, 696.0, 787.0, 824.0, 888.0, 1032.0, 1169.0, 1264.0, 1407.0, 1639.0, 1783.0, 2125.0, 2432.0, 3050.0, 3818.0, 5519.0], [854.0, 288.0, 162.0, 91.0, 76.0, 51.0, 48.0, 38.0, 32.0, 34.0, 25.0, 39.0, 37.0, 30.0, 26.0, 36.0, 32.0, 38.0, 36.0, 35.0, 50.0, 57.0, 51.0, 59.0, 45.0, 59.0, 61.0, 76.0, 87.0, 90.0, 114.0, 115.0, 145.0, 160.0, 160.0, 195.0, 252.0, 272.0, 349.0, 382.0, 476.0, 566.0, 705.0, 935.0, 1237.0, 1552.0, 2355.0, 3644.0, 7028.0], [1039.0, 282.0, 159.0, 107.0, 61.0, 60.0, 44.0, 27.0, 29.0, 27.0, 22.0, 19.0, 26.0, 32.0, 29.0, 23.0, 19.0, 18.0, 22.0, 32.0, 25.0, 21.0, 21.0, 22.0, 29.0, 26.0, 25.0, 37.0, 34.0, 34.0, 45.0, 39.0, 55.0, 48.0, 48.0, 58.0, 70.0, 62.0, 99.0, 116.0, 154.0, 152.0, 232.0, 270.0, 409.0, 600.0, 987.0, 1689.0, 4453.0], [1377.0, 350.0, 187.0, 97.0, 72.0, 51.0, 52.0, 34.0, 27.0, 24.0, 18.0, 30.0, 15.0, 17.0, 16.0, 13.0, 18.0, 23.0, 16.0, 19.0, 18.0, 15.0, 16.0, 20.0, 24.0, 15.0, 14.0, 26.0, 10.0, 27.0, 33.0, 20.0, 20.0, 32.0, 21.0, 36.0, 29.0, 35.0, 45.0, 41.0, 55.0, 75.0, 82.0, 89.0, 142.0, 212.0, 339.0, 708.0, 2057.0], [1932.0, 503.0, 226.0, 118.0, 64.0, 47.0, 38.0, 30.0, 17.0, 24.0, 22.0, 23.0, 20.0, 15.0, 15.0, 10.0, 29.0, 16.0, 18.0, 16.0, 13.0, 16.0, 16.0, 17.0, 20.0, 20.0, 8.0, 20.0, 16.0, 12.0, 14.0, 21.0, 17.0, 11.0, 19.0, 20.0, 20.0, 24.0, 29.0, 14.0, 31.0, 35.0, 37.0, 54.0, 66.0, 76.0, 154.0, 289.0, 1000.0], [2923.0, 814.0, 362.0, 163.0, 98.0, 56.0, 33.0, 30.0, 25.0, 21.0, 21.0, 13.0, 21.0, 17.0, 9.0, 15.0, 11.0, 12.0, 12.0, 14.0, 17.0, 15.0, 11.0, 13.0, 20.0, 17.0, 11.0, 11.0, 13.0, 8.0, 13.0, 17.0, 14.0, 22.0, 13.0, 14.0, 19.0, 12.0, 13.0, 20.0, 24.0, 22.0, 17.0, 24.0, 30.0, 66.0, 64.0, 149.0, 470.0], [4101.0, 1412.0, 603.0, 271.0, 160.0, 85.0, 59.0, 27.0, 40.0, 24.0, 25.0, 14.0, 17.0, 13.0, 16.0, 16.0, 16.0, 15.0, 11.0, 18.0, 7.0, 14.0, 17.0, 8.0, 10.0, 12.0, 10.0, 9.0, 16.0, 11.0, 6.0, 11.0, 13.0, 12.0, 10.0, 10.0, 13.0, 17.0, 12.0, 12.0, 23.0, 12.0, 14.0, 21.0, 34.0, 35.0, 55.0, 81.0, 224.0], [5284.0, 2251.0, 1150.0, 589.0, 309.0, 197.0, 116.0, 64.0, 45.0, 26.0, 23.0, 23.0, 14.0, 24.0, 13.0, 16.0, 12.0, 14.0, 10.0, 14.0, 14.0, 8.0, 12.0, 10.0, 13.0, 11.0, 14.0, 9.0, 8.0, 4.0, 5.0, 8.0, 14.0, 13.0, 7.0, 12.0, 13.0, 10.0, 17.0, 15.0, 11.0, 18.0, 15.0, 17.0, 19.0, 22.0, 26.0, 50.0, 135.0], [5832.0, 3184.0, 1854.0, 1143.0, 695.0, 434.0, 249.0, 179.0, 116.0, 84.0, 69.0, 32.0, 27.0, 23.0, 21.0, 10.0, 19.0, 15.0, 15.0, 8.0, 16.0, 10.0, 8.0, 10.0, 13.0, 13.0, 11.0, 11.0, 9.0, 13.0, 10.0, 15.0, 9.0, 4.0, 5.0, 10.0, 8.0, 9.0, 8.0, 16.0, 7.0, 13.0, 15.0, 21.0, 15.0, 11.0, 27.0, 33.0, 74.0], [5641.0, 3664.0, 2560.0, 1788.0, 1223.0, 854.0, 606.0, 412.0, 311.0, 190.0, 150.0, 132.0, 80.0, 52.0, 52.0, 31.0, 23.0, 17.0, 24.0, 16.0, 18.0, 13.0, 13.0, 9.0, 14.0, 15.0, 10.0, 5.0, 5.0, 4.0, 8.0, 9.0, 13.0, 6.0, 13.0, 14.0, 3.0, 8.0, 6.0, 3.0, 7.0, 13.0, 9.0, 12.0, 12.0, 20.0, 20.0, 26.0, 69.0], [4634.0, 3456.0, 2869.0, 2333.0, 1766.0, 1407.0, 1021.0, 829.0, 646.0, 469.0, 362.0, 288.0, 226.0, 180.0, 131.0, 105.0, 74.0, 68.0, 52.0, 39.0, 35.0, 21.0, 24.0, 17.0, 16.0, 12.0, 12.0, 12.0, 9.0, 13.0, 7.0, 13.0, 10.0, 8.0, 8.0, 9.0, 7.0, 3.0, 8.0, 8.0, 8.0, 9.0, 11.0, 13.0, 11.0, 16.0, 18.0, 27.0, 33.0], [3257.0, 2856.0, 2649.0, 2334.0, 1998.0, 1719.0, 1476.0, 1260.0, 1023.0, 861.0, 769.0, 575.0, 521.0, 423.0, 367.0, 308.0, 204.0, 173.0, 145.0, 121.0, 79.0, 89.0, 65.0, 48.0, 44.0, 42.0, 26.0, 31.0, 22.0, 19.0, 11.0, 10.0, 10.0, 7.0, 13.0, 12.0, 7.0, 13.0, 8.0, 8.0, 5.0, 2.0, 14.0, 13.0, 7.0, 11.0, 8.0, 22.0, 28.0], [2159.0, 1956.0, 1975.0, 1996.0, 1786.0, 1720.0, 1574.0, 1472.0, 1343.0, 1216.0, 1081.0, 996.0, 804.0, 760.0, 664.0, 538.0, 433.0, 389.0, 336.0, 304.0, 214.0, 215.0, 178.0, 124.0, 106.0, 82.0, 87.0, 61.0, 63.0, 37.0, 42.0, 34.0, 21.0, 27.0, 25.0, 17.0, 8.0, 7.0, 13.0, 12.0, 8.0, 6.0, 6.0, 8.0, 6.0, 12.0, 10.0, 14.0, 24.0], [1414.0, 1170.0, 1288.0, 1363.0, 1367.0, 1475.0, 1430.0, 1343.0, 1397.0, 1328.0, 1201.0, 1148.0, 1033.0, 1029.0, 919.0, 830.0, 743.0, 672.0, 586.0, 525.0, 471.0, 423.0, 381.0, 325.0, 268.0, 253.0, 215.0, 177.0, 162.0, 144.0, 89.0, 94.0, 83.0, 56.0, 41.0, 43.0, 43.0, 47.0, 26.0, 18.0, 20.0, 6.0, 11.0, 11.0, 14.0, 8.0, 10.0, 7.0, 20.0], [990.0, 717.0, 679.0, 744.0, 868.0, 959.0, 991.0, 1032.0, 1066.0, 1083.0, 1155.0, 1144.0, 1102.0, 1034.0, 1111.0, 998.0, 929.0, 938.0, 846.0, 815.0, 744.0, 681.0, 663.0, 544.0, 583.0, 477.0, 423.0, 384.0, 359.0, 332.0, 285.0, 215.0, 200.0, 158.0, 159.0, 129.0, 102.0, 87.0, 65.0, 59.0, 47.0, 36.0, 30.0, 19.0, 26.0, 12.0, 11.0, 18.0, 18.0], [771.0, 423.0, 353.0, 386.0, 419.0, 509.0, 585.0, 639.0, 663.0, 815.0, 813.0, 865.0, 934.0, 923.0, 988.0, 937.0, 920.0, 983.0, 950.0, 854.0, 941.0, 897.0, 846.0, 824.0, 805.0, 735.0, 699.0, 651.0, 600.0, 565.0, 535.0, 465.0, 392.0, 377.0, 319.0, 321.0, 274.0, 203.0, 193.0, 163.0, 133.0, 114.0, 101.0, 79.0, 56.0, 56.0, 35.0, 35.0, 24.0], [682.0, 305.0, 244.0, 214.0, 236.0, 256.0, 285.0, 340.0, 375.0, 424.0, 477.0, 515.0, 560.0, 642.0, 670.0, 777.0, 796.0, 801.0, 869.0, 919.0, 900.0, 862.0, 871.0, 855.0, 864.0, 875.0, 899.0, 837.0, 802.0, 772.0, 804.0, 730.0, 654.0, 641.0, 594.0, 552.0, 511.0, 483.0, 411.0, 361.0, 311.0, 243.0, 245.0, 203.0, 170.0, 137.0, 104.0, 72.0, 49.0], [676.0, 229.0, 153.0, 124.0, 100.0, 124.0, 134.0, 138.0, 178.0, 209.0, 201.0, 260.0, 303.0, 370.0, 379.0, 441.0, 497.0, 487.0, 560.0, 652.0, 685.0, 726.0, 770.0, 782.0, 787.0, 840.0, 833.0, 891.0, 914.0, 872.0, 916.0, 950.0, 880.0, 889.0, 857.0, 796.0, 754.0, 767.0, 722.0, 663.0, 649.0, 582.0, 494.0, 478.0, 407.0, 358.0, 289.0, 206.0, 143.0], [684.0, 234.0, 136.0, 97.0, 54.0, 53.0, 56.0, 69.0, 80.0, 84.0, 89.0, 96.0, 164.0, 187.0, 186.0, 201.0, 229.0, 257.0, 335.0, 343.0, 426.0, 452.0, 482.0, 536.0, 588.0, 649.0, 685.0, 732.0, 803.0, 802.0, 887.0, 879.0, 949.0, 960.0, 965.0, 1002.0, 995.0, 1002.0, 970.0, 1016.0, 934.0, 920.0, 917.0, 825.0, 777.0, 696.0, 576.0, 488.0, 407.0], [691.0, 209.0, 125.0, 76.0, 56.0, 38.0, 32.0, 39.0, 43.0, 36.0, 39.0, 48.0, 39.0, 58.0, 91.0, 84.0, 120.0, 131.0, 177.0, 186.0, 194.0, 254.0, 272.0, 286.0, 363.0, 375.0, 445.0, 449.0, 521.0, 599.0, 649.0, 686.0, 801.0, 906.0, 871.0, 908.0, 999.0, 1070.0, 1098.0, 1131.0, 1150.0, 1171.0, 1251.0, 1167.0, 1257.0, 1257.0, 1087.0, 1037.0, 889.0], [684.0, 232.0, 137.0, 73.0, 48.0, 58.0, 36.0, 25.0, 25.0, 19.0, 24.0, 26.0, 26.0, 26.0, 31.0, 39.0, 41.0, 46.0, 72.0, 68.0, 85.0, 106.0, 138.0, 159.0, 161.0, 220.0, 222.0, 255.0, 304.0, 334.0, 392.0, 455.0, 497.0, 603.0, 681.0, 738.0, 792.0, 917.0, 950.0, 1065.0, 1205.0, 1331.0, 1408.0, 1488.0, 1557.0, 1684.0, 1676.0, 1709.0, 1672.0], [677.0, 211.0, 127.0, 88.0, 68.0, 43.0, 32.0, 20.0, 19.0, 19.0, 17.0, 18.0, 10.0, 14.0, 17.0, 13.0, 18.0, 20.0, 29.0, 35.0, 38.0, 46.0, 45.0, 56.0, 69.0, 99.0, 102.0, 112.0, 142.0, 183.0, 225.0, 245.0, 289.0, 325.0, 374.0, 469.0, 545.0, 634.0, 705.0, 855.0, 994.0, 1193.0, 1253.0, 1442.0, 1709.0, 1896.0, 2158.0, 2471.0, 2643.0], [713.0, 223.0, 141.0, 74.0, 58.0, 48.0, 37.0, 20.0, 24.0, 16.0, 18.0, 11.0, 10.0, 10.0, 9.0, 12.0, 15.0, 16.0, 15.0, 13.0, 18.0, 16.0, 21.0, 24.0, 30.0, 45.0, 36.0, 46.0, 74.0, 80.0, 94.0, 106.0, 123.0, 187.0, 217.0, 243.0, 279.0, 368.0, 487.0, 567.0, 698.0, 817.0, 1016.0, 1252.0, 1486.0, 1919.0, 2311.0, 2845.0, 3765.0], [722.0, 216.0, 132.0, 79.0, 52.0, 54.0, 26.0, 34.0, 20.0, 16.0, 15.0, 15.0, 18.0, 8.0, 11.0, 10.0, 7.0, 9.0, 11.0, 13.0, 10.0, 10.0, 13.0, 13.0, 18.0, 18.0, 13.0, 23.0, 21.0, 23.0, 37.0, 50.0, 59.0, 58.0, 89.0, 128.0, 147.0, 202.0, 219.0, 304.0, 388.0, 561.0, 673.0, 841.0, 1135.0, 1557.0, 2208.0, 2922.0, 4344.0], [662.0, 234.0, 137.0, 83.0, 63.0, 38.0, 44.0, 22.0, 22.0, 16.0, 15.0, 14.0, 15.0, 8.0, 9.0, 9.0, 8.0, 13.0, 16.0, 12.0, 9.0, 9.0, 10.0, 9.0, 7.0, 6.0, 8.0, 10.0, 15.0, 21.0, 17.0, 12.0, 22.0, 27.0, 33.0, 48.0, 53.0, 77.0, 106.0, 151.0, 187.0, 255.0, 379.0, 518.0, 737.0, 1099.0, 1706.0, 2559.0, 4402.0], [667.0, 236.0, 127.0, 90.0, 53.0, 35.0, 37.0, 25.0, 23.0, 21.0, 13.0, 13.0, 13.0, 13.0, 14.0, 5.0, 5.0, 10.0, 12.0, 8.0, 15.0, 8.0, 6.0, 9.0, 7.0, 8.0, 16.0, 7.0, 11.0, 9.0, 5.0, 11.0, 11.0, 10.0, 17.0, 20.0, 27.0, 27.0, 33.0, 47.0, 88.0, 131.0, 202.0, 279.0, 431.0, 634.0, 1101.0, 2036.0, 4041.0], [711.0, 240.0, 129.0, 82.0, 60.0, 67.0, 33.0, 24.0, 19.0, 11.0, 4.0, 15.0, 10.0, 12.0, 7.0, 18.0, 11.0, 16.0, 6.0, 8.0, 9.0, 9.0, 9.0, 12.0, 9.0, 4.0, 6.0, 9.0, 6.0, 6.0, 10.0, 11.0, 7.0, 5.0, 13.0, 14.0, 11.0, 15.0, 15.0, 21.0, 33.0, 42.0, 74.0, 129.0, 206.0, 392.0, 689.0, 1384.0, 3272.0], [701.0, 206.0, 118.0, 93.0, 54.0, 41.0, 34.0, 30.0, 15.0, 18.0, 14.0, 11.0, 13.0, 11.0, 11.0, 12.0, 12.0, 13.0, 15.0, 10.0, 8.0, 12.0, 7.0, 14.0, 8.0, 8.0, 5.0, 8.0, 6.0, 7.0, 9.0, 2.0, 11.0, 7.0, 5.0, 10.0, 8.0, 8.0, 5.0, 11.0, 22.0, 20.0, 35.0, 53.0, 99.0, 186.0, 387.0, 786.0, 2419.0], [605.0, 237.0, 133.0, 86.0, 73.0, 36.0, 37.0, 31.0, 20.0, 11.0, 10.0, 17.0, 12.0, 15.0, 19.0, 8.0, 17.0, 4.0, 4.0, 9.0, 7.0, 7.0, 10.0, 12.0, 11.0, 6.0, 5.0, 9.0, 6.0, 10.0, 5.0, 5.0, 6.0, 7.0, 4.0, 7.0, 8.0, 8.0, 3.0, 8.0, 8.0, 10.0, 16.0, 24.0, 39.0, 75.0, 176.0, 461.0, 1592.0], [712.0, 214.0, 127.0, 85.0, 59.0, 42.0, 32.0, 29.0, 13.0, 17.0, 14.0, 15.0, 14.0, 7.0, 12.0, 15.0, 7.0, 12.0, 11.0, 10.0, 7.0, 4.0, 11.0, 6.0, 5.0, 9.0, 13.0, 9.0, 9.0, 10.0, 5.0, 8.0, 10.0, 3.0, 9.0, 8.0, 10.0, 5.0, 10.0, 2.0, 9.0, 2.0, 7.0, 15.0, 17.0, 32.0, 75.0, 250.0, 962.0], [674.0, 226.0, 134.0, 86.0, 56.0, 49.0, 26.0, 34.0, 23.0, 14.0, 16.0, 13.0, 11.0, 6.0, 5.0, 6.0, 14.0, 8.0, 11.0, 13.0, 9.0, 12.0, 5.0, 9.0, 9.0, 6.0, 9.0, 10.0, 8.0, 6.0, 8.0, 6.0, 9.0, 4.0, 6.0, 7.0, 7.0, 11.0, 7.0, 7.0, 6.0, 6.0, 6.0, 15.0, 10.0, 14.0, 44.0, 121.0, 569.0], [675.0, 215.0, 142.0, 85.0, 57.0, 46.0, 41.0, 15.0, 25.0, 16.0, 14.0, 9.0, 11.0, 9.0, 14.0, 11.0, 10.0, 16.0, 7.0, 6.0, 8.0, 10.0, 9.0, 16.0, 9.0, 14.0, 2.0, 5.0, 8.0, 8.0, 6.0, 10.0, 7.0, 8.0, 6.0, 10.0, 3.0, 8.0, 4.0, 13.0, 11.0, 4.0, 5.0, 5.0, 6.0, 14.0, 18.0, 59.0, 311.0], [658.0, 234.0, 128.0, 69.0, 52.0, 48.0, 39.0, 30.0, 28.0, 17.0, 21.0, 9.0, 10.0, 11.0, 7.0, 11.0, 11.0, 12.0, 11.0, 9.0, 6.0, 12.0, 6.0, 6.0, 7.0, 9.0, 9.0, 5.0, 10.0, 10.0, 4.0, 4.0, 4.0, 9.0, 13.0, 9.0, 12.0, 5.0, 8.0, 8.0, 4.0, 5.0, 4.0, 7.0, 5.0, 8.0, 16.0, 32.0, 147.0], [689.0, 228.0, 113.0, 90.0, 49.0, 50.0, 27.0, 14.0, 24.0, 19.0, 17.0, 18.0, 14.0, 14.0, 11.0, 8.0, 16.0, 9.0, 14.0, 9.0, 7.0, 10.0, 9.0, 8.0, 4.0, 9.0, 11.0, 11.0, 5.0, 13.0, 7.0, 6.0, 3.0, 4.0, 9.0, 7.0, 6.0, 11.0, 8.0, 3.0, 7.0, 6.0, 6.0, 4.0, 4.0, 7.0, 6.0, 24.0, 80.0], [655.0, 237.0, 116.0, 80.0, 59.0, 43.0, 32.0, 27.0, 28.0, 16.0, 19.0, 18.0, 14.0, 10.0, 11.0, 14.0, 9.0, 5.0, 9.0, 12.0, 8.0, 8.0, 9.0, 9.0, 7.0, 7.0, 1.0, 10.0, 9.0, 8.0, 6.0, 9.0, 11.0, 4.0, 10.0, 9.0, 5.0, 3.0, 7.0, 6.0, 4.0, 8.0, 9.0, 8.0, 6.0, 4.0, 6.0, 15.0, 54.0], [664.0, 222.0, 110.0, 85.0, 59.0, 45.0, 39.0, 26.0, 23.0, 14.0, 26.0, 11.0, 8.0, 9.0, 14.0, 5.0, 7.0, 8.0, 13.0, 5.0, 11.0, 16.0, 6.0, 6.0, 7.0, 12.0, 9.0, 8.0, 8.0, 4.0, 8.0, 9.0, 6.0, 5.0, 10.0, 5.0, 9.0, 3.0, 7.0, 8.0, 2.0, 8.0, 4.0, 9.0, 1.0, 4.0, 6.0, 10.0, 44.0], [697.0, 243.0, 131.0, 70.0, 59.0, 44.0, 36.0, 31.0, 22.0, 20.0, 13.0, 14.0, 7.0, 16.0, 10.0, 7.0, 13.0, 9.0, 8.0, 10.0, 12.0, 14.0, 5.0, 9.0, 12.0, 8.0, 8.0, 12.0, 4.0, 10.0, 6.0, 8.0, 6.0, 7.0, 5.0, 8.0, 7.0, 8.0, 7.0, 3.0, 5.0, 4.0, 4.0, 5.0, 6.0, 2.0, 4.0, 11.0, 28.0], [670.0, 220.0, 122.0, 105.0, 60.0, 59.0, 38.0, 22.0, 17.0, 23.0, 9.0, 9.0, 11.0, 11.0, 10.0, 9.0, 9.0, 3.0, 8.0, 14.0, 10.0, 15.0, 3.0, 4.0, 6.0, 14.0, 10.0, 9.0, 10.0, 13.0, 9.0, 9.0, 8.0, 4.0, 5.0, 7.0, 7.0, 6.0, 5.0, 8.0, 3.0, 7.0, 8.0, 2.0, 5.0, 3.0, 6.0, 4.0, 17.0], [694.0, 236.0, 112.0, 84.0, 65.0, 49.0, 32.0, 33.0, 24.0, 12.0, 11.0, 11.0, 17.0, 10.0, 10.0, 7.0, 9.0, 12.0, 8.0, 10.0, 6.0, 10.0, 12.0, 8.0, 7.0, 7.0, 12.0, 11.0, 7.0, 11.0, 6.0, 8.0, 7.0, 6.0, 5.0, 10.0, 6.0, 7.0, 4.0, 7.0, 7.0, 2.0, 6.0, 4.0, 5.0, 9.0, 8.0, 7.0, 17.0], [656.0, 247.0, 129.0, 88.0, 58.0, 41.0, 36.0, 23.0, 22.0, 19.0, 15.0, 15.0, 11.0, 12.0, 8.0, 10.0, 14.0, 12.0, 9.0, 8.0, 18.0, 10.0, 5.0, 5.0, 4.0, 11.0, 9.0, 8.0, 8.0, 12.0, 7.0, 7.0, 3.0, 9.0, 10.0, 8.0, 3.0, 4.0, 2.0, 7.0, 5.0, 6.0, 5.0, 9.0, 4.0, 5.0, 7.0, 7.0, 6.0], [626.0, 225.0, 122.0, 100.0, 51.0, 53.0, 38.0, 24.0, 18.0, 18.0, 14.0, 9.0, 12.0, 16.0, 7.0, 8.0, 10.0, 11.0, 13.0, 9.0, 8.0, 9.0, 6.0, 10.0, 10.0, 15.0, 8.0, 10.0, 5.0, 6.0, 6.0, 9.0, 6.0, 4.0, 9.0, 8.0, 3.0, 5.0, 5.0, 4.0, 10.0, 0.0, 6.0, 4.0, 2.0, 7.0, 10.0, 6.0, 11.0], [665.0, 252.0, 133.0, 89.0, 57.0, 48.0, 33.0, 24.0, 24.0, 12.0, 17.0, 11.0, 9.0, 11.0, 11.0, 9.0, 12.0, 9.0, 12.0, 9.0, 13.0, 3.0, 6.0, 16.0, 12.0, 5.0, 8.0, 3.0, 4.0, 6.0, 8.0, 9.0, 12.0, 6.0, 5.0, 6.0, 7.0, 5.0, 10.0, 6.0, 2.0, 7.0, 9.0, 9.0, 4.0, 8.0, 8.0, 7.0, 12.0]],
    "Name": "sCurve-0",
    "Overflow": 2578135.0,
    "Type": "Histo2d",
    "Underflow": 0.0,
    "x": {
        "AxisTitle": "Vcal",
        "Bins": 51,
        "High": 302.5,
        "Low": 47.5
    },
    "y": {
        "AxisTitle": "Occupancy",
        "Bins": 49,
        "High": 49.5,
        "Low": 0.5
    },
    "z": {
        "AxisTitle": "Number of pixels"
    }
}