{
    "Data": [0.0, 0.0, 0.0, 0.0, 0.0, 0.0, 0.0, 0.0, 0.0, 0.0, 0.0, 0.0, 0.0, 0.0, 0.0, 0.0, 0.0, 0.0, 0.0, 0.0, 0.0, 0.0, 0.0, 0.0, 0.0, 0.0, 0.0, 0.0, 0.0, 0.0, 0.0, 0.0, 0.0, 0.0, 0.0, 0.0, 0.0, 0.0, 0.0, 0.0, 0.0, 0.0, 0.0, 0.0, 0.0, 0.0, 0.0, 0.0, 0.0, 0.0, 5.0, 7.0, 12.0, 13.0, 11.0, 10.0, 13.0, 7.0, 11.0, 8.0, 18.0, 14.0, 21.0, 35.0, 40.0, 31.0, 61.0, 66.0, 91.0, 123.0, 117.0, 188.0, 208.0, 252.0, 322.0, 388.0, 458.0, 605.0, 645.0, 739.0, 853.0, 1002.0, 1105.0, 1130.0, 1143.0, 1228.0, 1383.0, 1323.0, 1540.0, 1711.0, 2118.0, 2469.0, 2994.0, 3663.0, 4072.0, 4189.0, 3867.0, 3160.0, 2521.0, 1816.0, 1194.0, 713.0, 530.0, 349.0, 227.0, 164.0, 144.0, 116.0, 79.0, 61.0, 64.0, 37.0, 46.0, 44.0, 32.0, 31.0, 27.0, 32.0, 25.0, 19.0, 29.0, 26.0, 13.0, 15.0, 16.0, 21.0, 12.0, 14.0, 18.0, 12.0, 10.0, 5.0, 9.0, 13.0, 8.0, 9.0, 15.0, 6.0, 10.0, 7.0, 10.0, 9.0, 4.0, 13.0, 10.0, 10.0, 9.0, 14.0, 9.0, 16.0, 13.0, 25.0, 26.0, 24.0, 26.0, 36.0, 44.0, 60.0, 66.0, 87.0, 92.0, 113.0, 121.0, 170.0, 165.0, 224.0, 252.0, 295.0, 329.0, 341.0, 416.0, 450.0, 472.0, 543.0, 518.0, 568.0, 577.0, 613.0, 638.0, 628.0, 731.0, 700.0, 671.0, 682.0, 654.0, 648.0, 645.0, 635.0, 633.0, 573.0, 563.0, 541.0, 448.0, 465.0, 455.0, 401.0, 431.0, 369.0, 300.0, 311.0, 274.0, 296.0, 260.0, 216.0, 212.0, 190.0, 181.0, 143.0, 148.0, 137.0, 166.0, 124.0, 113.0, 91.0, 84.0, 90.0, 78.0, 74.0, 66.0, 49.0, 55.0, 44.0, 52.0, 48.0, 35.0, 34.0, 30.0, 35.0, 29.0, 35.0, 28.0, 28.0, 30.0, 21.0, 18.0, 12.0, 13.0, 5.0, 6.0, 9.0, 6.0, 8.0, 4.0, 4.0, 5.0, 5.0, 6.0, 7.0, 6.0, 6.0, 2.0, 5.0, 9.0, 7.0, 4.0, 4.0, 5.0, 1.0, 2.0, 5.0, 8.0, 8.0, 8.0, 2.0, 4.0, 9.0, 1.0, 2.0, 1.0, 0.0, 1.0, 0.0, 2.0, 1.0, 1.0, 0.0, 2.0, 1.0, 2.0, 0.0, 0.0, 2.0, 0.0, 0.0, 0.0, 1.0, 2.0, 1.0, 1.0, 0.0, 2.0, 1.0, 1.0, 0.0, 0.0, 1.0, 2.0, 0.0, 0.0, 0.0, 1.0, 1.0, 1.0, 0.0, 0.0, 0.0, 0.0, 2.0, 0.0, 0.0, 1.0, 0.0, 0.0, 0.0, 1.0, 0.0, 1.0, 0.0, 0.0, 1.0, 0.0, 1.0, 0.0, 0.0, 1.0, 0.0, 0.0, 0.0, 0.0, 0.0, 0.0, 0.0, 0.0, 0.0, 0.0, 0.0, 0.0, 0.0, 0.0, 0.0, 0.0],
    "Name": "ThresholdDist-0",
    "Overflow": 0.0,
    "Type": "Histo1d",
    "Underflow": 0.0,
    "x": {
        "AxisTitle": "Threshold [e]",
        "Bins": 341,
        "High": 3405.0,
        "Low": -5.0
    },
    "y": {
        "AxisTitle": "Number of Pixels"
    },
    "z": {
        "AxisTitle": "z"
    }
}