{
    "Data": [0.0, 0.0, 0.0, 0.0, 0.0, 0.0, 0.0, 0.0, 0.0, 1.0, 0.0, 0.0, 0.0, 13.0, 73.0, 28.0, 10.0, 269.0, 765.0, 256.0, 113.0, 904.0, 2561.0, 2173.0, 574.0, 1461.0, 2783.0, 2257.0, 868.0, 1265.0, 2014.0, 2209.0, 1232.0, 1022.0, 1568.0, 1684.0, 1037.0, 835.0, 1426.0, 1947.0, 1591.0, 968.0, 1100.0, 1853.0, 1894.0, 1319.0, 1190.0, 1723.0, 2177.0, 1805.0, 1295.0, 1159.0, 1325.0, 1342.0, 1044.0, 951.0, 933.0, 1108.0, 934.0, 747.0, 733.0, 697.0, 654.0, 558.0, 512.0, 477.0, 517.0, 461.0, 379.0, 344.0, 352.0, 334.0, 284.0, 250.0, 214.0, 214.0, 213.0, 195.0, 153.0, 151.0, 160.0, 140.0, 97.0, 92.0, 88.0, 87.0, 70.0, 63.0, 46.0, 55.0, 34.0, 38.0, 29.0, 34.0, 22.0, 30.0, 38.0, 23.0, 19.0, 21.0, 23.0, 18.0, 19.0, 12.0, 19.0, 10.0, 14.0, 10.0, 14.0, 7.0, 12.0, 5.0, 11.0, 6.0, 6.0, 8.0, 4.0, 4.0, 7.0, 4.0, 7.0, 2.0, 4.0, 4.0, 3.0, 7.0, 3.0, 6.0, 4.0, 2.0, 5.0, 1.0, 2.0, 8.0, 0.0, 6.0, 1.0, 3.0, 3.0, 1.0, 2.0, 3.0, 1.0, 1.0, 2.0, 1.0, 2.0, 0.0, 3.0, 3.0, 2.0, 1.0, 0.0, 1.0, 0.0, 0.0, 2.0, 1.0, 1.0, 0.0, 1.0, 1.0, 0.0, 1.0, 0.0, 0.0, 2.0, 1.0, 1.0, 1.0, 1.0, 1.0, 0.0, 0.0, 4.0, 0.0, 2.0, 1.0, 2.0, 2.0, 0.0, 1.0, 1.0, 0.0, 0.0, 0.0, 0.0, 1.0, 0.0, 0.0, 1.0, 2.0, 0.0, 0.0, 0.0, 0.0, 0.0, 0.0, 0.0, 0.0, 0.0],
    "Name": "TimePerFitDist-0",
    "Overflow": 124.0,
    "Type": "Histo1d",
    "Underflow": 0.0,
    "x": {
        "AxisTitle": "Fit Time [us]",
        "Bins": 201,
        "High": 401.0,
        "Low": -1.0
    },
    "y": {
        "AxisTitle": "Number of Pixels"
    },
    "z": {
        "AxisTitle": "z"
    }
}