{
    "Data": [0.0, 0.0, 0.0, 0.0, 0.0, 0.0, 0.0, 0.0, 0.0, 0.0, 0.0, 0.0, 0.0, 0.0, 5.0, 0.0, 0.0, 16.0, 586.0, 342.0, 35.0, 119.0, 2853.0, 4233.0, 484.0, 308.0, 2414.0, 3780.0, 798.0, 442.0, 1461.0, 2450.0, 854.0, 310.0, 381.0, 473.0, 362.0, 244.0, 508.0, 524.0, 451.0, 457.0, 962.0, 1689.0, 1438.0, 1272.0, 1905.0, 2879.0, 3053.0, 2612.0, 2492.0, 2635.0, 2817.0, 2277.0, 2155.0, 2115.0, 2284.0, 2145.0, 1793.0, 1800.0, 1641.0, 1524.0, 1090.0, 863.0, 857.0, 859.0, 827.0, 615.0, 608.0, 509.0, 557.0, 500.0, 393.0, 340.0, 321.0, 282.0, 260.0, 222.0, 190.0, 134.0, 155.0, 159.0, 114.0, 95.0, 103.0, 98.0, 83.0, 78.0, 76.0, 57.0, 56.0, 45.0, 34.0, 33.0, 41.0, 28.0, 27.0, 34.0, 17.0, 22.0, 22.0, 17.0, 14.0, 12.0, 14.0, 19.0, 9.0, 9.0, 8.0, 8.0, 4.0, 3.0, 9.0, 8.0, 7.0, 3.0, 8.0, 10.0, 4.0, 5.0, 5.0, 3.0, 2.0, 1.0, 1.0, 3.0, 3.0, 1.0, 3.0, 1.0, 2.0, 1.0, 4.0, 0.0, 1.0, 3.0, 2.0, 0.0, 0.0, 2.0, 2.0, 1.0, 4.0, 2.0, 1.0, 0.0, 1.0, 2.0, 1.0, 2.0, 0.0, 0.0, 1.0, 1.0, 0.0, 2.0, 0.0, 1.0, 0.0, 0.0, 0.0, 0.0, 0.0, 0.0, 0.0, 0.0, 1.0, 0.0, 0.0, 0.0, 1.0, 1.0, 0.0, 0.0, 0.0, 0.0, 1.0, 0.0, 0.0, 0.0, 0.0, 0.0, 0.0, 0.0, 0.0, 0.0, 0.0, 0.0, 0.0, 0.0, 1.0, 0.0, 0.0, 0.0, 0.0, 0.0, 0.0, 0.0, 0.0, 0.0, 0.0],
    "Name": "TimePerFitDist-0",
    "Overflow": 62.0,
    "Type": "Histo1d",
    "Underflow": 0.0,
    "x": {
        "AxisTitle": "Fit Time [us]",
        "Bins": 201,
        "High": 401.0,
        "Low": -1.0
    },
    "y": {
        "AxisTitle": "Number of Pixels"
    },
    "z": {
        "AxisTitle": "z"
    }
}