{
    "Data": [7.0, 5.0, 1.0, 0.0, 3.0, 12.0, 70.0, 276.0, 920.0, 2222.0, 3964.0, 5473.0, 5364.0, 4199.0, 3297.0, 3596.0, 4499.0, 5025.0, 4723.0, 3741.0, 2479.0, 1406.0, 801.0, 677.0, 694.0, 985.0, 1266.0, 1492.0, 1836.0, 2093.0, 2193.0, 2237.0, 2106.0, 1878.0, 1574.0, 1217.0, 965.0, 717.0, 564.0, 407.0, 301.0, 221.0, 183.0, 138.0, 121.0, 89.0, 79.0, 50.0, 52.0, 35.0, 31.0, 29.0, 25.0, 25.0, 16.0, 20.0, 23.0, 15.0, 15.0, 17.0, 14.0, 8.0, 10.0, 8.0, 9.0, 7.0],
    "Name": "NoiseDist-0",
    "Overflow": 75.0,
    "Type": "Histo1d",
    "Underflow": 0.0,
    "x": {
        "AxisTitle": "Noise [e]",
        "Bins": 66,
        "High": 331.0,
        "Low": -2.0
    },
    "y": {
        "AxisTitle": "Number of Pixels"
    },
    "z": {
        "AxisTitle": "z"
    }
}