{
    "Data": [12.0, 59.0, 22.0, 6.0, 20.0, 27.0, 131.0, 554.0, 1425.0, 3075.0, 4884.0, 5614.0, 4917.0, 3821.0, 3417.0, 3320.0, 3223.0, 2981.0, 2625.0, 2312.0, 2024.0, 1876.0, 1644.0, 1435.0, 1177.0, 879.0, 573.0, 396.0, 319.0, 234.0, 247.0, 252.0, 301.0, 345.0, 438.0, 534.0, 606.0, 743.0, 790.0, 846.0, 909.0, 992.0, 1035.0, 986.0, 998.0, 972.0, 918.0, 861.0, 785.0, 711.0, 693.0, 563.0, 490.0, 409.0, 392.0, 334.0, 308.0, 300.0, 247.0, 225.0, 231.0, 180.0, 145.0, 149.0, 155.0, 118.0, 100.0, 90.0, 98.0, 93.0, 82.0, 58.0, 57.0, 44.0, 67.0, 53.0, 56.0, 47.0, 50.0, 37.0, 52.0, 41.0, 38.0, 29.0, 47.0, 40.0, 32.0, 47.0, 34.0, 44.0, 31.0, 33.0, 31.0, 25.0, 29.0, 29.0, 29.0, 28.0, 23.0, 22.0, 19.0, 15.0, 16.0, 25.0, 18.0, 11.0, 16.0, 16.0, 22.0, 10.0, 16.0, 19.0, 12.0, 10.0, 9.0, 17.0],
    "Name": "NoiseDist-0",
    "Overflow": 252.0,
    "Type": "Histo1d",
    "Underflow": 0.0,
    "x": {
        "AxisTitle": "Noise [e]",
        "Bins": 116,
        "High": 581.0,
        "Low": -2.0
    },
    "y": {
        "AxisTitle": "Number of Pixels"
    },
    "z": {
        "AxisTitle": "z"
    }
}