{
    "Data": [0.0, 0.0, 0.0, 0.0, 0.0, 0.0, 0.0, 0.0, 0.0, 0.0, 0.0, 0.0, 0.0, 0.0, 0.0, 0.0, 0.0, 0.0, 0.0, 0.0, 0.0, 0.0, 0.0, 0.0, 0.0, 0.0, 0.0, 0.0, 0.0, 0.0, 0.0, 0.0, 0.0, 0.0, 0.0, 0.0, 0.0, 0.0, 0.0, 0.0, 0.0, 0.0, 0.0, 0.0, 0.0, 0.0, 0.0, 0.0, 0.0, 0.0, 39.0, 101.0, 137.0, 151.0, 149.0, 194.0, 216.0, 229.0, 262.0, 298.0, 370.0, 395.0, 426.0, 460.0, 505.0, 574.0, 633.0, 601.0, 715.0, 739.0, 744.0, 811.0, 786.0, 829.0, 864.0, 846.0, 849.0, 888.0, 904.0, 819.0, 869.0, 868.0, 818.0, 858.0, 920.0, 995.0, 1145.0, 1263.0, 1555.0, 2012.0, 2256.0, 2636.0, 2810.0, 2932.0, 2775.0, 2495.0, 2098.0, 1713.0, 1248.0, 923.0, 627.0, 458.0, 339.0, 212.0, 147.0, 105.0, 87.0, 65.0, 43.0, 48.0, 36.0, 39.0, 25.0, 23.0, 20.0, 19.0, 24.0, 14.0, 14.0, 19.0, 10.0, 17.0, 11.0, 13.0, 12.0, 9.0, 12.0, 17.0, 10.0, 6.0, 10.0, 5.0, 2.0, 9.0, 7.0, 2.0, 4.0, 9.0, 6.0, 7.0, 3.0, 5.0, 2.0, 5.0, 2.0, 2.0, 1.0, 2.0, 2.0, 6.0, 0.0, 5.0, 4.0, 5.0, 2.0, 6.0, 6.0, 7.0, 18.0, 21.0, 18.0, 28.0, 44.0, 37.0, 56.0, 71.0, 86.0, 138.0, 153.0, 178.0, 187.0, 238.0, 245.0, 368.0, 378.0, 489.0, 503.0, 531.0, 595.0, 650.0, 673.0, 769.0, 817.0, 810.0, 901.0, 939.0, 953.0, 966.0, 941.0, 958.0, 946.0, 944.0, 854.0, 853.0, 843.0, 690.0, 691.0, 621.0, 611.0, 523.0, 455.0, 405.0, 356.0, 326.0, 255.0, 249.0, 181.0, 191.0, 175.0, 117.0, 113.0, 99.0, 74.0, 59.0, 54.0, 36.0, 28.0, 23.0, 14.0, 13.0, 12.0, 7.0, 4.0, 8.0, 2.0, 3.0, 0.0, 0.0, 0.0, 0.0, 1.0, 0.0, 0.0, 0.0, 0.0, 0.0, 0.0, 0.0, 0.0, 0.0, 1.0, 0.0, 0.0, 0.0, 0.0, 0.0, 1.0, 0.0, 0.0, 1.0, 0.0, 0.0, 0.0, 0.0, 0.0, 0.0, 0.0, 0.0, 0.0, 0.0, 0.0, 1.0, 0.0, 0.0, 0.0, 0.0, 0.0, 0.0, 0.0, 0.0, 0.0, 0.0, 0.0, 0.0, 0.0, 0.0, 0.0, 0.0, 0.0, 0.0, 0.0, 0.0, 0.0, 0.0, 0.0, 0.0, 0.0, 0.0, 0.0, 0.0, 0.0, 0.0, 0.0, 0.0, 0.0, 0.0, 0.0, 0.0, 0.0, 0.0, 0.0, 0.0, 0.0, 0.0, 0.0, 0.0, 0.0, 0.0, 0.0, 0.0, 0.0, 0.0, 0.0, 0.0, 0.0, 0.0, 0.0, 0.0, 0.0, 0.0, 0.0, 0.0, 0.0, 0.0, 0.0, 0.0, 0.0, 0.0, 0.0, 0.0, 0.0, 0.0, 0.0, 0.0, 0.0, 0.0, 0.0, 0.0, 0.0, 0.0, 0.0, 0.0, 0.0, 0.0, 0.0, 0.0, 0.0, 0.0, 0.0, 0.0, 0.0, 0.0, 0.0, 0.0, 0.0, 0.0, 0.0, 0.0, 0.0, 0.0, 0.0, 0.0, 0.0, 0.0],
    "Name": "ThresholdDist-0",
    "Overflow": 0.0,
    "Type": "Histo1d",
    "Underflow": 0.0,
    "x": {
        "AxisTitle": "Threshold [e]",
        "Bins": 364,
        "High": 3635.0,
        "Low": -5.0
    },
    "y": {
        "AxisTitle": "Number of Pixels"
    },
    "z": {
        "AxisTitle": "z"
    }
}