time,Hardware,Voltage,Current
1623352149832,high-voltage,1,0.0667045
time,Hardware,Voltage,Current
1623352149832,high-voltage,2,0.0835785
time,Hardware,Voltage,Current
1623352149832,high-voltage,3,0.0985834
time,Hardware,Voltage,Current
1623352149832,high-voltage,4,0.110286
time,Hardware,Voltage,Current
1623352149832,high-voltage,5,0.121404
time,Hardware,Voltage,Current
1623352149832,high-voltage,6,0.130767
time,Hardware,Voltage,Current
1623352149832,high-voltage,7,0.140371
time,Hardware,Voltage,Current
1623352149832,high-voltage,8,0.148927
time,Hardware,Voltage,Current
1623352149832,high-voltage,9,0.159067
time,Hardware,Voltage,Current
1623352149832,high-voltage,10,0.167412
time,Hardware,Voltage,Current
1623352149832,high-voltage,11,0.17702
time,Hardware,Voltage,Current
1623352149832,high-voltage,12,0.184129
time,Hardware,Voltage,Current
1623352149832,high-voltage,13,0.1924
time,Hardware,Voltage,Current
1623352149832,high-voltage,14,0.199187
time,Hardware,Voltage,Current
1623352149832,high-voltage,15,0.205806
time,Hardware,Voltage,Current
1623352149832,high-voltage,16,0.211414
time,Hardware,Voltage,Current
1623352149832,high-voltage,17,0.21573
time,Hardware,Voltage,Current
1623352149832,high-voltage,18,0.22009
time,Hardware,Voltage,Current
1623352149832,high-voltage,19,0.225222
time,Hardware,Voltage,Current
1623352149832,high-voltage,20,0.230833
time,Hardware,Voltage,Current
1623352149832,high-voltage,25,0.253679
time,Hardware,Voltage,Current
1623352149832,high-voltage,30,0.285497
time,Hardware,Voltage,Current
1623352149832,high-voltage,35,0.375687
time,Hardware,Voltage,Current
1623352149832,high-voltage,40,0.651282
time,Hardware,Voltage,Current
1623352149832,high-voltage,45,1.14799
time,Hardware,Voltage,Current
1623352149832,high-voltage,50,1.80851
time,Hardware,Voltage,Current
1623352149832,high-voltage,2.61038e-06,2.61067
time,Hardware,Voltage,Current
1623352149832,high-voltage,60,3.54856
time,Hardware,Voltage,Current
1623352149832,high-voltage,65,4.62263
time,Hardware,Voltage,Current
1623352149832,high-voltage,70,5.84532
time,Hardware,Voltage,Current
1623352149832,high-voltage,75,7.21828
time,Hardware,Voltage,Current
1623352149832,high-voltage,80,8.74723
