time,Hardware,Voltage,Current
1623355030008,high-voltage,1,0.06435
time,Hardware,Voltage,Current
1623355030008,high-voltage,2,0.0798813
time,Hardware,Voltage,Current
1623355030008,high-voltage,3,0.0925716
time,Hardware,Voltage,Current
1623355030008,high-voltage,4,0.103564
time,Hardware,Voltage,Current
1623355030008,high-voltage,5,0.113805
time,Hardware,Voltage,Current
1623355030008,high-voltage,6,0.122722
time,Hardware,Voltage,Current
1623355030008,high-voltage,7,0.132566
time,Hardware,Voltage,Current
1623355030008,high-voltage,8,0.143447
time,Hardware,Voltage,Current
1623355030008,high-voltage,9,0.153462
time,Hardware,Voltage,Current
1623355030008,high-voltage,10,0.163457
time,Hardware,Voltage,Current
1623355030008,high-voltage,11,0.172842
time,Hardware,Voltage,Current
1623355030008,high-voltage,12,0.18104
time,Hardware,Voltage,Current
1623355030008,high-voltage,13,0.189504
time,Hardware,Voltage,Current
1623355030008,high-voltage,14,0.1952
time,Hardware,Voltage,Current
1623355030008,high-voltage,15,0.202081
time,Hardware,Voltage,Current
1623355030008,high-voltage,16,0.207813
time,Hardware,Voltage,Current
1623355030008,high-voltage,17,0.213058
time,Hardware,Voltage,Current
1623355030008,high-voltage,18,0.217606
time,Hardware,Voltage,Current
1623355030008,high-voltage,19,0.223333
time,Hardware,Voltage,Current
1623355030008,high-voltage,20,0.227403
time,Hardware,Voltage,Current
1623355030008,high-voltage,25,0.251118
time,Hardware,Voltage,Current
1623355030008,high-voltage,30,0.282752
time,Hardware,Voltage,Current
1623355030008,high-voltage,3.74936e-07,0.374563
time,Hardware,Voltage,Current
1623355030008,high-voltage,40,0.657747
time,Hardware,Voltage,Current
1623355030008,high-voltage,45,1.16974
time,Hardware,Voltage,Current
1623355030008,high-voltage,50,1.85014
time,Hardware,Voltage,Current
1623355030008,high-voltage,55,5.5e+07
time,Hardware,Voltage,Current
1623355030008,high-voltage,60,3.64977
time,Hardware,Voltage,Current
1623355030008,high-voltage,4.76491e-06,4.76775
time,Hardware,Voltage,Current
1623355030008,high-voltage,70,6.03686
time,Hardware,Voltage,Current
1623355030008,high-voltage,7.47306e-06,7.47792
time,Hardware,Voltage,Current
1623355030008,high-voltage,80,9.08273
time,Hardware,Voltage,Current
1623355030008,high-voltage,85,10
