{
    "Data": [334.0, 1199.0, 216.0, 77.0, 137.0, 117.0, 108.0, 80.0, 62.0, 142.0, 181.0, 278.0, 409.0, 639.0, 912.0, 1216.0, 1594.0, 1981.0, 2188.0, 2371.0, 2414.0, 2361.0, 1995.0, 1733.0, 1598.0, 1416.0, 1581.0, 1706.0, 1749.0, 1818.0, 1684.0, 1474.0, 1080.0, 810.0, 631.0, 418.0, 365.0, 324.0, 254.0, 275.0, 262.0, 275.0, 255.0, 223.0, 247.0, 248.0, 236.0, 246.0, 253.0, 262.0, 223.0, 227.0, 243.0, 252.0, 255.0, 229.0, 237.0, 198.0, 222.0, 224.0, 224.0, 231.0, 217.0, 239.0, 227.0, 240.0, 202.0, 210.0, 223.0, 215.0, 197.0, 190.0, 187.0, 205.0, 179.0, 175.0, 164.0, 184.0, 158.0, 148.0, 155.0, 167.0, 181.0, 127.0, 168.0, 145.0, 132.0, 126.0, 123.0, 139.0, 108.0, 122.0, 135.0, 121.0, 115.0, 110.0, 111.0, 121.0, 109.0, 93.0, 94.0, 87.0, 88.0, 86.0, 93.0, 96.0, 82.0, 91.0, 102.0, 97.0, 89.0, 86.0, 71.0, 73.0, 75.0, 66.0, 73.0, 51.0, 57.0, 66.0, 45.0, 64.0, 54.0, 44.0, 52.0, 46.0, 37.0, 50.0, 41.0, 56.0, 45.0, 40.0, 33.0, 34.0, 44.0, 35.0, 40.0, 27.0, 32.0, 35.0, 38.0, 29.0, 19.0, 21.0, 17.0, 34.0, 34.0, 29.0, 28.0, 16.0, 11.0, 18.0, 20.0, 20.0, 25.0, 18.0, 19.0, 20.0, 19.0, 20.0, 14.0, 16.0, 15.0, 14.0, 11.0, 11.0, 9.0, 10.0, 11.0, 16.0, 6.0, 6.0, 11.0, 8.0, 9.0, 10.0, 9.0, 9.0, 6.0, 6.0, 6.0, 6.0, 6.0, 5.0, 4.0, 4.0, 8.0, 7.0, 2.0, 4.0, 4.0, 6.0, 4.0, 2.0, 3.0, 4.0, 3.0, 4.0, 6.0, 3.0, 2.0, 4.0, 2.0, 6.0, 3.0, 3.0, 1.0, 3.0, 2.0, 2.0, 2.0, 3.0, 4.0, 3.0, 5.0, 4.0, 1.0, 3.0, 5.0, 4.0, 1.0, 0.0, 1.0, 1.0, 5.0, 0.0, 0.0, 2.0, 2.0, 4.0],
    "Name": "NoiseDist-0",
    "Overflow": 294.0,
    "Type": "Histo1d",
    "Underflow": 0.0,
    "x": {
        "AxisTitle": "Noise [e]",
        "Bins": 230,
        "High": 1151.0,
        "Low": -2.0
    },
    "y": {
        "AxisTitle": "Number of Pixels"
    },
    "z": {
        "AxisTitle": "z"
    }
}