{
    "Data": [0.0, 0.0, 0.0, 0.0, 0.0, 0.0, 0.0, 0.0, 0.0, 0.0, 0.0, 0.0, 0.0, 0.0, 0.0, 1.0, 0.0, 0.0, 1.0, 0.0, 0.0, 0.0, 5.0, 7.0, 4.0, 5.0, 11.0, 18.0, 12.0, 16.0, 43.0, 73.0, 88.0, 131.0, 149.0, 112.0, 227.0, 807.0, 1362.0, 1017.0, 601.0, 1208.0, 2762.0, 3992.0, 2719.0, 1536.0, 2643.0, 3161.0, 3989.0, 2303.0, 1860.0, 2326.0, 2277.0, 2151.0, 1357.0, 1196.0, 1178.0, 1295.0, 863.0, 797.0, 745.0, 695.0, 732.0, 452.0, 428.0, 375.0, 409.0, 373.0, 249.0, 270.0, 228.0, 251.0, 210.0, 186.0, 135.0, 159.0, 139.0, 119.0, 118.0, 82.0, 84.0, 76.0, 57.0, 47.0, 55.0, 42.0, 41.0, 48.0, 33.0, 31.0, 28.0, 32.0, 22.0, 23.0, 12.0, 18.0, 17.0, 11.0, 11.0, 19.0, 15.0, 9.0, 8.0, 8.0, 7.0, 3.0, 10.0, 5.0, 2.0, 8.0, 4.0, 7.0, 7.0, 0.0, 3.0, 2.0, 3.0, 2.0, 7.0, 2.0, 2.0, 1.0, 1.0, 5.0, 1.0, 1.0, 6.0, 3.0, 4.0, 0.0, 1.0, 0.0, 2.0, 1.0, 1.0, 0.0, 2.0, 0.0, 1.0, 1.0, 1.0, 1.0, 0.0, 0.0, 0.0, 0.0, 0.0, 0.0, 0.0, 2.0, 0.0, 0.0, 0.0, 1.0, 0.0, 0.0, 2.0, 1.0, 1.0, 0.0, 0.0, 0.0, 1.0, 0.0, 0.0, 0.0, 0.0, 0.0, 0.0, 0.0, 1.0, 0.0, 0.0, 0.0, 0.0, 0.0, 0.0, 0.0, 0.0, 0.0, 0.0, 0.0, 0.0, 0.0, 1.0, 0.0, 0.0, 0.0, 0.0, 0.0, 0.0, 0.0, 0.0, 0.0, 0.0, 0.0, 1.0, 0.0, 1.0, 0.0, 0.0],
    "Name": "TimePerFitDist-0",
    "Overflow": 54.0,
    "Type": "Histo1d",
    "Underflow": 0.0,
    "x": {
        "AxisTitle": "Fit Time [us]",
        "Bins": 201,
        "High": 401.0,
        "Low": -1.0
    },
    "y": {
        "AxisTitle": "Number of Pixels"
    },
    "z": {
        "AxisTitle": "z"
    }
}