{
    "Data": [0.0, 0.0, 0.0, 0.0, 0.0, 0.0, 0.0, 0.0, 0.0, 0.0, 0.0, 0.0, 0.0, 0.0, 0.0, 0.0, 0.0, 0.0, 0.0, 0.0, 0.0, 0.0, 0.0, 0.0, 0.0, 0.0, 0.0, 0.0, 0.0, 0.0, 0.0, 0.0, 0.0, 0.0, 0.0, 0.0, 0.0, 0.0, 0.0, 0.0, 0.0, 0.0, 0.0, 0.0, 0.0, 0.0, 0.0, 0.0, 0.0, 0.0, 8.0, 20.0, 16.0, 22.0, 42.0, 29.0, 42.0, 58.0, 60.0, 70.0, 84.0, 137.0, 131.0, 172.0, 146.0, 228.0, 240.0, 264.0, 286.0, 327.0, 393.0, 383.0, 461.0, 487.0, 595.0, 604.0, 750.0, 726.0, 805.0, 782.0, 872.0, 863.0, 901.0, 1010.0, 1042.0, 1300.0, 1431.0, 1674.0, 2096.0, 2467.0, 2742.0, 3018.0, 3182.0, 3040.0, 2978.0, 2749.0, 2320.0, 1965.0, 1564.0, 1214.0, 984.0, 730.0, 553.0, 467.0, 364.0, 286.0, 232.0, 218.0, 165.0, 124.0, 125.0, 95.0, 96.0, 60.0, 54.0, 34.0, 39.0, 52.0, 36.0, 26.0, 25.0, 33.0, 16.0, 20.0, 16.0, 13.0, 16.0, 12.0, 16.0, 15.0, 15.0, 10.0, 12.0, 20.0, 13.0, 8.0, 13.0, 9.0, 4.0, 7.0, 7.0, 7.0, 8.0, 13.0, 15.0, 10.0, 10.0, 13.0, 16.0, 21.0, 26.0, 38.0, 37.0, 35.0, 58.0, 58.0, 81.0, 106.0, 122.0, 146.0, 158.0, 195.0, 206.0, 214.0, 248.0, 281.0, 361.0, 405.0, 449.0, 442.0, 501.0, 562.0, 628.0, 669.0, 645.0, 723.0, 722.0, 794.0, 770.0, 803.0, 784.0, 833.0, 853.0, 827.0, 795.0, 769.0, 737.0, 762.0, 683.0, 710.0, 637.0, 598.0, 567.0, 515.0, 507.0, 396.0, 393.0, 350.0, 329.0, 255.0, 204.0, 183.0, 179.0, 152.0, 139.0, 109.0, 101.0, 77.0, 77.0, 69.0, 52.0, 46.0, 30.0, 26.0, 28.0, 28.0, 26.0, 16.0, 15.0, 5.0, 4.0, 7.0, 2.0, 2.0, 3.0, 1.0, 0.0, 0.0, 2.0, 0.0, 0.0, 0.0, 0.0, 0.0, 0.0, 0.0, 0.0, 0.0, 2.0, 0.0, 0.0, 0.0, 0.0, 0.0, 0.0, 0.0, 0.0, 0.0, 0.0, 0.0, 0.0, 0.0, 0.0, 0.0, 0.0, 0.0, 0.0, 0.0, 0.0, 0.0, 0.0, 0.0, 0.0, 0.0, 0.0, 0.0, 0.0, 0.0, 0.0, 0.0, 0.0, 0.0, 0.0, 0.0, 0.0, 0.0, 0.0, 0.0, 0.0, 0.0, 0.0, 0.0, 0.0, 0.0, 0.0, 0.0, 0.0, 0.0, 0.0, 0.0, 0.0, 0.0, 0.0, 0.0, 0.0, 0.0, 0.0, 0.0, 0.0, 0.0, 0.0, 0.0, 0.0, 0.0, 0.0, 0.0, 0.0, 0.0, 0.0, 0.0, 0.0, 0.0, 0.0, 0.0, 0.0, 0.0, 0.0, 0.0, 0.0, 0.0, 0.0, 0.0, 0.0, 0.0, 0.0, 0.0, 0.0, 0.0, 0.0, 0.0, 0.0, 0.0, 0.0, 0.0, 0.0, 0.0, 0.0, 0.0, 0.0],
    "Name": "ThresholdDist-0",
    "Overflow": 0.0,
    "Type": "Histo1d",
    "Underflow": 0.0,
    "x": {
        "AxisTitle": "Threshold [e]",
        "Bins": 339,
        "High": 3385.0,
        "Low": -5.0
    },
    "y": {
        "AxisTitle": "Number of Pixels"
    },
    "z": {
        "AxisTitle": "z"
    }
}