{
    "Data": [42.0, 41.0, 3.0, 4.0, 6.0, 13.0, 46.0, 158.0, 474.0, 1218.0, 2441.0, 4063.0, 5136.0, 4864.0, 4341.0, 3949.0, 4196.0, 4959.0, 5217.0, 4755.0, 3840.0, 2909.0, 2230.0, 1845.0, 1744.0, 1791.0, 1669.0, 1724.0, 1682.0, 1648.0, 1549.0, 1374.0, 1139.0, 1016.0, 879.0, 645.0, 480.0, 421.0, 345.0, 274.0, 206.0, 144.0, 113.0, 83.0, 74.0, 60.0, 48.0, 32.0, 30.0, 29.0, 26.0, 29.0, 25.0, 23.0, 21.0, 12.0, 14.0, 15.0, 12.0, 14.0],
    "Name": "NoiseDist-0",
    "Overflow": 123.0,
    "Type": "Histo1d",
    "Underflow": 0.0,
    "x": {
        "AxisTitle": "Noise [e]",
        "Bins": 60,
        "High": 301.0,
        "Low": -2.0
    },
    "y": {
        "AxisTitle": "Number of Pixels"
    },
    "z": {
        "AxisTitle": "z"
    }
}