{
    "Data": [530.0, 9793.0, 13205.0, 6667.0, 2664.0, 1339.0, 1322.0, 1633.0, 2160.0, 2408.0, 2406.0, 2185.0, 1843.0, 1392.0, 1060.0, 735.0, 598.0, 483.0, 411.0, 389.0, 327.0, 338.0, 290.0, 309.0, 275.0, 270.0, 285.0, 254.0, 241.0, 263.0, 257.0, 230.0, 224.0, 195.0, 206.0, 196.0, 168.0, 151.0, 140.0, 126.0, 125.0, 129.0, 96.0, 97.0, 89.0, 91.0, 94.0, 83.0, 56.0, 38.0, 26.0],
    "Name": "Chi2Dist-0",
    "Overflow": 0.0,
    "Type": "Histo1d",
    "Underflow": 0.0,
    "x": {
        "AxisTitle": "Fit Chi/ndf",
        "Bins": 51,
        "High": 2.5250000953674318,
        "Low": -0.02500000037252903
    },
    "y": {
        "AxisTitle": "Number of Pixels"
    },
    "z": {
        "AxisTitle": "z"
    }
}