time,Hardware,Voltage,Current
1626749075816,high-voltage,1,0.00744239
time,Hardware,Voltage,Current
1626749075816,high-voltage,2,0.0243741
time,Hardware,Voltage,Current
1626749075816,high-voltage,3,0.0337192
time,Hardware,Voltage,Current
1626749075816,high-voltage,4,0.0419537
time,Hardware,Voltage,Current
1626749075816,high-voltage,5,0.0477896
time,Hardware,Voltage,Current
1626749075816,high-voltage,6,0.0553678
time,Hardware,Voltage,Current
1626749075816,high-voltage,7,0.0623731
time,Hardware,Voltage,Current
1626749075816,high-voltage,8,0.0693141
time,Hardware,Voltage,Current
1626749075816,high-voltage,9,0.0747838
time,Hardware,Voltage,Current
1626749075816,high-voltage,10,0.080747
time,Hardware,Voltage,Current
1626749075816,high-voltage,11,0.0868621
time,Hardware,Voltage,Current
1626749075816,high-voltage,12,0.0908737
time,Hardware,Voltage,Current
1626749075816,high-voltage,13,0.0954076
time,Hardware,Voltage,Current
1626749075816,high-voltage,14,0.0976763
time,Hardware,Voltage,Current
1626749075816,high-voltage,15,0.101075
time,Hardware,Voltage,Current
1626749075816,high-voltage,16,0.104344
time,Hardware,Voltage,Current
1626749075816,high-voltage,17,0.108345
time,Hardware,Voltage,Current
1626749075816,high-voltage,18,0.110242
time,Hardware,Voltage,Current
1626749075816,high-voltage,19,0.114522
time,Hardware,Voltage,Current
1626749075816,high-voltage,20,0.117388
time,Hardware,Voltage,Current
1626749075816,high-voltage,25,0.131808
time,Hardware,Voltage,Current
1626749075816,high-voltage,30,0.149575
time,Hardware,Voltage,Current
1626749075816,high-voltage,35,0.190723
time,Hardware,Voltage,Current
1626749075816,high-voltage,40,0.319656
time,Hardware,Voltage,Current
1626749075816,high-voltage,45,0.626314
time,Hardware,Voltage,Current
1626749075816,high-voltage,50,1.21416
time,Hardware,Voltage,Current
1626749075816,high-voltage,55,2.18906
time,Hardware,Voltage,Current
1626749075816,high-voltage,60,3.66083
time,Hardware,Voltage,Current
1626749075816,high-voltage,65,5.71038
time,Hardware,Voltage,Current
1626749075816,high-voltage,70,8.48965
time,Hardware,Voltage,Current
1626749075816,high-voltage,75,10
