{
    "Data": [5.0, 1940.0, 12601.0, 17389.0, 12423.0, 5540.0, 1812.0, 528.0, 162.0, 103.0, 105.0, 121.0, 147.0, 167.0, 247.0, 252.0, 322.0, 392.0, 441.0, 469.0, 528.0, 529.0, 631.0, 576.0, 590.0, 624.0, 652.0, 700.0, 671.0, 666.0, 611.0, 629.0, 614.0, 622.0, 614.0, 603.0, 552.0, 537.0, 568.0, 504.0, 545.0, 530.0, 506.0, 460.0, 445.0, 463.0, 392.0, 345.0, 390.0, 363.0, 187.0],
    "Name": "Chi2Dist-0",
    "Overflow": 0.0,
    "Type": "Histo1d",
    "Underflow": 0.0,
    "x": {
        "AxisTitle": "Fit Chi/ndf",
        "Bins": 51,
        "High": 2.5250000953674318,
        "Low": -0.02500000037252903
    },
    "y": {
        "AxisTitle": "Number of Pixels"
    },
    "z": {
        "AxisTitle": "z"
    }
}