{
    "Data": [0.0, 0.0, 0.0, 0.0, 0.0, 0.0, 0.0, 0.0, 0.0, 0.0, 0.0, 0.0, 0.0, 0.0, 0.0, 0.0, 0.0, 0.0, 0.0, 0.0, 0.0, 0.0, 0.0, 0.0, 0.0, 0.0, 0.0, 0.0, 0.0, 0.0, 0.0, 0.0, 0.0, 0.0, 0.0, 0.0, 0.0, 0.0, 0.0, 0.0, 0.0, 0.0, 0.0, 0.0, 0.0, 0.0, 0.0, 0.0, 0.0, 0.0, 5.0, 9.0, 12.0, 8.0, 8.0, 17.0, 8.0, 11.0, 10.0, 6.0, 15.0, 19.0, 25.0, 38.0, 37.0, 50.0, 54.0, 90.0, 94.0, 110.0, 152.0, 219.0, 215.0, 277.0, 357.0, 437.0, 520.0, 601.0, 704.0, 792.0, 856.0, 1005.0, 1135.0, 1139.0, 1154.0, 1288.0, 1354.0, 1384.0, 1492.0, 1665.0, 1968.0, 2454.0, 2951.0, 3621.0, 4055.0, 4126.0, 3852.0, 3194.0, 2509.0, 1741.0, 1158.0, 746.0, 497.0, 320.0, 245.0, 162.0, 116.0, 93.0, 86.0, 62.0, 53.0, 39.0, 52.0, 37.0, 31.0, 29.0, 31.0, 29.0, 21.0, 18.0, 29.0, 28.0, 29.0, 12.0, 15.0, 19.0, 8.0, 18.0, 12.0, 7.0, 9.0, 5.0, 13.0, 7.0, 9.0, 14.0, 11.0, 15.0, 4.0, 9.0, 8.0, 8.0, 7.0, 7.0, 12.0, 9.0, 10.0, 10.0, 10.0, 15.0, 16.0, 21.0, 19.0, 26.0, 20.0, 41.0, 53.0, 59.0, 75.0, 70.0, 83.0, 106.0, 120.0, 149.0, 177.0, 238.0, 240.0, 267.0, 315.0, 354.0, 402.0, 430.0, 467.0, 501.0, 561.0, 564.0, 526.0, 637.0, 630.0, 645.0, 622.0, 690.0, 737.0, 682.0, 653.0, 662.0, 647.0, 657.0, 575.0, 531.0, 544.0, 560.0, 472.0, 477.0, 438.0, 406.0, 426.0, 344.0, 359.0, 329.0, 283.0, 321.0, 254.0, 257.0, 246.0, 201.0, 189.0, 185.0, 128.0, 128.0, 132.0, 118.0, 128.0, 110.0, 91.0, 93.0, 92.0, 86.0, 72.0, 60.0, 53.0, 78.0, 67.0, 54.0, 65.0, 68.0, 48.0, 40.0, 30.0, 27.0, 27.0, 32.0, 27.0, 21.0, 26.0, 22.0, 19.0, 16.0, 14.0, 13.0, 6.0, 12.0, 5.0, 10.0, 7.0, 9.0, 6.0, 6.0, 8.0, 4.0, 6.0, 7.0, 8.0, 2.0, 5.0, 3.0, 4.0, 4.0, 4.0, 2.0, 4.0, 4.0, 3.0, 1.0, 0.0, 0.0, 3.0, 0.0, 1.0, 0.0, 2.0, 1.0, 2.0, 2.0, 0.0, 0.0, 2.0, 3.0, 1.0, 2.0, 1.0, 0.0, 0.0, 0.0, 2.0, 1.0, 1.0, 0.0, 1.0, 0.0, 1.0, 3.0, 2.0, 2.0, 2.0, 4.0, 2.0, 0.0, 0.0, 0.0, 0.0, 0.0, 1.0, 2.0, 0.0, 3.0, 2.0, 1.0, 0.0, 1.0, 1.0, 0.0, 0.0, 0.0, 1.0, 2.0, 0.0, 0.0, 0.0, 1.0, 1.0, 0.0, 1.0, 0.0, 0.0, 1.0, 0.0, 0.0, 0.0, 0.0, 0.0, 0.0, 0.0, 0.0, 0.0, 0.0, 0.0, 0.0, 0.0, 0.0, 0.0, 0.0, 0.0, 0.0, 0.0, 0.0],
    "Name": "ThresholdDist-0",
    "Overflow": 0.0,
    "Type": "Histo1d",
    "Underflow": 0.0,
    "x": {
        "AxisTitle": "Threshold [e]",
        "Bins": 346,
        "High": 3455.0,
        "Low": -5.0
    },
    "y": {
        "AxisTitle": "Number of Pixels"
    },
    "z": {
        "AxisTitle": "z"
    }
}