{
    "Data": [[1255.0, 440.0, 210.0, 117.0, 93.0, 78.0, 54.0, 36.0, 39.0, 28.0, 20.0, 22.0, 18.0, 17.0, 14.0, 14.0, 14.0, 9.0, 13.0, 9.0, 9.0, 6.0, 9.0, 7.0, 5.0, 5.0, 5.0, 11.0, 9.0, 7.0, 10.0, 9.0, 6.0, 8.0, 11.0, 3.0, 3.0, 9.0, 8.0, 10.0, 6.0, 12.0, 4.0, 9.0, 6.0, 6.0, 14.0, 17.0, 23.0], [2421.0, 920.0, 509.0, 287.0, 196.0, 144.0, 121.0, 114.0, 65.0, 57.0, 53.0, 53.0, 40.0, 28.0, 45.0, 27.0, 25.0, 15.0, 17.0, 23.0, 20.0, 24.0, 8.0, 12.0, 9.0, 15.0, 16.0, 19.0, 14.0, 8.0, 12.0, 9.0, 13.0, 8.0, 10.0, 11.0, 9.0, 12.0, 8.0, 13.0, 15.0, 4.0, 9.0, 12.0, 11.0, 9.0, 9.0, 14.0, 25.0], [3719.0, 1695.0, 1002.0, 678.0, 471.0, 339.0, 254.0, 195.0, 173.0, 164.0, 132.0, 106.0, 94.0, 94.0, 70.0, 60.0, 53.0, 66.0, 56.0, 35.0, 47.0, 29.0, 30.0, 37.0, 29.0, 25.0, 18.0, 20.0, 26.0, 22.0, 20.0, 23.0, 17.0, 16.0, 23.0, 15.0, 17.0, 15.0, 13.0, 22.0, 15.0, 17.0, 14.0, 18.0, 14.0, 21.0, 24.0, 22.0, 30.0], [4236.0, 2350.0, 1621.0, 1223.0, 925.0, 721.0, 612.0, 498.0, 389.0, 344.0, 300.0, 259.0, 201.0, 198.0, 169.0, 163.0, 145.0, 124.0, 105.0, 101.0, 93.0, 85.0, 95.0, 72.0, 63.0, 83.0, 55.0, 43.0, 49.0, 47.0, 48.0, 44.0, 41.0, 35.0, 27.0, 37.0, 35.0, 27.0, 31.0, 33.0, 25.0, 28.0, 33.0, 24.0, 33.0, 38.0, 26.0, 41.0, 51.0], [4379.0, 2486.0, 1811.0, 1487.0, 1312.0, 1062.0, 885.0, 822.0, 753.0, 589.0, 562.0, 533.0, 454.0, 460.0, 387.0, 361.0, 300.0, 281.0, 286.0, 251.0, 238.0, 239.0, 197.0, 173.0, 205.0, 161.0, 141.0, 158.0, 121.0, 124.0, 118.0, 101.0, 87.0, 108.0, 79.0, 85.0, 77.0, 81.0, 74.0, 66.0, 56.0, 48.0, 64.0, 58.0, 52.0, 59.0, 68.0, 75.0, 79.0], [6496.0, 3168.0, 2135.0, 1589.0, 1313.0, 1181.0, 1091.0, 942.0, 885.0, 807.0, 782.0, 702.0, 743.0, 646.0, 581.0, 597.0, 504.0, 511.0, 468.0, 448.0, 430.0, 420.0, 421.0, 396.0, 406.0, 333.0, 336.0, 322.0, 288.0, 270.0, 254.0, 293.0, 241.0, 243.0, 204.0, 220.0, 197.0, 181.0, 198.0, 173.0, 182.0, 159.0, 150.0, 146.0, 142.0, 126.0, 128.0, 134.0, 170.0], [4962.0, 4236.0, 3500.0, 2806.0, 2338.0, 1828.0, 1612.0, 1357.0, 1135.0, 1004.0, 939.0, 906.0, 833.0, 758.0, 754.0, 727.0, 705.0, 614.0, 631.0, 611.0, 646.0, 619.0, 591.0, 613.0, 530.0, 511.0, 533.0, 521.0, 526.0, 499.0, 483.0, 456.0, 517.0, 492.0, 431.0, 445.0, 414.0, 444.0, 440.0, 391.0, 426.0, 376.0, 359.0, 359.0, 375.0, 355.0, 374.0, 350.0, 399.0], [961.0, 1063.0, 1203.0, 1411.0, 1446.0, 1555.0, 1538.0, 1635.0, 1545.0, 1554.0, 1537.0, 1551.0, 1462.0, 1358.0, 1306.0, 1300.0, 1187.0, 1194.0, 1106.0, 1039.0, 983.0, 871.0, 869.0, 819.0, 875.0, 777.0, 787.0, 780.0, 759.0, 737.0, 715.0, 698.0, 673.0, 682.0, 695.0, 689.0, 668.0, 713.0, 696.0, 715.0, 731.0, 717.0, 709.0, 806.0, 785.0, 824.0, 816.0, 886.0, 993.0], [248.0, 192.0, 189.0, 234.0, 228.0, 251.0, 287.0, 330.0, 395.0, 443.0, 411.0, 514.0, 557.0, 654.0, 709.0, 753.0, 781.0, 808.0, 847.0, 902.0, 977.0, 1029.0, 1075.0, 1100.0, 1216.0, 1155.0, 1244.0, 1195.0, 1228.0, 1222.0, 1290.0, 1280.0, 1249.0, 1299.0, 1290.0, 1226.0, 1240.0, 1278.0, 1301.0, 1318.0, 1229.0, 1254.0, 1311.0, 1336.0, 1372.0, 1489.0, 1601.0, 1749.0, 2276.0], [173.0, 86.0, 69.0, 66.0, 65.0, 82.0, 61.0, 75.0, 72.0, 95.0, 106.0, 106.0, 133.0, 123.0, 122.0, 137.0, 183.0, 166.0, 169.0, 206.0, 235.0, 278.0, 322.0, 313.0, 363.0, 411.0, 421.0, 462.0, 500.0, 582.0, 655.0, 712.0, 774.0, 895.0, 1004.0, 1150.0, 1194.0, 1360.0, 1476.0, 1582.0, 1763.0, 1890.0, 2151.0, 2536.0, 2531.0, 3029.0, 3197.0, 3729.0, 4622.0], [143.0, 80.0, 60.0, 35.0, 28.0, 32.0, 26.0, 33.0, 23.0, 37.0, 24.0, 33.0, 33.0, 42.0, 48.0, 45.0, 45.0, 55.0, 45.0, 57.0, 66.0, 57.0, 98.0, 84.0, 110.0, 96.0, 114.0, 123.0, 148.0, 143.0, 171.0, 200.0, 219.0, 226.0, 308.0, 342.0, 374.0, 436.0, 482.0, 609.0, 731.0, 942.0, 1111.0, 1446.0, 1811.0, 2405.0, 3412.0, 5130.0, 8336.0], [142.0, 71.0, 49.0, 33.0, 33.0, 24.0, 18.0, 25.0, 18.0, 12.0, 17.0, 15.0, 23.0, 17.0, 18.0, 18.0, 19.0, 22.0, 19.0, 18.0, 26.0, 25.0, 27.0, 25.0, 31.0, 34.0, 40.0, 42.0, 41.0, 58.0, 54.0, 76.0, 74.0, 94.0, 85.0, 83.0, 124.0, 168.0, 183.0, 197.0, 273.0, 329.0, 367.0, 515.0, 696.0, 970.0, 1506.0, 2667.0, 6578.0], [105.0, 70.0, 38.0, 21.0, 24.0, 17.0, 18.0, 13.0, 13.0, 18.0, 12.0, 14.0, 17.0, 9.0, 15.0, 11.0, 19.0, 19.0, 11.0, 10.0, 11.0, 17.0, 11.0, 13.0, 10.0, 16.0, 23.0, 16.0, 18.0, 15.0, 17.0, 22.0, 32.0, 31.0, 46.0, 44.0, 43.0, 54.0, 62.0, 78.0, 88.0, 119.0, 127.0, 224.0, 294.0, 347.0, 626.0, 1161.0, 3179.0], [114.0, 54.0, 40.0, 37.0, 20.0, 20.0, 13.0, 11.0, 6.0, 5.0, 9.0, 14.0, 9.0, 12.0, 6.0, 11.0, 9.0, 7.0, 6.0, 12.0, 8.0, 12.0, 12.0, 12.0, 11.0, 12.0, 11.0, 9.0, 13.0, 7.0, 19.0, 16.0, 17.0, 11.0, 11.0, 19.0, 26.0, 29.0, 26.0, 34.0, 28.0, 40.0, 49.0, 77.0, 98.0, 178.0, 250.0, 525.0, 1548.0], [110.0, 54.0, 42.0, 19.0, 14.0, 23.0, 18.0, 14.0, 10.0, 11.0, 8.0, 13.0, 10.0, 7.0, 3.0, 8.0, 2.0, 7.0, 5.0, 12.0, 8.0, 2.0, 8.0, 12.0, 16.0, 4.0, 5.0, 5.0, 6.0, 7.0, 15.0, 12.0, 10.0, 15.0, 9.0, 6.0, 11.0, 9.0, 16.0, 18.0, 20.0, 29.0, 24.0, 41.0, 48.0, 56.0, 103.0, 215.0, 715.0], [107.0, 40.0, 27.0, 31.0, 14.0, 18.0, 12.0, 6.0, 12.0, 7.0, 8.0, 9.0, 9.0, 13.0, 6.0, 8.0, 12.0, 3.0, 6.0, 5.0, 8.0, 6.0, 4.0, 9.0, 3.0, 7.0, 6.0, 7.0, 5.0, 7.0, 11.0, 6.0, 11.0, 7.0, 5.0, 11.0, 6.0, 11.0, 18.0, 4.0, 10.0, 18.0, 29.0, 17.0, 22.0, 38.0, 61.0, 88.0, 316.0], [86.0, 63.0, 28.0, 15.0, 16.0, 8.0, 11.0, 8.0, 11.0, 9.0, 5.0, 5.0, 3.0, 2.0, 4.0, 6.0, 2.0, 9.0, 8.0, 8.0, 14.0, 9.0, 5.0, 2.0, 4.0, 8.0, 4.0, 7.0, 11.0, 7.0, 9.0, 4.0, 3.0, 3.0, 11.0, 11.0, 7.0, 11.0, 9.0, 5.0, 13.0, 6.0, 22.0, 13.0, 23.0, 28.0, 30.0, 57.0, 176.0], [96.0, 47.0, 40.0, 18.0, 13.0, 10.0, 6.0, 7.0, 9.0, 6.0, 4.0, 3.0, 7.0, 3.0, 5.0, 0.0, 5.0, 2.0, 3.0, 6.0, 2.0, 6.0, 9.0, 5.0, 3.0, 6.0, 11.0, 7.0, 6.0, 6.0, 7.0, 7.0, 5.0, 6.0, 10.0, 12.0, 14.0, 5.0, 7.0, 7.0, 11.0, 7.0, 12.0, 10.0, 12.0, 16.0, 23.0, 33.0, 106.0], [98.0, 44.0, 24.0, 19.0, 11.0, 13.0, 3.0, 8.0, 5.0, 7.0, 5.0, 3.0, 4.0, 1.0, 1.0, 3.0, 5.0, 0.0, 3.0, 5.0, 3.0, 8.0, 2.0, 3.0, 9.0, 1.0, 4.0, 5.0, 5.0, 4.0, 8.0, 9.0, 10.0, 2.0, 10.0, 8.0, 2.0, 6.0, 7.0, 7.0, 2.0, 14.0, 9.0, 14.0, 12.0, 15.0, 21.0, 21.0, 61.0], [89.0, 59.0, 24.0, 12.0, 13.0, 6.0, 4.0, 2.0, 11.0, 3.0, 1.0, 7.0, 2.0, 4.0, 7.0, 5.0, 3.0, 1.0, 4.0, 3.0, 1.0, 3.0, 5.0, 4.0, 2.0, 3.0, 1.0, 3.0, 3.0, 0.0, 7.0, 5.0, 2.0, 4.0, 4.0, 7.0, 8.0, 6.0, 10.0, 6.0, 7.0, 11.0, 12.0, 14.0, 11.0, 14.0, 9.0, 25.0, 54.0], [110.0, 40.0, 22.0, 12.0, 13.0, 8.0, 8.0, 8.0, 3.0, 4.0, 2.0, 5.0, 3.0, 5.0, 6.0, 2.0, 2.0, 1.0, 0.0, 0.0, 4.0, 4.0, 6.0, 2.0, 3.0, 3.0, 2.0, 1.0, 1.0, 5.0, 1.0, 0.0, 5.0, 6.0, 3.0, 7.0, 6.0, 2.0, 4.0, 7.0, 5.0, 4.0, 8.0, 7.0, 7.0, 17.0, 18.0, 15.0, 44.0], [90.0, 40.0, 21.0, 18.0, 10.0, 8.0, 6.0, 7.0, 5.0, 4.0, 3.0, 4.0, 5.0, 3.0, 1.0, 5.0, 3.0, 1.0, 3.0, 1.0, 3.0, 1.0, 1.0, 1.0, 4.0, 2.0, 2.0, 1.0, 0.0, 3.0, 3.0, 3.0, 1.0, 4.0, 5.0, 4.0, 6.0, 4.0, 6.0, 5.0, 4.0, 5.0, 4.0, 4.0, 4.0, 11.0, 12.0, 20.0, 38.0], [89.0, 35.0, 21.0, 16.0, 13.0, 13.0, 7.0, 6.0, 6.0, 5.0, 3.0, 1.0, 3.0, 2.0, 2.0, 1.0, 6.0, 6.0, 1.0, 1.0, 3.0, 4.0, 0.0, 1.0, 1.0, 2.0, 2.0, 4.0, 1.0, 0.0, 2.0, 4.0, 3.0, 2.0, 5.0, 1.0, 5.0, 5.0, 3.0, 3.0, 6.0, 1.0, 2.0, 3.0, 3.0, 7.0, 7.0, 12.0, 31.0], [98.0, 31.0, 22.0, 13.0, 10.0, 9.0, 3.0, 7.0, 3.0, 7.0, 5.0, 5.0, 2.0, 2.0, 3.0, 2.0, 3.0, 1.0, 0.0, 2.0, 0.0, 1.0, 2.0, 2.0, 2.0, 4.0, 3.0, 0.0, 1.0, 6.0, 1.0, 5.0, 3.0, 2.0, 5.0, 2.0, 1.0, 2.0, 7.0, 3.0, 0.0, 5.0, 5.0, 3.0, 4.0, 3.0, 3.0, 10.0, 19.0], [105.0, 42.0, 30.0, 13.0, 13.0, 7.0, 4.0, 7.0, 6.0, 2.0, 6.0, 2.0, 0.0, 1.0, 1.0, 4.0, 1.0, 1.0, 1.0, 1.0, 0.0, 0.0, 1.0, 1.0, 0.0, 2.0, 0.0, 4.0, 1.0, 2.0, 2.0, 2.0, 1.0, 2.0, 1.0, 6.0, 2.0, 5.0, 2.0, 4.0, 2.0, 5.0, 5.0, 3.0, 2.0, 2.0, 2.0, 8.0, 21.0], [99.0, 43.0, 19.0, 13.0, 18.0, 5.0, 9.0, 5.0, 7.0, 4.0, 4.0, 5.0, 3.0, 3.0, 4.0, 3.0, 0.0, 2.0, 1.0, 1.0, 1.0, 4.0, 0.0, 2.0, 0.0, 1.0, 4.0, 3.0, 2.0, 1.0, 1.0, 1.0, 2.0, 1.0, 1.0, 2.0, 3.0, 2.0, 2.0, 1.0, 1.0, 4.0, 4.0, 5.0, 3.0, 3.0, 5.0, 3.0, 9.0], [102.0, 47.0, 18.0, 18.0, 5.0, 10.0, 7.0, 1.0, 4.0, 2.0, 5.0, 6.0, 1.0, 3.0, 4.0, 2.0, 5.0, 2.0, 0.0, 1.0, 3.0, 3.0, 1.0, 0.0, 3.0, 0.0, 1.0, 3.0, 1.0, 1.0, 2.0, 5.0, 2.0, 3.0, 4.0, 1.0, 1.0, 1.0, 1.0, 1.0, 1.0, 1.0, 6.0, 0.0, 4.0, 1.0, 3.0, 6.0, 9.0], [86.0, 52.0, 25.0, 12.0, 6.0, 9.0, 6.0, 3.0, 3.0, 4.0, 5.0, 5.0, 3.0, 0.0, 3.0, 3.0, 3.0, 2.0, 2.0, 1.0, 1.0, 1.0, 0.0, 1.0, 4.0, 0.0, 2.0, 5.0, 0.0, 1.0, 1.0, 0.0, 2.0, 3.0, 1.0, 2.0, 4.0, 5.0, 3.0, 1.0, 1.0, 3.0, 1.0, 1.0, 3.0, 2.0, 1.0, 4.0, 4.0], [85.0, 49.0, 28.0, 12.0, 12.0, 6.0, 8.0, 3.0, 2.0, 3.0, 3.0, 6.0, 5.0, 3.0, 2.0, 0.0, 0.0, 2.0, 2.0, 4.0, 2.0, 1.0, 2.0, 3.0, 2.0, 1.0, 5.0, 2.0, 3.0, 1.0, 1.0, 3.0, 1.0, 1.0, 1.0, 4.0, 1.0, 5.0, 0.0, 0.0, 2.0, 2.0, 0.0, 1.0, 3.0, 2.0, 1.0, 0.0, 7.0], [90.0, 43.0, 21.0, 17.0, 13.0, 7.0, 8.0, 7.0, 1.0, 1.0, 3.0, 2.0, 4.0, 2.0, 4.0, 2.0, 1.0, 2.0, 0.0, 0.0, 4.0, 2.0, 5.0, 0.0, 2.0, 0.0, 0.0, 1.0, 1.0, 3.0, 2.0, 5.0, 2.0, 1.0, 0.0, 1.0, 2.0, 2.0, 5.0, 2.0, 6.0, 1.0, 2.0, 1.0, 5.0, 3.0, 0.0, 1.0, 0.0], [103.0, 37.0, 26.0, 17.0, 9.0, 4.0, 7.0, 4.0, 1.0, 6.0, 3.0, 4.0, 4.0, 2.0, 1.0, 1.0, 1.0, 4.0, 2.0, 3.0, 2.0, 2.0, 1.0, 1.0, 1.0, 1.0, 0.0, 0.0, 1.0, 1.0, 3.0, 2.0, 2.0, 0.0, 2.0, 2.0, 3.0, 2.0, 2.0, 3.0, 2.0, 3.0, 1.0, 1.0, 4.0, 4.0, 5.0, 5.0, 1.0], [105.0, 42.0, 26.0, 16.0, 12.0, 9.0, 5.0, 3.0, 3.0, 0.0, 4.0, 4.0, 1.0, 1.0, 5.0, 2.0, 1.0, 3.0, 2.0, 1.0, 2.0, 2.0, 1.0, 2.0, 1.0, 1.0, 3.0, 2.0, 2.0, 2.0, 0.0, 1.0, 3.0, 0.0, 2.0, 3.0, 1.0, 2.0, 4.0, 0.0, 3.0, 1.0, 5.0, 4.0, 2.0, 1.0, 3.0, 6.0, 6.0], [95.0, 38.0, 31.0, 10.0, 8.0, 10.0, 7.0, 6.0, 6.0, 4.0, 0.0, 2.0, 1.0, 3.0, 2.0, 3.0, 0.0, 2.0, 1.0, 2.0, 2.0, 0.0, 2.0, 1.0, 4.0, 5.0, 2.0, 2.0, 1.0, 1.0, 2.0, 1.0, 1.0, 2.0, 1.0, 3.0, 2.0, 2.0, 1.0, 3.0, 4.0, 1.0, 1.0, 2.0, 1.0, 2.0, 2.0, 3.0, 4.0], [103.0, 40.0, 20.0, 18.0, 13.0, 8.0, 4.0, 3.0, 5.0, 1.0, 3.0, 4.0, 2.0, 2.0, 2.0, 5.0, 1.0, 1.0, 0.0, 3.0, 3.0, 3.0, 2.0, 0.0, 1.0, 4.0, 2.0, 1.0, 1.0, 4.0, 6.0, 4.0, 0.0, 2.0, 0.0, 1.0, 1.0, 2.0, 1.0, 1.0, 2.0, 2.0, 3.0, 1.0, 1.0, 4.0, 2.0, 1.0, 3.0], [73.0, 47.0, 23.0, 22.0, 13.0, 8.0, 5.0, 3.0, 4.0, 3.0, 2.0, 2.0, 1.0, 3.0, 3.0, 1.0, 4.0, 4.0, 0.0, 3.0, 2.0, 2.0, 1.0, 2.0, 1.0, 2.0, 0.0, 3.0, 4.0, 4.0, 2.0, 1.0, 0.0, 2.0, 2.0, 0.0, 3.0, 0.0, 1.0, 0.0, 4.0, 1.0, 3.0, 1.0, 5.0, 3.0, 2.0, 1.0, 4.0], [91.0, 42.0, 22.0, 9.0, 11.0, 8.0, 7.0, 4.0, 1.0, 6.0, 3.0, 5.0, 5.0, 0.0, 3.0, 3.0, 1.0, 1.0, 1.0, 1.0, 2.0, 1.0, 3.0, 3.0, 3.0, 1.0, 2.0, 1.0, 2.0, 2.0, 0.0, 4.0, 3.0, 1.0, 1.0, 2.0, 4.0, 4.0, 2.0, 0.0, 3.0, 1.0, 1.0, 2.0, 3.0, 2.0, 3.0, 2.0, 2.0], [94.0, 43.0, 23.0, 18.0, 6.0, 8.0, 6.0, 7.0, 3.0, 5.0, 7.0, 2.0, 1.0, 4.0, 3.0, 2.0, 1.0, 2.0, 1.0, 0.0, 4.0, 0.0, 1.0, 4.0, 4.0, 2.0, 3.0, 0.0, 4.0, 1.0, 3.0, 2.0, 2.0, 3.0, 2.0, 1.0, 2.0, 2.0, 3.0, 3.0, 0.0, 2.0, 1.0, 0.0, 1.0, 0.0, 3.0, 4.0, 3.0], [84.0, 39.0, 34.0, 18.0, 14.0, 7.0, 6.0, 2.0, 1.0, 6.0, 3.0, 5.0, 2.0, 0.0, 1.0, 3.0, 1.0, 1.0, 0.0, 2.0, 2.0, 0.0, 3.0, 1.0, 4.0, 4.0, 2.0, 2.0, 1.0, 2.0, 3.0, 1.0, 1.0, 2.0, 3.0, 0.0, 1.0, 1.0, 3.0, 4.0, 1.0, 2.0, 1.0, 2.0, 4.0, 2.0, 1.0, 5.0, 2.0], [92.0, 39.0, 21.0, 20.0, 9.0, 11.0, 7.0, 6.0, 2.0, 5.0, 4.0, 3.0, 2.0, 4.0, 1.0, 2.0, 1.0, 0.0, 3.0, 5.0, 2.0, 1.0, 1.0, 2.0, 0.0, 2.0, 4.0, 1.0, 2.0, 0.0, 2.0, 3.0, 0.0, 0.0, 2.0, 0.0, 2.0, 0.0, 4.0, 0.0, 1.0, 4.0, 3.0, 4.0, 0.0, 3.0, 5.0, 2.0, 5.0], [93.0, 41.0, 26.0, 17.0, 9.0, 10.0, 9.0, 3.0, 7.0, 10.0, 0.0, 1.0, 0.0, 4.0, 0.0, 2.0, 1.0, 1.0, 0.0, 1.0, 0.0, 1.0, 4.0, 1.0, 3.0, 1.0, 3.0, 0.0, 5.0, 1.0, 1.0, 0.0, 2.0, 0.0, 4.0, 3.0, 2.0, 2.0, 4.0, 1.0, 3.0, 2.0, 5.0, 3.0, 2.0, 1.0, 1.0, 1.0, 6.0], [110.0, 24.0, 27.0, 19.0, 15.0, 6.0, 5.0, 8.0, 6.0, 1.0, 0.0, 5.0, 4.0, 0.0, 3.0, 0.0, 3.0, 1.0, 0.0, 0.0, 1.0, 2.0, 2.0, 2.0, 4.0, 1.0, 1.0, 2.0, 1.0, 2.0, 4.0, 3.0, 3.0, 1.0, 2.0, 1.0, 1.0, 1.0, 2.0, 5.0, 2.0, 2.0, 4.0, 4.0, 1.0, 0.0, 1.0, 3.0, 1.0], [91.0, 40.0, 24.0, 18.0, 7.0, 15.0, 4.0, 6.0, 1.0, 1.0, 3.0, 4.0, 2.0, 1.0, 5.0, 3.0, 1.0, 1.0, 1.0, 4.0, 2.0, 0.0, 2.0, 4.0, 0.0, 1.0, 3.0, 0.0, 0.0, 4.0, 1.0, 3.0, 4.0, 4.0, 1.0, 1.0, 1.0, 4.0, 0.0, 1.0, 0.0, 3.0, 2.0, 4.0, 2.0, 2.0, 2.0, 4.0, 1.0], [102.0, 38.0, 29.0, 15.0, 6.0, 7.0, 9.0, 8.0, 6.0, 0.0, 2.0, 4.0, 2.0, 4.0, 1.0, 1.0, 2.0, 2.0, 1.0, 1.0, 1.0, 3.0, 2.0, 2.0, 1.0, 1.0, 4.0, 2.0, 1.0, 2.0, 2.0, 0.0, 1.0, 1.0, 3.0, 1.0, 1.0, 5.0, 1.0, 4.0, 2.0, 2.0, 1.0, 2.0, 2.0, 3.0, 4.0, 4.0, 6.0], [105.0, 36.0, 28.0, 18.0, 8.0, 4.0, 3.0, 6.0, 7.0, 3.0, 6.0, 2.0, 3.0, 2.0, 2.0, 0.0, 0.0, 3.0, 1.0, 6.0, 1.0, 0.0, 2.0, 4.0, 1.0, 3.0, 2.0, 1.0, 2.0, 1.0, 1.0, 0.0, 2.0, 1.0, 1.0, 3.0, 2.0, 1.0, 3.0, 2.0, 5.0, 1.0, 2.0, 5.0, 3.0, 1.0, 2.0, 5.0, 4.0], [88.0, 51.0, 37.0, 16.0, 8.0, 4.0, 4.0, 5.0, 3.0, 3.0, 2.0, 1.0, 2.0, 3.0, 1.0, 2.0, 0.0, 3.0, 1.0, 4.0, 2.0, 1.0, 1.0, 0.0, 1.0, 3.0, 3.0, 0.0, 2.0, 0.0, 1.0, 2.0, 6.0, 1.0, 1.0, 3.0, 2.0, 3.0, 5.0, 4.0, 2.0, 2.0, 1.0, 2.0, 2.0, 1.0, 2.0, 2.0, 2.0], [99.0, 46.0, 27.0, 21.0, 8.0, 12.0, 1.0, 5.0, 3.0, 2.0, 5.0, 3.0, 4.0, 1.0, 2.0, 1.0, 1.0, 2.0, 0.0, 4.0, 1.0, 2.0, 1.0, 2.0, 2.0, 0.0, 2.0, 2.0, 1.0, 7.0, 6.0, 1.0, 0.0, 1.0, 0.0, 4.0, 2.0, 0.0, 1.0, 1.0, 1.0, 3.0, 2.0, 1.0, 2.0, 4.0, 1.0, 6.0, 0.0], [99.0, 41.0, 21.0, 15.0, 8.0, 8.0, 7.0, 8.0, 3.0, 4.0, 6.0, 1.0, 3.0, 1.0, 0.0, 3.0, 1.0, 3.0, 2.0, 0.0, 2.0, 2.0, 2.0, 0.0, 2.0, 2.0, 2.0, 0.0, 1.0, 2.0, 0.0, 3.0, 0.0, 4.0, 3.0, 2.0, 0.0, 1.0, 5.0, 2.0, 4.0, 1.0, 5.0, 3.0, 3.0, 4.0, 5.0, 0.0, 2.0], [92.0, 36.0, 27.0, 9.0, 19.0, 6.0, 7.0, 7.0, 2.0, 3.0, 3.0, 5.0, 1.0, 1.0, 1.0, 4.0, 1.0, 1.0, 1.0, 1.0, 2.0, 3.0, 4.0, 3.0, 3.0, 1.0, 0.0, 2.0, 1.0, 1.0, 2.0, 0.0, 3.0, 2.0, 2.0, 1.0, 3.0, 2.0, 1.0, 1.0, 3.0, 1.0, 4.0, 1.0, 5.0, 4.0, 4.0, 3.0, 1.0], [102.0, 36.0, 22.0, 23.0, 6.0, 10.0, 7.0, 4.0, 6.0, 1.0, 2.0, 3.0, 3.0, 1.0, 1.0, 2.0, 3.0, 2.0, 1.0, 2.0, 3.0, 1.0, 1.0, 1.0, 2.0, 2.0, 1.0, 3.0, 2.0, 3.0, 1.0, 2.0, 1.0, 4.0, 2.0, 6.0, 1.0, 2.0, 1.0, 0.0, 2.0, 2.0, 0.0, 3.0, 2.0, 3.0, 2.0, 2.0, 4.0], [95.0, 41.0, 23.0, 14.0, 16.0, 5.0, 5.0, 5.0, 8.0, 4.0, 4.0, 2.0, 3.0, 1.0, 2.0, 0.0, 2.0, 1.0, 2.0, 1.0, 1.0, 1.0, 1.0, 1.0, 0.0, 1.0, 3.0, 4.0, 2.0, 2.0, 1.0, 1.0, 3.0, 2.0, 0.0, 1.0, 1.0, 0.0, 1.0, 3.0, 1.0, 4.0, 3.0, 3.0, 5.0, 5.0, 5.0, 2.0, 5.0], [85.0, 48.0, 24.0, 11.0, 12.0, 13.0, 3.0, 5.0, 1.0, 4.0, 5.0, 6.0, 2.0, 0.0, 2.0, 1.0, 5.0, 2.0, 1.0, 0.0, 1.0, 4.0, 0.0, 1.0, 1.0, 0.0, 2.0, 0.0, 2.0, 2.0, 2.0, 1.0, 1.0, 4.0, 1.0, 0.0, 4.0, 5.0, 3.0, 0.0, 1.0, 6.0, 0.0, 2.0, 4.0, 2.0, 6.0, 3.0, 2.0]],
    "Name": "sCurve-0",
    "Overflow": 2093002.0,
    "Type": "Histo2d",
    "Underflow": 0.0,
    "x": {
        "AxisTitle": "Vcal",
        "Bins": 51,
        "High": 302.5,
        "Low": 47.5
    },
    "y": {
        "AxisTitle": "Occupancy",
        "Bins": 49,
        "High": 49.5,
        "Low": 0.5
    },
    "z": {
        "AxisTitle": "Number of pixels"
    }
}