{
    "Data": [5.0, 0.0, 0.0, 0.0, 4.0, 25.0, 51.0, 69.0, 141.0, 395.0, 858.0, 1819.0, 3129.0, 4217.0, 4886.0, 4262.0, 3330.0, 2729.0, 2829.0, 3434.0, 4152.0, 4345.0, 3958.0, 2969.0, 1979.0, 1113.0, 640.0, 348.0, 240.0, 258.0, 288.0, 345.0, 484.0, 701.0, 885.0, 1225.0, 1469.0, 1651.0, 1838.0, 1928.0, 1931.0, 1818.0, 1786.0, 1544.0, 1311.0, 1140.0, 897.0, 676.0, 525.0, 372.0, 307.0, 221.0, 178.0, 124.0, 94.0, 78.0, 73.0, 55.0, 54.0, 42.0, 26.0, 36.0, 29.0, 16.0, 20.0, 18.0, 15.0, 19.0, 12.0, 15.0, 6.0, 18.0, 12.0, 5.0, 9.0, 9.0, 4.0, 8.0, 3.0, 5.0, 4.0, 3.0, 3.0, 6.0, 3.0, 3.0],
    "Name": "NoiseDist-0",
    "Overflow": 33.0,
    "Type": "Histo1d",
    "Underflow": 0.0,
    "x": {
        "AxisTitle": "Noise [e]",
        "Bins": 86,
        "High": 431.0,
        "Low": -2.0
    },
    "y": {
        "AxisTitle": "Number of Pixels"
    },
    "z": {
        "AxisTitle": "z"
    }
}