time,Hardware,Voltage,Current
1621983357710,high-voltage,1,0.0632058
time,Hardware,Voltage,Current
1621983357710,high-voltage,2,0.135849
time,Hardware,Voltage,Current
1621983357710,high-voltage,3,0.251143
time,Hardware,Voltage,Current
1621983357710,high-voltage,4,0.391155
time,Hardware,Voltage,Current
1621983357710,high-voltage,5,0.593206
time,Hardware,Voltage,Current
1621983357710,high-voltage,6,0.829586
time,Hardware,Voltage,Current
1621983357710,high-voltage,7,1.1492
time,Hardware,Voltage,Current
1621983357710,high-voltage,8,1.5325
time,Hardware,Voltage,Current
1621983357710,high-voltage,9,2.02401
time,Hardware,Voltage,Current
1621983357710,high-voltage,10,2.59235
time,Hardware,Voltage,Current
1621983357710,high-voltage,11,3.28637
time,Hardware,Voltage,Current
1621983357710,high-voltage,12,3.99988
time,Hardware,Voltage,Current
1621983357710,high-voltage,13,5.06068
time,Hardware,Voltage,Current
1621983357710,high-voltage,14,6.12881
time,Hardware,Voltage,Current
1621983357710,high-voltage,15,7.44901
time,Hardware,Voltage,Current
1621983357710,high-voltage,16,8.78582
time,Hardware,Voltage,Current
1621983357710,high-voltage,17,9.56389
time,Hardware,Voltage,Current
1621983357710,high-voltage,18,10.0001
