time,Hardware,Voltage,Current
1623309594477,high-voltage,1,0.057338
time,Hardware,Voltage,Current
1623309594477,high-voltage,2,0.0708831
time,Hardware,Voltage,Current
1623309594477,high-voltage,3,0.0824267
time,Hardware,Voltage,Current
1623309594477,high-voltage,4,0.091727
time,Hardware,Voltage,Current
1623309594477,high-voltage,5,0.100806
time,Hardware,Voltage,Current
1623309594477,high-voltage,6,0.111957
time,Hardware,Voltage,Current
1623309594477,high-voltage,7,0.122561
time,Hardware,Voltage,Current
1623309594477,high-voltage,8,0.132886
time,Hardware,Voltage,Current
1623309594477,high-voltage,9,0.143737
time,Hardware,Voltage,Current
1623309594477,high-voltage,10,0.154603
time,Hardware,Voltage,Current
1623309594477,high-voltage,11,0.164625
time,Hardware,Voltage,Current
1623309594477,high-voltage,12,0.17366
time,Hardware,Voltage,Current
1623309594477,high-voltage,13,0.181039
time,Hardware,Voltage,Current
1623309594477,high-voltage,14,0.187326
time,Hardware,Voltage,Current
1623309594477,high-voltage,15,0.194126
time,Hardware,Voltage,Current
1623309594477,high-voltage,16,0.200263
time,Hardware,Voltage,Current
1623309594477,high-voltage,17,0.2056
time,Hardware,Voltage,Current
1623309594477,high-voltage,18,0.210283
time,Hardware,Voltage,Current
1623309594477,high-voltage,19,0.215283
time,Hardware,Voltage,Current
1623309594477,high-voltage,20,0.218801
time,Hardware,Voltage,Current
1623309594477,high-voltage,25,0.243039
time,Hardware,Voltage,Current
1623309594477,high-voltage,30,0.275979
time,Hardware,Voltage,Current
1623309594477,high-voltage,35,0.382211
time,Hardware,Voltage,Current
1623309594477,high-voltage,40,0.698459
time,Hardware,Voltage,Current
1623309594477,high-voltage,45,1.24976
time,Hardware,Voltage,Current
1623309594477,high-voltage,50,1.97011
time,Hardware,Voltage,Current
1623309594477,high-voltage,55,2.84154
time,Hardware,Voltage,Current
1623309594477,high-voltage,60,3.86147
time,Hardware,Voltage,Current
1623309594477,high-voltage,65,5.03295
time,Hardware,Voltage,Current
1623309594477,high-voltage,70,6.37464
time,Hardware,Voltage,Current
1623309594477,high-voltage,75,7.90934
time,Hardware,Voltage,Current
1623309594477,high-voltage,80,9.65079
time,Hardware,Voltage,Current
1623309594477,high-voltage,1e-05,10
