time,Hardware,Voltage,Current
1623282761427,high-voltage,1,0.0273839
time,Hardware,Voltage,Current
1623282761427,high-voltage,2,0.0360951
time,Hardware,Voltage,Current
1623282761427,high-voltage,3,0.0447885
time,Hardware,Voltage,Current
1623282761427,high-voltage,4,0.0519265
time,Hardware,Voltage,Current
1623282761427,high-voltage,5,0.058268
time,Hardware,Voltage,Current
1623282761427,high-voltage,6,0.0644611
time,Hardware,Voltage,Current
1623282761427,high-voltage,7,0.068909
time,Hardware,Voltage,Current
1623282761427,high-voltage,8,0.0736465
time,Hardware,Voltage,Current
1623282761427,high-voltage,9,0.0786213
time,Hardware,Voltage,Current
1623282761427,high-voltage,10,0.082275
time,Hardware,Voltage,Current
1623282761427,high-voltage,11,0.0852888
time,Hardware,Voltage,Current
1623282761427,high-voltage,12,0.0886738
time,Hardware,Voltage,Current
1623282761427,high-voltage,13,0.0918623
time,Hardware,Voltage,Current
1623282761427,high-voltage,14,0.0942373
time,Hardware,Voltage,Current
1623282761427,high-voltage,15,0.0958001
time,Hardware,Voltage,Current
1623282761427,high-voltage,16,0.098544
time,Hardware,Voltage,Current
1623282761427,high-voltage,17,0.100078
time,Hardware,Voltage,Current
1623282761427,high-voltage,18,0.103538
time,Hardware,Voltage,Current
1623282761427,high-voltage,19,0.10497
time,Hardware,Voltage,Current
1623282761427,high-voltage,20,0.108185
time,Hardware,Voltage,Current
1623282761427,high-voltage,25,0.119005
time,Hardware,Voltage,Current
1623282761427,high-voltage,30,0.134424
time,Hardware,Voltage,Current
1623282761427,high-voltage,35,0.185695
time,Hardware,Voltage,Current
1623282761427,high-voltage,40,0.366297
time,Hardware,Voltage,Current
1623282761427,high-voltage,45,0.746081
time,Hardware,Voltage,Current
1623282761427,high-voltage,50,1.29575
time,Hardware,Voltage,Current
1623282761427,high-voltage,55,2.00161
time,Hardware,Voltage,Current
1623282761427,high-voltage,60,2.84343
time,Hardware,Voltage,Current
1623282761427,high-voltage,65,3.82964
time,Hardware,Voltage,Current
1623282761427,high-voltage,70,4.94526
time,Hardware,Voltage,Current
1623282761427,high-voltage,75,6.23101
time,Hardware,Voltage,Current
1623282761427,high-voltage,80,7.67491
time,Hardware,Voltage,Current
1623282761427,high-voltage,85,9.30451
time,Hardware,Voltage,Current
1623282761427,high-voltage,90,10
