{
    "Data": [0.0, 0.0, 0.0, 0.0, 0.0, 0.0, 0.0, 0.0, 0.0, 0.0, 0.0, 0.0, 0.0, 0.0, 0.0, 0.0, 0.0, 2.0, 0.0, 3.0, 0.0, 3.0, 0.0, 11.0, 27.0, 1.0, 22.0, 12.0, 24.0, 44.0, 37.0, 45.0, 15.0, 7.0, 50.0, 31.0, 27.0, 50.0, 50.0, 50.0, 50.0, 0.0, 50.0, 24.0, 50.0, 22.0, 21.0, 16.0, 50.0, 50.0, 3.0],
    "Name": "Scurve-40-96",
    "Overflow": 0.0,
    "Type": "Histo1d",
    "Underflow": 0.0,
    "x": {
        "AxisTitle": "Vcal",
        "Bins": 51,
        "High": 302.5,
        "Low": 47.5
    },
    "y": {
        "AxisTitle": "Occupancy"
    },
    "z": {
        "AxisTitle": "z"
    }
}