time,Hardware,Voltage,Current
1621479614322,high-voltage-2,1,0.114032
time,Hardware,Voltage,Current
1621479614322,high-voltage-2,2,0.143586
time,Hardware,Voltage,Current
1621479614322,high-voltage-2,3,0.159286
time,Hardware,Voltage,Current
1621479614322,high-voltage-2,4,0.172816
time,Hardware,Voltage,Current
1621479614322,high-voltage-2,5,0.184829
time,Hardware,Voltage,Current
1621479614322,high-voltage-2,6,0.198888
time,Hardware,Voltage,Current
1621479614322,high-voltage-2,7,0.212751
time,Hardware,Voltage,Current
1621479614322,high-voltage-2,8,0.23131
time,Hardware,Voltage,Current
1621479614322,high-voltage-2,9,0.248674
time,Hardware,Voltage,Current
1621479614322,high-voltage-2,10,0.272596
time,Hardware,Voltage,Current
1621479614322,high-voltage-2,11,0.294118
time,Hardware,Voltage,Current
1621479614322,high-voltage-2,12,0.316569
time,Hardware,Voltage,Current
1621479614322,high-voltage-2,13,0.337645
time,Hardware,Voltage,Current
1621479614322,high-voltage-2,14,0.358531
time,Hardware,Voltage,Current
1621479614322,high-voltage-2,15,0.379185
time,Hardware,Voltage,Current
1621479614322,high-voltage-2,16,0.399844
time,Hardware,Voltage,Current
1621479614322,high-voltage-2,17,0.418566
time,Hardware,Voltage,Current
1621479614322,high-voltage-2,18,0.436516
time,Hardware,Voltage,Current
1621479614322,high-voltage-2,19,0.448355
time,Hardware,Voltage,Current
1621479614322,high-voltage-2,20,0.461838
time,Hardware,Voltage,Current
1621479614322,high-voltage-2,25,0.517657
time,Hardware,Voltage,Current
1621479614322,high-voltage-2,30,0.56976
time,Hardware,Voltage,Current
1621479614322,high-voltage-2,35,0.620684
time,Hardware,Voltage,Current
1621479614322,high-voltage-2,40,0.678457
time,Hardware,Voltage,Current
1621479614322,high-voltage-2,45,0.750275
time,Hardware,Voltage,Current
1621479614322,high-voltage-2,50,0.800373
time,Hardware,Voltage,Current
1621479614322,high-voltage-2,55,0.843869
time,Hardware,Voltage,Current
1621479614322,high-voltage-2,60,0.888424
time,Hardware,Voltage,Current
1621479614322,high-voltage-2,65,0.93257
time,Hardware,Voltage,Current
1621479614322,high-voltage-2,70,0.973831
time,Hardware,Voltage,Current
1621479614322,high-voltage-2,75,1.01228
time,Hardware,Voltage,Current
1621479614322,high-voltage-2,80,1.05177
time,Hardware,Voltage,Current
1621479614322,high-voltage-2,85,1.08913
time,Hardware,Voltage,Current
1621479614322,high-voltage-2,90,1.12683
time,Hardware,Voltage,Current
1621479614322,high-voltage-2,95,1.16348
time,Hardware,Voltage,Current
1621479614322,high-voltage-2,100,1.19797
