{
    "Data": [5.0, 4.0, 2.0, 3.0, 4.0, 5.0, 24.0, 135.0, 439.0, 1221.0, 2618.0, 4039.0, 4881.0, 4681.0, 3951.0, 3334.0, 3905.0, 4177.0, 4337.0, 4170.0, 3251.0, 2305.0, 1585.0, 1003.0, 723.0, 711.0, 765.0, 940.0, 1142.0, 1332.0, 1455.0, 1664.0, 1632.0, 1650.0, 1561.0, 1457.0, 1288.0, 1172.0, 1023.0, 894.0, 771.0, 672.0, 544.0, 448.0, 380.0, 308.0, 222.0, 182.0, 150.0, 120.0, 106.0, 87.0, 68.0, 45.0, 55.0, 46.0, 34.0, 37.0, 31.0, 26.0, 20.0, 15.0, 7.0, 10.0, 13.0, 9.0, 13.0, 2.0, 6.0, 8.0, 4.0, 7.0],
    "Name": "NoiseDist-0",
    "Overflow": 76.0,
    "Type": "Histo1d",
    "Underflow": 0.0,
    "x": {
        "AxisTitle": "Noise [e]",
        "Bins": 72,
        "High": 361.0,
        "Low": -2.0
    },
    "y": {
        "AxisTitle": "Number of Pixels"
    },
    "z": {
        "AxisTitle": "z"
    }
}