{
    "Data": [0.0, 0.0, 0.0, 0.0, 0.0, 0.0, 0.0, 0.0, 0.0, 0.0, 0.0, 0.0, 0.0, 0.0, 0.0, 0.0, 0.0, 0.0, 0.0, 0.0, 0.0, 0.0, 0.0, 0.0, 0.0, 0.0, 0.0, 0.0, 0.0, 0.0, 0.0, 0.0, 0.0, 0.0, 0.0, 0.0, 0.0, 0.0, 0.0, 0.0, 0.0, 0.0, 0.0, 0.0, 0.0, 0.0, 0.0, 0.0, 0.0, 0.0, 43.0, 75.0, 100.0, 128.0, 132.0, 151.0, 142.0, 208.0, 206.0, 265.0, 283.0, 332.0, 376.0, 379.0, 458.0, 480.0, 563.0, 587.0, 628.0, 690.0, 804.0, 750.0, 789.0, 760.0, 843.0, 910.0, 882.0, 929.0, 868.0, 964.0, 869.0, 906.0, 933.0, 864.0, 948.0, 1043.0, 1112.0, 1370.0, 1631.0, 1945.0, 2320.0, 2683.0, 2918.0, 3043.0, 2875.0, 2520.0, 2143.0, 1716.0, 1276.0, 962.0, 643.0, 485.0, 331.0, 214.0, 141.0, 112.0, 74.0, 75.0, 51.0, 42.0, 46.0, 34.0, 32.0, 26.0, 25.0, 25.0, 13.0, 15.0, 18.0, 13.0, 17.0, 16.0, 12.0, 17.0, 12.0, 14.0, 11.0, 14.0, 9.0, 6.0, 7.0, 4.0, 6.0, 6.0, 5.0, 3.0, 9.0, 5.0, 8.0, 1.0, 8.0, 8.0, 3.0, 1.0, 3.0, 6.0, 4.0, 1.0, 3.0, 2.0, 2.0, 3.0, 3.0, 8.0, 5.0, 3.0, 3.0, 11.0, 11.0, 21.0, 20.0, 32.0, 27.0, 49.0, 46.0, 72.0, 79.0, 124.0, 134.0, 160.0, 199.0, 226.0, 280.0, 332.0, 355.0, 401.0, 481.0, 536.0, 603.0, 647.0, 710.0, 759.0, 741.0, 864.0, 867.0, 911.0, 913.0, 896.0, 938.0, 977.0, 999.0, 947.0, 887.0, 847.0, 835.0, 773.0, 703.0, 644.0, 606.0, 478.0, 465.0, 421.0, 384.0, 360.0, 281.0, 254.0, 231.0, 171.0, 161.0, 136.0, 101.0, 103.0, 98.0, 55.0, 50.0, 48.0, 28.0, 27.0, 20.0, 20.0, 10.0, 7.0, 6.0, 2.0, 3.0, 3.0, 1.0, 0.0, 0.0, 0.0, 1.0, 0.0, 1.0, 0.0, 0.0, 0.0, 0.0, 0.0, 0.0, 0.0, 0.0, 0.0, 2.0, 0.0, 0.0, 0.0, 0.0, 0.0, 1.0, 0.0, 0.0, 0.0, 0.0, 0.0, 0.0, 0.0, 0.0, 0.0, 0.0, 0.0, 0.0, 0.0, 0.0, 0.0, 0.0, 0.0, 0.0, 0.0, 0.0, 0.0, 1.0, 0.0, 0.0, 0.0, 0.0, 1.0, 0.0, 0.0, 0.0, 0.0, 0.0, 0.0, 0.0, 0.0, 0.0, 0.0, 0.0, 0.0, 0.0, 0.0, 0.0, 0.0, 0.0, 0.0, 0.0, 0.0, 0.0, 0.0, 0.0, 0.0, 0.0, 0.0, 0.0, 0.0, 0.0, 0.0, 0.0, 0.0, 0.0, 0.0, 0.0, 0.0, 0.0, 0.0, 0.0, 0.0, 0.0, 0.0, 0.0, 0.0, 0.0, 0.0, 0.0, 0.0, 0.0, 0.0, 0.0, 0.0, 0.0, 0.0, 0.0, 0.0, 0.0, 0.0, 0.0, 0.0, 0.0, 0.0, 0.0, 0.0, 0.0, 0.0, 0.0, 0.0, 0.0, 0.0, 0.0, 0.0, 0.0, 0.0, 0.0, 0.0, 0.0, 0.0, 0.0, 0.0, 0.0, 0.0, 0.0, 0.0, 0.0, 0.0, 0.0, 0.0],
    "Name": "ThresholdDist-0",
    "Overflow": 0.0,
    "Type": "Histo1d",
    "Underflow": 0.0,
    "x": {
        "AxisTitle": "Threshold [e]",
        "Bins": 364,
        "High": 3635.0,
        "Low": -5.0
    },
    "y": {
        "AxisTitle": "Number of Pixels"
    },
    "z": {
        "AxisTitle": "z"
    }
}