time,Hardware,Voltage,Current
1622012940420,high-voltage-3,1,0.0635161
time,Hardware,Voltage,Current
1622012940420,high-voltage-3,2,0.0680887
time,Hardware,Voltage,Current
1622012940420,high-voltage-3,3,0.0740166
time,Hardware,Voltage,Current
1622012940420,high-voltage-3,4,0.0781095
time,Hardware,Voltage,Current
1622012940420,high-voltage-3,5,0.08379
time,Hardware,Voltage,Current
1622012940420,high-voltage-3,6,0.0874789
time,Hardware,Voltage,Current
1622012940420,high-voltage-3,7,0.0934264
time,Hardware,Voltage,Current
1622012940420,high-voltage-3,8,0.0990994
time,Hardware,Voltage,Current
1622012940420,high-voltage-3,9,0.10519
time,Hardware,Voltage,Current
1622012940420,high-voltage-3,10,0.113595
time,Hardware,Voltage,Current
1622012940420,high-voltage-3,11,0.119663
time,Hardware,Voltage,Current
1622012940420,high-voltage-3,12,0.126631
time,Hardware,Voltage,Current
1622012940420,high-voltage-3,13,0.131762
time,Hardware,Voltage,Current
1622012940420,high-voltage-3,14,0.137957
time,Hardware,Voltage,Current
1622012940420,high-voltage-3,15,0.141243
time,Hardware,Voltage,Current
1622012940420,high-voltage-3,16,0.14625
time,Hardware,Voltage,Current
1622012940420,high-voltage-3,17,0.150286
time,Hardware,Voltage,Current
1622012940420,high-voltage-3,18,0.155929
time,Hardware,Voltage,Current
1622012940420,high-voltage-3,19,0.159371
time,Hardware,Voltage,Current
1622012940420,high-voltage-3,20,0.163311
time,Hardware,Voltage,Current
1622012940420,high-voltage-3,25,0.182846
time,Hardware,Voltage,Current
1622012940420,high-voltage-3,30,0.199129
time,Hardware,Voltage,Current
1622012940420,high-voltage-3,35,0.215125
time,Hardware,Voltage,Current
1622012940420,high-voltage-3,40,0.230633
time,Hardware,Voltage,Current
1622012940420,high-voltage-3,45,0.243681
time,Hardware,Voltage,Current
1622012940420,high-voltage-3,2.55438e-07,0.255273
time,Hardware,Voltage,Current
1622012940420,high-voltage-3,55,0.269341
time,Hardware,Voltage,Current
1622012940420,high-voltage-3,60,0.278963
time,Hardware,Voltage,Current
1622012940420,high-voltage-3,65,0.291031
time,Hardware,Voltage,Current
1622012940420,high-voltage-3,70,0.299094
time,Hardware,Voltage,Current
1622012940420,high-voltage-3,75,0.309192
time,Hardware,Voltage,Current
1622012940420,high-voltage-3,80,0.317743
time,Hardware,Voltage,Current
1622012940420,high-voltage-3,85,0.326879
time,Hardware,Voltage,Current
1622012940420,high-voltage-3,90,0.335432
time,Hardware,Voltage,Current
1622012940420,high-voltage-3,95,0.344111
time,Hardware,Voltage,Current
1622012940420,high-voltage-3,100,0.353865
