{
    "Data": [0.0, 0.0, 0.0, 0.0, 0.0, 0.0, 0.0, 0.0, 0.0, 0.0, 0.0, 0.0, 0.0, 0.0, 0.0, 0.0, 0.0, 0.0, 0.0, 0.0, 0.0, 0.0, 0.0, 0.0, 0.0, 0.0, 0.0, 0.0, 0.0, 0.0, 0.0, 0.0, 0.0, 0.0, 0.0, 0.0, 0.0, 0.0, 0.0, 0.0, 0.0, 0.0, 0.0, 0.0, 0.0, 0.0, 0.0, 0.0, 0.0, 0.0, 5.0, 8.0, 4.0, 5.0, 9.0, 9.0, 6.0, 6.0, 14.0, 13.0, 12.0, 7.0, 13.0, 11.0, 16.0, 12.0, 24.0, 25.0, 36.0, 61.0, 68.0, 91.0, 103.0, 146.0, 159.0, 207.0, 255.0, 383.0, 382.0, 532.0, 629.0, 713.0, 832.0, 987.0, 1114.0, 1216.0, 1319.0, 1339.0, 1448.0, 1583.0, 1807.0, 2187.0, 2632.0, 3367.0, 4014.0, 4516.0, 4520.0, 4103.0, 3129.0, 2482.0, 1690.0, 1047.0, 649.0, 449.0, 313.0, 227.0, 142.0, 109.0, 100.0, 74.0, 67.0, 49.0, 50.0, 42.0, 35.0, 26.0, 37.0, 22.0, 24.0, 28.0, 23.0, 23.0, 19.0, 17.0, 6.0, 16.0, 19.0, 20.0, 11.0, 11.0, 15.0, 11.0, 10.0, 9.0, 9.0, 9.0, 8.0, 9.0, 10.0, 9.0, 8.0, 12.0, 8.0, 7.0, 4.0, 11.0, 3.0, 3.0, 7.0, 5.0, 2.0, 11.0, 3.0, 1.0, 5.0, 2.0, 3.0, 0.0, 0.0, 3.0, 4.0, 0.0, 5.0, 4.0, 9.0, 1.0, 8.0, 7.0, 16.0, 13.0, 16.0, 21.0, 25.0, 34.0, 49.0, 64.0, 73.0, 77.0, 97.0, 115.0, 139.0, 165.0, 182.0, 207.0, 258.0, 303.0, 340.0, 379.0, 432.0, 419.0, 483.0, 550.0, 628.0, 609.0, 640.0, 724.0, 692.0, 746.0, 763.0, 794.0, 790.0, 770.0, 779.0, 723.0, 740.0, 742.0, 639.0, 592.0, 615.0, 590.0, 505.0, 481.0, 454.0, 451.0, 348.0, 327.0, 296.0, 277.0, 233.0, 211.0, 168.0, 162.0, 128.0, 122.0, 110.0, 81.0, 76.0, 85.0, 57.0, 51.0, 41.0, 33.0, 36.0, 30.0, 19.0, 17.0, 17.0, 14.0, 17.0, 16.0, 18.0, 13.0, 18.0, 8.0, 11.0, 5.0, 3.0, 7.0, 4.0, 8.0, 8.0, 7.0, 5.0, 8.0, 4.0, 10.0, 5.0, 4.0, 2.0, 4.0, 1.0, 3.0, 2.0, 6.0, 3.0, 4.0, 1.0, 3.0, 2.0, 4.0, 1.0, 1.0, 3.0, 5.0, 3.0, 0.0, 0.0, 2.0, 3.0, 3.0, 0.0, 2.0, 2.0, 1.0, 1.0, 0.0, 2.0, 1.0, 1.0, 0.0, 1.0, 0.0, 0.0, 0.0, 1.0, 1.0, 1.0, 3.0, 2.0, 2.0, 1.0, 1.0, 3.0, 1.0, 0.0, 0.0, 1.0, 0.0, 1.0, 0.0, 0.0, 0.0, 0.0, 1.0, 0.0, 0.0, 0.0, 0.0, 1.0, 0.0, 1.0, 0.0, 1.0, 0.0, 0.0, 0.0, 0.0, 0.0, 0.0, 0.0, 0.0, 0.0, 0.0, 0.0, 0.0, 0.0, 0.0, 0.0, 0.0, 0.0, 0.0, 0.0, 0.0, 0.0, 0.0, 0.0, 0.0, 0.0, 0.0, 0.0, 0.0, 0.0, 0.0, 0.0, 0.0, 0.0, 0.0, 0.0, 0.0, 0.0, 0.0, 0.0, 0.0, 0.0, 0.0, 0.0, 0.0, 0.0, 0.0, 0.0, 0.0, 0.0, 0.0, 0.0, 0.0, 0.0],
    "Name": "ThresholdDist-0",
    "Overflow": 0.0,
    "Type": "Histo1d",
    "Underflow": 0.0,
    "x": {
        "AxisTitle": "Threshold [e]",
        "Bins": 376,
        "High": 3755.0,
        "Low": -5.0
    },
    "y": {
        "AxisTitle": "Number of Pixels"
    },
    "z": {
        "AxisTitle": "z"
    }
}