{
    "Data": [0.0, 0.0, 0.0, 0.0, 0.0, 0.0, 0.0, 0.0, 0.0, 0.0, 0.0, 0.0, 0.0, 7.0, 5.0, 2.0, 5.0, 185.0, 443.0, 113.0, 95.0, 994.0, 2681.0, 1388.0, 579.0, 1547.0, 2815.0, 1700.0, 738.0, 1270.0, 1808.0, 1397.0, 746.0, 694.0, 619.0, 592.0, 527.0, 981.0, 1265.0, 1019.0, 698.0, 1572.0, 2654.0, 3421.0, 2332.0, 1946.0, 2716.0, 3786.0, 3332.0, 2913.0, 2228.0, 2168.0, 2401.0, 1929.0, 1614.0, 1359.0, 1621.0, 1436.0, 1418.0, 1068.0, 919.0, 813.0, 625.0, 606.0, 533.0, 517.0, 537.0, 437.0, 360.0, 318.0, 338.0, 340.0, 274.0, 204.0, 198.0, 217.0, 169.0, 175.0, 144.0, 133.0, 105.0, 126.0, 78.0, 76.0, 88.0, 77.0, 69.0, 66.0, 44.0, 53.0, 40.0, 35.0, 54.0, 45.0, 44.0, 41.0, 36.0, 34.0, 32.0, 19.0, 20.0, 28.0, 29.0, 27.0, 17.0, 17.0, 18.0, 11.0, 11.0, 11.0, 15.0, 10.0, 14.0, 13.0, 10.0, 12.0, 8.0, 8.0, 12.0, 5.0, 6.0, 10.0, 5.0, 7.0, 6.0, 9.0, 2.0, 8.0, 2.0, 5.0, 3.0, 5.0, 5.0, 1.0, 1.0, 2.0, 2.0, 2.0, 2.0, 1.0, 2.0, 0.0, 1.0, 1.0, 1.0, 3.0, 1.0, 1.0, 2.0, 0.0, 2.0, 0.0, 4.0, 1.0, 0.0, 1.0, 1.0, 0.0, 2.0, 1.0, 1.0, 0.0, 2.0, 0.0, 0.0, 1.0, 0.0, 1.0, 1.0, 1.0, 1.0, 0.0, 0.0, 0.0, 0.0, 0.0, 1.0, 2.0, 0.0, 0.0, 0.0, 0.0, 1.0, 0.0, 0.0, 0.0, 0.0, 0.0, 0.0, 0.0, 0.0, 0.0, 0.0, 0.0, 0.0, 1.0, 1.0, 0.0, 0.0, 0.0, 0.0],
    "Name": "TimePerFitDist-0",
    "Overflow": 85.0,
    "Type": "Histo1d",
    "Underflow": 0.0,
    "x": {
        "AxisTitle": "Fit Time [us]",
        "Bins": 201,
        "High": 401.0,
        "Low": -1.0
    },
    "y": {
        "AxisTitle": "Number of Pixels"
    },
    "z": {
        "AxisTitle": "z"
    }
}