{
    "Data": [0.0, 0.0, 0.0, 0.0, 0.0, 0.0, 0.0, 0.0, 0.0, 0.0, 0.0, 0.0, 0.0, 0.0, 3.0, 0.0, 0.0, 14.0, 178.0, 128.0, 30.0, 200.0, 1427.0, 1517.0, 358.0, 610.0, 1894.0, 2126.0, 744.0, 821.0, 1390.0, 1652.0, 866.0, 593.0, 720.0, 859.0, 585.0, 507.0, 682.0, 802.0, 702.0, 721.0, 1479.0, 2738.0, 2151.0, 1504.0, 2070.0, 3196.0, 4248.0, 3202.0, 2231.0, 2474.0, 3141.0, 2741.0, 2066.0, 1829.0, 1746.0, 2079.0, 1702.0, 1363.0, 1255.0, 1175.0, 1075.0, 768.0, 705.0, 586.0, 638.0, 595.0, 460.0, 432.0, 410.0, 413.0, 362.0, 299.0, 268.0, 226.0, 257.0, 187.0, 194.0, 167.0, 166.0, 162.0, 130.0, 123.0, 110.0, 96.0, 96.0, 87.0, 74.0, 77.0, 67.0, 57.0, 47.0, 49.0, 52.0, 44.0, 36.0, 35.0, 42.0, 32.0, 31.0, 35.0, 23.0, 18.0, 30.0, 33.0, 14.0, 22.0, 18.0, 17.0, 12.0, 16.0, 13.0, 17.0, 14.0, 16.0, 12.0, 15.0, 10.0, 12.0, 14.0, 5.0, 16.0, 13.0, 11.0, 9.0, 6.0, 7.0, 7.0, 11.0, 3.0, 5.0, 5.0, 8.0, 5.0, 7.0, 6.0, 4.0, 3.0, 5.0, 4.0, 7.0, 4.0, 3.0, 6.0, 4.0, 7.0, 6.0, 5.0, 3.0, 8.0, 3.0, 4.0, 5.0, 5.0, 2.0, 5.0, 6.0, 2.0, 4.0, 3.0, 4.0, 5.0, 6.0, 3.0, 2.0, 4.0, 1.0, 1.0, 3.0, 0.0, 2.0, 2.0, 3.0, 1.0, 2.0, 4.0, 1.0, 1.0, 0.0, 6.0, 4.0, 1.0, 4.0, 4.0, 5.0, 3.0, 1.0, 2.0, 1.0, 4.0, 3.0, 1.0, 1.0, 0.0, 1.0, 3.0, 4.0, 2.0, 3.0, 4.0],
    "Name": "TimePerFitDist-0",
    "Overflow": 274.0,
    "Type": "Histo1d",
    "Underflow": 0.0,
    "x": {
        "AxisTitle": "Fit Time [us]",
        "Bins": 201,
        "High": 401.0,
        "Low": -1.0
    },
    "y": {
        "AxisTitle": "Number of Pixels"
    },
    "z": {
        "AxisTitle": "z"
    }
}