time,Hardware,Voltage,Current
1621479753413,high-voltage-2,1,0.115896
time,Hardware,Voltage,Current
1621479753413,high-voltage-2,2,0.145093
time,Hardware,Voltage,Current
1621479753413,high-voltage-2,3,0.162046
time,Hardware,Voltage,Current
1621479753413,high-voltage-2,4,0.173434
time,Hardware,Voltage,Current
1621479753413,high-voltage-2,5,0.184726
time,Hardware,Voltage,Current
1621479753413,high-voltage-2,6,0.200405
time,Hardware,Voltage,Current
1621479753413,high-voltage-2,7,0.212975
time,Hardware,Voltage,Current
1621479753413,high-voltage-2,8,0.231806
time,Hardware,Voltage,Current
1621479753413,high-voltage-2,9,0.251146
time,Hardware,Voltage,Current
1621479753413,high-voltage-2,10,0.273188
time,Hardware,Voltage,Current
1621479753413,high-voltage-2,11,0.293978
time,Hardware,Voltage,Current
1621479753413,high-voltage-2,12,0.316507
time,Hardware,Voltage,Current
1621479753413,high-voltage-2,13,0.339007
time,Hardware,Voltage,Current
1621479753413,high-voltage-2,14,0.359457
time,Hardware,Voltage,Current
1621479753413,high-voltage-2,15,0.377607
time,Hardware,Voltage,Current
1621479753413,high-voltage-2,16,0.397413
time,Hardware,Voltage,Current
1621479753413,high-voltage-2,17,0.418806
time,Hardware,Voltage,Current
1621479753413,high-voltage-2,18,0.434579
time,Hardware,Voltage,Current
1621479753413,high-voltage-2,19,0.447956
time,Hardware,Voltage,Current
1621479753413,high-voltage-2,20,0.45972
time,Hardware,Voltage,Current
1621479753413,high-voltage-2,25,0.516474
time,Hardware,Voltage,Current
1621479753413,high-voltage-2,30,0.566966
time,Hardware,Voltage,Current
1621479753413,high-voltage-2,35,0.619138
time,Hardware,Voltage,Current
1621479753413,high-voltage-2,40,0.678903
time,Hardware,Voltage,Current
1621479753413,high-voltage-2,45,0.748081
time,Hardware,Voltage,Current
1621479753413,high-voltage-2,50,0.799043
time,Hardware,Voltage,Current
1621479753413,high-voltage-2,55,0.844409
time,Hardware,Voltage,Current
1621479753413,high-voltage-2,60,0.886778
time,Hardware,Voltage,Current
1621479753413,high-voltage-2,65,0.930927
time,Hardware,Voltage,Current
1621479753413,high-voltage-2,70,0.971744
time,Hardware,Voltage,Current
1621479753413,high-voltage-2,75,1.01325
time,Hardware,Voltage,Current
1621479753413,high-voltage-2,80,1.04963
time,Hardware,Voltage,Current
1621479753413,high-voltage-2,85,1.08897
time,Hardware,Voltage,Current
1621479753413,high-voltage-2,90,1.12557
time,Hardware,Voltage,Current
1621479753413,high-voltage-2,95,1.16505
time,Hardware,Voltage,Current
1621479753413,high-voltage-2,100,1.19941
