{
    "Data": [1585.0, 15741.0, 14312.0, 7797.0, 4488.0, 3184.0, 2991.0, 2685.0, 2399.0, 1932.0, 1499.0, 1099.0, 835.0, 591.0, 475.0, 331.0, 306.0, 253.0, 252.0, 261.0, 184.0, 224.0, 200.0, 238.0, 225.0, 198.0, 212.0, 172.0, 195.0, 190.0, 170.0, 151.0, 144.0, 143.0, 140.0, 120.0, 111.0, 122.0, 111.0, 98.0, 85.0, 75.0, 62.0, 56.0, 59.0, 83.0, 82.0, 55.0, 43.0, 33.0, 22.0],
    "Name": "Chi2Dist-0",
    "Overflow": 0.0,
    "Type": "Histo1d",
    "Underflow": 0.0,
    "x": {
        "AxisTitle": "Fit Chi/ndf",
        "Bins": 51,
        "High": 2.5250000953674318,
        "Low": -0.02500000037252903
    },
    "y": {
        "AxisTitle": "Number of Pixels"
    },
    "z": {
        "AxisTitle": "z"
    }
}