{
    "Data": [0.0, 0.0, 0.0, 0.0, 0.0, 0.0, 0.0, 0.0, 0.0, 0.0, 0.0, 0.0, 0.0, 0.0, 0.0, 0.0, 2.0, 1.0, 1.0, 4.0, 9.0, 8.0, 2.0, 19.0, 15.0, 22.0, 31.0, 14.0, 24.0, 47.0, 5.0, 49.0, 50.0, 50.0, 50.0, 50.0, 50.0, 7.0, 19.0, 3.0, 50.0, 39.0, 2.0, 10.0, 50.0, 50.0, 50.0, 50.0, 50.0, 4.0, 50.0],
    "Name": "Scurve-110-96",
    "Overflow": 0.0,
    "Type": "Histo1d",
    "Underflow": 0.0,
    "x": {
        "AxisTitle": "Vcal",
        "Bins": 51,
        "High": 302.5,
        "Low": 47.5
    },
    "y": {
        "AxisTitle": "Occupancy"
    },
    "z": {
        "AxisTitle": "z"
    }
}