time,Hardware,Voltage,Current
1622099123435,high-voltage-2,1,0.292207
time,Hardware,Voltage,Current
1622099123435,high-voltage-2,2,0.354091
time,Hardware,Voltage,Current
1622099123435,high-voltage-2,3,0.397889
time,Hardware,Voltage,Current
1622099123435,high-voltage-2,4,0.433835
time,Hardware,Voltage,Current
1622099123435,high-voltage-2,5,0.461459
time,Hardware,Voltage,Current
1622099123435,high-voltage-2,6,0.483626
time,Hardware,Voltage,Current
1622099123435,high-voltage-2,7,0.506876
time,Hardware,Voltage,Current
1622099123435,high-voltage-2,8,0.52501
time,Hardware,Voltage,Current
1622099123435,high-voltage-2,9,0.543409
time,Hardware,Voltage,Current
1622099123435,high-voltage-2,10,0.562322
time,Hardware,Voltage,Current
1622099123435,high-voltage-2,11,0.578366
time,Hardware,Voltage,Current
1622099123435,high-voltage-2,12,0.59541
time,Hardware,Voltage,Current
1622099123435,high-voltage-2,13,0.614848
time,Hardware,Voltage,Current
1622099123435,high-voltage-2,14,0.632576
time,Hardware,Voltage,Current
1622099123435,high-voltage-2,15,0.647772
time,Hardware,Voltage,Current
1622099123435,high-voltage-2,16,0.665312
time,Hardware,Voltage,Current
1622099123435,high-voltage-2,17,0.681383
time,Hardware,Voltage,Current
1622099123435,high-voltage-2,18,0.7007
time,Hardware,Voltage,Current
1622099123435,high-voltage-2,19,0.718327
time,Hardware,Voltage,Current
1622099123435,high-voltage-2,20,0.734884
time,Hardware,Voltage,Current
1622099123435,high-voltage-2,25,0.809537
time,Hardware,Voltage,Current
1622099123435,high-voltage-2,30,0.886166
time,Hardware,Voltage,Current
1622099123435,high-voltage-2,35,0.968758
time,Hardware,Voltage,Current
1622099123435,high-voltage-2,40,1.07047
time,Hardware,Voltage,Current
1622099123435,high-voltage-2,45,1.19096
time,Hardware,Voltage,Current
1622099123435,high-voltage-2,50,1.27441
time,Hardware,Voltage,Current
1622099123435,high-voltage-2,55,1.3486
time,Hardware,Voltage,Current
1622099123435,high-voltage-2,60,1.42224
time,Hardware,Voltage,Current
1622099123435,high-voltage-2,65,1.49459
time,Hardware,Voltage,Current
1622099123435,high-voltage-2,70,1.5629
time,Hardware,Voltage,Current
1622099123435,high-voltage-2,75,1.63311
time,Hardware,Voltage,Current
1622099123435,high-voltage-2,80,1.70179
time,Hardware,Voltage,Current
1622099123435,high-voltage-2,85,1.76765
time,Hardware,Voltage,Current
1622099123435,high-voltage-2,90,1.83422
time,Hardware,Voltage,Current
1622099123435,high-voltage-2,95,1.9006
time,Hardware,Voltage,Current
1622099123435,high-voltage-2,100,1.96381
