{
    "Data": [404.0, 9169.0, 14844.0, 10146.0, 5315.0, 3045.0, 2330.0, 2395.0, 2661.0, 2673.0, 2464.0, 2117.0, 1659.0, 1139.0, 852.0, 566.0, 418.0, 282.0, 258.0, 228.0, 228.0, 218.0, 178.0, 207.0, 188.0, 175.0, 188.0, 169.0, 196.0, 169.0, 186.0, 163.0, 150.0, 146.0, 135.0, 129.0, 132.0, 120.0, 96.0, 84.0, 94.0, 94.0, 90.0, 77.0, 62.0, 63.0, 78.0, 66.0, 57.0, 45.0, 21.0],
    "Name": "Chi2Dist-0",
    "Overflow": 0.0,
    "Type": "Histo1d",
    "Underflow": 0.0,
    "x": {
        "AxisTitle": "Fit Chi/ndf",
        "Bins": 51,
        "High": 2.5250000953674318,
        "Low": -0.02500000037252903
    },
    "y": {
        "AxisTitle": "Number of Pixels"
    },
    "z": {
        "AxisTitle": "z"
    }
}