{
    "Data": [[713.0, 218.0, 90.0, 57.0, 41.0, 21.0, 14.0, 5.0, 7.0, 3.0, 10.0, 2.0, 6.0, 8.0, 4.0, 10.0, 6.0, 2.0, 7.0, 4.0, 3.0, 3.0, 3.0, 5.0, 7.0, 2.0, 4.0, 5.0, 1.0, 2.0, 1.0, 1.0, 4.0, 1.0, 5.0, 2.0, 2.0, 1.0, 1.0, 2.0, 4.0, 3.0, 2.0, 3.0, 4.0, 2.0, 3.0, 6.0, 1.0], [1682.0, 519.0, 283.0, 155.0, 113.0, 71.0, 51.0, 40.0, 31.0, 37.0, 19.0, 14.0, 12.0, 10.0, 7.0, 13.0, 7.0, 3.0, 7.0, 7.0, 6.0, 3.0, 4.0, 10.0, 5.0, 3.0, 2.0, 2.0, 5.0, 4.0, 6.0, 5.0, 8.0, 2.0, 4.0, 5.0, 5.0, 6.0, 3.0, 2.0, 5.0, 1.0, 4.0, 4.0, 4.0, 7.0, 7.0, 3.0, 16.0], [2872.0, 1180.0, 662.0, 430.0, 288.0, 218.0, 172.0, 118.0, 111.0, 81.0, 66.0, 53.0, 42.0, 37.0, 39.0, 25.0, 28.0, 15.0, 24.0, 30.0, 19.0, 18.0, 15.0, 10.0, 8.0, 11.0, 9.0, 7.0, 7.0, 8.0, 7.0, 5.0, 3.0, 3.0, 3.0, 8.0, 3.0, 3.0, 3.0, 6.0, 5.0, 6.0, 10.0, 7.0, 13.0, 9.0, 10.0, 10.0, 16.0], [3751.0, 1962.0, 1188.0, 955.0, 687.0, 509.0, 408.0, 355.0, 300.0, 234.0, 194.0, 153.0, 158.0, 130.0, 102.0, 79.0, 80.0, 77.0, 61.0, 56.0, 72.0, 41.0, 44.0, 37.0, 40.0, 41.0, 27.0, 19.0, 31.0, 16.0, 21.0, 23.0, 20.0, 20.0, 12.0, 14.0, 14.0, 10.0, 14.0, 10.0, 11.0, 9.0, 11.0, 12.0, 11.0, 11.0, 11.0, 24.0, 24.0], [3605.0, 2293.0, 1662.0, 1308.0, 1087.0, 900.0, 786.0, 694.0, 589.0, 507.0, 461.0, 386.0, 367.0, 367.0, 273.0, 258.0, 259.0, 221.0, 192.0, 181.0, 158.0, 142.0, 136.0, 132.0, 117.0, 113.0, 96.0, 89.0, 100.0, 74.0, 81.0, 67.0, 46.0, 60.0, 45.0, 44.0, 42.0, 49.0, 36.0, 43.0, 38.0, 40.0, 28.0, 22.0, 27.0, 27.0, 16.0, 27.0, 38.0], [4145.0, 2168.0, 1576.0, 1331.0, 1218.0, 1019.0, 895.0, 843.0, 797.0, 724.0, 642.0, 584.0, 582.0, 542.0, 516.0, 474.0, 508.0, 425.0, 418.0, 404.0, 363.0, 360.0, 332.0, 316.0, 289.0, 275.0, 249.0, 228.0, 227.0, 207.0, 215.0, 192.0, 184.0, 157.0, 171.0, 174.0, 147.0, 115.0, 135.0, 120.0, 109.0, 102.0, 82.0, 82.0, 82.0, 93.0, 80.0, 72.0, 73.0], [6925.0, 3951.0, 2510.0, 1871.0, 1428.0, 1082.0, 963.0, 862.0, 792.0, 764.0, 726.0, 666.0, 687.0, 666.0, 616.0, 580.0, 583.0, 558.0, 543.0, 545.0, 516.0, 523.0, 498.0, 543.0, 485.0, 492.0, 464.0, 428.0, 442.0, 446.0, 427.0, 418.0, 426.0, 405.0, 361.0, 353.0, 352.0, 368.0, 334.0, 349.0, 314.0, 292.0, 319.0, 252.0, 308.0, 238.0, 241.0, 251.0, 266.0], [2408.0, 2567.0, 2593.0, 2411.0, 2311.0, 2128.0, 1984.0, 1773.0, 1661.0, 1482.0, 1398.0, 1247.0, 1132.0, 1018.0, 961.0, 910.0, 814.0, 748.0, 741.0, 711.0, 714.0, 629.0, 609.0, 607.0, 611.0, 562.0, 577.0, 571.0, 602.0, 546.0, 586.0, 582.0, 597.0, 560.0, 598.0, 584.0, 618.0, 600.0, 611.0, 601.0, 609.0, 643.0, 685.0, 648.0, 638.0, 696.0, 696.0, 686.0, 748.0], [254.0, 240.0, 324.0, 380.0, 406.0, 485.0, 581.0, 707.0, 737.0, 743.0, 847.0, 921.0, 990.0, 1016.0, 1096.0, 1103.0, 1127.0, 1277.0, 1215.0, 1221.0, 1277.0, 1223.0, 1208.0, 1209.0, 1248.0, 1207.0, 1144.0, 1172.0, 1122.0, 1092.0, 1040.0, 1062.0, 1014.0, 989.0, 1009.0, 949.0, 1025.0, 925.0, 932.0, 1000.0, 950.0, 1022.0, 1024.0, 1137.0, 1121.0, 1237.0, 1332.0, 1522.0, 1878.0], [164.0, 90.0, 75.0, 52.0, 67.0, 64.0, 70.0, 71.0, 59.0, 107.0, 101.0, 98.0, 119.0, 133.0, 157.0, 187.0, 195.0, 262.0, 227.0, 274.0, 303.0, 372.0, 435.0, 447.0, 454.0, 556.0, 593.0, 685.0, 801.0, 872.0, 964.0, 996.0, 1082.0, 1153.0, 1255.0, 1369.0, 1470.0, 1497.0, 1745.0, 1737.0, 1899.0, 2023.0, 2145.0, 2313.0, 2488.0, 2536.0, 2794.0, 3151.0, 3899.0], [211.0, 71.0, 47.0, 65.0, 32.0, 33.0, 26.0, 30.0, 22.0, 24.0, 30.0, 16.0, 26.0, 27.0, 39.0, 36.0, 34.0, 38.0, 45.0, 53.0, 43.0, 66.0, 65.0, 69.0, 83.0, 76.0, 92.0, 106.0, 119.0, 146.0, 164.0, 198.0, 211.0, 235.0, 289.0, 380.0, 395.0, 502.0, 567.0, 707.0, 854.0, 1035.0, 1330.0, 1624.0, 2104.0, 2874.0, 3856.0, 5492.0, 8543.0], [322.0, 91.0, 46.0, 42.0, 29.0, 33.0, 25.0, 17.0, 18.0, 13.0, 19.0, 16.0, 17.0, 14.0, 11.0, 17.0, 20.0, 10.0, 28.0, 17.0, 21.0, 23.0, 20.0, 17.0, 23.0, 19.0, 26.0, 28.0, 26.0, 50.0, 50.0, 40.0, 52.0, 59.0, 61.0, 74.0, 83.0, 110.0, 130.0, 172.0, 170.0, 283.0, 338.0, 427.0, 647.0, 955.0, 1560.0, 2807.0, 6866.0], [632.0, 142.0, 58.0, 34.0, 15.0, 16.0, 19.0, 17.0, 12.0, 14.0, 10.0, 14.0, 9.0, 6.0, 19.0, 11.0, 15.0, 10.0, 10.0, 11.0, 12.0, 12.0, 20.0, 16.0, 13.0, 11.0, 10.0, 15.0, 14.0, 15.0, 12.0, 23.0, 26.0, 23.0, 26.0, 20.0, 29.0, 36.0, 39.0, 51.0, 69.0, 68.0, 97.0, 136.0, 206.0, 271.0, 501.0, 956.0, 2973.0], [1154.0, 279.0, 108.0, 53.0, 25.0, 17.0, 19.0, 9.0, 7.0, 8.0, 8.0, 6.0, 11.0, 5.0, 8.0, 10.0, 9.0, 7.0, 4.0, 11.0, 10.0, 8.0, 13.0, 8.0, 7.0, 10.0, 8.0, 9.0, 10.0, 18.0, 14.0, 13.0, 16.0, 18.0, 10.0, 14.0, 16.0, 22.0, 24.0, 26.0, 18.0, 32.0, 40.0, 55.0, 63.0, 104.0, 178.0, 336.0, 1205.0], [2101.0, 615.0, 273.0, 111.0, 64.0, 29.0, 18.0, 13.0, 13.0, 17.0, 13.0, 8.0, 8.0, 4.0, 6.0, 6.0, 2.0, 2.0, 7.0, 4.0, 4.0, 3.0, 9.0, 5.0, 3.0, 8.0, 6.0, 5.0, 9.0, 4.0, 8.0, 12.0, 11.0, 8.0, 13.0, 12.0, 14.0, 13.0, 13.0, 9.0, 21.0, 17.0, 19.0, 28.0, 46.0, 53.0, 82.0, 117.0, 484.0], [3170.0, 1253.0, 539.0, 254.0, 138.0, 86.0, 53.0, 32.0, 14.0, 12.0, 19.0, 14.0, 8.0, 8.0, 8.0, 4.0, 9.0, 7.0, 4.0, 7.0, 8.0, 2.0, 4.0, 3.0, 10.0, 4.0, 8.0, 4.0, 4.0, 2.0, 5.0, 10.0, 4.0, 5.0, 6.0, 9.0, 8.0, 7.0, 8.0, 11.0, 10.0, 8.0, 22.0, 23.0, 20.0, 33.0, 52.0, 80.0, 216.0], [4266.0, 1965.0, 1065.0, 621.0, 346.0, 207.0, 150.0, 78.0, 59.0, 62.0, 35.0, 22.0, 14.0, 16.0, 21.0, 9.0, 5.0, 8.0, 4.0, 4.0, 7.0, 4.0, 2.0, 5.0, 4.0, 5.0, 3.0, 6.0, 8.0, 0.0, 6.0, 8.0, 6.0, 7.0, 8.0, 7.0, 5.0, 10.0, 5.0, 8.0, 9.0, 7.0, 14.0, 16.0, 10.0, 16.0, 35.0, 38.0, 145.0], [4550.0, 2745.0, 1704.0, 1130.0, 772.0, 506.0, 331.0, 278.0, 193.0, 130.0, 82.0, 66.0, 61.0, 35.0, 31.0, 20.0, 22.0, 16.0, 10.0, 11.0, 9.0, 10.0, 4.0, 11.0, 7.0, 5.0, 2.0, 3.0, 6.0, 4.0, 6.0, 4.0, 2.0, 6.0, 5.0, 4.0, 2.0, 10.0, 6.0, 7.0, 7.0, 10.0, 11.0, 15.0, 5.0, 15.0, 24.0, 37.0, 75.0], [4227.0, 3027.0, 2222.0, 1639.0, 1149.0, 930.0, 704.0, 525.0, 404.0, 328.0, 254.0, 187.0, 145.0, 115.0, 73.0, 74.0, 54.0, 47.0, 46.0, 29.0, 26.0, 23.0, 27.0, 15.0, 9.0, 10.0, 8.0, 9.0, 9.0, 10.0, 4.0, 5.0, 5.0, 2.0, 7.0, 4.0, 4.0, 5.0, 10.0, 4.0, 4.0, 8.0, 4.0, 6.0, 15.0, 12.0, 22.0, 30.0, 60.0], [3506.0, 2742.0, 2321.0, 1910.0, 1500.0, 1381.0, 1077.0, 853.0, 720.0, 587.0, 511.0, 432.0, 359.0, 283.0, 252.0, 203.0, 161.0, 151.0, 110.0, 87.0, 88.0, 78.0, 47.0, 50.0, 33.0, 41.0, 38.0, 17.0, 21.0, 17.0, 10.0, 11.0, 18.0, 10.0, 8.0, 6.0, 8.0, 4.0, 7.0, 3.0, 7.0, 10.0, 9.0, 4.0, 10.0, 8.0, 17.0, 24.0, 36.0], [2367.0, 2221.0, 1983.0, 1797.0, 1585.0, 1368.0, 1228.0, 1119.0, 959.0, 879.0, 793.0, 670.0, 598.0, 540.0, 466.0, 404.0, 343.0, 307.0, 270.0, 221.0, 190.0, 172.0, 162.0, 138.0, 126.0, 100.0, 83.0, 60.0, 62.0, 55.0, 45.0, 43.0, 33.0, 29.0, 19.0, 15.0, 12.0, 20.0, 12.0, 10.0, 6.0, 10.0, 4.0, 6.0, 9.0, 15.0, 15.0, 14.0, 41.0], [1523.0, 1569.0, 1512.0, 1496.0, 1389.0, 1245.0, 1259.0, 1180.0, 1059.0, 1032.0, 956.0, 865.0, 797.0, 729.0, 637.0, 619.0, 580.0, 512.0, 479.0, 419.0, 376.0, 330.0, 289.0, 280.0, 236.0, 220.0, 179.0, 182.0, 155.0, 133.0, 112.0, 96.0, 80.0, 76.0, 77.0, 54.0, 53.0, 44.0, 23.0, 33.0, 26.0, 21.0, 17.0, 10.0, 8.0, 14.0, 12.0, 15.0, 40.0], [966.0, 978.0, 1018.0, 992.0, 1023.0, 999.0, 969.0, 1029.0, 966.0, 982.0, 910.0, 878.0, 867.0, 810.0, 733.0, 742.0, 720.0, 662.0, 615.0, 612.0, 578.0, 513.0, 458.0, 444.0, 431.0, 400.0, 381.0, 341.0, 311.0, 265.0, 239.0, 237.0, 208.0, 191.0, 158.0, 136.0, 142.0, 109.0, 104.0, 67.0, 72.0, 54.0, 44.0, 45.0, 33.0, 38.0, 25.0, 30.0, 22.0], [748.0, 679.0, 710.0, 698.0, 720.0, 658.0, 673.0, 715.0, 702.0, 717.0, 734.0, 765.0, 735.0, 762.0, 699.0, 735.0, 736.0, 715.0, 647.0, 677.0, 694.0, 658.0, 652.0, 595.0, 549.0, 568.0, 538.0, 508.0, 488.0, 469.0, 434.0, 365.0, 367.0, 327.0, 314.0, 315.0, 281.0, 239.0, 230.0, 212.0, 153.0, 173.0, 112.0, 132.0, 98.0, 81.0, 78.0, 52.0, 43.0], [416.0, 442.0, 461.0, 476.0, 479.0, 521.0, 522.0, 537.0, 485.0, 539.0, 532.0, 568.0, 577.0, 595.0, 592.0, 626.0, 641.0, 659.0, 604.0, 649.0, 620.0, 659.0, 600.0, 638.0, 633.0, 609.0, 617.0, 589.0, 645.0, 592.0, 569.0, 569.0, 547.0, 502.0, 523.0, 470.0, 459.0, 448.0, 423.0, 360.0, 380.0, 342.0, 266.0, 285.0, 272.0, 204.0, 208.0, 148.0, 98.0], [305.0, 340.0, 354.0, 333.0, 376.0, 289.0, 365.0, 367.0, 348.0, 368.0, 360.0, 398.0, 393.0, 361.0, 425.0, 407.0, 453.0, 471.0, 502.0, 495.0, 562.0, 521.0, 527.0, 515.0, 594.0, 601.0, 599.0, 619.0, 649.0, 662.0, 666.0, 643.0, 635.0, 646.0, 676.0, 650.0, 638.0, 594.0, 630.0, 594.0, 598.0, 564.0, 532.0, 529.0, 449.0, 421.0, 421.0, 385.0, 332.0], [362.0, 253.0, 220.0, 202.0, 238.0, 223.0, 255.0, 275.0, 229.0, 289.0, 288.0, 285.0, 301.0, 281.0, 310.0, 302.0, 325.0, 320.0, 343.0, 386.0, 386.0, 375.0, 413.0, 392.0, 419.0, 494.0, 471.0, 476.0, 528.0, 559.0, 585.0, 579.0, 570.0, 657.0, 659.0, 700.0, 714.0, 731.0, 790.0, 765.0, 728.0, 769.0, 780.0, 805.0, 740.0, 779.0, 766.0, 738.0, 661.0], [230.0, 169.0, 160.0, 176.0, 194.0, 194.0, 147.0, 161.0, 184.0, 208.0, 214.0, 168.0, 161.0, 186.0, 215.0, 196.0, 255.0, 207.0, 213.0, 262.0, 265.0, 252.0, 289.0, 328.0, 328.0, 355.0, 333.0, 389.0, 391.0, 449.0, 415.0, 485.0, 544.0, 533.0, 590.0, 614.0, 761.0, 668.0, 767.0, 779.0, 795.0, 884.0, 990.0, 997.0, 1051.0, 1156.0, 1206.0, 1196.0, 1260.0], [301.0, 162.0, 155.0, 128.0, 122.0, 130.0, 123.0, 123.0, 117.0, 163.0, 184.0, 141.0, 242.0, 175.0, 157.0, 156.0, 128.0, 126.0, 176.0, 183.0, 197.0, 136.0, 241.0, 189.0, 204.0, 202.0, 201.0, 250.0, 249.0, 306.0, 305.0, 356.0, 359.0, 377.0, 411.0, 463.0, 504.0, 541.0, 615.0, 717.0, 756.0, 884.0, 961.0, 1057.0, 1197.0, 1342.0, 1508.0, 1708.0, 1991.0], [150.0, 108.0, 116.0, 67.0, 68.0, 114.0, 107.0, 82.0, 111.0, 180.0, 139.0, 132.0, 156.0, 123.0, 141.0, 155.0, 136.0, 120.0, 114.0, 147.0, 160.0, 182.0, 190.0, 170.0, 130.0, 155.0, 179.0, 158.0, 178.0, 194.0, 174.0, 219.0, 220.0, 220.0, 275.0, 285.0, 340.0, 383.0, 449.0, 472.0, 577.0, 695.0, 782.0, 939.0, 1122.0, 1381.0, 1600.0, 2126.0, 2827.0], [181.0, 225.0, 70.0, 101.0, 79.0, 84.0, 88.0, 116.0, 161.0, 107.0, 130.0, 94.0, 161.0, 104.0, 121.0, 118.0, 99.0, 75.0, 92.0, 82.0, 154.0, 122.0, 198.0, 128.0, 128.0, 104.0, 101.0, 82.0, 99.0, 111.0, 124.0, 137.0, 166.0, 198.0, 181.0, 142.0, 218.0, 218.0, 262.0, 333.0, 418.0, 453.0, 583.0, 682.0, 944.0, 1130.0, 1564.0, 2132.0, 3188.0], [71.0, 101.0, 180.0, 184.0, 154.0, 131.0, 66.0, 168.0, 214.0, 139.0, 91.0, 142.0, 159.0, 90.0, 100.0, 97.0, 121.0, 119.0, 195.0, 108.0, 89.0, 99.0, 80.0, 94.0, 70.0, 106.0, 65.0, 125.0, 102.0, 96.0, 109.0, 124.0, 110.0, 116.0, 105.0, 115.0, 126.0, 180.0, 189.0, 191.0, 238.0, 271.0, 381.0, 486.0, 623.0, 830.0, 1166.0, 1778.0, 3198.0], [103.0, 70.0, 77.0, 90.0, 155.0, 140.0, 155.0, 85.0, 75.0, 33.0, 109.0, 142.0, 256.0, 205.0, 121.0, 120.0, 123.0, 108.0, 49.0, 77.0, 88.0, 55.0, 77.0, 123.0, 82.0, 125.0, 61.0, 104.0, 100.0, 73.0, 84.0, 95.0, 117.0, 78.0, 77.0, 63.0, 101.0, 156.0, 124.0, 119.0, 164.0, 163.0, 182.0, 297.0, 365.0, 519.0, 817.0, 1270.0, 2786.0], [126.0, 60.0, 109.0, 104.0, 110.0, 109.0, 154.0, 116.0, 58.0, 85.0, 48.0, 78.0, 144.0, 76.0, 85.0, 73.0, 147.0, 102.0, 92.0, 51.0, 102.0, 98.0, 83.0, 47.0, 69.0, 32.0, 59.0, 78.0, 72.0, 80.0, 119.0, 124.0, 115.0, 98.0, 84.0, 61.0, 115.0, 92.0, 72.0, 100.0, 140.0, 130.0, 131.0, 165.0, 227.0, 311.0, 516.0, 916.0, 2157.0], [71.0, 133.0, 186.0, 56.0, 107.0, 123.0, 63.0, 89.0, 153.0, 152.0, 130.0, 75.0, 137.0, 70.0, 137.0, 110.0, 127.0, 145.0, 86.0, 105.0, 67.0, 55.0, 75.0, 63.0, 59.0, 103.0, 103.0, 85.0, 121.0, 155.0, 116.0, 136.0, 78.0, 128.0, 61.0, 94.0, 101.0, 60.0, 48.0, 76.0, 66.0, 38.0, 95.0, 102.0, 85.0, 216.0, 331.0, 579.0, 1506.0], [140.0, 216.0, 194.0, 215.0, 131.0, 109.0, 221.0, 75.0, 58.0, 105.0, 108.0, 104.0, 59.0, 47.0, 88.0, 81.0, 170.0, 122.0, 70.0, 59.0, 148.0, 154.0, 97.0, 48.0, 67.0, 138.0, 119.0, 42.0, 35.0, 52.0, 43.0, 95.0, 79.0, 40.0, 58.0, 60.0, 129.0, 112.0, 89.0, 137.0, 91.0, 57.0, 12.0, 61.0, 48.0, 147.0, 174.0, 262.0, 947.0], [74.0, 76.0, 89.0, 147.0, 67.0, 74.0, 123.0, 118.0, 103.0, 119.0, 114.0, 134.0, 80.0, 62.0, 117.0, 138.0, 97.0, 98.0, 92.0, 60.0, 62.0, 118.0, 51.0, 25.0, 64.0, 68.0, 106.0, 138.0, 131.0, 130.0, 48.0, 70.0, 116.0, 164.0, 130.0, 67.0, 122.0, 86.0, 81.0, 81.0, 58.0, 32.0, 4.0, 6.0, 100.0, 98.0, 148.0, 146.0, 579.0], [187.0, 157.0, 101.0, 93.0, 94.0, 101.0, 89.0, 51.0, 74.0, 56.0, 104.0, 33.0, 56.0, 55.0, 71.0, 101.0, 123.0, 146.0, 167.0, 137.0, 75.0, 38.0, 72.0, 46.0, 106.0, 27.0, 54.0, 97.0, 90.0, 81.0, 101.0, 58.0, 57.0, 101.0, 50.0, 56.0, 17.0, 57.0, 27.0, 47.0, 54.0, 24.0, 57.0, 95.0, 55.0, 33.0, 71.0, 93.0, 340.0], [148.0, 97.0, 31.0, 41.0, 113.0, 54.0, 71.0, 140.0, 108.0, 60.0, 71.0, 111.0, 77.0, 11.0, 23.0, 44.0, 116.0, 109.0, 92.0, 27.0, 61.0, 24.0, 65.0, 42.0, 67.0, 61.0, 50.0, 67.0, 57.0, 31.0, 27.0, 29.0, 91.0, 137.0, 109.0, 41.0, 35.0, 103.0, 55.0, 28.0, 43.0, 88.0, 89.0, 64.0, 59.0, 83.0, 66.0, 125.0, 260.0], [70.0, 57.0, 84.0, 81.0, 170.0, 113.0, 90.0, 64.0, 27.0, 8.0, 140.0, 51.0, 90.0, 88.0, 38.0, 25.0, 40.0, 85.0, 81.0, 29.0, 45.0, 27.0, 42.0, 74.0, 97.0, 61.0, 14.0, 72.0, 92.0, 75.0, 59.0, 26.0, 20.0, 59.0, 100.0, 69.0, 54.0, 10.0, 58.0, 46.0, 36.0, 36.0, 39.0, 74.0, 66.0, 60.0, 67.0, 63.0, 122.0], [81.0, 93.0, 101.0, 91.0, 75.0, 36.0, 58.0, 64.0, 53.0, 78.0, 118.0, 168.0, 85.0, 57.0, 50.0, 30.0, 69.0, 51.0, 80.0, 49.0, 15.0, 27.0, 108.0, 21.0, 61.0, 48.0, 34.0, 46.0, 39.0, 83.0, 39.0, 62.0, 34.0, 4.0, 21.0, 64.0, 73.0, 18.0, 17.0, 73.0, 69.0, 35.0, 39.0, 33.0, 42.0, 100.0, 74.0, 77.0, 51.0], [84.0, 56.0, 138.0, 136.0, 52.0, 105.0, 24.0, 55.0, 36.0, 86.0, 33.0, 44.0, 51.0, 64.0, 38.0, 57.0, 104.0, 64.0, 100.0, 59.0, 42.0, 21.0, 23.0, 48.0, 15.0, 72.0, 80.0, 43.0, 47.0, 18.0, 47.0, 87.0, 68.0, 92.0, 44.0, 43.0, 60.0, 39.0, 15.0, 79.0, 39.0, 54.0, 30.0, 41.0, 46.0, 41.0, 1.0, 7.0, 61.0], [77.0, 74.0, 47.0, 36.0, 30.0, 56.0, 36.0, 64.0, 53.0, 8.0, 22.0, 40.0, 36.0, 52.0, 46.0, 35.0, 107.0, 44.0, 31.0, 47.0, 61.0, 12.0, 33.0, 16.0, 56.0, 59.0, 93.0, 60.0, 66.0, 70.0, 28.0, 47.0, 53.0, 53.0, 37.0, 38.0, 90.0, 22.0, 60.0, 95.0, 38.0, 94.0, 86.0, 14.0, 32.0, 73.0, 41.0, 39.0, 75.0], [16.0, 15.0, 61.0, 67.0, 36.0, 50.0, 57.0, 62.0, 20.0, 14.0, 1.0, 0.0, 10.0, 14.0, 0.0, 22.0, 67.0, 9.0, 6.0, 18.0, 0.0, 0.0, 55.0, 25.0, 37.0, 52.0, 43.0, 52.0, 17.0, 8.0, 14.0, 68.0, 37.0, 8.0, 21.0, 43.0, 36.0, 17.0, 5.0, 32.0, 12.0, 44.0, 74.0, 29.0, 22.0, 21.0, 63.0, 18.0, 43.0], [42.0, 19.0, 8.0, 29.0, 16.0, 39.0, 31.0, 22.0, 8.0, 75.0, 38.0, 70.0, 42.0, 33.0, 0.0, 0.0, 7.0, 28.0, 38.0, 47.0, 1.0, 23.0, 24.0, 48.0, 2.0, 40.0, 11.0, 41.0, 31.0, 38.0, 54.0, 4.0, 19.0, 5.0, 0.0, 8.0, 17.0, 0.0, 19.0, 7.0, 0.0, 60.0, 11.0, 2.0, 38.0, 33.0, 21.0, 9.0, 19.0], [46.0, 60.0, 69.0, 48.0, 50.0, 10.0, 4.0, 20.0, 36.0, 31.0, 15.0, 39.0, 14.0, 17.0, 54.0, 38.0, 51.0, 1.0, 0.0, 23.0, 25.0, 22.0, 22.0, 5.0, 17.0, 9.0, 24.0, 9.0, 15.0, 0.0, 40.0, 28.0, 5.0, 0.0, 20.0, 33.0, 20.0, 13.0, 35.0, 25.0, 17.0, 8.0, 37.0, 13.0, 0.0, 0.0, 14.0, 34.0, 54.0], [28.0, 35.0, 30.0, 21.0, 9.0, 33.0, 45.0, 26.0, 55.0, 37.0, 36.0, 18.0, 8.0, 21.0, 4.0, 0.0, 13.0, 11.0, 33.0, 38.0, 2.0, 0.0, 0.0, 0.0, 14.0, 39.0, 64.0, 26.0, 6.0, 39.0, 27.0, 1.0, 51.0, 22.0, 25.0, 0.0, 0.0, 3.0, 21.0, 22.0, 64.0, 10.0, 1.0, 5.0, 20.0, 39.0, 10.0, 1.0, 26.0], [18.0, 23.0, 17.0, 16.0, 24.0, 36.0, 24.0, 18.0, 48.0, 26.0, 2.0, 0.0, 1.0, 3.0, 21.0, 0.0, 10.0, 37.0, 48.0, 25.0, 38.0, 16.0, 23.0, 20.0, 0.0, 23.0, 25.0, 9.0, 38.0, 25.0, 1.0, 0.0, 23.0, 23.0, 21.0, 6.0, 0.0, 4.0, 20.0, 45.0, 3.0, 1.0, 0.0, 19.0, 5.0, 25.0, 0.0, 10.0, 21.0], [87.0, 41.0, 1.0, 10.0, 4.0, 1.0, 0.0, 1.0, 3.0, 1.0, 1.0, 25.0, 23.0, 0.0, 0.0, 8.0, 30.0, 22.0, 12.0, 19.0, 6.0, 29.0, 40.0, 5.0, 0.0, 0.0, 21.0, 4.0, 0.0, 0.0, 37.0, 41.0, 42.0, 0.0, 0.0, 0.0, 0.0, 0.0, 0.0, 25.0, 0.0, 0.0, 0.0, 0.0, 2.0, 32.0, 62.0, 6.0, 4.0], [26.0, 7.0, 29.0, 28.0, 29.0, 14.0, 27.0, 19.0, 28.0, 5.0, 23.0, 1.0, 0.0, 1.0, 2.0, 47.0, 39.0, 52.0, 3.0, 0.0, 28.0, 21.0, 2.0, 40.0, 8.0, 21.0, 3.0, 21.0, 42.0, 9.0, 0.0, 0.0, 0.0, 0.0, 0.0, 0.0, 0.0, 20.0, 4.0, 17.0, 8.0, 1.0, 1.0, 0.0, 37.0, 30.0, 7.0, 1.0, 24.0], [29.0, 13.0, 46.0, 10.0, 42.0, 12.0, 6.0, 2.0, 2.0, 21.0, 6.0, 23.0, 1.0, 1.0, 0.0, 0.0, 0.0, 24.0, 0.0, 0.0, 20.0, 21.0, 7.0, 0.0, 1.0, 1.0, 0.0, 0.0, 0.0, 0.0, 0.0, 0.0, 0.0, 6.0, 18.0, 0.0, 0.0, 17.0, 23.0, 11.0, 0.0, 0.0, 1.0, 0.0, 0.0, 2.0, 0.0, 1.0, 1.0]],
    "Name": "sCurve-0",
    "Overflow": 2526289.0,
    "Type": "Histo2d",
    "Underflow": 0.0,
    "x": {
        "AxisTitle": "Vcal",
        "Bins": 51,
        "High": 302.5,
        "Low": 47.5
    },
    "y": {
        "AxisTitle": "Occupancy",
        "Bins": 49,
        "High": 49.5,
        "Low": 0.5
    },
    "z": {
        "AxisTitle": "Number of pixels"
    }
}