time,Hardware,Voltage,Current
1626344480499,high-voltage-2,1,0.0950837
time,Hardware,Voltage,Current
1626344480499,high-voltage-2,2,0.136581
time,Hardware,Voltage,Current
1626344480499,high-voltage-2,3,0.159176
time,Hardware,Voltage,Current
1626344480499,high-voltage-2,4,0.177406
time,Hardware,Voltage,Current
1626344480499,high-voltage-2,5,0.194508
time,Hardware,Voltage,Current
1626344480499,high-voltage-2,6,0.215034
time,Hardware,Voltage,Current
1626344480499,high-voltage-2,7,0.234993
time,Hardware,Voltage,Current
1626344480499,high-voltage-2,8,0.259688
time,Hardware,Voltage,Current
1626344480499,high-voltage-2,9,0.282692
time,Hardware,Voltage,Current
1626344480499,high-voltage-2,10,0.308105
time,Hardware,Voltage,Current
1626344480499,high-voltage-2,11,0.332883
time,Hardware,Voltage,Current
1626344480499,high-voltage-2,12,0.355352
time,Hardware,Voltage,Current
1626344480499,high-voltage-2,13,0.373274
time,Hardware,Voltage,Current
1626344480499,high-voltage-2,14,0.391557
time,Hardware,Voltage,Current
1626344480499,high-voltage-2,15,0.406052
time,Hardware,Voltage,Current
1626344480499,high-voltage-2,16,0.420347
time,Hardware,Voltage,Current
1626344480499,high-voltage-2,17,0.43261
time,Hardware,Voltage,Current
1626344480499,high-voltage-2,18,0.444405
time,Hardware,Voltage,Current
1626344480499,high-voltage-2,19,0.457992
time,Hardware,Voltage,Current
1626344480499,high-voltage-2,20,0.468405
time,Hardware,Voltage,Current
1626344480499,high-voltage-2,25,0.520689
time,Hardware,Voltage,Current
1626344480499,high-voltage-2,30,0.571406
time,Hardware,Voltage,Current
1626344480499,high-voltage-2,35,0.62504
time,Hardware,Voltage,Current
1626344480499,high-voltage-2,40,0.688586
time,Hardware,Voltage,Current
1626344480499,high-voltage-2,45,0.765834
time,Hardware,Voltage,Current
1626344480499,high-voltage-2,50,0.824378
time,Hardware,Voltage,Current
1626344480499,high-voltage-2,55,0.880386
time,Hardware,Voltage,Current
1626344480499,high-voltage-2,60,0.934697
time,Hardware,Voltage,Current
1626344480499,high-voltage-2,65,0.984552
time,Hardware,Voltage,Current
1626344480499,high-voltage-2,70,1.03262
time,Hardware,Voltage,Current
1626344480499,high-voltage-2,75,1.08024
time,Hardware,Voltage,Current
1626344480499,high-voltage-2,80,1.12458
time,Hardware,Voltage,Current
1626344480499,high-voltage-2,85,1.16583
time,Hardware,Voltage,Current
1626344480499,high-voltage-2,90,1.20525
time,Hardware,Voltage,Current
1626344480499,high-voltage-2,95,1.24111
time,Hardware,Voltage,Current
1626344480499,high-voltage-2,100,1.27502
