time,Hardware,Voltage,Current
1623348964863,high-voltage,1,0.0672874
time,Hardware,Voltage,Current
1623348964863,high-voltage,2,0.0848661
time,Hardware,Voltage,Current
1623348964863,high-voltage,3,0.101097
time,Hardware,Voltage,Current
1623348964863,high-voltage,4,0.114993
time,Hardware,Voltage,Current
1623348964863,high-voltage,5,0.126
time,Hardware,Voltage,Current
1623348964863,high-voltage,6,0.13437
time,Hardware,Voltage,Current
1623348964863,high-voltage,7,0.142342
time,Hardware,Voltage,Current
1623348964863,high-voltage,8,0.14927
time,Hardware,Voltage,Current
1623348964863,high-voltage,9,0.155569
time,Hardware,Voltage,Current
1623348964863,high-voltage,10,0.160004
time,Hardware,Voltage,Current
1623348964863,high-voltage,11,0.165927
time,Hardware,Voltage,Current
1623348964863,high-voltage,12,0.171091
time,Hardware,Voltage,Current
1623348964863,high-voltage,13,0.174935
time,Hardware,Voltage,Current
1623348964863,high-voltage,14,0.179301
time,Hardware,Voltage,Current
1623348964863,high-voltage,15,0.183362
time,Hardware,Voltage,Current
1623348964863,high-voltage,16,0.188217
time,Hardware,Voltage,Current
1623348964863,high-voltage,17,0.19238
time,Hardware,Voltage,Current
1623348964863,high-voltage,18,0.196415
time,Hardware,Voltage,Current
1623348964863,high-voltage,19,0.199635
time,Hardware,Voltage,Current
1623348964863,high-voltage,20,0.204915
time,Hardware,Voltage,Current
1623348964863,high-voltage,2.26206e-07,0.22612
time,Hardware,Voltage,Current
1623348964863,high-voltage,30,0.260198
time,Hardware,Voltage,Current
1623348964863,high-voltage,35,0.358026
time,Hardware,Voltage,Current
1623348964863,high-voltage,40,0.608019
