time,Hardware,Voltage,Current
1622072457813,high-voltage-3,1,0.094032
time,Hardware,Voltage,Current
1622072457813,high-voltage-3,2,0.101038
time,Hardware,Voltage,Current
1622072457813,high-voltage-3,3,0.107165
time,Hardware,Voltage,Current
1622072457813,high-voltage-3,4,0.113668
time,Hardware,Voltage,Current
1622072457813,high-voltage-3,5,0.117346
time,Hardware,Voltage,Current
1622072457813,high-voltage-3,6,0.122266
time,Hardware,Voltage,Current
1622072457813,high-voltage-3,7,0.129063
time,Hardware,Voltage,Current
1622072457813,high-voltage-3,8,0.135555
time,Hardware,Voltage,Current
1622072457813,high-voltage-3,9,0.141724
time,Hardware,Voltage,Current
1622072457813,high-voltage-3,10,0.148186
time,Hardware,Voltage,Current
1622072457813,high-voltage-3,11,0.154991
time,Hardware,Voltage,Current
1622072457813,high-voltage-3,12,0.162861
time,Hardware,Voltage,Current
1622072457813,high-voltage-3,13,0.167637
time,Hardware,Voltage,Current
1622072457813,high-voltage-3,14,0.17348
time,Hardware,Voltage,Current
1622072457813,high-voltage-3,15,0.178798
time,Hardware,Voltage,Current
1622072457813,high-voltage-3,16,0.184957
time,Hardware,Voltage,Current
1622072457813,high-voltage-3,17,0.189206
time,Hardware,Voltage,Current
1622072457813,high-voltage-3,18,0.19466
time,Hardware,Voltage,Current
1622072457813,high-voltage-3,19,0.19898
time,Hardware,Voltage,Current
1622072457813,high-voltage-3,20,0.202042
time,Hardware,Voltage,Current
1622072457813,high-voltage-3,25,0.221956
time,Hardware,Voltage,Current
1622072457813,high-voltage-3,30,0.238102
time,Hardware,Voltage,Current
1622072457813,high-voltage-3,35,0.253133
time,Hardware,Voltage,Current
1622072457813,high-voltage-3,40,0.270614
time,Hardware,Voltage,Current
1622072457813,high-voltage-3,45,0.284266
time,Hardware,Voltage,Current
1622072457813,high-voltage-3,50,0.295521
time,Hardware,Voltage,Current
1622072457813,high-voltage-3,55,0.307938
time,Hardware,Voltage,Current
1622072457813,high-voltage-3,60,0.319816
time,Hardware,Voltage,Current
1622072457813,high-voltage-3,65,0.329829
time,Hardware,Voltage,Current
1622072457813,high-voltage-3,70,0.342832
time,Hardware,Voltage,Current
1622072457813,high-voltage-3,75,0.350736
time,Hardware,Voltage,Current
1622072457813,high-voltage-3,80,0.363968
time,Hardware,Voltage,Current
1622072457813,high-voltage-3,85,0.375784
time,Hardware,Voltage,Current
1622072457813,high-voltage-3,90,0.386469
time,Hardware,Voltage,Current
1622072457813,high-voltage-3,95,0.395171
time,Hardware,Voltage,Current
1622072457813,high-voltage-3,100,0.406048