time,Hardware,Voltage,Current
1626322251842,high-voltage-3,1,0.279111
time,Hardware,Voltage,Current
1626322251842,high-voltage-3,2,0.301057
time,Hardware,Voltage,Current
1626322251842,high-voltage-3,3,0.317959
time,Hardware,Voltage,Current
1626322251842,high-voltage-3,4,0.332293
time,Hardware,Voltage,Current
1626322251842,high-voltage-3,5,0.345854
time,Hardware,Voltage,Current
1626322251842,high-voltage-3,6,0.359124
time,Hardware,Voltage,Current
1626322251842,high-voltage-3,7,0.371841
time,Hardware,Voltage,Current
1626322251842,high-voltage-3,8,0.388766
time,Hardware,Voltage,Current
1626322251842,high-voltage-3,9,0.403317
time,Hardware,Voltage,Current
1626322251842,high-voltage-3,10,0.421854
time,Hardware,Voltage,Current
1626322251842,high-voltage-3,11,0.436568
time,Hardware,Voltage,Current
1626322251842,high-voltage-3,12,0.452782
time,Hardware,Voltage,Current
1626322251842,high-voltage-3,13,0.466957
time,Hardware,Voltage,Current
1626322251842,high-voltage-3,14,0.481864
time,Hardware,Voltage,Current
1626322251842,high-voltage-3,15,0.49264
time,Hardware,Voltage,Current
1626322251842,high-voltage-3,16,0.504571
time,Hardware,Voltage,Current
1626322251842,high-voltage-3,17,0.517086
time,Hardware,Voltage,Current
1626322251842,high-voltage-3,18,0.525932
time,Hardware,Voltage,Current
1626322251842,high-voltage-3,19,0.537621
time,Hardware,Voltage,Current
1626322251842,high-voltage-3,20,0.547271
time,Hardware,Voltage,Current
1626322251842,high-voltage-3,25,0.590676
time,Hardware,Voltage,Current
1626322251842,high-voltage-3,30,0.628112
time,Hardware,Voltage,Current
1626322251842,high-voltage-3,35,0.66035
time,Hardware,Voltage,Current
1626322251842,high-voltage-3,40,0.689812
time,Hardware,Voltage,Current
1626322251842,high-voltage-3,45,0.715271
time,Hardware,Voltage,Current
1626322251842,high-voltage-3,50,0.740887
time,Hardware,Voltage,Current
1626322251842,high-voltage-3,55,0.764727
time,Hardware,Voltage,Current
1626322251842,high-voltage-3,60,0.787534
time,Hardware,Voltage,Current
1626322251842,high-voltage-3,65,0.812294
time,Hardware,Voltage,Current
1626322251842,high-voltage-3,70,0.836978
time,Hardware,Voltage,Current
1626322251842,high-voltage-3,75,0.860796
time,Hardware,Voltage,Current
1626322251842,high-voltage-3,80,0.88524
time,Hardware,Voltage,Current
1626322251842,high-voltage-3,85,0.910358
time,Hardware,Voltage,Current
1626322251842,high-voltage-3,90,0.930956
time,Hardware,Voltage,Current
1626322251842,high-voltage-3,95,0.955907
time,Hardware,Voltage,Current
1626322251842,high-voltage-3,100,0.978072
