{
    "Data": [[4279.0, 2336.0, 1673.0, 1265.0, 1102.0, 915.0, 754.0, 762.0, 607.0, 612.0, 559.0, 515.0, 512.0, 500.0, 504.0, 468.0, 461.0, 445.0, 414.0, 374.0, 404.0, 396.0, 410.0, 390.0, 329.0, 354.0, 333.0, 369.0, 334.0, 330.0, 347.0, 321.0, 331.0, 337.0, 322.0, 351.0, 343.0, 315.0, 333.0, 353.0, 323.0, 357.0, 364.0, 377.0, 418.0, 429.0, 460.0, 533.0, 631.0], [4254.0, 2365.0, 1631.0, 1327.0, 1054.0, 873.0, 830.0, 744.0, 687.0, 599.0, 588.0, 552.0, 505.0, 542.0, 480.0, 481.0, 423.0, 404.0, 416.0, 416.0, 414.0, 420.0, 379.0, 367.0, 375.0, 372.0, 340.0, 366.0, 331.0, 353.0, 323.0, 363.0, 339.0, 355.0, 316.0, 324.0, 315.0, 349.0, 348.0, 316.0, 384.0, 348.0, 419.0, 405.0, 408.0, 468.0, 533.0, 594.0, 816.0], [4263.0, 2359.0, 1730.0, 1306.0, 1091.0, 885.0, 794.0, 758.0, 703.0, 655.0, 599.0, 557.0, 544.0, 490.0, 480.0, 459.0, 466.0, 435.0, 450.0, 439.0, 437.0, 438.0, 377.0, 354.0, 369.0, 369.0, 316.0, 346.0, 331.0, 330.0, 376.0, 338.0, 312.0, 330.0, 344.0, 345.0, 348.0, 382.0, 353.0, 348.0, 389.0, 382.0, 420.0, 381.0, 403.0, 468.0, 541.0, 657.0, 930.0], [4452.0, 2378.0, 1657.0, 1312.0, 1105.0, 935.0, 799.0, 751.0, 676.0, 665.0, 579.0, 551.0, 513.0, 525.0, 500.0, 509.0, 433.0, 429.0, 411.0, 421.0, 436.0, 425.0, 408.0, 400.0, 407.0, 345.0, 374.0, 336.0, 346.0, 348.0, 351.0, 302.0, 349.0, 372.0, 370.0, 327.0, 344.0, 376.0, 364.0, 345.0, 402.0, 385.0, 416.0, 422.0, 429.0, 469.0, 537.0, 670.0, 984.0], [4434.0, 2441.0, 1752.0, 1328.0, 1083.0, 903.0, 861.0, 797.0, 671.0, 654.0, 620.0, 533.0, 603.0, 511.0, 472.0, 517.0, 465.0, 452.0, 415.0, 426.0, 417.0, 391.0, 396.0, 389.0, 363.0, 398.0, 389.0, 350.0, 361.0, 375.0, 334.0, 318.0, 347.0, 355.0, 387.0, 324.0, 330.0, 340.0, 370.0, 378.0, 384.0, 379.0, 411.0, 405.0, 489.0, 524.0, 585.0, 715.0, 1073.0], [4423.0, 2390.0, 1855.0, 1325.0, 1078.0, 932.0, 844.0, 767.0, 683.0, 654.0, 603.0, 554.0, 603.0, 551.0, 481.0, 481.0, 464.0, 466.0, 416.0, 430.0, 450.0, 401.0, 384.0, 413.0, 367.0, 353.0, 378.0, 349.0, 349.0, 346.0, 383.0, 347.0, 372.0, 325.0, 351.0, 357.0, 368.0, 384.0, 396.0, 361.0, 405.0, 359.0, 419.0, 455.0, 482.0, 525.0, 610.0, 730.0, 1094.0], [4453.0, 2357.0, 1701.0, 1289.0, 1101.0, 917.0, 891.0, 787.0, 719.0, 666.0, 602.0, 630.0, 549.0, 512.0, 504.0, 558.0, 508.0, 448.0, 428.0, 431.0, 419.0, 435.0, 391.0, 399.0, 400.0, 382.0, 362.0, 377.0, 363.0, 373.0, 337.0, 364.0, 338.0, 345.0, 368.0, 362.0, 375.0, 386.0, 355.0, 411.0, 392.0, 420.0, 386.0, 469.0, 455.0, 494.0, 572.0, 723.0, 1199.0], [4490.0, 2432.0, 1706.0, 1345.0, 1133.0, 928.0, 867.0, 748.0, 688.0, 651.0, 624.0, 585.0, 558.0, 489.0, 504.0, 494.0, 509.0, 466.0, 439.0, 467.0, 430.0, 414.0, 410.0, 393.0, 352.0, 393.0, 402.0, 405.0, 384.0, 345.0, 357.0, 356.0, 364.0, 343.0, 375.0, 374.0, 386.0, 400.0, 374.0, 375.0, 408.0, 417.0, 418.0, 469.0, 473.0, 533.0, 634.0, 757.0, 1146.0], [4390.0, 2440.0, 1723.0, 1329.0, 1148.0, 931.0, 831.0, 785.0, 715.0, 631.0, 596.0, 619.0, 528.0, 512.0, 517.0, 506.0, 492.0, 438.0, 450.0, 437.0, 439.0, 414.0, 384.0, 391.0, 327.0, 431.0, 398.0, 367.0, 353.0, 380.0, 369.0, 356.0, 340.0, 401.0, 362.0, 370.0, 374.0, 376.0, 378.0, 410.0, 421.0, 417.0, 434.0, 470.0, 504.0, 574.0, 603.0, 786.0, 1181.0], [4347.0, 2467.0, 1694.0, 1333.0, 1077.0, 968.0, 866.0, 758.0, 714.0, 654.0, 589.0, 578.0, 563.0, 522.0, 494.0, 478.0, 503.0, 418.0, 442.0, 417.0, 407.0, 435.0, 435.0, 427.0, 365.0, 402.0, 382.0, 362.0, 344.0, 356.0, 395.0, 345.0, 369.0, 329.0, 356.0, 373.0, 375.0, 376.0, 425.0, 373.0, 401.0, 371.0, 449.0, 495.0, 463.0, 588.0, 629.0, 788.0, 1255.0], [4402.0, 2407.0, 1688.0, 1296.0, 1096.0, 963.0, 838.0, 756.0, 684.0, 675.0, 564.0, 600.0, 531.0, 534.0, 503.0, 506.0, 444.0, 469.0, 425.0, 426.0, 420.0, 375.0, 409.0, 425.0, 381.0, 392.0, 374.0, 348.0, 366.0, 365.0, 343.0, 381.0, 339.0, 372.0, 376.0, 381.0, 354.0, 368.0, 415.0, 370.0, 358.0, 434.0, 433.0, 458.0, 511.0, 506.0, 632.0, 771.0, 1222.0], [4265.0, 2391.0, 1646.0, 1315.0, 1043.0, 916.0, 808.0, 780.0, 657.0, 658.0, 565.0, 541.0, 550.0, 495.0, 493.0, 469.0, 455.0, 457.0, 394.0, 411.0, 388.0, 386.0, 395.0, 387.0, 419.0, 390.0, 415.0, 371.0, 395.0, 373.0, 316.0, 371.0, 357.0, 331.0, 347.0, 379.0, 401.0, 382.0, 380.0, 369.0, 381.0, 421.0, 421.0, 416.0, 506.0, 553.0, 612.0, 762.0, 1235.0], [4198.0, 2334.0, 1618.0, 1312.0, 1057.0, 921.0, 772.0, 690.0, 671.0, 655.0, 614.0, 544.0, 524.0, 487.0, 517.0, 473.0, 452.0, 445.0, 399.0, 407.0, 391.0, 391.0, 386.0, 384.0, 375.0, 366.0, 343.0, 360.0, 297.0, 361.0, 333.0, 360.0, 385.0, 338.0, 338.0, 356.0, 360.0, 363.0, 388.0, 407.0, 368.0, 413.0, 432.0, 417.0, 501.0, 516.0, 617.0, 742.0, 1208.0], [4143.0, 2324.0, 1620.0, 1296.0, 1024.0, 853.0, 763.0, 737.0, 630.0, 579.0, 574.0, 516.0, 512.0, 477.0, 465.0, 442.0, 463.0, 425.0, 419.0, 430.0, 391.0, 390.0, 384.0, 378.0, 369.0, 371.0, 372.0, 336.0, 360.0, 340.0, 319.0, 363.0, 344.0, 330.0, 303.0, 356.0, 361.0, 375.0, 376.0, 346.0, 360.0, 367.0, 396.0, 416.0, 492.0, 517.0, 564.0, 724.0, 1219.0], [4162.0, 2301.0, 1563.0, 1250.0, 1010.0, 871.0, 775.0, 669.0, 666.0, 602.0, 522.0, 489.0, 509.0, 523.0, 448.0, 442.0, 421.0, 436.0, 402.0, 397.0, 394.0, 377.0, 333.0, 379.0, 338.0, 338.0, 320.0, 365.0, 327.0, 353.0, 323.0, 302.0, 303.0, 335.0, 322.0, 336.0, 344.0, 345.0, 351.0, 375.0, 366.0, 371.0, 378.0, 413.0, 428.0, 513.0, 569.0, 712.0, 1048.0], [4275.0, 2316.0, 1561.0, 1269.0, 973.0, 850.0, 781.0, 662.0, 624.0, 561.0, 563.0, 502.0, 512.0, 503.0, 457.0, 432.0, 426.0, 420.0, 387.0, 401.0, 382.0, 384.0, 323.0, 353.0, 356.0, 352.0, 308.0, 327.0, 318.0, 302.0, 348.0, 308.0, 332.0, 295.0, 328.0, 310.0, 321.0, 306.0, 350.0, 332.0, 358.0, 394.0, 404.0, 376.0, 420.0, 466.0, 520.0, 612.0, 1002.0], [4826.0, 2345.0, 1625.0, 1236.0, 973.0, 862.0, 751.0, 673.0, 568.0, 591.0, 547.0, 499.0, 445.0, 459.0, 428.0, 410.0, 428.0, 409.0, 397.0, 347.0, 344.0, 421.0, 397.0, 342.0, 353.0, 363.0, 320.0, 308.0, 315.0, 325.0, 299.0, 316.0, 294.0, 322.0, 287.0, 280.0, 333.0, 296.0, 347.0, 331.0, 304.0, 345.0, 324.0, 380.0, 433.0, 424.0, 498.0, 610.0, 983.0], [5501.0, 2636.0, 1695.0, 1232.0, 967.0, 818.0, 769.0, 650.0, 597.0, 567.0, 531.0, 501.0, 493.0, 485.0, 422.0, 401.0, 398.0, 369.0, 367.0, 338.0, 369.0, 343.0, 372.0, 346.0, 327.0, 340.0, 349.0, 330.0, 327.0, 277.0, 274.0, 291.0, 311.0, 288.0, 320.0, 318.0, 298.0, 303.0, 307.0, 282.0, 321.0, 283.0, 345.0, 348.0, 387.0, 449.0, 509.0, 624.0, 892.0], [6403.0, 3088.0, 1941.0, 1450.0, 1040.0, 847.0, 804.0, 658.0, 643.0, 516.0, 545.0, 464.0, 457.0, 416.0, 436.0, 398.0, 367.0, 392.0, 384.0, 332.0, 322.0, 365.0, 335.0, 333.0, 317.0, 310.0, 312.0, 307.0, 289.0, 279.0, 317.0, 302.0, 284.0, 302.0, 325.0, 293.0, 306.0, 272.0, 279.0, 341.0, 290.0, 338.0, 342.0, 348.0, 342.0, 378.0, 456.0, 523.0, 854.0], [7230.0, 3731.0, 2462.0, 1655.0, 1277.0, 949.0, 833.0, 716.0, 613.0, 552.0, 552.0, 497.0, 513.0, 468.0, 410.0, 406.0, 380.0, 374.0, 392.0, 366.0, 370.0, 362.0, 329.0, 311.0, 315.0, 302.0, 276.0, 299.0, 267.0, 303.0, 262.0, 275.0, 292.0, 269.0, 287.0, 274.0, 291.0, 281.0, 279.0, 297.0, 288.0, 304.0, 328.0, 330.0, 367.0, 383.0, 440.0, 495.0, 815.0], [7800.0, 4332.0, 2989.0, 2099.0, 1574.0, 1222.0, 1010.0, 890.0, 765.0, 663.0, 601.0, 508.0, 484.0, 492.0, 413.0, 421.0, 384.0, 410.0, 366.0, 336.0, 353.0, 343.0, 357.0, 330.0, 288.0, 287.0, 312.0, 273.0, 268.0, 290.0, 266.0, 272.0, 286.0, 292.0, 270.0, 257.0, 269.0, 292.0, 292.0, 310.0, 292.0, 274.0, 307.0, 297.0, 326.0, 329.0, 352.0, 483.0, 696.0], [7536.0, 4746.0, 3354.0, 2515.0, 1967.0, 1602.0, 1327.0, 1126.0, 953.0, 852.0, 752.0, 640.0, 592.0, 515.0, 504.0, 405.0, 462.0, 385.0, 368.0, 390.0, 352.0, 347.0, 339.0, 337.0, 322.0, 316.0, 308.0, 281.0, 298.0, 261.0, 262.0, 273.0, 253.0, 267.0, 300.0, 285.0, 275.0, 273.0, 265.0, 276.0, 282.0, 282.0, 303.0, 288.0, 307.0, 328.0, 363.0, 460.0, 635.0], [7095.0, 4513.0, 3498.0, 2765.0, 2273.0, 1925.0, 1672.0, 1386.0, 1294.0, 1049.0, 951.0, 841.0, 713.0, 696.0, 701.0, 614.0, 533.0, 523.0, 464.0, 425.0, 409.0, 399.0, 367.0, 326.0, 326.0, 312.0, 308.0, 311.0, 310.0, 300.0, 299.0, 260.0, 279.0, 267.0, 297.0, 292.0, 304.0, 271.0, 303.0, 263.0, 267.0, 298.0, 284.0, 274.0, 268.0, 315.0, 336.0, 427.0, 579.0], [6119.0, 4214.0, 3354.0, 2701.0, 2291.0, 2147.0, 1789.0, 1650.0, 1485.0, 1291.0, 1204.0, 1069.0, 1015.0, 946.0, 812.0, 764.0, 719.0, 671.0, 594.0, 556.0, 539.0, 525.0, 457.0, 418.0, 425.0, 389.0, 354.0, 332.0, 341.0, 336.0, 304.0, 315.0, 299.0, 291.0, 311.0, 286.0, 273.0, 288.0, 284.0, 270.0, 291.0, 295.0, 289.0, 264.0, 288.0, 320.0, 309.0, 418.0, 529.0], [5410.0, 3404.0, 2894.0, 2473.0, 2102.0, 1929.0, 1787.0, 1639.0, 1483.0, 1399.0, 1408.0, 1279.0, 1125.0, 1110.0, 1075.0, 984.0, 916.0, 854.0, 780.0, 747.0, 662.0, 685.0, 606.0, 610.0, 554.0, 518.0, 492.0, 490.0, 450.0, 419.0, 373.0, 338.0, 356.0, 360.0, 348.0, 298.0, 322.0, 314.0, 303.0, 296.0, 309.0, 283.0, 272.0, 324.0, 289.0, 297.0, 321.0, 424.0, 545.0], [4732.0, 2999.0, 2424.0, 2041.0, 1790.0, 1746.0, 1597.0, 1469.0, 1422.0, 1291.0, 1295.0, 1261.0, 1230.0, 1149.0, 1129.0, 1032.0, 1108.0, 969.0, 960.0, 859.0, 869.0, 832.0, 825.0, 739.0, 731.0, 715.0, 674.0, 608.0, 585.0, 591.0, 518.0, 496.0, 516.0, 492.0, 454.0, 453.0, 412.0, 399.0, 412.0, 341.0, 381.0, 360.0, 356.0, 320.0, 324.0, 346.0, 329.0, 415.0, 470.0], [4189.0, 2601.0, 1999.0, 1679.0, 1469.0, 1408.0, 1347.0, 1259.0, 1213.0, 1237.0, 1153.0, 1112.0, 1043.0, 1011.0, 1094.0, 1030.0, 1015.0, 1018.0, 956.0, 971.0, 939.0, 906.0, 881.0, 855.0, 866.0, 831.0, 808.0, 809.0, 819.0, 775.0, 727.0, 713.0, 676.0, 682.0, 627.0, 604.0, 559.0, 517.0, 531.0, 546.0, 486.0, 491.0, 432.0, 432.0, 463.0, 450.0, 416.0, 463.0, 516.0], [3980.0, 2295.0, 1724.0, 1464.0, 1248.0, 1140.0, 1089.0, 1012.0, 1008.0, 948.0, 926.0, 959.0, 866.0, 914.0, 933.0, 868.0, 909.0, 935.0, 894.0, 943.0, 907.0, 869.0, 844.0, 868.0, 963.0, 920.0, 888.0, 809.0, 836.0, 892.0, 900.0, 897.0, 856.0, 846.0, 814.0, 765.0, 815.0, 800.0, 734.0, 674.0, 691.0, 662.0, 666.0, 632.0, 587.0, 644.0, 558.0, 607.0, 657.0], [3936.0, 2162.0, 1609.0, 1275.0, 1119.0, 962.0, 892.0, 818.0, 766.0, 737.0, 776.0, 763.0, 759.0, 745.0, 732.0, 788.0, 782.0, 783.0, 760.0, 780.0, 802.0, 751.0, 794.0, 809.0, 803.0, 844.0, 760.0, 848.0, 853.0, 865.0, 881.0, 849.0, 922.0, 892.0, 818.0, 932.0, 907.0, 944.0, 939.0, 994.0, 925.0, 887.0, 897.0, 899.0, 940.0, 902.0, 845.0, 886.0, 953.0], [3795.0, 2177.0, 1555.0, 1208.0, 1043.0, 897.0, 807.0, 699.0, 723.0, 668.0, 667.0, 694.0, 606.0, 618.0, 639.0, 606.0, 594.0, 614.0, 593.0, 584.0, 659.0, 676.0, 621.0, 643.0, 657.0, 625.0, 696.0, 672.0, 734.0, 737.0, 753.0, 766.0, 797.0, 834.0, 816.0, 896.0, 931.0, 984.0, 984.0, 1018.0, 1049.0, 1120.0, 1110.0, 1157.0, 1199.0, 1235.0, 1328.0, 1354.0, 1496.0], [3780.0, 2089.0, 1507.0, 1185.0, 946.0, 774.0, 740.0, 682.0, 651.0, 594.0, 552.0, 564.0, 494.0, 523.0, 476.0, 512.0, 514.0, 534.0, 473.0, 530.0, 515.0, 475.0, 516.0, 538.0, 505.0, 522.0, 539.0, 561.0, 585.0, 612.0, 611.0, 616.0, 659.0, 706.0, 792.0, 794.0, 877.0, 900.0, 880.0, 1035.0, 1024.0, 1081.0, 1218.0, 1212.0, 1388.0, 1559.0, 1639.0, 1913.0, 2208.0], [3782.0, 2107.0, 1475.0, 1082.0, 906.0, 804.0, 635.0, 654.0, 605.0, 579.0, 553.0, 538.0, 466.0, 505.0, 465.0, 526.0, 479.0, 414.0, 412.0, 430.0, 396.0, 450.0, 393.0, 406.0, 430.0, 426.0, 379.0, 420.0, 423.0, 461.0, 520.0, 522.0, 517.0, 581.0, 566.0, 605.0, 635.0, 716.0, 847.0, 821.0, 880.0, 1028.0, 1071.0, 1186.0, 1385.0, 1625.0, 1952.0, 2180.0, 2940.0], [3782.0, 2026.0, 1466.0, 1166.0, 927.0, 815.0, 762.0, 603.0, 598.0, 580.0, 592.0, 462.0, 467.0, 464.0, 417.0, 428.0, 393.0, 363.0, 366.0, 366.0, 395.0, 363.0, 384.0, 347.0, 384.0, 339.0, 359.0, 320.0, 364.0, 340.0, 414.0, 382.0, 417.0, 475.0, 477.0, 412.0, 514.0, 571.0, 603.0, 685.0, 651.0, 826.0, 778.0, 1007.0, 1214.0, 1444.0, 1853.0, 2283.0, 3467.0], [3654.0, 2114.0, 1451.0, 1104.0, 906.0, 841.0, 722.0, 614.0, 610.0, 546.0, 477.0, 458.0, 423.0, 441.0, 434.0, 393.0, 341.0, 383.0, 372.0, 368.0, 349.0, 369.0, 319.0, 345.0, 298.0, 294.0, 292.0, 298.0, 289.0, 297.0, 306.0, 288.0, 333.0, 356.0, 355.0, 358.0, 381.0, 372.0, 417.0, 503.0, 528.0, 585.0, 671.0, 779.0, 933.0, 1168.0, 1636.0, 2212.0, 3471.0], [3582.0, 2123.0, 1512.0, 1190.0, 895.0, 754.0, 673.0, 611.0, 562.0, 499.0, 457.0, 417.0, 453.0, 411.0, 420.0, 335.0, 340.0, 380.0, 376.0, 332.0, 320.0, 329.0, 363.0, 325.0, 326.0, 273.0, 278.0, 296.0, 267.0, 289.0, 292.0, 263.0, 257.0, 271.0, 274.0, 263.0, 299.0, 328.0, 363.0, 338.0, 384.0, 443.0, 421.0, 570.0, 721.0, 883.0, 1205.0, 1705.0, 3233.0], [3704.0, 2084.0, 1442.0, 1163.0, 849.0, 752.0, 647.0, 696.0, 565.0, 506.0, 477.0, 418.0, 447.0, 368.0, 394.0, 371.0, 334.0, 360.0, 304.0, 321.0, 329.0, 319.0, 269.0, 299.0, 302.0, 279.0, 289.0, 260.0, 280.0, 336.0, 272.0, 279.0, 281.0, 260.0, 279.0, 331.0, 247.0, 293.0, 297.0, 272.0, 265.0, 338.0, 361.0, 410.0, 495.0, 629.0, 853.0, 1301.0, 2578.0], [3625.0, 2044.0, 1493.0, 1116.0, 835.0, 760.0, 700.0, 556.0, 548.0, 539.0, 462.0, 442.0, 399.0, 444.0, 372.0, 401.0, 368.0, 320.0, 337.0, 347.0, 329.0, 302.0, 288.0, 294.0, 269.0, 306.0, 243.0, 281.0, 244.0, 208.0, 236.0, 271.0, 253.0, 245.0, 241.0, 257.0, 244.0, 259.0, 256.0, 253.0, 286.0, 282.0, 298.0, 329.0, 321.0, 389.0, 593.0, 881.0, 1803.0], [3727.0, 2018.0, 1468.0, 1154.0, 965.0, 768.0, 677.0, 568.0, 570.0, 517.0, 471.0, 436.0, 375.0, 397.0, 404.0, 328.0, 327.0, 369.0, 355.0, 308.0, 297.0, 310.0, 284.0, 316.0, 285.0, 280.0, 243.0, 276.0, 236.0, 260.0, 234.0, 264.0, 286.0, 252.0, 235.0, 260.0, 238.0, 218.0, 242.0, 243.0, 234.0, 269.0, 252.0, 282.0, 310.0, 306.0, 401.0, 588.0, 1291.0], [3716.0, 1987.0, 1449.0, 1152.0, 883.0, 775.0, 652.0, 580.0, 571.0, 511.0, 437.0, 443.0, 424.0, 395.0, 362.0, 360.0, 341.0, 368.0, 336.0, 312.0, 306.0, 308.0, 282.0, 268.0, 292.0, 262.0, 299.0, 275.0, 261.0, 234.0, 234.0, 208.0, 232.0, 249.0, 231.0, 270.0, 231.0, 252.0, 209.0, 261.0, 255.0, 225.0, 275.0, 231.0, 247.0, 267.0, 323.0, 418.0, 846.0], [3637.0, 2047.0, 1494.0, 1130.0, 891.0, 799.0, 671.0, 555.0, 561.0, 505.0, 468.0, 457.0, 391.0, 389.0, 375.0, 394.0, 353.0, 323.0, 335.0, 315.0, 362.0, 287.0, 318.0, 286.0, 280.0, 264.0, 241.0, 257.0, 252.0, 241.0, 239.0, 241.0, 237.0, 237.0, 215.0, 240.0, 263.0, 252.0, 232.0, 238.0, 232.0, 247.0, 227.0, 222.0, 241.0, 234.0, 274.0, 335.0, 612.0], [3694.0, 2132.0, 1433.0, 1091.0, 867.0, 753.0, 705.0, 602.0, 528.0, 497.0, 474.0, 438.0, 398.0, 411.0, 418.0, 402.0, 360.0, 353.0, 261.0, 305.0, 290.0, 271.0, 307.0, 312.0, 301.0, 275.0, 262.0, 247.0, 234.0, 265.0, 252.0, 267.0, 260.0, 245.0, 232.0, 233.0, 230.0, 219.0, 228.0, 223.0, 214.0, 255.0, 208.0, 206.0, 241.0, 256.0, 295.0, 267.0, 409.0], [3511.0, 2130.0, 1462.0, 1098.0, 920.0, 778.0, 642.0, 638.0, 534.0, 461.0, 502.0, 450.0, 388.0, 402.0, 401.0, 340.0, 343.0, 312.0, 345.0, 331.0, 296.0, 272.0, 283.0, 259.0, 271.0, 289.0, 258.0, 245.0, 249.0, 259.0, 265.0, 280.0, 234.0, 231.0, 233.0, 214.0, 236.0, 220.0, 235.0, 215.0, 221.0, 238.0, 228.0, 251.0, 251.0, 253.0, 212.0, 261.0, 364.0], [3643.0, 2036.0, 1464.0, 1157.0, 939.0, 756.0, 655.0, 582.0, 526.0, 509.0, 443.0, 447.0, 411.0, 423.0, 402.0, 348.0, 363.0, 378.0, 320.0, 299.0, 309.0, 290.0, 278.0, 256.0, 292.0, 285.0, 274.0, 241.0, 271.0, 290.0, 235.0, 254.0, 251.0, 213.0, 187.0, 219.0, 280.0, 224.0, 224.0, 212.0, 235.0, 233.0, 229.0, 240.0, 222.0, 236.0, 252.0, 282.0, 309.0], [3605.0, 2051.0, 1488.0, 1085.0, 940.0, 787.0, 649.0, 612.0, 546.0, 467.0, 464.0, 440.0, 406.0, 415.0, 382.0, 376.0, 332.0, 324.0, 303.0, 352.0, 286.0, 302.0, 290.0, 266.0, 262.0, 266.0, 277.0, 249.0, 270.0, 241.0, 275.0, 231.0, 245.0, 250.0, 233.0, 206.0, 267.0, 221.0, 237.0, 226.0, 238.0, 251.0, 211.0, 225.0, 233.0, 235.0, 229.0, 258.0, 301.0], [3644.0, 2083.0, 1492.0, 1146.0, 878.0, 783.0, 650.0, 599.0, 555.0, 498.0, 460.0, 442.0, 416.0, 422.0, 349.0, 355.0, 371.0, 320.0, 305.0, 325.0, 276.0, 298.0, 286.0, 278.0, 268.0, 277.0, 278.0, 247.0, 260.0, 228.0, 269.0, 235.0, 235.0, 247.0, 240.0, 235.0, 262.0, 244.0, 232.0, 226.0, 249.0, 214.0, 226.0, 211.0, 237.0, 236.0, 252.0, 261.0, 298.0], [3617.0, 1978.0, 1533.0, 1166.0, 895.0, 739.0, 637.0, 619.0, 536.0, 488.0, 459.0, 436.0, 434.0, 410.0, 383.0, 358.0, 356.0, 333.0, 333.0, 303.0, 290.0, 314.0, 298.0, 286.0, 270.0, 296.0, 270.0, 254.0, 232.0, 278.0, 257.0, 266.0, 234.0, 203.0, 244.0, 252.0, 235.0, 224.0, 222.0, 240.0, 222.0, 221.0, 210.0, 208.0, 230.0, 214.0, 246.0, 245.0, 299.0], [3711.0, 1977.0, 1445.0, 1136.0, 948.0, 753.0, 641.0, 599.0, 563.0, 521.0, 457.0, 411.0, 430.0, 401.0, 359.0, 365.0, 352.0, 339.0, 320.0, 302.0, 330.0, 325.0, 304.0, 305.0, 281.0, 287.0, 263.0, 245.0, 262.0, 229.0, 214.0, 253.0, 228.0, 236.0, 211.0, 257.0, 232.0, 246.0, 230.0, 202.0, 225.0, 189.0, 228.0, 250.0, 251.0, 226.0, 252.0, 265.0, 318.0], [3707.0, 1995.0, 1454.0, 1089.0, 971.0, 743.0, 668.0, 559.0, 540.0, 523.0, 487.0, 440.0, 419.0, 388.0, 380.0, 369.0, 350.0, 367.0, 319.0, 341.0, 308.0, 323.0, 274.0, 259.0, 263.0, 291.0, 277.0, 254.0, 265.0, 222.0, 238.0, 235.0, 227.0, 229.0, 222.0, 241.0, 215.0, 247.0, 217.0, 259.0, 237.0, 232.0, 223.0, 220.0, 240.0, 239.0, 237.0, 256.0, 298.0], [3759.0, 1984.0, 1478.0, 1117.0, 895.0, 769.0, 680.0, 548.0, 563.0, 475.0, 436.0, 407.0, 454.0, 357.0, 402.0, 382.0, 363.0, 352.0, 356.0, 323.0, 333.0, 328.0, 298.0, 289.0, 270.0, 247.0, 234.0, 253.0, 233.0, 249.0, 256.0, 224.0, 252.0, 257.0, 228.0, 227.0, 241.0, 232.0, 219.0, 236.0, 249.0, 227.0, 236.0, 199.0, 220.0, 257.0, 234.0, 263.0, 285.0], [3686.0, 2006.0, 1452.0, 1117.0, 923.0, 794.0, 690.0, 555.0, 553.0, 509.0, 460.0, 470.0, 410.0, 391.0, 377.0, 350.0, 360.0, 321.0, 336.0, 327.0, 295.0, 296.0, 276.0, 283.0, 279.0, 293.0, 264.0, 278.0, 259.0, 245.0, 257.0, 247.0, 265.0, 246.0, 222.0, 201.0, 191.0, 230.0, 236.0, 224.0, 195.0, 251.0, 230.0, 232.0, 237.0, 240.0, 234.0, 278.0, 294.0], [3619.0, 2057.0, 1435.0, 1203.0, 876.0, 758.0, 732.0, 588.0, 540.0, 460.0, 492.0, 445.0, 438.0, 364.0, 389.0, 370.0, 367.0, 342.0, 317.0, 313.0, 312.0, 294.0, 295.0, 285.0, 285.0, 288.0, 246.0, 251.0, 270.0, 243.0, 247.0, 244.0, 238.0, 236.0, 242.0, 252.0, 257.0, 234.0, 249.0, 259.0, 195.0, 218.0, 236.0, 209.0, 253.0, 247.0, 211.0, 251.0, 290.0]],
    "Name": "sCurve-0",
    "Overflow": 2536288.0,
    "Type": "Histo2d",
    "Underflow": 0.0,
    "x": {
        "AxisTitle": "Vcal",
        "Bins": 51,
        "High": 302.5,
        "Low": 47.5
    },
    "y": {
        "AxisTitle": "Occupancy",
        "Bins": 49,
        "High": 49.5,
        "Low": 0.5
    },
    "z": {
        "AxisTitle": "Number of pixels"
    }
}