{
    "Data": [1844.0, 22084.0, 18838.0, 6929.0, 2146.0, 991.0, 943.0, 1090.0, 1131.0, 1084.0, 969.0, 840.0, 663.0, 590.0, 466.0, 445.0, 396.0, 395.0, 402.0, 423.0, 416.0, 459.0, 412.0, 442.0, 476.0, 496.0, 486.0, 481.0, 490.0, 515.0, 542.0, 538.0, 505.0, 524.0, 490.0, 476.0, 426.0, 416.0, 419.0, 390.0, 327.0, 373.0, 339.0, 297.0, 296.0, 304.0, 244.0, 239.0, 192.0, 231.0, 84.0],
    "Name": "Chi2Dist-0",
    "Overflow": 0.0,
    "Type": "Histo1d",
    "Underflow": 0.0,
    "x": {
        "AxisTitle": "Fit Chi/ndf",
        "Bins": 51,
        "High": 2.5250000953674318,
        "Low": -0.02500000037252903
    },
    "y": {
        "AxisTitle": "Number of Pixels"
    },
    "z": {
        "AxisTitle": "z"
    }
}