time,Hardware,Voltage,Current
1622003391636,high-voltage-3,1,0.00328348
time,Hardware,Voltage,Current
1622003391636,high-voltage-3,2,0.0056111
time,Hardware,Voltage,Current
1622003391636,high-voltage-3,3,0.00716404
time,Hardware,Voltage,Current
1622003391636,high-voltage-3,4,0.010254
time,Hardware,Voltage,Current
1622003391636,high-voltage-3,5,0.010537
time,Hardware,Voltage,Current
1622003391636,high-voltage-3,6,0.0127004
time,Hardware,Voltage,Current
1622003391636,high-voltage-3,7,0.0129442
time,Hardware,Voltage,Current
1622003391636,high-voltage-3,8,8e+06
time,Hardware,Voltage,Current
1622003391636,high-voltage-3,9,0.0186112
time,Hardware,Voltage,Current
1622003391636,high-voltage-3,10,0.0201096
time,Hardware,Voltage,Current
1622003391636,high-voltage-3,11,0.0217512
time,Hardware,Voltage,Current
1622003391636,high-voltage-3,12,0.0230295
