time,Hardware,Voltage,Current
1621974020280,high-voltage-3,1,0.155988
time,Hardware,Voltage,Current
1621974020280,high-voltage-3,2,0.166537
time,Hardware,Voltage,Current
1621974020280,high-voltage-3,3,0.176849
time,Hardware,Voltage,Current
1621974020280,high-voltage-3,4,0.185526
time,Hardware,Voltage,Current
1621974020280,high-voltage-3,5,0.193023
time,Hardware,Voltage,Current
1621974020280,high-voltage-3,6,0.199231
time,Hardware,Voltage,Current
1621974020280,high-voltage-3,7,0.207207
time,Hardware,Voltage,Current
1621974020280,high-voltage-3,8,0.216788
time,Hardware,Voltage,Current
1621974020280,high-voltage-3,9,0.227547
time,Hardware,Voltage,Current
1621974020280,high-voltage-3,10,0.237067
time,Hardware,Voltage,Current
1621974020280,high-voltage-3,11,0.245891
time,Hardware,Voltage,Current
1621974020280,high-voltage-3,12,0.255518
time,Hardware,Voltage,Current
1621974020280,high-voltage-3,13,0.265743
time,Hardware,Voltage,Current
1621974020280,high-voltage-3,14,0.274283
time,Hardware,Voltage,Current
1621974020280,high-voltage-3,15,0.281243
time,Hardware,Voltage,Current
1621974020280,high-voltage-3,16,0.287946
time,Hardware,Voltage,Current
1621974020280,high-voltage-3,17,1.7e+07
time,Hardware,Voltage,Current
1621974020280,high-voltage-3,18,0.299007
time,Hardware,Voltage,Current
1621974020280,high-voltage-3,19,0.304788
time,Hardware,Voltage,Current
1621974020280,high-voltage-3,20,0.310418
time,Hardware,Voltage,Current
1621974020280,high-voltage-3,25,0.335192
time,Hardware,Voltage,Current
1621974020280,high-voltage-3,30,0.356156
time,Hardware,Voltage,Current
1621974020280,high-voltage-3,35,0.378448
time,Hardware,Voltage,Current
1621974020280,high-voltage-3,40,0.397133
time,Hardware,Voltage,Current
1621974020280,high-voltage-3,45,0.413657
time,Hardware,Voltage,Current
1621974020280,high-voltage-3,50,0.430385
time,Hardware,Voltage,Current
1621974020280,high-voltage-3,55,0.447945
time,Hardware,Voltage,Current
1621974020280,high-voltage-3,60,0.460643
time,Hardware,Voltage,Current
1621974020280,high-voltage-3,65,0.475669
time,Hardware,Voltage,Current
1621974020280,high-voltage-3,70,0.486888
time,Hardware,Voltage,Current
1621974020280,high-voltage-3,75,0.503852
time,Hardware,Voltage,Current
1621974020280,high-voltage-3,80,0.51764
time,Hardware,Voltage,Current
1621974020280,high-voltage-3,85,0.529336
time,Hardware,Voltage,Current
1621974020280,high-voltage-3,90,0.540491
time,Hardware,Voltage,Current
1621974020280,high-voltage-3,95,0.55091
time,Hardware,Voltage,Current
1621974020280,high-voltage-3,100,0.563725
