{
    "Data": [232.0, 997.0, 238.0, 67.0, 142.0, 131.0, 121.0, 121.0, 131.0, 187.0, 360.0, 907.0, 1772.0, 3061.0, 4087.0, 4578.0, 4394.0, 3671.0, 3148.0, 3327.0, 3894.0, 4281.0, 4415.0, 3944.0, 3187.0, 2202.0, 1382.0, 941.0, 571.0, 420.0, 360.0, 314.0, 284.0, 294.0, 306.0, 284.0, 299.0, 313.0, 266.0, 282.0, 244.0, 274.0, 278.0, 270.0, 245.0, 221.0, 207.0, 236.0, 219.0, 231.0, 192.0, 221.0, 188.0, 206.0, 206.0, 166.0, 149.0, 143.0, 152.0, 156.0, 153.0, 137.0, 121.0, 137.0, 125.0, 131.0, 136.0, 125.0, 110.0, 116.0, 119.0, 134.0, 112.0, 121.0, 108.0, 102.0, 106.0, 94.0, 122.0, 80.0, 102.0, 98.0, 68.0, 91.0, 73.0, 73.0, 74.0, 83.0, 71.0, 79.0, 78.0, 79.0, 66.0, 66.0, 74.0, 63.0, 77.0, 68.0, 66.0, 63.0, 64.0, 69.0, 59.0, 65.0, 62.0, 49.0, 51.0, 53.0, 50.0, 51.0, 43.0, 48.0, 63.0, 47.0, 43.0, 42.0, 40.0, 51.0, 37.0, 41.0, 47.0, 47.0, 33.0, 43.0, 34.0, 41.0, 29.0, 28.0, 40.0, 31.0, 24.0, 34.0, 36.0, 40.0, 40.0, 35.0, 25.0, 40.0, 33.0, 26.0, 23.0, 24.0, 29.0, 24.0, 34.0, 37.0, 22.0, 26.0, 23.0, 17.0, 21.0, 25.0, 35.0, 25.0, 28.0, 28.0, 19.0, 26.0, 26.0, 16.0, 6.0, 19.0, 18.0, 23.0, 13.0, 17.0, 17.0, 15.0, 23.0],
    "Name": "NoiseDist-0",
    "Overflow": 470.0,
    "Type": "Histo1d",
    "Underflow": 0.0,
    "x": {
        "AxisTitle": "Noise [e]",
        "Bins": 169,
        "High": 846.0,
        "Low": -2.0
    },
    "y": {
        "AxisTitle": "Number of Pixels"
    },
    "z": {
        "AxisTitle": "z"
    }
}