{
    "Data": [0.0, 0.0, 0.0, 0.0, 0.0, 0.0, 0.0, 0.0, 0.0, 0.0, 0.0, 0.0, 0.0, 0.0, 2.0, 0.0, 0.0, 27.0, 392.0, 150.0, 35.0, 799.0, 4659.0, 1880.0, 301.0, 1112.0, 4240.0, 2669.0, 512.0, 841.0, 2246.0, 1783.0, 445.0, 249.0, 386.0, 486.0, 277.0, 290.0, 700.0, 567.0, 441.0, 587.0, 1599.0, 2101.0, 1535.0, 1415.0, 2151.0, 3228.0, 3013.0, 2533.0, 2372.0, 2715.0, 2683.0, 2033.0, 2049.0, 1882.0, 2223.0, 1935.0, 1617.0, 1581.0, 1564.0, 1331.0, 990.0, 820.0, 730.0, 777.0, 729.0, 536.0, 501.0, 451.0, 476.0, 405.0, 313.0, 270.0, 232.0, 275.0, 209.0, 159.0, 147.0, 139.0, 133.0, 115.0, 92.0, 88.0, 90.0, 70.0, 66.0, 66.0, 53.0, 58.0, 45.0, 37.0, 35.0, 32.0, 31.0, 21.0, 24.0, 20.0, 13.0, 27.0, 19.0, 9.0, 8.0, 12.0, 12.0, 10.0, 15.0, 13.0, 6.0, 4.0, 7.0, 5.0, 3.0, 4.0, 3.0, 7.0, 4.0, 4.0, 3.0, 0.0, 4.0, 3.0, 3.0, 4.0, 6.0, 0.0, 4.0, 1.0, 2.0, 1.0, 2.0, 5.0, 1.0, 1.0, 3.0, 2.0, 1.0, 2.0, 0.0, 0.0, 1.0, 1.0, 2.0, 3.0, 0.0, 0.0, 1.0, 0.0, 0.0, 1.0, 2.0, 0.0, 1.0, 1.0, 0.0, 1.0, 0.0, 1.0, 0.0, 0.0, 1.0, 0.0, 0.0, 0.0, 0.0, 1.0, 1.0, 1.0, 0.0, 1.0, 0.0, 0.0, 1.0, 0.0, 0.0, 0.0, 1.0, 0.0, 0.0, 0.0, 0.0, 0.0, 0.0, 0.0, 0.0, 0.0, 0.0, 0.0, 0.0, 0.0, 0.0, 0.0, 0.0, 0.0, 0.0, 0.0, 0.0, 0.0, 0.0, 0.0, 0.0],
    "Name": "TimePerFitDist-0",
    "Overflow": 63.0,
    "Type": "Histo1d",
    "Underflow": 0.0,
    "x": {
        "AxisTitle": "Fit Time [us]",
        "Bins": 201,
        "High": 401.0,
        "Low": -1.0
    },
    "y": {
        "AxisTitle": "Number of Pixels"
    },
    "z": {
        "AxisTitle": "z"
    }
}