{
    "Data": [0.0, 0.0, 0.0, 0.0, 0.0, 0.0, 0.0, 0.0, 0.0, 0.0, 0.0, 0.0, 0.0, 1.0, 2.0, 1.0, 0.0, 34.0, 125.0, 30.0, 54.0, 710.0, 1851.0, 622.0, 368.0, 1410.0, 2319.0, 1217.0, 631.0, 1152.0, 1491.0, 1149.0, 647.0, 660.0, 683.0, 706.0, 528.0, 571.0, 893.0, 837.0, 629.0, 1010.0, 2014.0, 3046.0, 2075.0, 1471.0, 2350.0, 3499.0, 3958.0, 2921.0, 2323.0, 2618.0, 3120.0, 2682.0, 2080.0, 1901.0, 1787.0, 1973.0, 1529.0, 1326.0, 1277.0, 1127.0, 1016.0, 751.0, 721.0, 645.0, 653.0, 552.0, 458.0, 408.0, 401.0, 404.0, 384.0, 264.0, 242.0, 254.0, 219.0, 195.0, 201.0, 172.0, 162.0, 143.0, 117.0, 102.0, 119.0, 98.0, 82.0, 82.0, 63.0, 62.0, 80.0, 47.0, 65.0, 61.0, 54.0, 60.0, 41.0, 37.0, 33.0, 35.0, 38.0, 33.0, 47.0, 41.0, 33.0, 24.0, 31.0, 26.0, 29.0, 15.0, 22.0, 20.0, 24.0, 24.0, 23.0, 24.0, 19.0, 17.0, 26.0, 19.0, 27.0, 18.0, 11.0, 22.0, 20.0, 21.0, 15.0, 13.0, 14.0, 11.0, 15.0, 15.0, 9.0, 9.0, 10.0, 10.0, 14.0, 10.0, 6.0, 10.0, 14.0, 11.0, 12.0, 10.0, 10.0, 18.0, 13.0, 6.0, 13.0, 9.0, 6.0, 5.0, 6.0, 13.0, 6.0, 3.0, 8.0, 12.0, 12.0, 4.0, 6.0, 6.0, 5.0, 7.0, 5.0, 3.0, 5.0, 7.0, 4.0, 6.0, 4.0, 5.0, 1.0, 7.0, 3.0, 4.0, 3.0, 3.0, 5.0, 4.0, 2.0, 4.0, 4.0, 1.0, 2.0, 2.0, 2.0, 1.0, 4.0, 4.0, 1.0, 1.0, 3.0, 2.0, 7.0, 4.0, 5.0, 2.0, 6.0, 3.0, 4.0],
    "Name": "TimePerFitDist-0",
    "Overflow": 277.0,
    "Type": "Histo1d",
    "Underflow": 0.0,
    "x": {
        "AxisTitle": "Fit Time [us]",
        "Bins": 201,
        "High": 401.0,
        "Low": -1.0
    },
    "y": {
        "AxisTitle": "Number of Pixels"
    },
    "z": {
        "AxisTitle": "z"
    }
}