{
    "Data": [8.0, 10.0, 0.0, 2.0, 7.0, 3.0, 10.0, 31.0, 89.0, 278.0, 749.0, 1730.0, 2966.0, 4138.0, 4651.0, 4260.0, 3360.0, 2611.0, 2370.0, 2839.0, 3662.0, 4372.0, 4720.0, 4571.0, 3932.0, 3154.0, 2414.0, 1827.0, 1489.0, 1304.0, 1114.0, 1108.0, 1046.0, 1041.0, 964.0, 983.0, 934.0, 890.0, 901.0, 763.0, 742.0, 619.0, 565.0, 488.0, 436.0, 368.0, 277.0, 241.0, 216.0, 154.0, 133.0, 92.0, 73.0, 51.0, 60.0, 41.0, 41.0, 30.0, 25.0, 18.0, 23.0, 20.0, 18.0, 13.0, 10.0, 18.0, 11.0, 14.0, 5.0],
    "Name": "NoiseDist-0",
    "Overflow": 98.0,
    "Type": "Histo1d",
    "Underflow": 0.0,
    "x": {
        "AxisTitle": "Noise [e]",
        "Bins": 69,
        "High": 346.0,
        "Low": -2.0
    },
    "y": {
        "AxisTitle": "Number of Pixels"
    },
    "z": {
        "AxisTitle": "z"
    }
}