{
    "Data": [0.0, 0.0, 0.0, 0.0, 0.0, 0.0, 0.0, 0.0, 0.0, 0.0, 0.0, 0.0, 0.0, 0.0, 0.0, 0.0, 0.0, 0.0, 0.0, 0.0, 0.0, 0.0, 0.0, 0.0, 0.0, 0.0, 0.0, 0.0, 0.0, 0.0, 0.0, 0.0, 0.0, 0.0, 0.0, 0.0, 0.0, 0.0, 0.0, 0.0, 0.0, 0.0, 0.0, 0.0, 0.0, 0.0, 0.0, 0.0, 0.0, 0.0, 71.0, 118.0, 121.0, 148.0, 173.0, 192.0, 202.0, 291.0, 286.0, 313.0, 370.0, 422.0, 466.0, 520.0, 491.0, 553.0, 601.0, 727.0, 735.0, 737.0, 817.0, 823.0, 819.0, 789.0, 864.0, 874.0, 816.0, 906.0, 875.0, 878.0, 845.0, 806.0, 791.0, 827.0, 880.0, 927.0, 1076.0, 1248.0, 1528.0, 1907.0, 2218.0, 2539.0, 2870.0, 2923.0, 2718.0, 2506.0, 2188.0, 1681.0, 1245.0, 952.0, 609.0, 473.0, 319.0, 219.0, 134.0, 120.0, 79.0, 70.0, 45.0, 44.0, 30.0, 26.0, 28.0, 29.0, 26.0, 16.0, 18.0, 13.0, 11.0, 10.0, 16.0, 17.0, 13.0, 13.0, 11.0, 14.0, 15.0, 13.0, 6.0, 8.0, 5.0, 6.0, 7.0, 3.0, 3.0, 8.0, 7.0, 5.0, 5.0, 9.0, 6.0, 3.0, 3.0, 5.0, 1.0, 1.0, 2.0, 2.0, 1.0, 4.0, 5.0, 0.0, 5.0, 3.0, 6.0, 6.0, 4.0, 10.0, 12.0, 19.0, 24.0, 36.0, 23.0, 51.0, 56.0, 71.0, 88.0, 127.0, 128.0, 192.0, 209.0, 229.0, 275.0, 319.0, 390.0, 425.0, 493.0, 563.0, 611.0, 651.0, 682.0, 717.0, 728.0, 826.0, 892.0, 928.0, 952.0, 969.0, 933.0, 922.0, 942.0, 972.0, 886.0, 867.0, 818.0, 753.0, 708.0, 619.0, 603.0, 495.0, 473.0, 403.0, 382.0, 332.0, 307.0, 235.0, 205.0, 180.0, 169.0, 146.0, 98.0, 96.0, 83.0, 61.0, 46.0, 33.0, 23.0, 24.0, 17.0, 23.0, 15.0, 9.0, 4.0, 6.0, 3.0, 4.0, 0.0, 0.0, 0.0, 0.0, 0.0, 0.0, 1.0, 0.0, 0.0, 0.0, 0.0, 0.0, 0.0, 0.0, 0.0, 1.0, 0.0, 1.0, 0.0, 0.0, 0.0, 0.0, 0.0, 0.0, 0.0, 1.0, 0.0, 0.0, 0.0, 0.0, 0.0, 0.0, 0.0, 0.0, 0.0, 0.0, 0.0, 0.0, 0.0, 0.0, 0.0, 0.0, 1.0, 0.0, 0.0, 0.0, 0.0, 0.0, 0.0, 0.0, 0.0, 0.0, 0.0, 0.0, 0.0, 0.0, 0.0, 0.0, 0.0, 0.0, 0.0, 0.0, 0.0, 0.0, 0.0, 0.0, 0.0, 0.0, 0.0, 0.0, 0.0, 0.0, 0.0, 0.0, 0.0, 0.0, 0.0, 0.0, 0.0, 0.0, 0.0, 0.0, 0.0, 0.0, 0.0, 0.0, 0.0, 0.0, 0.0, 0.0, 0.0, 0.0, 0.0, 0.0, 0.0, 0.0, 0.0, 0.0, 0.0, 0.0, 0.0, 0.0, 0.0, 0.0, 0.0, 0.0, 0.0, 0.0, 0.0, 0.0, 0.0, 0.0, 0.0, 0.0, 0.0, 0.0, 0.0, 0.0, 0.0, 0.0, 0.0, 0.0, 0.0, 0.0, 0.0, 0.0, 0.0, 0.0, 0.0, 0.0, 0.0, 0.0, 0.0, 0.0, 0.0, 0.0, 0.0, 0.0],
    "Name": "ThresholdDist-0",
    "Overflow": 0.0,
    "Type": "Histo1d",
    "Underflow": 0.0,
    "x": {
        "AxisTitle": "Threshold [e]",
        "Bins": 364,
        "High": 3635.0,
        "Low": -5.0
    },
    "y": {
        "AxisTitle": "Number of Pixels"
    },
    "z": {
        "AxisTitle": "z"
    }
}