{
    "Data": [0.0, 0.0, 0.0, 0.0, 0.0, 0.0, 0.0, 0.0, 0.0, 0.0, 0.0, 0.0, 0.0, 0.0, 0.0, 0.0, 1.0, 8.0, 558.0, 333.0, 36.0, 119.0, 2885.0, 3776.0, 433.0, 328.0, 2360.0, 3324.0, 741.0, 443.0, 1497.0, 2210.0, 877.0, 328.0, 441.0, 483.0, 307.0, 318.0, 522.0, 550.0, 409.0, 462.0, 1019.0, 1648.0, 1386.0, 1257.0, 1865.0, 2692.0, 2905.0, 2577.0, 2446.0, 2505.0, 2689.0, 2210.0, 2054.0, 1950.0, 2146.0, 2065.0, 1809.0, 1815.0, 1602.0, 1414.0, 1078.0, 912.0, 839.0, 818.0, 854.0, 631.0, 571.0, 530.0, 595.0, 499.0, 409.0, 326.0, 305.0, 323.0, 285.0, 235.0, 180.0, 193.0, 207.0, 159.0, 147.0, 120.0, 125.0, 109.0, 104.0, 77.0, 70.0, 83.0, 75.0, 61.0, 69.0, 53.0, 71.0, 56.0, 49.0, 59.0, 51.0, 58.0, 41.0, 44.0, 37.0, 56.0, 35.0, 41.0, 25.0, 19.0, 18.0, 17.0, 26.0, 24.0, 20.0, 21.0, 21.0, 15.0, 13.0, 7.0, 19.0, 17.0, 12.0, 14.0, 13.0, 13.0, 7.0, 8.0, 7.0, 14.0, 23.0, 6.0, 8.0, 2.0, 1.0, 4.0, 5.0, 3.0, 9.0, 5.0, 7.0, 12.0, 4.0, 6.0, 9.0, 12.0, 9.0, 12.0, 4.0, 3.0, 4.0, 6.0, 2.0, 3.0, 2.0, 9.0, 4.0, 3.0, 7.0, 6.0, 7.0, 3.0, 5.0, 8.0, 1.0, 5.0, 2.0, 1.0, 1.0, 2.0, 2.0, 6.0, 7.0, 5.0, 3.0, 5.0, 6.0, 2.0, 2.0, 3.0, 4.0, 1.0, 3.0, 0.0, 1.0, 4.0, 1.0, 6.0, 4.0, 3.0, 4.0, 4.0, 5.0, 2.0, 3.0, 3.0, 2.0, 2.0, 1.0, 1.0, 6.0, 7.0, 1.0],
    "Name": "TimePerFitDist-0",
    "Overflow": 179.0,
    "Type": "Histo1d",
    "Underflow": 0.0,
    "x": {
        "AxisTitle": "Fit Time [us]",
        "Bins": 201,
        "High": 401.0,
        "Low": -1.0
    },
    "y": {
        "AxisTitle": "Number of Pixels"
    },
    "z": {
        "AxisTitle": "z"
    }
}