{
    "Data": [206.0, 10880.0, 20387.0, 12959.0, 4973.0, 2031.0, 1614.0, 2147.0, 2714.0, 2899.0, 2782.0, 2424.0, 1912.0, 1290.0, 943.0, 635.0, 428.0, 286.0, 198.0, 169.0, 128.0, 108.0, 135.0, 104.0, 96.0, 111.0, 83.0, 110.0, 111.0, 81.0, 80.0, 83.0, 80.0, 91.0, 76.0, 73.0, 69.0, 66.0, 59.0, 51.0, 40.0, 44.0, 47.0, 38.0, 38.0, 30.0, 27.0, 16.0, 22.0, 18.0, 6.0],
    "Name": "Chi2Dist-0",
    "Overflow": 0.0,
    "Type": "Histo1d",
    "Underflow": 0.0,
    "x": {
        "AxisTitle": "Fit Chi/ndf",
        "Bins": 51,
        "High": 2.5250000953674318,
        "Low": -0.02500000037252903
    },
    "y": {
        "AxisTitle": "Number of Pixels"
    },
    "z": {
        "AxisTitle": "z"
    }
}