{
    "Data": [1863.0, 22632.0, 18737.0, 6829.0, 1987.0, 852.0, 879.0, 1026.0, 1206.0, 1137.0, 1008.0, 846.0, 697.0, 601.0, 439.0, 402.0, 373.0, 376.0, 404.0, 386.0, 465.0, 435.0, 470.0, 468.0, 510.0, 471.0, 516.0, 402.0, 476.0, 431.0, 506.0, 481.0, 438.0, 425.0, 462.0, 381.0, 500.0, 423.0, 421.0, 378.0, 393.0, 369.0, 361.0, 277.0, 283.0, 267.0, 295.0, 248.0, 230.0, 207.0, 95.0],
    "Name": "Chi2Dist-0",
    "Overflow": 0.0,
    "Type": "Histo1d",
    "Underflow": 0.0,
    "x": {
        "AxisTitle": "Fit Chi/ndf",
        "Bins": 51,
        "High": 2.5250000953674318,
        "Low": -0.02500000037252903
    },
    "y": {
        "AxisTitle": "Number of Pixels"
    },
    "z": {
        "AxisTitle": "z"
    }
}