{
    "Data": [241.0, 12377.0, 21032.0, 12571.0, 4767.0, 2016.0, 1841.0, 2374.0, 3026.0, 3218.0, 3042.0, 2479.0, 1828.0, 1272.0, 938.0, 592.0, 413.0, 276.0, 212.0, 156.0, 139.0, 130.0, 150.0, 99.0, 115.0, 96.0, 89.0, 84.0, 79.0, 68.0, 61.0, 67.0, 54.0, 54.0, 64.0, 44.0, 46.0, 48.0, 50.0, 33.0, 44.0, 23.0, 19.0, 26.0, 27.0, 29.0, 26.0, 23.0, 30.0, 19.0, 8.0],
    "Name": "Chi2Dist-0",
    "Overflow": 0.0,
    "Type": "Histo1d",
    "Underflow": 0.0,
    "x": {
        "AxisTitle": "Fit Chi/ndf",
        "Bins": 51,
        "High": 2.5250000953674318,
        "Low": -0.02500000037252903
    },
    "y": {
        "AxisTitle": "Number of Pixels"
    },
    "z": {
        "AxisTitle": "z"
    }
}