{
    "Data": [[1119.0, 348.0, 160.0, 86.0, 64.0, 44.0, 37.0, 41.0, 22.0, 27.0, 18.0, 12.0, 16.0, 14.0, 12.0, 15.0, 13.0, 17.0, 11.0, 13.0, 14.0, 6.0, 4.0, 8.0, 5.0, 13.0, 7.0, 3.0, 5.0, 3.0, 7.0, 3.0, 0.0, 8.0, 7.0, 2.0, 4.0, 5.0, 5.0, 6.0, 3.0, 4.0, 4.0, 7.0, 9.0, 12.0, 7.0, 13.0, 13.0], [2106.0, 700.0, 393.0, 241.0, 160.0, 126.0, 74.0, 72.0, 55.0, 47.0, 32.0, 28.0, 34.0, 20.0, 25.0, 27.0, 10.0, 27.0, 27.0, 17.0, 12.0, 11.0, 17.0, 10.0, 9.0, 11.0, 11.0, 9.0, 9.0, 11.0, 8.0, 5.0, 10.0, 15.0, 4.0, 6.0, 9.0, 10.0, 8.0, 12.0, 5.0, 7.0, 4.0, 5.0, 3.0, 9.0, 12.0, 15.0, 18.0], [3337.0, 1453.0, 836.0, 531.0, 348.0, 257.0, 215.0, 170.0, 150.0, 97.0, 77.0, 70.0, 74.0, 60.0, 53.0, 41.0, 34.0, 34.0, 35.0, 31.0, 32.0, 26.0, 23.0, 16.0, 21.0, 17.0, 11.0, 14.0, 17.0, 21.0, 21.0, 26.0, 14.0, 21.0, 18.0, 6.0, 8.0, 9.0, 8.0, 10.0, 8.0, 14.0, 19.0, 11.0, 15.0, 9.0, 9.0, 14.0, 30.0], [4303.0, 2154.0, 1416.0, 969.0, 762.0, 572.0, 464.0, 367.0, 292.0, 282.0, 225.0, 177.0, 149.0, 159.0, 101.0, 103.0, 102.0, 75.0, 89.0, 81.0, 54.0, 58.0, 56.0, 43.0, 49.0, 37.0, 36.0, 36.0, 30.0, 30.0, 41.0, 25.0, 25.0, 29.0, 22.0, 17.0, 23.0, 21.0, 15.0, 24.0, 23.0, 21.0, 26.0, 22.0, 21.0, 23.0, 23.0, 31.0, 30.0], [4449.0, 2477.0, 1803.0, 1411.0, 1138.0, 937.0, 769.0, 647.0, 581.0, 535.0, 451.0, 360.0, 389.0, 320.0, 276.0, 268.0, 224.0, 220.0, 180.0, 199.0, 156.0, 145.0, 121.0, 132.0, 100.0, 125.0, 82.0, 88.0, 81.0, 69.0, 74.0, 65.0, 82.0, 47.0, 54.0, 48.0, 44.0, 41.0, 57.0, 30.0, 43.0, 39.0, 39.0, 39.0, 34.0, 33.0, 39.0, 54.0, 56.0], [6781.0, 3197.0, 1975.0, 1548.0, 1283.0, 1079.0, 995.0, 895.0, 810.0, 698.0, 703.0, 623.0, 616.0, 557.0, 471.0, 460.0, 475.0, 415.0, 382.0, 337.0, 325.0, 309.0, 289.0, 263.0, 258.0, 239.0, 196.0, 207.0, 190.0, 179.0, 197.0, 160.0, 152.0, 138.0, 142.0, 126.0, 115.0, 113.0, 106.0, 86.0, 98.0, 88.0, 90.0, 106.0, 84.0, 67.0, 73.0, 91.0, 94.0], [6687.0, 5044.0, 3797.0, 2984.0, 2299.0, 1790.0, 1547.0, 1340.0, 1074.0, 996.0, 917.0, 791.0, 767.0, 721.0, 646.0, 605.0, 596.0, 527.0, 555.0, 519.0, 530.0, 522.0, 512.0, 491.0, 428.0, 438.0, 412.0, 416.0, 382.0, 373.0, 338.0, 320.0, 351.0, 332.0, 293.0, 263.0, 260.0, 251.0, 272.0, 252.0, 261.0, 229.0, 225.0, 174.0, 189.0, 183.0, 177.0, 200.0, 210.0], [1710.0, 1952.0, 2016.0, 2177.0, 2153.0, 2200.0, 2068.0, 2057.0, 1972.0, 1789.0, 1725.0, 1671.0, 1513.0, 1445.0, 1330.0, 1283.0, 1180.0, 1046.0, 1076.0, 921.0, 874.0, 831.0, 794.0, 720.0, 737.0, 705.0, 592.0, 612.0, 561.0, 557.0, 585.0, 612.0, 596.0, 564.0, 558.0, 531.0, 513.0, 468.0, 459.0, 480.0, 434.0, 481.0, 493.0, 448.0, 452.0, 496.0, 452.0, 482.0, 510.0], [306.0, 308.0, 323.0, 403.0, 420.0, 509.0, 594.0, 610.0, 663.0, 801.0, 872.0, 926.0, 932.0, 1020.0, 1108.0, 1175.0, 1218.0, 1269.0, 1265.0, 1361.0, 1249.0, 1360.0, 1346.0, 1331.0, 1400.0, 1412.0, 1323.0, 1358.0, 1410.0, 1347.0, 1279.0, 1318.0, 1202.0, 1175.0, 1164.0, 1111.0, 1085.0, 1023.0, 1025.0, 1056.0, 934.0, 907.0, 905.0, 918.0, 903.0, 947.0, 997.0, 1019.0, 1160.0], [188.0, 99.0, 81.0, 100.0, 115.0, 107.0, 101.0, 131.0, 140.0, 145.0, 181.0, 191.0, 211.0, 227.0, 232.0, 279.0, 305.0, 337.0, 386.0, 403.0, 428.0, 490.0, 535.0, 599.0, 611.0, 680.0, 711.0, 779.0, 877.0, 964.0, 1052.0, 1135.0, 1235.0, 1341.0, 1500.0, 1537.0, 1638.0, 1778.0, 1853.0, 2054.0, 2097.0, 2220.0, 2209.0, 2360.0, 2366.0, 2501.0, 2542.0, 2615.0, 2764.0], [159.0, 70.0, 67.0, 54.0, 51.0, 32.0, 46.0, 30.0, 39.0, 48.0, 55.0, 54.0, 67.0, 54.0, 73.0, 65.0, 93.0, 84.0, 94.0, 92.0, 102.0, 120.0, 125.0, 150.0, 165.0, 185.0, 213.0, 228.0, 251.0, 292.0, 313.0, 375.0, 386.0, 453.0, 505.0, 567.0, 674.0, 738.0, 882.0, 1055.0, 1243.0, 1450.0, 1821.0, 2215.0, 2673.0, 3354.0, 4163.0, 5605.0, 7694.0], [164.0, 69.0, 36.0, 33.0, 36.0, 25.0, 29.0, 23.0, 24.0, 28.0, 19.0, 24.0, 22.0, 27.0, 24.0, 24.0, 30.0, 32.0, 30.0, 35.0, 43.0, 44.0, 48.0, 54.0, 53.0, 47.0, 65.0, 73.0, 94.0, 73.0, 114.0, 107.0, 123.0, 147.0, 156.0, 204.0, 244.0, 228.0, 308.0, 388.0, 496.0, 539.0, 716.0, 874.0, 1132.0, 1588.0, 2502.0, 4059.0, 8514.0], [175.0, 54.0, 41.0, 37.0, 26.0, 20.0, 10.0, 23.0, 17.0, 14.0, 13.0, 24.0, 15.0, 19.0, 19.0, 21.0, 17.0, 19.0, 23.0, 9.0, 9.0, 22.0, 22.0, 18.0, 16.0, 25.0, 28.0, 29.0, 22.0, 44.0, 32.0, 38.0, 54.0, 37.0, 68.0, 74.0, 76.0, 85.0, 113.0, 156.0, 149.0, 226.0, 232.0, 367.0, 456.0, 746.0, 1116.0, 1989.0, 5086.0], [234.0, 78.0, 46.0, 17.0, 26.0, 10.0, 18.0, 21.0, 17.0, 11.0, 11.0, 18.0, 13.0, 13.0, 20.0, 10.0, 10.0, 12.0, 8.0, 8.0, 11.0, 12.0, 10.0, 9.0, 10.0, 10.0, 16.0, 13.0, 13.0, 14.0, 21.0, 16.0, 21.0, 25.0, 24.0, 27.0, 28.0, 39.0, 49.0, 51.0, 70.0, 67.0, 98.0, 125.0, 183.0, 265.0, 444.0, 860.0, 2643.0], [427.0, 84.0, 47.0, 29.0, 18.0, 19.0, 8.0, 8.0, 13.0, 10.0, 18.0, 7.0, 12.0, 11.0, 6.0, 10.0, 10.0, 8.0, 16.0, 11.0, 6.0, 8.0, 8.0, 7.0, 6.0, 10.0, 7.0, 6.0, 16.0, 14.0, 7.0, 19.0, 12.0, 11.0, 15.0, 12.0, 18.0, 18.0, 21.0, 23.0, 39.0, 30.0, 33.0, 59.0, 70.0, 102.0, 181.0, 366.0, 1295.0], [748.0, 191.0, 70.0, 31.0, 22.0, 8.0, 10.0, 15.0, 13.0, 11.0, 8.0, 9.0, 4.0, 11.0, 10.0, 11.0, 15.0, 6.0, 7.0, 8.0, 9.0, 4.0, 4.0, 5.0, 5.0, 11.0, 7.0, 10.0, 4.0, 5.0, 9.0, 9.0, 7.0, 10.0, 6.0, 11.0, 14.0, 13.0, 19.0, 13.0, 18.0, 19.0, 28.0, 32.0, 40.0, 43.0, 88.0, 178.0, 577.0], [1438.0, 401.0, 149.0, 60.0, 35.0, 13.0, 11.0, 14.0, 13.0, 3.0, 7.0, 11.0, 15.0, 6.0, 5.0, 7.0, 10.0, 7.0, 3.0, 7.0, 5.0, 10.0, 6.0, 4.0, 2.0, 8.0, 5.0, 4.0, 6.0, 9.0, 5.0, 8.0, 7.0, 10.0, 9.0, 10.0, 8.0, 12.0, 13.0, 8.0, 7.0, 17.0, 14.0, 15.0, 21.0, 27.0, 56.0, 75.0, 310.0], [2384.0, 821.0, 336.0, 140.0, 83.0, 45.0, 30.0, 15.0, 10.0, 18.0, 13.0, 12.0, 6.0, 8.0, 8.0, 7.0, 3.0, 5.0, 8.0, 7.0, 4.0, 2.0, 0.0, 4.0, 13.0, 6.0, 4.0, 9.0, 5.0, 3.0, 6.0, 4.0, 9.0, 2.0, 4.0, 5.0, 6.0, 7.0, 6.0, 7.0, 7.0, 8.0, 11.0, 24.0, 18.0, 25.0, 26.0, 69.0, 149.0], [3450.0, 1470.0, 748.0, 375.0, 215.0, 121.0, 77.0, 58.0, 30.0, 28.0, 21.0, 17.0, 12.0, 8.0, 11.0, 3.0, 8.0, 0.0, 4.0, 10.0, 4.0, 4.0, 1.0, 4.0, 3.0, 3.0, 3.0, 2.0, 4.0, 2.0, 9.0, 4.0, 5.0, 6.0, 7.0, 2.0, 4.0, 11.0, 3.0, 3.0, 6.0, 11.0, 12.0, 8.0, 12.0, 15.0, 29.0, 31.0, 105.0], [4190.0, 2142.0, 1330.0, 786.0, 505.0, 347.0, 217.0, 145.0, 99.0, 84.0, 46.0, 54.0, 28.0, 25.0, 25.0, 8.0, 11.0, 14.0, 6.0, 2.0, 6.0, 3.0, 1.0, 4.0, 4.0, 1.0, 3.0, 5.0, 4.0, 5.0, 4.0, 4.0, 4.0, 4.0, 5.0, 1.0, 5.0, 3.0, 6.0, 4.0, 2.0, 6.0, 9.0, 8.0, 8.0, 10.0, 19.0, 33.0, 62.0], [4382.0, 2776.0, 1805.0, 1295.0, 915.0, 622.0, 516.0, 399.0, 266.0, 223.0, 168.0, 125.0, 97.0, 72.0, 51.0, 55.0, 37.0, 35.0, 23.0, 22.0, 16.0, 16.0, 8.0, 3.0, 3.0, 7.0, 10.0, 3.0, 1.0, 3.0, 1.0, 8.0, 6.0, 2.0, 0.0, 3.0, 0.0, 2.0, 4.0, 8.0, 3.0, 8.0, 3.0, 4.0, 6.0, 14.0, 10.0, 21.0, 62.0], [3994.0, 2774.0, 2226.0, 1641.0, 1314.0, 1029.0, 815.0, 638.0, 490.0, 418.0, 380.0, 311.0, 233.0, 186.0, 164.0, 131.0, 90.0, 106.0, 62.0, 72.0, 47.0, 39.0, 31.0, 22.0, 21.0, 22.0, 20.0, 7.0, 12.0, 7.0, 9.0, 2.0, 5.0, 5.0, 6.0, 4.0, 6.0, 5.0, 2.0, 1.0, 4.0, 5.0, 3.0, 5.0, 3.0, 4.0, 15.0, 22.0, 33.0], [3036.0, 2506.0, 2123.0, 1856.0, 1552.0, 1327.0, 1085.0, 937.0, 811.0, 693.0, 615.0, 482.0, 461.0, 353.0, 354.0, 293.0, 265.0, 201.0, 177.0, 175.0, 140.0, 127.0, 90.0, 87.0, 64.0, 55.0, 55.0, 45.0, 27.0, 26.0, 27.0, 23.0, 21.0, 15.0, 16.0, 10.0, 18.0, 9.0, 8.0, 8.0, 4.0, 7.0, 1.0, 5.0, 2.0, 5.0, 5.0, 12.0, 26.0], [2140.0, 1853.0, 1836.0, 1568.0, 1514.0, 1350.0, 1216.0, 1146.0, 1080.0, 915.0, 843.0, 735.0, 697.0, 584.0, 517.0, 506.0, 452.0, 416.0, 354.0, 293.0, 293.0, 246.0, 201.0, 192.0, 164.0, 172.0, 148.0, 108.0, 93.0, 96.0, 84.0, 70.0, 58.0, 46.0, 43.0, 44.0, 29.0, 24.0, 25.0, 18.0, 15.0, 18.0, 9.0, 9.0, 10.0, 7.0, 6.0, 8.0, 20.0], [1155.0, 1296.0, 1280.0, 1238.0, 1179.0, 1155.0, 1099.0, 1143.0, 1045.0, 1009.0, 956.0, 904.0, 814.0, 776.0, 743.0, 700.0, 661.0, 565.0, 545.0, 524.0, 506.0, 466.0, 374.0, 342.0, 312.0, 319.0, 254.0, 248.0, 260.0, 213.0, 200.0, 170.0, 146.0, 126.0, 122.0, 112.0, 102.0, 63.0, 63.0, 76.0, 59.0, 41.0, 45.0, 32.0, 26.0, 32.0, 20.0, 8.0, 10.0], [673.0, 688.0, 795.0, 806.0, 809.0, 797.0, 809.0, 878.0, 863.0, 868.0, 846.0, 867.0, 821.0, 824.0, 825.0, 786.0, 769.0, 727.0, 683.0, 692.0, 665.0, 608.0, 553.0, 526.0, 510.0, 475.0, 497.0, 476.0, 417.0, 381.0, 382.0, 319.0, 304.0, 293.0, 261.0, 243.0, 221.0, 203.0, 170.0, 150.0, 135.0, 116.0, 104.0, 85.0, 91.0, 59.0, 46.0, 41.0, 32.0], [329.0, 350.0, 412.0, 425.0, 481.0, 502.0, 574.0, 592.0, 593.0, 568.0, 652.0, 669.0, 665.0, 725.0, 718.0, 703.0, 736.0, 715.0, 770.0, 692.0, 722.0, 693.0, 682.0, 645.0, 671.0, 648.0, 608.0, 600.0, 556.0, 559.0, 591.0, 522.0, 525.0, 488.0, 456.0, 459.0, 411.0, 379.0, 326.0, 347.0, 283.0, 307.0, 256.0, 233.0, 185.0, 149.0, 131.0, 112.0, 90.0], [165.0, 164.0, 185.0, 227.0, 249.0, 283.0, 304.0, 339.0, 349.0, 372.0, 412.0, 459.0, 464.0, 493.0, 534.0, 558.0, 579.0, 572.0, 612.0, 626.0, 618.0, 649.0, 673.0, 643.0, 638.0, 677.0, 687.0, 680.0, 721.0, 650.0, 656.0, 703.0, 678.0, 628.0, 604.0, 659.0, 622.0, 618.0, 607.0, 537.0, 530.0, 520.0, 482.0, 422.0, 419.0, 372.0, 337.0, 267.0, 248.0], [118.0, 98.0, 82.0, 99.0, 115.0, 132.0, 169.0, 192.0, 196.0, 214.0, 250.0, 244.0, 305.0, 297.0, 324.0, 341.0, 361.0, 404.0, 422.0, 481.0, 473.0, 474.0, 537.0, 554.0, 534.0, 596.0, 630.0, 624.0, 623.0, 706.0, 674.0, 717.0, 759.0, 701.0, 670.0, 749.0, 759.0, 815.0, 756.0, 759.0, 786.0, 739.0, 719.0, 760.0, 731.0, 721.0, 652.0, 628.0, 547.0], [74.0, 51.0, 43.0, 45.0, 40.0, 48.0, 65.0, 80.0, 80.0, 100.0, 97.0, 127.0, 146.0, 132.0, 176.0, 181.0, 250.0, 233.0, 256.0, 297.0, 293.0, 332.0, 363.0, 378.0, 367.0, 435.0, 416.0, 476.0, 560.0, 589.0, 579.0, 618.0, 649.0, 646.0, 725.0, 795.0, 796.0, 762.0, 849.0, 848.0, 947.0, 931.0, 1105.0, 1021.0, 1020.0, 1052.0, 1165.0, 1098.0, 1119.0], [62.0, 34.0, 34.0, 28.0, 19.0, 19.0, 21.0, 27.0, 35.0, 47.0, 50.0, 60.0, 54.0, 73.0, 77.0, 91.0, 95.0, 100.0, 126.0, 145.0, 177.0, 193.0, 188.0, 208.0, 221.0, 281.0, 278.0, 294.0, 344.0, 429.0, 408.0, 451.0, 504.0, 487.0, 540.0, 664.0, 695.0, 729.0, 791.0, 850.0, 939.0, 1034.0, 1135.0, 1217.0, 1278.0, 1387.0, 1534.0, 1699.0, 2000.0], [72.0, 28.0, 16.0, 16.0, 11.0, 13.0, 9.0, 8.0, 19.0, 18.0, 18.0, 28.0, 22.0, 37.0, 32.0, 29.0, 44.0, 48.0, 67.0, 71.0, 76.0, 78.0, 78.0, 102.0, 138.0, 151.0, 157.0, 182.0, 201.0, 212.0, 241.0, 300.0, 296.0, 376.0, 411.0, 450.0, 509.0, 511.0, 634.0, 734.0, 787.0, 881.0, 1039.0, 1138.0, 1395.0, 1579.0, 1839.0, 2171.0, 2806.0], [66.0, 22.0, 19.0, 8.0, 7.0, 3.0, 5.0, 11.0, 5.0, 13.0, 11.0, 12.0, 16.0, 12.0, 9.0, 13.0, 20.0, 14.0, 27.0, 26.0, 33.0, 33.0, 38.0, 53.0, 57.0, 50.0, 79.0, 86.0, 95.0, 122.0, 146.0, 162.0, 164.0, 213.0, 230.0, 254.0, 295.0, 343.0, 442.0, 483.0, 551.0, 704.0, 868.0, 938.0, 1151.0, 1456.0, 1874.0, 2472.0, 3446.0], [64.0, 32.0, 12.0, 21.0, 4.0, 4.0, 3.0, 5.0, 8.0, 7.0, 1.0, 4.0, 3.0, 4.0, 9.0, 4.0, 14.0, 10.0, 7.0, 9.0, 15.0, 19.0, 12.0, 16.0, 26.0, 34.0, 30.0, 31.0, 41.0, 42.0, 54.0, 51.0, 92.0, 112.0, 109.0, 132.0, 141.0, 200.0, 231.0, 311.0, 373.0, 417.0, 541.0, 704.0, 915.0, 1233.0, 1573.0, 2364.0, 3888.0], [67.0, 18.0, 16.0, 12.0, 9.0, 3.0, 3.0, 7.0, 8.0, 3.0, 5.0, 2.0, 5.0, 4.0, 3.0, 7.0, 2.0, 5.0, 4.0, 3.0, 3.0, 4.0, 3.0, 8.0, 18.0, 5.0, 11.0, 9.0, 13.0, 19.0, 20.0, 26.0, 35.0, 27.0, 67.0, 67.0, 67.0, 91.0, 116.0, 159.0, 215.0, 265.0, 326.0, 429.0, 581.0, 825.0, 1278.0, 1942.0, 3653.0], [61.0, 29.0, 18.0, 14.0, 8.0, 5.0, 8.0, 2.0, 5.0, 3.0, 2.0, 3.0, 2.0, 3.0, 4.0, 2.0, 5.0, 5.0, 1.0, 2.0, 3.0, 0.0, 5.0, 1.0, 6.0, 6.0, 7.0, 3.0, 3.0, 7.0, 14.0, 9.0, 19.0, 12.0, 19.0, 30.0, 37.0, 39.0, 53.0, 70.0, 89.0, 137.0, 180.0, 231.0, 363.0, 531.0, 881.0, 1483.0, 3104.0], [68.0, 29.0, 23.0, 9.0, 5.0, 4.0, 2.0, 5.0, 4.0, 4.0, 6.0, 3.0, 5.0, 4.0, 4.0, 2.0, 2.0, 5.0, 3.0, 1.0, 1.0, 1.0, 4.0, 1.0, 1.0, 1.0, 3.0, 2.0, 1.0, 0.0, 2.0, 2.0, 1.0, 6.0, 7.0, 10.0, 13.0, 11.0, 27.0, 17.0, 30.0, 53.0, 74.0, 115.0, 200.0, 295.0, 524.0, 963.0, 2356.0], [63.0, 31.0, 11.0, 14.0, 7.0, 1.0, 5.0, 3.0, 1.0, 3.0, 3.0, 3.0, 5.0, 6.0, 1.0, 4.0, 2.0, 2.0, 1.0, 4.0, 1.0, 2.0, 1.0, 2.0, 0.0, 2.0, 3.0, 0.0, 1.0, 0.0, 2.0, 1.0, 1.0, 2.0, 3.0, 3.0, 5.0, 3.0, 9.0, 12.0, 13.0, 13.0, 37.0, 46.0, 95.0, 155.0, 277.0, 603.0, 1625.0], [71.0, 22.0, 16.0, 7.0, 9.0, 7.0, 5.0, 5.0, 3.0, 2.0, 3.0, 4.0, 3.0, 5.0, 2.0, 2.0, 5.0, 3.0, 4.0, 1.0, 1.0, 0.0, 0.0, 2.0, 0.0, 0.0, 0.0, 1.0, 0.0, 1.0, 3.0, 1.0, 3.0, 1.0, 2.0, 1.0, 1.0, 0.0, 2.0, 5.0, 4.0, 10.0, 16.0, 22.0, 35.0, 67.0, 121.0, 337.0, 1032.0], [70.0, 31.0, 16.0, 16.0, 7.0, 6.0, 7.0, 5.0, 2.0, 3.0, 2.0, 4.0, 1.0, 1.0, 3.0, 5.0, 2.0, 4.0, 0.0, 2.0, 1.0, 1.0, 1.0, 1.0, 0.0, 2.0, 2.0, 1.0, 0.0, 0.0, 1.0, 1.0, 0.0, 0.0, 0.0, 2.0, 0.0, 1.0, 1.0, 0.0, 2.0, 1.0, 5.0, 10.0, 13.0, 23.0, 47.0, 164.0, 641.0], [67.0, 29.0, 16.0, 10.0, 6.0, 6.0, 6.0, 3.0, 2.0, 5.0, 3.0, 3.0, 4.0, 4.0, 4.0, 3.0, 2.0, 2.0, 3.0, 2.0, 2.0, 1.0, 1.0, 0.0, 0.0, 0.0, 0.0, 1.0, 0.0, 2.0, 0.0, 0.0, 0.0, 0.0, 1.0, 1.0, 0.0, 1.0, 1.0, 1.0, 0.0, 2.0, 2.0, 5.0, 7.0, 10.0, 26.0, 63.0, 301.0], [71.0, 25.0, 19.0, 8.0, 6.0, 6.0, 7.0, 2.0, 6.0, 5.0, 3.0, 5.0, 5.0, 4.0, 1.0, 4.0, 2.0, 0.0, 2.0, 1.0, 2.0, 2.0, 1.0, 1.0, 0.0, 0.0, 1.0, 0.0, 1.0, 0.0, 0.0, 2.0, 1.0, 0.0, 0.0, 0.0, 0.0, 1.0, 0.0, 1.0, 1.0, 2.0, 3.0, 2.0, 4.0, 2.0, 9.0, 34.0, 156.0], [53.0, 26.0, 7.0, 14.0, 12.0, 8.0, 3.0, 3.0, 4.0, 2.0, 5.0, 2.0, 4.0, 0.0, 4.0, 4.0, 6.0, 1.0, 5.0, 0.0, 3.0, 2.0, 0.0, 1.0, 0.0, 2.0, 0.0, 0.0, 0.0, 0.0, 0.0, 1.0, 1.0, 2.0, 2.0, 1.0, 0.0, 2.0, 1.0, 0.0, 0.0, 0.0, 3.0, 1.0, 2.0, 4.0, 3.0, 11.0, 83.0], [64.0, 25.0, 20.0, 9.0, 9.0, 2.0, 5.0, 2.0, 8.0, 5.0, 4.0, 3.0, 2.0, 2.0, 5.0, 2.0, 4.0, 3.0, 1.0, 0.0, 1.0, 1.0, 0.0, 1.0, 0.0, 0.0, 3.0, 0.0, 2.0, 0.0, 0.0, 0.0, 0.0, 1.0, 1.0, 3.0, 0.0, 0.0, 0.0, 2.0, 2.0, 1.0, 0.0, 3.0, 2.0, 2.0, 3.0, 8.0, 44.0], [62.0, 28.0, 15.0, 10.0, 11.0, 4.0, 4.0, 4.0, 5.0, 8.0, 2.0, 4.0, 3.0, 3.0, 2.0, 4.0, 1.0, 0.0, 3.0, 2.0, 1.0, 0.0, 0.0, 0.0, 0.0, 0.0, 1.0, 0.0, 1.0, 0.0, 1.0, 0.0, 0.0, 0.0, 1.0, 0.0, 1.0, 1.0, 0.0, 1.0, 4.0, 0.0, 0.0, 1.0, 1.0, 2.0, 1.0, 6.0, 17.0], [62.0, 37.0, 12.0, 7.0, 9.0, 2.0, 3.0, 3.0, 3.0, 5.0, 4.0, 7.0, 2.0, 4.0, 2.0, 0.0, 4.0, 3.0, 1.0, 3.0, 1.0, 1.0, 0.0, 1.0, 0.0, 1.0, 0.0, 0.0, 0.0, 0.0, 2.0, 1.0, 1.0, 0.0, 2.0, 1.0, 1.0, 0.0, 0.0, 0.0, 1.0, 0.0, 1.0, 3.0, 3.0, 1.0, 2.0, 0.0, 10.0], [78.0, 20.0, 20.0, 5.0, 5.0, 6.0, 3.0, 2.0, 5.0, 3.0, 5.0, 5.0, 5.0, 4.0, 1.0, 4.0, 4.0, 2.0, 3.0, 0.0, 2.0, 1.0, 0.0, 0.0, 0.0, 1.0, 0.0, 0.0, 1.0, 1.0, 0.0, 0.0, 0.0, 0.0, 1.0, 0.0, 0.0, 0.0, 0.0, 2.0, 2.0, 2.0, 1.0, 1.0, 0.0, 3.0, 1.0, 3.0, 4.0], [56.0, 29.0, 20.0, 7.0, 7.0, 5.0, 5.0, 5.0, 6.0, 3.0, 4.0, 6.0, 3.0, 7.0, 3.0, 1.0, 4.0, 3.0, 0.0, 0.0, 0.0, 0.0, 1.0, 0.0, 0.0, 0.0, 0.0, 0.0, 0.0, 1.0, 0.0, 0.0, 1.0, 1.0, 2.0, 0.0, 1.0, 3.0, 0.0, 0.0, 3.0, 0.0, 1.0, 0.0, 1.0, 1.0, 2.0, 3.0, 4.0], [79.0, 19.0, 17.0, 10.0, 5.0, 4.0, 4.0, 8.0, 0.0, 6.0, 3.0, 3.0, 6.0, 5.0, 4.0, 3.0, 2.0, 2.0, 3.0, 0.0, 0.0, 0.0, 0.0, 2.0, 0.0, 1.0, 0.0, 0.0, 1.0, 0.0, 0.0, 0.0, 0.0, 1.0, 0.0, 0.0, 0.0, 2.0, 1.0, 0.0, 4.0, 1.0, 0.0, 0.0, 1.0, 1.0, 0.0, 2.0, 5.0], [68.0, 29.0, 17.0, 12.0, 3.0, 4.0, 4.0, 5.0, 6.0, 2.0, 2.0, 7.0, 4.0, 3.0, 5.0, 3.0, 2.0, 2.0, 1.0, 0.0, 0.0, 1.0, 1.0, 0.0, 2.0, 0.0, 0.0, 0.0, 1.0, 0.0, 0.0, 0.0, 1.0, 1.0, 2.0, 0.0, 1.0, 0.0, 0.0, 1.0, 0.0, 0.0, 1.0, 2.0, 1.0, 1.0, 2.0, 1.0, 2.0], [56.0, 29.0, 14.0, 7.0, 6.0, 3.0, 0.0, 9.0, 4.0, 4.0, 5.0, 2.0, 2.0, 5.0, 2.0, 2.0, 2.0, 5.0, 2.0, 0.0, 2.0, 2.0, 1.0, 0.0, 0.0, 1.0, 0.0, 0.0, 0.0, 0.0, 0.0, 0.0, 1.0, 0.0, 1.0, 0.0, 2.0, 1.0, 1.0, 1.0, 1.0, 0.0, 1.0, 1.0, 1.0, 1.0, 1.0, 5.0, 6.0]],
    "Name": "sCurve-0",
    "Overflow": 2481805.0,
    "Type": "Histo2d",
    "Underflow": 0.0,
    "x": {
        "AxisTitle": "Vcal",
        "Bins": 51,
        "High": 302.5,
        "Low": 47.5
    },
    "y": {
        "AxisTitle": "Occupancy",
        "Bins": 49,
        "High": 49.5,
        "Low": 0.5
    },
    "z": {
        "AxisTitle": "Number of pixels"
    }
}