{
    "Data": [0.0, 0.0, 0.0, 0.0, 0.0, 0.0, 0.0, 0.0, 0.0, 0.0, 0.0, 0.0, 0.0, 11.0, 13.0, 1.0, 5.0, 227.0, 510.0, 139.0, 104.0, 896.0, 2063.0, 1335.0, 533.0, 1623.0, 2251.0, 1466.0, 835.0, 1373.0, 1555.0, 1295.0, 871.0, 839.0, 700.0, 612.0, 526.0, 645.0, 732.0, 810.0, 609.0, 729.0, 1376.0, 2489.0, 2038.0, 1451.0, 1867.0, 3045.0, 3624.0, 3086.0, 2462.0, 2097.0, 2628.0, 2226.0, 1908.0, 1796.0, 1844.0, 1908.0, 1951.0, 1621.0, 1255.0, 1216.0, 1029.0, 733.0, 677.0, 683.0, 706.0, 564.0, 511.0, 423.0, 509.0, 406.0, 371.0, 297.0, 301.0, 301.0, 258.0, 251.0, 215.0, 173.0, 172.0, 177.0, 137.0, 121.0, 117.0, 129.0, 94.0, 100.0, 95.0, 99.0, 75.0, 81.0, 61.0, 57.0, 70.0, 53.0, 44.0, 36.0, 22.0, 38.0, 31.0, 38.0, 45.0, 38.0, 29.0, 25.0, 19.0, 22.0, 31.0, 15.0, 19.0, 14.0, 19.0, 25.0, 24.0, 19.0, 11.0, 10.0, 11.0, 15.0, 9.0, 11.0, 9.0, 3.0, 12.0, 8.0, 6.0, 7.0, 4.0, 14.0, 8.0, 5.0, 7.0, 5.0, 9.0, 6.0, 5.0, 11.0, 3.0, 4.0, 6.0, 5.0, 5.0, 4.0, 6.0, 6.0, 4.0, 5.0, 4.0, 1.0, 4.0, 2.0, 1.0, 3.0, 0.0, 0.0, 4.0, 3.0, 3.0, 3.0, 2.0, 4.0, 3.0, 1.0, 2.0, 3.0, 2.0, 1.0, 2.0, 0.0, 1.0, 4.0, 0.0, 1.0, 0.0, 3.0, 4.0, 1.0, 0.0, 3.0, 1.0, 1.0, 0.0, 3.0, 2.0, 1.0, 3.0, 1.0, 3.0, 1.0, 2.0, 1.0, 2.0, 0.0, 3.0, 1.0, 1.0, 2.0, 1.0, 2.0, 1.0],
    "Name": "TimePerFitDist-0",
    "Overflow": 147.0,
    "Type": "Histo1d",
    "Underflow": 0.0,
    "x": {
        "AxisTitle": "Fit Time [us]",
        "Bins": 201,
        "High": 401.0,
        "Low": -1.0
    },
    "y": {
        "AxisTitle": "Number of Pixels"
    },
    "z": {
        "AxisTitle": "z"
    }
}