time,Hardware,Voltage,Current
1626727709285,high-voltage,1,0.052276
time,Hardware,Voltage,Current
1626727709285,high-voltage,2,0.0751646
time,Hardware,Voltage,Current
1626727709285,high-voltage,3,0.089283
time,Hardware,Voltage,Current
1626727709285,high-voltage,4,0.0987829
time,Hardware,Voltage,Current
1626727709285,high-voltage,5,0.108145
time,Hardware,Voltage,Current
1626727709285,high-voltage,6,0.119429
time,Hardware,Voltage,Current
1626727709285,high-voltage,7,0.130088
time,Hardware,Voltage,Current
1626727709285,high-voltage,8,0.143832
time,Hardware,Voltage,Current
1626727709285,high-voltage,9,0.156475
time,Hardware,Voltage,Current
1626727709285,high-voltage,10,0.171849
time,Hardware,Voltage,Current
1626727709285,high-voltage,11,0.185184
time,Hardware,Voltage,Current
1626727709285,high-voltage,12,0.198747
time,Hardware,Voltage,Current
1626727709285,high-voltage,13,0.210637
time,Hardware,Voltage,Current
1626727709285,high-voltage,14,0.221412
time,Hardware,Voltage,Current
1626727709285,high-voltage,15,0.230133
time,Hardware,Voltage,Current
1626727709285,high-voltage,16,0.237325
time,Hardware,Voltage,Current
1626727709285,high-voltage,17,0.245248
time,Hardware,Voltage,Current
1626727709285,high-voltage,18,0.252371
time,Hardware,Voltage,Current
1626727709285,high-voltage,19,0.25976
time,Hardware,Voltage,Current
1626727709285,high-voltage,20,0.265127
time,Hardware,Voltage,Current
1626727709285,high-voltage,25,0.296405
time,Hardware,Voltage,Current
1626727709285,high-voltage,30,0.335427
time,Hardware,Voltage,Current
1626727709285,high-voltage,35,0.410122
time,Hardware,Voltage,Current
1626727709285,high-voltage,40,0.594532
time,Hardware,Voltage,Current
1626727709285,high-voltage,45,0.963749
time,Hardware,Voltage,Current
1626727709285,high-voltage,50,1.60674
time,Hardware,Voltage,Current
1626727709285,high-voltage,55,2.63137
time,Hardware,Voltage,Current
1626727709285,high-voltage,60,4.14505
time,Hardware,Voltage,Current
1626727709285,high-voltage,65,6.26689
time,Hardware,Voltage,Current
1626727709285,high-voltage,70,9.16266
time,Hardware,Voltage,Current
1626727709285,high-voltage,75,10
