{
    "Data": [0.0, 0.0, 0.0, 0.0, 0.0, 0.0, 0.0, 0.0, 0.0, 0.0, 0.0, 0.0, 0.0, 0.0, 0.0, 0.0, 0.0, 0.0, 0.0, 0.0, 0.0, 0.0, 0.0, 0.0, 0.0, 0.0, 0.0, 0.0, 0.0, 0.0, 0.0, 0.0, 0.0, 0.0, 0.0, 0.0, 0.0, 0.0, 0.0, 0.0, 0.0, 0.0, 0.0, 0.0, 0.0, 0.0, 0.0, 0.0, 0.0, 0.0, 5.0, 6.0, 8.0, 14.0, 12.0, 12.0, 8.0, 6.0, 11.0, 15.0, 12.0, 20.0, 28.0, 32.0, 36.0, 53.0, 64.0, 83.0, 103.0, 117.0, 177.0, 191.0, 227.0, 284.0, 362.0, 419.0, 517.0, 640.0, 669.0, 792.0, 862.0, 1044.0, 1072.0, 1129.0, 1212.0, 1233.0, 1378.0, 1328.0, 1433.0, 1651.0, 1944.0, 2431.0, 2873.0, 3390.0, 4108.0, 4065.0, 3910.0, 3140.0, 2660.0, 1804.0, 1233.0, 847.0, 527.0, 352.0, 249.0, 185.0, 132.0, 111.0, 76.0, 74.0, 53.0, 54.0, 29.0, 41.0, 28.0, 39.0, 24.0, 26.0, 23.0, 34.0, 26.0, 24.0, 17.0, 15.0, 19.0, 17.0, 15.0, 18.0, 10.0, 7.0, 10.0, 11.0, 6.0, 12.0, 10.0, 11.0, 12.0, 9.0, 3.0, 5.0, 17.0, 9.0, 8.0, 5.0, 8.0, 12.0, 7.0, 15.0, 5.0, 16.0, 14.0, 21.0, 26.0, 23.0, 31.0, 40.0, 34.0, 57.0, 74.0, 81.0, 89.0, 100.0, 119.0, 151.0, 181.0, 204.0, 249.0, 241.0, 298.0, 341.0, 385.0, 414.0, 479.0, 478.0, 541.0, 542.0, 571.0, 627.0, 578.0, 657.0, 642.0, 714.0, 668.0, 680.0, 652.0, 665.0, 661.0, 645.0, 607.0, 612.0, 553.0, 558.0, 524.0, 503.0, 483.0, 419.0, 439.0, 420.0, 345.0, 334.0, 315.0, 294.0, 286.0, 218.0, 215.0, 210.0, 182.0, 162.0, 149.0, 163.0, 138.0, 133.0, 105.0, 90.0, 95.0, 75.0, 74.0, 81.0, 57.0, 54.0, 44.0, 59.0, 44.0, 32.0, 62.0, 45.0, 45.0, 31.0, 35.0, 24.0, 20.0, 15.0, 13.0, 5.0, 7.0, 11.0, 8.0, 3.0, 6.0, 8.0, 8.0, 7.0, 9.0, 7.0, 10.0, 6.0, 8.0, 9.0, 9.0, 6.0, 10.0, 7.0, 5.0, 7.0, 3.0, 4.0, 2.0, 3.0, 6.0, 9.0, 4.0, 6.0, 7.0, 2.0, 4.0, 3.0, 3.0, 1.0, 1.0, 1.0, 1.0, 2.0, 0.0, 0.0, 0.0, 2.0, 0.0, 1.0, 3.0, 2.0, 2.0, 1.0, 1.0, 0.0, 1.0, 1.0, 0.0, 0.0, 1.0, 0.0, 0.0, 1.0, 2.0, 1.0, 0.0, 0.0, 0.0, 0.0, 1.0, 1.0, 0.0, 1.0, 0.0, 0.0, 0.0, 1.0, 0.0, 0.0, 0.0, 1.0, 1.0, 0.0, 1.0, 1.0, 0.0, 0.0, 0.0, 0.0, 0.0, 0.0, 0.0, 0.0, 0.0, 0.0, 0.0, 0.0, 0.0, 0.0, 0.0, 0.0, 0.0, 0.0, 0.0, 0.0, 0.0, 0.0, 0.0, 0.0, 0.0, 0.0, 0.0, 0.0, 0.0, 0.0, 0.0, 0.0],
    "Name": "ThresholdDist-0",
    "Overflow": 0.0,
    "Type": "Histo1d",
    "Underflow": 0.0,
    "x": {
        "AxisTitle": "Threshold [e]",
        "Bins": 346,
        "High": 3455.0,
        "Low": -5.0
    },
    "y": {
        "AxisTitle": "Number of Pixels"
    },
    "z": {
        "AxisTitle": "z"
    }
}