time,Hardware,Voltage,Current
1621632902705,high-voltage,1,0.0605246
time,Hardware,Voltage,Current
1621632902705,high-voltage,2,0.108923
time,Hardware,Voltage,Current
1621632902705,high-voltage,3,0.189378
time,Hardware,Voltage,Current
1621632902705,high-voltage,4,0.286923
time,Hardware,Voltage,Current
1621632902705,high-voltage,5,0.392946
time,Hardware,Voltage,Current
1621632902705,high-voltage,6,0.532152
time,Hardware,Voltage,Current
1621632902705,high-voltage,7,0.724441
time,Hardware,Voltage,Current
1621632902705,high-voltage,8,0.991426
time,Hardware,Voltage,Current
1621632902705,high-voltage,9,1.30675
time,Hardware,Voltage,Current
1621632902705,high-voltage,10,1.68575
time,Hardware,Voltage,Current
1621632902705,high-voltage,11,2.15023
time,Hardware,Voltage,Current
1621632902705,high-voltage,12,2.73709
time,Hardware,Voltage,Current
1621632902705,high-voltage,13,3.44292
time,Hardware,Voltage,Current
1621632902705,high-voltage,14,4.18639
time,Hardware,Voltage,Current
1621632902705,high-voltage,15,5.16047
time,Hardware,Voltage,Current
1621632902705,high-voltage,16,6.16223
time,Hardware,Voltage,Current
1621632902705,high-voltage,17,7.35862
time,Hardware,Voltage,Current
1621632902705,high-voltage,18,8.72284
time,Hardware,Voltage,Current
1621632902705,high-voltage,19,9.68517
time,Hardware,Voltage,Current
1621632902705,high-voltage,20,10.0001
