time,Hardware,Voltage,Current
1625783929178,high-voltage-4,1,0.427567
time,Hardware,Voltage,Current
1625783929178,high-voltage-4,2,0.58593
time,Hardware,Voltage,Current
1625783929178,high-voltage-4,3,0.683125
time,Hardware,Voltage,Current
1625783929178,high-voltage-4,4,0.750809
time,Hardware,Voltage,Current
1625783929178,high-voltage-4,5,0.799613
time,Hardware,Voltage,Current
1625783929178,high-voltage-4,6,0.838874
time,Hardware,Voltage,Current
1625783929178,high-voltage-4,7,0.870426
time,Hardware,Voltage,Current
1625783929178,high-voltage-4,8,0.906072
time,Hardware,Voltage,Current
1625783929178,high-voltage-4,9,0.940909
time,Hardware,Voltage,Current
1625783929178,high-voltage-4,10,0.978827
time,Hardware,Voltage,Current
1625783929178,high-voltage-4,11,1.01917
time,Hardware,Voltage,Current
1625783929178,high-voltage-4,12,1.05927
time,Hardware,Voltage,Current
1625783929178,high-voltage-4,13,1.10617
time,Hardware,Voltage,Current
1625783929178,high-voltage-4,14,1.15253
time,Hardware,Voltage,Current
1625783929178,high-voltage-4,15,1.20048
time,Hardware,Voltage,Current
1625783929178,high-voltage-4,16,1.25123
time,Hardware,Voltage,Current
1625783929178,high-voltage-4,17,1.30548
time,Hardware,Voltage,Current
1625783929178,high-voltage-4,18,1.35784
time,Hardware,Voltage,Current
1625783929178,high-voltage-4,19,1.41779
time,Hardware,Voltage,Current
1625783929178,high-voltage-4,20,1.4773
time,Hardware,Voltage,Current
1625783929178,high-voltage-4,25,1.75089
time,Hardware,Voltage,Current
1625783929178,high-voltage-4,30,1.97473
time,Hardware,Voltage,Current
1625783929178,high-voltage-4,35,2.18762
time,Hardware,Voltage,Current
1625783929178,high-voltage-4,40,2.41068
time,Hardware,Voltage,Current
1625783929178,high-voltage-4,45,2.6522
time,Hardware,Voltage,Current
1625783929178,high-voltage-4,50,2.9202
time,Hardware,Voltage,Current
1625783929178,high-voltage-4,55,3.24319
time,Hardware,Voltage,Current
1625783929178,high-voltage-4,60,3.60698
time,Hardware,Voltage,Current
1625783929178,high-voltage-4,65,4.05577
time,Hardware,Voltage,Current
1625783929178,high-voltage-4,70,4.62139
time,Hardware,Voltage,Current
1625783929178,high-voltage-4,75,5.60933
time,Hardware,Voltage,Current
1625783929178,high-voltage-4,80,9.43865
time,Hardware,Voltage,Current
1625783929178,high-voltage-4,85,9.99967
time,Hardware,Voltage,Current
1625783929178,high-voltage-4,90,9.99971
time,Hardware,Voltage,Current
1625783929178,high-voltage-4,95,9.99972
time,Hardware,Voltage,Current
1625783929178,high-voltage-4,100,9.99974
