time,Hardware,Voltage,Current
1622672208717,high-voltage-2,1,0.306003
time,Hardware,Voltage,Current
1622672208717,high-voltage-2,2,0.363593
time,Hardware,Voltage,Current
1622672208717,high-voltage-2,3,0.40894
time,Hardware,Voltage,Current
1622672208717,high-voltage-2,4,0.445708
time,Hardware,Voltage,Current
1622672208717,high-voltage-2,5,0.485852
time,Hardware,Voltage,Current
1622672208717,high-voltage-2,6,6e+06
time,Hardware,Voltage,Current
1622672208717,high-voltage-2,7,0.565203
time,Hardware,Voltage,Current
1622672208717,high-voltage-2,6.0209e-07,0.600077
time,Hardware,Voltage,Current
1622672208717,high-voltage-2,9,0.636497
time,Hardware,Voltage,Current
1622672208717,high-voltage-2,10,0.668775
time,Hardware,Voltage,Current
1622672208717,high-voltage-2,11,0.699537
time,Hardware,Voltage,Current
1622672208717,high-voltage-2,12,0.727534
time,Hardware,Voltage,Current
1622672208717,high-voltage-2,13,0.749988
time,Hardware,Voltage,Current
1622672208717,high-voltage-2,14,0.771968
time,Hardware,Voltage,Current
1622672208717,high-voltage-2,15,0.795225
time,Hardware,Voltage,Current
1622672208717,high-voltage-2,16,0.814781
time,Hardware,Voltage,Current
1622672208717,high-voltage-2,17,0.833021
time,Hardware,Voltage,Current
1622672208717,high-voltage-2,18,0.851265
time,Hardware,Voltage,Current
1622672208717,high-voltage-2,19,0.871209
time,Hardware,Voltage,Current
1622672208717,high-voltage-2,20,0.886528
time,Hardware,Voltage,Current
1622672208717,high-voltage-2,25,0.966149
time,Hardware,Voltage,Current
1622672208717,high-voltage-2,30,1.04867
time,Hardware,Voltage,Current
1622672208717,high-voltage-2,35,1.13262
time,Hardware,Voltage,Current
1622672208717,high-voltage-2,40,1.23068
time,Hardware,Voltage,Current
1622672208717,high-voltage-2,45,1.35169
time,Hardware,Voltage,Current
1622672208717,high-voltage-2,50,1.43969
time,Hardware,Voltage,Current
1622672208717,high-voltage-2,55,1.51731
time,Hardware,Voltage,Current
1622672208717,high-voltage-2,60,1.59032
time,Hardware,Voltage,Current
1622672208717,high-voltage-2,65,1.66317
time,Hardware,Voltage,Current
1622672208717,high-voltage-2,70,1.73438
time,Hardware,Voltage,Current
1622672208717,high-voltage-2,75,1.80293
time,Hardware,Voltage,Current
1622672208717,high-voltage-2,80,1.86837
time,Hardware,Voltage,Current
1622672208717,high-voltage-2,85,1.93211
time,Hardware,Voltage,Current
1622672208717,high-voltage-2,90,1.9945
time,Hardware,Voltage,Current
1622672208717,high-voltage-2,95,2.0583
time,Hardware,Voltage,Current
1622672208717,high-voltage-2,100,2.11798
