{
    "Data": [1836.0, 22406.0, 18880.0, 7031.0, 2002.0, 835.0, 804.0, 945.0, 1039.0, 963.0, 932.0, 831.0, 674.0, 570.0, 493.0, 438.0, 395.0, 395.0, 377.0, 404.0, 408.0, 417.0, 482.0, 457.0, 482.0, 503.0, 509.0, 502.0, 498.0, 470.0, 531.0, 491.0, 539.0, 511.0, 499.0, 488.0, 461.0, 451.0, 439.0, 450.0, 428.0, 420.0, 349.0, 361.0, 317.0, 286.0, 282.0, 270.0, 274.0, 220.0, 98.0],
    "Name": "Chi2Dist-0",
    "Overflow": 0.0,
    "Type": "Histo1d",
    "Underflow": 0.0,
    "x": {
        "AxisTitle": "Fit Chi/ndf",
        "Bins": 51,
        "High": 2.5250000953674318,
        "Low": -0.02500000037252903
    },
    "y": {
        "AxisTitle": "Number of Pixels"
    },
    "z": {
        "AxisTitle": "z"
    }
}