{
    "Data": [0.0, 0.0, 0.0, 0.0, 0.0, 0.0, 0.0, 0.0, 0.0, 0.0, 0.0, 0.0, 0.0, 0.0, 1.0, 0.0, 0.0, 0.0, 4.0, 3.0, 6.0, 5.0, 13.0, 12.0, 21.0, 26.0, 34.0, 32.0, 36.0, 40.0, 39.0, 45.0, 48.0, 46.0, 47.0, 50.0, 50.0, 49.0, 50.0, 50.0, 50.0, 50.0, 50.0, 50.0, 50.0, 50.0, 50.0, 50.0, 50.0, 50.0, 50.0],
    "Name": "Scurve-40-96",
    "Overflow": 0.0,
    "Type": "Histo1d",
    "Underflow": 0.0,
    "x": {
        "AxisTitle": "Vcal",
        "Bins": 51,
        "High": 302.5,
        "Low": 47.5
    },
    "y": {
        "AxisTitle": "Occupancy"
    },
    "z": {
        "AxisTitle": "z"
    }
}