{
    "Data": [0.0, 0.0, 0.0, 0.0, 0.0, 0.0, 0.0, 0.0, 0.0, 0.0, 0.0, 0.0, 0.0, 0.0, 0.0, 0.0, 3.0, 0.0, 3.0, 2.0, 11.0, 15.0, 12.0, 14.0, 14.0, 26.0, 33.0, 35.0, 47.0, 48.0, 48.0, 50.0, 50.0, 50.0, 50.0, 50.0, 50.0, 50.0, 50.0, 50.0, 50.0, 50.0, 50.0, 50.0, 50.0, 50.0, 50.0, 50.0, 50.0, 50.0, 50.0],
    "Name": "Scurve-30-96",
    "Overflow": 0.0,
    "Type": "Histo1d",
    "Underflow": 0.0,
    "x": {
        "AxisTitle": "Vcal",
        "Bins": 51,
        "High": 302.5,
        "Low": 47.5
    },
    "y": {
        "AxisTitle": "Occupancy"
    },
    "z": {
        "AxisTitle": "z"
    }
}