{
    "Data": [1528.0, 20111.0, 18277.0, 8570.0, 2884.0, 766.0, 397.0, 447.0, 638.0, 733.0, 761.0, 859.0, 717.0, 707.0, 614.0, 595.0, 557.0, 539.0, 538.0, 629.0, 611.0, 598.0, 580.0, 551.0, 592.0, 619.0, 559.0, 580.0, 566.0, 566.0, 532.0, 548.0, 506.0, 514.0, 437.0, 422.0, 408.0, 426.0, 391.0, 403.0, 368.0, 337.0, 303.0, 280.0, 271.0, 268.0, 240.0, 264.0, 184.0, 198.0, 96.0],
    "Name": "Chi2Dist-0",
    "Overflow": 0.0,
    "Type": "Histo1d",
    "Underflow": 0.0,
    "x": {
        "AxisTitle": "Fit Chi/ndf",
        "Bins": 51,
        "High": 2.5250000953674318,
        "Low": -0.02500000037252903
    },
    "y": {
        "AxisTitle": "Number of Pixels"
    },
    "z": {
        "AxisTitle": "z"
    }
}