{
    "Data": [0.0, 0.0, 0.0, 0.0, 0.0, 0.0, 0.0, 0.0, 0.0, 0.0, 0.0, 0.0, 0.0, 0.0, 0.0, 0.0, 0.0, 0.0, 0.0, 0.0, 0.0, 0.0, 0.0, 0.0, 0.0, 2.0, 2.0, 2.0, 7.0, 7.0, 15.0, 21.0, 21.0, 31.0, 36.0, 47.0, 46.0, 50.0, 49.0, 49.0, 50.0, 50.0, 50.0, 50.0, 50.0, 50.0, 50.0, 50.0, 50.0, 50.0, 50.0],
    "Name": "Scurve-80-96",
    "Overflow": 0.0,
    "Type": "Histo1d",
    "Underflow": 0.0,
    "x": {
        "AxisTitle": "Vcal",
        "Bins": 51,
        "High": 302.5,
        "Low": 47.5
    },
    "y": {
        "AxisTitle": "Occupancy"
    },
    "z": {
        "AxisTitle": "z"
    }
}