time,Hardware,Voltage,Current
1621541129955,high-voltage,1,0.067966
time,Hardware,Voltage,Current
1621541129955,high-voltage,2,0.114868
time,Hardware,Voltage,Current
1621541129955,high-voltage,3,0.198446
time,Hardware,Voltage,Current
1621541129955,high-voltage,4,0.318046
time,Hardware,Voltage,Current
1621541129955,high-voltage,5,0.450236
time,Hardware,Voltage,Current
1621541129955,high-voltage,6,0.684103
time,Hardware,Voltage,Current
1621541129955,high-voltage,7,0.93796
time,Hardware,Voltage,Current
1621541129955,high-voltage,8,1.28994
time,Hardware,Voltage,Current
1621541129955,high-voltage,9,1.67857
time,Hardware,Voltage,Current
1621541129955,high-voltage,10,2.21354
time,Hardware,Voltage,Current
1621541129955,high-voltage,2.78825e-06,2.79798
time,Hardware,Voltage,Current
1621541129955,high-voltage,12,3.4383
time,Hardware,Voltage,Current
1621541129955,high-voltage,13,4.33443
time,Hardware,Voltage,Current
1621541129955,high-voltage,14,5.25193
time,Hardware,Voltage,Current
1621541129955,high-voltage,15,6.5189
time,Hardware,Voltage,Current
1621541129955,high-voltage,16,7.65296
time,Hardware,Voltage,Current
1621541129955,high-voltage,17,8.91634
time,Hardware,Voltage,Current
1621541129955,high-voltage,18,9.75013
time,Hardware,Voltage,Current
1621541129955,high-voltage,19,10.0001
