time,Hardware,Voltage,Current
1623267318288,high-voltage-2,1,0.147164
time,Hardware,Voltage,Current
1623267318288,high-voltage-2,2,0.183792
time,Hardware,Voltage,Current
1623267318288,high-voltage-2,3,0.203916
time,Hardware,Voltage,Current
1623267318288,high-voltage-2,4,0.222137
time,Hardware,Voltage,Current
1623267318288,high-voltage-2,5,0.238264
time,Hardware,Voltage,Current
1623267318288,high-voltage-2,6,0.254146
time,Hardware,Voltage,Current
1623267318288,high-voltage-2,7,0.27118
time,Hardware,Voltage,Current
1623267318288,high-voltage-2,8,0.29146
time,Hardware,Voltage,Current
1623267318288,high-voltage-2,9,0.311577
time,Hardware,Voltage,Current
1623267318288,high-voltage-2,10,0.332805
time,Hardware,Voltage,Current
1623267318288,high-voltage-2,11,0.355647
time,Hardware,Voltage,Current
1623267318288,high-voltage-2,12,0.37621
time,Hardware,Voltage,Current
1623267318288,high-voltage-2,13,0.392022
time,Hardware,Voltage,Current
1623267318288,high-voltage-2,14,0.409741
time,Hardware,Voltage,Current
1623267318288,high-voltage-2,15,0.424361
time,Hardware,Voltage,Current
1623267318288,high-voltage-2,16,0.437913
time,Hardware,Voltage,Current
1623267318288,high-voltage-2,17,0.447755
time,Hardware,Voltage,Current
1623267318288,high-voltage-2,18,0.459292
time,Hardware,Voltage,Current
1623267318288,high-voltage-2,19,0.471654
time,Hardware,Voltage,Current
1623267318288,high-voltage-2,20,0.48346
time,Hardware,Voltage,Current
1623267318288,high-voltage-2,25,0.531529
time,Hardware,Voltage,Current
1623267318288,high-voltage-2,30,0.580788
time,Hardware,Voltage,Current
1623267318288,high-voltage-2,35,0.630168
time,Hardware,Voltage,Current
1623267318288,high-voltage-2,40,0.685669
time,Hardware,Voltage,Current
1623267318288,high-voltage-2,45,0.755417
time,Hardware,Voltage,Current
1623267318288,high-voltage-2,50,0.805193
time,Hardware,Voltage,Current
1623267318288,high-voltage-2,55,0.850738
time,Hardware,Voltage,Current
1623267318288,high-voltage-2,60,0.897043
time,Hardware,Voltage,Current
1623267318288,high-voltage-2,65,0.939968
time,Hardware,Voltage,Current
1623267318288,high-voltage-2,70,0.981424
time,Hardware,Voltage,Current
1623267318288,high-voltage-2,75,1.02144
time,Hardware,Voltage,Current
1623267318288,high-voltage-2,80,1.06061
time,Hardware,Voltage,Current
1623267318288,high-voltage-2,85,1.09908
time,Hardware,Voltage,Current
1623267318288,high-voltage-2,90,1.13604
time,Hardware,Voltage,Current
1623267318288,high-voltage-2,95,1.17289
time,Hardware,Voltage,Current
1623267318288,high-voltage-2,100,1.2082
