{
    "Data": [7.0, 4.0, 2.0, 0.0, 5.0, 26.0, 46.0, 61.0, 89.0, 227.0, 643.0, 1342.0, 2406.0, 3458.0, 4280.0, 4158.0, 3657.0, 2900.0, 2707.0, 2936.0, 3391.0, 3820.0, 3811.0, 3326.0, 2610.0, 1789.0, 1221.0, 734.0, 487.0, 360.0, 342.0, 346.0, 432.0, 560.0, 669.0, 943.0, 1061.0, 1259.0, 1373.0, 1518.0, 1488.0, 1479.0, 1410.0, 1390.0, 1250.0, 1174.0, 1041.0, 899.0, 804.0, 705.0, 559.0, 465.0, 398.0, 375.0, 276.0, 248.0, 175.0, 151.0, 129.0, 102.0, 88.0, 65.0, 34.0, 34.0, 31.0, 28.0, 26.0, 18.0, 19.0, 18.0, 24.0, 11.0, 9.0, 13.0, 6.0, 8.0, 7.0, 9.0, 7.0, 7.0, 3.0, 1.0, 2.0, 0.0, 2.0, 2.0, 1.0],
    "Name": "NoiseDist-0",
    "Overflow": 34.0,
    "Type": "Histo1d",
    "Underflow": 0.0,
    "x": {
        "AxisTitle": "Noise [e]",
        "Bins": 87,
        "High": 436.0,
        "Low": -2.0
    },
    "y": {
        "AxisTitle": "Number of Pixels"
    },
    "z": {
        "AxisTitle": "z"
    }
}