{
    "Data": [0.0, 0.0, 0.0, 0.0, 0.0, 0.0, 0.0, 0.0, 0.0, 0.0, 0.0, 0.0, 0.0, 0.0, 0.0, 0.0, 0.0, 0.0, 1.0, 1.0, 5.0, 8.0, 8.0, 8.0, 25.0, 17.0, 23.0, 34.0, 40.0, 36.0, 48.0, 47.0, 47.0, 49.0, 49.0, 50.0, 50.0, 50.0, 50.0, 50.0, 50.0, 50.0, 30.0, 50.0, 50.0, 50.0, 50.0, 50.0, 50.0, 50.0, 50.0],
    "Name": "Scurve-70-96",
    "Overflow": 0.0,
    "Type": "Histo1d",
    "Underflow": 0.0,
    "x": {
        "AxisTitle": "Vcal",
        "Bins": 51,
        "High": 302.5,
        "Low": 47.5
    },
    "y": {
        "AxisTitle": "Occupancy"
    },
    "z": {
        "AxisTitle": "z"
    }
}