time,Hardware,Voltage,Current
1623352843520,high-voltage,1,0.0665955
time,Hardware,Voltage,Current
1623352843520,high-voltage,2,0.082363
time,Hardware,Voltage,Current
1623352843520,high-voltage,3,0.0959873
time,Hardware,Voltage,Current
1623352843520,high-voltage,4,0.106625
time,Hardware,Voltage,Current
1623352843520,high-voltage,5,0.116675
time,Hardware,Voltage,Current
1623352843520,high-voltage,6,0.126275
time,Hardware,Voltage,Current
1623352843520,high-voltage,7,0.135569
time,Hardware,Voltage,Current
1623352843520,high-voltage,8,0.144116
time,Hardware,Voltage,Current
1623352843520,high-voltage,9,0.152893
time,Hardware,Voltage,Current
1623352843520,high-voltage,10,0.162393
time,Hardware,Voltage,Current
1623352843520,high-voltage,11,0.1714
time,Hardware,Voltage,Current
1623352843520,high-voltage,12,0.179808
time,Hardware,Voltage,Current
1623352843520,high-voltage,13,0.189382
time,Hardware,Voltage,Current
1623352843520,high-voltage,14,0.19546
time,Hardware,Voltage,Current
1623352843520,high-voltage,15,0.201952
time,Hardware,Voltage,Current
1623352843520,high-voltage,16,0.209195
time,Hardware,Voltage,Current
1623352843520,high-voltage,17,0.213691
time,Hardware,Voltage,Current
1623352843520,high-voltage,18,0.218828
time,Hardware,Voltage,Current
1623352843520,high-voltage,19,0.224605
time,Hardware,Voltage,Current
1623352843520,high-voltage,20,0.229229
time,Hardware,Voltage,Current
1623352843520,high-voltage,25,0.252812
time,Hardware,Voltage,Current
1623352843520,high-voltage,30,0.285419
time,Hardware,Voltage,Current
1623352843520,high-voltage,35,0.37503
time,Hardware,Voltage,Current
1623352843520,high-voltage,40,0.654057
time,Hardware,Voltage,Current
1623352843520,high-voltage,45,1.156
time,Hardware,Voltage,Current
1623352843520,high-voltage,50,1.82452
time,Hardware,Voltage,Current
1623352843520,high-voltage,55,2.63938
