time,Hardware,Voltage,Current
1621389341880,high-voltage-2,1,0.124597
time,Hardware,Voltage,Current
1621389341880,high-voltage-2,2,0.149099
time,Hardware,Voltage,Current
1621389341880,high-voltage-2,3,0.162294
time,Hardware,Voltage,Current
1621389341880,high-voltage-2,4,0.174411
time,Hardware,Voltage,Current
1621389341880,high-voltage-2,5,0.190309
time,Hardware,Voltage,Current
1621389341880,high-voltage-2,6,0.204178
time,Hardware,Voltage,Current
1621389341880,high-voltage-2,7,0.22085
time,Hardware,Voltage,Current
1621389341880,high-voltage-2,8,0.238318
time,Hardware,Voltage,Current
1621389341880,high-voltage-2,9,0.259482
time,Hardware,Voltage,Current
1621389341880,high-voltage-2,10,0.28317
time,Hardware,Voltage,Current
1621389341880,high-voltage-2,11,0.305275
time,Hardware,Voltage,Current
1621389341880,high-voltage-2,12,0.327048
time,Hardware,Voltage,Current
1621389341880,high-voltage-2,13,0.347102
time,Hardware,Voltage,Current
1621389341880,high-voltage-2,14,0.367619
time,Hardware,Voltage,Current
1621389341880,high-voltage-2,15,0.383818
time,Hardware,Voltage,Current
1621389341880,high-voltage-2,16,0.399986
time,Hardware,Voltage,Current
1621389341880,high-voltage-2,17,0.414376
time,Hardware,Voltage,Current
1621389341880,high-voltage-2,18,0.429133
time,Hardware,Voltage,Current
1621389341880,high-voltage-2,19,0.44079
time,Hardware,Voltage,Current
1621389341880,high-voltage-2,20,0.450951
time,Hardware,Voltage,Current
1621389341880,high-voltage-2,25,0.506389
time,Hardware,Voltage,Current
1621389341880,high-voltage-2,30,0.554405
time,Hardware,Voltage,Current
1621389341880,high-voltage-2,35,0.607094
time,Hardware,Voltage,Current
1621389341880,high-voltage-2,40,0.662982
time,Hardware,Voltage,Current
1621389341880,high-voltage-2,45,0.735415
time,Hardware,Voltage,Current
1621389341880,high-voltage-2,50,0.78912
time,Hardware,Voltage,Current
1621389341880,high-voltage-2,55,0.836233
time,Hardware,Voltage,Current
1621389341880,high-voltage-2,60,0.882836
time,Hardware,Voltage,Current
1621389341880,high-voltage-2,65,0.927628
time,Hardware,Voltage,Current
1621389341880,high-voltage-2,70,0.968731
time,Hardware,Voltage,Current
1621389341880,high-voltage-2,75,1.01004
time,Hardware,Voltage,Current
1621389341880,high-voltage-2,80,1.04935
time,Hardware,Voltage,Current
1621389341880,high-voltage-2,85,1.08711
time,Hardware,Voltage,Current
1621389341880,high-voltage-2,90,1.12673
time,Hardware,Voltage,Current
1621389341880,high-voltage-2,95,1.16266
time,Hardware,Voltage,Current
1621389341880,high-voltage-2,100,1.19819
