{
    "Data": [226.0, 11491.0, 20577.0, 14047.0, 6511.0, 3084.0, 2110.0, 1993.0, 2000.0, 1716.0, 1544.0, 1271.0, 921.0, 773.0, 616.0, 496.0, 420.0, 392.0, 394.0, 380.0, 363.0, 345.0, 339.0, 320.0, 314.0, 334.0, 285.0, 291.0, 304.0, 266.0, 250.0, 223.0, 222.0, 196.0, 218.0, 178.0, 167.0, 157.0, 160.0, 128.0, 115.0, 139.0, 116.0, 98.0, 102.0, 95.0, 93.0, 79.0, 82.0, 53.0, 26.0],
    "Name": "Chi2Dist-0",
    "Overflow": 0.0,
    "Type": "Histo1d",
    "Underflow": 0.0,
    "x": {
        "AxisTitle": "Fit Chi/ndf",
        "Bins": 51,
        "High": 2.5250000953674318,
        "Low": -0.02500000037252903
    },
    "y": {
        "AxisTitle": "Number of Pixels"
    },
    "z": {
        "AxisTitle": "z"
    }
}