time,Hardware,Voltage,Current
1625753013195,high-voltage-3,1,0.0331684
time,Hardware,Voltage,Current
1625753013195,high-voltage-3,2,0.0373138
time,Hardware,Voltage,Current
1625753013195,high-voltage-3,3,0.0401927
time,Hardware,Voltage,Current
1625753013195,high-voltage-3,4,0.0424367
time,Hardware,Voltage,Current
1625753013195,high-voltage-3,5,0.0447345
time,Hardware,Voltage,Current
1625753013195,high-voltage-3,6,0.0464595
time,Hardware,Voltage,Current
1625753013195,high-voltage-3,7,0.0475348
time,Hardware,Voltage,Current
1625753013195,high-voltage-3,8,0.0488038
time,Hardware,Voltage,Current
1625753013195,high-voltage-3,9,0.0520854
time,Hardware,Voltage,Current
1625753013195,high-voltage-3,10,0.0538985
time,Hardware,Voltage,Current
1625753013195,high-voltage-3,11,0.055859
time,Hardware,Voltage,Current
1625753013195,high-voltage-3,12,0.0577171
time,Hardware,Voltage,Current
1625753013195,high-voltage-3,13,0.0613072
time,Hardware,Voltage,Current
1625753013195,high-voltage-3,14,0.0626077
time,Hardware,Voltage,Current
1625753013195,high-voltage-3,15,0.064688
time,Hardware,Voltage,Current
1625753013195,high-voltage-3,16,0.0666695
time,Hardware,Voltage,Current
1625753013195,high-voltage-3,17,0.067779
time,Hardware,Voltage,Current
1625753013195,high-voltage-3,18,0.0699743
time,Hardware,Voltage,Current
1625753013195,high-voltage-3,19,0.0713541
time,Hardware,Voltage,Current
1625753013195,high-voltage-3,20,0.074067
time,Hardware,Voltage,Current
1625753013195,high-voltage-3,25,0.0817239
time,Hardware,Voltage,Current
1625753013195,high-voltage-3,30,0.088232
time,Hardware,Voltage,Current
1625753013195,high-voltage-3,35,0.0950127
time,Hardware,Voltage,Current
1625753013195,high-voltage-3,40,0.102159
time,Hardware,Voltage,Current
1625753013195,high-voltage-3,45,0.108124
time,Hardware,Voltage,Current
1625753013195,high-voltage-3,50,0.114698
time,Hardware,Voltage,Current
1625753013195,high-voltage-3,55,0.122605
time,Hardware,Voltage,Current
1625753013195,high-voltage-3,60,0.129287
time,Hardware,Voltage,Current
1625753013195,high-voltage-3,65,0.136617
time,Hardware,Voltage,Current
1625753013195,high-voltage-3,70,0.145836
time,Hardware,Voltage,Current
1625753013195,high-voltage-3,75,0.152938
time,Hardware,Voltage,Current
1625753013195,high-voltage-3,80,0.162385
time,Hardware,Voltage,Current
1625753013195,high-voltage-3,85,0.169912
time,Hardware,Voltage,Current
1625753013195,high-voltage-3,90,0.178136
time,Hardware,Voltage,Current
1625753013195,high-voltage-3,95,0.187893
time,Hardware,Voltage,Current
1625753013195,high-voltage-3,100,0.198773
