{
    "Data": [0.0, 0.0, 0.0, 0.0, 0.0, 0.0, 0.0, 0.0, 0.0, 0.0, 0.0, 0.0, 0.0, 0.0, 0.0, 0.0, 0.0, 0.0, 0.0, 0.0, 0.0, 0.0, 0.0, 0.0, 0.0, 0.0, 0.0, 0.0, 0.0, 0.0, 0.0, 0.0, 0.0, 0.0, 0.0, 0.0, 0.0, 0.0, 0.0, 0.0, 0.0, 0.0, 0.0, 0.0, 0.0, 0.0, 0.0, 0.0, 0.0, 0.0, 15.0, 47.0, 39.0, 44.0, 63.0, 62.0, 84.0, 110.0, 120.0, 136.0, 145.0, 157.0, 183.0, 207.0, 222.0, 229.0, 284.0, 304.0, 359.0, 350.0, 403.0, 430.0, 484.0, 536.0, 583.0, 620.0, 661.0, 713.0, 720.0, 759.0, 789.0, 772.0, 930.0, 995.0, 1243.0, 1297.0, 1630.0, 1816.0, 2228.0, 2510.0, 2760.0, 2956.0, 2947.0, 2804.0, 2732.0, 2317.0, 2105.0, 1750.0, 1379.0, 1092.0, 918.0, 759.0, 574.0, 513.0, 371.0, 334.0, 293.0, 239.0, 197.0, 176.0, 169.0, 116.0, 113.0, 108.0, 90.0, 67.0, 63.0, 62.0, 46.0, 35.0, 40.0, 24.0, 30.0, 28.0, 23.0, 24.0, 20.0, 18.0, 21.0, 13.0, 14.0, 15.0, 14.0, 13.0, 6.0, 10.0, 19.0, 17.0, 9.0, 13.0, 5.0, 7.0, 3.0, 3.0, 7.0, 6.0, 7.0, 8.0, 6.0, 4.0, 3.0, 3.0, 5.0, 3.0, 1.0, 5.0, 7.0, 3.0, 8.0, 10.0, 16.0, 19.0, 17.0, 18.0, 19.0, 25.0, 28.0, 54.0, 57.0, 76.0, 82.0, 117.0, 116.0, 132.0, 151.0, 195.0, 213.0, 218.0, 288.0, 308.0, 351.0, 364.0, 432.0, 458.0, 470.0, 504.0, 552.0, 609.0, 594.0, 695.0, 679.0, 754.0, 802.0, 747.0, 797.0, 781.0, 840.0, 799.0, 832.0, 868.0, 720.0, 664.0, 760.0, 668.0, 646.0, 628.0, 614.0, 565.0, 476.0, 452.0, 398.0, 383.0, 326.0, 297.0, 276.0, 229.0, 192.0, 171.0, 138.0, 140.0, 111.0, 106.0, 79.0, 48.0, 69.0, 45.0, 46.0, 18.0, 18.0, 23.0, 13.0, 15.0, 5.0, 4.0, 4.0, 2.0, 2.0, 1.0, 1.0, 1.0, 2.0, 2.0, 1.0, 0.0, 0.0, 1.0, 0.0, 0.0, 0.0, 0.0, 0.0, 0.0, 0.0, 0.0, 1.0, 0.0, 1.0, 1.0, 0.0, 0.0, 0.0, 0.0, 0.0, 0.0, 0.0, 0.0, 0.0, 0.0, 0.0, 0.0, 0.0, 0.0, 1.0, 0.0, 0.0, 0.0, 0.0, 0.0, 0.0, 0.0, 0.0, 0.0, 0.0, 0.0, 0.0, 0.0, 0.0, 0.0, 0.0, 0.0, 0.0, 0.0, 0.0, 0.0, 1.0, 0.0, 0.0, 0.0, 0.0, 0.0, 0.0, 0.0, 0.0, 0.0, 0.0, 0.0, 0.0, 0.0, 0.0, 0.0, 0.0, 0.0, 0.0, 0.0, 0.0, 0.0, 0.0, 0.0, 0.0, 0.0, 0.0, 0.0, 0.0, 0.0, 0.0, 0.0, 0.0, 0.0, 0.0, 0.0, 0.0, 0.0, 0.0, 0.0, 0.0, 0.0, 0.0, 0.0, 0.0, 0.0, 0.0, 0.0, 0.0, 0.0, 0.0, 0.0, 0.0, 0.0, 0.0, 0.0, 0.0, 0.0, 0.0, 0.0, 0.0, 0.0, 0.0, 0.0, 0.0, 0.0, 0.0, 0.0, 0.0, 0.0, 0.0, 0.0, 0.0, 0.0, 0.0, 0.0, 0.0, 0.0, 0.0, 0.0, 0.0, 0.0, 0.0, 0.0, 0.0],
    "Name": "ThresholdDist-0",
    "Overflow": 0.0,
    "Type": "Histo1d",
    "Underflow": 0.0,
    "x": {
        "AxisTitle": "Threshold [e]",
        "Bins": 379,
        "High": 3785.0,
        "Low": -5.0
    },
    "y": {
        "AxisTitle": "Number of Pixels"
    },
    "z": {
        "AxisTitle": "z"
    }
}