{
    "Data": [1802.0, 22474.0, 18820.0, 6856.0, 2037.0, 934.0, 834.0, 1036.0, 1093.0, 1085.0, 984.0, 862.0, 662.0, 606.0, 527.0, 468.0, 448.0, 454.0, 450.0, 426.0, 469.0, 414.0, 438.0, 452.0, 421.0, 448.0, 483.0, 486.0, 480.0, 500.0, 459.0, 488.0, 456.0, 448.0, 411.0, 473.0, 396.0, 433.0, 416.0, 361.0, 358.0, 313.0, 338.0, 301.0, 285.0, 261.0, 223.0, 249.0, 224.0, 238.0, 101.0],
    "Name": "Chi2Dist-0",
    "Overflow": 0.0,
    "Type": "Histo1d",
    "Underflow": 0.0,
    "x": {
        "AxisTitle": "Fit Chi/ndf",
        "Bins": 51,
        "High": 2.5250000953674318,
        "Low": -0.02500000037252903
    },
    "y": {
        "AxisTitle": "Number of Pixels"
    },
    "z": {
        "AxisTitle": "z"
    }
}