{
    "Data": [187.0, 2752.0, 8718.0, 9590.0, 6870.0, 3740.0, 1764.0, 996.0, 703.0, 616.0, 673.0, 759.0, 772.0, 787.0, 888.0, 896.0, 866.0, 834.0, 838.0, 780.0, 735.0, 764.0, 723.0, 729.0, 671.0, 603.0, 620.0, 544.0, 528.0, 495.0, 446.0, 405.0, 407.0, 326.0, 337.0, 287.0, 257.0, 215.0, 198.0, 172.0, 150.0, 142.0, 126.0, 75.0, 102.0, 78.0, 63.0, 43.0, 40.0, 48.0, 13.0],
    "Name": "Chi2Dist-0",
    "Overflow": 0.0,
    "Type": "Histo1d",
    "Underflow": 0.0,
    "x": {
        "AxisTitle": "Fit Chi/ndf",
        "Bins": 51,
        "High": 2.5250000953674318,
        "Low": -0.02500000037252903
    },
    "y": {
        "AxisTitle": "Number of Pixels"
    },
    "z": {
        "AxisTitle": "z"
    }
}