{
    "Data": [0.0, 0.0, 0.0, 0.0, 0.0, 0.0, 0.0, 0.0, 0.0, 0.0, 0.0, 0.0, 0.0, 0.0, 0.0, 0.0, 0.0, 0.0, 0.0, 0.0, 0.0, 0.0, 0.0, 0.0, 0.0, 0.0, 0.0, 0.0, 0.0, 0.0, 0.0, 0.0, 0.0, 0.0, 0.0, 0.0, 0.0, 0.0, 0.0, 0.0, 0.0, 0.0, 0.0, 0.0, 0.0, 0.0, 0.0, 0.0, 0.0, 0.0, 21.0, 34.0, 49.0, 64.0, 70.0, 83.0, 84.0, 117.0, 138.0, 167.0, 178.0, 173.0, 247.0, 247.0, 267.0, 296.0, 306.0, 378.0, 408.0, 447.0, 448.0, 557.0, 577.0, 636.0, 640.0, 710.0, 774.0, 838.0, 741.0, 865.0, 869.0, 943.0, 1117.0, 1240.0, 1420.0, 1724.0, 2087.0, 2426.0, 2733.0, 2877.0, 2976.0, 2846.0, 2794.0, 2586.0, 2126.0, 1878.0, 1491.0, 1208.0, 967.0, 791.0, 625.0, 529.0, 439.0, 346.0, 310.0, 272.0, 220.0, 174.0, 144.0, 124.0, 109.0, 100.0, 84.0, 68.0, 62.0, 42.0, 38.0, 50.0, 30.0, 32.0, 33.0, 27.0, 19.0, 17.0, 20.0, 10.0, 17.0, 18.0, 20.0, 17.0, 9.0, 14.0, 18.0, 11.0, 14.0, 9.0, 6.0, 7.0, 6.0, 9.0, 7.0, 5.0, 8.0, 4.0, 2.0, 6.0, 3.0, 4.0, 3.0, 1.0, 2.0, 6.0, 1.0, 5.0, 8.0, 5.0, 4.0, 9.0, 5.0, 14.0, 11.0, 16.0, 20.0, 13.0, 22.0, 31.0, 43.0, 34.0, 43.0, 55.0, 69.0, 81.0, 103.0, 96.0, 134.0, 151.0, 180.0, 174.0, 239.0, 246.0, 268.0, 319.0, 344.0, 385.0, 384.0, 441.0, 494.0, 532.0, 535.0, 625.0, 622.0, 691.0, 744.0, 772.0, 748.0, 766.0, 762.0, 799.0, 818.0, 826.0, 811.0, 851.0, 808.0, 793.0, 726.0, 688.0, 645.0, 592.0, 565.0, 531.0, 472.0, 433.0, 402.0, 345.0, 299.0, 279.0, 213.0, 204.0, 177.0, 186.0, 142.0, 124.0, 99.0, 85.0, 73.0, 53.0, 53.0, 43.0, 33.0, 30.0, 17.0, 17.0, 12.0, 10.0, 6.0, 5.0, 2.0, 3.0, 0.0, 2.0, 3.0, 1.0, 1.0, 0.0, 0.0, 0.0, 0.0, 0.0, 0.0, 0.0, 0.0, 0.0, 0.0, 0.0, 0.0, 0.0, 0.0, 0.0, 0.0, 0.0, 1.0, 0.0, 0.0, 0.0, 0.0, 0.0, 0.0, 0.0, 0.0, 0.0, 0.0, 0.0, 0.0, 0.0, 0.0, 0.0, 0.0, 0.0, 0.0, 0.0, 1.0, 0.0, 0.0, 0.0, 0.0, 0.0, 0.0, 0.0, 0.0, 0.0, 0.0, 0.0, 0.0, 0.0, 0.0, 0.0, 0.0, 0.0, 0.0, 0.0, 0.0, 0.0, 0.0, 0.0, 0.0, 0.0, 0.0, 0.0, 0.0, 0.0, 0.0, 0.0, 0.0, 0.0, 0.0, 0.0, 0.0, 0.0, 0.0, 0.0, 0.0, 0.0, 0.0, 0.0, 0.0, 0.0, 0.0, 0.0, 0.0, 0.0, 0.0, 0.0, 0.0, 0.0, 0.0, 0.0, 0.0, 0.0, 0.0, 0.0, 0.0, 0.0, 0.0, 0.0, 0.0, 0.0, 0.0, 0.0, 0.0, 0.0, 0.0, 0.0, 0.0, 0.0, 0.0, 0.0, 0.0, 0.0, 0.0, 0.0, 0.0, 0.0, 0.0, 0.0, 0.0, 0.0, 0.0, 0.0, 0.0, 0.0, 0.0, 0.0, 0.0, 0.0, 0.0, 0.0, 0.0, 0.0, 0.0, 0.0, 0.0, 0.0, 0.0],
    "Name": "ThresholdDist-0",
    "Overflow": 0.0,
    "Type": "Histo1d",
    "Underflow": 0.0,
    "x": {
        "AxisTitle": "Threshold [e]",
        "Bins": 383,
        "High": 3825.0,
        "Low": -5.0
    },
    "y": {
        "AxisTitle": "Number of Pixels"
    },
    "z": {
        "AxisTitle": "z"
    }
}