{
    "Data": [0.0, 0.0, 0.0, 0.0, 0.0, 0.0, 0.0, 0.0, 0.0, 0.0, 0.0, 0.0, 0.0, 0.0, 1.0, 0.0, 0.0, 0.0, 1.0, 0.0, 0.0, 0.0, 1.0, 0.0, 0.0, 2.0, 10.0, 6.0, 10.0, 6.0, 20.0, 22.0, 10.0, 10.0, 29.0, 41.0, 31.0, 213.0, 465.0, 498.0, 327.0, 702.0, 1654.0, 3000.0, 2267.0, 1470.0, 2355.0, 3204.0, 3873.0, 2923.0, 2457.0, 2258.0, 2649.0, 2169.0, 1704.0, 1555.0, 1444.0, 1604.0, 1375.0, 1316.0, 1085.0, 1081.0, 816.0, 632.0, 613.0, 513.0, 568.0, 474.0, 406.0, 362.0, 355.0, 322.0, 240.0, 265.0, 229.0, 221.0, 176.0, 146.0, 124.0, 113.0, 128.0, 125.0, 120.0, 98.0, 80.0, 75.0, 63.0, 51.0, 61.0, 54.0, 34.0, 34.0, 42.0, 34.0, 33.0, 37.0, 24.0, 28.0, 21.0, 20.0, 21.0, 14.0, 20.0, 11.0, 15.0, 14.0, 10.0, 12.0, 10.0, 9.0, 8.0, 15.0, 6.0, 4.0, 6.0, 8.0, 5.0, 5.0, 3.0, 1.0, 2.0, 3.0, 0.0, 1.0, 4.0, 3.0, 6.0, 3.0, 3.0, 5.0, 3.0, 1.0, 3.0, 3.0, 3.0, 2.0, 0.0, 2.0, 0.0, 0.0, 3.0, 3.0, 3.0, 3.0, 2.0, 1.0, 2.0, 1.0, 1.0, 1.0, 2.0, 0.0, 1.0, 1.0, 0.0, 0.0, 0.0, 3.0, 1.0, 2.0, 0.0, 1.0, 0.0, 2.0, 0.0, 1.0, 1.0, 0.0, 0.0, 0.0, 1.0, 0.0, 1.0, 0.0, 1.0, 0.0, 0.0, 0.0, 0.0, 0.0, 0.0, 0.0, 0.0, 0.0, 0.0, 0.0, 0.0, 1.0, 0.0, 0.0, 0.0, 1.0, 0.0, 1.0, 3.0, 1.0, 2.0, 0.0, 0.0, 2.0, 0.0],
    "Name": "TimePerFitDist-0",
    "Overflow": 130.0,
    "Type": "Histo1d",
    "Underflow": 0.0,
    "x": {
        "AxisTitle": "Fit Time [us]",
        "Bins": 201,
        "High": 401.0,
        "Low": -1.0
    },
    "y": {
        "AxisTitle": "Number of Pixels"
    },
    "z": {
        "AxisTitle": "z"
    }
}