{
    "Data": [4.0, 7.0, 1.0, 0.0, 0.0, 2.0, 5.0, 26.0, 76.0, 227.0, 596.0, 1305.0, 2522.0, 3596.0, 4112.0, 3886.0, 3079.0, 2362.0, 2066.0, 2381.0, 2978.0, 3379.0, 3530.0, 3323.0, 2596.0, 1992.0, 1407.0, 1003.0, 746.0, 574.0, 535.0, 445.0, 417.0, 404.0, 326.0, 291.0, 257.0, 203.0, 130.0, 119.0, 86.0, 66.0, 68.0, 45.0, 30.0, 19.0, 37.0, 16.0, 17.0, 7.0, 14.0, 14.0, 10.0, 9.0, 11.0, 8.0],
    "Name": "NoiseDist-0",
    "Overflow": 197.0,
    "Type": "Histo1d",
    "Underflow": 0.0,
    "x": {
        "AxisTitle": "Noise [e]",
        "Bins": 56,
        "High": 281.0,
        "Low": -2.0
    },
    "y": {
        "AxisTitle": "Number of Pixels"
    },
    "z": {
        "AxisTitle": "z"
    }
}