{
    "Data": [[728.0, 214.0, 112.0, 56.0, 40.0, 23.0, 12.0, 10.0, 15.0, 16.0, 9.0, 4.0, 2.0, 7.0, 4.0, 6.0, 5.0, 5.0, 2.0, 11.0, 6.0, 3.0, 6.0, 5.0, 2.0, 4.0, 1.0, 2.0, 4.0, 6.0, 4.0, 1.0, 1.0, 0.0, 3.0, 2.0, 4.0, 2.0, 2.0, 2.0, 0.0, 6.0, 4.0, 1.0, 6.0, 4.0, 3.0, 5.0, 1.0], [1692.0, 551.0, 297.0, 175.0, 115.0, 93.0, 67.0, 36.0, 29.0, 25.0, 21.0, 28.0, 9.0, 13.0, 17.0, 10.0, 8.0, 8.0, 6.0, 6.0, 5.0, 3.0, 3.0, 5.0, 7.0, 4.0, 6.0, 2.0, 5.0, 2.0, 1.0, 5.0, 9.0, 6.0, 4.0, 11.0, 3.0, 3.0, 2.0, 7.0, 5.0, 3.0, 3.0, 7.0, 6.0, 4.0, 4.0, 7.0, 9.0], [3066.0, 1269.0, 698.0, 440.0, 308.0, 241.0, 190.0, 144.0, 96.0, 96.0, 86.0, 44.0, 54.0, 35.0, 51.0, 35.0, 25.0, 25.0, 19.0, 19.0, 11.0, 13.0, 18.0, 16.0, 17.0, 8.0, 9.0, 6.0, 13.0, 7.0, 6.0, 6.0, 4.0, 4.0, 8.0, 6.0, 8.0, 7.0, 6.0, 8.0, 3.0, 4.0, 6.0, 9.0, 7.0, 13.0, 14.0, 8.0, 14.0], [3860.0, 2041.0, 1400.0, 956.0, 698.0, 583.0, 477.0, 365.0, 320.0, 254.0, 203.0, 183.0, 152.0, 158.0, 114.0, 91.0, 104.0, 74.0, 89.0, 60.0, 61.0, 58.0, 38.0, 63.0, 36.0, 34.0, 28.0, 38.0, 19.0, 30.0, 32.0, 18.0, 22.0, 11.0, 19.0, 13.0, 18.0, 18.0, 12.0, 15.0, 9.0, 11.0, 10.0, 6.0, 12.0, 9.0, 11.0, 25.0, 26.0], [3578.0, 2258.0, 1598.0, 1310.0, 1128.0, 922.0, 778.0, 718.0, 618.0, 542.0, 475.0, 406.0, 387.0, 317.0, 310.0, 276.0, 254.0, 261.0, 187.0, 227.0, 179.0, 193.0, 137.0, 131.0, 142.0, 137.0, 96.0, 95.0, 105.0, 68.0, 78.0, 75.0, 68.0, 63.0, 49.0, 44.0, 52.0, 36.0, 45.0, 43.0, 51.0, 34.0, 26.0, 36.0, 28.0, 14.0, 29.0, 31.0, 33.0], [4121.0, 2100.0, 1546.0, 1294.0, 1140.0, 969.0, 887.0, 864.0, 809.0, 739.0, 687.0, 625.0, 560.0, 587.0, 539.0, 514.0, 456.0, 453.0, 417.0, 386.0, 364.0, 360.0, 305.0, 335.0, 317.0, 309.0, 265.0, 220.0, 268.0, 236.0, 220.0, 198.0, 199.0, 194.0, 167.0, 182.0, 152.0, 137.0, 141.0, 145.0, 104.0, 102.0, 101.0, 94.0, 97.0, 93.0, 73.0, 73.0, 77.0], [6963.0, 3906.0, 2507.0, 1702.0, 1350.0, 1092.0, 949.0, 818.0, 754.0, 705.0, 736.0, 714.0, 644.0, 607.0, 602.0, 620.0, 554.0, 561.0, 560.0, 520.0, 549.0, 509.0, 522.0, 503.0, 451.0, 436.0, 514.0, 487.0, 450.0, 456.0, 422.0, 422.0, 466.0, 417.0, 375.0, 372.0, 389.0, 366.0, 363.0, 355.0, 310.0, 349.0, 283.0, 328.0, 302.0, 276.0, 259.0, 270.0, 268.0], [2390.0, 2599.0, 2660.0, 2447.0, 2313.0, 2139.0, 1899.0, 1752.0, 1606.0, 1512.0, 1258.0, 1234.0, 1093.0, 1030.0, 935.0, 842.0, 830.0, 725.0, 691.0, 681.0, 620.0, 620.0, 604.0, 611.0, 583.0, 598.0, 537.0, 594.0, 543.0, 621.0, 534.0, 607.0, 547.0, 588.0, 618.0, 622.0, 575.0, 632.0, 617.0, 629.0, 654.0, 662.0, 658.0, 689.0, 709.0, 670.0, 730.0, 735.0, 825.0], [251.0, 251.0, 301.0, 338.0, 456.0, 503.0, 552.0, 653.0, 776.0, 818.0, 866.0, 902.0, 976.0, 1064.0, 1112.0, 1129.0, 1190.0, 1109.0, 1199.0, 1228.0, 1176.0, 1235.0, 1209.0, 1214.0, 1179.0, 1253.0, 1150.0, 1162.0, 1095.0, 1032.0, 1038.0, 992.0, 1001.0, 937.0, 968.0, 932.0, 937.0, 995.0, 1018.0, 954.0, 955.0, 962.0, 1059.0, 1085.0, 1115.0, 1270.0, 1393.0, 1592.0, 1955.0], [164.0, 83.0, 64.0, 53.0, 55.0, 69.0, 68.0, 68.0, 71.0, 83.0, 86.0, 97.0, 118.0, 140.0, 144.0, 183.0, 228.0, 223.0, 286.0, 261.0, 308.0, 393.0, 405.0, 429.0, 507.0, 539.0, 646.0, 686.0, 766.0, 841.0, 885.0, 1035.0, 1075.0, 1164.0, 1290.0, 1376.0, 1401.0, 1558.0, 1628.0, 1783.0, 1980.0, 2054.0, 2141.0, 2268.0, 2300.0, 2476.0, 2806.0, 3163.0, 3930.0], [204.0, 79.0, 54.0, 47.0, 26.0, 32.0, 27.0, 25.0, 25.0, 29.0, 27.0, 29.0, 39.0, 22.0, 20.0, 34.0, 38.0, 41.0, 44.0, 42.0, 55.0, 41.0, 48.0, 65.0, 86.0, 84.0, 98.0, 120.0, 109.0, 123.0, 159.0, 165.0, 211.0, 248.0, 297.0, 301.0, 434.0, 499.0, 586.0, 715.0, 809.0, 1047.0, 1339.0, 1590.0, 2107.0, 2832.0, 3880.0, 5397.0, 8475.0], [309.0, 86.0, 45.0, 31.0, 37.0, 35.0, 22.0, 21.0, 17.0, 15.0, 12.0, 14.0, 15.0, 11.0, 20.0, 8.0, 10.0, 16.0, 11.0, 17.0, 24.0, 25.0, 15.0, 14.0, 28.0, 27.0, 38.0, 29.0, 29.0, 46.0, 26.0, 33.0, 45.0, 59.0, 70.0, 78.0, 80.0, 99.0, 125.0, 154.0, 193.0, 222.0, 326.0, 452.0, 617.0, 925.0, 1514.0, 2864.0, 6923.0], [605.0, 126.0, 48.0, 32.0, 32.0, 17.0, 19.0, 16.0, 11.0, 13.0, 14.0, 8.0, 6.0, 13.0, 14.0, 11.0, 14.0, 10.0, 12.0, 14.0, 10.0, 14.0, 17.0, 15.0, 11.0, 5.0, 14.0, 12.0, 19.0, 17.0, 14.0, 20.0, 20.0, 25.0, 18.0, 30.0, 28.0, 32.0, 35.0, 59.0, 67.0, 68.0, 87.0, 118.0, 174.0, 283.0, 481.0, 922.0, 2890.0], [1092.0, 278.0, 117.0, 44.0, 25.0, 15.0, 14.0, 15.0, 7.0, 14.0, 1.0, 8.0, 4.0, 11.0, 8.0, 10.0, 6.0, 5.0, 6.0, 7.0, 6.0, 11.0, 10.0, 9.0, 8.0, 19.0, 5.0, 16.0, 9.0, 11.0, 9.0, 8.0, 13.0, 22.0, 15.0, 14.0, 19.0, 23.0, 17.0, 24.0, 26.0, 31.0, 38.0, 36.0, 63.0, 99.0, 167.0, 344.0, 1203.0], [2039.0, 626.0, 250.0, 117.0, 39.0, 26.0, 15.0, 26.0, 14.0, 13.0, 5.0, 6.0, 3.0, 6.0, 8.0, 8.0, 2.0, 4.0, 4.0, 2.0, 9.0, 2.0, 4.0, 5.0, 11.0, 7.0, 10.0, 7.0, 9.0, 11.0, 11.0, 5.0, 7.0, 9.0, 11.0, 13.0, 8.0, 13.0, 15.0, 9.0, 14.0, 25.0, 32.0, 27.0, 37.0, 44.0, 80.0, 115.0, 432.0], [3037.0, 1187.0, 580.0, 238.0, 131.0, 79.0, 50.0, 33.0, 29.0, 17.0, 6.0, 11.0, 7.0, 9.0, 4.0, 9.0, 4.0, 7.0, 7.0, 6.0, 7.0, 2.0, 6.0, 5.0, 3.0, 4.0, 4.0, 6.0, 4.0, 4.0, 2.0, 4.0, 9.0, 3.0, 9.0, 8.0, 10.0, 14.0, 10.0, 4.0, 11.0, 16.0, 16.0, 17.0, 24.0, 31.0, 48.0, 67.0, 234.0], [4212.0, 1952.0, 1075.0, 552.0, 337.0, 216.0, 123.0, 89.0, 57.0, 53.0, 24.0, 23.0, 22.0, 10.0, 12.0, 16.0, 7.0, 8.0, 3.0, 7.0, 4.0, 7.0, 3.0, 2.0, 4.0, 7.0, 7.0, 5.0, 2.0, 6.0, 3.0, 5.0, 13.0, 3.0, 4.0, 5.0, 4.0, 5.0, 9.0, 9.0, 9.0, 11.0, 9.0, 15.0, 19.0, 23.0, 20.0, 45.0, 120.0], [4535.0, 2689.0, 1727.0, 1135.0, 747.0, 473.0, 312.0, 214.0, 192.0, 109.0, 90.0, 85.0, 57.0, 35.0, 34.0, 31.0, 15.0, 13.0, 17.0, 13.0, 8.0, 9.0, 7.0, 5.0, 3.0, 4.0, 4.0, 2.0, 6.0, 3.0, 6.0, 2.0, 4.0, 4.0, 4.0, 10.0, 8.0, 6.0, 5.0, 5.0, 9.0, 8.0, 10.0, 11.0, 13.0, 12.0, 19.0, 33.0, 73.0], [4294.0, 3046.0, 2196.0, 1561.0, 1179.0, 853.0, 669.0, 528.0, 408.0, 309.0, 247.0, 198.0, 170.0, 112.0, 89.0, 73.0, 52.0, 48.0, 42.0, 34.0, 17.0, 23.0, 15.0, 12.0, 13.0, 12.0, 4.0, 11.0, 6.0, 5.0, 3.0, 6.0, 8.0, 8.0, 8.0, 7.0, 7.0, 2.0, 4.0, 4.0, 4.0, 2.0, 6.0, 8.0, 15.0, 13.0, 19.0, 29.0, 56.0], [3496.0, 2690.0, 2436.0, 1836.0, 1494.0, 1294.0, 998.0, 857.0, 698.0, 616.0, 496.0, 401.0, 359.0, 271.0, 220.0, 195.0, 166.0, 135.0, 94.0, 88.0, 85.0, 72.0, 54.0, 46.0, 32.0, 33.0, 23.0, 20.0, 17.0, 14.0, 17.0, 10.0, 10.0, 9.0, 11.0, 5.0, 4.0, 2.0, 4.0, 5.0, 10.0, 10.0, 6.0, 10.0, 8.0, 7.0, 15.0, 17.0, 46.0], [2475.0, 2138.0, 2026.0, 1815.0, 1606.0, 1399.0, 1233.0, 1109.0, 989.0, 880.0, 773.0, 662.0, 577.0, 507.0, 414.0, 389.0, 315.0, 308.0, 276.0, 243.0, 191.0, 168.0, 141.0, 128.0, 120.0, 96.0, 80.0, 63.0, 49.0, 55.0, 56.0, 29.0, 37.0, 29.0, 26.0, 19.0, 10.0, 13.0, 11.0, 13.0, 10.0, 5.0, 4.0, 6.0, 8.0, 9.0, 14.0, 14.0, 33.0], [1711.0, 1667.0, 1514.0, 1486.0, 1408.0, 1315.0, 1230.0, 1088.0, 1063.0, 1011.0, 910.0, 820.0, 756.0, 743.0, 635.0, 565.0, 531.0, 451.0, 413.0, 426.0, 355.0, 321.0, 275.0, 238.0, 234.0, 196.0, 178.0, 170.0, 143.0, 119.0, 112.0, 101.0, 91.0, 65.0, 55.0, 48.0, 37.0, 30.0, 30.0, 18.0, 23.0, 23.0, 18.0, 12.0, 14.0, 11.0, 17.0, 16.0, 27.0], [1068.0, 1044.0, 1077.0, 1062.0, 1039.0, 1073.0, 1004.0, 947.0, 955.0, 931.0, 895.0, 890.0, 821.0, 799.0, 771.0, 717.0, 700.0, 612.0, 599.0, 544.0, 556.0, 493.0, 499.0, 468.0, 411.0, 401.0, 358.0, 309.0, 290.0, 245.0, 246.0, 226.0, 172.0, 173.0, 161.0, 149.0, 128.0, 107.0, 91.0, 82.0, 69.0, 55.0, 47.0, 40.0, 39.0, 26.0, 21.0, 20.0, 30.0], [699.0, 776.0, 754.0, 741.0, 717.0, 780.0, 684.0, 754.0, 753.0, 728.0, 770.0, 783.0, 729.0, 770.0, 733.0, 713.0, 731.0, 698.0, 628.0, 644.0, 662.0, 588.0, 579.0, 575.0, 603.0, 524.0, 497.0, 497.0, 471.0, 418.0, 384.0, 399.0, 355.0, 343.0, 310.0, 273.0, 242.0, 241.0, 230.0, 192.0, 153.0, 136.0, 152.0, 101.0, 84.0, 87.0, 74.0, 54.0, 45.0], [424.0, 446.0, 453.0, 421.0, 510.0, 504.0, 542.0, 522.0, 558.0, 577.0, 545.0, 574.0, 583.0, 656.0, 647.0, 637.0, 614.0, 630.0, 617.0, 661.0, 645.0, 664.0, 624.0, 603.0, 625.0, 626.0, 621.0, 580.0, 624.0, 581.0, 536.0, 588.0, 528.0, 492.0, 515.0, 478.0, 427.0, 443.0, 351.0, 383.0, 369.0, 309.0, 306.0, 243.0, 240.0, 203.0, 166.0, 138.0, 124.0], [348.0, 367.0, 336.0, 342.0, 365.0, 385.0, 354.0, 368.0, 355.0, 349.0, 395.0, 374.0, 410.0, 411.0, 449.0, 410.0, 447.0, 462.0, 524.0, 481.0, 453.0, 554.0, 574.0, 583.0, 588.0, 582.0, 633.0, 581.0, 652.0, 614.0, 654.0, 641.0, 608.0, 676.0, 643.0, 640.0, 664.0, 635.0, 595.0, 597.0, 571.0, 541.0, 508.0, 519.0, 481.0, 406.0, 378.0, 362.0, 276.0], [327.0, 313.0, 230.0, 211.0, 230.0, 256.0, 243.0, 263.0, 272.0, 266.0, 268.0, 255.0, 265.0, 304.0, 332.0, 327.0, 367.0, 345.0, 348.0, 374.0, 383.0, 353.0, 405.0, 393.0, 427.0, 457.0, 472.0, 514.0, 482.0, 565.0, 581.0, 584.0, 637.0, 659.0, 655.0, 684.0, 714.0, 736.0, 738.0, 749.0, 742.0, 747.0, 763.0, 803.0, 795.0, 768.0, 755.0, 734.0, 695.0], [207.0, 219.0, 236.0, 240.0, 214.0, 183.0, 162.0, 206.0, 191.0, 179.0, 190.0, 196.0, 213.0, 236.0, 207.0, 226.0, 245.0, 206.0, 246.0, 236.0, 266.0, 242.0, 274.0, 286.0, 326.0, 346.0, 369.0, 407.0, 366.0, 427.0, 490.0, 484.0, 534.0, 521.0, 582.0, 634.0, 646.0, 702.0, 716.0, 766.0, 829.0, 888.0, 912.0, 970.0, 990.0, 1096.0, 1160.0, 1247.0, 1230.0], [198.0, 317.0, 248.0, 193.0, 143.0, 81.0, 100.0, 106.0, 103.0, 156.0, 155.0, 146.0, 113.0, 152.0, 158.0, 156.0, 159.0, 162.0, 164.0, 192.0, 213.0, 213.0, 218.0, 232.0, 245.0, 250.0, 260.0, 281.0, 277.0, 302.0, 316.0, 324.0, 374.0, 383.0, 487.0, 478.0, 560.0, 603.0, 656.0, 630.0, 743.0, 826.0, 905.0, 1038.0, 1166.0, 1327.0, 1515.0, 1742.0, 1958.0], [263.0, 182.0, 180.0, 145.0, 125.0, 233.0, 250.0, 211.0, 115.0, 115.0, 92.0, 116.0, 158.0, 112.0, 151.0, 139.0, 127.0, 148.0, 148.0, 126.0, 136.0, 119.0, 136.0, 157.0, 138.0, 111.0, 142.0, 158.0, 167.0, 187.0, 216.0, 255.0, 244.0, 271.0, 308.0, 290.0, 363.0, 397.0, 434.0, 515.0, 594.0, 656.0, 779.0, 968.0, 1119.0, 1305.0, 1637.0, 2046.0, 2683.0], [281.0, 165.0, 93.0, 125.0, 100.0, 88.0, 71.0, 90.0, 148.0, 88.0, 96.0, 127.0, 117.0, 130.0, 117.0, 118.0, 94.0, 89.0, 73.0, 68.0, 81.0, 130.0, 161.0, 79.0, 92.0, 89.0, 117.0, 107.0, 102.0, 178.0, 150.0, 151.0, 175.0, 193.0, 197.0, 237.0, 213.0, 222.0, 289.0, 367.0, 377.0, 506.0, 543.0, 677.0, 911.0, 1154.0, 1465.0, 2145.0, 3190.0], [143.0, 52.0, 140.0, 114.0, 113.0, 146.0, 114.0, 159.0, 111.0, 135.0, 151.0, 201.0, 184.0, 142.0, 107.0, 99.0, 93.0, 69.0, 75.0, 138.0, 103.0, 149.0, 87.0, 68.0, 99.0, 120.0, 186.0, 114.0, 47.0, 94.0, 107.0, 76.0, 99.0, 151.0, 126.0, 79.0, 129.0, 227.0, 245.0, 209.0, 223.0, 366.0, 345.0, 477.0, 583.0, 870.0, 1221.0, 1810.0, 3150.0], [129.0, 113.0, 144.0, 119.0, 130.0, 91.0, 158.0, 74.0, 80.0, 131.0, 157.0, 183.0, 128.0, 187.0, 152.0, 131.0, 121.0, 134.0, 122.0, 87.0, 58.0, 94.0, 116.0, 140.0, 62.0, 51.0, 75.0, 125.0, 134.0, 104.0, 107.0, 54.0, 102.0, 89.0, 88.0, 95.0, 203.0, 131.0, 114.0, 96.0, 159.0, 187.0, 191.0, 270.0, 382.0, 519.0, 883.0, 1330.0, 2672.0], [128.0, 114.0, 183.0, 116.0, 53.0, 139.0, 139.0, 200.0, 137.0, 20.0, 89.0, 73.0, 137.0, 67.0, 107.0, 137.0, 120.0, 81.0, 104.0, 143.0, 75.0, 66.0, 108.0, 56.0, 96.0, 76.0, 78.0, 30.0, 86.0, 97.0, 91.0, 77.0, 71.0, 57.0, 75.0, 146.0, 131.0, 138.0, 125.0, 114.0, 103.0, 140.0, 116.0, 131.0, 211.0, 278.0, 517.0, 971.0, 2075.0], [49.0, 101.0, 65.0, 86.0, 154.0, 115.0, 98.0, 116.0, 102.0, 184.0, 105.0, 189.0, 136.0, 48.0, 44.0, 91.0, 106.0, 157.0, 127.0, 98.0, 107.0, 109.0, 91.0, 153.0, 68.0, 59.0, 116.0, 67.0, 61.0, 87.0, 117.0, 67.0, 63.0, 54.0, 78.0, 126.0, 65.0, 35.0, 66.0, 77.0, 76.0, 84.0, 104.0, 149.0, 102.0, 249.0, 318.0, 682.0, 1535.0], [212.0, 215.0, 130.0, 133.0, 138.0, 218.0, 88.0, 171.0, 163.0, 105.0, 67.0, 83.0, 102.0, 144.0, 78.0, 95.0, 110.0, 60.0, 46.0, 27.0, 48.0, 119.0, 104.0, 110.0, 75.0, 25.0, 54.0, 106.0, 76.0, 101.0, 143.0, 78.0, 39.0, 53.0, 64.0, 117.0, 75.0, 83.0, 53.0, 86.0, 57.0, 69.0, 76.0, 86.0, 95.0, 164.0, 182.0, 285.0, 894.0], [123.0, 79.0, 97.0, 99.0, 97.0, 103.0, 127.0, 167.0, 158.0, 82.0, 164.0, 105.0, 150.0, 130.0, 113.0, 76.0, 131.0, 57.0, 54.0, 50.0, 137.0, 141.0, 86.0, 46.0, 31.0, 69.0, 133.0, 119.0, 84.0, 80.0, 66.0, 47.0, 72.0, 52.0, 24.0, 170.0, 125.0, 103.0, 46.0, 43.0, 29.0, 22.0, 100.0, 51.0, 78.0, 165.0, 189.0, 224.0, 585.0], [120.0, 142.0, 50.0, 101.0, 85.0, 69.0, 142.0, 76.0, 123.0, 92.0, 47.0, 91.0, 39.0, 55.0, 64.0, 75.0, 27.0, 105.0, 61.0, 63.0, 78.0, 110.0, 79.0, 97.0, 56.0, 98.0, 101.0, 24.0, 71.0, 139.0, 96.0, 67.0, 126.0, 166.0, 154.0, 71.0, 53.0, 112.0, 72.0, 109.0, 73.0, 69.0, 109.0, 52.0, 91.0, 66.0, 70.0, 151.0, 342.0], [119.0, 82.0, 57.0, 48.0, 73.0, 85.0, 21.0, 58.0, 46.0, 78.0, 68.0, 55.0, 59.0, 161.0, 65.0, 36.0, 44.0, 75.0, 56.0, 112.0, 89.0, 50.0, 71.0, 81.0, 94.0, 52.0, 32.0, 58.0, 79.0, 34.0, 111.0, 28.0, 24.0, 10.0, 91.0, 75.0, 54.0, 53.0, 34.0, 125.0, 106.0, 68.0, 73.0, 169.0, 119.0, 86.0, 118.0, 112.0, 197.0], [102.0, 81.0, 95.0, 125.0, 51.0, 93.0, 110.0, 59.0, 55.0, 65.0, 17.0, 64.0, 69.0, 83.0, 99.0, 57.0, 39.0, 32.0, 108.0, 67.0, 92.0, 101.0, 86.0, 74.0, 135.0, 103.0, 75.0, 75.0, 81.0, 83.0, 100.0, 68.0, 40.0, 71.0, 57.0, 8.0, 62.0, 77.0, 82.0, 24.0, 60.0, 82.0, 22.0, 42.0, 54.0, 77.0, 49.0, 91.0, 137.0], [99.0, 49.0, 65.0, 91.0, 92.0, 69.0, 41.0, 82.0, 66.0, 29.0, 96.0, 87.0, 116.0, 29.0, 59.0, 26.0, 52.0, 58.0, 43.0, 65.0, 69.0, 30.0, 1.0, 64.0, 126.0, 73.0, 12.0, 56.0, 87.0, 83.0, 103.0, 42.0, 71.0, 43.0, 45.0, 43.0, 38.0, 35.0, 66.0, 27.0, 23.0, 66.0, 62.0, 35.0, 63.0, 18.0, 26.0, 41.0, 71.0], [128.0, 86.0, 64.0, 42.0, 38.0, 23.0, 102.0, 101.0, 56.0, 69.0, 53.0, 40.0, 7.0, 30.0, 76.0, 29.0, 33.0, 36.0, 59.0, 5.0, 13.0, 94.0, 64.0, 66.0, 68.0, 45.0, 62.0, 38.0, 70.0, 59.0, 40.0, 65.0, 22.0, 46.0, 47.0, 59.0, 57.0, 116.0, 66.0, 41.0, 39.0, 140.0, 131.0, 24.0, 0.0, 46.0, 47.0, 8.0, 68.0], [128.0, 37.0, 22.0, 42.0, 55.0, 44.0, 31.0, 53.0, 83.0, 52.0, 28.0, 67.0, 60.0, 37.0, 79.0, 62.0, 26.0, 3.0, 39.0, 31.0, 32.0, 16.0, 16.0, 8.0, 35.0, 13.0, 43.0, 27.0, 44.0, 22.0, 87.0, 64.0, 30.0, 22.0, 56.0, 42.0, 31.0, 61.0, 25.0, 60.0, 13.0, 0.0, 0.0, 27.0, 50.0, 30.0, 29.0, 40.0, 78.0], [30.0, 18.0, 41.0, 44.0, 58.0, 87.0, 57.0, 74.0, 154.0, 49.0, 63.0, 31.0, 23.0, 40.0, 42.0, 2.0, 27.0, 57.0, 20.0, 42.0, 20.0, 95.0, 40.0, 15.0, 0.0, 48.0, 21.0, 27.0, 35.0, 14.0, 63.0, 100.0, 27.0, 2.0, 12.0, 50.0, 10.0, 1.0, 15.0, 43.0, 33.0, 43.0, 12.0, 34.0, 15.0, 2.0, 43.0, 7.0, 39.0], [51.0, 24.0, 100.0, 73.0, 84.0, 86.0, 7.0, 22.0, 53.0, 1.0, 56.0, 30.0, 62.0, 52.0, 7.0, 130.0, 86.0, 62.0, 28.0, 27.0, 65.0, 4.0, 68.0, 26.0, 2.0, 0.0, 1.0, 3.0, 41.0, 50.0, 26.0, 24.0, 18.0, 29.0, 32.0, 46.0, 32.0, 33.0, 9.0, 19.0, 0.0, 9.0, 57.0, 41.0, 14.0, 19.0, 20.0, 16.0, 73.0], [46.0, 27.0, 24.0, 29.0, 42.0, 40.0, 23.0, 25.0, 39.0, 27.0, 21.0, 23.0, 18.0, 18.0, 15.0, 0.0, 0.0, 13.0, 11.0, 29.0, 28.0, 17.0, 33.0, 51.0, 12.0, 23.0, 9.0, 17.0, 1.0, 19.0, 4.0, 34.0, 14.0, 1.0, 33.0, 14.0, 0.0, 21.0, 16.0, 13.0, 24.0, 1.0, 8.0, 31.0, 61.0, 46.0, 31.0, 36.0, 26.0], [47.0, 33.0, 39.0, 6.0, 45.0, 13.0, 25.0, 2.0, 5.0, 25.0, 2.0, 0.0, 6.0, 38.0, 5.0, 18.0, 7.0, 0.0, 23.0, 1.0, 0.0, 11.0, 14.0, 0.0, 0.0, 2.0, 0.0, 6.0, 19.0, 0.0, 0.0, 0.0, 0.0, 6.0, 50.0, 16.0, 0.0, 19.0, 28.0, 2.0, 52.0, 19.0, 11.0, 13.0, 26.0, 23.0, 2.0, 7.0, 29.0], [16.0, 38.0, 5.0, 11.0, 28.0, 6.0, 8.0, 1.0, 1.0, 8.0, 16.0, 0.0, 0.0, 22.0, 49.0, 25.0, 24.0, 24.0, 29.0, 39.0, 5.0, 23.0, 1.0, 22.0, 38.0, 12.0, 21.0, 5.0, 1.0, 24.0, 0.0, 0.0, 37.0, 12.0, 0.0, 0.0, 33.0, 15.0, 43.0, 22.0, 7.0, 0.0, 18.0, 27.0, 24.0, 5.0, 0.0, 0.0, 4.0], [68.0, 45.0, 9.0, 7.0, 7.0, 4.0, 38.0, 39.0, 38.0, 11.0, 22.0, 23.0, 5.0, 36.0, 12.0, 36.0, 46.0, 54.0, 8.0, 0.0, 56.0, 40.0, 0.0, 12.0, 51.0, 11.0, 1.0, 0.0, 14.0, 28.0, 7.0, 0.0, 0.0, 0.0, 0.0, 0.0, 36.0, 12.0, 21.0, 25.0, 3.0, 0.0, 23.0, 1.0, 0.0, 0.0, 26.0, 25.0, 1.0], [30.0, 26.0, 41.0, 6.0, 27.0, 21.0, 16.0, 14.0, 11.0, 1.0, 1.0, 12.0, 12.0, 17.0, 31.0, 26.0, 0.0, 1.0, 24.0, 22.0, 20.0, 6.0, 0.0, 0.0, 21.0, 7.0, 20.0, 0.0, 0.0, 1.0, 0.0, 0.0, 0.0, 0.0, 0.0, 0.0, 0.0, 0.0, 0.0, 3.0, 22.0, 0.0, 1.0, 15.0, 10.0, 0.0, 19.0, 7.0, 1.0], [21.0, 16.0, 9.0, 4.0, 6.0, 4.0, 5.0, 1.0, 0.0, 21.0, 4.0, 20.0, 22.0, 7.0, 0.0, 1.0, 0.0, 0.0, 0.0, 0.0, 0.0, 24.0, 24.0, 0.0, 0.0, 24.0, 1.0, 0.0, 27.0, 45.0, 0.0, 0.0, 0.0, 0.0, 0.0, 0.0, 0.0, 1.0, 16.0, 8.0, 1.0, 0.0, 0.0, 18.0, 7.0, 1.0, 0.0, 0.0, 4.0]],
    "Name": "sCurve-0",
    "Overflow": 2524865.0,
    "Type": "Histo2d",
    "Underflow": 0.0,
    "x": {
        "AxisTitle": "Vcal",
        "Bins": 51,
        "High": 302.5,
        "Low": 47.5
    },
    "y": {
        "AxisTitle": "Occupancy",
        "Bins": 49,
        "High": 49.5,
        "Low": 0.5
    },
    "z": {
        "AxisTitle": "Number of pixels"
    }
}