{
    "Data": [0.0, 0.0, 0.0, 0.0, 0.0, 0.0, 0.0, 0.0, 0.0, 0.0, 0.0, 0.0, 0.0, 1.0, 2.0, 3.0, 2.0, 6.0, 7.0, 3.0, 7.0, 4.0, 3.0, 0.0, 20.0, 1.0, 2.0, 10.0, 11.0, 21.0, 7.0, 41.0, 11.0, 26.0, 48.0, 7.0, 15.0, 35.0, 3.0, 36.0, 0.0, 0.0, 2.0, 9.0, 1.0, 4.0, 25.0, 6.0, 8.0, 47.0, 10.0],
    "Name": "Scurve-110-96",
    "Overflow": 0.0,
    "Type": "Histo1d",
    "Underflow": 0.0,
    "x": {
        "AxisTitle": "Vcal",
        "Bins": 51,
        "High": 302.5,
        "Low": 47.5
    },
    "y": {
        "AxisTitle": "Occupancy"
    },
    "z": {
        "AxisTitle": "z"
    }
}