time,Hardware,Voltage,Current
1626719835525,high-voltage-2,1,0.310718
time,Hardware,Voltage,Current
1626719835525,high-voltage-2,2,0.392999
time,Hardware,Voltage,Current
1626719835525,high-voltage-2,3,0.44535
time,Hardware,Voltage,Current
1626719835525,high-voltage-2,4,0.48611
time,Hardware,Voltage,Current
1626719835525,high-voltage-2,5,0.516711
time,Hardware,Voltage,Current
1626719835525,high-voltage-2,6,0.547992
time,Hardware,Voltage,Current
1626719835525,high-voltage-2,7,0.575244
time,Hardware,Voltage,Current
1626719835525,high-voltage-2,8,0.602135
time,Hardware,Voltage,Current
1626719835525,high-voltage-2,9,0.627308
time,Hardware,Voltage,Current
1626719835525,high-voltage-2,10,0.653778
time,Hardware,Voltage,Current
1626719835525,high-voltage-2,11,0.677098
time,Hardware,Voltage,Current
1626719835525,high-voltage-2,12,0.702785
time,Hardware,Voltage,Current
1626719835525,high-voltage-2,13,0.727709
time,Hardware,Voltage,Current
1626719835525,high-voltage-2,14,0.751225
time,Hardware,Voltage,Current
1626719835525,high-voltage-2,15,0.776201
time,Hardware,Voltage,Current
1626719835525,high-voltage-2,16,0.799638
time,Hardware,Voltage,Current
1626719835525,high-voltage-2,17,0.824789
time,Hardware,Voltage,Current
1626719835525,high-voltage-2,18,0.846988
time,Hardware,Voltage,Current
1626719835525,high-voltage-2,19,0.872733
time,Hardware,Voltage,Current
1626719835525,high-voltage-2,20,0.894589
time,Hardware,Voltage,Current
1626719835525,high-voltage-2,25,0.981449
time,Hardware,Voltage,Current
1626719835525,high-voltage-2,30,1.07117
time,Hardware,Voltage,Current
1626719835525,high-voltage-2,35,1.16415
time,Hardware,Voltage,Current
1626719835525,high-voltage-2,40,1.27244
time,Hardware,Voltage,Current
1626719835525,high-voltage-2,45,1.40511
time,Hardware,Voltage,Current
1626719835525,high-voltage-2,50,1.50118
time,Hardware,Voltage,Current
1626719835525,high-voltage-2,55,1.5898
time,Hardware,Voltage,Current
1626719835525,high-voltage-2,60,1.67461
time,Hardware,Voltage,Current
1626719835525,high-voltage-2,65,1.75752
time,Hardware,Voltage,Current
1626719835525,high-voltage-2,70,1.8359
time,Hardware,Voltage,Current
1626719835525,high-voltage-2,75,1.91093
time,Hardware,Voltage,Current
1626719835525,high-voltage-2,80,1.98224
time,Hardware,Voltage,Current
1626719835525,high-voltage-2,85,2.05191
time,Hardware,Voltage,Current
1626719835525,high-voltage-2,90,2.12145
time,Hardware,Voltage,Current
1626719835525,high-voltage-2,95,2.18545
time,Hardware,Voltage,Current
1626719835525,high-voltage-2,100,2.24779
