time,Hardware,Voltage,Current
1626386551655,high-voltage-3,1,0.0508234
time,Hardware,Voltage,Current
1626386551655,high-voltage-3,2,0.0558025
time,Hardware,Voltage,Current
1626386551655,high-voltage-3,3,0.0602123
time,Hardware,Voltage,Current
1626386551655,high-voltage-3,4,0.0645312
time,Hardware,Voltage,Current
1626386551655,high-voltage-3,5,0.0670816
time,Hardware,Voltage,Current
1626386551655,high-voltage-3,6,0.0693377
time,Hardware,Voltage,Current
1626386551655,high-voltage-3,7,0.0719513
time,Hardware,Voltage,Current
1626386551655,high-voltage-3,8,0.0735655
time,Hardware,Voltage,Current
1626386551655,high-voltage-3,9,0.0757735
time,Hardware,Voltage,Current
1626386551655,high-voltage-3,10,0.0770569
time,Hardware,Voltage,Current
1626386551655,high-voltage-3,11,0.0798716
time,Hardware,Voltage,Current
1626386551655,high-voltage-3,12,0.0837251
time,Hardware,Voltage,Current
1626386551655,high-voltage-3,13,0.084834
time,Hardware,Voltage,Current
1626386551655,high-voltage-3,14,0.0870117
time,Hardware,Voltage,Current
1626386551655,high-voltage-3,15,0.0905427
time,Hardware,Voltage,Current
1626386551655,high-voltage-3,16,0.0928562
time,Hardware,Voltage,Current
1626386551655,high-voltage-3,17,0.0942879
time,Hardware,Voltage,Current
1626386551655,high-voltage-3,18,0.0970342
time,Hardware,Voltage,Current
1626386551655,high-voltage-3,19,0.0988157
time,Hardware,Voltage,Current
1626386551655,high-voltage-3,20,0.099838
time,Hardware,Voltage,Current
1626386551655,high-voltage-3,25,0.109077
time,Hardware,Voltage,Current
1626386551655,high-voltage-3,30,0.115688
time,Hardware,Voltage,Current
1626386551655,high-voltage-3,35,0.123057
time,Hardware,Voltage,Current
1626386551655,high-voltage-3,40,0.129256
time,Hardware,Voltage,Current
1626386551655,high-voltage-3,45,0.135106
time,Hardware,Voltage,Current
1626386551655,high-voltage-3,50,0.143099
time,Hardware,Voltage,Current
1626386551655,high-voltage-3,55,0.149387
time,Hardware,Voltage,Current
1626386551655,high-voltage-3,60,0.155432
time,Hardware,Voltage,Current
1626386551655,high-voltage-3,65,0.162605
time,Hardware,Voltage,Current
1626386551655,high-voltage-3,70,0.172289
time,Hardware,Voltage,Current
1626386551655,high-voltage-3,75,0.18218
time,Hardware,Voltage,Current
1626386551655,high-voltage-3,80,0.191015
time,Hardware,Voltage,Current
1626386551655,high-voltage-3,85,0.199691
time,Hardware,Voltage,Current
1626386551655,high-voltage-3,90,0.209362
time,Hardware,Voltage,Current
1626386551655,high-voltage-3,95,0.218171
time,Hardware,Voltage,Current
1626386551655,high-voltage-3,100,0.224796
