{
    "Data": [0.0, 55809.0, 16071.0, 4340.0, 76.0, 2.0, 0.0, 0.0, 0.0, 0.0, 0.0],
    "Name": "StatusDist-0",
    "Overflow": 0.0,
    "Type": "Histo1d",
    "Underflow": 0.0,
    "x": {
        "AxisTitle": "Fit Status ",
        "Bins": 11,
        "High": 10.5,
        "Low": -0.5
    },
    "y": {
        "AxisTitle": "Number of Pixels"
    },
    "z": {
        "AxisTitle": "z"
    }
}