time,Hardware,Voltage,Current
1621474823267,high-voltage-2,1,0.258502
time,Hardware,Voltage,Current
1621474823267,high-voltage-2,2,0.298389
time,Hardware,Voltage,Current
1621474823267,high-voltage-2,3,0.321689
time,Hardware,Voltage,Current
1621474823267,high-voltage-2,4,0.342557
time,Hardware,Voltage,Current
1621474823267,high-voltage-2,5,0.366193
time,Hardware,Voltage,Current
1621474823267,high-voltage-2,6,0.393538
time,Hardware,Voltage,Current
1621474823267,high-voltage-2,7,0.42184
time,Hardware,Voltage,Current
1621474823267,high-voltage-2,8,0.455357
time,Hardware,Voltage,Current
1621474823267,high-voltage-2,9,0.491156
time,Hardware,Voltage,Current
1621474823267,high-voltage-2,10,0.526501
time,Hardware,Voltage,Current
1621474823267,high-voltage-2,11,0.566317
time,Hardware,Voltage,Current
1621474823267,high-voltage-2,12,0.60401
time,Hardware,Voltage,Current
1621474823267,high-voltage-2,13,0.644825
time,Hardware,Voltage,Current
1621474823267,high-voltage-2,14,0.681965
time,Hardware,Voltage,Current
1621474823267,high-voltage-2,15,0.7223
time,Hardware,Voltage,Current
1621474823267,high-voltage-2,16,0.760026
time,Hardware,Voltage,Current
1621474823267,high-voltage-2,17,0.795033
time,Hardware,Voltage,Current
1621474823267,high-voltage-2,18,0.823895
time,Hardware,Voltage,Current
1621474823267,high-voltage-2,19,0.849252
time,Hardware,Voltage,Current
1621474823267,high-voltage-2,20,0.872363
time,Hardware,Voltage,Current
1621474823267,high-voltage-2,25,0.978795
time,Hardware,Voltage,Current
1621474823267,high-voltage-2,30,1.07672
time,Hardware,Voltage,Current
1621474823267,high-voltage-2,35,1.16884
time,Hardware,Voltage,Current
1621474823267,high-voltage-2,40,1.27432
time,Hardware,Voltage,Current
1621474823267,high-voltage-2,45,1.4025
time,Hardware,Voltage,Current
1621474823267,high-voltage-2,50,1.49046
time,Hardware,Voltage,Current
1621474823267,high-voltage-2,55,1.57182
time,Hardware,Voltage,Current
1621474823267,high-voltage-2,60,1.6463
time,Hardware,Voltage,Current
1621474823267,high-voltage-2,65,1.72446
time,Hardware,Voltage,Current
1621474823267,high-voltage-2,70,1.79641
time,Hardware,Voltage,Current
1621474823267,high-voltage-2,75,1.86591
time,Hardware,Voltage,Current
1621474823267,high-voltage-2,80,1.93348
time,Hardware,Voltage,Current
1621474823267,high-voltage-2,85,1.99966
time,Hardware,Voltage,Current
1621474823267,high-voltage-2,90,2.06384
time,Hardware,Voltage,Current
1621474823267,high-voltage-2,95,2.12902
time,Hardware,Voltage,Current
1621474823267,high-voltage-2,100,2.19153
