{
    "Data": [[2881.0, 1234.0, 686.0, 478.0, 365.0, 260.0, 198.0, 158.0, 118.0, 141.0, 110.0, 88.0, 79.0, 46.0, 50.0, 63.0, 47.0, 30.0, 40.0, 37.0, 32.0, 33.0, 19.0, 15.0, 23.0, 24.0, 13.0, 20.0, 22.0, 16.0, 12.0, 14.0, 12.0, 9.0, 16.0, 12.0, 14.0, 18.0, 17.0, 13.0, 9.0, 19.0, 12.0, 12.0, 8.0, 10.0, 12.0, 5.0, 15.0], [3617.0, 1690.0, 1057.0, 766.0, 515.0, 467.0, 343.0, 311.0, 260.0, 220.0, 168.0, 150.0, 135.0, 122.0, 120.0, 93.0, 100.0, 64.0, 92.0, 78.0, 69.0, 59.0, 53.0, 45.0, 49.0, 45.0, 40.0, 32.0, 30.0, 30.0, 25.0, 28.0, 24.0, 14.0, 21.0, 20.0, 18.0, 27.0, 12.0, 11.0, 21.0, 23.0, 14.0, 11.0, 13.0, 23.0, 26.0, 22.0, 18.0], [3834.0, 2161.0, 1408.0, 1085.0, 841.0, 726.0, 555.0, 468.0, 399.0, 371.0, 318.0, 273.0, 263.0, 226.0, 203.0, 170.0, 152.0, 159.0, 145.0, 137.0, 118.0, 119.0, 128.0, 98.0, 97.0, 86.0, 68.0, 56.0, 57.0, 82.0, 67.0, 48.0, 55.0, 47.0, 59.0, 43.0, 36.0, 37.0, 36.0, 24.0, 36.0, 28.0, 26.0, 29.0, 22.0, 19.0, 32.0, 44.0, 40.0], [4259.0, 2227.0, 1576.0, 1274.0, 1000.0, 837.0, 798.0, 665.0, 604.0, 519.0, 484.0, 435.0, 375.0, 335.0, 320.0, 307.0, 318.0, 264.0, 228.0, 215.0, 216.0, 201.0, 182.0, 154.0, 172.0, 150.0, 143.0, 140.0, 135.0, 128.0, 122.0, 99.0, 89.0, 88.0, 112.0, 89.0, 76.0, 74.0, 96.0, 70.0, 84.0, 79.0, 72.0, 58.0, 48.0, 55.0, 57.0, 51.0, 49.0], [6444.0, 2962.0, 1853.0, 1448.0, 1114.0, 1018.0, 806.0, 706.0, 668.0, 670.0, 612.0, 556.0, 556.0, 495.0, 433.0, 463.0, 427.0, 380.0, 367.0, 355.0, 340.0, 329.0, 313.0, 288.0, 257.0, 243.0, 288.0, 277.0, 187.0, 222.0, 220.0, 184.0, 186.0, 173.0, 178.0, 186.0, 158.0, 154.0, 171.0, 153.0, 133.0, 140.0, 132.0, 141.0, 138.0, 112.0, 107.0, 129.0, 106.0], [7651.0, 4741.0, 3170.0, 2386.0, 1781.0, 1452.0, 1228.0, 985.0, 878.0, 819.0, 688.0, 648.0, 654.0, 575.0, 556.0, 494.0, 523.0, 498.0, 484.0, 469.0, 487.0, 408.0, 405.0, 422.0, 390.0, 399.0, 380.0, 359.0, 375.0, 320.0, 326.0, 320.0, 289.0, 294.0, 309.0, 296.0, 291.0, 261.0, 244.0, 290.0, 222.0, 233.0, 228.0, 255.0, 251.0, 265.0, 269.0, 261.0, 268.0], [3773.0, 3454.0, 3157.0, 2828.0, 2479.0, 2240.0, 2028.0, 1871.0, 1659.0, 1630.0, 1351.0, 1188.0, 1129.0, 1020.0, 951.0, 845.0, 795.0, 763.0, 694.0, 613.0, 700.0, 630.0, 599.0, 577.0, 566.0, 500.0, 514.0, 504.0, 455.0, 483.0, 443.0, 465.0, 457.0, 477.0, 461.0, 450.0, 419.0, 456.0, 442.0, 405.0, 399.0, 437.0, 412.0, 474.0, 431.0, 440.0, 482.0, 506.0, 600.0], [1120.0, 1065.0, 1114.0, 1200.0, 1225.0, 1315.0, 1392.0, 1468.0, 1418.0, 1482.0, 1387.0, 1367.0, 1382.0, 1345.0, 1411.0, 1318.0, 1352.0, 1245.0, 1267.0, 1154.0, 1174.0, 1135.0, 1097.0, 1081.0, 1042.0, 978.0, 947.0, 866.0, 805.0, 862.0, 791.0, 844.0, 706.0, 745.0, 722.0, 689.0, 685.0, 693.0, 734.0, 733.0, 701.0, 684.0, 671.0, 689.0, 714.0, 740.0, 782.0, 967.0, 1076.0], [530.0, 369.0, 328.0, 359.0, 361.0, 385.0, 433.0, 439.0, 472.0, 534.0, 555.0, 606.0, 650.0, 658.0, 719.0, 788.0, 808.0, 888.0, 931.0, 977.0, 939.0, 1015.0, 1078.0, 1128.0, 1146.0, 1200.0, 1142.0, 1186.0, 1261.0, 1192.0, 1245.0, 1299.0, 1302.0, 1269.0, 1351.0, 1340.0, 1256.0, 1307.0, 1314.0, 1318.0, 1331.0, 1309.0, 1296.0, 1270.0, 1445.0, 1401.0, 1508.0, 1612.0, 1911.0], [436.0, 202.0, 155.0, 169.0, 122.0, 137.0, 170.0, 130.0, 149.0, 190.0, 186.0, 174.0, 225.0, 235.0, 226.0, 240.0, 283.0, 293.0, 342.0, 355.0, 359.0, 410.0, 403.0, 474.0, 472.0, 533.0, 590.0, 628.0, 678.0, 744.0, 844.0, 863.0, 967.0, 1095.0, 1133.0, 1201.0, 1348.0, 1423.0, 1494.0, 1613.0, 1791.0, 1916.0, 2036.0, 2299.0, 2451.0, 2629.0, 3049.0, 3398.0, 4225.0], [395.0, 153.0, 106.0, 105.0, 76.0, 81.0, 66.0, 67.0, 74.0, 79.0, 83.0, 74.0, 97.0, 91.0, 104.0, 103.0, 116.0, 124.0, 139.0, 148.0, 155.0, 168.0, 144.0, 180.0, 197.0, 202.0, 230.0, 234.0, 237.0, 285.0, 303.0, 376.0, 425.0, 485.0, 451.0, 514.0, 621.0, 741.0, 759.0, 924.0, 1076.0, 1297.0, 1495.0, 1872.0, 2157.0, 2776.0, 3641.0, 5062.0, 7334.0], [362.0, 137.0, 100.0, 62.0, 67.0, 51.0, 47.0, 33.0, 41.0, 49.0, 38.0, 54.0, 41.0, 41.0, 43.0, 48.0, 46.0, 58.0, 66.0, 63.0, 63.0, 82.0, 83.0, 69.0, 101.0, 90.0, 128.0, 113.0, 135.0, 134.0, 158.0, 171.0, 204.0, 219.0, 214.0, 237.0, 290.0, 325.0, 385.0, 406.0, 507.0, 602.0, 681.0, 916.0, 1163.0, 1563.0, 2349.0, 3738.0, 7742.0], [496.0, 159.0, 77.0, 59.0, 42.0, 44.0, 22.0, 30.0, 25.0, 31.0, 27.0, 32.0, 25.0, 36.0, 33.0, 37.0, 34.0, 27.0, 28.0, 36.0, 35.0, 37.0, 31.0, 39.0, 31.0, 52.0, 53.0, 53.0, 56.0, 83.0, 71.0, 98.0, 93.0, 100.0, 115.0, 116.0, 137.0, 181.0, 186.0, 224.0, 261.0, 307.0, 371.0, 509.0, 603.0, 820.0, 1234.0, 2118.0, 5222.0], [648.0, 178.0, 108.0, 54.0, 39.0, 37.0, 30.0, 25.0, 19.0, 17.0, 19.0, 21.0, 20.0, 22.0, 14.0, 16.0, 23.0, 28.0, 32.0, 21.0, 27.0, 14.0, 25.0, 22.0, 19.0, 22.0, 31.0, 33.0, 16.0, 36.0, 33.0, 41.0, 30.0, 60.0, 60.0, 54.0, 58.0, 78.0, 82.0, 106.0, 154.0, 155.0, 208.0, 281.0, 352.0, 518.0, 734.0, 1221.0, 3135.0], [957.0, 261.0, 95.0, 47.0, 42.0, 40.0, 38.0, 24.0, 22.0, 16.0, 19.0, 17.0, 12.0, 9.0, 19.0, 16.0, 13.0, 11.0, 14.0, 13.0, 15.0, 14.0, 21.0, 13.0, 16.0, 12.0, 22.0, 15.0, 18.0, 22.0, 23.0, 28.0, 25.0, 21.0, 24.0, 30.0, 32.0, 33.0, 49.0, 63.0, 46.0, 82.0, 90.0, 122.0, 193.0, 259.0, 409.0, 771.0, 1900.0], [1431.0, 412.0, 170.0, 89.0, 47.0, 41.0, 26.0, 19.0, 16.0, 13.0, 18.0, 12.0, 18.0, 18.0, 13.0, 17.0, 17.0, 13.0, 11.0, 18.0, 11.0, 9.0, 15.0, 13.0, 15.0, 13.0, 12.0, 7.0, 11.0, 18.0, 21.0, 5.0, 12.0, 18.0, 18.0, 18.0, 25.0, 21.0, 19.0, 36.0, 41.0, 43.0, 47.0, 64.0, 94.0, 127.0, 207.0, 442.0, 1182.0], [2030.0, 709.0, 342.0, 167.0, 90.0, 56.0, 30.0, 29.0, 17.0, 19.0, 15.0, 11.0, 18.0, 11.0, 5.0, 10.0, 8.0, 12.0, 12.0, 10.0, 17.0, 11.0, 12.0, 7.0, 13.0, 14.0, 11.0, 5.0, 15.0, 12.0, 11.0, 10.0, 17.0, 10.0, 14.0, 8.0, 17.0, 17.0, 13.0, 15.0, 18.0, 23.0, 40.0, 25.0, 47.0, 56.0, 96.0, 228.0, 700.0], [2620.0, 1174.0, 622.0, 339.0, 155.0, 117.0, 82.0, 44.0, 30.0, 28.0, 24.0, 18.0, 12.0, 10.0, 15.0, 15.0, 7.0, 10.0, 7.0, 3.0, 11.0, 8.0, 7.0, 8.0, 11.0, 9.0, 11.0, 9.0, 8.0, 13.0, 8.0, 6.0, 10.0, 8.0, 5.0, 15.0, 7.0, 21.0, 9.0, 24.0, 17.0, 7.0, 25.0, 15.0, 34.0, 38.0, 59.0, 104.0, 368.0], [3083.0, 1552.0, 1036.0, 604.0, 372.0, 238.0, 150.0, 122.0, 105.0, 62.0, 48.0, 28.0, 23.0, 17.0, 24.0, 12.0, 16.0, 12.0, 10.0, 10.0, 8.0, 8.0, 4.0, 7.0, 9.0, 10.0, 5.0, 9.0, 12.0, 6.0, 10.0, 4.0, 6.0, 9.0, 7.0, 7.0, 10.0, 7.0, 9.0, 11.0, 8.0, 8.0, 20.0, 16.0, 24.0, 28.0, 37.0, 70.0, 208.0], [3293.0, 1890.0, 1345.0, 901.0, 668.0, 444.0, 331.0, 275.0, 189.0, 140.0, 99.0, 89.0, 66.0, 55.0, 39.0, 29.0, 25.0, 14.0, 24.0, 18.0, 20.0, 17.0, 11.0, 13.0, 7.0, 8.0, 8.0, 5.0, 5.0, 5.0, 3.0, 7.0, 8.0, 10.0, 3.0, 5.0, 4.0, 10.0, 7.0, 4.0, 5.0, 10.0, 6.0, 13.0, 16.0, 20.0, 36.0, 51.0, 130.0], [3419.0, 2077.0, 1596.0, 1196.0, 928.0, 731.0, 573.0, 440.0, 383.0, 299.0, 248.0, 197.0, 163.0, 128.0, 99.0, 79.0, 88.0, 76.0, 43.0, 34.0, 36.0, 31.0, 26.0, 23.0, 20.0, 22.0, 5.0, 15.0, 6.0, 12.0, 6.0, 7.0, 5.0, 7.0, 8.0, 6.0, 7.0, 4.0, 6.0, 5.0, 6.0, 3.0, 10.0, 14.0, 6.0, 9.0, 17.0, 26.0, 99.0], [3493.0, 2104.0, 1604.0, 1347.0, 1115.0, 947.0, 808.0, 703.0, 548.0, 496.0, 401.0, 329.0, 293.0, 237.0, 203.0, 187.0, 143.0, 116.0, 95.0, 89.0, 89.0, 78.0, 55.0, 42.0, 40.0, 38.0, 32.0, 21.0, 23.0, 20.0, 11.0, 16.0, 8.0, 7.0, 12.0, 11.0, 4.0, 8.0, 8.0, 6.0, 4.0, 4.0, 9.0, 4.0, 10.0, 14.0, 14.0, 17.0, 69.0], [3127.0, 2094.0, 1679.0, 1415.0, 1174.0, 1028.0, 949.0, 826.0, 775.0, 688.0, 595.0, 536.0, 472.0, 426.0, 362.0, 304.0, 296.0, 254.0, 233.0, 204.0, 191.0, 151.0, 123.0, 118.0, 122.0, 93.0, 77.0, 72.0, 64.0, 56.0, 49.0, 22.0, 26.0, 26.0, 20.0, 22.0, 14.0, 9.0, 8.0, 13.0, 12.0, 13.0, 9.0, 7.0, 9.0, 12.0, 13.0, 21.0, 44.0], [2604.0, 1892.0, 1545.0, 1405.0, 1240.0, 1086.0, 1027.0, 895.0, 880.0, 767.0, 728.0, 636.0, 638.0, 575.0, 509.0, 460.0, 453.0, 437.0, 386.0, 335.0, 304.0, 297.0, 261.0, 250.0, 189.0, 210.0, 161.0, 135.0, 139.0, 113.0, 124.0, 92.0, 63.0, 73.0, 60.0, 51.0, 45.0, 32.0, 46.0, 25.0, 36.0, 27.0, 16.0, 18.0, 15.0, 17.0, 15.0, 18.0, 36.0], [1931.0, 1484.0, 1332.0, 1235.0, 1111.0, 994.0, 963.0, 927.0, 927.0, 832.0, 839.0, 691.0, 674.0, 679.0, 657.0, 659.0, 571.0, 562.0, 541.0, 494.0, 460.0, 442.0, 418.0, 395.0, 352.0, 342.0, 299.0, 279.0, 233.0, 260.0, 224.0, 199.0, 163.0, 142.0, 140.0, 137.0, 113.0, 97.0, 98.0, 80.0, 73.0, 55.0, 49.0, 46.0, 35.0, 44.0, 24.0, 29.0, 31.0], [1205.0, 990.0, 971.0, 893.0, 859.0, 867.0, 827.0, 806.0, 795.0, 804.0, 736.0, 744.0, 687.0, 694.0, 679.0, 709.0, 639.0, 669.0, 631.0, 578.0, 597.0, 591.0, 568.0, 543.0, 513.0, 503.0, 514.0, 426.0, 402.0, 393.0, 394.0, 342.0, 335.0, 312.0, 294.0, 235.0, 222.0, 222.0, 213.0, 184.0, 192.0, 139.0, 130.0, 106.0, 99.0, 85.0, 75.0, 77.0, 75.0], [731.0, 531.0, 552.0, 545.0, 553.0, 603.0, 551.0, 626.0, 606.0, 615.0, 608.0, 610.0, 643.0, 629.0, 658.0, 627.0, 633.0, 627.0, 671.0, 658.0, 663.0, 625.0, 614.0, 612.0, 634.0, 583.0, 636.0, 545.0, 567.0, 543.0, 561.0, 545.0, 502.0, 489.0, 479.0, 442.0, 419.0, 411.0, 413.0, 396.0, 342.0, 297.0, 295.0, 243.0, 236.0, 220.0, 191.0, 176.0, 151.0], [499.0, 337.0, 307.0, 322.0, 323.0, 321.0, 317.0, 351.0, 357.0, 435.0, 421.0, 477.0, 471.0, 447.0, 461.0, 522.0, 498.0, 536.0, 559.0, 558.0, 586.0, 555.0, 600.0, 623.0, 641.0, 653.0, 591.0, 630.0, 636.0, 656.0, 650.0, 624.0, 652.0, 630.0, 642.0, 629.0, 643.0, 584.0, 578.0, 534.0, 552.0, 548.0, 539.0, 515.0, 496.0, 435.0, 399.0, 369.0, 375.0], [361.0, 178.0, 150.0, 152.0, 164.0, 185.0, 192.0, 206.0, 216.0, 209.0, 219.0, 270.0, 287.0, 254.0, 326.0, 333.0, 339.0, 351.0, 390.0, 425.0, 427.0, 419.0, 469.0, 474.0, 502.0, 496.0, 525.0, 606.0, 590.0, 639.0, 646.0, 684.0, 650.0, 696.0, 733.0, 777.0, 759.0, 799.0, 800.0, 786.0, 767.0, 762.0, 805.0, 828.0, 744.0, 760.0, 768.0, 794.0, 752.0], [317.0, 136.0, 102.0, 84.0, 97.0, 105.0, 99.0, 88.0, 105.0, 93.0, 146.0, 153.0, 146.0, 172.0, 156.0, 183.0, 205.0, 207.0, 237.0, 232.0, 265.0, 265.0, 318.0, 280.0, 347.0, 374.0, 401.0, 445.0, 512.0, 488.0, 527.0, 516.0, 603.0, 561.0, 648.0, 712.0, 740.0, 753.0, 806.0, 911.0, 904.0, 1017.0, 991.0, 1099.0, 1056.0, 1139.0, 1330.0, 1267.0, 1363.0], [314.0, 156.0, 101.0, 55.0, 58.0, 43.0, 49.0, 57.0, 45.0, 48.0, 70.0, 71.0, 56.0, 63.0, 81.0, 86.0, 99.0, 105.0, 136.0, 139.0, 132.0, 129.0, 140.0, 161.0, 190.0, 221.0, 257.0, 271.0, 274.0, 320.0, 385.0, 350.0, 402.0, 436.0, 480.0, 533.0, 571.0, 656.0, 717.0, 786.0, 874.0, 932.0, 1071.0, 1243.0, 1334.0, 1434.0, 1594.0, 1857.0, 2187.0], [285.0, 109.0, 73.0, 45.0, 62.0, 55.0, 38.0, 32.0, 50.0, 39.0, 51.0, 35.0, 38.0, 39.0, 27.0, 41.0, 49.0, 49.0, 58.0, 59.0, 72.0, 71.0, 76.0, 90.0, 105.0, 114.0, 134.0, 145.0, 180.0, 193.0, 206.0, 202.0, 245.0, 306.0, 297.0, 324.0, 420.0, 430.0, 512.0, 591.0, 643.0, 762.0, 865.0, 1102.0, 1328.0, 1522.0, 1739.0, 2236.0, 3057.0], [323.0, 112.0, 61.0, 61.0, 43.0, 27.0, 13.0, 10.0, 17.0, 16.0, 16.0, 14.0, 32.0, 26.0, 34.0, 24.0, 19.0, 18.0, 17.0, 26.0, 20.0, 27.0, 32.0, 44.0, 53.0, 53.0, 63.0, 72.0, 66.0, 85.0, 114.0, 102.0, 132.0, 131.0, 167.0, 192.0, 223.0, 243.0, 284.0, 372.0, 435.0, 571.0, 648.0, 785.0, 1005.0, 1277.0, 1809.0, 2446.0, 3454.0], [341.0, 103.0, 54.0, 49.0, 39.0, 27.0, 18.0, 17.0, 40.0, 15.0, 31.0, 34.0, 13.0, 7.0, 13.0, 13.0, 33.0, 25.0, 19.0, 46.0, 28.0, 32.0, 21.0, 22.0, 17.0, 35.0, 51.0, 34.0, 37.0, 44.0, 46.0, 62.0, 80.0, 80.0, 86.0, 98.0, 147.0, 133.0, 142.0, 176.0, 217.0, 285.0, 360.0, 499.0, 709.0, 907.0, 1302.0, 2075.0, 3575.0], [282.0, 88.0, 56.0, 38.0, 34.0, 27.0, 18.0, 29.0, 46.0, 17.0, 14.0, 37.0, 43.0, 32.0, 18.0, 29.0, 16.0, 26.0, 7.0, 6.0, 7.0, 7.0, 11.0, 8.0, 23.0, 11.0, 10.0, 5.0, 21.0, 12.0, 19.0, 42.0, 49.0, 46.0, 41.0, 39.0, 54.0, 63.0, 74.0, 88.0, 145.0, 163.0, 209.0, 264.0, 413.0, 584.0, 898.0, 1571.0, 3061.0], [322.0, 125.0, 66.0, 74.0, 35.0, 36.0, 19.0, 18.0, 11.0, 10.0, 11.0, 11.0, 9.0, 7.0, 9.0, 8.0, 11.0, 10.0, 21.0, 13.0, 34.0, 44.0, 11.0, 40.0, 19.0, 9.0, 5.0, 11.0, 21.0, 4.0, 11.0, 6.0, 10.0, 7.0, 28.0, 12.0, 21.0, 27.0, 22.0, 35.0, 59.0, 69.0, 103.0, 162.0, 209.0, 305.0, 587.0, 1068.0, 2398.0], [291.0, 107.0, 64.0, 25.0, 29.0, 54.0, 22.0, 30.0, 24.0, 32.0, 14.0, 7.0, 25.0, 15.0, 5.0, 14.0, 9.0, 4.0, 8.0, 5.0, 10.0, 27.0, 7.0, 4.0, 13.0, 20.0, 3.0, 22.0, 30.0, 8.0, 4.0, 3.0, 4.0, 7.0, 7.0, 6.0, 8.0, 5.0, 18.0, 4.0, 15.0, 18.0, 35.0, 76.0, 112.0, 164.0, 303.0, 657.0, 1690.0], [290.0, 76.0, 59.0, 50.0, 26.0, 23.0, 20.0, 20.0, 15.0, 10.0, 4.0, 10.0, 9.0, 8.0, 23.0, 20.0, 13.0, 5.0, 6.0, 3.0, 17.0, 18.0, 8.0, 7.0, 11.0, 24.0, 3.0, 3.0, 4.0, 6.0, 3.0, 23.0, 10.0, 1.0, 2.0, 24.0, 6.0, 2.0, 4.0, 5.0, 4.0, 10.0, 15.0, 24.0, 35.0, 92.0, 161.0, 365.0, 1122.0], [252.0, 113.0, 64.0, 59.0, 58.0, 27.0, 21.0, 19.0, 13.0, 11.0, 30.0, 15.0, 8.0, 7.0, 6.0, 9.0, 8.0, 7.0, 43.0, 18.0, 11.0, 11.0, 2.0, 5.0, 24.0, 13.0, 12.0, 38.0, 8.0, 5.0, 2.0, 14.0, 23.0, 30.0, 14.0, 3.0, 1.0, 4.0, 3.0, 4.0, 20.0, 10.0, 8.0, 14.0, 56.0, 27.0, 75.0, 183.0, 639.0], [295.0, 107.0, 63.0, 54.0, 27.0, 22.0, 17.0, 14.0, 44.0, 33.0, 14.0, 15.0, 8.0, 16.0, 8.0, 6.0, 8.0, 5.0, 13.0, 28.0, 1.0, 26.0, 14.0, 7.0, 5.0, 17.0, 20.0, 4.0, 1.0, 0.0, 8.0, 5.0, 3.0, 12.0, 14.0, 16.0, 11.0, 1.0, 1.0, 3.0, 2.0, 1.0, 4.0, 4.0, 3.0, 18.0, 40.0, 81.0, 368.0], [262.0, 89.0, 49.0, 44.0, 30.0, 40.0, 12.0, 16.0, 15.0, 10.0, 22.0, 21.0, 8.0, 12.0, 11.0, 18.0, 24.0, 29.0, 6.0, 17.0, 19.0, 6.0, 15.0, 27.0, 22.0, 4.0, 6.0, 4.0, 7.0, 7.0, 8.0, 25.0, 4.0, 33.0, 19.0, 16.0, 9.0, 1.0, 2.0, 4.0, 4.0, 16.0, 11.0, 0.0, 4.0, 5.0, 20.0, 32.0, 202.0], [282.0, 106.0, 59.0, 87.0, 56.0, 29.0, 25.0, 13.0, 13.0, 14.0, 10.0, 9.0, 11.0, 9.0, 10.0, 5.0, 7.0, 5.0, 9.0, 5.0, 6.0, 8.0, 5.0, 4.0, 2.0, 7.0, 6.0, 5.0, 7.0, 4.0, 2.0, 7.0, 24.0, 1.0, 2.0, 3.0, 4.0, 3.0, 21.0, 5.0, 2.0, 0.0, 0.0, 0.0, 2.0, 4.0, 9.0, 19.0, 107.0], [266.0, 85.0, 53.0, 47.0, 26.0, 28.0, 25.0, 42.0, 14.0, 35.0, 31.0, 8.0, 6.0, 9.0, 13.0, 12.0, 7.0, 4.0, 11.0, 12.0, 2.0, 4.0, 3.0, 4.0, 15.0, 15.0, 3.0, 3.0, 4.0, 28.0, 16.0, 14.0, 5.0, 3.0, 2.0, 2.0, 2.0, 5.0, 7.0, 14.0, 15.0, 0.0, 0.0, 17.0, 10.0, 5.0, 26.0, 10.0, 42.0], [297.0, 89.0, 53.0, 40.0, 43.0, 22.0, 22.0, 17.0, 11.0, 14.0, 10.0, 10.0, 13.0, 11.0, 14.0, 8.0, 3.0, 4.0, 20.0, 23.0, 2.0, 9.0, 7.0, 4.0, 8.0, 12.0, 22.0, 6.0, 2.0, 16.0, 17.0, 3.0, 2.0, 5.0, 3.0, 1.0, 3.0, 0.0, 0.0, 1.0, 1.0, 5.0, 45.0, 3.0, 2.0, 1.0, 4.0, 5.0, 24.0], [280.0, 92.0, 56.0, 32.0, 24.0, 22.0, 18.0, 12.0, 14.0, 11.0, 8.0, 14.0, 8.0, 6.0, 12.0, 12.0, 7.0, 5.0, 12.0, 30.0, 9.0, 7.0, 5.0, 27.0, 9.0, 13.0, 24.0, 3.0, 2.0, 3.0, 1.0, 2.0, 4.0, 3.0, 23.0, 5.0, 0.0, 3.0, 2.0, 1.0, 13.0, 15.0, 2.0, 2.0, 8.0, 18.0, 1.0, 4.0, 16.0], [260.0, 106.0, 52.0, 30.0, 20.0, 25.0, 19.0, 16.0, 11.0, 13.0, 9.0, 10.0, 19.0, 26.0, 7.0, 6.0, 6.0, 21.0, 37.0, 10.0, 9.0, 13.0, 6.0, 9.0, 25.0, 4.0, 3.0, 5.0, 3.0, 6.0, 2.0, 2.0, 3.0, 4.0, 6.0, 21.0, 2.0, 1.0, 6.0, 2.0, 0.0, 4.0, 3.0, 1.0, 1.0, 0.0, 1.0, 5.0, 23.0], [287.0, 98.0, 71.0, 47.0, 26.0, 22.0, 16.0, 13.0, 14.0, 15.0, 18.0, 12.0, 14.0, 29.0, 8.0, 3.0, 6.0, 4.0, 2.0, 14.0, 9.0, 6.0, 8.0, 6.0, 5.0, 5.0, 7.0, 8.0, 2.0, 4.0, 5.0, 2.0, 2.0, 1.0, 2.0, 20.0, 6.0, 1.0, 5.0, 1.0, 3.0, 3.0, 0.0, 2.0, 1.0, 3.0, 2.0, 2.0, 5.0], [296.0, 90.0, 44.0, 44.0, 22.0, 18.0, 18.0, 8.0, 12.0, 19.0, 16.0, 12.0, 7.0, 11.0, 12.0, 3.0, 7.0, 9.0, 7.0, 8.0, 9.0, 7.0, 2.0, 3.0, 10.0, 6.0, 7.0, 2.0, 3.0, 2.0, 2.0, 21.0, 11.0, 3.0, 4.0, 0.0, 3.0, 1.0, 3.0, 3.0, 0.0, 2.0, 2.0, 0.0, 1.0, 1.0, 0.0, 2.0, 1.0], [298.0, 92.0, 60.0, 50.0, 31.0, 21.0, 19.0, 15.0, 9.0, 12.0, 8.0, 15.0, 8.0, 9.0, 7.0, 12.0, 9.0, 9.0, 7.0, 9.0, 10.0, 10.0, 4.0, 4.0, 4.0, 4.0, 3.0, 19.0, 9.0, 3.0, 3.0, 5.0, 1.0, 3.0, 4.0, 4.0, 4.0, 3.0, 3.0, 0.0, 3.0, 2.0, 1.0, 0.0, 0.0, 2.0, 0.0, 3.0, 5.0], [284.0, 86.0, 57.0, 38.0, 23.0, 27.0, 14.0, 16.0, 12.0, 10.0, 12.0, 7.0, 11.0, 7.0, 10.0, 11.0, 8.0, 4.0, 8.0, 11.0, 6.0, 5.0, 5.0, 7.0, 7.0, 8.0, 4.0, 8.0, 4.0, 2.0, 3.0, 5.0, 1.0, 2.0, 4.0, 0.0, 4.0, 0.0, 2.0, 3.0, 1.0, 3.0, 0.0, 0.0, 3.0, 1.0, 1.0, 1.0, 1.0], [315.0, 118.0, 45.0, 34.0, 21.0, 44.0, 18.0, 19.0, 14.0, 10.0, 7.0, 15.0, 8.0, 7.0, 6.0, 10.0, 7.0, 12.0, 11.0, 8.0, 4.0, 5.0, 6.0, 5.0, 4.0, 5.0, 8.0, 5.0, 3.0, 10.0, 1.0, 5.0, 2.0, 4.0, 2.0, 1.0, 1.0, 1.0, 1.0, 2.0, 0.0, 2.0, 1.0, 3.0, 0.0, 1.0, 6.0, 0.0, 1.0]],
    "Name": "sCurve-0",
    "Overflow": 2526246.0,
    "Type": "Histo2d",
    "Underflow": 0.0,
    "x": {
        "AxisTitle": "Vcal",
        "Bins": 51,
        "High": 302.5,
        "Low": 47.5
    },
    "y": {
        "AxisTitle": "Occupancy",
        "Bins": 49,
        "High": 49.5,
        "Low": 0.5
    },
    "z": {
        "AxisTitle": "Number of pixels"
    }
}