{
    "Data": [433.0, 8914.0, 14782.0, 10437.0, 5406.0, 3060.0, 2318.0, 2469.0, 2682.0, 2701.0, 2466.0, 2081.0, 1603.0, 1128.0, 881.0, 596.0, 448.0, 317.0, 270.0, 246.0, 195.0, 215.0, 189.0, 202.0, 172.0, 209.0, 172.0, 187.0, 180.0, 185.0, 195.0, 139.0, 168.0, 172.0, 156.0, 156.0, 158.0, 130.0, 121.0, 121.0, 118.0, 144.0, 114.0, 92.0, 83.0, 100.0, 71.0, 60.0, 37.0, 66.0, 17.0],
    "Name": "Chi2Dist-0",
    "Overflow": 0.0,
    "Type": "Histo1d",
    "Underflow": 0.0,
    "x": {
        "AxisTitle": "Fit Chi/ndf",
        "Bins": 51,
        "High": 2.5250000953674318,
        "Low": -0.02500000037252903
    },
    "y": {
        "AxisTitle": "Number of Pixels"
    },
    "z": {
        "AxisTitle": "z"
    }
}