{
    "Data": [[2842.0, 938.0, 491.0, 281.0, 187.0, 165.0, 105.0, 91.0, 66.0, 60.0, 48.0, 48.0, 34.0, 25.0, 27.0, 23.0, 15.0, 17.0, 15.0, 13.0, 13.0, 12.0, 10.0, 11.0, 11.0, 11.0, 11.0, 6.0, 7.0, 9.0, 9.0, 9.0, 9.0, 6.0, 3.0, 8.0, 9.0, 8.0, 7.0, 5.0, 6.0, 4.0, 7.0, 6.0, 7.0, 10.0, 15.0, 16.0, 9.0], [4005.0, 1604.0, 851.0, 521.0, 380.0, 234.0, 199.0, 162.0, 117.0, 87.0, 74.0, 73.0, 48.0, 51.0, 45.0, 39.0, 22.0, 26.0, 36.0, 17.0, 23.0, 28.0, 16.0, 15.0, 9.0, 12.0, 12.0, 16.0, 11.0, 15.0, 9.0, 12.0, 4.0, 13.0, 7.0, 9.0, 11.0, 6.0, 7.0, 9.0, 11.0, 9.0, 7.0, 6.0, 10.0, 15.0, 11.0, 14.0, 15.0], [5067.0, 2512.0, 1454.0, 980.0, 687.0, 509.0, 367.0, 286.0, 238.0, 194.0, 166.0, 131.0, 96.0, 113.0, 74.0, 80.0, 65.0, 56.0, 51.0, 39.0, 46.0, 37.0, 30.0, 19.0, 19.0, 22.0, 20.0, 23.0, 17.0, 10.0, 14.0, 17.0, 18.0, 10.0, 17.0, 13.0, 12.0, 16.0, 24.0, 11.0, 10.0, 9.0, 11.0, 13.0, 21.0, 12.0, 11.0, 21.0, 28.0], [5284.0, 3127.0, 2124.0, 1468.0, 1140.0, 879.0, 770.0, 515.0, 447.0, 406.0, 314.0, 280.0, 232.0, 185.0, 173.0, 151.0, 115.0, 132.0, 81.0, 88.0, 60.0, 74.0, 71.0, 60.0, 48.0, 44.0, 39.0, 38.0, 29.0, 37.0, 21.0, 31.0, 31.0, 22.0, 22.0, 24.0, 13.0, 19.0, 26.0, 19.0, 23.0, 17.0, 23.0, 19.0, 19.0, 25.0, 28.0, 17.0, 30.0], [5619.0, 3133.0, 2248.0, 1888.0, 1542.0, 1310.0, 1094.0, 926.0, 797.0, 698.0, 618.0, 531.0, 475.0, 444.0, 329.0, 316.0, 301.0, 251.0, 231.0, 205.0, 164.0, 158.0, 142.0, 119.0, 123.0, 94.0, 96.0, 70.0, 88.0, 77.0, 47.0, 74.0, 56.0, 47.0, 57.0, 39.0, 44.0, 35.0, 33.0, 39.0, 30.0, 39.0, 27.0, 32.0, 32.0, 32.0, 38.0, 42.0, 49.0], [7474.0, 3838.0, 2633.0, 1933.0, 1671.0, 1443.0, 1195.0, 1179.0, 1067.0, 962.0, 830.0, 859.0, 692.0, 703.0, 603.0, 562.0, 483.0, 512.0, 414.0, 408.0, 365.0, 339.0, 270.0, 307.0, 279.0, 238.0, 239.0, 202.0, 196.0, 165.0, 172.0, 147.0, 147.0, 133.0, 115.0, 96.0, 81.0, 103.0, 82.0, 69.0, 63.0, 62.0, 73.0, 61.0, 68.0, 54.0, 44.0, 68.0, 75.0], [6453.0, 5144.0, 3991.0, 3178.0, 2563.0, 2106.0, 1713.0, 1521.0, 1305.0, 1145.0, 1050.0, 1023.0, 901.0, 853.0, 845.0, 783.0, 703.0, 689.0, 656.0, 639.0, 615.0, 566.0, 550.0, 493.0, 530.0, 435.0, 415.0, 421.0, 357.0, 352.0, 339.0, 344.0, 332.0, 296.0, 292.0, 243.0, 228.0, 211.0, 206.0, 185.0, 184.0, 172.0, 173.0, 132.0, 143.0, 108.0, 115.0, 123.0, 121.0], [1726.0, 1917.0, 2225.0, 2402.0, 2487.0, 2477.0, 2434.0, 2307.0, 2112.0, 2123.0, 1902.0, 1772.0, 1721.0, 1487.0, 1334.0, 1249.0, 1153.0, 1052.0, 1059.0, 992.0, 869.0, 860.0, 815.0, 795.0, 737.0, 677.0, 661.0, 642.0, 603.0, 607.0, 561.0, 593.0, 517.0, 521.0, 487.0, 460.0, 455.0, 485.0, 470.0, 406.0, 374.0, 374.0, 343.0, 364.0, 311.0, 262.0, 297.0, 284.0, 274.0], [598.0, 357.0, 363.0, 441.0, 542.0, 656.0, 730.0, 883.0, 945.0, 1050.0, 1250.0, 1265.0, 1471.0, 1396.0, 1553.0, 1583.0, 1522.0, 1592.0, 1580.0, 1588.0, 1595.0, 1597.0, 1531.0, 1522.0, 1520.0, 1413.0, 1388.0, 1321.0, 1280.0, 1235.0, 1169.0, 1122.0, 1056.0, 948.0, 920.0, 928.0, 844.0, 837.0, 843.0, 799.0, 728.0, 703.0, 673.0, 704.0, 677.0, 690.0, 621.0, 631.0, 633.0], [516.0, 236.0, 166.0, 134.0, 134.0, 126.0, 160.0, 175.0, 194.0, 218.0, 244.0, 293.0, 345.0, 374.0, 411.0, 477.0, 534.0, 577.0, 659.0, 679.0, 778.0, 915.0, 915.0, 994.0, 1058.0, 1194.0, 1324.0, 1341.0, 1385.0, 1529.0, 1620.0, 1665.0, 1637.0, 1697.0, 1786.0, 1818.0, 1870.0, 1826.0, 1773.0, 1883.0, 1793.0, 1716.0, 1679.0, 1693.0, 1648.0, 1513.0, 1532.0, 1442.0, 1492.0], [478.0, 195.0, 104.0, 101.0, 79.0, 74.0, 65.0, 78.0, 73.0, 87.0, 109.0, 88.0, 106.0, 107.0, 114.0, 134.0, 149.0, 177.0, 206.0, 218.0, 226.0, 234.0, 256.0, 280.0, 346.0, 351.0, 419.0, 438.0, 486.0, 600.0, 603.0, 733.0, 772.0, 892.0, 993.0, 1182.0, 1309.0, 1485.0, 1619.0, 1837.0, 1992.0, 2388.0, 2611.0, 2819.0, 3280.0, 3486.0, 3871.0, 4078.0, 4438.0], [494.0, 181.0, 99.0, 87.0, 57.0, 52.0, 44.0, 48.0, 48.0, 44.0, 53.0, 37.0, 44.0, 46.0, 54.0, 82.0, 53.0, 80.0, 71.0, 81.0, 100.0, 98.0, 101.0, 135.0, 134.0, 146.0, 186.0, 185.0, 201.0, 225.0, 228.0, 277.0, 305.0, 346.0, 406.0, 421.0, 504.0, 593.0, 690.0, 790.0, 928.0, 1159.0, 1482.0, 1688.0, 2282.0, 3075.0, 4069.0, 5615.0, 8798.0], [491.0, 176.0, 109.0, 70.0, 67.0, 49.0, 40.0, 46.0, 31.0, 39.0, 40.0, 31.0, 24.0, 27.0, 24.0, 30.0, 24.0, 32.0, 51.0, 44.0, 46.0, 43.0, 55.0, 50.0, 67.0, 91.0, 70.0, 94.0, 94.0, 99.0, 137.0, 155.0, 139.0, 179.0, 181.0, 213.0, 239.0, 285.0, 317.0, 365.0, 417.0, 544.0, 719.0, 866.0, 1117.0, 1545.0, 2198.0, 3730.0, 7997.0], [602.0, 179.0, 79.0, 66.0, 45.0, 43.0, 40.0, 37.0, 29.0, 24.0, 28.0, 26.0, 18.0, 20.0, 24.0, 22.0, 23.0, 29.0, 29.0, 30.0, 12.0, 23.0, 21.0, 26.0, 36.0, 46.0, 41.0, 44.0, 41.0, 63.0, 61.0, 72.0, 76.0, 74.0, 100.0, 120.0, 123.0, 152.0, 175.0, 188.0, 250.0, 311.0, 331.0, 520.0, 612.0, 841.0, 1293.0, 2228.0, 5291.0], [707.0, 195.0, 95.0, 69.0, 54.0, 40.0, 44.0, 36.0, 30.0, 18.0, 18.0, 19.0, 19.0, 15.0, 24.0, 19.0, 21.0, 14.0, 19.0, 17.0, 9.0, 15.0, 10.0, 20.0, 29.0, 28.0, 22.0, 16.0, 23.0, 30.0, 34.0, 42.0, 40.0, 47.0, 48.0, 61.0, 62.0, 72.0, 94.0, 94.0, 123.0, 185.0, 192.0, 268.0, 363.0, 454.0, 759.0, 1303.0, 3176.0], [1006.0, 287.0, 147.0, 74.0, 51.0, 30.0, 32.0, 41.0, 34.0, 22.0, 20.0, 16.0, 17.0, 25.0, 10.0, 18.0, 9.0, 13.0, 11.0, 8.0, 19.0, 8.0, 10.0, 17.0, 13.0, 14.0, 11.0, 17.0, 15.0, 27.0, 23.0, 26.0, 25.0, 19.0, 35.0, 30.0, 45.0, 42.0, 50.0, 63.0, 81.0, 103.0, 127.0, 154.0, 186.0, 313.0, 453.0, 744.0, 2178.0], [1418.0, 456.0, 197.0, 91.0, 87.0, 52.0, 37.0, 27.0, 31.0, 21.0, 27.0, 18.0, 21.0, 12.0, 16.0, 13.0, 10.0, 3.0, 11.0, 9.0, 15.0, 6.0, 12.0, 8.0, 8.0, 12.0, 17.0, 9.0, 11.0, 8.0, 17.0, 12.0, 22.0, 24.0, 31.0, 24.0, 25.0, 27.0, 34.0, 36.0, 46.0, 56.0, 67.0, 75.0, 132.0, 151.0, 265.0, 516.0, 1420.0], [1999.0, 708.0, 357.0, 224.0, 101.0, 74.0, 41.0, 32.0, 40.0, 15.0, 20.0, 15.0, 17.0, 18.0, 15.0, 17.0, 10.0, 7.0, 13.0, 8.0, 3.0, 9.0, 10.0, 7.0, 5.0, 13.0, 7.0, 7.0, 9.0, 11.0, 8.0, 7.0, 21.0, 9.0, 16.0, 12.0, 24.0, 26.0, 18.0, 30.0, 45.0, 32.0, 42.0, 58.0, 87.0, 99.0, 143.0, 324.0, 947.0], [2810.0, 1128.0, 642.0, 349.0, 217.0, 149.0, 89.0, 74.0, 62.0, 47.0, 31.0, 24.0, 22.0, 14.0, 9.0, 15.0, 17.0, 13.0, 11.0, 7.0, 6.0, 4.0, 4.0, 8.0, 7.0, 6.0, 11.0, 17.0, 5.0, 12.0, 7.0, 5.0, 5.0, 10.0, 18.0, 11.0, 9.0, 17.0, 19.0, 20.0, 28.0, 31.0, 29.0, 38.0, 49.0, 73.0, 111.0, 202.0, 550.0], [3260.0, 1689.0, 934.0, 610.0, 429.0, 277.0, 213.0, 149.0, 101.0, 63.0, 71.0, 59.0, 39.0, 36.0, 20.0, 14.0, 16.0, 18.0, 9.0, 6.0, 16.0, 7.0, 9.0, 5.0, 4.0, 5.0, 12.0, 8.0, 5.0, 5.0, 5.0, 7.0, 6.0, 5.0, 15.0, 11.0, 11.0, 15.0, 16.0, 14.0, 18.0, 14.0, 22.0, 28.0, 38.0, 60.0, 79.0, 136.0, 338.0], [3883.0, 2057.0, 1454.0, 940.0, 697.0, 515.0, 366.0, 301.0, 213.0, 174.0, 149.0, 106.0, 85.0, 76.0, 68.0, 45.0, 40.0, 37.0, 25.0, 18.0, 17.0, 15.0, 16.0, 9.0, 8.0, 9.0, 3.0, 8.0, 10.0, 9.0, 12.0, 10.0, 7.0, 8.0, 10.0, 11.0, 10.0, 11.0, 9.0, 14.0, 15.0, 14.0, 10.0, 18.0, 38.0, 36.0, 55.0, 95.0, 249.0], [4139.0, 2470.0, 1705.0, 1329.0, 967.0, 730.0, 632.0, 505.0, 414.0, 310.0, 267.0, 241.0, 173.0, 150.0, 134.0, 95.0, 96.0, 65.0, 61.0, 64.0, 43.0, 37.0, 26.0, 20.0, 29.0, 18.0, 21.0, 17.0, 20.0, 7.0, 6.0, 13.0, 10.0, 10.0, 12.0, 15.0, 2.0, 9.0, 9.0, 10.0, 5.0, 21.0, 18.0, 19.0, 26.0, 25.0, 43.0, 68.0, 179.0], [3670.0, 2505.0, 1964.0, 1547.0, 1226.0, 1015.0, 892.0, 704.0, 627.0, 558.0, 465.0, 376.0, 346.0, 281.0, 249.0, 235.0, 208.0, 191.0, 135.0, 121.0, 92.0, 93.0, 79.0, 71.0, 67.0, 49.0, 46.0, 35.0, 37.0, 38.0, 34.0, 32.0, 14.0, 12.0, 13.0, 21.0, 19.0, 14.0, 16.0, 14.0, 7.0, 18.0, 15.0, 13.0, 14.0, 32.0, 31.0, 59.0, 135.0], [2954.0, 2221.0, 1788.0, 1594.0, 1454.0, 1185.0, 1056.0, 959.0, 861.0, 775.0, 628.0, 646.0, 552.0, 498.0, 453.0, 390.0, 362.0, 322.0, 263.0, 247.0, 210.0, 226.0, 155.0, 163.0, 141.0, 138.0, 107.0, 94.0, 80.0, 68.0, 68.0, 73.0, 58.0, 54.0, 45.0, 38.0, 27.0, 38.0, 25.0, 32.0, 28.0, 22.0, 28.0, 23.0, 33.0, 25.0, 32.0, 60.0, 107.0], [2106.0, 1640.0, 1528.0, 1346.0, 1324.0, 1179.0, 1121.0, 1010.0, 966.0, 916.0, 900.0, 765.0, 669.0, 677.0, 689.0, 537.0, 487.0, 510.0, 470.0, 428.0, 380.0, 382.0, 330.0, 288.0, 274.0, 238.0, 238.0, 194.0, 198.0, 159.0, 168.0, 148.0, 130.0, 115.0, 114.0, 88.0, 93.0, 82.0, 81.0, 58.0, 48.0, 42.0, 51.0, 57.0, 50.0, 37.0, 48.0, 55.0, 101.0], [1328.0, 1055.0, 1089.0, 983.0, 1002.0, 940.0, 950.0, 873.0, 820.0, 900.0, 805.0, 772.0, 770.0, 788.0, 738.0, 690.0, 673.0, 630.0, 567.0, 536.0, 565.0, 547.0, 519.0, 497.0, 432.0, 415.0, 383.0, 397.0, 359.0, 363.0, 293.0, 299.0, 285.0, 242.0, 244.0, 205.0, 204.0, 189.0, 172.0, 139.0, 131.0, 108.0, 118.0, 97.0, 96.0, 82.0, 98.0, 83.0, 141.0], [850.0, 641.0, 537.0, 599.0, 615.0, 598.0, 639.0, 683.0, 641.0, 668.0, 690.0, 736.0, 708.0, 670.0, 711.0, 703.0, 680.0, 673.0, 725.0, 640.0, 642.0, 602.0, 629.0, 589.0, 598.0, 604.0, 550.0, 505.0, 500.0, 528.0, 481.0, 457.0, 396.0, 447.0, 432.0, 389.0, 347.0, 310.0, 328.0, 300.0, 275.0, 254.0, 232.0, 227.0, 245.0, 213.0, 173.0, 182.0, 225.0], [592.0, 324.0, 327.0, 310.0, 354.0, 348.0, 426.0, 352.0, 425.0, 438.0, 437.0, 461.0, 504.0, 539.0, 509.0, 570.0, 544.0, 593.0, 598.0, 574.0, 601.0, 597.0, 649.0, 631.0, 653.0, 606.0, 644.0, 619.0, 609.0, 671.0, 603.0, 589.0, 595.0, 606.0, 585.0, 581.0, 542.0, 521.0, 530.0, 531.0, 484.0, 492.0, 455.0, 432.0, 405.0, 390.0, 377.0, 373.0, 391.0], [424.0, 248.0, 171.0, 178.0, 179.0, 203.0, 178.0, 216.0, 221.0, 230.0, 247.0, 279.0, 311.0, 321.0, 357.0, 352.0, 343.0, 382.0, 420.0, 414.0, 448.0, 479.0, 488.0, 524.0, 529.0, 582.0, 584.0, 581.0, 577.0, 665.0, 674.0, 700.0, 667.0, 678.0, 684.0, 694.0, 693.0, 670.0, 748.0, 696.0, 684.0, 737.0, 677.0, 727.0, 670.0, 724.0, 715.0, 693.0, 751.0], [426.0, 202.0, 83.0, 95.0, 83.0, 84.0, 88.0, 107.0, 119.0, 120.0, 138.0, 146.0, 155.0, 159.0, 189.0, 200.0, 195.0, 225.0, 236.0, 282.0, 268.0, 341.0, 352.0, 341.0, 359.0, 409.0, 412.0, 430.0, 440.0, 567.0, 490.0, 547.0, 639.0, 652.0, 675.0, 709.0, 729.0, 776.0, 771.0, 814.0, 894.0, 911.0, 929.0, 951.0, 1034.0, 1035.0, 1122.0, 1129.0, 1289.0], [424.0, 164.0, 92.0, 76.0, 60.0, 55.0, 57.0, 57.0, 55.0, 61.0, 66.0, 60.0, 55.0, 76.0, 94.0, 87.0, 96.0, 101.0, 109.0, 142.0, 181.0, 183.0, 193.0, 203.0, 221.0, 226.0, 253.0, 244.0, 347.0, 328.0, 359.0, 407.0, 434.0, 447.0, 540.0, 509.0, 610.0, 660.0, 684.0, 767.0, 868.0, 940.0, 991.0, 1072.0, 1244.0, 1339.0, 1496.0, 1652.0, 2034.0], [393.0, 132.0, 93.0, 84.0, 40.0, 33.0, 33.0, 34.0, 24.0, 30.0, 36.0, 28.0, 45.0, 39.0, 53.0, 42.0, 61.0, 51.0, 57.0, 89.0, 75.0, 68.0, 90.0, 94.0, 104.0, 116.0, 151.0, 141.0, 167.0, 193.0, 207.0, 270.0, 263.0, 303.0, 317.0, 377.0, 392.0, 489.0, 515.0, 601.0, 740.0, 777.0, 909.0, 1052.0, 1250.0, 1433.0, 1623.0, 2068.0, 2736.0], [405.0, 159.0, 70.0, 50.0, 39.0, 42.0, 21.0, 39.0, 35.0, 42.0, 28.0, 33.0, 21.0, 15.0, 22.0, 22.0, 21.0, 30.0, 36.0, 30.0, 28.0, 35.0, 33.0, 49.0, 57.0, 48.0, 48.0, 69.0, 89.0, 109.0, 122.0, 131.0, 134.0, 168.0, 192.0, 205.0, 269.0, 306.0, 368.0, 423.0, 490.0, 590.0, 682.0, 764.0, 1018.0, 1220.0, 1645.0, 2145.0, 3217.0], [420.0, 140.0, 92.0, 38.0, 42.0, 35.0, 27.0, 16.0, 19.0, 12.0, 25.0, 11.0, 14.0, 9.0, 27.0, 20.0, 12.0, 14.0, 8.0, 7.0, 12.0, 37.0, 17.0, 23.0, 26.0, 36.0, 19.0, 28.0, 40.0, 32.0, 57.0, 60.0, 64.0, 78.0, 115.0, 136.0, 134.0, 168.0, 161.0, 243.0, 282.0, 354.0, 424.0, 599.0, 721.0, 935.0, 1321.0, 1963.0, 3192.0], [409.0, 141.0, 59.0, 57.0, 47.0, 43.0, 20.0, 19.0, 21.0, 14.0, 17.0, 14.0, 10.0, 20.0, 15.0, 7.0, 6.0, 10.0, 11.0, 21.0, 28.0, 11.0, 12.0, 8.0, 8.0, 16.0, 32.0, 13.0, 23.0, 24.0, 16.0, 18.0, 27.0, 34.0, 48.0, 48.0, 63.0, 64.0, 88.0, 117.0, 151.0, 197.0, 271.0, 334.0, 445.0, 678.0, 980.0, 1526.0, 2959.0], [364.0, 158.0, 81.0, 69.0, 43.0, 35.0, 23.0, 16.0, 10.0, 14.0, 11.0, 9.0, 11.0, 11.0, 9.0, 9.0, 8.0, 6.0, 5.0, 5.0, 7.0, 4.0, 4.0, 6.0, 6.0, 2.0, 7.0, 24.0, 11.0, 12.0, 10.0, 14.0, 5.0, 14.0, 18.0, 22.0, 40.0, 32.0, 38.0, 55.0, 77.0, 98.0, 154.0, 202.0, 264.0, 394.0, 692.0, 1110.0, 2396.0], [432.0, 163.0, 86.0, 45.0, 48.0, 30.0, 31.0, 15.0, 38.0, 12.0, 15.0, 7.0, 7.0, 11.0, 8.0, 33.0, 7.0, 2.0, 5.0, 5.0, 5.0, 4.0, 2.0, 3.0, 3.0, 3.0, 1.0, 7.0, 2.0, 1.0, 4.0, 6.0, 5.0, 22.0, 9.0, 37.0, 12.0, 28.0, 29.0, 14.0, 36.0, 48.0, 46.0, 101.0, 139.0, 223.0, 385.0, 695.0, 1751.0], [415.0, 155.0, 80.0, 54.0, 41.0, 26.0, 44.0, 22.0, 40.0, 22.0, 8.0, 6.0, 10.0, 5.0, 11.0, 9.0, 12.0, 3.0, 4.0, 5.0, 4.0, 3.0, 4.0, 2.0, 19.0, 9.0, 4.0, 4.0, 5.0, 3.0, 18.0, 4.0, 3.0, 2.0, 7.0, 6.0, 4.0, 9.0, 11.0, 10.0, 14.0, 23.0, 30.0, 41.0, 72.0, 118.0, 224.0, 437.0, 1170.0], [431.0, 144.0, 73.0, 55.0, 38.0, 39.0, 28.0, 19.0, 11.0, 13.0, 9.0, 13.0, 12.0, 8.0, 9.0, 7.0, 3.0, 6.0, 6.0, 2.0, 2.0, 2.0, 1.0, 4.0, 7.0, 1.0, 4.0, 1.0, 22.0, 4.0, 2.0, 1.0, 4.0, 26.0, 2.0, 3.0, 2.0, 2.0, 3.0, 6.0, 5.0, 11.0, 13.0, 42.0, 34.0, 44.0, 134.0, 250.0, 754.0], [397.0, 126.0, 71.0, 93.0, 41.0, 33.0, 25.0, 26.0, 19.0, 33.0, 14.0, 13.0, 5.0, 11.0, 12.0, 6.0, 4.0, 4.0, 5.0, 3.0, 17.0, 13.0, 2.0, 1.0, 4.0, 1.0, 19.0, 9.0, 0.0, 25.0, 3.0, 3.0, 1.0, 1.0, 3.0, 3.0, 1.0, 2.0, 3.0, 4.0, 3.0, 4.0, 7.0, 10.0, 29.0, 30.0, 50.0, 125.0, 464.0], [413.0, 154.0, 94.0, 54.0, 43.0, 33.0, 23.0, 20.0, 15.0, 11.0, 19.0, 8.0, 10.0, 6.0, 7.0, 6.0, 8.0, 2.0, 7.0, 6.0, 6.0, 24.0, 6.0, 4.0, 2.0, 0.0, 2.0, 0.0, 0.0, 0.0, 2.0, 1.0, 4.0, 2.0, 1.0, 4.0, 2.0, 2.0, 0.0, 3.0, 1.0, 1.0, 3.0, 10.0, 6.0, 15.0, 27.0, 71.0, 245.0], [405.0, 163.0, 81.0, 52.0, 38.0, 31.0, 30.0, 13.0, 17.0, 41.0, 14.0, 10.0, 4.0, 9.0, 7.0, 30.0, 9.0, 8.0, 4.0, 6.0, 6.0, 20.0, 9.0, 3.0, 2.0, 2.0, 3.0, 1.0, 8.0, 0.0, 2.0, 4.0, 1.0, 3.0, 0.0, 4.0, 2.0, 1.0, 4.0, 0.0, 3.0, 3.0, 2.0, 6.0, 8.0, 7.0, 8.0, 29.0, 132.0], [407.0, 155.0, 83.0, 77.0, 33.0, 24.0, 24.0, 50.0, 49.0, 17.0, 7.0, 10.0, 11.0, 6.0, 6.0, 28.0, 4.0, 3.0, 4.0, 7.0, 4.0, 4.0, 27.0, 6.0, 2.0, 1.0, 22.0, 29.0, 4.0, 1.0, 1.0, 1.0, 1.0, 0.0, 1.0, 0.0, 4.0, 4.0, 2.0, 0.0, 3.0, 1.0, 5.0, 1.0, 26.0, 5.0, 8.0, 24.0, 95.0], [373.0, 147.0, 81.0, 63.0, 39.0, 22.0, 26.0, 17.0, 14.0, 16.0, 29.0, 16.0, 7.0, 13.0, 10.0, 12.0, 2.0, 3.0, 5.0, 8.0, 3.0, 2.0, 26.0, 2.0, 2.0, 2.0, 4.0, 2.0, 5.0, 1.0, 3.0, 23.0, 5.0, 2.0, 1.0, 1.0, 0.0, 2.0, 3.0, 0.0, 2.0, 3.0, 3.0, 2.0, 3.0, 3.0, 2.0, 15.0, 83.0], [397.0, 159.0, 65.0, 57.0, 45.0, 17.0, 26.0, 27.0, 12.0, 12.0, 10.0, 13.0, 28.0, 8.0, 13.0, 11.0, 7.0, 7.0, 6.0, 4.0, 2.0, 2.0, 2.0, 3.0, 1.0, 6.0, 3.0, 1.0, 1.0, 4.0, 4.0, 1.0, 2.0, 0.0, 2.0, 1.0, 2.0, 2.0, 3.0, 0.0, 25.0, 4.0, 2.0, 3.0, 4.0, 4.0, 3.0, 8.0, 35.0], [401.0, 144.0, 80.0, 56.0, 39.0, 58.0, 31.0, 20.0, 14.0, 9.0, 11.0, 11.0, 8.0, 7.0, 8.0, 9.0, 5.0, 5.0, 2.0, 5.0, 4.0, 9.0, 2.0, 6.0, 23.0, 2.0, 5.0, 4.0, 1.0, 2.0, 2.0, 2.0, 2.0, 0.0, 1.0, 2.0, 1.0, 2.0, 26.0, 4.0, 5.0, 5.0, 2.0, 4.0, 1.0, 25.0, 6.0, 6.0, 23.0], [395.0, 152.0, 81.0, 56.0, 32.0, 32.0, 19.0, 23.0, 13.0, 19.0, 9.0, 14.0, 13.0, 10.0, 7.0, 4.0, 4.0, 6.0, 7.0, 3.0, 3.0, 1.0, 1.0, 4.0, 0.0, 0.0, 2.0, 2.0, 1.0, 23.0, 6.0, 3.0, 2.0, 3.0, 2.0, 3.0, 2.0, 2.0, 5.0, 2.0, 4.0, 1.0, 18.0, 13.0, 1.0, 3.0, 2.0, 8.0, 29.0], [418.0, 137.0, 74.0, 47.0, 40.0, 23.0, 28.0, 18.0, 17.0, 15.0, 38.0, 14.0, 11.0, 7.0, 12.0, 7.0, 9.0, 9.0, 2.0, 3.0, 0.0, 25.0, 4.0, 0.0, 5.0, 1.0, 21.0, 8.0, 2.0, 2.0, 6.0, 0.0, 1.0, 1.0, 1.0, 4.0, 2.0, 0.0, 2.0, 4.0, 3.0, 4.0, 2.0, 5.0, 2.0, 1.0, 2.0, 6.0, 19.0], [377.0, 160.0, 80.0, 48.0, 28.0, 58.0, 27.0, 16.0, 23.0, 14.0, 15.0, 7.0, 7.0, 16.0, 9.0, 7.0, 6.0, 3.0, 2.0, 2.0, 2.0, 1.0, 5.0, 1.0, 2.0, 3.0, 3.0, 3.0, 4.0, 2.0, 3.0, 1.0, 4.0, 1.0, 3.0, 3.0, 2.0, 2.0, 3.0, 3.0, 1.0, 23.0, 5.0, 0.0, 3.0, 1.0, 3.0, 26.0, 23.0], [392.0, 173.0, 78.0, 48.0, 36.0, 27.0, 18.0, 16.0, 17.0, 19.0, 10.0, 15.0, 7.0, 9.0, 8.0, 7.0, 5.0, 7.0, 4.0, 4.0, 6.0, 2.0, 3.0, 2.0, 23.0, 5.0, 3.0, 27.0, 1.0, 2.0, 4.0, 4.0, 1.0, 22.0, 4.0, 4.0, 2.0, 1.0, 2.0, 24.0, 3.0, 23.0, 8.0, 2.0, 2.0, 3.0, 1.0, 8.0, 39.0], [403.0, 139.0, 82.0, 53.0, 44.0, 30.0, 17.0, 19.0, 18.0, 10.0, 26.0, 9.0, 13.0, 8.0, 4.0, 8.0, 6.0, 3.0, 5.0, 6.0, 4.0, 5.0, 1.0, 3.0, 3.0, 6.0, 3.0, 1.0, 22.0, 6.0, 1.0, 1.0, 0.0, 3.0, 1.0, 20.0, 8.0, 1.0, 2.0, 3.0, 1.0, 9.0, 0.0, 2.0, 2.0, 29.0, 2.0, 4.0, 14.0]],
    "Name": "sCurve-0",
    "Overflow": 2427227.0,
    "Type": "Histo2d",
    "Underflow": 0.0,
    "x": {
        "AxisTitle": "Vcal",
        "Bins": 51,
        "High": 302.5,
        "Low": 47.5
    },
    "y": {
        "AxisTitle": "Occupancy",
        "Bins": 49,
        "High": 49.5,
        "Low": 0.5
    },
    "z": {
        "AxisTitle": "Number of pixels"
    }
}