{
    "Data": [1758.0, 21207.0, 18160.0, 7851.0, 2620.0, 738.0, 449.0, 583.0, 848.0, 1073.0, 1146.0, 1084.0, 912.0, 783.0, 645.0, 523.0, 469.0, 460.0, 426.0, 399.0, 417.0, 419.0, 447.0, 440.0, 462.0, 463.0, 477.0, 501.0, 515.0, 479.0, 503.0, 492.0, 486.0, 487.0, 508.0, 480.0, 464.0, 449.0, 471.0, 420.0, 395.0, 410.0, 338.0, 329.0, 313.0, 278.0, 282.0, 271.0, 254.0, 212.0, 96.0],
    "Name": "Chi2Dist-0",
    "Overflow": 0.0,
    "Type": "Histo1d",
    "Underflow": 0.0,
    "x": {
        "AxisTitle": "Fit Chi/ndf",
        "Bins": 51,
        "High": 2.5250000953674318,
        "Low": -0.02500000037252903
    },
    "y": {
        "AxisTitle": "Number of Pixels"
    },
    "z": {
        "AxisTitle": "z"
    }
}