{
    "Data": [1713.0, 20708.0, 18111.0, 8140.0, 2645.0, 808.0, 460.0, 643.0, 909.0, 1121.0, 1122.0, 1083.0, 926.0, 761.0, 660.0, 581.0, 463.0, 432.0, 441.0, 390.0, 414.0, 428.0, 438.0, 465.0, 532.0, 485.0, 500.0, 480.0, 522.0, 456.0, 492.0, 450.0, 473.0, 446.0, 413.0, 384.0, 429.0, 407.0, 385.0, 399.0, 386.0, 345.0, 344.0, 332.0, 269.0, 288.0, 251.0, 272.0, 190.0, 234.0, 107.0],
    "Name": "Chi2Dist-0",
    "Overflow": 0.0,
    "Type": "Histo1d",
    "Underflow": 0.0,
    "x": {
        "AxisTitle": "Fit Chi/ndf",
        "Bins": 51,
        "High": 2.5250000953674318,
        "Low": -0.02500000037252903
    },
    "y": {
        "AxisTitle": "Number of Pixels"
    },
    "z": {
        "AxisTitle": "z"
    }
}