{
    "Data": [0.0, 0.0, 0.0, 0.0, 0.0, 0.0, 0.0, 0.0, 0.0, 0.0, 0.0, 0.0, 0.0, 0.0, 0.0, 0.0, 0.0, 0.0, 0.0, 0.0, 0.0, 0.0, 0.0, 0.0, 0.0, 0.0, 0.0, 0.0, 0.0, 0.0, 0.0, 0.0, 0.0, 0.0, 0.0, 0.0, 0.0, 0.0, 0.0, 0.0, 0.0, 0.0, 0.0, 0.0, 0.0, 0.0, 0.0, 0.0, 0.0, 0.0, 94.0, 206.0, 209.0, 226.0, 199.0, 225.0, 226.0, 255.0, 259.0, 297.0, 258.0, 260.0, 283.0, 279.0, 297.0, 301.0, 313.0, 318.0, 319.0, 379.0, 313.0, 360.0, 333.0, 362.0, 342.0, 330.0, 366.0, 431.0, 421.0, 381.0, 421.0, 427.0, 423.0, 398.0, 413.0, 397.0, 427.0, 433.0, 445.0, 482.0, 439.0, 488.0, 479.0, 429.0, 443.0, 433.0, 461.0, 449.0, 481.0, 443.0, 494.0, 433.0, 486.0, 474.0, 481.0, 426.0, 492.0, 466.0, 479.0, 483.0, 467.0, 415.0, 429.0, 434.0, 443.0, 437.0, 433.0, 436.0, 451.0, 464.0, 425.0, 368.0, 391.0, 386.0, 397.0, 358.0, 347.0, 323.0, 363.0, 334.0, 359.0, 326.0, 325.0, 311.0, 319.0, 300.0, 327.0, 311.0, 283.0, 341.0, 258.0, 281.0, 260.0, 259.0, 237.0, 259.0, 241.0, 260.0, 238.0, 219.0, 232.0, 186.0, 218.0, 196.0, 209.0, 197.0, 213.0, 189.0, 198.0, 204.0, 198.0, 230.0, 190.0, 207.0, 189.0, 209.0, 237.0, 255.0, 267.0, 282.0, 289.0, 347.0, 344.0, 376.0, 401.0, 459.0, 471.0, 467.0, 537.0, 622.0, 608.0, 659.0, 643.0, 708.0, 733.0, 792.0, 799.0, 813.0, 793.0, 792.0, 770.0, 803.0, 827.0, 757.0, 794.0, 755.0, 707.0, 696.0, 658.0, 663.0, 582.0, 655.0, 534.0, 529.0, 461.0, 438.0, 404.0, 359.0, 334.0, 272.0, 254.0, 262.0, 243.0, 208.0, 210.0, 162.0, 200.0, 137.0, 132.0, 91.0, 79.0, 97.0, 83.0, 57.0, 60.0, 37.0, 46.0, 37.0, 31.0, 36.0, 37.0, 28.0, 24.0, 24.0, 17.0, 19.0, 24.0, 14.0, 14.0, 11.0, 18.0, 15.0, 7.0, 15.0, 14.0, 11.0, 10.0, 9.0, 8.0, 5.0, 7.0, 16.0, 7.0, 5.0, 5.0, 6.0, 9.0, 7.0, 2.0, 3.0, 5.0, 12.0, 8.0, 2.0, 8.0, 4.0, 2.0, 4.0, 5.0, 0.0, 4.0, 4.0, 3.0, 6.0, 3.0, 2.0, 5.0, 2.0, 3.0, 4.0, 2.0, 3.0, 2.0, 1.0, 2.0, 2.0, 1.0, 2.0, 2.0, 2.0, 1.0, 4.0, 3.0, 1.0, 2.0, 0.0, 1.0, 0.0, 1.0, 0.0, 0.0, 0.0, 0.0, 0.0, 0.0, 1.0, 0.0, 1.0, 0.0, 1.0, 3.0, 1.0, 0.0, 0.0, 0.0, 0.0, 0.0, 1.0, 0.0, 4.0, 2.0, 2.0, 0.0, 1.0, 0.0, 0.0, 0.0, 0.0, 0.0, 0.0, 0.0, 0.0, 0.0, 0.0, 0.0, 0.0, 0.0, 0.0, 0.0, 0.0, 0.0, 0.0, 0.0, 0.0, 0.0, 0.0, 0.0, 0.0, 0.0, 0.0, 0.0, 0.0, 0.0, 0.0, 0.0, 0.0, 0.0, 0.0, 0.0, 0.0, 0.0, 0.0, 0.0, 0.0, 0.0, 0.0, 0.0, 0.0, 0.0, 0.0, 0.0, 0.0, 0.0, 0.0, 0.0, 0.0, 0.0, 0.0, 0.0, 0.0, 0.0, 0.0, 0.0, 0.0, 0.0, 0.0, 0.0],
    "Name": "ThresholdDist-0",
    "Overflow": 0.0,
    "Type": "Histo1d",
    "Underflow": 0.0,
    "x": {
        "AxisTitle": "Threshold [e]",
        "Bins": 387,
        "High": 3865.0,
        "Low": -5.0
    },
    "y": {
        "AxisTitle": "Number of Pixels"
    },
    "z": {
        "AxisTitle": "z"
    }
}