time,Hardware,Voltage,Current
1626754386430,high-voltage-3,1,0.00142882
time,Hardware,Voltage,Current
1626754386430,high-voltage-3,2,0.0039465
time,Hardware,Voltage,Current
1626754386430,high-voltage-3,3,0.00643928
time,Hardware,Voltage,Current
1626754386430,high-voltage-3,4,0.00824799
time,Hardware,Voltage,Current
1626754386430,high-voltage-3,5,0.0088128
time,Hardware,Voltage,Current
1626754386430,high-voltage-3,6,0.0110617
time,Hardware,Voltage,Current
1626754386430,high-voltage-3,7,0.0131575
time,Hardware,Voltage,Current
1626754386430,high-voltage-3,8,0.0144551
time,Hardware,Voltage,Current
1626754386430,high-voltage-3,9,0.015949
time,Hardware,Voltage,Current
1626754386430,high-voltage-3,10,0.018056
time,Hardware,Voltage,Current
1626754386430,high-voltage-3,11,0.0190454
time,Hardware,Voltage,Current
1626754386430,high-voltage-3,12,0.0196791
time,Hardware,Voltage,Current
1626754386430,high-voltage-3,13,0.0220609
time,Hardware,Voltage,Current
1626754386430,high-voltage-3,14,0.0237979
time,Hardware,Voltage,Current
1626754386430,high-voltage-3,15,0.0236313
time,Hardware,Voltage,Current
1626754386430,high-voltage-3,16,0.0249101
time,Hardware,Voltage,Current
1626754386430,high-voltage-3,17,0.0266726
time,Hardware,Voltage,Current
1626754386430,high-voltage-3,18,0.0285593
time,Hardware,Voltage,Current
1626754386430,high-voltage-3,19,0.0298144
time,Hardware,Voltage,Current
1626754386430,high-voltage-3,20,0.0294816
time,Hardware,Voltage,Current
1626754386430,high-voltage-3,25,0.0378913
time,Hardware,Voltage,Current
1626754386430,high-voltage-3,30,0.0436105
time,Hardware,Voltage,Current
1626754386430,high-voltage-3,35,0.0511702
time,Hardware,Voltage,Current
1626754386430,high-voltage-3,40,0.0561613
time,Hardware,Voltage,Current
1626754386430,high-voltage-3,45,0.0615507
time,Hardware,Voltage,Current
1626754386430,high-voltage-3,50,0.0669418
time,Hardware,Voltage,Current
1626754386430,high-voltage-3,55,0.0693568
time,Hardware,Voltage,Current
1626754386430,high-voltage-3,60,0.0743547
time,Hardware,Voltage,Current
1626754386430,high-voltage-3,65,0.0785966
time,Hardware,Voltage,Current
1626754386430,high-voltage-3,70,0.0840567
time,Hardware,Voltage,Current
1626754386430,high-voltage-3,75,0.0911566
time,Hardware,Voltage,Current
1626754386430,high-voltage-3,80,0.098459
time,Hardware,Voltage,Current
1626754386430,high-voltage-3,85,0.103451
time,Hardware,Voltage,Current
1626754386430,high-voltage-3,90,0.109641
time,Hardware,Voltage,Current
1626754386430,high-voltage-3,95,0.115265
time,Hardware,Voltage,Current
1626754386430,high-voltage-3,100,0.121129
