{
    "Data": [1734.0, 20886.0, 17903.0, 8121.0, 2897.0, 838.0, 448.0, 650.0, 860.0, 995.0, 1138.0, 1086.0, 1004.0, 771.0, 626.0, 544.0, 459.0, 391.0, 393.0, 375.0, 451.0, 440.0, 486.0, 465.0, 489.0, 509.0, 525.0, 524.0, 523.0, 542.0, 463.0, 508.0, 527.0, 468.0, 455.0, 438.0, 480.0, 441.0, 416.0, 387.0, 428.0, 314.0, 338.0, 304.0, 325.0, 304.0, 275.0, 264.0, 210.0, 199.0, 92.0],
    "Name": "Chi2Dist-0",
    "Overflow": 0.0,
    "Type": "Histo1d",
    "Underflow": 0.0,
    "x": {
        "AxisTitle": "Fit Chi/ndf",
        "Bins": 51,
        "High": 2.5250000953674318,
        "Low": -0.02500000037252903
    },
    "y": {
        "AxisTitle": "Number of Pixels"
    },
    "z": {
        "AxisTitle": "z"
    }
}