{
    "Data": [15.0, 75.0, 32.0, 26.0, 37.0, 36.0, 113.0, 382.0, 1129.0, 2675.0, 4542.0, 5514.0, 5155.0, 3960.0, 3218.0, 3010.0, 3206.0, 3068.0, 2866.0, 2420.0, 2214.0, 1974.0, 1818.0, 1615.0, 1272.0, 1091.0, 740.0, 539.0, 318.0, 279.0, 246.0, 277.0, 290.0, 344.0, 363.0, 401.0, 500.0, 517.0, 590.0, 681.0, 713.0, 800.0, 835.0, 846.0, 918.0, 918.0, 856.0, 828.0, 833.0, 737.0, 714.0, 675.0, 635.0, 526.0, 478.0, 389.0, 336.0, 386.0, 331.0, 291.0, 239.0, 271.0, 205.0, 191.0, 164.0, 127.0, 146.0, 144.0, 122.0, 124.0, 115.0, 104.0, 106.0, 84.0, 73.0, 77.0, 86.0, 58.0, 59.0, 58.0, 55.0, 56.0, 51.0, 47.0, 34.0, 37.0, 31.0, 43.0, 36.0, 27.0, 23.0, 22.0, 12.0, 22.0, 24.0, 16.0, 20.0, 20.0, 22.0, 20.0, 18.0, 17.0, 19.0, 18.0, 21.0, 7.0, 9.0, 9.0, 9.0, 10.0, 13.0, 8.0, 17.0, 11.0, 7.0, 5.0],
    "Name": "NoiseDist-0",
    "Overflow": 201.0,
    "Type": "Histo1d",
    "Underflow": 0.0,
    "x": {
        "AxisTitle": "Noise [e]",
        "Bins": 116,
        "High": 581.0,
        "Low": -2.0
    },
    "y": {
        "AxisTitle": "Number of Pixels"
    },
    "z": {
        "AxisTitle": "z"
    }
}