{
    "Data": [[1216.0, 327.0, 144.0, 74.0, 51.0, 47.0, 32.0, 23.0, 13.0, 9.0, 8.0, 11.0, 14.0, 10.0, 6.0, 7.0, 6.0, 8.0, 16.0, 11.0, 11.0, 9.0, 6.0, 6.0, 8.0, 7.0, 6.0, 3.0, 4.0, 4.0, 1.0, 1.0, 2.0, 3.0, 2.0, 1.0, 2.0, 3.0, 0.0, 4.0, 4.0, 4.0, 4.0, 3.0, 4.0, 3.0, 2.0, 5.0, 0.0], [2189.0, 790.0, 408.0, 240.0, 148.0, 115.0, 71.0, 58.0, 33.0, 48.0, 19.0, 21.0, 13.0, 13.0, 9.0, 9.0, 7.0, 4.0, 5.0, 6.0, 6.0, 7.0, 8.0, 5.0, 5.0, 5.0, 8.0, 7.0, 2.0, 6.0, 7.0, 3.0, 3.0, 6.0, 7.0, 11.0, 6.0, 11.0, 8.0, 8.0, 11.0, 6.0, 12.0, 5.0, 5.0, 3.0, 5.0, 10.0, 7.0], [3307.0, 1559.0, 851.0, 564.0, 410.0, 271.0, 199.0, 165.0, 131.0, 98.0, 71.0, 69.0, 52.0, 43.0, 42.0, 33.0, 22.0, 19.0, 17.0, 14.0, 23.0, 18.0, 14.0, 14.0, 6.0, 7.0, 3.0, 6.0, 5.0, 13.0, 6.0, 7.0, 6.0, 5.0, 6.0, 5.0, 6.0, 3.0, 6.0, 10.0, 7.0, 7.0, 5.0, 6.0, 7.0, 11.0, 18.0, 21.0, 33.0], [4022.0, 2172.0, 1501.0, 1081.0, 812.0, 625.0, 462.0, 404.0, 347.0, 292.0, 236.0, 181.0, 181.0, 141.0, 111.0, 107.0, 84.0, 74.0, 67.0, 67.0, 64.0, 37.0, 40.0, 39.0, 36.0, 27.0, 27.0, 25.0, 14.0, 17.0, 21.0, 15.0, 13.0, 16.0, 7.0, 10.0, 14.0, 10.0, 16.0, 9.0, 6.0, 13.0, 10.0, 12.0, 15.0, 9.0, 12.0, 9.0, 29.0], [3739.0, 2302.0, 1797.0, 1456.0, 1150.0, 1038.0, 861.0, 731.0, 661.0, 601.0, 539.0, 441.0, 433.0, 360.0, 328.0, 282.0, 271.0, 237.0, 199.0, 184.0, 174.0, 154.0, 124.0, 127.0, 97.0, 107.0, 100.0, 86.0, 68.0, 86.0, 53.0, 67.0, 50.0, 51.0, 54.0, 34.0, 34.0, 32.0, 29.0, 16.0, 21.0, 17.0, 23.0, 26.0, 21.0, 28.0, 23.0, 26.0, 32.0], [4272.0, 2158.0, 1656.0, 1367.0, 1199.0, 1098.0, 1005.0, 881.0, 871.0, 780.0, 735.0, 737.0, 646.0, 609.0, 580.0, 521.0, 476.0, 479.0, 416.0, 415.0, 379.0, 351.0, 354.0, 301.0, 284.0, 260.0, 246.0, 221.0, 203.0, 204.0, 225.0, 176.0, 168.0, 154.0, 123.0, 113.0, 111.0, 121.0, 112.0, 96.0, 116.0, 85.0, 78.0, 68.0, 53.0, 67.0, 43.0, 43.0, 65.0], [7163.0, 3945.0, 2510.0, 1791.0, 1443.0, 1177.0, 1010.0, 961.0, 877.0, 833.0, 765.0, 749.0, 718.0, 650.0, 622.0, 654.0, 618.0, 667.0, 594.0, 603.0, 572.0, 568.0, 543.0, 506.0, 547.0, 480.0, 464.0, 494.0, 412.0, 441.0, 448.0, 418.0, 345.0, 392.0, 354.0, 319.0, 334.0, 297.0, 276.0, 256.0, 268.0, 264.0, 245.0, 193.0, 184.0, 223.0, 190.0, 156.0, 199.0], [2754.0, 2792.0, 2637.0, 2601.0, 2408.0, 2370.0, 2078.0, 1819.0, 1687.0, 1531.0, 1422.0, 1227.0, 1061.0, 1002.0, 982.0, 906.0, 804.0, 848.0, 764.0, 780.0, 680.0, 711.0, 690.0, 627.0, 683.0, 608.0, 657.0, 610.0, 595.0, 638.0, 632.0, 631.0, 624.0, 586.0, 592.0, 619.0, 588.0, 586.0, 558.0, 620.0, 623.0, 581.0, 569.0, 580.0, 504.0, 540.0, 488.0, 528.0, 503.0], [522.0, 351.0, 374.0, 396.0, 483.0, 596.0, 663.0, 715.0, 851.0, 957.0, 1022.0, 1066.0, 1104.0, 1136.0, 1198.0, 1243.0, 1280.0, 1244.0, 1336.0, 1290.0, 1333.0, 1315.0, 1384.0, 1260.0, 1289.0, 1285.0, 1191.0, 1185.0, 1199.0, 1112.0, 1089.0, 1062.0, 1060.0, 1029.0, 1078.0, 959.0, 939.0, 1024.0, 1006.0, 1019.0, 1020.0, 969.0, 1012.0, 1027.0, 1081.0, 1093.0, 1179.0, 1248.0, 1344.0], [605.0, 164.0, 107.0, 82.0, 60.0, 67.0, 95.0, 75.0, 86.0, 114.0, 115.0, 146.0, 141.0, 158.0, 172.0, 217.0, 236.0, 275.0, 307.0, 339.0, 413.0, 408.0, 477.0, 559.0, 640.0, 675.0, 769.0, 799.0, 887.0, 989.0, 1020.0, 1100.0, 1254.0, 1346.0, 1419.0, 1580.0, 1665.0, 1742.0, 1808.0, 1999.0, 2086.0, 2245.0, 2197.0, 2268.0, 2474.0, 2575.0, 2605.0, 2935.0, 3352.0], [927.0, 208.0, 77.0, 57.0, 51.0, 46.0, 46.0, 47.0, 39.0, 51.0, 31.0, 30.0, 39.0, 40.0, 44.0, 42.0, 42.0, 49.0, 57.0, 54.0, 61.0, 83.0, 95.0, 92.0, 93.0, 110.0, 138.0, 156.0, 178.0, 224.0, 212.0, 219.0, 311.0, 363.0, 428.0, 448.0, 556.0, 644.0, 756.0, 905.0, 1089.0, 1332.0, 1620.0, 2054.0, 2444.0, 3228.0, 4341.0, 5796.0, 8283.0], [1570.0, 386.0, 135.0, 62.0, 52.0, 35.0, 24.0, 23.0, 18.0, 19.0, 23.0, 26.0, 25.0, 26.0, 17.0, 35.0, 22.0, 19.0, 28.0, 23.0, 30.0, 19.0, 28.0, 33.0, 41.0, 36.0, 31.0, 29.0, 48.0, 46.0, 54.0, 59.0, 66.0, 74.0, 95.0, 111.0, 119.0, 181.0, 188.0, 273.0, 291.0, 361.0, 473.0, 616.0, 895.0, 1280.0, 1998.0, 3506.0, 7973.0], [2504.0, 701.0, 275.0, 86.0, 43.0, 33.0, 22.0, 23.0, 20.0, 9.0, 10.0, 9.0, 22.0, 15.0, 13.0, 14.0, 13.0, 17.0, 18.0, 14.0, 17.0, 16.0, 21.0, 20.0, 24.0, 22.0, 23.0, 17.0, 24.0, 19.0, 30.0, 28.0, 32.0, 31.0, 36.0, 40.0, 43.0, 52.0, 67.0, 76.0, 85.0, 101.0, 154.0, 219.0, 291.0, 425.0, 786.0, 1505.0, 4013.0], [3830.0, 1230.0, 536.0, 246.0, 122.0, 44.0, 37.0, 16.0, 18.0, 21.0, 16.0, 11.0, 9.0, 21.0, 7.0, 11.0, 5.0, 11.0, 6.0, 9.0, 5.0, 4.0, 8.0, 11.0, 8.0, 14.0, 14.0, 14.0, 16.0, 15.0, 17.0, 17.0, 17.0, 19.0, 29.0, 16.0, 34.0, 34.0, 24.0, 39.0, 41.0, 67.0, 62.0, 94.0, 111.0, 178.0, 300.0, 591.0, 1958.0], [4903.0, 2145.0, 1084.0, 491.0, 258.0, 127.0, 72.0, 52.0, 25.0, 31.0, 15.0, 11.0, 9.0, 11.0, 8.0, 14.0, 11.0, 15.0, 9.0, 11.0, 6.0, 8.0, 5.0, 7.0, 9.0, 7.0, 10.0, 9.0, 9.0, 12.0, 9.0, 7.0, 8.0, 12.0, 10.0, 13.0, 16.0, 19.0, 23.0, 23.0, 29.0, 20.0, 47.0, 45.0, 61.0, 78.0, 126.0, 263.0, 887.0], [5593.0, 3035.0, 1796.0, 1003.0, 543.0, 330.0, 175.0, 103.0, 74.0, 49.0, 31.0, 23.0, 25.0, 20.0, 10.0, 13.0, 10.0, 6.0, 5.0, 7.0, 2.0, 9.0, 7.0, 5.0, 10.0, 6.0, 5.0, 6.0, 11.0, 4.0, 10.0, 7.0, 13.0, 11.0, 12.0, 11.0, 14.0, 16.0, 17.0, 14.0, 16.0, 22.0, 18.0, 26.0, 43.0, 43.0, 74.0, 155.0, 429.0], [5453.0, 3712.0, 2560.0, 1701.0, 1019.0, 730.0, 509.0, 274.0, 171.0, 144.0, 98.0, 48.0, 51.0, 37.0, 22.0, 20.0, 15.0, 10.0, 11.0, 8.0, 9.0, 7.0, 13.0, 9.0, 6.0, 4.0, 10.0, 13.0, 11.0, 7.0, 7.0, 8.0, 4.0, 5.0, 7.0, 10.0, 11.0, 5.0, 11.0, 10.0, 16.0, 6.0, 19.0, 23.0, 24.0, 27.0, 36.0, 77.0, 242.0], [4789.0, 3677.0, 2909.0, 2242.0, 1732.0, 1242.0, 877.0, 630.0, 514.0, 310.0, 238.0, 181.0, 127.0, 66.0, 65.0, 55.0, 30.0, 25.0, 24.0, 10.0, 14.0, 9.0, 5.0, 4.0, 7.0, 3.0, 5.0, 5.0, 4.0, 6.0, 2.0, 8.0, 4.0, 9.0, 8.0, 10.0, 14.0, 11.0, 14.0, 11.0, 17.0, 11.0, 6.0, 16.0, 17.0, 21.0, 31.0, 52.0, 129.0], [3449.0, 3164.0, 2880.0, 2502.0, 2133.0, 1780.0, 1382.0, 1039.0, 887.0, 719.0, 540.0, 416.0, 315.0, 268.0, 200.0, 129.0, 126.0, 77.0, 64.0, 70.0, 38.0, 28.0, 20.0, 12.0, 16.0, 5.0, 5.0, 7.0, 8.0, 6.0, 4.0, 7.0, 5.0, 5.0, 5.0, 3.0, 5.0, 3.0, 5.0, 8.0, 7.0, 8.0, 11.0, 12.0, 19.0, 22.0, 37.0, 43.0, 93.0], [2163.0, 2279.0, 2391.0, 2287.0, 2091.0, 1834.0, 1730.0, 1460.0, 1295.0, 1132.0, 913.0, 770.0, 624.0, 541.0, 434.0, 331.0, 315.0, 253.0, 192.0, 187.0, 118.0, 117.0, 70.0, 65.0, 27.0, 44.0, 29.0, 25.0, 20.0, 9.0, 9.0, 14.0, 7.0, 5.0, 8.0, 5.0, 3.0, 7.0, 6.0, 3.0, 6.0, 4.0, 3.0, 7.0, 12.0, 9.0, 25.0, 40.0, 73.0], [1355.0, 1512.0, 1573.0, 1694.0, 1702.0, 1662.0, 1609.0, 1629.0, 1362.0, 1368.0, 1190.0, 1124.0, 942.0, 873.0, 834.0, 726.0, 557.0, 492.0, 434.0, 349.0, 297.0, 250.0, 204.0, 179.0, 117.0, 129.0, 74.0, 87.0, 60.0, 39.0, 36.0, 32.0, 29.0, 22.0, 17.0, 19.0, 21.0, 13.0, 10.0, 13.0, 12.0, 7.0, 7.0, 12.0, 8.0, 7.0, 12.0, 18.0, 55.0], [870.0, 974.0, 1085.0, 1131.0, 1200.0, 1309.0, 1338.0, 1306.0, 1355.0, 1341.0, 1263.0, 1225.0, 1158.0, 1048.0, 1043.0, 930.0, 852.0, 754.0, 666.0, 568.0, 533.0, 519.0, 426.0, 337.0, 312.0, 295.0, 208.0, 193.0, 157.0, 132.0, 104.0, 94.0, 71.0, 57.0, 46.0, 38.0, 36.0, 18.0, 17.0, 13.0, 10.0, 6.0, 6.0, 5.0, 11.0, 7.0, 16.0, 33.0, 44.0], [568.0, 554.0, 633.0, 712.0, 753.0, 832.0, 902.0, 1017.0, 1017.0, 1001.0, 1095.0, 1144.0, 1143.0, 1093.0, 1061.0, 993.0, 945.0, 981.0, 935.0, 928.0, 793.0, 738.0, 691.0, 647.0, 560.0, 535.0, 459.0, 421.0, 365.0, 317.0, 266.0, 228.0, 210.0, 178.0, 148.0, 112.0, 95.0, 81.0, 62.0, 40.0, 30.0, 27.0, 27.0, 18.0, 18.0, 8.0, 9.0, 8.0, 46.0], [398.0, 362.0, 438.0, 416.0, 511.0, 542.0, 612.0, 646.0, 680.0, 775.0, 767.0, 846.0, 805.0, 885.0, 946.0, 884.0, 911.0, 959.0, 943.0, 980.0, 888.0, 899.0, 864.0, 816.0, 849.0, 781.0, 728.0, 631.0, 623.0, 546.0, 507.0, 458.0, 391.0, 375.0, 292.0, 257.0, 234.0, 169.0, 159.0, 119.0, 113.0, 91.0, 71.0, 58.0, 57.0, 30.0, 22.0, 24.0, 20.0], [353.0, 245.0, 300.0, 334.0, 326.0, 365.0, 399.0, 341.0, 406.0, 487.0, 523.0, 512.0, 576.0, 630.0, 636.0, 688.0, 743.0, 823.0, 836.0, 815.0, 852.0, 779.0, 859.0, 872.0, 864.0, 891.0, 887.0, 861.0, 829.0, 820.0, 779.0, 768.0, 671.0, 667.0, 587.0, 481.0, 437.0, 402.0, 382.0, 342.0, 246.0, 215.0, 200.0, 150.0, 121.0, 80.0, 64.0, 52.0, 47.0], [212.0, 205.0, 209.0, 261.0, 253.0, 235.0, 243.0, 270.0, 290.0, 318.0, 362.0, 348.0, 410.0, 383.0, 425.0, 517.0, 491.0, 532.0, 545.0, 589.0, 584.0, 689.0, 750.0, 754.0, 819.0, 838.0, 800.0, 832.0, 912.0, 878.0, 880.0, 862.0, 879.0, 865.0, 833.0, 818.0, 791.0, 713.0, 707.0, 584.0, 514.0, 519.0, 444.0, 343.0, 283.0, 243.0, 150.0, 142.0, 83.0], [229.0, 165.0, 170.0, 146.0, 147.0, 164.0, 171.0, 206.0, 195.0, 209.0, 229.0, 233.0, 255.0, 251.0, 268.0, 270.0, 333.0, 316.0, 364.0, 364.0, 424.0, 499.0, 511.0, 527.0, 600.0, 624.0, 667.0, 703.0, 751.0, 769.0, 771.0, 849.0, 900.0, 945.0, 993.0, 901.0, 1004.0, 946.0, 985.0, 946.0, 897.0, 875.0, 789.0, 722.0, 644.0, 555.0, 449.0, 345.0, 254.0], [230.0, 194.0, 194.0, 159.0, 151.0, 207.0, 201.0, 165.0, 170.0, 132.0, 150.0, 138.0, 165.0, 174.0, 151.0, 189.0, 217.0, 243.0, 245.0, 260.0, 249.0, 310.0, 328.0, 322.0, 382.0, 414.0, 478.0, 488.0, 540.0, 594.0, 641.0, 725.0, 718.0, 777.0, 818.0, 943.0, 942.0, 1046.0, 1096.0, 1095.0, 1096.0, 1043.0, 1139.0, 1101.0, 1060.0, 1004.0, 890.0, 699.0, 577.0], [183.0, 187.0, 149.0, 126.0, 78.0, 124.0, 121.0, 148.0, 107.0, 117.0, 149.0, 109.0, 127.0, 125.0, 130.0, 136.0, 108.0, 141.0, 146.0, 141.0, 120.0, 151.0, 189.0, 187.0, 213.0, 243.0, 277.0, 312.0, 379.0, 415.0, 432.0, 476.0, 554.0, 610.0, 655.0, 719.0, 789.0, 897.0, 1023.0, 1072.0, 1150.0, 1278.0, 1367.0, 1428.0, 1515.0, 1467.0, 1427.0, 1398.0, 1272.0], [183.0, 120.0, 96.0, 129.0, 116.0, 97.0, 113.0, 146.0, 193.0, 168.0, 114.0, 121.0, 106.0, 113.0, 99.0, 95.0, 83.0, 82.0, 71.0, 88.0, 101.0, 120.0, 120.0, 129.0, 135.0, 144.0, 151.0, 177.0, 183.0, 244.0, 238.0, 257.0, 336.0, 334.0, 399.0, 467.0, 579.0, 622.0, 796.0, 886.0, 973.0, 1210.0, 1305.0, 1520.0, 1688.0, 1822.0, 1995.0, 2099.0, 2151.0], [172.0, 100.0, 95.0, 127.0, 114.0, 93.0, 79.0, 85.0, 114.0, 113.0, 98.0, 85.0, 117.0, 83.0, 83.0, 67.0, 95.0, 90.0, 130.0, 138.0, 110.0, 129.0, 83.0, 97.0, 86.0, 63.0, 97.0, 97.0, 114.0, 127.0, 133.0, 162.0, 160.0, 215.0, 249.0, 283.0, 398.0, 452.0, 495.0, 612.0, 717.0, 845.0, 1057.0, 1289.0, 1512.0, 1907.0, 2288.0, 2710.0, 3123.0], [164.0, 94.0, 138.0, 154.0, 196.0, 88.0, 112.0, 63.0, 112.0, 67.0, 76.0, 130.0, 101.0, 104.0, 126.0, 102.0, 101.0, 106.0, 58.0, 96.0, 68.0, 83.0, 62.0, 57.0, 98.0, 72.0, 78.0, 100.0, 93.0, 106.0, 89.0, 84.0, 91.0, 111.0, 154.0, 151.0, 216.0, 213.0, 269.0, 370.0, 434.0, 577.0, 722.0, 961.0, 1190.0, 1614.0, 2160.0, 2856.0, 3962.0], [180.0, 105.0, 95.0, 104.0, 104.0, 58.0, 125.0, 107.0, 71.0, 71.0, 95.0, 138.0, 107.0, 71.0, 91.0, 47.0, 39.0, 66.0, 78.0, 114.0, 117.0, 170.0, 107.0, 82.0, 105.0, 125.0, 83.0, 63.0, 98.0, 62.0, 74.0, 98.0, 79.0, 78.0, 103.0, 100.0, 121.0, 119.0, 177.0, 208.0, 211.0, 343.0, 400.0, 584.0, 847.0, 1187.0, 1804.0, 2635.0, 4266.0], [106.0, 155.0, 161.0, 123.0, 76.0, 89.0, 108.0, 93.0, 90.0, 23.0, 68.0, 96.0, 44.0, 126.0, 150.0, 118.0, 80.0, 75.0, 125.0, 88.0, 81.0, 76.0, 88.0, 65.0, 66.0, 34.0, 34.0, 35.0, 78.0, 61.0, 83.0, 77.0, 140.0, 112.0, 86.0, 91.0, 81.0, 89.0, 67.0, 119.0, 165.0, 214.0, 234.0, 335.0, 534.0, 790.0, 1238.0, 2233.0, 4085.0], [217.0, 164.0, 78.0, 95.0, 90.0, 104.0, 158.0, 46.0, 105.0, 135.0, 80.0, 89.0, 151.0, 79.0, 94.0, 87.0, 90.0, 69.0, 118.0, 65.0, 96.0, 150.0, 72.0, 61.0, 125.0, 70.0, 58.0, 115.0, 67.0, 98.0, 48.0, 91.0, 123.0, 35.0, 83.0, 61.0, 107.0, 103.0, 125.0, 74.0, 74.0, 103.0, 146.0, 201.0, 260.0, 406.0, 740.0, 1500.0, 3388.0], [160.0, 36.0, 116.0, 126.0, 63.0, 140.0, 40.0, 43.0, 147.0, 132.0, 95.0, 95.0, 99.0, 132.0, 68.0, 47.0, 56.0, 34.0, 53.0, 95.0, 75.0, 81.0, 148.0, 116.0, 101.0, 65.0, 114.0, 177.0, 90.0, 95.0, 103.0, 97.0, 57.0, 73.0, 36.0, 39.0, 11.0, 94.0, 53.0, 107.0, 105.0, 143.0, 72.0, 132.0, 155.0, 279.0, 443.0, 1006.0, 2608.0], [125.0, 105.0, 93.0, 122.0, 118.0, 104.0, 74.0, 20.0, 76.0, 124.0, 88.0, 95.0, 44.0, 24.0, 107.0, 70.0, 179.0, 109.0, 59.0, 111.0, 31.0, 58.0, 106.0, 86.0, 102.0, 64.0, 47.0, 36.0, 113.0, 49.0, 15.0, 48.0, 98.0, 111.0, 89.0, 74.0, 79.0, 83.0, 97.0, 88.0, 109.0, 164.0, 161.0, 123.0, 172.0, 175.0, 251.0, 619.0, 1905.0], [88.0, 105.0, 213.0, 163.0, 71.0, 95.0, 74.0, 106.0, 124.0, 37.0, 100.0, 74.0, 83.0, 122.0, 119.0, 82.0, 62.0, 117.0, 83.0, 104.0, 41.0, 24.0, 79.0, 65.0, 79.0, 91.0, 94.0, 45.0, 84.0, 129.0, 88.0, 38.0, 142.0, 77.0, 43.0, 66.0, 61.0, 70.0, 41.0, 119.0, 145.0, 153.0, 109.0, 84.0, 94.0, 140.0, 134.0, 341.0, 1220.0], [83.0, 92.0, 172.0, 129.0, 117.0, 121.0, 81.0, 56.0, 178.0, 86.0, 36.0, 22.0, 48.0, 59.0, 135.0, 106.0, 47.0, 150.0, 37.0, 35.0, 133.0, 86.0, 59.0, 91.0, 199.0, 59.0, 66.0, 51.0, 79.0, 63.0, 37.0, 51.0, 102.0, 70.0, 43.0, 77.0, 124.0, 67.0, 140.0, 108.0, 57.0, 50.0, 61.0, 54.0, 27.0, 23.0, 60.0, 204.0, 859.0], [191.0, 175.0, 75.0, 120.0, 101.0, 169.0, 114.0, 72.0, 157.0, 69.0, 179.0, 106.0, 137.0, 68.0, 48.0, 84.0, 96.0, 51.0, 115.0, 27.0, 58.0, 27.0, 153.0, 112.0, 92.0, 42.0, 106.0, 90.0, 55.0, 27.0, 99.0, 52.0, 56.0, 40.0, 41.0, 48.0, 57.0, 67.0, 115.0, 38.0, 54.0, 66.0, 42.0, 15.0, 92.0, 113.0, 96.0, 125.0, 401.0], [184.0, 180.0, 109.0, 90.0, 65.0, 47.0, 80.0, 52.0, 64.0, 62.0, 56.0, 87.0, 121.0, 107.0, 28.0, 118.0, 59.0, 108.0, 151.0, 88.0, 143.0, 73.0, 61.0, 43.0, 62.0, 60.0, 41.0, 69.0, 21.0, 98.0, 120.0, 98.0, 144.0, 90.0, 119.0, 94.0, 53.0, 102.0, 43.0, 71.0, 85.0, 53.0, 63.0, 88.0, 54.0, 11.0, 13.0, 130.0, 265.0], [184.0, 110.0, 84.0, 123.0, 96.0, 102.0, 74.0, 61.0, 57.0, 49.0, 47.0, 138.0, 65.0, 146.0, 173.0, 101.0, 112.0, 45.0, 63.0, 24.0, 187.0, 89.0, 43.0, 44.0, 68.0, 112.0, 81.0, 89.0, 47.0, 85.0, 72.0, 55.0, 59.0, 76.0, 31.0, 62.0, 65.0, 24.0, 53.0, 42.0, 5.0, 32.0, 21.0, 32.0, 37.0, 88.0, 81.0, 93.0, 184.0], [159.0, 139.0, 78.0, 102.0, 90.0, 102.0, 113.0, 137.0, 93.0, 38.0, 197.0, 110.0, 35.0, 53.0, 75.0, 61.0, 47.0, 80.0, 50.0, 59.0, 21.0, 66.0, 89.0, 61.0, 60.0, 137.0, 105.0, 42.0, 1.0, 61.0, 65.0, 137.0, 89.0, 35.0, 70.0, 56.0, 33.0, 39.0, 72.0, 16.0, 64.0, 90.0, 42.0, 106.0, 30.0, 83.0, 57.0, 153.0, 160.0], [141.0, 73.0, 138.0, 153.0, 74.0, 129.0, 90.0, 133.0, 110.0, 185.0, 87.0, 55.0, 52.0, 88.0, 76.0, 67.0, 153.0, 54.0, 51.0, 111.0, 65.0, 80.0, 78.0, 8.0, 70.0, 70.0, 92.0, 54.0, 35.0, 80.0, 43.0, 135.0, 81.0, 51.0, 45.0, 19.0, 48.0, 54.0, 73.0, 52.0, 96.0, 35.0, 32.0, 44.0, 77.0, 55.0, 87.0, 49.0, 56.0], [90.0, 62.0, 59.0, 133.0, 59.0, 23.0, 51.0, 48.0, 178.0, 43.0, 55.0, 67.0, 95.0, 46.0, 88.0, 19.0, 57.0, 65.0, 170.0, 57.0, 41.0, 80.0, 65.0, 32.0, 62.0, 53.0, 30.0, 68.0, 78.0, 69.0, 100.0, 20.0, 50.0, 23.0, 47.0, 66.0, 98.0, 48.0, 113.0, 52.0, 107.0, 75.0, 74.0, 20.0, 87.0, 40.0, 26.0, 49.0, 166.0], [93.0, 34.0, 126.0, 104.0, 135.0, 82.0, 56.0, 83.0, 90.0, 38.0, 74.0, 50.0, 67.0, 63.0, 83.0, 40.0, 54.0, 25.0, 37.0, 28.0, 39.0, 39.0, 75.0, 70.0, 27.0, 57.0, 75.0, 6.0, 39.0, 41.0, 57.0, 62.0, 109.0, 112.0, 145.0, 16.0, 17.0, 54.0, 6.0, 27.0, 60.0, 37.0, 42.0, 56.0, 32.0, 1.0, 48.0, 57.0, 94.0], [92.0, 105.0, 78.0, 101.0, 47.0, 48.0, 36.0, 99.0, 96.0, 98.0, 46.0, 91.0, 74.0, 71.0, 34.0, 37.0, 36.0, 82.0, 34.0, 26.0, 27.0, 40.0, 79.0, 132.0, 73.0, 5.0, 10.0, 63.0, 83.0, 76.0, 86.0, 21.0, 47.0, 49.0, 19.0, 1.0, 40.0, 73.0, 29.0, 54.0, 79.0, 50.0, 94.0, 34.0, 24.0, 13.0, 169.0, 48.0, 42.0], [69.0, 116.0, 139.0, 136.0, 78.0, 22.0, 56.0, 30.0, 19.0, 17.0, 22.0, 14.0, 47.0, 128.0, 88.0, 59.0, 79.0, 45.0, 40.0, 113.0, 29.0, 98.0, 62.0, 5.0, 30.0, 45.0, 55.0, 38.0, 66.0, 54.0, 57.0, 24.0, 79.0, 23.0, 11.0, 65.0, 54.0, 90.0, 67.0, 38.0, 22.0, 61.0, 67.0, 55.0, 99.0, 37.0, 5.0, 34.0, 101.0], [83.0, 55.0, 47.0, 39.0, 97.0, 50.0, 47.0, 4.0, 39.0, 38.0, 72.0, 34.0, 32.0, 40.0, 34.0, 26.0, 17.0, 50.0, 74.0, 27.0, 13.0, 30.0, 27.0, 82.0, 66.0, 10.0, 36.0, 87.0, 82.0, 18.0, 58.0, 25.0, 41.0, 16.0, 17.0, 40.0, 39.0, 43.0, 24.0, 29.0, 25.0, 13.0, 64.0, 144.0, 57.0, 51.0, 20.0, 63.0, 41.0], [113.0, 69.0, 63.0, 76.0, 50.0, 52.0, 40.0, 27.0, 142.0, 94.0, 90.0, 43.0, 63.0, 99.0, 52.0, 7.0, 13.0, 50.0, 34.0, 26.0, 35.0, 0.0, 16.0, 9.0, 16.0, 9.0, 5.0, 37.0, 64.0, 56.0, 30.0, 3.0, 0.0, 50.0, 1.0, 23.0, 30.0, 31.0, 56.0, 33.0, 14.0, 34.0, 40.0, 24.0, 43.0, 42.0, 26.0, 6.0, 49.0], [72.0, 21.0, 29.0, 82.0, 78.0, 72.0, 67.0, 103.0, 55.0, 77.0, 48.0, 22.0, 44.0, 13.0, 22.0, 7.0, 44.0, 40.0, 44.0, 61.0, 49.0, 33.0, 25.0, 30.0, 10.0, 1.0, 7.0, 73.0, 20.0, 77.0, 45.0, 25.0, 35.0, 9.0, 52.0, 22.0, 15.0, 33.0, 52.0, 79.0, 9.0, 34.0, 14.0, 29.0, 22.0, 1.0, 11.0, 36.0, 43.0]],
    "Name": "sCurve-0",
    "Overflow": 2511336.0,
    "Type": "Histo2d",
    "Underflow": 0.0,
    "x": {
        "AxisTitle": "Vcal",
        "Bins": 51,
        "High": 302.5,
        "Low": 47.5
    },
    "y": {
        "AxisTitle": "Occupancy",
        "Bins": 49,
        "High": 49.5,
        "Low": 0.5
    },
    "z": {
        "AxisTitle": "Number of pixels"
    }
}