time,Hardware,Voltage,Current
1626351084876,high-voltage,1,0.00977867
time,Hardware,Voltage,Current
1626351084876,high-voltage,2,0.0252073
time,Hardware,Voltage,Current
1626351084876,high-voltage,3,0.0324414
time,Hardware,Voltage,Current
1626351084876,high-voltage,4,0.0402501
time,Hardware,Voltage,Current
1626351084876,high-voltage,5,0.0458025
time,Hardware,Voltage,Current
1626351084876,high-voltage,6,0.0520605
time,Hardware,Voltage,Current
1626351084876,high-voltage,7,0.0586158
time,Hardware,Voltage,Current
1626351084876,high-voltage,8,0.0652977
time,Hardware,Voltage,Current
1626351084876,high-voltage,9,0.0714824
time,Hardware,Voltage,Current
1626351084876,high-voltage,10,0.0791586
time,Hardware,Voltage,Current
1626351084876,high-voltage,11,0.0843602
time,Hardware,Voltage,Current
1626351084876,high-voltage,12,0.0895495
time,Hardware,Voltage,Current
1626351084876,high-voltage,13,0.0938143
time,Hardware,Voltage,Current
1626351084876,high-voltage,14,0.0985366
time,Hardware,Voltage,Current
1626351084876,high-voltage,15,0.101774
time,Hardware,Voltage,Current
1626351084876,high-voltage,16,0.104633
time,Hardware,Voltage,Current
1626351084876,high-voltage,17,0.108263
time,Hardware,Voltage,Current
1626351084876,high-voltage,18,0.112226
time,Hardware,Voltage,Current
1626351084876,high-voltage,19,0.114248
time,Hardware,Voltage,Current
1626351084876,high-voltage,20,0.118411
time,Hardware,Voltage,Current
1626351084876,high-voltage,25,0.132927
time,Hardware,Voltage,Current
1626351084876,high-voltage,30,0.149601
time,Hardware,Voltage,Current
1626351084876,high-voltage,35,0.183738
time,Hardware,Voltage,Current
1626351084876,high-voltage,40,0.285526
time,Hardware,Voltage,Current
1626351084876,high-voltage,45,0.533694
time,Hardware,Voltage,Current
1626351084876,high-voltage,50,1.01314
time,Hardware,Voltage,Current
1626351084876,high-voltage,55,1.82105
time,Hardware,Voltage,Current
1626351084876,high-voltage,60,3.06885
time,Hardware,Voltage,Current
1626351084876,high-voltage,65,4.82039
time,Hardware,Voltage,Current
1626351084876,high-voltage,70,7.14482
time,Hardware,Voltage,Current
1626351084876,high-voltage,75,10
