{
    "Data": [1670.0, 20868.0, 18127.0, 8177.0, 2756.0, 835.0, 508.0, 598.0, 890.0, 1048.0, 1220.0, 1141.0, 965.0, 885.0, 682.0, 560.0, 484.0, 453.0, 401.0, 420.0, 427.0, 434.0, 445.0, 432.0, 485.0, 440.0, 492.0, 467.0, 479.0, 474.0, 495.0, 443.0, 452.0, 418.0, 444.0, 475.0, 429.0, 400.0, 365.0, 405.0, 409.0, 402.0, 309.0, 335.0, 283.0, 298.0, 305.0, 300.0, 245.0, 230.0, 108.0],
    "Name": "Chi2Dist-0",
    "Overflow": 0.0,
    "Type": "Histo1d",
    "Underflow": 0.0,
    "x": {
        "AxisTitle": "Fit Chi/ndf",
        "Bins": 51,
        "High": 2.5250000953674318,
        "Low": -0.02500000037252903
    },
    "y": {
        "AxisTitle": "Number of Pixels"
    },
    "z": {
        "AxisTitle": "z"
    }
}