time,Hardware,Voltage,Current
1626299893287,high-voltage,1,0.0132124
time,Hardware,Voltage,Current
1626299893287,high-voltage,2,0.0307804
time,Hardware,Voltage,Current
1626299893287,high-voltage,3,0.0422086
time,Hardware,Voltage,Current
1626299893287,high-voltage,4,0.0513427
time,Hardware,Voltage,Current
1626299893287,high-voltage,5,0.0610846
time,Hardware,Voltage,Current
1626299893287,high-voltage,6,0.0690161
time,Hardware,Voltage,Current
1626299893287,high-voltage,7,0.0770793
time,Hardware,Voltage,Current
1626299893287,high-voltage,8,0.0853184
time,Hardware,Voltage,Current
1626299893287,high-voltage,9,0.0929338
time,Hardware,Voltage,Current
1626299893287,high-voltage,10,0.0979748
time,Hardware,Voltage,Current
1626299893287,high-voltage,11,0.10323
time,Hardware,Voltage,Current
1626299893287,high-voltage,12,0.108822
time,Hardware,Voltage,Current
1626299893287,high-voltage,13,0.113466
time,Hardware,Voltage,Current
1626299893287,high-voltage,14,0.116118
time,Hardware,Voltage,Current
1626299893287,high-voltage,15,0.121187
time,Hardware,Voltage,Current
1626299893287,high-voltage,16,0.123932
time,Hardware,Voltage,Current
1626299893287,high-voltage,17,0.128653
time,Hardware,Voltage,Current
1626299893287,high-voltage,18,0.132048
time,Hardware,Voltage,Current
1626299893287,high-voltage,19,0.136114
time,Hardware,Voltage,Current
1626299893287,high-voltage,20,0.139733
time,Hardware,Voltage,Current
1626299893287,high-voltage,25,0.158704
time,Hardware,Voltage,Current
1626299893287,high-voltage,30,0.181238
time,Hardware,Voltage,Current
1626299893287,high-voltage,35,0.227076
time,Hardware,Voltage,Current
1626299893287,high-voltage,40,0.350965
time,Hardware,Voltage,Current
1626299893287,high-voltage,45,0.616552
time,Hardware,Voltage,Current
1626299893287,high-voltage,50,1.07868
time,Hardware,Voltage,Current
1626299893287,high-voltage,55,1.83917
time,Hardware,Voltage,Current
1626299893287,high-voltage,60,2.99635
time,Hardware,Voltage,Current
1626299893287,high-voltage,65,4.6064
time,Hardware,Voltage,Current
1626299893287,high-voltage,70,6.74832
time,Hardware,Voltage,Current
1626299893287,high-voltage,75,9.62046
time,Hardware,Voltage,Current
1626299893287,high-voltage,80,10
