{
    "Data": [0.0, 0.0, 0.0, 0.0, 0.0, 0.0, 0.0, 0.0, 0.0, 0.0, 0.0, 0.0, 0.0, 0.0, 1.0, 0.0, 1.0, 10.0, 224.0, 148.0, 19.0, 188.0, 1463.0, 1453.0, 333.0, 625.0, 1911.0, 2124.0, 730.0, 849.0, 1445.0, 1644.0, 833.0, 562.0, 717.0, 868.0, 651.0, 411.0, 664.0, 792.0, 660.0, 713.0, 1467.0, 2703.0, 2214.0, 1429.0, 2149.0, 3167.0, 4027.0, 3123.0, 2381.0, 2539.0, 3074.0, 2700.0, 2035.0, 1835.0, 1734.0, 2041.0, 1645.0, 1407.0, 1218.0, 1150.0, 1071.0, 830.0, 764.0, 659.0, 651.0, 606.0, 511.0, 488.0, 456.0, 405.0, 333.0, 289.0, 260.0, 283.0, 273.0, 198.0, 188.0, 150.0, 139.0, 169.0, 136.0, 113.0, 103.0, 84.0, 98.0, 82.0, 69.0, 95.0, 76.0, 71.0, 62.0, 51.0, 56.0, 48.0, 48.0, 36.0, 46.0, 29.0, 30.0, 21.0, 26.0, 30.0, 27.0, 34.0, 24.0, 22.0, 21.0, 17.0, 21.0, 16.0, 19.0, 17.0, 10.0, 10.0, 13.0, 10.0, 12.0, 13.0, 15.0, 10.0, 10.0, 9.0, 14.0, 9.0, 10.0, 4.0, 11.0, 6.0, 4.0, 8.0, 9.0, 7.0, 7.0, 14.0, 12.0, 5.0, 10.0, 7.0, 5.0, 2.0, 3.0, 4.0, 2.0, 3.0, 3.0, 5.0, 2.0, 6.0, 5.0, 3.0, 5.0, 5.0, 6.0, 3.0, 5.0, 5.0, 2.0, 3.0, 2.0, 1.0, 3.0, 3.0, 1.0, 1.0, 1.0, 4.0, 1.0, 2.0, 1.0, 1.0, 2.0, 4.0, 4.0, 3.0, 4.0, 1.0, 2.0, 5.0, 4.0, 1.0, 2.0, 5.0, 4.0, 3.0, 1.0, 5.0, 2.0, 1.0, 1.0, 1.0, 0.0, 0.0, 3.0, 2.0, 1.0, 3.0, 2.0, 1.0, 2.0],
    "Name": "TimePerFitDist-0",
    "Overflow": 150.0,
    "Type": "Histo1d",
    "Underflow": 0.0,
    "x": {
        "AxisTitle": "Fit Time [us]",
        "Bins": 201,
        "High": 401.0,
        "Low": -1.0
    },
    "y": {
        "AxisTitle": "Number of Pixels"
    },
    "z": {
        "AxisTitle": "z"
    }
}