{
    "port" : ["/dev/ttyACM0","/dev/ttyACM1"],
    "pin": [[0,0,1,2,3,4,5],[0,0,1,2]],
    "maxTemp": 55,
    "name": [["x","0x2164", "0x2124", "0x2162","0x2142","0x2151", "0x2144"],["x","0x1B47", "0x1B4A","0x1B4B"]]
}
