{
    "Data": [0.0, 0.0, 0.0, 0.0, 0.0, 0.0, 0.0, 0.0, 0.0, 0.0, 0.0, 0.0, 0.0, 11.0, 5.0, 1.0, 4.0, 248.0, 486.0, 128.0, 100.0, 1029.0, 2135.0, 1160.0, 557.0, 1762.0, 2261.0, 1382.0, 920.0, 1419.0, 1645.0, 1201.0, 912.0, 791.0, 728.0, 599.0, 543.0, 668.0, 849.0, 765.0, 550.0, 768.0, 1582.0, 2563.0, 1925.0, 1348.0, 2112.0, 3183.0, 3426.0, 3038.0, 2397.0, 2226.0, 2540.0, 2182.0, 1796.0, 1773.0, 1935.0, 1908.0, 1880.0, 1494.0, 1353.0, 1195.0, 956.0, 794.0, 725.0, 676.0, 738.0, 548.0, 516.0, 462.0, 501.0, 421.0, 371.0, 325.0, 312.0, 312.0, 260.0, 263.0, 210.0, 208.0, 181.0, 174.0, 153.0, 131.0, 135.0, 97.0, 114.0, 87.0, 89.0, 73.0, 74.0, 61.0, 64.0, 52.0, 57.0, 51.0, 48.0, 54.0, 32.0, 41.0, 46.0, 35.0, 34.0, 32.0, 38.0, 31.0, 25.0, 35.0, 27.0, 31.0, 24.0, 33.0, 17.0, 27.0, 12.0, 15.0, 15.0, 21.0, 20.0, 14.0, 13.0, 16.0, 12.0, 15.0, 13.0, 12.0, 10.0, 9.0, 9.0, 13.0, 4.0, 6.0, 8.0, 6.0, 6.0, 5.0, 5.0, 4.0, 12.0, 13.0, 5.0, 7.0, 4.0, 2.0, 3.0, 2.0, 3.0, 3.0, 2.0, 2.0, 3.0, 2.0, 2.0, 4.0, 5.0, 1.0, 2.0, 5.0, 3.0, 3.0, 2.0, 1.0, 3.0, 6.0, 2.0, 1.0, 1.0, 1.0, 0.0, 3.0, 3.0, 2.0, 1.0, 1.0, 0.0, 0.0, 1.0, 0.0, 0.0, 0.0, 1.0, 1.0, 3.0, 2.0, 4.0, 0.0, 0.0, 1.0, 1.0, 0.0, 0.0, 0.0, 0.0, 0.0, 1.0, 0.0, 2.0, 0.0, 1.0, 0.0, 1.0],
    "Name": "TimePerFitDist-0",
    "Overflow": 88.0,
    "Type": "Histo1d",
    "Underflow": 0.0,
    "x": {
        "AxisTitle": "Fit Time [us]",
        "Bins": 201,
        "High": 401.0,
        "Low": -1.0
    },
    "y": {
        "AxisTitle": "Number of Pixels"
    },
    "z": {
        "AxisTitle": "z"
    }
}