{
    "Data": [0.0, 0.0, 0.0, 0.0, 0.0, 0.0, 0.0, 0.0, 0.0, 0.0, 0.0, 0.0, 0.0, 0.0, 0.0, 0.0, 0.0, 0.0, 2.0, 1.0, 9.0, 3.0, 10.0, 6.0, 20.0, 17.0, 22.0, 36.0, 31.0, 2.0, 39.0, 42.0, 49.0, 45.0, 49.0, 49.0, 49.0, 50.0, 50.0, 25.0, 50.0, 41.0, 2.0, 50.0, 50.0, 4.0, 11.0, 50.0, 50.0, 50.0, 12.0],
    "Name": "Scurve-60-96",
    "Overflow": 0.0,
    "Type": "Histo1d",
    "Underflow": 0.0,
    "x": {
        "AxisTitle": "Vcal",
        "Bins": 51,
        "High": 302.5,
        "Low": 47.5
    },
    "y": {
        "AxisTitle": "Occupancy"
    },
    "z": {
        "AxisTitle": "z"
    }
}