{
    "Data": [0.0, 56955.0, 16395.0, 4471.0, 89.0, 3.0, 0.0, 0.0, 0.0, 0.0, 0.0],
    "Name": "StatusDist-0",
    "Overflow": 0.0,
    "Type": "Histo1d",
    "Underflow": 0.0,
    "x": {
        "AxisTitle": "Fit Status ",
        "Bins": 11,
        "High": 10.5,
        "Low": -0.5
    },
    "y": {
        "AxisTitle": "Number of Pixels"
    },
    "z": {
        "AxisTitle": "z"
    }
}