{
    "Data": [233.0, 184.0, 14.0, 5.0, 9.0, 6.0, 13.0, 32.0, 71.0, 208.0, 608.0, 1402.0, 2735.0, 3936.0, 4345.0, 4094.0, 3034.0, 2051.0, 1493.0, 1477.0, 1589.0, 1624.0, 1469.0, 1204.0, 856.0, 505.0, 295.0, 218.0, 136.0, 143.0, 150.0, 170.0, 227.0, 317.0, 408.0, 531.0, 667.0, 847.0, 1111.0, 1186.0, 1363.0, 1447.0, 1530.0, 1516.0, 1476.0, 1453.0, 1293.0, 1154.0, 991.0, 863.0, 732.0, 626.0, 549.0, 387.0, 356.0, 308.0, 249.0, 221.0, 184.0, 148.0, 145.0, 122.0, 112.0, 115.0, 80.0, 85.0, 85.0, 62.0, 59.0, 62.0, 59.0, 45.0, 44.0, 40.0, 39.0, 42.0, 31.0, 38.0, 32.0, 31.0, 28.0, 35.0, 22.0, 16.0, 20.0, 21.0, 15.0, 23.0, 16.0, 18.0, 13.0, 14.0, 13.0, 9.0, 13.0, 7.0, 8.0, 5.0, 6.0, 2.0, 8.0, 9.0, 7.0, 5.0, 12.0, 10.0, 10.0, 6.0, 4.0, 10.0, 5.0, 2.0, 4.0, 8.0, 9.0, 3.0, 3.0, 3.0, 5.0, 1.0, 7.0, 2.0, 5.0, 1.0, 6.0, 6.0, 5.0, 2.0, 2.0, 7.0, 1.0, 5.0, 6.0, 2.0, 4.0, 3.0, 3.0, 3.0, 2.0, 3.0, 2.0, 4.0, 1.0, 6.0, 3.0, 1.0, 7.0, 0.0, 9.0, 4.0, 3.0, 6.0, 5.0, 4.0, 3.0, 5.0, 4.0, 4.0, 3.0, 2.0, 0.0, 2.0, 1.0, 3.0, 6.0, 5.0, 3.0, 2.0, 2.0, 2.0, 3.0, 1.0, 2.0, 1.0, 1.0, 6.0, 3.0, 5.0, 3.0, 5.0, 1.0, 5.0, 2.0, 5.0, 5.0, 1.0, 1.0],
    "Name": "NoiseDist-0",
    "Overflow": 460.0,
    "Type": "Histo1d",
    "Underflow": 0.0,
    "x": {
        "AxisTitle": "Noise [e]",
        "Bins": 187,
        "High": 936.0,
        "Low": -2.0
    },
    "y": {
        "AxisTitle": "Number of Pixels"
    },
    "z": {
        "AxisTitle": "z"
    }
}