{
    "Data": [0.0, 0.0, 0.0, 0.0, 0.0, 0.0, 0.0, 0.0, 0.0, 0.0, 0.0, 0.0, 0.0, 0.0, 0.0, 0.0, 0.0, 1.0, 1.0, 0.0, 2.0, 1.0, 0.0, 1.0, 1.0, 5.0, 14.0, 7.0, 12.0, 2.0, 0.0, 0.0, 4.0, 8.0, 10.0, 7.0, 36.0, 2.0, 6.0, 4.0, 8.0, 4.0, 20.0, 34.0, 15.0, 13.0, 41.0, 13.0, 50.0, 50.0, 28.0],
    "Name": "Scurve-60-96",
    "Overflow": 0.0,
    "Type": "Histo1d",
    "Underflow": 0.0,
    "x": {
        "AxisTitle": "Vcal",
        "Bins": 51,
        "High": 302.5,
        "Low": 47.5
    },
    "y": {
        "AxisTitle": "Occupancy"
    },
    "z": {
        "AxisTitle": "z"
    }
}