{
    "Data": [0.0, 0.0, 0.0, 0.0, 0.0, 0.0, 0.0, 0.0, 0.0, 0.0, 0.0, 0.0, 0.0, 0.0, 0.0, 0.0, 0.0, 0.0, 0.0, 0.0, 0.0, 1.0, 0.0, 0.0, 0.0, 2.0, 0.0, 9.0, 3.0, 1.0, 10.0, 6.0, 5.0, 13.0, 2.0, 5.0, 40.0, 7.0, 7.0, 8.0, 1.0, 30.0, 1.0, 50.0, 50.0, 50.0, 47.0, 50.0, 50.0, 50.0, 50.0],
    "Name": "Scurve-10-96",
    "Overflow": 0.0,
    "Type": "Histo1d",
    "Underflow": 0.0,
    "x": {
        "AxisTitle": "Vcal",
        "Bins": 51,
        "High": 302.5,
        "Low": 47.5
    },
    "y": {
        "AxisTitle": "Occupancy"
    },
    "z": {
        "AxisTitle": "z"
    }
}