time,Hardware,Voltage,Current
1623309800893,high-voltage,1,0.0588276
time,Hardware,Voltage,Current
1623309800893,high-voltage,2,0.0715415
time,Hardware,Voltage,Current
1623309800893,high-voltage,3,0.0833323
