{
    "Data": [13.0, 27.0, 3.0, 0.0, 4.0, 81.0, 465.0, 1440.0, 3036.0, 4305.0, 4560.0, 3702.0, 2955.0, 2575.0, 2336.0, 2212.0, 2197.0, 1917.0, 1795.0, 1866.0, 2088.0, 2255.0, 2338.0, 2286.0, 2052.0, 1597.0, 1135.0, 796.0, 547.0, 415.0, 410.0, 465.0, 582.0, 729.0, 974.0, 1222.0, 1451.0, 1672.0, 1876.0, 1927.0, 1995.0, 1816.0, 1703.0, 1538.0, 1344.0, 1076.0, 904.0, 752.0, 580.0, 454.0, 302.0, 210.0, 184.0, 130.0, 96.0, 76.0, 62.0, 58.0, 47.0, 38.0, 22.0, 29.0, 24.0, 17.0, 15.0, 16.0, 12.0, 7.0, 6.0, 10.0, 9.0, 6.0, 4.0, 5.0, 4.0, 1.0, 0.0, 0.0, 3.0, 1.0, 5.0, 3.0, 1.0, 3.0, 2.0, 1.0, 2.0, 0.0, 2.0, 2.0],
    "Name": "NoiseDist-0",
    "Overflow": 14.0,
    "Type": "Histo1d",
    "Underflow": 0.0,
    "x": {
        "AxisTitle": "Noise [e]",
        "Bins": 90,
        "High": 451.0,
        "Low": -2.0
    },
    "y": {
        "AxisTitle": "Number of Pixels"
    },
    "z": {
        "AxisTitle": "z"
    }
}