{
    "Data": [0.0, 0.0, 0.0, 0.0, 0.0, 0.0, 0.0, 0.0, 0.0, 0.0, 0.0, 0.0, 0.0, 0.0, 0.0, 0.0, 0.0, 4.0, 1.0, 13.0, 12.0, 18.0, 27.0, 24.0, 30.0, 34.0, 41.0, 45.0, 40.0, 48.0, 50.0, 49.0, 49.0, 22.0, 50.0, 15.0, 50.0, 50.0, 50.0, 50.0, 50.0, 4.0, 50.0, 23.0, 50.0, 50.0, 50.0, 19.0, 50.0, 50.0, 50.0],
    "Name": "Scurve-60-96",
    "Overflow": 0.0,
    "Type": "Histo1d",
    "Underflow": 0.0,
    "x": {
        "AxisTitle": "Vcal",
        "Bins": 51,
        "High": 302.5,
        "Low": 47.5
    },
    "y": {
        "AxisTitle": "Occupancy"
    },
    "z": {
        "AxisTitle": "z"
    }
}