time,Hardware,Voltage,Current
1626318915907,high-voltage-3,1,0.286176
time,Hardware,Voltage,Current
1626318915907,high-voltage-3,2,0.307539
time,Hardware,Voltage,Current
1626318915907,high-voltage-3,3,0.326321
time,Hardware,Voltage,Current
1626318915907,high-voltage-3,4,0.341289
time,Hardware,Voltage,Current
1626318915907,high-voltage-3,5,0.354313
time,Hardware,Voltage,Current
1626318915907,high-voltage-3,6,0.366204
time,Hardware,Voltage,Current
1626318915907,high-voltage-3,7,0.379651
time,Hardware,Voltage,Current
1626318915907,high-voltage-3,8,0.396605
time,Hardware,Voltage,Current
1626318915907,high-voltage-3,9,0.412989
time,Hardware,Voltage,Current
1626318915907,high-voltage-3,10,0.428288
time,Hardware,Voltage,Current
1626318915907,high-voltage-3,11,0.445903
time,Hardware,Voltage,Current
1626318915907,high-voltage-3,12,0.461067
time,Hardware,Voltage,Current
1626318915907,high-voltage-3,13,0.475217
time,Hardware,Voltage,Current
1626318915907,high-voltage-3,14,0.488881
time,Hardware,Voltage,Current
1626318915907,high-voltage-3,15,0.502137
time,Hardware,Voltage,Current
1626318915907,high-voltage-3,16,0.512487
time,Hardware,Voltage,Current
1626318915907,high-voltage-3,17,0.524599
time,Hardware,Voltage,Current
1626318915907,high-voltage-3,18,0.534091
time,Hardware,Voltage,Current
1626318915907,high-voltage-3,19,0.546428
time,Hardware,Voltage,Current
1626318915907,high-voltage-3,20,0.555906
time,Hardware,Voltage,Current
1626318915907,high-voltage-3,25,0.599058
time,Hardware,Voltage,Current
1626318915907,high-voltage-3,30,0.639326
time,Hardware,Voltage,Current
1626318915907,high-voltage-3,35,0.672598
time,Hardware,Voltage,Current
1626318915907,high-voltage-3,40,0.701868
time,Hardware,Voltage,Current
1626318915907,high-voltage-3,45,0.728411
time,Hardware,Voltage,Current
1626318915907,high-voltage-3,50,0.75517
time,Hardware,Voltage,Current
1626318915907,high-voltage-3,55,0.780691
time,Hardware,Voltage,Current
1626318915907,high-voltage-3,60,0.803594
time,Hardware,Voltage,Current
1626318915907,high-voltage-3,65,0.82805
time,Hardware,Voltage,Current
1626318915907,high-voltage-3,70,0.852468
time,Hardware,Voltage,Current
1626318915907,high-voltage-3,75,0.87949
time,Hardware,Voltage,Current
1626318915907,high-voltage-3,80,0.903073
time,Hardware,Voltage,Current
1626318915907,high-voltage-3,85,0.926277
time,Hardware,Voltage,Current
1626318915907,high-voltage-3,90,0.952744
time,Hardware,Voltage,Current
1626318915907,high-voltage-3,95,0.976475
time,Hardware,Voltage,Current
1626318915907,high-voltage-3,100,0.997769
