{
    "Data": [0.0, 54538.0, 15168.0, 4893.0, 85.0, 8.0, 0.0, 0.0, 0.0, 0.0, 0.0],
    "Name": "StatusDist-0",
    "Overflow": 0.0,
    "Type": "Histo1d",
    "Underflow": 0.0,
    "x": {
        "AxisTitle": "Fit Status ",
        "Bins": 11,
        "High": 10.5,
        "Low": -0.5
    },
    "y": {
        "AxisTitle": "Number of Pixels"
    },
    "z": {
        "AxisTitle": "z"
    }
}