time,Hardware,Voltage,Current
1626617957581,high-voltage-3,1,0.354836
time,Hardware,Voltage,Current
1626617957581,high-voltage-3,2,0.377831
time,Hardware,Voltage,Current
1626617957581,high-voltage-3,3,0.398318
time,Hardware,Voltage,Current
1626617957581,high-voltage-3,4,0.415253
time,Hardware,Voltage,Current
1626617957581,high-voltage-3,5,0.428249
time,Hardware,Voltage,Current
1626617957581,high-voltage-3,6,0.442786
time,Hardware,Voltage,Current
1626617957581,high-voltage-3,7,0.456187
time,Hardware,Voltage,Current
1626617957581,high-voltage-3,8,0.469416
time,Hardware,Voltage,Current
1626617957581,high-voltage-3,9,0.486336
time,Hardware,Voltage,Current
1626617957581,high-voltage-3,10,0.501263
time,Hardware,Voltage,Current
1626617957581,high-voltage-3,11,0.516616
time,Hardware,Voltage,Current
1626617957581,high-voltage-3,12,0.530532
time,Hardware,Voltage,Current
1626617957581,high-voltage-3,13,0.545366
time,Hardware,Voltage,Current
1626617957581,high-voltage-3,14,0.559808
time,Hardware,Voltage,Current
1626617957581,high-voltage-3,15,0.570826
time,Hardware,Voltage,Current
1626617957581,high-voltage-3,16,0.580283
time,Hardware,Voltage,Current
1626617957581,high-voltage-3,17,0.592059
time,Hardware,Voltage,Current
1626617957581,high-voltage-3,18,0.606712
time,Hardware,Voltage,Current
1626617957581,high-voltage-3,19,0.619409
time,Hardware,Voltage,Current
1626617957581,high-voltage-3,20,0.630792
time,Hardware,Voltage,Current
1626617957581,high-voltage-3,25,0.675922
time,Hardware,Voltage,Current
1626617957581,high-voltage-3,30,0.712582
time,Hardware,Voltage,Current
1626617957581,high-voltage-3,35,0.745768
time,Hardware,Voltage,Current
1626617957581,high-voltage-3,40,0.775817
time,Hardware,Voltage,Current
1626617957581,high-voltage-3,45,0.804592
time,Hardware,Voltage,Current
1626617957581,high-voltage-3,50,0.830189
time,Hardware,Voltage,Current
1626617957581,high-voltage-3,55,0.854031
time,Hardware,Voltage,Current
1626617957581,high-voltage-3,60,0.87767
time,Hardware,Voltage,Current
1626617957581,high-voltage-3,65,0.901523
time,Hardware,Voltage,Current
1626617957581,high-voltage-3,70,0.926229
time,Hardware,Voltage,Current
1626617957581,high-voltage-3,75,0.951103
time,Hardware,Voltage,Current
1626617957581,high-voltage-3,80,0.975085
time,Hardware,Voltage,Current
1626617957581,high-voltage-3,85,1.0037
time,Hardware,Voltage,Current
1626617957581,high-voltage-3,90,1.03188
time,Hardware,Voltage,Current
1626617957581,high-voltage-3,95,1.06026
time,Hardware,Voltage,Current
1626617957581,high-voltage-3,100,1.08749
