time,Hardware,Voltage,Current
1621632978377,high-voltage,1,0.0608964
time,Hardware,Voltage,Current
1621632978377,high-voltage,2,0.112635
time,Hardware,Voltage,Current
1621632978377,high-voltage,3,0.195614
time,Hardware,Voltage,Current
1621632978377,high-voltage,4,0.300659
time,Hardware,Voltage,Current
1621632978377,high-voltage,5,0.410276
time,Hardware,Voltage,Current
1621632978377,high-voltage,6,0.563123
time,Hardware,Voltage,Current
1621632978377,high-voltage,7,0.775344
time,Hardware,Voltage,Current
1621632978377,high-voltage,8,1.06149
time,Hardware,Voltage,Current
1621632978377,high-voltage,9,1.38876
time,Hardware,Voltage,Current
1621632978377,high-voltage,10,1.76915
time,Hardware,Voltage,Current
1621632978377,high-voltage,11,2.35909
time,Hardware,Voltage,Current
1621632978377,high-voltage,12,2.9442
time,Hardware,Voltage,Current
1621632978377,high-voltage,13,3.63836
time,Hardware,Voltage,Current
1621632978377,high-voltage,14,4.52362
time,Hardware,Voltage,Current
1621632978377,high-voltage,15,5.46112
time,Hardware,Voltage,Current
1621632978377,high-voltage,16,6.48946
time,Hardware,Voltage,Current
1621632978377,high-voltage,17,7.62393
time,Hardware,Voltage,Current
1621632978377,high-voltage,18,8.78629
time,Hardware,Voltage,Current
1621632978377,high-voltage,19,9.72719
time,Hardware,Voltage,Current
1621632978377,high-voltage,20,10.0001
