{
    "Data": [0.0, 0.0, 0.0, 0.0, 0.0, 0.0, 0.0, 0.0, 0.0, 0.0, 0.0, 0.0, 0.0, 0.0, 0.0, 0.0, 0.0, 0.0, 0.0, 0.0, 0.0, 1.0, 0.0, 0.0, 1.0, 3.0, 5.0, 12.0, 17.0, 11.0, 25.0, 19.0, 11.0, 11.0, 19.0, 32.0, 35.0, 120.0, 273.0, 388.0, 241.0, 368.0, 1040.0, 2394.0, 2036.0, 1303.0, 1594.0, 2457.0, 3685.0, 3088.0, 2307.0, 1980.0, 2421.0, 2217.0, 1824.0, 1591.0, 1506.0, 1768.0, 1706.0, 1648.0, 1238.0, 1097.0, 899.0, 785.0, 654.0, 603.0, 667.0, 580.0, 491.0, 428.0, 414.0, 422.0, 359.0, 306.0, 294.0, 247.0, 263.0, 212.0, 174.0, 185.0, 188.0, 190.0, 165.0, 115.0, 126.0, 121.0, 96.0, 93.0, 73.0, 85.0, 85.0, 95.0, 91.0, 73.0, 59.0, 58.0, 54.0, 50.0, 55.0, 51.0, 43.0, 52.0, 26.0, 31.0, 29.0, 30.0, 44.0, 52.0, 39.0, 43.0, 35.0, 37.0, 27.0, 14.0, 13.0, 20.0, 23.0, 22.0, 21.0, 15.0, 19.0, 22.0, 11.0, 12.0, 19.0, 12.0, 16.0, 15.0, 13.0, 7.0, 10.0, 12.0, 7.0, 6.0, 7.0, 11.0, 10.0, 6.0, 6.0, 7.0, 5.0, 7.0, 4.0, 4.0, 6.0, 3.0, 5.0, 2.0, 3.0, 2.0, 7.0, 3.0, 4.0, 4.0, 2.0, 5.0, 3.0, 3.0, 1.0, 5.0, 5.0, 2.0, 2.0, 3.0, 1.0, 0.0, 0.0, 0.0, 1.0, 0.0, 1.0, 1.0, 2.0, 2.0, 1.0, 1.0, 1.0, 2.0, 2.0, 2.0, 0.0, 0.0, 2.0, 0.0, 1.0, 0.0, 1.0, 0.0, 0.0, 2.0, 0.0, 0.0, 1.0, 2.0, 3.0, 2.0, 1.0, 0.0, 6.0, 0.0, 2.0],
    "Name": "TimePerFitDist-0",
    "Overflow": 174.0,
    "Type": "Histo1d",
    "Underflow": 0.0,
    "x": {
        "AxisTitle": "Fit Time [us]",
        "Bins": 201,
        "High": 401.0,
        "Low": -1.0
    },
    "y": {
        "AxisTitle": "Number of Pixels"
    },
    "z": {
        "AxisTitle": "z"
    }
}