{
    "Data": [0.0, 0.0, 0.0, 0.0, 0.0, 0.0, 0.0, 0.0, 0.0, 0.0, 0.0, 0.0, 0.0, 0.0, 0.0, 0.0, 0.0, 0.0, 0.0, 0.0, 0.0, 0.0, 0.0, 0.0, 0.0, 0.0, 0.0, 0.0, 0.0, 0.0, 0.0, 0.0, 0.0, 0.0, 0.0, 0.0, 0.0, 0.0, 0.0, 0.0, 0.0, 0.0, 0.0, 0.0, 0.0, 0.0, 0.0, 0.0, 0.0, 0.0, 29.0, 43.0, 52.0, 61.0, 73.0, 86.0, 116.0, 112.0, 134.0, 132.0, 166.0, 187.0, 223.0, 193.0, 258.0, 282.0, 296.0, 329.0, 358.0, 379.0, 444.0, 536.0, 467.0, 564.0, 611.0, 642.0, 687.0, 638.0, 750.0, 762.0, 778.0, 855.0, 942.0, 1001.0, 1160.0, 1405.0, 1595.0, 1985.0, 2328.0, 2471.0, 2796.0, 2894.0, 2880.0, 2833.0, 2592.0, 2300.0, 1992.0, 1630.0, 1303.0, 1079.0, 826.0, 691.0, 522.0, 478.0, 392.0, 302.0, 274.0, 244.0, 196.0, 146.0, 166.0, 113.0, 109.0, 90.0, 70.0, 89.0, 56.0, 41.0, 39.0, 40.0, 39.0, 41.0, 23.0, 34.0, 28.0, 17.0, 18.0, 17.0, 12.0, 19.0, 20.0, 12.0, 11.0, 6.0, 10.0, 12.0, 21.0, 7.0, 7.0, 11.0, 10.0, 7.0, 5.0, 7.0, 7.0, 6.0, 4.0, 7.0, 5.0, 5.0, 5.0, 4.0, 4.0, 2.0, 4.0, 8.0, 5.0, 8.0, 5.0, 14.0, 14.0, 17.0, 21.0, 12.0, 23.0, 33.0, 45.0, 46.0, 66.0, 68.0, 89.0, 104.0, 133.0, 150.0, 147.0, 187.0, 203.0, 260.0, 297.0, 312.0, 320.0, 399.0, 419.0, 448.0, 458.0, 514.0, 567.0, 611.0, 620.0, 642.0, 701.0, 738.0, 714.0, 764.0, 832.0, 821.0, 820.0, 790.0, 797.0, 773.0, 790.0, 731.0, 666.0, 701.0, 671.0, 613.0, 575.0, 537.0, 537.0, 444.0, 404.0, 376.0, 324.0, 292.0, 255.0, 238.0, 226.0, 166.0, 147.0, 132.0, 115.0, 95.0, 82.0, 90.0, 50.0, 44.0, 36.0, 28.0, 22.0, 27.0, 17.0, 11.0, 7.0, 7.0, 3.0, 4.0, 4.0, 1.0, 2.0, 4.0, 0.0, 0.0, 1.0, 2.0, 0.0, 0.0, 0.0, 0.0, 0.0, 0.0, 0.0, 0.0, 0.0, 0.0, 0.0, 0.0, 0.0, 0.0, 0.0, 0.0, 1.0, 0.0, 0.0, 0.0, 0.0, 0.0, 0.0, 0.0, 0.0, 0.0, 0.0, 0.0, 0.0, 0.0, 0.0, 0.0, 0.0, 0.0, 0.0, 0.0, 0.0, 0.0, 0.0, 0.0, 0.0, 0.0, 0.0, 0.0, 0.0, 0.0, 0.0, 0.0, 0.0, 0.0, 0.0, 0.0, 0.0, 0.0, 0.0, 0.0, 0.0, 0.0, 0.0, 0.0, 0.0, 0.0, 0.0, 0.0, 0.0, 0.0, 0.0, 0.0, 0.0, 0.0, 0.0, 0.0, 0.0, 0.0, 0.0, 0.0, 0.0, 0.0, 0.0, 0.0, 0.0, 0.0, 0.0, 0.0, 0.0, 0.0, 0.0, 0.0, 0.0, 0.0, 0.0, 0.0, 0.0, 0.0, 0.0, 0.0, 0.0, 0.0, 0.0, 0.0, 0.0, 0.0, 0.0, 0.0, 0.0, 0.0, 0.0, 0.0, 0.0, 0.0, 0.0, 0.0, 0.0, 0.0, 0.0, 0.0, 0.0, 0.0, 0.0, 0.0, 0.0, 0.0, 0.0, 0.0, 0.0, 0.0, 0.0, 0.0, 0.0, 0.0, 0.0, 0.0, 0.0, 0.0, 0.0],
    "Name": "ThresholdDist-0",
    "Overflow": 0.0,
    "Type": "Histo1d",
    "Underflow": 0.0,
    "x": {
        "AxisTitle": "Threshold [e]",
        "Bins": 379,
        "High": 3785.0,
        "Low": -5.0
    },
    "y": {
        "AxisTitle": "Number of Pixels"
    },
    "z": {
        "AxisTitle": "z"
    }
}