{
    "Data": [0.0, 0.0, 0.0, 0.0, 0.0, 0.0, 0.0, 0.0, 0.0, 0.0, 0.0, 0.0, 0.0, 0.0, 0.0, 0.0, 0.0, 3.0, 2.0, 5.0, 10.0, 6.0, 22.0, 26.0, 6.0, 4.0, 26.0, 13.0, 26.0, 39.0, 43.0, 44.0, 45.0, 9.0, 50.0, 17.0, 50.0, 50.0, 50.0, 50.0, 50.0, 43.0, 50.0, 50.0, 40.0, 36.0, 48.0, 50.0, 23.0, 50.0, 50.0],
    "Name": "Scurve-20-96",
    "Overflow": 0.0,
    "Type": "Histo1d",
    "Underflow": 0.0,
    "x": {
        "AxisTitle": "Vcal",
        "Bins": 51,
        "High": 302.5,
        "Low": 47.5
    },
    "y": {
        "AxisTitle": "Occupancy"
    },
    "z": {
        "AxisTitle": "z"
    }
}