{
    "Data": [[2979.0, 1117.0, 675.0, 445.0, 291.0, 218.0, 170.0, 140.0, 85.0, 80.0, 76.0, 60.0, 42.0, 44.0, 22.0, 36.0, 21.0, 39.0, 26.0, 18.0, 17.0, 16.0, 19.0, 10.0, 12.0, 11.0, 10.0, 9.0, 8.0, 9.0, 10.0, 11.0, 7.0, 6.0, 10.0, 8.0, 7.0, 8.0, 7.0, 4.0, 7.0, 3.0, 5.0, 1.0, 2.0, 12.0, 3.0, 5.0, 6.0], [3677.0, 1768.0, 1087.0, 784.0, 515.0, 418.0, 320.0, 255.0, 204.0, 185.0, 158.0, 109.0, 122.0, 84.0, 90.0, 84.0, 57.0, 48.0, 54.0, 42.0, 45.0, 34.0, 20.0, 28.0, 23.0, 19.0, 20.0, 28.0, 20.0, 18.0, 10.0, 20.0, 13.0, 13.0, 10.0, 12.0, 15.0, 9.0, 13.0, 10.0, 13.0, 8.0, 5.0, 10.0, 8.0, 8.0, 5.0, 7.0, 8.0], [4068.0, 2249.0, 1477.0, 1154.0, 855.0, 704.0, 527.0, 463.0, 382.0, 326.0, 301.0, 239.0, 226.0, 198.0, 170.0, 153.0, 142.0, 131.0, 118.0, 101.0, 91.0, 108.0, 74.0, 72.0, 67.0, 63.0, 49.0, 45.0, 32.0, 46.0, 37.0, 34.0, 32.0, 27.0, 30.0, 26.0, 25.0, 17.0, 18.0, 13.0, 12.0, 16.0, 14.0, 13.0, 21.0, 16.0, 12.0, 15.0, 19.0], [4374.0, 2397.0, 1729.0, 1336.0, 1117.0, 937.0, 818.0, 717.0, 652.0, 556.0, 489.0, 413.0, 403.0, 339.0, 317.0, 292.0, 249.0, 201.0, 212.0, 189.0, 205.0, 168.0, 165.0, 187.0, 119.0, 124.0, 113.0, 110.0, 88.0, 103.0, 86.0, 85.0, 84.0, 58.0, 77.0, 86.0, 51.0, 59.0, 44.0, 40.0, 48.0, 35.0, 31.0, 34.0, 26.0, 31.0, 28.0, 26.0, 26.0], [5985.0, 2891.0, 1859.0, 1490.0, 1212.0, 1036.0, 907.0, 827.0, 767.0, 699.0, 642.0, 637.0, 552.0, 524.0, 486.0, 478.0, 429.0, 414.0, 389.0, 348.0, 356.0, 297.0, 295.0, 262.0, 245.0, 219.0, 229.0, 205.0, 204.0, 205.0, 173.0, 166.0, 197.0, 153.0, 117.0, 133.0, 118.0, 129.0, 124.0, 93.0, 104.0, 114.0, 104.0, 101.0, 76.0, 70.0, 60.0, 53.0, 63.0], [7770.0, 4546.0, 3144.0, 2150.0, 1761.0, 1373.0, 1248.0, 1005.0, 869.0, 758.0, 738.0, 739.0, 645.0, 651.0, 638.0, 560.0, 543.0, 559.0, 531.0, 480.0, 466.0, 414.0, 433.0, 426.0, 430.0, 395.0, 362.0, 397.0, 351.0, 292.0, 346.0, 321.0, 293.0, 274.0, 265.0, 262.0, 261.0, 230.0, 235.0, 225.0, 224.0, 214.0, 191.0, 200.0, 204.0, 185.0, 141.0, 168.0, 140.0], [3985.0, 3701.0, 3347.0, 3026.0, 2607.0, 2332.0, 2056.0, 1819.0, 1610.0, 1520.0, 1278.0, 1178.0, 1072.0, 966.0, 895.0, 811.0, 827.0, 758.0, 678.0, 631.0, 639.0, 587.0, 590.0, 544.0, 531.0, 506.0, 544.0, 518.0, 499.0, 525.0, 470.0, 469.0, 475.0, 471.0, 439.0, 457.0, 383.0, 441.0, 448.0, 402.0, 418.0, 407.0, 377.0, 385.0, 369.0, 372.0, 382.0, 423.0, 421.0], [1066.0, 959.0, 1106.0, 1230.0, 1347.0, 1460.0, 1554.0, 1523.0, 1558.0, 1536.0, 1486.0, 1611.0, 1482.0, 1491.0, 1437.0, 1390.0, 1296.0, 1360.0, 1337.0, 1246.0, 1210.0, 1102.0, 1088.0, 1067.0, 950.0, 926.0, 893.0, 807.0, 843.0, 744.0, 831.0, 752.0, 708.0, 744.0, 735.0, 655.0, 662.0, 639.0, 647.0, 659.0, 673.0, 676.0, 717.0, 696.0, 695.0, 721.0, 745.0, 791.0, 892.0], [600.0, 310.0, 259.0, 286.0, 325.0, 365.0, 409.0, 439.0, 449.0, 528.0, 581.0, 599.0, 715.0, 789.0, 797.0, 863.0, 916.0, 940.0, 1024.0, 1003.0, 1109.0, 1087.0, 1205.0, 1235.0, 1262.0, 1257.0, 1253.0, 1289.0, 1298.0, 1373.0, 1321.0, 1306.0, 1302.0, 1392.0, 1408.0, 1405.0, 1315.0, 1260.0, 1271.0, 1223.0, 1314.0, 1272.0, 1221.0, 1211.0, 1311.0, 1260.0, 1340.0, 1418.0, 1708.0], [662.0, 236.0, 129.0, 112.0, 113.0, 132.0, 134.0, 139.0, 137.0, 161.0, 160.0, 188.0, 202.0, 187.0, 210.0, 264.0, 266.0, 280.0, 330.0, 340.0, 382.0, 383.0, 435.0, 482.0, 527.0, 600.0, 655.0, 759.0, 747.0, 816.0, 920.0, 973.0, 1037.0, 1135.0, 1224.0, 1373.0, 1493.0, 1530.0, 1756.0, 1834.0, 1969.0, 2029.0, 2268.0, 2294.0, 2493.0, 2693.0, 2918.0, 3176.0, 3693.0], [824.0, 271.0, 132.0, 93.0, 66.0, 70.0, 60.0, 69.0, 64.0, 56.0, 61.0, 64.0, 59.0, 89.0, 68.0, 86.0, 98.0, 100.0, 74.0, 124.0, 142.0, 131.0, 147.0, 170.0, 169.0, 219.0, 212.0, 258.0, 284.0, 287.0, 324.0, 351.0, 407.0, 424.0, 498.0, 579.0, 678.0, 761.0, 865.0, 1062.0, 1189.0, 1475.0, 1702.0, 2084.0, 2643.0, 3155.0, 4000.0, 5257.0, 7349.0], [1204.0, 347.0, 146.0, 92.0, 55.0, 50.0, 50.0, 35.0, 39.0, 57.0, 41.0, 24.0, 35.0, 34.0, 37.0, 25.0, 38.0, 33.0, 44.0, 48.0, 55.0, 55.0, 52.0, 72.0, 75.0, 60.0, 91.0, 87.0, 111.0, 126.0, 136.0, 151.0, 175.0, 175.0, 213.0, 266.0, 282.0, 323.0, 360.0, 389.0, 512.0, 642.0, 761.0, 976.0, 1270.0, 1828.0, 2611.0, 4450.0, 8406.0], [1779.0, 604.0, 269.0, 123.0, 95.0, 46.0, 40.0, 40.0, 21.0, 27.0, 23.0, 20.0, 21.0, 25.0, 27.0, 27.0, 20.0, 25.0, 24.0, 28.0, 24.0, 27.0, 24.0, 23.0, 26.0, 40.0, 36.0, 41.0, 44.0, 47.0, 60.0, 46.0, 73.0, 85.0, 89.0, 110.0, 118.0, 132.0, 184.0, 221.0, 247.0, 289.0, 363.0, 487.0, 615.0, 898.0, 1344.0, 2307.0, 5595.0], [2254.0, 964.0, 456.0, 234.0, 134.0, 86.0, 62.0, 27.0, 43.0, 23.0, 25.0, 11.0, 19.0, 19.0, 19.0, 16.0, 12.0, 16.0, 13.0, 11.0, 16.0, 14.0, 18.0, 17.0, 19.0, 20.0, 22.0, 16.0, 23.0, 22.0, 18.0, 38.0, 31.0, 37.0, 38.0, 44.0, 57.0, 64.0, 66.0, 86.0, 98.0, 129.0, 163.0, 224.0, 286.0, 490.0, 732.0, 1339.0, 3396.0], [2820.0, 1299.0, 761.0, 470.0, 238.0, 179.0, 97.0, 92.0, 56.0, 41.0, 32.0, 21.0, 14.0, 15.0, 12.0, 17.0, 19.0, 17.0, 9.0, 9.0, 8.0, 13.0, 6.0, 11.0, 13.0, 12.0, 10.0, 11.0, 11.0, 11.0, 22.0, 14.0, 14.0, 11.0, 25.0, 24.0, 39.0, 32.0, 30.0, 34.0, 50.0, 64.0, 89.0, 94.0, 133.0, 246.0, 334.0, 673.0, 1945.0], [3223.0, 1753.0, 1148.0, 715.0, 451.0, 307.0, 234.0, 156.0, 95.0, 80.0, 50.0, 36.0, 21.0, 26.0, 19.0, 14.0, 12.0, 12.0, 12.0, 9.0, 9.0, 19.0, 10.0, 9.0, 10.0, 10.0, 11.0, 11.0, 8.0, 14.0, 12.0, 15.0, 11.0, 14.0, 9.0, 13.0, 13.0, 26.0, 21.0, 19.0, 13.0, 33.0, 47.0, 50.0, 63.0, 94.0, 176.0, 321.0, 1175.0], [3432.0, 2118.0, 1459.0, 1029.0, 694.0, 528.0, 400.0, 287.0, 230.0, 159.0, 139.0, 73.0, 62.0, 42.0, 51.0, 35.0, 21.0, 23.0, 22.0, 12.0, 12.0, 10.0, 10.0, 15.0, 7.0, 10.0, 8.0, 7.0, 8.0, 10.0, 9.0, 14.0, 10.0, 12.0, 7.0, 9.0, 5.0, 16.0, 16.0, 23.0, 11.0, 23.0, 19.0, 25.0, 36.0, 43.0, 94.0, 189.0, 584.0], [3573.0, 2285.0, 1708.0, 1325.0, 1081.0, 777.0, 597.0, 517.0, 419.0, 292.0, 243.0, 226.0, 149.0, 113.0, 101.0, 87.0, 48.0, 51.0, 41.0, 39.0, 19.0, 24.0, 19.0, 21.0, 10.0, 13.0, 8.0, 6.0, 11.0, 12.0, 9.0, 5.0, 9.0, 10.0, 6.0, 9.0, 4.0, 8.0, 10.0, 13.0, 19.0, 17.0, 15.0, 19.0, 22.0, 35.0, 42.0, 102.0, 296.0], [3499.0, 2382.0, 1805.0, 1459.0, 1232.0, 1013.0, 868.0, 729.0, 620.0, 513.0, 462.0, 382.0, 273.0, 264.0, 194.0, 177.0, 141.0, 115.0, 117.0, 92.0, 67.0, 65.0, 44.0, 30.0, 35.0, 35.0, 21.0, 20.0, 18.0, 12.0, 11.0, 15.0, 14.0, 7.0, 9.0, 6.0, 9.0, 8.0, 8.0, 10.0, 7.0, 6.0, 9.0, 10.0, 18.0, 22.0, 34.0, 65.0, 165.0], [3030.0, 2199.0, 1846.0, 1599.0, 1347.0, 1125.0, 1042.0, 941.0, 796.0, 747.0, 706.0, 618.0, 485.0, 410.0, 381.0, 326.0, 284.0, 260.0, 200.0, 188.0, 146.0, 142.0, 130.0, 102.0, 71.0, 82.0, 63.0, 40.0, 38.0, 29.0, 28.0, 27.0, 21.0, 17.0, 14.0, 13.0, 12.0, 13.0, 10.0, 11.0, 6.0, 6.0, 15.0, 11.0, 14.0, 22.0, 19.0, 35.0, 106.0], [2310.0, 1876.0, 1720.0, 1489.0, 1339.0, 1184.0, 1129.0, 1068.0, 964.0, 893.0, 843.0, 720.0, 664.0, 632.0, 555.0, 534.0, 467.0, 435.0, 401.0, 361.0, 321.0, 276.0, 236.0, 204.0, 205.0, 152.0, 143.0, 131.0, 128.0, 97.0, 91.0, 47.0, 49.0, 52.0, 42.0, 33.0, 41.0, 27.0, 22.0, 29.0, 18.0, 7.0, 15.0, 13.0, 22.0, 12.0, 13.0, 34.0, 67.0], [1695.0, 1416.0, 1340.0, 1248.0, 1168.0, 1125.0, 1079.0, 1048.0, 988.0, 940.0, 881.0, 817.0, 815.0, 757.0, 692.0, 707.0, 660.0, 542.0, 558.0, 490.0, 467.0, 436.0, 389.0, 331.0, 341.0, 304.0, 238.0, 276.0, 212.0, 211.0, 173.0, 138.0, 136.0, 112.0, 105.0, 92.0, 82.0, 59.0, 55.0, 46.0, 41.0, 34.0, 37.0, 22.0, 19.0, 23.0, 21.0, 32.0, 57.0], [972.0, 905.0, 903.0, 937.0, 913.0, 935.0, 896.0, 920.0, 883.0, 851.0, 873.0, 836.0, 784.0, 792.0, 754.0, 713.0, 698.0, 716.0, 661.0, 615.0, 634.0, 607.0, 619.0, 562.0, 504.0, 478.0, 449.0, 454.0, 428.0, 414.0, 348.0, 293.0, 303.0, 243.0, 201.0, 181.0, 208.0, 151.0, 143.0, 128.0, 108.0, 99.0, 68.0, 52.0, 46.0, 46.0, 34.0, 40.0, 53.0], [607.0, 518.0, 553.0, 621.0, 637.0, 651.0, 634.0, 637.0, 688.0, 698.0, 686.0, 714.0, 674.0, 688.0, 697.0, 695.0, 713.0, 699.0, 724.0, 709.0, 695.0, 693.0, 660.0, 668.0, 636.0, 648.0, 584.0, 592.0, 557.0, 531.0, 510.0, 486.0, 488.0, 479.0, 391.0, 394.0, 343.0, 329.0, 291.0, 250.0, 244.0, 222.0, 178.0, 182.0, 148.0, 99.0, 99.0, 73.0, 89.0], [360.0, 276.0, 326.0, 329.0, 374.0, 369.0, 395.0, 431.0, 446.0, 426.0, 483.0, 524.0, 507.0, 531.0, 577.0, 566.0, 612.0, 594.0, 626.0, 586.0, 637.0, 628.0, 660.0, 657.0, 646.0, 658.0, 680.0, 721.0, 699.0, 641.0, 644.0, 657.0, 631.0, 639.0, 636.0, 617.0, 531.0, 539.0, 587.0, 473.0, 458.0, 445.0, 415.0, 360.0, 318.0, 304.0, 250.0, 228.0, 181.0], [284.0, 180.0, 182.0, 180.0, 197.0, 190.0, 215.0, 234.0, 236.0, 272.0, 274.0, 270.0, 335.0, 335.0, 372.0, 360.0, 399.0, 389.0, 491.0, 459.0, 519.0, 550.0, 585.0, 578.0, 598.0, 601.0, 646.0, 657.0, 643.0, 706.0, 738.0, 684.0, 677.0, 728.0, 742.0, 712.0, 768.0, 746.0, 761.0, 748.0, 773.0, 699.0, 631.0, 677.0, 652.0, 595.0, 546.0, 466.0, 416.0], [272.0, 128.0, 110.0, 103.0, 114.0, 117.0, 126.0, 115.0, 115.0, 143.0, 158.0, 154.0, 160.0, 155.0, 214.0, 224.0, 197.0, 238.0, 268.0, 301.0, 284.0, 389.0, 404.0, 394.0, 433.0, 459.0, 455.0, 544.0, 530.0, 549.0, 626.0, 636.0, 665.0, 714.0, 723.0, 758.0, 796.0, 841.0, 848.0, 956.0, 900.0, 959.0, 981.0, 957.0, 941.0, 992.0, 1064.0, 1007.0, 926.0], [260.0, 106.0, 83.0, 84.0, 59.0, 81.0, 69.0, 51.0, 76.0, 79.0, 90.0, 79.0, 81.0, 109.0, 104.0, 110.0, 138.0, 95.0, 141.0, 152.0, 186.0, 197.0, 208.0, 240.0, 261.0, 280.0, 303.0, 349.0, 350.0, 405.0, 404.0, 448.0, 486.0, 512.0, 599.0, 709.0, 694.0, 786.0, 893.0, 904.0, 909.0, 1033.0, 1081.0, 1120.0, 1263.0, 1358.0, 1539.0, 1636.0, 1676.0], [249.0, 106.0, 108.0, 67.0, 64.0, 38.0, 48.0, 46.0, 29.0, 47.0, 45.0, 45.0, 32.0, 50.0, 55.0, 53.0, 61.0, 56.0, 65.0, 82.0, 98.0, 123.0, 137.0, 149.0, 142.0, 164.0, 159.0, 183.0, 235.0, 232.0, 281.0, 288.0, 318.0, 348.0, 435.0, 422.0, 528.0, 597.0, 623.0, 745.0, 840.0, 940.0, 1014.0, 1137.0, 1339.0, 1592.0, 1778.0, 2089.0, 2576.0], [252.0, 101.0, 78.0, 49.0, 43.0, 39.0, 36.0, 41.0, 52.0, 40.0, 54.0, 33.0, 36.0, 22.0, 47.0, 38.0, 30.0, 32.0, 38.0, 57.0, 65.0, 81.0, 50.0, 48.0, 65.0, 73.0, 86.0, 90.0, 131.0, 131.0, 155.0, 179.0, 179.0, 199.0, 250.0, 279.0, 326.0, 382.0, 468.0, 532.0, 602.0, 732.0, 817.0, 954.0, 1218.0, 1495.0, 1865.0, 2287.0, 3294.0], [223.0, 90.0, 52.0, 29.0, 38.0, 35.0, 21.0, 28.0, 18.0, 52.0, 43.0, 14.0, 40.0, 11.0, 32.0, 33.0, 24.0, 43.0, 23.0, 12.0, 15.0, 33.0, 34.0, 24.0, 26.0, 43.0, 26.0, 41.0, 39.0, 48.0, 72.0, 94.0, 101.0, 105.0, 143.0, 140.0, 183.0, 212.0, 233.0, 316.0, 416.0, 478.0, 561.0, 738.0, 924.0, 1238.0, 1657.0, 2326.0, 3645.0], [206.0, 91.0, 61.0, 47.0, 40.0, 61.0, 39.0, 26.0, 12.0, 14.0, 14.0, 21.0, 60.0, 52.0, 43.0, 59.0, 44.0, 10.0, 20.0, 34.0, 21.0, 24.0, 53.0, 8.0, 25.0, 23.0, 27.0, 20.0, 26.0, 64.0, 42.0, 55.0, 86.0, 49.0, 54.0, 103.0, 93.0, 112.0, 128.0, 178.0, 216.0, 284.0, 380.0, 456.0, 601.0, 881.0, 1297.0, 1947.0, 3388.0], [252.0, 121.0, 69.0, 37.0, 76.0, 36.0, 37.0, 41.0, 16.0, 19.0, 33.0, 37.0, 42.0, 14.0, 14.0, 19.0, 14.0, 23.0, 26.0, 13.0, 5.0, 45.0, 20.0, 19.0, 10.0, 22.0, 12.0, 16.0, 12.0, 43.0, 37.0, 33.0, 32.0, 33.0, 29.0, 43.0, 37.0, 65.0, 63.0, 93.0, 92.0, 147.0, 194.0, 282.0, 344.0, 521.0, 857.0, 1475.0, 2972.0], [230.0, 80.0, 45.0, 54.0, 32.0, 24.0, 63.0, 26.0, 34.0, 69.0, 42.0, 21.0, 19.0, 21.0, 16.0, 18.0, 20.0, 19.0, 12.0, 6.0, 5.0, 4.0, 16.0, 54.0, 36.0, 6.0, 24.0, 6.0, 6.0, 4.0, 3.0, 20.0, 13.0, 8.0, 27.0, 16.0, 58.0, 84.0, 73.0, 60.0, 38.0, 80.0, 106.0, 126.0, 193.0, 298.0, 552.0, 1045.0, 2334.0], [207.0, 114.0, 97.0, 40.0, 30.0, 49.0, 26.0, 21.0, 18.0, 20.0, 36.0, 27.0, 14.0, 22.0, 12.0, 20.0, 6.0, 7.0, 29.0, 26.0, 29.0, 6.0, 12.0, 32.0, 55.0, 19.0, 13.0, 14.0, 31.0, 21.0, 26.0, 29.0, 20.0, 19.0, 15.0, 21.0, 16.0, 23.0, 26.0, 19.0, 14.0, 29.0, 72.0, 83.0, 87.0, 194.0, 306.0, 646.0, 1642.0], [223.0, 85.0, 74.0, 27.0, 51.0, 42.0, 21.0, 30.0, 31.0, 15.0, 14.0, 29.0, 30.0, 6.0, 9.0, 13.0, 21.0, 3.0, 19.0, 24.0, 1.0, 5.0, 29.0, 52.0, 3.0, 7.0, 5.0, 23.0, 5.0, 17.0, 31.0, 26.0, 3.0, 0.0, 3.0, 14.0, 39.0, 14.0, 15.0, 22.0, 11.0, 7.0, 11.0, 26.0, 49.0, 91.0, 173.0, 353.0, 1110.0], [249.0, 102.0, 62.0, 31.0, 32.0, 29.0, 23.0, 20.0, 16.0, 34.0, 15.0, 26.0, 15.0, 8.0, 6.0, 14.0, 44.0, 14.0, 18.0, 3.0, 8.0, 29.0, 15.0, 35.0, 34.0, 4.0, 4.0, 2.0, 2.0, 2.0, 3.0, 0.0, 1.0, 1.0, 1.0, 3.0, 6.0, 19.0, 2.0, 3.0, 2.0, 3.0, 7.0, 14.0, 15.0, 56.0, 90.0, 228.0, 727.0], [229.0, 104.0, 52.0, 27.0, 37.0, 24.0, 32.0, 38.0, 22.0, 15.0, 25.0, 22.0, 10.0, 6.0, 5.0, 6.0, 14.0, 26.0, 19.0, 5.0, 3.0, 4.0, 5.0, 13.0, 37.0, 4.0, 5.0, 24.0, 3.0, 4.0, 4.0, 1.0, 1.0, 4.0, 3.0, 3.0, 1.0, 0.0, 13.0, 11.0, 0.0, 2.0, 7.0, 9.0, 9.0, 32.0, 44.0, 93.0, 434.0], [193.0, 78.0, 55.0, 45.0, 25.0, 25.0, 31.0, 24.0, 31.0, 14.0, 16.0, 6.0, 16.0, 29.0, 3.0, 54.0, 3.0, 7.0, 3.0, 4.0, 3.0, 7.0, 17.0, 13.0, 3.0, 4.0, 8.0, 17.0, 4.0, 3.0, 2.0, 6.0, 19.0, 12.0, 19.0, 18.0, 11.0, 2.0, 12.0, 15.0, 0.0, 2.0, 1.0, 7.0, 22.0, 5.0, 18.0, 45.0, 239.0], [206.0, 82.0, 58.0, 41.0, 29.0, 47.0, 25.0, 22.0, 17.0, 28.0, 24.0, 29.0, 38.0, 9.0, 8.0, 10.0, 4.0, 4.0, 5.0, 3.0, 6.0, 23.0, 3.0, 4.0, 14.0, 14.0, 2.0, 6.0, 3.0, 6.0, 17.0, 10.0, 2.0, 2.0, 20.0, 8.0, 2.0, 10.0, 16.0, 1.0, 0.0, 3.0, 1.0, 2.0, 3.0, 5.0, 13.0, 29.0, 114.0], [176.0, 78.0, 41.0, 43.0, 56.0, 30.0, 39.0, 40.0, 13.0, 14.0, 9.0, 16.0, 8.0, 9.0, 8.0, 4.0, 1.0, 10.0, 4.0, 1.0, 6.0, 2.0, 3.0, 4.0, 3.0, 20.0, 17.0, 23.0, 3.0, 34.0, 16.0, 0.0, 4.0, 0.0, 2.0, 4.0, 1.0, 2.0, 2.0, 23.0, 0.0, 0.0, 5.0, 4.0, 25.0, 4.0, 5.0, 40.0, 69.0], [196.0, 120.0, 52.0, 48.0, 62.0, 35.0, 19.0, 11.0, 23.0, 28.0, 13.0, 11.0, 13.0, 8.0, 4.0, 29.0, 9.0, 4.0, 25.0, 13.0, 6.0, 5.0, 3.0, 4.0, 3.0, 17.0, 10.0, 2.0, 2.0, 2.0, 0.0, 0.0, 1.0, 2.0, 2.0, 3.0, 1.0, 1.0, 2.0, 3.0, 5.0, 3.0, 1.0, 3.0, 0.0, 1.0, 3.0, 12.0, 41.0], [206.0, 67.0, 38.0, 45.0, 46.0, 25.0, 31.0, 38.0, 28.0, 21.0, 17.0, 8.0, 10.0, 10.0, 7.0, 18.0, 20.0, 14.0, 16.0, 7.0, 21.0, 9.0, 0.0, 4.0, 8.0, 44.0, 3.0, 2.0, 6.0, 2.0, 5.0, 4.0, 2.0, 2.0, 1.0, 0.0, 1.0, 1.0, 1.0, 1.0, 16.0, 11.0, 2.0, 4.0, 25.0, 1.0, 0.0, 9.0, 22.0], [231.0, 75.0, 49.0, 29.0, 37.0, 24.0, 23.0, 13.0, 16.0, 18.0, 8.0, 15.0, 9.0, 7.0, 2.0, 10.0, 6.0, 6.0, 4.0, 6.0, 2.0, 3.0, 4.0, 7.0, 5.0, 3.0, 0.0, 7.0, 2.0, 1.0, 2.0, 1.0, 1.0, 3.0, 4.0, 2.0, 2.0, 2.0, 2.0, 2.0, 23.0, 1.0, 1.0, 0.0, 0.0, 2.0, 2.0, 2.0, 9.0], [239.0, 81.0, 39.0, 37.0, 31.0, 28.0, 25.0, 10.0, 9.0, 13.0, 13.0, 12.0, 8.0, 0.0, 13.0, 3.0, 7.0, 5.0, 3.0, 6.0, 6.0, 2.0, 12.0, 21.0, 6.0, 3.0, 2.0, 3.0, 1.0, 3.0, 2.0, 2.0, 2.0, 1.0, 3.0, 1.0, 1.0, 0.0, 1.0, 2.0, 2.0, 1.0, 2.0, 0.0, 1.0, 0.0, 2.0, 1.0, 8.0], [184.0, 79.0, 45.0, 35.0, 43.0, 17.0, 18.0, 21.0, 17.0, 11.0, 7.0, 8.0, 12.0, 33.0, 9.0, 7.0, 3.0, 5.0, 2.0, 4.0, 4.0, 3.0, 7.0, 3.0, 4.0, 3.0, 1.0, 4.0, 4.0, 4.0, 1.0, 2.0, 2.0, 4.0, 0.0, 2.0, 1.0, 3.0, 2.0, 0.0, 25.0, 2.0, 0.0, 0.0, 0.0, 2.0, 1.0, 4.0, 5.0], [183.0, 75.0, 59.0, 31.0, 32.0, 26.0, 17.0, 17.0, 15.0, 17.0, 13.0, 10.0, 4.0, 13.0, 5.0, 29.0, 8.0, 5.0, 2.0, 3.0, 2.0, 6.0, 19.0, 12.0, 3.0, 2.0, 3.0, 5.0, 1.0, 4.0, 3.0, 0.0, 1.0, 3.0, 1.0, 1.0, 2.0, 2.0, 1.0, 1.0, 4.0, 1.0, 5.0, 0.0, 3.0, 2.0, 1.0, 2.0, 1.0], [213.0, 70.0, 49.0, 27.0, 33.0, 27.0, 21.0, 16.0, 14.0, 14.0, 13.0, 7.0, 6.0, 11.0, 5.0, 8.0, 10.0, 5.0, 4.0, 8.0, 6.0, 3.0, 0.0, 6.0, 3.0, 4.0, 3.0, 5.0, 2.0, 5.0, 2.0, 1.0, 0.0, 4.0, 1.0, 5.0, 2.0, 1.0, 2.0, 2.0, 0.0, 1.0, 1.0, 0.0, 2.0, 2.0, 0.0, 1.0, 4.0], [190.0, 79.0, 37.0, 47.0, 22.0, 18.0, 27.0, 17.0, 13.0, 15.0, 32.0, 6.0, 8.0, 4.0, 9.0, 10.0, 5.0, 3.0, 2.0, 6.0, 5.0, 4.0, 6.0, 29.0, 6.0, 3.0, 2.0, 4.0, 4.0, 4.0, 1.0, 3.0, 4.0, 2.0, 0.0, 0.0, 0.0, 4.0, 2.0, 1.0, 4.0, 2.0, 2.0, 1.0, 3.0, 2.0, 3.0, 3.0, 3.0], [208.0, 77.0, 41.0, 62.0, 30.0, 17.0, 24.0, 17.0, 14.0, 15.0, 16.0, 6.0, 7.0, 4.0, 7.0, 11.0, 8.0, 5.0, 4.0, 6.0, 1.0, 1.0, 4.0, 1.0, 8.0, 4.0, 2.0, 3.0, 2.0, 5.0, 3.0, 2.0, 0.0, 1.0, 1.0, 2.0, 2.0, 4.0, 1.0, 1.0, 0.0, 1.0, 3.0, 3.0, 0.0, 2.0, 0.0, 1.0, 4.0], [187.0, 71.0, 58.0, 35.0, 32.0, 33.0, 19.0, 14.0, 15.0, 10.0, 9.0, 8.0, 12.0, 10.0, 5.0, 8.0, 4.0, 5.0, 3.0, 6.0, 3.0, 6.0, 6.0, 1.0, 3.0, 4.0, 3.0, 2.0, 4.0, 0.0, 3.0, 3.0, 1.0, 2.0, 3.0, 1.0, 1.0, 4.0, 2.0, 1.0, 1.0, 1.0, 4.0, 0.0, 6.0, 0.0, 3.0, 2.0, 0.0]],
    "Name": "sCurve-0",
    "Overflow": 2541527.0,
    "Type": "Histo2d",
    "Underflow": 0.0,
    "x": {
        "AxisTitle": "Vcal",
        "Bins": 51,
        "High": 302.5,
        "Low": 47.5
    },
    "y": {
        "AxisTitle": "Occupancy",
        "Bins": 49,
        "High": 49.5,
        "Low": 0.5
    },
    "z": {
        "AxisTitle": "Number of pixels"
    }
}