{
    "Data": [6.0, 9.0, 4.0, 10.0, 7.0, 4.0, 2.0, 8.0, 6.0, 7.0, 10.0, 10.0, 9.0, 12.0, 14.0, 19.0, 14.0, 27.0, 30.0, 21.0, 29.0, 49.0, 61.0, 56.0, 67.0, 81.0, 92.0, 104.0, 132.0, 174.0, 203.0, 281.0, 332.0, 371.0, 391.0, 541.0, 779.0, 1015.0, 1497.0, 2267.0, 3162.0, 3761.0, 4261.0, 4248.0, 4003.0, 3611.0, 3004.0, 2459.0, 1949.0, 1579.0, 1352.0, 1199.0, 1045.0, 988.0, 850.0, 784.0, 681.0, 565.0, 546.0, 462.0, 381.0, 301.0, 280.0, 249.0, 184.0, 147.0, 130.0, 100.0, 96.0, 78.0, 63.0, 52.0, 55.0, 41.0, 40.0, 34.0, 25.0, 30.0, 31.0, 21.0, 24.0, 25.0, 15.0, 21.0, 14.0, 23.0, 14.0, 26.0, 13.0, 13.0, 8.0],
    "Name": "ThresholdDist-0",
    "Overflow": 257.0,
    "Type": "Histo1d",
    "Underflow": 7.0,
    "x": {
        "AxisTitle": "Threshold [e]",
        "Bins": 91,
        "High": 1415.0,
        "Low": 505.0
    },
    "y": {
        "AxisTitle": "Number of Pixels"
    },
    "z": {
        "AxisTitle": "z"
    }
}