{
    "Data": [[3012.0, 1302.0, 754.0, 527.0, 363.0, 320.0, 223.0, 171.0, 128.0, 132.0, 110.0, 103.0, 79.0, 87.0, 52.0, 54.0, 48.0, 37.0, 46.0, 40.0, 28.0, 40.0, 33.0, 31.0, 22.0, 20.0, 19.0, 13.0, 19.0, 18.0, 13.0, 18.0, 16.0, 15.0, 19.0, 4.0, 9.0, 7.0, 15.0, 13.0, 6.0, 7.0, 12.0, 6.0, 8.0, 10.0, 8.0, 10.0, 4.0], [3469.0, 1802.0, 1132.0, 825.0, 589.0, 451.0, 385.0, 325.0, 248.0, 230.0, 193.0, 181.0, 167.0, 147.0, 126.0, 97.0, 114.0, 78.0, 91.0, 70.0, 69.0, 62.0, 68.0, 62.0, 46.0, 46.0, 31.0, 42.0, 36.0, 34.0, 32.0, 25.0, 16.0, 30.0, 25.0, 20.0, 18.0, 19.0, 21.0, 17.0, 22.0, 16.0, 14.0, 12.0, 11.0, 20.0, 15.0, 10.0, 17.0], [3914.0, 2071.0, 1489.0, 1074.0, 799.0, 720.0, 626.0, 516.0, 419.0, 386.0, 318.0, 270.0, 272.0, 257.0, 214.0, 185.0, 166.0, 153.0, 154.0, 107.0, 133.0, 120.0, 134.0, 122.0, 98.0, 98.0, 96.0, 81.0, 80.0, 80.0, 58.0, 55.0, 59.0, 48.0, 56.0, 47.0, 35.0, 44.0, 26.0, 31.0, 31.0, 32.0, 31.0, 35.0, 23.0, 25.0, 36.0, 28.0, 24.0], [4288.0, 2181.0, 1615.0, 1189.0, 997.0, 878.0, 766.0, 694.0, 629.0, 548.0, 495.0, 438.0, 411.0, 400.0, 341.0, 327.0, 295.0, 272.0, 254.0, 239.0, 201.0, 193.0, 207.0, 177.0, 187.0, 146.0, 185.0, 140.0, 174.0, 125.0, 119.0, 120.0, 117.0, 102.0, 104.0, 103.0, 91.0, 97.0, 96.0, 81.0, 77.0, 71.0, 71.0, 67.0, 62.0, 49.0, 51.0, 56.0, 59.0], [6408.0, 2939.0, 1862.0, 1373.0, 1205.0, 952.0, 888.0, 703.0, 739.0, 675.0, 614.0, 561.0, 479.0, 455.0, 482.0, 465.0, 415.0, 377.0, 399.0, 357.0, 377.0, 370.0, 306.0, 310.0, 307.0, 252.0, 235.0, 247.0, 224.0, 222.0, 226.0, 201.0, 202.0, 189.0, 188.0, 194.0, 187.0, 151.0, 163.0, 153.0, 163.0, 153.0, 150.0, 148.0, 137.0, 123.0, 119.0, 123.0, 128.0], [7332.0, 4623.0, 3184.0, 2398.0, 1831.0, 1407.0, 1232.0, 1042.0, 928.0, 831.0, 752.0, 656.0, 659.0, 608.0, 537.0, 565.0, 506.0, 456.0, 498.0, 440.0, 446.0, 423.0, 388.0, 417.0, 385.0, 365.0, 378.0, 381.0, 354.0, 368.0, 352.0, 329.0, 349.0, 312.0, 320.0, 296.0, 300.0, 286.0, 262.0, 320.0, 240.0, 245.0, 253.0, 271.0, 283.0, 281.0, 271.0, 273.0, 301.0], [3486.0, 3264.0, 3074.0, 2833.0, 2483.0, 2226.0, 2036.0, 1810.0, 1675.0, 1504.0, 1357.0, 1261.0, 1132.0, 1051.0, 963.0, 932.0, 796.0, 799.0, 694.0, 704.0, 669.0, 588.0, 573.0, 563.0, 546.0, 480.0, 505.0, 490.0, 534.0, 475.0, 459.0, 513.0, 440.0, 460.0, 497.0, 426.0, 459.0, 430.0, 483.0, 475.0, 449.0, 423.0, 451.0, 455.0, 449.0, 447.0, 480.0, 549.0, 614.0], [1054.0, 967.0, 1016.0, 1087.0, 1219.0, 1290.0, 1313.0, 1314.0, 1342.0, 1413.0, 1370.0, 1397.0, 1348.0, 1359.0, 1282.0, 1315.0, 1268.0, 1353.0, 1245.0, 1212.0, 1163.0, 1159.0, 1065.0, 1064.0, 1057.0, 1005.0, 904.0, 934.0, 919.0, 894.0, 812.0, 824.0, 765.0, 742.0, 706.0, 715.0, 723.0, 714.0, 719.0, 699.0, 639.0, 699.0, 690.0, 700.0, 747.0, 834.0, 863.0, 915.0, 1087.0], [531.0, 322.0, 322.0, 292.0, 329.0, 344.0, 372.0, 428.0, 430.0, 494.0, 499.0, 583.0, 605.0, 624.0, 679.0, 745.0, 774.0, 815.0, 878.0, 890.0, 957.0, 968.0, 1000.0, 1057.0, 1062.0, 1189.0, 1177.0, 1143.0, 1203.0, 1220.0, 1243.0, 1306.0, 1350.0, 1367.0, 1295.0, 1354.0, 1355.0, 1276.0, 1299.0, 1326.0, 1348.0, 1335.0, 1406.0, 1326.0, 1424.0, 1424.0, 1576.0, 1644.0, 2009.0], [423.0, 191.0, 169.0, 132.0, 141.0, 146.0, 137.0, 147.0, 146.0, 160.0, 171.0, 190.0, 196.0, 217.0, 215.0, 249.0, 259.0, 263.0, 311.0, 300.0, 337.0, 409.0, 403.0, 410.0, 457.0, 501.0, 549.0, 572.0, 644.0, 747.0, 819.0, 828.0, 902.0, 1000.0, 1107.0, 1211.0, 1266.0, 1364.0, 1504.0, 1696.0, 1781.0, 1964.0, 2034.0, 2228.0, 2472.0, 2739.0, 3085.0, 3492.0, 4232.0], [385.0, 155.0, 121.0, 79.0, 73.0, 57.0, 75.0, 78.0, 64.0, 82.0, 84.0, 81.0, 88.0, 93.0, 87.0, 88.0, 113.0, 103.0, 109.0, 127.0, 139.0, 153.0, 146.0, 179.0, 194.0, 199.0, 206.0, 223.0, 262.0, 281.0, 316.0, 373.0, 325.0, 417.0, 452.0, 490.0, 602.0, 655.0, 755.0, 867.0, 1015.0, 1224.0, 1457.0, 1794.0, 2157.0, 2762.0, 3625.0, 4837.0, 7472.0], [432.0, 141.0, 83.0, 57.0, 73.0, 43.0, 36.0, 49.0, 46.0, 46.0, 43.0, 56.0, 36.0, 43.0, 36.0, 45.0, 47.0, 46.0, 51.0, 69.0, 65.0, 77.0, 76.0, 73.0, 91.0, 100.0, 92.0, 123.0, 129.0, 116.0, 129.0, 164.0, 185.0, 177.0, 207.0, 254.0, 287.0, 289.0, 387.0, 415.0, 476.0, 540.0, 742.0, 913.0, 1169.0, 1470.0, 2237.0, 3664.0, 7441.0], [509.0, 165.0, 97.0, 41.0, 60.0, 39.0, 28.0, 36.0, 32.0, 26.0, 32.0, 27.0, 30.0, 25.0, 30.0, 23.0, 22.0, 33.0, 30.0, 32.0, 27.0, 28.0, 34.0, 39.0, 46.0, 42.0, 66.0, 43.0, 56.0, 66.0, 72.0, 67.0, 81.0, 90.0, 103.0, 142.0, 151.0, 177.0, 159.0, 169.0, 233.0, 328.0, 357.0, 480.0, 614.0, 844.0, 1164.0, 2036.0, 4926.0], [650.0, 193.0, 77.0, 59.0, 38.0, 37.0, 43.0, 26.0, 25.0, 32.0, 18.0, 21.0, 15.0, 15.0, 17.0, 17.0, 17.0, 12.0, 22.0, 24.0, 32.0, 18.0, 25.0, 20.0, 23.0, 18.0, 28.0, 20.0, 33.0, 28.0, 33.0, 35.0, 40.0, 49.0, 46.0, 50.0, 79.0, 63.0, 89.0, 112.0, 110.0, 142.0, 204.0, 287.0, 362.0, 461.0, 737.0, 1202.0, 3097.0], [976.0, 281.0, 138.0, 78.0, 41.0, 37.0, 29.0, 18.0, 18.0, 19.0, 23.0, 18.0, 12.0, 22.0, 24.0, 11.0, 18.0, 16.0, 13.0, 22.0, 12.0, 16.0, 16.0, 11.0, 9.0, 15.0, 24.0, 19.0, 16.0, 17.0, 19.0, 18.0, 23.0, 22.0, 23.0, 32.0, 29.0, 32.0, 44.0, 57.0, 55.0, 75.0, 92.0, 136.0, 158.0, 246.0, 378.0, 749.0, 1873.0], [1475.0, 491.0, 223.0, 105.0, 64.0, 37.0, 34.0, 18.0, 24.0, 16.0, 17.0, 11.0, 17.0, 13.0, 10.0, 18.0, 11.0, 9.0, 17.0, 13.0, 11.0, 10.0, 19.0, 15.0, 14.0, 17.0, 13.0, 13.0, 12.0, 11.0, 14.0, 14.0, 19.0, 14.0, 12.0, 18.0, 23.0, 13.0, 25.0, 25.0, 37.0, 37.0, 28.0, 59.0, 82.0, 124.0, 185.0, 375.0, 1232.0], [2101.0, 772.0, 400.0, 178.0, 94.0, 59.0, 43.0, 34.0, 24.0, 21.0, 17.0, 14.0, 12.0, 11.0, 11.0, 10.0, 15.0, 12.0, 15.0, 9.0, 8.0, 13.0, 15.0, 16.0, 9.0, 12.0, 7.0, 11.0, 9.0, 11.0, 3.0, 17.0, 10.0, 5.0, 12.0, 19.0, 12.0, 10.0, 17.0, 19.0, 21.0, 22.0, 13.0, 38.0, 38.0, 59.0, 111.0, 181.0, 691.0], [2708.0, 1261.0, 657.0, 357.0, 232.0, 136.0, 117.0, 56.0, 44.0, 43.0, 36.0, 22.0, 15.0, 11.0, 10.0, 9.0, 11.0, 5.0, 9.0, 10.0, 14.0, 8.0, 10.0, 10.0, 6.0, 10.0, 8.0, 6.0, 9.0, 10.0, 15.0, 9.0, 6.0, 12.0, 7.0, 10.0, 11.0, 7.0, 11.0, 8.0, 12.0, 18.0, 18.0, 25.0, 22.0, 51.0, 60.0, 99.0, 355.0], [3155.0, 1634.0, 1035.0, 654.0, 444.0, 298.0, 193.0, 137.0, 95.0, 76.0, 49.0, 44.0, 35.0, 22.0, 15.0, 21.0, 12.0, 12.0, 4.0, 12.0, 6.0, 11.0, 5.0, 11.0, 10.0, 6.0, 8.0, 8.0, 8.0, 5.0, 4.0, 5.0, 8.0, 10.0, 5.0, 2.0, 13.0, 6.0, 4.0, 15.0, 9.0, 10.0, 12.0, 15.0, 31.0, 25.0, 26.0, 61.0, 223.0], [3345.0, 2034.0, 1350.0, 951.0, 701.0, 489.0, 360.0, 303.0, 210.0, 184.0, 127.0, 111.0, 73.0, 53.0, 59.0, 43.0, 29.0, 21.0, 21.0, 17.0, 15.0, 7.0, 9.0, 13.0, 6.0, 11.0, 11.0, 8.0, 5.0, 4.0, 7.0, 4.0, 6.0, 9.0, 7.0, 5.0, 8.0, 2.0, 9.0, 5.0, 10.0, 8.0, 8.0, 13.0, 18.0, 11.0, 25.0, 43.0, 141.0], [3410.0, 2157.0, 1562.0, 1262.0, 1030.0, 756.0, 606.0, 533.0, 387.0, 315.0, 279.0, 208.0, 199.0, 141.0, 127.0, 102.0, 76.0, 77.0, 55.0, 54.0, 42.0, 37.0, 20.0, 22.0, 14.0, 16.0, 11.0, 13.0, 12.0, 9.0, 11.0, 8.0, 8.0, 5.0, 3.0, 3.0, 11.0, 12.0, 3.0, 9.0, 5.0, 7.0, 8.0, 5.0, 8.0, 19.0, 18.0, 31.0, 78.0], [3168.0, 2128.0, 1703.0, 1397.0, 1076.0, 910.0, 812.0, 717.0, 587.0, 521.0, 427.0, 372.0, 294.0, 272.0, 235.0, 207.0, 168.0, 162.0, 107.0, 111.0, 93.0, 78.0, 62.0, 51.0, 39.0, 38.0, 27.0, 27.0, 19.0, 26.0, 15.0, 12.0, 15.0, 12.0, 8.0, 9.0, 11.0, 6.0, 2.0, 8.0, 5.0, 7.0, 10.0, 9.0, 9.0, 13.0, 16.0, 17.0, 75.0], [3004.0, 2019.0, 1686.0, 1362.0, 1224.0, 1104.0, 932.0, 846.0, 709.0, 696.0, 607.0, 510.0, 488.0, 461.0, 414.0, 349.0, 335.0, 266.0, 226.0, 200.0, 198.0, 155.0, 147.0, 139.0, 123.0, 112.0, 86.0, 60.0, 65.0, 48.0, 55.0, 39.0, 41.0, 28.0, 26.0, 20.0, 24.0, 22.0, 10.0, 16.0, 6.0, 12.0, 15.0, 5.0, 8.0, 11.0, 12.0, 15.0, 36.0], [2482.0, 1757.0, 1532.0, 1349.0, 1183.0, 1117.0, 959.0, 942.0, 859.0, 829.0, 685.0, 668.0, 635.0, 563.0, 557.0, 519.0, 487.0, 433.0, 390.0, 368.0, 315.0, 338.0, 267.0, 260.0, 239.0, 204.0, 183.0, 159.0, 140.0, 113.0, 127.0, 110.0, 111.0, 84.0, 59.0, 57.0, 67.0, 45.0, 36.0, 31.0, 34.0, 22.0, 20.0, 7.0, 20.0, 19.0, 19.0, 18.0, 37.0], [1766.0, 1394.0, 1200.0, 1154.0, 1037.0, 1007.0, 914.0, 890.0, 809.0, 813.0, 761.0, 758.0, 779.0, 719.0, 665.0, 666.0, 625.0, 605.0, 540.0, 502.0, 477.0, 484.0, 417.0, 401.0, 356.0, 319.0, 313.0, 315.0, 265.0, 272.0, 263.0, 233.0, 195.0, 185.0, 155.0, 129.0, 119.0, 104.0, 98.0, 86.0, 81.0, 61.0, 62.0, 53.0, 31.0, 37.0, 23.0, 38.0, 37.0], [1168.0, 958.0, 894.0, 874.0, 823.0, 821.0, 801.0, 736.0, 737.0, 779.0, 694.0, 752.0, 722.0, 693.0, 712.0, 669.0, 691.0, 652.0, 624.0, 575.0, 616.0, 576.0, 573.0, 525.0, 513.0, 466.0, 455.0, 481.0, 417.0, 400.0, 383.0, 314.0, 352.0, 334.0, 293.0, 268.0, 269.0, 240.0, 222.0, 181.0, 207.0, 154.0, 159.0, 140.0, 110.0, 93.0, 77.0, 72.0, 66.0], [655.0, 507.0, 529.0, 546.0, 523.0, 513.0, 555.0, 577.0, 554.0, 564.0, 593.0, 579.0, 569.0, 619.0, 625.0, 636.0, 604.0, 628.0, 595.0, 686.0, 619.0, 664.0, 635.0, 615.0, 569.0, 622.0, 607.0, 556.0, 604.0, 567.0, 555.0, 510.0, 544.0, 480.0, 496.0, 492.0, 478.0, 427.0, 401.0, 387.0, 362.0, 338.0, 302.0, 304.0, 226.0, 228.0, 197.0, 186.0, 146.0], [425.0, 290.0, 296.0, 256.0, 315.0, 303.0, 329.0, 334.0, 377.0, 370.0, 365.0, 382.0, 408.0, 465.0, 461.0, 439.0, 494.0, 514.0, 484.0, 545.0, 540.0, 597.0, 577.0, 569.0, 576.0, 632.0, 607.0, 644.0, 632.0, 656.0, 661.0, 667.0, 662.0, 672.0, 685.0, 644.0, 654.0, 611.0, 572.0, 563.0, 593.0, 572.0, 534.0, 545.0, 525.0, 502.0, 421.0, 403.0, 405.0], [341.0, 155.0, 143.0, 158.0, 149.0, 156.0, 169.0, 184.0, 204.0, 190.0, 238.0, 255.0, 238.0, 269.0, 277.0, 295.0, 313.0, 359.0, 334.0, 399.0, 400.0, 402.0, 438.0, 476.0, 504.0, 532.0, 523.0, 559.0, 544.0, 613.0, 652.0, 607.0, 664.0, 688.0, 733.0, 711.0, 772.0, 726.0, 762.0, 820.0, 821.0, 815.0, 801.0, 852.0, 784.0, 813.0, 820.0, 806.0, 813.0], [293.0, 111.0, 93.0, 108.0, 83.0, 94.0, 76.0, 106.0, 104.0, 102.0, 122.0, 126.0, 126.0, 145.0, 158.0, 149.0, 150.0, 189.0, 214.0, 236.0, 248.0, 285.0, 285.0, 298.0, 345.0, 324.0, 364.0, 383.0, 431.0, 461.0, 523.0, 522.0, 554.0, 605.0, 597.0, 724.0, 721.0, 753.0, 812.0, 863.0, 887.0, 1016.0, 995.0, 1016.0, 1126.0, 1241.0, 1248.0, 1326.0, 1413.0], [300.0, 94.0, 66.0, 48.0, 58.0, 56.0, 41.0, 33.0, 39.0, 45.0, 53.0, 62.0, 53.0, 69.0, 88.0, 74.0, 68.0, 98.0, 106.0, 103.0, 131.0, 144.0, 140.0, 170.0, 214.0, 194.0, 232.0, 221.0, 292.0, 278.0, 298.0, 381.0, 397.0, 445.0, 457.0, 523.0, 585.0, 614.0, 659.0, 786.0, 808.0, 1009.0, 1018.0, 1158.0, 1237.0, 1504.0, 1685.0, 1897.0, 2302.0], [267.0, 101.0, 63.0, 74.0, 35.0, 36.0, 23.0, 19.0, 25.0, 22.0, 38.0, 37.0, 37.0, 25.0, 38.0, 40.0, 60.0, 32.0, 45.0, 50.0, 65.0, 66.0, 83.0, 107.0, 93.0, 115.0, 99.0, 139.0, 187.0, 167.0, 186.0, 203.0, 218.0, 259.0, 298.0, 320.0, 352.0, 433.0, 512.0, 569.0, 668.0, 729.0, 893.0, 1022.0, 1251.0, 1509.0, 1782.0, 2228.0, 3044.0], [289.0, 114.0, 89.0, 44.0, 28.0, 20.0, 23.0, 58.0, 68.0, 19.0, 22.0, 30.0, 21.0, 17.0, 17.0, 17.0, 17.0, 25.0, 16.0, 32.0, 21.0, 43.0, 44.0, 36.0, 44.0, 48.0, 50.0, 57.0, 49.0, 75.0, 64.0, 82.0, 107.0, 136.0, 155.0, 179.0, 244.0, 251.0, 294.0, 386.0, 427.0, 532.0, 663.0, 782.0, 974.0, 1266.0, 1635.0, 2222.0, 3542.0], [250.0, 119.0, 42.0, 82.0, 40.0, 31.0, 21.0, 19.0, 34.0, 14.0, 10.0, 7.0, 8.0, 11.0, 9.0, 13.0, 10.0, 8.0, 19.0, 23.0, 14.0, 12.0, 6.0, 32.0, 7.0, 15.0, 16.0, 18.0, 23.0, 23.0, 29.0, 56.0, 45.0, 72.0, 68.0, 96.0, 92.0, 116.0, 139.0, 175.0, 224.0, 292.0, 386.0, 435.0, 645.0, 918.0, 1329.0, 1956.0, 3476.0], [266.0, 121.0, 78.0, 48.0, 33.0, 32.0, 19.0, 11.0, 16.0, 16.0, 10.0, 7.0, 12.0, 27.0, 8.0, 5.0, 12.0, 8.0, 21.0, 13.0, 15.0, 28.0, 9.0, 22.0, 23.0, 23.0, 24.0, 14.0, 10.0, 12.0, 17.0, 19.0, 17.0, 39.0, 22.0, 36.0, 53.0, 75.0, 57.0, 105.0, 100.0, 151.0, 212.0, 289.0, 386.0, 600.0, 901.0, 1454.0, 3113.0], [273.0, 95.0, 42.0, 34.0, 32.0, 25.0, 42.0, 25.0, 11.0, 10.0, 27.0, 9.0, 7.0, 12.0, 13.0, 9.0, 34.0, 3.0, 9.0, 5.0, 2.0, 7.0, 6.0, 8.0, 7.0, 8.0, 21.0, 12.0, 7.0, 4.0, 6.0, 23.0, 22.0, 27.0, 14.0, 21.0, 42.0, 26.0, 17.0, 24.0, 53.0, 65.0, 92.0, 131.0, 187.0, 312.0, 534.0, 1057.0, 2333.0], [309.0, 121.0, 54.0, 41.0, 26.0, 22.0, 18.0, 22.0, 15.0, 7.0, 9.0, 14.0, 13.0, 54.0, 33.0, 9.0, 6.0, 12.0, 26.0, 9.0, 9.0, 8.0, 6.0, 9.0, 4.0, 5.0, 24.0, 8.0, 4.0, 17.0, 12.0, 5.0, 16.0, 19.0, 6.0, 6.0, 7.0, 24.0, 10.0, 11.0, 18.0, 27.0, 31.0, 78.0, 91.0, 159.0, 284.0, 611.0, 1722.0], [244.0, 89.0, 85.0, 64.0, 32.0, 38.0, 25.0, 15.0, 32.0, 15.0, 12.0, 22.0, 36.0, 21.0, 9.0, 15.0, 28.0, 15.0, 24.0, 25.0, 16.0, 5.0, 2.0, 4.0, 6.0, 6.0, 5.0, 5.0, 2.0, 4.0, 11.0, 39.0, 11.0, 19.0, 9.0, 3.0, 2.0, 22.0, 8.0, 16.0, 25.0, 16.0, 14.0, 38.0, 62.0, 79.0, 158.0, 315.0, 1077.0], [296.0, 118.0, 61.0, 56.0, 41.0, 31.0, 27.0, 47.0, 26.0, 11.0, 17.0, 46.0, 14.0, 8.0, 4.0, 20.0, 20.0, 8.0, 7.0, 9.0, 23.0, 16.0, 4.0, 11.0, 4.0, 2.0, 5.0, 4.0, 3.0, 4.0, 3.0, 5.0, 3.0, 22.0, 9.0, 11.0, 16.0, 16.0, 15.0, 1.0, 1.0, 8.0, 10.0, 5.0, 12.0, 32.0, 71.0, 158.0, 665.0], [282.0, 122.0, 70.0, 48.0, 55.0, 41.0, 31.0, 24.0, 26.0, 22.0, 16.0, 14.0, 14.0, 8.0, 10.0, 6.0, 8.0, 3.0, 7.0, 5.0, 10.0, 9.0, 11.0, 0.0, 26.0, 5.0, 8.0, 24.0, 5.0, 13.0, 16.0, 4.0, 1.0, 22.0, 7.0, 2.0, 30.0, 1.0, 3.0, 0.0, 0.0, 1.0, 3.0, 5.0, 6.0, 14.0, 23.0, 91.0, 408.0], [273.0, 99.0, 77.0, 45.0, 46.0, 44.0, 17.0, 15.0, 12.0, 15.0, 17.0, 13.0, 34.0, 29.0, 13.0, 7.0, 6.0, 5.0, 11.0, 13.0, 22.0, 8.0, 5.0, 17.0, 21.0, 6.0, 4.0, 2.0, 3.0, 1.0, 2.0, 6.0, 1.0, 3.0, 1.0, 1.0, 0.0, 3.0, 1.0, 2.0, 4.0, 2.0, 1.0, 14.0, 14.0, 7.0, 11.0, 53.0, 218.0], [261.0, 107.0, 61.0, 39.0, 35.0, 38.0, 14.0, 32.0, 42.0, 10.0, 15.0, 13.0, 13.0, 11.0, 7.0, 14.0, 29.0, 5.0, 7.0, 7.0, 5.0, 4.0, 12.0, 34.0, 40.0, 14.0, 6.0, 5.0, 2.0, 6.0, 5.0, 1.0, 2.0, 3.0, 1.0, 3.0, 0.0, 3.0, 2.0, 2.0, 1.0, 1.0, 2.0, 1.0, 3.0, 3.0, 4.0, 21.0, 127.0], [284.0, 92.0, 52.0, 42.0, 25.0, 13.0, 17.0, 13.0, 18.0, 8.0, 15.0, 10.0, 6.0, 14.0, 7.0, 13.0, 9.0, 6.0, 6.0, 11.0, 10.0, 5.0, 7.0, 9.0, 14.0, 24.0, 24.0, 3.0, 9.0, 22.0, 2.0, 4.0, 1.0, 2.0, 0.0, 5.0, 2.0, 9.0, 20.0, 1.0, 2.0, 2.0, 3.0, 0.0, 0.0, 2.0, 5.0, 9.0, 54.0], [286.0, 80.0, 59.0, 31.0, 34.0, 24.0, 44.0, 18.0, 8.0, 9.0, 16.0, 18.0, 6.0, 8.0, 24.0, 14.0, 8.0, 9.0, 3.0, 8.0, 10.0, 8.0, 7.0, 11.0, 7.0, 2.0, 11.0, 2.0, 5.0, 3.0, 0.0, 8.0, 19.0, 3.0, 0.0, 0.0, 5.0, 3.0, 2.0, 1.0, 3.0, 4.0, 0.0, 1.0, 2.0, 2.0, 4.0, 4.0, 32.0], [275.0, 97.0, 63.0, 27.0, 36.0, 36.0, 11.0, 21.0, 22.0, 8.0, 8.0, 8.0, 7.0, 10.0, 10.0, 9.0, 7.0, 4.0, 11.0, 6.0, 13.0, 7.0, 6.0, 6.0, 4.0, 2.0, 4.0, 7.0, 2.0, 4.0, 2.0, 3.0, 3.0, 5.0, 4.0, 2.0, 3.0, 3.0, 3.0, 0.0, 2.0, 2.0, 1.0, 0.0, 2.0, 2.0, 2.0, 3.0, 21.0], [293.0, 103.0, 39.0, 33.0, 29.0, 20.0, 24.0, 25.0, 15.0, 14.0, 12.0, 10.0, 16.0, 8.0, 9.0, 8.0, 10.0, 12.0, 9.0, 6.0, 8.0, 6.0, 8.0, 5.0, 5.0, 6.0, 3.0, 1.0, 2.0, 6.0, 25.0, 4.0, 1.0, 2.0, 4.0, 3.0, 3.0, 2.0, 2.0, 0.0, 4.0, 0.0, 0.0, 2.0, 3.0, 2.0, 1.0, 7.0, 10.0], [265.0, 98.0, 57.0, 38.0, 32.0, 21.0, 18.0, 16.0, 12.0, 19.0, 16.0, 34.0, 10.0, 4.0, 7.0, 12.0, 5.0, 5.0, 2.0, 8.0, 11.0, 28.0, 9.0, 8.0, 5.0, 6.0, 3.0, 4.0, 16.0, 14.0, 23.0, 7.0, 23.0, 3.0, 3.0, 5.0, 1.0, 1.0, 3.0, 1.0, 1.0, 2.0, 0.0, 1.0, 1.0, 2.0, 2.0, 0.0, 14.0], [268.0, 106.0, 49.0, 30.0, 29.0, 24.0, 14.0, 13.0, 11.0, 23.0, 14.0, 10.0, 12.0, 5.0, 5.0, 11.0, 6.0, 9.0, 9.0, 4.0, 9.0, 7.0, 8.0, 5.0, 5.0, 4.0, 8.0, 5.0, 0.0, 3.0, 9.0, 21.0, 5.0, 0.0, 26.0, 1.0, 3.0, 4.0, 3.0, 2.0, 1.0, 2.0, 1.0, 0.0, 0.0, 2.0, 3.0, 2.0, 6.0], [253.0, 96.0, 57.0, 34.0, 29.0, 29.0, 30.0, 16.0, 14.0, 35.0, 14.0, 16.0, 12.0, 6.0, 8.0, 8.0, 6.0, 12.0, 5.0, 10.0, 9.0, 5.0, 5.0, 3.0, 13.0, 4.0, 4.0, 2.0, 7.0, 3.0, 3.0, 3.0, 2.0, 0.0, 2.0, 0.0, 1.0, 1.0, 1.0, 6.0, 22.0, 5.0, 0.0, 0.0, 1.0, 2.0, 2.0, 0.0, 6.0], [278.0, 97.0, 62.0, 29.0, 39.0, 38.0, 24.0, 11.0, 11.0, 13.0, 7.0, 6.0, 13.0, 9.0, 6.0, 11.0, 9.0, 8.0, 10.0, 9.0, 5.0, 10.0, 7.0, 3.0, 1.0, 4.0, 6.0, 4.0, 7.0, 3.0, 6.0, 2.0, 3.0, 3.0, 2.0, 2.0, 3.0, 0.0, 0.0, 2.0, 2.0, 3.0, 3.0, 0.0, 3.0, 1.0, 1.0, 1.0, 5.0], [272.0, 78.0, 55.0, 38.0, 27.0, 27.0, 20.0, 16.0, 11.0, 20.0, 26.0, 7.0, 11.0, 14.0, 9.0, 10.0, 15.0, 9.0, 5.0, 10.0, 8.0, 6.0, 5.0, 6.0, 2.0, 6.0, 9.0, 4.0, 6.0, 1.0, 6.0, 2.0, 4.0, 1.0, 1.0, 3.0, 3.0, 0.0, 3.0, 3.0, 2.0, 0.0, 2.0, 1.0, 0.0, 3.0, 0.0, 3.0, 3.0]],
    "Name": "sCurve-0",
    "Overflow": 2504456.0,
    "Type": "Histo2d",
    "Underflow": 0.0,
    "x": {
        "AxisTitle": "Vcal",
        "Bins": 51,
        "High": 302.5,
        "Low": 47.5
    },
    "y": {
        "AxisTitle": "Occupancy",
        "Bins": 49,
        "High": 49.5,
        "Low": 0.5
    },
    "z": {
        "AxisTitle": "Number of pixels"
    }
}