{
    "Data": [0.0, 58143.0, 10866.0, 3028.0, 281.0, 30.0, 0.0, 0.0, 0.0, 0.0, 0.0],
    "Name": "StatusDist-0",
    "Overflow": 0.0,
    "Type": "Histo1d",
    "Underflow": 0.0,
    "x": {
        "AxisTitle": "Fit Status ",
        "Bins": 11,
        "High": 10.5,
        "Low": -0.5
    },
    "y": {
        "AxisTitle": "Number of Pixels"
    },
    "z": {
        "AxisTitle": "z"
    }
}