{
    "connectivity": [{
            "chipType": "RD53A",
            "chips": [{
                    "config": "/home/eresseguie/Yarr/configs/rd53a_3dmodule_A.json",
                    "enable": 1,
                    "locked": 0,
                    "rx": 0,
                    "tx": 0
                }, {
                    "config": "/home/eresseguie/Yarr/configs/rd53a_3dmodule_B.json",
                    "enable": 1,
                    "locked": 0,
                    "rx": 1,
                    "tx": 1
                }, {
                    "config": "/home/eresseguie/Yarr/configs/rd53a_3dmodule_C.json",
                    "enable": 1,
                    "locked": 0,
                    "rx": 2,
                    "tx": 2
                }, {
                    "config": "/home/eresseguie/Yarr/configs/rd53a_Triplet1107_IndCmdChipC.json",
                    "enable": 0,
                    "locked": 0,
                    "rx": 3,
                    "tx": 3
                }]
        }],
    "ctrlCfg": {
        "ctrlCfg": {
            "cfg": {
                "cmdPeriod": 6.250000073038109e-9,
                "idle": {
                    "word": 1768515945
                },
                "pulse": {
                    "interval": 500,
                    "word": 1549575846
                },
                "rxPolarity": 65535,
                "specNum": 2,
                "spiConfig": 541200,
                "sync": {
                    "interval": 32,
                    "word": 2172551550
                },
                "trigConfig": null,
                "txPolarity": 15
            },
            "type": "spec"
        }
    },
    "exec": "-r configs/controller/specCfg_bottom.json -c configs/connectivity/rd53a_3dmodule.json -s configs/scans/rd53a/std_thresholdscan.json -p -o 3dmoduleA ",
    "finishTime": 1620773176,
    "runNumber": 4829,
    "startTime": 1620773061,
    "stopwatch": {
        "analysis": 621,
        "config": 130,
        "processing": 3,
        "scan": 113634
    },
    "targetCharge": -1,
    "targetTot": -1,
    "testType": "std_thresholdscan",
    "timestamp": "2021-05-11_15:44:21"
}