{
    "Data": [[1198.0, 375.0, 161.0, 76.0, 51.0, 45.0, 19.0, 18.0, 13.0, 13.0, 12.0, 15.0, 5.0, 7.0, 3.0, 9.0, 5.0, 6.0, 7.0, 5.0, 7.0, 4.0, 5.0, 4.0, 6.0, 5.0, 4.0, 5.0, 7.0, 4.0, 5.0, 8.0, 10.0, 9.0, 7.0, 12.0, 7.0, 6.0, 5.0, 9.0, 4.0, 4.0, 3.0, 8.0, 6.0, 11.0, 14.0, 12.0, 8.0], [2211.0, 870.0, 402.0, 234.0, 153.0, 128.0, 71.0, 66.0, 44.0, 43.0, 28.0, 23.0, 12.0, 14.0, 15.0, 9.0, 11.0, 7.0, 3.0, 8.0, 3.0, 6.0, 7.0, 5.0, 9.0, 5.0, 5.0, 6.0, 9.0, 8.0, 3.0, 4.0, 6.0, 8.0, 6.0, 11.0, 5.0, 7.0, 7.0, 9.0, 8.0, 9.0, 15.0, 15.0, 8.0, 19.0, 17.0, 10.0, 10.0], [3523.0, 1560.0, 875.0, 634.0, 414.0, 300.0, 232.0, 158.0, 121.0, 122.0, 100.0, 74.0, 45.0, 52.0, 40.0, 38.0, 30.0, 30.0, 24.0, 23.0, 18.0, 19.0, 15.0, 8.0, 15.0, 14.0, 11.0, 9.0, 6.0, 5.0, 7.0, 6.0, 11.0, 6.0, 8.0, 8.0, 12.0, 7.0, 12.0, 12.0, 9.0, 11.0, 11.0, 11.0, 12.0, 13.0, 16.0, 13.0, 32.0], [4089.0, 2197.0, 1523.0, 1111.0, 813.0, 696.0, 511.0, 415.0, 353.0, 320.0, 254.0, 211.0, 169.0, 150.0, 119.0, 123.0, 90.0, 90.0, 69.0, 67.0, 60.0, 52.0, 45.0, 43.0, 32.0, 33.0, 45.0, 37.0, 31.0, 23.0, 28.0, 26.0, 25.0, 16.0, 13.0, 25.0, 6.0, 10.0, 17.0, 21.0, 17.0, 8.0, 10.0, 16.0, 18.0, 16.0, 15.0, 22.0, 32.0], [3681.0, 2372.0, 1942.0, 1418.0, 1218.0, 1040.0, 832.0, 778.0, 660.0, 541.0, 546.0, 501.0, 414.0, 388.0, 361.0, 302.0, 274.0, 237.0, 196.0, 196.0, 181.0, 162.0, 155.0, 143.0, 121.0, 95.0, 103.0, 112.0, 87.0, 71.0, 75.0, 73.0, 45.0, 48.0, 47.0, 50.0, 35.0, 33.0, 40.0, 41.0, 31.0, 41.0, 30.0, 39.0, 35.0, 33.0, 29.0, 29.0, 32.0], [4165.0, 2222.0, 1613.0, 1366.0, 1203.0, 1123.0, 977.0, 986.0, 908.0, 795.0, 747.0, 651.0, 712.0, 626.0, 584.0, 520.0, 529.0, 443.0, 439.0, 418.0, 390.0, 334.0, 339.0, 341.0, 267.0, 310.0, 262.0, 229.0, 219.0, 236.0, 186.0, 171.0, 178.0, 158.0, 148.0, 165.0, 143.0, 115.0, 117.0, 112.0, 97.0, 114.0, 95.0, 75.0, 73.0, 61.0, 66.0, 63.0, 79.0], [6970.0, 3994.0, 2555.0, 1786.0, 1391.0, 1186.0, 1007.0, 941.0, 861.0, 775.0, 765.0, 748.0, 720.0, 731.0, 660.0, 660.0, 647.0, 631.0, 613.0, 557.0, 522.0, 601.0, 553.0, 541.0, 529.0, 499.0, 499.0, 457.0, 473.0, 460.0, 430.0, 422.0, 368.0, 362.0, 404.0, 369.0, 343.0, 293.0, 334.0, 291.0, 285.0, 265.0, 241.0, 203.0, 233.0, 252.0, 221.0, 213.0, 202.0], [2790.0, 2855.0, 2873.0, 2644.0, 2470.0, 2256.0, 2041.0, 1805.0, 1703.0, 1512.0, 1346.0, 1231.0, 1147.0, 1039.0, 930.0, 862.0, 816.0, 799.0, 726.0, 716.0, 713.0, 705.0, 713.0, 625.0, 666.0, 659.0, 610.0, 650.0, 602.0, 622.0, 657.0, 628.0, 657.0, 617.0, 604.0, 611.0, 614.0, 636.0, 608.0, 562.0, 607.0, 579.0, 604.0, 529.0, 575.0, 538.0, 574.0, 613.0, 612.0], [502.0, 308.0, 369.0, 400.0, 536.0, 582.0, 668.0, 793.0, 849.0, 955.0, 1008.0, 1076.0, 1120.0, 1199.0, 1185.0, 1315.0, 1292.0, 1280.0, 1356.0, 1239.0, 1376.0, 1346.0, 1342.0, 1312.0, 1303.0, 1183.0, 1192.0, 1159.0, 1160.0, 1176.0, 1097.0, 1078.0, 1082.0, 1064.0, 1006.0, 964.0, 993.0, 952.0, 1005.0, 971.0, 1023.0, 1003.0, 1044.0, 1049.0, 1126.0, 1106.0, 1179.0, 1289.0, 1444.0], [587.0, 160.0, 116.0, 72.0, 72.0, 64.0, 86.0, 100.0, 74.0, 108.0, 111.0, 109.0, 150.0, 161.0, 192.0, 218.0, 248.0, 290.0, 306.0, 347.0, 411.0, 456.0, 485.0, 571.0, 638.0, 675.0, 745.0, 814.0, 950.0, 977.0, 1110.0, 1151.0, 1276.0, 1395.0, 1467.0, 1606.0, 1671.0, 1783.0, 1861.0, 2035.0, 2023.0, 2135.0, 2212.0, 2288.0, 2476.0, 2565.0, 2682.0, 2786.0, 3435.0], [959.0, 199.0, 109.0, 59.0, 44.0, 42.0, 37.0, 30.0, 32.0, 39.0, 39.0, 34.0, 38.0, 34.0, 44.0, 38.0, 54.0, 49.0, 50.0, 48.0, 60.0, 65.0, 83.0, 90.0, 113.0, 119.0, 118.0, 141.0, 168.0, 196.0, 215.0, 241.0, 273.0, 326.0, 420.0, 488.0, 553.0, 637.0, 721.0, 927.0, 1086.0, 1315.0, 1779.0, 1987.0, 2637.0, 3201.0, 4327.0, 5880.0, 8485.0], [1550.0, 349.0, 113.0, 64.0, 44.0, 43.0, 24.0, 35.0, 21.0, 19.0, 32.0, 17.0, 25.0, 23.0, 20.0, 27.0, 22.0, 24.0, 17.0, 15.0, 25.0, 23.0, 31.0, 37.0, 36.0, 26.0, 40.0, 41.0, 37.0, 46.0, 65.0, 63.0, 77.0, 90.0, 105.0, 112.0, 139.0, 185.0, 195.0, 254.0, 296.0, 369.0, 496.0, 640.0, 941.0, 1317.0, 2022.0, 3576.0, 8133.0], [2583.0, 691.0, 203.0, 102.0, 44.0, 24.0, 24.0, 19.0, 24.0, 18.0, 15.0, 18.0, 9.0, 10.0, 13.0, 19.0, 14.0, 20.0, 12.0, 14.0, 27.0, 18.0, 12.0, 9.0, 13.0, 17.0, 25.0, 28.0, 24.0, 17.0, 21.0, 31.0, 27.0, 43.0, 44.0, 48.0, 43.0, 45.0, 74.0, 82.0, 99.0, 107.0, 185.0, 226.0, 332.0, 449.0, 778.0, 1508.0, 4026.0], [3568.0, 1271.0, 489.0, 207.0, 108.0, 54.0, 39.0, 16.0, 28.0, 10.0, 14.0, 15.0, 10.0, 8.0, 16.0, 8.0, 13.0, 7.0, 5.0, 3.0, 8.0, 12.0, 9.0, 15.0, 9.0, 7.0, 18.0, 13.0, 13.0, 17.0, 22.0, 18.0, 19.0, 22.0, 23.0, 22.0, 32.0, 30.0, 35.0, 49.0, 41.0, 47.0, 67.0, 76.0, 128.0, 184.0, 277.0, 683.0, 2042.0], [4842.0, 2169.0, 1059.0, 462.0, 254.0, 108.0, 85.0, 50.0, 26.0, 17.0, 16.0, 13.0, 15.0, 15.0, 12.0, 15.0, 13.0, 7.0, 9.0, 9.0, 10.0, 6.0, 11.0, 11.0, 11.0, 12.0, 6.0, 6.0, 8.0, 11.0, 3.0, 11.0, 7.0, 10.0, 7.0, 20.0, 22.0, 19.0, 19.0, 24.0, 34.0, 34.0, 38.0, 47.0, 68.0, 79.0, 132.0, 255.0, 954.0], [5557.0, 3062.0, 1738.0, 884.0, 548.0, 298.0, 185.0, 130.0, 72.0, 52.0, 35.0, 15.0, 14.0, 8.0, 16.0, 4.0, 5.0, 4.0, 7.0, 5.0, 10.0, 7.0, 6.0, 7.0, 6.0, 15.0, 4.0, 13.0, 14.0, 14.0, 15.0, 11.0, 12.0, 16.0, 10.0, 15.0, 11.0, 13.0, 20.0, 16.0, 14.0, 29.0, 23.0, 30.0, 39.0, 47.0, 63.0, 139.0, 507.0], [5559.0, 3665.0, 2534.0, 1566.0, 999.0, 653.0, 445.0, 273.0, 209.0, 126.0, 93.0, 52.0, 45.0, 33.0, 19.0, 13.0, 10.0, 12.0, 8.0, 2.0, 9.0, 4.0, 8.0, 8.0, 10.0, 7.0, 8.0, 10.0, 5.0, 6.0, 6.0, 5.0, 11.0, 7.0, 8.0, 9.0, 20.0, 10.0, 21.0, 22.0, 19.0, 21.0, 27.0, 32.0, 33.0, 30.0, 42.0, 73.0, 227.0], [4599.0, 3674.0, 2886.0, 2207.0, 1704.0, 1175.0, 887.0, 624.0, 500.0, 358.0, 261.0, 192.0, 141.0, 81.0, 65.0, 47.0, 41.0, 30.0, 12.0, 11.0, 6.0, 12.0, 5.0, 5.0, 6.0, 5.0, 2.0, 3.0, 3.0, 12.0, 3.0, 9.0, 6.0, 9.0, 11.0, 13.0, 8.0, 10.0, 17.0, 12.0, 10.0, 14.0, 13.0, 20.0, 25.0, 36.0, 40.0, 65.0, 152.0], [3487.0, 3193.0, 2865.0, 2438.0, 2039.0, 1666.0, 1415.0, 1066.0, 825.0, 632.0, 540.0, 422.0, 328.0, 240.0, 197.0, 146.0, 107.0, 78.0, 72.0, 55.0, 39.0, 23.0, 20.0, 18.0, 7.0, 9.0, 9.0, 9.0, 6.0, 5.0, 7.0, 2.0, 3.0, 4.0, 1.0, 5.0, 5.0, 11.0, 7.0, 6.0, 13.0, 11.0, 27.0, 23.0, 17.0, 24.0, 34.0, 48.0, 111.0], [2213.0, 2399.0, 2395.0, 2249.0, 2129.0, 1917.0, 1719.0, 1501.0, 1213.0, 1025.0, 915.0, 817.0, 609.0, 530.0, 486.0, 351.0, 281.0, 227.0, 178.0, 144.0, 106.0, 86.0, 71.0, 74.0, 40.0, 46.0, 39.0, 21.0, 23.0, 12.0, 9.0, 5.0, 14.0, 10.0, 9.0, 7.0, 5.0, 9.0, 6.0, 7.0, 8.0, 9.0, 15.0, 17.0, 15.0, 16.0, 35.0, 47.0, 74.0], [1399.0, 1464.0, 1676.0, 1672.0, 1710.0, 1676.0, 1647.0, 1563.0, 1406.0, 1237.0, 1229.0, 1072.0, 990.0, 872.0, 779.0, 601.0, 546.0, 459.0, 416.0, 332.0, 317.0, 253.0, 223.0, 153.0, 139.0, 98.0, 110.0, 71.0, 62.0, 44.0, 50.0, 23.0, 35.0, 19.0, 16.0, 27.0, 19.0, 15.0, 8.0, 12.0, 10.0, 9.0, 13.0, 8.0, 12.0, 16.0, 18.0, 37.0, 61.0], [890.0, 863.0, 1112.0, 1156.0, 1235.0, 1323.0, 1308.0, 1426.0, 1338.0, 1272.0, 1270.0, 1185.0, 1197.0, 1028.0, 966.0, 882.0, 843.0, 748.0, 708.0, 588.0, 501.0, 444.0, 398.0, 337.0, 304.0, 266.0, 221.0, 198.0, 147.0, 132.0, 106.0, 72.0, 75.0, 55.0, 42.0, 32.0, 34.0, 22.0, 20.0, 22.0, 22.0, 20.0, 15.0, 22.0, 22.0, 38.0, 23.0, 23.0, 56.0], [592.0, 602.0, 692.0, 698.0, 783.0, 873.0, 928.0, 945.0, 1045.0, 1020.0, 1093.0, 1023.0, 1142.0, 1127.0, 990.0, 1012.0, 1023.0, 957.0, 929.0, 811.0, 798.0, 712.0, 645.0, 593.0, 538.0, 496.0, 426.0, 421.0, 333.0, 303.0, 266.0, 224.0, 204.0, 150.0, 141.0, 113.0, 90.0, 94.0, 66.0, 43.0, 31.0, 30.0, 22.0, 14.0, 18.0, 29.0, 19.0, 37.0, 57.0], [405.0, 348.0, 421.0, 461.0, 457.0, 547.0, 534.0, 612.0, 706.0, 795.0, 775.0, 856.0, 882.0, 849.0, 945.0, 940.0, 918.0, 983.0, 1003.0, 934.0, 917.0, 905.0, 824.0, 810.0, 797.0, 752.0, 660.0, 649.0, 601.0, 558.0, 469.0, 477.0, 408.0, 366.0, 289.0, 266.0, 224.0, 182.0, 149.0, 140.0, 102.0, 89.0, 71.0, 46.0, 57.0, 38.0, 28.0, 26.0, 52.0], [381.0, 286.0, 336.0, 304.0, 314.0, 302.0, 364.0, 391.0, 395.0, 471.0, 452.0, 554.0, 561.0, 568.0, 671.0, 674.0, 740.0, 798.0, 785.0, 821.0, 827.0, 861.0, 832.0, 874.0, 884.0, 919.0, 831.0, 834.0, 833.0, 758.0, 729.0, 772.0, 686.0, 605.0, 603.0, 517.0, 470.0, 451.0, 380.0, 323.0, 295.0, 226.0, 199.0, 169.0, 131.0, 100.0, 76.0, 70.0, 45.0], [233.0, 189.0, 213.0, 221.0, 219.0, 209.0, 256.0, 259.0, 294.0, 305.0, 294.0, 374.0, 326.0, 372.0, 394.0, 482.0, 463.0, 507.0, 591.0, 640.0, 642.0, 678.0, 734.0, 757.0, 757.0, 835.0, 843.0, 873.0, 874.0, 889.0, 942.0, 922.0, 884.0, 865.0, 841.0, 799.0, 727.0, 713.0, 672.0, 596.0, 560.0, 491.0, 419.0, 391.0, 291.0, 251.0, 191.0, 154.0, 119.0], [312.0, 234.0, 231.0, 239.0, 190.0, 194.0, 201.0, 225.0, 208.0, 221.0, 206.0, 242.0, 212.0, 252.0, 255.0, 264.0, 291.0, 360.0, 338.0, 368.0, 415.0, 482.0, 463.0, 547.0, 563.0, 595.0, 686.0, 696.0, 732.0, 746.0, 798.0, 865.0, 888.0, 910.0, 929.0, 918.0, 943.0, 977.0, 969.0, 842.0, 922.0, 820.0, 733.0, 712.0, 599.0, 539.0, 443.0, 376.0, 208.0], [153.0, 147.0, 125.0, 152.0, 150.0, 151.0, 144.0, 157.0, 185.0, 175.0, 152.0, 128.0, 141.0, 138.0, 158.0, 172.0, 185.0, 184.0, 179.0, 242.0, 260.0, 279.0, 294.0, 332.0, 372.0, 414.0, 461.0, 509.0, 557.0, 589.0, 625.0, 688.0, 744.0, 787.0, 921.0, 959.0, 997.0, 1001.0, 1068.0, 1112.0, 1085.0, 1153.0, 1153.0, 1154.0, 1062.0, 990.0, 906.0, 793.0, 607.0], [220.0, 196.0, 195.0, 195.0, 137.0, 112.0, 123.0, 117.0, 69.0, 77.0, 67.0, 58.0, 75.0, 88.0, 92.0, 104.0, 108.0, 88.0, 122.0, 153.0, 146.0, 154.0, 171.0, 213.0, 228.0, 219.0, 235.0, 305.0, 343.0, 337.0, 411.0, 509.0, 541.0, 601.0, 667.0, 802.0, 843.0, 891.0, 976.0, 1066.0, 1188.0, 1278.0, 1388.0, 1439.0, 1488.0, 1523.0, 1459.0, 1389.0, 1291.0], [195.0, 182.0, 99.0, 148.0, 196.0, 166.0, 80.0, 76.0, 124.0, 129.0, 141.0, 124.0, 89.0, 102.0, 96.0, 121.0, 108.0, 93.0, 113.0, 145.0, 93.0, 113.0, 107.0, 84.0, 104.0, 110.0, 124.0, 140.0, 181.0, 195.0, 216.0, 240.0, 284.0, 376.0, 387.0, 490.0, 580.0, 611.0, 738.0, 874.0, 1047.0, 1046.0, 1305.0, 1446.0, 1649.0, 1931.0, 2076.0, 2059.0, 2200.0], [105.0, 96.0, 180.0, 92.0, 99.0, 91.0, 84.0, 101.0, 79.0, 110.0, 109.0, 54.0, 55.0, 86.0, 100.0, 80.0, 87.0, 114.0, 128.0, 75.0, 96.0, 116.0, 135.0, 83.0, 84.0, 117.0, 87.0, 121.0, 127.0, 133.0, 108.0, 137.0, 168.0, 214.0, 225.0, 270.0, 327.0, 381.0, 471.0, 600.0, 736.0, 813.0, 1012.0, 1326.0, 1512.0, 1983.0, 2316.0, 2619.0, 3261.0], [115.0, 76.0, 133.0, 105.0, 88.0, 144.0, 94.0, 107.0, 92.0, 76.0, 130.0, 127.0, 122.0, 104.0, 59.0, 109.0, 100.0, 77.0, 78.0, 56.0, 82.0, 85.0, 90.0, 92.0, 91.0, 71.0, 95.0, 97.0, 84.0, 121.0, 125.0, 71.0, 95.0, 101.0, 122.0, 132.0, 174.0, 177.0, 267.0, 276.0, 448.0, 550.0, 747.0, 933.0, 1217.0, 1575.0, 2165.0, 2932.0, 4005.0], [147.0, 74.0, 150.0, 90.0, 153.0, 77.0, 80.0, 59.0, 128.0, 133.0, 116.0, 109.0, 95.0, 111.0, 129.0, 112.0, 51.0, 73.0, 65.0, 73.0, 104.0, 148.0, 107.0, 74.0, 83.0, 129.0, 121.0, 116.0, 89.0, 55.0, 85.0, 81.0, 94.0, 84.0, 90.0, 121.0, 119.0, 120.0, 190.0, 173.0, 239.0, 340.0, 412.0, 536.0, 797.0, 1167.0, 1735.0, 2636.0, 4206.0], [98.0, 44.0, 65.0, 62.0, 131.0, 142.0, 140.0, 98.0, 115.0, 101.0, 43.0, 82.0, 43.0, 109.0, 52.0, 68.0, 50.0, 61.0, 93.0, 107.0, 71.0, 52.0, 65.0, 61.0, 65.0, 41.0, 60.0, 68.0, 105.0, 129.0, 104.0, 78.0, 63.0, 36.0, 41.0, 64.0, 83.0, 102.0, 81.0, 72.0, 148.0, 196.0, 216.0, 367.0, 533.0, 754.0, 1276.0, 2157.0, 4107.0], [133.0, 89.0, 98.0, 90.0, 72.0, 133.0, 84.0, 84.0, 175.0, 60.0, 17.0, 74.0, 36.0, 55.0, 107.0, 50.0, 34.0, 17.0, 50.0, 67.0, 64.0, 69.0, 81.0, 56.0, 86.0, 73.0, 140.0, 62.0, 52.0, 46.0, 80.0, 127.0, 137.0, 84.0, 71.0, 44.0, 51.0, 77.0, 154.0, 97.0, 106.0, 105.0, 163.0, 177.0, 287.0, 450.0, 737.0, 1535.0, 3484.0], [128.0, 119.0, 105.0, 70.0, 91.0, 93.0, 82.0, 233.0, 112.0, 32.0, 52.0, 33.0, 120.0, 119.0, 148.0, 61.0, 114.0, 80.0, 184.0, 92.0, 93.0, 52.0, 76.0, 49.0, 132.0, 86.0, 80.0, 63.0, 88.0, 20.0, 83.0, 28.0, 91.0, 59.0, 57.0, 27.0, 78.0, 57.0, 108.0, 97.0, 103.0, 69.0, 60.0, 137.0, 150.0, 225.0, 429.0, 966.0, 2740.0], [119.0, 178.0, 91.0, 68.0, 160.0, 52.0, 66.0, 108.0, 99.0, 132.0, 137.0, 156.0, 111.0, 104.0, 66.0, 120.0, 122.0, 91.0, 73.0, 142.0, 146.0, 77.0, 66.0, 52.0, 42.0, 96.0, 61.0, 6.0, 45.0, 164.0, 128.0, 76.0, 38.0, 60.0, 75.0, 41.0, 73.0, 104.0, 110.0, 38.0, 48.0, 47.0, 45.0, 38.0, 116.0, 165.0, 275.0, 587.0, 1737.0], [274.0, 77.0, 94.0, 74.0, 52.0, 113.0, 77.0, 85.0, 106.0, 119.0, 53.0, 116.0, 92.0, 159.0, 151.0, 100.0, 47.0, 94.0, 36.0, 100.0, 68.0, 81.0, 160.0, 59.0, 60.0, 76.0, 82.0, 89.0, 80.0, 5.0, 1.0, 47.0, 6.0, 72.0, 54.0, 36.0, 106.0, 89.0, 88.0, 27.0, 17.0, 9.0, 96.0, 107.0, 70.0, 41.0, 95.0, 382.0, 1203.0], [113.0, 111.0, 124.0, 64.0, 54.0, 93.0, 169.0, 123.0, 31.0, 30.0, 87.0, 128.0, 75.0, 87.0, 133.0, 116.0, 19.0, 71.0, 58.0, 92.0, 78.0, 48.0, 110.0, 96.0, 137.0, 64.0, 65.0, 77.0, 42.0, 19.0, 68.0, 86.0, 131.0, 146.0, 67.0, 96.0, 93.0, 66.0, 83.0, 18.0, 110.0, 105.0, 92.0, 132.0, 78.0, 57.0, 174.0, 223.0, 694.0], [177.0, 103.0, 144.0, 27.0, 90.0, 66.0, 41.0, 59.0, 103.0, 80.0, 77.0, 91.0, 74.0, 112.0, 104.0, 64.0, 108.0, 141.0, 100.0, 155.0, 126.0, 91.0, 87.0, 159.0, 122.0, 83.0, 74.0, 69.0, 90.0, 35.0, 54.0, 46.0, 101.0, 115.0, 21.0, 54.0, 77.0, 46.0, 111.0, 60.0, 120.0, 80.0, 79.0, 67.0, 92.0, 110.0, 138.0, 131.0, 444.0], [217.0, 91.0, 115.0, 128.0, 82.0, 71.0, 79.0, 95.0, 97.0, 83.0, 93.0, 86.0, 116.0, 59.0, 65.0, 41.0, 90.0, 58.0, 80.0, 44.0, 129.0, 55.0, 112.0, 77.0, 32.0, 57.0, 47.0, 72.0, 97.0, 108.0, 90.0, 19.0, 31.0, 37.0, 41.0, 76.0, 109.0, 121.0, 97.0, 65.0, 46.0, 75.0, 65.0, 46.0, 55.0, 69.0, 114.0, 87.0, 265.0], [151.0, 75.0, 99.0, 167.0, 127.0, 82.0, 154.0, 94.0, 68.0, 25.0, 82.0, 108.0, 77.0, 64.0, 83.0, 98.0, 83.0, 58.0, 65.0, 73.0, 88.0, 73.0, 92.0, 66.0, 52.0, 82.0, 60.0, 135.0, 125.0, 28.0, 48.0, 85.0, 96.0, 63.0, 39.0, 37.0, 63.0, 28.0, 75.0, 81.0, 22.0, 51.0, 71.0, 68.0, 33.0, 55.0, 34.0, 136.0, 169.0], [86.0, 102.0, 102.0, 72.0, 43.0, 115.0, 162.0, 100.0, 46.0, 120.0, 209.0, 57.0, 69.0, 64.0, 72.0, 164.0, 71.0, 58.0, 48.0, 33.0, 3.0, 59.0, 14.0, 140.0, 139.0, 63.0, 97.0, 99.0, 77.0, 85.0, 104.0, 23.0, 96.0, 123.0, 142.0, 68.0, 49.0, 29.0, 52.0, 49.0, 105.0, 39.0, 81.0, 84.0, 129.0, 101.0, 61.0, 80.0, 158.0], [148.0, 83.0, 71.0, 86.0, 39.0, 116.0, 87.0, 77.0, 170.0, 126.0, 69.0, 86.0, 52.0, 61.0, 138.0, 95.0, 120.0, 62.0, 70.0, 35.0, 45.0, 93.0, 34.0, 0.0, 13.0, 53.0, 10.0, 22.0, 4.0, 1.0, 47.0, 77.0, 75.0, 40.0, 51.0, 51.0, 0.0, 58.0, 20.0, 30.0, 46.0, 87.0, 69.0, 51.0, 50.0, 80.0, 48.0, 42.0, 110.0], [146.0, 36.0, 13.0, 25.0, 77.0, 81.0, 95.0, 140.0, 83.0, 32.0, 91.0, 48.0, 88.0, 131.0, 124.0, 65.0, 85.0, 54.0, 105.0, 114.0, 74.0, 82.0, 62.0, 78.0, 43.0, 71.0, 64.0, 47.0, 23.0, 31.0, 86.0, 32.0, 11.0, 40.0, 58.0, 90.0, 41.0, 28.0, 11.0, 34.0, 36.0, 74.0, 51.0, 110.0, 65.0, 15.0, 45.0, 85.0, 124.0], [124.0, 72.0, 135.0, 146.0, 132.0, 78.0, 65.0, 108.0, 111.0, 60.0, 13.0, 33.0, 87.0, 26.0, 26.0, 87.0, 90.0, 50.0, 32.0, 92.0, 47.0, 21.0, 6.0, 20.0, 12.0, 56.0, 93.0, 131.0, 63.0, 61.0, 107.0, 34.0, 56.0, 70.0, 102.0, 38.0, 38.0, 1.0, 21.0, 21.0, 37.0, 73.0, 50.0, 47.0, 45.0, 55.0, 47.0, 49.0, 72.0], [121.0, 102.0, 40.0, 96.0, 51.0, 38.0, 52.0, 64.0, 115.0, 122.0, 101.0, 130.0, 129.0, 77.0, 31.0, 9.0, 22.0, 20.0, 72.0, 21.0, 84.0, 116.0, 67.0, 108.0, 64.0, 47.0, 56.0, 61.0, 59.0, 45.0, 75.0, 99.0, 65.0, 16.0, 121.0, 44.0, 39.0, 60.0, 93.0, 118.0, 65.0, 62.0, 118.0, 84.0, 59.0, 19.0, 4.0, 18.0, 57.0], [152.0, 94.0, 64.0, 77.0, 83.0, 27.0, 115.0, 12.0, 22.0, 27.0, 13.0, 23.0, 58.0, 60.0, 39.0, 65.0, 69.0, 64.0, 51.0, 64.0, 77.0, 23.0, 51.0, 57.0, 17.0, 33.0, 133.0, 39.0, 64.0, 35.0, 21.0, 21.0, 27.0, 51.0, 7.0, 78.0, 46.0, 112.0, 100.0, 40.0, 66.0, 48.0, 37.0, 40.0, 19.0, 35.0, 61.0, 54.0, 109.0], [137.0, 68.0, 49.0, 35.0, 80.0, 135.0, 55.0, 51.0, 68.0, 48.0, 80.0, 75.0, 56.0, 106.0, 23.0, 0.0, 0.0, 0.0, 0.0, 22.0, 81.0, 23.0, 53.0, 31.0, 22.0, 15.0, 32.0, 65.0, 42.0, 9.0, 27.0, 72.0, 129.0, 116.0, 56.0, 66.0, 55.0, 71.0, 17.0, 28.0, 27.0, 17.0, 82.0, 77.0, 55.0, 42.0, 61.0, 44.0, 37.0], [136.0, 63.0, 88.0, 49.0, 90.0, 65.0, 96.0, 17.0, 24.0, 40.0, 40.0, 27.0, 76.0, 48.0, 24.0, 58.0, 59.0, 65.0, 46.0, 4.0, 1.0, 86.0, 38.0, 27.0, 41.0, 0.0, 68.0, 52.0, 24.0, 39.0, 36.0, 19.0, 13.0, 24.0, 18.0, 47.0, 57.0, 58.0, 30.0, 48.0, 10.0, 72.0, 86.0, 35.0, 21.0, 32.0, 15.0, 12.0, 38.0], [64.0, 48.0, 41.0, 81.0, 33.0, 92.0, 75.0, 22.0, 47.0, 54.0, 47.0, 15.0, 35.0, 16.0, 50.0, 48.0, 4.0, 28.0, 20.0, 15.0, 80.0, 50.0, 4.0, 38.0, 53.0, 103.0, 54.0, 35.0, 19.0, 3.0, 26.0, 45.0, 2.0, 24.0, 39.0, 51.0, 43.0, 58.0, 55.0, 46.0, 26.0, 47.0, 54.0, 91.0, 27.0, 34.0, 21.0, 101.0, 42.0]],
    "Name": "sCurve-0",
    "Overflow": 2546503.0,
    "Type": "Histo2d",
    "Underflow": 0.0,
    "x": {
        "AxisTitle": "Vcal",
        "Bins": 51,
        "High": 302.5,
        "Low": 47.5
    },
    "y": {
        "AxisTitle": "Occupancy",
        "Bins": 49,
        "High": 49.5,
        "Low": 0.5
    },
    "z": {
        "AxisTitle": "Number of pixels"
    }
}