{
    "Data": [0.0, 0.0, 0.0, 0.0, 0.0, 0.0, 0.0, 0.0, 0.0, 0.0, 0.0, 0.0, 0.0, 5.0, 4.0, 0.0, 0.0, 53.0, 435.0, 271.0, 41.0, 383.0, 2248.0, 2490.0, 437.0, 813.0, 2617.0, 2929.0, 932.0, 715.0, 1440.0, 1799.0, 1092.0, 503.0, 553.0, 641.0, 562.0, 516.0, 1222.0, 1156.0, 758.0, 886.0, 2030.0, 4146.0, 2922.0, 1905.0, 1971.0, 3876.0, 4011.0, 3401.0, 2259.0, 2041.0, 2625.0, 2108.0, 1790.0, 1209.0, 1500.0, 1527.0, 1377.0, 1091.0, 842.0, 873.0, 798.0, 624.0, 445.0, 455.0, 511.0, 437.0, 345.0, 255.0, 317.0, 298.0, 219.0, 188.0, 176.0, 185.0, 177.0, 135.0, 116.0, 106.0, 124.0, 113.0, 83.0, 80.0, 68.0, 83.0, 56.0, 44.0, 43.0, 48.0, 49.0, 48.0, 39.0, 33.0, 22.0, 26.0, 33.0, 24.0, 31.0, 23.0, 22.0, 23.0, 20.0, 11.0, 13.0, 16.0, 18.0, 9.0, 14.0, 12.0, 21.0, 7.0, 10.0, 8.0, 6.0, 12.0, 6.0, 7.0, 5.0, 7.0, 5.0, 5.0, 4.0, 3.0, 3.0, 3.0, 6.0, 6.0, 2.0, 4.0, 8.0, 5.0, 2.0, 6.0, 3.0, 4.0, 1.0, 5.0, 0.0, 2.0, 4.0, 2.0, 1.0, 2.0, 3.0, 2.0, 1.0, 3.0, 0.0, 0.0, 0.0, 2.0, 2.0, 1.0, 6.0, 2.0, 3.0, 3.0, 3.0, 1.0, 2.0, 1.0, 1.0, 1.0, 2.0, 2.0, 0.0, 0.0, 2.0, 0.0, 2.0, 3.0, 3.0, 0.0, 2.0, 2.0, 0.0, 0.0, 2.0, 0.0, 1.0, 1.0, 2.0, 3.0, 2.0, 0.0, 1.0, 0.0, 2.0, 1.0, 0.0, 1.0, 1.0, 0.0, 0.0, 4.0, 2.0, 0.0, 2.0, 1.0, 2.0],
    "Name": "TimePerFitDist-0",
    "Overflow": 99.0,
    "Type": "Histo1d",
    "Underflow": 0.0,
    "x": {
        "AxisTitle": "Fit Time [us]",
        "Bins": 201,
        "High": 401.0,
        "Low": -1.0
    },
    "y": {
        "AxisTitle": "Number of Pixels"
    },
    "z": {
        "AxisTitle": "z"
    }
}