{
    "Data": [11.0, 4.0, 4.0, 11.0, 4.0, 5.0, 5.0, 6.0, 7.0, 9.0, 8.0, 10.0, 5.0, 12.0, 24.0, 18.0, 19.0, 25.0, 34.0, 36.0, 40.0, 38.0, 60.0, 69.0, 80.0, 91.0, 95.0, 124.0, 155.0, 207.0, 250.0, 299.0, 320.0, 397.0, 468.0, 572.0, 782.0, 1021.0, 1613.0, 2281.0, 3179.0, 3819.0, 4251.0, 4241.0, 4054.0, 3602.0, 2914.0, 2428.0, 1941.0, 1564.0, 1383.0, 1125.0, 1015.0, 946.0, 803.0, 724.0, 652.0, 581.0, 483.0, 421.0, 368.0, 343.0, 275.0, 203.0, 161.0, 167.0, 105.0, 87.0, 88.0, 82.0, 59.0, 55.0, 43.0, 53.0, 42.0, 36.0, 29.0, 26.0, 32.0, 23.0, 28.0, 18.0, 13.0, 18.0, 20.0, 20.0, 16.0, 14.0, 15.0, 10.0, 12.0],
    "Name": "ThresholdDist-0",
    "Overflow": 257.0,
    "Type": "Histo1d",
    "Underflow": 8.0,
    "x": {
        "AxisTitle": "Threshold [e]",
        "Bins": 91,
        "High": 1415.0,
        "Low": 505.0
    },
    "y": {
        "AxisTitle": "Number of Pixels"
    },
    "z": {
        "AxisTitle": "z"
    }
}