time,Hardware,Voltage,Current
1621990117381,high-voltage,1,0.0628629
time,Hardware,Voltage,Current
1621990117381,high-voltage,2,0.13683
time,Hardware,Voltage,Current
1621990117381,high-voltage,3,0.229643
time,Hardware,Voltage,Current
1621990117381,high-voltage,4,0.354086
time,Hardware,Voltage,Current
1621990117381,high-voltage,5,0.566945
time,Hardware,Voltage,Current
1621990117381,high-voltage,6,0.780818
time,Hardware,Voltage,Current
1621990117381,high-voltage,7,1.06953
time,Hardware,Voltage,Current
1621990117381,high-voltage,8,1.38671
time,Hardware,Voltage,Current
1621990117381,high-voltage,9,1.88572
time,Hardware,Voltage,Current
1621990117381,high-voltage,10,2.46884
time,Hardware,Voltage,Current
1621990117381,high-voltage,11,3.10809
time,Hardware,Voltage,Current
1621990117381,high-voltage,12,3.81454
time,Hardware,Voltage,Current
1621990117381,high-voltage,13,4.74489
time,Hardware,Voltage,Current
1621990117381,high-voltage,14,5.93893
time,Hardware,Voltage,Current
1621990117381,high-voltage,15,7.075
time,Hardware,Voltage,Current
1621990117381,high-voltage,16,8.28293
time,Hardware,Voltage,Current
1621990117381,high-voltage,17,9.50861
time,Hardware,Voltage,Current
1621990117381,high-voltage,18,10.0001
