{
    "Data": [3503.0, 23684.0, 16795.0, 6241.0, 2535.0, 2252.0, 2832.0, 3490.0, 3707.0, 3416.0, 2693.0, 1976.0, 1418.0, 942.0, 554.0, 358.0, 197.0, 111.0, 66.0, 33.0, 23.0, 9.0, 8.0, 7.0, 9.0, 5.0, 2.0, 1.0, 2.0, 0.0, 0.0, 1.0, 0.0, 0.0, 4.0, 0.0, 5.0, 0.0, 0.0, 1.0, 0.0, 3.0, 0.0, 0.0, 0.0, 0.0, 0.0, 1.0, 1.0, 0.0, 0.0],
    "Name": "Chi2Dist-0",
    "Overflow": 0.0,
    "Type": "Histo1d",
    "Underflow": 0.0,
    "x": {
        "AxisTitle": "Fit Chi/ndf",
        "Bins": 51,
        "High": 2.5250000953674318,
        "Low": -0.02500000037252903
    },
    "y": {
        "AxisTitle": "Number of Pixels"
    },
    "z": {
        "AxisTitle": "z"
    }
}