{
    "Data": [1529.0, 20296.0, 18766.0, 8707.0, 2790.0, 771.0, 372.0, 447.0, 591.0, 713.0, 778.0, 814.0, 790.0, 672.0, 608.0, 559.0, 566.0, 568.0, 528.0, 580.0, 565.0, 602.0, 597.0, 603.0, 653.0, 576.0, 588.0, 541.0, 577.0, 576.0, 583.0, 537.0, 508.0, 504.0, 489.0, 444.0, 446.0, 430.0, 402.0, 418.0, 403.0, 358.0, 348.0, 313.0, 355.0, 315.0, 265.0, 236.0, 227.0, 219.0, 119.0],
    "Name": "Chi2Dist-0",
    "Overflow": 0.0,
    "Type": "Histo1d",
    "Underflow": 0.0,
    "x": {
        "AxisTitle": "Fit Chi/ndf",
        "Bins": 51,
        "High": 2.5250000953674318,
        "Low": -0.02500000037252903
    },
    "y": {
        "AxisTitle": "Number of Pixels"
    },
    "z": {
        "AxisTitle": "z"
    }
}