time,Hardware,Voltage,Current
1626307781585,high-voltage-2,1,0.252856
time,Hardware,Voltage,Current
1626307781585,high-voltage-2,2,0.305041
time,Hardware,Voltage,Current
1626307781585,high-voltage-2,3,0.332016
time,Hardware,Voltage,Current
1626307781585,high-voltage-2,4,0.361227
time,Hardware,Voltage,Current
1626307781585,high-voltage-2,5,0.387101
time,Hardware,Voltage,Current
1626307781585,high-voltage-2,6,0.420218
time,Hardware,Voltage,Current
1626307781585,high-voltage-2,7,0.457487
time,Hardware,Voltage,Current
1626307781585,high-voltage-2,8,0.497375
time,Hardware,Voltage,Current
1626307781585,high-voltage-2,9,0.539602
time,Hardware,Voltage,Current
1626307781585,high-voltage-2,10,0.583413
time,Hardware,Voltage,Current
1626307781585,high-voltage-2,11,0.627009
time,Hardware,Voltage,Current
1626307781585,high-voltage-2,12,0.667504
time,Hardware,Voltage,Current
1626307781585,high-voltage-2,13,0.706379
time,Hardware,Voltage,Current
1626307781585,high-voltage-2,14,0.738296
time,Hardware,Voltage,Current
1626307781585,high-voltage-2,15,0.76686
time,Hardware,Voltage,Current
1626307781585,high-voltage-2,16,0.794082
time,Hardware,Voltage,Current
1626307781585,high-voltage-2,17,0.817048
time,Hardware,Voltage,Current
1626307781585,high-voltage-2,18,0.839903
time,Hardware,Voltage,Current
1626307781585,high-voltage-2,19,0.860139
time,Hardware,Voltage,Current
1626307781585,high-voltage-2,20,0.883845
time,Hardware,Voltage,Current
1626307781585,high-voltage-2,25,0.97544
time,Hardware,Voltage,Current
1626307781585,high-voltage-2,30,1.06808
time,Hardware,Voltage,Current
1626307781585,high-voltage-2,35,1.16319
time,Hardware,Voltage,Current
1626307781585,high-voltage-2,40,1.27447
time,Hardware,Voltage,Current
1626307781585,high-voltage-2,45,1.40879
time,Hardware,Voltage,Current
1626307781585,high-voltage-2,50,1.50429
time,Hardware,Voltage,Current
1626307781585,high-voltage-2,55,1.59634
time,Hardware,Voltage,Current
1626307781585,high-voltage-2,60,1.68441
time,Hardware,Voltage,Current
1626307781585,high-voltage-2,65,1.76709
time,Hardware,Voltage,Current
1626307781585,high-voltage-2,70,1.84691
time,Hardware,Voltage,Current
1626307781585,high-voltage-2,75,1.92404
time,Hardware,Voltage,Current
1626307781585,high-voltage-2,80,1.99862
time,Hardware,Voltage,Current
1626307781585,high-voltage-2,85,2.07079
time,Hardware,Voltage,Current
1626307781585,high-voltage-2,90,2.13893
time,Hardware,Voltage,Current
1626307781585,high-voltage-2,95,2.20513
time,Hardware,Voltage,Current
1626307781585,high-voltage-2,100,2.26973
