{
    "Data": [324.0, 1102.0, 210.0, 60.0, 110.0, 132.0, 81.0, 74.0, 124.0, 140.0, 185.0, 276.0, 441.0, 589.0, 959.0, 1243.0, 1694.0, 1865.0, 2160.0, 2408.0, 2467.0, 2258.0, 2058.0, 1819.0, 1558.0, 1515.0, 1579.0, 1650.0, 1768.0, 1847.0, 1711.0, 1432.0, 1159.0, 844.0, 652.0, 492.0, 399.0, 303.0, 317.0, 300.0, 280.0, 237.0, 262.0, 237.0, 221.0, 231.0, 232.0, 188.0, 212.0, 212.0, 219.0, 209.0, 201.0, 219.0, 228.0, 220.0, 210.0, 209.0, 230.0, 227.0, 203.0, 187.0, 202.0, 185.0, 220.0, 187.0, 198.0, 174.0, 180.0, 179.0, 172.0, 158.0, 160.0, 178.0, 177.0, 153.0, 155.0, 141.0, 148.0, 154.0, 147.0, 115.0, 153.0, 145.0, 137.0, 117.0, 150.0, 133.0, 122.0, 123.0, 116.0, 150.0, 110.0, 114.0, 118.0, 101.0, 117.0, 119.0, 109.0, 105.0, 98.0, 116.0, 93.0, 90.0, 85.0, 99.0, 84.0, 77.0, 91.0, 90.0, 77.0, 85.0, 88.0, 80.0, 81.0, 70.0, 74.0, 70.0, 74.0, 54.0, 72.0, 75.0, 50.0, 59.0, 60.0, 62.0, 43.0, 56.0, 51.0, 51.0, 56.0, 40.0, 41.0, 34.0, 52.0, 51.0, 40.0, 42.0, 35.0, 49.0, 43.0, 38.0, 36.0, 36.0, 24.0, 32.0, 26.0, 24.0, 28.0, 28.0, 29.0, 27.0, 25.0, 20.0, 20.0, 19.0, 17.0, 16.0, 15.0, 15.0, 6.0, 17.0, 14.0, 9.0, 15.0, 14.0, 10.0, 14.0, 10.0, 11.0, 15.0, 9.0, 13.0, 10.0, 4.0, 9.0, 7.0, 12.0, 7.0, 7.0, 6.0, 12.0, 6.0, 3.0, 6.0, 4.0, 8.0, 7.0, 2.0, 8.0, 1.0, 3.0, 4.0, 5.0, 1.0, 3.0, 3.0, 4.0, 5.0, 3.0, 6.0, 5.0, 5.0, 4.0, 1.0, 5.0, 2.0, 3.0, 3.0, 6.0, 1.0, 4.0, 1.0, 1.0, 2.0, 1.0, 1.0, 3.0, 1.0, 2.0, 1.0, 3.0, 4.0, 3.0, 3.0, 3.0, 6.0, 4.0, 4.0, 2.0, 3.0, 1.0, 2.0, 2.0, 6.0],
    "Name": "NoiseDist-0",
    "Overflow": 297.0,
    "Type": "Histo1d",
    "Underflow": 0.0,
    "x": {
        "AxisTitle": "Noise [e]",
        "Bins": 235,
        "High": 1176.0,
        "Low": -2.0
    },
    "y": {
        "AxisTitle": "Number of Pixels"
    },
    "z": {
        "AxisTitle": "z"
    }
}