{
    "Data": [1.0, 9.0, 2.0, 3.0, 2.0, 7.0, 17.0, 32.0, 116.0, 299.0, 810.0, 1592.0, 2906.0, 4064.0, 4645.0, 4251.0, 3302.0, 2613.0, 2452.0, 2859.0, 3658.0, 4317.0, 4696.0, 4696.0, 3915.0, 3107.0, 2399.0, 1852.0, 1515.0, 1277.0, 1145.0, 1068.0, 1083.0, 1059.0, 967.0, 972.0, 947.0, 912.0, 876.0, 825.0, 774.0, 668.0, 584.0, 477.0, 422.0, 356.0, 279.0, 211.0, 197.0, 165.0, 126.0, 98.0, 71.0, 59.0, 58.0, 44.0, 31.0, 42.0, 20.0, 21.0, 21.0, 19.0, 17.0, 14.0, 17.0, 17.0, 15.0, 5.0, 9.0],
    "Name": "NoiseDist-0",
    "Overflow": 128.0,
    "Type": "Histo1d",
    "Underflow": 0.0,
    "x": {
        "AxisTitle": "Noise [e]",
        "Bins": 69,
        "High": 346.0,
        "Low": -2.0
    },
    "y": {
        "AxisTitle": "Number of Pixels"
    },
    "z": {
        "AxisTitle": "z"
    }
}