{
    "Data": [0.0, 0.0, 0.0, 0.0, 0.0, 0.0, 0.0, 0.0, 0.0, 0.0, 0.0, 0.0, 0.0, 13.0, 71.0, 23.0, 8.0, 252.0, 705.0, 267.0, 121.0, 777.0, 2454.0, 2243.0, 564.0, 1318.0, 2543.0, 2265.0, 869.0, 1130.0, 1957.0, 2249.0, 1147.0, 1085.0, 1513.0, 1746.0, 1049.0, 876.0, 1339.0, 1949.0, 1672.0, 967.0, 1168.0, 1806.0, 1913.0, 1339.0, 1163.0, 1548.0, 2236.0, 1884.0, 1261.0, 1186.0, 1374.0, 1409.0, 1089.0, 896.0, 879.0, 1096.0, 1068.0, 818.0, 758.0, 711.0, 624.0, 513.0, 473.0, 502.0, 537.0, 448.0, 382.0, 337.0, 329.0, 361.0, 320.0, 267.0, 207.0, 240.0, 215.0, 199.0, 170.0, 136.0, 178.0, 132.0, 104.0, 95.0, 84.0, 72.0, 62.0, 61.0, 67.0, 54.0, 50.0, 42.0, 40.0, 29.0, 35.0, 22.0, 33.0, 32.0, 28.0, 31.0, 22.0, 26.0, 19.0, 19.0, 11.0, 21.0, 13.0, 18.0, 14.0, 18.0, 9.0, 12.0, 18.0, 16.0, 8.0, 8.0, 8.0, 16.0, 7.0, 14.0, 15.0, 10.0, 6.0, 7.0, 8.0, 3.0, 2.0, 6.0, 3.0, 5.0, 4.0, 4.0, 3.0, 4.0, 7.0, 4.0, 4.0, 3.0, 5.0, 6.0, 2.0, 5.0, 6.0, 6.0, 5.0, 1.0, 1.0, 1.0, 3.0, 3.0, 3.0, 1.0, 4.0, 2.0, 1.0, 2.0, 5.0, 3.0, 3.0, 3.0, 2.0, 3.0, 2.0, 4.0, 3.0, 5.0, 2.0, 1.0, 2.0, 5.0, 1.0, 3.0, 1.0, 1.0, 3.0, 6.0, 1.0, 0.0, 2.0, 1.0, 2.0, 1.0, 0.0, 1.0, 2.0, 0.0, 1.0, 1.0, 2.0, 0.0, 3.0, 0.0, 1.0, 1.0, 1.0, 1.0, 2.0, 1.0, 3.0, 1.0, 4.0],
    "Name": "TimePerFitDist-0",
    "Overflow": 192.0,
    "Type": "Histo1d",
    "Underflow": 0.0,
    "x": {
        "AxisTitle": "Fit Time [us]",
        "Bins": 201,
        "High": 401.0,
        "Low": -1.0
    },
    "y": {
        "AxisTitle": "Number of Pixels"
    },
    "z": {
        "AxisTitle": "z"
    }
}