{
    "Data": [0.0, 0.0, 0.0, 0.0, 0.0, 0.0, 0.0, 0.0, 0.0, 0.0, 0.0, 0.0, 0.0, 0.0, 0.0, 2.0, 0.0, 1.0, 0.0, 2.0, 4.0, 4.0, 11.0, 10.0, 8.0, 14.0, 12.0, 12.0, 23.0, 18.0, 22.0, 26.0, 30.0, 44.0, 37.0, 45.0, 42.0, 40.0, 44.0, 49.0, 50.0, 48.0, 46.0, 50.0, 50.0, 49.0, 50.0, 50.0, 50.0, 50.0, 50.0],
    "Name": "Scurve-60-96",
    "Overflow": 0.0,
    "Type": "Histo1d",
    "Underflow": 0.0,
    "x": {
        "AxisTitle": "Vcal",
        "Bins": 51,
        "High": 302.5,
        "Low": 47.5
    },
    "y": {
        "AxisTitle": "Occupancy"
    },
    "z": {
        "AxisTitle": "z"
    }
}