{
    "Data": [8.0, 20.0, 1.0, 2.0, 0.0, 9.0, 91.0, 213.0, 454.0, 876.0, 1653.0, 2643.0, 3862.0, 4393.0, 4069.0, 3358.0, 2293.0, 1729.0, 1797.0, 2234.0, 3150.0, 3787.0, 3941.0, 3613.0, 2855.0, 1956.0, 1201.0, 708.0, 393.0, 216.0, 139.0, 83.0, 65.0, 40.0, 32.0, 31.0, 13.0, 13.0, 14.0, 14.0, 14.0, 12.0, 4.0, 8.0],
    "Name": "NoiseDist-0",
    "Overflow": 67.0,
    "Type": "Histo1d",
    "Underflow": 0.0,
    "x": {
        "AxisTitle": "Noise [e]",
        "Bins": 44,
        "High": 221.0,
        "Low": -2.0
    },
    "y": {
        "AxisTitle": "Number of Pixels"
    },
    "z": {
        "AxisTitle": "z"
    }
}