time,Hardware,Voltage,Current
1621991132813,high-voltage,1,0.0644022
time,Hardware,Voltage,Current
1621991132813,high-voltage,2,0.123206
time,Hardware,Voltage,Current
1621991132813,high-voltage,3,0.209874
time,Hardware,Voltage,Current
1621991132813,high-voltage,3.31357e-07,0.329072
time,Hardware,Voltage,Current
1621991132813,high-voltage,5,0.453823
time,Hardware,Voltage,Current
1621991132813,high-voltage,6,0.678055
time,Hardware,Voltage,Current
1621991132813,high-voltage,7,0.927346
time,Hardware,Voltage,Current
1621991132813,high-voltage,8,1.22304
time,Hardware,Voltage,Current
1621991132813,high-voltage,9,9e+06
time,Hardware,Voltage,Current
1621991132813,high-voltage,10,2.06953
time,Hardware,Voltage,Current
1621991132813,high-voltage,11,2.69067
time,Hardware,Voltage,Current
1621991132813,high-voltage,12,3.31686
time,Hardware,Voltage,Current
1621991132813,high-voltage,13,4.1519
time,Hardware,Voltage,Current
1621991132813,high-voltage,14,5.28
time,Hardware,Voltage,Current
1621991132813,high-voltage,15,6.24295
time,Hardware,Voltage,Current
1621991132813,high-voltage,16,7.38148
time,Hardware,Voltage,Current
1621991132813,high-voltage,17,8.7547
time,Hardware,Voltage,Current
1621991132813,high-voltage,18,9.85998
time,Hardware,Voltage,Current
1621991132813,high-voltage,19,10.0001
