{
    "Data": [1846.0, 22380.0, 18918.0, 6891.0, 1993.0, 831.0, 790.0, 966.0, 1051.0, 1062.0, 977.0, 743.0, 630.0, 543.0, 466.0, 467.0, 385.0, 406.0, 446.0, 402.0, 446.0, 461.0, 526.0, 486.0, 483.0, 576.0, 552.0, 536.0, 523.0, 537.0, 560.0, 533.0, 506.0, 459.0, 434.0, 485.0, 481.0, 489.0, 454.0, 451.0, 306.0, 347.0, 337.0, 354.0, 340.0, 287.0, 272.0, 233.0, 235.0, 229.0, 108.0],
    "Name": "Chi2Dist-0",
    "Overflow": 0.0,
    "Type": "Histo1d",
    "Underflow": 0.0,
    "x": {
        "AxisTitle": "Fit Chi/ndf",
        "Bins": 51,
        "High": 2.5250000953674318,
        "Low": -0.02500000037252903
    },
    "y": {
        "AxisTitle": "Number of Pixels"
    },
    "z": {
        "AxisTitle": "z"
    }
}