time,Hardware,Voltage,Current
1623285529964,high-voltage,1,0.0255764
time,Hardware,Voltage,Current
1623285529964,high-voltage,2,0.0329388
time,Hardware,Voltage,Current
1623285529964,high-voltage,3,0.0391905
time,Hardware,Voltage,Current
1623285529964,high-voltage,4,0.0451029
time,Hardware,Voltage,Current
1623285529964,high-voltage,5,0.0515496
time,Hardware,Voltage,Current
1623285529964,high-voltage,6,0.056346
time,Hardware,Voltage,Current
1623285529964,high-voltage,7,0.0614053
time,Hardware,Voltage,Current
1623285529964,high-voltage,8,0.0665613
time,Hardware,Voltage,Current
1623285529964,high-voltage,9,0.0709623
time,Hardware,Voltage,Current
1623285529964,high-voltage,10,0.0768486
time,Hardware,Voltage,Current
1623285529964,high-voltage,11,0.0813898
time,Hardware,Voltage,Current
1623285529964,high-voltage,12,0.0851294
time,Hardware,Voltage,Current
1623285529964,high-voltage,13,0.0879621
time,Hardware,Voltage,Current
1623285529964,high-voltage,14,0.0909744
time,Hardware,Voltage,Current
1623285529964,high-voltage,15,0.0944409
time,Hardware,Voltage,Current
1623285529964,high-voltage,16,0.0966387
time,Hardware,Voltage,Current
1623285529964,high-voltage,17,0.0998805
time,Hardware,Voltage,Current
1623285529964,high-voltage,18,0.10197
time,Hardware,Voltage,Current
1623285529964,high-voltage,1.03743e-07,0.104781
time,Hardware,Voltage,Current
1623285529964,high-voltage,20,0.105718
