time,Hardware,Voltage,Current
1626314671297,high-voltage,1,0.05176
time,Hardware,Voltage,Current
1626314671297,high-voltage,2,0.0726811
time,Hardware,Voltage,Current
1626314671297,high-voltage,3,0.0858812
time,Hardware,Voltage,Current
1626314671297,high-voltage,4,0.0951097
time,Hardware,Voltage,Current
1626314671297,high-voltage,5,0.103584
time,Hardware,Voltage,Current
1626314671297,high-voltage,6,0.113592
time,Hardware,Voltage,Current
1626314671297,high-voltage,7,0.124904
time,Hardware,Voltage,Current
1626314671297,high-voltage,8,0.136611
time,Hardware,Voltage,Current
1626314671297,high-voltage,9,0.149483
time,Hardware,Voltage,Current
1626314671297,high-voltage,10,0.163694
time,Hardware,Voltage,Current
1626314671297,high-voltage,11,0.177524
time,Hardware,Voltage,Current
1626314671297,high-voltage,12,0.189875
time,Hardware,Voltage,Current
1626314671297,high-voltage,13,0.201566
time,Hardware,Voltage,Current
1626314671297,high-voltage,14,0.21292
time,Hardware,Voltage,Current
1626314671297,high-voltage,15,0.221507
time,Hardware,Voltage,Current
1626314671297,high-voltage,16,0.229392
time,Hardware,Voltage,Current
1626314671297,high-voltage,17,0.237753
time,Hardware,Voltage,Current
1626314671297,high-voltage,18,0.243721
time,Hardware,Voltage,Current
1626314671297,high-voltage,19,0.250505
time,Hardware,Voltage,Current
1626314671297,high-voltage,20,0.257524
time,Hardware,Voltage,Current
1626314671297,high-voltage,25,0.28761
time,Hardware,Voltage,Current
1626314671297,high-voltage,30,0.321783
time,Hardware,Voltage,Current
1626314671297,high-voltage,35,0.380493
time,Hardware,Voltage,Current
1626314671297,high-voltage,40,0.521973
time,Hardware,Voltage,Current
1626314671297,high-voltage,45,0.795859
time,Hardware,Voltage,Current
1626314671297,high-voltage,50,1.24498
time,Hardware,Voltage,Current
1626314671297,high-voltage,55,1.95614
time,Hardware,Voltage,Current
1626314671297,high-voltage,60,3.05913
time,Hardware,Voltage,Current
1626314671297,high-voltage,65,4.58797
time,Hardware,Voltage,Current
1626314671297,high-voltage,70,6.64746
time,Hardware,Voltage,Current
1626314671297,high-voltage,75,9.49215
time,Hardware,Voltage,Current
1626314671297,high-voltage,80,10
