time,Hardware,Voltage,Current
1621389205459,high-voltage-2,1,0.126736
time,Hardware,Voltage,Current
1621389205459,high-voltage-2,2,0.152157
time,Hardware,Voltage,Current
1621389205459,high-voltage-2,3,0.167234
time,Hardware,Voltage,Current
1621389205459,high-voltage-2,4,0.183519
time,Hardware,Voltage,Current
1621389205459,high-voltage-2,5,0.195949
time,Hardware,Voltage,Current
1621389205459,high-voltage-2,6,0.213746
time,Hardware,Voltage,Current
1621389205459,high-voltage-2,7,0.229031
time,Hardware,Voltage,Current
1621389205459,high-voltage-2,8,0.251789
time,Hardware,Voltage,Current
1621389205459,high-voltage-2,9,0.271136
time,Hardware,Voltage,Current
1621389205459,high-voltage-2,10,0.294419
time,Hardware,Voltage,Current
1621389205459,high-voltage-2,11,0.315669
time,Hardware,Voltage,Current
1621389205459,high-voltage-2,12,0.33889
time,Hardware,Voltage,Current
1621389205459,high-voltage-2,13,0.357719
time,Hardware,Voltage,Current
1621389205459,high-voltage-2,14,0.376677
time,Hardware,Voltage,Current
1621389205459,high-voltage-2,15,0.391967
time,Hardware,Voltage,Current
1621389205459,high-voltage-2,16,0.406744
time,Hardware,Voltage,Current
1621389205459,high-voltage-2,17,0.421386
time,Hardware,Voltage,Current
1621389205459,high-voltage-2,18,0.433075
time,Hardware,Voltage,Current
1621389205459,high-voltage-2,4.45865e-07,0.444958
time,Hardware,Voltage,Current
1621389205459,high-voltage-2,20,0.457722
time,Hardware,Voltage,Current
1621389205459,high-voltage-2,25,0.50696
time,Hardware,Voltage,Current
1621389205459,high-voltage-2,30,0.558459
time,Hardware,Voltage,Current
1621389205459,high-voltage-2,35,0.609818
time,Hardware,Voltage,Current
1621389205459,high-voltage-2,40,0.664579
time,Hardware,Voltage,Current
1621389205459,high-voltage-2,45,0.737432
time,Hardware,Voltage,Current
1621389205459,high-voltage-2,50,0.789996
time,Hardware,Voltage,Current
1621389205459,high-voltage-2,55,0.835913
time,Hardware,Voltage,Current
1621389205459,high-voltage-2,60,0.882605
time,Hardware,Voltage,Current
1621389205459,high-voltage-2,65,0.927504
time,Hardware,Voltage,Current
1621389205459,high-voltage-2,70,0.968843
time,Hardware,Voltage,Current
1621389205459,high-voltage-2,75,1.00912
time,Hardware,Voltage,Current
1621389205459,high-voltage-2,80,1.04846
time,Hardware,Voltage,Current
1621389205459,high-voltage-2,85,1.08666
time,Hardware,Voltage,Current
1621389205459,high-voltage-2,90,1.12389
time,Hardware,Voltage,Current
1621389205459,high-voltage-2,95,1.16104
time,Hardware,Voltage,Current
1621389205459,high-voltage-2,100,1.1943
