{
    "Data": [23.0, 39.0, 0.0, 0.0, 0.0, 6.0, 61.0, 232.0, 615.0, 1612.0, 3203.0, 4573.0, 4972.0, 4708.0, 3767.0, 3757.0, 4304.0, 4749.0, 4863.0, 3937.0, 2680.0, 1616.0, 852.0, 377.0, 213.0, 114.0, 64.0, 50.0, 35.0, 22.0, 16.0],
    "Name": "NoiseDist-0",
    "Overflow": 101.0,
    "Type": "Histo1d",
    "Underflow": 0.0,
    "x": {
        "AxisTitle": "Noise [e]",
        "Bins": 31,
        "High": 156.0,
        "Low": -2.0
    },
    "y": {
        "AxisTitle": "Number of Pixels"
    },
    "z": {
        "AxisTitle": "z"
    }
}