{
    "Data": [0.0, 0.0, 0.0, 0.0, 0.0, 0.0, 0.0, 0.0, 0.0, 0.0, 0.0, 0.0, 0.0, 0.0, 55.0, 11.0, 7.0, 22.0, 25.0, 19.0, 9.0, 61.0, 102.0, 108.0, 165.0, 335.0, 453.0, 405.0, 474.0, 566.0, 724.0, 653.0, 571.0, 602.0, 893.0, 958.0, 773.0, 1113.0, 2214.0, 3043.0, 2504.0, 2333.0, 3566.0, 4955.0, 4300.0, 2838.0, 2798.0, 4248.0, 3966.0, 2627.0, 1691.0, 1729.0, 1879.0, 1565.0, 1179.0, 1063.0, 1282.0, 1133.0, 903.0, 716.0, 662.0, 832.0, 698.0, 517.0, 522.0, 480.0, 472.0, 378.0, 366.0, 315.0, 302.0, 254.0, 226.0, 201.0, 182.0, 198.0, 183.0, 173.0, 135.0, 127.0, 121.0, 118.0, 112.0, 102.0, 92.0, 89.0, 76.0, 48.0, 59.0, 58.0, 51.0, 41.0, 47.0, 36.0, 47.0, 30.0, 29.0, 40.0, 34.0, 30.0, 28.0, 31.0, 26.0, 22.0, 25.0, 15.0, 25.0, 22.0, 14.0, 12.0, 14.0, 13.0, 11.0, 14.0, 9.0, 14.0, 9.0, 12.0, 11.0, 10.0, 14.0, 11.0, 12.0, 13.0, 10.0, 10.0, 10.0, 6.0, 11.0, 10.0, 11.0, 4.0, 7.0, 7.0, 14.0, 14.0, 5.0, 7.0, 11.0, 6.0, 4.0, 5.0, 9.0, 7.0, 2.0, 3.0, 4.0, 5.0, 7.0, 4.0, 6.0, 3.0, 5.0, 3.0, 5.0, 1.0, 5.0, 5.0, 4.0, 3.0, 5.0, 1.0, 3.0, 3.0, 2.0, 5.0, 4.0, 1.0, 1.0, 2.0, 2.0, 3.0, 4.0, 2.0, 5.0, 4.0, 2.0, 8.0, 4.0, 3.0, 2.0, 1.0, 0.0, 2.0, 3.0, 2.0, 4.0, 1.0, 2.0, 3.0, 3.0, 4.0, 4.0, 3.0, 1.0, 1.0, 2.0, 1.0, 3.0, 1.0, 2.0],
    "Name": "TimePerFitDist-0",
    "Overflow": 194.0,
    "Type": "Histo1d",
    "Underflow": 0.0,
    "x": {
        "AxisTitle": "Fit Time [us]",
        "Bins": 201,
        "High": 401.0,
        "Low": -1.0
    },
    "y": {
        "AxisTitle": "Number of Pixels"
    },
    "z": {
        "AxisTitle": "z"
    }
}