{
    "Data": [0.0, 0.0, 0.0, 0.0, 0.0, 0.0, 0.0, 0.0, 0.0, 0.0, 0.0, 0.0, 0.0, 0.0, 0.0, 0.0, 0.0, 0.0, 0.0, 0.0, 0.0, 0.0, 0.0, 0.0, 0.0, 0.0, 0.0, 0.0, 0.0, 0.0, 0.0, 0.0, 0.0, 0.0, 0.0, 0.0, 0.0, 0.0, 0.0, 0.0, 0.0, 0.0, 0.0, 0.0, 0.0, 0.0, 0.0, 0.0, 0.0, 0.0, 47.0, 123.0, 148.0, 165.0, 182.0, 208.0, 243.0, 259.0, 300.0, 359.0, 413.0, 421.0, 492.0, 538.0, 537.0, 633.0, 675.0, 739.0, 764.0, 810.0, 837.0, 818.0, 835.0, 861.0, 893.0, 931.0, 868.0, 938.0, 873.0, 820.0, 830.0, 892.0, 760.0, 767.0, 871.0, 958.0, 1050.0, 1360.0, 1577.0, 1992.0, 2245.0, 2622.0, 2760.0, 2892.0, 2676.0, 2391.0, 2018.0, 1562.0, 1131.0, 827.0, 597.0, 418.0, 316.0, 201.0, 132.0, 92.0, 70.0, 69.0, 52.0, 29.0, 31.0, 31.0, 17.0, 26.0, 16.0, 25.0, 11.0, 16.0, 14.0, 17.0, 10.0, 13.0, 16.0, 12.0, 15.0, 11.0, 6.0, 5.0, 6.0, 9.0, 5.0, 4.0, 4.0, 6.0, 8.0, 9.0, 8.0, 4.0, 3.0, 7.0, 3.0, 4.0, 2.0, 1.0, 2.0, 1.0, 3.0, 4.0, 1.0, 4.0, 4.0, 5.0, 5.0, 7.0, 11.0, 10.0, 9.0, 20.0, 25.0, 26.0, 29.0, 40.0, 53.0, 71.0, 88.0, 109.0, 109.0, 147.0, 177.0, 207.0, 263.0, 269.0, 290.0, 377.0, 415.0, 503.0, 547.0, 602.0, 642.0, 703.0, 731.0, 776.0, 771.0, 836.0, 868.0, 879.0, 891.0, 939.0, 920.0, 860.0, 887.0, 883.0, 776.0, 748.0, 762.0, 661.0, 670.0, 541.0, 507.0, 452.0, 459.0, 432.0, 353.0, 330.0, 268.0, 245.0, 217.0, 168.0, 158.0, 151.0, 134.0, 105.0, 79.0, 78.0, 67.0, 55.0, 50.0, 29.0, 28.0, 16.0, 20.0, 14.0, 12.0, 11.0, 7.0, 2.0, 3.0, 6.0, 1.0, 1.0, 1.0, 0.0, 0.0, 0.0, 0.0, 0.0, 0.0, 0.0, 1.0, 0.0, 0.0, 0.0, 0.0, 1.0, 0.0, 0.0, 0.0, 0.0, 1.0, 0.0, 0.0, 0.0, 0.0, 0.0, 0.0, 0.0, 0.0, 1.0, 0.0, 0.0, 0.0, 0.0, 0.0, 0.0, 0.0, 0.0, 0.0, 0.0, 0.0, 0.0, 0.0, 0.0, 0.0, 0.0, 0.0, 0.0, 0.0, 0.0, 0.0, 0.0, 0.0, 0.0, 0.0, 0.0, 0.0, 0.0, 0.0, 0.0, 0.0, 0.0, 0.0, 0.0, 0.0, 0.0, 0.0, 0.0, 0.0, 0.0, 0.0, 0.0, 0.0, 0.0, 0.0, 0.0, 0.0, 0.0, 0.0, 0.0, 0.0, 0.0, 0.0, 0.0, 0.0, 0.0, 0.0, 0.0, 0.0, 0.0, 0.0, 0.0, 0.0, 0.0, 0.0, 0.0, 0.0, 0.0, 0.0, 0.0, 0.0, 0.0, 0.0, 0.0, 0.0, 0.0, 0.0, 0.0, 0.0, 0.0, 0.0, 0.0, 0.0, 0.0, 0.0, 0.0, 0.0, 0.0, 0.0, 0.0, 0.0, 0.0, 0.0, 0.0, 0.0, 0.0, 0.0, 0.0, 0.0, 0.0, 0.0, 0.0, 0.0, 0.0, 0.0],
    "Name": "ThresholdDist-0",
    "Overflow": 0.0,
    "Type": "Histo1d",
    "Underflow": 0.0,
    "x": {
        "AxisTitle": "Threshold [e]",
        "Bins": 363,
        "High": 3625.0,
        "Low": -5.0
    },
    "y": {
        "AxisTitle": "Number of Pixels"
    },
    "z": {
        "AxisTitle": "z"
    }
}