{
    "Data": [0.0, 0.0, 0.0, 0.0, 0.0, 0.0, 0.0, 0.0, 0.0, 0.0, 0.0, 0.0, 0.0, 0.0, 1.0, 0.0, 0.0, 48.0, 368.0, 119.0, 44.0, 849.0, 4327.0, 1826.0, 357.0, 1246.0, 3946.0, 2403.0, 481.0, 937.0, 2028.0, 1579.0, 411.0, 263.0, 425.0, 455.0, 306.0, 374.0, 650.0, 561.0, 410.0, 773.0, 1543.0, 2083.0, 1505.0, 1427.0, 2145.0, 3078.0, 2762.0, 2603.0, 2388.0, 2544.0, 2619.0, 2048.0, 2122.0, 1897.0, 2071.0, 1959.0, 1644.0, 1644.0, 1494.0, 1297.0, 924.0, 743.0, 715.0, 698.0, 700.0, 527.0, 496.0, 458.0, 438.0, 420.0, 310.0, 281.0, 248.0, 259.0, 209.0, 161.0, 155.0, 141.0, 132.0, 118.0, 118.0, 95.0, 101.0, 71.0, 65.0, 58.0, 46.0, 61.0, 51.0, 51.0, 33.0, 38.0, 48.0, 30.0, 34.0, 31.0, 38.0, 24.0, 36.0, 18.0, 21.0, 17.0, 12.0, 35.0, 18.0, 21.0, 20.0, 26.0, 17.0, 8.0, 9.0, 6.0, 16.0, 10.0, 13.0, 15.0, 12.0, 13.0, 10.0, 10.0, 8.0, 11.0, 11.0, 10.0, 9.0, 8.0, 16.0, 8.0, 8.0, 11.0, 11.0, 5.0, 7.0, 13.0, 9.0, 11.0, 6.0, 5.0, 8.0, 3.0, 6.0, 9.0, 5.0, 6.0, 12.0, 6.0, 4.0, 5.0, 5.0, 6.0, 2.0, 5.0, 4.0, 6.0, 1.0, 2.0, 3.0, 4.0, 5.0, 7.0, 6.0, 3.0, 1.0, 3.0, 4.0, 3.0, 2.0, 3.0, 1.0, 3.0, 3.0, 1.0, 1.0, 2.0, 0.0, 1.0, 3.0, 1.0, 3.0, 1.0, 5.0, 2.0, 0.0, 2.0, 3.0, 1.0, 2.0, 1.0, 3.0, 2.0, 0.0, 2.0, 2.0, 0.0, 2.0, 1.0, 2.0, 1.0, 0.0],
    "Name": "TimePerFitDist-0",
    "Overflow": 111.0,
    "Type": "Histo1d",
    "Underflow": 0.0,
    "x": {
        "AxisTitle": "Fit Time [us]",
        "Bins": 201,
        "High": 401.0,
        "Low": -1.0
    },
    "y": {
        "AxisTitle": "Number of Pixels"
    },
    "z": {
        "AxisTitle": "z"
    }
}