time,Hardware,Voltage,Current
1626300294366,high-voltage-3,1,0.0737793
time,Hardware,Voltage,Current
1626300294366,high-voltage-3,2,0.0798371
time,Hardware,Voltage,Current
1626300294366,high-voltage-3,3,0.0829951
time,Hardware,Voltage,Current
1626300294366,high-voltage-3,4,0.0884235
time,Hardware,Voltage,Current
1626300294366,high-voltage-3,5,0.0937862
time,Hardware,Voltage,Current
1626300294366,high-voltage-3,6,0.0969455
time,Hardware,Voltage,Current
1626300294366,high-voltage-3,7,0.0988224
time,Hardware,Voltage,Current
1626300294366,high-voltage-3,8,0.100988
time,Hardware,Voltage,Current
1626300294366,high-voltage-3,9,0.103217
time,Hardware,Voltage,Current
1626300294366,high-voltage-3,10,0.106378
time,Hardware,Voltage,Current
1626300294366,high-voltage-3,11,0.108607
time,Hardware,Voltage,Current
1626300294366,high-voltage-3,12,0.111224
time,Hardware,Voltage,Current
1626300294366,high-voltage-3,13,0.115655
time,Hardware,Voltage,Current
1626300294366,high-voltage-3,14,0.118571
time,Hardware,Voltage,Current
1626300294366,high-voltage-3,15,0.12164
time,Hardware,Voltage,Current
1626300294366,high-voltage-3,16,0.126375
time,Hardware,Voltage,Current
1626300294366,high-voltage-3,17,0.129472
time,Hardware,Voltage,Current
1626300294366,high-voltage-3,18,0.129591
time,Hardware,Voltage,Current
1626300294366,high-voltage-3,19,0.130513
time,Hardware,Voltage,Current
1626300294366,high-voltage-3,20,0.130121
time,Hardware,Voltage,Current
1626300294366,high-voltage-3,25,0.141056
time,Hardware,Voltage,Current
1626300294366,high-voltage-3,30,0.150678
time,Hardware,Voltage,Current
1626300294366,high-voltage-3,35,0.158413
time,Hardware,Voltage,Current
1626300294366,high-voltage-3,40,0.168607
time,Hardware,Voltage,Current
1626300294366,high-voltage-3,45,0.17716
time,Hardware,Voltage,Current
1626300294366,high-voltage-3,50,0.183269
time,Hardware,Voltage,Current
1626300294366,high-voltage-3,55,0.186989
time,Hardware,Voltage,Current
1626300294366,high-voltage-3,60,0.190205
time,Hardware,Voltage,Current
1626300294366,high-voltage-3,65,0.197077
time,Hardware,Voltage,Current
1626300294366,high-voltage-3,70,0.206368
time,Hardware,Voltage,Current
1626300294366,high-voltage-3,75,0.218132
time,Hardware,Voltage,Current
1626300294366,high-voltage-3,80,0.230885
time,Hardware,Voltage,Current
1626300294366,high-voltage-3,85,0.243849
time,Hardware,Voltage,Current
1626300294366,high-voltage-3,90,0.256019
time,Hardware,Voltage,Current
1626300294366,high-voltage-3,95,0.270298
time,Hardware,Voltage,Current
1626300294366,high-voltage-3,100,0.284723
