{
    "Data": [0.0, 0.0, 0.0, 0.0, 0.0, 0.0, 0.0, 0.0, 0.0, 0.0, 0.0, 0.0, 0.0, 0.0, 0.0, 0.0, 0.0, 1.0, 3.0, 0.0, 2.0, 5.0, 1.0, 3.0, 3.0, 8.0, 11.0, 5.0, 5.0, 19.0, 25.0, 25.0, 21.0, 25.0, 4.0, 11.0, 50.0, 8.0, 29.0, 50.0, 50.0, 9.0, 34.0, 50.0, 48.0, 32.0, 50.0, 20.0, 50.0, 18.0, 50.0],
    "Name": "Scurve-110-96",
    "Overflow": 0.0,
    "Type": "Histo1d",
    "Underflow": 0.0,
    "x": {
        "AxisTitle": "Vcal",
        "Bins": 51,
        "High": 302.5,
        "Low": 47.5
    },
    "y": {
        "AxisTitle": "Occupancy"
    },
    "z": {
        "AxisTitle": "z"
    }
}