{
    "Data": [[3024.0, 1500.0, 907.0, 661.0, 538.0, 426.0, 351.0, 294.0, 252.0, 198.0, 184.0, 137.0, 157.0, 132.0, 119.0, 94.0, 120.0, 81.0, 78.0, 73.0, 55.0, 76.0, 58.0, 52.0, 59.0, 39.0, 41.0, 45.0, 38.0, 42.0, 48.0, 40.0, 37.0, 30.0, 30.0, 35.0, 39.0, 23.0, 22.0, 30.0, 18.0, 25.0, 26.0, 27.0, 20.0, 20.0, 20.0, 21.0, 27.0], [3164.0, 1795.0, 1236.0, 966.0, 745.0, 610.0, 572.0, 447.0, 414.0, 385.0, 334.0, 281.0, 247.0, 233.0, 216.0, 230.0, 182.0, 178.0, 146.0, 150.0, 158.0, 125.0, 112.0, 97.0, 115.0, 107.0, 79.0, 76.0, 90.0, 78.0, 72.0, 77.0, 56.0, 65.0, 68.0, 69.0, 45.0, 48.0, 42.0, 71.0, 62.0, 51.0, 43.0, 55.0, 38.0, 42.0, 39.0, 46.0, 53.0], [2818.0, 1766.0, 1327.0, 1049.0, 873.0, 788.0, 708.0, 578.0, 543.0, 525.0, 456.0, 462.0, 400.0, 372.0, 326.0, 351.0, 299.0, 281.0, 282.0, 240.0, 250.0, 236.0, 214.0, 180.0, 204.0, 190.0, 181.0, 172.0, 142.0, 157.0, 179.0, 149.0, 131.0, 116.0, 114.0, 116.0, 111.0, 131.0, 119.0, 108.0, 103.0, 91.0, 115.0, 91.0, 97.0, 104.0, 112.0, 91.0, 109.0], [2306.0, 1471.0, 1131.0, 991.0, 835.0, 764.0, 697.0, 687.0, 628.0, 601.0, 533.0, 537.0, 476.0, 442.0, 438.0, 456.0, 414.0, 379.0, 379.0, 372.0, 365.0, 363.0, 348.0, 309.0, 290.0, 304.0, 315.0, 268.0, 259.0, 263.0, 264.0, 218.0, 257.0, 236.0, 245.0, 235.0, 233.0, 239.0, 236.0, 188.0, 228.0, 225.0, 204.0, 224.0, 206.0, 198.0, 189.0, 199.0, 259.0], [2239.0, 1184.0, 912.0, 759.0, 700.0, 634.0, 567.0, 617.0, 538.0, 507.0, 524.0, 503.0, 473.0, 486.0, 427.0, 441.0, 421.0, 426.0, 391.0, 457.0, 408.0, 410.0, 404.0, 424.0, 383.0, 373.0, 415.0, 384.0, 367.0, 378.0, 388.0, 373.0, 389.0, 365.0, 397.0, 328.0, 374.0, 371.0, 357.0, 336.0, 390.0, 395.0, 393.0, 385.0, 378.0, 404.0, 408.0, 474.0, 547.0], [3753.0, 1714.0, 1080.0, 801.0, 666.0, 593.0, 532.0, 499.0, 446.0, 427.0, 412.0, 431.0, 370.0, 378.0, 400.0, 362.0, 357.0, 437.0, 368.0, 392.0, 373.0, 367.0, 411.0, 405.0, 423.0, 380.0, 399.0, 403.0, 392.0, 414.0, 437.0, 423.0, 434.0, 448.0, 476.0, 467.0, 512.0, 487.0, 466.0, 506.0, 522.0, 557.0, 564.0, 601.0, 667.0, 697.0, 762.0, 837.0, 1103.0], [4769.0, 3008.0, 2192.0, 1690.0, 1372.0, 1135.0, 920.0, 816.0, 678.0, 672.0, 560.0, 532.0, 490.0, 469.0, 418.0, 383.0, 392.0, 377.0, 396.0, 377.0, 358.0, 330.0, 362.0, 352.0, 370.0, 348.0, 347.0, 379.0, 376.0, 347.0, 405.0, 450.0, 452.0, 447.0, 434.0, 482.0, 527.0, 530.0, 524.0, 540.0, 597.0, 686.0, 665.0, 810.0, 893.0, 960.0, 1080.0, 1368.0, 1870.0], [1686.0, 1542.0, 1419.0, 1389.0, 1251.0, 1274.0, 1250.0, 1164.0, 1131.0, 1072.0, 988.0, 1024.0, 955.0, 917.0, 843.0, 813.0, 738.0, 717.0, 705.0, 708.0, 665.0, 627.0, 656.0, 596.0, 564.0, 572.0, 555.0, 586.0, 558.0, 512.0, 526.0, 510.0, 514.0, 507.0, 492.0, 519.0, 503.0, 495.0, 535.0, 627.0, 649.0, 685.0, 775.0, 845.0, 978.0, 1115.0, 1358.0, 1685.0, 2658.0], [353.0, 273.0, 285.0, 293.0, 277.0, 305.0, 328.0, 333.0, 394.0, 403.0, 452.0, 439.0, 488.0, 449.0, 502.0, 558.0, 558.0, 599.0, 652.0, 669.0, 647.0, 685.0, 662.0, 686.0, 757.0, 810.0, 788.0, 806.0, 832.0, 824.0, 872.0, 860.0, 900.0, 905.0, 942.0, 920.0, 984.0, 978.0, 1007.0, 963.0, 1098.0, 1064.0, 1150.0, 1233.0, 1331.0, 1424.0, 1779.0, 2252.0, 3449.0], [288.0, 115.0, 77.0, 74.0, 68.0, 64.0, 64.0, 45.0, 53.0, 65.0, 75.0, 77.0, 84.0, 98.0, 100.0, 102.0, 104.0, 141.0, 132.0, 152.0, 157.0, 163.0, 183.0, 180.0, 227.0, 237.0, 259.0, 280.0, 327.0, 353.0, 400.0, 402.0, 465.0, 521.0, 520.0, 616.0, 706.0, 773.0, 872.0, 985.0, 1091.0, 1218.0, 1466.0, 1626.0, 1929.0, 2316.0, 2761.0, 3670.0, 5679.0], [295.0, 117.0, 78.0, 44.0, 41.0, 32.0, 34.0, 23.0, 21.0, 28.0, 43.0, 32.0, 36.0, 32.0, 26.0, 41.0, 21.0, 28.0, 30.0, 43.0, 37.0, 40.0, 39.0, 38.0, 38.0, 54.0, 56.0, 61.0, 75.0, 64.0, 77.0, 92.0, 99.0, 125.0, 124.0, 145.0, 193.0, 190.0, 238.0, 255.0, 362.0, 432.0, 535.0, 643.0, 879.0, 1203.0, 1846.0, 3027.0, 6161.0], [316.0, 91.0, 67.0, 53.0, 38.0, 34.0, 25.0, 23.0, 28.0, 19.0, 22.0, 20.0, 25.0, 21.0, 21.0, 24.0, 22.0, 18.0, 20.0, 13.0, 23.0, 18.0, 14.0, 14.0, 22.0, 23.0, 24.0, 26.0, 25.0, 20.0, 27.0, 22.0, 37.0, 36.0, 39.0, 41.0, 60.0, 69.0, 82.0, 82.0, 85.0, 131.0, 161.0, 240.0, 255.0, 337.0, 594.0, 1148.0, 3105.0], [428.0, 126.0, 60.0, 41.0, 33.0, 24.0, 29.0, 21.0, 21.0, 22.0, 12.0, 24.0, 23.0, 21.0, 22.0, 19.0, 11.0, 8.0, 12.0, 19.0, 13.0, 12.0, 11.0, 13.0, 17.0, 17.0, 12.0, 8.0, 14.0, 19.0, 14.0, 22.0, 9.0, 21.0, 21.0, 17.0, 25.0, 29.0, 25.0, 34.0, 44.0, 55.0, 65.0, 68.0, 89.0, 142.0, 221.0, 429.0, 1292.0], [578.0, 149.0, 81.0, 44.0, 32.0, 29.0, 18.0, 28.0, 20.0, 18.0, 12.0, 10.0, 21.0, 15.0, 10.0, 14.0, 19.0, 12.0, 19.0, 18.0, 17.0, 9.0, 11.0, 12.0, 11.0, 7.0, 10.0, 12.0, 8.0, 17.0, 10.0, 20.0, 17.0, 18.0, 9.0, 13.0, 13.0, 16.0, 10.0, 14.0, 22.0, 25.0, 32.0, 29.0, 47.0, 60.0, 111.0, 177.0, 538.0], [1023.0, 228.0, 98.0, 59.0, 29.0, 31.0, 19.0, 17.0, 26.0, 18.0, 17.0, 9.0, 14.0, 12.0, 13.0, 14.0, 12.0, 17.0, 13.0, 10.0, 13.0, 12.0, 7.0, 9.0, 10.0, 9.0, 7.0, 12.0, 5.0, 11.0, 14.0, 9.0, 9.0, 13.0, 12.0, 13.0, 15.0, 15.0, 12.0, 20.0, 14.0, 15.0, 25.0, 20.0, 30.0, 24.0, 43.0, 76.0, 237.0], [1765.0, 470.0, 191.0, 81.0, 57.0, 32.0, 32.0, 20.0, 22.0, 11.0, 20.0, 18.0, 17.0, 12.0, 10.0, 12.0, 10.0, 15.0, 15.0, 9.0, 9.0, 7.0, 10.0, 9.0, 11.0, 3.0, 6.0, 6.0, 4.0, 11.0, 6.0, 7.0, 11.0, 12.0, 14.0, 9.0, 9.0, 12.0, 4.0, 14.0, 12.0, 12.0, 16.0, 26.0, 19.0, 23.0, 40.0, 47.0, 148.0], [2802.0, 985.0, 427.0, 221.0, 113.0, 58.0, 33.0, 36.0, 24.0, 27.0, 19.0, 16.0, 21.0, 14.0, 12.0, 13.0, 12.0, 8.0, 12.0, 10.0, 9.0, 7.0, 5.0, 7.0, 6.0, 10.0, 14.0, 7.0, 10.0, 8.0, 9.0, 6.0, 8.0, 4.0, 8.0, 14.0, 8.0, 6.0, 13.0, 8.0, 7.0, 8.0, 12.0, 13.0, 20.0, 22.0, 28.0, 31.0, 81.0], [4045.0, 1723.0, 921.0, 490.0, 254.0, 164.0, 123.0, 77.0, 56.0, 41.0, 32.0, 23.0, 24.0, 17.0, 15.0, 18.0, 13.0, 12.0, 10.0, 5.0, 8.0, 7.0, 10.0, 5.0, 5.0, 8.0, 10.0, 2.0, 6.0, 8.0, 9.0, 4.0, 5.0, 4.0, 6.0, 10.0, 10.0, 6.0, 8.0, 9.0, 14.0, 10.0, 9.0, 7.0, 14.0, 14.0, 22.0, 28.0, 62.0], [4778.0, 2582.0, 1584.0, 981.0, 571.0, 418.0, 290.0, 223.0, 132.0, 121.0, 72.0, 62.0, 58.0, 57.0, 36.0, 29.0, 19.0, 20.0, 15.0, 8.0, 8.0, 10.0, 10.0, 6.0, 7.0, 10.0, 6.0, 4.0, 8.0, 2.0, 8.0, 9.0, 8.0, 7.0, 8.0, 5.0, 5.0, 6.0, 8.0, 7.0, 6.0, 13.0, 8.0, 8.0, 10.0, 10.0, 17.0, 16.0, 45.0], [4673.0, 3013.0, 2231.0, 1534.0, 1089.0, 819.0, 636.0, 475.0, 332.0, 300.0, 244.0, 163.0, 132.0, 97.0, 87.0, 77.0, 65.0, 47.0, 42.0, 39.0, 17.0, 29.0, 26.0, 13.0, 20.0, 12.0, 8.0, 7.0, 12.0, 12.0, 7.0, 7.0, 10.0, 8.0, 6.0, 4.0, 9.0, 11.0, 3.0, 8.0, 9.0, 9.0, 4.0, 11.0, 8.0, 15.0, 9.0, 20.0, 35.0], [3908.0, 2925.0, 2365.0, 1877.0, 1551.0, 1235.0, 1064.0, 858.0, 657.0, 563.0, 473.0, 403.0, 339.0, 285.0, 215.0, 184.0, 167.0, 150.0, 122.0, 100.0, 96.0, 71.0, 64.0, 43.0, 43.0, 44.0, 27.0, 33.0, 17.0, 19.0, 12.0, 11.0, 15.0, 19.0, 9.0, 13.0, 10.0, 10.0, 6.0, 10.0, 7.0, 7.0, 4.0, 9.0, 14.0, 14.0, 9.0, 12.0, 28.0], [2661.0, 2339.0, 2116.0, 1931.0, 1724.0, 1376.0, 1311.0, 1099.0, 995.0, 839.0, 758.0, 668.0, 570.0, 522.0, 430.0, 403.0, 322.0, 285.0, 261.0, 234.0, 200.0, 168.0, 167.0, 135.0, 110.0, 96.0, 88.0, 75.0, 55.0, 40.0, 46.0, 35.0, 29.0, 34.0, 24.0, 27.0, 28.0, 19.0, 14.0, 18.0, 11.0, 12.0, 14.0, 7.0, 12.0, 14.0, 6.0, 9.0, 21.0], [1591.0, 1539.0, 1534.0, 1541.0, 1444.0, 1365.0, 1320.0, 1219.0, 1094.0, 1081.0, 904.0, 898.0, 822.0, 767.0, 697.0, 599.0, 576.0, 525.0, 423.0, 480.0, 436.0, 379.0, 363.0, 286.0, 251.0, 210.0, 202.0, 188.0, 159.0, 143.0, 131.0, 115.0, 95.0, 99.0, 74.0, 68.0, 54.0, 42.0, 48.0, 41.0, 31.0, 31.0, 24.0, 26.0, 19.0, 24.0, 14.0, 23.0, 15.0], [1005.0, 886.0, 901.0, 945.0, 996.0, 996.0, 957.0, 1006.0, 1010.0, 1041.0, 938.0, 895.0, 955.0, 920.0, 868.0, 832.0, 779.0, 736.0, 676.0, 650.0, 592.0, 557.0, 497.0, 502.0, 476.0, 451.0, 391.0, 361.0, 323.0, 327.0, 279.0, 265.0, 246.0, 221.0, 163.0, 178.0, 158.0, 141.0, 119.0, 93.0, 86.0, 70.0, 79.0, 66.0, 47.0, 38.0, 43.0, 34.0, 35.0], [537.0, 477.0, 493.0, 552.0, 572.0, 611.0, 718.0, 713.0, 734.0, 736.0, 738.0, 790.0, 794.0, 768.0, 829.0, 816.0, 742.0, 784.0, 757.0, 775.0, 762.0, 680.0, 665.0, 722.0, 603.0, 599.0, 581.0, 576.0, 553.0, 533.0, 499.0, 463.0, 442.0, 442.0, 384.0, 360.0, 342.0, 305.0, 256.0, 247.0, 217.0, 182.0, 174.0, 148.0, 117.0, 137.0, 90.0, 79.0, 66.0], [331.0, 227.0, 242.0, 276.0, 284.0, 322.0, 342.0, 398.0, 444.0, 465.0, 479.0, 572.0, 576.0, 555.0, 567.0, 637.0, 641.0, 620.0, 671.0, 691.0, 700.0, 692.0, 751.0, 713.0, 722.0, 711.0, 698.0, 724.0, 658.0, 725.0, 670.0, 670.0, 696.0, 601.0, 587.0, 581.0, 579.0, 525.0, 521.0, 464.0, 455.0, 391.0, 403.0, 334.0, 306.0, 308.0, 261.0, 207.0, 202.0], [290.0, 143.0, 105.0, 121.0, 129.0, 155.0, 174.0, 218.0, 224.0, 239.0, 244.0, 293.0, 301.0, 310.0, 373.0, 396.0, 429.0, 480.0, 442.0, 498.0, 585.0, 548.0, 527.0, 583.0, 623.0, 649.0, 711.0, 682.0, 710.0, 726.0, 695.0, 730.0, 758.0, 742.0, 763.0, 780.0, 767.0, 778.0, 773.0, 737.0, 728.0, 743.0, 689.0, 671.0, 673.0, 583.0, 567.0, 481.0, 425.0], [264.0, 93.0, 74.0, 49.0, 59.0, 86.0, 70.0, 97.0, 90.0, 100.0, 124.0, 145.0, 154.0, 178.0, 199.0, 222.0, 215.0, 239.0, 304.0, 283.0, 331.0, 354.0, 377.0, 384.0, 467.0, 441.0, 470.0, 581.0, 613.0, 634.0, 603.0, 670.0, 695.0, 702.0, 735.0, 800.0, 846.0, 846.0, 886.0, 872.0, 957.0, 981.0, 997.0, 1015.0, 1044.0, 1002.0, 1018.0, 1016.0, 938.0], [264.0, 83.0, 55.0, 32.0, 37.0, 38.0, 27.0, 36.0, 46.0, 48.0, 73.0, 67.0, 76.0, 63.0, 94.0, 106.0, 110.0, 129.0, 151.0, 135.0, 189.0, 169.0, 216.0, 241.0, 255.0, 301.0, 292.0, 330.0, 368.0, 416.0, 479.0, 459.0, 542.0, 559.0, 676.0, 657.0, 690.0, 864.0, 828.0, 881.0, 993.0, 1063.0, 1140.0, 1240.0, 1331.0, 1385.0, 1533.0, 1594.0, 1837.0], [240.0, 93.0, 59.0, 26.0, 19.0, 18.0, 24.0, 20.0, 24.0, 18.0, 26.0, 45.0, 36.0, 43.0, 39.0, 42.0, 52.0, 65.0, 65.0, 64.0, 92.0, 87.0, 109.0, 102.0, 128.0, 170.0, 153.0, 185.0, 190.0, 232.0, 263.0, 299.0, 344.0, 374.0, 453.0, 486.0, 528.0, 586.0, 679.0, 791.0, 799.0, 999.0, 1106.0, 1242.0, 1382.0, 1591.0, 1908.0, 2195.0, 2642.0], [242.0, 81.0, 49.0, 33.0, 21.0, 15.0, 13.0, 19.0, 20.0, 21.0, 15.0, 22.0, 19.0, 21.0, 20.0, 17.0, 25.0, 29.0, 30.0, 22.0, 33.0, 38.0, 51.0, 48.0, 51.0, 62.0, 74.0, 82.0, 91.0, 126.0, 115.0, 152.0, 186.0, 214.0, 228.0, 289.0, 326.0, 375.0, 424.0, 518.0, 611.0, 701.0, 888.0, 979.0, 1270.0, 1589.0, 1855.0, 2516.0, 3624.0], [214.0, 88.0, 58.0, 33.0, 16.0, 10.0, 21.0, 16.0, 16.0, 12.0, 13.0, 17.0, 21.0, 11.0, 12.0, 17.0, 9.0, 13.0, 17.0, 12.0, 18.0, 15.0, 17.0, 27.0, 10.0, 32.0, 23.0, 42.0, 33.0, 57.0, 54.0, 77.0, 92.0, 88.0, 113.0, 138.0, 173.0, 204.0, 222.0, 282.0, 387.0, 471.0, 589.0, 731.0, 931.0, 1222.0, 1728.0, 2455.0, 3977.0], [240.0, 95.0, 51.0, 33.0, 14.0, 16.0, 26.0, 13.0, 10.0, 20.0, 17.0, 15.0, 13.0, 14.0, 11.0, 10.0, 4.0, 6.0, 11.0, 10.0, 18.0, 7.0, 3.0, 13.0, 5.0, 12.0, 9.0, 19.0, 13.0, 17.0, 31.0, 30.0, 36.0, 47.0, 43.0, 51.0, 81.0, 93.0, 123.0, 141.0, 204.0, 238.0, 307.0, 433.0, 615.0, 820.0, 1231.0, 2080.0, 3775.0], [250.0, 99.0, 49.0, 25.0, 24.0, 17.0, 11.0, 16.0, 13.0, 15.0, 13.0, 15.0, 13.0, 12.0, 12.0, 15.0, 8.0, 14.0, 5.0, 9.0, 7.0, 6.0, 7.0, 5.0, 5.0, 10.0, 10.0, 3.0, 8.0, 13.0, 10.0, 16.0, 17.0, 11.0, 11.0, 24.0, 28.0, 43.0, 46.0, 72.0, 84.0, 134.0, 143.0, 223.0, 310.0, 500.0, 819.0, 1384.0, 3140.0], [251.0, 88.0, 42.0, 28.0, 19.0, 14.0, 18.0, 12.0, 23.0, 11.0, 14.0, 10.0, 13.0, 11.0, 11.0, 11.0, 16.0, 8.0, 11.0, 11.0, 2.0, 5.0, 6.0, 5.0, 6.0, 5.0, 10.0, 3.0, 4.0, 1.0, 12.0, 9.0, 8.0, 11.0, 5.0, 9.0, 13.0, 14.0, 15.0, 27.0, 34.0, 45.0, 53.0, 111.0, 165.0, 247.0, 524.0, 963.0, 2295.0], [245.0, 80.0, 56.0, 27.0, 24.0, 21.0, 14.0, 13.0, 9.0, 16.0, 22.0, 11.0, 16.0, 9.0, 15.0, 10.0, 9.0, 6.0, 7.0, 9.0, 9.0, 5.0, 7.0, 5.0, 2.0, 5.0, 7.0, 3.0, 4.0, 4.0, 8.0, 12.0, 6.0, 5.0, 6.0, 5.0, 10.0, 3.0, 12.0, 12.0, 13.0, 24.0, 26.0, 48.0, 73.0, 121.0, 253.0, 477.0, 1565.0], [277.0, 73.0, 49.0, 30.0, 27.0, 22.0, 19.0, 10.0, 13.0, 12.0, 12.0, 17.0, 13.0, 13.0, 9.0, 8.0, 12.0, 7.0, 10.0, 7.0, 6.0, 2.0, 6.0, 3.0, 5.0, 5.0, 3.0, 5.0, 9.0, 1.0, 3.0, 5.0, 5.0, 9.0, 2.0, 9.0, 11.0, 9.0, 5.0, 10.0, 8.0, 9.0, 18.0, 20.0, 32.0, 47.0, 107.0, 272.0, 901.0], [262.0, 96.0, 43.0, 28.0, 26.0, 20.0, 11.0, 11.0, 10.0, 13.0, 13.0, 15.0, 17.0, 12.0, 6.0, 12.0, 5.0, 13.0, 12.0, 9.0, 4.0, 3.0, 4.0, 7.0, 6.0, 3.0, 6.0, 5.0, 3.0, 6.0, 6.0, 4.0, 8.0, 2.0, 9.0, 4.0, 7.0, 5.0, 3.0, 8.0, 10.0, 8.0, 7.0, 12.0, 8.0, 19.0, 46.0, 144.0, 511.0], [227.0, 86.0, 52.0, 27.0, 30.0, 20.0, 13.0, 16.0, 15.0, 13.0, 19.0, 16.0, 11.0, 14.0, 9.0, 7.0, 6.0, 9.0, 2.0, 6.0, 5.0, 9.0, 8.0, 5.0, 5.0, 4.0, 3.0, 7.0, 6.0, 7.0, 4.0, 3.0, 7.0, 7.0, 4.0, 5.0, 6.0, 3.0, 6.0, 5.0, 6.0, 9.0, 7.0, 8.0, 7.0, 9.0, 21.0, 48.0, 248.0], [214.0, 85.0, 47.0, 28.0, 23.0, 22.0, 16.0, 12.0, 18.0, 19.0, 13.0, 13.0, 16.0, 9.0, 11.0, 12.0, 4.0, 4.0, 5.0, 10.0, 9.0, 2.0, 8.0, 4.0, 4.0, 7.0, 4.0, 4.0, 8.0, 8.0, 4.0, 6.0, 4.0, 8.0, 9.0, 2.0, 10.0, 3.0, 2.0, 3.0, 4.0, 2.0, 3.0, 11.0, 9.0, 8.0, 13.0, 25.0, 128.0], [224.0, 83.0, 52.0, 29.0, 16.0, 16.0, 19.0, 12.0, 25.0, 12.0, 11.0, 12.0, 13.0, 9.0, 8.0, 9.0, 11.0, 4.0, 4.0, 10.0, 6.0, 6.0, 4.0, 6.0, 9.0, 7.0, 6.0, 8.0, 6.0, 1.0, 6.0, 11.0, 3.0, 8.0, 9.0, 4.0, 5.0, 3.0, 4.0, 4.0, 5.0, 2.0, 2.0, 7.0, 7.0, 7.0, 9.0, 18.0, 83.0], [254.0, 84.0, 46.0, 31.0, 27.0, 13.0, 25.0, 11.0, 15.0, 19.0, 11.0, 18.0, 13.0, 13.0, 13.0, 3.0, 7.0, 11.0, 6.0, 9.0, 6.0, 5.0, 3.0, 4.0, 5.0, 4.0, 2.0, 7.0, 4.0, 11.0, 9.0, 5.0, 9.0, 8.0, 2.0, 4.0, 3.0, 5.0, 5.0, 3.0, 4.0, 6.0, 7.0, 11.0, 3.0, 9.0, 8.0, 10.0, 35.0], [245.0, 77.0, 45.0, 27.0, 18.0, 19.0, 16.0, 15.0, 17.0, 20.0, 16.0, 10.0, 18.0, 13.0, 9.0, 11.0, 11.0, 7.0, 10.0, 8.0, 3.0, 6.0, 6.0, 6.0, 6.0, 7.0, 5.0, 3.0, 6.0, 2.0, 3.0, 6.0, 7.0, 4.0, 3.0, 1.0, 6.0, 6.0, 7.0, 3.0, 3.0, 5.0, 4.0, 8.0, 7.0, 7.0, 9.0, 10.0, 23.0], [258.0, 76.0, 46.0, 22.0, 31.0, 17.0, 17.0, 16.0, 17.0, 18.0, 15.0, 15.0, 12.0, 11.0, 10.0, 3.0, 7.0, 6.0, 11.0, 4.0, 4.0, 11.0, 6.0, 6.0, 3.0, 6.0, 10.0, 5.0, 4.0, 3.0, 4.0, 5.0, 9.0, 7.0, 5.0, 6.0, 7.0, 4.0, 3.0, 6.0, 8.0, 4.0, 5.0, 2.0, 5.0, 4.0, 8.0, 12.0, 13.0], [251.0, 82.0, 48.0, 35.0, 14.0, 26.0, 14.0, 17.0, 15.0, 10.0, 10.0, 8.0, 17.0, 13.0, 11.0, 10.0, 10.0, 10.0, 9.0, 4.0, 8.0, 9.0, 6.0, 6.0, 13.0, 2.0, 6.0, 6.0, 7.0, 3.0, 6.0, 5.0, 3.0, 3.0, 3.0, 10.0, 6.0, 3.0, 5.0, 5.0, 5.0, 3.0, 11.0, 5.0, 5.0, 10.0, 7.0, 7.0, 12.0], [237.0, 97.0, 44.0, 18.0, 24.0, 18.0, 16.0, 14.0, 18.0, 15.0, 11.0, 17.0, 12.0, 18.0, 8.0, 11.0, 9.0, 6.0, 11.0, 3.0, 6.0, 7.0, 2.0, 8.0, 12.0, 3.0, 1.0, 8.0, 4.0, 9.0, 5.0, 5.0, 6.0, 2.0, 5.0, 5.0, 5.0, 9.0, 8.0, 4.0, 7.0, 3.0, 9.0, 3.0, 6.0, 8.0, 5.0, 7.0, 9.0], [248.0, 81.0, 47.0, 30.0, 23.0, 12.0, 20.0, 18.0, 15.0, 17.0, 16.0, 11.0, 6.0, 12.0, 10.0, 8.0, 8.0, 7.0, 12.0, 12.0, 6.0, 5.0, 4.0, 8.0, 9.0, 5.0, 3.0, 4.0, 3.0, 5.0, 3.0, 3.0, 2.0, 4.0, 10.0, 8.0, 10.0, 7.0, 5.0, 7.0, 5.0, 4.0, 3.0, 8.0, 6.0, 11.0, 3.0, 7.0, 9.0], [237.0, 88.0, 54.0, 26.0, 19.0, 19.0, 10.0, 11.0, 17.0, 18.0, 19.0, 14.0, 12.0, 12.0, 12.0, 12.0, 11.0, 9.0, 10.0, 3.0, 5.0, 4.0, 3.0, 9.0, 2.0, 6.0, 7.0, 5.0, 6.0, 2.0, 8.0, 5.0, 3.0, 6.0, 8.0, 9.0, 6.0, 8.0, 7.0, 3.0, 6.0, 4.0, 6.0, 6.0, 4.0, 4.0, 8.0, 7.0, 9.0], [227.0, 99.0, 45.0, 29.0, 17.0, 16.0, 22.0, 15.0, 13.0, 19.0, 12.0, 20.0, 7.0, 13.0, 14.0, 17.0, 12.0, 9.0, 5.0, 2.0, 5.0, 4.0, 3.0, 7.0, 4.0, 5.0, 6.0, 5.0, 3.0, 5.0, 4.0, 9.0, 8.0, 4.0, 7.0, 5.0, 5.0, 8.0, 6.0, 5.0, 8.0, 6.0, 5.0, 5.0, 7.0, 4.0, 5.0, 7.0, 5.0], [225.0, 90.0, 43.0, 29.0, 24.0, 14.0, 11.0, 19.0, 19.0, 18.0, 8.0, 3.0, 12.0, 13.0, 11.0, 19.0, 6.0, 9.0, 7.0, 13.0, 5.0, 1.0, 10.0, 6.0, 2.0, 5.0, 5.0, 4.0, 7.0, 2.0, 5.0, 3.0, 6.0, 5.0, 8.0, 4.0, 4.0, 9.0, 4.0, 2.0, 7.0, 6.0, 8.0, 3.0, 6.0, 9.0, 9.0, 4.0, 10.0], [248.0, 99.0, 44.0, 34.0, 22.0, 24.0, 17.0, 21.0, 11.0, 10.0, 8.0, 14.0, 13.0, 13.0, 11.0, 7.0, 14.0, 9.0, 7.0, 6.0, 11.0, 9.0, 6.0, 6.0, 3.0, 3.0, 6.0, 4.0, 8.0, 7.0, 1.0, 5.0, 4.0, 7.0, 5.0, 7.0, 10.0, 3.0, 3.0, 4.0, 4.0, 4.0, 7.0, 7.0, 10.0, 4.0, 3.0, 6.0, 8.0]],
    "Name": "sCurve-0",
    "Overflow": 2642385.0,
    "Type": "Histo2d",
    "Underflow": 0.0,
    "x": {
        "AxisTitle": "Vcal",
        "Bins": 51,
        "High": 302.5,
        "Low": 47.5
    },
    "y": {
        "AxisTitle": "Occupancy",
        "Bins": 49,
        "High": 49.5,
        "Low": 0.5
    },
    "z": {
        "AxisTitle": "Number of pixels"
    }
}