{
    "Data": [185.0, 9861.0, 18639.0, 13126.0, 6128.0, 2250.0, 733.0, 247.0, 102.0, 58.0, 44.0, 27.0, 39.0, 20.0, 16.0, 9.0, 1.0, 4.0, 3.0, 6.0, 3.0, 2.0, 3.0, 0.0, 3.0, 0.0, 4.0, 0.0, 0.0, 0.0, 1.0, 0.0, 0.0, 0.0, 0.0, 0.0, 0.0, 0.0, 0.0, 0.0, 0.0, 0.0, 0.0, 0.0, 0.0, 0.0, 1.0, 0.0, 0.0, 0.0, 0.0],
    "Name": "Chi2Dist-0",
    "Overflow": 0.0,
    "Type": "Histo1d",
    "Underflow": 0.0,
    "x": {
        "AxisTitle": "Fit Chi/ndf",
        "Bins": 51,
        "High": 2.5250000953674318,
        "Low": -0.02500000037252903
    },
    "y": {
        "AxisTitle": "Number of Pixels"
    },
    "z": {
        "AxisTitle": "z"
    }
}