time,Hardware,Voltage,Current
1621471335364,high-voltage-2,1,0.307804
time,Hardware,Voltage,Current
1621471335364,high-voltage-2,2,0.359111
time,Hardware,Voltage,Current
1621471335364,high-voltage-2,3,0.400914
time,Hardware,Voltage,Current
1621471335364,high-voltage-2,4,0.437954
time,Hardware,Voltage,Current
1621471335364,high-voltage-2,5,0.476704
time,Hardware,Voltage,Current
1621471335364,high-voltage-2,6,0.517337
time,Hardware,Voltage,Current
1621471335364,high-voltage-2,7,0.559566
time,Hardware,Voltage,Current
1621471335364,high-voltage-2,8,0.599104
time,Hardware,Voltage,Current
1621471335364,high-voltage-2,9,0.638466
time,Hardware,Voltage,Current
1621471335364,high-voltage-2,10,0.671691
time,Hardware,Voltage,Current
1621471335364,high-voltage-2,11,0.708984
time,Hardware,Voltage,Current
1621471335364,high-voltage-2,12,0.740561
time,Hardware,Voltage,Current
1621471335364,high-voltage-2,13,0.771797
time,Hardware,Voltage,Current
1621471335364,high-voltage-2,14,0.805511
time,Hardware,Voltage,Current
1621471335364,high-voltage-2,15,0.834322
time,Hardware,Voltage,Current
1621471335364,high-voltage-2,16,0.86174
time,Hardware,Voltage,Current
1621471335364,high-voltage-2,17,0.882444
time,Hardware,Voltage,Current
1621471335364,high-voltage-2,18,0.905661
time,Hardware,Voltage,Current
1621471335364,high-voltage-2,19,0.926287
time,Hardware,Voltage,Current
1621471335364,high-voltage-2,20,0.942642
time,Hardware,Voltage,Current
1621471335364,high-voltage-2,25,1.02979
time,Hardware,Voltage,Current
1621471335364,high-voltage-2,30,1.1104
time,Hardware,Voltage,Current
1621471335364,high-voltage-2,35,1.19547
time,Hardware,Voltage,Current
1621471335364,high-voltage-2,40,1.29053
time,Hardware,Voltage,Current
1621471335364,high-voltage-2,45,1.41242
time,Hardware,Voltage,Current
1621471335364,high-voltage-2,50,1.49461
time,Hardware,Voltage,Current
1621471335364,high-voltage-2,55,1.56889
time,Hardware,Voltage,Current
1621471335364,high-voltage-2,60,1.6382
time,Hardware,Voltage,Current
1621471335364,high-voltage-2,65,1.70538
time,Hardware,Voltage,Current
1621471335364,high-voltage-2,70,1.77342
time,Hardware,Voltage,Current
1621471335364,high-voltage-2,75,1.83964
time,Hardware,Voltage,Current
1621471335364,high-voltage-2,80,1.9008
time,Hardware,Voltage,Current
1621471335364,high-voltage-2,85,1.96136
time,Hardware,Voltage,Current
1621471335364,high-voltage-2,90,2.02168
time,Hardware,Voltage,Current
1621471335364,high-voltage-2,95,2.08219
time,Hardware,Voltage,Current
1621471335364,high-voltage-2,100,2.14137
