time,Hardware,Voltage,Current
1621617662765,high-voltage-3,1,0.240399
time,Hardware,Voltage,Current
1621617662765,high-voltage-3,2,0.251423
time,Hardware,Voltage,Current
1621617662765,high-voltage-3,3,0.264001
time,Hardware,Voltage,Current
1621617662765,high-voltage-3,4,0.274379
time,Hardware,Voltage,Current
1621617662765,high-voltage-3,5,0.282683
time,Hardware,Voltage,Current
1621617662765,high-voltage-3,6,0.291798
time,Hardware,Voltage,Current
1621617662765,high-voltage-3,7,0.299483
time,Hardware,Voltage,Current
1621617662765,high-voltage-3,8,0.30829
time,Hardware,Voltage,Current
1621617662765,high-voltage-3,9,0.315471
time,Hardware,Voltage,Current
1621617662765,high-voltage-3,10,0.324495
time,Hardware,Voltage,Current
1621617662765,high-voltage-3,11,0.333196
time,Hardware,Voltage,Current
1621617662765,high-voltage-3,12,0.342408
time,Hardware,Voltage,Current
1621617662765,high-voltage-3,13,0.349837
time,Hardware,Voltage,Current
1621617662765,high-voltage-3,14,0.357508
time,Hardware,Voltage,Current
1621617662765,high-voltage-3,15,0.363976
time,Hardware,Voltage,Current
1621617662765,high-voltage-3,16,0.369506
time,Hardware,Voltage,Current
1621617662765,high-voltage-3,17,0.376076
time,Hardware,Voltage,Current
1621617662765,high-voltage-3,18,0.380188
time,Hardware,Voltage,Current
1621617662765,high-voltage-3,19,0.385484
time,Hardware,Voltage,Current
1621617662765,high-voltage-3,20,0.390389
time,Hardware,Voltage,Current
1621617662765,high-voltage-3,25,0.417209
time,Hardware,Voltage,Current
1621617662765,high-voltage-3,30,0.439378
time,Hardware,Voltage,Current
1621617662765,high-voltage-3,35,0.461727
time,Hardware,Voltage,Current
1621617662765,high-voltage-3,40,0.481038
time,Hardware,Voltage,Current
1621617662765,high-voltage-3,45,0.50061
time,Hardware,Voltage,Current
1621617662765,high-voltage-3,50,0.515784
time,Hardware,Voltage,Current
1621617662765,high-voltage-3,55,0.532154
time,Hardware,Voltage,Current
1621617662765,high-voltage-3,60,0.54802
time,Hardware,Voltage,Current
1621617662765,high-voltage-3,5.64407e-07,0.563613
time,Hardware,Voltage,Current
1621617662765,high-voltage-3,70,0.579089
time,Hardware,Voltage,Current
1621617662765,high-voltage-3,75,0.59405
time,Hardware,Voltage,Current
1621617662765,high-voltage-3,80,0.609455
time,Hardware,Voltage,Current
1621617662765,high-voltage-3,85,0.622053
time,Hardware,Voltage,Current
1621617662765,high-voltage-3,90,0.635952
time,Hardware,Voltage,Current
1621617662765,high-voltage-3,95,0.647632
time,Hardware,Voltage,Current
1621617662765,high-voltage-3,100,0.661573
