{
    "Data": [[274.0, 122.0, 98.0, 68.0, 49.0, 27.0, 22.0, 21.0, 17.0, 10.0, 7.0, 12.0, 9.0, 8.0, 9.0, 7.0, 9.0, 6.0, 6.0, 5.0, 5.0, 6.0, 0.0, 8.0, 2.0, 4.0, 5.0, 7.0, 5.0, 8.0, 0.0, 3.0, 1.0, 8.0, 5.0, 3.0, 6.0, 11.0, 5.0, 4.0, 5.0, 2.0, 2.0, 5.0, 5.0, 5.0, 7.0, 7.0, 2.0], [520.0, 174.0, 113.0, 52.0, 36.0, 28.0, 16.0, 21.0, 24.0, 11.0, 7.0, 17.0, 12.0, 7.0, 8.0, 12.0, 7.0, 9.0, 12.0, 9.0, 10.0, 4.0, 7.0, 7.0, 6.0, 7.0, 4.0, 5.0, 5.0, 7.0, 7.0, 7.0, 5.0, 2.0, 5.0, 1.0, 6.0, 4.0, 6.0, 4.0, 5.0, 7.0, 8.0, 3.0, 7.0, 5.0, 6.0, 4.0, 5.0], [1128.0, 314.0, 173.0, 95.0, 69.0, 39.0, 19.0, 24.0, 13.0, 10.0, 14.0, 11.0, 9.0, 6.0, 8.0, 9.0, 6.0, 7.0, 10.0, 12.0, 7.0, 8.0, 15.0, 11.0, 9.0, 3.0, 8.0, 3.0, 4.0, 10.0, 14.0, 8.0, 5.0, 10.0, 6.0, 6.0, 6.0, 9.0, 2.0, 7.0, 2.0, 4.0, 7.0, 3.0, 8.0, 6.0, 5.0, 10.0, 5.0], [2653.0, 822.0, 320.0, 206.0, 131.0, 77.0, 55.0, 45.0, 30.0, 25.0, 18.0, 15.0, 15.0, 7.0, 10.0, 10.0, 12.0, 8.0, 11.0, 11.0, 9.0, 7.0, 6.0, 9.0, 6.0, 6.0, 5.0, 4.0, 6.0, 9.0, 8.0, 10.0, 9.0, 15.0, 11.0, 5.0, 8.0, 9.0, 17.0, 7.0, 9.0, 9.0, 10.0, 4.0, 3.0, 15.0, 6.0, 9.0, 15.0], [5490.0, 1943.0, 979.0, 569.0, 337.0, 260.0, 175.0, 129.0, 99.0, 79.0, 57.0, 39.0, 40.0, 31.0, 27.0, 36.0, 15.0, 21.0, 10.0, 13.0, 21.0, 28.0, 10.0, 6.0, 9.0, 10.0, 7.0, 5.0, 8.0, 7.0, 12.0, 5.0, 4.0, 8.0, 10.0, 6.0, 10.0, 6.0, 11.0, 7.0, 7.0, 13.0, 10.0, 11.0, 10.0, 14.0, 14.0, 24.0, 16.0], [10024.0, 4636.0, 2582.0, 1653.0, 1085.0, 756.0, 550.0, 361.0, 280.0, 267.0, 192.0, 150.0, 143.0, 120.0, 89.0, 80.0, 71.0, 51.0, 63.0, 48.0, 40.0, 42.0, 31.0, 32.0, 22.0, 26.0, 19.0, 17.0, 10.0, 12.0, 13.0, 12.0, 11.0, 13.0, 16.0, 16.0, 9.0, 8.0, 11.0, 16.0, 4.0, 11.0, 8.0, 14.0, 9.0, 15.0, 19.0, 27.0, 27.0], [8250.0, 7002.0, 5670.0, 4381.0, 3492.0, 2712.0, 2133.0, 1559.0, 1291.0, 1011.0, 767.0, 603.0, 463.0, 393.0, 344.0, 271.0, 233.0, 197.0, 178.0, 168.0, 145.0, 111.0, 100.0, 89.0, 92.0, 79.0, 72.0, 72.0, 77.0, 56.0, 44.0, 48.0, 31.0, 42.0, 21.0, 34.0, 26.0, 19.0, 26.0, 15.0, 9.0, 22.0, 18.0, 17.0, 23.0, 10.0, 25.0, 18.0, 31.0], [1644.0, 1935.0, 2179.0, 2570.0, 2665.0, 2849.0, 2957.0, 2922.0, 2872.0, 2638.0, 2678.0, 2391.0, 2195.0, 2102.0, 1870.0, 1713.0, 1471.0, 1340.0, 1111.0, 990.0, 850.0, 737.0, 608.0, 519.0, 446.0, 412.0, 335.0, 335.0, 251.0, 202.0, 204.0, 154.0, 139.0, 127.0, 117.0, 104.0, 89.0, 84.0, 89.0, 80.0, 74.0, 54.0, 41.0, 58.0, 32.0, 51.0, 31.0, 44.0, 45.0], [514.0, 378.0, 447.0, 474.0, 490.0, 576.0, 607.0, 725.0, 782.0, 916.0, 994.0, 1083.0, 1213.0, 1301.0, 1448.0, 1587.0, 1651.0, 1682.0, 1755.0, 1850.0, 1844.0, 1892.0, 1872.0, 1846.0, 1802.0, 1805.0, 1733.0, 1699.0, 1646.0, 1573.0, 1484.0, 1319.0, 1277.0, 1124.0, 1089.0, 964.0, 824.0, 748.0, 619.0, 521.0, 467.0, 389.0, 323.0, 264.0, 176.0, 148.0, 144.0, 111.0, 113.0], [322.0, 191.0, 171.0, 149.0, 152.0, 175.0, 167.0, 162.0, 176.0, 179.0, 249.0, 250.0, 266.0, 291.0, 337.0, 322.0, 438.0, 428.0, 485.0, 532.0, 606.0, 700.0, 763.0, 863.0, 902.0, 1004.0, 1096.0, 1122.0, 1257.0, 1386.0, 1513.0, 1549.0, 1691.0, 1746.0, 1793.0, 1802.0, 1942.0, 1978.0, 2047.0, 2070.0, 2223.0, 2190.0, 2106.0, 2147.0, 2064.0, 1868.0, 1750.0, 1354.0, 1040.0], [256.0, 163.0, 124.0, 79.0, 77.0, 64.0, 56.0, 55.0, 54.0, 73.0, 65.0, 78.0, 72.0, 70.0, 91.0, 107.0, 96.0, 118.0, 141.0, 131.0, 162.0, 166.0, 199.0, 227.0, 220.0, 242.0, 305.0, 316.0, 321.0, 450.0, 504.0, 500.0, 685.0, 743.0, 852.0, 960.0, 1088.0, 1269.0, 1403.0, 1557.0, 1776.0, 2041.0, 2223.0, 2545.0, 2909.0, 3339.0, 3965.0, 4779.0, 6100.0], [258.0, 159.0, 99.0, 84.0, 60.0, 44.0, 37.0, 33.0, 30.0, 26.0, 33.0, 29.0, 23.0, 29.0, 31.0, 30.0, 30.0, 33.0, 49.0, 48.0, 56.0, 44.0, 50.0, 63.0, 62.0, 68.0, 93.0, 119.0, 111.0, 136.0, 141.0, 165.0, 187.0, 235.0, 231.0, 304.0, 347.0, 437.0, 481.0, 582.0, 734.0, 983.0, 1260.0, 1616.0, 2026.0, 2615.0, 3398.0, 4697.0, 7602.0], [316.0, 135.0, 95.0, 66.0, 68.0, 32.0, 31.0, 34.0, 24.0, 19.0, 24.0, 22.0, 17.0, 15.0, 24.0, 20.0, 15.0, 16.0, 21.0, 20.0, 21.0, 16.0, 27.0, 22.0, 17.0, 18.0, 25.0, 33.0, 40.0, 44.0, 45.0, 36.0, 47.0, 63.0, 76.0, 68.0, 100.0, 115.0, 144.0, 199.0, 260.0, 310.0, 404.0, 535.0, 813.0, 1157.0, 1905.0, 3377.0, 6942.0], [384.0, 146.0, 99.0, 72.0, 41.0, 47.0, 25.0, 22.0, 19.0, 22.0, 20.0, 15.0, 7.0, 19.0, 13.0, 21.0, 11.0, 15.0, 17.0, 14.0, 19.0, 17.0, 16.0, 22.0, 19.0, 15.0, 20.0, 16.0, 17.0, 14.0, 15.0, 18.0, 28.0, 27.0, 24.0, 35.0, 32.0, 39.0, 37.0, 60.0, 73.0, 75.0, 109.0, 174.0, 270.0, 392.0, 715.0, 1432.0, 4428.0], [558.0, 213.0, 108.0, 72.0, 37.0, 34.0, 22.0, 25.0, 14.0, 15.0, 18.0, 16.0, 22.0, 11.0, 5.0, 18.0, 13.0, 11.0, 17.0, 13.0, 12.0, 15.0, 13.0, 12.0, 12.0, 7.0, 6.0, 19.0, 16.0, 15.0, 20.0, 18.0, 13.0, 13.0, 20.0, 15.0, 24.0, 29.0, 33.0, 24.0, 31.0, 30.0, 48.0, 62.0, 69.0, 118.0, 213.0, 496.0, 1909.0], [857.0, 306.0, 146.0, 71.0, 48.0, 45.0, 24.0, 26.0, 10.0, 23.0, 16.0, 9.0, 11.0, 12.0, 14.0, 11.0, 11.0, 7.0, 6.0, 11.0, 8.0, 18.0, 11.0, 8.0, 16.0, 8.0, 8.0, 11.0, 12.0, 9.0, 16.0, 16.0, 13.0, 18.0, 18.0, 9.0, 17.0, 18.0, 21.0, 22.0, 19.0, 19.0, 20.0, 48.0, 43.0, 55.0, 73.0, 201.0, 798.0], [1446.0, 477.0, 250.0, 116.0, 64.0, 49.0, 36.0, 19.0, 12.0, 12.0, 9.0, 11.0, 8.0, 8.0, 14.0, 8.0, 11.0, 12.0, 11.0, 7.0, 8.0, 9.0, 4.0, 8.0, 7.0, 13.0, 9.0, 8.0, 10.0, 14.0, 5.0, 11.0, 18.0, 7.0, 19.0, 19.0, 3.0, 15.0, 15.0, 15.0, 14.0, 20.0, 21.0, 21.0, 26.0, 35.0, 52.0, 104.0, 309.0], [2079.0, 868.0, 414.0, 181.0, 120.0, 76.0, 49.0, 39.0, 15.0, 10.0, 11.0, 13.0, 7.0, 12.0, 10.0, 8.0, 7.0, 13.0, 10.0, 8.0, 6.0, 3.0, 15.0, 8.0, 8.0, 5.0, 7.0, 7.0, 12.0, 3.0, 7.0, 12.0, 6.0, 4.0, 11.0, 8.0, 13.0, 8.0, 10.0, 13.0, 20.0, 14.0, 17.0, 21.0, 21.0, 32.0, 26.0, 64.0, 171.0], [2767.0, 1292.0, 740.0, 376.0, 226.0, 163.0, 90.0, 83.0, 44.0, 26.0, 28.0, 24.0, 13.0, 14.0, 10.0, 16.0, 10.0, 5.0, 3.0, 7.0, 6.0, 8.0, 4.0, 4.0, 8.0, 8.0, 8.0, 7.0, 9.0, 8.0, 6.0, 9.0, 9.0, 10.0, 7.0, 6.0, 6.0, 7.0, 9.0, 5.0, 14.0, 12.0, 9.0, 23.0, 20.0, 24.0, 25.0, 52.0, 117.0], [3356.0, 1799.0, 1032.0, 693.0, 465.0, 322.0, 227.0, 144.0, 114.0, 92.0, 54.0, 45.0, 32.0, 29.0, 33.0, 15.0, 15.0, 8.0, 14.0, 11.0, 10.0, 7.0, 8.0, 5.0, 9.0, 7.0, 8.0, 4.0, 6.0, 5.0, 8.0, 9.0, 6.0, 8.0, 9.0, 7.0, 9.0, 2.0, 11.0, 10.0, 9.0, 12.0, 8.0, 9.0, 12.0, 21.0, 19.0, 39.0, 86.0], [3643.0, 2208.0, 1513.0, 995.0, 773.0, 546.0, 403.0, 324.0, 230.0, 188.0, 144.0, 122.0, 81.0, 89.0, 57.0, 38.0, 45.0, 35.0, 23.0, 25.0, 12.0, 12.0, 8.0, 12.0, 9.0, 14.0, 9.0, 11.0, 5.0, 6.0, 2.0, 13.0, 8.0, 8.0, 6.0, 7.0, 7.0, 7.0, 8.0, 7.0, 10.0, 8.0, 6.0, 13.0, 6.0, 10.0, 16.0, 32.0, 52.0], [3631.0, 2402.0, 1706.0, 1332.0, 1006.0, 779.0, 636.0, 555.0, 420.0, 343.0, 268.0, 232.0, 196.0, 145.0, 157.0, 139.0, 88.0, 73.0, 75.0, 59.0, 54.0, 35.0, 33.0, 24.0, 21.0, 21.0, 23.0, 15.0, 14.0, 8.0, 16.0, 13.0, 5.0, 5.0, 6.0, 7.0, 9.0, 8.0, 10.0, 11.0, 7.0, 6.0, 8.0, 8.0, 11.0, 13.0, 11.0, 22.0, 38.0], [3150.0, 2365.0, 1789.0, 1431.0, 1196.0, 1015.0, 925.0, 758.0, 611.0, 589.0, 477.0, 387.0, 343.0, 324.0, 307.0, 273.0, 207.0, 176.0, 149.0, 115.0, 111.0, 91.0, 81.0, 73.0, 50.0, 37.0, 54.0, 43.0, 38.0, 27.0, 26.0, 31.0, 26.0, 18.0, 17.0, 15.0, 14.0, 10.0, 6.0, 5.0, 7.0, 8.0, 3.0, 10.0, 14.0, 8.0, 13.0, 16.0, 36.0], [2519.0, 2021.0, 1647.0, 1450.0, 1217.0, 1160.0, 1008.0, 872.0, 798.0, 723.0, 671.0, 582.0, 586.0, 461.0, 478.0, 395.0, 335.0, 334.0, 286.0, 279.0, 212.0, 210.0, 194.0, 162.0, 149.0, 121.0, 105.0, 115.0, 53.0, 72.0, 74.0, 43.0, 58.0, 51.0, 49.0, 24.0, 32.0, 22.0, 22.0, 21.0, 13.0, 16.0, 17.0, 8.0, 16.0, 6.0, 4.0, 20.0, 31.0], [1890.0, 1568.0, 1460.0, 1280.0, 1136.0, 1096.0, 1024.0, 926.0, 878.0, 794.0, 691.0, 718.0, 689.0, 618.0, 584.0, 568.0, 475.0, 496.0, 412.0, 422.0, 400.0, 364.0, 326.0, 309.0, 245.0, 231.0, 245.0, 189.0, 183.0, 159.0, 157.0, 139.0, 108.0, 126.0, 86.0, 87.0, 65.0, 65.0, 55.0, 47.0, 42.0, 35.0, 31.0, 26.0, 25.0, 17.0, 23.0, 15.0, 22.0], [1240.0, 1182.0, 1090.0, 999.0, 948.0, 872.0, 878.0, 819.0, 850.0, 764.0, 777.0, 705.0, 684.0, 718.0, 654.0, 622.0, 597.0, 603.0, 547.0, 531.0, 496.0, 490.0, 467.0, 412.0, 416.0, 438.0, 351.0, 363.0, 322.0, 276.0, 274.0, 285.0, 252.0, 234.0, 194.0, 194.0, 148.0, 163.0, 143.0, 114.0, 93.0, 88.0, 67.0, 49.0, 75.0, 52.0, 37.0, 42.0, 49.0], [797.0, 752.0, 720.0, 697.0, 698.0, 722.0, 678.0, 693.0, 666.0, 639.0, 657.0, 644.0, 638.0, 617.0, 621.0, 635.0, 659.0, 581.0, 600.0, 587.0, 597.0, 600.0, 577.0, 573.0, 504.0, 521.0, 506.0, 483.0, 481.0, 436.0, 411.0, 412.0, 393.0, 370.0, 365.0, 355.0, 325.0, 308.0, 263.0, 251.0, 221.0, 213.0, 198.0, 138.0, 138.0, 128.0, 104.0, 74.0, 93.0], [494.0, 459.0, 514.0, 480.0, 452.0, 426.0, 501.0, 466.0, 494.0, 516.0, 509.0, 489.0, 505.0, 504.0, 544.0, 553.0, 535.0, 576.0, 564.0, 599.0, 592.0, 569.0, 557.0, 588.0, 593.0, 580.0, 535.0, 568.0, 562.0, 546.0, 546.0, 543.0, 507.0, 561.0, 528.0, 494.0, 492.0, 452.0, 436.0, 432.0, 429.0, 367.0, 381.0, 378.0, 322.0, 264.0, 242.0, 213.0, 189.0], [341.0, 295.0, 322.0, 318.0, 260.0, 303.0, 308.0, 295.0, 308.0, 306.0, 358.0, 377.0, 365.0, 373.0, 436.0, 424.0, 423.0, 444.0, 453.0, 439.0, 489.0, 520.0, 555.0, 507.0, 557.0, 519.0, 604.0, 574.0, 540.0, 598.0, 624.0, 646.0, 611.0, 616.0, 620.0, 617.0, 624.0, 609.0, 631.0, 631.0, 580.0, 545.0, 552.0, 585.0, 579.0, 554.0, 501.0, 445.0, 431.0], [229.0, 216.0, 223.0, 207.0, 196.0, 166.0, 166.0, 199.0, 184.0, 205.0, 226.0, 250.0, 223.0, 242.0, 262.0, 278.0, 285.0, 311.0, 295.0, 337.0, 366.0, 389.0, 410.0, 406.0, 384.0, 463.0, 477.0, 521.0, 525.0, 520.0, 566.0, 587.0, 630.0, 613.0, 662.0, 630.0, 680.0, 688.0, 749.0, 787.0, 779.0, 717.0, 792.0, 851.0, 811.0, 814.0, 868.0, 869.0, 889.0], [237.0, 154.0, 109.0, 104.0, 122.0, 88.0, 109.0, 116.0, 122.0, 103.0, 125.0, 133.0, 154.0, 147.0, 139.0, 165.0, 209.0, 185.0, 221.0, 205.0, 224.0, 250.0, 270.0, 282.0, 342.0, 343.0, 377.0, 339.0, 412.0, 428.0, 425.0, 493.0, 502.0, 549.0, 568.0, 627.0, 687.0, 662.0, 706.0, 730.0, 830.0, 837.0, 976.0, 981.0, 1083.0, 1213.0, 1185.0, 1376.0, 1480.0], [170.0, 124.0, 112.0, 76.0, 67.0, 80.0, 90.0, 64.0, 86.0, 63.0, 87.0, 72.0, 86.0, 91.0, 86.0, 72.0, 94.0, 124.0, 142.0, 138.0, 160.0, 164.0, 166.0, 189.0, 206.0, 214.0, 225.0, 250.0, 240.0, 324.0, 299.0, 351.0, 397.0, 393.0, 412.0, 472.0, 599.0, 609.0, 619.0, 784.0, 802.0, 853.0, 950.0, 1032.0, 1158.0, 1284.0, 1491.0, 1748.0, 2193.0], [162.0, 95.0, 77.0, 50.0, 53.0, 58.0, 27.0, 36.0, 39.0, 43.0, 61.0, 52.0, 52.0, 41.0, 61.0, 72.0, 85.0, 83.0, 79.0, 77.0, 88.0, 98.0, 120.0, 114.0, 107.0, 143.0, 140.0, 157.0, 186.0, 167.0, 199.0, 226.0, 267.0, 278.0, 308.0, 307.0, 371.0, 433.0, 431.0, 528.0, 626.0, 752.0, 864.0, 942.0, 1115.0, 1420.0, 1632.0, 2085.0, 2812.0], [180.0, 129.0, 82.0, 52.0, 32.0, 42.0, 29.0, 24.0, 29.0, 19.0, 15.0, 22.0, 27.0, 51.0, 46.0, 26.0, 34.0, 26.0, 32.0, 38.0, 39.0, 50.0, 49.0, 62.0, 76.0, 70.0, 78.0, 92.0, 118.0, 92.0, 105.0, 148.0, 139.0, 150.0, 208.0, 229.0, 219.0, 296.0, 304.0, 359.0, 419.0, 510.0, 609.0, 786.0, 936.0, 1222.0, 1624.0, 2137.0, 3326.0], [180.0, 112.0, 80.0, 73.0, 41.0, 64.0, 10.0, 11.0, 14.0, 13.0, 16.0, 29.0, 14.0, 17.0, 39.0, 39.0, 37.0, 22.0, 29.0, 59.0, 25.0, 30.0, 26.0, 36.0, 23.0, 35.0, 44.0, 61.0, 48.0, 53.0, 81.0, 83.0, 96.0, 103.0, 126.0, 145.0, 158.0, 153.0, 172.0, 207.0, 278.0, 313.0, 434.0, 580.0, 681.0, 962.0, 1347.0, 1886.0, 3378.0], [182.0, 103.0, 81.0, 54.0, 39.0, 42.0, 30.0, 39.0, 47.0, 40.0, 39.0, 24.0, 29.0, 12.0, 25.0, 27.0, 49.0, 23.0, 10.0, 15.0, 25.0, 17.0, 12.0, 14.0, 12.0, 40.0, 19.0, 15.0, 15.0, 28.0, 26.0, 33.0, 56.0, 42.0, 62.0, 84.0, 77.0, 104.0, 137.0, 156.0, 192.0, 215.0, 272.0, 322.0, 479.0, 648.0, 959.0, 1580.0, 3013.0], [171.0, 107.0, 88.0, 61.0, 38.0, 18.0, 23.0, 33.0, 53.0, 24.0, 13.0, 3.0, 4.0, 9.0, 6.0, 10.0, 7.0, 26.0, 7.0, 19.0, 15.0, 6.0, 5.0, 3.0, 6.0, 14.0, 11.0, 33.0, 14.0, 25.0, 21.0, 18.0, 27.0, 48.0, 41.0, 30.0, 35.0, 22.0, 67.0, 68.0, 84.0, 116.0, 195.0, 183.0, 301.0, 385.0, 598.0, 1084.0, 2566.0], [150.0, 121.0, 105.0, 54.0, 52.0, 19.0, 26.0, 26.0, 16.0, 50.0, 1.0, 6.0, 10.0, 26.0, 7.0, 4.0, 10.0, 40.0, 20.0, 17.0, 6.0, 30.0, 9.0, 21.0, 12.0, 4.0, 27.0, 11.0, 43.0, 11.0, 7.0, 7.0, 8.0, 6.0, 27.0, 22.0, 11.0, 14.0, 22.0, 29.0, 33.0, 41.0, 71.0, 108.0, 153.0, 246.0, 419.0, 739.0, 1889.0], [190.0, 87.0, 87.0, 49.0, 34.0, 19.0, 16.0, 36.0, 21.0, 16.0, 7.0, 6.0, 3.0, 23.0, 17.0, 7.0, 49.0, 17.0, 22.0, 12.0, 13.0, 34.0, 41.0, 8.0, 4.0, 4.0, 3.0, 7.0, 36.0, 49.0, 15.0, 4.0, 6.0, 3.0, 30.0, 11.0, 17.0, 26.0, 12.0, 33.0, 14.0, 18.0, 31.0, 46.0, 82.0, 120.0, 219.0, 436.0, 1274.0], [160.0, 117.0, 92.0, 97.0, 26.0, 79.0, 61.0, 42.0, 15.0, 10.0, 19.0, 22.0, 24.0, 9.0, 26.0, 24.0, 8.0, 3.0, 27.0, 10.0, 5.0, 4.0, 19.0, 12.0, 8.0, 5.0, 26.0, 22.0, 14.0, 7.0, 1.0, 5.0, 16.0, 20.0, 16.0, 7.0, 7.0, 4.0, 9.0, 23.0, 17.0, 11.0, 11.0, 20.0, 19.0, 63.0, 134.0, 226.0, 771.0], [177.0, 101.0, 94.0, 56.0, 21.0, 23.0, 12.0, 19.0, 7.0, 28.0, 6.0, 7.0, 5.0, 19.0, 36.0, 10.0, 4.0, 24.0, 23.0, 19.0, 4.0, 5.0, 19.0, 27.0, 15.0, 2.0, 1.0, 6.0, 4.0, 5.0, 4.0, 23.0, 5.0, 14.0, 17.0, 4.0, 6.0, 4.0, 26.0, 9.0, 5.0, 5.0, 9.0, 9.0, 17.0, 21.0, 57.0, 122.0, 431.0], [196.0, 110.0, 107.0, 68.0, 38.0, 25.0, 19.0, 14.0, 24.0, 22.0, 4.0, 4.0, 6.0, 33.0, 8.0, 27.0, 5.0, 7.0, 5.0, 5.0, 3.0, 2.0, 25.0, 30.0, 24.0, 10.0, 22.0, 7.0, 5.0, 3.0, 4.0, 4.0, 4.0, 5.0, 14.0, 20.0, 1.0, 5.0, 5.0, 3.0, 6.0, 24.0, 11.0, 3.0, 6.0, 16.0, 20.0, 48.0, 263.0], [192.0, 87.0, 79.0, 28.0, 28.0, 22.0, 40.0, 21.0, 12.0, 4.0, 6.0, 14.0, 34.0, 14.0, 12.0, 38.0, 20.0, 5.0, 18.0, 34.0, 26.0, 7.0, 6.0, 4.0, 2.0, 7.0, 20.0, 14.0, 4.0, 26.0, 2.0, 16.0, 16.0, 6.0, 3.0, 3.0, 17.0, 10.0, 5.0, 25.0, 17.0, 35.0, 1.0, 3.0, 6.0, 7.0, 15.0, 24.0, 123.0], [159.0, 107.0, 56.0, 49.0, 45.0, 41.0, 30.0, 26.0, 9.0, 14.0, 9.0, 8.0, 6.0, 2.0, 2.0, 3.0, 29.0, 3.0, 4.0, 5.0, 11.0, 4.0, 6.0, 4.0, 7.0, 20.0, 14.0, 2.0, 2.0, 6.0, 7.0, 3.0, 3.0, 25.0, 4.0, 7.0, 3.0, 3.0, 2.0, 20.0, 9.0, 5.0, 6.0, 1.0, 7.0, 20.0, 8.0, 22.0, 74.0], [146.0, 107.0, 76.0, 58.0, 59.0, 39.0, 19.0, 10.0, 19.0, 24.0, 0.0, 7.0, 7.0, 18.0, 17.0, 28.0, 11.0, 7.0, 3.0, 8.0, 8.0, 17.0, 10.0, 2.0, 7.0, 8.0, 5.0, 4.0, 6.0, 3.0, 5.0, 5.0, 8.0, 22.0, 1.0, 5.0, 25.0, 5.0, 7.0, 27.0, 26.0, 6.0, 2.0, 2.0, 27.0, 5.0, 2.0, 12.0, 30.0], [158.0, 101.0, 81.0, 58.0, 38.0, 28.0, 13.0, 5.0, 36.0, 14.0, 7.0, 4.0, 6.0, 3.0, 7.0, 31.0, 8.0, 6.0, 4.0, 7.0, 2.0, 2.0, 23.0, 12.0, 3.0, 7.0, 4.0, 1.0, 6.0, 3.0, 4.0, 2.0, 5.0, 4.0, 8.0, 1.0, 3.0, 1.0, 24.0, 12.0, 18.0, 6.0, 4.0, 8.0, 5.0, 7.0, 5.0, 5.0, 23.0], [140.0, 108.0, 71.0, 54.0, 33.0, 21.0, 23.0, 50.0, 14.0, 10.0, 4.0, 12.0, 27.0, 6.0, 17.0, 17.0, 28.0, 6.0, 4.0, 4.0, 3.0, 4.0, 3.0, 3.0, 5.0, 3.0, 6.0, 5.0, 38.0, 18.0, 3.0, 5.0, 1.0, 5.0, 7.0, 4.0, 6.0, 1.0, 6.0, 2.0, 5.0, 4.0, 3.0, 6.0, 6.0, 3.0, 6.0, 33.0, 15.0], [180.0, 110.0, 73.0, 56.0, 54.0, 22.0, 30.0, 15.0, 12.0, 6.0, 10.0, 2.0, 4.0, 7.0, 1.0, 5.0, 8.0, 5.0, 4.0, 6.0, 6.0, 3.0, 24.0, 4.0, 5.0, 4.0, 3.0, 5.0, 3.0, 0.0, 3.0, 4.0, 5.0, 3.0, 5.0, 5.0, 15.0, 39.0, 16.0, 15.0, 5.0, 2.0, 25.0, 9.0, 3.0, 2.0, 6.0, 12.0, 16.0], [164.0, 96.0, 68.0, 74.0, 31.0, 14.0, 11.0, 10.0, 11.0, 4.0, 29.0, 8.0, 8.0, 5.0, 3.0, 5.0, 7.0, 20.0, 11.0, 6.0, 4.0, 4.0, 2.0, 5.0, 6.0, 3.0, 8.0, 2.0, 5.0, 6.0, 7.0, 7.0, 2.0, 3.0, 4.0, 4.0, 4.0, 4.0, 3.0, 1.0, 16.0, 18.0, 1.0, 5.0, 3.0, 29.0, 5.0, 11.0, 25.0], [149.0, 97.0, 81.0, 65.0, 20.0, 19.0, 18.0, 28.0, 19.0, 2.0, 8.0, 8.0, 8.0, 11.0, 37.0, 14.0, 8.0, 4.0, 5.0, 5.0, 4.0, 3.0, 32.0, 4.0, 5.0, 6.0, 2.0, 5.0, 2.0, 5.0, 3.0, 3.0, 9.0, 2.0, 1.0, 4.0, 8.0, 1.0, 4.0, 5.0, 4.0, 3.0, 3.0, 24.0, 7.0, 5.0, 2.0, 8.0, 13.0], [145.0, 101.0, 62.0, 42.0, 40.0, 18.0, 21.0, 28.0, 18.0, 12.0, 24.0, 10.0, 9.0, 2.0, 7.0, 6.0, 6.0, 6.0, 5.0, 1.0, 8.0, 2.0, 4.0, 5.0, 4.0, 2.0, 4.0, 3.0, 6.0, 6.0, 4.0, 4.0, 5.0, 4.0, 5.0, 2.0, 2.0, 2.0, 6.0, 4.0, 5.0, 4.0, 1.0, 5.0, 2.0, 5.0, 13.0, 6.0, 9.0]],
    "Name": "sCurve-0",
    "Overflow": 2358167.0,
    "Type": "Histo2d",
    "Underflow": 0.0,
    "x": {
        "AxisTitle": "Vcal",
        "Bins": 51,
        "High": 302.5,
        "Low": 47.5
    },
    "y": {
        "AxisTitle": "Occupancy",
        "Bins": 49,
        "High": 49.5,
        "Low": 0.5
    },
    "z": {
        "AxisTitle": "Number of pixels"
    }
}