time,Hardware,Voltage,Current
1626352920256,high-voltage-3,1,0.00323385
time,Hardware,Voltage,Current
1626352920256,high-voltage-3,2,0.00430597
time,Hardware,Voltage,Current
1626352920256,high-voltage-3,3,0.00638473
time,Hardware,Voltage,Current
1626352920256,high-voltage-3,4,0.00769035
time,Hardware,Voltage,Current
1626352920256,high-voltage-3,5,0.00877394
time,Hardware,Voltage,Current
1626352920256,high-voltage-3,6,0.0106301
time,Hardware,Voltage,Current
1626352920256,high-voltage-3,7,0.012429
time,Hardware,Voltage,Current
1626352920256,high-voltage-3,8,0.0150338
time,Hardware,Voltage,Current
1626352920256,high-voltage-3,9,0.0153083
time,Hardware,Voltage,Current
1626352920256,high-voltage-3,10,0.0170617
time,Hardware,Voltage,Current
1626352920256,high-voltage-3,11,0.0182846
time,Hardware,Voltage,Current
1626352920256,high-voltage-3,12,0.0208946
time,Hardware,Voltage,Current
1626352920256,high-voltage-3,13,0.021931
time,Hardware,Voltage,Current
1626352920256,high-voltage-3,14,0.023887
time,Hardware,Voltage,Current
1626352920256,high-voltage-3,15,0.0250004
time,Hardware,Voltage,Current
1626352920256,high-voltage-3,16,0.0265747
time,Hardware,Voltage,Current
1626352920256,high-voltage-3,17,0.0268894
time,Hardware,Voltage,Current
1626352920256,high-voltage-3,18,0.0278835
time,Hardware,Voltage,Current
1626352920256,high-voltage-3,19,0.0286277
time,Hardware,Voltage,Current
1626352920256,high-voltage-3,20,0.0303978
time,Hardware,Voltage,Current
1626352920256,high-voltage-3,25,0.0369649
time,Hardware,Voltage,Current
1626352920256,high-voltage-3,30,0.0433521
time,Hardware,Voltage,Current
1626352920256,high-voltage-3,35,0.0487807
time,Hardware,Voltage,Current
1626352920256,high-voltage-3,40,0.0544038
time,Hardware,Voltage,Current
1626352920256,high-voltage-3,45,0.0600498
time,Hardware,Voltage,Current
1626352920256,high-voltage-3,50,0.0650875
time,Hardware,Voltage,Current
1626352920256,high-voltage-3,55,0.0700571
time,Hardware,Voltage,Current
1626352920256,high-voltage-3,60,0.073406
time,Hardware,Voltage,Current
1626352920256,high-voltage-3,65,0.0787589
time,Hardware,Voltage,Current
1626352920256,high-voltage-3,70,0.084224
time,Hardware,Voltage,Current
1626352920256,high-voltage-3,75,0.0891247
time,Hardware,Voltage,Current
1626352920256,high-voltage-3,80,0.0933754
time,Hardware,Voltage,Current
1626352920256,high-voltage-3,85,0.0980171
time,Hardware,Voltage,Current
1626352920256,high-voltage-3,90,0.105367
time,Hardware,Voltage,Current
1626352920256,high-voltage-3,95,0.110145
time,Hardware,Voltage,Current
1626352920256,high-voltage-3,100,0.116054
