{
    "Data": [592.0, 10225.0, 13714.0, 7346.0, 3016.0, 1310.0, 922.0, 820.0, 862.0, 868.0, 905.0, 942.0, 969.0, 1037.0, 1007.0, 1023.0, 1002.0, 944.0, 904.0, 847.0, 743.0, 776.0, 670.0, 604.0, 552.0, 463.0, 445.0, 376.0, 376.0, 308.0, 276.0, 292.0, 250.0, 248.0, 224.0, 198.0, 171.0, 161.0, 119.0, 119.0, 103.0, 68.0, 92.0, 60.0, 56.0, 39.0, 59.0, 35.0, 38.0, 40.0, 8.0],
    "Name": "Chi2Dist-0",
    "Overflow": 0.0,
    "Type": "Histo1d",
    "Underflow": 0.0,
    "x": {
        "AxisTitle": "Fit Chi/ndf",
        "Bins": 51,
        "High": 2.5250000953674318,
        "Low": -0.02500000037252903
    },
    "y": {
        "AxisTitle": "Number of Pixels"
    },
    "z": {
        "AxisTitle": "z"
    }
}