time,Hardware,Voltage,Current
1621993394258,high-voltage,1,0.0607125
time,Hardware,Voltage,Current
1621993394258,high-voltage,2,0.11656
time,Hardware,Voltage,Current
1621993394258,high-voltage,3,0.207417
time,Hardware,Voltage,Current
1621993394258,high-voltage,4,0.331012
time,Hardware,Voltage,Current
1621993394258,high-voltage,5,0.464599
time,Hardware,Voltage,Current
1621993394258,high-voltage,6,0.609365
time,Hardware,Voltage,Current
1621993394258,high-voltage,7,0.813724
time,Hardware,Voltage,Current
1621993394258,high-voltage,8,1.05707
time,Hardware,Voltage,Current
1621993394258,high-voltage,9,1.36544
time,Hardware,Voltage,Current
1621993394258,high-voltage,10,1.72056
time,Hardware,Voltage,Current
1621993394258,high-voltage,11,2.20973
time,Hardware,Voltage,Current
1621993394258,high-voltage,12,2.73715
time,Hardware,Voltage,Current
1621993394258,high-voltage,13,3.38419
time,Hardware,Voltage,Current
1621993394258,high-voltage,14,4.16492
time,Hardware,Voltage,Current
1621993394258,high-voltage,15,5.10843
time,Hardware,Voltage,Current
1621993394258,high-voltage,16,6.07799
time,Hardware,Voltage,Current
1621993394258,high-voltage,17,7.27704
time,Hardware,Voltage,Current
1621993394258,high-voltage,18,8.50913
time,Hardware,Voltage,Current
1621993394258,high-voltage,19,9.4645
time,Hardware,Voltage,Current
1621993394258,high-voltage,20,10.0001
