time,Hardware,Voltage,Current
1626395237103,high-voltage,1,0.0582098
time,Hardware,Voltage,Current
1626395237103,high-voltage,2,0.0918328
time,Hardware,Voltage,Current
1626395237103,high-voltage,3,0.114398
time,Hardware,Voltage,Current
1626395237103,high-voltage,4,0.13266
time,Hardware,Voltage,Current
1626395237103,high-voltage,5,0.147873
time,Hardware,Voltage,Current
1626395237103,high-voltage,6,0.161884
time,Hardware,Voltage,Current
1626395237103,high-voltage,7,0.174576
time,Hardware,Voltage,Current
1626395237103,high-voltage,8,0.185868
time,Hardware,Voltage,Current
1626395237103,high-voltage,9,0.196893
time,Hardware,Voltage,Current
1626395237103,high-voltage,10,0.206122
time,Hardware,Voltage,Current
1626395237103,high-voltage,11,0.216016
time,Hardware,Voltage,Current
1626395237103,high-voltage,12,0.222664
time,Hardware,Voltage,Current
1626395237103,high-voltage,13,0.230213
time,Hardware,Voltage,Current
1626395237103,high-voltage,14,0.236291
time,Hardware,Voltage,Current
1626395237103,high-voltage,15,0.242273
time,Hardware,Voltage,Current
1626395237103,high-voltage,16,0.247984
time,Hardware,Voltage,Current
1626395237103,high-voltage,17,0.253558
time,Hardware,Voltage,Current
1626395237103,high-voltage,18,0.260302
time,Hardware,Voltage,Current
1626395237103,high-voltage,19,0.266518
time,Hardware,Voltage,Current
1626395237103,high-voltage,20,0.270999
time,Hardware,Voltage,Current
1626395237103,high-voltage,25,0.299672
time,Hardware,Voltage,Current
1626395237103,high-voltage,30,0.328929
time,Hardware,Voltage,Current
1626395237103,high-voltage,35,0.375348
time,Hardware,Voltage,Current
1626395237103,high-voltage,40,0.48531
time,Hardware,Voltage,Current
1626395237103,high-voltage,45,0.708381
time,Hardware,Voltage,Current
1626395237103,high-voltage,50,1.08199
time,Hardware,Voltage,Current
1626395237103,high-voltage,55,1.71781
time,Hardware,Voltage,Current
1626395237103,high-voltage,60,2.70613
time,Hardware,Voltage,Current
1626395237103,high-voltage,65,4.14663
time,Hardware,Voltage,Current
1626395237103,high-voltage,70,6.12264
time,Hardware,Voltage,Current
1626395237103,high-voltage,75,8.84434
time,Hardware,Voltage,Current
1626395237103,high-voltage,80,10
