time,Hardware,Voltage,Current
1626610527299,high-voltage,1,0.0505253
time,Hardware,Voltage,Current
1626610527299,high-voltage,2,0.0737326
time,Hardware,Voltage,Current
1626610527299,high-voltage,3,0.0869649
time,Hardware,Voltage,Current
1626610527299,high-voltage,4,0.097886
time,Hardware,Voltage,Current
1626610527299,high-voltage,5,0.108406
time,Hardware,Voltage,Current
1626610527299,high-voltage,6,0.119555
time,Hardware,Voltage,Current
1626610527299,high-voltage,7,0.132077
time,Hardware,Voltage,Current
1626610527299,high-voltage,8,0.144712
time,Hardware,Voltage,Current
1626610527299,high-voltage,9,0.157567
time,Hardware,Voltage,Current
1626610527299,high-voltage,10,0.171892
time,Hardware,Voltage,Current
1626610527299,high-voltage,11,0.184384
time,Hardware,Voltage,Current
1626610527299,high-voltage,12,0.197765
time,Hardware,Voltage,Current
1626610527299,high-voltage,13,0.207873
time,Hardware,Voltage,Current
1626610527299,high-voltage,14,0.218207
time,Hardware,Voltage,Current
1626610527299,high-voltage,15,0.226185
time,Hardware,Voltage,Current
1626610527299,high-voltage,16,0.234139
time,Hardware,Voltage,Current
1626610527299,high-voltage,17,0.240226
time,Hardware,Voltage,Current
1626610527299,high-voltage,18,0.247452
time,Hardware,Voltage,Current
1626610527299,high-voltage,19,0.253627
time,Hardware,Voltage,Current
1626610527299,high-voltage,20,0.259011
time,Hardware,Voltage,Current
1626610527299,high-voltage,25,0.288052
time,Hardware,Voltage,Current
1626610527299,high-voltage,30,0.323844
time,Hardware,Voltage,Current
1626610527299,high-voltage,35,0.390873
time,Hardware,Voltage,Current
1626610527299,high-voltage,40,0.550843
time,Hardware,Voltage,Current
1626610527299,high-voltage,45,0.867451
time,Hardware,Voltage,Current
1626610527299,high-voltage,50,1.41858
time,Hardware,Voltage,Current
1626610527299,high-voltage,55,2.30903
time,Hardware,Voltage,Current
1626610527299,high-voltage,60,3.67039
time,Hardware,Voltage,Current
1626610527299,high-voltage,65,5.59737
time,Hardware,Voltage,Current
1626610527299,high-voltage,70,8.23115
time,Hardware,Voltage,Current
1626610527299,high-voltage,75,10
