time,Hardware,Voltage,Current
1623352270340,high-voltage,1,0.0680069
time,Hardware,Voltage,Current
1623352270340,high-voltage,2,0.0841356
time,Hardware,Voltage,Current
1623352270340,high-voltage,3,0.0974075
time,Hardware,Voltage,Current
1623352270340,high-voltage,4,0.109357
time,Hardware,Voltage,Current
1623352270340,high-voltage,5,0.119207
time,Hardware,Voltage,Current
1623352270340,high-voltage,6,0.128665
time,Hardware,Voltage,Current
1623352270340,high-voltage,7,0.138062
time,Hardware,Voltage,Current
1623352270340,high-voltage,8,0.147595
time,Hardware,Voltage,Current
1623352270340,high-voltage,9,0.156466
time,Hardware,Voltage,Current
1623352270340,high-voltage,10,0.165591
time,Hardware,Voltage,Current
1623352270340,high-voltage,11,0.175278
time,Hardware,Voltage,Current
1623352270340,high-voltage,12,0.183674
time,Hardware,Voltage,Current
1623352270340,high-voltage,13,0.191093
time,Hardware,Voltage,Current
1623352270340,high-voltage,14,0.197588
time,Hardware,Voltage,Current
1623352270340,high-voltage,15,0.204306
time,Hardware,Voltage,Current
1623352270340,high-voltage,16,0.210627
time,Hardware,Voltage,Current
1623352270340,high-voltage,17,0.21588
time,Hardware,Voltage,Current
1623352270340,high-voltage,18,0.220933
time,Hardware,Voltage,Current
1623352270340,high-voltage,19,0.224625
time,Hardware,Voltage,Current
1623352270340,high-voltage,20,0.230336
time,Hardware,Voltage,Current
1623352270340,high-voltage,25,0.253752
time,Hardware,Voltage,Current
1623352270340,high-voltage,30,0.286228
