{
    "Data": [0.0, 0.0, 8.0, 16.0, 10.0, 10.0, 15.0, 13.0, 20.0, 26.0, 25.0, 28.0, 23.0, 22.0, 35.0, 39.0, 45.0, 43.0, 59.0, 64.0, 80.0, 73.0, 118.0, 153.0, 149.0, 164.0, 210.0, 264.0, 295.0, 329.0, 409.0, 481.0, 519.0, 642.0, 682.0, 720.0, 826.0, 836.0, 960.0, 1109.0, 1149.0, 1487.0, 1814.0, 2253.0, 2807.0, 3366.0, 3637.0, 4036.0, 3779.0, 3521.0, 2961.0, 2279.0, 1862.0, 1373.0, 1029.0, 716.0, 589.0, 520.0, 379.0, 322.0, 320.0, 254.0, 172.0, 175.0, 136.0, 117.0, 110.0, 78.0, 70.0, 78.0, 71.0, 49.0, 34.0, 22.0, 38.0, 31.0, 25.0, 19.0, 15.0, 20.0, 21.0, 11.0, 12.0, 16.0, 14.0, 15.0, 12.0, 12.0, 17.0, 6.0, 9.0],
    "Name": "ThresholdDist-0",
    "Overflow": 193.0,
    "Type": "Histo1d",
    "Underflow": 0.0,
    "x": {
        "AxisTitle": "Threshold [e]",
        "Bins": 91,
        "High": 1385.0,
        "Low": 475.0
    },
    "y": {
        "AxisTitle": "Number of Pixels"
    },
    "z": {
        "AxisTitle": "z"
    }
}