time,Hardware,Voltage,Current
1623286427337,high-voltage,1,0.0252847
time,Hardware,Voltage,Current
1623286427337,high-voltage,2,0.0322191
time,Hardware,Voltage,Current
1623286427337,high-voltage,3,0.0372039
time,Hardware,Voltage,Current
1623286427337,high-voltage,4,0.0416166
time,Hardware,Voltage,Current
1623286427337,high-voltage,5,0.0454779
time,Hardware,Voltage,Current
1623286427337,high-voltage,6,0.0507174
time,Hardware,Voltage,Current
1623286427337,high-voltage,7,0.0540055
time,Hardware,Voltage,Current
1623286427337,high-voltage,8,0.0584287
time,Hardware,Voltage,Current
1623286427337,high-voltage,9,0.0638964
time,Hardware,Voltage,Current
1623286427337,high-voltage,10,0.0693991
time,Hardware,Voltage,Current
1623286427337,high-voltage,11,0.0745395
time,Hardware,Voltage,Current
1623286427337,high-voltage,12,0.0796883
time,Hardware,Voltage,Current
1623286427337,high-voltage,13,0.0844743
time,Hardware,Voltage,Current
1623286427337,high-voltage,14,0.0880084
time,Hardware,Voltage,Current
1623286427337,high-voltage,15,0.0915856
time,Hardware,Voltage,Current
1623286427337,high-voltage,16,0.09491
time,Hardware,Voltage,Current
1623286427337,high-voltage,17,0.0973454
time,Hardware,Voltage,Current
1623286427337,high-voltage,18,0.100527
time,Hardware,Voltage,Current
1623286427337,high-voltage,19,0.102085
time,Hardware,Voltage,Current
1623286427337,high-voltage,20,0.104697
time,Hardware,Voltage,Current
1623286427337,high-voltage,25,0.117798
time,Hardware,Voltage,Current
1623286427337,high-voltage,30,0.134829
time,Hardware,Voltage,Current
1623286427337,high-voltage,35,0.187579
time,Hardware,Voltage,Current
1623286427337,high-voltage,40,0.390113
time,Hardware,Voltage,Current
1623286427337,high-voltage,45,0.824582
time,Hardware,Voltage,Current
1623286427337,high-voltage,50,1.46601
time,Hardware,Voltage,Current
1623286427337,high-voltage,55,2.28116
