{
    "Data": [0.0, 0.0, 0.0, 0.0, 0.0, 0.0, 0.0, 0.0, 0.0, 0.0, 0.0, 0.0, 0.0, 0.0, 0.0, 0.0, 0.0, 0.0, 0.0, 0.0, 0.0, 0.0, 0.0, 0.0, 0.0, 1.0, 3.0, 4.0, 6.0, 10.0, 0.0, 15.0, 7.0, 12.0, 29.0, 12.0, 9.0, 49.0, 20.0, 47.0, 50.0, 46.0, 11.0, 2.0, 24.0, 27.0, 2.0, 28.0, 50.0, 1.0, 17.0],
    "Name": "Scurve-20-96",
    "Overflow": 0.0,
    "Type": "Histo1d",
    "Underflow": 0.0,
    "x": {
        "AxisTitle": "Vcal",
        "Bins": 51,
        "High": 302.5,
        "Low": 47.5
    },
    "y": {
        "AxisTitle": "Occupancy"
    },
    "z": {
        "AxisTitle": "z"
    }
}