time,Hardware,Voltage,Current
1623358621435,high-voltage,1,0.0257621
time,Hardware,Voltage,Current
1623358621435,high-voltage,2,0.0333085
time,Hardware,Voltage,Current
1623358621435,high-voltage,3,0.0380685
time,Hardware,Voltage,Current
1623358621435,high-voltage,4,0.043693
time,Hardware,Voltage,Current
1623358621435,high-voltage,5,0.0477627
time,Hardware,Voltage,Current
1623358621435,high-voltage,6,0.0529494
time,Hardware,Voltage,Current
1623358621435,high-voltage,7,0.0575831
time,Hardware,Voltage,Current
1623358621435,high-voltage,8,0.06242
time,Hardware,Voltage,Current
1623358621435,high-voltage,9,0.0672284
time,Hardware,Voltage,Current
1623358621435,high-voltage,10,0.0721673
time,Hardware,Voltage,Current
1623358621435,high-voltage,11,0.0769589
time,Hardware,Voltage,Current
1623358621435,high-voltage,12,0.0820239
time,Hardware,Voltage,Current
1623358621435,high-voltage,13,0.0869409
time,Hardware,Voltage,Current
1623358621435,high-voltage,14,0.0900227
time,Hardware,Voltage,Current
1623358621435,high-voltage,15,0.0943886
time,Hardware,Voltage,Current
1623358621435,high-voltage,16,0.0969084
time,Hardware,Voltage,Current
1623358621435,high-voltage,17,0.100236
time,Hardware,Voltage,Current
1623358621435,high-voltage,18,0.102609
time,Hardware,Voltage,Current
1623358621435,high-voltage,19,0.105793
time,Hardware,Voltage,Current
1623358621435,high-voltage,20,0.107165
time,Hardware,Voltage,Current
1623358621435,high-voltage,25,0.119487
time,Hardware,Voltage,Current
1623358621435,high-voltage,30,0.132057
time,Hardware,Voltage,Current
1623358621435,high-voltage,35,0.159663
time,Hardware,Voltage,Current
1623358621435,high-voltage,40,0.266752
time,Hardware,Voltage,Current
1623358621435,high-voltage,5.632e-07,0.567158
time,Hardware,Voltage,Current
1623358621435,high-voltage,50,1.06734
time,Hardware,Voltage,Current
1623358621435,high-voltage,1.72849e-06,1.73759
time,Hardware,Voltage,Current
1623358621435,high-voltage,60,2.57029
time,Hardware,Voltage,Current
1623358621435,high-voltage,65,3.5514
time,Hardware,Voltage,Current
1623358621435,high-voltage,70,4.64122
time,Hardware,Voltage,Current
1623358621435,high-voltage,75,5.87284
time,Hardware,Voltage,Current
1623358621435,high-voltage,80,7.27149
time,Hardware,Voltage,Current
1623358621435,high-voltage,85,8.85787
time,Hardware,Voltage,Current
1623358621435,high-voltage,90,10
