{
    "Data": [0.0, 0.0, 0.0, 0.0, 0.0, 0.0, 0.0, 0.0, 0.0, 0.0, 0.0, 0.0, 0.0, 0.0, 0.0, 0.0, 0.0, 1.0, 0.0, 0.0, 1.0, 0.0, 2.0, 6.0, 2.0, 13.0, 13.0, 15.0, 21.0, 15.0, 28.0, 32.0, 38.0, 40.0, 34.0, 43.0, 43.0, 28.0, 50.0, 17.0, 48.0, 49.0, 4.0, 50.0, 50.0, 50.0, 48.0, 12.0, 50.0, 3.0, 50.0],
    "Name": "Scurve-20-96",
    "Overflow": 0.0,
    "Type": "Histo1d",
    "Underflow": 0.0,
    "x": {
        "AxisTitle": "Vcal",
        "Bins": 51,
        "High": 302.5,
        "Low": 47.5
    },
    "y": {
        "AxisTitle": "Occupancy"
    },
    "z": {
        "AxisTitle": "z"
    }
}