{
    "Data": [0.0, 0.0, 0.0, 0.0, 0.0, 0.0, 0.0, 0.0, 0.0, 0.0, 1.0, 0.0, 0.0, 14.0, 77.0, 26.0, 7.0, 239.0, 775.0, 252.0, 92.0, 817.0, 2656.0, 2222.0, 538.0, 1401.0, 2544.0, 2372.0, 878.0, 1128.0, 1938.0, 2250.0, 1186.0, 1032.0, 1589.0, 1706.0, 1068.0, 899.0, 1402.0, 2018.0, 1638.0, 950.0, 1167.0, 1805.0, 1893.0, 1275.0, 1152.0, 1645.0, 2174.0, 1893.0, 1189.0, 1148.0, 1364.0, 1272.0, 1067.0, 993.0, 893.0, 1095.0, 931.0, 872.0, 782.0, 745.0, 647.0, 554.0, 529.0, 506.0, 498.0, 447.0, 335.0, 340.0, 327.0, 357.0, 305.0, 269.0, 214.0, 196.0, 183.0, 197.0, 160.0, 153.0, 127.0, 126.0, 108.0, 86.0, 85.0, 72.0, 59.0, 51.0, 43.0, 46.0, 41.0, 44.0, 25.0, 29.0, 41.0, 28.0, 25.0, 31.0, 28.0, 19.0, 23.0, 13.0, 26.0, 23.0, 15.0, 13.0, 11.0, 16.0, 13.0, 12.0, 14.0, 9.0, 12.0, 12.0, 11.0, 2.0, 14.0, 10.0, 9.0, 7.0, 8.0, 10.0, 8.0, 7.0, 3.0, 3.0, 4.0, 3.0, 5.0, 1.0, 4.0, 5.0, 6.0, 1.0, 3.0, 3.0, 1.0, 3.0, 4.0, 2.0, 8.0, 1.0, 4.0, 3.0, 1.0, 0.0, 2.0, 3.0, 3.0, 3.0, 1.0, 2.0, 2.0, 5.0, 4.0, 1.0, 4.0, 3.0, 1.0, 3.0, 2.0, 0.0, 4.0, 2.0, 0.0, 2.0, 3.0, 1.0, 3.0, 4.0, 2.0, 1.0, 2.0, 2.0, 1.0, 3.0, 4.0, 0.0, 2.0, 4.0, 0.0, 4.0, 3.0, 1.0, 3.0, 0.0, 0.0, 0.0, 0.0, 0.0, 2.0, 3.0, 1.0, 1.0, 2.0, 0.0, 0.0, 2.0, 2.0, 4.0, 3.0],
    "Name": "TimePerFitDist-0",
    "Overflow": 215.0,
    "Type": "Histo1d",
    "Underflow": 0.0,
    "x": {
        "AxisTitle": "Fit Time [us]",
        "Bins": 201,
        "High": 401.0,
        "Low": -1.0
    },
    "y": {
        "AxisTitle": "Number of Pixels"
    },
    "z": {
        "AxisTitle": "z"
    }
}