{
    "Data": [0.0, 0.0, 0.0, 0.0, 0.0, 0.0, 0.0, 0.0, 0.0, 0.0, 0.0, 0.0, 0.0, 0.0, 0.0, 0.0, 0.0, 0.0, 0.0, 0.0, 0.0, 0.0, 0.0, 0.0, 0.0, 0.0, 0.0, 0.0, 0.0, 0.0, 0.0, 0.0, 0.0, 0.0, 0.0, 0.0, 0.0, 0.0, 0.0, 0.0, 0.0, 0.0, 0.0, 0.0, 0.0, 0.0, 0.0, 0.0, 0.0, 0.0, 143.0, 242.0, 242.0, 286.0, 253.0, 254.0, 253.0, 303.0, 272.0, 277.0, 256.0, 310.0, 291.0, 307.0, 283.0, 313.0, 316.0, 314.0, 313.0, 304.0, 315.0, 345.0, 327.0, 345.0, 346.0, 296.0, 295.0, 406.0, 347.0, 339.0, 384.0, 395.0, 379.0, 353.0, 348.0, 374.0, 375.0, 382.0, 359.0, 383.0, 371.0, 362.0, 378.0, 368.0, 373.0, 352.0, 394.0, 396.0, 369.0, 340.0, 368.0, 388.0, 418.0, 345.0, 368.0, 373.0, 350.0, 387.0, 358.0, 358.0, 346.0, 352.0, 338.0, 323.0, 341.0, 291.0, 295.0, 324.0, 322.0, 367.0, 293.0, 319.0, 286.0, 309.0, 287.0, 296.0, 252.0, 261.0, 241.0, 235.0, 215.0, 223.0, 220.0, 232.0, 213.0, 223.0, 215.0, 231.0, 196.0, 187.0, 177.0, 202.0, 191.0, 176.0, 169.0, 182.0, 159.0, 155.0, 155.0, 154.0, 133.0, 148.0, 119.0, 133.0, 115.0, 127.0, 139.0, 113.0, 116.0, 128.0, 114.0, 93.0, 110.0, 106.0, 109.0, 119.0, 101.0, 118.0, 94.0, 109.0, 103.0, 98.0, 130.0, 127.0, 154.0, 175.0, 188.0, 212.0, 215.0, 260.0, 264.0, 314.0, 355.0, 379.0, 418.0, 498.0, 520.0, 543.0, 615.0, 652.0, 654.0, 716.0, 733.0, 812.0, 813.0, 867.0, 830.0, 832.0, 864.0, 845.0, 779.0, 812.0, 790.0, 776.0, 751.0, 670.0, 657.0, 608.0, 576.0, 530.0, 526.0, 500.0, 460.0, 416.0, 361.0, 303.0, 264.0, 298.0, 221.0, 200.0, 212.0, 175.0, 147.0, 135.0, 95.0, 79.0, 73.0, 76.0, 65.0, 54.0, 41.0, 37.0, 33.0, 33.0, 27.0, 22.0, 13.0, 22.0, 17.0, 19.0, 8.0, 10.0, 10.0, 13.0, 9.0, 5.0, 4.0, 4.0, 5.0, 4.0, 8.0, 1.0, 6.0, 5.0, 9.0, 5.0, 4.0, 4.0, 3.0, 3.0, 6.0, 3.0, 3.0, 2.0, 3.0, 1.0, 6.0, 3.0, 7.0, 0.0, 1.0, 1.0, 4.0, 3.0, 3.0, 2.0, 3.0, 1.0, 0.0, 0.0, 1.0, 2.0, 8.0, 2.0, 0.0, 1.0, 1.0, 1.0, 1.0, 2.0, 2.0, 2.0, 1.0, 4.0, 0.0, 1.0, 2.0, 1.0, 2.0, 1.0, 0.0, 0.0, 2.0, 1.0, 4.0, 1.0, 1.0, 0.0, 0.0, 4.0, 1.0, 2.0, 0.0, 1.0, 1.0, 1.0, 0.0, 1.0, 0.0, 0.0, 0.0, 3.0, 7.0, 0.0, 1.0, 1.0, 0.0, 0.0, 0.0, 0.0, 0.0, 0.0, 0.0, 0.0, 0.0, 0.0, 0.0, 0.0, 0.0, 0.0, 0.0, 0.0, 0.0, 0.0, 0.0, 0.0, 0.0, 0.0, 0.0, 0.0, 0.0, 0.0, 0.0, 0.0, 0.0, 0.0, 0.0, 0.0, 0.0, 0.0, 0.0, 0.0, 0.0, 0.0, 0.0, 0.0, 0.0, 0.0, 0.0, 0.0, 0.0, 0.0, 0.0, 0.0, 0.0, 0.0, 0.0, 0.0, 0.0, 0.0, 0.0, 0.0, 0.0, 0.0, 0.0, 0.0, 0.0, 0.0, 0.0, 0.0, 0.0, 0.0, 0.0, 0.0, 0.0, 0.0, 0.0, 0.0, 0.0, 0.0, 0.0, 0.0, 0.0, 0.0, 0.0, 0.0, 0.0, 0.0, 0.0, 0.0, 0.0, 0.0, 0.0, 0.0, 0.0, 0.0],
    "Name": "ThresholdDist-0",
    "Overflow": 0.0,
    "Type": "Histo1d",
    "Underflow": 0.0,
    "x": {
        "AxisTitle": "Threshold [e]",
        "Bins": 416,
        "High": 4155.0,
        "Low": -5.0
    },
    "y": {
        "AxisTitle": "Number of Pixels"
    },
    "z": {
        "AxisTitle": "z"
    }
}