{
    "Data": [745.0, 17744.0, 21055.0, 10471.0, 5241.0, 3955.0, 3453.0, 3343.0, 2751.0, 2090.0, 1415.0, 1004.0, 653.0, 410.0, 279.0, 210.0, 129.0, 129.0, 94.0, 64.0, 66.0, 59.0, 61.0, 50.0, 52.0, 41.0, 35.0, 38.0, 48.0, 35.0, 22.0, 27.0, 32.0, 29.0, 24.0, 20.0, 21.0, 25.0, 22.0, 21.0, 10.0, 15.0, 5.0, 9.0, 6.0, 6.0, 11.0, 14.0, 14.0, 7.0, 0.0],
    "Name": "Chi2Dist-0",
    "Overflow": 0.0,
    "Type": "Histo1d",
    "Underflow": 0.0,
    "x": {
        "AxisTitle": "Fit Chi/ndf",
        "Bins": 51,
        "High": 2.5250000953674318,
        "Low": -0.02500000037252903
    },
    "y": {
        "AxisTitle": "Number of Pixels"
    },
    "z": {
        "AxisTitle": "z"
    }
}