{
    "Data": [0.0, 0.0, 0.0, 0.0, 0.0, 0.0, 0.0, 0.0, 0.0, 0.0, 0.0, 0.0, 0.0, 0.0, 0.0, 1.0, 2.0, 2.0, 0.0, 6.0, 3.0, 4.0, 3.0, 5.0, 6.0, 30.0, 24.0, 34.0, 36.0, 42.0, 41.0, 48.0, 49.0, 49.0, 49.0, 50.0, 50.0, 46.0, 50.0, 50.0, 31.0, 21.0, 50.0, 50.0, 50.0, 1.0, 50.0, 49.0, 29.0, 50.0, 6.0],
    "Name": "Scurve-30-96",
    "Overflow": 0.0,
    "Type": "Histo1d",
    "Underflow": 0.0,
    "x": {
        "AxisTitle": "Vcal",
        "Bins": 51,
        "High": 302.5,
        "Low": 47.5
    },
    "y": {
        "AxisTitle": "Occupancy"
    },
    "z": {
        "AxisTitle": "z"
    }
}