time,Hardware,Voltage,Current
1621989350855,high-voltage,1,0.0647825
time,Hardware,Voltage,Current
1621989350855,high-voltage,2,0.138514
time,Hardware,Voltage,Current
1621989350855,high-voltage,3,0.252445
time,Hardware,Voltage,Current
1621989350855,high-voltage,4,0.396555
time,Hardware,Voltage,Current
1621989350855,high-voltage,5,0.580002
time,Hardware,Voltage,Current
1621989350855,high-voltage,6,0.882354
time,Hardware,Voltage,Current
1621989350855,high-voltage,7,1.1525
time,Hardware,Voltage,Current
1621989350855,high-voltage,8,1.58095
time,Hardware,Voltage,Current
1621989350855,high-voltage,9,2.02725
time,Hardware,Voltage,Current
1621989350855,high-voltage,10,2.66881
time,Hardware,Voltage,Current
1621989350855,high-voltage,11,3.37587
time,Hardware,Voltage,Current
1621989350855,high-voltage,12,4.23915
time,Hardware,Voltage,Current
1621989350855,high-voltage,13,5.25902
time,Hardware,Voltage,Current
1621989350855,high-voltage,14,6.39583
time,Hardware,Voltage,Current
1621989350855,high-voltage,15,7.84632
time,Hardware,Voltage,Current
1621989350855,high-voltage,16,9.17351
time,Hardware,Voltage,Current
1621989350855,high-voltage,17,10.0001
