{
    "Data": [0.0, 0.0, 0.0, 0.0, 0.0, 0.0, 0.0, 0.0, 0.0, 0.0, 0.0, 0.0, 0.0, 0.0, 0.0, 0.0, 0.0, 0.0, 0.0, 0.0, 0.0, 0.0, 0.0, 0.0, 0.0, 0.0, 0.0, 0.0, 0.0, 0.0, 0.0, 0.0, 0.0, 0.0, 0.0, 0.0, 0.0, 0.0, 0.0, 0.0, 0.0, 0.0, 0.0, 0.0, 0.0, 0.0, 0.0, 0.0, 0.0, 0.0, 2.0, 2.0, 3.0, 2.0, 2.0, 7.0, 6.0, 3.0, 8.0, 7.0, 9.0, 4.0, 19.0, 12.0, 17.0, 19.0, 30.0, 35.0, 32.0, 35.0, 56.0, 56.0, 59.0, 65.0, 90.0, 129.0, 121.0, 135.0, 174.0, 204.0, 234.0, 265.0, 305.0, 386.0, 405.0, 468.0, 505.0, 586.0, 733.0, 774.0, 821.0, 954.0, 971.0, 1061.0, 1075.0, 1183.0, 1172.0, 1231.0, 1202.0, 1180.0, 1381.0, 1460.0, 1701.0, 1910.0, 2229.0, 2509.0, 2792.0, 2953.0, 3011.0, 2930.0, 2695.0, 2376.0, 1874.0, 1409.0, 1068.0, 793.0, 535.0, 366.0, 270.0, 182.0, 145.0, 102.0, 82.0, 41.0, 40.0, 37.0, 20.0, 35.0, 28.0, 27.0, 13.0, 23.0, 17.0, 13.0, 13.0, 9.0, 11.0, 8.0, 12.0, 9.0, 8.0, 7.0, 11.0, 6.0, 4.0, 12.0, 3.0, 5.0, 6.0, 11.0, 10.0, 9.0, 15.0, 4.0, 13.0, 16.0, 11.0, 7.0, 11.0, 21.0, 11.0, 18.0, 12.0, 20.0, 27.0, 31.0, 19.0, 23.0, 35.0, 38.0, 51.0, 62.0, 66.0, 62.0, 75.0, 88.0, 103.0, 109.0, 125.0, 129.0, 166.0, 174.0, 210.0, 209.0, 238.0, 258.0, 254.0, 285.0, 315.0, 297.0, 355.0, 348.0, 355.0, 448.0, 432.0, 391.0, 512.0, 418.0, 466.0, 513.0, 506.0, 520.0, 519.0, 504.0, 572.0, 527.0, 473.0, 507.0, 467.0, 475.0, 473.0, 411.0, 397.0, 366.0, 305.0, 369.0, 332.0, 260.0, 261.0, 271.0, 227.0, 285.0, 229.0, 198.0, 196.0, 178.0, 169.0, 191.0, 134.0, 132.0, 103.0, 102.0, 114.0, 70.0, 67.0, 56.0, 51.0, 56.0, 38.0, 46.0, 34.0, 44.0, 25.0, 31.0, 26.0, 26.0, 34.0, 28.0, 20.0, 16.0, 18.0, 13.0, 19.0, 18.0, 20.0, 14.0, 13.0, 8.0, 8.0, 4.0, 13.0, 7.0, 8.0, 8.0, 4.0, 6.0, 8.0, 6.0, 11.0, 6.0, 9.0, 7.0, 6.0, 6.0, 5.0, 4.0, 6.0, 3.0, 2.0, 6.0, 8.0, 1.0, 5.0, 4.0, 2.0, 5.0, 2.0, 5.0, 6.0, 0.0, 3.0, 2.0, 3.0, 8.0, 0.0, 2.0, 1.0, 3.0, 2.0, 0.0, 2.0, 4.0, 6.0, 1.0, 6.0, 4.0, 2.0, 1.0, 6.0, 1.0, 2.0, 1.0, 4.0, 1.0, 1.0, 2.0, 1.0, 3.0, 0.0, 1.0, 1.0, 3.0, 2.0, 4.0, 2.0, 1.0, 0.0, 0.0, 0.0, 0.0, 0.0, 0.0, 0.0, 0.0, 0.0, 0.0, 0.0, 0.0, 0.0, 0.0, 0.0, 0.0, 0.0, 0.0, 0.0, 0.0, 0.0, 0.0, 0.0, 0.0, 0.0, 0.0, 0.0, 0.0, 0.0, 0.0, 0.0, 0.0, 0.0, 0.0, 0.0, 0.0, 0.0, 0.0, 0.0, 0.0],
    "Name": "ThresholdDist-0",
    "Overflow": 0.0,
    "Type": "Histo1d",
    "Underflow": 0.0,
    "x": {
        "AxisTitle": "Threshold [e]",
        "Bins": 366,
        "High": 3655.0,
        "Low": -5.0
    },
    "y": {
        "AxisTitle": "Number of Pixels"
    },
    "z": {
        "AxisTitle": "z"
    }
}