time,Hardware,Voltage,Current
1623309473815,high-voltage,1,0.0588959
time,Hardware,Voltage,Current
1623309473815,high-voltage,2,0.0745348
time,Hardware,Voltage,Current
1623309473815,high-voltage,3,0.0872467
time,Hardware,Voltage,Current
1623309473815,high-voltage,4,0.0983815
time,Hardware,Voltage,Current
1623309473815,high-voltage,5,0.10904
time,Hardware,Voltage,Current
1623309473815,high-voltage,6,0.120368
time,Hardware,Voltage,Current
1623309473815,high-voltage,7,0.132016
time,Hardware,Voltage,Current
1623309473815,high-voltage,8,0.141429
time,Hardware,Voltage,Current
1623309473815,high-voltage,9,0.151679
time,Hardware,Voltage,Current
1623309473815,high-voltage,10,0.162459
time,Hardware,Voltage,Current
1623309473815,high-voltage,11,0.169414
time,Hardware,Voltage,Current
1623309473815,high-voltage,12,0.176915
time,Hardware,Voltage,Current
1623309473815,high-voltage,13,0.183168
time,Hardware,Voltage,Current
1623309473815,high-voltage,14,0.188418
time,Hardware,Voltage,Current
1623309473815,high-voltage,15,0.194545
time,Hardware,Voltage,Current
1623309473815,high-voltage,16,0.19841
time,Hardware,Voltage,Current
1623309473815,high-voltage,17,0.204064
time,Hardware,Voltage,Current
1623309473815,high-voltage,18,0.207912
time,Hardware,Voltage,Current
1623309473815,high-voltage,19,0.21259
time,Hardware,Voltage,Current
1623309473815,high-voltage,20,0.217822
time,Hardware,Voltage,Current
1623309473815,high-voltage,25,0.240349
time,Hardware,Voltage,Current
1623309473815,high-voltage,30,0.274198
time,Hardware,Voltage,Current
1623309473815,high-voltage,3.83002e-07,0.382733
time,Hardware,Voltage,Current
1623309473815,high-voltage,40,0.705031
time,Hardware,Voltage,Current
1623309473815,high-voltage,1.25408e-06,1.25416
time,Hardware,Voltage,Current
1623309473815,high-voltage,50,1.97133
time,Hardware,Voltage,Current
1623309473815,high-voltage,2.83939e-06,2.84097
time,Hardware,Voltage,Current
1623309473815,high-voltage,60,3.85607
time,Hardware,Voltage,Current
1623309473815,high-voltage,5.02726e-06,5.02962
time,Hardware,Voltage,Current
1623309473815,high-voltage,70,6.36621
time,Hardware,Voltage,Current
1623309473815,high-voltage,7.89107e-06,7.89288
time,Hardware,Voltage,Current
1623309473815,high-voltage,80,9.63092
time,Hardware,Voltage,Current
1623309473815,high-voltage,85,10
