time,Hardware,Voltage,Current
1626348348130,high-voltage,1,0.0105931
time,Hardware,Voltage,Current
1626348348130,high-voltage,2,0.0251208
time,Hardware,Voltage,Current
1626348348130,high-voltage,3,0.0325728
time,Hardware,Voltage,Current
1626348348130,high-voltage,4,0.0399589
time,Hardware,Voltage,Current
1626348348130,high-voltage,5,0.0446432
time,Hardware,Voltage,Current
1626348348130,high-voltage,6,0.0516521
time,Hardware,Voltage,Current
1626348348130,high-voltage,7,0.0584783
time,Hardware,Voltage,Current
1626348348130,high-voltage,8,0.06431
time,Hardware,Voltage,Current
1626348348130,high-voltage,9,0.0719329
time,Hardware,Voltage,Current
1626348348130,high-voltage,10,0.0775283
time,Hardware,Voltage,Current
1626348348130,high-voltage,11,0.0843993
time,Hardware,Voltage,Current
1626348348130,high-voltage,12,0.0893597
time,Hardware,Voltage,Current
1626348348130,high-voltage,13,0.09319
time,Hardware,Voltage,Current
1626348348130,high-voltage,14,0.0984197
time,Hardware,Voltage,Current
1626348348130,high-voltage,15,0.102177
time,Hardware,Voltage,Current
1626348348130,high-voltage,16,0.105694
time,Hardware,Voltage,Current
1626348348130,high-voltage,17,0.10802
time,Hardware,Voltage,Current
1626348348130,high-voltage,18,0.11204
time,Hardware,Voltage,Current
1626348348130,high-voltage,19,0.113953
time,Hardware,Voltage,Current
1626348348130,high-voltage,20,0.117475
time,Hardware,Voltage,Current
1626348348130,high-voltage,25,0.132928
time,Hardware,Voltage,Current
1626348348130,high-voltage,30,0.149773
time,Hardware,Voltage,Current
1626348348130,high-voltage,35,0.184126
time,Hardware,Voltage,Current
1626348348130,high-voltage,40,0.288961
time,Hardware,Voltage,Current
1626348348130,high-voltage,45,0.535774
time,Hardware,Voltage,Current
1626348348130,high-voltage,50,1.00632
time,Hardware,Voltage,Current
1626348348130,high-voltage,55,1.80951
time,Hardware,Voltage,Current
1626348348130,high-voltage,60,3.05331
time,Hardware,Voltage,Current
1626348348130,high-voltage,65,4.79431
time,Hardware,Voltage,Current
1626348348130,high-voltage,70,7.1013
time,Hardware,Voltage,Current
1626348348130,high-voltage,75,10
