{
    "Data": [[680.0, 175.0, 90.0, 54.0, 21.0, 17.0, 12.0, 11.0, 6.0, 10.0, 3.0, 2.0, 6.0, 7.0, 10.0, 5.0, 7.0, 1.0, 7.0, 6.0, 8.0, 6.0, 6.0, 7.0, 4.0, 4.0, 3.0, 2.0, 5.0, 1.0, 2.0, 2.0, 2.0, 2.0, 4.0, 6.0, 6.0, 5.0, 1.0, 0.0, 3.0, 4.0, 1.0, 3.0, 4.0, 2.0, 3.0, 5.0, 2.0], [1597.0, 529.0, 258.0, 136.0, 81.0, 61.0, 52.0, 41.0, 33.0, 19.0, 17.0, 14.0, 13.0, 9.0, 11.0, 12.0, 5.0, 7.0, 2.0, 8.0, 4.0, 4.0, 3.0, 6.0, 6.0, 6.0, 3.0, 12.0, 5.0, 6.0, 4.0, 7.0, 4.0, 8.0, 4.0, 6.0, 2.0, 3.0, 5.0, 4.0, 5.0, 5.0, 2.0, 3.0, 4.0, 9.0, 5.0, 9.0, 5.0], [2861.0, 1175.0, 651.0, 438.0, 258.0, 194.0, 167.0, 106.0, 88.0, 89.0, 47.0, 48.0, 49.0, 29.0, 28.0, 33.0, 24.0, 20.0, 17.0, 19.0, 11.0, 11.0, 17.0, 5.0, 11.0, 5.0, 14.0, 9.0, 9.0, 6.0, 4.0, 11.0, 7.0, 4.0, 6.0, 4.0, 9.0, 6.0, 7.0, 10.0, 5.0, 6.0, 9.0, 10.0, 13.0, 11.0, 6.0, 7.0, 17.0], [3816.0, 1984.0, 1246.0, 937.0, 620.0, 499.0, 437.0, 295.0, 260.0, 241.0, 177.0, 151.0, 148.0, 125.0, 94.0, 93.0, 67.0, 69.0, 61.0, 51.0, 51.0, 47.0, 53.0, 49.0, 23.0, 28.0, 30.0, 28.0, 19.0, 20.0, 21.0, 14.0, 15.0, 9.0, 13.0, 12.0, 12.0, 11.0, 13.0, 6.0, 13.0, 10.0, 12.0, 4.0, 11.0, 17.0, 13.0, 15.0, 27.0], [3857.0, 2313.0, 1672.0, 1351.0, 1098.0, 853.0, 734.0, 641.0, 550.0, 482.0, 432.0, 402.0, 355.0, 308.0, 289.0, 252.0, 183.0, 197.0, 181.0, 153.0, 166.0, 134.0, 117.0, 122.0, 119.0, 87.0, 75.0, 89.0, 82.0, 72.0, 74.0, 43.0, 46.0, 49.0, 45.0, 47.0, 32.0, 37.0, 29.0, 30.0, 31.0, 27.0, 27.0, 25.0, 13.0, 17.0, 20.0, 28.0, 37.0], [4270.0, 2177.0, 1596.0, 1408.0, 1167.0, 1062.0, 978.0, 885.0, 745.0, 789.0, 650.0, 656.0, 615.0, 588.0, 541.0, 452.0, 448.0, 427.0, 402.0, 420.0, 332.0, 343.0, 333.0, 295.0, 271.0, 250.0, 255.0, 238.0, 235.0, 192.0, 179.0, 172.0, 154.0, 139.0, 136.0, 132.0, 123.0, 124.0, 114.0, 103.0, 93.0, 101.0, 91.0, 87.0, 74.0, 74.0, 70.0, 60.0, 56.0], [6997.0, 3991.0, 2594.0, 1829.0, 1408.0, 1150.0, 975.0, 905.0, 870.0, 780.0, 709.0, 738.0, 668.0, 690.0, 624.0, 578.0, 643.0, 570.0, 559.0, 536.0, 529.0, 555.0, 524.0, 506.0, 468.0, 434.0, 469.0, 475.0, 480.0, 431.0, 392.0, 419.0, 408.0, 364.0, 384.0, 342.0, 335.0, 324.0, 333.0, 315.0, 306.0, 282.0, 247.0, 265.0, 272.0, 228.0, 215.0, 212.0, 224.0], [2438.0, 2571.0, 2615.0, 2481.0, 2355.0, 2243.0, 1997.0, 1829.0, 1628.0, 1567.0, 1360.0, 1242.0, 1077.0, 1043.0, 935.0, 893.0, 828.0, 756.0, 741.0, 690.0, 671.0, 670.0, 634.0, 676.0, 599.0, 608.0, 633.0, 633.0, 627.0, 549.0, 599.0, 591.0, 598.0, 564.0, 565.0, 600.0, 590.0, 600.0, 575.0, 645.0, 667.0, 614.0, 616.0, 637.0, 645.0, 653.0, 618.0, 661.0, 703.0], [271.0, 230.0, 302.0, 358.0, 437.0, 492.0, 577.0, 653.0, 760.0, 870.0, 872.0, 980.0, 966.0, 1085.0, 1166.0, 1139.0, 1196.0, 1187.0, 1205.0, 1220.0, 1316.0, 1268.0, 1290.0, 1250.0, 1231.0, 1204.0, 1193.0, 1194.0, 1060.0, 1043.0, 1004.0, 1092.0, 1065.0, 995.0, 1010.0, 987.0, 958.0, 1000.0, 952.0, 996.0, 1019.0, 1027.0, 1050.0, 1098.0, 1105.0, 1287.0, 1366.0, 1474.0, 1707.0], [189.0, 95.0, 78.0, 65.0, 53.0, 71.0, 53.0, 66.0, 78.0, 74.0, 77.0, 111.0, 97.0, 146.0, 159.0, 169.0, 216.0, 238.0, 261.0, 309.0, 324.0, 380.0, 423.0, 449.0, 510.0, 591.0, 672.0, 680.0, 789.0, 772.0, 929.0, 1056.0, 1114.0, 1208.0, 1313.0, 1369.0, 1485.0, 1611.0, 1777.0, 1812.0, 2040.0, 2081.0, 2180.0, 2307.0, 2463.0, 2648.0, 2871.0, 3178.0, 3799.0], [243.0, 89.0, 42.0, 36.0, 43.0, 24.0, 18.0, 37.0, 23.0, 24.0, 31.0, 36.0, 25.0, 34.0, 31.0, 32.0, 29.0, 46.0, 54.0, 48.0, 52.0, 46.0, 70.0, 65.0, 60.0, 84.0, 90.0, 125.0, 100.0, 161.0, 147.0, 162.0, 244.0, 227.0, 302.0, 358.0, 436.0, 494.0, 590.0, 752.0, 923.0, 1119.0, 1281.0, 1718.0, 2276.0, 2869.0, 4011.0, 5680.0, 8608.0], [335.0, 85.0, 53.0, 38.0, 35.0, 29.0, 20.0, 26.0, 17.0, 25.0, 12.0, 13.0, 20.0, 15.0, 15.0, 15.0, 18.0, 19.0, 18.0, 13.0, 23.0, 14.0, 28.0, 22.0, 30.0, 25.0, 28.0, 25.0, 31.0, 47.0, 41.0, 46.0, 48.0, 52.0, 69.0, 82.0, 96.0, 106.0, 119.0, 174.0, 207.0, 258.0, 307.0, 482.0, 677.0, 976.0, 1576.0, 2837.0, 7166.0], [649.0, 153.0, 66.0, 25.0, 20.0, 25.0, 19.0, 14.0, 17.0, 12.0, 15.0, 21.0, 14.0, 13.0, 20.0, 9.0, 15.0, 13.0, 14.0, 8.0, 8.0, 7.0, 12.0, 21.0, 15.0, 16.0, 8.0, 20.0, 16.0, 15.0, 16.0, 30.0, 20.0, 25.0, 18.0, 21.0, 30.0, 38.0, 37.0, 67.0, 61.0, 91.0, 109.0, 135.0, 177.0, 306.0, 497.0, 1018.0, 3155.0], [1208.0, 326.0, 117.0, 50.0, 27.0, 20.0, 14.0, 11.0, 10.0, 7.0, 5.0, 11.0, 12.0, 9.0, 7.0, 13.0, 9.0, 13.0, 12.0, 7.0, 12.0, 13.0, 5.0, 8.0, 11.0, 12.0, 7.0, 9.0, 11.0, 14.0, 7.0, 9.0, 16.0, 23.0, 18.0, 16.0, 19.0, 22.0, 25.0, 26.0, 28.0, 35.0, 30.0, 38.0, 62.0, 113.0, 188.0, 348.0, 1244.0], [2178.0, 688.0, 260.0, 104.0, 65.0, 34.0, 22.0, 23.0, 5.0, 13.0, 8.0, 7.0, 8.0, 4.0, 6.0, 2.0, 7.0, 9.0, 4.0, 8.0, 6.0, 9.0, 8.0, 6.0, 10.0, 15.0, 8.0, 8.0, 8.0, 9.0, 6.0, 13.0, 8.0, 7.0, 12.0, 15.0, 13.0, 10.0, 10.0, 23.0, 15.0, 26.0, 28.0, 18.0, 36.0, 52.0, 64.0, 132.0, 473.0], [3334.0, 1202.0, 582.0, 293.0, 160.0, 94.0, 52.0, 29.0, 33.0, 18.0, 13.0, 13.0, 9.0, 3.0, 11.0, 5.0, 9.0, 8.0, 6.0, 5.0, 5.0, 10.0, 7.0, 6.0, 5.0, 8.0, 10.0, 3.0, 8.0, 7.0, 5.0, 3.0, 7.0, 7.0, 3.0, 10.0, 5.0, 9.0, 17.0, 14.0, 14.0, 16.0, 16.0, 17.0, 24.0, 40.0, 39.0, 74.0, 247.0], [4238.0, 2084.0, 1185.0, 647.0, 348.0, 224.0, 168.0, 114.0, 77.0, 48.0, 26.0, 21.0, 20.0, 12.0, 12.0, 12.0, 10.0, 9.0, 12.0, 5.0, 3.0, 6.0, 4.0, 2.0, 5.0, 4.0, 6.0, 9.0, 6.0, 11.0, 6.0, 8.0, 7.0, 7.0, 5.0, 3.0, 9.0, 14.0, 6.0, 3.0, 8.0, 10.0, 9.0, 10.0, 25.0, 28.0, 30.0, 66.0, 124.0], [4696.0, 2844.0, 1766.0, 1148.0, 785.0, 516.0, 374.0, 256.0, 185.0, 138.0, 96.0, 64.0, 62.0, 44.0, 33.0, 24.0, 25.0, 18.0, 11.0, 14.0, 9.0, 16.0, 7.0, 10.0, 4.0, 5.0, 5.0, 4.0, 7.0, 3.0, 7.0, 7.0, 10.0, 4.0, 3.0, 6.0, 6.0, 9.0, 4.0, 8.0, 15.0, 7.0, 7.0, 15.0, 5.0, 15.0, 24.0, 33.0, 72.0], [4339.0, 3025.0, 2295.0, 1657.0, 1206.0, 965.0, 746.0, 546.0, 418.0, 337.0, 231.0, 212.0, 175.0, 147.0, 92.0, 77.0, 77.0, 39.0, 44.0, 49.0, 30.0, 31.0, 26.0, 16.0, 15.0, 10.0, 10.0, 7.0, 16.0, 6.0, 5.0, 13.0, 3.0, 3.0, 4.0, 5.0, 6.0, 5.0, 5.0, 7.0, 7.0, 5.0, 9.0, 8.0, 9.0, 11.0, 22.0, 25.0, 58.0], [3385.0, 2812.0, 2308.0, 1885.0, 1560.0, 1268.0, 1119.0, 945.0, 735.0, 664.0, 479.0, 441.0, 364.0, 321.0, 257.0, 195.0, 183.0, 146.0, 114.0, 112.0, 90.0, 69.0, 62.0, 60.0, 47.0, 33.0, 28.0, 34.0, 20.0, 20.0, 15.0, 6.0, 16.0, 10.0, 10.0, 6.0, 6.0, 7.0, 6.0, 7.0, 10.0, 4.0, 7.0, 9.0, 7.0, 8.0, 18.0, 20.0, 48.0], [2249.0, 2179.0, 1955.0, 1727.0, 1613.0, 1425.0, 1249.0, 1118.0, 1045.0, 872.0, 830.0, 752.0, 643.0, 569.0, 516.0, 442.0, 377.0, 331.0, 263.0, 245.0, 221.0, 168.0, 164.0, 152.0, 124.0, 105.0, 97.0, 78.0, 67.0, 55.0, 31.0, 40.0, 30.0, 28.0, 20.0, 13.0, 17.0, 15.0, 21.0, 11.0, 9.0, 10.0, 10.0, 11.0, 7.0, 9.0, 15.0, 10.0, 35.0], [1661.0, 1577.0, 1559.0, 1317.0, 1393.0, 1324.0, 1221.0, 1130.0, 1034.0, 996.0, 917.0, 886.0, 801.0, 726.0, 697.0, 642.0, 603.0, 482.0, 466.0, 394.0, 388.0, 368.0, 311.0, 305.0, 253.0, 235.0, 190.0, 157.0, 154.0, 125.0, 130.0, 95.0, 84.0, 76.0, 92.0, 71.0, 45.0, 35.0, 41.0, 26.0, 22.0, 16.0, 24.0, 15.0, 14.0, 11.0, 12.0, 13.0, 34.0], [988.0, 1043.0, 1018.0, 975.0, 914.0, 973.0, 1024.0, 919.0, 932.0, 953.0, 920.0, 881.0, 844.0, 842.0, 771.0, 737.0, 693.0, 682.0, 686.0, 583.0, 575.0, 515.0, 527.0, 475.0, 487.0, 394.0, 379.0, 323.0, 349.0, 274.0, 276.0, 260.0, 196.0, 211.0, 158.0, 135.0, 120.0, 130.0, 97.0, 90.0, 92.0, 68.0, 57.0, 37.0, 31.0, 33.0, 22.0, 23.0, 34.0], [565.0, 604.0, 645.0, 667.0, 675.0, 756.0, 751.0, 753.0, 735.0, 741.0, 774.0, 759.0, 750.0, 784.0, 766.0, 713.0, 735.0, 693.0, 683.0, 665.0, 648.0, 641.0, 646.0, 655.0, 594.0, 568.0, 558.0, 506.0, 493.0, 493.0, 449.0, 408.0, 379.0, 376.0, 324.0, 286.0, 289.0, 268.0, 241.0, 224.0, 215.0, 157.0, 150.0, 120.0, 113.0, 68.0, 68.0, 60.0, 52.0], [452.0, 452.0, 448.0, 481.0, 463.0, 473.0, 493.0, 459.0, 544.0, 529.0, 545.0, 568.0, 591.0, 556.0, 585.0, 668.0, 619.0, 625.0, 621.0, 650.0, 645.0, 664.0, 638.0, 631.0, 650.0, 635.0, 641.0, 616.0, 600.0, 579.0, 589.0, 569.0, 573.0, 555.0, 547.0, 480.0, 508.0, 425.0, 442.0, 375.0, 368.0, 333.0, 337.0, 272.0, 245.0, 232.0, 183.0, 151.0, 113.0], [365.0, 300.0, 296.0, 313.0, 320.0, 350.0, 334.0, 350.0, 365.0, 375.0, 382.0, 388.0, 388.0, 420.0, 427.0, 414.0, 436.0, 485.0, 521.0, 470.0, 534.0, 510.0, 582.0, 532.0, 547.0, 580.0, 587.0, 644.0, 635.0, 592.0, 611.0, 608.0, 643.0, 654.0, 672.0, 662.0, 627.0, 638.0, 644.0, 639.0, 619.0, 588.0, 538.0, 530.0, 511.0, 441.0, 418.0, 364.0, 330.0], [266.0, 169.0, 205.0, 262.0, 267.0, 296.0, 294.0, 276.0, 274.0, 258.0, 283.0, 276.0, 279.0, 272.0, 307.0, 330.0, 327.0, 324.0, 328.0, 318.0, 363.0, 370.0, 398.0, 412.0, 391.0, 445.0, 477.0, 486.0, 504.0, 551.0, 609.0, 589.0, 609.0, 633.0, 625.0, 723.0, 721.0, 715.0, 752.0, 805.0, 776.0, 823.0, 831.0, 811.0, 845.0, 821.0, 782.0, 747.0, 714.0], [276.0, 210.0, 234.0, 207.0, 210.0, 199.0, 206.0, 233.0, 174.0, 171.0, 188.0, 184.0, 160.0, 169.0, 186.0, 206.0, 230.0, 232.0, 240.0, 233.0, 263.0, 265.0, 322.0, 277.0, 297.0, 318.0, 337.0, 357.0, 414.0, 450.0, 455.0, 451.0, 489.0, 568.0, 530.0, 615.0, 641.0, 700.0, 754.0, 776.0, 849.0, 911.0, 973.0, 1055.0, 1043.0, 1168.0, 1178.0, 1181.0, 1329.0], [222.0, 185.0, 151.0, 167.0, 189.0, 157.0, 106.0, 136.0, 124.0, 124.0, 113.0, 138.0, 173.0, 157.0, 226.0, 225.0, 194.0, 191.0, 217.0, 161.0, 157.0, 194.0, 214.0, 199.0, 199.0, 198.0, 251.0, 268.0, 250.0, 303.0, 266.0, 290.0, 344.0, 395.0, 452.0, 449.0, 478.0, 542.0, 608.0, 697.0, 733.0, 879.0, 962.0, 1098.0, 1252.0, 1383.0, 1512.0, 1784.0, 2020.0], [215.0, 268.0, 195.0, 165.0, 118.0, 82.0, 98.0, 100.0, 103.0, 108.0, 154.0, 132.0, 168.0, 118.0, 146.0, 161.0, 156.0, 144.0, 126.0, 161.0, 145.0, 124.0, 146.0, 123.0, 128.0, 140.0, 140.0, 116.0, 124.0, 192.0, 197.0, 195.0, 215.0, 221.0, 257.0, 324.0, 334.0, 357.0, 428.0, 495.0, 545.0, 663.0, 789.0, 949.0, 1145.0, 1367.0, 1715.0, 2084.0, 2907.0], [165.0, 118.0, 134.0, 134.0, 124.0, 154.0, 167.0, 160.0, 139.0, 158.0, 149.0, 151.0, 148.0, 84.0, 88.0, 117.0, 80.0, 117.0, 115.0, 153.0, 154.0, 92.0, 99.0, 109.0, 128.0, 83.0, 128.0, 142.0, 133.0, 134.0, 122.0, 144.0, 164.0, 152.0, 211.0, 221.0, 246.0, 257.0, 297.0, 303.0, 387.0, 432.0, 529.0, 628.0, 818.0, 1025.0, 1465.0, 2086.0, 3339.0], [161.0, 128.0, 156.0, 152.0, 134.0, 199.0, 155.0, 124.0, 125.0, 132.0, 161.0, 167.0, 115.0, 195.0, 165.0, 140.0, 153.0, 100.0, 93.0, 89.0, 93.0, 96.0, 114.0, 86.0, 79.0, 121.0, 84.0, 72.0, 90.0, 68.0, 87.0, 118.0, 151.0, 111.0, 140.0, 120.0, 124.0, 141.0, 189.0, 167.0, 230.0, 298.0, 305.0, 425.0, 567.0, 775.0, 1131.0, 1799.0, 3174.0], [192.0, 179.0, 135.0, 72.0, 193.0, 123.0, 81.0, 61.0, 188.0, 157.0, 199.0, 183.0, 165.0, 121.0, 122.0, 83.0, 115.0, 113.0, 107.0, 105.0, 83.0, 147.0, 95.0, 92.0, 119.0, 98.0, 70.0, 93.0, 103.0, 77.0, 152.0, 95.0, 101.0, 137.0, 96.0, 95.0, 128.0, 140.0, 93.0, 127.0, 149.0, 166.0, 239.0, 313.0, 401.0, 462.0, 731.0, 1242.0, 2717.0], [133.0, 104.0, 128.0, 77.0, 88.0, 122.0, 115.0, 155.0, 133.0, 109.0, 78.0, 149.0, 147.0, 153.0, 131.0, 87.0, 101.0, 175.0, 223.0, 55.0, 35.0, 45.0, 107.0, 122.0, 60.0, 107.0, 77.0, 113.0, 98.0, 78.0, 100.0, 73.0, 74.0, 72.0, 64.0, 37.0, 70.0, 51.0, 35.0, 99.0, 120.0, 167.0, 203.0, 185.0, 208.0, 260.0, 516.0, 872.0, 2144.0], [186.0, 109.0, 160.0, 166.0, 139.0, 130.0, 69.0, 88.0, 118.0, 80.0, 97.0, 95.0, 115.0, 122.0, 141.0, 198.0, 189.0, 151.0, 118.0, 77.0, 108.0, 127.0, 141.0, 99.0, 79.0, 71.0, 103.0, 87.0, 104.0, 137.0, 70.0, 28.0, 53.0, 30.0, 54.0, 102.0, 140.0, 96.0, 122.0, 53.0, 67.0, 145.0, 147.0, 119.0, 223.0, 274.0, 324.0, 544.0, 1420.0], [123.0, 224.0, 165.0, 149.0, 106.0, 159.0, 77.0, 110.0, 95.0, 109.0, 75.0, 72.0, 91.0, 44.0, 85.0, 73.0, 121.0, 132.0, 153.0, 109.0, 31.0, 84.0, 108.0, 162.0, 117.0, 140.0, 39.0, 36.0, 95.0, 65.0, 79.0, 57.0, 108.0, 32.0, 56.0, 103.0, 131.0, 87.0, 90.0, 79.0, 148.0, 108.0, 61.0, 76.0, 118.0, 92.0, 153.0, 297.0, 972.0], [135.0, 101.0, 99.0, 36.0, 71.0, 115.0, 122.0, 118.0, 116.0, 85.0, 94.0, 74.0, 142.0, 64.0, 84.0, 140.0, 121.0, 143.0, 114.0, 71.0, 167.0, 103.0, 101.0, 96.0, 113.0, 95.0, 131.0, 124.0, 125.0, 36.0, 151.0, 78.0, 98.0, 36.0, 59.0, 88.0, 26.0, 9.0, 45.0, 69.0, 17.0, 49.0, 53.0, 125.0, 47.0, 47.0, 122.0, 191.0, 519.0], [141.0, 94.0, 37.0, 77.0, 160.0, 127.0, 80.0, 114.0, 190.0, 199.0, 119.0, 33.0, 104.0, 40.0, 92.0, 65.0, 87.0, 84.0, 73.0, 107.0, 107.0, 83.0, 59.0, 120.0, 22.0, 51.0, 91.0, 99.0, 115.0, 116.0, 85.0, 52.0, 56.0, 46.0, 88.0, 77.0, 87.0, 95.0, 32.0, 22.0, 45.0, 8.0, 66.0, 50.0, 32.0, 69.0, 135.0, 227.0, 350.0], [97.0, 68.0, 167.0, 113.0, 86.0, 42.0, 33.0, 102.0, 104.0, 56.0, 68.0, 97.0, 88.0, 61.0, 67.0, 104.0, 59.0, 76.0, 134.0, 73.0, 70.0, 66.0, 77.0, 23.0, 65.0, 58.0, 143.0, 129.0, 73.0, 92.0, 100.0, 110.0, 25.0, 25.0, 108.0, 84.0, 25.0, 62.0, 60.0, 127.0, 108.0, 66.0, 35.0, 48.0, 49.0, 25.0, 120.0, 98.0, 203.0], [122.0, 68.0, 52.0, 67.0, 124.0, 96.0, 44.0, 52.0, 107.0, 43.0, 41.0, 54.0, 82.0, 120.0, 121.0, 108.0, 102.0, 70.0, 31.0, 41.0, 37.0, 50.0, 97.0, 94.0, 123.0, 28.0, 115.0, 22.0, 77.0, 46.0, 92.0, 60.0, 34.0, 56.0, 86.0, 81.0, 29.0, 62.0, 89.0, 128.0, 112.0, 127.0, 105.0, 23.0, 39.0, 86.0, 69.0, 61.0, 134.0], [82.0, 50.0, 19.0, 32.0, 135.0, 67.0, 92.0, 75.0, 69.0, 47.0, 105.0, 15.0, 53.0, 68.0, 20.0, 64.0, 41.0, 76.0, 107.0, 52.0, 40.0, 37.0, 67.0, 142.0, 62.0, 53.0, 60.0, 68.0, 79.0, 66.0, 65.0, 29.0, 97.0, 59.0, 34.0, 29.0, 58.0, 24.0, 33.0, 36.0, 95.0, 56.0, 64.0, 91.0, 62.0, 16.0, 101.0, 50.0, 97.0], [75.0, 52.0, 115.0, 85.0, 62.0, 39.0, 30.0, 89.0, 22.0, 41.0, 102.0, 19.0, 83.0, 60.0, 45.0, 62.0, 19.0, 69.0, 84.0, 68.0, 19.0, 45.0, 58.0, 102.0, 94.0, 89.0, 19.0, 79.0, 32.0, 37.0, 91.0, 88.0, 73.0, 66.0, 51.0, 67.0, 23.0, 42.0, 54.0, 51.0, 62.0, 42.0, 24.0, 12.0, 48.0, 95.0, 60.0, 18.0, 133.0], [75.0, 64.0, 26.0, 52.0, 25.0, 34.0, 36.0, 54.0, 32.0, 1.0, 11.0, 56.0, 9.0, 52.0, 50.0, 61.0, 71.0, 27.0, 29.0, 43.0, 46.0, 62.0, 25.0, 77.0, 47.0, 36.0, 44.0, 9.0, 27.0, 8.0, 19.0, 1.0, 1.0, 34.0, 38.0, 43.0, 53.0, 79.0, 89.0, 43.0, 20.0, 58.0, 27.0, 3.0, 21.0, 52.0, 27.0, 27.0, 54.0], [50.0, 50.0, 36.0, 84.0, 40.0, 89.0, 15.0, 1.0, 48.0, 0.0, 2.0, 66.0, 29.0, 0.0, 18.0, 40.0, 84.0, 90.0, 37.0, 46.0, 65.0, 29.0, 25.0, 30.0, 44.0, 69.0, 7.0, 25.0, 44.0, 42.0, 55.0, 16.0, 22.0, 44.0, 42.0, 47.0, 55.0, 35.0, 41.0, 3.0, 48.0, 23.0, 48.0, 44.0, 23.0, 10.0, 41.0, 26.0, 69.0], [66.0, 31.0, 46.0, 7.0, 5.0, 20.0, 9.0, 1.0, 62.0, 57.0, 1.0, 43.0, 51.0, 30.0, 0.0, 0.0, 2.0, 24.0, 26.0, 0.0, 2.0, 2.0, 21.0, 4.0, 4.0, 17.0, 16.0, 32.0, 38.0, 40.0, 46.0, 36.0, 25.0, 1.0, 60.0, 31.0, 7.0, 2.0, 22.0, 14.0, 14.0, 1.0, 0.0, 1.0, 11.0, 15.0, 1.0, 21.0, 73.0], [42.0, 30.0, 39.0, 24.0, 28.0, 21.0, 35.0, 48.0, 41.0, 0.0, 0.0, 0.0, 12.0, 37.0, 25.0, 8.0, 41.0, 29.0, 62.0, 8.0, 44.0, 7.0, 3.0, 1.0, 0.0, 1.0, 2.0, 46.0, 5.0, 14.0, 14.0, 13.0, 13.0, 21.0, 67.0, 10.0, 0.0, 0.0, 17.0, 15.0, 44.0, 12.0, 21.0, 18.0, 24.0, 3.0, 19.0, 9.0, 26.0], [43.0, 34.0, 63.0, 68.0, 26.0, 26.0, 47.0, 43.0, 26.0, 6.0, 0.0, 2.0, 0.0, 14.0, 11.0, 21.0, 4.0, 21.0, 4.0, 26.0, 28.0, 43.0, 4.0, 11.0, 18.0, 2.0, 2.0, 23.0, 6.0, 11.0, 14.0, 1.0, 24.0, 40.0, 18.0, 28.0, 13.0, 0.0, 1.0, 19.0, 7.0, 22.0, 9.0, 20.0, 44.0, 10.0, 21.0, 26.0, 3.0], [69.0, 19.0, 29.0, 13.0, 25.0, 1.0, 25.0, 41.0, 8.0, 0.0, 0.0, 29.0, 8.0, 21.0, 4.0, 43.0, 32.0, 24.0, 14.0, 11.0, 24.0, 4.0, 1.0, 2.0, 2.0, 3.0, 8.0, 40.0, 5.0, 0.0, 13.0, 47.0, 27.0, 26.0, 10.0, 0.0, 1.0, 0.0, 1.0, 40.0, 31.0, 4.0, 8.0, 19.0, 22.0, 4.0, 15.0, 35.0, 37.0], [25.0, 28.0, 27.0, 16.0, 20.0, 41.0, 28.0, 0.0, 0.0, 10.0, 14.0, 0.0, 0.0, 0.0, 37.0, 13.0, 17.0, 11.0, 1.0, 8.0, 29.0, 18.0, 16.0, 27.0, 6.0, 2.0, 1.0, 0.0, 1.0, 16.0, 12.0, 1.0, 0.0, 18.0, 33.0, 23.0, 20.0, 5.0, 4.0, 22.0, 3.0, 1.0, 49.0, 24.0, 0.0, 0.0, 2.0, 1.0, 24.0], [34.0, 63.0, 7.0, 22.0, 22.0, 12.0, 2.0, 1.0, 1.0, 0.0, 0.0, 34.0, 14.0, 1.0, 1.0, 0.0, 1.0, 18.0, 8.0, 1.0, 2.0, 33.0, 9.0, 20.0, 27.0, 2.0, 67.0, 33.0, 1.0, 0.0, 0.0, 1.0, 24.0, 1.0, 3.0, 0.0, 2.0, 0.0, 0.0, 1.0, 16.0, 10.0, 0.0, 0.0, 0.0, 0.0, 1.0, 19.0, 8.0], [31.0, 14.0, 8.0, 53.0, 16.0, 3.0, 1.0, 0.0, 0.0, 0.0, 0.0, 0.0, 21.0, 5.0, 3.0, 43.0, 4.0, 1.0, 0.0, 1.0, 1.0, 2.0, 2.0, 2.0, 0.0, 3.0, 3.0, 1.0, 2.0, 0.0, 0.0, 2.0, 1.0, 0.0, 1.0, 0.0, 0.0, 0.0, 0.0, 12.0, 12.0, 0.0, 0.0, 19.0, 8.0, 1.0, 0.0, 18.0, 13.0]],
    "Name": "sCurve-0",
    "Overflow": 2533570.0,
    "Type": "Histo2d",
    "Underflow": 0.0,
    "x": {
        "AxisTitle": "Vcal",
        "Bins": 51,
        "High": 302.5,
        "Low": 47.5
    },
    "y": {
        "AxisTitle": "Occupancy",
        "Bins": 49,
        "High": 49.5,
        "Low": 0.5
    },
    "z": {
        "AxisTitle": "Number of pixels"
    }
}