{
    "Data": [8.0, 9.0, 11.0, 4.0, 5.0, 3.0, 8.0, 26.0, 81.0, 269.0, 712.0, 1596.0, 2902.0, 4116.0, 4709.0, 4377.0, 3340.0, 2600.0, 2431.0, 2881.0, 3684.0, 4297.0, 4715.0, 4451.0, 3931.0, 3169.0, 2392.0, 1806.0, 1541.0, 1257.0, 1184.0, 1100.0, 1092.0, 1007.0, 981.0, 1004.0, 996.0, 909.0, 830.0, 784.0, 752.0, 671.0, 545.0, 491.0, 428.0, 365.0, 297.0, 229.0, 181.0, 185.0, 145.0, 121.0, 100.0, 81.0, 64.0, 45.0, 41.0, 31.0, 36.0, 26.0, 26.0, 19.0, 16.0, 11.0, 10.0, 17.0, 11.0, 14.0, 6.0],
    "Name": "NoiseDist-0",
    "Overflow": 88.0,
    "Type": "Histo1d",
    "Underflow": 0.0,
    "x": {
        "AxisTitle": "Noise [e]",
        "Bins": 69,
        "High": 346.0,
        "Low": -2.0
    },
    "y": {
        "AxisTitle": "Number of Pixels"
    },
    "z": {
        "AxisTitle": "z"
    }
}