time,Hardware,Voltage,Current
1625767070322,high-voltage-3,1,0.319967
time,Hardware,Voltage,Current
1625767070322,high-voltage-3,2,0.33532
time,Hardware,Voltage,Current
1625767070322,high-voltage-3,3,0.351988
time,Hardware,Voltage,Current
1625767070322,high-voltage-3,4,0.366919
time,Hardware,Voltage,Current
1625767070322,high-voltage-3,5,0.375786
time,Hardware,Voltage,Current
1625767070322,high-voltage-3,6,0.385129
time,Hardware,Voltage,Current
1625767070322,high-voltage-3,7,0.39613
time,Hardware,Voltage,Current
1625767070322,high-voltage-3,8,0.40798
time,Hardware,Voltage,Current
1625767070322,high-voltage-3,9,0.418556
time,Hardware,Voltage,Current
1625767070322,high-voltage-3,10,0.429125
time,Hardware,Voltage,Current
1625767070322,high-voltage-3,11,0.440233
time,Hardware,Voltage,Current
1625767070322,high-voltage-3,12,0.452626
time,Hardware,Voltage,Current
1625767070322,high-voltage-3,13,0.461769
time,Hardware,Voltage,Current
1625767070322,high-voltage-3,14,0.470996
time,Hardware,Voltage,Current
1625767070322,high-voltage-3,15,0.4785
time,Hardware,Voltage,Current
1625767070322,high-voltage-3,16,0.48663
time,Hardware,Voltage,Current
1625767070322,high-voltage-3,17,0.494617
time,Hardware,Voltage,Current
1625767070322,high-voltage-3,18,0.502525
time,Hardware,Voltage,Current
1625767070322,high-voltage-3,19,0.508656
time,Hardware,Voltage,Current
1625767070322,high-voltage-3,20,0.515094
time,Hardware,Voltage,Current
1625767070322,high-voltage-3,25,0.544827
time,Hardware,Voltage,Current
1625767070322,high-voltage-3,30,0.573624
time,Hardware,Voltage,Current
1625767070322,high-voltage-3,35,0.599791
time,Hardware,Voltage,Current
1625767070322,high-voltage-3,40,0.623019
time,Hardware,Voltage,Current
1625767070322,high-voltage-3,45,0.64576
time,Hardware,Voltage,Current
1625767070322,high-voltage-3,50,0.669103
time,Hardware,Voltage,Current
1625767070322,high-voltage-3,55,0.69168
time,Hardware,Voltage,Current
1625767070322,high-voltage-3,60,0.71453
time,Hardware,Voltage,Current
1625767070322,high-voltage-3,65,0.733756
time,Hardware,Voltage,Current
1625767070322,high-voltage-3,70,0.755964
time,Hardware,Voltage,Current
1625767070322,high-voltage-3,75,0.77656
time,Hardware,Voltage,Current
1625767070322,high-voltage-3,80,0.796717
time,Hardware,Voltage,Current
1625767070322,high-voltage-3,85,0.816657
time,Hardware,Voltage,Current
1625767070322,high-voltage-3,90,0.835208
time,Hardware,Voltage,Current
1625767070322,high-voltage-3,95,0.852538
time,Hardware,Voltage,Current
1625767070322,high-voltage-3,100,0.869773
