{
    "Data": [0.0, 0.0, 0.0, 0.0, 0.0, 0.0, 0.0, 0.0, 0.0, 0.0, 0.0, 0.0, 0.0, 0.0, 10.0, 2.0, 0.0, 22.0, 227.0, 67.0, 26.0, 877.0, 3384.0, 1139.0, 372.0, 1858.0, 3800.0, 1639.0, 572.0, 1534.0, 2351.0, 1288.0, 465.0, 585.0, 792.0, 601.0, 480.0, 1337.0, 2250.0, 1587.0, 778.0, 1664.0, 3306.0, 3783.0, 1891.0, 1634.0, 2886.0, 3661.0, 3058.0, 1919.0, 1980.0, 2344.0, 2737.0, 1737.0, 1227.0, 1154.0, 1166.0, 1299.0, 905.0, 804.0, 792.0, 762.0, 648.0, 502.0, 495.0, 448.0, 448.0, 334.0, 346.0, 357.0, 322.0, 285.0, 278.0, 224.0, 173.0, 183.0, 160.0, 210.0, 163.0, 144.0, 156.0, 113.0, 102.0, 82.0, 99.0, 103.0, 77.0, 84.0, 56.0, 68.0, 43.0, 51.0, 45.0, 41.0, 54.0, 44.0, 35.0, 27.0, 33.0, 18.0, 33.0, 28.0, 22.0, 19.0, 18.0, 22.0, 23.0, 24.0, 20.0, 16.0, 19.0, 12.0, 7.0, 9.0, 10.0, 16.0, 12.0, 15.0, 18.0, 11.0, 9.0, 18.0, 11.0, 5.0, 5.0, 4.0, 6.0, 4.0, 10.0, 17.0, 10.0, 4.0, 8.0, 7.0, 4.0, 11.0, 3.0, 6.0, 5.0, 2.0, 6.0, 6.0, 7.0, 8.0, 2.0, 5.0, 1.0, 3.0, 3.0, 6.0, 4.0, 2.0, 2.0, 0.0, 1.0, 5.0, 5.0, 2.0, 2.0, 4.0, 3.0, 5.0, 2.0, 2.0, 3.0, 2.0, 1.0, 1.0, 3.0, 6.0, 4.0, 0.0, 2.0, 6.0, 3.0, 1.0, 4.0, 3.0, 1.0, 4.0, 3.0, 2.0, 2.0, 2.0, 2.0, 0.0, 0.0, 3.0, 2.0, 1.0, 2.0, 2.0, 3.0, 4.0, 2.0, 4.0, 6.0, 3.0, 4.0, 6.0, 0.0],
    "Name": "TimePerFitDist-0",
    "Overflow": 156.0,
    "Type": "Histo1d",
    "Underflow": 0.0,
    "x": {
        "AxisTitle": "Fit Time [us]",
        "Bins": 201,
        "High": 401.0,
        "Low": -1.0
    },
    "y": {
        "AxisTitle": "Number of Pixels"
    },
    "z": {
        "AxisTitle": "z"
    }
}