{
    "Data": [0.0, 0.0, 0.0, 0.0, 0.0, 0.0, 0.0, 0.0, 0.0, 0.0, 0.0, 0.0, 0.0, 0.0, 0.0, 0.0, 1.0, 3.0, 4.0, 6.0, 3.0, 19.0, 15.0, 19.0, 44.0, 0.0, 3.0, 43.0, 50.0, 49.0, 4.0, 50.0, 17.0, 36.0, 18.0, 50.0, 24.0, 47.0, 35.0, 9.0, 36.0, 15.0, 8.0, 14.0, 0.0, 14.0, 48.0, 41.0, 8.0, 50.0, 50.0],
    "Name": "Scurve-50-96",
    "Overflow": 0.0,
    "Type": "Histo1d",
    "Underflow": 0.0,
    "x": {
        "AxisTitle": "Vcal",
        "Bins": 51,
        "High": 302.5,
        "Low": 47.5
    },
    "y": {
        "AxisTitle": "Occupancy"
    },
    "z": {
        "AxisTitle": "z"
    }
}