{
    "Data": [[358.0, 126.0, 59.0, 26.0, 18.0, 15.0, 6.0, 13.0, 16.0, 6.0, 9.0, 6.0, 5.0, 3.0, 4.0, 5.0, 10.0, 5.0, 7.0, 5.0, 3.0, 8.0, 2.0, 6.0, 5.0, 1.0, 3.0, 5.0, 4.0, 4.0, 4.0, 7.0, 8.0, 8.0, 9.0, 8.0, 6.0, 11.0, 5.0, 5.0, 8.0, 3.0, 6.0, 3.0, 3.0, 8.0, 4.0, 9.0, 8.0], [635.0, 197.0, 101.0, 68.0, 44.0, 33.0, 23.0, 22.0, 17.0, 18.0, 9.0, 5.0, 3.0, 7.0, 7.0, 3.0, 4.0, 9.0, 7.0, 9.0, 7.0, 5.0, 2.0, 9.0, 5.0, 7.0, 6.0, 7.0, 5.0, 2.0, 1.0, 4.0, 4.0, 3.0, 4.0, 4.0, 5.0, 5.0, 6.0, 6.0, 4.0, 8.0, 4.0, 4.0, 9.0, 8.0, 16.0, 16.0, 16.0], [1273.0, 406.0, 183.0, 118.0, 88.0, 54.0, 42.0, 33.0, 42.0, 17.0, 19.0, 22.0, 25.0, 23.0, 19.0, 14.0, 14.0, 12.0, 7.0, 6.0, 12.0, 4.0, 5.0, 6.0, 7.0, 11.0, 4.0, 4.0, 5.0, 6.0, 3.0, 7.0, 3.0, 8.0, 6.0, 2.0, 3.0, 4.0, 7.0, 3.0, 4.0, 5.0, 11.0, 7.0, 4.0, 4.0, 10.0, 23.0, 26.0], [2360.0, 869.0, 429.0, 305.0, 187.0, 140.0, 96.0, 81.0, 66.0, 47.0, 58.0, 32.0, 35.0, 37.0, 17.0, 30.0, 25.0, 20.0, 13.0, 15.0, 13.0, 17.0, 14.0, 10.0, 14.0, 9.0, 15.0, 8.0, 11.0, 14.0, 8.0, 15.0, 14.0, 8.0, 4.0, 5.0, 8.0, 5.0, 6.0, 8.0, 8.0, 3.0, 5.0, 3.0, 13.0, 8.0, 15.0, 17.0, 25.0], [3952.0, 1621.0, 994.0, 578.0, 423.0, 340.0, 235.0, 215.0, 179.0, 131.0, 116.0, 110.0, 94.0, 75.0, 53.0, 59.0, 58.0, 37.0, 33.0, 41.0, 41.0, 21.0, 33.0, 26.0, 26.0, 27.0, 13.0, 18.0, 21.0, 6.0, 17.0, 9.0, 18.0, 16.0, 12.0, 14.0, 17.0, 15.0, 19.0, 11.0, 13.0, 10.0, 17.0, 16.0, 12.0, 12.0, 18.0, 20.0, 40.0], [7201.0, 3065.0, 1742.0, 1152.0, 861.0, 665.0, 524.0, 432.0, 362.0, 326.0, 299.0, 229.0, 207.0, 186.0, 148.0, 144.0, 129.0, 103.0, 95.0, 88.0, 79.0, 81.0, 60.0, 62.0, 46.0, 60.0, 44.0, 52.0, 46.0, 36.0, 54.0, 38.0, 38.0, 23.0, 20.0, 29.0, 21.0, 29.0, 21.0, 26.0, 23.0, 21.0, 24.0, 29.0, 23.0, 20.0, 20.0, 42.0, 47.0], [8951.0, 5933.0, 4172.0, 3115.0, 2280.0, 1720.0, 1341.0, 1117.0, 906.0, 716.0, 646.0, 545.0, 462.0, 416.0, 383.0, 348.0, 306.0, 277.0, 256.0, 240.0, 186.0, 202.0, 188.0, 146.0, 150.0, 146.0, 137.0, 142.0, 113.0, 119.0, 93.0, 88.0, 76.0, 72.0, 76.0, 69.0, 69.0, 65.0, 66.0, 61.0, 46.0, 48.0, 38.0, 54.0, 49.0, 43.0, 47.0, 72.0, 77.0], [3411.0, 3295.0, 3173.0, 2930.0, 2802.0, 2722.0, 2569.0, 2404.0, 2173.0, 2103.0, 1789.0, 1741.0, 1557.0, 1431.0, 1210.0, 1228.0, 1051.0, 936.0, 868.0, 782.0, 737.0, 610.0, 565.0, 508.0, 481.0, 399.0, 437.0, 352.0, 330.0, 282.0, 279.0, 275.0, 226.0, 219.0, 208.0, 201.0, 177.0, 162.0, 129.0, 129.0, 136.0, 140.0, 119.0, 135.0, 122.0, 103.0, 106.0, 118.0, 147.0], [1050.0, 1030.0, 1022.0, 1008.0, 1036.0, 1078.0, 1049.0, 1096.0, 1057.0, 1209.0, 1239.0, 1237.0, 1226.0, 1345.0, 1328.0, 1337.0, 1392.0, 1377.0, 1426.0, 1407.0, 1404.0, 1462.0, 1431.0, 1432.0, 1470.0, 1370.0, 1298.0, 1385.0, 1228.0, 1187.0, 1144.0, 1140.0, 1079.0, 1030.0, 903.0, 865.0, 810.0, 717.0, 721.0, 616.0, 590.0, 544.0, 449.0, 437.0, 400.0, 362.0, 323.0, 311.0, 310.0], [471.0, 401.0, 377.0, 363.0, 386.0, 376.0, 398.0, 429.0, 431.0, 492.0, 496.0, 446.0, 475.0, 486.0, 525.0, 552.0, 568.0, 623.0, 628.0, 575.0, 652.0, 661.0, 736.0, 752.0, 809.0, 870.0, 925.0, 880.0, 1004.0, 1083.0, 1126.0, 1208.0, 1279.0, 1310.0, 1421.0, 1485.0, 1584.0, 1699.0, 1737.0, 1823.0, 2005.0, 1979.0, 2041.0, 2031.0, 2040.0, 2001.0, 1938.0, 1846.0, 1653.0], [266.0, 205.0, 151.0, 157.0, 155.0, 177.0, 141.0, 155.0, 180.0, 185.0, 202.0, 225.0, 247.0, 232.0, 238.0, 264.0, 315.0, 310.0, 313.0, 295.0, 302.0, 329.0, 346.0, 349.0, 362.0, 429.0, 442.0, 485.0, 551.0, 518.0, 526.0, 593.0, 582.0, 648.0, 699.0, 790.0, 830.0, 932.0, 981.0, 1013.0, 1295.0, 1408.0, 1617.0, 1923.0, 2314.0, 2860.0, 3682.0, 4877.0, 6544.0], [239.0, 134.0, 72.0, 93.0, 68.0, 73.0, 52.0, 67.0, 62.0, 74.0, 87.0, 71.0, 96.0, 96.0, 110.0, 104.0, 111.0, 133.0, 126.0, 162.0, 160.0, 153.0, 193.0, 208.0, 213.0, 183.0, 240.0, 253.0, 277.0, 277.0, 324.0, 309.0, 377.0, 375.0, 433.0, 438.0, 495.0, 536.0, 624.0, 694.0, 765.0, 819.0, 1037.0, 1178.0, 1371.0, 1728.0, 2343.0, 3555.0, 6909.0], [223.0, 111.0, 71.0, 50.0, 43.0, 32.0, 32.0, 31.0, 37.0, 44.0, 27.0, 32.0, 41.0, 60.0, 48.0, 41.0, 58.0, 54.0, 50.0, 60.0, 51.0, 55.0, 54.0, 80.0, 76.0, 97.0, 110.0, 111.0, 115.0, 131.0, 137.0, 157.0, 159.0, 200.0, 216.0, 258.0, 270.0, 336.0, 352.0, 446.0, 458.0, 533.0, 603.0, 801.0, 952.0, 1192.0, 1669.0, 2453.0, 4820.0], [236.0, 81.0, 56.0, 39.0, 31.0, 32.0, 36.0, 25.0, 24.0, 33.0, 32.0, 18.0, 25.0, 17.0, 37.0, 34.0, 22.0, 28.0, 30.0, 19.0, 31.0, 21.0, 26.0, 23.0, 33.0, 30.0, 39.0, 54.0, 41.0, 46.0, 59.0, 62.0, 62.0, 73.0, 92.0, 113.0, 114.0, 148.0, 152.0, 203.0, 195.0, 249.0, 324.0, 434.0, 553.0, 754.0, 1104.0, 1799.0, 3733.0], [347.0, 91.0, 53.0, 36.0, 17.0, 18.0, 24.0, 14.0, 20.0, 18.0, 11.0, 18.0, 16.0, 15.0, 11.0, 8.0, 16.0, 15.0, 15.0, 16.0, 19.0, 21.0, 23.0, 32.0, 18.0, 25.0, 21.0, 22.0, 21.0, 30.0, 33.0, 29.0, 29.0, 32.0, 53.0, 42.0, 39.0, 63.0, 67.0, 68.0, 97.0, 110.0, 119.0, 171.0, 258.0, 332.0, 577.0, 966.0, 2581.0], [564.0, 139.0, 69.0, 27.0, 29.0, 14.0, 16.0, 11.0, 17.0, 14.0, 10.0, 9.0, 10.0, 15.0, 8.0, 11.0, 13.0, 14.0, 8.0, 4.0, 19.0, 9.0, 11.0, 14.0, 20.0, 13.0, 15.0, 13.0, 17.0, 9.0, 13.0, 23.0, 18.0, 24.0, 15.0, 20.0, 29.0, 28.0, 42.0, 34.0, 41.0, 57.0, 70.0, 97.0, 101.0, 158.0, 218.0, 487.0, 1499.0], [1045.0, 239.0, 90.0, 39.0, 30.0, 22.0, 12.0, 7.0, 13.0, 12.0, 10.0, 11.0, 7.0, 8.0, 9.0, 14.0, 8.0, 15.0, 4.0, 12.0, 10.0, 5.0, 8.0, 13.0, 17.0, 7.0, 11.0, 11.0, 9.0, 8.0, 9.0, 8.0, 10.0, 14.0, 12.0, 15.0, 17.0, 18.0, 21.0, 20.0, 18.0, 28.0, 39.0, 44.0, 48.0, 69.0, 125.0, 202.0, 811.0], [1965.0, 535.0, 222.0, 110.0, 46.0, 30.0, 23.0, 15.0, 9.0, 11.0, 11.0, 6.0, 11.0, 5.0, 7.0, 5.0, 9.0, 9.0, 6.0, 7.0, 4.0, 7.0, 10.0, 8.0, 11.0, 7.0, 3.0, 6.0, 6.0, 6.0, 13.0, 6.0, 14.0, 14.0, 10.0, 8.0, 9.0, 16.0, 11.0, 16.0, 16.0, 21.0, 19.0, 23.0, 27.0, 36.0, 71.0, 115.0, 356.0], [2907.0, 1088.0, 459.0, 269.0, 108.0, 89.0, 43.0, 29.0, 22.0, 13.0, 18.0, 10.0, 8.0, 5.0, 6.0, 11.0, 4.0, 4.0, 5.0, 11.0, 6.0, 12.0, 9.0, 7.0, 9.0, 7.0, 4.0, 5.0, 8.0, 4.0, 7.0, 4.0, 7.0, 4.0, 3.0, 12.0, 12.0, 14.0, 9.0, 12.0, 11.0, 18.0, 17.0, 30.0, 18.0, 28.0, 40.0, 72.0, 186.0], [3915.0, 1804.0, 992.0, 538.0, 290.0, 197.0, 118.0, 89.0, 67.0, 44.0, 21.0, 22.0, 22.0, 21.0, 8.0, 12.0, 6.0, 6.0, 7.0, 7.0, 6.0, 7.0, 4.0, 6.0, 6.0, 8.0, 5.0, 6.0, 5.0, 2.0, 9.0, 6.0, 10.0, 5.0, 5.0, 10.0, 10.0, 8.0, 8.0, 9.0, 9.0, 9.0, 8.0, 16.0, 10.0, 25.0, 34.0, 45.0, 122.0], [4447.0, 2452.0, 1559.0, 1051.0, 718.0, 496.0, 350.0, 258.0, 191.0, 149.0, 84.0, 85.0, 63.0, 40.0, 37.0, 37.0, 19.0, 17.0, 12.0, 12.0, 7.0, 14.0, 5.0, 9.0, 5.0, 4.0, 6.0, 7.0, 3.0, 7.0, 8.0, 6.0, 2.0, 5.0, 9.0, 4.0, 5.0, 5.0, 9.0, 7.0, 10.0, 14.0, 10.0, 7.0, 11.0, 21.0, 22.0, 29.0, 91.0], [4400.0, 2880.0, 2036.0, 1466.0, 1131.0, 755.0, 625.0, 524.0, 385.0, 282.0, 243.0, 186.0, 136.0, 102.0, 97.0, 65.0, 69.0, 51.0, 36.0, 40.0, 27.0, 26.0, 23.0, 19.0, 13.0, 14.0, 22.0, 10.0, 9.0, 7.0, 6.0, 7.0, 11.0, 3.0, 4.0, 2.0, 9.0, 6.0, 9.0, 7.0, 6.0, 5.0, 7.0, 6.0, 10.0, 11.0, 19.0, 26.0, 69.0], [3612.0, 2759.0, 2314.0, 1788.0, 1394.0, 1208.0, 989.0, 751.0, 710.0, 546.0, 468.0, 396.0, 323.0, 317.0, 274.0, 185.0, 166.0, 129.0, 131.0, 88.0, 77.0, 64.0, 48.0, 44.0, 53.0, 47.0, 35.0, 22.0, 28.0, 12.0, 21.0, 22.0, 16.0, 11.0, 14.0, 10.0, 6.0, 7.0, 16.0, 7.0, 5.0, 6.0, 6.0, 12.0, 6.0, 11.0, 11.0, 23.0, 54.0], [2592.0, 2251.0, 1979.0, 1793.0, 1574.0, 1325.0, 1197.0, 1016.0, 933.0, 862.0, 765.0, 653.0, 576.0, 483.0, 452.0, 361.0, 365.0, 323.0, 278.0, 249.0, 223.0, 157.0, 170.0, 156.0, 99.0, 101.0, 94.0, 94.0, 68.0, 65.0, 47.0, 37.0, 47.0, 37.0, 26.0, 36.0, 19.0, 21.0, 18.0, 18.0, 16.0, 12.0, 13.0, 12.0, 9.0, 9.0, 19.0, 19.0, 40.0], [1579.0, 1573.0, 1535.0, 1364.0, 1371.0, 1296.0, 1241.0, 1124.0, 1070.0, 919.0, 959.0, 830.0, 761.0, 668.0, 641.0, 634.0, 572.0, 533.0, 445.0, 442.0, 386.0, 350.0, 323.0, 316.0, 276.0, 241.0, 231.0, 183.0, 152.0, 155.0, 150.0, 124.0, 118.0, 110.0, 93.0, 67.0, 61.0, 52.0, 47.0, 50.0, 41.0, 23.0, 36.0, 25.0, 16.0, 18.0, 19.0, 26.0, 41.0], [917.0, 946.0, 962.0, 959.0, 1002.0, 983.0, 978.0, 962.0, 1002.0, 920.0, 935.0, 867.0, 886.0, 809.0, 789.0, 737.0, 719.0, 683.0, 600.0, 600.0, 581.0, 511.0, 513.0, 453.0, 427.0, 434.0, 422.0, 328.0, 326.0, 312.0, 333.0, 287.0, 252.0, 215.0, 210.0, 165.0, 170.0, 144.0, 141.0, 121.0, 93.0, 82.0, 81.0, 68.0, 58.0, 42.0, 65.0, 41.0, 44.0], [445.0, 462.0, 518.0, 585.0, 619.0, 643.0, 696.0, 680.0, 709.0, 756.0, 727.0, 791.0, 808.0, 745.0, 721.0, 685.0, 738.0, 746.0, 715.0, 646.0, 677.0, 631.0, 637.0, 648.0, 595.0, 599.0, 533.0, 549.0, 521.0, 507.0, 486.0, 450.0, 442.0, 402.0, 393.0, 358.0, 357.0, 309.0, 301.0, 248.0, 214.0, 253.0, 201.0, 193.0, 146.0, 123.0, 115.0, 87.0, 109.0], [259.0, 256.0, 237.0, 284.0, 343.0, 373.0, 390.0, 441.0, 508.0, 493.0, 467.0, 507.0, 545.0, 567.0, 592.0, 593.0, 581.0, 648.0, 639.0, 647.0, 622.0, 655.0, 668.0, 705.0, 678.0, 718.0, 654.0, 683.0, 612.0, 579.0, 640.0, 662.0, 543.0, 632.0, 573.0, 553.0, 544.0, 506.0, 514.0, 453.0, 430.0, 439.0, 377.0, 408.0, 330.0, 313.0, 277.0, 266.0, 209.0], [147.0, 116.0, 141.0, 155.0, 150.0, 169.0, 201.0, 236.0, 248.0, 312.0, 284.0, 328.0, 351.0, 373.0, 394.0, 384.0, 445.0, 452.0, 452.0, 541.0, 533.0, 564.0, 531.0, 587.0, 572.0, 650.0, 668.0, 643.0, 698.0, 642.0, 659.0, 685.0, 695.0, 720.0, 714.0, 736.0, 680.0, 702.0, 670.0, 629.0, 710.0, 691.0, 634.0, 673.0, 643.0, 587.0, 540.0, 513.0, 508.0], [129.0, 62.0, 57.0, 57.0, 64.0, 90.0, 93.0, 109.0, 118.0, 138.0, 155.0, 167.0, 191.0, 221.0, 215.0, 249.0, 269.0, 302.0, 307.0, 300.0, 371.0, 347.0, 417.0, 416.0, 496.0, 483.0, 494.0, 493.0, 555.0, 583.0, 595.0, 644.0, 690.0, 707.0, 699.0, 784.0, 821.0, 782.0, 802.0, 874.0, 876.0, 854.0, 875.0, 961.0, 987.0, 892.0, 970.0, 991.0, 984.0], [110.0, 51.0, 35.0, 29.0, 34.0, 24.0, 33.0, 38.0, 51.0, 55.0, 81.0, 72.0, 86.0, 101.0, 105.0, 144.0, 141.0, 150.0, 159.0, 172.0, 172.0, 243.0, 244.0, 266.0, 326.0, 325.0, 324.0, 358.0, 410.0, 414.0, 457.0, 488.0, 483.0, 559.0, 607.0, 653.0, 726.0, 774.0, 793.0, 883.0, 918.0, 1027.0, 1076.0, 1164.0, 1209.0, 1273.0, 1437.0, 1484.0, 1729.0], [100.0, 46.0, 30.0, 14.0, 13.0, 18.0, 18.0, 17.0, 17.0, 31.0, 29.0, 27.0, 32.0, 40.0, 59.0, 52.0, 71.0, 85.0, 60.0, 98.0, 107.0, 121.0, 147.0, 126.0, 171.0, 171.0, 211.0, 242.0, 242.0, 272.0, 289.0, 307.0, 353.0, 439.0, 440.0, 452.0, 535.0, 616.0, 633.0, 758.0, 847.0, 921.0, 1038.0, 1133.0, 1358.0, 1476.0, 1730.0, 2009.0, 2534.0], [102.0, 40.0, 19.0, 9.0, 6.0, 10.0, 9.0, 10.0, 10.0, 8.0, 14.0, 10.0, 20.0, 15.0, 24.0, 22.0, 28.0, 25.0, 42.0, 45.0, 36.0, 43.0, 56.0, 73.0, 79.0, 93.0, 89.0, 104.0, 145.0, 155.0, 181.0, 195.0, 229.0, 227.0, 278.0, 289.0, 388.0, 389.0, 468.0, 562.0, 642.0, 710.0, 872.0, 982.0, 1235.0, 1496.0, 1836.0, 2278.0, 3206.0], [109.0, 40.0, 20.0, 19.0, 17.0, 9.0, 6.0, 3.0, 3.0, 3.0, 8.0, 5.0, 7.0, 9.0, 11.0, 7.0, 10.0, 14.0, 7.0, 16.0, 23.0, 20.0, 27.0, 34.0, 32.0, 42.0, 44.0, 49.0, 62.0, 83.0, 87.0, 89.0, 104.0, 139.0, 150.0, 180.0, 207.0, 240.0, 284.0, 361.0, 371.0, 493.0, 655.0, 734.0, 967.0, 1178.0, 1633.0, 2364.0, 3625.0], [102.0, 32.0, 22.0, 23.0, 12.0, 4.0, 8.0, 7.0, 8.0, 3.0, 0.0, 2.0, 6.0, 2.0, 6.0, 7.0, 3.0, 7.0, 3.0, 7.0, 7.0, 10.0, 11.0, 9.0, 15.0, 16.0, 20.0, 21.0, 26.0, 32.0, 37.0, 41.0, 44.0, 65.0, 78.0, 87.0, 97.0, 125.0, 148.0, 200.0, 207.0, 315.0, 365.0, 535.0, 625.0, 882.0, 1311.0, 2013.0, 3645.0], [85.0, 41.0, 30.0, 18.0, 7.0, 5.0, 4.0, 7.0, 4.0, 3.0, 2.0, 3.0, 4.0, 7.0, 2.0, 0.0, 5.0, 2.0, 4.0, 4.0, 2.0, 3.0, 5.0, 4.0, 4.0, 4.0, 5.0, 4.0, 12.0, 17.0, 18.0, 17.0, 28.0, 24.0, 30.0, 37.0, 43.0, 60.0, 76.0, 96.0, 99.0, 168.0, 220.0, 280.0, 456.0, 590.0, 858.0, 1542.0, 3081.0], [86.0, 44.0, 26.0, 14.0, 8.0, 7.0, 3.0, 4.0, 5.0, 2.0, 1.0, 5.0, 1.0, 4.0, 5.0, 2.0, 2.0, 5.0, 3.0, 3.0, 1.0, 5.0, 1.0, 3.0, 2.0, 0.0, 2.0, 2.0, 4.0, 5.0, 7.0, 10.0, 8.0, 6.0, 14.0, 21.0, 21.0, 26.0, 31.0, 51.0, 58.0, 71.0, 96.0, 148.0, 246.0, 347.0, 580.0, 1028.0, 2418.0], [80.0, 47.0, 23.0, 14.0, 6.0, 3.0, 7.0, 5.0, 5.0, 3.0, 3.0, 4.0, 0.0, 2.0, 2.0, 4.0, 3.0, 4.0, 2.0, 1.0, 3.0, 0.0, 2.0, 4.0, 1.0, 2.0, 2.0, 2.0, 3.0, 1.0, 2.0, 6.0, 7.0, 8.0, 7.0, 3.0, 10.0, 11.0, 18.0, 18.0, 27.0, 32.0, 56.0, 72.0, 101.0, 162.0, 353.0, 636.0, 1682.0], [91.0, 46.0, 27.0, 16.0, 9.0, 5.0, 9.0, 3.0, 4.0, 2.0, 2.0, 4.0, 1.0, 4.0, 3.0, 3.0, 6.0, 3.0, 0.0, 3.0, 2.0, 3.0, 0.0, 1.0, 2.0, 2.0, 0.0, 2.0, 2.0, 3.0, 4.0, 3.0, 3.0, 2.0, 1.0, 1.0, 5.0, 3.0, 11.0, 6.0, 4.0, 18.0, 16.0, 31.0, 43.0, 93.0, 167.0, 334.0, 1093.0], [92.0, 46.0, 20.0, 15.0, 6.0, 6.0, 0.0, 5.0, 5.0, 5.0, 3.0, 5.0, 5.0, 3.0, 2.0, 2.0, 2.0, 1.0, 4.0, 2.0, 3.0, 2.0, 3.0, 2.0, 1.0, 1.0, 1.0, 0.0, 1.0, 3.0, 1.0, 2.0, 1.0, 2.0, 2.0, 2.0, 3.0, 1.0, 1.0, 1.0, 1.0, 5.0, 5.0, 10.0, 15.0, 43.0, 75.0, 171.0, 687.0], [87.0, 57.0, 15.0, 16.0, 10.0, 6.0, 23.0, 4.0, 5.0, 3.0, 6.0, 1.0, 1.0, 1.0, 5.0, 4.0, 5.0, 2.0, 3.0, 0.0, 1.0, 0.0, 2.0, 0.0, 4.0, 3.0, 1.0, 5.0, 1.0, 2.0, 1.0, 4.0, 2.0, 1.0, 3.0, 2.0, 2.0, 1.0, 0.0, 2.0, 3.0, 3.0, 2.0, 4.0, 4.0, 20.0, 40.0, 107.0, 372.0], [83.0, 44.0, 23.0, 17.0, 7.0, 6.0, 5.0, 1.0, 5.0, 2.0, 5.0, 5.0, 4.0, 4.0, 2.0, 4.0, 0.0, 0.0, 4.0, 2.0, 3.0, 1.0, 2.0, 4.0, 0.0, 1.0, 3.0, 1.0, 3.0, 2.0, 0.0, 2.0, 0.0, 2.0, 0.0, 2.0, 2.0, 1.0, 0.0, 2.0, 0.0, 2.0, 1.0, 2.0, 1.0, 15.0, 17.0, 45.0, 183.0], [102.0, 52.0, 19.0, 7.0, 12.0, 2.0, 3.0, 6.0, 5.0, 5.0, 2.0, 3.0, 2.0, 3.0, 4.0, 3.0, 2.0, 2.0, 1.0, 0.0, 2.0, 0.0, 4.0, 2.0, 2.0, 2.0, 4.0, 0.0, 2.0, 5.0, 1.0, 4.0, 2.0, 0.0, 2.0, 0.0, 1.0, 3.0, 2.0, 1.0, 2.0, 2.0, 1.0, 0.0, 0.0, 2.0, 11.0, 23.0, 128.0], [93.0, 50.0, 26.0, 14.0, 9.0, 2.0, 2.0, 5.0, 5.0, 2.0, 2.0, 2.0, 2.0, 5.0, 3.0, 0.0, 4.0, 2.0, 2.0, 3.0, 0.0, 4.0, 2.0, 5.0, 1.0, 3.0, 0.0, 0.0, 1.0, 3.0, 3.0, 3.0, 0.0, 2.0, 0.0, 3.0, 1.0, 2.0, 0.0, 2.0, 2.0, 1.0, 3.0, 0.0, 2.0, 19.0, 13.0, 18.0, 55.0], [89.0, 48.0, 22.0, 15.0, 8.0, 4.0, 6.0, 5.0, 2.0, 4.0, 20.0, 9.0, 3.0, 0.0, 4.0, 2.0, 2.0, 3.0, 2.0, 0.0, 4.0, 1.0, 2.0, 1.0, 4.0, 2.0, 2.0, 0.0, 0.0, 1.0, 1.0, 1.0, 1.0, 0.0, 2.0, 5.0, 1.0, 1.0, 2.0, 0.0, 0.0, 0.0, 2.0, 3.0, 0.0, 4.0, 7.0, 9.0, 31.0], [101.0, 41.0, 26.0, 11.0, 10.0, 2.0, 7.0, 1.0, 5.0, 3.0, 4.0, 3.0, 8.0, 4.0, 2.0, 1.0, 2.0, 1.0, 0.0, 1.0, 3.0, 1.0, 4.0, 1.0, 1.0, 0.0, 2.0, 1.0, 1.0, 2.0, 4.0, 3.0, 2.0, 2.0, 1.0, 1.0, 1.0, 1.0, 3.0, 1.0, 0.0, 1.0, 2.0, 0.0, 0.0, 2.0, 5.0, 7.0, 16.0], [91.0, 35.0, 20.0, 17.0, 8.0, 7.0, 11.0, 5.0, 4.0, 1.0, 1.0, 3.0, 1.0, 1.0, 7.0, 2.0, 3.0, 1.0, 2.0, 2.0, 2.0, 2.0, 1.0, 2.0, 1.0, 2.0, 2.0, 1.0, 2.0, 4.0, 0.0, 2.0, 3.0, 1.0, 2.0, 3.0, 1.0, 0.0, 2.0, 0.0, 3.0, 0.0, 1.0, 0.0, 4.0, 4.0, 7.0, 7.0, 11.0], [93.0, 45.0, 25.0, 10.0, 8.0, 9.0, 1.0, 4.0, 3.0, 0.0, 6.0, 1.0, 3.0, 3.0, 18.0, 11.0, 4.0, 0.0, 5.0, 1.0, 2.0, 1.0, 0.0, 1.0, 3.0, 2.0, 3.0, 0.0, 0.0, 1.0, 1.0, 4.0, 3.0, 2.0, 3.0, 2.0, 2.0, 1.0, 0.0, 1.0, 0.0, 0.0, 2.0, 1.0, 2.0, 0.0, 5.0, 7.0, 9.0], [104.0, 32.0, 22.0, 16.0, 14.0, 6.0, 4.0, 6.0, 4.0, 3.0, 2.0, 3.0, 2.0, 2.0, 2.0, 4.0, 4.0, 1.0, 2.0, 0.0, 2.0, 1.0, 1.0, 4.0, 1.0, 0.0, 3.0, 1.0, 5.0, 2.0, 1.0, 1.0, 2.0, 2.0, 1.0, 0.0, 2.0, 3.0, 0.0, 0.0, 1.0, 1.0, 1.0, 1.0, 1.0, 2.0, 3.0, 3.0, 10.0], [95.0, 43.0, 19.0, 16.0, 9.0, 6.0, 5.0, 5.0, 4.0, 6.0, 0.0, 3.0, 1.0, 3.0, 3.0, 0.0, 4.0, 0.0, 2.0, 1.0, 2.0, 4.0, 1.0, 2.0, 3.0, 2.0, 2.0, 2.0, 1.0, 4.0, 4.0, 0.0, 1.0, 1.0, 3.0, 1.0, 1.0, 0.0, 2.0, 1.0, 1.0, 1.0, 2.0, 2.0, 0.0, 1.0, 2.0, 9.0, 4.0], [88.0, 44.0, 20.0, 21.0, 9.0, 4.0, 2.0, 3.0, 2.0, 4.0, 1.0, 4.0, 5.0, 1.0, 0.0, 1.0, 2.0, 3.0, 3.0, 4.0, 3.0, 2.0, 4.0, 4.0, 2.0, 2.0, 3.0, 2.0, 0.0, 0.0, 0.0, 3.0, 1.0, 3.0, 4.0, 1.0, 1.0, 1.0, 0.0, 0.0, 1.0, 0.0, 1.0, 1.0, 2.0, 4.0, 3.0, 5.0, 8.0]],
    "Name": "sCurve-0",
    "Overflow": 2463000.0,
    "Type": "Histo2d",
    "Underflow": 0.0,
    "x": {
        "AxisTitle": "Vcal",
        "Bins": 51,
        "High": 302.5,
        "Low": 47.5
    },
    "y": {
        "AxisTitle": "Occupancy",
        "Bins": 49,
        "High": 49.5,
        "Low": 0.5
    },
    "z": {
        "AxisTitle": "Number of pixels"
    }
}