time,Hardware,Voltage,Current
1621633530052,high-voltage,1,0.0622887
time,Hardware,Voltage,Current
1621633530052,high-voltage,2,0.111499
time,Hardware,Voltage,Current
1621633530052,high-voltage,3,0.195624
time,Hardware,Voltage,Current
1621633530052,high-voltage,4,0.292327
time,Hardware,Voltage,Current
1621633530052,high-voltage,5,0.410897
time,Hardware,Voltage,Current
1621633530052,high-voltage,6,0.59847
time,Hardware,Voltage,Current
1621633530052,high-voltage,7,0.769965
time,Hardware,Voltage,Current
1621633530052,high-voltage,8,1.00901
time,Hardware,Voltage,Current
1621633530052,high-voltage,9,1.365
time,Hardware,Voltage,Current
1621633530052,high-voltage,10,1.74867
time,Hardware,Voltage,Current
1621633530052,high-voltage,11,2.22576
time,Hardware,Voltage,Current
1621633530052,high-voltage,12,2.84102
time,Hardware,Voltage,Current
1621633530052,high-voltage,13,3.40555
time,Hardware,Voltage,Current
1621633530052,high-voltage,14,4.24826
time,Hardware,Voltage,Current
1621633530052,high-voltage,15,5.07028
time,Hardware,Voltage,Current
1621633530052,high-voltage,16,6.09057
time,Hardware,Voltage,Current
1621633530052,high-voltage,17,7.32835
time,Hardware,Voltage,Current
1621633530052,high-voltage,18,8.49888
time,Hardware,Voltage,Current
1621633530052,high-voltage,19,9.52668
time,Hardware,Voltage,Current
1621633530052,high-voltage,20,9.52111
time,Hardware,Voltage,Current
1621633530052,high-voltage,25,10.0001
