time,Hardware,Voltage,Current
1626319870370,high-voltage-3,1,0.282572
time,Hardware,Voltage,Current
1626319870370,high-voltage-3,2,0.302802
time,Hardware,Voltage,Current
1626319870370,high-voltage-3,3,0.322642
time,Hardware,Voltage,Current
1626319870370,high-voltage-3,4,0.336485
time,Hardware,Voltage,Current
1626319870370,high-voltage-3,5,0.350375
time,Hardware,Voltage,Current
1626319870370,high-voltage-3,6,0.362912
time,Hardware,Voltage,Current
1626319870370,high-voltage-3,7,0.376024
time,Hardware,Voltage,Current
1626319870370,high-voltage-3,8,0.392769
time,Hardware,Voltage,Current
1626319870370,high-voltage-3,9,0.407461
time,Hardware,Voltage,Current
1626319870370,high-voltage-3,10,0.424623
time,Hardware,Voltage,Current
1626319870370,high-voltage-3,11,0.442225
time,Hardware,Voltage,Current
1626319870370,high-voltage-3,12,0.456202
time,Hardware,Voltage,Current
1626319870370,high-voltage-3,13,0.472658
time,Hardware,Voltage,Current
1626319870370,high-voltage-3,14,0.484443
time,Hardware,Voltage,Current
1626319870370,high-voltage-3,15,0.496984
time,Hardware,Voltage,Current
1626319870370,high-voltage-3,16,0.508798
time,Hardware,Voltage,Current
1626319870370,high-voltage-3,17,0.520509
time,Hardware,Voltage,Current
1626319870370,high-voltage-3,18,0.5314
time,Hardware,Voltage,Current
1626319870370,high-voltage-3,19,0.541613
time,Hardware,Voltage,Current
1626319870370,high-voltage-3,20,0.550287
time,Hardware,Voltage,Current
1626319870370,high-voltage-3,25,0.594744
time,Hardware,Voltage,Current
1626319870370,high-voltage-3,30,0.633404
time,Hardware,Voltage,Current
1626319870370,high-voltage-3,35,0.665919
time,Hardware,Voltage,Current
1626319870370,high-voltage-3,40,0.694943
time,Hardware,Voltage,Current
1626319870370,high-voltage-3,45,0.721886
time,Hardware,Voltage,Current
1626319870370,high-voltage-3,50,0.746678
time,Hardware,Voltage,Current
1626319870370,high-voltage-3,55,0.77173
time,Hardware,Voltage,Current
1626319870370,high-voltage-3,60,0.794729
time,Hardware,Voltage,Current
1626319870370,high-voltage-3,65,0.81825
time,Hardware,Voltage,Current
1626319870370,high-voltage-3,70,0.845107
time,Hardware,Voltage,Current
1626319870370,high-voltage-3,75,0.868111
time,Hardware,Voltage,Current
1626319870370,high-voltage-3,80,0.894139
time,Hardware,Voltage,Current
1626319870370,high-voltage-3,85,0.917818
time,Hardware,Voltage,Current
1626319870370,high-voltage-3,90,0.942556
time,Hardware,Voltage,Current
1626319870370,high-voltage-3,95,0.96809
time,Hardware,Voltage,Current
1626319870370,high-voltage-3,100,0.987417
