{
    "Data": [1577.0, 15763.0, 14340.0, 7701.0, 4598.0, 3415.0, 2934.0, 2823.0, 2442.0, 2083.0, 1565.0, 1236.0, 828.0, 530.0, 449.0, 364.0, 305.0, 245.0, 213.0, 204.0, 189.0, 185.0, 205.0, 198.0, 190.0, 189.0, 173.0, 169.0, 166.0, 144.0, 130.0, 113.0, 110.0, 122.0, 123.0, 98.0, 96.0, 95.0, 109.0, 86.0, 74.0, 74.0, 72.0, 58.0, 57.0, 50.0, 53.0, 55.0, 39.0, 36.0, 19.0],
    "Name": "Chi2Dist-0",
    "Overflow": 0.0,
    "Type": "Histo1d",
    "Underflow": 0.0,
    "x": {
        "AxisTitle": "Fit Chi/ndf",
        "Bins": 51,
        "High": 2.5250000953674318,
        "Low": -0.02500000037252903
    },
    "y": {
        "AxisTitle": "Number of Pixels"
    },
    "z": {
        "AxisTitle": "z"
    }
}