{
    "Data": [0.0, 0.0, 0.0, 0.0, 0.0, 0.0, 0.0, 0.0, 0.0, 0.0, 0.0, 0.0, 1.0, 0.0, 1.0, 0.0, 1.0, 5.0, 4.0, 6.0, 2.0, 15.0, 22.0, 21.0, 26.0, 42.0, 40.0, 21.0, 43.0, 48.0, 6.0, 49.0, 49.0, 35.0, 46.0, 50.0, 50.0, 22.0, 28.0, 50.0, 50.0, 43.0, 35.0, 50.0, 50.0, 50.0, 15.0, 50.0, 50.0, 50.0, 50.0],
    "Name": "Scurve-60-96",
    "Overflow": 0.0,
    "Type": "Histo1d",
    "Underflow": 0.0,
    "x": {
        "AxisTitle": "Vcal",
        "Bins": 51,
        "High": 302.5,
        "Low": 47.5
    },
    "y": {
        "AxisTitle": "Occupancy"
    },
    "z": {
        "AxisTitle": "z"
    }
}