{
    "Data": [0.0, 0.0, 0.0, 0.0, 0.0, 0.0, 0.0, 0.0, 0.0, 0.0, 0.0, 0.0, 0.0, 0.0, 1.0, 3.0, 0.0, 2.0, 0.0, 1.0, 0.0, 4.0, 3.0, 2.0, 1.0, 1.0, 8.0, 9.0, 2.0, 8.0, 25.0, 46.0, 17.0, 23.0, 60.0, 104.0, 75.0, 295.0, 663.0, 760.0, 415.0, 752.0, 1591.0, 2874.0, 1899.0, 1335.0, 2135.0, 3078.0, 3538.0, 2750.0, 2300.0, 2098.0, 2680.0, 2178.0, 1684.0, 1430.0, 1463.0, 1628.0, 1422.0, 1281.0, 1125.0, 1035.0, 901.0, 684.0, 643.0, 557.0, 602.0, 476.0, 424.0, 373.0, 381.0, 389.0, 259.0, 273.0, 227.0, 226.0, 214.0, 164.0, 172.0, 148.0, 153.0, 119.0, 110.0, 82.0, 99.0, 103.0, 79.0, 75.0, 63.0, 80.0, 56.0, 52.0, 42.0, 49.0, 46.0, 40.0, 44.0, 42.0, 33.0, 28.0, 21.0, 20.0, 24.0, 27.0, 9.0, 25.0, 19.0, 15.0, 20.0, 26.0, 22.0, 12.0, 12.0, 11.0, 7.0, 8.0, 11.0, 14.0, 5.0, 7.0, 11.0, 5.0, 6.0, 5.0, 3.0, 1.0, 10.0, 7.0, 4.0, 10.0, 4.0, 4.0, 4.0, 5.0, 5.0, 2.0, 4.0, 2.0, 4.0, 5.0, 4.0, 2.0, 1.0, 4.0, 1.0, 2.0, 2.0, 2.0, 3.0, 1.0, 0.0, 2.0, 2.0, 2.0, 1.0, 2.0, 3.0, 1.0, 0.0, 4.0, 2.0, 1.0, 3.0, 2.0, 0.0, 2.0, 0.0, 4.0, 1.0, 2.0, 0.0, 0.0, 0.0, 0.0, 3.0, 2.0, 1.0, 0.0, 1.0, 1.0, 1.0, 1.0, 1.0, 1.0, 1.0, 0.0, 0.0, 1.0, 1.0, 0.0, 0.0, 0.0, 3.0, 3.0, 1.0, 2.0, 0.0, 3.0, 0.0, 2.0, 2.0],
    "Name": "TimePerFitDist-0",
    "Overflow": 259.0,
    "Type": "Histo1d",
    "Underflow": 0.0,
    "x": {
        "AxisTitle": "Fit Time [us]",
        "Bins": 201,
        "High": 401.0,
        "Low": -1.0
    },
    "y": {
        "AxisTitle": "Number of Pixels"
    },
    "z": {
        "AxisTitle": "z"
    }
}