{
    "Data": [[1128.0, 350.0, 176.0, 99.0, 69.0, 59.0, 42.0, 30.0, 20.0, 26.0, 23.0, 10.0, 19.0, 14.0, 10.0, 11.0, 10.0, 15.0, 11.0, 13.0, 9.0, 13.0, 10.0, 6.0, 10.0, 7.0, 6.0, 10.0, 4.0, 8.0, 2.0, 6.0, 5.0, 3.0, 2.0, 3.0, 4.0, 9.0, 1.0, 6.0, 4.0, 5.0, 7.0, 4.0, 4.0, 8.0, 12.0, 11.0, 12.0], [2164.0, 812.0, 392.0, 228.0, 130.0, 120.0, 77.0, 75.0, 47.0, 39.0, 41.0, 40.0, 35.0, 36.0, 17.0, 19.0, 16.0, 28.0, 14.0, 23.0, 18.0, 15.0, 18.0, 11.0, 11.0, 15.0, 13.0, 4.0, 7.0, 12.0, 6.0, 10.0, 7.0, 8.0, 7.0, 7.0, 7.0, 7.0, 7.0, 7.0, 5.0, 4.0, 8.0, 10.0, 8.0, 12.0, 7.0, 13.0, 14.0], [3357.0, 1430.0, 815.0, 574.0, 366.0, 305.0, 203.0, 183.0, 157.0, 103.0, 101.0, 71.0, 71.0, 62.0, 47.0, 38.0, 31.0, 35.0, 26.0, 31.0, 34.0, 30.0, 19.0, 28.0, 24.0, 15.0, 15.0, 19.0, 18.0, 18.0, 15.0, 11.0, 11.0, 19.0, 17.0, 13.0, 11.0, 12.0, 13.0, 15.0, 13.0, 13.0, 10.0, 16.0, 9.0, 11.0, 15.0, 23.0, 22.0], [4048.0, 2225.0, 1480.0, 1021.0, 776.0, 613.0, 461.0, 340.0, 311.0, 282.0, 240.0, 175.0, 158.0, 159.0, 132.0, 113.0, 99.0, 75.0, 65.0, 79.0, 69.0, 68.0, 50.0, 54.0, 47.0, 34.0, 44.0, 34.0, 31.0, 32.0, 26.0, 33.0, 25.0, 28.0, 31.0, 19.0, 20.0, 34.0, 21.0, 23.0, 10.0, 25.0, 13.0, 25.0, 22.0, 24.0, 31.0, 27.0, 38.0], [4470.0, 2534.0, 1815.0, 1445.0, 1143.0, 922.0, 804.0, 718.0, 642.0, 538.0, 447.0, 399.0, 359.0, 346.0, 303.0, 253.0, 254.0, 194.0, 201.0, 179.0, 169.0, 157.0, 141.0, 121.0, 124.0, 108.0, 115.0, 87.0, 88.0, 75.0, 81.0, 72.0, 58.0, 59.0, 50.0, 55.0, 53.0, 50.0, 40.0, 41.0, 43.0, 40.0, 43.0, 51.0, 34.0, 31.0, 34.0, 51.0, 65.0], [7159.0, 3291.0, 2105.0, 1636.0, 1362.0, 1085.0, 1015.0, 861.0, 809.0, 756.0, 690.0, 646.0, 577.0, 567.0, 516.0, 461.0, 451.0, 422.0, 400.0, 404.0, 352.0, 322.0, 285.0, 283.0, 251.0, 248.0, 230.0, 217.0, 212.0, 183.0, 162.0, 170.0, 172.0, 177.0, 128.0, 136.0, 137.0, 137.0, 106.0, 102.0, 96.0, 114.0, 92.0, 89.0, 98.0, 76.0, 77.0, 93.0, 109.0], [6053.0, 5125.0, 3902.0, 3139.0, 2489.0, 2032.0, 1738.0, 1416.0, 1205.0, 1100.0, 982.0, 888.0, 765.0, 746.0, 690.0, 570.0, 607.0, 626.0, 588.0, 554.0, 526.0, 534.0, 477.0, 421.0, 485.0, 438.0, 450.0, 421.0, 383.0, 436.0, 361.0, 349.0, 345.0, 314.0, 311.0, 288.0, 329.0, 270.0, 278.0, 241.0, 240.0, 242.0, 241.0, 239.0, 198.0, 195.0, 204.0, 203.0, 248.0], [1208.0, 1411.0, 1595.0, 1745.0, 1821.0, 1900.0, 1936.0, 1918.0, 1976.0, 1860.0, 1818.0, 1768.0, 1620.0, 1639.0, 1545.0, 1372.0, 1281.0, 1288.0, 1145.0, 1139.0, 1026.0, 1001.0, 944.0, 850.0, 783.0, 787.0, 719.0, 689.0, 664.0, 563.0, 621.0, 542.0, 561.0, 581.0, 534.0, 569.0, 558.0, 559.0, 527.0, 552.0, 476.0, 504.0, 491.0, 497.0, 492.0, 473.0, 498.0, 509.0, 523.0], [262.0, 273.0, 251.0, 281.0, 330.0, 416.0, 462.0, 500.0, 533.0, 548.0, 663.0, 702.0, 817.0, 841.0, 940.0, 941.0, 1042.0, 1087.0, 1166.0, 1208.0, 1229.0, 1262.0, 1259.0, 1299.0, 1396.0, 1487.0, 1452.0, 1380.0, 1518.0, 1416.0, 1471.0, 1383.0, 1471.0, 1373.0, 1350.0, 1313.0, 1279.0, 1162.0, 1158.0, 1097.0, 1109.0, 1079.0, 1022.0, 1009.0, 1058.0, 965.0, 1024.0, 1070.0, 1242.0], [135.0, 98.0, 98.0, 92.0, 71.0, 90.0, 93.0, 100.0, 112.0, 123.0, 147.0, 155.0, 173.0, 188.0, 218.0, 186.0, 249.0, 262.0, 296.0, 335.0, 335.0, 406.0, 410.0, 485.0, 492.0, 571.0, 661.0, 658.0, 744.0, 794.0, 879.0, 1008.0, 1084.0, 1204.0, 1321.0, 1387.0, 1550.0, 1699.0, 1835.0, 2030.0, 2183.0, 2264.0, 2404.0, 2530.0, 2643.0, 2869.0, 2933.0, 3082.0, 3236.0], [114.0, 71.0, 49.0, 39.0, 37.0, 38.0, 44.0, 32.0, 33.0, 46.0, 47.0, 62.0, 51.0, 50.0, 71.0, 64.0, 71.0, 72.0, 64.0, 81.0, 112.0, 101.0, 122.0, 114.0, 125.0, 158.0, 168.0, 220.0, 205.0, 227.0, 285.0, 295.0, 329.0, 353.0, 441.0, 475.0, 568.0, 692.0, 732.0, 891.0, 1054.0, 1216.0, 1557.0, 1973.0, 2497.0, 3090.0, 4141.0, 5752.0, 8270.0], [92.0, 70.0, 40.0, 36.0, 21.0, 17.0, 25.0, 26.0, 19.0, 15.0, 18.0, 27.0, 26.0, 26.0, 28.0, 27.0, 21.0, 23.0, 35.0, 24.0, 42.0, 45.0, 36.0, 53.0, 47.0, 61.0, 61.0, 59.0, 72.0, 79.0, 92.0, 95.0, 111.0, 120.0, 159.0, 167.0, 176.0, 201.0, 279.0, 316.0, 386.0, 483.0, 580.0, 816.0, 1016.0, 1467.0, 2182.0, 3731.0, 7930.0], [98.0, 59.0, 34.0, 24.0, 12.0, 28.0, 12.0, 14.0, 14.0, 14.0, 23.0, 24.0, 16.0, 20.0, 14.0, 17.0, 13.0, 18.0, 16.0, 16.0, 14.0, 14.0, 23.0, 18.0, 20.0, 19.0, 25.0, 29.0, 32.0, 20.0, 31.0, 35.0, 45.0, 37.0, 53.0, 73.0, 90.0, 84.0, 112.0, 132.0, 135.0, 185.0, 247.0, 307.0, 406.0, 607.0, 1010.0, 1782.0, 4690.0], [108.0, 39.0, 24.0, 24.0, 20.0, 9.0, 18.0, 9.0, 17.0, 8.0, 13.0, 11.0, 13.0, 15.0, 11.0, 10.0, 10.0, 13.0, 15.0, 16.0, 15.0, 7.0, 13.0, 8.0, 14.0, 20.0, 17.0, 12.0, 16.0, 12.0, 14.0, 16.0, 18.0, 17.0, 24.0, 20.0, 26.0, 31.0, 47.0, 51.0, 47.0, 72.0, 93.0, 122.0, 158.0, 264.0, 450.0, 795.0, 2487.0], [87.0, 32.0, 24.0, 17.0, 15.0, 24.0, 11.0, 6.0, 11.0, 6.0, 14.0, 8.0, 14.0, 16.0, 13.0, 6.0, 6.0, 9.0, 9.0, 7.0, 6.0, 10.0, 10.0, 9.0, 8.0, 7.0, 7.0, 7.0, 8.0, 17.0, 6.0, 12.0, 13.0, 14.0, 7.0, 17.0, 17.0, 21.0, 24.0, 17.0, 21.0, 26.0, 46.0, 49.0, 52.0, 119.0, 166.0, 344.0, 1141.0], [75.0, 36.0, 30.0, 15.0, 8.0, 17.0, 9.0, 11.0, 10.0, 7.0, 9.0, 8.0, 8.0, 7.0, 9.0, 7.0, 8.0, 9.0, 13.0, 10.0, 4.0, 3.0, 7.0, 5.0, 9.0, 8.0, 3.0, 7.0, 14.0, 6.0, 8.0, 8.0, 11.0, 8.0, 10.0, 9.0, 11.0, 9.0, 10.0, 20.0, 17.0, 20.0, 22.0, 28.0, 30.0, 45.0, 82.0, 164.0, 571.0], [79.0, 51.0, 23.0, 13.0, 6.0, 8.0, 6.0, 4.0, 6.0, 6.0, 8.0, 11.0, 4.0, 13.0, 5.0, 6.0, 5.0, 4.0, 8.0, 8.0, 8.0, 8.0, 6.0, 4.0, 3.0, 6.0, 6.0, 6.0, 8.0, 8.0, 8.0, 9.0, 11.0, 8.0, 4.0, 7.0, 5.0, 3.0, 13.0, 8.0, 9.0, 13.0, 20.0, 22.0, 22.0, 30.0, 45.0, 86.0, 268.0], [69.0, 37.0, 26.0, 8.0, 8.0, 2.0, 3.0, 8.0, 7.0, 9.0, 8.0, 7.0, 4.0, 6.0, 12.0, 3.0, 1.0, 7.0, 8.0, 7.0, 7.0, 3.0, 6.0, 4.0, 1.0, 2.0, 6.0, 3.0, 5.0, 2.0, 6.0, 5.0, 10.0, 4.0, 2.0, 7.0, 9.0, 8.0, 7.0, 6.0, 4.0, 10.0, 12.0, 12.0, 14.0, 27.0, 34.0, 44.0, 156.0], [60.0, 39.0, 15.0, 11.0, 10.0, 8.0, 5.0, 7.0, 5.0, 4.0, 3.0, 4.0, 4.0, 8.0, 10.0, 5.0, 6.0, 4.0, 6.0, 5.0, 2.0, 6.0, 1.0, 1.0, 1.0, 3.0, 7.0, 0.0, 3.0, 4.0, 8.0, 2.0, 4.0, 4.0, 4.0, 3.0, 6.0, 3.0, 6.0, 8.0, 8.0, 10.0, 11.0, 9.0, 11.0, 15.0, 13.0, 36.0, 101.0], [77.0, 18.0, 22.0, 13.0, 9.0, 8.0, 6.0, 4.0, 3.0, 9.0, 2.0, 4.0, 4.0, 5.0, 5.0, 2.0, 3.0, 3.0, 2.0, 4.0, 3.0, 3.0, 6.0, 2.0, 1.0, 2.0, 2.0, 4.0, 2.0, 3.0, 3.0, 4.0, 3.0, 2.0, 2.0, 2.0, 4.0, 7.0, 5.0, 4.0, 6.0, 4.0, 9.0, 9.0, 8.0, 11.0, 20.0, 20.0, 68.0], [65.0, 24.0, 12.0, 4.0, 8.0, 9.0, 4.0, 2.0, 6.0, 7.0, 1.0, 9.0, 3.0, 7.0, 5.0, 5.0, 5.0, 2.0, 3.0, 1.0, 0.0, 3.0, 4.0, 2.0, 6.0, 1.0, 2.0, 1.0, 2.0, 3.0, 2.0, 1.0, 2.0, 0.0, 1.0, 4.0, 0.0, 1.0, 3.0, 3.0, 4.0, 6.0, 3.0, 5.0, 9.0, 9.0, 14.0, 24.0, 51.0], [55.0, 35.0, 13.0, 8.0, 7.0, 8.0, 4.0, 4.0, 2.0, 3.0, 5.0, 2.0, 3.0, 5.0, 5.0, 7.0, 3.0, 3.0, 4.0, 3.0, 3.0, 0.0, 2.0, 0.0, 2.0, 7.0, 1.0, 1.0, 4.0, 0.0, 2.0, 2.0, 2.0, 2.0, 1.0, 1.0, 1.0, 3.0, 1.0, 0.0, 2.0, 4.0, 1.0, 9.0, 3.0, 5.0, 9.0, 11.0, 35.0], [53.0, 23.0, 17.0, 13.0, 5.0, 3.0, 4.0, 4.0, 4.0, 1.0, 3.0, 6.0, 3.0, 4.0, 5.0, 1.0, 6.0, 7.0, 3.0, 1.0, 3.0, 1.0, 2.0, 0.0, 4.0, 0.0, 2.0, 0.0, 3.0, 0.0, 2.0, 1.0, 0.0, 3.0, 2.0, 2.0, 0.0, 3.0, 3.0, 2.0, 1.0, 4.0, 2.0, 1.0, 1.0, 5.0, 4.0, 13.0, 22.0], [58.0, 24.0, 16.0, 16.0, 4.0, 6.0, 1.0, 5.0, 3.0, 1.0, 5.0, 1.0, 1.0, 7.0, 4.0, 5.0, 7.0, 4.0, 3.0, 2.0, 1.0, 0.0, 3.0, 0.0, 0.0, 1.0, 2.0, 1.0, 0.0, 1.0, 1.0, 2.0, 1.0, 1.0, 4.0, 2.0, 1.0, 1.0, 1.0, 0.0, 0.0, 2.0, 3.0, 4.0, 3.0, 5.0, 3.0, 5.0, 20.0], [57.0, 33.0, 15.0, 9.0, 6.0, 5.0, 4.0, 1.0, 3.0, 3.0, 1.0, 3.0, 5.0, 5.0, 3.0, 1.0, 5.0, 6.0, 2.0, 1.0, 1.0, 3.0, 0.0, 1.0, 1.0, 0.0, 2.0, 1.0, 1.0, 3.0, 1.0, 0.0, 1.0, 0.0, 3.0, 0.0, 0.0, 1.0, 0.0, 1.0, 3.0, 1.0, 2.0, 1.0, 4.0, 2.0, 1.0, 8.0, 11.0], [53.0, 24.0, 17.0, 13.0, 3.0, 8.0, 3.0, 3.0, 2.0, 4.0, 4.0, 4.0, 6.0, 3.0, 2.0, 2.0, 6.0, 3.0, 4.0, 2.0, 2.0, 1.0, 1.0, 0.0, 3.0, 2.0, 0.0, 0.0, 2.0, 1.0, 0.0, 0.0, 1.0, 0.0, 1.0, 1.0, 1.0, 0.0, 1.0, 0.0, 0.0, 0.0, 0.0, 0.0, 2.0, 2.0, 4.0, 8.0, 11.0], [70.0, 16.0, 21.0, 9.0, 8.0, 5.0, 4.0, 3.0, 1.0, 3.0, 5.0, 4.0, 3.0, 0.0, 3.0, 2.0, 0.0, 7.0, 5.0, 3.0, 1.0, 2.0, 3.0, 2.0, 0.0, 0.0, 1.0, 1.0, 2.0, 0.0, 0.0, 3.0, 0.0, 2.0, 1.0, 0.0, 2.0, 0.0, 0.0, 0.0, 0.0, 0.0, 2.0, 1.0, 3.0, 3.0, 2.0, 2.0, 6.0], [52.0, 23.0, 12.0, 12.0, 5.0, 5.0, 4.0, 3.0, 6.0, 7.0, 2.0, 1.0, 5.0, 4.0, 3.0, 1.0, 1.0, 4.0, 4.0, 4.0, 2.0, 2.0, 2.0, 1.0, 0.0, 0.0, 1.0, 0.0, 0.0, 0.0, 2.0, 0.0, 0.0, 0.0, 1.0, 2.0, 0.0, 2.0, 1.0, 0.0, 1.0, 0.0, 1.0, 2.0, 0.0, 0.0, 1.0, 3.0, 9.0], [76.0, 26.0, 11.0, 10.0, 6.0, 1.0, 4.0, 3.0, 6.0, 8.0, 2.0, 3.0, 1.0, 4.0, 4.0, 3.0, 2.0, 6.0, 4.0, 0.0, 2.0, 2.0, 2.0, 2.0, 0.0, 0.0, 0.0, 3.0, 0.0, 0.0, 1.0, 0.0, 1.0, 0.0, 2.0, 0.0, 0.0, 2.0, 0.0, 0.0, 1.0, 2.0, 0.0, 3.0, 1.0, 0.0, 0.0, 1.0, 2.0], [61.0, 33.0, 16.0, 9.0, 7.0, 4.0, 5.0, 7.0, 0.0, 6.0, 1.0, 3.0, 3.0, 5.0, 4.0, 3.0, 2.0, 1.0, 4.0, 1.0, 2.0, 3.0, 1.0, 1.0, 1.0, 1.0, 2.0, 1.0, 0.0, 0.0, 0.0, 0.0, 1.0, 1.0, 2.0, 1.0, 0.0, 0.0, 0.0, 0.0, 1.0, 1.0, 0.0, 1.0, 0.0, 3.0, 1.0, 1.0, 1.0], [62.0, 26.0, 15.0, 8.0, 5.0, 6.0, 1.0, 6.0, 3.0, 4.0, 3.0, 4.0, 3.0, 2.0, 2.0, 0.0, 3.0, 5.0, 2.0, 2.0, 3.0, 2.0, 1.0, 1.0, 2.0, 2.0, 0.0, 2.0, 2.0, 0.0, 1.0, 1.0, 0.0, 1.0, 1.0, 1.0, 0.0, 0.0, 1.0, 1.0, 1.0, 1.0, 2.0, 0.0, 0.0, 0.0, 0.0, 1.0, 1.0], [64.0, 29.0, 22.0, 9.0, 5.0, 3.0, 3.0, 3.0, 3.0, 4.0, 8.0, 2.0, 4.0, 2.0, 4.0, 5.0, 2.0, 3.0, 1.0, 1.0, 0.0, 1.0, 4.0, 1.0, 0.0, 0.0, 0.0, 1.0, 0.0, 1.0, 0.0, 1.0, 1.0, 2.0, 0.0, 0.0, 0.0, 1.0, 0.0, 1.0, 0.0, 2.0, 0.0, 0.0, 0.0, 1.0, 0.0, 1.0, 1.0], [60.0, 31.0, 19.0, 11.0, 3.0, 2.0, 5.0, 1.0, 7.0, 3.0, 3.0, 6.0, 1.0, 4.0, 1.0, 3.0, 2.0, 7.0, 1.0, 3.0, 1.0, 2.0, 0.0, 5.0, 0.0, 1.0, 2.0, 1.0, 0.0, 1.0, 0.0, 0.0, 1.0, 0.0, 1.0, 0.0, 1.0, 0.0, 0.0, 0.0, 0.0, 1.0, 1.0, 0.0, 0.0, 0.0, 1.0, 1.0, 2.0], [51.0, 29.0, 17.0, 11.0, 4.0, 2.0, 3.0, 2.0, 7.0, 4.0, 4.0, 4.0, 2.0, 3.0, 1.0, 1.0, 3.0, 3.0, 1.0, 3.0, 3.0, 2.0, 2.0, 1.0, 4.0, 0.0, 1.0, 1.0, 1.0, 0.0, 0.0, 0.0, 0.0, 1.0, 1.0, 0.0, 2.0, 0.0, 1.0, 0.0, 1.0, 0.0, 0.0, 0.0, 2.0, 1.0, 0.0, 0.0, 2.0], [55.0, 25.0, 18.0, 11.0, 4.0, 6.0, 3.0, 5.0, 3.0, 5.0, 3.0, 7.0, 2.0, 1.0, 4.0, 4.0, 3.0, 2.0, 1.0, 2.0, 1.0, 1.0, 0.0, 2.0, 1.0, 1.0, 1.0, 0.0, 0.0, 1.0, 2.0, 2.0, 0.0, 0.0, 0.0, 0.0, 0.0, 0.0, 0.0, 1.0, 0.0, 2.0, 1.0, 0.0, 1.0, 0.0, 0.0, 0.0, 0.0], [70.0, 35.0, 19.0, 9.0, 9.0, 5.0, 1.0, 3.0, 1.0, 4.0, 4.0, 1.0, 3.0, 1.0, 4.0, 3.0, 3.0, 6.0, 1.0, 2.0, 3.0, 1.0, 2.0, 0.0, 1.0, 1.0, 0.0, 0.0, 2.0, 0.0, 1.0, 1.0, 0.0, 2.0, 1.0, 0.0, 1.0, 0.0, 1.0, 0.0, 0.0, 1.0, 0.0, 0.0, 0.0, 0.0, 2.0, 0.0, 0.0], [68.0, 24.0, 15.0, 11.0, 8.0, 2.0, 5.0, 3.0, 4.0, 3.0, 4.0, 3.0, 2.0, 8.0, 2.0, 2.0, 3.0, 0.0, 0.0, 4.0, 4.0, 1.0, 3.0, 1.0, 1.0, 2.0, 0.0, 1.0, 0.0, 0.0, 0.0, 0.0, 2.0, 0.0, 0.0, 2.0, 1.0, 0.0, 0.0, 0.0, 0.0, 0.0, 1.0, 1.0, 1.0, 1.0, 0.0, 1.0, 0.0], [71.0, 32.0, 17.0, 11.0, 3.0, 3.0, 2.0, 4.0, 3.0, 6.0, 6.0, 1.0, 7.0, 1.0, 4.0, 0.0, 2.0, 2.0, 3.0, 2.0, 2.0, 2.0, 3.0, 3.0, 0.0, 1.0, 0.0, 1.0, 1.0, 0.0, 0.0, 1.0, 1.0, 1.0, 0.0, 0.0, 2.0, 1.0, 1.0, 0.0, 1.0, 0.0, 1.0, 0.0, 0.0, 1.0, 1.0, 0.0, 1.0], [60.0, 34.0, 16.0, 7.0, 7.0, 6.0, 5.0, 2.0, 4.0, 2.0, 5.0, 3.0, 2.0, 6.0, 2.0, 6.0, 2.0, 1.0, 0.0, 4.0, 1.0, 3.0, 0.0, 1.0, 2.0, 1.0, 0.0, 1.0, 1.0, 0.0, 0.0, 1.0, 1.0, 0.0, 2.0, 0.0, 0.0, 1.0, 0.0, 2.0, 0.0, 0.0, 1.0, 1.0, 0.0, 1.0, 0.0, 1.0, 0.0], [73.0, 27.0, 12.0, 8.0, 10.0, 6.0, 4.0, 4.0, 2.0, 4.0, 3.0, 1.0, 2.0, 2.0, 5.0, 3.0, 0.0, 3.0, 1.0, 2.0, 4.0, 2.0, 1.0, 3.0, 0.0, 1.0, 3.0, 0.0, 3.0, 0.0, 0.0, 2.0, 1.0, 1.0, 0.0, 0.0, 0.0, 0.0, 1.0, 1.0, 1.0, 1.0, 0.0, 1.0, 1.0, 1.0, 1.0, 2.0, 0.0], [66.0, 23.0, 18.0, 9.0, 6.0, 3.0, 4.0, 2.0, 1.0, 2.0, 7.0, 6.0, 1.0, 1.0, 2.0, 7.0, 2.0, 1.0, 3.0, 3.0, 3.0, 0.0, 1.0, 1.0, 3.0, 0.0, 1.0, 2.0, 0.0, 1.0, 0.0, 1.0, 1.0, 0.0, 0.0, 2.0, 1.0, 0.0, 2.0, 0.0, 0.0, 1.0, 0.0, 0.0, 0.0, 1.0, 1.0, 0.0, 1.0], [65.0, 26.0, 15.0, 7.0, 6.0, 8.0, 5.0, 4.0, 4.0, 1.0, 5.0, 1.0, 4.0, 6.0, 1.0, 2.0, 6.0, 2.0, 2.0, 4.0, 0.0, 3.0, 0.0, 1.0, 0.0, 1.0, 1.0, 1.0, 1.0, 1.0, 0.0, 3.0, 0.0, 1.0, 0.0, 0.0, 2.0, 1.0, 0.0, 1.0, 0.0, 0.0, 0.0, 2.0, 1.0, 0.0, 0.0, 1.0, 0.0], [81.0, 16.0, 17.0, 8.0, 9.0, 6.0, 5.0, 7.0, 2.0, 5.0, 1.0, 5.0, 3.0, 3.0, 1.0, 1.0, 4.0, 2.0, 2.0, 2.0, 4.0, 1.0, 1.0, 2.0, 1.0, 0.0, 0.0, 2.0, 1.0, 1.0, 1.0, 1.0, 0.0, 0.0, 1.0, 0.0, 0.0, 0.0, 3.0, 0.0, 0.0, 2.0, 1.0, 0.0, 2.0, 0.0, 0.0, 0.0, 0.0], [64.0, 23.0, 14.0, 10.0, 6.0, 6.0, 1.0, 1.0, 8.0, 1.0, 5.0, 1.0, 4.0, 3.0, 2.0, 3.0, 5.0, 3.0, 0.0, 2.0, 3.0, 1.0, 0.0, 1.0, 1.0, 2.0, 1.0, 1.0, 4.0, 0.0, 0.0, 0.0, 1.0, 1.0, 0.0, 1.0, 0.0, 0.0, 0.0, 0.0, 0.0, 0.0, 0.0, 1.0, 2.0, 0.0, 0.0, 1.0, 1.0], [72.0, 22.0, 14.0, 9.0, 6.0, 7.0, 2.0, 2.0, 4.0, 7.0, 2.0, 3.0, 6.0, 2.0, 3.0, 4.0, 1.0, 1.0, 1.0, 6.0, 0.0, 2.0, 2.0, 0.0, 2.0, 0.0, 3.0, 2.0, 1.0, 1.0, 2.0, 0.0, 0.0, 0.0, 0.0, 0.0, 2.0, 0.0, 1.0, 0.0, 1.0, 0.0, 0.0, 0.0, 0.0, 1.0, 0.0, 0.0, 1.0], [57.0, 28.0, 17.0, 9.0, 10.0, 7.0, 3.0, 2.0, 2.0, 3.0, 0.0, 7.0, 1.0, 5.0, 6.0, 1.0, 3.0, 5.0, 1.0, 2.0, 1.0, 1.0, 1.0, 1.0, 2.0, 1.0, 1.0, 2.0, 0.0, 1.0, 1.0, 0.0, 2.0, 0.0, 0.0, 1.0, 1.0, 0.0, 0.0, 1.0, 0.0, 0.0, 1.0, 1.0, 0.0, 1.0, 1.0, 0.0, 3.0], [73.0, 27.0, 16.0, 11.0, 5.0, 5.0, 5.0, 1.0, 2.0, 4.0, 6.0, 4.0, 3.0, 1.0, 1.0, 2.0, 5.0, 2.0, 3.0, 1.0, 3.0, 2.0, 0.0, 3.0, 1.0, 1.0, 0.0, 3.0, 2.0, 0.0, 2.0, 0.0, 2.0, 1.0, 1.0, 1.0, 0.0, 0.0, 0.0, 0.0, 1.0, 0.0, 0.0, 0.0, 0.0, 0.0, 0.0, 1.0, 0.0], [67.0, 28.0, 13.0, 5.0, 11.0, 3.0, 2.0, 7.0, 2.0, 0.0, 4.0, 4.0, 4.0, 2.0, 2.0, 7.0, 2.0, 4.0, 4.0, 2.0, 2.0, 1.0, 3.0, 1.0, 1.0, 0.0, 0.0, 0.0, 2.0, 2.0, 0.0, 0.0, 0.0, 1.0, 2.0, 1.0, 1.0, 0.0, 0.0, 1.0, 0.0, 0.0, 2.0, 0.0, 0.0, 0.0, 0.0, 0.0, 0.0], [73.0, 25.0, 22.0, 8.0, 7.0, 4.0, 5.0, 1.0, 3.0, 3.0, 6.0, 5.0, 5.0, 5.0, 6.0, 0.0, 3.0, 2.0, 1.0, 4.0, 2.0, 0.0, 0.0, 2.0, 1.0, 5.0, 0.0, 1.0, 0.0, 1.0, 0.0, 1.0, 1.0, 0.0, 0.0, 2.0, 0.0, 0.0, 1.0, 2.0, 1.0, 0.0, 1.0, 0.0, 0.0, 0.0, 0.0, 0.0, 0.0], [64.0, 33.0, 14.0, 6.0, 4.0, 6.0, 4.0, 4.0, 6.0, 1.0, 3.0, 2.0, 5.0, 4.0, 5.0, 3.0, 2.0, 1.0, 3.0, 0.0, 2.0, 2.0, 1.0, 1.0, 2.0, 3.0, 0.0, 2.0, 0.0, 3.0, 1.0, 1.0, 0.0, 0.0, 0.0, 0.0, 1.0, 0.0, 2.0, 0.0, 2.0, 0.0, 0.0, 0.0, 0.0, 0.0, 3.0, 0.0, 0.0], [63.0, 28.0, 16.0, 11.0, 3.0, 6.0, 7.0, 5.0, 2.0, 3.0, 5.0, 4.0, 4.0, 1.0, 8.0, 3.0, 1.0, 1.0, 3.0, 2.0, 1.0, 3.0, 2.0, 1.0, 1.0, 2.0, 0.0, 1.0, 1.0, 0.0, 3.0, 0.0, 0.0, 0.0, 1.0, 1.0, 0.0, 1.0, 0.0, 1.0, 0.0, 0.0, 1.0, 1.0, 0.0, 0.0, 1.0, 0.0, 0.0]],
    "Name": "sCurve-0",
    "Overflow": 2071417.0,
    "Type": "Histo2d",
    "Underflow": 0.0,
    "x": {
        "AxisTitle": "Vcal",
        "Bins": 51,
        "High": 302.5,
        "Low": 47.5
    },
    "y": {
        "AxisTitle": "Occupancy",
        "Bins": 49,
        "High": 49.5,
        "Low": 0.5
    },
    "z": {
        "AxisTitle": "Number of pixels"
    }
}