{
    "Data": [0.0, 0.0, 0.0, 0.0, 0.0, 0.0, 0.0, 0.0, 0.0, 0.0, 0.0, 0.0, 0.0, 0.0, 0.0, 0.0, 0.0, 0.0, 0.0, 3.0, 0.0, 1.0, 1.0, 4.0, 0.0, 8.0, 27.0, 4.0, 29.0, 35.0, 46.0, 48.0, 47.0, 46.0, 49.0, 50.0, 45.0, 50.0, 50.0, 13.0, 50.0, 50.0, 50.0, 50.0, 50.0, 50.0, 49.0, 13.0, 41.0, 50.0, 50.0],
    "Name": "Scurve-10-96",
    "Overflow": 0.0,
    "Type": "Histo1d",
    "Underflow": 0.0,
    "x": {
        "AxisTitle": "Vcal",
        "Bins": 51,
        "High": 302.5,
        "Low": 47.5
    },
    "y": {
        "AxisTitle": "Occupancy"
    },
    "z": {
        "AxisTitle": "z"
    }
}