{
    "Data": [12.0, 25.0, 1.0, 2.0, 5.0, 79.0, 455.0, 1490.0, 3069.0, 4328.0, 4429.0, 3697.0, 2998.0, 2611.0, 2382.0, 2222.0, 2028.0, 1953.0, 1931.0, 1822.0, 2073.0, 2229.0, 2429.0, 2379.0, 2004.0, 1558.0, 1103.0, 741.0, 539.0, 404.0, 380.0, 399.0, 588.0, 742.0, 975.0, 1208.0, 1420.0, 1620.0, 1787.0, 1990.0, 1966.0, 1884.0, 1768.0, 1586.0, 1334.0, 1157.0, 909.0, 741.0, 591.0, 431.0, 340.0, 245.0, 164.0, 134.0, 101.0, 77.0, 59.0, 48.0, 33.0, 28.0, 26.0, 16.0, 21.0, 23.0, 21.0, 12.0, 11.0, 7.0, 12.0, 8.0, 4.0, 9.0, 6.0, 1.0, 6.0, 2.0, 4.0, 5.0, 3.0, 1.0, 4.0, 3.0, 0.0, 2.0, 1.0, 1.0, 1.0, 0.0, 2.0, 1.0],
    "Name": "NoiseDist-0",
    "Overflow": 13.0,
    "Type": "Histo1d",
    "Underflow": 0.0,
    "x": {
        "AxisTitle": "Noise [e]",
        "Bins": 90,
        "High": 451.0,
        "Low": -2.0
    },
    "y": {
        "AxisTitle": "Number of Pixels"
    },
    "z": {
        "AxisTitle": "z"
    }
}