{
    "Data": [[1337.0, 408.0, 168.0, 103.0, 83.0, 35.0, 30.0, 26.0, 19.0, 12.0, 13.0, 17.0, 14.0, 6.0, 5.0, 2.0, 5.0, 4.0, 5.0, 2.0, 6.0, 4.0, 4.0, 1.0, 4.0, 3.0, 1.0, 1.0, 2.0, 0.0, 1.0, 3.0, 0.0, 2.0, 0.0, 3.0, 1.0, 2.0, 0.0, 1.0, 0.0, 1.0, 0.0, 1.0, 2.0, 2.0, 2.0, 0.0, 0.0], [2240.0, 808.0, 412.0, 291.0, 134.0, 119.0, 89.0, 66.0, 56.0, 40.0, 34.0, 35.0, 23.0, 20.0, 18.0, 13.0, 13.0, 12.0, 7.0, 8.0, 11.0, 6.0, 6.0, 4.0, 5.0, 3.0, 2.0, 5.0, 2.0, 2.0, 4.0, 3.0, 3.0, 4.0, 5.0, 3.0, 3.0, 1.0, 2.0, 2.0, 2.0, 3.0, 2.0, 2.0, 1.0, 0.0, 0.0, 0.0, 4.0], [3296.0, 1327.0, 757.0, 543.0, 392.0, 278.0, 214.0, 155.0, 115.0, 88.0, 92.0, 62.0, 59.0, 42.0, 50.0, 49.0, 36.0, 29.0, 24.0, 21.0, 21.0, 14.0, 14.0, 18.0, 12.0, 11.0, 6.0, 11.0, 9.0, 5.0, 6.0, 6.0, 8.0, 3.0, 2.0, 3.0, 6.0, 5.0, 2.0, 2.0, 7.0, 5.0, 4.0, 3.0, 4.0, 1.0, 5.0, 2.0, 3.0], [4060.0, 1963.0, 1223.0, 864.0, 682.0, 508.0, 396.0, 343.0, 268.0, 227.0, 173.0, 171.0, 165.0, 108.0, 119.0, 101.0, 79.0, 66.0, 71.0, 53.0, 50.0, 48.0, 37.0, 34.0, 27.0, 35.0, 26.0, 31.0, 14.0, 22.0, 16.0, 10.0, 14.0, 14.0, 10.0, 11.0, 9.0, 13.0, 10.0, 7.0, 9.0, 8.0, 7.0, 6.0, 5.0, 6.0, 6.0, 7.0, 9.0], [4006.0, 2546.0, 1704.0, 1306.0, 1049.0, 789.0, 678.0, 557.0, 446.0, 438.0, 351.0, 348.0, 288.0, 266.0, 222.0, 214.0, 195.0, 156.0, 159.0, 119.0, 137.0, 99.0, 105.0, 108.0, 81.0, 69.0, 63.0, 54.0, 48.0, 46.0, 48.0, 46.0, 42.0, 36.0, 26.0, 29.0, 23.0, 31.0, 18.0, 36.0, 16.0, 22.0, 12.0, 21.0, 11.0, 8.0, 8.0, 14.0, 16.0], [3139.0, 2229.0, 1816.0, 1513.0, 1239.0, 1118.0, 952.0, 820.0, 751.0, 713.0, 578.0, 533.0, 458.0, 399.0, 390.0, 384.0, 332.0, 276.0, 300.0, 255.0, 261.0, 199.0, 201.0, 188.0, 205.0, 155.0, 136.0, 161.0, 159.0, 134.0, 125.0, 113.0, 92.0, 90.0, 86.0, 78.0, 82.0, 67.0, 49.0, 50.0, 53.0, 51.0, 41.0, 53.0, 40.0, 28.0, 30.0, 24.0, 23.0], [2327.0, 1632.0, 1380.0, 1260.0, 1166.0, 1090.0, 957.0, 981.0, 898.0, 844.0, 741.0, 741.0, 724.0, 670.0, 586.0, 559.0, 492.0, 495.0, 453.0, 414.0, 384.0, 376.0, 382.0, 357.0, 312.0, 290.0, 304.0, 274.0, 280.0, 291.0, 237.0, 233.0, 211.0, 208.0, 222.0, 189.0, 160.0, 150.0, 173.0, 146.0, 150.0, 115.0, 103.0, 100.0, 109.0, 85.0, 83.0, 67.0, 75.0], [2945.0, 1441.0, 959.0, 859.0, 792.0, 821.0, 743.0, 740.0, 771.0, 748.0, 655.0, 687.0, 737.0, 684.0, 650.0, 637.0, 639.0, 643.0, 610.0, 580.0, 588.0, 569.0, 593.0, 516.0, 476.0, 476.0, 513.0, 455.0, 486.0, 418.0, 393.0, 390.0, 388.0, 362.0, 316.0, 337.0, 328.0, 346.0, 364.0, 322.0, 275.0, 308.0, 243.0, 265.0, 258.0, 242.0, 207.0, 207.0, 184.0], [4169.0, 2123.0, 1382.0, 977.0, 740.0, 656.0, 564.0, 557.0, 522.0, 510.0, 519.0, 542.0, 556.0, 517.0, 526.0, 507.0, 574.0, 554.0, 555.0, 545.0, 578.0, 615.0, 586.0, 546.0, 586.0, 593.0, 546.0, 647.0, 623.0, 595.0, 537.0, 562.0, 590.0, 580.0, 571.0, 583.0, 561.0, 567.0, 500.0, 537.0, 528.0, 530.0, 516.0, 511.0, 533.0, 480.0, 500.0, 509.0, 463.0], [4457.0, 2747.0, 2008.0, 1491.0, 1308.0, 1056.0, 871.0, 750.0, 654.0, 626.0, 577.0, 546.0, 460.0, 461.0, 429.0, 431.0, 422.0, 439.0, 424.0, 413.0, 435.0, 444.0, 459.0, 499.0, 491.0, 522.0, 529.0, 516.0, 577.0, 641.0, 577.0, 625.0, 605.0, 616.0, 712.0, 682.0, 689.0, 764.0, 750.0, 793.0, 753.0, 805.0, 906.0, 803.0, 814.0, 938.0, 910.0, 967.0, 1101.0], [2892.0, 2072.0, 1761.0, 1628.0, 1414.0, 1285.0, 1118.0, 1055.0, 1002.0, 927.0, 852.0, 804.0, 739.0, 702.0, 637.0, 639.0, 605.0, 583.0, 523.0, 497.0, 526.0, 467.0, 503.0, 464.0, 440.0, 421.0, 483.0, 477.0, 503.0, 481.0, 453.0, 556.0, 582.0, 566.0, 600.0, 604.0, 693.0, 771.0, 788.0, 762.0, 881.0, 999.0, 1058.0, 1106.0, 1223.0, 1371.0, 1529.0, 1730.0, 2115.0], [1599.0, 1093.0, 977.0, 916.0, 919.0, 859.0, 861.0, 860.0, 802.0, 828.0, 830.0, 787.0, 765.0, 779.0, 757.0, 760.0, 742.0, 747.0, 706.0, 727.0, 732.0, 656.0, 742.0, 633.0, 648.0, 651.0, 632.0, 651.0, 631.0, 630.0, 640.0, 564.0, 632.0, 659.0, 632.0, 665.0, 653.0, 680.0, 718.0, 772.0, 834.0, 919.0, 1080.0, 1101.0, 1319.0, 1657.0, 1908.0, 2382.0, 3357.0], [1313.0, 486.0, 351.0, 371.0, 346.0, 366.0, 394.0, 390.0, 417.0, 469.0, 443.0, 458.0, 470.0, 514.0, 521.0, 494.0, 556.0, 526.0, 571.0, 566.0, 576.0, 594.0, 614.0, 625.0, 598.0, 686.0, 678.0, 727.0, 693.0, 693.0, 744.0, 775.0, 778.0, 837.0, 834.0, 861.0, 894.0, 934.0, 890.0, 1044.0, 1018.0, 1117.0, 1227.0, 1275.0, 1391.0, 1731.0, 2040.0, 2739.0, 4370.0], [1739.0, 549.0, 232.0, 147.0, 113.0, 124.0, 140.0, 119.0, 114.0, 155.0, 146.0, 153.0, 189.0, 197.0, 200.0, 226.0, 241.0, 268.0, 264.0, 261.0, 265.0, 348.0, 353.0, 352.0, 374.0, 435.0, 409.0, 481.0, 462.0, 508.0, 514.0, 553.0, 621.0, 635.0, 659.0, 779.0, 772.0, 863.0, 900.0, 1045.0, 1156.0, 1228.0, 1400.0, 1504.0, 1709.0, 2118.0, 2515.0, 3308.0, 5443.0], [2534.0, 807.0, 346.0, 139.0, 69.0, 49.0, 52.0, 37.0, 33.0, 41.0, 43.0, 42.0, 43.0, 35.0, 68.0, 67.0, 76.0, 81.0, 80.0, 104.0, 101.0, 109.0, 120.0, 117.0, 116.0, 137.0, 180.0, 155.0, 221.0, 224.0, 240.0, 282.0, 268.0, 341.0, 343.0, 394.0, 417.0, 496.0, 533.0, 627.0, 700.0, 844.0, 951.0, 1197.0, 1511.0, 1834.0, 2577.0, 3739.0, 6514.0], [3401.0, 1315.0, 619.0, 270.0, 135.0, 88.0, 36.0, 33.0, 25.0, 19.0, 16.0, 18.0, 14.0, 20.0, 8.0, 22.0, 22.0, 20.0, 23.0, 23.0, 20.0, 30.0, 34.0, 42.0, 32.0, 39.0, 63.0, 55.0, 68.0, 74.0, 66.0, 90.0, 88.0, 121.0, 128.0, 157.0, 166.0, 195.0, 244.0, 287.0, 357.0, 396.0, 509.0, 634.0, 780.0, 1124.0, 1574.0, 2765.0, 5713.0], [4308.0, 1938.0, 1020.0, 480.0, 293.0, 148.0, 98.0, 78.0, 40.0, 18.0, 19.0, 14.0, 10.0, 8.0, 11.0, 11.0, 8.0, 6.0, 13.0, 8.0, 8.0, 14.0, 6.0, 15.0, 17.0, 7.0, 15.0, 19.0, 22.0, 21.0, 26.0, 20.0, 22.0, 36.0, 33.0, 37.0, 50.0, 65.0, 88.0, 81.0, 118.0, 148.0, 178.0, 253.0, 355.0, 463.0, 776.0, 1394.0, 3630.0], [4472.0, 2476.0, 1511.0, 896.0, 489.0, 311.0, 200.0, 143.0, 107.0, 54.0, 43.0, 30.0, 13.0, 12.0, 14.0, 10.0, 6.0, 10.0, 6.0, 3.0, 2.0, 8.0, 6.0, 4.0, 8.0, 5.0, 7.0, 8.0, 7.0, 12.0, 10.0, 11.0, 10.0, 15.0, 12.0, 12.0, 13.0, 19.0, 28.0, 31.0, 29.0, 42.0, 54.0, 78.0, 120.0, 170.0, 309.0, 634.0, 1815.0], [4640.0, 2660.0, 1914.0, 1206.0, 899.0, 523.0, 367.0, 298.0, 186.0, 129.0, 87.0, 63.0, 49.0, 26.0, 26.0, 18.0, 14.0, 11.0, 9.0, 10.0, 4.0, 6.0, 7.0, 6.0, 4.0, 1.0, 1.0, 8.0, 8.0, 5.0, 5.0, 4.0, 4.0, 7.0, 5.0, 9.0, 11.0, 14.0, 16.0, 9.0, 20.0, 19.0, 15.0, 30.0, 43.0, 66.0, 98.0, 234.0, 780.0], [4175.0, 2916.0, 2126.0, 1604.0, 1175.0, 911.0, 657.0, 493.0, 374.0, 264.0, 205.0, 159.0, 151.0, 82.0, 67.0, 47.0, 39.0, 26.0, 27.0, 13.0, 13.0, 12.0, 8.0, 7.0, 2.0, 4.0, 4.0, 1.0, 3.0, 5.0, 0.0, 6.0, 4.0, 3.0, 1.0, 5.0, 7.0, 7.0, 8.0, 6.0, 3.0, 12.0, 16.0, 12.0, 15.0, 29.0, 39.0, 99.0, 350.0], [3770.0, 2852.0, 2280.0, 1755.0, 1256.0, 1046.0, 828.0, 621.0, 524.0, 419.0, 338.0, 259.0, 194.0, 156.0, 153.0, 109.0, 80.0, 82.0, 58.0, 35.0, 31.0, 22.0, 19.0, 19.0, 20.0, 10.0, 10.0, 5.0, 3.0, 7.0, 4.0, 3.0, 4.0, 3.0, 4.0, 0.0, 4.0, 6.0, 0.0, 4.0, 1.0, 3.0, 9.0, 12.0, 15.0, 13.0, 23.0, 35.0, 173.0], [3572.0, 2708.0, 2284.0, 1721.0, 1428.0, 1169.0, 933.0, 802.0, 585.0, 522.0, 408.0, 351.0, 298.0, 243.0, 187.0, 167.0, 137.0, 106.0, 96.0, 81.0, 63.0, 48.0, 40.0, 40.0, 21.0, 21.0, 21.0, 9.0, 19.0, 6.0, 12.0, 6.0, 9.0, 5.0, 1.0, 2.0, 1.0, 0.0, 1.0, 3.0, 5.0, 2.0, 2.0, 2.0, 2.0, 7.0, 15.0, 33.0, 88.0], [3283.0, 2508.0, 2156.0, 1700.0, 1386.0, 1168.0, 1032.0, 861.0, 775.0, 631.0, 545.0, 450.0, 433.0, 345.0, 257.0, 255.0, 225.0, 169.0, 148.0, 137.0, 101.0, 74.0, 86.0, 69.0, 50.0, 49.0, 49.0, 30.0, 21.0, 19.0, 23.0, 15.0, 12.0, 14.0, 7.0, 4.0, 4.0, 4.0, 6.0, 6.0, 3.0, 3.0, 5.0, 2.0, 1.0, 2.0, 6.0, 20.0, 40.0], [3046.0, 2238.0, 2052.0, 1548.0, 1360.0, 1243.0, 1048.0, 872.0, 757.0, 722.0, 600.0, 461.0, 458.0, 438.0, 348.0, 307.0, 281.0, 243.0, 216.0, 199.0, 180.0, 176.0, 122.0, 106.0, 111.0, 86.0, 77.0, 51.0, 58.0, 59.0, 43.0, 31.0, 23.0, 22.0, 22.0, 24.0, 13.0, 7.0, 10.0, 15.0, 6.0, 5.0, 1.0, 6.0, 1.0, 6.0, 7.0, 13.0, 26.0], [2579.0, 2120.0, 1874.0, 1612.0, 1517.0, 1284.0, 1070.0, 933.0, 889.0, 756.0, 658.0, 611.0, 531.0, 500.0, 390.0, 385.0, 335.0, 325.0, 270.0, 261.0, 261.0, 211.0, 177.0, 183.0, 167.0, 129.0, 123.0, 118.0, 100.0, 77.0, 49.0, 55.0, 51.0, 42.0, 37.0, 32.0, 26.0, 19.0, 14.0, 15.0, 13.0, 2.0, 13.0, 5.0, 10.0, 5.0, 2.0, 2.0, 15.0], [2389.0, 2072.0, 1824.0, 1604.0, 1308.0, 1189.0, 1165.0, 957.0, 861.0, 747.0, 677.0, 584.0, 555.0, 522.0, 484.0, 463.0, 403.0, 377.0, 330.0, 301.0, 317.0, 266.0, 249.0, 210.0, 205.0, 161.0, 182.0, 149.0, 117.0, 132.0, 122.0, 93.0, 105.0, 87.0, 66.0, 57.0, 64.0, 56.0, 45.0, 33.0, 36.0, 18.0, 19.0, 24.0, 23.0, 11.0, 11.0, 13.0, 19.0], [2164.0, 1762.0, 1659.0, 1411.0, 1219.0, 1164.0, 1058.0, 972.0, 823.0, 809.0, 696.0, 689.0, 561.0, 563.0, 499.0, 510.0, 464.0, 404.0, 386.0, 381.0, 326.0, 317.0, 299.0, 306.0, 257.0, 267.0, 231.0, 213.0, 190.0, 192.0, 183.0, 144.0, 130.0, 124.0, 115.0, 116.0, 112.0, 93.0, 81.0, 69.0, 65.0, 45.0, 40.0, 35.0, 24.0, 25.0, 21.0, 17.0, 15.0], [1881.0, 1558.0, 1504.0, 1430.0, 1243.0, 1216.0, 1028.0, 954.0, 819.0, 830.0, 738.0, 675.0, 638.0, 580.0, 559.0, 510.0, 444.0, 459.0, 407.0, 411.0, 362.0, 320.0, 317.0, 329.0, 305.0, 289.0, 259.0, 236.0, 229.0, 206.0, 200.0, 176.0, 193.0, 158.0, 158.0, 134.0, 133.0, 134.0, 101.0, 118.0, 97.0, 78.0, 93.0, 79.0, 64.0, 64.0, 43.0, 26.0, 23.0], [1442.0, 1385.0, 1379.0, 1376.0, 1228.0, 1149.0, 1108.0, 948.0, 975.0, 791.0, 738.0, 587.0, 557.0, 490.0, 487.0, 467.0, 457.0, 424.0, 361.0, 410.0, 364.0, 348.0, 320.0, 332.0, 323.0, 295.0, 281.0, 279.0, 254.0, 244.0, 210.0, 236.0, 229.0, 226.0, 213.0, 203.0, 179.0, 206.0, 197.0, 208.0, 155.0, 169.0, 163.0, 133.0, 138.0, 129.0, 110.0, 104.0, 73.0], [1557.0, 1471.0, 1281.0, 1172.0, 1036.0, 963.0, 926.0, 898.0, 808.0, 742.0, 721.0, 722.0, 605.0, 591.0, 583.0, 524.0, 544.0, 490.0, 404.0, 398.0, 343.0, 318.0, 315.0, 286.0, 292.0, 265.0, 266.0, 231.0, 255.0, 240.0, 235.0, 254.0, 226.0, 245.0, 237.0, 233.0, 238.0, 264.0, 267.0, 226.0, 254.0, 219.0, 234.0, 211.0, 231.0, 213.0, 200.0, 165.0, 116.0], [1309.0, 1174.0, 1105.0, 995.0, 772.0, 672.0, 820.0, 760.0, 754.0, 767.0, 658.0, 602.0, 549.0, 475.0, 498.0, 574.0, 531.0, 495.0, 445.0, 426.0, 357.0, 422.0, 395.0, 376.0, 334.0, 342.0, 307.0, 287.0, 317.0, 312.0, 290.0, 297.0, 328.0, 275.0, 299.0, 264.0, 257.0, 244.0, 294.0, 272.0, 285.0, 268.0, 292.0, 318.0, 299.0, 295.0, 349.0, 284.0, 328.0], [1073.0, 954.0, 991.0, 1002.0, 838.0, 684.0, 733.0, 749.0, 808.0, 768.0, 537.0, 555.0, 492.0, 499.0, 555.0, 537.0, 466.0, 474.0, 373.0, 394.0, 368.0, 353.0, 329.0, 351.0, 283.0, 260.0, 246.0, 239.0, 257.0, 266.0, 260.0, 241.0, 266.0, 233.0, 219.0, 243.0, 270.0, 276.0, 287.0, 324.0, 320.0, 325.0, 364.0, 400.0, 478.0, 467.0, 476.0, 539.0, 605.0], [1056.0, 684.0, 804.0, 871.0, 682.0, 759.0, 686.0, 650.0, 457.0, 484.0, 553.0, 668.0, 619.0, 566.0, 581.0, 527.0, 459.0, 452.0, 335.0, 309.0, 372.0, 352.0, 297.0, 267.0, 356.0, 309.0, 329.0, 266.0, 298.0, 323.0, 325.0, 213.0, 240.0, 241.0, 259.0, 288.0, 317.0, 282.0, 272.0, 292.0, 220.0, 291.0, 292.0, 362.0, 451.0, 475.0, 634.0, 733.0, 841.0], [858.0, 833.0, 804.0, 898.0, 756.0, 804.0, 837.0, 682.0, 613.0, 543.0, 488.0, 469.0, 455.0, 442.0, 406.0, 545.0, 448.0, 470.0, 349.0, 394.0, 352.0, 261.0, 335.0, 368.0, 301.0, 249.0, 227.0, 248.0, 214.0, 273.0, 273.0, 278.0, 218.0, 206.0, 202.0, 226.0, 270.0, 162.0, 224.0, 224.0, 238.0, 248.0, 375.0, 384.0, 406.0, 469.0, 613.0, 773.0, 1017.0], [920.0, 755.0, 753.0, 649.0, 833.0, 563.0, 528.0, 388.0, 474.0, 555.0, 581.0, 409.0, 577.0, 477.0, 490.0, 505.0, 462.0, 510.0, 292.0, 291.0, 324.0, 342.0, 295.0, 371.0, 250.0, 342.0, 259.0, 312.0, 332.0, 306.0, 276.0, 255.0, 227.0, 189.0, 268.0, 219.0, 236.0, 166.0, 177.0, 280.0, 233.0, 246.0, 270.0, 335.0, 381.0, 471.0, 596.0, 797.0, 1215.0], [822.0, 888.0, 688.0, 767.0, 468.0, 654.0, 448.0, 634.0, 647.0, 629.0, 407.0, 485.0, 563.0, 580.0, 464.0, 380.0, 446.0, 323.0, 329.0, 348.0, 435.0, 420.0, 414.0, 311.0, 270.0, 202.0, 347.0, 268.0, 317.0, 330.0, 262.0, 291.0, 289.0, 240.0, 313.0, 285.0, 251.0, 208.0, 166.0, 312.0, 218.0, 267.0, 181.0, 201.0, 232.0, 293.0, 431.0, 581.0, 999.0], [925.0, 733.0, 725.0, 588.0, 714.0, 790.0, 639.0, 562.0, 699.0, 666.0, 514.0, 478.0, 482.0, 487.0, 426.0, 391.0, 354.0, 370.0, 414.0, 264.0, 353.0, 318.0, 473.0, 364.0, 309.0, 330.0, 309.0, 211.0, 208.0, 244.0, 186.0, 312.0, 334.0, 226.0, 126.0, 127.0, 206.0, 204.0, 202.0, 165.0, 157.0, 202.0, 265.0, 243.0, 243.0, 249.0, 370.0, 472.0, 962.0], [769.0, 751.0, 784.0, 729.0, 844.0, 655.0, 646.0, 653.0, 672.0, 645.0, 635.0, 506.0, 442.0, 440.0, 338.0, 425.0, 321.0, 465.0, 421.0, 544.0, 398.0, 488.0, 367.0, 338.0, 339.0, 282.0, 234.0, 158.0, 273.0, 277.0, 252.0, 302.0, 371.0, 148.0, 138.0, 195.0, 146.0, 164.0, 179.0, 252.0, 159.0, 119.0, 54.0, 115.0, 208.0, 131.0, 208.0, 345.0, 781.0], [826.0, 717.0, 806.0, 554.0, 628.0, 682.0, 613.0, 668.0, 736.0, 494.0, 547.0, 395.0, 542.0, 353.0, 395.0, 618.0, 409.0, 404.0, 336.0, 454.0, 484.0, 346.0, 357.0, 255.0, 339.0, 411.0, 310.0, 312.0, 174.0, 266.0, 288.0, 232.0, 185.0, 167.0, 196.0, 110.0, 207.0, 208.0, 225.0, 99.0, 112.0, 261.0, 168.0, 178.0, 151.0, 198.0, 135.0, 300.0, 609.0], [851.0, 735.0, 772.0, 808.0, 846.0, 787.0, 649.0, 689.0, 760.0, 536.0, 571.0, 494.0, 451.0, 468.0, 441.0, 349.0, 411.0, 300.0, 458.0, 436.0, 406.0, 390.0, 325.0, 310.0, 248.0, 322.0, 284.0, 352.0, 296.0, 269.0, 269.0, 115.0, 176.0, 130.0, 208.0, 235.0, 228.0, 213.0, 184.0, 196.0, 232.0, 202.0, 161.0, 164.0, 234.0, 331.0, 225.0, 211.0, 335.0], [1010.0, 921.0, 841.0, 720.0, 760.0, 815.0, 553.0, 603.0, 580.0, 552.0, 484.0, 524.0, 486.0, 586.0, 403.0, 405.0, 362.0, 465.0, 397.0, 335.0, 321.0, 269.0, 322.0, 374.0, 364.0, 263.0, 236.0, 349.0, 276.0, 293.0, 226.0, 209.0, 256.0, 211.0, 335.0, 194.0, 127.0, 347.0, 220.0, 133.0, 150.0, 148.0, 188.0, 105.0, 183.0, 181.0, 179.0, 180.0, 305.0], [953.0, 879.0, 566.0, 688.0, 589.0, 566.0, 713.0, 712.0, 516.0, 647.0, 678.0, 675.0, 769.0, 530.0, 423.0, 382.0, 295.0, 455.0, 526.0, 418.0, 399.0, 322.0, 320.0, 209.0, 213.0, 323.0, 254.0, 261.0, 160.0, 192.0, 295.0, 201.0, 159.0, 204.0, 263.0, 149.0, 264.0, 174.0, 135.0, 140.0, 177.0, 117.0, 201.0, 222.0, 324.0, 235.0, 210.0, 237.0, 246.0], [930.0, 847.0, 678.0, 741.0, 850.0, 577.0, 632.0, 638.0, 713.0, 682.0, 638.0, 506.0, 401.0, 478.0, 481.0, 449.0, 372.0, 255.0, 388.0, 419.0, 399.0, 378.0, 372.0, 366.0, 457.0, 330.0, 350.0, 221.0, 343.0, 172.0, 228.0, 305.0, 204.0, 230.0, 246.0, 206.0, 169.0, 81.0, 123.0, 132.0, 171.0, 97.0, 170.0, 185.0, 137.0, 255.0, 125.0, 156.0, 149.0], [930.0, 829.0, 709.0, 773.0, 643.0, 640.0, 594.0, 599.0, 433.0, 476.0, 628.0, 399.0, 697.0, 456.0, 493.0, 310.0, 395.0, 367.0, 438.0, 483.0, 380.0, 415.0, 431.0, 283.0, 295.0, 240.0, 334.0, 396.0, 284.0, 266.0, 246.0, 275.0, 211.0, 160.0, 177.0, 218.0, 132.0, 133.0, 171.0, 210.0, 97.0, 192.0, 219.0, 157.0, 117.0, 170.0, 208.0, 137.0, 232.0], [916.0, 741.0, 639.0, 792.0, 683.0, 482.0, 407.0, 533.0, 533.0, 863.0, 648.0, 475.0, 507.0, 562.0, 560.0, 336.0, 381.0, 391.0, 264.0, 401.0, 252.0, 247.0, 150.0, 341.0, 272.0, 261.0, 265.0, 270.0, 179.0, 174.0, 252.0, 406.0, 291.0, 257.0, 320.0, 200.0, 130.0, 149.0, 243.0, 286.0, 277.0, 58.0, 198.0, 223.0, 182.0, 207.0, 235.0, 193.0, 194.0], [553.0, 567.0, 553.0, 606.0, 597.0, 714.0, 500.0, 706.0, 417.0, 455.0, 529.0, 568.0, 531.0, 390.0, 438.0, 409.0, 489.0, 533.0, 430.0, 318.0, 332.0, 355.0, 313.0, 298.0, 208.0, 203.0, 225.0, 457.0, 301.0, 279.0, 143.0, 305.0, 244.0, 165.0, 157.0, 134.0, 101.0, 342.0, 203.0, 139.0, 163.0, 232.0, 288.0, 163.0, 184.0, 193.0, 176.0, 288.0, 157.0], [673.0, 708.0, 431.0, 576.0, 502.0, 592.0, 613.0, 517.0, 650.0, 608.0, 530.0, 415.0, 663.0, 443.0, 342.0, 267.0, 252.0, 297.0, 247.0, 250.0, 286.0, 404.0, 368.0, 367.0, 294.0, 296.0, 271.0, 399.0, 334.0, 324.0, 389.0, 292.0, 228.0, 283.0, 290.0, 233.0, 190.0, 289.0, 223.0, 129.0, 168.0, 93.0, 336.0, 186.0, 116.0, 121.0, 145.0, 107.0, 189.0], [587.0, 468.0, 697.0, 527.0, 509.0, 780.0, 636.0, 515.0, 405.0, 295.0, 243.0, 329.0, 395.0, 348.0, 418.0, 417.0, 301.0, 457.0, 329.0, 294.0, 225.0, 198.0, 232.0, 353.0, 316.0, 318.0, 296.0, 206.0, 298.0, 213.0, 275.0, 191.0, 214.0, 310.0, 333.0, 238.0, 179.0, 177.0, 181.0, 191.0, 109.0, 200.0, 222.0, 170.0, 218.0, 101.0, 100.0, 238.0, 157.0], [540.0, 416.0, 367.0, 430.0, 550.0, 450.0, 326.0, 360.0, 355.0, 492.0, 394.0, 538.0, 393.0, 427.0, 328.0, 261.0, 348.0, 348.0, 317.0, 415.0, 216.0, 235.0, 209.0, 178.0, 292.0, 458.0, 286.0, 361.0, 223.0, 162.0, 307.0, 249.0, 258.0, 180.0, 104.0, 191.0, 315.0, 272.0, 163.0, 183.0, 189.0, 214.0, 116.0, 90.0, 100.0, 186.0, 219.0, 185.0, 177.0], [564.0, 358.0, 405.0, 493.0, 427.0, 442.0, 286.0, 296.0, 324.0, 368.0, 331.0, 232.0, 331.0, 403.0, 381.0, 254.0, 375.0, 390.0, 377.0, 298.0, 273.0, 270.0, 284.0, 330.0, 335.0, 308.0, 244.0, 140.0, 336.0, 268.0, 316.0, 281.0, 182.0, 202.0, 249.0, 294.0, 238.0, 173.0, 82.0, 183.0, 176.0, 150.0, 103.0, 149.0, 137.0, 134.0, 202.0, 169.0, 198.0], [382.0, 357.0, 375.0, 325.0, 314.0, 335.0, 489.0, 359.0, 341.0, 468.0, 352.0, 329.0, 302.0, 364.0, 351.0, 336.0, 327.0, 235.0, 169.0, 160.0, 242.0, 237.0, 254.0, 317.0, 316.0, 328.0, 273.0, 133.0, 214.0, 189.0, 176.0, 235.0, 253.0, 253.0, 193.0, 218.0, 219.0, 293.0, 156.0, 183.0, 137.0, 241.0, 285.0, 246.0, 188.0, 158.0, 110.0, 123.0, 170.0]],
    "Name": "sCurve-0",
    "Overflow": 2028568.0,
    "Type": "Histo2d",
    "Underflow": 0.0,
    "x": {
        "AxisTitle": "Vcal",
        "Bins": 51,
        "High": 302.5,
        "Low": 47.5
    },
    "y": {
        "AxisTitle": "Occupancy",
        "Bins": 49,
        "High": 49.5,
        "Low": 0.5
    },
    "z": {
        "AxisTitle": "Number of pixels"
    }
}