{
    "Data": [[123.0, 57.0, 26.0, 39.0, 10.0, 13.0, 22.0, 18.0, 17.0, 9.0, 12.0, 9.0, 13.0, 7.0, 6.0, 1.0, 9.0, 3.0, 6.0, 7.0, 5.0, 3.0, 2.0, 1.0, 2.0, 3.0, 3.0, 2.0, 1.0, 2.0, 2.0, 2.0, 1.0, 1.0, 1.0, 4.0, 5.0, 4.0, 1.0, 0.0, 0.0, 3.0, 6.0, 4.0, 0.0, 4.0, 5.0, 2.0, 1.0], [333.0, 84.0, 30.0, 25.0, 14.0, 9.0, 15.0, 12.0, 19.0, 9.0, 14.0, 23.0, 5.0, 11.0, 15.0, 10.0, 12.0, 13.0, 6.0, 6.0, 2.0, 3.0, 7.0, 5.0, 9.0, 1.0, 0.0, 3.0, 2.0, 5.0, 5.0, 4.0, 6.0, 3.0, 3.0, 0.0, 1.0, 3.0, 0.0, 4.0, 4.0, 5.0, 4.0, 7.0, 3.0, 3.0, 5.0, 10.0, 5.0], [862.0, 219.0, 95.0, 62.0, 40.0, 24.0, 17.0, 8.0, 12.0, 7.0, 13.0, 4.0, 8.0, 2.0, 3.0, 6.0, 10.0, 10.0, 4.0, 7.0, 9.0, 11.0, 5.0, 6.0, 10.0, 9.0, 10.0, 7.0, 10.0, 14.0, 2.0, 5.0, 7.0, 2.0, 2.0, 2.0, 11.0, 2.0, 5.0, 7.0, 5.0, 4.0, 5.0, 5.0, 6.0, 3.0, 9.0, 9.0, 13.0], [2079.0, 566.0, 275.0, 182.0, 111.0, 83.0, 52.0, 40.0, 33.0, 20.0, 20.0, 23.0, 16.0, 10.0, 9.0, 6.0, 7.0, 9.0, 6.0, 7.0, 2.0, 6.0, 3.0, 3.0, 1.0, 4.0, 2.0, 7.0, 7.0, 3.0, 10.0, 6.0, 6.0, 11.0, 4.0, 15.0, 10.0, 9.0, 10.0, 7.0, 10.0, 8.0, 7.0, 13.0, 8.0, 8.0, 11.0, 18.0, 23.0], [4820.0, 1669.0, 762.0, 454.0, 363.0, 220.0, 179.0, 138.0, 88.0, 75.0, 59.0, 59.0, 51.0, 46.0, 34.0, 27.0, 25.0, 15.0, 9.0, 15.0, 14.0, 18.0, 15.0, 15.0, 10.0, 13.0, 5.0, 7.0, 6.0, 3.0, 8.0, 4.0, 3.0, 3.0, 4.0, 5.0, 5.0, 8.0, 9.0, 13.0, 3.0, 10.0, 6.0, 14.0, 16.0, 15.0, 24.0, 26.0, 28.0], [7890.0, 3732.0, 2214.0, 1379.0, 1009.0, 607.0, 458.0, 367.0, 290.0, 219.0, 194.0, 163.0, 150.0, 134.0, 96.0, 86.0, 80.0, 67.0, 70.0, 54.0, 51.0, 40.0, 40.0, 31.0, 28.0, 42.0, 30.0, 18.0, 16.0, 16.0, 15.0, 24.0, 17.0, 14.0, 10.0, 10.0, 12.0, 9.0, 9.0, 8.0, 8.0, 5.0, 9.0, 14.0, 15.0, 10.0, 27.0, 32.0, 35.0], [8894.0, 6211.0, 4508.0, 3552.0, 2641.0, 2106.0, 1691.0, 1373.0, 1061.0, 859.0, 733.0, 586.0, 488.0, 371.0, 338.0, 260.0, 240.0, 226.0, 190.0, 181.0, 136.0, 142.0, 150.0, 117.0, 105.0, 112.0, 91.0, 71.0, 76.0, 73.0, 58.0, 67.0, 63.0, 71.0, 45.0, 39.0, 23.0, 33.0, 28.0, 30.0, 23.0, 23.0, 30.0, 26.0, 19.0, 15.0, 21.0, 24.0, 46.0], [2469.0, 2775.0, 2993.0, 3102.0, 3090.0, 2971.0, 2886.0, 2843.0, 2465.0, 2468.0, 2339.0, 2131.0, 1876.0, 1716.0, 1610.0, 1435.0, 1258.0, 1095.0, 971.0, 795.0, 707.0, 579.0, 515.0, 466.0, 403.0, 320.0, 265.0, 269.0, 227.0, 210.0, 223.0, 185.0, 179.0, 158.0, 154.0, 143.0, 124.0, 139.0, 120.0, 100.0, 98.0, 85.0, 74.0, 66.0, 61.0, 58.0, 56.0, 50.0, 71.0], [339.0, 401.0, 460.0, 556.0, 585.0, 705.0, 791.0, 871.0, 965.0, 1142.0, 1148.0, 1322.0, 1386.0, 1532.0, 1570.0, 1682.0, 1732.0, 1682.0, 1831.0, 1848.0, 1849.0, 1924.0, 1964.0, 1837.0, 1807.0, 1725.0, 1708.0, 1631.0, 1480.0, 1428.0, 1316.0, 1296.0, 1119.0, 976.0, 835.0, 770.0, 689.0, 636.0, 522.0, 421.0, 386.0, 351.0, 298.0, 299.0, 252.0, 239.0, 192.0, 203.0, 174.0], [186.0, 118.0, 85.0, 104.0, 130.0, 130.0, 147.0, 167.0, 179.0, 216.0, 205.0, 229.0, 248.0, 292.0, 313.0, 334.0, 394.0, 437.0, 443.0, 505.0, 557.0, 654.0, 694.0, 765.0, 856.0, 964.0, 1007.0, 1210.0, 1282.0, 1450.0, 1457.0, 1683.0, 1706.0, 1889.0, 1913.0, 2086.0, 2245.0, 2269.0, 2268.0, 2241.0, 2255.0, 2285.0, 2143.0, 2029.0, 1920.0, 1796.0, 1614.0, 1328.0, 1088.0], [155.0, 78.0, 68.0, 42.0, 34.0, 35.0, 47.0, 55.0, 46.0, 47.0, 46.0, 76.0, 73.0, 70.0, 67.0, 82.0, 83.0, 98.0, 122.0, 109.0, 150.0, 127.0, 161.0, 189.0, 174.0, 218.0, 258.0, 263.0, 283.0, 309.0, 386.0, 443.0, 507.0, 548.0, 677.0, 743.0, 924.0, 1005.0, 1258.0, 1475.0, 1754.0, 2094.0, 2343.0, 2796.0, 3234.0, 3774.0, 4544.0, 5317.0, 6531.0], [130.0, 68.0, 47.0, 44.0, 44.0, 27.0, 28.0, 30.0, 28.0, 24.0, 27.0, 24.0, 21.0, 21.0, 33.0, 20.0, 23.0, 21.0, 36.0, 24.0, 32.0, 46.0, 52.0, 50.0, 57.0, 66.0, 65.0, 86.0, 97.0, 92.0, 120.0, 131.0, 137.0, 170.0, 184.0, 229.0, 264.0, 293.0, 316.0, 447.0, 524.0, 652.0, 865.0, 1182.0, 1597.0, 2211.0, 3226.0, 4990.0, 8823.0], [134.0, 71.0, 46.0, 36.0, 37.0, 23.0, 25.0, 25.0, 28.0, 23.0, 23.0, 22.0, 23.0, 25.0, 15.0, 19.0, 13.0, 16.0, 16.0, 15.0, 15.0, 18.0, 19.0, 24.0, 19.0, 19.0, 24.0, 21.0, 29.0, 41.0, 22.0, 35.0, 53.0, 40.0, 56.0, 67.0, 85.0, 96.0, 110.0, 124.0, 170.0, 229.0, 298.0, 344.0, 457.0, 819.0, 1330.0, 2570.0, 6314.0], [129.0, 68.0, 53.0, 35.0, 28.0, 27.0, 18.0, 22.0, 9.0, 20.0, 24.0, 27.0, 15.0, 18.0, 12.0, 11.0, 14.0, 10.0, 9.0, 15.0, 15.0, 14.0, 16.0, 18.0, 17.0, 10.0, 14.0, 20.0, 17.0, 10.0, 20.0, 18.0, 21.0, 23.0, 29.0, 20.0, 24.0, 26.0, 36.0, 47.0, 53.0, 65.0, 90.0, 127.0, 154.0, 247.0, 401.0, 954.0, 3160.0], [187.0, 49.0, 46.0, 15.0, 29.0, 17.0, 25.0, 15.0, 23.0, 21.0, 13.0, 13.0, 11.0, 10.0, 18.0, 11.0, 11.0, 14.0, 13.0, 9.0, 9.0, 7.0, 10.0, 14.0, 15.0, 10.0, 12.0, 13.0, 20.0, 20.0, 14.0, 11.0, 11.0, 22.0, 14.0, 20.0, 12.0, 22.0, 16.0, 29.0, 23.0, 29.0, 39.0, 39.0, 62.0, 95.0, 151.0, 361.0, 1270.0], [291.0, 80.0, 49.0, 23.0, 22.0, 16.0, 17.0, 16.0, 17.0, 10.0, 11.0, 12.0, 9.0, 9.0, 5.0, 10.0, 12.0, 15.0, 6.0, 5.0, 7.0, 11.0, 10.0, 7.0, 14.0, 10.0, 12.0, 9.0, 11.0, 8.0, 9.0, 12.0, 10.0, 9.0, 14.0, 19.0, 16.0, 19.0, 10.0, 24.0, 15.0, 22.0, 24.0, 37.0, 32.0, 58.0, 76.0, 138.0, 487.0], [577.0, 157.0, 53.0, 40.0, 21.0, 22.0, 15.0, 16.0, 15.0, 13.0, 8.0, 6.0, 6.0, 8.0, 5.0, 6.0, 12.0, 8.0, 7.0, 7.0, 10.0, 9.0, 5.0, 9.0, 8.0, 0.0, 5.0, 4.0, 8.0, 7.0, 14.0, 13.0, 5.0, 10.0, 16.0, 12.0, 6.0, 17.0, 14.0, 7.0, 21.0, 20.0, 10.0, 21.0, 22.0, 46.0, 50.0, 72.0, 237.0], [1117.0, 303.0, 131.0, 54.0, 41.0, 26.0, 18.0, 16.0, 17.0, 11.0, 8.0, 9.0, 4.0, 7.0, 4.0, 4.0, 5.0, 10.0, 5.0, 4.0, 5.0, 9.0, 6.0, 5.0, 6.0, 5.0, 3.0, 6.0, 5.0, 4.0, 5.0, 3.0, 7.0, 5.0, 9.0, 8.0, 7.0, 10.0, 14.0, 16.0, 14.0, 21.0, 11.0, 15.0, 23.0, 22.0, 50.0, 47.0, 134.0], [1897.0, 644.0, 297.0, 171.0, 96.0, 50.0, 41.0, 32.0, 27.0, 10.0, 12.0, 9.0, 8.0, 7.0, 3.0, 6.0, 8.0, 3.0, 5.0, 4.0, 5.0, 5.0, 6.0, 3.0, 4.0, 2.0, 7.0, 5.0, 6.0, 4.0, 3.0, 4.0, 6.0, 8.0, 2.0, 5.0, 5.0, 8.0, 2.0, 6.0, 7.0, 10.0, 12.0, 10.0, 17.0, 14.0, 33.0, 33.0, 113.0], [2838.0, 1166.0, 626.0, 336.0, 228.0, 120.0, 89.0, 65.0, 41.0, 40.0, 27.0, 33.0, 20.0, 16.0, 7.0, 10.0, 8.0, 10.0, 4.0, 6.0, 9.0, 6.0, 5.0, 3.0, 8.0, 1.0, 1.0, 5.0, 1.0, 2.0, 5.0, 2.0, 4.0, 3.0, 5.0, 9.0, 6.0, 4.0, 6.0, 3.0, 6.0, 8.0, 14.0, 6.0, 8.0, 14.0, 18.0, 28.0, 69.0], [3652.0, 1877.0, 1069.0, 612.0, 437.0, 309.0, 243.0, 176.0, 127.0, 92.0, 77.0, 56.0, 52.0, 40.0, 28.0, 30.0, 20.0, 21.0, 15.0, 10.0, 10.0, 11.0, 6.0, 12.0, 6.0, 6.0, 6.0, 2.0, 2.0, 1.0, 5.0, 6.0, 4.0, 2.0, 0.0, 2.0, 0.0, 2.0, 4.0, 4.0, 9.0, 3.0, 13.0, 5.0, 6.0, 14.0, 18.0, 21.0, 63.0], [3929.0, 2323.0, 1562.0, 1054.0, 768.0, 559.0, 419.0, 371.0, 261.0, 231.0, 174.0, 131.0, 117.0, 87.0, 91.0, 52.0, 48.0, 41.0, 40.0, 33.0, 32.0, 25.0, 25.0, 17.0, 12.0, 16.0, 10.0, 8.0, 12.0, 10.0, 7.0, 3.0, 3.0, 4.0, 1.0, 6.0, 6.0, 2.0, 3.0, 7.0, 4.0, 7.0, 5.0, 5.0, 4.0, 9.0, 20.0, 18.0, 31.0], [3910.0, 2498.0, 1883.0, 1399.0, 1122.0, 882.0, 703.0, 533.0, 474.0, 377.0, 336.0, 283.0, 268.0, 202.0, 188.0, 147.0, 117.0, 122.0, 104.0, 79.0, 80.0, 64.0, 52.0, 46.0, 45.0, 45.0, 32.0, 27.0, 25.0, 29.0, 22.0, 19.0, 11.0, 13.0, 14.0, 7.0, 8.0, 9.0, 8.0, 10.0, 10.0, 4.0, 2.0, 6.0, 7.0, 7.0, 7.0, 11.0, 30.0], [3020.0, 2354.0, 1910.0, 1564.0, 1342.0, 1095.0, 928.0, 849.0, 726.0, 624.0, 525.0, 497.0, 397.0, 382.0, 298.0, 303.0, 263.0, 235.0, 234.0, 172.0, 147.0, 142.0, 131.0, 129.0, 109.0, 89.0, 93.0, 65.0, 66.0, 62.0, 51.0, 56.0, 35.0, 42.0, 38.0, 24.0, 34.0, 19.0, 17.0, 25.0, 11.0, 8.0, 11.0, 9.0, 10.0, 13.0, 9.0, 19.0, 18.0], [2162.0, 1885.0, 1665.0, 1450.0, 1345.0, 1208.0, 1033.0, 910.0, 871.0, 806.0, 694.0, 669.0, 620.0, 517.0, 538.0, 479.0, 439.0, 343.0, 359.0, 296.0, 305.0, 283.0, 240.0, 229.0, 205.0, 218.0, 170.0, 162.0, 127.0, 128.0, 124.0, 106.0, 98.0, 110.0, 94.0, 71.0, 60.0, 42.0, 68.0, 48.0, 48.0, 37.0, 30.0, 32.0, 13.0, 16.0, 17.0, 24.0, 27.0], [1415.0, 1312.0, 1236.0, 1198.0, 1112.0, 1002.0, 1001.0, 950.0, 906.0, 789.0, 795.0, 783.0, 704.0, 686.0, 595.0, 571.0, 577.0, 518.0, 508.0, 488.0, 424.0, 433.0, 431.0, 402.0, 362.0, 341.0, 276.0, 280.0, 286.0, 267.0, 245.0, 223.0, 196.0, 188.0, 189.0, 167.0, 140.0, 146.0, 119.0, 110.0, 99.0, 95.0, 91.0, 76.0, 56.0, 67.0, 51.0, 50.0, 44.0], [821.0, 778.0, 785.0, 802.0, 794.0, 832.0, 848.0, 761.0, 807.0, 745.0, 701.0, 708.0, 704.0, 686.0, 609.0, 654.0, 625.0, 643.0, 595.0, 562.0, 534.0, 521.0, 523.0, 469.0, 502.0, 476.0, 467.0, 404.0, 448.0, 385.0, 379.0, 364.0, 346.0, 345.0, 313.0, 308.0, 298.0, 255.0, 241.0, 247.0, 231.0, 193.0, 191.0, 193.0, 159.0, 154.0, 113.0, 102.0, 102.0], [464.0, 429.0, 457.0, 492.0, 518.0, 540.0, 558.0, 559.0, 525.0, 572.0, 584.0, 612.0, 626.0, 575.0, 609.0, 591.0, 585.0, 590.0, 583.0, 575.0, 556.0, 568.0, 573.0, 577.0, 576.0, 563.0, 515.0, 541.0, 500.0, 548.0, 512.0, 478.0, 443.0, 534.0, 481.0, 454.0, 479.0, 417.0, 421.0, 395.0, 402.0, 411.0, 339.0, 366.0, 298.0, 304.0, 277.0, 245.0, 240.0], [250.0, 220.0, 270.0, 295.0, 327.0, 322.0, 388.0, 374.0, 384.0, 405.0, 397.0, 403.0, 424.0, 445.0, 438.0, 487.0, 500.0, 476.0, 516.0, 509.0, 517.0, 492.0, 542.0, 555.0, 572.0, 510.0, 527.0, 542.0, 557.0, 577.0, 583.0, 524.0, 549.0, 559.0, 572.0, 560.0, 595.0, 605.0, 567.0, 579.0, 573.0, 549.0, 605.0, 509.0, 622.0, 547.0, 559.0, 562.0, 533.0], [152.0, 120.0, 158.0, 182.0, 187.0, 170.0, 179.0, 203.0, 238.0, 243.0, 241.0, 271.0, 292.0, 284.0, 345.0, 337.0, 349.0, 344.0, 332.0, 377.0, 399.0, 396.0, 418.0, 458.0, 429.0, 472.0, 495.0, 470.0, 533.0, 535.0, 573.0, 591.0, 578.0, 580.0, 603.0, 624.0, 645.0, 656.0, 647.0, 691.0, 701.0, 747.0, 745.0, 790.0, 824.0, 901.0, 891.0, 931.0, 966.0], [78.0, 68.0, 73.0, 79.0, 92.0, 98.0, 108.0, 110.0, 147.0, 123.0, 114.0, 142.0, 141.0, 183.0, 208.0, 178.0, 198.0, 197.0, 220.0, 235.0, 270.0, 264.0, 284.0, 275.0, 314.0, 350.0, 412.0, 390.0, 403.0, 406.0, 422.0, 460.0, 524.0, 508.0, 547.0, 604.0, 615.0, 679.0, 704.0, 798.0, 789.0, 846.0, 861.0, 919.0, 1005.0, 1150.0, 1265.0, 1452.0, 1691.0], [54.0, 64.0, 53.0, 76.0, 81.0, 66.0, 72.0, 58.0, 82.0, 48.0, 74.0, 89.0, 97.0, 91.0, 84.0, 88.0, 108.0, 117.0, 144.0, 144.0, 147.0, 178.0, 193.0, 182.0, 201.0, 216.0, 252.0, 272.0, 308.0, 299.0, 322.0, 342.0, 354.0, 388.0, 443.0, 499.0, 520.0, 516.0, 648.0, 626.0, 742.0, 808.0, 859.0, 1000.0, 1085.0, 1244.0, 1579.0, 1872.0, 2357.0], [65.0, 28.0, 27.0, 24.0, 22.0, 32.0, 56.0, 20.0, 37.0, 34.0, 38.0, 38.0, 51.0, 46.0, 47.0, 72.0, 111.0, 69.0, 71.0, 69.0, 69.0, 78.0, 85.0, 96.0, 87.0, 126.0, 148.0, 145.0, 175.0, 188.0, 218.0, 230.0, 278.0, 266.0, 323.0, 339.0, 355.0, 413.0, 441.0, 522.0, 594.0, 691.0, 800.0, 882.0, 1049.0, 1261.0, 1514.0, 2018.0, 2977.0], [70.0, 42.0, 28.0, 22.0, 18.0, 19.0, 33.0, 39.0, 39.0, 54.0, 44.0, 22.0, 21.0, 38.0, 28.0, 42.0, 46.0, 37.0, 38.0, 59.0, 62.0, 71.0, 58.0, 61.0, 70.0, 65.0, 103.0, 80.0, 102.0, 108.0, 114.0, 146.0, 123.0, 167.0, 194.0, 197.0, 224.0, 278.0, 279.0, 374.0, 417.0, 496.0, 596.0, 709.0, 833.0, 1062.0, 1454.0, 2042.0, 3101.0], [52.0, 34.0, 11.0, 8.0, 11.0, 11.0, 28.0, 21.0, 18.0, 40.0, 18.0, 20.0, 11.0, 14.0, 20.0, 18.0, 15.0, 27.0, 16.0, 16.0, 17.0, 34.0, 29.0, 33.0, 25.0, 23.0, 42.0, 37.0, 39.0, 44.0, 54.0, 73.0, 73.0, 77.0, 94.0, 128.0, 128.0, 152.0, 194.0, 244.0, 263.0, 332.0, 369.0, 471.0, 634.0, 875.0, 1181.0, 1772.0, 3116.0], [40.0, 62.0, 16.0, 9.0, 11.0, 21.0, 6.0, 6.0, 9.0, 21.0, 8.0, 9.0, 19.0, 19.0, 11.0, 16.0, 9.0, 9.0, 14.0, 19.0, 26.0, 8.0, 8.0, 28.0, 26.0, 19.0, 28.0, 24.0, 26.0, 42.0, 24.0, 30.0, 46.0, 37.0, 44.0, 62.0, 77.0, 92.0, 79.0, 108.0, 139.0, 203.0, 254.0, 289.0, 399.0, 551.0, 869.0, 1372.0, 2721.0], [38.0, 64.0, 52.0, 15.0, 14.0, 28.0, 22.0, 8.0, 8.0, 21.0, 13.0, 3.0, 5.0, 9.0, 22.0, 2.0, 20.0, 21.0, 9.0, 5.0, 3.0, 11.0, 19.0, 3.0, 5.0, 8.0, 3.0, 9.0, 8.0, 15.0, 15.0, 11.0, 33.0, 22.0, 57.0, 43.0, 25.0, 40.0, 43.0, 56.0, 76.0, 108.0, 157.0, 151.0, 239.0, 361.0, 568.0, 959.0, 2150.0], [45.0, 53.0, 12.0, 8.0, 10.0, 6.0, 5.0, 7.0, 21.0, 34.0, 17.0, 15.0, 2.0, 4.0, 23.0, 0.0, 2.0, 3.0, 1.0, 2.0, 1.0, 4.0, 2.0, 2.0, 6.0, 6.0, 17.0, 16.0, 32.0, 14.0, 15.0, 19.0, 8.0, 13.0, 21.0, 19.0, 12.0, 34.0, 67.0, 40.0, 38.0, 43.0, 52.0, 82.0, 141.0, 186.0, 352.0, 668.0, 1561.0], [34.0, 14.0, 10.0, 11.0, 10.0, 51.0, 15.0, 39.0, 25.0, 12.0, 3.0, 34.0, 22.0, 4.0, 0.0, 21.0, 8.0, 1.0, 26.0, 19.0, 16.0, 13.0, 0.0, 1.0, 4.0, 3.0, 20.0, 0.0, 2.0, 1.0, 3.0, 3.0, 3.0, 3.0, 6.0, 22.0, 26.0, 18.0, 5.0, 8.0, 16.0, 58.0, 48.0, 41.0, 59.0, 107.0, 210.0, 353.0, 961.0], [34.0, 16.0, 9.0, 6.0, 12.0, 8.0, 2.0, 8.0, 8.0, 4.0, 3.0, 13.0, 53.0, 57.0, 10.0, 1.0, 1.0, 1.0, 1.0, 0.0, 0.0, 2.0, 1.0, 0.0, 2.0, 2.0, 0.0, 0.0, 0.0, 1.0, 1.0, 0.0, 1.0, 1.0, 3.0, 3.0, 11.0, 17.0, 3.0, 24.0, 24.0, 36.0, 13.0, 24.0, 18.0, 36.0, 79.0, 187.0, 635.0], [35.0, 37.0, 12.0, 7.0, 11.0, 6.0, 27.0, 6.0, 5.0, 6.0, 24.0, 7.0, 4.0, 2.0, 3.0, 0.0, 2.0, 1.0, 0.0, 2.0, 0.0, 0.0, 2.0, 1.0, 0.0, 0.0, 0.0, 1.0, 0.0, 1.0, 1.0, 1.0, 0.0, 0.0, 1.0, 0.0, 0.0, 2.0, 0.0, 5.0, 16.0, 10.0, 6.0, 21.0, 39.0, 29.0, 41.0, 82.0, 347.0], [37.0, 18.0, 13.0, 8.0, 10.0, 9.0, 4.0, 3.0, 5.0, 38.0, 20.0, 19.0, 7.0, 1.0, 0.0, 2.0, 2.0, 38.0, 10.0, 1.0, 1.0, 0.0, 1.0, 1.0, 1.0, 0.0, 0.0, 0.0, 1.0, 0.0, 0.0, 0.0, 1.0, 1.0, 0.0, 0.0, 1.0, 3.0, 20.0, 5.0, 2.0, 26.0, 20.0, 33.0, 5.0, 7.0, 17.0, 48.0, 194.0], [60.0, 16.0, 10.0, 8.0, 9.0, 11.0, 8.0, 5.0, 2.0, 5.0, 2.0, 4.0, 1.0, 18.0, 9.0, 2.0, 2.0, 0.0, 0.0, 1.0, 1.0, 18.0, 9.0, 1.0, 0.0, 1.0, 0.0, 0.0, 1.0, 0.0, 2.0, 0.0, 0.0, 0.0, 0.0, 1.0, 2.0, 0.0, 0.0, 10.0, 14.0, 23.0, 25.0, 0.0, 3.0, 6.0, 12.0, 32.0, 86.0], [39.0, 13.0, 12.0, 8.0, 3.0, 15.0, 3.0, 8.0, 5.0, 3.0, 4.0, 3.0, 2.0, 2.0, 0.0, 24.0, 0.0, 3.0, 8.0, 17.0, 2.0, 1.0, 1.0, 1.0, 0.0, 0.0, 0.0, 0.0, 0.0, 0.0, 2.0, 0.0, 2.0, 0.0, 0.0, 0.0, 0.0, 0.0, 47.0, 2.0, 30.0, 19.0, 0.0, 0.0, 0.0, 2.0, 3.0, 10.0, 40.0], [34.0, 18.0, 16.0, 7.0, 7.0, 8.0, 31.0, 6.0, 3.0, 6.0, 4.0, 1.0, 1.0, 2.0, 0.0, 2.0, 4.0, 1.0, 1.0, 2.0, 0.0, 0.0, 1.0, 0.0, 1.0, 1.0, 0.0, 16.0, 8.0, 0.0, 1.0, 0.0, 1.0, 0.0, 0.0, 0.0, 1.0, 0.0, 0.0, 2.0, 0.0, 0.0, 0.0, 0.0, 0.0, 2.0, 2.0, 7.0, 44.0], [34.0, 19.0, 12.0, 12.0, 5.0, 2.0, 41.0, 16.0, 3.0, 24.0, 5.0, 5.0, 3.0, 2.0, 5.0, 2.0, 2.0, 2.0, 1.0, 1.0, 25.0, 1.0, 0.0, 0.0, 1.0, 0.0, 22.0, 2.0, 0.0, 1.0, 1.0, 1.0, 0.0, 2.0, 0.0, 0.0, 0.0, 0.0, 0.0, 0.0, 0.0, 0.0, 0.0, 16.0, 32.0, 0.0, 0.0, 4.0, 10.0], [39.0, 18.0, 13.0, 7.0, 6.0, 9.0, 6.0, 2.0, 7.0, 4.0, 3.0, 23.0, 6.0, 3.0, 0.0, 3.0, 22.0, 4.0, 3.0, 0.0, 0.0, 1.0, 0.0, 2.0, 1.0, 0.0, 1.0, 1.0, 1.0, 1.0, 0.0, 0.0, 2.0, 0.0, 0.0, 0.0, 0.0, 0.0, 0.0, 0.0, 0.0, 0.0, 0.0, 0.0, 19.0, 6.0, 0.0, 1.0, 12.0], [39.0, 13.0, 11.0, 15.0, 6.0, 5.0, 2.0, 2.0, 7.0, 8.0, 2.0, 7.0, 27.0, 2.0, 0.0, 2.0, 0.0, 0.0, 1.0, 1.0, 0.0, 0.0, 1.0, 0.0, 1.0, 1.0, 2.0, 1.0, 1.0, 15.0, 9.0, 2.0, 0.0, 0.0, 0.0, 0.0, 1.0, 0.0, 0.0, 0.0, 0.0, 0.0, 0.0, 0.0, 1.0, 0.0, 1.0, 2.0, 5.0], [46.0, 12.0, 7.0, 5.0, 12.0, 6.0, 1.0, 5.0, 8.0, 3.0, 4.0, 4.0, 1.0, 26.0, 2.0, 1.0, 3.0, 0.0, 1.0, 0.0, 0.0, 25.0, 19.0, 8.0, 1.0, 0.0, 1.0, 0.0, 0.0, 1.0, 0.0, 0.0, 0.0, 1.0, 1.0, 0.0, 0.0, 0.0, 1.0, 0.0, 0.0, 2.0, 0.0, 0.0, 0.0, 0.0, 1.0, 2.0, 2.0], [34.0, 19.0, 7.0, 8.0, 7.0, 9.0, 7.0, 7.0, 5.0, 3.0, 3.0, 5.0, 3.0, 0.0, 0.0, 1.0, 0.0, 4.0, 1.0, 1.0, 1.0, 0.0, 1.0, 0.0, 0.0, 1.0, 1.0, 0.0, 19.0, 7.0, 0.0, 0.0, 0.0, 0.0, 0.0, 0.0, 0.0, 1.0, 0.0, 0.0, 1.0, 0.0, 0.0, 0.0, 0.0, 0.0, 1.0, 0.0, 2.0], [30.0, 22.0, 9.0, 7.0, 28.0, 12.0, 6.0, 7.0, 7.0, 1.0, 3.0, 2.0, 0.0, 1.0, 0.0, 2.0, 1.0, 1.0, 1.0, 1.0, 0.0, 1.0, 2.0, 1.0, 0.0, 0.0, 1.0, 0.0, 1.0, 0.0, 0.0, 0.0, 1.0, 1.0, 0.0, 0.0, 1.0, 0.0, 1.0, 0.0, 0.0, 0.0, 0.0, 0.0, 0.0, 1.0, 0.0, 0.0, 2.0]],
    "Name": "sCurve-0",
    "Overflow": 2454567.0,
    "Type": "Histo2d",
    "Underflow": 0.0,
    "x": {
        "AxisTitle": "Vcal",
        "Bins": 51,
        "High": 302.5,
        "Low": 47.5
    },
    "y": {
        "AxisTitle": "Occupancy",
        "Bins": 49,
        "High": 49.5,
        "Low": 0.5
    },
    "z": {
        "AxisTitle": "Number of pixels"
    }
}