{
    "Data": [0.0, 0.0, 0.0, 0.0, 0.0, 0.0, 0.0, 0.0, 0.0, 0.0, 0.0, 0.0, 0.0, 0.0, 0.0, 0.0, 0.0, 0.0, 0.0, 0.0, 0.0, 0.0, 0.0, 0.0, 0.0, 0.0, 0.0, 0.0, 0.0, 0.0, 0.0, 0.0, 0.0, 0.0, 0.0, 0.0, 0.0, 0.0, 0.0, 0.0, 0.0, 0.0, 0.0, 0.0, 0.0, 0.0, 0.0, 0.0, 0.0, 0.0, 2.0, 2.0, 2.0, 9.0, 6.0, 4.0, 4.0, 10.0, 5.0, 11.0, 8.0, 14.0, 9.0, 7.0, 5.0, 11.0, 9.0, 4.0, 8.0, 10.0, 5.0, 6.0, 14.0, 17.0, 18.0, 26.0, 28.0, 26.0, 39.0, 55.0, 81.0, 101.0, 137.0, 135.0, 186.0, 240.0, 267.0, 342.0, 408.0, 687.0, 1017.0, 1684.0, 2707.0, 3827.0, 4650.0, 5106.0, 5380.0, 4868.0, 4216.0, 3375.0, 2498.0, 1872.0, 1293.0, 1034.0, 763.0, 562.0, 447.0, 397.0, 296.0, 282.0, 233.0, 153.0, 112.0, 85.0, 70.0, 71.0, 37.0, 39.0, 33.0, 22.0, 34.0, 25.0, 31.0, 22.0, 28.0, 24.0, 20.0, 22.0, 18.0, 19.0, 18.0, 11.0, 15.0, 15.0, 11.0, 19.0, 14.0, 14.0, 7.0, 14.0, 8.0, 16.0, 6.0, 5.0, 9.0, 8.0, 6.0, 7.0, 8.0, 5.0, 5.0, 8.0, 5.0, 3.0, 6.0, 4.0, 6.0, 7.0, 7.0, 4.0, 5.0, 7.0, 10.0, 11.0, 12.0, 19.0, 24.0, 28.0, 41.0, 51.0, 59.0, 63.0, 69.0, 102.0, 138.0, 148.0, 163.0, 165.0, 234.0, 283.0, 281.0, 361.0, 418.0, 449.0, 452.0, 513.0, 532.0, 583.0, 608.0, 615.0, 654.0, 740.0, 727.0, 726.0, 792.0, 703.0, 721.0, 697.0, 776.0, 703.0, 717.0, 710.0, 676.0, 664.0, 627.0, 561.0, 570.0, 493.0, 486.0, 407.0, 415.0, 358.0, 304.0, 316.0, 270.0, 252.0, 243.0, 198.0, 172.0, 177.0, 140.0, 120.0, 114.0, 82.0, 101.0, 78.0, 74.0, 63.0, 49.0, 45.0, 26.0, 33.0, 23.0, 21.0, 14.0, 11.0, 12.0, 11.0, 12.0, 7.0, 4.0, 5.0, 2.0, 4.0, 2.0, 1.0, 1.0, 1.0, 0.0, 1.0, 0.0, 0.0, 1.0, 3.0, 0.0, 1.0, 0.0, 0.0, 0.0, 1.0, 0.0, 1.0, 0.0, 0.0, 1.0, 0.0, 0.0, 0.0, 0.0, 1.0, 0.0, 1.0, 0.0, 0.0, 0.0, 1.0, 0.0, 0.0, 1.0, 2.0, 0.0, 0.0, 1.0, 3.0, 1.0, 1.0, 0.0, 0.0, 0.0, 1.0, 0.0, 0.0, 1.0, 1.0, 0.0, 1.0, 0.0, 0.0, 0.0, 0.0, 0.0, 0.0, 0.0, 0.0, 0.0, 0.0, 1.0, 0.0, 0.0, 0.0, 0.0, 0.0, 0.0, 0.0, 0.0, 0.0, 0.0, 0.0, 0.0, 0.0, 0.0, 0.0, 0.0, 0.0, 0.0, 0.0, 0.0, 0.0, 0.0, 0.0, 0.0, 0.0, 0.0, 0.0, 0.0, 0.0, 0.0, 0.0, 0.0, 0.0, 0.0, 0.0, 0.0, 0.0, 0.0, 0.0, 0.0, 0.0, 0.0, 0.0, 0.0, 0.0, 0.0, 0.0, 0.0, 0.0, 0.0, 0.0, 0.0, 0.0, 0.0, 0.0, 0.0, 0.0],
    "Name": "ThresholdDist-0",
    "Overflow": 0.0,
    "Type": "Histo1d",
    "Underflow": 0.0,
    "x": {
        "AxisTitle": "Threshold [e]",
        "Bins": 364,
        "High": 3635.0,
        "Low": -5.0
    },
    "y": {
        "AxisTitle": "Number of Pixels"
    },
    "z": {
        "AxisTitle": "z"
    }
}