time,Hardware,Voltage,Current
1621384672342,high-voltage-2,1,0.238713
time,Hardware,Voltage,Current
1621384672342,high-voltage-2,2,0.277139
time,Hardware,Voltage,Current
1621384672342,high-voltage-2,3,0.297418
time,Hardware,Voltage,Current
1621384672342,high-voltage-2,4,0.314839
time,Hardware,Voltage,Current
1621384672342,high-voltage-2,5,0.334724
time,Hardware,Voltage,Current
1621384672342,high-voltage-2,6,0.35662
time,Hardware,Voltage,Current
1621384672342,high-voltage-2,7,0.380556
time,Hardware,Voltage,Current
1621384672342,high-voltage-2,8,0.408373
time,Hardware,Voltage,Current
1621384672342,high-voltage-2,9,0.439015
time,Hardware,Voltage,Current
1621384672342,high-voltage-2,10,0.474074
time,Hardware,Voltage,Current
1621384672342,high-voltage-2,11,0.510939
time,Hardware,Voltage,Current
1621384672342,high-voltage-2,12,0.548638
time,Hardware,Voltage,Current
1621384672342,high-voltage-2,13,0.58743
time,Hardware,Voltage,Current
1621384672342,high-voltage-2,14,0.629106
time,Hardware,Voltage,Current
1621384672342,high-voltage-2,15,0.664536
time,Hardware,Voltage,Current
1621384672342,high-voltage-2,16,0.701383
time,Hardware,Voltage,Current
1621384672342,high-voltage-2,17,0.732423
time,Hardware,Voltage,Current
1621384672342,high-voltage-2,18,0.759846
time,Hardware,Voltage,Current
1621384672342,high-voltage-2,19,0.787757
time,Hardware,Voltage,Current
1621384672342,high-voltage-2,20,0.810392
time,Hardware,Voltage,Current
1621384672342,high-voltage-2,25,0.91634
time,Hardware,Voltage,Current
1621384672342,high-voltage-2,30,1.01361
time,Hardware,Voltage,Current
1621384672342,high-voltage-2,35,1.10921
time,Hardware,Voltage,Current
1621384672342,high-voltage-2,40,1.21676
time,Hardware,Voltage,Current
1621384672342,high-voltage-2,45,1.34811
time,Hardware,Voltage,Current
1621384672342,high-voltage-2,50,1.44248
time,Hardware,Voltage,Current
1621384672342,high-voltage-2,55,1.52482
time,Hardware,Voltage,Current
1621384672342,high-voltage-2,60,1.60515
time,Hardware,Voltage,Current
1621384672342,high-voltage-2,65,1.68176
time,Hardware,Voltage,Current
1621384672342,high-voltage-2,70,1.7587
time,Hardware,Voltage,Current
1621384672342,high-voltage-2,75,1.82786
time,Hardware,Voltage,Current
1621384672342,high-voltage-2,80,1.89854
time,Hardware,Voltage,Current
1621384672342,high-voltage-2,85,1.96724
time,Hardware,Voltage,Current
1621384672342,high-voltage-2,90,2.03165
time,Hardware,Voltage,Current
1621384672342,high-voltage-2,95,2.09633
time,Hardware,Voltage,Current
1621384672342,high-voltage-2,100,2.16118
