time,Hardware,Voltage,Current
1622002290720,high-voltage-3,1,0.0050144
time,Hardware,Voltage,Current
1622002290720,high-voltage-3,2,0.00795984
time,Hardware,Voltage,Current
1622002290720,high-voltage-3,3,0.00908248
time,Hardware,Voltage,Current
1622002290720,high-voltage-3,4,0.0101399
time,Hardware,Voltage,Current
1622002290720,high-voltage-3,5,0.0111793
time,Hardware,Voltage,Current
1622002290720,high-voltage-3,6,0.0114804
time,Hardware,Voltage,Current
1622002290720,high-voltage-3,7,0.013091
time,Hardware,Voltage,Current
1622002290720,high-voltage-3,8,0.0162794
time,Hardware,Voltage,Current
1622002290720,high-voltage-3,9,0.0171798
time,Hardware,Voltage,Current
1622002290720,high-voltage-3,10,0.0202549
time,Hardware,Voltage,Current
1622002290720,high-voltage-3,11,0.0201394
time,Hardware,Voltage,Current
1622002290720,high-voltage-3,12,0.0224963
time,Hardware,Voltage,Current
1622002290720,high-voltage-3,13,0.0240622
time,Hardware,Voltage,Current
1622002290720,high-voltage-3,14,0.0261674
time,Hardware,Voltage,Current
1622002290720,high-voltage-3,15,0.0265386
time,Hardware,Voltage,Current
1622002290720,high-voltage-3,16,0.029153
time,Hardware,Voltage,Current
1622002290720,high-voltage-3,17,0.0309012
time,Hardware,Voltage,Current
1622002290720,high-voltage-3,18,0.030944
time,Hardware,Voltage,Current
1622002290720,high-voltage-3,19,0.0330061
time,Hardware,Voltage,Current
1622002290720,high-voltage-3,20,0.0330351
time,Hardware,Voltage,Current
1622002290720,high-voltage-3,25,0.0419531
time,Hardware,Voltage,Current
1622002290720,high-voltage-3,30,0.0494753
time,Hardware,Voltage,Current
1622002290720,high-voltage-3,35,0.0549271
time,Hardware,Voltage,Current
1622002290720,high-voltage-3,40,0.058531
time,Hardware,Voltage,Current
1622002290720,high-voltage-3,45,0.0644771
time,Hardware,Voltage,Current
1622002290720,high-voltage-3,50,0.067541
time,Hardware,Voltage,Current
1622002290720,high-voltage-3,55,0.0731913
time,Hardware,Voltage,Current
1622002290720,high-voltage-3,60,0.0786841
time,Hardware,Voltage,Current
1622002290720,high-voltage-3,65,0.0857554
time,Hardware,Voltage,Current
1622002290720,high-voltage-3,70,0.0917501
time,Hardware,Voltage,Current
1622002290720,high-voltage-3,75,0.101865
time,Hardware,Voltage,Current
1622002290720,high-voltage-3,80,0.108798
time,Hardware,Voltage,Current
1622002290720,high-voltage-3,85,0.117195
time,Hardware,Voltage,Current
1622002290720,high-voltage-3,90,0.125226
time,Hardware,Voltage,Current
1622002290720,high-voltage-3,95,0.137289
time,Hardware,Voltage,Current
1622002290720,high-voltage-3,100,0.147404
