{
    "Data": [[1072.0, 315.0, 172.0, 94.0, 69.0, 54.0, 27.0, 19.0, 23.0, 24.0, 25.0, 17.0, 18.0, 16.0, 11.0, 17.0, 15.0, 8.0, 9.0, 12.0, 9.0, 6.0, 2.0, 6.0, 9.0, 5.0, 11.0, 4.0, 10.0, 5.0, 6.0, 6.0, 5.0, 4.0, 5.0, 5.0, 5.0, 4.0, 6.0, 4.0, 5.0, 5.0, 3.0, 8.0, 4.0, 9.0, 8.0, 14.0, 18.0], [2097.0, 724.0, 379.0, 207.0, 169.0, 113.0, 79.0, 55.0, 45.0, 44.0, 38.0, 34.0, 25.0, 41.0, 14.0, 25.0, 18.0, 16.0, 18.0, 20.0, 12.0, 8.0, 15.0, 10.0, 14.0, 11.0, 6.0, 10.0, 9.0, 7.0, 10.0, 7.0, 14.0, 4.0, 13.0, 8.0, 5.0, 4.0, 8.0, 4.0, 10.0, 8.0, 11.0, 6.0, 8.0, 7.0, 8.0, 16.0, 19.0], [3387.0, 1432.0, 818.0, 505.0, 353.0, 271.0, 208.0, 155.0, 117.0, 114.0, 95.0, 92.0, 64.0, 52.0, 52.0, 56.0, 29.0, 39.0, 33.0, 29.0, 18.0, 16.0, 23.0, 24.0, 18.0, 14.0, 18.0, 14.0, 17.0, 18.0, 17.0, 16.0, 18.0, 15.0, 10.0, 13.0, 9.0, 14.0, 11.0, 16.0, 6.0, 5.0, 12.0, 11.0, 16.0, 8.0, 18.0, 12.0, 23.0], [4138.0, 2147.0, 1420.0, 979.0, 732.0, 559.0, 456.0, 356.0, 307.0, 245.0, 226.0, 177.0, 155.0, 116.0, 113.0, 110.0, 109.0, 100.0, 73.0, 70.0, 64.0, 64.0, 63.0, 65.0, 30.0, 35.0, 32.0, 30.0, 39.0, 26.0, 18.0, 32.0, 17.0, 28.0, 27.0, 22.0, 21.0, 18.0, 22.0, 23.0, 23.0, 11.0, 24.0, 22.0, 15.0, 18.0, 27.0, 30.0, 39.0], [4633.0, 2478.0, 1803.0, 1441.0, 1165.0, 954.0, 787.0, 662.0, 554.0, 470.0, 461.0, 363.0, 370.0, 325.0, 284.0, 245.0, 230.0, 183.0, 205.0, 170.0, 152.0, 129.0, 150.0, 121.0, 106.0, 89.0, 107.0, 94.0, 84.0, 81.0, 70.0, 66.0, 56.0, 59.0, 50.0, 44.0, 40.0, 42.0, 37.0, 42.0, 40.0, 36.0, 34.0, 34.0, 32.0, 51.0, 39.0, 44.0, 58.0], [7375.0, 3554.0, 2143.0, 1658.0, 1279.0, 1133.0, 965.0, 861.0, 836.0, 782.0, 705.0, 641.0, 571.0, 504.0, 536.0, 450.0, 476.0, 408.0, 366.0, 332.0, 323.0, 271.0, 269.0, 282.0, 242.0, 218.0, 225.0, 184.0, 208.0, 185.0, 168.0, 171.0, 158.0, 153.0, 122.0, 130.0, 138.0, 99.0, 106.0, 100.0, 90.0, 88.0, 79.0, 88.0, 91.0, 74.0, 70.0, 88.0, 106.0], [6122.0, 5068.0, 4023.0, 3104.0, 2606.0, 2152.0, 1749.0, 1518.0, 1236.0, 1099.0, 1017.0, 926.0, 788.0, 747.0, 683.0, 649.0, 645.0, 597.0, 543.0, 482.0, 526.0, 509.0, 475.0, 452.0, 442.0, 409.0, 422.0, 433.0, 368.0, 355.0, 384.0, 334.0, 332.0, 310.0, 303.0, 273.0, 269.0, 246.0, 237.0, 236.0, 211.0, 213.0, 232.0, 208.0, 213.0, 236.0, 183.0, 184.0, 214.0], [1138.0, 1413.0, 1632.0, 1758.0, 1850.0, 1918.0, 1939.0, 1937.0, 1986.0, 1915.0, 1858.0, 1779.0, 1709.0, 1626.0, 1496.0, 1470.0, 1307.0, 1345.0, 1191.0, 1094.0, 1060.0, 962.0, 932.0, 891.0, 825.0, 771.0, 730.0, 715.0, 656.0, 578.0, 567.0, 559.0, 561.0, 582.0, 553.0, 501.0, 505.0, 524.0, 517.0, 480.0, 499.0, 457.0, 450.0, 475.0, 496.0, 463.0, 453.0, 464.0, 494.0], [260.0, 261.0, 286.0, 270.0, 321.0, 399.0, 426.0, 478.0, 580.0, 529.0, 681.0, 729.0, 810.0, 854.0, 936.0, 938.0, 1018.0, 1061.0, 1183.0, 1253.0, 1202.0, 1270.0, 1403.0, 1352.0, 1343.0, 1418.0, 1443.0, 1420.0, 1508.0, 1508.0, 1459.0, 1414.0, 1441.0, 1403.0, 1409.0, 1335.0, 1240.0, 1197.0, 1175.0, 1156.0, 1035.0, 1081.0, 1018.0, 1000.0, 979.0, 1032.0, 980.0, 1048.0, 1161.0], [163.0, 109.0, 89.0, 73.0, 97.0, 93.0, 91.0, 121.0, 136.0, 141.0, 138.0, 143.0, 179.0, 187.0, 235.0, 235.0, 231.0, 267.0, 304.0, 333.0, 376.0, 411.0, 421.0, 490.0, 511.0, 526.0, 635.0, 654.0, 745.0, 826.0, 900.0, 1007.0, 1108.0, 1166.0, 1322.0, 1458.0, 1533.0, 1703.0, 1811.0, 2013.0, 2126.0, 2304.0, 2469.0, 2621.0, 2734.0, 2777.0, 2881.0, 3061.0, 3247.0], [124.0, 77.0, 38.0, 39.0, 37.0, 42.0, 38.0, 34.0, 51.0, 54.0, 52.0, 52.0, 57.0, 60.0, 63.0, 66.0, 79.0, 95.0, 87.0, 91.0, 106.0, 133.0, 118.0, 131.0, 153.0, 169.0, 200.0, 187.0, 217.0, 249.0, 271.0, 315.0, 372.0, 407.0, 456.0, 486.0, 603.0, 708.0, 748.0, 954.0, 1077.0, 1248.0, 1582.0, 1941.0, 2534.0, 3134.0, 4151.0, 5638.0, 8167.0], [111.0, 58.0, 36.0, 36.0, 25.0, 17.0, 35.0, 18.0, 22.0, 22.0, 16.0, 25.0, 25.0, 20.0, 33.0, 27.0, 31.0, 31.0, 33.0, 21.0, 31.0, 34.0, 44.0, 41.0, 61.0, 50.0, 64.0, 74.0, 72.0, 72.0, 87.0, 112.0, 135.0, 128.0, 124.0, 210.0, 201.0, 206.0, 279.0, 331.0, 403.0, 429.0, 632.0, 806.0, 1085.0, 1432.0, 2182.0, 3687.0, 8086.0], [97.0, 39.0, 52.0, 29.0, 20.0, 16.0, 18.0, 15.0, 16.0, 17.0, 19.0, 14.0, 14.0, 15.0, 18.0, 11.0, 16.0, 23.0, 12.0, 14.0, 16.0, 17.0, 12.0, 24.0, 14.0, 39.0, 31.0, 18.0, 23.0, 34.0, 30.0, 32.0, 36.0, 43.0, 66.0, 74.0, 76.0, 75.0, 100.0, 151.0, 144.0, 187.0, 236.0, 274.0, 438.0, 666.0, 973.0, 1810.0, 4668.0], [83.0, 58.0, 32.0, 21.0, 23.0, 12.0, 11.0, 7.0, 13.0, 11.0, 16.0, 12.0, 13.0, 11.0, 8.0, 7.0, 10.0, 18.0, 11.0, 9.0, 12.0, 13.0, 14.0, 10.0, 12.0, 15.0, 14.0, 11.0, 17.0, 26.0, 18.0, 22.0, 16.0, 18.0, 24.0, 22.0, 26.0, 43.0, 39.0, 44.0, 43.0, 89.0, 96.0, 124.0, 168.0, 260.0, 471.0, 802.0, 2466.0], [76.0, 47.0, 23.0, 21.0, 17.0, 13.0, 10.0, 9.0, 14.0, 9.0, 11.0, 13.0, 10.0, 9.0, 10.0, 7.0, 4.0, 10.0, 6.0, 4.0, 8.0, 10.0, 10.0, 8.0, 8.0, 7.0, 8.0, 8.0, 5.0, 21.0, 10.0, 13.0, 14.0, 18.0, 14.0, 20.0, 15.0, 17.0, 14.0, 20.0, 32.0, 39.0, 34.0, 55.0, 68.0, 110.0, 167.0, 355.0, 1171.0], [64.0, 42.0, 20.0, 15.0, 11.0, 11.0, 11.0, 11.0, 5.0, 7.0, 13.0, 14.0, 10.0, 5.0, 9.0, 8.0, 9.0, 5.0, 11.0, 6.0, 4.0, 8.0, 9.0, 4.0, 8.0, 5.0, 8.0, 12.0, 4.0, 7.0, 4.0, 3.0, 13.0, 6.0, 8.0, 14.0, 14.0, 10.0, 10.0, 21.0, 20.0, 23.0, 16.0, 35.0, 34.0, 56.0, 81.0, 169.0, 504.0], [63.0, 35.0, 18.0, 15.0, 6.0, 12.0, 7.0, 12.0, 11.0, 5.0, 6.0, 3.0, 8.0, 10.0, 10.0, 10.0, 7.0, 6.0, 2.0, 4.0, 6.0, 6.0, 1.0, 9.0, 0.0, 4.0, 3.0, 6.0, 4.0, 9.0, 9.0, 5.0, 9.0, 7.0, 7.0, 11.0, 17.0, 11.0, 9.0, 8.0, 5.0, 15.0, 13.0, 19.0, 21.0, 39.0, 50.0, 85.0, 262.0], [69.0, 34.0, 18.0, 10.0, 9.0, 11.0, 6.0, 6.0, 7.0, 4.0, 5.0, 3.0, 7.0, 3.0, 7.0, 7.0, 6.0, 2.0, 3.0, 6.0, 3.0, 3.0, 8.0, 5.0, 6.0, 8.0, 7.0, 1.0, 6.0, 5.0, 2.0, 5.0, 7.0, 4.0, 6.0, 10.0, 4.0, 12.0, 6.0, 5.0, 10.0, 9.0, 10.0, 8.0, 15.0, 23.0, 31.0, 45.0, 165.0], [68.0, 38.0, 16.0, 16.0, 5.0, 7.0, 1.0, 4.0, 9.0, 6.0, 2.0, 1.0, 13.0, 3.0, 2.0, 3.0, 6.0, 6.0, 2.0, 9.0, 1.0, 4.0, 3.0, 3.0, 5.0, 3.0, 2.0, 5.0, 2.0, 5.0, 4.0, 4.0, 4.0, 2.0, 4.0, 3.0, 6.0, 8.0, 8.0, 9.0, 5.0, 6.0, 8.0, 14.0, 14.0, 13.0, 29.0, 36.0, 90.0], [55.0, 29.0, 17.0, 12.0, 10.0, 4.0, 5.0, 3.0, 1.0, 7.0, 9.0, 1.0, 8.0, 0.0, 5.0, 4.0, 3.0, 1.0, 4.0, 2.0, 0.0, 2.0, 2.0, 5.0, 2.0, 3.0, 0.0, 3.0, 2.0, 2.0, 3.0, 3.0, 3.0, 4.0, 3.0, 5.0, 2.0, 2.0, 4.0, 7.0, 6.0, 7.0, 7.0, 9.0, 15.0, 7.0, 22.0, 18.0, 72.0], [65.0, 32.0, 18.0, 12.0, 6.0, 5.0, 7.0, 5.0, 4.0, 1.0, 4.0, 5.0, 2.0, 3.0, 6.0, 3.0, 7.0, 1.0, 0.0, 5.0, 3.0, 2.0, 2.0, 3.0, 4.0, 1.0, 3.0, 3.0, 1.0, 1.0, 0.0, 1.0, 4.0, 4.0, 1.0, 2.0, 4.0, 2.0, 2.0, 6.0, 4.0, 4.0, 6.0, 4.0, 5.0, 8.0, 13.0, 18.0, 42.0], [47.0, 29.0, 20.0, 11.0, 6.0, 3.0, 4.0, 4.0, 6.0, 2.0, 5.0, 2.0, 7.0, 3.0, 3.0, 4.0, 3.0, 2.0, 2.0, 4.0, 1.0, 1.0, 5.0, 1.0, 1.0, 2.0, 0.0, 4.0, 0.0, 1.0, 1.0, 1.0, 3.0, 1.0, 3.0, 1.0, 1.0, 1.0, 3.0, 3.0, 3.0, 5.0, 3.0, 6.0, 4.0, 7.0, 3.0, 11.0, 34.0], [64.0, 22.0, 11.0, 18.0, 7.0, 2.0, 3.0, 4.0, 5.0, 5.0, 5.0, 3.0, 2.0, 4.0, 3.0, 1.0, 2.0, 2.0, 2.0, 0.0, 1.0, 3.0, 2.0, 0.0, 1.0, 0.0, 2.0, 0.0, 3.0, 5.0, 1.0, 1.0, 2.0, 2.0, 3.0, 2.0, 3.0, 1.0, 3.0, 1.0, 2.0, 2.0, 0.0, 3.0, 5.0, 4.0, 3.0, 7.0, 26.0], [58.0, 33.0, 12.0, 10.0, 8.0, 4.0, 3.0, 2.0, 5.0, 8.0, 3.0, 1.0, 4.0, 5.0, 3.0, 2.0, 1.0, 2.0, 3.0, 2.0, 1.0, 2.0, 0.0, 1.0, 3.0, 1.0, 1.0, 0.0, 2.0, 1.0, 2.0, 0.0, 1.0, 0.0, 2.0, 3.0, 2.0, 2.0, 0.0, 4.0, 4.0, 3.0, 2.0, 3.0, 1.0, 1.0, 4.0, 3.0, 14.0], [54.0, 26.0, 12.0, 13.0, 6.0, 6.0, 5.0, 2.0, 6.0, 2.0, 1.0, 1.0, 4.0, 3.0, 1.0, 4.0, 4.0, 1.0, 3.0, 2.0, 2.0, 0.0, 3.0, 1.0, 0.0, 0.0, 1.0, 1.0, 1.0, 1.0, 2.0, 0.0, 1.0, 1.0, 1.0, 0.0, 1.0, 0.0, 1.0, 1.0, 3.0, 2.0, 1.0, 2.0, 2.0, 7.0, 4.0, 2.0, 10.0], [63.0, 30.0, 17.0, 7.0, 6.0, 4.0, 3.0, 2.0, 4.0, 5.0, 4.0, 3.0, 7.0, 1.0, 5.0, 3.0, 1.0, 2.0, 0.0, 1.0, 0.0, 2.0, 0.0, 2.0, 0.0, 2.0, 0.0, 2.0, 0.0, 2.0, 0.0, 1.0, 0.0, 0.0, 1.0, 2.0, 0.0, 2.0, 2.0, 1.0, 1.0, 0.0, 1.0, 0.0, 0.0, 5.0, 1.0, 5.0, 9.0], [58.0, 35.0, 17.0, 17.0, 4.0, 4.0, 2.0, 3.0, 4.0, 4.0, 4.0, 3.0, 2.0, 0.0, 2.0, 4.0, 3.0, 3.0, 0.0, 4.0, 1.0, 1.0, 1.0, 1.0, 1.0, 0.0, 1.0, 1.0, 0.0, 0.0, 1.0, 0.0, 3.0, 0.0, 0.0, 1.0, 2.0, 4.0, 1.0, 1.0, 1.0, 1.0, 0.0, 1.0, 1.0, 2.0, 3.0, 3.0, 4.0], [48.0, 34.0, 10.0, 10.0, 5.0, 5.0, 4.0, 2.0, 3.0, 5.0, 7.0, 5.0, 6.0, 5.0, 1.0, 0.0, 4.0, 0.0, 0.0, 2.0, 1.0, 4.0, 0.0, 0.0, 3.0, 0.0, 0.0, 3.0, 0.0, 1.0, 0.0, 2.0, 0.0, 1.0, 0.0, 0.0, 2.0, 1.0, 0.0, 1.0, 0.0, 1.0, 0.0, 0.0, 0.0, 0.0, 3.0, 1.0, 3.0], [57.0, 27.0, 21.0, 5.0, 10.0, 4.0, 5.0, 4.0, 1.0, 4.0, 3.0, 7.0, 2.0, 2.0, 0.0, 1.0, 3.0, 3.0, 1.0, 0.0, 3.0, 3.0, 2.0, 1.0, 0.0, 2.0, 0.0, 0.0, 1.0, 3.0, 0.0, 0.0, 2.0, 0.0, 1.0, 2.0, 0.0, 1.0, 0.0, 1.0, 0.0, 1.0, 1.0, 1.0, 2.0, 0.0, 0.0, 0.0, 4.0], [69.0, 30.0, 16.0, 9.0, 2.0, 2.0, 3.0, 1.0, 4.0, 2.0, 3.0, 4.0, 6.0, 3.0, 2.0, 3.0, 2.0, 3.0, 0.0, 3.0, 2.0, 2.0, 1.0, 1.0, 0.0, 1.0, 3.0, 1.0, 0.0, 1.0, 0.0, 1.0, 0.0, 0.0, 3.0, 3.0, 1.0, 0.0, 0.0, 0.0, 0.0, 0.0, 1.0, 2.0, 0.0, 0.0, 0.0, 1.0, 3.0], [64.0, 21.0, 13.0, 11.0, 5.0, 10.0, 3.0, 2.0, 1.0, 5.0, 5.0, 4.0, 2.0, 2.0, 4.0, 4.0, 1.0, 3.0, 2.0, 3.0, 4.0, 1.0, 0.0, 0.0, 0.0, 1.0, 1.0, 1.0, 0.0, 0.0, 0.0, 2.0, 2.0, 1.0, 0.0, 0.0, 2.0, 1.0, 0.0, 1.0, 0.0, 0.0, 0.0, 0.0, 0.0, 0.0, 1.0, 0.0, 3.0], [59.0, 24.0, 14.0, 13.0, 4.0, 6.0, 1.0, 5.0, 5.0, 2.0, 3.0, 2.0, 8.0, 2.0, 3.0, 0.0, 1.0, 3.0, 2.0, 0.0, 1.0, 0.0, 0.0, 2.0, 3.0, 2.0, 0.0, 1.0, 0.0, 1.0, 2.0, 2.0, 0.0, 1.0, 0.0, 1.0, 1.0, 0.0, 0.0, 0.0, 0.0, 1.0, 1.0, 0.0, 0.0, 0.0, 1.0, 1.0, 2.0], [42.0, 24.0, 19.0, 9.0, 7.0, 9.0, 4.0, 2.0, 5.0, 3.0, 3.0, 3.0, 1.0, 5.0, 1.0, 2.0, 5.0, 1.0, 3.0, 1.0, 1.0, 1.0, 2.0, 1.0, 1.0, 2.0, 0.0, 0.0, 0.0, 1.0, 0.0, 0.0, 1.0, 3.0, 0.0, 1.0, 1.0, 1.0, 0.0, 0.0, 1.0, 0.0, 0.0, 0.0, 2.0, 1.0, 1.0, 1.0, 2.0], [63.0, 31.0, 14.0, 5.0, 11.0, 3.0, 0.0, 4.0, 4.0, 7.0, 1.0, 6.0, 5.0, 1.0, 1.0, 2.0, 2.0, 1.0, 1.0, 1.0, 3.0, 1.0, 0.0, 0.0, 1.0, 2.0, 3.0, 0.0, 2.0, 0.0, 1.0, 0.0, 0.0, 0.0, 0.0, 0.0, 0.0, 0.0, 1.0, 1.0, 1.0, 1.0, 1.0, 0.0, 0.0, 0.0, 2.0, 0.0, 1.0], [54.0, 35.0, 9.0, 9.0, 8.0, 1.0, 4.0, 1.0, 1.0, 3.0, 4.0, 9.0, 6.0, 6.0, 0.0, 4.0, 4.0, 4.0, 0.0, 0.0, 0.0, 1.0, 0.0, 0.0, 2.0, 3.0, 0.0, 0.0, 2.0, 1.0, 0.0, 0.0, 0.0, 0.0, 3.0, 0.0, 0.0, 0.0, 0.0, 1.0, 0.0, 0.0, 0.0, 0.0, 0.0, 0.0, 1.0, 3.0, 0.0], [69.0, 28.0, 16.0, 13.0, 4.0, 4.0, 4.0, 3.0, 1.0, 6.0, 9.0, 2.0, 3.0, 3.0, 1.0, 2.0, 3.0, 0.0, 1.0, 2.0, 1.0, 1.0, 1.0, 1.0, 1.0, 1.0, 1.0, 1.0, 0.0, 1.0, 0.0, 1.0, 1.0, 1.0, 0.0, 0.0, 1.0, 0.0, 1.0, 0.0, 0.0, 0.0, 1.0, 0.0, 1.0, 0.0, 0.0, 1.0, 0.0], [53.0, 23.0, 18.0, 10.0, 4.0, 5.0, 5.0, 2.0, 2.0, 7.0, 3.0, 3.0, 0.0, 5.0, 4.0, 2.0, 0.0, 2.0, 2.0, 4.0, 1.0, 1.0, 3.0, 0.0, 2.0, 0.0, 0.0, 1.0, 0.0, 0.0, 0.0, 0.0, 0.0, 0.0, 0.0, 1.0, 3.0, 0.0, 0.0, 1.0, 0.0, 1.0, 0.0, 0.0, 1.0, 0.0, 2.0, 1.0, 3.0], [62.0, 24.0, 12.0, 14.0, 5.0, 2.0, 3.0, 2.0, 2.0, 9.0, 6.0, 4.0, 4.0, 4.0, 4.0, 0.0, 1.0, 3.0, 1.0, 2.0, 1.0, 1.0, 0.0, 0.0, 0.0, 1.0, 2.0, 0.0, 1.0, 0.0, 1.0, 0.0, 0.0, 0.0, 1.0, 1.0, 0.0, 1.0, 0.0, 1.0, 0.0, 0.0, 0.0, 0.0, 0.0, 1.0, 2.0, 1.0, 1.0], [57.0, 24.0, 13.0, 14.0, 8.0, 4.0, 2.0, 2.0, 4.0, 4.0, 5.0, 2.0, 6.0, 3.0, 8.0, 3.0, 1.0, 1.0, 1.0, 1.0, 0.0, 1.0, 0.0, 0.0, 1.0, 0.0, 0.0, 1.0, 2.0, 0.0, 0.0, 1.0, 0.0, 1.0, 2.0, 1.0, 3.0, 0.0, 0.0, 1.0, 0.0, 0.0, 0.0, 0.0, 0.0, 0.0, 0.0, 1.0, 0.0], [62.0, 27.0, 15.0, 9.0, 6.0, 4.0, 5.0, 2.0, 5.0, 4.0, 4.0, 4.0, 3.0, 2.0, 4.0, 3.0, 2.0, 1.0, 2.0, 2.0, 1.0, 0.0, 1.0, 1.0, 0.0, 0.0, 0.0, 1.0, 1.0, 1.0, 0.0, 1.0, 0.0, 1.0, 0.0, 1.0, 1.0, 0.0, 1.0, 0.0, 2.0, 0.0, 0.0, 1.0, 0.0, 0.0, 1.0, 0.0, 1.0], [59.0, 25.0, 11.0, 13.0, 4.0, 5.0, 7.0, 5.0, 2.0, 5.0, 3.0, 7.0, 4.0, 2.0, 1.0, 3.0, 3.0, 0.0, 2.0, 2.0, 1.0, 1.0, 0.0, 0.0, 0.0, 0.0, 0.0, 1.0, 1.0, 1.0, 0.0, 0.0, 1.0, 1.0, 0.0, 0.0, 0.0, 1.0, 1.0, 0.0, 2.0, 1.0, 0.0, 0.0, 0.0, 0.0, 1.0, 0.0, 1.0], [57.0, 24.0, 25.0, 6.0, 6.0, 4.0, 4.0, 1.0, 5.0, 3.0, 1.0, 5.0, 4.0, 7.0, 6.0, 2.0, 3.0, 0.0, 0.0, 2.0, 2.0, 3.0, 1.0, 0.0, 0.0, 0.0, 0.0, 1.0, 0.0, 0.0, 1.0, 1.0, 0.0, 1.0, 0.0, 0.0, 2.0, 0.0, 1.0, 0.0, 0.0, 2.0, 1.0, 0.0, 2.0, 0.0, 0.0, 1.0, 0.0], [74.0, 25.0, 13.0, 9.0, 3.0, 3.0, 5.0, 8.0, 4.0, 2.0, 6.0, 3.0, 5.0, 1.0, 2.0, 4.0, 1.0, 4.0, 1.0, 2.0, 0.0, 1.0, 0.0, 0.0, 0.0, 0.0, 1.0, 1.0, 1.0, 0.0, 0.0, 0.0, 1.0, 1.0, 1.0, 0.0, 1.0, 0.0, 1.0, 1.0, 1.0, 0.0, 0.0, 0.0, 0.0, 1.0, 1.0, 0.0, 1.0], [76.0, 16.0, 25.0, 6.0, 6.0, 4.0, 3.0, 2.0, 6.0, 4.0, 4.0, 3.0, 1.0, 3.0, 6.0, 5.0, 0.0, 1.0, 2.0, 0.0, 2.0, 1.0, 1.0, 0.0, 0.0, 0.0, 3.0, 1.0, 1.0, 0.0, 0.0, 0.0, 1.0, 0.0, 1.0, 0.0, 1.0, 1.0, 2.0, 0.0, 1.0, 0.0, 2.0, 1.0, 0.0, 0.0, 0.0, 0.0, 1.0], [60.0, 28.0, 23.0, 6.0, 7.0, 5.0, 5.0, 2.0, 2.0, 5.0, 5.0, 4.0, 5.0, 4.0, 3.0, 5.0, 1.0, 1.0, 3.0, 3.0, 0.0, 0.0, 0.0, 0.0, 0.0, 1.0, 0.0, 0.0, 0.0, 2.0, 0.0, 2.0, 0.0, 1.0, 0.0, 0.0, 2.0, 1.0, 1.0, 0.0, 0.0, 1.0, 0.0, 0.0, 0.0, 0.0, 1.0, 0.0, 0.0], [63.0, 28.0, 9.0, 9.0, 9.0, 3.0, 2.0, 4.0, 3.0, 1.0, 4.0, 4.0, 7.0, 2.0, 1.0, 0.0, 4.0, 1.0, 4.0, 3.0, 0.0, 2.0, 0.0, 1.0, 1.0, 1.0, 0.0, 0.0, 2.0, 1.0, 1.0, 0.0, 1.0, 2.0, 1.0, 0.0, 1.0, 1.0, 0.0, 0.0, 2.0, 0.0, 0.0, 1.0, 0.0, 0.0, 0.0, 0.0, 0.0], [68.0, 23.0, 18.0, 5.0, 9.0, 3.0, 5.0, 5.0, 4.0, 5.0, 1.0, 1.0, 6.0, 3.0, 5.0, 3.0, 4.0, 2.0, 2.0, 0.0, 0.0, 1.0, 1.0, 0.0, 0.0, 0.0, 0.0, 1.0, 1.0, 1.0, 0.0, 2.0, 0.0, 1.0, 0.0, 2.0, 1.0, 0.0, 1.0, 0.0, 0.0, 1.0, 1.0, 0.0, 0.0, 0.0, 0.0, 0.0, 0.0], [56.0, 25.0, 14.0, 13.0, 8.0, 5.0, 5.0, 3.0, 6.0, 1.0, 3.0, 4.0, 4.0, 0.0, 3.0, 4.0, 1.0, 3.0, 4.0, 0.0, 4.0, 1.0, 0.0, 0.0, 1.0, 1.0, 0.0, 0.0, 0.0, 1.0, 1.0, 0.0, 0.0, 0.0, 1.0, 0.0, 1.0, 2.0, 1.0, 1.0, 2.0, 0.0, 0.0, 0.0, 0.0, 0.0, 0.0, 1.0, 1.0], [48.0, 30.0, 18.0, 13.0, 7.0, 4.0, 5.0, 0.0, 3.0, 2.0, 4.0, 2.0, 5.0, 4.0, 4.0, 2.0, 0.0, 5.0, 3.0, 4.0, 2.0, 0.0, 2.0, 0.0, 0.0, 0.0, 0.0, 0.0, 0.0, 0.0, 1.0, 1.0, 1.0, 1.0, 3.0, 0.0, 0.0, 1.0, 0.0, 1.0, 0.0, 1.0, 0.0, 2.0, 0.0, 0.0, 0.0, 0.0, 0.0], [60.0, 22.0, 16.0, 8.0, 7.0, 6.0, 5.0, 4.0, 2.0, 4.0, 5.0, 5.0, 3.0, 5.0, 0.0, 3.0, 3.0, 1.0, 2.0, 1.0, 2.0, 0.0, 0.0, 1.0, 1.0, 2.0, 0.0, 2.0, 0.0, 1.0, 0.0, 1.0, 0.0, 0.0, 0.0, 2.0, 0.0, 0.0, 1.0, 0.0, 0.0, 0.0, 2.0, 0.0, 1.0, 0.0, 1.0, 0.0, 1.0], [58.0, 26.0, 17.0, 8.0, 5.0, 5.0, 3.0, 4.0, 6.0, 3.0, 4.0, 8.0, 4.0, 2.0, 0.0, 3.0, 2.0, 1.0, 1.0, 1.0, 0.0, 1.0, 3.0, 0.0, 1.0, 2.0, 1.0, 2.0, 0.0, 0.0, 0.0, 0.0, 0.0, 1.0, 2.0, 1.0, 1.0, 1.0, 0.0, 1.0, 0.0, 0.0, 0.0, 2.0, 0.0, 2.0, 0.0, 0.0, 0.0]],
    "Name": "sCurve-0",
    "Overflow": 2070176.0,
    "Type": "Histo2d",
    "Underflow": 0.0,
    "x": {
        "AxisTitle": "Vcal",
        "Bins": 51,
        "High": 302.5,
        "Low": 47.5
    },
    "y": {
        "AxisTitle": "Occupancy",
        "Bins": 49,
        "High": 49.5,
        "Low": 0.5
    },
    "z": {
        "AxisTitle": "Number of pixels"
    }
}