time,Hardware,Voltage,Current
1625780197678,high-voltage-3,1,0.0624668
time,Hardware,Voltage,Current
1625780197678,high-voltage-3,2,0.0673943
time,Hardware,Voltage,Current
1625780197678,high-voltage-3,3,0.0722506
time,Hardware,Voltage,Current
1625780197678,high-voltage-3,4,0.0758879
time,Hardware,Voltage,Current
1625780197678,high-voltage-3,5,0.0795584
time,Hardware,Voltage,Current
1625780197678,high-voltage-3,6,0.0829917
time,Hardware,Voltage,Current
1625780197678,high-voltage-3,7,0.0845183
time,Hardware,Voltage,Current
1625780197678,high-voltage-3,8,0.0884553
time,Hardware,Voltage,Current
1625780197678,high-voltage-3,9,0.0906758
time,Hardware,Voltage,Current
1625780197678,high-voltage-3,10,0.0925348
time,Hardware,Voltage,Current
1625780197678,high-voltage-3,11,0.095478
time,Hardware,Voltage,Current
1625780197678,high-voltage-3,12,0.100057
time,Hardware,Voltage,Current
1625780197678,high-voltage-3,13,0.103137
time,Hardware,Voltage,Current
1625780197678,high-voltage-3,14,0.104573
time,Hardware,Voltage,Current
1625780197678,high-voltage-3,15,0.107358
time,Hardware,Voltage,Current
1625780197678,high-voltage-3,16,0.109966
time,Hardware,Voltage,Current
1625780197678,high-voltage-3,17,0.112877
time,Hardware,Voltage,Current
1625780197678,high-voltage-3,18,0.114149
time,Hardware,Voltage,Current
1625780197678,high-voltage-3,19,0.116598
time,Hardware,Voltage,Current
1625780197678,high-voltage-3,20,0.118833
time,Hardware,Voltage,Current
1625780197678,high-voltage-3,25,0.129487
time,Hardware,Voltage,Current
1625780197678,high-voltage-3,30,0.138523
time,Hardware,Voltage,Current
1625780197678,high-voltage-3,35,0.146741
time,Hardware,Voltage,Current
1625780197678,high-voltage-3,40,0.153909
time,Hardware,Voltage,Current
1625780197678,high-voltage-3,45,0.163094
time,Hardware,Voltage,Current
1625780197678,high-voltage-3,50,0.171824
time,Hardware,Voltage,Current
1625780197678,high-voltage-3,55,0.181243
time,Hardware,Voltage,Current
1625780197678,high-voltage-3,60,0.192313
time,Hardware,Voltage,Current
1625780197678,high-voltage-3,65,0.203125
time,Hardware,Voltage,Current
1625780197678,high-voltage-3,70,0.212961
time,Hardware,Voltage,Current
1625780197678,high-voltage-3,75,0.223718
time,Hardware,Voltage,Current
1625780197678,high-voltage-3,80,0.232347
time,Hardware,Voltage,Current
1625780197678,high-voltage-3,85,0.243911
time,Hardware,Voltage,Current
1625780197678,high-voltage-3,90,0.251802
time,Hardware,Voltage,Current
1625780197678,high-voltage-3,95,0.263821
time,Hardware,Voltage,Current
1625780197678,high-voltage-3,100,0.2744
