{
    "Data": [0.0, 0.0, 0.0, 0.0, 0.0, 0.0, 0.0, 0.0, 0.0, 0.0, 0.0, 0.0, 0.0, 0.0, 0.0, 0.0, 0.0, 0.0, 0.0, 0.0, 0.0, 0.0, 0.0, 0.0, 0.0, 0.0, 0.0, 0.0, 0.0, 0.0, 0.0, 0.0, 0.0, 0.0, 0.0, 0.0, 0.0, 0.0, 0.0, 0.0, 0.0, 0.0, 0.0, 0.0, 0.0, 0.0, 0.0, 0.0, 0.0, 0.0, 67.0, 116.0, 119.0, 141.0, 183.0, 202.0, 252.0, 258.0, 286.0, 332.0, 380.0, 406.0, 444.0, 497.0, 533.0, 618.0, 632.0, 687.0, 696.0, 734.0, 792.0, 789.0, 855.0, 828.0, 867.0, 833.0, 804.0, 924.0, 894.0, 830.0, 857.0, 815.0, 813.0, 858.0, 844.0, 929.0, 1099.0, 1212.0, 1617.0, 1846.0, 2297.0, 2588.0, 2834.0, 2931.0, 2732.0, 2503.0, 2027.0, 1676.0, 1264.0, 908.0, 637.0, 478.0, 328.0, 217.0, 159.0, 95.0, 89.0, 67.0, 50.0, 38.0, 38.0, 30.0, 33.0, 19.0, 26.0, 21.0, 16.0, 11.0, 12.0, 14.0, 17.0, 12.0, 9.0, 18.0, 10.0, 12.0, 11.0, 12.0, 9.0, 10.0, 6.0, 2.0, 5.0, 5.0, 6.0, 10.0, 4.0, 4.0, 8.0, 3.0, 7.0, 5.0, 5.0, 3.0, 2.0, 1.0, 2.0, 2.0, 3.0, 1.0, 6.0, 0.0, 3.0, 6.0, 6.0, 5.0, 7.0, 8.0, 15.0, 17.0, 21.0, 27.0, 44.0, 44.0, 57.0, 72.0, 82.0, 98.0, 143.0, 175.0, 210.0, 246.0, 290.0, 323.0, 402.0, 472.0, 519.0, 562.0, 608.0, 670.0, 683.0, 714.0, 807.0, 826.0, 886.0, 923.0, 965.0, 980.0, 930.0, 938.0, 894.0, 946.0, 918.0, 833.0, 805.0, 766.0, 651.0, 677.0, 561.0, 514.0, 445.0, 389.0, 402.0, 321.0, 282.0, 223.0, 192.0, 171.0, 170.0, 139.0, 111.0, 90.0, 83.0, 70.0, 36.0, 38.0, 33.0, 12.0, 21.0, 7.0, 15.0, 9.0, 6.0, 3.0, 3.0, 3.0, 0.0, 1.0, 0.0, 0.0, 1.0, 0.0, 1.0, 0.0, 0.0, 0.0, 0.0, 0.0, 1.0, 0.0, 0.0, 0.0, 0.0, 0.0, 1.0, 0.0, 0.0, 0.0, 1.0, 0.0, 0.0, 0.0, 0.0, 0.0, 0.0, 0.0, 0.0, 0.0, 0.0, 0.0, 0.0, 0.0, 0.0, 0.0, 0.0, 0.0, 0.0, 0.0, 0.0, 0.0, 0.0, 0.0, 0.0, 0.0, 0.0, 0.0, 0.0, 0.0, 0.0, 0.0, 0.0, 0.0, 0.0, 0.0, 0.0, 0.0, 0.0, 0.0, 0.0, 0.0, 0.0, 0.0, 0.0, 0.0, 0.0, 0.0, 0.0, 0.0, 0.0, 0.0, 0.0, 0.0, 0.0, 0.0, 0.0, 0.0, 0.0, 0.0, 0.0, 0.0, 0.0, 0.0, 0.0, 0.0, 0.0, 0.0, 0.0, 0.0, 0.0, 0.0, 0.0, 0.0, 0.0, 0.0, 0.0, 0.0, 0.0, 0.0, 0.0, 0.0, 0.0, 0.0, 0.0, 0.0, 0.0, 0.0, 0.0, 0.0, 0.0, 0.0, 0.0, 0.0, 0.0, 0.0, 0.0, 0.0, 0.0, 0.0, 0.0, 0.0, 0.0, 0.0, 0.0, 0.0, 0.0, 0.0, 0.0, 0.0, 0.0, 0.0, 0.0, 0.0, 0.0, 0.0],
    "Name": "ThresholdDist-0",
    "Overflow": 0.0,
    "Type": "Histo1d",
    "Underflow": 0.0,
    "x": {
        "AxisTitle": "Threshold [e]",
        "Bins": 364,
        "High": 3635.0,
        "Low": -5.0
    },
    "y": {
        "AxisTitle": "Number of Pixels"
    },
    "z": {
        "AxisTitle": "z"
    }
}