{
    "Data": [0.0, 0.0, 0.0, 0.0, 0.0, 0.0, 0.0, 0.0, 0.0, 0.0, 0.0, 0.0, 0.0, 0.0, 0.0, 0.0, 0.0, 0.0, 0.0, 0.0, 0.0, 0.0, 0.0, 0.0, 0.0, 0.0, 0.0, 0.0, 0.0, 0.0, 0.0, 0.0, 0.0, 0.0, 0.0, 0.0, 0.0, 0.0, 0.0, 0.0, 0.0, 0.0, 0.0, 0.0, 0.0, 0.0, 0.0, 0.0, 0.0, 0.0, 40.0, 80.0, 87.0, 101.0, 129.0, 135.0, 143.0, 190.0, 213.0, 249.0, 253.0, 291.0, 342.0, 392.0, 463.0, 527.0, 537.0, 607.0, 613.0, 668.0, 743.0, 811.0, 817.0, 841.0, 863.0, 869.0, 929.0, 944.0, 921.0, 917.0, 915.0, 909.0, 888.0, 889.0, 900.0, 938.0, 976.0, 1158.0, 1328.0, 1674.0, 2075.0, 2497.0, 2810.0, 3125.0, 2878.0, 2920.0, 2425.0, 1996.0, 1534.0, 1066.0, 768.0, 528.0, 369.0, 257.0, 176.0, 105.0, 93.0, 80.0, 64.0, 39.0, 37.0, 31.0, 31.0, 19.0, 19.0, 24.0, 22.0, 15.0, 13.0, 15.0, 15.0, 12.0, 14.0, 9.0, 18.0, 10.0, 9.0, 12.0, 9.0, 10.0, 7.0, 5.0, 5.0, 3.0, 4.0, 5.0, 6.0, 3.0, 4.0, 11.0, 6.0, 4.0, 4.0, 4.0, 5.0, 2.0, 0.0, 1.0, 2.0, 1.0, 3.0, 3.0, 2.0, 3.0, 2.0, 5.0, 3.0, 0.0, 4.0, 1.0, 5.0, 6.0, 5.0, 9.0, 7.0, 9.0, 13.0, 24.0, 14.0, 22.0, 43.0, 46.0, 49.0, 70.0, 88.0, 98.0, 132.0, 137.0, 177.0, 227.0, 240.0, 286.0, 340.0, 369.0, 429.0, 430.0, 554.0, 594.0, 588.0, 657.0, 688.0, 666.0, 791.0, 767.0, 878.0, 847.0, 891.0, 889.0, 867.0, 909.0, 848.0, 859.0, 827.0, 826.0, 744.0, 724.0, 634.0, 596.0, 547.0, 480.0, 476.0, 413.0, 395.0, 328.0, 298.0, 256.0, 218.0, 201.0, 176.0, 156.0, 125.0, 121.0, 86.0, 91.0, 74.0, 53.0, 37.0, 35.0, 26.0, 16.0, 17.0, 11.0, 10.0, 10.0, 8.0, 9.0, 4.0, 0.0, 1.0, 1.0, 0.0, 0.0, 0.0, 0.0, 0.0, 0.0, 0.0, 1.0, 0.0, 0.0, 2.0, 0.0, 0.0, 0.0, 0.0, 0.0, 1.0, 0.0, 0.0, 0.0, 0.0, 0.0, 1.0, 1.0, 0.0, 0.0, 0.0, 0.0, 0.0, 0.0, 0.0, 0.0, 1.0, 0.0, 0.0, 0.0, 0.0, 0.0, 1.0, 0.0, 0.0, 0.0, 0.0, 0.0, 0.0, 0.0, 0.0, 0.0, 0.0, 0.0, 0.0, 0.0, 0.0, 0.0, 0.0, 0.0, 0.0, 0.0, 0.0, 0.0, 0.0, 0.0, 0.0, 0.0, 0.0, 0.0, 0.0, 0.0, 0.0, 0.0, 0.0, 0.0, 0.0, 0.0, 0.0, 0.0, 0.0, 0.0, 0.0, 0.0, 0.0, 0.0, 0.0, 0.0, 0.0, 0.0, 0.0, 0.0, 0.0, 0.0, 0.0, 0.0, 0.0, 0.0, 0.0, 0.0, 0.0, 0.0, 0.0, 0.0, 0.0, 0.0, 0.0, 0.0, 0.0, 0.0, 0.0, 0.0, 0.0, 0.0, 0.0, 0.0, 0.0, 0.0, 0.0, 0.0, 0.0, 0.0, 0.0, 0.0, 0.0, 0.0, 0.0, 0.0, 0.0, 0.0, 0.0, 0.0, 0.0, 0.0, 0.0, 0.0, 0.0, 0.0, 0.0, 0.0, 0.0, 0.0, 0.0, 0.0, 0.0, 0.0, 0.0, 0.0, 0.0, 0.0, 0.0, 0.0],
    "Name": "ThresholdDist-0",
    "Overflow": 0.0,
    "Type": "Histo1d",
    "Underflow": 0.0,
    "x": {
        "AxisTitle": "Threshold [e]",
        "Bins": 388,
        "High": 3875.0,
        "Low": -5.0
    },
    "y": {
        "AxisTitle": "Number of Pixels"
    },
    "z": {
        "AxisTitle": "z"
    }
}