{
    "Data": [0.0, 0.0, 0.0, 0.0, 0.0, 0.0, 0.0, 0.0, 0.0, 0.0, 0.0, 0.0, 0.0, 0.0, 2.0, 0.0, 0.0, 1.0, 2.0, 8.0, 18.0, 62.0, 72.0, 82.0, 230.0, 304.0, 290.0, 340.0, 424.0, 532.0, 472.0, 524.0, 503.0, 787.0, 864.0, 639.0, 1220.0, 3016.0, 4072.0, 2888.0, 1759.0, 3417.0, 5537.0, 4642.0, 2793.0, 2400.0, 3905.0, 3908.0, 3161.0, 1842.0, 1581.0, 1715.0, 1302.0, 1127.0, 1079.0, 1049.0, 1099.0, 921.0, 760.0, 645.0, 769.0, 615.0, 613.0, 520.0, 454.0, 521.0, 451.0, 389.0, 395.0, 364.0, 336.0, 344.0, 280.0, 248.0, 240.0, 250.0, 219.0, 214.0, 216.0, 165.0, 163.0, 168.0, 155.0, 129.0, 122.0, 122.0, 88.0, 88.0, 61.0, 82.0, 78.0, 81.0, 57.0, 62.0, 50.0, 56.0, 42.0, 38.0, 49.0, 33.0, 42.0, 34.0, 29.0, 35.0, 21.0, 22.0, 17.0, 19.0, 24.0, 17.0, 24.0, 20.0, 24.0, 10.0, 11.0, 16.0, 13.0, 23.0, 16.0, 9.0, 12.0, 17.0, 11.0, 12.0, 14.0, 9.0, 9.0, 8.0, 9.0, 12.0, 7.0, 4.0, 4.0, 6.0, 4.0, 4.0, 8.0, 7.0, 8.0, 9.0, 6.0, 5.0, 9.0, 4.0, 11.0, 7.0, 7.0, 5.0, 6.0, 7.0, 3.0, 0.0, 3.0, 5.0, 5.0, 7.0, 3.0, 1.0, 3.0, 3.0, 5.0, 6.0, 1.0, 4.0, 7.0, 1.0, 4.0, 5.0, 4.0, 2.0, 2.0, 3.0, 1.0, 3.0, 3.0, 6.0, 3.0, 5.0, 3.0, 1.0, 5.0, 5.0, 1.0, 4.0, 2.0, 4.0, 2.0, 2.0, 2.0, 2.0, 1.0, 2.0, 4.0, 2.0, 3.0, 2.0, 3.0, 2.0, 1.0, 2.0, 2.0],
    "Name": "TimePerFitDist-0",
    "Overflow": 205.0,
    "Type": "Histo1d",
    "Underflow": 0.0,
    "x": {
        "AxisTitle": "Fit Time [us]",
        "Bins": 201,
        "High": 401.0,
        "Low": -1.0
    },
    "y": {
        "AxisTitle": "Number of Pixels"
    },
    "z": {
        "AxisTitle": "z"
    }
}