{
    "Data": [0.0, 0.0, 0.0, 0.0, 0.0, 0.0, 0.0, 0.0, 0.0, 0.0, 0.0, 0.0, 0.0, 0.0, 0.0, 0.0, 0.0, 8.0, 54.0, 16.0, 23.0, 490.0, 1072.0, 338.0, 372.0, 1242.0, 1820.0, 839.0, 614.0, 1111.0, 1320.0, 907.0, 533.0, 707.0, 886.0, 681.0, 471.0, 662.0, 1141.0, 959.0, 697.0, 947.0, 2066.0, 3566.0, 2397.0, 1534.0, 2292.0, 3594.0, 4360.0, 3049.0, 2255.0, 2438.0, 3458.0, 2916.0, 2184.0, 1613.0, 1627.0, 2055.0, 1505.0, 1258.0, 1101.0, 1103.0, 1069.0, 763.0, 700.0, 694.0, 630.0, 615.0, 460.0, 466.0, 412.0, 440.0, 336.0, 302.0, 256.0, 272.0, 232.0, 219.0, 213.0, 187.0, 185.0, 179.0, 164.0, 140.0, 130.0, 114.0, 103.0, 91.0, 91.0, 94.0, 93.0, 97.0, 95.0, 60.0, 60.0, 69.0, 62.0, 60.0, 57.0, 62.0, 48.0, 60.0, 43.0, 46.0, 37.0, 38.0, 24.0, 30.0, 36.0, 31.0, 22.0, 27.0, 19.0, 21.0, 29.0, 24.0, 37.0, 20.0, 22.0, 23.0, 23.0, 21.0, 26.0, 17.0, 15.0, 9.0, 11.0, 12.0, 9.0, 16.0, 9.0, 14.0, 15.0, 10.0, 14.0, 11.0, 4.0, 13.0, 8.0, 9.0, 7.0, 5.0, 11.0, 3.0, 4.0, 6.0, 10.0, 10.0, 7.0, 3.0, 9.0, 7.0, 4.0, 1.0, 4.0, 2.0, 7.0, 6.0, 4.0, 6.0, 6.0, 7.0, 5.0, 3.0, 3.0, 4.0, 2.0, 4.0, 1.0, 8.0, 7.0, 6.0, 3.0, 5.0, 6.0, 13.0, 4.0, 4.0, 7.0, 4.0, 6.0, 4.0, 4.0, 3.0, 2.0, 1.0, 5.0, 3.0, 4.0, 6.0, 5.0, 5.0, 3.0, 2.0, 3.0, 3.0, 2.0, 1.0, 2.0, 5.0, 3.0],
    "Name": "TimePerFitDist-0",
    "Overflow": 254.0,
    "Type": "Histo1d",
    "Underflow": 0.0,
    "x": {
        "AxisTitle": "Fit Time [us]",
        "Bins": 201,
        "High": 401.0,
        "Low": -1.0
    },
    "y": {
        "AxisTitle": "Number of Pixels"
    },
    "z": {
        "AxisTitle": "z"
    }
}