{
    "Data": [0.0, 0.0, 0.0, 0.0, 0.0, 0.0, 0.0, 0.0, 0.0, 0.0, 0.0, 0.0, 0.0, 0.0, 0.0, 0.0, 0.0, 0.0, 0.0, 1.0, 0.0, 0.0, 4.0, 6.0, 5.0, 5.0, 22.0, 34.0, 21.0, 16.0, 46.0, 73.0, 68.0, 129.0, 128.0, 108.0, 228.0, 701.0, 1293.0, 785.0, 570.0, 1155.0, 2417.0, 3926.0, 2150.0, 1546.0, 2030.0, 3421.0, 3449.0, 2242.0, 1794.0, 1739.0, 2813.0, 1965.0, 1457.0, 1106.0, 1195.0, 1258.0, 954.0, 765.0, 676.0, 951.0, 698.0, 518.0, 477.0, 414.0, 537.0, 389.0, 321.0, 277.0, 309.0, 306.0, 275.0, 214.0, 195.0, 187.0, 181.0, 162.0, 166.0, 141.0, 126.0, 100.0, 71.0, 89.0, 100.0, 115.0, 97.0, 72.0, 55.0, 53.0, 54.0, 46.0, 59.0, 43.0, 53.0, 53.0, 36.0, 52.0, 33.0, 30.0, 39.0, 33.0, 29.0, 23.0, 17.0, 28.0, 28.0, 15.0, 24.0, 31.0, 27.0, 30.0, 21.0, 20.0, 17.0, 16.0, 18.0, 18.0, 14.0, 16.0, 14.0, 15.0, 15.0, 11.0, 14.0, 12.0, 17.0, 15.0, 11.0, 13.0, 18.0, 13.0, 13.0, 7.0, 16.0, 7.0, 4.0, 4.0, 4.0, 10.0, 4.0, 11.0, 6.0, 5.0, 9.0, 7.0, 8.0, 6.0, 4.0, 6.0, 5.0, 9.0, 1.0, 2.0, 4.0, 7.0, 4.0, 5.0, 2.0, 3.0, 3.0, 4.0, 1.0, 1.0, 2.0, 0.0, 0.0, 4.0, 5.0, 4.0, 2.0, 6.0, 3.0, 5.0, 2.0, 1.0, 0.0, 1.0, 3.0, 9.0, 2.0, 1.0, 1.0, 2.0, 3.0, 2.0, 2.0, 1.0, 1.0, 2.0, 0.0, 0.0, 2.0, 2.0, 9.0, 4.0, 2.0, 1.0, 1.0, 2.0, 4.0],
    "Name": "TimePerFitDist-0",
    "Overflow": 254.0,
    "Type": "Histo1d",
    "Underflow": 0.0,
    "x": {
        "AxisTitle": "Fit Time [us]",
        "Bins": 201,
        "High": 401.0,
        "Low": -1.0
    },
    "y": {
        "AxisTitle": "Number of Pixels"
    },
    "z": {
        "AxisTitle": "z"
    }
}