time,Hardware,Voltage,Current
1625776181399,high-voltage-4,1,0.428686
time,Hardware,Voltage,Current
1625776181399,high-voltage-4,2,0.582832
time,Hardware,Voltage,Current
1625776181399,high-voltage-4,3,0.67609
time,Hardware,Voltage,Current
1625776181399,high-voltage-4,4,0.739608
time,Hardware,Voltage,Current
1625776181399,high-voltage-4,5,0.785326
time,Hardware,Voltage,Current
1625776181399,high-voltage-4,6,0.823617
time,Hardware,Voltage,Current
1625776181399,high-voltage-4,7,0.857358
time,Hardware,Voltage,Current
1625776181399,high-voltage-4,8,0.925759
time,Hardware,Voltage,Current
1625776181399,high-voltage-4,9,0.972055
time,Hardware,Voltage,Current
1625776181399,high-voltage-4,10,1.01115
time,Hardware,Voltage,Current
1625776181399,high-voltage-4,11,1.00955
time,Hardware,Voltage,Current
1625776181399,high-voltage-4,12,1.05551
time,Hardware,Voltage,Current
1625776181399,high-voltage-4,13,1.09975
time,Hardware,Voltage,Current
1625776181399,high-voltage-4,14,1.14577
time,Hardware,Voltage,Current
1625776181399,high-voltage-4,15,1.19449
time,Hardware,Voltage,Current
1625776181399,high-voltage-4,16,1.24351
time,Hardware,Voltage,Current
1625776181399,high-voltage-4,17,1.29756
time,Hardware,Voltage,Current
1625776181399,high-voltage-4,18,1.35057
time,Hardware,Voltage,Current
1625776181399,high-voltage-4,19,1.40511
time,Hardware,Voltage,Current
1625776181399,high-voltage-4,20,1.46429
time,Hardware,Voltage,Current
1625776181399,high-voltage-4,25,1.73579
time,Hardware,Voltage,Current
1625776181399,high-voltage-4,30,1.94501
time,Hardware,Voltage,Current
1625776181399,high-voltage-4,35,2.15288
time,Hardware,Voltage,Current
1625776181399,high-voltage-4,40,2.36189
time,Hardware,Voltage,Current
1625776181399,high-voltage-4,45,2.59509
time,Hardware,Voltage,Current
1625776181399,high-voltage-4,50,2.8611
time,Hardware,Voltage,Current
1625776181399,high-voltage-4,55,3.17559
time,Hardware,Voltage,Current
1625776181399,high-voltage-4,60,3.55428
time,Hardware,Voltage,Current
1625776181399,high-voltage-4,65,4.0349
time,Hardware,Voltage,Current
1625776181399,high-voltage-4,70,4.77979
time,Hardware,Voltage,Current
1625776181399,high-voltage-4,75,7.91343
time,Hardware,Voltage,Current
1625776181399,high-voltage-4,80,9.99973
time,Hardware,Voltage,Current
1625776181399,high-voltage-4,85,9.99971
time,Hardware,Voltage,Current
1625776181399,high-voltage-4,90,9.99978
time,Hardware,Voltage,Current
1625776181399,high-voltage-4,95,9.99975
time,Hardware,Voltage,Current
1625776181399,high-voltage-4,100,9.99976
