{
    "Data": [0.0, 0.0, 0.0, 0.0, 0.0, 0.0, 0.0, 0.0, 0.0, 0.0, 0.0, 0.0, 0.0, 0.0, 0.0, 1.0, 1.0, 0.0, 4.0, 10.0, 12.0, 8.0, 8.0, 8.0, 1.0, 31.0, 35.0, 38.0, 44.0, 44.0, 32.0, 8.0, 32.0, 4.0, 15.0, 36.0, 9.0, 1.0, 12.0, 16.0, 50.0, 29.0, 7.0, 50.0, 25.0, 50.0, 50.0, 50.0, 42.0, 50.0, 50.0],
    "Name": "Scurve-70-96",
    "Overflow": 0.0,
    "Type": "Histo1d",
    "Underflow": 0.0,
    "x": {
        "AxisTitle": "Vcal",
        "Bins": 51,
        "High": 302.5,
        "Low": 47.5
    },
    "y": {
        "AxisTitle": "Occupancy"
    },
    "z": {
        "AxisTitle": "z"
    }
}