time,Hardware,Voltage,Current
1626352131339,high-voltage-3,1,0.00182084
time,Hardware,Voltage,Current
1626352131339,high-voltage-3,2,0.00432651
time,Hardware,Voltage,Current
1626352131339,high-voltage-3,3,0.00741966
time,Hardware,Voltage,Current
1626352131339,high-voltage-3,4,0.0088761
time,Hardware,Voltage,Current
1626352131339,high-voltage-3,5,0.0101433
time,Hardware,Voltage,Current
1626352131339,high-voltage-3,6,0.0108199
time,Hardware,Voltage,Current
1626352131339,high-voltage-3,7,0.0114339
time,Hardware,Voltage,Current
1626352131339,high-voltage-3,8,0.0129072
time,Hardware,Voltage,Current
1626352131339,high-voltage-3,9,0.0151453
time,Hardware,Voltage,Current
1626352131339,high-voltage-3,10,0.0168872
time,Hardware,Voltage,Current
1626352131339,high-voltage-3,11,0.01911
time,Hardware,Voltage,Current
1626352131339,high-voltage-3,12,0.0208925
time,Hardware,Voltage,Current
1626352131339,high-voltage-3,13,0.0222145
time,Hardware,Voltage,Current
1626352131339,high-voltage-3,14,0.0221424
time,Hardware,Voltage,Current
1626352131339,high-voltage-3,15,0.0239419
time,Hardware,Voltage,Current
1626352131339,high-voltage-3,16,0.0251331
time,Hardware,Voltage,Current
1626352131339,high-voltage-3,17,0.0262031
time,Hardware,Voltage,Current
1626352131339,high-voltage-3,18,0.027501
time,Hardware,Voltage,Current
1626352131339,high-voltage-3,19,0.0292495
time,Hardware,Voltage,Current
1626352131339,high-voltage-3,20,0.0305705
time,Hardware,Voltage,Current
1626352131339,high-voltage-3,25,0.0358318
time,Hardware,Voltage,Current
1626352131339,high-voltage-3,30,0.0418967
time,Hardware,Voltage,Current
1626352131339,high-voltage-3,35,0.0470623
time,Hardware,Voltage,Current
1626352131339,high-voltage-3,40,0.0539265
time,Hardware,Voltage,Current
1626352131339,high-voltage-3,45,0.0601293
time,Hardware,Voltage,Current
1626352131339,high-voltage-3,50,0.0644233
time,Hardware,Voltage,Current
1626352131339,high-voltage-3,55,0.0701759
time,Hardware,Voltage,Current
1626352131339,high-voltage-3,60,0.074238
time,Hardware,Voltage,Current
1626352131339,high-voltage-3,65,0.0781517
time,Hardware,Voltage,Current
1626352131339,high-voltage-3,70,0.0842779
time,Hardware,Voltage,Current
1626352131339,high-voltage-3,75,0.0882802
time,Hardware,Voltage,Current
1626352131339,high-voltage-3,80,0.0926939
time,Hardware,Voltage,Current
1626352131339,high-voltage-3,85,0.0987115
time,Hardware,Voltage,Current
1626352131339,high-voltage-3,90,0.10351
time,Hardware,Voltage,Current
1626352131339,high-voltage-3,95,0.110259
time,Hardware,Voltage,Current
1626352131339,high-voltage-3,100,0.114775
