time,Hardware,Voltage,Current
1623304842690,high-voltage,1,0.0631893
time,Hardware,Voltage,Current
1623304842690,high-voltage,2,0.0797785
time,Hardware,Voltage,Current
1623304842690,high-voltage,3,0.0968866
time,Hardware,Voltage,Current
1623304842690,high-voltage,4,0.11014
time,Hardware,Voltage,Current
1623304842690,high-voltage,5,0.120364
time,Hardware,Voltage,Current
1623304842690,high-voltage,6,0.131861
time,Hardware,Voltage,Current
1623304842690,high-voltage,7,0.140985
time,Hardware,Voltage,Current
1623304842690,high-voltage,8,0.149507
time,Hardware,Voltage,Current
1623304842690,high-voltage,9,0.159438
time,Hardware,Voltage,Current
1623304842690,high-voltage,10,0.166763
time,Hardware,Voltage,Current
1623304842690,high-voltage,11,0.176656
time,Hardware,Voltage,Current
1623304842690,high-voltage,12,0.183152
time,Hardware,Voltage,Current
1623304842690,high-voltage,13,0.191081
time,Hardware,Voltage,Current
1623304842690,high-voltage,14,0.195639
time,Hardware,Voltage,Current
1623304842690,high-voltage,15,0.202208
time,Hardware,Voltage,Current
1623304842690,high-voltage,16,0.207553
time,Hardware,Voltage,Current
1623304842690,high-voltage,17,0.211895
time,Hardware,Voltage,Current
1623304842690,high-voltage,18,0.216229
time,Hardware,Voltage,Current
1623304842690,high-voltage,19,0.221487
time,Hardware,Voltage,Current
1623304842690,high-voltage,20,0.224589
time,Hardware,Voltage,Current
1623304842690,high-voltage,25,0.248595
time,Hardware,Voltage,Current
1623304842690,high-voltage,30,0.283991
time,Hardware,Voltage,Current
1623304842690,high-voltage,35,0.402607
time,Hardware,Voltage,Current
1623304842690,high-voltage,40,0.733193
time,Hardware,Voltage,Current
1623304842690,high-voltage,45,1.27807
time,Hardware,Voltage,Current
1623304842690,high-voltage,50,1.97638
time,Hardware,Voltage,Current
1623304842690,high-voltage,55,2.81541
time,Hardware,Voltage,Current
1623304842690,high-voltage,60,3.79335
time,Hardware,Voltage,Current
1623304842690,high-voltage,65,4.91555
time,Hardware,Voltage,Current
1623304842690,high-voltage,6.20413e-06,6.20768
time,Hardware,Voltage,Current
1623304842690,high-voltage,75,7.6745
time,Hardware,Voltage,Current
1623304842690,high-voltage,80,9.36566
time,Hardware,Voltage,Current
1623304842690,high-voltage,85,10
