{
    "Data": [2.0, 1.0, 0.0, 0.0, 0.0, 0.0, 10.0, 20.0, 67.0, 190.0, 675.0, 1433.0, 2627.0, 3689.0, 4186.0, 3775.0, 2936.0, 2249.0, 2156.0, 2307.0, 2860.0, 3257.0, 3607.0, 3336.0, 2717.0, 2002.0, 1414.0, 1025.0, 772.0, 641.0, 559.0, 533.0, 437.0, 385.0, 312.0, 253.0, 181.0, 161.0, 142.0, 97.0, 82.0, 41.0, 57.0, 31.0, 25.0, 27.0, 16.0, 20.0, 15.0, 13.0, 10.0, 9.0, 10.0, 6.0, 8.0, 8.0],
    "Name": "NoiseDist-0",
    "Overflow": 186.0,
    "Type": "Histo1d",
    "Underflow": 0.0,
    "x": {
        "AxisTitle": "Noise [e]",
        "Bins": 56,
        "High": 281.0,
        "Low": -2.0
    },
    "y": {
        "AxisTitle": "Number of Pixels"
    },
    "z": {
        "AxisTitle": "z"
    }
}