time,Hardware,Voltage,Current
1625751937997,high-voltage,1,0.00395704
time,Hardware,Voltage,Current
1625751937997,high-voltage,2,0.0252124
time,Hardware,Voltage,Current
1625751937997,high-voltage,3,0.0397165
time,Hardware,Voltage,Current
1625751937997,high-voltage,4,0.0510214
time,Hardware,Voltage,Current
1625751937997,high-voltage,5,0.060727
time,Hardware,Voltage,Current
1625751937997,high-voltage,6,0.0703616
time,Hardware,Voltage,Current
1625751937997,high-voltage,7,0.0783488
time,Hardware,Voltage,Current
1625751937997,high-voltage,8,0.0838483
time,Hardware,Voltage,Current
1625751937997,high-voltage,9,0.0906454
time,Hardware,Voltage,Current
1625751937997,high-voltage,10,0.0962118
time,Hardware,Voltage,Current
1625751937997,high-voltage,11,0.101146
time,Hardware,Voltage,Current
1625751937997,high-voltage,12,0.105498
time,Hardware,Voltage,Current
1625751937997,high-voltage,13,0.110563
time,Hardware,Voltage,Current
1625751937997,high-voltage,14,0.114523
time,Hardware,Voltage,Current
1625751937997,high-voltage,15,0.119843
time,Hardware,Voltage,Current
1625751937997,high-voltage,16,0.124459
time,Hardware,Voltage,Current
1625751937997,high-voltage,17,0.128668
time,Hardware,Voltage,Current
1625751937997,high-voltage,18,0.132372
time,Hardware,Voltage,Current
1625751937997,high-voltage,19,0.136883
time,Hardware,Voltage,Current
1625751937997,high-voltage,20,0.141414
time,Hardware,Voltage,Current
1625751937997,high-voltage,25,0.161962
time,Hardware,Voltage,Current
1625751937997,high-voltage,30,0.186846
time,Hardware,Voltage,Current
1625751937997,high-voltage,35,0.225162
time,Hardware,Voltage,Current
1625751937997,high-voltage,40,0.302495
time,Hardware,Voltage,Current
1625751937997,high-voltage,45,0.440904
time,Hardware,Voltage,Current
1625751937997,high-voltage,50,0.664747
time,Hardware,Voltage,Current
1625751937997,high-voltage,55,1.03806
time,Hardware,Voltage,Current
1625751937997,high-voltage,60,1.62944
time,Hardware,Voltage,Current
1625751937997,high-voltage,65,2.47565
time,Hardware,Voltage,Current
1625751937997,high-voltage,70,3.69257
time,Hardware,Voltage,Current
1625751937997,high-voltage,75,5.22948
time,Hardware,Voltage,Current
1625751937997,high-voltage,80,6.73557
time,Hardware,Voltage,Current
1625751937997,high-voltage,85,8.45863
time,Hardware,Voltage,Current
1625751937997,high-voltage,90,10
