{
    "Data": [0.0, 0.0, 0.0, 0.0, 0.0, 0.0, 0.0, 0.0, 0.0, 0.0, 0.0, 0.0, 0.0, 0.0, 7.0, 1.0, 0.0, 117.0, 351.0, 66.0, 29.0, 587.0, 1641.0, 649.0, 224.0, 1367.0, 2121.0, 859.0, 799.0, 1947.0, 1986.0, 1073.0, 1207.0, 1396.0, 846.0, 639.0, 906.0, 987.0, 777.0, 769.0, 727.0, 712.0, 1085.0, 1758.0, 1433.0, 1319.0, 2038.0, 2922.0, 3185.0, 2529.0, 2569.0, 2452.0, 2923.0, 2341.0, 2161.0, 2209.0, 2265.0, 2240.0, 1880.0, 1839.0, 1721.0, 1544.0, 1179.0, 909.0, 913.0, 829.0, 892.0, 689.0, 603.0, 548.0, 563.0, 518.0, 403.0, 332.0, 283.0, 296.0, 274.0, 228.0, 189.0, 178.0, 173.0, 182.0, 121.0, 109.0, 118.0, 109.0, 75.0, 71.0, 80.0, 73.0, 64.0, 49.0, 46.0, 50.0, 54.0, 40.0, 35.0, 26.0, 31.0, 29.0, 24.0, 22.0, 36.0, 20.0, 20.0, 10.0, 20.0, 21.0, 16.0, 19.0, 21.0, 16.0, 14.0, 11.0, 15.0, 6.0, 12.0, 17.0, 12.0, 13.0, 15.0, 11.0, 12.0, 12.0, 11.0, 9.0, 10.0, 7.0, 10.0, 8.0, 2.0, 6.0, 10.0, 9.0, 4.0, 9.0, 7.0, 3.0, 5.0, 5.0, 3.0, 2.0, 3.0, 1.0, 3.0, 3.0, 3.0, 1.0, 3.0, 3.0, 1.0, 3.0, 5.0, 5.0, 2.0, 2.0, 2.0, 2.0, 4.0, 1.0, 2.0, 1.0, 2.0, 1.0, 3.0, 1.0, 1.0, 2.0, 1.0, 1.0, 0.0, 2.0, 1.0, 2.0, 0.0, 1.0, 2.0, 0.0, 2.0, 1.0, 2.0, 3.0, 3.0, 0.0, 0.0, 0.0, 1.0, 0.0, 3.0, 0.0, 2.0, 1.0, 2.0, 0.0, 0.0, 0.0, 3.0, 0.0, 0.0, 0.0, 1.0],
    "Name": "TimePerFitDist-0",
    "Overflow": 103.0,
    "Type": "Histo1d",
    "Underflow": 0.0,
    "x": {
        "AxisTitle": "Fit Time [us]",
        "Bins": 201,
        "High": 401.0,
        "Low": -1.0
    },
    "y": {
        "AxisTitle": "Number of Pixels"
    },
    "z": {
        "AxisTitle": "z"
    }
}