time,Hardware,Voltage,Current
1623089327736,high-voltage-3,1,0.157713
time,Hardware,Voltage,Current
1623089327736,high-voltage-3,2,0.168026
time,Hardware,Voltage,Current
1623089327736,high-voltage-3,3,0.177935
time,Hardware,Voltage,Current
1623089327736,high-voltage-3,4,0.186715
time,Hardware,Voltage,Current
1623089327736,high-voltage-3,5,0.193265
time,Hardware,Voltage,Current
1623089327736,high-voltage-3,6,0.19886
time,Hardware,Voltage,Current
1623089327736,high-voltage-3,7,0.205194
time,Hardware,Voltage,Current
1623089327736,high-voltage-3,8,0.213057
time,Hardware,Voltage,Current
1623089327736,high-voltage-3,9,0.219903
time,Hardware,Voltage,Current
1623089327736,high-voltage-3,10,0.227463
time,Hardware,Voltage,Current
1623089327736,high-voltage-3,11,0.23589
time,Hardware,Voltage,Current
1623089327736,high-voltage-3,12,0.242535
time,Hardware,Voltage,Current
1623089327736,high-voltage-3,13,0.249635
time,Hardware,Voltage,Current
1623089327736,high-voltage-3,14,0.255903
time,Hardware,Voltage,Current
1623089327736,high-voltage-3,15,0.262296
time,Hardware,Voltage,Current
1623089327736,high-voltage-3,16,0.267499
time,Hardware,Voltage,Current
1623089327736,high-voltage-3,17,0.272168
time,Hardware,Voltage,Current
1623089327736,high-voltage-3,18,0.277189
time,Hardware,Voltage,Current
1623089327736,high-voltage-3,19,0.281705
time,Hardware,Voltage,Current
1623089327736,high-voltage-3,20,0.285584
time,Hardware,Voltage,Current
1623089327736,high-voltage-3,25,0.303266
time,Hardware,Voltage,Current
1623089327736,high-voltage-3,30,0.317961
time,Hardware,Voltage,Current
1623089327736,high-voltage-3,35,0.331538
time,Hardware,Voltage,Current
1623089327736,high-voltage-3,40,0.343925
time,Hardware,Voltage,Current
1623089327736,high-voltage-3,45,0.356637
time,Hardware,Voltage,Current
1623089327736,high-voltage-3,50,0.368668
time,Hardware,Voltage,Current
1623089327736,high-voltage-3,55,0.38101
time,Hardware,Voltage,Current
1623089327736,high-voltage-3,60,0.392791
time,Hardware,Voltage,Current
1623089327736,high-voltage-3,65,0.404128
time,Hardware,Voltage,Current
1623089327736,high-voltage-3,70,0.415685
time,Hardware,Voltage,Current
1623089327736,high-voltage-3,75,0.427216
time,Hardware,Voltage,Current
1623089327736,high-voltage-3,80,0.437784
time,Hardware,Voltage,Current
1623089327736,high-voltage-3,85,0.44917
time,Hardware,Voltage,Current
1623089327736,high-voltage-3,90,0.460109
time,Hardware,Voltage,Current
1623089327736,high-voltage-3,95,0.471632
time,Hardware,Voltage,Current
1623089327736,high-voltage-3,100,0.481677
