{
    "Data": [25.0, 35.0, 0.0, 0.0, 0.0, 10.0, 67.0, 191.0, 684.0, 1497.0, 3014.0, 4522.0, 5039.0, 4755.0, 3964.0, 3704.0, 4308.0, 4725.0, 4819.0, 3922.0, 2776.0, 1635.0, 861.0, 399.0, 188.0, 107.0, 73.0, 47.0, 34.0, 34.0, 24.0, 15.0, 10.0, 11.0, 10.0, 10.0],
    "Name": "NoiseDist-0",
    "Overflow": 43.0,
    "Type": "Histo1d",
    "Underflow": 0.0,
    "x": {
        "AxisTitle": "Noise [e]",
        "Bins": 36,
        "High": 181.0,
        "Low": -2.0
    },
    "y": {
        "AxisTitle": "Number of Pixels"
    },
    "z": {
        "AxisTitle": "z"
    }
}