time,Hardware,Voltage,Current
1625757904180,high-voltage-2,1,0.266417
time,Hardware,Voltage,Current
1625757904180,high-voltage-2,2,0.328833
time,Hardware,Voltage,Current
1625757904180,high-voltage-2,3,0.366209
time,Hardware,Voltage,Current
1625757904180,high-voltage-2,4,0.398552
time,Hardware,Voltage,Current
1625757904180,high-voltage-2,5,0.432728
time,Hardware,Voltage,Current
1625757904180,high-voltage-2,6,0.468649
time,Hardware,Voltage,Current
1625757904180,high-voltage-2,7,0.508829
time,Hardware,Voltage,Current
1625757904180,high-voltage-2,8,0.551146
time,Hardware,Voltage,Current
1625757904180,high-voltage-2,9,0.594505
time,Hardware,Voltage,Current
1625757904180,high-voltage-2,10,0.635993
time,Hardware,Voltage,Current
1625757904180,high-voltage-2,11,0.673873
time,Hardware,Voltage,Current
1625757904180,high-voltage-2,12,0.710923
time,Hardware,Voltage,Current
1625757904180,high-voltage-2,13,0.743784
time,Hardware,Voltage,Current
1625757904180,high-voltage-2,14,0.772417
time,Hardware,Voltage,Current
1625757904180,high-voltage-2,15,0.797897
time,Hardware,Voltage,Current
1625757904180,high-voltage-2,16,0.823272
time,Hardware,Voltage,Current
1625757904180,high-voltage-2,17,0.846928
time,Hardware,Voltage,Current
1625757904180,high-voltage-2,18,0.8704
time,Hardware,Voltage,Current
1625757904180,high-voltage-2,19,0.89081
time,Hardware,Voltage,Current
1625757904180,high-voltage-2,20,0.909857
time,Hardware,Voltage,Current
1625757904180,high-voltage-2,25,0.999618
time,Hardware,Voltage,Current
1625757904180,high-voltage-2,30,1.0912
time,Hardware,Voltage,Current
1625757904180,high-voltage-2,35,1.18256
time,Hardware,Voltage,Current
1625757904180,high-voltage-2,40,1.29115
time,Hardware,Voltage,Current
1625757904180,high-voltage-2,45,1.4221
time,Hardware,Voltage,Current
1625757904180,high-voltage-2,50,1.51791
time,Hardware,Voltage,Current
1625757904180,high-voltage-2,55,1.60446
time,Hardware,Voltage,Current
1625757904180,high-voltage-2,60,1.68982
time,Hardware,Voltage,Current
1625757904180,high-voltage-2,65,1.7713
time,Hardware,Voltage,Current
1625757904180,high-voltage-2,70,1.85068
time,Hardware,Voltage,Current
1625757904180,high-voltage-2,75,1.9247
time,Hardware,Voltage,Current
1625757904180,high-voltage-2,80,1.99736
time,Hardware,Voltage,Current
1625757904180,high-voltage-2,85,2.06704
time,Hardware,Voltage,Current
1625757904180,high-voltage-2,90,2.13468
time,Hardware,Voltage,Current
1625757904180,high-voltage-2,95,2.19969
time,Hardware,Voltage,Current
1625757904180,high-voltage-2,100,2.26408
