{
    "Data": [9.0, 10.0, 4.0, 1.0, 5.0, 15.0, 46.0, 253.0, 859.0, 2206.0, 4147.0, 5344.0, 5313.0, 4258.0, 3523.0, 3700.0, 4383.0, 4930.0, 4795.0, 3685.0, 2340.0, 1338.0, 800.0, 637.0, 723.0, 941.0, 1218.0, 1593.0, 1923.0, 2060.0, 2288.0, 2171.0, 2036.0, 1799.0, 1489.0, 1248.0, 937.0, 705.0, 537.0, 387.0, 308.0, 247.0, 194.0, 135.0, 132.0, 114.0, 90.0, 78.0, 62.0, 63.0, 49.0, 35.0, 37.0, 29.0, 32.0, 23.0, 16.0, 15.0, 19.0, 15.0, 9.0, 11.0, 12.0, 9.0, 11.0, 7.0],
    "Name": "NoiseDist-0",
    "Overflow": 137.0,
    "Type": "Histo1d",
    "Underflow": 0.0,
    "x": {
        "AxisTitle": "Noise [e]",
        "Bins": 66,
        "High": 331.0,
        "Low": -2.0
    },
    "y": {
        "AxisTitle": "Number of Pixels"
    },
    "z": {
        "AxisTitle": "z"
    }
}