{
    "Data": [0.0, 0.0, 0.0, 0.0, 0.0, 0.0, 0.0, 0.0, 0.0, 0.0, 0.0, 0.0, 0.0, 0.0, 0.0, 3.0, 5.0, 3.0, 0.0, 5.0, 14.0, 4.0, 5.0, 10.0, 16.0, 12.0, 20.0, 16.0, 22.0, 23.0, 30.0, 33.0, 35.0, 30.0, 40.0, 46.0, 44.0, 42.0, 46.0, 47.0, 47.0, 49.0, 49.0, 50.0, 50.0, 50.0, 49.0, 50.0, 50.0, 50.0, 50.0],
    "Name": "Scurve-70-96",
    "Overflow": 0.0,
    "Type": "Histo1d",
    "Underflow": 0.0,
    "x": {
        "AxisTitle": "Vcal",
        "Bins": 51,
        "High": 302.5,
        "Low": 47.5
    },
    "y": {
        "AxisTitle": "Occupancy"
    },
    "z": {
        "AxisTitle": "z"
    }
}