time,Hardware,Voltage,Current
1626373066901,high-voltage-2,1,0.132653
time,Hardware,Voltage,Current
1626373066901,high-voltage-2,2,0.179899
time,Hardware,Voltage,Current
1626373066901,high-voltage-2,3,0.206906
time,Hardware,Voltage,Current
1626373066901,high-voltage-2,4,0.227552
time,Hardware,Voltage,Current
1626373066901,high-voltage-2,5,0.250447
time,Hardware,Voltage,Current
1626373066901,high-voltage-2,6,0.273463
time,Hardware,Voltage,Current
1626373066901,high-voltage-2,7,0.296551
time,Hardware,Voltage,Current
1626373066901,high-voltage-2,8,0.323974
time,Hardware,Voltage,Current
1626373066901,high-voltage-2,9,0.348766
time,Hardware,Voltage,Current
1626373066901,high-voltage-2,10,0.374218
time,Hardware,Voltage,Current
1626373066901,high-voltage-2,11,0.399063
time,Hardware,Voltage,Current
1626373066901,high-voltage-2,12,0.421845
time,Hardware,Voltage,Current
1626373066901,high-voltage-2,13,0.439927
time,Hardware,Voltage,Current
1626373066901,high-voltage-2,14,0.456702
time,Hardware,Voltage,Current
1626373066901,high-voltage-2,15,0.470807
time,Hardware,Voltage,Current
1626373066901,high-voltage-2,16,0.484511
time,Hardware,Voltage,Current
1626373066901,high-voltage-2,17,0.496924
time,Hardware,Voltage,Current
1626373066901,high-voltage-2,18,0.509007
time,Hardware,Voltage,Current
1626373066901,high-voltage-2,19,0.520855
time,Hardware,Voltage,Current
1626373066901,high-voltage-2,20,0.531017
time,Hardware,Voltage,Current
1626373066901,high-voltage-2,25,0.583362
time,Hardware,Voltage,Current
1626373066901,high-voltage-2,30,0.634718
time,Hardware,Voltage,Current
1626373066901,high-voltage-2,35,0.686844
time,Hardware,Voltage,Current
1626373066901,high-voltage-2,40,0.749112
time,Hardware,Voltage,Current
1626373066901,high-voltage-2,45,0.826978
time,Hardware,Voltage,Current
1626373066901,high-voltage-2,50,0.885994
time,Hardware,Voltage,Current
1626373066901,high-voltage-2,55,0.941634
time,Hardware,Voltage,Current
1626373066901,high-voltage-2,60,0.994864
time,Hardware,Voltage,Current
1626373066901,high-voltage-2,65,1.04366
time,Hardware,Voltage,Current
1626373066901,high-voltage-2,70,1.09381
time,Hardware,Voltage,Current
1626373066901,high-voltage-2,75,1.14036
time,Hardware,Voltage,Current
1626373066901,high-voltage-2,80,1.18504
time,Hardware,Voltage,Current
1626373066901,high-voltage-2,85,1.22672
time,Hardware,Voltage,Current
1626373066901,high-voltage-2,90,1.26625
time,Hardware,Voltage,Current
1626373066901,high-voltage-2,95,1.30099
time,Hardware,Voltage,Current
1626373066901,high-voltage-2,100,1.33321
