{
    "Data": [727.0, 18139.0, 21386.0, 9987.0, 4885.0, 3502.0, 3308.0, 3127.0, 2683.0, 2132.0, 1522.0, 1067.0, 696.0, 508.0, 363.0, 245.0, 207.0, 166.0, 133.0, 102.0, 117.0, 80.0, 112.0, 99.0, 82.0, 84.0, 73.0, 71.0, 72.0, 54.0, 38.0, 52.0, 54.0, 50.0, 45.0, 49.0, 38.0, 22.0, 25.0, 20.0, 33.0, 24.0, 22.0, 17.0, 20.0, 12.0, 15.0, 12.0, 11.0, 17.0, 7.0],
    "Name": "Chi2Dist-0",
    "Overflow": 0.0,
    "Type": "Histo1d",
    "Underflow": 0.0,
    "x": {
        "AxisTitle": "Fit Chi/ndf",
        "Bins": 51,
        "High": 2.5250000953674318,
        "Low": -0.02500000037252903
    },
    "y": {
        "AxisTitle": "Number of Pixels"
    },
    "z": {
        "AxisTitle": "z"
    }
}