time,Hardware,Voltage,Current
1626342740073,high-voltage-2,1,0.0959737
time,Hardware,Voltage,Current
1626342740073,high-voltage-2,2,0.138959
time,Hardware,Voltage,Current
1626342740073,high-voltage-2,3,0.160247
time,Hardware,Voltage,Current
1626342740073,high-voltage-2,4,0.177952
time,Hardware,Voltage,Current
1626342740073,high-voltage-2,5,0.195719
time,Hardware,Voltage,Current
1626342740073,high-voltage-2,6,0.215471
time,Hardware,Voltage,Current
1626342740073,high-voltage-2,7,0.23712
time,Hardware,Voltage,Current
1626342740073,high-voltage-2,8,0.261565
time,Hardware,Voltage,Current
1626342740073,high-voltage-2,9,0.284365
time,Hardware,Voltage,Current
1626342740073,high-voltage-2,10,0.309824
time,Hardware,Voltage,Current
1626342740073,high-voltage-2,11,0.334636
time,Hardware,Voltage,Current
1626342740073,high-voltage-2,12,0.357722
time,Hardware,Voltage,Current
1626342740073,high-voltage-2,13,0.375589
time,Hardware,Voltage,Current
1626342740073,high-voltage-2,14,0.394383
time,Hardware,Voltage,Current
1626342740073,high-voltage-2,15,0.408027
time,Hardware,Voltage,Current
1626342740073,high-voltage-2,16,0.422017
time,Hardware,Voltage,Current
1626342740073,high-voltage-2,17,0.433395
time,Hardware,Voltage,Current
1626342740073,high-voltage-2,18,0.445906
time,Hardware,Voltage,Current
1626342740073,high-voltage-2,19,0.455685
time,Hardware,Voltage,Current
1626342740073,high-voltage-2,20,0.466893
time,Hardware,Voltage,Current
1626342740073,high-voltage-2,25,0.518364
time,Hardware,Voltage,Current
1626342740073,high-voltage-2,30,0.572543
time,Hardware,Voltage,Current
1626342740073,high-voltage-2,35,0.625815
time,Hardware,Voltage,Current
1626342740073,high-voltage-2,40,0.688323
time,Hardware,Voltage,Current
1626342740073,high-voltage-2,45,0.764013
time,Hardware,Voltage,Current
1626342740073,high-voltage-2,50,0.823742
time,Hardware,Voltage,Current
1626342740073,high-voltage-2,55,0.877636
time,Hardware,Voltage,Current
1626342740073,high-voltage-2,60,0.929962
time,Hardware,Voltage,Current
1626342740073,high-voltage-2,65,0.979905
time,Hardware,Voltage,Current
1626342740073,high-voltage-2,70,1.02904
time,Hardware,Voltage,Current
1626342740073,high-voltage-2,75,1.07598
time,Hardware,Voltage,Current
1626342740073,high-voltage-2,80,1.12068
time,Hardware,Voltage,Current
1626342740073,high-voltage-2,85,1.16181
time,Hardware,Voltage,Current
1626342740073,high-voltage-2,90,1.20059
time,Hardware,Voltage,Current
1626342740073,high-voltage-2,95,1.23653
time,Hardware,Voltage,Current
1626342740073,high-voltage-2,100,1.26919
