time,Hardware,Voltage,Current
1621277877246,high-voltage-3,1,0.16885
time,Hardware,Voltage,Current
1621277877246,high-voltage-3,2,0.178716
time,Hardware,Voltage,Current
1621277877246,high-voltage-3,3,0.187052
time,Hardware,Voltage,Current
1621277877246,high-voltage-3,4,0.195409
time,Hardware,Voltage,Current
1621277877246,high-voltage-3,5,0.199346
time,Hardware,Voltage,Current
1621277877246,high-voltage-3,6,0.205163
time,Hardware,Voltage,Current
1621277877246,high-voltage-3,7,0.212371
time,Hardware,Voltage,Current
1621277877246,high-voltage-3,8,0.217175
time,Hardware,Voltage,Current
1621277877246,high-voltage-3,9,0.223965
time,Hardware,Voltage,Current
1621277877246,high-voltage-3,10,0.230323
time,Hardware,Voltage,Current
1621277877246,high-voltage-3,11,0.237898
time,Hardware,Voltage,Current
1621277877246,high-voltage-3,12,0.245835
time,Hardware,Voltage,Current
1621277877246,high-voltage-3,13,0.251243
time,Hardware,Voltage,Current
1621277877246,high-voltage-3,14,0.255959
time,Hardware,Voltage,Current
1621277877246,high-voltage-3,15,0.261615
time,Hardware,Voltage,Current
1621277877246,high-voltage-3,16,0.269287
time,Hardware,Voltage,Current
1621277877246,high-voltage-3,17,0.273274
time,Hardware,Voltage,Current
1621277877246,high-voltage-3,18,0.278861
time,Hardware,Voltage,Current
1621277877246,high-voltage-3,19,0.285469
time,Hardware,Voltage,Current
1621277877246,high-voltage-3,20,0.290044
time,Hardware,Voltage,Current
1621277877246,high-voltage-3,25,0.31326
time,Hardware,Voltage,Current
1621277877246,high-voltage-3,30,0.335377
time,Hardware,Voltage,Current
1621277877246,high-voltage-3,35,0.35504
time,Hardware,Voltage,Current
1621277877246,high-voltage-3,40,0.372082
time,Hardware,Voltage,Current
1621277877246,high-voltage-3,45,0.391388
time,Hardware,Voltage,Current
1621277877246,high-voltage-3,50,0.406316
time,Hardware,Voltage,Current
1621277877246,high-voltage-3,55,0.420371
time,Hardware,Voltage,Current
1621277877246,high-voltage-3,60,0.434242
time,Hardware,Voltage,Current
1621277877246,high-voltage-3,65,0.447272
time,Hardware,Voltage,Current
1621277877246,high-voltage-3,70,0.458906
time,Hardware,Voltage,Current
1621277877246,high-voltage-3,75,0.475508
time,Hardware,Voltage,Current
1621277877246,high-voltage-3,80,0.489455
time,Hardware,Voltage,Current
1621277877246,high-voltage-3,85,0.499881
time,Hardware,Voltage,Current
1621277877246,high-voltage-3,90,0.508862
time,Hardware,Voltage,Current
1621277877246,high-voltage-3,95,0.521882
time,Hardware,Voltage,Current
1621277877246,high-voltage-3,100,0.532374
