time,Hardware,Voltage,Current
1626346380047,high-voltage-2,1,0.0962763
time,Hardware,Voltage,Current
1626346380047,high-voltage-2,2,0.137949
time,Hardware,Voltage,Current
1626346380047,high-voltage-2,3,0.161158
time,Hardware,Voltage,Current
1626346380047,high-voltage-2,4,0.177911
time,Hardware,Voltage,Current
1626346380047,high-voltage-2,5,0.196749
time,Hardware,Voltage,Current
1626346380047,high-voltage-2,6,0.216172
time,Hardware,Voltage,Current
1626346380047,high-voltage-2,7,0.237076
time,Hardware,Voltage,Current
1626346380047,high-voltage-2,8,0.26023
time,Hardware,Voltage,Current
1626346380047,high-voltage-2,9,0.283808
time,Hardware,Voltage,Current
1626346380047,high-voltage-2,10,0.310234
time,Hardware,Voltage,Current
1626346380047,high-voltage-2,11,0.333853
time,Hardware,Voltage,Current
1626346380047,high-voltage-2,12,0.355695
time,Hardware,Voltage,Current
1626346380047,high-voltage-2,13,0.374819
time,Hardware,Voltage,Current
1626346380047,high-voltage-2,14,0.391941
time,Hardware,Voltage,Current
1626346380047,high-voltage-2,15,0.407015
time,Hardware,Voltage,Current
1626346380047,high-voltage-2,16,0.421319
time,Hardware,Voltage,Current
1626346380047,high-voltage-2,17,0.432256
time,Hardware,Voltage,Current
1626346380047,high-voltage-2,18,0.446576
time,Hardware,Voltage,Current
1626346380047,high-voltage-2,19,0.457878
time,Hardware,Voltage,Current
1626346380047,high-voltage-2,20,0.46883
time,Hardware,Voltage,Current
1626346380047,high-voltage-2,25,0.520754
time,Hardware,Voltage,Current
1626346380047,high-voltage-2,30,0.570934
time,Hardware,Voltage,Current
1626346380047,high-voltage-2,35,0.626952
time,Hardware,Voltage,Current
1626346380047,high-voltage-2,40,0.687487
time,Hardware,Voltage,Current
1626346380047,high-voltage-2,45,0.765325
time,Hardware,Voltage,Current
1626346380047,high-voltage-2,50,0.823545
time,Hardware,Voltage,Current
1626346380047,high-voltage-2,55,0.88019
time,Hardware,Voltage,Current
1626346380047,high-voltage-2,60,0.932983
time,Hardware,Voltage,Current
1626346380047,high-voltage-2,65,0.984928
time,Hardware,Voltage,Current
1626346380047,high-voltage-2,70,1.03391
time,Hardware,Voltage,Current
1626346380047,high-voltage-2,75,1.07933
time,Hardware,Voltage,Current
1626346380047,high-voltage-2,80,1.12549
time,Hardware,Voltage,Current
1626346380047,high-voltage-2,85,1.16756
time,Hardware,Voltage,Current
1626346380047,high-voltage-2,90,1.20535
time,Hardware,Voltage,Current
1626346380047,high-voltage-2,95,1.24044
time,Hardware,Voltage,Current
1626346380047,high-voltage-2,100,1.27518
