{
    "Data": [0.0, 0.0, 0.0, 0.0, 0.0, 0.0, 0.0, 0.0, 0.0, 0.0, 0.0, 0.0, 0.0, 11.0, 12.0, 1.0, 4.0, 221.0, 569.0, 154.0, 65.0, 860.0, 2042.0, 1226.0, 471.0, 1504.0, 2541.0, 1531.0, 765.0, 1443.0, 1817.0, 1430.0, 993.0, 1001.0, 831.0, 668.0, 652.0, 720.0, 897.0, 947.0, 710.0, 688.0, 1640.0, 2811.0, 2366.0, 1545.0, 2034.0, 2836.0, 4191.0, 3201.0, 2408.0, 2521.0, 2526.0, 2602.0, 1887.0, 1709.0, 1667.0, 1980.0, 1617.0, 1546.0, 1317.0, 1064.0, 1034.0, 793.0, 647.0, 643.0, 603.0, 605.0, 462.0, 416.0, 343.0, 426.0, 327.0, 301.0, 258.0, 224.0, 246.0, 196.0, 200.0, 186.0, 156.0, 142.0, 143.0, 121.0, 99.0, 116.0, 98.0, 92.0, 74.0, 77.0, 85.0, 81.0, 56.0, 47.0, 40.0, 42.0, 42.0, 48.0, 35.0, 37.0, 32.0, 26.0, 20.0, 23.0, 24.0, 15.0, 12.0, 20.0, 13.0, 21.0, 12.0, 14.0, 13.0, 19.0, 12.0, 12.0, 16.0, 10.0, 7.0, 11.0, 4.0, 2.0, 6.0, 8.0, 6.0, 6.0, 7.0, 5.0, 5.0, 5.0, 7.0, 6.0, 4.0, 4.0, 2.0, 6.0, 2.0, 1.0, 6.0, 3.0, 3.0, 6.0, 0.0, 2.0, 3.0, 3.0, 2.0, 4.0, 0.0, 1.0, 2.0, 2.0, 3.0, 2.0, 1.0, 1.0, 1.0, 4.0, 1.0, 0.0, 3.0, 1.0, 2.0, 0.0, 0.0, 0.0, 2.0, 0.0, 0.0, 0.0, 0.0, 0.0, 0.0, 0.0, 0.0, 1.0, 0.0, 1.0, 1.0, 0.0, 0.0, 0.0, 0.0, 2.0, 0.0, 1.0, 0.0, 1.0, 0.0, 0.0, 0.0, 0.0, 2.0, 0.0, 1.0, 0.0, 0.0, 1.0, 0.0, 2.0, 0.0],
    "Name": "TimePerFitDist-0",
    "Overflow": 70.0,
    "Type": "Histo1d",
    "Underflow": 0.0,
    "x": {
        "AxisTitle": "Fit Time [us]",
        "Bins": 201,
        "High": 401.0,
        "Low": -1.0
    },
    "y": {
        "AxisTitle": "Number of Pixels"
    },
    "z": {
        "AxisTitle": "z"
    }
}