{
    "Data": [[2993.0, 1177.0, 652.0, 434.0, 332.0, 210.0, 179.0, 123.0, 108.0, 86.0, 75.0, 53.0, 42.0, 51.0, 44.0, 24.0, 30.0, 28.0, 23.0, 17.0, 17.0, 22.0, 10.0, 18.0, 9.0, 11.0, 11.0, 14.0, 13.0, 5.0, 7.0, 6.0, 10.0, 8.0, 12.0, 4.0, 5.0, 7.0, 6.0, 5.0, 6.0, 5.0, 3.0, 9.0, 5.0, 5.0, 5.0, 3.0, 4.0], [3755.0, 1783.0, 1097.0, 763.0, 552.0, 378.0, 332.0, 277.0, 213.0, 194.0, 171.0, 123.0, 122.0, 86.0, 90.0, 71.0, 77.0, 61.0, 47.0, 45.0, 31.0, 36.0, 28.0, 25.0, 29.0, 24.0, 23.0, 18.0, 25.0, 17.0, 9.0, 10.0, 16.0, 10.0, 9.0, 11.0, 7.0, 12.0, 13.0, 16.0, 8.0, 8.0, 8.0, 12.0, 7.0, 10.0, 10.0, 10.0, 13.0], [4054.0, 2257.0, 1589.0, 1105.0, 870.0, 697.0, 559.0, 521.0, 400.0, 360.0, 278.0, 290.0, 200.0, 200.0, 148.0, 146.0, 123.0, 127.0, 112.0, 113.0, 90.0, 80.0, 89.0, 76.0, 66.0, 61.0, 56.0, 49.0, 43.0, 42.0, 28.0, 34.0, 36.0, 36.0, 20.0, 20.0, 24.0, 21.0, 28.0, 15.0, 22.0, 18.0, 16.0, 15.0, 16.0, 17.0, 18.0, 15.0, 16.0], [4340.0, 2355.0, 1754.0, 1340.0, 1107.0, 938.0, 837.0, 701.0, 636.0, 551.0, 479.0, 443.0, 368.0, 356.0, 335.0, 284.0, 254.0, 219.0, 211.0, 211.0, 196.0, 181.0, 164.0, 126.0, 134.0, 130.0, 127.0, 124.0, 112.0, 82.0, 86.0, 81.0, 85.0, 63.0, 61.0, 53.0, 63.0, 49.0, 45.0, 52.0, 41.0, 38.0, 37.0, 37.0, 26.0, 30.0, 32.0, 35.0, 31.0], [6108.0, 2867.0, 1890.0, 1420.0, 1232.0, 1050.0, 975.0, 813.0, 781.0, 686.0, 635.0, 611.0, 540.0, 547.0, 496.0, 468.0, 433.0, 431.0, 376.0, 347.0, 353.0, 317.0, 307.0, 312.0, 250.0, 243.0, 230.0, 203.0, 211.0, 205.0, 178.0, 169.0, 173.0, 158.0, 172.0, 129.0, 131.0, 113.0, 115.0, 115.0, 103.0, 95.0, 86.0, 90.0, 81.0, 75.0, 79.0, 61.0, 65.0], [7727.0, 4631.0, 3147.0, 2249.0, 1705.0, 1372.0, 1173.0, 1012.0, 944.0, 785.0, 744.0, 696.0, 674.0, 621.0, 563.0, 544.0, 550.0, 528.0, 521.0, 502.0, 496.0, 432.0, 428.0, 438.0, 407.0, 408.0, 396.0, 390.0, 356.0, 358.0, 322.0, 292.0, 334.0, 284.0, 269.0, 282.0, 235.0, 271.0, 228.0, 233.0, 224.0, 199.0, 201.0, 219.0, 196.0, 179.0, 161.0, 161.0, 161.0], [3889.0, 3709.0, 3382.0, 3001.0, 2714.0, 2290.0, 2080.0, 1805.0, 1691.0, 1406.0, 1313.0, 1220.0, 1069.0, 948.0, 964.0, 788.0, 823.0, 743.0, 716.0, 654.0, 620.0, 598.0, 596.0, 546.0, 566.0, 522.0, 484.0, 497.0, 480.0, 530.0, 461.0, 488.0, 501.0, 475.0, 437.0, 435.0, 450.0, 402.0, 448.0, 418.0, 405.0, 375.0, 406.0, 436.0, 388.0, 396.0, 407.0, 373.0, 422.0], [971.0, 968.0, 1131.0, 1166.0, 1332.0, 1474.0, 1458.0, 1476.0, 1563.0, 1538.0, 1485.0, 1550.0, 1509.0, 1513.0, 1458.0, 1451.0, 1311.0, 1347.0, 1281.0, 1201.0, 1193.0, 1137.0, 1085.0, 1072.0, 973.0, 978.0, 931.0, 891.0, 815.0, 826.0, 770.0, 690.0, 700.0, 719.0, 642.0, 707.0, 650.0, 698.0, 689.0, 665.0, 749.0, 688.0, 668.0, 721.0, 713.0, 743.0, 728.0, 778.0, 875.0], [580.0, 311.0, 275.0, 272.0, 312.0, 330.0, 393.0, 417.0, 442.0, 512.0, 558.0, 632.0, 732.0, 736.0, 781.0, 844.0, 909.0, 880.0, 989.0, 1077.0, 1101.0, 1115.0, 1164.0, 1129.0, 1213.0, 1210.0, 1303.0, 1222.0, 1374.0, 1315.0, 1378.0, 1389.0, 1318.0, 1318.0, 1393.0, 1355.0, 1354.0, 1254.0, 1288.0, 1249.0, 1257.0, 1261.0, 1239.0, 1343.0, 1255.0, 1359.0, 1370.0, 1497.0, 1744.0], [638.0, 196.0, 148.0, 132.0, 121.0, 103.0, 132.0, 121.0, 127.0, 152.0, 146.0, 169.0, 182.0, 183.0, 225.0, 215.0, 269.0, 287.0, 338.0, 327.0, 377.0, 390.0, 451.0, 502.0, 531.0, 580.0, 635.0, 682.0, 758.0, 836.0, 879.0, 926.0, 1065.0, 1162.0, 1278.0, 1362.0, 1513.0, 1542.0, 1658.0, 1847.0, 1914.0, 2052.0, 2230.0, 2358.0, 2531.0, 2638.0, 3007.0, 3173.0, 3735.0], [892.0, 270.0, 126.0, 99.0, 72.0, 52.0, 72.0, 56.0, 58.0, 57.0, 53.0, 69.0, 68.0, 64.0, 75.0, 84.0, 91.0, 90.0, 116.0, 105.0, 117.0, 130.0, 163.0, 156.0, 178.0, 194.0, 225.0, 224.0, 271.0, 283.0, 350.0, 357.0, 409.0, 416.0, 520.0, 599.0, 633.0, 738.0, 843.0, 1009.0, 1168.0, 1453.0, 1597.0, 2072.0, 2568.0, 3137.0, 4047.0, 5219.0, 7560.0], [1269.0, 372.0, 161.0, 86.0, 64.0, 54.0, 42.0, 36.0, 46.0, 32.0, 35.0, 35.0, 26.0, 28.0, 32.0, 34.0, 42.0, 45.0, 45.0, 39.0, 50.0, 51.0, 67.0, 72.0, 64.0, 68.0, 68.0, 108.0, 93.0, 110.0, 121.0, 180.0, 159.0, 190.0, 204.0, 228.0, 238.0, 318.0, 338.0, 441.0, 525.0, 628.0, 785.0, 958.0, 1255.0, 1750.0, 2531.0, 4246.0, 8357.0], [1745.0, 586.0, 296.0, 129.0, 85.0, 66.0, 38.0, 32.0, 34.0, 26.0, 22.0, 18.0, 25.0, 19.0, 20.0, 23.0, 21.0, 21.0, 22.0, 19.0, 20.0, 33.0, 35.0, 26.0, 31.0, 30.0, 39.0, 36.0, 30.0, 51.0, 54.0, 63.0, 52.0, 85.0, 105.0, 98.0, 116.0, 150.0, 152.0, 203.0, 245.0, 304.0, 377.0, 428.0, 631.0, 870.0, 1272.0, 2361.0, 5588.0], [2264.0, 947.0, 524.0, 219.0, 145.0, 78.0, 55.0, 41.0, 29.0, 26.0, 24.0, 23.0, 18.0, 17.0, 18.0, 15.0, 12.0, 13.0, 8.0, 9.0, 13.0, 19.0, 15.0, 19.0, 25.0, 19.0, 22.0, 16.0, 24.0, 23.0, 20.0, 24.0, 31.0, 31.0, 43.0, 36.0, 62.0, 61.0, 63.0, 90.0, 114.0, 135.0, 179.0, 224.0, 312.0, 466.0, 715.0, 1252.0, 3290.0], [2812.0, 1340.0, 815.0, 473.0, 297.0, 155.0, 126.0, 64.0, 46.0, 44.0, 25.0, 26.0, 20.0, 21.0, 11.0, 24.0, 12.0, 9.0, 13.0, 11.0, 9.0, 20.0, 9.0, 17.0, 8.0, 10.0, 11.0, 11.0, 15.0, 6.0, 16.0, 13.0, 21.0, 15.0, 21.0, 31.0, 28.0, 26.0, 26.0, 34.0, 49.0, 46.0, 85.0, 100.0, 139.0, 229.0, 333.0, 639.0, 1960.0], [3165.0, 1827.0, 1139.0, 703.0, 484.0, 332.0, 195.0, 156.0, 107.0, 70.0, 55.0, 30.0, 34.0, 23.0, 19.0, 15.0, 15.0, 10.0, 13.0, 9.0, 5.0, 13.0, 17.0, 11.0, 9.0, 13.0, 9.0, 16.0, 12.0, 11.0, 7.0, 7.0, 10.0, 11.0, 18.0, 13.0, 13.0, 20.0, 14.0, 20.0, 35.0, 32.0, 32.0, 49.0, 67.0, 84.0, 137.0, 361.0, 1113.0], [3406.0, 2077.0, 1501.0, 1085.0, 732.0, 593.0, 402.0, 283.0, 223.0, 160.0, 108.0, 92.0, 73.0, 51.0, 46.0, 32.0, 20.0, 23.0, 11.0, 17.0, 13.0, 13.0, 14.0, 9.0, 9.0, 1.0, 6.0, 11.0, 9.0, 3.0, 8.0, 14.0, 8.0, 13.0, 13.0, 16.0, 10.0, 11.0, 14.0, 15.0, 23.0, 11.0, 16.0, 30.0, 41.0, 54.0, 74.0, 183.0, 568.0], [3415.0, 2194.0, 1760.0, 1337.0, 1018.0, 789.0, 647.0, 516.0, 409.0, 317.0, 249.0, 220.0, 146.0, 134.0, 103.0, 77.0, 59.0, 64.0, 35.0, 30.0, 29.0, 25.0, 19.0, 10.0, 10.0, 10.0, 12.0, 12.0, 9.0, 9.0, 12.0, 6.0, 4.0, 7.0, 4.0, 8.0, 9.0, 5.0, 12.0, 10.0, 17.0, 24.0, 11.0, 25.0, 20.0, 28.0, 52.0, 105.0, 300.0], [3425.0, 2320.0, 1848.0, 1530.0, 1245.0, 1011.0, 866.0, 748.0, 633.0, 552.0, 460.0, 358.0, 321.0, 257.0, 211.0, 175.0, 152.0, 133.0, 95.0, 90.0, 58.0, 60.0, 42.0, 47.0, 29.0, 22.0, 23.0, 19.0, 12.0, 8.0, 10.0, 9.0, 11.0, 10.0, 8.0, 9.0, 8.0, 7.0, 10.0, 6.0, 6.0, 16.0, 7.0, 12.0, 20.0, 30.0, 27.0, 66.0, 189.0], [3066.0, 2156.0, 1924.0, 1616.0, 1318.0, 1199.0, 1006.0, 952.0, 800.0, 753.0, 722.0, 577.0, 499.0, 423.0, 366.0, 322.0, 304.0, 255.0, 230.0, 162.0, 166.0, 147.0, 116.0, 103.0, 84.0, 66.0, 67.0, 44.0, 43.0, 35.0, 26.0, 26.0, 18.0, 17.0, 14.0, 10.0, 14.0, 12.0, 13.0, 20.0, 8.0, 16.0, 12.0, 12.0, 11.0, 10.0, 29.0, 46.0, 124.0], [2355.0, 1940.0, 1715.0, 1453.0, 1236.0, 1232.0, 1106.0, 1027.0, 980.0, 890.0, 842.0, 723.0, 618.0, 611.0, 546.0, 556.0, 471.0, 462.0, 393.0, 354.0, 305.0, 269.0, 209.0, 242.0, 214.0, 153.0, 137.0, 133.0, 111.0, 98.0, 92.0, 68.0, 60.0, 62.0, 48.0, 38.0, 36.0, 17.0, 31.0, 23.0, 13.0, 16.0, 20.0, 14.0, 17.0, 16.0, 26.0, 29.0, 74.0], [1707.0, 1429.0, 1372.0, 1247.0, 1193.0, 1071.0, 1042.0, 1043.0, 957.0, 917.0, 899.0, 871.0, 801.0, 726.0, 686.0, 688.0, 694.0, 588.0, 534.0, 503.0, 462.0, 400.0, 414.0, 347.0, 338.0, 305.0, 243.0, 236.0, 236.0, 219.0, 173.0, 159.0, 128.0, 141.0, 97.0, 94.0, 76.0, 67.0, 46.0, 59.0, 47.0, 26.0, 23.0, 22.0, 24.0, 29.0, 28.0, 29.0, 48.0], [1038.0, 847.0, 897.0, 887.0, 880.0, 955.0, 921.0, 874.0, 805.0, 872.0, 824.0, 894.0, 764.0, 786.0, 757.0, 774.0, 732.0, 696.0, 718.0, 700.0, 648.0, 593.0, 562.0, 538.0, 535.0, 468.0, 472.0, 400.0, 392.0, 364.0, 333.0, 306.0, 262.0, 291.0, 255.0, 197.0, 192.0, 165.0, 145.0, 126.0, 98.0, 84.0, 71.0, 70.0, 63.0, 41.0, 33.0, 40.0, 56.0], [627.0, 505.0, 546.0, 567.0, 582.0, 586.0, 599.0, 653.0, 638.0, 695.0, 666.0, 646.0, 700.0, 703.0, 687.0, 683.0, 767.0, 720.0, 709.0, 724.0, 697.0, 673.0, 652.0, 668.0, 659.0, 650.0, 615.0, 640.0, 574.0, 579.0, 541.0, 496.0, 457.0, 422.0, 420.0, 388.0, 372.0, 324.0, 327.0, 282.0, 237.0, 249.0, 205.0, 182.0, 132.0, 114.0, 124.0, 84.0, 83.0], [372.0, 276.0, 299.0, 310.0, 343.0, 350.0, 395.0, 417.0, 425.0, 442.0, 478.0, 492.0, 538.0, 558.0, 560.0, 583.0, 591.0, 611.0, 616.0, 623.0, 628.0, 640.0, 663.0, 621.0, 696.0, 721.0, 683.0, 667.0, 672.0, 698.0, 671.0, 672.0, 612.0, 648.0, 577.0, 639.0, 592.0, 552.0, 519.0, 525.0, 496.0, 433.0, 384.0, 378.0, 335.0, 289.0, 270.0, 220.0, 183.0], [349.0, 252.0, 210.0, 192.0, 201.0, 213.0, 213.0, 238.0, 229.0, 273.0, 260.0, 282.0, 310.0, 328.0, 385.0, 397.0, 396.0, 398.0, 443.0, 472.0, 520.0, 506.0, 503.0, 532.0, 579.0, 601.0, 640.0, 626.0, 713.0, 667.0, 672.0, 734.0, 703.0, 700.0, 710.0, 747.0, 771.0, 780.0, 784.0, 702.0, 756.0, 677.0, 673.0, 680.0, 618.0, 580.0, 545.0, 483.0, 440.0], [286.0, 155.0, 141.0, 80.0, 94.0, 108.0, 113.0, 108.0, 138.0, 126.0, 113.0, 125.0, 164.0, 164.0, 213.0, 213.0, 259.0, 247.0, 263.0, 282.0, 335.0, 360.0, 357.0, 416.0, 407.0, 429.0, 479.0, 469.0, 540.0, 606.0, 649.0, 628.0, 644.0, 706.0, 729.0, 768.0, 792.0, 852.0, 856.0, 868.0, 923.0, 993.0, 977.0, 979.0, 1020.0, 1027.0, 968.0, 951.0, 958.0], [288.0, 133.0, 116.0, 94.0, 68.0, 69.0, 69.0, 67.0, 68.0, 97.0, 95.0, 95.0, 116.0, 121.0, 127.0, 111.0, 109.0, 145.0, 129.0, 157.0, 187.0, 184.0, 212.0, 220.0, 259.0, 294.0, 313.0, 350.0, 393.0, 387.0, 399.0, 450.0, 452.0, 542.0, 627.0, 694.0, 661.0, 755.0, 822.0, 935.0, 952.0, 1006.0, 1044.0, 1201.0, 1245.0, 1345.0, 1460.0, 1551.0, 1666.0], [219.0, 98.0, 64.0, 92.0, 61.0, 82.0, 69.0, 82.0, 75.0, 57.0, 72.0, 58.0, 62.0, 60.0, 49.0, 52.0, 63.0, 72.0, 66.0, 75.0, 94.0, 126.0, 106.0, 152.0, 169.0, 137.0, 158.0, 209.0, 221.0, 242.0, 232.0, 259.0, 325.0, 368.0, 439.0, 434.0, 533.0, 524.0, 664.0, 736.0, 793.0, 964.0, 1051.0, 1200.0, 1315.0, 1491.0, 1775.0, 2044.0, 2609.0], [244.0, 77.0, 69.0, 49.0, 54.0, 62.0, 42.0, 39.0, 25.0, 31.0, 63.0, 40.0, 21.0, 25.0, 27.0, 30.0, 28.0, 30.0, 32.0, 37.0, 42.0, 43.0, 62.0, 62.0, 80.0, 91.0, 102.0, 88.0, 109.0, 169.0, 141.0, 179.0, 179.0, 210.0, 224.0, 278.0, 303.0, 374.0, 436.0, 519.0, 610.0, 670.0, 872.0, 994.0, 1143.0, 1468.0, 1870.0, 2309.0, 3301.0], [200.0, 113.0, 48.0, 61.0, 32.0, 42.0, 29.0, 34.0, 29.0, 20.0, 16.0, 31.0, 26.0, 12.0, 15.0, 27.0, 28.0, 33.0, 73.0, 16.0, 34.0, 35.0, 25.0, 19.0, 23.0, 35.0, 40.0, 59.0, 53.0, 78.0, 85.0, 74.0, 80.0, 95.0, 126.0, 173.0, 168.0, 195.0, 243.0, 320.0, 387.0, 409.0, 584.0, 710.0, 903.0, 1175.0, 1722.0, 2309.0, 3621.0], [216.0, 78.0, 53.0, 106.0, 55.0, 76.0, 41.0, 28.0, 45.0, 33.0, 45.0, 22.0, 8.0, 9.0, 20.0, 13.0, 5.0, 9.0, 23.0, 8.0, 5.0, 22.0, 11.0, 8.0, 7.0, 8.0, 6.0, 23.0, 21.0, 33.0, 41.0, 52.0, 36.0, 59.0, 70.0, 71.0, 70.0, 125.0, 143.0, 154.0, 193.0, 249.0, 350.0, 454.0, 654.0, 873.0, 1300.0, 1916.0, 3448.0], [207.0, 106.0, 90.0, 61.0, 48.0, 36.0, 30.0, 21.0, 16.0, 9.0, 21.0, 34.0, 24.0, 5.0, 7.0, 25.0, 9.0, 26.0, 20.0, 21.0, 23.0, 2.0, 5.0, 11.0, 1.0, 5.0, 7.0, 17.0, 48.0, 36.0, 30.0, 26.0, 28.0, 43.0, 49.0, 44.0, 70.0, 59.0, 54.0, 61.0, 94.0, 122.0, 183.0, 241.0, 407.0, 551.0, 944.0, 1441.0, 3034.0], [225.0, 110.0, 58.0, 36.0, 40.0, 54.0, 69.0, 54.0, 17.0, 11.0, 17.0, 32.0, 6.0, 32.0, 17.0, 23.0, 24.0, 34.0, 44.0, 11.0, 7.0, 12.0, 23.0, 42.0, 2.0, 7.0, 3.0, 3.0, 7.0, 24.0, 40.0, 11.0, 2.0, 10.0, 31.0, 31.0, 12.0, 36.0, 24.0, 46.0, 67.0, 43.0, 76.0, 105.0, 218.0, 330.0, 546.0, 984.0, 2220.0], [235.0, 88.0, 40.0, 38.0, 36.0, 35.0, 34.0, 17.0, 20.0, 24.0, 26.0, 12.0, 28.0, 46.0, 35.0, 22.0, 12.0, 8.0, 9.0, 19.0, 5.0, 28.0, 3.0, 4.0, 5.0, 6.0, 8.0, 16.0, 29.0, 15.0, 14.0, 21.0, 36.0, 4.0, 2.0, 3.0, 2.0, 3.0, 8.0, 8.0, 17.0, 27.0, 62.0, 58.0, 109.0, 196.0, 314.0, 662.0, 1667.0], [205.0, 83.0, 58.0, 31.0, 32.0, 37.0, 22.0, 25.0, 25.0, 16.0, 17.0, 11.0, 15.0, 24.0, 25.0, 7.0, 8.0, 3.0, 24.0, 12.0, 7.0, 3.0, 4.0, 11.0, 60.0, 14.0, 0.0, 3.0, 3.0, 5.0, 25.0, 1.0, 1.0, 19.0, 18.0, 20.0, 4.0, 14.0, 11.0, 6.0, 4.0, 14.0, 14.0, 18.0, 45.0, 115.0, 176.0, 406.0, 1177.0], [207.0, 75.0, 67.0, 42.0, 28.0, 23.0, 35.0, 55.0, 43.0, 7.0, 11.0, 3.0, 20.0, 22.0, 6.0, 4.0, 46.0, 15.0, 6.0, 3.0, 4.0, 9.0, 29.0, 6.0, 4.0, 5.0, 21.0, 4.0, 1.0, 4.0, 0.0, 6.0, 2.0, 8.0, 20.0, 2.0, 27.0, 5.0, 20.0, 2.0, 8.0, 22.0, 9.0, 56.0, 37.0, 47.0, 96.0, 224.0, 723.0], [226.0, 63.0, 40.0, 49.0, 25.0, 25.0, 39.0, 25.0, 18.0, 34.0, 81.0, 35.0, 6.0, 15.0, 3.0, 11.0, 5.0, 6.0, 39.0, 41.0, 2.0, 5.0, 26.0, 1.0, 5.0, 5.0, 14.0, 44.0, 17.0, 12.0, 22.0, 25.0, 2.0, 23.0, 6.0, 0.0, 4.0, 9.0, 41.0, 2.0, 23.0, 26.0, 5.0, 8.0, 14.0, 28.0, 29.0, 99.0, 432.0], [242.0, 74.0, 46.0, 74.0, 46.0, 48.0, 20.0, 15.0, 17.0, 43.0, 33.0, 9.0, 5.0, 5.0, 6.0, 7.0, 9.0, 16.0, 43.0, 26.0, 8.0, 3.0, 3.0, 6.0, 4.0, 3.0, 1.0, 24.0, 34.0, 2.0, 3.0, 3.0, 41.0, 10.0, 2.0, 11.0, 27.0, 11.0, 15.0, 11.0, 2.0, 1.0, 4.0, 0.0, 6.0, 8.0, 12.0, 49.0, 232.0], [211.0, 90.0, 71.0, 40.0, 27.0, 24.0, 24.0, 16.0, 15.0, 17.0, 14.0, 8.0, 29.0, 19.0, 17.0, 12.0, 13.0, 21.0, 26.0, 5.0, 1.0, 1.0, 5.0, 4.0, 9.0, 9.0, 8.0, 20.0, 2.0, 2.0, 0.0, 1.0, 4.0, 21.0, 1.0, 1.0, 0.0, 4.0, 9.0, 19.0, 14.0, 12.0, 0.0, 3.0, 2.0, 6.0, 9.0, 19.0, 105.0], [202.0, 95.0, 35.0, 43.0, 50.0, 42.0, 19.0, 33.0, 16.0, 13.0, 12.0, 7.0, 11.0, 6.0, 8.0, 10.0, 4.0, 4.0, 5.0, 4.0, 7.0, 6.0, 6.0, 8.0, 4.0, 4.0, 23.0, 11.0, 22.0, 1.0, 4.0, 0.0, 1.0, 0.0, 2.0, 0.0, 1.0, 1.0, 8.0, 17.0, 2.0, 1.0, 0.0, 2.0, 3.0, 0.0, 2.0, 22.0, 88.0], [216.0, 69.0, 55.0, 32.0, 54.0, 25.0, 39.0, 24.0, 16.0, 11.0, 13.0, 10.0, 8.0, 10.0, 4.0, 7.0, 8.0, 5.0, 4.0, 25.0, 5.0, 3.0, 3.0, 6.0, 6.0, 28.0, 2.0, 1.0, 6.0, 2.0, 2.0, 3.0, 2.0, 1.0, 0.0, 0.0, 1.0, 0.0, 1.0, 0.0, 2.0, 1.0, 0.0, 1.0, 6.0, 0.0, 3.0, 8.0, 33.0], [219.0, 87.0, 48.0, 42.0, 25.0, 25.0, 11.0, 23.0, 23.0, 9.0, 14.0, 15.0, 8.0, 6.0, 5.0, 8.0, 11.0, 6.0, 4.0, 3.0, 4.0, 3.0, 7.0, 3.0, 4.0, 8.0, 22.0, 3.0, 3.0, 6.0, 21.0, 1.0, 0.0, 0.0, 0.0, 1.0, 12.0, 14.0, 2.0, 2.0, 4.0, 1.0, 0.0, 10.0, 22.0, 22.0, 5.0, 27.0, 23.0], [205.0, 86.0, 42.0, 38.0, 33.0, 21.0, 16.0, 23.0, 12.0, 20.0, 11.0, 5.0, 7.0, 10.0, 31.0, 5.0, 4.0, 7.0, 7.0, 9.0, 3.0, 2.0, 3.0, 8.0, 4.0, 26.0, 4.0, 4.0, 0.0, 1.0, 1.0, 1.0, 3.0, 1.0, 1.0, 3.0, 2.0, 0.0, 9.0, 20.0, 1.0, 2.0, 0.0, 2.0, 10.0, 19.0, 1.0, 2.0, 14.0], [207.0, 88.0, 44.0, 27.0, 27.0, 28.0, 15.0, 17.0, 12.0, 15.0, 14.0, 13.0, 9.0, 7.0, 10.0, 12.0, 10.0, 6.0, 3.0, 5.0, 9.0, 2.0, 6.0, 3.0, 3.0, 5.0, 1.0, 1.0, 3.0, 1.0, 0.0, 3.0, 2.0, 1.0, 2.0, 24.0, 1.0, 1.0, 26.0, 2.0, 1.0, 2.0, 3.0, 0.0, 1.0, 10.0, 18.0, 1.0, 9.0], [202.0, 85.0, 54.0, 65.0, 18.0, 23.0, 27.0, 37.0, 21.0, 16.0, 13.0, 9.0, 6.0, 6.0, 6.0, 7.0, 5.0, 5.0, 4.0, 3.0, 7.0, 6.0, 4.0, 6.0, 6.0, 3.0, 1.0, 2.0, 1.0, 2.0, 1.0, 3.0, 0.0, 4.0, 3.0, 2.0, 0.0, 2.0, 3.0, 1.0, 1.0, 0.0, 1.0, 1.0, 4.0, 1.0, 1.0, 5.0, 6.0], [190.0, 79.0, 61.0, 26.0, 25.0, 23.0, 18.0, 22.0, 13.0, 18.0, 10.0, 13.0, 10.0, 12.0, 24.0, 9.0, 7.0, 4.0, 3.0, 8.0, 6.0, 5.0, 4.0, 3.0, 9.0, 2.0, 2.0, 3.0, 4.0, 0.0, 3.0, 0.0, 0.0, 1.0, 1.0, 1.0, 1.0, 4.0, 0.0, 1.0, 3.0, 3.0, 0.0, 15.0, 12.0, 28.0, 0.0, 5.0, 3.0], [214.0, 78.0, 47.0, 34.0, 35.0, 20.0, 27.0, 18.0, 22.0, 10.0, 8.0, 7.0, 9.0, 4.0, 6.0, 9.0, 10.0, 6.0, 7.0, 25.0, 4.0, 8.0, 0.0, 1.0, 17.0, 15.0, 0.0, 2.0, 6.0, 4.0, 4.0, 1.0, 4.0, 1.0, 0.0, 2.0, 1.0, 1.0, 2.0, 0.0, 1.0, 0.0, 3.0, 2.0, 0.0, 2.0, 2.0, 3.0, 3.0], [218.0, 81.0, 41.0, 39.0, 34.0, 21.0, 18.0, 22.0, 14.0, 13.0, 11.0, 9.0, 10.0, 4.0, 5.0, 7.0, 7.0, 5.0, 9.0, 4.0, 7.0, 3.0, 0.0, 9.0, 5.0, 27.0, 1.0, 3.0, 2.0, 0.0, 3.0, 2.0, 0.0, 4.0, 3.0, 2.0, 2.0, 1.0, 2.0, 1.0, 0.0, 4.0, 2.0, 1.0, 0.0, 3.0, 5.0, 2.0, 1.0], [198.0, 80.0, 43.0, 43.0, 29.0, 25.0, 20.0, 19.0, 12.0, 17.0, 10.0, 11.0, 9.0, 13.0, 2.0, 4.0, 7.0, 5.0, 10.0, 4.0, 3.0, 5.0, 5.0, 5.0, 3.0, 4.0, 2.0, 1.0, 1.0, 4.0, 1.0, 2.0, 4.0, 3.0, 2.0, 1.0, 4.0, 0.0, 2.0, 2.0, 1.0, 4.0, 2.0, 2.0, 0.0, 0.0, 0.0, 5.0, 3.0], [219.0, 67.0, 44.0, 34.0, 29.0, 21.0, 22.0, 10.0, 17.0, 11.0, 15.0, 13.0, 9.0, 9.0, 7.0, 6.0, 5.0, 5.0, 9.0, 4.0, 6.0, 2.0, 6.0, 5.0, 6.0, 0.0, 7.0, 21.0, 2.0, 6.0, 2.0, 1.0, 1.0, 1.0, 1.0, 0.0, 25.0, 1.0, 3.0, 0.0, 5.0, 2.0, 4.0, 1.0, 5.0, 3.0, 2.0, 1.0, 1.0]],
    "Name": "sCurve-0",
    "Overflow": 2544112.0,
    "Type": "Histo2d",
    "Underflow": 0.0,
    "x": {
        "AxisTitle": "Vcal",
        "Bins": 51,
        "High": 302.5,
        "Low": 47.5
    },
    "y": {
        "AxisTitle": "Occupancy",
        "Bins": 49,
        "High": 49.5,
        "Low": 0.5
    },
    "z": {
        "AxisTitle": "Number of pixels"
    }
}