{
    "Data": [220.0, 11842.0, 20896.0, 13188.0, 5565.0, 2583.0, 2135.0, 2289.0, 2393.0, 2345.0, 2050.0, 1785.0, 1394.0, 1048.0, 774.0, 534.0, 422.0, 317.0, 316.0, 262.0, 266.0, 251.0, 225.0, 259.0, 232.0, 203.0, 228.0, 192.0, 178.0, 178.0, 178.0, 173.0, 165.0, 149.0, 109.0, 124.0, 116.0, 88.0, 111.0, 103.0, 75.0, 66.0, 51.0, 58.0, 49.0, 47.0, 22.0, 27.0, 35.0, 25.0, 7.0],
    "Name": "Chi2Dist-0",
    "Overflow": 0.0,
    "Type": "Histo1d",
    "Underflow": 0.0,
    "x": {
        "AxisTitle": "Fit Chi/ndf",
        "Bins": 51,
        "High": 2.5250000953674318,
        "Low": -0.02500000037252903
    },
    "y": {
        "AxisTitle": "Number of Pixels"
    },
    "z": {
        "AxisTitle": "z"
    }
}