{
    "Data": [18.0, 33.0, 0.0, 0.0, 1.0, 73.0, 447.0, 1287.0, 2840.0, 4140.0, 4427.0, 3802.0, 3090.0, 2535.0, 2390.0, 2178.0, 2224.0, 1820.0, 1707.0, 1788.0, 1923.0, 2166.0, 2372.0, 2466.0, 2175.0, 1738.0, 1326.0, 869.0, 602.0, 369.0, 249.0, 210.0, 220.0, 295.0, 355.0, 509.0, 622.0, 843.0, 1028.0, 1205.0, 1318.0, 1529.0, 1695.0, 1714.0, 1663.0, 1594.0, 1545.0, 1433.0, 1273.0, 1095.0, 948.0, 694.0, 629.0, 536.0, 403.0, 338.0, 245.0, 198.0, 141.0, 128.0, 90.0, 63.0, 52.0, 46.0, 36.0, 38.0, 39.0, 22.0, 27.0, 24.0, 21.0, 12.0, 19.0, 14.0, 18.0, 9.0, 6.0, 10.0, 6.0, 2.0, 7.0, 5.0, 6.0, 5.0, 6.0, 5.0, 5.0, 2.0, 2.0, 3.0, 6.0, 0.0, 3.0, 1.0, 0.0, 2.0, 1.0, 0.0, 0.0, 1.0, 2.0],
    "Name": "NoiseDist-0",
    "Overflow": 11.0,
    "Type": "Histo1d",
    "Underflow": 0.0,
    "x": {
        "AxisTitle": "Noise [e]",
        "Bins": 101,
        "High": 506.0,
        "Low": -2.0
    },
    "y": {
        "AxisTitle": "Number of Pixels"
    },
    "z": {
        "AxisTitle": "z"
    }
}