{
    "Data": [814.0, 2769.0, 501.0, 148.0, 214.0, 258.0, 211.0, 190.0, 240.0, 362.0, 656.0, 1265.0, 2418.0, 3621.0, 4357.0, 4256.0, 3570.0, 2822.0, 2448.0, 2320.0, 2437.0, 2262.0, 2082.0, 1602.0, 1112.0, 757.0, 529.0, 416.0, 366.0, 326.0, 284.0, 305.0, 284.0, 276.0, 293.0, 269.0, 272.0, 270.0, 259.0, 272.0, 228.0, 239.0, 256.0, 246.0, 242.0, 227.0, 243.0, 211.0, 239.0, 182.0, 229.0, 218.0, 192.0, 207.0, 170.0, 192.0, 160.0, 167.0, 167.0, 157.0, 133.0, 125.0, 133.0, 128.0, 132.0, 124.0, 124.0, 108.0, 92.0, 123.0, 84.0, 99.0, 101.0, 82.0, 83.0, 88.0, 80.0, 83.0, 72.0, 63.0, 66.0, 63.0, 74.0, 62.0, 53.0, 53.0, 69.0, 54.0, 62.0, 52.0, 46.0, 57.0, 57.0, 53.0, 39.0, 48.0, 57.0, 35.0, 48.0, 47.0, 52.0, 43.0, 35.0, 48.0, 51.0, 41.0, 47.0, 38.0, 33.0, 42.0, 43.0, 31.0, 27.0, 37.0, 27.0, 35.0, 24.0, 30.0, 32.0, 27.0, 37.0, 32.0, 24.0, 29.0, 34.0, 29.0, 29.0, 14.0, 22.0, 19.0, 18.0, 20.0, 11.0, 18.0, 18.0, 18.0, 11.0, 17.0, 19.0, 14.0, 10.0, 18.0, 12.0, 13.0, 13.0, 10.0, 7.0, 17.0, 14.0, 10.0, 5.0, 13.0, 9.0, 9.0, 7.0, 11.0, 6.0, 7.0, 5.0, 4.0, 7.0, 7.0, 9.0, 9.0, 4.0, 5.0, 7.0, 5.0, 5.0, 10.0, 1.0, 5.0, 4.0, 7.0, 3.0, 4.0, 3.0, 5.0, 5.0, 3.0, 2.0, 1.0],
    "Name": "NoiseDist-0",
    "Overflow": 300.0,
    "Type": "Histo1d",
    "Underflow": 0.0,
    "x": {
        "AxisTitle": "Noise [e]",
        "Bins": 182,
        "High": 911.0,
        "Low": -2.0
    },
    "y": {
        "AxisTitle": "Number of Pixels"
    },
    "z": {
        "AxisTitle": "z"
    }
}