{
    "Data": [16.0, 68.0, 20.0, 13.0, 47.0, 57.0, 168.0, 597.0, 1665.0, 3431.0, 5094.0, 5664.0, 4983.0, 4066.0, 3828.0, 4078.0, 4267.0, 4169.0, 3572.0, 2755.0, 1887.0, 1232.0, 692.0, 451.0, 400.0, 426.0, 471.0, 554.0, 642.0, 776.0, 924.0, 1029.0, 1099.0, 1111.0, 1184.0, 1056.0, 1054.0, 966.0, 864.0, 736.0, 712.0, 569.0, 513.0, 444.0, 392.0, 317.0, 335.0, 307.0, 236.0, 247.0, 192.0, 197.0, 182.0, 166.0, 142.0, 131.0, 116.0, 120.0, 104.0, 108.0, 106.0, 87.0, 106.0, 79.0, 82.0, 79.0, 79.0, 57.0, 56.0, 71.0, 52.0, 56.0, 60.0, 61.0, 46.0, 59.0, 47.0, 45.0, 55.0, 59.0, 65.0, 64.0, 44.0, 55.0, 56.0, 50.0, 66.0, 51.0, 59.0, 54.0, 48.0, 52.0, 49.0, 47.0, 48.0, 42.0, 45.0, 31.0, 42.0, 31.0, 33.0, 31.0, 23.0, 17.0, 27.0, 25.0, 17.0, 27.0],
    "Name": "NoiseDist-0",
    "Overflow": 449.0,
    "Type": "Histo1d",
    "Underflow": 0.0,
    "x": {
        "AxisTitle": "Noise [e]",
        "Bins": 108,
        "High": 541.0,
        "Low": -2.0
    },
    "y": {
        "AxisTitle": "Number of Pixels"
    },
    "z": {
        "AxisTitle": "z"
    }
}