{
    "Data": [3054.0, 20271.0, 16174.0, 8167.0, 3097.0, 1433.0, 1735.0, 2453.0, 3273.0, 3596.0, 3423.0, 2920.0, 2292.0, 1571.0, 1074.0, 623.0, 374.0, 187.0, 115.0, 68.0, 38.0, 16.0, 12.0, 5.0, 3.0, 3.0, 1.0, 1.0, 1.0, 0.0, 1.0, 1.0, 1.0, 0.0, 1.0, 1.0, 1.0, 1.0, 0.0, 2.0, 1.0, 0.0, 0.0, 0.0, 0.0, 0.0, 1.0, 1.0, 1.0, 0.0, 0.0],
    "Name": "Chi2Dist-0",
    "Overflow": 0.0,
    "Type": "Histo1d",
    "Underflow": 0.0,
    "x": {
        "AxisTitle": "Fit Chi/ndf",
        "Bins": 51,
        "High": 2.5250000953674318,
        "Low": -0.02500000037252903
    },
    "y": {
        "AxisTitle": "Number of Pixels"
    },
    "z": {
        "AxisTitle": "z"
    }
}