{
    "Data": [0.0, 6.0, 10.0, 12.0, 9.0, 11.0, 17.0, 17.0, 20.0, 17.0, 16.0, 28.0, 30.0, 21.0, 24.0, 31.0, 32.0, 43.0, 38.0, 54.0, 72.0, 92.0, 111.0, 122.0, 164.0, 185.0, 206.0, 261.0, 284.0, 357.0, 428.0, 487.0, 508.0, 653.0, 659.0, 708.0, 864.0, 872.0, 998.0, 1133.0, 1255.0, 1612.0, 2138.0, 2672.0, 3371.0, 3829.0, 4219.0, 4198.0, 3836.0, 3376.0, 2711.0, 2119.0, 1499.0, 1087.0, 786.0, 602.0, 458.0, 414.0, 343.0, 260.0, 230.0, 174.0, 144.0, 123.0, 85.0, 71.0, 61.0, 62.0, 43.0, 38.0, 54.0, 23.0, 35.0, 32.0, 18.0, 18.0, 19.0, 24.0, 17.0, 19.0, 14.0, 18.0, 17.0, 16.0, 11.0, 15.0, 7.0, 16.0, 13.0, 10.0, 15.0],
    "Name": "ThresholdDist-0",
    "Overflow": 189.0,
    "Type": "Histo1d",
    "Underflow": 0.0,
    "x": {
        "AxisTitle": "Threshold [e]",
        "Bins": 91,
        "High": 1395.0,
        "Low": 485.0
    },
    "y": {
        "AxisTitle": "Number of Pixels"
    },
    "z": {
        "AxisTitle": "z"
    }
}