time,Hardware,Voltage,Current
1621474016473,high-voltage-2,1,0.268158
time,Hardware,Voltage,Current
1621474016473,high-voltage-2,2,0.308442
time,Hardware,Voltage,Current
1621474016473,high-voltage-2,3,0.333498
time,Hardware,Voltage,Current
1621474016473,high-voltage-2,4,0.357288
time,Hardware,Voltage,Current
1621474016473,high-voltage-2,5,0.382488
time,Hardware,Voltage,Current
1621474016473,high-voltage-2,6,0.41129
time,Hardware,Voltage,Current
1621474016473,high-voltage-2,7,0.441191
time,Hardware,Voltage,Current
1621474016473,high-voltage-2,8,0.475031
time,Hardware,Voltage,Current
1621474016473,high-voltage-2,9,0.513073
time,Hardware,Voltage,Current
1621474016473,high-voltage-2,10,0.553439
time,Hardware,Voltage,Current
1621474016473,high-voltage-2,11,0.591957
time,Hardware,Voltage,Current
1621474016473,high-voltage-2,12,0.630753
time,Hardware,Voltage,Current
1621474016473,high-voltage-2,13,0.670466
time,Hardware,Voltage,Current
1621474016473,high-voltage-2,14,0.708068
time,Hardware,Voltage,Current
1621474016473,high-voltage-2,15,0.745677
time,Hardware,Voltage,Current
1621474016473,high-voltage-2,16,0.782107
time,Hardware,Voltage,Current
1621474016473,high-voltage-2,17,0.813403
time,Hardware,Voltage,Current
1621474016473,high-voltage-2,18,0.838761
time,Hardware,Voltage,Current
1621474016473,high-voltage-2,19,0.865634
time,Hardware,Voltage,Current
1621474016473,high-voltage-2,20,0.885357
time,Hardware,Voltage,Current
1621474016473,high-voltage-2,25,0.990945
time,Hardware,Voltage,Current
1621474016473,high-voltage-2,30,1.08485
time,Hardware,Voltage,Current
1621474016473,high-voltage-2,35,1.17629
time,Hardware,Voltage,Current
1621474016473,high-voltage-2,40,1.28133
time,Hardware,Voltage,Current
1621474016473,high-voltage-2,45,1.40813
time,Hardware,Voltage,Current
1621474016473,high-voltage-2,50,1.49636
time,Hardware,Voltage,Current
1621474016473,high-voltage-2,55,1.57292
time,Hardware,Voltage,Current
1621474016473,high-voltage-2,60,1.6489
time,Hardware,Voltage,Current
1621474016473,high-voltage-2,65,1.72399
time,Hardware,Voltage,Current
1621474016473,high-voltage-2,70,1.79621
time,Hardware,Voltage,Current
1621474016473,high-voltage-2,75,1.86521
time,Hardware,Voltage,Current
1621474016473,high-voltage-2,80,1.93346
time,Hardware,Voltage,Current
1621474016473,high-voltage-2,85,1.9966
time,Hardware,Voltage,Current
1621474016473,high-voltage-2,90,2.06168
time,Hardware,Voltage,Current
1621474016473,high-voltage-2,95,2.1259
time,Hardware,Voltage,Current
1621474016473,high-voltage-2,100,2.18715
