time,Hardware,Voltage,Current
1621992042105,high-voltage,1,0.062271
time,Hardware,Voltage,Current
1621992042105,high-voltage,2,0.121722
time,Hardware,Voltage,Current
1621992042105,high-voltage,3,0.21444
time,Hardware,Voltage,Current
1621992042105,high-voltage,4,0.366079
time,Hardware,Voltage,Current
1621992042105,high-voltage,5,0.499374
time,Hardware,Voltage,Current
1621992042105,high-voltage,6,0.692662
time,Hardware,Voltage,Current
1621992042105,high-voltage,7,0.899451
time,Hardware,Voltage,Current
1621992042105,high-voltage,8,1.22928
time,Hardware,Voltage,Current
1621992042105,high-voltage,9,1.51815
time,Hardware,Voltage,Current
1621992042105,high-voltage,10,1.9654
time,Hardware,Voltage,Current
1621992042105,high-voltage,11,2.51828
time,Hardware,Voltage,Current
1621992042105,high-voltage,12,3.07995
time,Hardware,Voltage,Current
1621992042105,high-voltage,13,3.80792
time,Hardware,Voltage,Current
1621992042105,high-voltage,14,4.87689
time,Hardware,Voltage,Current
1621992042105,high-voltage,15,5.93731
time,Hardware,Voltage,Current
1621992042105,high-voltage,16,6.99581
time,Hardware,Voltage,Current
1621992042105,high-voltage,17,8.21163
time,Hardware,Voltage,Current
1621992042105,high-voltage,18,9.35693
time,Hardware,Voltage,Current
1621992042105,high-voltage,19,10.0001
