{
    "Data": [0.0, 0.0, 0.0, 0.0, 0.0, 0.0, 0.0, 0.0, 0.0, 0.0, 0.0, 0.0, 0.0, 0.0, 5.0, 5.0, 0.0, 19.0, 242.0, 62.0, 15.0, 922.0, 3575.0, 1299.0, 328.0, 1864.0, 4461.0, 1937.0, 585.0, 1403.0, 2563.0, 1410.0, 466.0, 545.0, 824.0, 726.0, 380.0, 1267.0, 2422.0, 1776.0, 832.0, 1618.0, 3316.0, 4002.0, 2103.0, 1620.0, 2776.0, 3696.0, 3328.0, 2063.0, 1899.0, 2323.0, 2746.0, 1808.0, 1325.0, 1246.0, 1208.0, 1340.0, 950.0, 855.0, 817.0, 816.0, 645.0, 446.0, 476.0, 445.0, 469.0, 345.0, 299.0, 295.0, 261.0, 237.0, 233.0, 207.0, 143.0, 197.0, 148.0, 130.0, 116.0, 126.0, 112.0, 85.0, 97.0, 69.0, 82.0, 60.0, 80.0, 64.0, 58.0, 54.0, 43.0, 40.0, 22.0, 25.0, 50.0, 32.0, 29.0, 38.0, 32.0, 39.0, 41.0, 20.0, 27.0, 18.0, 13.0, 11.0, 18.0, 18.0, 22.0, 11.0, 13.0, 16.0, 9.0, 4.0, 10.0, 20.0, 9.0, 14.0, 15.0, 15.0, 10.0, 14.0, 8.0, 6.0, 8.0, 5.0, 9.0, 5.0, 7.0, 9.0, 6.0, 8.0, 9.0, 10.0, 5.0, 5.0, 9.0, 5.0, 10.0, 7.0, 5.0, 3.0, 3.0, 13.0, 11.0, 5.0, 1.0, 1.0, 4.0, 1.0, 3.0, 3.0, 2.0, 1.0, 1.0, 0.0, 1.0, 1.0, 4.0, 1.0, 1.0, 1.0, 1.0, 0.0, 1.0, 0.0, 1.0, 2.0, 1.0, 0.0, 4.0, 0.0, 1.0, 0.0, 0.0, 3.0, 3.0, 1.0, 3.0, 3.0, 0.0, 2.0, 2.0, 2.0, 0.0, 0.0, 1.0, 0.0, 2.0, 0.0, 0.0, 0.0, 2.0, 1.0, 1.0, 0.0, 2.0, 5.0, 0.0, 3.0, 0.0],
    "Name": "TimePerFitDist-0",
    "Overflow": 62.0,
    "Type": "Histo1d",
    "Underflow": 0.0,
    "x": {
        "AxisTitle": "Fit Time [us]",
        "Bins": 201,
        "High": 401.0,
        "Low": -1.0
    },
    "y": {
        "AxisTitle": "Number of Pixels"
    },
    "z": {
        "AxisTitle": "z"
    }
}