time,Hardware,Voltage,Current
1626608723656,high-voltage-2,1,0.215994
time,Hardware,Voltage,Current
1626608723656,high-voltage-2,2,0.261152
time,Hardware,Voltage,Current
1626608723656,high-voltage-2,3,0.283882
time,Hardware,Voltage,Current
1626608723656,high-voltage-2,4,0.303959
time,Hardware,Voltage,Current
1626608723656,high-voltage-2,5,0.322337
time,Hardware,Voltage,Current
1626608723656,high-voltage-2,6,0.343995
time,Hardware,Voltage,Current
1626608723656,high-voltage-2,7,0.371942
time,Hardware,Voltage,Current
1626608723656,high-voltage-2,8,0.40256
time,Hardware,Voltage,Current
1626608723656,high-voltage-2,9,0.434167
time,Hardware,Voltage,Current
1626608723656,high-voltage-2,10,0.469608
time,Hardware,Voltage,Current
1626608723656,high-voltage-2,11,0.509152
time,Hardware,Voltage,Current
1626608723656,high-voltage-2,12,0.552386
time,Hardware,Voltage,Current
1626608723656,high-voltage-2,13,0.595423
time,Hardware,Voltage,Current
1626608723656,high-voltage-2,14,0.633951
time,Hardware,Voltage,Current
1626608723656,high-voltage-2,15,0.669899
time,Hardware,Voltage,Current
1626608723656,high-voltage-2,16,0.702776
time,Hardware,Voltage,Current
1626608723656,high-voltage-2,17,0.734075
time,Hardware,Voltage,Current
1626608723656,high-voltage-2,18,0.760386
time,Hardware,Voltage,Current
1626608723656,high-voltage-2,19,0.784639
time,Hardware,Voltage,Current
1626608723656,high-voltage-2,20,0.808983
time,Hardware,Voltage,Current
1626608723656,high-voltage-2,25,0.910337
time,Hardware,Voltage,Current
1626608723656,high-voltage-2,30,1.0097
time,Hardware,Voltage,Current
1626608723656,high-voltage-2,35,1.10798
time,Hardware,Voltage,Current
1626608723656,high-voltage-2,40,1.22074
time,Hardware,Voltage,Current
1626608723656,high-voltage-2,45,1.35769
time,Hardware,Voltage,Current
1626608723656,high-voltage-2,50,1.45885
time,Hardware,Voltage,Current
1626608723656,high-voltage-2,55,1.54964
time,Hardware,Voltage,Current
1626608723656,high-voltage-2,60,1.63824
time,Hardware,Voltage,Current
1626608723656,high-voltage-2,65,1.72397
time,Hardware,Voltage,Current
1626608723656,high-voltage-2,70,1.80684
time,Hardware,Voltage,Current
1626608723656,high-voltage-2,75,1.88334
time,Hardware,Voltage,Current
1626608723656,high-voltage-2,80,1.96094
time,Hardware,Voltage,Current
1626608723656,high-voltage-2,85,2.03401
time,Hardware,Voltage,Current
1626608723656,high-voltage-2,90,2.10427
time,Hardware,Voltage,Current
1626608723656,high-voltage-2,95,2.17608
time,Hardware,Voltage,Current
1626608723656,high-voltage-2,100,2.24212
