time,Hardware,Voltage,Current
1622015479300,high-voltage,1,0.157162
time,Hardware,Voltage,Current
1622015479300,high-voltage,2,0.286977
time,Hardware,Voltage,Current
1622015479300,high-voltage,3,0.416149
time,Hardware,Voltage,Current
1622015479300,high-voltage,4,0.539789
time,Hardware,Voltage,Current
1622015479300,high-voltage,5,0.677023
time,Hardware,Voltage,Current
1622015479300,high-voltage,6,0.851306
time,Hardware,Voltage,Current
1622015479300,high-voltage,7,1.10781
time,Hardware,Voltage,Current
1622015479300,high-voltage,8,1.40059
time,Hardware,Voltage,Current
1622015479300,high-voltage,9,1.73463
time,Hardware,Voltage,Current
1622015479300,high-voltage,10,2.10687
time,Hardware,Voltage,Current
1622015479300,high-voltage,11,2.73518
time,Hardware,Voltage,Current
1622015479300,high-voltage,12,3.35916
time,Hardware,Voltage,Current
1622015479300,high-voltage,13,4.09331
time,Hardware,Voltage,Current
1622015479300,high-voltage,14,4.85655
time,Hardware,Voltage,Current
1622015479300,high-voltage,15,5.97854
time,Hardware,Voltage,Current
1622015479300,high-voltage,16,6.82322
time,Hardware,Voltage,Current
1622015479300,high-voltage,17,7.89485
time,Hardware,Voltage,Current
1622015479300,high-voltage,18,9.03506
time,Hardware,Voltage,Current
1622015479300,high-voltage,19,9.87349
time,Hardware,Voltage,Current
1622015479300,high-voltage,20,10.0001
