{
    "Data": [[1242.0, 359.0, 168.0, 112.0, 82.0, 58.0, 39.0, 31.0, 22.0, 16.0, 15.0, 12.0, 9.0, 7.0, 7.0, 8.0, 5.0, 3.0, 5.0, 5.0, 4.0, 5.0, 4.0, 9.0, 7.0, 5.0, 8.0, 2.0, 3.0, 5.0, 6.0, 8.0, 8.0, 8.0, 3.0, 10.0, 2.0, 4.0, 2.0, 4.0, 9.0, 4.0, 1.0, 8.0, 5.0, 8.0, 3.0, 7.0, 8.0], [2177.0, 823.0, 438.0, 251.0, 171.0, 134.0, 87.0, 68.0, 55.0, 35.0, 33.0, 23.0, 23.0, 19.0, 9.0, 10.0, 4.0, 3.0, 3.0, 8.0, 5.0, 2.0, 8.0, 3.0, 8.0, 11.0, 4.0, 5.0, 8.0, 6.0, 5.0, 2.0, 11.0, 3.0, 6.0, 9.0, 6.0, 7.0, 8.0, 5.0, 10.0, 9.0, 4.0, 13.0, 8.0, 16.0, 9.0, 4.0, 12.0], [3400.0, 1576.0, 894.0, 603.0, 415.0, 287.0, 233.0, 171.0, 140.0, 92.0, 98.0, 85.0, 56.0, 41.0, 41.0, 38.0, 30.0, 25.0, 19.0, 16.0, 24.0, 14.0, 15.0, 11.0, 7.0, 8.0, 8.0, 4.0, 8.0, 5.0, 10.0, 7.0, 3.0, 4.0, 11.0, 5.0, 5.0, 7.0, 9.0, 7.0, 7.0, 13.0, 9.0, 12.0, 18.0, 8.0, 20.0, 21.0, 18.0], [4028.0, 2293.0, 1497.0, 1140.0, 828.0, 661.0, 515.0, 412.0, 346.0, 309.0, 209.0, 179.0, 162.0, 175.0, 127.0, 119.0, 81.0, 102.0, 69.0, 61.0, 55.0, 40.0, 37.0, 36.0, 38.0, 28.0, 24.0, 28.0, 20.0, 20.0, 19.0, 15.0, 12.0, 13.0, 12.0, 15.0, 9.0, 10.0, 7.0, 13.0, 11.0, 18.0, 12.0, 22.0, 13.0, 21.0, 10.0, 18.0, 28.0], [3728.0, 2422.0, 1847.0, 1510.0, 1198.0, 1071.0, 917.0, 736.0, 668.0, 615.0, 514.0, 462.0, 386.0, 386.0, 288.0, 320.0, 228.0, 225.0, 222.0, 172.0, 171.0, 155.0, 123.0, 116.0, 122.0, 106.0, 113.0, 84.0, 69.0, 72.0, 72.0, 60.0, 49.0, 51.0, 49.0, 44.0, 37.0, 29.0, 24.0, 33.0, 19.0, 24.0, 23.0, 21.0, 27.0, 25.0, 28.0, 25.0, 43.0], [4132.0, 2225.0, 1713.0, 1414.0, 1239.0, 1131.0, 1012.0, 961.0, 850.0, 825.0, 759.0, 646.0, 676.0, 632.0, 554.0, 579.0, 506.0, 461.0, 458.0, 406.0, 390.0, 334.0, 316.0, 328.0, 310.0, 297.0, 248.0, 217.0, 214.0, 223.0, 170.0, 190.0, 150.0, 139.0, 135.0, 121.0, 116.0, 114.0, 102.0, 76.0, 97.0, 82.0, 88.0, 60.0, 61.0, 55.0, 57.0, 63.0, 52.0], [7213.0, 4061.0, 2585.0, 1893.0, 1421.0, 1161.0, 1037.0, 972.0, 850.0, 818.0, 795.0, 744.0, 717.0, 678.0, 707.0, 662.0, 667.0, 626.0, 662.0, 524.0, 570.0, 542.0, 526.0, 547.0, 513.0, 474.0, 486.0, 471.0, 477.0, 432.0, 439.0, 416.0, 403.0, 378.0, 396.0, 358.0, 331.0, 332.0, 291.0, 252.0, 257.0, 233.0, 254.0, 190.0, 230.0, 197.0, 183.0, 166.0, 192.0], [2738.0, 2738.0, 2701.0, 2594.0, 2441.0, 2232.0, 2068.0, 1812.0, 1673.0, 1533.0, 1348.0, 1281.0, 1141.0, 1111.0, 933.0, 873.0, 907.0, 812.0, 748.0, 769.0, 726.0, 752.0, 666.0, 720.0, 694.0, 658.0, 630.0, 632.0, 628.0, 618.0, 637.0, 619.0, 617.0, 629.0, 627.0, 614.0, 625.0, 617.0, 584.0, 549.0, 624.0, 571.0, 567.0, 551.0, 558.0, 545.0, 521.0, 525.0, 519.0], [584.0, 304.0, 357.0, 454.0, 467.0, 580.0, 639.0, 753.0, 810.0, 917.0, 953.0, 1071.0, 1062.0, 1195.0, 1173.0, 1245.0, 1277.0, 1297.0, 1246.0, 1258.0, 1298.0, 1341.0, 1304.0, 1272.0, 1289.0, 1277.0, 1185.0, 1192.0, 1193.0, 1105.0, 1129.0, 1116.0, 1126.0, 1136.0, 1013.0, 989.0, 1024.0, 969.0, 944.0, 1011.0, 1013.0, 1047.0, 1072.0, 1011.0, 1141.0, 1123.0, 1139.0, 1295.0, 1413.0], [677.0, 196.0, 148.0, 136.0, 115.0, 109.0, 107.0, 95.0, 81.0, 95.0, 119.0, 105.0, 149.0, 166.0, 165.0, 199.0, 213.0, 262.0, 321.0, 315.0, 397.0, 439.0, 466.0, 536.0, 576.0, 662.0, 692.0, 827.0, 879.0, 961.0, 1101.0, 1156.0, 1201.0, 1290.0, 1424.0, 1602.0, 1672.0, 1736.0, 1932.0, 1987.0, 2098.0, 2178.0, 2235.0, 2372.0, 2410.0, 2506.0, 2640.0, 2934.0, 3356.0], [1048.0, 262.0, 126.0, 97.0, 69.0, 70.0, 43.0, 57.0, 52.0, 43.0, 52.0, 52.0, 46.0, 47.0, 46.0, 50.0, 45.0, 53.0, 58.0, 50.0, 68.0, 70.0, 60.0, 71.0, 82.0, 96.0, 113.0, 133.0, 140.0, 193.0, 204.0, 235.0, 245.0, 323.0, 396.0, 481.0, 500.0, 583.0, 715.0, 849.0, 1043.0, 1268.0, 1570.0, 1999.0, 2570.0, 3245.0, 4331.0, 5876.0, 8420.0], [1701.0, 391.0, 174.0, 100.0, 73.0, 68.0, 39.0, 38.0, 35.0, 20.0, 18.0, 16.0, 18.0, 19.0, 26.0, 28.0, 33.0, 33.0, 22.0, 35.0, 33.0, 31.0, 38.0, 24.0, 40.0, 39.0, 37.0, 40.0, 49.0, 44.0, 54.0, 64.0, 59.0, 91.0, 84.0, 110.0, 118.0, 162.0, 214.0, 231.0, 255.0, 405.0, 470.0, 613.0, 877.0, 1219.0, 1949.0, 3531.0, 7905.0], [2591.0, 789.0, 291.0, 133.0, 70.0, 56.0, 37.0, 31.0, 24.0, 22.0, 18.0, 14.0, 20.0, 11.0, 15.0, 16.0, 11.0, 24.0, 15.0, 12.0, 11.0, 15.0, 13.0, 15.0, 10.0, 24.0, 12.0, 24.0, 26.0, 26.0, 35.0, 38.0, 37.0, 49.0, 46.0, 34.0, 56.0, 64.0, 73.0, 70.0, 103.0, 114.0, 146.0, 218.0, 288.0, 454.0, 732.0, 1477.0, 4030.0], [3728.0, 1276.0, 592.0, 237.0, 114.0, 75.0, 49.0, 30.0, 26.0, 24.0, 20.0, 14.0, 19.0, 12.0, 20.0, 11.0, 6.0, 11.0, 10.0, 7.0, 18.0, 8.0, 16.0, 10.0, 15.0, 18.0, 14.0, 17.0, 15.0, 10.0, 14.0, 13.0, 16.0, 21.0, 14.0, 20.0, 20.0, 34.0, 27.0, 29.0, 48.0, 54.0, 94.0, 98.0, 127.0, 203.0, 286.0, 645.0, 1875.0], [4923.0, 2193.0, 1166.0, 564.0, 279.0, 181.0, 77.0, 69.0, 38.0, 25.0, 20.0, 6.0, 10.0, 10.0, 12.0, 10.0, 6.0, 6.0, 6.0, 4.0, 12.0, 7.0, 6.0, 5.0, 9.0, 9.0, 12.0, 9.0, 13.0, 7.0, 8.0, 14.0, 13.0, 9.0, 20.0, 13.0, 16.0, 24.0, 18.0, 14.0, 27.0, 27.0, 31.0, 44.0, 55.0, 78.0, 133.0, 280.0, 893.0], [5541.0, 3063.0, 1824.0, 1069.0, 578.0, 369.0, 218.0, 129.0, 79.0, 54.0, 36.0, 18.0, 16.0, 12.0, 14.0, 5.0, 6.0, 6.0, 7.0, 2.0, 5.0, 9.0, 5.0, 6.0, 4.0, 7.0, 3.0, 3.0, 9.0, 7.0, 6.0, 7.0, 6.0, 9.0, 12.0, 11.0, 12.0, 12.0, 8.0, 22.0, 17.0, 16.0, 24.0, 45.0, 33.0, 52.0, 66.0, 119.0, 481.0], [5426.0, 3649.0, 2537.0, 1742.0, 1094.0, 786.0, 461.0, 324.0, 219.0, 122.0, 99.0, 66.0, 42.0, 33.0, 25.0, 18.0, 11.0, 12.0, 3.0, 5.0, 9.0, 2.0, 4.0, 7.0, 9.0, 3.0, 7.0, 8.0, 7.0, 3.0, 3.0, 6.0, 10.0, 4.0, 8.0, 5.0, 5.0, 8.0, 12.0, 12.0, 10.0, 20.0, 21.0, 21.0, 24.0, 29.0, 51.0, 72.0, 224.0], [4402.0, 3660.0, 2978.0, 2211.0, 1745.0, 1316.0, 953.0, 668.0, 479.0, 356.0, 289.0, 183.0, 144.0, 75.0, 78.0, 50.0, 42.0, 24.0, 22.0, 20.0, 13.0, 6.0, 8.0, 3.0, 10.0, 5.0, 3.0, 4.0, 3.0, 2.0, 3.0, 5.0, 8.0, 7.0, 6.0, 5.0, 9.0, 7.0, 6.0, 4.0, 12.0, 16.0, 10.0, 14.0, 14.0, 21.0, 30.0, 56.0, 128.0], [3207.0, 3108.0, 2858.0, 2414.0, 2162.0, 1733.0, 1386.0, 1126.0, 901.0, 745.0, 623.0, 410.0, 362.0, 282.0, 218.0, 160.0, 121.0, 104.0, 72.0, 57.0, 41.0, 35.0, 34.0, 16.0, 10.0, 10.0, 7.0, 4.0, 8.0, 9.0, 3.0, 0.0, 3.0, 3.0, 2.0, 4.0, 3.0, 5.0, 6.0, 4.0, 10.0, 11.0, 10.0, 15.0, 12.0, 21.0, 33.0, 31.0, 93.0], [2071.0, 2225.0, 2293.0, 2137.0, 2014.0, 1903.0, 1682.0, 1485.0, 1297.0, 1149.0, 991.0, 796.0, 652.0, 554.0, 436.0, 362.0, 334.0, 241.0, 164.0, 161.0, 127.0, 108.0, 81.0, 59.0, 63.0, 37.0, 20.0, 25.0, 16.0, 7.0, 9.0, 9.0, 9.0, 7.0, 6.0, 2.0, 6.0, 8.0, 5.0, 4.0, 7.0, 8.0, 9.0, 4.0, 10.0, 9.0, 23.0, 26.0, 61.0], [1281.0, 1402.0, 1663.0, 1582.0, 1686.0, 1643.0, 1571.0, 1509.0, 1408.0, 1309.0, 1284.0, 1081.0, 960.0, 803.0, 791.0, 658.0, 621.0, 536.0, 407.0, 333.0, 317.0, 280.0, 194.0, 165.0, 145.0, 111.0, 104.0, 87.0, 68.0, 43.0, 40.0, 29.0, 20.0, 16.0, 8.0, 11.0, 3.0, 8.0, 7.0, 3.0, 5.0, 9.0, 6.0, 14.0, 11.0, 11.0, 10.0, 20.0, 51.0], [844.0, 926.0, 1004.0, 1183.0, 1169.0, 1245.0, 1241.0, 1262.0, 1287.0, 1270.0, 1172.0, 1194.0, 1141.0, 1079.0, 964.0, 893.0, 818.0, 738.0, 697.0, 647.0, 607.0, 463.0, 443.0, 371.0, 324.0, 273.0, 228.0, 200.0, 187.0, 126.0, 123.0, 84.0, 83.0, 66.0, 52.0, 30.0, 22.0, 28.0, 16.0, 11.0, 9.0, 7.0, 8.0, 11.0, 5.0, 8.0, 13.0, 16.0, 33.0], [473.0, 505.0, 596.0, 673.0, 780.0, 861.0, 886.0, 959.0, 975.0, 1045.0, 1068.0, 1122.0, 1018.0, 1044.0, 1011.0, 1079.0, 980.0, 906.0, 939.0, 860.0, 796.0, 773.0, 684.0, 641.0, 546.0, 554.0, 481.0, 402.0, 386.0, 347.0, 264.0, 257.0, 207.0, 163.0, 173.0, 115.0, 83.0, 79.0, 50.0, 41.0, 34.0, 28.0, 25.0, 17.0, 8.0, 14.0, 14.0, 17.0, 23.0], [417.0, 402.0, 382.0, 455.0, 463.0, 556.0, 549.0, 577.0, 595.0, 698.0, 694.0, 765.0, 839.0, 855.0, 904.0, 849.0, 959.0, 945.0, 935.0, 936.0, 959.0, 870.0, 819.0, 829.0, 864.0, 753.0, 748.0, 683.0, 614.0, 583.0, 498.0, 503.0, 423.0, 321.0, 323.0, 284.0, 239.0, 198.0, 150.0, 165.0, 94.0, 69.0, 65.0, 56.0, 45.0, 27.0, 19.0, 15.0, 27.0], [288.0, 297.0, 292.0, 274.0, 332.0, 349.0, 348.0, 355.0, 419.0, 448.0, 460.0, 489.0, 570.0, 597.0, 602.0, 671.0, 712.0, 773.0, 805.0, 811.0, 776.0, 879.0, 864.0, 892.0, 845.0, 854.0, 833.0, 840.0, 851.0, 780.0, 822.0, 705.0, 683.0, 626.0, 609.0, 554.0, 494.0, 406.0, 343.0, 351.0, 317.0, 219.0, 202.0, 151.0, 124.0, 99.0, 64.0, 42.0, 34.0], [298.0, 235.0, 220.0, 243.0, 188.0, 229.0, 220.0, 221.0, 229.0, 245.0, 278.0, 310.0, 319.0, 372.0, 420.0, 404.0, 516.0, 500.0, 510.0, 572.0, 651.0, 631.0, 718.0, 778.0, 760.0, 791.0, 814.0, 855.0, 873.0, 878.0, 855.0, 881.0, 900.0, 839.0, 849.0, 810.0, 792.0, 742.0, 703.0, 596.0, 600.0, 491.0, 465.0, 393.0, 286.0, 244.0, 188.0, 127.0, 101.0], [205.0, 229.0, 203.0, 206.0, 213.0, 200.0, 240.0, 186.0, 188.0, 168.0, 190.0, 224.0, 217.0, 219.0, 242.0, 292.0, 311.0, 298.0, 318.0, 408.0, 364.0, 426.0, 465.0, 505.0, 538.0, 619.0, 649.0, 725.0, 710.0, 752.0, 778.0, 868.0, 846.0, 906.0, 950.0, 927.0, 971.0, 985.0, 873.0, 891.0, 923.0, 861.0, 834.0, 725.0, 627.0, 569.0, 465.0, 354.0, 236.0], [127.0, 133.0, 173.0, 173.0, 158.0, 160.0, 157.0, 125.0, 156.0, 136.0, 145.0, 144.0, 148.0, 171.0, 204.0, 186.0, 209.0, 216.0, 232.0, 268.0, 275.0, 301.0, 316.0, 319.0, 376.0, 365.0, 434.0, 509.0, 475.0, 569.0, 619.0, 677.0, 719.0, 791.0, 823.0, 917.0, 1003.0, 992.0, 1052.0, 1179.0, 1121.0, 1148.0, 1091.0, 1105.0, 1034.0, 931.0, 912.0, 795.0, 583.0], [181.0, 116.0, 147.0, 151.0, 134.0, 191.0, 193.0, 154.0, 153.0, 160.0, 149.0, 137.0, 134.0, 110.0, 125.0, 130.0, 125.0, 143.0, 145.0, 120.0, 136.0, 143.0, 189.0, 167.0, 203.0, 209.0, 230.0, 259.0, 308.0, 314.0, 337.0, 411.0, 507.0, 521.0, 653.0, 696.0, 826.0, 863.0, 921.0, 1087.0, 1170.0, 1224.0, 1402.0, 1449.0, 1446.0, 1510.0, 1451.0, 1413.0, 1271.0], [149.0, 157.0, 163.0, 220.0, 240.0, 163.0, 186.0, 173.0, 149.0, 143.0, 108.0, 134.0, 126.0, 105.0, 87.0, 120.0, 123.0, 127.0, 109.0, 117.0, 109.0, 98.0, 107.0, 111.0, 121.0, 137.0, 127.0, 174.0, 182.0, 188.0, 219.0, 258.0, 280.0, 378.0, 402.0, 469.0, 549.0, 613.0, 701.0, 858.0, 984.0, 1092.0, 1249.0, 1380.0, 1607.0, 1801.0, 1994.0, 1989.0, 2112.0], [145.0, 179.0, 188.0, 185.0, 155.0, 164.0, 98.0, 136.0, 158.0, 130.0, 80.0, 116.0, 157.0, 122.0, 120.0, 115.0, 73.0, 128.0, 87.0, 75.0, 30.0, 51.0, 40.0, 58.0, 69.0, 112.0, 121.0, 122.0, 123.0, 117.0, 120.0, 162.0, 181.0, 200.0, 223.0, 273.0, 334.0, 376.0, 459.0, 559.0, 689.0, 815.0, 1034.0, 1215.0, 1472.0, 1754.0, 2297.0, 2660.0, 3181.0], [219.0, 81.0, 116.0, 119.0, 112.0, 75.0, 106.0, 94.0, 92.0, 109.0, 58.0, 71.0, 53.0, 85.0, 74.0, 74.0, 120.0, 80.0, 89.0, 54.0, 84.0, 69.0, 86.0, 57.0, 104.0, 72.0, 65.0, 78.0, 92.0, 123.0, 90.0, 92.0, 106.0, 139.0, 152.0, 185.0, 203.0, 289.0, 332.0, 365.0, 416.0, 539.0, 715.0, 867.0, 1261.0, 1602.0, 2109.0, 2846.0, 3890.0], [189.0, 164.0, 129.0, 192.0, 135.0, 93.0, 91.0, 87.0, 87.0, 107.0, 122.0, 89.0, 62.0, 93.0, 77.0, 39.0, 26.0, 73.0, 35.0, 50.0, 40.0, 48.0, 75.0, 79.0, 50.0, 20.0, 30.0, 84.0, 83.0, 71.0, 39.0, 107.0, 84.0, 83.0, 83.0, 93.0, 134.0, 139.0, 113.0, 157.0, 178.0, 281.0, 367.0, 553.0, 808.0, 1154.0, 1751.0, 2730.0, 4268.0], [123.0, 111.0, 106.0, 91.0, 74.0, 154.0, 146.0, 152.0, 71.0, 117.0, 97.0, 25.0, 70.0, 92.0, 85.0, 119.0, 155.0, 126.0, 105.0, 57.0, 58.0, 25.0, 9.0, 44.0, 74.0, 72.0, 91.0, 75.0, 58.0, 101.0, 62.0, 36.0, 71.0, 44.0, 51.0, 63.0, 72.0, 69.0, 91.0, 79.0, 114.0, 148.0, 263.0, 382.0, 472.0, 752.0, 1230.0, 2134.0, 4009.0], [74.0, 81.0, 114.0, 154.0, 205.0, 124.0, 116.0, 123.0, 141.0, 98.0, 76.0, 86.0, 80.0, 64.0, 131.0, 99.0, 124.0, 119.0, 70.0, 66.0, 27.0, 30.0, 127.0, 59.0, 81.0, 73.0, 79.0, 96.0, 79.0, 69.0, 74.0, 54.0, 47.0, 135.0, 77.0, 74.0, 87.0, 76.0, 117.0, 89.0, 95.0, 113.0, 137.0, 240.0, 260.0, 422.0, 794.0, 1583.0, 3432.0], [175.0, 123.0, 115.0, 122.0, 80.0, 112.0, 82.0, 100.0, 151.0, 103.0, 42.0, 76.0, 73.0, 44.0, 41.0, 73.0, 17.0, 84.0, 56.0, 11.0, 22.0, 69.0, 77.0, 52.0, 75.0, 167.0, 80.0, 73.0, 78.0, 49.0, 37.0, 57.0, 50.0, 182.0, 76.0, 57.0, 66.0, 61.0, 93.0, 65.0, 47.0, 104.0, 108.0, 110.0, 149.0, 248.0, 467.0, 915.0, 2714.0], [142.0, 126.0, 153.0, 117.0, 104.0, 214.0, 143.0, 89.0, 47.0, 80.0, 116.0, 99.0, 93.0, 154.0, 152.0, 97.0, 117.0, 61.0, 5.0, 49.0, 51.0, 69.0, 69.0, 98.0, 85.0, 62.0, 25.0, 63.0, 60.0, 95.0, 99.0, 60.0, 86.0, 100.0, 56.0, 71.0, 125.0, 44.0, 49.0, 111.0, 101.0, 60.0, 119.0, 85.0, 83.0, 113.0, 241.0, 514.0, 1787.0], [197.0, 163.0, 119.0, 141.0, 99.0, 67.0, 83.0, 71.0, 94.0, 58.0, 44.0, 131.0, 70.0, 81.0, 58.0, 82.0, 66.0, 160.0, 107.0, 89.0, 78.0, 101.0, 22.0, 66.0, 29.0, 5.0, 91.0, 28.0, 67.0, 191.0, 105.0, 116.0, 135.0, 31.0, 37.0, 64.0, 15.0, 68.0, 63.0, 92.0, 108.0, 157.0, 109.0, 112.0, 102.0, 116.0, 209.0, 323.0, 1152.0], [249.0, 160.0, 83.0, 107.0, 157.0, 105.0, 71.0, 43.0, 72.0, 96.0, 151.0, 133.0, 103.0, 134.0, 25.0, 5.0, 23.0, 23.0, 48.0, 83.0, 103.0, 70.0, 125.0, 108.0, 8.0, 31.0, 82.0, 160.0, 66.0, 103.0, 62.0, 37.0, 41.0, 67.0, 67.0, 10.0, 39.0, 96.0, 94.0, 91.0, 79.0, 57.0, 66.0, 122.0, 99.0, 93.0, 124.0, 233.0, 769.0], [176.0, 76.0, 88.0, 119.0, 61.0, 114.0, 99.0, 94.0, 57.0, 42.0, 146.0, 147.0, 117.0, 100.0, 51.0, 55.0, 119.0, 94.0, 61.0, 120.0, 67.0, 58.0, 91.0, 126.0, 67.0, 93.0, 43.0, 86.0, 111.0, 79.0, 52.0, 30.0, 48.0, 119.0, 57.0, 68.0, 75.0, 79.0, 7.0, 21.0, 27.0, 27.0, 50.0, 79.0, 75.0, 43.0, 85.0, 123.0, 464.0], [169.0, 143.0, 106.0, 119.0, 43.0, 69.0, 110.0, 158.0, 148.0, 189.0, 84.0, 96.0, 30.0, 124.0, 72.0, 90.0, 85.0, 112.0, 163.0, 57.0, 51.0, 147.0, 73.0, 84.0, 77.0, 61.0, 33.0, 114.0, 52.0, 76.0, 107.0, 98.0, 66.0, 15.0, 61.0, 84.0, 90.0, 79.0, 69.0, 82.0, 91.0, 26.0, 16.0, 142.0, 25.0, 46.0, 44.0, 44.0, 236.0], [103.0, 70.0, 183.0, 120.0, 108.0, 110.0, 64.0, 136.0, 115.0, 49.0, 115.0, 63.0, 160.0, 21.0, 69.0, 147.0, 144.0, 59.0, 74.0, 49.0, 77.0, 101.0, 136.0, 96.0, 90.0, 97.0, 61.0, 41.0, 41.0, 49.0, 125.0, 60.0, 41.0, 76.0, 54.0, 71.0, 35.0, 34.0, 74.0, 71.0, 48.0, 70.0, 27.0, 106.0, 76.0, 43.0, 44.0, 57.0, 176.0], [109.0, 111.0, 125.0, 154.0, 188.0, 99.0, 116.0, 90.0, 74.0, 69.0, 90.0, 93.0, 23.0, 89.0, 110.0, 101.0, 73.0, 71.0, 69.0, 21.0, 49.0, 58.0, 27.0, 52.0, 41.0, 66.0, 66.0, 78.0, 78.0, 17.0, 98.0, 53.0, 77.0, 49.0, 44.0, 28.0, 95.0, 40.0, 64.0, 85.0, 98.0, 98.0, 82.0, 43.0, 30.0, 19.0, 28.0, 20.0, 102.0], [187.0, 71.0, 64.0, 86.0, 56.0, 88.0, 129.0, 94.0, 32.0, 60.0, 73.0, 73.0, 72.0, 83.0, 40.0, 66.0, 20.0, 100.0, 58.0, 72.0, 33.0, 53.0, 21.0, 63.0, 85.0, 43.0, 50.0, 51.0, 55.0, 49.0, 73.0, 63.0, 78.0, 61.0, 52.0, 26.0, 47.0, 88.0, 77.0, 52.0, 12.0, 32.0, 100.0, 44.0, 39.0, 62.0, 77.0, 50.0, 57.0], [163.0, 151.0, 85.0, 77.0, 96.0, 91.0, 86.0, 40.0, 34.0, 35.0, 92.0, 107.0, 82.0, 6.0, 57.0, 62.0, 91.0, 104.0, 96.0, 38.0, 39.0, 86.0, 110.0, 39.0, 24.0, 20.0, 15.0, 67.0, 80.0, 101.0, 59.0, 85.0, 21.0, 61.0, 32.0, 73.0, 94.0, 65.0, 38.0, 12.0, 33.0, 58.0, 47.0, 47.0, 29.0, 8.0, 50.0, 75.0, 73.0], [114.0, 140.0, 120.0, 85.0, 155.0, 68.0, 78.0, 151.0, 89.0, 117.0, 57.0, 19.0, 61.0, 10.0, 25.0, 47.0, 38.0, 63.0, 41.0, 34.0, 58.0, 83.0, 64.0, 39.0, 39.0, 56.0, 49.0, 21.0, 21.0, 70.0, 78.0, 51.0, 60.0, 17.0, 77.0, 135.0, 123.0, 48.0, 67.0, 61.0, 37.0, 50.0, 88.0, 18.0, 44.0, 55.0, 74.0, 22.0, 51.0], [103.0, 70.0, 33.0, 93.0, 80.0, 44.0, 55.0, 111.0, 128.0, 66.0, 37.0, 117.0, 118.0, 26.0, 61.0, 37.0, 88.0, 175.0, 101.0, 63.0, 74.0, 30.0, 21.0, 25.0, 36.0, 40.0, 51.0, 107.0, 59.0, 72.0, 31.0, 65.0, 23.0, 17.0, 47.0, 54.0, 14.0, 56.0, 24.0, 8.0, 24.0, 1.0, 6.0, 61.0, 97.0, 45.0, 101.0, 59.0, 67.0], [116.0, 99.0, 92.0, 112.0, 150.0, 81.0, 129.0, 67.0, 118.0, 50.0, 71.0, 81.0, 69.0, 36.0, 91.0, 76.0, 103.0, 43.0, 99.0, 35.0, 87.0, 70.0, 105.0, 46.0, 85.0, 67.0, 102.0, 43.0, 0.0, 24.0, 85.0, 16.0, 57.0, 51.0, 61.0, 43.0, 61.0, 39.0, 43.0, 20.0, 8.0, 26.0, 40.0, 19.0, 44.0, 59.0, 39.0, 28.0, 9.0], [116.0, 83.0, 62.0, 26.0, 113.0, 107.0, 46.0, 38.0, 74.0, 46.0, 84.0, 38.0, 32.0, 23.0, 40.0, 48.0, 70.0, 82.0, 23.0, 70.0, 70.0, 18.0, 12.0, 61.0, 53.0, 116.0, 108.0, 40.0, 24.0, 25.0, 64.0, 42.0, 65.0, 40.0, 28.0, 40.0, 23.0, 45.0, 37.0, 56.0, 51.0, 97.0, 64.0, 11.0, 47.0, 52.0, 55.0, 19.0, 43.0], [86.0, 37.0, 62.0, 71.0, 69.0, 37.0, 33.0, 18.0, 31.0, 16.0, 5.0, 50.0, 68.0, 29.0, 65.0, 8.0, 24.0, 31.0, 7.0, 1.0, 1.0, 21.0, 37.0, 33.0, 23.0, 33.0, 31.0, 24.0, 37.0, 16.0, 11.0, 33.0, 52.0, 38.0, 38.0, 44.0, 4.0, 17.0, 23.0, 90.0, 69.0, 36.0, 50.0, 30.0, 3.0, 2.0, 36.0, 28.0, 36.0], [90.0, 52.0, 89.0, 77.0, 76.0, 23.0, 57.0, 36.0, 44.0, 48.0, 10.0, 41.0, 14.0, 3.0, 17.0, 61.0, 65.0, 31.0, 8.0, 41.0, 35.0, 65.0, 25.0, 11.0, 47.0, 54.0, 20.0, 22.0, 21.0, 21.0, 37.0, 53.0, 30.0, 30.0, 94.0, 61.0, 37.0, 17.0, 45.0, 40.0, 97.0, 44.0, 1.0, 0.0, 26.0, 97.0, 66.0, 64.0, 12.0]],
    "Name": "sCurve-0",
    "Overflow": 2506525.0,
    "Type": "Histo2d",
    "Underflow": 0.0,
    "x": {
        "AxisTitle": "Vcal",
        "Bins": 51,
        "High": 302.5,
        "Low": 47.5
    },
    "y": {
        "AxisTitle": "Occupancy",
        "Bins": 49,
        "High": 49.5,
        "Low": 0.5
    },
    "z": {
        "AxisTitle": "Number of pixels"
    }
}