time,Hardware,Voltage,Current
1621613031835,high-voltage,1,0.135408
time,Hardware,Voltage,Current
1621613031835,high-voltage,2,0.210349
time,Hardware,Voltage,Current
1621613031835,high-voltage,3,0.31911
time,Hardware,Voltage,Current
1621613031835,high-voltage,4,0.450587
time,Hardware,Voltage,Current
1621613031835,high-voltage,5,0.613742
time,Hardware,Voltage,Current
1621613031835,high-voltage,6,0.840759
time,Hardware,Voltage,Current
1621613031835,high-voltage,7,1.12619
time,Hardware,Voltage,Current
1621613031835,high-voltage,8,1.45823
time,Hardware,Voltage,Current
1621613031835,high-voltage,9,1.9125
time,Hardware,Voltage,Current
1621613031835,high-voltage,10,2.46194
time,Hardware,Voltage,Current
1621613031835,high-voltage,11,3.16427
time,Hardware,Voltage,Current
1621613031835,high-voltage,12,3.94012
time,Hardware,Voltage,Current
1621613031835,high-voltage,13,4.89763
time,Hardware,Voltage,Current
1621613031835,high-voltage,14,6.02877
time,Hardware,Voltage,Current
1621613031835,high-voltage,15,7.15007
time,Hardware,Voltage,Current
1621613031835,high-voltage,16,8.18647
time,Hardware,Voltage,Current
1621613031835,high-voltage,17,9.27629
time,Hardware,Voltage,Current
1621613031835,high-voltage,18,9.91447
time,Hardware,Voltage,Current
1621613031835,high-voltage,19,10.0001
time,Hardware,Voltage,Current
1621613031835,high-voltage,20,10.0001
