{
    "Data": [0.0, 0.0, 0.0, 0.0, 0.0, 0.0, 0.0, 0.0, 0.0, 0.0, 0.0, 0.0, 0.0, 1.0, 9.0, 1.0, 1.0, 47.0, 469.0, 175.0, 22.0, 306.0, 2271.0, 1692.0, 215.0, 787.0, 2618.0, 1940.0, 484.0, 1205.0, 2334.0, 1785.0, 745.0, 808.0, 929.0, 613.0, 441.0, 734.0, 1048.0, 1023.0, 769.0, 932.0, 1579.0, 3321.0, 2641.0, 1762.0, 2185.0, 3466.0, 4322.0, 3303.0, 2508.0, 2378.0, 3437.0, 2820.0, 2028.0, 1478.0, 1518.0, 1811.0, 1347.0, 1313.0, 1052.0, 1094.0, 987.0, 629.0, 568.0, 494.0, 583.0, 514.0, 425.0, 391.0, 348.0, 381.0, 252.0, 210.0, 210.0, 232.0, 184.0, 136.0, 134.0, 128.0, 134.0, 110.0, 79.0, 87.0, 61.0, 81.0, 39.0, 60.0, 37.0, 52.0, 36.0, 30.0, 35.0, 22.0, 25.0, 22.0, 25.0, 18.0, 15.0, 27.0, 16.0, 14.0, 14.0, 10.0, 9.0, 16.0, 9.0, 12.0, 12.0, 7.0, 4.0, 4.0, 10.0, 6.0, 3.0, 5.0, 4.0, 5.0, 4.0, 0.0, 2.0, 7.0, 5.0, 4.0, 0.0, 2.0, 1.0, 0.0, 2.0, 3.0, 2.0, 7.0, 2.0, 0.0, 2.0, 1.0, 0.0, 1.0, 0.0, 1.0, 2.0, 3.0, 1.0, 0.0, 0.0, 1.0, 1.0, 2.0, 1.0, 0.0, 1.0, 1.0, 2.0, 1.0, 2.0, 0.0, 0.0, 0.0, 2.0, 1.0, 0.0, 0.0, 0.0, 0.0, 0.0, 0.0, 0.0, 0.0, 0.0, 0.0, 0.0, 1.0, 0.0, 1.0, 0.0, 0.0, 1.0, 2.0, 0.0, 0.0, 0.0, 0.0, 0.0, 0.0, 0.0, 1.0, 1.0, 0.0, 0.0, 0.0, 0.0, 0.0, 0.0, 0.0, 0.0, 0.0, 0.0, 0.0, 0.0, 0.0, 0.0],
    "Name": "TimePerFitDist-0",
    "Overflow": 111.0,
    "Type": "Histo1d",
    "Underflow": 0.0,
    "x": {
        "AxisTitle": "Fit Time [us]",
        "Bins": 201,
        "High": 401.0,
        "Low": -1.0
    },
    "y": {
        "AxisTitle": "Number of Pixels"
    },
    "z": {
        "AxisTitle": "z"
    }
}