time,Hardware,Voltage,Current
1625751620137,high-voltage-2,1,0.0969908
time,Hardware,Voltage,Current
1625751620137,high-voltage-2,2,0.146992
time,Hardware,Voltage,Current
1625751620137,high-voltage-2,3,0.175537
time,Hardware,Voltage,Current
1625751620137,high-voltage-2,4,0.197867
time,Hardware,Voltage,Current
1625751620137,high-voltage-2,5,0.220417
time,Hardware,Voltage,Current
1625751620137,high-voltage-2,6,0.243544
time,Hardware,Voltage,Current
1625751620137,high-voltage-2,7,0.270002
time,Hardware,Voltage,Current
1625751620137,high-voltage-2,8,0.296204
time,Hardware,Voltage,Current
1625751620137,high-voltage-2,9,0.322737
time,Hardware,Voltage,Current
1625751620137,high-voltage-2,10,0.347622
time,Hardware,Voltage,Current
1625751620137,high-voltage-2,11,0.367957
time,Hardware,Voltage,Current
1625751620137,high-voltage-2,12,0.386085
time,Hardware,Voltage,Current
1625751620137,high-voltage-2,13,0.403899
time,Hardware,Voltage,Current
1625751620137,high-voltage-2,14,0.416556
time,Hardware,Voltage,Current
1625751620137,high-voltage-2,15,0.428989
time,Hardware,Voltage,Current
1625751620137,high-voltage-2,16,0.440879
time,Hardware,Voltage,Current
1625751620137,high-voltage-2,17,0.450933
time,Hardware,Voltage,Current
1625751620137,high-voltage-2,18,0.462563
time,Hardware,Voltage,Current
1625751620137,high-voltage-2,19,0.47245
time,Hardware,Voltage,Current
1625751620137,high-voltage-2,20,0.482306
time,Hardware,Voltage,Current
1625751620137,high-voltage-2,25,0.533118
time,Hardware,Voltage,Current
1625751620137,high-voltage-2,30,0.587102
time,Hardware,Voltage,Current
1625751620137,high-voltage-2,35,0.638993
time,Hardware,Voltage,Current
1625751620137,high-voltage-2,40,0.699254
time,Hardware,Voltage,Current
1625751620137,high-voltage-2,45,0.776555
time,Hardware,Voltage,Current
1625751620137,high-voltage-2,50,0.837873
time,Hardware,Voltage,Current
1625751620137,high-voltage-2,55,0.894313
time,Hardware,Voltage,Current
1625751620137,high-voltage-2,60,0.947851
time,Hardware,Voltage,Current
1625751620137,high-voltage-2,65,0.998686
time,Hardware,Voltage,Current
1625751620137,high-voltage-2,70,1.0481
time,Hardware,Voltage,Current
1625751620137,high-voltage-2,75,1.09799
time,Hardware,Voltage,Current
1625751620137,high-voltage-2,80,1.14262
time,Hardware,Voltage,Current
1625751620137,high-voltage-2,85,1.1843
time,Hardware,Voltage,Current
1625751620137,high-voltage-2,90,1.22159
time,Hardware,Voltage,Current
1625751620137,high-voltage-2,95,1.25386
time,Hardware,Voltage,Current
1625751620137,high-voltage-2,100,1.28274
