time,Hardware,Voltage,Current
1623355537522,high-voltage,1,0.0673446
time,Hardware,Voltage,Current
1623355537522,high-voltage,2,0.0838104
time,Hardware,Voltage,Current
1623355537522,high-voltage,3,0.0986702
time,Hardware,Voltage,Current
1623355537522,high-voltage,4,0.111877
time,Hardware,Voltage,Current
1623355537522,high-voltage,5,0.123422
time,Hardware,Voltage,Current
1623355537522,high-voltage,6,0.13431
time,Hardware,Voltage,Current
1623355537522,high-voltage,7,0.146146
time,Hardware,Voltage,Current
1623355537522,high-voltage,8,0.155298
time,Hardware,Voltage,Current
1623355537522,high-voltage,9,0.16535
time,Hardware,Voltage,Current
1623355537522,high-voltage,10,0.172653
time,Hardware,Voltage,Current
1623355537522,high-voltage,11,0.179735
time,Hardware,Voltage,Current
1623355537522,high-voltage,12,0.187211
time,Hardware,Voltage,Current
1623355537522,high-voltage,13,0.192927
time,Hardware,Voltage,Current
1623355537522,high-voltage,14,0.198267
time,Hardware,Voltage,Current
1623355537522,high-voltage,15,0.20329
time,Hardware,Voltage,Current
1623355537522,high-voltage,16,0.208351
time,Hardware,Voltage,Current
1623355537522,high-voltage,17,0.212196
time,Hardware,Voltage,Current
1623355537522,high-voltage,18,0.217711
time,Hardware,Voltage,Current
1623355537522,high-voltage,19,0.222312
time,Hardware,Voltage,Current
1623355537522,high-voltage,2.25449e-07,0.226006
time,Hardware,Voltage,Current
1623355537522,high-voltage,25,0.248635
time,Hardware,Voltage,Current
1623355537522,high-voltage,30,0.280261
time,Hardware,Voltage,Current
1623355537522,high-voltage,35,0.374317
time,Hardware,Voltage,Current
1623355537522,high-voltage,40,0.662727
time,Hardware,Voltage,Current
1623355537522,high-voltage,45,1.17481
time,Hardware,Voltage,Current
1623355537522,high-voltage,50,1.8562
time,Hardware,Voltage,Current
1623355537522,high-voltage,55,2.67996
time,Hardware,Voltage,Current
1623355537522,high-voltage,60,3.6486
time,Hardware,Voltage,Current
1623355537522,high-voltage,65,4.7559
