{
    "Data": [[2345.0, 611.0, 248.0, 120.0, 73.0, 61.0, 37.0, 26.0, 27.0, 23.0, 11.0, 20.0, 13.0, 12.0, 13.0, 10.0, 9.0, 5.0, 6.0, 6.0, 6.0, 5.0, 3.0, 5.0, 3.0, 1.0, 6.0, 3.0, 3.0, 4.0, 0.0, 1.0, 4.0, 2.0, 5.0, 1.0, 2.0, 1.0, 4.0, 4.0, 3.0, 0.0, 1.0, 2.0, 2.0, 2.0, 1.0, 5.0, 3.0], [3918.0, 1252.0, 514.0, 294.0, 185.0, 126.0, 78.0, 44.0, 32.0, 31.0, 26.0, 22.0, 24.0, 22.0, 13.0, 8.0, 11.0, 16.0, 8.0, 8.0, 13.0, 7.0, 4.0, 7.0, 3.0, 8.0, 5.0, 6.0, 6.0, 6.0, 3.0, 1.0, 4.0, 3.0, 6.0, 3.0, 5.0, 0.0, 2.0, 1.0, 3.0, 1.0, 5.0, 3.0, 1.0, 2.0, 5.0, 5.0, 6.0], [5354.0, 2128.0, 1158.0, 660.0, 393.0, 248.0, 195.0, 141.0, 100.0, 65.0, 74.0, 45.0, 34.0, 34.0, 19.0, 16.0, 27.0, 10.0, 13.0, 12.0, 12.0, 16.0, 10.0, 8.0, 10.0, 10.0, 5.0, 12.0, 4.0, 7.0, 9.0, 8.0, 3.0, 6.0, 5.0, 6.0, 4.0, 2.0, 1.0, 4.0, 1.0, 5.0, 6.0, 3.0, 4.0, 5.0, 2.0, 7.0, 7.0], [5874.0, 3356.0, 2052.0, 1296.0, 880.0, 605.0, 447.0, 301.0, 245.0, 213.0, 163.0, 109.0, 77.0, 70.0, 66.0, 52.0, 42.0, 35.0, 25.0, 27.0, 18.0, 21.0, 18.0, 21.0, 11.0, 12.0, 8.0, 13.0, 21.0, 15.0, 10.0, 3.0, 13.0, 11.0, 7.0, 12.0, 5.0, 6.0, 7.0, 3.0, 9.0, 9.0, 3.0, 6.0, 5.0, 3.0, 4.0, 7.0, 8.0], [4949.0, 3533.0, 2731.0, 2063.0, 1504.0, 1188.0, 942.0, 695.0, 522.0, 468.0, 366.0, 291.0, 239.0, 203.0, 205.0, 133.0, 122.0, 103.0, 70.0, 63.0, 65.0, 46.0, 40.0, 38.0, 38.0, 24.0, 27.0, 14.0, 21.0, 19.0, 22.0, 14.0, 9.0, 14.0, 16.0, 12.0, 11.0, 9.0, 14.0, 12.0, 14.0, 18.0, 6.0, 9.0, 10.0, 13.0, 6.0, 10.0, 8.0], [3859.0, 2815.0, 2490.0, 2229.0, 1937.0, 1737.0, 1414.0, 1223.0, 1059.0, 884.0, 751.0, 658.0, 547.0, 480.0, 387.0, 326.0, 286.0, 257.0, 214.0, 184.0, 144.0, 150.0, 123.0, 103.0, 108.0, 82.0, 69.0, 75.0, 47.0, 33.0, 36.0, 36.0, 20.0, 32.0, 22.0, 22.0, 20.0, 22.0, 13.0, 10.0, 22.0, 20.0, 25.0, 19.0, 16.0, 18.0, 6.0, 15.0, 20.0], [4493.0, 2019.0, 1599.0, 1620.0, 1563.0, 1567.0, 1595.0, 1472.0, 1365.0, 1288.0, 1156.0, 1073.0, 980.0, 911.0, 720.0, 702.0, 642.0, 548.0, 504.0, 437.0, 411.0, 366.0, 293.0, 292.0, 231.0, 222.0, 180.0, 163.0, 153.0, 122.0, 132.0, 82.0, 78.0, 85.0, 72.0, 46.0, 52.0, 50.0, 33.0, 44.0, 41.0, 29.0, 26.0, 25.0, 24.0, 31.0, 32.0, 26.0, 36.0], [6913.0, 3160.0, 1842.0, 1312.0, 1013.0, 960.0, 1087.0, 1074.0, 1074.0, 1119.0, 1090.0, 1118.0, 1125.0, 1085.0, 1098.0, 987.0, 925.0, 906.0, 890.0, 813.0, 730.0, 698.0, 644.0, 619.0, 538.0, 518.0, 440.0, 408.0, 365.0, 330.0, 306.0, 323.0, 245.0, 213.0, 192.0, 173.0, 141.0, 147.0, 110.0, 99.0, 84.0, 70.0, 65.0, 52.0, 53.0, 54.0, 46.0, 45.0, 49.0], [6179.0, 4482.0, 3277.0, 2366.0, 1876.0, 1430.0, 1193.0, 1000.0, 800.0, 715.0, 770.0, 803.0, 816.0, 749.0, 846.0, 881.0, 899.0, 920.0, 953.0, 956.0, 962.0, 961.0, 973.0, 905.0, 849.0, 856.0, 857.0, 761.0, 726.0, 667.0, 670.0, 575.0, 529.0, 511.0, 481.0, 424.0, 423.0, 344.0, 315.0, 295.0, 276.0, 249.0, 202.0, 181.0, 135.0, 125.0, 88.0, 80.0, 97.0], [2913.0, 2471.0, 2560.0, 2400.0, 2280.0, 2207.0, 1975.0, 1833.0, 1641.0, 1436.0, 1299.0, 1152.0, 1030.0, 901.0, 869.0, 802.0, 752.0, 789.0, 709.0, 723.0, 761.0, 817.0, 792.0, 821.0, 869.0, 888.0, 875.0, 908.0, 1012.0, 1005.0, 966.0, 923.0, 920.0, 941.0, 893.0, 877.0, 807.0, 800.0, 722.0, 649.0, 641.0, 531.0, 517.0, 497.0, 443.0, 385.0, 304.0, 250.0, 203.0], [1790.0, 773.0, 690.0, 790.0, 891.0, 999.0, 1147.0, 1228.0, 1313.0, 1343.0, 1435.0, 1479.0, 1430.0, 1487.0, 1500.0, 1391.0, 1312.0, 1264.0, 1201.0, 1119.0, 1079.0, 999.0, 971.0, 915.0, 921.0, 860.0, 858.0, 893.0, 844.0, 977.0, 986.0, 957.0, 991.0, 1025.0, 1104.0, 1089.0, 1143.0, 1192.0, 1231.0, 1192.0, 1164.0, 1144.0, 1115.0, 1024.0, 989.0, 951.0, 860.0, 703.0, 639.0], [2127.0, 599.0, 297.0, 178.0, 188.0, 184.0, 234.0, 236.0, 298.0, 378.0, 422.0, 457.0, 582.0, 622.0, 704.0, 776.0, 864.0, 992.0, 1060.0, 1085.0, 1171.0, 1231.0, 1279.0, 1281.0, 1327.0, 1330.0, 1315.0, 1341.0, 1317.0, 1353.0, 1336.0, 1300.0, 1313.0, 1256.0, 1313.0, 1269.0, 1384.0, 1339.0, 1352.0, 1469.0, 1524.0, 1644.0, 1660.0, 1779.0, 1715.0, 1716.0, 1736.0, 1690.0, 1594.0], [2993.0, 892.0, 362.0, 151.0, 75.0, 75.0, 68.0, 56.0, 56.0, 66.0, 88.0, 85.0, 76.0, 114.0, 107.0, 142.0, 156.0, 184.0, 215.0, 243.0, 314.0, 392.0, 418.0, 469.0, 554.0, 640.0, 692.0, 829.0, 869.0, 1015.0, 1141.0, 1280.0, 1332.0, 1441.0, 1589.0, 1703.0, 1827.0, 1875.0, 1894.0, 2101.0, 2160.0, 2369.0, 2337.0, 2560.0, 2666.0, 2813.0, 3144.0, 3138.0, 3384.0], [4031.0, 1413.0, 639.0, 246.0, 108.0, 61.0, 51.0, 36.0, 37.0, 32.0, 35.0, 39.0, 26.0, 36.0, 29.0, 45.0, 45.0, 40.0, 40.0, 52.0, 61.0, 63.0, 66.0, 63.0, 114.0, 106.0, 123.0, 150.0, 188.0, 237.0, 280.0, 308.0, 388.0, 482.0, 581.0, 656.0, 874.0, 1046.0, 1208.0, 1627.0, 1906.0, 2217.0, 2677.0, 3098.0, 3666.0, 4251.0, 4779.0, 5656.0, 6573.0], [4878.0, 2098.0, 996.0, 463.0, 197.0, 132.0, 74.0, 45.0, 32.0, 29.0, 26.0, 30.0, 25.0, 20.0, 25.0, 14.0, 17.0, 33.0, 20.0, 27.0, 20.0, 21.0, 20.0, 26.0, 34.0, 34.0, 34.0, 34.0, 58.0, 44.0, 48.0, 62.0, 80.0, 86.0, 103.0, 135.0, 152.0, 179.0, 248.0, 366.0, 479.0, 625.0, 965.0, 1455.0, 2022.0, 3079.0, 4705.0, 7254.0, 11381.0], [5363.0, 2782.0, 1539.0, 860.0, 460.0, 244.0, 122.0, 78.0, 57.0, 23.0, 27.0, 21.0, 19.0, 13.0, 11.0, 10.0, 20.0, 11.0, 15.0, 14.0, 6.0, 12.0, 16.0, 20.0, 14.0, 29.0, 25.0, 28.0, 24.0, 20.0, 18.0, 22.0, 31.0, 37.0, 41.0, 33.0, 48.0, 72.0, 55.0, 85.0, 107.0, 174.0, 222.0, 316.0, 519.0, 973.0, 1849.0, 4156.0, 10660.0], [5514.0, 3361.0, 2123.0, 1294.0, 754.0, 475.0, 302.0, 180.0, 107.0, 70.0, 50.0, 26.0, 24.0, 19.0, 19.0, 9.0, 10.0, 10.0, 5.0, 15.0, 13.0, 10.0, 8.0, 7.0, 8.0, 5.0, 11.0, 16.0, 13.0, 8.0, 19.0, 17.0, 16.0, 14.0, 16.0, 27.0, 25.0, 43.0, 26.0, 55.0, 50.0, 49.0, 75.0, 104.0, 178.0, 272.0, 521.0, 1412.0, 5732.0], [5068.0, 3580.0, 2561.0, 1712.0, 1142.0, 800.0, 523.0, 391.0, 221.0, 143.0, 93.0, 66.0, 47.0, 40.0, 24.0, 19.0, 10.0, 9.0, 11.0, 3.0, 9.0, 5.0, 10.0, 2.0, 6.0, 8.0, 15.0, 5.0, 6.0, 10.0, 12.0, 17.0, 13.0, 13.0, 18.0, 15.0, 10.0, 13.0, 17.0, 28.0, 31.0, 30.0, 26.0, 56.0, 86.0, 108.0, 198.0, 476.0, 2385.0], [4488.0, 3451.0, 2860.0, 2155.0, 1596.0, 1173.0, 861.0, 638.0, 438.0, 325.0, 225.0, 166.0, 104.0, 84.0, 57.0, 30.0, 23.0, 18.0, 21.0, 9.0, 16.0, 10.0, 8.0, 5.0, 3.0, 8.0, 5.0, 14.0, 6.0, 9.0, 7.0, 8.0, 11.0, 6.0, 7.0, 6.0, 16.0, 8.0, 13.0, 11.0, 15.0, 16.0, 26.0, 42.0, 36.0, 65.0, 105.0, 240.0, 1089.0], [3766.0, 3004.0, 2857.0, 2214.0, 1836.0, 1468.0, 1190.0, 949.0, 748.0, 526.0, 436.0, 312.0, 211.0, 156.0, 123.0, 99.0, 82.0, 54.0, 42.0, 34.0, 16.0, 14.0, 11.0, 11.0, 16.0, 6.0, 5.0, 9.0, 1.0, 2.0, 7.0, 7.0, 7.0, 7.0, 5.0, 9.0, 8.0, 9.0, 7.0, 13.0, 7.0, 22.0, 13.0, 30.0, 24.0, 32.0, 63.0, 122.0, 521.0], [3161.0, 2638.0, 2437.0, 2176.0, 1869.0, 1611.0, 1476.0, 1109.0, 988.0, 792.0, 669.0, 509.0, 409.0, 365.0, 255.0, 198.0, 147.0, 114.0, 87.0, 73.0, 52.0, 49.0, 42.0, 25.0, 23.0, 14.0, 13.0, 8.0, 11.0, 7.0, 6.0, 10.0, 6.0, 5.0, 2.0, 7.0, 5.0, 8.0, 10.0, 8.0, 6.0, 10.0, 20.0, 12.0, 17.0, 32.0, 33.0, 87.0, 270.0], [2521.0, 2164.0, 2139.0, 1959.0, 1831.0, 1633.0, 1424.0, 1324.0, 1115.0, 967.0, 865.0, 736.0, 594.0, 478.0, 439.0, 384.0, 260.0, 241.0, 188.0, 163.0, 117.0, 91.0, 72.0, 60.0, 45.0, 23.0, 33.0, 15.0, 15.0, 7.0, 18.0, 11.0, 19.0, 6.0, 6.0, 4.0, 5.0, 8.0, 4.0, 6.0, 7.0, 3.0, 10.0, 11.0, 9.0, 15.0, 33.0, 49.0, 182.0], [2087.0, 1897.0, 1821.0, 1659.0, 1574.0, 1533.0, 1392.0, 1292.0, 1188.0, 1110.0, 1026.0, 910.0, 739.0, 717.0, 601.0, 522.0, 448.0, 378.0, 326.0, 302.0, 241.0, 228.0, 172.0, 136.0, 112.0, 69.0, 67.0, 59.0, 45.0, 38.0, 24.0, 21.0, 12.0, 19.0, 8.0, 8.0, 12.0, 13.0, 7.0, 5.0, 8.0, 3.0, 8.0, 10.0, 7.0, 16.0, 21.0, 32.0, 99.0], [1758.0, 1615.0, 1586.0, 1470.0, 1397.0, 1308.0, 1249.0, 1253.0, 1118.0, 1110.0, 1046.0, 1004.0, 893.0, 856.0, 746.0, 641.0, 595.0, 503.0, 486.0, 478.0, 376.0, 313.0, 291.0, 233.0, 202.0, 150.0, 136.0, 111.0, 101.0, 70.0, 59.0, 43.0, 38.0, 34.0, 27.0, 18.0, 22.0, 7.0, 8.0, 8.0, 7.0, 11.0, 4.0, 16.0, 11.0, 18.0, 12.0, 31.0, 69.0], [1578.0, 1282.0, 1293.0, 1199.0, 1110.0, 1164.0, 1094.0, 1067.0, 1088.0, 929.0, 1042.0, 938.0, 922.0, 864.0, 873.0, 771.0, 718.0, 627.0, 611.0, 550.0, 499.0, 465.0, 449.0, 390.0, 332.0, 289.0, 254.0, 201.0, 190.0, 145.0, 150.0, 104.0, 81.0, 74.0, 53.0, 51.0, 46.0, 25.0, 23.0, 18.0, 8.0, 10.0, 8.0, 13.0, 12.0, 8.0, 11.0, 27.0, 60.0], [1436.0, 1216.0, 1163.0, 1079.0, 982.0, 950.0, 957.0, 846.0, 855.0, 830.0, 810.0, 813.0, 824.0, 769.0, 757.0, 812.0, 705.0, 693.0, 664.0, 643.0, 622.0, 564.0, 518.0, 481.0, 461.0, 466.0, 394.0, 351.0, 302.0, 314.0, 234.0, 196.0, 179.0, 156.0, 117.0, 103.0, 91.0, 68.0, 57.0, 57.0, 45.0, 30.0, 14.0, 18.0, 21.0, 12.0, 10.0, 19.0, 41.0], [1166.0, 1017.0, 1026.0, 984.0, 994.0, 884.0, 867.0, 789.0, 845.0, 778.0, 742.0, 755.0, 730.0, 702.0, 672.0, 708.0, 732.0, 725.0, 668.0, 717.0, 680.0, 601.0, 621.0, 560.0, 565.0, 536.0, 524.0, 484.0, 420.0, 410.0, 360.0, 363.0, 284.0, 280.0, 220.0, 192.0, 148.0, 139.0, 129.0, 94.0, 100.0, 57.0, 52.0, 30.0, 21.0, 27.0, 16.0, 13.0, 30.0], [1080.0, 873.0, 772.0, 782.0, 753.0, 689.0, 698.0, 683.0, 656.0, 658.0, 609.0, 617.0, 590.0, 587.0, 608.0, 578.0, 617.0, 571.0, 606.0, 603.0, 617.0, 628.0, 657.0, 611.0, 595.0, 630.0, 616.0, 630.0, 572.0, 564.0, 563.0, 542.0, 476.0, 487.0, 381.0, 373.0, 361.0, 336.0, 248.0, 204.0, 184.0, 180.0, 137.0, 100.0, 67.0, 54.0, 39.0, 29.0, 32.0], [883.0, 705.0, 681.0, 677.0, 640.0, 640.0, 621.0, 638.0, 586.0, 576.0, 606.0, 620.0, 556.0, 563.0, 552.0, 515.0, 525.0, 531.0, 547.0, 596.0, 585.0, 633.0, 585.0, 570.0, 557.0, 588.0, 608.0, 592.0, 590.0, 593.0, 598.0, 575.0, 555.0, 533.0, 528.0, 498.0, 471.0, 410.0, 411.0, 372.0, 308.0, 298.0, 266.0, 224.0, 166.0, 137.0, 87.0, 63.0, 59.0], [877.0, 749.0, 713.0, 607.0, 668.0, 613.0, 585.0, 579.0, 500.0, 522.0, 557.0, 486.0, 435.0, 497.0, 486.0, 429.0, 431.0, 489.0, 459.0, 437.0, 485.0, 480.0, 494.0, 480.0, 485.0, 498.0, 494.0, 494.0, 532.0, 550.0, 626.0, 572.0, 615.0, 607.0, 636.0, 616.0, 573.0, 551.0, 577.0, 554.0, 517.0, 456.0, 427.0, 368.0, 320.0, 235.0, 195.0, 158.0, 116.0], [727.0, 603.0, 652.0, 501.0, 474.0, 487.0, 511.0, 545.0, 499.0, 493.0, 465.0, 404.0, 432.0, 442.0, 440.0, 416.0, 431.0, 394.0, 408.0, 380.0, 418.0, 400.0, 395.0, 407.0, 406.0, 416.0, 428.0, 472.0, 421.0, 525.0, 562.0, 521.0, 569.0, 571.0, 640.0, 604.0, 658.0, 693.0, 682.0, 662.0, 673.0, 635.0, 658.0, 601.0, 585.0, 541.0, 431.0, 321.0, 247.0], [690.0, 577.0, 637.0, 399.0, 498.0, 508.0, 422.0, 338.0, 344.0, 328.0, 356.0, 374.0, 383.0, 363.0, 406.0, 382.0, 378.0, 343.0, 327.0, 311.0, 338.0, 357.0, 347.0, 376.0, 343.0, 439.0, 366.0, 379.0, 408.0, 383.0, 436.0, 527.0, 534.0, 547.0, 563.0, 575.0, 640.0, 692.0, 734.0, 745.0, 788.0, 786.0, 820.0, 776.0, 753.0, 712.0, 648.0, 570.0, 467.0], [641.0, 509.0, 517.0, 442.0, 432.0, 456.0, 355.0, 373.0, 351.0, 398.0, 413.0, 349.0, 313.0, 339.0, 304.0, 325.0, 308.0, 334.0, 250.0, 287.0, 301.0, 317.0, 313.0, 342.0, 339.0, 328.0, 305.0, 314.0, 329.0, 368.0, 360.0, 396.0, 409.0, 404.0, 453.0, 518.0, 584.0, 653.0, 644.0, 707.0, 779.0, 766.0, 883.0, 1005.0, 1019.0, 1036.0, 1072.0, 973.0, 879.0], [549.0, 358.0, 402.0, 400.0, 285.0, 430.0, 356.0, 319.0, 278.0, 237.0, 371.0, 368.0, 304.0, 338.0, 329.0, 279.0, 268.0, 266.0, 289.0, 314.0, 317.0, 281.0, 293.0, 302.0, 278.0, 264.0, 263.0, 235.0, 263.0, 267.0, 328.0, 321.0, 323.0, 311.0, 367.0, 423.0, 416.0, 463.0, 538.0, 596.0, 675.0, 842.0, 960.0, 1043.0, 1175.0, 1278.0, 1334.0, 1421.0, 1447.0], [659.0, 387.0, 383.0, 306.0, 392.0, 318.0, 298.0, 299.0, 363.0, 289.0, 327.0, 402.0, 311.0, 312.0, 322.0, 276.0, 297.0, 200.0, 175.0, 220.0, 196.0, 289.0, 294.0, 245.0, 285.0, 213.0, 204.0, 215.0, 223.0, 247.0, 255.0, 210.0, 254.0, 295.0, 303.0, 311.0, 301.0, 349.0, 417.0, 472.0, 576.0, 664.0, 790.0, 925.0, 1077.0, 1299.0, 1555.0, 1765.0, 1904.0], [435.0, 352.0, 355.0, 218.0, 193.0, 268.0, 326.0, 316.0, 323.0, 244.0, 281.0, 263.0, 282.0, 276.0, 245.0, 235.0, 269.0, 244.0, 283.0, 223.0, 233.0, 192.0, 157.0, 170.0, 156.0, 159.0, 197.0, 227.0, 244.0, 207.0, 175.0, 150.0, 151.0, 200.0, 188.0, 224.0, 295.0, 297.0, 299.0, 346.0, 437.0, 514.0, 672.0, 849.0, 1076.0, 1391.0, 1661.0, 2122.0, 2740.0], [358.0, 424.0, 287.0, 347.0, 282.0, 284.0, 267.0, 317.0, 277.0, 292.0, 295.0, 281.0, 184.0, 237.0, 164.0, 293.0, 274.0, 200.0, 295.0, 277.0, 221.0, 262.0, 196.0, 202.0, 168.0, 158.0, 160.0, 208.0, 229.0, 183.0, 213.0, 165.0, 196.0, 263.0, 219.0, 257.0, 293.0, 308.0, 344.0, 292.0, 373.0, 411.0, 502.0, 545.0, 715.0, 1028.0, 1453.0, 1930.0, 2861.0], [353.0, 201.0, 289.0, 273.0, 176.0, 366.0, 238.0, 391.0, 352.0, 271.0, 234.0, 314.0, 161.0, 220.0, 218.0, 263.0, 278.0, 221.0, 259.0, 219.0, 215.0, 208.0, 288.0, 234.0, 185.0, 170.0, 188.0, 173.0, 133.0, 196.0, 158.0, 163.0, 142.0, 160.0, 174.0, 216.0, 278.0, 276.0, 227.0, 218.0, 185.0, 245.0, 284.0, 386.0, 509.0, 788.0, 1296.0, 1840.0, 3155.0], [515.0, 300.0, 405.0, 299.0, 267.0, 243.0, 211.0, 188.0, 161.0, 154.0, 224.0, 139.0, 191.0, 205.0, 264.0, 295.0, 136.0, 283.0, 113.0, 203.0, 171.0, 174.0, 234.0, 266.0, 223.0, 150.0, 188.0, 250.0, 225.0, 167.0, 207.0, 189.0, 240.0, 172.0, 172.0, 209.0, 205.0, 135.0, 72.0, 164.0, 174.0, 184.0, 198.0, 282.0, 381.0, 562.0, 1005.0, 1557.0, 2963.0], [512.0, 524.0, 232.0, 310.0, 250.0, 273.0, 250.0, 307.0, 236.0, 280.0, 172.0, 261.0, 235.0, 247.0, 227.0, 268.0, 297.0, 88.0, 144.0, 219.0, 162.0, 231.0, 241.0, 182.0, 167.0, 244.0, 222.0, 158.0, 149.0, 102.0, 100.0, 237.0, 198.0, 274.0, 268.0, 227.0, 212.0, 195.0, 172.0, 145.0, 172.0, 163.0, 217.0, 238.0, 336.0, 401.0, 735.0, 1138.0, 2346.0], [463.0, 366.0, 349.0, 271.0, 253.0, 291.0, 405.0, 281.0, 307.0, 250.0, 264.0, 358.0, 345.0, 312.0, 228.0, 149.0, 138.0, 257.0, 128.0, 226.0, 190.0, 168.0, 119.0, 142.0, 71.0, 176.0, 171.0, 207.0, 195.0, 156.0, 179.0, 113.0, 159.0, 204.0, 247.0, 131.0, 144.0, 103.0, 121.0, 220.0, 215.0, 155.0, 116.0, 89.0, 139.0, 294.0, 470.0, 873.0, 2042.0], [448.0, 504.0, 360.0, 163.0, 360.0, 324.0, 418.0, 354.0, 267.0, 230.0, 277.0, 389.0, 262.0, 344.0, 262.0, 236.0, 209.0, 189.0, 168.0, 140.0, 240.0, 242.0, 219.0, 257.0, 213.0, 136.0, 156.0, 135.0, 140.0, 107.0, 164.0, 275.0, 148.0, 131.0, 143.0, 147.0, 173.0, 168.0, 109.0, 174.0, 165.0, 160.0, 166.0, 137.0, 213.0, 211.0, 245.0, 609.0, 1540.0], [545.0, 382.0, 341.0, 274.0, 528.0, 446.0, 270.0, 454.0, 296.0, 197.0, 315.0, 262.0, 250.0, 228.0, 197.0, 206.0, 297.0, 281.0, 272.0, 241.0, 177.0, 238.0, 191.0, 123.0, 247.0, 142.0, 181.0, 303.0, 238.0, 203.0, 238.0, 300.0, 140.0, 148.0, 215.0, 243.0, 294.0, 140.0, 149.0, 211.0, 196.0, 180.0, 179.0, 73.0, 85.0, 110.0, 210.0, 322.0, 1035.0], [557.0, 305.0, 324.0, 339.0, 298.0, 375.0, 332.0, 364.0, 303.0, 305.0, 173.0, 365.0, 189.0, 223.0, 381.0, 195.0, 209.0, 168.0, 265.0, 241.0, 231.0, 219.0, 385.0, 206.0, 128.0, 249.0, 244.0, 175.0, 235.0, 300.0, 267.0, 262.0, 164.0, 240.0, 191.0, 178.0, 143.0, 120.0, 258.0, 180.0, 257.0, 189.0, 149.0, 115.0, 201.0, 170.0, 185.0, 255.0, 748.0], [387.0, 474.0, 279.0, 293.0, 227.0, 342.0, 286.0, 242.0, 190.0, 343.0, 308.0, 278.0, 316.0, 301.0, 286.0, 260.0, 194.0, 169.0, 321.0, 240.0, 257.0, 221.0, 213.0, 189.0, 191.0, 264.0, 254.0, 237.0, 215.0, 265.0, 147.0, 237.0, 180.0, 221.0, 176.0, 233.0, 123.0, 234.0, 233.0, 147.0, 167.0, 48.0, 83.0, 193.0, 164.0, 160.0, 159.0, 248.0, 649.0], [533.0, 295.0, 318.0, 253.0, 188.0, 179.0, 262.0, 304.0, 375.0, 400.0, 394.0, 185.0, 222.0, 199.0, 249.0, 136.0, 192.0, 279.0, 260.0, 248.0, 280.0, 269.0, 185.0, 269.0, 227.0, 374.0, 275.0, 283.0, 190.0, 135.0, 157.0, 159.0, 102.0, 237.0, 332.0, 300.0, 183.0, 123.0, 133.0, 144.0, 258.0, 163.0, 190.0, 249.0, 105.0, 227.0, 107.0, 71.0, 373.0], [451.0, 311.0, 384.0, 299.0, 343.0, 299.0, 340.0, 381.0, 342.0, 286.0, 267.0, 300.0, 187.0, 357.0, 414.0, 316.0, 201.0, 184.0, 147.0, 226.0, 203.0, 209.0, 321.0, 245.0, 212.0, 156.0, 325.0, 161.0, 287.0, 209.0, 253.0, 257.0, 254.0, 188.0, 194.0, 191.0, 180.0, 121.0, 161.0, 209.0, 210.0, 137.0, 123.0, 212.0, 79.0, 74.0, 172.0, 161.0, 259.0], [443.0, 410.0, 416.0, 280.0, 266.0, 353.0, 226.0, 308.0, 348.0, 242.0, 297.0, 330.0, 329.0, 176.0, 218.0, 212.0, 160.0, 346.0, 119.0, 190.0, 193.0, 305.0, 276.0, 260.0, 192.0, 190.0, 218.0, 327.0, 163.0, 98.0, 131.0, 273.0, 117.0, 200.0, 162.0, 168.0, 232.0, 139.0, 268.0, 80.0, 168.0, 174.0, 269.0, 156.0, 171.0, 132.0, 149.0, 107.0, 318.0], [464.0, 264.0, 281.0, 448.0, 476.0, 399.0, 394.0, 304.0, 315.0, 301.0, 221.0, 270.0, 352.0, 283.0, 243.0, 320.0, 352.0, 178.0, 309.0, 304.0, 363.0, 272.0, 267.0, 198.0, 169.0, 329.0, 191.0, 141.0, 119.0, 283.0, 261.0, 174.0, 225.0, 138.0, 220.0, 177.0, 116.0, 250.0, 196.0, 90.0, 189.0, 110.0, 171.0, 151.0, 97.0, 90.0, 273.0, 198.0, 203.0], [588.0, 456.0, 359.0, 212.0, 329.0, 336.0, 310.0, 335.0, 286.0, 317.0, 288.0, 300.0, 533.0, 261.0, 398.0, 324.0, 224.0, 365.0, 231.0, 213.0, 234.0, 146.0, 308.0, 257.0, 273.0, 224.0, 137.0, 131.0, 151.0, 171.0, 144.0, 133.0, 164.0, 236.0, 136.0, 124.0, 189.0, 75.0, 97.0, 186.0, 133.0, 295.0, 173.0, 157.0, 278.0, 114.0, 141.0, 186.0, 203.0], [538.0, 233.0, 162.0, 373.0, 355.0, 324.0, 331.0, 333.0, 177.0, 198.0, 304.0, 181.0, 201.0, 250.0, 389.0, 236.0, 213.0, 215.0, 287.0, 320.0, 252.0, 209.0, 188.0, 177.0, 343.0, 304.0, 208.0, 207.0, 119.0, 175.0, 275.0, 208.0, 235.0, 206.0, 284.0, 295.0, 131.0, 123.0, 263.0, 213.0, 183.0, 191.0, 256.0, 157.0, 198.0, 174.0, 197.0, 193.0, 152.0]],
    "Name": "sCurve-0",
    "Overflow": 2071488.0,
    "Type": "Histo2d",
    "Underflow": 0.0,
    "x": {
        "AxisTitle": "Vcal",
        "Bins": 51,
        "High": 302.5,
        "Low": 47.5
    },
    "y": {
        "AxisTitle": "Occupancy",
        "Bins": 49,
        "High": 49.5,
        "Low": 0.5
    },
    "z": {
        "AxisTitle": "Number of pixels"
    }
}