{
    "Data": [0.0, 0.0, 0.0, 0.0, 0.0, 0.0, 0.0, 0.0, 0.0, 0.0, 0.0, 0.0, 0.0, 0.0, 0.0, 0.0, 0.0, 0.0, 9.0, 6.0, 4.0, 6.0, 2.0, 1.0, 17.0, 32.0, 14.0, 44.0, 39.0, 41.0, 29.0, 49.0, 50.0, 37.0, 50.0, 49.0, 21.0, 50.0, 50.0, 50.0, 50.0, 24.0, 50.0, 50.0, 50.0, 50.0, 50.0, 50.0, 50.0, 15.0, 50.0],
    "Name": "Scurve-110-96",
    "Overflow": 0.0,
    "Type": "Histo1d",
    "Underflow": 0.0,
    "x": {
        "AxisTitle": "Vcal",
        "Bins": 51,
        "High": 302.5,
        "Low": 47.5
    },
    "y": {
        "AxisTitle": "Occupancy"
    },
    "z": {
        "AxisTitle": "z"
    }
}