{
    "Data": [[732.0, 211.0, 91.0, 67.0, 36.0, 37.0, 24.0, 26.0, 16.0, 15.0, 13.0, 7.0, 5.0, 12.0, 5.0, 10.0, 8.0, 5.0, 4.0, 4.0, 4.0, 3.0, 6.0, 5.0, 4.0, 4.0, 6.0, 7.0, 7.0, 2.0, 7.0, 8.0, 5.0, 7.0, 6.0, 8.0, 3.0, 9.0, 3.0, 4.0, 6.0, 5.0, 7.0, 7.0, 4.0, 6.0, 5.0, 3.0, 2.0], [1244.0, 373.0, 184.0, 98.0, 64.0, 52.0, 41.0, 29.0, 25.0, 14.0, 20.0, 10.0, 10.0, 10.0, 6.0, 10.0, 9.0, 5.0, 9.0, 5.0, 7.0, 4.0, 9.0, 4.0, 5.0, 6.0, 7.0, 4.0, 6.0, 7.0, 11.0, 5.0, 2.0, 7.0, 4.0, 4.0, 6.0, 6.0, 8.0, 10.0, 9.0, 3.0, 6.0, 7.0, 4.0, 9.0, 4.0, 9.0, 8.0], [2368.0, 695.0, 352.0, 218.0, 133.0, 103.0, 68.0, 59.0, 46.0, 33.0, 23.0, 27.0, 23.0, 19.0, 25.0, 13.0, 10.0, 4.0, 7.0, 5.0, 8.0, 8.0, 8.0, 5.0, 11.0, 11.0, 7.0, 8.0, 6.0, 6.0, 5.0, 5.0, 3.0, 6.0, 4.0, 9.0, 4.0, 11.0, 7.0, 8.0, 5.0, 6.0, 5.0, 12.0, 8.0, 8.0, 11.0, 17.0, 13.0], [3498.0, 1405.0, 767.0, 406.0, 275.0, 204.0, 172.0, 116.0, 85.0, 66.0, 50.0, 52.0, 44.0, 27.0, 21.0, 29.0, 23.0, 17.0, 15.0, 16.0, 22.0, 10.0, 18.0, 16.0, 3.0, 11.0, 13.0, 8.0, 6.0, 13.0, 8.0, 11.0, 5.0, 7.0, 10.0, 12.0, 7.0, 6.0, 4.0, 9.0, 8.0, 5.0, 7.0, 9.0, 10.0, 10.0, 14.0, 11.0, 20.0], [5348.0, 2233.0, 1264.0, 852.0, 647.0, 447.0, 313.0, 291.0, 227.0, 178.0, 144.0, 109.0, 86.0, 84.0, 71.0, 59.0, 44.0, 49.0, 45.0, 47.0, 28.0, 31.0, 27.0, 31.0, 21.0, 15.0, 17.0, 18.0, 24.0, 12.0, 18.0, 20.0, 12.0, 11.0, 12.0, 14.0, 8.0, 7.0, 13.0, 7.0, 17.0, 12.0, 7.0, 5.0, 9.0, 10.0, 13.0, 19.0, 22.0], [8866.0, 3873.0, 2245.0, 1455.0, 1081.0, 804.0, 666.0, 575.0, 447.0, 385.0, 318.0, 292.0, 245.0, 211.0, 161.0, 133.0, 130.0, 116.0, 107.0, 103.0, 83.0, 66.0, 60.0, 52.0, 61.0, 47.0, 43.0, 46.0, 40.0, 43.0, 30.0, 17.0, 32.0, 17.0, 28.0, 23.0, 25.0, 16.0, 16.0, 17.0, 14.0, 26.0, 18.0, 15.0, 17.0, 23.0, 15.0, 17.0, 22.0], [9321.0, 6817.0, 4813.0, 3519.0, 2545.0, 2022.0, 1533.0, 1269.0, 995.0, 815.0, 682.0, 587.0, 509.0, 432.0, 375.0, 353.0, 351.0, 290.0, 228.0, 224.0, 209.0, 185.0, 192.0, 149.0, 136.0, 128.0, 128.0, 99.0, 96.0, 77.0, 81.0, 57.0, 66.0, 70.0, 60.0, 52.0, 57.0, 55.0, 42.0, 31.0, 29.0, 36.0, 36.0, 29.0, 36.0, 31.0, 26.0, 44.0, 35.0], [3153.0, 3232.0, 3320.0, 3265.0, 3403.0, 3095.0, 2915.0, 2718.0, 2473.0, 2369.0, 2012.0, 1912.0, 1645.0, 1480.0, 1333.0, 1119.0, 1029.0, 943.0, 798.0, 735.0, 596.0, 529.0, 429.0, 452.0, 386.0, 358.0, 305.0, 296.0, 252.0, 251.0, 206.0, 184.0, 192.0, 146.0, 138.0, 158.0, 140.0, 102.0, 121.0, 95.0, 101.0, 73.0, 83.0, 88.0, 68.0, 67.0, 53.0, 72.0, 67.0], [1027.0, 957.0, 958.0, 973.0, 1032.0, 1062.0, 1147.0, 1282.0, 1326.0, 1383.0, 1456.0, 1617.0, 1551.0, 1650.0, 1703.0, 1683.0, 1661.0, 1754.0, 1708.0, 1679.0, 1650.0, 1695.0, 1546.0, 1641.0, 1494.0, 1450.0, 1399.0, 1293.0, 1200.0, 1105.0, 1036.0, 954.0, 825.0, 800.0, 676.0, 648.0, 526.0, 487.0, 470.0, 381.0, 351.0, 293.0, 271.0, 215.0, 180.0, 170.0, 162.0, 172.0, 166.0], [562.0, 433.0, 427.0, 403.0, 445.0, 452.0, 488.0, 539.0, 507.0, 562.0, 514.0, 580.0, 631.0, 608.0, 607.0, 633.0, 674.0, 731.0, 819.0, 825.0, 891.0, 908.0, 994.0, 1013.0, 1119.0, 1104.0, 1203.0, 1264.0, 1332.0, 1435.0, 1574.0, 1693.0, 1682.0, 1739.0, 1718.0, 1771.0, 1751.0, 1798.0, 1775.0, 1791.0, 1699.0, 1729.0, 1484.0, 1438.0, 1292.0, 1181.0, 939.0, 761.0, 579.0], [375.0, 210.0, 185.0, 189.0, 170.0, 193.0, 211.0, 216.0, 239.0, 253.0, 275.0, 269.0, 298.0, 316.0, 329.0, 355.0, 386.0, 366.0, 437.0, 415.0, 441.0, 459.0, 469.0, 562.0, 513.0, 580.0, 609.0, 621.0, 642.0, 681.0, 694.0, 751.0, 812.0, 858.0, 916.0, 1049.0, 1152.0, 1182.0, 1405.0, 1583.0, 1653.0, 2003.0, 2301.0, 2571.0, 2858.0, 3296.0, 3586.0, 3977.0, 4126.0], [287.0, 154.0, 112.0, 94.0, 100.0, 93.0, 85.0, 93.0, 89.0, 110.0, 110.0, 110.0, 129.0, 158.0, 156.0, 158.0, 171.0, 182.0, 192.0, 213.0, 236.0, 270.0, 262.0, 291.0, 288.0, 321.0, 364.0, 398.0, 418.0, 433.0, 475.0, 525.0, 520.0, 558.0, 634.0, 619.0, 685.0, 781.0, 782.0, 877.0, 1025.0, 1082.0, 1370.0, 1524.0, 1792.0, 2337.0, 3055.0, 4541.0, 7786.0], [248.0, 121.0, 65.0, 67.0, 57.0, 60.0, 59.0, 51.0, 39.0, 51.0, 41.0, 55.0, 57.0, 54.0, 55.0, 63.0, 74.0, 79.0, 80.0, 78.0, 108.0, 108.0, 115.0, 133.0, 132.0, 163.0, 183.0, 204.0, 190.0, 219.0, 266.0, 286.0, 335.0, 349.0, 360.0, 403.0, 430.0, 503.0, 622.0, 688.0, 697.0, 861.0, 957.0, 1168.0, 1351.0, 1650.0, 2177.0, 3026.0, 6017.0], [252.0, 113.0, 61.0, 38.0, 39.0, 29.0, 38.0, 40.0, 30.0, 30.0, 27.0, 28.0, 32.0, 36.0, 29.0, 26.0, 25.0, 38.0, 31.0, 39.0, 36.0, 41.0, 53.0, 46.0, 45.0, 54.0, 77.0, 71.0, 76.0, 112.0, 115.0, 130.0, 145.0, 166.0, 183.0, 210.0, 219.0, 274.0, 315.0, 367.0, 440.0, 550.0, 620.0, 820.0, 1018.0, 1298.0, 1762.0, 2531.0, 4864.0], [227.0, 101.0, 67.0, 38.0, 36.0, 22.0, 37.0, 25.0, 18.0, 21.0, 26.0, 11.0, 23.0, 17.0, 20.0, 14.0, 17.0, 29.0, 17.0, 26.0, 21.0, 18.0, 25.0, 27.0, 26.0, 21.0, 34.0, 36.0, 37.0, 39.0, 47.0, 56.0, 58.0, 55.0, 74.0, 81.0, 95.0, 122.0, 106.0, 150.0, 214.0, 257.0, 326.0, 427.0, 580.0, 804.0, 1195.0, 1966.0, 4133.0], [243.0, 88.0, 48.0, 34.0, 34.0, 32.0, 22.0, 18.0, 20.0, 25.0, 18.0, 14.0, 13.0, 13.0, 17.0, 16.0, 9.0, 10.0, 13.0, 12.0, 16.0, 11.0, 17.0, 16.0, 14.0, 11.0, 27.0, 15.0, 24.0, 23.0, 28.0, 30.0, 29.0, 27.0, 40.0, 35.0, 48.0, 57.0, 56.0, 79.0, 98.0, 110.0, 146.0, 177.0, 284.0, 393.0, 635.0, 1217.0, 3039.0], [230.0, 78.0, 53.0, 43.0, 26.0, 19.0, 19.0, 14.0, 19.0, 14.0, 11.0, 14.0, 12.0, 14.0, 16.0, 10.0, 11.0, 11.0, 6.0, 10.0, 12.0, 10.0, 12.0, 15.0, 15.0, 12.0, 16.0, 11.0, 13.0, 16.0, 13.0, 16.0, 18.0, 16.0, 9.0, 22.0, 34.0, 25.0, 33.0, 36.0, 43.0, 55.0, 64.0, 97.0, 117.0, 172.0, 276.0, 654.0, 1943.0], [202.0, 91.0, 56.0, 29.0, 32.0, 23.0, 19.0, 23.0, 11.0, 15.0, 8.0, 17.0, 11.0, 11.0, 7.0, 9.0, 5.0, 11.0, 4.0, 6.0, 8.0, 14.0, 11.0, 9.0, 9.0, 10.0, 12.0, 12.0, 10.0, 11.0, 10.0, 17.0, 13.0, 11.0, 12.0, 21.0, 14.0, 16.0, 24.0, 19.0, 24.0, 33.0, 34.0, 51.0, 74.0, 75.0, 140.0, 297.0, 1040.0], [228.0, 83.0, 35.0, 29.0, 24.0, 25.0, 20.0, 16.0, 16.0, 9.0, 5.0, 14.0, 8.0, 8.0, 11.0, 4.0, 8.0, 10.0, 10.0, 12.0, 8.0, 5.0, 6.0, 6.0, 10.0, 9.0, 10.0, 10.0, 8.0, 5.0, 7.0, 9.0, 10.0, 5.0, 18.0, 14.0, 11.0, 16.0, 17.0, 15.0, 16.0, 26.0, 22.0, 24.0, 40.0, 60.0, 84.0, 122.0, 545.0], [236.0, 76.0, 49.0, 25.0, 21.0, 24.0, 22.0, 16.0, 9.0, 10.0, 8.0, 10.0, 11.0, 3.0, 8.0, 10.0, 4.0, 9.0, 3.0, 4.0, 9.0, 6.0, 8.0, 8.0, 10.0, 7.0, 11.0, 11.0, 4.0, 8.0, 6.0, 4.0, 9.0, 8.0, 16.0, 10.0, 5.0, 12.0, 10.0, 11.0, 11.0, 13.0, 24.0, 30.0, 28.0, 32.0, 40.0, 81.0, 295.0], [196.0, 61.0, 48.0, 24.0, 15.0, 12.0, 10.0, 14.0, 11.0, 16.0, 10.0, 6.0, 12.0, 8.0, 10.0, 10.0, 3.0, 5.0, 6.0, 1.0, 7.0, 8.0, 3.0, 6.0, 6.0, 6.0, 5.0, 7.0, 8.0, 11.0, 6.0, 5.0, 13.0, 9.0, 7.0, 8.0, 8.0, 11.0, 12.0, 5.0, 9.0, 14.0, 13.0, 12.0, 15.0, 26.0, 31.0, 70.0, 195.0], [206.0, 70.0, 36.0, 32.0, 14.0, 14.0, 12.0, 3.0, 18.0, 8.0, 9.0, 9.0, 5.0, 8.0, 6.0, 4.0, 4.0, 2.0, 4.0, 9.0, 6.0, 4.0, 7.0, 9.0, 7.0, 3.0, 6.0, 3.0, 2.0, 6.0, 9.0, 3.0, 10.0, 9.0, 3.0, 7.0, 11.0, 9.0, 15.0, 7.0, 8.0, 19.0, 3.0, 8.0, 14.0, 20.0, 23.0, 49.0, 111.0], [203.0, 78.0, 41.0, 25.0, 17.0, 14.0, 20.0, 9.0, 8.0, 8.0, 7.0, 8.0, 4.0, 6.0, 3.0, 4.0, 6.0, 3.0, 4.0, 2.0, 3.0, 5.0, 5.0, 5.0, 2.0, 2.0, 5.0, 6.0, 6.0, 5.0, 9.0, 6.0, 10.0, 5.0, 4.0, 11.0, 5.0, 7.0, 3.0, 6.0, 6.0, 5.0, 12.0, 10.0, 22.0, 18.0, 15.0, 34.0, 77.0], [162.0, 73.0, 42.0, 26.0, 17.0, 12.0, 11.0, 10.0, 12.0, 12.0, 4.0, 7.0, 4.0, 3.0, 4.0, 2.0, 2.0, 2.0, 3.0, 5.0, 4.0, 2.0, 2.0, 2.0, 6.0, 3.0, 3.0, 1.0, 6.0, 7.0, 1.0, 5.0, 6.0, 4.0, 3.0, 3.0, 7.0, 10.0, 8.0, 6.0, 9.0, 5.0, 13.0, 8.0, 14.0, 8.0, 14.0, 33.0, 62.0], [198.0, 74.0, 40.0, 22.0, 15.0, 17.0, 10.0, 7.0, 2.0, 10.0, 8.0, 4.0, 8.0, 3.0, 5.0, 4.0, 1.0, 3.0, 6.0, 5.0, 2.0, 4.0, 2.0, 2.0, 3.0, 6.0, 3.0, 2.0, 6.0, 3.0, 2.0, 4.0, 4.0, 3.0, 2.0, 10.0, 4.0, 8.0, 7.0, 2.0, 8.0, 3.0, 11.0, 9.0, 5.0, 10.0, 14.0, 19.0, 54.0], [199.0, 70.0, 34.0, 21.0, 20.0, 10.0, 15.0, 12.0, 7.0, 13.0, 4.0, 4.0, 2.0, 2.0, 7.0, 3.0, 3.0, 0.0, 5.0, 3.0, 1.0, 2.0, 1.0, 2.0, 2.0, 5.0, 5.0, 2.0, 4.0, 4.0, 3.0, 2.0, 2.0, 2.0, 4.0, 4.0, 0.0, 2.0, 5.0, 3.0, 4.0, 7.0, 4.0, 5.0, 7.0, 13.0, 15.0, 14.0, 43.0], [186.0, 75.0, 37.0, 23.0, 28.0, 13.0, 10.0, 12.0, 6.0, 6.0, 2.0, 3.0, 2.0, 5.0, 2.0, 2.0, 3.0, 4.0, 3.0, 2.0, 2.0, 3.0, 2.0, 2.0, 3.0, 1.0, 3.0, 1.0, 2.0, 3.0, 6.0, 5.0, 3.0, 2.0, 5.0, 5.0, 2.0, 7.0, 9.0, 4.0, 7.0, 5.0, 0.0, 1.0, 6.0, 6.0, 8.0, 7.0, 25.0], [183.0, 68.0, 37.0, 27.0, 14.0, 10.0, 11.0, 11.0, 12.0, 9.0, 6.0, 1.0, 3.0, 2.0, 3.0, 1.0, 2.0, 1.0, 2.0, 3.0, 1.0, 3.0, 1.0, 4.0, 2.0, 6.0, 2.0, 1.0, 0.0, 4.0, 6.0, 2.0, 3.0, 3.0, 3.0, 1.0, 4.0, 1.0, 3.0, 4.0, 6.0, 1.0, 4.0, 6.0, 5.0, 5.0, 4.0, 3.0, 25.0], [194.0, 80.0, 40.0, 26.0, 19.0, 12.0, 14.0, 8.0, 7.0, 3.0, 9.0, 3.0, 4.0, 3.0, 5.0, 2.0, 3.0, 2.0, 1.0, 4.0, 2.0, 0.0, 0.0, 5.0, 1.0, 3.0, 4.0, 2.0, 1.0, 7.0, 2.0, 4.0, 4.0, 3.0, 2.0, 5.0, 1.0, 1.0, 1.0, 4.0, 4.0, 1.0, 3.0, 4.0, 4.0, 2.0, 6.0, 8.0, 14.0], [180.0, 76.0, 35.0, 28.0, 16.0, 12.0, 7.0, 12.0, 9.0, 8.0, 8.0, 2.0, 1.0, 2.0, 2.0, 7.0, 3.0, 3.0, 5.0, 1.0, 5.0, 2.0, 4.0, 1.0, 4.0, 1.0, 1.0, 6.0, 1.0, 2.0, 2.0, 3.0, 4.0, 1.0, 1.0, 2.0, 4.0, 3.0, 3.0, 2.0, 2.0, 2.0, 1.0, 6.0, 5.0, 2.0, 2.0, 3.0, 7.0], [203.0, 60.0, 53.0, 22.0, 19.0, 12.0, 15.0, 14.0, 6.0, 3.0, 4.0, 3.0, 3.0, 4.0, 3.0, 3.0, 2.0, 3.0, 6.0, 2.0, 0.0, 1.0, 3.0, 2.0, 3.0, 4.0, 1.0, 3.0, 2.0, 1.0, 3.0, 4.0, 3.0, 1.0, 2.0, 7.0, 2.0, 1.0, 3.0, 4.0, 3.0, 2.0, 1.0, 6.0, 1.0, 1.0, 1.0, 2.0, 11.0], [206.0, 70.0, 35.0, 22.0, 21.0, 8.0, 13.0, 6.0, 8.0, 6.0, 6.0, 4.0, 5.0, 3.0, 0.0, 3.0, 2.0, 3.0, 1.0, 3.0, 0.0, 3.0, 0.0, 4.0, 2.0, 4.0, 5.0, 1.0, 4.0, 4.0, 4.0, 3.0, 4.0, 2.0, 4.0, 2.0, 3.0, 2.0, 2.0, 2.0, 3.0, 2.0, 2.0, 0.0, 0.0, 2.0, 0.0, 4.0, 4.0], [197.0, 67.0, 30.0, 21.0, 15.0, 14.0, 12.0, 12.0, 8.0, 9.0, 5.0, 4.0, 4.0, 2.0, 7.0, 4.0, 0.0, 2.0, 4.0, 1.0, 1.0, 4.0, 2.0, 1.0, 4.0, 3.0, 2.0, 4.0, 2.0, 2.0, 0.0, 3.0, 1.0, 2.0, 2.0, 1.0, 2.0, 2.0, 0.0, 6.0, 5.0, 3.0, 2.0, 2.0, 2.0, 1.0, 2.0, 1.0, 7.0], [194.0, 71.0, 26.0, 29.0, 15.0, 10.0, 16.0, 13.0, 12.0, 8.0, 6.0, 4.0, 4.0, 2.0, 2.0, 0.0, 1.0, 2.0, 4.0, 4.0, 1.0, 2.0, 4.0, 3.0, 1.0, 0.0, 4.0, 0.0, 1.0, 5.0, 3.0, 3.0, 1.0, 1.0, 4.0, 5.0, 2.0, 4.0, 0.0, 0.0, 4.0, 1.0, 4.0, 3.0, 3.0, 1.0, 2.0, 0.0, 4.0], [192.0, 57.0, 34.0, 25.0, 17.0, 15.0, 11.0, 14.0, 12.0, 6.0, 4.0, 4.0, 6.0, 2.0, 1.0, 1.0, 2.0, 1.0, 1.0, 0.0, 2.0, 3.0, 2.0, 3.0, 3.0, 4.0, 4.0, 5.0, 2.0, 1.0, 2.0, 4.0, 4.0, 2.0, 2.0, 2.0, 1.0, 2.0, 2.0, 0.0, 1.0, 2.0, 2.0, 2.0, 3.0, 1.0, 3.0, 6.0, 0.0], [187.0, 70.0, 34.0, 25.0, 25.0, 18.0, 10.0, 9.0, 13.0, 8.0, 2.0, 3.0, 6.0, 3.0, 0.0, 4.0, 1.0, 2.0, 0.0, 2.0, 1.0, 2.0, 2.0, 3.0, 3.0, 1.0, 0.0, 5.0, 5.0, 3.0, 2.0, 5.0, 1.0, 5.0, 1.0, 4.0, 2.0, 0.0, 2.0, 1.0, 2.0, 1.0, 3.0, 2.0, 0.0, 1.0, 2.0, 3.0, 2.0], [203.0, 62.0, 38.0, 13.0, 25.0, 10.0, 8.0, 15.0, 7.0, 7.0, 3.0, 5.0, 3.0, 6.0, 2.0, 3.0, 3.0, 3.0, 0.0, 1.0, 3.0, 4.0, 2.0, 1.0, 1.0, 1.0, 2.0, 0.0, 2.0, 2.0, 1.0, 4.0, 2.0, 3.0, 4.0, 2.0, 6.0, 1.0, 2.0, 0.0, 4.0, 3.0, 2.0, 1.0, 3.0, 2.0, 2.0, 0.0, 2.0], [184.0, 70.0, 43.0, 21.0, 17.0, 16.0, 20.0, 6.0, 4.0, 7.0, 7.0, 6.0, 1.0, 5.0, 2.0, 1.0, 1.0, 0.0, 2.0, 1.0, 2.0, 3.0, 2.0, 5.0, 2.0, 0.0, 4.0, 2.0, 1.0, 2.0, 3.0, 2.0, 3.0, 4.0, 0.0, 2.0, 4.0, 1.0, 2.0, 3.0, 1.0, 2.0, 3.0, 1.0, 2.0, 1.0, 4.0, 2.0, 6.0], [181.0, 71.0, 44.0, 19.0, 22.0, 17.0, 8.0, 14.0, 7.0, 3.0, 7.0, 5.0, 4.0, 2.0, 4.0, 4.0, 1.0, 0.0, 2.0, 1.0, 4.0, 0.0, 1.0, 3.0, 4.0, 1.0, 0.0, 5.0, 3.0, 3.0, 6.0, 5.0, 1.0, 3.0, 0.0, 1.0, 4.0, 1.0, 1.0, 2.0, 2.0, 1.0, 2.0, 1.0, 1.0, 2.0, 0.0, 3.0, 8.0], [193.0, 72.0, 40.0, 27.0, 14.0, 13.0, 12.0, 13.0, 13.0, 2.0, 4.0, 3.0, 1.0, 4.0, 1.0, 2.0, 1.0, 2.0, 2.0, 2.0, 1.0, 3.0, 2.0, 2.0, 3.0, 1.0, 2.0, 2.0, 5.0, 5.0, 3.0, 1.0, 4.0, 2.0, 1.0, 3.0, 0.0, 1.0, 3.0, 0.0, 3.0, 0.0, 3.0, 2.0, 1.0, 3.0, 2.0, 3.0, 5.0], [194.0, 80.0, 41.0, 33.0, 14.0, 12.0, 5.0, 7.0, 9.0, 6.0, 7.0, 2.0, 2.0, 4.0, 3.0, 2.0, 2.0, 2.0, 2.0, 1.0, 5.0, 2.0, 3.0, 0.0, 3.0, 1.0, 1.0, 4.0, 3.0, 1.0, 5.0, 2.0, 3.0, 5.0, 4.0, 1.0, 1.0, 0.0, 2.0, 2.0, 2.0, 2.0, 0.0, 2.0, 1.0, 3.0, 1.0, 2.0, 2.0], [221.0, 60.0, 36.0, 26.0, 15.0, 19.0, 11.0, 8.0, 6.0, 5.0, 2.0, 6.0, 4.0, 4.0, 3.0, 2.0, 3.0, 1.0, 4.0, 0.0, 0.0, 2.0, 0.0, 1.0, 4.0, 2.0, 4.0, 3.0, 1.0, 5.0, 2.0, 1.0, 5.0, 3.0, 3.0, 0.0, 0.0, 4.0, 1.0, 4.0, 1.0, 4.0, 1.0, 1.0, 1.0, 2.0, 2.0, 0.0, 4.0], [201.0, 79.0, 32.0, 26.0, 12.0, 16.0, 13.0, 8.0, 7.0, 5.0, 2.0, 6.0, 3.0, 2.0, 3.0, 4.0, 1.0, 2.0, 1.0, 2.0, 1.0, 3.0, 1.0, 1.0, 1.0, 1.0, 0.0, 3.0, 2.0, 7.0, 4.0, 2.0, 2.0, 2.0, 5.0, 2.0, 4.0, 1.0, 4.0, 2.0, 2.0, 2.0, 2.0, 1.0, 0.0, 2.0, 4.0, 3.0, 2.0], [192.0, 77.0, 29.0, 24.0, 20.0, 16.0, 15.0, 7.0, 4.0, 3.0, 5.0, 7.0, 5.0, 3.0, 2.0, 6.0, 4.0, 3.0, 1.0, 0.0, 2.0, 0.0, 2.0, 1.0, 1.0, 3.0, 0.0, 2.0, 0.0, 7.0, 2.0, 3.0, 2.0, 4.0, 2.0, 3.0, 3.0, 6.0, 2.0, 2.0, 0.0, 0.0, 6.0, 0.0, 1.0, 0.0, 0.0, 4.0, 3.0], [181.0, 79.0, 42.0, 20.0, 25.0, 15.0, 13.0, 5.0, 4.0, 8.0, 9.0, 3.0, 6.0, 4.0, 3.0, 1.0, 2.0, 0.0, 4.0, 1.0, 3.0, 1.0, 2.0, 3.0, 1.0, 1.0, 3.0, 3.0, 1.0, 2.0, 3.0, 0.0, 5.0, 3.0, 2.0, 0.0, 3.0, 4.0, 2.0, 2.0, 2.0, 3.0, 1.0, 0.0, 2.0, 5.0, 2.0, 4.0, 2.0], [181.0, 68.0, 50.0, 23.0, 21.0, 20.0, 12.0, 9.0, 4.0, 4.0, 3.0, 4.0, 3.0, 2.0, 2.0, 4.0, 3.0, 4.0, 3.0, 2.0, 1.0, 1.0, 3.0, 1.0, 1.0, 1.0, 3.0, 3.0, 1.0, 2.0, 3.0, 3.0, 1.0, 2.0, 3.0, 3.0, 1.0, 3.0, 3.0, 2.0, 1.0, 1.0, 3.0, 1.0, 2.0, 4.0, 4.0, 2.0, 4.0], [181.0, 83.0, 48.0, 19.0, 16.0, 16.0, 15.0, 13.0, 4.0, 8.0, 6.0, 2.0, 2.0, 2.0, 1.0, 6.0, 3.0, 5.0, 3.0, 2.0, 3.0, 2.0, 1.0, 1.0, 1.0, 1.0, 2.0, 0.0, 3.0, 7.0, 1.0, 1.0, 2.0, 1.0, 1.0, 0.0, 2.0, 2.0, 2.0, 0.0, 3.0, 4.0, 1.0, 1.0, 0.0, 5.0, 3.0, 3.0, 2.0], [196.0, 69.0, 39.0, 23.0, 17.0, 21.0, 11.0, 6.0, 9.0, 8.0, 7.0, 6.0, 4.0, 1.0, 2.0, 4.0, 0.0, 2.0, 1.0, 0.0, 0.0, 5.0, 4.0, 1.0, 5.0, 1.0, 3.0, 0.0, 3.0, 1.0, 1.0, 3.0, 2.0, 0.0, 0.0, 4.0, 0.0, 1.0, 2.0, 1.0, 4.0, 0.0, 2.0, 5.0, 3.0, 1.0, 3.0, 2.0, 1.0], [207.0, 62.0, 41.0, 23.0, 12.0, 19.0, 14.0, 7.0, 5.0, 6.0, 7.0, 5.0, 4.0, 3.0, 2.0, 2.0, 2.0, 2.0, 3.0, 2.0, 4.0, 2.0, 2.0, 5.0, 2.0, 2.0, 2.0, 2.0, 1.0, 4.0, 3.0, 1.0, 1.0, 1.0, 3.0, 1.0, 2.0, 1.0, 3.0, 0.0, 3.0, 2.0, 5.0, 2.0, 0.0, 2.0, 0.0, 4.0, 2.0], [188.0, 74.0, 41.0, 24.0, 17.0, 7.0, 6.0, 8.0, 10.0, 1.0, 6.0, 5.0, 2.0, 4.0, 4.0, 4.0, 4.0, 2.0, 6.0, 1.0, 6.0, 0.0, 2.0, 1.0, 1.0, 1.0, 2.0, 2.0, 1.0, 1.0, 2.0, 6.0, 3.0, 0.0, 3.0, 4.0, 3.0, 0.0, 0.0, 1.0, 6.0, 1.0, 2.0, 0.0, 1.0, 3.0, 2.0, 0.0, 10.0], [183.0, 63.0, 41.0, 33.0, 12.0, 17.0, 7.0, 10.0, 4.0, 7.0, 7.0, 2.0, 3.0, 5.0, 3.0, 5.0, 1.0, 2.0, 3.0, 0.0, 0.0, 5.0, 3.0, 1.0, 1.0, 2.0, 2.0, 4.0, 1.0, 1.0, 5.0, 2.0, 0.0, 1.0, 3.0, 2.0, 5.0, 0.0, 2.0, 3.0, 2.0, 2.0, 3.0, 1.0, 3.0, 4.0, 1.0, 1.0, 2.0]],
    "Name": "sCurve-0",
    "Overflow": 1989908.0,
    "Type": "Histo2d",
    "Underflow": 0.0,
    "x": {
        "AxisTitle": "Vcal",
        "Bins": 51,
        "High": 302.5,
        "Low": 47.5
    },
    "y": {
        "AxisTitle": "Occupancy",
        "Bins": 49,
        "High": 49.5,
        "Low": 0.5
    },
    "z": {
        "AxisTitle": "Number of pixels"
    }
}