time,Hardware,Voltage,Current
1623309031426,high-voltage,1,0.055809
time,Hardware,Voltage,Current
1623309031426,high-voltage,2,0.0684732
time,Hardware,Voltage,Current
1623309031426,high-voltage,3,0.0799883
time,Hardware,Voltage,Current
1623309031426,high-voltage,4,0.0890025
time,Hardware,Voltage,Current
1623309031426,high-voltage,5,0.0982185
time,Hardware,Voltage,Current
1623309031426,high-voltage,6,0.107792
time,Hardware,Voltage,Current
1623309031426,high-voltage,7,0.116914
time,Hardware,Voltage,Current
1623309031426,high-voltage,8,0.125572
time,Hardware,Voltage,Current
1623309031426,high-voltage,9,0.136266
time,Hardware,Voltage,Current
1623309031426,high-voltage,10,0.14519
time,Hardware,Voltage,Current
1623309031426,high-voltage,11,0.156117
time,Hardware,Voltage,Current
1623309031426,high-voltage,12,0.165112
time,Hardware,Voltage,Current
1623309031426,high-voltage,13,0.174979
time,Hardware,Voltage,Current
1623309031426,high-voltage,14,0.182005
time,Hardware,Voltage,Current
1623309031426,high-voltage,15,0.189877
time,Hardware,Voltage,Current
1623309031426,high-voltage,16,0.195271
time,Hardware,Voltage,Current
1623309031426,high-voltage,17,0.201134
time,Hardware,Voltage,Current
1623309031426,high-voltage,18,0.207498
time,Hardware,Voltage,Current
1623309031426,high-voltage,19,0.211975
time,Hardware,Voltage,Current
1623309031426,high-voltage,20,0.218167
time,Hardware,Voltage,Current
1623309031426,high-voltage,25,0.242874
time,Hardware,Voltage,Current
1623309031426,high-voltage,30,0.276424
time,Hardware,Voltage,Current
1623309031426,high-voltage,35,0.382328
time,Hardware,Voltage,Current
1623309031426,high-voltage,40,0.699721
time,Hardware,Voltage,Current
1623309031426,high-voltage,45,1.24933
time,Hardware,Voltage,Current
1623309031426,high-voltage,50,1.97097
time,Hardware,Voltage,Current
1623309031426,high-voltage,55,2.8471
time,Hardware,Voltage,Current
1623309031426,high-voltage,60,3.86894
time,Hardware,Voltage,Current
1623309031426,high-voltage,65,5.04801
time,Hardware,Voltage,Current
1623309031426,high-voltage,70,6.39802
time,Hardware,Voltage,Current
1623309031426,high-voltage,75,7.92817
time,Hardware,Voltage,Current
1623309031426,high-voltage,9.68206e-06,9.68234
time,Hardware,Voltage,Current
1623309031426,high-voltage,85,10
