time,Hardware,Voltage,Current
1621550559027,high-voltage,1,0.0581108
time,Hardware,Voltage,Current
1621550559027,high-voltage,2,0.0985306
time,Hardware,Voltage,Current
1621550559027,high-voltage,3,0.17454
time,Hardware,Voltage,Current
1621550559027,high-voltage,4,0.278919
time,Hardware,Voltage,Current
1621550559027,high-voltage,5,0.419266
time,Hardware,Voltage,Current
1621550559027,high-voltage,6,0.616112
time,Hardware,Voltage,Current
1621550559027,high-voltage,7,0.827922
time,Hardware,Voltage,Current
1621550559027,high-voltage,8,1.19159
time,Hardware,Voltage,Current
1621550559027,high-voltage,9,1.58018
time,Hardware,Voltage,Current
1621550559027,high-voltage,10,2.0313
time,Hardware,Voltage,Current
1621550559027,high-voltage,11,2.6072
time,Hardware,Voltage,Current
1621550559027,high-voltage,12,3.24845
time,Hardware,Voltage,Current
1621550559027,high-voltage,13,4.05632
time,Hardware,Voltage,Current
1621550559027,high-voltage,14,4.70354
time,Hardware,Voltage,Current
1621550559027,high-voltage,5.97373e-06,5.94735
time,Hardware,Voltage,Current
1621550559027,high-voltage,16,7.06303
time,Hardware,Voltage,Current
1621550559027,high-voltage,17,8.24404
time,Hardware,Voltage,Current
1621550559027,high-voltage,18,9.22812
time,Hardware,Voltage,Current
1621550559027,high-voltage,19,9.72535
time,Hardware,Voltage,Current
1621550559027,high-voltage,20,10.0001
