{
    "Data": [765.0, 18500.0, 21289.0, 10098.0, 5083.0, 3695.0, 3551.0, 3264.0, 2818.0, 2182.0, 1545.0, 1133.0, 736.0, 518.0, 357.0, 248.0, 207.0, 127.0, 139.0, 131.0, 113.0, 114.0, 95.0, 89.0, 97.0, 106.0, 80.0, 70.0, 79.0, 81.0, 68.0, 72.0, 54.0, 50.0, 53.0, 56.0, 48.0, 30.0, 31.0, 33.0, 32.0, 28.0, 17.0, 29.0, 25.0, 14.0, 14.0, 24.0, 8.0, 10.0, 4.0],
    "Name": "Chi2Dist-0",
    "Overflow": 0.0,
    "Type": "Histo1d",
    "Underflow": 0.0,
    "x": {
        "AxisTitle": "Fit Chi/ndf",
        "Bins": 51,
        "High": 2.5250000953674318,
        "Low": -0.02500000037252903
    },
    "y": {
        "AxisTitle": "Number of Pixels"
    },
    "z": {
        "AxisTitle": "z"
    }
}