time,Hardware,Voltage,Current
1623284715718,high-voltage,1,0.0255938
time,Hardware,Voltage,Current
1623284715718,high-voltage,2,0.0321609
time,Hardware,Voltage,Current
1623284715718,high-voltage,3,0.0371843
time,Hardware,Voltage,Current
1623284715718,high-voltage,4,0.0418872
time,Hardware,Voltage,Current
1623284715718,high-voltage,5,0.0463173
time,Hardware,Voltage,Current
1623284715718,high-voltage,6,0.0503878
time,Hardware,Voltage,Current
1623284715718,high-voltage,7,0.0553583
time,Hardware,Voltage,Current
1623284715718,high-voltage,8,0.0597025
time,Hardware,Voltage,Current
1623284715718,high-voltage,9,0.0651107
time,Hardware,Voltage,Current
1623284715718,high-voltage,10,0.0700677
time,Hardware,Voltage,Current
1623284715718,high-voltage,11,0.0745757
time,Hardware,Voltage,Current
1623284715718,high-voltage,12,0.0804197
time,Hardware,Voltage,Current
1623284715718,high-voltage,13,0.0839035
time,Hardware,Voltage,Current
1623284715718,high-voltage,14,0.0877889
time,Hardware,Voltage,Current
1623284715718,high-voltage,15,0.0916431
time,Hardware,Voltage,Current
1623284715718,high-voltage,16,0.0934323
time,Hardware,Voltage,Current
1623284715718,high-voltage,17,0.0977168
time,Hardware,Voltage,Current
1623284715718,high-voltage,18,0.0995859
time,Hardware,Voltage,Current
1623284715718,high-voltage,19,0.101775
time,Hardware,Voltage,Current
1623284715718,high-voltage,1.04534e-07,0.105307
time,Hardware,Voltage,Current
1623284715718,high-voltage,25,0.116878
time,Hardware,Voltage,Current
1623284715718,high-voltage,30,0.13383
time,Hardware,Voltage,Current
1623284715718,high-voltage,35,0.186546
time,Hardware,Voltage,Current
1623284715718,high-voltage,40,0.384075
time,Hardware,Voltage,Current
1623284715718,high-voltage,45,0.805749
time,Hardware,Voltage,Current
1623284715718,high-voltage,50,1.43095
time,Hardware,Voltage,Current
1623284715718,high-voltage,55,2.22252
time,Hardware,Voltage,Current
1623284715718,high-voltage,60,3.17723
time,Hardware,Voltage,Current
1623284715718,high-voltage,65,4.27667
time,Hardware,Voltage,Current
1623284715718,high-voltage,70,5.53756
time,Hardware,Voltage,Current
1623284715718,high-voltage,75,6.97341
time,Hardware,Voltage,Current
1623284715718,high-voltage,80,8.59712
time,Hardware,Voltage,Current
1623284715718,high-voltage,85,10
