{
    "Data": [14.0, 38.0, 1.0, 1.0, 9.0, 90.0, 470.0, 1465.0, 2933.0, 4269.0, 4488.0, 3691.0, 3010.0, 2634.0, 2389.0, 2226.0, 2129.0, 1954.0, 1833.0, 1860.0, 2036.0, 2347.0, 2481.0, 2332.0, 1976.0, 1609.0, 1165.0, 741.0, 512.0, 409.0, 366.0, 437.0, 529.0, 698.0, 926.0, 1117.0, 1350.0, 1651.0, 1765.0, 1922.0, 1929.0, 1901.0, 1710.0, 1598.0, 1376.0, 1223.0, 933.0, 786.0, 651.0, 471.0, 374.0, 250.0, 180.0, 135.0, 128.0, 80.0, 55.0, 55.0, 41.0, 33.0, 25.0, 20.0, 28.0, 22.0, 16.0, 16.0, 7.0, 3.0, 8.0, 10.0, 6.0, 9.0, 5.0, 5.0, 7.0, 4.0, 3.0, 6.0, 2.0, 4.0, 4.0, 2.0, 2.0, 1.0, 1.0, 0.0, 4.0, 0.0, 2.0, 0.0],
    "Name": "NoiseDist-0",
    "Overflow": 13.0,
    "Type": "Histo1d",
    "Underflow": 0.0,
    "x": {
        "AxisTitle": "Noise [e]",
        "Bins": 90,
        "High": 451.0,
        "Low": -2.0
    },
    "y": {
        "AxisTitle": "Number of Pixels"
    },
    "z": {
        "AxisTitle": "z"
    }
}