{
    "Data": [[1007.0, 250.0, 112.0, 61.0, 41.0, 33.0, 17.0, 11.0, 11.0, 11.0, 9.0, 6.0, 2.0, 4.0, 1.0, 3.0, 3.0, 4.0, 4.0, 3.0, 2.0, 6.0, 1.0, 1.0, 0.0, 3.0, 1.0, 1.0, 1.0, 2.0, 2.0, 0.0, 1.0, 2.0, 1.0, 1.0, 4.0, 1.0, 3.0, 1.0, 1.0, 0.0, 3.0, 3.0, 2.0, 2.0, 1.0, 2.0, 1.0], [1845.0, 580.0, 295.0, 169.0, 89.0, 78.0, 45.0, 31.0, 29.0, 28.0, 16.0, 16.0, 8.0, 11.0, 6.0, 6.0, 3.0, 6.0, 4.0, 5.0, 7.0, 5.0, 3.0, 2.0, 6.0, 6.0, 1.0, 2.0, 0.0, 2.0, 0.0, 2.0, 1.0, 2.0, 1.0, 3.0, 2.0, 2.0, 1.0, 6.0, 0.0, 5.0, 2.0, 1.0, 2.0, 1.0, 6.0, 4.0, 3.0], [3220.0, 1131.0, 628.0, 369.0, 247.0, 167.0, 131.0, 81.0, 91.0, 37.0, 49.0, 40.0, 35.0, 22.0, 27.0, 22.0, 24.0, 15.0, 10.0, 10.0, 5.0, 15.0, 8.0, 11.0, 5.0, 5.0, 3.0, 7.0, 2.0, 7.0, 2.0, 6.0, 4.0, 3.0, 3.0, 4.0, 1.0, 3.0, 2.0, 0.0, 2.0, 3.0, 4.0, 2.0, 1.0, 1.0, 7.0, 7.0, 10.0], [4221.0, 2003.0, 1198.0, 759.0, 579.0, 403.0, 282.0, 213.0, 198.0, 120.0, 125.0, 108.0, 80.0, 79.0, 58.0, 52.0, 50.0, 43.0, 42.0, 34.0, 26.0, 27.0, 21.0, 13.0, 15.0, 23.0, 14.0, 8.0, 16.0, 11.0, 10.0, 9.0, 7.0, 8.0, 9.0, 4.0, 6.0, 4.0, 8.0, 4.0, 4.0, 3.0, 2.0, 5.0, 4.0, 7.0, 4.0, 1.0, 11.0], [4531.0, 2762.0, 1876.0, 1354.0, 1009.0, 785.0, 604.0, 502.0, 440.0, 334.0, 282.0, 254.0, 205.0, 163.0, 154.0, 143.0, 105.0, 101.0, 94.0, 107.0, 68.0, 76.0, 61.0, 58.0, 37.0, 34.0, 25.0, 33.0, 27.0, 22.0, 38.0, 27.0, 22.0, 21.0, 18.0, 15.0, 27.0, 11.0, 15.0, 11.0, 16.0, 6.0, 5.0, 5.0, 6.0, 8.0, 8.0, 14.0, 6.0], [3547.0, 2599.0, 2047.0, 1720.0, 1463.0, 1162.0, 1058.0, 892.0, 739.0, 644.0, 555.0, 473.0, 426.0, 407.0, 351.0, 311.0, 271.0, 267.0, 210.0, 187.0, 161.0, 172.0, 133.0, 133.0, 115.0, 142.0, 90.0, 81.0, 95.0, 75.0, 69.0, 59.0, 56.0, 62.0, 52.0, 46.0, 35.0, 47.0, 27.0, 32.0, 27.0, 32.0, 25.0, 22.0, 24.0, 17.0, 16.0, 13.0, 22.0], [2361.0, 1680.0, 1560.0, 1482.0, 1304.0, 1283.0, 1192.0, 1155.0, 998.0, 913.0, 845.0, 805.0, 722.0, 672.0, 625.0, 621.0, 517.0, 487.0, 446.0, 372.0, 416.0, 365.0, 342.0, 329.0, 280.0, 254.0, 239.0, 210.0, 217.0, 166.0, 188.0, 206.0, 160.0, 133.0, 111.0, 116.0, 109.0, 103.0, 91.0, 85.0, 69.0, 82.0, 64.0, 60.0, 65.0, 55.0, 47.0, 51.0, 46.0], [2838.0, 1253.0, 935.0, 879.0, 849.0, 823.0, 930.0, 883.0, 826.0, 870.0, 863.0, 822.0, 822.0, 809.0, 782.0, 722.0, 715.0, 703.0, 658.0, 681.0, 655.0, 625.0, 584.0, 559.0, 482.0, 491.0, 491.0, 436.0, 403.0, 405.0, 385.0, 344.0, 392.0, 323.0, 284.0, 275.0, 266.0, 265.0, 258.0, 203.0, 218.0, 168.0, 170.0, 164.0, 157.0, 152.0, 144.0, 115.0, 115.0], [4455.0, 2052.0, 1333.0, 925.0, 707.0, 618.0, 525.0, 543.0, 538.0, 550.0, 577.0, 502.0, 522.0, 583.0, 630.0, 664.0, 648.0, 668.0, 647.0, 671.0, 687.0, 693.0, 683.0, 701.0, 715.0, 691.0, 619.0, 672.0, 673.0, 646.0, 660.0, 621.0, 584.0, 588.0, 559.0, 573.0, 508.0, 541.0, 486.0, 491.0, 451.0, 445.0, 431.0, 383.0, 336.0, 358.0, 338.0, 313.0, 288.0], [4509.0, 2904.0, 2084.0, 1600.0, 1258.0, 1051.0, 896.0, 754.0, 675.0, 615.0, 525.0, 488.0, 456.0, 433.0, 432.0, 401.0, 400.0, 407.0, 428.0, 456.0, 465.0, 535.0, 522.0, 506.0, 564.0, 579.0, 604.0, 661.0, 664.0, 663.0, 714.0, 722.0, 826.0, 748.0, 786.0, 797.0, 812.0, 829.0, 864.0, 818.0, 830.0, 794.0, 810.0, 790.0, 787.0, 808.0, 810.0, 763.0, 710.0], [2671.0, 2032.0, 1819.0, 1639.0, 1412.0, 1355.0, 1237.0, 1072.0, 986.0, 971.0, 895.0, 828.0, 739.0, 659.0, 690.0, 672.0, 593.0, 538.0, 550.0, 548.0, 512.0, 468.0, 471.0, 449.0, 456.0, 487.0, 434.0, 473.0, 500.0, 498.0, 520.0, 587.0, 608.0, 655.0, 693.0, 718.0, 753.0, 838.0, 928.0, 976.0, 1021.0, 1094.0, 1170.0, 1320.0, 1284.0, 1453.0, 1518.0, 1613.0, 1771.0], [1367.0, 924.0, 829.0, 909.0, 845.0, 877.0, 851.0, 826.0, 850.0, 826.0, 809.0, 793.0, 763.0, 817.0, 797.0, 687.0, 799.0, 789.0, 756.0, 700.0, 716.0, 767.0, 639.0, 670.0, 684.0, 625.0, 662.0, 667.0, 639.0, 667.0, 627.0, 609.0, 661.0, 652.0, 677.0, 683.0, 713.0, 736.0, 807.0, 818.0, 904.0, 1024.0, 1181.0, 1334.0, 1473.0, 1769.0, 2212.0, 2624.0, 3325.0], [1201.0, 443.0, 299.0, 320.0, 290.0, 307.0, 327.0, 337.0, 359.0, 372.0, 385.0, 434.0, 480.0, 465.0, 484.0, 507.0, 535.0, 533.0, 533.0, 550.0, 587.0, 567.0, 621.0, 615.0, 591.0, 674.0, 679.0, 724.0, 711.0, 758.0, 723.0, 764.0, 809.0, 834.0, 866.0, 882.0, 917.0, 900.0, 986.0, 960.0, 1137.0, 1118.0, 1301.0, 1383.0, 1566.0, 1876.0, 2260.0, 3132.0, 4873.0], [1557.0, 457.0, 211.0, 117.0, 111.0, 104.0, 95.0, 102.0, 99.0, 124.0, 105.0, 137.0, 167.0, 167.0, 151.0, 201.0, 199.0, 216.0, 222.0, 235.0, 283.0, 264.0, 282.0, 320.0, 394.0, 367.0, 361.0, 443.0, 458.0, 422.0, 494.0, 519.0, 526.0, 629.0, 724.0, 722.0, 728.0, 795.0, 883.0, 993.0, 1063.0, 1268.0, 1365.0, 1566.0, 1871.0, 2267.0, 2732.0, 3697.0, 5944.0], [2428.0, 768.0, 291.0, 136.0, 67.0, 47.0, 38.0, 33.0, 39.0, 35.0, 33.0, 29.0, 46.0, 39.0, 49.0, 41.0, 63.0, 55.0, 56.0, 57.0, 68.0, 97.0, 83.0, 113.0, 108.0, 146.0, 119.0, 131.0, 180.0, 172.0, 213.0, 220.0, 257.0, 327.0, 308.0, 323.0, 365.0, 426.0, 496.0, 577.0, 641.0, 747.0, 962.0, 1115.0, 1326.0, 1807.0, 2407.0, 3758.0, 7055.0], [3326.0, 1188.0, 554.0, 254.0, 117.0, 76.0, 48.0, 22.0, 24.0, 19.0, 16.0, 15.0, 12.0, 17.0, 21.0, 22.0, 13.0, 13.0, 16.0, 18.0, 25.0, 29.0, 16.0, 38.0, 26.0, 34.0, 48.0, 43.0, 55.0, 54.0, 57.0, 66.0, 81.0, 96.0, 123.0, 118.0, 147.0, 169.0, 201.0, 225.0, 297.0, 313.0, 432.0, 575.0, 698.0, 986.0, 1371.0, 2403.0, 5759.0], [4209.0, 1862.0, 986.0, 524.0, 270.0, 181.0, 102.0, 55.0, 44.0, 30.0, 15.0, 16.0, 12.0, 10.0, 14.0, 9.0, 15.0, 7.0, 9.0, 8.0, 8.0, 8.0, 15.0, 7.0, 11.0, 17.0, 15.0, 17.0, 15.0, 13.0, 17.0, 18.0, 31.0, 25.0, 30.0, 36.0, 37.0, 43.0, 66.0, 78.0, 111.0, 125.0, 142.0, 192.0, 278.0, 394.0, 642.0, 1184.0, 3272.0], [4661.0, 2510.0, 1505.0, 899.0, 494.0, 313.0, 224.0, 154.0, 86.0, 69.0, 42.0, 29.0, 18.0, 16.0, 13.0, 9.0, 7.0, 13.0, 8.0, 8.0, 6.0, 6.0, 7.0, 8.0, 5.0, 10.0, 6.0, 7.0, 6.0, 4.0, 7.0, 14.0, 13.0, 8.0, 15.0, 13.0, 14.0, 19.0, 23.0, 26.0, 36.0, 46.0, 50.0, 60.0, 78.0, 177.0, 265.0, 527.0, 1488.0], [4651.0, 2871.0, 1967.0, 1244.0, 871.0, 581.0, 475.0, 284.0, 194.0, 161.0, 113.0, 75.0, 64.0, 36.0, 33.0, 25.0, 19.0, 10.0, 10.0, 6.0, 9.0, 3.0, 7.0, 6.0, 6.0, 6.0, 4.0, 5.0, 5.0, 6.0, 10.0, 3.0, 4.0, 5.0, 7.0, 8.0, 9.0, 16.0, 15.0, 13.0, 15.0, 10.0, 22.0, 25.0, 44.0, 55.0, 81.0, 195.0, 690.0], [4281.0, 2992.0, 2187.0, 1536.0, 1180.0, 913.0, 702.0, 502.0, 366.0, 282.0, 245.0, 169.0, 134.0, 99.0, 75.0, 54.0, 38.0, 34.0, 30.0, 17.0, 14.0, 12.0, 6.0, 5.0, 10.0, 6.0, 6.0, 5.0, 1.0, 1.0, 7.0, 4.0, 7.0, 8.0, 4.0, 9.0, 5.0, 3.0, 5.0, 8.0, 7.0, 11.0, 12.0, 25.0, 15.0, 29.0, 44.0, 95.0, 325.0], [3625.0, 2830.0, 2276.0, 1761.0, 1435.0, 1118.0, 914.0, 731.0, 557.0, 495.0, 371.0, 316.0, 266.0, 216.0, 182.0, 114.0, 101.0, 76.0, 58.0, 63.0, 36.0, 32.0, 20.0, 20.0, 21.0, 16.0, 11.0, 7.0, 2.0, 9.0, 4.0, 5.0, 5.0, 2.0, 3.0, 3.0, 6.0, 4.0, 1.0, 1.0, 7.0, 11.0, 6.0, 16.0, 15.0, 18.0, 16.0, 46.0, 165.0], [3249.0, 2439.0, 2152.0, 1726.0, 1540.0, 1212.0, 1028.0, 876.0, 772.0, 581.0, 501.0, 437.0, 359.0, 336.0, 272.0, 229.0, 193.0, 169.0, 141.0, 95.0, 83.0, 70.0, 56.0, 65.0, 37.0, 36.0, 30.0, 29.0, 15.0, 22.0, 8.0, 7.0, 9.0, 6.0, 3.0, 4.0, 6.0, 4.0, 6.0, 4.0, 4.0, 5.0, 3.0, 2.0, 8.0, 11.0, 20.0, 30.0, 83.0], [2730.0, 2241.0, 2000.0, 1673.0, 1504.0, 1352.0, 1083.0, 975.0, 872.0, 812.0, 674.0, 544.0, 539.0, 456.0, 395.0, 339.0, 297.0, 256.0, 227.0, 193.0, 176.0, 144.0, 114.0, 81.0, 78.0, 79.0, 60.0, 66.0, 37.0, 30.0, 32.0, 23.0, 20.0, 14.0, 12.0, 13.0, 7.0, 5.0, 7.0, 4.0, 3.0, 5.0, 2.0, 8.0, 4.0, 8.0, 12.0, 18.0, 43.0], [2593.0, 2067.0, 1852.0, 1584.0, 1389.0, 1249.0, 1126.0, 1010.0, 902.0, 715.0, 736.0, 628.0, 572.0, 487.0, 490.0, 450.0, 372.0, 348.0, 303.0, 268.0, 230.0, 199.0, 188.0, 207.0, 147.0, 113.0, 126.0, 115.0, 73.0, 76.0, 65.0, 55.0, 40.0, 45.0, 33.0, 31.0, 21.0, 15.0, 9.0, 10.0, 14.0, 8.0, 9.0, 3.0, 7.0, 4.0, 9.0, 13.0, 30.0], [2241.0, 1789.0, 1726.0, 1380.0, 1336.0, 1187.0, 1037.0, 993.0, 873.0, 763.0, 718.0, 695.0, 604.0, 589.0, 527.0, 493.0, 467.0, 443.0, 380.0, 354.0, 301.0, 318.0, 284.0, 238.0, 209.0, 211.0, 193.0, 159.0, 151.0, 121.0, 114.0, 86.0, 73.0, 79.0, 76.0, 45.0, 60.0, 40.0, 24.0, 32.0, 25.0, 16.0, 18.0, 17.0, 5.0, 4.0, 7.0, 12.0, 19.0], [1924.0, 1477.0, 1485.0, 1312.0, 1205.0, 1082.0, 983.0, 939.0, 867.0, 785.0, 722.0, 706.0, 598.0, 604.0, 587.0, 585.0, 508.0, 474.0, 442.0, 412.0, 379.0, 389.0, 340.0, 329.0, 316.0, 284.0, 244.0, 230.0, 213.0, 180.0, 184.0, 174.0, 149.0, 125.0, 129.0, 101.0, 100.0, 76.0, 76.0, 75.0, 64.0, 37.0, 27.0, 30.0, 31.0, 26.0, 9.0, 12.0, 25.0], [1611.0, 1452.0, 1373.0, 1183.0, 1077.0, 1023.0, 944.0, 882.0, 748.0, 769.0, 744.0, 644.0, 639.0, 656.0, 607.0, 514.0, 506.0, 499.0, 482.0, 433.0, 426.0, 397.0, 387.0, 373.0, 363.0, 328.0, 330.0, 284.0, 334.0, 278.0, 272.0, 261.0, 233.0, 245.0, 189.0, 194.0, 168.0, 162.0, 141.0, 132.0, 122.0, 95.0, 90.0, 67.0, 51.0, 38.0, 42.0, 37.0, 32.0], [1464.0, 1323.0, 1298.0, 1126.0, 969.0, 963.0, 848.0, 816.0, 770.0, 685.0, 705.0, 648.0, 580.0, 559.0, 576.0, 581.0, 554.0, 524.0, 456.0, 454.0, 402.0, 418.0, 401.0, 394.0, 398.0, 384.0, 332.0, 363.0, 331.0, 327.0, 320.0, 324.0, 279.0, 300.0, 291.0, 290.0, 235.0, 227.0, 221.0, 198.0, 191.0, 169.0, 157.0, 145.0, 121.0, 120.0, 102.0, 83.0, 58.0], [1132.0, 1071.0, 1151.0, 1044.0, 848.0, 838.0, 783.0, 773.0, 744.0, 755.0, 665.0, 604.0, 596.0, 599.0, 532.0, 565.0, 533.0, 465.0, 461.0, 407.0, 409.0, 411.0, 356.0, 382.0, 358.0, 368.0, 372.0, 344.0, 325.0, 353.0, 327.0, 335.0, 333.0, 342.0, 308.0, 295.0, 336.0, 308.0, 331.0, 273.0, 285.0, 289.0, 257.0, 245.0, 235.0, 198.0, 213.0, 150.0, 135.0], [1071.0, 938.0, 970.0, 899.0, 707.0, 707.0, 644.0, 669.0, 641.0, 642.0, 570.0, 572.0, 501.0, 443.0, 467.0, 403.0, 461.0, 411.0, 418.0, 417.0, 427.0, 410.0, 377.0, 437.0, 370.0, 353.0, 359.0, 346.0, 363.0, 349.0, 384.0, 371.0, 392.0, 348.0, 376.0, 396.0, 379.0, 385.0, 373.0, 394.0, 408.0, 431.0, 415.0, 418.0, 392.0, 372.0, 348.0, 308.0, 307.0], [935.0, 864.0, 830.0, 742.0, 835.0, 620.0, 644.0, 598.0, 485.0, 524.0, 522.0, 509.0, 483.0, 432.0, 471.0, 458.0, 392.0, 421.0, 429.0, 402.0, 370.0, 428.0, 333.0, 338.0, 369.0, 354.0, 341.0, 309.0, 314.0, 288.0, 322.0, 320.0, 329.0, 324.0, 343.0, 349.0, 376.0, 392.0, 431.0, 429.0, 457.0, 427.0, 470.0, 492.0, 550.0, 525.0, 590.0, 619.0, 572.0], [615.0, 807.0, 732.0, 756.0, 701.0, 667.0, 621.0, 562.0, 562.0, 471.0, 393.0, 461.0, 493.0, 532.0, 444.0, 404.0, 442.0, 441.0, 465.0, 415.0, 375.0, 328.0, 323.0, 261.0, 328.0, 295.0, 270.0, 243.0, 264.0, 264.0, 278.0, 251.0, 253.0, 278.0, 257.0, 305.0, 387.0, 368.0, 379.0, 411.0, 433.0, 444.0, 542.0, 549.0, 620.0, 694.0, 732.0, 814.0, 920.0], [747.0, 617.0, 653.0, 577.0, 537.0, 535.0, 523.0, 561.0, 498.0, 452.0, 354.0, 456.0, 384.0, 413.0, 445.0, 351.0, 329.0, 325.0, 377.0, 338.0, 252.0, 345.0, 324.0, 288.0, 253.0, 231.0, 222.0, 261.0, 266.0, 339.0, 309.0, 386.0, 335.0, 331.0, 315.0, 277.0, 340.0, 300.0, 390.0, 373.0, 393.0, 431.0, 501.0, 509.0, 638.0, 739.0, 862.0, 1075.0, 1309.0], [577.0, 598.0, 613.0, 579.0, 530.0, 390.0, 457.0, 406.0, 534.0, 557.0, 410.0, 484.0, 381.0, 361.0, 341.0, 349.0, 417.0, 388.0, 341.0, 327.0, 298.0, 290.0, 329.0, 334.0, 338.0, 326.0, 344.0, 324.0, 249.0, 224.0, 264.0, 268.0, 234.0, 260.0, 250.0, 205.0, 181.0, 240.0, 275.0, 260.0, 295.0, 357.0, 388.0, 459.0, 541.0, 660.0, 846.0, 1160.0, 1665.0], [751.0, 617.0, 452.0, 547.0, 441.0, 632.0, 573.0, 505.0, 399.0, 601.0, 289.0, 451.0, 433.0, 389.0, 285.0, 305.0, 316.0, 308.0, 223.0, 370.0, 269.0, 442.0, 419.0, 383.0, 394.0, 310.0, 302.0, 275.0, 287.0, 271.0, 202.0, 208.0, 197.0, 172.0, 176.0, 202.0, 190.0, 247.0, 152.0, 173.0, 234.0, 300.0, 280.0, 334.0, 418.0, 560.0, 745.0, 1127.0, 1659.0], [591.0, 541.0, 635.0, 491.0, 486.0, 562.0, 465.0, 393.0, 571.0, 481.0, 356.0, 312.0, 309.0, 332.0, 187.0, 201.0, 280.0, 352.0, 276.0, 336.0, 353.0, 354.0, 316.0, 296.0, 265.0, 264.0, 337.0, 383.0, 265.0, 272.0, 287.0, 219.0, 189.0, 248.0, 231.0, 180.0, 192.0, 191.0, 170.0, 219.0, 213.0, 296.0, 265.0, 307.0, 350.0, 377.0, 542.0, 839.0, 1627.0], [609.0, 689.0, 528.0, 521.0, 438.0, 515.0, 458.0, 567.0, 457.0, 517.0, 538.0, 356.0, 459.0, 311.0, 309.0, 379.0, 264.0, 295.0, 257.0, 227.0, 299.0, 321.0, 142.0, 243.0, 252.0, 249.0, 283.0, 260.0, 227.0, 212.0, 210.0, 230.0, 233.0, 375.0, 224.0, 285.0, 313.0, 294.0, 139.0, 207.0, 291.0, 183.0, 269.0, 224.0, 281.0, 323.0, 460.0, 688.0, 1399.0], [459.0, 584.0, 722.0, 549.0, 515.0, 367.0, 473.0, 528.0, 346.0, 396.0, 442.0, 395.0, 381.0, 490.0, 362.0, 400.0, 414.0, 327.0, 352.0, 330.0, 314.0, 268.0, 340.0, 322.0, 223.0, 289.0, 398.0, 346.0, 300.0, 246.0, 264.0, 207.0, 245.0, 309.0, 196.0, 118.0, 145.0, 137.0, 155.0, 165.0, 131.0, 122.0, 200.0, 147.0, 97.0, 284.0, 354.0, 522.0, 1028.0], [595.0, 439.0, 588.0, 472.0, 431.0, 542.0, 371.0, 413.0, 491.0, 402.0, 528.0, 316.0, 494.0, 301.0, 311.0, 460.0, 403.0, 241.0, 439.0, 385.0, 249.0, 184.0, 256.0, 325.0, 265.0, 254.0, 292.0, 295.0, 342.0, 306.0, 115.0, 201.0, 242.0, 235.0, 333.0, 281.0, 226.0, 169.0, 200.0, 148.0, 174.0, 157.0, 147.0, 158.0, 189.0, 215.0, 196.0, 393.0, 848.0], [536.0, 473.0, 479.0, 620.0, 597.0, 558.0, 460.0, 422.0, 302.0, 447.0, 427.0, 418.0, 394.0, 387.0, 349.0, 287.0, 452.0, 286.0, 316.0, 296.0, 296.0, 293.0, 315.0, 241.0, 224.0, 240.0, 294.0, 276.0, 312.0, 274.0, 188.0, 208.0, 283.0, 171.0, 189.0, 175.0, 189.0, 138.0, 132.0, 293.0, 94.0, 249.0, 257.0, 265.0, 194.0, 140.0, 246.0, 322.0, 535.0], [662.0, 765.0, 408.0, 423.0, 593.0, 442.0, 364.0, 327.0, 376.0, 440.0, 435.0, 518.0, 470.0, 502.0, 412.0, 515.0, 408.0, 232.0, 340.0, 384.0, 449.0, 365.0, 356.0, 437.0, 230.0, 282.0, 239.0, 225.0, 178.0, 252.0, 261.0, 193.0, 158.0, 215.0, 101.0, 271.0, 183.0, 254.0, 198.0, 225.0, 189.0, 203.0, 153.0, 197.0, 156.0, 119.0, 129.0, 262.0, 351.0], [497.0, 628.0, 516.0, 411.0, 503.0, 503.0, 676.0, 632.0, 687.0, 599.0, 612.0, 306.0, 297.0, 394.0, 428.0, 369.0, 383.0, 251.0, 473.0, 284.0, 258.0, 285.0, 255.0, 236.0, 327.0, 376.0, 161.0, 312.0, 242.0, 280.0, 184.0, 206.0, 271.0, 218.0, 268.0, 232.0, 215.0, 284.0, 232.0, 179.0, 261.0, 199.0, 123.0, 167.0, 129.0, 202.0, 185.0, 244.0, 282.0], [497.0, 498.0, 448.0, 602.0, 576.0, 472.0, 521.0, 397.0, 486.0, 514.0, 364.0, 321.0, 282.0, 325.0, 312.0, 395.0, 409.0, 348.0, 396.0, 459.0, 479.0, 358.0, 334.0, 316.0, 256.0, 254.0, 197.0, 401.0, 267.0, 239.0, 224.0, 372.0, 394.0, 223.0, 250.0, 205.0, 242.0, 239.0, 206.0, 157.0, 254.0, 214.0, 133.0, 181.0, 168.0, 83.0, 250.0, 231.0, 238.0], [522.0, 531.0, 593.0, 593.0, 424.0, 506.0, 463.0, 361.0, 362.0, 382.0, 283.0, 250.0, 343.0, 311.0, 308.0, 351.0, 307.0, 324.0, 510.0, 377.0, 301.0, 390.0, 180.0, 312.0, 226.0, 263.0, 361.0, 270.0, 230.0, 207.0, 196.0, 299.0, 339.0, 232.0, 321.0, 166.0, 174.0, 153.0, 306.0, 291.0, 142.0, 180.0, 201.0, 155.0, 136.0, 143.0, 118.0, 138.0, 258.0], [395.0, 486.0, 448.0, 501.0, 390.0, 428.0, 500.0, 355.0, 402.0, 338.0, 370.0, 405.0, 333.0, 364.0, 286.0, 365.0, 300.0, 322.0, 404.0, 292.0, 336.0, 334.0, 333.0, 225.0, 212.0, 263.0, 195.0, 303.0, 235.0, 212.0, 319.0, 203.0, 205.0, 253.0, 305.0, 165.0, 238.0, 163.0, 174.0, 276.0, 125.0, 237.0, 158.0, 143.0, 86.0, 102.0, 171.0, 261.0, 215.0], [557.0, 385.0, 550.0, 519.0, 476.0, 266.0, 338.0, 401.0, 388.0, 433.0, 447.0, 318.0, 489.0, 293.0, 276.0, 273.0, 299.0, 252.0, 251.0, 276.0, 279.0, 241.0, 270.0, 238.0, 247.0, 232.0, 351.0, 248.0, 358.0, 213.0, 222.0, 96.0, 260.0, 243.0, 257.0, 160.0, 146.0, 132.0, 219.0, 178.0, 190.0, 208.0, 213.0, 263.0, 225.0, 286.0, 190.0, 196.0, 168.0], [473.0, 403.0, 399.0, 411.0, 381.0, 540.0, 380.0, 312.0, 289.0, 429.0, 288.0, 334.0, 370.0, 251.0, 280.0, 340.0, 290.0, 227.0, 253.0, 301.0, 418.0, 399.0, 180.0, 285.0, 275.0, 198.0, 160.0, 322.0, 311.0, 292.0, 298.0, 169.0, 198.0, 234.0, 154.0, 137.0, 177.0, 266.0, 151.0, 109.0, 162.0, 185.0, 193.0, 173.0, 162.0, 151.0, 160.0, 161.0, 134.0], [508.0, 436.0, 319.0, 349.0, 401.0, 375.0, 455.0, 391.0, 380.0, 229.0, 251.0, 334.0, 209.0, 401.0, 448.0, 272.0, 306.0, 254.0, 140.0, 210.0, 141.0, 212.0, 223.0, 248.0, 327.0, 221.0, 212.0, 218.0, 165.0, 185.0, 251.0, 274.0, 248.0, 204.0, 237.0, 243.0, 172.0, 160.0, 181.0, 168.0, 163.0, 185.0, 185.0, 214.0, 187.0, 183.0, 149.0, 174.0, 290.0], [429.0, 325.0, 199.0, 308.0, 247.0, 243.0, 363.0, 278.0, 193.0, 339.0, 283.0, 237.0, 195.0, 281.0, 346.0, 407.0, 405.0, 296.0, 305.0, 233.0, 257.0, 267.0, 344.0, 246.0, 232.0, 257.0, 281.0, 167.0, 282.0, 283.0, 143.0, 194.0, 200.0, 253.0, 280.0, 217.0, 188.0, 139.0, 112.0, 134.0, 108.0, 123.0, 75.0, 78.0, 174.0, 148.0, 232.0, 166.0, 126.0], [291.0, 331.0, 227.0, 390.0, 280.0, 235.0, 196.0, 250.0, 357.0, 255.0, 186.0, 295.0, 249.0, 280.0, 341.0, 301.0, 210.0, 363.0, 274.0, 244.0, 165.0, 329.0, 227.0, 190.0, 111.0, 129.0, 199.0, 130.0, 232.0, 140.0, 270.0, 177.0, 138.0, 84.0, 156.0, 104.0, 145.0, 202.0, 105.0, 239.0, 192.0, 115.0, 142.0, 86.0, 115.0, 62.0, 70.0, 122.0, 138.0], [394.0, 226.0, 200.0, 281.0, 268.0, 285.0, 264.0, 218.0, 229.0, 308.0, 279.0, 170.0, 169.0, 269.0, 277.0, 215.0, 246.0, 214.0, 108.0, 240.0, 143.0, 119.0, 199.0, 102.0, 117.0, 83.0, 188.0, 197.0, 176.0, 153.0, 122.0, 175.0, 186.0, 218.0, 191.0, 212.0, 164.0, 181.0, 154.0, 152.0, 132.0, 102.0, 95.0, 194.0, 199.0, 138.0, 111.0, 146.0, 134.0]],
    "Name": "sCurve-0",
    "Overflow": 2082848.0,
    "Type": "Histo2d",
    "Underflow": 0.0,
    "x": {
        "AxisTitle": "Vcal",
        "Bins": 51,
        "High": 302.5,
        "Low": 47.5
    },
    "y": {
        "AxisTitle": "Occupancy",
        "Bins": 49,
        "High": 49.5,
        "Low": 0.5
    },
    "z": {
        "AxisTitle": "Number of pixels"
    }
}