{
    "Data": [749.0, 17768.0, 21255.0, 10319.0, 5187.0, 3819.0, 3535.0, 3235.0, 2651.0, 2076.0, 1432.0, 974.0, 641.0, 425.0, 279.0, 213.0, 160.0, 117.0, 128.0, 94.0, 78.0, 83.0, 62.0, 58.0, 58.0, 56.0, 56.0, 44.0, 46.0, 39.0, 35.0, 33.0, 30.0, 29.0, 42.0, 24.0, 27.0, 15.0, 21.0, 29.0, 22.0, 19.0, 19.0, 10.0, 9.0, 22.0, 2.0, 7.0, 4.0, 11.0, 7.0],
    "Name": "Chi2Dist-0",
    "Overflow": 0.0,
    "Type": "Histo1d",
    "Underflow": 0.0,
    "x": {
        "AxisTitle": "Fit Chi/ndf",
        "Bins": 51,
        "High": 2.5250000953674318,
        "Low": -0.02500000037252903
    },
    "y": {
        "AxisTitle": "Number of Pixels"
    },
    "z": {
        "AxisTitle": "z"
    }
}