{
    "Data": [123.0, 88.0, 5.0, 1.0, 2.0, 3.0, 1.0, 15.0, 41.0, 139.0, 408.0, 984.0, 2012.0, 3190.0, 4053.0, 4053.0, 3530.0, 2940.0, 2405.0, 2540.0, 2887.0, 3126.0, 3008.0, 2594.0, 1975.0, 1428.0, 994.0, 679.0, 511.0, 477.0, 543.0, 623.0, 728.0, 1001.0, 1116.0, 1327.0, 1527.0, 1590.0, 1644.0, 1538.0, 1435.0, 1420.0, 1231.0, 1063.0, 942.0, 775.0, 736.0, 627.0, 467.0, 381.0, 327.0, 262.0, 181.0, 168.0, 136.0, 106.0, 92.0, 81.0, 57.0, 57.0, 45.0, 48.0, 41.0, 27.0, 31.0, 28.0, 21.0, 20.0, 19.0, 15.0, 21.0, 18.0, 8.0, 6.0, 5.0, 5.0, 4.0, 7.0, 4.0, 4.0, 5.0, 4.0, 0.0, 1.0, 2.0, 2.0, 2.0, 2.0, 1.0, 2.0, 2.0, 2.0, 1.0, 1.0, 1.0, 1.0, 2.0, 0.0, 2.0, 0.0, 2.0, 2.0, 2.0, 0.0, 0.0, 0.0, 1.0],
    "Name": "NoiseDist-0",
    "Overflow": 138.0,
    "Type": "Histo1d",
    "Underflow": 0.0,
    "x": {
        "AxisTitle": "Noise [e]",
        "Bins": 107,
        "High": 536.0,
        "Low": -2.0
    },
    "y": {
        "AxisTitle": "Number of Pixels"
    },
    "z": {
        "AxisTitle": "z"
    }
}