time,Hardware,Voltage,Current
1621382067324,high-voltage-2,1,0.248327
time,Hardware,Voltage,Current
1621382067324,high-voltage-2,2,0.290997
time,Hardware,Voltage,Current
1621382067324,high-voltage-2,3,0.316435
time,Hardware,Voltage,Current
1621382067324,high-voltage-2,4,0.340149
time,Hardware,Voltage,Current
1621382067324,high-voltage-2,5,0.366871
time,Hardware,Voltage,Current
1621382067324,high-voltage-2,6,0.393457
time,Hardware,Voltage,Current
1621382067324,high-voltage-2,7,0.426114
time,Hardware,Voltage,Current
1621382067324,high-voltage-2,8,0.459421
time,Hardware,Voltage,Current
1621382067324,high-voltage-2,9,0.496052
time,Hardware,Voltage,Current
1621382067324,high-voltage-2,10,0.5319
time,Hardware,Voltage,Current
1621382067324,high-voltage-2,11,0.572057
time,Hardware,Voltage,Current
1621382067324,high-voltage-2,12,0.610862
time,Hardware,Voltage,Current
1621382067324,high-voltage-2,13,0.646491
time,Hardware,Voltage,Current
1621382067324,high-voltage-2,14,0.682302
time,Hardware,Voltage,Current
1621382067324,high-voltage-2,15,0.716261
time,Hardware,Voltage,Current
1621382067324,high-voltage-2,16,0.748819
time,Hardware,Voltage,Current
1621382067324,high-voltage-2,17,0.77419
time,Hardware,Voltage,Current
1621382067324,high-voltage-2,18,0.799134
time,Hardware,Voltage,Current
1621382067324,high-voltage-2,19,0.82319
time,Hardware,Voltage,Current
1621382067324,high-voltage-2,20,0.845852
time,Hardware,Voltage,Current
1621382067324,high-voltage-2,25,0.941365
time,Hardware,Voltage,Current
1621382067324,high-voltage-2,30,1.03412
time,Hardware,Voltage,Current
1621382067324,high-voltage-2,35,1.1244
time,Hardware,Voltage,Current
1621382067324,high-voltage-2,40,1.22789
time,Hardware,Voltage,Current
1621382067324,high-voltage-2,45,1.35407
time,Hardware,Voltage,Current
1621382067324,high-voltage-2,50,1.44473
time,Hardware,Voltage,Current
1621382067324,high-voltage-2,55,1.52624
time,Hardware,Voltage,Current
1621382067324,high-voltage-2,60,1.60234
time,Hardware,Voltage,Current
1621382067324,high-voltage-2,65,1.67532
time,Hardware,Voltage,Current
1621382067324,high-voltage-2,70,1.74668
time,Hardware,Voltage,Current
1621382067324,high-voltage-2,75,1.81718
time,Hardware,Voltage,Current
1621382067324,high-voltage-2,80,1.88398
time,Hardware,Voltage,Current
1621382067324,high-voltage-2,85,1.94945
time,Hardware,Voltage,Current
1621382067324,high-voltage-2,90,2.01223
time,Hardware,Voltage,Current
1621382067324,high-voltage-2,95,2.07354
time,Hardware,Voltage,Current
1621382067324,high-voltage-2,100,2.13536
