{
    "Data": [137.0, 9875.0, 19430.0, 13697.0, 6134.0, 1875.0, 423.0, 141.0, 41.0, 25.0, 29.0, 21.0, 23.0, 23.0, 31.0, 22.0, 15.0, 13.0, 12.0, 3.0, 10.0, 6.0, 2.0, 5.0, 5.0, 1.0, 5.0, 3.0, 1.0, 2.0, 0.0, 0.0, 1.0, 1.0, 1.0, 0.0, 0.0, 0.0, 0.0, 1.0, 0.0, 1.0, 0.0, 0.0, 1.0, 0.0, 0.0, 0.0, 0.0, 0.0, 0.0],
    "Name": "Chi2Dist-0",
    "Overflow": 0.0,
    "Type": "Histo1d",
    "Underflow": 0.0,
    "x": {
        "AxisTitle": "Fit Chi/ndf",
        "Bins": 51,
        "High": 2.5250000953674318,
        "Low": -0.02500000037252903
    },
    "y": {
        "AxisTitle": "Number of Pixels"
    },
    "z": {
        "AxisTitle": "z"
    }
}