{
    "Data": [0.0, 3.0, 11.0, 13.0, 10.0, 6.0, 14.0, 19.0, 16.0, 21.0, 14.0, 19.0, 18.0, 19.0, 28.0, 27.0, 33.0, 35.0, 42.0, 59.0, 53.0, 62.0, 106.0, 127.0, 118.0, 154.0, 154.0, 237.0, 278.0, 303.0, 369.0, 374.0, 509.0, 544.0, 614.0, 672.0, 746.0, 785.0, 958.0, 1024.0, 1253.0, 1595.0, 2095.0, 2832.0, 3488.0, 3893.0, 4093.0, 4153.0, 3870.0, 3380.0, 2791.0, 2121.0, 1498.0, 1094.0, 861.0, 688.0, 539.0, 472.0, 381.0, 370.0, 251.0, 209.0, 214.0, 153.0, 118.0, 100.0, 91.0, 52.0, 68.0, 51.0, 40.0, 37.0, 36.0, 32.0, 27.0, 25.0, 18.0, 17.0, 25.0, 19.0, 26.0, 22.0, 16.0, 15.0, 19.0, 16.0, 9.0, 12.0, 9.0, 10.0, 10.0],
    "Name": "ThresholdDist-0",
    "Overflow": 214.0,
    "Type": "Histo1d",
    "Underflow": 0.0,
    "x": {
        "AxisTitle": "Threshold [e]",
        "Bins": 91,
        "High": 1395.0,
        "Low": 485.0
    },
    "y": {
        "AxisTitle": "Number of Pixels"
    },
    "z": {
        "AxisTitle": "z"
    }
}