time,Hardware,Voltage,Current
1626389253106,high-voltage,1,0.00530343
time,Hardware,Voltage,Current
1626389253106,high-voltage,2,0.0250659
time,Hardware,Voltage,Current
1626389253106,high-voltage,3,0.0354694
time,Hardware,Voltage,Current
1626389253106,high-voltage,4,0.0429366
time,Hardware,Voltage,Current
1626389253106,high-voltage,5,0.048961
time,Hardware,Voltage,Current
1626389253106,high-voltage,6,0.0566601
time,Hardware,Voltage,Current
1626389253106,high-voltage,7,0.0627538
time,Hardware,Voltage,Current
1626389253106,high-voltage,8,0.0700227
time,Hardware,Voltage,Current
1626389253106,high-voltage,9,0.0757708
time,Hardware,Voltage,Current
1626389253106,high-voltage,10,0.082648
time,Hardware,Voltage,Current
1626389253106,high-voltage,11,0.0883868
time,Hardware,Voltage,Current
1626389253106,high-voltage,12,0.0918751
time,Hardware,Voltage,Current
1626389253106,high-voltage,13,0.0967491
time,Hardware,Voltage,Current
1626389253106,high-voltage,14,0.0994722
time,Hardware,Voltage,Current
1626389253106,high-voltage,15,0.103182
time,Hardware,Voltage,Current
1626389253106,high-voltage,16,0.105947
time,Hardware,Voltage,Current
1626389253106,high-voltage,17,0.109104
time,Hardware,Voltage,Current
1626389253106,high-voltage,18,0.112071
time,Hardware,Voltage,Current
1626389253106,high-voltage,19,0.115045
time,Hardware,Voltage,Current
1626389253106,high-voltage,20,0.116524
time,Hardware,Voltage,Current
1626389253106,high-voltage,25,0.130632
time,Hardware,Voltage,Current
1626389253106,high-voltage,30,0.145296
time,Hardware,Voltage,Current
1626389253106,high-voltage,35,0.171998
time,Hardware,Voltage,Current
1626389253106,high-voltage,40,0.255177
time,Hardware,Voltage,Current
1626389253106,high-voltage,45,0.459339
time,Hardware,Voltage,Current
1626389253106,high-voltage,50,0.849544
time,Hardware,Voltage,Current
1626389253106,high-voltage,55,1.51733
time,Hardware,Voltage,Current
1626389253106,high-voltage,60,2.54984
time,Hardware,Voltage,Current
1626389253106,high-voltage,65,4.01468
time,Hardware,Voltage,Current
1626389253106,high-voltage,70,6.01538
time,Hardware,Voltage,Current
1626389253106,high-voltage,75,8.68278
time,Hardware,Voltage,Current
1626389253106,high-voltage,80,10
