{
    "Data": [[3090.0, 1570.0, 927.0, 729.0, 516.0, 460.0, 347.0, 309.0, 240.0, 238.0, 208.0, 175.0, 136.0, 149.0, 131.0, 110.0, 119.0, 91.0, 94.0, 66.0, 63.0, 64.0, 70.0, 58.0, 52.0, 48.0, 44.0, 44.0, 48.0, 32.0, 40.0, 40.0, 28.0, 44.0, 38.0, 32.0, 26.0, 36.0, 35.0, 27.0, 35.0, 30.0, 39.0, 27.0, 28.0, 35.0, 31.0, 27.0, 35.0], [3270.0, 1869.0, 1310.0, 982.0, 791.0, 679.0, 593.0, 474.0, 444.0, 385.0, 334.0, 285.0, 278.0, 230.0, 211.0, 210.0, 191.0, 181.0, 154.0, 154.0, 144.0, 141.0, 129.0, 130.0, 119.0, 119.0, 95.0, 99.0, 91.0, 85.0, 72.0, 79.0, 65.0, 61.0, 61.0, 54.0, 80.0, 63.0, 61.0, 55.0, 61.0, 52.0, 52.0, 45.0, 53.0, 56.0, 68.0, 55.0, 70.0], [2813.0, 1811.0, 1380.0, 1165.0, 901.0, 782.0, 734.0, 606.0, 587.0, 539.0, 526.0, 431.0, 432.0, 423.0, 349.0, 346.0, 314.0, 261.0, 294.0, 250.0, 257.0, 232.0, 247.0, 250.0, 194.0, 199.0, 171.0, 181.0, 171.0, 157.0, 155.0, 159.0, 145.0, 150.0, 153.0, 146.0, 119.0, 119.0, 101.0, 141.0, 118.0, 87.0, 111.0, 110.0, 117.0, 104.0, 102.0, 109.0, 125.0], [2315.0, 1455.0, 1178.0, 982.0, 902.0, 844.0, 745.0, 712.0, 698.0, 609.0, 511.0, 530.0, 515.0, 484.0, 464.0, 437.0, 431.0, 398.0, 363.0, 362.0, 354.0, 350.0, 331.0, 356.0, 311.0, 300.0, 309.0, 312.0, 295.0, 273.0, 277.0, 256.0, 249.0, 232.0, 248.0, 276.0, 238.0, 240.0, 245.0, 215.0, 223.0, 240.0, 234.0, 248.0, 215.0, 217.0, 216.0, 251.0, 255.0], [2104.0, 1229.0, 919.0, 857.0, 674.0, 645.0, 575.0, 561.0, 540.0, 544.0, 514.0, 539.0, 474.0, 491.0, 485.0, 440.0, 445.0, 480.0, 419.0, 473.0, 437.0, 411.0, 449.0, 391.0, 417.0, 416.0, 385.0, 393.0, 380.0, 366.0, 394.0, 402.0, 394.0, 383.0, 360.0, 396.0, 404.0, 387.0, 413.0, 396.0, 353.0, 414.0, 395.0, 423.0, 422.0, 445.0, 467.0, 482.0, 614.0], [3643.0, 1614.0, 1097.0, 765.0, 679.0, 634.0, 515.0, 476.0, 439.0, 434.0, 430.0, 448.0, 387.0, 356.0, 395.0, 397.0, 361.0, 411.0, 408.0, 336.0, 399.0, 426.0, 405.0, 391.0, 412.0, 416.0, 404.0, 434.0, 436.0, 452.0, 430.0, 505.0, 471.0, 488.0, 437.0, 452.0, 478.0, 484.0, 494.0, 492.0, 604.0, 548.0, 603.0, 643.0, 687.0, 737.0, 829.0, 873.0, 1207.0], [4832.0, 2964.0, 2048.0, 1596.0, 1313.0, 1077.0, 945.0, 775.0, 680.0, 595.0, 540.0, 475.0, 482.0, 419.0, 379.0, 402.0, 376.0, 376.0, 354.0, 348.0, 375.0, 384.0, 371.0, 371.0, 334.0, 309.0, 346.0, 328.0, 391.0, 381.0, 422.0, 435.0, 457.0, 502.0, 467.0, 487.0, 524.0, 553.0, 574.0, 586.0, 645.0, 718.0, 744.0, 786.0, 882.0, 912.0, 1173.0, 1471.0, 1977.0], [1961.0, 1668.0, 1560.0, 1451.0, 1351.0, 1288.0, 1269.0, 1243.0, 1120.0, 1093.0, 1017.0, 963.0, 894.0, 837.0, 859.0, 768.0, 795.0, 704.0, 690.0, 670.0, 669.0, 570.0, 645.0, 594.0, 567.0, 555.0, 526.0, 500.0, 489.0, 478.0, 482.0, 479.0, 443.0, 474.0, 508.0, 558.0, 522.0, 550.0, 533.0, 602.0, 641.0, 674.0, 800.0, 890.0, 955.0, 1203.0, 1442.0, 1767.0, 2737.0], [440.0, 320.0, 319.0, 321.0, 337.0, 332.0, 370.0, 379.0, 430.0, 438.0, 481.0, 540.0, 490.0, 523.0, 539.0, 553.0, 597.0, 595.0, 640.0, 643.0, 670.0, 688.0, 724.0, 752.0, 844.0, 792.0, 794.0, 843.0, 884.0, 858.0, 822.0, 883.0, 915.0, 947.0, 921.0, 944.0, 912.0, 972.0, 1042.0, 948.0, 969.0, 1032.0, 1133.0, 1158.0, 1260.0, 1406.0, 1707.0, 2278.0, 3525.0], [336.0, 131.0, 103.0, 76.0, 74.0, 95.0, 73.0, 79.0, 80.0, 65.0, 84.0, 101.0, 94.0, 97.0, 100.0, 102.0, 122.0, 143.0, 135.0, 156.0, 166.0, 182.0, 209.0, 193.0, 245.0, 250.0, 258.0, 294.0, 326.0, 384.0, 419.0, 460.0, 500.0, 516.0, 616.0, 634.0, 726.0, 823.0, 888.0, 1096.0, 1134.0, 1194.0, 1431.0, 1764.0, 1948.0, 2310.0, 2782.0, 3660.0, 5508.0], [348.0, 140.0, 86.0, 73.0, 47.0, 44.0, 43.0, 35.0, 24.0, 39.0, 35.0, 44.0, 26.0, 42.0, 35.0, 48.0, 41.0, 30.0, 41.0, 34.0, 40.0, 53.0, 35.0, 44.0, 54.0, 58.0, 50.0, 62.0, 69.0, 87.0, 85.0, 96.0, 108.0, 139.0, 159.0, 131.0, 202.0, 204.0, 270.0, 298.0, 337.0, 413.0, 548.0, 690.0, 950.0, 1337.0, 1895.0, 3038.0, 6461.0], [360.0, 134.0, 90.0, 50.0, 46.0, 33.0, 41.0, 50.0, 50.0, 39.0, 43.0, 31.0, 26.0, 34.0, 21.0, 18.0, 19.0, 23.0, 19.0, 19.0, 29.0, 31.0, 24.0, 27.0, 22.0, 24.0, 19.0, 33.0, 29.0, 46.0, 29.0, 31.0, 36.0, 46.0, 61.0, 42.0, 70.0, 63.0, 63.0, 108.0, 94.0, 143.0, 169.0, 191.0, 275.0, 386.0, 692.0, 1190.0, 3255.0], [412.0, 117.0, 91.0, 57.0, 47.0, 41.0, 34.0, 35.0, 15.0, 28.0, 24.0, 21.0, 17.0, 17.0, 16.0, 22.0, 16.0, 13.0, 14.0, 12.0, 14.0, 17.0, 30.0, 32.0, 26.0, 24.0, 24.0, 39.0, 22.0, 22.0, 28.0, 27.0, 30.0, 23.0, 21.0, 34.0, 39.0, 42.0, 45.0, 50.0, 56.0, 80.0, 60.0, 96.0, 88.0, 140.0, 236.0, 434.0, 1266.0], [552.0, 143.0, 84.0, 62.0, 42.0, 25.0, 29.0, 22.0, 20.0, 24.0, 12.0, 24.0, 20.0, 17.0, 27.0, 22.0, 16.0, 30.0, 9.0, 15.0, 9.0, 10.0, 9.0, 9.0, 10.0, 11.0, 14.0, 8.0, 15.0, 15.0, 16.0, 21.0, 22.0, 16.0, 20.0, 21.0, 20.0, 24.0, 24.0, 37.0, 35.0, 55.0, 57.0, 67.0, 69.0, 92.0, 114.0, 200.0, 554.0], [979.0, 252.0, 123.0, 56.0, 35.0, 26.0, 23.0, 27.0, 18.0, 21.0, 19.0, 16.0, 20.0, 14.0, 15.0, 13.0, 11.0, 9.0, 8.0, 10.0, 15.0, 18.0, 10.0, 9.0, 11.0, 21.0, 13.0, 14.0, 19.0, 10.0, 17.0, 17.0, 16.0, 12.0, 11.0, 22.0, 13.0, 22.0, 13.0, 24.0, 26.0, 23.0, 31.0, 34.0, 30.0, 53.0, 81.0, 139.0, 314.0], [1775.0, 488.0, 175.0, 91.0, 50.0, 32.0, 30.0, 14.0, 27.0, 20.0, 16.0, 19.0, 10.0, 21.0, 13.0, 19.0, 10.0, 14.0, 8.0, 17.0, 7.0, 8.0, 11.0, 8.0, 4.0, 12.0, 10.0, 6.0, 8.0, 11.0, 9.0, 11.0, 14.0, 11.0, 14.0, 14.0, 20.0, 17.0, 24.0, 28.0, 23.0, 23.0, 34.0, 26.0, 24.0, 41.0, 42.0, 59.0, 187.0], [2862.0, 975.0, 403.0, 235.0, 114.0, 83.0, 52.0, 44.0, 28.0, 19.0, 21.0, 17.0, 15.0, 12.0, 15.0, 11.0, 10.0, 14.0, 6.0, 9.0, 7.0, 7.0, 7.0, 9.0, 7.0, 5.0, 5.0, 9.0, 11.0, 14.0, 5.0, 14.0, 18.0, 13.0, 9.0, 8.0, 14.0, 11.0, 15.0, 19.0, 28.0, 16.0, 18.0, 23.0, 35.0, 42.0, 46.0, 56.0, 108.0], [4013.0, 1728.0, 932.0, 472.0, 257.0, 140.0, 125.0, 85.0, 75.0, 47.0, 32.0, 30.0, 27.0, 20.0, 21.0, 18.0, 13.0, 10.0, 11.0, 10.0, 18.0, 12.0, 12.0, 10.0, 12.0, 14.0, 5.0, 7.0, 6.0, 4.0, 9.0, 9.0, 6.0, 11.0, 10.0, 17.0, 10.0, 11.0, 16.0, 19.0, 16.0, 13.0, 17.0, 17.0, 21.0, 21.0, 44.0, 46.0, 81.0], [4836.0, 2512.0, 1575.0, 926.0, 637.0, 400.0, 313.0, 218.0, 151.0, 108.0, 78.0, 57.0, 49.0, 45.0, 20.0, 29.0, 20.0, 25.0, 21.0, 14.0, 16.0, 16.0, 18.0, 8.0, 14.0, 12.0, 9.0, 13.0, 11.0, 10.0, 2.0, 9.0, 7.0, 9.0, 8.0, 11.0, 8.0, 11.0, 9.0, 11.0, 18.0, 20.0, 19.0, 28.0, 24.0, 23.0, 28.0, 45.0, 65.0], [4720.0, 3051.0, 2128.0, 1531.0, 1106.0, 823.0, 563.0, 471.0, 338.0, 286.0, 252.0, 170.0, 133.0, 110.0, 88.0, 61.0, 60.0, 33.0, 33.0, 30.0, 28.0, 25.0, 18.0, 22.0, 21.0, 14.0, 11.0, 7.0, 12.0, 12.0, 12.0, 7.0, 12.0, 15.0, 16.0, 17.0, 12.0, 20.0, 13.0, 18.0, 11.0, 22.0, 16.0, 15.0, 17.0, 29.0, 18.0, 29.0, 59.0], [3852.0, 3043.0, 2389.0, 1874.0, 1543.0, 1285.0, 1028.0, 861.0, 703.0, 583.0, 432.0, 368.0, 295.0, 283.0, 223.0, 186.0, 150.0, 127.0, 116.0, 93.0, 64.0, 53.0, 55.0, 55.0, 32.0, 39.0, 39.0, 25.0, 22.0, 19.0, 14.0, 14.0, 21.0, 16.0, 15.0, 12.0, 14.0, 20.0, 10.0, 13.0, 16.0, 15.0, 20.0, 20.0, 25.0, 15.0, 20.0, 33.0, 34.0], [2820.0, 2402.0, 2090.0, 1876.0, 1629.0, 1440.0, 1321.0, 1132.0, 990.0, 852.0, 750.0, 709.0, 583.0, 486.0, 473.0, 363.0, 297.0, 288.0, 257.0, 208.0, 174.0, 158.0, 148.0, 139.0, 98.0, 95.0, 71.0, 62.0, 61.0, 44.0, 47.0, 42.0, 37.0, 25.0, 32.0, 23.0, 20.0, 21.0, 11.0, 19.0, 16.0, 19.0, 17.0, 17.0, 20.0, 20.0, 33.0, 26.0, 47.0], [1766.0, 1654.0, 1601.0, 1522.0, 1399.0, 1426.0, 1329.0, 1175.0, 1131.0, 1081.0, 975.0, 882.0, 794.0, 772.0, 672.0, 630.0, 612.0, 489.0, 481.0, 398.0, 387.0, 341.0, 335.0, 265.0, 261.0, 259.0, 189.0, 190.0, 146.0, 134.0, 112.0, 120.0, 90.0, 73.0, 69.0, 68.0, 55.0, 45.0, 38.0, 44.0, 43.0, 28.0, 34.0, 24.0, 20.0, 14.0, 25.0, 39.0, 51.0], [988.0, 926.0, 984.0, 1024.0, 1039.0, 1020.0, 1054.0, 1059.0, 1044.0, 1015.0, 984.0, 941.0, 971.0, 854.0, 798.0, 752.0, 787.0, 723.0, 672.0, 637.0, 622.0, 563.0, 507.0, 499.0, 465.0, 396.0, 403.0, 386.0, 340.0, 311.0, 281.0, 230.0, 219.0, 233.0, 196.0, 162.0, 157.0, 122.0, 115.0, 96.0, 88.0, 81.0, 64.0, 56.0, 51.0, 52.0, 42.0, 41.0, 44.0], [583.0, 496.0, 567.0, 562.0, 633.0, 686.0, 705.0, 705.0, 726.0, 730.0, 798.0, 796.0, 822.0, 838.0, 823.0, 808.0, 818.0, 783.0, 781.0, 772.0, 697.0, 732.0, 699.0, 633.0, 595.0, 639.0, 573.0, 545.0, 538.0, 540.0, 485.0, 464.0, 417.0, 388.0, 387.0, 367.0, 312.0, 271.0, 285.0, 238.0, 226.0, 189.0, 175.0, 177.0, 135.0, 108.0, 82.0, 85.0, 78.0], [393.0, 284.0, 256.0, 269.0, 343.0, 364.0, 397.0, 419.0, 440.0, 492.0, 529.0, 537.0, 550.0, 603.0, 633.0, 643.0, 694.0, 688.0, 677.0, 704.0, 718.0, 761.0, 728.0, 716.0, 665.0, 732.0, 649.0, 696.0, 686.0, 682.0, 668.0, 669.0, 622.0, 610.0, 565.0, 595.0, 519.0, 508.0, 470.0, 513.0, 445.0, 436.0, 422.0, 369.0, 323.0, 291.0, 202.0, 209.0, 184.0], [268.0, 161.0, 145.0, 158.0, 162.0, 180.0, 184.0, 223.0, 219.0, 260.0, 315.0, 305.0, 323.0, 364.0, 377.0, 370.0, 420.0, 481.0, 494.0, 500.0, 582.0, 544.0, 597.0, 622.0, 643.0, 650.0, 679.0, 694.0, 734.0, 706.0, 720.0, 736.0, 783.0, 778.0, 784.0, 787.0, 713.0, 735.0, 719.0, 760.0, 748.0, 715.0, 672.0, 659.0, 623.0, 604.0, 521.0, 508.0, 435.0], [264.0, 121.0, 80.0, 76.0, 72.0, 86.0, 91.0, 108.0, 131.0, 132.0, 127.0, 167.0, 145.0, 201.0, 182.0, 222.0, 238.0, 263.0, 281.0, 309.0, 337.0, 409.0, 389.0, 417.0, 446.0, 514.0, 550.0, 553.0, 567.0, 600.0, 683.0, 680.0, 732.0, 728.0, 776.0, 784.0, 817.0, 884.0, 838.0, 966.0, 974.0, 939.0, 984.0, 972.0, 978.0, 1029.0, 1011.0, 930.0, 970.0], [236.0, 100.0, 70.0, 44.0, 57.0, 39.0, 46.0, 49.0, 47.0, 52.0, 57.0, 81.0, 70.0, 91.0, 100.0, 103.0, 125.0, 140.0, 145.0, 181.0, 174.0, 209.0, 232.0, 240.0, 255.0, 284.0, 326.0, 345.0, 363.0, 397.0, 502.0, 531.0, 532.0, 605.0, 686.0, 704.0, 704.0, 821.0, 896.0, 959.0, 1020.0, 1092.0, 1148.0, 1263.0, 1270.0, 1423.0, 1454.0, 1502.0, 1763.0], [246.0, 95.0, 63.0, 39.0, 35.0, 24.0, 31.0, 33.0, 29.0, 28.0, 28.0, 29.0, 30.0, 31.0, 45.0, 59.0, 48.0, 70.0, 82.0, 66.0, 68.0, 96.0, 89.0, 136.0, 157.0, 139.0, 163.0, 218.0, 213.0, 233.0, 292.0, 317.0, 337.0, 431.0, 407.0, 466.0, 576.0, 622.0, 695.0, 809.0, 920.0, 1034.0, 1103.0, 1260.0, 1422.0, 1596.0, 1839.0, 2142.0, 2662.0], [259.0, 92.0, 68.0, 39.0, 27.0, 19.0, 26.0, 19.0, 23.0, 15.0, 24.0, 18.0, 19.0, 14.0, 18.0, 24.0, 17.0, 20.0, 28.0, 37.0, 37.0, 50.0, 58.0, 51.0, 60.0, 59.0, 78.0, 97.0, 108.0, 131.0, 143.0, 157.0, 190.0, 216.0, 250.0, 271.0, 354.0, 395.0, 478.0, 533.0, 638.0, 746.0, 867.0, 1027.0, 1264.0, 1631.0, 1981.0, 2504.0, 3509.0], [248.0, 104.0, 58.0, 46.0, 27.0, 22.0, 17.0, 23.0, 15.0, 18.0, 21.0, 12.0, 12.0, 16.0, 14.0, 15.0, 10.0, 11.0, 16.0, 19.0, 5.0, 17.0, 19.0, 20.0, 28.0, 26.0, 49.0, 29.0, 57.0, 73.0, 61.0, 84.0, 76.0, 107.0, 122.0, 135.0, 192.0, 220.0, 243.0, 330.0, 396.0, 483.0, 574.0, 795.0, 993.0, 1293.0, 1782.0, 2527.0, 3885.0], [232.0, 99.0, 45.0, 51.0, 31.0, 28.0, 22.0, 20.0, 17.0, 12.0, 13.0, 15.0, 11.0, 12.0, 8.0, 12.0, 12.0, 11.0, 9.0, 14.0, 12.0, 4.0, 9.0, 11.0, 10.0, 9.0, 12.0, 15.0, 30.0, 27.0, 33.0, 30.0, 42.0, 50.0, 51.0, 69.0, 63.0, 108.0, 124.0, 153.0, 227.0, 275.0, 327.0, 465.0, 596.0, 924.0, 1335.0, 2083.0, 3814.0], [230.0, 102.0, 57.0, 40.0, 27.0, 21.0, 22.0, 25.0, 12.0, 16.0, 12.0, 12.0, 10.0, 20.0, 8.0, 13.0, 10.0, 11.0, 13.0, 13.0, 9.0, 5.0, 3.0, 5.0, 4.0, 4.0, 6.0, 9.0, 10.0, 10.0, 10.0, 16.0, 14.0, 16.0, 23.0, 27.0, 39.0, 40.0, 57.0, 79.0, 88.0, 144.0, 175.0, 224.0, 364.0, 499.0, 891.0, 1563.0, 3239.0], [244.0, 93.0, 56.0, 41.0, 41.0, 23.0, 29.0, 21.0, 17.0, 16.0, 12.0, 13.0, 11.0, 9.0, 8.0, 12.0, 8.0, 12.0, 9.0, 8.0, 5.0, 5.0, 9.0, 4.0, 7.0, 3.0, 7.0, 6.0, 7.0, 3.0, 10.0, 7.0, 9.0, 11.0, 15.0, 20.0, 16.0, 23.0, 16.0, 27.0, 38.0, 80.0, 73.0, 124.0, 172.0, 285.0, 514.0, 955.0, 2446.0], [231.0, 85.0, 66.0, 31.0, 29.0, 17.0, 31.0, 22.0, 20.0, 9.0, 16.0, 19.0, 17.0, 13.0, 7.0, 9.0, 9.0, 9.0, 8.0, 6.0, 4.0, 7.0, 3.0, 6.0, 3.0, 5.0, 6.0, 10.0, 4.0, 6.0, 10.0, 8.0, 9.0, 7.0, 6.0, 4.0, 10.0, 10.0, 15.0, 24.0, 17.0, 22.0, 36.0, 52.0, 81.0, 148.0, 270.0, 544.0, 1592.0], [247.0, 92.0, 63.0, 34.0, 37.0, 22.0, 27.0, 18.0, 13.0, 9.0, 12.0, 21.0, 11.0, 16.0, 13.0, 7.0, 15.0, 6.0, 8.0, 6.0, 5.0, 4.0, 9.0, 3.0, 5.0, 9.0, 9.0, 2.0, 5.0, 4.0, 5.0, 8.0, 7.0, 9.0, 9.0, 12.0, 6.0, 7.0, 11.0, 11.0, 12.0, 16.0, 23.0, 20.0, 33.0, 68.0, 134.0, 288.0, 1005.0], [255.0, 87.0, 64.0, 45.0, 33.0, 31.0, 17.0, 17.0, 18.0, 15.0, 12.0, 12.0, 14.0, 9.0, 13.0, 12.0, 9.0, 5.0, 8.0, 8.0, 6.0, 5.0, 7.0, 4.0, 4.0, 6.0, 7.0, 3.0, 7.0, 11.0, 0.0, 3.0, 6.0, 10.0, 7.0, 8.0, 11.0, 9.0, 13.0, 9.0, 14.0, 14.0, 14.0, 12.0, 23.0, 38.0, 51.0, 153.0, 555.0], [272.0, 104.0, 50.0, 52.0, 26.0, 18.0, 23.0, 18.0, 13.0, 13.0, 17.0, 13.0, 17.0, 13.0, 12.0, 5.0, 13.0, 7.0, 8.0, 6.0, 7.0, 4.0, 11.0, 6.0, 4.0, 5.0, 10.0, 5.0, 10.0, 6.0, 4.0, 6.0, 6.0, 6.0, 6.0, 7.0, 6.0, 7.0, 8.0, 10.0, 12.0, 9.0, 13.0, 11.0, 16.0, 28.0, 37.0, 70.0, 308.0], [254.0, 91.0, 63.0, 40.0, 30.0, 28.0, 20.0, 18.0, 13.0, 22.0, 13.0, 14.0, 10.0, 11.0, 5.0, 4.0, 14.0, 10.0, 2.0, 14.0, 5.0, 8.0, 11.0, 8.0, 4.0, 7.0, 5.0, 7.0, 5.0, 5.0, 7.0, 3.0, 1.0, 6.0, 7.0, 10.0, 7.0, 11.0, 11.0, 14.0, 11.0, 15.0, 7.0, 9.0, 11.0, 17.0, 26.0, 29.0, 139.0], [253.0, 76.0, 62.0, 39.0, 31.0, 22.0, 27.0, 16.0, 7.0, 19.0, 13.0, 21.0, 12.0, 9.0, 18.0, 5.0, 8.0, 12.0, 11.0, 7.0, 8.0, 6.0, 6.0, 7.0, 3.0, 2.0, 4.0, 4.0, 4.0, 4.0, 4.0, 4.0, 2.0, 10.0, 6.0, 8.0, 9.0, 12.0, 8.0, 8.0, 13.0, 13.0, 13.0, 19.0, 13.0, 18.0, 13.0, 28.0, 80.0], [241.0, 79.0, 51.0, 32.0, 40.0, 22.0, 25.0, 15.0, 16.0, 13.0, 11.0, 15.0, 10.0, 13.0, 10.0, 13.0, 12.0, 6.0, 7.0, 11.0, 8.0, 11.0, 3.0, 6.0, 5.0, 3.0, 8.0, 1.0, 6.0, 3.0, 7.0, 6.0, 11.0, 13.0, 4.0, 6.0, 8.0, 4.0, 14.0, 10.0, 15.0, 12.0, 10.0, 15.0, 12.0, 16.0, 13.0, 24.0, 43.0], [221.0, 115.0, 44.0, 50.0, 24.0, 23.0, 25.0, 22.0, 15.0, 8.0, 20.0, 11.0, 15.0, 12.0, 18.0, 9.0, 9.0, 4.0, 9.0, 7.0, 6.0, 8.0, 8.0, 5.0, 4.0, 2.0, 6.0, 4.0, 5.0, 3.0, 7.0, 5.0, 6.0, 6.0, 9.0, 1.0, 10.0, 12.0, 4.0, 10.0, 9.0, 15.0, 16.0, 13.0, 16.0, 14.0, 19.0, 17.0, 27.0], [270.0, 96.0, 49.0, 38.0, 32.0, 19.0, 28.0, 17.0, 13.0, 19.0, 15.0, 13.0, 20.0, 16.0, 9.0, 9.0, 16.0, 5.0, 10.0, 7.0, 5.0, 3.0, 11.0, 3.0, 4.0, 6.0, 1.0, 6.0, 5.0, 4.0, 6.0, 4.0, 3.0, 5.0, 10.0, 11.0, 8.0, 11.0, 7.0, 13.0, 11.0, 11.0, 11.0, 8.0, 15.0, 13.0, 21.0, 23.0, 26.0], [213.0, 99.0, 59.0, 41.0, 26.0, 26.0, 22.0, 25.0, 17.0, 11.0, 15.0, 18.0, 12.0, 12.0, 11.0, 7.0, 13.0, 7.0, 6.0, 8.0, 7.0, 5.0, 13.0, 6.0, 6.0, 3.0, 6.0, 5.0, 2.0, 6.0, 8.0, 3.0, 6.0, 5.0, 6.0, 9.0, 9.0, 10.0, 8.0, 8.0, 11.0, 7.0, 7.0, 13.0, 10.0, 12.0, 18.0, 17.0, 25.0], [266.0, 73.0, 57.0, 46.0, 30.0, 36.0, 13.0, 12.0, 15.0, 15.0, 17.0, 19.0, 9.0, 9.0, 19.0, 11.0, 12.0, 8.0, 6.0, 6.0, 3.0, 2.0, 4.0, 3.0, 8.0, 5.0, 3.0, 10.0, 3.0, 6.0, 5.0, 7.0, 8.0, 7.0, 11.0, 8.0, 6.0, 7.0, 4.0, 17.0, 8.0, 10.0, 11.0, 10.0, 16.0, 14.0, 8.0, 22.0, 23.0], [269.0, 83.0, 53.0, 41.0, 28.0, 24.0, 22.0, 20.0, 17.0, 18.0, 12.0, 16.0, 10.0, 14.0, 8.0, 8.0, 9.0, 9.0, 8.0, 6.0, 6.0, 6.0, 7.0, 3.0, 6.0, 5.0, 2.0, 7.0, 7.0, 5.0, 4.0, 6.0, 2.0, 9.0, 5.0, 9.0, 6.0, 14.0, 6.0, 9.0, 11.0, 11.0, 7.0, 10.0, 11.0, 9.0, 14.0, 15.0, 24.0], [242.0, 90.0, 67.0, 34.0, 32.0, 29.0, 16.0, 21.0, 14.0, 19.0, 14.0, 11.0, 11.0, 9.0, 11.0, 11.0, 11.0, 7.0, 6.0, 6.0, 8.0, 7.0, 8.0, 4.0, 5.0, 4.0, 6.0, 7.0, 7.0, 5.0, 3.0, 3.0, 5.0, 7.0, 3.0, 10.0, 6.0, 9.0, 13.0, 8.0, 10.0, 18.0, 8.0, 15.0, 12.0, 10.0, 11.0, 17.0, 15.0], [248.0, 113.0, 57.0, 45.0, 33.0, 23.0, 13.0, 17.0, 17.0, 14.0, 12.0, 16.0, 10.0, 16.0, 10.0, 10.0, 14.0, 8.0, 7.0, 6.0, 9.0, 2.0, 6.0, 4.0, 3.0, 9.0, 3.0, 5.0, 7.0, 4.0, 9.0, 9.0, 3.0, 1.0, 10.0, 6.0, 9.0, 7.0, 2.0, 10.0, 9.0, 11.0, 13.0, 18.0, 15.0, 20.0, 15.0, 17.0, 20.0], [268.0, 99.0, 53.0, 35.0, 28.0, 25.0, 20.0, 19.0, 15.0, 16.0, 23.0, 18.0, 9.0, 13.0, 11.0, 13.0, 12.0, 9.0, 8.0, 6.0, 2.0, 6.0, 4.0, 6.0, 3.0, 4.0, 9.0, 4.0, 6.0, 6.0, 7.0, 3.0, 11.0, 3.0, 7.0, 7.0, 7.0, 9.0, 7.0, 9.0, 14.0, 11.0, 10.0, 10.0, 13.0, 9.0, 12.0, 21.0, 31.0], [229.0, 95.0, 51.0, 36.0, 31.0, 27.0, 22.0, 19.0, 22.0, 15.0, 19.0, 20.0, 9.0, 4.0, 7.0, 11.0, 13.0, 9.0, 12.0, 10.0, 8.0, 3.0, 4.0, 5.0, 8.0, 5.0, 3.0, 5.0, 6.0, 3.0, 8.0, 7.0, 5.0, 5.0, 5.0, 12.0, 7.0, 9.0, 5.0, 9.0, 8.0, 10.0, 9.0, 13.0, 10.0, 15.0, 18.0, 21.0, 15.0]],
    "Name": "sCurve-0",
    "Overflow": 2704064.0,
    "Type": "Histo2d",
    "Underflow": 0.0,
    "x": {
        "AxisTitle": "Vcal",
        "Bins": 51,
        "High": 302.5,
        "Low": 47.5
    },
    "y": {
        "AxisTitle": "Occupancy",
        "Bins": 49,
        "High": 49.5,
        "Low": 0.5
    },
    "z": {
        "AxisTitle": "Number of pixels"
    }
}