time,Hardware,Voltage,Current
1623358097969,high-voltage,1,0.0261237
time,Hardware,Voltage,Current
1623358097969,high-voltage,2,0.0328162
time,Hardware,Voltage,Current
1623358097969,high-voltage,3,0.0386252
time,Hardware,Voltage,Current
1623358097969,high-voltage,4,0.0428815
time,Hardware,Voltage,Current
1623358097969,high-voltage,5,0.0471225
time,Hardware,Voltage,Current
1623358097969,high-voltage,6,0.0517075
time,Hardware,Voltage,Current
1623358097969,high-voltage,7,0.055623
time,Hardware,Voltage,Current
1623358097969,high-voltage,8,0.0601929
time,Hardware,Voltage,Current
1623358097969,high-voltage,9,0.0643269
time,Hardware,Voltage,Current
1623358097969,high-voltage,10,0.0692723
time,Hardware,Voltage,Current
1623358097969,high-voltage,11,0.0747717
time,Hardware,Voltage,Current
1623358097969,high-voltage,12,0.0794938
time,Hardware,Voltage,Current
1623358097969,high-voltage,13,0.0848966
time,Hardware,Voltage,Current
1623358097969,high-voltage,14,0.0882658
time,Hardware,Voltage,Current
1623358097969,high-voltage,15,0.0924371
time,Hardware,Voltage,Current
1623358097969,high-voltage,16,0.0962073
time,Hardware,Voltage,Current
1623358097969,high-voltage,17,0.0982541
time,Hardware,Voltage,Current
1623358097969,high-voltage,18,0.1013
time,Hardware,Voltage,Current
1623358097969,high-voltage,19,0.10528
time,Hardware,Voltage,Current
1623358097969,high-voltage,20,0.107733
time,Hardware,Voltage,Current
1623358097969,high-voltage,25,0.119304
time,Hardware,Voltage,Current
1623358097969,high-voltage,30,0.133388
time,Hardware,Voltage,Current
1623358097969,high-voltage,35,0.158924
time,Hardware,Voltage,Current
1623358097969,high-voltage,40,0.256501
time,Hardware,Voltage,Current
1623358097969,high-voltage,5.38764e-07,0.54033
time,Hardware,Voltage,Current
1623358097969,high-voltage,50,1.01153
time,Hardware,Voltage,Current
1623358097969,high-voltage,55,1.65546
time,Hardware,Voltage,Current
1623358097969,high-voltage,60,2.4529
time,Hardware,Voltage,Current
1623358097969,high-voltage,65,3.41108
time,Hardware,Voltage,Current
1623358097969,high-voltage,70,4.45779
time,Hardware,Voltage,Current
1623358097969,high-voltage,75,5.72269
time,Hardware,Voltage,Current
1623358097969,high-voltage,80,7.04461
time,Hardware,Voltage,Current
1623358097969,high-voltage,85,8.54911
time,Hardware,Voltage,Current
1623358097969,high-voltage,90,10
