{
    "Data": [[636.0, 173.0, 107.0, 63.0, 30.0, 25.0, 25.0, 11.0, 15.0, 9.0, 14.0, 7.0, 4.0, 7.0, 3.0, 5.0, 5.0, 1.0, 4.0, 9.0, 7.0, 3.0, 5.0, 8.0, 8.0, 4.0, 9.0, 8.0, 4.0, 11.0, 6.0, 2.0, 1.0, 6.0, 5.0, 8.0, 6.0, 5.0, 7.0, 5.0, 3.0, 5.0, 2.0, 5.0, 3.0, 6.0, 5.0, 3.0, 4.0], [1076.0, 306.0, 140.0, 85.0, 69.0, 46.0, 33.0, 26.0, 21.0, 11.0, 11.0, 11.0, 9.0, 13.0, 3.0, 7.0, 5.0, 6.0, 7.0, 4.0, 4.0, 2.0, 5.0, 4.0, 10.0, 7.0, 7.0, 7.0, 8.0, 4.0, 3.0, 7.0, 4.0, 7.0, 7.0, 5.0, 6.0, 5.0, 6.0, 5.0, 6.0, 8.0, 3.0, 6.0, 7.0, 6.0, 4.0, 1.0, 4.0], [1916.0, 545.0, 288.0, 182.0, 109.0, 69.0, 57.0, 45.0, 34.0, 35.0, 20.0, 24.0, 15.0, 18.0, 12.0, 9.0, 9.0, 5.0, 8.0, 6.0, 5.0, 3.0, 7.0, 4.0, 9.0, 8.0, 5.0, 6.0, 8.0, 5.0, 5.0, 5.0, 4.0, 5.0, 5.0, 5.0, 8.0, 3.0, 8.0, 9.0, 9.0, 10.0, 6.0, 6.0, 10.0, 14.0, 7.0, 7.0, 6.0], [3218.0, 1106.0, 550.0, 324.0, 201.0, 175.0, 122.0, 83.0, 73.0, 48.0, 49.0, 39.0, 34.0, 24.0, 27.0, 22.0, 32.0, 17.0, 15.0, 9.0, 8.0, 19.0, 12.0, 10.0, 10.0, 7.0, 13.0, 11.0, 10.0, 5.0, 6.0, 4.0, 4.0, 5.0, 6.0, 10.0, 3.0, 5.0, 6.0, 5.0, 5.0, 7.0, 6.0, 11.0, 12.0, 9.0, 10.0, 12.0, 17.0], [5079.0, 1924.0, 1043.0, 681.0, 488.0, 356.0, 293.0, 221.0, 164.0, 129.0, 91.0, 81.0, 82.0, 62.0, 47.0, 45.0, 38.0, 35.0, 24.0, 33.0, 23.0, 23.0, 27.0, 23.0, 14.0, 20.0, 18.0, 15.0, 14.0, 14.0, 11.0, 10.0, 14.0, 10.0, 9.0, 16.0, 13.0, 10.0, 8.0, 6.0, 4.0, 10.0, 7.0, 5.0, 13.0, 7.0, 17.0, 21.0, 21.0], [8727.0, 3733.0, 2060.0, 1365.0, 969.0, 718.0, 547.0, 387.0, 355.0, 306.0, 267.0, 221.0, 185.0, 154.0, 133.0, 123.0, 110.0, 84.0, 69.0, 63.0, 77.0, 58.0, 51.0, 43.0, 47.0, 39.0, 27.0, 27.0, 28.0, 25.0, 23.0, 26.0, 29.0, 28.0, 20.0, 10.0, 9.0, 16.0, 19.0, 11.0, 13.0, 17.0, 14.0, 12.0, 11.0, 15.0, 13.0, 24.0, 29.0], [9601.0, 6800.0, 4843.0, 3558.0, 2526.0, 1853.0, 1496.0, 1068.0, 904.0, 752.0, 547.0, 477.0, 424.0, 367.0, 325.0, 289.0, 235.0, 243.0, 226.0, 164.0, 161.0, 140.0, 136.0, 116.0, 110.0, 103.0, 89.0, 91.0, 69.0, 71.0, 63.0, 48.0, 43.0, 35.0, 31.0, 41.0, 40.0, 42.0, 27.0, 35.0, 30.0, 34.0, 22.0, 21.0, 34.0, 32.0, 31.0, 19.0, 35.0], [3746.0, 3485.0, 3496.0, 3461.0, 3285.0, 3165.0, 2933.0, 2743.0, 2451.0, 2227.0, 2036.0, 1828.0, 1586.0, 1347.0, 1257.0, 1081.0, 930.0, 775.0, 729.0, 601.0, 544.0, 462.0, 418.0, 331.0, 314.0, 308.0, 242.0, 241.0, 212.0, 173.0, 141.0, 156.0, 141.0, 127.0, 113.0, 105.0, 97.0, 89.0, 68.0, 84.0, 66.0, 61.0, 68.0, 50.0, 55.0, 57.0, 42.0, 52.0, 63.0], [1388.0, 1239.0, 1240.0, 1198.0, 1209.0, 1223.0, 1283.0, 1292.0, 1354.0, 1424.0, 1510.0, 1521.0, 1570.0, 1652.0, 1710.0, 1677.0, 1703.0, 1733.0, 1713.0, 1664.0, 1638.0, 1613.0, 1600.0, 1486.0, 1420.0, 1353.0, 1260.0, 1170.0, 1117.0, 1053.0, 969.0, 883.0, 764.0, 645.0, 610.0, 512.0, 501.0, 404.0, 396.0, 303.0, 245.0, 245.0, 186.0, 145.0, 136.0, 121.0, 137.0, 116.0, 128.0], [640.0, 621.0, 557.0, 592.0, 544.0, 574.0, 619.0, 592.0, 662.0, 625.0, 662.0, 677.0, 676.0, 661.0, 714.0, 748.0, 731.0, 804.0, 822.0, 821.0, 876.0, 892.0, 1016.0, 1011.0, 1035.0, 1117.0, 1239.0, 1261.0, 1362.0, 1421.0, 1385.0, 1531.0, 1571.0, 1602.0, 1683.0, 1635.0, 1699.0, 1674.0, 1660.0, 1712.0, 1598.0, 1556.0, 1485.0, 1333.0, 1247.0, 981.0, 825.0, 683.0, 518.0], [372.0, 259.0, 255.0, 261.0, 296.0, 261.0, 307.0, 302.0, 314.0, 318.0, 362.0, 378.0, 375.0, 385.0, 428.0, 444.0, 432.0, 460.0, 479.0, 506.0, 483.0, 555.0, 547.0, 538.0, 589.0, 614.0, 591.0, 647.0, 675.0, 709.0, 679.0, 757.0, 819.0, 875.0, 937.0, 1035.0, 1070.0, 1230.0, 1351.0, 1453.0, 1648.0, 1885.0, 2048.0, 2405.0, 2750.0, 3085.0, 3428.0, 3713.0, 3928.0], [292.0, 190.0, 116.0, 120.0, 115.0, 113.0, 112.0, 141.0, 147.0, 145.0, 155.0, 158.0, 207.0, 201.0, 218.0, 222.0, 255.0, 230.0, 277.0, 320.0, 300.0, 323.0, 335.0, 358.0, 379.0, 411.0, 442.0, 451.0, 466.0, 521.0, 521.0, 529.0, 623.0, 635.0, 664.0, 681.0, 717.0, 735.0, 804.0, 882.0, 1015.0, 1115.0, 1266.0, 1450.0, 1640.0, 2184.0, 2957.0, 4270.0, 7238.0], [260.0, 119.0, 90.0, 77.0, 66.0, 86.0, 42.0, 48.0, 58.0, 67.0, 72.0, 62.0, 65.0, 87.0, 88.0, 90.0, 109.0, 115.0, 106.0, 140.0, 167.0, 152.0, 166.0, 225.0, 173.0, 206.0, 245.0, 248.0, 292.0, 311.0, 360.0, 361.0, 386.0, 391.0, 454.0, 528.0, 589.0, 578.0, 673.0, 791.0, 772.0, 899.0, 968.0, 1163.0, 1344.0, 1584.0, 1999.0, 2895.0, 5640.0], [263.0, 85.0, 80.0, 52.0, 43.0, 47.0, 37.0, 35.0, 30.0, 34.0, 36.0, 34.0, 32.0, 27.0, 38.0, 44.0, 40.0, 47.0, 67.0, 54.0, 46.0, 71.0, 67.0, 77.0, 87.0, 96.0, 95.0, 132.0, 134.0, 159.0, 160.0, 198.0, 191.0, 227.0, 255.0, 266.0, 341.0, 396.0, 398.0, 493.0, 551.0, 634.0, 752.0, 966.0, 1099.0, 1394.0, 1874.0, 2610.0, 4454.0], [247.0, 82.0, 53.0, 41.0, 43.0, 37.0, 19.0, 24.0, 25.0, 27.0, 22.0, 27.0, 17.0, 15.0, 36.0, 14.0, 23.0, 20.0, 26.0, 33.0, 23.0, 31.0, 33.0, 44.0, 33.0, 39.0, 39.0, 47.0, 38.0, 57.0, 60.0, 64.0, 100.0, 99.0, 105.0, 115.0, 127.0, 169.0, 234.0, 240.0, 277.0, 368.0, 444.0, 543.0, 769.0, 1028.0, 1418.0, 2191.0, 4140.0], [217.0, 81.0, 63.0, 45.0, 30.0, 30.0, 27.0, 20.0, 14.0, 18.0, 20.0, 16.0, 17.0, 10.0, 18.0, 11.0, 16.0, 19.0, 16.0, 21.0, 23.0, 11.0, 11.0, 11.0, 19.0, 18.0, 22.0, 23.0, 26.0, 35.0, 31.0, 40.0, 46.0, 45.0, 52.0, 49.0, 55.0, 61.0, 101.0, 102.0, 119.0, 151.0, 202.0, 258.0, 431.0, 557.0, 935.0, 1508.0, 3397.0], [212.0, 86.0, 42.0, 43.0, 24.0, 22.0, 22.0, 20.0, 16.0, 19.0, 18.0, 16.0, 11.0, 11.0, 12.0, 15.0, 10.0, 10.0, 16.0, 15.0, 9.0, 9.0, 12.0, 13.0, 8.0, 15.0, 15.0, 13.0, 20.0, 21.0, 16.0, 22.0, 25.0, 33.0, 19.0, 29.0, 35.0, 35.0, 38.0, 44.0, 52.0, 68.0, 98.0, 117.0, 159.0, 279.0, 415.0, 890.0, 2275.0], [183.0, 84.0, 51.0, 41.0, 32.0, 26.0, 26.0, 12.0, 14.0, 17.0, 7.0, 8.0, 10.0, 9.0, 9.0, 14.0, 8.0, 7.0, 8.0, 10.0, 12.0, 8.0, 9.0, 14.0, 15.0, 14.0, 14.0, 10.0, 11.0, 10.0, 7.0, 18.0, 19.0, 16.0, 18.0, 13.0, 25.0, 18.0, 14.0, 26.0, 29.0, 39.0, 40.0, 57.0, 91.0, 115.0, 197.0, 434.0, 1362.0], [187.0, 69.0, 56.0, 32.0, 25.0, 23.0, 17.0, 17.0, 14.0, 17.0, 9.0, 14.0, 8.0, 4.0, 9.0, 10.0, 6.0, 9.0, 7.0, 6.0, 6.0, 5.0, 3.0, 12.0, 11.0, 11.0, 9.0, 11.0, 13.0, 17.0, 14.0, 18.0, 15.0, 15.0, 10.0, 9.0, 9.0, 11.0, 10.0, 17.0, 23.0, 19.0, 24.0, 36.0, 49.0, 62.0, 95.0, 205.0, 721.0], [168.0, 68.0, 51.0, 43.0, 25.0, 13.0, 13.0, 15.0, 8.0, 15.0, 9.0, 11.0, 5.0, 11.0, 8.0, 10.0, 2.0, 10.0, 3.0, 12.0, 6.0, 8.0, 9.0, 7.0, 12.0, 10.0, 2.0, 5.0, 7.0, 14.0, 9.0, 10.0, 9.0, 3.0, 10.0, 12.0, 8.0, 15.0, 18.0, 22.0, 15.0, 18.0, 15.0, 18.0, 34.0, 38.0, 65.0, 117.0, 350.0], [174.0, 66.0, 40.0, 25.0, 25.0, 20.0, 15.0, 18.0, 9.0, 8.0, 6.0, 6.0, 8.0, 4.0, 7.0, 9.0, 11.0, 6.0, 5.0, 5.0, 3.0, 4.0, 7.0, 4.0, 4.0, 10.0, 9.0, 8.0, 8.0, 8.0, 11.0, 8.0, 9.0, 9.0, 9.0, 7.0, 15.0, 7.0, 6.0, 10.0, 13.0, 8.0, 15.0, 25.0, 20.0, 37.0, 31.0, 72.0, 215.0], [180.0, 70.0, 38.0, 35.0, 19.0, 16.0, 13.0, 5.0, 6.0, 9.0, 1.0, 9.0, 8.0, 5.0, 1.0, 6.0, 4.0, 6.0, 5.0, 6.0, 4.0, 8.0, 6.0, 10.0, 6.0, 7.0, 7.0, 3.0, 5.0, 8.0, 10.0, 3.0, 10.0, 8.0, 8.0, 7.0, 16.0, 9.0, 8.0, 9.0, 12.0, 6.0, 12.0, 10.0, 20.0, 25.0, 33.0, 46.0, 136.0], [192.0, 62.0, 44.0, 22.0, 16.0, 15.0, 12.0, 10.0, 5.0, 3.0, 7.0, 6.0, 7.0, 5.0, 4.0, 5.0, 3.0, 2.0, 3.0, 3.0, 12.0, 1.0, 7.0, 9.0, 4.0, 3.0, 7.0, 13.0, 2.0, 6.0, 6.0, 6.0, 2.0, 5.0, 9.0, 10.0, 6.0, 8.0, 9.0, 4.0, 9.0, 10.0, 13.0, 10.0, 10.0, 20.0, 21.0, 38.0, 98.0], [173.0, 62.0, 47.0, 26.0, 18.0, 16.0, 13.0, 9.0, 8.0, 6.0, 4.0, 4.0, 5.0, 1.0, 1.0, 0.0, 1.0, 2.0, 6.0, 4.0, 6.0, 3.0, 4.0, 4.0, 6.0, 4.0, 7.0, 2.0, 6.0, 7.0, 6.0, 4.0, 4.0, 8.0, 7.0, 6.0, 7.0, 3.0, 9.0, 7.0, 4.0, 7.0, 5.0, 4.0, 16.0, 9.0, 25.0, 30.0, 86.0], [175.0, 79.0, 32.0, 13.0, 28.0, 12.0, 8.0, 11.0, 5.0, 3.0, 3.0, 4.0, 1.0, 1.0, 6.0, 4.0, 5.0, 2.0, 4.0, 3.0, 1.0, 3.0, 7.0, 2.0, 2.0, 5.0, 5.0, 6.0, 5.0, 4.0, 4.0, 1.0, 7.0, 6.0, 3.0, 5.0, 3.0, 3.0, 4.0, 9.0, 8.0, 5.0, 5.0, 12.0, 5.0, 9.0, 15.0, 21.0, 60.0], [145.0, 82.0, 29.0, 33.0, 16.0, 14.0, 7.0, 8.0, 3.0, 7.0, 9.0, 4.0, 4.0, 0.0, 2.0, 7.0, 4.0, 3.0, 6.0, 5.0, 4.0, 2.0, 3.0, 3.0, 4.0, 2.0, 2.0, 3.0, 5.0, 3.0, 5.0, 0.0, 6.0, 3.0, 2.0, 5.0, 1.0, 9.0, 3.0, 4.0, 6.0, 1.0, 5.0, 6.0, 8.0, 6.0, 14.0, 17.0, 40.0], [170.0, 61.0, 45.0, 22.0, 12.0, 10.0, 14.0, 6.0, 6.0, 4.0, 2.0, 4.0, 4.0, 7.0, 2.0, 2.0, 4.0, 4.0, 3.0, 5.0, 3.0, 2.0, 1.0, 5.0, 1.0, 3.0, 11.0, 4.0, 3.0, 3.0, 2.0, 2.0, 2.0, 3.0, 1.0, 5.0, 2.0, 1.0, 0.0, 1.0, 1.0, 2.0, 5.0, 3.0, 5.0, 6.0, 13.0, 14.0, 36.0], [155.0, 61.0, 43.0, 20.0, 17.0, 17.0, 8.0, 6.0, 8.0, 2.0, 1.0, 2.0, 4.0, 2.0, 2.0, 3.0, 1.0, 5.0, 1.0, 1.0, 3.0, 3.0, 3.0, 4.0, 3.0, 5.0, 3.0, 5.0, 0.0, 7.0, 5.0, 3.0, 1.0, 0.0, 3.0, 1.0, 4.0, 1.0, 5.0, 4.0, 5.0, 4.0, 2.0, 4.0, 0.0, 4.0, 2.0, 12.0, 25.0], [176.0, 63.0, 40.0, 27.0, 24.0, 12.0, 12.0, 7.0, 5.0, 3.0, 4.0, 2.0, 5.0, 2.0, 1.0, 4.0, 2.0, 0.0, 3.0, 1.0, 2.0, 2.0, 3.0, 1.0, 2.0, 1.0, 2.0, 6.0, 5.0, 2.0, 3.0, 3.0, 3.0, 5.0, 0.0, 1.0, 2.0, 2.0, 5.0, 4.0, 1.0, 6.0, 2.0, 3.0, 1.0, 3.0, 5.0, 4.0, 19.0], [166.0, 67.0, 32.0, 13.0, 20.0, 15.0, 14.0, 9.0, 4.0, 3.0, 6.0, 4.0, 2.0, 1.0, 3.0, 4.0, 3.0, 1.0, 0.0, 2.0, 2.0, 3.0, 3.0, 2.0, 2.0, 5.0, 5.0, 4.0, 4.0, 0.0, 2.0, 3.0, 1.0, 7.0, 1.0, 1.0, 3.0, 2.0, 5.0, 3.0, 0.0, 2.0, 1.0, 3.0, 2.0, 4.0, 2.0, 5.0, 12.0], [146.0, 56.0, 36.0, 34.0, 19.0, 14.0, 13.0, 6.0, 4.0, 1.0, 3.0, 1.0, 1.0, 5.0, 2.0, 3.0, 1.0, 3.0, 3.0, 1.0, 3.0, 4.0, 2.0, 5.0, 3.0, 3.0, 6.0, 5.0, 3.0, 0.0, 3.0, 7.0, 0.0, 2.0, 2.0, 2.0, 1.0, 1.0, 1.0, 4.0, 3.0, 2.0, 0.0, 0.0, 2.0, 5.0, 2.0, 6.0, 9.0], [177.0, 74.0, 31.0, 21.0, 15.0, 12.0, 6.0, 10.0, 9.0, 3.0, 6.0, 2.0, 1.0, 1.0, 1.0, 3.0, 1.0, 4.0, 5.0, 1.0, 1.0, 2.0, 3.0, 0.0, 4.0, 2.0, 4.0, 2.0, 7.0, 3.0, 1.0, 1.0, 3.0, 5.0, 3.0, 1.0, 3.0, 2.0, 2.0, 2.0, 1.0, 2.0, 3.0, 2.0, 2.0, 1.0, 4.0, 2.0, 5.0], [173.0, 64.0, 41.0, 22.0, 10.0, 13.0, 11.0, 7.0, 6.0, 3.0, 4.0, 3.0, 4.0, 1.0, 2.0, 6.0, 3.0, 0.0, 1.0, 3.0, 2.0, 2.0, 4.0, 1.0, 1.0, 1.0, 1.0, 1.0, 1.0, 5.0, 1.0, 8.0, 3.0, 5.0, 2.0, 0.0, 4.0, 1.0, 2.0, 3.0, 0.0, 1.0, 2.0, 2.0, 3.0, 5.0, 4.0, 2.0, 5.0], [165.0, 66.0, 37.0, 21.0, 24.0, 18.0, 4.0, 6.0, 2.0, 7.0, 6.0, 4.0, 2.0, 1.0, 1.0, 0.0, 3.0, 2.0, 0.0, 2.0, 1.0, 1.0, 3.0, 3.0, 0.0, 8.0, 2.0, 1.0, 4.0, 5.0, 3.0, 3.0, 2.0, 1.0, 2.0, 3.0, 2.0, 2.0, 3.0, 4.0, 3.0, 1.0, 1.0, 0.0, 1.0, 2.0, 0.0, 4.0, 11.0], [180.0, 60.0, 35.0, 19.0, 21.0, 11.0, 10.0, 7.0, 8.0, 3.0, 3.0, 2.0, 3.0, 3.0, 2.0, 1.0, 2.0, 1.0, 2.0, 2.0, 2.0, 4.0, 1.0, 2.0, 2.0, 3.0, 4.0, 3.0, 3.0, 4.0, 4.0, 5.0, 4.0, 2.0, 2.0, 4.0, 0.0, 1.0, 1.0, 0.0, 0.0, 1.0, 0.0, 3.0, 1.0, 2.0, 2.0, 2.0, 5.0], [164.0, 62.0, 37.0, 26.0, 12.0, 15.0, 6.0, 5.0, 4.0, 3.0, 3.0, 7.0, 1.0, 1.0, 2.0, 3.0, 4.0, 1.0, 3.0, 1.0, 1.0, 4.0, 1.0, 0.0, 7.0, 5.0, 1.0, 3.0, 1.0, 3.0, 3.0, 1.0, 2.0, 1.0, 3.0, 2.0, 2.0, 2.0, 3.0, 2.0, 2.0, 1.0, 2.0, 0.0, 0.0, 0.0, 5.0, 2.0, 2.0], [189.0, 51.0, 42.0, 27.0, 17.0, 11.0, 5.0, 9.0, 6.0, 4.0, 7.0, 4.0, 3.0, 0.0, 1.0, 2.0, 0.0, 2.0, 1.0, 2.0, 1.0, 2.0, 5.0, 3.0, 2.0, 5.0, 3.0, 4.0, 1.0, 3.0, 3.0, 0.0, 1.0, 2.0, 4.0, 2.0, 1.0, 1.0, 1.0, 1.0, 1.0, 2.0, 7.0, 0.0, 1.0, 0.0, 1.0, 2.0, 7.0], [203.0, 66.0, 34.0, 31.0, 20.0, 9.0, 5.0, 9.0, 4.0, 6.0, 2.0, 5.0, 4.0, 3.0, 2.0, 0.0, 2.0, 0.0, 2.0, 2.0, 3.0, 1.0, 3.0, 4.0, 4.0, 2.0, 0.0, 4.0, 1.0, 4.0, 5.0, 6.0, 0.0, 3.0, 2.0, 1.0, 2.0, 2.0, 3.0, 2.0, 0.0, 0.0, 0.0, 0.0, 0.0, 1.0, 1.0, 2.0, 1.0], [194.0, 54.0, 36.0, 23.0, 20.0, 12.0, 7.0, 12.0, 6.0, 8.0, 6.0, 1.0, 4.0, 0.0, 0.0, 1.0, 0.0, 3.0, 4.0, 3.0, 5.0, 0.0, 5.0, 7.0, 2.0, 0.0, 2.0, 2.0, 2.0, 4.0, 1.0, 4.0, 1.0, 2.0, 2.0, 3.0, 3.0, 0.0, 0.0, 1.0, 3.0, 0.0, 1.0, 0.0, 1.0, 1.0, 0.0, 1.0, 1.0], [181.0, 68.0, 48.0, 28.0, 21.0, 10.0, 8.0, 10.0, 4.0, 8.0, 3.0, 1.0, 4.0, 1.0, 2.0, 1.0, 1.0, 3.0, 1.0, 3.0, 0.0, 1.0, 2.0, 2.0, 2.0, 6.0, 2.0, 4.0, 3.0, 0.0, 7.0, 1.0, 4.0, 1.0, 1.0, 1.0, 5.0, 1.0, 0.0, 0.0, 2.0, 2.0, 1.0, 0.0, 3.0, 0.0, 2.0, 3.0, 3.0], [167.0, 57.0, 39.0, 29.0, 12.0, 14.0, 14.0, 8.0, 7.0, 1.0, 3.0, 5.0, 0.0, 2.0, 1.0, 0.0, 3.0, 1.0, 4.0, 2.0, 3.0, 2.0, 1.0, 1.0, 1.0, 1.0, 4.0, 5.0, 2.0, 5.0, 2.0, 3.0, 5.0, 3.0, 3.0, 2.0, 4.0, 2.0, 0.0, 3.0, 1.0, 1.0, 0.0, 0.0, 1.0, 1.0, 1.0, 1.0, 3.0], [182.0, 68.0, 31.0, 30.0, 16.0, 9.0, 14.0, 10.0, 3.0, 4.0, 2.0, 4.0, 4.0, 1.0, 1.0, 4.0, 3.0, 1.0, 2.0, 3.0, 2.0, 3.0, 0.0, 0.0, 5.0, 3.0, 2.0, 2.0, 4.0, 4.0, 4.0, 2.0, 2.0, 1.0, 2.0, 2.0, 1.0, 1.0, 0.0, 3.0, 4.0, 0.0, 0.0, 2.0, 2.0, 1.0, 1.0, 1.0, 1.0], [178.0, 58.0, 35.0, 22.0, 25.0, 13.0, 9.0, 7.0, 7.0, 4.0, 1.0, 3.0, 3.0, 5.0, 1.0, 2.0, 0.0, 0.0, 1.0, 6.0, 1.0, 4.0, 2.0, 2.0, 3.0, 3.0, 3.0, 2.0, 2.0, 4.0, 2.0, 2.0, 3.0, 5.0, 2.0, 3.0, 2.0, 3.0, 0.0, 4.0, 1.0, 0.0, 2.0, 1.0, 0.0, 1.0, 2.0, 2.0, 1.0], [158.0, 70.0, 35.0, 26.0, 18.0, 12.0, 7.0, 7.0, 2.0, 8.0, 4.0, 1.0, 4.0, 4.0, 3.0, 3.0, 3.0, 2.0, 1.0, 4.0, 2.0, 4.0, 1.0, 3.0, 4.0, 3.0, 1.0, 1.0, 4.0, 2.0, 2.0, 2.0, 2.0, 1.0, 2.0, 1.0, 3.0, 3.0, 1.0, 2.0, 2.0, 2.0, 1.0, 1.0, 2.0, 0.0, 1.0, 1.0, 2.0], [178.0, 65.0, 31.0, 27.0, 14.0, 13.0, 10.0, 6.0, 3.0, 2.0, 5.0, 3.0, 5.0, 3.0, 1.0, 2.0, 2.0, 3.0, 1.0, 1.0, 1.0, 0.0, 3.0, 2.0, 6.0, 0.0, 6.0, 2.0, 4.0, 2.0, 3.0, 2.0, 1.0, 3.0, 2.0, 2.0, 2.0, 2.0, 1.0, 1.0, 3.0, 2.0, 2.0, 0.0, 0.0, 1.0, 0.0, 0.0, 6.0], [179.0, 68.0, 34.0, 24.0, 19.0, 20.0, 10.0, 6.0, 10.0, 8.0, 1.0, 1.0, 1.0, 0.0, 2.0, 1.0, 1.0, 2.0, 2.0, 2.0, 5.0, 5.0, 1.0, 2.0, 4.0, 5.0, 3.0, 2.0, 3.0, 4.0, 5.0, 1.0, 2.0, 1.0, 1.0, 4.0, 1.0, 3.0, 2.0, 2.0, 0.0, 2.0, 0.0, 1.0, 0.0, 0.0, 1.0, 1.0, 2.0], [163.0, 76.0, 41.0, 13.0, 19.0, 18.0, 8.0, 11.0, 5.0, 3.0, 3.0, 2.0, 4.0, 4.0, 1.0, 1.0, 3.0, 1.0, 0.0, 2.0, 2.0, 2.0, 1.0, 3.0, 4.0, 7.0, 3.0, 1.0, 4.0, 2.0, 0.0, 4.0, 1.0, 1.0, 4.0, 2.0, 1.0, 2.0, 1.0, 1.0, 1.0, 1.0, 2.0, 2.0, 1.0, 1.0, 3.0, 0.0, 3.0], [181.0, 75.0, 25.0, 12.0, 23.0, 20.0, 9.0, 7.0, 11.0, 6.0, 3.0, 2.0, 3.0, 1.0, 3.0, 1.0, 0.0, 0.0, 1.0, 1.0, 5.0, 0.0, 4.0, 4.0, 3.0, 3.0, 4.0, 1.0, 2.0, 3.0, 5.0, 2.0, 1.0, 1.0, 6.0, 3.0, 1.0, 0.0, 3.0, 2.0, 1.0, 1.0, 1.0, 1.0, 3.0, 0.0, 3.0, 1.0, 5.0], [175.0, 60.0, 45.0, 24.0, 17.0, 17.0, 13.0, 5.0, 5.0, 3.0, 3.0, 3.0, 5.0, 2.0, 2.0, 2.0, 1.0, 2.0, 1.0, 4.0, 2.0, 2.0, 4.0, 2.0, 5.0, 2.0, 3.0, 4.0, 2.0, 3.0, 3.0, 3.0, 4.0, 3.0, 1.0, 1.0, 3.0, 2.0, 2.0, 1.0, 0.0, 0.0, 0.0, 2.0, 0.0, 1.0, 1.0, 1.0, 2.0], [179.0, 64.0, 41.0, 30.0, 13.0, 11.0, 10.0, 7.0, 4.0, 3.0, 6.0, 2.0, 4.0, 2.0, 0.0, 3.0, 3.0, 4.0, 1.0, 4.0, 3.0, 5.0, 2.0, 3.0, 4.0, 2.0, 1.0, 1.0, 5.0, 3.0, 4.0, 3.0, 4.0, 2.0, 2.0, 2.0, 1.0, 1.0, 2.0, 3.0, 2.0, 1.0, 1.0, 0.0, 1.0, 0.0, 0.0, 1.0, 3.0], [177.0, 63.0, 44.0, 24.0, 19.0, 19.0, 9.0, 4.0, 7.0, 7.0, 2.0, 3.0, 3.0, 2.0, 1.0, 1.0, 2.0, 2.0, 3.0, 1.0, 2.0, 2.0, 4.0, 0.0, 4.0, 2.0, 1.0, 2.0, 3.0, 4.0, 2.0, 1.0, 3.0, 2.0, 5.0, 5.0, 1.0, 4.0, 1.0, 1.0, 1.0, 3.0, 2.0, 1.0, 0.0, 1.0, 0.0, 2.0, 3.0]],
    "Name": "sCurve-0",
    "Overflow": 1976697.0,
    "Type": "Histo2d",
    "Underflow": 0.0,
    "x": {
        "AxisTitle": "Vcal",
        "Bins": 51,
        "High": 302.5,
        "Low": 47.5
    },
    "y": {
        "AxisTitle": "Occupancy",
        "Bins": 49,
        "High": 49.5,
        "Low": 0.5
    },
    "z": {
        "AxisTitle": "Number of pixels"
    }
}