time,Hardware,Voltage,Current
1621610913666,high-voltage,1,0.138309
time,Hardware,Voltage,Current
1621610913666,high-voltage,2,0.235956
time,Hardware,Voltage,Current
1621610913666,high-voltage,3,0.370364
time,Hardware,Voltage,Current
1621610913666,high-voltage,4,0.531057
time,Hardware,Voltage,Current
1621610913666,high-voltage,5,0.723937
time,Hardware,Voltage,Current
1621610913666,high-voltage,6,0.950484
time,Hardware,Voltage,Current
1621610913666,high-voltage,7,1.26624
time,Hardware,Voltage,Current
1621610913666,high-voltage,8,1.61021
time,Hardware,Voltage,Current
1621610913666,high-voltage,9,2.06687
time,Hardware,Voltage,Current
1621610913666,high-voltage,10,2.73277
time,Hardware,Voltage,Current
1621610913666,high-voltage,11,3.369
time,Hardware,Voltage,Current
1621610913666,high-voltage,12,4.06496
time,Hardware,Voltage,Current
1621610913666,high-voltage,13,5.03634
time,Hardware,Voltage,Current
1621610913666,high-voltage,14,6.09124
time,Hardware,Voltage,Current
1621610913666,high-voltage,15,7.20442
time,Hardware,Voltage,Current
1621610913666,high-voltage,16,8.32234
time,Hardware,Voltage,Current
1621610913666,high-voltage,17,9.56193
time,Hardware,Voltage,Current
1621610913666,high-voltage,18,10.0001
time,Hardware,Voltage,Current
1621610913666,high-voltage,19,10.0001
