{
    "Data": [0.0, 0.0, 0.0, 0.0, 0.0, 0.0, 0.0, 0.0, 0.0, 0.0, 0.0, 0.0, 0.0, 0.0, 0.0, 0.0, 0.0, 0.0, 0.0, 0.0, 0.0, 0.0, 9.0, 11.0, 1.0, 14.0, 0.0, 7.0, 4.0, 19.0, 32.0, 9.0, 3.0, 33.0, 4.0, 46.0, 48.0, 6.0, 29.0, 11.0, 50.0, 1.0, 14.0, 50.0, 31.0, 50.0, 10.0, 6.0, 50.0, 50.0, 50.0],
    "Name": "Scurve-80-96",
    "Overflow": 0.0,
    "Type": "Histo1d",
    "Underflow": 0.0,
    "x": {
        "AxisTitle": "Vcal",
        "Bins": 51,
        "High": 302.5,
        "Low": 47.5
    },
    "y": {
        "AxisTitle": "Occupancy"
    },
    "z": {
        "AxisTitle": "z"
    }
}