{
    "Data": [0.0, 0.0, 0.0, 0.0, 0.0, 0.0, 0.0, 0.0, 0.0, 0.0, 0.0, 0.0, 0.0, 0.0, 1.0, 0.0, 1.0, 2.0, 5.0, 2.0, 3.0, 8.0, 14.0, 8.0, 11.0, 11.0, 5.0, 21.0, 39.0, 31.0, 38.0, 45.0, 43.0, 47.0, 46.0, 45.0, 49.0, 50.0, 50.0, 50.0, 50.0, 50.0, 50.0, 50.0, 19.0, 50.0, 50.0, 11.0, 47.0, 50.0, 14.0],
    "Name": "Scurve-20-96",
    "Overflow": 0.0,
    "Type": "Histo1d",
    "Underflow": 0.0,
    "x": {
        "AxisTitle": "Vcal",
        "Bins": 51,
        "High": 302.5,
        "Low": 47.5
    },
    "y": {
        "AxisTitle": "Occupancy"
    },
    "z": {
        "AxisTitle": "z"
    }
}