{
    "Data": [0.0, 0.0, 0.0, 0.0, 0.0, 0.0, 0.0, 0.0, 0.0, 0.0, 0.0, 0.0, 0.0, 0.0, 0.0, 0.0, 0.0, 0.0, 0.0, 0.0, 0.0, 0.0, 0.0, 0.0, 0.0, 0.0, 0.0, 0.0, 0.0, 0.0, 0.0, 0.0, 0.0, 0.0, 0.0, 0.0, 0.0, 0.0, 0.0, 0.0, 0.0, 0.0, 0.0, 0.0, 0.0, 0.0, 0.0, 0.0, 0.0, 0.0, 24.0, 48.0, 52.0, 64.0, 90.0, 100.0, 134.0, 126.0, 167.0, 164.0, 203.0, 204.0, 244.0, 263.0, 293.0, 325.0, 384.0, 389.0, 401.0, 467.0, 536.0, 590.0, 567.0, 651.0, 684.0, 682.0, 705.0, 830.0, 777.0, 820.0, 857.0, 1048.0, 1074.0, 1299.0, 1410.0, 1722.0, 2180.0, 2446.0, 2734.0, 2912.0, 2982.0, 2864.0, 2734.0, 2378.0, 2102.0, 1744.0, 1447.0, 1135.0, 928.0, 753.0, 652.0, 484.0, 353.0, 340.0, 325.0, 295.0, 187.0, 159.0, 139.0, 116.0, 123.0, 90.0, 81.0, 62.0, 60.0, 47.0, 48.0, 38.0, 32.0, 32.0, 23.0, 23.0, 30.0, 27.0, 15.0, 18.0, 10.0, 12.0, 19.0, 18.0, 13.0, 14.0, 17.0, 12.0, 11.0, 9.0, 7.0, 4.0, 6.0, 9.0, 6.0, 6.0, 5.0, 4.0, 6.0, 6.0, 7.0, 4.0, 1.0, 2.0, 2.0, 3.0, 5.0, 4.0, 4.0, 5.0, 5.0, 4.0, 15.0, 11.0, 13.0, 9.0, 20.0, 12.0, 29.0, 27.0, 35.0, 37.0, 64.0, 63.0, 75.0, 87.0, 86.0, 93.0, 137.0, 153.0, 152.0, 202.0, 228.0, 225.0, 265.0, 289.0, 349.0, 372.0, 397.0, 441.0, 487.0, 493.0, 568.0, 612.0, 646.0, 675.0, 695.0, 764.0, 769.0, 765.0, 812.0, 791.0, 858.0, 822.0, 850.0, 784.0, 774.0, 783.0, 732.0, 682.0, 675.0, 559.0, 573.0, 546.0, 473.0, 454.0, 391.0, 347.0, 330.0, 282.0, 249.0, 215.0, 190.0, 163.0, 134.0, 110.0, 96.0, 91.0, 80.0, 51.0, 52.0, 47.0, 30.0, 26.0, 14.0, 15.0, 13.0, 11.0, 7.0, 7.0, 5.0, 1.0, 1.0, 2.0, 2.0, 2.0, 1.0, 2.0, 2.0, 0.0, 0.0, 0.0, 0.0, 0.0, 0.0, 0.0, 0.0, 0.0, 0.0, 1.0, 1.0, 0.0, 0.0, 0.0, 0.0, 0.0, 0.0, 0.0, 1.0, 0.0, 0.0, 0.0, 0.0, 0.0, 0.0, 0.0, 0.0, 0.0, 0.0, 0.0, 0.0, 0.0, 1.0, 0.0, 0.0, 0.0, 0.0, 0.0, 0.0, 0.0, 0.0, 0.0, 0.0, 0.0, 0.0, 0.0, 0.0, 0.0, 0.0, 0.0, 0.0, 0.0, 0.0, 0.0, 0.0, 0.0, 0.0, 0.0, 0.0, 0.0, 0.0, 0.0, 0.0, 0.0, 0.0, 0.0, 0.0, 0.0, 0.0, 0.0, 0.0, 0.0, 0.0, 0.0, 0.0, 0.0, 0.0, 0.0, 0.0, 0.0, 0.0, 0.0, 0.0, 0.0, 0.0, 0.0, 0.0, 0.0, 0.0, 0.0, 0.0, 0.0, 0.0, 0.0, 0.0, 0.0, 0.0, 0.0, 0.0, 0.0, 0.0, 0.0, 0.0, 0.0, 0.0, 0.0, 0.0, 0.0, 0.0, 0.0, 0.0, 0.0, 0.0, 0.0, 0.0, 0.0, 0.0, 0.0, 0.0, 0.0, 0.0, 0.0, 0.0, 0.0, 0.0, 0.0, 0.0, 0.0, 0.0, 0.0, 0.0, 0.0, 0.0, 0.0, 0.0, 0.0, 0.0],
    "Name": "ThresholdDist-0",
    "Overflow": 0.0,
    "Type": "Histo1d",
    "Underflow": 0.0,
    "x": {
        "AxisTitle": "Threshold [e]",
        "Bins": 383,
        "High": 3825.0,
        "Low": -5.0
    },
    "y": {
        "AxisTitle": "Number of Pixels"
    },
    "z": {
        "AxisTitle": "z"
    }
}