time,Hardware,Voltage,Current
1622072457813,high-voltage-3,1,0.094032
time,Hardware,Voltage,Current
1622072457813,high-voltage-3,2,0.101038
time,Hardware,Voltage,Current
1622072457813,high-voltage-3,3,0.107165
time,Hardware,Voltage,Current
1622072457813,high-voltage-3,4,0.113668
time,Hardware,Voltage,Current
1622072457813,high-voltage-3,5,0.117346
time,Hardware,Voltage,Current
1622072457813,high-voltage-3,6,0.122266
time,Hardware,Voltage,Current
1622072457813,high-voltage-3,7,0.129063
time,Hardware,Voltage,Current
1622072457813,high-voltage-3,8,0.135555
time,Hardware,Voltage,Current
1622072457813,high-voltage-3,9,0.141724
time,Hardware,Voltage,Current
1622072457813,high-voltage-3,10,0.148186
time,Hardware,Voltage,Current
1622072457813,high-voltage-3,11,0.154991
time,Hardware,Voltage,Current
1622072457813,high-voltage-3,12,0.162861
time,Hardware,Voltage,Current
1622072457813,high-voltage-3,13,0.167637
time,Hardware,Voltage,Current
1622072457813,high-voltage-3,14,0.17348
time,Hardware,Voltage,Current
1622072457813,high-voltage-3,15,0.178798
time,Hardware,Voltage,Current
1622072457813,high-voltage-3,16,0.184957
time,Hardware,Voltage,Current
1622072457813,high-voltage-3,17,0.189206
time,Hardware,Voltage,Current
1622072457813,high-voltage-3,18,0.19466
time,Hardware,Voltage,Current
1622072457813,high-voltage-3,19,0.19898
time,Hardware,Voltage,Current
1622072457813,high-voltage-3,20,0.202042
time,Hardware,Voltage,Current
1622072457813,high-voltage-3,25,0.221956
time,Hardware,Voltage,Current
1622072457813,high-voltage-3,30,0.238102
time,Hardware,Voltage,Current
1622072457813,high-voltage-3,35,0.253133
time,Hardware,Voltage,Current
1622072457813,high-voltage-3,40,0.270614
time,Hardware,Voltage,Current
1622072457813,high-voltage-3,45,0.284266
time,Hardware,Voltage,Current
1622072457813,high-voltage-3,50,0.295521
time,Hardware,Voltage,Current
1622072457813,high-voltage-3,55,0.307938
time,Hardware,Voltage,Current
1622072457813,high-voltage-3,60,0.319816
time,Hardware,Voltage,Current
1622072457813,high-voltage-3,65,0.329829
time,Hardware,Voltage,Current
1622072457813,high-voltage-3,70,0.342832
time,Hardware,Voltage,Current
1622072457813,high-voltage-3,75,0.350736
time,Hardware,Voltage,Current
1622072457813,high-voltage-3,80,0.363968
time,Hardware,Voltage,Current
1622072457813,high-voltage-3,85,0.375784
time,Hardware,Voltage,Current
1622072457813,high-voltage-3,90,0.386469
time,Hardware,Voltage,Current
1622072457813,high-voltage-3,95,0.395171
time,Hardware,Voltage,Current
1622072457813,high-voltage-3,100,0.406048
1622072584836,high-voltage-3,1,0.0888662
1622072584836,high-voltage-3,2,0.0999109
1622072584836,high-voltage-3,3,0.106141
1622072584836,high-voltage-3,4,0.113195
1622072584836,high-voltage-3,5,0.118044
1622072584836,high-voltage-3,6,0.123129
1622072584836,high-voltage-3,7,0.128079
1622072584836,high-voltage-3,8,0.134103
1622072584836,high-voltage-3,9,0.140552
1622072584836,high-voltage-3,10,0.14792
1622072584836,high-voltage-3,11,0.156321
1622072584836,high-voltage-3,12,0.163267
1622072584836,high-voltage-3,13,0.169399
1622072584836,high-voltage-3,14,0.174605
1622072584836,high-voltage-3,15,0.17899
1622072584836,high-voltage-3,16,0.184974
1622072584836,high-voltage-3,17,0.188748
1622072584836,high-voltage-3,18,0.193175
1622072584836,high-voltage-3,19,0.19785
1622072584836,high-voltage-3,20,0.201826
1622072584836,high-voltage-3,25,0.22123
1622072584836,high-voltage-3,30,0.237624
1622072584836,high-voltage-3,35,0.254535
1622072584836,high-voltage-3,40,0.267888
1622072584836,high-voltage-3,45,0.281674
1622072584836,high-voltage-3,50,0.293966
1622072584836,high-voltage-3,55,0.309554
1622072584836,high-voltage-3,60,0.31882
1622072584836,high-voltage-3,65,0.331912
1622072584836,high-voltage-3,70,0.34139
1622072584836,high-voltage-3,75,0.353868
1622072584836,high-voltage-3,80,0.36464
1622072584836,high-voltage-3,85,0.373966
1622072584836,high-voltage-3,90,0.383086
1622072584836,high-voltage-3,95,0.395407
1622072584836,high-voltage-3,100,0.404404
1622072711161,high-voltage-3,1,0.0890474
1622072711161,high-voltage-3,2,0.0983734
1622072711161,high-voltage-3,3,0.105625
1622072711161,high-voltage-3,4,0.111365
1622072711161,high-voltage-3,5,0.117541
1622072711161,high-voltage-3,6,0.123455
1622072711161,high-voltage-3,7,0.127845
1622072711161,high-voltage-3,8,0.133723
1622072711161,high-voltage-3,9,0.142147
1622072711161,high-voltage-3,10,0.148183
1622072711161,high-voltage-3,11,0.155673
1622072711161,high-voltage-3,12,0.161512
1622072711161,high-voltage-3,13,0.168443
1622072711161,high-voltage-3,14,0.173407
1622072711161,high-voltage-3,15,0.179055
1622072711161,high-voltage-3,16,0.185133
1622072711161,high-voltage-3,17,0.188495
1622072711161,high-voltage-3,18,0.193507
1622072711161,high-voltage-3,19,0.198148
1622072711161,high-voltage-3,20,0.202568
1622072711161,high-voltage-3,25,0.219503
1622072711161,high-voltage-3,30,0.236361
1622072711161,high-voltage-3,35,0.254233
1622072711161,high-voltage-3,40,0.269278
1622072711161,high-voltage-3,45,0.281456
1622072711161,high-voltage-3,50,0.296844
1622072711161,high-voltage-3,55,0.309932
1622072711161,high-voltage-3,60,0.320009
1622072711161,high-voltage-3,65,0.330813
1622072711161,high-voltage-3,70,0.343197
1622072711161,high-voltage-3,75,0.353698
1622072711161,high-voltage-3,80,0.363319
1622072711161,high-voltage-3,85,0.375772
1622072711161,high-voltage-3,90,0.384704
1622072711161,high-voltage-3,95,0.39426
1622072711161,high-voltage-3,100,0.404573
1622072838411,high-voltage-3,1,0.090153
1622072838411,high-voltage-3,2,0.0981847
1622072838411,high-voltage-3,3,0.105593
1622072838411,high-voltage-3,4,0.111384
1622072838411,high-voltage-3,5,0.118217
1622072838411,high-voltage-3,6,0.121895
1622072838411,high-voltage-3,7,0.128882
1622072838411,high-voltage-3,8,0.134537
1622072838411,high-voltage-3,9,0.139771
1622072838411,high-voltage-3,10,0.148481
1622072838411,high-voltage-3,11,0.155102
1622072838411,high-voltage-3,12,0.162457
1622072838411,high-voltage-3,13,0.167428
1622072838411,high-voltage-3,14,0.174397
1622072838411,high-voltage-3,15,0.179092
1622072838411,high-voltage-3,16,0.184139
1622072838411,high-voltage-3,17,0.188007
1622072838411,high-voltage-3,18,0.193625
1622072838411,high-voltage-3,19,0.196602
1622072838411,high-voltage-3,20,0.201033
1622072838411,high-voltage-3,25,0.21935
1622072838411,high-voltage-3,30,0.237827
1622072838411,high-voltage-3,35,0.252107
1622072838411,high-voltage-3,40,0.269155
1622072838411,high-voltage-3,45,0.28192
1622072838411,high-voltage-3,50,0.294005
1622072838411,high-voltage-3,55,0.308362
1622072838411,high-voltage-3,60,0.319859
1622072838411,high-voltage-3,65,0.333245
1622072838411,high-voltage-3,70,0.342227
1622072838411,high-voltage-3,75,0.353608
1622072838411,high-voltage-3,80,0.362191
1622072838411,high-voltage-3,85,0.373079
1622072838411,high-voltage-3,90,0.384259
1622072838411,high-voltage-3,95,0.395405
1622072838411,high-voltage-3,100,0.402474
