{
    "Data": [51.0, 81.0, 0.0, 0.0, 6.0, 111.0, 639.0, 1943.0, 3898.0, 5166.0, 5286.0, 4057.0, 3115.0, 2841.0, 3268.0, 4135.0, 4638.0, 4304.0, 3438.0, 2399.0, 1442.0, 1019.0, 903.0, 1071.0, 1385.0, 1697.0, 2002.0, 2410.0, 2392.0, 2399.0, 2230.0, 1845.0, 1611.0, 1226.0, 970.0, 617.0, 432.0, 340.0, 224.0, 177.0, 100.0, 63.0, 46.0, 43.0, 28.0, 25.0, 17.0, 13.0, 8.0, 6.0, 9.0, 5.0, 3.0, 4.0, 4.0, 3.0, 3.0, 2.0, 3.0],
    "Name": "NoiseDist-0",
    "Overflow": 47.0,
    "Type": "Histo1d",
    "Underflow": 0.0,
    "x": {
        "AxisTitle": "Noise [e]",
        "Bins": 59,
        "High": 296.0,
        "Low": -2.0
    },
    "y": {
        "AxisTitle": "Number of Pixels"
    },
    "z": {
        "AxisTitle": "z"
    }
}