{
    "Data": [0.0, 0.0, 0.0, 0.0, 0.0, 0.0, 0.0, 0.0, 0.0, 0.0, 0.0, 0.0, 0.0, 7.0, 1.0, 2.0, 4.0, 193.0, 402.0, 141.0, 93.0, 840.0, 2692.0, 1538.0, 509.0, 1501.0, 2854.0, 1938.0, 716.0, 1299.0, 1775.0, 1472.0, 728.0, 665.0, 684.0, 627.0, 527.0, 896.0, 1281.0, 1007.0, 678.0, 1472.0, 2564.0, 3466.0, 2420.0, 1961.0, 2618.0, 3926.0, 3453.0, 2951.0, 2247.0, 2218.0, 2491.0, 1800.0, 1689.0, 1371.0, 1732.0, 1447.0, 1396.0, 1039.0, 906.0, 909.0, 685.0, 640.0, 475.0, 532.0, 500.0, 401.0, 365.0, 323.0, 352.0, 296.0, 276.0, 212.0, 211.0, 174.0, 176.0, 151.0, 120.0, 108.0, 103.0, 95.0, 78.0, 69.0, 58.0, 65.0, 49.0, 44.0, 31.0, 30.0, 39.0, 34.0, 25.0, 33.0, 36.0, 20.0, 26.0, 27.0, 19.0, 17.0, 21.0, 18.0, 16.0, 8.0, 13.0, 6.0, 8.0, 16.0, 10.0, 9.0, 3.0, 5.0, 11.0, 2.0, 7.0, 5.0, 4.0, 1.0, 5.0, 1.0, 1.0, 4.0, 1.0, 5.0, 2.0, 5.0, 4.0, 2.0, 1.0, 3.0, 5.0, 2.0, 0.0, 3.0, 1.0, 3.0, 3.0, 2.0, 3.0, 0.0, 1.0, 0.0, 1.0, 5.0, 0.0, 0.0, 1.0, 2.0, 2.0, 3.0, 0.0, 1.0, 0.0, 2.0, 0.0, 1.0, 2.0, 0.0, 1.0, 0.0, 0.0, 1.0, 0.0, 1.0, 2.0, 0.0, 0.0, 0.0, 0.0, 2.0, 0.0, 0.0, 1.0, 0.0, 1.0, 0.0, 0.0, 4.0, 0.0, 0.0, 1.0, 0.0, 0.0, 0.0, 0.0, 0.0, 0.0, 0.0, 0.0, 1.0, 0.0, 0.0, 0.0, 1.0, 1.0, 0.0, 0.0, 0.0, 0.0, 0.0, 0.0],
    "Name": "TimePerFitDist-0",
    "Overflow": 71.0,
    "Type": "Histo1d",
    "Underflow": 0.0,
    "x": {
        "AxisTitle": "Fit Time [us]",
        "Bins": 201,
        "High": 401.0,
        "Low": -1.0
    },
    "y": {
        "AxisTitle": "Number of Pixels"
    },
    "z": {
        "AxisTitle": "z"
    }
}