time,Hardware,Voltage,Current
1621983656745,high-voltage,1,0.0697058
time,Hardware,Voltage,Current
1621983656745,high-voltage,2,0.149147
time,Hardware,Voltage,Current
1621983656745,high-voltage,3,0.266126
time,Hardware,Voltage,Current
1621983656745,high-voltage,4,0.444818
time,Hardware,Voltage,Current
1621983656745,high-voltage,5,0.648905
time,Hardware,Voltage,Current
1621983656745,high-voltage,6,0.862614
time,Hardware,Voltage,Current
1621983656745,high-voltage,7,1.20125
time,Hardware,Voltage,Current
1621983656745,high-voltage,8,1.64972
time,Hardware,Voltage,Current
1621983656745,high-voltage,9,2.10214
time,Hardware,Voltage,Current
1621983656745,high-voltage,10,2.71639
time,Hardware,Voltage,Current
1621983656745,high-voltage,11,3.41946
time,Hardware,Voltage,Current
1621983656745,high-voltage,12,4.22992
time,Hardware,Voltage,Current
1621983656745,high-voltage,13,5.11368
time,Hardware,Voltage,Current
1621983656745,high-voltage,14,6.32601
time,Hardware,Voltage,Current
1621983656745,high-voltage,15,7.61676
time,Hardware,Voltage,Current
1621983656745,high-voltage,16,8.87851
time,Hardware,Voltage,Current
1621983656745,high-voltage,17,9.79239
time,Hardware,Voltage,Current
1621983656745,high-voltage,18,10.0001
