time,Hardware,Voltage,Current
1623283880878,high-voltage,1,0.0249492
time,Hardware,Voltage,Current
1623283880878,high-voltage,2,0.0319343
time,Hardware,Voltage,Current
1623283880878,high-voltage,3,0.0381297
time,Hardware,Voltage,Current
1623283880878,high-voltage,4,0.0428967
time,Hardware,Voltage,Current
1623283880878,high-voltage,5,0.0466716
time,Hardware,Voltage,Current
1623283880878,high-voltage,6,0.0519449
time,Hardware,Voltage,Current
1623283880878,high-voltage,7,0.0566253
time,Hardware,Voltage,Current
1623283880878,high-voltage,8,0.0607971
time,Hardware,Voltage,Current
1623283880878,high-voltage,9,0.0662453
