time,Hardware,Voltage,Current
1621382917219,high-voltage-2,1,0.242425
time,Hardware,Voltage,Current
1621382917219,high-voltage-2,2,0.284242
time,Hardware,Voltage,Current
1621382917219,high-voltage-2,3,0.308118
time,Hardware,Voltage,Current
1621382917219,high-voltage-2,4,0.327436
time,Hardware,Voltage,Current
1621382917219,high-voltage-2,5,0.352578
time,Hardware,Voltage,Current
1621382917219,high-voltage-2,6,0.376263
