{
    "Data": [0.0, 0.0, 0.0, 0.0, 0.0, 0.0, 0.0, 0.0, 0.0, 0.0, 0.0, 0.0, 0.0, 0.0, 0.0, 0.0, 1.0, 2.0, 6.0, 4.0, 4.0, 16.0, 1.0, 15.0, 13.0, 36.0, 40.0, 38.0, 40.0, 49.0, 49.0, 48.0, 47.0, 14.0, 50.0, 50.0, 18.0, 50.0, 50.0, 50.0, 20.0, 50.0, 50.0, 50.0, 50.0, 48.0, 50.0, 50.0, 44.0, 50.0, 50.0],
    "Name": "Scurve-110-96",
    "Overflow": 0.0,
    "Type": "Histo1d",
    "Underflow": 0.0,
    "x": {
        "AxisTitle": "Vcal",
        "Bins": 51,
        "High": 302.5,
        "Low": 47.5
    },
    "y": {
        "AxisTitle": "Occupancy"
    },
    "z": {
        "AxisTitle": "z"
    }
}