{
    "Data": [0.0, 0.0, 0.0, 0.0, 0.0, 0.0, 0.0, 0.0, 0.0, 0.0, 0.0, 0.0, 0.0, 0.0, 0.0, 0.0, 0.0, 0.0, 4.0, 3.0, 1.0, 0.0, 1.0, 6.0, 3.0, 11.0, 0.0, 1.0, 8.0, 15.0, 19.0, 28.0, 9.0, 6.0, 5.0, 25.0, 50.0, 38.0, 4.0, 20.0, 50.0, 50.0, 5.0, 1.0, 0.0, 6.0, 32.0, 43.0, 12.0, 17.0, 5.0],
    "Name": "Scurve-60-96",
    "Overflow": 0.0,
    "Type": "Histo1d",
    "Underflow": 0.0,
    "x": {
        "AxisTitle": "Vcal",
        "Bins": 51,
        "High": 302.5,
        "Low": 47.5
    },
    "y": {
        "AxisTitle": "Occupancy"
    },
    "z": {
        "AxisTitle": "z"
    }
}