{
    "Data": [[5467.0, 2902.0, 2118.0, 1646.0, 1383.0, 1186.0, 1066.0, 926.0, 833.0, 767.0, 722.0, 676.0, 665.0, 573.0, 589.0, 545.0, 504.0, 461.0, 444.0, 487.0, 428.0, 415.0, 397.0, 437.0, 428.0, 430.0, 433.0, 416.0, 407.0, 374.0, 373.0, 394.0, 375.0, 392.0, 405.0, 351.0, 398.0, 382.0, 388.0, 424.0, 386.0, 409.0, 397.0, 381.0, 408.0, 407.0, 438.0, 479.0, 562.0], [5576.0, 3085.0, 2159.0, 1681.0, 1395.0, 1154.0, 1039.0, 916.0, 819.0, 752.0, 751.0, 656.0, 646.0, 619.0, 578.0, 532.0, 546.0, 547.0, 463.0, 480.0, 457.0, 432.0, 423.0, 422.0, 413.0, 367.0, 411.0, 405.0, 413.0, 382.0, 402.0, 422.0, 398.0, 358.0, 402.0, 397.0, 380.0, 385.0, 399.0, 405.0, 408.0, 411.0, 432.0, 466.0, 477.0, 497.0, 520.0, 528.0, 698.0], [5566.0, 3202.0, 2148.0, 1648.0, 1350.0, 1204.0, 1047.0, 995.0, 833.0, 794.0, 732.0, 664.0, 681.0, 657.0, 579.0, 557.0, 534.0, 509.0, 470.0, 489.0, 475.0, 450.0, 459.0, 435.0, 418.0, 441.0, 414.0, 377.0, 368.0, 366.0, 419.0, 406.0, 400.0, 402.0, 387.0, 410.0, 430.0, 411.0, 407.0, 406.0, 420.0, 447.0, 480.0, 446.0, 504.0, 494.0, 584.0, 652.0, 838.0], [5696.0, 3045.0, 2213.0, 1696.0, 1445.0, 1197.0, 1138.0, 947.0, 859.0, 842.0, 748.0, 666.0, 618.0, 567.0, 587.0, 555.0, 511.0, 513.0, 528.0, 497.0, 454.0, 459.0, 451.0, 426.0, 496.0, 459.0, 428.0, 422.0, 407.0, 431.0, 403.0, 391.0, 419.0, 397.0, 419.0, 385.0, 402.0, 422.0, 452.0, 458.0, 455.0, 402.0, 469.0, 494.0, 514.0, 558.0, 637.0, 734.0, 1021.0], [5843.0, 3128.0, 2178.0, 1715.0, 1429.0, 1203.0, 1127.0, 949.0, 869.0, 792.0, 732.0, 701.0, 669.0, 604.0, 594.0, 552.0, 558.0, 510.0, 517.0, 485.0, 467.0, 454.0, 448.0, 454.0, 456.0, 419.0, 436.0, 416.0, 398.0, 451.0, 403.0, 458.0, 408.0, 417.0, 435.0, 461.0, 454.0, 397.0, 460.0, 443.0, 424.0, 467.0, 474.0, 523.0, 524.0, 569.0, 670.0, 790.0, 1125.0], [5850.0, 3187.0, 2138.0, 1763.0, 1513.0, 1223.0, 1039.0, 981.0, 876.0, 848.0, 800.0, 703.0, 648.0, 667.0, 581.0, 578.0, 520.0, 523.0, 488.0, 488.0, 481.0, 472.0, 446.0, 461.0, 465.0, 442.0, 458.0, 433.0, 455.0, 397.0, 418.0, 390.0, 458.0, 417.0, 418.0, 424.0, 456.0, 431.0, 453.0, 451.0, 463.0, 483.0, 499.0, 544.0, 533.0, 599.0, 666.0, 892.0, 1224.0], [5910.0, 3094.0, 2164.0, 1713.0, 1457.0, 1237.0, 1098.0, 972.0, 865.0, 799.0, 820.0, 721.0, 682.0, 607.0, 597.0, 613.0, 538.0, 548.0, 569.0, 468.0, 479.0, 474.0, 443.0, 507.0, 420.0, 468.0, 456.0, 454.0, 440.0, 457.0, 398.0, 445.0, 423.0, 418.0, 425.0, 432.0, 446.0, 454.0, 472.0, 461.0, 482.0, 485.0, 518.0, 562.0, 574.0, 588.0, 711.0, 852.0, 1304.0], [5883.0, 3201.0, 2206.0, 1668.0, 1502.0, 1230.0, 1092.0, 989.0, 881.0, 806.0, 758.0, 754.0, 652.0, 650.0, 605.0, 601.0, 553.0, 527.0, 540.0, 519.0, 501.0, 468.0, 455.0, 460.0, 452.0, 504.0, 433.0, 422.0, 452.0, 470.0, 421.0, 447.0, 412.0, 440.0, 448.0, 469.0, 449.0, 456.0, 466.0, 451.0, 487.0, 478.0, 504.0, 513.0, 597.0, 594.0, 721.0, 903.0, 1448.0], [5883.0, 3150.0, 2197.0, 1705.0, 1433.0, 1241.0, 1084.0, 1026.0, 907.0, 832.0, 772.0, 701.0, 651.0, 600.0, 613.0, 585.0, 587.0, 493.0, 539.0, 533.0, 491.0, 517.0, 423.0, 491.0, 480.0, 467.0, 455.0, 424.0, 438.0, 433.0, 421.0, 423.0, 434.0, 422.0, 449.0, 449.0, 445.0, 495.0, 469.0, 500.0, 472.0, 530.0, 476.0, 584.0, 568.0, 664.0, 744.0, 931.0, 1441.0], [5711.0, 3134.0, 2235.0, 1714.0, 1455.0, 1233.0, 1067.0, 983.0, 925.0, 805.0, 708.0, 732.0, 679.0, 615.0, 615.0, 564.0, 554.0, 554.0, 516.0, 502.0, 498.0, 498.0, 489.0, 432.0, 464.0, 467.0, 455.0, 441.0, 471.0, 456.0, 419.0, 419.0, 428.0, 444.0, 466.0, 446.0, 452.0, 442.0, 447.0, 482.0, 526.0, 485.0, 545.0, 558.0, 612.0, 667.0, 761.0, 958.0, 1498.0], [5917.0, 3085.0, 2214.0, 1594.0, 1351.0, 1279.0, 1072.0, 954.0, 900.0, 856.0, 737.0, 710.0, 677.0, 638.0, 585.0, 583.0, 511.0, 524.0, 493.0, 539.0, 473.0, 485.0, 509.0, 464.0, 444.0, 464.0, 427.0, 419.0, 458.0, 440.0, 419.0, 460.0, 456.0, 440.0, 458.0, 443.0, 433.0, 456.0, 474.0, 470.0, 468.0, 490.0, 569.0, 601.0, 591.0, 662.0, 749.0, 1007.0, 1503.0], [6099.0, 3122.0, 2160.0, 1711.0, 1338.0, 1140.0, 984.0, 916.0, 923.0, 775.0, 762.0, 691.0, 643.0, 632.0, 585.0, 556.0, 559.0, 534.0, 481.0, 532.0, 459.0, 472.0, 485.0, 442.0, 424.0, 445.0, 453.0, 431.0, 468.0, 435.0, 449.0, 440.0, 386.0, 468.0, 434.0, 481.0, 432.0, 439.0, 448.0, 471.0, 465.0, 510.0, 531.0, 507.0, 640.0, 671.0, 761.0, 993.0, 1562.0], [6132.0, 3151.0, 2152.0, 1691.0, 1399.0, 1220.0, 1018.0, 887.0, 865.0, 808.0, 726.0, 695.0, 640.0, 580.0, 559.0, 512.0, 555.0, 470.0, 487.0, 470.0, 490.0, 474.0, 457.0, 459.0, 437.0, 487.0, 430.0, 448.0, 408.0, 430.0, 392.0, 412.0, 405.0, 414.0, 452.0, 435.0, 493.0, 477.0, 453.0, 460.0, 499.0, 510.0, 511.0, 544.0, 621.0, 634.0, 722.0, 959.0, 1505.0], [6848.0, 3285.0, 2103.0, 1703.0, 1372.0, 1127.0, 1012.0, 888.0, 791.0, 775.0, 724.0, 683.0, 625.0, 578.0, 574.0, 515.0, 506.0, 518.0, 471.0, 484.0, 469.0, 443.0, 466.0, 467.0, 401.0, 449.0, 424.0, 433.0, 431.0, 423.0, 429.0, 398.0, 383.0, 428.0, 395.0, 415.0, 426.0, 457.0, 413.0, 443.0, 470.0, 495.0, 492.0, 553.0, 613.0, 648.0, 742.0, 948.0, 1487.0], [7387.0, 3707.0, 2376.0, 1658.0, 1307.0, 1142.0, 1020.0, 910.0, 801.0, 735.0, 689.0, 650.0, 627.0, 577.0, 562.0, 548.0, 516.0, 472.0, 487.0, 472.0, 436.0, 411.0, 415.0, 410.0, 412.0, 429.0, 450.0, 370.0, 430.0, 414.0, 370.0, 385.0, 424.0, 397.0, 417.0, 427.0, 407.0, 428.0, 425.0, 425.0, 470.0, 448.0, 475.0, 518.0, 574.0, 609.0, 758.0, 919.0, 1426.0], [8275.0, 4140.0, 2471.0, 1734.0, 1402.0, 1158.0, 995.0, 847.0, 834.0, 759.0, 681.0, 626.0, 577.0, 604.0, 553.0, 503.0, 485.0, 497.0, 454.0, 465.0, 436.0, 443.0, 424.0, 411.0, 382.0, 409.0, 399.0, 376.0, 382.0, 389.0, 340.0, 357.0, 428.0, 404.0, 413.0, 410.0, 406.0, 375.0, 414.0, 421.0, 480.0, 448.0, 459.0, 492.0, 569.0, 562.0, 695.0, 828.0, 1428.0], [9125.0, 4714.0, 2909.0, 2031.0, 1461.0, 1255.0, 1021.0, 911.0, 776.0, 747.0, 675.0, 649.0, 623.0, 589.0, 541.0, 493.0, 456.0, 459.0, 412.0, 446.0, 442.0, 425.0, 410.0, 376.0, 395.0, 361.0, 406.0, 403.0, 382.0, 364.0, 358.0, 374.0, 371.0, 400.0, 347.0, 374.0, 367.0, 437.0, 429.0, 341.0, 416.0, 417.0, 445.0, 487.0, 549.0, 562.0, 685.0, 800.0, 1350.0], [9595.0, 5358.0, 3470.0, 2361.0, 1822.0, 1439.0, 1168.0, 1023.0, 836.0, 717.0, 715.0, 652.0, 588.0, 543.0, 506.0, 494.0, 497.0, 423.0, 446.0, 411.0, 421.0, 411.0, 364.0, 438.0, 387.0, 388.0, 351.0, 371.0, 388.0, 354.0, 355.0, 379.0, 371.0, 358.0, 364.0, 391.0, 360.0, 391.0, 384.0, 431.0, 381.0, 412.0, 445.0, 439.0, 469.0, 537.0, 592.0, 766.0, 1195.0], [9705.0, 5833.0, 4064.0, 2907.0, 2131.0, 1686.0, 1381.0, 1130.0, 951.0, 854.0, 794.0, 659.0, 650.0, 540.0, 485.0, 484.0, 466.0, 465.0, 396.0, 431.0, 379.0, 397.0, 382.0, 378.0, 362.0, 397.0, 364.0, 377.0, 382.0, 380.0, 403.0, 340.0, 352.0, 337.0, 381.0, 367.0, 326.0, 375.0, 351.0, 374.0, 410.0, 384.0, 386.0, 464.0, 460.0, 515.0, 565.0, 712.0, 1125.0], [9018.0, 5936.0, 4330.0, 3350.0, 2626.0, 2104.0, 1706.0, 1392.0, 1215.0, 1003.0, 911.0, 809.0, 675.0, 631.0, 620.0, 508.0, 517.0, 460.0, 479.0, 401.0, 428.0, 396.0, 381.0, 393.0, 358.0, 354.0, 360.0, 370.0, 361.0, 347.0, 373.0, 315.0, 344.0, 330.0, 345.0, 336.0, 343.0, 337.0, 367.0, 357.0, 417.0, 368.0, 393.0, 407.0, 456.0, 447.0, 520.0, 663.0, 1053.0], [8190.0, 5552.0, 4439.0, 3497.0, 2946.0, 2427.0, 2100.0, 1723.0, 1547.0, 1317.0, 1120.0, 1046.0, 908.0, 753.0, 715.0, 629.0, 609.0, 495.0, 537.0, 452.0, 444.0, 451.0, 423.0, 395.0, 349.0, 399.0, 348.0, 366.0, 341.0, 325.0, 334.0, 320.0, 337.0, 332.0, 329.0, 306.0, 333.0, 346.0, 352.0, 380.0, 356.0, 392.0, 403.0, 338.0, 391.0, 446.0, 476.0, 603.0, 925.0], [7320.0, 4897.0, 4083.0, 3481.0, 3014.0, 2556.0, 2271.0, 2018.0, 1849.0, 1529.0, 1391.0, 1220.0, 1080.0, 1040.0, 831.0, 804.0, 752.0, 690.0, 630.0, 596.0, 530.0, 495.0, 439.0, 430.0, 382.0, 416.0, 382.0, 389.0, 367.0, 332.0, 335.0, 364.0, 355.0, 295.0, 329.0, 314.0, 316.0, 300.0, 338.0, 334.0, 353.0, 339.0, 370.0, 339.0, 402.0, 420.0, 471.0, 606.0, 846.0], [6377.0, 4259.0, 3551.0, 3188.0, 2774.0, 2527.0, 2206.0, 2081.0, 1869.0, 1794.0, 1603.0, 1509.0, 1344.0, 1195.0, 1151.0, 1025.0, 931.0, 874.0, 820.0, 713.0, 669.0, 629.0, 548.0, 527.0, 493.0, 455.0, 449.0, 430.0, 387.0, 437.0, 394.0, 390.0, 370.0, 339.0, 359.0, 367.0, 359.0, 327.0, 341.0, 319.0, 312.0, 325.0, 354.0, 370.0, 352.0, 406.0, 425.0, 501.0, 837.0], [5701.0, 3600.0, 3013.0, 2576.0, 2388.0, 2222.0, 2033.0, 1963.0, 1937.0, 1762.0, 1661.0, 1650.0, 1445.0, 1419.0, 1360.0, 1191.0, 1107.0, 1122.0, 951.0, 968.0, 884.0, 769.0, 769.0, 747.0, 657.0, 603.0, 554.0, 566.0, 547.0, 545.0, 443.0, 445.0, 436.0, 415.0, 383.0, 387.0, 343.0, 350.0, 328.0, 334.0, 348.0, 326.0, 364.0, 372.0, 360.0, 347.0, 365.0, 489.0, 789.0], [5256.0, 3181.0, 2584.0, 2272.0, 2032.0, 1909.0, 1770.0, 1686.0, 1682.0, 1597.0, 1507.0, 1491.0, 1449.0, 1312.0, 1380.0, 1385.0, 1282.0, 1260.0, 1145.0, 1066.0, 1086.0, 1010.0, 1014.0, 957.0, 888.0, 823.0, 766.0, 712.0, 681.0, 625.0, 600.0, 585.0, 499.0, 505.0, 467.0, 470.0, 432.0, 447.0, 391.0, 409.0, 381.0, 338.0, 332.0, 357.0, 362.0, 355.0, 411.0, 471.0, 668.0], [5089.0, 3121.0, 2223.0, 1945.0, 1665.0, 1592.0, 1433.0, 1446.0, 1422.0, 1363.0, 1319.0, 1314.0, 1295.0, 1326.0, 1246.0, 1240.0, 1207.0, 1229.0, 1160.0, 1162.0, 1240.0, 1072.0, 1103.0, 1034.0, 1071.0, 997.0, 989.0, 978.0, 861.0, 812.0, 816.0, 776.0, 664.0, 686.0, 645.0, 646.0, 552.0, 542.0, 525.0, 470.0, 448.0, 428.0, 424.0, 411.0, 407.0, 389.0, 372.0, 467.0, 613.0], [4998.0, 2840.0, 2170.0, 1688.0, 1525.0, 1351.0, 1302.0, 1155.0, 1127.0, 1127.0, 1126.0, 1043.0, 1063.0, 1084.0, 1093.0, 1087.0, 1108.0, 1048.0, 1077.0, 1106.0, 1071.0, 1119.0, 1091.0, 1118.0, 1090.0, 1123.0, 1064.0, 1019.0, 1042.0, 976.0, 942.0, 915.0, 983.0, 888.0, 819.0, 772.0, 790.0, 759.0, 746.0, 630.0, 611.0, 549.0, 521.0, 534.0, 499.0, 483.0, 473.0, 509.0, 635.0], [4778.0, 2781.0, 1999.0, 1707.0, 1357.0, 1169.0, 1046.0, 1003.0, 977.0, 913.0, 945.0, 956.0, 905.0, 912.0, 874.0, 919.0, 959.0, 945.0, 931.0, 852.0, 1066.0, 977.0, 1012.0, 977.0, 1073.0, 1000.0, 1094.0, 1064.0, 983.0, 1048.0, 1045.0, 995.0, 1067.0, 1041.0, 1016.0, 1000.0, 994.0, 955.0, 941.0, 941.0, 838.0, 826.0, 775.0, 766.0, 653.0, 602.0, 607.0, 588.0, 729.0], [4722.0, 2717.0, 1918.0, 1548.0, 1350.0, 1179.0, 1057.0, 883.0, 842.0, 759.0, 777.0, 732.0, 726.0, 723.0, 716.0, 736.0, 800.0, 751.0, 743.0, 757.0, 822.0, 795.0, 856.0, 872.0, 878.0, 893.0, 971.0, 962.0, 998.0, 998.0, 1013.0, 1009.0, 1082.0, 1078.0, 1112.0, 1059.0, 1159.0, 1151.0, 1117.0, 1095.0, 1139.0, 1083.0, 1082.0, 1085.0, 981.0, 959.0, 905.0, 856.0, 866.0], [4747.0, 2646.0, 1927.0, 1456.0, 1244.0, 1118.0, 978.0, 853.0, 856.0, 690.0, 731.0, 729.0, 652.0, 621.0, 592.0, 608.0, 613.0, 607.0, 649.0, 675.0, 632.0, 603.0, 652.0, 683.0, 683.0, 747.0, 759.0, 800.0, 844.0, 880.0, 888.0, 919.0, 941.0, 1019.0, 1017.0, 1173.0, 1134.0, 1173.0, 1245.0, 1293.0, 1299.0, 1286.0, 1318.0, 1317.0, 1285.0, 1335.0, 1304.0, 1189.0, 1250.0], [4725.0, 2625.0, 1928.0, 1465.0, 1282.0, 1063.0, 902.0, 858.0, 747.0, 689.0, 620.0, 583.0, 621.0, 521.0, 489.0, 570.0, 537.0, 509.0, 482.0, 506.0, 505.0, 517.0, 567.0, 537.0, 552.0, 599.0, 632.0, 608.0, 633.0, 754.0, 771.0, 803.0, 796.0, 873.0, 923.0, 939.0, 1043.0, 1122.0, 1136.0, 1256.0, 1304.0, 1435.0, 1482.0, 1567.0, 1650.0, 1644.0, 1744.0, 1848.0, 1820.0], [4824.0, 2677.0, 1867.0, 1527.0, 1211.0, 1105.0, 950.0, 856.0, 780.0, 656.0, 624.0, 551.0, 580.0, 529.0, 523.0, 535.0, 478.0, 478.0, 418.0, 469.0, 446.0, 447.0, 452.0, 414.0, 517.0, 519.0, 522.0, 494.0, 548.0, 544.0, 558.0, 669.0, 608.0, 650.0, 780.0, 862.0, 857.0, 901.0, 1014.0, 1056.0, 1166.0, 1268.0, 1441.0, 1569.0, 1701.0, 1915.0, 2050.0, 2261.0, 2656.0], [4821.0, 2621.0, 1848.0, 1444.0, 1266.0, 1019.0, 940.0, 903.0, 693.0, 682.0, 603.0, 599.0, 585.0, 561.0, 488.0, 448.0, 446.0, 433.0, 419.0, 408.0, 426.0, 361.0, 376.0, 404.0, 355.0, 430.0, 412.0, 404.0, 446.0, 480.0, 457.0, 462.0, 482.0, 495.0, 579.0, 638.0, 665.0, 781.0, 804.0, 859.0, 1011.0, 1106.0, 1250.0, 1490.0, 1708.0, 2006.0, 2295.0, 2805.0, 3384.0], [4628.0, 2711.0, 1881.0, 1507.0, 1258.0, 1094.0, 965.0, 830.0, 735.0, 660.0, 559.0, 560.0, 517.0, 510.0, 497.0, 447.0, 447.0, 437.0, 448.0, 411.0, 353.0, 403.0, 369.0, 355.0, 377.0, 358.0, 358.0, 355.0, 370.0, 390.0, 395.0, 425.0, 450.0, 446.0, 458.0, 483.0, 565.0, 547.0, 598.0, 678.0, 791.0, 891.0, 992.0, 1211.0, 1391.0, 1867.0, 2153.0, 2867.0, 4028.0], [4710.0, 2657.0, 1798.0, 1508.0, 1217.0, 1065.0, 980.0, 810.0, 714.0, 726.0, 629.0, 555.0, 571.0, 495.0, 455.0, 425.0, 432.0, 419.0, 369.0, 347.0, 395.0, 368.0, 407.0, 347.0, 363.0, 375.0, 320.0, 327.0, 355.0, 357.0, 357.0, 386.0, 366.0, 393.0, 380.0, 427.0, 382.0, 428.0, 456.0, 519.0, 577.0, 698.0, 809.0, 962.0, 1196.0, 1510.0, 2029.0, 2675.0, 4247.0], [4612.0, 2616.0, 1810.0, 1522.0, 1226.0, 1067.0, 886.0, 834.0, 721.0, 718.0, 613.0, 591.0, 536.0, 496.0, 491.0, 495.0, 429.0, 406.0, 421.0, 404.0, 343.0, 322.0, 360.0, 323.0, 324.0, 343.0, 335.0, 357.0, 369.0, 333.0, 328.0, 304.0, 328.0, 322.0, 326.0, 312.0, 375.0, 401.0, 366.0, 385.0, 478.0, 519.0, 589.0, 712.0, 932.0, 1124.0, 1623.0, 2381.0, 4187.0], [4678.0, 2587.0, 1847.0, 1492.0, 1291.0, 1048.0, 929.0, 832.0, 708.0, 706.0, 621.0, 581.0, 517.0, 525.0, 477.0, 422.0, 425.0, 386.0, 377.0, 351.0, 386.0, 331.0, 325.0, 324.0, 338.0, 305.0, 338.0, 376.0, 312.0, 295.0, 323.0, 288.0, 316.0, 331.0, 307.0, 299.0, 334.0, 287.0, 339.0, 371.0, 363.0, 450.0, 484.0, 509.0, 642.0, 862.0, 1228.0, 1866.0, 3708.0], [4620.0, 2560.0, 1837.0, 1588.0, 1302.0, 1128.0, 930.0, 853.0, 701.0, 615.0, 597.0, 563.0, 593.0, 515.0, 521.0, 439.0, 443.0, 367.0, 396.0, 382.0, 356.0, 364.0, 322.0, 305.0, 326.0, 357.0, 321.0, 322.0, 300.0, 324.0, 289.0, 333.0, 324.0, 276.0, 283.0, 296.0, 330.0, 333.0, 324.0, 304.0, 301.0, 374.0, 390.0, 401.0, 484.0, 668.0, 965.0, 1461.0, 3020.0], [4566.0, 2586.0, 1876.0, 1483.0, 1234.0, 1100.0, 928.0, 840.0, 770.0, 612.0, 586.0, 558.0, 509.0, 459.0, 444.0, 458.0, 408.0, 423.0, 376.0, 406.0, 381.0, 359.0, 341.0, 341.0, 369.0, 358.0, 314.0, 313.0, 342.0, 282.0, 323.0, 312.0, 287.0, 300.0, 266.0, 286.0, 296.0, 257.0, 253.0, 290.0, 261.0, 300.0, 341.0, 324.0, 359.0, 489.0, 630.0, 1145.0, 2398.0], [4608.0, 2547.0, 1821.0, 1520.0, 1227.0, 1084.0, 926.0, 791.0, 750.0, 680.0, 643.0, 594.0, 526.0, 472.0, 468.0, 424.0, 440.0, 386.0, 362.0, 369.0, 343.0, 341.0, 339.0, 357.0, 346.0, 308.0, 276.0, 314.0, 295.0, 303.0, 286.0, 298.0, 283.0, 303.0, 274.0, 279.0, 264.0, 295.0, 301.0, 275.0, 334.0, 297.0, 292.0, 324.0, 324.0, 351.0, 471.0, 774.0, 1850.0], [4525.0, 2548.0, 1840.0, 1490.0, 1279.0, 1037.0, 888.0, 853.0, 719.0, 699.0, 637.0, 588.0, 531.0, 521.0, 441.0, 447.0, 460.0, 409.0, 358.0, 348.0, 374.0, 340.0, 294.0, 367.0, 326.0, 321.0, 315.0, 281.0, 330.0, 359.0, 331.0, 330.0, 338.0, 337.0, 266.0, 309.0, 298.0, 309.0, 254.0, 312.0, 310.0, 270.0, 287.0, 300.0, 310.0, 287.0, 384.0, 582.0, 1348.0], [4666.0, 2496.0, 1808.0, 1498.0, 1175.0, 1114.0, 972.0, 882.0, 765.0, 645.0, 580.0, 569.0, 538.0, 514.0, 538.0, 432.0, 394.0, 373.0, 372.0, 334.0, 376.0, 353.0, 325.0, 328.0, 330.0, 272.0, 307.0, 303.0, 283.0, 302.0, 343.0, 263.0, 311.0, 299.0, 297.0, 280.0, 265.0, 266.0, 257.0, 269.0, 288.0, 275.0, 343.0, 262.0, 298.0, 336.0, 336.0, 468.0, 946.0], [4549.0, 2590.0, 1788.0, 1398.0, 1247.0, 1032.0, 1000.0, 850.0, 736.0, 713.0, 642.0, 534.0, 554.0, 462.0, 448.0, 488.0, 420.0, 419.0, 367.0, 326.0, 325.0, 331.0, 351.0, 311.0, 376.0, 322.0, 295.0, 301.0, 311.0, 311.0, 311.0, 328.0, 319.0, 296.0, 302.0, 268.0, 252.0, 262.0, 292.0, 340.0, 258.0, 258.0, 270.0, 264.0, 265.0, 265.0, 320.0, 423.0, 680.0], [4634.0, 2502.0, 1748.0, 1462.0, 1223.0, 1078.0, 977.0, 841.0, 734.0, 678.0, 629.0, 504.0, 504.0, 502.0, 474.0, 469.0, 423.0, 423.0, 379.0, 337.0, 362.0, 419.0, 346.0, 359.0, 322.0, 366.0, 325.0, 284.0, 290.0, 301.0, 342.0, 301.0, 309.0, 292.0, 288.0, 258.0, 329.0, 277.0, 269.0, 265.0, 275.0, 288.0, 278.0, 322.0, 289.0, 295.0, 291.0, 346.0, 558.0], [4465.0, 2607.0, 1787.0, 1427.0, 1289.0, 1088.0, 926.0, 893.0, 755.0, 677.0, 581.0, 548.0, 567.0, 519.0, 465.0, 387.0, 474.0, 438.0, 382.0, 373.0, 347.0, 335.0, 362.0, 346.0, 378.0, 336.0, 301.0, 316.0, 324.0, 305.0, 299.0, 287.0, 327.0, 268.0, 271.0, 264.0, 308.0, 296.0, 273.0, 261.0, 288.0, 278.0, 277.0, 253.0, 276.0, 287.0, 245.0, 314.0, 425.0], [4665.0, 2505.0, 1861.0, 1477.0, 1198.0, 1093.0, 946.0, 857.0, 745.0, 737.0, 692.0, 584.0, 527.0, 456.0, 439.0, 451.0, 398.0, 388.0, 335.0, 353.0, 337.0, 327.0, 337.0, 294.0, 329.0, 326.0, 317.0, 338.0, 296.0, 319.0, 261.0, 322.0, 292.0, 279.0, 306.0, 257.0, 261.0, 271.0, 293.0, 279.0, 294.0, 259.0, 243.0, 239.0, 237.0, 283.0, 300.0, 324.0, 442.0], [4652.0, 2529.0, 1818.0, 1423.0, 1151.0, 1055.0, 1021.0, 805.0, 732.0, 729.0, 572.0, 582.0, 550.0, 504.0, 502.0, 466.0, 418.0, 376.0, 378.0, 342.0, 354.0, 381.0, 318.0, 335.0, 305.0, 327.0, 295.0, 309.0, 294.0, 301.0, 305.0, 261.0, 295.0, 294.0, 275.0, 278.0, 259.0, 280.0, 268.0, 297.0, 224.0, 283.0, 308.0, 243.0, 260.0, 256.0, 269.0, 299.0, 418.0], [4608.0, 2497.0, 1762.0, 1429.0, 1232.0, 1052.0, 908.0, 839.0, 772.0, 690.0, 663.0, 602.0, 556.0, 484.0, 484.0, 481.0, 388.0, 396.0, 359.0, 350.0, 337.0, 341.0, 310.0, 382.0, 343.0, 346.0, 307.0, 279.0, 291.0, 306.0, 272.0, 276.0, 276.0, 275.0, 274.0, 274.0, 266.0, 292.0, 269.0, 263.0, 282.0, 245.0, 275.0, 244.0, 308.0, 268.0, 319.0, 299.0, 357.0], [4455.0, 2620.0, 1804.0, 1413.0, 1205.0, 1056.0, 994.0, 839.0, 744.0, 671.0, 644.0, 589.0, 562.0, 517.0, 467.0, 449.0, 402.0, 402.0, 354.0, 371.0, 337.0, 345.0, 352.0, 314.0, 326.0, 333.0, 344.0, 288.0, 288.0, 322.0, 286.0, 313.0, 289.0, 280.0, 296.0, 323.0, 249.0, 279.0, 278.0, 246.0, 278.0, 268.0, 261.0, 302.0, 269.0, 312.0, 287.0, 272.0, 357.0], [4533.0, 2599.0, 1825.0, 1350.0, 1199.0, 994.0, 908.0, 883.0, 781.0, 661.0, 688.0, 610.0, 514.0, 555.0, 486.0, 460.0, 390.0, 365.0, 362.0, 383.0, 370.0, 346.0, 344.0, 361.0, 332.0, 274.0, 297.0, 288.0, 286.0, 283.0, 288.0, 254.0, 300.0, 299.0, 283.0, 258.0, 275.0, 258.0, 249.0, 268.0, 254.0, 270.0, 300.0, 282.0, 257.0, 287.0, 282.0, 284.0, 326.0], [4592.0, 2500.0, 1792.0, 1336.0, 1191.0, 1088.0, 959.0, 861.0, 768.0, 660.0, 650.0, 608.0, 586.0, 495.0, 451.0, 415.0, 401.0, 391.0, 389.0, 354.0, 359.0, 330.0, 332.0, 296.0, 346.0, 290.0, 300.0, 304.0, 313.0, 298.0, 294.0, 304.0, 313.0, 283.0, 255.0, 225.0, 248.0, 253.0, 305.0, 278.0, 267.0, 251.0, 309.0, 286.0, 282.0, 234.0, 273.0, 279.0, 361.0]],
    "Name": "sCurve-0",
    "Overflow": 2654747.0,
    "Type": "Histo2d",
    "Underflow": 0.0,
    "x": {
        "AxisTitle": "Vcal",
        "Bins": 51,
        "High": 302.5,
        "Low": 47.5
    },
    "y": {
        "AxisTitle": "Occupancy",
        "Bins": 49,
        "High": 49.5,
        "Low": 0.5
    },
    "z": {
        "AxisTitle": "Number of pixels"
    }
}