{
    "Data": [0.0, 0.0, 0.0, 0.0, 0.0, 0.0, 0.0, 0.0, 0.0, 1.0, 0.0, 0.0, 0.0, 3.0, 54.0, 26.0, 6.0, 99.0, 429.0, 238.0, 69.0, 528.0, 3326.0, 2602.0, 463.0, 1061.0, 3393.0, 3579.0, 886.0, 947.0, 2226.0, 3103.0, 1408.0, 665.0, 1174.0, 1977.0, 1469.0, 643.0, 1236.0, 2220.0, 2141.0, 998.0, 1189.0, 2263.0, 2081.0, 1293.0, 1039.0, 1726.0, 2283.0, 1716.0, 958.0, 1012.0, 1274.0, 1257.0, 800.0, 684.0, 787.0, 965.0, 735.0, 563.0, 519.0, 611.0, 640.0, 470.0, 377.0, 334.0, 450.0, 378.0, 295.0, 234.0, 254.0, 300.0, 263.0, 177.0, 131.0, 164.0, 187.0, 158.0, 108.0, 108.0, 121.0, 112.0, 72.0, 73.0, 73.0, 64.0, 41.0, 39.0, 38.0, 35.0, 38.0, 27.0, 22.0, 24.0, 23.0, 24.0, 21.0, 17.0, 22.0, 10.0, 16.0, 15.0, 10.0, 5.0, 14.0, 17.0, 7.0, 15.0, 11.0, 11.0, 8.0, 4.0, 9.0, 5.0, 10.0, 5.0, 10.0, 7.0, 4.0, 4.0, 4.0, 3.0, 7.0, 4.0, 1.0, 1.0, 7.0, 4.0, 2.0, 4.0, 5.0, 0.0, 1.0, 1.0, 2.0, 2.0, 3.0, 1.0, 3.0, 0.0, 2.0, 1.0, 3.0, 0.0, 1.0, 0.0, 0.0, 0.0, 2.0, 2.0, 3.0, 1.0, 0.0, 0.0, 0.0, 2.0, 1.0, 1.0, 0.0, 0.0, 1.0, 1.0, 1.0, 0.0, 1.0, 0.0, 0.0, 2.0, 0.0, 0.0, 1.0, 2.0, 1.0, 0.0, 0.0, 0.0, 0.0, 0.0, 2.0, 1.0, 0.0, 0.0, 0.0, 1.0, 0.0, 2.0, 1.0, 0.0, 0.0, 0.0, 0.0, 0.0, 0.0, 1.0, 0.0, 0.0, 0.0, 1.0, 0.0, 0.0, 0.0],
    "Name": "TimePerFitDist-0",
    "Overflow": 86.0,
    "Type": "Histo1d",
    "Underflow": 0.0,
    "x": {
        "AxisTitle": "Fit Time [us]",
        "Bins": 201,
        "High": 401.0,
        "Low": -1.0
    },
    "y": {
        "AxisTitle": "Number of Pixels"
    },
    "z": {
        "AxisTitle": "z"
    }
}