{
    "Data": [7.0, 5.0, 0.0, 0.0, 3.0, 25.0, 189.0, 572.0, 1295.0, 2544.0, 3932.0, 4883.0, 4930.0, 3802.0, 3112.0, 3162.0, 3889.0, 4645.0, 4663.0, 4066.0, 2793.0, 1685.0, 846.0, 422.0, 199.0, 111.0, 62.0, 37.0, 36.0, 22.0, 18.0, 22.0, 14.0, 10.0, 13.0, 9.0],
    "Name": "NoiseDist-0",
    "Overflow": 52.0,
    "Type": "Histo1d",
    "Underflow": 0.0,
    "x": {
        "AxisTitle": "Noise [e]",
        "Bins": 36,
        "High": 181.0,
        "Low": -2.0
    },
    "y": {
        "AxisTitle": "Number of Pixels"
    },
    "z": {
        "AxisTitle": "z"
    }
}