time,Hardware,Voltage,Current
1625770127244,high-voltage-2,1,0.119776
time,Hardware,Voltage,Current
1625770127244,high-voltage-2,2,0.180126
time,Hardware,Voltage,Current
1625770127244,high-voltage-2,3,0.215187
time,Hardware,Voltage,Current
1625770127244,high-voltage-2,4,0.245939
time,Hardware,Voltage,Current
1625770127244,high-voltage-2,5,0.274298
time,Hardware,Voltage,Current
1625770127244,high-voltage-2,6,0.305173
time,Hardware,Voltage,Current
1625770127244,high-voltage-2,7,0.333794
time,Hardware,Voltage,Current
1625770127244,high-voltage-2,8,0.362459
time,Hardware,Voltage,Current
1625770127244,high-voltage-2,9,0.388317
time,Hardware,Voltage,Current
1625770127244,high-voltage-2,10,0.407797
time,Hardware,Voltage,Current
1625770127244,high-voltage-2,11,0.424915
time,Hardware,Voltage,Current
1625770127244,high-voltage-2,12,0.441773
time,Hardware,Voltage,Current
1625770127244,high-voltage-2,13,0.453967
time,Hardware,Voltage,Current
1625770127244,high-voltage-2,14,0.465865
time,Hardware,Voltage,Current
1625770127244,high-voltage-2,15,0.478299
time,Hardware,Voltage,Current
1625770127244,high-voltage-2,16,0.490472
time,Hardware,Voltage,Current
1625770127244,high-voltage-2,17,0.499566
time,Hardware,Voltage,Current
1625770127244,high-voltage-2,18,0.509088
time,Hardware,Voltage,Current
1625770127244,high-voltage-2,19,0.51978
time,Hardware,Voltage,Current
1625770127244,high-voltage-2,20,0.529863
time,Hardware,Voltage,Current
1625770127244,high-voltage-2,25,0.580722
time,Hardware,Voltage,Current
1625770127244,high-voltage-2,30,0.632261
time,Hardware,Voltage,Current
1625770127244,high-voltage-2,35,0.684829
time,Hardware,Voltage,Current
1625770127244,high-voltage-2,40,0.74547
time,Hardware,Voltage,Current
1625770127244,high-voltage-2,45,0.822848
time,Hardware,Voltage,Current
1625770127244,high-voltage-2,50,0.882838
time,Hardware,Voltage,Current
1625770127244,high-voltage-2,55,0.936712
time,Hardware,Voltage,Current
1625770127244,high-voltage-2,60,0.99235
time,Hardware,Voltage,Current
1625770127244,high-voltage-2,65,1.0454
time,Hardware,Voltage,Current
1625770127244,high-voltage-2,70,1.09554
time,Hardware,Voltage,Current
1625770127244,high-voltage-2,75,1.14364
time,Hardware,Voltage,Current
1625770127244,high-voltage-2,80,1.1895
time,Hardware,Voltage,Current
1625770127244,high-voltage-2,85,1.23005
time,Hardware,Voltage,Current
1625770127244,high-voltage-2,90,1.26827
time,Hardware,Voltage,Current
1625770127244,high-voltage-2,95,1.3008
time,Hardware,Voltage,Current
1625770127244,high-voltage-2,100,1.32983
