time,Hardware,Voltage,Current
1626343689616,high-voltage-2,1,0.0963357
time,Hardware,Voltage,Current
1626343689616,high-voltage-2,2,0.138743
time,Hardware,Voltage,Current
1626343689616,high-voltage-2,3,0.160456
time,Hardware,Voltage,Current
1626343689616,high-voltage-2,4,0.17694
time,Hardware,Voltage,Current
1626343689616,high-voltage-2,5,0.19491
time,Hardware,Voltage,Current
1626343689616,high-voltage-2,6,0.215913
time,Hardware,Voltage,Current
1626343689616,high-voltage-2,7,0.236423
time,Hardware,Voltage,Current
1626343689616,high-voltage-2,8,0.259457
time,Hardware,Voltage,Current
1626343689616,high-voltage-2,9,0.285348
time,Hardware,Voltage,Current
1626343689616,high-voltage-2,10,0.309966
time,Hardware,Voltage,Current
1626343689616,high-voltage-2,11,0.331542
time,Hardware,Voltage,Current
1626343689616,high-voltage-2,12,0.35413
time,Hardware,Voltage,Current
1626343689616,high-voltage-2,13,0.374244
time,Hardware,Voltage,Current
1626343689616,high-voltage-2,14,0.390853
time,Hardware,Voltage,Current
1626343689616,high-voltage-2,15,0.407819
time,Hardware,Voltage,Current
1626343689616,high-voltage-2,16,0.420763
time,Hardware,Voltage,Current
1626343689616,high-voltage-2,17,0.432232
time,Hardware,Voltage,Current
1626343689616,high-voltage-2,18,0.444743
time,Hardware,Voltage,Current
1626343689616,high-voltage-2,19,0.455719
time,Hardware,Voltage,Current
1626343689616,high-voltage-2,20,0.46675
time,Hardware,Voltage,Current
1626343689616,high-voltage-2,25,0.520535
time,Hardware,Voltage,Current
1626343689616,high-voltage-2,30,0.570404
time,Hardware,Voltage,Current
1626343689616,high-voltage-2,35,0.625201
time,Hardware,Voltage,Current
1626343689616,high-voltage-2,40,0.68742
time,Hardware,Voltage,Current
1626343689616,high-voltage-2,45,0.764902
time,Hardware,Voltage,Current
1626343689616,high-voltage-2,50,0.824074
time,Hardware,Voltage,Current
1626343689616,high-voltage-2,55,0.878724
time,Hardware,Voltage,Current
1626343689616,high-voltage-2,60,0.93214
time,Hardware,Voltage,Current
1626343689616,high-voltage-2,65,0.982624
time,Hardware,Voltage,Current
1626343689616,high-voltage-2,70,1.02967
time,Hardware,Voltage,Current
1626343689616,high-voltage-2,75,1.07629
time,Hardware,Voltage,Current
1626343689616,high-voltage-2,80,1.12268
time,Hardware,Voltage,Current
1626343689616,high-voltage-2,85,1.16477
time,Hardware,Voltage,Current
1626343689616,high-voltage-2,90,1.2044
time,Hardware,Voltage,Current
1626343689616,high-voltage-2,95,1.24026
time,Hardware,Voltage,Current
1626343689616,high-voltage-2,100,1.27288
