time,Hardware,Voltage,Current
1622015632894,high-voltage,1,0.152757
time,Hardware,Voltage,Current
1622015632894,high-voltage,2,0.267334
time,Hardware,Voltage,Current
1622015632894,high-voltage,3,0.399365
time,Hardware,Voltage,Current
1622015632894,high-voltage,4,0.513691
time,Hardware,Voltage,Current
1622015632894,high-voltage,5,0.664031
time,Hardware,Voltage,Current
1622015632894,high-voltage,6,0.842465
time,Hardware,Voltage,Current
1622015632894,high-voltage,7,1.0701
time,Hardware,Voltage,Current
1622015632894,high-voltage,8,1.35302
time,Hardware,Voltage,Current
1622015632894,high-voltage,9,1.79481
time,Hardware,Voltage,Current
1622015632894,high-voltage,10,2.19631
time,Hardware,Voltage,Current
1622015632894,high-voltage,11,2.7067
time,Hardware,Voltage,Current
1622015632894,high-voltage,12,3.35144
time,Hardware,Voltage,Current
1622015632894,high-voltage,13,4.04335
time,Hardware,Voltage,Current
1622015632894,high-voltage,14,4.98078
time,Hardware,Voltage,Current
1622015632894,high-voltage,15,5.97271
time,Hardware,Voltage,Current
1622015632894,high-voltage,16,6.8106
time,Hardware,Voltage,Current
1622015632894,high-voltage,17,7.97268
time,Hardware,Voltage,Current
1622015632894,high-voltage,18,9.04655
time,Hardware,Voltage,Current
1622015632894,high-voltage,19,10.0001
