{
    "Data": [0.0, 0.0, 0.0, 0.0, 0.0, 0.0, 0.0, 0.0, 0.0, 0.0, 0.0, 0.0, 0.0, 0.0, 0.0, 1.0, 1.0, 3.0, 5.0, 4.0, 13.0, 20.0, 6.0, 15.0, 25.0, 38.0, 31.0, 41.0, 41.0, 48.0, 50.0, 50.0, 49.0, 48.0, 50.0, 50.0, 50.0, 45.0, 50.0, 50.0, 50.0, 50.0, 12.0, 50.0, 50.0, 34.0, 50.0, 50.0, 50.0, 50.0, 50.0],
    "Name": "Scurve-90-96",
    "Overflow": 0.0,
    "Type": "Histo1d",
    "Underflow": 0.0,
    "x": {
        "AxisTitle": "Vcal",
        "Bins": 51,
        "High": 302.5,
        "Low": 47.5
    },
    "y": {
        "AxisTitle": "Occupancy"
    },
    "z": {
        "AxisTitle": "z"
    }
}