{
    "Data": [0.0, 0.0, 0.0, 0.0, 0.0, 0.0, 0.0, 0.0, 0.0, 0.0, 0.0, 0.0, 0.0, 0.0, 2.0, 1.0, 0.0, 38.0, 131.0, 43.0, 55.0, 686.0, 1938.0, 690.0, 435.0, 1453.0, 2616.0, 1269.0, 725.0, 1145.0, 1672.0, 1070.0, 588.0, 596.0, 693.0, 679.0, 438.0, 531.0, 874.0, 835.0, 615.0, 773.0, 1719.0, 3157.0, 2133.0, 1483.0, 2049.0, 3288.0, 4141.0, 2948.0, 2357.0, 2392.0, 3220.0, 2626.0, 2088.0, 1746.0, 1696.0, 1965.0, 1521.0, 1393.0, 1192.0, 1192.0, 1037.0, 784.0, 640.0, 617.0, 609.0, 514.0, 502.0, 422.0, 413.0, 379.0, 308.0, 292.0, 271.0, 284.0, 247.0, 197.0, 175.0, 180.0, 167.0, 168.0, 131.0, 103.0, 98.0, 119.0, 101.0, 81.0, 84.0, 68.0, 64.0, 72.0, 56.0, 49.0, 54.0, 54.0, 44.0, 45.0, 55.0, 35.0, 29.0, 33.0, 22.0, 28.0, 30.0, 27.0, 28.0, 34.0, 31.0, 28.0, 21.0, 30.0, 32.0, 20.0, 19.0, 15.0, 23.0, 25.0, 22.0, 18.0, 14.0, 15.0, 12.0, 14.0, 7.0, 15.0, 15.0, 6.0, 6.0, 3.0, 9.0, 12.0, 8.0, 12.0, 8.0, 6.0, 9.0, 3.0, 7.0, 7.0, 4.0, 6.0, 4.0, 8.0, 7.0, 7.0, 5.0, 1.0, 7.0, 4.0, 5.0, 5.0, 8.0, 3.0, 2.0, 6.0, 6.0, 4.0, 1.0, 3.0, 3.0, 1.0, 2.0, 4.0, 3.0, 3.0, 3.0, 5.0, 3.0, 4.0, 2.0, 0.0, 3.0, 2.0, 5.0, 4.0, 1.0, 3.0, 3.0, 1.0, 2.0, 1.0, 3.0, 2.0, 2.0, 1.0, 1.0, 2.0, 2.0, 2.0, 1.0, 2.0, 3.0, 3.0, 3.0, 2.0, 3.0, 6.0, 3.0, 0.0, 3.0],
    "Name": "TimePerFitDist-0",
    "Overflow": 177.0,
    "Type": "Histo1d",
    "Underflow": 0.0,
    "x": {
        "AxisTitle": "Fit Time [us]",
        "Bins": 201,
        "High": 401.0,
        "Low": -1.0
    },
    "y": {
        "AxisTitle": "Number of Pixels"
    },
    "z": {
        "AxisTitle": "z"
    }
}