{
    "Data": [0.0, 0.0, 0.0, 0.0, 0.0, 0.0, 0.0, 0.0, 0.0, 0.0, 0.0, 0.0, 4.0, 0.0, 1.0, 1.0, 0.0, 4.0, 3.0, 3.0, 7.0, 2.0, 5.0, 11.0, 6.0, 8.0, 17.0, 11.0, 12.0, 15.0, 32.0, 16.0, 24.0, 6.0, 7.0, 4.0, 30.0, 50.0, 25.0, 23.0, 19.0, 43.0, 50.0, 50.0, 3.0, 3.0, 31.0, 47.0, 10.0, 46.0, 50.0],
    "Name": "Scurve-70-96",
    "Overflow": 0.0,
    "Type": "Histo1d",
    "Underflow": 0.0,
    "x": {
        "AxisTitle": "Vcal",
        "Bins": 51,
        "High": 302.5,
        "Low": 47.5
    },
    "y": {
        "AxisTitle": "Occupancy"
    },
    "z": {
        "AxisTitle": "z"
    }
}