time,Hardware,Voltage,Current
1626615740917,high-voltage-3,1,0.25195
time,Hardware,Voltage,Current
1626615740917,high-voltage-3,2,0.269414
time,Hardware,Voltage,Current
1626615740917,high-voltage-3,3,0.285679
time,Hardware,Voltage,Current
1626615740917,high-voltage-3,4,0.298567
time,Hardware,Voltage,Current
1626615740917,high-voltage-3,5,0.308469
time,Hardware,Voltage,Current
1626615740917,high-voltage-3,6,0.320122
time,Hardware,Voltage,Current
1626615740917,high-voltage-3,7,0.332654
time,Hardware,Voltage,Current
1626615740917,high-voltage-3,8,0.345774
time,Hardware,Voltage,Current
1626615740917,high-voltage-3,9,0.359125
time,Hardware,Voltage,Current
1626615740917,high-voltage-3,10,0.372252
time,Hardware,Voltage,Current
1626615740917,high-voltage-3,11,0.387229
time,Hardware,Voltage,Current
1626615740917,high-voltage-3,12,0.399434
time,Hardware,Voltage,Current
1626615740917,high-voltage-3,13,0.413572
time,Hardware,Voltage,Current
1626615740917,high-voltage-3,14,0.425786
time,Hardware,Voltage,Current
1626615740917,high-voltage-3,15,0.436309
time,Hardware,Voltage,Current
1626615740917,high-voltage-3,16,0.446076
time,Hardware,Voltage,Current
1626615740917,high-voltage-3,17,0.455794
time,Hardware,Voltage,Current
1626615740917,high-voltage-3,18,0.466242
time,Hardware,Voltage,Current
1626615740917,high-voltage-3,19,0.473348
time,Hardware,Voltage,Current
1626615740917,high-voltage-3,20,0.48194
time,Hardware,Voltage,Current
1626615740917,high-voltage-3,25,0.518532
time,Hardware,Voltage,Current
1626615740917,high-voltage-3,30,0.549281
time,Hardware,Voltage,Current
1626615740917,high-voltage-3,35,0.574633
time,Hardware,Voltage,Current
1626615740917,high-voltage-3,40,0.600004
time,Hardware,Voltage,Current
1626615740917,high-voltage-3,45,0.624027
time,Hardware,Voltage,Current
1626615740917,high-voltage-3,50,0.645787
time,Hardware,Voltage,Current
1626615740917,high-voltage-3,55,0.667034
time,Hardware,Voltage,Current
1626615740917,high-voltage-3,60,0.688774
time,Hardware,Voltage,Current
1626615740917,high-voltage-3,65,0.709384
time,Hardware,Voltage,Current
1626615740917,high-voltage-3,70,0.730247
time,Hardware,Voltage,Current
1626615740917,high-voltage-3,75,0.753069
time,Hardware,Voltage,Current
1626615740917,high-voltage-3,80,0.775303
time,Hardware,Voltage,Current
1626615740917,high-voltage-3,85,0.79869
time,Hardware,Voltage,Current
1626615740917,high-voltage-3,90,0.819654
time,Hardware,Voltage,Current
1626615740917,high-voltage-3,95,0.842107
time,Hardware,Voltage,Current
1626615740917,high-voltage-3,100,0.861897
