time,Hardware,Voltage,Current
1623356707823,high-voltage,1,0.0289813
time,Hardware,Voltage,Current
1623356707823,high-voltage,3.8412e-08,0.0388341
time,Hardware,Voltage,Current
1623356707823,high-voltage,3,0.047704
time,Hardware,Voltage,Current
1623356707823,high-voltage,4,0.0554499
time,Hardware,Voltage,Current
1623356707823,high-voltage,5,0.0618019
time,Hardware,Voltage,Current
1623356707823,high-voltage,6,0.0680086
time,Hardware,Voltage,Current
1623356707823,high-voltage,7,0.0740512
