{
    "Data": [3575.0, 23726.0, 17139.0, 6343.0, 2604.0, 2363.0, 2923.0, 3489.0, 3733.0, 3421.0, 2732.0, 2058.0, 1441.0, 960.0, 614.0, 333.0, 190.0, 96.0, 69.0, 28.0, 25.0, 11.0, 9.0, 5.0, 9.0, 0.0, 1.0, 3.0, 0.0, 0.0, 1.0, 1.0, 0.0, 0.0, 5.0, 2.0, 1.0, 0.0, 0.0, 2.0, 8.0, 1.0, 1.0, 0.0, 0.0, 0.0, 1.0, 7.0, 5.0, 1.0, 0.0],
    "Name": "Chi2Dist-0",
    "Overflow": 0.0,
    "Type": "Histo1d",
    "Underflow": 0.0,
    "x": {
        "AxisTitle": "Fit Chi/ndf",
        "Bins": 51,
        "High": 2.5250000953674318,
        "Low": -0.02500000037252903
    },
    "y": {
        "AxisTitle": "Number of Pixels"
    },
    "z": {
        "AxisTitle": "z"
    }
}