{
    "Data": [[2019.0, 659.0, 355.0, 239.0, 166.0, 130.0, 75.0, 59.0, 60.0, 39.0, 39.0, 37.0, 28.0, 20.0, 17.0, 16.0, 20.0, 15.0, 11.0, 11.0, 14.0, 9.0, 9.0, 9.0, 9.0, 7.0, 7.0, 8.0, 4.0, 6.0, 7.0, 4.0, 4.0, 4.0, 7.0, 6.0, 8.0, 4.0, 2.0, 5.0, 8.0, 4.0, 4.0, 6.0, 8.0, 5.0, 11.0, 11.0, 17.0], [3140.0, 1157.0, 608.0, 380.0, 251.0, 177.0, 148.0, 104.0, 67.0, 64.0, 47.0, 42.0, 35.0, 31.0, 24.0, 26.0, 30.0, 13.0, 20.0, 23.0, 17.0, 12.0, 18.0, 8.0, 9.0, 14.0, 7.0, 6.0, 9.0, 11.0, 8.0, 5.0, 3.0, 8.0, 7.0, 6.0, 9.0, 7.0, 4.0, 7.0, 3.0, 5.0, 6.0, 10.0, 10.0, 6.0, 8.0, 10.0, 14.0], [4366.0, 1974.0, 1174.0, 696.0, 467.0, 322.0, 237.0, 212.0, 163.0, 104.0, 108.0, 71.0, 71.0, 54.0, 54.0, 47.0, 48.0, 27.0, 23.0, 31.0, 24.0, 16.0, 21.0, 16.0, 17.0, 8.0, 12.0, 14.0, 13.0, 10.0, 9.0, 12.0, 13.0, 11.0, 11.0, 7.0, 15.0, 11.0, 5.0, 6.0, 9.0, 9.0, 3.0, 8.0, 9.0, 9.0, 13.0, 14.0, 18.0], [5158.0, 2589.0, 1766.0, 1166.0, 913.0, 647.0, 495.0, 380.0, 333.0, 264.0, 216.0, 175.0, 138.0, 120.0, 120.0, 100.0, 92.0, 73.0, 61.0, 49.0, 34.0, 37.0, 36.0, 26.0, 25.0, 28.0, 23.0, 29.0, 14.0, 19.0, 20.0, 17.0, 14.0, 12.0, 17.0, 15.0, 10.0, 8.0, 13.0, 12.0, 14.0, 13.0, 9.0, 17.0, 8.0, 14.0, 17.0, 14.0, 22.0], [5926.0, 3083.0, 2221.0, 1634.0, 1362.0, 1019.0, 854.0, 744.0, 622.0, 501.0, 431.0, 387.0, 317.0, 286.0, 221.0, 221.0, 203.0, 199.0, 127.0, 132.0, 118.0, 93.0, 103.0, 82.0, 66.0, 49.0, 67.0, 60.0, 41.0, 39.0, 34.0, 31.0, 41.0, 25.0, 24.0, 36.0, 24.0, 16.0, 22.0, 14.0, 20.0, 18.0, 16.0, 19.0, 19.0, 18.0, 23.0, 29.0, 32.0], [8730.0, 4292.0, 2777.0, 1997.0, 1552.0, 1351.0, 1159.0, 1001.0, 886.0, 815.0, 704.0, 625.0, 587.0, 488.0, 507.0, 430.0, 370.0, 351.0, 348.0, 280.0, 272.0, 224.0, 220.0, 177.0, 156.0, 161.0, 143.0, 134.0, 124.0, 107.0, 98.0, 93.0, 82.0, 63.0, 73.0, 43.0, 57.0, 44.0, 41.0, 47.0, 35.0, 32.0, 36.0, 36.0, 35.0, 36.0, 35.0, 26.0, 45.0], [7139.0, 6072.0, 4762.0, 3757.0, 2871.0, 2264.0, 1940.0, 1588.0, 1350.0, 1158.0, 1040.0, 957.0, 855.0, 804.0, 716.0, 661.0, 618.0, 559.0, 564.0, 526.0, 483.0, 451.0, 424.0, 407.0, 366.0, 364.0, 318.0, 293.0, 280.0, 270.0, 256.0, 196.0, 198.0, 186.0, 185.0, 170.0, 140.0, 125.0, 123.0, 130.0, 87.0, 91.0, 85.0, 79.0, 62.0, 71.0, 61.0, 86.0, 74.0], [1729.0, 2055.0, 2403.0, 2679.0, 2674.0, 2764.0, 2741.0, 2617.0, 2522.0, 2285.0, 2103.0, 2064.0, 1898.0, 1689.0, 1585.0, 1355.0, 1319.0, 1128.0, 1063.0, 953.0, 874.0, 822.0, 773.0, 733.0, 646.0, 651.0, 570.0, 567.0, 496.0, 482.0, 436.0, 432.0, 426.0, 375.0, 393.0, 336.0, 375.0, 349.0, 293.0, 296.0, 253.0, 215.0, 229.0, 204.0, 181.0, 157.0, 161.0, 143.0, 160.0], [648.0, 487.0, 507.0, 510.0, 565.0, 637.0, 769.0, 875.0, 944.0, 1078.0, 1305.0, 1363.0, 1467.0, 1575.0, 1601.0, 1661.0, 1727.0, 1815.0, 1774.0, 1850.0, 1708.0, 1768.0, 1733.0, 1683.0, 1581.0, 1670.0, 1449.0, 1445.0, 1399.0, 1295.0, 1217.0, 1135.0, 1062.0, 1001.0, 894.0, 851.0, 802.0, 731.0, 642.0, 605.0, 598.0, 561.0, 521.0, 477.0, 441.0, 440.0, 429.0, 398.0, 331.0], [507.0, 309.0, 227.0, 222.0, 189.0, 201.0, 211.0, 200.0, 217.0, 270.0, 283.0, 283.0, 330.0, 339.0, 423.0, 494.0, 525.0, 561.0, 627.0, 718.0, 803.0, 842.0, 928.0, 1079.0, 1154.0, 1251.0, 1365.0, 1491.0, 1539.0, 1630.0, 1657.0, 1776.0, 1832.0, 1884.0, 1974.0, 2043.0, 2008.0, 2046.0, 1988.0, 1977.0, 1945.0, 1877.0, 1680.0, 1630.0, 1442.0, 1352.0, 1225.0, 1044.0, 988.0], [464.0, 265.0, 177.0, 143.0, 132.0, 100.0, 87.0, 84.0, 77.0, 79.0, 77.0, 112.0, 106.0, 140.0, 148.0, 149.0, 169.0, 175.0, 207.0, 199.0, 255.0, 273.0, 311.0, 330.0, 331.0, 355.0, 397.0, 477.0, 538.0, 625.0, 679.0, 741.0, 825.0, 946.0, 993.0, 1210.0, 1368.0, 1524.0, 1769.0, 1993.0, 2137.0, 2469.0, 2744.0, 3117.0, 3503.0, 3785.0, 4047.0, 4135.0, 3983.0], [432.0, 226.0, 178.0, 151.0, 79.0, 82.0, 49.0, 41.0, 40.0, 47.0, 46.0, 47.0, 43.0, 52.0, 47.0, 49.0, 63.0, 77.0, 75.0, 89.0, 96.0, 103.0, 103.0, 124.0, 155.0, 186.0, 156.0, 189.0, 199.0, 272.0, 297.0, 318.0, 350.0, 361.0, 382.0, 494.0, 547.0, 599.0, 659.0, 883.0, 1023.0, 1190.0, 1526.0, 1825.0, 2349.0, 3091.0, 4253.0, 6098.0, 8981.0], [425.0, 221.0, 147.0, 120.0, 83.0, 77.0, 44.0, 28.0, 33.0, 34.0, 26.0, 36.0, 24.0, 24.0, 20.0, 31.0, 33.0, 29.0, 34.0, 33.0, 38.0, 33.0, 47.0, 58.0, 58.0, 58.0, 67.0, 76.0, 81.0, 104.0, 123.0, 133.0, 137.0, 169.0, 217.0, 252.0, 257.0, 277.0, 348.0, 427.0, 501.0, 604.0, 784.0, 887.0, 1233.0, 1631.0, 2476.0, 3846.0, 8291.0], [422.0, 234.0, 151.0, 97.0, 76.0, 59.0, 40.0, 35.0, 24.0, 21.0, 24.0, 26.0, 23.0, 22.0, 16.0, 24.0, 15.0, 26.0, 15.0, 17.0, 19.0, 28.0, 31.0, 33.0, 27.0, 25.0, 31.0, 31.0, 38.0, 43.0, 50.0, 54.0, 61.0, 63.0, 76.0, 108.0, 106.0, 133.0, 170.0, 203.0, 253.0, 286.0, 406.0, 499.0, 695.0, 922.0, 1384.0, 2421.0, 5386.0], [415.0, 216.0, 124.0, 118.0, 71.0, 45.0, 45.0, 28.0, 26.0, 23.0, 16.0, 13.0, 12.0, 21.0, 14.0, 30.0, 14.0, 31.0, 15.0, 15.0, 9.0, 18.0, 17.0, 18.0, 20.0, 13.0, 22.0, 25.0, 28.0, 38.0, 21.0, 32.0, 37.0, 25.0, 41.0, 39.0, 48.0, 56.0, 53.0, 94.0, 105.0, 130.0, 165.0, 219.0, 339.0, 465.0, 727.0, 1424.0, 3731.0], [394.0, 221.0, 132.0, 107.0, 60.0, 69.0, 36.0, 27.0, 26.0, 18.0, 15.0, 11.0, 11.0, 13.0, 14.0, 15.0, 12.0, 9.0, 12.0, 11.0, 17.0, 9.0, 17.0, 16.0, 14.0, 16.0, 16.0, 14.0, 22.0, 16.0, 12.0, 26.0, 24.0, 22.0, 23.0, 30.0, 45.0, 30.0, 49.0, 47.0, 59.0, 58.0, 84.0, 107.0, 138.0, 216.0, 353.0, 755.0, 2336.0], [364.0, 205.0, 146.0, 95.0, 69.0, 55.0, 36.0, 29.0, 20.0, 21.0, 13.0, 13.0, 10.0, 11.0, 15.0, 11.0, 13.0, 10.0, 15.0, 10.0, 10.0, 12.0, 10.0, 12.0, 7.0, 11.0, 17.0, 12.0, 16.0, 26.0, 10.0, 10.0, 24.0, 16.0, 29.0, 21.0, 23.0, 25.0, 33.0, 28.0, 37.0, 32.0, 73.0, 48.0, 71.0, 118.0, 166.0, 373.0, 1241.0], [381.0, 201.0, 138.0, 99.0, 63.0, 43.0, 29.0, 27.0, 24.0, 18.0, 16.0, 11.0, 14.0, 8.0, 13.0, 10.0, 8.0, 12.0, 13.0, 8.0, 8.0, 9.0, 11.0, 9.0, 11.0, 10.0, 8.0, 12.0, 8.0, 12.0, 9.0, 11.0, 15.0, 13.0, 17.0, 20.0, 26.0, 22.0, 21.0, 25.0, 30.0, 30.0, 47.0, 49.0, 49.0, 79.0, 94.0, 187.0, 681.0], [373.0, 209.0, 141.0, 105.0, 67.0, 57.0, 28.0, 28.0, 14.0, 11.0, 9.0, 5.0, 11.0, 11.0, 8.0, 7.0, 7.0, 4.0, 5.0, 9.0, 8.0, 10.0, 6.0, 13.0, 11.0, 7.0, 6.0, 8.0, 12.0, 14.0, 10.0, 15.0, 10.0, 6.0, 12.0, 11.0, 20.0, 16.0, 20.0, 21.0, 30.0, 29.0, 36.0, 39.0, 39.0, 65.0, 75.0, 132.0, 371.0], [391.0, 184.0, 148.0, 89.0, 72.0, 49.0, 27.0, 26.0, 22.0, 8.0, 11.0, 9.0, 11.0, 5.0, 3.0, 6.0, 9.0, 11.0, 4.0, 7.0, 2.0, 8.0, 3.0, 8.0, 4.0, 7.0, 7.0, 8.0, 10.0, 8.0, 8.0, 10.0, 11.0, 8.0, 19.0, 6.0, 12.0, 10.0, 13.0, 23.0, 17.0, 19.0, 27.0, 38.0, 39.0, 45.0, 79.0, 79.0, 232.0], [394.0, 183.0, 148.0, 87.0, 68.0, 46.0, 37.0, 22.0, 21.0, 14.0, 9.0, 6.0, 10.0, 6.0, 4.0, 7.0, 4.0, 4.0, 6.0, 2.0, 5.0, 8.0, 5.0, 7.0, 6.0, 7.0, 7.0, 3.0, 11.0, 6.0, 4.0, 5.0, 10.0, 11.0, 5.0, 4.0, 14.0, 8.0, 14.0, 10.0, 18.0, 12.0, 24.0, 29.0, 25.0, 39.0, 61.0, 89.0, 180.0], [366.0, 185.0, 144.0, 81.0, 87.0, 55.0, 29.0, 23.0, 13.0, 13.0, 8.0, 10.0, 12.0, 7.0, 8.0, 6.0, 5.0, 8.0, 4.0, 3.0, 5.0, 2.0, 5.0, 8.0, 8.0, 2.0, 4.0, 3.0, 5.0, 5.0, 3.0, 6.0, 5.0, 5.0, 7.0, 6.0, 10.0, 7.0, 7.0, 12.0, 12.0, 19.0, 14.0, 19.0, 37.0, 39.0, 38.0, 68.0, 145.0], [363.0, 194.0, 142.0, 111.0, 56.0, 40.0, 36.0, 25.0, 20.0, 11.0, 8.0, 8.0, 6.0, 5.0, 5.0, 3.0, 7.0, 4.0, 5.0, 2.0, 6.0, 8.0, 5.0, 2.0, 5.0, 1.0, 3.0, 6.0, 1.0, 1.0, 1.0, 7.0, 7.0, 8.0, 2.0, 4.0, 5.0, 9.0, 7.0, 7.0, 7.0, 18.0, 16.0, 10.0, 16.0, 28.0, 40.0, 69.0, 122.0], [366.0, 205.0, 159.0, 80.0, 65.0, 56.0, 31.0, 17.0, 13.0, 15.0, 7.0, 5.0, 7.0, 5.0, 7.0, 2.0, 9.0, 2.0, 10.0, 4.0, 0.0, 5.0, 2.0, 3.0, 3.0, 5.0, 3.0, 2.0, 11.0, 6.0, 2.0, 3.0, 5.0, 8.0, 3.0, 3.0, 8.0, 6.0, 2.0, 4.0, 3.0, 13.0, 13.0, 8.0, 22.0, 23.0, 37.0, 50.0, 87.0], [342.0, 214.0, 130.0, 106.0, 60.0, 61.0, 41.0, 25.0, 23.0, 3.0, 11.0, 7.0, 9.0, 4.0, 4.0, 3.0, 3.0, 4.0, 4.0, 5.0, 4.0, 4.0, 5.0, 7.0, 5.0, 1.0, 3.0, 2.0, 1.0, 4.0, 7.0, 6.0, 2.0, 5.0, 3.0, 3.0, 5.0, 4.0, 7.0, 5.0, 7.0, 3.0, 9.0, 6.0, 7.0, 21.0, 24.0, 38.0, 95.0], [376.0, 181.0, 142.0, 99.0, 77.0, 50.0, 29.0, 16.0, 10.0, 15.0, 10.0, 6.0, 3.0, 8.0, 4.0, 6.0, 3.0, 5.0, 6.0, 6.0, 0.0, 1.0, 1.0, 4.0, 1.0, 7.0, 2.0, 4.0, 3.0, 4.0, 5.0, 1.0, 4.0, 1.0, 3.0, 3.0, 6.0, 9.0, 3.0, 7.0, 2.0, 7.0, 6.0, 7.0, 11.0, 11.0, 31.0, 30.0, 93.0], [353.0, 209.0, 144.0, 90.0, 64.0, 52.0, 33.0, 14.0, 20.0, 10.0, 11.0, 3.0, 7.0, 7.0, 5.0, 6.0, 7.0, 8.0, 1.0, 3.0, 2.0, 2.0, 5.0, 2.0, 3.0, 4.0, 3.0, 2.0, 3.0, 3.0, 3.0, 4.0, 5.0, 3.0, 1.0, 4.0, 0.0, 4.0, 3.0, 2.0, 6.0, 3.0, 9.0, 6.0, 10.0, 7.0, 19.0, 32.0, 70.0], [366.0, 214.0, 135.0, 87.0, 61.0, 52.0, 30.0, 25.0, 10.0, 10.0, 9.0, 5.0, 6.0, 3.0, 3.0, 7.0, 4.0, 6.0, 7.0, 3.0, 1.0, 2.0, 1.0, 0.0, 6.0, 1.0, 3.0, 4.0, 3.0, 6.0, 5.0, 4.0, 2.0, 4.0, 2.0, 1.0, 7.0, 3.0, 1.0, 2.0, 4.0, 7.0, 2.0, 8.0, 3.0, 11.0, 14.0, 37.0, 54.0], [392.0, 176.0, 135.0, 105.0, 65.0, 49.0, 31.0, 22.0, 18.0, 14.0, 6.0, 7.0, 6.0, 2.0, 2.0, 4.0, 3.0, 5.0, 4.0, 5.0, 2.0, 4.0, 3.0, 2.0, 1.0, 2.0, 3.0, 3.0, 1.0, 4.0, 3.0, 4.0, 2.0, 1.0, 2.0, 3.0, 5.0, 3.0, 4.0, 2.0, 4.0, 5.0, 1.0, 4.0, 9.0, 2.0, 17.0, 31.0, 39.0], [399.0, 195.0, 124.0, 95.0, 73.0, 47.0, 30.0, 23.0, 18.0, 6.0, 9.0, 9.0, 5.0, 8.0, 5.0, 5.0, 3.0, 7.0, 3.0, 2.0, 1.0, 7.0, 4.0, 7.0, 1.0, 0.0, 1.0, 3.0, 3.0, 2.0, 2.0, 3.0, 3.0, 0.0, 2.0, 4.0, 2.0, 1.0, 1.0, 4.0, 4.0, 5.0, 0.0, 5.0, 6.0, 5.0, 12.0, 27.0, 41.0], [356.0, 199.0, 136.0, 113.0, 55.0, 42.0, 28.0, 30.0, 19.0, 15.0, 7.0, 8.0, 6.0, 5.0, 7.0, 2.0, 1.0, 4.0, 3.0, 2.0, 3.0, 5.0, 5.0, 1.0, 4.0, 3.0, 6.0, 3.0, 2.0, 0.0, 3.0, 1.0, 1.0, 2.0, 2.0, 2.0, 1.0, 2.0, 3.0, 4.0, 5.0, 2.0, 1.0, 2.0, 6.0, 7.0, 7.0, 16.0, 40.0], [386.0, 200.0, 131.0, 99.0, 74.0, 50.0, 21.0, 21.0, 8.0, 11.0, 6.0, 8.0, 5.0, 6.0, 7.0, 5.0, 2.0, 2.0, 3.0, 3.0, 1.0, 5.0, 2.0, 5.0, 3.0, 0.0, 0.0, 1.0, 4.0, 3.0, 3.0, 2.0, 3.0, 5.0, 0.0, 5.0, 2.0, 2.0, 1.0, 2.0, 0.0, 2.0, 4.0, 4.0, 3.0, 3.0, 7.0, 18.0, 39.0], [378.0, 197.0, 156.0, 97.0, 75.0, 41.0, 23.0, 28.0, 13.0, 12.0, 8.0, 4.0, 6.0, 3.0, 7.0, 3.0, 3.0, 4.0, 1.0, 1.0, 10.0, 2.0, 3.0, 3.0, 3.0, 4.0, 2.0, 0.0, 4.0, 1.0, 3.0, 0.0, 2.0, 2.0, 2.0, 1.0, 3.0, 1.0, 1.0, 5.0, 4.0, 1.0, 5.0, 2.0, 9.0, 6.0, 3.0, 12.0, 21.0], [384.0, 203.0, 137.0, 97.0, 75.0, 36.0, 30.0, 23.0, 16.0, 16.0, 12.0, 4.0, 5.0, 9.0, 7.0, 4.0, 8.0, 2.0, 3.0, 2.0, 4.0, 3.0, 6.0, 4.0, 1.0, 2.0, 2.0, 2.0, 0.0, 3.0, 2.0, 3.0, 1.0, 3.0, 1.0, 0.0, 1.0, 3.0, 1.0, 2.0, 2.0, 6.0, 6.0, 4.0, 3.0, 6.0, 7.0, 6.0, 22.0], [395.0, 188.0, 129.0, 91.0, 54.0, 45.0, 46.0, 16.0, 13.0, 19.0, 9.0, 7.0, 9.0, 5.0, 4.0, 4.0, 4.0, 3.0, 2.0, 1.0, 1.0, 2.0, 5.0, 2.0, 2.0, 4.0, 3.0, 2.0, 1.0, 4.0, 4.0, 5.0, 2.0, 1.0, 1.0, 4.0, 0.0, 1.0, 0.0, 2.0, 3.0, 0.0, 3.0, 4.0, 3.0, 1.0, 6.0, 6.0, 26.0], [375.0, 182.0, 131.0, 98.0, 76.0, 47.0, 31.0, 18.0, 13.0, 5.0, 11.0, 9.0, 8.0, 5.0, 3.0, 2.0, 9.0, 4.0, 5.0, 2.0, 4.0, 1.0, 5.0, 0.0, 2.0, 2.0, 2.0, 4.0, 2.0, 1.0, 4.0, 3.0, 1.0, 1.0, 2.0, 2.0, 1.0, 2.0, 3.0, 0.0, 0.0, 2.0, 2.0, 2.0, 3.0, 3.0, 7.0, 4.0, 19.0], [377.0, 201.0, 146.0, 102.0, 56.0, 46.0, 32.0, 19.0, 17.0, 20.0, 7.0, 3.0, 5.0, 3.0, 4.0, 5.0, 4.0, 6.0, 3.0, 3.0, 1.0, 3.0, 3.0, 2.0, 1.0, 4.0, 2.0, 1.0, 6.0, 2.0, 2.0, 1.0, 1.0, 2.0, 1.0, 2.0, 3.0, 1.0, 1.0, 0.0, 1.0, 1.0, 1.0, 4.0, 4.0, 2.0, 2.0, 7.0, 17.0], [356.0, 199.0, 131.0, 106.0, 61.0, 40.0, 39.0, 25.0, 17.0, 14.0, 8.0, 5.0, 4.0, 7.0, 6.0, 3.0, 1.0, 6.0, 2.0, 4.0, 4.0, 4.0, 3.0, 1.0, 2.0, 0.0, 3.0, 6.0, 1.0, 2.0, 1.0, 1.0, 1.0, 3.0, 3.0, 3.0, 0.0, 2.0, 2.0, 1.0, 1.0, 2.0, 1.0, 1.0, 4.0, 4.0, 5.0, 7.0, 7.0], [363.0, 194.0, 127.0, 95.0, 60.0, 47.0, 35.0, 29.0, 14.0, 9.0, 6.0, 13.0, 5.0, 5.0, 7.0, 3.0, 3.0, 4.0, 4.0, 1.0, 3.0, 0.0, 1.0, 4.0, 4.0, 3.0, 3.0, 1.0, 1.0, 4.0, 4.0, 5.0, 1.0, 0.0, 0.0, 2.0, 1.0, 3.0, 1.0, 0.0, 3.0, 0.0, 3.0, 1.0, 2.0, 2.0, 3.0, 4.0, 12.0], [369.0, 197.0, 137.0, 103.0, 65.0, 48.0, 38.0, 24.0, 13.0, 12.0, 8.0, 11.0, 10.0, 1.0, 2.0, 4.0, 4.0, 2.0, 3.0, 3.0, 4.0, 0.0, 1.0, 3.0, 2.0, 3.0, 1.0, 3.0, 2.0, 5.0, 2.0, 2.0, 0.0, 2.0, 1.0, 2.0, 0.0, 3.0, 3.0, 1.0, 2.0, 0.0, 0.0, 1.0, 2.0, 3.0, 5.0, 4.0, 10.0], [369.0, 201.0, 146.0, 81.0, 74.0, 44.0, 35.0, 13.0, 25.0, 9.0, 5.0, 7.0, 4.0, 5.0, 2.0, 4.0, 3.0, 5.0, 2.0, 5.0, 2.0, 1.0, 6.0, 1.0, 1.0, 2.0, 0.0, 2.0, 5.0, 4.0, 6.0, 2.0, 0.0, 2.0, 0.0, 0.0, 2.0, 1.0, 1.0, 3.0, 2.0, 1.0, 3.0, 3.0, 3.0, 2.0, 2.0, 6.0, 15.0], [387.0, 222.0, 131.0, 92.0, 73.0, 47.0, 33.0, 31.0, 11.0, 14.0, 8.0, 7.0, 7.0, 5.0, 8.0, 6.0, 2.0, 5.0, 2.0, 1.0, 4.0, 1.0, 3.0, 4.0, 3.0, 2.0, 2.0, 7.0, 3.0, 2.0, 0.0, 2.0, 2.0, 0.0, 2.0, 0.0, 3.0, 2.0, 0.0, 2.0, 2.0, 0.0, 0.0, 1.0, 5.0, 3.0, 3.0, 4.0, 14.0], [374.0, 218.0, 134.0, 106.0, 57.0, 31.0, 46.0, 20.0, 9.0, 12.0, 8.0, 8.0, 6.0, 5.0, 1.0, 3.0, 6.0, 3.0, 3.0, 2.0, 1.0, 3.0, 1.0, 4.0, 10.0, 3.0, 2.0, 3.0, 1.0, 3.0, 3.0, 1.0, 0.0, 1.0, 3.0, 0.0, 1.0, 0.0, 2.0, 0.0, 0.0, 2.0, 2.0, 2.0, 1.0, 3.0, 1.0, 4.0, 6.0], [369.0, 199.0, 143.0, 100.0, 79.0, 49.0, 31.0, 23.0, 16.0, 10.0, 4.0, 12.0, 2.0, 4.0, 4.0, 5.0, 3.0, 3.0, 2.0, 2.0, 5.0, 2.0, 3.0, 5.0, 6.0, 4.0, 1.0, 2.0, 2.0, 5.0, 1.0, 1.0, 0.0, 2.0, 1.0, 3.0, 3.0, 0.0, 1.0, 0.0, 0.0, 1.0, 0.0, 0.0, 4.0, 1.0, 6.0, 4.0, 12.0], [367.0, 222.0, 143.0, 105.0, 80.0, 43.0, 45.0, 15.0, 15.0, 9.0, 4.0, 4.0, 3.0, 2.0, 12.0, 5.0, 3.0, 6.0, 6.0, 1.0, 4.0, 2.0, 4.0, 3.0, 1.0, 4.0, 2.0, 4.0, 3.0, 0.0, 0.0, 2.0, 4.0, 1.0, 0.0, 0.0, 2.0, 0.0, 1.0, 1.0, 2.0, 3.0, 0.0, 2.0, 0.0, 3.0, 2.0, 5.0, 11.0], [366.0, 219.0, 149.0, 104.0, 78.0, 40.0, 31.0, 20.0, 17.0, 9.0, 9.0, 9.0, 8.0, 7.0, 5.0, 3.0, 1.0, 5.0, 5.0, 2.0, 1.0, 1.0, 6.0, 2.0, 0.0, 4.0, 4.0, 2.0, 5.0, 2.0, 2.0, 4.0, 2.0, 2.0, 2.0, 0.0, 1.0, 2.0, 0.0, 2.0, 0.0, 0.0, 0.0, 1.0, 2.0, 2.0, 2.0, 7.0, 9.0], [387.0, 214.0, 128.0, 99.0, 68.0, 51.0, 30.0, 21.0, 14.0, 7.0, 4.0, 7.0, 6.0, 6.0, 3.0, 7.0, 2.0, 5.0, 2.0, 2.0, 5.0, 0.0, 3.0, 2.0, 2.0, 2.0, 4.0, 3.0, 1.0, 4.0, 3.0, 1.0, 2.0, 1.0, 1.0, 0.0, 3.0, 0.0, 2.0, 1.0, 3.0, 1.0, 1.0, 3.0, 1.0, 1.0, 4.0, 3.0, 7.0], [389.0, 200.0, 127.0, 93.0, 61.0, 64.0, 41.0, 11.0, 16.0, 7.0, 6.0, 5.0, 11.0, 4.0, 4.0, 4.0, 8.0, 1.0, 3.0, 5.0, 2.0, 2.0, 4.0, 2.0, 9.0, 0.0, 3.0, 4.0, 1.0, 2.0, 3.0, 4.0, 2.0, 1.0, 0.0, 0.0, 0.0, 1.0, 1.0, 1.0, 1.0, 1.0, 1.0, 0.0, 4.0, 2.0, 2.0, 3.0, 6.0], [360.0, 198.0, 135.0, 113.0, 70.0, 46.0, 30.0, 26.0, 15.0, 8.0, 8.0, 9.0, 5.0, 7.0, 5.0, 3.0, 3.0, 4.0, 6.0, 4.0, 3.0, 3.0, 3.0, 2.0, 3.0, 3.0, 2.0, 2.0, 2.0, 0.0, 5.0, 2.0, 0.0, 4.0, 0.0, 2.0, 1.0, 2.0, 0.0, 0.0, 1.0, 1.0, 1.0, 0.0, 2.0, 0.0, 2.0, 6.0, 6.0], [373.0, 212.0, 137.0, 102.0, 64.0, 31.0, 25.0, 21.0, 16.0, 12.0, 5.0, 7.0, 10.0, 6.0, 8.0, 6.0, 4.0, 5.0, 4.0, 3.0, 3.0, 3.0, 1.0, 0.0, 2.0, 5.0, 1.0, 2.0, 3.0, 2.0, 5.0, 1.0, 2.0, 2.0, 1.0, 0.0, 2.0, 1.0, 1.0, 1.0, 0.0, 1.0, 2.0, 2.0, 3.0, 2.0, 1.0, 2.0, 6.0], [355.0, 235.0, 144.0, 98.0, 64.0, 43.0, 35.0, 25.0, 17.0, 8.0, 5.0, 5.0, 8.0, 5.0, 5.0, 1.0, 7.0, 4.0, 3.0, 2.0, 1.0, 4.0, 2.0, 3.0, 4.0, 7.0, 3.0, 4.0, 1.0, 0.0, 2.0, 2.0, 1.0, 2.0, 2.0, 1.0, 2.0, 2.0, 1.0, 1.0, 1.0, 1.0, 1.0, 0.0, 2.0, 1.0, 1.0, 3.0, 8.0]],
    "Name": "sCurve-0",
    "Overflow": 1999273.0,
    "Type": "Histo2d",
    "Underflow": 0.0,
    "x": {
        "AxisTitle": "Vcal",
        "Bins": 51,
        "High": 302.5,
        "Low": 47.5
    },
    "y": {
        "AxisTitle": "Occupancy",
        "Bins": 49,
        "High": 49.5,
        "Low": 0.5
    },
    "z": {
        "AxisTitle": "Number of pixels"
    }
}