time,Hardware,Voltage,Current
1621973332887,high-voltage-3,1,0.160508
time,Hardware,Voltage,Current
1621973332887,high-voltage-3,2,0.172057
time,Hardware,Voltage,Current
1621973332887,high-voltage-3,3,0.182394
time,Hardware,Voltage,Current
1621973332887,high-voltage-3,4,0.191862
time,Hardware,Voltage,Current
1621973332887,high-voltage-3,5,0.199867
time,Hardware,Voltage,Current
1621973332887,high-voltage-3,6,0.207972
time,Hardware,Voltage,Current
1621973332887,high-voltage-3,7,7e+06
time,Hardware,Voltage,Current
1621973332887,high-voltage-3,8,0.224851
time,Hardware,Voltage,Current
1621973332887,high-voltage-3,9,0.234971
time,Hardware,Voltage,Current
1621973332887,high-voltage-3,10,0.245393
time,Hardware,Voltage,Current
1621973332887,high-voltage-3,11,0.254799
time,Hardware,Voltage,Current
1621973332887,high-voltage-3,12,0.264715
time,Hardware,Voltage,Current
1621973332887,high-voltage-3,13,0.2733
time,Hardware,Voltage,Current
1621973332887,high-voltage-3,14,0.282625
time,Hardware,Voltage,Current
1621973332887,high-voltage-3,15,0.288627
time,Hardware,Voltage,Current
1621973332887,high-voltage-3,16,0.295919
time,Hardware,Voltage,Current
1621973332887,high-voltage-3,17,0.303847
time,Hardware,Voltage,Current
1621973332887,high-voltage-3,18,0.309181
time,Hardware,Voltage,Current
1621973332887,high-voltage-3,19,0.313635
time,Hardware,Voltage,Current
1621973332887,high-voltage-3,20,0.319379
time,Hardware,Voltage,Current
1621973332887,high-voltage-3,25,0.344454
time,Hardware,Voltage,Current
1621973332887,high-voltage-3,30,0.365791
time,Hardware,Voltage,Current
1621973332887,high-voltage-3,35,0.387314
time,Hardware,Voltage,Current
1621973332887,high-voltage-3,40,0.406384
time,Hardware,Voltage,Current
1621973332887,high-voltage-3,45,0.424381
time,Hardware,Voltage,Current
1621973332887,high-voltage-3,50,0.443054
time,Hardware,Voltage,Current
1621973332887,high-voltage-3,55,0.45886
time,Hardware,Voltage,Current
1621973332887,high-voltage-3,60,0.472185
time,Hardware,Voltage,Current
1621973332887,high-voltage-3,65,0.486337
time,Hardware,Voltage,Current
1621973332887,high-voltage-3,70,0.500411
time,Hardware,Voltage,Current
1621973332887,high-voltage-3,75,0.514052
time,Hardware,Voltage,Current
1621973332887,high-voltage-3,80,0.525805
time,Hardware,Voltage,Current
1621973332887,high-voltage-3,85,0.540898
time,Hardware,Voltage,Current
1621973332887,high-voltage-3,90,0.555716
time,Hardware,Voltage,Current
1621973332887,high-voltage-3,95,0.568224
time,Hardware,Voltage,Current
1621973332887,high-voltage-3,100,0.580111
