{
    "Data": [1546.0, 15502.0, 14579.0, 7885.0, 4619.0, 3439.0, 3022.0, 2790.0, 2479.0, 2012.0, 1543.0, 1091.0, 770.0, 544.0, 456.0, 355.0, 295.0, 257.0, 260.0, 212.0, 214.0, 222.0, 211.0, 209.0, 224.0, 191.0, 166.0, 143.0, 156.0, 135.0, 134.0, 148.0, 132.0, 127.0, 113.0, 106.0, 97.0, 90.0, 87.0, 100.0, 59.0, 43.0, 58.0, 59.0, 45.0, 57.0, 52.0, 32.0, 40.0, 29.0, 11.0],
    "Name": "Chi2Dist-0",
    "Overflow": 0.0,
    "Type": "Histo1d",
    "Underflow": 0.0,
    "x": {
        "AxisTitle": "Fit Chi/ndf",
        "Bins": 51,
        "High": 2.5250000953674318,
        "Low": -0.02500000037252903
    },
    "y": {
        "AxisTitle": "Number of Pixels"
    },
    "z": {
        "AxisTitle": "z"
    }
}