{
    "Data": [0.0, 0.0, 0.0, 0.0, 0.0, 0.0, 0.0, 0.0, 0.0, 0.0, 0.0, 0.0, 0.0, 0.0, 0.0, 0.0, 0.0, 0.0, 0.0, 0.0, 0.0, 0.0, 0.0, 0.0, 0.0, 0.0, 0.0, 0.0, 0.0, 0.0, 0.0, 0.0, 0.0, 0.0, 0.0, 0.0, 0.0, 0.0, 0.0, 0.0, 0.0, 0.0, 0.0, 0.0, 0.0, 0.0, 0.0, 0.0, 0.0, 0.0, 116.0, 189.0, 184.0, 216.0, 180.0, 222.0, 185.0, 211.0, 238.0, 251.0, 262.0, 254.0, 282.0, 243.0, 283.0, 256.0, 310.0, 287.0, 291.0, 357.0, 290.0, 307.0, 330.0, 337.0, 350.0, 340.0, 342.0, 385.0, 324.0, 383.0, 380.0, 404.0, 384.0, 401.0, 433.0, 371.0, 424.0, 402.0, 406.0, 417.0, 463.0, 409.0, 433.0, 454.0, 471.0, 421.0, 416.0, 418.0, 450.0, 467.0, 424.0, 468.0, 485.0, 475.0, 459.0, 458.0, 451.0, 462.0, 453.0, 448.0, 451.0, 438.0, 443.0, 502.0, 457.0, 442.0, 440.0, 421.0, 449.0, 429.0, 416.0, 435.0, 414.0, 408.0, 398.0, 362.0, 350.0, 370.0, 324.0, 338.0, 356.0, 344.0, 373.0, 335.0, 335.0, 343.0, 323.0, 337.0, 313.0, 312.0, 273.0, 282.0, 262.0, 273.0, 274.0, 290.0, 261.0, 257.0, 231.0, 240.0, 236.0, 244.0, 218.0, 216.0, 223.0, 229.0, 214.0, 192.0, 195.0, 235.0, 230.0, 202.0, 213.0, 243.0, 238.0, 254.0, 257.0, 284.0, 299.0, 339.0, 374.0, 404.0, 456.0, 507.0, 502.0, 567.0, 644.0, 699.0, 744.0, 765.0, 815.0, 830.0, 853.0, 884.0, 926.0, 888.0, 927.0, 888.0, 885.0, 941.0, 868.0, 850.0, 852.0, 807.0, 744.0, 682.0, 687.0, 589.0, 587.0, 499.0, 463.0, 441.0, 400.0, 351.0, 299.0, 294.0, 262.0, 250.0, 204.0, 177.0, 169.0, 157.0, 139.0, 129.0, 104.0, 105.0, 78.0, 58.0, 53.0, 43.0, 56.0, 48.0, 42.0, 39.0, 34.0, 28.0, 30.0, 25.0, 29.0, 21.0, 25.0, 18.0, 16.0, 13.0, 22.0, 21.0, 19.0, 21.0, 15.0, 12.0, 10.0, 11.0, 8.0, 17.0, 15.0, 11.0, 7.0, 10.0, 7.0, 8.0, 11.0, 9.0, 7.0, 5.0, 8.0, 7.0, 5.0, 12.0, 4.0, 3.0, 6.0, 9.0, 4.0, 4.0, 5.0, 7.0, 5.0, 4.0, 2.0, 2.0, 4.0, 3.0, 1.0, 3.0, 6.0, 3.0, 3.0, 2.0, 3.0, 1.0, 3.0, 2.0, 2.0, 1.0, 2.0, 6.0, 1.0, 1.0, 0.0, 1.0, 3.0, 0.0, 2.0, 2.0, 2.0, 1.0, 3.0, 0.0, 1.0, 0.0, 1.0, 1.0, 0.0, 3.0, 2.0, 1.0, 0.0, 0.0, 0.0, 1.0, 0.0, 0.0, 2.0, 1.0, 0.0, 1.0, 0.0, 0.0, 0.0, 0.0, 0.0, 0.0, 1.0, 0.0, 1.0, 0.0, 0.0, 0.0, 0.0, 0.0, 0.0, 0.0, 0.0, 0.0, 0.0, 0.0, 0.0, 0.0, 0.0, 0.0, 0.0, 0.0, 0.0, 0.0, 0.0, 0.0, 0.0, 0.0, 0.0, 0.0, 0.0, 0.0, 0.0, 0.0, 0.0, 0.0, 0.0, 0.0, 0.0, 0.0, 0.0, 0.0, 0.0, 0.0, 0.0, 0.0, 0.0, 0.0, 0.0, 0.0, 0.0, 0.0, 0.0, 0.0, 0.0, 0.0],
    "Name": "ThresholdDist-0",
    "Overflow": 0.0,
    "Type": "Histo1d",
    "Underflow": 0.0,
    "x": {
        "AxisTitle": "Threshold [e]",
        "Bins": 376,
        "High": 3755.0,
        "Low": -5.0
    },
    "y": {
        "AxisTitle": "Number of Pixels"
    },
    "z": {
        "AxisTitle": "z"
    }
}