{
    "Data": [2512.0, 17005.0, 9554.0, 3777.0, 2439.0, 2345.0, 2619.0, 2697.0, 2484.0, 2198.0, 1783.0, 1435.0, 1089.0, 875.0, 619.0, 471.0, 415.0, 374.0, 340.0, 314.0, 290.0, 277.0, 236.0, 239.0, 225.0, 196.0, 157.0, 172.0, 169.0, 186.0, 129.0, 123.0, 125.0, 111.0, 100.0, 80.0, 94.0, 74.0, 57.0, 39.0, 35.0, 42.0, 30.0, 23.0, 21.0, 22.0, 17.0, 32.0, 15.0, 6.0, 8.0],
    "Name": "Chi2Dist-0",
    "Overflow": 0.0,
    "Type": "Histo1d",
    "Underflow": 0.0,
    "x": {
        "AxisTitle": "Fit Chi/ndf",
        "Bins": 51,
        "High": 2.5250000953674318,
        "Low": -0.02500000037252903
    },
    "y": {
        "AxisTitle": "Number of Pixels"
    },
    "z": {
        "AxisTitle": "z"
    }
}