time,Hardware,Voltage,Current
1621983123888,high-voltage,1,0.0649923
time,Hardware,Voltage,Current
1621983123888,high-voltage,2,0.135818
time,Hardware,Voltage,Current
1621983123888,high-voltage,3,0.235342
time,Hardware,Voltage,Current
1621983123888,high-voltage,4,0.383213
time,Hardware,Voltage,Current
1621983123888,high-voltage,5,0.574922
time,Hardware,Voltage,Current
1621983123888,high-voltage,6,0.852516
time,Hardware,Voltage,Current
1621983123888,high-voltage,7,1.14269
time,Hardware,Voltage,Current
1621983123888,high-voltage,8,1.55307
time,Hardware,Voltage,Current
1621983123888,high-voltage,9,1.98588
time,Hardware,Voltage,Current
1621983123888,high-voltage,10,2.53579
time,Hardware,Voltage,Current
1621983123888,high-voltage,11,3.32946
time,Hardware,Voltage,Current
1621983123888,high-voltage,12,4.24307
time,Hardware,Voltage,Current
1621983123888,high-voltage,13,5.51068
time,Hardware,Voltage,Current
1621983123888,high-voltage,14,6.79088
time,Hardware,Voltage,Current
1621983123888,high-voltage,15,8.13402
time,Hardware,Voltage,Current
1621983123888,high-voltage,16,9.35549
time,Hardware,Voltage,Current
1621983123888,high-voltage,17,9.15746
time,Hardware,Voltage,Current
1621983123888,high-voltage,18,10.0001
time,Hardware,Voltage,Current
1621983123888,high-voltage,19,10
