time,Hardware,Voltage,Current
1626319552965,high-voltage-3,1,0.284359
time,Hardware,Voltage,Current
1626319552965,high-voltage-3,2,0.306241
time,Hardware,Voltage,Current
1626319552965,high-voltage-3,3,0.323178
time,Hardware,Voltage,Current
1626319552965,high-voltage-3,4,0.339218
time,Hardware,Voltage,Current
1626319552965,high-voltage-3,5,0.351373
time,Hardware,Voltage,Current
1626319552965,high-voltage-3,6,0.365104
time,Hardware,Voltage,Current
1626319552965,high-voltage-3,7,0.377738
time,Hardware,Voltage,Current
1626319552965,high-voltage-3,8,0.395017
time,Hardware,Voltage,Current
1626319552965,high-voltage-3,9,0.40949
time,Hardware,Voltage,Current
1626319552965,high-voltage-3,10,0.426992
time,Hardware,Voltage,Current
1626319552965,high-voltage-3,11,0.443313
time,Hardware,Voltage,Current
1626319552965,high-voltage-3,12,0.4581
time,Hardware,Voltage,Current
1626319552965,high-voltage-3,13,0.473751
time,Hardware,Voltage,Current
1626319552965,high-voltage-3,14,0.48591
time,Hardware,Voltage,Current
1626319552965,high-voltage-3,15,0.499101
time,Hardware,Voltage,Current
1626319552965,high-voltage-3,16,0.511732
time,Hardware,Voltage,Current
1626319552965,high-voltage-3,17,0.521529
time,Hardware,Voltage,Current
1626319552965,high-voltage-3,18,0.532442
time,Hardware,Voltage,Current
1626319552965,high-voltage-3,19,0.541421
time,Hardware,Voltage,Current
1626319552965,high-voltage-3,20,0.552832
time,Hardware,Voltage,Current
1626319552965,high-voltage-3,25,0.596191
time,Hardware,Voltage,Current
1626319552965,high-voltage-3,30,0.635237
time,Hardware,Voltage,Current
1626319552965,high-voltage-3,35,0.668452
time,Hardware,Voltage,Current
1626319552965,high-voltage-3,40,0.696479
time,Hardware,Voltage,Current
1626319552965,high-voltage-3,45,0.724288
time,Hardware,Voltage,Current
1626319552965,high-voltage-3,50,0.750379
time,Hardware,Voltage,Current
1626319552965,high-voltage-3,55,0.774325
time,Hardware,Voltage,Current
1626319552965,high-voltage-3,60,0.798498
time,Hardware,Voltage,Current
1626319552965,high-voltage-3,65,0.820485
time,Hardware,Voltage,Current
1626319552965,high-voltage-3,70,0.847059
time,Hardware,Voltage,Current
1626319552965,high-voltage-3,75,0.870025
time,Hardware,Voltage,Current
1626319552965,high-voltage-3,80,0.896823
time,Hardware,Voltage,Current
1626319552965,high-voltage-3,85,0.921316
time,Hardware,Voltage,Current
1626319552965,high-voltage-3,90,0.94376
time,Hardware,Voltage,Current
1626319552965,high-voltage-3,95,0.968512
time,Hardware,Voltage,Current
1626319552965,high-voltage-3,100,0.990126
