{
    "Data": [1493.0, 19985.0, 18474.0, 8637.0, 2938.0, 887.0, 456.0, 499.0, 676.0, 778.0, 869.0, 932.0, 761.0, 746.0, 582.0, 572.0, 533.0, 541.0, 512.0, 552.0, 586.0, 555.0, 603.0, 561.0, 548.0, 570.0, 583.0, 569.0, 532.0, 503.0, 545.0, 519.0, 482.0, 535.0, 505.0, 435.0, 464.0, 432.0, 411.0, 400.0, 374.0, 355.0, 311.0, 310.0, 276.0, 274.0, 261.0, 247.0, 221.0, 190.0, 98.0],
    "Name": "Chi2Dist-0",
    "Overflow": 0.0,
    "Type": "Histo1d",
    "Underflow": 0.0,
    "x": {
        "AxisTitle": "Fit Chi/ndf",
        "Bins": 51,
        "High": 2.5250000953674318,
        "Low": -0.02500000037252903
    },
    "y": {
        "AxisTitle": "Number of Pixels"
    },
    "z": {
        "AxisTitle": "z"
    }
}