time,Hardware,Voltage,Current
1623286182171,high-voltage,1,0.0266051
time,Hardware,Voltage,Current
1623286182171,high-voltage,2,0.0340866
time,Hardware,Voltage,Current
1623286182171,high-voltage,3,0.0400471
time,Hardware,Voltage,Current
1623286182171,high-voltage,4.59778e-08,0.0463043
time,Hardware,Voltage,Current
1623286182171,high-voltage,5,0.0504522
time,Hardware,Voltage,Current
1623286182171,high-voltage,6,0.0559747
time,Hardware,Voltage,Current
1623286182171,high-voltage,7,0.0607114
time,Hardware,Voltage,Current
1623286182171,high-voltage,6.70332e-08,0.0664047
time,Hardware,Voltage,Current
1623286182171,high-voltage,9,0.0719764
time,Hardware,Voltage,Current
1623286182171,high-voltage,10,0.0758011
time,Hardware,Voltage,Current
1623286182171,high-voltage,11,0.0814205
time,Hardware,Voltage,Current
1623286182171,high-voltage,12,0.0855402
time,Hardware,Voltage,Current
1623286182171,high-voltage,13,0.0874822
time,Hardware,Voltage,Current
1623286182171,high-voltage,9.12881e-08,0.0918629
time,Hardware,Voltage,Current
1623286182171,high-voltage,15,0.0938579
time,Hardware,Voltage,Current
1623286182171,high-voltage,16,0.0967816
time,Hardware,Voltage,Current
1623286182171,high-voltage,17,0.0997993
time,Hardware,Voltage,Current
1623286182171,high-voltage,18,0.101755
time,Hardware,Voltage,Current
1623286182171,high-voltage,19,0.104163
time,Hardware,Voltage,Current
1623286182171,high-voltage,20,0.105846
time,Hardware,Voltage,Current
1623286182171,high-voltage,25,0.116781
time,Hardware,Voltage,Current
1623286182171,high-voltage,30,0.133711
time,Hardware,Voltage,Current
1623286182171,high-voltage,35,0.188405
time,Hardware,Voltage,Current
1623286182171,high-voltage,3.90527e-07,0.391574
time,Hardware,Voltage,Current
1623286182171,high-voltage,45,0.825127
time,Hardware,Voltage,Current
1623286182171,high-voltage,50,1.45968
time,Hardware,Voltage,Current
1623286182171,high-voltage,55,2.26682
time,Hardware,Voltage,Current
1623286182171,high-voltage,3.24348e-06,3.24797
time,Hardware,Voltage,Current
1623286182171,high-voltage,65,4.36707
time,Hardware,Voltage,Current
1623286182171,high-voltage,70,5.66079
time,Hardware,Voltage,Current
1623286182171,high-voltage,75,7.13053
time,Hardware,Voltage,Current
1623286182171,high-voltage,80,8.81008
time,Hardware,Voltage,Current
1623286182171,high-voltage,85,10
