{
    "Data": [0.0, 0.0, 0.0, 0.0, 0.0, 0.0, 0.0, 0.0, 0.0, 0.0, 0.0, 0.0, 0.0, 0.0, 0.0, 0.0, 0.0, 0.0, 0.0, 0.0, 0.0, 0.0, 0.0, 0.0, 0.0, 0.0, 0.0, 0.0, 0.0, 0.0, 0.0, 0.0, 0.0, 0.0, 0.0, 0.0, 0.0, 0.0, 0.0, 0.0, 0.0, 0.0, 0.0, 0.0, 0.0, 0.0, 0.0, 0.0, 0.0, 0.0, 52.0, 110.0, 108.0, 127.0, 165.0, 139.0, 207.0, 225.0, 264.0, 294.0, 324.0, 372.0, 418.0, 464.0, 520.0, 533.0, 581.0, 598.0, 702.0, 751.0, 750.0, 833.0, 810.0, 796.0, 892.0, 902.0, 850.0, 927.0, 893.0, 881.0, 874.0, 823.0, 866.0, 886.0, 934.0, 943.0, 1122.0, 1358.0, 1565.0, 1939.0, 2209.0, 2654.0, 2928.0, 2987.0, 2884.0, 2560.0, 2072.0, 1655.0, 1300.0, 881.0, 594.0, 458.0, 315.0, 218.0, 123.0, 92.0, 80.0, 75.0, 46.0, 40.0, 39.0, 30.0, 23.0, 25.0, 19.0, 22.0, 13.0, 9.0, 20.0, 15.0, 14.0, 11.0, 15.0, 17.0, 17.0, 10.0, 5.0, 15.0, 9.0, 7.0, 3.0, 9.0, 5.0, 4.0, 4.0, 8.0, 7.0, 5.0, 6.0, 7.0, 3.0, 4.0, 5.0, 2.0, 3.0, 4.0, 1.0, 2.0, 3.0, 2.0, 2.0, 3.0, 2.0, 5.0, 6.0, 3.0, 10.0, 9.0, 6.0, 19.0, 14.0, 27.0, 31.0, 49.0, 52.0, 70.0, 81.0, 107.0, 132.0, 157.0, 162.0, 243.0, 283.0, 309.0, 392.0, 446.0, 504.0, 543.0, 578.0, 626.0, 691.0, 702.0, 794.0, 793.0, 863.0, 889.0, 958.0, 941.0, 982.0, 950.0, 986.0, 935.0, 903.0, 844.0, 783.0, 772.0, 725.0, 675.0, 590.0, 500.0, 455.0, 419.0, 419.0, 327.0, 303.0, 247.0, 221.0, 196.0, 157.0, 154.0, 116.0, 114.0, 76.0, 61.0, 51.0, 28.0, 27.0, 25.0, 29.0, 17.0, 12.0, 12.0, 9.0, 3.0, 1.0, 1.0, 3.0, 0.0, 0.0, 0.0, 0.0, 1.0, 0.0, 0.0, 0.0, 0.0, 0.0, 0.0, 0.0, 0.0, 0.0, 0.0, 0.0, 0.0, 0.0, 1.0, 0.0, 0.0, 0.0, 0.0, 0.0, 0.0, 0.0, 0.0, 0.0, 0.0, 0.0, 0.0, 0.0, 0.0, 0.0, 0.0, 0.0, 1.0, 0.0, 0.0, 0.0, 0.0, 0.0, 0.0, 0.0, 0.0, 1.0, 0.0, 0.0, 0.0, 0.0, 0.0, 0.0, 0.0, 0.0, 0.0, 0.0, 0.0, 0.0, 0.0, 0.0, 0.0, 0.0, 0.0, 0.0, 0.0, 0.0, 0.0, 0.0, 0.0, 0.0, 0.0, 0.0, 0.0, 0.0, 0.0, 0.0, 0.0, 0.0, 0.0, 0.0, 0.0, 0.0, 0.0, 0.0, 0.0, 0.0, 0.0, 0.0, 0.0, 0.0, 0.0, 0.0, 0.0, 0.0, 0.0, 0.0, 0.0, 0.0, 0.0, 0.0, 0.0, 0.0, 0.0, 0.0, 0.0, 0.0, 0.0, 0.0, 0.0, 0.0, 0.0, 0.0, 0.0, 0.0, 0.0, 0.0, 0.0, 0.0, 0.0, 0.0, 0.0, 0.0, 0.0, 0.0, 0.0, 0.0, 0.0, 0.0, 0.0, 0.0, 0.0, 0.0, 0.0, 0.0, 0.0, 0.0, 0.0],
    "Name": "ThresholdDist-0",
    "Overflow": 0.0,
    "Type": "Histo1d",
    "Underflow": 0.0,
    "x": {
        "AxisTitle": "Threshold [e]",
        "Bins": 364,
        "High": 3635.0,
        "Low": -5.0
    },
    "y": {
        "AxisTitle": "Number of Pixels"
    },
    "z": {
        "AxisTitle": "z"
    }
}