{
    "Data": [0.0, 0.0, 0.0, 0.0, 0.0, 0.0, 0.0, 0.0, 0.0, 0.0, 0.0, 0.0, 0.0, 0.0, 0.0, 0.0, 0.0, 0.0, 0.0, 0.0, 0.0, 0.0, 0.0, 0.0, 0.0, 0.0, 0.0, 0.0, 0.0, 0.0, 0.0, 0.0, 0.0, 0.0, 0.0, 0.0, 0.0, 0.0, 0.0, 0.0, 0.0, 0.0, 0.0, 0.0, 0.0, 0.0, 0.0, 0.0, 0.0, 0.0, 4.0, 6.0, 9.0, 4.0, 3.0, 8.0, 7.0, 10.0, 10.0, 14.0, 9.0, 8.0, 13.0, 13.0, 14.0, 17.0, 15.0, 36.0, 39.0, 44.0, 50.0, 89.0, 101.0, 121.0, 154.0, 214.0, 240.0, 295.0, 385.0, 477.0, 608.0, 650.0, 784.0, 881.0, 1103.0, 1200.0, 1263.0, 1292.0, 1434.0, 1601.0, 1772.0, 2197.0, 2637.0, 3358.0, 3952.0, 4470.0, 4590.0, 4122.0, 3347.0, 2521.0, 1714.0, 1169.0, 720.0, 479.0, 330.0, 234.0, 171.0, 124.0, 112.0, 71.0, 60.0, 61.0, 39.0, 41.0, 44.0, 29.0, 29.0, 22.0, 24.0, 29.0, 21.0, 29.0, 21.0, 17.0, 17.0, 14.0, 16.0, 13.0, 17.0, 11.0, 12.0, 8.0, 14.0, 7.0, 10.0, 14.0, 8.0, 10.0, 7.0, 8.0, 11.0, 11.0, 6.0, 10.0, 2.0, 6.0, 6.0, 8.0, 8.0, 4.0, 5.0, 6.0, 1.0, 6.0, 3.0, 3.0, 5.0, 2.0, 1.0, 0.0, 3.0, 2.0, 8.0, 3.0, 2.0, 10.0, 6.0, 10.0, 11.0, 19.0, 23.0, 25.0, 30.0, 25.0, 48.0, 66.0, 68.0, 78.0, 113.0, 135.0, 128.0, 147.0, 190.0, 203.0, 240.0, 264.0, 325.0, 380.0, 436.0, 444.0, 480.0, 539.0, 610.0, 562.0, 597.0, 708.0, 647.0, 721.0, 735.0, 777.0, 785.0, 738.0, 722.0, 714.0, 708.0, 718.0, 667.0, 614.0, 595.0, 554.0, 571.0, 462.0, 425.0, 412.0, 348.0, 312.0, 289.0, 266.0, 252.0, 226.0, 172.0, 162.0, 160.0, 115.0, 106.0, 92.0, 86.0, 85.0, 58.0, 63.0, 45.0, 40.0, 43.0, 24.0, 35.0, 20.0, 20.0, 21.0, 16.0, 12.0, 13.0, 10.0, 2.0, 5.0, 9.0, 13.0, 6.0, 3.0, 0.0, 6.0, 4.0, 3.0, 1.0, 2.0, 9.0, 2.0, 5.0, 7.0, 8.0, 9.0, 4.0, 5.0, 1.0, 2.0, 6.0, 5.0, 2.0, 3.0, 4.0, 4.0, 2.0, 3.0, 4.0, 2.0, 1.0, 2.0, 2.0, 0.0, 3.0, 1.0, 3.0, 2.0, 1.0, 0.0, 3.0, 3.0, 1.0, 1.0, 0.0, 0.0, 2.0, 1.0, 1.0, 1.0, 1.0, 1.0, 2.0, 0.0, 1.0, 1.0, 1.0, 0.0, 0.0, 0.0, 3.0, 0.0, 0.0, 0.0, 2.0, 0.0, 0.0, 1.0, 1.0, 0.0, 0.0, 0.0, 1.0, 0.0, 0.0, 1.0, 0.0, 0.0, 0.0, 1.0, 0.0, 1.0, 0.0, 0.0, 0.0, 0.0, 0.0, 0.0, 0.0, 0.0, 0.0, 0.0, 0.0, 0.0, 0.0, 0.0, 0.0, 0.0, 0.0, 0.0, 0.0, 0.0, 0.0, 0.0, 0.0, 0.0, 0.0, 0.0, 0.0, 0.0, 0.0, 0.0, 0.0, 0.0, 0.0, 0.0, 0.0, 0.0, 0.0, 0.0, 0.0, 0.0, 0.0, 0.0, 0.0, 0.0, 0.0, 0.0, 0.0, 0.0, 0.0, 0.0],
    "Name": "ThresholdDist-0",
    "Overflow": 0.0,
    "Type": "Histo1d",
    "Underflow": 0.0,
    "x": {
        "AxisTitle": "Threshold [e]",
        "Bins": 376,
        "High": 3755.0,
        "Low": -5.0
    },
    "y": {
        "AxisTitle": "Number of Pixels"
    },
    "z": {
        "AxisTitle": "z"
    }
}