{
    "Data": [0.0, 0.0, 0.0, 0.0, 0.0, 0.0, 0.0, 0.0, 0.0, 0.0, 0.0, 0.0, 0.0, 10.0, 11.0, 1.0, 2.0, 135.0, 447.0, 158.0, 49.0, 695.0, 2490.0, 1745.0, 500.0, 1314.0, 2667.0, 2101.0, 793.0, 1121.0, 1824.0, 1592.0, 808.0, 765.0, 740.0, 666.0, 539.0, 799.0, 1410.0, 1100.0, 705.0, 1045.0, 2411.0, 3737.0, 2634.0, 1676.0, 2202.0, 4076.0, 3522.0, 3053.0, 2084.0, 2107.0, 2532.0, 1977.0, 1595.0, 1306.0, 1674.0, 1398.0, 1522.0, 1037.0, 921.0, 1003.0, 824.0, 663.0, 543.0, 617.0, 554.0, 462.0, 394.0, 298.0, 422.0, 321.0, 298.0, 246.0, 256.0, 233.0, 200.0, 186.0, 163.0, 165.0, 127.0, 95.0, 100.0, 96.0, 103.0, 75.0, 67.0, 58.0, 53.0, 68.0, 64.0, 57.0, 57.0, 42.0, 39.0, 35.0, 48.0, 45.0, 37.0, 38.0, 28.0, 28.0, 32.0, 24.0, 24.0, 33.0, 30.0, 17.0, 15.0, 16.0, 8.0, 20.0, 14.0, 15.0, 19.0, 23.0, 18.0, 19.0, 21.0, 21.0, 16.0, 24.0, 12.0, 16.0, 16.0, 6.0, 7.0, 4.0, 13.0, 11.0, 3.0, 14.0, 14.0, 10.0, 4.0, 9.0, 15.0, 7.0, 7.0, 9.0, 22.0, 11.0, 7.0, 6.0, 8.0, 10.0, 8.0, 6.0, 5.0, 5.0, 2.0, 2.0, 5.0, 9.0, 1.0, 3.0, 3.0, 5.0, 7.0, 6.0, 2.0, 2.0, 5.0, 4.0, 3.0, 1.0, 5.0, 6.0, 0.0, 6.0, 2.0, 2.0, 8.0, 3.0, 5.0, 3.0, 2.0, 1.0, 4.0, 4.0, 4.0, 2.0, 3.0, 1.0, 1.0, 2.0, 0.0, 0.0, 0.0, 2.0, 2.0, 3.0, 1.0, 4.0, 3.0, 3.0, 3.0, 1.0, 4.0, 2.0, 0.0],
    "Name": "TimePerFitDist-0",
    "Overflow": 183.0,
    "Type": "Histo1d",
    "Underflow": 0.0,
    "x": {
        "AxisTitle": "Fit Time [us]",
        "Bins": 201,
        "High": 401.0,
        "Low": -1.0
    },
    "y": {
        "AxisTitle": "Number of Pixels"
    },
    "z": {
        "AxisTitle": "z"
    }
}