time,Hardware,Voltage,Current
1626606512084,high-voltage-2,1,0.218036
time,Hardware,Voltage,Current
1626606512084,high-voltage-2,2,0.265379
time,Hardware,Voltage,Current
1626606512084,high-voltage-2,3,0.290095
time,Hardware,Voltage,Current
1626606512084,high-voltage-2,4,0.313812
time,Hardware,Voltage,Current
1626606512084,high-voltage-2,5,0.33377
time,Hardware,Voltage,Current
1626606512084,high-voltage-2,6,0.35866
time,Hardware,Voltage,Current
1626606512084,high-voltage-2,7,0.387381
time,Hardware,Voltage,Current
1626606512084,high-voltage-2,8,0.420509
time,Hardware,Voltage,Current
1626606512084,high-voltage-2,9,0.455559
time,Hardware,Voltage,Current
1626606512084,high-voltage-2,10,0.494221
time,Hardware,Voltage,Current
1626606512084,high-voltage-2,11,0.53691
time,Hardware,Voltage,Current
1626606512084,high-voltage-2,12,0.580794
time,Hardware,Voltage,Current
1626606512084,high-voltage-2,13,0.622074
time,Hardware,Voltage,Current
1626606512084,high-voltage-2,14,0.658297
time,Hardware,Voltage,Current
1626606512084,high-voltage-2,15,0.693796
time,Hardware,Voltage,Current
1626606512084,high-voltage-2,16,0.725643
time,Hardware,Voltage,Current
1626606512084,high-voltage-2,17,0.755602
time,Hardware,Voltage,Current
1626606512084,high-voltage-2,18,0.781623
time,Hardware,Voltage,Current
1626606512084,high-voltage-2,19,0.805612
time,Hardware,Voltage,Current
1626606512084,high-voltage-2,20,0.828356
time,Hardware,Voltage,Current
1626606512084,high-voltage-2,25,0.928783
time,Hardware,Voltage,Current
1626606512084,high-voltage-2,30,1.02265
time,Hardware,Voltage,Current
1626606512084,high-voltage-2,35,1.12125
time,Hardware,Voltage,Current
1626606512084,high-voltage-2,40,1.23368
time,Hardware,Voltage,Current
1626606512084,high-voltage-2,45,1.37028
time,Hardware,Voltage,Current
1626606512084,high-voltage-2,50,1.46765
time,Hardware,Voltage,Current
1626606512084,high-voltage-2,55,1.55698
time,Hardware,Voltage,Current
1626606512084,high-voltage-2,60,1.64465
time,Hardware,Voltage,Current
1626606512084,high-voltage-2,65,1.72967
time,Hardware,Voltage,Current
1626606512084,high-voltage-2,70,1.81211
time,Hardware,Voltage,Current
1626606512084,high-voltage-2,75,1.88739
time,Hardware,Voltage,Current
1626606512084,high-voltage-2,80,1.96239
time,Hardware,Voltage,Current
1626606512084,high-voltage-2,85,2.03383
time,Hardware,Voltage,Current
1626606512084,high-voltage-2,90,2.10591
time,Hardware,Voltage,Current
1626606512084,high-voltage-2,95,2.17284
time,Hardware,Voltage,Current
1626606512084,high-voltage-2,100,2.23933
