{
    "Data": [0.0, 0.0, 0.0, 0.0, 0.0, 0.0, 0.0, 0.0, 0.0, 0.0, 0.0, 0.0, 0.0, 0.0, 0.0, 2.0, 0.0, 0.0, 1.0, 0.0, 1.0, 9.0, 11.0, 3.0, 11.0, 18.0, 15.0, 25.0, 22.0, 23.0, 42.0, 67.0, 53.0, 61.0, 108.0, 106.0, 172.0, 794.0, 1485.0, 918.0, 610.0, 1606.0, 3094.0, 4212.0, 2139.0, 1808.0, 2635.0, 3870.0, 3439.0, 2134.0, 2005.0, 2066.0, 2979.0, 1691.0, 1323.0, 1128.0, 1174.0, 1203.0, 861.0, 768.0, 683.0, 759.0, 606.0, 462.0, 412.0, 399.0, 453.0, 312.0, 256.0, 242.0, 263.0, 281.0, 210.0, 148.0, 127.0, 153.0, 135.0, 108.0, 105.0, 88.0, 94.0, 94.0, 77.0, 54.0, 63.0, 66.0, 44.0, 37.0, 47.0, 43.0, 35.0, 28.0, 31.0, 32.0, 22.0, 24.0, 13.0, 14.0, 25.0, 21.0, 12.0, 17.0, 8.0, 12.0, 10.0, 9.0, 9.0, 5.0, 10.0, 6.0, 5.0, 5.0, 5.0, 4.0, 3.0, 1.0, 7.0, 6.0, 2.0, 6.0, 3.0, 5.0, 3.0, 2.0, 1.0, 0.0, 1.0, 1.0, 0.0, 2.0, 1.0, 3.0, 0.0, 2.0, 2.0, 0.0, 1.0, 2.0, 1.0, 2.0, 0.0, 3.0, 1.0, 0.0, 3.0, 2.0, 0.0, 0.0, 1.0, 0.0, 1.0, 0.0, 0.0, 0.0, 1.0, 0.0, 1.0, 1.0, 0.0, 0.0, 0.0, 0.0, 0.0, 1.0, 0.0, 0.0, 0.0, 2.0, 0.0, 0.0, 0.0, 0.0, 0.0, 0.0, 0.0, 1.0, 0.0, 1.0, 0.0, 0.0, 0.0, 0.0, 0.0, 0.0, 0.0, 0.0, 0.0, 0.0, 0.0, 0.0, 0.0, 0.0, 0.0, 0.0, 0.0, 0.0, 0.0, 1.0, 0.0, 0.0, 0.0],
    "Name": "TimePerFitDist-0",
    "Overflow": 68.0,
    "Type": "Histo1d",
    "Underflow": 0.0,
    "x": {
        "AxisTitle": "Fit Time [us]",
        "Bins": 201,
        "High": 401.0,
        "Low": -1.0
    },
    "y": {
        "AxisTitle": "Number of Pixels"
    },
    "z": {
        "AxisTitle": "z"
    }
}