{
    "Data": [0.0, 0.0, 0.0, 0.0, 0.0, 0.0, 0.0, 0.0, 0.0, 0.0, 0.0, 0.0, 1.0, 6.0, 68.0, 29.0, 6.0, 107.0, 440.0, 218.0, 58.0, 504.0, 3563.0, 2586.0, 441.0, 1153.0, 3472.0, 3540.0, 843.0, 931.0, 2289.0, 3147.0, 1307.0, 636.0, 1152.0, 1984.0, 1430.0, 601.0, 1216.0, 2153.0, 1977.0, 927.0, 1147.0, 2238.0, 2171.0, 1165.0, 1008.0, 1814.0, 2470.0, 1702.0, 965.0, 938.0, 1304.0, 1133.0, 764.0, 685.0, 783.0, 957.0, 742.0, 572.0, 543.0, 606.0, 613.0, 391.0, 358.0, 367.0, 489.0, 373.0, 287.0, 225.0, 282.0, 345.0, 260.0, 208.0, 157.0, 169.0, 146.0, 152.0, 108.0, 126.0, 123.0, 94.0, 83.0, 73.0, 75.0, 60.0, 43.0, 51.0, 44.0, 36.0, 32.0, 33.0, 23.0, 26.0, 26.0, 22.0, 18.0, 31.0, 22.0, 21.0, 22.0, 12.0, 17.0, 12.0, 10.0, 11.0, 5.0, 16.0, 16.0, 12.0, 14.0, 11.0, 9.0, 7.0, 9.0, 2.0, 7.0, 5.0, 9.0, 10.0, 10.0, 8.0, 10.0, 7.0, 0.0, 5.0, 4.0, 7.0, 8.0, 4.0, 6.0, 9.0, 7.0, 4.0, 3.0, 6.0, 5.0, 4.0, 2.0, 1.0, 4.0, 1.0, 4.0, 1.0, 3.0, 3.0, 5.0, 4.0, 2.0, 3.0, 2.0, 1.0, 1.0, 0.0, 2.0, 3.0, 0.0, 1.0, 0.0, 4.0, 1.0, 1.0, 1.0, 0.0, 2.0, 2.0, 0.0, 1.0, 0.0, 1.0, 1.0, 0.0, 1.0, 0.0, 1.0, 0.0, 2.0, 0.0, 2.0, 0.0, 0.0, 0.0, 0.0, 1.0, 0.0, 1.0, 2.0, 0.0, 0.0, 0.0, 1.0, 0.0, 0.0, 1.0, 0.0, 0.0, 0.0, 1.0, 2.0, 0.0, 0.0],
    "Name": "TimePerFitDist-0",
    "Overflow": 118.0,
    "Type": "Histo1d",
    "Underflow": 0.0,
    "x": {
        "AxisTitle": "Fit Time [us]",
        "Bins": 201,
        "High": 401.0,
        "Low": -1.0
    },
    "y": {
        "AxisTitle": "Number of Pixels"
    },
    "z": {
        "AxisTitle": "z"
    }
}