{
    "Data": [[323.0, 105.0, 42.0, 27.0, 17.0, 13.0, 12.0, 5.0, 8.0, 12.0, 11.0, 5.0, 6.0, 9.0, 10.0, 5.0, 5.0, 9.0, 5.0, 7.0, 5.0, 2.0, 4.0, 6.0, 4.0, 4.0, 2.0, 6.0, 9.0, 4.0, 5.0, 6.0, 4.0, 3.0, 4.0, 3.0, 5.0, 4.0, 4.0, 5.0, 1.0, 3.0, 6.0, 4.0, 4.0, 2.0, 6.0, 3.0, 2.0], [519.0, 171.0, 102.0, 54.0, 35.0, 27.0, 19.0, 9.0, 8.0, 17.0, 14.0, 5.0, 6.0, 9.0, 7.0, 6.0, 7.0, 7.0, 6.0, 14.0, 3.0, 7.0, 5.0, 5.0, 4.0, 3.0, 5.0, 7.0, 5.0, 5.0, 2.0, 3.0, 4.0, 5.0, 5.0, 3.0, 7.0, 5.0, 5.0, 4.0, 7.0, 4.0, 6.0, 5.0, 5.0, 7.0, 5.0, 5.0, 5.0], [1122.0, 353.0, 165.0, 113.0, 53.0, 69.0, 56.0, 31.0, 28.0, 15.0, 24.0, 13.0, 19.0, 11.0, 15.0, 12.0, 9.0, 4.0, 6.0, 10.0, 3.0, 4.0, 5.0, 9.0, 3.0, 8.0, 5.0, 5.0, 4.0, 3.0, 4.0, 9.0, 3.0, 4.0, 5.0, 4.0, 5.0, 4.0, 7.0, 6.0, 3.0, 7.0, 6.0, 3.0, 8.0, 8.0, 14.0, 12.0, 13.0], [2178.0, 824.0, 432.0, 225.0, 166.0, 121.0, 94.0, 64.0, 65.0, 48.0, 35.0, 26.0, 32.0, 21.0, 26.0, 19.0, 11.0, 22.0, 15.0, 18.0, 12.0, 22.0, 12.0, 9.0, 12.0, 5.0, 8.0, 7.0, 7.0, 11.0, 5.0, 8.0, 6.0, 3.0, 7.0, 2.0, 13.0, 8.0, 8.0, 2.0, 5.0, 8.0, 2.0, 4.0, 5.0, 6.0, 17.0, 11.0, 24.0], [3708.0, 1581.0, 897.0, 602.0, 431.0, 312.0, 236.0, 176.0, 151.0, 120.0, 95.0, 84.0, 61.0, 60.0, 54.0, 48.0, 43.0, 40.0, 35.0, 34.0, 29.0, 30.0, 22.0, 23.0, 20.0, 24.0, 14.0, 17.0, 13.0, 14.0, 17.0, 13.0, 13.0, 14.0, 9.0, 17.0, 12.0, 11.0, 9.0, 7.0, 9.0, 12.0, 17.0, 3.0, 8.0, 8.0, 11.0, 13.0, 26.0], [7550.0, 3070.0, 1646.0, 1161.0, 842.0, 631.0, 530.0, 397.0, 347.0, 310.0, 259.0, 236.0, 197.0, 175.0, 154.0, 149.0, 111.0, 106.0, 83.0, 81.0, 73.0, 61.0, 70.0, 66.0, 53.0, 47.0, 34.0, 46.0, 26.0, 40.0, 36.0, 32.0, 16.0, 25.0, 26.0, 33.0, 22.0, 32.0, 16.0, 23.0, 22.0, 13.0, 13.0, 14.0, 20.0, 16.0, 19.0, 20.0, 35.0], [8918.0, 6121.0, 4328.0, 3193.0, 2360.0, 1750.0, 1428.0, 1114.0, 936.0, 747.0, 606.0, 559.0, 466.0, 408.0, 356.0, 317.0, 262.0, 274.0, 243.0, 230.0, 191.0, 195.0, 166.0, 179.0, 146.0, 147.0, 125.0, 118.0, 83.0, 103.0, 84.0, 91.0, 63.0, 87.0, 74.0, 62.0, 40.0, 57.0, 70.0, 39.0, 57.0, 44.0, 50.0, 37.0, 43.0, 37.0, 51.0, 34.0, 61.0], [3130.0, 3053.0, 3025.0, 2824.0, 2821.0, 2629.0, 2464.0, 2406.0, 2186.0, 1986.0, 1917.0, 1782.0, 1636.0, 1482.0, 1401.0, 1265.0, 1162.0, 1047.0, 907.0, 840.0, 749.0, 643.0, 599.0, 613.0, 474.0, 462.0, 385.0, 352.0, 297.0, 303.0, 263.0, 254.0, 252.0, 219.0, 206.0, 187.0, 159.0, 154.0, 150.0, 127.0, 127.0, 141.0, 110.0, 100.0, 94.0, 101.0, 115.0, 84.0, 124.0], [994.0, 961.0, 917.0, 913.0, 890.0, 973.0, 886.0, 1007.0, 1026.0, 1075.0, 1082.0, 1077.0, 1217.0, 1211.0, 1264.0, 1216.0, 1295.0, 1373.0, 1335.0, 1393.0, 1436.0, 1397.0, 1428.0, 1424.0, 1387.0, 1409.0, 1344.0, 1348.0, 1324.0, 1329.0, 1236.0, 1240.0, 1208.0, 1122.0, 1041.0, 1057.0, 969.0, 854.0, 813.0, 737.0, 616.0, 641.0, 500.0, 457.0, 426.0, 362.0, 283.0, 303.0, 307.0], [455.0, 309.0, 371.0, 374.0, 385.0, 368.0, 354.0, 417.0, 423.0, 479.0, 434.0, 474.0, 487.0, 505.0, 535.0, 551.0, 503.0, 540.0, 577.0, 561.0, 632.0, 630.0, 675.0, 712.0, 751.0, 768.0, 823.0, 893.0, 941.0, 929.0, 1031.0, 1072.0, 1147.0, 1240.0, 1344.0, 1394.0, 1551.0, 1655.0, 1718.0, 1940.0, 1866.0, 2026.0, 2146.0, 2134.0, 2222.0, 2228.0, 2240.0, 2004.0, 1812.0], [255.0, 152.0, 144.0, 123.0, 151.0, 161.0, 155.0, 185.0, 178.0, 177.0, 186.0, 227.0, 240.0, 222.0, 232.0, 255.0, 276.0, 296.0, 280.0, 294.0, 313.0, 320.0, 367.0, 393.0, 362.0, 468.0, 421.0, 437.0, 469.0, 510.0, 550.0, 536.0, 613.0, 651.0, 642.0, 732.0, 761.0, 842.0, 949.0, 991.0, 1160.0, 1302.0, 1536.0, 1858.0, 2203.0, 2755.0, 3491.0, 4763.0, 6803.0], [151.0, 93.0, 73.0, 73.0, 65.0, 64.0, 71.0, 67.0, 65.0, 54.0, 92.0, 88.0, 86.0, 73.0, 96.0, 98.0, 118.0, 134.0, 134.0, 123.0, 139.0, 146.0, 171.0, 190.0, 179.0, 209.0, 214.0, 252.0, 283.0, 283.0, 296.0, 299.0, 350.0, 371.0, 430.0, 456.0, 521.0, 577.0, 599.0, 685.0, 768.0, 825.0, 989.0, 1098.0, 1370.0, 1645.0, 2160.0, 3186.0, 6504.0], [107.0, 97.0, 55.0, 43.0, 37.0, 25.0, 43.0, 26.0, 35.0, 39.0, 35.0, 35.0, 39.0, 44.0, 37.0, 44.0, 38.0, 46.0, 52.0, 53.0, 53.0, 56.0, 60.0, 50.0, 76.0, 79.0, 99.0, 89.0, 110.0, 129.0, 131.0, 154.0, 166.0, 181.0, 233.0, 252.0, 249.0, 281.0, 360.0, 387.0, 461.0, 523.0, 632.0, 756.0, 926.0, 1277.0, 1681.0, 2376.0, 4623.0], [117.0, 54.0, 51.0, 28.0, 27.0, 14.0, 20.0, 29.0, 25.0, 21.0, 19.0, 26.0, 14.0, 26.0, 22.0, 24.0, 23.0, 21.0, 29.0, 27.0, 23.0, 18.0, 26.0, 34.0, 27.0, 32.0, 23.0, 41.0, 48.0, 52.0, 41.0, 67.0, 79.0, 72.0, 78.0, 75.0, 111.0, 120.0, 137.0, 165.0, 199.0, 286.0, 284.0, 394.0, 571.0, 732.0, 1048.0, 1838.0, 3680.0], [95.0, 47.0, 38.0, 29.0, 37.0, 17.0, 18.0, 23.0, 14.0, 16.0, 11.0, 9.0, 19.0, 18.0, 13.0, 17.0, 11.0, 20.0, 10.0, 17.0, 10.0, 12.0, 12.0, 19.0, 18.0, 16.0, 25.0, 27.0, 20.0, 26.0, 20.0, 18.0, 33.0, 43.0, 31.0, 28.0, 33.0, 40.0, 73.0, 54.0, 103.0, 95.0, 118.0, 159.0, 242.0, 330.0, 544.0, 989.0, 2490.0], [86.0, 49.0, 35.0, 22.0, 21.0, 17.0, 12.0, 10.0, 10.0, 17.0, 10.0, 13.0, 12.0, 9.0, 16.0, 12.0, 10.0, 14.0, 11.0, 9.0, 7.0, 14.0, 12.0, 12.0, 11.0, 12.0, 16.0, 10.0, 12.0, 12.0, 16.0, 22.0, 12.0, 9.0, 26.0, 23.0, 17.0, 22.0, 28.0, 22.0, 24.0, 38.0, 56.0, 84.0, 109.0, 172.0, 233.0, 424.0, 1448.0], [86.0, 46.0, 27.0, 23.0, 16.0, 15.0, 18.0, 9.0, 12.0, 8.0, 11.0, 5.0, 7.0, 11.0, 12.0, 13.0, 9.0, 10.0, 16.0, 5.0, 10.0, 10.0, 12.0, 7.0, 6.0, 7.0, 12.0, 7.0, 8.0, 7.0, 10.0, 9.0, 10.0, 11.0, 12.0, 15.0, 15.0, 15.0, 26.0, 18.0, 17.0, 29.0, 26.0, 32.0, 61.0, 46.0, 106.0, 204.0, 688.0], [89.0, 34.0, 28.0, 16.0, 19.0, 16.0, 7.0, 9.0, 14.0, 11.0, 6.0, 13.0, 11.0, 8.0, 5.0, 8.0, 12.0, 8.0, 8.0, 9.0, 6.0, 6.0, 6.0, 3.0, 10.0, 3.0, 8.0, 4.0, 5.0, 9.0, 8.0, 13.0, 6.0, 12.0, 7.0, 13.0, 11.0, 11.0, 13.0, 10.0, 13.0, 22.0, 14.0, 26.0, 35.0, 30.0, 54.0, 112.0, 323.0], [79.0, 40.0, 15.0, 18.0, 16.0, 5.0, 12.0, 14.0, 8.0, 11.0, 4.0, 8.0, 5.0, 8.0, 7.0, 5.0, 8.0, 7.0, 9.0, 6.0, 9.0, 11.0, 6.0, 4.0, 8.0, 14.0, 1.0, 7.0, 5.0, 8.0, 5.0, 3.0, 9.0, 8.0, 11.0, 6.0, 8.0, 10.0, 8.0, 8.0, 14.0, 13.0, 16.0, 11.0, 24.0, 28.0, 34.0, 58.0, 210.0], [79.0, 29.0, 19.0, 14.0, 10.0, 8.0, 6.0, 7.0, 8.0, 5.0, 4.0, 4.0, 11.0, 7.0, 4.0, 10.0, 7.0, 8.0, 5.0, 6.0, 6.0, 9.0, 3.0, 9.0, 6.0, 4.0, 6.0, 4.0, 6.0, 4.0, 5.0, 3.0, 9.0, 8.0, 4.0, 6.0, 4.0, 6.0, 11.0, 6.0, 6.0, 10.0, 10.0, 13.0, 12.0, 21.0, 27.0, 39.0, 116.0], [65.0, 30.0, 29.0, 10.0, 9.0, 4.0, 11.0, 5.0, 5.0, 5.0, 7.0, 10.0, 6.0, 8.0, 8.0, 3.0, 7.0, 4.0, 2.0, 7.0, 4.0, 4.0, 3.0, 1.0, 7.0, 6.0, 0.0, 5.0, 5.0, 4.0, 1.0, 6.0, 8.0, 5.0, 6.0, 9.0, 3.0, 6.0, 9.0, 7.0, 7.0, 5.0, 8.0, 13.0, 13.0, 12.0, 22.0, 32.0, 83.0], [69.0, 28.0, 25.0, 13.0, 7.0, 5.0, 6.0, 5.0, 7.0, 2.0, 3.0, 6.0, 5.0, 9.0, 4.0, 4.0, 4.0, 7.0, 2.0, 5.0, 6.0, 4.0, 2.0, 8.0, 1.0, 4.0, 1.0, 4.0, 0.0, 2.0, 6.0, 4.0, 8.0, 5.0, 3.0, 4.0, 5.0, 5.0, 4.0, 6.0, 8.0, 5.0, 8.0, 10.0, 10.0, 13.0, 16.0, 21.0, 61.0], [76.0, 25.0, 12.0, 14.0, 11.0, 6.0, 10.0, 5.0, 4.0, 3.0, 5.0, 3.0, 4.0, 4.0, 4.0, 7.0, 2.0, 2.0, 1.0, 6.0, 2.0, 1.0, 1.0, 4.0, 3.0, 3.0, 2.0, 3.0, 3.0, 1.0, 4.0, 4.0, 7.0, 3.0, 4.0, 4.0, 11.0, 2.0, 3.0, 1.0, 3.0, 4.0, 6.0, 4.0, 10.0, 13.0, 17.0, 14.0, 41.0], [65.0, 33.0, 16.0, 9.0, 8.0, 5.0, 10.0, 8.0, 3.0, 0.0, 9.0, 4.0, 5.0, 2.0, 5.0, 5.0, 5.0, 3.0, 1.0, 0.0, 5.0, 2.0, 1.0, 2.0, 2.0, 1.0, 2.0, 4.0, 5.0, 4.0, 4.0, 1.0, 1.0, 3.0, 2.0, 2.0, 4.0, 3.0, 5.0, 4.0, 3.0, 4.0, 4.0, 4.0, 4.0, 10.0, 4.0, 12.0, 35.0], [62.0, 32.0, 13.0, 13.0, 5.0, 9.0, 8.0, 4.0, 4.0, 6.0, 2.0, 4.0, 1.0, 1.0, 3.0, 6.0, 2.0, 3.0, 3.0, 2.0, 5.0, 5.0, 2.0, 3.0, 1.0, 1.0, 3.0, 5.0, 2.0, 1.0, 3.0, 3.0, 0.0, 2.0, 4.0, 2.0, 0.0, 3.0, 2.0, 5.0, 4.0, 1.0, 4.0, 2.0, 7.0, 6.0, 7.0, 14.0, 18.0], [64.0, 25.0, 13.0, 10.0, 7.0, 9.0, 7.0, 2.0, 2.0, 1.0, 3.0, 5.0, 2.0, 6.0, 3.0, 4.0, 3.0, 4.0, 0.0, 6.0, 1.0, 1.0, 8.0, 4.0, 0.0, 3.0, 2.0, 0.0, 2.0, 4.0, 3.0, 1.0, 0.0, 0.0, 2.0, 2.0, 4.0, 2.0, 3.0, 3.0, 2.0, 1.0, 4.0, 2.0, 2.0, 4.0, 2.0, 7.0, 19.0], [66.0, 30.0, 18.0, 9.0, 10.0, 7.0, 5.0, 3.0, 2.0, 4.0, 6.0, 4.0, 5.0, 3.0, 1.0, 4.0, 3.0, 3.0, 3.0, 4.0, 2.0, 1.0, 3.0, 4.0, 3.0, 2.0, 3.0, 3.0, 0.0, 2.0, 3.0, 0.0, 0.0, 1.0, 1.0, 0.0, 2.0, 2.0, 1.0, 4.0, 2.0, 1.0, 4.0, 1.0, 3.0, 3.0, 1.0, 3.0, 9.0], [68.0, 20.0, 16.0, 13.0, 9.0, 4.0, 4.0, 5.0, 6.0, 2.0, 1.0, 7.0, 2.0, 2.0, 4.0, 7.0, 4.0, 2.0, 3.0, 2.0, 2.0, 2.0, 0.0, 3.0, 3.0, 0.0, 3.0, 0.0, 2.0, 2.0, 3.0, 0.0, 2.0, 1.0, 1.0, 1.0, 2.0, 1.0, 1.0, 1.0, 1.0, 3.0, 0.0, 4.0, 2.0, 4.0, 5.0, 4.0, 6.0], [78.0, 32.0, 14.0, 7.0, 9.0, 4.0, 2.0, 3.0, 2.0, 2.0, 5.0, 3.0, 4.0, 7.0, 3.0, 5.0, 4.0, 0.0, 2.0, 3.0, 2.0, 2.0, 0.0, 3.0, 3.0, 0.0, 4.0, 0.0, 1.0, 1.0, 0.0, 1.0, 4.0, 2.0, 1.0, 1.0, 0.0, 0.0, 0.0, 0.0, 2.0, 1.0, 0.0, 2.0, 1.0, 4.0, 3.0, 4.0, 5.0], [70.0, 30.0, 15.0, 8.0, 11.0, 5.0, 7.0, 5.0, 3.0, 2.0, 1.0, 1.0, 3.0, 7.0, 2.0, 5.0, 2.0, 2.0, 4.0, 3.0, 1.0, 2.0, 2.0, 1.0, 3.0, 2.0, 2.0, 1.0, 0.0, 3.0, 1.0, 1.0, 0.0, 0.0, 4.0, 0.0, 0.0, 1.0, 2.0, 0.0, 2.0, 1.0, 1.0, 3.0, 2.0, 2.0, 1.0, 1.0, 6.0], [61.0, 27.0, 21.0, 13.0, 7.0, 3.0, 3.0, 0.0, 8.0, 1.0, 2.0, 4.0, 2.0, 3.0, 2.0, 2.0, 5.0, 2.0, 4.0, 7.0, 1.0, 1.0, 2.0, 1.0, 0.0, 2.0, 2.0, 3.0, 0.0, 2.0, 2.0, 2.0, 1.0, 2.0, 2.0, 0.0, 1.0, 1.0, 3.0, 0.0, 0.0, 1.0, 3.0, 0.0, 1.0, 2.0, 1.0, 0.0, 4.0], [53.0, 40.0, 16.0, 10.0, 4.0, 6.0, 6.0, 3.0, 5.0, 1.0, 4.0, 7.0, 3.0, 5.0, 1.0, 2.0, 5.0, 1.0, 2.0, 5.0, 4.0, 1.0, 2.0, 3.0, 3.0, 3.0, 0.0, 1.0, 0.0, 1.0, 1.0, 0.0, 1.0, 0.0, 0.0, 2.0, 1.0, 1.0, 1.0, 1.0, 0.0, 0.0, 1.0, 0.0, 4.0, 1.0, 1.0, 2.0, 2.0], [72.0, 32.0, 12.0, 12.0, 8.0, 3.0, 6.0, 5.0, 3.0, 3.0, 4.0, 4.0, 7.0, 3.0, 2.0, 2.0, 2.0, 0.0, 2.0, 5.0, 3.0, 4.0, 1.0, 0.0, 4.0, 1.0, 0.0, 4.0, 3.0, 0.0, 1.0, 0.0, 0.0, 1.0, 0.0, 0.0, 1.0, 0.0, 0.0, 0.0, 2.0, 0.0, 0.0, 1.0, 3.0, 1.0, 3.0, 2.0, 1.0], [75.0, 32.0, 19.0, 8.0, 6.0, 2.0, 9.0, 3.0, 2.0, 4.0, 5.0, 4.0, 8.0, 1.0, 2.0, 4.0, 1.0, 2.0, 4.0, 1.0, 0.0, 3.0, 0.0, 2.0, 1.0, 3.0, 2.0, 1.0, 3.0, 1.0, 1.0, 1.0, 1.0, 2.0, 1.0, 0.0, 0.0, 2.0, 1.0, 0.0, 1.0, 0.0, 0.0, 1.0, 2.0, 2.0, 2.0, 2.0, 3.0], [72.0, 27.0, 14.0, 6.0, 7.0, 5.0, 0.0, 4.0, 2.0, 6.0, 6.0, 6.0, 5.0, 2.0, 6.0, 1.0, 3.0, 3.0, 3.0, 4.0, 2.0, 2.0, 3.0, 1.0, 2.0, 2.0, 1.0, 1.0, 2.0, 1.0, 1.0, 0.0, 0.0, 0.0, 0.0, 1.0, 1.0, 0.0, 0.0, 0.0, 0.0, 0.0, 2.0, 2.0, 0.0, 0.0, 0.0, 1.0, 2.0], [68.0, 32.0, 21.0, 4.0, 5.0, 5.0, 4.0, 2.0, 5.0, 4.0, 6.0, 4.0, 0.0, 6.0, 5.0, 2.0, 2.0, 2.0, 2.0, 2.0, 2.0, 3.0, 1.0, 2.0, 3.0, 1.0, 1.0, 3.0, 1.0, 1.0, 2.0, 2.0, 1.0, 0.0, 0.0, 1.0, 0.0, 1.0, 1.0, 2.0, 2.0, 0.0, 1.0, 1.0, 0.0, 2.0, 1.0, 0.0, 3.0], [59.0, 25.0, 20.0, 12.0, 5.0, 5.0, 2.0, 2.0, 5.0, 4.0, 5.0, 3.0, 0.0, 2.0, 4.0, 0.0, 4.0, 2.0, 2.0, 4.0, 5.0, 3.0, 2.0, 1.0, 1.0, 5.0, 0.0, 1.0, 0.0, 1.0, 2.0, 2.0, 2.0, 0.0, 0.0, 2.0, 1.0, 0.0, 0.0, 0.0, 3.0, 0.0, 0.0, 0.0, 1.0, 1.0, 2.0, 0.0, 2.0], [61.0, 35.0, 12.0, 10.0, 7.0, 3.0, 3.0, 6.0, 1.0, 3.0, 2.0, 2.0, 2.0, 1.0, 4.0, 3.0, 3.0, 5.0, 1.0, 2.0, 4.0, 5.0, 1.0, 4.0, 2.0, 2.0, 4.0, 2.0, 1.0, 1.0, 1.0, 0.0, 1.0, 1.0, 0.0, 0.0, 0.0, 0.0, 1.0, 0.0, 0.0, 2.0, 1.0, 1.0, 1.0, 1.0, 2.0, 0.0, 3.0], [67.0, 32.0, 18.0, 6.0, 6.0, 3.0, 4.0, 4.0, 2.0, 3.0, 2.0, 4.0, 3.0, 5.0, 3.0, 2.0, 3.0, 3.0, 3.0, 7.0, 2.0, 3.0, 2.0, 4.0, 1.0, 0.0, 0.0, 0.0, 1.0, 5.0, 0.0, 1.0, 1.0, 1.0, 1.0, 0.0, 0.0, 0.0, 1.0, 0.0, 1.0, 2.0, 0.0, 1.0, 0.0, 2.0, 1.0, 1.0, 2.0], [60.0, 31.0, 17.0, 10.0, 8.0, 4.0, 3.0, 6.0, 1.0, 6.0, 5.0, 2.0, 2.0, 1.0, 0.0, 3.0, 1.0, 4.0, 5.0, 4.0, 2.0, 4.0, 1.0, 2.0, 2.0, 0.0, 1.0, 1.0, 4.0, 1.0, 2.0, 2.0, 0.0, 0.0, 1.0, 0.0, 3.0, 0.0, 1.0, 2.0, 0.0, 0.0, 1.0, 0.0, 1.0, 1.0, 2.0, 1.0, 3.0], [69.0, 27.0, 13.0, 12.0, 10.0, 5.0, 3.0, 6.0, 2.0, 1.0, 1.0, 6.0, 0.0, 5.0, 7.0, 3.0, 3.0, 2.0, 6.0, 0.0, 2.0, 5.0, 5.0, 1.0, 0.0, 1.0, 2.0, 0.0, 1.0, 3.0, 1.0, 0.0, 1.0, 1.0, 0.0, 0.0, 2.0, 0.0, 2.0, 0.0, 0.0, 0.0, 0.0, 1.0, 0.0, 0.0, 1.0, 3.0, 1.0], [69.0, 25.0, 16.0, 13.0, 1.0, 6.0, 8.0, 4.0, 3.0, 4.0, 1.0, 4.0, 6.0, 4.0, 1.0, 3.0, 4.0, 3.0, 1.0, 2.0, 0.0, 2.0, 3.0, 2.0, 2.0, 0.0, 1.0, 2.0, 1.0, 2.0, 2.0, 0.0, 2.0, 1.0, 0.0, 1.0, 0.0, 1.0, 0.0, 1.0, 1.0, 2.0, 4.0, 0.0, 0.0, 1.0, 3.0, 0.0, 0.0], [68.0, 23.0, 18.0, 11.0, 10.0, 5.0, 4.0, 4.0, 5.0, 7.0, 3.0, 1.0, 1.0, 6.0, 7.0, 3.0, 2.0, 8.0, 1.0, 1.0, 1.0, 4.0, 0.0, 3.0, 1.0, 0.0, 2.0, 0.0, 0.0, 2.0, 0.0, 3.0, 0.0, 1.0, 2.0, 0.0, 1.0, 0.0, 0.0, 1.0, 1.0, 2.0, 0.0, 0.0, 0.0, 0.0, 0.0, 0.0, 4.0], [64.0, 26.0, 16.0, 9.0, 8.0, 6.0, 4.0, 1.0, 5.0, 4.0, 3.0, 2.0, 1.0, 5.0, 5.0, 5.0, 4.0, 5.0, 1.0, 2.0, 2.0, 4.0, 3.0, 0.0, 2.0, 2.0, 2.0, 3.0, 0.0, 0.0, 2.0, 1.0, 0.0, 0.0, 1.0, 0.0, 0.0, 0.0, 2.0, 1.0, 1.0, 1.0, 0.0, 0.0, 0.0, 1.0, 0.0, 1.0, 2.0], [72.0, 23.0, 20.0, 13.0, 3.0, 4.0, 7.0, 0.0, 3.0, 1.0, 7.0, 4.0, 2.0, 5.0, 4.0, 3.0, 3.0, 4.0, 4.0, 1.0, 6.0, 0.0, 1.0, 0.0, 2.0, 1.0, 4.0, 0.0, 1.0, 3.0, 0.0, 1.0, 1.0, 0.0, 0.0, 0.0, 3.0, 1.0, 1.0, 0.0, 0.0, 1.0, 1.0, 1.0, 0.0, 1.0, 1.0, 2.0, 0.0], [80.0, 23.0, 16.0, 12.0, 4.0, 5.0, 5.0, 5.0, 3.0, 4.0, 4.0, 2.0, 0.0, 6.0, 2.0, 1.0, 7.0, 1.0, 0.0, 4.0, 5.0, 2.0, 2.0, 2.0, 0.0, 2.0, 1.0, 2.0, 4.0, 1.0, 1.0, 1.0, 1.0, 1.0, 0.0, 0.0, 3.0, 0.0, 1.0, 1.0, 0.0, 0.0, 0.0, 1.0, 0.0, 0.0, 2.0, 1.0, 2.0], [62.0, 22.0, 19.0, 10.0, 6.0, 3.0, 7.0, 2.0, 3.0, 5.0, 4.0, 6.0, 3.0, 2.0, 2.0, 4.0, 1.0, 1.0, 4.0, 2.0, 3.0, 6.0, 5.0, 0.0, 3.0, 2.0, 0.0, 3.0, 1.0, 0.0, 0.0, 1.0, 1.0, 1.0, 0.0, 1.0, 1.0, 1.0, 2.0, 1.0, 0.0, 1.0, 2.0, 0.0, 0.0, 2.0, 0.0, 0.0, 2.0], [69.0, 23.0, 15.0, 7.0, 7.0, 8.0, 5.0, 5.0, 3.0, 1.0, 3.0, 2.0, 2.0, 7.0, 3.0, 4.0, 6.0, 2.0, 4.0, 2.0, 2.0, 2.0, 2.0, 2.0, 1.0, 1.0, 0.0, 2.0, 2.0, 1.0, 1.0, 1.0, 2.0, 0.0, 0.0, 2.0, 0.0, 0.0, 0.0, 2.0, 2.0, 1.0, 0.0, 0.0, 1.0, 1.0, 0.0, 0.0, 3.0], [71.0, 36.0, 13.0, 10.0, 7.0, 2.0, 9.0, 4.0, 3.0, 5.0, 2.0, 3.0, 4.0, 4.0, 3.0, 3.0, 4.0, 4.0, 2.0, 0.0, 5.0, 0.0, 4.0, 0.0, 0.0, 2.0, 0.0, 3.0, 1.0, 1.0, 3.0, 0.0, 0.0, 1.0, 1.0, 1.0, 2.0, 0.0, 0.0, 1.0, 3.0, 3.0, 0.0, 3.0, 0.0, 1.0, 0.0, 0.0, 2.0], [78.0, 25.0, 7.0, 13.0, 3.0, 8.0, 6.0, 3.0, 4.0, 4.0, 0.0, 6.0, 6.0, 1.0, 4.0, 2.0, 4.0, 3.0, 3.0, 5.0, 2.0, 0.0, 0.0, 3.0, 3.0, 1.0, 0.0, 2.0, 1.0, 0.0, 1.0, 5.0, 1.0, 0.0, 1.0, 1.0, 2.0, 0.0, 2.0, 0.0, 0.0, 0.0, 0.0, 0.0, 0.0, 1.0, 0.0, 0.0, 0.0], [74.0, 33.0, 11.0, 14.0, 7.0, 4.0, 3.0, 8.0, 4.0, 3.0, 2.0, 7.0, 0.0, 4.0, 4.0, 3.0, 4.0, 4.0, 3.0, 1.0, 3.0, 1.0, 1.0, 0.0, 0.0, 3.0, 2.0, 1.0, 1.0, 2.0, 2.0, 0.0, 1.0, 1.0, 0.0, 0.0, 1.0, 3.0, 0.0, 1.0, 1.0, 0.0, 1.0, 0.0, 0.0, 1.0, 0.0, 1.0, 0.0]],
    "Name": "sCurve-0",
    "Overflow": 2033181.0,
    "Type": "Histo2d",
    "Underflow": 0.0,
    "x": {
        "AxisTitle": "Vcal",
        "Bins": 51,
        "High": 302.5,
        "Low": 47.5
    },
    "y": {
        "AxisTitle": "Occupancy",
        "Bins": 49,
        "High": 49.5,
        "Low": 0.5
    },
    "z": {
        "AxisTitle": "Number of pixels"
    }
}