time,Hardware,Voltage,Current
1623283320057,high-voltage,1,0.0248255
time,Hardware,Voltage,Current
1623283320057,high-voltage,2,0.0321432
time,Hardware,Voltage,Current
1623283320057,high-voltage,3,0.0392835
time,Hardware,Voltage,Current
1623283320057,high-voltage,4,0.0435441
time,Hardware,Voltage,Current
1623283320057,high-voltage,5,0.0481306
time,Hardware,Voltage,Current
1623283320057,high-voltage,6,0.0522411
time,Hardware,Voltage,Current
1623283320057,high-voltage,7,0.0583949
time,Hardware,Voltage,Current
1623283320057,high-voltage,8,0.0632129
time,Hardware,Voltage,Current
1623283320057,high-voltage,9,0.0680345
time,Hardware,Voltage,Current
1623283320057,high-voltage,10,0.0731279
time,Hardware,Voltage,Current
1623283320057,high-voltage,11,0.0768999
time,Hardware,Voltage,Current
1623283320057,high-voltage,12,0.0823409
time,Hardware,Voltage,Current
1623283320057,high-voltage,13,0.0860095
time,Hardware,Voltage,Current
1623283320057,high-voltage,14,0.0887881
time,Hardware,Voltage,Current
1623283320057,high-voltage,9.3241e-08,0.0922819
time,Hardware,Voltage,Current
1623283320057,high-voltage,16,0.0945937
time,Hardware,Voltage,Current
1623283320057,high-voltage,9.79785e-08,0.0980702
time,Hardware,Voltage,Current
1623283320057,high-voltage,18,0.100074
time,Hardware,Voltage,Current
1623283320057,high-voltage,19,0.103645
time,Hardware,Voltage,Current
1623283320057,high-voltage,20,0.105963
time,Hardware,Voltage,Current
1623283320057,high-voltage,25,0.118134
time,Hardware,Voltage,Current
1623283320057,high-voltage,30,0.134723
time,Hardware,Voltage,Current
1623283320057,high-voltage,35,0.185022
time,Hardware,Voltage,Current
1623283320057,high-voltage,40,0.374007
time,Hardware,Voltage,Current
1623283320057,high-voltage,7.76068e-07,0.776448
time,Hardware,Voltage,Current
1623283320057,high-voltage,50,1.36654
time,Hardware,Voltage,Current
1623283320057,high-voltage,2.1149e-06,2.11651
time,Hardware,Voltage,Current
1623283320057,high-voltage,60,3.01483
time,Hardware,Voltage,Current
1623283320057,high-voltage,65,4.05239
time,Hardware,Voltage,Current
1623283320057,high-voltage,70,5.24374
time,Hardware,Voltage,Current
1623283320057,high-voltage,75,6.6184
time,Hardware,Voltage,Current
1623283320057,high-voltage,80,8.167
time,Hardware,Voltage,Current
1623283320057,high-voltage,85,9.89031
time,Hardware,Voltage,Current
1623283320057,high-voltage,90,10
