{
    "Data": [[2603.0, 1387.0, 999.0, 778.0, 599.0, 514.0, 489.0, 451.0, 380.0, 367.0, 309.0, 277.0, 285.0, 277.0, 259.0, 234.0, 210.0, 241.0, 204.0, 201.0, 188.0, 184.0, 189.0, 190.0, 185.0, 177.0, 160.0, 178.0, 172.0, 189.0, 188.0, 185.0, 176.0, 167.0, 182.0, 164.0, 165.0, 175.0, 179.0, 175.0, 195.0, 187.0, 199.0, 208.0, 201.0, 226.0, 244.0, 303.0, 359.0], [2615.0, 1512.0, 1037.0, 789.0, 694.0, 555.0, 463.0, 430.0, 419.0, 407.0, 345.0, 330.0, 279.0, 292.0, 260.0, 237.0, 251.0, 203.0, 235.0, 214.0, 221.0, 190.0, 206.0, 199.0, 195.0, 183.0, 215.0, 164.0, 176.0, 198.0, 192.0, 195.0, 181.0, 171.0, 194.0, 199.0, 184.0, 194.0, 187.0, 202.0, 216.0, 194.0, 228.0, 233.0, 244.0, 235.0, 284.0, 331.0, 472.0], [2785.0, 1522.0, 1061.0, 825.0, 669.0, 597.0, 460.0, 462.0, 443.0, 400.0, 346.0, 308.0, 310.0, 311.0, 276.0, 271.0, 284.0, 241.0, 234.0, 247.0, 217.0, 215.0, 206.0, 206.0, 225.0, 200.0, 207.0, 178.0, 219.0, 200.0, 213.0, 224.0, 223.0, 215.0, 200.0, 211.0, 210.0, 210.0, 196.0, 221.0, 200.0, 238.0, 220.0, 239.0, 278.0, 289.0, 304.0, 447.0, 573.0], [2912.0, 1563.0, 1045.0, 818.0, 742.0, 569.0, 506.0, 486.0, 443.0, 436.0, 345.0, 354.0, 331.0, 321.0, 309.0, 273.0, 279.0, 276.0, 287.0, 249.0, 251.0, 223.0, 258.0, 228.0, 234.0, 215.0, 183.0, 181.0, 207.0, 223.0, 209.0, 227.0, 189.0, 218.0, 209.0, 228.0, 216.0, 232.0, 227.0, 245.0, 246.0, 279.0, 270.0, 296.0, 329.0, 307.0, 392.0, 452.0, 716.0], [2910.0, 1671.0, 1138.0, 886.0, 717.0, 650.0, 566.0, 488.0, 407.0, 415.0, 387.0, 389.0, 347.0, 311.0, 331.0, 311.0, 310.0, 282.0, 258.0, 244.0, 242.0, 247.0, 231.0, 231.0, 228.0, 225.0, 212.0, 212.0, 227.0, 247.0, 238.0, 217.0, 223.0, 242.0, 227.0, 252.0, 259.0, 224.0, 241.0, 256.0, 256.0, 266.0, 302.0, 303.0, 320.0, 366.0, 461.0, 544.0, 819.0], [2972.0, 1652.0, 1200.0, 878.0, 757.0, 679.0, 572.0, 496.0, 467.0, 415.0, 383.0, 423.0, 353.0, 355.0, 319.0, 335.0, 274.0, 267.0, 265.0, 277.0, 268.0, 245.0, 275.0, 262.0, 267.0, 230.0, 245.0, 233.0, 241.0, 260.0, 245.0, 213.0, 238.0, 236.0, 247.0, 273.0, 247.0, 256.0, 264.0, 270.0, 287.0, 285.0, 307.0, 345.0, 351.0, 407.0, 429.0, 613.0, 976.0], [3006.0, 1716.0, 1213.0, 892.0, 738.0, 654.0, 646.0, 538.0, 454.0, 459.0, 460.0, 411.0, 339.0, 370.0, 360.0, 305.0, 319.0, 275.0, 260.0, 255.0, 279.0, 261.0, 260.0, 246.0, 250.0, 270.0, 270.0, 253.0, 244.0, 293.0, 240.0, 260.0, 280.0, 248.0, 248.0, 253.0, 249.0, 301.0, 281.0, 301.0, 288.0, 295.0, 316.0, 361.0, 398.0, 407.0, 499.0, 650.0, 1077.0], [3012.0, 1723.0, 1270.0, 942.0, 713.0, 650.0, 598.0, 542.0, 489.0, 431.0, 431.0, 424.0, 405.0, 325.0, 350.0, 312.0, 312.0, 301.0, 321.0, 291.0, 303.0, 289.0, 279.0, 281.0, 279.0, 286.0, 247.0, 245.0, 276.0, 257.0, 269.0, 253.0, 253.0, 274.0, 236.0, 259.0, 287.0, 258.0, 287.0, 318.0, 340.0, 349.0, 330.0, 399.0, 421.0, 453.0, 535.0, 677.0, 1122.0], [3062.0, 1762.0, 1183.0, 907.0, 767.0, 659.0, 598.0, 578.0, 540.0, 490.0, 405.0, 427.0, 396.0, 398.0, 339.0, 305.0, 324.0, 299.0, 276.0, 295.0, 253.0, 264.0, 300.0, 280.0, 296.0, 278.0, 271.0, 260.0, 268.0, 273.0, 271.0, 265.0, 282.0, 263.0, 273.0, 292.0, 291.0, 280.0, 303.0, 290.0, 331.0, 311.0, 377.0, 398.0, 459.0, 514.0, 576.0, 770.0, 1197.0], [3051.0, 1676.0, 1220.0, 959.0, 774.0, 701.0, 603.0, 552.0, 490.0, 471.0, 442.0, 395.0, 336.0, 363.0, 330.0, 330.0, 307.0, 312.0, 304.0, 298.0, 288.0, 301.0, 292.0, 284.0, 272.0, 282.0, 270.0, 252.0, 261.0, 266.0, 281.0, 289.0, 291.0, 291.0, 288.0, 294.0, 293.0, 284.0, 301.0, 337.0, 368.0, 370.0, 396.0, 408.0, 406.0, 514.0, 598.0, 824.0, 1331.0], [2965.0, 1679.0, 1227.0, 898.0, 735.0, 687.0, 613.0, 528.0, 508.0, 460.0, 447.0, 402.0, 395.0, 363.0, 319.0, 324.0, 310.0, 331.0, 311.0, 283.0, 308.0, 284.0, 278.0, 252.0, 294.0, 306.0, 267.0, 272.0, 244.0, 240.0, 293.0, 284.0, 282.0, 283.0, 258.0, 290.0, 293.0, 298.0, 321.0, 323.0, 339.0, 331.0, 387.0, 442.0, 458.0, 576.0, 627.0, 814.0, 1403.0], [2934.0, 1571.0, 1169.0, 888.0, 770.0, 673.0, 549.0, 517.0, 533.0, 465.0, 401.0, 378.0, 390.0, 372.0, 325.0, 323.0, 303.0, 305.0, 275.0, 297.0, 302.0, 282.0, 280.0, 297.0, 246.0, 267.0, 272.0, 273.0, 281.0, 292.0, 302.0, 261.0, 271.0, 294.0, 270.0, 289.0, 310.0, 288.0, 332.0, 352.0, 341.0, 368.0, 392.0, 417.0, 444.0, 519.0, 614.0, 860.0, 1393.0], [2928.0, 1516.0, 1164.0, 862.0, 682.0, 630.0, 562.0, 483.0, 461.0, 416.0, 393.0, 368.0, 371.0, 365.0, 349.0, 337.0, 313.0, 289.0, 285.0, 302.0, 269.0, 287.0, 239.0, 267.0, 268.0, 278.0, 279.0, 272.0, 238.0, 253.0, 245.0, 276.0, 265.0, 281.0, 268.0, 282.0, 293.0, 325.0, 313.0, 351.0, 319.0, 401.0, 389.0, 378.0, 469.0, 517.0, 692.0, 879.0, 1389.0], [2814.0, 1491.0, 1065.0, 813.0, 711.0, 608.0, 526.0, 474.0, 484.0, 421.0, 435.0, 352.0, 350.0, 314.0, 331.0, 296.0, 262.0, 319.0, 273.0, 270.0, 264.0, 271.0, 261.0, 240.0, 240.0, 254.0, 247.0, 265.0, 280.0, 245.0, 262.0, 261.0, 256.0, 304.0, 268.0, 258.0, 268.0, 304.0, 320.0, 326.0, 332.0, 348.0, 354.0, 430.0, 473.0, 506.0, 625.0, 854.0, 1428.0], [2887.0, 1543.0, 1088.0, 802.0, 680.0, 585.0, 533.0, 514.0, 444.0, 382.0, 375.0, 360.0, 321.0, 334.0, 295.0, 293.0, 292.0, 275.0, 299.0, 264.0, 258.0, 240.0, 248.0, 232.0, 222.0, 250.0, 245.0, 231.0, 263.0, 262.0, 241.0, 237.0, 267.0, 246.0, 279.0, 249.0, 271.0, 303.0, 276.0, 290.0, 330.0, 319.0, 384.0, 392.0, 435.0, 503.0, 582.0, 849.0, 1443.0], [3099.0, 1550.0, 1118.0, 780.0, 650.0, 566.0, 512.0, 409.0, 399.0, 369.0, 376.0, 363.0, 333.0, 312.0, 298.0, 297.0, 269.0, 264.0, 248.0, 250.0, 264.0, 265.0, 242.0, 227.0, 218.0, 246.0, 228.0, 225.0, 224.0, 226.0, 243.0, 231.0, 244.0, 252.0, 246.0, 269.0, 249.0, 295.0, 274.0, 314.0, 293.0, 295.0, 367.0, 410.0, 395.0, 454.0, 603.0, 750.0, 1326.0], [3694.0, 1776.0, 1144.0, 873.0, 713.0, 564.0, 463.0, 395.0, 399.0, 356.0, 350.0, 322.0, 301.0, 286.0, 299.0, 256.0, 259.0, 234.0, 234.0, 241.0, 265.0, 245.0, 219.0, 248.0, 215.0, 239.0, 234.0, 211.0, 212.0, 232.0, 225.0, 233.0, 203.0, 227.0, 259.0, 232.0, 272.0, 230.0, 272.0, 303.0, 301.0, 297.0, 329.0, 347.0, 384.0, 443.0, 556.0, 731.0, 1267.0], [4306.0, 2131.0, 1311.0, 940.0, 750.0, 610.0, 489.0, 431.0, 405.0, 376.0, 324.0, 281.0, 327.0, 284.0, 280.0, 285.0, 258.0, 266.0, 209.0, 214.0, 232.0, 217.0, 182.0, 219.0, 213.0, 206.0, 198.0, 218.0, 233.0, 216.0, 194.0, 235.0, 222.0, 229.0, 203.0, 240.0, 222.0, 259.0, 247.0, 272.0, 265.0, 299.0, 303.0, 344.0, 374.0, 430.0, 466.0, 689.0, 1182.0], [5004.0, 2556.0, 1627.0, 1185.0, 906.0, 695.0, 571.0, 476.0, 424.0, 415.0, 335.0, 333.0, 288.0, 302.0, 274.0, 264.0, 257.0, 231.0, 229.0, 184.0, 224.0, 213.0, 218.0, 218.0, 191.0, 199.0, 204.0, 168.0, 180.0, 190.0, 217.0, 217.0, 221.0, 225.0, 197.0, 223.0, 217.0, 235.0, 216.0, 225.0, 269.0, 286.0, 280.0, 306.0, 337.0, 408.0, 518.0, 655.0, 1096.0], [5297.0, 2996.0, 2015.0, 1454.0, 1082.0, 911.0, 738.0, 634.0, 582.0, 453.0, 416.0, 381.0, 377.0, 274.0, 270.0, 261.0, 251.0, 284.0, 244.0, 192.0, 205.0, 232.0, 208.0, 193.0, 206.0, 179.0, 200.0, 182.0, 196.0, 188.0, 176.0, 192.0, 167.0, 196.0, 218.0, 205.0, 217.0, 224.0, 210.0, 212.0, 238.0, 276.0, 257.0, 287.0, 301.0, 384.0, 437.0, 640.0, 1099.0], [5420.0, 3111.0, 2343.0, 1824.0, 1412.0, 1099.0, 966.0, 820.0, 738.0, 621.0, 553.0, 515.0, 436.0, 403.0, 348.0, 310.0, 303.0, 325.0, 251.0, 247.0, 218.0, 225.0, 177.0, 223.0, 214.0, 194.0, 215.0, 188.0, 197.0, 205.0, 203.0, 197.0, 201.0, 204.0, 182.0, 187.0, 210.0, 188.0, 207.0, 228.0, 244.0, 255.0, 260.0, 261.0, 275.0, 325.0, 414.0, 549.0, 950.0], [5122.0, 3267.0, 2357.0, 1927.0, 1597.0, 1346.0, 1138.0, 989.0, 890.0, 754.0, 697.0, 616.0, 579.0, 531.0, 517.0, 439.0, 416.0, 342.0, 324.0, 318.0, 311.0, 294.0, 235.0, 240.0, 240.0, 247.0, 204.0, 215.0, 228.0, 203.0, 197.0, 199.0, 191.0, 213.0, 211.0, 195.0, 192.0, 191.0, 202.0, 212.0, 227.0, 227.0, 225.0, 268.0, 266.0, 322.0, 361.0, 506.0, 881.0], [4492.0, 2987.0, 2352.0, 1885.0, 1575.0, 1458.0, 1328.0, 1167.0, 1006.0, 966.0, 861.0, 848.0, 786.0, 661.0, 666.0, 582.0, 526.0, 497.0, 476.0, 421.0, 385.0, 371.0, 405.0, 332.0, 335.0, 303.0, 284.0, 266.0, 245.0, 266.0, 220.0, 222.0, 229.0, 220.0, 226.0, 215.0, 209.0, 225.0, 212.0, 217.0, 223.0, 203.0, 226.0, 260.0, 258.0, 298.0, 386.0, 450.0, 799.0], [3686.0, 2608.0, 2080.0, 1743.0, 1603.0, 1386.0, 1282.0, 1131.0, 1135.0, 1006.0, 975.0, 875.0, 839.0, 826.0, 792.0, 676.0, 714.0, 684.0, 610.0, 589.0, 515.0, 539.0, 497.0, 456.0, 434.0, 398.0, 412.0, 402.0, 365.0, 364.0, 305.0, 286.0, 315.0, 295.0, 280.0, 294.0, 256.0, 258.0, 257.0, 245.0, 252.0, 266.0, 249.0, 249.0, 282.0, 306.0, 360.0, 448.0, 783.0], [2962.0, 2064.0, 1701.0, 1504.0, 1293.0, 1270.0, 1144.0, 1108.0, 1045.0, 959.0, 953.0, 853.0, 894.0, 836.0, 815.0, 789.0, 697.0, 710.0, 698.0, 641.0, 690.0, 680.0, 593.0, 651.0, 590.0, 556.0, 547.0, 518.0, 483.0, 483.0, 476.0, 444.0, 443.0, 437.0, 409.0, 386.0, 394.0, 371.0, 398.0, 286.0, 352.0, 364.0, 327.0, 294.0, 302.0, 318.0, 395.0, 451.0, 764.0], [2530.0, 1619.0, 1297.0, 1153.0, 1059.0, 930.0, 931.0, 888.0, 849.0, 853.0, 846.0, 807.0, 780.0, 771.0, 805.0, 781.0, 724.0, 713.0, 724.0, 717.0, 664.0, 625.0, 692.0, 678.0, 704.0, 663.0, 635.0, 628.0, 600.0, 590.0, 594.0, 563.0, 597.0, 583.0, 495.0, 561.0, 559.0, 524.0, 547.0, 496.0, 499.0, 489.0, 459.0, 455.0, 464.0, 446.0, 457.0, 532.0, 783.0], [2250.0, 1344.0, 1092.0, 895.0, 815.0, 797.0, 698.0, 679.0, 659.0, 687.0, 632.0, 641.0, 642.0, 633.0, 636.0, 632.0, 602.0, 661.0, 601.0, 660.0, 617.0, 652.0, 663.0, 686.0, 631.0, 637.0, 675.0, 582.0, 641.0, 630.0, 667.0, 676.0, 699.0, 671.0, 691.0, 730.0, 678.0, 726.0, 697.0, 692.0, 668.0, 660.0, 681.0, 675.0, 686.0, 634.0, 700.0, 750.0, 946.0], [2054.0, 1187.0, 910.0, 727.0, 665.0, 567.0, 564.0, 554.0, 483.0, 504.0, 487.0, 522.0, 482.0, 480.0, 491.0, 487.0, 497.0, 442.0, 486.0, 522.0, 519.0, 542.0, 552.0, 569.0, 576.0, 580.0, 583.0, 604.0, 609.0, 622.0, 596.0, 680.0, 665.0, 722.0, 764.0, 756.0, 790.0, 772.0, 785.0, 807.0, 876.0, 867.0, 913.0, 899.0, 900.0, 976.0, 1039.0, 1144.0, 1347.0], [1870.0, 1199.0, 770.0, 647.0, 559.0, 449.0, 473.0, 467.0, 414.0, 386.0, 341.0, 372.0, 376.0, 391.0, 361.0, 399.0, 393.0, 362.0, 334.0, 394.0, 417.0, 364.0, 412.0, 445.0, 461.0, 451.0, 474.0, 508.0, 515.0, 520.0, 531.0, 543.0, 584.0, 622.0, 669.0, 722.0, 744.0, 713.0, 825.0, 836.0, 888.0, 933.0, 995.0, 1077.0, 1166.0, 1326.0, 1425.0, 1579.0, 1997.0], [1975.0, 1084.0, 776.0, 548.0, 532.0, 444.0, 396.0, 342.0, 344.0, 347.0, 339.0, 289.0, 297.0, 330.0, 320.0, 278.0, 315.0, 289.0, 286.0, 283.0, 273.0, 296.0, 300.0, 294.0, 326.0, 353.0, 338.0, 380.0, 324.0, 398.0, 412.0, 436.0, 451.0, 495.0, 543.0, 535.0, 639.0, 634.0, 694.0, 778.0, 810.0, 907.0, 987.0, 1073.0, 1187.0, 1495.0, 1675.0, 2051.0, 2649.0], [1827.0, 1055.0, 810.0, 586.0, 473.0, 394.0, 374.0, 344.0, 303.0, 274.0, 244.0, 316.0, 234.0, 252.0, 254.0, 257.0, 241.0, 216.0, 250.0, 219.0, 207.0, 217.0, 238.0, 225.0, 240.0, 235.0, 258.0, 252.0, 244.0, 292.0, 302.0, 320.0, 315.0, 338.0, 332.0, 380.0, 423.0, 503.0, 544.0, 612.0, 643.0, 719.0, 845.0, 949.0, 1212.0, 1410.0, 1743.0, 2212.0, 3290.0], [1877.0, 1039.0, 733.0, 545.0, 489.0, 417.0, 356.0, 353.0, 320.0, 288.0, 258.0, 248.0, 202.0, 219.0, 207.0, 199.0, 202.0, 176.0, 217.0, 218.0, 171.0, 168.0, 146.0, 155.0, 178.0, 211.0, 179.0, 221.0, 234.0, 227.0, 220.0, 229.0, 245.0, 255.0, 280.0, 284.0, 323.0, 359.0, 334.0, 406.0, 491.0, 483.0, 590.0, 717.0, 908.0, 1146.0, 1559.0, 2134.0, 3547.0], [1794.0, 1064.0, 642.0, 521.0, 437.0, 393.0, 356.0, 320.0, 268.0, 284.0, 261.0, 251.0, 209.0, 233.0, 195.0, 209.0, 186.0, 154.0, 163.0, 132.0, 184.0, 163.0, 146.0, 165.0, 164.0, 152.0, 161.0, 153.0, 146.0, 164.0, 169.0, 149.0, 168.0, 178.0, 206.0, 187.0, 209.0, 246.0, 239.0, 262.0, 296.0, 388.0, 421.0, 479.0, 608.0, 829.0, 1229.0, 1837.0, 3308.0], [1829.0, 982.0, 711.0, 594.0, 449.0, 414.0, 350.0, 259.0, 280.0, 288.0, 259.0, 226.0, 198.0, 172.0, 183.0, 181.0, 167.0, 176.0, 186.0, 170.0, 171.0, 172.0, 142.0, 161.0, 159.0, 134.0, 137.0, 127.0, 121.0, 145.0, 120.0, 117.0, 176.0, 148.0, 154.0, 105.0, 142.0, 155.0, 178.0, 194.0, 204.0, 225.0, 276.0, 314.0, 401.0, 550.0, 810.0, 1337.0, 2704.0], [1686.0, 964.0, 713.0, 591.0, 482.0, 336.0, 336.0, 288.0, 299.0, 283.0, 268.0, 188.0, 194.0, 196.0, 158.0, 156.0, 169.0, 161.0, 166.0, 163.0, 159.0, 155.0, 173.0, 127.0, 122.0, 135.0, 145.0, 130.0, 127.0, 135.0, 109.0, 162.0, 125.0, 138.0, 129.0, 140.0, 136.0, 148.0, 117.0, 164.0, 143.0, 158.0, 172.0, 223.0, 257.0, 353.0, 557.0, 884.0, 1990.0], [1797.0, 1029.0, 678.0, 494.0, 416.0, 390.0, 359.0, 323.0, 247.0, 237.0, 216.0, 201.0, 202.0, 172.0, 208.0, 167.0, 176.0, 167.0, 131.0, 146.0, 144.0, 124.0, 168.0, 111.0, 102.0, 128.0, 118.0, 121.0, 121.0, 114.0, 137.0, 109.0, 100.0, 114.0, 163.0, 145.0, 136.0, 134.0, 129.0, 107.0, 131.0, 131.0, 146.0, 154.0, 201.0, 235.0, 367.0, 500.0, 1399.0], [1790.0, 1001.0, 682.0, 595.0, 457.0, 374.0, 332.0, 326.0, 277.0, 232.0, 198.0, 211.0, 216.0, 183.0, 175.0, 201.0, 157.0, 156.0, 166.0, 187.0, 140.0, 113.0, 131.0, 131.0, 132.0, 133.0, 101.0, 131.0, 132.0, 169.0, 166.0, 109.0, 104.0, 134.0, 130.0, 106.0, 96.0, 99.0, 96.0, 110.0, 104.0, 158.0, 142.0, 121.0, 154.0, 140.0, 242.0, 348.0, 807.0], [1738.0, 972.0, 692.0, 566.0, 449.0, 343.0, 313.0, 288.0, 281.0, 261.0, 213.0, 187.0, 209.0, 187.0, 168.0, 199.0, 195.0, 173.0, 173.0, 147.0, 142.0, 120.0, 148.0, 150.0, 102.0, 110.0, 150.0, 105.0, 109.0, 110.0, 126.0, 111.0, 98.0, 100.0, 127.0, 120.0, 119.0, 159.0, 95.0, 129.0, 152.0, 134.0, 126.0, 95.0, 119.0, 153.0, 179.0, 221.0, 544.0], [1761.0, 976.0, 708.0, 553.0, 432.0, 366.0, 364.0, 311.0, 295.0, 260.0, 230.0, 173.0, 223.0, 221.0, 150.0, 182.0, 168.0, 145.0, 145.0, 130.0, 101.0, 133.0, 113.0, 154.0, 114.0, 129.0, 101.0, 112.0, 109.0, 104.0, 113.0, 117.0, 88.0, 101.0, 124.0, 99.0, 117.0, 113.0, 133.0, 137.0, 97.0, 108.0, 160.0, 128.0, 134.0, 120.0, 143.0, 182.0, 362.0], [1728.0, 975.0, 720.0, 507.0, 433.0, 349.0, 333.0, 272.0, 269.0, 250.0, 245.0, 234.0, 192.0, 178.0, 183.0, 185.0, 168.0, 130.0, 136.0, 148.0, 131.0, 136.0, 138.0, 109.0, 119.0, 104.0, 129.0, 112.0, 102.0, 105.0, 91.0, 126.0, 110.0, 89.0, 112.0, 113.0, 126.0, 95.0, 111.0, 122.0, 119.0, 100.0, 102.0, 100.0, 118.0, 125.0, 154.0, 156.0, 278.0], [1758.0, 952.0, 689.0, 562.0, 430.0, 358.0, 334.0, 276.0, 250.0, 217.0, 214.0, 205.0, 215.0, 154.0, 192.0, 162.0, 158.0, 151.0, 138.0, 157.0, 113.0, 125.0, 138.0, 105.0, 118.0, 126.0, 124.0, 145.0, 95.0, 116.0, 100.0, 97.0, 129.0, 118.0, 109.0, 85.0, 93.0, 102.0, 96.0, 100.0, 112.0, 97.0, 107.0, 96.0, 101.0, 106.0, 113.0, 146.0, 244.0], [1776.0, 986.0, 691.0, 510.0, 441.0, 373.0, 313.0, 304.0, 243.0, 224.0, 218.0, 224.0, 206.0, 172.0, 195.0, 142.0, 143.0, 153.0, 164.0, 135.0, 139.0, 167.0, 175.0, 110.0, 118.0, 124.0, 91.0, 124.0, 94.0, 115.0, 91.0, 93.0, 106.0, 103.0, 150.0, 111.0, 88.0, 111.0, 110.0, 80.0, 125.0, 90.0, 96.0, 98.0, 80.0, 101.0, 106.0, 123.0, 211.0], [1788.0, 1014.0, 714.0, 486.0, 437.0, 361.0, 335.0, 251.0, 245.0, 230.0, 225.0, 237.0, 186.0, 201.0, 158.0, 148.0, 148.0, 180.0, 133.0, 118.0, 127.0, 114.0, 111.0, 118.0, 108.0, 116.0, 126.0, 100.0, 120.0, 132.0, 109.0, 120.0, 96.0, 84.0, 117.0, 89.0, 96.0, 95.0, 122.0, 91.0, 107.0, 114.0, 123.0, 91.0, 143.0, 92.0, 108.0, 166.0, 211.0], [1790.0, 965.0, 670.0, 533.0, 428.0, 356.0, 342.0, 280.0, 276.0, 218.0, 229.0, 209.0, 168.0, 174.0, 174.0, 154.0, 182.0, 160.0, 136.0, 120.0, 118.0, 119.0, 115.0, 118.0, 109.0, 113.0, 113.0, 88.0, 111.0, 86.0, 137.0, 103.0, 85.0, 117.0, 114.0, 106.0, 106.0, 121.0, 107.0, 76.0, 96.0, 91.0, 112.0, 91.0, 104.0, 113.0, 106.0, 133.0, 171.0], [1760.0, 986.0, 695.0, 535.0, 425.0, 369.0, 305.0, 291.0, 271.0, 240.0, 201.0, 211.0, 185.0, 181.0, 158.0, 175.0, 144.0, 160.0, 123.0, 143.0, 122.0, 142.0, 133.0, 114.0, 122.0, 98.0, 105.0, 112.0, 95.0, 96.0, 107.0, 120.0, 108.0, 104.0, 88.0, 101.0, 109.0, 106.0, 95.0, 96.0, 146.0, 75.0, 116.0, 106.0, 96.0, 102.0, 109.0, 138.0, 166.0], [1833.0, 924.0, 743.0, 541.0, 435.0, 343.0, 298.0, 254.0, 269.0, 209.0, 223.0, 211.0, 182.0, 179.0, 147.0, 162.0, 136.0, 136.0, 132.0, 135.0, 148.0, 128.0, 112.0, 121.0, 116.0, 100.0, 102.0, 110.0, 114.0, 96.0, 79.0, 100.0, 100.0, 112.0, 104.0, 97.0, 93.0, 107.0, 117.0, 120.0, 93.0, 101.0, 106.0, 93.0, 106.0, 117.0, 95.0, 118.0, 157.0], [1760.0, 972.0, 731.0, 503.0, 428.0, 383.0, 283.0, 267.0, 250.0, 223.0, 237.0, 189.0, 188.0, 178.0, 172.0, 149.0, 149.0, 151.0, 132.0, 133.0, 147.0, 148.0, 116.0, 101.0, 106.0, 115.0, 101.0, 126.0, 99.0, 108.0, 117.0, 106.0, 114.0, 82.0, 86.0, 112.0, 100.0, 92.0, 98.0, 92.0, 103.0, 97.0, 95.0, 98.0, 95.0, 96.0, 111.0, 126.0, 156.0], [1785.0, 982.0, 666.0, 514.0, 420.0, 343.0, 304.0, 271.0, 286.0, 237.0, 200.0, 198.0, 161.0, 185.0, 182.0, 165.0, 160.0, 140.0, 128.0, 139.0, 111.0, 124.0, 119.0, 103.0, 118.0, 116.0, 113.0, 119.0, 116.0, 100.0, 89.0, 98.0, 107.0, 82.0, 101.0, 108.0, 83.0, 89.0, 99.0, 88.0, 87.0, 95.0, 109.0, 103.0, 98.0, 96.0, 110.0, 146.0, 187.0], [1765.0, 951.0, 728.0, 524.0, 434.0, 346.0, 308.0, 298.0, 239.0, 244.0, 208.0, 208.0, 177.0, 175.0, 145.0, 155.0, 133.0, 154.0, 147.0, 144.0, 133.0, 115.0, 135.0, 102.0, 110.0, 111.0, 120.0, 102.0, 98.0, 121.0, 96.0, 97.0, 88.0, 99.0, 85.0, 96.0, 96.0, 92.0, 93.0, 96.0, 112.0, 95.0, 103.0, 98.0, 105.0, 105.0, 109.0, 105.0, 185.0], [1721.0, 990.0, 705.0, 498.0, 414.0, 366.0, 325.0, 275.0, 250.0, 226.0, 215.0, 215.0, 182.0, 191.0, 175.0, 136.0, 158.0, 138.0, 131.0, 139.0, 124.0, 116.0, 120.0, 107.0, 123.0, 92.0, 116.0, 114.0, 122.0, 109.0, 111.0, 101.0, 97.0, 93.0, 78.0, 109.0, 97.0, 90.0, 105.0, 97.0, 104.0, 108.0, 95.0, 85.0, 111.0, 102.0, 99.0, 123.0, 162.0], [1733.0, 973.0, 646.0, 501.0, 455.0, 353.0, 344.0, 279.0, 234.0, 232.0, 214.0, 183.0, 177.0, 190.0, 162.0, 157.0, 159.0, 135.0, 129.0, 138.0, 135.0, 126.0, 130.0, 130.0, 103.0, 108.0, 114.0, 92.0, 107.0, 105.0, 99.0, 91.0, 113.0, 99.0, 88.0, 100.0, 90.0, 93.0, 97.0, 109.0, 95.0, 84.0, 91.0, 91.0, 102.0, 115.0, 112.0, 118.0, 167.0]],
    "Name": "sCurve-0",
    "Overflow": 2447664.0,
    "Type": "Histo2d",
    "Underflow": 0.0,
    "x": {
        "AxisTitle": "Vcal",
        "Bins": 51,
        "High": 302.5,
        "Low": 47.5
    },
    "y": {
        "AxisTitle": "Occupancy",
        "Bins": 49,
        "High": 49.5,
        "Low": 0.5
    },
    "z": {
        "AxisTitle": "Number of pixels"
    }
}