time,Hardware,Voltage,Current
1621615123608,high-voltage-3,1,0.248282
time,Hardware,Voltage,Current
1621615123608,high-voltage-3,2,0.265042
time,Hardware,Voltage,Current
1621615123608,high-voltage-3,3,0.274776
time,Hardware,Voltage,Current
1621615123608,high-voltage-3,4,0.285867
time,Hardware,Voltage,Current
1621615123608,high-voltage-3,5,0.295609
time,Hardware,Voltage,Current
1621615123608,high-voltage-3,6,0.303773
time,Hardware,Voltage,Current
1621615123608,high-voltage-3,7,0.310803
time,Hardware,Voltage,Current
1621615123608,high-voltage-3,8,0.319721
time,Hardware,Voltage,Current
1621615123608,high-voltage-3,9,0.327389
time,Hardware,Voltage,Current
1621615123608,high-voltage-3,10,0.33573
time,Hardware,Voltage,Current
1621615123608,high-voltage-3,11,0.344922
time,Hardware,Voltage,Current
1621615123608,high-voltage-3,12,0.352085
time,Hardware,Voltage,Current
1621615123608,high-voltage-3,13,0.360679
time,Hardware,Voltage,Current
1621615123608,high-voltage-3,14,0.367099
time,Hardware,Voltage,Current
1621615123608,high-voltage-3,15,0.374643
time,Hardware,Voltage,Current
1621615123608,high-voltage-3,16,0.381078
time,Hardware,Voltage,Current
1621615123608,high-voltage-3,17,0.385418
time,Hardware,Voltage,Current
1621615123608,high-voltage-3,18,0.392391
time,Hardware,Voltage,Current
1621615123608,high-voltage-3,19,0.395963
time,Hardware,Voltage,Current
1621615123608,high-voltage-3,20,0.40244
time,Hardware,Voltage,Current
1621615123608,high-voltage-3,25,0.427604
time,Hardware,Voltage,Current
1621615123608,high-voltage-3,30,0.450147
time,Hardware,Voltage,Current
1621615123608,high-voltage-3,35,0.47164
time,Hardware,Voltage,Current
1621615123608,high-voltage-3,40,0.490735
time,Hardware,Voltage,Current
1621615123608,high-voltage-3,45,0.509144
time,Hardware,Voltage,Current
1621615123608,high-voltage-3,50,0.527411
time,Hardware,Voltage,Current
1621615123608,high-voltage-3,55,0.544041
time,Hardware,Voltage,Current
1621615123608,high-voltage-3,60,0.559429
time,Hardware,Voltage,Current
1621615123608,high-voltage-3,65,0.576951
time,Hardware,Voltage,Current
1621615123608,high-voltage-3,70,0.592288
time,Hardware,Voltage,Current
1621615123608,high-voltage-3,75,0.60641
time,Hardware,Voltage,Current
1621615123608,high-voltage-3,80,0.622698
time,Hardware,Voltage,Current
1621615123608,high-voltage-3,85,0.636006
time,Hardware,Voltage,Current
1621615123608,high-voltage-3,90,0.650288
time,Hardware,Voltage,Current
1621615123608,high-voltage-3,95,0.663049
