{
    "Data": [3012.0, 20388.0, 16161.0, 8115.0, 3031.0, 1462.0, 1675.0, 2497.0, 3294.0, 3674.0, 3431.0, 2886.0, 2227.0, 1647.0, 1033.0, 623.0, 357.0, 218.0, 123.0, 64.0, 34.0, 14.0, 9.0, 3.0, 7.0, 0.0, 4.0, 3.0, 1.0, 0.0, 2.0, 1.0, 0.0, 1.0, 2.0, 0.0, 3.0, 1.0, 0.0, 0.0, 2.0, 1.0, 0.0, 0.0, 0.0, 0.0, 0.0, 3.0, 0.0, 0.0, 0.0],
    "Name": "Chi2Dist-0",
    "Overflow": 0.0,
    "Type": "Histo1d",
    "Underflow": 0.0,
    "x": {
        "AxisTitle": "Fit Chi/ndf",
        "Bins": 51,
        "High": 2.5250000953674318,
        "Low": -0.02500000037252903
    },
    "y": {
        "AxisTitle": "Number of Pixels"
    },
    "z": {
        "AxisTitle": "z"
    }
}