time,Hardware,Voltage,Current
1626321622927,high-voltage-3,1,0.281292
time,Hardware,Voltage,Current
1626321622927,high-voltage-3,2,0.301393
time,Hardware,Voltage,Current
1626321622927,high-voltage-3,3,0.318498
time,Hardware,Voltage,Current
1626321622927,high-voltage-3,4,0.335026
time,Hardware,Voltage,Current
1626321622927,high-voltage-3,5,0.347011
time,Hardware,Voltage,Current
1626321622927,high-voltage-3,6,0.360101
time,Hardware,Voltage,Current
1626321622927,high-voltage-3,7,0.372401
time,Hardware,Voltage,Current
1626321622927,high-voltage-3,8,0.388914
time,Hardware,Voltage,Current
1626321622927,high-voltage-3,9,0.404784
time,Hardware,Voltage,Current
1626321622927,high-voltage-3,10,0.421173
time,Hardware,Voltage,Current
1626321622927,high-voltage-3,11,0.438385
time,Hardware,Voltage,Current
1626321622927,high-voltage-3,12,0.454188
time,Hardware,Voltage,Current
1626321622927,high-voltage-3,13,0.468326
time,Hardware,Voltage,Current
1626321622927,high-voltage-3,14,0.481434
time,Hardware,Voltage,Current
1626321622927,high-voltage-3,15,0.495493
time,Hardware,Voltage,Current
1626321622927,high-voltage-3,16,0.505806
time,Hardware,Voltage,Current
1626321622927,high-voltage-3,17,0.517836
time,Hardware,Voltage,Current
1626321622927,high-voltage-3,18,0.527305
time,Hardware,Voltage,Current
1626321622927,high-voltage-3,19,0.537543
time,Hardware,Voltage,Current
1626321622927,high-voltage-3,20,0.54756
time,Hardware,Voltage,Current
1626321622927,high-voltage-3,25,0.590897
time,Hardware,Voltage,Current
1626321622927,high-voltage-3,30,0.629382
time,Hardware,Voltage,Current
1626321622927,high-voltage-3,35,0.661218
time,Hardware,Voltage,Current
1626321622927,high-voltage-3,40,0.691855
time,Hardware,Voltage,Current
1626321622927,high-voltage-3,45,0.715985
time,Hardware,Voltage,Current
1626321622927,high-voltage-3,50,0.74207
time,Hardware,Voltage,Current
1626321622927,high-voltage-3,55,0.76762
time,Hardware,Voltage,Current
1626321622927,high-voltage-3,60,0.790878
time,Hardware,Voltage,Current
1626321622927,high-voltage-3,65,0.81475
time,Hardware,Voltage,Current
1626321622927,high-voltage-3,70,0.83969
time,Hardware,Voltage,Current
1626321622927,high-voltage-3,75,0.863355
time,Hardware,Voltage,Current
1626321622927,high-voltage-3,80,0.889735
time,Hardware,Voltage,Current
1626321622927,high-voltage-3,85,0.913574
