time,Hardware,Voltage,Current
1622071188910,high-voltage-3,1,0.096688
time,Hardware,Voltage,Current
1622071188910,high-voltage-3,2,0.102864
time,Hardware,Voltage,Current
1622071188910,high-voltage-3,3,0.109498
time,Hardware,Voltage,Current
1622071188910,high-voltage-3,4,0.11527
time,Hardware,Voltage,Current
1622071188910,high-voltage-3,5,0.121565
time,Hardware,Voltage,Current
1622071188910,high-voltage-3,6,0.126424
time,Hardware,Voltage,Current
1622071188910,high-voltage-3,7,0.13061
time,Hardware,Voltage,Current
1622071188910,high-voltage-3,8,0.136787
time,Hardware,Voltage,Current
1622071188910,high-voltage-3,9,0.144034
time,Hardware,Voltage,Current
1622071188910,high-voltage-3,10,0.151711
time,Hardware,Voltage,Current
1622071188910,high-voltage-3,11,0.157518
time,Hardware,Voltage,Current
1622071188910,high-voltage-3,12,0.164882
time,Hardware,Voltage,Current
1622071188910,high-voltage-3,13,0.171976
time,Hardware,Voltage,Current
1622071188910,high-voltage-3,14,0.176424
time,Hardware,Voltage,Current
1622071188910,high-voltage-3,15,0.182173
time,Hardware,Voltage,Current
1622071188910,high-voltage-3,16,0.188498
time,Hardware,Voltage,Current
1622071188910,high-voltage-3,17,0.192875
time,Hardware,Voltage,Current
1622071188910,high-voltage-3,18,0.196301
time,Hardware,Voltage,Current
1622071188910,high-voltage-3,19,0.200526
time,Hardware,Voltage,Current
1622071188910,high-voltage-3,20,0.205988
time,Hardware,Voltage,Current
1622071188910,high-voltage-3,25,0.223191
time,Hardware,Voltage,Current
1622071188910,high-voltage-3,30,0.240852
time,Hardware,Voltage,Current
1622071188910,high-voltage-3,35,0.257266
time,Hardware,Voltage,Current
1622071188910,high-voltage-3,40,0.271493
time,Hardware,Voltage,Current
1622071188910,high-voltage-3,45,0.283901
time,Hardware,Voltage,Current
1622071188910,high-voltage-3,50,0.299636
time,Hardware,Voltage,Current
1622071188910,high-voltage-3,55,0.310519
time,Hardware,Voltage,Current
1622071188910,high-voltage-3,60,0.321773
time,Hardware,Voltage,Current
1622071188910,high-voltage-3,65,0.33214
time,Hardware,Voltage,Current
1622071188910,high-voltage-3,70,0.344082
time,Hardware,Voltage,Current
1622071188910,high-voltage-3,75,0.354531
time,Hardware,Voltage,Current
1622071188910,high-voltage-3,80,0.364568
time,Hardware,Voltage,Current
1622071188910,high-voltage-3,85,0.374592
time,Hardware,Voltage,Current
1622071188910,high-voltage-3,90,0.385629
time,Hardware,Voltage,Current
1622071188910,high-voltage-3,95,0.396276
time,Hardware,Voltage,Current
1622071188910,high-voltage-3,100,0.406223