time,Hardware,Voltage,Current
1626732115489,high-voltage-3,1,0.315782
time,Hardware,Voltage,Current
1626732115489,high-voltage-3,2,0.335664
time,Hardware,Voltage,Current
1626732115489,high-voltage-3,3,0.353262
time,Hardware,Voltage,Current
1626732115489,high-voltage-3,4,0.369115
time,Hardware,Voltage,Current
1626732115489,high-voltage-3,5,0.381318
time,Hardware,Voltage,Current
1626732115489,high-voltage-3,6,0.392533
time,Hardware,Voltage,Current
1626732115489,high-voltage-3,7,0.405412
time,Hardware,Voltage,Current
1626732115489,high-voltage-3,8,0.42015
time,Hardware,Voltage,Current
1626732115489,high-voltage-3,9,0.436338
time,Hardware,Voltage,Current
1626732115489,high-voltage-3,10,0.451088
time,Hardware,Voltage,Current
1626732115489,high-voltage-3,11,0.466729
time,Hardware,Voltage,Current
1626732115489,high-voltage-3,12,0.48093
time,Hardware,Voltage,Current
1626732115489,high-voltage-3,13,0.494678
time,Hardware,Voltage,Current
1626732115489,high-voltage-3,14,0.506914
time,Hardware,Voltage,Current
1626732115489,high-voltage-3,15,0.518603
time,Hardware,Voltage,Current
1626732115489,high-voltage-3,16,0.530779
time,Hardware,Voltage,Current
1626732115489,high-voltage-3,17,0.541943
time,Hardware,Voltage,Current
1626732115489,high-voltage-3,18,0.553288
time,Hardware,Voltage,Current
1626732115489,high-voltage-3,19,0.563298
time,Hardware,Voltage,Current
1626732115489,high-voltage-3,20,0.572882
time,Hardware,Voltage,Current
1626732115489,high-voltage-3,25,0.616247
time,Hardware,Voltage,Current
1626732115489,high-voltage-3,30,0.651754
time,Hardware,Voltage,Current
1626732115489,high-voltage-3,35,0.684301
time,Hardware,Voltage,Current
1626732115489,high-voltage-3,40,0.71113
time,Hardware,Voltage,Current
1626732115489,high-voltage-3,45,0.736878
time,Hardware,Voltage,Current
1626732115489,high-voltage-3,50,0.761647
time,Hardware,Voltage,Current
1626732115489,high-voltage-3,55,0.783601
time,Hardware,Voltage,Current
1626732115489,high-voltage-3,60,0.806573
time,Hardware,Voltage,Current
1626732115489,high-voltage-3,65,0.82916
time,Hardware,Voltage,Current
1626732115489,high-voltage-3,70,0.853636
time,Hardware,Voltage,Current
1626732115489,high-voltage-3,75,0.877035
time,Hardware,Voltage,Current
1626732115489,high-voltage-3,80,0.901892
time,Hardware,Voltage,Current
1626732115489,high-voltage-3,85,0.9242
time,Hardware,Voltage,Current
1626732115489,high-voltage-3,90,0.949633
time,Hardware,Voltage,Current
1626732115489,high-voltage-3,95,0.970106
time,Hardware,Voltage,Current
1626732115489,high-voltage-3,100,0.994974
