{
    "Data": [0.0, 0.0, 0.0, 0.0, 0.0, 0.0, 0.0, 0.0, 0.0, 0.0, 0.0, 0.0, 0.0, 0.0, 0.0, 0.0, 0.0, 0.0, 0.0, 0.0, 0.0, 0.0, 0.0, 0.0, 0.0, 0.0, 0.0, 0.0, 0.0, 0.0, 0.0, 0.0, 0.0, 0.0, 0.0, 0.0, 0.0, 0.0, 0.0, 0.0, 0.0, 0.0, 0.0, 0.0, 0.0, 0.0, 0.0, 0.0, 0.0, 0.0, 2.0, 10.0, 17.0, 13.0, 9.0, 15.0, 9.0, 10.0, 12.0, 10.0, 18.0, 13.0, 38.0, 37.0, 41.0, 57.0, 53.0, 95.0, 100.0, 132.0, 176.0, 208.0, 251.0, 305.0, 349.0, 441.0, 509.0, 703.0, 688.0, 840.0, 941.0, 1002.0, 1059.0, 1159.0, 1228.0, 1230.0, 1292.0, 1426.0, 1434.0, 1584.0, 1971.0, 2313.0, 2919.0, 3481.0, 4040.0, 4163.0, 3816.0, 3233.0, 2553.0, 1739.0, 1248.0, 790.0, 487.0, 353.0, 236.0, 176.0, 113.0, 101.0, 85.0, 67.0, 49.0, 44.0, 33.0, 36.0, 41.0, 36.0, 24.0, 30.0, 23.0, 23.0, 29.0, 16.0, 21.0, 11.0, 24.0, 17.0, 17.0, 7.0, 12.0, 11.0, 10.0, 9.0, 10.0, 4.0, 13.0, 9.0, 8.0, 14.0, 9.0, 4.0, 10.0, 11.0, 8.0, 13.0, 5.0, 14.0, 4.0, 9.0, 11.0, 17.0, 12.0, 14.0, 25.0, 25.0, 25.0, 37.0, 43.0, 55.0, 67.0, 89.0, 111.0, 96.0, 130.0, 159.0, 155.0, 208.0, 226.0, 275.0, 295.0, 350.0, 386.0, 427.0, 457.0, 473.0, 527.0, 556.0, 562.0, 631.0, 602.0, 629.0, 690.0, 653.0, 652.0, 661.0, 687.0, 652.0, 718.0, 663.0, 615.0, 598.0, 605.0, 563.0, 508.0, 497.0, 484.0, 469.0, 429.0, 399.0, 343.0, 327.0, 296.0, 296.0, 269.0, 241.0, 218.0, 206.0, 179.0, 162.0, 153.0, 156.0, 137.0, 112.0, 105.0, 92.0, 109.0, 88.0, 58.0, 79.0, 56.0, 54.0, 49.0, 57.0, 58.0, 50.0, 32.0, 29.0, 28.0, 27.0, 28.0, 22.0, 25.0, 28.0, 21.0, 16.0, 13.0, 21.0, 28.0, 12.0, 22.0, 13.0, 9.0, 7.0, 14.0, 10.0, 10.0, 5.0, 7.0, 2.0, 4.0, 4.0, 8.0, 5.0, 4.0, 8.0, 4.0, 3.0, 1.0, 2.0, 5.0, 5.0, 5.0, 1.0, 5.0, 3.0, 4.0, 1.0, 4.0, 2.0, 8.0, 3.0, 4.0, 4.0, 3.0, 2.0, 2.0, 6.0, 0.0, 1.0, 5.0, 3.0, 1.0, 3.0, 1.0, 0.0, 0.0, 3.0, 0.0, 1.0, 1.0, 2.0, 1.0, 0.0, 1.0, 2.0, 0.0, 3.0, 0.0, 0.0, 1.0, 0.0, 1.0, 0.0, 0.0, 0.0, 0.0, 0.0, 0.0, 1.0, 0.0, 0.0, 2.0, 0.0, 0.0, 2.0, 2.0, 0.0, 1.0, 0.0, 1.0, 0.0, 0.0, 0.0, 1.0, 1.0, 0.0, 0.0, 0.0, 0.0, 0.0, 0.0, 0.0, 0.0, 0.0, 0.0, 0.0, 0.0, 0.0, 0.0, 0.0, 0.0, 0.0, 0.0, 0.0, 0.0, 0.0, 0.0],
    "Name": "ThresholdDist-0",
    "Overflow": 0.0,
    "Type": "Histo1d",
    "Underflow": 0.0,
    "x": {
        "AxisTitle": "Threshold [e]",
        "Bins": 346,
        "High": 3455.0,
        "Low": -5.0
    },
    "y": {
        "AxisTitle": "Number of Pixels"
    },
    "z": {
        "AxisTitle": "z"
    }
}