time,Hardware,Voltage,Current
1622002691697,high-voltage-3,1,0.00343444
time,Hardware,Voltage,Current
1622002691697,high-voltage-3,2,0.00664826
time,Hardware,Voltage,Current
1622002691697,high-voltage-3,3,0.00684286
time,Hardware,Voltage,Current
1622002691697,high-voltage-3,4,0.00812732
time,Hardware,Voltage,Current
1622002691697,high-voltage-3,5,0.0108262
time,Hardware,Voltage,Current
1622002691697,high-voltage-3,6,0.0112685
time,Hardware,Voltage,Current
1622002691697,high-voltage-3,7,0.0132643
time,Hardware,Voltage,Current
1622002691697,high-voltage-3,8,0.0166497
time,Hardware,Voltage,Current
1622002691697,high-voltage-3,9,0.0167799
time,Hardware,Voltage,Current
1622002691697,high-voltage-3,10,0.0188864
time,Hardware,Voltage,Current
1622002691697,high-voltage-3,11,0.0218366
time,Hardware,Voltage,Current
1622002691697,high-voltage-3,12,0.0217914
time,Hardware,Voltage,Current
1622002691697,high-voltage-3,13,0.0249308
time,Hardware,Voltage,Current
1622002691697,high-voltage-3,14,0.0265977
time,Hardware,Voltage,Current
1622002691697,high-voltage-3,15,0.0275372
time,Hardware,Voltage,Current
1622002691697,high-voltage-3,16,0.0293961
time,Hardware,Voltage,Current
1622002691697,high-voltage-3,17,0.0312757
time,Hardware,Voltage,Current
1622002691697,high-voltage-3,18,0.0322143
time,Hardware,Voltage,Current
1622002691697,high-voltage-3,19,0.0319632
time,Hardware,Voltage,Current
1622002691697,high-voltage-3,20,0.0342148
time,Hardware,Voltage,Current
1622002691697,high-voltage-3,25,0.041667
time,Hardware,Voltage,Current
1622002691697,high-voltage-3,30,0.0482518
time,Hardware,Voltage,Current
1622002691697,high-voltage-3,35,0.0565729
time,Hardware,Voltage,Current
1622002691697,high-voltage-3,40,0.0622086
time,Hardware,Voltage,Current
1622002691697,high-voltage-3,45,0.0705698
time,Hardware,Voltage,Current
1622002691697,high-voltage-3,50,0.0738542
time,Hardware,Voltage,Current
1622002691697,high-voltage-3,55,0.0805513
time,Hardware,Voltage,Current
1622002691697,high-voltage-3,60,0.0835908
time,Hardware,Voltage,Current
1622002691697,high-voltage-3,65,0.0913398
time,Hardware,Voltage,Current
1622002691697,high-voltage-3,70,0.0970065
time,Hardware,Voltage,Current
1622002691697,high-voltage-3,75,0.105163
time,Hardware,Voltage,Current
1622002691697,high-voltage-3,1.12753e-07,0.112228
time,Hardware,Voltage,Current
1622002691697,high-voltage-3,85,0.118807
time,Hardware,Voltage,Current
1622002691697,high-voltage-3,90,0.126513
time,Hardware,Voltage,Current
1622002691697,high-voltage-3,95,0.137693
time,Hardware,Voltage,Current
1622002691697,high-voltage-3,100,0.145636
