time,Hardware,Voltage,Current
1622100062225,high-voltage-2,1,0.299063
time,Hardware,Voltage,Current
1622100062225,high-voltage-2,2,0.360985
time,Hardware,Voltage,Current
1622100062225,high-voltage-2,3,0.398171
time,Hardware,Voltage,Current
1622100062225,high-voltage-2,4,0.432236
time,Hardware,Voltage,Current
1622100062225,high-voltage-2,5,0.467429
time,Hardware,Voltage,Current
1622100062225,high-voltage-2,6,0.49931
time,Hardware,Voltage,Current
1622100062225,high-voltage-2,7,0.530291
time,Hardware,Voltage,Current
1622100062225,high-voltage-2,8,0.563773
time,Hardware,Voltage,Current
1622100062225,high-voltage-2,9,0.596595
time,Hardware,Voltage,Current
1622100062225,high-voltage-2,10,0.628582
time,Hardware,Voltage,Current
1622100062225,high-voltage-2,11,0.658696
time,Hardware,Voltage,Current
1622100062225,high-voltage-2,12,0.690537
time,Hardware,Voltage,Current
1622100062225,high-voltage-2,13,0.723086
time,Hardware,Voltage,Current
1622100062225,high-voltage-2,14,0.746663
time,Hardware,Voltage,Current
1622100062225,high-voltage-2,15,0.776059
time,Hardware,Voltage,Current
1622100062225,high-voltage-2,16,0.797123
time,Hardware,Voltage,Current
1622100062225,high-voltage-2,17,0.818021
time,Hardware,Voltage,Current
1622100062225,high-voltage-2,18,0.840128
time,Hardware,Voltage,Current
1622100062225,high-voltage-2,19,0.857812
time,Hardware,Voltage,Current
1622100062225,high-voltage-2,20,0.876673
time,Hardware,Voltage,Current
1622100062225,high-voltage-2,25,0.960473
time,Hardware,Voltage,Current
1622100062225,high-voltage-2,30,1.03999
time,Hardware,Voltage,Current
1622100062225,high-voltage-2,35,1.12143
time,Hardware,Voltage,Current
1622100062225,high-voltage-2,40,1.21631
time,Hardware,Voltage,Current
1622100062225,high-voltage-2,45,1.3349
time,Hardware,Voltage,Current
1622100062225,high-voltage-2,50,1.41804
time,Hardware,Voltage,Current
1622100062225,high-voltage-2,55,1.4924
time,Hardware,Voltage,Current
1622100062225,high-voltage-2,60,1.56153
time,Hardware,Voltage,Current
1622100062225,high-voltage-2,65,1.63043
time,Hardware,Voltage,Current
1622100062225,high-voltage-2,70,1.69822
time,Hardware,Voltage,Current
1622100062225,high-voltage-2,75,1.76366
time,Hardware,Voltage,Current
1622100062225,high-voltage-2,80,1.82446
time,Hardware,Voltage,Current
1622100062225,high-voltage-2,85,1.88491
time,Hardware,Voltage,Current
1622100062225,high-voltage-2,90,1.94477
time,Hardware,Voltage,Current
1622100062225,high-voltage-2,95,2.00202
time,Hardware,Voltage,Current
1622100062225,high-voltage-2,100,2.06063
