time,Hardware,Voltage,Current
1625780726361,high-voltage-4,1,0.423887
time,Hardware,Voltage,Current
1625780726361,high-voltage-4,2,0.582026
time,Hardware,Voltage,Current
1625780726361,high-voltage-4,3,0.677765
time,Hardware,Voltage,Current
1625780726361,high-voltage-4,4,0.743547
time,Hardware,Voltage,Current
1625780726361,high-voltage-4,5,0.791383
