{
    "Data": [0.0, 0.0, 0.0, 0.0, 0.0, 0.0, 0.0, 0.0, 0.0, 0.0, 0.0, 0.0, 0.0, 0.0, 0.0, 0.0, 0.0, 0.0, 0.0, 0.0, 0.0, 0.0, 0.0, 0.0, 0.0, 0.0, 0.0, 0.0, 0.0, 0.0, 0.0, 0.0, 0.0, 0.0, 0.0, 0.0, 0.0, 0.0, 0.0, 0.0, 0.0, 0.0, 0.0, 0.0, 0.0, 0.0, 0.0, 0.0, 0.0, 0.0, 2.0, 3.0, 3.0, 3.0, 7.0, 2.0, 5.0, 5.0, 2.0, 10.0, 5.0, 14.0, 13.0, 19.0, 20.0, 21.0, 27.0, 35.0, 46.0, 46.0, 47.0, 69.0, 72.0, 95.0, 109.0, 134.0, 142.0, 212.0, 204.0, 256.0, 326.0, 368.0, 407.0, 461.0, 560.0, 656.0, 655.0, 777.0, 927.0, 1019.0, 1064.0, 1119.0, 1157.0, 1255.0, 1258.0, 1239.0, 1230.0, 1127.0, 1188.0, 1065.0, 1018.0, 864.0, 853.0, 886.0, 854.0, 905.0, 1082.0, 1184.0, 1357.0, 1473.0, 1623.0, 1635.0, 1791.0, 1802.0, 1824.0, 1722.0, 1614.0, 1465.0, 1423.0, 1253.0, 1111.0, 904.0, 757.0, 660.0, 561.0, 377.0, 287.0, 259.0, 182.0, 122.0, 138.0, 90.0, 85.0, 66.0, 37.0, 41.0, 31.0, 26.0, 25.0, 22.0, 20.0, 14.0, 9.0, 15.0, 11.0, 18.0, 8.0, 9.0, 6.0, 18.0, 9.0, 7.0, 9.0, 10.0, 11.0, 3.0, 10.0, 8.0, 10.0, 10.0, 15.0, 15.0, 14.0, 26.0, 18.0, 24.0, 26.0, 30.0, 27.0, 40.0, 39.0, 53.0, 65.0, 61.0, 79.0, 86.0, 95.0, 115.0, 118.0, 102.0, 121.0, 146.0, 176.0, 190.0, 178.0, 224.0, 212.0, 240.0, 321.0, 277.0, 301.0, 274.0, 329.0, 415.0, 396.0, 380.0, 386.0, 414.0, 387.0, 462.0, 402.0, 432.0, 370.0, 357.0, 465.0, 427.0, 397.0, 349.0, 357.0, 398.0, 556.0, 366.0, 297.0, 282.0, 292.0, 276.0, 286.0, 250.0, 219.0, 240.0, 205.0, 281.0, 171.0, 179.0, 176.0, 137.0, 233.0, 164.0, 155.0, 155.0, 129.0, 139.0, 118.0, 123.0, 108.0, 92.0, 102.0, 77.0, 90.0, 82.0, 83.0, 71.0, 54.0, 68.0, 56.0, 51.0, 45.0, 46.0, 34.0, 30.0, 29.0, 48.0, 36.0, 30.0, 44.0, 23.0, 34.0, 36.0, 31.0, 19.0, 27.0, 29.0, 20.0, 20.0, 34.0, 27.0, 21.0, 26.0, 19.0, 21.0, 21.0, 23.0, 21.0, 34.0, 17.0, 24.0, 19.0, 21.0, 19.0, 26.0, 29.0, 23.0, 27.0, 28.0, 18.0, 21.0, 15.0, 17.0, 18.0, 15.0, 8.0, 17.0, 14.0, 13.0, 14.0, 7.0, 7.0, 16.0, 8.0, 17.0, 15.0, 6.0, 13.0, 17.0, 14.0, 9.0, 12.0, 12.0, 11.0, 15.0, 6.0, 15.0, 6.0, 14.0, 8.0, 7.0, 7.0, 15.0, 16.0, 7.0, 14.0, 17.0, 8.0, 11.0, 9.0, 5.0, 0.0, 0.0, 0.0, 0.0, 0.0, 0.0, 0.0, 0.0, 0.0, 0.0, 0.0, 0.0, 0.0, 0.0, 0.0, 0.0, 0.0, 0.0, 0.0, 0.0, 0.0, 0.0, 0.0, 0.0, 0.0, 0.0, 0.0, 0.0, 0.0, 0.0, 0.0, 0.0, 0.0, 0.0, 0.0, 0.0, 0.0, 0.0, 0.0, 0.0, 0.0, 0.0, 0.0, 0.0, 0.0, 0.0, 0.0, 0.0, 0.0, 0.0, 0.0, 0.0, 0.0, 0.0, 0.0, 0.0, 0.0],
    "Name": "ThresholdDist-0",
    "Overflow": 0.0,
    "Type": "Histo1d",
    "Underflow": 0.0,
    "x": {
        "AxisTitle": "Threshold [e]",
        "Bins": 383,
        "High": 3825.0,
        "Low": -5.0
    },
    "y": {
        "AxisTitle": "Number of Pixels"
    },
    "z": {
        "AxisTitle": "z"
    }
}