{
    "Data": [1893.0, 22526.0, 18865.0, 6973.0, 2080.0, 872.0, 876.0, 977.0, 1114.0, 1060.0, 944.0, 758.0, 688.0, 538.0, 490.0, 434.0, 447.0, 360.0, 409.0, 436.0, 441.0, 434.0, 505.0, 476.0, 498.0, 508.0, 510.0, 454.0, 505.0, 503.0, 492.0, 514.0, 484.0, 466.0, 468.0, 430.0, 425.0, 393.0, 446.0, 480.0, 385.0, 330.0, 360.0, 355.0, 382.0, 315.0, 304.0, 282.0, 230.0, 200.0, 92.0],
    "Name": "Chi2Dist-0",
    "Overflow": 0.0,
    "Type": "Histo1d",
    "Underflow": 0.0,
    "x": {
        "AxisTitle": "Fit Chi/ndf",
        "Bins": 51,
        "High": 2.5250000953674318,
        "Low": -0.02500000037252903
    },
    "y": {
        "AxisTitle": "Number of Pixels"
    },
    "z": {
        "AxisTitle": "z"
    }
}