{
    "Data": [0.0, 0.0, 0.0, 0.0, 0.0, 0.0, 0.0, 0.0, 0.0, 0.0, 0.0, 0.0, 0.0, 0.0, 3.0, 0.0, 1.0, 33.0, 408.0, 114.0, 40.0, 934.0, 4561.0, 1810.0, 355.0, 1444.0, 4101.0, 2441.0, 486.0, 957.0, 2177.0, 1548.0, 445.0, 263.0, 371.0, 463.0, 269.0, 387.0, 611.0, 511.0, 388.0, 789.0, 1628.0, 1979.0, 1392.0, 1555.0, 2245.0, 3169.0, 2856.0, 2496.0, 2425.0, 2669.0, 2499.0, 2028.0, 2014.0, 2074.0, 2078.0, 1864.0, 1675.0, 1541.0, 1492.0, 1258.0, 897.0, 744.0, 786.0, 701.0, 664.0, 530.0, 489.0, 494.0, 478.0, 354.0, 331.0, 266.0, 236.0, 245.0, 214.0, 157.0, 135.0, 150.0, 119.0, 117.0, 113.0, 80.0, 63.0, 79.0, 60.0, 54.0, 36.0, 39.0, 35.0, 30.0, 34.0, 37.0, 27.0, 21.0, 17.0, 13.0, 20.0, 20.0, 16.0, 17.0, 7.0, 11.0, 10.0, 11.0, 10.0, 11.0, 11.0, 2.0, 4.0, 4.0, 5.0, 2.0, 10.0, 3.0, 5.0, 4.0, 3.0, 4.0, 4.0, 4.0, 4.0, 2.0, 2.0, 3.0, 3.0, 0.0, 0.0, 4.0, 2.0, 0.0, 5.0, 0.0, 3.0, 1.0, 0.0, 0.0, 0.0, 1.0, 1.0, 1.0, 2.0, 2.0, 0.0, 0.0, 0.0, 0.0, 1.0, 0.0, 0.0, 0.0, 0.0, 0.0, 0.0, 0.0, 0.0, 1.0, 0.0, 1.0, 0.0, 1.0, 0.0, 0.0, 0.0, 0.0, 0.0, 0.0, 0.0, 1.0, 1.0, 0.0, 0.0, 0.0, 2.0, 0.0, 0.0, 0.0, 1.0, 0.0, 0.0, 0.0, 0.0, 0.0, 0.0, 0.0, 0.0, 0.0, 0.0, 0.0, 0.0, 1.0, 0.0, 0.0, 0.0, 0.0, 0.0, 0.0, 0.0, 0.0, 0.0],
    "Name": "TimePerFitDist-0",
    "Overflow": 57.0,
    "Type": "Histo1d",
    "Underflow": 0.0,
    "x": {
        "AxisTitle": "Fit Time [us]",
        "Bins": 201,
        "High": 401.0,
        "Low": -1.0
    },
    "y": {
        "AxisTitle": "Number of Pixels"
    },
    "z": {
        "AxisTitle": "z"
    }
}