time,Hardware,Voltage,Current
1623176127788,high-voltage-3,1,0.0778748
time,Hardware,Voltage,Current
1623176127788,high-voltage-3,2,0.0806448
time,Hardware,Voltage,Current
1623176127788,high-voltage-3,3,0.0827313
time,Hardware,Voltage,Current
1623176127788,high-voltage-3,4,0.0850683
time,Hardware,Voltage,Current
1623176127788,high-voltage-3,5,0.0868171
time,Hardware,Voltage,Current
1623176127788,high-voltage-3,6,0.089117
time,Hardware,Voltage,Current
1623176127788,high-voltage-3,7,0.0919347
time,Hardware,Voltage,Current
1623176127788,high-voltage-3,8,0.0931604
time,Hardware,Voltage,Current
1623176127788,high-voltage-3,9,0.0947433
time,Hardware,Voltage,Current
1623176127788,high-voltage-3,10,0.0964788
time,Hardware,Voltage,Current
1623176127788,high-voltage-3,11,0.0992719
time,Hardware,Voltage,Current
1623176127788,high-voltage-3,12,0.101377
time,Hardware,Voltage,Current
1623176127788,high-voltage-3,13,0.102747
time,Hardware,Voltage,Current
1623176127788,high-voltage-3,14,0.105263
time,Hardware,Voltage,Current
1623176127788,high-voltage-3,15,0.106321
time,Hardware,Voltage,Current
1623176127788,high-voltage-3,16,0.1086
time,Hardware,Voltage,Current
1623176127788,high-voltage-3,17,0.10934
time,Hardware,Voltage,Current
1623176127788,high-voltage-3,18,0.110503
time,Hardware,Voltage,Current
1623176127788,high-voltage-3,19,0.11238
time,Hardware,Voltage,Current
1623176127788,high-voltage-3,20,0.113392
time,Hardware,Voltage,Current
1623176127788,high-voltage-3,25,0.118779
time,Hardware,Voltage,Current
1623176127788,high-voltage-3,30,0.124572
time,Hardware,Voltage,Current
1623176127788,high-voltage-3,35,0.129353
time,Hardware,Voltage,Current
1623176127788,high-voltage-3,40,0.133603
time,Hardware,Voltage,Current
1623176127788,high-voltage-3,45,0.138119
time,Hardware,Voltage,Current
1623176127788,high-voltage-3,50,0.142498
time,Hardware,Voltage,Current
1623176127788,high-voltage-3,55,0.145889
time,Hardware,Voltage,Current
1623176127788,high-voltage-3,60,0.149985
time,Hardware,Voltage,Current
1623176127788,high-voltage-3,65,0.153756
time,Hardware,Voltage,Current
1623176127788,high-voltage-3,70,0.157327
time,Hardware,Voltage,Current
1623176127788,high-voltage-3,75,0.160326
time,Hardware,Voltage,Current
1623176127788,high-voltage-3,80,0.163949
time,Hardware,Voltage,Current
1623176127788,high-voltage-3,85,0.16638
time,Hardware,Voltage,Current
1623176127788,high-voltage-3,90,0.169251
time,Hardware,Voltage,Current
1623176127788,high-voltage-3,95,0.172112
time,Hardware,Voltage,Current
1623176127788,high-voltage-3,100,0.174553
