time,Hardware,Voltage,Current
1626347800495,high-voltage,1,0.00957905
time,Hardware,Voltage,Current
1626347800495,high-voltage,2,0.0251876
time,Hardware,Voltage,Current
1626347800495,high-voltage,3,0.0328649
time,Hardware,Voltage,Current
1626347800495,high-voltage,4,0.0395046
time,Hardware,Voltage,Current
1626347800495,high-voltage,5,0.0449875
time,Hardware,Voltage,Current
1626347800495,high-voltage,6,0.051827
time,Hardware,Voltage,Current
1626347800495,high-voltage,7,0.0570129
time,Hardware,Voltage,Current
1626347800495,high-voltage,8,0.0648489
time,Hardware,Voltage,Current
1626347800495,high-voltage,9,0.0706332
time,Hardware,Voltage,Current
1626347800495,high-voltage,10,0.0779765
time,Hardware,Voltage,Current
1626347800495,high-voltage,11,0.0833101
time,Hardware,Voltage,Current
1626347800495,high-voltage,12,0.0892732
time,Hardware,Voltage,Current
1626347800495,high-voltage,13,0.0934298
time,Hardware,Voltage,Current
1626347800495,high-voltage,14,0.0977041
time,Hardware,Voltage,Current
1626347800495,high-voltage,15,0.100725
time,Hardware,Voltage,Current
1626347800495,high-voltage,16,0.104838
time,Hardware,Voltage,Current
1626347800495,high-voltage,17,0.108208
time,Hardware,Voltage,Current
1626347800495,high-voltage,18,0.111883
time,Hardware,Voltage,Current
1626347800495,high-voltage,19,0.113921
time,Hardware,Voltage,Current
1626347800495,high-voltage,20,0.118314
time,Hardware,Voltage,Current
1626347800495,high-voltage,25,0.132063
time,Hardware,Voltage,Current
1626347800495,high-voltage,30,0.150054
time,Hardware,Voltage,Current
1626347800495,high-voltage,35,0.184338
time,Hardware,Voltage,Current
1626347800495,high-voltage,40,0.287214
time,Hardware,Voltage,Current
1626347800495,high-voltage,45,0.53071
time,Hardware,Voltage,Current
1626347800495,high-voltage,50,0.995275
time,Hardware,Voltage,Current
1626347800495,high-voltage,55,1.78893
time,Hardware,Voltage,Current
1626347800495,high-voltage,60,3.0212
time,Hardware,Voltage,Current
1626347800495,high-voltage,65,4.74387
time,Hardware,Voltage,Current
1626347800495,high-voltage,70,7.02899
time,Hardware,Voltage,Current
1626347800495,high-voltage,75,10
