{
    "Data": [0.0, 0.0, 0.0, 0.0, 0.0, 0.0, 0.0, 0.0, 0.0, 0.0, 0.0, 0.0, 0.0, 0.0, 1.0, 0.0, 0.0, 20.0, 260.0, 72.0, 30.0, 912.0, 3379.0, 1083.0, 351.0, 1893.0, 3831.0, 1704.0, 517.0, 1582.0, 2368.0, 1323.0, 416.0, 588.0, 854.0, 673.0, 420.0, 1274.0, 2326.0, 1636.0, 823.0, 1618.0, 3143.0, 3719.0, 2027.0, 1664.0, 2666.0, 3515.0, 3244.0, 2033.0, 1931.0, 2253.0, 2732.0, 1758.0, 1300.0, 1236.0, 1235.0, 1248.0, 940.0, 814.0, 820.0, 828.0, 740.0, 535.0, 545.0, 465.0, 487.0, 376.0, 331.0, 313.0, 310.0, 321.0, 233.0, 237.0, 165.0, 222.0, 172.0, 146.0, 153.0, 140.0, 125.0, 110.0, 96.0, 68.0, 84.0, 93.0, 57.0, 58.0, 66.0, 41.0, 66.0, 50.0, 46.0, 44.0, 32.0, 46.0, 34.0, 25.0, 32.0, 34.0, 21.0, 24.0, 29.0, 17.0, 19.0, 20.0, 7.0, 18.0, 16.0, 18.0, 12.0, 20.0, 20.0, 16.0, 10.0, 9.0, 8.0, 11.0, 18.0, 7.0, 6.0, 14.0, 7.0, 3.0, 7.0, 0.0, 5.0, 2.0, 7.0, 3.0, 6.0, 4.0, 1.0, 3.0, 3.0, 1.0, 5.0, 4.0, 3.0, 1.0, 1.0, 1.0, 4.0, 0.0, 2.0, 0.0, 2.0, 2.0, 1.0, 1.0, 0.0, 1.0, 3.0, 2.0, 2.0, 1.0, 0.0, 1.0, 0.0, 0.0, 1.0, 4.0, 3.0, 1.0, 1.0, 3.0, 2.0, 1.0, 0.0, 1.0, 0.0, 0.0, 0.0, 0.0, 0.0, 0.0, 0.0, 1.0, 0.0, 0.0, 0.0, 0.0, 0.0, 0.0, 3.0, 0.0, 0.0, 0.0, 0.0, 0.0, 0.0, 0.0, 0.0, 0.0, 2.0, 0.0, 0.0, 0.0, 1.0, 0.0, 0.0],
    "Name": "TimePerFitDist-0",
    "Overflow": 72.0,
    "Type": "Histo1d",
    "Underflow": 0.0,
    "x": {
        "AxisTitle": "Fit Time [us]",
        "Bins": 201,
        "High": 401.0,
        "Low": -1.0
    },
    "y": {
        "AxisTitle": "Number of Pixels"
    },
    "z": {
        "AxisTitle": "z"
    }
}