{
    "Data": [3.0, 2.0, 0.0, 0.0, 0.0, 1.0, 8.0, 13.0, 43.0, 149.0, 394.0, 1083.0, 2067.0, 3390.0, 4311.0, 4643.0, 3921.0, 2722.0, 1857.0, 1418.0, 1478.0, 2034.0, 2850.0, 3396.0, 3744.0, 3477.0, 2858.0, 2149.0, 1382.0, 855.0, 559.0, 369.0, 293.0, 264.0, 280.0, 360.0, 441.0, 594.0, 706.0, 824.0, 972.0, 1021.0, 1075.0, 1280.0, 1263.0, 1217.0, 1114.0, 1090.0, 978.0, 811.0, 742.0, 632.0, 542.0, 462.0, 370.0, 310.0, 283.0, 223.0, 187.0, 195.0, 164.0, 142.0, 173.0, 210.0, 171.0, 198.0, 198.0, 173.0, 172.0, 218.0, 214.0, 217.0, 227.0, 209.0, 215.0, 219.0, 214.0, 225.0, 199.0, 195.0, 174.0, 171.0, 183.0, 184.0, 141.0, 138.0, 136.0, 94.0, 99.0, 103.0, 87.0, 93.0, 71.0, 88.0, 70.0, 63.0, 70.0, 41.0, 46.0, 44.0, 41.0, 30.0, 35.0, 31.0, 31.0, 26.0, 20.0, 24.0, 16.0, 26.0, 18.0, 20.0, 23.0, 25.0, 15.0, 20.0, 15.0, 9.0, 12.0, 8.0, 14.0, 9.0, 11.0, 15.0, 3.0, 10.0, 10.0, 5.0, 4.0, 8.0, 3.0, 6.0],
    "Name": "NoiseDist-0",
    "Overflow": 170.0,
    "Type": "Histo1d",
    "Underflow": 0.0,
    "x": {
        "AxisTitle": "Noise [e]",
        "Bins": 132,
        "High": 661.0,
        "Low": -2.0
    },
    "y": {
        "AxisTitle": "Number of Pixels"
    },
    "z": {
        "AxisTitle": "z"
    }
}