{
    "Data": [562.0, 12022.0, 18365.0, 12697.0, 6054.0, 2778.0, 2170.0, 2636.0, 3298.0, 3579.0, 3485.0, 2928.0, 2266.0, 1501.0, 972.0, 565.0, 331.0, 190.0, 112.0, 55.0, 25.0, 16.0, 6.0, 12.0, 7.0, 1.0, 3.0, 1.0, 0.0, 1.0, 0.0, 0.0, 1.0, 0.0, 1.0, 0.0, 0.0, 0.0, 0.0, 1.0, 0.0, 2.0, 1.0, 1.0, 0.0, 0.0, 2.0, 0.0, 1.0, 0.0, 0.0],
    "Name": "Chi2Dist-0",
    "Overflow": 0.0,
    "Type": "Histo1d",
    "Underflow": 0.0,
    "x": {
        "AxisTitle": "Fit Chi/ndf",
        "Bins": 51,
        "High": 2.5250000953674318,
        "Low": -0.02500000037252903
    },
    "y": {
        "AxisTitle": "Number of Pixels"
    },
    "z": {
        "AxisTitle": "z"
    }
}