{
    "Data": [0.0, 0.0, 0.0, 0.0, 0.0, 0.0, 0.0, 0.0, 0.0, 0.0, 0.0, 0.0, 1.0, 0.0, 0.0, 0.0, 0.0, 0.0, 0.0, 3.0, 2.0, 1.0, 6.0, 0.0, 0.0, 6.0, 4.0, 24.0, 25.0, 16.0, 29.0, 1.0, 38.0, 50.0, 10.0, 50.0, 50.0, 7.0, 9.0, 50.0, 0.0, 18.0, 14.0, 8.0, 50.0, 47.0, 14.0, 50.0, 36.0, 22.0, 31.0],
    "Name": "Scurve-10-96",
    "Overflow": 0.0,
    "Type": "Histo1d",
    "Underflow": 0.0,
    "x": {
        "AxisTitle": "Vcal",
        "Bins": 51,
        "High": 302.5,
        "Low": 47.5
    },
    "y": {
        "AxisTitle": "Occupancy"
    },
    "z": {
        "AxisTitle": "z"
    }
}