{
    "Data": [[1336.0, 402.0, 190.0, 95.0, 74.0, 44.0, 37.0, 25.0, 17.0, 15.0, 12.0, 12.0, 6.0, 11.0, 7.0, 2.0, 5.0, 3.0, 5.0, 2.0, 1.0, 4.0, 1.0, 5.0, 4.0, 0.0, 3.0, 2.0, 1.0, 0.0, 4.0, 1.0, 1.0, 3.0, 2.0, 0.0, 1.0, 2.0, 2.0, 0.0, 2.0, 2.0, 0.0, 1.0, 1.0, 0.0, 1.0, 1.0, 1.0], [2121.0, 830.0, 448.0, 240.0, 170.0, 116.0, 71.0, 55.0, 60.0, 39.0, 35.0, 28.0, 29.0, 13.0, 12.0, 9.0, 11.0, 11.0, 10.0, 6.0, 10.0, 2.0, 9.0, 5.0, 7.0, 6.0, 2.0, 0.0, 3.0, 4.0, 2.0, 5.0, 2.0, 5.0, 0.0, 3.0, 1.0, 1.0, 6.0, 1.0, 2.0, 3.0, 0.0, 2.0, 1.0, 1.0, 2.0, 2.0, 3.0], [3293.0, 1429.0, 850.0, 490.0, 386.0, 251.0, 196.0, 150.0, 131.0, 111.0, 81.0, 68.0, 62.0, 47.0, 39.0, 42.0, 38.0, 18.0, 30.0, 18.0, 21.0, 15.0, 15.0, 9.0, 12.0, 15.0, 14.0, 6.0, 6.0, 10.0, 8.0, 4.0, 7.0, 3.0, 2.0, 5.0, 5.0, 4.0, 4.0, 3.0, 3.0, 2.0, 4.0, 3.0, 1.0, 7.0, 6.0, 3.0, 3.0], [4006.0, 2086.0, 1276.0, 901.0, 653.0, 524.0, 409.0, 349.0, 278.0, 216.0, 192.0, 181.0, 144.0, 127.0, 99.0, 94.0, 75.0, 74.0, 66.0, 65.0, 47.0, 47.0, 39.0, 37.0, 34.0, 29.0, 16.0, 17.0, 30.0, 22.0, 16.0, 22.0, 12.0, 15.0, 10.0, 8.0, 6.0, 11.0, 12.0, 12.0, 1.0, 8.0, 1.0, 8.0, 7.0, 6.0, 3.0, 8.0, 10.0], [4052.0, 2522.0, 1808.0, 1288.0, 1049.0, 824.0, 680.0, 569.0, 461.0, 447.0, 349.0, 334.0, 291.0, 226.0, 233.0, 195.0, 196.0, 151.0, 163.0, 122.0, 123.0, 118.0, 92.0, 92.0, 87.0, 77.0, 65.0, 69.0, 65.0, 60.0, 43.0, 35.0, 32.0, 37.0, 31.0, 33.0, 21.0, 25.0, 19.0, 18.0, 24.0, 22.0, 16.0, 9.0, 13.0, 10.0, 11.0, 9.0, 18.0], [3119.0, 2293.0, 1859.0, 1629.0, 1263.0, 1060.0, 932.0, 825.0, 718.0, 684.0, 664.0, 567.0, 451.0, 427.0, 366.0, 395.0, 335.0, 296.0, 270.0, 256.0, 246.0, 228.0, 196.0, 205.0, 209.0, 173.0, 165.0, 138.0, 129.0, 139.0, 115.0, 118.0, 109.0, 80.0, 88.0, 80.0, 52.0, 62.0, 61.0, 57.0, 48.0, 50.0, 50.0, 39.0, 37.0, 25.0, 25.0, 35.0, 36.0], [2381.0, 1650.0, 1403.0, 1302.0, 1101.0, 1096.0, 993.0, 904.0, 828.0, 831.0, 790.0, 742.0, 677.0, 661.0, 648.0, 554.0, 514.0, 526.0, 492.0, 427.0, 405.0, 399.0, 346.0, 382.0, 317.0, 351.0, 266.0, 307.0, 294.0, 270.0, 258.0, 223.0, 214.0, 200.0, 193.0, 200.0, 199.0, 171.0, 149.0, 130.0, 148.0, 109.0, 116.0, 93.0, 105.0, 93.0, 86.0, 82.0, 62.0], [2955.0, 1338.0, 1081.0, 879.0, 823.0, 803.0, 768.0, 736.0, 746.0, 719.0, 715.0, 746.0, 686.0, 664.0, 645.0, 676.0, 658.0, 635.0, 633.0, 596.0, 570.0, 534.0, 512.0, 543.0, 499.0, 497.0, 515.0, 443.0, 393.0, 423.0, 419.0, 439.0, 430.0, 386.0, 363.0, 362.0, 333.0, 328.0, 282.0, 341.0, 307.0, 297.0, 282.0, 267.0, 236.0, 223.0, 228.0, 214.0, 200.0], [4249.0, 2223.0, 1398.0, 988.0, 758.0, 668.0, 582.0, 515.0, 560.0, 542.0, 492.0, 485.0, 525.0, 528.0, 534.0, 567.0, 587.0, 564.0, 581.0, 582.0, 559.0, 593.0, 533.0, 612.0, 565.0, 626.0, 581.0, 631.0, 597.0, 556.0, 574.0, 575.0, 575.0, 605.0, 561.0, 577.0, 544.0, 549.0, 515.0, 528.0, 533.0, 521.0, 527.0, 510.0, 528.0, 522.0, 521.0, 505.0, 488.0], [4572.0, 2801.0, 1946.0, 1566.0, 1235.0, 1032.0, 859.0, 797.0, 675.0, 651.0, 555.0, 562.0, 493.0, 472.0, 447.0, 456.0, 431.0, 413.0, 423.0, 434.0, 467.0, 428.0, 423.0, 461.0, 472.0, 524.0, 499.0, 540.0, 578.0, 619.0, 618.0, 576.0, 637.0, 640.0, 655.0, 765.0, 710.0, 724.0, 781.0, 752.0, 825.0, 830.0, 823.0, 821.0, 941.0, 891.0, 940.0, 1018.0, 1089.0], [2958.0, 2119.0, 1766.0, 1598.0, 1434.0, 1290.0, 1231.0, 1073.0, 1022.0, 885.0, 865.0, 793.0, 764.0, 686.0, 654.0, 653.0, 610.0, 567.0, 565.0, 539.0, 470.0, 455.0, 494.0, 496.0, 453.0, 457.0, 460.0, 496.0, 481.0, 474.0, 495.0, 547.0, 517.0, 562.0, 636.0, 612.0, 671.0, 691.0, 758.0, 839.0, 886.0, 940.0, 1077.0, 1111.0, 1336.0, 1401.0, 1533.0, 1725.0, 2108.0], [1541.0, 1135.0, 949.0, 940.0, 936.0, 882.0, 836.0, 854.0, 839.0, 796.0, 852.0, 821.0, 798.0, 768.0, 791.0, 770.0, 729.0, 773.0, 733.0, 667.0, 738.0, 668.0, 659.0, 663.0, 701.0, 676.0, 627.0, 637.0, 639.0, 637.0, 670.0, 625.0, 634.0, 611.0, 622.0, 710.0, 614.0, 675.0, 740.0, 765.0, 848.0, 869.0, 1056.0, 1228.0, 1317.0, 1541.0, 1846.0, 2478.0, 3294.0], [1303.0, 527.0, 427.0, 339.0, 343.0, 396.0, 393.0, 394.0, 442.0, 429.0, 465.0, 499.0, 497.0, 496.0, 491.0, 542.0, 543.0, 534.0, 557.0, 560.0, 550.0, 570.0, 639.0, 678.0, 608.0, 711.0, 692.0, 710.0, 721.0, 739.0, 786.0, 741.0, 790.0, 804.0, 820.0, 876.0, 860.0, 973.0, 977.0, 1019.0, 1030.0, 1137.0, 1122.0, 1293.0, 1433.0, 1665.0, 2039.0, 2766.0, 4456.0], [1747.0, 510.0, 229.0, 168.0, 124.0, 108.0, 124.0, 131.0, 145.0, 150.0, 147.0, 168.0, 180.0, 194.0, 228.0, 211.0, 203.0, 293.0, 245.0, 306.0, 292.0, 331.0, 312.0, 396.0, 369.0, 385.0, 424.0, 433.0, 502.0, 515.0, 520.0, 559.0, 635.0, 659.0, 677.0, 756.0, 795.0, 882.0, 888.0, 1029.0, 1177.0, 1272.0, 1354.0, 1583.0, 1806.0, 2067.0, 2621.0, 3466.0, 5251.0], [2572.0, 787.0, 331.0, 151.0, 95.0, 62.0, 50.0, 43.0, 52.0, 44.0, 60.0, 44.0, 65.0, 65.0, 50.0, 63.0, 76.0, 71.0, 79.0, 94.0, 85.0, 103.0, 109.0, 136.0, 150.0, 146.0, 147.0, 187.0, 180.0, 231.0, 237.0, 269.0, 305.0, 329.0, 344.0, 408.0, 480.0, 501.0, 562.0, 641.0, 722.0, 790.0, 989.0, 1173.0, 1470.0, 1877.0, 2578.0, 3679.0, 6699.0], [3536.0, 1338.0, 622.0, 271.0, 119.0, 66.0, 48.0, 30.0, 24.0, 19.0, 17.0, 24.0, 16.0, 20.0, 22.0, 15.0, 21.0, 19.0, 31.0, 19.0, 32.0, 30.0, 36.0, 46.0, 44.0, 55.0, 59.0, 63.0, 68.0, 71.0, 77.0, 97.0, 85.0, 126.0, 125.0, 134.0, 179.0, 198.0, 238.0, 323.0, 346.0, 383.0, 522.0, 621.0, 808.0, 1107.0, 1610.0, 2705.0, 5909.0], [4179.0, 1901.0, 1046.0, 499.0, 275.0, 157.0, 93.0, 55.0, 34.0, 26.0, 23.0, 12.0, 11.0, 20.0, 8.0, 11.0, 6.0, 11.0, 7.0, 18.0, 12.0, 11.0, 12.0, 4.0, 12.0, 14.0, 14.0, 15.0, 18.0, 17.0, 17.0, 38.0, 34.0, 33.0, 52.0, 55.0, 50.0, 70.0, 79.0, 92.0, 127.0, 148.0, 199.0, 261.0, 341.0, 479.0, 769.0, 1439.0, 3716.0], [4651.0, 2461.0, 1534.0, 952.0, 524.0, 330.0, 215.0, 131.0, 75.0, 78.0, 39.0, 33.0, 10.0, 14.0, 12.0, 13.0, 8.0, 4.0, 8.0, 7.0, 8.0, 5.0, 4.0, 5.0, 11.0, 7.0, 8.0, 7.0, 5.0, 9.0, 10.0, 12.0, 10.0, 13.0, 12.0, 16.0, 14.0, 23.0, 21.0, 30.0, 37.0, 45.0, 55.0, 87.0, 106.0, 192.0, 316.0, 641.0, 1833.0], [4529.0, 2915.0, 2013.0, 1295.0, 868.0, 613.0, 432.0, 280.0, 219.0, 136.0, 92.0, 64.0, 40.0, 41.0, 17.0, 11.0, 21.0, 14.0, 6.0, 7.0, 2.0, 7.0, 5.0, 5.0, 5.0, 6.0, 1.0, 3.0, 3.0, 13.0, 4.0, 6.0, 3.0, 6.0, 8.0, 7.0, 17.0, 6.0, 8.0, 16.0, 14.0, 15.0, 19.0, 31.0, 48.0, 62.0, 102.0, 233.0, 870.0], [4325.0, 2977.0, 2215.0, 1567.0, 1109.0, 884.0, 613.0, 459.0, 327.0, 237.0, 187.0, 154.0, 122.0, 87.0, 70.0, 52.0, 39.0, 41.0, 32.0, 22.0, 15.0, 12.0, 8.0, 3.0, 2.0, 5.0, 1.0, 3.0, 2.0, 2.0, 4.0, 5.0, 2.0, 4.0, 2.0, 5.0, 5.0, 5.0, 4.0, 13.0, 9.0, 18.0, 16.0, 16.0, 13.0, 29.0, 47.0, 84.0, 356.0], [3794.0, 2876.0, 2261.0, 1691.0, 1341.0, 1079.0, 822.0, 676.0, 523.0, 414.0, 322.0, 260.0, 240.0, 166.0, 135.0, 111.0, 101.0, 58.0, 59.0, 38.0, 45.0, 24.0, 19.0, 19.0, 14.0, 15.0, 10.0, 4.0, 12.0, 7.0, 9.0, 7.0, 3.0, 6.0, 3.0, 5.0, 1.0, 8.0, 2.0, 2.0, 3.0, 1.0, 7.0, 16.0, 12.0, 14.0, 17.0, 49.0, 157.0], [3624.0, 2629.0, 2244.0, 1691.0, 1462.0, 1190.0, 982.0, 791.0, 627.0, 552.0, 481.0, 394.0, 318.0, 246.0, 207.0, 162.0, 131.0, 118.0, 92.0, 72.0, 65.0, 56.0, 44.0, 38.0, 37.0, 29.0, 24.0, 17.0, 11.0, 4.0, 8.0, 6.0, 6.0, 8.0, 3.0, 8.0, 2.0, 5.0, 6.0, 7.0, 13.0, 8.0, 6.0, 5.0, 11.0, 11.0, 6.0, 33.0, 87.0], [3206.0, 2411.0, 2156.0, 1774.0, 1426.0, 1284.0, 1017.0, 855.0, 795.0, 604.0, 531.0, 466.0, 413.0, 354.0, 309.0, 234.0, 220.0, 196.0, 162.0, 160.0, 121.0, 114.0, 73.0, 69.0, 53.0, 51.0, 44.0, 31.0, 29.0, 16.0, 21.0, 16.0, 11.0, 12.0, 10.0, 5.0, 5.0, 6.0, 7.0, 3.0, 0.0, 3.0, 3.0, 3.0, 6.0, 8.0, 15.0, 18.0, 55.0], [2928.0, 2279.0, 2051.0, 1737.0, 1453.0, 1219.0, 1035.0, 959.0, 778.0, 701.0, 637.0, 503.0, 501.0, 395.0, 365.0, 331.0, 276.0, 252.0, 224.0, 205.0, 162.0, 178.0, 129.0, 109.0, 109.0, 104.0, 74.0, 68.0, 50.0, 47.0, 43.0, 37.0, 30.0, 22.0, 19.0, 13.0, 24.0, 12.0, 8.0, 5.0, 5.0, 2.0, 4.0, 5.0, 3.0, 5.0, 7.0, 14.0, 33.0], [2661.0, 2198.0, 1943.0, 1652.0, 1405.0, 1172.0, 1008.0, 907.0, 809.0, 777.0, 644.0, 593.0, 566.0, 507.0, 468.0, 429.0, 376.0, 340.0, 321.0, 297.0, 223.0, 231.0, 175.0, 164.0, 152.0, 129.0, 113.0, 115.0, 105.0, 84.0, 84.0, 70.0, 46.0, 62.0, 39.0, 41.0, 28.0, 21.0, 20.0, 18.0, 12.0, 10.0, 11.0, 11.0, 10.0, 3.0, 8.0, 7.0, 15.0], [2596.0, 2105.0, 1761.0, 1522.0, 1319.0, 1185.0, 1044.0, 996.0, 807.0, 772.0, 728.0, 640.0, 535.0, 507.0, 497.0, 445.0, 364.0, 358.0, 348.0, 306.0, 284.0, 259.0, 241.0, 196.0, 214.0, 188.0, 159.0, 132.0, 155.0, 143.0, 119.0, 94.0, 92.0, 84.0, 78.0, 52.0, 53.0, 51.0, 57.0, 41.0, 35.0, 25.0, 17.0, 20.0, 9.0, 13.0, 10.0, 9.0, 14.0], [2047.0, 1698.0, 1666.0, 1525.0, 1361.0, 1242.0, 1045.0, 987.0, 914.0, 814.0, 824.0, 690.0, 627.0, 541.0, 547.0, 507.0, 455.0, 457.0, 405.0, 361.0, 317.0, 338.0, 278.0, 256.0, 257.0, 230.0, 202.0, 203.0, 182.0, 173.0, 174.0, 159.0, 110.0, 136.0, 109.0, 107.0, 114.0, 75.0, 60.0, 62.0, 35.0, 42.0, 42.0, 30.0, 37.0, 24.0, 33.0, 17.0, 14.0], [1860.0, 1738.0, 1628.0, 1306.0, 1158.0, 1070.0, 1021.0, 921.0, 912.0, 748.0, 713.0, 644.0, 633.0, 581.0, 518.0, 480.0, 437.0, 424.0, 401.0, 381.0, 375.0, 368.0, 314.0, 310.0, 311.0, 291.0, 239.0, 301.0, 258.0, 258.0, 237.0, 234.0, 192.0, 197.0, 153.0, 165.0, 151.0, 161.0, 128.0, 118.0, 123.0, 89.0, 70.0, 70.0, 71.0, 77.0, 53.0, 36.0, 33.0], [1865.0, 1510.0, 1304.0, 1118.0, 1059.0, 998.0, 974.0, 912.0, 810.0, 731.0, 767.0, 640.0, 624.0, 565.0, 478.0, 441.0, 450.0, 399.0, 396.0, 373.0, 374.0, 347.0, 339.0, 354.0, 298.0, 311.0, 268.0, 290.0, 288.0, 280.0, 256.0, 248.0, 218.0, 261.0, 231.0, 196.0, 206.0, 197.0, 175.0, 206.0, 201.0, 188.0, 190.0, 165.0, 147.0, 132.0, 123.0, 93.0, 97.0], [1380.0, 1170.0, 1255.0, 1143.0, 978.0, 858.0, 851.0, 820.0, 768.0, 740.0, 713.0, 574.0, 560.0, 548.0, 562.0, 499.0, 546.0, 543.0, 481.0, 436.0, 420.0, 428.0, 400.0, 384.0, 363.0, 327.0, 302.0, 317.0, 287.0, 269.0, 289.0, 265.0, 243.0, 279.0, 270.0, 254.0, 253.0, 221.0, 246.0, 226.0, 243.0, 236.0, 256.0, 237.0, 200.0, 272.0, 209.0, 195.0, 159.0], [1126.0, 983.0, 941.0, 997.0, 811.0, 882.0, 911.0, 710.0, 691.0, 613.0, 645.0, 588.0, 542.0, 534.0, 488.0, 521.0, 515.0, 451.0, 453.0, 421.0, 440.0, 393.0, 430.0, 402.0, 367.0, 345.0, 325.0, 332.0, 337.0, 312.0, 306.0, 294.0, 305.0, 279.0, 291.0, 275.0, 289.0, 321.0, 271.0, 320.0, 319.0, 344.0, 326.0, 326.0, 354.0, 341.0, 363.0, 335.0, 352.0], [1208.0, 1023.0, 1017.0, 835.0, 863.0, 667.0, 677.0, 698.0, 739.0, 578.0, 692.0, 550.0, 600.0, 618.0, 492.0, 525.0, 480.0, 472.0, 432.0, 450.0, 415.0, 375.0, 331.0, 387.0, 342.0, 324.0, 310.0, 222.0, 218.0, 278.0, 265.0, 211.0, 268.0, 268.0, 230.0, 228.0, 217.0, 236.0, 204.0, 263.0, 298.0, 362.0, 338.0, 364.0, 393.0, 481.0, 509.0, 553.0, 629.0], [937.0, 956.0, 810.0, 922.0, 794.0, 709.0, 641.0, 657.0, 558.0, 497.0, 405.0, 443.0, 539.0, 434.0, 442.0, 454.0, 528.0, 488.0, 482.0, 465.0, 392.0, 422.0, 315.0, 351.0, 335.0, 339.0, 252.0, 316.0, 318.0, 232.0, 265.0, 243.0, 262.0, 248.0, 232.0, 272.0, 282.0, 282.0, 284.0, 303.0, 290.0, 318.0, 356.0, 332.0, 382.0, 493.0, 597.0, 759.0, 865.0], [830.0, 848.0, 857.0, 892.0, 733.0, 632.0, 600.0, 783.0, 616.0, 450.0, 538.0, 561.0, 507.0, 449.0, 483.0, 453.0, 362.0, 358.0, 418.0, 389.0, 348.0, 316.0, 314.0, 373.0, 268.0, 298.0, 242.0, 306.0, 280.0, 339.0, 281.0, 282.0, 234.0, 255.0, 183.0, 204.0, 191.0, 171.0, 246.0, 305.0, 246.0, 249.0, 258.0, 295.0, 391.0, 466.0, 578.0, 840.0, 1210.0], [915.0, 721.0, 827.0, 596.0, 801.0, 730.0, 615.0, 667.0, 635.0, 484.0, 494.0, 470.0, 514.0, 411.0, 441.0, 352.0, 509.0, 419.0, 349.0, 269.0, 318.0, 360.0, 332.0, 308.0, 346.0, 364.0, 256.0, 235.0, 223.0, 213.0, 202.0, 307.0, 298.0, 213.0, 269.0, 196.0, 292.0, 224.0, 185.0, 161.0, 208.0, 243.0, 320.0, 328.0, 330.0, 458.0, 593.0, 691.0, 1204.0], [734.0, 624.0, 791.0, 627.0, 676.0, 631.0, 625.0, 628.0, 609.0, 567.0, 580.0, 605.0, 444.0, 464.0, 555.0, 509.0, 571.0, 410.0, 385.0, 276.0, 404.0, 281.0, 340.0, 313.0, 342.0, 297.0, 294.0, 231.0, 293.0, 288.0, 219.0, 248.0, 211.0, 267.0, 308.0, 261.0, 234.0, 196.0, 232.0, 193.0, 187.0, 268.0, 241.0, 246.0, 214.0, 316.0, 429.0, 655.0, 1083.0], [823.0, 844.0, 738.0, 682.0, 685.0, 699.0, 819.0, 553.0, 599.0, 643.0, 534.0, 447.0, 387.0, 494.0, 563.0, 458.0, 415.0, 367.0, 304.0, 376.0, 305.0, 431.0, 389.0, 318.0, 354.0, 369.0, 308.0, 266.0, 172.0, 257.0, 269.0, 275.0, 230.0, 196.0, 241.0, 260.0, 252.0, 194.0, 243.0, 172.0, 100.0, 159.0, 140.0, 209.0, 184.0, 253.0, 334.0, 508.0, 881.0], [936.0, 828.0, 862.0, 544.0, 661.0, 646.0, 453.0, 667.0, 684.0, 671.0, 449.0, 487.0, 520.0, 409.0, 418.0, 485.0, 448.0, 403.0, 259.0, 390.0, 407.0, 296.0, 406.0, 388.0, 237.0, 350.0, 208.0, 229.0, 231.0, 269.0, 264.0, 403.0, 237.0, 321.0, 206.0, 276.0, 200.0, 202.0, 315.0, 175.0, 165.0, 159.0, 181.0, 169.0, 189.0, 212.0, 281.0, 345.0, 741.0], [882.0, 610.0, 552.0, 769.0, 599.0, 726.0, 669.0, 697.0, 584.0, 520.0, 512.0, 596.0, 603.0, 305.0, 479.0, 519.0, 386.0, 418.0, 315.0, 377.0, 290.0, 287.0, 274.0, 240.0, 355.0, 272.0, 357.0, 301.0, 254.0, 270.0, 290.0, 268.0, 289.0, 340.0, 240.0, 212.0, 175.0, 157.0, 279.0, 161.0, 284.0, 180.0, 253.0, 209.0, 178.0, 232.0, 182.0, 247.0, 547.0], [852.0, 1115.0, 711.0, 705.0, 826.0, 765.0, 947.0, 725.0, 550.0, 465.0, 636.0, 438.0, 438.0, 467.0, 587.0, 500.0, 379.0, 450.0, 317.0, 361.0, 358.0, 343.0, 252.0, 307.0, 298.0, 349.0, 257.0, 189.0, 255.0, 374.0, 290.0, 249.0, 137.0, 234.0, 218.0, 220.0, 215.0, 194.0, 172.0, 180.0, 208.0, 164.0, 197.0, 209.0, 118.0, 51.0, 109.0, 206.0, 320.0], [935.0, 905.0, 716.0, 655.0, 844.0, 626.0, 638.0, 583.0, 605.0, 577.0, 524.0, 473.0, 558.0, 445.0, 517.0, 455.0, 347.0, 416.0, 319.0, 256.0, 376.0, 301.0, 258.0, 328.0, 394.0, 426.0, 290.0, 285.0, 365.0, 365.0, 272.0, 267.0, 325.0, 199.0, 196.0, 222.0, 127.0, 247.0, 278.0, 90.0, 220.0, 176.0, 134.0, 207.0, 174.0, 94.0, 116.0, 176.0, 307.0], [886.0, 747.0, 902.0, 817.0, 871.0, 577.0, 601.0, 593.0, 678.0, 472.0, 503.0, 492.0, 490.0, 372.0, 449.0, 586.0, 361.0, 441.0, 565.0, 368.0, 340.0, 291.0, 354.0, 317.0, 397.0, 235.0, 323.0, 320.0, 392.0, 326.0, 191.0, 418.0, 242.0, 191.0, 321.0, 211.0, 126.0, 160.0, 170.0, 181.0, 130.0, 119.0, 206.0, 159.0, 110.0, 113.0, 130.0, 126.0, 223.0], [894.0, 806.0, 814.0, 777.0, 613.0, 465.0, 614.0, 560.0, 646.0, 533.0, 407.0, 415.0, 409.0, 573.0, 449.0, 385.0, 481.0, 355.0, 412.0, 507.0, 434.0, 504.0, 358.0, 278.0, 267.0, 310.0, 292.0, 305.0, 392.0, 232.0, 173.0, 264.0, 236.0, 297.0, 183.0, 200.0, 211.0, 147.0, 66.0, 170.0, 182.0, 196.0, 207.0, 237.0, 85.0, 242.0, 200.0, 224.0, 174.0], [817.0, 721.0, 948.0, 628.0, 640.0, 650.0, 610.0, 648.0, 508.0, 460.0, 560.0, 497.0, 611.0, 568.0, 413.0, 623.0, 423.0, 307.0, 340.0, 441.0, 396.0, 332.0, 259.0, 300.0, 227.0, 332.0, 357.0, 326.0, 163.0, 152.0, 316.0, 210.0, 313.0, 152.0, 185.0, 289.0, 245.0, 124.0, 117.0, 224.0, 199.0, 168.0, 170.0, 158.0, 172.0, 138.0, 61.0, 109.0, 166.0], [903.0, 688.0, 477.0, 600.0, 654.0, 721.0, 710.0, 621.0, 691.0, 671.0, 524.0, 561.0, 489.0, 466.0, 488.0, 501.0, 424.0, 352.0, 392.0, 343.0, 416.0, 456.0, 316.0, 385.0, 322.0, 229.0, 224.0, 270.0, 263.0, 307.0, 303.0, 140.0, 206.0, 258.0, 207.0, 124.0, 323.0, 232.0, 252.0, 157.0, 198.0, 203.0, 206.0, 293.0, 217.0, 268.0, 161.0, 66.0, 127.0], [519.0, 662.0, 730.0, 339.0, 463.0, 700.0, 657.0, 634.0, 580.0, 485.0, 466.0, 532.0, 526.0, 527.0, 426.0, 395.0, 522.0, 380.0, 402.0, 257.0, 284.0, 380.0, 274.0, 191.0, 446.0, 366.0, 250.0, 240.0, 300.0, 291.0, 274.0, 223.0, 180.0, 296.0, 185.0, 284.0, 354.0, 127.0, 160.0, 249.0, 210.0, 170.0, 59.0, 192.0, 193.0, 134.0, 230.0, 191.0, 174.0], [682.0, 502.0, 485.0, 604.0, 552.0, 438.0, 442.0, 443.0, 463.0, 499.0, 561.0, 480.0, 422.0, 401.0, 550.0, 375.0, 545.0, 439.0, 389.0, 335.0, 217.0, 186.0, 357.0, 351.0, 361.0, 264.0, 332.0, 399.0, 366.0, 273.0, 340.0, 218.0, 328.0, 274.0, 372.0, 215.0, 220.0, 266.0, 229.0, 294.0, 206.0, 83.0, 166.0, 206.0, 226.0, 285.0, 100.0, 133.0, 90.0], [670.0, 554.0, 444.0, 470.0, 415.0, 574.0, 507.0, 588.0, 335.0, 403.0, 489.0, 396.0, 301.0, 364.0, 455.0, 331.0, 333.0, 402.0, 469.0, 300.0, 464.0, 373.0, 254.0, 268.0, 304.0, 227.0, 247.0, 147.0, 202.0, 323.0, 304.0, 250.0, 228.0, 172.0, 224.0, 145.0, 142.0, 185.0, 212.0, 312.0, 241.0, 158.0, 169.0, 184.0, 180.0, 146.0, 160.0, 122.0, 138.0], [591.0, 349.0, 433.0, 531.0, 567.0, 531.0, 411.0, 492.0, 321.0, 382.0, 309.0, 362.0, 546.0, 415.0, 380.0, 354.0, 251.0, 297.0, 278.0, 391.0, 282.0, 326.0, 337.0, 267.0, 281.0, 282.0, 313.0, 348.0, 208.0, 98.0, 209.0, 266.0, 200.0, 220.0, 214.0, 301.0, 307.0, 212.0, 100.0, 232.0, 165.0, 121.0, 135.0, 235.0, 234.0, 157.0, 261.0, 225.0, 159.0], [399.0, 410.0, 528.0, 401.0, 305.0, 391.0, 482.0, 531.0, 364.0, 209.0, 233.0, 452.0, 365.0, 391.0, 379.0, 260.0, 314.0, 203.0, 260.0, 323.0, 287.0, 320.0, 383.0, 234.0, 161.0, 240.0, 221.0, 238.0, 404.0, 356.0, 209.0, 166.0, 205.0, 287.0, 365.0, 300.0, 248.0, 176.0, 139.0, 187.0, 153.0, 235.0, 237.0, 251.0, 167.0, 181.0, 264.0, 228.0, 145.0], [278.0, 412.0, 420.0, 335.0, 276.0, 509.0, 360.0, 268.0, 284.0, 317.0, 253.0, 332.0, 301.0, 348.0, 336.0, 335.0, 349.0, 380.0, 408.0, 265.0, 255.0, 318.0, 347.0, 248.0, 237.0, 206.0, 217.0, 182.0, 237.0, 216.0, 266.0, 180.0, 238.0, 264.0, 332.0, 121.0, 142.0, 195.0, 297.0, 227.0, 72.0, 95.0, 190.0, 145.0, 135.0, 100.0, 185.0, 202.0, 183.0]],
    "Name": "sCurve-0",
    "Overflow": 2048946.0,
    "Type": "Histo2d",
    "Underflow": 0.0,
    "x": {
        "AxisTitle": "Vcal",
        "Bins": 51,
        "High": 302.5,
        "Low": 47.5
    },
    "y": {
        "AxisTitle": "Occupancy",
        "Bins": 49,
        "High": 49.5,
        "Low": 0.5
    },
    "z": {
        "AxisTitle": "Number of pixels"
    }
}