{
    "Data": [11.0, 97.0, 27.0, 14.0, 38.0, 60.0, 194.0, 550.0, 1586.0, 3313.0, 5037.0, 5649.0, 5188.0, 4064.0, 3813.0, 4055.0, 4460.0, 4132.0, 3640.0, 2751.0, 1901.0, 1122.0, 702.0, 482.0, 397.0, 394.0, 448.0, 453.0, 630.0, 750.0, 834.0, 931.0, 979.0, 1129.0, 1058.0, 1015.0, 980.0, 843.0, 806.0, 664.0, 585.0, 527.0, 470.0, 416.0, 352.0, 336.0, 298.0, 324.0, 269.0, 231.0, 239.0, 224.0, 222.0, 202.0, 167.0, 179.0, 185.0, 172.0, 168.0, 150.0, 129.0, 125.0, 121.0, 110.0, 101.0, 97.0, 73.0, 89.0, 92.0, 72.0, 71.0, 63.0, 72.0, 77.0, 72.0, 65.0, 70.0, 73.0, 65.0, 73.0, 61.0, 65.0, 54.0, 46.0, 51.0, 58.0, 65.0, 70.0, 56.0, 50.0, 38.0, 60.0, 41.0, 44.0, 37.0, 51.0, 26.0, 40.0, 40.0, 38.0, 33.0, 27.0, 33.0, 41.0, 30.0, 38.0, 35.0, 26.0, 17.0, 21.0, 24.0, 16.0, 24.0, 22.0, 23.0, 20.0, 17.0, 23.0, 19.0],
    "Name": "NoiseDist-0",
    "Overflow": 495.0,
    "Type": "Histo1d",
    "Underflow": 0.0,
    "x": {
        "AxisTitle": "Noise [e]",
        "Bins": 119,
        "High": 596.0,
        "Low": -2.0
    },
    "y": {
        "AxisTitle": "Number of Pixels"
    },
    "z": {
        "AxisTitle": "z"
    }
}