{
    "Data": [0.0, 0.0, 0.0, 0.0, 0.0, 0.0, 0.0, 0.0, 0.0, 0.0, 0.0, 0.0, 0.0, 0.0, 0.0, 0.0, 0.0, 0.0, 0.0, 0.0, 0.0, 0.0, 0.0, 0.0, 0.0, 0.0, 0.0, 0.0, 0.0, 0.0, 0.0, 0.0, 0.0, 0.0, 0.0, 0.0, 0.0, 0.0, 0.0, 0.0, 0.0, 0.0, 0.0, 0.0, 0.0, 0.0, 0.0, 0.0, 0.0, 0.0, 46.0, 75.0, 100.0, 105.0, 129.0, 149.0, 181.0, 204.0, 230.0, 284.0, 334.0, 351.0, 431.0, 397.0, 524.0, 552.0, 606.0, 683.0, 713.0, 787.0, 854.0, 880.0, 887.0, 917.0, 910.0, 963.0, 937.0, 1048.0, 909.0, 895.0, 912.0, 888.0, 899.0, 888.0, 969.0, 988.0, 1151.0, 1391.0, 1669.0, 1979.0, 2393.0, 2604.0, 2873.0, 2830.0, 2658.0, 2450.0, 2026.0, 1504.0, 1199.0, 821.0, 614.0, 411.0, 297.0, 211.0, 140.0, 111.0, 71.0, 63.0, 43.0, 49.0, 25.0, 32.0, 22.0, 19.0, 18.0, 14.0, 17.0, 14.0, 22.0, 18.0, 9.0, 9.0, 14.0, 12.0, 14.0, 8.0, 9.0, 11.0, 8.0, 8.0, 4.0, 2.0, 6.0, 8.0, 8.0, 7.0, 4.0, 3.0, 9.0, 5.0, 3.0, 2.0, 1.0, 0.0, 4.0, 1.0, 1.0, 5.0, 2.0, 1.0, 3.0, 4.0, 6.0, 2.0, 3.0, 0.0, 2.0, 4.0, 2.0, 4.0, 2.0, 5.0, 4.0, 2.0, 9.0, 7.0, 10.0, 11.0, 12.0, 16.0, 29.0, 22.0, 28.0, 39.0, 27.0, 46.0, 60.0, 84.0, 90.0, 80.0, 104.0, 121.0, 132.0, 151.0, 174.0, 213.0, 206.0, 245.0, 312.0, 316.0, 314.0, 367.0, 401.0, 465.0, 476.0, 442.0, 533.0, 584.0, 615.0, 568.0, 672.0, 663.0, 677.0, 632.0, 655.0, 704.0, 670.0, 688.0, 692.0, 691.0, 675.0, 614.0, 658.0, 606.0, 606.0, 594.0, 584.0, 562.0, 487.0, 435.0, 440.0, 459.0, 382.0, 348.0, 326.0, 318.0, 305.0, 247.0, 230.0, 209.0, 201.0, 167.0, 136.0, 141.0, 121.0, 120.0, 84.0, 82.0, 55.0, 57.0, 39.0, 41.0, 30.0, 27.0, 34.0, 26.0, 18.0, 14.0, 8.0, 11.0, 3.0, 11.0, 0.0, 2.0, 1.0, 1.0, 2.0, 0.0, 3.0, 0.0, 0.0, 2.0, 0.0, 0.0, 0.0, 0.0, 0.0, 0.0, 0.0, 0.0, 1.0, 0.0, 0.0, 0.0, 0.0, 0.0, 0.0, 0.0, 0.0, 0.0, 0.0, 0.0, 0.0, 0.0, 0.0, 0.0, 0.0, 0.0, 0.0, 0.0, 0.0, 0.0, 0.0, 0.0, 0.0, 0.0, 0.0, 0.0, 0.0, 0.0, 0.0, 0.0, 0.0, 0.0, 0.0, 0.0, 0.0, 0.0, 0.0, 0.0, 0.0, 0.0, 0.0, 0.0, 0.0, 0.0, 0.0, 0.0, 0.0, 0.0, 0.0, 0.0, 0.0, 0.0, 0.0, 0.0, 0.0, 0.0, 0.0, 0.0, 0.0, 0.0, 0.0, 0.0, 0.0, 0.0, 0.0, 0.0, 0.0, 0.0, 0.0, 0.0, 0.0, 0.0, 0.0, 0.0, 0.0, 0.0, 0.0, 0.0, 0.0, 0.0, 0.0, 0.0, 0.0, 0.0, 0.0, 0.0, 0.0, 0.0, 0.0, 0.0, 0.0, 0.0, 0.0, 0.0, 0.0, 0.0, 0.0, 0.0, 0.0, 0.0, 0.0, 0.0, 0.0, 0.0, 0.0, 0.0, 0.0, 0.0, 0.0, 0.0, 0.0, 0.0, 0.0, 0.0, 0.0, 0.0, 0.0, 0.0, 0.0, 0.0, 0.0, 0.0, 0.0, 0.0, 0.0, 0.0, 0.0, 0.0, 0.0, 0.0, 0.0, 0.0, 0.0, 0.0, 0.0, 0.0, 0.0, 0.0, 0.0, 0.0, 0.0, 0.0, 0.0],
    "Name": "ThresholdDist-0",
    "Overflow": 0.0,
    "Type": "Histo1d",
    "Underflow": 0.0,
    "x": {
        "AxisTitle": "Threshold [e]",
        "Bins": 415,
        "High": 4145.0,
        "Low": -5.0
    },
    "y": {
        "AxisTitle": "Number of Pixels"
    },
    "z": {
        "AxisTitle": "z"
    }
}