time,Hardware,Voltage,Current
1622099390149,high-voltage-2,1,0.334947
time,Hardware,Voltage,Current
1622099390149,high-voltage-2,2,0.403471
time,Hardware,Voltage,Current
1622099390149,high-voltage-2,3,0.450679
time,Hardware,Voltage,Current
1622099390149,high-voltage-2,4,0.491909
time,Hardware,Voltage,Current
1622099390149,high-voltage-2,5,0.52367
time,Hardware,Voltage,Current
1622099390149,high-voltage-2,6,0.558172
time,Hardware,Voltage,Current
1622099390149,high-voltage-2,7,0.589842
time,Hardware,Voltage,Current
1622099390149,high-voltage-2,8,0.618167
time,Hardware,Voltage,Current
1622099390149,high-voltage-2,9,0.648656
time,Hardware,Voltage,Current
1622099390149,high-voltage-2,10,0.677842
time,Hardware,Voltage,Current
1622099390149,high-voltage-2,11,0.702858
time,Hardware,Voltage,Current
1622099390149,high-voltage-2,12,0.729719
time,Hardware,Voltage,Current
1622099390149,high-voltage-2,13,0.753625
time,Hardware,Voltage,Current
1622099390149,high-voltage-2,14,0.772916
time,Hardware,Voltage,Current
1622099390149,high-voltage-2,15,0.79235
time,Hardware,Voltage,Current
1622099390149,high-voltage-2,16,0.810009
time,Hardware,Voltage,Current
1622099390149,high-voltage-2,17,0.825122
time,Hardware,Voltage,Current
1622099390149,high-voltage-2,18,0.843835
time,Hardware,Voltage,Current
1622099390149,high-voltage-2,19,0.858168
time,Hardware,Voltage,Current
1622099390149,high-voltage-2,20,0.875184
time,Hardware,Voltage,Current
1622099390149,high-voltage-2,25,0.949
time,Hardware,Voltage,Current
1622099390149,high-voltage-2,30,1.02416
time,Hardware,Voltage,Current
1622099390149,high-voltage-2,35,1.10137
time,Hardware,Voltage,Current
1622099390149,high-voltage-2,40,1.1947
time,Hardware,Voltage,Current
1622099390149,high-voltage-2,45,1.30797
time,Hardware,Voltage,Current
1622099390149,high-voltage-2,50,1.3891
time,Hardware,Voltage,Current
1622099390149,high-voltage-2,55,1.46073
time,Hardware,Voltage,Current
1622099390149,high-voltage-2,60,6e+07
time,Hardware,Voltage,Current
1622099390149,high-voltage-2,65,1.59588
time,Hardware,Voltage,Current
1622099390149,high-voltage-2,70,1.66149
time,Hardware,Voltage,Current
1622099390149,high-voltage-2,75,1.72543
time,Hardware,Voltage,Current
1622099390149,high-voltage-2,80,1.78615
time,Hardware,Voltage,Current
1622099390149,high-voltage-2,85,1.8458
time,Hardware,Voltage,Current
1622099390149,high-voltage-2,90,1.90692
time,Hardware,Voltage,Current
1622099390149,high-voltage-2,95,9.5e+07
time,Hardware,Voltage,Current
1622099390149,high-voltage-2,100,2.02412
