time,Hardware,Voltage,Current
1623292564903,high-voltage,1,0.0226526
time,Hardware,Voltage,Current
1623292564903,high-voltage,2,0.0284377
time,Hardware,Voltage,Current
1623292564903,high-voltage,3,0.0333118
time,Hardware,Voltage,Current
1623292564903,high-voltage,4,0.0377078
time,Hardware,Voltage,Current
1623292564903,high-voltage,5,0.0405515
time,Hardware,Voltage,Current
1623292564903,high-voltage,6,0.0435365
time,Hardware,Voltage,Current
1623292564903,high-voltage,7,0.0486281
time,Hardware,Voltage,Current
1623292564903,high-voltage,8,0.0524747
time,Hardware,Voltage,Current
1623292564903,high-voltage,9,0.0571918
time,Hardware,Voltage,Current
1623292564903,high-voltage,10,0.062395
time,Hardware,Voltage,Current
1623292564903,high-voltage,11,0.06688
time,Hardware,Voltage,Current
1623292564903,high-voltage,12,0.0726225
time,Hardware,Voltage,Current
1623292564903,high-voltage,13,0.0773414
time,Hardware,Voltage,Current
1623292564903,high-voltage,14,0.0824406
time,Hardware,Voltage,Current
1623292564903,high-voltage,15,0.0862444
time,Hardware,Voltage,Current
1623292564903,high-voltage,16,0.0895005
time,Hardware,Voltage,Current
1623292564903,high-voltage,17,0.0941087
time,Hardware,Voltage,Current
1623292564903,high-voltage,18,0.0963455
time,Hardware,Voltage,Current
1623292564903,high-voltage,19,0.0999079
time,Hardware,Voltage,Current
1623292564903,high-voltage,20,0.102227
time,Hardware,Voltage,Current
1623292564903,high-voltage,1.14704e-07,0.114591
time,Hardware,Voltage,Current
1623292564903,high-voltage,30,0.131372
time,Hardware,Voltage,Current
1623292564903,high-voltage,1.85225e-07,0.185075
time,Hardware,Voltage,Current
1623292564903,high-voltage,40,0.395835
time,Hardware,Voltage,Current
1623292564903,high-voltage,45,0.857098
time,Hardware,Voltage,Current
1623292564903,high-voltage,50,1.53422
time,Hardware,Voltage,Current
1623292564903,high-voltage,55,2.38519
time,Hardware,Voltage,Current
1623292564903,high-voltage,60,3.40373
