{
    "Data": [[7216.0, 3912.0, 2785.0, 2203.0, 1850.0, 1611.0, 1337.0, 1147.0, 1082.0, 1017.0, 988.0, 882.0, 830.0, 806.0, 802.0, 719.0, 710.0, 672.0, 586.0, 624.0, 623.0, 642.0, 582.0, 542.0, 563.0, 560.0, 545.0, 521.0, 581.0, 484.0, 510.0, 510.0, 485.0, 486.0, 479.0, 521.0, 487.0, 479.0, 531.0, 483.0, 526.0, 518.0, 529.0, 528.0, 588.0, 576.0, 551.0, 682.0, 818.0], [7249.0, 4047.0, 2790.0, 2287.0, 1897.0, 1572.0, 1359.0, 1232.0, 1147.0, 1019.0, 942.0, 907.0, 840.0, 764.0, 751.0, 770.0, 678.0, 690.0, 672.0, 644.0, 673.0, 577.0, 547.0, 575.0, 574.0, 552.0, 558.0, 530.0, 529.0, 568.0, 530.0, 519.0, 543.0, 509.0, 480.0, 554.0, 557.0, 525.0, 506.0, 573.0, 571.0, 540.0, 546.0, 617.0, 672.0, 630.0, 722.0, 770.0, 909.0], [7182.0, 4069.0, 2846.0, 2210.0, 1866.0, 1635.0, 1388.0, 1246.0, 1109.0, 1075.0, 999.0, 905.0, 858.0, 834.0, 796.0, 726.0, 737.0, 693.0, 638.0, 677.0, 642.0, 563.0, 617.0, 593.0, 567.0, 588.0, 529.0, 550.0, 590.0, 555.0, 501.0, 534.0, 485.0, 511.0, 552.0, 560.0, 519.0, 584.0, 538.0, 542.0, 579.0, 584.0, 646.0, 663.0, 644.0, 691.0, 838.0, 910.0, 1145.0], [7109.0, 4073.0, 2879.0, 2096.0, 1894.0, 1557.0, 1425.0, 1300.0, 1137.0, 1020.0, 970.0, 920.0, 862.0, 872.0, 805.0, 754.0, 705.0, 725.0, 662.0, 664.0, 649.0, 647.0, 609.0, 626.0, 612.0, 573.0, 547.0, 544.0, 591.0, 536.0, 580.0, 569.0, 565.0, 495.0, 562.0, 585.0, 532.0, 551.0, 554.0, 562.0, 623.0, 613.0, 630.0, 714.0, 727.0, 741.0, 861.0, 1015.0, 1346.0], [7133.0, 4048.0, 2779.0, 2168.0, 1882.0, 1588.0, 1409.0, 1239.0, 1134.0, 1051.0, 988.0, 895.0, 927.0, 849.0, 787.0, 800.0, 694.0, 730.0, 684.0, 647.0, 642.0, 663.0, 638.0, 630.0, 618.0, 570.0, 566.0, 587.0, 509.0, 531.0, 579.0, 575.0, 601.0, 552.0, 564.0, 556.0, 549.0, 611.0, 604.0, 623.0, 617.0, 595.0, 660.0, 705.0, 720.0, 803.0, 886.0, 1134.0, 1623.0], [7156.0, 3988.0, 2830.0, 2207.0, 1905.0, 1609.0, 1379.0, 1209.0, 1097.0, 1054.0, 984.0, 971.0, 870.0, 844.0, 768.0, 725.0, 731.0, 729.0, 698.0, 668.0, 656.0, 635.0, 618.0, 613.0, 611.0, 540.0, 597.0, 579.0, 577.0, 582.0, 566.0, 566.0, 553.0, 615.0, 527.0, 556.0, 591.0, 581.0, 594.0, 591.0, 636.0, 659.0, 683.0, 729.0, 772.0, 882.0, 999.0, 1182.0, 1764.0], [6946.0, 4033.0, 2808.0, 2284.0, 1780.0, 1529.0, 1317.0, 1225.0, 1156.0, 1117.0, 953.0, 903.0, 849.0, 818.0, 826.0, 726.0, 728.0, 731.0, 700.0, 653.0, 647.0, 611.0, 629.0, 593.0, 622.0, 582.0, 580.0, 597.0, 592.0, 617.0, 585.0, 563.0, 506.0, 554.0, 582.0, 531.0, 563.0, 622.0, 618.0, 659.0, 606.0, 664.0, 724.0, 727.0, 779.0, 863.0, 1018.0, 1282.0, 1931.0], [6944.0, 4002.0, 2681.0, 2138.0, 1844.0, 1526.0, 1411.0, 1246.0, 1041.0, 1061.0, 891.0, 898.0, 858.0, 821.0, 797.0, 751.0, 757.0, 669.0, 720.0, 651.0, 674.0, 638.0, 665.0, 584.0, 575.0, 609.0, 618.0, 637.0, 557.0, 510.0, 567.0, 555.0, 573.0, 584.0, 534.0, 577.0, 567.0, 591.0, 577.0, 626.0, 693.0, 651.0, 703.0, 788.0, 822.0, 910.0, 1063.0, 1294.0, 2039.0], [6843.0, 3901.0, 2668.0, 2131.0, 1844.0, 1509.0, 1358.0, 1258.0, 1045.0, 996.0, 942.0, 917.0, 842.0, 833.0, 820.0, 737.0, 734.0, 701.0, 646.0, 685.0, 650.0, 606.0, 632.0, 564.0, 599.0, 583.0, 611.0, 557.0, 557.0, 573.0, 537.0, 575.0, 571.0, 596.0, 599.0, 582.0, 582.0, 590.0, 562.0, 588.0, 604.0, 676.0, 706.0, 720.0, 839.0, 901.0, 1070.0, 1338.0, 2146.0], [6605.0, 3881.0, 2711.0, 2061.0, 1771.0, 1504.0, 1278.0, 1183.0, 1079.0, 984.0, 909.0, 869.0, 854.0, 807.0, 803.0, 769.0, 725.0, 719.0, 676.0, 631.0, 607.0, 608.0, 612.0, 602.0, 616.0, 550.0, 570.0, 548.0, 505.0, 548.0, 568.0, 535.0, 601.0, 560.0, 542.0, 582.0, 609.0, 644.0, 615.0, 617.0, 595.0, 686.0, 668.0, 751.0, 806.0, 869.0, 1085.0, 1400.0, 2054.0], [6568.0, 3634.0, 2652.0, 2094.0, 1715.0, 1538.0, 1305.0, 1111.0, 1038.0, 996.0, 910.0, 860.0, 798.0, 788.0, 742.0, 726.0, 761.0, 706.0, 652.0, 624.0, 632.0, 587.0, 604.0, 538.0, 552.0, 551.0, 595.0, 571.0, 525.0, 546.0, 549.0, 546.0, 536.0, 550.0, 571.0, 532.0, 547.0, 585.0, 560.0, 627.0, 617.0, 644.0, 712.0, 720.0, 839.0, 935.0, 1068.0, 1331.0, 2236.0], [6521.0, 3671.0, 2605.0, 2054.0, 1655.0, 1368.0, 1330.0, 1115.0, 1083.0, 1003.0, 881.0, 842.0, 812.0, 728.0, 715.0, 709.0, 688.0, 678.0, 669.0, 584.0, 612.0, 553.0, 583.0, 556.0, 564.0, 561.0, 543.0, 554.0, 524.0, 540.0, 576.0, 550.0, 532.0, 551.0, 531.0, 572.0, 562.0, 539.0, 566.0, 569.0, 574.0, 592.0, 677.0, 782.0, 783.0, 899.0, 1098.0, 1349.0, 2125.0], [6429.0, 3600.0, 2538.0, 2051.0, 1641.0, 1413.0, 1290.0, 1088.0, 1038.0, 979.0, 914.0, 797.0, 740.0, 761.0, 724.0, 686.0, 684.0, 609.0, 618.0, 584.0, 542.0, 558.0, 568.0, 582.0, 561.0, 547.0, 555.0, 568.0, 539.0, 511.0, 500.0, 495.0, 539.0, 544.0, 507.0, 509.0, 533.0, 551.0, 585.0, 561.0, 565.0, 630.0, 655.0, 754.0, 779.0, 847.0, 1037.0, 1293.0, 2139.0], [6506.0, 3459.0, 2494.0, 1893.0, 1667.0, 1488.0, 1209.0, 1123.0, 975.0, 919.0, 858.0, 828.0, 721.0, 744.0, 732.0, 671.0, 642.0, 621.0, 605.0, 610.0, 547.0, 561.0, 521.0, 515.0, 514.0, 515.0, 550.0, 535.0, 487.0, 500.0, 526.0, 482.0, 497.0, 525.0, 487.0, 502.0, 536.0, 514.0, 544.0, 566.0, 614.0, 626.0, 668.0, 651.0, 780.0, 816.0, 982.0, 1256.0, 2134.0], [6581.0, 3572.0, 2460.0, 1921.0, 1618.0, 1411.0, 1205.0, 1011.0, 986.0, 902.0, 786.0, 786.0, 784.0, 665.0, 709.0, 636.0, 655.0, 601.0, 577.0, 542.0, 524.0, 555.0, 551.0, 511.0, 511.0, 512.0, 504.0, 549.0, 462.0, 480.0, 493.0, 491.0, 478.0, 489.0, 500.0, 510.0, 492.0, 522.0, 554.0, 571.0, 542.0, 577.0, 634.0, 664.0, 728.0, 771.0, 926.0, 1204.0, 2047.0], [6896.0, 3584.0, 2430.0, 1955.0, 1584.0, 1306.0, 1159.0, 1033.0, 935.0, 838.0, 814.0, 791.0, 717.0, 724.0, 653.0, 631.0, 573.0, 609.0, 559.0, 546.0, 549.0, 528.0, 514.0, 492.0, 523.0, 489.0, 468.0, 496.0, 443.0, 472.0, 432.0, 493.0, 481.0, 490.0, 416.0, 483.0, 473.0, 485.0, 510.0, 528.0, 558.0, 568.0, 604.0, 635.0, 684.0, 799.0, 874.0, 1166.0, 2005.0], [7232.0, 3637.0, 2422.0, 1882.0, 1505.0, 1310.0, 1138.0, 1037.0, 961.0, 867.0, 762.0, 731.0, 705.0, 650.0, 633.0, 606.0, 578.0, 568.0, 576.0, 543.0, 532.0, 511.0, 482.0, 543.0, 495.0, 481.0, 463.0, 469.0, 465.0, 465.0, 471.0, 459.0, 429.0, 439.0, 439.0, 485.0, 429.0, 451.0, 469.0, 490.0, 513.0, 514.0, 573.0, 588.0, 686.0, 714.0, 902.0, 1132.0, 1826.0], [7819.0, 3927.0, 2506.0, 1878.0, 1555.0, 1363.0, 1028.0, 1001.0, 899.0, 831.0, 778.0, 745.0, 669.0, 655.0, 649.0, 593.0, 581.0, 608.0, 555.0, 538.0, 485.0, 474.0, 496.0, 445.0, 477.0, 507.0, 437.0, 435.0, 470.0, 448.0, 431.0, 415.0, 390.0, 435.0, 402.0, 467.0, 419.0, 467.0, 471.0, 468.0, 474.0, 470.0, 523.0, 558.0, 584.0, 640.0, 832.0, 1050.0, 1838.0], [8582.0, 4221.0, 2557.0, 1892.0, 1609.0, 1328.0, 1079.0, 978.0, 852.0, 786.0, 765.0, 715.0, 693.0, 664.0, 616.0, 604.0, 606.0, 566.0, 526.0, 498.0, 486.0, 491.0, 462.0, 465.0, 459.0, 472.0, 425.0, 430.0, 436.0, 423.0, 426.0, 409.0, 452.0, 427.0, 420.0, 418.0, 403.0, 408.0, 386.0, 417.0, 465.0, 497.0, 491.0, 548.0, 567.0, 668.0, 746.0, 970.0, 1665.0], [9332.0, 4601.0, 2925.0, 2036.0, 1538.0, 1315.0, 1177.0, 950.0, 856.0, 821.0, 720.0, 714.0, 708.0, 672.0, 583.0, 563.0, 552.0, 502.0, 536.0, 485.0, 504.0, 492.0, 452.0, 431.0, 467.0, 422.0, 467.0, 427.0, 381.0, 401.0, 439.0, 388.0, 382.0, 415.0, 389.0, 409.0, 430.0, 378.0, 419.0, 463.0, 455.0, 438.0, 473.0, 515.0, 527.0, 594.0, 715.0, 816.0, 1503.0], [10078.0, 5109.0, 3287.0, 2171.0, 1639.0, 1322.0, 1130.0, 959.0, 874.0, 798.0, 769.0, 778.0, 617.0, 623.0, 600.0, 570.0, 527.0, 505.0, 508.0, 490.0, 490.0, 450.0, 419.0, 399.0, 393.0, 441.0, 440.0, 443.0, 385.0, 414.0, 385.0, 409.0, 338.0, 407.0, 407.0, 396.0, 364.0, 412.0, 386.0, 412.0, 422.0, 415.0, 445.0, 500.0, 516.0, 547.0, 671.0, 806.0, 1438.0], [10665.0, 5581.0, 3593.0, 2486.0, 1793.0, 1427.0, 1098.0, 998.0, 828.0, 782.0, 746.0, 708.0, 686.0, 606.0, 572.0, 576.0, 515.0, 504.0, 468.0, 492.0, 454.0, 479.0, 450.0, 421.0, 425.0, 430.0, 372.0, 408.0, 411.0, 399.0, 413.0, 379.0, 384.0, 376.0, 383.0, 335.0, 367.0, 393.0, 387.0, 375.0, 403.0, 403.0, 430.0, 452.0, 493.0, 559.0, 546.0, 786.0, 1254.0], [10707.0, 6032.0, 4145.0, 2752.0, 2019.0, 1521.0, 1257.0, 990.0, 925.0, 787.0, 744.0, 685.0, 635.0, 593.0, 588.0, 576.0, 564.0, 479.0, 506.0, 495.0, 466.0, 443.0, 409.0, 458.0, 432.0, 406.0, 369.0, 382.0, 381.0, 413.0, 365.0, 356.0, 382.0, 381.0, 342.0, 375.0, 378.0, 362.0, 376.0, 358.0, 418.0, 391.0, 422.0, 444.0, 481.0, 500.0, 530.0, 687.0, 1155.0], [10690.0, 6143.0, 4450.0, 3120.0, 2302.0, 1740.0, 1432.0, 1151.0, 1014.0, 859.0, 779.0, 688.0, 709.0, 564.0, 590.0, 560.0, 528.0, 520.0, 474.0, 450.0, 447.0, 444.0, 421.0, 433.0, 395.0, 404.0, 352.0, 387.0, 394.0, 372.0, 391.0, 363.0, 340.0, 369.0, 343.0, 374.0, 369.0, 387.0, 320.0, 356.0, 382.0, 354.0, 418.0, 406.0, 422.0, 479.0, 492.0, 655.0, 1066.0], [10235.0, 6259.0, 4637.0, 3557.0, 2604.0, 1926.0, 1613.0, 1278.0, 1071.0, 948.0, 789.0, 785.0, 682.0, 652.0, 596.0, 552.0, 481.0, 512.0, 446.0, 472.0, 451.0, 439.0, 406.0, 434.0, 394.0, 429.0, 388.0, 397.0, 364.0, 331.0, 360.0, 347.0, 355.0, 346.0, 335.0, 338.0, 342.0, 329.0, 347.0, 344.0, 369.0, 357.0, 349.0, 400.0, 427.0, 421.0, 494.0, 594.0, 970.0], [9815.0, 6240.0, 4773.0, 3563.0, 2842.0, 2265.0, 1817.0, 1479.0, 1226.0, 1071.0, 934.0, 793.0, 762.0, 644.0, 611.0, 532.0, 531.0, 479.0, 476.0, 484.0, 428.0, 411.0, 442.0, 409.0, 418.0, 376.0, 407.0, 363.0, 352.0, 343.0, 361.0, 356.0, 389.0, 359.0, 358.0, 323.0, 362.0, 338.0, 327.0, 329.0, 322.0, 354.0, 398.0, 370.0, 403.0, 431.0, 454.0, 547.0, 845.0], [9449.0, 5915.0, 4817.0, 3715.0, 2898.0, 2420.0, 2009.0, 1680.0, 1367.0, 1225.0, 955.0, 939.0, 794.0, 737.0, 636.0, 583.0, 562.0, 526.0, 482.0, 458.0, 430.0, 424.0, 407.0, 450.0, 400.0, 358.0, 366.0, 414.0, 373.0, 374.0, 352.0, 372.0, 340.0, 326.0, 338.0, 316.0, 340.0, 341.0, 310.0, 329.0, 346.0, 358.0, 354.0, 395.0, 395.0, 375.0, 423.0, 498.0, 799.0], [9133.0, 5920.0, 4569.0, 3718.0, 2968.0, 2460.0, 2078.0, 1751.0, 1546.0, 1330.0, 1176.0, 1045.0, 939.0, 810.0, 743.0, 634.0, 629.0, 546.0, 508.0, 475.0, 493.0, 459.0, 422.0, 359.0, 372.0, 373.0, 400.0, 354.0, 362.0, 369.0, 340.0, 356.0, 346.0, 373.0, 363.0, 327.0, 331.0, 311.0, 330.0, 327.0, 338.0, 371.0, 327.0, 305.0, 356.0, 399.0, 404.0, 463.0, 746.0], [8672.0, 5675.0, 4570.0, 3515.0, 3023.0, 2529.0, 2157.0, 1819.0, 1729.0, 1469.0, 1223.0, 1144.0, 1030.0, 886.0, 798.0, 719.0, 671.0, 623.0, 590.0, 545.0, 457.0, 482.0, 434.0, 402.0, 417.0, 400.0, 387.0, 368.0, 388.0, 356.0, 378.0, 338.0, 294.0, 329.0, 308.0, 312.0, 343.0, 352.0, 298.0, 346.0, 295.0, 336.0, 326.0, 336.0, 388.0, 393.0, 383.0, 481.0, 729.0], [8648.0, 5584.0, 4412.0, 3505.0, 2974.0, 2537.0, 2229.0, 1924.0, 1644.0, 1455.0, 1374.0, 1247.0, 1103.0, 943.0, 894.0, 768.0, 698.0, 669.0, 587.0, 587.0, 536.0, 520.0, 504.0, 445.0, 449.0, 438.0, 388.0, 393.0, 321.0, 363.0, 337.0, 348.0, 358.0, 322.0, 335.0, 316.0, 306.0, 327.0, 304.0, 352.0, 329.0, 334.0, 350.0, 334.0, 362.0, 360.0, 396.0, 451.0, 675.0], [8382.0, 5298.0, 4400.0, 3578.0, 2968.0, 2541.0, 2281.0, 1918.0, 1646.0, 1491.0, 1379.0, 1242.0, 1148.0, 1073.0, 973.0, 893.0, 768.0, 713.0, 637.0, 671.0, 613.0, 526.0, 563.0, 460.0, 441.0, 392.0, 432.0, 392.0, 358.0, 383.0, 357.0, 348.0, 318.0, 336.0, 337.0, 340.0, 330.0, 320.0, 303.0, 339.0, 311.0, 291.0, 323.0, 317.0, 345.0, 334.0, 367.0, 415.0, 673.0], [8158.0, 5471.0, 4357.0, 3644.0, 2997.0, 2522.0, 2210.0, 1920.0, 1704.0, 1546.0, 1433.0, 1302.0, 1199.0, 1016.0, 959.0, 901.0, 857.0, 776.0, 706.0, 685.0, 645.0, 603.0, 566.0, 487.0, 473.0, 463.0, 439.0, 411.0, 399.0, 384.0, 386.0, 342.0, 332.0, 391.0, 311.0, 348.0, 317.0, 332.0, 345.0, 329.0, 312.0, 351.0, 324.0, 340.0, 309.0, 357.0, 358.0, 395.0, 609.0], [7846.0, 5157.0, 4078.0, 3450.0, 2840.0, 2525.0, 2216.0, 1983.0, 1793.0, 1543.0, 1485.0, 1320.0, 1295.0, 1072.0, 1054.0, 966.0, 858.0, 772.0, 780.0, 787.0, 719.0, 632.0, 603.0, 617.0, 535.0, 512.0, 517.0, 510.0, 461.0, 425.0, 377.0, 402.0, 378.0, 363.0, 308.0, 319.0, 356.0, 351.0, 319.0, 345.0, 302.0, 332.0, 287.0, 330.0, 302.0, 299.0, 336.0, 394.0, 555.0], [7811.0, 5103.0, 4218.0, 3356.0, 2904.0, 2517.0, 2203.0, 1882.0, 1785.0, 1547.0, 1415.0, 1324.0, 1185.0, 1097.0, 1009.0, 1000.0, 952.0, 826.0, 789.0, 764.0, 761.0, 703.0, 657.0, 605.0, 607.0, 529.0, 578.0, 515.0, 547.0, 439.0, 445.0, 428.0, 411.0, 419.0, 376.0, 371.0, 358.0, 345.0, 359.0, 328.0, 348.0, 294.0, 329.0, 310.0, 340.0, 324.0, 358.0, 354.0, 578.0], [7787.0, 4880.0, 3822.0, 3177.0, 2790.0, 2375.0, 2235.0, 1885.0, 1715.0, 1523.0, 1428.0, 1298.0, 1256.0, 1052.0, 1080.0, 1035.0, 951.0, 866.0, 824.0, 852.0, 778.0, 749.0, 755.0, 682.0, 663.0, 602.0, 618.0, 566.0, 551.0, 487.0, 475.0, 472.0, 476.0, 448.0, 411.0, 417.0, 347.0, 392.0, 356.0, 330.0, 356.0, 308.0, 338.0, 287.0, 294.0, 307.0, 340.0, 408.0, 519.0], [7523.0, 4560.0, 3782.0, 3180.0, 2722.0, 2437.0, 2140.0, 2014.0, 1737.0, 1746.0, 1550.0, 1381.0, 1297.0, 1192.0, 1072.0, 1013.0, 1012.0, 875.0, 839.0, 750.0, 776.0, 739.0, 706.0, 665.0, 671.0, 615.0, 621.0, 603.0, 594.0, 575.0, 534.0, 512.0, 524.0, 496.0, 478.0, 471.0, 422.0, 402.0, 438.0, 413.0, 388.0, 376.0, 364.0, 344.0, 346.0, 334.0, 343.0, 344.0, 496.0], [6805.0, 4557.0, 3513.0, 3019.0, 2619.0, 2220.0, 2189.0, 1892.0, 1776.0, 1629.0, 1552.0, 1457.0, 1305.0, 1143.0, 1122.0, 1063.0, 1020.0, 930.0, 965.0, 896.0, 818.0, 848.0, 733.0, 733.0, 726.0, 696.0, 638.0, 631.0, 647.0, 627.0, 618.0, 591.0, 572.0, 548.0, 528.0, 542.0, 520.0, 506.0, 511.0, 451.0, 449.0, 455.0, 400.0, 413.0, 365.0, 405.0, 388.0, 377.0, 514.0], [7097.0, 4483.0, 3475.0, 2888.0, 2495.0, 2229.0, 1911.0, 1785.0, 1724.0, 1533.0, 1405.0, 1299.0, 1236.0, 1185.0, 1110.0, 1041.0, 997.0, 942.0, 943.0, 834.0, 815.0, 779.0, 796.0, 761.0, 709.0, 636.0, 671.0, 656.0, 613.0, 620.0, 586.0, 565.0, 609.0, 567.0, 579.0, 566.0, 545.0, 583.0, 535.0, 535.0, 569.0, 518.0, 483.0, 489.0, 447.0, 418.0, 448.0, 393.0, 546.0], [6739.0, 4177.0, 3232.0, 2708.0, 2458.0, 2144.0, 1918.0, 1695.0, 1710.0, 1562.0, 1486.0, 1325.0, 1236.0, 1171.0, 1128.0, 1057.0, 1073.0, 972.0, 991.0, 899.0, 894.0, 812.0, 817.0, 764.0, 783.0, 755.0, 730.0, 702.0, 639.0, 657.0, 651.0, 657.0, 596.0, 602.0, 610.0, 575.0, 573.0, 564.0, 522.0, 563.0, 574.0, 567.0, 564.0, 541.0, 543.0, 532.0, 501.0, 465.0, 573.0], [6456.0, 4065.0, 3159.0, 2740.0, 2439.0, 2169.0, 2088.0, 1734.0, 1662.0, 1519.0, 1403.0, 1291.0, 1221.0, 1156.0, 1123.0, 1076.0, 967.0, 924.0, 836.0, 814.0, 826.0, 818.0, 791.0, 809.0, 759.0, 705.0, 722.0, 731.0, 652.0, 632.0, 661.0, 611.0, 632.0, 646.0, 647.0, 639.0, 617.0, 652.0, 592.0, 618.0, 650.0, 621.0, 651.0, 632.0, 640.0, 651.0, 588.0, 565.0, 660.0], [6323.0, 3942.0, 3058.0, 2657.0, 2365.0, 1939.0, 1777.0, 1592.0, 1424.0, 1382.0, 1308.0, 1267.0, 1274.0, 1132.0, 1078.0, 1010.0, 931.0, 911.0, 874.0, 867.0, 804.0, 769.0, 752.0, 818.0, 698.0, 692.0, 709.0, 656.0, 686.0, 611.0, 660.0, 688.0, 620.0, 621.0, 583.0, 627.0, 628.0, 621.0, 700.0, 694.0, 686.0, 755.0, 785.0, 822.0, 819.0, 797.0, 888.0, 881.0, 889.0], [6411.0, 3798.0, 3020.0, 2380.0, 2070.0, 2022.0, 1957.0, 1598.0, 1516.0, 1488.0, 1389.0, 1390.0, 1252.0, 1267.0, 1056.0, 1014.0, 943.0, 986.0, 1004.0, 926.0, 864.0, 767.0, 761.0, 800.0, 702.0, 689.0, 590.0, 590.0, 581.0, 559.0, 578.0, 591.0, 608.0, 579.0, 566.0, 640.0, 546.0, 563.0, 665.0, 670.0, 675.0, 657.0, 751.0, 786.0, 830.0, 857.0, 914.0, 947.0, 1080.0], [6078.0, 3664.0, 3033.0, 2460.0, 2184.0, 1913.0, 1692.0, 1487.0, 1428.0, 1412.0, 1313.0, 1296.0, 1104.0, 1059.0, 1049.0, 922.0, 887.0, 904.0, 821.0, 829.0, 788.0, 744.0, 805.0, 760.0, 762.0, 756.0, 749.0, 654.0, 677.0, 612.0, 554.0, 618.0, 597.0, 597.0, 638.0, 582.0, 595.0, 571.0, 598.0, 622.0, 606.0, 675.0, 656.0, 789.0, 893.0, 932.0, 1149.0, 1213.0, 1535.0], [5966.0, 3599.0, 2856.0, 2408.0, 1829.0, 1654.0, 1501.0, 1619.0, 1454.0, 1354.0, 1268.0, 1226.0, 1151.0, 1027.0, 941.0, 914.0, 1027.0, 848.0, 872.0, 754.0, 708.0, 795.0, 865.0, 711.0, 794.0, 789.0, 746.0, 723.0, 695.0, 667.0, 569.0, 571.0, 596.0, 612.0, 509.0, 621.0, 589.0, 537.0, 553.0, 639.0, 618.0, 640.0, 670.0, 772.0, 887.0, 983.0, 1208.0, 1533.0, 1852.0], [6186.0, 3592.0, 2531.0, 2503.0, 1993.0, 1788.0, 1719.0, 1611.0, 1469.0, 1287.0, 1128.0, 1176.0, 1165.0, 1118.0, 916.0, 976.0, 874.0, 789.0, 832.0, 780.0, 687.0, 705.0, 768.0, 746.0, 746.0, 702.0, 758.0, 620.0, 633.0, 578.0, 512.0, 555.0, 597.0, 510.0, 555.0, 575.0, 497.0, 549.0, 488.0, 630.0, 604.0, 655.0, 622.0, 657.0, 821.0, 929.0, 1145.0, 1501.0, 2032.0], [5828.0, 3708.0, 2572.0, 2174.0, 2146.0, 1658.0, 1563.0, 1544.0, 1449.0, 1127.0, 1274.0, 1241.0, 1100.0, 1210.0, 994.0, 978.0, 816.0, 936.0, 906.0, 881.0, 786.0, 852.0, 784.0, 709.0, 770.0, 726.0, 598.0, 566.0, 639.0, 614.0, 588.0, 646.0, 626.0, 595.0, 574.0, 524.0, 493.0, 512.0, 567.0, 568.0, 557.0, 555.0, 582.0, 584.0, 620.0, 888.0, 1058.0, 1354.0, 2062.0], [5969.0, 3781.0, 2553.0, 2246.0, 1877.0, 1610.0, 1644.0, 1679.0, 1455.0, 1258.0, 1345.0, 1072.0, 1307.0, 1145.0, 951.0, 857.0, 844.0, 883.0, 886.0, 859.0, 755.0, 655.0, 645.0, 720.0, 666.0, 629.0, 775.0, 723.0, 666.0, 567.0, 609.0, 624.0, 647.0, 530.0, 606.0, 625.0, 528.0, 564.0, 513.0, 576.0, 519.0, 581.0, 476.0, 559.0, 515.0, 646.0, 865.0, 1144.0, 1950.0], [5888.0, 3630.0, 2824.0, 2232.0, 1939.0, 1650.0, 1571.0, 1573.0, 1651.0, 1222.0, 1230.0, 1478.0, 1117.0, 938.0, 1119.0, 1022.0, 787.0, 801.0, 845.0, 780.0, 751.0, 735.0, 685.0, 521.0, 698.0, 607.0, 646.0, 700.0, 682.0, 581.0, 550.0, 629.0, 643.0, 549.0, 552.0, 531.0, 523.0, 445.0, 514.0, 448.0, 398.0, 542.0, 569.0, 548.0, 536.0, 681.0, 845.0, 1036.0, 1811.0], [6002.0, 3623.0, 2685.0, 2273.0, 1815.0, 1671.0, 1628.0, 1466.0, 1428.0, 1353.0, 1372.0, 1097.0, 1087.0, 1153.0, 1029.0, 870.0, 879.0, 1053.0, 975.0, 931.0, 895.0, 787.0, 853.0, 670.0, 699.0, 679.0, 633.0, 719.0, 733.0, 677.0, 518.0, 537.0, 495.0, 496.0, 446.0, 582.0, 490.0, 568.0, 549.0, 557.0, 478.0, 488.0, 439.0, 475.0, 405.0, 554.0, 716.0, 909.0, 1615.0], [6166.0, 3749.0, 2872.0, 2311.0, 1991.0, 1809.0, 1782.0, 1420.0, 1537.0, 1265.0, 1147.0, 1137.0, 1060.0, 1159.0, 929.0, 1008.0, 983.0, 838.0, 744.0, 770.0, 839.0, 728.0, 727.0, 744.0, 654.0, 683.0, 657.0, 563.0, 498.0, 529.0, 586.0, 621.0, 500.0, 487.0, 542.0, 551.0, 536.0, 487.0, 446.0, 512.0, 392.0, 414.0, 452.0, 610.0, 531.0, 390.0, 563.0, 794.0, 1500.0], [6225.0, 3647.0, 2765.0, 2210.0, 2007.0, 1932.0, 1902.0, 1635.0, 1500.0, 1291.0, 1222.0, 1146.0, 1258.0, 1199.0, 1136.0, 1087.0, 964.0, 835.0, 832.0, 701.0, 882.0, 746.0, 888.0, 737.0, 722.0, 535.0, 637.0, 638.0, 626.0, 605.0, 536.0, 660.0, 499.0, 488.0, 468.0, 475.0, 484.0, 556.0, 484.0, 521.0, 609.0, 621.0, 545.0, 450.0, 433.0, 428.0, 622.0, 694.0, 1131.0]],
    "Name": "sCurve-0",
    "Overflow": 2552180.0,
    "Type": "Histo2d",
    "Underflow": 0.0,
    "x": {
        "AxisTitle": "Vcal",
        "Bins": 51,
        "High": 302.5,
        "Low": 47.5
    },
    "y": {
        "AxisTitle": "Occupancy",
        "Bins": 49,
        "High": 49.5,
        "Low": 0.5
    },
    "z": {
        "AxisTitle": "Number of pixels"
    }
}