{
    "Data": [0.0, 0.0, 0.0, 0.0, 0.0, 0.0, 0.0, 0.0, 0.0, 0.0, 0.0, 0.0, 0.0, 0.0, 0.0, 0.0, 1.0, 2.0, 10.0, 5.0, 2.0, 1.0, 11.0, 20.0, 31.0, 30.0, 35.0, 16.0, 46.0, 2.0, 49.0, 15.0, 50.0, 16.0, 50.0, 27.0, 50.0, 13.0, 50.0, 7.0, 50.0, 26.0, 48.0, 50.0, 50.0, 50.0, 8.0, 50.0, 50.0, 14.0, 50.0],
    "Name": "Scurve-70-96",
    "Overflow": 0.0,
    "Type": "Histo1d",
    "Underflow": 0.0,
    "x": {
        "AxisTitle": "Vcal",
        "Bins": 51,
        "High": 302.5,
        "Low": 47.5
    },
    "y": {
        "AxisTitle": "Occupancy"
    },
    "z": {
        "AxisTitle": "z"
    }
}