time,Hardware,Voltage,Current
1621609646471,high-voltage,1,0.134385
time,Hardware,Voltage,Current
1621609646471,high-voltage,2,0.229273
time,Hardware,Voltage,Current
1621609646471,high-voltage,3,0.361482
time,Hardware,Voltage,Current
1621609646471,high-voltage,4,0.530821
time,Hardware,Voltage,Current
1621609646471,high-voltage,5,0.779436
time,Hardware,Voltage,Current
1621609646471,high-voltage,6,1.0895
time,Hardware,Voltage,Current
1621609646471,high-voltage,7,1.43187
time,Hardware,Voltage,Current
1621609646471,high-voltage,8,1.85102
time,Hardware,Voltage,Current
1621609646471,high-voltage,9,2.34348
time,Hardware,Voltage,Current
1621609646471,high-voltage,10,2.9339
time,Hardware,Voltage,Current
1621609646471,high-voltage,11,3.67239
time,Hardware,Voltage,Current
1621609646471,high-voltage,12,4.62659
time,Hardware,Voltage,Current
1621609646471,high-voltage,13,5.6241
time,Hardware,Voltage,Current
1621609646471,high-voltage,14,6.57435
time,Hardware,Voltage,Current
1621609646471,high-voltage,15,7.73863
time,Hardware,Voltage,Current
1621609646471,high-voltage,16,8.73705
time,Hardware,Voltage,Current
1621609646471,high-voltage,17,9.46339
time,Hardware,Voltage,Current
1621609646471,high-voltage,18,10.0001
