{
    "Data": [0.0, 0.0, 0.0, 0.0, 0.0, 0.0, 0.0, 0.0, 0.0, 0.0, 0.0, 2.0, 0.0, 5.0, 26.0, 19.0, 4.0, 49.0, 435.0, 284.0, 71.0, 274.0, 1620.0, 2302.0, 405.0, 604.0, 2215.0, 2814.0, 786.0, 906.0, 2099.0, 2423.0, 1076.0, 959.0, 1453.0, 1415.0, 789.0, 776.0, 1171.0, 1575.0, 1227.0, 824.0, 911.0, 1296.0, 1406.0, 1143.0, 998.0, 1204.0, 1663.0, 1678.0, 1228.0, 1049.0, 1104.0, 1248.0, 1016.0, 970.0, 844.0, 989.0, 922.0, 877.0, 750.0, 728.0, 695.0, 506.0, 504.0, 513.0, 437.0, 442.0, 398.0, 347.0, 335.0, 394.0, 334.0, 269.0, 243.0, 238.0, 232.0, 211.0, 185.0, 147.0, 166.0, 160.0, 143.0, 94.0, 85.0, 84.0, 75.0, 70.0, 44.0, 57.0, 46.0, 47.0, 39.0, 31.0, 36.0, 36.0, 35.0, 27.0, 21.0, 21.0, 30.0, 23.0, 19.0, 17.0, 14.0, 12.0, 9.0, 12.0, 8.0, 9.0, 9.0, 8.0, 13.0, 4.0, 4.0, 5.0, 8.0, 5.0, 8.0, 3.0, 7.0, 4.0, 5.0, 4.0, 3.0, 7.0, 4.0, 3.0, 3.0, 3.0, 7.0, 3.0, 3.0, 2.0, 1.0, 0.0, 1.0, 2.0, 3.0, 1.0, 2.0, 4.0, 3.0, 2.0, 1.0, 0.0, 2.0, 0.0, 3.0, 1.0, 2.0, 1.0, 1.0, 2.0, 0.0, 0.0, 2.0, 1.0, 1.0, 2.0, 0.0, 1.0, 1.0, 2.0, 0.0, 0.0, 1.0, 1.0, 2.0, 1.0, 0.0, 0.0, 0.0, 2.0, 1.0, 1.0, 0.0, 1.0, 1.0, 0.0, 0.0, 1.0, 1.0, 0.0, 0.0, 0.0, 0.0, 0.0, 2.0, 0.0, 0.0, 0.0, 0.0, 0.0, 1.0, 1.0, 0.0, 2.0, 0.0, 0.0, 1.0],
    "Name": "TimePerFitDist-0",
    "Overflow": 92.0,
    "Type": "Histo1d",
    "Underflow": 0.0,
    "x": {
        "AxisTitle": "Fit Time [us]",
        "Bins": 201,
        "High": 401.0,
        "Low": -1.0
    },
    "y": {
        "AxisTitle": "Number of Pixels"
    },
    "z": {
        "AxisTitle": "z"
    }
}