{
    "Data": [7.0, 9.0, 6.0, 2.0, 10.0, 5.0, 6.0, 4.0, 6.0, 6.0, 11.0, 8.0, 11.0, 13.0, 18.0, 21.0, 20.0, 25.0, 25.0, 33.0, 44.0, 42.0, 58.0, 56.0, 68.0, 96.0, 97.0, 123.0, 144.0, 174.0, 222.0, 259.0, 284.0, 355.0, 448.0, 485.0, 681.0, 844.0, 1320.0, 1966.0, 2785.0, 3558.0, 4030.0, 4380.0, 4146.0, 3884.0, 3438.0, 2531.0, 2048.0, 1584.0, 1310.0, 1132.0, 1029.0, 927.0, 860.0, 809.0, 675.0, 612.0, 532.0, 510.0, 449.0, 373.0, 313.0, 280.0, 234.0, 160.0, 171.0, 136.0, 102.0, 102.0, 90.0, 65.0, 54.0, 45.0, 44.0, 35.0, 37.0, 37.0, 30.0, 26.0, 22.0, 29.0, 14.0, 24.0, 12.0, 16.0, 16.0, 14.0, 16.0, 19.0, 18.0],
    "Name": "ThresholdDist-0",
    "Overflow": 281.0,
    "Type": "Histo1d",
    "Underflow": 9.0,
    "x": {
        "AxisTitle": "Threshold [e]",
        "Bins": 91,
        "High": 1425.0,
        "Low": 515.0
    },
    "y": {
        "AxisTitle": "Number of Pixels"
    },
    "z": {
        "AxisTitle": "z"
    }
}