time,Hardware,Voltage,Current
1626354821763,high-voltage-3,1,0.00427405
time,Hardware,Voltage,Current
1626354821763,high-voltage-3,2,0.00689078
time,Hardware,Voltage,Current
1626354821763,high-voltage-3,3,0.00922955
time,Hardware,Voltage,Current
1626354821763,high-voltage-3,4,0.00903425
time,Hardware,Voltage,Current
1626354821763,high-voltage-3,5,0.0113591
time,Hardware,Voltage,Current
1626354821763,high-voltage-3,6,0.0133139
time,Hardware,Voltage,Current
1626354821763,high-voltage-3,7,0.0151053
time,Hardware,Voltage,Current
1626354821763,high-voltage-3,8,0.0162211
time,Hardware,Voltage,Current
1626354821763,high-voltage-3,9,0.0181619
time,Hardware,Voltage,Current
1626354821763,high-voltage-3,10,0.019938
time,Hardware,Voltage,Current
1626354821763,high-voltage-3,11,0.0212944
time,Hardware,Voltage,Current
1626354821763,high-voltage-3,12,0.0219201
time,Hardware,Voltage,Current
1626354821763,high-voltage-3,13,0.0239881
time,Hardware,Voltage,Current
1626354821763,high-voltage-3,14,0.0255587
time,Hardware,Voltage,Current
1626354821763,high-voltage-3,15,0.0271387
time,Hardware,Voltage,Current
1626354821763,high-voltage-3,16,0.0275241
time,Hardware,Voltage,Current
1626354821763,high-voltage-3,17,0.0285126
time,Hardware,Voltage,Current
1626354821763,high-voltage-3,18,0.0308311
time,Hardware,Voltage,Current
1626354821763,high-voltage-3,19,0.0315208
time,Hardware,Voltage,Current
1626354821763,high-voltage-3,20,0.031908
time,Hardware,Voltage,Current
1626354821763,high-voltage-3,25,0.0383837
time,Hardware,Voltage,Current
1626354821763,high-voltage-3,30,0.0443397
time,Hardware,Voltage,Current
1626354821763,high-voltage-3,35,0.0512802
time,Hardware,Voltage,Current
1626354821763,high-voltage-3,40,0.0561574
time,Hardware,Voltage,Current
1626354821763,high-voltage-3,45,0.0613907
time,Hardware,Voltage,Current
1626354821763,high-voltage-3,50,0.0670691
time,Hardware,Voltage,Current
1626354821763,high-voltage-3,55,0.0720692
time,Hardware,Voltage,Current
1626354821763,high-voltage-3,60,0.0761235
time,Hardware,Voltage,Current
1626354821763,high-voltage-3,65,0.0808675
time,Hardware,Voltage,Current
1626354821763,high-voltage-3,70,0.0852574
time,Hardware,Voltage,Current
1626354821763,high-voltage-3,75,0.0906581
time,Hardware,Voltage,Current
1626354821763,high-voltage-3,80,0.094533
time,Hardware,Voltage,Current
1626354821763,high-voltage-3,85,0.101768
time,Hardware,Voltage,Current
1626354821763,high-voltage-3,90,0.108679
time,Hardware,Voltage,Current
1626354821763,high-voltage-3,95,0.115166
time,Hardware,Voltage,Current
1626354821763,high-voltage-3,100,0.121124
