time,Hardware,Voltage,Current
1623349267648,high-voltage,1,0.0693119
time,Hardware,Voltage,Current
1623349267648,high-voltage,2,0.0884363
time,Hardware,Voltage,Current
1623349267648,high-voltage,3,0.106901
time,Hardware,Voltage,Current
1623349267648,high-voltage,4,0.120594
time,Hardware,Voltage,Current
1623349267648,high-voltage,5,0.131635
time,Hardware,Voltage,Current
1623349267648,high-voltage,6,0.141458
time,Hardware,Voltage,Current
1623349267648,high-voltage,7,0.150747
time,Hardware,Voltage,Current
1623349267648,high-voltage,8,0.158059
time,Hardware,Voltage,Current
1623349267648,high-voltage,9,0.164036
time,Hardware,Voltage,Current
1623349267648,high-voltage,10,0.170111
time,Hardware,Voltage,Current
1623349267648,high-voltage,11,0.175723
time,Hardware,Voltage,Current
1623349267648,high-voltage,12,0.181011
time,Hardware,Voltage,Current
1623349267648,high-voltage,13,0.184875
time,Hardware,Voltage,Current
1623349267648,high-voltage,14,0.188783
time,Hardware,Voltage,Current
1623349267648,high-voltage,15,0.193797
time,Hardware,Voltage,Current
1623349267648,high-voltage,16,0.198304
time,Hardware,Voltage,Current
1623349267648,high-voltage,17,0.202285
time,Hardware,Voltage,Current
1623349267648,high-voltage,18,0.206465
time,Hardware,Voltage,Current
1623349267648,high-voltage,19,0.210172
time,Hardware,Voltage,Current
1623349267648,high-voltage,20,0.21483
time,Hardware,Voltage,Current
1623349267648,high-voltage,25,0.235682
time,Hardware,Voltage,Current
1623349267648,high-voltage,30,0.268753
time,Hardware,Voltage,Current
1623349267648,high-voltage,35,0.366756
time,Hardware,Voltage,Current
1623349267648,high-voltage,40,0.629773
time,Hardware,Voltage,Current
1623349267648,high-voltage,45,1.06801
time,Hardware,Voltage,Current
1623349267648,high-voltage,50,1.63214
time,Hardware,Voltage,Current
1623349267648,high-voltage,55,2.31133
time,Hardware,Voltage,Current
1623349267648,high-voltage,60,3.10102
time,Hardware,Voltage,Current
1623349267648,high-voltage,65,4.01311
time,Hardware,Voltage,Current
1623349267648,high-voltage,70,5.04594
time,Hardware,Voltage,Current
1623349267648,high-voltage,75,6.21756
time,Hardware,Voltage,Current
1623349267648,high-voltage,80,7.53468
time,Hardware,Voltage,Current
1623349267648,high-voltage,85,9.03487
time,Hardware,Voltage,Current
1623349267648,high-voltage,90,10
