{
    "Data": [8.0, 11.0, 2.0, 1.0, 4.0, 6.0, 14.0, 39.0, 112.0, 302.0, 817.0, 1636.0, 2861.0, 4111.0, 4542.0, 4207.0, 3391.0, 2606.0, 2468.0, 2685.0, 3532.0, 4330.0, 4660.0, 4561.0, 4057.0, 3282.0, 2466.0, 1926.0, 1521.0, 1283.0, 1141.0, 1066.0, 1033.0, 969.0, 1005.0, 932.0, 940.0, 879.0, 886.0, 778.0, 757.0, 650.0, 575.0, 529.0, 427.0, 379.0, 297.0, 296.0, 222.0, 159.0, 142.0, 125.0, 79.0, 77.0, 56.0, 60.0, 35.0, 38.0, 30.0, 16.0, 22.0, 13.0, 16.0, 15.0, 15.0, 7.0, 7.0, 7.0, 12.0],
    "Name": "NoiseDist-0",
    "Overflow": 127.0,
    "Type": "Histo1d",
    "Underflow": 0.0,
    "x": {
        "AxisTitle": "Noise [e]",
        "Bins": 69,
        "High": 346.0,
        "Low": -2.0
    },
    "y": {
        "AxisTitle": "Number of Pixels"
    },
    "z": {
        "AxisTitle": "z"
    }
}