time,Hardware,Voltage,Current
1621470411174,high-voltage-2,1,0.375876
time,Hardware,Voltage,Current
1621470411174,high-voltage-2,2,0.461245
time,Hardware,Voltage,Current
1621470411174,high-voltage-2,3,0.528123
time,Hardware,Voltage,Current
1621470411174,high-voltage-2,4,0.576579
time,Hardware,Voltage,Current
1621470411174,high-voltage-2,5,0.616918
time,Hardware,Voltage,Current
1621470411174,high-voltage-2,6,0.647547
time,Hardware,Voltage,Current
1621470411174,high-voltage-2,7,0.671612
time,Hardware,Voltage,Current
1621470411174,high-voltage-2,8,0.697762
time,Hardware,Voltage,Current
1621470411174,high-voltage-2,9,0.718418
time,Hardware,Voltage,Current
1621470411174,high-voltage-2,10,0.736037
time,Hardware,Voltage,Current
1621470411174,high-voltage-2,11,0.755402
time,Hardware,Voltage,Current
1621470411174,high-voltage-2,12,0.772546
time,Hardware,Voltage,Current
1621470411174,high-voltage-2,13,0.793161
time,Hardware,Voltage,Current
1621470411174,high-voltage-2,14,0.808876
time,Hardware,Voltage,Current
1621470411174,high-voltage-2,15,0.824152
time,Hardware,Voltage,Current
1621470411174,high-voltage-2,16,0.840801
time,Hardware,Voltage,Current
1621470411174,high-voltage-2,17,0.858073
time,Hardware,Voltage,Current
1621470411174,high-voltage-2,18,0.872188
time,Hardware,Voltage,Current
1621470411174,high-voltage-2,19,0.88759
time,Hardware,Voltage,Current
1621470411174,high-voltage-2,20,2e+07
time,Hardware,Voltage,Current
1621470411174,high-voltage-2,25,0.97734
time,Hardware,Voltage,Current
1621470411174,high-voltage-2,30,1.05216
time,Hardware,Voltage,Current
1621470411174,high-voltage-2,35,1.13082
time,Hardware,Voltage,Current
1621470411174,high-voltage-2,40,1.22381
time,Hardware,Voltage,Current
1621470411174,high-voltage-2,1.33976e-06,1.34015
time,Hardware,Voltage,Current
1621470411174,high-voltage-2,50,1.41699
time,Hardware,Voltage,Current
1621470411174,high-voltage-2,55,1.48602
time,Hardware,Voltage,Current
1621470411174,high-voltage-2,60,1.55352
time,Hardware,Voltage,Current
1621470411174,high-voltage-2,65,1.61898
time,Hardware,Voltage,Current
1621470411174,high-voltage-2,70,1.68129
time,Hardware,Voltage,Current
1621470411174,high-voltage-2,75,1.74634
time,Hardware,Voltage,Current
1621470411174,high-voltage-2,80,1.80816
time,Hardware,Voltage,Current
1621470411174,high-voltage-2,85,1.87195
time,Hardware,Voltage,Current
1621470411174,high-voltage-2,90,1.93418
time,Hardware,Voltage,Current
1621470411174,high-voltage-2,95,1.99704
time,Hardware,Voltage,Current
1621470411174,high-voltage-2,100,2.05867
