time,Hardware,Voltage,Current
1623359493842,high-voltage,1,0.0261325
time,Hardware,Voltage,Current
1623359493842,high-voltage,2,0.0327917
time,Hardware,Voltage,Current
1623359493842,high-voltage,3,0.0382513
time,Hardware,Voltage,Current
1623359493842,high-voltage,4,0.0427989
time,Hardware,Voltage,Current
1623359493842,high-voltage,5,0.046996
time,Hardware,Voltage,Current
1623359493842,high-voltage,6,0.0502777
time,Hardware,Voltage,Current
1623359493842,high-voltage,7,0.0544063
time,Hardware,Voltage,Current
1623359493842,high-voltage,8,0.0591696
time,Hardware,Voltage,Current
1623359493842,high-voltage,9,0.0635291
time,Hardware,Voltage,Current
1623359493842,high-voltage,10,0.0685191
time,Hardware,Voltage,Current
1623359493842,high-voltage,11,0.073974
time,Hardware,Voltage,Current
1623359493842,high-voltage,12,0.0797579
time,Hardware,Voltage,Current
1623359493842,high-voltage,13,0.0838994
time,Hardware,Voltage,Current
1623359493842,high-voltage,14,0.0891677
time,Hardware,Voltage,Current
1623359493842,high-voltage,15,0.0918127
time,Hardware,Voltage,Current
1623359493842,high-voltage,16,0.0956375
time,Hardware,Voltage,Current
1623359493842,high-voltage,17,0.0984343
time,Hardware,Voltage,Current
1623359493842,high-voltage,18,0.101233
time,Hardware,Voltage,Current
1623359493842,high-voltage,19,0.104198
time,Hardware,Voltage,Current
1623359493842,high-voltage,20,0.107328
time,Hardware,Voltage,Current
1623359493842,high-voltage,25,0.118866
time,Hardware,Voltage,Current
1623359493842,high-voltage,30,0.132195
time,Hardware,Voltage,Current
1623359493842,high-voltage,35,0.16264
time,Hardware,Voltage,Current
1623359493842,high-voltage,40,0.282097
time,Hardware,Voltage,Current
1623359493842,high-voltage,45,0.603586
time,Hardware,Voltage,Current
1623359493842,high-voltage,50,1.13133
time,Hardware,Voltage,Current
1623359493842,high-voltage,55,1.83128
time,Hardware,Voltage,Current
1623359493842,high-voltage,2.70458e-06,2.71211
time,Hardware,Voltage,Current
1623359493842,high-voltage,65,3.70858
time,Hardware,Voltage,Current
1623359493842,high-voltage,70,4.90938
time,Hardware,Voltage,Current
1623359493842,high-voltage,75,6.17448
time,Hardware,Voltage,Current
1623359493842,high-voltage,80,7.63133
time,Hardware,Voltage,Current
1623359493842,high-voltage,85,9.19512
time,Hardware,Voltage,Current
1623359493842,high-voltage,90,10
