{
    "Data": [0.0, 0.0, 0.0, 0.0, 0.0, 0.0, 0.0, 0.0, 0.0, 0.0, 0.0, 0.0, 0.0, 0.0, 2.0, 0.0, 0.0, 17.0, 443.0, 143.0, 31.0, 659.0, 4413.0, 1938.0, 346.0, 936.0, 4047.0, 2733.0, 542.0, 798.0, 2040.0, 1714.0, 408.0, 228.0, 502.0, 538.0, 294.0, 314.0, 604.0, 624.0, 462.0, 643.0, 1439.0, 2139.0, 1499.0, 1376.0, 2022.0, 3111.0, 2994.0, 2522.0, 2186.0, 2643.0, 2632.0, 2107.0, 1928.0, 1934.0, 2178.0, 1887.0, 1653.0, 1512.0, 1544.0, 1383.0, 971.0, 776.0, 721.0, 727.0, 776.0, 540.0, 473.0, 457.0, 468.0, 406.0, 339.0, 255.0, 266.0, 256.0, 233.0, 191.0, 177.0, 168.0, 173.0, 127.0, 104.0, 125.0, 110.0, 99.0, 70.0, 70.0, 56.0, 70.0, 54.0, 41.0, 42.0, 51.0, 49.0, 40.0, 40.0, 32.0, 33.0, 29.0, 42.0, 27.0, 33.0, 17.0, 13.0, 19.0, 20.0, 24.0, 25.0, 14.0, 15.0, 16.0, 9.0, 5.0, 7.0, 8.0, 12.0, 15.0, 9.0, 11.0, 7.0, 11.0, 10.0, 4.0, 5.0, 7.0, 4.0, 4.0, 3.0, 6.0, 4.0, 2.0, 5.0, 3.0, 7.0, 3.0, 1.0, 7.0, 5.0, 9.0, 1.0, 4.0, 0.0, 1.0, 3.0, 4.0, 2.0, 1.0, 5.0, 0.0, 4.0, 1.0, 3.0, 1.0, 1.0, 1.0, 4.0, 1.0, 2.0, 0.0, 3.0, 1.0, 0.0, 1.0, 1.0, 0.0, 0.0, 0.0, 1.0, 0.0, 4.0, 1.0, 1.0, 1.0, 0.0, 1.0, 2.0, 1.0, 1.0, 0.0, 0.0, 0.0, 0.0, 1.0, 0.0, 1.0, 0.0, 0.0, 1.0, 0.0, 2.0, 0.0, 1.0, 2.0, 1.0, 2.0, 2.0, 0.0, 0.0, 1.0, 0.0],
    "Name": "TimePerFitDist-0",
    "Overflow": 166.0,
    "Type": "Histo1d",
    "Underflow": 0.0,
    "x": {
        "AxisTitle": "Fit Time [us]",
        "Bins": 201,
        "High": 401.0,
        "Low": -1.0
    },
    "y": {
        "AxisTitle": "Number of Pixels"
    },
    "z": {
        "AxisTitle": "z"
    }
}