{
    "Data": [0.0, 0.0, 0.0, 0.0, 0.0, 0.0, 0.0, 0.0, 0.0, 0.0, 0.0, 0.0, 0.0, 0.0, 0.0, 0.0, 0.0, 0.0, 0.0, 0.0, 0.0, 0.0, 0.0, 0.0, 0.0, 0.0, 0.0, 0.0, 0.0, 0.0, 0.0, 0.0, 0.0, 0.0, 0.0, 0.0, 0.0, 0.0, 0.0, 0.0, 0.0, 0.0, 0.0, 0.0, 0.0, 0.0, 0.0, 0.0, 0.0, 0.0, 6.0, 13.0, 10.0, 11.0, 12.0, 7.0, 12.0, 10.0, 12.0, 19.0, 17.0, 29.0, 35.0, 36.0, 51.0, 77.0, 70.0, 99.0, 126.0, 153.0, 184.0, 236.0, 279.0, 347.0, 426.0, 475.0, 598.0, 668.0, 783.0, 827.0, 963.0, 1056.0, 1077.0, 1153.0, 1237.0, 1233.0, 1267.0, 1337.0, 1444.0, 1555.0, 1946.0, 2271.0, 2811.0, 3572.0, 3881.0, 4086.0, 3848.0, 3068.0, 2601.0, 1772.0, 1177.0, 800.0, 513.0, 333.0, 237.0, 173.0, 116.0, 101.0, 69.0, 65.0, 50.0, 42.0, 48.0, 33.0, 36.0, 24.0, 25.0, 29.0, 26.0, 27.0, 25.0, 18.0, 21.0, 17.0, 23.0, 14.0, 15.0, 10.0, 13.0, 11.0, 7.0, 5.0, 11.0, 17.0, 11.0, 5.0, 12.0, 5.0, 9.0, 9.0, 11.0, 9.0, 5.0, 9.0, 8.0, 7.0, 11.0, 10.0, 8.0, 11.0, 13.0, 13.0, 27.0, 31.0, 22.0, 44.0, 33.0, 62.0, 70.0, 78.0, 91.0, 99.0, 106.0, 165.0, 186.0, 203.0, 238.0, 270.0, 302.0, 336.0, 375.0, 437.0, 400.0, 522.0, 501.0, 600.0, 581.0, 593.0, 600.0, 640.0, 639.0, 674.0, 722.0, 696.0, 698.0, 641.0, 627.0, 644.0, 680.0, 628.0, 599.0, 560.0, 508.0, 521.0, 491.0, 436.0, 415.0, 404.0, 385.0, 348.0, 319.0, 289.0, 261.0, 238.0, 217.0, 186.0, 178.0, 154.0, 151.0, 113.0, 114.0, 102.0, 109.0, 106.0, 108.0, 90.0, 90.0, 81.0, 78.0, 70.0, 61.0, 48.0, 60.0, 54.0, 49.0, 40.0, 52.0, 46.0, 38.0, 29.0, 32.0, 34.0, 22.0, 14.0, 14.0, 16.0, 18.0, 21.0, 13.0, 26.0, 22.0, 19.0, 13.0, 7.0, 7.0, 8.0, 10.0, 4.0, 4.0, 7.0, 5.0, 4.0, 7.0, 6.0, 8.0, 6.0, 3.0, 11.0, 8.0, 4.0, 6.0, 6.0, 1.0, 7.0, 3.0, 0.0, 0.0, 5.0, 1.0, 3.0, 1.0, 5.0, 2.0, 2.0, 1.0, 2.0, 2.0, 1.0, 0.0, 2.0, 0.0, 3.0, 2.0, 1.0, 1.0, 0.0, 0.0, 1.0, 0.0, 0.0, 1.0, 1.0, 0.0, 0.0, 0.0, 1.0, 0.0, 1.0, 0.0, 1.0, 1.0, 2.0, 0.0, 1.0, 0.0, 0.0, 1.0, 1.0, 1.0, 0.0, 0.0, 2.0, 0.0, 2.0, 0.0, 0.0, 0.0, 0.0, 0.0, 0.0, 0.0, 0.0, 0.0, 0.0, 0.0, 0.0, 0.0, 0.0, 0.0, 0.0, 0.0, 0.0, 0.0, 0.0, 0.0, 0.0, 0.0, 0.0, 0.0, 0.0, 0.0, 0.0, 0.0, 0.0, 0.0, 0.0],
    "Name": "ThresholdDist-0",
    "Overflow": 0.0,
    "Type": "Histo1d",
    "Underflow": 0.0,
    "x": {
        "AxisTitle": "Threshold [e]",
        "Bins": 346,
        "High": 3455.0,
        "Low": -5.0
    },
    "y": {
        "AxisTitle": "Number of Pixels"
    },
    "z": {
        "AxisTitle": "z"
    }
}