{
    "Data": [11.0, 4.0, 1.0, 2.0, 8.0, 5.0, 55.0, 264.0, 870.0, 2202.0, 4085.0, 5402.0, 5283.0, 4352.0, 3473.0, 3568.0, 4496.0, 5069.0, 4668.0, 3614.0, 2439.0, 1371.0, 837.0, 673.0, 730.0, 967.0, 1286.0, 1575.0, 1885.0, 2142.0, 2173.0, 2172.0, 2092.0, 1774.0, 1550.0, 1169.0, 911.0, 704.0, 544.0, 394.0, 302.0, 242.0, 164.0, 154.0, 115.0, 109.0, 97.0, 58.0, 40.0, 47.0, 42.0, 39.0, 23.0, 33.0, 32.0, 20.0, 21.0, 24.0, 18.0, 12.0, 13.0, 6.0, 9.0, 9.0, 8.0, 7.0],
    "Name": "NoiseDist-0",
    "Overflow": 118.0,
    "Type": "Histo1d",
    "Underflow": 0.0,
    "x": {
        "AxisTitle": "Noise [e]",
        "Bins": 66,
        "High": 331.0,
        "Low": -2.0
    },
    "y": {
        "AxisTitle": "Number of Pixels"
    },
    "z": {
        "AxisTitle": "z"
    }
}