{
    "Data": [[2495.0, 944.0, 489.0, 310.0, 240.0, 159.0, 101.0, 94.0, 66.0, 51.0, 38.0, 33.0, 36.0, 28.0, 19.0, 27.0, 16.0, 9.0, 16.0, 13.0, 11.0, 15.0, 13.0, 15.0, 9.0, 3.0, 9.0, 12.0, 6.0, 1.0, 10.0, 4.0, 13.0, 6.0, 8.0, 3.0, 7.0, 7.0, 4.0, 12.0, 6.0, 6.0, 8.0, 10.0, 7.0, 5.0, 11.0, 9.0, 16.0], [3701.0, 1583.0, 846.0, 519.0, 353.0, 227.0, 202.0, 137.0, 120.0, 95.0, 94.0, 62.0, 32.0, 42.0, 39.0, 32.0, 18.0, 28.0, 27.0, 21.0, 18.0, 16.0, 9.0, 12.0, 9.0, 19.0, 11.0, 14.0, 8.0, 9.0, 12.0, 12.0, 6.0, 8.0, 10.0, 5.0, 8.0, 12.0, 10.0, 5.0, 10.0, 4.0, 7.0, 13.0, 8.0, 10.0, 10.0, 9.0, 17.0], [4733.0, 2472.0, 1420.0, 929.0, 640.0, 505.0, 379.0, 286.0, 224.0, 177.0, 147.0, 140.0, 90.0, 74.0, 79.0, 73.0, 58.0, 45.0, 39.0, 38.0, 26.0, 31.0, 27.0, 11.0, 22.0, 20.0, 20.0, 15.0, 19.0, 15.0, 9.0, 13.0, 13.0, 14.0, 8.0, 9.0, 12.0, 16.0, 12.0, 2.0, 10.0, 13.0, 13.0, 13.0, 10.0, 9.0, 16.0, 12.0, 21.0], [5111.0, 2990.0, 1954.0, 1461.0, 1099.0, 888.0, 660.0, 563.0, 430.0, 353.0, 302.0, 236.0, 230.0, 177.0, 170.0, 141.0, 124.0, 119.0, 98.0, 84.0, 66.0, 76.0, 55.0, 54.0, 40.0, 20.0, 37.0, 25.0, 23.0, 28.0, 30.0, 18.0, 22.0, 24.0, 18.0, 15.0, 8.0, 17.0, 12.0, 18.0, 16.0, 19.0, 10.0, 20.0, 18.0, 15.0, 19.0, 21.0, 16.0], [5321.0, 2972.0, 2294.0, 1786.0, 1510.0, 1214.0, 1003.0, 860.0, 757.0, 640.0, 609.0, 510.0, 429.0, 414.0, 362.0, 308.0, 289.0, 276.0, 202.0, 205.0, 165.0, 150.0, 122.0, 127.0, 111.0, 103.0, 91.0, 82.0, 81.0, 58.0, 60.0, 64.0, 36.0, 41.0, 36.0, 39.0, 33.0, 25.0, 30.0, 25.0, 24.0, 34.0, 22.0, 18.0, 22.0, 22.0, 24.0, 28.0, 43.0], [8367.0, 4105.0, 2437.0, 1861.0, 1591.0, 1361.0, 1186.0, 1145.0, 988.0, 924.0, 804.0, 764.0, 745.0, 635.0, 567.0, 523.0, 480.0, 485.0, 451.0, 406.0, 364.0, 334.0, 298.0, 257.0, 240.0, 249.0, 248.0, 187.0, 191.0, 168.0, 155.0, 115.0, 125.0, 91.0, 104.0, 89.0, 92.0, 86.0, 78.0, 56.0, 52.0, 42.0, 50.0, 46.0, 35.0, 37.0, 45.0, 47.0, 51.0], [6599.0, 5691.0, 4562.0, 3396.0, 2826.0, 2181.0, 1819.0, 1560.0, 1324.0, 1162.0, 1053.0, 939.0, 846.0, 782.0, 755.0, 789.0, 693.0, 691.0, 630.0, 584.0, 598.0, 554.0, 531.0, 500.0, 503.0, 421.0, 466.0, 437.0, 360.0, 354.0, 318.0, 303.0, 293.0, 301.0, 257.0, 233.0, 214.0, 208.0, 181.0, 170.0, 149.0, 160.0, 154.0, 100.0, 112.0, 86.0, 78.0, 91.0, 110.0], [1561.0, 1731.0, 2152.0, 2316.0, 2517.0, 2542.0, 2601.0, 2473.0, 2321.0, 2212.0, 2101.0, 1907.0, 1809.0, 1618.0, 1511.0, 1406.0, 1258.0, 1172.0, 1063.0, 1029.0, 920.0, 902.0, 863.0, 741.0, 697.0, 704.0, 679.0, 613.0, 568.0, 607.0, 505.0, 582.0, 559.0, 533.0, 476.0, 477.0, 447.0, 411.0, 429.0, 355.0, 403.0, 353.0, 319.0, 318.0, 274.0, 246.0, 216.0, 211.0, 218.0], [551.0, 435.0, 373.0, 389.0, 483.0, 585.0, 619.0, 745.0, 813.0, 1035.0, 1071.0, 1202.0, 1282.0, 1404.0, 1513.0, 1491.0, 1608.0, 1643.0, 1639.0, 1707.0, 1775.0, 1695.0, 1710.0, 1690.0, 1617.0, 1638.0, 1556.0, 1452.0, 1488.0, 1338.0, 1229.0, 1183.0, 1067.0, 1067.0, 995.0, 977.0, 915.0, 840.0, 785.0, 791.0, 740.0, 704.0, 676.0, 660.0, 610.0, 636.0, 588.0, 540.0, 518.0], [491.0, 294.0, 201.0, 186.0, 168.0, 138.0, 150.0, 145.0, 146.0, 196.0, 203.0, 218.0, 229.0, 296.0, 334.0, 345.0, 444.0, 487.0, 494.0, 606.0, 684.0, 741.0, 840.0, 943.0, 1026.0, 1166.0, 1258.0, 1274.0, 1421.0, 1560.0, 1638.0, 1742.0, 1797.0, 1900.0, 1975.0, 2021.0, 2084.0, 2140.0, 2095.0, 2100.0, 2045.0, 1974.0, 1945.0, 1809.0, 1705.0, 1561.0, 1403.0, 1387.0, 1266.0], [455.0, 254.0, 185.0, 137.0, 123.0, 84.0, 90.0, 69.0, 69.0, 67.0, 81.0, 69.0, 76.0, 77.0, 82.0, 102.0, 115.0, 126.0, 152.0, 165.0, 165.0, 191.0, 196.0, 236.0, 274.0, 292.0, 336.0, 397.0, 433.0, 506.0, 501.0, 658.0, 683.0, 786.0, 980.0, 1067.0, 1179.0, 1526.0, 1599.0, 1850.0, 2257.0, 2509.0, 2703.0, 3302.0, 3554.0, 3950.0, 4239.0, 4541.0, 4608.0], [442.0, 251.0, 158.0, 129.0, 95.0, 84.0, 62.0, 68.0, 38.0, 51.0, 41.0, 27.0, 36.0, 36.0, 46.0, 39.0, 39.0, 43.0, 49.0, 55.0, 56.0, 66.0, 97.0, 82.0, 95.0, 95.0, 110.0, 147.0, 143.0, 163.0, 220.0, 224.0, 289.0, 278.0, 327.0, 379.0, 422.0, 538.0, 596.0, 697.0, 885.0, 1062.0, 1395.0, 1717.0, 2264.0, 3007.0, 4380.0, 6212.0, 9595.0], [435.0, 221.0, 171.0, 109.0, 92.0, 85.0, 51.0, 35.0, 39.0, 42.0, 31.0, 28.0, 24.0, 26.0, 20.0, 24.0, 21.0, 26.0, 17.0, 36.0, 30.0, 37.0, 33.0, 31.0, 49.0, 37.0, 45.0, 45.0, 49.0, 75.0, 85.0, 87.0, 98.0, 126.0, 145.0, 160.0, 186.0, 235.0, 276.0, 294.0, 370.0, 443.0, 603.0, 750.0, 1017.0, 1470.0, 2172.0, 3783.0, 8498.0], [424.0, 236.0, 163.0, 132.0, 97.0, 66.0, 51.0, 38.0, 26.0, 35.0, 18.0, 22.0, 15.0, 24.0, 16.0, 18.0, 21.0, 16.0, 14.0, 17.0, 24.0, 24.0, 22.0, 18.0, 29.0, 20.0, 31.0, 30.0, 38.0, 31.0, 38.0, 37.0, 44.0, 47.0, 63.0, 67.0, 68.0, 103.0, 105.0, 131.0, 169.0, 209.0, 266.0, 402.0, 470.0, 729.0, 1181.0, 2152.0, 5163.0], [394.0, 241.0, 150.0, 116.0, 104.0, 57.0, 49.0, 33.0, 27.0, 16.0, 24.0, 15.0, 17.0, 17.0, 18.0, 19.0, 11.0, 13.0, 10.0, 18.0, 19.0, 13.0, 14.0, 14.0, 15.0, 21.0, 17.0, 27.0, 14.0, 18.0, 27.0, 25.0, 28.0, 34.0, 33.0, 40.0, 40.0, 38.0, 77.0, 60.0, 88.0, 78.0, 128.0, 171.0, 228.0, 356.0, 554.0, 1123.0, 3152.0], [408.0, 219.0, 168.0, 117.0, 82.0, 62.0, 44.0, 37.0, 22.0, 14.0, 20.0, 20.0, 20.0, 9.0, 14.0, 13.0, 20.0, 13.0, 17.0, 14.0, 13.0, 9.0, 8.0, 8.0, 11.0, 10.0, 7.0, 18.0, 26.0, 20.0, 16.0, 18.0, 32.0, 17.0, 31.0, 24.0, 28.0, 31.0, 35.0, 41.0, 46.0, 54.0, 65.0, 72.0, 130.0, 163.0, 274.0, 566.0, 1931.0], [400.0, 225.0, 125.0, 122.0, 74.0, 61.0, 48.0, 32.0, 24.0, 22.0, 13.0, 17.0, 14.0, 14.0, 11.0, 16.0, 10.0, 8.0, 12.0, 12.0, 7.0, 16.0, 11.0, 12.0, 12.0, 13.0, 8.0, 7.0, 9.0, 15.0, 8.0, 20.0, 14.0, 23.0, 18.0, 26.0, 15.0, 23.0, 32.0, 42.0, 23.0, 31.0, 48.0, 62.0, 62.0, 93.0, 105.0, 302.0, 992.0], [406.0, 223.0, 152.0, 108.0, 81.0, 58.0, 50.0, 33.0, 24.0, 16.0, 22.0, 10.0, 13.0, 20.0, 11.0, 7.0, 6.0, 6.0, 7.0, 8.0, 9.0, 11.0, 17.0, 6.0, 5.0, 11.0, 11.0, 7.0, 7.0, 10.0, 10.0, 13.0, 16.0, 14.0, 19.0, 15.0, 20.0, 19.0, 21.0, 21.0, 24.0, 33.0, 36.0, 50.0, 55.0, 71.0, 95.0, 150.0, 517.0], [381.0, 229.0, 153.0, 112.0, 85.0, 60.0, 36.0, 32.0, 26.0, 17.0, 15.0, 11.0, 7.0, 9.0, 11.0, 11.0, 7.0, 13.0, 10.0, 14.0, 6.0, 6.0, 4.0, 11.0, 6.0, 5.0, 6.0, 9.0, 10.0, 8.0, 11.0, 3.0, 7.0, 12.0, 15.0, 14.0, 17.0, 13.0, 17.0, 20.0, 21.0, 30.0, 29.0, 36.0, 38.0, 56.0, 72.0, 110.0, 306.0], [369.0, 217.0, 150.0, 109.0, 79.0, 57.0, 43.0, 32.0, 20.0, 16.0, 15.0, 11.0, 8.0, 7.0, 8.0, 8.0, 5.0, 4.0, 3.0, 8.0, 6.0, 3.0, 6.0, 8.0, 8.0, 6.0, 7.0, 8.0, 11.0, 7.0, 6.0, 4.0, 11.0, 7.0, 9.0, 13.0, 7.0, 13.0, 20.0, 18.0, 14.0, 22.0, 25.0, 26.0, 40.0, 51.0, 63.0, 83.0, 231.0], [370.0, 205.0, 150.0, 134.0, 63.0, 59.0, 44.0, 30.0, 28.0, 15.0, 9.0, 9.0, 12.0, 8.0, 7.0, 8.0, 7.0, 5.0, 8.0, 6.0, 6.0, 5.0, 2.0, 5.0, 4.0, 4.0, 5.0, 5.0, 7.0, 5.0, 10.0, 3.0, 8.0, 13.0, 7.0, 10.0, 5.0, 10.0, 8.0, 13.0, 15.0, 15.0, 20.0, 25.0, 25.0, 46.0, 48.0, 77.0, 163.0], [408.0, 218.0, 158.0, 107.0, 71.0, 60.0, 41.0, 36.0, 16.0, 14.0, 11.0, 15.0, 13.0, 14.0, 6.0, 6.0, 4.0, 7.0, 5.0, 7.0, 5.0, 6.0, 0.0, 5.0, 3.0, 5.0, 7.0, 5.0, 2.0, 4.0, 6.0, 4.0, 7.0, 7.0, 6.0, 5.0, 8.0, 6.0, 11.0, 7.0, 5.0, 7.0, 17.0, 11.0, 32.0, 27.0, 48.0, 61.0, 142.0], [367.0, 236.0, 181.0, 104.0, 73.0, 51.0, 44.0, 39.0, 18.0, 14.0, 9.0, 8.0, 6.0, 9.0, 8.0, 7.0, 8.0, 9.0, 5.0, 5.0, 5.0, 2.0, 7.0, 5.0, 7.0, 4.0, 3.0, 2.0, 4.0, 3.0, 4.0, 4.0, 5.0, 5.0, 0.0, 4.0, 8.0, 8.0, 5.0, 6.0, 6.0, 10.0, 16.0, 11.0, 21.0, 28.0, 34.0, 43.0, 107.0], [402.0, 220.0, 130.0, 112.0, 79.0, 63.0, 38.0, 30.0, 23.0, 18.0, 15.0, 4.0, 7.0, 9.0, 10.0, 4.0, 2.0, 4.0, 7.0, 5.0, 3.0, 1.0, 5.0, 6.0, 5.0, 4.0, 5.0, 3.0, 3.0, 7.0, 3.0, 5.0, 1.0, 9.0, 6.0, 6.0, 6.0, 5.0, 4.0, 5.0, 11.0, 3.0, 8.0, 8.0, 12.0, 17.0, 35.0, 42.0, 108.0], [414.0, 201.0, 134.0, 90.0, 83.0, 69.0, 50.0, 35.0, 20.0, 12.0, 13.0, 11.0, 9.0, 4.0, 3.0, 12.0, 4.0, 6.0, 2.0, 6.0, 3.0, 3.0, 5.0, 1.0, 0.0, 2.0, 6.0, 0.0, 4.0, 3.0, 9.0, 5.0, 5.0, 3.0, 2.0, 5.0, 6.0, 8.0, 9.0, 5.0, 4.0, 4.0, 7.0, 5.0, 13.0, 20.0, 18.0, 32.0, 74.0], [394.0, 204.0, 156.0, 104.0, 79.0, 64.0, 41.0, 34.0, 22.0, 14.0, 9.0, 10.0, 7.0, 8.0, 7.0, 8.0, 7.0, 1.0, 6.0, 4.0, 0.0, 4.0, 6.0, 3.0, 3.0, 3.0, 0.0, 2.0, 4.0, 2.0, 3.0, 3.0, 8.0, 4.0, 3.0, 3.0, 7.0, 5.0, 8.0, 2.0, 5.0, 10.0, 5.0, 5.0, 13.0, 6.0, 13.0, 35.0, 57.0], [366.0, 230.0, 144.0, 106.0, 69.0, 56.0, 38.0, 38.0, 22.0, 17.0, 16.0, 8.0, 9.0, 13.0, 2.0, 8.0, 3.0, 9.0, 3.0, 1.0, 4.0, 1.0, 4.0, 1.0, 2.0, 3.0, 4.0, 1.0, 3.0, 6.0, 2.0, 5.0, 3.0, 3.0, 6.0, 6.0, 4.0, 4.0, 6.0, 3.0, 3.0, 7.0, 5.0, 4.0, 8.0, 6.0, 15.0, 21.0, 58.0], [377.0, 232.0, 147.0, 112.0, 75.0, 51.0, 35.0, 37.0, 21.0, 20.0, 6.0, 12.0, 4.0, 8.0, 3.0, 7.0, 7.0, 2.0, 7.0, 6.0, 6.0, 3.0, 4.0, 2.0, 3.0, 2.0, 1.0, 2.0, 3.0, 2.0, 1.0, 4.0, 3.0, 9.0, 6.0, 2.0, 0.0, 1.0, 5.0, 2.0, 5.0, 4.0, 10.0, 5.0, 4.0, 9.0, 16.0, 21.0, 57.0], [381.0, 222.0, 155.0, 101.0, 81.0, 58.0, 32.0, 26.0, 24.0, 12.0, 11.0, 9.0, 11.0, 11.0, 7.0, 6.0, 7.0, 4.0, 4.0, 4.0, 0.0, 4.0, 2.0, 5.0, 2.0, 2.0, 3.0, 2.0, 2.0, 3.0, 3.0, 2.0, 2.0, 4.0, 1.0, 3.0, 5.0, 2.0, 6.0, 3.0, 2.0, 4.0, 7.0, 7.0, 3.0, 6.0, 14.0, 19.0, 51.0], [387.0, 220.0, 136.0, 107.0, 81.0, 48.0, 38.0, 29.0, 26.0, 14.0, 14.0, 7.0, 10.0, 6.0, 6.0, 8.0, 6.0, 7.0, 5.0, 3.0, 2.0, 2.0, 3.0, 6.0, 2.0, 1.0, 2.0, 1.0, 4.0, 5.0, 0.0, 4.0, 6.0, 2.0, 2.0, 2.0, 4.0, 5.0, 2.0, 5.0, 3.0, 3.0, 3.0, 6.0, 6.0, 4.0, 6.0, 19.0, 36.0], [390.0, 188.0, 156.0, 117.0, 87.0, 59.0, 42.0, 23.0, 19.0, 14.0, 11.0, 10.0, 9.0, 8.0, 3.0, 5.0, 5.0, 5.0, 4.0, 7.0, 6.0, 2.0, 1.0, 3.0, 2.0, 2.0, 4.0, 3.0, 1.0, 5.0, 2.0, 1.0, 2.0, 1.0, 0.0, 3.0, 1.0, 7.0, 4.0, 6.0, 1.0, 3.0, 3.0, 3.0, 5.0, 1.0, 4.0, 14.0, 33.0], [393.0, 201.0, 136.0, 112.0, 79.0, 54.0, 57.0, 28.0, 18.0, 12.0, 8.0, 11.0, 4.0, 9.0, 5.0, 5.0, 12.0, 2.0, 5.0, 7.0, 2.0, 3.0, 7.0, 3.0, 1.0, 4.0, 3.0, 2.0, 2.0, 0.0, 2.0, 1.0, 2.0, 3.0, 3.0, 2.0, 1.0, 1.0, 3.0, 1.0, 9.0, 4.0, 1.0, 3.0, 8.0, 4.0, 5.0, 12.0, 24.0], [375.0, 223.0, 149.0, 118.0, 74.0, 68.0, 48.0, 23.0, 22.0, 13.0, 15.0, 7.0, 7.0, 9.0, 4.0, 5.0, 7.0, 3.0, 3.0, 4.0, 6.0, 3.0, 1.0, 4.0, 3.0, 4.0, 0.0, 1.0, 2.0, 1.0, 1.0, 3.0, 4.0, 3.0, 4.0, 3.0, 4.0, 3.0, 3.0, 2.0, 1.0, 1.0, 3.0, 1.0, 2.0, 8.0, 8.0, 6.0, 22.0], [394.0, 207.0, 158.0, 106.0, 69.0, 61.0, 46.0, 17.0, 33.0, 17.0, 12.0, 11.0, 7.0, 9.0, 0.0, 7.0, 2.0, 5.0, 6.0, 4.0, 6.0, 4.0, 3.0, 3.0, 1.0, 1.0, 1.0, 2.0, 3.0, 2.0, 5.0, 3.0, 4.0, 5.0, 3.0, 3.0, 1.0, 4.0, 2.0, 4.0, 0.0, 1.0, 1.0, 5.0, 3.0, 6.0, 3.0, 8.0, 19.0], [367.0, 222.0, 140.0, 108.0, 83.0, 64.0, 36.0, 36.0, 17.0, 14.0, 14.0, 7.0, 3.0, 9.0, 4.0, 6.0, 8.0, 7.0, 5.0, 4.0, 6.0, 4.0, 2.0, 2.0, 2.0, 3.0, 5.0, 2.0, 1.0, 1.0, 0.0, 2.0, 0.0, 4.0, 3.0, 1.0, 4.0, 6.0, 1.0, 3.0, 1.0, 3.0, 3.0, 1.0, 6.0, 5.0, 5.0, 4.0, 11.0], [364.0, 242.0, 145.0, 121.0, 87.0, 53.0, 35.0, 25.0, 16.0, 19.0, 12.0, 9.0, 15.0, 4.0, 5.0, 12.0, 3.0, 4.0, 7.0, 3.0, 4.0, 2.0, 1.0, 2.0, 0.0, 2.0, 3.0, 3.0, 2.0, 1.0, 5.0, 4.0, 2.0, 1.0, 2.0, 2.0, 2.0, 4.0, 3.0, 2.0, 4.0, 3.0, 4.0, 2.0, 3.0, 3.0, 3.0, 4.0, 17.0], [401.0, 230.0, 144.0, 98.0, 83.0, 70.0, 39.0, 32.0, 23.0, 14.0, 15.0, 9.0, 11.0, 9.0, 8.0, 4.0, 3.0, 4.0, 6.0, 4.0, 2.0, 2.0, 1.0, 2.0, 0.0, 5.0, 0.0, 2.0, 1.0, 2.0, 4.0, 5.0, 1.0, 3.0, 0.0, 0.0, 1.0, 2.0, 6.0, 2.0, 3.0, 2.0, 3.0, 0.0, 1.0, 1.0, 3.0, 10.0, 15.0], [383.0, 243.0, 156.0, 100.0, 81.0, 61.0, 31.0, 27.0, 23.0, 8.0, 8.0, 11.0, 9.0, 2.0, 7.0, 7.0, 8.0, 6.0, 7.0, 5.0, 2.0, 4.0, 4.0, 1.0, 5.0, 2.0, 4.0, 3.0, 3.0, 3.0, 2.0, 2.0, 5.0, 2.0, 2.0, 1.0, 3.0, 1.0, 0.0, 1.0, 1.0, 4.0, 1.0, 2.0, 2.0, 5.0, 2.0, 4.0, 11.0], [383.0, 225.0, 155.0, 98.0, 90.0, 46.0, 40.0, 26.0, 15.0, 12.0, 10.0, 11.0, 6.0, 9.0, 10.0, 7.0, 2.0, 3.0, 4.0, 4.0, 2.0, 8.0, 3.0, 5.0, 1.0, 0.0, 1.0, 5.0, 5.0, 3.0, 1.0, 3.0, 3.0, 2.0, 2.0, 3.0, 2.0, 1.0, 2.0, 2.0, 2.0, 1.0, 1.0, 2.0, 3.0, 3.0, 6.0, 6.0, 5.0], [403.0, 235.0, 147.0, 98.0, 67.0, 61.0, 43.0, 44.0, 15.0, 19.0, 19.0, 7.0, 7.0, 7.0, 8.0, 4.0, 5.0, 4.0, 5.0, 2.0, 2.0, 3.0, 0.0, 1.0, 6.0, 1.0, 1.0, 1.0, 5.0, 2.0, 1.0, 4.0, 1.0, 2.0, 3.0, 1.0, 5.0, 3.0, 5.0, 1.0, 0.0, 1.0, 2.0, 3.0, 2.0, 2.0, 3.0, 5.0, 10.0], [366.0, 217.0, 143.0, 106.0, 69.0, 55.0, 48.0, 40.0, 33.0, 14.0, 6.0, 10.0, 12.0, 6.0, 7.0, 4.0, 2.0, 3.0, 2.0, 3.0, 7.0, 1.0, 2.0, 2.0, 2.0, 2.0, 1.0, 5.0, 2.0, 3.0, 2.0, 4.0, 6.0, 0.0, 0.0, 0.0, 5.0, 1.0, 2.0, 2.0, 2.0, 4.0, 0.0, 0.0, 4.0, 2.0, 1.0, 7.0, 6.0], [378.0, 215.0, 148.0, 123.0, 76.0, 56.0, 35.0, 22.0, 28.0, 18.0, 11.0, 15.0, 5.0, 7.0, 7.0, 2.0, 6.0, 6.0, 5.0, 3.0, 6.0, 1.0, 3.0, 5.0, 2.0, 2.0, 2.0, 3.0, 5.0, 2.0, 0.0, 4.0, 1.0, 4.0, 4.0, 2.0, 2.0, 0.0, 2.0, 2.0, 0.0, 1.0, 1.0, 1.0, 4.0, 6.0, 3.0, 3.0, 5.0], [415.0, 209.0, 143.0, 94.0, 75.0, 58.0, 46.0, 29.0, 16.0, 15.0, 14.0, 7.0, 8.0, 8.0, 8.0, 8.0, 5.0, 6.0, 4.0, 2.0, 4.0, 1.0, 2.0, 3.0, 2.0, 2.0, 2.0, 0.0, 3.0, 3.0, 0.0, 1.0, 3.0, 4.0, 2.0, 1.0, 5.0, 3.0, 4.0, 0.0, 2.0, 3.0, 3.0, 1.0, 4.0, 2.0, 3.0, 5.0, 9.0], [390.0, 216.0, 149.0, 111.0, 85.0, 53.0, 45.0, 34.0, 16.0, 16.0, 4.0, 11.0, 13.0, 3.0, 6.0, 7.0, 1.0, 9.0, 7.0, 1.0, 0.0, 7.0, 0.0, 1.0, 5.0, 1.0, 3.0, 2.0, 4.0, 3.0, 3.0, 1.0, 2.0, 2.0, 2.0, 0.0, 2.0, 2.0, 2.0, 3.0, 2.0, 1.0, 0.0, 5.0, 5.0, 4.0, 2.0, 3.0, 8.0], [422.0, 219.0, 119.0, 118.0, 78.0, 53.0, 36.0, 33.0, 21.0, 10.0, 19.0, 10.0, 5.0, 10.0, 9.0, 4.0, 8.0, 3.0, 0.0, 2.0, 1.0, 1.0, 4.0, 1.0, 3.0, 3.0, 6.0, 4.0, 1.0, 2.0, 5.0, 3.0, 1.0, 0.0, 2.0, 1.0, 5.0, 1.0, 1.0, 2.0, 2.0, 1.0, 1.0, 0.0, 2.0, 2.0, 2.0, 3.0, 8.0], [387.0, 209.0, 146.0, 105.0, 89.0, 63.0, 44.0, 35.0, 24.0, 10.0, 16.0, 5.0, 8.0, 7.0, 4.0, 6.0, 1.0, 9.0, 5.0, 2.0, 3.0, 7.0, 5.0, 0.0, 5.0, 3.0, 2.0, 3.0, 1.0, 1.0, 2.0, 2.0, 2.0, 4.0, 1.0, 4.0, 3.0, 1.0, 4.0, 2.0, 0.0, 1.0, 1.0, 1.0, 0.0, 1.0, 4.0, 3.0, 7.0], [403.0, 214.0, 150.0, 119.0, 80.0, 56.0, 43.0, 25.0, 22.0, 19.0, 10.0, 8.0, 6.0, 6.0, 9.0, 4.0, 9.0, 2.0, 7.0, 3.0, 3.0, 3.0, 1.0, 0.0, 4.0, 1.0, 2.0, 3.0, 4.0, 2.0, 0.0, 3.0, 4.0, 5.0, 4.0, 0.0, 1.0, 3.0, 2.0, 3.0, 1.0, 0.0, 0.0, 0.0, 1.0, 0.0, 3.0, 4.0, 4.0], [392.0, 227.0, 151.0, 93.0, 80.0, 73.0, 36.0, 29.0, 17.0, 15.0, 9.0, 5.0, 9.0, 9.0, 13.0, 2.0, 7.0, 6.0, 6.0, 3.0, 4.0, 0.0, 5.0, 1.0, 1.0, 2.0, 2.0, 3.0, 3.0, 6.0, 2.0, 2.0, 0.0, 3.0, 0.0, 2.0, 2.0, 1.0, 2.0, 1.0, 3.0, 1.0, 1.0, 1.0, 1.0, 2.0, 3.0, 1.0, 7.0], [388.0, 219.0, 153.0, 119.0, 91.0, 64.0, 41.0, 26.0, 16.0, 17.0, 4.0, 12.0, 8.0, 5.0, 6.0, 8.0, 8.0, 4.0, 6.0, 7.0, 2.0, 1.0, 1.0, 1.0, 2.0, 3.0, 1.0, 4.0, 3.0, 3.0, 2.0, 0.0, 2.0, 1.0, 3.0, 2.0, 3.0, 0.0, 3.0, 2.0, 2.0, 5.0, 2.0, 0.0, 0.0, 4.0, 1.0, 5.0, 3.0], [390.0, 196.0, 170.0, 106.0, 71.0, 70.0, 33.0, 38.0, 23.0, 11.0, 16.0, 13.0, 5.0, 7.0, 6.0, 12.0, 7.0, 3.0, 2.0, 4.0, 3.0, 3.0, 4.0, 5.0, 2.0, 3.0, 3.0, 1.0, 2.0, 4.0, 2.0, 3.0, 0.0, 5.0, 3.0, 2.0, 1.0, 1.0, 2.0, 3.0, 1.0, 2.0, 2.0, 0.0, 0.0, 1.0, 0.0, 3.0, 2.0], [397.0, 217.0, 151.0, 95.0, 79.0, 74.0, 37.0, 40.0, 21.0, 22.0, 16.0, 6.0, 10.0, 7.0, 9.0, 11.0, 5.0, 4.0, 4.0, 1.0, 2.0, 2.0, 1.0, 2.0, 0.0, 6.0, 2.0, 0.0, 2.0, 4.0, 3.0, 0.0, 1.0, 0.0, 2.0, 5.0, 3.0, 0.0, 2.0, 4.0, 2.0, 2.0, 1.0, 3.0, 2.0, 0.0, 2.0, 4.0, 5.0]],
    "Name": "sCurve-0",
    "Overflow": 2010849.0,
    "Type": "Histo2d",
    "Underflow": 0.0,
    "x": {
        "AxisTitle": "Vcal",
        "Bins": 51,
        "High": 302.5,
        "Low": 47.5
    },
    "y": {
        "AxisTitle": "Occupancy",
        "Bins": 49,
        "High": 49.5,
        "Low": 0.5
    },
    "z": {
        "AxisTitle": "Number of pixels"
    }
}