{
    "Data": [14.0, 20.0, 0.0, 2.0, 13.0, 84.0, 462.0, 1444.0, 2942.0, 4240.0, 4388.0, 3844.0, 2976.0, 2459.0, 2297.0, 2260.0, 2115.0, 1884.0, 1912.0, 1884.0, 2107.0, 2311.0, 2359.0, 2319.0, 2059.0, 1595.0, 1147.0, 791.0, 503.0, 434.0, 376.0, 462.0, 521.0, 708.0, 885.0, 1134.0, 1381.0, 1596.0, 1708.0, 1875.0, 1914.0, 1868.0, 1787.0, 1623.0, 1471.0, 1241.0, 994.0, 756.0, 602.0, 455.0, 397.0, 281.0, 221.0, 139.0, 103.0, 81.0, 62.0, 53.0, 42.0, 37.0, 31.0, 22.0, 20.0, 10.0, 16.0, 11.0, 18.0, 17.0, 9.0, 12.0, 10.0, 3.0, 2.0, 3.0, 4.0, 6.0, 6.0, 4.0, 3.0, 3.0, 2.0, 4.0, 3.0, 1.0, 2.0, 1.0, 1.0, 2.0, 1.0, 0.0],
    "Name": "NoiseDist-0",
    "Overflow": 14.0,
    "Type": "Histo1d",
    "Underflow": 0.0,
    "x": {
        "AxisTitle": "Noise [e]",
        "Bins": 90,
        "High": 451.0,
        "Low": -2.0
    },
    "y": {
        "AxisTitle": "Number of Pixels"
    },
    "z": {
        "AxisTitle": "z"
    }
}