time,Hardware,Voltage,Current
1621470675143,high-voltage-2,1,0.365533
time,Hardware,Voltage,Current
1621470675143,high-voltage-2,2,0.440762
time,Hardware,Voltage,Current
1621470675143,high-voltage-2,3,0.493164
time,Hardware,Voltage,Current
1621470675143,high-voltage-2,4,0.540817
time,Hardware,Voltage,Current
1621470675143,high-voltage-2,5,0.584336
time,Hardware,Voltage,Current
1621470675143,high-voltage-2,6,0.624916
time,Hardware,Voltage,Current
1621470675143,high-voltage-2,7,0.661502
time,Hardware,Voltage,Current
1621470675143,high-voltage-2,8,0.695785
time,Hardware,Voltage,Current
1621470675143,high-voltage-2,9,0.728491
time,Hardware,Voltage,Current
1621470675143,high-voltage-2,10,0.75688
time,Hardware,Voltage,Current
1621470675143,high-voltage-2,11,0.784868
time,Hardware,Voltage,Current
1621470675143,high-voltage-2,12,0.808386
time,Hardware,Voltage,Current
1621470675143,high-voltage-2,13,0.834996
time,Hardware,Voltage,Current
1621470675143,high-voltage-2,14,0.85709
time,Hardware,Voltage,Current
1621470675143,high-voltage-2,15,0.877338
time,Hardware,Voltage,Current
1621470675143,high-voltage-2,16,0.894786
time,Hardware,Voltage,Current
1621470675143,high-voltage-2,17,0.913704
time,Hardware,Voltage,Current
1621470675143,high-voltage-2,18,0.927497
time,Hardware,Voltage,Current
1621470675143,high-voltage-2,19,0.944041
time,Hardware,Voltage,Current
1621470675143,high-voltage-2,20,0.957073
time,Hardware,Voltage,Current
1621470675143,high-voltage-2,25,1.03057
time,Hardware,Voltage,Current
1621470675143,high-voltage-2,30,1.10561
time,Hardware,Voltage,Current
1621470675143,high-voltage-2,35,1.18411
time,Hardware,Voltage,Current
1621470675143,high-voltage-2,40,1.27514
time,Hardware,Voltage,Current
1621470675143,high-voltage-2,45,1.39323
time,Hardware,Voltage,Current
1621470675143,high-voltage-2,50,1.47025
time,Hardware,Voltage,Current
1621470675143,high-voltage-2,55,1.53971
time,Hardware,Voltage,Current
1621470675143,high-voltage-2,60,1.60777
time,Hardware,Voltage,Current
1621470675143,high-voltage-2,65,1.67051
time,Hardware,Voltage,Current
1621470675143,high-voltage-2,70,1.73557
time,Hardware,Voltage,Current
1621470675143,high-voltage-2,75,1.79838
time,Hardware,Voltage,Current
1621470675143,high-voltage-2,80,1.85957
time,Hardware,Voltage,Current
1621470675143,high-voltage-2,85,1.91929
time,Hardware,Voltage,Current
1621470675143,high-voltage-2,90,1.97977
time,Hardware,Voltage,Current
1621470675143,high-voltage-2,95,2.03678
time,Hardware,Voltage,Current
1621470675143,high-voltage-2,100,2.09699
