{
    "Data": [0.0, 0.0, 0.0, 0.0, 0.0, 0.0, 0.0, 0.0, 0.0, 0.0, 0.0, 0.0, 0.0, 0.0, 4.0, 1.0, 0.0, 38.0, 348.0, 142.0, 27.0, 307.0, 2248.0, 1548.0, 277.0, 806.0, 2549.0, 1809.0, 600.0, 1182.0, 2145.0, 1507.0, 674.0, 733.0, 851.0, 577.0, 465.0, 750.0, 984.0, 936.0, 742.0, 1197.0, 1915.0, 3339.0, 2390.0, 1650.0, 2419.0, 3288.0, 3676.0, 3108.0, 2577.0, 2295.0, 3004.0, 2138.0, 1654.0, 1452.0, 1344.0, 1519.0, 1324.0, 1256.0, 1040.0, 1034.0, 821.0, 655.0, 552.0, 553.0, 538.0, 409.0, 387.0, 376.0, 349.0, 338.0, 265.0, 255.0, 224.0, 202.0, 187.0, 141.0, 154.0, 133.0, 130.0, 101.0, 80.0, 95.0, 85.0, 84.0, 71.0, 63.0, 58.0, 51.0, 41.0, 38.0, 34.0, 43.0, 48.0, 30.0, 26.0, 22.0, 22.0, 26.0, 22.0, 20.0, 16.0, 18.0, 20.0, 16.0, 13.0, 11.0, 14.0, 10.0, 15.0, 14.0, 6.0, 10.0, 11.0, 9.0, 7.0, 8.0, 9.0, 12.0, 8.0, 8.0, 8.0, 2.0, 4.0, 7.0, 7.0, 3.0, 3.0, 3.0, 5.0, 2.0, 3.0, 4.0, 2.0, 1.0, 2.0, 1.0, 5.0, 2.0, 3.0, 4.0, 1.0, 0.0, 2.0, 1.0, 0.0, 2.0, 0.0, 2.0, 4.0, 3.0, 1.0, 4.0, 0.0, 1.0, 1.0, 2.0, 3.0, 1.0, 1.0, 1.0, 1.0, 0.0, 0.0, 0.0, 0.0, 1.0, 0.0, 2.0, 2.0, 2.0, 1.0, 0.0, 1.0, 0.0, 1.0, 0.0, 0.0, 2.0, 1.0, 0.0, 0.0, 1.0, 0.0, 0.0, 0.0, 0.0, 0.0, 0.0, 0.0, 0.0, 1.0, 0.0, 0.0, 0.0, 1.0, 0.0, 0.0, 1.0, 0.0],
    "Name": "TimePerFitDist-0",
    "Overflow": 58.0,
    "Type": "Histo1d",
    "Underflow": 0.0,
    "x": {
        "AxisTitle": "Fit Time [us]",
        "Bins": 201,
        "High": 401.0,
        "Low": -1.0
    },
    "y": {
        "AxisTitle": "Number of Pixels"
    },
    "z": {
        "AxisTitle": "z"
    }
}