{
    "Data": [0.0, 0.0, 0.0, 0.0, 0.0, 0.0, 0.0, 0.0, 0.0, 0.0, 0.0, 0.0, 0.0, 0.0, 0.0, 0.0, 0.0, 0.0, 0.0, 0.0, 0.0, 0.0, 5.0, 6.0, 0.0, 8.0, 16.0, 19.0, 15.0, 16.0, 44.0, 71.0, 88.0, 114.0, 132.0, 115.0, 252.0, 923.0, 1288.0, 907.0, 560.0, 1322.0, 2898.0, 3561.0, 2621.0, 1581.0, 2702.0, 3004.0, 3723.0, 2293.0, 1889.0, 2283.0, 2238.0, 2156.0, 1412.0, 1298.0, 1133.0, 1268.0, 921.0, 796.0, 796.0, 704.0, 712.0, 515.0, 484.0, 440.0, 415.0, 402.0, 295.0, 255.0, 234.0, 232.0, 217.0, 220.0, 157.0, 132.0, 129.0, 123.0, 134.0, 112.0, 80.0, 86.0, 69.0, 62.0, 79.0, 64.0, 42.0, 38.0, 32.0, 39.0, 35.0, 21.0, 31.0, 28.0, 34.0, 24.0, 15.0, 18.0, 18.0, 23.0, 16.0, 9.0, 19.0, 7.0, 8.0, 12.0, 10.0, 10.0, 10.0, 8.0, 12.0, 6.0, 3.0, 4.0, 3.0, 6.0, 3.0, 4.0, 5.0, 6.0, 5.0, 6.0, 3.0, 2.0, 2.0, 3.0, 2.0, 2.0, 4.0, 2.0, 4.0, 4.0, 0.0, 2.0, 3.0, 2.0, 1.0, 1.0, 2.0, 1.0, 0.0, 1.0, 2.0, 1.0, 2.0, 3.0, 1.0, 1.0, 1.0, 0.0, 0.0, 0.0, 0.0, 1.0, 0.0, 0.0, 0.0, 1.0, 1.0, 2.0, 1.0, 1.0, 1.0, 3.0, 0.0, 0.0, 0.0, 0.0, 3.0, 0.0, 0.0, 0.0, 0.0, 0.0, 0.0, 0.0, 0.0, 0.0, 0.0, 0.0, 1.0, 1.0, 1.0, 0.0, 0.0, 0.0, 0.0, 0.0, 0.0, 0.0, 0.0, 1.0, 0.0, 1.0, 0.0, 0.0, 0.0, 0.0, 0.0, 0.0, 0.0],
    "Name": "TimePerFitDist-0",
    "Overflow": 105.0,
    "Type": "Histo1d",
    "Underflow": 0.0,
    "x": {
        "AxisTitle": "Fit Time [us]",
        "Bins": 201,
        "High": 401.0,
        "Low": -1.0
    },
    "y": {
        "AxisTitle": "Number of Pixels"
    },
    "z": {
        "AxisTitle": "z"
    }
}