time,Hardware,Voltage,Current
1623305948507,high-voltage,1,0.0606052
time,Hardware,Voltage,Current
1623305948507,high-voltage,2,0.0777026
time,Hardware,Voltage,Current
1623305948507,high-voltage,3,0.0915204
time,Hardware,Voltage,Current
1623305948507,high-voltage,4,0.104393
time,Hardware,Voltage,Current
1623305948507,high-voltage,5,0.116269
time,Hardware,Voltage,Current
1623305948507,high-voltage,6,0.127139
time,Hardware,Voltage,Current
1623305948507,high-voltage,7,0.138063
time,Hardware,Voltage,Current
1623305948507,high-voltage,8,0.148139
time,Hardware,Voltage,Current
1623305948507,high-voltage,9,0.158245
time,Hardware,Voltage,Current
1623305948507,high-voltage,10,0.167926
time,Hardware,Voltage,Current
1623305948507,high-voltage,11,0.175891
time,Hardware,Voltage,Current
1623305948507,high-voltage,12,0.182147
time,Hardware,Voltage,Current
1623305948507,high-voltage,13,0.189387
time,Hardware,Voltage,Current
1623305948507,high-voltage,14,0.193909
time,Hardware,Voltage,Current
1623305948507,high-voltage,15,0.19868
time,Hardware,Voltage,Current
1623305948507,high-voltage,16,0.20446
time,Hardware,Voltage,Current
1623305948507,high-voltage,17,0.208708
time,Hardware,Voltage,Current
1623305948507,high-voltage,18,0.214669
time,Hardware,Voltage,Current
1623305948507,high-voltage,19,0.219243
time,Hardware,Voltage,Current
1623305948507,high-voltage,20,0.223406
time,Hardware,Voltage,Current
1623305948507,high-voltage,25,0.245329
time,Hardware,Voltage,Current
1623305948507,high-voltage,30,0.281286
time,Hardware,Voltage,Current
1623305948507,high-voltage,3.96626e-07,0.396462
time,Hardware,Voltage,Current
1623305948507,high-voltage,40,0.728692
time,Hardware,Voltage,Current
1623305948507,high-voltage,1.28503e-06,1.28496
time,Hardware,Voltage,Current
1623305948507,high-voltage,50,2.00085
time,Hardware,Voltage,Current
1623305948507,high-voltage,55,2.86353
time,Hardware,Voltage,Current
1623305948507,high-voltage,60,3.87557
