time,Hardware,Voltage,Current
1621611797416,high-voltage,1,0.133769
time,Hardware,Voltage,Current
1621611797416,high-voltage,2,0.222875
time,Hardware,Voltage,Current
1621611797416,high-voltage,3,0.349921
time,Hardware,Voltage,Current
1621611797416,high-voltage,4,0.501969
time,Hardware,Voltage,Current
1621611797416,high-voltage,5,0.721954
time,Hardware,Voltage,Current
1621611797416,high-voltage,6,0.965762
time,Hardware,Voltage,Current
1621611797416,high-voltage,7,1.2203
time,Hardware,Voltage,Current
1621611797416,high-voltage,8,1.59062
time,Hardware,Voltage,Current
1621611797416,high-voltage,9,2.1104
time,Hardware,Voltage,Current
1621611797416,high-voltage,10,2.64892
time,Hardware,Voltage,Current
1621611797416,high-voltage,11,3.34353
time,Hardware,Voltage,Current
1621611797416,high-voltage,12,4.10419
time,Hardware,Voltage,Current
1621611797416,high-voltage,13,4.88616
time,Hardware,Voltage,Current
1621611797416,high-voltage,14,6.10298
time,Hardware,Voltage,Current
1621611797416,high-voltage,15,7.12143
time,Hardware,Voltage,Current
1621611797416,high-voltage,16,8.31699
time,Hardware,Voltage,Current
1621611797416,high-voltage,17,9.37128
time,Hardware,Voltage,Current
1621611797416,high-voltage,18,9.67832
time,Hardware,Voltage,Current
1621611797416,high-voltage,19,10.0001
