{
    "Data": [3519.0, 23188.0, 16710.0, 6284.0, 2474.0, 2255.0, 2906.0, 3377.0, 3603.0, 3228.0, 2735.0, 1977.0, 1420.0, 944.0, 556.0, 338.0, 193.0, 111.0, 66.0, 37.0, 16.0, 13.0, 13.0, 7.0, 0.0, 1.0, 0.0, 1.0, 1.0, 0.0, 1.0, 0.0, 0.0, 0.0, 1.0, 0.0, 0.0, 0.0, 0.0, 0.0, 0.0, 0.0, 0.0, 0.0, 0.0, 0.0, 0.0, 0.0, 0.0, 0.0, 0.0],
    "Name": "Chi2Dist-0",
    "Overflow": 0.0,
    "Type": "Histo1d",
    "Underflow": 0.0,
    "x": {
        "AxisTitle": "Fit Chi/ndf",
        "Bins": 51,
        "High": 2.5250000953674318,
        "Low": -0.02500000037252903
    },
    "y": {
        "AxisTitle": "Number of Pixels"
    },
    "z": {
        "AxisTitle": "z"
    }
}