time,Hardware,Voltage,Current
1623354029740,high-voltage,1,0.0649711
time,Hardware,Voltage,Current
1623354029740,high-voltage,8.135e-08,0.0811103
time,Hardware,Voltage,Current
1623354029740,high-voltage,3,0.0939617
time,Hardware,Voltage,Current
1623354029740,high-voltage,1.04766e-07,0.105044
time,Hardware,Voltage,Current
1623354029740,high-voltage,5,0.115479
