time,Hardware,Voltage,Current
1626724513840,high-voltage-2,1,0.236195
time,Hardware,Voltage,Current
1626724513840,high-voltage-2,2,0.284868
time,Hardware,Voltage,Current
1626724513840,high-voltage-2,3,0.309463
time,Hardware,Voltage,Current
1626724513840,high-voltage-2,4,0.332518
time,Hardware,Voltage,Current
1626724513840,high-voltage-2,5,0.357746
time,Hardware,Voltage,Current
1626724513840,high-voltage-2,6,0.384862
time,Hardware,Voltage,Current
1626724513840,high-voltage-2,7,0.415094
time,Hardware,Voltage,Current
1626724513840,high-voltage-2,8,0.448917
time,Hardware,Voltage,Current
1626724513840,high-voltage-2,9,0.490004
time,Hardware,Voltage,Current
1626724513840,high-voltage-2,10,0.530585
time,Hardware,Voltage,Current
1626724513840,high-voltage-2,11,0.573643
time,Hardware,Voltage,Current
1626724513840,high-voltage-2,12,0.617504
time,Hardware,Voltage,Current
1626724513840,high-voltage-2,13,0.656212
time,Hardware,Voltage,Current
1626724513840,high-voltage-2,14,0.69267
time,Hardware,Voltage,Current
1626724513840,high-voltage-2,15,0.726241
time,Hardware,Voltage,Current
1626724513840,high-voltage-2,16,0.75514
time,Hardware,Voltage,Current
1626724513840,high-voltage-2,17,0.783334
time,Hardware,Voltage,Current
1626724513840,high-voltage-2,18,0.805524
time,Hardware,Voltage,Current
1626724513840,high-voltage-2,19,0.828201
time,Hardware,Voltage,Current
1626724513840,high-voltage-2,20,0.851245
time,Hardware,Voltage,Current
1626724513840,high-voltage-2,25,0.948663
time,Hardware,Voltage,Current
1626724513840,high-voltage-2,30,1.04642
time,Hardware,Voltage,Current
1626724513840,high-voltage-2,35,1.14553
time,Hardware,Voltage,Current
1626724513840,high-voltage-2,40,1.25832
time,Hardware,Voltage,Current
1626724513840,high-voltage-2,45,1.39562
time,Hardware,Voltage,Current
1626724513840,high-voltage-2,50,1.49817
time,Hardware,Voltage,Current
1626724513840,high-voltage-2,55,1.59144
time,Hardware,Voltage,Current
1626724513840,high-voltage-2,60,1.68372
time,Hardware,Voltage,Current
1626724513840,high-voltage-2,65,1.77063
time,Hardware,Voltage,Current
1626724513840,high-voltage-2,70,1.85556
time,Hardware,Voltage,Current
1626724513840,high-voltage-2,75,1.93509
time,Hardware,Voltage,Current
1626724513840,high-voltage-2,80,2.0126
time,Hardware,Voltage,Current
1626724513840,high-voltage-2,85,2.0856
time,Hardware,Voltage,Current
1626724513840,high-voltage-2,90,2.15741
time,Hardware,Voltage,Current
1626724513840,high-voltage-2,95,2.22438
time,Hardware,Voltage,Current
1626724513840,high-voltage-2,100,2.29218
