{
    "Data": [0.0, 0.0, 0.0, 0.0, 0.0, 0.0, 0.0, 0.0, 0.0, 0.0, 0.0, 0.0, 0.0, 0.0, 0.0, 0.0, 0.0, 0.0, 0.0, 0.0, 0.0, 0.0, 0.0, 0.0, 0.0, 0.0, 0.0, 0.0, 0.0, 0.0, 0.0, 0.0, 0.0, 0.0, 0.0, 0.0, 0.0, 0.0, 0.0, 0.0, 0.0, 0.0, 0.0, 0.0, 0.0, 0.0, 0.0, 0.0, 0.0, 0.0, 112.0, 238.0, 226.0, 242.0, 223.0, 271.0, 268.0, 211.0, 254.0, 232.0, 252.0, 260.0, 273.0, 288.0, 297.0, 288.0, 300.0, 297.0, 298.0, 292.0, 330.0, 307.0, 297.0, 327.0, 282.0, 303.0, 313.0, 359.0, 330.0, 358.0, 341.0, 337.0, 348.0, 354.0, 363.0, 376.0, 350.0, 361.0, 372.0, 359.0, 389.0, 358.0, 377.0, 352.0, 353.0, 381.0, 337.0, 390.0, 384.0, 363.0, 363.0, 364.0, 376.0, 334.0, 382.0, 384.0, 344.0, 370.0, 365.0, 351.0, 345.0, 361.0, 354.0, 339.0, 345.0, 339.0, 337.0, 340.0, 311.0, 319.0, 304.0, 293.0, 306.0, 353.0, 319.0, 274.0, 231.0, 278.0, 247.0, 217.0, 278.0, 239.0, 226.0, 243.0, 238.0, 236.0, 205.0, 226.0, 224.0, 234.0, 204.0, 213.0, 201.0, 188.0, 169.0, 184.0, 190.0, 159.0, 178.0, 160.0, 178.0, 140.0, 164.0, 162.0, 119.0, 162.0, 132.0, 126.0, 137.0, 127.0, 130.0, 118.0, 123.0, 126.0, 138.0, 155.0, 144.0, 171.0, 185.0, 187.0, 214.0, 202.0, 209.0, 263.0, 268.0, 291.0, 300.0, 364.0, 399.0, 428.0, 447.0, 502.0, 592.0, 607.0, 652.0, 657.0, 665.0, 690.0, 718.0, 762.0, 812.0, 796.0, 789.0, 799.0, 783.0, 757.0, 834.0, 719.0, 733.0, 702.0, 735.0, 681.0, 624.0, 598.0, 549.0, 511.0, 517.0, 433.0, 451.0, 392.0, 364.0, 323.0, 277.0, 286.0, 253.0, 219.0, 214.0, 180.0, 165.0, 126.0, 114.0, 96.0, 107.0, 76.0, 90.0, 99.0, 73.0, 60.0, 43.0, 52.0, 25.0, 37.0, 35.0, 30.0, 19.0, 24.0, 23.0, 22.0, 15.0, 20.0, 14.0, 18.0, 17.0, 14.0, 11.0, 6.0, 10.0, 10.0, 13.0, 15.0, 6.0, 8.0, 8.0, 7.0, 11.0, 21.0, 8.0, 14.0, 5.0, 6.0, 11.0, 8.0, 5.0, 9.0, 5.0, 5.0, 5.0, 7.0, 4.0, 7.0, 3.0, 8.0, 8.0, 2.0, 1.0, 5.0, 3.0, 12.0, 3.0, 3.0, 3.0, 3.0, 10.0, 5.0, 3.0, 5.0, 1.0, 1.0, 5.0, 6.0, 2.0, 2.0, 5.0, 3.0, 6.0, 3.0, 4.0, 4.0, 2.0, 1.0, 4.0, 3.0, 1.0, 1.0, 4.0, 2.0, 3.0, 3.0, 2.0, 2.0, 4.0, 5.0, 4.0, 1.0, 1.0, 5.0, 4.0, 1.0, 12.0, 9.0, 15.0, 13.0, 2.0, 0.0, 4.0, 0.0, 0.0, 0.0, 0.0, 0.0, 0.0, 0.0, 0.0, 0.0, 0.0, 0.0, 0.0, 0.0, 0.0, 0.0, 0.0, 0.0, 0.0, 0.0, 0.0, 0.0, 0.0, 0.0, 0.0, 0.0, 0.0, 0.0, 0.0, 0.0, 0.0, 0.0, 0.0, 0.0, 0.0, 0.0, 0.0, 0.0, 0.0, 0.0, 0.0, 0.0, 0.0, 0.0, 0.0, 0.0, 0.0, 0.0, 0.0, 0.0, 0.0, 0.0, 0.0, 0.0, 0.0, 0.0, 0.0, 0.0, 0.0, 0.0, 0.0, 0.0, 0.0, 0.0, 0.0, 0.0, 0.0, 0.0, 0.0, 0.0, 0.0, 0.0, 0.0, 0.0, 0.0, 0.0, 0.0, 0.0, 0.0, 0.0, 0.0, 0.0],
    "Name": "ThresholdDist-0",
    "Overflow": 0.0,
    "Type": "Histo1d",
    "Underflow": 0.0,
    "x": {
        "AxisTitle": "Threshold [e]",
        "Bins": 406,
        "High": 4055.0,
        "Low": -5.0
    },
    "y": {
        "AxisTitle": "Number of Pixels"
    },
    "z": {
        "AxisTitle": "z"
    }
}