{
    "Data": [[3028.0, 1241.0, 701.0, 468.0, 291.0, 254.0, 190.0, 151.0, 103.0, 102.0, 68.0, 54.0, 50.0, 44.0, 44.0, 28.0, 30.0, 30.0, 17.0, 29.0, 21.0, 20.0, 10.0, 20.0, 12.0, 11.0, 12.0, 7.0, 18.0, 9.0, 3.0, 14.0, 7.0, 8.0, 9.0, 7.0, 6.0, 7.0, 6.0, 8.0, 6.0, 5.0, 3.0, 4.0, 5.0, 4.0, 5.0, 8.0, 3.0], [3790.0, 1921.0, 1156.0, 767.0, 581.0, 435.0, 335.0, 254.0, 214.0, 211.0, 163.0, 133.0, 134.0, 104.0, 98.0, 76.0, 79.0, 60.0, 62.0, 50.0, 43.0, 35.0, 28.0, 41.0, 27.0, 20.0, 29.0, 25.0, 21.0, 9.0, 11.0, 17.0, 20.0, 9.0, 18.0, 15.0, 15.0, 8.0, 7.0, 15.0, 10.0, 9.0, 7.0, 8.0, 12.0, 4.0, 9.0, 8.0, 9.0], [4131.0, 2295.0, 1543.0, 1131.0, 899.0, 755.0, 608.0, 507.0, 404.0, 352.0, 304.0, 243.0, 229.0, 201.0, 206.0, 177.0, 152.0, 129.0, 109.0, 140.0, 106.0, 88.0, 83.0, 68.0, 75.0, 61.0, 58.0, 55.0, 42.0, 35.0, 38.0, 41.0, 28.0, 39.0, 27.0, 21.0, 34.0, 19.0, 10.0, 26.0, 29.0, 15.0, 16.0, 12.0, 21.0, 21.0, 14.0, 12.0, 15.0], [4340.0, 2468.0, 1730.0, 1385.0, 1091.0, 971.0, 848.0, 686.0, 645.0, 566.0, 529.0, 433.0, 393.0, 366.0, 344.0, 311.0, 282.0, 252.0, 240.0, 229.0, 192.0, 209.0, 177.0, 164.0, 143.0, 126.0, 122.0, 120.0, 102.0, 109.0, 84.0, 101.0, 83.0, 82.0, 64.0, 61.0, 58.0, 53.0, 61.0, 47.0, 44.0, 36.0, 38.0, 46.0, 31.0, 31.0, 20.0, 33.0, 28.0], [6023.0, 2699.0, 1861.0, 1425.0, 1193.0, 1049.0, 988.0, 866.0, 839.0, 675.0, 638.0, 584.0, 606.0, 541.0, 528.0, 465.0, 449.0, 445.0, 382.0, 362.0, 355.0, 331.0, 286.0, 299.0, 281.0, 269.0, 229.0, 220.0, 211.0, 214.0, 169.0, 207.0, 167.0, 156.0, 152.0, 135.0, 143.0, 147.0, 128.0, 108.0, 115.0, 113.0, 108.0, 96.0, 83.0, 79.0, 79.0, 57.0, 67.0], [7737.0, 4440.0, 3048.0, 2187.0, 1679.0, 1370.0, 1178.0, 1088.0, 882.0, 829.0, 775.0, 725.0, 693.0, 616.0, 599.0, 589.0, 523.0, 522.0, 538.0, 474.0, 471.0, 476.0, 429.0, 476.0, 392.0, 437.0, 418.0, 394.0, 347.0, 350.0, 359.0, 307.0, 302.0, 289.0, 266.0, 293.0, 269.0, 259.0, 235.0, 268.0, 215.0, 231.0, 201.0, 207.0, 200.0, 186.0, 168.0, 183.0, 177.0], [3920.0, 3723.0, 3339.0, 2978.0, 2566.0, 2319.0, 2081.0, 1808.0, 1700.0, 1417.0, 1317.0, 1136.0, 1031.0, 968.0, 871.0, 833.0, 828.0, 735.0, 690.0, 657.0, 629.0, 591.0, 558.0, 583.0, 542.0, 526.0, 539.0, 496.0, 523.0, 494.0, 481.0, 486.0, 481.0, 475.0, 504.0, 482.0, 470.0, 440.0, 436.0, 446.0, 423.0, 446.0, 379.0, 372.0, 409.0, 396.0, 414.0, 395.0, 419.0], [1020.0, 923.0, 1105.0, 1162.0, 1320.0, 1468.0, 1552.0, 1519.0, 1611.0, 1519.0, 1574.0, 1487.0, 1429.0, 1464.0, 1386.0, 1377.0, 1351.0, 1325.0, 1202.0, 1247.0, 1203.0, 1119.0, 1086.0, 994.0, 1023.0, 912.0, 940.0, 895.0, 819.0, 797.0, 766.0, 791.0, 748.0, 709.0, 696.0, 712.0, 614.0, 675.0, 646.0, 709.0, 730.0, 684.0, 690.0, 766.0, 731.0, 692.0, 795.0, 831.0, 903.0], [560.0, 288.0, 282.0, 272.0, 320.0, 343.0, 365.0, 396.0, 515.0, 498.0, 546.0, 598.0, 702.0, 780.0, 779.0, 816.0, 868.0, 996.0, 1067.0, 1051.0, 1121.0, 1079.0, 1183.0, 1081.0, 1266.0, 1295.0, 1217.0, 1276.0, 1265.0, 1273.0, 1401.0, 1353.0, 1363.0, 1366.0, 1321.0, 1303.0, 1258.0, 1313.0, 1292.0, 1324.0, 1283.0, 1205.0, 1302.0, 1277.0, 1268.0, 1327.0, 1418.0, 1529.0, 1791.0], [677.0, 236.0, 145.0, 115.0, 106.0, 106.0, 113.0, 131.0, 117.0, 147.0, 149.0, 152.0, 167.0, 183.0, 227.0, 228.0, 235.0, 269.0, 333.0, 319.0, 360.0, 395.0, 462.0, 453.0, 526.0, 610.0, 662.0, 683.0, 773.0, 853.0, 915.0, 977.0, 1083.0, 1040.0, 1257.0, 1387.0, 1494.0, 1526.0, 1731.0, 1864.0, 1924.0, 2053.0, 2201.0, 2355.0, 2580.0, 2688.0, 2927.0, 3161.0, 3758.0], [842.0, 277.0, 144.0, 75.0, 73.0, 64.0, 61.0, 54.0, 64.0, 48.0, 52.0, 70.0, 72.0, 57.0, 83.0, 63.0, 78.0, 86.0, 118.0, 120.0, 138.0, 117.0, 125.0, 153.0, 160.0, 200.0, 206.0, 234.0, 243.0, 284.0, 301.0, 344.0, 395.0, 416.0, 537.0, 559.0, 652.0, 714.0, 891.0, 1078.0, 1184.0, 1400.0, 1740.0, 2081.0, 2577.0, 3204.0, 3992.0, 5232.0, 7412.0], [1273.0, 392.0, 160.0, 91.0, 62.0, 45.0, 41.0, 42.0, 42.0, 39.0, 34.0, 25.0, 26.0, 35.0, 31.0, 30.0, 37.0, 39.0, 37.0, 48.0, 58.0, 43.0, 56.0, 43.0, 72.0, 68.0, 92.0, 85.0, 106.0, 120.0, 130.0, 135.0, 153.0, 172.0, 218.0, 258.0, 248.0, 315.0, 359.0, 408.0, 488.0, 631.0, 772.0, 975.0, 1253.0, 1721.0, 2606.0, 4281.0, 8458.0], [1840.0, 591.0, 280.0, 116.0, 80.0, 56.0, 40.0, 41.0, 26.0, 35.0, 24.0, 17.0, 23.0, 23.0, 24.0, 32.0, 20.0, 29.0, 16.0, 22.0, 25.0, 24.0, 26.0, 23.0, 29.0, 20.0, 31.0, 46.0, 36.0, 39.0, 36.0, 57.0, 70.0, 66.0, 94.0, 101.0, 131.0, 148.0, 150.0, 192.0, 224.0, 285.0, 339.0, 464.0, 576.0, 895.0, 1278.0, 2382.0, 5677.0], [2301.0, 973.0, 479.0, 271.0, 126.0, 85.0, 60.0, 43.0, 36.0, 23.0, 22.0, 14.0, 17.0, 19.0, 19.0, 14.0, 20.0, 12.0, 12.0, 13.0, 14.0, 14.0, 16.0, 19.0, 14.0, 20.0, 20.0, 20.0, 28.0, 20.0, 29.0, 23.0, 32.0, 32.0, 44.0, 39.0, 36.0, 47.0, 50.0, 86.0, 101.0, 123.0, 161.0, 236.0, 292.0, 445.0, 665.0, 1218.0, 3310.0], [2765.0, 1472.0, 816.0, 440.0, 241.0, 163.0, 106.0, 85.0, 63.0, 43.0, 27.0, 25.0, 19.0, 19.0, 13.0, 21.0, 16.0, 18.0, 11.0, 10.0, 14.0, 6.0, 11.0, 10.0, 6.0, 12.0, 4.0, 12.0, 15.0, 14.0, 14.0, 18.0, 9.0, 23.0, 21.0, 17.0, 17.0, 34.0, 28.0, 45.0, 49.0, 37.0, 63.0, 87.0, 136.0, 197.0, 358.0, 660.0, 1891.0], [3323.0, 1763.0, 1177.0, 745.0, 430.0, 331.0, 239.0, 139.0, 102.0, 63.0, 61.0, 41.0, 33.0, 22.0, 23.0, 14.0, 7.0, 13.0, 11.0, 15.0, 12.0, 9.0, 15.0, 10.0, 15.0, 10.0, 12.0, 13.0, 16.0, 10.0, 5.0, 7.0, 8.0, 6.0, 9.0, 10.0, 16.0, 23.0, 25.0, 21.0, 30.0, 27.0, 36.0, 45.0, 58.0, 85.0, 133.0, 338.0, 1076.0], [3524.0, 2096.0, 1443.0, 1015.0, 763.0, 537.0, 431.0, 324.0, 230.0, 167.0, 113.0, 96.0, 68.0, 63.0, 39.0, 34.0, 33.0, 25.0, 24.0, 19.0, 14.0, 13.0, 14.0, 3.0, 7.0, 4.0, 14.0, 6.0, 9.0, 8.0, 5.0, 8.0, 12.0, 6.0, 11.0, 12.0, 13.0, 18.0, 15.0, 17.0, 18.0, 14.0, 24.0, 19.0, 29.0, 49.0, 82.0, 146.0, 589.0], [3613.0, 2278.0, 1653.0, 1286.0, 1054.0, 805.0, 653.0, 559.0, 394.0, 313.0, 268.0, 195.0, 152.0, 118.0, 90.0, 89.0, 62.0, 45.0, 38.0, 31.0, 22.0, 32.0, 15.0, 16.0, 11.0, 22.0, 13.0, 4.0, 10.0, 6.0, 10.0, 6.0, 3.0, 13.0, 7.0, 7.0, 7.0, 6.0, 8.0, 9.0, 12.0, 10.0, 19.0, 21.0, 36.0, 29.0, 46.0, 83.0, 310.0], [3442.0, 2312.0, 1882.0, 1444.0, 1205.0, 1041.0, 863.0, 737.0, 597.0, 552.0, 494.0, 366.0, 310.0, 259.0, 218.0, 204.0, 136.0, 116.0, 115.0, 82.0, 61.0, 61.0, 60.0, 36.0, 31.0, 34.0, 26.0, 18.0, 17.0, 17.0, 12.0, 12.0, 12.0, 10.0, 4.0, 9.0, 8.0, 6.0, 5.0, 13.0, 7.0, 5.0, 8.0, 15.0, 17.0, 30.0, 26.0, 65.0, 161.0], [3001.0, 2187.0, 1921.0, 1556.0, 1342.0, 1225.0, 1117.0, 844.0, 819.0, 696.0, 649.0, 594.0, 494.0, 429.0, 404.0, 333.0, 287.0, 254.0, 224.0, 185.0, 159.0, 145.0, 111.0, 113.0, 86.0, 68.0, 59.0, 52.0, 42.0, 27.0, 32.0, 30.0, 19.0, 23.0, 14.0, 14.0, 9.0, 11.0, 5.0, 12.0, 8.0, 12.0, 8.0, 13.0, 12.0, 19.0, 18.0, 47.0, 105.0], [2329.0, 1862.0, 1712.0, 1474.0, 1340.0, 1161.0, 1146.0, 1040.0, 922.0, 903.0, 840.0, 769.0, 694.0, 617.0, 564.0, 530.0, 445.0, 435.0, 411.0, 365.0, 294.0, 265.0, 242.0, 199.0, 183.0, 186.0, 136.0, 143.0, 126.0, 99.0, 76.0, 56.0, 51.0, 38.0, 44.0, 34.0, 34.0, 25.0, 23.0, 17.0, 11.0, 23.0, 18.0, 13.0, 16.0, 13.0, 18.0, 30.0, 82.0], [1734.0, 1409.0, 1377.0, 1255.0, 1165.0, 1167.0, 1017.0, 1023.0, 953.0, 956.0, 895.0, 856.0, 801.0, 734.0, 703.0, 676.0, 620.0, 579.0, 540.0, 524.0, 466.0, 451.0, 361.0, 359.0, 342.0, 307.0, 261.0, 246.0, 215.0, 192.0, 155.0, 151.0, 136.0, 134.0, 107.0, 85.0, 69.0, 64.0, 47.0, 50.0, 47.0, 38.0, 24.0, 22.0, 15.0, 20.0, 16.0, 25.0, 55.0], [1043.0, 942.0, 951.0, 895.0, 927.0, 868.0, 885.0, 909.0, 866.0, 823.0, 892.0, 858.0, 827.0, 769.0, 771.0, 692.0, 763.0, 729.0, 702.0, 667.0, 604.0, 632.0, 608.0, 498.0, 533.0, 467.0, 452.0, 439.0, 366.0, 360.0, 339.0, 290.0, 280.0, 258.0, 228.0, 209.0, 179.0, 157.0, 150.0, 145.0, 97.0, 87.0, 71.0, 68.0, 54.0, 39.0, 39.0, 40.0, 51.0], [660.0, 546.0, 534.0, 537.0, 642.0, 598.0, 616.0, 589.0, 680.0, 662.0, 705.0, 674.0, 675.0, 732.0, 713.0, 737.0, 706.0, 694.0, 679.0, 728.0, 720.0, 632.0, 704.0, 662.0, 599.0, 650.0, 609.0, 631.0, 605.0, 516.0, 511.0, 534.0, 503.0, 418.0, 423.0, 368.0, 366.0, 309.0, 306.0, 274.0, 246.0, 207.0, 193.0, 172.0, 150.0, 115.0, 94.0, 90.0, 77.0], [430.0, 322.0, 312.0, 327.0, 335.0, 351.0, 414.0, 421.0, 428.0, 456.0, 513.0, 480.0, 481.0, 529.0, 614.0, 565.0, 589.0, 604.0, 610.0, 594.0, 597.0, 649.0, 672.0, 677.0, 670.0, 675.0, 706.0, 684.0, 695.0, 624.0, 641.0, 641.0, 625.0, 663.0, 650.0, 606.0, 563.0, 572.0, 562.0, 501.0, 498.0, 445.0, 383.0, 330.0, 333.0, 288.0, 237.0, 196.0, 175.0], [307.0, 210.0, 175.0, 175.0, 168.0, 207.0, 195.0, 207.0, 248.0, 241.0, 283.0, 292.0, 352.0, 352.0, 364.0, 368.0, 421.0, 439.0, 489.0, 466.0, 500.0, 518.0, 559.0, 606.0, 627.0, 590.0, 688.0, 629.0, 671.0, 706.0, 684.0, 718.0, 706.0, 753.0, 702.0, 692.0, 762.0, 736.0, 795.0, 694.0, 724.0, 696.0, 699.0, 659.0, 606.0, 607.0, 507.0, 489.0, 421.0], [292.0, 192.0, 115.0, 105.0, 112.0, 127.0, 116.0, 124.0, 125.0, 159.0, 169.0, 197.0, 175.0, 181.0, 202.0, 235.0, 229.0, 262.0, 269.0, 272.0, 319.0, 351.0, 363.0, 387.0, 449.0, 455.0, 501.0, 519.0, 551.0, 585.0, 596.0, 605.0, 623.0, 742.0, 760.0, 726.0, 791.0, 822.0, 875.0, 932.0, 926.0, 915.0, 955.0, 965.0, 977.0, 1030.0, 937.0, 942.0, 890.0], [256.0, 124.0, 86.0, 46.0, 54.0, 64.0, 75.0, 78.0, 75.0, 75.0, 100.0, 115.0, 110.0, 122.0, 104.0, 116.0, 121.0, 144.0, 168.0, 173.0, 201.0, 189.0, 213.0, 231.0, 241.0, 274.0, 290.0, 377.0, 372.0, 389.0, 435.0, 439.0, 521.0, 562.0, 571.0, 647.0, 682.0, 791.0, 789.0, 893.0, 954.0, 1077.0, 1095.0, 1195.0, 1249.0, 1354.0, 1433.0, 1578.0, 1669.0], [262.0, 147.0, 86.0, 65.0, 47.0, 38.0, 39.0, 59.0, 38.0, 53.0, 49.0, 41.0, 39.0, 43.0, 45.0, 49.0, 62.0, 84.0, 89.0, 84.0, 96.0, 126.0, 119.0, 122.0, 139.0, 173.0, 185.0, 221.0, 215.0, 256.0, 252.0, 271.0, 334.0, 372.0, 347.0, 465.0, 501.0, 580.0, 654.0, 694.0, 844.0, 966.0, 1003.0, 1194.0, 1338.0, 1581.0, 1840.0, 2112.0, 2510.0], [311.0, 129.0, 97.0, 60.0, 63.0, 69.0, 67.0, 33.0, 34.0, 41.0, 46.0, 48.0, 38.0, 58.0, 53.0, 42.0, 74.0, 49.0, 53.0, 50.0, 73.0, 84.0, 64.0, 60.0, 93.0, 86.0, 79.0, 80.0, 93.0, 112.0, 148.0, 174.0, 161.0, 198.0, 255.0, 293.0, 315.0, 328.0, 436.0, 540.0, 649.0, 711.0, 800.0, 1037.0, 1167.0, 1427.0, 1781.0, 2289.0, 3254.0], [247.0, 101.0, 71.0, 62.0, 80.0, 54.0, 60.0, 91.0, 65.0, 33.0, 31.0, 39.0, 18.0, 39.0, 52.0, 27.0, 18.0, 23.0, 19.0, 26.0, 57.0, 53.0, 44.0, 37.0, 27.0, 27.0, 53.0, 61.0, 46.0, 61.0, 63.0, 87.0, 95.0, 137.0, 123.0, 162.0, 187.0, 238.0, 221.0, 328.0, 402.0, 457.0, 623.0, 692.0, 901.0, 1187.0, 1629.0, 2216.0, 3418.0], [261.0, 89.0, 59.0, 46.0, 47.0, 30.0, 20.0, 25.0, 58.0, 23.0, 18.0, 29.0, 37.0, 11.0, 41.0, 55.0, 35.0, 18.0, 6.0, 40.0, 48.0, 39.0, 34.0, 26.0, 13.0, 14.0, 50.0, 13.0, 25.0, 38.0, 45.0, 42.0, 57.0, 51.0, 48.0, 82.0, 97.0, 123.0, 157.0, 173.0, 227.0, 282.0, 336.0, 439.0, 662.0, 881.0, 1303.0, 1874.0, 3448.0], [193.0, 80.0, 71.0, 48.0, 23.0, 28.0, 25.0, 54.0, 50.0, 17.0, 35.0, 27.0, 18.0, 12.0, 20.0, 29.0, 62.0, 58.0, 25.0, 2.0, 6.0, 9.0, 29.0, 18.0, 42.0, 37.0, 27.0, 73.0, 30.0, 8.0, 15.0, 33.0, 29.0, 24.0, 17.0, 20.0, 30.0, 48.0, 70.0, 99.0, 132.0, 143.0, 207.0, 262.0, 398.0, 581.0, 905.0, 1380.0, 2974.0], [243.0, 91.0, 48.0, 32.0, 40.0, 50.0, 51.0, 36.0, 40.0, 32.0, 42.0, 50.0, 28.0, 18.0, 30.0, 13.0, 42.0, 62.0, 40.0, 30.0, 51.0, 22.0, 4.0, 5.0, 6.0, 13.0, 18.0, 26.0, 19.0, 4.0, 3.0, 2.0, 3.0, 19.0, 9.0, 8.0, 10.0, 14.0, 25.0, 35.0, 53.0, 73.0, 93.0, 141.0, 199.0, 352.0, 586.0, 1042.0, 2325.0], [220.0, 96.0, 53.0, 36.0, 32.0, 37.0, 32.0, 42.0, 74.0, 62.0, 36.0, 13.0, 6.0, 7.0, 16.0, 25.0, 10.0, 27.0, 40.0, 18.0, 31.0, 12.0, 45.0, 31.0, 28.0, 22.0, 17.0, 11.0, 3.0, 27.0, 39.0, 9.0, 4.0, 10.0, 20.0, 2.0, 12.0, 29.0, 42.0, 7.0, 12.0, 23.0, 33.0, 58.0, 138.0, 167.0, 332.0, 628.0, 1674.0], [239.0, 100.0, 64.0, 94.0, 47.0, 33.0, 35.0, 40.0, 34.0, 7.0, 9.0, 48.0, 79.0, 17.0, 9.0, 11.0, 6.0, 47.0, 10.0, 24.0, 27.0, 13.0, 5.0, 9.0, 20.0, 6.0, 33.0, 20.0, 12.0, 30.0, 47.0, 17.0, 13.0, 13.0, 0.0, 2.0, 2.0, 2.0, 3.0, 3.0, 3.0, 16.0, 23.0, 43.0, 53.0, 91.0, 220.0, 382.0, 1147.0], [206.0, 105.0, 69.0, 76.0, 56.0, 25.0, 22.0, 15.0, 26.0, 24.0, 23.0, 35.0, 28.0, 18.0, 19.0, 22.0, 40.0, 5.0, 6.0, 2.0, 6.0, 7.0, 12.0, 27.0, 26.0, 1.0, 17.0, 8.0, 2.0, 21.0, 13.0, 21.0, 13.0, 44.0, 15.0, 17.0, 9.0, 5.0, 2.0, 15.0, 13.0, 4.0, 9.0, 27.0, 21.0, 35.0, 65.0, 220.0, 694.0], [225.0, 96.0, 38.0, 33.0, 29.0, 62.0, 32.0, 17.0, 12.0, 13.0, 7.0, 9.0, 18.0, 24.0, 4.0, 8.0, 11.0, 22.0, 64.0, 16.0, 21.0, 14.0, 24.0, 19.0, 11.0, 17.0, 9.0, 17.0, 23.0, 27.0, 4.0, 3.0, 20.0, 6.0, 0.0, 0.0, 2.0, 0.0, 0.0, 3.0, 4.0, 20.0, 25.0, 8.0, 6.0, 16.0, 44.0, 106.0, 429.0], [206.0, 74.0, 54.0, 38.0, 30.0, 28.0, 46.0, 23.0, 20.0, 9.0, 16.0, 37.0, 23.0, 6.0, 7.0, 8.0, 6.0, 8.0, 8.0, 25.0, 11.0, 29.0, 21.0, 9.0, 29.0, 31.0, 1.0, 1.0, 1.0, 3.0, 10.0, 40.0, 3.0, 0.0, 2.0, 1.0, 2.0, 1.0, 1.0, 0.0, 0.0, 5.0, 3.0, 1.0, 2.0, 9.0, 25.0, 73.0, 273.0], [234.0, 91.0, 53.0, 36.0, 44.0, 37.0, 27.0, 13.0, 13.0, 10.0, 13.0, 15.0, 13.0, 27.0, 8.0, 10.0, 5.0, 6.0, 6.0, 28.0, 4.0, 3.0, 3.0, 10.0, 2.0, 3.0, 4.0, 1.0, 5.0, 24.0, 1.0, 2.0, 29.0, 22.0, 1.0, 0.0, 0.0, 1.0, 8.0, 22.0, 12.0, 13.0, 3.0, 3.0, 1.0, 17.0, 19.0, 19.0, 119.0], [206.0, 89.0, 44.0, 43.0, 24.0, 28.0, 20.0, 33.0, 30.0, 35.0, 9.0, 16.0, 28.0, 18.0, 25.0, 30.0, 9.0, 12.0, 19.0, 9.0, 2.0, 5.0, 29.0, 4.0, 5.0, 4.0, 28.0, 1.0, 1.0, 3.0, 4.0, 1.0, 0.0, 2.0, 0.0, 1.0, 2.0, 1.0, 3.0, 0.0, 0.0, 1.0, 3.0, 3.0, 3.0, 2.0, 3.0, 9.0, 62.0], [231.0, 74.0, 53.0, 33.0, 32.0, 27.0, 32.0, 32.0, 20.0, 8.0, 13.0, 8.0, 8.0, 5.0, 8.0, 14.0, 18.0, 7.0, 9.0, 8.0, 9.0, 23.0, 2.0, 10.0, 23.0, 2.0, 1.0, 8.0, 5.0, 4.0, 0.0, 1.0, 1.0, 2.0, 3.0, 1.0, 3.0, 4.0, 12.0, 14.0, 1.0, 1.0, 1.0, 1.0, 2.0, 2.0, 5.0, 6.0, 42.0], [199.0, 89.0, 59.0, 38.0, 62.0, 28.0, 14.0, 18.0, 21.0, 15.0, 10.0, 7.0, 8.0, 12.0, 5.0, 7.0, 8.0, 4.0, 7.0, 8.0, 4.0, 3.0, 5.0, 1.0, 2.0, 23.0, 7.0, 1.0, 2.0, 3.0, 4.0, 2.0, 4.0, 0.0, 3.0, 1.0, 1.0, 0.0, 27.0, 1.0, 1.0, 2.0, 4.0, 1.0, 0.0, 0.0, 5.0, 3.0, 19.0], [228.0, 79.0, 47.0, 35.0, 29.0, 28.0, 21.0, 19.0, 16.0, 12.0, 13.0, 12.0, 12.0, 7.0, 8.0, 6.0, 26.0, 3.0, 5.0, 5.0, 4.0, 4.0, 2.0, 7.0, 2.0, 4.0, 7.0, 2.0, 2.0, 1.0, 16.0, 11.0, 2.0, 4.0, 1.0, 2.0, 3.0, 2.0, 0.0, 0.0, 1.0, 8.0, 21.0, 1.0, 2.0, 1.0, 1.0, 4.0, 17.0], [218.0, 86.0, 45.0, 38.0, 30.0, 25.0, 24.0, 18.0, 18.0, 16.0, 7.0, 9.0, 10.0, 3.0, 6.0, 3.0, 12.0, 8.0, 8.0, 4.0, 26.0, 7.0, 4.0, 3.0, 7.0, 25.0, 3.0, 2.0, 3.0, 0.0, 4.0, 0.0, 2.0, 2.0, 2.0, 1.0, 3.0, 1.0, 1.0, 2.0, 1.0, 2.0, 3.0, 2.0, 0.0, 9.0, 42.0, 2.0, 11.0], [188.0, 93.0, 65.0, 37.0, 28.0, 28.0, 25.0, 17.0, 25.0, 33.0, 21.0, 18.0, 6.0, 8.0, 32.0, 11.0, 25.0, 6.0, 3.0, 7.0, 5.0, 6.0, 10.0, 19.0, 2.0, 2.0, 4.0, 8.0, 22.0, 4.0, 2.0, 1.0, 2.0, 0.0, 2.0, 2.0, 1.0, 2.0, 4.0, 1.0, 0.0, 0.0, 0.0, 28.0, 2.0, 1.0, 3.0, 2.0, 3.0], [209.0, 99.0, 49.0, 22.0, 27.0, 27.0, 21.0, 14.0, 14.0, 19.0, 12.0, 13.0, 8.0, 12.0, 6.0, 4.0, 5.0, 6.0, 7.0, 27.0, 5.0, 8.0, 1.0, 10.0, 25.0, 7.0, 0.0, 4.0, 5.0, 1.0, 1.0, 10.0, 22.0, 20.0, 0.0, 1.0, 2.0, 2.0, 3.0, 3.0, 2.0, 0.0, 2.0, 1.0, 3.0, 1.0, 1.0, 25.0, 4.0], [200.0, 74.0, 54.0, 35.0, 32.0, 29.0, 21.0, 22.0, 13.0, 11.0, 8.0, 9.0, 10.0, 6.0, 4.0, 7.0, 4.0, 4.0, 11.0, 3.0, 5.0, 6.0, 4.0, 4.0, 5.0, 5.0, 2.0, 3.0, 24.0, 1.0, 5.0, 3.0, 2.0, 0.0, 4.0, 3.0, 2.0, 1.0, 0.0, 2.0, 2.0, 2.0, 4.0, 21.0, 2.0, 0.0, 2.0, 1.0, 4.0], [201.0, 91.0, 45.0, 32.0, 32.0, 22.0, 23.0, 18.0, 22.0, 14.0, 10.0, 7.0, 8.0, 9.0, 8.0, 6.0, 5.0, 6.0, 8.0, 3.0, 5.0, 5.0, 5.0, 5.0, 5.0, 4.0, 5.0, 1.0, 0.0, 4.0, 1.0, 1.0, 1.0, 5.0, 0.0, 0.0, 2.0, 0.0, 2.0, 0.0, 11.0, 18.0, 1.0, 0.0, 2.0, 2.0, 2.0, 3.0, 4.0], [211.0, 87.0, 53.0, 35.0, 25.0, 23.0, 23.0, 12.0, 13.0, 15.0, 9.0, 8.0, 7.0, 7.0, 9.0, 8.0, 9.0, 6.0, 3.0, 9.0, 3.0, 4.0, 5.0, 3.0, 8.0, 0.0, 2.0, 4.0, 4.0, 1.0, 2.0, 1.0, 3.0, 5.0, 2.0, 2.0, 0.0, 3.0, 0.0, 0.0, 0.0, 2.0, 3.0, 3.0, 1.0, 2.0, 0.0, 2.0, 3.0], [209.0, 78.0, 42.0, 34.0, 31.0, 13.0, 28.0, 15.0, 15.0, 13.0, 16.0, 7.0, 15.0, 10.0, 8.0, 7.0, 5.0, 3.0, 4.0, 6.0, 3.0, 4.0, 4.0, 3.0, 3.0, 5.0, 5.0, 10.0, 3.0, 2.0, 2.0, 3.0, 3.0, 2.0, 0.0, 1.0, 0.0, 2.0, 0.0, 0.0, 2.0, 3.0, 1.0, 1.0, 0.0, 0.0, 1.0, 0.0, 5.0]],
    "Name": "sCurve-0",
    "Overflow": 2543471.0,
    "Type": "Histo2d",
    "Underflow": 0.0,
    "x": {
        "AxisTitle": "Vcal",
        "Bins": 51,
        "High": 302.5,
        "Low": 47.5
    },
    "y": {
        "AxisTitle": "Occupancy",
        "Bins": 49,
        "High": 49.5,
        "Low": 0.5
    },
    "z": {
        "AxisTitle": "Number of pixels"
    }
}