{
    "Data": [[3161.0, 1572.0, 1046.0, 727.0, 571.0, 435.0, 345.0, 332.0, 237.0, 243.0, 186.0, 181.0, 160.0, 136.0, 141.0, 121.0, 111.0, 123.0, 79.0, 104.0, 97.0, 81.0, 80.0, 53.0, 71.0, 76.0, 59.0, 59.0, 59.0, 55.0, 39.0, 31.0, 29.0, 37.0, 44.0, 32.0, 24.0, 26.0, 31.0, 18.0, 25.0, 32.0, 18.0, 36.0, 31.0, 33.0, 36.0, 40.0, 30.0], [3228.0, 1792.0, 1300.0, 1040.0, 783.0, 647.0, 565.0, 507.0, 436.0, 360.0, 372.0, 330.0, 310.0, 235.0, 226.0, 190.0, 234.0, 200.0, 198.0, 176.0, 169.0, 136.0, 135.0, 126.0, 126.0, 126.0, 105.0, 102.0, 108.0, 103.0, 95.0, 71.0, 84.0, 83.0, 62.0, 66.0, 72.0, 52.0, 63.0, 46.0, 50.0, 57.0, 56.0, 52.0, 48.0, 38.0, 54.0, 47.0, 69.0], [2882.0, 1833.0, 1321.0, 1095.0, 886.0, 784.0, 710.0, 657.0, 585.0, 506.0, 523.0, 454.0, 453.0, 398.0, 370.0, 354.0, 332.0, 345.0, 291.0, 300.0, 257.0, 259.0, 232.0, 239.0, 240.0, 210.0, 184.0, 197.0, 175.0, 171.0, 165.0, 144.0, 154.0, 155.0, 154.0, 124.0, 125.0, 119.0, 132.0, 120.0, 109.0, 111.0, 121.0, 110.0, 104.0, 99.0, 114.0, 97.0, 113.0], [2288.0, 1475.0, 1142.0, 989.0, 840.0, 811.0, 738.0, 672.0, 647.0, 552.0, 553.0, 517.0, 510.0, 510.0, 470.0, 425.0, 455.0, 458.0, 393.0, 397.0, 371.0, 391.0, 327.0, 357.0, 363.0, 361.0, 311.0, 315.0, 300.0, 298.0, 291.0, 269.0, 223.0, 241.0, 278.0, 268.0, 241.0, 247.0, 240.0, 224.0, 209.0, 219.0, 229.0, 237.0, 207.0, 211.0, 202.0, 255.0, 256.0], [2145.0, 1154.0, 886.0, 791.0, 715.0, 577.0, 565.0, 577.0, 566.0, 502.0, 529.0, 507.0, 478.0, 445.0, 474.0, 495.0, 471.0, 480.0, 420.0, 453.0, 422.0, 423.0, 410.0, 391.0, 403.0, 417.0, 409.0, 417.0, 419.0, 358.0, 408.0, 418.0, 375.0, 375.0, 380.0, 403.0, 402.0, 413.0, 443.0, 401.0, 365.0, 381.0, 412.0, 424.0, 434.0, 471.0, 435.0, 505.0, 603.0], [3684.0, 1626.0, 1011.0, 772.0, 578.0, 587.0, 437.0, 486.0, 423.0, 446.0, 415.0, 401.0, 369.0, 405.0, 419.0, 395.0, 424.0, 404.0, 411.0, 389.0, 402.0, 362.0, 436.0, 387.0, 392.0, 437.0, 447.0, 421.0, 388.0, 452.0, 439.0, 456.0, 406.0, 501.0, 462.0, 470.0, 506.0, 510.0, 479.0, 529.0, 555.0, 591.0, 607.0, 626.0, 667.0, 743.0, 790.0, 970.0, 1209.0], [5051.0, 3008.0, 2045.0, 1570.0, 1283.0, 1069.0, 901.0, 746.0, 670.0, 590.0, 529.0, 503.0, 457.0, 446.0, 393.0, 370.0, 367.0, 382.0, 401.0, 370.0, 342.0, 344.0, 383.0, 351.0, 376.0, 356.0, 367.0, 389.0, 368.0, 370.0, 362.0, 401.0, 463.0, 415.0, 444.0, 475.0, 508.0, 525.0, 582.0, 583.0, 626.0, 674.0, 674.0, 850.0, 922.0, 934.0, 1162.0, 1451.0, 1993.0], [2012.0, 1668.0, 1500.0, 1444.0, 1318.0, 1317.0, 1206.0, 1226.0, 1146.0, 1142.0, 1065.0, 988.0, 915.0, 873.0, 839.0, 785.0, 763.0, 730.0, 636.0, 680.0, 618.0, 662.0, 606.0, 566.0, 537.0, 532.0, 559.0, 540.0, 530.0, 444.0, 504.0, 495.0, 491.0, 486.0, 508.0, 480.0, 479.0, 501.0, 518.0, 574.0, 578.0, 670.0, 716.0, 836.0, 940.0, 1173.0, 1312.0, 1835.0, 2863.0], [514.0, 336.0, 326.0, 303.0, 318.0, 345.0, 399.0, 358.0, 438.0, 425.0, 484.0, 524.0, 536.0, 539.0, 596.0, 554.0, 622.0, 644.0, 669.0, 650.0, 690.0, 734.0, 749.0, 741.0, 739.0, 816.0, 828.0, 844.0, 823.0, 869.0, 873.0, 850.0, 845.0, 936.0, 915.0, 902.0, 971.0, 958.0, 952.0, 947.0, 1040.0, 1005.0, 1100.0, 1176.0, 1242.0, 1438.0, 1626.0, 2164.0, 3478.0], [366.0, 152.0, 92.0, 83.0, 49.0, 44.0, 63.0, 79.0, 82.0, 87.0, 94.0, 104.0, 100.0, 116.0, 127.0, 121.0, 155.0, 146.0, 170.0, 172.0, 193.0, 196.0, 222.0, 239.0, 268.0, 265.0, 284.0, 272.0, 323.0, 374.0, 424.0, 440.0, 486.0, 563.0, 578.0, 686.0, 741.0, 808.0, 853.0, 1047.0, 1127.0, 1226.0, 1489.0, 1623.0, 1869.0, 2287.0, 2798.0, 3667.0, 5576.0], [379.0, 147.0, 89.0, 48.0, 48.0, 44.0, 26.0, 39.0, 37.0, 43.0, 43.0, 24.0, 45.0, 43.0, 46.0, 46.0, 61.0, 51.0, 41.0, 54.0, 45.0, 49.0, 41.0, 58.0, 59.0, 45.0, 69.0, 68.0, 94.0, 102.0, 116.0, 101.0, 107.0, 127.0, 163.0, 155.0, 190.0, 212.0, 252.0, 309.0, 368.0, 387.0, 516.0, 624.0, 944.0, 1299.0, 1905.0, 3111.0, 6416.0], [387.0, 135.0, 69.0, 43.0, 48.0, 28.0, 37.0, 34.0, 39.0, 28.0, 30.0, 36.0, 37.0, 38.0, 41.0, 33.0, 25.0, 32.0, 34.0, 34.0, 30.0, 37.0, 33.0, 30.0, 36.0, 28.0, 29.0, 34.0, 31.0, 24.0, 32.0, 39.0, 37.0, 51.0, 59.0, 51.0, 52.0, 62.0, 64.0, 83.0, 101.0, 136.0, 155.0, 201.0, 244.0, 392.0, 626.0, 1191.0, 3237.0], [446.0, 137.0, 76.0, 46.0, 46.0, 31.0, 19.0, 32.0, 28.0, 23.0, 22.0, 29.0, 28.0, 27.0, 37.0, 39.0, 38.0, 35.0, 29.0, 36.0, 24.0, 27.0, 23.0, 29.0, 18.0, 24.0, 27.0, 18.0, 16.0, 12.0, 23.0, 27.0, 16.0, 22.0, 19.0, 39.0, 32.0, 37.0, 34.0, 41.0, 46.0, 45.0, 54.0, 86.0, 99.0, 133.0, 239.0, 400.0, 1252.0], [652.0, 192.0, 82.0, 45.0, 46.0, 29.0, 17.0, 26.0, 27.0, 27.0, 30.0, 27.0, 37.0, 26.0, 31.0, 40.0, 32.0, 33.0, 29.0, 28.0, 25.0, 27.0, 19.0, 22.0, 29.0, 20.0, 20.0, 14.0, 20.0, 16.0, 19.0, 12.0, 8.0, 16.0, 12.0, 18.0, 22.0, 15.0, 20.0, 22.0, 20.0, 33.0, 28.0, 43.0, 38.0, 59.0, 114.0, 205.0, 539.0], [996.0, 256.0, 122.0, 69.0, 33.0, 33.0, 23.0, 28.0, 28.0, 25.0, 30.0, 21.0, 28.0, 26.0, 27.0, 32.0, 39.0, 21.0, 27.0, 31.0, 21.0, 20.0, 21.0, 23.0, 15.0, 20.0, 16.0, 14.0, 14.0, 20.0, 14.0, 20.0, 17.0, 20.0, 14.0, 22.0, 22.0, 14.0, 21.0, 17.0, 17.0, 13.0, 23.0, 27.0, 24.0, 35.0, 61.0, 94.0, 262.0], [1682.0, 492.0, 192.0, 74.0, 55.0, 33.0, 23.0, 15.0, 23.0, 23.0, 27.0, 26.0, 23.0, 37.0, 28.0, 32.0, 32.0, 33.0, 27.0, 30.0, 45.0, 20.0, 20.0, 17.0, 22.0, 20.0, 22.0, 20.0, 14.0, 10.0, 9.0, 15.0, 12.0, 15.0, 14.0, 6.0, 4.0, 19.0, 6.0, 7.0, 17.0, 22.0, 24.0, 29.0, 30.0, 32.0, 34.0, 72.0, 145.0], [2812.0, 957.0, 387.0, 194.0, 107.0, 55.0, 46.0, 27.0, 31.0, 25.0, 28.0, 19.0, 26.0, 24.0, 25.0, 27.0, 24.0, 19.0, 24.0, 25.0, 26.0, 22.0, 25.0, 22.0, 19.0, 10.0, 15.0, 19.0, 21.0, 25.0, 15.0, 14.0, 14.0, 15.0, 8.0, 14.0, 18.0, 15.0, 12.0, 20.0, 16.0, 9.0, 23.0, 13.0, 18.0, 13.0, 36.0, 49.0, 119.0], [4163.0, 1740.0, 894.0, 500.0, 274.0, 156.0, 128.0, 66.0, 54.0, 48.0, 33.0, 31.0, 32.0, 31.0, 37.0, 28.0, 27.0, 19.0, 28.0, 18.0, 20.0, 20.0, 18.0, 11.0, 26.0, 17.0, 10.0, 10.0, 11.0, 12.0, 13.0, 12.0, 6.0, 14.0, 4.0, 10.0, 9.0, 10.0, 4.0, 5.0, 8.0, 16.0, 11.0, 19.0, 33.0, 28.0, 39.0, 47.0, 70.0], [4894.0, 2603.0, 1494.0, 906.0, 569.0, 402.0, 284.0, 204.0, 157.0, 123.0, 99.0, 89.0, 65.0, 49.0, 39.0, 36.0, 41.0, 42.0, 31.0, 31.0, 30.0, 18.0, 24.0, 25.0, 18.0, 18.0, 22.0, 8.0, 8.0, 6.0, 9.0, 6.0, 6.0, 9.0, 8.0, 6.0, 6.0, 3.0, 10.0, 15.0, 4.0, 13.0, 14.0, 10.0, 12.0, 13.0, 27.0, 22.0, 84.0], [4830.0, 3052.0, 2121.0, 1477.0, 1078.0, 793.0, 599.0, 470.0, 363.0, 265.0, 187.0, 171.0, 143.0, 108.0, 92.0, 71.0, 80.0, 67.0, 65.0, 58.0, 44.0, 48.0, 35.0, 33.0, 29.0, 26.0, 25.0, 24.0, 15.0, 19.0, 19.0, 7.0, 9.0, 12.0, 5.0, 16.0, 6.0, 10.0, 3.0, 5.0, 14.0, 10.0, 8.0, 7.0, 11.0, 14.0, 14.0, 14.0, 42.0], [4001.0, 3012.0, 2458.0, 1868.0, 1507.0, 1242.0, 1025.0, 783.0, 646.0, 614.0, 450.0, 385.0, 308.0, 279.0, 252.0, 196.0, 170.0, 157.0, 116.0, 100.0, 89.0, 67.0, 59.0, 63.0, 56.0, 39.0, 37.0, 25.0, 21.0, 17.0, 22.0, 17.0, 17.0, 21.0, 22.0, 19.0, 21.0, 20.0, 18.0, 13.0, 21.0, 18.0, 16.0, 9.0, 7.0, 10.0, 10.0, 13.0, 31.0], [2961.0, 2496.0, 2187.0, 1945.0, 1723.0, 1517.0, 1285.0, 1105.0, 930.0, 824.0, 737.0, 660.0, 559.0, 474.0, 453.0, 386.0, 343.0, 291.0, 263.0, 246.0, 210.0, 157.0, 144.0, 122.0, 114.0, 81.0, 97.0, 75.0, 53.0, 52.0, 50.0, 39.0, 34.0, 31.0, 31.0, 27.0, 12.0, 16.0, 21.0, 20.0, 23.0, 18.0, 15.0, 25.0, 23.0, 22.0, 15.0, 25.0, 36.0], [1872.0, 1638.0, 1606.0, 1568.0, 1488.0, 1414.0, 1329.0, 1277.0, 1103.0, 1066.0, 943.0, 871.0, 813.0, 739.0, 699.0, 643.0, 583.0, 520.0, 469.0, 456.0, 387.0, 353.0, 340.0, 277.0, 237.0, 207.0, 202.0, 175.0, 159.0, 136.0, 115.0, 103.0, 96.0, 82.0, 84.0, 73.0, 47.0, 45.0, 41.0, 27.0, 32.0, 30.0, 23.0, 30.0, 23.0, 25.0, 23.0, 36.0, 50.0], [1107.0, 970.0, 952.0, 1076.0, 1073.0, 1126.0, 1080.0, 1043.0, 1015.0, 1010.0, 973.0, 943.0, 918.0, 891.0, 840.0, 812.0, 791.0, 765.0, 676.0, 650.0, 621.0, 544.0, 541.0, 530.0, 450.0, 410.0, 398.0, 381.0, 296.0, 273.0, 256.0, 238.0, 228.0, 219.0, 178.0, 148.0, 147.0, 131.0, 111.0, 92.0, 92.0, 79.0, 57.0, 55.0, 51.0, 31.0, 41.0, 24.0, 64.0], [691.0, 564.0, 517.0, 585.0, 594.0, 655.0, 707.0, 733.0, 762.0, 764.0, 829.0, 813.0, 795.0, 813.0, 843.0, 819.0, 839.0, 795.0, 813.0, 778.0, 733.0, 749.0, 719.0, 653.0, 648.0, 642.0, 586.0, 570.0, 538.0, 481.0, 479.0, 458.0, 446.0, 392.0, 371.0, 336.0, 325.0, 276.0, 287.0, 255.0, 217.0, 168.0, 177.0, 147.0, 117.0, 99.0, 93.0, 64.0, 86.0], [434.0, 294.0, 291.0, 282.0, 323.0, 360.0, 398.0, 432.0, 496.0, 472.0, 515.0, 537.0, 544.0, 625.0, 654.0, 674.0, 674.0, 700.0, 704.0, 749.0, 721.0, 767.0, 746.0, 698.0, 791.0, 678.0, 722.0, 748.0, 701.0, 650.0, 664.0, 643.0, 651.0, 625.0, 585.0, 595.0, 556.0, 515.0, 499.0, 463.0, 429.0, 402.0, 376.0, 336.0, 309.0, 263.0, 237.0, 169.0, 176.0], [362.0, 182.0, 131.0, 137.0, 149.0, 194.0, 191.0, 209.0, 238.0, 274.0, 310.0, 304.0, 350.0, 345.0, 416.0, 430.0, 472.0, 488.0, 507.0, 555.0, 575.0, 608.0, 609.0, 623.0, 694.0, 665.0, 673.0, 707.0, 715.0, 769.0, 743.0, 779.0, 757.0, 741.0, 761.0, 747.0, 770.0, 817.0, 705.0, 755.0, 682.0, 679.0, 707.0, 662.0, 631.0, 535.0, 507.0, 469.0, 381.0], [337.0, 133.0, 81.0, 69.0, 74.0, 60.0, 80.0, 103.0, 109.0, 133.0, 152.0, 189.0, 161.0, 217.0, 234.0, 227.0, 269.0, 277.0, 309.0, 334.0, 392.0, 365.0, 407.0, 438.0, 444.0, 535.0, 547.0, 533.0, 636.0, 599.0, 654.0, 669.0, 705.0, 777.0, 795.0, 815.0, 898.0, 872.0, 912.0, 929.0, 924.0, 921.0, 952.0, 980.0, 960.0, 1045.0, 998.0, 949.0, 937.0], [293.0, 107.0, 59.0, 34.0, 40.0, 40.0, 37.0, 35.0, 45.0, 74.0, 63.0, 80.0, 100.0, 107.0, 104.0, 137.0, 147.0, 157.0, 167.0, 177.0, 213.0, 236.0, 237.0, 257.0, 283.0, 304.0, 360.0, 346.0, 374.0, 406.0, 494.0, 520.0, 555.0, 612.0, 667.0, 718.0, 772.0, 815.0, 885.0, 963.0, 991.0, 1048.0, 1128.0, 1245.0, 1325.0, 1407.0, 1422.0, 1593.0, 1658.0], [298.0, 114.0, 59.0, 37.0, 25.0, 25.0, 32.0, 29.0, 27.0, 42.0, 41.0, 39.0, 37.0, 39.0, 66.0, 63.0, 68.0, 68.0, 102.0, 89.0, 109.0, 117.0, 137.0, 149.0, 149.0, 149.0, 177.0, 214.0, 242.0, 232.0, 261.0, 326.0, 346.0, 446.0, 444.0, 494.0, 556.0, 660.0, 697.0, 768.0, 861.0, 974.0, 1148.0, 1259.0, 1440.0, 1697.0, 1847.0, 2110.0, 2646.0], [296.0, 127.0, 46.0, 29.0, 26.0, 18.0, 16.0, 19.0, 20.0, 27.0, 30.0, 20.0, 26.0, 28.0, 30.0, 34.0, 40.0, 45.0, 44.0, 49.0, 53.0, 64.0, 57.0, 82.0, 85.0, 67.0, 99.0, 104.0, 108.0, 139.0, 146.0, 154.0, 191.0, 241.0, 248.0, 274.0, 338.0, 393.0, 505.0, 498.0, 644.0, 754.0, 930.0, 1120.0, 1265.0, 1524.0, 2016.0, 2559.0, 3438.0], [291.0, 107.0, 46.0, 44.0, 20.0, 19.0, 23.0, 9.0, 12.0, 16.0, 23.0, 23.0, 20.0, 24.0, 22.0, 34.0, 19.0, 30.0, 39.0, 33.0, 33.0, 26.0, 39.0, 31.0, 42.0, 38.0, 51.0, 46.0, 63.0, 59.0, 66.0, 71.0, 91.0, 108.0, 126.0, 167.0, 199.0, 199.0, 274.0, 336.0, 405.0, 460.0, 623.0, 776.0, 973.0, 1266.0, 1732.0, 2557.0, 3803.0], [312.0, 106.0, 51.0, 30.0, 29.0, 16.0, 14.0, 11.0, 17.0, 13.0, 25.0, 19.0, 22.0, 24.0, 17.0, 29.0, 32.0, 27.0, 19.0, 30.0, 23.0, 29.0, 12.0, 20.0, 23.0, 24.0, 25.0, 24.0, 23.0, 37.0, 34.0, 45.0, 43.0, 66.0, 66.0, 67.0, 77.0, 100.0, 134.0, 158.0, 226.0, 261.0, 359.0, 449.0, 641.0, 891.0, 1324.0, 2032.0, 3803.0], [297.0, 110.0, 59.0, 35.0, 19.0, 17.0, 17.0, 10.0, 10.0, 18.0, 26.0, 20.0, 21.0, 17.0, 27.0, 25.0, 26.0, 27.0, 16.0, 24.0, 30.0, 23.0, 14.0, 16.0, 18.0, 25.0, 11.0, 11.0, 13.0, 18.0, 11.0, 18.0, 22.0, 25.0, 23.0, 29.0, 37.0, 40.0, 64.0, 85.0, 100.0, 135.0, 191.0, 228.0, 356.0, 481.0, 921.0, 1532.0, 3273.0], [314.0, 103.0, 56.0, 39.0, 17.0, 18.0, 21.0, 22.0, 13.0, 23.0, 16.0, 14.0, 26.0, 14.0, 22.0, 16.0, 17.0, 26.0, 23.0, 17.0, 27.0, 31.0, 26.0, 28.0, 14.0, 16.0, 11.0, 14.0, 12.0, 7.0, 10.0, 4.0, 13.0, 11.0, 10.0, 23.0, 21.0, 14.0, 37.0, 25.0, 57.0, 50.0, 101.0, 110.0, 169.0, 302.0, 516.0, 1019.0, 2402.0], [302.0, 120.0, 43.0, 30.0, 28.0, 16.0, 17.0, 18.0, 13.0, 22.0, 17.0, 19.0, 22.0, 16.0, 26.0, 28.0, 26.0, 19.0, 27.0, 13.0, 29.0, 26.0, 17.0, 22.0, 13.0, 22.0, 18.0, 8.0, 10.0, 11.0, 6.0, 9.0, 1.0, 7.0, 8.0, 7.0, 11.0, 6.0, 12.0, 10.0, 25.0, 29.0, 40.0, 43.0, 80.0, 138.0, 275.0, 546.0, 1629.0], [316.0, 116.0, 46.0, 33.0, 26.0, 14.0, 16.0, 14.0, 13.0, 17.0, 18.0, 8.0, 30.0, 20.0, 17.0, 31.0, 28.0, 41.0, 25.0, 14.0, 18.0, 27.0, 20.0, 12.0, 10.0, 14.0, 9.0, 14.0, 5.0, 6.0, 11.0, 6.0, 6.0, 8.0, 12.0, 6.0, 4.0, 5.0, 3.0, 11.0, 11.0, 8.0, 17.0, 24.0, 48.0, 67.0, 136.0, 279.0, 1028.0], [326.0, 104.0, 47.0, 35.0, 29.0, 23.0, 13.0, 18.0, 22.0, 19.0, 18.0, 23.0, 13.0, 30.0, 16.0, 16.0, 24.0, 26.0, 20.0, 25.0, 22.0, 20.0, 18.0, 18.0, 19.0, 12.0, 12.0, 13.0, 8.0, 14.0, 8.0, 8.0, 8.0, 4.0, 5.0, 7.0, 5.0, 2.0, 9.0, 8.0, 10.0, 3.0, 8.0, 12.0, 15.0, 21.0, 49.0, 150.0, 591.0], [288.0, 111.0, 44.0, 39.0, 20.0, 15.0, 16.0, 19.0, 17.0, 11.0, 17.0, 25.0, 32.0, 18.0, 21.0, 23.0, 29.0, 22.0, 27.0, 23.0, 22.0, 20.0, 18.0, 18.0, 17.0, 14.0, 9.0, 17.0, 4.0, 5.0, 5.0, 3.0, 9.0, 3.0, 9.0, 3.0, 7.0, 7.0, 5.0, 5.0, 5.0, 4.0, 6.0, 5.0, 13.0, 15.0, 33.0, 69.0, 318.0], [308.0, 107.0, 57.0, 28.0, 21.0, 26.0, 17.0, 15.0, 19.0, 18.0, 19.0, 16.0, 19.0, 18.0, 24.0, 21.0, 24.0, 19.0, 24.0, 25.0, 19.0, 20.0, 24.0, 9.0, 17.0, 15.0, 15.0, 13.0, 10.0, 6.0, 7.0, 12.0, 5.0, 3.0, 4.0, 9.0, 8.0, 4.0, 4.0, 9.0, 6.0, 6.0, 6.0, 6.0, 5.0, 9.0, 11.0, 46.0, 152.0], [331.0, 109.0, 65.0, 38.0, 24.0, 23.0, 14.0, 7.0, 15.0, 18.0, 16.0, 24.0, 17.0, 22.0, 18.0, 21.0, 24.0, 22.0, 16.0, 28.0, 19.0, 30.0, 18.0, 22.0, 18.0, 14.0, 7.0, 17.0, 7.0, 9.0, 3.0, 5.0, 7.0, 10.0, 9.0, 5.0, 4.0, 6.0, 8.0, 8.0, 8.0, 6.0, 7.0, 8.0, 6.0, 6.0, 4.0, 26.0, 82.0], [319.0, 100.0, 61.0, 33.0, 21.0, 19.0, 17.0, 18.0, 18.0, 17.0, 13.0, 11.0, 37.0, 17.0, 20.0, 18.0, 23.0, 28.0, 31.0, 20.0, 21.0, 19.0, 17.0, 11.0, 12.0, 8.0, 28.0, 11.0, 10.0, 5.0, 8.0, 11.0, 9.0, 6.0, 9.0, 5.0, 8.0, 6.0, 3.0, 4.0, 7.0, 4.0, 6.0, 4.0, 4.0, 11.0, 14.0, 16.0, 64.0], [281.0, 126.0, 53.0, 36.0, 27.0, 10.0, 15.0, 16.0, 17.0, 17.0, 20.0, 19.0, 19.0, 17.0, 27.0, 23.0, 19.0, 19.0, 23.0, 24.0, 17.0, 27.0, 17.0, 14.0, 19.0, 18.0, 19.0, 15.0, 12.0, 6.0, 4.0, 9.0, 2.0, 3.0, 9.0, 12.0, 6.0, 5.0, 7.0, 4.0, 8.0, 5.0, 6.0, 7.0, 5.0, 4.0, 6.0, 15.0, 36.0], [314.0, 105.0, 50.0, 34.0, 17.0, 17.0, 18.0, 16.0, 19.0, 11.0, 16.0, 13.0, 18.0, 22.0, 19.0, 26.0, 17.0, 32.0, 25.0, 19.0, 27.0, 24.0, 14.0, 19.0, 18.0, 14.0, 13.0, 17.0, 14.0, 10.0, 8.0, 3.0, 7.0, 3.0, 8.0, 4.0, 4.0, 9.0, 4.0, 5.0, 4.0, 4.0, 6.0, 6.0, 7.0, 6.0, 9.0, 16.0, 24.0], [279.0, 111.0, 68.0, 33.0, 27.0, 18.0, 16.0, 19.0, 19.0, 12.0, 10.0, 10.0, 24.0, 30.0, 21.0, 15.0, 22.0, 20.0, 20.0, 26.0, 27.0, 16.0, 29.0, 18.0, 20.0, 18.0, 12.0, 8.0, 13.0, 7.0, 7.0, 9.0, 9.0, 4.0, 6.0, 3.0, 8.0, 3.0, 5.0, 5.0, 4.0, 9.0, 3.0, 8.0, 9.0, 14.0, 12.0, 15.0, 25.0], [318.0, 108.0, 69.0, 35.0, 25.0, 19.0, 14.0, 11.0, 17.0, 14.0, 16.0, 17.0, 21.0, 14.0, 20.0, 25.0, 19.0, 31.0, 20.0, 18.0, 31.0, 27.0, 24.0, 16.0, 18.0, 12.0, 19.0, 7.0, 10.0, 9.0, 5.0, 8.0, 7.0, 7.0, 6.0, 8.0, 3.0, 3.0, 9.0, 4.0, 9.0, 4.0, 6.0, 12.0, 7.0, 6.0, 9.0, 12.0, 27.0], [291.0, 120.0, 46.0, 32.0, 19.0, 24.0, 21.0, 13.0, 20.0, 20.0, 17.0, 14.0, 19.0, 16.0, 25.0, 29.0, 33.0, 14.0, 23.0, 25.0, 25.0, 26.0, 19.0, 15.0, 13.0, 9.0, 18.0, 10.0, 14.0, 6.0, 12.0, 6.0, 4.0, 8.0, 4.0, 3.0, 8.0, 3.0, 5.0, 6.0, 4.0, 6.0, 8.0, 6.0, 7.0, 6.0, 4.0, 11.0, 26.0], [310.0, 111.0, 48.0, 37.0, 26.0, 17.0, 24.0, 17.0, 15.0, 12.0, 18.0, 21.0, 18.0, 20.0, 29.0, 16.0, 29.0, 20.0, 17.0, 22.0, 19.0, 17.0, 16.0, 17.0, 23.0, 17.0, 16.0, 10.0, 8.0, 14.0, 6.0, 7.0, 6.0, 7.0, 1.0, 8.0, 9.0, 10.0, 3.0, 9.0, 5.0, 4.0, 6.0, 4.0, 6.0, 2.0, 5.0, 9.0, 22.0], [302.0, 111.0, 58.0, 48.0, 26.0, 14.0, 26.0, 17.0, 24.0, 12.0, 13.0, 13.0, 27.0, 15.0, 22.0, 23.0, 20.0, 20.0, 18.0, 27.0, 18.0, 19.0, 23.0, 20.0, 17.0, 15.0, 11.0, 12.0, 6.0, 12.0, 6.0, 10.0, 9.0, 6.0, 6.0, 6.0, 5.0, 2.0, 7.0, 6.0, 8.0, 8.0, 7.0, 11.0, 6.0, 6.0, 12.0, 14.0, 20.0], [304.0, 96.0, 60.0, 45.0, 24.0, 15.0, 17.0, 20.0, 12.0, 14.0, 14.0, 13.0, 22.0, 21.0, 27.0, 27.0, 24.0, 23.0, 26.0, 22.0, 19.0, 28.0, 22.0, 22.0, 11.0, 13.0, 11.0, 10.0, 8.0, 9.0, 9.0, 7.0, 8.0, 9.0, 5.0, 5.0, 8.0, 4.0, 3.0, 6.0, 4.0, 5.0, 9.0, 9.0, 7.0, 9.0, 7.0, 13.0, 25.0], [293.0, 94.0, 61.0, 29.0, 32.0, 19.0, 15.0, 21.0, 13.0, 18.0, 23.0, 22.0, 30.0, 20.0, 21.0, 28.0, 22.0, 22.0, 10.0, 24.0, 23.0, 17.0, 17.0, 12.0, 14.0, 14.0, 17.0, 11.0, 13.0, 9.0, 9.0, 12.0, 7.0, 5.0, 8.0, 4.0, 7.0, 1.0, 8.0, 9.0, 6.0, 4.0, 7.0, 7.0, 8.0, 6.0, 6.0, 11.0, 24.0]],
    "Name": "sCurve-0",
    "Overflow": 2707628.0,
    "Type": "Histo2d",
    "Underflow": 0.0,
    "x": {
        "AxisTitle": "Vcal",
        "Bins": 51,
        "High": 302.5,
        "Low": 47.5
    },
    "y": {
        "AxisTitle": "Occupancy",
        "Bins": 49,
        "High": 49.5,
        "Low": 0.5
    },
    "z": {
        "AxisTitle": "Number of pixels"
    }
}