{
    "Data": [36.0, 59.0, 0.0, 0.0, 4.0, 90.0, 568.0, 1762.0, 3416.0, 4804.0, 4918.0, 3939.0, 3116.0, 2611.0, 2554.0, 2948.0, 3375.0, 3616.0, 3599.0, 3278.0, 2592.0, 1754.0, 1154.0, 720.0, 593.0, 599.0, 762.0, 1032.0, 1353.0, 1633.0, 1972.0, 2130.0, 2296.0, 2327.0, 2100.0, 1889.0, 1555.0, 1253.0, 1017.0, 723.0, 491.0, 364.0, 257.0, 181.0, 118.0, 67.0, 51.0, 49.0, 31.0, 14.0, 27.0, 16.0, 8.0, 11.0, 9.0, 6.0, 6.0, 5.0, 1.0, 2.0, 3.0, 5.0, 3.0, 4.0, 0.0, 2.0, 2.0, 0.0, 2.0, 2.0, 0.0],
    "Name": "NoiseDist-0",
    "Overflow": 14.0,
    "Type": "Histo1d",
    "Underflow": 0.0,
    "x": {
        "AxisTitle": "Noise [e]",
        "Bins": 71,
        "High": 356.0,
        "Low": -2.0
    },
    "y": {
        "AxisTitle": "Number of Pixels"
    },
    "z": {
        "AxisTitle": "z"
    }
}