time,Hardware,Voltage,Current
1621625632049,high-voltage-3,1,0.0964793
time,Hardware,Voltage,Current
1621625632049,high-voltage-3,2,0.103601
time,Hardware,Voltage,Current
1621625632049,high-voltage-3,3,0.108877
time,Hardware,Voltage,Current
1621625632049,high-voltage-3,4,0.113854
time,Hardware,Voltage,Current
1621625632049,high-voltage-3,5,0.118359
time,Hardware,Voltage,Current
1621625632049,high-voltage-3,6,0.121809
time,Hardware,Voltage,Current
1621625632049,high-voltage-3,7,0.122609
time,Hardware,Voltage,Current
1621625632049,high-voltage-3,1.26496e-07,0.126644
time,Hardware,Voltage,Current
1621625632049,high-voltage-3,9,0.129833
time,Hardware,Voltage,Current
1621625632049,high-voltage-3,10,0.132916
time,Hardware,Voltage,Current
1621625632049,high-voltage-3,11,0.135018
time,Hardware,Voltage,Current
1621625632049,high-voltage-3,12,0.140009
time,Hardware,Voltage,Current
1621625632049,high-voltage-3,13,0.142863
time,Hardware,Voltage,Current
1621625632049,high-voltage-3,14,0.145017
time,Hardware,Voltage,Current
1621625632049,high-voltage-3,15,0.148806
time,Hardware,Voltage,Current
1621625632049,high-voltage-3,16,0.150316
time,Hardware,Voltage,Current
1621625632049,high-voltage-3,17,0.152262
time,Hardware,Voltage,Current
1621625632049,high-voltage-3,18,0.155891
time,Hardware,Voltage,Current
1621625632049,high-voltage-3,19,0.157452
time,Hardware,Voltage,Current
1621625632049,high-voltage-3,20,0.159941
time,Hardware,Voltage,Current
1621625632049,high-voltage-3,25,0.170362
time,Hardware,Voltage,Current
1621625632049,high-voltage-3,30,0.17924
time,Hardware,Voltage,Current
1621625632049,high-voltage-3,35,0.187512
time,Hardware,Voltage,Current
1621625632049,high-voltage-3,40,0.193536
time,Hardware,Voltage,Current
1621625632049,high-voltage-3,45,0.200655
time,Hardware,Voltage,Current
1621625632049,high-voltage-3,50,0.206513
time,Hardware,Voltage,Current
1621625632049,high-voltage-3,55,0.210973
time,Hardware,Voltage,Current
1621625632049,high-voltage-3,60,0.217789
time,Hardware,Voltage,Current
1621625632049,high-voltage-3,65,0.222656
time,Hardware,Voltage,Current
1621625632049,high-voltage-3,70,0.228621
time,Hardware,Voltage,Current
1621625632049,high-voltage-3,75,0.234001
time,Hardware,Voltage,Current
1621625632049,high-voltage-3,80,0.239466
time,Hardware,Voltage,Current
1621625632049,high-voltage-3,85,0.242313
time,Hardware,Voltage,Current
1621625632049,high-voltage-3,90,0.248219
time,Hardware,Voltage,Current
1621625632049,high-voltage-3,95,0.252461
time,Hardware,Voltage,Current
1621625632049,high-voltage-3,100,0.256638
