{
    "Data": [[2086.0, 941.0, 532.0, 340.0, 306.0, 223.0, 181.0, 145.0, 123.0, 97.0, 96.0, 114.0, 68.0, 85.0, 68.0, 57.0, 46.0, 31.0, 34.0, 30.0, 35.0, 25.0, 25.0, 40.0, 27.0, 33.0, 26.0, 19.0, 26.0, 12.0, 16.0, 17.0, 18.0, 17.0, 18.0, 19.0, 27.0, 13.0, 29.0, 15.0, 10.0, 13.0, 14.0, 13.0, 15.0, 11.0, 10.0, 25.0, 14.0], [2806.0, 1309.0, 865.0, 609.0, 460.0, 337.0, 311.0, 258.0, 210.0, 190.0, 171.0, 171.0, 129.0, 114.0, 128.0, 101.0, 96.0, 102.0, 65.0, 61.0, 64.0, 71.0, 58.0, 73.0, 58.0, 34.0, 53.0, 41.0, 41.0, 36.0, 43.0, 38.0, 31.0, 36.0, 32.0, 37.0, 40.0, 30.0, 26.0, 24.0, 26.0, 22.0, 29.0, 24.0, 26.0, 21.0, 28.0, 18.0, 22.0], [3121.0, 1678.0, 1181.0, 864.0, 754.0, 583.0, 488.0, 418.0, 336.0, 319.0, 312.0, 237.0, 217.0, 218.0, 200.0, 170.0, 169.0, 163.0, 150.0, 131.0, 138.0, 133.0, 123.0, 106.0, 91.0, 107.0, 92.0, 101.0, 74.0, 77.0, 93.0, 66.0, 63.0, 67.0, 60.0, 75.0, 59.0, 64.0, 54.0, 55.0, 51.0, 38.0, 50.0, 45.0, 55.0, 57.0, 47.0, 46.0, 54.0], [3549.0, 1885.0, 1304.0, 986.0, 874.0, 700.0, 633.0, 519.0, 493.0, 495.0, 468.0, 425.0, 367.0, 362.0, 297.0, 313.0, 263.0, 267.0, 270.0, 199.0, 232.0, 174.0, 182.0, 188.0, 196.0, 142.0, 159.0, 160.0, 127.0, 156.0, 144.0, 127.0, 123.0, 108.0, 123.0, 136.0, 116.0, 104.0, 112.0, 126.0, 109.0, 118.0, 99.0, 96.0, 92.0, 120.0, 103.0, 102.0, 108.0], [5261.0, 2433.0, 1523.0, 1230.0, 929.0, 843.0, 718.0, 645.0, 601.0, 532.0, 508.0, 473.0, 426.0, 464.0, 396.0, 403.0, 396.0, 386.0, 363.0, 356.0, 300.0, 336.0, 321.0, 267.0, 289.0, 277.0, 268.0, 249.0, 236.0, 261.0, 240.0, 231.0, 206.0, 205.0, 177.0, 213.0, 205.0, 186.0, 194.0, 179.0, 181.0, 207.0, 212.0, 203.0, 192.0, 201.0, 227.0, 237.0, 238.0], [6871.0, 3992.0, 2759.0, 2017.0, 1641.0, 1254.0, 1030.0, 928.0, 797.0, 744.0, 603.0, 593.0, 549.0, 572.0, 535.0, 491.0, 437.0, 447.0, 442.0, 402.0, 395.0, 381.0, 380.0, 354.0, 342.0, 354.0, 348.0, 329.0, 344.0, 362.0, 314.0, 363.0, 366.0, 311.0, 335.0, 316.0, 338.0, 346.0, 318.0, 345.0, 302.0, 300.0, 353.0, 330.0, 346.0, 397.0, 415.0, 460.0, 508.0], [3603.0, 3144.0, 2795.0, 2410.0, 2268.0, 2029.0, 1776.0, 1586.0, 1470.0, 1409.0, 1236.0, 1102.0, 1072.0, 1005.0, 900.0, 841.0, 785.0, 699.0, 701.0, 620.0, 610.0, 583.0, 578.0, 539.0, 527.0, 498.0, 472.0, 469.0, 460.0, 449.0, 428.0, 437.0, 383.0, 500.0, 484.0, 449.0, 447.0, 466.0, 463.0, 475.0, 498.0, 508.0, 548.0, 519.0, 604.0, 655.0, 658.0, 783.0, 978.0], [1030.0, 969.0, 952.0, 1026.0, 1015.0, 1061.0, 1100.0, 1138.0, 1159.0, 1157.0, 1132.0, 1124.0, 1113.0, 1139.0, 1165.0, 1173.0, 1083.0, 1102.0, 1094.0, 1059.0, 1104.0, 1033.0, 1022.0, 982.0, 969.0, 891.0, 942.0, 896.0, 879.0, 888.0, 897.0, 810.0, 821.0, 780.0, 755.0, 774.0, 735.0, 698.0, 772.0, 753.0, 756.0, 733.0, 827.0, 849.0, 854.0, 937.0, 1101.0, 1246.0, 1686.0], [420.0, 329.0, 302.0, 289.0, 310.0, 323.0, 367.0, 355.0, 370.0, 417.0, 425.0, 477.0, 470.0, 445.0, 514.0, 565.0, 570.0, 611.0, 667.0, 658.0, 691.0, 747.0, 763.0, 788.0, 815.0, 855.0, 830.0, 999.0, 962.0, 991.0, 1013.0, 1078.0, 1101.0, 1139.0, 1243.0, 1229.0, 1289.0, 1234.0, 1275.0, 1424.0, 1468.0, 1426.0, 1504.0, 1553.0, 1603.0, 1754.0, 1933.0, 2215.0, 2886.0], [264.0, 152.0, 134.0, 103.0, 127.0, 118.0, 115.0, 153.0, 129.0, 128.0, 146.0, 162.0, 180.0, 173.0, 182.0, 221.0, 193.0, 209.0, 224.0, 244.0, 259.0, 239.0, 303.0, 281.0, 307.0, 340.0, 403.0, 358.0, 440.0, 462.0, 490.0, 544.0, 592.0, 656.0, 768.0, 780.0, 900.0, 949.0, 1052.0, 1174.0, 1349.0, 1469.0, 1704.0, 1886.0, 2255.0, 2602.0, 3182.0, 4035.0, 5698.0], [266.0, 125.0, 78.0, 53.0, 56.0, 62.0, 53.0, 50.0, 70.0, 74.0, 59.0, 72.0, 71.0, 75.0, 70.0, 79.0, 98.0, 100.0, 82.0, 103.0, 105.0, 119.0, 130.0, 122.0, 134.0, 141.0, 155.0, 170.0, 195.0, 197.0, 207.0, 194.0, 243.0, 246.0, 262.0, 324.0, 401.0, 404.0, 477.0, 574.0, 592.0, 698.0, 817.0, 1113.0, 1379.0, 1816.0, 2542.0, 3932.0, 7079.0], [226.0, 115.0, 59.0, 58.0, 63.0, 52.0, 32.0, 40.0, 41.0, 42.0, 43.0, 49.0, 51.0, 47.0, 47.0, 40.0, 43.0, 37.0, 36.0, 38.0, 48.0, 41.0, 50.0, 57.0, 61.0, 75.0, 67.0, 68.0, 76.0, 87.0, 95.0, 100.0, 107.0, 159.0, 129.0, 162.0, 183.0, 190.0, 231.0, 251.0, 238.0, 347.0, 421.0, 546.0, 646.0, 872.0, 1284.0, 2120.0, 5004.0], [267.0, 95.0, 74.0, 52.0, 48.0, 42.0, 23.0, 38.0, 31.0, 33.0, 39.0, 27.0, 31.0, 41.0, 34.0, 26.0, 36.0, 33.0, 39.0, 29.0, 29.0, 32.0, 28.0, 20.0, 30.0, 30.0, 29.0, 30.0, 34.0, 38.0, 35.0, 56.0, 52.0, 61.0, 57.0, 73.0, 89.0, 97.0, 118.0, 140.0, 125.0, 176.0, 214.0, 285.0, 343.0, 453.0, 655.0, 1096.0, 2791.0], [259.0, 95.0, 75.0, 51.0, 50.0, 27.0, 27.0, 30.0, 25.0, 31.0, 46.0, 31.0, 21.0, 28.0, 30.0, 23.0, 26.0, 17.0, 26.0, 26.0, 26.0, 19.0, 22.0, 12.0, 28.0, 32.0, 22.0, 21.0, 31.0, 31.0, 24.0, 28.0, 29.0, 36.0, 28.0, 43.0, 48.0, 42.0, 48.0, 57.0, 56.0, 95.0, 108.0, 130.0, 190.0, 212.0, 334.0, 650.0, 1675.0], [317.0, 109.0, 67.0, 41.0, 44.0, 40.0, 36.0, 25.0, 30.0, 34.0, 30.0, 26.0, 27.0, 22.0, 31.0, 24.0, 26.0, 26.0, 24.0, 20.0, 21.0, 24.0, 17.0, 17.0, 19.0, 18.0, 15.0, 11.0, 10.0, 16.0, 15.0, 21.0, 15.0, 25.0, 22.0, 31.0, 28.0, 33.0, 45.0, 37.0, 48.0, 47.0, 65.0, 75.0, 70.0, 121.0, 175.0, 323.0, 910.0], [453.0, 132.0, 50.0, 41.0, 23.0, 26.0, 32.0, 38.0, 18.0, 30.0, 24.0, 32.0, 30.0, 22.0, 37.0, 30.0, 32.0, 27.0, 13.0, 19.0, 19.0, 17.0, 15.0, 13.0, 12.0, 15.0, 14.0, 15.0, 21.0, 15.0, 18.0, 18.0, 25.0, 17.0, 29.0, 19.0, 16.0, 10.0, 17.0, 27.0, 32.0, 33.0, 37.0, 54.0, 56.0, 61.0, 96.0, 200.0, 509.0], [809.0, 210.0, 98.0, 54.0, 42.0, 21.0, 25.0, 26.0, 22.0, 24.0, 24.0, 22.0, 21.0, 24.0, 18.0, 25.0, 24.0, 27.0, 22.0, 20.0, 25.0, 17.0, 19.0, 9.0, 14.0, 12.0, 14.0, 13.0, 14.0, 13.0, 11.0, 19.0, 12.0, 23.0, 16.0, 16.0, 25.0, 15.0, 31.0, 29.0, 20.0, 27.0, 31.0, 44.0, 41.0, 38.0, 62.0, 103.0, 289.0], [1346.0, 429.0, 189.0, 94.0, 50.0, 49.0, 22.0, 34.0, 30.0, 26.0, 18.0, 15.0, 32.0, 23.0, 20.0, 21.0, 18.0, 21.0, 14.0, 12.0, 11.0, 7.0, 14.0, 6.0, 8.0, 9.0, 9.0, 7.0, 11.0, 21.0, 30.0, 23.0, 19.0, 19.0, 25.0, 14.0, 17.0, 17.0, 29.0, 18.0, 18.0, 28.0, 23.0, 31.0, 32.0, 39.0, 49.0, 83.0, 182.0], [1908.0, 745.0, 394.0, 226.0, 127.0, 103.0, 71.0, 46.0, 45.0, 32.0, 33.0, 27.0, 20.0, 28.0, 31.0, 21.0, 12.0, 13.0, 12.0, 15.0, 16.0, 8.0, 11.0, 11.0, 8.0, 6.0, 12.0, 14.0, 10.0, 12.0, 7.0, 10.0, 14.0, 9.0, 13.0, 14.0, 19.0, 14.0, 35.0, 24.0, 22.0, 19.0, 22.0, 31.0, 36.0, 27.0, 50.0, 72.0, 132.0], [2579.0, 1252.0, 707.0, 413.0, 272.0, 169.0, 157.0, 112.0, 90.0, 81.0, 64.0, 49.0, 44.0, 42.0, 31.0, 30.0, 26.0, 13.0, 18.0, 15.0, 17.0, 13.0, 16.0, 13.0, 5.0, 7.0, 9.0, 4.0, 6.0, 10.0, 8.0, 9.0, 8.0, 7.0, 8.0, 10.0, 14.0, 18.0, 14.0, 20.0, 15.0, 27.0, 17.0, 21.0, 27.0, 35.0, 55.0, 52.0, 98.0], [3233.0, 1648.0, 1075.0, 693.0, 484.0, 396.0, 265.0, 218.0, 171.0, 143.0, 121.0, 103.0, 103.0, 79.0, 50.0, 61.0, 58.0, 44.0, 24.0, 25.0, 23.0, 27.0, 24.0, 21.0, 15.0, 16.0, 14.0, 17.0, 8.0, 6.0, 11.0, 10.0, 6.0, 9.0, 12.0, 8.0, 15.0, 9.0, 11.0, 13.0, 8.0, 9.0, 18.0, 15.0, 13.0, 23.0, 33.0, 56.0, 80.0], [3647.0, 2075.0, 1382.0, 974.0, 762.0, 575.0, 412.0, 389.0, 312.0, 275.0, 224.0, 182.0, 168.0, 125.0, 133.0, 117.0, 76.0, 90.0, 73.0, 58.0, 47.0, 33.0, 32.0, 29.0, 34.0, 30.0, 17.0, 26.0, 28.0, 19.0, 13.0, 14.0, 17.0, 15.0, 24.0, 10.0, 13.0, 21.0, 15.0, 20.0, 14.0, 16.0, 17.0, 13.0, 15.0, 10.0, 18.0, 26.0, 77.0], [3725.0, 2318.0, 1720.0, 1238.0, 996.0, 782.0, 717.0, 539.0, 497.0, 427.0, 388.0, 330.0, 310.0, 237.0, 224.0, 199.0, 203.0, 160.0, 136.0, 131.0, 116.0, 87.0, 82.0, 69.0, 68.0, 80.0, 50.0, 54.0, 39.0, 45.0, 47.0, 41.0, 32.0, 27.0, 27.0, 26.0, 26.0, 25.0, 15.0, 17.0, 21.0, 19.0, 24.0, 17.0, 28.0, 17.0, 25.0, 17.0, 34.0], [3166.0, 2340.0, 1821.0, 1449.0, 1196.0, 1048.0, 842.0, 754.0, 655.0, 613.0, 532.0, 542.0, 426.0, 432.0, 388.0, 313.0, 300.0, 252.0, 239.0, 233.0, 195.0, 199.0, 166.0, 141.0, 167.0, 128.0, 123.0, 103.0, 102.0, 91.0, 75.0, 75.0, 73.0, 76.0, 56.0, 48.0, 47.0, 52.0, 48.0, 31.0, 39.0, 36.0, 33.0, 33.0, 43.0, 21.0, 31.0, 29.0, 38.0], [2301.0, 1923.0, 1551.0, 1434.0, 1243.0, 1173.0, 1026.0, 919.0, 855.0, 752.0, 741.0, 666.0, 582.0, 566.0, 529.0, 455.0, 445.0, 429.0, 375.0, 390.0, 341.0, 266.0, 268.0, 286.0, 252.0, 262.0, 211.0, 211.0, 162.0, 172.0, 153.0, 161.0, 164.0, 163.0, 131.0, 106.0, 121.0, 96.0, 94.0, 89.0, 80.0, 81.0, 63.0, 66.0, 51.0, 46.0, 48.0, 46.0, 62.0], [1435.0, 1285.0, 1204.0, 1152.0, 1100.0, 1001.0, 958.0, 948.0, 841.0, 776.0, 764.0, 737.0, 737.0, 651.0, 608.0, 623.0, 604.0, 587.0, 524.0, 507.0, 458.0, 446.0, 420.0, 393.0, 376.0, 396.0, 333.0, 353.0, 309.0, 344.0, 297.0, 278.0, 270.0, 248.0, 236.0, 221.0, 203.0, 172.0, 211.0, 161.0, 161.0, 152.0, 143.0, 149.0, 123.0, 94.0, 118.0, 102.0, 101.0], [823.0, 786.0, 759.0, 733.0, 744.0, 669.0, 764.0, 755.0, 718.0, 738.0, 703.0, 716.0, 687.0, 637.0, 613.0, 602.0, 663.0, 605.0, 593.0, 593.0, 578.0, 563.0, 514.0, 544.0, 504.0, 500.0, 477.0, 487.0, 449.0, 417.0, 420.0, 448.0, 415.0, 401.0, 399.0, 343.0, 346.0, 362.0, 312.0, 347.0, 317.0, 273.0, 268.0, 267.0, 259.0, 231.0, 239.0, 215.0, 206.0], [441.0, 386.0, 360.0, 405.0, 396.0, 458.0, 473.0, 453.0, 498.0, 526.0, 529.0, 513.0, 536.0, 528.0, 575.0, 578.0, 508.0, 576.0, 572.0, 525.0, 545.0, 576.0, 577.0, 571.0, 556.0, 582.0, 576.0, 564.0, 564.0, 523.0, 527.0, 579.0, 529.0, 529.0, 509.0, 556.0, 530.0, 475.0, 458.0, 535.0, 494.0, 508.0, 498.0, 547.0, 476.0, 483.0, 465.0, 444.0, 470.0], [249.0, 212.0, 193.0, 208.0, 211.0, 224.0, 248.0, 256.0, 243.0, 303.0, 339.0, 360.0, 377.0, 356.0, 356.0, 397.0, 418.0, 440.0, 406.0, 432.0, 465.0, 499.0, 452.0, 457.0, 509.0, 519.0, 528.0, 549.0, 536.0, 581.0, 589.0, 582.0, 615.0, 576.0, 644.0, 620.0, 644.0, 702.0, 692.0, 656.0, 680.0, 697.0, 683.0, 761.0, 782.0, 748.0, 802.0, 768.0, 915.0], [186.0, 90.0, 87.0, 78.0, 104.0, 126.0, 159.0, 143.0, 159.0, 163.0, 172.0, 175.0, 200.0, 217.0, 242.0, 237.0, 257.0, 257.0, 270.0, 321.0, 296.0, 329.0, 330.0, 358.0, 378.0, 418.0, 382.0, 449.0, 447.0, 477.0, 496.0, 512.0, 548.0, 553.0, 580.0, 624.0, 657.0, 688.0, 717.0, 760.0, 822.0, 836.0, 880.0, 944.0, 982.0, 1050.0, 1163.0, 1289.0, 1612.0], [179.0, 71.0, 86.0, 49.0, 53.0, 41.0, 65.0, 68.0, 68.0, 90.0, 107.0, 94.0, 108.0, 107.0, 112.0, 110.0, 114.0, 139.0, 149.0, 159.0, 164.0, 175.0, 174.0, 189.0, 233.0, 218.0, 269.0, 304.0, 323.0, 340.0, 388.0, 403.0, 406.0, 406.0, 446.0, 486.0, 577.0, 597.0, 652.0, 715.0, 763.0, 824.0, 965.0, 1032.0, 1178.0, 1225.0, 1498.0, 1770.0, 2359.0], [172.0, 73.0, 46.0, 28.0, 23.0, 20.0, 15.0, 29.0, 33.0, 37.0, 57.0, 58.0, 62.0, 72.0, 87.0, 69.0, 85.0, 96.0, 97.0, 104.0, 78.0, 94.0, 99.0, 112.0, 106.0, 129.0, 167.0, 169.0, 139.0, 162.0, 187.0, 257.0, 252.0, 277.0, 347.0, 353.0, 382.0, 446.0, 453.0, 534.0, 621.0, 687.0, 766.0, 950.0, 1122.0, 1314.0, 1550.0, 2059.0, 2975.0], [167.0, 92.0, 43.0, 20.0, 37.0, 19.0, 24.0, 12.0, 46.0, 45.0, 62.0, 33.0, 61.0, 56.0, 88.0, 49.0, 25.0, 22.0, 27.0, 39.0, 37.0, 58.0, 32.0, 46.0, 46.0, 55.0, 60.0, 85.0, 70.0, 92.0, 131.0, 119.0, 127.0, 182.0, 194.0, 205.0, 194.0, 269.0, 275.0, 331.0, 414.0, 460.0, 583.0, 727.0, 827.0, 1129.0, 1447.0, 2057.0, 3343.0], [140.0, 83.0, 26.0, 19.0, 15.0, 21.0, 35.0, 23.0, 12.0, 13.0, 15.0, 18.0, 21.0, 37.0, 15.0, 46.0, 45.0, 29.0, 42.0, 29.0, 13.0, 38.0, 21.0, 53.0, 52.0, 35.0, 23.0, 32.0, 30.0, 38.0, 45.0, 83.0, 59.0, 89.0, 77.0, 106.0, 125.0, 146.0, 175.0, 202.0, 239.0, 276.0, 355.0, 451.0, 579.0, 779.0, 1108.0, 1657.0, 3144.0], [169.0, 49.0, 36.0, 35.0, 20.0, 15.0, 13.0, 39.0, 23.0, 10.0, 12.0, 20.0, 57.0, 36.0, 30.0, 29.0, 17.0, 37.0, 18.0, 12.0, 8.0, 11.0, 18.0, 7.0, 8.0, 28.0, 10.0, 10.0, 20.0, 16.0, 17.0, 20.0, 26.0, 28.0, 37.0, 42.0, 72.0, 58.0, 57.0, 96.0, 123.0, 183.0, 210.0, 270.0, 356.0, 517.0, 762.0, 1223.0, 2605.0], [171.0, 65.0, 28.0, 20.0, 14.0, 12.0, 15.0, 61.0, 28.0, 14.0, 13.0, 16.0, 36.0, 21.0, 10.0, 10.0, 12.0, 23.0, 37.0, 9.0, 11.0, 8.0, 3.0, 9.0, 6.0, 10.0, 4.0, 11.0, 21.0, 24.0, 41.0, 16.0, 13.0, 8.0, 17.0, 28.0, 30.0, 51.0, 29.0, 37.0, 59.0, 61.0, 118.0, 123.0, 211.0, 273.0, 471.0, 781.0, 1889.0], [147.0, 60.0, 28.0, 22.0, 16.0, 23.0, 34.0, 11.0, 13.0, 19.0, 11.0, 20.0, 15.0, 21.0, 19.0, 11.0, 14.0, 32.0, 40.0, 19.0, 10.0, 4.0, 2.0, 8.0, 3.0, 18.0, 15.0, 10.0, 23.0, 8.0, 8.0, 6.0, 7.0, 6.0, 31.0, 16.0, 7.0, 6.0, 24.0, 20.0, 22.0, 50.0, 35.0, 48.0, 99.0, 143.0, 202.0, 481.0, 1202.0], [181.0, 55.0, 27.0, 13.0, 16.0, 16.0, 21.0, 32.0, 11.0, 19.0, 11.0, 17.0, 18.0, 52.0, 26.0, 31.0, 30.0, 21.0, 14.0, 7.0, 14.0, 26.0, 14.0, 6.0, 3.0, 9.0, 4.0, 7.0, 16.0, 21.0, 5.0, 7.0, 4.0, 4.0, 7.0, 6.0, 10.0, 28.0, 37.0, 38.0, 9.0, 22.0, 30.0, 28.0, 47.0, 58.0, 100.0, 241.0, 687.0], [134.0, 61.0, 36.0, 20.0, 13.0, 12.0, 19.0, 12.0, 19.0, 9.0, 23.0, 29.0, 9.0, 16.0, 19.0, 15.0, 13.0, 14.0, 17.0, 12.0, 9.0, 13.0, 6.0, 2.0, 9.0, 4.0, 4.0, 1.0, 9.0, 6.0, 22.0, 14.0, 7.0, 4.0, 8.0, 7.0, 15.0, 25.0, 10.0, 8.0, 11.0, 9.0, 16.0, 30.0, 14.0, 29.0, 55.0, 123.0, 415.0], [155.0, 61.0, 28.0, 17.0, 14.0, 12.0, 19.0, 10.0, 18.0, 15.0, 19.0, 20.0, 17.0, 36.0, 7.0, 9.0, 9.0, 8.0, 17.0, 37.0, 12.0, 11.0, 8.0, 11.0, 28.0, 11.0, 3.0, 5.0, 16.0, 17.0, 4.0, 3.0, 6.0, 6.0, 5.0, 11.0, 25.0, 4.0, 13.0, 10.0, 10.0, 5.0, 11.0, 10.0, 16.0, 29.0, 31.0, 50.0, 188.0], [153.0, 60.0, 37.0, 21.0, 17.0, 14.0, 7.0, 15.0, 40.0, 10.0, 18.0, 8.0, 17.0, 20.0, 13.0, 8.0, 15.0, 10.0, 19.0, 18.0, 10.0, 9.0, 9.0, 7.0, 3.0, 5.0, 6.0, 5.0, 7.0, 1.0, 3.0, 4.0, 5.0, 4.0, 11.0, 5.0, 7.0, 8.0, 9.0, 9.0, 6.0, 13.0, 6.0, 4.0, 11.0, 9.0, 19.0, 18.0, 93.0], [142.0, 58.0, 37.0, 15.0, 15.0, 13.0, 10.0, 16.0, 14.0, 18.0, 16.0, 11.0, 18.0, 20.0, 16.0, 21.0, 17.0, 64.0, 25.0, 9.0, 10.0, 11.0, 6.0, 3.0, 11.0, 3.0, 3.0, 4.0, 7.0, 11.0, 5.0, 8.0, 6.0, 5.0, 5.0, 7.0, 7.0, 3.0, 4.0, 11.0, 11.0, 10.0, 8.0, 3.0, 12.0, 6.0, 9.0, 34.0, 45.0], [140.0, 54.0, 27.0, 21.0, 13.0, 22.0, 39.0, 10.0, 14.0, 20.0, 23.0, 26.0, 10.0, 18.0, 21.0, 13.0, 14.0, 11.0, 14.0, 9.0, 11.0, 11.0, 9.0, 30.0, 2.0, 4.0, 4.0, 4.0, 4.0, 2.0, 5.0, 4.0, 6.0, 4.0, 8.0, 12.0, 11.0, 15.0, 26.0, 9.0, 10.0, 4.0, 4.0, 5.0, 5.0, 9.0, 10.0, 10.0, 25.0], [156.0, 56.0, 43.0, 13.0, 16.0, 18.0, 20.0, 10.0, 16.0, 14.0, 14.0, 14.0, 18.0, 12.0, 7.0, 20.0, 17.0, 15.0, 18.0, 10.0, 4.0, 7.0, 13.0, 5.0, 6.0, 6.0, 5.0, 2.0, 3.0, 5.0, 5.0, 3.0, 7.0, 8.0, 11.0, 9.0, 6.0, 10.0, 4.0, 6.0, 4.0, 9.0, 10.0, 8.0, 14.0, 4.0, 13.0, 25.0, 18.0], [146.0, 55.0, 35.0, 20.0, 16.0, 11.0, 12.0, 8.0, 17.0, 11.0, 17.0, 15.0, 14.0, 10.0, 15.0, 25.0, 14.0, 12.0, 9.0, 6.0, 9.0, 12.0, 11.0, 6.0, 6.0, 3.0, 4.0, 8.0, 8.0, 6.0, 2.0, 4.0, 4.0, 7.0, 9.0, 10.0, 7.0, 6.0, 8.0, 10.0, 8.0, 4.0, 5.0, 6.0, 7.0, 9.0, 12.0, 7.0, 9.0], [154.0, 56.0, 16.0, 23.0, 16.0, 18.0, 15.0, 16.0, 12.0, 9.0, 16.0, 16.0, 19.0, 18.0, 14.0, 11.0, 13.0, 11.0, 15.0, 17.0, 10.0, 8.0, 5.0, 9.0, 7.0, 8.0, 4.0, 4.0, 5.0, 7.0, 6.0, 7.0, 7.0, 7.0, 3.0, 3.0, 6.0, 8.0, 10.0, 11.0, 8.0, 9.0, 4.0, 6.0, 10.0, 3.0, 7.0, 7.0, 14.0], [133.0, 68.0, 34.0, 16.0, 13.0, 11.0, 9.0, 16.0, 4.0, 14.0, 20.0, 15.0, 28.0, 17.0, 10.0, 11.0, 11.0, 13.0, 13.0, 8.0, 7.0, 11.0, 7.0, 12.0, 12.0, 6.0, 7.0, 4.0, 6.0, 4.0, 3.0, 2.0, 9.0, 8.0, 4.0, 8.0, 6.0, 5.0, 5.0, 11.0, 6.0, 4.0, 11.0, 6.0, 6.0, 10.0, 7.0, 4.0, 8.0], [151.0, 48.0, 37.0, 22.0, 13.0, 21.0, 10.0, 11.0, 17.0, 19.0, 14.0, 18.0, 9.0, 12.0, 19.0, 10.0, 15.0, 6.0, 12.0, 9.0, 13.0, 8.0, 11.0, 6.0, 9.0, 4.0, 5.0, 4.0, 11.0, 4.0, 5.0, 1.0, 5.0, 6.0, 6.0, 7.0, 11.0, 6.0, 5.0, 5.0, 5.0, 11.0, 8.0, 11.0, 8.0, 6.0, 6.0, 8.0, 13.0], [163.0, 62.0, 24.0, 16.0, 13.0, 13.0, 12.0, 12.0, 18.0, 17.0, 14.0, 11.0, 17.0, 16.0, 16.0, 14.0, 15.0, 16.0, 24.0, 11.0, 3.0, 12.0, 6.0, 8.0, 6.0, 2.0, 2.0, 6.0, 3.0, 6.0, 3.0, 3.0, 6.0, 8.0, 9.0, 4.0, 9.0, 6.0, 8.0, 13.0, 10.0, 6.0, 6.0, 6.0, 4.0, 7.0, 4.0, 7.0, 7.0], [140.0, 53.0, 33.0, 29.0, 9.0, 14.0, 19.0, 14.0, 7.0, 16.0, 23.0, 21.0, 13.0, 15.0, 8.0, 11.0, 13.0, 15.0, 15.0, 14.0, 9.0, 10.0, 7.0, 6.0, 4.0, 4.0, 3.0, 8.0, 4.0, 6.0, 6.0, 9.0, 3.0, 9.0, 1.0, 3.0, 4.0, 8.0, 6.0, 5.0, 5.0, 9.0, 10.0, 9.0, 8.0, 1.0, 6.0, 7.0, 7.0], [153.0, 49.0, 32.0, 20.0, 18.0, 14.0, 23.0, 17.0, 14.0, 15.0, 20.0, 20.0, 13.0, 14.0, 9.0, 14.0, 16.0, 10.0, 8.0, 13.0, 4.0, 5.0, 7.0, 9.0, 5.0, 6.0, 2.0, 8.0, 8.0, 8.0, 10.0, 5.0, 9.0, 4.0, 8.0, 6.0, 8.0, 4.0, 4.0, 1.0, 2.0, 9.0, 6.0, 16.0, 10.0, 4.0, 12.0, 5.0, 8.0]],
    "Name": "sCurve-0",
    "Overflow": 2616679.0,
    "Type": "Histo2d",
    "Underflow": 0.0,
    "x": {
        "AxisTitle": "Vcal",
        "Bins": 51,
        "High": 302.5,
        "Low": 47.5
    },
    "y": {
        "AxisTitle": "Occupancy",
        "Bins": 49,
        "High": 49.5,
        "Low": 0.5
    },
    "z": {
        "AxisTitle": "Number of pixels"
    }
}