time,Hardware,Voltage,Current
1623091395463,high-voltage-3,1,0.0589104
time,Hardware,Voltage,Current
1623091395463,high-voltage-3,2,0.0618749
time,Hardware,Voltage,Current
1623091395463,high-voltage-3,3,0.0629581
time,Hardware,Voltage,Current
1623091395463,high-voltage-3,4,0.0647404
time,Hardware,Voltage,Current
1623091395463,high-voltage-3,5,0.0661504
time,Hardware,Voltage,Current
1623091395463,high-voltage-3,6,0.0679083
time,Hardware,Voltage,Current
1623091395463,high-voltage-3,7,0.0696659
time,Hardware,Voltage,Current
1623091395463,high-voltage-3,8,0.0716167
time,Hardware,Voltage,Current
1623091395463,high-voltage-3,9,0.0726993
time,Hardware,Voltage,Current
1623091395463,high-voltage-3,10,0.0744695
time,Hardware,Voltage,Current
1623091395463,high-voltage-3,11,0.0751431
time,Hardware,Voltage,Current
1623091395463,high-voltage-3,12,0.0770978
time,Hardware,Voltage,Current
1623091395463,high-voltage-3,13,0.0781569
time,Hardware,Voltage,Current
1623091395463,high-voltage-3,14,0.0796103
time,Hardware,Voltage,Current
1623091395463,high-voltage-3,15,0.0810478
time,Hardware,Voltage,Current
1623091395463,high-voltage-3,16,0.0821143
time,Hardware,Voltage,Current
1623091395463,high-voltage-3,17,0.0833072
time,Hardware,Voltage,Current
1623091395463,high-voltage-3,18,0.0843546
time,Hardware,Voltage,Current
1623091395463,high-voltage-3,19,0.0847034
time,Hardware,Voltage,Current
1623091395463,high-voltage-3,20,0.0853305
time,Hardware,Voltage,Current
1623091395463,high-voltage-3,25,0.0906417
time,Hardware,Voltage,Current
1623091395463,high-voltage-3,30,0.0953057
time,Hardware,Voltage,Current
1623091395463,high-voltage-3,35,0.099162
time,Hardware,Voltage,Current
1623091395463,high-voltage-3,40,0.102965
time,Hardware,Voltage,Current
1623091395463,high-voltage-3,45,0.105949
time,Hardware,Voltage,Current
1623091395463,high-voltage-3,50,0.109885
time,Hardware,Voltage,Current
1623091395463,high-voltage-3,55,0.112731
time,Hardware,Voltage,Current
1623091395463,high-voltage-3,60,0.116368
time,Hardware,Voltage,Current
1623091395463,high-voltage-3,65,0.119436
time,Hardware,Voltage,Current
1623091395463,high-voltage-3,70,0.121896
time,Hardware,Voltage,Current
1623091395463,high-voltage-3,75,0.124139
time,Hardware,Voltage,Current
1623091395463,high-voltage-3,80,0.127589
time,Hardware,Voltage,Current
1623091395463,high-voltage-3,85,0.129297
time,Hardware,Voltage,Current
1623091395463,high-voltage-3,90,0.131853
time,Hardware,Voltage,Current
1623091395463,high-voltage-3,95,0.134429
time,Hardware,Voltage,Current
1623091395463,high-voltage-3,100,0.136732
