time,Hardware,Voltage,Current
1622003285607,high-voltage-3,1,0.00450056
time,Hardware,Voltage,Current
1622003285607,high-voltage-3,2,0.00761384
time,Hardware,Voltage,Current
1622003285607,high-voltage-3,3,0.00731812
time,Hardware,Voltage,Current
1622003285607,high-voltage-3,4,0.00882764
time,Hardware,Voltage,Current
1622003285607,high-voltage-3,5,0.0116198
time,Hardware,Voltage,Current
1622003285607,high-voltage-3,6,0.0127189
time,Hardware,Voltage,Current
1622003285607,high-voltage-3,7,0.0132455
time,Hardware,Voltage,Current
1622003285607,high-voltage-3,8,0.0167773
time,Hardware,Voltage,Current
1622003285607,high-voltage-3,9,0.0180649
time,Hardware,Voltage,Current
1622003285607,high-voltage-3,10,0.0204179
time,Hardware,Voltage,Current
1622003285607,high-voltage-3,11,0.0202024
time,Hardware,Voltage,Current
1622003285607,high-voltage-3,12,0.0235048
time,Hardware,Voltage,Current
1622003285607,high-voltage-3,13,0.0237674
time,Hardware,Voltage,Current
1622003285607,high-voltage-3,14,0.0253778
time,Hardware,Voltage,Current
1622003285607,high-voltage-3,15,0.0284982
time,Hardware,Voltage,Current
1622003285607,high-voltage-3,16,0.0297928
time,Hardware,Voltage,Current
1622003285607,high-voltage-3,17,0.0294028
time,Hardware,Voltage,Current
1622003285607,high-voltage-3,18,0.0320338
time,Hardware,Voltage,Current
1622003285607,high-voltage-3,19,0.0328094
time,Hardware,Voltage,Current
1622003285607,high-voltage-3,20,0.0332079
time,Hardware,Voltage,Current
1622003285607,high-voltage-3,25,0.0420695
time,Hardware,Voltage,Current
1622003285607,high-voltage-3,30,0.0488656
time,Hardware,Voltage,Current
1622003285607,high-voltage-3,35,0.0543715
time,Hardware,Voltage,Current
1622003285607,high-voltage-3,40,0.0609493
time,Hardware,Voltage,Current
1622003285607,high-voltage-3,45,0.0648487
time,Hardware,Voltage,Current
1622003285607,high-voltage-3,50,0.0699957
time,Hardware,Voltage,Current
1622003285607,high-voltage-3,55,0.074334
