{
    "Data": [0.0, 0.0, 0.0, 0.0, 0.0, 0.0, 0.0, 0.0, 0.0, 0.0, 0.0, 0.0, 0.0, 0.0, 0.0, 0.0, 0.0, 0.0, 0.0, 0.0, 0.0, 0.0, 0.0, 0.0, 0.0, 0.0, 0.0, 0.0, 0.0, 0.0, 0.0, 0.0, 0.0, 0.0, 0.0, 0.0, 0.0, 0.0, 0.0, 0.0, 0.0, 0.0, 0.0, 0.0, 0.0, 0.0, 0.0, 0.0, 0.0, 0.0, 148.0, 264.0, 291.0, 305.0, 291.0, 288.0, 276.0, 313.0, 311.0, 337.0, 362.0, 328.0, 329.0, 320.0, 348.0, 341.0, 333.0, 357.0, 350.0, 355.0, 390.0, 380.0, 397.0, 370.0, 394.0, 374.0, 388.0, 418.0, 416.0, 364.0, 408.0, 371.0, 436.0, 415.0, 418.0, 429.0, 426.0, 429.0, 422.0, 462.0, 384.0, 376.0, 393.0, 411.0, 411.0, 413.0, 397.0, 385.0, 401.0, 364.0, 362.0, 411.0, 391.0, 409.0, 418.0, 380.0, 346.0, 349.0, 381.0, 387.0, 365.0, 356.0, 366.0, 321.0, 328.0, 351.0, 348.0, 330.0, 325.0, 335.0, 294.0, 326.0, 340.0, 288.0, 292.0, 277.0, 229.0, 264.0, 228.0, 251.0, 244.0, 244.0, 253.0, 242.0, 235.0, 217.0, 208.0, 228.0, 203.0, 189.0, 190.0, 209.0, 189.0, 155.0, 168.0, 159.0, 151.0, 155.0, 134.0, 128.0, 145.0, 135.0, 140.0, 127.0, 118.0, 127.0, 102.0, 101.0, 105.0, 95.0, 101.0, 101.0, 104.0, 87.0, 72.0, 87.0, 75.0, 76.0, 80.0, 72.0, 68.0, 64.0, 82.0, 67.0, 67.0, 74.0, 63.0, 71.0, 59.0, 74.0, 62.0, 63.0, 87.0, 78.0, 56.0, 70.0, 73.0, 75.0, 110.0, 80.0, 69.0, 55.0, 74.0, 125.0, 96.0, 65.0, 93.0, 76.0, 60.0, 132.0, 86.0, 77.0, 99.0, 73.0, 120.0, 114.0, 123.0, 114.0, 113.0, 123.0, 196.0, 153.0, 125.0, 146.0, 152.0, 212.0, 248.0, 204.0, 209.0, 208.0, 244.0, 289.0, 237.0, 251.0, 250.0, 270.0, 361.0, 350.0, 323.0, 325.0, 332.0, 353.0, 602.0, 320.0, 335.0, 349.0, 315.0, 581.0, 514.0, 334.0, 340.0, 347.0, 368.0, 689.0, 394.0, 334.0, 306.0, 333.0, 441.0, 490.0, 327.0, 268.0, 265.0, 262.0, 490.0, 249.0, 227.0, 197.0, 206.0, 241.0, 321.0, 141.0, 130.0, 135.0, 131.0, 152.0, 139.0, 119.0, 90.0, 112.0, 150.0, 105.0, 73.0, 90.0, 75.0, 61.0, 87.0, 59.0, 49.0, 60.0, 44.0, 92.0, 73.0, 32.0, 45.0, 37.0, 46.0, 76.0, 45.0, 33.0, 26.0, 35.0, 25.0, 29.0, 24.0, 23.0, 20.0, 32.0, 14.0, 25.0, 21.0, 13.0, 23.0, 16.0, 32.0, 15.0, 16.0, 15.0, 22.0, 41.0, 20.0, 13.0, 25.0, 9.0, 13.0, 10.0, 5.0, 13.0, 15.0, 17.0, 15.0, 15.0, 8.0, 9.0, 12.0, 2.0, 0.0, 0.0, 0.0, 0.0, 0.0, 0.0, 0.0, 0.0, 0.0, 0.0, 0.0, 0.0, 0.0, 0.0, 0.0, 0.0, 0.0, 0.0, 0.0, 0.0, 0.0, 0.0, 0.0, 0.0, 0.0, 0.0, 0.0, 0.0, 0.0, 0.0, 0.0, 0.0, 0.0, 0.0, 0.0, 0.0, 0.0, 0.0, 0.0, 0.0, 0.0, 0.0, 0.0, 0.0, 0.0, 0.0, 0.0, 0.0, 0.0, 0.0, 0.0, 0.0, 0.0, 0.0, 0.0, 0.0, 0.0, 0.0, 0.0, 0.0, 0.0, 0.0, 0.0, 0.0, 0.0, 0.0, 0.0, 0.0, 0.0, 0.0, 0.0, 0.0, 0.0, 0.0, 0.0, 0.0, 0.0, 0.0, 0.0, 0.0, 0.0, 0.0, 0.0, 0.0, 0.0, 0.0, 0.0, 0.0, 0.0, 0.0, 0.0, 0.0, 0.0, 0.0, 0.0, 0.0, 0.0, 0.0, 0.0, 0.0, 0.0, 0.0, 0.0, 0.0, 0.0, 0.0, 0.0, 0.0, 0.0, 0.0, 0.0, 0.0, 0.0, 0.0, 0.0, 0.0, 0.0, 0.0, 0.0, 0.0, 0.0, 0.0, 0.0, 0.0, 0.0, 0.0, 0.0, 0.0, 0.0, 0.0, 0.0, 0.0, 0.0, 0.0, 0.0, 0.0, 0.0, 0.0, 0.0, 0.0, 0.0, 0.0, 0.0, 0.0, 0.0, 0.0, 0.0, 0.0, 0.0, 0.0, 0.0, 0.0, 0.0, 0.0, 0.0, 0.0, 0.0, 0.0, 0.0, 0.0, 0.0, 0.0, 0.0, 0.0, 0.0, 0.0, 0.0, 0.0, 0.0, 0.0, 0.0, 0.0, 0.0, 0.0, 0.0, 0.0, 0.0, 0.0, 0.0, 0.0, 0.0, 0.0, 0.0, 0.0, 0.0, 0.0, 0.0, 0.0],
    "Name": "ThresholdDist-0",
    "Overflow": 0.0,
    "Type": "Histo1d",
    "Underflow": 0.0,
    "x": {
        "AxisTitle": "Threshold [e]",
        "Bins": 514,
        "High": 5135.0,
        "Low": -5.0
    },
    "y": {
        "AxisTitle": "Number of Pixels"
    },
    "z": {
        "AxisTitle": "z"
    }
}