{
    "Data": [1708.0, 21084.0, 17984.0, 8000.0, 2704.0, 827.0, 446.0, 607.0, 876.0, 1063.0, 1183.0, 1069.0, 934.0, 713.0, 643.0, 566.0, 422.0, 445.0, 398.0, 417.0, 419.0, 465.0, 455.0, 508.0, 481.0, 549.0, 462.0, 496.0, 539.0, 497.0, 480.0, 515.0, 484.0, 491.0, 503.0, 490.0, 459.0, 471.0, 457.0, 416.0, 395.0, 362.0, 338.0, 309.0, 321.0, 291.0, 330.0, 287.0, 260.0, 234.0, 119.0],
    "Name": "Chi2Dist-0",
    "Overflow": 0.0,
    "Type": "Histo1d",
    "Underflow": 0.0,
    "x": {
        "AxisTitle": "Fit Chi/ndf",
        "Bins": 51,
        "High": 2.5250000953674318,
        "Low": -0.02500000037252903
    },
    "y": {
        "AxisTitle": "Number of Pixels"
    },
    "z": {
        "AxisTitle": "z"
    }
}