{
    "Data": [25.0, 36.0, 2.0, 3.0, 9.0, 20.0, 89.0, 222.0, 616.0, 1443.0, 2749.0, 4098.0, 4896.0, 4822.0, 4153.0, 3766.0, 4302.0, 4842.0, 5141.0, 4796.0, 4004.0, 3054.0, 2259.0, 1960.0, 1966.0, 1879.0, 1777.0, 1784.0, 1873.0, 1705.0, 1473.0, 1378.0, 1068.0, 916.0, 706.0, 505.0, 373.0, 288.0, 222.0, 145.0, 118.0, 87.0, 60.0, 69.0, 43.0, 46.0, 30.0, 24.0, 15.0, 23.0, 18.0, 20.0, 7.0, 8.0, 13.0],
    "Name": "NoiseDist-0",
    "Overflow": 108.0,
    "Type": "Histo1d",
    "Underflow": 0.0,
    "x": {
        "AxisTitle": "Noise [e]",
        "Bins": 55,
        "High": 276.0,
        "Low": -2.0
    },
    "y": {
        "AxisTitle": "Number of Pixels"
    },
    "z": {
        "AxisTitle": "z"
    }
}