time,Hardware,Voltage,Current
1626607618927,high-voltage-2,1,0.215304
time,Hardware,Voltage,Current
1626607618927,high-voltage-2,2,0.262172
time,Hardware,Voltage,Current
1626607618927,high-voltage-2,3,0.286262
time,Hardware,Voltage,Current
1626607618927,high-voltage-2,4,0.306796
time,Hardware,Voltage,Current
1626607618927,high-voltage-2,5,0.325802
time,Hardware,Voltage,Current
1626607618927,high-voltage-2,6,0.348946
time,Hardware,Voltage,Current
1626607618927,high-voltage-2,7,0.377938
time,Hardware,Voltage,Current
1626607618927,high-voltage-2,8,0.40676
time,Hardware,Voltage,Current
1626607618927,high-voltage-2,9,0.442472
time,Hardware,Voltage,Current
1626607618927,high-voltage-2,10,0.480248
time,Hardware,Voltage,Current
1626607618927,high-voltage-2,11,0.518674
time,Hardware,Voltage,Current
1626607618927,high-voltage-2,12,0.562109
time,Hardware,Voltage,Current
1626607618927,high-voltage-2,13,0.60552
time,Hardware,Voltage,Current
1626607618927,high-voltage-2,14,0.642838
time,Hardware,Voltage,Current
1626607618927,high-voltage-2,15,0.678647
time,Hardware,Voltage,Current
1626607618927,high-voltage-2,16,0.713041
time,Hardware,Voltage,Current
1626607618927,high-voltage-2,17,0.740326
time,Hardware,Voltage,Current
1626607618927,high-voltage-2,18,0.767717
time,Hardware,Voltage,Current
1626607618927,high-voltage-2,19,0.792792
time,Hardware,Voltage,Current
1626607618927,high-voltage-2,20,0.817885
time,Hardware,Voltage,Current
1626607618927,high-voltage-2,25,0.915557
time,Hardware,Voltage,Current
1626607618927,high-voltage-2,30,1.01514
time,Hardware,Voltage,Current
1626607618927,high-voltage-2,35,1.11373
time,Hardware,Voltage,Current
1626607618927,high-voltage-2,40,1.22578
time,Hardware,Voltage,Current
1626607618927,high-voltage-2,45,1.36424
time,Hardware,Voltage,Current
1626607618927,high-voltage-2,50,1.46313
time,Hardware,Voltage,Current
1626607618927,high-voltage-2,55,1.55441
time,Hardware,Voltage,Current
1626607618927,high-voltage-2,60,1.64256
time,Hardware,Voltage,Current
1626607618927,high-voltage-2,65,1.72598
time,Hardware,Voltage,Current
1626607618927,high-voltage-2,70,1.80844
time,Hardware,Voltage,Current
1626607618927,high-voltage-2,75,1.88488
time,Hardware,Voltage,Current
1626607618927,high-voltage-2,80,1.9612
time,Hardware,Voltage,Current
1626607618927,high-voltage-2,85,2.03501
time,Hardware,Voltage,Current
1626607618927,high-voltage-2,90,2.10641
time,Hardware,Voltage,Current
1626607618927,high-voltage-2,95,2.17339
time,Hardware,Voltage,Current
1626607618927,high-voltage-2,100,2.23894
