{
    "Data": [[3298.0, 1527.0, 881.0, 558.0, 417.0, 338.0, 274.0, 210.0, 183.0, 146.0, 141.0, 121.0, 117.0, 83.0, 113.0, 94.0, 97.0, 68.0, 64.0, 61.0, 45.0, 45.0, 56.0, 56.0, 54.0, 55.0, 33.0, 27.0, 30.0, 39.0, 25.0, 26.0, 21.0, 19.0, 22.0, 22.0, 30.0, 23.0, 14.0, 24.0, 24.0, 26.0, 26.0, 20.0, 22.0, 13.0, 11.0, 20.0, 32.0], [3746.0, 1992.0, 1209.0, 900.0, 671.0, 523.0, 419.0, 375.0, 281.0, 240.0, 214.0, 200.0, 193.0, 163.0, 157.0, 154.0, 142.0, 127.0, 124.0, 100.0, 100.0, 82.0, 98.0, 62.0, 77.0, 55.0, 61.0, 63.0, 48.0, 47.0, 46.0, 42.0, 40.0, 37.0, 22.0, 29.0, 27.0, 28.0, 24.0, 27.0, 22.0, 17.0, 23.0, 45.0, 34.0, 46.0, 45.0, 43.0, 35.0], [4200.0, 2214.0, 1544.0, 1184.0, 859.0, 806.0, 620.0, 523.0, 459.0, 415.0, 373.0, 324.0, 319.0, 271.0, 226.0, 230.0, 209.0, 183.0, 210.0, 193.0, 145.0, 144.0, 127.0, 140.0, 149.0, 102.0, 117.0, 88.0, 100.0, 78.0, 94.0, 76.0, 67.0, 72.0, 57.0, 57.0, 53.0, 39.0, 42.0, 39.0, 40.0, 34.0, 40.0, 36.0, 41.0, 41.0, 53.0, 60.0, 80.0], [4581.0, 2272.0, 1742.0, 1314.0, 1082.0, 900.0, 812.0, 717.0, 660.0, 606.0, 517.0, 454.0, 444.0, 369.0, 377.0, 371.0, 335.0, 281.0, 264.0, 250.0, 283.0, 241.0, 210.0, 214.0, 217.0, 206.0, 175.0, 174.0, 163.0, 138.0, 118.0, 135.0, 123.0, 118.0, 106.0, 106.0, 121.0, 109.0, 110.0, 114.0, 90.0, 94.0, 92.0, 74.0, 68.0, 71.0, 58.0, 56.0, 100.0], [6635.0, 3068.0, 2000.0, 1543.0, 1211.0, 1027.0, 826.0, 804.0, 730.0, 652.0, 563.0, 574.0, 537.0, 541.0, 491.0, 458.0, 449.0, 427.0, 415.0, 441.0, 375.0, 346.0, 378.0, 324.0, 309.0, 300.0, 251.0, 293.0, 287.0, 230.0, 241.0, 240.0, 226.0, 196.0, 227.0, 205.0, 174.0, 201.0, 171.0, 161.0, 172.0, 188.0, 185.0, 155.0, 137.0, 164.0, 155.0, 153.0, 160.0], [7744.0, 4844.0, 3248.0, 2441.0, 1836.0, 1501.0, 1268.0, 1032.0, 956.0, 842.0, 740.0, 736.0, 656.0, 642.0, 595.0, 504.0, 514.0, 499.0, 505.0, 486.0, 455.0, 460.0, 439.0, 412.0, 413.0, 391.0, 396.0, 412.0, 398.0, 388.0, 384.0, 370.0, 387.0, 318.0, 298.0, 292.0, 319.0, 289.0, 276.0, 291.0, 291.0, 280.0, 272.0, 319.0, 293.0, 295.0, 304.0, 328.0, 340.0], [3941.0, 3623.0, 3199.0, 2901.0, 2544.0, 2183.0, 1987.0, 1783.0, 1729.0, 1506.0, 1372.0, 1268.0, 1135.0, 1127.0, 978.0, 942.0, 879.0, 826.0, 800.0, 697.0, 629.0, 659.0, 589.0, 579.0, 522.0, 542.0, 480.0, 491.0, 522.0, 484.0, 456.0, 488.0, 437.0, 496.0, 468.0, 472.0, 496.0, 437.0, 517.0, 477.0, 448.0, 463.0, 498.0, 458.0, 500.0, 514.0, 538.0, 617.0, 702.0], [1321.0, 1209.0, 1195.0, 1232.0, 1279.0, 1298.0, 1339.0, 1409.0, 1424.0, 1396.0, 1423.0, 1423.0, 1426.0, 1379.0, 1391.0, 1337.0, 1317.0, 1254.0, 1193.0, 1309.0, 1226.0, 1182.0, 1136.0, 1167.0, 995.0, 1010.0, 1003.0, 901.0, 908.0, 855.0, 788.0, 772.0, 794.0, 755.0, 737.0, 683.0, 708.0, 698.0, 723.0, 720.0, 665.0, 717.0, 753.0, 734.0, 764.0, 861.0, 892.0, 1015.0, 1188.0], [762.0, 532.0, 446.0, 397.0, 387.0, 421.0, 448.0, 435.0, 475.0, 531.0, 575.0, 575.0, 605.0, 681.0, 746.0, 806.0, 797.0, 913.0, 933.0, 924.0, 984.0, 973.0, 1069.0, 1061.0, 1201.0, 1128.0, 1187.0, 1199.0, 1240.0, 1200.0, 1245.0, 1319.0, 1320.0, 1306.0, 1366.0, 1351.0, 1420.0, 1328.0, 1359.0, 1310.0, 1332.0, 1315.0, 1318.0, 1396.0, 1397.0, 1505.0, 1538.0, 1757.0, 2076.0], [678.0, 338.0, 252.0, 205.0, 180.0, 188.0, 162.0, 180.0, 173.0, 230.0, 218.0, 230.0, 218.0, 263.0, 238.0, 277.0, 285.0, 340.0, 350.0, 327.0, 397.0, 396.0, 421.0, 433.0, 519.0, 524.0, 576.0, 644.0, 684.0, 740.0, 731.0, 885.0, 893.0, 978.0, 1162.0, 1178.0, 1328.0, 1471.0, 1557.0, 1663.0, 1767.0, 1895.0, 2140.0, 2356.0, 2506.0, 2727.0, 3037.0, 3576.0, 4229.0], [657.0, 296.0, 179.0, 160.0, 109.0, 107.0, 100.0, 107.0, 90.0, 87.0, 99.0, 99.0, 93.0, 135.0, 149.0, 138.0, 143.0, 151.0, 179.0, 175.0, 166.0, 165.0, 181.0, 209.0, 183.0, 221.0, 221.0, 238.0, 263.0, 269.0, 366.0, 338.0, 382.0, 411.0, 452.0, 521.0, 604.0, 666.0, 754.0, 873.0, 1015.0, 1255.0, 1431.0, 1757.0, 2340.0, 2870.0, 3680.0, 4862.0, 7591.0], [647.0, 282.0, 185.0, 134.0, 97.0, 81.0, 76.0, 54.0, 56.0, 59.0, 64.0, 64.0, 66.0, 71.0, 95.0, 73.0, 84.0, 90.0, 75.0, 99.0, 92.0, 100.0, 91.0, 114.0, 116.0, 129.0, 123.0, 151.0, 146.0, 128.0, 130.0, 191.0, 180.0, 202.0, 220.0, 262.0, 280.0, 306.0, 361.0, 416.0, 504.0, 589.0, 708.0, 863.0, 1099.0, 1582.0, 2345.0, 3749.0, 7549.0], [684.0, 294.0, 180.0, 149.0, 104.0, 77.0, 65.0, 41.0, 34.0, 40.0, 40.0, 47.0, 50.0, 47.0, 49.0, 48.0, 61.0, 67.0, 63.0, 55.0, 68.0, 65.0, 65.0, 70.0, 58.0, 64.0, 54.0, 68.0, 67.0, 81.0, 72.0, 90.0, 89.0, 99.0, 131.0, 142.0, 141.0, 170.0, 194.0, 219.0, 262.0, 314.0, 357.0, 440.0, 603.0, 832.0, 1240.0, 2053.0, 5172.0], [913.0, 301.0, 178.0, 140.0, 100.0, 78.0, 56.0, 49.0, 40.0, 47.0, 51.0, 47.0, 37.0, 40.0, 48.0, 43.0, 52.0, 43.0, 57.0, 55.0, 50.0, 32.0, 53.0, 41.0, 32.0, 32.0, 33.0, 50.0, 48.0, 51.0, 41.0, 50.0, 42.0, 55.0, 71.0, 68.0, 79.0, 77.0, 120.0, 108.0, 135.0, 169.0, 181.0, 261.0, 344.0, 508.0, 679.0, 1245.0, 3064.0], [1242.0, 416.0, 198.0, 142.0, 93.0, 66.0, 48.0, 35.0, 31.0, 35.0, 44.0, 41.0, 42.0, 37.0, 44.0, 58.0, 60.0, 54.0, 49.0, 48.0, 39.0, 46.0, 32.0, 35.0, 36.0, 30.0, 27.0, 27.0, 37.0, 26.0, 23.0, 19.0, 31.0, 34.0, 38.0, 24.0, 38.0, 49.0, 54.0, 51.0, 72.0, 90.0, 92.0, 127.0, 192.0, 294.0, 406.0, 705.0, 1911.0], [1741.0, 559.0, 286.0, 150.0, 106.0, 63.0, 42.0, 37.0, 26.0, 39.0, 38.0, 40.0, 38.0, 35.0, 44.0, 40.0, 41.0, 33.0, 47.0, 42.0, 50.0, 36.0, 31.0, 42.0, 34.0, 31.0, 24.0, 26.0, 27.0, 16.0, 24.0, 27.0, 21.0, 21.0, 22.0, 19.0, 31.0, 24.0, 29.0, 53.0, 43.0, 43.0, 58.0, 70.0, 108.0, 131.0, 209.0, 419.0, 1167.0], [2224.0, 896.0, 415.0, 233.0, 149.0, 78.0, 58.0, 41.0, 38.0, 41.0, 24.0, 30.0, 26.0, 34.0, 37.0, 41.0, 38.0, 47.0, 47.0, 43.0, 42.0, 30.0, 31.0, 32.0, 35.0, 26.0, 25.0, 18.0, 17.0, 14.0, 11.0, 7.0, 19.0, 18.0, 17.0, 24.0, 24.0, 22.0, 28.0, 26.0, 25.0, 30.0, 28.0, 44.0, 66.0, 88.0, 126.0, 225.0, 667.0], [2931.0, 1267.0, 717.0, 358.0, 231.0, 140.0, 86.0, 75.0, 53.0, 45.0, 32.0, 29.0, 37.0, 54.0, 39.0, 30.0, 31.0, 39.0, 40.0, 33.0, 33.0, 27.0, 32.0, 20.0, 26.0, 21.0, 22.0, 29.0, 22.0, 12.0, 12.0, 22.0, 8.0, 10.0, 11.0, 12.0, 27.0, 18.0, 14.0, 15.0, 22.0, 19.0, 31.0, 30.0, 41.0, 48.0, 70.0, 142.0, 384.0], [3364.0, 1735.0, 1099.0, 712.0, 447.0, 276.0, 165.0, 133.0, 93.0, 86.0, 53.0, 43.0, 34.0, 45.0, 33.0, 38.0, 44.0, 40.0, 36.0, 43.0, 31.0, 30.0, 35.0, 27.0, 27.0, 18.0, 23.0, 14.0, 15.0, 19.0, 21.0, 8.0, 7.0, 9.0, 7.0, 9.0, 12.0, 7.0, 8.0, 15.0, 12.0, 18.0, 18.0, 22.0, 24.0, 42.0, 58.0, 97.0, 266.0], [3653.0, 2104.0, 1420.0, 996.0, 682.0, 482.0, 389.0, 290.0, 215.0, 161.0, 123.0, 108.0, 79.0, 61.0, 59.0, 61.0, 59.0, 47.0, 43.0, 39.0, 33.0, 35.0, 35.0, 27.0, 24.0, 18.0, 13.0, 21.0, 14.0, 18.0, 18.0, 6.0, 8.0, 10.0, 14.0, 11.0, 9.0, 5.0, 9.0, 8.0, 9.0, 10.0, 5.0, 12.0, 13.0, 26.0, 38.0, 52.0, 190.0], [3633.0, 2218.0, 1690.0, 1272.0, 1030.0, 757.0, 640.0, 478.0, 395.0, 320.0, 246.0, 221.0, 198.0, 156.0, 132.0, 121.0, 112.0, 90.0, 75.0, 57.0, 40.0, 52.0, 45.0, 38.0, 32.0, 22.0, 23.0, 15.0, 16.0, 15.0, 15.0, 13.0, 9.0, 6.0, 12.0, 6.0, 5.0, 13.0, 10.0, 12.0, 8.0, 11.0, 11.0, 8.0, 9.0, 21.0, 21.0, 37.0, 116.0], [3648.0, 2252.0, 1825.0, 1412.0, 1208.0, 975.0, 790.0, 712.0, 556.0, 486.0, 433.0, 340.0, 311.0, 256.0, 255.0, 231.0, 168.0, 159.0, 152.0, 127.0, 104.0, 95.0, 80.0, 59.0, 49.0, 42.0, 28.0, 31.0, 26.0, 31.0, 19.0, 28.0, 15.0, 11.0, 7.0, 8.0, 4.0, 12.0, 4.0, 9.0, 4.0, 7.0, 8.0, 9.0, 12.0, 18.0, 18.0, 34.0, 61.0], [3300.0, 2271.0, 1821.0, 1482.0, 1259.0, 1110.0, 934.0, 887.0, 756.0, 693.0, 645.0, 548.0, 493.0, 488.0, 418.0, 358.0, 352.0, 288.0, 250.0, 212.0, 198.0, 184.0, 150.0, 157.0, 106.0, 109.0, 81.0, 82.0, 76.0, 56.0, 49.0, 39.0, 41.0, 32.0, 29.0, 23.0, 19.0, 12.0, 11.0, 12.0, 11.0, 12.0, 10.0, 5.0, 14.0, 12.0, 13.0, 28.0, 54.0], [2831.0, 2054.0, 1601.0, 1440.0, 1291.0, 1114.0, 995.0, 1016.0, 905.0, 810.0, 745.0, 692.0, 636.0, 624.0, 564.0, 526.0, 464.0, 428.0, 394.0, 379.0, 387.0, 310.0, 292.0, 266.0, 246.0, 210.0, 184.0, 165.0, 154.0, 142.0, 130.0, 83.0, 89.0, 64.0, 68.0, 50.0, 59.0, 43.0, 37.0, 27.0, 30.0, 23.0, 20.0, 22.0, 13.0, 18.0, 13.0, 18.0, 48.0], [2125.0, 1711.0, 1403.0, 1219.0, 1189.0, 1063.0, 980.0, 917.0, 860.0, 872.0, 809.0, 752.0, 754.0, 754.0, 654.0, 659.0, 643.0, 626.0, 558.0, 495.0, 489.0, 450.0, 435.0, 430.0, 371.0, 351.0, 309.0, 307.0, 279.0, 276.0, 267.0, 228.0, 189.0, 179.0, 143.0, 139.0, 111.0, 129.0, 106.0, 81.0, 72.0, 63.0, 56.0, 46.0, 45.0, 28.0, 31.0, 32.0, 36.0], [1444.0, 1237.0, 983.0, 986.0, 909.0, 885.0, 840.0, 796.0, 847.0, 785.0, 819.0, 747.0, 755.0, 732.0, 699.0, 712.0, 693.0, 665.0, 621.0, 675.0, 576.0, 599.0, 543.0, 555.0, 506.0, 531.0, 502.0, 438.0, 437.0, 440.0, 405.0, 380.0, 352.0, 357.0, 269.0, 289.0, 284.0, 238.0, 225.0, 169.0, 161.0, 140.0, 119.0, 124.0, 103.0, 85.0, 80.0, 83.0, 69.0], [920.0, 725.0, 702.0, 661.0, 612.0, 637.0, 558.0, 652.0, 609.0, 614.0, 583.0, 659.0, 675.0, 666.0, 635.0, 669.0, 653.0, 700.0, 693.0, 674.0, 648.0, 662.0, 631.0, 621.0, 669.0, 628.0, 600.0, 577.0, 568.0, 585.0, 596.0, 493.0, 490.0, 498.0, 496.0, 438.0, 465.0, 382.0, 440.0, 403.0, 348.0, 338.0, 295.0, 267.0, 238.0, 231.0, 189.0, 173.0, 171.0], [702.0, 397.0, 381.0, 401.0, 373.0, 349.0, 389.0, 438.0, 400.0, 435.0, 416.0, 442.0, 469.0, 478.0, 514.0, 529.0, 541.0, 553.0, 592.0, 614.0, 602.0, 661.0, 647.0, 642.0, 631.0, 626.0, 650.0, 654.0, 661.0, 685.0, 690.0, 653.0, 676.0, 659.0, 650.0, 620.0, 612.0, 645.0, 554.0, 553.0, 548.0, 543.0, 533.0, 555.0, 510.0, 459.0, 403.0, 373.0, 358.0], [570.0, 321.0, 304.0, 218.0, 196.0, 198.0, 193.0, 235.0, 221.0, 245.0, 275.0, 279.0, 288.0, 327.0, 330.0, 367.0, 368.0, 390.0, 427.0, 415.0, 437.0, 462.0, 491.0, 526.0, 517.0, 507.0, 591.0, 616.0, 601.0, 604.0, 646.0, 711.0, 666.0, 729.0, 771.0, 762.0, 771.0, 822.0, 730.0, 736.0, 783.0, 840.0, 773.0, 833.0, 793.0, 796.0, 810.0, 825.0, 804.0], [551.0, 274.0, 213.0, 181.0, 126.0, 115.0, 98.0, 121.0, 107.0, 121.0, 109.0, 121.0, 152.0, 176.0, 200.0, 204.0, 210.0, 242.0, 243.0, 269.0, 302.0, 281.0, 336.0, 303.0, 380.0, 373.0, 428.0, 416.0, 504.0, 490.0, 564.0, 513.0, 602.0, 625.0, 678.0, 694.0, 777.0, 859.0, 818.0, 886.0, 939.0, 975.0, 1014.0, 1119.0, 1141.0, 1137.0, 1295.0, 1338.0, 1410.0], [476.0, 244.0, 167.0, 125.0, 89.0, 75.0, 55.0, 61.0, 44.0, 63.0, 66.0, 86.0, 87.0, 87.0, 93.0, 116.0, 104.0, 137.0, 154.0, 153.0, 154.0, 182.0, 202.0, 193.0, 208.0, 228.0, 229.0, 302.0, 299.0, 318.0, 336.0, 411.0, 393.0, 465.0, 534.0, 549.0, 600.0, 685.0, 766.0, 814.0, 904.0, 933.0, 1056.0, 1208.0, 1345.0, 1435.0, 1638.0, 1967.0, 2275.0], [501.0, 246.0, 165.0, 150.0, 86.0, 77.0, 50.0, 42.0, 65.0, 31.0, 32.0, 45.0, 38.0, 59.0, 48.0, 79.0, 73.0, 81.0, 71.0, 80.0, 105.0, 100.0, 86.0, 121.0, 98.0, 101.0, 135.0, 137.0, 166.0, 163.0, 206.0, 217.0, 254.0, 313.0, 328.0, 356.0, 402.0, 520.0, 531.0, 593.0, 693.0, 813.0, 892.0, 1160.0, 1275.0, 1494.0, 1809.0, 2235.0, 3076.0], [435.0, 224.0, 155.0, 126.0, 88.0, 58.0, 80.0, 51.0, 45.0, 36.0, 34.0, 51.0, 28.0, 36.0, 51.0, 36.0, 33.0, 53.0, 50.0, 74.0, 39.0, 66.0, 61.0, 53.0, 76.0, 63.0, 45.0, 65.0, 88.0, 127.0, 101.0, 119.0, 126.0, 145.0, 177.0, 187.0, 261.0, 274.0, 296.0, 403.0, 454.0, 588.0, 630.0, 770.0, 1027.0, 1334.0, 1748.0, 2400.0, 3477.0], [505.0, 204.0, 191.0, 160.0, 68.0, 52.0, 54.0, 30.0, 26.0, 24.0, 27.0, 30.0, 50.0, 42.0, 49.0, 25.0, 50.0, 35.0, 28.0, 28.0, 41.0, 54.0, 38.0, 26.0, 28.0, 36.0, 36.0, 40.0, 31.0, 27.0, 45.0, 49.0, 58.0, 73.0, 84.0, 102.0, 112.0, 140.0, 175.0, 202.0, 258.0, 316.0, 439.0, 515.0, 734.0, 936.0, 1348.0, 2043.0, 3644.0], [509.0, 219.0, 156.0, 111.0, 93.0, 45.0, 39.0, 36.0, 34.0, 24.0, 20.0, 21.0, 32.0, 44.0, 37.0, 26.0, 32.0, 26.0, 41.0, 41.0, 28.0, 32.0, 39.0, 36.0, 22.0, 57.0, 21.0, 14.0, 27.0, 22.0, 21.0, 19.0, 39.0, 47.0, 48.0, 55.0, 46.0, 44.0, 81.0, 86.0, 129.0, 168.0, 232.0, 316.0, 416.0, 604.0, 966.0, 1570.0, 3185.0], [467.0, 213.0, 172.0, 111.0, 105.0, 63.0, 49.0, 60.0, 41.0, 31.0, 37.0, 48.0, 25.0, 23.0, 34.0, 35.0, 51.0, 55.0, 34.0, 24.0, 34.0, 16.0, 23.0, 15.0, 12.0, 18.0, 51.0, 76.0, 24.0, 12.0, 17.0, 19.0, 16.0, 18.0, 42.0, 13.0, 20.0, 34.0, 30.0, 66.0, 61.0, 58.0, 116.0, 135.0, 225.0, 354.0, 620.0, 1070.0, 2450.0], [451.0, 231.0, 147.0, 107.0, 83.0, 75.0, 46.0, 29.0, 33.0, 30.0, 28.0, 23.0, 31.0, 42.0, 39.0, 23.0, 23.0, 53.0, 23.0, 26.0, 37.0, 58.0, 22.0, 43.0, 58.0, 24.0, 17.0, 20.0, 7.0, 17.0, 12.0, 8.0, 32.0, 10.0, 15.0, 16.0, 12.0, 10.0, 16.0, 44.0, 36.0, 30.0, 45.0, 59.0, 100.0, 197.0, 296.0, 698.0, 1738.0], [455.0, 218.0, 158.0, 121.0, 106.0, 54.0, 38.0, 32.0, 35.0, 28.0, 34.0, 20.0, 33.0, 42.0, 71.0, 45.0, 31.0, 42.0, 46.0, 45.0, 37.0, 25.0, 18.0, 20.0, 11.0, 22.0, 27.0, 11.0, 31.0, 35.0, 27.0, 30.0, 8.0, 27.0, 8.0, 5.0, 10.0, 5.0, 4.0, 13.0, 25.0, 21.0, 20.0, 29.0, 49.0, 97.0, 188.0, 370.0, 1160.0], [478.0, 223.0, 153.0, 113.0, 81.0, 52.0, 44.0, 36.0, 31.0, 22.0, 38.0, 32.0, 27.0, 28.0, 32.0, 31.0, 26.0, 31.0, 50.0, 32.0, 29.0, 31.0, 39.0, 32.0, 30.0, 12.0, 17.0, 8.0, 19.0, 27.0, 8.0, 10.0, 45.0, 45.0, 19.0, 42.0, 16.0, 12.0, 21.0, 10.0, 9.0, 9.0, 8.0, 14.0, 20.0, 29.0, 67.0, 196.0, 671.0], [481.0, 206.0, 192.0, 130.0, 94.0, 72.0, 44.0, 46.0, 34.0, 22.0, 19.0, 31.0, 35.0, 31.0, 34.0, 26.0, 36.0, 26.0, 26.0, 44.0, 17.0, 32.0, 21.0, 16.0, 18.0, 12.0, 17.0, 8.0, 13.0, 15.0, 8.0, 10.0, 5.0, 5.0, 25.0, 14.0, 7.0, 7.0, 4.0, 4.0, 2.0, 8.0, 4.0, 4.0, 19.0, 29.0, 46.0, 110.0, 404.0], [491.0, 227.0, 147.0, 106.0, 93.0, 74.0, 54.0, 32.0, 25.0, 31.0, 26.0, 24.0, 27.0, 26.0, 30.0, 30.0, 36.0, 32.0, 29.0, 27.0, 25.0, 22.0, 37.0, 33.0, 14.0, 13.0, 11.0, 12.0, 12.0, 28.0, 16.0, 21.0, 21.0, 12.0, 9.0, 11.0, 18.0, 17.0, 4.0, 8.0, 1.0, 7.0, 1.0, 2.0, 2.0, 5.0, 13.0, 51.0, 219.0], [467.0, 182.0, 177.0, 131.0, 80.0, 61.0, 89.0, 70.0, 47.0, 38.0, 24.0, 40.0, 44.0, 28.0, 32.0, 37.0, 31.0, 33.0, 41.0, 34.0, 26.0, 25.0, 41.0, 16.0, 24.0, 9.0, 38.0, 15.0, 8.0, 14.0, 4.0, 9.0, 6.0, 7.0, 3.0, 9.0, 8.0, 17.0, 16.0, 5.0, 19.0, 16.0, 17.0, 13.0, 1.0, 5.0, 25.0, 34.0, 102.0], [437.0, 239.0, 160.0, 148.0, 71.0, 58.0, 31.0, 25.0, 30.0, 27.0, 26.0, 18.0, 29.0, 18.0, 30.0, 31.0, 52.0, 36.0, 25.0, 42.0, 29.0, 31.0, 67.0, 17.0, 20.0, 14.0, 11.0, 9.0, 4.0, 7.0, 11.0, 7.0, 12.0, 7.0, 10.0, 7.0, 10.0, 8.0, 4.0, 3.0, 14.0, 19.0, 6.0, 0.0, 3.0, 15.0, 24.0, 4.0, 63.0], [437.0, 197.0, 155.0, 120.0, 79.0, 58.0, 50.0, 41.0, 29.0, 24.0, 27.0, 35.0, 21.0, 24.0, 32.0, 31.0, 29.0, 28.0, 32.0, 27.0, 26.0, 26.0, 21.0, 19.0, 14.0, 9.0, 12.0, 10.0, 13.0, 19.0, 28.0, 10.0, 14.0, 7.0, 15.0, 5.0, 2.0, 9.0, 1.0, 3.0, 4.0, 2.0, 5.0, 5.0, 13.0, 16.0, 3.0, 2.0, 36.0], [487.0, 213.0, 148.0, 125.0, 77.0, 69.0, 38.0, 45.0, 14.0, 23.0, 21.0, 32.0, 48.0, 30.0, 22.0, 32.0, 30.0, 31.0, 34.0, 27.0, 17.0, 30.0, 24.0, 21.0, 19.0, 9.0, 15.0, 10.0, 12.0, 9.0, 14.0, 14.0, 20.0, 7.0, 5.0, 5.0, 5.0, 13.0, 5.0, 4.0, 6.0, 6.0, 5.0, 1.0, 5.0, 4.0, 2.0, 6.0, 17.0], [484.0, 232.0, 134.0, 107.0, 91.0, 78.0, 42.0, 25.0, 20.0, 34.0, 18.0, 21.0, 30.0, 30.0, 36.0, 35.0, 23.0, 22.0, 21.0, 24.0, 22.0, 50.0, 14.0, 19.0, 26.0, 21.0, 12.0, 7.0, 13.0, 9.0, 14.0, 10.0, 8.0, 12.0, 6.0, 8.0, 6.0, 11.0, 31.0, 5.0, 5.0, 5.0, 4.0, 2.0, 2.0, 4.0, 2.0, 7.0, 30.0], [452.0, 225.0, 161.0, 131.0, 81.0, 51.0, 32.0, 43.0, 27.0, 30.0, 49.0, 19.0, 33.0, 23.0, 36.0, 29.0, 28.0, 48.0, 41.0, 32.0, 24.0, 30.0, 39.0, 24.0, 10.0, 11.0, 11.0, 8.0, 10.0, 9.0, 6.0, 19.0, 13.0, 6.0, 7.0, 3.0, 10.0, 5.0, 5.0, 29.0, 5.0, 1.0, 4.0, 2.0, 1.0, 4.0, 1.0, 9.0, 11.0], [433.0, 225.0, 173.0, 124.0, 82.0, 52.0, 37.0, 45.0, 27.0, 27.0, 51.0, 28.0, 28.0, 17.0, 43.0, 35.0, 37.0, 33.0, 18.0, 27.0, 23.0, 22.0, 20.0, 18.0, 18.0, 9.0, 11.0, 13.0, 16.0, 12.0, 10.0, 28.0, 4.0, 5.0, 8.0, 11.0, 7.0, 12.0, 2.0, 8.0, 7.0, 23.0, 6.0, 5.0, 5.0, 1.0, 2.0, 2.0, 8.0], [472.0, 219.0, 159.0, 115.0, 78.0, 59.0, 42.0, 27.0, 38.0, 21.0, 24.0, 39.0, 28.0, 23.0, 41.0, 52.0, 34.0, 32.0, 28.0, 25.0, 22.0, 23.0, 32.0, 12.0, 21.0, 11.0, 12.0, 12.0, 10.0, 12.0, 6.0, 5.0, 10.0, 9.0, 11.0, 11.0, 8.0, 28.0, 5.0, 4.0, 2.0, 7.0, 8.0, 4.0, 9.0, 0.0, 3.0, 3.0, 12.0], [472.0, 219.0, 141.0, 114.0, 87.0, 87.0, 45.0, 37.0, 28.0, 16.0, 29.0, 30.0, 26.0, 34.0, 43.0, 34.0, 27.0, 36.0, 21.0, 27.0, 20.0, 17.0, 23.0, 19.0, 15.0, 14.0, 21.0, 25.0, 5.0, 6.0, 7.0, 13.0, 11.0, 5.0, 9.0, 11.0, 11.0, 10.0, 8.0, 4.0, 9.0, 27.0, 8.0, 3.0, 2.0, 3.0, 2.0, 2.0, 8.0], [434.0, 214.0, 153.0, 110.0, 101.0, 55.0, 45.0, 36.0, 35.0, 31.0, 22.0, 17.0, 22.0, 52.0, 35.0, 30.0, 79.0, 29.0, 20.0, 21.0, 25.0, 23.0, 22.0, 24.0, 17.0, 13.0, 36.0, 5.0, 13.0, 12.0, 12.0, 7.0, 10.0, 15.0, 10.0, 10.0, 5.0, 4.0, 6.0, 10.0, 7.0, 5.0, 2.0, 5.0, 3.0, 1.0, 3.0, 27.0, 11.0]],
    "Name": "sCurve-0",
    "Overflow": 2617336.0,
    "Type": "Histo2d",
    "Underflow": 0.0,
    "x": {
        "AxisTitle": "Vcal",
        "Bins": 51,
        "High": 302.5,
        "Low": 47.5
    },
    "y": {
        "AxisTitle": "Occupancy",
        "Bins": 49,
        "High": 49.5,
        "Low": 0.5
    },
    "z": {
        "AxisTitle": "Number of pixels"
    }
}