(kicad_sch (version 20211123) (generator eeschema)

  (uuid bff35e53-0373-44e5-a0ce-05175bbecd57)

  (paper "A4")

  (title_block
    (title "Powerboard v3 Massive Active Tester Board")
    (date "2021-03-16")
    (company "Lawrence Berkeley National Laboratory")
    (comment 1 "Karol Krizka")
  )

  (lib_symbols
    (symbol "Connector:Conn_Coaxial" (pin_names (offset 1.016) hide) (in_bom yes) (on_board yes)
      (property "Reference" "J" (id 0) (at 0.254 3.048 0)
        (effects (font (size 1.27 1.27)))
      )
      (property "Value" "Conn_Coaxial" (id 1) (at 2.921 0 90)
        (effects (font (size 1.27 1.27)))
      )
      (property "Footprint" "" (id 2) (at 0 0 0)
        (effects (font (size 1.27 1.27)) hide)
      )
      (property "Datasheet" " ~" (id 3) (at 0 0 0)
        (effects (font (size 1.27 1.27)) hide)
      )
      (property "ki_keywords" "BNC SMA SMB SMC LEMO coaxial connector CINCH RCA" (id 4) (at 0 0 0)
        (effects (font (size 1.27 1.27)) hide)
      )
      (property "ki_description" "coaxial connector (BNC, SMA, SMB, SMC, Cinch/RCA, LEMO, ...)" (id 5) (at 0 0 0)
        (effects (font (size 1.27 1.27)) hide)
      )
      (property "ki_fp_filters" "*BNC* *SMA* *SMB* *SMC* *Cinch* *LEMO*" (id 6) (at 0 0 0)
        (effects (font (size 1.27 1.27)) hide)
      )
      (symbol "Conn_Coaxial_0_1"
        (arc (start -1.778 -0.508) (mid 0.2311 -1.8066) (end 1.778 0)
          (stroke (width 0.254) (type default) (color 0 0 0 0))
          (fill (type none))
        )
        (polyline
          (pts
            (xy -2.54 0)
            (xy -0.508 0)
          )
          (stroke (width 0) (type default) (color 0 0 0 0))
          (fill (type none))
        )
        (polyline
          (pts
            (xy 0 -2.54)
            (xy 0 -1.778)
          )
          (stroke (width 0) (type default) (color 0 0 0 0))
          (fill (type none))
        )
        (circle (center 0 0) (radius 0.508)
          (stroke (width 0.2032) (type default) (color 0 0 0 0))
          (fill (type none))
        )
        (arc (start 1.778 0) (mid 0.2099 1.8101) (end -1.778 0.508)
          (stroke (width 0.254) (type default) (color 0 0 0 0))
          (fill (type none))
        )
      )
      (symbol "Conn_Coaxial_1_1"
        (pin passive line (at -5.08 0 0) (length 2.54)
          (name "In" (effects (font (size 1.27 1.27))))
          (number "1" (effects (font (size 1.27 1.27))))
        )
        (pin passive line (at 0 -5.08 90) (length 2.54)
          (name "Ext" (effects (font (size 1.27 1.27))))
          (number "2" (effects (font (size 1.27 1.27))))
        )
      )
    )
    (symbol "Device:C" (pin_numbers hide) (pin_names (offset 0.254)) (in_bom yes) (on_board yes)
      (property "Reference" "C" (id 0) (at 0.635 2.54 0)
        (effects (font (size 1.27 1.27)) (justify left))
      )
      (property "Value" "C" (id 1) (at 0.635 -2.54 0)
        (effects (font (size 1.27 1.27)) (justify left))
      )
      (property "Footprint" "" (id 2) (at 0.9652 -3.81 0)
        (effects (font (size 1.27 1.27)) hide)
      )
      (property "Datasheet" "~" (id 3) (at 0 0 0)
        (effects (font (size 1.27 1.27)) hide)
      )
      (property "ki_keywords" "cap capacitor" (id 4) (at 0 0 0)
        (effects (font (size 1.27 1.27)) hide)
      )
      (property "ki_description" "Unpolarized capacitor" (id 5) (at 0 0 0)
        (effects (font (size 1.27 1.27)) hide)
      )
      (property "ki_fp_filters" "C_*" (id 6) (at 0 0 0)
        (effects (font (size 1.27 1.27)) hide)
      )
      (symbol "C_0_1"
        (polyline
          (pts
            (xy -2.032 -0.762)
            (xy 2.032 -0.762)
          )
          (stroke (width 0.508) (type default) (color 0 0 0 0))
          (fill (type none))
        )
        (polyline
          (pts
            (xy -2.032 0.762)
            (xy 2.032 0.762)
          )
          (stroke (width 0.508) (type default) (color 0 0 0 0))
          (fill (type none))
        )
      )
      (symbol "C_1_1"
        (pin passive line (at 0 3.81 270) (length 2.794)
          (name "~" (effects (font (size 1.27 1.27))))
          (number "1" (effects (font (size 1.27 1.27))))
        )
        (pin passive line (at 0 -3.81 90) (length 2.794)
          (name "~" (effects (font (size 1.27 1.27))))
          (number "2" (effects (font (size 1.27 1.27))))
        )
      )
    )
    (symbol "Device:R" (pin_numbers hide) (pin_names (offset 0)) (in_bom yes) (on_board yes)
      (property "Reference" "R" (id 0) (at 2.032 0 90)
        (effects (font (size 1.27 1.27)))
      )
      (property "Value" "R" (id 1) (at 0 0 90)
        (effects (font (size 1.27 1.27)))
      )
      (property "Footprint" "" (id 2) (at -1.778 0 90)
        (effects (font (size 1.27 1.27)) hide)
      )
      (property "Datasheet" "~" (id 3) (at 0 0 0)
        (effects (font (size 1.27 1.27)) hide)
      )
      (property "ki_keywords" "R res resistor" (id 4) (at 0 0 0)
        (effects (font (size 1.27 1.27)) hide)
      )
      (property "ki_description" "Resistor" (id 5) (at 0 0 0)
        (effects (font (size 1.27 1.27)) hide)
      )
      (property "ki_fp_filters" "R_*" (id 6) (at 0 0 0)
        (effects (font (size 1.27 1.27)) hide)
      )
      (symbol "R_0_1"
        (rectangle (start -1.016 -2.54) (end 1.016 2.54)
          (stroke (width 0.254) (type default) (color 0 0 0 0))
          (fill (type none))
        )
      )
      (symbol "R_1_1"
        (pin passive line (at 0 3.81 270) (length 1.27)
          (name "~" (effects (font (size 1.27 1.27))))
          (number "1" (effects (font (size 1.27 1.27))))
        )
        (pin passive line (at 0 -3.81 90) (length 1.27)
          (name "~" (effects (font (size 1.27 1.27))))
          (number "2" (effects (font (size 1.27 1.27))))
        )
      )
    )
    (symbol "Interface_Expansion:TCA9534" (in_bom yes) (on_board yes)
      (property "Reference" "U" (id 0) (at -6.35 12.7 0)
        (effects (font (size 1.27 1.27)) (justify left))
      )
      (property "Value" "TCA9534" (id 1) (at 2.54 12.7 0)
        (effects (font (size 1.27 1.27)) (justify left))
      )
      (property "Footprint" "" (id 2) (at 24.13 -13.97 0)
        (effects (font (size 1.27 1.27)) hide)
      )
      (property "Datasheet" "http://www.ti.com/lit/ds/symlink/tca9534.pdf" (id 3) (at 2.54 -2.54 0)
        (effects (font (size 1.27 1.27)) hide)
      )
      (property "ki_keywords" "SMBUS I2C Expander" (id 4) (at 0 0 0)
        (effects (font (size 1.27 1.27)) hide)
      )
      (property "ki_description" "8 Bit Port/Expander, I2C SMBUS, Interrupt output, TSSOP-16, SOIC-16" (id 5) (at 0 0 0)
        (effects (font (size 1.27 1.27)) hide)
      )
      (property "ki_fp_filters" "TSSOP*4.4x5mm*P0.65mm* SOIC*7.5x10.3mm*P1.27mm*" (id 6) (at 0 0 0)
        (effects (font (size 1.27 1.27)) hide)
      )
      (symbol "TCA9534_0_1"
        (rectangle (start -6.35 -13.97) (end 6.35 11.43)
          (stroke (width 0.254) (type default) (color 0 0 0 0))
          (fill (type background))
        )
      )
      (symbol "TCA9534_1_1"
        (pin input line (at -10.16 -5.08 0) (length 3.81)
          (name "A0" (effects (font (size 1.27 1.27))))
          (number "1" (effects (font (size 1.27 1.27))))
        )
        (pin bidirectional line (at 10.16 -5.08 180) (length 3.81)
          (name "P5" (effects (font (size 1.27 1.27))))
          (number "10" (effects (font (size 1.27 1.27))))
        )
        (pin bidirectional line (at 10.16 -7.62 180) (length 3.81)
          (name "P6" (effects (font (size 1.27 1.27))))
          (number "11" (effects (font (size 1.27 1.27))))
        )
        (pin bidirectional line (at 10.16 -10.16 180) (length 3.81)
          (name "P7" (effects (font (size 1.27 1.27))))
          (number "12" (effects (font (size 1.27 1.27))))
        )
        (pin open_collector line (at -10.16 2.54 0) (length 3.81)
          (name "~{INT}" (effects (font (size 1.27 1.27))))
          (number "13" (effects (font (size 1.27 1.27))))
        )
        (pin input line (at -10.16 7.62 0) (length 3.81)
          (name "SCL" (effects (font (size 1.27 1.27))))
          (number "14" (effects (font (size 1.27 1.27))))
        )
        (pin bidirectional line (at -10.16 5.08 0) (length 3.81)
          (name "SDA" (effects (font (size 1.27 1.27))))
          (number "15" (effects (font (size 1.27 1.27))))
        )
        (pin power_in line (at 0 15.24 270) (length 3.81)
          (name "VDD" (effects (font (size 1.27 1.27))))
          (number "16" (effects (font (size 1.27 1.27))))
        )
        (pin input line (at -10.16 -7.62 0) (length 3.81)
          (name "A1" (effects (font (size 1.27 1.27))))
          (number "2" (effects (font (size 1.27 1.27))))
        )
        (pin input line (at -10.16 -10.16 0) (length 3.81)
          (name "A2" (effects (font (size 1.27 1.27))))
          (number "3" (effects (font (size 1.27 1.27))))
        )
        (pin bidirectional line (at 10.16 7.62 180) (length 3.81)
          (name "P0" (effects (font (size 1.27 1.27))))
          (number "4" (effects (font (size 1.27 1.27))))
        )
        (pin bidirectional line (at 10.16 5.08 180) (length 3.81)
          (name "P1" (effects (font (size 1.27 1.27))))
          (number "5" (effects (font (size 1.27 1.27))))
        )
        (pin bidirectional line (at 10.16 2.54 180) (length 3.81)
          (name "P2" (effects (font (size 1.27 1.27))))
          (number "6" (effects (font (size 1.27 1.27))))
        )
        (pin bidirectional line (at 10.16 0 180) (length 3.81)
          (name "P3" (effects (font (size 1.27 1.27))))
          (number "7" (effects (font (size 1.27 1.27))))
        )
        (pin power_in line (at 0 -17.78 90) (length 3.81)
          (name "GND" (effects (font (size 1.27 1.27))))
          (number "8" (effects (font (size 1.27 1.27))))
        )
        (pin bidirectional line (at 10.16 -2.54 180) (length 3.81)
          (name "P4" (effects (font (size 1.27 1.27))))
          (number "9" (effects (font (size 1.27 1.27))))
        )
      )
    )
    (symbol "lbl_lvds:TC7PCI3212MT" (pin_names (offset 1.016)) (in_bom yes) (on_board yes)
      (property "Reference" "U" (id 0) (at -8.89 -5.08 0)
        (effects (font (size 1.524 1.524)))
      )
      (property "Value" "TC7PCI3212MT" (id 1) (at -11.43 -7.62 0)
        (effects (font (size 1.524 1.524)))
      )
      (property "Footprint" "lbl_packages:VQFN-20_2.5x4.5mm_P0.50mm" (id 2) (at 0 -12.7 0)
        (effects (font (size 1.524 1.524)) hide)
      )
      (property "Datasheet" "https://www.mouser.com/datasheet/2/408/TC7PCI3212MT_datasheet_en_20130809-1915956.pdf" (id 3) (at 0 -3.81 0)
        (effects (font (size 1.524 1.524)) hide)
      )
      (property "ki_description" "2 Differential Channel, 2:1 multiplexer/demultiplexer switch for PCI Express Gen3" (id 4) (at 0 0 0)
        (effects (font (size 1.27 1.27)) hide)
      )
      (symbol "TC7PCI3212MT_0_1"
        (rectangle (start -8.89 24.13) (end 8.89 -2.54)
          (stroke (width 0) (type default) (color 0 0 0 0))
          (fill (type background))
        )
      )
      (symbol "TC7PCI3212MT_1_1"
        (pin no_connect line (at -7.62 26.67 270) (length 2.54) hide
          (name "~" (effects (font (size 1.27 1.27))))
          (number "1" (effects (font (size 1.27 1.27))))
        )
        (pin no_connect line (at -5.08 26.67 270) (length 2.54) hide
          (name "~" (effects (font (size 1.27 1.27))))
          (number "10" (effects (font (size 1.27 1.27))))
        )
        (pin passive line (at -2.54 -5.08 90) (length 2.54)
          (name "GND" (effects (font (size 1.27 1.27))))
          (number "11" (effects (font (size 1.27 1.27))))
        )
        (pin bidirectional line (at 11.43 3.81 180) (length 2.54)
          (name "C1-" (effects (font (size 1.27 1.27))))
          (number "12" (effects (font (size 1.27 1.27))))
        )
        (pin bidirectional line (at 11.43 6.35 180) (length 2.54)
          (name "C1+" (effects (font (size 1.27 1.27))))
          (number "13" (effects (font (size 1.27 1.27))))
        )
        (pin bidirectional line (at 11.43 13.97 180) (length 2.54)
          (name "C0-" (effects (font (size 1.27 1.27))))
          (number "14" (effects (font (size 1.27 1.27))))
        )
        (pin bidirectional line (at 11.43 16.51 180) (length 2.54)
          (name "C0+" (effects (font (size 1.27 1.27))))
          (number "15" (effects (font (size 1.27 1.27))))
        )
        (pin bidirectional line (at 11.43 8.89 180) (length 2.54)
          (name "B1-" (effects (font (size 1.27 1.27))))
          (number "16" (effects (font (size 1.27 1.27))))
        )
        (pin bidirectional line (at 11.43 11.43 180) (length 2.54)
          (name "B1+" (effects (font (size 1.27 1.27))))
          (number "17" (effects (font (size 1.27 1.27))))
        )
        (pin bidirectional line (at 11.43 19.05 180) (length 2.54)
          (name "B0-" (effects (font (size 1.27 1.27))))
          (number "18" (effects (font (size 1.27 1.27))))
        )
        (pin bidirectional line (at 11.43 21.59 180) (length 2.54)
          (name "B0+" (effects (font (size 1.27 1.27))))
          (number "19" (effects (font (size 1.27 1.27))))
        )
        (pin input line (at -11.43 1.27 0) (length 2.54)
          (name "OEn" (effects (font (size 1.27 1.27))))
          (number "2" (effects (font (size 1.27 1.27))))
        )
        (pin passive line (at 2.54 -5.08 90) (length 2.54)
          (name "GND" (effects (font (size 1.27 1.27))))
          (number "20" (effects (font (size 1.27 1.27))))
        )
        (pin passive line (at 7.62 -5.08 90) (length 2.54)
          (name "PAD" (effects (font (size 1.27 1.27))))
          (number "21" (effects (font (size 1.27 1.27))))
        )
        (pin bidirectional line (at -11.43 19.05 0) (length 2.54)
          (name "A0+" (effects (font (size 1.27 1.27))))
          (number "3" (effects (font (size 1.27 1.27))))
        )
        (pin bidirectional line (at -11.43 16.51 0) (length 2.54)
          (name "A0-" (effects (font (size 1.27 1.27))))
          (number "4" (effects (font (size 1.27 1.27))))
        )
        (pin passive line (at 0 -5.08 90) (length 2.54)
          (name "GND" (effects (font (size 1.27 1.27))))
          (number "5" (effects (font (size 1.27 1.27))))
        )
        (pin power_in line (at 0 26.67 270) (length 2.54)
          (name "VDD" (effects (font (size 1.27 1.27))))
          (number "6" (effects (font (size 1.27 1.27))))
        )
        (pin bidirectional line (at -11.43 8.89 0) (length 2.54)
          (name "A1+" (effects (font (size 1.27 1.27))))
          (number "7" (effects (font (size 1.27 1.27))))
        )
        (pin bidirectional line (at -11.43 6.35 0) (length 2.54)
          (name "A1-" (effects (font (size 1.27 1.27))))
          (number "8" (effects (font (size 1.27 1.27))))
        )
        (pin input line (at -11.43 -1.27 0) (length 2.54)
          (name "SEL" (effects (font (size 1.27 1.27))))
          (number "9" (effects (font (size 1.27 1.27))))
        )
      )
    )
    (symbol "power:+3V3" (power) (pin_names (offset 0)) (in_bom yes) (on_board yes)
      (property "Reference" "#PWR" (id 0) (at 0 -3.81 0)
        (effects (font (size 1.27 1.27)) hide)
      )
      (property "Value" "+3V3" (id 1) (at 0 3.556 0)
        (effects (font (size 1.27 1.27)))
      )
      (property "Footprint" "" (id 2) (at 0 0 0)
        (effects (font (size 1.27 1.27)) hide)
      )
      (property "Datasheet" "" (id 3) (at 0 0 0)
        (effects (font (size 1.27 1.27)) hide)
      )
      (property "ki_keywords" "power-flag" (id 4) (at 0 0 0)
        (effects (font (size 1.27 1.27)) hide)
      )
      (property "ki_description" "Power symbol creates a global label with name \"+3V3\"" (id 5) (at 0 0 0)
        (effects (font (size 1.27 1.27)) hide)
      )
      (symbol "+3V3_0_1"
        (polyline
          (pts
            (xy -0.762 1.27)
            (xy 0 2.54)
          )
          (stroke (width 0) (type default) (color 0 0 0 0))
          (fill (type none))
        )
        (polyline
          (pts
            (xy 0 0)
            (xy 0 2.54)
          )
          (stroke (width 0) (type default) (color 0 0 0 0))
          (fill (type none))
        )
        (polyline
          (pts
            (xy 0 2.54)
            (xy 0.762 1.27)
          )
          (stroke (width 0) (type default) (color 0 0 0 0))
          (fill (type none))
        )
      )
      (symbol "+3V3_1_1"
        (pin power_in line (at 0 0 90) (length 0) hide
          (name "+3V3" (effects (font (size 1.27 1.27))))
          (number "1" (effects (font (size 1.27 1.27))))
        )
      )
    )
    (symbol "power:GND" (power) (pin_names (offset 0)) (in_bom yes) (on_board yes)
      (property "Reference" "#PWR" (id 0) (at 0 -6.35 0)
        (effects (font (size 1.27 1.27)) hide)
      )
      (property "Value" "GND" (id 1) (at 0 -3.81 0)
        (effects (font (size 1.27 1.27)))
      )
      (property "Footprint" "" (id 2) (at 0 0 0)
        (effects (font (size 1.27 1.27)) hide)
      )
      (property "Datasheet" "" (id 3) (at 0 0 0)
        (effects (font (size 1.27 1.27)) hide)
      )
      (property "ki_keywords" "power-flag" (id 4) (at 0 0 0)
        (effects (font (size 1.27 1.27)) hide)
      )
      (property "ki_description" "Power symbol creates a global label with name \"GND\" , ground" (id 5) (at 0 0 0)
        (effects (font (size 1.27 1.27)) hide)
      )
      (symbol "GND_0_1"
        (polyline
          (pts
            (xy 0 0)
            (xy 0 -1.27)
            (xy 1.27 -1.27)
            (xy 0 -2.54)
            (xy -1.27 -1.27)
            (xy 0 -1.27)
          )
          (stroke (width 0) (type default) (color 0 0 0 0))
          (fill (type none))
        )
      )
      (symbol "GND_1_1"
        (pin power_in line (at 0 0 270) (length 0) hide
          (name "GND" (effects (font (size 1.27 1.27))))
          (number "1" (effects (font (size 1.27 1.27))))
        )
      )
    )
  )

  (junction (at 194.31 104.14) (diameter 0) (color 0 0 0 0)
    (uuid 311a70eb-5859-4da6-8fe4-344b06368e0f)
  )
  (junction (at 194.31 154.94) (diameter 0) (color 0 0 0 0)
    (uuid 4445e598-1c38-4291-936b-eafc95d0cf78)
  )
  (junction (at 194.31 53.34) (diameter 0) (color 0 0 0 0)
    (uuid 486e42a8-ccd7-4296-b46d-c1c0b1981be4)
  )
  (junction (at 196.85 154.94) (diameter 0) (color 0 0 0 0)
    (uuid 741e6598-04b9-4005-a079-9081c23103ab)
  )
  (junction (at 196.85 104.14) (diameter 0) (color 0 0 0 0)
    (uuid c355ca51-32bc-4d88-a250-07d5621dd709)
  )
  (junction (at 82.55 138.43) (diameter 0) (color 0 0 0 0)
    (uuid c3c15276-82a5-4b64-990f-7f503a97141e)
  )
  (junction (at 196.85 53.34) (diameter 0) (color 0 0 0 0)
    (uuid f252e204-5b1e-4386-b15b-42d6a51ae097)
  )

  (no_connect (at 82.55 130.81) (uuid 82f0532d-1a6d-464b-ad29-fc3e8108d6a8))
  (no_connect (at 102.87 143.51) (uuid 85c4eb9a-1efe-40fd-86af-36f89108b5f9))
  (no_connect (at 102.87 133.35) (uuid b67591ef-79c1-406a-9cdd-2d6de62566a6))
  (no_connect (at 205.74 135.89) (uuid ba54b977-6e85-4849-863a-8aba90c0983f))
  (no_connect (at 205.74 133.35) (uuid f37be837-3bee-4441-b239-c214f98ba58a))

  (bus_entry (at 29.21 50.8) (size 2.54 2.54)
    (stroke (width 0) (type default) (color 0 0 0 0))
    (uuid 2009ab3a-f4bf-4c63-a0fe-9d170c762787)
  )
  (bus_entry (at 29.21 27.94) (size 2.54 2.54)
    (stroke (width 0) (type default) (color 0 0 0 0))
    (uuid 2798cc00-37db-458a-b5f8-bea65ae99be7)
  )
  (bus_entry (at 29.21 40.64) (size 2.54 2.54)
    (stroke (width 0) (type default) (color 0 0 0 0))
    (uuid 2926e945-d9e3-4a4e-9b51-aad244dc04f4)
  )
  (bus_entry (at 29.21 73.66) (size 2.54 2.54)
    (stroke (width 0) (type default) (color 0 0 0 0))
    (uuid 33193802-955d-4a94-98cf-a3ed27526865)
  )
  (bus_entry (at 29.21 35.56) (size 2.54 2.54)
    (stroke (width 0) (type default) (color 0 0 0 0))
    (uuid 334446cd-af18-48a8-bb73-a88f4d220620)
  )
  (bus_entry (at 29.21 63.5) (size 2.54 2.54)
    (stroke (width 0) (type default) (color 0 0 0 0))
    (uuid 37c732a1-cf44-4113-843f-85a5910958ec)
  )
  (bus_entry (at 29.21 43.18) (size 2.54 2.54)
    (stroke (width 0) (type default) (color 0 0 0 0))
    (uuid 432045b0-7589-468b-8659-999ac30c51fa)
  )
  (bus_entry (at 29.21 45.72) (size 2.54 2.54)
    (stroke (width 0) (type default) (color 0 0 0 0))
    (uuid 4d290f63-844a-4f7b-8aec-c610c29b1e2f)
  )
  (bus_entry (at 29.21 78.74) (size 2.54 2.54)
    (stroke (width 0) (type default) (color 0 0 0 0))
    (uuid 570b0686-0fc3-46c1-be51-39569bba54ce)
  )
  (bus_entry (at 29.21 71.12) (size 2.54 2.54)
    (stroke (width 0) (type default) (color 0 0 0 0))
    (uuid 7966563c-e279-4a7c-bf41-af45d42c4a74)
  )
  (bus_entry (at 29.21 81.28) (size 2.54 2.54)
    (stroke (width 0) (type default) (color 0 0 0 0))
    (uuid 7cc91655-208f-4c40-986f-00fd054b4b29)
  )
  (bus_entry (at 29.21 38.1) (size 2.54 2.54)
    (stroke (width 0) (type default) (color 0 0 0 0))
    (uuid 978f5906-8b9c-49a6-9b77-25cbc28e396e)
  )
  (bus_entry (at 29.21 30.48) (size 2.54 2.54)
    (stroke (width 0) (type default) (color 0 0 0 0))
    (uuid a54a2d51-4b66-4d14-b33d-1444b55de06d)
  )
  (bus_entry (at 29.21 66.04) (size 2.54 2.54)
    (stroke (width 0) (type default) (color 0 0 0 0))
    (uuid b2d11b31-1b82-4d0c-a24f-3ecd947114ec)
  )
  (bus_entry (at 29.21 76.2) (size 2.54 2.54)
    (stroke (width 0) (type default) (color 0 0 0 0))
    (uuid c61a2d85-d3d7-4faf-9bef-d07618588ca0)
  )
  (bus_entry (at 29.21 83.82) (size 2.54 2.54)
    (stroke (width 0) (type default) (color 0 0 0 0))
    (uuid ce824579-a256-4757-8547-32bf1db63637)
  )
  (bus_entry (at 29.21 68.58) (size 2.54 2.54)
    (stroke (width 0) (type default) (color 0 0 0 0))
    (uuid e0795232-a4f5-40af-bd8a-4a69f1a39aa6)
  )
  (bus_entry (at 29.21 86.36) (size 2.54 2.54)
    (stroke (width 0) (type default) (color 0 0 0 0))
    (uuid f66b82ab-c203-4cb4-84ea-abcb2cd50a9c)
  )
  (bus_entry (at 29.21 33.02) (size 2.54 2.54)
    (stroke (width 0) (type default) (color 0 0 0 0))
    (uuid f7eedf75-4d8e-4db5-a979-879f661d7288)
  )
  (bus_entry (at 29.21 48.26) (size 2.54 2.54)
    (stroke (width 0) (type default) (color 0 0 0 0))
    (uuid fdd0a3ff-3d05-4dc5-8f2c-3aa967326c19)
  )

  (wire (pts (xy 201.93 104.14) (xy 196.85 104.14))
    (stroke (width 0) (type default) (color 0 0 0 0))
    (uuid 0a1ac2c6-8da8-4410-b772-69afa2855077)
  )
  (bus (pts (xy 29.21 35.56) (xy 29.21 38.1))
    (stroke (width 0) (type default) (color 0 0 0 0))
    (uuid 107fe7c5-84ae-442d-9ac6-a07c7ee8c825)
  )

  (wire (pts (xy 196.85 53.34) (xy 201.93 53.34))
    (stroke (width 0) (type default) (color 0 0 0 0))
    (uuid 119a2ba9-03f2-48af-8f1a-4a96cb25a3bf)
  )
  (wire (pts (xy 254 29.21) (xy 254 27.94))
    (stroke (width 0) (type default) (color 0 0 0 0))
    (uuid 163cdeae-7841-4f2c-b738-e36b081d5e19)
  )
  (wire (pts (xy 33.02 35.56) (xy 31.75 35.56))
    (stroke (width 0) (type default) (color 0 0 0 0))
    (uuid 168a0226-3f44-46ec-a72a-15290137bd66)
  )
  (wire (pts (xy 191.77 154.94) (xy 194.31 154.94))
    (stroke (width 0) (type default) (color 0 0 0 0))
    (uuid 1a657991-5c9c-41a4-9f2e-22f0c7450b3a)
  )
  (wire (pts (xy 228.6 29.21) (xy 228.6 27.94))
    (stroke (width 0) (type default) (color 0 0 0 0))
    (uuid 1fbda89d-82ba-4f0a-b113-988f269883dc)
  )
  (wire (pts (xy 33.02 81.28) (xy 31.75 81.28))
    (stroke (width 0) (type default) (color 0 0 0 0))
    (uuid 21491966-3c4c-414a-8ddc-0c7176ddff87)
  )
  (wire (pts (xy 241.3 29.21) (xy 241.3 27.94))
    (stroke (width 0) (type default) (color 0 0 0 0))
    (uuid 240fde71-00e0-458d-bf75-b4d973cb180b)
  )
  (wire (pts (xy 254 20.32) (xy 254 19.05))
    (stroke (width 0) (type default) (color 0 0 0 0))
    (uuid 2415334a-b998-4d19-a8b5-e60e8af2aff4)
  )
  (wire (pts (xy 33.02 45.72) (xy 31.75 45.72))
    (stroke (width 0) (type default) (color 0 0 0 0))
    (uuid 2b7fcec9-f103-4c1e-8056-817283941746)
  )
  (wire (pts (xy 33.02 43.18) (xy 31.75 43.18))
    (stroke (width 0) (type default) (color 0 0 0 0))
    (uuid 318b1c02-8f98-40e0-8672-6e5f766110ad)
  )
  (wire (pts (xy 241.3 20.32) (xy 241.3 19.05))
    (stroke (width 0) (type default) (color 0 0 0 0))
    (uuid 325006ce-4c23-4f07-9871-dc0cd047f7fd)
  )
  (wire (pts (xy 196.85 154.94) (xy 201.93 154.94))
    (stroke (width 0) (type default) (color 0 0 0 0))
    (uuid 3450ae82-42ae-493f-904b-d8b1a09c107a)
  )
  (wire (pts (xy 33.02 73.66) (xy 31.75 73.66))
    (stroke (width 0) (type default) (color 0 0 0 0))
    (uuid 363809f4-b895-434e-8ee8-f8b8fb35d4fe)
  )
  (bus (pts (xy 29.21 78.74) (xy 29.21 81.28))
    (stroke (width 0) (type default) (color 0 0 0 0))
    (uuid 3714d7ab-da0a-493a-b871-4b3522fa0a09)
  )

  (wire (pts (xy 92.71 152.4) (xy 92.71 151.13))
    (stroke (width 0) (type default) (color 0 0 0 0))
    (uuid 389820b3-dc0f-41a8-9487-f37594ec848d)
  )
  (wire (pts (xy 68.58 135.89) (xy 68.58 139.7))
    (stroke (width 0) (type default) (color 0 0 0 0))
    (uuid 39549a53-fe72-4509-a12d-de170bbf0433)
  )
  (wire (pts (xy 228.6 20.32) (xy 228.6 19.05))
    (stroke (width 0) (type default) (color 0 0 0 0))
    (uuid 3d927ca0-f4ad-42ab-b902-dfef8d84eebb)
  )
  (wire (pts (xy 73.66 143.51) (xy 73.66 142.24))
    (stroke (width 0) (type default) (color 0 0 0 0))
    (uuid 4035093c-8c14-4085-bfea-fcb41c163f69)
  )
  (wire (pts (xy 33.02 83.82) (xy 31.75 83.82))
    (stroke (width 0) (type default) (color 0 0 0 0))
    (uuid 4159a1b3-645b-4fcf-a72d-9242b2067a63)
  )
  (wire (pts (xy 191.77 104.14) (xy 194.31 104.14))
    (stroke (width 0) (type default) (color 0 0 0 0))
    (uuid 437daa66-7365-482e-804c-8098c6a0905c)
  )
  (wire (pts (xy 33.02 71.12) (xy 31.75 71.12))
    (stroke (width 0) (type default) (color 0 0 0 0))
    (uuid 49956dd5-35c0-4b9f-8b2a-6f2b8918bd8c)
  )
  (wire (pts (xy 80.01 125.73) (xy 82.55 125.73))
    (stroke (width 0) (type default) (color 0 0 0 0))
    (uuid 4cb674e3-7fd0-4bdf-83d4-7b2424e2e5c0)
  )
  (wire (pts (xy 194.31 105.41) (xy 194.31 104.14))
    (stroke (width 0) (type default) (color 0 0 0 0))
    (uuid 4d759aa0-1145-43ae-a507-a45f6fc89e2a)
  )
  (bus (pts (xy 29.21 81.28) (xy 29.21 83.82))
    (stroke (width 0) (type default) (color 0 0 0 0))
    (uuid 4f396d42-6bc4-473f-aca6-b834f29dc1f1)
  )

  (wire (pts (xy 33.02 33.02) (xy 31.75 33.02))
    (stroke (width 0) (type default) (color 0 0 0 0))
    (uuid 54562a16-6662-4d1b-9b50-45ed0ae36481)
  )
  (wire (pts (xy 80.01 128.27) (xy 82.55 128.27))
    (stroke (width 0) (type default) (color 0 0 0 0))
    (uuid 58518ef0-9375-45b7-b518-1100f14f6963)
  )
  (bus (pts (xy 29.21 30.48) (xy 29.21 33.02))
    (stroke (width 0) (type default) (color 0 0 0 0))
    (uuid 5fa72ed7-ec8c-4ac2-a6e0-52d4d5626877)
  )

  (wire (pts (xy 82.55 135.89) (xy 68.58 135.89))
    (stroke (width 0) (type default) (color 0 0 0 0))
    (uuid 71c1b4b1-fe29-4ef4-89f5-de4386e105a9)
  )
  (wire (pts (xy 194.31 156.21) (xy 194.31 154.94))
    (stroke (width 0) (type default) (color 0 0 0 0))
    (uuid 78502c21-b204-41a4-a74c-663a74be7530)
  )
  (wire (pts (xy 194.31 21.59) (xy 194.31 20.32))
    (stroke (width 0) (type default) (color 0 0 0 0))
    (uuid 79094860-9de1-4089-9ad1-fb708c7e674c)
  )
  (wire (pts (xy 33.02 76.2) (xy 31.75 76.2))
    (stroke (width 0) (type default) (color 0 0 0 0))
    (uuid 791a5e22-eefd-4c9f-8145-64da9c193893)
  )
  (bus (pts (xy 29.21 38.1) (xy 29.21 40.64))
    (stroke (width 0) (type default) (color 0 0 0 0))
    (uuid 7b0375fd-a4df-4e3a-b6bf-8dc03528d9c8)
  )

  (wire (pts (xy 205.74 143.51) (xy 205.74 146.05))
    (stroke (width 0) (type default) (color 0 0 0 0))
    (uuid 7b0b2e9d-7b62-4d86-ba92-8de66c2be81f)
  )
  (wire (pts (xy 33.02 78.74) (xy 31.75 78.74))
    (stroke (width 0) (type default) (color 0 0 0 0))
    (uuid 7d6a83ee-b39d-480d-9568-6e909628ec27)
  )
  (wire (pts (xy 191.77 53.34) (xy 194.31 53.34))
    (stroke (width 0) (type default) (color 0 0 0 0))
    (uuid 7db41bda-359c-420f-bdf5-221e6a8efd3d)
  )
  (bus (pts (xy 29.21 83.82) (xy 29.21 86.36))
    (stroke (width 0) (type default) (color 0 0 0 0))
    (uuid 7eb21bab-a05a-4bbb-b256-bb6c88f98f65)
  )
  (bus (pts (xy 29.21 33.02) (xy 29.21 35.56))
    (stroke (width 0) (type default) (color 0 0 0 0))
    (uuid 89e55abc-0aee-4d27-a8f6-0a8654d804c1)
  )

  (wire (pts (xy 74.93 143.51) (xy 73.66 143.51))
    (stroke (width 0) (type default) (color 0 0 0 0))
    (uuid 94865570-11cc-4b49-8ee4-db024780b3ae)
  )
  (wire (pts (xy 33.02 53.34) (xy 31.75 53.34))
    (stroke (width 0) (type default) (color 0 0 0 0))
    (uuid 956f8a88-9acc-4e52-9280-d386fdb26e68)
  )
  (bus (pts (xy 29.21 71.12) (xy 29.21 73.66))
    (stroke (width 0) (type default) (color 0 0 0 0))
    (uuid 9a477a6a-5267-46ac-bca9-908f86330b3d)
  )

  (wire (pts (xy 194.31 104.14) (xy 196.85 104.14))
    (stroke (width 0) (type default) (color 0 0 0 0))
    (uuid 9d221b3b-0bfe-4439-a426-0f2594b9c7bf)
  )
  (bus (pts (xy 29.21 45.72) (xy 29.21 48.26))
    (stroke (width 0) (type default) (color 0 0 0 0))
    (uuid a101fd62-6ae4-41dd-91e6-aa5095ef2017)
  )

  (wire (pts (xy 33.02 38.1) (xy 31.75 38.1))
    (stroke (width 0) (type default) (color 0 0 0 0))
    (uuid a1bbbcb7-3394-4d47-a7e2-c5aca5915b62)
  )
  (wire (pts (xy 33.02 68.58) (xy 31.75 68.58))
    (stroke (width 0) (type default) (color 0 0 0 0))
    (uuid a5129eb7-d259-4824-8f60-442feba02c79)
  )
  (wire (pts (xy 33.02 50.8) (xy 31.75 50.8))
    (stroke (width 0) (type default) (color 0 0 0 0))
    (uuid ae0ad2a8-816d-4ed9-8122-ce73b249d5bc)
  )
  (bus (pts (xy 29.21 63.5) (xy 29.21 66.04))
    (stroke (width 0) (type default) (color 0 0 0 0))
    (uuid b092272b-afc2-4b95-b23e-48c3d3080f6e)
  )

  (wire (pts (xy 81.915 102.235) (xy 81.915 103.505))
    (stroke (width 0) (type default) (color 0 0 0 0))
    (uuid b5e1d796-f3d8-4363-a6bf-5bf078e880e8)
  )
  (wire (pts (xy 194.31 54.61) (xy 194.31 53.34))
    (stroke (width 0) (type default) (color 0 0 0 0))
    (uuid b67db6fb-e010-4837-9b46-419c0d446aba)
  )
  (bus (pts (xy 29.21 76.2) (xy 29.21 78.74))
    (stroke (width 0) (type default) (color 0 0 0 0))
    (uuid b67ee340-7981-4107-b242-2e31bb56c79c)
  )

  (wire (pts (xy 194.31 123.19) (xy 194.31 121.92))
    (stroke (width 0) (type default) (color 0 0 0 0))
    (uuid ba80136a-34d0-4a97-a9c9-c43ab3f7be6e)
  )
  (bus (pts (xy 29.21 73.66) (xy 29.21 76.2))
    (stroke (width 0) (type default) (color 0 0 0 0))
    (uuid c0d55760-30bd-490e-b5bd-f182a77e1a61)
  )
  (bus (pts (xy 29.21 40.64) (xy 29.21 43.18))
    (stroke (width 0) (type default) (color 0 0 0 0))
    (uuid c3a39680-eeb2-4335-a2ec-8069212537b9)
  )
  (bus (pts (xy 29.21 66.04) (xy 29.21 68.58))
    (stroke (width 0) (type default) (color 0 0 0 0))
    (uuid c3a7841a-e0c6-42f0-b8cf-d4212abf8c31)
  )

  (wire (pts (xy 194.31 72.39) (xy 194.31 71.12))
    (stroke (width 0) (type default) (color 0 0 0 0))
    (uuid c435621a-1e7b-4aea-a701-d5d27a54bd0d)
  )
  (wire (pts (xy 33.02 88.9) (xy 31.75 88.9))
    (stroke (width 0) (type default) (color 0 0 0 0))
    (uuid c5ed04ff-a810-4989-b637-8cc763ae2ab6)
  )
  (wire (pts (xy 82.55 140.97) (xy 82.55 138.43))
    (stroke (width 0) (type default) (color 0 0 0 0))
    (uuid cba11463-444d-4fb1-9f76-b3065c51a98b)
  )
  (wire (pts (xy 33.02 40.64) (xy 31.75 40.64))
    (stroke (width 0) (type default) (color 0 0 0 0))
    (uuid ccefc75b-fd16-4e82-963f-281710a98051)
  )
  (wire (pts (xy 33.02 48.26) (xy 31.75 48.26))
    (stroke (width 0) (type default) (color 0 0 0 0))
    (uuid cd008119-17d3-4098-90f3-4ace8a150683)
  )
  (wire (pts (xy 81.915 112.395) (xy 81.915 111.125))
    (stroke (width 0) (type default) (color 0 0 0 0))
    (uuid d3ea5011-250b-4076-bf21-0457c1dc2816)
  )
  (wire (pts (xy 33.02 86.36) (xy 31.75 86.36))
    (stroke (width 0) (type default) (color 0 0 0 0))
    (uuid d7b44d07-2cb6-4c10-bad9-adf2185ee6fd)
  )
  (bus (pts (xy 29.21 68.58) (xy 29.21 71.12))
    (stroke (width 0) (type default) (color 0 0 0 0))
    (uuid d8acd365-cdd5-4d70-980b-b94f9654064c)
  )
  (bus (pts (xy 29.21 48.26) (xy 29.21 50.8))
    (stroke (width 0) (type default) (color 0 0 0 0))
    (uuid dbbb11b7-cd69-43c0-8928-d98f48baee20)
  )

  (wire (pts (xy 33.02 30.48) (xy 31.75 30.48))
    (stroke (width 0) (type default) (color 0 0 0 0))
    (uuid dfdaa22a-0489-48da-8a56-737e4c4366e1)
  )
  (wire (pts (xy 194.31 154.94) (xy 196.85 154.94))
    (stroke (width 0) (type default) (color 0 0 0 0))
    (uuid e12656ad-962f-4bd5-a35d-a45aa6b4e27e)
  )
  (bus (pts (xy 29.21 60.96) (xy 29.21 63.5))
    (stroke (width 0) (type default) (color 0 0 0 0))
    (uuid e51830a2-6dc5-4f13-834b-b490ff3a07e5)
  )

  (wire (pts (xy 33.02 66.04) (xy 31.75 66.04))
    (stroke (width 0) (type default) (color 0 0 0 0))
    (uuid e567c545-204a-4e4a-bfa9-ae48e2366f9a)
  )
  (wire (pts (xy 82.55 135.89) (xy 82.55 138.43))
    (stroke (width 0) (type default) (color 0 0 0 0))
    (uuid e5abcaa8-c89a-49d4-9e47-28a25f37d322)
  )
  (bus (pts (xy 29.21 43.18) (xy 29.21 45.72))
    (stroke (width 0) (type default) (color 0 0 0 0))
    (uuid e6354de7-405c-49de-a746-a1c8208fc5f4)
  )
  (bus (pts (xy 29.21 27.94) (xy 29.21 30.48))
    (stroke (width 0) (type default) (color 0 0 0 0))
    (uuid ef94b030-682e-4281-9601-1fd8d84b014b)
  )

  (wire (pts (xy 92.71 116.84) (xy 92.71 118.11))
    (stroke (width 0) (type default) (color 0 0 0 0))
    (uuid f80a85fd-e6d4-41d6-ba9f-12f575651e85)
  )
  (bus (pts (xy 29.21 25.4) (xy 29.21 27.94))
    (stroke (width 0) (type default) (color 0 0 0 0))
    (uuid fd27925d-9b2e-4663-bdb7-e46b9715b801)
  )

  (wire (pts (xy 194.31 53.34) (xy 196.85 53.34))
    (stroke (width 0) (type default) (color 0 0 0 0))
    (uuid ff3f0dce-48a8-4a4e-9a85-b6808253807b)
  )

  (label "COIL_N2" (at 33.02 71.12 0)
    (effects (font (size 1.524 1.524)) (justify left bottom))
    (uuid 06691abe-4a61-4d84-ab64-63ace23bf8b5)
  )
  (label "COIL_N2" (at 205.74 34.29 0)
    (effects (font (size 1.524 1.524)) (justify left bottom))
    (uuid 0739a502-7fa1-4e85-8cae-604fd21c9156)
  )
  (label "COIL_P4" (at 205.74 77.47 0)
    (effects (font (size 1.524 1.524)) (justify left bottom))
    (uuid 0afc6592-c2db-4caa-a22b-f13f9e7e1c40)
  )
  (label "COIL_P0" (at 33.02 30.48 0)
    (effects (font (size 1.524 1.524)) (justify left bottom))
    (uuid 17c7b03d-e4b9-4587-b2ce-0ee7a9d30575)
  )
  (label "COIL_P9" (at 33.02 53.34 0)
    (effects (font (size 1.524 1.524)) (justify left bottom))
    (uuid 18406746-0f9d-4d88-9ef2-8423e08576f0)
  )
  (label "COIL_N6" (at 33.02 81.28 0)
    (effects (font (size 1.524 1.524)) (justify left bottom))
    (uuid 1b73c962-e471-4ec3-ab97-9114c97a5609)
  )
  (label "COIL_P8" (at 33.02 50.8 0)
    (effects (font (size 1.524 1.524)) (justify left bottom))
    (uuid 20ac7a70-5cb9-4418-b061-8e4ee8d36b79)
  )
  (label "COIL_N5" (at 33.02 78.74 0)
    (effects (font (size 1.524 1.524)) (justify left bottom))
    (uuid 24e41c56-597e-4023-adfa-f1d5bfd2a519)
  )
  (label "COIL_P8" (at 205.74 128.27 0)
    (effects (font (size 1.524 1.524)) (justify left bottom))
    (uuid 3491c78b-620e-46ca-a1c1-053b49774cc7)
  )
  (label "EN0" (at 182.88 49.53 180)
    (effects (font (size 1.524 1.524)) (justify right bottom))
    (uuid 34f20938-82be-4faa-a3bd-ea4ff60955a6)
  )
  (label "COIL_P1" (at 33.02 33.02 0)
    (effects (font (size 1.524 1.524)) (justify left bottom))
    (uuid 381ea437-8589-413a-8d00-c27a465a3773)
  )
  (label "COIL_P6" (at 205.74 82.55 0)
    (effects (font (size 1.524 1.524)) (justify left bottom))
    (uuid 3d38eca7-b037-4400-970c-46db57e3c3cb)
  )
  (label "COIL_N0" (at 33.02 66.04 0)
    (effects (font (size 1.524 1.524)) (justify left bottom))
    (uuid 3e6949fd-a9d6-4530-9145-d07c13ad2635)
  )
  (label "EN1" (at 182.88 100.33 180)
    (effects (font (size 1.524 1.524)) (justify right bottom))
    (uuid 3f6533ba-c4f9-46fc-b56b-e4570f6ba8d8)
  )
  (label "EN2" (at 102.87 125.73 0)
    (effects (font (size 1.524 1.524)) (justify left bottom))
    (uuid 4a151dd5-28d8-42af-b70d-d52cf427540e)
  )
  (label "COIL_N" (at 182.88 41.91 180)
    (effects (font (size 1.524 1.524)) (justify right bottom))
    (uuid 4ab287b0-f7e5-4d54-ac56-3885f4c05418)
  )
  (label "COIL_N9" (at 205.74 140.97 0)
    (effects (font (size 1.524 1.524)) (justify left bottom))
    (uuid 4ed19592-a5c4-4f6f-8e35-67fef4315ee4)
  )
  (label "COIL_P5" (at 205.74 87.63 0)
    (effects (font (size 1.524 1.524)) (justify left bottom))
    (uuid 4f2de74c-a0a3-419c-86d3-f1056d120362)
  )
  (label "COIL_N4" (at 33.02 76.2 0)
    (effects (font (size 1.524 1.524)) (justify left bottom))
    (uuid 5632ff9d-82e3-45b5-a86b-5a4683beef51)
  )
  (label "COIL_N" (at 182.88 92.71 180)
    (effects (font (size 1.524 1.524)) (justify right bottom))
    (uuid 5b1cf420-b469-4a8f-a998-9abdfd8b7687)
  )
  (label "EN2" (at 182.88 151.13 180)
    (effects (font (size 1.524 1.524)) (justify right bottom))
    (uuid 5baacfaf-4f9b-484a-b0ad-900c2c96f940)
  )
  (label "COIL_N9" (at 33.02 88.9 0)
    (effects (font (size 1.524 1.524)) (justify left bottom))
    (uuid 5c080aa7-74cc-491d-a4fa-a35e9d41b2a9)
  )
  (label "COIL_N" (at 182.88 31.75 180)
    (effects (font (size 1.524 1.524)) (justify right bottom))
    (uuid 5f6e226e-a567-408b-beb0-c8a8e2ec508f)
  )
  (label "COIL_P" (at 182.88 29.21 180)
    (effects (font (size 1.524 1.524)) (justify right bottom))
    (uuid 606cc23c-679a-4fa3-b3b1-c023026298b1)
  )
  (label "COIL_P" (at 182.88 90.17 180)
    (effects (font (size 1.524 1.524)) (justify right bottom))
    (uuid 60e61964-6ea7-468c-b4d5-c464c2964fb4)
  )
  (label "COIL_N4" (at 205.74 80.01 0)
    (effects (font (size 1.524 1.524)) (justify left bottom))
    (uuid 62b6b2b3-6ade-4e95-8062-936451a2172f)
  )
  (label "COIL_P4" (at 33.02 40.64 0)
    (effects (font (size 1.524 1.524)) (justify left bottom))
    (uuid 6f581e98-caac-4a3a-b0ed-76aab462e56a)
  )
  (label "COIL_P5" (at 33.02 43.18 0)
    (effects (font (size 1.524 1.524)) (justify left bottom))
    (uuid 73b08644-febb-4c1e-9b8f-826cf4cd7348)
  )
  (label "EN0" (at 102.87 130.81 0)
    (effects (font (size 1.524 1.524)) (justify left bottom))
    (uuid 75fcab2b-759b-4221-b3ed-5bcbea1afb05)
  )
  (label "COIL_N3" (at 205.74 44.45 0)
    (effects (font (size 1.524 1.524)) (justify left bottom))
    (uuid 7de04273-7eda-4419-ad6c-938bfee9f2d2)
  )
  (label "COIL_P7" (at 205.74 92.71 0)
    (effects (font (size 1.524 1.524)) (justify left bottom))
    (uuid 8c497335-9f19-4d8f-81b9-d3f6e5560190)
  )
  (label "MUX_EN1" (at 102.87 138.43 0)
    (effects (font (size 1.524 1.524)) (justify left bottom))
    (uuid 8cc78138-26c2-4be3-a4bd-4ad124dd5c3d)
  )
  (label "MUX_EN2" (at 102.87 135.89 0)
    (effects (font (size 1.524 1.524)) (justify left bottom))
    (uuid 959ed360-eb0a-4a79-8f34-5faaf7fec5ad)
  )
  (label "COIL_N0" (at 205.74 29.21 0)
    (effects (font (size 1.524 1.524)) (justify left bottom))
    (uuid 99187cb6-681b-4886-9fc6-864207b7616f)
  )
  (label "MUX_EN1" (at 182.88 97.79 180)
    (effects (font (size 1.524 1.524)) (justify right bottom))
    (uuid 9c8b409b-0d1b-49e5-8fed-acd83e0e8b3e)
  )
  (label "COIL_N7" (at 205.74 95.25 0)
    (effects (font (size 1.524 1.524)) (justify left bottom))
    (uuid ac5a5c45-797a-4bbe-bfd5-5ce5a8aa3463)
  )
  (label "COIL_P" (at 182.88 140.97 180)
    (effects (font (size 1.524 1.524)) (justify right bottom))
    (uuid ae9a2cfc-2e02-4731-9394-e388bba596f8)
  )
  (label "COIL_P" (at 182.88 80.01 180)
    (effects (font (size 1.524 1.524)) (justify right bottom))
    (uuid b4bb129a-27c6-47af-a65b-1d062a176af1)
  )
  (label "COIL_N" (at 182.88 133.35 180)
    (effects (font (size 1.524 1.524)) (justify right bottom))
    (uuid b555eee7-8149-4892-8ba4-057aabcbbee2)
  )
  (label "COIL_N8" (at 205.74 130.81 0)
    (effects (font (size 1.524 1.524)) (justify left bottom))
    (uuid b5a26653-4e77-4514-a8f1-63ca7c4f9ab9)
  )
  (label "COIL_P2" (at 205.74 31.75 0)
    (effects (font (size 1.524 1.524)) (justify left bottom))
    (uuid baa2bb27-3ff4-481e-b331-7cfee71362fe)
  )
  (label "MUX_EN0" (at 182.88 46.99 180)
    (effects (font (size 1.524 1.524)) (justify right bottom))
    (uuid bb857b3f-cfd2-48ea-8ae4-988435afb17f)
  )
  (label "COIL_N1" (at 33.02 68.58 0)
    (effects (font (size 1.524 1.524)) (justify left bottom))
    (uuid be78c320-66c9-47db-84c6-e07682b2c3ee)
  )
  (label "COIL_P" (at 139.7 35.56 180)
    (effects (font (size 1.524 1.524)) (justify right bottom))
    (uuid c40d36bb-2efa-4bc3-859b-223faaa66f3e)
  )
  (label "COIL_P" (at 182.88 130.81 180)
    (effects (font (size 1.524 1.524)) (justify right bottom))
    (uuid c97ec1e3-38c3-4514-9704-1b06a25c7c8d)
  )
  (label "MUX_EN0" (at 102.87 140.97 0)
    (effects (font (size 1.524 1.524)) (justify left bottom))
    (uuid ca6052ba-b6c7-4761-b3cb-c749f8cbf361)
  )
  (label "COIL_P7" (at 33.02 48.26 0)
    (effects (font (size 1.524 1.524)) (justify left bottom))
    (uuid d0823f78-79d3-470b-87e6-694e750395bc)
  )
  (label "COIL_N6" (at 205.74 85.09 0)
    (effects (font (size 1.524 1.524)) (justify left bottom))
    (uuid d0d2152d-05bb-45b9-922c-65dc46f5a5df)
  )
  (label "COIL_P9" (at 205.74 138.43 0)
    (effects (font (size 1.524 1.524)) (justify left bottom))
    (uuid d789eb5c-7750-4e88-bd51-088f1d8d4899)
  )
  (label "EN1" (at 102.87 128.27 0)
    (effects (font (size 1.524 1.524)) (justify left bottom))
    (uuid db3e62ed-d2c4-4262-9844-874282d066c8)
  )
  (label "COIL_P1" (at 205.74 36.83 0)
    (effects (font (size 1.524 1.524)) (justify left bottom))
    (uuid dc463df2-2692-4a08-9d95-1a693251e4f0)
  )
  (label "COIL_P3" (at 33.02 38.1 0)
    (effects (font (size 1.524 1.524)) (justify left bottom))
    (uuid dc50af72-15b3-4fb5-bf25-289e8b8f51f6)
  )
  (label "MUX_EN2" (at 182.88 148.59 180)
    (effects (font (size 1.524 1.524)) (justify right bottom))
    (uuid dcbc5a2e-2561-4663-8736-09acc9fe0209)
  )
  (label "COIL_N" (at 182.88 82.55 180)
    (effects (font (size 1.524 1.524)) (justify right bottom))
    (uuid de673e63-5f43-4989-8aea-860e28e93f50)
  )
  (label "COIL_P2" (at 33.02 35.56 0)
    (effects (font (size 1.524 1.524)) (justify left bottom))
    (uuid e12ec3e8-0d5b-47b1-abb9-9b31a4bb451e)
  )
  (label "COIL_N3" (at 33.02 73.66 0)
    (effects (font (size 1.524 1.524)) (justify left bottom))
    (uuid e41ebddf-cb62-48cb-abb2-1cc22a5eecdd)
  )
  (label "COIL_N7" (at 33.02 83.82 0)
    (effects (font (size 1.524 1.524)) (justify left bottom))
    (uuid e5ef96dd-e14b-40bb-acac-746f5d3aee37)
  )
  (label "COIL_P0" (at 205.74 26.67 0)
    (effects (font (size 1.524 1.524)) (justify left bottom))
    (uuid e60f5c1d-c97e-4327-8023-b78c1d20bdfb)
  )
  (label "COIL_N1" (at 205.74 39.37 0)
    (effects (font (size 1.524 1.524)) (justify left bottom))
    (uuid e93f1ff9-82cc-426b-b31b-274f08cc4327)
  )
  (label "COIL_P3" (at 205.74 41.91 0)
    (effects (font (size 1.524 1.524)) (justify left bottom))
    (uuid f42c2843-70f0-463a-bc38-eee11dd73b5f)
  )
  (label "COIL_P6" (at 33.02 45.72 0)
    (effects (font (size 1.524 1.524)) (justify left bottom))
    (uuid f47ba0cc-ecae-4aef-a30d-acee22ce59db)
  )
  (label "COIL_N5" (at 205.74 90.17 0)
    (effects (font (size 1.524 1.524)) (justify left bottom))
    (uuid f6662114-e94f-4466-8b01-5f4d76363a86)
  )
  (label "COIL_N" (at 144.78 40.64 270)
    (effects (font (size 1.524 1.524)) (justify right bottom))
    (uuid f686f314-e4c1-4c2d-a83a-58da96d3edf9)
  )
  (label "COIL_N" (at 182.88 143.51 180)
    (effects (font (size 1.524 1.524)) (justify right bottom))
    (uuid fae1c1af-89ba-4c18-88bc-46f514e9bd6f)
  )
  (label "COIL_N8" (at 33.02 86.36 0)
    (effects (font (size 1.524 1.524)) (justify left bottom))
    (uuid fb7d0d2c-09e5-46e0-8091-1901472a84d1)
  )
  (label "COIL_P" (at 182.88 39.37 180)
    (effects (font (size 1.524 1.524)) (justify right bottom))
    (uuid ff667a13-f89b-40a5-99a3-00684de2da09)
  )

  (hierarchical_label "SDA" (shape input) (at 80.01 128.27 180)
    (effects (font (size 1.524 1.524)) (justify right))
    (uuid 06d56cea-efec-4ee2-a30e-da196d83ccb4)
  )
  (hierarchical_label "SCL" (shape input) (at 80.01 125.73 180)
    (effects (font (size 1.524 1.524)) (justify right))
    (uuid 7b66c522-eb2b-4ac5-8fa6-badbd9e03844)
  )
  (hierarchical_label "COIL_N[0..9]" (shape input) (at 29.21 60.96 180)
    (effects (font (size 1.524 1.524)) (justify right))
    (uuid 92adc2a7-705f-4e7b-90a7-1c91d9f5977d)
  )
  (hierarchical_label "COIL_P[0..9]" (shape input) (at 29.21 25.4 180)
    (effects (font (size 1.524 1.524)) (justify right))
    (uuid 9c1b71cf-44fe-4b7f-bf7f-4966704258c9)
  )

  (symbol (lib_id "power:+3V3") (at 194.31 20.32 0) (unit 1)
    (in_bom yes) (on_board yes)
    (uuid 00000000-0000-0000-0000-0000604b413d)
    (property "Reference" "#PWR0149" (id 0) (at 194.31 24.13 0)
      (effects (font (size 1.27 1.27)) hide)
    )
    (property "Value" "+3V3" (id 1) (at 194.691 15.9258 0))
    (property "Footprint" "" (id 2) (at 194.31 20.32 0)
      (effects (font (size 1.27 1.27)) hide)
    )
    (property "Datasheet" "" (id 3) (at 194.31 20.32 0)
      (effects (font (size 1.27 1.27)) hide)
    )
    (pin "1" (uuid 3a748dd7-058d-4016-b75c-46453bb15837))
  )

  (symbol (lib_id "power:GND") (at 194.31 54.61 0) (unit 1)
    (in_bom yes) (on_board yes)
    (uuid 00000000-0000-0000-0000-0000604b4145)
    (property "Reference" "#PWR0150" (id 0) (at 194.31 60.96 0)
      (effects (font (size 1.27 1.27)) hide)
    )
    (property "Value" "GND" (id 1) (at 194.437 59.0042 0))
    (property "Footprint" "" (id 2) (at 194.31 54.61 0)
      (effects (font (size 1.27 1.27)) hide)
    )
    (property "Datasheet" "" (id 3) (at 194.31 54.61 0)
      (effects (font (size 1.27 1.27)) hide)
    )
    (pin "1" (uuid 1a4222e4-fc1b-4bf8-9b18-7bbcb6cceb25))
  )

  (symbol (lib_id "power:+3V3") (at 194.31 71.12 0) (unit 1)
    (in_bom yes) (on_board yes)
    (uuid 00000000-0000-0000-0000-0000604bcb74)
    (property "Reference" "#PWR0151" (id 0) (at 194.31 74.93 0)
      (effects (font (size 1.27 1.27)) hide)
    )
    (property "Value" "+3V3" (id 1) (at 194.691 66.7258 0))
    (property "Footprint" "" (id 2) (at 194.31 71.12 0)
      (effects (font (size 1.27 1.27)) hide)
    )
    (property "Datasheet" "" (id 3) (at 194.31 71.12 0)
      (effects (font (size 1.27 1.27)) hide)
    )
    (pin "1" (uuid 708514ad-846a-48ab-9091-bea41c0f2b85))
  )

  (symbol (lib_id "power:GND") (at 194.31 105.41 0) (unit 1)
    (in_bom yes) (on_board yes)
    (uuid 00000000-0000-0000-0000-0000604bcb80)
    (property "Reference" "#PWR0152" (id 0) (at 194.31 111.76 0)
      (effects (font (size 1.27 1.27)) hide)
    )
    (property "Value" "GND" (id 1) (at 194.437 109.8042 0))
    (property "Footprint" "" (id 2) (at 194.31 105.41 0)
      (effects (font (size 1.27 1.27)) hide)
    )
    (property "Datasheet" "" (id 3) (at 194.31 105.41 0)
      (effects (font (size 1.27 1.27)) hide)
    )
    (pin "1" (uuid f77b5f5d-e542-4fa1-b8e4-8fdf02f8d114))
  )

  (symbol (lib_id "power:+3V3") (at 194.31 121.92 0) (unit 1)
    (in_bom yes) (on_board yes)
    (uuid 00000000-0000-0000-0000-0000604cc957)
    (property "Reference" "#PWR0153" (id 0) (at 194.31 125.73 0)
      (effects (font (size 1.27 1.27)) hide)
    )
    (property "Value" "+3V3" (id 1) (at 194.691 117.5258 0))
    (property "Footprint" "" (id 2) (at 194.31 121.92 0)
      (effects (font (size 1.27 1.27)) hide)
    )
    (property "Datasheet" "" (id 3) (at 194.31 121.92 0)
      (effects (font (size 1.27 1.27)) hide)
    )
    (pin "1" (uuid 807cdea3-4bb3-4dbd-875d-9f70c221d2a9))
  )

  (symbol (lib_id "power:GND") (at 194.31 156.21 0) (unit 1)
    (in_bom yes) (on_board yes)
    (uuid 00000000-0000-0000-0000-0000604cc963)
    (property "Reference" "#PWR0154" (id 0) (at 194.31 162.56 0)
      (effects (font (size 1.27 1.27)) hide)
    )
    (property "Value" "GND" (id 1) (at 194.437 160.6042 0))
    (property "Footprint" "" (id 2) (at 194.31 156.21 0)
      (effects (font (size 1.27 1.27)) hide)
    )
    (property "Datasheet" "" (id 3) (at 194.31 156.21 0)
      (effects (font (size 1.27 1.27)) hide)
    )
    (pin "1" (uuid 4bb3832f-49fb-495a-ab87-53a8e35ef1e8))
  )

  (symbol (lib_id "power:+3V3") (at 92.71 116.84 0) (unit 1)
    (in_bom yes) (on_board yes)
    (uuid 00000000-0000-0000-0000-000060554316)
    (property "Reference" "#PWR0155" (id 0) (at 92.71 120.65 0)
      (effects (font (size 1.27 1.27)) hide)
    )
    (property "Value" "+3V3" (id 1) (at 93.091 112.4458 0))
    (property "Footprint" "" (id 2) (at 92.71 116.84 0)
      (effects (font (size 1.27 1.27)) hide)
    )
    (property "Datasheet" "" (id 3) (at 92.71 116.84 0)
      (effects (font (size 1.27 1.27)) hide)
    )
    (pin "1" (uuid 07191767-04f5-4837-9ca1-40f06835cb37))
  )

  (symbol (lib_id "power:GND") (at 92.71 152.4 0) (unit 1)
    (in_bom yes) (on_board yes)
    (uuid 00000000-0000-0000-0000-00006055431d)
    (property "Reference" "#PWR0156" (id 0) (at 92.71 158.75 0)
      (effects (font (size 1.27 1.27)) hide)
    )
    (property "Value" "GND" (id 1) (at 92.837 156.7942 0))
    (property "Footprint" "" (id 2) (at 92.71 152.4 0)
      (effects (font (size 1.27 1.27)) hide)
    )
    (property "Datasheet" "" (id 3) (at 92.71 152.4 0)
      (effects (font (size 1.27 1.27)) hide)
    )
    (pin "1" (uuid a663ca1a-0ef1-4e29-804f-1c95031cff29))
  )

  (symbol (lib_id "power:GND") (at 68.58 139.7 0) (unit 1)
    (in_bom yes) (on_board yes)
    (uuid 00000000-0000-0000-0000-000060554324)
    (property "Reference" "#PWR0157" (id 0) (at 68.58 146.05 0)
      (effects (font (size 1.27 1.27)) hide)
    )
    (property "Value" "GND" (id 1) (at 68.707 144.0942 0))
    (property "Footprint" "" (id 2) (at 68.58 139.7 0)
      (effects (font (size 1.27 1.27)) hide)
    )
    (property "Datasheet" "" (id 3) (at 68.58 139.7 0)
      (effects (font (size 1.27 1.27)) hide)
    )
    (pin "1" (uuid 406995de-d70a-45f3-b96f-d66806f917d1))
  )

  (symbol (lib_id "Device:C") (at 81.915 107.315 0) (unit 1)
    (in_bom yes) (on_board yes)
    (uuid 00000000-0000-0000-0000-00006055433b)
    (property "Reference" "C3" (id 0) (at 84.836 106.1466 0)
      (effects (font (size 1.27 1.27)) (justify left))
    )
    (property "Value" "0.1uF" (id 1) (at 84.836 108.458 0)
      (effects (font (size 1.27 1.27)) (justify left))
    )
    (property "Footprint" "Capacitor_SMD:C_0805_2012Metric" (id 2) (at 82.8802 111.125 0)
      (effects (font (size 1.27 1.27)) hide)
    )
    (property "Datasheet" "~" (id 3) (at 81.915 107.315 0)
      (effects (font (size 1.27 1.27)) hide)
    )
    (pin "1" (uuid 427fb868-521f-49ac-be83-f66031a06169))
    (pin "2" (uuid d260b863-659c-43b4-b5a4-454e27148467))
  )

  (symbol (lib_id "power:+3V3") (at 81.915 102.235 0) (unit 1)
    (in_bom yes) (on_board yes)
    (uuid 00000000-0000-0000-0000-000060554341)
    (property "Reference" "#PWR0159" (id 0) (at 81.915 106.045 0)
      (effects (font (size 1.27 1.27)) hide)
    )
    (property "Value" "+3V3" (id 1) (at 82.296 97.8408 0))
    (property "Footprint" "" (id 2) (at 81.915 102.235 0)
      (effects (font (size 1.27 1.27)) hide)
    )
    (property "Datasheet" "" (id 3) (at 81.915 102.235 0)
      (effects (font (size 1.27 1.27)) hide)
    )
    (pin "1" (uuid c46700cb-8650-4446-aae2-40ac13fc1170))
  )

  (symbol (lib_id "power:GND") (at 81.915 112.395 0) (unit 1)
    (in_bom yes) (on_board yes)
    (uuid 00000000-0000-0000-0000-000060554348)
    (property "Reference" "#PWR0160" (id 0) (at 81.915 118.745 0)
      (effects (font (size 1.27 1.27)) hide)
    )
    (property "Value" "GND" (id 1) (at 82.042 116.7892 0))
    (property "Footprint" "" (id 2) (at 81.915 112.395 0)
      (effects (font (size 1.27 1.27)) hide)
    )
    (property "Datasheet" "" (id 3) (at 81.915 112.395 0)
      (effects (font (size 1.27 1.27)) hide)
    )
    (pin "1" (uuid f542499c-70e8-400a-b0d1-909949007edc))
  )

  (symbol (lib_id "Device:R") (at 78.74 143.51 270) (unit 1)
    (in_bom yes) (on_board yes)
    (uuid 00000000-0000-0000-0000-00006059779b)
    (property "Reference" "R27" (id 0) (at 78.74 138.2522 90))
    (property "Value" "10k" (id 1) (at 78.74 140.5636 90))
    (property "Footprint" "Resistor_SMD:R_0805_2012Metric" (id 2) (at 78.74 141.732 90)
      (effects (font (size 1.27 1.27)) hide)
    )
    (property "Datasheet" "~" (id 3) (at 78.74 143.51 0)
      (effects (font (size 1.27 1.27)) hide)
    )
    (pin "1" (uuid 641026af-becd-40d8-816d-e62ca8f758f9))
    (pin "2" (uuid b940d47b-f83c-4ff6-9ec6-435df6fce1c1))
  )

  (symbol (lib_id "power:+3V3") (at 73.66 142.24 0) (unit 1)
    (in_bom yes) (on_board yes)
    (uuid 00000000-0000-0000-0000-000060598da5)
    (property "Reference" "#PWR0161" (id 0) (at 73.66 146.05 0)
      (effects (font (size 1.27 1.27)) hide)
    )
    (property "Value" "+3V3" (id 1) (at 74.041 137.8458 0))
    (property "Footprint" "" (id 2) (at 73.66 142.24 0)
      (effects (font (size 1.27 1.27)) hide)
    )
    (property "Datasheet" "" (id 3) (at 73.66 142.24 0)
      (effects (font (size 1.27 1.27)) hide)
    )
    (pin "1" (uuid ff415c94-6ee7-4997-a5be-e6957b192e94))
  )

  (symbol (lib_id "Connector:Conn_Coaxial") (at 144.78 35.56 0) (unit 1)
    (in_bom yes) (on_board yes)
    (uuid 00000000-0000-0000-0000-0000605cf1dd)
    (property "Reference" "J1" (id 0) (at 147.32 36.195 0)
      (effects (font (size 1.27 1.27)) (justify left))
    )
    (property "Value" "Conn_Coaxial" (id 1) (at 147.32 38.5064 0)
      (effects (font (size 1.27 1.27)) (justify left))
    )
    (property "Footprint" "lbl_conn:lemo_epb00250ntn" (id 2) (at 144.78 35.56 0)
      (effects (font (size 1.27 1.27)) hide)
    )
    (property "Datasheet" " ~" (id 3) (at 144.78 35.56 0)
      (effects (font (size 1.27 1.27)) hide)
    )
    (property "MfrPart" "EPL.00.250.NTN" (id 4) (at 144.78 35.56 0)
      (effects (font (size 1.27 1.27)) hide)
    )
    (pin "1" (uuid b89c438f-5b62-4a21-9790-4a5ac81b8d0d))
    (pin "2" (uuid 2c3fbab7-18c4-46ae-8614-376a2fcbe863))
  )

  (symbol (lib_id "lbl_lvds:TC7PCI3212MT") (at 194.31 48.26 0) (unit 1)
    (in_bom yes) (on_board yes)
    (uuid 00000000-0000-0000-0000-0000606b400b)
    (property "Reference" "U3" (id 0) (at 187.325 52.705 0)
      (effects (font (size 1.524 1.524)))
    )
    (property "Value" "TC7PCI3212MT" (id 1) (at 182.245 55.245 0)
      (effects (font (size 1.524 1.524)))
    )
    (property "Footprint" "lbl_packages:VQFN-20_2.5x4.5mm_P0.50mm" (id 2) (at 194.31 60.96 0)
      (effects (font (size 1.524 1.524)) hide)
    )
    (property "Datasheet" "https://www.mouser.com/datasheet/2/408/TC7PCI3212MT_datasheet_en_20130809-1915956.pdf" (id 3) (at 194.31 52.07 0)
      (effects (font (size 1.524 1.524)) hide)
    )
    (pin "1" (uuid 03fc48c3-f1a0-4bb4-a2e5-dab73be4390e))
    (pin "10" (uuid ce4a0331-a915-4c2c-a774-44ba848f27aa))
    (pin "11" (uuid 2a30f5bb-2daf-4fc6-83d6-a6697bd25a08))
    (pin "12" (uuid 0041f065-3695-467e-874d-38bd330e5146))
    (pin "13" (uuid 711b56b0-1cca-482c-b7e9-ce0fd8289709))
    (pin "14" (uuid d0d130bd-7f15-4151-ab62-b099b2830085))
    (pin "15" (uuid 3a28c12b-8bd7-46bf-9258-a04dd3db15cd))
    (pin "16" (uuid 492e9f6a-df61-459b-90d0-d7a83bc57789))
    (pin "17" (uuid 5f3d968b-a287-4952-a74a-9ce31868f05b))
    (pin "18" (uuid d3511c76-1e01-4ae3-a996-2ceebee32484))
    (pin "19" (uuid 5e157e21-adc9-4d65-bb06-3ab06cff514d))
    (pin "2" (uuid f6c4e809-d7c2-4201-ac08-099708a927e8))
    (pin "20" (uuid 0c480dda-c0e9-4ae7-8236-163ac3e0d8cb))
    (pin "21" (uuid 65bbcfda-6d05-401a-8298-717cd1bc605b))
    (pin "3" (uuid 1defaf3e-bc81-4c82-b89c-85b5ac23ce99))
    (pin "4" (uuid 53cedb90-ac5d-4885-a137-2b81c1ca74de))
    (pin "5" (uuid f9fa9e59-26c2-4a42-a77e-d7f40c7c0027))
    (pin "6" (uuid fc13daa7-16d2-4671-9231-21b3a3dcd3eb))
    (pin "7" (uuid abb99c4f-63f9-4129-b26d-4cc7637258a3))
    (pin "8" (uuid e0611fbe-f2d3-45f8-bc41-936d01a75ebd))
    (pin "9" (uuid 907bcb9e-96eb-477b-9fc6-d2bce38d6454))
  )

  (symbol (lib_id "lbl_lvds:TC7PCI3212MT") (at 194.31 99.06 0) (unit 1)
    (in_bom yes) (on_board yes)
    (uuid 00000000-0000-0000-0000-0000606b5894)
    (property "Reference" "U4" (id 0) (at 187.325 103.505 0)
      (effects (font (size 1.524 1.524)))
    )
    (property "Value" "TC7PCI3212MT" (id 1) (at 182.245 106.045 0)
      (effects (font (size 1.524 1.524)))
    )
    (property "Footprint" "lbl_packages:VQFN-20_2.5x4.5mm_P0.50mm" (id 2) (at 194.31 111.76 0)
      (effects (font (size 1.524 1.524)) hide)
    )
    (property "Datasheet" "https://www.mouser.com/datasheet/2/408/TC7PCI3212MT_datasheet_en_20130809-1915956.pdf" (id 3) (at 194.31 102.87 0)
      (effects (font (size 1.524 1.524)) hide)
    )
    (pin "1" (uuid 1d54e8c8-c40b-40d2-9571-85f408fcbed6))
    (pin "10" (uuid 580db45c-aaec-4b45-afaa-5c06095c222b))
    (pin "11" (uuid eed9a33f-d049-4bc6-ab4f-1f68b94a4f5b))
    (pin "12" (uuid 91131205-e84d-4112-aca5-975fc611e50f))
    (pin "13" (uuid 09951791-e667-4eff-a0ef-5ad643ca3e6d))
    (pin "14" (uuid 23558fd7-0a32-48f9-87d9-e95fe9d6a7da))
    (pin "15" (uuid 440147c6-9eaa-4e21-9b3b-7e38ff8a513b))
    (pin "16" (uuid ab1cb22e-f97b-46ed-bc43-38ec5ae12d77))
    (pin "17" (uuid 75901270-48b5-41d8-aeb9-849ff053e585))
    (pin "18" (uuid cb283eec-b8f6-4d2e-b87c-e852f79718ea))
    (pin "19" (uuid 19e8e68e-0c36-4840-855a-abe82a5cc518))
    (pin "2" (uuid 2e852bed-6b24-4773-8dd3-ba5f6f6ccde9))
    (pin "20" (uuid f8ff46ec-1e7a-47fa-8ba7-e09a1b20eb85))
    (pin "21" (uuid 7cb3b3ce-e7c6-463c-9ddb-273cb7514fde))
    (pin "3" (uuid 5c0dea98-0e27-4bfe-80d9-a7ac6f1fd83f))
    (pin "4" (uuid 3b4639ac-7acf-4dff-9653-5fa491af848e))
    (pin "5" (uuid d3bff59c-3f07-44b7-8e46-15145da7dc0c))
    (pin "6" (uuid 3b864285-40c3-4142-a97e-623c082c887b))
    (pin "7" (uuid 772c8d05-277f-47fb-8366-eef07bca8052))
    (pin "8" (uuid 8f515a1c-d3a2-4dad-9461-d5ac01f2fc3b))
    (pin "9" (uuid cf67cdca-aed6-4c1e-9aaa-fb05b1089fa0))
  )

  (symbol (lib_id "lbl_lvds:TC7PCI3212MT") (at 194.31 149.86 0) (unit 1)
    (in_bom yes) (on_board yes)
    (uuid 00000000-0000-0000-0000-0000606b5d40)
    (property "Reference" "U5" (id 0) (at 187.325 154.305 0)
      (effects (font (size 1.524 1.524)))
    )
    (property "Value" "TC7PCI3212MT" (id 1) (at 182.245 156.845 0)
      (effects (font (size 1.524 1.524)))
    )
    (property "Footprint" "lbl_packages:VQFN-20_2.5x4.5mm_P0.50mm" (id 2) (at 194.31 162.56 0)
      (effects (font (size 1.524 1.524)) hide)
    )
    (property "Datasheet" "https://www.mouser.com/datasheet/2/408/TC7PCI3212MT_datasheet_en_20130809-1915956.pdf" (id 3) (at 194.31 153.67 0)
      (effects (font (size 1.524 1.524)) hide)
    )
    (pin "1" (uuid 33ffc367-3dfb-441c-9325-8ded537310f7))
    (pin "10" (uuid 8451b58c-50b9-4035-906d-4a6c44c83d24))
    (pin "11" (uuid af3e7e9b-2033-44e8-a6bb-5fdca06a24c5))
    (pin "12" (uuid d376c477-b400-4c8d-be11-f1eefcd4ff95))
    (pin "13" (uuid 512d49ca-79dc-4e8f-bd6c-508c43a479e2))
    (pin "14" (uuid d59a8c9a-6251-4e08-82e0-bee4502fa872))
    (pin "15" (uuid 080e1725-7e93-4799-bd7e-964605a940ea))
    (pin "16" (uuid 8117d781-bb34-4e1b-beef-0497bb1bb767))
    (pin "17" (uuid be1573dd-a82e-4e34-be83-118ce2bbe2d7))
    (pin "18" (uuid 90e58997-db1f-42e7-93c9-6dfbb455c5a8))
    (pin "19" (uuid 46d9e01b-71b9-486c-9d63-a12463bd7121))
    (pin "2" (uuid 84d49b97-86ee-471b-97d7-5f9d65adbb89))
    (pin "20" (uuid 78df2ad3-fe54-4acd-85a2-760b6f7e9315))
    (pin "21" (uuid 691b3ff2-550b-4a26-a550-f38d0e3ebbd0))
    (pin "3" (uuid 265eeb2e-bd10-4bcb-92f3-b15f2ecbcfcc))
    (pin "4" (uuid 00abf296-d051-417e-9b7a-30a3971d4903))
    (pin "5" (uuid ec662c8c-8321-4e2d-94b1-517e95b720c1))
    (pin "6" (uuid 06cae86e-ecb0-44a2-99c0-0f76000b90f0))
    (pin "7" (uuid 3a8e92d3-804c-42ea-8b49-db87afc63e49))
    (pin "8" (uuid 51ff16f8-67f2-4a1f-bedb-d11b9a1f8d2f))
    (pin "9" (uuid 9c4256b9-361a-4049-a703-e200fe075415))
  )

  (symbol (lib_id "Device:C") (at 228.6 24.13 0) (unit 1)
    (in_bom yes) (on_board yes)
    (uuid 00000000-0000-0000-0000-000060908f80)
    (property "Reference" "C11" (id 0) (at 231.521 22.9616 0)
      (effects (font (size 1.27 1.27)) (justify left))
    )
    (property "Value" "0.1uF" (id 1) (at 231.521 25.273 0)
      (effects (font (size 1.27 1.27)) (justify left))
    )
    (property "Footprint" "Capacitor_SMD:C_0805_2012Metric" (id 2) (at 229.5652 27.94 0)
      (effects (font (size 1.27 1.27)) hide)
    )
    (property "Datasheet" "~" (id 3) (at 228.6 24.13 0)
      (effects (font (size 1.27 1.27)) hide)
    )
    (pin "1" (uuid 1ef9fd1e-c578-4c28-a125-c3a8d0156df9))
    (pin "2" (uuid 3d218f32-a3a3-4a11-9e12-72e9e346d480))
  )

  (symbol (lib_id "power:+3V3") (at 228.6 19.05 0) (unit 1)
    (in_bom yes) (on_board yes)
    (uuid 00000000-0000-0000-0000-000060908f86)
    (property "Reference" "#PWR0146" (id 0) (at 228.6 22.86 0)
      (effects (font (size 1.27 1.27)) hide)
    )
    (property "Value" "+3V3" (id 1) (at 228.981 14.6558 0))
    (property "Footprint" "" (id 2) (at 228.6 19.05 0)
      (effects (font (size 1.27 1.27)) hide)
    )
    (property "Datasheet" "" (id 3) (at 228.6 19.05 0)
      (effects (font (size 1.27 1.27)) hide)
    )
    (pin "1" (uuid cd7f9716-cb01-4a66-bab6-590b85b0d606))
  )

  (symbol (lib_id "power:GND") (at 228.6 29.21 0) (unit 1)
    (in_bom yes) (on_board yes)
    (uuid 00000000-0000-0000-0000-000060908f8d)
    (property "Reference" "#PWR0162" (id 0) (at 228.6 35.56 0)
      (effects (font (size 1.27 1.27)) hide)
    )
    (property "Value" "GND" (id 1) (at 228.727 33.6042 0))
    (property "Footprint" "" (id 2) (at 228.6 29.21 0)
      (effects (font (size 1.27 1.27)) hide)
    )
    (property "Datasheet" "" (id 3) (at 228.6 29.21 0)
      (effects (font (size 1.27 1.27)) hide)
    )
    (pin "1" (uuid 180cd9dc-97f3-44ba-90a7-a7524b689175))
  )

  (symbol (lib_id "Device:C") (at 241.3 24.13 0) (unit 1)
    (in_bom yes) (on_board yes)
    (uuid 00000000-0000-0000-0000-00006090fa78)
    (property "Reference" "C12" (id 0) (at 244.221 22.9616 0)
      (effects (font (size 1.27 1.27)) (justify left))
    )
    (property "Value" "0.1uF" (id 1) (at 244.221 25.273 0)
      (effects (font (size 1.27 1.27)) (justify left))
    )
    (property "Footprint" "Capacitor_SMD:C_0805_2012Metric" (id 2) (at 242.2652 27.94 0)
      (effects (font (size 1.27 1.27)) hide)
    )
    (property "Datasheet" "~" (id 3) (at 241.3 24.13 0)
      (effects (font (size 1.27 1.27)) hide)
    )
    (pin "1" (uuid 50ccf39c-130a-4319-b9f1-cf7f1ce0e2dd))
    (pin "2" (uuid b1779e01-a968-49d4-be53-eca6e14f1815))
  )

  (symbol (lib_id "power:+3V3") (at 241.3 19.05 0) (unit 1)
    (in_bom yes) (on_board yes)
    (uuid 00000000-0000-0000-0000-00006090fcaa)
    (property "Reference" "#PWR0163" (id 0) (at 241.3 22.86 0)
      (effects (font (size 1.27 1.27)) hide)
    )
    (property "Value" "+3V3" (id 1) (at 241.681 14.6558 0))
    (property "Footprint" "" (id 2) (at 241.3 19.05 0)
      (effects (font (size 1.27 1.27)) hide)
    )
    (property "Datasheet" "" (id 3) (at 241.3 19.05 0)
      (effects (font (size 1.27 1.27)) hide)
    )
    (pin "1" (uuid ab13f4d1-33e2-4bb8-8825-b4de949fec5b))
  )

  (symbol (lib_id "power:GND") (at 241.3 29.21 0) (unit 1)
    (in_bom yes) (on_board yes)
    (uuid 00000000-0000-0000-0000-00006090fcb5)
    (property "Reference" "#PWR0164" (id 0) (at 241.3 35.56 0)
      (effects (font (size 1.27 1.27)) hide)
    )
    (property "Value" "GND" (id 1) (at 241.427 33.6042 0))
    (property "Footprint" "" (id 2) (at 241.3 29.21 0)
      (effects (font (size 1.27 1.27)) hide)
    )
    (property "Datasheet" "" (id 3) (at 241.3 29.21 0)
      (effects (font (size 1.27 1.27)) hide)
    )
    (pin "1" (uuid f684f8aa-d349-4f06-9064-8790b84f8197))
  )

  (symbol (lib_id "Device:C") (at 254 24.13 0) (unit 1)
    (in_bom yes) (on_board yes)
    (uuid 00000000-0000-0000-0000-00006091247d)
    (property "Reference" "C13" (id 0) (at 256.921 22.9616 0)
      (effects (font (size 1.27 1.27)) (justify left))
    )
    (property "Value" "0.1uF" (id 1) (at 256.921 25.273 0)
      (effects (font (size 1.27 1.27)) (justify left))
    )
    (property "Footprint" "Capacitor_SMD:C_0805_2012Metric" (id 2) (at 254.9652 27.94 0)
      (effects (font (size 1.27 1.27)) hide)
    )
    (property "Datasheet" "~" (id 3) (at 254 24.13 0)
      (effects (font (size 1.27 1.27)) hide)
    )
    (pin "1" (uuid d74d6944-4ca5-43c1-9298-a0b17c4404d2))
    (pin "2" (uuid 2e61eab0-6f7f-4326-add2-557902286309))
  )

  (symbol (lib_id "power:+3V3") (at 254 19.05 0) (unit 1)
    (in_bom yes) (on_board yes)
    (uuid 00000000-0000-0000-0000-0000609126df)
    (property "Reference" "#PWR0165" (id 0) (at 254 22.86 0)
      (effects (font (size 1.27 1.27)) hide)
    )
    (property "Value" "+3V3" (id 1) (at 254.381 14.6558 0))
    (property "Footprint" "" (id 2) (at 254 19.05 0)
      (effects (font (size 1.27 1.27)) hide)
    )
    (property "Datasheet" "" (id 3) (at 254 19.05 0)
      (effects (font (size 1.27 1.27)) hide)
    )
    (pin "1" (uuid 923a95c9-0381-4b34-b57c-2a978c64ee82))
  )

  (symbol (lib_id "power:GND") (at 254 29.21 0) (unit 1)
    (in_bom yes) (on_board yes)
    (uuid 00000000-0000-0000-0000-0000609126ea)
    (property "Reference" "#PWR0166" (id 0) (at 254 35.56 0)
      (effects (font (size 1.27 1.27)) hide)
    )
    (property "Value" "GND" (id 1) (at 254.127 33.6042 0))
    (property "Footprint" "" (id 2) (at 254 29.21 0)
      (effects (font (size 1.27 1.27)) hide)
    )
    (property "Datasheet" "" (id 3) (at 254 29.21 0)
      (effects (font (size 1.27 1.27)) hide)
    )
    (pin "1" (uuid f7e34d63-2ec7-419c-9833-da22381c24e5))
  )

  (symbol (lib_id "Interface_Expansion:TCA9534") (at 92.71 133.35 0) (unit 1)
    (in_bom yes) (on_board yes)
    (uuid 00000000-0000-0000-0000-0000609c04ed)
    (property "Reference" "U2" (id 0) (at 97.79 120.65 0))
    (property "Value" "TCA9534" (id 1) (at 98.425 148.59 0))
    (property "Footprint" "Package_SO:TSSOP-16_4.4x5mm_P0.65mm" (id 2) (at 116.84 147.32 0)
      (effects (font (size 1.27 1.27)) hide)
    )
    (property "Datasheet" "http://www.ti.com/lit/ds/symlink/tca9534.pdf" (id 3) (at 95.25 135.89 0)
      (effects (font (size 1.27 1.27)) hide)
    )
    (pin "1" (uuid 38f14bfc-cbb3-44e9-bd06-4788ea832b3e))
    (pin "10" (uuid 51c37ad9-917f-49f1-bef8-d1a178a14e24))
    (pin "11" (uuid 402dfac4-a7fd-45fc-9b9e-e40b939062d5))
    (pin "12" (uuid f8f101c7-792c-4f9c-887e-cfaf2ab76415))
    (pin "13" (uuid a49d7fa1-df7a-40f1-8dca-b25aa3e5012d))
    (pin "14" (uuid 13e6346c-126c-45bc-ac1e-54d624a8509a))
    (pin "15" (uuid ac96a865-6fdc-43ba-bb85-f8a28891ef28))
    (pin "16" (uuid 2282fe08-0f1e-410a-b338-afff49029dbb))
    (pin "2" (uuid 84081600-e515-49ab-99c6-c4bdd2462dc6))
    (pin "3" (uuid e9aeee9b-b797-463b-85c7-6c1364e6161d))
    (pin "4" (uuid 0efd6317-8306-44f6-b3d5-989eab918592))
    (pin "5" (uuid 7d6dbee0-531d-4974-8990-f7a5bd83b240))
    (pin "6" (uuid 81519aab-ea70-4e5c-a606-c264556e79c3))
    (pin "7" (uuid 92d0f901-a698-4a37-8a61-bed49c6eb63b))
    (pin "8" (uuid a955d3e9-7d38-43c4-9caf-9d0935d229b1))
    (pin "9" (uuid 1ceb89cb-47b8-42fd-b723-4e7e5ad29c12))
  )
)
