(kicad_sch (version 20211123) (generator eeschema)

  (uuid 4cbba380-690c-405e-bbfb-a0cd7ef65d0e)

  (paper "A4")

  (title_block
    (title "Powerboard v3 Massive Active Tester Board")
    (date "2021-03-16")
    (company "Lawrence Berkeley National Laboratory")
    (comment 1 "Karol Krizka")
  )

  (lib_symbols
    (symbol "Connector_Generic:Conn_02x02_Odd_Even" (pin_names (offset 1.016) hide) (in_bom yes) (on_board yes)
      (property "Reference" "J" (id 0) (at 1.27 2.54 0)
        (effects (font (size 1.27 1.27)))
      )
      (property "Value" "Conn_02x02_Odd_Even" (id 1) (at 1.27 -5.08 0)
        (effects (font (size 1.27 1.27)))
      )
      (property "Footprint" "" (id 2) (at 0 0 0)
        (effects (font (size 1.27 1.27)) hide)
      )
      (property "Datasheet" "~" (id 3) (at 0 0 0)
        (effects (font (size 1.27 1.27)) hide)
      )
      (property "ki_keywords" "connector" (id 4) (at 0 0 0)
        (effects (font (size 1.27 1.27)) hide)
      )
      (property "ki_description" "Generic connector, double row, 02x02, odd/even pin numbering scheme (row 1 odd numbers, row 2 even numbers), script generated (kicad-library-utils/schlib/autogen/connector/)" (id 5) (at 0 0 0)
        (effects (font (size 1.27 1.27)) hide)
      )
      (property "ki_fp_filters" "Connector*:*_2x??_*" (id 6) (at 0 0 0)
        (effects (font (size 1.27 1.27)) hide)
      )
      (symbol "Conn_02x02_Odd_Even_1_1"
        (rectangle (start -1.27 -2.413) (end 0 -2.667)
          (stroke (width 0.1524) (type default) (color 0 0 0 0))
          (fill (type none))
        )
        (rectangle (start -1.27 0.127) (end 0 -0.127)
          (stroke (width 0.1524) (type default) (color 0 0 0 0))
          (fill (type none))
        )
        (rectangle (start -1.27 1.27) (end 3.81 -3.81)
          (stroke (width 0.254) (type default) (color 0 0 0 0))
          (fill (type background))
        )
        (rectangle (start 3.81 -2.413) (end 2.54 -2.667)
          (stroke (width 0.1524) (type default) (color 0 0 0 0))
          (fill (type none))
        )
        (rectangle (start 3.81 0.127) (end 2.54 -0.127)
          (stroke (width 0.1524) (type default) (color 0 0 0 0))
          (fill (type none))
        )
        (pin passive line (at -5.08 0 0) (length 3.81)
          (name "Pin_1" (effects (font (size 1.27 1.27))))
          (number "1" (effects (font (size 1.27 1.27))))
        )
        (pin passive line (at 7.62 0 180) (length 3.81)
          (name "Pin_2" (effects (font (size 1.27 1.27))))
          (number "2" (effects (font (size 1.27 1.27))))
        )
        (pin passive line (at -5.08 -2.54 0) (length 3.81)
          (name "Pin_3" (effects (font (size 1.27 1.27))))
          (number "3" (effects (font (size 1.27 1.27))))
        )
        (pin passive line (at 7.62 -2.54 180) (length 3.81)
          (name "Pin_4" (effects (font (size 1.27 1.27))))
          (number "4" (effects (font (size 1.27 1.27))))
        )
      )
    )
    (symbol "Connector_Generic:Conn_02x10_Odd_Even" (pin_names (offset 1.016) hide) (in_bom yes) (on_board yes)
      (property "Reference" "J" (id 0) (at 1.27 12.7 0)
        (effects (font (size 1.27 1.27)))
      )
      (property "Value" "Conn_02x10_Odd_Even" (id 1) (at 1.27 -15.24 0)
        (effects (font (size 1.27 1.27)))
      )
      (property "Footprint" "" (id 2) (at 0 0 0)
        (effects (font (size 1.27 1.27)) hide)
      )
      (property "Datasheet" "~" (id 3) (at 0 0 0)
        (effects (font (size 1.27 1.27)) hide)
      )
      (property "ki_keywords" "connector" (id 4) (at 0 0 0)
        (effects (font (size 1.27 1.27)) hide)
      )
      (property "ki_description" "Generic connector, double row, 02x10, odd/even pin numbering scheme (row 1 odd numbers, row 2 even numbers), script generated (kicad-library-utils/schlib/autogen/connector/)" (id 5) (at 0 0 0)
        (effects (font (size 1.27 1.27)) hide)
      )
      (property "ki_fp_filters" "Connector*:*_2x??_*" (id 6) (at 0 0 0)
        (effects (font (size 1.27 1.27)) hide)
      )
      (symbol "Conn_02x10_Odd_Even_1_1"
        (rectangle (start -1.27 -12.573) (end 0 -12.827)
          (stroke (width 0.1524) (type default) (color 0 0 0 0))
          (fill (type none))
        )
        (rectangle (start -1.27 -10.033) (end 0 -10.287)
          (stroke (width 0.1524) (type default) (color 0 0 0 0))
          (fill (type none))
        )
        (rectangle (start -1.27 -7.493) (end 0 -7.747)
          (stroke (width 0.1524) (type default) (color 0 0 0 0))
          (fill (type none))
        )
        (rectangle (start -1.27 -4.953) (end 0 -5.207)
          (stroke (width 0.1524) (type default) (color 0 0 0 0))
          (fill (type none))
        )
        (rectangle (start -1.27 -2.413) (end 0 -2.667)
          (stroke (width 0.1524) (type default) (color 0 0 0 0))
          (fill (type none))
        )
        (rectangle (start -1.27 0.127) (end 0 -0.127)
          (stroke (width 0.1524) (type default) (color 0 0 0 0))
          (fill (type none))
        )
        (rectangle (start -1.27 2.667) (end 0 2.413)
          (stroke (width 0.1524) (type default) (color 0 0 0 0))
          (fill (type none))
        )
        (rectangle (start -1.27 5.207) (end 0 4.953)
          (stroke (width 0.1524) (type default) (color 0 0 0 0))
          (fill (type none))
        )
        (rectangle (start -1.27 7.747) (end 0 7.493)
          (stroke (width 0.1524) (type default) (color 0 0 0 0))
          (fill (type none))
        )
        (rectangle (start -1.27 10.287) (end 0 10.033)
          (stroke (width 0.1524) (type default) (color 0 0 0 0))
          (fill (type none))
        )
        (rectangle (start -1.27 11.43) (end 3.81 -13.97)
          (stroke (width 0.254) (type default) (color 0 0 0 0))
          (fill (type background))
        )
        (rectangle (start 3.81 -12.573) (end 2.54 -12.827)
          (stroke (width 0.1524) (type default) (color 0 0 0 0))
          (fill (type none))
        )
        (rectangle (start 3.81 -10.033) (end 2.54 -10.287)
          (stroke (width 0.1524) (type default) (color 0 0 0 0))
          (fill (type none))
        )
        (rectangle (start 3.81 -7.493) (end 2.54 -7.747)
          (stroke (width 0.1524) (type default) (color 0 0 0 0))
          (fill (type none))
        )
        (rectangle (start 3.81 -4.953) (end 2.54 -5.207)
          (stroke (width 0.1524) (type default) (color 0 0 0 0))
          (fill (type none))
        )
        (rectangle (start 3.81 -2.413) (end 2.54 -2.667)
          (stroke (width 0.1524) (type default) (color 0 0 0 0))
          (fill (type none))
        )
        (rectangle (start 3.81 0.127) (end 2.54 -0.127)
          (stroke (width 0.1524) (type default) (color 0 0 0 0))
          (fill (type none))
        )
        (rectangle (start 3.81 2.667) (end 2.54 2.413)
          (stroke (width 0.1524) (type default) (color 0 0 0 0))
          (fill (type none))
        )
        (rectangle (start 3.81 5.207) (end 2.54 4.953)
          (stroke (width 0.1524) (type default) (color 0 0 0 0))
          (fill (type none))
        )
        (rectangle (start 3.81 7.747) (end 2.54 7.493)
          (stroke (width 0.1524) (type default) (color 0 0 0 0))
          (fill (type none))
        )
        (rectangle (start 3.81 10.287) (end 2.54 10.033)
          (stroke (width 0.1524) (type default) (color 0 0 0 0))
          (fill (type none))
        )
        (pin passive line (at -5.08 10.16 0) (length 3.81)
          (name "Pin_1" (effects (font (size 1.27 1.27))))
          (number "1" (effects (font (size 1.27 1.27))))
        )
        (pin passive line (at 7.62 0 180) (length 3.81)
          (name "Pin_10" (effects (font (size 1.27 1.27))))
          (number "10" (effects (font (size 1.27 1.27))))
        )
        (pin passive line (at -5.08 -2.54 0) (length 3.81)
          (name "Pin_11" (effects (font (size 1.27 1.27))))
          (number "11" (effects (font (size 1.27 1.27))))
        )
        (pin passive line (at 7.62 -2.54 180) (length 3.81)
          (name "Pin_12" (effects (font (size 1.27 1.27))))
          (number "12" (effects (font (size 1.27 1.27))))
        )
        (pin passive line (at -5.08 -5.08 0) (length 3.81)
          (name "Pin_13" (effects (font (size 1.27 1.27))))
          (number "13" (effects (font (size 1.27 1.27))))
        )
        (pin passive line (at 7.62 -5.08 180) (length 3.81)
          (name "Pin_14" (effects (font (size 1.27 1.27))))
          (number "14" (effects (font (size 1.27 1.27))))
        )
        (pin passive line (at -5.08 -7.62 0) (length 3.81)
          (name "Pin_15" (effects (font (size 1.27 1.27))))
          (number "15" (effects (font (size 1.27 1.27))))
        )
        (pin passive line (at 7.62 -7.62 180) (length 3.81)
          (name "Pin_16" (effects (font (size 1.27 1.27))))
          (number "16" (effects (font (size 1.27 1.27))))
        )
        (pin passive line (at -5.08 -10.16 0) (length 3.81)
          (name "Pin_17" (effects (font (size 1.27 1.27))))
          (number "17" (effects (font (size 1.27 1.27))))
        )
        (pin passive line (at 7.62 -10.16 180) (length 3.81)
          (name "Pin_18" (effects (font (size 1.27 1.27))))
          (number "18" (effects (font (size 1.27 1.27))))
        )
        (pin passive line (at -5.08 -12.7 0) (length 3.81)
          (name "Pin_19" (effects (font (size 1.27 1.27))))
          (number "19" (effects (font (size 1.27 1.27))))
        )
        (pin passive line (at 7.62 10.16 180) (length 3.81)
          (name "Pin_2" (effects (font (size 1.27 1.27))))
          (number "2" (effects (font (size 1.27 1.27))))
        )
        (pin passive line (at 7.62 -12.7 180) (length 3.81)
          (name "Pin_20" (effects (font (size 1.27 1.27))))
          (number "20" (effects (font (size 1.27 1.27))))
        )
        (pin passive line (at -5.08 7.62 0) (length 3.81)
          (name "Pin_3" (effects (font (size 1.27 1.27))))
          (number "3" (effects (font (size 1.27 1.27))))
        )
        (pin passive line (at 7.62 7.62 180) (length 3.81)
          (name "Pin_4" (effects (font (size 1.27 1.27))))
          (number "4" (effects (font (size 1.27 1.27))))
        )
        (pin passive line (at -5.08 5.08 0) (length 3.81)
          (name "Pin_5" (effects (font (size 1.27 1.27))))
          (number "5" (effects (font (size 1.27 1.27))))
        )
        (pin passive line (at 7.62 5.08 180) (length 3.81)
          (name "Pin_6" (effects (font (size 1.27 1.27))))
          (number "6" (effects (font (size 1.27 1.27))))
        )
        (pin passive line (at -5.08 2.54 0) (length 3.81)
          (name "Pin_7" (effects (font (size 1.27 1.27))))
          (number "7" (effects (font (size 1.27 1.27))))
        )
        (pin passive line (at 7.62 2.54 180) (length 3.81)
          (name "Pin_8" (effects (font (size 1.27 1.27))))
          (number "8" (effects (font (size 1.27 1.27))))
        )
        (pin passive line (at -5.08 0 0) (length 3.81)
          (name "Pin_9" (effects (font (size 1.27 1.27))))
          (number "9" (effects (font (size 1.27 1.27))))
        )
      )
    )
    (symbol "power:GND" (power) (pin_names (offset 0)) (in_bom yes) (on_board yes)
      (property "Reference" "#PWR" (id 0) (at 0 -6.35 0)
        (effects (font (size 1.27 1.27)) hide)
      )
      (property "Value" "GND" (id 1) (at 0 -3.81 0)
        (effects (font (size 1.27 1.27)))
      )
      (property "Footprint" "" (id 2) (at 0 0 0)
        (effects (font (size 1.27 1.27)) hide)
      )
      (property "Datasheet" "" (id 3) (at 0 0 0)
        (effects (font (size 1.27 1.27)) hide)
      )
      (property "ki_keywords" "power-flag" (id 4) (at 0 0 0)
        (effects (font (size 1.27 1.27)) hide)
      )
      (property "ki_description" "Power symbol creates a global label with name \"GND\" , ground" (id 5) (at 0 0 0)
        (effects (font (size 1.27 1.27)) hide)
      )
      (symbol "GND_0_1"
        (polyline
          (pts
            (xy 0 0)
            (xy 0 -1.27)
            (xy 1.27 -1.27)
            (xy 0 -2.54)
            (xy -1.27 -1.27)
            (xy 0 -1.27)
          )
          (stroke (width 0) (type default) (color 0 0 0 0))
          (fill (type none))
        )
      )
      (symbol "GND_1_1"
        (pin power_in line (at 0 0 270) (length 0) hide
          (name "GND" (effects (font (size 1.27 1.27))))
          (number "1" (effects (font (size 1.27 1.27))))
        )
      )
    )
  )

  (junction (at 39.37 27.94) (diameter 0) (color 0 0 0 0)
    (uuid 0c6cd6d9-0fad-4433-b450-c020bdbd929f)
  )
  (junction (at 39.37 43.18) (diameter 0) (color 0 0 0 0)
    (uuid 32ca2f2a-3374-4e05-bdf5-999cd14c2497)
  )
  (junction (at 39.37 40.64) (diameter 0) (color 0 0 0 0)
    (uuid 417403d5-48c4-4831-8a2c-72bb55190801)
  )
  (junction (at 39.37 50.8) (diameter 0) (color 0 0 0 0)
    (uuid 6139f85c-676c-426e-a60d-f0737ce59ddc)
  )
  (junction (at 39.37 35.56) (diameter 0) (color 0 0 0 0)
    (uuid 6e91ca48-6abf-4217-b6f4-66f1bd2ac9db)
  )
  (junction (at 39.37 30.48) (diameter 0) (color 0 0 0 0)
    (uuid c0d3b1f8-77e4-4bd4-9ea6-96aa8748d2fc)
  )
  (junction (at 39.37 48.26) (diameter 0) (color 0 0 0 0)
    (uuid cc2d81e1-2b40-46f2-8b58-dd653536fa2a)
  )
  (junction (at 39.37 53.34) (diameter 0) (color 0 0 0 0)
    (uuid d082c7bc-fb7d-4d61-947e-efce33fb0370)
  )
  (junction (at 39.37 33.02) (diameter 0) (color 0 0 0 0)
    (uuid d501fa0d-0b76-427e-b313-83686600ccf1)
  )
  (junction (at 39.37 38.1) (diameter 0) (color 0 0 0 0)
    (uuid f1f5e783-c18f-4e24-ab32-79cf1b6f5e9a)
  )
  (junction (at 39.37 45.72) (diameter 0) (color 0 0 0 0)
    (uuid f7e70d0c-7a28-4c91-a752-1256b4b5de34)
  )

  (bus_entry (at 34.29 152.4) (size 2.54 -2.54)
    (stroke (width 0) (type default) (color 0 0 0 0))
    (uuid 09684b6c-5d15-4020-b96b-0b388e8ee3ea)
  )
  (bus_entry (at 34.29 124.46) (size 2.54 -2.54)
    (stroke (width 0) (type default) (color 0 0 0 0))
    (uuid 1002411f-a485-468c-981b-cec2ce41d8bd)
  )
  (bus_entry (at 34.29 121.92) (size 2.54 -2.54)
    (stroke (width 0) (type default) (color 0 0 0 0))
    (uuid 1a0c5194-0d7e-4fcc-a11d-049fac80c4dc)
  )
  (bus_entry (at 34.29 104.14) (size 2.54 -2.54)
    (stroke (width 0) (type default) (color 0 0 0 0))
    (uuid 3520b9bf-2dfc-4868-a650-86ff98682e83)
  )
  (bus_entry (at 34.29 48.26) (size 2.54 -2.54)
    (stroke (width 0) (type default) (color 0 0 0 0))
    (uuid 3adb8c69-132c-478c-b246-f381b0e1424c)
  )
  (bus_entry (at 34.29 43.18) (size 2.54 -2.54)
    (stroke (width 0) (type default) (color 0 0 0 0))
    (uuid 3be2f64a-643b-4527-aaf5-307341a81097)
  )
  (bus_entry (at 34.29 119.38) (size 2.54 -2.54)
    (stroke (width 0) (type default) (color 0 0 0 0))
    (uuid 415d6a7d-98b2-4d17-b46f-6f38749a3ba2)
  )
  (bus_entry (at 34.29 86.36) (size 2.54 -2.54)
    (stroke (width 0) (type default) (color 0 0 0 0))
    (uuid 45c7911f-b027-440e-9e3e-77a146b41944)
  )
  (bus_entry (at 34.29 109.22) (size 2.54 -2.54)
    (stroke (width 0) (type default) (color 0 0 0 0))
    (uuid 494a6b97-f33e-4834-b724-0c3a3ff54317)
  )
  (bus_entry (at 34.29 116.84) (size 2.54 -2.54)
    (stroke (width 0) (type default) (color 0 0 0 0))
    (uuid 4dfbe524-132d-43d4-8ae0-9aa2f72df70b)
  )
  (bus_entry (at 34.29 106.68) (size 2.54 -2.54)
    (stroke (width 0) (type default) (color 0 0 0 0))
    (uuid 506110af-ac51-4501-bfa6-1552a848d599)
  )
  (bus_entry (at 34.29 45.72) (size 2.54 -2.54)
    (stroke (width 0) (type default) (color 0 0 0 0))
    (uuid 59550421-1010-45d2-ae78-ff36e5bca6b7)
  )
  (bus_entry (at 34.29 53.34) (size 2.54 -2.54)
    (stroke (width 0) (type default) (color 0 0 0 0))
    (uuid 5c4ddc3a-1b67-4d06-8b43-5f565c9d4f71)
  )
  (bus_entry (at 34.29 160.02) (size 2.54 -2.54)
    (stroke (width 0) (type default) (color 0 0 0 0))
    (uuid 5ecea6c7-cbcd-4340-9db8-55b54a886e1e)
  )
  (bus_entry (at 34.29 55.88) (size 2.54 -2.54)
    (stroke (width 0) (type default) (color 0 0 0 0))
    (uuid 6a5fe9e5-baaf-40a3-a520-f60ee8a61237)
  )
  (bus_entry (at 34.29 114.3) (size 2.54 -2.54)
    (stroke (width 0) (type default) (color 0 0 0 0))
    (uuid 6b1d6bcd-1928-474b-8dbd-6dab746597ca)
  )
  (bus_entry (at 34.29 33.02) (size 2.54 -2.54)
    (stroke (width 0) (type default) (color 0 0 0 0))
    (uuid 7b1f2f40-abe7-4adb-bfe4-3f1a7f99a0f2)
  )
  (bus_entry (at 34.29 38.1) (size 2.54 -2.54)
    (stroke (width 0) (type default) (color 0 0 0 0))
    (uuid 7bc13ee4-2194-461b-9242-0d96ebba241b)
  )
  (bus_entry (at 34.29 147.32) (size 2.54 -2.54)
    (stroke (width 0) (type default) (color 0 0 0 0))
    (uuid 7bd09790-9a37-4331-94a2-940c4fb9585b)
  )
  (bus_entry (at 34.29 139.7) (size 2.54 -2.54)
    (stroke (width 0) (type default) (color 0 0 0 0))
    (uuid 83226cf4-4bcb-4755-8744-16fd92f3a724)
  )
  (bus_entry (at 34.29 154.94) (size 2.54 -2.54)
    (stroke (width 0) (type default) (color 0 0 0 0))
    (uuid 88b7d164-35a2-420d-9da6-a56db04f962b)
  )
  (bus_entry (at 34.29 142.24) (size 2.54 -2.54)
    (stroke (width 0) (type default) (color 0 0 0 0))
    (uuid 8b129856-cc2d-4792-b90f-5af9599716ce)
  )
  (bus_entry (at 34.29 157.48) (size 2.54 -2.54)
    (stroke (width 0) (type default) (color 0 0 0 0))
    (uuid 92ff4797-ba89-46c8-b3a8-8260d960e660)
  )
  (bus_entry (at 34.29 162.56) (size 2.54 -2.54)
    (stroke (width 0) (type default) (color 0 0 0 0))
    (uuid 9328bf5e-c997-4667-847d-cf51587a0583)
  )
  (bus_entry (at 34.29 81.28) (size 2.54 -2.54)
    (stroke (width 0) (type default) (color 0 0 0 0))
    (uuid a11284ee-2f71-4eb8-b0ee-e01b498d0140)
  )
  (bus_entry (at 34.29 30.48) (size 2.54 -2.54)
    (stroke (width 0) (type default) (color 0 0 0 0))
    (uuid a886efcd-79c7-4a50-9341-60c02bb6b3d4)
  )
  (bus_entry (at 34.29 27.94) (size 2.54 -2.54)
    (stroke (width 0) (type default) (color 0 0 0 0))
    (uuid ac9d3142-cb7a-4666-baf3-d78233469686)
  )
  (bus_entry (at 34.29 50.8) (size 2.54 -2.54)
    (stroke (width 0) (type default) (color 0 0 0 0))
    (uuid b027388d-8092-416a-ae2f-62be7825303f)
  )
  (bus_entry (at 34.29 127) (size 2.54 -2.54)
    (stroke (width 0) (type default) (color 0 0 0 0))
    (uuid b29fb2cb-e4b7-4450-8086-3c4d31478159)
  )
  (bus_entry (at 34.29 111.76) (size 2.54 -2.54)
    (stroke (width 0) (type default) (color 0 0 0 0))
    (uuid b9f8ba78-9b7b-4a7c-8351-c9f145a140ab)
  )
  (bus_entry (at 34.29 78.74) (size 2.54 -2.54)
    (stroke (width 0) (type default) (color 0 0 0 0))
    (uuid bf9ad5a6-c4c4-4072-8854-6425d90cd19f)
  )
  (bus_entry (at 34.29 149.86) (size 2.54 -2.54)
    (stroke (width 0) (type default) (color 0 0 0 0))
    (uuid d2f72b7f-67e2-4cf3-9de6-340a26ecf95b)
  )
  (bus_entry (at 34.29 83.82) (size 2.54 -2.54)
    (stroke (width 0) (type default) (color 0 0 0 0))
    (uuid d4a7ff11-09f1-4325-94c0-c1b4b4278fe4)
  )
  (bus_entry (at 34.29 66.04) (size 2.54 -2.54)
    (stroke (width 0) (type default) (color 0 0 0 0))
    (uuid d4e5a639-c802-4fd5-bd43-bd9483f1fee3)
  )
  (bus_entry (at 34.29 144.78) (size 2.54 -2.54)
    (stroke (width 0) (type default) (color 0 0 0 0))
    (uuid dad24ddf-e25d-4aa8-b795-2adc252edc45)
  )
  (bus_entry (at 34.29 35.56) (size 2.54 -2.54)
    (stroke (width 0) (type default) (color 0 0 0 0))
    (uuid ddfa4cf0-3486-4284-897b-3a9e51f271d9)
  )
  (bus_entry (at 34.29 63.5) (size 2.54 -2.54)
    (stroke (width 0) (type default) (color 0 0 0 0))
    (uuid e0bbf399-c52b-4993-8f0b-a5400682c686)
  )
  (bus_entry (at 34.29 68.58) (size 2.54 -2.54)
    (stroke (width 0) (type default) (color 0 0 0 0))
    (uuid e1754158-40dc-4df5-848e-7e0c189ace53)
  )
  (bus_entry (at 34.29 71.12) (size 2.54 -2.54)
    (stroke (width 0) (type default) (color 0 0 0 0))
    (uuid e34d78fc-c821-4e5c-ac82-ce6fcdcd9454)
  )
  (bus_entry (at 34.29 76.2) (size 2.54 -2.54)
    (stroke (width 0) (type default) (color 0 0 0 0))
    (uuid eb8da7b1-c954-4f96-b636-28a01b4ed609)
  )
  (bus_entry (at 34.29 40.64) (size 2.54 -2.54)
    (stroke (width 0) (type default) (color 0 0 0 0))
    (uuid f420833d-9f22-43c2-813c-6543682555e5)
  )
  (bus_entry (at 34.29 73.66) (size 2.54 -2.54)
    (stroke (width 0) (type default) (color 0 0 0 0))
    (uuid f574310b-3071-4841-b3bc-44ccc3dd1422)
  )

  (wire (pts (xy 36.83 30.48) (xy 39.37 30.48))
    (stroke (width 0) (type default) (color 0 0 0 0))
    (uuid 03a79994-33b9-4df6-bdb0-d3807834d731)
  )
  (bus (pts (xy 34.29 63.5) (xy 34.29 66.04))
    (stroke (width 0) (type default) (color 0 0 0 0))
    (uuid 0673bd15-bb27-42a3-b8dd-ff34de638161)
  )

  (wire (pts (xy 39.37 33.02) (xy 39.37 35.56))
    (stroke (width 0) (type default) (color 0 0 0 0))
    (uuid 07946836-1773-4221-a587-230315f291e9)
  )
  (bus (pts (xy 34.29 35.56) (xy 34.29 38.1))
    (stroke (width 0) (type default) (color 0 0 0 0))
    (uuid 0b45b8a3-704c-4ce1-8076-df9c24e494fe)
  )

  (wire (pts (xy 36.83 60.96) (xy 39.37 60.96))
    (stroke (width 0) (type default) (color 0 0 0 0))
    (uuid 0f99d31f-3e61-45ba-a78c-4a282f861613)
  )
  (bus (pts (xy 34.29 154.94) (xy 34.29 157.48))
    (stroke (width 0) (type default) (color 0 0 0 0))
    (uuid 1330ef47-7b09-414a-a1f0-2278832b8dc8)
  )

  (wire (pts (xy 39.37 35.56) (xy 39.37 38.1))
    (stroke (width 0) (type default) (color 0 0 0 0))
    (uuid 14a511ab-2372-40ef-b89a-34d3e7f7fd47)
  )
  (wire (pts (xy 85.09 29.21) (xy 97.79 29.21))
    (stroke (width 0) (type default) (color 0 0 0 0))
    (uuid 1509b6e6-a266-4bd3-bef6-1700f12ad930)
  )
  (wire (pts (xy 39.37 50.8) (xy 39.37 53.34))
    (stroke (width 0) (type default) (color 0 0 0 0))
    (uuid 166526dc-9bab-462c-b78f-57ee72352c35)
  )
  (wire (pts (xy 85.09 83.82) (xy 97.79 83.82))
    (stroke (width 0) (type default) (color 0 0 0 0))
    (uuid 1b6f5437-7cc3-4fb0-a914-07fa3cdc968c)
  )
  (bus (pts (xy 34.29 53.34) (xy 34.29 55.88))
    (stroke (width 0) (type default) (color 0 0 0 0))
    (uuid 1c408391-fc59-4ea9-a0d9-3d99d381c04f)
  )

  (wire (pts (xy 36.83 119.38) (xy 39.37 119.38))
    (stroke (width 0) (type default) (color 0 0 0 0))
    (uuid 1c6c46b2-dd9e-430f-85e9-621815ceca94)
  )
  (wire (pts (xy 85.09 38.1) (xy 97.79 38.1))
    (stroke (width 0) (type default) (color 0 0 0 0))
    (uuid 1e0743f9-25f1-4e27-8ba3-1bbc1755dc6c)
  )
  (bus (pts (xy 34.29 27.94) (xy 34.29 30.48))
    (stroke (width 0) (type default) (color 0 0 0 0))
    (uuid 2175143b-96e5-45ef-b31c-8e810e35215e)
  )

  (wire (pts (xy 36.83 104.14) (xy 39.37 104.14))
    (stroke (width 0) (type default) (color 0 0 0 0))
    (uuid 226748a0-9c54-4438-a724-741c7846a7bf)
  )
  (wire (pts (xy 36.83 66.04) (xy 39.37 66.04))
    (stroke (width 0) (type default) (color 0 0 0 0))
    (uuid 233d14ec-e17f-4b70-ace9-a65479e58a33)
  )
  (bus (pts (xy 34.29 68.58) (xy 34.29 71.12))
    (stroke (width 0) (type default) (color 0 0 0 0))
    (uuid 23d75705-10e1-4dec-9c10-8f67a847bef4)
  )
  (bus (pts (xy 34.29 162.56) (xy 34.29 165.1))
    (stroke (width 0) (type default) (color 0 0 0 0))
    (uuid 28a0bdff-c8be-4e20-985b-4448da7d67aa)
  )

  (wire (pts (xy 36.83 101.6) (xy 39.37 101.6))
    (stroke (width 0) (type default) (color 0 0 0 0))
    (uuid 28aab436-a04a-4f1d-a887-4f09513fdc8a)
  )
  (wire (pts (xy 36.83 35.56) (xy 39.37 35.56))
    (stroke (width 0) (type default) (color 0 0 0 0))
    (uuid 29e27db0-3c69-4f62-9b26-37b540cf4f34)
  )
  (wire (pts (xy 124.46 26.67) (xy 137.16 26.67))
    (stroke (width 0) (type default) (color 0 0 0 0))
    (uuid 2edba9d3-c333-4296-851f-3df46822dd7b)
  )
  (wire (pts (xy 36.83 144.78) (xy 39.37 144.78))
    (stroke (width 0) (type default) (color 0 0 0 0))
    (uuid 310e28e7-f7b1-4197-b25d-4003c7dcabae)
  )
  (wire (pts (xy 36.83 50.8) (xy 39.37 50.8))
    (stroke (width 0) (type default) (color 0 0 0 0))
    (uuid 3581de8b-daeb-467a-8039-51714599e4ba)
  )
  (bus (pts (xy 34.29 30.48) (xy 34.29 33.02))
    (stroke (width 0) (type default) (color 0 0 0 0))
    (uuid 3e58c630-613c-4858-bdb4-aaf6c25e4568)
  )

  (wire (pts (xy 97.79 63.5) (xy 85.09 63.5))
    (stroke (width 0) (type default) (color 0 0 0 0))
    (uuid 3e82ba62-7189-4489-87d5-60db49657901)
  )
  (wire (pts (xy 36.83 81.28) (xy 39.37 81.28))
    (stroke (width 0) (type default) (color 0 0 0 0))
    (uuid 40ef82a7-1843-41e2-896c-620f16b91b4f)
  )
  (bus (pts (xy 34.29 55.88) (xy 34.29 58.42))
    (stroke (width 0) (type default) (color 0 0 0 0))
    (uuid 41436b41-42cc-4b8a-b519-5efc295c053b)
  )
  (bus (pts (xy 34.29 106.68) (xy 34.29 109.22))
    (stroke (width 0) (type default) (color 0 0 0 0))
    (uuid 44afad59-6daf-4b20-a351-053772d5b408)
  )

  (wire (pts (xy 39.37 30.48) (xy 39.37 33.02))
    (stroke (width 0) (type default) (color 0 0 0 0))
    (uuid 4863dd64-b35b-4af7-9769-44630b725abf)
  )
  (wire (pts (xy 39.37 55.88) (xy 53.34 55.88))
    (stroke (width 0) (type default) (color 0 0 0 0))
    (uuid 4bc1a0ab-1a3e-436d-bc1c-2edb39185457)
  )
  (wire (pts (xy 39.37 53.34) (xy 36.83 53.34))
    (stroke (width 0) (type default) (color 0 0 0 0))
    (uuid 4be25af8-39f2-4002-9837-911821c1b9cc)
  )
  (wire (pts (xy 97.79 74.93) (xy 85.09 74.93))
    (stroke (width 0) (type default) (color 0 0 0 0))
    (uuid 4eeb2bf2-5aa0-4534-94bd-c0dab739d13b)
  )
  (bus (pts (xy 34.29 66.04) (xy 34.29 68.58))
    (stroke (width 0) (type default) (color 0 0 0 0))
    (uuid 51164dcb-11fa-46ce-8afd-b1b4d8dcb7d0)
  )
  (bus (pts (xy 34.29 73.66) (xy 34.29 76.2))
    (stroke (width 0) (type default) (color 0 0 0 0))
    (uuid 516283cf-b47a-490e-bce3-b1a2b10c51cd)
  )

  (wire (pts (xy 36.83 27.94) (xy 39.37 27.94))
    (stroke (width 0) (type default) (color 0 0 0 0))
    (uuid 52b0b1af-6b4f-4347-ba0b-71f9f5ddacd7)
  )
  (wire (pts (xy 97.79 26.67) (xy 85.09 26.67))
    (stroke (width 0) (type default) (color 0 0 0 0))
    (uuid 563db87b-34c4-4832-bfe7-c025196b0284)
  )
  (bus (pts (xy 34.29 45.72) (xy 34.29 48.26))
    (stroke (width 0) (type default) (color 0 0 0 0))
    (uuid 56b33c36-8771-424b-8d11-65057408e8e2)
  )

  (wire (pts (xy 137.16 29.21) (xy 124.46 29.21))
    (stroke (width 0) (type default) (color 0 0 0 0))
    (uuid 56d5d2e4-dbd9-4665-9c2f-4cd76f3e3bd2)
  )
  (wire (pts (xy 36.83 124.46) (xy 39.37 124.46))
    (stroke (width 0) (type default) (color 0 0 0 0))
    (uuid 570ee06f-38f1-44a9-ae2b-f08cf56305e0)
  )
  (bus (pts (xy 34.29 50.8) (xy 34.29 53.34))
    (stroke (width 0) (type default) (color 0 0 0 0))
    (uuid 572a0b45-4f2f-46da-a139-78a2a9141e92)
  )

  (wire (pts (xy 137.16 52.07) (xy 124.46 52.07))
    (stroke (width 0) (type default) (color 0 0 0 0))
    (uuid 58e43a80-a74c-4a45-a990-a8fe7ecac27a)
  )
  (bus (pts (xy 34.29 78.74) (xy 34.29 81.28))
    (stroke (width 0) (type default) (color 0 0 0 0))
    (uuid 59be1e35-0009-4cda-bff4-47a95947075f)
  )
  (bus (pts (xy 34.29 144.78) (xy 34.29 147.32))
    (stroke (width 0) (type default) (color 0 0 0 0))
    (uuid 5ab46a14-0d56-44f7-be6a-6a9a2ff2be30)
  )

  (wire (pts (xy 137.16 86.36) (xy 124.46 86.36))
    (stroke (width 0) (type default) (color 0 0 0 0))
    (uuid 5bc4bec0-de82-443a-a56c-94cfb0912fcb)
  )
  (wire (pts (xy 36.83 139.7) (xy 39.37 139.7))
    (stroke (width 0) (type default) (color 0 0 0 0))
    (uuid 5bf032d7-1ed3-461e-8d9e-98362eeab2a2)
  )
  (wire (pts (xy 36.83 109.22) (xy 39.37 109.22))
    (stroke (width 0) (type default) (color 0 0 0 0))
    (uuid 5ea450c5-c799-4c49-a77b-90af3b812ea4)
  )
  (wire (pts (xy 97.79 86.36) (xy 85.09 86.36))
    (stroke (width 0) (type default) (color 0 0 0 0))
    (uuid 5edbc061-8621-4c13-864b-a2a2b212044e)
  )
  (wire (pts (xy 39.37 38.1) (xy 39.37 40.64))
    (stroke (width 0) (type default) (color 0 0 0 0))
    (uuid 5f8e8250-bba3-4fe1-892c-6dbce9b40863)
  )
  (bus (pts (xy 34.29 40.64) (xy 34.29 43.18))
    (stroke (width 0) (type default) (color 0 0 0 0))
    (uuid 600f5cfa-dd31-4607-87c8-5dfbe5b656fa)
  )

  (wire (pts (xy 137.16 74.93) (xy 124.46 74.93))
    (stroke (width 0) (type default) (color 0 0 0 0))
    (uuid 61a8149a-2c46-4891-a026-d1321b4c0b29)
  )
  (wire (pts (xy 124.46 72.39) (xy 137.16 72.39))
    (stroke (width 0) (type default) (color 0 0 0 0))
    (uuid 67ed65af-3dae-472c-882d-b64c8e40e12c)
  )
  (bus (pts (xy 34.29 111.76) (xy 34.29 114.3))
    (stroke (width 0) (type default) (color 0 0 0 0))
    (uuid 6d552e71-fedf-4fee-9bb1-2c6c11aa21c7)
  )

  (wire (pts (xy 36.83 114.3) (xy 39.37 114.3))
    (stroke (width 0) (type default) (color 0 0 0 0))
    (uuid 6e23d37a-3804-4cb0-9f56-ede150eedda5)
  )
  (bus (pts (xy 34.29 157.48) (xy 34.29 160.02))
    (stroke (width 0) (type default) (color 0 0 0 0))
    (uuid 724d998a-d04a-46ee-9b29-fb7b4ebc9a6e)
  )

  (wire (pts (xy 36.83 111.76) (xy 39.37 111.76))
    (stroke (width 0) (type default) (color 0 0 0 0))
    (uuid 730780c7-40bd-484b-b640-ae047209b478)
  )
  (bus (pts (xy 34.29 86.36) (xy 34.29 88.9))
    (stroke (width 0) (type default) (color 0 0 0 0))
    (uuid 738a2d37-3fe6-4c2f-adcd-a08af9d6f339)
  )

  (wire (pts (xy 53.34 55.88) (xy 53.34 59.69))
    (stroke (width 0) (type default) (color 0 0 0 0))
    (uuid 76ec217b-f7f7-43cb-a044-172f00e1e213)
  )
  (bus (pts (xy 34.29 109.22) (xy 34.29 111.76))
    (stroke (width 0) (type default) (color 0 0 0 0))
    (uuid 7a1426cf-302c-4de8-9d69-039edf21325e)
  )

  (wire (pts (xy 36.83 157.48) (xy 39.37 157.48))
    (stroke (width 0) (type default) (color 0 0 0 0))
    (uuid 7b2f6028-5234-4df8-8d41-bf003f728f58)
  )
  (wire (pts (xy 124.46 49.53) (xy 137.16 49.53))
    (stroke (width 0) (type default) (color 0 0 0 0))
    (uuid 7ff097b5-a55d-47f6-a955-3ddc5f3d0fd8)
  )
  (wire (pts (xy 36.83 147.32) (xy 39.37 147.32))
    (stroke (width 0) (type default) (color 0 0 0 0))
    (uuid 80f56a42-ff05-4345-8ffd-85584fdb3701)
  )
  (wire (pts (xy 36.83 137.16) (xy 39.37 137.16))
    (stroke (width 0) (type default) (color 0 0 0 0))
    (uuid 86856bef-d161-4600-b8d6-44f81ad42b7c)
  )
  (bus (pts (xy 34.29 121.92) (xy 34.29 124.46))
    (stroke (width 0) (type default) (color 0 0 0 0))
    (uuid 879bb4e1-00e9-4bf5-a03c-0a7f5a77af5e)
  )

  (wire (pts (xy 39.37 83.82) (xy 36.83 83.82))
    (stroke (width 0) (type default) (color 0 0 0 0))
    (uuid 8aff71fc-0b55-4238-837c-95b0b4aac181)
  )
  (bus (pts (xy 34.29 142.24) (xy 34.29 144.78))
    (stroke (width 0) (type default) (color 0 0 0 0))
    (uuid 8b4d6a36-8b8a-47fa-9b34-e1f16ae22191)
  )
  (bus (pts (xy 34.29 71.12) (xy 34.29 73.66))
    (stroke (width 0) (type default) (color 0 0 0 0))
    (uuid 8bcded31-bb3b-4512-b0e7-e445feeb54de)
  )

  (wire (pts (xy 36.83 149.86) (xy 39.37 149.86))
    (stroke (width 0) (type default) (color 0 0 0 0))
    (uuid 8c65d639-2c7e-432d-bc2d-cd7263d4f689)
  )
  (bus (pts (xy 34.29 33.02) (xy 34.29 35.56))
    (stroke (width 0) (type default) (color 0 0 0 0))
    (uuid 9098a6bf-eae0-4636-90c3-6c2f5d9401fd)
  )

  (wire (pts (xy 36.83 68.58) (xy 39.37 68.58))
    (stroke (width 0) (type default) (color 0 0 0 0))
    (uuid 91a85248-7895-453a-bdbc-36a6edbe91db)
  )
  (wire (pts (xy 137.16 63.5) (xy 124.46 63.5))
    (stroke (width 0) (type default) (color 0 0 0 0))
    (uuid 93927c49-5ee1-4ac6-b668-9cc01dba8402)
  )
  (bus (pts (xy 34.29 25.4) (xy 34.29 27.94))
    (stroke (width 0) (type default) (color 0 0 0 0))
    (uuid 93b0400d-1c06-448a-9708-3d9fe621905c)
  )

  (wire (pts (xy 36.83 142.24) (xy 39.37 142.24))
    (stroke (width 0) (type default) (color 0 0 0 0))
    (uuid 975ad921-d330-495d-a812-58638ba9e7c7)
  )
  (wire (pts (xy 85.09 49.53) (xy 97.79 49.53))
    (stroke (width 0) (type default) (color 0 0 0 0))
    (uuid 97675b30-915a-43e3-828c-166fb0161c3a)
  )
  (wire (pts (xy 85.09 72.39) (xy 97.79 72.39))
    (stroke (width 0) (type default) (color 0 0 0 0))
    (uuid 9a025d13-3f10-4480-b02b-5650c6d28ed8)
  )
  (wire (pts (xy 36.83 45.72) (xy 39.37 45.72))
    (stroke (width 0) (type default) (color 0 0 0 0))
    (uuid 9b774066-2c22-4032-af01-4291adb02340)
  )
  (wire (pts (xy 36.83 116.84) (xy 39.37 116.84))
    (stroke (width 0) (type default) (color 0 0 0 0))
    (uuid 9c7af13e-949e-4a55-a6b7-45ef51b4f106)
  )
  (bus (pts (xy 34.29 116.84) (xy 34.29 119.38))
    (stroke (width 0) (type default) (color 0 0 0 0))
    (uuid 9dd2e0b7-f638-4296-a814-314c10fceeb0)
  )
  (bus (pts (xy 34.29 124.46) (xy 34.29 127))
    (stroke (width 0) (type default) (color 0 0 0 0))
    (uuid 9f0c4e08-aefa-45f8-b780-d3d3f61b6f32)
  )

  (wire (pts (xy 36.83 71.12) (xy 39.37 71.12))
    (stroke (width 0) (type default) (color 0 0 0 0))
    (uuid a0400e61-7ec0-4cc7-a41d-d7c451e758fe)
  )
  (wire (pts (xy 39.37 40.64) (xy 39.37 43.18))
    (stroke (width 0) (type default) (color 0 0 0 0))
    (uuid a1592887-07b4-43dc-8a75-d77574be7216)
  )
  (wire (pts (xy 36.83 106.68) (xy 39.37 106.68))
    (stroke (width 0) (type default) (color 0 0 0 0))
    (uuid a56d1fde-b4ad-42de-a848-9c94bc0cbe09)
  )
  (wire (pts (xy 36.83 25.4) (xy 39.37 25.4))
    (stroke (width 0) (type default) (color 0 0 0 0))
    (uuid aa30b9c6-343c-4aef-bed3-4a301b183468)
  )
  (wire (pts (xy 36.83 160.02) (xy 39.37 160.02))
    (stroke (width 0) (type default) (color 0 0 0 0))
    (uuid ab15be4c-1efb-422a-9053-a5c97ba751b0)
  )
  (wire (pts (xy 36.83 121.92) (xy 39.37 121.92))
    (stroke (width 0) (type default) (color 0 0 0 0))
    (uuid ab3e0d45-ad5b-42a1-ab02-8fee32ad804e)
  )
  (bus (pts (xy 34.29 147.32) (xy 34.29 149.86))
    (stroke (width 0) (type default) (color 0 0 0 0))
    (uuid b30b0f89-aa4f-4480-90bd-1eefefaddb66)
  )

  (wire (pts (xy 39.37 45.72) (xy 39.37 48.26))
    (stroke (width 0) (type default) (color 0 0 0 0))
    (uuid b6de2db9-a25f-466b-8f4f-04a0b4ce0456)
  )
  (bus (pts (xy 34.29 152.4) (xy 34.29 154.94))
    (stroke (width 0) (type default) (color 0 0 0 0))
    (uuid b76911ff-41c5-455f-8484-a11c7c17ac54)
  )

  (wire (pts (xy 39.37 53.34) (xy 39.37 55.88))
    (stroke (width 0) (type default) (color 0 0 0 0))
    (uuid bc4c477c-d6fb-4981-9b61-b9709b1b2248)
  )
  (wire (pts (xy 124.46 60.96) (xy 137.16 60.96))
    (stroke (width 0) (type default) (color 0 0 0 0))
    (uuid be40a792-1fff-4ce1-a6d8-41730132bad4)
  )
  (wire (pts (xy 39.37 43.18) (xy 39.37 45.72))
    (stroke (width 0) (type default) (color 0 0 0 0))
    (uuid c03e28d2-0e03-47a4-90ca-018219ff0322)
  )
  (bus (pts (xy 34.29 81.28) (xy 34.29 83.82))
    (stroke (width 0) (type default) (color 0 0 0 0))
    (uuid c41f6407-8adc-4c40-b777-d1220528ff49)
  )

  (wire (pts (xy 36.83 38.1) (xy 39.37 38.1))
    (stroke (width 0) (type default) (color 0 0 0 0))
    (uuid c4e3a83a-2945-4c21-9d1d-f3f3be86b7bd)
  )
  (wire (pts (xy 85.09 60.96) (xy 97.79 60.96))
    (stroke (width 0) (type default) (color 0 0 0 0))
    (uuid c77559f1-9310-438e-bb42-9cac3de0d116)
  )
  (wire (pts (xy 36.83 33.02) (xy 39.37 33.02))
    (stroke (width 0) (type default) (color 0 0 0 0))
    (uuid cb082ca8-e559-493c-a769-6ac76ddc831e)
  )
  (bus (pts (xy 34.29 114.3) (xy 34.29 116.84))
    (stroke (width 0) (type default) (color 0 0 0 0))
    (uuid cb73d5e1-cb35-4cc7-a45e-bbf60ebd9cfe)
  )
  (bus (pts (xy 34.29 48.26) (xy 34.29 50.8))
    (stroke (width 0) (type default) (color 0 0 0 0))
    (uuid cbc36dec-758f-4870-b904-a0d31c293f35)
  )
  (bus (pts (xy 34.29 149.86) (xy 34.29 152.4))
    (stroke (width 0) (type default) (color 0 0 0 0))
    (uuid ccf7a7b8-69ac-41d0-a2a1-6436c1221e39)
  )
  (bus (pts (xy 34.29 38.1) (xy 34.29 40.64))
    (stroke (width 0) (type default) (color 0 0 0 0))
    (uuid cddd0ad0-870d-4f5a-a781-2a7705bca2c4)
  )

  (wire (pts (xy 36.83 154.94) (xy 39.37 154.94))
    (stroke (width 0) (type default) (color 0 0 0 0))
    (uuid d0b8883f-56d3-436a-a178-a658388f963b)
  )
  (wire (pts (xy 39.37 48.26) (xy 39.37 50.8))
    (stroke (width 0) (type default) (color 0 0 0 0))
    (uuid d23b4936-7795-4153-aa9c-1b270fb884de)
  )
  (bus (pts (xy 34.29 43.18) (xy 34.29 45.72))
    (stroke (width 0) (type default) (color 0 0 0 0))
    (uuid d32e6966-5cf5-4dfb-b22f-1fe279445894)
  )

  (wire (pts (xy 124.46 38.1) (xy 137.16 38.1))
    (stroke (width 0) (type default) (color 0 0 0 0))
    (uuid d432cbe6-4998-44d8-87df-626563ccc34f)
  )
  (bus (pts (xy 34.29 139.7) (xy 34.29 142.24))
    (stroke (width 0) (type default) (color 0 0 0 0))
    (uuid d618158f-4184-4754-aa33-65a98e706342)
  )

  (wire (pts (xy 124.46 83.82) (xy 137.16 83.82))
    (stroke (width 0) (type default) (color 0 0 0 0))
    (uuid d70b07f0-7794-49ac-aab9-bba7744f562e)
  )
  (wire (pts (xy 137.16 40.64) (xy 124.46 40.64))
    (stroke (width 0) (type default) (color 0 0 0 0))
    (uuid d82759b1-57a0-4293-812e-59347193bfc5)
  )
  (wire (pts (xy 36.83 48.26) (xy 39.37 48.26))
    (stroke (width 0) (type default) (color 0 0 0 0))
    (uuid d98b06b1-d759-4372-889f-6ac21114139f)
  )
  (bus (pts (xy 34.29 160.02) (xy 34.29 162.56))
    (stroke (width 0) (type default) (color 0 0 0 0))
    (uuid dc256d85-d6a6-49b0-a631-c3d28df03a0f)
  )
  (bus (pts (xy 34.29 119.38) (xy 34.29 121.92))
    (stroke (width 0) (type default) (color 0 0 0 0))
    (uuid dc27d331-c243-40ab-8815-68c702f3aa36)
  )

  (wire (pts (xy 36.83 40.64) (xy 39.37 40.64))
    (stroke (width 0) (type default) (color 0 0 0 0))
    (uuid dd4b4783-44b6-4bbf-bf18-b846491e4d4c)
  )
  (wire (pts (xy 36.83 78.74) (xy 39.37 78.74))
    (stroke (width 0) (type default) (color 0 0 0 0))
    (uuid de01c5f0-8b67-4f95-a915-b01789f320eb)
  )
  (wire (pts (xy 36.83 63.5) (xy 39.37 63.5))
    (stroke (width 0) (type default) (color 0 0 0 0))
    (uuid e08b3dd0-5717-45d9-897c-a2c963f9de1a)
  )
  (bus (pts (xy 34.29 83.82) (xy 34.29 86.36))
    (stroke (width 0) (type default) (color 0 0 0 0))
    (uuid e08e4be3-e176-4424-a1f3-98c5f39333da)
  )

  (wire (pts (xy 36.83 76.2) (xy 39.37 76.2))
    (stroke (width 0) (type default) (color 0 0 0 0))
    (uuid e0937f55-5a21-4b1f-aa30-aba62e4969e5)
  )
  (wire (pts (xy 36.83 43.18) (xy 39.37 43.18))
    (stroke (width 0) (type default) (color 0 0 0 0))
    (uuid e325a134-36dc-4151-9d17-8bf13dc78564)
  )
  (wire (pts (xy 36.83 73.66) (xy 39.37 73.66))
    (stroke (width 0) (type default) (color 0 0 0 0))
    (uuid e44b0081-5f25-4984-8fb5-ea876fb2fc1c)
  )
  (wire (pts (xy 36.83 152.4) (xy 39.37 152.4))
    (stroke (width 0) (type default) (color 0 0 0 0))
    (uuid ec15bc3b-566a-44e3-a715-82c18713a059)
  )
  (bus (pts (xy 34.29 76.2) (xy 34.29 78.74))
    (stroke (width 0) (type default) (color 0 0 0 0))
    (uuid f096e358-8a0e-4cc6-90b3-f9b0335ba61f)
  )

  (wire (pts (xy 39.37 27.94) (xy 39.37 30.48))
    (stroke (width 0) (type default) (color 0 0 0 0))
    (uuid f0e836d0-4742-45c9-bc45-daec24fb1db8)
  )
  (wire (pts (xy 39.37 25.4) (xy 39.37 27.94))
    (stroke (width 0) (type default) (color 0 0 0 0))
    (uuid f24a009c-433a-4dee-8804-740c882fd7e3)
  )
  (bus (pts (xy 34.29 127) (xy 34.29 129.54))
    (stroke (width 0) (type default) (color 0 0 0 0))
    (uuid f2d0b580-63cc-444c-a324-942d413ae071)
  )
  (bus (pts (xy 34.29 104.14) (xy 34.29 106.68))
    (stroke (width 0) (type default) (color 0 0 0 0))
    (uuid f84570f0-8f86-40f4-8c85-4d0ad12444b2)
  )

  (wire (pts (xy 97.79 52.07) (xy 85.09 52.07))
    (stroke (width 0) (type default) (color 0 0 0 0))
    (uuid f9fdab0b-0971-4c0c-831c-cda73093deb5)
  )
  (wire (pts (xy 97.79 40.64) (xy 85.09 40.64))
    (stroke (width 0) (type default) (color 0 0 0 0))
    (uuid ff579cc0-821d-40ca-8f3d-8708c2d87acb)
  )

  (label "HV_OUT3" (at 39.37 152.4 0)
    (effects (font (size 1.524 1.524)) (justify left bottom))
    (uuid 03ae5596-bc68-4919-b712-a127d93338cc)
  )
  (label "VOUT_RTN7" (at 39.37 35.56 0)
    (effects (font (size 1.524 1.524)) (justify left bottom))
    (uuid 08601885-ffd0-426c-9b07-2dc479593fb1)
  )
  (label "VOUT_RTN8" (at 124.46 52.07 180)
    (effects (font (size 1.524 1.524)) (justify right bottom))
    (uuid 0f0d22b0-c2a7-436a-931c-fa4be6782d48)
  )
  (label "VOUT_RTN5" (at 85.09 83.82 180)
    (effects (font (size 1.524 1.524)) (justify right bottom))
    (uuid 1000aad2-ee88-468e-a417-b002fef105e7)
  )
  (label "HV_OUT_RTN2" (at 100.33 104.14 0)
    (effects (font (size 1.524 1.524)) (justify left bottom))
    (uuid 15328724-62c0-4c64-8165-7ba7fa235831)
  )
  (label "VOUT_RTN6" (at 124.46 29.21 180)
    (effects (font (size 1.524 1.524)) (justify right bottom))
    (uuid 158af5df-cc1b-4506-bbe6-cb7505295b5b)
  )
  (label "HV_OUT_RTN0" (at 100.33 99.06 0)
    (effects (font (size 1.524 1.524)) (justify left bottom))
    (uuid 15ddbae8-4879-44da-8c42-497366b84781)
  )
  (label "HV_OUT_RTN8" (at 39.37 104.14 0)
    (effects (font (size 1.524 1.524)) (justify left bottom))
    (uuid 190829cf-8172-400f-bba0-21761cc942eb)
  )
  (label "HV_OUT6" (at 39.37 144.78 0)
    (effects (font (size 1.524 1.524)) (justify left bottom))
    (uuid 1f2605ff-0052-4214-ba00-e5f83f987c66)
  )
  (label "HV_OUT_RTN3" (at 100.33 106.68 0)
    (effects (font (size 1.524 1.524)) (justify left bottom))
    (uuid 1fcbe337-d147-4e02-846e-7f1ec4528bd0)
  )
  (label "VOUT7" (at 39.37 66.04 0)
    (effects (font (size 1.524 1.524)) (justify left bottom))
    (uuid 201a8082-80bc-49cb-a857-a9c917ee8418)
  )
  (label "HV_OUT_RTN7" (at 100.33 116.84 0)
    (effects (font (size 1.524 1.524)) (justify left bottom))
    (uuid 23a49e10-e7d0-41d9-a15a-25ac614cee99)
  )
  (label "VOUT7" (at 124.46 40.64 180)
    (effects (font (size 1.524 1.524)) (justify right bottom))
    (uuid 2460f6d2-1d7c-4c35-9be4-33dfefab8082)
  )
  (label "VOUT_RTN0" (at 85.09 29.21 180)
    (effects (font (size 1.524 1.524)) (justify right bottom))
    (uuid 26fd0d92-e1d7-4ec3-9cd1-0c12f182f0d8)
  )
  (label "VOUT_RTN10" (at 124.46 74.93 180)
    (effects (font (size 1.524 1.524)) (justify right bottom))
    (uuid 26fd21bc-b3dd-4d3f-828b-c65aac383c0b)
  )
  (label "VOUT_RTN10" (at 39.37 27.94 0)
    (effects (font (size 1.524 1.524)) (justify left bottom))
    (uuid 2b655423-4fcf-4347-ae4d-02fe0c896b52)
  )
  (label "VOUT_RTN7" (at 124.46 38.1 180)
    (effects (font (size 1.524 1.524)) (justify right bottom))
    (uuid 2fc6c800-22f6-42f6-a664-0677d01cefba)
  )
  (label "HV_OUT7" (at 87.63 116.84 180)
    (effects (font (size 1.524 1.524)) (justify right bottom))
    (uuid 30d4a5b8-34e9-412f-9d1a-e616a8a28215)
  )
  (label "HV_OUT_RTN5" (at 100.33 111.76 0)
    (effects (font (size 1.524 1.524)) (justify left bottom))
    (uuid 34d6d782-5641-4526-b346-05de03ea8c0e)
  )
  (label "VOUT_RTN4" (at 85.09 74.93 180)
    (effects (font (size 1.524 1.524)) (justify right bottom))
    (uuid 39367e70-4fd8-4578-b7c9-16f6f15e83e4)
  )
  (label "VOUT_RTN4" (at 39.37 43.18 0)
    (effects (font (size 1.524 1.524)) (justify left bottom))
    (uuid 3bdc61da-fd87-4d91-ae6a-f160ef1e6b25)
  )
  (label "VOUT6" (at 39.37 68.58 0)
    (effects (font (size 1.524 1.524)) (justify left bottom))
    (uuid 3d6472eb-4872-48d0-9b65-1b39f6d4a46a)
  )
  (label "HV_OUT_RTN9" (at 100.33 121.92 0)
    (effects (font (size 1.524 1.524)) (justify left bottom))
    (uuid 3d774050-1f75-473e-bdf5-d052504e6a25)
  )
  (label "HV_OUT7" (at 39.37 142.24 0)
    (effects (font (size 1.524 1.524)) (justify left bottom))
    (uuid 3e3af5be-1b4c-4ba4-b660-3033fdf1caed)
  )
  (label "HV_OUT1" (at 39.37 157.48 0)
    (effects (font (size 1.524 1.524)) (justify left bottom))
    (uuid 3fe74e96-d630-4db9-83b3-437a4cba15b4)
  )
  (label "VOUT3" (at 39.37 76.2 0)
    (effects (font (size 1.524 1.524)) (justify left bottom))
    (uuid 422a6702-d1c1-4e76-898e-ec20aaee30c2)
  )
  (label "HV_OUT_RTN3" (at 39.37 116.84 0)
    (effects (font (size 1.524 1.524)) (justify left bottom))
    (uuid 443b842e-cdd6-495f-a7fb-0cef04c17274)
  )
  (label "HV_OUT_RTN1" (at 39.37 121.92 0)
    (effects (font (size 1.524 1.524)) (justify left bottom))
    (uuid 45b2cd71-50dd-4f61-80ce-9a5382fe6dd4)
  )
  (label "HV_OUT_RTN2" (at 39.37 119.38 0)
    (effects (font (size 1.524 1.524)) (justify left bottom))
    (uuid 481d8c49-260f-40f8-9d7a-177fecb9140f)
  )
  (label "VOUT_RTN2" (at 39.37 48.26 0)
    (effects (font (size 1.524 1.524)) (justify left bottom))
    (uuid 505c1d3e-8ca5-438e-9eae-18483f12882c)
  )
  (label "HV_OUT_RTN7" (at 39.37 106.68 0)
    (effects (font (size 1.524 1.524)) (justify left bottom))
    (uuid 510813ff-4301-4d7b-b640-805049ac6194)
  )
  (label "HV_OUT_RTN5" (at 39.37 111.76 0)
    (effects (font (size 1.524 1.524)) (justify left bottom))
    (uuid 52fe3400-bf18-4fe5-aa6e-2be779b65697)
  )
  (label "VOUT_RTN11" (at 124.46 83.82 180)
    (effects (font (size 1.524 1.524)) (justify right bottom))
    (uuid 5367a494-64b6-4f8c-adca-814c4b88525b)
  )
  (label "VOUT4" (at 39.37 73.66 0)
    (effects (font (size 1.524 1.524)) (justify left bottom))
    (uuid 555e8fc3-19b4-40e8-abc6-87d7c193534e)
  )
  (label "VOUT10" (at 124.46 72.39 180)
    (effects (font (size 1.524 1.524)) (justify right bottom))
    (uuid 5cdb2718-315e-4c06-804f-561b680e75ba)
  )
  (label "VOUT11" (at 124.46 86.36 180)
    (effects (font (size 1.524 1.524)) (justify right bottom))
    (uuid 5dcbb3b6-1c66-4989-97d2-485c6610a0cb)
  )
  (label "HV_OUT0" (at 39.37 160.02 0)
    (effects (font (size 1.524 1.524)) (justify left bottom))
    (uuid 5f9c5087-aeae-41db-97be-1dd276294553)
  )
  (label "VOUT_RTN3" (at 85.09 60.96 180)
    (effects (font (size 1.524 1.524)) (justify right bottom))
    (uuid 64bbd1a8-b20b-4d12-891d-7b53b4a0334a)
  )
  (label "HV_OUT_RTN0" (at 39.37 124.46 0)
    (effects (font (size 1.524 1.524)) (justify left bottom))
    (uuid 64d84e49-aaf5-4eba-8a78-1b20287a1fe2)
  )
  (label "VOUT_RTN9" (at 124.46 60.96 180)
    (effects (font (size 1.524 1.524)) (justify right bottom))
    (uuid 69e05192-f084-4bb3-aff6-f350c539f1a8)
  )
  (label "HV_OUT8" (at 39.37 139.7 0)
    (effects (font (size 1.524 1.524)) (justify left bottom))
    (uuid 6bdf4c09-0d97-4f84-a45b-4830c8cb3132)
  )
  (label "HV_OUT_RTN6" (at 39.37 109.22 0)
    (effects (font (size 1.524 1.524)) (justify left bottom))
    (uuid 7112d2ae-7915-4f1a-aae6-e71244f669d8)
  )
  (label "HV_OUT2" (at 87.63 104.14 180)
    (effects (font (size 1.524 1.524)) (justify right bottom))
    (uuid 713e4d09-6cf1-49fc-bf2e-c643eb7890b8)
  )
  (label "HV_OUT_RTN4" (at 100.33 109.22 0)
    (effects (font (size 1.524 1.524)) (justify left bottom))
    (uuid 75080b0b-6140-45af-8605-622af6de8bea)
  )
  (label "VOUT_RTN6" (at 39.37 38.1 0)
    (effects (font (size 1.524 1.524)) (justify left bottom))
    (uuid 785187eb-3061-4043-a954-4178556793a1)
  )
  (label "HV_OUT_RTN4" (at 39.37 114.3 0)
    (effects (font (size 1.524 1.524)) (justify left bottom))
    (uuid 7ab8aff0-29e4-4be7-af1f-6a97b7752e20)
  )
  (label "VOUT2" (at 39.37 78.74 0)
    (effects (font (size 1.524 1.524)) (justify left bottom))
    (uuid 7b485fa8-406a-42d5-9a01-13ae76ec07b5)
  )
  (label "VOUT_RTN8" (at 39.37 33.02 0)
    (effects (font (size 1.524 1.524)) (justify left bottom))
    (uuid 824a1256-25d4-4c20-968f-40a07210c698)
  )
  (label "VOUT_RTN1" (at 85.09 38.1 180)
    (effects (font (size 1.524 1.524)) (justify right bottom))
    (uuid 826dab59-fbdd-42ab-9237-6c754170917b)
  )
  (label "HV_OUT9" (at 39.37 137.16 0)
    (effects (font (size 1.524 1.524)) (justify left bottom))
    (uuid 8524da93-8e55-4af1-8974-d6a0c4c21263)
  )
  (label "HV_OUT_RTN9" (at 39.37 101.6 0)
    (effects (font (size 1.524 1.524)) (justify left bottom))
    (uuid 86b1650c-27f6-4516-8b60-2a6a434a183e)
  )
  (label "VOUT_RTN9" (at 39.37 30.48 0)
    (effects (font (size 1.524 1.524)) (justify left bottom))
    (uuid 89d9af53-e698-40c4-8ab2-a44fdf0a4c6c)
  )
  (label "HV_OUT1" (at 87.63 101.6 180)
    (effects (font (size 1.524 1.524)) (justify right bottom))
    (uuid 8f0c1305-7bd7-41b0-a77d-0a9232a17e2e)
  )
  (label "HV_OUT8" (at 87.63 119.38 180)
    (effects (font (size 1.524 1.524)) (justify right bottom))
    (uuid 96bdf5ea-ca81-4096-814f-ff6d6aaf3220)
  )
  (label "VOUT5" (at 85.09 86.36 180)
    (effects (font (size 1.524 1.524)) (justify right bottom))
    (uuid 98fe4024-dd1f-4460-ab6c-997be1e2af2c)
  )
  (label "VOUT8" (at 39.37 63.5 0)
    (effects (font (size 1.524 1.524)) (justify left bottom))
    (uuid 9a68bf85-c16f-48ee-8e66-0d9ea8ea8b23)
  )
  (label "VOUT_RTN3" (at 39.37 45.72 0)
    (effects (font (size 1.524 1.524)) (justify left bottom))
    (uuid a0129fe7-e9e9-4c74-af85-e2b335707eb4)
  )
  (label "VOUT1" (at 39.37 81.28 0)
    (effects (font (size 1.524 1.524)) (justify left bottom))
    (uuid a1533d6a-9d56-4622-800a-f5af923f4a97)
  )
  (label "HV_OUT3" (at 87.63 106.68 180)
    (effects (font (size 1.524 1.524)) (justify right bottom))
    (uuid a9fdce30-e0b1-49dc-914c-0573fb33fbc7)
  )
  (label "HV_OUT4" (at 39.37 149.86 0)
    (effects (font (size 1.524 1.524)) (justify left bottom))
    (uuid ae2d0972-d851-4e32-b78e-a1894c29cfe1)
  )
  (label "VOUT_RTN5" (at 39.37 40.64 0)
    (effects (font (size 1.524 1.524)) (justify left bottom))
    (uuid b0b40da2-8918-4f0b-b11b-1408b929feb5)
  )
  (label "VOUT_RTN11" (at 39.37 25.4 0)
    (effects (font (size 1.524 1.524)) (justify left bottom))
    (uuid b1a84af6-8d98-414d-88ed-0dfe64c90ccc)
  )
  (label "HV_OUT6" (at 87.63 114.3 180)
    (effects (font (size 1.524 1.524)) (justify right bottom))
    (uuid b6670714-a829-420f-8f82-042c74d803a5)
  )
  (label "HV_OUT_RTN8" (at 100.33 119.38 0)
    (effects (font (size 1.524 1.524)) (justify left bottom))
    (uuid b8e9717b-c8d9-44dd-9eb5-d37e3b2c2fb5)
  )
  (label "VOUT8" (at 124.46 49.53 180)
    (effects (font (size 1.524 1.524)) (justify right bottom))
    (uuid c71e1710-20a1-4e33-88ae-549fb47faa61)
  )
  (label "VOUT0" (at 85.09 26.67 180)
    (effects (font (size 1.524 1.524)) (justify right bottom))
    (uuid c95ae74a-ca90-4a39-aa68-19d5d2714b13)
  )
  (label "VOUT9" (at 39.37 60.96 0)
    (effects (font (size 1.524 1.524)) (justify left bottom))
    (uuid ccdce88e-24b7-4692-934b-22bb9b0763dc)
  )
  (label "VOUT0" (at 39.37 83.82 0)
    (effects (font (size 1.524 1.524)) (justify left bottom))
    (uuid cdce2be4-88ef-44ed-b591-e6404a14a2cf)
  )
  (label "VOUT1" (at 85.09 40.64 180)
    (effects (font (size 1.524 1.524)) (justify right bottom))
    (uuid cf6465a5-cdc8-43ab-af6a-066f3abc4788)
  )
  (label "VOUT2" (at 85.09 49.53 180)
    (effects (font (size 1.524 1.524)) (justify right bottom))
    (uuid d0c5561a-ecf5-4fb9-9963-743c221a8335)
  )
  (label "HV_OUT9" (at 87.63 121.92 180)
    (effects (font (size 1.524 1.524)) (justify right bottom))
    (uuid d2b76814-7e11-4ea5-b409-7892e0c8500a)
  )
  (label "HV_OUT5" (at 87.63 111.76 180)
    (effects (font (size 1.524 1.524)) (justify right bottom))
    (uuid d7329050-0c4f-4d4d-b156-c34af61257ff)
  )
  (label "VOUT_RTN2" (at 85.09 52.07 180)
    (effects (font (size 1.524 1.524)) (justify right bottom))
    (uuid d9c1c6f8-c198-49f9-bff0-eab2393a0053)
  )
  (label "VOUT9" (at 124.46 63.5 180)
    (effects (font (size 1.524 1.524)) (justify right bottom))
    (uuid da423bcf-af02-422a-8d3f-915d7fd393eb)
  )
  (label "VOUT3" (at 85.09 63.5 180)
    (effects (font (size 1.524 1.524)) (justify right bottom))
    (uuid db002d44-34dc-4a16-a373-be2b73d8ad8e)
  )
  (label "VOUT_RTN0" (at 39.37 53.34 0)
    (effects (font (size 1.524 1.524)) (justify left bottom))
    (uuid dfe0615d-48dd-4d5e-ae77-f5a2410688c9)
  )
  (label "VOUT_RTN1" (at 39.37 50.8 0)
    (effects (font (size 1.524 1.524)) (justify left bottom))
    (uuid e188f4e0-97d6-45d5-9852-98640c6abc42)
  )
  (label "HV_OUT_RTN6" (at 100.33 114.3 0)
    (effects (font (size 1.524 1.524)) (justify left bottom))
    (uuid e1a929c4-c484-4255-9524-8c224d1f6e73)
  )
  (label "HV_OUT4" (at 87.63 109.22 180)
    (effects (font (size 1.524 1.524)) (justify right bottom))
    (uuid e595c6c4-f51e-40bc-a76d-c0a08bbd62be)
  )
  (label "HV_OUT0" (at 87.63 99.06 180)
    (effects (font (size 1.524 1.524)) (justify right bottom))
    (uuid e69b829b-c0b7-43a9-80d0-4376f3776ee0)
  )
  (label "HV_OUT2" (at 39.37 154.94 0)
    (effects (font (size 1.524 1.524)) (justify left bottom))
    (uuid ef996d8d-e885-4c54-b48b-e12cd0bd7e8e)
  )
  (label "VOUT6" (at 124.46 26.67 180)
    (effects (font (size 1.524 1.524)) (justify right bottom))
    (uuid f09eeb0b-a016-4287-8ed5-683b4c4b51a3)
  )
  (label "HV_OUT_RTN1" (at 100.33 101.6 0)
    (effects (font (size 1.524 1.524)) (justify left bottom))
    (uuid f1353e9e-7eae-44e9-872c-ec11c41e5657)
  )
  (label "VOUT5" (at 39.37 71.12 0)
    (effects (font (size 1.524 1.524)) (justify left bottom))
    (uuid f50538bf-e44a-4d20-ab4a-ccf1e95ea69c)
  )
  (label "HV_OUT5" (at 39.37 147.32 0)
    (effects (font (size 1.524 1.524)) (justify left bottom))
    (uuid fc153f76-4971-47fe-9c36-88d5ca4ab507)
  )
  (label "VOUT4" (at 85.09 72.39 180)
    (effects (font (size 1.524 1.524)) (justify right bottom))
    (uuid fd52c1ac-e295-4f41-943d-ac9b91f9f1bf)
  )

  (hierarchical_label "VOUT[0..11]" (shape input) (at 34.29 88.9 180)
    (effects (font (size 1.524 1.524)) (justify right))
    (uuid 22127bf3-28e1-4f2a-9132-0b2244d2149e)
  )
  (hierarchical_label "HV_OUT_RTN[0..9]" (shape input) (at 34.29 129.54 180)
    (effects (font (size 1.524 1.524)) (justify right))
    (uuid d0f11060-bc65-49c7-b1f8-1ffca12c5c16)
  )
  (hierarchical_label "HV_OUT[0..9]" (shape input) (at 34.29 165.1 180)
    (effects (font (size 1.524 1.524)) (justify right))
    (uuid dd07efd4-24c4-483d-a118-ed58a9223c8c)
  )
  (hierarchical_label "VOUT_RTN[0..11]" (shape input) (at 34.29 58.42 180)
    (effects (font (size 1.524 1.524)) (justify right))
    (uuid e61e3b10-16bb-45fa-9a42-277efd2ec104)
  )

  (symbol (lib_id "Connector_Generic:Conn_02x02_Odd_Even") (at 90.17 26.67 0) (unit 1)
    (in_bom yes) (on_board yes)
    (uuid 00000000-0000-0000-0000-00005d057286)
    (property "Reference" "J2101" (id 0) (at 91.44 21.1582 0))
    (property "Value" "Conn_02x02_Odd_Even" (id 1) (at 91.44 23.4696 0))
    (property "Footprint" "Connector_PinHeader_2.54mm:PinHeader_2x02_P2.54mm_Vertical_SMD" (id 2) (at 90.17 26.67 0)
      (effects (font (size 1.27 1.27)) hide)
    )
    (property "Datasheet" "~" (id 3) (at 90.17 26.67 0)
      (effects (font (size 1.27 1.27)) hide)
    )
    (property "MfrPart" "15910040" (id 4) (at 90.17 26.67 0)
      (effects (font (size 1.27 1.27)) hide)
    )
    (pin "1" (uuid 7605744d-9eb4-4e57-8dc8-fc25c365854a))
    (pin "2" (uuid 63549222-bbf8-4425-9bb1-ba72d0cf0655))
    (pin "3" (uuid f6b651be-a6bf-4600-9912-b3168ef88a43))
    (pin "4" (uuid 5629d331-b01e-476b-8022-90f13c6b55e1))
  )

  (symbol (lib_id "Connector_Generic:Conn_02x02_Odd_Even") (at 90.17 38.1 0) (unit 1)
    (in_bom yes) (on_board yes)
    (uuid 00000000-0000-0000-0000-00005d061789)
    (property "Reference" "J2102" (id 0) (at 91.44 32.5882 0))
    (property "Value" "Conn_02x02_Odd_Even" (id 1) (at 91.44 34.8996 0))
    (property "Footprint" "Connector_PinHeader_2.54mm:PinHeader_2x02_P2.54mm_Vertical_SMD" (id 2) (at 90.17 38.1 0)
      (effects (font (size 1.27 1.27)) hide)
    )
    (property "Datasheet" "~" (id 3) (at 90.17 38.1 0)
      (effects (font (size 1.27 1.27)) hide)
    )
    (pin "1" (uuid 08878d56-7ce2-4823-bd08-496599f3ff0c))
    (pin "2" (uuid c8e5ba63-4015-4eef-9939-1c3752ba4fad))
    (pin "3" (uuid 866193a7-0208-4bb2-a74a-0cf250681f6e))
    (pin "4" (uuid 12e3194d-c140-4d2f-8b52-4c2b40f6e5ef))
  )

  (symbol (lib_id "Connector_Generic:Conn_02x02_Odd_Even") (at 90.17 49.53 0) (unit 1)
    (in_bom yes) (on_board yes)
    (uuid 00000000-0000-0000-0000-00005d06b399)
    (property "Reference" "J2103" (id 0) (at 91.44 44.0182 0))
    (property "Value" "Conn_02x02_Odd_Even" (id 1) (at 91.44 46.3296 0))
    (property "Footprint" "Connector_PinHeader_2.54mm:PinHeader_2x02_P2.54mm_Vertical_SMD" (id 2) (at 90.17 49.53 0)
      (effects (font (size 1.27 1.27)) hide)
    )
    (property "Datasheet" "~" (id 3) (at 90.17 49.53 0)
      (effects (font (size 1.27 1.27)) hide)
    )
    (pin "1" (uuid 68eaa07e-d860-498f-b202-f97d53559394))
    (pin "2" (uuid 07abd4bf-d05a-49a6-9132-0c53ffebe591))
    (pin "3" (uuid c1811cd5-e3c1-49de-9264-01dae832be17))
    (pin "4" (uuid 272bee26-b371-410b-9440-24fdf3bf0f07))
  )

  (symbol (lib_id "Connector_Generic:Conn_02x02_Odd_Even") (at 90.17 60.96 0) (unit 1)
    (in_bom yes) (on_board yes)
    (uuid 00000000-0000-0000-0000-00005d075147)
    (property "Reference" "J2104" (id 0) (at 91.44 55.4482 0))
    (property "Value" "Conn_02x02_Odd_Even" (id 1) (at 91.44 57.7596 0))
    (property "Footprint" "Connector_PinHeader_2.54mm:PinHeader_2x02_P2.54mm_Vertical_SMD" (id 2) (at 90.17 60.96 0)
      (effects (font (size 1.27 1.27)) hide)
    )
    (property "Datasheet" "~" (id 3) (at 90.17 60.96 0)
      (effects (font (size 1.27 1.27)) hide)
    )
    (pin "1" (uuid 01ea8fbc-93c2-4b49-8600-416f1218d3ba))
    (pin "2" (uuid 10f5eea7-1a84-4dd1-b00f-fea975d0d3e0))
    (pin "3" (uuid 70b2bd67-fec1-4223-a384-0b83df4c8490))
    (pin "4" (uuid 574d5065-f79d-4379-ba29-a6ba00d9e137))
  )

  (symbol (lib_id "Connector_Generic:Conn_02x02_Odd_Even") (at 90.17 72.39 0) (unit 1)
    (in_bom yes) (on_board yes)
    (uuid 00000000-0000-0000-0000-00005d07f2f6)
    (property "Reference" "J2105" (id 0) (at 91.44 66.8782 0))
    (property "Value" "Conn_02x02_Odd_Even" (id 1) (at 91.44 69.1896 0))
    (property "Footprint" "Connector_PinHeader_2.54mm:PinHeader_2x02_P2.54mm_Vertical_SMD" (id 2) (at 90.17 72.39 0)
      (effects (font (size 1.27 1.27)) hide)
    )
    (property "Datasheet" "~" (id 3) (at 90.17 72.39 0)
      (effects (font (size 1.27 1.27)) hide)
    )
    (pin "1" (uuid d4f0930c-5001-4569-978c-5f88080cc088))
    (pin "2" (uuid 3be13e5e-c69a-43a0-a45e-211b47ba5719))
    (pin "3" (uuid 3e6d2843-714c-4d27-831a-a93b48ca1d85))
    (pin "4" (uuid 68285742-a1f1-4cf2-b57f-092eb32f5dc1))
  )

  (symbol (lib_id "Connector_Generic:Conn_02x02_Odd_Even") (at 90.17 83.82 0) (unit 1)
    (in_bom yes) (on_board yes)
    (uuid 00000000-0000-0000-0000-00005d07f302)
    (property "Reference" "J2106" (id 0) (at 91.44 78.3082 0))
    (property "Value" "Conn_02x02_Odd_Even" (id 1) (at 91.44 80.6196 0))
    (property "Footprint" "Connector_PinHeader_2.54mm:PinHeader_2x02_P2.54mm_Vertical_SMD" (id 2) (at 90.17 83.82 0)
      (effects (font (size 1.27 1.27)) hide)
    )
    (property "Datasheet" "~" (id 3) (at 90.17 83.82 0)
      (effects (font (size 1.27 1.27)) hide)
    )
    (pin "1" (uuid 1a045feb-92ab-4449-b4bf-1bd58ab16fe2))
    (pin "2" (uuid e870e7b8-b81b-461b-98fb-8a52403fd74c))
    (pin "3" (uuid 5931c1c5-3fa1-449b-8962-93bfd6193213))
    (pin "4" (uuid e34e2184-f4a0-4f3c-bf9b-ff119f0c1f39))
  )

  (symbol (lib_id "Connector_Generic:Conn_02x02_Odd_Even") (at 129.54 26.67 0) (unit 1)
    (in_bom yes) (on_board yes)
    (uuid 00000000-0000-0000-0000-00005d085c2b)
    (property "Reference" "J2108" (id 0) (at 130.81 21.1582 0))
    (property "Value" "Conn_02x02_Odd_Even" (id 1) (at 130.81 23.4696 0))
    (property "Footprint" "Connector_PinHeader_2.54mm:PinHeader_2x02_P2.54mm_Vertical_SMD" (id 2) (at 129.54 26.67 0)
      (effects (font (size 1.27 1.27)) hide)
    )
    (property "Datasheet" "~" (id 3) (at 129.54 26.67 0)
      (effects (font (size 1.27 1.27)) hide)
    )
    (pin "1" (uuid 73b7da4d-5c74-47c7-84fc-a398710762f6))
    (pin "2" (uuid dd5b78c7-80ce-4af0-98d9-859ee4de8808))
    (pin "3" (uuid 455db737-1417-4ca7-b99d-4d4225554688))
    (pin "4" (uuid 89c2d0f0-16a3-410b-b95f-5b1027131dd5))
  )

  (symbol (lib_id "Connector_Generic:Conn_02x02_Odd_Even") (at 129.54 38.1 0) (unit 1)
    (in_bom yes) (on_board yes)
    (uuid 00000000-0000-0000-0000-00005d085c37)
    (property "Reference" "J2109" (id 0) (at 130.81 32.5882 0))
    (property "Value" "Conn_02x02_Odd_Even" (id 1) (at 130.81 34.8996 0))
    (property "Footprint" "Connector_PinHeader_2.54mm:PinHeader_2x02_P2.54mm_Vertical_SMD" (id 2) (at 129.54 38.1 0)
      (effects (font (size 1.27 1.27)) hide)
    )
    (property "Datasheet" "~" (id 3) (at 129.54 38.1 0)
      (effects (font (size 1.27 1.27)) hide)
    )
    (pin "1" (uuid db1a700d-a4a6-469e-a3e5-25b5f7589d68))
    (pin "2" (uuid 3b930678-19f7-4705-a1f5-8f3ec94f8367))
    (pin "3" (uuid 560c3dbb-ab57-471f-8d71-d3e427376a37))
    (pin "4" (uuid 0c2afe07-dccd-40e5-a061-799d926da4f0))
  )

  (symbol (lib_id "Connector_Generic:Conn_02x02_Odd_Even") (at 129.54 49.53 0) (unit 1)
    (in_bom yes) (on_board yes)
    (uuid 00000000-0000-0000-0000-00005d09df6c)
    (property "Reference" "J2110" (id 0) (at 130.81 44.0182 0))
    (property "Value" "Conn_02x02_Odd_Even" (id 1) (at 130.81 46.3296 0))
    (property "Footprint" "Connector_PinHeader_2.54mm:PinHeader_2x02_P2.54mm_Vertical_SMD" (id 2) (at 129.54 49.53 0)
      (effects (font (size 1.27 1.27)) hide)
    )
    (property "Datasheet" "~" (id 3) (at 129.54 49.53 0)
      (effects (font (size 1.27 1.27)) hide)
    )
    (pin "1" (uuid dcfff542-0117-46b8-97aa-77af5a6a5843))
    (pin "2" (uuid 7e61df15-ac24-462e-ad58-5b7db863fcdf))
    (pin "3" (uuid 0231238d-7961-4636-9f60-0723bbb7ff5c))
    (pin "4" (uuid 533ef5b9-ee4c-4b44-95a9-da85e8b6fee6))
  )

  (symbol (lib_id "Connector_Generic:Conn_02x02_Odd_Even") (at 129.54 60.96 0) (unit 1)
    (in_bom yes) (on_board yes)
    (uuid 00000000-0000-0000-0000-00005d09df78)
    (property "Reference" "J2111" (id 0) (at 130.81 55.4482 0))
    (property "Value" "Conn_02x02_Odd_Even" (id 1) (at 130.81 57.7596 0))
    (property "Footprint" "Connector_PinHeader_2.54mm:PinHeader_2x02_P2.54mm_Vertical_SMD" (id 2) (at 129.54 60.96 0)
      (effects (font (size 1.27 1.27)) hide)
    )
    (property "Datasheet" "~" (id 3) (at 129.54 60.96 0)
      (effects (font (size 1.27 1.27)) hide)
    )
    (pin "1" (uuid fefef940-e8ce-4229-bb42-ce3672df7dc6))
    (pin "2" (uuid 1fde5cfd-5af9-4594-b419-b9368f2a470c))
    (pin "3" (uuid 4680a7a9-0e89-4372-87b1-59581323340a))
    (pin "4" (uuid 583bf575-3f22-4eb6-8843-3cd64696bf23))
  )

  (symbol (lib_id "Connector_Generic:Conn_02x02_Odd_Even") (at 129.54 72.39 0) (unit 1)
    (in_bom yes) (on_board yes)
    (uuid 00000000-0000-0000-0000-00005d0b3da3)
    (property "Reference" "J2112" (id 0) (at 130.81 66.8782 0))
    (property "Value" "Conn_02x02_Odd_Even" (id 1) (at 130.81 69.1896 0))
    (property "Footprint" "Connector_PinHeader_2.54mm:PinHeader_2x02_P2.54mm_Vertical_SMD" (id 2) (at 129.54 72.39 0)
      (effects (font (size 1.27 1.27)) hide)
    )
    (property "Datasheet" "~" (id 3) (at 129.54 72.39 0)
      (effects (font (size 1.27 1.27)) hide)
    )
    (pin "1" (uuid e79e3d81-cc03-4bcd-ad70-44f73788986a))
    (pin "2" (uuid 9e15a114-d2d1-4afa-ab0c-f916dbae8503))
    (pin "3" (uuid 35923a30-33ca-4094-aae4-87593eed91ae))
    (pin "4" (uuid 479190fd-76d5-4b42-8c83-3d80782861ac))
  )

  (symbol (lib_id "Connector_Generic:Conn_02x02_Odd_Even") (at 129.54 83.82 0) (unit 1)
    (in_bom yes) (on_board yes)
    (uuid 00000000-0000-0000-0000-00005d0b3daf)
    (property "Reference" "J2113" (id 0) (at 130.81 78.3082 0))
    (property "Value" "Conn_02x02_Odd_Even" (id 1) (at 130.81 80.6196 0))
    (property "Footprint" "Connector_PinHeader_2.54mm:PinHeader_2x02_P2.54mm_Vertical_SMD" (id 2) (at 129.54 83.82 0)
      (effects (font (size 1.27 1.27)) hide)
    )
    (property "Datasheet" "~" (id 3) (at 129.54 83.82 0)
      (effects (font (size 1.27 1.27)) hide)
    )
    (pin "1" (uuid d09a5acb-acb1-4212-8c6c-786e25fbbf7a))
    (pin "2" (uuid b53ae1bd-469c-41aa-9ef8-d47ae93b85f3))
    (pin "3" (uuid 3a932ca9-4446-4ea1-9b9c-f083f5373b81))
    (pin "4" (uuid c56a46a4-884c-425e-b6c7-b58fd43af720))
  )

  (symbol (lib_id "Connector_Generic:Conn_02x10_Odd_Even") (at 92.71 109.22 0) (unit 1)
    (in_bom yes) (on_board yes)
    (uuid 00000000-0000-0000-0000-00005d27738a)
    (property "Reference" "J2107" (id 0) (at 93.98 93.5482 0))
    (property "Value" "Conn_02x10_Odd_Even" (id 1) (at 93.98 95.8596 0))
    (property "Footprint" "Connector_PinHeader_2.54mm:PinHeader_2x10_P2.54mm_Vertical_SMD" (id 2) (at 92.71 109.22 0)
      (effects (font (size 1.27 1.27)) hide)
    )
    (property "Datasheet" "~" (id 3) (at 92.71 109.22 0)
      (effects (font (size 1.27 1.27)) hide)
    )
    (property "MfrPart" "15912200" (id 4) (at 92.71 109.22 0)
      (effects (font (size 1.27 1.27)) hide)
    )
    (pin "1" (uuid 9fca5b71-a175-42a0-9d6f-e740d5aacdd1))
    (pin "10" (uuid f6526837-64bf-41b0-9d04-a6055e1a4859))
    (pin "11" (uuid 25400207-7ba2-4e1e-8d80-f6fe9bbe5b38))
    (pin "12" (uuid 55361948-c755-4cc9-82a1-a1b1012dab32))
    (pin "13" (uuid 0e22e248-660a-4c05-b751-23e868865868))
    (pin "14" (uuid a20617ce-8d76-40c9-82e0-7b118996043a))
    (pin "15" (uuid 29f43c6f-567e-4898-9d72-b21d4f687042))
    (pin "16" (uuid ae7e87a8-54dd-4b4a-b782-b9905d0d539c))
    (pin "17" (uuid 137819d2-580a-4e8d-baf4-ebb97c277c4f))
    (pin "18" (uuid fa1c7273-44e5-4ee2-8dfd-7bb6962cbae4))
    (pin "19" (uuid fd33cd8a-022b-4cd1-b6e2-144a02ffeb84))
    (pin "2" (uuid 51a4f6cf-2028-479b-b4b9-8abb712030b6))
    (pin "20" (uuid 5c26d80c-a27b-40dd-8f64-0309c60fdc60))
    (pin "3" (uuid 7c5e1030-7343-417d-bcb1-9d141079cb88))
    (pin "4" (uuid 93b6ca40-183e-48f7-bf30-e347e0339bc6))
    (pin "5" (uuid 83ce96af-8c3f-4fe3-b3cd-a01004b8893c))
    (pin "6" (uuid 4af9e1aa-1ec7-47ef-b6dd-c35477373f45))
    (pin "7" (uuid 7661cc5c-f2d4-4343-bddd-fdcf2e8b42a1))
    (pin "8" (uuid 82e93324-78ad-4849-b13b-50104a97b94b))
    (pin "9" (uuid f16787b2-62c3-44b5-8eda-291262e96681))
  )

  (symbol (lib_id "power:GND") (at 53.34 59.69 0) (unit 1)
    (in_bom yes) (on_board yes)
    (uuid 52069693-046f-482f-850b-ccfe4268d33c)
    (property "Reference" "#PWR07" (id 0) (at 53.34 66.04 0)
      (effects (font (size 1.27 1.27)) hide)
    )
    (property "Value" "GND" (id 1) (at 53.34 63.5 0))
    (property "Footprint" "" (id 2) (at 53.34 59.69 0)
      (effects (font (size 1.27 1.27)) hide)
    )
    (property "Datasheet" "" (id 3) (at 53.34 59.69 0)
      (effects (font (size 1.27 1.27)) hide)
    )
    (pin "1" (uuid 239b9f71-6da3-42a8-b005-952b7ee26458))
  )
)
