(kicad_sch (version 20211123) (generator eeschema)

  (uuid 875d8101-02ec-4109-9cb3-dc03033ea564)

  (paper "A4")

  (title_block
    (title "Powerboard v3 Massive Active Tester Board")
    (date "2021-03-16")
    (company "Lawrence Berkeley National Laboratory")
    (comment 1 "Karol Krizka")
  )

  (lib_symbols
    (symbol "Connector_Generic:Conn_02x06_Odd_Even" (pin_names (offset 1.016) hide) (in_bom yes) (on_board yes)
      (property "Reference" "J" (id 0) (at 1.27 7.62 0)
        (effects (font (size 1.27 1.27)))
      )
      (property "Value" "Conn_02x06_Odd_Even" (id 1) (at 1.27 -10.16 0)
        (effects (font (size 1.27 1.27)))
      )
      (property "Footprint" "" (id 2) (at 0 0 0)
        (effects (font (size 1.27 1.27)) hide)
      )
      (property "Datasheet" "~" (id 3) (at 0 0 0)
        (effects (font (size 1.27 1.27)) hide)
      )
      (property "ki_keywords" "connector" (id 4) (at 0 0 0)
        (effects (font (size 1.27 1.27)) hide)
      )
      (property "ki_description" "Generic connector, double row, 02x06, odd/even pin numbering scheme (row 1 odd numbers, row 2 even numbers), script generated (kicad-library-utils/schlib/autogen/connector/)" (id 5) (at 0 0 0)
        (effects (font (size 1.27 1.27)) hide)
      )
      (property "ki_fp_filters" "Connector*:*_2x??_*" (id 6) (at 0 0 0)
        (effects (font (size 1.27 1.27)) hide)
      )
      (symbol "Conn_02x06_Odd_Even_1_1"
        (rectangle (start -1.27 -7.493) (end 0 -7.747)
          (stroke (width 0.1524) (type default) (color 0 0 0 0))
          (fill (type none))
        )
        (rectangle (start -1.27 -4.953) (end 0 -5.207)
          (stroke (width 0.1524) (type default) (color 0 0 0 0))
          (fill (type none))
        )
        (rectangle (start -1.27 -2.413) (end 0 -2.667)
          (stroke (width 0.1524) (type default) (color 0 0 0 0))
          (fill (type none))
        )
        (rectangle (start -1.27 0.127) (end 0 -0.127)
          (stroke (width 0.1524) (type default) (color 0 0 0 0))
          (fill (type none))
        )
        (rectangle (start -1.27 2.667) (end 0 2.413)
          (stroke (width 0.1524) (type default) (color 0 0 0 0))
          (fill (type none))
        )
        (rectangle (start -1.27 5.207) (end 0 4.953)
          (stroke (width 0.1524) (type default) (color 0 0 0 0))
          (fill (type none))
        )
        (rectangle (start -1.27 6.35) (end 3.81 -8.89)
          (stroke (width 0.254) (type default) (color 0 0 0 0))
          (fill (type background))
        )
        (rectangle (start 3.81 -7.493) (end 2.54 -7.747)
          (stroke (width 0.1524) (type default) (color 0 0 0 0))
          (fill (type none))
        )
        (rectangle (start 3.81 -4.953) (end 2.54 -5.207)
          (stroke (width 0.1524) (type default) (color 0 0 0 0))
          (fill (type none))
        )
        (rectangle (start 3.81 -2.413) (end 2.54 -2.667)
          (stroke (width 0.1524) (type default) (color 0 0 0 0))
          (fill (type none))
        )
        (rectangle (start 3.81 0.127) (end 2.54 -0.127)
          (stroke (width 0.1524) (type default) (color 0 0 0 0))
          (fill (type none))
        )
        (rectangle (start 3.81 2.667) (end 2.54 2.413)
          (stroke (width 0.1524) (type default) (color 0 0 0 0))
          (fill (type none))
        )
        (rectangle (start 3.81 5.207) (end 2.54 4.953)
          (stroke (width 0.1524) (type default) (color 0 0 0 0))
          (fill (type none))
        )
        (pin passive line (at -5.08 5.08 0) (length 3.81)
          (name "Pin_1" (effects (font (size 1.27 1.27))))
          (number "1" (effects (font (size 1.27 1.27))))
        )
        (pin passive line (at 7.62 -5.08 180) (length 3.81)
          (name "Pin_10" (effects (font (size 1.27 1.27))))
          (number "10" (effects (font (size 1.27 1.27))))
        )
        (pin passive line (at -5.08 -7.62 0) (length 3.81)
          (name "Pin_11" (effects (font (size 1.27 1.27))))
          (number "11" (effects (font (size 1.27 1.27))))
        )
        (pin passive line (at 7.62 -7.62 180) (length 3.81)
          (name "Pin_12" (effects (font (size 1.27 1.27))))
          (number "12" (effects (font (size 1.27 1.27))))
        )
        (pin passive line (at 7.62 5.08 180) (length 3.81)
          (name "Pin_2" (effects (font (size 1.27 1.27))))
          (number "2" (effects (font (size 1.27 1.27))))
        )
        (pin passive line (at -5.08 2.54 0) (length 3.81)
          (name "Pin_3" (effects (font (size 1.27 1.27))))
          (number "3" (effects (font (size 1.27 1.27))))
        )
        (pin passive line (at 7.62 2.54 180) (length 3.81)
          (name "Pin_4" (effects (font (size 1.27 1.27))))
          (number "4" (effects (font (size 1.27 1.27))))
        )
        (pin passive line (at -5.08 0 0) (length 3.81)
          (name "Pin_5" (effects (font (size 1.27 1.27))))
          (number "5" (effects (font (size 1.27 1.27))))
        )
        (pin passive line (at 7.62 0 180) (length 3.81)
          (name "Pin_6" (effects (font (size 1.27 1.27))))
          (number "6" (effects (font (size 1.27 1.27))))
        )
        (pin passive line (at -5.08 -2.54 0) (length 3.81)
          (name "Pin_7" (effects (font (size 1.27 1.27))))
          (number "7" (effects (font (size 1.27 1.27))))
        )
        (pin passive line (at 7.62 -2.54 180) (length 3.81)
          (name "Pin_8" (effects (font (size 1.27 1.27))))
          (number "8" (effects (font (size 1.27 1.27))))
        )
        (pin passive line (at -5.08 -5.08 0) (length 3.81)
          (name "Pin_9" (effects (font (size 1.27 1.27))))
          (number "9" (effects (font (size 1.27 1.27))))
        )
      )
    )
    (symbol "power:GND" (power) (pin_names (offset 0)) (in_bom yes) (on_board yes)
      (property "Reference" "#PWR" (id 0) (at 0 -6.35 0)
        (effects (font (size 1.27 1.27)) hide)
      )
      (property "Value" "GND" (id 1) (at 0 -3.81 0)
        (effects (font (size 1.27 1.27)))
      )
      (property "Footprint" "" (id 2) (at 0 0 0)
        (effects (font (size 1.27 1.27)) hide)
      )
      (property "Datasheet" "" (id 3) (at 0 0 0)
        (effects (font (size 1.27 1.27)) hide)
      )
      (property "ki_keywords" "power-flag" (id 4) (at 0 0 0)
        (effects (font (size 1.27 1.27)) hide)
      )
      (property "ki_description" "Power symbol creates a global label with name \"GND\" , ground" (id 5) (at 0 0 0)
        (effects (font (size 1.27 1.27)) hide)
      )
      (symbol "GND_0_1"
        (polyline
          (pts
            (xy 0 0)
            (xy 0 -1.27)
            (xy 1.27 -1.27)
            (xy 0 -2.54)
            (xy -1.27 -1.27)
            (xy 0 -1.27)
          )
          (stroke (width 0) (type default) (color 0 0 0 0))
          (fill (type none))
        )
      )
      (symbol "GND_1_1"
        (pin power_in line (at 0 0 270) (length 0) hide
          (name "GND" (effects (font (size 1.27 1.27))))
          (number "1" (effects (font (size 1.27 1.27))))
        )
      )
    )
  )

  (junction (at 193.04 22.86) (diameter 0) (color 0 0 0 0)
    (uuid 19d84518-aa56-4a89-beed-78ce8456d9cf)
  )
  (junction (at 96.52 64.77) (diameter 0) (color 0 0 0 0)
    (uuid 3739076a-baeb-4668-95d4-28b7b5f3ab71)
  )
  (junction (at 146.05 64.77) (diameter 0) (color 0 0 0 0)
    (uuid a4724856-e209-425c-bddb-8aaca3cddaab)
  )
  (junction (at 46.99 64.77) (diameter 0) (color 0 0 0 0)
    (uuid bbdd926d-7d86-45cf-ae08-f1f150d09cfe)
  )
  (junction (at 195.58 64.77) (diameter 0) (color 0 0 0 0)
    (uuid e921d58d-34eb-4712-9ae1-ea79177cfaf4)
  )

  (wire (pts (xy 195.58 63.5) (xy 198.755 63.5))
    (stroke (width 0) (type default) (color 0 0 0 0))
    (uuid 28402017-1373-4e9f-83bc-1dd8451e4b54)
  )
  (wire (pts (xy 193.04 22.86) (xy 193.04 21.59))
    (stroke (width 0) (type default) (color 0 0 0 0))
    (uuid 2eb5c7ae-ece1-4fed-b4e9-592cfba8365c)
  )
  (wire (pts (xy 193.04 21.59) (xy 196.215 21.59))
    (stroke (width 0) (type default) (color 0 0 0 0))
    (uuid 3900a3b0-431b-4976-9497-7ceb8bad1232)
  )
  (wire (pts (xy 96.52 64.77) (xy 96.52 67.31))
    (stroke (width 0) (type default) (color 0 0 0 0))
    (uuid 39bba2de-58c8-476c-98e2-bfd08f6032b9)
  )
  (wire (pts (xy 46.99 63.5) (xy 50.165 63.5))
    (stroke (width 0) (type default) (color 0 0 0 0))
    (uuid 5b182f66-b0c8-4347-9c9e-3ee95097eabe)
  )
  (wire (pts (xy 96.52 63.5) (xy 96.52 64.77))
    (stroke (width 0) (type default) (color 0 0 0 0))
    (uuid 6cb9631d-f4f9-464d-ad18-d53fa23081fa)
  )
  (wire (pts (xy 96.52 63.5) (xy 99.695 63.5))
    (stroke (width 0) (type default) (color 0 0 0 0))
    (uuid 6eb8a12c-f7dd-45db-ac57-5cf35b00d623)
  )
  (wire (pts (xy 193.04 25.4) (xy 193.04 22.86))
    (stroke (width 0) (type default) (color 0 0 0 0))
    (uuid 802934f8-7c36-4345-a27f-3454fedf92f5)
  )
  (wire (pts (xy 146.05 63.5) (xy 149.225 63.5))
    (stroke (width 0) (type default) (color 0 0 0 0))
    (uuid a4e9d70b-0682-4de7-a82a-24ad7fb3af1b)
  )
  (wire (pts (xy 46.99 64.77) (xy 46.99 63.5))
    (stroke (width 0) (type default) (color 0 0 0 0))
    (uuid acdd6813-47a9-43b9-8c0d-c0787f18321e)
  )
  (wire (pts (xy 146.05 64.77) (xy 146.05 67.31))
    (stroke (width 0) (type default) (color 0 0 0 0))
    (uuid c91abc1a-9225-47cc-9d9c-5d96a0e6c5bb)
  )
  (wire (pts (xy 195.58 64.77) (xy 195.58 67.31))
    (stroke (width 0) (type default) (color 0 0 0 0))
    (uuid d7453f44-321c-4050-b18b-a12237a10415)
  )
  (wire (pts (xy 146.05 63.5) (xy 146.05 64.77))
    (stroke (width 0) (type default) (color 0 0 0 0))
    (uuid d932e413-55ae-457b-a959-bad83c84d724)
  )
  (wire (pts (xy 195.58 63.5) (xy 195.58 64.77))
    (stroke (width 0) (type default) (color 0 0 0 0))
    (uuid eba3e869-9c4e-40f7-aa3e-e2c1bcfc73f2)
  )
  (wire (pts (xy 46.99 64.77) (xy 46.99 67.31))
    (stroke (width 0) (type default) (color 0 0 0 0))
    (uuid fdf1b3e7-069e-4f76-9d87-caaeb7d55ad9)
  )

  (hierarchical_label "A4_SCL" (shape input) (at 182.88 67.31 180)
    (effects (font (size 1.524 1.524)) (justify right))
    (uuid 03ceb6fa-e744-4405-b1b0-49ed782742c2)
  )
  (hierarchical_label "A0_CMDin_P" (shape output) (at 180.34 27.94 180)
    (effects (font (size 1.524 1.524)) (justify right))
    (uuid 09518f18-8c5c-4629-8039-76c971a8c2f1)
  )
  (hierarchical_label "A2_CMDout_N" (shape output) (at 96.52 72.39 0)
    (effects (font (size 1.524 1.524)) (justify left))
    (uuid 0db1eaf5-5010-44fc-a4d5-224d3d02536a)
  )
  (hierarchical_label "A2_CMDout_P" (shape output) (at 83.82 72.39 180)
    (effects (font (size 1.524 1.524)) (justify right))
    (uuid 1a3b3ac1-1149-4af0-88a5-7f64e33c4898)
  )
  (hierarchical_label "A1_CMDout_P" (shape output) (at 34.29 72.39 180)
    (effects (font (size 1.524 1.524)) (justify right))
    (uuid 2687370f-49a5-4bc5-9d99-d875739be787)
  )
  (hierarchical_label "A4_CMDout_N" (shape output) (at 195.58 72.39 0)
    (effects (font (size 1.524 1.524)) (justify left))
    (uuid 29052f11-eb52-41b4-aa3f-c148433f61d5)
  )
  (hierarchical_label "A3_CMDout_P" (shape output) (at 133.35 72.39 180)
    (effects (font (size 1.524 1.524)) (justify right))
    (uuid 33f0ff87-5826-47b7-a189-ca3528f1f211)
  )
  (hierarchical_label "A2_SCL" (shape input) (at 83.82 67.31 180)
    (effects (font (size 1.524 1.524)) (justify right))
    (uuid 3cd62bef-586b-4354-a0d8-b45f0b86f8d4)
  )
  (hierarchical_label "A1_CMDin_N" (shape input) (at 46.99 69.85 0)
    (effects (font (size 1.524 1.524)) (justify left))
    (uuid 4035c6d5-0218-4683-a405-7b7b1fd841f8)
  )
  (hierarchical_label "A1_SDA" (shape bidirectional) (at 34.29 64.77 180)
    (effects (font (size 1.524 1.524)) (justify right))
    (uuid 463adae5-2b8d-4805-b9f3-b2a6f8105566)
  )
  (hierarchical_label "A2_CMDin_P" (shape input) (at 83.82 69.85 180)
    (effects (font (size 1.524 1.524)) (justify right))
    (uuid 473c668c-5f7b-4cf5-8012-906483dc5dc1)
  )
  (hierarchical_label "A0_SCLK" (shape output) (at 180.34 33.02 180)
    (effects (font (size 1.524 1.524)) (justify right))
    (uuid 495b9f3e-72d4-4443-8d1b-2b95612acb36)
  )
  (hierarchical_label "A2_DIN" (shape input) (at 83.82 77.47 180)
    (effects (font (size 1.524 1.524)) (justify right))
    (uuid 4a8f9efa-0cc8-49f1-a296-c0ae29b30fa4)
  )
  (hierarchical_label "A0_SCL" (shape output) (at 180.34 25.4 180)
    (effects (font (size 1.524 1.524)) (justify right))
    (uuid 4b8be3ff-4f25-49f4-9eee-d26026895d38)
  )
  (hierarchical_label "~{A0_CS}" (shape output) (at 193.04 33.02 0)
    (effects (font (size 1.524 1.524)) (justify left))
    (uuid 4c0cd657-4a0d-4409-9555-bb1ce90e34ed)
  )
  (hierarchical_label "A1_CMDout_N" (shape output) (at 46.99 72.39 0)
    (effects (font (size 1.524 1.524)) (justify left))
    (uuid 52039751-7c90-4bad-b446-00e9c6094980)
  )
  (hierarchical_label "A3_CMDin_N" (shape input) (at 146.05 69.85 0)
    (effects (font (size 1.524 1.524)) (justify left))
    (uuid 520b6a75-0c73-42ff-a977-3233797b07fd)
  )
  (hierarchical_label "A3_CMDout_N" (shape output) (at 146.05 72.39 0)
    (effects (font (size 1.524 1.524)) (justify left))
    (uuid 62a0b005-d543-412f-93b9-72a8d1c3610c)
  )
  (hierarchical_label "A4_SDA" (shape bidirectional) (at 182.88 64.77 180)
    (effects (font (size 1.524 1.524)) (justify right))
    (uuid 6360866e-61e1-4dc6-a707-8374bcb5b436)
  )
  (hierarchical_label "A0_CMDout_N" (shape input) (at 193.04 30.48 0)
    (effects (font (size 1.524 1.524)) (justify left))
    (uuid 6cfdc61e-9238-4bf1-8adc-0aa2afd5e23c)
  )
  (hierarchical_label "A3_SCL" (shape input) (at 133.35 67.31 180)
    (effects (font (size 1.524 1.524)) (justify right))
    (uuid 6f0bf181-b7ac-48a2-905c-c67feeb7d571)
  )
  (hierarchical_label "A1_DOUT" (shape output) (at 46.99 77.47 0)
    (effects (font (size 1.524 1.524)) (justify left))
    (uuid 7442195e-b309-4104-87d4-096c8b6e0583)
  )
  (hierarchical_label "A2_SCLK" (shape input) (at 83.82 74.93 180)
    (effects (font (size 1.524 1.524)) (justify right))
    (uuid 7670d6a4-669e-4a95-8178-29fc8bb78054)
  )
  (hierarchical_label "A1_SCL" (shape input) (at 34.29 67.31 180)
    (effects (font (size 1.524 1.524)) (justify right))
    (uuid 7856fd3e-7cb2-4617-9f08-e93b38475b94)
  )
  (hierarchical_label "A4_CMDin_N" (shape input) (at 195.58 69.85 0)
    (effects (font (size 1.524 1.524)) (justify left))
    (uuid 808953e6-4649-45c8-ae8d-0fce582466f0)
  )
  (hierarchical_label "A4_DIN" (shape input) (at 182.88 77.47 180)
    (effects (font (size 1.524 1.524)) (justify right))
    (uuid 8bcfde59-b85c-43bb-9e8e-e5706baedd16)
  )
  (hierarchical_label "A0_CMDin_N" (shape output) (at 193.04 27.94 0)
    (effects (font (size 1.524 1.524)) (justify left))
    (uuid 8f3eb88d-9ce9-4013-ad67-32b8876a01b4)
  )
  (hierarchical_label "~{A2_CS}" (shape input) (at 96.52 74.93 0)
    (effects (font (size 1.524 1.524)) (justify left))
    (uuid 9acfcfc7-989c-4acc-abb2-e00b92310a55)
  )
  (hierarchical_label "A1_CMDin_P" (shape input) (at 34.29 69.85 180)
    (effects (font (size 1.524 1.524)) (justify right))
    (uuid 9c352ce5-8dcd-4676-8f85-0d97597fd098)
  )
  (hierarchical_label "A3_CMDin_P" (shape input) (at 133.35 69.85 180)
    (effects (font (size 1.524 1.524)) (justify right))
    (uuid 9cda867b-4eb8-4af0-9da1-fb3c11f6d1f3)
  )
  (hierarchical_label "A3_SCLK" (shape input) (at 133.35 74.93 180)
    (effects (font (size 1.524 1.524)) (justify right))
    (uuid 9d5e7df5-7472-4dc8-a9fc-73987a422b16)
  )
  (hierarchical_label "~{A4_CS}" (shape input) (at 195.58 74.93 0)
    (effects (font (size 1.524 1.524)) (justify left))
    (uuid 9ddd0afe-6b4f-4d87-8112-c5b7d07ad5bc)
  )
  (hierarchical_label "A4_CMDin_P" (shape input) (at 182.88 69.85 180)
    (effects (font (size 1.524 1.524)) (justify right))
    (uuid a2e657e9-8fbb-46fe-96c9-f7babcd4a7d6)
  )
  (hierarchical_label "A0_DIN" (shape output) (at 180.34 35.56 180)
    (effects (font (size 1.524 1.524)) (justify right))
    (uuid a498800d-c7f2-4a17-96da-2f9a8f6ad361)
  )
  (hierarchical_label "~{A3_CS}" (shape input) (at 146.05 74.93 0)
    (effects (font (size 1.524 1.524)) (justify left))
    (uuid a5c104d3-89c9-4abc-a64e-c0025d27215c)
  )
  (hierarchical_label "A2_SDA" (shape bidirectional) (at 83.82 64.77 180)
    (effects (font (size 1.524 1.524)) (justify right))
    (uuid ac99f243-aa8f-4496-82dd-cd58dae79415)
  )
  (hierarchical_label "A3_DOUT" (shape output) (at 146.05 77.47 0)
    (effects (font (size 1.524 1.524)) (justify left))
    (uuid b61e78c1-958a-4345-a047-f6894dcd028d)
  )
  (hierarchical_label "A3_SDA" (shape bidirectional) (at 133.35 64.77 180)
    (effects (font (size 1.524 1.524)) (justify right))
    (uuid b7b0924b-a534-453f-b03b-3088a452d2d5)
  )
  (hierarchical_label "A3_DIN" (shape input) (at 133.35 77.47 180)
    (effects (font (size 1.524 1.524)) (justify right))
    (uuid bb3adeee-1a92-483a-ace7-e1ef71d12c76)
  )
  (hierarchical_label "A4_SCLK" (shape input) (at 182.88 74.93 180)
    (effects (font (size 1.524 1.524)) (justify right))
    (uuid ca4b2a77-5a71-40ab-b178-0276e8dd2714)
  )
  (hierarchical_label "A2_DOUT" (shape output) (at 96.52 77.47 0)
    (effects (font (size 1.524 1.524)) (justify left))
    (uuid d41115c9-7c02-4897-9fd1-4a591b7b2833)
  )
  (hierarchical_label "A4_CMDout_P" (shape output) (at 182.88 72.39 180)
    (effects (font (size 1.524 1.524)) (justify right))
    (uuid d5d0ab72-d292-46f1-9956-293c20275329)
  )
  (hierarchical_label "A1_DIN" (shape input) (at 34.29 77.47 180)
    (effects (font (size 1.524 1.524)) (justify right))
    (uuid d7c96d03-c33d-42a4-b9f5-33ebc94d6064)
  )
  (hierarchical_label "A0_CMDout_P" (shape input) (at 180.34 30.48 180)
    (effects (font (size 1.524 1.524)) (justify right))
    (uuid dc907d3a-ade0-4fb2-bac6-3f031f194fac)
  )
  (hierarchical_label "A0_SDA" (shape bidirectional) (at 180.34 22.86 180)
    (effects (font (size 1.524 1.524)) (justify right))
    (uuid dfdae403-bb08-48d4-b042-b5f0fa182e90)
  )
  (hierarchical_label "A0_DOUT" (shape input) (at 193.04 35.56 0)
    (effects (font (size 1.524 1.524)) (justify left))
    (uuid e8863b0a-bdcc-4c2a-b3e9-c6dcfc091d1e)
  )
  (hierarchical_label "A2_CMDin_N" (shape input) (at 96.52 69.85 0)
    (effects (font (size 1.524 1.524)) (justify left))
    (uuid ebca813b-d03c-4d15-a46c-a958b096aefa)
  )
  (hierarchical_label "A4_DOUT" (shape output) (at 195.58 77.47 0)
    (effects (font (size 1.524 1.524)) (justify left))
    (uuid ed045454-339e-41b3-adf7-74925ba99853)
  )
  (hierarchical_label "A1_SCLK" (shape input) (at 34.29 74.93 180)
    (effects (font (size 1.524 1.524)) (justify right))
    (uuid eefbb01a-1017-402d-94d8-5e1519140627)
  )
  (hierarchical_label "~{A1_CS}" (shape input) (at 46.99 74.93 0)
    (effects (font (size 1.524 1.524)) (justify left))
    (uuid f2b36193-b632-424c-b534-9f2f874f65c5)
  )

  (symbol (lib_id "Connector_Generic:Conn_02x06_Odd_Even") (at 39.37 69.85 0) (unit 1)
    (in_bom yes) (on_board yes)
    (uuid 00000000-0000-0000-0000-00005d4c52be)
    (property "Reference" "J2501" (id 0) (at 40.64 59.2582 0))
    (property "Value" "Conn_02x06_Odd_Even" (id 1) (at 40.64 61.5696 0))
    (property "Footprint" "Connector_PinHeader_2.54mm:PinHeader_2x06_P2.54mm_Horizontal" (id 2) (at 39.37 69.85 0)
      (effects (font (size 1.27 1.27)) hide)
    )
    (property "Datasheet" "~" (id 3) (at 39.37 69.85 0)
      (effects (font (size 1.27 1.27)) hide)
    )
    (property "MfrPart" "78207-112HLF" (id 4) (at 39.37 69.85 0)
      (effects (font (size 1.27 1.27)) hide)
    )
    (pin "1" (uuid 8588d019-3df7-4e6c-99b4-c25e560e198f))
    (pin "10" (uuid 5ff816d2-14fe-422a-aec9-0030719e3ff6))
    (pin "11" (uuid 732cf7f1-1497-49fb-9df9-283f13bc9404))
    (pin "12" (uuid 8afe3ccb-06c4-449f-a360-cd097848bd4d))
    (pin "2" (uuid 26551ff6-d2b6-499a-9b1f-76cc044dd976))
    (pin "3" (uuid 4c8451c7-cce3-4abc-89c4-dc2ac5202733))
    (pin "4" (uuid ad58f393-9ae7-4f86-afbb-9666afbf3eb9))
    (pin "5" (uuid 12ab9aa0-7650-4363-b78e-49387aff44ac))
    (pin "6" (uuid 29bdf366-29cb-4aba-a242-14bed940e319))
    (pin "7" (uuid 05cb53dc-04d8-46bb-851d-dc8d2852fc88))
    (pin "8" (uuid d6f1af51-0e95-41dd-a8b8-9ae612c65faa))
    (pin "9" (uuid 7fc5bab0-7e23-48c7-8069-9d335e1f094f))
  )

  (symbol (lib_id "power:GND") (at 50.165 63.5 0) (unit 1)
    (in_bom yes) (on_board yes)
    (uuid 00000000-0000-0000-0000-00005d4cab4c)
    (property "Reference" "#PWR02501" (id 0) (at 50.165 69.85 0)
      (effects (font (size 1.27 1.27)) hide)
    )
    (property "Value" "GND" (id 1) (at 50.292 67.8942 0))
    (property "Footprint" "" (id 2) (at 50.165 63.5 0)
      (effects (font (size 1.27 1.27)) hide)
    )
    (property "Datasheet" "" (id 3) (at 50.165 63.5 0)
      (effects (font (size 1.27 1.27)) hide)
    )
    (pin "1" (uuid ca4119e7-0ccd-4468-af69-690a2633ead6))
  )

  (symbol (lib_id "Connector_Generic:Conn_02x06_Odd_Even") (at 88.9 69.85 0) (unit 1)
    (in_bom yes) (on_board yes)
    (uuid 00000000-0000-0000-0000-00005d4cd182)
    (property "Reference" "J2502" (id 0) (at 90.17 59.2582 0))
    (property "Value" "Conn_02x06_Odd_Even" (id 1) (at 90.17 61.5696 0))
    (property "Footprint" "Connector_PinHeader_2.54mm:PinHeader_2x06_P2.54mm_Horizontal" (id 2) (at 88.9 69.85 0)
      (effects (font (size 1.27 1.27)) hide)
    )
    (property "Datasheet" "~" (id 3) (at 88.9 69.85 0)
      (effects (font (size 1.27 1.27)) hide)
    )
    (property "MfrPart" "78207-112HLF" (id 4) (at 88.9 69.85 0)
      (effects (font (size 1.27 1.27)) hide)
    )
    (pin "1" (uuid ca8f82f2-88a8-426c-8f24-a25219306dd1))
    (pin "10" (uuid 17282933-a81a-4b61-8ca9-db5ca090bd86))
    (pin "11" (uuid cadab07e-00a4-4e4a-b247-861666897cd6))
    (pin "12" (uuid 2189d1be-0ed2-4565-afed-3c37f89f419d))
    (pin "2" (uuid a6c2c227-1aac-42d4-a023-22a436a5d746))
    (pin "3" (uuid 2fa59316-d176-4553-aee4-a43b611b0503))
    (pin "4" (uuid 11f41cfe-3fc1-4e7b-8256-ae3816fc9398))
    (pin "5" (uuid b8cfb57c-c563-47fd-969c-7b1c7851ffe7))
    (pin "6" (uuid 74d6a48f-dc35-488c-8425-9e6684eb439c))
    (pin "7" (uuid 6dd26538-ec73-4f8d-827f-8d03adf27aa0))
    (pin "8" (uuid 1dec311a-aa54-4a68-a19e-4a94a75ae4be))
    (pin "9" (uuid 449aa4fd-01df-4352-b690-80e85a4798b8))
  )

  (symbol (lib_id "Connector_Generic:Conn_02x06_Odd_Even") (at 138.43 69.85 0) (unit 1)
    (in_bom yes) (on_board yes)
    (uuid 00000000-0000-0000-0000-00005d4cea9b)
    (property "Reference" "J2503" (id 0) (at 139.7 59.2582 0))
    (property "Value" "Conn_02x06_Odd_Even" (id 1) (at 139.7 61.5696 0))
    (property "Footprint" "Connector_PinHeader_2.54mm:PinHeader_2x06_P2.54mm_Horizontal" (id 2) (at 138.43 69.85 0)
      (effects (font (size 1.27 1.27)) hide)
    )
    (property "Datasheet" "~" (id 3) (at 138.43 69.85 0)
      (effects (font (size 1.27 1.27)) hide)
    )
    (property "MfrPart" "78207-112HLF" (id 4) (at 138.43 69.85 0)
      (effects (font (size 1.27 1.27)) hide)
    )
    (pin "1" (uuid 6d6f16d7-83c3-4f5b-9c6b-36b4f2547ac3))
    (pin "10" (uuid 41a59429-2177-4b5f-8407-7863a7769524))
    (pin "11" (uuid 235e4d67-2dd1-410a-b574-ac86a809b649))
    (pin "12" (uuid 913da19f-7e83-4f3b-917c-c8dbaa1a298c))
    (pin "2" (uuid 7467c1d0-9884-44fd-b3c8-8058a7f5dea8))
    (pin "3" (uuid 4e867f97-33c8-40b0-af28-0364779efab7))
    (pin "4" (uuid 8af03b39-5367-480c-ab0d-2e7bdd97e0d9))
    (pin "5" (uuid 947b0045-4aa7-4eaf-860c-7fcd76735eac))
    (pin "6" (uuid 14277f09-5828-4bef-a55b-0a577f13ec6b))
    (pin "7" (uuid 8a1bbd9a-5506-4623-92a7-d9a97859e652))
    (pin "8" (uuid 8649b4e0-5a75-4961-b6fa-5e6dbd464df9))
    (pin "9" (uuid 2f3995a8-36fe-445e-b829-2278d735ac8b))
  )

  (symbol (lib_id "Connector_Generic:Conn_02x06_Odd_Even") (at 187.96 69.85 0) (unit 1)
    (in_bom yes) (on_board yes)
    (uuid 00000000-0000-0000-0000-00005d4cfc1c)
    (property "Reference" "J2505" (id 0) (at 189.23 59.2582 0))
    (property "Value" "Conn_02x06_Odd_Even" (id 1) (at 189.23 61.5696 0))
    (property "Footprint" "Connector_PinHeader_2.54mm:PinHeader_2x06_P2.54mm_Horizontal" (id 2) (at 187.96 69.85 0)
      (effects (font (size 1.27 1.27)) hide)
    )
    (property "Datasheet" "~" (id 3) (at 187.96 69.85 0)
      (effects (font (size 1.27 1.27)) hide)
    )
    (property "MfrPart" "78207-112HLF" (id 4) (at 187.96 69.85 0)
      (effects (font (size 1.27 1.27)) hide)
    )
    (pin "1" (uuid d1d2ca14-a057-486d-b8ae-dcc5a5c5bab8))
    (pin "10" (uuid f3135e8c-47df-4d28-8958-6b5d38f6bcea))
    (pin "11" (uuid abb43a22-81de-4e59-b84e-51477c0e013e))
    (pin "12" (uuid 53103df5-ca6f-4b9c-8f11-99c5163e8f22))
    (pin "2" (uuid f0852334-0410-4a06-99ff-da7ea21a1167))
    (pin "3" (uuid e4b06f25-a555-4292-8afa-55279c4490d6))
    (pin "4" (uuid 6a04128f-f69c-4836-9633-e201dc9e36e6))
    (pin "5" (uuid f9ea3f1e-bbbe-48cd-9eca-cab2e35eed2a))
    (pin "6" (uuid 907076e9-2b06-490a-ad0a-fa7039cff072))
    (pin "7" (uuid 36765fce-2a29-47ff-8d82-3087f9d38e30))
    (pin "8" (uuid d5d7a58e-22b7-4f62-a223-b7de17d48897))
    (pin "9" (uuid 2ca99bdd-e55e-4a6b-9c92-ab35091cfa7d))
  )

  (symbol (lib_id "power:GND") (at 99.695 63.5 0) (unit 1)
    (in_bom yes) (on_board yes)
    (uuid 00000000-0000-0000-0000-00005d4d128c)
    (property "Reference" "#PWR02502" (id 0) (at 99.695 69.85 0)
      (effects (font (size 1.27 1.27)) hide)
    )
    (property "Value" "GND" (id 1) (at 99.822 67.8942 0))
    (property "Footprint" "" (id 2) (at 99.695 63.5 0)
      (effects (font (size 1.27 1.27)) hide)
    )
    (property "Datasheet" "" (id 3) (at 99.695 63.5 0)
      (effects (font (size 1.27 1.27)) hide)
    )
    (pin "1" (uuid 24fb8ab1-dba6-4a17-9e07-642a7d579224))
  )

  (symbol (lib_id "power:GND") (at 149.225 63.5 0) (unit 1)
    (in_bom yes) (on_board yes)
    (uuid 00000000-0000-0000-0000-00005d4d1a9e)
    (property "Reference" "#PWR02503" (id 0) (at 149.225 69.85 0)
      (effects (font (size 1.27 1.27)) hide)
    )
    (property "Value" "GND" (id 1) (at 149.352 67.8942 0))
    (property "Footprint" "" (id 2) (at 149.225 63.5 0)
      (effects (font (size 1.27 1.27)) hide)
    )
    (property "Datasheet" "" (id 3) (at 149.225 63.5 0)
      (effects (font (size 1.27 1.27)) hide)
    )
    (pin "1" (uuid d6cb5382-ff78-4735-8014-dd382f7019b0))
  )

  (symbol (lib_id "power:GND") (at 198.755 63.5 0) (unit 1)
    (in_bom yes) (on_board yes)
    (uuid 00000000-0000-0000-0000-00005d4d2804)
    (property "Reference" "#PWR02505" (id 0) (at 198.755 69.85 0)
      (effects (font (size 1.27 1.27)) hide)
    )
    (property "Value" "GND" (id 1) (at 198.882 67.8942 0))
    (property "Footprint" "" (id 2) (at 198.755 63.5 0)
      (effects (font (size 1.27 1.27)) hide)
    )
    (property "Datasheet" "" (id 3) (at 198.755 63.5 0)
      (effects (font (size 1.27 1.27)) hide)
    )
    (pin "1" (uuid 1e97f176-0046-4a4d-9806-d7c11ea2073d))
  )

  (symbol (lib_id "Connector_Generic:Conn_02x06_Odd_Even") (at 185.42 27.94 0) (unit 1)
    (in_bom yes) (on_board yes)
    (uuid 00000000-0000-0000-0000-00005d4d3e8c)
    (property "Reference" "J2504" (id 0) (at 186.69 17.3482 0))
    (property "Value" "Conn_02x06_Odd_Even" (id 1) (at 186.69 19.6596 0))
    (property "Footprint" "Connector_PinHeader_2.54mm:PinHeader_2x06_P2.54mm_Horizontal" (id 2) (at 185.42 27.94 0)
      (effects (font (size 1.27 1.27)) hide)
    )
    (property "Datasheet" "~" (id 3) (at 185.42 27.94 0)
      (effects (font (size 1.27 1.27)) hide)
    )
    (property "MfrPart" "78207-112HLF" (id 4) (at 185.42 27.94 0)
      (effects (font (size 1.27 1.27)) hide)
    )
    (pin "1" (uuid c4e3d562-90f9-4653-bc60-00a5d8001f40))
    (pin "10" (uuid 9280e48f-bc81-469e-897a-a0d1e8f16506))
    (pin "11" (uuid d5999206-eb84-4af8-bdb9-b2b0a802279d))
    (pin "12" (uuid 1bf4d2d7-d987-4596-9a7d-e95a7d391735))
    (pin "2" (uuid 09c41a12-7105-4f5b-ba67-01f5510a9d75))
    (pin "3" (uuid c7420b7d-0c35-477a-a996-b9e7e88b90ba))
    (pin "4" (uuid 6aadae28-7197-43a0-ada3-0c09939cd024))
    (pin "5" (uuid 7140ec3e-8241-4c98-9305-3e76208507dc))
    (pin "6" (uuid a8a7dad5-f843-4c5a-b6f9-e002393e1baf))
    (pin "7" (uuid 64bf311b-f54a-4dee-a743-fade97165da2))
    (pin "8" (uuid 90e33c19-4c6f-4ef5-8114-69630f997371))
    (pin "9" (uuid a7de3a40-26af-41ea-a03a-cb1cca262e27))
  )

  (symbol (lib_id "power:GND") (at 196.215 21.59 0) (unit 1)
    (in_bom yes) (on_board yes)
    (uuid 00000000-0000-0000-0000-00005d4d5508)
    (property "Reference" "#PWR02504" (id 0) (at 196.215 27.94 0)
      (effects (font (size 1.27 1.27)) hide)
    )
    (property "Value" "GND" (id 1) (at 196.342 25.9842 0))
    (property "Footprint" "" (id 2) (at 196.215 21.59 0)
      (effects (font (size 1.27 1.27)) hide)
    )
    (property "Datasheet" "" (id 3) (at 196.215 21.59 0)
      (effects (font (size 1.27 1.27)) hide)
    )
    (pin "1" (uuid 5e61cac9-e3e4-4a09-9efe-b2c5ac4d22dd))
  )
)
