%!PS-Adobe-3.0
%%Creator: PCBNEW
%%CreationDate: Tue Sep 29 19:32:00 2020
%%Title: /home/kkrizka/Dropbox/HEP/ITkStrips/PowerBoard/plusminus5_adapter/gerbers/active_power-PTH-drl_map.ps
%%Pages: 1
%%PageOrder: Ascend
%%BoundingBox: 0 0 596 842
%%DocumentMedia: A4 595 842 0 () ()
%%Orientation: Landscape
%%EndComments
%%BeginProlog
/line { newpath moveto lineto stroke } bind def
/cir0 { newpath 0 360 arc stroke } bind def
/cir1 { newpath 0 360 arc gsave fill grestore stroke } bind def
/cir2 { newpath 0 360 arc gsave fill grestore stroke } bind def
/arc0 { newpath arc stroke } bind def
/arc1 { newpath 4 index 4 index moveto arc closepath gsave fill
    grestore stroke } bind def
/arc2 { newpath 4 index 4 index moveto arc closepath gsave fill
    grestore stroke } bind def
/poly0 { stroke } bind def
/poly1 { closepath gsave fill grestore stroke } bind def
/poly2 { closepath gsave fill grestore stroke } bind def
/rect0 { rectstroke } bind def
/rect1 { rectfill } bind def
/rect2 { rectfill } bind def
/linemode0 { 0 setlinecap 0 setlinejoin 0 setlinewidth } bind def
/linemode1 { 1 setlinecap 1 setlinejoin } bind def
/dashedline { [200] 100 setdash } bind def
/solidline { [] 0 setdash } bind def
/phantomshow { moveto
    /KicadFont findfont 0.000001 scalefont setfont
    show } bind def
/textshow { gsave
    findfont exch scalefont setfont concat 1 scale 0 0 moveto show
    } bind def
/reencodefont {
  findfont dup length dict begin
  { 1 index /FID ne
    { def }
    { pop pop } ifelse
  } forall
  /Encoding ISOLatin1Encoding def
  currentdict
  end } bind def
/KicadFont /Helvetica reencodefont definefont pop
/KicadFont-Bold /Helvetica-Bold reencodefont definefont pop
/KicadFont-Oblique /Helvetica-Oblique reencodefont definefont pop
/KicadFont-BoldOblique /Helvetica-BoldOblique reencodefont definefont pop
%%EndProlog
%%Page: 1 1
%%BeginPageSetup
gsave
0.0072 0.0072 scale
linemode1
82680 0 translate 90 rotate
150 setlinewidth
%%EndPageSetup
0 0 0 setrgbcolor
59.0551 setlinewidth
newpath
13465 75876 moveto
13465 39876 lineto
stroke
0 0 0 setrgbcolor
newpath
103465 39876 moveto
13465 39876 lineto
stroke
0 0 0 setrgbcolor
newpath
103465 75876 moveto
103465 39876 lineto
stroke
0 0 0 setrgbcolor
newpath
13465 75876 moveto
103465 75876 lineto
stroke
78.7394 setlinewidth
newpath
77728.8 44612.2 moveto
78201.2 44139.8 lineto
stroke
newpath
78201.2 44612.2 moveto
77728.8 44139.8 lineto
stroke
newpath
80128.8 44612.2 moveto
80601.2 44139.8 lineto
stroke
newpath
80601.2 44612.2 moveto
80128.8 44139.8 lineto
stroke
19765 56976 472.441 cir0
newpath
18229.6 56542.9 moveto
21300.4 56542.9 lineto
stroke
newpath
18229.6 57409.1 moveto
21300.4 57409.1 lineto
stroke
21300.4 56976 433.071 270 450 arc0
18229.6 56976 433.071 90 270 arc0
19765 50125.6 472.441 cir0
newpath
18465.8 49692.5 moveto
21064.2 49692.5 lineto
stroke
newpath
18465.8 50558.7 moveto
21064.2 50558.7 lineto
stroke
21064.2 50125.6 433.071 270 450 arc0
18465.8 50125.6 433.071 90 270 arc0
25434.3 53432.7 472.441 cir0
newpath
25867.4 52133.5 moveto
25867.4 54731.9 lineto
stroke
newpath
25001.2 52133.5 moveto
25001.2 54731.9 lineto
stroke
25434.3 54731.9 433.071 360 540 arc0
25434.3 52133.5 433.071 180 360 arc0
newpath
30959.5 63084.7 moveto
30959.5 62021.7 lineto
stroke
newpath
30428 62553.2 moveto
31491 62553.2 lineto
stroke
newpath
30959.5 47730.3 moveto
30959.5 46667.3 lineto
stroke
newpath
30428 47198.8 moveto
31491 47198.8 lineto
stroke
newpath
42770.5 63084.7 moveto
42770.5 62021.7 lineto
stroke
newpath
42239 62553.2 moveto
43302 62553.2 lineto
stroke
newpath
42770.5 47730.3 moveto
42770.5 46667.3 lineto
stroke
newpath
42239 47198.8 moveto
43302 47198.8 lineto
stroke
newpath
48442.3 61898.7 moveto
48442.3 62853.3 lineto
47487.7 62853.3 lineto
47487.7 61898.7 lineto
48442.3 61898.7 lineto
poly0
newpath
48442.3 55898.7 moveto
48442.3 56853.3 lineto
47487.7 56853.3 lineto
47487.7 55898.7 lineto
48442.3 55898.7 lineto
poly0
newpath
48442.3 46898.7 moveto
48442.3 47853.3 lineto
47487.7 47853.3 lineto
47487.7 46898.7 lineto
48442.3 46898.7 lineto
poly0
newpath
94165 57413 moveto
95228 58476 lineto
94165 59539 lineto
93102 58476 lineto
94165 57413 lineto
poly0
newpath
94165 50916.9 moveto
95228 51979.9 lineto
94165 53042.9 lineto
93102 51979.9 lineto
94165 50916.9 lineto
poly0
newpath
99125.6 57413 moveto
100189 58476 lineto
99125.6 59539 lineto
98062.6 58476 lineto
99125.6 57413 lineto
poly0
newpath
99125.6 50916.9 moveto
100189 51979.9 lineto
99125.6 53042.9 lineto
98062.6 51979.9 lineto
99125.6 50916.9 lineto
poly0
newpath
70840 72501 moveto
73090 70251 lineto
stroke
newpath
73090 72501 moveto
70840 70251 lineto
stroke
71965 71376 1125 cir0
newpath
70840 60501 moveto
73090 58251 lineto
stroke
newpath
73090 60501 moveto
70840 58251 lineto
stroke
71965 59376 1125 cir0
newpath
70840 48501 moveto
73090 46251 lineto
stroke
newpath
73090 48501 moveto
70840 46251 lineto
stroke
71965 47376 1125 cir0
118.11 setlinewidth
0 0 0 setrgbcolor
0 0 0 setrgbcolor
newpath
14563.1 38013 moveto
14563.1 39194.1 lineto
14844.4 39194.1 lineto
15013.1 39137.8 lineto
15125.6 39025.3 lineto
15181.8 38912.8 lineto
15238.1 38687.9 lineto
15238.1 38519.1 lineto
15181.8 38294.2 lineto
15125.6 38181.7 lineto
15013.1 38069.2 lineto
14844.4 38013 lineto
14563.1 38013 lineto
stroke
newpath
15744.2 38013 moveto
15744.2 38800.4 lineto
stroke
newpath
15744.2 38575.4 moveto
15800.5 38687.9 lineto
15856.7 38744.1 lineto
15969.2 38800.4 lineto
16081.7 38800.4 lineto
stroke
newpath
16475.4 38013 moveto
16475.4 38800.4 lineto
stroke
newpath
16475.4 39194.1 moveto
16419.2 39137.8 lineto
16475.4 39081.6 lineto
16531.6 39137.8 lineto
16475.4 39194.1 lineto
16475.4 39081.6 lineto
stroke
newpath
17206.6 38013 moveto
17094.1 38069.2 lineto
17037.8 38181.7 lineto
17037.8 39194.1 lineto
stroke
newpath
17825.2 38013 moveto
17712.7 38069.2 lineto
17656.5 38181.7 lineto
17656.5 39194.1 lineto
stroke
newpath
19175.1 38013 moveto
19175.1 39194.1 lineto
19568.8 38350.4 lineto
19962.5 39194.1 lineto
19962.5 38013 lineto
stroke
newpath
21031.1 38013 moveto
21031.1 38631.6 lineto
20974.8 38744.1 lineto
20862.4 38800.4 lineto
20637.4 38800.4 lineto
20524.9 38744.1 lineto
stroke
newpath
21031.1 38069.2 moveto
20918.6 38013 lineto
20637.4 38013 lineto
20524.9 38069.2 lineto
20468.7 38181.7 lineto
20468.7 38294.2 lineto
20524.9 38406.7 lineto
20637.4 38462.9 lineto
20918.6 38462.9 lineto
21031.1 38519.1 lineto
stroke
newpath
21593.5 38800.4 moveto
21593.5 37619.2 lineto
stroke
newpath
21593.5 38744.1 moveto
21706 38800.4 lineto
21931 38800.4 lineto
22043.5 38744.1 lineto
22099.7 38687.9 lineto
22155.9 38575.4 lineto
22155.9 38237.9 lineto
22099.7 38125.4 lineto
22043.5 38069.2 lineto
21931 38013 lineto
21706 38013 lineto
21593.5 38069.2 lineto
stroke
newpath
22662.1 38125.4 moveto
22718.4 38069.2 lineto
22662.1 38013 lineto
22605.9 38069.2 lineto
22662.1 38125.4 lineto
22662.1 38013 lineto
stroke
newpath
22662.1 38744.1 moveto
22718.4 38687.9 lineto
22662.1 38631.6 lineto
22605.9 38687.9 lineto
22662.1 38744.1 lineto
22662.1 38631.6 lineto
stroke
newpath
12963 36303.2 moveto
13435.5 35830.7 lineto
stroke
newpath
13435.5 36303.2 moveto
12963 35830.7 lineto
stroke
0 0 0 setrgbcolor
0 0 0 setrgbcolor
newpath
14788.1 36713.7 moveto
14900.6 36713.7 lineto
15013.1 36657.5 lineto
15069.3 36601.3 lineto
15125.6 36488.8 lineto
15181.8 36263.8 lineto
15181.8 35982.6 lineto
15125.6 35757.6 lineto
15069.3 35645.1 lineto
15013.1 35588.9 lineto
14900.6 35532.6 lineto
14788.1 35532.6 lineto
14675.6 35588.9 lineto
14619.4 35645.1 lineto
14563.1 35757.6 lineto
14506.9 35982.6 lineto
14506.9 36263.8 lineto
14563.1 36488.8 lineto
14619.4 36601.3 lineto
14675.6 36657.5 lineto
14788.1 36713.7 lineto
stroke
newpath
15688 35645.1 moveto
15744.2 35588.9 lineto
15688 35532.6 lineto
15631.8 35588.9 lineto
15688 35645.1 lineto
15688 35532.6 lineto
stroke
newpath
16756.6 36320 moveto
16756.6 35532.6 lineto
stroke
newpath
16475.4 36770 moveto
16194.2 35926.3 lineto
16925.3 35926.3 lineto
stroke
newpath
17600.3 36713.7 moveto
17712.7 36713.7 lineto
17825.2 36657.5 lineto
17881.5 36601.3 lineto
17937.7 36488.8 lineto
17994 36263.8 lineto
17994 35982.6 lineto
17937.7 35757.6 lineto
17881.5 35645.1 lineto
17825.2 35588.9 lineto
17712.7 35532.6 lineto
17600.3 35532.6 lineto
17487.8 35588.9 lineto
17431.5 35645.1 lineto
17375.3 35757.6 lineto
17319 35982.6 lineto
17319 36263.8 lineto
17375.3 36488.8 lineto
17431.5 36601.3 lineto
17487.8 36657.5 lineto
17600.3 36713.7 lineto
stroke
newpath
18500.2 35532.6 moveto
18500.2 36320 lineto
stroke
newpath
18500.2 36207.6 moveto
18556.4 36263.8 lineto
18668.9 36320 lineto
18837.6 36320 lineto
18950.1 36263.8 lineto
19006.3 36151.3 lineto
19006.3 35532.6 lineto
stroke
newpath
19006.3 36151.3 moveto
19062.6 36263.8 lineto
19175.1 36320 lineto
19343.8 36320 lineto
19456.3 36263.8 lineto
19512.5 36151.3 lineto
19512.5 35532.6 lineto
stroke
newpath
20075 35532.6 moveto
20075 36320 lineto
stroke
newpath
20075 36207.6 moveto
20131.2 36263.8 lineto
20243.7 36320 lineto
20412.4 36320 lineto
20524.9 36263.8 lineto
20581.1 36151.3 lineto
20581.1 35532.6 lineto
stroke
newpath
20581.1 36151.3 moveto
20637.4 36263.8 lineto
20749.9 36320 lineto
20918.6 36320 lineto
21031.1 36263.8 lineto
21087.3 36151.3 lineto
21087.3 35532.6 lineto
stroke
newpath
23393.3 36770 moveto
22380.9 35251.4 lineto
stroke
newpath
24911.8 36713.7 moveto
25024.3 36713.7 lineto
25136.8 36657.5 lineto
25193.1 36601.3 lineto
25249.3 36488.8 lineto
25305.6 36263.8 lineto
25305.6 35982.6 lineto
25249.3 35757.6 lineto
25193.1 35645.1 lineto
25136.8 35588.9 lineto
25024.3 35532.6 lineto
24911.8 35532.6 lineto
24799.4 35588.9 lineto
24743.1 35645.1 lineto
24686.9 35757.6 lineto
24630.6 35982.6 lineto
24630.6 36263.8 lineto
24686.9 36488.8 lineto
24743.1 36601.3 lineto
24799.4 36657.5 lineto
24911.8 36713.7 lineto
stroke
newpath
25811.7 35645.1 moveto
25868 35588.9 lineto
25811.7 35532.6 lineto
25755.5 35588.9 lineto
25811.7 35645.1 lineto
25811.7 35532.6 lineto
stroke
newpath
26599.1 36713.7 moveto
26711.6 36713.7 lineto
26824.1 36657.5 lineto
26880.4 36601.3 lineto
26936.6 36488.8 lineto
26992.8 36263.8 lineto
26992.8 35982.6 lineto
26936.6 35757.6 lineto
26880.4 35645.1 lineto
26824.1 35588.9 lineto
26711.6 35532.6 lineto
26599.1 35532.6 lineto
26486.7 35588.9 lineto
26430.4 35645.1 lineto
26374.2 35757.6 lineto
26317.9 35982.6 lineto
26317.9 36263.8 lineto
26374.2 36488.8 lineto
26430.4 36601.3 lineto
26486.7 36657.5 lineto
26599.1 36713.7 lineto
stroke
newpath
28117.7 35532.6 moveto
27442.8 35532.6 lineto
stroke
newpath
27780.2 35532.6 moveto
27780.2 36713.7 lineto
27667.8 36545 lineto
27555.3 36432.5 lineto
27442.8 36376.3 lineto
stroke
newpath
29130.1 36713.7 moveto
28905.1 36713.7 lineto
28792.6 36657.5 lineto
28736.4 36601.3 lineto
28623.9 36432.5 lineto
28567.6 36207.6 lineto
28567.6 35757.6 lineto
28623.9 35645.1 lineto
28680.1 35588.9 lineto
28792.6 35532.6 lineto
29017.6 35532.6 lineto
29130.1 35588.9 lineto
29186.3 35645.1 lineto
29242.6 35757.6 lineto
29242.6 36038.8 lineto
29186.3 36151.3 lineto
29130.1 36207.6 lineto
29017.6 36263.8 lineto
28792.6 36263.8 lineto
28680.1 36207.6 lineto
28623.9 36151.3 lineto
28567.6 36038.8 lineto
stroke
newpath
29692.5 36713.7 moveto
29692.5 36488.8 lineto
stroke
newpath
30142.4 36713.7 moveto
30142.4 36488.8 lineto
stroke
newpath
31886 35082.7 moveto
31829.7 35138.9 lineto
31717.2 35307.7 lineto
31661 35420.1 lineto
31604.8 35588.9 lineto
31548.5 35870.1 lineto
31548.5 36095.1 lineto
31604.8 36376.3 lineto
31661 36545 lineto
31717.2 36657.5 lineto
31829.7 36826.2 lineto
31886 36882.5 lineto
stroke
newpath
32279.7 36601.3 moveto
32335.9 36657.5 lineto
32448.4 36713.7 lineto
32729.6 36713.7 lineto
32842.1 36657.5 lineto
32898.4 36601.3 lineto
32954.6 36488.8 lineto
32954.6 36376.3 lineto
32898.4 36207.6 lineto
32223.4 35532.6 lineto
32954.6 35532.6 lineto
stroke
newpath
34360.7 35532.6 moveto
34360.7 36713.7 lineto
stroke
newpath
34866.9 35532.6 moveto
34866.9 36151.3 lineto
34810.6 36263.8 lineto
34698.1 36320 lineto
34529.4 36320 lineto
34416.9 36263.8 lineto
34360.7 36207.6 lineto
stroke
newpath
35598 35532.6 moveto
35485.5 35588.9 lineto
35429.3 35645.1 lineto
35373 35757.6 lineto
35373 36095.1 lineto
35429.3 36207.6 lineto
35485.5 36263.8 lineto
35598 36320 lineto
35766.7 36320 lineto
35879.2 36263.8 lineto
35935.5 36207.6 lineto
35991.7 36095.1 lineto
35991.7 35757.6 lineto
35935.5 35645.1 lineto
35879.2 35588.9 lineto
35766.7 35532.6 lineto
35598 35532.6 lineto
stroke
newpath
36666.6 35532.6 moveto
36554.1 35588.9 lineto
36497.9 35701.4 lineto
36497.9 36713.7 lineto
stroke
newpath
37566.5 35588.9 moveto
37454 35532.6 lineto
37229.1 35532.6 lineto
37116.6 35588.9 lineto
37060.3 35701.4 lineto
37060.3 36151.3 lineto
37116.6 36263.8 lineto
37229.1 36320 lineto
37454 36320 lineto
37566.5 36263.8 lineto
37622.8 36151.3 lineto
37622.8 36038.8 lineto
37060.3 35926.3 lineto
stroke
newpath
38072.7 35588.9 moveto
38185.2 35532.6 lineto
38410.2 35532.6 lineto
38522.6 35588.9 lineto
38578.9 35701.4 lineto
38578.9 35757.6 lineto
38522.6 35870.1 lineto
38410.2 35926.3 lineto
38241.4 35926.3 lineto
38128.9 35982.6 lineto
38072.7 36095.1 lineto
38072.7 36151.3 lineto
38128.9 36263.8 lineto
38241.4 36320 lineto
38410.2 36320 lineto
38522.6 36263.8 lineto
stroke
newpath
38972.6 35082.7 moveto
39028.8 35138.9 lineto
39141.3 35307.7 lineto
39197.6 35420.1 lineto
39253.8 35588.9 lineto
39310.1 35870.1 lineto
39310.1 36095.1 lineto
39253.8 36376.3 lineto
39197.6 36545 lineto
39141.3 36657.5 lineto
39028.8 36826.2 lineto
38972.6 36882.5 lineto
stroke
12963 34507.9 472.441 cir0
0 0 0 setrgbcolor
0 0 0 setrgbcolor
newpath
14788.1 35154.7 moveto
14900.6 35154.7 lineto
15013.1 35098.4 lineto
15069.3 35042.2 lineto
15125.6 34929.7 lineto
15181.8 34704.7 lineto
15181.8 34423.5 lineto
15125.6 34198.6 lineto
15069.3 34086.1 lineto
15013.1 34029.8 lineto
14900.6 33973.6 lineto
14788.1 33973.6 lineto
14675.6 34029.8 lineto
14619.4 34086.1 lineto
14563.1 34198.6 lineto
14506.9 34423.5 lineto
14506.9 34704.7 lineto
14563.1 34929.7 lineto
14619.4 35042.2 lineto
14675.6 35098.4 lineto
14788.1 35154.7 lineto
stroke
newpath
15688 34086.1 moveto
15744.2 34029.8 lineto
15688 33973.6 lineto
15631.8 34029.8 lineto
15688 34086.1 lineto
15688 33973.6 lineto
stroke
newpath
16419.2 34648.5 moveto
16306.7 34704.7 lineto
16250.4 34761 lineto
16194.2 34873.5 lineto
16194.2 34929.7 lineto
16250.4 35042.2 lineto
16306.7 35098.4 lineto
16419.2 35154.7 lineto
16644.1 35154.7 lineto
16756.6 35098.4 lineto
16812.9 35042.2 lineto
16869.1 34929.7 lineto
16869.1 34873.5 lineto
16812.9 34761 lineto
16756.6 34704.7 lineto
16644.1 34648.5 lineto
16419.2 34648.5 lineto
16306.7 34592.3 lineto
16250.4 34536 lineto
16194.2 34423.5 lineto
16194.2 34198.6 lineto
16250.4 34086.1 lineto
16306.7 34029.8 lineto
16419.2 33973.6 lineto
16644.1 33973.6 lineto
16756.6 34029.8 lineto
16812.9 34086.1 lineto
16869.1 34198.6 lineto
16869.1 34423.5 lineto
16812.9 34536 lineto
16756.6 34592.3 lineto
16644.1 34648.5 lineto
stroke
newpath
17600.3 35154.7 moveto
17712.7 35154.7 lineto
17825.2 35098.4 lineto
17881.5 35042.2 lineto
17937.7 34929.7 lineto
17994 34704.7 lineto
17994 34423.5 lineto
17937.7 34198.6 lineto
17881.5 34086.1 lineto
17825.2 34029.8 lineto
17712.7 33973.6 lineto
17600.3 33973.6 lineto
17487.8 34029.8 lineto
17431.5 34086.1 lineto
17375.3 34198.6 lineto
17319 34423.5 lineto
17319 34704.7 lineto
17375.3 34929.7 lineto
17431.5 35042.2 lineto
17487.8 35098.4 lineto
17600.3 35154.7 lineto
stroke
newpath
18500.2 33973.6 moveto
18500.2 34761 lineto
stroke
newpath
18500.2 34648.5 moveto
18556.4 34704.7 lineto
18668.9 34761 lineto
18837.6 34761 lineto
18950.1 34704.7 lineto
19006.3 34592.3 lineto
19006.3 33973.6 lineto
stroke
newpath
19006.3 34592.3 moveto
19062.6 34704.7 lineto
19175.1 34761 lineto
19343.8 34761 lineto
19456.3 34704.7 lineto
19512.5 34592.3 lineto
19512.5 33973.6 lineto
stroke
newpath
20075 33973.6 moveto
20075 34761 lineto
stroke
newpath
20075 34648.5 moveto
20131.2 34704.7 lineto
20243.7 34761 lineto
20412.4 34761 lineto
20524.9 34704.7 lineto
20581.1 34592.3 lineto
20581.1 33973.6 lineto
stroke
newpath
20581.1 34592.3 moveto
20637.4 34704.7 lineto
20749.9 34761 lineto
20918.6 34761 lineto
21031.1 34704.7 lineto
21087.3 34592.3 lineto
21087.3 33973.6 lineto
stroke
newpath
23393.3 35210.9 moveto
22380.9 33692.4 lineto
stroke
newpath
24911.8 35154.7 moveto
25024.3 35154.7 lineto
25136.8 35098.4 lineto
25193.1 35042.2 lineto
25249.3 34929.7 lineto
25305.6 34704.7 lineto
25305.6 34423.5 lineto
25249.3 34198.6 lineto
25193.1 34086.1 lineto
25136.8 34029.8 lineto
25024.3 33973.6 lineto
24911.8 33973.6 lineto
24799.4 34029.8 lineto
24743.1 34086.1 lineto
24686.9 34198.6 lineto
24630.6 34423.5 lineto
24630.6 34704.7 lineto
24686.9 34929.7 lineto
24743.1 35042.2 lineto
24799.4 35098.4 lineto
24911.8 35154.7 lineto
stroke
newpath
25811.7 34086.1 moveto
25868 34029.8 lineto
25811.7 33973.6 lineto
25755.5 34029.8 lineto
25811.7 34086.1 lineto
25811.7 33973.6 lineto
stroke
newpath
26599.1 35154.7 moveto
26711.6 35154.7 lineto
26824.1 35098.4 lineto
26880.4 35042.2 lineto
26936.6 34929.7 lineto
26992.8 34704.7 lineto
26992.8 34423.5 lineto
26936.6 34198.6 lineto
26880.4 34086.1 lineto
26824.1 34029.8 lineto
26711.6 33973.6 lineto
26599.1 33973.6 lineto
26486.7 34029.8 lineto
26430.4 34086.1 lineto
26374.2 34198.6 lineto
26317.9 34423.5 lineto
26317.9 34704.7 lineto
26374.2 34929.7 lineto
26430.4 35042.2 lineto
26486.7 35098.4 lineto
26599.1 35154.7 lineto
stroke
newpath
27386.5 35154.7 moveto
28117.7 35154.7 lineto
27724 34704.7 lineto
27892.7 34704.7 lineto
28005.2 34648.5 lineto
28061.5 34592.3 lineto
28117.7 34479.8 lineto
28117.7 34198.6 lineto
28061.5 34086.1 lineto
28005.2 34029.8 lineto
27892.7 33973.6 lineto
27555.3 33973.6 lineto
27442.8 34029.8 lineto
27386.5 34086.1 lineto
stroke
newpath
29242.6 33973.6 moveto
28567.6 33973.6 lineto
stroke
newpath
28905.1 33973.6 moveto
28905.1 35154.7 lineto
28792.6 34986 lineto
28680.1 34873.5 lineto
28567.6 34817.2 lineto
stroke
newpath
29692.5 35154.7 moveto
29692.5 34929.7 lineto
stroke
newpath
30142.4 35154.7 moveto
30142.4 34929.7 lineto
stroke
newpath
31886 33523.6 moveto
31829.7 33579.9 lineto
31717.2 33748.6 lineto
31661 33861.1 lineto
31604.8 34029.8 lineto
31548.5 34311 lineto
31548.5 34536 lineto
31604.8 34817.2 lineto
31661 34986 lineto
31717.2 35098.4 lineto
31829.7 35267.2 lineto
31886 35323.4 lineto
stroke
newpath
32560.9 35154.7 moveto
32673.4 35154.7 lineto
32785.9 35098.4 lineto
32842.1 35042.2 lineto
32898.4 34929.7 lineto
32954.6 34704.7 lineto
32954.6 34423.5 lineto
32898.4 34198.6 lineto
32842.1 34086.1 lineto
32785.9 34029.8 lineto
32673.4 33973.6 lineto
32560.9 33973.6 lineto
32448.4 34029.8 lineto
32392.2 34086.1 lineto
32335.9 34198.6 lineto
32279.7 34423.5 lineto
32279.7 34704.7 lineto
32335.9 34929.7 lineto
32392.2 35042.2 lineto
32448.4 35098.4 lineto
32560.9 35154.7 lineto
stroke
newpath
34360.7 33973.6 moveto
34360.7 35154.7 lineto
stroke
newpath
34866.9 33973.6 moveto
34866.9 34592.3 lineto
34810.6 34704.7 lineto
34698.1 34761 lineto
34529.4 34761 lineto
34416.9 34704.7 lineto
34360.7 34648.5 lineto
stroke
newpath
35598 33973.6 moveto
35485.5 34029.8 lineto
35429.3 34086.1 lineto
35373 34198.6 lineto
35373 34536 lineto
35429.3 34648.5 lineto
35485.5 34704.7 lineto
35598 34761 lineto
35766.7 34761 lineto
35879.2 34704.7 lineto
35935.5 34648.5 lineto
35991.7 34536 lineto
35991.7 34198.6 lineto
35935.5 34086.1 lineto
35879.2 34029.8 lineto
35766.7 33973.6 lineto
35598 33973.6 lineto
stroke
newpath
36666.6 33973.6 moveto
36554.1 34029.8 lineto
36497.9 34142.3 lineto
36497.9 35154.7 lineto
stroke
newpath
37566.5 34029.8 moveto
37454 33973.6 lineto
37229.1 33973.6 lineto
37116.6 34029.8 lineto
37060.3 34142.3 lineto
37060.3 34592.3 lineto
37116.6 34704.7 lineto
37229.1 34761 lineto
37454 34761 lineto
37566.5 34704.7 lineto
37622.8 34592.3 lineto
37622.8 34479.8 lineto
37060.3 34367.3 lineto
stroke
newpath
38072.7 34029.8 moveto
38185.2 33973.6 lineto
38410.2 33973.6 lineto
38522.6 34029.8 lineto
38578.9 34142.3 lineto
38578.9 34198.6 lineto
38522.6 34311 lineto
38410.2 34367.3 lineto
38241.4 34367.3 lineto
38128.9 34423.5 lineto
38072.7 34536 lineto
38072.7 34592.3 lineto
38128.9 34704.7 lineto
38241.4 34761 lineto
38410.2 34761 lineto
38522.6 34704.7 lineto
stroke
newpath
39985 34423.5 moveto
40884.9 34423.5 lineto
stroke
newpath
40434.9 33973.6 moveto
40434.9 34873.5 lineto
stroke
newpath
42234.7 35154.7 moveto
42965.8 35154.7 lineto
42572.1 34704.7 lineto
42740.9 34704.7 lineto
42853.4 34648.5 lineto
42909.6 34592.3 lineto
42965.8 34479.8 lineto
42965.8 34198.6 lineto
42909.6 34086.1 lineto
42853.4 34029.8 lineto
42740.9 33973.6 lineto
42403.4 33973.6 lineto
42290.9 34029.8 lineto
42234.7 34086.1 lineto
stroke
newpath
44315.7 34029.8 moveto
44428.2 33973.6 lineto
44653.1 33973.6 lineto
44765.6 34029.8 lineto
44821.9 34142.3 lineto
44821.9 34198.6 lineto
44765.6 34311 lineto
44653.1 34367.3 lineto
44484.4 34367.3 lineto
44371.9 34423.5 lineto
44315.7 34536 lineto
44315.7 34592.3 lineto
44371.9 34704.7 lineto
44484.4 34761 lineto
44653.1 34761 lineto
44765.6 34704.7 lineto
stroke
newpath
45496.8 33973.6 moveto
45384.3 34029.8 lineto
45328 34142.3 lineto
45328 35154.7 lineto
stroke
newpath
46115.4 33973.6 moveto
46003 34029.8 lineto
45946.7 34086.1 lineto
45890.5 34198.6 lineto
45890.5 34536 lineto
45946.7 34648.5 lineto
46003 34704.7 lineto
46115.4 34761 lineto
46284.2 34761 lineto
46396.7 34704.7 lineto
46452.9 34648.5 lineto
46509.2 34536 lineto
46509.2 34198.6 lineto
46452.9 34086.1 lineto
46396.7 34029.8 lineto
46284.2 33973.6 lineto
46115.4 33973.6 lineto
stroke
newpath
46846.6 34761 moveto
47296.6 34761 lineto
stroke
newpath
47015.3 35154.7 moveto
47015.3 34142.3 lineto
47071.6 34029.8 lineto
47184.1 33973.6 lineto
47296.6 33973.6 lineto
stroke
newpath
47634 34029.8 moveto
47746.5 33973.6 lineto
47971.5 33973.6 lineto
48084 34029.8 lineto
48140.2 34142.3 lineto
48140.2 34198.6 lineto
48084 34311 lineto
47971.5 34367.3 lineto
47802.7 34367.3 lineto
47690.3 34423.5 lineto
47634 34536 lineto
47634 34592.3 lineto
47690.3 34704.7 lineto
47802.7 34761 lineto
47971.5 34761 lineto
48084 34704.7 lineto
stroke
newpath
48533.9 33523.6 moveto
48590.1 33579.9 lineto
48702.6 33748.6 lineto
48758.9 33861.1 lineto
48815.1 34029.8 lineto
48871.4 34311 lineto
48871.4 34536 lineto
48815.1 34817.2 lineto
48758.9 34986 lineto
48702.6 35098.4 lineto
48590.1 35267.2 lineto
48533.9 35323.4 lineto
stroke
newpath
12904 33480.3 moveto
12904 32417.3 lineto
stroke
newpath
12372.5 32948.8 moveto
13435.5 32948.8 lineto
stroke
0 0 0 setrgbcolor
0 0 0 setrgbcolor
newpath
14788.1 33595.6 moveto
14900.6 33595.6 lineto
15013.1 33539.4 lineto
15069.3 33483.1 lineto
15125.6 33370.7 lineto
15181.8 33145.7 lineto
15181.8 32864.5 lineto
15125.6 32639.5 lineto
15069.3 32527 lineto
15013.1 32470.8 lineto
14900.6 32414.5 lineto
14788.1 32414.5 lineto
14675.6 32470.8 lineto
14619.4 32527 lineto
14563.1 32639.5 lineto
14506.9 32864.5 lineto
14506.9 33145.7 lineto
14563.1 33370.7 lineto
14619.4 33483.1 lineto
14675.6 33539.4 lineto
14788.1 33595.6 lineto
stroke
newpath
15688 32527 moveto
15744.2 32470.8 lineto
15688 32414.5 lineto
15631.8 32470.8 lineto
15688 32527 lineto
15688 32414.5 lineto
stroke
newpath
16306.7 32414.5 moveto
16531.6 32414.5 lineto
16644.1 32470.8 lineto
16700.4 32527 lineto
16812.9 32695.7 lineto
16869.1 32920.7 lineto
16869.1 33370.7 lineto
16812.9 33483.1 lineto
16756.6 33539.4 lineto
16644.1 33595.6 lineto
16419.2 33595.6 lineto
16306.7 33539.4 lineto
16250.4 33483.1 lineto
16194.2 33370.7 lineto
16194.2 33089.4 lineto
16250.4 32977 lineto
16306.7 32920.7 lineto
16419.2 32864.5 lineto
16644.1 32864.5 lineto
16756.6 32920.7 lineto
16812.9 32977 lineto
16869.1 33089.4 lineto
stroke
newpath
17600.3 33595.6 moveto
17712.7 33595.6 lineto
17825.2 33539.4 lineto
17881.5 33483.1 lineto
17937.7 33370.7 lineto
17994 33145.7 lineto
17994 32864.5 lineto
17937.7 32639.5 lineto
17881.5 32527 lineto
17825.2 32470.8 lineto
17712.7 32414.5 lineto
17600.3 32414.5 lineto
17487.8 32470.8 lineto
17431.5 32527 lineto
17375.3 32639.5 lineto
17319 32864.5 lineto
17319 33145.7 lineto
17375.3 33370.7 lineto
17431.5 33483.1 lineto
17487.8 33539.4 lineto
17600.3 33595.6 lineto
stroke
newpath
18500.2 32414.5 moveto
18500.2 33201.9 lineto
stroke
newpath
18500.2 33089.4 moveto
18556.4 33145.7 lineto
18668.9 33201.9 lineto
18837.6 33201.9 lineto
18950.1 33145.7 lineto
19006.3 33033.2 lineto
19006.3 32414.5 lineto
stroke
newpath
19006.3 33033.2 moveto
19062.6 33145.7 lineto
19175.1 33201.9 lineto
19343.8 33201.9 lineto
19456.3 33145.7 lineto
19512.5 33033.2 lineto
19512.5 32414.5 lineto
stroke
newpath
20075 32414.5 moveto
20075 33201.9 lineto
stroke
newpath
20075 33089.4 moveto
20131.2 33145.7 lineto
20243.7 33201.9 lineto
20412.4 33201.9 lineto
20524.9 33145.7 lineto
20581.1 33033.2 lineto
20581.1 32414.5 lineto
stroke
newpath
20581.1 33033.2 moveto
20637.4 33145.7 lineto
20749.9 33201.9 lineto
20918.6 33201.9 lineto
21031.1 33145.7 lineto
21087.3 33033.2 lineto
21087.3 32414.5 lineto
stroke
newpath
23393.3 33651.9 moveto
22380.9 32133.3 lineto
stroke
newpath
24911.8 33595.6 moveto
25024.3 33595.6 lineto
25136.8 33539.4 lineto
25193.1 33483.1 lineto
25249.3 33370.7 lineto
25305.6 33145.7 lineto
25305.6 32864.5 lineto
25249.3 32639.5 lineto
25193.1 32527 lineto
25136.8 32470.8 lineto
25024.3 32414.5 lineto
24911.8 32414.5 lineto
24799.4 32470.8 lineto
24743.1 32527 lineto
24686.9 32639.5 lineto
24630.6 32864.5 lineto
24630.6 33145.7 lineto
24686.9 33370.7 lineto
24743.1 33483.1 lineto
24799.4 33539.4 lineto
24911.8 33595.6 lineto
stroke
newpath
25811.7 32527 moveto
25868 32470.8 lineto
25811.7 32414.5 lineto
25755.5 32470.8 lineto
25811.7 32527 lineto
25811.7 32414.5 lineto
stroke
newpath
26599.1 33595.6 moveto
26711.6 33595.6 lineto
26824.1 33539.4 lineto
26880.4 33483.1 lineto
26936.6 33370.7 lineto
26992.8 33145.7 lineto
26992.8 32864.5 lineto
26936.6 32639.5 lineto
26880.4 32527 lineto
26824.1 32470.8 lineto
26711.6 32414.5 lineto
26599.1 32414.5 lineto
26486.7 32470.8 lineto
26430.4 32527 lineto
26374.2 32639.5 lineto
26317.9 32864.5 lineto
26317.9 33145.7 lineto
26374.2 33370.7 lineto
26430.4 33483.1 lineto
26486.7 33539.4 lineto
26599.1 33595.6 lineto
stroke
newpath
27386.5 33595.6 moveto
28117.7 33595.6 lineto
27724 33145.7 lineto
27892.7 33145.7 lineto
28005.2 33089.4 lineto
28061.5 33033.2 lineto
28117.7 32920.7 lineto
28117.7 32639.5 lineto
28061.5 32527 lineto
28005.2 32470.8 lineto
27892.7 32414.5 lineto
27555.3 32414.5 lineto
27442.8 32470.8 lineto
27386.5 32527 lineto
stroke
newpath
29186.3 33595.6 moveto
28623.9 33595.6 lineto
28567.6 33033.2 lineto
28623.9 33089.4 lineto
28736.4 33145.7 lineto
29017.6 33145.7 lineto
29130.1 33089.4 lineto
29186.3 33033.2 lineto
29242.6 32920.7 lineto
29242.6 32639.5 lineto
29186.3 32527 lineto
29130.1 32470.8 lineto
29017.6 32414.5 lineto
28736.4 32414.5 lineto
28623.9 32470.8 lineto
28567.6 32527 lineto
stroke
newpath
29692.5 33595.6 moveto
29692.5 33370.7 lineto
stroke
newpath
30142.4 33595.6 moveto
30142.4 33370.7 lineto
stroke
newpath
31886 31964.6 moveto
31829.7 32020.8 lineto
31717.2 32189.6 lineto
31661 32302 lineto
31604.8 32470.8 lineto
31548.5 32752 lineto
31548.5 32977 lineto
31604.8 33258.2 lineto
31661 33426.9 lineto
31717.2 33539.4 lineto
31829.7 33708.1 lineto
31886 33764.4 lineto
stroke
newpath
32842.1 33201.9 moveto
32842.1 32414.5 lineto
stroke
newpath
32560.9 33651.9 moveto
32279.7 32808.2 lineto
33010.8 32808.2 lineto
stroke
newpath
34360.7 32414.5 moveto
34360.7 33595.6 lineto
stroke
newpath
34866.9 32414.5 moveto
34866.9 33033.2 lineto
34810.6 33145.7 lineto
34698.1 33201.9 lineto
34529.4 33201.9 lineto
34416.9 33145.7 lineto
34360.7 33089.4 lineto
stroke
newpath
35598 32414.5 moveto
35485.5 32470.8 lineto
35429.3 32527 lineto
35373 32639.5 lineto
35373 32977 lineto
35429.3 33089.4 lineto
35485.5 33145.7 lineto
35598 33201.9 lineto
35766.7 33201.9 lineto
35879.2 33145.7 lineto
35935.5 33089.4 lineto
35991.7 32977 lineto
35991.7 32639.5 lineto
35935.5 32527 lineto
35879.2 32470.8 lineto
35766.7 32414.5 lineto
35598 32414.5 lineto
stroke
newpath
36666.6 32414.5 moveto
36554.1 32470.8 lineto
36497.9 32583.3 lineto
36497.9 33595.6 lineto
stroke
newpath
37566.5 32470.8 moveto
37454 32414.5 lineto
37229.1 32414.5 lineto
37116.6 32470.8 lineto
37060.3 32583.3 lineto
37060.3 33033.2 lineto
37116.6 33145.7 lineto
37229.1 33201.9 lineto
37454 33201.9 lineto
37566.5 33145.7 lineto
37622.8 33033.2 lineto
37622.8 32920.7 lineto
37060.3 32808.2 lineto
stroke
newpath
38072.7 32470.8 moveto
38185.2 32414.5 lineto
38410.2 32414.5 lineto
38522.6 32470.8 lineto
38578.9 32583.3 lineto
38578.9 32639.5 lineto
38522.6 32752 lineto
38410.2 32808.2 lineto
38241.4 32808.2 lineto
38128.9 32864.5 lineto
38072.7 32977 lineto
38072.7 33033.2 lineto
38128.9 33145.7 lineto
38241.4 33201.9 lineto
38410.2 33201.9 lineto
38522.6 33145.7 lineto
stroke
newpath
38972.6 31964.6 moveto
39028.8 32020.8 lineto
39141.3 32189.6 lineto
39197.6 32302 lineto
39253.8 32470.8 lineto
39310.1 32752 lineto
39310.1 32977 lineto
39253.8 33258.2 lineto
39197.6 33426.9 lineto
39141.3 33539.4 lineto
39028.8 33708.1 lineto
38972.6 33764.4 lineto
stroke
newpath
13237.8 30896.7 moveto
13237.8 31851.3 lineto
12283.2 31851.3 lineto
12283.2 30896.7 lineto
13237.8 30896.7 lineto
poly0
0 0 0 setrgbcolor
0 0 0 setrgbcolor
newpath
15181.8 30839.7 moveto
14506.9 30839.7 lineto
stroke
newpath
14844.4 30839.7 moveto
14844.4 32020.8 lineto
14731.9 31852.1 lineto
14619.4 31739.6 lineto
14506.9 31683.4 lineto
stroke
newpath
15688 30952.2 moveto
15744.2 30896 lineto
15688 30839.7 lineto
15631.8 30896 lineto
15688 30952.2 lineto
15688 30839.7 lineto
stroke
newpath
16869.1 30839.7 moveto
16194.2 30839.7 lineto
stroke
newpath
16531.6 30839.7 moveto
16531.6 32020.8 lineto
16419.2 31852.1 lineto
16306.7 31739.6 lineto
16194.2 31683.4 lineto
stroke
newpath
17881.5 31627.1 moveto
17881.5 30839.7 lineto
stroke
newpath
17600.3 32077.1 moveto
17319 31233.4 lineto
18050.2 31233.4 lineto
stroke
newpath
18500.2 30839.7 moveto
18500.2 31627.1 lineto
stroke
newpath
18500.2 31514.6 moveto
18556.4 31570.9 lineto
18668.9 31627.1 lineto
18837.6 31627.1 lineto
18950.1 31570.9 lineto
19006.3 31458.4 lineto
19006.3 30839.7 lineto
stroke
newpath
19006.3 31458.4 moveto
19062.6 31570.9 lineto
19175.1 31627.1 lineto
19343.8 31627.1 lineto
19456.3 31570.9 lineto
19512.5 31458.4 lineto
19512.5 30839.7 lineto
stroke
newpath
20075 30839.7 moveto
20075 31627.1 lineto
stroke
newpath
20075 31514.6 moveto
20131.2 31570.9 lineto
20243.7 31627.1 lineto
20412.4 31627.1 lineto
20524.9 31570.9 lineto
20581.1 31458.4 lineto
20581.1 30839.7 lineto
stroke
newpath
20581.1 31458.4 moveto
20637.4 31570.9 lineto
20749.9 31627.1 lineto
20918.6 31627.1 lineto
21031.1 31570.9 lineto
21087.3 31458.4 lineto
21087.3 30839.7 lineto
stroke
newpath
23393.3 32077.1 moveto
22380.9 30558.5 lineto
stroke
newpath
24911.8 32020.8 moveto
25024.3 32020.8 lineto
25136.8 31964.6 lineto
25193.1 31908.3 lineto
25249.3 31795.9 lineto
25305.6 31570.9 lineto
25305.6 31289.7 lineto
25249.3 31064.7 lineto
25193.1 30952.2 lineto
25136.8 30896 lineto
25024.3 30839.7 lineto
24911.8 30839.7 lineto
24799.4 30896 lineto
24743.1 30952.2 lineto
24686.9 31064.7 lineto
24630.6 31289.7 lineto
24630.6 31570.9 lineto
24686.9 31795.9 lineto
24743.1 31908.3 lineto
24799.4 31964.6 lineto
24911.8 32020.8 lineto
stroke
newpath
25811.7 30952.2 moveto
25868 30896 lineto
25811.7 30839.7 lineto
25755.5 30896 lineto
25811.7 30952.2 lineto
25811.7 30839.7 lineto
stroke
newpath
26599.1 32020.8 moveto
26711.6 32020.8 lineto
26824.1 31964.6 lineto
26880.4 31908.3 lineto
26936.6 31795.9 lineto
26992.8 31570.9 lineto
26992.8 31289.7 lineto
26936.6 31064.7 lineto
26880.4 30952.2 lineto
26824.1 30896 lineto
26711.6 30839.7 lineto
26599.1 30839.7 lineto
26486.7 30896 lineto
26430.4 30952.2 lineto
26374.2 31064.7 lineto
26317.9 31289.7 lineto
26317.9 31570.9 lineto
26374.2 31795.9 lineto
26430.4 31908.3 lineto
26486.7 31964.6 lineto
26599.1 32020.8 lineto
stroke
newpath
28005.2 31627.1 moveto
28005.2 30839.7 lineto
stroke
newpath
27724 32077.1 moveto
27442.8 31233.4 lineto
28173.9 31233.4 lineto
stroke
newpath
29186.3 32020.8 moveto
28623.9 32020.8 lineto
28567.6 31458.4 lineto
28623.9 31514.6 lineto
28736.4 31570.9 lineto
29017.6 31570.9 lineto
29130.1 31514.6 lineto
29186.3 31458.4 lineto
29242.6 31345.9 lineto
29242.6 31064.7 lineto
29186.3 30952.2 lineto
29130.1 30896 lineto
29017.6 30839.7 lineto
28736.4 30839.7 lineto
28623.9 30896 lineto
28567.6 30952.2 lineto
stroke
newpath
29692.5 32020.8 moveto
29692.5 31795.9 lineto
stroke
newpath
30142.4 32020.8 moveto
30142.4 31795.9 lineto
stroke
newpath
31886 30389.8 moveto
31829.7 30446 lineto
31717.2 30614.8 lineto
31661 30727.2 lineto
31604.8 30896 lineto
31548.5 31177.2 lineto
31548.5 31402.2 lineto
31604.8 31683.4 lineto
31661 31852.1 lineto
31717.2 31964.6 lineto
31829.7 32133.3 lineto
31886 32189.6 lineto
stroke
newpath
32223.4 32020.8 moveto
32954.6 32020.8 lineto
32560.9 31570.9 lineto
32729.6 31570.9 lineto
32842.1 31514.6 lineto
32898.4 31458.4 lineto
32954.6 31345.9 lineto
32954.6 31064.7 lineto
32898.4 30952.2 lineto
32842.1 30896 lineto
32729.6 30839.7 lineto
32392.2 30839.7 lineto
32279.7 30896 lineto
32223.4 30952.2 lineto
stroke
newpath
34360.7 30839.7 moveto
34360.7 32020.8 lineto
stroke
newpath
34866.9 30839.7 moveto
34866.9 31458.4 lineto
34810.6 31570.9 lineto
34698.1 31627.1 lineto
34529.4 31627.1 lineto
34416.9 31570.9 lineto
34360.7 31514.6 lineto
stroke
newpath
35598 30839.7 moveto
35485.5 30896 lineto
35429.3 30952.2 lineto
35373 31064.7 lineto
35373 31402.2 lineto
35429.3 31514.6 lineto
35485.5 31570.9 lineto
35598 31627.1 lineto
35766.7 31627.1 lineto
35879.2 31570.9 lineto
35935.5 31514.6 lineto
35991.7 31402.2 lineto
35991.7 31064.7 lineto
35935.5 30952.2 lineto
35879.2 30896 lineto
35766.7 30839.7 lineto
35598 30839.7 lineto
stroke
newpath
36666.6 30839.7 moveto
36554.1 30896 lineto
36497.9 31008.5 lineto
36497.9 32020.8 lineto
stroke
newpath
37566.5 30896 moveto
37454 30839.7 lineto
37229.1 30839.7 lineto
37116.6 30896 lineto
37060.3 31008.5 lineto
37060.3 31458.4 lineto
37116.6 31570.9 lineto
37229.1 31627.1 lineto
37454 31627.1 lineto
37566.5 31570.9 lineto
37622.8 31458.4 lineto
37622.8 31345.9 lineto
37060.3 31233.4 lineto
stroke
newpath
38072.7 30896 moveto
38185.2 30839.7 lineto
38410.2 30839.7 lineto
38522.6 30896 lineto
38578.9 31008.5 lineto
38578.9 31064.7 lineto
38522.6 31177.2 lineto
38410.2 31233.4 lineto
38241.4 31233.4 lineto
38128.9 31289.7 lineto
38072.7 31402.2 lineto
38072.7 31458.4 lineto
38128.9 31570.9 lineto
38241.4 31627.1 lineto
38410.2 31627.1 lineto
38522.6 31570.9 lineto
stroke
newpath
38972.6 30389.8 moveto
39028.8 30446 lineto
39141.3 30614.8 lineto
39197.6 30727.2 lineto
39253.8 30896 lineto
39310.1 31177.2 lineto
39310.1 31402.2 lineto
39253.8 31683.4 lineto
39197.6 31852.1 lineto
39141.3 31964.6 lineto
39028.8 32133.3 lineto
38972.6 32189.6 lineto
stroke
newpath
12372.5 28449.2 moveto
13435.5 29512.2 lineto
12372.5 30575.2 lineto
11309.5 29512.2 lineto
12372.5 28449.2 lineto
poly0
0 0 0 setrgbcolor
0 0 0 setrgbcolor
newpath
15181.8 28977.9 moveto
14506.9 28977.9 lineto
stroke
newpath
14844.4 28977.9 moveto
14844.4 30159 lineto
14731.9 29990.3 lineto
14619.4 29877.8 lineto
14506.9 29821.6 lineto
stroke
newpath
15688 29090.4 moveto
15744.2 29034.2 lineto
15688 28977.9 lineto
15631.8 29034.2 lineto
15688 29090.4 lineto
15688 28977.9 lineto
stroke
newpath
16419.2 29652.8 moveto
16306.7 29709.1 lineto
16250.4 29765.3 lineto
16194.2 29877.8 lineto
16194.2 29934 lineto
16250.4 30046.5 lineto
16306.7 30102.8 lineto
16419.2 30159 lineto
16644.1 30159 lineto
16756.6 30102.8 lineto
16812.9 30046.5 lineto
16869.1 29934 lineto
16869.1 29877.8 lineto
16812.9 29765.3 lineto
16756.6 29709.1 lineto
16644.1 29652.8 lineto
16419.2 29652.8 lineto
16306.7 29596.6 lineto
16250.4 29540.3 lineto
16194.2 29427.9 lineto
16194.2 29202.9 lineto
16250.4 29090.4 lineto
16306.7 29034.2 lineto
16419.2 28977.9 lineto
16644.1 28977.9 lineto
16756.6 29034.2 lineto
16812.9 29090.4 lineto
16869.1 29202.9 lineto
16869.1 29427.9 lineto
16812.9 29540.3 lineto
16756.6 29596.6 lineto
16644.1 29652.8 lineto
stroke
newpath
17600.3 30159 moveto
17712.7 30159 lineto
17825.2 30102.8 lineto
17881.5 30046.5 lineto
17937.7 29934 lineto
17994 29709.1 lineto
17994 29427.9 lineto
17937.7 29202.9 lineto
17881.5 29090.4 lineto
17825.2 29034.2 lineto
17712.7 28977.9 lineto
17600.3 28977.9 lineto
17487.8 29034.2 lineto
17431.5 29090.4 lineto
17375.3 29202.9 lineto
17319 29427.9 lineto
17319 29709.1 lineto
17375.3 29934 lineto
17431.5 30046.5 lineto
17487.8 30102.8 lineto
17600.3 30159 lineto
stroke
newpath
18500.2 28977.9 moveto
18500.2 29765.3 lineto
stroke
newpath
18500.2 29652.8 moveto
18556.4 29709.1 lineto
18668.9 29765.3 lineto
18837.6 29765.3 lineto
18950.1 29709.1 lineto
19006.3 29596.6 lineto
19006.3 28977.9 lineto
stroke
newpath
19006.3 29596.6 moveto
19062.6 29709.1 lineto
19175.1 29765.3 lineto
19343.8 29765.3 lineto
19456.3 29709.1 lineto
19512.5 29596.6 lineto
19512.5 28977.9 lineto
stroke
newpath
20075 28977.9 moveto
20075 29765.3 lineto
stroke
newpath
20075 29652.8 moveto
20131.2 29709.1 lineto
20243.7 29765.3 lineto
20412.4 29765.3 lineto
20524.9 29709.1 lineto
20581.1 29596.6 lineto
20581.1 28977.9 lineto
stroke
newpath
20581.1 29596.6 moveto
20637.4 29709.1 lineto
20749.9 29765.3 lineto
20918.6 29765.3 lineto
21031.1 29709.1 lineto
21087.3 29596.6 lineto
21087.3 28977.9 lineto
stroke
newpath
23393.3 30215.3 moveto
22380.9 28696.7 lineto
stroke
newpath
24911.8 30159 moveto
25024.3 30159 lineto
25136.8 30102.8 lineto
25193.1 30046.5 lineto
25249.3 29934 lineto
25305.6 29709.1 lineto
25305.6 29427.9 lineto
25249.3 29202.9 lineto
25193.1 29090.4 lineto
25136.8 29034.2 lineto
25024.3 28977.9 lineto
24911.8 28977.9 lineto
24799.4 29034.2 lineto
24743.1 29090.4 lineto
24686.9 29202.9 lineto
24630.6 29427.9 lineto
24630.6 29709.1 lineto
24686.9 29934 lineto
24743.1 30046.5 lineto
24799.4 30102.8 lineto
24911.8 30159 lineto
stroke
newpath
25811.7 29090.4 moveto
25868 29034.2 lineto
25811.7 28977.9 lineto
25755.5 29034.2 lineto
25811.7 29090.4 lineto
25811.7 28977.9 lineto
stroke
newpath
26599.1 30159 moveto
26711.6 30159 lineto
26824.1 30102.8 lineto
26880.4 30046.5 lineto
26936.6 29934 lineto
26992.8 29709.1 lineto
26992.8 29427.9 lineto
26936.6 29202.9 lineto
26880.4 29090.4 lineto
26824.1 29034.2 lineto
26711.6 28977.9 lineto
26599.1 28977.9 lineto
26486.7 29034.2 lineto
26430.4 29090.4 lineto
26374.2 29202.9 lineto
26317.9 29427.9 lineto
26317.9 29709.1 lineto
26374.2 29934 lineto
26430.4 30046.5 lineto
26486.7 30102.8 lineto
26599.1 30159 lineto
stroke
newpath
27386.5 30159 moveto
28173.9 30159 lineto
27667.8 28977.9 lineto
stroke
newpath
29242.6 28977.9 moveto
28567.6 28977.9 lineto
stroke
newpath
28905.1 28977.9 moveto
28905.1 30159 lineto
28792.6 29990.3 lineto
28680.1 29877.8 lineto
28567.6 29821.6 lineto
stroke
newpath
29692.5 30159 moveto
29692.5 29934 lineto
stroke
newpath
30142.4 30159 moveto
30142.4 29934 lineto
stroke
newpath
31886 28528 moveto
31829.7 28584.2 lineto
31717.2 28752.9 lineto
31661 28865.4 lineto
31604.8 29034.2 lineto
31548.5 29315.4 lineto
31548.5 29540.3 lineto
31604.8 29821.6 lineto
31661 29990.3 lineto
31717.2 30102.8 lineto
31829.7 30271.5 lineto
31886 30327.7 lineto
stroke
newpath
32842.1 29765.3 moveto
32842.1 28977.9 lineto
stroke
newpath
32560.9 30215.3 moveto
32279.7 29371.6 lineto
33010.8 29371.6 lineto
stroke
newpath
34360.7 28977.9 moveto
34360.7 30159 lineto
stroke
newpath
34866.9 28977.9 moveto
34866.9 29596.6 lineto
34810.6 29709.1 lineto
34698.1 29765.3 lineto
34529.4 29765.3 lineto
34416.9 29709.1 lineto
34360.7 29652.8 lineto
stroke
newpath
35598 28977.9 moveto
35485.5 29034.2 lineto
35429.3 29090.4 lineto
35373 29202.9 lineto
35373 29540.3 lineto
35429.3 29652.8 lineto
35485.5 29709.1 lineto
35598 29765.3 lineto
35766.7 29765.3 lineto
35879.2 29709.1 lineto
35935.5 29652.8 lineto
35991.7 29540.3 lineto
35991.7 29202.9 lineto
35935.5 29090.4 lineto
35879.2 29034.2 lineto
35766.7 28977.9 lineto
35598 28977.9 lineto
stroke
newpath
36666.6 28977.9 moveto
36554.1 29034.2 lineto
36497.9 29146.6 lineto
36497.9 30159 lineto
stroke
newpath
37566.5 29034.2 moveto
37454 28977.9 lineto
37229.1 28977.9 lineto
37116.6 29034.2 lineto
37060.3 29146.6 lineto
37060.3 29596.6 lineto
37116.6 29709.1 lineto
37229.1 29765.3 lineto
37454 29765.3 lineto
37566.5 29709.1 lineto
37622.8 29596.6 lineto
37622.8 29484.1 lineto
37060.3 29371.6 lineto
stroke
newpath
38072.7 29034.2 moveto
38185.2 28977.9 lineto
38410.2 28977.9 lineto
38522.6 29034.2 lineto
38578.9 29146.6 lineto
38578.9 29202.9 lineto
38522.6 29315.4 lineto
38410.2 29371.6 lineto
38241.4 29371.6 lineto
38128.9 29427.9 lineto
38072.7 29540.3 lineto
38072.7 29596.6 lineto
38128.9 29709.1 lineto
38241.4 29765.3 lineto
38410.2 29765.3 lineto
38522.6 29709.1 lineto
stroke
newpath
38972.6 28528 moveto
39028.8 28584.2 lineto
39141.3 28752.9 lineto
39197.6 28865.4 lineto
39253.8 29034.2 lineto
39310.1 29315.4 lineto
39310.1 29540.3 lineto
39253.8 29821.6 lineto
39197.6 29990.3 lineto
39141.3 30102.8 lineto
39028.8 30271.5 lineto
38972.6 30327.7 lineto
stroke
newpath
11185.5 27999.4 moveto
13435.5 25749.4 lineto
stroke
newpath
13435.5 27999.4 moveto
11185.5 25749.4 lineto
stroke
12310.5 26874.4 1125 cir0
0 0 0 setrgbcolor
0 0 0 setrgbcolor
newpath
15181.8 26340.1 moveto
14506.9 26340.1 lineto
stroke
newpath
14844.4 26340.1 moveto
14844.4 27521.2 lineto
14731.9 27352.5 lineto
14619.4 27240 lineto
14506.9 27183.8 lineto
stroke
newpath
15688 26452.6 moveto
15744.2 26396.4 lineto
15688 26340.1 lineto
15631.8 26396.4 lineto
15688 26452.6 lineto
15688 26340.1 lineto
stroke
newpath
16306.7 26340.1 moveto
16531.6 26340.1 lineto
16644.1 26396.4 lineto
16700.4 26452.6 lineto
16812.9 26621.3 lineto
16869.1 26846.3 lineto
16869.1 27296.2 lineto
16812.9 27408.7 lineto
16756.6 27465 lineto
16644.1 27521.2 lineto
16419.2 27521.2 lineto
16306.7 27465 lineto
16250.4 27408.7 lineto
16194.2 27296.2 lineto
16194.2 27015 lineto
16250.4 26902.5 lineto
16306.7 26846.3 lineto
16419.2 26790.1 lineto
16644.1 26790.1 lineto
16756.6 26846.3 lineto
16812.9 26902.5 lineto
16869.1 27015 lineto
stroke
newpath
17994 26340.1 moveto
17319 26340.1 lineto
stroke
newpath
17656.5 26340.1 moveto
17656.5 27521.2 lineto
17544 27352.5 lineto
17431.5 27240 lineto
17319 27183.8 lineto
stroke
newpath
18500.2 26340.1 moveto
18500.2 27127.5 lineto
stroke
newpath
18500.2 27015 moveto
18556.4 27071.3 lineto
18668.9 27127.5 lineto
18837.6 27127.5 lineto
18950.1 27071.3 lineto
19006.3 26958.8 lineto
19006.3 26340.1 lineto
stroke
newpath
19006.3 26958.8 moveto
19062.6 27071.3 lineto
19175.1 27127.5 lineto
19343.8 27127.5 lineto
19456.3 27071.3 lineto
19512.5 26958.8 lineto
19512.5 26340.1 lineto
stroke
newpath
20075 26340.1 moveto
20075 27127.5 lineto
stroke
newpath
20075 27015 moveto
20131.2 27071.3 lineto
20243.7 27127.5 lineto
20412.4 27127.5 lineto
20524.9 27071.3 lineto
20581.1 26958.8 lineto
20581.1 26340.1 lineto
stroke
newpath
20581.1 26958.8 moveto
20637.4 27071.3 lineto
20749.9 27127.5 lineto
20918.6 27127.5 lineto
21031.1 27071.3 lineto
21087.3 26958.8 lineto
21087.3 26340.1 lineto
stroke
newpath
23393.3 27577.5 moveto
22380.9 26058.9 lineto
stroke
newpath
24911.8 27521.2 moveto
25024.3 27521.2 lineto
25136.8 27465 lineto
25193.1 27408.7 lineto
25249.3 27296.2 lineto
25305.6 27071.3 lineto
25305.6 26790.1 lineto
25249.3 26565.1 lineto
25193.1 26452.6 lineto
25136.8 26396.4 lineto
25024.3 26340.1 lineto
24911.8 26340.1 lineto
24799.4 26396.4 lineto
24743.1 26452.6 lineto
24686.9 26565.1 lineto
24630.6 26790.1 lineto
24630.6 27071.3 lineto
24686.9 27296.2 lineto
24743.1 27408.7 lineto
24799.4 27465 lineto
24911.8 27521.2 lineto
stroke
newpath
25811.7 26452.6 moveto
25868 26396.4 lineto
25811.7 26340.1 lineto
25755.5 26396.4 lineto
25811.7 26452.6 lineto
25811.7 26340.1 lineto
stroke
newpath
26599.1 27521.2 moveto
26711.6 27521.2 lineto
26824.1 27465 lineto
26880.4 27408.7 lineto
26936.6 27296.2 lineto
26992.8 27071.3 lineto
26992.8 26790.1 lineto
26936.6 26565.1 lineto
26880.4 26452.6 lineto
26824.1 26396.4 lineto
26711.6 26340.1 lineto
26599.1 26340.1 lineto
26486.7 26396.4 lineto
26430.4 26452.6 lineto
26374.2 26565.1 lineto
26317.9 26790.1 lineto
26317.9 27071.3 lineto
26374.2 27296.2 lineto
26430.4 27408.7 lineto
26486.7 27465 lineto
26599.1 27521.2 lineto
stroke
newpath
27386.5 27521.2 moveto
28173.9 27521.2 lineto
27667.8 26340.1 lineto
stroke
newpath
29186.3 27521.2 moveto
28623.9 27521.2 lineto
28567.6 26958.8 lineto
28623.9 27015 lineto
28736.4 27071.3 lineto
29017.6 27071.3 lineto
29130.1 27015 lineto
29186.3 26958.8 lineto
29242.6 26846.3 lineto
29242.6 26565.1 lineto
29186.3 26452.6 lineto
29130.1 26396.4 lineto
29017.6 26340.1 lineto
28736.4 26340.1 lineto
28623.9 26396.4 lineto
28567.6 26452.6 lineto
stroke
newpath
29692.5 27521.2 moveto
29692.5 27296.2 lineto
stroke
newpath
30142.4 27521.2 moveto
30142.4 27296.2 lineto
stroke
newpath
31886 25890.2 moveto
31829.7 25946.4 lineto
31717.2 26115.1 lineto
31661 26227.6 lineto
31604.8 26396.4 lineto
31548.5 26677.6 lineto
31548.5 26902.5 lineto
31604.8 27183.8 lineto
31661 27352.5 lineto
31717.2 27465 lineto
31829.7 27633.7 lineto
31886 27689.9 lineto
stroke
newpath
32223.4 27521.2 moveto
32954.6 27521.2 lineto
32560.9 27071.3 lineto
32729.6 27071.3 lineto
32842.1 27015 lineto
32898.4 26958.8 lineto
32954.6 26846.3 lineto
32954.6 26565.1 lineto
32898.4 26452.6 lineto
32842.1 26396.4 lineto
32729.6 26340.1 lineto
32392.2 26340.1 lineto
32279.7 26396.4 lineto
32223.4 26452.6 lineto
stroke
newpath
34360.7 26340.1 moveto
34360.7 27521.2 lineto
stroke
newpath
34866.9 26340.1 moveto
34866.9 26958.8 lineto
34810.6 27071.3 lineto
34698.1 27127.5 lineto
34529.4 27127.5 lineto
34416.9 27071.3 lineto
34360.7 27015 lineto
stroke
newpath
35598 26340.1 moveto
35485.5 26396.4 lineto
35429.3 26452.6 lineto
35373 26565.1 lineto
35373 26902.5 lineto
35429.3 27015 lineto
35485.5 27071.3 lineto
35598 27127.5 lineto
35766.7 27127.5 lineto
35879.2 27071.3 lineto
35935.5 27015 lineto
35991.7 26902.5 lineto
35991.7 26565.1 lineto
35935.5 26452.6 lineto
35879.2 26396.4 lineto
35766.7 26340.1 lineto
35598 26340.1 lineto
stroke
newpath
36666.6 26340.1 moveto
36554.1 26396.4 lineto
36497.9 26508.8 lineto
36497.9 27521.2 lineto
stroke
newpath
37566.5 26396.4 moveto
37454 26340.1 lineto
37229.1 26340.1 lineto
37116.6 26396.4 lineto
37060.3 26508.8 lineto
37060.3 26958.8 lineto
37116.6 27071.3 lineto
37229.1 27127.5 lineto
37454 27127.5 lineto
37566.5 27071.3 lineto
37622.8 26958.8 lineto
37622.8 26846.3 lineto
37060.3 26733.8 lineto
stroke
newpath
38072.7 26396.4 moveto
38185.2 26340.1 lineto
38410.2 26340.1 lineto
38522.6 26396.4 lineto
38578.9 26508.8 lineto
38578.9 26565.1 lineto
38522.6 26677.6 lineto
38410.2 26733.8 lineto
38241.4 26733.8 lineto
38128.9 26790.1 lineto
38072.7 26902.5 lineto
38072.7 26958.8 lineto
38128.9 27071.3 lineto
38241.4 27127.5 lineto
38410.2 27127.5 lineto
38522.6 27071.3 lineto
stroke
newpath
38972.6 25890.2 moveto
39028.8 25946.4 lineto
39141.3 26115.1 lineto
39197.6 26227.6 lineto
39253.8 26396.4 lineto
39310.1 26677.6 lineto
39310.1 26902.5 lineto
39253.8 27183.8 lineto
39197.6 27352.5 lineto
39141.3 27465 lineto
39028.8 27633.7 lineto
38972.6 27689.9 lineto
stroke
showpage
grestore
%%EOF
