%!PS-Adobe-3.0
%%Creator: PCBNEW
%%CreationDate: Tue Sep 29 19:32:00 2020
%%Title: /home/kkrizka/Dropbox/HEP/ITkStrips/PowerBoard/plusminus5_adapter/gerbers/active_power-NPTH-drl_map.ps
%%Pages: 1
%%PageOrder: Ascend
%%BoundingBox: 0 0 596 842
%%DocumentMedia: A4 595 842 0 () ()
%%Orientation: Landscape
%%EndComments
%%BeginProlog
/line { newpath moveto lineto stroke } bind def
/cir0 { newpath 0 360 arc stroke } bind def
/cir1 { newpath 0 360 arc gsave fill grestore stroke } bind def
/cir2 { newpath 0 360 arc gsave fill grestore stroke } bind def
/arc0 { newpath arc stroke } bind def
/arc1 { newpath 4 index 4 index moveto arc closepath gsave fill
    grestore stroke } bind def
/arc2 { newpath 4 index 4 index moveto arc closepath gsave fill
    grestore stroke } bind def
/poly0 { stroke } bind def
/poly1 { closepath gsave fill grestore stroke } bind def
/poly2 { closepath gsave fill grestore stroke } bind def
/rect0 { rectstroke } bind def
/rect1 { rectfill } bind def
/rect2 { rectfill } bind def
/linemode0 { 0 setlinecap 0 setlinejoin 0 setlinewidth } bind def
/linemode1 { 1 setlinecap 1 setlinejoin } bind def
/dashedline { [200] 100 setdash } bind def
/solidline { [] 0 setdash } bind def
/phantomshow { moveto
    /KicadFont findfont 0.000001 scalefont setfont
    show } bind def
/textshow { gsave
    findfont exch scalefont setfont concat 1 scale 0 0 moveto show
    } bind def
/reencodefont {
  findfont dup length dict begin
  { 1 index /FID ne
    { def }
    { pop pop } ifelse
  } forall
  /Encoding ISOLatin1Encoding def
  currentdict
  end } bind def
/KicadFont /Helvetica reencodefont definefont pop
/KicadFont-Bold /Helvetica-Bold reencodefont definefont pop
/KicadFont-Oblique /Helvetica-Oblique reencodefont definefont pop
/KicadFont-BoldOblique /Helvetica-BoldOblique reencodefont definefont pop
%%EndProlog
%%Page: 1 1
%%BeginPageSetup
gsave
0.0072 0.0072 scale
linemode1
82680 0 translate 90 rotate
150 setlinewidth
%%EndPageSetup
0 0 0 setrgbcolor
59.0551 setlinewidth
newpath
13465 75876 moveto
13465 39876 lineto
stroke
0 0 0 setrgbcolor
newpath
103465 39876 moveto
13465 39876 lineto
stroke
0 0 0 setrgbcolor
newpath
103465 75876 moveto
103465 39876 lineto
stroke
0 0 0 setrgbcolor
newpath
13465 75876 moveto
103465 75876 lineto
stroke
78.7394 setlinewidth
newpath
94873.7 68869.7 moveto
98417 65326.4 lineto
stroke
newpath
98417 68869.7 moveto
94873.7 65326.4 lineto
stroke
118.11 setlinewidth
0 0 0 setrgbcolor
0 0 0 setrgbcolor
newpath
14563.1 38013 moveto
14563.1 39194.1 lineto
14844.4 39194.1 lineto
15013.1 39137.8 lineto
15125.6 39025.3 lineto
15181.8 38912.8 lineto
15238.1 38687.9 lineto
15238.1 38519.1 lineto
15181.8 38294.2 lineto
15125.6 38181.7 lineto
15013.1 38069.2 lineto
14844.4 38013 lineto
14563.1 38013 lineto
stroke
newpath
15744.2 38013 moveto
15744.2 38800.4 lineto
stroke
newpath
15744.2 38575.4 moveto
15800.5 38687.9 lineto
15856.7 38744.1 lineto
15969.2 38800.4 lineto
16081.7 38800.4 lineto
stroke
newpath
16475.4 38013 moveto
16475.4 38800.4 lineto
stroke
newpath
16475.4 39194.1 moveto
16419.2 39137.8 lineto
16475.4 39081.6 lineto
16531.6 39137.8 lineto
16475.4 39194.1 lineto
16475.4 39081.6 lineto
stroke
newpath
17206.6 38013 moveto
17094.1 38069.2 lineto
17037.8 38181.7 lineto
17037.8 39194.1 lineto
stroke
newpath
17825.2 38013 moveto
17712.7 38069.2 lineto
17656.5 38181.7 lineto
17656.5 39194.1 lineto
stroke
newpath
19175.1 38013 moveto
19175.1 39194.1 lineto
19568.8 38350.4 lineto
19962.5 39194.1 lineto
19962.5 38013 lineto
stroke
newpath
21031.1 38013 moveto
21031.1 38631.6 lineto
20974.8 38744.1 lineto
20862.4 38800.4 lineto
20637.4 38800.4 lineto
20524.9 38744.1 lineto
stroke
newpath
21031.1 38069.2 moveto
20918.6 38013 lineto
20637.4 38013 lineto
20524.9 38069.2 lineto
20468.7 38181.7 lineto
20468.7 38294.2 lineto
20524.9 38406.7 lineto
20637.4 38462.9 lineto
20918.6 38462.9 lineto
21031.1 38519.1 lineto
stroke
newpath
21593.5 38800.4 moveto
21593.5 37619.2 lineto
stroke
newpath
21593.5 38744.1 moveto
21706 38800.4 lineto
21931 38800.4 lineto
22043.5 38744.1 lineto
22099.7 38687.9 lineto
22155.9 38575.4 lineto
22155.9 38237.9 lineto
22099.7 38125.4 lineto
22043.5 38069.2 lineto
21931 38013 lineto
21706 38013 lineto
21593.5 38069.2 lineto
stroke
newpath
22662.1 38125.4 moveto
22718.4 38069.2 lineto
22662.1 38013 lineto
22605.9 38069.2 lineto
22662.1 38125.4 lineto
22662.1 38013 lineto
stroke
newpath
22662.1 38744.1 moveto
22718.4 38687.9 lineto
22662.1 38631.6 lineto
22605.9 38687.9 lineto
22662.1 38744.1 lineto
22662.1 38631.6 lineto
stroke
newpath
9892.16 37838.6 moveto
13435.5 34295.3 lineto
stroke
newpath
13435.5 37838.6 moveto
9892.16 34295.3 lineto
stroke
0 0 0 setrgbcolor
0 0 0 setrgbcolor
newpath
14450.7 36713.7 moveto
15181.8 36713.7 lineto
14788.1 36263.8 lineto
14956.8 36263.8 lineto
15069.3 36207.6 lineto
15125.6 36151.3 lineto
15181.8 36038.8 lineto
15181.8 35757.6 lineto
15125.6 35645.1 lineto
15069.3 35588.9 lineto
14956.8 35532.6 lineto
14619.4 35532.6 lineto
14506.9 35588.9 lineto
14450.7 35645.1 lineto
stroke
newpath
15688 35645.1 moveto
15744.2 35588.9 lineto
15688 35532.6 lineto
15631.8 35588.9 lineto
15688 35645.1 lineto
15688 35532.6 lineto
stroke
newpath
16475.4 36713.7 moveto
16587.9 36713.7 lineto
16700.4 36657.5 lineto
16756.6 36601.3 lineto
16812.9 36488.8 lineto
16869.1 36263.8 lineto
16869.1 35982.6 lineto
16812.9 35757.6 lineto
16756.6 35645.1 lineto
16700.4 35588.9 lineto
16587.9 35532.6 lineto
16475.4 35532.6 lineto
16362.9 35588.9 lineto
16306.7 35645.1 lineto
16250.4 35757.6 lineto
16194.2 35982.6 lineto
16194.2 36263.8 lineto
16250.4 36488.8 lineto
16306.7 36601.3 lineto
16362.9 36657.5 lineto
16475.4 36713.7 lineto
stroke
newpath
17600.3 36713.7 moveto
17712.7 36713.7 lineto
17825.2 36657.5 lineto
17881.5 36601.3 lineto
17937.7 36488.8 lineto
17994 36263.8 lineto
17994 35982.6 lineto
17937.7 35757.6 lineto
17881.5 35645.1 lineto
17825.2 35588.9 lineto
17712.7 35532.6 lineto
17600.3 35532.6 lineto
17487.8 35588.9 lineto
17431.5 35645.1 lineto
17375.3 35757.6 lineto
17319 35982.6 lineto
17319 36263.8 lineto
17375.3 36488.8 lineto
17431.5 36601.3 lineto
17487.8 36657.5 lineto
17600.3 36713.7 lineto
stroke
newpath
18500.2 35532.6 moveto
18500.2 36320 lineto
stroke
newpath
18500.2 36207.6 moveto
18556.4 36263.8 lineto
18668.9 36320 lineto
18837.6 36320 lineto
18950.1 36263.8 lineto
19006.3 36151.3 lineto
19006.3 35532.6 lineto
stroke
newpath
19006.3 36151.3 moveto
19062.6 36263.8 lineto
19175.1 36320 lineto
19343.8 36320 lineto
19456.3 36263.8 lineto
19512.5 36151.3 lineto
19512.5 35532.6 lineto
stroke
newpath
20075 35532.6 moveto
20075 36320 lineto
stroke
newpath
20075 36207.6 moveto
20131.2 36263.8 lineto
20243.7 36320 lineto
20412.4 36320 lineto
20524.9 36263.8 lineto
20581.1 36151.3 lineto
20581.1 35532.6 lineto
stroke
newpath
20581.1 36151.3 moveto
20637.4 36263.8 lineto
20749.9 36320 lineto
20918.6 36320 lineto
21031.1 36263.8 lineto
21087.3 36151.3 lineto
21087.3 35532.6 lineto
stroke
newpath
23393.3 36770 moveto
22380.9 35251.4 lineto
stroke
newpath
24911.8 36713.7 moveto
25024.3 36713.7 lineto
25136.8 36657.5 lineto
25193.1 36601.3 lineto
25249.3 36488.8 lineto
25305.6 36263.8 lineto
25305.6 35982.6 lineto
25249.3 35757.6 lineto
25193.1 35645.1 lineto
25136.8 35588.9 lineto
25024.3 35532.6 lineto
24911.8 35532.6 lineto
24799.4 35588.9 lineto
24743.1 35645.1 lineto
24686.9 35757.6 lineto
24630.6 35982.6 lineto
24630.6 36263.8 lineto
24686.9 36488.8 lineto
24743.1 36601.3 lineto
24799.4 36657.5 lineto
24911.8 36713.7 lineto
stroke
newpath
25811.7 35645.1 moveto
25868 35588.9 lineto
25811.7 35532.6 lineto
25755.5 35588.9 lineto
25811.7 35645.1 lineto
25811.7 35532.6 lineto
stroke
newpath
26992.8 35532.6 moveto
26317.9 35532.6 lineto
stroke
newpath
26655.4 35532.6 moveto
26655.4 36713.7 lineto
26542.9 36545 lineto
26430.4 36432.5 lineto
26317.9 36376.3 lineto
stroke
newpath
28117.7 35532.6 moveto
27442.8 35532.6 lineto
stroke
newpath
27780.2 35532.6 moveto
27780.2 36713.7 lineto
27667.8 36545 lineto
27555.3 36432.5 lineto
27442.8 36376.3 lineto
stroke
newpath
28792.6 36207.6 moveto
28680.1 36263.8 lineto
28623.9 36320 lineto
28567.6 36432.5 lineto
28567.6 36488.8 lineto
28623.9 36601.3 lineto
28680.1 36657.5 lineto
28792.6 36713.7 lineto
29017.6 36713.7 lineto
29130.1 36657.5 lineto
29186.3 36601.3 lineto
29242.6 36488.8 lineto
29242.6 36432.5 lineto
29186.3 36320 lineto
29130.1 36263.8 lineto
29017.6 36207.6 lineto
28792.6 36207.6 lineto
28680.1 36151.3 lineto
28623.9 36095.1 lineto
28567.6 35982.6 lineto
28567.6 35757.6 lineto
28623.9 35645.1 lineto
28680.1 35588.9 lineto
28792.6 35532.6 lineto
29017.6 35532.6 lineto
29130.1 35588.9 lineto
29186.3 35645.1 lineto
29242.6 35757.6 lineto
29242.6 35982.6 lineto
29186.3 36095.1 lineto
29130.1 36151.3 lineto
29017.6 36207.6 lineto
stroke
newpath
29692.5 36713.7 moveto
29692.5 36488.8 lineto
stroke
newpath
30142.4 36713.7 moveto
30142.4 36488.8 lineto
stroke
newpath
31886 35082.7 moveto
31829.7 35138.9 lineto
31717.2 35307.7 lineto
31661 35420.1 lineto
31604.8 35588.9 lineto
31548.5 35870.1 lineto
31548.5 36095.1 lineto
31604.8 36376.3 lineto
31661 36545 lineto
31717.2 36657.5 lineto
31829.7 36826.2 lineto
31886 36882.5 lineto
stroke
newpath
32954.6 35532.6 moveto
32279.7 35532.6 lineto
stroke
newpath
32617.1 35532.6 moveto
32617.1 36713.7 lineto
32504.7 36545 lineto
32392.2 36432.5 lineto
32279.7 36376.3 lineto
stroke
newpath
34360.7 35532.6 moveto
34360.7 36713.7 lineto
stroke
newpath
34866.9 35532.6 moveto
34866.9 36151.3 lineto
34810.6 36263.8 lineto
34698.1 36320 lineto
34529.4 36320 lineto
34416.9 36263.8 lineto
34360.7 36207.6 lineto
stroke
newpath
35598 35532.6 moveto
35485.5 35588.9 lineto
35429.3 35645.1 lineto
35373 35757.6 lineto
35373 36095.1 lineto
35429.3 36207.6 lineto
35485.5 36263.8 lineto
35598 36320 lineto
35766.7 36320 lineto
35879.2 36263.8 lineto
35935.5 36207.6 lineto
35991.7 36095.1 lineto
35991.7 35757.6 lineto
35935.5 35645.1 lineto
35879.2 35588.9 lineto
35766.7 35532.6 lineto
35598 35532.6 lineto
stroke
newpath
36666.6 35532.6 moveto
36554.1 35588.9 lineto
36497.9 35701.4 lineto
36497.9 36713.7 lineto
stroke
newpath
37566.5 35588.9 moveto
37454 35532.6 lineto
37229.1 35532.6 lineto
37116.6 35588.9 lineto
37060.3 35701.4 lineto
37060.3 36151.3 lineto
37116.6 36263.8 lineto
37229.1 36320 lineto
37454 36320 lineto
37566.5 36263.8 lineto
37622.8 36151.3 lineto
37622.8 36038.8 lineto
37060.3 35926.3 lineto
stroke
newpath
38016.5 35082.7 moveto
38072.7 35138.9 lineto
38185.2 35307.7 lineto
38241.4 35420.1 lineto
38297.7 35588.9 lineto
38353.9 35870.1 lineto
38353.9 36095.1 lineto
38297.7 36376.3 lineto
38241.4 36545 lineto
38185.2 36657.5 lineto
38072.7 36826.2 lineto
38016.5 36882.5 lineto
stroke
newpath
40153.7 35082.7 moveto
40097.5 35138.9 lineto
39985 35307.7 lineto
39928.7 35420.1 lineto
39872.5 35588.9 lineto
39816.2 35870.1 lineto
39816.2 36095.1 lineto
39872.5 36376.3 lineto
39928.7 36545 lineto
39985 36657.5 lineto
40097.5 36826.2 lineto
40153.7 36882.5 lineto
stroke
newpath
40603.6 36320 moveto
40603.6 35532.6 lineto
stroke
newpath
40603.6 36207.6 moveto
40659.9 36263.8 lineto
40772.4 36320 lineto
40941.1 36320 lineto
41053.6 36263.8 lineto
41109.8 36151.3 lineto
41109.8 35532.6 lineto
stroke
newpath
41841 35532.6 moveto
41728.5 35588.9 lineto
41672.3 35645.1 lineto
41616 35757.6 lineto
41616 36095.1 lineto
41672.3 36207.6 lineto
41728.5 36263.8 lineto
41841 36320 lineto
42009.7 36320 lineto
42122.2 36263.8 lineto
42178.4 36207.6 lineto
42234.7 36095.1 lineto
42234.7 35757.6 lineto
42178.4 35645.1 lineto
42122.2 35588.9 lineto
42009.7 35532.6 lineto
41841 35532.6 lineto
stroke
newpath
42572.1 36320 moveto
43022.1 36320 lineto
stroke
newpath
42740.9 36713.7 moveto
42740.9 35701.4 lineto
42797.1 35588.9 lineto
42909.6 35532.6 lineto
43022.1 35532.6 lineto
stroke
newpath
44315.7 36320 moveto
44315.7 35138.9 lineto
stroke
newpath
44315.7 36263.8 moveto
44428.2 36320 lineto
44653.1 36320 lineto
44765.6 36263.8 lineto
44821.9 36207.6 lineto
44878.1 36095.1 lineto
44878.1 35757.6 lineto
44821.9 35645.1 lineto
44765.6 35588.9 lineto
44653.1 35532.6 lineto
44428.2 35532.6 lineto
44315.7 35588.9 lineto
stroke
newpath
45553 35532.6 moveto
45440.5 35588.9 lineto
45384.3 35701.4 lineto
45384.3 36713.7 lineto
stroke
newpath
46509.2 35532.6 moveto
46509.2 36151.3 lineto
46452.9 36263.8 lineto
46340.4 36320 lineto
46115.4 36320 lineto
46003 36263.8 lineto
stroke
newpath
46509.2 35588.9 moveto
46396.7 35532.6 lineto
46115.4 35532.6 lineto
46003 35588.9 lineto
45946.7 35701.4 lineto
45946.7 35813.9 lineto
46003 35926.3 lineto
46115.4 35982.6 lineto
46396.7 35982.6 lineto
46509.2 36038.8 lineto
stroke
newpath
46902.9 36320 moveto
47352.8 36320 lineto
stroke
newpath
47071.6 36713.7 moveto
47071.6 35701.4 lineto
47127.8 35588.9 lineto
47240.3 35532.6 lineto
47352.8 35532.6 lineto
stroke
newpath
48196.4 35588.9 moveto
48084 35532.6 lineto
47859 35532.6 lineto
47746.5 35588.9 lineto
47690.3 35701.4 lineto
47690.3 36151.3 lineto
47746.5 36263.8 lineto
47859 36320 lineto
48084 36320 lineto
48196.4 36263.8 lineto
48252.7 36151.3 lineto
48252.7 36038.8 lineto
47690.3 35926.3 lineto
stroke
newpath
49265.1 35532.6 moveto
49265.1 36713.7 lineto
stroke
newpath
49265.1 35588.9 moveto
49152.6 35532.6 lineto
48927.6 35532.6 lineto
48815.1 35588.9 lineto
48758.9 35645.1 lineto
48702.6 35757.6 lineto
48702.6 36095.1 lineto
48758.9 36207.6 lineto
48815.1 36263.8 lineto
48927.6 36320 lineto
49152.6 36320 lineto
49265.1 36263.8 lineto
stroke
newpath
49715 35082.7 moveto
49771.2 35138.9 lineto
49883.7 35307.7 lineto
49940 35420.1 lineto
49996.2 35588.9 lineto
50052.5 35870.1 lineto
50052.5 36095.1 lineto
49996.2 36376.3 lineto
49940 36545 lineto
49883.7 36657.5 lineto
49771.2 36826.2 lineto
49715 36882.5 lineto
stroke
showpage
grestore
%%EOF
