EESchema Schematic File Version 4
EELAYER 30 0
EELAYER END
$Descr A4 11693 8268
encoding utf-8
Sheet 1 1
Title ""
Date ""
Rev ""
Comp ""
Comment1 ""
Comment2 ""
Comment3 ""
Comment4 ""
$EndDescr
$Comp
L Device:CP1 C1
U 1 1 5F5ABB67
P 4100 2700
F 0 "C1" H 4215 2746 50  0000 L CNN
F 1 "680uF" H 4215 2655 50  0000 L CNN
F 2 "Capacitor_SMD:CP_Elec_10x10" H 4100 2700 50  0001 C CNN
F 3 "~" H 4100 2700 50  0001 C CNN
	1    4100 2700
	1    0    0    -1  
$EndComp
$Comp
L Connector_Generic:Conn_02x02_Odd_Even J2
U 1 1 5F5B3891
P 8125 2575
F 0 "J2" H 8175 2792 50  0000 C CNN
F 1 "Conn_02x02_Odd_Even" H 8175 2701 50  0000 C CNN
F 2 "Connector_Molex:Molex_Mini-Fit_Jr_5569-04A2_2x02_P4.20mm_Horizontal" H 8125 2575 50  0001 C CNN
F 3 "~" H 8125 2575 50  0001 C CNN
	1    8125 2575
	1    0    0    -1  
$EndComp
Wire Wire Line
	7925 2575 8425 2575
Wire Wire Line
	8425 2575 8900 2575
Wire Wire Line
	8900 2575 8900 2650
Connection ~ 8425 2575
Text Label 8550 2675 0    50   ~ 0
mVout
Wire Wire Line
	8425 2675 8550 2675
$Comp
L lbl_dcdc:NSD10-12D5 U1
U 1 1 5F7395DE
P 4750 2650
F 0 "U1" H 4750 3015 50  0000 C CNN
F 1 "NSD10-12D5" H 4750 2924 50  0000 C CNN
F 2 "lbl_dcdc:NDS10-D" H 4750 2650 50  0001 C CNN
F 3 "https://www.meanwell.com/Upload/PDF/NSD10-D/NSD10-D-SPEC.PDF" H 4750 2650 50  0001 C CNN
	1    4750 2650
	1    0    0    -1  
$EndComp
NoConn ~ 4350 3150
Wire Wire Line
	3850 2550 4100 2550
Connection ~ 4100 2550
Wire Wire Line
	4100 2550 4225 2550
Wire Wire Line
	4350 2850 4100 2850
Connection ~ 4100 2850
Wire Wire Line
	4100 2850 3850 2850
$Comp
L power:GND1 #PWR0101
U 1 1 5F73F683
P 8900 2650
F 0 "#PWR0101" H 8900 2400 50  0001 C CNN
F 1 "GND1" H 8905 2477 50  0000 C CNN
F 2 "" H 8900 2650 50  0001 C CNN
F 3 "" H 8900 2650 50  0001 C CNN
	1    8900 2650
	1    0    0    -1  
$EndComp
$Comp
L power:GND1 #PWR0102
U 1 1 5F73FE84
P 5300 2850
F 0 "#PWR0102" H 5300 2600 50  0001 C CNN
F 1 "GND1" H 5305 2677 50  0000 C CNN
F 2 "" H 5300 2850 50  0001 C CNN
F 3 "" H 5300 2850 50  0001 C CNN
	1    5300 2850
	1    0    0    -1  
$EndComp
Wire Wire Line
	5150 2850 5300 2850
$Comp
L Connector:Barrel_Jack_Switch J1
U 1 1 5F741C9A
P 1475 2700
F 0 "J1" H 1532 3017 50  0000 C CNN
F 1 "Barrel_Jack_Switch" H 1532 2926 50  0000 C CNN
F 2 "Connector_BarrelJack:BarrelJack_Wuerth_6941xx301002" H 1525 2660 50  0001 C CNN
F 3 "~" H 1525 2660 50  0001 C CNN
	1    1475 2700
	1    0    0    -1  
$EndComp
NoConn ~ 1775 2700
Wire Wire Line
	3400 2800 3300 2800
Wire Wire Line
	3400 2600 3300 2600
$Comp
L power:GND #PWR0103
U 1 1 5F7441A8
P 2400 2800
F 0 "#PWR0103" H 2400 2550 50  0001 C CNN
F 1 "GND" H 2405 2627 50  0000 C CNN
F 2 "" H 2400 2800 50  0001 C CNN
F 3 "" H 2400 2800 50  0001 C CNN
	1    2400 2800
	1    0    0    -1  
$EndComp
$Comp
L power:GND #PWR0104
U 1 1 5F74455A
P 3300 2800
F 0 "#PWR0104" H 3300 2550 50  0001 C CNN
F 1 "GND" H 3305 2627 50  0000 C CNN
F 2 "" H 3300 2800 50  0001 C CNN
F 3 "" H 3300 2800 50  0001 C CNN
	1    3300 2800
	1    0    0    -1  
$EndComp
$Comp
L power:+12V #PWR0105
U 1 1 5F744A29
P 2400 2600
F 0 "#PWR0105" H 2400 2450 50  0001 C CNN
F 1 "+12V" H 2415 2773 50  0000 C CNN
F 2 "" H 2400 2600 50  0001 C CNN
F 3 "" H 2400 2600 50  0001 C CNN
	1    2400 2600
	1    0    0    -1  
$EndComp
$Comp
L power:+12V #PWR0106
U 1 1 5F744EFD
P 3300 2600
F 0 "#PWR0106" H 3300 2450 50  0001 C CNN
F 1 "+12V" H 3315 2773 50  0000 C CNN
F 2 "" H 3300 2600 50  0001 C CNN
F 3 "" H 3300 2600 50  0001 C CNN
	1    3300 2600
	1    0    0    -1  
$EndComp
$Comp
L power:PWR_FLAG #FLG0102
U 1 1 5F7479C3
P 2500 1250
F 0 "#FLG0102" H 2500 1325 50  0001 C CNN
F 1 "PWR_FLAG" H 2500 1423 50  0000 C CNN
F 2 "" H 2500 1250 50  0001 C CNN
F 3 "~" H 2500 1250 50  0001 C CNN
	1    2500 1250
	1    0    0    -1  
$EndComp
$Comp
L power:GND1 #PWR0107
U 1 1 5F747C44
P 2500 1300
F 0 "#PWR0107" H 2500 1050 50  0001 C CNN
F 1 "GND1" H 2505 1127 50  0000 C CNN
F 2 "" H 2500 1300 50  0001 C CNN
F 3 "" H 2500 1300 50  0001 C CNN
	1    2500 1300
	1    0    0    -1  
$EndComp
Wire Wire Line
	2500 1250 2500 1300
$Comp
L power:PWR_FLAG #FLG0103
U 1 1 5F748391
P 2000 1250
F 0 "#FLG0103" H 2000 1325 50  0001 C CNN
F 1 "PWR_FLAG" H 2000 1423 50  0000 C CNN
F 2 "" H 2000 1250 50  0001 C CNN
F 3 "~" H 2000 1250 50  0001 C CNN
	1    2000 1250
	1    0    0    -1  
$EndComp
$Comp
L power:GND #PWR0108
U 1 1 5F748790
P 2000 1300
F 0 "#PWR0108" H 2000 1050 50  0001 C CNN
F 1 "GND" H 2005 1127 50  0000 C CNN
F 2 "" H 2000 1300 50  0001 C CNN
F 3 "" H 2000 1300 50  0001 C CNN
	1    2000 1300
	1    0    0    -1  
$EndComp
Wire Wire Line
	2000 1300 2000 1250
Wire Wire Line
	1775 2800 2400 2800
$Comp
L power:PWR_FLAG #FLG0104
U 1 1 5F7490F7
P 4225 2550
F 0 "#FLG0104" H 4225 2625 50  0001 C CNN
F 1 "PWR_FLAG" H 4225 2723 50  0000 C CNN
F 2 "" H 4225 2550 50  0001 C CNN
F 3 "~" H 4225 2550 50  0001 C CNN
	1    4225 2550
	1    0    0    -1  
$EndComp
Connection ~ 4225 2550
Wire Wire Line
	4225 2550 4350 2550
Wire Wire Line
	1775 2600 2400 2600
$Comp
L power:+12V #PWR0109
U 1 1 5F7496D6
P 1000 1250
F 0 "#PWR0109" H 1000 1100 50  0001 C CNN
F 1 "+12V" H 1015 1423 50  0000 C CNN
F 2 "" H 1000 1250 50  0001 C CNN
F 3 "" H 1000 1250 50  0001 C CNN
	1    1000 1250
	1    0    0    -1  
$EndComp
$Comp
L power:PWR_FLAG #FLG0101
U 1 1 5F74A228
P 1325 1250
F 0 "#FLG0101" H 1325 1325 50  0001 C CNN
F 1 "PWR_FLAG" H 1325 1423 50  0000 C CNN
F 2 "" H 1325 1250 50  0001 C CNN
F 3 "~" H 1325 1250 50  0001 C CNN
	1    1325 1250
	1    0    0    -1  
$EndComp
Wire Wire Line
	1000 1250 1325 1250
$Comp
L lbl_dcdc:TC59 U2
U 1 1 5F752C15
P 6225 3150
F 0 "U2" H 6225 3415 50  0000 C CNN
F 1 "TC59" H 6225 3324 50  0000 C CNN
F 2 "Package_TO_SOT_SMD:SOT-23W" H 6225 3400 50  0001 C CNN
F 3 "https://ww1.microchip.com/downloads/en/DeviceDoc/21438C.pdf" H 6225 3150 50  0001 C CNN
	1    6225 3150
	1    0    0    -1  
$EndComp
$Comp
L power:GND1 #PWR0110
U 1 1 5F7534CC
P 6225 3600
F 0 "#PWR0110" H 6225 3350 50  0001 C CNN
F 1 "GND1" H 6230 3427 50  0000 C CNN
F 2 "" H 6225 3600 50  0001 C CNN
F 3 "" H 6225 3600 50  0001 C CNN
	1    6225 3600
	1    0    0    -1  
$EndComp
Wire Wire Line
	6225 3600 6225 3550
Wire Wire Line
	5150 3150 5425 3150
Wire Wire Line
	6675 3150 6750 3150
Text Label 6925 3150 0    50   ~ 0
mVout
$Comp
L Device:C C2
U 1 1 5F755B08
P 5425 3300
F 0 "C2" H 5540 3346 50  0000 L CNN
F 1 "1uF" H 5540 3255 50  0000 L CNN
F 2 "Capacitor_SMD:C_0805_2012Metric" H 5463 3150 50  0001 C CNN
F 3 "~" H 5425 3300 50  0001 C CNN
	1    5425 3300
	1    0    0    -1  
$EndComp
Connection ~ 5425 3150
$Comp
L power:GND1 #PWR0111
U 1 1 5F756116
P 5425 3600
F 0 "#PWR0111" H 5425 3350 50  0001 C CNN
F 1 "GND1" H 5430 3427 50  0000 C CNN
F 2 "" H 5425 3600 50  0001 C CNN
F 3 "" H 5425 3600 50  0001 C CNN
	1    5425 3600
	1    0    0    -1  
$EndComp
Wire Wire Line
	5425 3450 5425 3600
Wire Wire Line
	5425 3150 5775 3150
$Comp
L Device:C C3
U 1 1 5F758647
P 6750 3300
F 0 "C3" H 6865 3346 50  0000 L CNN
F 1 "1uF" H 6865 3255 50  0000 L CNN
F 2 "Capacitor_SMD:C_0805_2012Metric" H 6788 3150 50  0001 C CNN
F 3 "~" H 6750 3300 50  0001 C CNN
	1    6750 3300
	1    0    0    -1  
$EndComp
$Comp
L power:GND1 #PWR0112
U 1 1 5F75864D
P 6750 3600
F 0 "#PWR0112" H 6750 3350 50  0001 C CNN
F 1 "GND1" H 6755 3427 50  0000 C CNN
F 2 "" H 6750 3600 50  0001 C CNN
F 3 "" H 6750 3600 50  0001 C CNN
	1    6750 3600
	1    0    0    -1  
$EndComp
Wire Wire Line
	6750 3450 6750 3600
Connection ~ 6750 3150
Wire Wire Line
	6750 3150 6925 3150
$Comp
L Device:EMI_Filter_CLC FL1
U 1 1 5F7713F7
P 5700 2650
F 0 "FL1" H 5700 2967 50  0000 C CNN
F 1 "4700-003MLF" H 5700 2876 50  0000 C CNN
F 2 "lbl_filters:4700-008MLF" V 5700 2650 50  0001 C CNN
F 3 "http://www.murata.com/~/media/webrenewal/support/library/catalog/products/emc/emifil/c31e.ashx?la=en-gb" V 5700 2650 50  0001 C CNN
	1    5700 2650
	1    0    0    -1  
$EndComp
Wire Wire Line
	5150 2550 5400 2550
Wire Wire Line
	6000 2550 6925 2550
Text Label 6925 2550 0    50   ~ 0
pVout
Text Label 7925 2675 2    50   ~ 0
pVout
$Comp
L power:GND1 #PWR0113
U 1 1 5F775FB1
P 5700 2800
F 0 "#PWR0113" H 5700 2550 50  0001 C CNN
F 1 "GND1" H 5705 2627 50  0000 C CNN
F 2 "" H 5700 2800 50  0001 C CNN
F 3 "" H 5700 2800 50  0001 C CNN
	1    5700 2800
	1    0    0    -1  
$EndComp
Wire Wire Line
	5700 2800 5700 2750
$Comp
L Device:L_Coupled L1
U 1 1 5F73DFE3
P 3600 2700
F 0 "L1" H 3600 2981 50  0000 C CNN
F 1 "80uH" H 3600 2890 50  0000 C CNN
F 2 "lbl_filters:SU10VD-10080" H 3600 2700 50  0001 C CNN
F 3 "~" H 3600 2700 50  0001 C CNN
	1    3600 2700
	1    0    0    -1  
$EndComp
Wire Wire Line
	3800 2600 3850 2600
Wire Wire Line
	3850 2600 3850 2550
Wire Wire Line
	3850 2850 3850 2800
Wire Wire Line
	3850 2800 3800 2800
$EndSCHEMATC
