(kicad_sch (version 20230121) (generator eeschema)

  (uuid 4999e665-d242-4312-ace5-5c56c161431b)

  (paper "A4")

  (lib_symbols
    (symbol "74xx:CD74HC4067M" (in_bom yes) (on_board yes)
      (property "Reference" "U" (at -8.89 22.86 0)
        (effects (font (size 1.27 1.27)) (justify left))
      )
      (property "Value" "CD74HC4067M" (at 1.27 22.86 0)
        (effects (font (size 1.27 1.27)) (justify left))
      )
      (property "Footprint" "Package_SO:SOIC-24W_7.5x15.4mm_P1.27mm" (at 22.86 -25.4 0)
        (effects (font (size 1.27 1.27) italic) hide)
      )
      (property "Datasheet" "http://www.ti.com/lit/ds/symlink/cd74hc4067.pdf" (at -8.89 21.59 0)
        (effects (font (size 1.27 1.27)) hide)
      )
      (property "ki_keywords" "multiplexer demultiplexer mux demux" (at 0 0 0)
        (effects (font (size 1.27 1.27)) hide)
      )
      (property "ki_description" "High-Speed CMOS Logic 16-Channel Analog Multiplexer/Demultiplexer, SOIC-24" (at 0 0 0)
        (effects (font (size 1.27 1.27)) hide)
      )
      (property "ki_fp_filters" "SOIC*W*7.5x15.4mm*P1.27mm*" (at 0 0 0)
        (effects (font (size 1.27 1.27)) hide)
      )
      (symbol "CD74HC4067M_0_1"
        (rectangle (start -8.89 21.59) (end 8.89 -24.13)
          (stroke (width 0.254) (type default))
          (fill (type background))
        )
      )
      (symbol "CD74HC4067M_1_1"
        (pin passive line (at -12.7 12.7 0) (length 3.81)
          (name "COM" (effects (font (size 1.27 1.27))))
          (number "1" (effects (font (size 1.27 1.27))))
        )
        (pin input line (at -12.7 2.54 0) (length 3.81)
          (name "S0" (effects (font (size 1.27 1.27))))
          (number "10" (effects (font (size 1.27 1.27))))
        )
        (pin input line (at -12.7 0 0) (length 3.81)
          (name "S1" (effects (font (size 1.27 1.27))))
          (number "11" (effects (font (size 1.27 1.27))))
        )
        (pin power_in line (at 0 -27.94 90) (length 3.81)
          (name "GND" (effects (font (size 1.27 1.27))))
          (number "12" (effects (font (size 1.27 1.27))))
        )
        (pin input line (at -12.7 -5.08 0) (length 3.81)
          (name "S3" (effects (font (size 1.27 1.27))))
          (number "13" (effects (font (size 1.27 1.27))))
        )
        (pin input line (at -12.7 -2.54 0) (length 3.81)
          (name "S2" (effects (font (size 1.27 1.27))))
          (number "14" (effects (font (size 1.27 1.27))))
        )
        (pin input line (at -12.7 -15.24 0) (length 3.81)
          (name "~{E}" (effects (font (size 1.27 1.27))))
          (number "15" (effects (font (size 1.27 1.27))))
        )
        (pin passive line (at 12.7 -20.32 180) (length 3.81)
          (name "I15" (effects (font (size 1.27 1.27))))
          (number "16" (effects (font (size 1.27 1.27))))
        )
        (pin passive line (at 12.7 -17.78 180) (length 3.81)
          (name "I14" (effects (font (size 1.27 1.27))))
          (number "17" (effects (font (size 1.27 1.27))))
        )
        (pin passive line (at 12.7 -15.24 180) (length 3.81)
          (name "I13" (effects (font (size 1.27 1.27))))
          (number "18" (effects (font (size 1.27 1.27))))
        )
        (pin passive line (at 12.7 -12.7 180) (length 3.81)
          (name "I12" (effects (font (size 1.27 1.27))))
          (number "19" (effects (font (size 1.27 1.27))))
        )
        (pin passive line (at 12.7 0 180) (length 3.81)
          (name "I7" (effects (font (size 1.27 1.27))))
          (number "2" (effects (font (size 1.27 1.27))))
        )
        (pin passive line (at 12.7 -10.16 180) (length 3.81)
          (name "I11" (effects (font (size 1.27 1.27))))
          (number "20" (effects (font (size 1.27 1.27))))
        )
        (pin passive line (at 12.7 -7.62 180) (length 3.81)
          (name "I10" (effects (font (size 1.27 1.27))))
          (number "21" (effects (font (size 1.27 1.27))))
        )
        (pin passive line (at 12.7 -5.08 180) (length 3.81)
          (name "I9" (effects (font (size 1.27 1.27))))
          (number "22" (effects (font (size 1.27 1.27))))
        )
        (pin passive line (at 12.7 -2.54 180) (length 3.81)
          (name "I8" (effects (font (size 1.27 1.27))))
          (number "23" (effects (font (size 1.27 1.27))))
        )
        (pin power_in line (at 0 25.4 270) (length 3.81)
          (name "VCC" (effects (font (size 1.27 1.27))))
          (number "24" (effects (font (size 1.27 1.27))))
        )
        (pin passive line (at 12.7 2.54 180) (length 3.81)
          (name "I6" (effects (font (size 1.27 1.27))))
          (number "3" (effects (font (size 1.27 1.27))))
        )
        (pin passive line (at 12.7 5.08 180) (length 3.81)
          (name "I5" (effects (font (size 1.27 1.27))))
          (number "4" (effects (font (size 1.27 1.27))))
        )
        (pin passive line (at 12.7 7.62 180) (length 3.81)
          (name "I4" (effects (font (size 1.27 1.27))))
          (number "5" (effects (font (size 1.27 1.27))))
        )
        (pin passive line (at 12.7 10.16 180) (length 3.81)
          (name "I3" (effects (font (size 1.27 1.27))))
          (number "6" (effects (font (size 1.27 1.27))))
        )
        (pin passive line (at 12.7 12.7 180) (length 3.81)
          (name "I2" (effects (font (size 1.27 1.27))))
          (number "7" (effects (font (size 1.27 1.27))))
        )
        (pin passive line (at 12.7 15.24 180) (length 3.81)
          (name "I1" (effects (font (size 1.27 1.27))))
          (number "8" (effects (font (size 1.27 1.27))))
        )
        (pin passive line (at 12.7 17.78 180) (length 3.81)
          (name "I0" (effects (font (size 1.27 1.27))))
          (number "9" (effects (font (size 1.27 1.27))))
        )
      )
    )
    (symbol "Device:C" (pin_numbers hide) (pin_names (offset 0.254)) (in_bom yes) (on_board yes)
      (property "Reference" "C" (at 0.635 2.54 0)
        (effects (font (size 1.27 1.27)) (justify left))
      )
      (property "Value" "C" (at 0.635 -2.54 0)
        (effects (font (size 1.27 1.27)) (justify left))
      )
      (property "Footprint" "" (at 0.9652 -3.81 0)
        (effects (font (size 1.27 1.27)) hide)
      )
      (property "Datasheet" "~" (at 0 0 0)
        (effects (font (size 1.27 1.27)) hide)
      )
      (property "ki_keywords" "cap capacitor" (at 0 0 0)
        (effects (font (size 1.27 1.27)) hide)
      )
      (property "ki_description" "Unpolarized capacitor" (at 0 0 0)
        (effects (font (size 1.27 1.27)) hide)
      )
      (property "ki_fp_filters" "C_*" (at 0 0 0)
        (effects (font (size 1.27 1.27)) hide)
      )
      (symbol "C_0_1"
        (polyline
          (pts
            (xy -2.032 -0.762)
            (xy 2.032 -0.762)
          )
          (stroke (width 0.508) (type default))
          (fill (type none))
        )
        (polyline
          (pts
            (xy -2.032 0.762)
            (xy 2.032 0.762)
          )
          (stroke (width 0.508) (type default))
          (fill (type none))
        )
      )
      (symbol "C_1_1"
        (pin passive line (at 0 3.81 270) (length 2.794)
          (name "~" (effects (font (size 1.27 1.27))))
          (number "1" (effects (font (size 1.27 1.27))))
        )
        (pin passive line (at 0 -3.81 90) (length 2.794)
          (name "~" (effects (font (size 1.27 1.27))))
          (number "2" (effects (font (size 1.27 1.27))))
        )
      )
    )
    (symbol "Device:D_Zener" (pin_numbers hide) (pin_names (offset 1.016) hide) (in_bom yes) (on_board yes)
      (property "Reference" "D" (at 0 2.54 0)
        (effects (font (size 1.27 1.27)))
      )
      (property "Value" "D_Zener" (at 0 -2.54 0)
        (effects (font (size 1.27 1.27)))
      )
      (property "Footprint" "" (at 0 0 0)
        (effects (font (size 1.27 1.27)) hide)
      )
      (property "Datasheet" "~" (at 0 0 0)
        (effects (font (size 1.27 1.27)) hide)
      )
      (property "ki_keywords" "diode" (at 0 0 0)
        (effects (font (size 1.27 1.27)) hide)
      )
      (property "ki_description" "Zener diode" (at 0 0 0)
        (effects (font (size 1.27 1.27)) hide)
      )
      (property "ki_fp_filters" "TO-???* *_Diode_* *SingleDiode* D_*" (at 0 0 0)
        (effects (font (size 1.27 1.27)) hide)
      )
      (symbol "D_Zener_0_1"
        (polyline
          (pts
            (xy 1.27 0)
            (xy -1.27 0)
          )
          (stroke (width 0) (type default))
          (fill (type none))
        )
        (polyline
          (pts
            (xy -1.27 -1.27)
            (xy -1.27 1.27)
            (xy -0.762 1.27)
          )
          (stroke (width 0.254) (type default))
          (fill (type none))
        )
        (polyline
          (pts
            (xy 1.27 -1.27)
            (xy 1.27 1.27)
            (xy -1.27 0)
            (xy 1.27 -1.27)
          )
          (stroke (width 0.254) (type default))
          (fill (type none))
        )
      )
      (symbol "D_Zener_1_1"
        (pin passive line (at -3.81 0 0) (length 2.54)
          (name "K" (effects (font (size 1.27 1.27))))
          (number "1" (effects (font (size 1.27 1.27))))
        )
        (pin passive line (at 3.81 0 180) (length 2.54)
          (name "A" (effects (font (size 1.27 1.27))))
          (number "2" (effects (font (size 1.27 1.27))))
        )
      )
    )
    (symbol "Device:R" (pin_numbers hide) (pin_names (offset 0)) (in_bom yes) (on_board yes)
      (property "Reference" "R" (at 2.032 0 90)
        (effects (font (size 1.27 1.27)))
      )
      (property "Value" "R" (at 0 0 90)
        (effects (font (size 1.27 1.27)))
      )
      (property "Footprint" "" (at -1.778 0 90)
        (effects (font (size 1.27 1.27)) hide)
      )
      (property "Datasheet" "~" (at 0 0 0)
        (effects (font (size 1.27 1.27)) hide)
      )
      (property "ki_keywords" "R res resistor" (at 0 0 0)
        (effects (font (size 1.27 1.27)) hide)
      )
      (property "ki_description" "Resistor" (at 0 0 0)
        (effects (font (size 1.27 1.27)) hide)
      )
      (property "ki_fp_filters" "R_*" (at 0 0 0)
        (effects (font (size 1.27 1.27)) hide)
      )
      (symbol "R_0_1"
        (rectangle (start -1.016 -2.54) (end 1.016 2.54)
          (stroke (width 0.254) (type default))
          (fill (type none))
        )
      )
      (symbol "R_1_1"
        (pin passive line (at 0 3.81 270) (length 1.27)
          (name "~" (effects (font (size 1.27 1.27))))
          (number "1" (effects (font (size 1.27 1.27))))
        )
        (pin passive line (at 0 -3.81 90) (length 1.27)
          (name "~" (effects (font (size 1.27 1.27))))
          (number "2" (effects (font (size 1.27 1.27))))
        )
      )
    )
    (symbol "lbl_strips:pbv3" (pin_names (offset 1.016)) (in_bom yes) (on_board yes)
      (property "Reference" "U" (at 21.59 13.97 0)
        (effects (font (size 1.524 1.524)))
      )
      (property "Value" "pbv3" (at -21.59 13.97 0)
        (effects (font (size 1.524 1.524)))
      )
      (property "Footprint" "" (at 26.67 -15.24 0)
        (effects (font (size 1.524 1.524)) hide)
      )
      (property "Datasheet" "" (at 26.67 -15.24 0)
        (effects (font (size 1.524 1.524)) hide)
      )
      (symbol "pbv3_0_1"
        (rectangle (start -22.86 12.7) (end 22.86 -26.67)
          (stroke (width 0) (type default))
          (fill (type background))
        )
      )
      (symbol "pbv3_1_1"
        (pin output line (at -27.94 10.16 0) (length 5.08)
          (name "LDx0EN" (effects (font (size 1.27 1.27))))
          (number "1" (effects (font (size 1.27 1.27))))
        )
        (pin output line (at -27.94 -12.7 0) (length 5.08)
          (name "LDx2EN" (effects (font (size 1.27 1.27))))
          (number "10" (effects (font (size 1.27 1.27))))
        )
        (pin output line (at -27.94 -15.24 0) (length 5.08)
          (name "SHUNTx" (effects (font (size 1.27 1.27))))
          (number "11" (effects (font (size 1.27 1.27))))
        )
        (pin output line (at -27.94 -17.78 0) (length 5.08)
          (name "CALx" (effects (font (size 1.27 1.27))))
          (number "12" (effects (font (size 1.27 1.27))))
        )
        (pin passive line (at -27.94 -25.4 0) (length 5.08)
          (name "HVretx" (effects (font (size 1.27 1.27))))
          (number "13" (effects (font (size 1.27 1.27))))
        )
        (pin power_out line (at -12.7 -31.75 90) (length 5.08)
          (name "HVout" (effects (font (size 1.27 1.27))))
          (number "14" (effects (font (size 1.27 1.27))))
        )
        (pin power_in line (at -10.16 -31.75 90) (length 5.08)
          (name "HVin" (effects (font (size 1.27 1.27))))
          (number "15" (effects (font (size 1.27 1.27))))
        )
        (pin passive line (at -7.62 -31.75 90) (length 5.08)
          (name "GND" (effects (font (size 1.27 1.27))))
          (number "16" (effects (font (size 1.27 1.27))))
        )
        (pin power_in line (at -5.08 -31.75 90) (length 5.08)
          (name "VIN" (effects (font (size 1.27 1.27))))
          (number "17" (effects (font (size 1.27 1.27))))
        )
        (pin passive line (at -2.54 -31.75 90) (length 5.08)
          (name "CMDin_N" (effects (font (size 1.27 1.27))))
          (number "18" (effects (font (size 1.27 1.27))))
        )
        (pin passive line (at 0 -31.75 90) (length 5.08)
          (name "CMDin_P" (effects (font (size 1.27 1.27))))
          (number "19" (effects (font (size 1.27 1.27))))
        )
        (pin output line (at -27.94 7.62 0) (length 5.08)
          (name "HRSTBx" (effects (font (size 1.27 1.27))))
          (number "2" (effects (font (size 1.27 1.27))))
        )
        (pin passive line (at 2.54 -31.75 90) (length 5.08)
          (name "CMDout_P" (effects (font (size 1.27 1.27))))
          (number "20" (effects (font (size 1.27 1.27))))
        )
        (pin passive line (at 5.08 -31.75 90) (length 5.08)
          (name "CMDout_N" (effects (font (size 1.27 1.27))))
          (number "21" (effects (font (size 1.27 1.27))))
        )
        (pin input line (at 7.62 -31.75 90) (length 5.08)
          (name "CAL" (effects (font (size 1.27 1.27))))
          (number "22" (effects (font (size 1.27 1.27))))
        )
        (pin input line (at 10.16 -31.75 90) (length 5.08)
          (name "OFin" (effects (font (size 1.27 1.27))))
          (number "23" (effects (font (size 1.27 1.27))))
        )
        (pin output line (at 12.7 -31.75 90) (length 5.08)
          (name "OFout" (effects (font (size 1.27 1.27))))
          (number "24" (effects (font (size 1.27 1.27))))
        )
        (pin passive line (at 27.94 -25.4 180) (length 5.08)
          (name "HVrety" (effects (font (size 1.27 1.27))))
          (number "25" (effects (font (size 1.27 1.27))))
        )
        (pin output line (at 27.94 -22.86 180) (length 5.08)
          (name "VCC1V4" (effects (font (size 1.27 1.27))))
          (number "26" (effects (font (size 1.27 1.27))))
        )
        (pin output line (at 27.94 -20.32 180) (length 5.08)
          (name "VCC3V3" (effects (font (size 1.27 1.27))))
          (number "27" (effects (font (size 1.27 1.27))))
        )
        (pin output line (at 27.94 -17.78 180) (length 5.08)
          (name "CALy" (effects (font (size 1.27 1.27))))
          (number "28" (effects (font (size 1.27 1.27))))
        )
        (pin output line (at 27.94 -15.24 180) (length 5.08)
          (name "SHUNTy" (effects (font (size 1.27 1.27))))
          (number "29" (effects (font (size 1.27 1.27))))
        )
        (pin input line (at -27.94 5.08 0) (length 5.08)
          (name "SSSHx" (effects (font (size 1.27 1.27))))
          (number "3" (effects (font (size 1.27 1.27))))
        )
        (pin output line (at 27.94 -12.7 180) (length 5.08)
          (name "LDy2EN" (effects (font (size 1.27 1.27))))
          (number "30" (effects (font (size 1.27 1.27))))
        )
        (pin output line (at 27.94 -10.16 180) (length 5.08)
          (name "LDy1EN" (effects (font (size 1.27 1.27))))
          (number "31" (effects (font (size 1.27 1.27))))
        )
        (pin input line (at 27.94 -7.62 180) (length 5.08)
          (name "NTCyN" (effects (font (size 1.27 1.27))))
          (number "32" (effects (font (size 1.27 1.27))))
        )
        (pin output line (at 27.94 -5.08 180) (length 5.08)
          (name "NTCyP" (effects (font (size 1.27 1.27))))
          (number "33" (effects (font (size 1.27 1.27))))
        )
        (pin input line (at 27.94 -2.54 180) (length 5.08)
          (name "HREFy" (effects (font (size 1.27 1.27))))
          (number "34" (effects (font (size 1.27 1.27))))
        )
        (pin passive line (at 27.94 0 180) (length 5.08)
          (name "VOUT_RTN" (effects (font (size 1.27 1.27))))
          (number "35" (effects (font (size 1.27 1.27))))
        )
        (pin passive line (at 27.94 2.54 180) (length 5.08)
          (name "VOUT" (effects (font (size 1.27 1.27))))
          (number "36" (effects (font (size 1.27 1.27))))
        )
        (pin input line (at 27.94 5.08 180) (length 5.08)
          (name "SSSHy" (effects (font (size 1.27 1.27))))
          (number "37" (effects (font (size 1.27 1.27))))
        )
        (pin output line (at 27.94 7.62 180) (length 5.08)
          (name "HRSTBy" (effects (font (size 1.27 1.27))))
          (number "38" (effects (font (size 1.27 1.27))))
        )
        (pin output line (at 27.94 10.16 180) (length 5.08)
          (name "LDy0EN" (effects (font (size 1.27 1.27))))
          (number "39" (effects (font (size 1.27 1.27))))
        )
        (pin power_out line (at -27.94 2.54 0) (length 5.08)
          (name "VOUT" (effects (font (size 1.27 1.27))))
          (number "4" (effects (font (size 1.27 1.27))))
        )
        (pin passive line (at -27.94 0 0) (length 5.08)
          (name "VOUT_RTN" (effects (font (size 1.27 1.27))))
          (number "5" (effects (font (size 1.27 1.27))))
        )
        (pin input line (at -27.94 -2.54 0) (length 5.08)
          (name "HREFx" (effects (font (size 1.27 1.27))))
          (number "6" (effects (font (size 1.27 1.27))))
        )
        (pin output line (at -27.94 -5.08 0) (length 5.08)
          (name "NTCxP" (effects (font (size 1.27 1.27))))
          (number "7" (effects (font (size 1.27 1.27))))
        )
        (pin input line (at -27.94 -7.62 0) (length 5.08)
          (name "NTCxN" (effects (font (size 1.27 1.27))))
          (number "8" (effects (font (size 1.27 1.27))))
        )
        (pin output line (at -27.94 -10.16 0) (length 5.08)
          (name "LDx1EN" (effects (font (size 1.27 1.27))))
          (number "9" (effects (font (size 1.27 1.27))))
        )
      )
    )
    (symbol "power:+12V" (power) (pin_names (offset 0)) (in_bom yes) (on_board yes)
      (property "Reference" "#PWR" (at 0 -3.81 0)
        (effects (font (size 1.27 1.27)) hide)
      )
      (property "Value" "+12V" (at 0 3.556 0)
        (effects (font (size 1.27 1.27)))
      )
      (property "Footprint" "" (at 0 0 0)
        (effects (font (size 1.27 1.27)) hide)
      )
      (property "Datasheet" "" (at 0 0 0)
        (effects (font (size 1.27 1.27)) hide)
      )
      (property "ki_keywords" "power-flag" (at 0 0 0)
        (effects (font (size 1.27 1.27)) hide)
      )
      (property "ki_description" "Power symbol creates a global label with name \"+12V\"" (at 0 0 0)
        (effects (font (size 1.27 1.27)) hide)
      )
      (symbol "+12V_0_1"
        (polyline
          (pts
            (xy -0.762 1.27)
            (xy 0 2.54)
          )
          (stroke (width 0) (type default))
          (fill (type none))
        )
        (polyline
          (pts
            (xy 0 0)
            (xy 0 2.54)
          )
          (stroke (width 0) (type default))
          (fill (type none))
        )
        (polyline
          (pts
            (xy 0 2.54)
            (xy 0.762 1.27)
          )
          (stroke (width 0) (type default))
          (fill (type none))
        )
      )
      (symbol "+12V_1_1"
        (pin power_in line (at 0 0 90) (length 0) hide
          (name "+12V" (effects (font (size 1.27 1.27))))
          (number "1" (effects (font (size 1.27 1.27))))
        )
      )
    )
    (symbol "power:+3V3" (power) (pin_names (offset 0)) (in_bom yes) (on_board yes)
      (property "Reference" "#PWR" (at 0 -3.81 0)
        (effects (font (size 1.27 1.27)) hide)
      )
      (property "Value" "+3V3" (at 0 3.556 0)
        (effects (font (size 1.27 1.27)))
      )
      (property "Footprint" "" (at 0 0 0)
        (effects (font (size 1.27 1.27)) hide)
      )
      (property "Datasheet" "" (at 0 0 0)
        (effects (font (size 1.27 1.27)) hide)
      )
      (property "ki_keywords" "power-flag" (at 0 0 0)
        (effects (font (size 1.27 1.27)) hide)
      )
      (property "ki_description" "Power symbol creates a global label with name \"+3V3\"" (at 0 0 0)
        (effects (font (size 1.27 1.27)) hide)
      )
      (symbol "+3V3_0_1"
        (polyline
          (pts
            (xy -0.762 1.27)
            (xy 0 2.54)
          )
          (stroke (width 0) (type default))
          (fill (type none))
        )
        (polyline
          (pts
            (xy 0 0)
            (xy 0 2.54)
          )
          (stroke (width 0) (type default))
          (fill (type none))
        )
        (polyline
          (pts
            (xy 0 2.54)
            (xy 0.762 1.27)
          )
          (stroke (width 0) (type default))
          (fill (type none))
        )
      )
      (symbol "+3V3_1_1"
        (pin power_in line (at 0 0 90) (length 0) hide
          (name "+3V3" (effects (font (size 1.27 1.27))))
          (number "1" (effects (font (size 1.27 1.27))))
        )
      )
    )
    (symbol "power:GND" (power) (pin_names (offset 0)) (in_bom yes) (on_board yes)
      (property "Reference" "#PWR" (at 0 -6.35 0)
        (effects (font (size 1.27 1.27)) hide)
      )
      (property "Value" "GND" (at 0 -3.81 0)
        (effects (font (size 1.27 1.27)))
      )
      (property "Footprint" "" (at 0 0 0)
        (effects (font (size 1.27 1.27)) hide)
      )
      (property "Datasheet" "" (at 0 0 0)
        (effects (font (size 1.27 1.27)) hide)
      )
      (property "ki_keywords" "power-flag" (at 0 0 0)
        (effects (font (size 1.27 1.27)) hide)
      )
      (property "ki_description" "Power symbol creates a global label with name \"GND\" , ground" (at 0 0 0)
        (effects (font (size 1.27 1.27)) hide)
      )
      (symbol "GND_0_1"
        (polyline
          (pts
            (xy 0 0)
            (xy 0 -1.27)
            (xy 1.27 -1.27)
            (xy 0 -2.54)
            (xy -1.27 -1.27)
            (xy 0 -1.27)
          )
          (stroke (width 0) (type default))
          (fill (type none))
        )
      )
      (symbol "GND_1_1"
        (pin power_in line (at 0 0 270) (length 0) hide
          (name "GND" (effects (font (size 1.27 1.27))))
          (number "1" (effects (font (size 1.27 1.27))))
        )
      )
    )
    (symbol "power:GNDPWR" (power) (pin_names (offset 0)) (in_bom yes) (on_board yes)
      (property "Reference" "#PWR" (at 0 -5.08 0)
        (effects (font (size 1.27 1.27)) hide)
      )
      (property "Value" "GNDPWR" (at 0 -3.302 0)
        (effects (font (size 1.27 1.27)))
      )
      (property "Footprint" "" (at 0 -1.27 0)
        (effects (font (size 1.27 1.27)) hide)
      )
      (property "Datasheet" "" (at 0 -1.27 0)
        (effects (font (size 1.27 1.27)) hide)
      )
      (property "ki_keywords" "power-flag" (at 0 0 0)
        (effects (font (size 1.27 1.27)) hide)
      )
      (property "ki_description" "Power symbol creates a global label with name \"GNDPWR\" , power ground" (at 0 0 0)
        (effects (font (size 1.27 1.27)) hide)
      )
      (symbol "GNDPWR_0_1"
        (polyline
          (pts
            (xy 0 -1.27)
            (xy 0 0)
          )
          (stroke (width 0) (type default))
          (fill (type none))
        )
        (polyline
          (pts
            (xy -1.016 -1.27)
            (xy -1.27 -2.032)
            (xy -1.27 -2.032)
          )
          (stroke (width 0.2032) (type default))
          (fill (type none))
        )
        (polyline
          (pts
            (xy -0.508 -1.27)
            (xy -0.762 -2.032)
            (xy -0.762 -2.032)
          )
          (stroke (width 0.2032) (type default))
          (fill (type none))
        )
        (polyline
          (pts
            (xy 0 -1.27)
            (xy -0.254 -2.032)
            (xy -0.254 -2.032)
          )
          (stroke (width 0.2032) (type default))
          (fill (type none))
        )
        (polyline
          (pts
            (xy 0.508 -1.27)
            (xy 0.254 -2.032)
            (xy 0.254 -2.032)
          )
          (stroke (width 0.2032) (type default))
          (fill (type none))
        )
        (polyline
          (pts
            (xy 1.016 -1.27)
            (xy -1.016 -1.27)
            (xy -1.016 -1.27)
          )
          (stroke (width 0.2032) (type default))
          (fill (type none))
        )
        (polyline
          (pts
            (xy 1.016 -1.27)
            (xy 0.762 -2.032)
            (xy 0.762 -2.032)
            (xy 0.762 -2.032)
          )
          (stroke (width 0.2032) (type default))
          (fill (type none))
        )
      )
      (symbol "GNDPWR_1_1"
        (pin power_in line (at 0 0 270) (length 0) hide
          (name "GNDPWR" (effects (font (size 1.27 1.27))))
          (number "1" (effects (font (size 1.27 1.27))))
        )
      )
    )
  )

  (junction (at 207.645 113.665) (diameter 0) (color 0 0 0 0)
    (uuid 1962e27a-f25d-407c-98fc-1bbfd329b44d)
  )
  (junction (at 24.765 62.23) (diameter 0) (color 0 0 0 0)
    (uuid 1c44338c-b9a1-4269-978f-e8fd90211a46)
  )
  (junction (at 203.835 104.14) (diameter 0) (color 0 0 0 0)
    (uuid cef3c07b-49ed-4b95-b754-4daff9ad0cb2)
  )

  (no_connect (at 154.94 93.98) (uuid 13412314-0c45-499d-868f-173ee61a3614))
  (no_connect (at 99.06 63.5) (uuid 55b5479f-61f0-425d-9978-4fedcaba0a33))
  (no_connect (at 154.94 63.5) (uuid 99c0f8a8-b950-4f92-b6c8-02bd4dd5baf9))
  (no_connect (at 154.94 68.58) (uuid b79e1752-f5a4-4f28-aa9f-eadaf05a01a7))
  (no_connect (at 154.94 66.04) (uuid c3d95146-d734-44ad-91fe-d3787ad54c5f))

  (bus_entry (at 27.94 44.45) (size 2.54 2.54)
    (stroke (width 0) (type default))
    (uuid 199ca809-df09-4f8c-aa3d-2e3b43898ae2)
  )
  (bus_entry (at 27.94 46.99) (size 2.54 2.54)
    (stroke (width 0) (type default))
    (uuid 2fa5d26a-6f69-4299-969a-c309cce46548)
  )
  (bus_entry (at 27.94 41.91) (size 2.54 2.54)
    (stroke (width 0) (type default))
    (uuid a5c9214f-e38d-44a3-83c3-d7452b6d337d)
  )
  (bus_entry (at 27.94 49.53) (size 2.54 2.54)
    (stroke (width 0) (type default))
    (uuid ce9c8143-c86c-4098-80c5-308bd7311735)
  )

  (wire (pts (xy 212.09 104.14) (xy 212.09 104.775))
    (stroke (width 0) (type default))
    (uuid 0c22591a-c8b5-481a-8575-666a6025d067)
  )
  (wire (pts (xy 41.275 97.79) (xy 43.18 97.79))
    (stroke (width 0) (type default))
    (uuid 0cd59b17-0644-47f8-ada9-27f14e5a38c7)
  )
  (wire (pts (xy 30.48 49.53) (xy 40.64 49.53))
    (stroke (width 0) (type default))
    (uuid 1cc353e2-504b-4b00-9976-cf3fed5e110e)
  )
  (wire (pts (xy 121.92 100.33) (xy 121.92 118.11))
    (stroke (width 0) (type default))
    (uuid 24d400be-22be-4fdb-a877-761c6176103f)
  )
  (wire (pts (xy 200.66 38.1) (xy 200.66 39.37))
    (stroke (width 0) (type default))
    (uuid 264133dd-3e9a-4ab6-9801-c5fb2f0a934b)
  )
  (wire (pts (xy 53.34 76.2) (xy 53.34 74.93))
    (stroke (width 0) (type default))
    (uuid 271b3591-208b-4a15-b600-36ca45079b5a)
  )
  (wire (pts (xy 214.63 38.1) (xy 214.63 39.37))
    (stroke (width 0) (type default))
    (uuid 2724ecf5-b6b2-418c-b4a7-bf6b9484d996)
  )
  (wire (pts (xy 24.765 62.23) (xy 40.64 62.23))
    (stroke (width 0) (type default))
    (uuid 2d16f761-4e55-4990-8c99-95f111e968ba)
  )
  (bus (pts (xy 27.94 44.45) (xy 27.94 46.99))
    (stroke (width 0) (type default))
    (uuid 30814b52-dff0-4352-ac98-bee638ee9898)
  )
  (bus (pts (xy 27.94 46.99) (xy 27.94 49.53))
    (stroke (width 0) (type default))
    (uuid 30814b52-dff0-4352-ac98-bee638ee9899)
  )
  (bus (pts (xy 27.94 40.64) (xy 27.94 41.91))
    (stroke (width 0) (type default))
    (uuid 30814b52-dff0-4352-ac98-bee638ee989a)
  )
  (bus (pts (xy 27.94 41.91) (xy 27.94 44.45))
    (stroke (width 0) (type default))
    (uuid 30814b52-dff0-4352-ac98-bee638ee989b)
  )

  (wire (pts (xy 30.48 104.14) (xy 31.75 104.14))
    (stroke (width 0) (type default))
    (uuid 31d1a6e6-d635-4df4-a23a-423dbb8cbb44)
  )
  (wire (pts (xy 137.16 114.3) (xy 137.16 116.84))
    (stroke (width 0) (type default))
    (uuid 3256e942-2bd6-426d-8564-18af33fd11ff)
  )
  (wire (pts (xy 20.32 21.59) (xy 20.32 20.32))
    (stroke (width 0) (type default))
    (uuid 3378f29d-9682-48c6-93bd-8808151c4df0)
  )
  (wire (pts (xy 203.835 103.505) (xy 203.835 104.14))
    (stroke (width 0) (type default))
    (uuid 3bbe3d77-a204-4ffa-95c6-2b37ea5ff3c5)
  )
  (wire (pts (xy 200.66 49.53) (xy 200.66 46.99))
    (stroke (width 0) (type default))
    (uuid 42989ff0-034d-4a18-b285-f62ab1b8c6f4)
  )
  (wire (pts (xy 53.34 21.59) (xy 53.34 19.05))
    (stroke (width 0) (type default))
    (uuid 4c217f46-8334-4b44-bba5-aa1e55ecfaf7)
  )
  (wire (pts (xy 207.645 113.665) (xy 203.835 113.665))
    (stroke (width 0) (type default))
    (uuid 52a14f29-5069-406c-96e3-2542b61efaa8)
  )
  (wire (pts (xy 203.835 113.665) (xy 203.835 112.395))
    (stroke (width 0) (type default))
    (uuid 55ccdc50-62c6-4f3f-87b8-b4785a4b3536)
  )
  (wire (pts (xy 24.765 62.23) (xy 21.59 62.23))
    (stroke (width 0) (type default))
    (uuid 5f56e67d-bdb8-4e16-bad5-72fee9cf04d0)
  )
  (wire (pts (xy 203.835 104.14) (xy 203.835 104.775))
    (stroke (width 0) (type default))
    (uuid 63cf5f24-58ec-4e7a-8bbf-4b805a930732)
  )
  (wire (pts (xy 30.48 97.79) (xy 33.655 97.79))
    (stroke (width 0) (type default))
    (uuid 67c31d07-1102-466a-8f36-94ef29b03470)
  )
  (wire (pts (xy 20.32 29.21) (xy 20.32 30.48))
    (stroke (width 0) (type default))
    (uuid 6fc8db4b-578a-4058-9a6f-328b40fe1bcc)
  )
  (wire (pts (xy 105.41 123.19) (xy 105.41 120.65))
    (stroke (width 0) (type default))
    (uuid 77a21e48-c939-4267-99b2-6c2d3420915f)
  )
  (wire (pts (xy 121.92 118.11) (xy 119.38 118.11))
    (stroke (width 0) (type default))
    (uuid 7da5ec15-0057-4d83-8c02-37831ca98bd8)
  )
  (wire (pts (xy 203.835 104.14) (xy 212.09 104.14))
    (stroke (width 0) (type default))
    (uuid 8bfbc731-cf94-413c-8fae-440a81716fc9)
  )
  (wire (pts (xy 31.75 104.14) (xy 31.75 106.68))
    (stroke (width 0) (type default))
    (uuid 93d3b1c8-b266-46b0-a835-01404a3fd995)
  )
  (wire (pts (xy 24.765 54.61) (xy 24.765 52.705))
    (stroke (width 0) (type default))
    (uuid a489eff2-706d-4857-8ec3-615facca18c9)
  )
  (wire (pts (xy 214.63 49.53) (xy 214.63 46.99))
    (stroke (width 0) (type default))
    (uuid b09dcaac-bd6c-4281-b980-89f968fa9035)
  )
  (wire (pts (xy 105.41 110.49) (xy 105.41 113.03))
    (stroke (width 0) (type default))
    (uuid b0bda316-3d11-415f-a857-f1fd0fe5019e)
  )
  (wire (pts (xy 235.585 112.395) (xy 235.585 113.665))
    (stroke (width 0) (type default))
    (uuid b18e0048-e6cb-429b-b2ee-d11a0536a9af)
  )
  (wire (pts (xy 31.75 106.68) (xy 30.48 106.68))
    (stroke (width 0) (type default))
    (uuid b4e12fca-4682-4f17-b143-bf7406ac13d9)
  )
  (wire (pts (xy 212.09 113.665) (xy 207.645 113.665))
    (stroke (width 0) (type default))
    (uuid bdc043f4-8e90-4acf-9dc8-eb292b83db5d)
  )
  (wire (pts (xy 40.64 46.99) (xy 30.48 46.99))
    (stroke (width 0) (type default))
    (uuid c31e70a7-f742-4ad7-820d-619385422512)
  )
  (wire (pts (xy 137.16 106.68) (xy 137.16 100.33))
    (stroke (width 0) (type default))
    (uuid d18616e1-e80f-4f66-8298-3a1f4e6fdb05)
  )
  (wire (pts (xy 235.585 104.14) (xy 235.585 104.775))
    (stroke (width 0) (type default))
    (uuid d79918fc-9b36-4b66-95ea-34f365d782d3)
  )
  (wire (pts (xy 212.09 112.395) (xy 212.09 113.665))
    (stroke (width 0) (type default))
    (uuid df182652-a6c7-42f5-b571-a6a41b44efc8)
  )
  (wire (pts (xy 116.84 100.33) (xy 116.84 105.41))
    (stroke (width 0) (type default))
    (uuid e64c8d02-6ee7-439f-a180-238657ff8cdb)
  )
  (wire (pts (xy 119.38 102.87) (xy 119.38 100.33))
    (stroke (width 0) (type default))
    (uuid f1fc387c-0708-4215-892d-55275951c7aa)
  )
  (wire (pts (xy 40.64 52.07) (xy 30.48 52.07))
    (stroke (width 0) (type default))
    (uuid f28d02d9-a84b-4f81-86b1-7cb06cb47dd8)
  )
  (wire (pts (xy 114.3 100.33) (xy 114.3 102.87))
    (stroke (width 0) (type default))
    (uuid f295bb41-dfc3-478b-8f6b-17856e81944d)
  )
  (wire (pts (xy 30.48 44.45) (xy 40.64 44.45))
    (stroke (width 0) (type default))
    (uuid f3180f67-06f7-4797-9336-a51212ef77d3)
  )
  (wire (pts (xy 105.41 102.87) (xy 114.3 102.87))
    (stroke (width 0) (type default))
    (uuid fdc13ead-a309-4014-934c-a9e694bf59e8)
  )

  (text "Zener diode limits the linPOL outputs range\ncompatible with the output multiplexer."
    (at 212.725 96.52 0)
    (effects (font (size 1.27 1.27)) (justify left bottom))
    (uuid d44159b8-9864-4319-8689-0b237d6c340c)
  )

  (label "NTCxN" (at 200.66 49.53 180) (fields_autoplaced)
    (effects (font (size 1.27 1.27)) (justify right bottom))
    (uuid 03d0089f-edfb-4471-9dfa-088312b419bf)
  )
  (label "OUT_SEL2" (at 30.48 49.53 0) (fields_autoplaced)
    (effects (font (size 1.27 1.27)) (justify left bottom))
    (uuid 0d8fd4f9-81a5-402a-8953-8e7c38296f4e)
  )
  (label "VCC1V4" (at 154.94 91.44 0) (fields_autoplaced)
    (effects (font (size 1.27 1.27)) (justify left bottom))
    (uuid 0e9eedff-3bf7-40bd-823b-9332c56a892e)
  )
  (label "ANALOGUEr" (at 154.94 71.12 0) (fields_autoplaced)
    (effects (font (size 1.27 1.27)) (justify left bottom))
    (uuid 12a21285-f045-4f62-894a-2d11c2d6aeef)
  )
  (label "VOUT_RTN" (at 99.06 68.58 180) (fields_autoplaced)
    (effects (font (size 1.27 1.27)) (justify right bottom))
    (uuid 14ec4736-a670-413c-a00d-140f7c7cb765)
  )
  (label "CALy" (at 66.04 34.29 0) (fields_autoplaced)
    (effects (font (size 1.27 1.27)) (justify left bottom))
    (uuid 19a1f67e-ef8e-4523-af66-3ab8abbc46e4)
  )
  (label "NTCyP" (at 154.94 73.66 0) (fields_autoplaced)
    (effects (font (size 1.27 1.27)) (justify left bottom))
    (uuid 1fff831f-5427-4341-9669-f8b0935ea48c)
  )
  (label "HRSTBx" (at 99.06 60.96 180) (fields_autoplaced)
    (effects (font (size 1.27 1.27)) (justify right bottom))
    (uuid 24cd652e-2f7e-469c-a635-69ef93de573a)
  )
  (label "VCC3V3" (at 203.835 95.885 180) (fields_autoplaced)
    (effects (font (size 1.27 1.27)) (justify right bottom))
    (uuid 3112875a-8962-44cc-9589-5dd9dc42fe9f)
  )
  (label "ANALOGUEr" (at 99.06 71.12 180) (fields_autoplaced)
    (effects (font (size 1.27 1.27)) (justify right bottom))
    (uuid 354ecac7-7679-4f24-83db-3826d488ebda)
  )
  (label "HRSTBy" (at 66.04 44.45 0) (fields_autoplaced)
    (effects (font (size 1.27 1.27)) (justify left bottom))
    (uuid 39d95f51-42e9-45e7-9679-974a3e9ab6d7)
  )
  (label "OUT_SEL0" (at 30.48 44.45 0) (fields_autoplaced)
    (effects (font (size 1.27 1.27)) (justify left bottom))
    (uuid 3d4ca3c5-af6c-42af-9ef9-74bea5aede48)
  )
  (label "LDy1EN" (at 66.04 41.91 0) (fields_autoplaced)
    (effects (font (size 1.27 1.27)) (justify left bottom))
    (uuid 4075a6ed-c338-497c-83bb-22ab19e477ff)
  )
  (label "HRSTBy" (at 154.94 60.96 0) (fields_autoplaced)
    (effects (font (size 1.27 1.27)) (justify left bottom))
    (uuid 476f31a0-07a8-4ddb-8090-375d7d682569)
  )
  (label "VCC3V3" (at 154.94 88.9 0) (fields_autoplaced)
    (effects (font (size 1.27 1.27)) (justify left bottom))
    (uuid 50875f96-e137-49c6-94d5-3895e951cd54)
  )
  (label "CALy" (at 154.94 86.36 0) (fields_autoplaced)
    (effects (font (size 1.27 1.27)) (justify left bottom))
    (uuid 5306fa89-b713-4668-ba14-752346d4a961)
  )
  (label "LDx0EN" (at 66.04 52.07 0) (fields_autoplaced)
    (effects (font (size 1.27 1.27)) (justify left bottom))
    (uuid 6229e004-892a-4ee5-8ef3-5bb90aeda026)
  )
  (label "ANALOGUEr" (at 43.18 97.79 0) (fields_autoplaced)
    (effects (font (size 1.27 1.27)) (justify left bottom))
    (uuid 6c9bcd4b-df34-4f5e-b50e-f1716c6a0596)
  )
  (label "VCC3V3half" (at 66.04 31.75 0) (fields_autoplaced)
    (effects (font (size 1.27 1.27)) (justify left bottom))
    (uuid 6d354ac3-2e4d-4449-adc7-6bffa2c27753)
  )
  (label "VOUT" (at 66.04 57.15 0) (fields_autoplaced)
    (effects (font (size 1.27 1.27)) (justify left bottom))
    (uuid 6d6363ac-4708-4131-85d2-f7dbeb2288f0)
  )
  (label "LDy0EN" (at 154.94 58.42 0) (fields_autoplaced)
    (effects (font (size 1.27 1.27)) (justify left bottom))
    (uuid 738d9825-ae1b-44f5-85e1-486d0f4f1c09)
  )
  (label "SHUNTx" (at 66.04 64.77 0) (fields_autoplaced)
    (effects (font (size 1.27 1.27)) (justify left bottom))
    (uuid 7656ff0e-e2c0-4eea-bbf4-7c88e8c18868)
  )
  (label "NTCyN" (at 214.63 49.53 180) (fields_autoplaced)
    (effects (font (size 1.27 1.27)) (justify right bottom))
    (uuid 7ff1e60d-1f28-41c1-9d22-fd264f6fcb50)
  )
  (label "VCC1V4" (at 66.04 29.21 0) (fields_autoplaced)
    (effects (font (size 1.27 1.27)) (justify left bottom))
    (uuid 884f9cad-41f3-4374-b1f1-ad70560eed72)
  )
  (label "LDy2EN" (at 154.94 81.28 0) (fields_autoplaced)
    (effects (font (size 1.27 1.27)) (justify left bottom))
    (uuid 8a78288a-cbe4-4225-b84a-171cbd08830b)
  )
  (label "LDx0EN" (at 99.06 58.42 180) (fields_autoplaced)
    (effects (font (size 1.27 1.27)) (justify right bottom))
    (uuid 8cd61e18-9308-4176-90f6-8c3e60454124)
  )
  (label "HVout_high" (at 114.3 101.6 180) (fields_autoplaced)
    (effects (font (size 1.27 1.27)) (justify right bottom))
    (uuid 9033b884-66ae-4bfe-b275-8f7a5f21354c)
  )
  (label "NTCxP" (at 99.06 73.66 180) (fields_autoplaced)
    (effects (font (size 1.27 1.27)) (justify right bottom))
    (uuid a192f350-3926-4f76-8ba1-4a6e8a204b53)
  )
  (label "NTCyP" (at 214.63 38.1 180) (fields_autoplaced)
    (effects (font (size 1.27 1.27)) (justify right bottom))
    (uuid a2196708-664e-484d-85b7-d8afc786c5dd)
  )
  (label "SHUNTy" (at 66.04 36.83 0) (fields_autoplaced)
    (effects (font (size 1.27 1.27)) (justify left bottom))
    (uuid a3bc3856-6b8e-4624-8e26-3df2aa4326e8)
  )
  (label "CALx" (at 99.06 86.36 180) (fields_autoplaced)
    (effects (font (size 1.27 1.27)) (justify right bottom))
    (uuid a53650cb-7bd1-44a0-96cc-f6a0a695bc78)
  )
  (label "NTCyN" (at 154.94 76.2 0) (fields_autoplaced)
    (effects (font (size 1.27 1.27)) (justify left bottom))
    (uuid a584b137-6a2f-47d6-88da-671c72e3fc17)
  )
  (label "CALx" (at 66.04 67.31 0) (fields_autoplaced)
    (effects (font (size 1.27 1.27)) (justify left bottom))
    (uuid a83f4321-cfce-405d-9288-5dbf986a4680)
  )
  (label "OFout" (at 139.7 100.33 270) (fields_autoplaced)
    (effects (font (size 1.27 1.27)) (justify right bottom))
    (uuid a88dd297-d6d8-4f10-9bd6-514864074f44)
  )
  (label "SHUNTx" (at 99.06 83.82 180) (fields_autoplaced)
    (effects (font (size 1.27 1.27)) (justify right bottom))
    (uuid ac346932-2110-47fd-832b-555202268bed)
  )
  (label "LDy0EN" (at 66.04 46.99 0) (fields_autoplaced)
    (effects (font (size 1.27 1.27)) (justify left bottom))
    (uuid aed66d99-9c1d-4a58-943c-329ca772522b)
  )
  (label "LDy2EN" (at 66.04 39.37 0) (fields_autoplaced)
    (effects (font (size 1.27 1.27)) (justify left bottom))
    (uuid b216b098-95a4-4559-86cd-f8913ee59d3c)
  )
  (label "OUT_SEL3" (at 30.48 52.07 0) (fields_autoplaced)
    (effects (font (size 1.27 1.27)) (justify left bottom))
    (uuid b3320150-a357-4451-9a80-a8aaaa744dd9)
  )
  (label "SHUNTy" (at 154.94 83.82 0) (fields_autoplaced)
    (effects (font (size 1.27 1.27)) (justify left bottom))
    (uuid b399f042-f66a-4a8f-b5f7-5bd3b4c38288)
  )
  (label "LDx1EN" (at 99.06 78.74 180) (fields_autoplaced)
    (effects (font (size 1.27 1.27)) (justify right bottom))
    (uuid b5a03999-6b3e-4188-a099-4d11d8cb3c75)
  )
  (label "ANALOGUEr" (at 134.62 100.33 270) (fields_autoplaced)
    (effects (font (size 1.27 1.27)) (justify right bottom))
    (uuid bc9161ef-e802-4cd5-8388-4507f0dc0da2)
  )
  (label "VCC3V3half" (at 209.55 104.14 0) (fields_autoplaced)
    (effects (font (size 1.27 1.27)) (justify left bottom))
    (uuid c1e4dcd2-5366-4b84-b96d-b480469d6a39)
  )
  (label "LDy1EN" (at 154.94 78.74 0) (fields_autoplaced)
    (effects (font (size 1.27 1.27)) (justify left bottom))
    (uuid c2667d90-722f-4d8a-9f82-3f6d9fa47727)
  )
  (label "HRSTBx" (at 66.04 54.61 0) (fields_autoplaced)
    (effects (font (size 1.27 1.27)) (justify left bottom))
    (uuid c712420a-d341-461c-bfb6-265b1b3e618f)
  )
  (label "LDx2EN" (at 66.04 62.23 0) (fields_autoplaced)
    (effects (font (size 1.27 1.27)) (justify left bottom))
    (uuid cc5e80ab-c035-4567-ae3f-fd0376157c8e)
  )
  (label "NTCxN" (at 99.06 76.2 180) (fields_autoplaced)
    (effects (font (size 1.27 1.27)) (justify right bottom))
    (uuid ce810ef6-ba40-4d0c-bb3c-5e9d58a074af)
  )
  (label "LDx2EN" (at 99.06 81.28 180) (fields_autoplaced)
    (effects (font (size 1.27 1.27)) (justify right bottom))
    (uuid d0684abb-d23b-4592-940d-48432ebfa4df)
  )
  (label "NTCxP" (at 200.66 38.1 180) (fields_autoplaced)
    (effects (font (size 1.27 1.27)) (justify right bottom))
    (uuid d86bfa65-9ee7-4879-b2e7-ec90af8c96cc)
  )
  (label "OUT_SEL1" (at 30.48 46.99 0) (fields_autoplaced)
    (effects (font (size 1.27 1.27)) (justify left bottom))
    (uuid d924ce72-8c56-4648-976d-8203f7369e9e)
  )
  (label "VOUT" (at 99.06 66.04 180) (fields_autoplaced)
    (effects (font (size 1.27 1.27)) (justify right bottom))
    (uuid dac68a1d-d6cf-4e51-af28-3bb50923e59c)
  )
  (label "VCC1V4" (at 235.585 104.14 0) (fields_autoplaced)
    (effects (font (size 1.27 1.27)) (justify left bottom))
    (uuid e195ad17-7171-446f-a810-c406cb506cdc)
  )
  (label "OFout" (at 66.04 49.53 0) (fields_autoplaced)
    (effects (font (size 1.27 1.27)) (justify left bottom))
    (uuid e8abbbcb-7a70-43c0-804a-23331701e07f)
  )
  (label "LDx1EN" (at 66.04 59.69 0) (fields_autoplaced)
    (effects (font (size 1.27 1.27)) (justify left bottom))
    (uuid fa0f18fd-865f-47d1-a53e-62d8b8ede86c)
  )

  (hierarchical_label "OFin" (shape input) (at 137.16 116.84 180) (fields_autoplaced)
    (effects (font (size 1.27 1.27)) (justify right))
    (uuid 0aa146a3-08c0-47b9-b906-c04ce89fe4cf)
  )
  (hierarchical_label "HVin" (shape input) (at 116.84 105.41 270) (fields_autoplaced)
    (effects (font (size 1.27 1.27)) (justify right))
    (uuid 0c645dd2-fcaa-4a46-b25d-78efd340ab01)
  )
  (hierarchical_label "CMDin_N" (shape input) (at 124.46 100.33 270) (fields_autoplaced)
    (effects (font (size 1.27 1.27)) (justify right))
    (uuid 1318b5b8-3294-46e3-89a0-34edc731e183)
  )
  (hierarchical_label "COILn" (shape output) (at 30.48 106.68 180) (fields_autoplaced)
    (effects (font (size 1.27 1.27)) (justify right))
    (uuid 2bf747da-e6c3-4497-865e-4fbaadf18aa6)
  )
  (hierarchical_label "OUT" (shape output) (at 40.64 34.29 180) (fields_autoplaced)
    (effects (font (size 1.27 1.27)) (justify right))
    (uuid 41afd23e-ddb3-4761-85c3-4ddf1c1133f1)
  )
  (hierarchical_label "VOUT_RTN" (shape input) (at 30.48 95.25 180) (fields_autoplaced)
    (effects (font (size 1.27 1.27)) (justify right))
    (uuid 45c57f6c-12e7-4199-b5de-fe4fc76d1672)
  )
  (hierarchical_label "CMDin_P" (shape input) (at 127 100.33 270) (fields_autoplaced)
    (effects (font (size 1.27 1.27)) (justify right))
    (uuid 4846c30c-8adc-47eb-b3ca-d76cf4751a0e)
  )
  (hierarchical_label "VOUT" (shape output) (at 30.48 92.71 180) (fields_autoplaced)
    (effects (font (size 1.27 1.27)) (justify right))
    (uuid 4aa303d0-5c5c-4125-b55a-ed19e52a9b78)
  )
  (hierarchical_label "CMDout_N" (shape output) (at 132.08 100.33 270) (fields_autoplaced)
    (effects (font (size 1.27 1.27)) (justify right))
    (uuid 637d8942-33ae-49c0-a682-7cecf9dfa1d1)
  )
  (hierarchical_label "CMDout_P" (shape output) (at 129.54 100.33 270) (fields_autoplaced)
    (effects (font (size 1.27 1.27)) (justify right))
    (uuid 75a72667-ec88-4d7a-ba80-820fdeba809c)
  )
  (hierarchical_label "OUT_EN" (shape input) (at 21.59 62.23 180) (fields_autoplaced)
    (effects (font (size 1.27 1.27)) (justify right))
    (uuid 7748b3c3-dabc-4e8e-bd7a-526758781e63)
  )
  (hierarchical_label "COILp" (shape input) (at 30.48 104.14 180) (fields_autoplaced)
    (effects (font (size 1.27 1.27)) (justify right))
    (uuid b8e8ad34-4f42-4ea2-81eb-1b668fb4cbcc)
  )
  (hierarchical_label "HVout" (shape output) (at 105.41 123.19 270) (fields_autoplaced)
    (effects (font (size 1.27 1.27)) (justify right))
    (uuid c5104f4b-f807-4220-aac6-a5c2c2e63cc5)
  )
  (hierarchical_label "ANALOGUE" (shape input) (at 30.48 97.79 180) (fields_autoplaced)
    (effects (font (size 1.27 1.27)) (justify right))
    (uuid f6bcc039-f582-4d65-9d51-9254f8f6508b)
  )
  (hierarchical_label "OUT_SEL[0..3]" (shape input) (at 27.94 40.64 180) (fields_autoplaced)
    (effects (font (size 1.27 1.27)) (justify right))
    (uuid faaf875b-ceec-4c87-8902-1681290ab0b6)
  )
  (hierarchical_label "HVret" (shape input) (at 99.06 93.98 180) (fields_autoplaced)
    (effects (font (size 1.27 1.27)) (justify right))
    (uuid fc352ed1-0ae8-4d07-ae6e-d30bb8da6be9)
  )

  (symbol (lib_id "power:GNDPWR") (at 53.34 76.2 0) (unit 1)
    (in_bom yes) (on_board yes) (dnp no)
    (uuid 00000000-0000-0000-0000-00005c01898c)
    (property "Reference" "#PWR0106" (at 53.34 81.28 0)
      (effects (font (size 1.27 1.27)) hide)
    )
    (property "Value" "GNDPWR" (at 53.4416 80.1116 0)
      (effects (font (size 1.27 1.27)))
    )
    (property "Footprint" "" (at 53.34 77.47 0)
      (effects (font (size 1.27 1.27)) hide)
    )
    (property "Datasheet" "" (at 53.34 77.47 0)
      (effects (font (size 1.27 1.27)) hide)
    )
    (pin "1" (uuid 52b43fe8-4dca-4878-901f-3da1aa563700))
    (instances
      (project "pbv3_test_adapter_carrier"
        (path "/f0f61744-1e8c-4ab3-8121-774876cd6c56/00000000-0000-0000-0000-00005c020d45"
          (reference "#PWR0106") (unit 1)
        )
        (path "/f0f61744-1e8c-4ab3-8121-774876cd6c56/00000000-0000-0000-0000-00005c0ca217"
          (reference "#PWR0118") (unit 1)
        )
        (path "/f0f61744-1e8c-4ab3-8121-774876cd6c56/00000000-0000-0000-0000-00005c0ce926"
          (reference "#PWR0130") (unit 1)
        )
        (path "/f0f61744-1e8c-4ab3-8121-774876cd6c56/00000000-0000-0000-0000-00005c0d315a"
          (reference "#PWR0142") (unit 1)
        )
        (path "/f0f61744-1e8c-4ab3-8121-774876cd6c56/00000000-0000-0000-0000-00005c0d317e"
          (reference "#PWR0154") (unit 1)
        )
      )
    )
  )

  (symbol (lib_id "74xx:CD74HC4067M") (at 53.34 46.99 0) (unit 1)
    (in_bom yes) (on_board yes) (dnp no)
    (uuid 00000000-0000-0000-0000-00005c032791)
    (property "Reference" "U2" (at 44.45 73.66 0)
      (effects (font (size 1.27 1.27)))
    )
    (property "Value" "CD74HC4067M" (at 43.18 22.86 0)
      (effects (font (size 1.27 1.27)))
    )
    (property "Footprint" "Package_SO:SOIC-24W_7.5x15.4mm_P1.27mm" (at 76.2 72.39 0)
      (effects (font (size 1.27 1.27) italic) hide)
    )
    (property "Datasheet" "http://www.ti.com/lit/ds/symlink/cd74hc4067.pdf" (at 44.45 25.4 0)
      (effects (font (size 1.27 1.27)) hide)
    )
    (pin "1" (uuid 7e8bb050-9164-406f-90ce-eae6454d2fc1))
    (pin "10" (uuid 5aa46384-557f-42fb-902a-b74f251e70de))
    (pin "11" (uuid 169fa4d8-8854-458b-9193-3fb2f154e06f))
    (pin "12" (uuid 6f4d2d7e-0571-4eba-883b-89c6e1d4adb3))
    (pin "13" (uuid 88067e76-0c1f-4ff3-918d-2216ab844ab7))
    (pin "14" (uuid 606058dd-cfdf-4ab8-a87b-20a064929c09))
    (pin "15" (uuid 4455949d-dc43-498b-abac-ad64c42a1f05))
    (pin "16" (uuid 568d65dc-0291-408a-97d8-40768868e018))
    (pin "17" (uuid 5986d966-9144-451b-ba9b-0334d92a9aad))
    (pin "18" (uuid 9a79c08a-1d5f-4560-ab64-a51645aa66cd))
    (pin "19" (uuid f5a4ce18-ca1f-4faf-b0af-1a52e9d920af))
    (pin "2" (uuid 2035b252-b989-4d68-86f5-0a468cd3dd32))
    (pin "20" (uuid f1931614-ef8a-4409-8b7d-cdeff91fe3ae))
    (pin "21" (uuid 6dc488ae-011b-45ed-bb28-e6b1063dae25))
    (pin "22" (uuid 9c1055c6-7a00-4cca-9f19-56bacf29ae5c))
    (pin "23" (uuid 8cce67a7-4c7f-4025-afbb-8abb96be09ba))
    (pin "24" (uuid 8f74e6f8-adf8-4fcb-95b1-0fec62dcd138))
    (pin "3" (uuid 6a0dedee-7ac0-4ef1-b45f-e42466844f76))
    (pin "4" (uuid 2f3a7be4-f88c-4c5e-95cc-e0b0bdbd459e))
    (pin "5" (uuid d947896d-c243-4661-a463-288b42eebb53))
    (pin "6" (uuid 3f4c2e5d-583c-4d7a-a62d-a3926001d34c))
    (pin "7" (uuid 6f9a4d2e-74c3-435c-a163-0971d45b69da))
    (pin "8" (uuid 34b0d8b0-0184-4cb2-9e35-97c6ff1df4e7))
    (pin "9" (uuid c65ec923-3622-45eb-a272-e193d0bb1f1d))
    (instances
      (project "pbv3_test_adapter_carrier"
        (path "/f0f61744-1e8c-4ab3-8121-774876cd6c56/00000000-0000-0000-0000-00005c020d45"
          (reference "U2") (unit 1)
        )
        (path "/f0f61744-1e8c-4ab3-8121-774876cd6c56/00000000-0000-0000-0000-00005c0ca217"
          (reference "U7") (unit 1)
        )
        (path "/f0f61744-1e8c-4ab3-8121-774876cd6c56/00000000-0000-0000-0000-00005c0ce926"
          (reference "U11") (unit 1)
        )
        (path "/f0f61744-1e8c-4ab3-8121-774876cd6c56/00000000-0000-0000-0000-00005c0d315a"
          (reference "U15") (unit 1)
        )
        (path "/f0f61744-1e8c-4ab3-8121-774876cd6c56/00000000-0000-0000-0000-00005c0d317e"
          (reference "U19") (unit 1)
        )
      )
    )
  )

  (symbol (lib_id "power:+3V3") (at 53.34 19.05 0) (unit 1)
    (in_bom yes) (on_board yes) (dnp no)
    (uuid 00000000-0000-0000-0000-00005c03292f)
    (property "Reference" "#PWR0101" (at 53.34 22.86 0)
      (effects (font (size 1.27 1.27)) hide)
    )
    (property "Value" "+3V3" (at 53.721 14.6558 0)
      (effects (font (size 1.27 1.27)))
    )
    (property "Footprint" "" (at 53.34 19.05 0)
      (effects (font (size 1.27 1.27)) hide)
    )
    (property "Datasheet" "" (at 53.34 19.05 0)
      (effects (font (size 1.27 1.27)) hide)
    )
    (pin "1" (uuid 212e423b-9b3c-40f2-a7ab-8bfb2b879d2c))
    (instances
      (project "pbv3_test_adapter_carrier"
        (path "/f0f61744-1e8c-4ab3-8121-774876cd6c56/00000000-0000-0000-0000-00005c020d45"
          (reference "#PWR0101") (unit 1)
        )
        (path "/f0f61744-1e8c-4ab3-8121-774876cd6c56/00000000-0000-0000-0000-00005c0ca217"
          (reference "#PWR0114") (unit 1)
        )
        (path "/f0f61744-1e8c-4ab3-8121-774876cd6c56/00000000-0000-0000-0000-00005c0ce926"
          (reference "#PWR0126") (unit 1)
        )
        (path "/f0f61744-1e8c-4ab3-8121-774876cd6c56/00000000-0000-0000-0000-00005c0d315a"
          (reference "#PWR0138") (unit 1)
        )
        (path "/f0f61744-1e8c-4ab3-8121-774876cd6c56/00000000-0000-0000-0000-00005c0d317e"
          (reference "#PWR0150") (unit 1)
        )
      )
    )
  )

  (symbol (lib_id "power:+3V3") (at 20.32 20.32 0) (unit 1)
    (in_bom yes) (on_board yes) (dnp no)
    (uuid 00000000-0000-0000-0000-00005c03296b)
    (property "Reference" "#PWR0102" (at 20.32 24.13 0)
      (effects (font (size 1.27 1.27)) hide)
    )
    (property "Value" "+3V3" (at 20.701 15.9258 0)
      (effects (font (size 1.27 1.27)))
    )
    (property "Footprint" "" (at 20.32 20.32 0)
      (effects (font (size 1.27 1.27)) hide)
    )
    (property "Datasheet" "" (at 20.32 20.32 0)
      (effects (font (size 1.27 1.27)) hide)
    )
    (pin "1" (uuid 3586a3b8-9d7f-4d40-834f-f06086a3cae5))
    (instances
      (project "pbv3_test_adapter_carrier"
        (path "/f0f61744-1e8c-4ab3-8121-774876cd6c56/00000000-0000-0000-0000-00005c020d45"
          (reference "#PWR0102") (unit 1)
        )
        (path "/f0f61744-1e8c-4ab3-8121-774876cd6c56/00000000-0000-0000-0000-00005c0ca217"
          (reference "#PWR0115") (unit 1)
        )
        (path "/f0f61744-1e8c-4ab3-8121-774876cd6c56/00000000-0000-0000-0000-00005c0ce926"
          (reference "#PWR0127") (unit 1)
        )
        (path "/f0f61744-1e8c-4ab3-8121-774876cd6c56/00000000-0000-0000-0000-00005c0d315a"
          (reference "#PWR0139") (unit 1)
        )
        (path "/f0f61744-1e8c-4ab3-8121-774876cd6c56/00000000-0000-0000-0000-00005c0d317e"
          (reference "#PWR0151") (unit 1)
        )
      )
    )
  )

  (symbol (lib_id "Device:C") (at 20.32 25.4 0) (unit 1)
    (in_bom yes) (on_board yes) (dnp no)
    (uuid 00000000-0000-0000-0000-00005c0329a8)
    (property "Reference" "C1" (at 23.241 24.2316 0)
      (effects (font (size 1.27 1.27)) (justify left))
    )
    (property "Value" "0.1uF" (at 23.241 26.543 0)
      (effects (font (size 1.27 1.27)) (justify left))
    )
    (property "Footprint" "Capacitor_SMD:C_0805_2012Metric" (at 21.2852 29.21 0)
      (effects (font (size 1.27 1.27)) hide)
    )
    (property "Datasheet" "http://www.yageo.com/documents/recent/UPY-GPHC_Y5V_6.3V-to-50V_8.pdf" (at 20.32 25.4 0)
      (effects (font (size 1.27 1.27)) hide)
    )
    (pin "1" (uuid d0df03ab-1b74-4dd8-bdba-85ee34acf8dd))
    (pin "2" (uuid 27fa3c16-91dd-40e7-b32d-fa84a62b1c8d))
    (instances
      (project "pbv3_test_adapter_carrier"
        (path "/f0f61744-1e8c-4ab3-8121-774876cd6c56/00000000-0000-0000-0000-00005c020d45"
          (reference "C1") (unit 1)
        )
        (path "/f0f61744-1e8c-4ab3-8121-774876cd6c56/00000000-0000-0000-0000-00005c0ca217"
          (reference "C4") (unit 1)
        )
        (path "/f0f61744-1e8c-4ab3-8121-774876cd6c56/00000000-0000-0000-0000-00005c0ce926"
          (reference "C6") (unit 1)
        )
        (path "/f0f61744-1e8c-4ab3-8121-774876cd6c56/00000000-0000-0000-0000-00005c0d315a"
          (reference "C8") (unit 1)
        )
        (path "/f0f61744-1e8c-4ab3-8121-774876cd6c56/00000000-0000-0000-0000-00005c0d317e"
          (reference "C10") (unit 1)
        )
      )
    )
  )

  (symbol (lib_id "Device:R") (at 200.66 43.18 0) (unit 1)
    (in_bom yes) (on_board yes) (dnp no)
    (uuid 00000000-0000-0000-0000-00005c033371)
    (property "Reference" "R4" (at 202.438 42.0116 0)
      (effects (font (size 1.27 1.27)) (justify left))
    )
    (property "Value" "10k" (at 202.438 44.323 0)
      (effects (font (size 1.27 1.27)) (justify left))
    )
    (property "Footprint" "Resistor_SMD:R_0603_1608Metric" (at 198.882 43.18 90)
      (effects (font (size 1.27 1.27)) hide)
    )
    (property "Datasheet" "https://www.murata.com/~/media/webrenewal/support/library/catalog/products/thermistor/r03e.ashx?la=en-us" (at 200.66 43.18 0)
      (effects (font (size 1.27 1.27)) hide)
    )
    (pin "1" (uuid 3ca4253a-c955-4ebb-87e2-5f0cac0ad7dd))
    (pin "2" (uuid 54218ef6-973d-498e-8754-5609ef5cb810))
    (instances
      (project "pbv3_test_adapter_carrier"
        (path "/f0f61744-1e8c-4ab3-8121-774876cd6c56/00000000-0000-0000-0000-00005c020d45"
          (reference "R4") (unit 1)
        )
        (path "/f0f61744-1e8c-4ab3-8121-774876cd6c56/00000000-0000-0000-0000-00005c0ca217"
          (reference "R14") (unit 1)
        )
        (path "/f0f61744-1e8c-4ab3-8121-774876cd6c56/00000000-0000-0000-0000-00005c0ce926"
          (reference "R24") (unit 1)
        )
        (path "/f0f61744-1e8c-4ab3-8121-774876cd6c56/00000000-0000-0000-0000-00005c0d315a"
          (reference "R34") (unit 1)
        )
        (path "/f0f61744-1e8c-4ab3-8121-774876cd6c56/00000000-0000-0000-0000-00005c0d317e"
          (reference "R44") (unit 1)
        )
      )
    )
  )

  (symbol (lib_id "Device:R") (at 214.63 43.18 0) (unit 1)
    (in_bom yes) (on_board yes) (dnp no)
    (uuid 00000000-0000-0000-0000-00005c0335fb)
    (property "Reference" "R5" (at 216.408 42.0116 0)
      (effects (font (size 1.27 1.27)) (justify left))
    )
    (property "Value" "10k" (at 216.408 44.323 0)
      (effects (font (size 1.27 1.27)) (justify left))
    )
    (property "Footprint" "Resistor_SMD:R_0603_1608Metric" (at 212.852 43.18 90)
      (effects (font (size 1.27 1.27)) hide)
    )
    (property "Datasheet" "https://www.murata.com/~/media/webrenewal/support/library/catalog/products/thermistor/r03e.ashx?la=en-us" (at 214.63 43.18 0)
      (effects (font (size 1.27 1.27)) hide)
    )
    (pin "1" (uuid 85e36d3e-f672-4974-a173-7075fc45fcf9))
    (pin "2" (uuid 4fbb2efe-f310-426e-870f-194f6f44dc70))
    (instances
      (project "pbv3_test_adapter_carrier"
        (path "/f0f61744-1e8c-4ab3-8121-774876cd6c56/00000000-0000-0000-0000-00005c020d45"
          (reference "R5") (unit 1)
        )
        (path "/f0f61744-1e8c-4ab3-8121-774876cd6c56/00000000-0000-0000-0000-00005c0ca217"
          (reference "R15") (unit 1)
        )
        (path "/f0f61744-1e8c-4ab3-8121-774876cd6c56/00000000-0000-0000-0000-00005c0ce926"
          (reference "R25") (unit 1)
        )
        (path "/f0f61744-1e8c-4ab3-8121-774876cd6c56/00000000-0000-0000-0000-00005c0d315a"
          (reference "R35") (unit 1)
        )
        (path "/f0f61744-1e8c-4ab3-8121-774876cd6c56/00000000-0000-0000-0000-00005c0d317e"
          (reference "R45") (unit 1)
        )
      )
    )
  )

  (symbol (lib_id "power:GND") (at 119.38 102.87 0) (unit 1)
    (in_bom yes) (on_board yes) (dnp no)
    (uuid 00000000-0000-0000-0000-00005c0473cf)
    (property "Reference" "#PWR0104" (at 119.38 109.22 0)
      (effects (font (size 1.27 1.27)) hide)
    )
    (property "Value" "GND" (at 119.507 107.2642 0)
      (effects (font (size 1.27 1.27)))
    )
    (property "Footprint" "" (at 119.38 102.87 0)
      (effects (font (size 1.27 1.27)) hide)
    )
    (property "Datasheet" "" (at 119.38 102.87 0)
      (effects (font (size 1.27 1.27)) hide)
    )
    (pin "1" (uuid 83240009-67a4-4f41-b611-b0959e850b3a))
    (instances
      (project "pbv3_test_adapter_carrier"
        (path "/f0f61744-1e8c-4ab3-8121-774876cd6c56/00000000-0000-0000-0000-00005c020d45"
          (reference "#PWR0104") (unit 1)
        )
        (path "/f0f61744-1e8c-4ab3-8121-774876cd6c56/00000000-0000-0000-0000-00005c0ca217"
          (reference "#PWR0116") (unit 1)
        )
        (path "/f0f61744-1e8c-4ab3-8121-774876cd6c56/00000000-0000-0000-0000-00005c0ce926"
          (reference "#PWR0128") (unit 1)
        )
        (path "/f0f61744-1e8c-4ab3-8121-774876cd6c56/00000000-0000-0000-0000-00005c0d315a"
          (reference "#PWR0140") (unit 1)
        )
        (path "/f0f61744-1e8c-4ab3-8121-774876cd6c56/00000000-0000-0000-0000-00005c0d317e"
          (reference "#PWR0152") (unit 1)
        )
      )
    )
  )

  (symbol (lib_id "power:+12V") (at 119.38 118.11 0) (unit 1)
    (in_bom yes) (on_board yes) (dnp no)
    (uuid 00000000-0000-0000-0000-00005c0474c4)
    (property "Reference" "#PWR0105" (at 119.38 121.92 0)
      (effects (font (size 1.27 1.27)) hide)
    )
    (property "Value" "+12V" (at 118.11 114.3 0)
      (effects (font (size 1.27 1.27)))
    )
    (property "Footprint" "" (at 119.38 118.11 0)
      (effects (font (size 1.27 1.27)) hide)
    )
    (property "Datasheet" "" (at 119.38 118.11 0)
      (effects (font (size 1.27 1.27)) hide)
    )
    (pin "1" (uuid ec0bab6c-e3e3-41af-a108-c9171e57256c))
    (instances
      (project "pbv3_test_adapter_carrier"
        (path "/f0f61744-1e8c-4ab3-8121-774876cd6c56/00000000-0000-0000-0000-00005c020d45"
          (reference "#PWR0105") (unit 1)
        )
        (path "/f0f61744-1e8c-4ab3-8121-774876cd6c56/00000000-0000-0000-0000-00005c0ca217"
          (reference "#PWR0117") (unit 1)
        )
        (path "/f0f61744-1e8c-4ab3-8121-774876cd6c56/00000000-0000-0000-0000-00005c0ce926"
          (reference "#PWR0129") (unit 1)
        )
        (path "/f0f61744-1e8c-4ab3-8121-774876cd6c56/00000000-0000-0000-0000-00005c0d315a"
          (reference "#PWR0141") (unit 1)
        )
        (path "/f0f61744-1e8c-4ab3-8121-774876cd6c56/00000000-0000-0000-0000-00005c0d317e"
          (reference "#PWR0153") (unit 1)
        )
      )
    )
  )

  (symbol (lib_id "Device:R") (at 105.41 106.68 0) (unit 1)
    (in_bom yes) (on_board yes) (dnp no)
    (uuid 00000000-0000-0000-0000-00005c048e86)
    (property "Reference" "R1" (at 107.188 105.5116 0)
      (effects (font (size 1.27 1.27)) (justify left))
    )
    (property "Value" "249k" (at 107.188 107.823 0)
      (effects (font (size 1.27 1.27)) (justify left))
    )
    (property "Footprint" "Resistor_SMD:R_0805_2012Metric" (at 103.632 106.68 90)
      (effects (font (size 1.27 1.27)) hide)
    )
    (property "Datasheet" "~" (at 105.41 106.68 0)
      (effects (font (size 1.27 1.27)) hide)
    )
    (property "mfg#" "ERA-6AEB2493V" (at 105.41 106.68 0)
      (effects (font (size 1.27 1.27)) hide)
    )
    (pin "1" (uuid dc98600e-ed6c-411c-97fb-c1fe1cc9bb5f))
    (pin "2" (uuid 481bc131-2375-41da-b0d4-8406fb7202fa))
    (instances
      (project "pbv3_test_adapter_carrier"
        (path "/f0f61744-1e8c-4ab3-8121-774876cd6c56/00000000-0000-0000-0000-00005c020d45"
          (reference "R1") (unit 1)
        )
        (path "/f0f61744-1e8c-4ab3-8121-774876cd6c56/00000000-0000-0000-0000-00005c0ca217"
          (reference "R11") (unit 1)
        )
        (path "/f0f61744-1e8c-4ab3-8121-774876cd6c56/00000000-0000-0000-0000-00005c0ce926"
          (reference "R21") (unit 1)
        )
        (path "/f0f61744-1e8c-4ab3-8121-774876cd6c56/00000000-0000-0000-0000-00005c0d315a"
          (reference "R31") (unit 1)
        )
        (path "/f0f61744-1e8c-4ab3-8121-774876cd6c56/00000000-0000-0000-0000-00005c0d317e"
          (reference "R41") (unit 1)
        )
      )
    )
  )

  (symbol (lib_id "Device:R") (at 105.41 116.84 0) (unit 1)
    (in_bom yes) (on_board yes) (dnp no)
    (uuid 00000000-0000-0000-0000-00005c048ee9)
    (property "Reference" "R2" (at 107.188 115.6716 0)
      (effects (font (size 1.27 1.27)) (justify left))
    )
    (property "Value" "249k" (at 107.188 117.983 0)
      (effects (font (size 1.27 1.27)) (justify left))
    )
    (property "Footprint" "Resistor_SMD:R_0805_2012Metric" (at 103.632 116.84 90)
      (effects (font (size 1.27 1.27)) hide)
    )
    (property "Datasheet" "~" (at 105.41 116.84 0)
      (effects (font (size 1.27 1.27)) hide)
    )
    (pin "1" (uuid a6286f13-fa7e-48d0-a37f-a1e6d17c2a15))
    (pin "2" (uuid 610515c1-c169-41f9-b2d2-865613183811))
    (instances
      (project "pbv3_test_adapter_carrier"
        (path "/f0f61744-1e8c-4ab3-8121-774876cd6c56/00000000-0000-0000-0000-00005c020d45"
          (reference "R2") (unit 1)
        )
        (path "/f0f61744-1e8c-4ab3-8121-774876cd6c56/00000000-0000-0000-0000-00005c0ca217"
          (reference "R12") (unit 1)
        )
        (path "/f0f61744-1e8c-4ab3-8121-774876cd6c56/00000000-0000-0000-0000-00005c0ce926"
          (reference "R22") (unit 1)
        )
        (path "/f0f61744-1e8c-4ab3-8121-774876cd6c56/00000000-0000-0000-0000-00005c0d315a"
          (reference "R32") (unit 1)
        )
        (path "/f0f61744-1e8c-4ab3-8121-774876cd6c56/00000000-0000-0000-0000-00005c0d317e"
          (reference "R42") (unit 1)
        )
      )
    )
  )

  (symbol (lib_id "lbl_strips:pbv3") (at 127 68.58 0) (unit 1)
    (in_bom yes) (on_board yes) (dnp no)
    (uuid 00000000-0000-0000-0000-000061855a17)
    (property "Reference" "P1" (at 127 51.1302 0)
      (effects (font (size 1.524 1.524)))
    )
    (property "Value" "pbv3" (at 127 53.8226 0)
      (effects (font (size 1.524 1.524)))
    )
    (property "Footprint" "lbl_strips:pbv3_npth" (at 153.67 83.82 0)
      (effects (font (size 1.524 1.524)) hide)
    )
    (property "Datasheet" "" (at 153.67 83.82 0)
      (effects (font (size 1.524 1.524)) hide)
    )
    (pin "1" (uuid 16748919-c1f1-4982-b023-a1485cb8c86e))
    (pin "10" (uuid 61737b9f-1ba4-4d75-bcdf-f401f9338e60))
    (pin "11" (uuid a2d08759-d8f1-4e06-b613-64352d081908))
    (pin "12" (uuid 467d4b6c-7419-4a74-a872-ab84b6da1dc3))
    (pin "13" (uuid 4b6fa935-0c9a-468d-83a8-d91171fa9a47))
    (pin "14" (uuid a0115ca4-a4c4-4bbb-a6ad-0d2995092d83))
    (pin "15" (uuid a9ed9046-9ee6-4f36-b814-0e2ae7853d7d))
    (pin "16" (uuid 685a4b4e-1078-4887-83dd-c42054518da9))
    (pin "17" (uuid 35b8a2b7-4ccb-4e0d-b71e-bee423c203c7))
    (pin "18" (uuid 94c31745-a942-4bf6-adf4-59839a644e91))
    (pin "19" (uuid 5c880fbe-b234-4734-8c91-88b11d7fb01c))
    (pin "2" (uuid ef9ae6ef-6936-482d-a591-e79e8ede5e2e))
    (pin "20" (uuid e0826a0c-1e1a-41d8-bb97-f21b26d26c9c))
    (pin "21" (uuid eea5a110-4ff2-4f97-bc1f-db3c1a5c3e83))
    (pin "22" (uuid c321713d-f89e-4392-8945-8b7b9b04658b))
    (pin "23" (uuid 0cdc3a74-f75a-490e-9083-0d8761f3ed61))
    (pin "24" (uuid b6651028-4787-4e15-b7a1-bad93a99e3f4))
    (pin "25" (uuid 9cb94f75-3f71-4e11-9346-44e6e2e7ade5))
    (pin "26" (uuid cd7f921b-3939-400c-9cfc-cb82fba10d94))
    (pin "27" (uuid e258ced1-2be7-40b5-9d22-ea6df1607922))
    (pin "28" (uuid 96e8e64e-0cfa-4a10-9633-102dc7f994f7))
    (pin "29" (uuid 3dd8b7f5-8c70-4b9d-ad8a-d52f1109b0bf))
    (pin "3" (uuid 6485825e-d96e-40c8-aaf7-6b89461d1cd7))
    (pin "30" (uuid 56c782af-7838-4029-8d17-db7edf4b1b17))
    (pin "31" (uuid b2da8ad1-562b-4fe7-b5d9-e525c28af6fe))
    (pin "32" (uuid 9cec8d0d-27d1-4aad-b465-03f9f6ba472e))
    (pin "33" (uuid afff8f0f-00f4-41d6-b767-2e87aeb6d3e0))
    (pin "34" (uuid a25f9907-f8a3-4898-9c3e-b2539767954c))
    (pin "35" (uuid 63af6f39-954b-4f65-a320-c33fab7bf714))
    (pin "36" (uuid d58340ca-265e-4414-9bcb-d88c18377b42))
    (pin "37" (uuid 0ba9b63a-90c8-4d25-af04-6e7a56530f0c))
    (pin "38" (uuid 7e106c00-df91-411f-955f-bcc7a84ce16a))
    (pin "39" (uuid e21e6775-6d7c-406d-a796-8aad7a7ebdc8))
    (pin "4" (uuid ae5a9999-fdc2-43d3-a903-8a9197c8d1fb))
    (pin "5" (uuid 18bb58ae-adac-4412-8bf7-1dd5afc99eab))
    (pin "6" (uuid ffe98822-9e0c-409e-bf25-bc23aa0b2556))
    (pin "7" (uuid 40dbca2f-237f-4d7b-a32f-8302048593e7))
    (pin "8" (uuid 16fc3afc-4c4b-4e25-bea9-9b62a3840fa3))
    (pin "9" (uuid b54e387d-646e-42f9-b297-10ddb7618689))
    (instances
      (project "pbv3_test_adapter_carrier"
        (path "/f0f61744-1e8c-4ab3-8121-774876cd6c56/00000000-0000-0000-0000-00005c020d45"
          (reference "P1") (unit 1)
        )
        (path "/f0f61744-1e8c-4ab3-8121-774876cd6c56/00000000-0000-0000-0000-00005c0ca217"
          (reference "P3") (unit 1)
        )
        (path "/f0f61744-1e8c-4ab3-8121-774876cd6c56/00000000-0000-0000-0000-00005c0ce926"
          (reference "P5") (unit 1)
        )
        (path "/f0f61744-1e8c-4ab3-8121-774876cd6c56/00000000-0000-0000-0000-00005c0d315a"
          (reference "P7") (unit 1)
        )
        (path "/f0f61744-1e8c-4ab3-8121-774876cd6c56/00000000-0000-0000-0000-00005c0d317e"
          (reference "P9") (unit 1)
        )
      )
    )
  )

  (symbol (lib_id "power:GNDPWR") (at 20.32 30.48 0) (unit 1)
    (in_bom yes) (on_board yes) (dnp no)
    (uuid 00000000-0000-0000-0000-000061855a1e)
    (property "Reference" "#PWR0103" (at 20.32 35.56 0)
      (effects (font (size 1.27 1.27)) hide)
    )
    (property "Value" "GNDPWR" (at 20.4216 34.3916 0)
      (effects (font (size 1.27 1.27)))
    )
    (property "Footprint" "" (at 20.32 31.75 0)
      (effects (font (size 1.27 1.27)) hide)
    )
    (property "Datasheet" "" (at 20.32 31.75 0)
      (effects (font (size 1.27 1.27)) hide)
    )
    (pin "1" (uuid a60432c0-eae0-405b-8173-011313f34ab5))
    (instances
      (project "pbv3_test_adapter_carrier"
        (path "/f0f61744-1e8c-4ab3-8121-774876cd6c56/00000000-0000-0000-0000-00005c020d45"
          (reference "#PWR0103") (unit 1)
        )
        (path "/f0f61744-1e8c-4ab3-8121-774876cd6c56/00000000-0000-0000-0000-00005c0ca217"
          (reference "#PWR0119") (unit 1)
        )
        (path "/f0f61744-1e8c-4ab3-8121-774876cd6c56/00000000-0000-0000-0000-00005c0ce926"
          (reference "#PWR0131") (unit 1)
        )
        (path "/f0f61744-1e8c-4ab3-8121-774876cd6c56/00000000-0000-0000-0000-00005c0d315a"
          (reference "#PWR0143") (unit 1)
        )
        (path "/f0f61744-1e8c-4ab3-8121-774876cd6c56/00000000-0000-0000-0000-00005c0d317e"
          (reference "#PWR0155") (unit 1)
        )
      )
    )
  )

  (symbol (lib_id "Device:R") (at 137.16 110.49 0) (unit 1)
    (in_bom yes) (on_board yes) (dnp no)
    (uuid 00000000-0000-0000-0000-000061855a21)
    (property "Reference" "R3" (at 138.938 109.3216 0)
      (effects (font (size 1.27 1.27)) (justify left))
    )
    (property "Value" "0" (at 138.938 111.633 0)
      (effects (font (size 1.27 1.27)) (justify left))
    )
    (property "Footprint" "Resistor_SMD:R_0805_2012Metric" (at 135.382 110.49 90)
      (effects (font (size 1.27 1.27)) hide)
    )
    (property "Datasheet" "~" (at 137.16 110.49 0)
      (effects (font (size 1.27 1.27)) hide)
    )
    (property "mfg#" "CRG0805F20K" (at 137.16 110.49 0)
      (effects (font (size 1.27 1.27)) hide)
    )
    (pin "1" (uuid 86e3bed2-34ae-471a-a544-8ff7e3a5c08d))
    (pin "2" (uuid 97bc8c4a-6d43-4b1d-9fa6-4cf5bf9e4708))
    (instances
      (project "pbv3_test_adapter_carrier"
        (path "/f0f61744-1e8c-4ab3-8121-774876cd6c56/00000000-0000-0000-0000-00005c020d45"
          (reference "R3") (unit 1)
        )
        (path "/f0f61744-1e8c-4ab3-8121-774876cd6c56/00000000-0000-0000-0000-00005c0ca217"
          (reference "R13") (unit 1)
        )
        (path "/f0f61744-1e8c-4ab3-8121-774876cd6c56/00000000-0000-0000-0000-00005c0ce926"
          (reference "R23") (unit 1)
        )
        (path "/f0f61744-1e8c-4ab3-8121-774876cd6c56/00000000-0000-0000-0000-00005c0d315a"
          (reference "R33") (unit 1)
        )
        (path "/f0f61744-1e8c-4ab3-8121-774876cd6c56/00000000-0000-0000-0000-00005c0d317e"
          (reference "R43") (unit 1)
        )
      )
    )
  )

  (symbol (lib_id "Device:R") (at 24.765 58.42 0) (unit 1)
    (in_bom yes) (on_board yes) (dnp no)
    (uuid 00000000-0000-0000-0000-000061855a24)
    (property "Reference" "R52" (at 26.543 57.2516 0)
      (effects (font (size 1.27 1.27)) (justify left))
    )
    (property "Value" "2k" (at 26.543 59.563 0)
      (effects (font (size 1.27 1.27)) (justify left))
    )
    (property "Footprint" "Resistor_SMD:R_0805_2012Metric" (at 22.987 58.42 90)
      (effects (font (size 1.27 1.27)) hide)
    )
    (property "Datasheet" "~" (at 24.765 58.42 0)
      (effects (font (size 1.27 1.27)) hide)
    )
    (pin "1" (uuid ed52099f-3459-42ab-8930-8138dae91dac))
    (pin "2" (uuid f9a2f021-1653-41c6-b952-186fa222be57))
    (instances
      (project "pbv3_test_adapter_carrier"
        (path "/f0f61744-1e8c-4ab3-8121-774876cd6c56/00000000-0000-0000-0000-00005c020d45"
          (reference "R52") (unit 1)
        )
        (path "/f0f61744-1e8c-4ab3-8121-774876cd6c56/00000000-0000-0000-0000-00005c0ca217"
          (reference "R55") (unit 1)
        )
        (path "/f0f61744-1e8c-4ab3-8121-774876cd6c56/00000000-0000-0000-0000-00005c0ce926"
          (reference "R57") (unit 1)
        )
        (path "/f0f61744-1e8c-4ab3-8121-774876cd6c56/00000000-0000-0000-0000-00005c0d315a"
          (reference "R59") (unit 1)
        )
        (path "/f0f61744-1e8c-4ab3-8121-774876cd6c56/00000000-0000-0000-0000-00005c0d317e"
          (reference "R61") (unit 1)
        )
      )
    )
  )

  (symbol (lib_id "power:+3V3") (at 24.765 52.705 0) (unit 1)
    (in_bom yes) (on_board yes) (dnp no)
    (uuid 00000000-0000-0000-0000-000061855a25)
    (property "Reference" "#PWR0163" (at 24.765 56.515 0)
      (effects (font (size 1.27 1.27)) hide)
    )
    (property "Value" "+3V3" (at 25.146 48.3108 0)
      (effects (font (size 1.27 1.27)))
    )
    (property "Footprint" "" (at 24.765 52.705 0)
      (effects (font (size 1.27 1.27)) hide)
    )
    (property "Datasheet" "" (at 24.765 52.705 0)
      (effects (font (size 1.27 1.27)) hide)
    )
    (pin "1" (uuid b8360f3c-5081-47a2-a159-20bb4ac2296a))
    (instances
      (project "pbv3_test_adapter_carrier"
        (path "/f0f61744-1e8c-4ab3-8121-774876cd6c56/00000000-0000-0000-0000-00005c020d45"
          (reference "#PWR0163") (unit 1)
        )
        (path "/f0f61744-1e8c-4ab3-8121-774876cd6c56/00000000-0000-0000-0000-00005c0ca217"
          (reference "#PWR0178") (unit 1)
        )
        (path "/f0f61744-1e8c-4ab3-8121-774876cd6c56/00000000-0000-0000-0000-00005c0ce926"
          (reference "#PWR0180") (unit 1)
        )
        (path "/f0f61744-1e8c-4ab3-8121-774876cd6c56/00000000-0000-0000-0000-00005c0d315a"
          (reference "#PWR0182") (unit 1)
        )
        (path "/f0f61744-1e8c-4ab3-8121-774876cd6c56/00000000-0000-0000-0000-00005c0d317e"
          (reference "#PWR0184") (unit 1)
        )
      )
    )
  )

  (symbol (lib_id "Device:R") (at 203.835 99.695 0) (unit 1)
    (in_bom yes) (on_board yes) (dnp no)
    (uuid 00000000-0000-0000-0000-0000618a7678)
    (property "Reference" "R79" (at 205.613 98.5266 0)
      (effects (font (size 1.27 1.27)) (justify left))
    )
    (property "Value" "10k" (at 205.613 100.838 0)
      (effects (font (size 1.27 1.27)) (justify left))
    )
    (property "Footprint" "Resistor_SMD:R_0805_2012Metric" (at 202.057 99.695 90)
      (effects (font (size 1.27 1.27)) hide)
    )
    (property "Datasheet" "~" (at 203.835 99.695 0)
      (effects (font (size 1.27 1.27)) hide)
    )
    (pin "1" (uuid b00f093c-6426-4b22-aa14-7c62c314703d))
    (pin "2" (uuid f924e6be-130f-4496-84fa-e5c6d458ad46))
    (instances
      (project "pbv3_test_adapter_carrier"
        (path "/f0f61744-1e8c-4ab3-8121-774876cd6c56/00000000-0000-0000-0000-00005c020d45"
          (reference "R79") (unit 1)
        )
        (path "/f0f61744-1e8c-4ab3-8121-774876cd6c56/00000000-0000-0000-0000-00005c0ca217"
          (reference "R82") (unit 1)
        )
        (path "/f0f61744-1e8c-4ab3-8121-774876cd6c56/00000000-0000-0000-0000-00005c0ce926"
          (reference "R85") (unit 1)
        )
        (path "/f0f61744-1e8c-4ab3-8121-774876cd6c56/00000000-0000-0000-0000-00005c0d315a"
          (reference "R88") (unit 1)
        )
        (path "/f0f61744-1e8c-4ab3-8121-774876cd6c56/00000000-0000-0000-0000-00005c0d317e"
          (reference "R91") (unit 1)
        )
      )
    )
  )

  (symbol (lib_id "Device:R") (at 203.835 108.585 0) (unit 1)
    (in_bom yes) (on_board yes) (dnp no)
    (uuid 00000000-0000-0000-0000-0000618a767e)
    (property "Reference" "R80" (at 205.613 107.4166 0)
      (effects (font (size 1.27 1.27)) (justify left))
    )
    (property "Value" "10k" (at 205.613 109.728 0)
      (effects (font (size 1.27 1.27)) (justify left))
    )
    (property "Footprint" "Resistor_SMD:R_0805_2012Metric" (at 202.057 108.585 90)
      (effects (font (size 1.27 1.27)) hide)
    )
    (property "Datasheet" "~" (at 203.835 108.585 0)
      (effects (font (size 1.27 1.27)) hide)
    )
    (pin "1" (uuid 81f110e7-007f-4eff-88b6-7fc421406467))
    (pin "2" (uuid 44e5cb2e-2d81-4122-964f-c178d414ef92))
    (instances
      (project "pbv3_test_adapter_carrier"
        (path "/f0f61744-1e8c-4ab3-8121-774876cd6c56/00000000-0000-0000-0000-00005c020d45"
          (reference "R80") (unit 1)
        )
        (path "/f0f61744-1e8c-4ab3-8121-774876cd6c56/00000000-0000-0000-0000-00005c0ca217"
          (reference "R83") (unit 1)
        )
        (path "/f0f61744-1e8c-4ab3-8121-774876cd6c56/00000000-0000-0000-0000-00005c0ce926"
          (reference "R86") (unit 1)
        )
        (path "/f0f61744-1e8c-4ab3-8121-774876cd6c56/00000000-0000-0000-0000-00005c0d315a"
          (reference "R89") (unit 1)
        )
        (path "/f0f61744-1e8c-4ab3-8121-774876cd6c56/00000000-0000-0000-0000-00005c0d317e"
          (reference "R92") (unit 1)
        )
      )
    )
  )

  (symbol (lib_id "power:GND") (at 207.645 113.665 0) (unit 1)
    (in_bom yes) (on_board yes) (dnp no)
    (uuid 00000000-0000-0000-0000-0000618a7684)
    (property "Reference" "#PWR08" (at 207.645 120.015 0)
      (effects (font (size 1.27 1.27)) hide)
    )
    (property "Value" "GND" (at 207.772 118.0592 0)
      (effects (font (size 1.27 1.27)))
    )
    (property "Footprint" "" (at 207.645 113.665 0)
      (effects (font (size 1.27 1.27)) hide)
    )
    (property "Datasheet" "" (at 207.645 113.665 0)
      (effects (font (size 1.27 1.27)) hide)
    )
    (pin "1" (uuid 311bc691-527b-4ec8-854e-dcd4ec2825f0))
    (instances
      (project "pbv3_test_adapter_carrier"
        (path "/f0f61744-1e8c-4ab3-8121-774876cd6c56/00000000-0000-0000-0000-00005c020d45"
          (reference "#PWR08") (unit 1)
        )
        (path "/f0f61744-1e8c-4ab3-8121-774876cd6c56/00000000-0000-0000-0000-00005c0ca217"
          (reference "#PWR010") (unit 1)
        )
        (path "/f0f61744-1e8c-4ab3-8121-774876cd6c56/00000000-0000-0000-0000-00005c0ce926"
          (reference "#PWR012") (unit 1)
        )
        (path "/f0f61744-1e8c-4ab3-8121-774876cd6c56/00000000-0000-0000-0000-00005c0d315a"
          (reference "#PWR014") (unit 1)
        )
        (path "/f0f61744-1e8c-4ab3-8121-774876cd6c56/00000000-0000-0000-0000-00005c0d317e"
          (reference "#PWR016") (unit 1)
        )
      )
    )
  )

  (symbol (lib_id "Device:D_Zener") (at 212.09 108.585 270) (unit 1)
    (in_bom yes) (on_board yes) (dnp no)
    (uuid 00000000-0000-0000-0000-0000618a7690)
    (property "Reference" "D11" (at 214.122 107.4166 90)
      (effects (font (size 1.27 1.27)) (justify left))
    )
    (property "Value" "BZT52-C3V0J" (at 214.122 109.728 90)
      (effects (font (size 1.27 1.27)) (justify left))
    )
    (property "Footprint" "Diode_SMD:D_SOD-123" (at 212.09 108.585 0)
      (effects (font (size 1.27 1.27)) hide)
    )
    (property "Datasheet" "~" (at 212.09 108.585 0)
      (effects (font (size 1.27 1.27)) hide)
    )
    (pin "1" (uuid 044acd4c-8ab6-4878-8ad7-ed0f7f7e14aa))
    (pin "2" (uuid 4a43ac03-fd2e-4c7f-9b22-3c5e9c36540b))
    (instances
      (project "pbv3_test_adapter_carrier"
        (path "/f0f61744-1e8c-4ab3-8121-774876cd6c56/00000000-0000-0000-0000-00005c020d45"
          (reference "D11") (unit 1)
        )
        (path "/f0f61744-1e8c-4ab3-8121-774876cd6c56/00000000-0000-0000-0000-00005c0ca217"
          (reference "D13") (unit 1)
        )
        (path "/f0f61744-1e8c-4ab3-8121-774876cd6c56/00000000-0000-0000-0000-00005c0ce926"
          (reference "D15") (unit 1)
        )
        (path "/f0f61744-1e8c-4ab3-8121-774876cd6c56/00000000-0000-0000-0000-00005c0d315a"
          (reference "D17") (unit 1)
        )
        (path "/f0f61744-1e8c-4ab3-8121-774876cd6c56/00000000-0000-0000-0000-00005c0d317e"
          (reference "D19") (unit 1)
        )
      )
    )
  )

  (symbol (lib_id "power:GND") (at 235.585 113.665 0) (unit 1)
    (in_bom yes) (on_board yes) (dnp no)
    (uuid 00000000-0000-0000-0000-0000618a769c)
    (property "Reference" "#PWR09" (at 235.585 120.015 0)
      (effects (font (size 1.27 1.27)) hide)
    )
    (property "Value" "GND" (at 235.712 118.0592 0)
      (effects (font (size 1.27 1.27)))
    )
    (property "Footprint" "" (at 235.585 113.665 0)
      (effects (font (size 1.27 1.27)) hide)
    )
    (property "Datasheet" "" (at 235.585 113.665 0)
      (effects (font (size 1.27 1.27)) hide)
    )
    (pin "1" (uuid 4f32196b-4002-4027-8d94-5cdce791094a))
    (instances
      (project "pbv3_test_adapter_carrier"
        (path "/f0f61744-1e8c-4ab3-8121-774876cd6c56/00000000-0000-0000-0000-00005c020d45"
          (reference "#PWR09") (unit 1)
        )
        (path "/f0f61744-1e8c-4ab3-8121-774876cd6c56/00000000-0000-0000-0000-00005c0ca217"
          (reference "#PWR011") (unit 1)
        )
        (path "/f0f61744-1e8c-4ab3-8121-774876cd6c56/00000000-0000-0000-0000-00005c0ce926"
          (reference "#PWR013") (unit 1)
        )
        (path "/f0f61744-1e8c-4ab3-8121-774876cd6c56/00000000-0000-0000-0000-00005c0d315a"
          (reference "#PWR015") (unit 1)
        )
        (path "/f0f61744-1e8c-4ab3-8121-774876cd6c56/00000000-0000-0000-0000-00005c0d317e"
          (reference "#PWR017") (unit 1)
        )
      )
    )
  )

  (symbol (lib_id "Device:D_Zener") (at 235.585 108.585 270) (unit 1)
    (in_bom yes) (on_board yes) (dnp no)
    (uuid 00000000-0000-0000-0000-0000618a76a3)
    (property "Reference" "D12" (at 237.617 107.4166 90)
      (effects (font (size 1.27 1.27)) (justify left))
    )
    (property "Value" "BZT52-C3V0J" (at 237.617 109.728 90)
      (effects (font (size 1.27 1.27)) (justify left))
    )
    (property "Footprint" "Diode_SMD:D_SOD-123" (at 235.585 108.585 0)
      (effects (font (size 1.27 1.27)) hide)
    )
    (property "Datasheet" "~" (at 235.585 108.585 0)
      (effects (font (size 1.27 1.27)) hide)
    )
    (pin "1" (uuid 120f3aa8-cba0-4a1c-9ca2-0ed9fc7f9d89))
    (pin "2" (uuid cc3f1edf-26e4-4c7e-b865-87347e001f5b))
    (instances
      (project "pbv3_test_adapter_carrier"
        (path "/f0f61744-1e8c-4ab3-8121-774876cd6c56/00000000-0000-0000-0000-00005c020d45"
          (reference "D12") (unit 1)
        )
        (path "/f0f61744-1e8c-4ab3-8121-774876cd6c56/00000000-0000-0000-0000-00005c0ca217"
          (reference "D14") (unit 1)
        )
        (path "/f0f61744-1e8c-4ab3-8121-774876cd6c56/00000000-0000-0000-0000-00005c0ce926"
          (reference "D16") (unit 1)
        )
        (path "/f0f61744-1e8c-4ab3-8121-774876cd6c56/00000000-0000-0000-0000-00005c0d315a"
          (reference "D18") (unit 1)
        )
        (path "/f0f61744-1e8c-4ab3-8121-774876cd6c56/00000000-0000-0000-0000-00005c0d317e"
          (reference "D20") (unit 1)
        )
      )
    )
  )

  (symbol (lib_id "Device:R") (at 37.465 97.79 270) (unit 1)
    (in_bom yes) (on_board yes) (dnp no)
    (uuid 00000000-0000-0000-0000-0000618aab2a)
    (property "Reference" "R78" (at 37.465 92.5322 90)
      (effects (font (size 1.27 1.27)))
    )
    (property "Value" "0" (at 37.465 94.8436 90)
      (effects (font (size 1.27 1.27)))
    )
    (property "Footprint" "Resistor_SMD:R_0805_2012Metric" (at 37.465 96.012 90)
      (effects (font (size 1.27 1.27)) hide)
    )
    (property "Datasheet" "~" (at 37.465 97.79 0)
      (effects (font (size 1.27 1.27)) hide)
    )
    (pin "1" (uuid 522cef65-86aa-422c-b4f5-64031ca7c626))
    (pin "2" (uuid f66c3f5f-46ba-4161-a69a-95d92134bb9c))
    (instances
      (project "pbv3_test_adapter_carrier"
        (path "/f0f61744-1e8c-4ab3-8121-774876cd6c56/00000000-0000-0000-0000-00005c020d45"
          (reference "R78") (unit 1)
        )
        (path "/f0f61744-1e8c-4ab3-8121-774876cd6c56/00000000-0000-0000-0000-00005c0ca217"
          (reference "R81") (unit 1)
        )
        (path "/f0f61744-1e8c-4ab3-8121-774876cd6c56/00000000-0000-0000-0000-00005c0ce926"
          (reference "R84") (unit 1)
        )
        (path "/f0f61744-1e8c-4ab3-8121-774876cd6c56/00000000-0000-0000-0000-00005c0d315a"
          (reference "R87") (unit 1)
        )
        (path "/f0f61744-1e8c-4ab3-8121-774876cd6c56/00000000-0000-0000-0000-00005c0d317e"
          (reference "R90") (unit 1)
        )
      )
    )
  )
)
