EESchema Schematic File Version 4
EELAYER 30 0
EELAYER END
$Descr A4 11693 8268
encoding utf-8
Sheet 3 4
Title "Powerboard v3 Massive Active Tester Board"
Date "2019-06-04"
Rev ""
Comp "Lawrence Berkeley National Laboratory"
Comment1 ""
Comment2 ""
Comment3 ""
Comment4 ""
$EndDescr
$Comp
L power:+5V #PWR037
U 1 1 5A260093
P 6650 3750
AR Path="/59C2F489/5A260093" Ref="#PWR037"  Part="1" 
AR Path="/5D418DA8/5A260093" Ref="#PWR?"  Part="1" 
F 0 "#PWR037" H 6650 3600 50  0001 C CNN
F 1 "+5V" H 6650 3890 50  0000 C CNN
F 2 "" H 6650 3750 50  0001 C CNN
F 3 "" H 6650 3750 50  0001 C CNN
	1    6650 3750
	1    0    0    -1  
$EndComp
$Comp
L power:+5V #PWR042
U 1 1 5A2600D2
P 10350 3750
AR Path="/59C2F489/5A2600D2" Ref="#PWR042"  Part="1" 
AR Path="/5D418DA8/5A2600D2" Ref="#PWR?"  Part="1" 
F 0 "#PWR042" H 10350 3600 50  0001 C CNN
F 1 "+5V" H 10350 3890 50  0000 C CNN
F 2 "" H 10350 3750 50  0001 C CNN
F 3 "" H 10350 3750 50  0001 C CNN
	1    10350 3750
	-1   0    0    -1  
$EndComp
$Comp
L power:GND #PWR039
U 1 1 5A260431
P 6950 6050
AR Path="/59C2F489/5A260431" Ref="#PWR039"  Part="1" 
AR Path="/5D418DA8/5A260431" Ref="#PWR?"  Part="1" 
F 0 "#PWR039" H 6950 5800 50  0001 C CNN
F 1 "GND" H 6950 5900 50  0000 C CNN
F 2 "" H 6950 6050 50  0001 C CNN
F 3 "" H 6950 6050 50  0001 C CNN
	1    6950 6050
	1    0    0    -1  
$EndComp
$Comp
L power:GND #PWR041
U 1 1 5A260590
P 10050 6050
AR Path="/59C2F489/5A260590" Ref="#PWR041"  Part="1" 
AR Path="/5D418DA8/5A260590" Ref="#PWR?"  Part="1" 
F 0 "#PWR041" H 10050 5800 50  0001 C CNN
F 1 "GND" H 10050 5900 50  0000 C CNN
F 2 "" H 10050 6050 50  0001 C CNN
F 3 "" H 10050 6050 50  0001 C CNN
	1    10050 6050
	-1   0    0    -1  
$EndComp
NoConn ~ 9500 1600
NoConn ~ 9500 5600
NoConn ~ 9500 5700
NoConn ~ 9500 5900
NoConn ~ 7500 1100
NoConn ~ 7500 1200
NoConn ~ 7500 1400
NoConn ~ 2900 1000
NoConn ~ 2900 1100
NoConn ~ 2900 1200
NoConn ~ 2900 1300
NoConn ~ 2900 5800
NoConn ~ 2900 5900
NoConn ~ 4900 1000
NoConn ~ 4900 1100
NoConn ~ 4900 1200
NoConn ~ 4900 1300
NoConn ~ 4900 5800
NoConn ~ 4900 5900
Wire Wire Line
	10350 3750 10350 3800
Connection ~ 10350 3800
Wire Wire Line
	2900 5700 2350 5700
Connection ~ 2350 5700
Wire Wire Line
	2900 4800 2350 4800
Connection ~ 2350 4800
Wire Wire Line
	2900 5200 2350 5200
Connection ~ 2350 5200
Wire Wire Line
	2900 4500 2350 4500
Connection ~ 2350 4500
Wire Wire Line
	2900 4200 2350 4200
Connection ~ 2350 4200
Wire Wire Line
	2900 3500 2350 3500
Connection ~ 2350 3500
Wire Wire Line
	2900 3200 2350 3200
Connection ~ 2350 3200
Wire Wire Line
	2900 2900 2350 2900
Connection ~ 2350 2900
Wire Wire Line
	2900 2600 2350 2600
Connection ~ 2350 2600
Wire Wire Line
	6950 5500 7500 5500
Connection ~ 6950 5500
Wire Wire Line
	6950 4800 7500 4800
Connection ~ 6950 4800
Wire Wire Line
	6950 5200 7500 5200
Connection ~ 6950 5200
Wire Wire Line
	6950 4500 7500 4500
Connection ~ 6950 4500
Wire Wire Line
	6950 4200 7500 4200
Connection ~ 6950 4200
Wire Wire Line
	6950 3500 7500 3500
Connection ~ 6950 3500
Wire Wire Line
	6950 3200 7500 3200
Connection ~ 6950 3200
Wire Wire Line
	6950 2900 7500 2900
Connection ~ 6950 2900
Wire Wire Line
	10050 5500 9500 5500
Wire Wire Line
	10050 5200 9500 5200
Wire Wire Line
	10050 4500 9500 4500
Wire Wire Line
	10050 4200 9500 4200
Wire Wire Line
	10050 3500 9500 3500
Wire Wire Line
	10050 3200 9500 3200
Wire Wire Line
	10050 2900 9500 2900
Wire Wire Line
	10050 2600 9500 2600
Connection ~ 10050 2600
Wire Wire Line
	10050 2300 9500 2300
Connection ~ 10050 2300
Wire Wire Line
	9500 2000 10050 2000
Wire Wire Line
	9500 1700 10050 1700
Wire Wire Line
	4900 5700 5450 5700
Connection ~ 5450 5700
Wire Wire Line
	4900 5200 5450 5200
Connection ~ 5450 5200
Wire Wire Line
	4900 4500 5450 4500
Connection ~ 5450 4500
Wire Wire Line
	4900 4200 5450 4200
Connection ~ 5450 4200
Wire Wire Line
	4900 3500 5450 3500
Connection ~ 5450 3500
Wire Wire Line
	4900 3200 5450 3200
Connection ~ 5450 3200
Wire Wire Line
	4900 2900 5450 2900
Connection ~ 5450 2900
Wire Wire Line
	4900 2600 5450 2600
Wire Wire Line
	10350 4750 10350 4800
Connection ~ 10350 4800
NoConn ~ 4900 1400
NoConn ~ 2900 1400
NoConn ~ 7500 1500
$Comp
L power:GND #PWR033
U 1 1 5B6420DB
P 2350 6250
AR Path="/59C2F489/5B6420DB" Ref="#PWR033"  Part="1" 
AR Path="/5D418DA8/5B6420DB" Ref="#PWR?"  Part="1" 
F 0 "#PWR033" H 2350 6000 50  0001 C CNN
F 1 "GND" H 2350 6100 50  0000 C CNN
F 2 "" H 2350 6250 50  0001 C CNN
F 3 "" H 2350 6250 50  0001 C CNN
	1    2350 6250
	1    0    0    -1  
$EndComp
$Comp
L power:GND #PWR034
U 1 1 5B6426A9
P 5450 6250
AR Path="/59C2F489/5B6426A9" Ref="#PWR034"  Part="1" 
AR Path="/5D418DA8/5B6426A9" Ref="#PWR?"  Part="1" 
F 0 "#PWR034" H 5450 6000 50  0001 C CNN
F 1 "GND" H 5450 6100 50  0000 C CNN
F 2 "" H 5450 6250 50  0001 C CNN
F 3 "" H 5450 6250 50  0001 C CNN
	1    5450 6250
	1    0    0    -1  
$EndComp
Wire Wire Line
	10350 3800 10350 3900
Wire Wire Line
	2350 5700 2350 6250
Wire Wire Line
	2350 4800 2350 5200
Wire Wire Line
	2350 5200 2350 5700
Wire Wire Line
	2350 4500 2350 4800
Wire Wire Line
	2350 4200 2350 4500
Wire Wire Line
	2350 3500 2350 4200
Wire Wire Line
	2350 3200 2350 3500
Wire Wire Line
	2350 2900 2350 3200
Wire Wire Line
	2350 2600 2350 2900
Wire Wire Line
	6950 5500 6950 6050
Wire Wire Line
	6950 4800 6950 5200
Wire Wire Line
	6950 5200 6950 5500
Wire Wire Line
	6950 4500 6950 4800
Wire Wire Line
	6950 4200 6950 4500
Wire Wire Line
	6950 3500 6950 4200
Wire Wire Line
	6950 3200 6950 3500
Wire Wire Line
	6950 2900 6950 3200
Wire Wire Line
	6950 2600 6950 2900
Wire Wire Line
	10050 5500 10050 6050
Wire Wire Line
	10050 2600 10050 2900
Wire Wire Line
	10050 2300 10050 2600
Wire Wire Line
	10050 2000 10050 2300
Wire Wire Line
	5450 5700 5450 6250
Wire Wire Line
	5450 5200 5450 5700
Wire Wire Line
	5450 4500 5450 5200
Wire Wire Line
	5450 4200 5450 4500
Wire Wire Line
	5450 3500 5450 4200
Wire Wire Line
	5450 3200 5450 3500
Wire Wire Line
	5450 2900 5450 3200
Wire Wire Line
	5450 2600 5450 2900
Wire Wire Line
	10350 4800 10350 4900
Text HLabel 9500 1800 2    60   Output ~ 12
A0_CMDin_P
Text HLabel 9500 1900 2    60   Output ~ 12
A0_CMDin_N
Wire Wire Line
	9500 3800 10350 3800
Wire Wire Line
	9500 3900 10350 3900
Text HLabel 9500 2200 2    60   BiDi ~ 12
A0_SDA
Text HLabel 9500 2100 2    60   Output ~ 12
A0_SCL
Wire Wire Line
	9500 4800 10350 4800
Wire Wire Line
	9500 4900 10350 4900
Wire Wire Line
	10050 2900 10050 3200
Connection ~ 10050 2900
Connection ~ 10050 5500
Connection ~ 10050 3200
Wire Wire Line
	10050 3200 10050 3500
Connection ~ 10050 3500
Wire Wire Line
	10050 3500 10050 4200
Connection ~ 10050 4200
Wire Wire Line
	10050 4200 10050 4500
Connection ~ 10050 4500
Wire Wire Line
	10050 4500 10050 5200
Connection ~ 10050 5200
Wire Wire Line
	10050 5200 10050 5500
Wire Wire Line
	6650 3900 6650 3800
Wire Wire Line
	6650 3800 6650 3750
Connection ~ 6650 3800
Wire Wire Line
	6650 3900 7500 3900
Wire Wire Line
	6650 3800 7500 3800
Wire Wire Line
	6950 2600 7500 2600
NoConn ~ 2900 1500
Text Label 2900 5100 2    60   ~ 0
CMDin_P0
Text Label 2900 5000 2    60   ~ 0
CMDin_N0
Text Label 9500 3100 0    60   ~ 12
CMDin_P6
Text Label 9500 3000 0    60   ~ 12
CMDin_N6
Text Label 9500 3600 0    60   ~ 12
CMDin_P7
Text Label 9500 3700 0    60   ~ 12
CMDin_N7
Text Label 9500 4300 0    60   ~ 12
CMDin_P8
Text Label 9500 4400 0    60   ~ 12
CMDin_N8
Text Label 9500 5000 0    60   ~ 12
CMDin_P9
Text Label 9500 5100 0    60   ~ 12
CMDin_N9
Wire Wire Line
	6650 4900 6650 4850
Text Label 9500 2800 0    60   ~ 12
CMDout_P5
Text Label 9500 2700 0    60   ~ 12
CMDout_N5
Text Label 9500 3400 0    60   ~ 12
CMDout_P6
Text Label 9500 3300 0    60   ~ 12
CMDout_N6
Text Label 9500 4000 0    60   ~ 12
CMDout_P7
Text Label 9500 4100 0    60   ~ 12
CMDout_N7
Text Label 9500 4600 0    60   ~ 12
CMDout_P8
Text Label 9500 5400 0    60   ~ 12
CMDout_P9
Text Label 9500 5300 0    60   ~ 12
CMDout_N9
Wire Bus Line
	1300 550  1250 550 
Entry Wire Line
	1300 600  1400 700 
Entry Wire Line
	1300 700  1400 800 
Entry Wire Line
	1300 800  1400 900 
Entry Wire Line
	1300 900  1400 1000
Entry Wire Line
	1300 1000 1400 1100
Entry Wire Line
	1300 1100 1400 1200
Entry Wire Line
	1300 1200 1400 1300
Entry Wire Line
	1300 1300 1400 1400
Entry Wire Line
	1300 1400 1400 1500
Wire Wire Line
	1400 700  1450 700 
Wire Wire Line
	1400 800  1450 800 
Wire Wire Line
	1400 900  1450 900 
Wire Wire Line
	1400 1000 1450 1000
Wire Wire Line
	1400 1100 1450 1100
Wire Wire Line
	1400 1200 1450 1200
Wire Wire Line
	1400 1300 1450 1300
Wire Wire Line
	1400 1400 1450 1400
Wire Wire Line
	1400 1500 1450 1500
Entry Wire Line
	1300 1500 1400 1600
Wire Wire Line
	1400 1600 1450 1600
Text HLabel 1250 550  0    60   Output ~ 12
CMDin_P[0..9]
Wire Bus Line
	1300 1700 1250 1700
Entry Wire Line
	1300 1750 1400 1850
Entry Wire Line
	1300 1850 1400 1950
Entry Wire Line
	1300 1950 1400 2050
Entry Wire Line
	1300 2050 1400 2150
Entry Wire Line
	1300 2150 1400 2250
Entry Wire Line
	1300 2250 1400 2350
Entry Wire Line
	1300 2350 1400 2450
Entry Wire Line
	1300 2450 1400 2550
Entry Wire Line
	1300 2550 1400 2650
Wire Wire Line
	1400 1850 1450 1850
Wire Wire Line
	1400 1950 1450 1950
Wire Wire Line
	1400 2050 1450 2050
Wire Wire Line
	1400 2150 1450 2150
Wire Wire Line
	1400 2250 1450 2250
Wire Wire Line
	1400 2350 1450 2350
Wire Wire Line
	1400 2450 1450 2450
Wire Wire Line
	1400 2550 1450 2550
Wire Wire Line
	1400 2650 1450 2650
Entry Wire Line
	1300 2650 1400 2750
Wire Wire Line
	1400 2750 1450 2750
Text HLabel 1250 1700 0    60   Output ~ 0
CMDin_N[0..9]
Wire Bus Line
	1300 2850 1250 2850
Entry Wire Line
	1300 2900 1400 3000
Entry Wire Line
	1300 3000 1400 3100
Entry Wire Line
	1300 3100 1400 3200
Entry Wire Line
	1300 3200 1400 3300
Entry Wire Line
	1300 3300 1400 3400
Entry Wire Line
	1300 3400 1400 3500
Entry Wire Line
	1300 3500 1400 3600
Entry Wire Line
	1300 3600 1400 3700
Entry Wire Line
	1300 3700 1400 3800
Wire Wire Line
	1400 3000 1450 3000
Wire Wire Line
	1400 3100 1450 3100
Wire Wire Line
	1400 3200 1450 3200
Wire Wire Line
	1400 3300 1450 3300
Wire Wire Line
	1400 3400 1450 3400
Wire Wire Line
	1400 3500 1450 3500
Wire Wire Line
	1400 3600 1450 3600
Wire Wire Line
	1400 3700 1450 3700
Wire Wire Line
	1400 3800 1450 3800
Entry Wire Line
	1300 3800 1400 3900
Wire Wire Line
	1400 3900 1450 3900
Text HLabel 1250 2850 0    60   Input ~ 0
CMDout_P[0..9]
Wire Bus Line
	1300 4000 1250 4000
Entry Wire Line
	1300 4050 1400 4150
Entry Wire Line
	1300 4150 1400 4250
Entry Wire Line
	1300 4250 1400 4350
Entry Wire Line
	1300 4350 1400 4450
Entry Wire Line
	1300 4450 1400 4550
Entry Wire Line
	1300 4550 1400 4650
Entry Wire Line
	1300 4650 1400 4750
Entry Wire Line
	1300 4750 1400 4850
Entry Wire Line
	1300 4850 1400 4950
Wire Wire Line
	1400 4150 1450 4150
Wire Wire Line
	1400 4250 1450 4250
Wire Wire Line
	1400 4350 1450 4350
Wire Wire Line
	1400 4450 1450 4450
Wire Wire Line
	1400 4550 1450 4550
Wire Wire Line
	1400 4650 1450 4650
Wire Wire Line
	1400 4750 1450 4750
Wire Wire Line
	1400 4850 1450 4850
Wire Wire Line
	1400 4950 1450 4950
Entry Wire Line
	1300 4950 1400 5050
Wire Wire Line
	1400 5050 1450 5050
Text HLabel 1250 4000 0    60   Input ~ 0
CMDout_N[0..9]
Text Label 1450 700  0    60   ~ 12
CMDin_P0
Text Label 1450 800  0    60   ~ 12
CMDin_P1
Text Label 1450 900  0    60   ~ 12
CMDin_P2
Text Label 1450 1000 0    60   ~ 12
CMDin_P3
Text Label 1450 1100 0    60   ~ 12
CMDin_P4
Text Label 1450 1200 0    60   ~ 12
CMDin_P5
Text Label 1450 1300 0    60   ~ 12
CMDin_P6
Text Label 1450 1400 0    60   ~ 12
CMDin_P7
Text Label 1450 1500 0    60   ~ 12
CMDin_P8
Text Label 1450 1600 0    60   ~ 12
CMDin_P9
Text Label 1450 3000 0    60   ~ 0
CMDout_P0
Text Label 1450 3100 0    60   ~ 12
CMDout_P1
Text Label 1450 3200 0    60   ~ 12
CMDout_P2
Text Label 1450 1850 0    60   ~ 0
CMDin_N0
Text Label 1450 1950 0    60   ~ 0
CMDin_N1
Text Label 1450 2050 0    60   ~ 12
CMDin_N2
Text Label 1450 2150 0    60   ~ 12
CMDin_N3
Text Label 1450 2250 0    60   ~ 12
CMDin_N4
Text Label 1450 2350 0    60   ~ 12
CMDin_N5
Text Label 1450 2450 0    60   ~ 12
CMDin_N6
Text Label 1450 2550 0    60   ~ 12
CMDin_N7
Text Label 1450 2650 0    60   ~ 12
CMDin_N8
Text Label 1450 2750 0    60   ~ 12
CMDin_N9
Text Label 1450 4150 0    60   ~ 0
CMDout_N0
Text Label 1450 4250 0    60   ~ 12
CMDout_N1
Text Label 1450 4350 0    60   ~ 12
CMDout_N2
Text Label 1450 4450 0    60   ~ 12
CMDout_N3
Text Label 1450 4550 0    60   ~ 12
CMDout_N4
Text Label 1450 4650 0    60   ~ 12
CMDout_N5
Text Label 1450 4750 0    60   ~ 12
CMDout_N6
Text Label 1450 4850 0    60   ~ 12
CMDout_N7
Text Label 1450 4950 0    60   ~ 12
CMDout_N8
Text Label 1450 5050 0    60   ~ 12
CMDout_N9
Text Label 1450 3400 0    60   ~ 12
CMDout_P4
Text Label 1450 3900 0    60   ~ 12
CMDout_P9
Text Label 1450 3800 0    60   ~ 12
CMDout_P8
Text Label 1450 3700 0    60   ~ 12
CMDout_P7
Text Label 1450 3600 0    60   ~ 12
CMDout_P6
Text Label 1450 3500 0    60   ~ 12
CMDout_P5
Text Label 1450 3300 0    60   ~ 12
CMDout_P3
Text Label 2900 4700 2    60   ~ 0
CMDout_P0
Text Label 2900 4600 2    60   ~ 0
CMDout_N0
Text Label 2900 4300 2    60   ~ 12
CMDin_N1
Text Label 2900 4400 2    60   ~ 12
CMDin_P1
Text Label 2900 4100 2    60   ~ 12
CMDout_P1
Text Label 2900 4000 2    60   ~ 12
CMDout_N1
Text Label 2900 3600 2    60   ~ 12
CMDin_N2
Text Label 2900 3700 2    60   ~ 12
CMDin_P2
Text Label 2900 3400 2    60   ~ 12
CMDout_P2
Text Label 2900 3300 2    60   ~ 12
CMDout_N2
Text Label 2900 3000 2    60   ~ 12
CMDin_N3
Text Label 2900 3100 2    60   ~ 12
CMDin_P3
Text Label 2900 2800 2    60   ~ 12
CMDout_P3
Text Label 2900 2700 2    60   ~ 12
CMDout_N3
Text Label 2900 2500 2    60   ~ 12
CMDin_P4
Connection ~ 5450 2600
Connection ~ 6950 2600
NoConn ~ 2900 1900
NoConn ~ 2900 1800
Text Label 2900 2200 2    60   ~ 12
CMDout_P4
Text Label 2900 2100 2    60   ~ 12
CMDout_N4
Text Label 2900 2400 2    60   ~ 12
CMDin_N4
$Comp
L microzed:MicroZed ZED1
U 1 1 5C88D67D
P 3900 3450
AR Path="/59C2F489/5C88D67D" Ref="ZED1"  Part="1" 
AR Path="/5D418DA8/5C88D67D" Ref="ZED?"  Part="1" 
F 0 "ZED1" H 3900 6165 50  0000 C CNN
F 1 "MicroZed" H 3900 6074 50  0000 C CNN
F 2 "zed:microzed_replacement" H 3900 3450 60  0001 C CNN
F 3 "" H 3900 3450 60  0001 C CNN
	1    3900 3450
	1    0    0    -1  
$EndComp
NoConn ~ 2900 1600
$Comp
L microzed:MicroZed ZED1
U 2 1 5C88D91D
P 8500 3450
AR Path="/59C2F489/5C88D91D" Ref="ZED1"  Part="2" 
AR Path="/5D418DA8/5C88D91D" Ref="ZED?"  Part="2" 
F 0 "ZED1" H 8500 6165 50  0000 C CNN
F 1 "MicroZed" H 8500 6074 50  0000 C CNN
F 2 "zed:microzed_replacement" H 8500 3450 60  0001 C CNN
F 3 "" H 8500 3450 60  0001 C CNN
	2    8500 3450
	1    0    0    -1  
$EndComp
Wire Wire Line
	4900 2000 5450 2000
Wire Wire Line
	5450 2000 5450 2300
Wire Wire Line
	5450 2300 5450 2600
Connection ~ 5450 2300
Wire Wire Line
	4900 2300 5450 2300
Connection ~ 5450 2000
Wire Wire Line
	5450 1700 5450 2000
Wire Wire Line
	4900 1700 5450 1700
Wire Wire Line
	7500 1700 6950 1700
Wire Wire Line
	6950 1700 6950 2000
Connection ~ 6950 2000
Wire Wire Line
	7500 2000 6950 2000
Wire Wire Line
	6950 2000 6950 2300
Wire Wire Line
	6950 2300 6950 2600
Connection ~ 6950 2300
Wire Wire Line
	6950 2300 7500 2300
Wire Wire Line
	2350 1700 2350 2000
Connection ~ 2350 2000
Wire Wire Line
	2900 2000 2350 2000
Wire Wire Line
	2350 2000 2350 2300
Wire Wire Line
	2350 2300 2350 2600
Connection ~ 2350 2300
Wire Wire Line
	2900 2300 2350 2300
Wire Wire Line
	2900 1700 2350 1700
NoConn ~ 7500 1600
Text Label 9500 2400 0    60   ~ 12
CMDin_N5
Text Label 9500 2500 0    60   ~ 12
CMDin_P5
Text Label 9500 4700 0    60   ~ 12
CMDout_N8
$Comp
L power:+2V5 #PWR038
U 1 1 5D2D21AB
P 6650 4850
F 0 "#PWR038" H 6650 4700 50  0001 C CNN
F 1 "+2V5" H 6665 5023 50  0000 C CNN
F 2 "" H 6650 4850 50  0001 C CNN
F 3 "" H 6650 4850 50  0001 C CNN
	1    6650 4850
	1    0    0    -1  
$EndComp
$Comp
L power:+2V5 #PWR043
U 1 1 5D2D2618
P 10350 4750
F 0 "#PWR043" H 10350 4600 50  0001 C CNN
F 1 "+2V5" H 10365 4923 50  0000 C CNN
F 2 "" H 10350 4750 50  0001 C CNN
F 3 "" H 10350 4750 50  0001 C CNN
	1    10350 4750
	1    0    0    -1  
$EndComp
Connection ~ 10050 2000
Wire Wire Line
	10050 1700 10050 2000
Text HLabel 7500 2100 0    60   Output ~ 0
A0_SCLK
Text HLabel 7500 2200 0    60   Output ~ 0
~A0_CS
Text HLabel 7500 1800 0    60   Output ~ 0
A0_DIN
Text HLabel 7500 1900 0    60   Input ~ 0
A0_DOUT
NoConn ~ 4900 5000
NoConn ~ 4900 5100
NoConn ~ 7500 5600
NoConn ~ 7500 5700
NoConn ~ 7500 5800
NoConn ~ 7500 5900
NoConn ~ 7500 1000
NoConn ~ 7500 1300
NoConn ~ 9500 1000
NoConn ~ 9500 1100
NoConn ~ 9500 1200
NoConn ~ 9500 1300
NoConn ~ 7500 2700
NoConn ~ 7500 2800
NoConn ~ 7500 3000
NoConn ~ 7500 3100
NoConn ~ 7500 3300
NoConn ~ 7500 3400
NoConn ~ 7500 3600
NoConn ~ 7500 3700
NoConn ~ 7500 4000
NoConn ~ 7500 4100
NoConn ~ 7500 4300
NoConn ~ 7500 4400
NoConn ~ 7500 4600
NoConn ~ 7500 4700
NoConn ~ 7500 5000
NoConn ~ 7500 5100
NoConn ~ 7500 5300
NoConn ~ 7500 5400
NoConn ~ 4900 1500
NoConn ~ 4900 1600
NoConn ~ 4900 1800
NoConn ~ 4900 1900
NoConn ~ 4900 2100
NoConn ~ 4900 2200
NoConn ~ 4900 2400
NoConn ~ 4900 2500
NoConn ~ 4900 2700
NoConn ~ 4900 2800
NoConn ~ 4900 3000
NoConn ~ 4900 3100
NoConn ~ 4900 3300
NoConn ~ 4900 3400
NoConn ~ 4900 3600
NoConn ~ 4900 3700
NoConn ~ 4900 4000
NoConn ~ 4900 4100
NoConn ~ 4900 4300
NoConn ~ 4900 4400
NoConn ~ 4900 4600
NoConn ~ 4900 4700
NoConn ~ 4900 5300
NoConn ~ 4900 5400
NoConn ~ 4900 5500
NoConn ~ 4900 5600
NoConn ~ 2900 5300
NoConn ~ 2900 5400
NoConn ~ 2900 5500
NoConn ~ 2900 5600
$Comp
L Device:R R4
U 1 1 5FAE8293
P 10750 1300
F 0 "R4" H 10680 1254 50  0000 R CNN
F 1 "10k" H 10680 1345 50  0000 R CNN
F 2 "Resistor_SMD:R_0805_2012Metric" V 10680 1300 50  0001 C CNN
F 3 "~" H 10750 1300 50  0001 C CNN
	1    10750 1300
	-1   0    0    1   
$EndComp
Wire Wire Line
	9500 1400 9600 1400
$Comp
L Device:R R9
U 1 1 5FAFF108
P 10750 950
F 0 "R9" H 10820 996 50  0000 L CNN
F 1 "8.3k" H 10820 905 50  0000 L CNN
F 2 "Resistor_SMD:R_0805_2012Metric" V 10680 950 50  0001 C CNN
F 3 "~" H 10750 950 50  0001 C CNN
	1    10750 950 
	1    0    0    -1  
$EndComp
$Comp
L power:GND #PWR0101
U 1 1 5FB08740
P 10750 1500
F 0 "#PWR0101" H 10750 1250 50  0001 C CNN
F 1 "GND" H 10755 1327 50  0000 C CNN
F 2 "" H 10750 1500 50  0001 C CNN
F 3 "" H 10750 1500 50  0001 C CNN
	1    10750 1500
	1    0    0    -1  
$EndComp
Wire Wire Line
	10750 1500 10750 1450
Wire Wire Line
	10750 1150 10750 1125
$Comp
L power:+5V #PWR0102
U 1 1 5FB1A98A
P 10750 750
F 0 "#PWR0102" H 10750 600 50  0001 C CNN
F 1 "+5V" H 10765 923 50  0000 C CNN
F 2 "" H 10750 750 50  0001 C CNN
F 3 "" H 10750 750 50  0001 C CNN
	1    10750 750 
	1    0    0    -1  
$EndComp
Wire Wire Line
	10750 750  10750 800 
Wire Wire Line
	10750 1125 10650 1125
Connection ~ 10750 1125
Wire Wire Line
	10750 1125 10750 1100
Text Label 10650 1125 2    50   ~ 0
PWR_EN
Text Label 9600 1400 0    50   ~ 0
PWR_EN
Text HLabel 7500 2400 0    50   Input ~ 0
A0_CMDout_P
Text HLabel 7500 2500 0    50   Input ~ 0
A0_CMDout_N
$Comp
L power:PWR_FLAG #FLG0101
U 1 1 5FB70290
P 3250 7350
F 0 "#FLG0101" H 3250 7425 50  0001 C CNN
F 1 "PWR_FLAG" H 3250 7523 50  0000 C CNN
F 2 "" H 3250 7350 50  0001 C CNN
F 3 "~" H 3250 7350 50  0001 C CNN
	1    3250 7350
	-1   0    0    1   
$EndComp
Wire Wire Line
	6650 4900 7500 4900
$Comp
L power:+5V #PWR0103
U 1 1 5FB70CEE
P 3250 7250
F 0 "#PWR0103" H 3250 7100 50  0001 C CNN
F 1 "+5V" H 3265 7423 50  0000 C CNN
F 2 "" H 3250 7250 50  0001 C CNN
F 3 "" H 3250 7250 50  0001 C CNN
	1    3250 7250
	1    0    0    -1  
$EndComp
Wire Wire Line
	3250 7350 3250 7250
$Comp
L power:+2V5 #PWR0104
U 1 1 5FB7A878
P 3750 7250
F 0 "#PWR0104" H 3750 7100 50  0001 C CNN
F 1 "+2V5" H 3765 7423 50  0000 C CNN
F 2 "" H 3750 7250 50  0001 C CNN
F 3 "" H 3750 7250 50  0001 C CNN
	1    3750 7250
	1    0    0    -1  
$EndComp
$Comp
L power:PWR_FLAG #FLG0102
U 1 1 5FB7B4C7
P 3750 7350
F 0 "#FLG0102" H 3750 7425 50  0001 C CNN
F 1 "PWR_FLAG" H 3750 7523 50  0000 C CNN
F 2 "" H 3750 7350 50  0001 C CNN
F 3 "~" H 3750 7350 50  0001 C CNN
	1    3750 7350
	-1   0    0    1   
$EndComp
Wire Wire Line
	3750 7350 3750 7250
NoConn ~ 4900 4800
NoConn ~ 4900 4900
NoConn ~ 4900 3800
NoConn ~ 4900 3900
NoConn ~ 9500 5800
NoConn ~ 2900 4900
NoConn ~ 2900 3900
NoConn ~ 2900 3800
NoConn ~ 9500 1500
Wire Bus Line
	1300 4000 1300 4950
Wire Bus Line
	1300 2850 1300 3800
Wire Bus Line
	1300 1700 1300 2650
Wire Bus Line
	1300 550  1300 1500
$EndSCHEMATC
