EESchema Schematic File Version 4
EELAYER 30 0
EELAYER END
$Descr A4 11693 8268
encoding utf-8
Sheet 1 4
Title "AMAC CMD Multiplexer for PBv3 Active Board"
Date "2020-09-29"
Rev ""
Comp "Lawrence Berkeley National Laboratory"
Comment1 "Karol Krizka"
Comment2 ""
Comment3 ""
Comment4 ""
$EndDescr
Text Label 2475 1325 0    60   ~ 12
A0_SCL
Text Label 2475 1425 0    60   ~ 12
A0_SDA
$Sheet
S 5300 1500 1400 800 
U 5CE8A32E
F0 "CMDMuximpl" 60
F1 "CMDMuximpl.sch" 60
F2 "SDA" I L 5300 1600 60 
F3 "SCL" I L 5300 1700 60 
F4 "CMDin_P" I L 5300 1850 60 
F5 "CMDin_N" I L 5300 1950 60 
F6 "CMDin_P[0..9]" O R 6700 1850 60 
F7 "CMDin_N[0..9]" O R 6700 1950 60 
F8 "CMDout_N[0..9]" I R 6700 2200 60 
F9 "CMDout_P" O L 5300 2100 60 
F10 "CMDout_N" O L 5300 2200 60 
F11 "CMDout_P[0..9]" I R 6700 2100 60 
$EndSheet
Wire Wire Line
	5300 1600 5200 1600
Wire Wire Line
	5300 1700 5200 1700
Wire Wire Line
	5300 1850 5200 1850
Wire Wire Line
	5300 1950 5200 1950
Text Label 6800 1850 0    60   ~ 0
CMDin_P[0..9]
Text Label 6800 1950 0    60   ~ 0
CMDin_N[0..9]
Wire Wire Line
	5300 2100 5200 2100
Wire Wire Line
	5300 2200 5200 2200
Text Label 6800 2100 0    60   ~ 0
CMDout_P[0..9]
Text Label 6800 2200 0    60   ~ 0
CMDout_N[0..9]
Text Label 5200 1850 2    60   ~ 0
A0_CMDin_P
Text Label 5200 1950 2    60   ~ 0
A0_CMDin_N
Text Label 5200 2100 2    60   ~ 0
A0_CMDout_P
Text Label 5200 2200 2    60   ~ 0
A0_CMDout_N
Text Label 2475 1525 0    60   ~ 12
A0_CMDin_P
Text Label 2475 1625 0    60   ~ 12
A0_CMDin_N
Text Label 2475 1725 0    60   ~ 12
A0_CMDout_P
Text Label 2475 1825 0    60   ~ 12
A0_CMDout_N
Text Label 2475 2425 0    60   ~ 0
CMDin_P[0..9]
Text Label 2475 2525 0    60   ~ 0
CMDin_N[0..9]
Text Label 2475 2625 0    60   ~ 0
CMDout_P[0..9]
Text Label 2475 2725 0    60   ~ 0
CMDout_N[0..9]
Text Label 5200 1600 2    60   ~ 0
A0_SDA_3V3
Text Label 5200 1700 2    60   ~ 0
A0_SCL_3V3
$Sheet
S 1250 1250 1175 1550
U 59C2F489
F0 "MicroZed" 60
F1 "microzed.sch" 60
F2 "A0_SCL" O R 2425 1325 60 
F3 "A0_SDA" B R 2425 1425 60 
F4 "A0_CMDin_P" O R 2425 1525 60 
F5 "A0_CMDin_N" O R 2425 1625 60 
F6 "A0_CMDout_P" I R 2425 1725 60 
F7 "A0_CMDout_N" I R 2425 1825 60 
F8 "A0_SCLK" O R 2425 1925 60 
F9 "A0_DIN" O R 2425 2025 60 
F10 "A0_DOUT" I R 2425 2125 60 
F11 "~A0_CS" O R 2425 2225 60 
F12 "CMDin_P[0..9]" O R 2425 2425 60 
F13 "CMDin_N[0..9]" O R 2425 2525 60 
F14 "CMDout_P[0..9]" I R 2425 2625 60 
F15 "CMDout_N[0..9]" I R 2425 2725 60 
$EndSheet
$Sheet
S 1250 3650 925  375 
U 5FA51E21
F0 "Power" 50
F1 "Power.sch" 50
$EndSheet
$Comp
L Connector_Generic:Conn_01x04 J1
U 1 1 5FA5B495
P 1275 5450
F 0 "J1" H 1193 5025 50  0000 C CNN
F 1 "Conn_01x04" H 1193 5116 50  0000 C CNN
F 2 "Connector_JST:JST_SH_BM04B-SRSS-TB_1x04-1MP_P1.00mm_Vertical" H 1275 5450 50  0001 C CNN
F 3 "~" H 1275 5450 50  0001 C CNN
	1    1275 5450
	-1   0    0    1   
$EndComp
Text Label 3150 4925 2    50   ~ 0
A0_SCL
$Comp
L Transistor_FET:BSS138 Q1
U 1 1 5FA6918C
P 3450 4825
F 0 "Q1" V 3699 4825 50  0000 C CNN
F 1 "BSS138" V 3790 4825 50  0000 C CNN
F 2 "Package_TO_SOT_SMD:SOT-23" H 3650 4750 50  0001 L CIN
F 3 "https://www.fairchildsemi.com/datasheets/BS/BSS138.pdf" H 3450 4825 50  0001 L CNN
	1    3450 4825
	0    1    1    0   
$EndComp
$Comp
L Device:R R1
U 1 1 5FA76698
P 3825 4775
F 0 "R1" H 3895 4821 50  0000 L CNN
F 1 "2k" H 3895 4730 50  0000 L CNN
F 2 "Resistor_SMD:R_0805_2012Metric" V 3755 4775 50  0001 C CNN
F 3 "~" H 3825 4775 50  0001 C CNN
	1    3825 4775
	1    0    0    -1  
$EndComp
Wire Wire Line
	3250 4925 3150 4925
$Comp
L power:+3V3 #PWR03
U 1 1 5FA76F93
P 3825 4550
F 0 "#PWR03" H 3825 4400 50  0001 C CNN
F 1 "+3V3" H 3840 4723 50  0000 C CNN
F 2 "" H 3825 4550 50  0001 C CNN
F 3 "" H 3825 4550 50  0001 C CNN
	1    3825 4550
	1    0    0    -1  
$EndComp
Wire Wire Line
	3975 4925 3825 4925
Connection ~ 3825 4925
Wire Wire Line
	3825 4925 3650 4925
Text Label 3975 4925 0    50   ~ 0
A0_SCL_3V3
Wire Wire Line
	3825 4625 3825 4550
$Comp
L power:+2V5 #PWR05
U 1 1 5FA784CC
P 3450 4550
F 0 "#PWR05" H 3450 4400 50  0001 C CNN
F 1 "+2V5" H 3465 4723 50  0000 C CNN
F 2 "" H 3450 4550 50  0001 C CNN
F 3 "" H 3450 4550 50  0001 C CNN
	1    3450 4550
	1    0    0    -1  
$EndComp
Wire Wire Line
	3450 4550 3450 4625
Text Label 3150 5850 2    50   ~ 0
A0_SDA
$Comp
L Transistor_FET:BSS138 Q2
U 1 1 5FA814F6
P 3450 5750
F 0 "Q2" V 3699 5750 50  0000 C CNN
F 1 "BSS138" V 3790 5750 50  0000 C CNN
F 2 "Package_TO_SOT_SMD:SOT-23" H 3650 5675 50  0001 L CIN
F 3 "https://www.fairchildsemi.com/datasheets/BS/BSS138.pdf" H 3450 5750 50  0001 L CNN
	1    3450 5750
	0    1    1    0   
$EndComp
$Comp
L Device:R R2
U 1 1 5FA81500
P 3825 5700
F 0 "R2" H 3895 5746 50  0000 L CNN
F 1 "2k" H 3895 5655 50  0000 L CNN
F 2 "Resistor_SMD:R_0805_2012Metric" V 3755 5700 50  0001 C CNN
F 3 "~" H 3825 5700 50  0001 C CNN
	1    3825 5700
	1    0    0    -1  
$EndComp
Wire Wire Line
	3250 5850 3150 5850
$Comp
L power:+3V3 #PWR04
U 1 1 5FA8150B
P 3825 5475
F 0 "#PWR04" H 3825 5325 50  0001 C CNN
F 1 "+3V3" H 3840 5648 50  0000 C CNN
F 2 "" H 3825 5475 50  0001 C CNN
F 3 "" H 3825 5475 50  0001 C CNN
	1    3825 5475
	1    0    0    -1  
$EndComp
Wire Wire Line
	3975 5850 3825 5850
Connection ~ 3825 5850
Wire Wire Line
	3825 5850 3650 5850
Text Label 3975 5850 0    50   ~ 0
A0_SDA_3V3
Wire Wire Line
	3825 5550 3825 5475
$Comp
L power:+2V5 #PWR06
U 1 1 5FA8151A
P 3450 5475
F 0 "#PWR06" H 3450 5325 50  0001 C CNN
F 1 "+2V5" H 3465 5648 50  0000 C CNN
F 2 "" H 3450 5475 50  0001 C CNN
F 3 "" H 3450 5475 50  0001 C CNN
	1    3450 5475
	1    0    0    -1  
$EndComp
Wire Wire Line
	3450 5475 3450 5550
NoConn ~ 2425 1925
NoConn ~ 2425 2025
NoConn ~ 2425 2125
NoConn ~ 2425 2225
Wire Bus Line
	6800 2100 6700 2100
Wire Bus Line
	6800 1850 6700 1850
Wire Bus Line
	6700 1950 6800 1950
Wire Bus Line
	6800 2200 6700 2200
Wire Wire Line
	2425 1325 2475 1325
Wire Wire Line
	2475 1425 2425 1425
Wire Wire Line
	2425 1525 2475 1525
Wire Wire Line
	2425 1625 2475 1625
Wire Wire Line
	2425 1725 2475 1725
Wire Wire Line
	2475 1825 2425 1825
Wire Bus Line
	2425 2425 2475 2425
Wire Bus Line
	2475 2525 2425 2525
Wire Bus Line
	2425 2625 2475 2625
Wire Bus Line
	2475 2725 2425 2725
Text Label 1475 6300 0    50   ~ 0
A0_SDA_3V3
$Comp
L power:+3V3 #PWR031
U 1 1 5FBFE352
P 1925 6200
F 0 "#PWR031" H 1925 6050 50  0001 C CNN
F 1 "+3V3" H 1940 6373 50  0000 C CNN
F 2 "" H 1925 6200 50  0001 C CNN
F 3 "" H 1925 6200 50  0001 C CNN
	1    1925 6200
	1    0    0    -1  
$EndComp
Text Label 1475 6400 0    50   ~ 0
A0_SCL_3V3
Wire Wire Line
	1475 6200 1925 6200
$Comp
L power:GND #PWR0106
U 1 1 5FCCC203
P 1675 6000
F 0 "#PWR0106" H 1675 5750 50  0001 C CNN
F 1 "GND" H 1775 5875 50  0000 C CNN
F 2 "" H 1675 6000 50  0001 C CNN
F 3 "" H 1675 6000 50  0001 C CNN
	1    1675 6000
	1    0    0    -1  
$EndComp
$Comp
L Connector_Generic:Conn_01x04 J2
U 1 1 5FBFE137
P 1275 6300
F 0 "J2" H 1193 5875 50  0000 C CNN
F 1 "Conn_01x04" H 1193 5966 50  0000 C CNN
F 2 "Connector_JST:JST_SH_BM04B-SRSS-TB_1x04-1MP_P1.00mm_Vertical" H 1275 6300 50  0001 C CNN
F 3 "~" H 1275 6300 50  0001 C CNN
	1    1275 6300
	-1   0    0    1   
$EndComp
Wire Wire Line
	1475 6100 1600 6100
Wire Wire Line
	1600 6100 1600 6000
Wire Wire Line
	1600 6000 1675 6000
Text Label 1475 5450 0    50   ~ 0
A0_SDA_3V3
$Comp
L power:+3V3 #PWR0107
U 1 1 5FCD01C0
P 1925 5350
F 0 "#PWR0107" H 1925 5200 50  0001 C CNN
F 1 "+3V3" H 1940 5523 50  0000 C CNN
F 2 "" H 1925 5350 50  0001 C CNN
F 3 "" H 1925 5350 50  0001 C CNN
	1    1925 5350
	1    0    0    -1  
$EndComp
Text Label 1475 5550 0    50   ~ 0
A0_SCL_3V3
Wire Wire Line
	1475 5350 1925 5350
$Comp
L power:GND #PWR0108
U 1 1 5FCD01CC
P 1675 5150
F 0 "#PWR0108" H 1675 4900 50  0001 C CNN
F 1 "GND" H 1775 5025 50  0000 C CNN
F 2 "" H 1675 5150 50  0001 C CNN
F 3 "" H 1675 5150 50  0001 C CNN
	1    1675 5150
	1    0    0    -1  
$EndComp
Wire Wire Line
	1475 5250 1600 5250
Wire Wire Line
	1600 5250 1600 5150
Wire Wire Line
	1600 5150 1675 5150
$Comp
L Device:C C4
U 1 1 5FBC9DEC
P 8500 3725
F 0 "C4" H 8615 3771 50  0000 L CNN
F 1 "10uF" H 8615 3680 50  0000 L CNN
F 2 "Capacitor_SMD:C_0805_2012Metric" H 8538 3575 50  0001 C CNN
F 3 "~" H 8500 3725 50  0001 C CNN
	1    8500 3725
	1    0    0    -1  
$EndComp
$Comp
L Device:C C5
U 1 1 5FBCA6A4
P 9000 3725
F 0 "C5" H 9115 3771 50  0000 L CNN
F 1 "0.1uF" H 9115 3680 50  0000 L CNN
F 2 "Capacitor_SMD:C_0805_2012Metric" H 9038 3575 50  0001 C CNN
F 3 "~" H 9000 3725 50  0001 C CNN
	1    9000 3725
	1    0    0    -1  
$EndComp
$Comp
L power:+3V3 #PWR0109
U 1 1 5FBCBE12
P 8750 3500
F 0 "#PWR0109" H 8750 3350 50  0001 C CNN
F 1 "+3V3" H 8765 3673 50  0000 C CNN
F 2 "" H 8750 3500 50  0001 C CNN
F 3 "" H 8750 3500 50  0001 C CNN
	1    8750 3500
	1    0    0    -1  
$EndComp
Wire Wire Line
	8500 3575 8750 3575
Wire Wire Line
	8750 3500 8750 3575
Connection ~ 8750 3575
Wire Wire Line
	8750 3575 9000 3575
Wire Wire Line
	8500 3875 8750 3875
Wire Wire Line
	8750 3875 8750 3925
Connection ~ 8750 3875
$Comp
L power:GND #PWR0110
U 1 1 5FBD08F3
P 8750 3925
F 0 "#PWR0110" H 8750 3675 50  0001 C CNN
F 1 "GND" H 8755 3752 50  0000 C CNN
F 2 "" H 8750 3925 50  0001 C CNN
F 3 "" H 8750 3925 50  0001 C CNN
	1    8750 3925
	1    0    0    -1  
$EndComp
$Comp
L power:+3V3 #PWR0111
U 1 1 5FBD111A
P 8075 3800
F 0 "#PWR0111" H 8075 3650 50  0001 C CNN
F 1 "+3V3" H 8090 3973 50  0000 C CNN
F 2 "" H 8075 3800 50  0001 C CNN
F 3 "" H 8075 3800 50  0001 C CNN
	1    8075 3800
	1    0    0    -1  
$EndComp
Wire Wire Line
	8075 3800 8075 3875
$Comp
L Device:R R11
U 1 1 5FBD243B
P 7050 5075
F 0 "R11" V 6950 5075 50  0000 C CNN
F 1 "10k" V 7050 5075 50  0000 C CNN
F 2 "Resistor_SMD:R_0805_2012Metric" V 6980 5075 50  0001 C CNN
F 3 "~" H 7050 5075 50  0001 C CNN
	1    7050 5075
	0    1    1    0   
$EndComp
$Comp
L power:+3V3 #PWR0112
U 1 1 5FBD2D8F
P 6625 5075
F 0 "#PWR0112" H 6625 4925 50  0001 C CNN
F 1 "+3V3" H 6640 5248 50  0000 C CNN
F 2 "" H 6625 5075 50  0001 C CNN
F 3 "" H 6625 5075 50  0001 C CNN
	1    6625 5075
	1    0    0    -1  
$EndComp
Wire Wire Line
	6625 5075 6900 5075
Wire Wire Line
	7200 5075 7275 5075
Connection ~ 8175 5575
Wire Wire Line
	8175 5575 8275 5575
Wire Wire Line
	8075 5575 8175 5575
Connection ~ 8075 5575
Connection ~ 7975 5575
Wire Wire Line
	7975 5575 8075 5575
Wire Wire Line
	7875 5575 7975 5575
Wire Wire Line
	8750 3875 9000 3875
$Comp
L lbl_adc:AD7994 U12
U 1 1 5FBC8991
P 7275 4275
F 0 "U12" H 8500 4425 60  0000 C CNN
F 1 "AD7993" H 7800 4425 60  0000 C CNN
F 2 "Package_SO:TSSOP-16_4.4x5mm_P0.65mm" H 8575 3225 60  0001 C CNN
F 3 "http://www.analog.com/media/en/technical-documentation/data-sheets/AD7993_7994.pdf" H 8075 4772 60  0001 C CNN
	1    7275 4275
	1    0    0    -1  
$EndComp
NoConn ~ 7275 4475
$Comp
L power:GND #PWR0113
U 1 1 5FBD6A4E
P 8075 5625
F 0 "#PWR0113" H 8075 5375 50  0001 C CNN
F 1 "GND" H 8080 5452 50  0000 C CNN
F 2 "" H 8075 5625 50  0001 C CNN
F 3 "" H 8075 5625 50  0001 C CNN
	1    8075 5625
	1    0    0    -1  
$EndComp
$Comp
L power:GND #PWR0114
U 1 1 5FBD7374
P 6625 4575
F 0 "#PWR0114" H 6625 4325 50  0001 C CNN
F 1 "GND" H 6630 4402 50  0000 C CNN
F 2 "" H 6625 4575 50  0001 C CNN
F 3 "" H 6625 4575 50  0001 C CNN
	1    6625 4575
	1    0    0    -1  
$EndComp
Wire Wire Line
	7275 4575 6625 4575
Wire Wire Line
	8075 5625 8075 5575
$Comp
L power:+3V3 #PWR0115
U 1 1 5FBD9AE6
P 7275 4200
F 0 "#PWR0115" H 7275 4050 50  0001 C CNN
F 1 "+3V3" H 7290 4373 50  0000 C CNN
F 2 "" H 7275 4200 50  0001 C CNN
F 3 "" H 7275 4200 50  0001 C CNN
	1    7275 4200
	1    0    0    -1  
$EndComp
Wire Wire Line
	7275 4275 7275 4200
Text Label 7225 4775 2    50   ~ 0
A0_SCL_3V3
Text Label 7225 4875 2    50   ~ 0
A0_SDA_3V3
Wire Wire Line
	7225 4875 7275 4875
Wire Wire Line
	7275 4775 7225 4775
Text Label 8875 4675 0    50   ~ 0
NTC0
Text Label 8875 4575 0    50   ~ 0
NTC1
Text Label 8875 4375 0    50   ~ 0
NTC2
Text Label 8875 4475 0    50   ~ 0
NTC3
Text Label 10475 5475 2    50   ~ 0
NTC0
Text Label 10475 5575 2    50   ~ 0
NTC1
Text Label 10475 5675 2    50   ~ 0
NTC2
Text Label 10475 5775 2    50   ~ 0
NTC3
$Comp
L power:GND #PWR0116
U 1 1 5FBEA0D3
P 10975 5925
F 0 "#PWR0116" H 10975 5675 50  0001 C CNN
F 1 "GND" H 10980 5752 50  0000 C CNN
F 2 "" H 10975 5925 50  0001 C CNN
F 3 "" H 10975 5925 50  0001 C CNN
	1    10975 5925
	1    0    0    -1  
$EndComp
$Comp
L Connector_Generic:Conn_02x04_Odd_Even J4
U 1 1 5FC1335B
P 10675 5575
F 0 "J4" H 10725 5892 50  0000 C CNN
F 1 "Conn_02x04_Odd_Even" H 10725 5801 50  0000 C CNN
F 2 "Connector_PinHeader_2.54mm:PinHeader_2x04_P2.54mm_Horizontal" H 10675 5575 50  0001 C CNN
F 3 "~" H 10675 5575 50  0001 C CNN
	1    10675 5575
	1    0    0    -1  
$EndComp
Wire Wire Line
	10975 5775 10975 5925
Wire Wire Line
	10975 5475 10975 5575
Connection ~ 10975 5775
Connection ~ 10975 5575
Wire Wire Line
	10975 5575 10975 5675
Connection ~ 10975 5675
Wire Wire Line
	10975 5675 10975 5775
$Comp
L Device:R R15
U 1 1 5FC23750
P 10075 5300
F 0 "R15" H 10145 5346 50  0000 L CNN
F 1 "50k" H 10145 5255 50  0000 L CNN
F 2 "Resistor_SMD:R_0805_2012Metric" V 10005 5300 50  0001 C CNN
F 3 "~" H 10075 5300 50  0001 C CNN
	1    10075 5300
	1    0    0    -1  
$EndComp
$Comp
L power:+3V3 #PWR0117
U 1 1 5FC24087
P 10075 5150
F 0 "#PWR0117" H 10075 5000 50  0001 C CNN
F 1 "+3V3" H 10090 5323 50  0000 C CNN
F 2 "" H 10075 5150 50  0001 C CNN
F 3 "" H 10075 5150 50  0001 C CNN
	1    10075 5150
	1    0    0    -1  
$EndComp
$Comp
L Device:R R14
U 1 1 5FC2901A
P 9775 5300
F 0 "R14" H 9845 5346 50  0000 L CNN
F 1 "50k" H 9845 5255 50  0000 L CNN
F 2 "Resistor_SMD:R_0805_2012Metric" V 9705 5300 50  0001 C CNN
F 3 "~" H 9775 5300 50  0001 C CNN
	1    9775 5300
	1    0    0    -1  
$EndComp
$Comp
L power:+3V3 #PWR0118
U 1 1 5FC2937E
P 9775 5150
F 0 "#PWR0118" H 9775 5000 50  0001 C CNN
F 1 "+3V3" H 9790 5323 50  0000 C CNN
F 2 "" H 9775 5150 50  0001 C CNN
F 3 "" H 9775 5150 50  0001 C CNN
	1    9775 5150
	1    0    0    -1  
$EndComp
$Comp
L Device:R R13
U 1 1 5FC2AB3A
P 9475 5300
F 0 "R13" H 9545 5346 50  0000 L CNN
F 1 "50k" H 9545 5255 50  0000 L CNN
F 2 "Resistor_SMD:R_0805_2012Metric" V 9405 5300 50  0001 C CNN
F 3 "~" H 9475 5300 50  0001 C CNN
	1    9475 5300
	1    0    0    -1  
$EndComp
$Comp
L power:+3V3 #PWR0119
U 1 1 5FC2AEC0
P 9475 5150
F 0 "#PWR0119" H 9475 5000 50  0001 C CNN
F 1 "+3V3" H 9490 5323 50  0000 C CNN
F 2 "" H 9475 5150 50  0001 C CNN
F 3 "" H 9475 5150 50  0001 C CNN
	1    9475 5150
	1    0    0    -1  
$EndComp
$Comp
L Device:R R12
U 1 1 5FC2AECA
P 9175 5300
F 0 "R12" H 9245 5346 50  0000 L CNN
F 1 "50k" H 9245 5255 50  0000 L CNN
F 2 "Resistor_SMD:R_0805_2012Metric" V 9105 5300 50  0001 C CNN
F 3 "~" H 9175 5300 50  0001 C CNN
	1    9175 5300
	1    0    0    -1  
$EndComp
$Comp
L power:+3V3 #PWR0120
U 1 1 5FC2AED4
P 9175 5150
F 0 "#PWR0120" H 9175 5000 50  0001 C CNN
F 1 "+3V3" H 9190 5323 50  0000 C CNN
F 2 "" H 9175 5150 50  0001 C CNN
F 3 "" H 9175 5150 50  0001 C CNN
	1    9175 5150
	1    0    0    -1  
$EndComp
Wire Wire Line
	10475 5475 10075 5475
Wire Wire Line
	10075 5475 10075 5450
Wire Wire Line
	10475 5575 9775 5575
Wire Wire Line
	9775 5575 9775 5450
Wire Wire Line
	10475 5675 9475 5675
Wire Wire Line
	9475 5675 9475 5450
Wire Wire Line
	10475 5775 9175 5775
Wire Wire Line
	9175 5775 9175 5450
$EndSCHEMATC
