%!PS-Adobe-3.0
%%Creator: PCBNEW
%%CreationDate: Thu Nov 19 13:35:55 2020
%%Title: /home/kkrizka/Dropbox/HEP/ITkStrips/PowerBoard/cmdmux/gerbers/cmdmux-PTH-drl_map.ps
%%Pages: 1
%%PageOrder: Ascend
%%BoundingBox: 0 0 596 842
%%DocumentMedia: A4 595 842 0 () ()
%%Orientation: Landscape
%%EndComments
%%BeginProlog
/line { newpath moveto lineto stroke } bind def
/cir0 { newpath 0 360 arc stroke } bind def
/cir1 { newpath 0 360 arc gsave fill grestore stroke } bind def
/cir2 { newpath 0 360 arc gsave fill grestore stroke } bind def
/arc0 { newpath arc stroke } bind def
/arc1 { newpath 4 index 4 index moveto arc closepath gsave fill
    grestore stroke } bind def
/arc2 { newpath 4 index 4 index moveto arc closepath gsave fill
    grestore stroke } bind def
/poly0 { stroke } bind def
/poly1 { closepath gsave fill grestore stroke } bind def
/poly2 { closepath gsave fill grestore stroke } bind def
/rect0 { rectstroke } bind def
/rect1 { rectfill } bind def
/rect2 { rectfill } bind def
/linemode0 { 0 setlinecap 0 setlinejoin 0 setlinewidth } bind def
/linemode1 { 1 setlinecap 1 setlinejoin } bind def
/dashedline { [200] 100 setdash } bind def
/solidline { [] 0 setdash } bind def
/phantomshow { moveto
    /KicadFont findfont 0.000001 scalefont setfont
    show } bind def
/textshow { gsave
    findfont exch scalefont setfont concat 1 scale 0 0 moveto show
    } bind def
/reencodefont {
  findfont dup length dict begin
  { 1 index /FID ne
    { def }
    { pop pop } ifelse
  } forall
  /Encoding ISOLatin1Encoding def
  currentdict
  end } bind def
/KicadFont /Helvetica reencodefont definefont pop
/KicadFont-Bold /Helvetica-Bold reencodefont definefont pop
/KicadFont-Oblique /Helvetica-Oblique reencodefont definefont pop
/KicadFont-BoldOblique /Helvetica-BoldOblique reencodefont definefont pop
%%EndProlog
%%Page: 1 1
%%BeginPageSetup
gsave
0.0072 0.0072 scale
linemode1
82680 0 translate 90 rotate
92.4994 setlinewidth
%%EndPageSetup
0 0 0 setrgbcolor
109.251 setlinewidth
newpath
30715.2 78688.4 moveto
86214.8 78688.4 lineto
stroke
0 0 0 setrgbcolor
newpath
30715.2 37063.6 moveto
30715.2 78688.4 lineto
stroke
0 0 0 setrgbcolor
newpath
86214.8 37063.6 moveto
30715.2 37063.6 lineto
stroke
0 0 0 setrgbcolor
newpath
86214.8 78688.4 moveto
86214.8 37063.6 lineto
stroke
78.7396 setlinewidth
newpath
37616.2 74302.1 moveto
37907.6 74010.7 lineto
stroke
newpath
37907.6 74302.1 moveto
37616.2 74010.7 lineto
stroke
newpath
38381 74302.1 moveto
38672.3 74010.7 lineto
stroke
newpath
38672.3 74302.1 moveto
38381 74010.7 lineto
stroke
newpath
39364.2 74300.4 moveto
39655.6 74009.1 lineto
stroke
newpath
39655.6 74300.4 moveto
39364.2 74009.1 lineto
stroke
newpath
39364.2 41741.8 moveto
39655.6 41450.4 lineto
stroke
newpath
39655.6 41741.8 moveto
39364.2 41450.4 lineto
stroke
newpath
40129 74300.4 moveto
40420.3 74009.1 lineto
stroke
newpath
40420.3 74300.4 moveto
40129 74009.1 lineto
stroke
newpath
40129 41741.8 moveto
40420.3 41450.4 lineto
stroke
newpath
40420.3 41741.8 moveto
40129 41450.4 lineto
stroke
newpath
41694.9 74297.3 moveto
41986.3 74006 lineto
stroke
newpath
41986.3 74297.3 moveto
41694.9 74006 lineto
stroke
newpath
41694.9 41741.8 moveto
41986.3 41450.4 lineto
stroke
newpath
41986.3 41741.8 moveto
41694.9 41450.4 lineto
stroke
newpath
42459.7 74297.3 moveto
42751 74006 lineto
stroke
newpath
42751 74297.3 moveto
42459.7 74006 lineto
stroke
newpath
42459.7 41741.8 moveto
42751 41450.4 lineto
stroke
newpath
42751 41741.8 moveto
42459.7 41450.4 lineto
stroke
newpath
43443 74296.7 moveto
43734.3 74005.4 lineto
stroke
newpath
43734.3 74296.7 moveto
43443 74005.4 lineto
stroke
newpath
43443 41741.8 moveto
43734.3 41450.4 lineto
stroke
newpath
43734.3 41741.8 moveto
43443 41450.4 lineto
stroke
newpath
44207.7 74296.7 moveto
44499 74005.4 lineto
stroke
newpath
44499 74296.7 moveto
44207.7 74005.4 lineto
stroke
newpath
44207.7 41741.8 moveto
44499 41450.4 lineto
stroke
newpath
44499 41741.8 moveto
44207.7 41450.4 lineto
stroke
newpath
45191 74296.3 moveto
45482.3 74004.9 lineto
stroke
newpath
45482.3 74296.3 moveto
45191 74004.9 lineto
stroke
newpath
45191 41741.8 moveto
45482.3 41450.4 lineto
stroke
newpath
45482.3 41741.8 moveto
45191 41450.4 lineto
stroke
newpath
45955.7 74296.3 moveto
46247.1 74004.9 lineto
stroke
newpath
46247.1 74296.3 moveto
45955.7 74004.9 lineto
stroke
newpath
45955.7 41741.8 moveto
46247.1 41450.4 lineto
stroke
newpath
46247.1 41741.8 moveto
45955.7 41450.4 lineto
stroke
newpath
46447.4 72383.6 moveto
46738.7 72092.2 lineto
stroke
newpath
46738.7 72383.6 moveto
46447.4 72092.2 lineto
stroke
newpath
46447.4 76025.3 moveto
46738.7 75734 lineto
stroke
newpath
46738.7 76025.3 moveto
46447.4 75734 lineto
stroke
newpath
47030 76025.3 moveto
47321.4 75734 lineto
stroke
newpath
47321.4 76025.3 moveto
47030 75734 lineto
stroke
newpath
47030 72383.6 moveto
47321.4 72092.2 lineto
stroke
newpath
47321.4 72383.6 moveto
47030 72092.2 lineto
stroke
newpath
47521.7 74297.3 moveto
47813 74005.9 lineto
stroke
newpath
47813 74297.3 moveto
47521.7 74005.9 lineto
stroke
newpath
47521.7 41741.8 moveto
47813 41450.4 lineto
stroke
newpath
47813 41741.8 moveto
47521.7 41450.4 lineto
stroke
newpath
48286.4 74297.3 moveto
48577.8 74005.9 lineto
stroke
newpath
48577.8 74297.3 moveto
48286.4 74005.9 lineto
stroke
newpath
48286.4 41741.8 moveto
48577.8 41450.4 lineto
stroke
newpath
48577.8 41741.8 moveto
48286.4 41450.4 lineto
stroke
newpath
49269.7 74299.6 moveto
49561 74008.2 lineto
stroke
newpath
49561 74299.6 moveto
49269.7 74008.2 lineto
stroke
newpath
49269.7 41741.8 moveto
49561 41450.4 lineto
stroke
newpath
49561 41741.8 moveto
49269.7 41450.4 lineto
stroke
newpath
50034.4 74299.6 moveto
50325.8 74008.2 lineto
stroke
newpath
50325.8 74299.6 moveto
50034.4 74008.2 lineto
stroke
newpath
50034.4 41741.8 moveto
50325.8 41450.4 lineto
stroke
newpath
50325.8 41741.8 moveto
50034.4 41450.4 lineto
stroke
newpath
51017.7 74296.2 moveto
51309 74004.9 lineto
stroke
newpath
51309 74296.2 moveto
51017.7 74004.9 lineto
stroke
newpath
51017.7 41741.8 moveto
51309 41450.4 lineto
stroke
newpath
51309 41741.8 moveto
51017.7 41450.4 lineto
stroke
newpath
51782.5 74296.2 moveto
52073.8 74004.9 lineto
stroke
newpath
52073.8 74296.2 moveto
51782.5 74004.9 lineto
stroke
newpath
51782.5 41741.8 moveto
52073.8 41450.4 lineto
stroke
newpath
52073.8 41741.8 moveto
51782.5 41450.4 lineto
stroke
newpath
52765.7 74301.6 moveto
53057.1 74010.2 lineto
stroke
newpath
53057.1 74301.6 moveto
52765.7 74010.2 lineto
stroke
newpath
52765.7 41741.8 moveto
53057.1 41450.4 lineto
stroke
newpath
53057.1 41741.8 moveto
52765.7 41450.4 lineto
stroke
newpath
53530.5 74301.6 moveto
53821.8 74010.2 lineto
stroke
newpath
53821.8 74301.6 moveto
53530.5 74010.2 lineto
stroke
newpath
53530.5 41741.8 moveto
53821.8 41450.4 lineto
stroke
newpath
53821.8 41741.8 moveto
53530.5 41450.4 lineto
stroke
newpath
54513.7 74301.6 moveto
54805.1 74010.2 lineto
stroke
newpath
54805.1 74301.6 moveto
54513.7 74010.2 lineto
stroke
newpath
54513.7 41741.8 moveto
54805.1 41450.4 lineto
stroke
newpath
54805.1 41741.8 moveto
54513.7 41450.4 lineto
stroke
newpath
55278.5 74301.6 moveto
55569.8 74010.2 lineto
stroke
newpath
55569.8 74301.6 moveto
55278.5 74010.2 lineto
stroke
newpath
55278.5 41741.8 moveto
55569.8 41450.4 lineto
stroke
newpath
55569.8 41741.8 moveto
55278.5 41450.4 lineto
stroke
newpath
56261.8 41741.8 moveto
56553.1 41450.4 lineto
stroke
newpath
56553.1 41741.8 moveto
56261.8 41450.4 lineto
stroke
newpath
56284.3 74764.1 moveto
56575.7 74472.7 lineto
stroke
newpath
56575.7 74764.1 moveto
56284.3 74472.7 lineto
stroke
newpath
56284.3 74116.6 moveto
56575.7 73825.2 lineto
stroke
newpath
56575.7 74116.6 moveto
56284.3 73825.2 lineto
stroke
newpath
57026.5 41741.8 moveto
57317.9 41450.4 lineto
stroke
newpath
57317.9 41741.8 moveto
57026.5 41450.4 lineto
stroke
newpath
58009.8 74300.4 moveto
58301.1 74009.1 lineto
stroke
newpath
58301.1 74300.4 moveto
58009.8 74009.1 lineto
stroke
newpath
58041.8 49511.7 moveto
58333.2 49220.4 lineto
stroke
newpath
58333.2 49511.7 moveto
58041.8 49220.4 lineto
stroke
newpath
58565.5 53381 moveto
58856.9 53089.7 lineto
stroke
newpath
58856.9 53381 moveto
58565.5 53089.7 lineto
stroke
newpath
58592.1 45685.3 moveto
58883.4 45394 lineto
stroke
newpath
58883.4 45685.3 moveto
58592.1 45394 lineto
stroke
newpath
58774.5 74300.4 moveto
59065.9 74009.1 lineto
stroke
newpath
59065.9 74300.4 moveto
58774.5 74009.1 lineto
stroke
newpath
58874.3 69646.9 moveto
59165.7 69355.5 lineto
stroke
newpath
59165.7 69646.9 moveto
58874.3 69355.5 lineto
stroke
newpath
58874.3 68566.6 moveto
59165.7 68275.3 lineto
stroke
newpath
59165.7 68566.6 moveto
58874.3 68275.3 lineto
stroke
newpath
59151.8 53674.2 moveto
59443.2 53382.9 lineto
stroke
newpath
59443.2 53674.2 moveto
59151.8 53382.9 lineto
stroke
newpath
59255.5 49516.1 moveto
59546.9 49224.7 lineto
stroke
newpath
59546.9 49516.1 moveto
59255.5 49224.7 lineto
stroke
newpath
59796.4 49945.1 moveto
60087.7 49653.8 lineto
stroke
newpath
60087.7 49945.1 moveto
59796.4 49653.8 lineto
stroke
newpath
59796.4 46048.5 moveto
60087.7 45757.1 lineto
stroke
newpath
60087.7 46048.5 moveto
59796.4 45757.1 lineto
stroke
newpath
60261.8 47729 moveto
60553.2 47437.6 lineto
stroke
newpath
60553.2 47729 moveto
60261.8 47437.6 lineto
stroke
newpath
60297.3 51625.6 moveto
60588.6 51334.3 lineto
stroke
newpath
60588.6 51625.6 moveto
60297.3 51334.3 lineto
stroke
newpath
60354.3 52853.4 moveto
60645.7 52562 lineto
stroke
newpath
60645.7 52853.4 moveto
60354.3 52562 lineto
stroke
newpath
60385.3 48986 moveto
60676.6 48694.7 lineto
stroke
newpath
60676.6 48986 moveto
60385.3 48694.7 lineto
stroke
newpath
60540.3 46256.1 moveto
60831.6 45964.8 lineto
stroke
newpath
60831.6 46256.1 moveto
60540.3 45964.8 lineto
stroke
newpath
61001.8 74821.2 moveto
61293.2 74529.9 lineto
stroke
newpath
61293.2 74821.2 moveto
61001.8 74529.9 lineto
stroke
newpath
62771.6 45987 moveto
63062.9 45695.7 lineto
stroke
newpath
63062.9 45987 moveto
62771.6 45695.7 lineto
stroke
newpath
62851.8 49881.7 moveto
63143.1 49590.4 lineto
stroke
newpath
63143.1 49881.7 moveto
62851.8 49590.4 lineto
stroke
newpath
62944.3 53766.7 moveto
63235.6 53475.4 lineto
stroke
newpath
63235.6 53766.7 moveto
62944.3 53475.4 lineto
stroke
newpath
63499.3 65606.6 moveto
63790.6 65315.3 lineto
stroke
newpath
63790.6 65606.6 moveto
63499.3 65315.3 lineto
stroke
newpath
63605.4 61605.9 moveto
63896.8 61314.6 lineto
stroke
newpath
63896.8 61605.9 moveto
63605.4 61314.6 lineto
stroke
newpath
63605.4 57694.7 moveto
63896.8 57403.3 lineto
stroke
newpath
63896.8 57694.7 moveto
63605.4 57403.3 lineto
stroke
newpath
63605.4 53709.2 moveto
63896.8 53417.8 lineto
stroke
newpath
63896.8 53709.2 moveto
63605.4 53417.8 lineto
stroke
newpath
63605.4 49974.2 moveto
63896.8 49682.9 lineto
stroke
newpath
63896.8 49974.2 moveto
63605.4 49682.9 lineto
stroke
newpath
63961.8 74579.1 moveto
64253.1 74287.7 lineto
stroke
newpath
64253.1 74579.1 moveto
63961.8 74287.7 lineto
stroke
newpath
64239.3 61999.1 moveto
64530.6 61707.8 lineto
stroke
newpath
64530.6 61999.1 moveto
64239.3 61707.8 lineto
stroke
newpath
64239.3 58102.5 moveto
64530.6 57811.2 lineto
stroke
newpath
64530.6 58102.5 moveto
64239.3 57811.2 lineto
stroke
newpath
64239.3 54205.9 moveto
64530.6 53914.5 lineto
stroke
newpath
64530.6 54205.9 moveto
64239.3 53914.5 lineto
stroke
newpath
64239.3 46412.6 moveto
64530.6 46121.3 lineto
stroke
newpath
64530.6 46412.6 moveto
64239.3 46121.3 lineto
stroke
newpath
64424.3 53381.4 moveto
64715.6 53090.1 lineto
stroke
newpath
64715.6 53381.4 moveto
64424.3 53090.1 lineto
stroke
newpath
64424.3 52325.3 moveto
64715.6 52034 lineto
stroke
newpath
64715.6 52325.3 moveto
64424.3 52034 lineto
stroke
newpath
64701.8 59779.2 moveto
64993.1 59487.8 lineto
stroke
newpath
64993.1 59779.2 moveto
64701.8 59487.8 lineto
stroke
newpath
64701.8 55886.4 moveto
64993.1 55595.1 lineto
stroke
newpath
64993.1 55886.4 moveto
64701.8 55595.1 lineto
stroke
newpath
64701.8 48093.1 moveto
64993.1 47801.8 lineto
stroke
newpath
64993.1 48093.1 moveto
64701.8 47801.8 lineto
stroke
newpath
64703.1 63665 moveto
64994.4 63373.7 lineto
stroke
newpath
64994.4 63665 moveto
64703.1 63373.7 lineto
stroke
newpath
64797.2 64907.4 moveto
65088.5 64616.1 lineto
stroke
newpath
65088.5 64907.4 moveto
64797.2 64616.1 lineto
stroke
newpath
64797.2 61010.8 moveto
65088.5 60719.4 lineto
stroke
newpath
65088.5 61010.8 moveto
64797.2 60719.4 lineto
stroke
newpath
64797.2 49320.9 moveto
65088.5 49029.6 lineto
stroke
newpath
65088.5 49320.9 moveto
64797.2 49029.6 lineto
stroke
newpath
65017.1 70670.5 moveto
65308.4 70379.2 lineto
stroke
newpath
65308.4 70670.5 moveto
65017.1 70379.2 lineto
stroke
newpath
65256.8 46636.4 moveto
65548.1 46345.1 lineto
stroke
newpath
65548.1 46636.4 moveto
65256.8 46345.1 lineto
stroke
newpath
65557.9 71211.3 moveto
65849.2 70919.9 lineto
stroke
newpath
65849.2 71211.3 moveto
65557.9 70919.9 lineto
stroke
newpath
66181.8 58114.2 moveto
66473.1 57822.8 lineto
stroke
newpath
66473.1 58114.2 moveto
66181.8 57822.8 lineto
stroke
newpath
66644.3 51361.7 moveto
66935.6 51070.4 lineto
stroke
newpath
66935.6 51361.7 moveto
66644.3 51070.4 lineto
stroke
newpath
67661.8 76799 moveto
67953.1 76507.7 lineto
stroke
newpath
67953.1 76799 moveto
67661.8 76507.7 lineto
stroke
newpath
68079.9 58001.4 moveto
68371.2 57710.1 lineto
stroke
newpath
68371.2 58001.4 moveto
68079.9 57710.1 lineto
stroke
newpath
68092.8 61629.1 moveto
68384.1 61337.8 lineto
stroke
newpath
68384.1 61629.1 moveto
68092.8 61337.8 lineto
stroke
newpath
68216.8 50344.2 moveto
68508.1 50052.9 lineto
stroke
newpath
68508.1 50344.2 moveto
68216.8 50052.9 lineto
stroke
newpath
68216.8 45719.2 moveto
68508.1 45427.9 lineto
stroke
newpath
68508.1 45719.2 moveto
68216.8 45427.9 lineto
stroke
newpath
68586.8 73561.6 moveto
68878.1 73270.2 lineto
stroke
newpath
68878.1 73561.6 moveto
68586.8 73270.2 lineto
stroke
newpath
68682.2 58466.7 moveto
68973.5 58175.3 lineto
stroke
newpath
68973.5 58466.7 moveto
68682.2 58175.3 lineto
stroke
newpath
68682.2 46776.8 moveto
68973.5 46485.5 lineto
stroke
newpath
68973.5 46776.8 moveto
68682.2 46485.5 lineto
stroke
newpath
68956.8 71526.6 moveto
69248.1 71235.2 lineto
stroke
newpath
69248.1 71526.6 moveto
68956.8 71235.2 lineto
stroke
newpath
69141.8 60147.2 moveto
69433.1 59855.9 lineto
stroke
newpath
69433.1 60147.2 moveto
69141.8 59855.9 lineto
stroke
newpath
69240.1 49685.1 moveto
69531.4 49393.7 lineto
stroke
newpath
69531.4 49685.1 moveto
69240.1 49393.7 lineto
stroke
newpath
69488.7 48457.3 moveto
69780.1 48166 lineto
stroke
newpath
69780.1 48457.3 moveto
69488.7 48166 lineto
stroke
newpath
71084.2 43684.3 moveto
71375.6 43392.9 lineto
stroke
newpath
71375.6 43684.3 moveto
71084.2 43392.9 lineto
stroke
newpath
71269.2 39521.8 moveto
71560.6 39230.5 lineto
stroke
newpath
71560.6 39521.8 moveto
71269.2 39230.5 lineto
stroke
newpath
71639.2 50621.7 moveto
71930.6 50330.4 lineto
stroke
newpath
71930.6 50621.7 moveto
71639.2 50330.4 lineto
stroke
newpath
71639.2 46829.2 moveto
71930.6 46537.9 lineto
stroke
newpath
71930.6 46829.2 moveto
71639.2 46537.9 lineto
stroke
newpath
71824.2 75596.6 moveto
72115.6 75305.2 lineto
stroke
newpath
72115.6 75596.6 moveto
71824.2 75305.2 lineto
stroke
newpath
72114.9 60402.6 moveto
72406.2 60111.3 lineto
stroke
newpath
72406.2 60402.6 moveto
72114.9 60111.3 lineto
stroke
newpath
72114.9 59477.6 moveto
72406.2 59186.3 lineto
stroke
newpath
72406.2 59477.6 moveto
72114.9 59186.3 lineto
stroke
newpath
72114.9 57627.6 moveto
72406.2 57336.3 lineto
stroke
newpath
72406.2 57627.6 moveto
72114.9 57336.3 lineto
stroke
newpath
72114.9 56702.6 moveto
72406.2 56411.3 lineto
stroke
newpath
72406.2 56702.6 moveto
72114.9 56411.3 lineto
stroke
newpath
72345.4 61780.3 moveto
72636.7 61488.9 lineto
stroke
newpath
72636.7 61780.3 moveto
72345.4 61488.9 lineto
stroke
newpath
72442.6 51332.6 moveto
72733.9 51041.2 lineto
stroke
newpath
72733.9 51332.6 moveto
72442.6 51041.2 lineto
stroke
newpath
72471.7 46551.7 moveto
72763.1 46260.4 lineto
stroke
newpath
72763.1 46551.7 moveto
72471.7 46260.4 lineto
stroke
newpath
72622.9 63167.8 moveto
72914.2 62876.4 lineto
stroke
newpath
72914.2 63167.8 moveto
72622.9 62876.4 lineto
stroke
newpath
72749.2 77261.5 moveto
73040.6 76970.2 lineto
stroke
newpath
73040.6 77261.5 moveto
72749.2 76970.2 lineto
stroke
newpath
72749.2 43499.3 moveto
73040.6 43207.9 lineto
stroke
newpath
73040.6 43499.3 moveto
72749.2 43207.9 lineto
stroke
newpath
72783.1 62218 moveto
73074.5 61926.7 lineto
stroke
newpath
73074.5 62218 moveto
72783.1 61926.7 lineto
stroke
newpath
73060.6 63605.5 moveto
73352 63314.2 lineto
stroke
newpath
73352 63605.5 moveto
73060.6 63314.2 lineto
stroke
newpath
73125.1 47141 moveto
73416.4 46849.6 lineto
stroke
newpath
73416.4 47141 moveto
73125.1 46849.6 lineto
stroke
newpath
73766.7 48742.6 moveto
74058.1 48451.3 lineto
stroke
newpath
74058.1 48742.6 moveto
73766.7 48451.3 lineto
stroke
newpath
73802.1 51454.2 moveto
74093.4 51162.9 lineto
stroke
newpath
74093.4 51454.2 moveto
73802.1 51162.9 lineto
stroke
newpath
75616.7 38781.8 moveto
75908.1 38490.5 lineto
stroke
newpath
75908.1 38781.8 moveto
75616.7 38490.5 lineto
stroke
newpath
77836.7 55894.2 moveto
78128 55602.8 lineto
stroke
newpath
78128 55894.2 moveto
77836.7 55602.8 lineto
stroke
newpath
77836.7 55154.2 moveto
78128 54862.9 lineto
stroke
newpath
78128 55154.2 moveto
77836.7 54862.9 lineto
stroke
newpath
77929.2 60472.9 moveto
78220.5 60181.6 lineto
stroke
newpath
78220.5 60472.9 moveto
77929.2 60181.6 lineto
stroke
newpath
79515.1 53251.5 moveto
79806.5 52960.1 lineto
stroke
newpath
79806.5 53251.5 moveto
79515.1 52960.1 lineto
stroke
newpath
81906.7 61629.1 moveto
82198 61337.8 lineto
stroke
newpath
82198 61629.1 moveto
81906.7 61337.8 lineto
stroke
newpath
82096.6 55709.2 moveto
82387.9 55417.8 lineto
stroke
newpath
82387.9 55709.2 moveto
82096.6 55417.8 lineto
stroke
newpath
82276.7 53119.2 moveto
82568 52827.9 lineto
stroke
newpath
82568 53119.2 moveto
82276.7 52827.9 lineto
stroke
newpath
82369.2 58946.7 moveto
82660.5 58655.3 lineto
stroke
newpath
82660.5 58946.7 moveto
82369.2 58655.3 lineto
stroke
81034.9 48163.6 364.171 cir0
81034.9 46313.6 364.171 cir0
81034.9 44463.6 364.171 cir0
81034.9 42613.6 364.171 cir0
82884.8 48163.6 364.171 cir0
82884.8 46313.6 364.171 cir0
82884.8 44463.6 364.171 cir0
82884.8 42613.6 364.171 cir0
81034.9 72213.4 364.171 cir0
81034.9 70363.4 364.171 cir0
81034.9 68513.4 364.171 cir0
81034.9 66663.4 364.171 cir0
82884.8 72213.4 364.171 cir0
82884.8 70363.4 364.171 cir0
82884.8 68513.4 364.171 cir0
82884.8 66663.4 364.171 cir0
118.11 setlinewidth
0 0 0 setrgbcolor
0 0 0 setrgbcolor
newpath
31788.2 35175.5 moveto
31788.2 36356.6 lineto
32069.4 36356.6 lineto
32238.2 36300.3 lineto
32350.7 36187.9 lineto
32406.9 36075.4 lineto
32463.1 35850.4 lineto
32463.1 35681.7 lineto
32406.9 35456.7 lineto
32350.7 35344.2 lineto
32238.2 35231.7 lineto
32069.4 35175.5 lineto
31788.2 35175.5 lineto
stroke
newpath
32969.3 35175.5 moveto
32969.3 35962.9 lineto
stroke
newpath
32969.3 35737.9 moveto
33025.6 35850.4 lineto
33081.8 35906.6 lineto
33194.3 35962.9 lineto
33306.8 35962.9 lineto
stroke
newpath
33700.5 35175.5 moveto
33700.5 35962.9 lineto
stroke
newpath
33700.5 36356.6 moveto
33644.2 36300.3 lineto
33700.5 36244.1 lineto
33756.7 36300.3 lineto
33700.5 36356.6 lineto
33700.5 36244.1 lineto
stroke
newpath
34431.6 35175.5 moveto
34319.2 35231.7 lineto
34262.9 35344.2 lineto
34262.9 36356.6 lineto
stroke
newpath
35050.3 35175.5 moveto
34937.8 35231.7 lineto
34881.6 35344.2 lineto
34881.6 36356.6 lineto
stroke
newpath
36400.1 35175.5 moveto
36400.1 36356.6 lineto
36793.8 35512.9 lineto
37187.5 36356.6 lineto
37187.5 35175.5 lineto
stroke
newpath
38256.2 35175.5 moveto
38256.2 35794.2 lineto
38199.9 35906.6 lineto
38087.4 35962.9 lineto
37862.5 35962.9 lineto
37750 35906.6 lineto
stroke
newpath
38256.2 35231.7 moveto
38143.7 35175.5 lineto
37862.5 35175.5 lineto
37750 35231.7 lineto
37693.7 35344.2 lineto
37693.7 35456.7 lineto
37750 35569.2 lineto
37862.5 35625.4 lineto
38143.7 35625.4 lineto
38256.2 35681.7 lineto
stroke
newpath
38818.6 35962.9 moveto
38818.6 34781.8 lineto
stroke
newpath
38818.6 35906.6 moveto
38931.1 35962.9 lineto
39156.1 35962.9 lineto
39268.5 35906.6 lineto
39324.8 35850.4 lineto
39381 35737.9 lineto
39381 35400.5 lineto
39324.8 35288 lineto
39268.5 35231.7 lineto
39156.1 35175.5 lineto
38931.1 35175.5 lineto
38818.6 35231.7 lineto
stroke
newpath
39887.2 35288 moveto
39943.5 35231.7 lineto
39887.2 35175.5 lineto
39831 35231.7 lineto
39887.2 35288 lineto
39887.2 35175.5 lineto
stroke
newpath
39887.2 35906.6 moveto
39943.5 35850.4 lineto
39887.2 35794.2 lineto
39831 35850.4 lineto
39887.2 35906.6 lineto
39887.2 35794.2 lineto
stroke
newpath
30369.2 33375.1 moveto
30660.6 33083.8 lineto
stroke
newpath
30660.6 33375.1 moveto
30369.2 33083.8 lineto
stroke
0 0 0 setrgbcolor
0 0 0 setrgbcolor
newpath
32013.2 33876.3 moveto
32125.7 33876.3 lineto
32238.2 33820 lineto
32294.4 33763.8 lineto
32350.7 33651.3 lineto
32406.9 33426.3 lineto
32406.9 33145.1 lineto
32350.7 32920.1 lineto
32294.4 32807.7 lineto
32238.2 32751.4 lineto
32125.7 32695.2 lineto
32013.2 32695.2 lineto
31900.7 32751.4 lineto
31844.5 32807.7 lineto
31788.2 32920.1 lineto
31732 33145.1 lineto
31732 33426.3 lineto
31788.2 33651.3 lineto
31844.5 33763.8 lineto
31900.7 33820 lineto
32013.2 33876.3 lineto
stroke
newpath
32913.1 32807.7 moveto
32969.3 32751.4 lineto
32913.1 32695.2 lineto
32856.8 32751.4 lineto
32913.1 32807.7 lineto
32913.1 32695.2 lineto
stroke
newpath
33981.7 33482.6 moveto
33981.7 32695.2 lineto
stroke
newpath
33700.5 33932.5 moveto
33419.3 33088.9 lineto
34150.4 33088.9 lineto
stroke
newpath
34825.3 33876.3 moveto
34937.8 33876.3 lineto
35050.3 33820 lineto
35106.6 33763.8 lineto
35162.8 33651.3 lineto
35219 33426.3 lineto
35219 33145.1 lineto
35162.8 32920.1 lineto
35106.6 32807.7 lineto
35050.3 32751.4 lineto
34937.8 32695.2 lineto
34825.3 32695.2 lineto
34712.9 32751.4 lineto
34656.6 32807.7 lineto
34600.4 32920.1 lineto
34544.1 33145.1 lineto
34544.1 33426.3 lineto
34600.4 33651.3 lineto
34656.6 33763.8 lineto
34712.9 33820 lineto
34825.3 33876.3 lineto
stroke
newpath
35725.2 32695.2 moveto
35725.2 33482.6 lineto
stroke
newpath
35725.2 33370.1 moveto
35781.5 33426.3 lineto
35894 33482.6 lineto
36062.7 33482.6 lineto
36175.2 33426.3 lineto
36231.4 33313.8 lineto
36231.4 32695.2 lineto
stroke
newpath
36231.4 33313.8 moveto
36287.7 33426.3 lineto
36400.1 33482.6 lineto
36568.9 33482.6 lineto
36681.4 33426.3 lineto
36737.6 33313.8 lineto
36737.6 32695.2 lineto
stroke
newpath
37300 32695.2 moveto
37300 33482.6 lineto
stroke
newpath
37300 33370.1 moveto
37356.3 33426.3 lineto
37468.8 33482.6 lineto
37637.5 33482.6 lineto
37750 33426.3 lineto
37806.2 33313.8 lineto
37806.2 32695.2 lineto
stroke
newpath
37806.2 33313.8 moveto
37862.5 33426.3 lineto
37975 33482.6 lineto
38143.7 33482.6 lineto
38256.2 33426.3 lineto
38312.4 33313.8 lineto
38312.4 32695.2 lineto
stroke
newpath
40618.4 33932.5 moveto
39606 32414 lineto
stroke
newpath
42136.9 33876.3 moveto
42249.4 33876.3 lineto
42361.9 33820 lineto
42418.1 33763.8 lineto
42474.4 33651.3 lineto
42530.6 33426.3 lineto
42530.6 33145.1 lineto
42474.4 32920.1 lineto
42418.1 32807.7 lineto
42361.9 32751.4 lineto
42249.4 32695.2 lineto
42136.9 32695.2 lineto
42024.4 32751.4 lineto
41968.2 32807.7 lineto
41912 32920.1 lineto
41855.7 33145.1 lineto
41855.7 33426.3 lineto
41912 33651.3 lineto
41968.2 33763.8 lineto
42024.4 33820 lineto
42136.9 33876.3 lineto
stroke
newpath
43036.8 32807.7 moveto
43093.1 32751.4 lineto
43036.8 32695.2 lineto
42980.6 32751.4 lineto
43036.8 32807.7 lineto
43036.8 32695.2 lineto
stroke
newpath
43824.2 33876.3 moveto
43936.7 33876.3 lineto
44049.2 33820 lineto
44105.4 33763.8 lineto
44161.7 33651.3 lineto
44217.9 33426.3 lineto
44217.9 33145.1 lineto
44161.7 32920.1 lineto
44105.4 32807.7 lineto
44049.2 32751.4 lineto
43936.7 32695.2 lineto
43824.2 32695.2 lineto
43711.7 32751.4 lineto
43655.5 32807.7 lineto
43599.2 32920.1 lineto
43543 33145.1 lineto
43543 33426.3 lineto
43599.2 33651.3 lineto
43655.5 33763.8 lineto
43711.7 33820 lineto
43824.2 33876.3 lineto
stroke
newpath
45342.8 32695.2 moveto
44667.9 32695.2 lineto
stroke
newpath
45005.3 32695.2 moveto
45005.3 33876.3 lineto
44892.8 33707.5 lineto
44780.3 33595.1 lineto
44667.9 33538.8 lineto
stroke
newpath
46355.2 33876.3 moveto
46130.2 33876.3 lineto
46017.7 33820 lineto
45961.5 33763.8 lineto
45849 33595.1 lineto
45792.7 33370.1 lineto
45792.7 32920.1 lineto
45849 32807.7 lineto
45905.2 32751.4 lineto
46017.7 32695.2 lineto
46242.7 32695.2 lineto
46355.2 32751.4 lineto
46411.4 32807.7 lineto
46467.6 32920.1 lineto
46467.6 33201.4 lineto
46411.4 33313.8 lineto
46355.2 33370.1 lineto
46242.7 33426.3 lineto
46017.7 33426.3 lineto
45905.2 33370.1 lineto
45849 33313.8 lineto
45792.7 33201.4 lineto
stroke
newpath
46917.6 33876.3 moveto
46917.6 33651.3 lineto
stroke
newpath
47367.5 33876.3 moveto
47367.5 33651.3 lineto
stroke
newpath
49111.1 32245.2 moveto
49054.8 32301.5 lineto
48942.3 32470.2 lineto
48886.1 32582.7 lineto
48829.8 32751.4 lineto
48773.6 33032.6 lineto
48773.6 33257.6 lineto
48829.8 33538.8 lineto
48886.1 33707.5 lineto
48942.3 33820 lineto
49054.8 33988.8 lineto
49111.1 34045 lineto
stroke
newpath
50179.7 32695.2 moveto
49504.8 32695.2 lineto
stroke
newpath
49842.2 32695.2 moveto
49842.2 33876.3 lineto
49729.7 33707.5 lineto
49617.2 33595.1 lineto
49504.8 33538.8 lineto
stroke
newpath
50573.4 33876.3 moveto
51304.5 33876.3 lineto
50910.8 33426.3 lineto
51079.6 33426.3 lineto
51192 33370.1 lineto
51248.3 33313.8 lineto
51304.5 33201.4 lineto
51304.5 32920.1 lineto
51248.3 32807.7 lineto
51192 32751.4 lineto
51079.6 32695.2 lineto
50742.1 32695.2 lineto
50629.6 32751.4 lineto
50573.4 32807.7 lineto
stroke
newpath
52429.4 32695.2 moveto
51754.5 32695.2 lineto
stroke
newpath
52091.9 32695.2 moveto
52091.9 33876.3 lineto
51979.4 33707.5 lineto
51867 33595.1 lineto
51754.5 33538.8 lineto
stroke
newpath
53835.5 32695.2 moveto
53835.5 33876.3 lineto
stroke
newpath
54341.7 32695.2 moveto
54341.7 33313.8 lineto
54285.4 33426.3 lineto
54172.9 33482.6 lineto
54004.2 33482.6 lineto
53891.7 33426.3 lineto
53835.5 33370.1 lineto
stroke
newpath
55072.8 32695.2 moveto
54960.3 32751.4 lineto
54904.1 32807.7 lineto
54847.8 32920.1 lineto
54847.8 33257.6 lineto
54904.1 33370.1 lineto
54960.3 33426.3 lineto
55072.8 33482.6 lineto
55241.5 33482.6 lineto
55354 33426.3 lineto
55410.3 33370.1 lineto
55466.5 33257.6 lineto
55466.5 32920.1 lineto
55410.3 32807.7 lineto
55354 32751.4 lineto
55241.5 32695.2 lineto
55072.8 32695.2 lineto
stroke
newpath
56141.4 32695.2 moveto
56028.9 32751.4 lineto
55972.7 32863.9 lineto
55972.7 33876.3 lineto
stroke
newpath
57041.3 32751.4 moveto
56928.8 32695.2 lineto
56703.9 32695.2 lineto
56591.4 32751.4 lineto
56535.1 32863.9 lineto
56535.1 33313.8 lineto
56591.4 33426.3 lineto
56703.9 33482.6 lineto
56928.8 33482.6 lineto
57041.3 33426.3 lineto
57097.6 33313.8 lineto
57097.6 33201.4 lineto
56535.1 33088.9 lineto
stroke
newpath
57547.5 32751.4 moveto
57660 32695.2 lineto
57885 32695.2 lineto
57997.4 32751.4 lineto
58053.7 32863.9 lineto
58053.7 32920.1 lineto
57997.4 33032.6 lineto
57885 33088.9 lineto
57716.2 33088.9 lineto
57603.7 33145.1 lineto
57547.5 33257.6 lineto
57547.5 33313.8 lineto
57603.7 33426.3 lineto
57716.2 33482.6 lineto
57885 33482.6 lineto
57997.4 33426.3 lineto
stroke
newpath
58447.4 32245.2 moveto
58503.6 32301.5 lineto
58616.1 32470.2 lineto
58672.4 32582.7 lineto
58728.6 32751.4 lineto
58784.8 33032.6 lineto
58784.8 33257.6 lineto
58728.6 33538.8 lineto
58672.4 33707.5 lineto
58616.1 33820 lineto
58503.6 33988.8 lineto
58447.4 34045 lineto
stroke
30296.4 31670.4 364.171 cir0
0 0 0 setrgbcolor
0 0 0 setrgbcolor
newpath
32406.9 31136.1 moveto
31732 31136.1 lineto
stroke
newpath
32069.4 31136.1 moveto
32069.4 32317.2 lineto
31957 32148.5 lineto
31844.5 32036 lineto
31732 31979.8 lineto
stroke
newpath
32913.1 31248.6 moveto
32969.3 31192.4 lineto
32913.1 31136.1 lineto
32856.8 31192.4 lineto
32913.1 31248.6 lineto
32913.1 31136.1 lineto
stroke
newpath
33700.5 32317.2 moveto
33813 32317.2 lineto
33925.5 32261 lineto
33981.7 32204.7 lineto
34037.9 32092.2 lineto
34094.2 31867.3 lineto
34094.2 31586.1 lineto
34037.9 31361.1 lineto
33981.7 31248.6 lineto
33925.5 31192.4 lineto
33813 31136.1 lineto
33700.5 31136.1 lineto
33588 31192.4 lineto
33531.8 31248.6 lineto
33475.5 31361.1 lineto
33419.3 31586.1 lineto
33419.3 31867.3 lineto
33475.5 32092.2 lineto
33531.8 32204.7 lineto
33588 32261 lineto
33700.5 32317.2 lineto
stroke
newpath
34825.3 32317.2 moveto
34937.8 32317.2 lineto
35050.3 32261 lineto
35106.6 32204.7 lineto
35162.8 32092.2 lineto
35219 31867.3 lineto
35219 31586.1 lineto
35162.8 31361.1 lineto
35106.6 31248.6 lineto
35050.3 31192.4 lineto
34937.8 31136.1 lineto
34825.3 31136.1 lineto
34712.9 31192.4 lineto
34656.6 31248.6 lineto
34600.4 31361.1 lineto
34544.1 31586.1 lineto
34544.1 31867.3 lineto
34600.4 32092.2 lineto
34656.6 32204.7 lineto
34712.9 32261 lineto
34825.3 32317.2 lineto
stroke
newpath
35725.2 31136.1 moveto
35725.2 31923.5 lineto
stroke
newpath
35725.2 31811 moveto
35781.5 31867.3 lineto
35894 31923.5 lineto
36062.7 31923.5 lineto
36175.2 31867.3 lineto
36231.4 31754.8 lineto
36231.4 31136.1 lineto
stroke
newpath
36231.4 31754.8 moveto
36287.7 31867.3 lineto
36400.1 31923.5 lineto
36568.9 31923.5 lineto
36681.4 31867.3 lineto
36737.6 31754.8 lineto
36737.6 31136.1 lineto
stroke
newpath
37300 31136.1 moveto
37300 31923.5 lineto
stroke
newpath
37300 31811 moveto
37356.3 31867.3 lineto
37468.8 31923.5 lineto
37637.5 31923.5 lineto
37750 31867.3 lineto
37806.2 31754.8 lineto
37806.2 31136.1 lineto
stroke
newpath
37806.2 31754.8 moveto
37862.5 31867.3 lineto
37975 31923.5 lineto
38143.7 31923.5 lineto
38256.2 31867.3 lineto
38312.4 31754.8 lineto
38312.4 31136.1 lineto
stroke
newpath
40618.4 32373.5 moveto
39606 30854.9 lineto
stroke
newpath
42136.9 32317.2 moveto
42249.4 32317.2 lineto
42361.9 32261 lineto
42418.1 32204.7 lineto
42474.4 32092.2 lineto
42530.6 31867.3 lineto
42530.6 31586.1 lineto
42474.4 31361.1 lineto
42418.1 31248.6 lineto
42361.9 31192.4 lineto
42249.4 31136.1 lineto
42136.9 31136.1 lineto
42024.4 31192.4 lineto
41968.2 31248.6 lineto
41912 31361.1 lineto
41855.7 31586.1 lineto
41855.7 31867.3 lineto
41912 32092.2 lineto
41968.2 32204.7 lineto
42024.4 32261 lineto
42136.9 32317.2 lineto
stroke
newpath
43036.8 31248.6 moveto
43093.1 31192.4 lineto
43036.8 31136.1 lineto
42980.6 31192.4 lineto
43036.8 31248.6 lineto
43036.8 31136.1 lineto
stroke
newpath
43824.2 32317.2 moveto
43936.7 32317.2 lineto
44049.2 32261 lineto
44105.4 32204.7 lineto
44161.7 32092.2 lineto
44217.9 31867.3 lineto
44217.9 31586.1 lineto
44161.7 31361.1 lineto
44105.4 31248.6 lineto
44049.2 31192.4 lineto
43936.7 31136.1 lineto
43824.2 31136.1 lineto
43711.7 31192.4 lineto
43655.5 31248.6 lineto
43599.2 31361.1 lineto
43543 31586.1 lineto
43543 31867.3 lineto
43599.2 32092.2 lineto
43655.5 32204.7 lineto
43711.7 32261 lineto
43824.2 32317.2 lineto
stroke
newpath
44611.6 32317.2 moveto
45342.8 32317.2 lineto
44949.1 31867.3 lineto
45117.8 31867.3 lineto
45230.3 31811 lineto
45286.5 31754.8 lineto
45342.8 31642.3 lineto
45342.8 31361.1 lineto
45286.5 31248.6 lineto
45230.3 31192.4 lineto
45117.8 31136.1 lineto
44780.3 31136.1 lineto
44667.9 31192.4 lineto
44611.6 31248.6 lineto
stroke
newpath
45905.2 31136.1 moveto
46130.2 31136.1 lineto
46242.7 31192.4 lineto
46298.9 31248.6 lineto
46411.4 31417.3 lineto
46467.6 31642.3 lineto
46467.6 32092.2 lineto
46411.4 32204.7 lineto
46355.2 32261 lineto
46242.7 32317.2 lineto
46017.7 32317.2 lineto
45905.2 32261 lineto
45849 32204.7 lineto
45792.7 32092.2 lineto
45792.7 31811 lineto
45849 31698.5 lineto
45905.2 31642.3 lineto
46017.7 31586.1 lineto
46242.7 31586.1 lineto
46355.2 31642.3 lineto
46411.4 31698.5 lineto
46467.6 31811 lineto
stroke
newpath
46917.6 32317.2 moveto
46917.6 32092.2 lineto
stroke
newpath
47367.5 32317.2 moveto
47367.5 32092.2 lineto
stroke
newpath
49111.1 30686.2 moveto
49054.8 30742.4 lineto
48942.3 30911.1 lineto
48886.1 31023.6 lineto
48829.8 31192.4 lineto
48773.6 31473.6 lineto
48773.6 31698.5 lineto
48829.8 31979.8 lineto
48886.1 32148.5 lineto
48942.3 32261 lineto
49054.8 32429.7 lineto
49111.1 32485.9 lineto
stroke
newpath
50179.7 31136.1 moveto
49504.8 31136.1 lineto
stroke
newpath
49842.2 31136.1 moveto
49842.2 32317.2 lineto
49729.7 32148.5 lineto
49617.2 32036 lineto
49504.8 31979.8 lineto
stroke
newpath
51192 32317.2 moveto
50967.1 32317.2 lineto
50854.6 32261 lineto
50798.3 32204.7 lineto
50685.9 32036 lineto
50629.6 31811 lineto
50629.6 31361.1 lineto
50685.9 31248.6 lineto
50742.1 31192.4 lineto
50854.6 31136.1 lineto
51079.6 31136.1 lineto
51192 31192.4 lineto
51248.3 31248.6 lineto
51304.5 31361.1 lineto
51304.5 31642.3 lineto
51248.3 31754.8 lineto
51192 31811 lineto
51079.6 31867.3 lineto
50854.6 31867.3 lineto
50742.1 31811 lineto
50685.9 31754.8 lineto
50629.6 31642.3 lineto
stroke
newpath
52710.6 31136.1 moveto
52710.6 32317.2 lineto
stroke
newpath
53216.8 31136.1 moveto
53216.8 31754.8 lineto
53160.6 31867.3 lineto
53048.1 31923.5 lineto
52879.3 31923.5 lineto
52766.9 31867.3 lineto
52710.6 31811 lineto
stroke
newpath
53948 31136.1 moveto
53835.5 31192.4 lineto
53779.2 31248.6 lineto
53723 31361.1 lineto
53723 31698.5 lineto
53779.2 31811 lineto
53835.5 31867.3 lineto
53948 31923.5 lineto
54116.7 31923.5 lineto
54229.2 31867.3 lineto
54285.4 31811 lineto
54341.7 31698.5 lineto
54341.7 31361.1 lineto
54285.4 31248.6 lineto
54229.2 31192.4 lineto
54116.7 31136.1 lineto
53948 31136.1 lineto
stroke
newpath
55016.6 31136.1 moveto
54904.1 31192.4 lineto
54847.8 31304.8 lineto
54847.8 32317.2 lineto
stroke
newpath
55916.5 31192.4 moveto
55804 31136.1 lineto
55579 31136.1 lineto
55466.5 31192.4 lineto
55410.3 31304.8 lineto
55410.3 31754.8 lineto
55466.5 31867.3 lineto
55579 31923.5 lineto
55804 31923.5 lineto
55916.5 31867.3 lineto
55972.7 31754.8 lineto
55972.7 31642.3 lineto
55410.3 31529.8 lineto
stroke
newpath
56422.6 31192.4 moveto
56535.1 31136.1 lineto
56760.1 31136.1 lineto
56872.6 31192.4 lineto
56928.8 31304.8 lineto
56928.8 31361.1 lineto
56872.6 31473.6 lineto
56760.1 31529.8 lineto
56591.4 31529.8 lineto
56478.9 31586.1 lineto
56422.6 31698.5 lineto
56422.6 31754.8 lineto
56478.9 31867.3 lineto
56591.4 31923.5 lineto
56760.1 31923.5 lineto
56872.6 31867.3 lineto
stroke
newpath
57322.5 30686.2 moveto
57378.8 30742.4 lineto
57491.3 30911.1 lineto
57547.5 31023.6 lineto
57603.7 31192.4 lineto
57660 31473.6 lineto
57660 31698.5 lineto
57603.7 31979.8 lineto
57547.5 32148.5 lineto
57491.3 32261 lineto
57378.8 32429.7 lineto
57322.5 32485.9 lineto
stroke
showpage
grestore
%%EOF
