EESchema Schematic File Version 4
EELAYER 30 0
EELAYER END
$Descr A4 11693 8268
encoding utf-8
Sheet 4 4
Title "Powerboard v3 Massive Active Tester Board"
Date "2019-06-04"
Rev ""
Comp "Lawrence Berkeley National Laboratory"
Comment1 ""
Comment2 ""
Comment3 ""
Comment4 ""
$EndDescr
Wire Wire Line
	3100 2900 3925 2900
$Comp
L power:GND #PWR052
U 1 1 5A25A617
P 5300 3700
F 0 "#PWR052" H 5300 3450 50  0001 C CNN
F 1 "GND" H 5300 3550 50  0000 C CNN
F 2 "" H 5300 3700 50  0001 C CNN
F 3 "" H 5300 3700 50  0001 C CNN
	1    5300 3700
	1    0    0    -1  
$EndComp
$Comp
L Device:R R7
U 1 1 5A25A67F
P 5300 3050
F 0 "R7" V 5380 3050 50  0000 C CNN
F 1 "133k" V 5300 3050 50  0000 C CNN
F 2 "Resistor_SMD:R_0805_2012Metric" V 5230 3050 50  0001 C CNN
F 3 "" H 5300 3050 50  0001 C CNN
F 4 "CRCW0805133KFKEA" V 5300 3050 50  0001 C CNN "mfg#"
	1    5300 3050
	1    0    0    -1  
$EndComp
$Comp
L Device:R R8
U 1 1 5A25A70B
P 5300 3450
F 0 "R8" V 5380 3450 50  0000 C CNN
F 1 "24k" V 5300 3450 50  0000 C CNN
F 2 "Resistor_SMD:R_0805_2012Metric" V 5230 3450 50  0001 C CNN
F 3 "" H 5300 3450 50  0001 C CNN
F 4 "CRCW080524K0FKEA" V 5300 3450 50  0001 C CNN "mfg#"
	1    5300 3450
	1    0    0    -1  
$EndComp
Wire Wire Line
	5300 3200 5300 3300
Wire Wire Line
	5300 3600 5300 3700
Connection ~ 5300 2900
Connection ~ 3100 2900
$Comp
L Device:C C2
U 1 1 5A25A824
P 3100 3250
F 0 "C2" H 3125 3350 50  0000 L CNN
F 1 "1uF" H 3125 3150 50  0000 L CNN
F 2 "Capacitor_SMD:C_0805_2012Metric" H 3138 3100 50  0001 C CNN
F 3 "" H 3100 3250 50  0001 C CNN
	1    3100 3250
	1    0    0    -1  
$EndComp
$Comp
L Device:C C3
U 1 1 5A25A883
P 5500 3050
F 0 "C3" H 5525 3150 50  0000 L CNN
F 1 "1uF" H 5525 2950 50  0000 L CNN
F 2 "Capacitor_SMD:C_0805_2012Metric" H 5538 2900 50  0001 C CNN
F 3 "" H 5500 3050 50  0001 C CNN
	1    5500 3050
	1    0    0    -1  
$EndComp
$Comp
L power:GND #PWR048
U 1 1 5A25A8E0
P 3100 3500
F 0 "#PWR048" H 3100 3250 50  0001 C CNN
F 1 "GND" H 3100 3350 50  0000 C CNN
F 2 "" H 3100 3500 50  0001 C CNN
F 3 "" H 3100 3500 50  0001 C CNN
	1    3100 3500
	1    0    0    -1  
$EndComp
$Comp
L power:GND #PWR053
U 1 1 5A25A900
P 5500 3300
F 0 "#PWR053" H 5500 3050 50  0001 C CNN
F 1 "GND" H 5500 3150 50  0000 C CNN
F 2 "" H 5500 3300 50  0001 C CNN
F 3 "" H 5500 3300 50  0001 C CNN
	1    5500 3300
	1    0    0    -1  
$EndComp
Wire Wire Line
	5500 3300 5500 3200
Wire Wire Line
	3100 3500 3100 3400
$Comp
L power:GND #PWR049
U 1 1 5A25A96A
P 4550 3550
F 0 "#PWR049" H 4550 3300 50  0001 C CNN
F 1 "GND" H 4550 3400 50  0000 C CNN
F 2 "" H 4550 3550 50  0001 C CNN
F 3 "" H 4550 3550 50  0001 C CNN
	1    4550 3550
	1    0    0    -1  
$EndComp
Wire Wire Line
	4550 3450 4550 3550
$Comp
L power:+5V #PWR047
U 1 1 5A25A9A4
P 3100 2800
F 0 "#PWR047" H 3100 2650 50  0001 C CNN
F 1 "+5V" H 3100 2940 50  0000 C CNN
F 2 "" H 3100 2800 50  0001 C CNN
F 3 "" H 3100 2800 50  0001 C CNN
	1    3100 2800
	1    0    0    -1  
$EndComp
Wire Wire Line
	3100 2800 3100 2900
Wire Wire Line
	5300 3200 5050 3200
Connection ~ 5300 3200
$Comp
L power:+3V3 #PWR054
U 1 1 5B361189
P 5900 2900
F 0 "#PWR054" H 5900 2750 50  0001 C CNN
F 1 "+3V3" H 5900 3040 50  0000 C CNN
F 2 "" H 5900 2900 50  0001 C CNN
F 3 "" H 5900 2900 50  0001 C CNN
	1    5900 2900
	1    0    0    -1  
$EndComp
$Comp
L Device:LED D1
U 1 1 5B3F5161
P 1900 6500
F 0 "D1" H 1900 6600 50  0000 C CNN
F 1 "LED" H 1900 6400 50  0000 C CNN
F 2 "LED_SMD:LED_1206_3216Metric_Pad1.42x1.75mm_HandSolder" H 1900 6500 50  0001 C CNN
F 3 "" H 1900 6500 50  0001 C CNN
	1    1900 6500
	0    -1   -1   0   
$EndComp
$Comp
L Device:R R5
U 1 1 5B3F5168
P 1900 6100
F 0 "R5" V 1980 6100 50  0000 C CNN
F 1 "621" V 1900 6100 50  0000 C CNN
F 2 "Resistor_SMD:R_0805_2012Metric" V 1830 6100 50  0001 C CNN
F 3 "" H 1900 6100 50  0001 C CNN
	1    1900 6100
	1    0    0    -1  
$EndComp
Wire Wire Line
	1900 6350 1900 6250
Wire Wire Line
	1900 5950 1900 5850
Wire Wire Line
	1900 6650 1900 6750
$Comp
L power:GND #PWR046
U 1 1 5B3F5328
P 1900 6750
F 0 "#PWR046" H 1900 6500 50  0001 C CNN
F 1 "GND" H 1900 6600 50  0000 C CNN
F 2 "" H 1900 6750 50  0001 C CNN
F 3 "" H 1900 6750 50  0001 C CNN
	1    1900 6750
	1    0    0    -1  
$EndComp
$Comp
L power:+3V3 #PWR050
U 1 1 5B3FF164
P 4700 5500
F 0 "#PWR050" H 4700 5350 50  0001 C CNN
F 1 "+3V3" H 4700 5640 50  0000 C CNN
F 2 "" H 4700 5500 50  0001 C CNN
F 3 "" H 4700 5500 50  0001 C CNN
	1    4700 5500
	1    0    0    -1  
$EndComp
$Comp
L power:GND #PWR051
U 1 1 5B3FF1C9
P 5200 6150
F 0 "#PWR051" H 5200 5900 50  0001 C CNN
F 1 "GND" H 5200 6000 50  0000 C CNN
F 2 "" H 5200 6150 50  0001 C CNN
F 3 "" H 5200 6150 50  0001 C CNN
	1    5200 6150
	1    0    0    -1  
$EndComp
Wire Wire Line
	5050 2900 5300 2900
$Comp
L lbl_power:APD123 U11
U 1 1 5B40AFF4
P 4550 3350
F 0 "U11" H 4300 3350 60  0000 C CNN
F 1 "ADP123" H 4800 3350 60  0000 C CNN
F 2 "Package_TO_SOT_SMD:TSOT-23-5" H 4300 3350 60  0001 C CNN
F 3 "" H 4300 3350 60  0001 C CNN
F 4 "ADP123AUJZ-R7" H 4550 3350 50  0001 C CNN "mfg#"
	1    4550 3350
	1    0    0    -1  
$EndComp
Connection ~ 5500 2900
Wire Wire Line
	5300 2900 5500 2900
Wire Wire Line
	3100 2900 3100 3100
Wire Wire Line
	4700 5500 4700 5600
$Comp
L Connector_Generic:Conn_02x04_Odd_Even J3
U 1 1 5CA51694
P 4900 5700
F 0 "J3" H 4950 5900 50  0000 C CNN
F 1 "Conn_02x04_Odd_Even" H 4750 5400 50  0000 C CNN
F 2 "Connector_PinHeader_2.54mm:PinHeader_2x04_P2.54mm_Horizontal" H 4900 5700 50  0001 C CNN
F 3 "~" H 4900 5700 50  0001 C CNN
F 4 "15910080" H 4900 5700 50  0001 C CNN "mfg#"
	1    4900 5700
	1    0    0    -1  
$EndComp
Wire Wire Line
	5200 5900 5200 6150
Wire Wire Line
	4700 5600 4700 5700
Connection ~ 4700 5600
Connection ~ 4700 5700
Wire Wire Line
	4700 5700 4700 5800
Connection ~ 4700 5800
Wire Wire Line
	4700 5800 4700 5900
Wire Wire Line
	5200 5600 5200 5700
Connection ~ 5200 5900
Connection ~ 5200 5700
Wire Wire Line
	5200 5700 5200 5800
Connection ~ 5200 5800
Wire Wire Line
	5200 5800 5200 5900
$Comp
L power:PWR_FLAG #FLG02
U 1 1 5CFA17EA
P 6600 1050
F 0 "#FLG02" H 6600 1125 50  0001 C CNN
F 1 "PWR_FLAG" H 6600 1223 50  0000 C CNN
F 2 "" H 6600 1050 50  0001 C CNN
F 3 "~" H 6600 1050 50  0001 C CNN
	1    6600 1050
	1    0    0    -1  
$EndComp
$Comp
L power:GND #PWR055
U 1 1 5CFA1F64
P 6600 1150
F 0 "#PWR055" H 6600 900 50  0001 C CNN
F 1 "GND" H 6605 977 50  0000 C CNN
F 2 "" H 6600 1150 50  0001 C CNN
F 3 "" H 6600 1150 50  0001 C CNN
	1    6600 1150
	1    0    0    -1  
$EndComp
Wire Wire Line
	6600 1150 6600 1050
$Comp
L power:+3V3 #PWR045
U 1 1 5D364CA7
P 1900 5850
F 0 "#PWR045" H 1900 5700 50  0001 C CNN
F 1 "+3V3" H 1915 6023 50  0000 C CNN
F 2 "" H 1900 5850 50  0001 C CNN
F 3 "" H 1900 5850 50  0001 C CNN
	1    1900 5850
	1    0    0    -1  
$EndComp
$Comp
L Device:R R6
U 1 1 5FABCDD2
P 3925 3050
F 0 "R6" H 3995 3096 50  0000 L CNN
F 1 "10k" H 3995 3005 50  0000 L CNN
F 2 "Resistor_SMD:R_0805_2012Metric" V 3855 3050 50  0001 C CNN
F 3 "~" H 3925 3050 50  0001 C CNN
	1    3925 3050
	1    0    0    -1  
$EndComp
Connection ~ 3925 2900
Wire Wire Line
	3925 2900 4050 2900
Wire Wire Line
	3925 3200 4050 3200
Wire Wire Line
	5500 2900 5900 2900
$EndSCHEMATC
