%!PS-Adobe-3.0
%%Creator: PCBNEW
%%CreationDate: Thu Nov 19 13:35:55 2020
%%Title: /home/kkrizka/Dropbox/HEP/ITkStrips/PowerBoard/cmdmux/gerbers/cmdmux-NPTH-drl_map.ps
%%Pages: 1
%%PageOrder: Ascend
%%BoundingBox: 0 0 596 842
%%DocumentMedia: A4 595 842 0 () ()
%%Orientation: Landscape
%%EndComments
%%BeginProlog
/line { newpath moveto lineto stroke } bind def
/cir0 { newpath 0 360 arc stroke } bind def
/cir1 { newpath 0 360 arc gsave fill grestore stroke } bind def
/cir2 { newpath 0 360 arc gsave fill grestore stroke } bind def
/arc0 { newpath arc stroke } bind def
/arc1 { newpath 4 index 4 index moveto arc closepath gsave fill
    grestore stroke } bind def
/arc2 { newpath 4 index 4 index moveto arc closepath gsave fill
    grestore stroke } bind def
/poly0 { stroke } bind def
/poly1 { closepath gsave fill grestore stroke } bind def
/poly2 { closepath gsave fill grestore stroke } bind def
/rect0 { rectstroke } bind def
/rect1 { rectfill } bind def
/rect2 { rectfill } bind def
/linemode0 { 0 setlinecap 0 setlinejoin 0 setlinewidth } bind def
/linemode1 { 1 setlinecap 1 setlinejoin } bind def
/dashedline { [200] 100 setdash } bind def
/solidline { [] 0 setdash } bind def
/phantomshow { moveto
    /KicadFont findfont 0.000001 scalefont setfont
    show } bind def
/textshow { gsave
    findfont exch scalefont setfont concat 1 scale 0 0 moveto show
    } bind def
/reencodefont {
  findfont dup length dict begin
  { 1 index /FID ne
    { def }
    { pop pop } ifelse
  } forall
  /Encoding ISOLatin1Encoding def
  currentdict
  end } bind def
/KicadFont /Helvetica reencodefont definefont pop
/KicadFont-Bold /Helvetica-Bold reencodefont definefont pop
/KicadFont-Oblique /Helvetica-Oblique reencodefont definefont pop
/KicadFont-BoldOblique /Helvetica-BoldOblique reencodefont definefont pop
%%EndProlog
%%Page: 1 1
%%BeginPageSetup
gsave
0.0072 0.0072 scale
linemode1
82680 0 translate 90 rotate
92.4994 setlinewidth
%%EndPageSetup
0 0 0 setrgbcolor
109.251 setlinewidth
newpath
30715.2 78688.4 moveto
86214.8 78688.4 lineto
stroke
0 0 0 setrgbcolor
newpath
30715.2 37063.6 moveto
30715.2 78688.4 lineto
stroke
0 0 0 setrgbcolor
newpath
86214.8 37063.6 moveto
30715.2 37063.6 lineto
stroke
0 0 0 setrgbcolor
newpath
86214.8 78688.4 moveto
86214.8 37063.6 lineto
stroke
78.7396 setlinewidth
newpath
32827.4 74350.1 moveto
33410 73767.4 lineto
stroke
newpath
33410 74350.1 moveto
32827.4 73767.4 lineto
stroke
newpath
32827.4 41975.3 moveto
33410 41392.6 lineto
stroke
newpath
33410 41975.3 moveto
32827.4 41392.6 lineto
stroke
65311.4 74058.8 437.005 cir0
65311.4 41684 437.005 cir0
newpath
14990.3 77069.6 moveto
14990.3 74757.1 lineto
stroke
newpath
13834 75913.4 moveto
16146.5 75913.4 lineto
stroke
newpath
14990.3 40994.9 moveto
14990.3 38682.4 lineto
stroke
newpath
13834 39838.6 moveto
16146.5 39838.6 lineto
stroke
newpath
83439.8 77069.6 moveto
83439.8 74757.1 lineto
stroke
newpath
82283.6 75913.4 moveto
84596.1 75913.4 lineto
stroke
newpath
83439.8 40994.9 moveto
83439.8 38682.4 lineto
stroke
newpath
82283.6 39838.6 moveto
84596.1 39838.6 lineto
stroke
118.11 setlinewidth
0 0 0 setrgbcolor
0 0 0 setrgbcolor
newpath
31788.2 35175.5 moveto
31788.2 36356.6 lineto
32069.4 36356.6 lineto
32238.2 36300.3 lineto
32350.7 36187.9 lineto
32406.9 36075.4 lineto
32463.1 35850.4 lineto
32463.1 35681.7 lineto
32406.9 35456.7 lineto
32350.7 35344.2 lineto
32238.2 35231.7 lineto
32069.4 35175.5 lineto
31788.2 35175.5 lineto
stroke
newpath
32969.3 35175.5 moveto
32969.3 35962.9 lineto
stroke
newpath
32969.3 35737.9 moveto
33025.6 35850.4 lineto
33081.8 35906.6 lineto
33194.3 35962.9 lineto
33306.8 35962.9 lineto
stroke
newpath
33700.5 35175.5 moveto
33700.5 35962.9 lineto
stroke
newpath
33700.5 36356.6 moveto
33644.2 36300.3 lineto
33700.5 36244.1 lineto
33756.7 36300.3 lineto
33700.5 36356.6 lineto
33700.5 36244.1 lineto
stroke
newpath
34431.6 35175.5 moveto
34319.2 35231.7 lineto
34262.9 35344.2 lineto
34262.9 36356.6 lineto
stroke
newpath
35050.3 35175.5 moveto
34937.8 35231.7 lineto
34881.6 35344.2 lineto
34881.6 36356.6 lineto
stroke
newpath
36400.1 35175.5 moveto
36400.1 36356.6 lineto
36793.8 35512.9 lineto
37187.5 36356.6 lineto
37187.5 35175.5 lineto
stroke
newpath
38256.2 35175.5 moveto
38256.2 35794.2 lineto
38199.9 35906.6 lineto
38087.4 35962.9 lineto
37862.5 35962.9 lineto
37750 35906.6 lineto
stroke
newpath
38256.2 35231.7 moveto
38143.7 35175.5 lineto
37862.5 35175.5 lineto
37750 35231.7 lineto
37693.7 35344.2 lineto
37693.7 35456.7 lineto
37750 35569.2 lineto
37862.5 35625.4 lineto
38143.7 35625.4 lineto
38256.2 35681.7 lineto
stroke
newpath
38818.6 35962.9 moveto
38818.6 34781.8 lineto
stroke
newpath
38818.6 35906.6 moveto
38931.1 35962.9 lineto
39156.1 35962.9 lineto
39268.5 35906.6 lineto
39324.8 35850.4 lineto
39381 35737.9 lineto
39381 35400.5 lineto
39324.8 35288 lineto
39268.5 35231.7 lineto
39156.1 35175.5 lineto
38931.1 35175.5 lineto
38818.6 35231.7 lineto
stroke
newpath
39887.2 35288 moveto
39943.5 35231.7 lineto
39887.2 35175.5 lineto
39831 35231.7 lineto
39887.2 35288 lineto
39887.2 35175.5 lineto
stroke
newpath
39887.2 35906.6 moveto
39943.5 35850.4 lineto
39887.2 35794.2 lineto
39831 35850.4 lineto
39887.2 35906.6 lineto
39887.2 35794.2 lineto
stroke
newpath
30077.9 33520.8 moveto
30660.6 32938.1 lineto
stroke
newpath
30660.6 33520.8 moveto
30077.9 32938.1 lineto
stroke
0 0 0 setrgbcolor
0 0 0 setrgbcolor
newpath
32013.2 33876.3 moveto
32125.7 33876.3 lineto
32238.2 33820 lineto
32294.4 33763.8 lineto
32350.7 33651.3 lineto
32406.9 33426.3 lineto
32406.9 33145.1 lineto
32350.7 32920.1 lineto
32294.4 32807.7 lineto
32238.2 32751.4 lineto
32125.7 32695.2 lineto
32013.2 32695.2 lineto
31900.7 32751.4 lineto
31844.5 32807.7 lineto
31788.2 32920.1 lineto
31732 33145.1 lineto
31732 33426.3 lineto
31788.2 33651.3 lineto
31844.5 33763.8 lineto
31900.7 33820 lineto
32013.2 33876.3 lineto
stroke
newpath
32913.1 32807.7 moveto
32969.3 32751.4 lineto
32913.1 32695.2 lineto
32856.8 32751.4 lineto
32913.1 32807.7 lineto
32913.1 32695.2 lineto
stroke
newpath
33644.2 33370.1 moveto
33531.8 33426.3 lineto
33475.5 33482.6 lineto
33419.3 33595.1 lineto
33419.3 33651.3 lineto
33475.5 33763.8 lineto
33531.8 33820 lineto
33644.2 33876.3 lineto
33869.2 33876.3 lineto
33981.7 33820 lineto
34037.9 33763.8 lineto
34094.2 33651.3 lineto
34094.2 33595.1 lineto
34037.9 33482.6 lineto
33981.7 33426.3 lineto
33869.2 33370.1 lineto
33644.2 33370.1 lineto
33531.8 33313.8 lineto
33475.5 33257.6 lineto
33419.3 33145.1 lineto
33419.3 32920.1 lineto
33475.5 32807.7 lineto
33531.8 32751.4 lineto
33644.2 32695.2 lineto
33869.2 32695.2 lineto
33981.7 32751.4 lineto
34037.9 32807.7 lineto
34094.2 32920.1 lineto
34094.2 33145.1 lineto
34037.9 33257.6 lineto
33981.7 33313.8 lineto
33869.2 33370.1 lineto
stroke
newpath
34825.3 33876.3 moveto
34937.8 33876.3 lineto
35050.3 33820 lineto
35106.6 33763.8 lineto
35162.8 33651.3 lineto
35219 33426.3 lineto
35219 33145.1 lineto
35162.8 32920.1 lineto
35106.6 32807.7 lineto
35050.3 32751.4 lineto
34937.8 32695.2 lineto
34825.3 32695.2 lineto
34712.9 32751.4 lineto
34656.6 32807.7 lineto
34600.4 32920.1 lineto
34544.1 33145.1 lineto
34544.1 33426.3 lineto
34600.4 33651.3 lineto
34656.6 33763.8 lineto
34712.9 33820 lineto
34825.3 33876.3 lineto
stroke
newpath
35725.2 32695.2 moveto
35725.2 33482.6 lineto
stroke
newpath
35725.2 33370.1 moveto
35781.5 33426.3 lineto
35894 33482.6 lineto
36062.7 33482.6 lineto
36175.2 33426.3 lineto
36231.4 33313.8 lineto
36231.4 32695.2 lineto
stroke
newpath
36231.4 33313.8 moveto
36287.7 33426.3 lineto
36400.1 33482.6 lineto
36568.9 33482.6 lineto
36681.4 33426.3 lineto
36737.6 33313.8 lineto
36737.6 32695.2 lineto
stroke
newpath
37300 32695.2 moveto
37300 33482.6 lineto
stroke
newpath
37300 33370.1 moveto
37356.3 33426.3 lineto
37468.8 33482.6 lineto
37637.5 33482.6 lineto
37750 33426.3 lineto
37806.2 33313.8 lineto
37806.2 32695.2 lineto
stroke
newpath
37806.2 33313.8 moveto
37862.5 33426.3 lineto
37975 33482.6 lineto
38143.7 33482.6 lineto
38256.2 33426.3 lineto
38312.4 33313.8 lineto
38312.4 32695.2 lineto
stroke
newpath
40618.4 33932.5 moveto
39606 32414 lineto
stroke
newpath
42136.9 33876.3 moveto
42249.4 33876.3 lineto
42361.9 33820 lineto
42418.1 33763.8 lineto
42474.4 33651.3 lineto
42530.6 33426.3 lineto
42530.6 33145.1 lineto
42474.4 32920.1 lineto
42418.1 32807.7 lineto
42361.9 32751.4 lineto
42249.4 32695.2 lineto
42136.9 32695.2 lineto
42024.4 32751.4 lineto
41968.2 32807.7 lineto
41912 32920.1 lineto
41855.7 33145.1 lineto
41855.7 33426.3 lineto
41912 33651.3 lineto
41968.2 33763.8 lineto
42024.4 33820 lineto
42136.9 33876.3 lineto
stroke
newpath
43036.8 32807.7 moveto
43093.1 32751.4 lineto
43036.8 32695.2 lineto
42980.6 32751.4 lineto
43036.8 32807.7 lineto
43036.8 32695.2 lineto
stroke
newpath
43824.2 33876.3 moveto
43936.7 33876.3 lineto
44049.2 33820 lineto
44105.4 33763.8 lineto
44161.7 33651.3 lineto
44217.9 33426.3 lineto
44217.9 33145.1 lineto
44161.7 32920.1 lineto
44105.4 32807.7 lineto
44049.2 32751.4 lineto
43936.7 32695.2 lineto
43824.2 32695.2 lineto
43711.7 32751.4 lineto
43655.5 32807.7 lineto
43599.2 32920.1 lineto
43543 33145.1 lineto
43543 33426.3 lineto
43599.2 33651.3 lineto
43655.5 33763.8 lineto
43711.7 33820 lineto
43824.2 33876.3 lineto
stroke
newpath
44611.6 33876.3 moveto
45342.8 33876.3 lineto
44949.1 33426.3 lineto
45117.8 33426.3 lineto
45230.3 33370.1 lineto
45286.5 33313.8 lineto
45342.8 33201.4 lineto
45342.8 32920.1 lineto
45286.5 32807.7 lineto
45230.3 32751.4 lineto
45117.8 32695.2 lineto
44780.3 32695.2 lineto
44667.9 32751.4 lineto
44611.6 32807.7 lineto
stroke
newpath
46467.6 32695.2 moveto
45792.7 32695.2 lineto
stroke
newpath
46130.2 32695.2 moveto
46130.2 33876.3 lineto
46017.7 33707.5 lineto
45905.2 33595.1 lineto
45792.7 33538.8 lineto
stroke
newpath
46917.6 33876.3 moveto
46917.6 33651.3 lineto
stroke
newpath
47367.5 33876.3 moveto
47367.5 33651.3 lineto
stroke
newpath
49111.1 32245.2 moveto
49054.8 32301.5 lineto
48942.3 32470.2 lineto
48886.1 32582.7 lineto
48829.8 32751.4 lineto
48773.6 33032.6 lineto
48773.6 33257.6 lineto
48829.8 33538.8 lineto
48886.1 33707.5 lineto
48942.3 33820 lineto
49054.8 33988.8 lineto
49111.1 34045 lineto
stroke
newpath
49504.8 33763.8 moveto
49561 33820 lineto
49673.5 33876.3 lineto
49954.7 33876.3 lineto
50067.2 33820 lineto
50123.4 33763.8 lineto
50179.7 33651.3 lineto
50179.7 33538.8 lineto
50123.4 33370.1 lineto
49448.5 32695.2 lineto
50179.7 32695.2 lineto
stroke
newpath
51585.7 32695.2 moveto
51585.7 33876.3 lineto
stroke
newpath
52091.9 32695.2 moveto
52091.9 33313.8 lineto
52035.7 33426.3 lineto
51923.2 33482.6 lineto
51754.5 33482.6 lineto
51642 33426.3 lineto
51585.7 33370.1 lineto
stroke
newpath
52823.1 32695.2 moveto
52710.6 32751.4 lineto
52654.4 32807.7 lineto
52598.1 32920.1 lineto
52598.1 33257.6 lineto
52654.4 33370.1 lineto
52710.6 33426.3 lineto
52823.1 33482.6 lineto
52991.8 33482.6 lineto
53104.3 33426.3 lineto
53160.6 33370.1 lineto
53216.8 33257.6 lineto
53216.8 32920.1 lineto
53160.6 32807.7 lineto
53104.3 32751.4 lineto
52991.8 32695.2 lineto
52823.1 32695.2 lineto
stroke
newpath
53891.7 32695.2 moveto
53779.2 32751.4 lineto
53723 32863.9 lineto
53723 33876.3 lineto
stroke
newpath
54791.6 32751.4 moveto
54679.1 32695.2 lineto
54454.1 32695.2 lineto
54341.7 32751.4 lineto
54285.4 32863.9 lineto
54285.4 33313.8 lineto
54341.7 33426.3 lineto
54454.1 33482.6 lineto
54679.1 33482.6 lineto
54791.6 33426.3 lineto
54847.8 33313.8 lineto
54847.8 33201.4 lineto
54285.4 33088.9 lineto
stroke
newpath
55297.8 32751.4 moveto
55410.3 32695.2 lineto
55635.2 32695.2 lineto
55747.7 32751.4 lineto
55804 32863.9 lineto
55804 32920.1 lineto
55747.7 33032.6 lineto
55635.2 33088.9 lineto
55466.5 33088.9 lineto
55354 33145.1 lineto
55297.8 33257.6 lineto
55297.8 33313.8 lineto
55354 33426.3 lineto
55466.5 33482.6 lineto
55635.2 33482.6 lineto
55747.7 33426.3 lineto
stroke
newpath
56197.7 32245.2 moveto
56253.9 32301.5 lineto
56366.4 32470.2 lineto
56422.6 32582.7 lineto
56478.9 32751.4 lineto
56535.1 33032.6 lineto
56535.1 33257.6 lineto
56478.9 33538.8 lineto
56422.6 33707.5 lineto
56366.4 33820 lineto
56253.9 33988.8 lineto
56197.7 34045 lineto
stroke
newpath
58334.9 32245.2 moveto
58278.7 32301.5 lineto
58166.2 32470.2 lineto
58109.9 32582.7 lineto
58053.7 32751.4 lineto
57997.4 33032.6 lineto
57997.4 33257.6 lineto
58053.7 33538.8 lineto
58109.9 33707.5 lineto
58166.2 33820 lineto
58278.7 33988.8 lineto
58334.9 34045 lineto
stroke
newpath
58784.8 33482.6 moveto
58784.8 32695.2 lineto
stroke
newpath
58784.8 33370.1 moveto
58841.1 33426.3 lineto
58953.6 33482.6 lineto
59122.3 33482.6 lineto
59234.8 33426.3 lineto
59291 33313.8 lineto
59291 32695.2 lineto
stroke
newpath
60022.2 32695.2 moveto
59909.7 32751.4 lineto
59853.5 32807.7 lineto
59797.2 32920.1 lineto
59797.2 33257.6 lineto
59853.5 33370.1 lineto
59909.7 33426.3 lineto
60022.2 33482.6 lineto
60190.9 33482.6 lineto
60303.4 33426.3 lineto
60359.7 33370.1 lineto
60415.9 33257.6 lineto
60415.9 32920.1 lineto
60359.7 32807.7 lineto
60303.4 32751.4 lineto
60190.9 32695.2 lineto
60022.2 32695.2 lineto
stroke
newpath
60753.4 33482.6 moveto
61203.3 33482.6 lineto
stroke
newpath
60922.1 33876.3 moveto
60922.1 32863.9 lineto
60978.3 32751.4 lineto
61090.8 32695.2 lineto
61203.3 32695.2 lineto
stroke
newpath
62496.9 33482.6 moveto
62496.9 32301.5 lineto
stroke
newpath
62496.9 33426.3 moveto
62609.4 33482.6 lineto
62834.3 33482.6 lineto
62946.8 33426.3 lineto
63003.1 33370.1 lineto
63059.3 33257.6 lineto
63059.3 32920.1 lineto
63003.1 32807.7 lineto
62946.8 32751.4 lineto
62834.3 32695.2 lineto
62609.4 32695.2 lineto
62496.9 32751.4 lineto
stroke
newpath
63734.2 32695.2 moveto
63621.7 32751.4 lineto
63565.5 32863.9 lineto
63565.5 33876.3 lineto
stroke
newpath
64690.4 32695.2 moveto
64690.4 33313.8 lineto
64634.1 33426.3 lineto
64521.6 33482.6 lineto
64296.7 33482.6 lineto
64184.2 33426.3 lineto
stroke
newpath
64690.4 32751.4 moveto
64577.9 32695.2 lineto
64296.7 32695.2 lineto
64184.2 32751.4 lineto
64127.9 32863.9 lineto
64127.9 32976.4 lineto
64184.2 33088.9 lineto
64296.7 33145.1 lineto
64577.9 33145.1 lineto
64690.4 33201.4 lineto
stroke
newpath
65084.1 33482.6 moveto
65534 33482.6 lineto
stroke
newpath
65252.8 33876.3 moveto
65252.8 32863.9 lineto
65309 32751.4 lineto
65421.5 32695.2 lineto
65534 32695.2 lineto
stroke
newpath
66377.6 32751.4 moveto
66265.2 32695.2 lineto
66040.2 32695.2 lineto
65927.7 32751.4 lineto
65871.5 32863.9 lineto
65871.5 33313.8 lineto
65927.7 33426.3 lineto
66040.2 33482.6 lineto
66265.2 33482.6 lineto
66377.6 33426.3 lineto
66433.9 33313.8 lineto
66433.9 33201.4 lineto
65871.5 33088.9 lineto
stroke
newpath
67446.3 32695.2 moveto
67446.3 33876.3 lineto
stroke
newpath
67446.3 32751.4 moveto
67333.8 32695.2 lineto
67108.8 32695.2 lineto
66996.3 32751.4 lineto
66940.1 32807.7 lineto
66883.8 32920.1 lineto
66883.8 33257.6 lineto
66940.1 33370.1 lineto
66996.3 33426.3 lineto
67108.8 33482.6 lineto
67333.8 33482.6 lineto
67446.3 33426.3 lineto
stroke
newpath
67896.2 32245.2 moveto
67952.5 32301.5 lineto
68064.9 32470.2 lineto
68121.2 32582.7 lineto
68177.4 32751.4 lineto
68233.7 33032.6 lineto
68233.7 33257.6 lineto
68177.4 33538.8 lineto
68121.2 33707.5 lineto
68064.9 33820 lineto
67952.5 33988.8 lineto
67896.2 34045 lineto
stroke
30223.5 31670.4 437.005 cir0
0 0 0 setrgbcolor
0 0 0 setrgbcolor
newpath
32406.9 31136.1 moveto
31732 31136.1 lineto
stroke
newpath
32069.4 31136.1 moveto
32069.4 32317.2 lineto
31957 32148.5 lineto
31844.5 32036 lineto
31732 31979.8 lineto
stroke
newpath
32913.1 31248.6 moveto
32969.3 31192.4 lineto
32913.1 31136.1 lineto
32856.8 31192.4 lineto
32913.1 31248.6 lineto
32913.1 31136.1 lineto
stroke
newpath
33419.3 32204.7 moveto
33475.5 32261 lineto
33588 32317.2 lineto
33869.2 32317.2 lineto
33981.7 32261 lineto
34037.9 32204.7 lineto
34094.2 32092.2 lineto
34094.2 31979.8 lineto
34037.9 31811 lineto
33363 31136.1 lineto
34094.2 31136.1 lineto
stroke
newpath
34825.3 32317.2 moveto
34937.8 32317.2 lineto
35050.3 32261 lineto
35106.6 32204.7 lineto
35162.8 32092.2 lineto
35219 31867.3 lineto
35219 31586.1 lineto
35162.8 31361.1 lineto
35106.6 31248.6 lineto
35050.3 31192.4 lineto
34937.8 31136.1 lineto
34825.3 31136.1 lineto
34712.9 31192.4 lineto
34656.6 31248.6 lineto
34600.4 31361.1 lineto
34544.1 31586.1 lineto
34544.1 31867.3 lineto
34600.4 32092.2 lineto
34656.6 32204.7 lineto
34712.9 32261 lineto
34825.3 32317.2 lineto
stroke
newpath
35725.2 31136.1 moveto
35725.2 31923.5 lineto
stroke
newpath
35725.2 31811 moveto
35781.5 31867.3 lineto
35894 31923.5 lineto
36062.7 31923.5 lineto
36175.2 31867.3 lineto
36231.4 31754.8 lineto
36231.4 31136.1 lineto
stroke
newpath
36231.4 31754.8 moveto
36287.7 31867.3 lineto
36400.1 31923.5 lineto
36568.9 31923.5 lineto
36681.4 31867.3 lineto
36737.6 31754.8 lineto
36737.6 31136.1 lineto
stroke
newpath
37300 31136.1 moveto
37300 31923.5 lineto
stroke
newpath
37300 31811 moveto
37356.3 31867.3 lineto
37468.8 31923.5 lineto
37637.5 31923.5 lineto
37750 31867.3 lineto
37806.2 31754.8 lineto
37806.2 31136.1 lineto
stroke
newpath
37806.2 31754.8 moveto
37862.5 31867.3 lineto
37975 31923.5 lineto
38143.7 31923.5 lineto
38256.2 31867.3 lineto
38312.4 31754.8 lineto
38312.4 31136.1 lineto
stroke
newpath
40618.4 32373.5 moveto
39606 30854.9 lineto
stroke
newpath
42136.9 32317.2 moveto
42249.4 32317.2 lineto
42361.9 32261 lineto
42418.1 32204.7 lineto
42474.4 32092.2 lineto
42530.6 31867.3 lineto
42530.6 31586.1 lineto
42474.4 31361.1 lineto
42418.1 31248.6 lineto
42361.9 31192.4 lineto
42249.4 31136.1 lineto
42136.9 31136.1 lineto
42024.4 31192.4 lineto
41968.2 31248.6 lineto
41912 31361.1 lineto
41855.7 31586.1 lineto
41855.7 31867.3 lineto
41912 32092.2 lineto
41968.2 32204.7 lineto
42024.4 32261 lineto
42136.9 32317.2 lineto
stroke
newpath
43036.8 31248.6 moveto
43093.1 31192.4 lineto
43036.8 31136.1 lineto
42980.6 31192.4 lineto
43036.8 31248.6 lineto
43036.8 31136.1 lineto
stroke
newpath
43824.2 32317.2 moveto
43936.7 32317.2 lineto
44049.2 32261 lineto
44105.4 32204.7 lineto
44161.7 32092.2 lineto
44217.9 31867.3 lineto
44217.9 31586.1 lineto
44161.7 31361.1 lineto
44105.4 31248.6 lineto
44049.2 31192.4 lineto
43936.7 31136.1 lineto
43824.2 31136.1 lineto
43711.7 31192.4 lineto
43655.5 31248.6 lineto
43599.2 31361.1 lineto
43543 31586.1 lineto
43543 31867.3 lineto
43599.2 32092.2 lineto
43655.5 32204.7 lineto
43711.7 32261 lineto
43824.2 32317.2 lineto
stroke
newpath
45230.3 31923.5 moveto
45230.3 31136.1 lineto
stroke
newpath
44949.1 32373.5 moveto
44667.9 31529.8 lineto
45399 31529.8 lineto
stroke
newpath
45736.5 32317.2 moveto
46523.9 32317.2 lineto
46017.7 31136.1 lineto
stroke
newpath
46917.6 32317.2 moveto
46917.6 32092.2 lineto
stroke
newpath
47367.5 32317.2 moveto
47367.5 32092.2 lineto
stroke
newpath
49111.1 30686.2 moveto
49054.8 30742.4 lineto
48942.3 30911.1 lineto
48886.1 31023.6 lineto
48829.8 31192.4 lineto
48773.6 31473.6 lineto
48773.6 31698.5 lineto
48829.8 31979.8 lineto
48886.1 32148.5 lineto
48942.3 32261 lineto
49054.8 32429.7 lineto
49111.1 32485.9 lineto
stroke
newpath
49504.8 32204.7 moveto
49561 32261 lineto
49673.5 32317.2 lineto
49954.7 32317.2 lineto
50067.2 32261 lineto
50123.4 32204.7 lineto
50179.7 32092.2 lineto
50179.7 31979.8 lineto
50123.4 31811 lineto
49448.5 31136.1 lineto
50179.7 31136.1 lineto
stroke
newpath
51585.7 31136.1 moveto
51585.7 32317.2 lineto
stroke
newpath
52091.9 31136.1 moveto
52091.9 31754.8 lineto
52035.7 31867.3 lineto
51923.2 31923.5 lineto
51754.5 31923.5 lineto
51642 31867.3 lineto
51585.7 31811 lineto
stroke
newpath
52823.1 31136.1 moveto
52710.6 31192.4 lineto
52654.4 31248.6 lineto
52598.1 31361.1 lineto
52598.1 31698.5 lineto
52654.4 31811 lineto
52710.6 31867.3 lineto
52823.1 31923.5 lineto
52991.8 31923.5 lineto
53104.3 31867.3 lineto
53160.6 31811 lineto
53216.8 31698.5 lineto
53216.8 31361.1 lineto
53160.6 31248.6 lineto
53104.3 31192.4 lineto
52991.8 31136.1 lineto
52823.1 31136.1 lineto
stroke
newpath
53891.7 31136.1 moveto
53779.2 31192.4 lineto
53723 31304.8 lineto
53723 32317.2 lineto
stroke
newpath
54791.6 31192.4 moveto
54679.1 31136.1 lineto
54454.1 31136.1 lineto
54341.7 31192.4 lineto
54285.4 31304.8 lineto
54285.4 31754.8 lineto
54341.7 31867.3 lineto
54454.1 31923.5 lineto
54679.1 31923.5 lineto
54791.6 31867.3 lineto
54847.8 31754.8 lineto
54847.8 31642.3 lineto
54285.4 31529.8 lineto
stroke
newpath
55297.8 31192.4 moveto
55410.3 31136.1 lineto
55635.2 31136.1 lineto
55747.7 31192.4 lineto
55804 31304.8 lineto
55804 31361.1 lineto
55747.7 31473.6 lineto
55635.2 31529.8 lineto
55466.5 31529.8 lineto
55354 31586.1 lineto
55297.8 31698.5 lineto
55297.8 31754.8 lineto
55354 31867.3 lineto
55466.5 31923.5 lineto
55635.2 31923.5 lineto
55747.7 31867.3 lineto
stroke
newpath
56197.7 30686.2 moveto
56253.9 30742.4 lineto
56366.4 30911.1 lineto
56422.6 31023.6 lineto
56478.9 31192.4 lineto
56535.1 31473.6 lineto
56535.1 31698.5 lineto
56478.9 31979.8 lineto
56422.6 32148.5 lineto
56366.4 32261 lineto
56253.9 32429.7 lineto
56197.7 32485.9 lineto
stroke
newpath
58334.9 30686.2 moveto
58278.7 30742.4 lineto
58166.2 30911.1 lineto
58109.9 31023.6 lineto
58053.7 31192.4 lineto
57997.4 31473.6 lineto
57997.4 31698.5 lineto
58053.7 31979.8 lineto
58109.9 32148.5 lineto
58166.2 32261 lineto
58278.7 32429.7 lineto
58334.9 32485.9 lineto
stroke
newpath
58784.8 31923.5 moveto
58784.8 31136.1 lineto
stroke
newpath
58784.8 31811 moveto
58841.1 31867.3 lineto
58953.6 31923.5 lineto
59122.3 31923.5 lineto
59234.8 31867.3 lineto
59291 31754.8 lineto
59291 31136.1 lineto
stroke
newpath
60022.2 31136.1 moveto
59909.7 31192.4 lineto
59853.5 31248.6 lineto
59797.2 31361.1 lineto
59797.2 31698.5 lineto
59853.5 31811 lineto
59909.7 31867.3 lineto
60022.2 31923.5 lineto
60190.9 31923.5 lineto
60303.4 31867.3 lineto
60359.7 31811 lineto
60415.9 31698.5 lineto
60415.9 31361.1 lineto
60359.7 31248.6 lineto
60303.4 31192.4 lineto
60190.9 31136.1 lineto
60022.2 31136.1 lineto
stroke
newpath
60753.4 31923.5 moveto
61203.3 31923.5 lineto
stroke
newpath
60922.1 32317.2 moveto
60922.1 31304.8 lineto
60978.3 31192.4 lineto
61090.8 31136.1 lineto
61203.3 31136.1 lineto
stroke
newpath
62496.9 31923.5 moveto
62496.9 30742.4 lineto
stroke
newpath
62496.9 31867.3 moveto
62609.4 31923.5 lineto
62834.3 31923.5 lineto
62946.8 31867.3 lineto
63003.1 31811 lineto
63059.3 31698.5 lineto
63059.3 31361.1 lineto
63003.1 31248.6 lineto
62946.8 31192.4 lineto
62834.3 31136.1 lineto
62609.4 31136.1 lineto
62496.9 31192.4 lineto
stroke
newpath
63734.2 31136.1 moveto
63621.7 31192.4 lineto
63565.5 31304.8 lineto
63565.5 32317.2 lineto
stroke
newpath
64690.4 31136.1 moveto
64690.4 31754.8 lineto
64634.1 31867.3 lineto
64521.6 31923.5 lineto
64296.7 31923.5 lineto
64184.2 31867.3 lineto
stroke
newpath
64690.4 31192.4 moveto
64577.9 31136.1 lineto
64296.7 31136.1 lineto
64184.2 31192.4 lineto
64127.9 31304.8 lineto
64127.9 31417.3 lineto
64184.2 31529.8 lineto
64296.7 31586.1 lineto
64577.9 31586.1 lineto
64690.4 31642.3 lineto
stroke
newpath
65084.1 31923.5 moveto
65534 31923.5 lineto
stroke
newpath
65252.8 32317.2 moveto
65252.8 31304.8 lineto
65309 31192.4 lineto
65421.5 31136.1 lineto
65534 31136.1 lineto
stroke
newpath
66377.6 31192.4 moveto
66265.2 31136.1 lineto
66040.2 31136.1 lineto
65927.7 31192.4 lineto
65871.5 31304.8 lineto
65871.5 31754.8 lineto
65927.7 31867.3 lineto
66040.2 31923.5 lineto
66265.2 31923.5 lineto
66377.6 31867.3 lineto
66433.9 31754.8 lineto
66433.9 31642.3 lineto
65871.5 31529.8 lineto
stroke
newpath
67446.3 31136.1 moveto
67446.3 32317.2 lineto
stroke
newpath
67446.3 31192.4 moveto
67333.8 31136.1 lineto
67108.8 31136.1 lineto
66996.3 31192.4 lineto
66940.1 31248.6 lineto
66883.8 31361.1 lineto
66883.8 31698.5 lineto
66940.1 31811 lineto
66996.3 31867.3 lineto
67108.8 31923.5 lineto
67333.8 31923.5 lineto
67446.3 31867.3 lineto
stroke
newpath
67896.2 30686.2 moveto
67952.5 30742.4 lineto
68064.9 30911.1 lineto
68121.2 31023.6 lineto
68177.4 31192.4 lineto
68233.7 31473.6 lineto
68233.7 31698.5 lineto
68177.4 31979.8 lineto
68121.2 32148.5 lineto
68064.9 32261 lineto
67952.5 32429.7 lineto
67896.2 32485.9 lineto
stroke
newpath
29504.3 31267.6 moveto
29504.3 28955.1 lineto
stroke
newpath
28348.1 30111.4 moveto
30660.6 30111.4 lineto
stroke
0 0 0 setrgbcolor
0 0 0 setrgbcolor
newpath
31675.7 30758.2 moveto
32406.9 30758.2 lineto
32013.2 30308.2 lineto
32181.9 30308.2 lineto
32294.4 30252 lineto
32350.7 30195.7 lineto
32406.9 30083.2 lineto
32406.9 29802 lineto
32350.7 29689.5 lineto
32294.4 29633.3 lineto
32181.9 29577.1 lineto
31844.5 29577.1 lineto
31732 29633.3 lineto
31675.7 29689.5 lineto
stroke
newpath
32913.1 29689.5 moveto
32969.3 29633.3 lineto
32913.1 29577.1 lineto
32856.8 29633.3 lineto
32913.1 29689.5 lineto
32913.1 29577.1 lineto
stroke
newpath
34094.2 29577.1 moveto
33419.3 29577.1 lineto
stroke
newpath
33756.7 29577.1 moveto
33756.7 30758.2 lineto
33644.2 30589.4 lineto
33531.8 30477 lineto
33419.3 30420.7 lineto
stroke
newpath
34487.9 30758.2 moveto
35275.3 30758.2 lineto
34769.1 29577.1 lineto
stroke
newpath
35725.2 29577.1 moveto
35725.2 30364.5 lineto
stroke
newpath
35725.2 30252 moveto
35781.5 30308.2 lineto
35894 30364.5 lineto
36062.7 30364.5 lineto
36175.2 30308.2 lineto
36231.4 30195.7 lineto
36231.4 29577.1 lineto
stroke
newpath
36231.4 30195.7 moveto
36287.7 30308.2 lineto
36400.1 30364.5 lineto
36568.9 30364.5 lineto
36681.4 30308.2 lineto
36737.6 30195.7 lineto
36737.6 29577.1 lineto
stroke
newpath
37300 29577.1 moveto
37300 30364.5 lineto
stroke
newpath
37300 30252 moveto
37356.3 30308.2 lineto
37468.8 30364.5 lineto
37637.5 30364.5 lineto
37750 30308.2 lineto
37806.2 30195.7 lineto
37806.2 29577.1 lineto
stroke
newpath
37806.2 30195.7 moveto
37862.5 30308.2 lineto
37975 30364.5 lineto
38143.7 30364.5 lineto
38256.2 30308.2 lineto
38312.4 30195.7 lineto
38312.4 29577.1 lineto
stroke
newpath
40618.4 30814.4 moveto
39606 29295.8 lineto
stroke
newpath
42136.9 30758.2 moveto
42249.4 30758.2 lineto
42361.9 30701.9 lineto
42418.1 30645.7 lineto
42474.4 30533.2 lineto
42530.6 30308.2 lineto
42530.6 30027 lineto
42474.4 29802 lineto
42418.1 29689.5 lineto
42361.9 29633.3 lineto
42249.4 29577.1 lineto
42136.9 29577.1 lineto
42024.4 29633.3 lineto
41968.2 29689.5 lineto
41912 29802 lineto
41855.7 30027 lineto
41855.7 30308.2 lineto
41912 30533.2 lineto
41968.2 30645.7 lineto
42024.4 30701.9 lineto
42136.9 30758.2 lineto
stroke
newpath
43036.8 29689.5 moveto
43093.1 29633.3 lineto
43036.8 29577.1 lineto
42980.6 29633.3 lineto
43036.8 29689.5 lineto
43036.8 29577.1 lineto
stroke
newpath
44217.9 29577.1 moveto
43543 29577.1 lineto
stroke
newpath
43880.5 29577.1 moveto
43880.5 30758.2 lineto
43768 30589.4 lineto
43655.5 30477 lineto
43543 30420.7 lineto
stroke
newpath
44667.9 30645.7 moveto
44724.1 30701.9 lineto
44836.6 30758.2 lineto
45117.8 30758.2 lineto
45230.3 30701.9 lineto
45286.5 30645.7 lineto
45342.8 30533.2 lineto
45342.8 30420.7 lineto
45286.5 30252 lineto
44611.6 29577.1 lineto
45342.8 29577.1 lineto
stroke
newpath
46411.4 30758.2 moveto
45849 30758.2 lineto
45792.7 30195.7 lineto
45849 30252 lineto
45961.5 30308.2 lineto
46242.7 30308.2 lineto
46355.2 30252 lineto
46411.4 30195.7 lineto
46467.6 30083.2 lineto
46467.6 29802 lineto
46411.4 29689.5 lineto
46355.2 29633.3 lineto
46242.7 29577.1 lineto
45961.5 29577.1 lineto
45849 29633.3 lineto
45792.7 29689.5 lineto
stroke
newpath
46917.6 30758.2 moveto
46917.6 30533.2 lineto
stroke
newpath
47367.5 30758.2 moveto
47367.5 30533.2 lineto
stroke
newpath
49111.1 29127.1 moveto
49054.8 29183.4 lineto
48942.3 29352.1 lineto
48886.1 29464.6 lineto
48829.8 29633.3 lineto
48773.6 29914.5 lineto
48773.6 30139.5 lineto
48829.8 30420.7 lineto
48886.1 30589.4 lineto
48942.3 30701.9 lineto
49054.8 30870.7 lineto
49111.1 30926.9 lineto
stroke
newpath
50067.2 30364.5 moveto
50067.2 29577.1 lineto
stroke
newpath
49786 30814.4 moveto
49504.8 29970.8 lineto
50235.9 29970.8 lineto
stroke
newpath
51585.7 29577.1 moveto
51585.7 30758.2 lineto
stroke
newpath
52091.9 29577.1 moveto
52091.9 30195.7 lineto
52035.7 30308.2 lineto
51923.2 30364.5 lineto
51754.5 30364.5 lineto
51642 30308.2 lineto
51585.7 30252 lineto
stroke
newpath
52823.1 29577.1 moveto
52710.6 29633.3 lineto
52654.4 29689.5 lineto
52598.1 29802 lineto
52598.1 30139.5 lineto
52654.4 30252 lineto
52710.6 30308.2 lineto
52823.1 30364.5 lineto
52991.8 30364.5 lineto
53104.3 30308.2 lineto
53160.6 30252 lineto
53216.8 30139.5 lineto
53216.8 29802 lineto
53160.6 29689.5 lineto
53104.3 29633.3 lineto
52991.8 29577.1 lineto
52823.1 29577.1 lineto
stroke
newpath
53891.7 29577.1 moveto
53779.2 29633.3 lineto
53723 29745.8 lineto
53723 30758.2 lineto
stroke
newpath
54791.6 29633.3 moveto
54679.1 29577.1 lineto
54454.1 29577.1 lineto
54341.7 29633.3 lineto
54285.4 29745.8 lineto
54285.4 30195.7 lineto
54341.7 30308.2 lineto
54454.1 30364.5 lineto
54679.1 30364.5 lineto
54791.6 30308.2 lineto
54847.8 30195.7 lineto
54847.8 30083.2 lineto
54285.4 29970.8 lineto
stroke
newpath
55297.8 29633.3 moveto
55410.3 29577.1 lineto
55635.2 29577.1 lineto
55747.7 29633.3 lineto
55804 29745.8 lineto
55804 29802 lineto
55747.7 29914.5 lineto
55635.2 29970.8 lineto
55466.5 29970.8 lineto
55354 30027 lineto
55297.8 30139.5 lineto
55297.8 30195.7 lineto
55354 30308.2 lineto
55466.5 30364.5 lineto
55635.2 30364.5 lineto
55747.7 30308.2 lineto
stroke
newpath
56197.7 29127.1 moveto
56253.9 29183.4 lineto
56366.4 29352.1 lineto
56422.6 29464.6 lineto
56478.9 29633.3 lineto
56535.1 29914.5 lineto
56535.1 30139.5 lineto
56478.9 30420.7 lineto
56422.6 30589.4 lineto
56366.4 30701.9 lineto
56253.9 30870.7 lineto
56197.7 30926.9 lineto
stroke
newpath
58334.9 29127.1 moveto
58278.7 29183.4 lineto
58166.2 29352.1 lineto
58109.9 29464.6 lineto
58053.7 29633.3 lineto
57997.4 29914.5 lineto
57997.4 30139.5 lineto
58053.7 30420.7 lineto
58109.9 30589.4 lineto
58166.2 30701.9 lineto
58278.7 30870.7 lineto
58334.9 30926.9 lineto
stroke
newpath
58784.8 30364.5 moveto
58784.8 29577.1 lineto
stroke
newpath
58784.8 30252 moveto
58841.1 30308.2 lineto
58953.6 30364.5 lineto
59122.3 30364.5 lineto
59234.8 30308.2 lineto
59291 30195.7 lineto
59291 29577.1 lineto
stroke
newpath
60022.2 29577.1 moveto
59909.7 29633.3 lineto
59853.5 29689.5 lineto
59797.2 29802 lineto
59797.2 30139.5 lineto
59853.5 30252 lineto
59909.7 30308.2 lineto
60022.2 30364.5 lineto
60190.9 30364.5 lineto
60303.4 30308.2 lineto
60359.7 30252 lineto
60415.9 30139.5 lineto
60415.9 29802 lineto
60359.7 29689.5 lineto
60303.4 29633.3 lineto
60190.9 29577.1 lineto
60022.2 29577.1 lineto
stroke
newpath
60753.4 30364.5 moveto
61203.3 30364.5 lineto
stroke
newpath
60922.1 30758.2 moveto
60922.1 29745.8 lineto
60978.3 29633.3 lineto
61090.8 29577.1 lineto
61203.3 29577.1 lineto
stroke
newpath
62496.9 30364.5 moveto
62496.9 29183.4 lineto
stroke
newpath
62496.9 30308.2 moveto
62609.4 30364.5 lineto
62834.3 30364.5 lineto
62946.8 30308.2 lineto
63003.1 30252 lineto
63059.3 30139.5 lineto
63059.3 29802 lineto
63003.1 29689.5 lineto
62946.8 29633.3 lineto
62834.3 29577.1 lineto
62609.4 29577.1 lineto
62496.9 29633.3 lineto
stroke
newpath
63734.2 29577.1 moveto
63621.7 29633.3 lineto
63565.5 29745.8 lineto
63565.5 30758.2 lineto
stroke
newpath
64690.4 29577.1 moveto
64690.4 30195.7 lineto
64634.1 30308.2 lineto
64521.6 30364.5 lineto
64296.7 30364.5 lineto
64184.2 30308.2 lineto
stroke
newpath
64690.4 29633.3 moveto
64577.9 29577.1 lineto
64296.7 29577.1 lineto
64184.2 29633.3 lineto
64127.9 29745.8 lineto
64127.9 29858.3 lineto
64184.2 29970.8 lineto
64296.7 30027 lineto
64577.9 30027 lineto
64690.4 30083.2 lineto
stroke
newpath
65084.1 30364.5 moveto
65534 30364.5 lineto
stroke
newpath
65252.8 30758.2 moveto
65252.8 29745.8 lineto
65309 29633.3 lineto
65421.5 29577.1 lineto
65534 29577.1 lineto
stroke
newpath
66377.6 29633.3 moveto
66265.2 29577.1 lineto
66040.2 29577.1 lineto
65927.7 29633.3 lineto
65871.5 29745.8 lineto
65871.5 30195.7 lineto
65927.7 30308.2 lineto
66040.2 30364.5 lineto
66265.2 30364.5 lineto
66377.6 30308.2 lineto
66433.9 30195.7 lineto
66433.9 30083.2 lineto
65871.5 29970.8 lineto
stroke
newpath
67446.3 29577.1 moveto
67446.3 30758.2 lineto
stroke
newpath
67446.3 29633.3 moveto
67333.8 29577.1 lineto
67108.8 29577.1 lineto
66996.3 29633.3 lineto
66940.1 29689.5 lineto
66883.8 29802 lineto
66883.8 30139.5 lineto
66940.1 30252 lineto
66996.3 30308.2 lineto
67108.8 30364.5 lineto
67333.8 30364.5 lineto
67446.3 30308.2 lineto
stroke
newpath
67896.2 29127.1 moveto
67952.5 29183.4 lineto
68064.9 29352.1 lineto
68121.2 29464.6 lineto
68177.4 29633.3 lineto
68233.7 29914.5 lineto
68233.7 30139.5 lineto
68177.4 30420.7 lineto
68121.2 30589.4 lineto
68064.9 30701.9 lineto
67952.5 30870.7 lineto
67896.2 30926.9 lineto
stroke
showpage
grestore
%%EOF
