(export (version D)
  (design
    (source "/Users/theim/Work/ITk Strips/PCBs/pb_masstest_patchpanel/pb_masstest_patchpanel.sch")
    (date "Wednesday, July 28, 2021 at 09:27:38 AM")
    (tool "Eeschema (5.1.9-0-10_14)")
    (sheet (number 1) (name /) (tstamps /)
      (title_block
        (title "Powerboard Masstest Patch Panel")
        (company LBNL)
        (rev A)
        (date 2021-07-26)
        (source pb_masstest_patchpanel.sch)
        (comment (number 1) (value "Timon Heim"))
        (comment (number 2) (value ""))
        (comment (number 3) (value ""))
        (comment (number 4) (value ""))))
    (sheet (number 2) (name /pm5V_Out/) (tstamps /600EAF16/)
      (title_block
        (title "Powerboard Masstest Patch Panel")
        (company LBNL)
        (rev A)
        (date 2021-07-26)
        (source pm5V_out.sch)
        (comment (number 1) (value "Timon Heim"))
        (comment (number 2) (value ""))
        (comment (number 3) (value ""))
        (comment (number 4) (value ""))))
    (sheet (number 3) (name /HV_input_0/) (tstamps /610B1C11/)
      (title_block
        (title "Powerboard Masstest Patch Panel")
        (company LBNL)
        (rev A)
        (date 2021-07-26)
        (source HV_input.sch)
        (comment (number 1) (value "Timon Heim"))
        (comment (number 2) (value ""))
        (comment (number 3) (value ""))
        (comment (number 4) (value ""))))
    (sheet (number 4) (name /HV_input_1/) (tstamps /611F04D2/)
      (title_block
        (title "Powerboard Masstest Patch Panel")
        (company LBNL)
        (rev A)
        (date 2021-07-26)
        (source HV_input.sch)
        (comment (number 1) (value "Timon Heim"))
        (comment (number 2) (value ""))
        (comment (number 3) (value ""))
        (comment (number 4) (value ""))))
    (sheet (number 5) (name /LV_Input_0/) (tstamps /600573E1/)
      (title_block
        (title "Powerboard Masstest Patch Panel")
        (company LBNL)
        (rev A)
        (date 2021-07-26)
        (source lv_input.sch)
        (comment (number 1) (value "Timon Heim"))
        (comment (number 2) (value ""))
        (comment (number 3) (value ""))
        (comment (number 4) (value ""))))
    (sheet (number 6) (name /LV_input_1/) (tstamps /612A5468/)
      (title_block
        (title "Powerboard Masstest Patch Panel")
        (company LBNL)
        (rev A)
        (date 2021-07-26)
        (source lv_input.sch)
        (comment (number 1) (value "Timon Heim"))
        (comment (number 2) (value ""))
        (comment (number 3) (value ""))
        (comment (number 4) (value ""))))
    (sheet (number 7) (name /LV_input_2/) (tstamps /612AA7FD/)
      (title_block
        (title "Powerboard Masstest Patch Panel")
        (company LBNL)
        (rev A)
        (date 2021-07-26)
        (source lv_input.sch)
        (comment (number 1) (value "Timon Heim"))
        (comment (number 2) (value ""))
        (comment (number 3) (value ""))
        (comment (number 4) (value ""))))
    (sheet (number 8) (name /11V_Out_0/) (tstamps /600B1B77/)
      (title_block
        (title "Powerboard Masstest Patch Panel")
        (company LBNL)
        (rev A)
        (date 2021-07-26)
        (source 11V_out.sch)
        (comment (number 1) (value "Timon Heim"))
        (comment (number 2) (value ""))
        (comment (number 3) (value ""))
        (comment (number 4) (value ""))))
    (sheet (number 9) (name /11V_out_1/) (tstamps /612B8FA8/)
      (title_block
        (title "Powerboard Masstest Patch Panel")
        (company LBNL)
        (rev A)
        (date 2021-07-26)
        (source 11V_out.sch)
        (comment (number 1) (value "Timon Heim"))
        (comment (number 2) (value ""))
        (comment (number 3) (value ""))
        (comment (number 4) (value "")))))
  (components
    (comp (ref J52)
      (value Conn_02x12_Odd_Even)
      (footprint Connector_IDC:IDC-Header_2x12_P2.54mm_Vertical)
      (datasheet ~)
      (libsource (lib Connector_Generic) (part Conn_02x12_Odd_Even) (description "Generic connector, double row, 02x12, odd/even pin numbering scheme (row 1 odd numbers, row 2 even numbers), script generated (kicad-library-utils/schlib/autogen/connector/)"))
      (sheetpath (names /) (tstamps /))
      (tstamp 6102C8EB))
    (comp (ref H1)
      (value MountingHole)
      (footprint MountingHole:MountingHole_3.2mm_M3)
      (datasheet ~)
      (libsource (lib Mechanical) (part MountingHole) (description "Mounting Hole without connection"))
      (sheetpath (names /) (tstamps /))
      (tstamp 61340C19))
    (comp (ref H3)
      (value MountingHole)
      (footprint MountingHole:MountingHole_3.2mm_M3)
      (datasheet ~)
      (libsource (lib Mechanical) (part MountingHole) (description "Mounting Hole without connection"))
      (sheetpath (names /) (tstamps /))
      (tstamp 6134150B))
    (comp (ref H5)
      (value MountingHole)
      (footprint MountingHole:MountingHole_3.2mm_M3)
      (datasheet ~)
      (libsource (lib Mechanical) (part MountingHole) (description "Mounting Hole without connection"))
      (sheetpath (names /) (tstamps /))
      (tstamp 6134170B))
    (comp (ref H7)
      (value MountingHole)
      (footprint MountingHole:MountingHole_3.2mm_M3)
      (datasheet ~)
      (libsource (lib Mechanical) (part MountingHole) (description "Mounting Hole without connection"))
      (sheetpath (names /) (tstamps /))
      (tstamp 613418C0))
    (comp (ref H2)
      (value MountingHole)
      (footprint MountingHole:MountingHole_3.2mm_M3)
      (datasheet ~)
      (libsource (lib Mechanical) (part MountingHole) (description "Mounting Hole without connection"))
      (sheetpath (names /) (tstamps /))
      (tstamp 61341B2D))
    (comp (ref H4)
      (value MountingHole)
      (footprint MountingHole:MountingHole_3.2mm_M3)
      (datasheet ~)
      (libsource (lib Mechanical) (part MountingHole) (description "Mounting Hole without connection"))
      (sheetpath (names /) (tstamps /))
      (tstamp 61341FB3))
    (comp (ref H6)
      (value MountingHole)
      (footprint MountingHole:MountingHole_3.2mm_M3)
      (datasheet ~)
      (libsource (lib Mechanical) (part MountingHole) (description "Mounting Hole without connection"))
      (sheetpath (names /) (tstamps /))
      (tstamp 6134214D))
    (comp (ref H8)
      (value MountingHole)
      (footprint MountingHole:MountingHole_3.2mm_M3)
      (datasheet ~)
      (libsource (lib Mechanical) (part MountingHole) (description "Mounting Hole without connection"))
      (sheetpath (names /) (tstamps /))
      (tstamp 6134240B))
    (comp (ref J1)
      (value Conn_02x02_Top_Bottom)
      (footprint Connector_Molex:Molex_Mini-Fit_Jr_5566-04A_2x02_P4.20mm_Vertical)
      (datasheet ~)
      (libsource (lib Connector_Generic) (part Conn_02x02_Top_Bottom) (description "Generic connector, double row, 02x02, top/bottom pin numbering scheme (row 1: 1...pins_per_row, row2: pins_per_row+1 ... num_pins), script generated (kicad-library-utils/schlib/autogen/connector/)"))
      (sheetpath (names /pm5V_Out/) (tstamps /600EAF16/))
      (tstamp 600F2124))
    (comp (ref J2)
      (value Conn_02x02_Top_Bottom)
      (footprint Connector_Molex:Molex_Mini-Fit_Jr_5566-04A_2x02_P4.20mm_Vertical)
      (datasheet ~)
      (libsource (lib Connector_Generic) (part Conn_02x02_Top_Bottom) (description "Generic connector, double row, 02x02, top/bottom pin numbering scheme (row 1: 1...pins_per_row, row2: pins_per_row+1 ... num_pins), script generated (kicad-library-utils/schlib/autogen/connector/)"))
      (sheetpath (names /pm5V_Out/) (tstamps /600EAF16/))
      (tstamp 600F212A))
    (comp (ref J3)
      (value Conn_02x02_Top_Bottom)
      (footprint Connector_Molex:Molex_Mini-Fit_Jr_5566-04A_2x02_P4.20mm_Vertical)
      (datasheet ~)
      (libsource (lib Connector_Generic) (part Conn_02x02_Top_Bottom) (description "Generic connector, double row, 02x02, top/bottom pin numbering scheme (row 1: 1...pins_per_row, row2: pins_per_row+1 ... num_pins), script generated (kicad-library-utils/schlib/autogen/connector/)"))
      (sheetpath (names /pm5V_Out/) (tstamps /600EAF16/))
      (tstamp 600F2130))
    (comp (ref J4)
      (value Conn_02x02_Top_Bottom)
      (footprint Connector_Molex:Molex_Mini-Fit_Jr_5566-04A_2x02_P4.20mm_Vertical)
      (datasheet ~)
      (libsource (lib Connector_Generic) (part Conn_02x02_Top_Bottom) (description "Generic connector, double row, 02x02, top/bottom pin numbering scheme (row 1: 1...pins_per_row, row2: pins_per_row+1 ... num_pins), script generated (kicad-library-utils/schlib/autogen/connector/)"))
      (sheetpath (names /pm5V_Out/) (tstamps /600EAF16/))
      (tstamp 600F2136))
    (comp (ref J5)
      (value Conn_02x02_Top_Bottom)
      (footprint Connector_Molex:Molex_Mini-Fit_Jr_5566-04A_2x02_P4.20mm_Vertical)
      (datasheet ~)
      (libsource (lib Connector_Generic) (part Conn_02x02_Top_Bottom) (description "Generic connector, double row, 02x02, top/bottom pin numbering scheme (row 1: 1...pins_per_row, row2: pins_per_row+1 ... num_pins), script generated (kicad-library-utils/schlib/autogen/connector/)"))
      (sheetpath (names /pm5V_Out/) (tstamps /600EAF16/))
      (tstamp 600F213C))
    (comp (ref J6)
      (value Conn_02x02_Top_Bottom)
      (footprint Connector_Molex:Molex_Mini-Fit_Jr_5566-04A_2x02_P4.20mm_Vertical)
      (datasheet ~)
      (libsource (lib Connector_Generic) (part Conn_02x02_Top_Bottom) (description "Generic connector, double row, 02x02, top/bottom pin numbering scheme (row 1: 1...pins_per_row, row2: pins_per_row+1 ... num_pins), script generated (kicad-library-utils/schlib/autogen/connector/)"))
      (sheetpath (names /pm5V_Out/) (tstamps /600EAF16/))
      (tstamp 600F2142))
    (comp (ref J7)
      (value Conn_02x02_Top_Bottom)
      (footprint Connector_Molex:Molex_Mini-Fit_Jr_5566-04A_2x02_P4.20mm_Vertical)
      (datasheet ~)
      (libsource (lib Connector_Generic) (part Conn_02x02_Top_Bottom) (description "Generic connector, double row, 02x02, top/bottom pin numbering scheme (row 1: 1...pins_per_row, row2: pins_per_row+1 ... num_pins), script generated (kicad-library-utils/schlib/autogen/connector/)"))
      (sheetpath (names /pm5V_Out/) (tstamps /600EAF16/))
      (tstamp 600F2148))
    (comp (ref J8)
      (value Conn_02x02_Top_Bottom)
      (footprint Connector_Molex:Molex_Mini-Fit_Jr_5566-04A_2x02_P4.20mm_Vertical)
      (datasheet ~)
      (libsource (lib Connector_Generic) (part Conn_02x02_Top_Bottom) (description "Generic connector, double row, 02x02, top/bottom pin numbering scheme (row 1: 1...pins_per_row, row2: pins_per_row+1 ... num_pins), script generated (kicad-library-utils/schlib/autogen/connector/)"))
      (sheetpath (names /pm5V_Out/) (tstamps /600EAF16/))
      (tstamp 600F214E))
    (comp (ref J9)
      (value Conn_02x02_Top_Bottom)
      (footprint Connector_Molex:Molex_Mini-Fit_Jr_5566-04A_2x02_P4.20mm_Vertical)
      (datasheet ~)
      (libsource (lib Connector_Generic) (part Conn_02x02_Top_Bottom) (description "Generic connector, double row, 02x02, top/bottom pin numbering scheme (row 1: 1...pins_per_row, row2: pins_per_row+1 ... num_pins), script generated (kicad-library-utils/schlib/autogen/connector/)"))
      (sheetpath (names /pm5V_Out/) (tstamps /600EAF16/))
      (tstamp 600F2154))
    (comp (ref J10)
      (value Conn_02x02_Top_Bottom)
      (footprint Connector_Molex:Molex_Mini-Fit_Jr_5566-04A_2x02_P4.20mm_Vertical)
      (datasheet ~)
      (libsource (lib Connector_Generic) (part Conn_02x02_Top_Bottom) (description "Generic connector, double row, 02x02, top/bottom pin numbering scheme (row 1: 1...pins_per_row, row2: pins_per_row+1 ... num_pins), script generated (kicad-library-utils/schlib/autogen/connector/)"))
      (sheetpath (names /pm5V_Out/) (tstamps /600EAF16/))
      (tstamp 600F215A))
    (comp (ref J11)
      (value Conn_02x02_Top_Bottom)
      (footprint Connector_Molex:Molex_Mini-Fit_Jr_5566-04A_2x02_P4.20mm_Vertical)
      (datasheet ~)
      (libsource (lib Connector_Generic) (part Conn_02x02_Top_Bottom) (description "Generic connector, double row, 02x02, top/bottom pin numbering scheme (row 1: 1...pins_per_row, row2: pins_per_row+1 ... num_pins), script generated (kicad-library-utils/schlib/autogen/connector/)"))
      (sheetpath (names /pm5V_Out/) (tstamps /600EAF16/))
      (tstamp 619448FB))
    (comp (ref J12)
      (value Conn_02x02_Top_Bottom)
      (footprint Connector_Molex:Molex_Mini-Fit_Jr_5566-04A_2x02_P4.20mm_Vertical)
      (datasheet ~)
      (libsource (lib Connector_Generic) (part Conn_02x02_Top_Bottom) (description "Generic connector, double row, 02x02, top/bottom pin numbering scheme (row 1: 1...pins_per_row, row2: pins_per_row+1 ... num_pins), script generated (kicad-library-utils/schlib/autogen/connector/)"))
      (sheetpath (names /pm5V_Out/) (tstamps /600EAF16/))
      (tstamp 61944905))
    (comp (ref J13)
      (value Conn_02x02_Top_Bottom)
      (footprint Connector_Molex:Molex_Mini-Fit_Jr_5566-04A_2x02_P4.20mm_Vertical)
      (datasheet ~)
      (libsource (lib Connector_Generic) (part Conn_02x02_Top_Bottom) (description "Generic connector, double row, 02x02, top/bottom pin numbering scheme (row 1: 1...pins_per_row, row2: pins_per_row+1 ... num_pins), script generated (kicad-library-utils/schlib/autogen/connector/)"))
      (sheetpath (names /pm5V_Out/) (tstamps /600EAF16/))
      (tstamp 6194490F))
    (comp (ref J14)
      (value Conn_02x02_Top_Bottom)
      (footprint Connector_Molex:Molex_Mini-Fit_Jr_5566-04A_2x02_P4.20mm_Vertical)
      (datasheet ~)
      (libsource (lib Connector_Generic) (part Conn_02x02_Top_Bottom) (description "Generic connector, double row, 02x02, top/bottom pin numbering scheme (row 1: 1...pins_per_row, row2: pins_per_row+1 ... num_pins), script generated (kicad-library-utils/schlib/autogen/connector/)"))
      (sheetpath (names /pm5V_Out/) (tstamps /600EAF16/))
      (tstamp 61944919))
    (comp (ref J15)
      (value Conn_02x02_Top_Bottom)
      (footprint Connector_Molex:Molex_Mini-Fit_Jr_5566-04A_2x02_P4.20mm_Vertical)
      (datasheet ~)
      (libsource (lib Connector_Generic) (part Conn_02x02_Top_Bottom) (description "Generic connector, double row, 02x02, top/bottom pin numbering scheme (row 1: 1...pins_per_row, row2: pins_per_row+1 ... num_pins), script generated (kicad-library-utils/schlib/autogen/connector/)"))
      (sheetpath (names /pm5V_Out/) (tstamps /600EAF16/))
      (tstamp 61944923))
    (comp (ref J16)
      (value Conn_02x02_Top_Bottom)
      (footprint Connector_Molex:Molex_Mini-Fit_Jr_5566-04A_2x02_P4.20mm_Vertical)
      (datasheet ~)
      (libsource (lib Connector_Generic) (part Conn_02x02_Top_Bottom) (description "Generic connector, double row, 02x02, top/bottom pin numbering scheme (row 1: 1...pins_per_row, row2: pins_per_row+1 ... num_pins), script generated (kicad-library-utils/schlib/autogen/connector/)"))
      (sheetpath (names /pm5V_Out/) (tstamps /600EAF16/))
      (tstamp 6194492D))
    (comp (ref J17)
      (value Conn_02x02_Top_Bottom)
      (footprint Connector_Molex:Molex_Mini-Fit_Jr_5566-04A_2x02_P4.20mm_Vertical)
      (datasheet ~)
      (libsource (lib Connector_Generic) (part Conn_02x02_Top_Bottom) (description "Generic connector, double row, 02x02, top/bottom pin numbering scheme (row 1: 1...pins_per_row, row2: pins_per_row+1 ... num_pins), script generated (kicad-library-utils/schlib/autogen/connector/)"))
      (sheetpath (names /pm5V_Out/) (tstamps /600EAF16/))
      (tstamp 61944937))
    (comp (ref J18)
      (value Conn_02x02_Top_Bottom)
      (footprint Connector_Molex:Molex_Mini-Fit_Jr_5566-04A_2x02_P4.20mm_Vertical)
      (datasheet ~)
      (libsource (lib Connector_Generic) (part Conn_02x02_Top_Bottom) (description "Generic connector, double row, 02x02, top/bottom pin numbering scheme (row 1: 1...pins_per_row, row2: pins_per_row+1 ... num_pins), script generated (kicad-library-utils/schlib/autogen/connector/)"))
      (sheetpath (names /pm5V_Out/) (tstamps /600EAF16/))
      (tstamp 61944941))
    (comp (ref J19)
      (value Conn_02x02_Top_Bottom)
      (footprint Connector_Molex:Molex_Mini-Fit_Jr_5566-04A_2x02_P4.20mm_Vertical)
      (datasheet ~)
      (libsource (lib Connector_Generic) (part Conn_02x02_Top_Bottom) (description "Generic connector, double row, 02x02, top/bottom pin numbering scheme (row 1: 1...pins_per_row, row2: pins_per_row+1 ... num_pins), script generated (kicad-library-utils/schlib/autogen/connector/)"))
      (sheetpath (names /pm5V_Out/) (tstamps /600EAF16/))
      (tstamp 6194494B))
    (comp (ref J20)
      (value Conn_02x02_Top_Bottom)
      (footprint Connector_Molex:Molex_Mini-Fit_Jr_5566-04A_2x02_P4.20mm_Vertical)
      (datasheet ~)
      (libsource (lib Connector_Generic) (part Conn_02x02_Top_Bottom) (description "Generic connector, double row, 02x02, top/bottom pin numbering scheme (row 1: 1...pins_per_row, row2: pins_per_row+1 ... num_pins), script generated (kicad-library-utils/schlib/autogen/connector/)"))
      (sheetpath (names /pm5V_Out/) (tstamps /600EAF16/))
      (tstamp 61944955))
    (comp (ref J21)
      (value Conn_01x04)
      (footprint Connector_PinSocket_2.54mm:PinSocket_1x04_P2.54mm_Vertical)
      (datasheet ~)
      (libsource (lib Connector_Generic) (part Conn_01x04) (description "Generic connector, single row, 01x04, script generated (kicad-library-utils/schlib/autogen/connector/)"))
      (sheetpath (names /HV_input_0/) (tstamps /610B1C11/))
      (tstamp 610B29D0))
    (comp (ref J22)
      (value Conn_01x04)
      (footprint Connector_PinSocket_2.54mm:PinSocket_1x04_P2.54mm_Vertical)
      (datasheet ~)
      (libsource (lib Connector_Generic) (part Conn_01x04) (description "Generic connector, single row, 01x04, script generated (kicad-library-utils/schlib/autogen/connector/)"))
      (sheetpath (names /HV_input_1/) (tstamps /611F04D2/))
      (tstamp 610B29D0))
    (comp (ref J24)
      (value Conn_01x08_Shielded)
      (footprint TerminalBlock_RND:TerminalBlock_RND_205-00062_1x08_P5.00mm_45Degree)
      (datasheet ~)
      (libsource (lib Connector_Generic) (part Conn_01x08) (description "Generic connector, single row, 01x08, script generated (kicad-library-utils/schlib/autogen/connector/)"))
      (sheetpath (names /LV_Input_0/) (tstamps /600573E1/))
      (tstamp 6005F484))
    (comp (ref J25)
      (value DB26_Female_HighDensity_MountingHoles)
      (footprint Connector_Dsub:DSUB-26-HD_Female_Vertical_P2.29x1.98mm_MountingHoles)
      (datasheet " ~")
      (libsource (lib Connector) (part DB26_Female_HighDensity_MountingHoles) (description "15-pin female D-SUB connector, High density (3 columns), Triple Row, Generic, VGA-connector, Mounting Hole"))
      (sheetpath (names /LV_Input_0/) (tstamps /600573E1/))
      (tstamp 6005F48A))
    (comp (ref J23)
      (value Conn_01x08_Shielded)
      (footprint TerminalBlock_RND:TerminalBlock_RND_205-00062_1x08_P5.00mm_45Degree)
      (datasheet ~)
      (libsource (lib Connector_Generic) (part Conn_01x08) (description "Generic connector, single row, 01x08, script generated (kicad-library-utils/schlib/autogen/connector/)"))
      (sheetpath (names /LV_Input_0/) (tstamps /600573E1/))
      (tstamp 6005F47E))
    (comp (ref Q1)
      (value BS250)
      (footprint Package_TO_SOT_THT:TO-92_Inline)
      (datasheet http://www.vishay.com/docs/70209/70209.pdf)
      (libsource (lib Transistor_FET) (part BS250) (description "-0.18A Id, -45V Vds, P-Channel MOSFET, TO-92"))
      (sheetpath (names /LV_Input_0/) (tstamps /600573E1/))
      (tstamp 61270A8C))
    (comp (ref Q2)
      (value BS250)
      (footprint Package_TO_SOT_THT:TO-92_Inline)
      (datasheet http://www.vishay.com/docs/70209/70209.pdf)
      (libsource (lib Transistor_FET) (part BS250) (description "-0.18A Id, -45V Vds, P-Channel MOSFET, TO-92"))
      (sheetpath (names /LV_Input_0/) (tstamps /600573E1/))
      (tstamp 61273D6B))
    (comp (ref R2)
      (value 4k7)
      (footprint Resistor_SMD:R_0805_2012Metric)
      (datasheet ~)
      (libsource (lib Device) (part R) (description Resistor))
      (sheetpath (names /LV_Input_0/) (tstamps /600573E1/))
      (tstamp 6127F4A0))
    (comp (ref R1)
      (value 4k7)
      (footprint Resistor_SMD:R_0805_2012Metric)
      (datasheet ~)
      (libsource (lib Device) (part R) (description Resistor))
      (sheetpath (names /LV_Input_0/) (tstamps /600573E1/))
      (tstamp 6127E6BC))
    (comp (ref J27)
      (value Conn_01x08_Shielded)
      (footprint TerminalBlock_RND:TerminalBlock_RND_205-00062_1x08_P5.00mm_45Degree)
      (datasheet ~)
      (libsource (lib Connector_Generic) (part Conn_01x08) (description "Generic connector, single row, 01x08, script generated (kicad-library-utils/schlib/autogen/connector/)"))
      (sheetpath (names /LV_input_1/) (tstamps /612A5468/))
      (tstamp 6005F484))
    (comp (ref J28)
      (value DB26_Female_HighDensity_MountingHoles)
      (footprint Connector_Dsub:DSUB-26-HD_Female_Vertical_P2.29x1.98mm_MountingHoles)
      (datasheet " ~")
      (libsource (lib Connector) (part DB26_Female_HighDensity_MountingHoles) (description "15-pin female D-SUB connector, High density (3 columns), Triple Row, Generic, VGA-connector, Mounting Hole"))
      (sheetpath (names /LV_input_1/) (tstamps /612A5468/))
      (tstamp 6005F48A))
    (comp (ref J26)
      (value Conn_01x08_Shielded)
      (footprint TerminalBlock_RND:TerminalBlock_RND_205-00062_1x08_P5.00mm_45Degree)
      (datasheet ~)
      (libsource (lib Connector_Generic) (part Conn_01x08) (description "Generic connector, single row, 01x08, script generated (kicad-library-utils/schlib/autogen/connector/)"))
      (sheetpath (names /LV_input_1/) (tstamps /612A5468/))
      (tstamp 6005F47E))
    (comp (ref Q3)
      (value BS250)
      (footprint Package_TO_SOT_THT:TO-92_Inline)
      (datasheet http://www.vishay.com/docs/70209/70209.pdf)
      (libsource (lib Transistor_FET) (part BS250) (description "-0.18A Id, -45V Vds, P-Channel MOSFET, TO-92"))
      (sheetpath (names /LV_input_1/) (tstamps /612A5468/))
      (tstamp 61270A8C))
    (comp (ref Q4)
      (value BS250)
      (footprint Package_TO_SOT_THT:TO-92_Inline)
      (datasheet http://www.vishay.com/docs/70209/70209.pdf)
      (libsource (lib Transistor_FET) (part BS250) (description "-0.18A Id, -45V Vds, P-Channel MOSFET, TO-92"))
      (sheetpath (names /LV_input_1/) (tstamps /612A5468/))
      (tstamp 61273D6B))
    (comp (ref R4)
      (value 4k7)
      (footprint Resistor_SMD:R_0805_2012Metric)
      (datasheet ~)
      (libsource (lib Device) (part R) (description Resistor))
      (sheetpath (names /LV_input_1/) (tstamps /612A5468/))
      (tstamp 6127F4A0))
    (comp (ref R3)
      (value 4k7)
      (footprint Resistor_SMD:R_0805_2012Metric)
      (datasheet ~)
      (libsource (lib Device) (part R) (description Resistor))
      (sheetpath (names /LV_input_1/) (tstamps /612A5468/))
      (tstamp 6127E6BC))
    (comp (ref J30)
      (value Conn_01x08_Shielded)
      (footprint TerminalBlock_RND:TerminalBlock_RND_205-00062_1x08_P5.00mm_45Degree)
      (datasheet ~)
      (libsource (lib Connector_Generic) (part Conn_01x08) (description "Generic connector, single row, 01x08, script generated (kicad-library-utils/schlib/autogen/connector/)"))
      (sheetpath (names /LV_input_2/) (tstamps /612AA7FD/))
      (tstamp 6005F484))
    (comp (ref J31)
      (value DB26_Female_HighDensity_MountingHoles)
      (footprint Connector_Dsub:DSUB-26-HD_Female_Vertical_P2.29x1.98mm_MountingHoles)
      (datasheet " ~")
      (libsource (lib Connector) (part DB26_Female_HighDensity_MountingHoles) (description "15-pin female D-SUB connector, High density (3 columns), Triple Row, Generic, VGA-connector, Mounting Hole"))
      (sheetpath (names /LV_input_2/) (tstamps /612AA7FD/))
      (tstamp 6005F48A))
    (comp (ref J29)
      (value Conn_01x08_Shielded)
      (footprint TerminalBlock_RND:TerminalBlock_RND_205-00062_1x08_P5.00mm_45Degree)
      (datasheet ~)
      (libsource (lib Connector_Generic) (part Conn_01x08) (description "Generic connector, single row, 01x08, script generated (kicad-library-utils/schlib/autogen/connector/)"))
      (sheetpath (names /LV_input_2/) (tstamps /612AA7FD/))
      (tstamp 6005F47E))
    (comp (ref Q5)
      (value BS250)
      (footprint Package_TO_SOT_THT:TO-92_Inline)
      (datasheet http://www.vishay.com/docs/70209/70209.pdf)
      (libsource (lib Transistor_FET) (part BS250) (description "-0.18A Id, -45V Vds, P-Channel MOSFET, TO-92"))
      (sheetpath (names /LV_input_2/) (tstamps /612AA7FD/))
      (tstamp 61270A8C))
    (comp (ref Q6)
      (value BS250)
      (footprint Package_TO_SOT_THT:TO-92_Inline)
      (datasheet http://www.vishay.com/docs/70209/70209.pdf)
      (libsource (lib Transistor_FET) (part BS250) (description "-0.18A Id, -45V Vds, P-Channel MOSFET, TO-92"))
      (sheetpath (names /LV_input_2/) (tstamps /612AA7FD/))
      (tstamp 61273D6B))
    (comp (ref R6)
      (value 4k7)
      (footprint Resistor_SMD:R_0805_2012Metric)
      (datasheet ~)
      (libsource (lib Device) (part R) (description Resistor))
      (sheetpath (names /LV_input_2/) (tstamps /612AA7FD/))
      (tstamp 6127F4A0))
    (comp (ref R5)
      (value 4k7)
      (footprint Resistor_SMD:R_0805_2012Metric)
      (datasheet ~)
      (libsource (lib Device) (part R) (description Resistor))
      (sheetpath (names /LV_input_2/) (tstamps /612AA7FD/))
      (tstamp 6127E6BC))
    (comp (ref J32)
      (value Conn_02x03_Top_Bottom)
      (footprint Connector_Molex:Molex_Mini-Fit_Jr_5566-06A_2x03_P4.20mm_Vertical)
      (datasheet ~)
      (libsource (lib Connector_Generic) (part Conn_02x03_Top_Bottom) (description "Generic connector, double row, 02x03, top/bottom pin numbering scheme (row 1: 1...pins_per_row, row2: pins_per_row+1 ... num_pins), script generated (kicad-library-utils/schlib/autogen/connector/)"))
      (sheetpath (names /11V_Out_0/) (tstamps /600B1B77/))
      (tstamp 6005BD53))
    (comp (ref J33)
      (value Conn_02x03_Top_Bottom)
      (footprint Connector_Molex:Molex_Mini-Fit_Jr_5566-06A_2x03_P4.20mm_Vertical)
      (datasheet ~)
      (libsource (lib Connector_Generic) (part Conn_02x03_Top_Bottom) (description "Generic connector, double row, 02x03, top/bottom pin numbering scheme (row 1: 1...pins_per_row, row2: pins_per_row+1 ... num_pins), script generated (kicad-library-utils/schlib/autogen/connector/)"))
      (sheetpath (names /11V_Out_0/) (tstamps /600B1B77/))
      (tstamp 611047E1))
    (comp (ref J34)
      (value Conn_02x03_Top_Bottom)
      (footprint Connector_Molex:Molex_Mini-Fit_Jr_5566-06A_2x03_P4.20mm_Vertical)
      (datasheet ~)
      (libsource (lib Connector_Generic) (part Conn_02x03_Top_Bottom) (description "Generic connector, double row, 02x03, top/bottom pin numbering scheme (row 1: 1...pins_per_row, row2: pins_per_row+1 ... num_pins), script generated (kicad-library-utils/schlib/autogen/connector/)"))
      (sheetpath (names /11V_Out_0/) (tstamps /600B1B77/))
      (tstamp 611064F9))
    (comp (ref J35)
      (value Conn_02x03_Top_Bottom)
      (footprint Connector_Molex:Molex_Mini-Fit_Jr_5566-06A_2x03_P4.20mm_Vertical)
      (datasheet ~)
      (libsource (lib Connector_Generic) (part Conn_02x03_Top_Bottom) (description "Generic connector, double row, 02x03, top/bottom pin numbering scheme (row 1: 1...pins_per_row, row2: pins_per_row+1 ... num_pins), script generated (kicad-library-utils/schlib/autogen/connector/)"))
      (sheetpath (names /11V_Out_0/) (tstamps /600B1B77/))
      (tstamp 61106513))
    (comp (ref J36)
      (value Conn_02x03_Top_Bottom)
      (footprint Connector_Molex:Molex_Mini-Fit_Jr_5566-06A_2x03_P4.20mm_Vertical)
      (datasheet ~)
      (libsource (lib Connector_Generic) (part Conn_02x03_Top_Bottom) (description "Generic connector, double row, 02x03, top/bottom pin numbering scheme (row 1: 1...pins_per_row, row2: pins_per_row+1 ... num_pins), script generated (kicad-library-utils/schlib/autogen/connector/)"))
      (sheetpath (names /11V_Out_0/) (tstamps /600B1B77/))
      (tstamp 6110C5C1))
    (comp (ref J37)
      (value Conn_02x03_Top_Bottom)
      (footprint Connector_Molex:Molex_Mini-Fit_Jr_5566-06A_2x03_P4.20mm_Vertical)
      (datasheet ~)
      (libsource (lib Connector_Generic) (part Conn_02x03_Top_Bottom) (description "Generic connector, double row, 02x03, top/bottom pin numbering scheme (row 1: 1...pins_per_row, row2: pins_per_row+1 ... num_pins), script generated (kicad-library-utils/schlib/autogen/connector/)"))
      (sheetpath (names /11V_Out_0/) (tstamps /600B1B77/))
      (tstamp 6110C5DB))
    (comp (ref J38)
      (value Conn_02x03_Top_Bottom)
      (footprint Connector_Molex:Molex_Mini-Fit_Jr_5566-06A_2x03_P4.20mm_Vertical)
      (datasheet ~)
      (libsource (lib Connector_Generic) (part Conn_02x03_Top_Bottom) (description "Generic connector, double row, 02x03, top/bottom pin numbering scheme (row 1: 1...pins_per_row, row2: pins_per_row+1 ... num_pins), script generated (kicad-library-utils/schlib/autogen/connector/)"))
      (sheetpath (names /11V_Out_0/) (tstamps /600B1B77/))
      (tstamp 6110C5F5))
    (comp (ref J39)
      (value Conn_02x03_Top_Bottom)
      (footprint Connector_Molex:Molex_Mini-Fit_Jr_5566-06A_2x03_P4.20mm_Vertical)
      (datasheet ~)
      (libsource (lib Connector_Generic) (part Conn_02x03_Top_Bottom) (description "Generic connector, double row, 02x03, top/bottom pin numbering scheme (row 1: 1...pins_per_row, row2: pins_per_row+1 ... num_pins), script generated (kicad-library-utils/schlib/autogen/connector/)"))
      (sheetpath (names /11V_Out_0/) (tstamps /600B1B77/))
      (tstamp 6110C60F))
    (comp (ref J40)
      (value Conn_02x03_Top_Bottom)
      (footprint Connector_Molex:Molex_Mini-Fit_Jr_5566-06A_2x03_P4.20mm_Vertical)
      (datasheet ~)
      (libsource (lib Connector_Generic) (part Conn_02x03_Top_Bottom) (description "Generic connector, double row, 02x03, top/bottom pin numbering scheme (row 1: 1...pins_per_row, row2: pins_per_row+1 ... num_pins), script generated (kicad-library-utils/schlib/autogen/connector/)"))
      (sheetpath (names /11V_Out_0/) (tstamps /600B1B77/))
      (tstamp 611189C7))
    (comp (ref J41)
      (value Conn_02x03_Top_Bottom)
      (footprint Connector_Molex:Molex_Mini-Fit_Jr_5566-06A_2x03_P4.20mm_Vertical)
      (datasheet ~)
      (libsource (lib Connector_Generic) (part Conn_02x03_Top_Bottom) (description "Generic connector, double row, 02x03, top/bottom pin numbering scheme (row 1: 1...pins_per_row, row2: pins_per_row+1 ... num_pins), script generated (kicad-library-utils/schlib/autogen/connector/)"))
      (sheetpath (names /11V_Out_0/) (tstamps /600B1B77/))
      (tstamp 611189E1))
    (comp (ref J42)
      (value Conn_02x03_Top_Bottom)
      (footprint Connector_Molex:Molex_Mini-Fit_Jr_5566-06A_2x03_P4.20mm_Vertical)
      (datasheet ~)
      (libsource (lib Connector_Generic) (part Conn_02x03_Top_Bottom) (description "Generic connector, double row, 02x03, top/bottom pin numbering scheme (row 1: 1...pins_per_row, row2: pins_per_row+1 ... num_pins), script generated (kicad-library-utils/schlib/autogen/connector/)"))
      (sheetpath (names /11V_out_1/) (tstamps /612B8FA8/))
      (tstamp 6005BD53))
    (comp (ref J43)
      (value Conn_02x03_Top_Bottom)
      (footprint Connector_Molex:Molex_Mini-Fit_Jr_5566-06A_2x03_P4.20mm_Vertical)
      (datasheet ~)
      (libsource (lib Connector_Generic) (part Conn_02x03_Top_Bottom) (description "Generic connector, double row, 02x03, top/bottom pin numbering scheme (row 1: 1...pins_per_row, row2: pins_per_row+1 ... num_pins), script generated (kicad-library-utils/schlib/autogen/connector/)"))
      (sheetpath (names /11V_out_1/) (tstamps /612B8FA8/))
      (tstamp 611047E1))
    (comp (ref J44)
      (value Conn_02x03_Top_Bottom)
      (footprint Connector_Molex:Molex_Mini-Fit_Jr_5566-06A_2x03_P4.20mm_Vertical)
      (datasheet ~)
      (libsource (lib Connector_Generic) (part Conn_02x03_Top_Bottom) (description "Generic connector, double row, 02x03, top/bottom pin numbering scheme (row 1: 1...pins_per_row, row2: pins_per_row+1 ... num_pins), script generated (kicad-library-utils/schlib/autogen/connector/)"))
      (sheetpath (names /11V_out_1/) (tstamps /612B8FA8/))
      (tstamp 611064F9))
    (comp (ref J45)
      (value Conn_02x03_Top_Bottom)
      (footprint Connector_Molex:Molex_Mini-Fit_Jr_5566-06A_2x03_P4.20mm_Vertical)
      (datasheet ~)
      (libsource (lib Connector_Generic) (part Conn_02x03_Top_Bottom) (description "Generic connector, double row, 02x03, top/bottom pin numbering scheme (row 1: 1...pins_per_row, row2: pins_per_row+1 ... num_pins), script generated (kicad-library-utils/schlib/autogen/connector/)"))
      (sheetpath (names /11V_out_1/) (tstamps /612B8FA8/))
      (tstamp 61106513))
    (comp (ref J46)
      (value Conn_02x03_Top_Bottom)
      (footprint Connector_Molex:Molex_Mini-Fit_Jr_5566-06A_2x03_P4.20mm_Vertical)
      (datasheet ~)
      (libsource (lib Connector_Generic) (part Conn_02x03_Top_Bottom) (description "Generic connector, double row, 02x03, top/bottom pin numbering scheme (row 1: 1...pins_per_row, row2: pins_per_row+1 ... num_pins), script generated (kicad-library-utils/schlib/autogen/connector/)"))
      (sheetpath (names /11V_out_1/) (tstamps /612B8FA8/))
      (tstamp 6110C5C1))
    (comp (ref J47)
      (value Conn_02x03_Top_Bottom)
      (footprint Connector_Molex:Molex_Mini-Fit_Jr_5566-06A_2x03_P4.20mm_Vertical)
      (datasheet ~)
      (libsource (lib Connector_Generic) (part Conn_02x03_Top_Bottom) (description "Generic connector, double row, 02x03, top/bottom pin numbering scheme (row 1: 1...pins_per_row, row2: pins_per_row+1 ... num_pins), script generated (kicad-library-utils/schlib/autogen/connector/)"))
      (sheetpath (names /11V_out_1/) (tstamps /612B8FA8/))
      (tstamp 6110C5DB))
    (comp (ref J48)
      (value Conn_02x03_Top_Bottom)
      (footprint Connector_Molex:Molex_Mini-Fit_Jr_5566-06A_2x03_P4.20mm_Vertical)
      (datasheet ~)
      (libsource (lib Connector_Generic) (part Conn_02x03_Top_Bottom) (description "Generic connector, double row, 02x03, top/bottom pin numbering scheme (row 1: 1...pins_per_row, row2: pins_per_row+1 ... num_pins), script generated (kicad-library-utils/schlib/autogen/connector/)"))
      (sheetpath (names /11V_out_1/) (tstamps /612B8FA8/))
      (tstamp 6110C5F5))
    (comp (ref J49)
      (value Conn_02x03_Top_Bottom)
      (footprint Connector_Molex:Molex_Mini-Fit_Jr_5566-06A_2x03_P4.20mm_Vertical)
      (datasheet ~)
      (libsource (lib Connector_Generic) (part Conn_02x03_Top_Bottom) (description "Generic connector, double row, 02x03, top/bottom pin numbering scheme (row 1: 1...pins_per_row, row2: pins_per_row+1 ... num_pins), script generated (kicad-library-utils/schlib/autogen/connector/)"))
      (sheetpath (names /11V_out_1/) (tstamps /612B8FA8/))
      (tstamp 6110C60F))
    (comp (ref J50)
      (value Conn_02x03_Top_Bottom)
      (footprint Connector_Molex:Molex_Mini-Fit_Jr_5566-06A_2x03_P4.20mm_Vertical)
      (datasheet ~)
      (libsource (lib Connector_Generic) (part Conn_02x03_Top_Bottom) (description "Generic connector, double row, 02x03, top/bottom pin numbering scheme (row 1: 1...pins_per_row, row2: pins_per_row+1 ... num_pins), script generated (kicad-library-utils/schlib/autogen/connector/)"))
      (sheetpath (names /11V_out_1/) (tstamps /612B8FA8/))
      (tstamp 611189C7))
    (comp (ref J51)
      (value Conn_02x03_Top_Bottom)
      (footprint Connector_Molex:Molex_Mini-Fit_Jr_5566-06A_2x03_P4.20mm_Vertical)
      (datasheet ~)
      (libsource (lib Connector_Generic) (part Conn_02x03_Top_Bottom) (description "Generic connector, double row, 02x03, top/bottom pin numbering scheme (row 1: 1...pins_per_row, row2: pins_per_row+1 ... num_pins), script generated (kicad-library-utils/schlib/autogen/connector/)"))
      (sheetpath (names /11V_out_1/) (tstamps /612B8FA8/))
      (tstamp 611189E1)))
  (libparts
    (libpart (lib Connector) (part DB26_Female_HighDensity_MountingHoles)
      (description "15-pin female D-SUB connector, High density (3 columns), Triple Row, Generic, VGA-connector, Mounting Hole")
      (docs " ~")
      (footprints
        (fp DSUB*Female*))
      (fields
        (field (name Reference) J)
        (field (name Value) DB26_Female_HighDensity_MountingHoles))
      (pins
        (pin (num 0) (name ~) (type passive))
        (pin (num 1) (name ~) (type passive))
        (pin (num 2) (name ~) (type passive))
        (pin (num 3) (name ~) (type passive))
        (pin (num 4) (name ~) (type passive))
        (pin (num 5) (name ~) (type passive))
        (pin (num 6) (name ~) (type passive))
        (pin (num 7) (name ~) (type passive))
        (pin (num 8) (name ~) (type passive))
        (pin (num 9) (name ~) (type passive))
        (pin (num 10) (name ~) (type passive))
        (pin (num 11) (name ~) (type passive))
        (pin (num 12) (name ~) (type passive))
        (pin (num 13) (name ~) (type passive))
        (pin (num 14) (name ~) (type passive))
        (pin (num 15) (name ~) (type passive))
        (pin (num 16) (name ~) (type passive))
        (pin (num 17) (name ~) (type passive))
        (pin (num 18) (name ~) (type passive))
        (pin (num 19) (name ~) (type passive))
        (pin (num 20) (name ~) (type passive))
        (pin (num 21) (name ~) (type passive))
        (pin (num 22) (name ~) (type passive))
        (pin (num 23) (name ~) (type passive))
        (pin (num 24) (name ~) (type passive))
        (pin (num 25) (name ~) (type passive))
        (pin (num 26) (name ~) (type passive))))
    (libpart (lib Connector_Generic) (part Conn_01x04)
      (description "Generic connector, single row, 01x04, script generated (kicad-library-utils/schlib/autogen/connector/)")
      (docs ~)
      (footprints
        (fp Connector*:*_1x??_*))
      (fields
        (field (name Reference) J)
        (field (name Value) Conn_01x04))
      (pins
        (pin (num 1) (name Pin_1) (type passive))
        (pin (num 2) (name Pin_2) (type passive))
        (pin (num 3) (name Pin_3) (type passive))
        (pin (num 4) (name Pin_4) (type passive))))
    (libpart (lib Connector_Generic) (part Conn_01x08)
      (description "Generic connector, single row, 01x08, script generated (kicad-library-utils/schlib/autogen/connector/)")
      (docs ~)
      (footprints
        (fp Connector*:*_1x??_*))
      (fields
        (field (name Reference) J)
        (field (name Value) Conn_01x08))
      (pins
        (pin (num 1) (name Pin_1) (type passive))
        (pin (num 2) (name Pin_2) (type passive))
        (pin (num 3) (name Pin_3) (type passive))
        (pin (num 4) (name Pin_4) (type passive))
        (pin (num 5) (name Pin_5) (type passive))
        (pin (num 6) (name Pin_6) (type passive))
        (pin (num 7) (name Pin_7) (type passive))
        (pin (num 8) (name Pin_8) (type passive))))
    (libpart (lib Connector_Generic) (part Conn_02x02_Top_Bottom)
      (description "Generic connector, double row, 02x02, top/bottom pin numbering scheme (row 1: 1...pins_per_row, row2: pins_per_row+1 ... num_pins), script generated (kicad-library-utils/schlib/autogen/connector/)")
      (docs ~)
      (footprints
        (fp Connector*:*_2x??_*))
      (fields
        (field (name Reference) J)
        (field (name Value) Conn_02x02_Top_Bottom))
      (pins
        (pin (num 1) (name Pin_1) (type passive))
        (pin (num 2) (name Pin_2) (type passive))
        (pin (num 3) (name Pin_3) (type passive))
        (pin (num 4) (name Pin_4) (type passive))))
    (libpart (lib Connector_Generic) (part Conn_02x03_Top_Bottom)
      (description "Generic connector, double row, 02x03, top/bottom pin numbering scheme (row 1: 1...pins_per_row, row2: pins_per_row+1 ... num_pins), script generated (kicad-library-utils/schlib/autogen/connector/)")
      (docs ~)
      (footprints
        (fp Connector*:*_2x??_*))
      (fields
        (field (name Reference) J)
        (field (name Value) Conn_02x03_Top_Bottom))
      (pins
        (pin (num 1) (name Pin_1) (type passive))
        (pin (num 2) (name Pin_2) (type passive))
        (pin (num 3) (name Pin_3) (type passive))
        (pin (num 4) (name Pin_4) (type passive))
        (pin (num 5) (name Pin_5) (type passive))
        (pin (num 6) (name Pin_6) (type passive))))
    (libpart (lib Connector_Generic) (part Conn_02x12_Odd_Even)
      (description "Generic connector, double row, 02x12, odd/even pin numbering scheme (row 1 odd numbers, row 2 even numbers), script generated (kicad-library-utils/schlib/autogen/connector/)")
      (docs ~)
      (footprints
        (fp Connector*:*_2x??_*))
      (fields
        (field (name Reference) J)
        (field (name Value) Conn_02x12_Odd_Even))
      (pins
        (pin (num 1) (name Pin_1) (type passive))
        (pin (num 2) (name Pin_2) (type passive))
        (pin (num 3) (name Pin_3) (type passive))
        (pin (num 4) (name Pin_4) (type passive))
        (pin (num 5) (name Pin_5) (type passive))
        (pin (num 6) (name Pin_6) (type passive))
        (pin (num 7) (name Pin_7) (type passive))
        (pin (num 8) (name Pin_8) (type passive))
        (pin (num 9) (name Pin_9) (type passive))
        (pin (num 10) (name Pin_10) (type passive))
        (pin (num 11) (name Pin_11) (type passive))
        (pin (num 12) (name Pin_12) (type passive))
        (pin (num 13) (name Pin_13) (type passive))
        (pin (num 14) (name Pin_14) (type passive))
        (pin (num 15) (name Pin_15) (type passive))
        (pin (num 16) (name Pin_16) (type passive))
        (pin (num 17) (name Pin_17) (type passive))
        (pin (num 18) (name Pin_18) (type passive))
        (pin (num 19) (name Pin_19) (type passive))
        (pin (num 20) (name Pin_20) (type passive))
        (pin (num 21) (name Pin_21) (type passive))
        (pin (num 22) (name Pin_22) (type passive))
        (pin (num 23) (name Pin_23) (type passive))
        (pin (num 24) (name Pin_24) (type passive))))
    (libpart (lib Device) (part R)
      (description Resistor)
      (docs ~)
      (footprints
        (fp R_*))
      (fields
        (field (name Reference) R)
        (field (name Value) R))
      (pins
        (pin (num 1) (name ~) (type passive))
        (pin (num 2) (name ~) (type passive))))
    (libpart (lib Mechanical) (part MountingHole)
      (description "Mounting Hole without connection")
      (docs ~)
      (footprints
        (fp MountingHole*))
      (fields
        (field (name Reference) H)
        (field (name Value) MountingHole)))
    (libpart (lib Transistor_FET) (part BS250)
      (description "-0.18A Id, -45V Vds, P-Channel MOSFET, TO-92")
      (docs http://www.vishay.com/docs/70209/70209.pdf)
      (footprints
        (fp TO?92*))
      (fields
        (field (name Reference) Q)
        (field (name Value) BS250)
        (field (name Footprint) Package_TO_SOT_THT:TO-92_Inline))
      (pins
        (pin (num 1) (name D) (type passive))
        (pin (num 2) (name G) (type input))
        (pin (num 3) (name S) (type passive)))))
  (libraries
    (library (logical Connector)
      (uri "/Library/Application Support/kicad/library/Connector.lib"))
    (library (logical Connector_Generic)
      (uri "/Library/Application Support/kicad/library/Connector_Generic.lib"))
    (library (logical Device)
      (uri "/Library/Application Support/kicad/library/Device.lib"))
    (library (logical Mechanical)
      (uri "/Library/Application Support/kicad/library/Mechanical.lib"))
    (library (logical Transistor_FET)
      (uri "/Library/Application Support/kicad/library/Transistor_FET.lib")))
  (nets
    (net (code 1) (name /LV_PRSNT_0)
      (node (ref J52) (pin 2))
      (node (ref J25) (pin 22))
      (node (ref J25) (pin 26))
      (node (ref J25) (pin 1))
      (node (ref Q2) (pin 3))
      (node (ref Q1) (pin 3)))
    (net (code 2) (name /S_P6)
      (node (ref J25) (pin 11))
      (node (ref J38) (pin 6)))
    (net (code 3) (name /S_P4)
      (node (ref J36) (pin 6))
      (node (ref J25) (pin 2)))
    (net (code 4) (name /S_P7)
      (node (ref J39) (pin 6))
      (node (ref J25) (pin 13)))
    (net (code 5) (name /S_P5)
      (node (ref J25) (pin 4))
      (node (ref J37) (pin 6)))
    (net (code 6) (name /S_P0)
      (node (ref J32) (pin 6))
      (node (ref J25) (pin 15)))
    (net (code 7) (name /S_P2)
      (node (ref J34) (pin 6))
      (node (ref J25) (pin 6)))
    (net (code 8) (name /S_P1)
      (node (ref J25) (pin 17))
      (node (ref J33) (pin 6)))
    (net (code 9) (name /S_P3)
      (node (ref J25) (pin 8))
      (node (ref J35) (pin 6)))
    (net (code 10) (name /S_N3)
      (node (ref J35) (pin 3))
      (node (ref J25) (pin 9)))
    (net (code 11) (name /S_N1)
      (node (ref J25) (pin 18))
      (node (ref J33) (pin 3)))
    (net (code 12) (name /S_N2)
      (node (ref J34) (pin 3))
      (node (ref J25) (pin 7)))
    (net (code 13) (name /S_N0)
      (node (ref J25) (pin 16))
      (node (ref J32) (pin 3)))
    (net (code 14) (name /S_N5)
      (node (ref J25) (pin 5))
      (node (ref J37) (pin 3)))
    (net (code 15) (name /S_N7)
      (node (ref J39) (pin 3))
      (node (ref J25) (pin 14)))
    (net (code 16) (name /S_N4)
      (node (ref J36) (pin 3))
      (node (ref J25) (pin 3)))
    (net (code 17) (name /S_N6)
      (node (ref J25) (pin 12))
      (node (ref J38) (pin 3)))
    (net (code 18) (name /LV_PRSNT1)
      (node (ref Q3) (pin 3))
      (node (ref Q4) (pin 3))
      (node (ref J28) (pin 26))
      (node (ref J28) (pin 1))
      (node (ref J28) (pin 22)))
    (net (code 19) (name /S_P14)
      (node (ref J46) (pin 6))
      (node (ref J28) (pin 11)))
    (net (code 20) (name /S_P12)
      (node (ref J44) (pin 6))
      (node (ref J28) (pin 2)))
    (net (code 21) (name /S_P15)
      (node (ref J28) (pin 13))
      (node (ref J47) (pin 6)))
    (net (code 22) (name /S_P13)
      (node (ref J28) (pin 4))
      (node (ref J45) (pin 6)))
    (net (code 23) (name /S_P8)
      (node (ref J40) (pin 6))
      (node (ref J28) (pin 15)))
    (net (code 24) (name /S_P10)
      (node (ref J42) (pin 6))
      (node (ref J28) (pin 6)))
    (net (code 25) (name /S_P9)
      (node (ref J41) (pin 6))
      (node (ref J28) (pin 17)))
    (net (code 26) (name /S_P11)
      (node (ref J28) (pin 8))
      (node (ref J43) (pin 6)))
    (net (code 27) (name /S_N11)
      (node (ref J28) (pin 9))
      (node (ref J43) (pin 3)))
    (net (code 28) (name /S_N9)
      (node (ref J41) (pin 3))
      (node (ref J28) (pin 18)))
    (net (code 29) (name /S_N10)
      (node (ref J42) (pin 3))
      (node (ref J28) (pin 7)))
    (net (code 30) (name /S_N8)
      (node (ref J28) (pin 16))
      (node (ref J40) (pin 3)))
    (net (code 31) (name /S_N13)
      (node (ref J28) (pin 5))
      (node (ref J45) (pin 3)))
    (net (code 32) (name /S_N15)
      (node (ref J28) (pin 14))
      (node (ref J47) (pin 3)))
    (net (code 33) (name /S_N12)
      (node (ref J28) (pin 3))
      (node (ref J44) (pin 3)))
    (net (code 34) (name /S_N14)
      (node (ref J28) (pin 12))
      (node (ref J46) (pin 3)))
    (net (code 35) (name /LV_PRSNT2)
      (node (ref Q5) (pin 3))
      (node (ref Q6) (pin 3))
      (node (ref J31) (pin 26))
      (node (ref J31) (pin 22))
      (node (ref J31) (pin 1)))
    (net (code 36) (name /LV_P22)
      (node (ref J30) (pin 5))
      (node (ref J31) (pin 11))
      (node (ref J11) (pin 3))
      (node (ref J12) (pin 3))
      (node (ref J13) (pin 3))
      (node (ref J14) (pin 3))
      (node (ref J15) (pin 3))
      (node (ref J16) (pin 3))
      (node (ref J17) (pin 3))
      (node (ref J18) (pin 3))
      (node (ref J19) (pin 3))
      (node (ref J20) (pin 3)))
    (net (code 37) (name /LV_P20)
      (node (ref J3) (pin 3))
      (node (ref J1) (pin 3))
      (node (ref J2) (pin 3))
      (node (ref J4) (pin 3))
      (node (ref J5) (pin 3))
      (node (ref J6) (pin 3))
      (node (ref J7) (pin 3))
      (node (ref J31) (pin 2))
      (node (ref J8) (pin 3))
      (node (ref J9) (pin 3))
      (node (ref J10) (pin 3))
      (node (ref J30) (pin 1)))
    (net (code 38) (name /LV_N22)
      (node (ref J11) (pin 1))
      (node (ref J11) (pin 2))
      (node (ref J12) (pin 1))
      (node (ref J12) (pin 2))
      (node (ref J13) (pin 1))
      (node (ref J13) (pin 2))
      (node (ref J14) (pin 1))
      (node (ref J14) (pin 2))
      (node (ref J15) (pin 1))
      (node (ref J15) (pin 2))
      (node (ref J20) (pin 2))
      (node (ref J31) (pin 13))
      (node (ref J31) (pin 12))
      (node (ref J30) (pin 7))
      (node (ref J30) (pin 6))
      (node (ref J20) (pin 1))
      (node (ref J19) (pin 2))
      (node (ref J19) (pin 1))
      (node (ref J18) (pin 2))
      (node (ref J18) (pin 1))
      (node (ref J17) (pin 2))
      (node (ref J17) (pin 1))
      (node (ref J16) (pin 2))
      (node (ref J16) (pin 1)))
    (net (code 39) (name /LV_N20)
      (node (ref J1) (pin 2))
      (node (ref J1) (pin 1))
      (node (ref J30) (pin 2))
      (node (ref J30) (pin 3))
      (node (ref J2) (pin 1))
      (node (ref J2) (pin 2))
      (node (ref J3) (pin 1))
      (node (ref J10) (pin 2))
      (node (ref J10) (pin 1))
      (node (ref J9) (pin 2))
      (node (ref J9) (pin 1))
      (node (ref J3) (pin 2))
      (node (ref J8) (pin 2))
      (node (ref J8) (pin 1))
      (node (ref J31) (pin 3))
      (node (ref J31) (pin 4))
      (node (ref J7) (pin 2))
      (node (ref J7) (pin 1))
      (node (ref J6) (pin 2))
      (node (ref J6) (pin 1))
      (node (ref J4) (pin 1))
      (node (ref J5) (pin 2))
      (node (ref J5) (pin 1))
      (node (ref J4) (pin 2)))
    (net (code 40) (name /S_P16)
      (node (ref J31) (pin 15))
      (node (ref J48) (pin 6)))
    (net (code 41) (name /S_P18)
      (node (ref J50) (pin 6))
      (node (ref J31) (pin 6)))
    (net (code 42) (name /S_P17)
      (node (ref J49) (pin 6))
      (node (ref J31) (pin 17)))
    (net (code 43) (name /S_P19)
      (node (ref J51) (pin 6))
      (node (ref J31) (pin 8)))
    (net (code 44) (name /S_N19)
      (node (ref J31) (pin 9))
      (node (ref J51) (pin 3)))
    (net (code 45) (name /S_N17)
      (node (ref J31) (pin 18))
      (node (ref J49) (pin 3)))
    (net (code 46) (name /S_N18)
      (node (ref J50) (pin 3))
      (node (ref J31) (pin 7)))
    (net (code 47) (name /S_N16)
      (node (ref J48) (pin 3))
      (node (ref J31) (pin 16)))
    (net (code 48) (name /LV_N21)
      (node (ref J1) (pin 4))
      (node (ref J2) (pin 4))
      (node (ref J3) (pin 4))
      (node (ref J4) (pin 4))
      (node (ref J5) (pin 4))
      (node (ref J6) (pin 4))
      (node (ref J7) (pin 4))
      (node (ref J31) (pin 5))
      (node (ref J8) (pin 4))
      (node (ref J9) (pin 4))
      (node (ref J10) (pin 4))
      (node (ref J30) (pin 4)))
    (net (code 49) (name /LV_N23)
      (node (ref J11) (pin 4))
      (node (ref J12) (pin 4))
      (node (ref J13) (pin 4))
      (node (ref J14) (pin 4))
      (node (ref J15) (pin 4))
      (node (ref J16) (pin 4))
      (node (ref J17) (pin 4))
      (node (ref J18) (pin 4))
      (node (ref J19) (pin 4))
      (node (ref J20) (pin 4))
      (node (ref J30) (pin 8))
      (node (ref J31) (pin 14)))
    (net (code 50) (name GND)
      (node (ref J25) (pin 0))
      (node (ref J25) (pin 10))
      (node (ref J25) (pin 20))
      (node (ref J25) (pin 24))
      (node (ref J31) (pin 24))
      (node (ref J31) (pin 20))
      (node (ref J31) (pin 10))
      (node (ref J31) (pin 0))
      (node (ref R3) (pin 2))
      (node (ref R4) (pin 2))
      (node (ref R5) (pin 2))
      (node (ref J28) (pin 0))
      (node (ref R2) (pin 2))
      (node (ref J28) (pin 10))
      (node (ref R1) (pin 2))
      (node (ref J52) (pin 24))
      (node (ref J28) (pin 20))
      (node (ref R6) (pin 2))
      (node (ref J28) (pin 24)))
    (net (code 51) (name /ST03_2)
      (node (ref J52) (pin 16))
      (node (ref J31) (pin 25)))
    (net (code 52) (name /ST47_2)
      (node (ref J52) (pin 18))
      (node (ref J31) (pin 21)))
    (net (code 53) (name /~IT03_2)
      (node (ref J52) (pin 20))
      (node (ref Q6) (pin 2))
      (node (ref R6) (pin 1)))
    (net (code 54) (name /~IT47_2)
      (node (ref Q5) (pin 2))
      (node (ref J52) (pin 22))
      (node (ref R5) (pin 1)))
    (net (code 55) (name /ST03_1)
      (node (ref J52) (pin 8))
      (node (ref J28) (pin 25)))
    (net (code 56) (name /ST47_1)
      (node (ref J52) (pin 10))
      (node (ref J28) (pin 21)))
    (net (code 57) (name /~IT03_1)
      (node (ref J52) (pin 12))
      (node (ref Q4) (pin 2))
      (node (ref R4) (pin 1)))
    (net (code 58) (name /~IT47_1)
      (node (ref J52) (pin 14))
      (node (ref Q3) (pin 2))
      (node (ref R3) (pin 1)))
    (net (code 59) (name /ST03_0)
      (node (ref J25) (pin 25))
      (node (ref J52) (pin 17)))
    (net (code 60) (name /ST47_0)
      (node (ref J25) (pin 21))
      (node (ref J52) (pin 19)))
    (net (code 61) (name /~IT03_0)
      (node (ref R2) (pin 1))
      (node (ref Q2) (pin 2))
      (node (ref J52) (pin 21)))
    (net (code 62) (name /~IT47_0)
      (node (ref R1) (pin 1))
      (node (ref J52) (pin 23))
      (node (ref Q1) (pin 2)))
    (net (code 63) (name /LV_P0)
      (node (ref J23) (pin 1))
      (node (ref J32) (pin 5))
      (node (ref J32) (pin 4)))
    (net (code 64) (name /LV_P1)
      (node (ref J33) (pin 5))
      (node (ref J33) (pin 4))
      (node (ref J23) (pin 3)))
    (net (code 65) (name /LV_N0)
      (node (ref J32) (pin 2))
      (node (ref J32) (pin 1))
      (node (ref J23) (pin 2)))
    (net (code 66) (name /LV_N1)
      (node (ref J23) (pin 4))
      (node (ref J33) (pin 2))
      (node (ref J33) (pin 1)))
    (net (code 67) (name /LV_P2)
      (node (ref J34) (pin 4))
      (node (ref J34) (pin 5))
      (node (ref J23) (pin 5)))
    (net (code 68) (name /LV_N2)
      (node (ref J34) (pin 2))
      (node (ref J34) (pin 1))
      (node (ref J23) (pin 6)))
    (net (code 69) (name /LV_P3)
      (node (ref J35) (pin 5))
      (node (ref J23) (pin 7))
      (node (ref J35) (pin 4)))
    (net (code 70) (name /LV_N3)
      (node (ref J35) (pin 2))
      (node (ref J23) (pin 8))
      (node (ref J35) (pin 1)))
    (net (code 71) (name /LV_P4)
      (node (ref J36) (pin 5))
      (node (ref J36) (pin 4))
      (node (ref J24) (pin 1)))
    (net (code 72) (name /LV_N4)
      (node (ref J24) (pin 2))
      (node (ref J36) (pin 1))
      (node (ref J36) (pin 2)))
    (net (code 73) (name /LV_P5)
      (node (ref J24) (pin 3))
      (node (ref J37) (pin 5))
      (node (ref J37) (pin 4)))
    (net (code 74) (name /LV_N5)
      (node (ref J37) (pin 1))
      (node (ref J37) (pin 2))
      (node (ref J24) (pin 4)))
    (net (code 75) (name /LV_P6)
      (node (ref J38) (pin 5))
      (node (ref J24) (pin 5))
      (node (ref J38) (pin 4)))
    (net (code 76) (name /LV_N6)
      (node (ref J38) (pin 1))
      (node (ref J38) (pin 2))
      (node (ref J24) (pin 6)))
    (net (code 77) (name /LV_P7)
      (node (ref J39) (pin 5))
      (node (ref J39) (pin 4))
      (node (ref J24) (pin 7)))
    (net (code 78) (name /LV_N7)
      (node (ref J24) (pin 8))
      (node (ref J39) (pin 1))
      (node (ref J39) (pin 2)))
    (net (code 79) (name /LV_P8)
      (node (ref J26) (pin 1))
      (node (ref J40) (pin 4))
      (node (ref J40) (pin 5)))
    (net (code 80) (name /LV_N8)
      (node (ref J40) (pin 2))
      (node (ref J26) (pin 2))
      (node (ref J40) (pin 1)))
    (net (code 81) (name /LV_P9)
      (node (ref J26) (pin 3))
      (node (ref J41) (pin 5))
      (node (ref J41) (pin 4)))
    (net (code 82) (name /LV_N9)
      (node (ref J26) (pin 4))
      (node (ref J41) (pin 1))
      (node (ref J41) (pin 2)))
    (net (code 83) (name /LV_P10)
      (node (ref J42) (pin 4))
      (node (ref J42) (pin 5))
      (node (ref J26) (pin 5)))
    (net (code 84) (name /LV_N10)
      (node (ref J26) (pin 6))
      (node (ref J42) (pin 2))
      (node (ref J42) (pin 1)))
    (net (code 85) (name /LV_P11)
      (node (ref J43) (pin 5))
      (node (ref J43) (pin 4))
      (node (ref J26) (pin 7)))
    (net (code 86) (name /LV_N11)
      (node (ref J26) (pin 8))
      (node (ref J43) (pin 2))
      (node (ref J43) (pin 1)))
    (net (code 87) (name /LV_P12)
      (node (ref J27) (pin 1))
      (node (ref J44) (pin 5))
      (node (ref J44) (pin 4)))
    (net (code 88) (name /LV_N12)
      (node (ref J44) (pin 1))
      (node (ref J44) (pin 2))
      (node (ref J27) (pin 2)))
    (net (code 89) (name /LV_P13)
      (node (ref J27) (pin 3))
      (node (ref J45) (pin 4))
      (node (ref J45) (pin 5)))
    (net (code 90) (name /LV_N13)
      (node (ref J27) (pin 4))
      (node (ref J45) (pin 2))
      (node (ref J45) (pin 1)))
    (net (code 91) (name /LV_P14)
      (node (ref J46) (pin 4))
      (node (ref J46) (pin 5))
      (node (ref J27) (pin 5)))
    (net (code 92) (name /LV_N14)
      (node (ref J27) (pin 6))
      (node (ref J46) (pin 1))
      (node (ref J46) (pin 2)))
    (net (code 93) (name /LV_P15)
      (node (ref J47) (pin 4))
      (node (ref J27) (pin 7))
      (node (ref J47) (pin 5)))
    (net (code 94) (name /LV_N15)
      (node (ref J27) (pin 8))
      (node (ref J47) (pin 1))
      (node (ref J47) (pin 2)))
    (net (code 95) (name /LV_P16)
      (node (ref J48) (pin 5))
      (node (ref J48) (pin 4))
      (node (ref J29) (pin 1)))
    (net (code 96) (name /LV_N16)
      (node (ref J48) (pin 1))
      (node (ref J48) (pin 2))
      (node (ref J29) (pin 2)))
    (net (code 97) (name /LV_P17)
      (node (ref J49) (pin 4))
      (node (ref J29) (pin 3))
      (node (ref J49) (pin 5)))
    (net (code 98) (name /LV_N17)
      (node (ref J29) (pin 4))
      (node (ref J49) (pin 2))
      (node (ref J49) (pin 1)))
    (net (code 99) (name /LV_P18)
      (node (ref J50) (pin 5))
      (node (ref J50) (pin 4))
      (node (ref J29) (pin 5)))
    (net (code 100) (name /LV_N18)
      (node (ref J50) (pin 2))
      (node (ref J29) (pin 6))
      (node (ref J50) (pin 1)))
    (net (code 101) (name /LV_P19)
      (node (ref J51) (pin 4))
      (node (ref J29) (pin 7))
      (node (ref J51) (pin 5)))
    (net (code 102) (name /LV_N19)
      (node (ref J29) (pin 8))
      (node (ref J51) (pin 2))
      (node (ref J51) (pin 1)))
    (net (code 103) (name /PAS_P_0)
      (node (ref J52) (pin 1))
      (node (ref J21) (pin 1)))
    (net (code 104) (name /PAS_N_0)
      (node (ref J21) (pin 2))
      (node (ref J52) (pin 3)))
    (net (code 105) (name /SIG_P_0)
      (node (ref J21) (pin 3))
      (node (ref J52) (pin 5)))
    (net (code 106) (name /SIG_N_0)
      (node (ref J21) (pin 4))
      (node (ref J52) (pin 7)))
    (net (code 107) (name /PAS_P_1)
      (node (ref J22) (pin 1))
      (node (ref J52) (pin 9)))
    (net (code 108) (name /PAS_N_1)
      (node (ref J52) (pin 11))
      (node (ref J22) (pin 2)))
    (net (code 109) (name /SIG_P_1)
      (node (ref J52) (pin 13))
      (node (ref J22) (pin 3)))
    (net (code 110) (name /SIG_N_1)
      (node (ref J22) (pin 4))
      (node (ref J52) (pin 15)))
    (net (code 111) (name /LV_PRSNT_1)
      (node (ref J52) (pin 4)))
    (net (code 112) (name /LV_PRSNT_2)
      (node (ref J52) (pin 6)))
    (net (code 113) (name /LV_Input_0/IT03_P)
      (node (ref Q2) (pin 1))
      (node (ref J25) (pin 23)))
    (net (code 114) (name /LV_Input_0/IT47_P)
      (node (ref J25) (pin 19))
      (node (ref Q1) (pin 1)))
    (net (code 115) (name /LV_input_1/IT03_P)
      (node (ref Q4) (pin 1))
      (node (ref J28) (pin 23)))
    (net (code 116) (name /LV_input_1/IT47_P)
      (node (ref Q3) (pin 1))
      (node (ref J28) (pin 19)))
    (net (code 117) (name /LV_input_2/IT03_P)
      (node (ref J31) (pin 23))
      (node (ref Q6) (pin 1)))
    (net (code 118) (name /LV_input_2/IT47_P)
      (node (ref J31) (pin 19))
      (node (ref Q5) (pin 1)))))