EESchema Schematic File Version 4
EELAYER 30 0
EELAYER END
$Descr A4 11693 8268
encoding utf-8
Sheet 1 9
Title "Powerboard Masstest Patch Panel"
Date "2021-07-26"
Rev "A"
Comp "LBNL"
Comment1 "Timon Heim"
Comment2 ""
Comment3 ""
Comment4 ""
$EndDescr
$Sheet
S 3850 6400 550  900 
U 600EAF16
F0 "pm5V_Out" 50
F1 "pm5V_out.sch" 50
F2 "P5V_0" I L 3850 6550 50 
F3 "GND_5V_0" I L 3850 6650 50 
F4 "N3V_0" I L 3850 6750 50 
F5 "P5V_1" I L 3850 6950 50 
F6 "GND_5V_1" I L 3850 7050 50 
F7 "N3V_1" I L 3850 7150 50 
$EndSheet
$Sheet
S 5500 700  550  700 
U 610B1C11
F0 "HV_input_0" 50
F1 "HV_input.sch" 50
F2 "PAS_N" I R 6050 950 50 
F3 "PAS_P" I R 6050 850 50 
F4 "SIG_P" I R 6050 1100 50 
F5 "SIG_N" I R 6050 1250 50 
$EndSheet
$Sheet
S 5500 1650 550  700 
U 611F04D2
F0 "HV_input_1" 50
F1 "HV_input.sch" 50
F2 "PAS_N" I R 6050 1900 50 
F3 "PAS_P" I R 6050 1800 50 
F4 "SIG_P" I R 6050 2050 50 
F5 "SIG_N" I R 6050 2200 50 
$EndSheet
Entry Wire Line
	-2500 1650 -2400 1750
$Sheet
S 1450 800  750  2150
U 600573E1
F0 "LV_Input_0" 50
F1 "lv_input.sch" 50
F2 "VAUX" I L 1450 2650 50 
F3 "LV_N4" I R 2200 1800 50 
F4 "LV_N2" I R 2200 1400 50 
F5 "LV_N1" I R 2200 1200 50 
F6 "LV_N0" I R 2200 1000 50 
F7 "LV_P3" I R 2200 1500 50 
F8 "LV_P2" I R 2200 1300 50 
F9 "LV_P1" I R 2200 1100 50 
F10 "LV_P0" I R 2200 900 50 
F11 "LV_N7" I R 2200 2400 50 
F12 "LV_N6" I R 2200 2200 50 
F13 "LV_N5" I R 2200 2000 50 
F14 "LV_P7" I R 2200 2300 50 
F15 "LV_P6" I R 2200 2100 50 
F16 "LV_P5" I R 2200 1900 50 
F17 "LV_P4" I R 2200 1700 50 
F18 "S_P6" I L 1450 2100 50 
F19 "S_P4" I L 1450 1700 50 
F20 "S_P7" I L 1450 2300 50 
F21 "S_P5" I L 1450 1900 50 
F22 "S_P0" I L 1450 900 50 
F23 "S_P2" I L 1450 1300 50 
F24 "S_P1" I L 1450 1100 50 
F25 "S_P3" I L 1450 1500 50 
F26 "S_N3" I L 1450 1600 50 
F27 "S_N1" I L 1450 1200 50 
F28 "S_N2" I L 1450 1400 50 
F29 "S_N0" I L 1450 1000 50 
F30 "S_N5" I L 1450 2000 50 
F31 "S_N7" I L 1450 2400 50 
F32 "S_N4" I L 1450 1800 50 
F33 "S_N6" I L 1450 2200 50 
F34 "ST47" I R 2200 2650 50 
F35 "ST03" I R 2200 2550 50 
F36 "~IT47" I R 2200 2850 50 
F37 "~IT03" I R 2200 2750 50 
F38 "LV_N3" I R 2200 1600 50 
$EndSheet
$Sheet
S 1450 3150 750  2150
U 612A5468
F0 "LV_input_1" 50
F1 "lv_input.sch" 50
F2 "VAUX" I L 1450 5000 50 
F3 "LV_N4" I R 2200 4150 50 
F4 "LV_N2" I R 2200 3750 50 
F5 "LV_N1" I R 2200 3550 50 
F6 "LV_N0" I R 2200 3350 50 
F7 "LV_P3" I R 2200 3850 50 
F8 "LV_P2" I R 2200 3650 50 
F9 "LV_P1" I R 2200 3450 50 
F10 "LV_P0" I R 2200 3250 50 
F11 "LV_N7" I R 2200 4750 50 
F12 "LV_N6" I R 2200 4550 50 
F13 "LV_N5" I R 2200 4350 50 
F14 "LV_P7" I R 2200 4650 50 
F15 "LV_P6" I R 2200 4450 50 
F16 "LV_P5" I R 2200 4250 50 
F17 "LV_P4" I R 2200 4050 50 
F18 "S_P6" I L 1450 4450 50 
F19 "S_P4" I L 1450 4050 50 
F20 "S_P7" I L 1450 4650 50 
F21 "S_P5" I L 1450 4250 50 
F22 "S_P0" I L 1450 3250 50 
F23 "S_P2" I L 1450 3650 50 
F24 "S_P1" I L 1450 3450 50 
F25 "S_P3" I L 1450 3850 50 
F26 "S_N3" I L 1450 3950 50 
F27 "S_N1" I L 1450 3550 50 
F28 "S_N2" I L 1450 3750 50 
F29 "S_N0" I L 1450 3350 50 
F30 "S_N5" I L 1450 4350 50 
F31 "S_N7" I L 1450 4750 50 
F32 "S_N4" I L 1450 4150 50 
F33 "S_N6" I L 1450 4550 50 
F34 "ST47" I R 2200 5000 50 
F35 "ST03" I R 2200 4900 50 
F36 "~IT47" I R 2200 5200 50 
F37 "~IT03" I R 2200 5100 50 
F38 "LV_N3" I R 2200 3950 50 
$EndSheet
$Sheet
S 1450 5500 750  2150
U 612AA7FD
F0 "LV_input_2" 50
F1 "lv_input.sch" 50
F2 "VAUX" I L 1450 7350 50 
F3 "LV_N4" I R 2200 6500 50 
F4 "LV_N2" I R 2200 6100 50 
F5 "LV_N1" I R 2200 5900 50 
F6 "LV_N0" I R 2200 5700 50 
F7 "LV_P3" I R 2200 6200 50 
F8 "LV_P2" I R 2200 6000 50 
F9 "LV_P1" I R 2200 5800 50 
F10 "LV_P0" I R 2200 5600 50 
F11 "LV_N7" I R 2200 7100 50 
F12 "LV_N6" I R 2200 6900 50 
F13 "LV_N5" I R 2200 6700 50 
F14 "LV_P7" I R 2200 7000 50 
F15 "LV_P6" I R 2200 6800 50 
F16 "LV_P5" I R 2200 6600 50 
F17 "LV_P4" I R 2200 6400 50 
F18 "S_P6" I L 1450 6800 50 
F19 "S_P4" I L 1450 6400 50 
F20 "S_P7" I L 1450 7000 50 
F21 "S_P5" I L 1450 6600 50 
F22 "S_P0" I L 1450 5600 50 
F23 "S_P2" I L 1450 6000 50 
F24 "S_P1" I L 1450 5800 50 
F25 "S_P3" I L 1450 6200 50 
F26 "S_N3" I L 1450 6300 50 
F27 "S_N1" I L 1450 5900 50 
F28 "S_N2" I L 1450 6100 50 
F29 "S_N0" I L 1450 5700 50 
F30 "S_N5" I L 1450 6700 50 
F31 "S_N7" I L 1450 7100 50 
F32 "S_N4" I L 1450 6500 50 
F33 "S_N6" I L 1450 6900 50 
F34 "ST47" I R 2200 7350 50 
F35 "ST03" I R 2200 7250 50 
F36 "~IT47" I R 2200 7550 50 
F37 "~IT03" I R 2200 7450 50 
F38 "LV_N3" I R 2200 6300 50 
$EndSheet
$Sheet
S 3600 1450 1000 2150
U 600B1B77
F0 "11V_Out_0" 50
F1 "11V_out.sch" 50
F2 "VIN_P0" I L 3600 1550 50 
F3 "VIN_P1" I L 3600 1750 50 
F4 "VIN_P2" I L 3600 1950 50 
F5 "VIN_P3" I L 3600 2150 50 
F6 "VIN_P4" I L 3600 2350 50 
F7 "VIN_P5" I L 3600 2550 50 
F8 "VIN_P6" I L 3600 2750 50 
F9 "VIN_P7" I L 3600 2950 50 
F10 "VIN_P8" I L 3600 3150 50 
F11 "VIN_P9" I L 3600 3350 50 
F12 "VIN_N8" I L 3600 3250 50 
F13 "VIN_N9" I L 3600 3450 50 
F14 "VIN_N7" I L 3600 3050 50 
F15 "VIN_N6" I L 3600 2850 50 
F16 "VIN_N5" I L 3600 2650 50 
F17 "VIN_N4" I L 3600 2450 50 
F18 "VIN_N3" I L 3600 2250 50 
F19 "VIN_N2" I L 3600 2050 50 
F20 "VIN_N1" I L 3600 1850 50 
F21 "VIN_N0" I L 3600 1650 50 
F22 "SENSE_P0" I R 4600 1550 50 
F23 "SENSE_P1" I R 4600 1750 50 
F24 "SENSE_P2" I R 4600 1950 50 
F25 "SENSE_P3" I R 4600 2150 50 
F26 "SENSE_P4" I R 4600 2350 50 
F27 "SENSE_P5" I R 4600 2550 50 
F28 "SENSE_P6" I R 4600 2750 50 
F29 "SENSE_P7" I R 4600 2950 50 
F30 "SENSE_P8" I R 4600 3150 50 
F31 "SENSE_P9" I R 4600 3350 50 
F32 "SENSE_N0" I R 4600 1650 50 
F33 "SENSE_N1" I R 4600 1850 50 
F34 "SENSE_N2" I R 4600 2050 50 
F35 "SENSE_N3" I R 4600 2250 50 
F36 "SENSE_N4" I R 4600 2450 50 
F37 "SENSE_N5" I R 4600 2650 50 
F38 "SENSE_N6" I R 4600 2850 50 
F39 "SENSE_N7" I R 4600 3050 50 
F40 "SENSE_N8" I R 4600 3250 50 
F41 "SENSE_N9" I R 4600 3450 50 
$EndSheet
$Sheet
S 3600 3800 1000 2150
U 612B8FA8
F0 "11V_out_1" 50
F1 "11V_out.sch" 50
F2 "VIN_P0" I L 3600 3900 50 
F3 "VIN_P1" I L 3600 4100 50 
F4 "VIN_P2" I L 3600 4300 50 
F5 "VIN_P3" I L 3600 4500 50 
F6 "VIN_P4" I L 3600 4700 50 
F7 "VIN_P5" I L 3600 4900 50 
F8 "VIN_P6" I L 3600 5100 50 
F9 "VIN_P7" I L 3600 5300 50 
F10 "VIN_P8" I L 3600 5500 50 
F11 "VIN_P9" I L 3600 5700 50 
F12 "VIN_N8" I L 3600 5600 50 
F13 "VIN_N9" I L 3600 5800 50 
F14 "VIN_N7" I L 3600 5400 50 
F15 "VIN_N6" I L 3600 5200 50 
F16 "VIN_N5" I L 3600 5000 50 
F17 "VIN_N4" I L 3600 4800 50 
F18 "VIN_N3" I L 3600 4600 50 
F19 "VIN_N2" I L 3600 4400 50 
F20 "VIN_N1" I L 3600 4200 50 
F21 "VIN_N0" I L 3600 4000 50 
F22 "SENSE_P0" I R 4600 3900 50 
F23 "SENSE_P1" I R 4600 4100 50 
F24 "SENSE_P2" I R 4600 4300 50 
F25 "SENSE_P3" I R 4600 4500 50 
F26 "SENSE_P4" I R 4600 4700 50 
F27 "SENSE_P5" I R 4600 4900 50 
F28 "SENSE_P6" I R 4600 5100 50 
F29 "SENSE_P7" I R 4600 5300 50 
F30 "SENSE_P8" I R 4600 5500 50 
F31 "SENSE_P9" I R 4600 5700 50 
F32 "SENSE_N0" I R 4600 4000 50 
F33 "SENSE_N1" I R 4600 4200 50 
F34 "SENSE_N2" I R 4600 4400 50 
F35 "SENSE_N3" I R 4600 4600 50 
F36 "SENSE_N4" I R 4600 4800 50 
F37 "SENSE_N5" I R 4600 5000 50 
F38 "SENSE_N6" I R 4600 5200 50 
F39 "SENSE_N7" I R 4600 5400 50 
F40 "SENSE_N8" I R 4600 5600 50 
F41 "SENSE_N9" I R 4600 5800 50 
$EndSheet
Wire Wire Line
	2200 900  3350 900 
Wire Wire Line
	3350 1550 3600 1550
Wire Wire Line
	3350 900  3350 1550
Wire Wire Line
	3600 1650 3300 1650
Wire Wire Line
	3300 1650 3300 1000
Wire Wire Line
	3300 1000 2200 1000
Wire Wire Line
	2200 1100 3250 1100
Wire Wire Line
	3250 1100 3250 1750
Wire Wire Line
	3250 1750 3600 1750
Wire Wire Line
	3600 1850 3200 1850
Wire Wire Line
	3200 1850 3200 1200
Wire Wire Line
	3200 1200 2200 1200
Wire Wire Line
	3600 1950 3150 1950
Wire Wire Line
	3150 1950 3150 1300
Wire Wire Line
	3150 1300 2200 1300
Wire Wire Line
	2200 1400 3100 1400
Wire Wire Line
	3100 1400 3100 2050
Wire Wire Line
	3100 2050 3600 2050
Wire Wire Line
	3600 2150 3050 2150
Wire Wire Line
	3050 2150 3050 1500
Wire Wire Line
	3050 1500 2200 1500
Wire Wire Line
	2200 1600 3000 1600
Wire Wire Line
	3000 1600 3000 2250
Wire Wire Line
	3000 2250 3600 2250
Wire Wire Line
	3600 2350 2950 2350
Wire Wire Line
	2950 2350 2950 1700
Wire Wire Line
	2950 1700 2200 1700
Wire Wire Line
	3600 2450 2900 2450
Wire Wire Line
	2900 2450 2900 1800
Wire Wire Line
	2900 1800 2200 1800
Wire Wire Line
	2200 1900 2850 1900
Wire Wire Line
	2850 1900 2850 2550
Wire Wire Line
	2850 2550 3600 2550
Wire Wire Line
	3600 2650 2800 2650
Wire Wire Line
	2800 2650 2800 2000
Wire Wire Line
	2800 2000 2200 2000
Wire Wire Line
	2200 2100 2750 2100
Wire Wire Line
	2750 2100 2750 2750
Wire Wire Line
	2750 2750 3600 2750
Wire Wire Line
	2200 2200 2700 2200
Wire Wire Line
	2700 2200 2700 2850
Wire Wire Line
	2700 2850 3600 2850
Wire Wire Line
	3600 2950 2650 2950
Wire Wire Line
	2650 2950 2650 2300
Wire Wire Line
	2650 2300 2200 2300
Wire Wire Line
	2200 2400 2600 2400
Wire Wire Line
	2600 2400 2600 3050
Wire Wire Line
	2600 3050 3600 3050
Wire Wire Line
	2200 2550 2500 2550
Wire Wire Line
	2200 2650 2500 2650
Wire Wire Line
	2200 2750 2500 2750
Wire Wire Line
	2200 2850 2500 2850
Wire Wire Line
	2200 3250 2700 3250
Wire Wire Line
	2700 3250 2700 3150
Wire Wire Line
	2700 3150 3600 3150
Wire Wire Line
	2200 3350 2750 3350
Wire Wire Line
	2750 3350 2750 3250
Wire Wire Line
	2750 3250 3600 3250
Wire Wire Line
	2200 3450 2800 3450
Wire Wire Line
	2800 3450 2800 3350
Wire Wire Line
	2800 3350 3600 3350
Wire Wire Line
	2200 3550 2850 3550
Wire Wire Line
	2850 3550 2850 3450
Wire Wire Line
	2850 3450 3600 3450
Wire Wire Line
	3600 3900 3500 3900
Wire Wire Line
	3500 3900 3500 3650
Wire Wire Line
	3500 3650 2200 3650
Wire Wire Line
	2200 3750 3450 3750
Wire Wire Line
	3450 3750 3450 4000
Wire Wire Line
	3450 4000 3600 4000
Wire Wire Line
	3600 4100 3400 4100
Wire Wire Line
	3400 4100 3400 3850
Wire Wire Line
	3400 3850 2200 3850
Wire Wire Line
	2200 3950 3350 3950
Wire Wire Line
	3350 3950 3350 4200
Wire Wire Line
	3350 4200 3600 4200
Wire Wire Line
	3600 4300 3300 4300
Wire Wire Line
	3300 4300 3300 4050
Wire Wire Line
	3300 4050 2200 4050
Wire Wire Line
	2200 4150 3250 4150
Wire Wire Line
	3250 4150 3250 4400
Wire Wire Line
	3250 4400 3600 4400
Wire Wire Line
	3600 4500 3200 4500
Wire Wire Line
	3200 4500 3200 4250
Wire Wire Line
	3200 4250 2200 4250
Wire Wire Line
	2200 4350 3150 4350
Wire Wire Line
	3150 4350 3150 4600
Wire Wire Line
	3150 4600 3600 4600
Wire Wire Line
	2200 4450 3100 4450
Wire Wire Line
	3100 4450 3100 4700
Wire Wire Line
	3100 4700 3600 4700
Wire Wire Line
	2200 4550 3050 4550
Wire Wire Line
	3050 4550 3050 4800
Wire Wire Line
	3050 4800 3600 4800
Wire Wire Line
	2200 4650 3000 4650
Wire Wire Line
	3000 4650 3000 4900
Wire Wire Line
	3000 4900 3600 4900
Wire Wire Line
	2200 4750 2950 4750
Wire Wire Line
	2950 4750 2950 5000
Wire Wire Line
	2950 5000 3600 5000
Wire Wire Line
	2200 4900 2650 4900
Wire Wire Line
	2200 5000 2650 5000
Wire Wire Line
	2200 5100 2650 5100
Wire Wire Line
	2200 5200 2650 5200
Wire Wire Line
	3600 5100 2850 5100
Wire Wire Line
	2850 5100 2850 5600
Wire Wire Line
	2850 5600 2200 5600
Wire Wire Line
	2200 5700 2900 5700
Wire Wire Line
	2900 5700 2900 5200
Wire Wire Line
	2900 5200 3600 5200
Wire Wire Line
	3600 5300 2950 5300
Wire Wire Line
	2950 5300 2950 5800
Wire Wire Line
	2950 5800 2200 5800
Wire Wire Line
	2200 5900 3000 5900
Wire Wire Line
	3000 5900 3000 5400
Wire Wire Line
	3000 5400 3600 5400
Wire Wire Line
	3600 5500 3050 5500
Wire Wire Line
	3050 5500 3050 6000
Wire Wire Line
	3050 6000 2200 6000
Wire Wire Line
	2200 6100 3100 6100
Wire Wire Line
	3100 6100 3100 5600
Wire Wire Line
	3100 5600 3600 5600
Wire Wire Line
	3600 5700 3150 5700
Wire Wire Line
	3150 5700 3150 6200
Wire Wire Line
	3150 6200 2200 6200
Wire Wire Line
	2200 6300 3200 6300
Wire Wire Line
	3200 6300 3200 5800
Wire Wire Line
	3200 5800 3600 5800
Wire Wire Line
	1450 900  1000 900 
Wire Wire Line
	1000 1000 1450 1000
Wire Wire Line
	1000 1100 1450 1100
Wire Wire Line
	1000 1200 1450 1200
Wire Wire Line
	1000 1300 1450 1300
Wire Wire Line
	1000 1400 1450 1400
Wire Wire Line
	1000 1500 1450 1500
Wire Wire Line
	1000 1600 1450 1600
Wire Wire Line
	1000 1700 1450 1700
Wire Wire Line
	1000 1800 1450 1800
Wire Wire Line
	1000 1900 1450 1900
Wire Wire Line
	1000 2000 1450 2000
Wire Wire Line
	1000 2100 1450 2100
Wire Wire Line
	1000 2200 1450 2200
Wire Wire Line
	1000 2300 1450 2300
Wire Wire Line
	1000 2400 1450 2400
Wire Wire Line
	1450 2650 1000 2650
Text GLabel 3800 800  0    50   Input ~ 0
GND
$Comp
L power:GND #PWR01
U 1 1 613A68FF
P 4000 900
F 0 "#PWR01" H 4000 650 50  0001 C CNN
F 1 "GND" H 4005 727 50  0000 C CNN
F 2 "" H 4000 900 50  0001 C CNN
F 3 "" H 4000 900 50  0001 C CNN
	1    4000 900 
	1    0    0    -1  
$EndComp
Wire Wire Line
	3800 800  4000 800 
Wire Wire Line
	4000 800  4000 900 
Wire Wire Line
	1000 3250 1450 3250
Wire Wire Line
	1000 3350 1450 3350
Wire Wire Line
	1000 3450 1450 3450
Wire Wire Line
	1000 3550 1450 3550
Wire Wire Line
	1000 3650 1450 3650
Wire Wire Line
	1000 3750 1450 3750
Wire Wire Line
	1000 3850 1450 3850
Wire Wire Line
	1000 3950 1450 3950
Wire Wire Line
	1000 4050 1450 4050
Wire Wire Line
	1000 4150 1450 4150
Wire Wire Line
	1000 4250 1450 4250
Wire Wire Line
	1000 4350 1450 4350
Wire Wire Line
	1000 4450 1450 4450
Wire Wire Line
	1000 4550 1450 4550
Wire Wire Line
	1000 4650 1450 4650
Wire Wire Line
	1000 4750 1450 4750
Wire Wire Line
	1000 5000 1450 5000
Wire Wire Line
	1000 5600 1450 5600
Wire Wire Line
	1000 5700 1450 5700
Wire Wire Line
	1000 5800 1450 5800
Wire Wire Line
	1000 5900 1450 5900
Wire Wire Line
	1000 6000 1450 6000
Wire Wire Line
	1000 6100 1450 6100
Wire Wire Line
	1000 6200 1450 6200
Wire Wire Line
	1000 6300 1450 6300
Wire Wire Line
	1000 6400 1450 6400
Wire Wire Line
	1000 6500 1450 6500
Wire Wire Line
	1000 6600 1450 6600
Wire Wire Line
	1000 6700 1450 6700
Wire Wire Line
	1000 6800 1450 6800
Wire Wire Line
	1000 6900 1450 6900
Wire Wire Line
	1000 7000 1450 7000
Wire Wire Line
	1000 7100 1450 7100
Wire Wire Line
	1000 7350 1450 7350
Wire Wire Line
	2200 7250 2650 7250
Wire Wire Line
	2200 7350 2650 7350
Wire Wire Line
	2200 7450 2650 7450
Wire Wire Line
	2200 7550 2650 7550
Wire Wire Line
	4600 1550 5000 1550
Wire Wire Line
	5000 1650 4600 1650
Wire Wire Line
	5000 1750 4600 1750
Wire Wire Line
	5000 1850 4600 1850
Wire Wire Line
	5000 1950 4600 1950
Wire Wire Line
	5000 2050 4600 2050
Wire Wire Line
	5000 2150 4600 2150
Wire Wire Line
	5000 2250 4600 2250
Wire Wire Line
	5000 2350 4600 2350
Wire Wire Line
	5000 2450 4600 2450
Wire Wire Line
	5000 2550 4600 2550
Wire Wire Line
	5000 2650 4600 2650
Wire Wire Line
	5000 2750 4600 2750
Wire Wire Line
	5000 2850 4600 2850
Wire Wire Line
	5000 2950 4600 2950
Wire Wire Line
	5000 3050 4600 3050
Wire Wire Line
	5000 3150 4600 3150
Wire Wire Line
	5000 3250 4600 3250
Wire Wire Line
	5000 3350 4600 3350
Wire Wire Line
	5000 3450 4600 3450
Wire Wire Line
	5000 3900 4600 3900
Wire Wire Line
	5000 4000 4600 4000
Wire Wire Line
	5000 4100 4600 4100
Wire Wire Line
	5000 4200 4600 4200
Wire Wire Line
	5000 4300 4600 4300
Wire Wire Line
	5000 4400 4600 4400
Wire Wire Line
	5000 4500 4600 4500
Wire Wire Line
	5000 4600 4600 4600
Wire Wire Line
	5000 4700 4600 4700
Wire Wire Line
	5000 4800 4600 4800
Wire Wire Line
	5000 4900 4600 4900
Wire Wire Line
	5000 5000 4600 5000
Wire Wire Line
	5000 5100 4600 5100
Wire Wire Line
	5000 5200 4600 5200
Wire Wire Line
	5000 5300 4600 5300
Wire Wire Line
	5000 5400 4600 5400
Wire Wire Line
	4600 5500 5000 5500
Wire Wire Line
	5000 5600 4600 5600
Wire Wire Line
	5000 5700 4600 5700
Wire Wire Line
	5000 5800 4600 5800
Text Label 1000 900  0    50   ~ 0
S_P0
Text Label 1000 1000 0    50   ~ 0
S_N0
Text Label 1000 1100 0    50   ~ 0
S_P1
Text Label 1000 1200 0    50   ~ 0
S_N1
Text Label 1000 1300 0    50   ~ 0
S_P2
Text Label 1000 1400 0    50   ~ 0
S_N2
Text Label 1000 1500 0    50   ~ 0
S_P3
Text Label 1000 1600 0    50   ~ 0
S_N3
Text Label 1000 1700 0    50   ~ 0
S_P4
Text Label 1000 1800 0    50   ~ 0
S_N4
Text Label 1000 1900 0    50   ~ 0
S_P5
Text Label 1000 2000 0    50   ~ 0
S_N5
Text Label 1000 2100 0    50   ~ 0
S_P6
Text Label 1000 2200 0    50   ~ 0
S_N6
Text Label 1000 2300 0    50   ~ 0
S_P7
Text Label 1000 2400 0    50   ~ 0
S_N7
Text Label 1000 2650 0    50   ~ 0
LV_PRSNT_0
Text Label 1000 3250 0    50   ~ 0
S_P8
Text Label 1000 3350 0    50   ~ 0
S_N8
Text Label 1000 3450 0    50   ~ 0
S_P9
Text Label 1000 3550 0    50   ~ 0
S_N9
Text Label 1000 3650 0    50   ~ 0
S_P10
Text Label 1000 3750 0    50   ~ 0
S_N10
Text Label 1000 3850 0    50   ~ 0
S_P11
Text Label 1000 3950 0    50   ~ 0
S_N11
Text Label 1000 4050 0    50   ~ 0
S_P12
Text Label 1000 4150 0    50   ~ 0
S_N12
Text Label 1000 4250 0    50   ~ 0
S_P13
Text Label 1000 4350 0    50   ~ 0
S_N13
Text Label 1000 4450 0    50   ~ 0
S_P14
Text Label 1000 4550 0    50   ~ 0
S_N14
Text Label 1000 4650 0    50   ~ 0
S_P15
Text Label 1000 4750 0    50   ~ 0
S_N15
Text Label 1000 5000 0    50   ~ 0
LV_PRSNT1
Text Label 1000 5600 0    50   ~ 0
S_P16
Text Label 1000 5700 0    50   ~ 0
S_N16
Text Label 1000 7350 0    50   ~ 0
LV_PRSNT2
Text Label 1000 5800 0    50   ~ 0
S_P17
Text Label 1000 5900 0    50   ~ 0
S_N17
Text Label 1000 6000 0    50   ~ 0
S_P18
Text Label 1000 6100 0    50   ~ 0
S_N18
Text Label 1000 6200 0    50   ~ 0
S_P19
Text Label 1000 6300 0    50   ~ 0
S_N19
Text Label 1000 6400 0    50   ~ 0
LV_P20
Text Label 1000 6500 0    50   ~ 0
LV_N20
Text Label 1000 6600 0    50   ~ 0
LV_P21
Text Label 1000 6700 0    50   ~ 0
LV_N21
Text Label 1000 6800 0    50   ~ 0
LV_P22
Text Label 1000 6900 0    50   ~ 0
LV_N22
Text Label 1000 7000 0    50   ~ 0
LV_P23
Text Label 1000 7100 0    50   ~ 0
LV_N23
Text Label 2300 7250 0    50   ~ 0
ST03_2
Text Label 2300 7350 0    50   ~ 0
ST47_2
Text Label 2300 7450 0    50   ~ 0
~IT03_2
Text Label 2300 7550 0    50   ~ 0
~IT47_2
Text Label 2300 4900 0    50   ~ 0
ST03_1
Text Label 2300 5000 0    50   ~ 0
ST47_1
Text Label 2300 5100 0    50   ~ 0
~IT03_1
Text Label 2300 5200 0    50   ~ 0
~IT47_1
Text Label 2250 2550 0    50   ~ 0
ST03_0
Text Label 2250 2650 0    50   ~ 0
ST47_0
Text Label 2250 2750 0    50   ~ 0
~IT03_0
Text Label 2250 2850 0    50   ~ 0
~IT47_0
Text Label 4700 1550 0    50   ~ 0
S_P0
Text Label 4700 1650 0    50   ~ 0
S_N0
Text Label 4700 1750 0    50   ~ 0
S_P1
Text Label 4700 1850 0    50   ~ 0
S_N1
Text Label 4700 1950 0    50   ~ 0
S_P2
Text Label 4700 2050 0    50   ~ 0
S_N2
Text Label 4700 2150 0    50   ~ 0
S_P3
Text Label 4700 2250 0    50   ~ 0
S_N3
Text Label 4700 2350 0    50   ~ 0
S_P4
Text Label 4700 2450 0    50   ~ 0
S_N4
Text Label 4700 2550 0    50   ~ 0
S_P5
Text Label 4700 2650 0    50   ~ 0
S_N5
Text Label 4700 2750 0    50   ~ 0
S_P6
Text Label 4700 2850 0    50   ~ 0
S_N6
Text Label 4700 2950 0    50   ~ 0
S_P7
Text Label 4700 3050 0    50   ~ 0
S_N7
Text Label 4700 3150 0    50   ~ 0
S_P8
Text Label 4700 3250 0    50   ~ 0
S_N8
Text Label 4700 3350 0    50   ~ 0
S_P9
Text Label 4700 3450 0    50   ~ 0
S_N9
Text Label 2300 900  0    50   ~ 0
LV_P0
Text Label 2300 1100 0    50   ~ 0
LV_P1
Text Label 2300 1000 0    50   ~ 0
LV_N0
Text Label 2300 1200 0    50   ~ 0
LV_N1
Text Label 2300 1300 0    50   ~ 0
LV_P2
Text Label 2300 1400 0    50   ~ 0
LV_N2
Text Label 2300 1500 0    50   ~ 0
LV_P3
Text Label 2300 1600 0    50   ~ 0
LV_N3
Text Label 2300 1700 0    50   ~ 0
LV_P4
Text Label 2300 1800 0    50   ~ 0
LV_N4
Text Label 2300 1900 0    50   ~ 0
LV_P5
Text Label 2300 2000 0    50   ~ 0
LV_N5
Text Label 2300 2100 0    50   ~ 0
LV_P6
Text Label 2300 2200 0    50   ~ 0
LV_N6
Text Label 2300 2300 0    50   ~ 0
LV_P7
Text Label 2300 2400 0    50   ~ 0
LV_N7
Text Label 2300 3250 0    50   ~ 0
LV_P8
Text Label 2300 3350 0    50   ~ 0
LV_N8
Text Label 2300 3450 0    50   ~ 0
LV_P9
Text Label 2300 3550 0    50   ~ 0
LV_N9
Text Label 2300 3650 0    50   ~ 0
LV_P10
Text Label 2300 3750 0    50   ~ 0
LV_N10
Text Label 2300 3850 0    50   ~ 0
LV_P11
Text Label 2300 3950 0    50   ~ 0
LV_N11
Text Label 2300 4050 0    50   ~ 0
LV_P12
Text Label 2300 4150 0    50   ~ 0
LV_N12
Text Label 2300 4250 0    50   ~ 0
LV_P13
Text Label 2300 4350 0    50   ~ 0
LV_N13
Text Label 2300 4450 0    50   ~ 0
LV_P14
Text Label 2300 4550 0    50   ~ 0
LV_N14
Text Label 2300 4650 0    50   ~ 0
LV_P15
Text Label 2300 4750 0    50   ~ 0
LV_N15
Text Label 2300 5600 0    50   ~ 0
LV_P16
Text Label 2300 5700 0    50   ~ 0
LV_N16
Text Label 2300 5800 0    50   ~ 0
LV_P17
Text Label 2300 5900 0    50   ~ 0
LV_N17
Text Label 2300 6000 0    50   ~ 0
LV_P18
Text Label 2300 6100 0    50   ~ 0
LV_N18
Text Label 2300 6200 0    50   ~ 0
LV_P19
Text Label 2300 6300 0    50   ~ 0
LV_N19
Text Label 2300 6400 0    50   ~ 0
LV_P20
Text Label 2300 6500 0    50   ~ 0
LV_N20
Text Label 2300 6600 0    50   ~ 0
LV_P21
Text Label 2300 6700 0    50   ~ 0
LV_N21
Text Label 2300 6800 0    50   ~ 0
LV_P22
Text Label 2300 6900 0    50   ~ 0
LV_N22
Text Label 2300 7000 0    50   ~ 0
LV_P23
Text Label 2300 7100 0    50   ~ 0
LV_N23
Text Label 4700 3900 0    50   ~ 0
S_P10
Text Label 4700 4000 0    50   ~ 0
S_N10
Text Label 4700 4100 0    50   ~ 0
S_P11
Text Label 4700 4200 0    50   ~ 0
S_N11
Text Label 4700 4300 0    50   ~ 0
S_P12
Text Label 4700 4400 0    50   ~ 0
S_N12
Text Label 4700 4500 0    50   ~ 0
S_P13
Text Label 4700 4600 0    50   ~ 0
S_N13
Text Label 4700 4700 0    50   ~ 0
S_P14
Text Label 4700 4800 0    50   ~ 0
S_N14
Text Label 4700 4900 0    50   ~ 0
S_P15
Text Label 4700 5000 0    50   ~ 0
S_N15
Text Label 4700 5100 0    50   ~ 0
S_P16
Text Label 4700 5200 0    50   ~ 0
S_N16
Text Label 4700 5300 0    50   ~ 0
S_P17
Text Label 4700 5400 0    50   ~ 0
S_N17
Text Label 4700 5500 0    50   ~ 0
S_P18
Text Label 4700 5600 0    50   ~ 0
S_N18
Text Label 4700 5700 0    50   ~ 0
S_P19
Text Label 4700 5800 0    50   ~ 0
S_N19
Wire Wire Line
	3600 6400 3600 6550
Wire Wire Line
	3600 6550 3850 6550
Wire Wire Line
	2200 6400 3600 6400
Wire Wire Line
	2750 6500 2750 6550
Wire Wire Line
	2200 6500 2750 6500
Wire Wire Line
	2200 6600 2750 6600
Wire Wire Line
	2750 6550 3550 6550
Wire Wire Line
	3550 6550 3550 6650
Wire Wire Line
	3550 6650 3850 6650
Connection ~ 2750 6550
Wire Wire Line
	2750 6550 2750 6600
Wire Wire Line
	3500 6700 3500 6750
Wire Wire Line
	3500 6750 3850 6750
Wire Wire Line
	2200 6700 3500 6700
Wire Wire Line
	3450 6800 3450 6950
Wire Wire Line
	3450 6950 3850 6950
Wire Wire Line
	2200 6800 3450 6800
Wire Wire Line
	2750 6900 2750 6950
Wire Wire Line
	2200 6900 2750 6900
Wire Wire Line
	2200 7000 2750 7000
Wire Wire Line
	2750 6950 3400 6950
Wire Wire Line
	3400 6950 3400 7050
Wire Wire Line
	3400 7050 3850 7050
Connection ~ 2750 6950
Wire Wire Line
	2750 6950 2750 7000
Wire Wire Line
	3350 7100 3350 7150
Wire Wire Line
	3350 7150 3850 7150
Wire Wire Line
	2200 7100 3350 7100
$Comp
L Connector_Generic:Conn_02x12_Odd_Even J52
U 1 1 6102C8EB
P 7750 4000
F 0 "J52" H 7800 4717 50  0000 C CNN
F 1 "Conn_02x12_Odd_Even" H 7800 4626 50  0000 C CNN
F 2 "Connector_IDC:IDC-Header_2x12_P2.54mm_Vertical" H 7750 4000 50  0001 C CNN
F 3 "~" H 7750 4000 50  0001 C CNN
	1    7750 4000
	1    0    0    -1  
$EndComp
Wire Wire Line
	6050 850  6500 850 
Wire Wire Line
	6050 950  6500 950 
Wire Wire Line
	6050 1100 6500 1100
Wire Wire Line
	6050 1250 6500 1250
Wire Wire Line
	6050 1800 6500 1800
Wire Wire Line
	6050 1900 6500 1900
Wire Wire Line
	6050 2050 6500 2050
Wire Wire Line
	6050 2200 6500 2200
Text Label 6150 850  0    50   ~ 0
PAS_P_0
Text Label 6150 950  0    50   ~ 0
PAS_N_0
Text Label 6150 1100 0    50   ~ 0
SIG_P_0
Text Label 6150 1250 0    50   ~ 0
SIG_N_0
Text Label 6150 1800 0    50   ~ 0
PAS_P_1
Text Label 6150 1900 0    50   ~ 0
PAS_N_1
Text Label 6150 2050 0    50   ~ 0
SIG_P_1
Text Label 6150 2200 0    50   ~ 0
SIG_N_1
Wire Wire Line
	8050 3500 8500 3500
Wire Wire Line
	7550 3500 7000 3500
Wire Wire Line
	7550 3600 7000 3600
Wire Wire Line
	7550 3700 7000 3700
Wire Wire Line
	7550 3800 7000 3800
Wire Wire Line
	7000 3900 7550 3900
Wire Wire Line
	7550 4000 7000 4000
Wire Wire Line
	7550 4100 7000 4100
Wire Wire Line
	7550 4200 7000 4200
Wire Wire Line
	7550 4300 7000 4300
Wire Wire Line
	7550 4400 7000 4400
Wire Wire Line
	7550 4500 7000 4500
Wire Wire Line
	7550 4600 7000 4600
Wire Wire Line
	8050 3600 8500 3600
Wire Wire Line
	8050 3700 8500 3700
Wire Wire Line
	8050 3800 8500 3800
Wire Wire Line
	8050 3900 8500 3900
Wire Wire Line
	8050 4000 8500 4000
Wire Wire Line
	8050 4100 8500 4100
Wire Wire Line
	8050 4200 8500 4200
Wire Wire Line
	8050 4300 8500 4300
Wire Wire Line
	8050 4400 8500 4400
Wire Wire Line
	8050 4500 8500 4500
Wire Wire Line
	8050 4600 8500 4600
Text Label 7100 3500 0    50   ~ 0
PAS_P_0
Text Label 7100 3600 0    50   ~ 0
PAS_N_0
Text Label 7100 3700 0    50   ~ 0
SIG_P_0
Text Label 7100 3800 0    50   ~ 0
SIG_N_0
Text Label 7100 3900 0    50   ~ 0
PAS_P_1
Text Label 7100 4000 0    50   ~ 0
PAS_N_1
Text Label 7100 4100 0    50   ~ 0
SIG_P_1
Text Label 7100 4200 0    50   ~ 0
SIG_N_1
Text Label 7100 4300 0    50   ~ 0
ST03_0
Text Label 7100 4400 0    50   ~ 0
ST47_0
Text Label 7100 4500 0    50   ~ 0
~IT03_0
Text Label 7100 4600 0    50   ~ 0
~IT47_0
Text Label 8100 3500 0    50   ~ 0
LV_PRSNT_0
Text Label 8100 3600 0    50   ~ 0
LV_PRSNT_1
Text Label 8100 3700 0    50   ~ 0
LV_PRSNT_2
Text Label 8100 3800 0    50   ~ 0
ST03_1
Text Label 8100 3900 0    50   ~ 0
ST47_1
Text Label 8100 4000 0    50   ~ 0
~IT03_1
Text Label 8100 4100 0    50   ~ 0
~IT47_1
Text Label 8100 4200 0    50   ~ 0
ST03_2
Text Label 8100 4300 0    50   ~ 0
ST47_2
Text Label 8100 4400 0    50   ~ 0
~IT03_2
Text Label 8100 4500 0    50   ~ 0
~IT47_2
Text Label 8100 4600 0    50   ~ 0
GND
$Comp
L power:GND #PWR0101
U 1 1 61336BE3
P 8500 4600
F 0 "#PWR0101" H 8500 4350 50  0001 C CNN
F 1 "GND" H 8505 4427 50  0000 C CNN
F 2 "" H 8500 4600 50  0001 C CNN
F 3 "" H 8500 4600 50  0001 C CNN
	1    8500 4600
	1    0    0    -1  
$EndComp
$Comp
L Mechanical:MountingHole H1
U 1 1 61340C19
P 6550 5350
F 0 "H1" H 6650 5396 50  0000 L CNN
F 1 "MountingHole" H 6650 5305 50  0000 L CNN
F 2 "MountingHole:MountingHole_3.2mm_M3" H 6550 5350 50  0001 C CNN
F 3 "~" H 6550 5350 50  0001 C CNN
	1    6550 5350
	1    0    0    -1  
$EndComp
$Comp
L Mechanical:MountingHole H3
U 1 1 6134150B
P 6750 5350
F 0 "H3" H 6850 5396 50  0000 L CNN
F 1 "MountingHole" H 6850 5305 50  0000 L CNN
F 2 "MountingHole:MountingHole_3.2mm_M3" H 6750 5350 50  0001 C CNN
F 3 "~" H 6750 5350 50  0001 C CNN
	1    6750 5350
	1    0    0    -1  
$EndComp
$Comp
L Mechanical:MountingHole H5
U 1 1 6134170B
P 6950 5350
F 0 "H5" H 7050 5396 50  0000 L CNN
F 1 "MountingHole" H 7050 5305 50  0000 L CNN
F 2 "MountingHole:MountingHole_3.2mm_M3" H 6950 5350 50  0001 C CNN
F 3 "~" H 6950 5350 50  0001 C CNN
	1    6950 5350
	1    0    0    -1  
$EndComp
$Comp
L Mechanical:MountingHole H7
U 1 1 613418C0
P 7150 5350
F 0 "H7" H 7250 5396 50  0000 L CNN
F 1 "MountingHole" H 7250 5305 50  0000 L CNN
F 2 "MountingHole:MountingHole_3.2mm_M3" H 7150 5350 50  0001 C CNN
F 3 "~" H 7150 5350 50  0001 C CNN
	1    7150 5350
	1    0    0    -1  
$EndComp
$Comp
L Mechanical:MountingHole H2
U 1 1 61341B2D
P 6550 5550
F 0 "H2" H 6650 5596 50  0000 L CNN
F 1 "MountingHole" H 6650 5505 50  0000 L CNN
F 2 "MountingHole:MountingHole_3.2mm_M3" H 6550 5550 50  0001 C CNN
F 3 "~" H 6550 5550 50  0001 C CNN
	1    6550 5550
	1    0    0    -1  
$EndComp
$Comp
L Mechanical:MountingHole H4
U 1 1 61341FB3
P 6750 5550
F 0 "H4" H 6850 5596 50  0000 L CNN
F 1 "MountingHole" H 6850 5505 50  0000 L CNN
F 2 "MountingHole:MountingHole_3.2mm_M3" H 6750 5550 50  0001 C CNN
F 3 "~" H 6750 5550 50  0001 C CNN
	1    6750 5550
	1    0    0    -1  
$EndComp
$Comp
L Mechanical:MountingHole H6
U 1 1 6134214D
P 6950 5550
F 0 "H6" H 7050 5596 50  0000 L CNN
F 1 "MountingHole" H 7050 5505 50  0000 L CNN
F 2 "MountingHole:MountingHole_3.2mm_M3" H 6950 5550 50  0001 C CNN
F 3 "~" H 6950 5550 50  0001 C CNN
	1    6950 5550
	1    0    0    -1  
$EndComp
$Comp
L Mechanical:MountingHole H8
U 1 1 6134240B
P 7150 5550
F 0 "H8" H 7250 5596 50  0000 L CNN
F 1 "MountingHole" H 7250 5505 50  0000 L CNN
F 2 "MountingHole:MountingHole_3.2mm_M3" H 7150 5550 50  0001 C CNN
F 3 "~" H 7150 5550 50  0001 C CNN
	1    7150 5550
	1    0    0    -1  
$EndComp
$EndSCHEMATC
