*****************************************************************
Pin Report - Date: Fri May 26 13:30:13 2017 Pinchecksum: NOT-AVAILABLE
Product: Designer
Release: v11.7
Version: 11.7.0.119
Design Name: GefeTop
Family: ProASIC3L
Die: A3PE3000L
Package: 896 FBGA
*****************************************************************

-----------------------------------------------------------------
Flash*Freeze information
        Pin name  : AH4
        Pin usage : Available as a regular pin
-----------------------------------------------------------------

Number |Port                     |Function            |State       |I/O Std     |Output Drive (mA) |Slew |Resistor Pull |Schmitt Trigger |Input Delay |Skew |Output Load (pF) |Use I/O Reg |Hot Swappable |
-------|-------------------------|--------------------|------------|------------|------------------|-----|--------------|----------------|------------|-----|-----------------|------------|--------------|
A2                                GND                  Reserved
A3                                GND                  Reserved
A4                                IO14NPB0V1           Unassigned
A5                                GND                  Reserved
A6                                IO07NPB0V0           Unassigned
A7                                GND                  Reserved
A8      GbtxElinksDout_ib24n[29]  IO09NDB0V1           Fixed        LVDS         ---                ---   ---            ---              Off          ---   ---               No           Yes
A9      GbtxElinksDout_ib24n[28]  IO17NDB0V2           Fixed        LVDS         ---                ---   ---            ---              Off          ---   ---               No           Yes
A10     GbtxElinksDout_ib24p[28]  IO17PDB0V2           Fixed        LVDS         ---                ---   ---            ---              Off          ---   ---               Yes          Yes
A11     DipSwitch_ib8[0]          IO21NDB0V2           Fixed        LVCMOS25     ---                ---   None           Yes              Off          ---   ---               No           Yes
A12                               IO21PDB0V2           Unassigned
A13                               IO33NDB0V4           Unassigned
A14                               IO33PDB0V4           Unassigned
A15                               IO35NDB0V4           Unassigned
A16                               IO35PDB0V4           Unassigned
A17                               IO41NDB1V0           Unassigned
A18                               IO43NDB1V0           Unassigned
A19                               IO43PDB1V0           Unassigned
A20                               IO45NDB1V0           Unassigned
A21                               IO45PDB1V0           Unassigned
A22                               IO57NDB1V2           Unassigned
A23                               IO57PDB1V2           Unassigned
A24                               GND                  Reserved
A25                               IO69PPB1V3           Unassigned
A26                               GND                  Reserved
A27                               GBC1/IO79PPB1V4      Special
A28                               GND                  Reserved
A29                               GND                  Reserved
AA1     GbtxElinksDin_ob40p[33]   IO256PDB6V2          Fixed        LVDS         24                 High  ---            ---              ---          ---   0                 Yes          Yes
AA2     GbtxElinksDin_ob40p[24]   IO248PDB6V1          Fixed        LVDS         24                 High  ---            ---              ---          ---   0                 Yes          Yes
AA3     GbtxElinksDin_ob40n[24]   IO248NDB6V1          Fixed        LVDS         24                 High  ---            ---              ---          ---   0                 No           Yes
AA4     GbtxElinksDin_ob40n[27]   IO246NDB6V1          Fixed        LVDS         24                 High  ---            ---              ---          ---   0                 No           Yes
AA5                               GEA1/IO234PDB6V0     Special
AA6                               GEA0/IO234NDB6V0     Special
AA7                               IO243PPB6V1          Unassigned
AA8     GbtxElinksDin_ob40n[22]   IO245NDB6V1          Fixed        LVDS         24                 High  ---            ---              ---          ---   0                 No           Yes
AA9                               GEB1/IO235PPB6V0     Special
AA10                              VCC                  Reserved
AA11                              IO226PPB5V4          Unassigned
AA12                              VCCIB5               Reserved
AA13                              VCCIB5               Reserved
AA14                              VCCIB5               Reserved
AA15                              VCCIB5               Reserved
AA16                              VCCIB4               Reserved
AA17                              VCCIB4               Reserved
AA18                              VCCIB4               Reserved
AA19                              VCCIB4               Reserved
AA20                              IO174PDB4V2          Unassigned
AA21                              VCC                  Reserved
AA22                              IO142NPB3V3          Unassigned
AA23                              IO144NDB3V3          Unassigned
AA24                              IO144PDB3V3          Unassigned
AA25                              IO146NDB3V4          Unassigned
AA26                              IO146PDB3V4          Unassigned
AA27                              IO147PDB3V4          Unassigned
AA28                              IO139NDB3V3          Unassigned
AA29                              IO139PDB3V3          Unassigned
AA30                              IO133NDB3V2          Unassigned
AB1     GbtxElinksDin_ob40n[33]   IO256NDB6V2          Fixed        LVDS         24                 High  ---            ---              ---          ---   0                 No           Yes
AB2     GbtxElinksDin_ob40p[23]   IO244PDB6V1          Fixed        LVDS         24                 High  ---            ---              ---          ---   0                 Yes          Yes
AB3     GbtxElinksDin_ob40n[23]   IO244NDB6V1          Fixed        LVDS         24                 High  ---            ---              ---          ---   0                 No           Yes
AB4     GbtxElinksDin_ob40p[7]    IO241PDB6V0          Fixed        LVDS         24                 High  ---            ---              ---          ---   0                 Yes          Yes
AB5     GbtxElinksDin_ob40n[7]    IO241NDB6V0          Fixed        LVDS         24                 High  ---            ---              ---          ---   0                 No           Yes
AB6     Leds_onb6[4]              IO243NPB6V1          Fixed        LVCMOS25     12                 High  None           ---              ---          No    5                 No           Yes
AB7                               VCCIB6               Reserved
AB8                               VCCPLE               Reserved
AB9                               VCC                  Reserved
AB10                              IO222PDB5V3          Unassigned
AB11                              IO218PPB5V3          Unassigned
AB12    GbtxElinksDin_ob40n[14]   IO206NDB5V1          Fixed        LVDS         24                 High  ---            ---              ---          ---   0                 No           Yes
AB13    GbtxElinksDin_ob40p[14]   IO206PDB5V1          Fixed        LVDS         24                 High  ---            ---              ---          ---   0                 Yes          Yes
AB14    GbtxElinksDin_ob40n[11]   IO198NDB5V0          Fixed        LVDS         24                 High  ---            ---              ---          ---   0                 No           Yes
AB15    GbtxElinksDin_ob40p[11]   IO198PDB5V0          Fixed        LVDS         24                 High  ---            ---              ---          ---   0                 Yes          Yes
AB16    ElectSerialLinkTx_o       IO192NDB4V4          Assigned     LVCMOS25_50  12                 High  None           ---              ---          No    5                 No           No
AB17                              IO192PDB4V4          Unassigned
AB18                              IO178NDB4V3          Unassigned
AB19                              IO178PDB4V3          Unassigned
AB20                              IO174NDB4V2          Unassigned
AB21                              IO162NPB4V1          Unassigned
AB22                              VCC                  Reserved
AB23                              VCCPLD               Reserved
AB24                              VCCIB3               Reserved
AB25                              IO150PDB3V4          Unassigned
AB26                              IO148PDB3V4          Unassigned
AB27                              IO147NDB3V4          Unassigned
AB28                              IO145PDB3V3          Unassigned
AB29                              IO143PDB3V3          Unassigned
AB30                              IO137PDB3V2          Unassigned
AC1     GbtxElinksDin_ob40p[34]   IO254PDB6V2          Fixed        LVDS         24                 High  ---            ---              ---          ---   0                 Yes          Yes
AC2     GbtxElinksDin_ob40n[34]   IO254NDB6V2          Fixed        LVDS         24                 High  ---            ---              ---          ---   0                 No           Yes
AC3     GbtxElinksDin_ob40p[28]   IO240PDB6V0          Fixed        LVDS         24                 High  ---            ---              ---          ---   0                 Yes          Yes
AC4                               GEC1/IO236PDB6V0     Special
AC5     GbtxElinksDin_ob40p[31]   IO237PDB6V0          Fixed        LVDS         24                 High  ---            ---              ---          ---   0                 Yes          Yes
AC6     GbtxElinksDin_ob40n[31]   IO237NDB6V0          Fixed        LVDS         24                 High  ---            ---              ---          ---   0                 No           Yes
AC7                               VCOMPLE              Reserved
AC8                               GND                  Reserved
AC9     FmcTdo_o                  IO226NPB5V4          Assigned     LVCMOS25_50  12                 High  None           ---              ---          No    5                 No           No
AC10                              IO222NDB5V3          Unassigned
AC11                              IO216NPB5V2          Unassigned
AC12                              IO210NPB5V2          Unassigned
AC13    GbtxElinksDin_ob40n[13]   IO204NDB5V1          Fixed        LVDS         24                 High  ---            ---              ---          ---   0                 No           Yes
AC14    GbtxElinksDin_ob40p[13]   IO204PDB5V1          Fixed        LVDS         24                 High  ---            ---              ---          ---   0                 Yes          Yes
AC15    GbtxElinksDin_ob40n[32]   IO194NDB5V0          Fixed        LVDS         24                 High  ---            ---              ---          ---   0                 No           Yes
AC16                              IO188NDB4V4          Unassigned
AC17                              IO188PDB4V4          Unassigned
AC18                              IO182PPB4V3          Unassigned
AC19                              IO170NPB4V2          Unassigned
AC20                              IO164NDB4V1          Unassigned
AC21                              IO164PDB4V1          Unassigned
AC22                              IO162PPB4V1          Unassigned
AC23                              GND                  Reserved
AC24                              VCOMPLD              Reserved
AC25                              IO150NDB3V4          Unassigned
AC26                              IO148NDB3V4          Unassigned
AC27                              GDA1/IO153PDB3V4     Special
AC28                              IO145NDB3V3          Unassigned
AC29                              IO143NDB3V3          Unassigned
AC30                              IO137NDB3V2          Unassigned
AD1                               GND                  Reserved
AD2     Leds_onb6[5]              IO242NPB6V1          Fixed        LVCMOS25     12                 High  None           ---              ---          No    5                 No           Yes
AD3     GbtxElinksDin_ob40n[28]   IO240NDB6V0          Fixed        LVDS         24                 High  ---            ---              ---          ---   0                 No           Yes
AD4                               GEC0/IO236NDB6V0     Special
AD5                               VCCIB6               Reserved
AD6                               GNDQ                 Reserved
AD7                               VCC                  Reserved
AD8                               VMV5                 Reserved
AD9                               VCCIB5               Reserved
AD10                              IO224PPB5V3          Unassigned
AD11                              IO218NPB5V3          Unassigned
AD12                              IO216PPB5V2          Unassigned
AD13    V3p3Inhibit_o             IO210PPB5V2          Assigned     LVCMOS25_50  12                 High  None           ---              ---          No    5                 No           No
AD14    LemoGpioDir_o             IO202PPB5V1          Assigned     LVCMOS25_50  12                 High  None           ---              ---          No    5                 No           No
AD15    GbtxElinksDin_ob40p[32]   IO194PDB5V0          Fixed        LVDS         24                 High  ---            ---              ---          ---   0                 Yes          Yes
AD16                              IO190PDB4V4          Unassigned
AD17                              IO182NPB4V3          Unassigned
AD18                              IO176NDB4V2          Unassigned
AD19                              IO176PDB4V2          Unassigned
AD20                              IO170PPB4V2          Unassigned
AD21                              IO166PDB4V1          Unassigned
AD22                              VCCIB4               Reserved
AD23    atck                      TCK                  Dedicated
AD24                              VCC                  Reserved
AD25    atrstb                    TRST                 Dedicated
AD26                              VCCIB3               Reserved
AD27                              GDA0/IO153NDB3V4     Special
AD28                              GDC0/IO151NDB3V4     Special
AD29                              GDC1/IO151PDB3V4     Special
AD30                              GND                  Reserved
AE1     Leds_onb6[0]              IO242PPB6V1          Fixed        LVCMOS25     12                 High  None           ---              ---          No    5                 No           Yes
AE2                               VCC                  Reserved
AE3     GbtxElinksDin_ob40p[4]    IO239PDB6V0          Fixed        LVDS         24                 High  ---            ---              ---          ---   0                 Yes          Yes
AE4     GbtxElinksDin_ob40n[4]    IO239NDB6V0          Fixed        LVDS         24                 High  ---            ---              ---          ---   0                 No           Yes
AE5                               VMV6                 Reserved
AE6                               GND                  Reserved
AE7                               GNDQ                 Reserved
AE8                               IO230NDB5V4          Unassigned
AE9                               IO224NPB5V3          Unassigned
AE10                              IO214NPB5V2          Unassigned
AE11                              IO212NDB5V2          Unassigned
AE12                              IO212PDB5V2          Unassigned
AE13                              IO202NPB5V1          Unassigned
AE14    GbtxElinksDin_ob40n[6]    IO200NDB5V0          Fixed        LVDS         24                 High  ---            ---              ---          ---   0                 No           Yes
AE15    GbtxElinksDin_ob40p[38]   IO196PDB5V0          Fixed        LVDS         24                 High  ---            ---              ---          ---   0                 Yes          Yes
AE16                              IO190NDB4V4          Unassigned
AE17    FmcTms_o                  IO184PDB4V3          Assigned     LVCMOS25_50  12                 High  None           ---              ---          No    5                 No           No
AE18                              IO184NDB4V3          Unassigned
AE19                              IO172PDB4V2          Unassigned
AE20                              IO172NDB4V2          Unassigned
AE21                              IO166NDB4V1          Unassigned
AE22                              IO160PDB4V0          Unassigned
AE23                              GNDQ                 Reserved
AE24                              VMV4                 Reserved
AE25                              GND                  Reserved
AE26                              GDB0/IO152NDB3V4     Special
AE27                              GDB1/IO152PDB3V4     Special
AE28                              VMV3                 Reserved
AE29                              VCC                  Reserved
AE30                              IO149PDB3V4          Unassigned
AF1                               GND                  Reserved
AF2     Leds_onb6[1]              IO238PPB6V0          Fixed        LVCMOS25     12                 High  None           ---              ---          No    5                 No           Yes
AF3                               VCCIB6               Reserved
AF4                               IO220NPB5V3          Unassigned
AF5                               VCC                  Reserved
AF6                               IO228NDB5V4          Unassigned
AF7                               VCCIB5               Reserved
AF8                               IO230PDB5V4          Unassigned
AF9                               IO229NDB5V4          Unassigned
AF10                              IO229PDB5V4          Unassigned
AF11                              IO214PPB5V2          Unassigned
AF12    GbtxElinksDin_ob40n[10]   IO208NDB5V1          Fixed        LVDS         24                 High  ---            ---              ---          ---   0                 No           Yes
AF13    GbtxElinksDin_ob40p[10]   IO208PDB5V1          Fixed        LVDS         24                 High  ---            ---              ---          ---   0                 Yes          Yes
AF14    GbtxElinksDin_ob40p[6]    IO200PDB5V0          Fixed        LVDS         24                 High  ---            ---              ---          ---   0                 Yes          Yes
AF15    GbtxElinksDin_ob40n[38]   IO196NDB5V0          Fixed        LVDS         24                 High  ---            ---              ---          ---   0                 No           Yes
AF16                              IO186NDB4V4          Unassigned
AF17                              IO186PDB4V4          Unassigned
AF18                              IO180NDB4V3          Unassigned
AF19                              IO180PDB4V3          Unassigned
AF20                              IO168NDB4V1          Unassigned
AF21                              IO168PDB4V1          Unassigned
AF22                              IO160NDB4V0          Unassigned
AF23                              IO158NPB4V0          Unassigned
AF24                              VCCIB4               Reserved
AF25                              IO154NPB4V0          Unassigned
AF26                              VCC                  Reserved
AF27    atdo                      TDO                  Dedicated
AF28                              VCCIB3               Reserved
AF29                              GNDQ                 Reserved
AF30                              GND                  Reserved
AG1     Leds_onb6[2]              IO238NPB6V0          Fixed        LVCMOS25     12                 High  None           ---              ---          No    5                 No           Yes
AG2                               VCC                  Reserved
AG3                               IO232NPB5V4          Unassigned
AG4                               GND                  Reserved
AG5                               IO220PPB5V3          Unassigned
AG6                               IO228PDB5V4          Unassigned
AG7                               IO231NDB5V4          Unassigned
AG8                               GEC2/IO231PDB5V4     Special
AG9                               IO225NPB5V3          Unassigned
AG10                              IO223NPB5V3          Unassigned
AG11                              IO221PDB5V3          Unassigned
AG12                              IO221NDB5V3          Unassigned
AG13                              IO205NPB5V1          Unassigned
AG14    GbtxElinksDin_ob40n[5]    IO199NDB5V0          Fixed        LVDS         24                 High  ---            ---              ---          ---   0                 No           Yes
AG15    GbtxElinksDin_ob40p[5]    IO199PDB5V0          Fixed        LVDS         24                 High  ---            ---              ---          ---   0                 Yes          Yes
AG16                              IO187NDB4V4          Unassigned
AG17                              IO187PDB4V4          Unassigned
AG18                              IO181NDB4V3          Unassigned
AG19                              IO171PPB4V2          Unassigned
AG20                              IO165NPB4V1          Unassigned
AG21                              IO161NPB4V0          Unassigned
AG22                              IO159NDB4V0          Unassigned
AG23                              IO159PDB4V0          Unassigned
AG24                              IO158PPB4V0          Unassigned
AG25                              GDB2/IO155PDB4V0     Special
AG26                              GDA2/IO154PPB4V0     Special
AG27                              GND                  Reserved
AG28                              VJTAG                Reserved
AG29                              VCC                  Reserved
AG30                              IO149NDB3V4          Unassigned
AH1                               GND                  Reserved
AH2                               IO233NPB5V4          Unassigned
AH3                               VCC                  Reserved
AH4                               FF/GEB2/IO232PPB5V4  Special
AH5                               VCCIB5               Reserved
AH6                               IO219NDB5V3          Unassigned
AH7                               IO219PDB5V3          Unassigned
AH8                               IO227NDB5V4          Unassigned
AH9                               IO227PDB5V4          Unassigned
AH10                              IO225PPB5V3          Unassigned
AH11                              IO223PPB5V3          Unassigned
AH12                              IO211NDB5V2          Unassigned
AH13                              IO211PDB5V2          Unassigned
AH14                              IO205PPB5V1          Unassigned
AH15    GbtxElinksDin_ob40n[3]    IO195NDB5V0          Fixed        LVDS         24                 High  ---            ---              ---          ---   0                 No           Yes
AH16                              IO185NDB4V3          Unassigned
AH17                              IO185PDB4V3          Unassigned
AH18                              IO181PDB4V3          Unassigned
AH19                              IO177NDB4V2          Unassigned
AH20                              IO171NPB4V2          Unassigned
AH21                              IO165PPB4V1          Unassigned
AH22                              IO161PPB4V0          Unassigned
AH23                              IO157NDB4V0          Unassigned
AH24                              IO157PDB4V0          Unassigned
AH25                              IO155NDB4V0          Unassigned
AH26                              VCCIB4               Reserved
AH27    atdi                      TDI                  Dedicated
AH28                              VCC                  Reserved
AH29                              VPUMP                Reserved
AH30                              GND                  Reserved
AJ1                               GND                  Reserved
AJ2                               GND                  Reserved
AJ3                               GEA2/IO233PPB5V4     Special
AJ4                               VCC                  Reserved
AJ5                               IO217NPB5V2          Unassigned
AJ6                               VCC                  Reserved
AJ7                               IO215NPB5V2          Unassigned
AJ8                               IO213NDB5V2          Unassigned
AJ9                               IO213PDB5V2          Unassigned
AJ10                              IO209NDB5V1          Unassigned
AJ11                              IO209PDB5V1          Unassigned
AJ12    GbtxElinksDin_ob40n[2]    IO203NDB5V1          Fixed        LVDS         24                 High  ---            ---              ---          ---   0                 No           Yes
AJ13    GbtxElinksDin_ob40p[2]    IO203PDB5V1          Fixed        LVDS         24                 High  ---            ---              ---          ---   0                 Yes          Yes
AJ14    GbtxElinksDin_ob40n[30]   IO197NDB5V0          Fixed        LVDS         24                 High  ---            ---              ---          ---   0                 No           Yes
AJ15    GbtxElinksDin_ob40p[3]    IO195PDB5V0          Fixed        LVDS         24                 High  ---            ---              ---          ---   0                 Yes          Yes
AJ16                              IO183NDB4V3          Unassigned
AJ17                              IO183PDB4V3          Unassigned
AJ18                              IO179NPB4V3          Unassigned
AJ19    FmcTck_o                  IO177PDB4V2          Assigned     LVCMOS25_50  12                 High  None           ---              ---          No    5                 No           No
AJ20                              IO173NDB4V2          Unassigned
AJ21                              IO173PDB4V2          Unassigned
AJ22                              IO163NDB4V1          Unassigned
AJ23                              IO163PDB4V1          Unassigned
AJ24                              IO167NPB4V1          Unassigned
AJ25                              VCC                  Reserved
AJ26                              IO156NPB4V0          Unassigned
AJ27                              VCC                  Reserved
AJ28    atms                      TMS                  Dedicated
AJ29                              GND                  Reserved
AJ30                              GND                  Reserved
AK2                               GND                  Reserved
AK3                               GND                  Reserved
AK4                               IO217PPB5V2          Unassigned
AK5                               GND                  Reserved
AK6     FmcPowerGoodC2m_o         IO215PPB5V2          Assigned     LVCMOS25_50  12                 High  None           ---              ---          No    5                 No           No
AK7                               GND                  Reserved
AK8     GbtxElinksDin_ob40n[1]    IO207NDB5V1          Fixed        LVDS         24                 High  ---            ---              ---          ---   0                 No           Yes
AK9     GbtxElinksDin_ob40p[1]    IO207PDB5V1          Fixed        LVDS         24                 High  ---            ---              ---          ---   0                 Yes          Yes
AK10    GbtxElinksDin_ob40n[0]    IO201NDB5V0          Fixed        LVDS         24                 High  ---            ---              ---          ---   0                 No           Yes
AK11    GbtxElinksDin_ob40p[0]    IO201PDB5V0          Fixed        LVDS         24                 High  ---            ---              ---          ---   0                 Yes          Yes
AK12                              IO193NDB4V4          Unassigned
AK13                              IO193PDB4V4          Unassigned
AK14    GbtxElinksDin_ob40p[30]   IO197PDB5V0          Fixed        LVDS         24                 High  ---            ---              ---          ---   0                 Yes          Yes
AK15                              IO191NDB4V4          Unassigned
AK16                              IO191PDB4V4          Unassigned
AK17                              IO189NDB4V4          Unassigned
AK18                              IO189PDB4V4          Unassigned
AK19                              IO179PPB4V3          Unassigned
AK20                              IO175NDB4V2          Unassigned
AK21                              IO175PDB4V2          Unassigned
AK22                              IO169NDB4V1          Unassigned
AK23                              IO169PDB4V1          Unassigned
AK24                              GND                  Reserved
AK25                              IO167PPB4V1          Unassigned
AK26                              GND                  Reserved
AK27                              GDC2/IO156PPB4V0     Special
AK28                              GND                  Reserved
AK29                              GND                  Reserved
B1                                GND                  Reserved
B2                                GND                  Reserved
B3                                GAA2/IO309PPB7V4     Special
B4                                VCC                  Reserved
B5      V2p5PowerGood_i           IO14PPB0V1           Fixed        LVCMOS25     ---                ---   None           No               Off          ---   ---               No           Yes
B6                                VCC                  Reserved
B7                                IO07PPB0V0           Unassigned
B8      GbtxElinksDout_ib24p[29]  IO09PDB0V1           Fixed        LVDS         ---                ---   ---            ---              Off          ---   ---               Yes          Yes
B9      V1p5PowerGood_i           IO15PPB0V1           Fixed        LVCMOS25     ---                ---   None           No               Off          ---   ---               No           Yes
B10     GbtxElinksDout_ib24n[39]  IO19NDB0V2           Fixed        LVDS         ---                ---   ---            ---              Off          ---   ---               No           Yes
B11     GbtxElinksDout_ib24p[39]  IO19PDB0V2           Fixed        LVDS         ---                ---   ---            ---              Off          ---   ---               Yes          Yes
B12                               IO29NDB0V3           Unassigned
B13                               IO29PDB0V3           Unassigned
B14                               IO31PPB0V3           Unassigned
B15                               IO37NDB0V4           Unassigned
B16                               IO37PDB0V4           Unassigned
B17                               IO41PDB1V0           Unassigned
B18                               IO51NDB1V1           Unassigned
B19                               IO59PDB1V2           Unassigned
B20                               IO53PDB1V1           Unassigned
B21                               IO53NDB1V1           Unassigned
B22                               IO61NDB1V2           Unassigned
B23                               IO61PDB1V2           Unassigned
B24                               IO69NPB1V3           Unassigned
B25                               VCC                  Reserved
B26                               GBC0/IO79NPB1V4      Special
B27                               VCC                  Reserved
B28                               IO64NPB1V2           Unassigned
B29                               GND                  Reserved
B30                               GND                  Reserved
C1                                GND                  Reserved
C2                                IO309NPB7V4          Unassigned
C3                                VCC                  Reserved
C4                                GAA0/IO00NPB0V0      Special
C5                                VCCIB0               Reserved
C6      GbtxElinksDout_ib24p[34]  IO03PDB0V0           Fixed        LVDS         ---                ---   ---            ---              Off          ---   ---               Yes          Yes
C7      GbtxElinksDout_ib24n[34]  IO03NDB0V0           Fixed        LVDS         ---                ---   ---            ---              Off          ---   ---               No           Yes
C8                                GAB1/IO01PDB0V0      Special
C9      GbtxElinksDout_ib24p[36]  IO05PDB0V0           Fixed        LVDS         ---                ---   ---            ---              Off          ---   ---               Yes          Yes
C10                               IO15NPB0V1           Unassigned
C11                               IO25NDB0V3           Unassigned
C12                               IO25PDB0V3           Unassigned
C13                               IO31NPB0V3           Unassigned
C14                               IO27NDB0V3           Unassigned
C15                               IO39NDB0V4           Unassigned
C16                               IO39PDB0V4           Unassigned
C17                               IO55PPB1V1           Unassigned
C18                               IO51PDB1V1           Unassigned
C19                               IO59NDB1V2           Unassigned
C20                               IO63NDB1V2           Unassigned
C21                               IO63PDB1V2           Unassigned
C22                               IO67NDB1V3           Unassigned
C23                               IO67PDB1V3           Unassigned
C24                               IO75NDB1V4           Unassigned
C25                               IO75PDB1V4           Unassigned
C26                               VCCIB1               Reserved
C27                               IO64PPB1V2           Unassigned
C28                               VCC                  Reserved
C29                               GBA1/IO81PPB1V4      Special
C30                               GND                  Reserved
D1      GbtxTxDataValid_o         IO303PPB7V3          Fixed        LVCMOS25     12                 High  None           ---              ---          No    5                 No           Yes
D2                                VCC                  Reserved
D3                                IO305NPB7V3          Unassigned
D4                                GND                  Reserved
D5                                GAA1/IO00PPB0V0      Special
D6                                GAC1/IO02PDB0V0      Special
D7                                IO06NPB0V0           Unassigned
D8                                GAB0/IO01NDB0V0      Special
D9      GbtxElinksDout_ib24n[36]  IO05NDB0V0           Fixed        LVDS         ---                ---   ---            ---              Off          ---   ---               No           Yes
D10     GbtxElinksDout_ib24n[32]  IO11NDB0V1           Fixed        LVDS         ---                ---   ---            ---              Off          ---   ---               No           Yes
D11     GbtxElinksDout_ib24p[32]  IO11PDB0V1           Fixed        LVDS         ---                ---   ---            ---              Off          ---   ---               Yes          Yes
D12     GbtxElinksScIn_on         IO23NDB0V2           Fixed        LVDS         24                 High  ---            ---              ---          ---   0                 No           Yes
D13     GbtxElinksScIn_op         IO23PDB0V2           Fixed        LVDS         24                 High  ---            ---              ---          ---   0                 Yes          Yes
D14                               IO27PDB0V3           Unassigned
D15                               IO40PDB0V4           Unassigned
D16                               IO47NDB1V0           Unassigned
D17                               IO47PDB1V0           Unassigned
D18                               IO55NPB1V1           Unassigned
D19                               IO65NDB1V3           Unassigned
D20                               IO65PDB1V3           Unassigned
D21                               IO71NDB1V3           Unassigned
D22                               IO71PDB1V3           Unassigned
D23                               IO73NDB1V4           Unassigned
D24                               IO73PDB1V4           Unassigned
D25                               IO74NDB1V4           Unassigned
D26                               GBB0/IO80NPB1V4      Special
D27                               GND                  Reserved
D28                               GBA0/IO81NPB1V4      Special
D29                               VCC                  Reserved
D30                               GBA2/IO82PPB2V0      Special
E1                                GND                  Reserved
E2                                IO303NPB7V3          Unassigned
E3                                VCCIB7               Reserved
E4      GbtxRxDataValid_i         IO305PPB7V3          Fixed        LVCMOS25     ---                ---   None           No               Off          ---   ---               No           Yes
E5                                VCC                  Reserved
E6                                GAC0/IO02NDB0V0      Special
E7                                VCCIB0               Reserved
E8                                IO06PPB0V0           Unassigned
E9                                IO24NDB0V2           Unassigned
E10                               IO24PDB0V2           Unassigned
E11     GbtxElinksDout_ib24n[37]  IO13NDB0V1           Fixed        LVDS         ---                ---   ---            ---              Off          ---   ---               No           Yes
E12     GbtxElinksDout_ib24p[37]  IO13PDB0V1           Fixed        LVDS         ---                ---   ---            ---              Off          ---   ---               Yes          Yes
E13                               IO34NDB0V4           Unassigned
E14                               IO34PDB0V4           Unassigned
E15                               IO40NDB0V4           Unassigned
E16                               IO49NDB1V1           Unassigned
E17                               IO49PDB1V1           Unassigned
E18                               IO50PDB1V1           Unassigned
E19                               IO58PDB1V2           Unassigned
E20                               IO60NDB1V2           Unassigned
E21                               IO77PDB1V4           Unassigned
E22                               IO68NDB1V3           Unassigned
E23                               IO68PDB1V3           Unassigned
E24                               VCCIB1               Reserved
E25                               IO74PDB1V4           Unassigned
E26                               VCC                  Reserved
E27                               GBB1/IO80PPB1V4      Special
E28                               VCCIB2               Reserved
E29                               IO82NPB2V0           Unassigned
E30                               GND                  Reserved
F1                                IO296PPB7V2          Unassigned
F2                                VCC                  Reserved
F3      GbtxElinksDout_ib24p[23]  IO306PDB7V4          Fixed        LVDS         ---                ---   ---            ---              Off          ---   ---               Yes          Yes
F4      GbtxElinksDout_ib24p[16]  IO297PDB7V2          Fixed        LVDS         ---                ---   ---            ---              Off          ---   ---               Yes          Yes
F5                                VMV7                 Reserved
F6                                GND                  Reserved
F7                                GNDQ                 Reserved
F8      GbtxElinksDout_ib24n[33]  IO12NDB0V1           Fixed        LVDS         ---                ---   ---            ---              Off          ---   ---               No           Yes
F9      GbtxElinksDout_ib24p[33]  IO12PDB0V1           Fixed        LVDS         ---                ---   ---            ---              Off          ---   ---               Yes          Yes
F10     GbtxElinksDout_ib24p[35]  IO10PDB0V1           Fixed        LVDS         ---                ---   ---            ---              Off          ---   ---               Yes          Yes
F11     GbtxElinksDout_ib24p[38]  IO16PDB0V1           Fixed        LVDS         ---                ---   ---            ---              Off          ---   ---               Yes          Yes
F12                               IO22NDB0V2           Unassigned
F13                               IO30NDB0V3           Unassigned
F14                               IO30PDB0V3           Unassigned
F15                               IO36PDB0V4           Unassigned
F16                               IO48NDB1V0           Unassigned
F17                               IO48PDB1V0           Unassigned
F18                               IO50NDB1V1           Unassigned
F19                               IO58NDB1V2           Unassigned
F20                               IO60PDB1V2           Unassigned
F21                               IO77NDB1V4           Unassigned
F22                               IO72NDB1V3           Unassigned
F23                               IO72PDB1V3           Unassigned
F24                               GNDQ                 Reserved
F25                               GND                  Reserved
F26                               VMV2                 Reserved
F27                               IO86PDB2V0           Unassigned
F28                               IO92PDB2V1           Unassigned
F29                               VCC                  Reserved
F30                               IO100NPB2V2          Unassigned
G1                                GND                  Reserved
G2                                IO296NPB7V2          Unassigned
G3      GbtxElinksDout_ib24n[23]  IO306NDB7V4          Fixed        LVDS         ---                ---   ---            ---              Off          ---   ---               No           Yes
G4      GbtxElinksDout_ib24n[16]  IO297NDB7V2          Fixed        LVDS         ---                ---   ---            ---              Off          ---   ---               No           Yes
G5                                VCCIB7               Reserved
G6                                GNDQ                 Reserved
G7                                VCC                  Reserved
G8                                VMV0                 Reserved
G9                                VCCIB0               Reserved
G10     GbtxElinksDout_ib24n[35]  IO10NDB0V1           Fixed        LVDS         ---                ---   ---            ---              Off          ---   ---               No           Yes
G11     GbtxElinksDout_ib24n[38]  IO16NDB0V1           Fixed        LVDS         ---                ---   ---            ---              Off          ---   ---               No           Yes
G12                               IO22PDB0V2           Unassigned
G13                               IO26PPB0V3           Unassigned
G14                               IO38NPB0V4           Unassigned
G15                               IO36NDB0V4           Unassigned
G16                               IO46NDB1V0           Unassigned
G17                               IO46PDB1V0           Unassigned
G18                               IO56NDB1V1           Unassigned
G19                               IO56PDB1V1           Unassigned
G20                               IO66NDB1V3           Unassigned
G21                               IO66PDB1V3           Unassigned
G22                               VCCIB1               Reserved
G23                               VMV1                 Reserved
G24                               VCC                  Reserved
G25                               GNDQ                 Reserved
G26                               VCCIB2               Reserved
G27                               IO86NDB2V0           Unassigned
G28     FmcTrstL_on               IO92NDB2V1           Assigned     LVCMOS25_50  12                 High  None           ---              ---          No    5                 No           No
G29                               IO100PPB2V2          Unassigned
G30                               GND                  Reserved
H1      GbtxElinksDout_ib24p[26]  IO294PDB7V2          Fixed        LVDS         ---                ---   ---            ---              Off          ---   ---               Yes          Yes
H2      GbtxElinksDout_ib24n[26]  IO294NDB7V2          Fixed        LVDS         ---                ---   ---            ---              Off          ---   ---               No           Yes
H3      GbtxElinksDout_ib24n[24]  IO300NDB7V3          Fixed        LVDS         ---                ---   ---            ---              Off          ---   ---               No           Yes
H4      GbtxElinksDout_ib24p[24]  IO300PDB7V3          Fixed        LVDS         ---                ---   ---            ---              Off          ---   ---               Yes          Yes
H5      GbtxElinksDout_ib24p[22]  IO295PDB7V2          Fixed        LVDS         ---                ---   ---            ---              Off          ---   ---               Yes          Yes
H6      GbtxElinksDout_ib24p[18]  IO299PDB7V3          Fixed        LVDS         ---                ---   ---            ---              Off          ---   ---               Yes          Yes
H7                                VCOMPLA              Reserved
H8                                GND                  Reserved
H9      GbtxElinksDout_ib24n[30]  IO08NDB0V0           Fixed        LVDS         ---                ---   ---            ---              Off          ---   ---               No           Yes
H10     GbtxElinksDout_ib24p[30]  IO08PDB0V0           Fixed        LVDS         ---                ---   ---            ---              Off          ---   ---               Yes          Yes
H11     GbtxElinksDout_ib24p[31]  IO18PDB0V2           Fixed        LVDS         ---                ---   ---            ---              Off          ---   ---               Yes          Yes
H12                               IO26NPB0V3           Unassigned
H13     GbtxElinksScOut_in        IO28NDB0V3           Fixed        LVDS         ---                ---   ---            ---              Off          ---   ---               No           Yes
H14     GbtxElinksScOut_ip        IO28PDB0V3           Fixed        LVDS         ---                ---   ---            ---              Off          ---   ---               Yes          Yes
H15                               IO38PPB0V4           Unassigned
H16                               IO42NDB1V0           Unassigned
H17                               IO52NDB1V1           Unassigned
H18                               IO52PDB1V1           Unassigned
H19                               IO62NDB1V2           Unassigned
H20                               IO62PDB1V2           Unassigned
H21                               IO70NDB1V3           Unassigned
H22                               IO70PDB1V3           Unassigned
H23                               GND                  Reserved
H24                               VCOMPLB              Reserved
H25                               GBC2/IO84PDB2V0      Special
H26                               IO84NDB2V0           Unassigned
H27                               IO96PDB2V1           Unassigned
H28                               IO96NDB2V1           Unassigned
H29                               IO89PDB2V0           Unassigned
H30                               IO89NDB2V0           Unassigned
J1      GbtxElinksDio_ib16n[13]   IO290NDB7V2          Fixed        LVDS         ---                ---   ---            ---              Off          ---   ---               No           Yes
J2      GbtxElinksDio_ib16p[13]   IO290PDB7V2          Fixed        LVDS         ---                ---   ---            ---              Off          ---   ---               Yes          Yes
J3      GbtxElinksDout_ib24n[27]  IO302NDB7V3          Fixed        LVDS         ---                ---   ---            ---              Off          ---   ---               No           Yes
J4      GbtxElinksDout_ib24p[27]  IO302PDB7V3          Fixed        LVDS         ---                ---   ---            ---              Off          ---   ---               Yes          Yes
J5      GbtxElinksDout_ib24n[22]  IO295NDB7V2          Fixed        LVDS         ---                ---   ---            ---              Off          ---   ---               No           Yes
J6      GbtxElinksDout_ib24n[18]  IO299NDB7V3          Fixed        LVDS         ---                ---   ---            ---              Off          ---   ---               No           Yes
J7                                VCCIB7               Reserved
J8                                VCCPLA               Reserved
J9                                VCC                  Reserved
J10                               IO04NPB0V0           Unassigned
J11     GbtxElinksDout_ib24n[31]  IO18NDB0V2           Fixed        LVDS         ---                ---   ---            ---              Off          ---   ---               No           Yes
J12                               IO20NDB0V2           Unassigned
J13                               IO20PDB0V2           Unassigned
J14                               IO32NDB0V3           Unassigned
J15                               IO32PDB0V3           Unassigned
J16                               IO42PDB1V0           Unassigned
J17                               IO44NDB1V0           Unassigned
J18                               IO44PDB1V0           Unassigned
J19                               IO54NDB1V1           Unassigned
J20                               IO54PDB1V1           Unassigned
J21                               IO76NPB1V4           Unassigned
J22                               VCC                  Reserved
J23                               VCCPLB               Reserved
J24                               VCCIB2               Reserved
J25                               IO90PDB2V1           Unassigned
J26                               IO90NDB2V1           Unassigned
J27                               GBB2/IO83PDB2V0      Special
J28                               IO83NDB2V0           Unassigned
J29                               IO91PDB2V1           Unassigned
J30                               IO91NDB2V1           Unassigned
K1      GbtxElinksDio_ib16n[12]   IO288NDB7V1          Fixed        LVDS         ---                ---   ---            ---              Off          ---   ---               No           Yes
K2      GbtxElinksDio_ib16p[12]   IO288PDB7V1          Fixed        LVDS         ---                ---   ---            ---              Off          ---   ---               Yes          Yes
K3      GbtxElinksDout_ib24n[25]  IO304NDB7V3          Fixed        LVDS         ---                ---   ---            ---              Off          ---   ---               No           Yes
K4      GbtxElinksDout_ib24p[25]  IO304PDB7V3          Fixed        LVDS         ---                ---   ---            ---              Off          ---   ---               Yes          Yes
K5      PushButton_i              GAB2/IO308PDB7V4     Special      LVCMOS25     ---                ---   None           Yes              Off          ---   ---               No           Yes
K6                                IO308NDB7V4          Unassigned
K7      GbtxElinksDout_ib24p[19]  IO301PDB7V3          Fixed        LVDS         ---                ---   ---            ---              Off          ---   ---               Yes          Yes
K8      GbtxElinksDout_ib24n[19]  IO301NDB7V3          Fixed        LVDS         ---                ---   ---            ---              Off          ---   ---               No           Yes
K9                                GAC2/IO307PPB7V4     Special
K10                               VCC                  Reserved
K11                               IO04PPB0V0           Unassigned
K12                               VCCIB0               Reserved
K13                               VCCIB0               Reserved
K14                               VCCIB0               Reserved
K15                               VCCIB0               Reserved
K16                               VCCIB1               Reserved
K17                               VCCIB1               Reserved
K18                               VCCIB1               Reserved
K19                               VCCIB1               Reserved
K20                               IO76PPB1V4           Unassigned
K21                               VCC                  Reserved
K22                               IO78PPB1V4           Unassigned
K23                               IO88NDB2V0           Unassigned
K24                               IO88PDB2V0           Unassigned
K25                               IO94PDB2V1           Unassigned
K26                               IO94NDB2V1           Unassigned
K27                               IO85PDB2V0           Unassigned
K28                               IO85NDB2V0           Unassigned
K29                               IO93PDB2V1           Unassigned
K30                               IO93NDB2V1           Unassigned
L1      GbtxElinksDio_ib16n[11]   IO286NDB7V1          Fixed        LVDS         ---                ---   ---            ---              Off          ---   ---               No           Yes
L2      GbtxElinksDio_ib16p[11]   IO286PDB7V1          Fixed        LVDS         ---                ---   ---            ---              Off          ---   ---               Yes          Yes
L3      GbtxElinksDout_ib24n[17]  IO298NDB7V3          Fixed        LVDS         ---                ---   ---            ---              Off          ---   ---               No           Yes
L4      GbtxElinksDout_ib24p[17]  IO298PDB7V3          Fixed        LVDS         ---                ---   ---            ---              Off          ---   ---               Yes          Yes
L5      GbtxElinksDout_ib24p[20]  IO283PDB7V1          Fixed        LVDS         ---                ---   ---            ---              Off          ---   ---               Yes          Yes
L6      GbtxElinksDout_ib24n[21]  IO291NDB7V2          Fixed        LVDS         ---                ---   ---            ---              Off          ---   ---               No           Yes
L7      GbtxElinksDout_ib24p[21]  IO291PDB7V2          Fixed        LVDS         ---                ---   ---            ---              Off          ---   ---               Yes          Yes
L8      GbtxElinksDio_ib16p[0]    IO293PDB7V2          Fixed        LVDS         ---                ---   ---            ---              Off          ---   ---               Yes          Yes
L9      GbtxElinksDio_ib16n[0]    IO293NDB7V2          Fixed        LVDS         ---                ---   ---            ---              Off          ---   ---               No           Yes
L10                               IO307NPB7V4          Unassigned
L11                               VCC                  Reserved
L12                               VCC                  Reserved
L13                               VCC                  Reserved
L14                               VCC                  Reserved
L15                               VCC                  Reserved
L16                               VCC                  Reserved
L17                               VCC                  Reserved
L18                               VCC                  Reserved
L19                               VCC                  Reserved
L20                               VCC                  Reserved
L21                               IO78NPB1V4           Unassigned
L22                               IO104NPB2V2          Unassigned
L23                               IO98NDB2V2           Unassigned
L24                               IO98PDB2V2           Unassigned
L25                               IO87PDB2V0           Unassigned
L26                               IO87NDB2V0           Unassigned
L27                               IO97PDB2V1           Unassigned
L28                               IO101PDB2V2          Unassigned
L29                               IO103PDB2V2          Unassigned
L30                               IO119NDB3V0          Unassigned
M1      GbtxElinksDio_ib16n[10]   IO282NDB7V1          Fixed        LVDS         ---                ---   ---            ---              Off          ---   ---               No           Yes
M2      GbtxElinksDio_ib16p[10]   IO282PDB7V1          Fixed        LVDS         ---                ---   ---            ---              Off          ---   ---               Yes          Yes
M3      GbtxElinksDio_ib16n[7]    IO292NDB7V2          Fixed        LVDS         ---                ---   ---            ---              Off          ---   ---               No           Yes
M4      GbtxElinksDio_ib16p[7]    IO292PDB7V2          Fixed        LVDS         ---                ---   ---            ---              Off          ---   ---               Yes          Yes
M5      GbtxElinksDout_ib24n[20]  IO283NDB7V1          Fixed        LVDS         ---                ---   ---            ---              Off          ---   ---               No           Yes
M6      GbtxElinksDio_ib16p[2]    IO285PDB7V1          Fixed        LVDS         ---                ---   ---            ---              Off          ---   ---               Yes          Yes
M7      GbtxElinksDio_ib16p[15]   IO287PDB7V1          Fixed        LVDS         ---                ---   ---            ---              Off          ---   ---               Yes          Yes
M8      GbtxElinksDio_ib16p[14]   IO289PDB7V1          Fixed        LVDS         ---                ---   ---            ---              Off          ---   ---               Yes          Yes
M9      GbtxElinksDio_ib16n[14]   IO289NDB7V1          Fixed        LVDS         ---                ---   ---            ---              Off          ---   ---               No           Yes
M10                               VCCIB7               Reserved
M11                               VCC                  Reserved
M12                               GND                  Reserved
M13                               GND                  Reserved
M14                               GND                  Reserved
M15                               GND                  Reserved
M16                               GND                  Reserved
M17                               GND                  Reserved
M18                               GND                  Reserved
M19                               GND                  Reserved
M20                               VCC                  Reserved
M21                               VCCIB2               Reserved
M22                               Not Bonded           Unconnected
M23                               IO104PPB2V2          Unassigned
M24                               IO102PDB2V2          Unassigned
M25                               IO102NDB2V2          Unassigned
M26     V3p3PowerGood_i           IO95PDB2V1           Fixed        LVCMOS25     ---                ---   None           No               Off          ---   ---               No           Yes
M27                               IO97NDB2V1           Unassigned
M28                               IO101NDB2V2          Unassigned
M29                               IO103NDB2V2          Unassigned
M30                               IO119PDB3V0          Unassigned
N1      GbtxElinksDio_ib16p[9]    IO276PDB7V0          Fixed        LVDS         ---                ---   ---            ---              Off          ---   ---               Yes          Yes
N2      GbtxElinksDio_ib16p[8]    IO278PDB7V0          Fixed        LVDS         ---                ---   ---            ---              Off          ---   ---               Yes          Yes
N3      GbtxElinksDio_ib16p[6]    IO280PDB7V0          Fixed        LVDS         ---                ---   ---            ---              Off          ---   ---               Yes          Yes
N4      GbtxElinksDio_ib16p[4]    IO284PDB7V1          Fixed        LVDS         ---                ---   ---            ---              Off          ---   ---               Yes          Yes
N5      GbtxElinksDio_ib16p[5]    IO279PDB7V0          Fixed        LVDS         ---                ---   ---            ---              Off          ---   ---               Yes          Yes
N6      GbtxElinksDio_ib16n[2]    IO285NDB7V1          Fixed        LVDS         ---                ---   ---            ---              Off          ---   ---               No           Yes
N7      GbtxElinksDio_ib16n[15]   IO287NDB7V1          Fixed        LVDS         ---                ---   ---            ---              Off          ---   ---               No           Yes
N8      GbtxElinksDio_ib16n[1]    IO281NDB7V0          Fixed        LVDS         ---                ---   ---            ---              Off          ---   ---               No           Yes
N9      GbtxElinksDio_ib16p[1]    IO281PDB7V0          Fixed        LVDS         ---                ---   ---            ---              Off          ---   ---               Yes          Yes
N10                               VCCIB7               Reserved
N11                               VCC                  Reserved
N12                               GND                  Reserved
N13                               GND                  Reserved
N14                               GND                  Reserved
N15                               GND                  Reserved
N16                               GND                  Reserved
N17                               GND                  Reserved
N18                               GND                  Reserved
N19                               GND                  Reserved
N20                               VCC                  Reserved
N21                               VCCIB2               Reserved
N22                               IO106NDB2V3          Unassigned
N23                               IO106PDB2V3          Unassigned
N24                               IO108PDB2V3          Unassigned
N25                               IO108NDB2V3          Unassigned
N26                               IO95NDB2V1           Unassigned
N27                               IO99NDB2V2           Unassigned
N28                               IO99PDB2V2           Unassigned
N29                               IO107PDB2V3          Unassigned
N30                               IO107NDB2V3          Unassigned
P1      GbtxElinksDio_ib16n[9]    IO276NDB7V0          Fixed        LVDS         ---                ---   ---            ---              Off          ---   ---               No           Yes
P2      GbtxElinksDio_ib16n[8]    IO278NDB7V0          Fixed        LVDS         ---                ---   ---            ---              Off          ---   ---               No           Yes
P3      GbtxElinksDio_ib16n[6]    IO280NDB7V0          Fixed        LVDS         ---                ---   ---            ---              Off          ---   ---               No           Yes
P4      GbtxElinksDio_ib16n[4]    IO284NDB7V1          Fixed        LVDS         ---                ---   ---            ---              Off          ---   ---               No           Yes
P5      GbtxElinksDio_ib16n[5]    IO279NDB7V0          Fixed        LVDS         ---                ---   ---            ---              Off          ---   ---               No           Yes
P6                                GFC1/IO275PDB7V0     Special
P7                                GFC0/IO275NDB7V0     Special
P8      GbtxElinksDio_ib16p[3]    IO277PDB7V0          Fixed        LVDS         ---                ---   ---            ---              Off          ---   ---               Yes          Yes
P9      GbtxElinksDio_ib16n[3]    IO277NDB7V0          Fixed        LVDS         ---                ---   ---            ---              Off          ---   ---               No           Yes
P10                               VCCIB7               Reserved
P11                               VCC                  Reserved
P12                               GND                  Reserved
P13                               GND                  Reserved
P14                               GND                  Reserved
P15                               GND                  Reserved
P16                               GND                  Reserved
P17                               GND                  Reserved
P18                               GND                  Reserved
P19                               GND                  Reserved
P20                               VCC                  Reserved
P21                               VCCIB2               Reserved
P22                               GCC1/IO112PDB2V3     Special
P23                               IO110PDB2V3          Unassigned
P24                               IO110NDB2V3          Unassigned
P25                               IO109PPB2V3          Unassigned
P26                               IO111NPB2V3          Unassigned
P27                               IO105PDB2V2          Unassigned
P28                               IO105NDB2V2          Unassigned
P29     ClkFeedbackI_ikp          GCC2/IO117PDB3V0     Special      LVDS         ---                ---   ---            ---              Off          ---   ---               No           Yes
P30     ClkFeedbackI_ikn          IO117NDB3V0          Fixed        LVDS         ---                ---   ---            ---              Off          ---   ---               No           Yes
R1      FpgaReset_ira             GFC2/IO270PDB6V4     Special      LVCMOS25     12                 High  None           No               Off          No    5                 No           Yes
R2      OptoLosReset_iran         GFB1/IO274PPB7V0     Special      LVCMOS25     ---                ---   None           Yes              Off          ---   ---               No           Yes
R3                                VCOMPLF              Reserved
R4      GbtxElinksDclk_ikb3n[1]   GFA0/IO273NDB6V4     Special      LVDS         ---                ---   ---            ---              Off          ---   ---               No           Yes
R5                                GFB0/IO274NPB7V0     Special
R6                                IO271NDB6V4          Unassigned
R7      Osc25Mhz_ik               GFB2/IO271PDB6V4     Special      LVCMOS25     ---                ---   ---            No               Off          ---   ---               No           Yes
R8      GbtxElinksDin_ob40p[39]   IO269PDB6V4          Fixed        LVDS         24                 High  ---            ---              ---          ---   0                 Yes          Yes
R9      GbtxElinksDin_ob40n[39]   IO269NDB6V4          Fixed        LVDS         24                 High  ---            ---              ---          ---   0                 No           Yes
R10                               VCCIB7               Reserved
R11                               VCC                  Reserved
R12                               GND                  Reserved
R13                               GND                  Reserved
R14                               GND                  Reserved
R15                               GND                  Reserved
R16                               GND                  Reserved
R17                               GND                  Reserved
R18                               GND                  Reserved
R19                               GND                  Reserved
R20                               VCC                  Reserved
R21                               VCCIB2               Reserved
R22                               GCC0/IO112NDB2V3     Special
R23                               GCB2/IO116PDB3V0     Special
R24                               IO118PDB3V0          Unassigned
R25                               IO111PPB2V3          Unassigned
R26     ClkFeedbackO_okp          IO122PPB3V1          Fixed        LVDS         24                 High  ---            ---              ---          ---   0                 Yes          Yes
R27                               GCA0/IO114NPB3V0     Special
R28                               VCOMPLC              Reserved
R29                               GCB1/IO113PPB2V3     Special
R30                               IO115NPB3V0          Unassigned
T1                                IO270NDB6V4          Unassigned
T2                                VCCPLF               Reserved
T3                                GFA2/IO272PPB6V4     Special
T4      GbtxElinksDclk_ikb3p[1]   GFA1/IO273PDB6V4     Special      LVDS         ---                ---   ---            ---              Off          ---   ---               No           Yes
T5                                IO272NPB6V4          Unassigned
T6      GbtxElinksDin_ob40n[9]    IO267NDB6V4          Fixed        LVDS         24                 High  ---            ---              ---          ---   0                 No           Yes
T7      GbtxElinksDin_ob40p[9]    IO267PDB6V4          Fixed        LVDS         24                 High  ---            ---              ---          ---   0                 Yes          Yes
T8      GbtxElinksDin_ob40p[17]   IO265PDB6V3          Fixed        LVDS         24                 High  ---            ---              ---          ---   0                 Yes          Yes
T9      GbtxElinksDin_ob40p[15]   IO263PDB6V3          Fixed        LVDS         24                 High  ---            ---              ---          ---   0                 Yes          Yes
T10                               VCCIB6               Reserved
T11                               VCC                  Reserved
T12                               GND                  Reserved
T13                               GND                  Reserved
T14                               GND                  Reserved
T15                               GND                  Reserved
T16                               GND                  Reserved
T17                               GND                  Reserved
T18                               GND                  Reserved
T19                               GND                  Reserved
T20                               VCC                  Reserved
T21                               VCCIB3               Reserved
T22                               IO109NPB2V3          Unassigned
T23                               IO116NDB3V0          Unassigned
T24                               IO118NDB3V0          Unassigned
T25     ClkFeedbackO_okn          IO122NPB3V1          Fixed        LVDS         24                 High  ---            ---              ---          ---   0                 No           Yes
T26                               GCA1/IO114PPB3V0     Special
T27                               GCB0/IO113NPB2V3     Special
T28                               GCA2/IO115PPB3V0     Special
T29                               VCCPLC               Reserved
T30                               IO121PDB3V0          Unassigned
U1      GbtxElinksDin_ob40p[16]   IO268PDB6V4          Fixed        LVDS         24                 High  ---            ---              ---          ---   0                 Yes          Yes
U2      GbtxElinksDin_ob40n[35]   IO264NDB6V3          Fixed        LVDS         24                 High  ---            ---              ---          ---   0                 No           Yes
U3      GbtxElinksDin_ob40p[35]   IO264PDB6V3          Fixed        LVDS         24                 High  ---            ---              ---          ---   0                 Yes          Yes
U4      GbtxElinksDin_ob40p[36]   IO258PDB6V3          Fixed        LVDS         24                 High  ---            ---              ---          ---   0                 Yes          Yes
U5      GbtxElinksDin_ob40n[36]   IO258NDB6V3          Fixed        LVDS         24                 High  ---            ---              ---          ---   0                 No           Yes
U6      GbtxReset_or              IO257PPB6V2          Fixed        LVCMOS25     12                 High  None           ---              ---          No    5                 No           Yes
U7                                IO261PPB6V3          Unassigned
U8      GbtxElinksDin_ob40n[17]   IO265NDB6V3          Fixed        LVDS         24                 High  ---            ---              ---          ---   0                 No           Yes
U9      GbtxElinksDin_ob40n[15]   IO263NDB6V3          Fixed        LVDS         24                 High  ---            ---              ---          ---   0                 No           Yes
U10                               VCCIB6               Reserved
U11                               VCC                  Reserved
U12                               GND                  Reserved
U13                               GND                  Reserved
U14                               GND                  Reserved
U15                               GND                  Reserved
U16                               GND                  Reserved
U17                               GND                  Reserved
U18                               GND                  Reserved
U19                               GND                  Reserved
U20                               VCC                  Reserved
U21                               VCCIB3               Reserved
U22                               IO120PDB3V0          Unassigned
U23                               IO128PDB3V1          Unassigned
U24                               IO124PDB3V1          Unassigned
U25                               IO124NDB3V1          Unassigned
U26                               IO126PDB3V1          Unassigned
U27                               IO129PDB3V1          Unassigned
U28                               IO127PDB3V1          Unassigned
U29                               IO125PDB3V1          Unassigned
U30                               IO121NDB3V0          Unassigned
V1      GbtxElinksDin_ob40n[16]   IO268NDB6V4          Fixed        LVDS         24                 High  ---            ---              ---          ---   0                 No           Yes
V2      GbtxElinksDin_ob40p[29]   IO262PDB6V3          Fixed        LVDS         24                 High  ---            ---              ---          ---   0                 Yes          Yes
V3      GbtxElinksDin_ob40p[19]   IO260PDB6V3          Fixed        LVDS         24                 High  ---            ---              ---          ---   0                 Yes          Yes
V4      GbtxElinksDin_ob40p[20]   IO252PDB6V2          Fixed        LVDS         24                 High  ---            ---              ---          ---   0                 Yes          Yes
V5                                IO257NPB6V2          Unassigned
V6                                IO261NPB6V3          Unassigned
V7      GbtxElinksDin_ob40p[25]   IO255PDB6V2          Fixed        LVDS         24                 High  ---            ---              ---          ---   0                 Yes          Yes
V8      GbtxElinksDin_ob40p[12]   IO259PDB6V3          Fixed        LVDS         24                 High  ---            ---              ---          ---   0                 Yes          Yes
V9      GbtxElinksDin_ob40n[12]   IO259NDB6V3          Fixed        LVDS         24                 High  ---            ---              ---          ---   0                 No           Yes
V10                               VCCIB6               Reserved
V11                               VCC                  Reserved
V12                               GND                  Reserved
V13                               GND                  Reserved
V14                               GND                  Reserved
V15                               GND                  Reserved
V16                               GND                  Reserved
V17                               GND                  Reserved
V18                               GND                  Reserved
V19                               GND                  Reserved
V20                               VCC                  Reserved
V21                               VCCIB3               Reserved
V22                               IO120NDB3V0          Unassigned
V23                               IO128NDB3V1          Unassigned
V24                               IO132PDB3V2          Unassigned
V25                               IO130PPB3V2          Unassigned
V26                               IO126NDB3V1          Unassigned
V27                               IO129NDB3V1          Unassigned
V28                               IO127NDB3V1          Unassigned
V29                               IO125NDB3V1          Unassigned
V30                               IO123PDB3V1          Unassigned
W1      GbtxElinksDin_ob40n[37]   IO266NDB6V4          Fixed        LVDS         24                 High  ---            ---              ---          ---   0                 No           Yes
W2      GbtxElinksDin_ob40n[29]   IO262NDB6V3          Fixed        LVDS         24                 High  ---            ---              ---          ---   0                 No           Yes
W3      GbtxElinksDin_ob40n[19]   IO260NDB6V3          Fixed        LVDS         24                 High  ---            ---              ---          ---   0                 No           Yes
W4      GbtxElinksDin_ob40n[20]   IO252NDB6V2          Fixed        LVDS         24                 High  ---            ---              ---          ---   0                 No           Yes
W5      GbtxElinksDin_ob40n[21]   IO251NDB6V2          Fixed        LVDS         24                 High  ---            ---              ---          ---   0                 No           Yes
W6      GbtxElinksDin_ob40p[21]   IO251PDB6V2          Fixed        LVDS         24                 High  ---            ---              ---          ---   0                 Yes          Yes
W7      GbtxElinksDin_ob40n[25]   IO255NDB6V2          Fixed        LVDS         24                 High  ---            ---              ---          ---   0                 No           Yes
W8      Leds_onb6[3]              IO249PPB6V1          Fixed        LVCMOS25     12                 High  None           ---              ---          No    5                 No           Yes
W9      GbtxElinksDin_ob40p[8]    IO253PDB6V2          Fixed        LVDS         24                 High  ---            ---              ---          ---   0                 Yes          Yes
W10                               VCCIB6               Reserved
W11                               VCC                  Reserved
W12                               GND                  Reserved
W13                               GND                  Reserved
W14                               GND                  Reserved
W15                               GND                  Reserved
W16                               GND                  Reserved
W17                               GND                  Reserved
W18                               GND                  Reserved
W19                               GND                  Reserved
W20                               VCC                  Reserved
W21                               VCCIB3               Reserved
W22                               IO134PDB3V2          Unassigned
W23                               IO138PDB3V3          Unassigned
W24                               IO132NDB3V2          Unassigned
W25                               IO136NPB3V2          Unassigned
W26                               IO130NPB3V2          Unassigned
W27                               IO141PDB3V3          Unassigned
W28                               IO135PDB3V2          Unassigned
W29                               IO131PDB3V2          Unassigned
W30                               IO123NDB3V1          Unassigned
Y1      GbtxElinksDin_ob40p[37]   IO266PDB6V4          Fixed        LVDS         24                 High  ---            ---              ---          ---   0                 Yes          Yes
Y2      GbtxElinksDin_ob40p[26]   IO250PDB6V2          Fixed        LVDS         24                 High  ---            ---              ---          ---   0                 Yes          Yes
Y3      GbtxElinksDin_ob40n[26]   IO250NDB6V2          Fixed        LVDS         24                 High  ---            ---              ---          ---   0                 No           Yes
Y4      GbtxElinksDin_ob40p[27]   IO246PDB6V1          Fixed        LVDS         24                 High  ---            ---              ---          ---   0                 Yes          Yes
Y5      GbtxElinksDin_ob40n[18]   IO247NDB6V1          Fixed        LVDS         24                 High  ---            ---              ---          ---   0                 No           Yes
Y6      GbtxElinksDin_ob40p[18]   IO247PDB6V1          Fixed        LVDS         24                 High  ---            ---              ---          ---   0                 Yes          Yes
Y7                                IO249NPB6V1          Unassigned
Y8      GbtxElinksDin_ob40p[22]   IO245PDB6V1          Fixed        LVDS         24                 High  ---            ---              ---          ---   0                 Yes          Yes
Y9      GbtxElinksDin_ob40n[8]    IO253NDB6V2          Fixed        LVDS         24                 High  ---            ---              ---          ---   0                 No           Yes
Y10                               GEB0/IO235NPB6V0     Special
Y11                               VCC                  Reserved
Y12                               VCC                  Reserved
Y13                               VCC                  Reserved
Y14                               VCC                  Reserved
Y15                               VCC                  Reserved
Y16                               VCC                  Reserved
Y17                               VCC                  Reserved
Y18                               VCC                  Reserved
Y19                               VCC                  Reserved
Y20                               VCC                  Reserved
Y21                               IO142PPB3V3          Unassigned
Y22                               IO134NDB3V2          Unassigned
Y23                               IO138NDB3V3          Unassigned
Y24                               IO140NDB3V3          Unassigned
Y25                               IO140PDB3V3          Unassigned
Y26                               IO136PPB3V2          Unassigned
Y27                               IO141NDB3V3          Unassigned
Y28                               IO135NDB3V2          Unassigned
Y29                               IO131NDB3V2          Unassigned
Y30                               IO133PDB3V2          Unassigned
