Microsemi Libero Software
Version: 11.7.0.119
Release: v11.7

'IDE_DESIGNERVIEW_ROOTDIR' set to 'E:\work_git\GEFE\GEFE_Base\hdl\synthesis\libero_prj\designer'
Info: The design GefeTop_Identify.adb was last modified by software version 11.7.0.119.
Opened an existing Libero design GefeTop_Identify.adb.

The Execute Script command succeeded ( 00:00:23 )
Design closed.

