

#### START OF CLOCK OPTIMIZATION REPORT #####[

Clock optimization not enabled
4 non-gated/non-generated clock tree(s) driving 536 clock pin(s) of sequential element(s)
4 gated/generated clock tree(s) driving 490 clock pin(s) of sequential element(s)
0 instances converted, 490 sequential instances remain driven by gated/generated clocks

====================================================================== Non-Gated/Non-Generated Clocks ======================================================================
Clock Tree ID     Driving Element                                       Drive Element Type              Fanout     Sample Instance                                          
----------------------------------------------------------------------------------------------------------------------------------------------------------------------------
@K:CKID0004       ident_coreinst.comm_block_INST.jtagi.b9_Rcmi_KsDw     UJTAG                           522        ident_coreinst.comm_block_INST.b9_ORb_xNywD.b3_ORb[32]   
@K:CKID0005       atck                                                  port                            1          ident_coreinst.comm_block_INST.jtagi.b9_Rcmi_KsDw        
@K:CKID0007       ident_coreinst.comm_block_INST.dr2_tck_keep           clock definition on keepbuf     8          ident_coreinst.comm_block_INST.b7_Rcmi_ql.b9_OvyH3_saL[7]
@K:CKID0008       Osc25Mhz_ik                                           clock definition on port        5          i_GefeSystem.i_PorPpr_d1                                 
============================================================================================================================================================================
========================================================================================================= Gated/Generated Clocks =========================================================================================================
Clock Tree ID     Driving Element                                             Drive Element Type                  Fanout     Sample Instance                                                                     Explanation              
------------------------------------------------------------------------------------------------------------------------------------------------------------------------------------------------------------------------------------------
@K:CKID0001       i_GefeSystem.i_GbtxElinksDclkCg_buf                         CLKBUF_LVDS                         434        i_GefeApplication.DataGbtxElinks_qb80[79]                                           No clocks found on inputs
@K:CKID0002       ident_coreinst.comm_block_INST.jtagi.b9_nv_oQwfYF_RNO       NOR2B                               14         ident_coreinst.IICE_INST.b8_12m_IFLY.b5_nUTGT.b11_nUTGT_khWqH.genblk2.b3_nUT[6]     No clocks found on inputs
@K:CKID0003       ident_coreinst.comm_block_INST.jtagi.b10_8Kz_rKlrtX_RNO     NOR2B                               9          ident_coreinst.comm_block_INST.b7_Rcmi_ql.genblk1.b10_dZst39_EF3[7]                 No clocks found on inputs
@K:CKID0006       i_GefeApplication.i_ClkFeedbackI_buf                        clock definition on CLKBUF_LVDS     33         i_GefeApplication.i_Osc25MhzFeedBackHb.HeartBeatCntr_c32[31]                        Clock conversion disabled
==========================================================================================================================================================================================================================================


##### END OF CLOCK OPTIMIZATION REPORT ######]

