Microsemi Libero Software
Version: 11.7.0.119
Release: v11.7

Info: The design GefeTop_Identify.adb was last modified by software version 11.7.0.119.
Opened an existing Libero design GefeTop_Identify.adb.
'BA_NAME' set to 'GefeTop_ba'
'IDE_DESIGNERVIEW_NAME' set to 'Impl1'
'IDE_DESIGNERVIEW_COUNT' set to '1'
'IDE_DESIGNERVIEW_REV0' set to 'Impl1'
'IDE_DESIGNERVIEW_REVNUM0' set to '1'
'IDE_DESIGNERVIEW_ROOTDIR' set to 'E:\work_git\GEFE\GEFE_Base\hdl\synthesis\libero_prj\designer'
'IDE_DESIGNERVIEW_LASTREV' set to '1'
Wrote timing report to file: GefeTop_maxdelay_timing_report.txt

The Report command succeeded ( 00:00:03 )
Wrote timing report to file: GefeTop_mindelay_timing_report.txt

The Report command succeeded ( 00:00:01 )
Wrote timing_violations report to file: GefeTop_maxdelay_timingviolations_report.txt

The Report command succeeded ( 00:00:00 )
Wrote timing_violations report to file: GefeTop_mindelay_timingviolations_report.txt

The Report command succeeded ( 00:00:00 )
Design saved to file
E:\work_git\GEFE\GEFE_Base\hdl\synthesis\libero_prj\designer\impl1\GefeTop_Identify.adb.

The Execute Script command succeeded ( 00:00:05 )
Design closed.

