#--  Synopsys, Inc.
#--  Version L-2016.09M-2
#--  Project file E:\work_git\S-GEFE\S-GEFE_Test\proasic3\synthesis\SGefeTop_syn.prj
#--  Written on Thu Mar 22 18:42:18 2018


#project files
add_file -verilog "E:/work_git/S-GEFE/S-GEFE_Test/proasic3/hdl/HeartBeat.v"
add_file -verilog "E:/work_git/S-GEFE/S-GEFE_Test/proasic3/hdl/UserIoChecker.v"
add_file -verilog -vlog_std sysv "E:/work_git/S-GEFE/S-GEFE_Test/proasic3/hdl/SGefeApplication.sv"
add_file -verilog -vlog_std sysv "E:/work_git/S-GEFE/S-GEFE_Test/proasic3/hdl/SGefeSystem.sv"
add_file -verilog -vlog_std sysv "E:/work_git/S-GEFE/S-GEFE_Test/proasic3/hdl/SGefeTop.sv"
add_file -constraint "E:/work_git/S-GEFE/S-GEFE_Test/proasic3/constraint/SGefe_Application_Timing.sdc"
add_file -constraint "E:/work_git/S-GEFE/S-GEFE_Test/proasic3/constraint/SGefe_System_Timing.sdc"



#implementation: "synthesis"
impl -add synthesis -type fpga

#
#implementation attributes

set_option -vlog_std v2001

#device options
set_option -technology ProASIC3L
set_option -part A3PE3000L
set_option -package FBGA896
set_option -speed_grade STD
set_option -part_companion ""

#compilation/mapping options
set_option -use_fsm_explorer 0
set_option -top_module "SGefeTop"

# hdl_compiler_options
set_option -distributed_compile 0

# mapper_without_write_options
set_option -frequency 100.000
set_option -srs_instrumentation 1

# mapper_options
set_option -write_verilog 0
set_option -write_vhdl 0

# actel_options
set_option -rw_check_on_ram 0

# Microsemi 500K
set_option -run_prop_extract 1
set_option -maxfan 24
set_option -disable_io_insertion 0
set_option -retiming 0
set_option -report_path 4000
set_option -opcond COMWC
set_option -update_models_cp 0
set_option -preserve_registers 0

# Microsemi 500K
set_option -globalthreshold 50

# NFilter
set_option -no_sequential_opt 0

# sequential_optimization_options
set_option -symbolic_fsm_compiler 1

# Compiler Options
set_option -compiler_compatible 0
set_option -resource_sharing 1

# Compiler Options
set_option -auto_infer_blackbox 0

#automatic place and route (vendor) options
set_option -write_apr_constraint 1

#set result format/file last
project -result_file "./SGefeTop.edn"
impl -active "synthesis"
