Timing Report Min Delay Analysis

SmartTime Version v11.8
Microsemi Corporation - Microsemi Libero Software Release v11.8 (Version 11.8.0.26)
Date: Thu Mar 22 18:45:50 2018


Design: SGefeTop
Family: ProASIC3L
Die: A3PE3000L
Package: 896 FBGA
Temperature Range: 0 - 70 C
Voltage Range: 1.425 - 1.575 V
Speed Grade: STD
Design State: Post-Layout
Data source: Silicon verified
Min Operating Conditions: BEST - 1.575 V - 0 C
Max Operating Conditions: WORST - 1.425 V - 70 C
Using Enhanced Min Delay Analysis
Scenario for Timing Analysis: Primary


-----------------------------------------------------
SUMMARY

Clock Domain:               Osc25Mhz
Period (ns):                18.432
Frequency (MHz):            54.253
Required Period (ns):       40.000
Required Frequency (MHz):   25.000
External Setup (ns):        N/A
External Hold (ns):         N/A
Min Clock-To-Out (ns):      2.067
Max Clock-To-Out (ns):      16.903

Clock Domain:               GbtxElinksDclk
Period (ns):                2.860
Frequency (MHz):            349.650
Required Period (ns):       25.000
Required Frequency (MHz):   40.000
External Setup (ns):        N/A
External Hold (ns):         N/A
Min Clock-To-Out (ns):      2.196
Max Clock-To-Out (ns):      6.183

Clock Domain:               ClkFeedback0
Period (ns):                9.307
Frequency (MHz):            107.446
Required Period (ns):       40.000
Required Frequency (MHz):   25.000
External Setup (ns):        N/A
External Hold (ns):         N/A
Min Clock-To-Out (ns):      5.257
Max Clock-To-Out (ns):      14.193

Clock Domain:               ClkFeedback1
Period (ns):                10.024
Frequency (MHz):            99.761
Required Period (ns):       25.000
Required Frequency (MHz):   40.000
External Setup (ns):        N/A
External Hold (ns):         N/A
Min Clock-To-Out (ns):      8.215
Max Clock-To-Out (ns):      21.686

Clock Domain:               GbtxClockDes
Period (ns):                26.519
Frequency (MHz):            37.709
Required Period (ns):       25.000
Required Frequency (MHz):   40.000
External Setup (ns):        20.208
External Hold (ns):         1.103
Min Clock-To-Out (ns):      2.193
Max Clock-To-Out (ns):      15.239

                            Input to Output
Min Delay (ns):             1.984
Max Delay (ns):             19.131

END SUMMARY
-----------------------------------------------------

Clock Domain Osc25Mhz

SET Register to Register

Path 1
  From:                        i_SGefeSystem/i_PorPpr_d1:CLK
  To:                          i_SGefeSystem/i_PorPpr_d2_3:D
  Delay (ns):                  0.387
  Slack (ns):                  0.371
  Arrival (ns):                1.626
  Required (ns):               1.255
  Hold (ns):                   0.000

Path 2
  From:                        i_SGefeSystem/i_PorPpr_d1:CLK
  To:                          i_SGefeSystem/i_PorPpr_d2:D
  Delay (ns):                  0.387
  Slack (ns):                  0.371
  Arrival (ns):                1.626
  Required (ns):               1.255
  Hold (ns):                   0.000

Path 3
  From:                        i_SGefeSystem/i_PorPpr_d1:CLK
  To:                          i_SGefeSystem/i_PorPpr_d2_4:D
  Delay (ns):                  0.388
  Slack (ns):                  0.372
  Arrival (ns):                1.627
  Required (ns):               1.255
  Hold (ns):                   0.000

Path 4
  From:                        i_SGefeApplication/TestCntr_c16[1]:CLK
  To:                          i_SGefeApplication/TestCntr_c16[1]:D
  Delay (ns):                  0.598
  Slack (ns):                  0.598
  Arrival (ns):                1.831
  Required (ns):               1.233
  Hold (ns):                   0.000

Path 5
  From:                        i_SGefeSystem/i_PorPpr_d1:CLK
  To:                          i_SGefeSystem/i_PorPpr_d2_1:D
  Delay (ns):                  0.628
  Slack (ns):                  0.621
  Arrival (ns):                1.867
  Required (ns):               1.246
  Hold (ns):                   0.000


Expanded Path 1
  From: i_SGefeSystem/i_PorPpr_d1:CLK
  To: i_SGefeSystem/i_PorPpr_d2_3:D
  data arrival time                              1.626
  data required time                         -   1.255
  slack                                          0.371
  ________________________________________________________
  Data arrival time calculation
  0.000                        Osc25Mhz
               +     0.000          Clock source
  0.000                        Osc25Mhz_ik (r)
               +     0.000          net: Osc25Mhz_ik
  0.000                        i_SGefeSystem/i_Osc25Mhz_ibuf/U0/U0:PAD (r)
               +     0.523          cell: ADLIB:IOPAD_IN
  0.523                        i_SGefeSystem/i_Osc25Mhz_ibuf/U0/U0:Y (r)
               +     0.000          net: i_SGefeSystem/i_Osc25Mhz_ibuf/U0/NET1
  0.523                        i_SGefeSystem/i_Osc25Mhz_ibuf/U0/U1:A (r)
               +     0.118          cell: ADLIB:CLKIO
  0.641                        i_SGefeSystem/i_Osc25Mhz_ibuf/U0/U1:Y (r)
               +     0.598          net: Osc25MhzCg_k
  1.239                        i_SGefeSystem/i_PorPpr_d1:CLK (r)
               +     0.196          cell: ADLIB:DFN1C1
  1.435                        i_SGefeSystem/i_PorPpr_d1:Q (r)
               +     0.191          net: i_SGefeSystem/PorPpr_rand2[0]
  1.626                        i_SGefeSystem/i_PorPpr_d2_3:D (r)
                                    
  1.626                        data arrival time
  ________________________________________________________
  Data required time calculation
  0.000                        Osc25Mhz
               +     0.000          Clock source
  0.000                        Osc25Mhz_ik (r)
               +     0.000          net: Osc25Mhz_ik
  0.000                        i_SGefeSystem/i_Osc25Mhz_ibuf/U0/U0:PAD (r)
               +     0.523          cell: ADLIB:IOPAD_IN
  0.523                        i_SGefeSystem/i_Osc25Mhz_ibuf/U0/U0:Y (r)
               +     0.000          net: i_SGefeSystem/i_Osc25Mhz_ibuf/U0/NET1
  0.523                        i_SGefeSystem/i_Osc25Mhz_ibuf/U0/U1:A (r)
               +     0.118          cell: ADLIB:CLKIO
  0.641                        i_SGefeSystem/i_Osc25Mhz_ibuf/U0/U1:Y (r)
               +     0.614          net: Osc25MhzCg_k
  1.255                        i_SGefeSystem/i_PorPpr_d2_3:CLK (r)
               +     0.000          Library hold time: ADLIB:DFN1C1
  1.255                        i_SGefeSystem/i_PorPpr_d2_3:D
                                    
  1.255                        data required time


END SET Register to Register

----------------------------------------------------

SET External Hold

No Path

END SET External Hold

----------------------------------------------------

SET Clock to Output

Path 1
  From:                        i_SGefeApplication/ClkFeedback_gen[0].i_ClkFeedback_obuf/U0/U1:OCLK
  To:                          ClkFeedbackP_okb2[0]
  Delay (ns):                  0.830
  Slack (ns):
  Arrival (ns):                2.067
  Required (ns):
  Clock to Out (ns):           2.067

Path 2
  From:                        i_SGefeApplication/ClkFeedback_gen[0].i_ClkFeedback_obuf/U0/U1:OCLK
  To:                          ClkFeedbackN_okb2[0]
  Delay (ns):                  0.844
  Slack (ns):
  Arrival (ns):                2.081
  Required (ns):
  Clock to Out (ns):           2.081

Path 3
  From:                        i_SGefeApplication/TestCntr_c16[3]:CLK
  To:                          GpioConnB_iob24[15]
  Delay (ns):                  2.178
  Slack (ns):
  Arrival (ns):                3.410
  Required (ns):
  Clock to Out (ns):           3.410

Path 4
  From:                        i_SGefeApplication/TestCntr_c16[5]:CLK
  To:                          GpioConnB_iob24[5]
  Delay (ns):                  2.186
  Slack (ns):
  Arrival (ns):                3.418
  Required (ns):
  Clock to Out (ns):           3.418

Path 5
  From:                        i_SGefeApplication/TestCntr_c16[5]:CLK
  To:                          GpioConnB_iob24[17]
  Delay (ns):                  2.257
  Slack (ns):
  Arrival (ns):                3.489
  Required (ns):
  Clock to Out (ns):           3.489


Expanded Path 1
  From: i_SGefeApplication/ClkFeedback_gen[0].i_ClkFeedback_obuf/U0/U1:OCLK
  To: ClkFeedbackP_okb2[0]
  data arrival time                              2.067
  data required time                         -   N/C
  slack                                          N/C
  ________________________________________________________
  Data arrival time calculation
  0.000                        Osc25Mhz
               +     0.000          Clock source
  0.000                        Osc25Mhz_ik (r)
               +     0.000          net: Osc25Mhz_ik
  0.000                        i_SGefeSystem/i_Osc25Mhz_ibuf/U0/U0:PAD (r)
               +     0.523          cell: ADLIB:IOPAD_IN
  0.523                        i_SGefeSystem/i_Osc25Mhz_ibuf/U0/U0:Y (r)
               +     0.000          net: i_SGefeSystem/i_Osc25Mhz_ibuf/U0/NET1
  0.523                        i_SGefeSystem/i_Osc25Mhz_ibuf/U0/U1:A (r)
               +     0.118          cell: ADLIB:CLKIO
  0.641                        i_SGefeSystem/i_Osc25Mhz_ibuf/U0/U1:Y (r)
               +     0.596          net: Osc25MhzCg_k
  1.237                        i_SGefeApplication/ClkFeedback_gen[0].i_ClkFeedback_obuf/U0/U1:OCLK (r)
               +     0.300          cell: ADLIB:IOTRI_OD_EB
  1.537                        i_SGefeApplication/ClkFeedback_gen[0].i_ClkFeedback_obuf/U0/U1:DOUT (r)
               +     0.000          net: i_SGefeApplication/ClkFeedback_gen[0]_i_ClkFeedback_obuf/U0/NET1
  1.537                        i_SGefeApplication/ClkFeedback_gen[0].i_ClkFeedback_obuf/U0/U0:D (r)
               +     0.530          cell: ADLIB:IOPADP_TRI
  2.067                        i_SGefeApplication/ClkFeedback_gen[0].i_ClkFeedback_obuf/U0/U0:PAD (r)
               +     0.000          net: ClkFeedbackP_okb2[0]
  2.067                        ClkFeedbackP_okb2[0] (r)
                                    
  2.067                        data arrival time
  ________________________________________________________
  Data required time calculation
  N/C                          Osc25Mhz
               +     0.000          Clock source
  N/C                          Osc25Mhz_ik (r)
                                    
  N/C                          ClkFeedbackP_okb2[0] (r)


END SET Clock to Output

----------------------------------------------------

SET Register to Asynchronous

No Path

END SET Register to Asynchronous

----------------------------------------------------

SET External Removal

Path 1
  From:                        FpgaReset_ira
  To:                          i_SGefeSystem/i_PorPpr_d2_5:CLR
  Delay (ns):                  2.765
  Slack (ns):
  Arrival (ns):                2.765
  Required (ns):
  Removal (ns):                0.000
  External Removal (ns):       -1.247

Path 2
  From:                        FpgaReset_ira
  To:                          i_SGefeSystem/i_PorPpr_d2_2:CLR
  Delay (ns):                  2.873
  Slack (ns):
  Arrival (ns):                2.873
  Required (ns):
  Removal (ns):                0.000
  External Removal (ns):       -1.355

Path 3
  From:                        FpgaReset_ira
  To:                          i_SGefeSystem/i_PorPpr_d2_1:CLR
  Delay (ns):                  2.985
  Slack (ns):
  Arrival (ns):                2.985
  Required (ns):
  Removal (ns):                0.000
  External Removal (ns):       -1.471

Path 4
  From:                        FpgaReset_ira
  To:                          i_SGefeSystem/i_PorPpr_d2_0:CLR
  Delay (ns):                  3.000
  Slack (ns):
  Arrival (ns):                3.000
  Required (ns):
  Removal (ns):                0.000
  External Removal (ns):       -1.486

Path 5
  From:                        FpgaReset_ira
  To:                          i_SGefeSystem/i_PorPpr_d1:CLR
  Delay (ns):                  3.026
  Slack (ns):
  Arrival (ns):                3.026
  Required (ns):
  Removal (ns):                0.000
  External Removal (ns):       -1.503


Expanded Path 1
  From: FpgaReset_ira
  To: i_SGefeSystem/i_PorPpr_d2_5:CLR
  data arrival time                              2.765
  data required time                         -   N/C
  slack                                          N/C
  ________________________________________________________
  Data arrival time calculation
  0.000                        FpgaReset_ira (f)
               +     0.000          net: FpgaReset_ira
  0.000                        i_SGefeSystem/i_PorPpr_ibuf/U0/U0:PAD (f)
               +     0.477          cell: ADLIB:IOPAD_BI
  0.477                        i_SGefeSystem/i_PorPpr_ibuf/U0/U0:Y (f)
               +     0.000          net: i_SGefeSystem/i_PorPpr_ibuf/U0/NET3
  0.477                        i_SGefeSystem/i_PorPpr_ibuf/U0/U1:YIN (f)
               +     0.014          cell: ADLIB:IOBI_IB_OB_EB
  0.491                        i_SGefeSystem/i_PorPpr_ibuf/U0/U1:Y (f)
               +     2.274          net: i_SGefeSystem/PorPpr_ra
  2.765                        i_SGefeSystem/i_PorPpr_d2_5:CLR (f)
                                    
  2.765                        data arrival time
  ________________________________________________________
  Data required time calculation
  N/C                          Osc25Mhz
               +     0.000          Clock source
  N/C                          Osc25Mhz_ik (r)
               +     0.000          net: Osc25Mhz_ik
  N/C                          i_SGefeSystem/i_Osc25Mhz_ibuf/U0/U0:PAD (r)
               +     0.649          cell: ADLIB:IOPAD_IN
  N/C                          i_SGefeSystem/i_Osc25Mhz_ibuf/U0/U0:Y (r)
               +     0.000          net: i_SGefeSystem/i_Osc25Mhz_ibuf/U0/NET1
  N/C                          i_SGefeSystem/i_Osc25Mhz_ibuf/U0/U1:A (r)
               +     0.146          cell: ADLIB:CLKIO
  N/C                          i_SGefeSystem/i_Osc25Mhz_ibuf/U0/U1:Y (r)
               +     0.723          net: Osc25MhzCg_k
  N/C                          i_SGefeSystem/i_PorPpr_d2_5:CLK (r)
               +     0.000          Library removal time: ADLIB:DFN1C1
  N/C                          i_SGefeSystem/i_PorPpr_d2_5:CLR


END SET External Removal

----------------------------------------------------

SET Asynchronous to Register

No Path

END SET Asynchronous to Register

----------------------------------------------------

Clock Domain GbtxElinksDclk

Info: The maximum frequency of this clock domain is limited by the minimum pulse widths of pin i_SGefeApplication/i_GbtxElinksDclkCg_ibuf/U0/U0:PAD

SET Register to Register

No Path

END SET Register to Register

----------------------------------------------------

SET External Hold

No Path

END SET External Hold

----------------------------------------------------

SET Clock to Output

Path 1
  From:                        i_SGefeApplication/ClkFeedback_gen[1].i_ClkFeedback_obuf/U0/U1:OCLK
  To:                          ClkFeedbackP_okb2[1]
  Delay (ns):                  0.830
  Slack (ns):
  Arrival (ns):                2.196
  Required (ns):
  Clock to Out (ns):           2.196

Path 2
  From:                        i_SGefeApplication/ClkFeedback_gen[1].i_ClkFeedback_obuf/U0/U1:OCLK
  To:                          ClkFeedbackN_okb2[1]
  Delay (ns):                  0.844
  Slack (ns):
  Arrival (ns):                2.210
  Required (ns):
  Clock to Out (ns):           2.210


Expanded Path 1
  From: i_SGefeApplication/ClkFeedback_gen[1].i_ClkFeedback_obuf/U0/U1:OCLK
  To: ClkFeedbackP_okb2[1]
  data arrival time                              2.196
  data required time                         -   N/C
  slack                                          N/C
  ________________________________________________________
  Data arrival time calculation
  0.000                        GbtxElinksDclk
               +     0.000          Clock source
  0.000                        GbtxElinksDclkP_ik (r)
               +     0.000          net: GbtxElinksDclkP_ik
  0.000                        i_SGefeApplication/i_GbtxElinksDclkCg_ibuf/U0/U0:PAD (r)
               +     0.647          cell: ADLIB:IOPADP_IN
  0.647                        i_SGefeApplication/i_GbtxElinksDclkCg_ibuf/U0/U0:Y (r)
               +     0.000          net: i_SGefeApplication/i_GbtxElinksDclkCg_ibuf/U0/NET1
  0.647                        i_SGefeApplication/i_GbtxElinksDclkCg_ibuf/U0/U1:A (r)
               +     0.118          cell: ADLIB:CLKIO
  0.765                        i_SGefeApplication/i_GbtxElinksDclkCg_ibuf/U0/U1:Y (r)
               +     0.601          net: i_SGefeApplication/GbtxElinksDclkCg_k
  1.366                        i_SGefeApplication/ClkFeedback_gen[1].i_ClkFeedback_obuf/U0/U1:OCLK (r)
               +     0.300          cell: ADLIB:IOTRI_OD_EB
  1.666                        i_SGefeApplication/ClkFeedback_gen[1].i_ClkFeedback_obuf/U0/U1:DOUT (r)
               +     0.000          net: i_SGefeApplication/ClkFeedback_gen[1]_i_ClkFeedback_obuf/U0/NET1
  1.666                        i_SGefeApplication/ClkFeedback_gen[1].i_ClkFeedback_obuf/U0/U0:D (r)
               +     0.530          cell: ADLIB:IOPADP_TRI
  2.196                        i_SGefeApplication/ClkFeedback_gen[1].i_ClkFeedback_obuf/U0/U0:PAD (r)
               +     0.000          net: ClkFeedbackP_okb2[1]
  2.196                        ClkFeedbackP_okb2[1] (r)
                                    
  2.196                        data arrival time
  ________________________________________________________
  Data required time calculation
  N/C                          GbtxElinksDclk
               +     0.000          Clock source
  N/C                          GbtxElinksDclkP_ik (r)
                                    
  N/C                          ClkFeedbackP_okb2[1] (r)


END SET Clock to Output

----------------------------------------------------

SET Register to Asynchronous

No Path

END SET Register to Asynchronous

----------------------------------------------------

SET External Removal

No Path

END SET External Removal

----------------------------------------------------

SET Asynchronous to Register

No Path

END SET Asynchronous to Register

----------------------------------------------------

Clock Domain ClkFeedback0

SET Register to Register

Path 1
  From:                        i_SGefeApplication/i_Osc25MhzFeedBack0Hb/HeartBeat_oq:CLK
  To:                          i_SGefeApplication/i_Osc25MhzFeedBack0Hb/HeartBeat_oq:D
  Delay (ns):                  0.553
  Slack (ns):                  0.553
  Arrival (ns):                1.911
  Required (ns):               1.358
  Hold (ns):                   0.000

Path 2
  From:                        i_SGefeApplication/i_Osc25MhzFeedBack0Hb/HeartBeatCntr_c32[0]:CLK
  To:                          i_SGefeApplication/i_Osc25MhzFeedBack0Hb/HeartBeatCntr_c32[0]:D
  Delay (ns):                  0.560
  Slack (ns):                  0.560
  Arrival (ns):                1.920
  Required (ns):               1.360
  Hold (ns):                   0.000

Path 3
  From:                        i_SGefeApplication/i_Osc25MhzFeedBack0Hb/HeartBeatCntr_c32[2]:CLK
  To:                          i_SGefeApplication/i_Osc25MhzFeedBack0Hb/HeartBeatCntr_c32[2]:D
  Delay (ns):                  0.580
  Slack (ns):                  0.580
  Arrival (ns):                1.942
  Required (ns):               1.362
  Hold (ns):                   0.000

Path 4
  From:                        i_SGefeApplication/i_Osc25MhzFeedBack0Hb/HeartBeatCntr_c32[9]:CLK
  To:                          i_SGefeApplication/i_Osc25MhzFeedBack0Hb/HeartBeatCntr_c32[9]:D
  Delay (ns):                  0.608
  Slack (ns):                  0.608
  Arrival (ns):                1.978
  Required (ns):               1.370
  Hold (ns):                   0.000

Path 5
  From:                        i_SGefeApplication/i_Osc25MhzFeedBack0Hb/HeartBeatCntr_c32[4]:CLK
  To:                          i_SGefeApplication/i_Osc25MhzFeedBack0Hb/HeartBeatCntr_c32[4]:D
  Delay (ns):                  0.621
  Slack (ns):                  0.621
  Arrival (ns):                1.984
  Required (ns):               1.363
  Hold (ns):                   0.000


Expanded Path 1
  From: i_SGefeApplication/i_Osc25MhzFeedBack0Hb/HeartBeat_oq:CLK
  To: i_SGefeApplication/i_Osc25MhzFeedBack0Hb/HeartBeat_oq:D
  data arrival time                              1.911
  data required time                         -   1.358
  slack                                          0.553
  ________________________________________________________
  Data arrival time calculation
  0.000                        ClkFeedback0
               +     0.000          Clock source
  0.000                        ClkFeedbackP_ikb2[0] (r)
               +     0.000          net: ClkFeedbackP_ikb2[0]
  0.000                        i_SGefeApplication/i_ClkFeedback0_ibuf/U0/U0:PAD (r)
               +     0.647          cell: ADLIB:IOPADP_IN
  0.647                        i_SGefeApplication/i_ClkFeedback0_ibuf/U0/U0:Y (r)
               +     0.000          net: i_SGefeApplication/i_ClkFeedback0_ibuf/U0/NET1
  0.647                        i_SGefeApplication/i_ClkFeedback0_ibuf/U0/U1:A (r)
               +     0.118          cell: ADLIB:CLKIO
  0.765                        i_SGefeApplication/i_ClkFeedback0_ibuf/U0/U1:Y (r)
               +     0.593          net: i_SGefeApplication/ClkFeedbackCg_kb2[0]
  1.358                        i_SGefeApplication/i_Osc25MhzFeedBack0Hb/HeartBeat_oq:CLK (r)
               +     0.196          cell: ADLIB:DFN1C0
  1.554                        i_SGefeApplication/i_Osc25MhzFeedBack0Hb/HeartBeat_oq:Q (r)
               +     0.118          net: i_SGefeApplication/i_Osc25MhzFeedBack0Hb/FeedBackHb_b2[0]
  1.672                        i_SGefeApplication/i_Osc25MhzFeedBack0Hb/HeartBeat_oq_RNO:C (r)
               +     0.116          cell: ADLIB:AX1C
  1.788                        i_SGefeApplication/i_Osc25MhzFeedBack0Hb/HeartBeat_oq_RNO:Y (r)
               +     0.123          net: i_SGefeApplication/i_Osc25MhzFeedBack0Hb/HeartBeat_oq_RNO
  1.911                        i_SGefeApplication/i_Osc25MhzFeedBack0Hb/HeartBeat_oq:D (r)
                                    
  1.911                        data arrival time
  ________________________________________________________
  Data required time calculation
  0.000                        ClkFeedback0
               +     0.000          Clock source
  0.000                        ClkFeedbackP_ikb2[0] (r)
               +     0.000          net: ClkFeedbackP_ikb2[0]
  0.000                        i_SGefeApplication/i_ClkFeedback0_ibuf/U0/U0:PAD (r)
               +     0.647          cell: ADLIB:IOPADP_IN
  0.647                        i_SGefeApplication/i_ClkFeedback0_ibuf/U0/U0:Y (r)
               +     0.000          net: i_SGefeApplication/i_ClkFeedback0_ibuf/U0/NET1
  0.647                        i_SGefeApplication/i_ClkFeedback0_ibuf/U0/U1:A (r)
               +     0.118          cell: ADLIB:CLKIO
  0.765                        i_SGefeApplication/i_ClkFeedback0_ibuf/U0/U1:Y (r)
               +     0.593          net: i_SGefeApplication/ClkFeedbackCg_kb2[0]
  1.358                        i_SGefeApplication/i_Osc25MhzFeedBack0Hb/HeartBeat_oq:CLK (r)
               +     0.000          Library hold time: ADLIB:DFN1C0
  1.358                        i_SGefeApplication/i_Osc25MhzFeedBack0Hb/HeartBeat_oq:D
                                    
  1.358                        data required time


END SET Register to Register

----------------------------------------------------

SET External Hold

No Path

END SET External Hold

----------------------------------------------------

SET Clock to Output

Path 1
  From:                        i_SGefeApplication/i_Osc25MhzFeedBack0Hb/HeartBeat_oq:CLK
  To:                          Leds_onb6[2]
  Delay (ns):                  3.899
  Slack (ns):
  Arrival (ns):                5.257
  Required (ns):
  Clock to Out (ns):           5.257


Expanded Path 1
  From: i_SGefeApplication/i_Osc25MhzFeedBack0Hb/HeartBeat_oq:CLK
  To: Leds_onb6[2]
  data arrival time                              5.257
  data required time                         -   N/C
  slack                                          N/C
  ________________________________________________________
  Data arrival time calculation
  0.000                        ClkFeedback0
               +     0.000          Clock source
  0.000                        ClkFeedbackP_ikb2[0] (r)
               +     0.000          net: ClkFeedbackP_ikb2[0]
  0.000                        i_SGefeApplication/i_ClkFeedback0_ibuf/U0/U0:PAD (r)
               +     0.647          cell: ADLIB:IOPADP_IN
  0.647                        i_SGefeApplication/i_ClkFeedback0_ibuf/U0/U0:Y (r)
               +     0.000          net: i_SGefeApplication/i_ClkFeedback0_ibuf/U0/NET1
  0.647                        i_SGefeApplication/i_ClkFeedback0_ibuf/U0/U1:A (r)
               +     0.118          cell: ADLIB:CLKIO
  0.765                        i_SGefeApplication/i_ClkFeedback0_ibuf/U0/U1:Y (r)
               +     0.593          net: i_SGefeApplication/ClkFeedbackCg_kb2[0]
  1.358                        i_SGefeApplication/i_Osc25MhzFeedBack0Hb/HeartBeat_oq:CLK (r)
               +     0.196          cell: ADLIB:DFN1C0
  1.554                        i_SGefeApplication/i_Osc25MhzFeedBack0Hb/HeartBeat_oq:Q (r)
               +     0.545          net: i_SGefeApplication/i_Osc25MhzFeedBack0Hb/FeedBackHb_b2[0]
  2.099                        i_SGefeApplication/i_Osc25MhzFeedBack0Hb/HeartBeat_oq_RNIIOVG:A (r)
               +     0.192          cell: ADLIB:MX2
  2.291                        i_SGefeApplication/i_Osc25MhzFeedBack0Hb/HeartBeat_oq_RNIIOVG:Y (r)
               +     2.158          net: Leds_onb6_c[2]
  4.449                        Leds_onb6_pad[2]/U0/U1:D (r)
               +     0.220          cell: ADLIB:IOTRI_OB_EB
  4.669                        Leds_onb6_pad[2]/U0/U1:DOUT (r)
               +     0.000          net: Leds_onb6_pad[2]/U0/NET1
  4.669                        Leds_onb6_pad[2]/U0/U0:D (r)
               +     0.588          cell: ADLIB:IOPAD_TRI
  5.257                        Leds_onb6_pad[2]/U0/U0:PAD (r)
               +     0.000          net: Leds_onb6[2]
  5.257                        Leds_onb6[2] (r)
                                    
  5.257                        data arrival time
  ________________________________________________________
  Data required time calculation
  N/C                          ClkFeedback0
               +     0.000          Clock source
  N/C                          ClkFeedbackP_ikb2[0] (r)
                                    
  N/C                          Leds_onb6[2] (r)


END SET Clock to Output

----------------------------------------------------

SET Register to Asynchronous

No Path

END SET Register to Asynchronous

----------------------------------------------------

SET External Removal

No Path

END SET External Removal

----------------------------------------------------

SET Asynchronous to Register

No Path

END SET Asynchronous to Register

----------------------------------------------------

Clock Domain ClkFeedback1

SET Register to Register

Path 1
  From:                        i_SGefeApplication/i_GbtxElinksDclkFeedBack1Hb/HeartBeat_oq:CLK
  To:                          i_SGefeApplication/i_GbtxElinksDclkFeedBack1Hb/HeartBeat_oq:D
  Delay (ns):                  0.578
  Slack (ns):                  0.578
  Arrival (ns):                5.284
  Required (ns):               4.706
  Hold (ns):                   0.000

Path 2
  From:                        i_SGefeApplication/i_GbtxElinksDclkFeedBack1Hb/HeartBeatCntr_c32[0]:CLK
  To:                          i_SGefeApplication/i_GbtxElinksDclkFeedBack1Hb/HeartBeatCntr_c32[0]:D
  Delay (ns):                  0.580
  Slack (ns):                  0.580
  Arrival (ns):                5.295
  Required (ns):               4.715
  Hold (ns):                   0.000

Path 3
  From:                        i_SGefeApplication/i_GbtxElinksDclkFeedBack1Hb/HeartBeatCntr_c32[2]:CLK
  To:                          i_SGefeApplication/i_GbtxElinksDclkFeedBack1Hb/HeartBeatCntr_c32[2]:D
  Delay (ns):                  0.581
  Slack (ns):                  0.581
  Arrival (ns):                5.287
  Required (ns):               4.706
  Hold (ns):                   0.000

Path 4
  From:                        i_SGefeApplication/i_GbtxElinksDclkFeedBack1Hb/HeartBeatCntr_c32[4]:CLK
  To:                          i_SGefeApplication/i_GbtxElinksDclkFeedBack1Hb/HeartBeatCntr_c32[4]:D
  Delay (ns):                  0.606
  Slack (ns):                  0.606
  Arrival (ns):                5.316
  Required (ns):               4.710
  Hold (ns):                   0.000

Path 5
  From:                        i_SGefeApplication/i_GbtxElinksDclkFeedBack1Hb/HeartBeatCntr_c32[23]:CLK
  To:                          i_SGefeApplication/i_GbtxElinksDclkFeedBack1Hb/HeartBeatCntr_c32[23]:D
  Delay (ns):                  0.657
  Slack (ns):                  0.657
  Arrival (ns):                5.362
  Required (ns):               4.705
  Hold (ns):                   0.000


Expanded Path 1
  From: i_SGefeApplication/i_GbtxElinksDclkFeedBack1Hb/HeartBeat_oq:CLK
  To: i_SGefeApplication/i_GbtxElinksDclkFeedBack1Hb/HeartBeat_oq:D
  data arrival time                              5.284
  data required time                         -   4.706
  slack                                          0.578
  ________________________________________________________
  Data arrival time calculation
  0.000                        ClkFeedback1
               +     0.000          Clock source
  0.000                        ClkFeedbackP_ikb2[1] (r)
               +     0.000          net: ClkFeedbackP_ikb2[1]
  0.000                        i_SGefeApplication/i_ClkFeedback1_ibuf/U0/U0:PAD (r)
               +     0.647          cell: ADLIB:IOPADP_IN
  0.647                        i_SGefeApplication/i_ClkFeedback1_ibuf/U0/U0:Y (r)
               +     0.000          net: i_SGefeApplication/i_ClkFeedback1_ibuf/U0/NET1
  0.647                        i_SGefeApplication/i_ClkFeedback1_ibuf/U0/U1:YIN (r)
               +     0.014          cell: ADLIB:IOIN_IB
  0.661                        i_SGefeApplication/i_ClkFeedback1_ibuf/U0/U1:Y (r)
               +     3.203          net: i_SGefeApplication/ClkFeedback1_kb2
  3.864                        i_SGefeApplication/i_ClkFeedback1_Chbuf:A (r)
               +     0.252          cell: ADLIB:CLKINT
  4.116                        i_SGefeApplication/i_ClkFeedback1_Chbuf:Y (r)
               +     0.590          net: i_SGefeApplication/ClkFeedbackCg_kb2[1]
  4.706                        i_SGefeApplication/i_GbtxElinksDclkFeedBack1Hb/HeartBeat_oq:CLK (r)
               +     0.196          cell: ADLIB:DFN1C0
  4.902                        i_SGefeApplication/i_GbtxElinksDclkFeedBack1Hb/HeartBeat_oq:Q (r)
               +     0.143          net: i_SGefeApplication/FeedBackHb_b2[1]
  5.045                        i_SGefeApplication/i_GbtxElinksDclkFeedBack1Hb/HeartBeat_oq_RNO:C (r)
               +     0.116          cell: ADLIB:AX1C
  5.161                        i_SGefeApplication/i_GbtxElinksDclkFeedBack1Hb/HeartBeat_oq_RNO:Y (r)
               +     0.123          net: i_SGefeApplication/i_GbtxElinksDclkFeedBack1Hb/HeartBeat_oq_RNO_0
  5.284                        i_SGefeApplication/i_GbtxElinksDclkFeedBack1Hb/HeartBeat_oq:D (r)
                                    
  5.284                        data arrival time
  ________________________________________________________
  Data required time calculation
  0.000                        ClkFeedback1
               +     0.000          Clock source
  0.000                        ClkFeedbackP_ikb2[1] (r)
               +     0.000          net: ClkFeedbackP_ikb2[1]
  0.000                        i_SGefeApplication/i_ClkFeedback1_ibuf/U0/U0:PAD (r)
               +     0.647          cell: ADLIB:IOPADP_IN
  0.647                        i_SGefeApplication/i_ClkFeedback1_ibuf/U0/U0:Y (r)
               +     0.000          net: i_SGefeApplication/i_ClkFeedback1_ibuf/U0/NET1
  0.647                        i_SGefeApplication/i_ClkFeedback1_ibuf/U0/U1:YIN (r)
               +     0.014          cell: ADLIB:IOIN_IB
  0.661                        i_SGefeApplication/i_ClkFeedback1_ibuf/U0/U1:Y (r)
               +     3.203          net: i_SGefeApplication/ClkFeedback1_kb2
  3.864                        i_SGefeApplication/i_ClkFeedback1_Chbuf:A (r)
               +     0.252          cell: ADLIB:CLKINT
  4.116                        i_SGefeApplication/i_ClkFeedback1_Chbuf:Y (r)
               +     0.590          net: i_SGefeApplication/ClkFeedbackCg_kb2[1]
  4.706                        i_SGefeApplication/i_GbtxElinksDclkFeedBack1Hb/HeartBeat_oq:CLK (r)
               +     0.000          Library hold time: ADLIB:DFN1C0
  4.706                        i_SGefeApplication/i_GbtxElinksDclkFeedBack1Hb/HeartBeat_oq:D
                                    
  4.706                        data required time


END SET Register to Register

----------------------------------------------------

SET External Hold

No Path

END SET External Hold

----------------------------------------------------

SET Clock to Output

Path 1
  From:                        i_SGefeApplication/i_GbtxElinksDclkFeedBack1Hb/HeartBeat_oq:CLK
  To:                          Leds_onb6[2]
  Delay (ns):                  3.509
  Slack (ns):
  Arrival (ns):                8.215
  Required (ns):
  Clock to Out (ns):           8.215


Expanded Path 1
  From: i_SGefeApplication/i_GbtxElinksDclkFeedBack1Hb/HeartBeat_oq:CLK
  To: Leds_onb6[2]
  data arrival time                              8.215
  data required time                         -   N/C
  slack                                          N/C
  ________________________________________________________
  Data arrival time calculation
  0.000                        ClkFeedback1
               +     0.000          Clock source
  0.000                        ClkFeedbackP_ikb2[1] (r)
               +     0.000          net: ClkFeedbackP_ikb2[1]
  0.000                        i_SGefeApplication/i_ClkFeedback1_ibuf/U0/U0:PAD (r)
               +     0.647          cell: ADLIB:IOPADP_IN
  0.647                        i_SGefeApplication/i_ClkFeedback1_ibuf/U0/U0:Y (r)
               +     0.000          net: i_SGefeApplication/i_ClkFeedback1_ibuf/U0/NET1
  0.647                        i_SGefeApplication/i_ClkFeedback1_ibuf/U0/U1:YIN (r)
               +     0.014          cell: ADLIB:IOIN_IB
  0.661                        i_SGefeApplication/i_ClkFeedback1_ibuf/U0/U1:Y (r)
               +     3.203          net: i_SGefeApplication/ClkFeedback1_kb2
  3.864                        i_SGefeApplication/i_ClkFeedback1_Chbuf:A (r)
               +     0.252          cell: ADLIB:CLKINT
  4.116                        i_SGefeApplication/i_ClkFeedback1_Chbuf:Y (r)
               +     0.590          net: i_SGefeApplication/ClkFeedbackCg_kb2[1]
  4.706                        i_SGefeApplication/i_GbtxElinksDclkFeedBack1Hb/HeartBeat_oq:CLK (r)
               +     0.196          cell: ADLIB:DFN1C0
  4.902                        i_SGefeApplication/i_GbtxElinksDclkFeedBack1Hb/HeartBeat_oq:Q (r)
               +     0.149          net: i_SGefeApplication/FeedBackHb_b2[1]
  5.051                        i_SGefeApplication/i_Osc25MhzFeedBack0Hb/HeartBeat_oq_RNIIOVG:B (r)
               +     0.198          cell: ADLIB:MX2
  5.249                        i_SGefeApplication/i_Osc25MhzFeedBack0Hb/HeartBeat_oq_RNIIOVG:Y (r)
               +     2.158          net: Leds_onb6_c[2]
  7.407                        Leds_onb6_pad[2]/U0/U1:D (r)
               +     0.220          cell: ADLIB:IOTRI_OB_EB
  7.627                        Leds_onb6_pad[2]/U0/U1:DOUT (r)
               +     0.000          net: Leds_onb6_pad[2]/U0/NET1
  7.627                        Leds_onb6_pad[2]/U0/U0:D (r)
               +     0.588          cell: ADLIB:IOPAD_TRI
  8.215                        Leds_onb6_pad[2]/U0/U0:PAD (r)
               +     0.000          net: Leds_onb6[2]
  8.215                        Leds_onb6[2] (r)
                                    
  8.215                        data arrival time
  ________________________________________________________
  Data required time calculation
  N/C                          ClkFeedback1
               +     0.000          Clock source
  N/C                          ClkFeedbackP_ikb2[1] (r)
                                    
  N/C                          Leds_onb6[2] (r)


END SET Clock to Output

----------------------------------------------------

SET Register to Asynchronous

No Path

END SET Register to Asynchronous

----------------------------------------------------

SET External Removal

No Path

END SET External Removal

----------------------------------------------------

SET Asynchronous to Register

No Path

END SET Asynchronous to Register

----------------------------------------------------

Clock Domain GbtxClockDes

SET Register to Register

Path 1
  From:                        i_SGefeSystem/GbtxElinksDout_gen[11].i_GbtxElinksDout_ibuf/U0/U1:ICLK
  To:                          i_SGefeApplication/DataGbtxElinks_qb80[55]:D
  Delay (ns):                  0.285
  Slack (ns):                  0.269
  Arrival (ns):                1.651
  Required (ns):               1.382
  Hold (ns):                   0.000

Path 2
  From:                        i_SGefeSystem/GbtxElinksDio_gen[15].i_GbtxElinksDio_ibuf/U0/U1:ICLK
  To:                          i_SGefeApplication/DataGbtxElinks_qb80[31]:D
  Delay (ns):                  0.285
  Slack (ns):                  0.269
  Arrival (ns):                1.654
  Required (ns):               1.385
  Hold (ns):                   0.000

Path 3
  From:                        i_SGefeSystem/GbtxElinksDout_gen[1].i_GbtxElinksDout_ibuf/U0/U1:ICLK
  To:                          i_SGefeApplication/DataGbtxElinks_qb80[35]:D
  Delay (ns):                  0.285
  Slack (ns):                  0.270
  Arrival (ns):                1.652
  Required (ns):               1.382
  Hold (ns):                   0.000

Path 4
  From:                        i_SGefeSystem/GbtxElinksDio_gen[6].i_GbtxElinksDio_ibuf/U0/U1:ICLK
  To:                          i_SGefeApplication/DataGbtxElinks_qb80[13]:D
  Delay (ns):                  0.285
  Slack (ns):                  0.274
  Arrival (ns):                1.656
  Required (ns):               1.382
  Hold (ns):                   0.000

Path 5
  From:                        i_SGefeSystem/GbtxElinksDout_gen[3].i_GbtxElinksDout_ibuf/U0/U1:ICLK
  To:                          i_SGefeApplication/DataGbtxElinks_qb80[39]:D
  Delay (ns):                  0.285
  Slack (ns):                  0.274
  Arrival (ns):                1.656
  Required (ns):               1.382
  Hold (ns):                   0.000


Expanded Path 1
  From: i_SGefeSystem/GbtxElinksDout_gen[11].i_GbtxElinksDout_ibuf/U0/U1:ICLK
  To: i_SGefeApplication/DataGbtxElinks_qb80[55]:D
  data arrival time                              1.651
  data required time                         -   1.382
  slack                                          0.269
  ________________________________________________________
  Data arrival time calculation
  0.000                        GbtxClockDes
               +     0.000          Clock source
  0.000                        GbtxClockDesP_ik (r)
               +     0.000          net: GbtxClockDesP_ik
  0.000                        i_SGefeSystem/i_GbtxElinksDclkCg_ibuf/U0/U0:PAD (r)
               +     0.647          cell: ADLIB:IOPADP_IN
  0.647                        i_SGefeSystem/i_GbtxElinksDclkCg_ibuf/U0/U0:Y (r)
               +     0.000          net: i_SGefeSystem/i_GbtxElinksDclkCg_ibuf/U0/NET1
  0.647                        i_SGefeSystem/i_GbtxElinksDclkCg_ibuf/U0/U1:A (r)
               +     0.118          cell: ADLIB:CLKIO
  0.765                        i_SGefeSystem/i_GbtxElinksDclkCg_ibuf/U0/U1:Y (r)
               +     0.601          net: GbtxClockDesCg_k
  1.366                        i_SGefeSystem/GbtxElinksDout_gen[11].i_GbtxElinksDout_ibuf/U0/U1:ICLK (r)
               +     0.166          cell: ADLIB:IOIN_ID
  1.532                        i_SGefeSystem/GbtxElinksDout_gen[11].i_GbtxElinksDout_ibuf/U0/U1:YR (r)
               +     0.119          net: DataFromGbtx_b80[55]
  1.651                        i_SGefeApplication/DataGbtxElinks_qb80[55]:D (r)
                                    
  1.651                        data arrival time
  ________________________________________________________
  Data required time calculation
  0.000                        GbtxClockDes
               +     0.000          Clock source
  0.000                        GbtxClockDesP_ik (r)
               +     0.000          net: GbtxClockDesP_ik
  0.000                        i_SGefeSystem/i_GbtxElinksDclkCg_ibuf/U0/U0:PAD (r)
               +     0.647          cell: ADLIB:IOPADP_IN
  0.647                        i_SGefeSystem/i_GbtxElinksDclkCg_ibuf/U0/U0:Y (r)
               +     0.000          net: i_SGefeSystem/i_GbtxElinksDclkCg_ibuf/U0/NET1
  0.647                        i_SGefeSystem/i_GbtxElinksDclkCg_ibuf/U0/U1:A (r)
               +     0.118          cell: ADLIB:CLKIO
  0.765                        i_SGefeSystem/i_GbtxElinksDclkCg_ibuf/U0/U1:Y (r)
               +     0.617          net: GbtxClockDesCg_k
  1.382                        i_SGefeApplication/DataGbtxElinks_qb80[55]:CLK (r)
               +     0.000          Library hold time: ADLIB:DFN1
  1.382                        i_SGefeApplication/DataGbtxElinks_qb80[55]:D
                                    
  1.382                        data required time


END SET Register to Register

----------------------------------------------------

SET External Hold

Path 1
  From:                        GbtxElinksDoutP_ib24[35]
  To:                          i_SGefeSystem/GbtxElinksDout_gen[19].i_GbtxElinksDout_ibuf/U0/U1:YIN
  Delay (ns):                  0.647
  Slack (ns):
  Arrival (ns):                0.647
  Required (ns):
  Hold (ns):                   0.000
  External Hold (ns):          1.103

Path 2
  From:                        GbtxElinksDoutP_ib24[28]
  To:                          i_SGefeSystem/GbtxElinksDout_gen[12].i_GbtxElinksDout_ibuf/U0/U1:YIN
  Delay (ns):                  0.647
  Slack (ns):
  Arrival (ns):                0.647
  Required (ns):
  Hold (ns):                   0.000
  External Hold (ns):          1.103

Path 3
  From:                        GbtxElinksDoutP_ib24[37]
  To:                          i_SGefeSystem/GbtxElinksDout_gen[21].i_GbtxElinksDout_ibuf/U0/U1:YIN
  Delay (ns):                  0.647
  Slack (ns):
  Arrival (ns):                0.647
  Required (ns):
  Hold (ns):                   0.000
  External Hold (ns):          1.103

Path 4
  From:                        GbtxElinksDoutP_ib24[39]
  To:                          i_SGefeSystem/GbtxElinksDout_gen[23].i_GbtxElinksDout_ibuf/U0/U1:YIN
  Delay (ns):                  0.647
  Slack (ns):
  Arrival (ns):                0.647
  Required (ns):
  Hold (ns):                   0.000
  External Hold (ns):          1.099

Path 5
  From:                        GbtxElinksDoutP_ib24[32]
  To:                          i_SGefeSystem/GbtxElinksDout_gen[16].i_GbtxElinksDout_ibuf/U0/U1:YIN
  Delay (ns):                  0.647
  Slack (ns):
  Arrival (ns):                0.647
  Required (ns):
  Hold (ns):                   0.000
  External Hold (ns):          1.099


Expanded Path 1
  From: GbtxElinksDoutP_ib24[35]
  To: i_SGefeSystem/GbtxElinksDout_gen[19].i_GbtxElinksDout_ibuf/U0/U1:YIN
  data arrival time                              0.647
  data required time                         -   N/C
  slack                                          N/C
  ________________________________________________________
  Data arrival time calculation
  0.000                        GbtxElinksDoutP_ib24[35] (r)
               +     0.000          net: GbtxElinksDoutP_ib24[35]
  0.000                        i_SGefeSystem/GbtxElinksDout_gen[19].i_GbtxElinksDout_ibuf/U0/U0:PAD (r)
               +     0.647          cell: ADLIB:IOPADP_IN
  0.647                        i_SGefeSystem/GbtxElinksDout_gen[19].i_GbtxElinksDout_ibuf/U0/U0:Y (r)
               +     0.000          net: i_SGefeSystem/GbtxElinksDout_gen[19]_i_GbtxElinksDout_ibuf/U0/NET1
  0.647                        i_SGefeSystem/GbtxElinksDout_gen[19].i_GbtxElinksDout_ibuf/U0/U1:YIN (r)
                                    
  0.647                        data arrival time
  ________________________________________________________
  Data required time calculation
  N/C                          GbtxClockDes
               +     0.000          Clock source
  N/C                          GbtxClockDesP_ik (f)
               +     0.000          net: GbtxClockDesP_ik
  N/C                          i_SGefeSystem/i_GbtxElinksDclkCg_ibuf/U0/U0:PAD (f)
               +     0.823          cell: ADLIB:IOPADP_IN
  N/C                          i_SGefeSystem/i_GbtxElinksDclkCg_ibuf/U0/U0:Y (f)
               +     0.000          net: i_SGefeSystem/i_GbtxElinksDclkCg_ibuf/U0/NET1
  N/C                          i_SGefeSystem/i_GbtxElinksDclkCg_ibuf/U0/U1:A (f)
               +     0.141          cell: ADLIB:CLKIO
  N/C                          i_SGefeSystem/i_GbtxElinksDclkCg_ibuf/U0/U1:Y (f)
               +     0.786          net: GbtxClockDesCg_k
  N/C                          i_SGefeSystem/GbtxElinksDout_gen[19].i_GbtxElinksDout_ibuf/U0/U1:ICLK (f)
               +     0.000          Library hold time: ADLIB:IOIN_ID
  N/C                          i_SGefeSystem/GbtxElinksDout_gen[19].i_GbtxElinksDout_ibuf/U0/U1:YIN


END SET External Hold

----------------------------------------------------

SET Clock to Output

Path 1
  From:                        i_SGefeSystem/GbtxElinksDin_gen[37].i_GbtxElinksDin_obuf/U0/U1:OCLK
  To:                          GbtxElinksDinP_ob40[37]
  Delay (ns):                  0.830
  Slack (ns):
  Arrival (ns):                2.193
  Required (ns):
  Clock to Out (ns):           2.193

Path 2
  From:                        i_SGefeSystem/GbtxElinksDin_gen[30].i_GbtxElinksDin_obuf/U0/U1:OCLK
  To:                          GbtxElinksDinP_ob40[30]
  Delay (ns):                  0.830
  Slack (ns):
  Arrival (ns):                2.193
  Required (ns):
  Clock to Out (ns):           2.193

Path 3
  From:                        i_SGefeSystem/GbtxElinksDin_gen[11].i_GbtxElinksDin_obuf/U0/U1:OCLK
  To:                          GbtxElinksDinP_ob40[11]
  Delay (ns):                  0.830
  Slack (ns):
  Arrival (ns):                2.193
  Required (ns):
  Clock to Out (ns):           2.193

Path 4
  From:                        i_SGefeSystem/GbtxElinksDin_gen[27].i_GbtxElinksDin_obuf/U0/U1:OCLK
  To:                          GbtxElinksDinP_ob40[27]
  Delay (ns):                  0.830
  Slack (ns):
  Arrival (ns):                2.194
  Required (ns):
  Clock to Out (ns):           2.194

Path 5
  From:                        i_SGefeSystem/GbtxElinksDin_gen[29].i_GbtxElinksDin_obuf/U0/U1:OCLK
  To:                          GbtxElinksDinP_ob40[29]
  Delay (ns):                  0.830
  Slack (ns):
  Arrival (ns):                2.195
  Required (ns):
  Clock to Out (ns):           2.195


Expanded Path 1
  From: i_SGefeSystem/GbtxElinksDin_gen[37].i_GbtxElinksDin_obuf/U0/U1:OCLK
  To: GbtxElinksDinP_ob40[37]
  data arrival time                              2.193
  data required time                         -   N/C
  slack                                          N/C
  ________________________________________________________
  Data arrival time calculation
  0.000                        GbtxClockDes
               +     0.000          Clock source
  0.000                        GbtxClockDesP_ik (r)
               +     0.000          net: GbtxClockDesP_ik
  0.000                        i_SGefeSystem/i_GbtxElinksDclkCg_ibuf/U0/U0:PAD (r)
               +     0.647          cell: ADLIB:IOPADP_IN
  0.647                        i_SGefeSystem/i_GbtxElinksDclkCg_ibuf/U0/U0:Y (r)
               +     0.000          net: i_SGefeSystem/i_GbtxElinksDclkCg_ibuf/U0/NET1
  0.647                        i_SGefeSystem/i_GbtxElinksDclkCg_ibuf/U0/U1:A (r)
               +     0.118          cell: ADLIB:CLKIO
  0.765                        i_SGefeSystem/i_GbtxElinksDclkCg_ibuf/U0/U1:Y (r)
               +     0.598          net: GbtxClockDesCg_k
  1.363                        i_SGefeSystem/GbtxElinksDin_gen[37].i_GbtxElinksDin_obuf/U0/U1:OCLK (r)
               +     0.300          cell: ADLIB:IOTRI_OD_EB
  1.663                        i_SGefeSystem/GbtxElinksDin_gen[37].i_GbtxElinksDin_obuf/U0/U1:DOUT (r)
               +     0.000          net: i_SGefeSystem/GbtxElinksDin_gen[37]_i_GbtxElinksDin_obuf/U0/NET1
  1.663                        i_SGefeSystem/GbtxElinksDin_gen[37].i_GbtxElinksDin_obuf/U0/U0:D (r)
               +     0.530          cell: ADLIB:IOPADP_TRI
  2.193                        i_SGefeSystem/GbtxElinksDin_gen[37].i_GbtxElinksDin_obuf/U0/U0:PAD (r)
               +     0.000          net: GbtxElinksDinP_ob40[37]
  2.193                        GbtxElinksDinP_ob40[37] (r)
                                    
  2.193                        data arrival time
  ________________________________________________________
  Data required time calculation
  N/C                          GbtxClockDes
               +     0.000          Clock source
  N/C                          GbtxClockDesP_ik (r)
                                    
  N/C                          GbtxElinksDinP_ob40[37] (r)


END SET Clock to Output

----------------------------------------------------

SET Register to Asynchronous

No Path

END SET Register to Asynchronous

----------------------------------------------------

SET External Removal

No Path

END SET External Removal

----------------------------------------------------

SET Asynchronous to Register

No Path

END SET Asynchronous to Register

----------------------------------------------------

Path set Pin to Pin

SET Input to Output

Path 1
  From:                        Osc25Mhz_ik
  To:                          FmcClkBidirN_iokb2[2]
  Delay (ns):                  1.984
  Slack (ns):
  Arrival (ns):                1.984
  Required (ns):

Path 2
  From:                        Osc25Mhz_ik
  To:                          FmcClkBidirP_iokb2[2]
  Delay (ns):                  1.985
  Slack (ns):
  Arrival (ns):                1.985
  Required (ns):

Path 3
  From:                        GbtxElinksDclkP_ik
  To:                          FmcClkBidirP_iokb2[3]
  Delay (ns):                  2.204
  Slack (ns):
  Arrival (ns):                2.204
  Required (ns):

Path 4
  From:                        GbtxElinksDclkP_ik
  To:                          FmcClkBidirN_iokb2[3]
  Delay (ns):                  2.218
  Slack (ns):
  Arrival (ns):                2.218
  Required (ns):

Path 5
  From:                        GbtxElinksDclkN_ik
  To:                          FmcClkBidirP_iokb2[3]
  Delay (ns):                  2.240
  Slack (ns):
  Arrival (ns):                2.240
  Required (ns):


Expanded Path 1
  From: Osc25Mhz_ik
  To: FmcClkBidirN_iokb2[2]
  data arrival time                              1.984
  data required time                         -   N/C
  slack                                          N/C
  ________________________________________________________
  Data arrival time calculation
  0.000                        Osc25Mhz_ik (f)
               +     0.000          net: Osc25Mhz_ik
  0.000                        i_SGefeSystem/i_Osc25Mhz_ibuf/U0/U0:PAD (f)
               +     0.477          cell: ADLIB:IOPAD_IN
  0.477                        i_SGefeSystem/i_Osc25Mhz_ibuf/U0/U0:Y (f)
               +     0.000          net: i_SGefeSystem/i_Osc25Mhz_ibuf/U0/NET1
  0.477                        i_SGefeSystem/i_Osc25Mhz_ibuf/U0/U1:A (f)
               +     0.120          cell: ADLIB:CLKIO
  0.597                        i_SGefeSystem/i_Osc25Mhz_ibuf/U0/U1:Y (f)
               +     0.600          net: Osc25MhzCg_k
  1.197                        i_SGefeApplication/i_FmcClkBidir2_obuf/U0/U1:D (f)
               +     0.226          cell: ADLIB:IOTRI_OB_EB
  1.423                        i_SGefeApplication/i_FmcClkBidir2_obuf/U0/U1:DOUT (f)
               +     0.000          net: i_SGefeApplication/i_FmcClkBidir2_obuf/U0/NET1
  1.423                        i_SGefeApplication/i_FmcClkBidir2_obuf/U0/U2:DB (f)
               +     0.561          cell: ADLIB:IOPADN_OUT
  1.984                        i_SGefeApplication/i_FmcClkBidir2_obuf/U0/U2:PAD (r)
               +     0.000          net: FmcClkBidirN_iokb2[2]
  1.984                        FmcClkBidirN_iokb2[2] (r)
                                    
  1.984                        data arrival time
  ________________________________________________________
  Data required time calculation
  N/C                          Osc25Mhz_ik (f)
                                    
  N/C                          FmcClkBidirN_iokb2[2] (r)
                                    
  N/C                          data required time


END SET Input to Output

----------------------------------------------------

Path set User Sets

