Target Part: A3PE3000L_FBGA896_STD
Report for cell SGefeTop.verilog
  Core Cell usage:
              cell count     area count*area
              AND2    54      1.0       54.0
              AND3   194      1.0      194.0
               AO1    83      1.0       83.0
              AO1A   105      1.0      105.0
              AO1B    10      1.0       10.0
              AO1C    90      1.0       90.0
             AOI1B    38      1.0       38.0
               AX1     2      1.0        2.0
              AX1C     5      1.0        5.0
              AX1D     1      1.0        1.0
             AXOI3     1      1.0        1.0
             AXOI4     1      1.0        1.0
              BUFF     4      1.0        4.0
            CLKINT     2      0.0        0.0
               GND     8      0.0        0.0
               INV     6      1.0        6.0
               MX2   416      1.0      416.0
              MX2A     1      1.0        1.0
              MX2B     3      1.0        3.0
              NOR2   134      1.0      134.0
             NOR2A   545      1.0      545.0
             NOR2B   202      1.0      202.0
              NOR3    19      1.0       19.0
             NOR3A    94      1.0       94.0
             NOR3B    77      1.0       77.0
             NOR3C   171      1.0      171.0
               OA1   197      1.0      197.0
              OA1A    96      1.0       96.0
              OA1B     5      1.0        5.0
              OA1C     4      1.0        4.0
              OAI1     2      1.0        2.0
               OR2   226      1.0      226.0
              OR2A    38      1.0       38.0
              OR2B    17      1.0       17.0
               OR3    88      1.0       88.0
              OR3A     5      1.0        5.0
              OR3B     3      1.0        3.0
              OR3C     1      1.0        1.0
               VCC     8      0.0        0.0
               XA1    11      1.0       11.0
              XA1B     2      1.0        2.0
              XA1C    25      1.0       25.0
              XOR2   131      1.0      131.0


           DDR_OUT    43      0.0        0.0
           DDR_REG    41      0.0        0.0
              DFN1   553      1.0      553.0
            DFN1C0   132      1.0      132.0
            DFN1C1     8      1.0        8.0
            DFN1E0    38      1.0       38.0
            DFN1P0    11      1.0       11.0
                   -----          ----------
             TOTAL  3951              3849.0


  IO Cell usage:
              cell count
    BIBUF_LVCMOS25     1
   CLKBUF_LVCMOS25     1
       CLKBUF_LVDS     3
             INBUF   129
        INBUF_LVDS    47
            OUTBUF   211
       OUTBUF_LVDS    45
           TRIBUFF     3
                   -----
             TOTAL   440


Core Cells         : 3849 of 75264 (5%)
IO Cells           : 440

  RAM/ROM Usage Summary
Block Rams : 0 of 112 (0%)

