# Synopsys Constraint Checker(syntax only), version mapact, Build 1920R, built Nov 17 2016
# Copyright (C) 1994-2016 Synopsys, Inc. All rights reserved. This Synopsys software and all associated documentation are proprietary to Synopsys, Inc. and may only be used pursuant to the terms and conditions of a written license agreement with Synopsys, Inc. All other use, reproduction, modification, or distribution of the Synopsys software or the associated documentation is strictly prohibited.

# Written on Thu Mar 22 18:42:10 2018


##### DESIGN INFO #######################################################

Top View:                "SGefeTop"
Constraint File(s):      "E:\work_git\S-GEFE\S-GEFE_Test\proasic3\constraint\SGefe_Application_Timing.sdc"
                         "E:\work_git\S-GEFE\S-GEFE_Test\proasic3\constraint\SGefe_System_Timing.sdc"

#Run constraint checker to find more issues with constraints.
#########################################################################



No issues found in constraint syntax.



Clock Summary
*************

Start              Requested     Requested     Clock        Clock           Clock
Clock              Frequency     Period        Type         Group           Load 
---------------------------------------------------------------------------------
ClkFeedback0       25.0 MHz      40.000        declared     group_12_44     33   
ClkFeedback1       40.0 MHz      25.000        declared     group_12_45     33   
GbtxClockDes       40.0 MHz      25.000        declared     group_14_52     721  
GbtxElinksDclk     40.0 MHz      25.000        declared     group_12_43     1    
Osc25Mhz           25.0 MHz      40.000        declared     group_14_51     16   
=================================================================================
