00
00
00
00
00
00
00
00
00
00
00
00
00
00
00
00
00
00
00
00
00
00
00
00
00
00
7f
28
00
17
17
17
66
00
0d
f2
00
0f
04
08
00
20
00
00
00
00
15
15
15
00
07
00
38
00
00
00
00
00
00
00
00
00
00
15
00
00
00
00
00
00
00
00
00
00
00
00
00
00
00
00
00
ff
ff
ff
00
00
00
15
bb
0b
00
00
00
00
00
00
00
00
00
00
00
00
00
00
00
ff
ff
ff
00
00
00
15
bb
0b
00
00
00
00
00
00
00
00
00
00
00
00
00
00
00
ff
ff
ff
00
00
00
15
bb
0b
00
00
00
00
00
00
00
00
00
00
00
00
00
00
00
ff
ff
ff
00
00
00
15
bb
0b
00
00
00
00
00
00
00
00
00
00
00
00
00
00
00
ff
ff
ff
00
00
00
00
00
70
00
00
00
00
00
00
00
00
00
00
00
00
00
00
00
00
00
00
00
00
00
00
00
70
00
00
00
00
00
00
00
00
00
00
00
00
00
00
00
00
00
00
00
00
00
00
00
70
00
00
00
00
00
00
00
00
3f
3f
38
00
00
00
07
00
00
07
00
00
71
02
ff
01
00
ff
01
00
ff
01
00
ff
01
00
ff
00
00
00
00
20
00
00
00
00
00
00
27
15
00
00
00
00
00
00
00
00
00
00
00
00
00
00
00
00
00
00
00
00
00
00
00
00
00
00
00
00
00
00
00
4e
4e
4e
aa
0a
07
00
ff
ff
ff
ff
ff
00
00
88
88
88
88
88
01
02
ff
01
00
ff
01
00
ff
01
00
ff
01
00
ff
01
02
ff
01
00
ff
01
00
ff
01
00
ff
01
00
ff
00
00
00
aa
01
02
00
