# system info serial_flash_loader on 2021.04.16.09:32:08
system_info:
name,value
DEVICE,5AGXMB1G4F40C4
DEVICE_FAMILY,Arria V
GENERATION_ID,1618558327
#
#
# Files generated for serial_flash_loader on 2021.04.16.09:32:08
files:
filepath,kind,attributes,module,is_top
simulation/serial_flash_loader.v,VERILOG,,serial_flash_loader,true
simulation/submodules/altera_serial_flash_loader.v,VERILOG,,altera_serial_flash_loader,false
#
# Map from instance-path to kind of module
instances:
instancePath,module
serial_flash_loader.serial_flash_loader_0,altera_serial_flash_loader
