Info: Starting: Create simulation model
Info: qsys-generate /home/belohrad/git/VFC-HD_Base/libs/VFC-HD_System/hdl/modules/altera_ip/fpga_temp_sensor.qsys --simulation=VERILOG --allow-mixed-language-simulation --output-directory=/home/belohrad/git/VFC-HD_Base/libs/VFC-HD_System/hdl/modules/altera_ip/fpga_temp_sensor/simulation --family="Arria V" --part=5AGXMB1G4F40C4
Progress: Loading altera_ip/fpga_temp_sensor.qsys
Progress: Reading input file
Progress: Adding temp_sense_0 [altera_temp_sense 20.1]
Progress: Parameterizing module temp_sense_0
Progress: Building connections
Progress: Parameterizing connections
Progress: Validating
Progress: Done reading input file
Info: fpga_temp_sensor: Generating fpga_temp_sensor "fpga_temp_sensor" for SIM_VERILOG
Info: temp_sense_0: "fpga_temp_sensor" instantiated altera_temp_sense "temp_sense_0"
Info: fpga_temp_sensor: Done "fpga_temp_sensor" with 2 modules, 2 files
Info: qsys-generate succeeded.
Info: Finished: Create simulation model
Info: Starting: Create Modelsim Project.
Info: sim-script-gen --spd=/home/belohrad/git/VFC-HD_Base/libs/VFC-HD_System/hdl/modules/altera_ip/fpga_temp_sensor/fpga_temp_sensor.spd --output-directory=/home/belohrad/git/VFC-HD_Base/libs/VFC-HD_System/hdl/modules/altera_ip/fpga_temp_sensor/simulation/ --use-relative-paths=true
Info: Doing: ip-make-simscript --spd=/home/belohrad/git/VFC-HD_Base/libs/VFC-HD_System/hdl/modules/altera_ip/fpga_temp_sensor/fpga_temp_sensor.spd --output-directory=/home/belohrad/git/VFC-HD_Base/libs/VFC-HD_System/hdl/modules/altera_ip/fpga_temp_sensor/simulation/ --use-relative-paths=true
Info: Generating the following file(s) for MODELSIM simulator in /home/belohrad/git/VFC-HD_Base/libs/VFC-HD_System/hdl/modules/altera_ip/fpga_temp_sensor/simulation/ directory:
Info: 	mentor/msim_setup.tcl
Info: Generating the following file(s) for VCS simulator in /home/belohrad/git/VFC-HD_Base/libs/VFC-HD_System/hdl/modules/altera_ip/fpga_temp_sensor/simulation/ directory:
Info: 	synopsys/vcs/vcs_setup.sh
Info: Generating the following file(s) for VCSMX simulator in /home/belohrad/git/VFC-HD_Base/libs/VFC-HD_System/hdl/modules/altera_ip/fpga_temp_sensor/simulation/ directory:
Info: 	synopsys/vcsmx/synopsys_sim.setup
Info: 	synopsys/vcsmx/vcsmx_setup.sh
Info: Generating the following file(s) for NCSIM simulator in /home/belohrad/git/VFC-HD_Base/libs/VFC-HD_System/hdl/modules/altera_ip/fpga_temp_sensor/simulation/ directory:
Info: 	cadence/cds.lib
Info: 	cadence/hdl.var
Info: 	cadence/ncsim_setup.sh
Info: 	1 .cds.lib files in cadence/cds_libs/ directory
Info: Generating the following file(s) for RIVIERA simulator in /home/belohrad/git/VFC-HD_Base/libs/VFC-HD_System/hdl/modules/altera_ip/fpga_temp_sensor/simulation/ directory:
Info: 	aldec/rivierapro_setup.tcl
Info: For information on how to simulate your IP, see the explanatory comments in the simulator-specific subdirectories under /home/belohrad/git/VFC-HD_Base/libs/VFC-HD_System/hdl/modules/altera_ip/fpga_temp_sensor/simulation/.
Info: Regenerate these scripts whenever you make any change to any Quartus-generated IP in your project.
Info: Finished: Create Modelsim Project.
Info: Starting: Create block symbol file (.bsf)
Info: qsys-generate /home/belohrad/git/VFC-HD_Base/libs/VFC-HD_System/hdl/modules/altera_ip/fpga_temp_sensor.qsys --block-symbol-file --output-directory=/home/belohrad/git/VFC-HD_Base/libs/VFC-HD_System/hdl/modules/altera_ip/fpga_temp_sensor --family="Arria V" --part=5AGXMB1G4F40C4
Progress: Loading altera_ip/fpga_temp_sensor.qsys
Progress: Reading input file
Progress: Adding temp_sense_0 [altera_temp_sense 20.1]
Progress: Parameterizing module temp_sense_0
Progress: Building connections
Progress: Parameterizing connections
Progress: Validating
Progress: Done reading input file
Info: qsys-generate succeeded.
Info: Finished: Create block symbol file (.bsf)
Info: 
Info: Starting: Create HDL design files for synthesis
Info: qsys-generate /home/belohrad/git/VFC-HD_Base/libs/VFC-HD_System/hdl/modules/altera_ip/fpga_temp_sensor.qsys --synthesis=VERILOG --output-directory=/home/belohrad/git/VFC-HD_Base/libs/VFC-HD_System/hdl/modules/altera_ip/fpga_temp_sensor/synthesis --family="Arria V" --part=5AGXMB1G4F40C4
Progress: Loading altera_ip/fpga_temp_sensor.qsys
Progress: Reading input file
Progress: Adding temp_sense_0 [altera_temp_sense 20.1]
Progress: Parameterizing module temp_sense_0
Progress: Building connections
Progress: Parameterizing connections
Progress: Validating
Progress: Done reading input file
Info: fpga_temp_sensor: Generating fpga_temp_sensor "fpga_temp_sensor" for QUARTUS_SYNTH
Info: temp_sense_0: Generating top-level entity fpga_temp_sensor_temp_sense_0.
Info: temp_sense_0: "fpga_temp_sensor" instantiated altera_temp_sense "temp_sense_0"
Info: fpga_temp_sensor: Done "fpga_temp_sensor" with 2 modules, 2 files
Info: qsys-generate succeeded.
Info: Finished: Create HDL design files for synthesis
