# system info fpga_temp_sensor on 2021.04.16.09:32:51
system_info:
name,value
DEVICE,5AGXMB1G4F40C4
DEVICE_FAMILY,Arria V
GENERATION_ID,1618558371
#
#
# Files generated for fpga_temp_sensor on 2021.04.16.09:32:51
files:
filepath,kind,attributes,module,is_top
simulation/fpga_temp_sensor.v,VERILOG,,fpga_temp_sensor,true
simulation/submodules/altera_temp_sense.v,VERILOG,,altera_temp_sense,false
#
# Map from instance-path to kind of module
instances:
instancePath,module
fpga_temp_sensor.temp_sense_0,altera_temp_sense
