/* XPM */
static char * led_green_xpm[] = {
"24 24 134 2",
"  	c None",
". 	c #36A200",
"+ 	c #51AE1E",
"@ 	c #62BD30",
"# 	c #61BC30",
"$ 	c #51AF1D",
"% 	c #36A000",
"& 	c #5EBB2C",
"* 	c #72D23D",
"= 	c #5FCB25",
"- 	c #67CE2F",
"; 	c #64CD2A",
"> 	c #5BCA1E",
", 	c #71D23C",
"' 	c #5BB928",
") 	c #6BC639",
"! 	c #5ACA1D",
"~ 	c #93DB6B",
"{ 	c #B4E799",
"] 	c #ABE38C",
"^ 	c #A3E181",
"/ 	c #9BDE77",
"( 	c #75D242",
"_ 	c #56C917",
": 	c #67C434",
"< 	c #59B925",
"[ 	c #58C919",
"} 	c #9BDE76",
"| 	c #A0E07D",
"1 	c #9DDF79",
"2 	c #99DD73",
"3 	c #92DB6A",
"4 	c #8CD962",
"5 	c #85D759",
"6 	c #54C815",
"7 	c #58B924",
"8 	c #37A100",
"9 	c #6ACF33",
"0 	c #77D345",
"a 	c #8EDA65",
"b 	c #8FDA66",
"c 	c #8EDB63",
"d 	c #8ADA5E",
"e 	c #84D857",
"f 	c #7ED64F",
"g 	c #78D346",
"h 	c #70D03C",
"i 	c #5CCA1F",
"j 	c #66CE2D",
"k 	c #3AA301",
"l 	c #50AE1D",
"m 	c #7BD44B",
"n 	c #7FD74F",
"o 	c #80D950",
"p 	c #7FD94E",
"q 	c #7CD949",
"r 	c #79D844",
"s 	c #73D63C",
"t 	c #6CD334",
"u 	c #64CF2A",
"v 	c #57C919",
"w 	c #56C817",
"x 	c #5CB829",
"y 	c #59BA25",
"z 	c #4EC60D",
"A 	c #5DCD20",
"B 	c #71D63A",
"C 	c #72D83A",
"D 	c #72D939",
"E 	c #70DA36",
"F 	c #6CD931",
"G 	c #67D62A",
"H 	c #60D321",
"I 	c #59CF18",
"J 	c #52CA10",
"K 	c #56BA20",
"L 	c #57BA22",
"M 	c #51C90F",
"N 	c #54CE12",
"O 	c #5ED31E",
"P 	c #65D826",
"Q 	c #64DA23",
"R 	c #63DB22",
"S 	c #61DB1E",
"T 	c #5DD91A",
"U 	c #5AD617",
"V 	c #58D216",
"W 	c #54B91D",
"X 	c #59B626",
"Y 	c #5ACF1A",
"Z 	c #57D215",
"` 	c #5BD618",
" .	c #5EDA1A",
"..	c #61DD1D",
"+.	c #63DF1E",
"@.	c #63DF1F",
"#.	c #5EDA1B",
"$.	c #58CE18",
"%.	c #5ABA26",
"&.	c #65D429",
"*.	c #59D316",
"=.	c #5DD81A",
"-.	c #65E220",
";.	c #68E523",
">.	c #60D222",
",.	c #6DBB42",
"'.	c #56BD1E",
").	c #5DD61C",
"!.	c #5FDB1B",
"~.	c #63E01F",
"{.	c #6BEA26",
"].	c #5CD61A",
"^.	c #52BC18",
"/.	c #81C45C",
"(.	c #56C719",
"_.	c #62DC1F",
":.	c #61DC1E",
"<.	c #52C413",
"[.	c #82C35F",
"}.	c #7CC057",
"|.	c #53BE19",
"1.	c #69DF28",
"2.	c #69E425",
"3.	c #68E524",
"4.	c #68E425",
"5.	c #67DF25",
"6.	c #50BC15",
"7.	c #7DC259",
"8.	c #69B93D",
"9.	c #5ABE23",
"0.	c #54C118",
"a.	c #53C117",
"b.	c #59BE22",
"c.	c #6AB93F",
"                                                ",
"                                                ",
"                                                ",
"                                                ",
"                                                ",
"                  . + @ # $ %                   ",
"                & * = - ; > , '                 ",
"              ) ! ~ { ] ^ / ( _ :               ",
"            < [ } | 1 2 3 4 5 ( 6 7             ",
"          8 9 0 a b c d e f g h i j k           ",
"          l _ m n o p q r s t u v w x           ",
"          y z A B C D E F G H I J z K           ",
"          L M N O P Q R S T U V N M W           ",
"          X Y Z `  ...+.@...#.` Z $.%.          ",
"            &.*.=...-.;.;.-...=.*.>.,.          ",
"            '.).!.~.;.{.{.;.~.!.].^.            ",
"            /.(._.~.;.{.{.;.~.:.<.[.            ",
"              }.|.1.2.3.;.4.5.6.7.              ",
"                  8.9.0.a.b.c.                  ",
"                                                ",
"                                                ",
"                                                ",
"                                                ",
"                                                "};
