{
    "dependencies": [
        {
            "name": "kube-prometheus",
            "source": {
                "git": {
                    "remote": "https://github.com/coreos/kube-prometheus",
                    "subdir": "jsonnet/kube-prometheus"
                }
            },
            "version": "da959c643657c7d2aac6f5ddd68582a949283c49"
        },
        {
            "name": "ksonnet",
            "source": {
                "git": {
                    "remote": "https://github.com/ksonnet/ksonnet-lib",
                    "subdir": ""
                }
            },
            "version": "0d2f82676817bbf9e4acf6495b2090205f323b9f"
        },
        {
            "name": "kubernetes-mixin",
            "source": {
                "git": {
                    "remote": "https://github.com/kubernetes-monitoring/kubernetes-mixin",
                    "subdir": ""
                }
            },
            "version": "3a6af8f5e9b16441308bcd57ad3f5bcaa03d1d68"
        },
        {
            "name": "grafonnet",
            "source": {
                "git": {
                    "remote": "https://github.com/grafana/grafonnet-lib",
                    "subdir": "grafonnet"
                }
            },
            "version": "69bc267211790a1c3f4ea6e6211f3e8ffe22f987"
        },
        {
            "name": "grafana-builder",
            "source": {
                "git": {
                    "remote": "https://github.com/kausalco/public",
                    "subdir": "grafana-builder"
                }
            },
            "version": "189d685069d896a8cdcc69f9432f982490a2bbd4"
        },
        {
            "name": "grafana",
            "source": {
                "git": {
                    "remote": "https://github.com/brancz/kubernetes-grafana",
                    "subdir": "grafana"
                }
            },
            "version": "7fadaf2274d5cbe4ac6fbaf8786e4b7ecf3c1713"
        },
        {
            "name": "prometheus-operator",
            "source": {
                "git": {
                    "remote": "https://github.com/coreos/prometheus-operator",
                    "subdir": "jsonnet/prometheus-operator"
                }
            },
            "version": "6efd4e5e12213021516c10b3ebd0699260ddd804"
        },
        {
            "name": "etcd-mixin",
            "source": {
                "git": {
                    "remote": "https://github.com/coreos/etcd",
                    "subdir": "Documentation/etcd-mixin"
                }
            },
            "version": "43fe8c3ee02693053ea1e1a2f9350d9b39c80721"
        },
        {
            "name": "prometheus",
            "source": {
                "git": {
                    "remote": "https://github.com/prometheus/prometheus",
                    "subdir": "documentation/prometheus-mixin"
                }
            },
            "version": "d7f4183791266ae3fda183e3c6a236673a23e63a"
        }
    ]
}
