{
  "title": "HLT Prescales",
  "$schema": "http://json-schema.org/draft-07/schema#",
  "$id": "https://gitlab.cern.ch/cms-cactus/experimental/l1-hlt-prescales/blob/master/hlt.schema.xml",
  "type": "object",
  "required": [
    "columns"
  ],
  "properties": {
    "columns": {
      "type": "array",
      "items": {
        "type": "object",
        "required": [
          "name"
        ],
        "properties": {
          "name": {
            "type": "string"
          }
        }
      }
    }
  }
}