[
  {
    "labels": {
      "alertname": "SWATCHMetricAlert",
      "alertstate": "firing",
      "instance": "l1ts-test:9030",
      "job": "swatch-exporter",
      "board": "test_board",
      "component": "test_component1",
      "metric": "test_metric1",
      "subsystem": "TEST",
      "severity": "error"
    },
    "annotations": {
      "title": "TEST error",
      "description": "Metric test_metric1 from test_board.test_component1 has been in error for over 2 minutes.",
      "url": "https://l1page.cms"
    }
  },
  {
    "labels": {
      "alertname": "SWATCHComponentAlert",
      "alertstate": "firing",
      "instance": "l1ts-test:9030",
      "job": "swatch-exporter",
      "board": "test_board",
      "component": "test_component1",
      "subsystem": "TEST",
      "severity": "error"
    },
    "annotations": {
      "title": "TEST error",
      "description": "Component test_component1 of test_board has been in error for over 2 minutes.",
      "url": "https://l1page.cms"
    }
  },
  {
    "labels": {
      "alertname": "SWATCHBoardAlert",
      "alertstate": "firing",
      "instance": "l1ts-test:9030",
      "job": "swatch-exporter",
      "board": "test_board",
      "subsystem": "TEST",
      "severity": "error"
    },
    "annotations": {
      "title": "TEST error",
      "description": "Board test_board has been in error for over 2 minutes.",
      "url": "https://l1page.cms"
    }
  },
  {
    "labels": {
      "alertname": "SWATCHSystemAlert",
      "alertstate": "firing",
      "instance": "l1ts-test:9030",
      "job": "swatch-exporter",
      "subsystem": "TEST",
      "severity": "error"
    },
    "annotations": {
      "title": "TEST error",
      "description": "Subsystem TEST has been in error for over 2 minutes.",
      "url": "https://l1page.cms"
    }
  }
]