{
  "table": {
    "properties": {
      "Name": "urn:xdaq-flashlist:l1ts_cell",
      "LastUpdate": "Fri, Oct 09 2020 10:31:17 GMT",
      "Version": "1.0.0",
      "Tag": "l1ts",
      "LastOriginator": "http://l1ts-calol2.cms:4500/urn:xdaq-application:lid=5",
      "Rows": 20
    },
    "definition": [
      {
        "key": "Alarms",
        "type": "table"
      },
      {
        "key": "CPU",
        "type": "double"
      },
      {
        "key": "Operations",
        "type": "table"
      },
      {
        "key": "PID",
        "type": "int"
      },
      {
        "key": "RSS",
        "type": "unsigned int 32"
      },
      {
        "key": "Rates",
        "type": "table"
      },
      {
        "key": "VSZ",
        "type": "unsigned int 32"
      },
      {
        "key": "context",
        "type": "string"
      },
      {
        "key": "name",
        "type": "string"
      },
      {
        "key": "subsystem",
        "type": "string"
      },
      {
        "key": "timestamp",
        "type": "time"
      },
      {
        "key": "uniqueid",
        "type": "string"
      },
      {
        "key": "urn",
        "type": "string"
      }
    ],
    "rows": [
      {
        "Alarms": {
          "definition": [
            {
              "key": "details",
              "type": "string"
            },
            {
              "key": "name",
              "type": "string"
            },
            {
              "key": "severity",
              "type": "string"
            }
          ],
          "rows": []
        },
        "CPU": 1.62497613465073e-01,
        "Operations": {
          "definition": [
            {
              "key": "className",
              "type": "string"
            },
            {
              "key": "id",
              "type": "string"
            },
            {
              "key": "result",
              "type": "string"
            },
            {
              "key": "state",
              "type": "string"
            },
            {
              "key": "warningLevel",
              "type": "int"
            },
            {
              "key": "warningMessage",
              "type": "string"
            }
          ],
          "rows": [
            {
              "className": "N8tcdscell13ConfigurationE",
              "id": "Run Control",
              "result": "Executed 'cold reset/halt'.",
              "state": "halted",
              "warningLevel": 0,
              "warningMessage": ""
            }
          ]
        },
        "PID": 410819,
        "RSS": 243007488,
        "Rates": {
          "definition": [
            {
              "key": "details",
              "type": "string"
            },
            {
              "key": "name",
              "type": "string"
            },
            {
              "key": "severity",
              "type": "string"
            },
            {
              "key": "value",
              "type": "double"
            }
          ],
          "rows": [
            {
              "details": "",
              "name": "rate 1 - manually added",
              "severity": "WARNING",
              "value": 6.62336269000000e+08
            },
            {
              "details": "rate seems to high",
              "name": "rate 2 - manually added",
              "severity": "ERROR",
              "value": 1.46081403100000e+09
            }
          ]
        },
        "VSZ": 2397581312,
        "context": "http://l1ts-calol2.cms:4500",
        "name": "CALOL2 TCDS ICI Cell",
        "subsystem": "CALOL2",
        "timestamp": "2020-10-09T10:31:17.692010Z",
        "uniqueid": "63ed0025-7bd2-402f-8eb3-8e02c78e8dc4",
        "urn": "urn:xdaq-application:lid=13"
      },
      {
        "Alarms": {
          "definition": [
            {
              "key": "details",
              "type": "string"
            },
            {
              "key": "name",
              "type": "string"
            },
            {
              "key": "severity",
              "type": "string"
            }
          ],
          "rows": []
        },
        "CPU": 4.16664461306483e-01,
        "Operations": {
          "definition": [
            {
              "key": "className",
              "type": "string"
            },
            {
              "key": "id",
              "type": "string"
            },
            {
              "key": "result",
              "type": "string"
            },
            {
              "key": "state",
              "type": "string"
            },
            {
              "key": "warningLevel",
              "type": "int"
            },
            {
              "key": "warningMessage",
              "type": "string"
            }
          ],
          "rows": [
            {
              "className": "N8tcdscell13ConfigurationE",
              "id": "Run Control",
              "result": "Executed 'cold reset/halt'.",
              "state": "halted",
              "warningLevel": 0,
              "warningMessage": ""
            }
          ]
        },
        "PID": 7088,
        "RSS": 250392576,
        "Rates": {
          "definition": [
            {
              "key": "details",
              "type": "string"
            },
            {
              "key": "name",
              "type": "string"
            },
            {
              "key": "severity",
              "type": "string"
            },
            {
              "key": "value",
              "type": "double"
            }
          ],
          "rows": []
        },
        "VSZ": 2229665792,
        "context": "http://l1ts-twinmux.cms:5500",
        "name": "TWINMUX TCDS PI Cell",
        "subsystem": "TWINMUX",
        "timestamp": "2020-10-09T10:31:13.098843Z",
        "uniqueid": "751f2c68-627b-4659-8332-2902ac8cc2ca",
        "urn": "urn:xdaq-application:lid=13"
      },
      {
        "Alarms": {
          "definition": [
            {
              "key": "details",
              "type": "string"
            },
            {
              "key": "name",
              "type": "string"
            },
            {
              "key": "severity",
              "type": "string"
            }
          ],
          "rows": []
        },
        "CPU": 4.08331571228956e-01,
        "Operations": {
          "definition": [
            {
              "key": "className",
              "type": "string"
            },
            {
              "key": "id",
              "type": "string"
            },
            {
              "key": "result",
              "type": "string"
            },
            {
              "key": "state",
              "type": "string"
            },
            {
              "key": "warningLevel",
              "type": "int"
            },
            {
              "key": "warningMessage",
              "type": "string"
            }
          ],
          "rows": [
            {
              "className": "N8tcdscell13ConfigurationE",
              "id": "Run Control",
              "result": "Executed 'cold reset/halt'.",
              "state": "halted",
              "warningLevel": 0,
              "warningMessage": ""
            }
          ]
        },
        "PID": 7094,
        "RSS": 251076608,
        "Rates": {
          "definition": [
            {
              "key": "details",
              "type": "string"
            },
            {
              "key": "name",
              "type": "string"
            },
            {
              "key": "severity",
              "type": "string"
            },
            {
              "key": "value",
              "type": "double"
            }
          ],
          "rows": []
        },
        "VSZ": 2229665792,
        "context": "http://l1ts-twinmux.cms:4500",
        "name": "TWINMUX TCDS ICI Cell",
        "subsystem": "TWINMUX",
        "timestamp": "2020-10-09T10:31:13.099667Z",
        "uniqueid": "79e1412d-1842-46af-9308-8f4fb7e8bcae",
        "urn": "urn:xdaq-application:lid=13"
      },
      {
        "Alarms": {
          "definition": [
            {
              "key": "details",
              "type": "string"
            },
            {
              "key": "name",
              "type": "string"
            },
            {
              "key": "severity",
              "type": "string"
            }
          ],
          "rows": [
            {
              "details": "SWATCH monitoring Warning components : slinkXp0.linkUp",
              "name": "SWATCH_system_monitoring_state",
              "severity": "WARNING"
            }
          ]
        },
        "CPU": 2.48331598572134e+00,
        "Operations": {
          "definition": [
            {
              "key": "className",
              "type": "string"
            },
            {
              "key": "id",
              "type": "string"
            },
            {
              "key": "result",
              "type": "string"
            },
            {
              "key": "state",
              "type": "string"
            },
            {
              "key": "warningLevel",
              "type": "int"
            },
            {
              "key": "warningMessage",
              "type": "string"
            }
          ],
          "rows": [
            {
              "className": "N4emtf16CustomRunControlE",
              "id": "Run Control",
              "result": "Successfully completed system FSM transition 'start' (attempt 1)!",
              "state": "running",
              "warningLevel": 0,
              "warningMessage": ""
            }
          ]
        },
        "PID": 8176,
        "RSS": 373870592,
        "Rates": {
          "definition": [
            {
              "key": "details",
              "type": "string"
            },
            {
              "key": "name",
              "type": "string"
            },
            {
              "key": "severity",
              "type": "string"
            },
            {
              "key": "value",
              "type": "double"
            }
          ],
          "rows": []
        },
        "VSZ": 3657945088,
        "context": "http://l1ts-emtf.cms:3333",
        "name": "EMTF SWATCH Cell",
        "subsystem": "EMTF",
        "timestamp": "2020-10-09T10:31:14.121563Z",
        "uniqueid": "2b4a0d81-827e-4ace-a1c1-1e84083116ed",
        "urn": "urn:xdaq-application:lid=13"
      },
      {
        "Alarms": {
          "definition": [
            {
              "key": "details",
              "type": "string"
            },
            {
              "key": "name",
              "type": "string"
            },
            {
              "key": "severity",
              "type": "string"
            }
          ],
          "rows": [
            {
              "details": "SWATCH monitoring Warning components : evb.tts, slinkXp0.linkUp",
              "name": "SWATCH_system_monitoring_state",
              "severity": "WARNING"
            }
          ]
        },
        "CPU": 3.74997898948044e-01,
        "Operations": {
          "definition": [
            {
              "key": "className",
              "type": "string"
            },
            {
              "key": "id",
              "type": "string"
            },
            {
              "key": "result",
              "type": "string"
            },
            {
              "key": "state",
              "type": "string"
            },
            {
              "key": "warningLevel",
              "type": "int"
            },
            {
              "key": "warningMessage",
              "type": "string"
            }
          ],
          "rows": [
            {
              "className": "N19swatchcellframework10RunControlE",
              "id": "Run Control",
              "result": "",
              "state": "halted",
              "warningLevel": 0,
              "warningMessage": ""
            }
          ]
        },
        "PID": 21004,
        "RSS": 1341693952,
        "Rates": {
          "definition": [
            {
              "key": "details",
              "type": "string"
            },
            {
              "key": "name",
              "type": "string"
            },
            {
              "key": "severity",
              "type": "string"
            },
            {
              "key": "value",
              "type": "double"
            }
          ],
          "rows": []
        },
        "VSZ": 435433472,
        "context": "http://l1ts-calol1.cms:3333",
        "name": "CALOL1 SWATCH Cell",
        "subsystem": "CALOL1",
        "timestamp": "2020-10-09T10:31:08.418069Z",
        "uniqueid": "c3776aee-c505-4c23-8f26-72c8b3807db0",
        "urn": "urn:xdaq-application:lid=13"
      },
      {
        "Alarms": {
          "definition": [
            {
              "key": "details",
              "type": "string"
            },
            {
              "key": "name",
              "type": "string"
            },
            {
              "key": "severity",
              "type": "string"
            }
          ],
          "rows": [
            {
              "details": "SWATCH monitoring Error components : RPCports.portsInErrorCnt",
              "name": "SWATCH_system_monitoring_state",
              "severity": "ERROR"
            }
          ]
        },
        "CPU": 2.09999559403390e+00,
        "Operations": {
          "definition": [
            {
              "key": "className",
              "type": "string"
            },
            {
              "key": "id",
              "type": "string"
            },
            {
              "key": "result",
              "type": "string"
            },
            {
              "key": "state",
              "type": "string"
            },
            {
              "key": "warningLevel",
              "type": "int"
            },
            {
              "key": "warningMessage",
              "type": "string"
            }
          ],
          "rows": [
            {
              "className": "N19swatchcellframework10RunControlE",
              "id": "Run Control",
              "result": "Successfully completed system FSM transition 'start' (attempt 1)!",
              "state": "running",
              "warningLevel": 0,
              "warningMessage": ""
            }
          ]
        },
        "PID": 9608,
        "RSS": 626814976,
        "Rates": {
          "definition": [
            {
              "key": "details",
              "type": "string"
            },
            {
              "key": "name",
              "type": "string"
            },
            {
              "key": "severity",
              "type": "string"
            },
            {
              "key": "value",
              "type": "double"
            }
          ],
          "rows": []
        },
        "VSZ": 3984883712,
        "context": "http://l1ts-twinmux.cms:3333",
        "name": "TWINMUX SWATCH Cell",
        "subsystem": "TWINMUX",
        "timestamp": "2020-10-09T10:31:09.983113Z",
        "uniqueid": "2d5f04b4-5746-4635-87e5-699897c4bbda",
        "urn": "urn:xdaq-application:lid=13"
      },
      {
        "Alarms": {
          "definition": [
            {
              "key": "details",
              "type": "string"
            },
            {
              "key": "name",
              "type": "string"
            },
            {
              "key": "severity",
              "type": "string"
            }
          ],
          "rows": []
        },
        "CPU": 3.83332300586304e-01,
        "Operations": {
          "definition": [
            {
              "key": "className",
              "type": "string"
            },
            {
              "key": "id",
              "type": "string"
            },
            {
              "key": "result",
              "type": "string"
            },
            {
              "key": "state",
              "type": "string"
            },
            {
              "key": "warningLevel",
              "type": "int"
            },
            {
              "key": "warningMessage",
              "type": "string"
            }
          ],
          "rows": [
            {
              "className": "N8tcdscell13ConfigurationE",
              "id": "Run Control",
              "result": "Executed 'cold reset/halt'.",
              "state": "halted",
              "warningLevel": 0,
              "warningMessage": ""
            }
          ]
        },
        "PID": 15512,
        "RSS": 244260864,
        "Rates": {
          "definition": [
            {
              "key": "details",
              "type": "string"
            },
            {
              "key": "name",
              "type": "string"
            },
            {
              "key": "severity",
              "type": "string"
            },
            {
              "key": "value",
              "type": "double"
            }
          ],
          "rows": []
        },
        "VSZ": 2229686272,
        "context": "http://l1ts-ugmt.cms:4500",
        "name": "MUTFUP TCDS ICI Cell",
        "subsystem": "UGMT",
        "timestamp": "2020-10-09T10:31:12.218665Z",
        "uniqueid": "70df5ac6-95d6-4e82-a270-77bf24cb5c75",
        "urn": "urn:xdaq-application:lid=13"
      },
      {
        "Alarms": {
          "definition": [
            {
              "key": "details",
              "type": "string"
            },
            {
              "key": "name",
              "type": "string"
            },
            {
              "key": "severity",
              "type": "string"
            }
          ],
          "rows": [
            {
              "details": "SWATCH monitoring Warning components : evb.tts, slinkXp0.linkUp",
              "name": "SWATCH_system_monitoring_state",
              "severity": "WARNING"
            }
          ]
        },
        "CPU": 1.65562202237239e-01,
        "Operations": {
          "definition": [
            {
              "key": "className",
              "type": "string"
            },
            {
              "key": "id",
              "type": "string"
            },
            {
              "key": "result",
              "type": "string"
            },
            {
              "key": "state",
              "type": "string"
            },
            {
              "key": "warningLevel",
              "type": "int"
            },
            {
              "key": "warningMessage",
              "type": "string"
            }
          ],
          "rows": [
            {
              "className": "N19swatchcellframework10RunControlE",
              "id": "Run Control",
              "result": "",
              "state": "halted",
              "warningLevel": 0,
              "warningMessage": ""
            }
          ]
        },
        "PID": 410822,
        "RSS": 439226368,
        "Rates": {
          "definition": [
            {
              "key": "details",
              "type": "string"
            },
            {
              "key": "name",
              "type": "string"
            },
            {
              "key": "severity",
              "type": "string"
            },
            {
              "key": "value",
              "type": "double"
            }
          ],
          "rows": []
        },
        "VSZ": 4251639808,
        "context": "http://l1ts-calol2.cms:3333",
        "name": "CALOL2 SWATCH Cell",
        "subsystem": "CALOL2",
        "timestamp": "2020-10-09T10:31:15.584161Z",
        "uniqueid": "b57a8b4f-ef67-4642-b854-f57d549e1c6d",
        "urn": "urn:xdaq-application:lid=13"
      },
      {
        "Alarms": {
          "definition": [
            {
              "key": "details",
              "type": "string"
            },
            {
              "key": "name",
              "type": "string"
            },
            {
              "key": "severity",
              "type": "string"
            }
          ],
          "rows": []
        },
        "CPU": 3.74999284745627e-01,
        "Operations": {
          "definition": [
            {
              "key": "className",
              "type": "string"
            },
            {
              "key": "id",
              "type": "string"
            },
            {
              "key": "result",
              "type": "string"
            },
            {
              "key": "state",
              "type": "string"
            },
            {
              "key": "warningLevel",
              "type": "int"
            },
            {
              "key": "warningMessage",
              "type": "string"
            }
          ],
          "rows": [
            {
              "className": "N8tcdscell13ConfigurationE",
              "id": "Run Control",
              "result": "Executed 'cold reset/halt'.",
              "state": "halted",
              "warningLevel": 0,
              "warningMessage": ""
            }
          ]
        },
        "PID": 15509,
        "RSS": 247672832,
        "Rates": {
          "definition": [
            {
              "key": "details",
              "type": "string"
            },
            {
              "key": "name",
              "type": "string"
            },
            {
              "key": "severity",
              "type": "string"
            },
            {
              "key": "value",
              "type": "double"
            }
          ],
          "rows": []
        },
        "VSZ": 2229673984,
        "context": "http://l1ts-ugmt.cms:5500",
        "name": "MUTFUP TCDS PI Cell",
        "subsystem": "UGMT",
        "timestamp": "2020-10-09T10:31:11.432096Z",
        "uniqueid": "3cf7338b-6a34-4d9a-b888-5c1fb83deab0",
        "urn": "urn:xdaq-application:lid=13"
      },
      {
        "Alarms": {
          "definition": [
            {
              "key": "details",
              "type": "string"
            },
            {
              "key": "name",
              "type": "string"
            },
            {
              "key": "severity",
              "type": "string"
            }
          ],
          "rows": []
        },
        "CPU": 1.68748768875044e-01,
        "Operations": {
          "definition": [
            {
              "key": "className",
              "type": "string"
            },
            {
              "key": "id",
              "type": "string"
            },
            {
              "key": "result",
              "type": "string"
            },
            {
              "key": "state",
              "type": "string"
            },
            {
              "key": "warningLevel",
              "type": "int"
            },
            {
              "key": "warningMessage",
              "type": "string"
            }
          ],
          "rows": [
            {
              "className": "N8tcdscell13ConfigurationE",
              "id": "Run Control",
              "result": "Executed 'cold reset/halt'.",
              "state": "halted",
              "warningLevel": 0,
              "warningMessage": ""
            }
          ]
        },
        "PID": 410831,
        "RSS": 232013824,
        "Rates": {
          "definition": [
            {
              "key": "details",
              "type": "string"
            },
            {
              "key": "name",
              "type": "string"
            },
            {
              "key": "severity",
              "type": "string"
            },
            {
              "key": "value",
              "type": "double"
            }
          ],
          "rows": []
        },
        "VSZ": 2397581312,
        "context": "http://l1ts-calol2.cms:5500",
        "name": "CALOL2 TCDS PI Cell",
        "subsystem": "CALOL2",
        "timestamp": "2020-10-09T10:31:14.306122Z",
        "uniqueid": "0e7e1f4a-3657-4060-b777-c3431e25e2d1",
        "urn": "urn:xdaq-application:lid=13"
      },
      {
        "Alarms": {
          "definition": [
            {
              "key": "details",
              "type": "string"
            },
            {
              "key": "name",
              "type": "string"
            },
            {
              "key": "severity",
              "type": "string"
            }
          ],
          "rows": []
        },
        "CPU": 3.83331605998511e-01,
        "Operations": {
          "definition": [
            {
              "key": "className",
              "type": "string"
            },
            {
              "key": "id",
              "type": "string"
            },
            {
              "key": "result",
              "type": "string"
            },
            {
              "key": "state",
              "type": "string"
            },
            {
              "key": "warningLevel",
              "type": "int"
            },
            {
              "key": "warningMessage",
              "type": "string"
            }
          ],
          "rows": [
            {
              "className": "N8tcdscell13ConfigurationE",
              "id": "Run Control",
              "result": "Executed transition 'start'.",
              "state": "running",
              "warningLevel": 0,
              "warningMessage": ""
            }
          ]
        },
        "PID": 15450,
        "RSS": 252649472,
        "Rates": {
          "definition": [
            {
              "key": "details",
              "type": "string"
            },
            {
              "key": "name",
              "type": "string"
            },
            {
              "key": "severity",
              "type": "string"
            },
            {
              "key": "value",
              "type": "double"
            }
          ],
          "rows": []
        },
        "VSZ": 2229669888,
        "context": "http://l1ts-ugt.cms:4500",
        "name": "GTUP TCDS ICI Cell",
        "subsystem": "UGT",
        "timestamp": "2020-10-09T10:31:14.650945Z",
        "uniqueid": "4803645f-a168-4799-8a4a-2907e28d05dc",
        "urn": "urn:xdaq-application:lid=13"
      },
      {
        "Alarms": {
          "definition": [
            {
              "key": "details",
              "type": "string"
            },
            {
              "key": "name",
              "type": "string"
            },
            {
              "key": "severity",
              "type": "string"
            }
          ],
          "rows": []
        },
        "CPU": 3.83332382840288e-01,
        "Operations": {
          "definition": [
            {
              "key": "className",
              "type": "string"
            },
            {
              "key": "id",
              "type": "string"
            },
            {
              "key": "result",
              "type": "string"
            },
            {
              "key": "state",
              "type": "string"
            },
            {
              "key": "warningLevel",
              "type": "int"
            },
            {
              "key": "warningMessage",
              "type": "string"
            }
          ],
          "rows": [
            {
              "className": "N8tcdscell13ConfigurationE",
              "id": "Run Control",
              "result": "Executed 'cold reset/halt'.",
              "state": "halted",
              "warningLevel": 0,
              "warningMessage": ""
            }
          ]
        },
        "PID": 15457,
        "RSS": 249561088,
        "Rates": {
          "definition": [
            {
              "key": "details",
              "type": "string"
            },
            {
              "key": "name",
              "type": "string"
            },
            {
              "key": "severity",
              "type": "string"
            },
            {
              "key": "value",
              "type": "double"
            }
          ],
          "rows": []
        },
        "VSZ": 2229665792,
        "context": "http://l1ts-calol1.cms:4500",
        "name": "CALOL1 TCDS ICI Cell",
        "subsystem": "CALOL1",
        "timestamp": "2020-10-09T10:31:14.419598Z",
        "uniqueid": "2829b03f-f867-406e-aa9a-6d5f04e471fc",
        "urn": "urn:xdaq-application:lid=13"
      },
      {
        "Alarms": {
          "definition": [
            {
              "key": "details",
              "type": "string"
            },
            {
              "key": "name",
              "type": "string"
            },
            {
              "key": "severity",
              "type": "string"
            }
          ],
          "rows": []
        },
        "CPU": 3.83331222148443e-01,
        "Operations": {
          "definition": [
            {
              "key": "className",
              "type": "string"
            },
            {
              "key": "id",
              "type": "string"
            },
            {
              "key": "result",
              "type": "string"
            },
            {
              "key": "state",
              "type": "string"
            },
            {
              "key": "warningLevel",
              "type": "int"
            },
            {
              "key": "warningMessage",
              "type": "string"
            }
          ],
          "rows": [
            {
              "className": "N8tcdscell13ConfigurationE",
              "id": "Run Control",
              "result": "Executed 'cold reset/halt'.",
              "state": "halted",
              "warningLevel": 0,
              "warningMessage": ""
            }
          ]
        },
        "PID": 15454,
        "RSS": 246734848,
        "Rates": {
          "definition": [
            {
              "key": "details",
              "type": "string"
            },
            {
              "key": "name",
              "type": "string"
            },
            {
              "key": "severity",
              "type": "string"
            },
            {
              "key": "value",
              "type": "double"
            }
          ],
          "rows": []
        },
        "VSZ": 2229678080,
        "context": "http://l1ts-calol1.cms:5500",
        "name": "CALOL1 TCDS PI Cell",
        "subsystem": "CALOL1",
        "timestamp": "2020-10-09T10:31:08.504501Z",
        "uniqueid": "fa713329-6bab-419d-a81d-b4d1fd2b6852",
        "urn": "urn:xdaq-application:lid=13"
      },
      {
        "Alarms": {
          "definition": [
            {
              "key": "details",
              "type": "string"
            },
            {
              "key": "name",
              "type": "string"
            },
            {
              "key": "severity",
              "type": "string"
            }
          ],
          "rows": [
            {
              "details": "SWATCH monitoring Warning components : evb.tts",
              "name": "SWATCH_system_monitoring_state",
              "severity": "WARNING"
            }
          ]
        },
        "CPU": 3.74998801950468e-01,
        "Operations": {
          "definition": [
            {
              "key": "className",
              "type": "string"
            },
            {
              "key": "id",
              "type": "string"
            },
            {
              "key": "result",
              "type": "string"
            },
            {
              "key": "state",
              "type": "string"
            },
            {
              "key": "warningLevel",
              "type": "int"
            },
            {
              "key": "warningMessage",
              "type": "string"
            }
          ],
          "rows": [
            {
              "className": "N19swatchcellframework10RunControlE",
              "id": "Run Control",
              "result": "",
              "state": "halted",
              "warningLevel": 0,
              "warningMessage": ""
            }
          ]
        },
        "PID": 16976,
        "RSS": 297943040,
        "Rates": {
          "definition": [
            {
              "key": "details",
              "type": "string"
            },
            {
              "key": "name",
              "type": "string"
            },
            {
              "key": "severity",
              "type": "string"
            },
            {
              "key": "value",
              "type": "double"
            }
          ],
          "rows": []
        },
        "VSZ": 3668717568,
        "context": "http://l1ts-cppf.cms:3333",
        "name": "CPPF SWATCH Cell",
        "subsystem": "CPPF",
        "timestamp": "2020-10-09T10:31:13.334792Z",
        "uniqueid": "831a43c4-a41f-4e6a-93e0-00dff4c99824",
        "urn": "urn:xdaq-application:lid=13"
      },
      {
        "Alarms": {
          "definition": [
            {
              "key": "details",
              "type": "string"
            },
            {
              "key": "name",
              "type": "string"
            },
            {
              "key": "severity",
              "type": "string"
            }
          ],
          "rows": []
        },
        "CPU": 3.66664612304754e-01,
        "Operations": {
          "definition": [
            {
              "key": "className",
              "type": "string"
            },
            {
              "key": "id",
              "type": "string"
            },
            {
              "key": "result",
              "type": "string"
            },
            {
              "key": "state",
              "type": "string"
            },
            {
              "key": "warningLevel",
              "type": "int"
            },
            {
              "key": "warningMessage",
              "type": "string"
            }
          ],
          "rows": [
            {
              "className": "N8tcdscell13ConfigurationE",
              "id": "Run Control",
              "result": "Executed transition 'start'.",
              "state": "running",
              "warningLevel": 0,
              "warningMessage": ""
            }
          ]
        },
        "PID": 15445,
        "RSS": 246898688,
        "Rates": {
          "definition": [
            {
              "key": "details",
              "type": "string"
            },
            {
              "key": "name",
              "type": "string"
            },
            {
              "key": "severity",
              "type": "string"
            },
            {
              "key": "value",
              "type": "double"
            }
          ],
          "rows": []
        },
        "VSZ": 2229678080,
        "context": "http://l1ts-ugt.cms:5500",
        "name": "GTUP TCDS PI Cell",
        "subsystem": "UGT",
        "timestamp": "2020-10-09T10:31:12.123537Z",
        "uniqueid": "4cfcae06-bb43-4bdd-ac17-74a8071fced4",
        "urn": "urn:xdaq-application:lid=13"
      },
      {
        "Alarms": {
          "definition": [
            {
              "key": "details",
              "type": "string"
            },
            {
              "key": "name",
              "type": "string"
            },
            {
              "key": "severity",
              "type": "string"
            }
          ],
          "rows": [
            {
              "details": "SWATCH monitoring Warning components : evb.tts",
              "name": "SWATCH_system_monitoring_state",
              "severity": "WARNING"
            }
          ]
        },
        "CPU": 3.74996700911936e-01,
        "Operations": {
          "definition": [
            {
              "key": "className",
              "type": "string"
            },
            {
              "key": "id",
              "type": "string"
            },
            {
              "key": "result",
              "type": "string"
            },
            {
              "key": "state",
              "type": "string"
            },
            {
              "key": "warningLevel",
              "type": "int"
            },
            {
              "key": "warningMessage",
              "type": "string"
            }
          ],
          "rows": [
            {
              "className": "N19swatchcellframework10RunControlE",
              "id": "Run Control",
              "result": "",
              "state": "halted",
              "warningLevel": 0,
              "warningMessage": ""
            }
          ]
        },
        "PID": 15449,
        "RSS": 300142592,
        "Rates": {
          "definition": [
            {
              "key": "details",
              "type": "string"
            },
            {
              "key": "name",
              "type": "string"
            },
            {
              "key": "severity",
              "type": "string"
            },
            {
              "key": "value",
              "type": "double"
            }
          ],
          "rows": []
        },
        "VSZ": 110370816,
        "context": "http://l1ts-bmtf.cms:3333",
        "name": "BMTF SWATCH Cell",
        "subsystem": "BMTF",
        "timestamp": "2020-10-09T10:31:16.083503Z",
        "uniqueid": "bbe85088-2765-4229-9841-a24ab065b219",
        "urn": "urn:xdaq-application:lid=13"
      },
      {
        "Alarms": {
          "definition": [
            {
              "key": "details",
              "type": "string"
            },
            {
              "key": "name",
              "type": "string"
            },
            {
              "key": "severity",
              "type": "string"
            }
          ],
          "rows": []
        },
        "CPU": 3.99998245246956e+00,
        "Operations": {
          "definition": [
            {
              "key": "className",
              "type": "string"
            },
            {
              "key": "id",
              "type": "string"
            },
            {
              "key": "result",
              "type": "string"
            },
            {
              "key": "state",
              "type": "string"
            },
            {
              "key": "warningLevel",
              "type": "int"
            },
            {
              "key": "warningMessage",
              "type": "string"
            }
          ],
          "rows": [
            {
              "className": "N11centralcell10RunControlE",
              "id": "Run Control",
              "result": "*** Collecting Run Control:align\\\" replies...\\n================================================================================\\n\n*** Collecting Run Control:align\\\" replies...\\n================================================================================\\n\n*** Collecting Run Control:align\\\" replies...\\n================================================================================\\n\n*** Collecting Run Control:align\\\" replies...\\n================================================================================\\n\n*** Collecting Run Control:align\\\" replies...\\n================================================================================\\n\n*** Collecting Run Control:align\\\" replies...\\n================================================================================\\n\n*** Collecting Run Control:align\\\" replies...\\n================================================================================\\n\n*** Collecting Run Control:align\\\" replies...\\n================================================================================\\n\n*** Collecting Run Control:align\\\" replies...\\n@UGT.align : Successfully completed system FSM transition 'align' (attempt 1)!\\n### Elapsed time: 941 msec\\n\n================================================================================\\n\n*** Collecting Run Control:start\\\" replies...\\n@UGT.start : Successfully completed system FSM transition 'start' (attempt 1)!\\n### Elapsed time: 1249 msec\\n\n================================================================================\\n\n*** Collecting Run Control:start\\\" replies...\\n@GTUP_TCDS_ICI.start : Executed transition 'start'.\\n### Elapsed time: 228 msec\\n\n@GTUP_TCDS_PI.start : Executed transition 'start'.\\n### Elapsed time: 226 msec\\n\n================================================================================\\n\n",
              "state": "running",
              "warningLevel": 0,
              "warningMessage": ""
            }
          ]
        },
        "PID": 11184,
        "RSS": 228974592,
        "Rates": {
          "definition": [
            {
              "key": "details",
              "type": "string"
            },
            {
              "key": "name",
              "type": "string"
            },
            {
              "key": "severity",
              "type": "string"
            },
            {
              "key": "value",
              "type": "double"
            }
          ],
          "rows": []
        },
        "VSZ": 1829732352,
        "context": "http://l1ts-central.cms:3333",
        "name": "Upgrade Central Cell",
        "subsystem": "CENTRAL",
        "timestamp": "2020-10-09T10:31:12.666960Z",
        "uniqueid": "57cc6a73-1086-4083-a5cb-69eaf6584730",
        "urn": "urn:xdaq-application:lid=13"
      },
      {
        "Alarms": {
          "definition": [
            {
              "key": "details",
              "type": "string"
            },
            {
              "key": "name",
              "type": "string"
            },
            {
              "key": "severity",
              "type": "string"
            }
          ],
          "rows": [
            {
              "details": "SWATCH monitoring Warning components : evb.tts",
              "name": "SWATCH_system_monitoring_state",
              "severity": "WARNING"
            }
          ]
        },
        "CPU": 3.91666125059877e-01,
        "Operations": {
          "definition": [
            {
              "key": "className",
              "type": "string"
            },
            {
              "key": "id",
              "type": "string"
            },
            {
              "key": "result",
              "type": "string"
            },
            {
              "key": "state",
              "type": "string"
            },
            {
              "key": "warningLevel",
              "type": "int"
            },
            {
              "key": "warningMessage",
              "type": "string"
            }
          ],
          "rows": [
            {
              "className": "N10ugmttscell16CustomRunControlE",
              "id": "Run Control",
              "result": "",
              "state": "halted",
              "warningLevel": 0,
              "warningMessage": ""
            }
          ]
        },
        "PID": 763,
        "RSS": 300306432,
        "Rates": {
          "definition": [
            {
              "key": "details",
              "type": "string"
            },
            {
              "key": "name",
              "type": "string"
            },
            {
              "key": "severity",
              "type": "string"
            },
            {
              "key": "value",
              "type": "double"
            }
          ],
          "rows": []
        },
        "VSZ": 2825408512,
        "context": "http://l1ts-ugmt.cms:3333",
        "name": "uGMT SWATCH Cell",
        "subsystem": "UGMT",
        "timestamp": "2020-10-09T10:31:17.489161Z",
        "uniqueid": "967c1c44-2632-4e2f-a799-51c79d1cf55c",
        "urn": "urn:xdaq-application:lid=13"
      },
      {
        "Alarms": {
          "definition": [
            {
              "key": "details",
              "type": "string"
            },
            {
              "key": "name",
              "type": "string"
            },
            {
              "key": "severity",
              "type": "string"
            }
          ],
          "rows": [
            {
              "details": "SWATCH monitoring Good",
              "name": "SWATCH_system_monitoring_state",
              "severity": "INFO"
            }
          ]
        },
        "CPU": 1.69166263342865e+00,
        "Operations": {
          "definition": [
            {
              "key": "className",
              "type": "string"
            },
            {
              "key": "id",
              "type": "string"
            },
            {
              "key": "result",
              "type": "string"
            },
            {
              "key": "state",
              "type": "string"
            },
            {
              "key": "warningLevel",
              "type": "int"
            },
            {
              "key": "warningMessage",
              "type": "string"
            }
          ],
          "rows": [
            {
              "className": "N3ugt16CustomRunControlE",
              "id": "Run Control",
              "result": "Successfully completed system FSM transition 'start' (attempt 1)!",
              "state": "running",
              "warningLevel": 0,
              "warningMessage": ""
            }
          ]
        },
        "PID": 25491,
        "RSS": 1924931584,
        "Rates": {
          "definition": [
            {
              "key": "details",
              "type": "string"
            },
            {
              "key": "name",
              "type": "string"
            },
            {
              "key": "severity",
              "type": "string"
            },
            {
              "key": "value",
              "type": "double"
            }
          ],
          "rows": []
        },
        "VSZ": 910753792,
        "context": "http://l1ts-ugt.cms:3333",
        "name": "uGT SWATCH Cell",
        "subsystem": "UGT",
        "timestamp": "2020-10-09T10:31:13.420687Z",
        "uniqueid": "49379f17-cd9a-42d9-8bc5-9048c24f6905",
        "urn": "urn:xdaq-application:lid=13"
      },
      {
        "Alarms": {
          "definition": [
            {
              "key": "details",
              "type": "string"
            },
            {
              "key": "name",
              "type": "string"
            },
            {
              "key": "severity",
              "type": "string"
            }
          ],
          "rows": [
            {
              "details": "SWATCH monitoring Warning components : evb.tts",
              "name": "SWATCH_system_monitoring_state",
              "severity": "WARNING"
            }
          ]
        },
        "CPU": 3.74998095641270e-01,
        "Operations": {
          "definition": [
            {
              "key": "className",
              "type": "string"
            },
            {
              "key": "id",
              "type": "string"
            },
            {
              "key": "result",
              "type": "string"
            },
            {
              "key": "state",
              "type": "string"
            },
            {
              "key": "warningLevel",
              "type": "int"
            },
            {
              "key": "warningMessage",
              "type": "string"
            }
          ],
          "rows": [
            {
              "className": "N19swatchcellframework10RunControlE",
              "id": "Run Control",
              "result": "",
              "state": "halted",
              "warningLevel": 0,
              "warningMessage": ""
            }
          ]
        },
        "PID": 573,
        "RSS": 394711040,
        "Rates": {
          "definition": [
            {
              "key": "details",
              "type": "string"
            },
            {
              "key": "name",
              "type": "string"
            },
            {
              "key": "severity",
              "type": "string"
            },
            {
              "key": "value",
              "type": "double"
            }
          ],
          "rows": []
        },
        "VSZ": 118845440,
        "context": "http://l1ts-omtf.cms:3333",
        "name": "OMTF SWATCH Cell",
        "subsystem": "OMTF",
        "timestamp": "2020-10-09T10:31:11.811685Z",
        "uniqueid": "4f483af8-ff50-469a-b7c8-77ee636517fd",
        "urn": "urn:xdaq-application:lid=13"
      }
    ]
  }
}