{
  "table": {
    "properties": {
      "Name": "urn:xdaq-flashlist:eventing-statistics",
      "LastUpdate": "Fri, Oct 09 2020 10:30:57 GMT",
      "Version": "$Revision: 15125 $",
      "Tag": "unit",
      "LastOriginator": "http://kvm-s3562-1-ip151-102.cms:4002/urn:xdaq-application:lid=5",
      "Rows": 2
    },
    "definition": [
      {
        "key": "classname",
        "type": "string"
      },
      {
        "key": "clients",
        "type": "unsigned int 32"
      },
      {
        "key": "components",
        "type": "table"
      },
      {
        "key": "context",
        "type": "string"
      },
      {
        "key": "cpuusage",
        "type": "double"
      },
      {
        "key": "datacount",
        "type": "unsigned int 32"
      },
      {
        "key": "datacounthisto",
        "type": "vector unsigned int 32"
      },
      {
        "key": "group",
        "type": "string"
      },
      {
        "key": "lid",
        "type": "string"
      },
      {
        "key": "load",
        "type": "double"
      },
      {
        "key": "lostdatacount",
        "type": "unsigned int 32"
      },
      {
        "key": "lostdatacounthisto",
        "type": "vector unsigned int 32"
      },
      {
        "key": "lostmessagecount",
        "type": "unsigned int 32"
      },
      {
        "key": "lostmessagecounthisto",
        "type": "vector unsigned int 32"
      },
      {
        "key": "messagecount",
        "type": "unsigned int 32"
      },
      {
        "key": "messagecounthisto",
        "type": "vector unsigned int 32"
      },
      {
        "key": "messagesizehisto",
        "type": "vector unsigned int 32"
      },
      {
        "key": "rsize",
        "type": "unsigned int 32"
      },
      {
        "key": "service",
        "type": "string"
      },
      {
        "key": "systemtime",
        "type": "double"
      },
      {
        "key": "timestamp",
        "type": "time"
      },
      {
        "key": "uniqueid",
        "type": "string"
      },
      {
        "key": "url",
        "type": "string"
      },
      {
        "key": "vsize",
        "type": "unsigned int 32"
      }
    ],
    "rows": [
      {
        "classname": "b2in::eventing::Application",
        "clients": 0,
        "components": {
          "definition": [
            {
              "key": "load",
              "type": "double"
            },
            {
              "key": "name",
              "type": "string"
            },
            {
              "key": "servicetime",
              "type": "double"
            }
          ],
          "rows": [
            {
              "load": 0.00000000000000e+00,
              "name": "eventing",
              "servicetime": 0.00000000000000e+00
            },
            {
              "load": 0.00000000000000e+00,
              "name": "ptincoming",
              "servicetime": 0.00000000000000e+00
            },
            {
              "load": 0.00000000000000e+00,
              "name": "ptoutgoing",
              "servicetime": 0.00000000000000e+00
            }
          ]
        },
        "context": "http://kvm-s3562-1-ip151-102.cms:4003",
        "cpuusage": 2.12086387479576e+00,
        "datacount": 0,
        "datacounthisto": [
          0,
          0,
          0,
          0,
          0,
          0,
          0,
          0,
          0,
          0,
          0,
          0,
          0,
          0,
          0,
          0,
          0,
          0,
          0,
          0,
          0,
          0,
          0,
          0,
          0,
          0,
          0,
          0,
          0,
          0
        ],
        "group": "trigger,b2in-eventing-mirror",
        "lid": "42",
        "load": 0.00000000000000e+00,
        "lostdatacount": 0,
        "lostdatacounthisto": [
          0,
          0,
          0,
          0,
          0,
          0,
          0,
          0,
          0,
          0,
          0,
          0,
          0,
          0,
          0,
          0,
          0,
          0,
          0,
          0,
          0,
          0,
          0,
          0,
          0,
          0,
          0,
          0,
          0,
          0
        ],
        "lostmessagecount": 0,
        "lostmessagecounthisto": [
          0,
          0,
          0,
          0,
          0,
          0,
          0,
          0,
          0,
          0,
          0,
          0,
          0,
          0,
          0,
          0,
          0,
          0,
          0,
          0,
          0,
          0,
          0,
          0,
          0,
          0,
          0,
          0,
          0,
          0
        ],
        "messagecount": 0,
        "messagecounthisto": [
          0,
          0,
          0,
          0,
          0,
          0,
          0,
          0,
          0,
          0,
          0,
          0,
          0,
          0,
          0,
          0,
          0,
          0,
          0,
          0,
          0,
          0,
          0,
          0,
          0,
          0,
          0,
          0,
          0,
          0
        ],
        "messagesizehisto": [
          0,
          0,
          0,
          0,
          0,
          0,
          0,
          0,
          0,
          0,
          0,
          0,
          0,
          0,
          0,
          0,
          0,
          0,
          0,
          0,
          0,
          0,
          0,
          0,
          0,
          0,
          0,
          0,
          0,
          0,
          0,
          0,
          0,
          0,
          0,
          0,
          0,
          0,
          0,
          0
        ],
        "rsize": 367747072,
        "service": "b2in-eventing",
        "systemtime": 2.99993520000000e+01,
        "timestamp": "2020-10-09T10:30:50.242041Z",
        "uniqueid": "51161531-085e-4673-8f26-8586875cae5d",
        "url": "utcp://10.176.142.163:1212",
        "vsize": 2569797632
      },
      {
        "classname": "b2in::eventing::Application",
        "clients": 39,
        "components": {
          "definition": [
            {
              "key": "load",
              "type": "double"
            },
            {
              "key": "name",
              "type": "string"
            },
            {
              "key": "servicetime",
              "type": "double"
            }
          ],
          "rows": [
            {
              "load": 3.49184575999589e-03,
              "name": "eventing",
              "servicetime": 1.04757000000001e-01
            },
            {
              "load": 0.00000000000000e+00,
              "name": "ptincoming",
              "servicetime": 0.00000000000000e+00
            },
            {
              "load": 0.00000000000000e+00,
              "name": "ptoutgoing",
              "servicetime": 0.00000000000000e+00
            }
          ]
        },
        "context": "http://kvm-s3562-1-ip151-102.cms:4002",
        "cpuusage": 2.47079241171371e+00,
        "datacount": 4754612,
        "datacounthisto": [
          4724,
          2628,
          133188,
          49440,
          628540,
          7832,
          8048,
          138372,
          1368,
          628632,
          3540,
          134876,
          0,
          1436,
          627604,
          6896,
          139364,
          6124,
          133616,
          497084,
          3540,
          137696,
          0,
          181944,
          494416,
          139144,
          10396,
          138292,
          1368,
          494504
        ],
        "group": "sentinel,xmas",
        "lid": "42",
        "load": 3.49184575999589e-03,
        "lostdatacount": 0,
        "lostdatacounthisto": [
          0,
          0,
          0,
          0,
          0,
          0,
          0,
          0,
          0,
          0,
          0,
          0,
          0,
          0,
          0,
          0,
          0,
          0,
          0,
          0,
          0,
          0,
          0,
          0,
          0,
          0,
          0,
          0,
          0,
          0
        ],
        "lostmessagecount": 0,
        "lostmessagecounthisto": [
          0,
          0,
          0,
          0,
          0,
          0,
          0,
          0,
          0,
          0,
          0,
          0,
          0,
          0,
          0,
          0,
          0,
          0,
          0,
          0,
          0,
          0,
          0,
          0,
          0,
          0,
          0,
          0,
          0,
          0
        ],
        "messagecount": 1705,
        "messagecounthisto": [
          44,
          60,
          60,
          55,
          60,
          38,
          109,
          56,
          34,
          34,
          75,
          61,
          58,
          52,
          59,
          37,
          109,
          55,
          35,
          34,
          75,
          64,
          58,
          55,
          57,
          38,
          112,
          56,
          34,
          31
        ],
        "messagesizehisto": [
          1623,
          0,
          0,
          0,
          0,
          0,
          0,
          0,
          0,
          34,
          57,
          5,
          0,
          0,
          0,
          2,
          0,
          13,
          6,
          0,
          0,
          0,
          0,
          0,
          0,
          0,
          0,
          0,
          0,
          0,
          0,
          0,
          0,
          0,
          0,
          0,
          0,
          0,
          0,
          0
        ],
        "rsize": 424787968,
        "service": "b2in-eventing",
        "systemtime": 3.00004660000000e+01,
        "timestamp": "2020-10-09T10:30:57.218941Z",
        "uniqueid": "4257405b-6b8b-469b-9486-a2ffb6c3f7eb",
        "url": "utcp://10.176.142.163:1977",
        "vsize": 2654130176
      }
    ]
  }
}