﻿id,summary,reporter,owner,description,type,status,priority,milestone,component,version,resolution,keywords,cc
399,Is IPbus/uhal supported under non-SLC?,jhegeman,marc tsw arose cghabrou,"Hi,

'In the beginning' the fact that PyChips and the control-hub were multi-platform was widely advertised.

Since the control-hub is written in Erlang, I'm guessing there should be no problems running it on non-SLC platforms. With the move from PyChips to uhal, though, I suspect this no longer holds for the Python side of the IPbus suite. Right?

More in particular: if I want to connect to an IPbus device from an OS X machine:
* Is this supported?
* Is this foreseen to work/not work?

Cheers,
Jeroen",support,closed,major,IPbus software - v2.3.0 release,uhal,ipbus sw 2.2,fixed,,thea
