﻿id,summary,reporter,owner,description,type,status,priority,milestone,component,version,resolution,keywords,cc
2111,TwinMux error during ENGAGE transition,clazarid,clazarid anavarro,"Dear TwinMux experts,

during the last days we observed a couple of configuration failures attributed to the TwinMux. The message shows that a timeout happens when trying to connect to the control hub:

{{{
Upgrade Central Cell
An error occured during TCDS CONFIGURE / SUBSYSTEM ENGAGE on 2016-09-28 08:30:38

Error message:
~~~~~~~~~~~~~
@TWINMUX : Caught exception when constructing system ... 
   Config key: TwinMux_base_newlatency_super/v31
   Exception type: swatch::system::SystemConstructionFailed
   Message:  Failed to create/add Processor (id: 'YB0_S1'). Caught exception 'uhal::exception::TcpConnectionFailure', message: Timeout (1000 milliseconds) occurred when connecting to ControlHub at ""bridge-s1d07-41:10203"". URI=""chtcp-2.0://bridge-s1d07-41:10203?target=amc-s1d07-41-01:50001""
}}}

Any ideas why this is happening? Could you have a look?

cheers,
  Christos.",defect,new,major,,twinmux,,,,triossi@… sandrov@… ignacio.redondo.fernandez@… alvaro.navarro.tobar@… Giuseppe.Codispoti@…
