﻿id,summary,reporter,owner,description,type,status,priority,milestone,component,version,resolution,keywords,cc
626,Configure vmepc-e1x07-22-01,bortigno,clazarid,"Hello, would it be possible to configure vmepc-e1x07-22-01 for CSCTF testing with slc6 in 904? We need xdaq, trigger supervisor, and root.

The details of the packages we need are in 
https://twiki.cern.ch/twiki/bin/view/Main/CsctfTriggerSupervisor#Install_the_Code

Thank you
Pierluigi",support,closed,minor,,csctf,,fixed,,thea clazarid
