﻿id,summary,reporter,owner,description,type,status,priority,milestone,component,version,resolution,keywords,cc
2361,New tag (v1_2_9) of AMC13 rpms need to be added to the repo,darcaro,ehazen dgastler dzou,"A new tag for the AMC13 software was added. Tag includes address table updates for new TTS states for HCAL firmwares (0x606X)
The corresponding rpms are located here:
cc7:
http://physics.bu.edu/~djarcaro/AMC13/AMC13_rpms/cactusboards-amc13-amc13-1.2.9-0.centos7.x86_64.rpm
http://physics.bu.edu/~djarcaro/AMC13/AMC13_rpms/cactusboards-amc13-python-1.2.9-0.centos7.python2.7.x86_64.rpm
http://physics.bu.edu/~djarcaro/AMC13/AMC13_rpms/cactusboards-amc13-python-debuginfo-1.2.9-0.centos7.python2.7.x86_64.rpm
http://physics.bu.edu/~djarcaro/AMC13/AMC13_rpms/cactusboards-amc13-tools-1.2.9-0.centos7.x86_64.rpm

slc6:
http://physics.bu.edu/~djarcaro/AMC13/AMC13_rpms/cactusboards-amc13-amc13-1.2.9-0.slc6.x86_64.rpm
http://physics.bu.edu/~djarcaro/AMC13/AMC13_rpms/cactusboards-amc13-python-1.2.9-0.slc6.python2.6.x86_64.rpm
http://physics.bu.edu/~djarcaro/AMC13/AMC13_rpms/cactusboards-amc13-python-debuginfo-1.2.9-0.slc6.python2.6.x86_64.rpm
http://physics.bu.edu/~djarcaro/AMC13/AMC13_rpms/cactusboards-amc13-tools-1.2.9-0.slc6.x86_64.rpm",task,new,minor,,amc13,,,rpms,dgastler@…
