﻿id,summary,reporter,owner,description,type,status,priority,milestone,component,version,resolution,keywords,cc
404,Simplifying ProtocolTCP and ProtocolUDP,arose,tsw arose cghabrou,"Hi Tom,

I had a spark of inspiration as to how to remove the extra copy from the read callbacks, allowing me to remove the `mReplyMemory` member variable and also allowing me to change `mAsioSendBuffer` and `mAsioReplyBuffer` to locals.

Don't know if this will affect your comments that you were going to send me...

Cheers,
AR",defect,new,minor,IPbus software - FUTURE releases,uhal,nightly build,,,tsw
