﻿id,summary,reporter,owner,description,type,status,priority,milestone,component,version,resolution,keywords,cc
835,Moving GLIB test design to test directory,newbold,cghabrou clazarid thea,"As requested by the boss, moving GLIB test design our of projects directory.

Also contains a minor update to ipbus RAM cores, to avoid potential address space conflict.",enhancement,closed,minor,,unknown,,fixed,,
