﻿id,summary,reporter,owner,description,type,status,priority,milestone,component,version,resolution,keywords,cc
890,Object-Oriented MMC branch,arose,arose,"I have created the branch [https://svnweb.cern.ch/trac/cactus/browser/branches/arose_oommc arose_mmc] for porting the imperial MMC from C to C++ with the intention of making it (infinitely) more maintainable.

This ticket is for tracking this work.",task,new,minor,,imperial mmc,,,,bundocka harder
