﻿id,summary,reporter,owner,description,type,status,priority,milestone,component,version,resolution,keywords,cc
1511,New puppet snapshot needed for DT,gcodispo,clazarid,"Hi,

a small fix in the DT panels required new rpms. I put them here:

/nfshome0/gcodispo/TS21/cactusprojects-dtsctscell-2.3.4-1.cmsos12.slc6.gcc4_4_7.src.rpm
/nfshome0/gcodispo/TS21/cactusprojects-dtsctscell-2.3.4-1.cmsos12.slc6.gcc4_4_7.x86_64.rpm
/nfshome0/gcodispo/TS21/cactusprojects-dtsctscell-debuginfo-2.3.4-1.cmsos12.slc6.gcc4_4_7.x86_64.rpm
/nfshome0/gcodispo/TS21/cactusprojects-dtsctscell-devel-2.3.4-1.cmsos12.slc6.gcc4_4_7.x86_64.rpm

Could you please deploy them as soon as possible?

Cheers,
   Giuseppe",support,closed,critical,,.cms admin,,fixed,,
