﻿id,summary,reporter,owner,description,type,status,priority,milestone,component,version,resolution,keywords,cc
1235,/tmp filling up kills nightlies,clazarid,clazarid,"The existence of too many core dumps in /tmp fills up the disk space in the nightly build machines and kills the nightly builds in some cases.

I'll be adding a line to clean up /tmp from old core dumps.",defect,closed,minor,,nightlies,,fixed,,
