﻿id,summary,reporter,owner,description,type,status,priority,milestone,component,version,resolution,keywords,cc
46,HwInterface creation time depends on the address file memory size,marc,marc,"Dear Andrew,

After adding the size attribute to the address table I have noticed that the address table parsing time depends on the ""size"" attribute:
size value,parsing time
1,200us
100,254us
10k,3.62ms
1M,358ms
100M,computer hanging

I would say that the parsing time should not depend on the value of the size attribute. ",defect,closed,major,IPbus 1.3 suite,uhal,ipbus sw 1.0,fixed,,frazier
