﻿id,summary,reporter,owner,description,type,status,priority,milestone,component,version,resolution,keywords,cc
1024,New setup release,mguilbau,clazarid,"I updates the s1calol2-cell.profile so a new setup release is needed to take this change into account

",task,closed,minor,l1ts 1.13.6,setups,,fixed,,
