﻿id,summary,reporter,owner,description,type,status,priority,milestone,component,version,resolution,keywords,cc
577,FC7 MMC code,arose,mp801,"Gentlemen,

Could you update me on the status of the MMC code for the FC7?

I had asked a couple of weeks ago about the implementation of the sensors on the FC7, so I was wondering what was happening. It seems that as a consequence you had agreed on the following plan:

 1. refactorise MP7/FC7 mmc software so that we have a separate build system and files we can modify ourselves/upload to svn
 1. upload relevant source/project files to svn and start versioning
 1. update sensor data records wrt MP7
 1. remove power good signals wrt MP7
 1. test ipbus IP/MAC configuration by mmc
 1. update user manual

Once 1 & 2 are completed we could become somewhat autonomous here at CERN in terms of not having to bug you (as much) for further developments. When do you think we will get to that point?

Cheers,

Jan.",defect,new,minor,,imperial mmc,,,,troskajk vichoudi mp801
