﻿id,summary,reporter,owner,description,type,status,priority,milestone,component,version,resolution,keywords,cc
1356,Fix MP7 - AMC13 error counters,thea,thea fball,"AMC13 reports a number of errors related to bunch and orbit counters.
Looking at the firmware it looks like this is related to the lack of BC0 signal connection to the AMC13 block.

TODO:
 * Provide a BC0 signal with appropriate delay to the AMC block (AMC resets Bcntr on BC0)
 * Monitor Stage1 AMC13 Link table to spot any other error ",defect,closed,minor,mp7fw - v1.8.x releases,mp7 firmware,,fixed,,
