﻿id,summary,reporter,owner,description,type,status,priority,milestone,component,version,resolution,keywords,cc
1892,Introduction of MinBias trigger in menu,tmatsush,,"- Introduce the following new trigger objects:
  * MBT0HFP for Minimum Bias Threshold 0 HF+
  * MBT1HFP for Minimum Bias Threshold 1 HF+
  * MBT0HFM for Minimum Bias Threshold 0 HF-
  * MBT1HFM for Minimum Bias Threshold 1 HF-

- the scale for the objects are:
  COUNT : [0, 15] with step size of 1
",enhancement,closed,major,,L1 Menu,,fixed,uGT menu,jwittman hbergaue garadi arnold
