﻿id,summary,reporter,owner,description,type,status,priority,milestone,component,version,resolution,keywords,cc
2139,MP7 software: Alignment error doesn't report faulty channels,thea,thea arose bundocka harder tsw,"From Dinyar

yesterday we had a small problem with the EMTF where they didn't write their alignment register properly for two processors. The result was that uGMT couldn't align at all because the two problematic processors had their minimum alignment points too far away from the one of the other processors.

There was no indication in the error message which of the processors was problematic and they had to call me to check it by hand. I was wondering if it would be possible to add such a functionality. I think at some point we had also talked about the possibility of setting an ""expected minimum alignment point range"" which probably would have also made debugging easier.

I don't think it's very urgent, but it would remove the need to call another expert in those cases.
",defect,closed,minor,mp7sw - v2.2.x releases,mp7 software,,fixed,,
