﻿id,summary,reporter,owner,description,type,status,priority,milestone,component,version,resolution,keywords,cc
2261,Central Cell sending commands to DT-XDAQ application (XDCS),gcodispo,,"Right now the Central Cell is sending two different Soap messages to XDCS:
 

- `Delay`; because MiniCrates may not lock the clock if it’s lost for some time
- `Sync`; to align TwinMux with the loaded delay set


`Delay` are anyway set by DT Function Manager: if any clock instability happens, the full CMS needs a reconfiguration, therefore DT cannot enter in undefined states.
`Sync` is not needed anymore: TwinMux delays are uniquely defined by cable lengths and do not change.

After coordinating with DT, we comment the request in the Central Cell code.

Cheers,
   Giuseppe",enhancement,closed,minor,Central Cell - FUTURE,unknown,,fixed,,thea tsw sandro.ventura@…
