﻿id,summary,reporter,owner,description,type,status,priority,milestone,component,version,resolution,keywords,cc
724,Upgrade OpenI2CNode to deal with multiple slaves,thea,thea arose bundocka harder,"Currently the `OpenI2CNode` can connect to one i2c target only.
This is not optimal for connecting to minipods, where multiple minipods talk to 1 i2c master, at different addresses.

The `OpenI2CNode` functionalities must be split into master and slaves.

The `OpenI2CMasterNode` should be constructed with the list of slaves as argument.
{{{
#!xml
<node id=""minipods_top"" address=""0x18"" class=""OpenI2CMasterNode"" parameters=""tx0=0x29,tx1=0x2b,tx2=0x2d,rx0=0x30,rx1=0x32,rx2=0x34"">
}}}

Then the slaves are accessible as
{{{
#!cpp
   const OpenI2CMasterNode& master = hw.getNode('ctrl.minipods_top');
   master.getSlave(""tx0"");
}}}

Slaves implement the read/write I2C interface, now available in `OpenI2CNode`.

Current minipod address table
{{{
#!xml
<node id=""minipods_top"" address=""0x18"">
  <node id=""tx0"" module=""file://opencores_i2c.xml"" class=""MiniPODNode"" parameters=""i2caddr=0x29""/>
  <node id=""tx1"" module=""file://opencores_i2c.xml"" class=""MiniPODNode"" parameters=""i2caddr=0x2b""/>
  <node id=""tx2"" module=""file://opencores_i2c.xml"" class=""MiniPODNode"" parameters=""i2caddr=0x2d""/>
  <node id=""rx0"" module=""file://opencores_i2c.xml"" class=""MiniPODNode"" parameters=""i2caddr=0x30""/>
  <node id=""rx1"" module=""file://opencores_i2c.xml"" class=""MiniPODNode"" parameters=""i2caddr=0x32""/>
  <node id=""rx2"" module=""file://opencores_i2c.xml"" class=""MiniPODNode"" parameters=""i2caddr=0x34""/>
</node>
}}}

",defect,closed,major,mp7sw v1.4,mp7 software,,fixed,,
