﻿id,summary,reporter,owner,description,type,status,priority,milestone,component,version,resolution,keywords,cc
325,Square brackets appear in node description when a 'tags' tag is present,christian.bonnin@…,marc tsw arose cghabrou,"Given the following address table:

{{{
<node id=""TOP"">
         <node id=""node"" address=""0x0"" description=""no brackets"" tags=""slave""/>
</node>
}}}

The node description is enclosed in square brackets: 

{{{
>>> import uhal
>>> hw = uhal.getDevice( ""id"", ""ipbusudp-1.3://127.000.000.001:50001"", ""file:///tmp/address.xml"")
>>> hw.getNode(""node"").getDescription()
'[no brackets]'
}}}

The square brackets are not added if the 'tags' tag is removed.",defect,closed,minor,IPbus software: v2.1.0 release,uhal,ipbus sw 2.0,fixed,,
