﻿id,summary,reporter,owner,description,type,status,priority,milestone,component,version,resolution,keywords,cc
676,Simulation of mp7fw_v1_2_0,babak.rahbaran@…,dsankey,"Dear All,
I tried to simulate the mp7fw_v1_2_0 based on instruction documented :https://twiki.cern.ch/twiki/bin/viewauth/CMS/MP7FirmwareNews
Step 7 is not working :ping 192.168.201.2
the result is:
From 192.168.201.1 icmp_seq=2 Destination Host Unreachable

FW:1_2_0
Machine: SLC6
Modelsim 10.3b

I did the same workflow  a few weeks in past with mp7fw_v1_1_6, and it was working.

It would be great to provide me with some clues, what is going on?

cheers
Babak",defect,new,major,,mp7 firmware,,,Simulation of mp7fw_v1_2_0 tag,
