﻿id,summary,reporter,owner,description,type,status,priority,milestone,component,version,resolution,keywords,cc
445,REGISTER macro name,thea,tsw arose cghabrou,"Would it be possible to rename the 

REGISTER

macro, from DerivedNode.hpp to something more uhal specific?
For instance UHAL_REGISTER_DERIVED_NODE.
It would clarify the purpose of the macro
",defect,closed,minor,IPbus software: v2.1.0 release,uhal,ipbus sw 2.0,fixed,,
