﻿id,summary,reporter,owner,description,type,status,priority,milestone,component,version,resolution,keywords,cc
1471,typo in transactor?,phhorn,,"Hey,
I was going through the transactor_sm.vhd because of a different problem and found an interesting line:

(142) elsif state <= ST_ADDR or ack = '1' then

Shouldn't it be:

(142) elsif state = ST_ADDR or ack = '1' then

or am I missing something? As a result the words_todo signal keeps getting reduced during the idle state.

Regards,
Philipp",enhancement,closed,minor,,ipbus F/W,ipbus2.0 fw v1,fixed,,
