﻿id,summary,reporter,owner,description,type,status,priority,milestone,component,version,resolution,keywords,cc
1415,"Possible to Remove RPC from ""Select All"" in L1 Page Process Controller?",pamc,,"Hi,
Apparently we cannot restart the RPC again, or we remove some masking that isn't saved in anyway.  Is it possible to remove this?  
Thanks,
Pam",enhancement,closed,minor,,l1page,,invalid,,
