﻿id,summary,reporter,owner,description,type,status,priority,milestone,component,version,resolution,keywords,cc
94,Address space collision question,frazier,arose,"Submitting ticket on behalf of Chris West - original email below:

--

Hi uHAL folks,

I have a question about address space collision in the latest version of uHAL. I have data in multiple bits of a single register that I need to be able to access individually. But, for the sake of efficiency, I also would like to be able to access all of the data at once. See the example address table file below as an example of what I'm trying to do. How can I do this?

Chris

{{{
<?xml version=""1.0"" encoding=""utf-8""?>
<node id=""ctr2_test"">
  <node id=""FIRMWARE_REVISION"" address=""0x101"">
    <node id=""FIRMWARE_REVISION"" address=""0x000"" mask=""0xFFFFFFFF"" permission=""read""/>
    <node id=""FIRMWARE_FLAVOR"" address=""0x000"" mask=""0xFF000000"" permission=""read""/>
    <node id=""FIRMWARE_MAJOR"" address=""0x000"" mask=""0x00FF0000"" permission=""read""/>
    <node id=""FIRMWARE_MINOR"" address=""0x000"" mask=""0x0000FF00"" permission=""read""/>
    <node id=""FIRMWARE_PATCH"" address=""0x000"" mask=""0x000000FF"" permission=""read""/>
  </node>
</node>
}}}",defect,closed,critical,IPbus 1.3 suite,uhal,,fixed,,christopher.alan.west@…
