﻿id,summary,reporter,owner,description,type,status,priority,milestone,component,version,resolution,keywords,cc
1154,New tag (v1_1_2) of AMC13 rpms need to be added to the repo,dgastler,thea@…,"A new tag for the AMC13 software was added.
The corresponding rpms are located here:

http://ohm.bu.edu/~dgastler/AMC13_rpms/cactusboards-amc13-amc13-1.1.2-0.slc6.x86_64.rpm

http://ohm.bu.edu/~dgastler/AMC13_rpms/cactusboards-amc13-python-1.1.2-0.slc6.python2.6.x86_64.rpm

http://ohm.bu.edu/~dgastler/AMC13_rpms/cactusboards-amc13-python-debuginfo-1.1.2-0.slc6.python2.6.x86_64.rpm

http://ohm.bu.edu/~dgastler/AMC13_rpms/cactusboards-amc13-tools-1.1.2-0.slc6.x86_64.rpm",task,closed,minor,,amc13,,fixed,rpms,dgastler@…
