﻿id,summary,reporter,owner,description,type,status,priority,milestone,component,version,resolution,keywords,cc
2205,utm - removing obsolete modules,arnold,arnold aradi,"Removing obsolete utm modules:
 * tmGui/ (superseded by tmEditor)
 * ts/ (abandoned)",enhancement,closed,minor,utm - v0.5.x releases,ugt,,fixed,,hephy-cms-trigger@…
