﻿id,summary,reporter,owner,description,type,status,priority,milestone,component,version,resolution,keywords,cc
364,GT: Stand alone tools compiled using dummy hardware,marc,cghabrou,"Dear Carlos,

It seems that the standalone tools where compiled with dummy hardware:
{{{
[marc@vmepc-e1x07-09-01 ~]$ /opt/xdaq/bin/FDLStandaloneConfigurator.exe 

Choose bus adapter: 

  3) DUMMY_VME64x
Enter option: 
}}}

It seems that the standalone GUIs are also compiled with the dummy bus adapter.

Could you please take a look?

Remember, that once you fix the issue, you will need to:
* Create a new GT milestone
* Update the RPMs in the YUM repo
* Update the dropbox packages

Cheers,
marc

",defect,closed,minor,GT/GMT v1.0.6,gt/gmt,TS 1.12.5,fixed,,mjeitler
