﻿id,summary,reporter,owner,description,type,status,priority,milestone,component,version,resolution,keywords,cc
807,Add Crate to SystemCreator,kreczko,kreczko,"This is a sub-task to #728.
Crate creation is currently done in the functions for adding Processor and AMC13Service. 

This task consists of
 - writing tests for all below (first!)
 - reading crate information in the SystemCreator and using it to construct crates
 - add System::add(Crate)
 - add Crate::isSlotTaken(slot)
 - refactor System::add(Processor) and System::add(AMC13Service) to take the above into account
",defect,closed,minor,SWATCH suite v0.1,swatch,,fixed,,
