﻿id,summary,reporter,owner,description,type,status,priority,milestone,component,version,resolution,keywords,cc
1326,Project area for stage 2 upgrade layer 1 code,nawoods,cghabrou clazarid thea,"We need a place to put the stage 2 layer 1 code as we start it while doing the SWATCH tutorial. Could an admin please create a directory like trunk/cactusprojects/caloLayer1 so I can start committing? There's already a ""calol1"" directory but I don't know what was intended to go there, so I'm not committing to it for now.

Thanks!
Nate",support,closed,minor,,calol1,,fixed,,truggles@… pamc@…
