﻿id,summary,reporter,owner,description,type,status,priority,milestone,component,version,resolution,keywords,cc
2038,Read Finor/ExtCond board metrics,garadi,garadi arnold,"On Finor and ExtCond board metrics should be monitored. For this purpose each board gets a specific Algo interface inherited from the AMC502Algo interface.

Monitored metrics on Finor & ExtCond
* Luminosity segment number
* Orbit counter
* Max. Bunch cross number

Monitored metrics on Finor
* Finor counter rate to TCDS
* Local Finor counter rate from each mp7 board",enhancement,closed,minor,ugt v0.7.0,ugt,,fixed,,hephy-cms-trigger@…
