﻿id,summary,reporter,owner,description,type,status,priority,milestone,component,version,resolution,keywords,cc
1804,MP7 Buffer playback payload shifted by 1 clock cycle,thea,,"The mp7 buffers playback in mp7fw 2.0.X is affected by a bug that delays the data playback by 1 clock cycle.
The problem is related to the buffer ram latency, that needs to be properly taken into account to start the playback.",defect,closed,minor,mp7fw - v2.1.0 release,mp7 firmware,,fixed,,
