﻿id,summary,reporter,owner,description,type,status,priority,milestone,component,version,resolution,keywords,cc
1269,"S1CALOL2: erase ""Transition"" parameter from the TCDS execute transition",cghabrou,mguilbau,"Hi Maxime; 
by taking a look into the logs, I have seen the following error repeating in every transition: 

{{{
Tue Jul  7 22:31:20 2015 ERROR l1ts.cms.l1ts-s1calol2.p:9901.tcdststcdscell::Cell.instance(0910).Configuration <> - The parameter Transition is not a parameter of the operation 'Configuration'. The existing parameters are:  AutoMode  Configuration File  DCS_LHC_Flags  FEDMap  KEY  L1_KEY  RS_KEY  Run Number  TSC_KEY  TTCMap  UsePrimaryTCDS .
}}}

It is caused because you have defined a parameter named ""Transition"" you pass to the TCDS cells. The parameter doesn't exist at the TCDS level and therefore the error. 
Could you clean it up? 

Cheers,
Carlos. ",defect,closed,minor,,calol2,TS 2.0,fixed,,
