﻿id,summary,reporter,owner,description,type,status,priority,milestone,component,version,resolution,keywords,cc
227,L1page nightlies: fails,cghabrou,cghabrou,"I have seen that the nightlies build fails for the l1page in all platforms/architectures. 
By taking a look to the error, I have realized that the JAVA_HOME was not properly exported in all places where it is needed. I have included it in:
 * extern/Makefile
 * extern/spec.file 
 * extern/l1paged -> it was not here 
 * src/Makefile
 * src/spec.file

I corrected the rest of files because there was a double ""/"" in one of the paths (it didn't prevent the compilation from being executed, but once I started reviewing the files...)

I have updated the code already checked out in the cactus worker machines (1, 2) and manually compiled, built RPMs and perform the l1page test. 

Seems correct. ",defect,closed,minor,,l1page,nightly build,fixed,,
