﻿id,summary,reporter,owner,description,type,status,priority,milestone,component,version,resolution,keywords,cc
2119,ProjectManager.py fails to compile a modelsim project when coregen parts are not present.,giles,newbold giles arose thea harder,"ProjectManager.py fails to compile a modelsim project when there aren't any coregen parts in the project because the directory top/top.srcs/sources_1/ip/built does not exist.  I'm sure we fixed this in the distant past, but perhaps the changed wasn't propagated to the trunk.


# cd /home/giles/Development/uk-tracktrig/htmux_trunk_base_mp7fw_v2_2_0/mux_sim/top/top.sim/sim_1/behav
# exec echo exit | vsim -c -do top_compile.do -modelsimini modelsim.ini
INFO: [Common 17-206] Exiting Vivado at Thu Oct  6 19:59:12 2016...
touch top/top.srcs/sources_1/ip/built
touch: cannot touch `top/top.srcs/sources_1/ip/built': No such file or directory
make: *** [top/top.srcs/sources_1/ip/built] Error 1
[giles@greg-i7 mux_sim]$ 
[giles@greg-i7 mux_sim]$ mkdir -p top/top.srcs/sources_1/ip/built
",defect,new,major,mp7fw - v2.4.x releases,mp7 firmware,,,ProjectManager touch top/top.srcs/sources_1/ip/built,
