﻿id,summary,reporter,owner,description,type,status,priority,milestone,component,version,resolution,keywords,cc
221,uhal: random extension in address_table throws an exception,marc,arose,"Hi andy,

Today, while writing the solution to #213, I copied an address table to a temporal file generated with mkstemp. This function generates names like ""/tmp/atlas_devices.xml.AHhG2v"" after passign the template ""/tmp/atlas_devices.xml.XXXXXX"".

uHAL throws an exception during the call to ConnectionManager::gerDevice:
{{{
[cactus-worker-2] /afs/cern.ch/user/m/marc/tmpfile_c > ./bin/tmpfile simple.xml 
Temporary file name '/tmp/atlas_devices.xml.AHhG2v'
21-03-13 10:06:13.915857 [0x2376750] INFO - Parsed ""file:///tmp/atlas_devices.xml.AHhG2v"" to:
21-03-13 10:06:13.916087 [0x2376750] INFO -  > [file] ""/tmp/atlas_devices.xml.AHhG2v""
21-03-13 10:06:13.916269 [0x2376750] INFO - Shell expansion of ""/tmp/atlas_devices.xml.AHhG2v"" returned:
21-03-13 10:06:13.916350 [0x2376750] INFO -  > [file] /tmp/atlas_devices.xml.AHhG2v
21-03-13 10:06:13.916519 [0x2376750] ERROR - Extension "".ahh"" not known.
21-03-13 10:06:13.916615 [0x2376750] ERROR - Exactly one address table file must be specified. The expression ""/tmp/atlas_devices.xml.AHhG2v"" refers to 0 valid files.
terminate called after throwing an instance of 'uhal::exception::IncorrectAddressTableFileCount'
  what():  
I'm terribly sorry to have to tell you this, but it appears that there was an exception:
In thread 0x2376750:
 - Exception 0:
   - Exception of type:
     - uhal::exception::IncorrectAddressTableFileCount
   - Description:
     - Exception class to handle the case where too many or two few address files are specified.
   - Call stack:
     - function ""IncorrectAddressTableFileCount"" in /build/cactus/trunk/cactuscore/uhal/uhal/include/uhal/NodeTreeBuilder.hpp, line 72
     - function ""uhal::NodeTreeBuilder::getNodeTree(std::string const&, boost::filesystem3::path const&)"" in /build/cactus/trunk/cactuscore/uhal/uhal/src/common/NodeTreeBuilder.cpp, line 164
     - function ""uhal::ConnectionManager::getDevice(std::string const&, std::string const&, std::string const&)"" in /build/cactus/trunk/cactuscore/uhal/uhal/src/common/ConnectionManager.cpp, line 158
     - function ""atlas_device(std::string const&, std::string const&, char const*, unsigned long)"" in /afs/cern.ch/user/m/marc/tmpfile_c/src/tmpfile.cpp, line 25
     - function ""main"" in /afs/cern.ch/user/m/marc/tmpfile_c/src/tmpfile.cpp, line 50
   - Log messages (currently missing):

Aborted
}}}

I attach the .cpp and the SConstruct file to debug the issue.

Cheers,
marc
",defect,closed,minor,IPbus software - FUTURE releases,uhal,nightly build,wontfix,,
