﻿id,summary,reporter,owner,description,type,status,priority,milestone,component,version,resolution,keywords,cc
605,'Set=uhal' build instructions need updating,jhegeman,tsw arose cghabrou clazarid thea harder,"At the moment the build instructions for developers of the IPbus software tell one to check out the CACTUS trunk. (These instructions:
https://svnweb.cern.ch/trac/cactus/wiki/DevInstructions
under 'How to compile the software?')

At the moment the head of the trunk seems to be about 2.5 GB in size. Only a small fraction of that is actually needed to build 'Set=uhal'. Maybe the instructions could be updated to only check out the relevant bits.",task,closed,minor,,uhal,,fixed,,thea clazarid
