﻿id,summary,reporter,owner,description,type,status,priority,milestone,component,version,resolution,keywords,cc
275,GT/GMT nightlies fail in SLC6/64,cghabrou,cghabrou,"Now that I have gotten rid of the compilation errors for the SLC5 platforms, I will start with SLC6. 

I have seen a lot of occurrences of: 
{{{
/build/cactus/trunk/cactusprojects/gt/ts/cell/include/gt/ts/cell/monitoring/LumiSegmentScalers.h:110: error: 'uint64_t' does not name a type
}}}
",defect,closed,minor,GT/GMT v1.0.6,gt/gmt,nightly build,fixed,,
