﻿id,summary,reporter,owner,description,type,status,priority,milestone,component,version,resolution,keywords,cc
1202,Tidy up unit tests,arose,tsw,"The unit tests are in a bit of a mess, with, for example, multiple dummy command in different files.

If we could simplify the tests, removing duplicates etc., it will make them lot easier to maintain.

AR",task,closed,minor,SWATCH suite v0.2,swatch,,fixed,,tsw thea
