﻿id,summary,reporter,owner,description,type,status,priority,milestone,component,version,resolution,keywords,cc
510,Need root in SLC6 profile for L1,guiducci@…,cghabrou,"Hello,
we used to have root available (in /wbm/root/5.32.00/bin). Now I am testing the new SLC6 DT trigger machine vmepc-s2g16-31-01 but it is not there. Can you include a root version?",defect,closed,critical,,.cms admin,,fixed,,clazarid gianni.masetti@… gcodispo
