﻿id,summary,reporter,owner,description,type,status,priority,milestone,component,version,resolution,keywords,cc
336,SVN: Access to trunk/components/mp7_mgt,marc,newbold,"(Send by Sudan)
Hi Marc,

Alessandro Thea and I would like access to the following directory

trunk/components/mp7_mgt

in the repository. This is so we can build the recent firmware
from Dave Newbold.

Is it possible to add us?
Usernames  - thea  and sudan

Thanks a lot,
Sudan
",support,closed,minor,,svn/trac admin,,fixed,,sudan thea newbold
