﻿id,summary,reporter,owner,description,type,status,priority,milestone,component,version,resolution,keywords,cc
806,ControlHub : Monitoring and debugging IPbus control in production systems,tsw,tsw newbold,"The `controlhub_status` script's output, `controlhub_stats` script's output and contents of the ControlHub logging information need to be reviewed to ensure:
 0. Quick recovery from typical error scenarios 
   * i.e. end-users should be able to quickly identify cause
 0. Enough information is stored during errors to perform post-mortem of any errors - i.e. to answer questions like:
   * where did things go wrong? 
   * Was IPbus request packet from uHAL mangled? Was IPbus response packet from firmware mangled? Is there inconsistent behaviour of ControlHub processes?

(May want to open a sister ticket for uHAL)

Precursor tickets:
 * `controlhub_status` script: #686, #802
 * ControlHub logging: #217",enhancement,new,minor,IPbus software - FUTURE releases,controlhub,ipbus sw 2.3,,,
