﻿id,summary,reporter,owner,description,type,status,priority,milestone,component,version,resolution,keywords,cc
1371,Svn commit hooks update following Trac 1.0.8 migration,thea,thea,"'''TODOs''':
 * Commit hook changes provided by IT
 * Switch to new trac plugin for posting comments to tickets",task,closed,major,,svn/trac admin,,fixed,,
