﻿id,summary,reporter,owner,description,type,status,priority,milestone,component,version,resolution,keywords,cc
383,GMT: exception while starting the Cell,cghabrou,cghabrou,"Hi Marc, 
with the problem pointed out by Hannes yesterday while configuring GMT @904, when I finally added all environment variables another CAEN Busadapter issue came up. 

I used the GMT standalone tool to verify the correct access to the HW and then realized that the GMT packages were produced without the famous GTCAEN environment variable set to ""yes"". 

After building the GMT RPMs again, I now get an exception when the Cell starts:

{{{
15 Aug 2013 09:20:32.250 [47480757527344] INFO  l1ts904.cms904.l1ts-gmt.p:4328.Cell.instance(6).CellOperationFactory <> - add :GtGmtFunctionTest
15 Aug 2013 09:20:32.252 [47480757527344] FATAL l1ts904.cms904.l1ts-gmt.p:4328.Cell.instance(6) <> - Error initializing the Cell: Caught exception: tsexcepti
on::CellException 'Invalid SequenceItem: GCT:120->RCT:10' raised at fromString(/build/cactus/trunk/cactuscore/ts/itf/src/common/XSequenceItem.cc:42)
15 Aug 2013 09:20:32.259 [47480757527344] INFO  l1ts904.cms904.l1ts-gmt.p:4328 <> - Ready.
}}}

It seems it happens as the operation ""GtGmtFunctionTest"" is added to the cell operation factory. 

I assume that this happens because I recompiled the code against the new version of the ITF. 

Could we take a look together? 

Thanks, 
Carlos. ",defect,closed,major,GT/GMT v1.0.7,gt/gmt,TS 1.12.5,fixed,,marc
