﻿id,summary,reporter,owner,description,type,status,priority,milestone,component,version,resolution,keywords,cc
511,uhal : Why is ConnectionManager::mMutex public?,tsw,arose,"When looking at the uHAL doxygen, I noticed that the `mMutex` member variable of `uhal::ConnectionManager` is public? 

Was there any reason for this? Naturally I'd think that it would be private. The code still compiles when I change it to being private",defect,closed,minor,IPbus software - v2.3.0 release,uhal,ipbus sw 2.0,fixed,,
