﻿id,summary,reporter,owner,description,type,status,priority,milestone,component,version,resolution,keywords,cc
1297,Adding Zach in s1calol2 machine sudoers list,mguilbau,christos.lazaridis@…,"Please, could you add Zach Hulcher (zhulcher) to the sudo list on s1calol2 machine.

l1ts-s1calol2.cms

Cheers

Maxime",defect,closed,major,Trigger Supervisor 2.1,unknown,TS 2.1,fixed,,zachary.hulcher@…
