﻿id,summary,reporter,owner,description,type,status,priority,milestone,component,version,resolution,keywords,cc
1230,Threading/threadpool issues,arose,tsw,"Hi all,

When I run the unit tests (specifically `CommandTestSuite`) with use of the threadpool enabled, it dies various with

 * `unknown location(0): fatal error in ""TestRegisterOperation"": memory access violation at address: 0x00000000: no mapping at fault address`
 * `Segmentation fault`
 * `*** 10 failures detected in test suite ""SwatchTest""`
 * `unknown location(0): fatal error in ""TestRunNothing"": memory access violation at address: 0x00000000: no mapping at fault address <<<continue a while>>> *** 5 failures detected in test suite ""SwatchTest""`
 * Just stalling...

With the threading disabled it works beautifully.

This looks to me like a bug in the behaviour of the destructor of the threadpool.

Any thoughts?
AR",defect,closed,major,SWATCH suite v0.1,swatch,,fixed,,thea kreczko
