﻿id,summary,reporter,owner,description,type,status,priority,milestone,component,version,resolution,keywords,cc
179,Unit tests for IPbus 2.0,arose,marc,"Hi Marc,

The specification for `RMW` operations in `IPbus 1.3` and `IPbus 2.0` has changed. In 1.3, it returned the '''post'''-modification value whereas in 2.0 it returns the '''pre'''-modification value.

The unit tests check the behaviour of the `RMW-sum` operation using a arithmetic series. This means that the results for `IPbus 2.0` are ""off"" by one index because the test is expecting the post-modification value.

Could you please think about how the tests could be modified to handle this? Checking using a `read` after the final `RMW-sum` will return the correct answer, but it is a bit of a hack.

Thanks,
AR",defect,closed,minor,,uhal,,fixed,,tsw newbold
