﻿id,summary,reporter,owner,description,type,status,priority,milestone,component,version,resolution,keywords,cc
653,Does the ConnectionManager cache address tables?,jhegeman,tsw arose cghabrou clazarid thea harder,"Hi,

I'm using
{{{
uhal::ConnectionManager::getDevice(id, uri, addressTableFileName)
}}}
to create connections to IPbus devices. As usual in CMS, these devices are controlled by a XDAQ appication with a state machine cycling through Configure->Enable->Stop->Halt, etc. Upon Configure I create the above connection, and upon Halt I'd like to release the connection. Now it appears that the ConnectionManager caches either the address table, or the whole connection. This means that I have to restart the whole application in order to reload the address table.

So now the questions. Is my understanding correct? And if so: how do I avoid this behaviour?

Cheers,
Jeroen",enhancement,closed,major,IPbus software - v2.4.0 release,uhal,ipbus sw 2.3,fixed,,thea clazarid
