﻿id,summary,reporter,owner,description,type,status,priority,milestone,component,version,resolution,keywords,cc
338,uhal: python: segfault on uhal::exception::what(),marc,tsw,"Dear Tom and Andrew,

During the debugging of #323 I have found a segmentation during the execution of e.what on the Python code.

I'm not sure where this issue comes from (uhal or pycohal).

In order to reproduce the error, I have added ""del hw"" to all the tests of the test_pycohal code (modified version attached).

The back trace I get is:
{{{
(gdb) info threads
* 1 Thread 0x2aaaaaad0630 (LWP 32001)  0x00002aaab00e9209 in elf_find_function (abfd=0x2f28160, section=0x2e51418, 
    symbols=0x2f2c720, offset=77068, filename_ptr=0x7fffffff9ab8, functionname_ptr=0x7fffffff9ab0, 
    line_ptr=0x7fffffff9aac, discriminator_ptr=0x0) at elf.c:7485
(gdb) bt full
#0  0x00002aaab00e9209 in elf_find_function (abfd=0x2f28160, section=0x2e51418, symbols=0x2f2c720, offset=77068, 
    filename_ptr=0x7fffffff9ab8, functionname_ptr=0x7fffffff9ab0, line_ptr=0x7fffffff9aac, discriminator_ptr=0x0)
    at elf.c:7485
        last_section = 0x2e51418
        func = 0x4f3b020
        filename = 0x0
        func_size = 2362
#1  _bfd_elf_find_nearest_line_discriminator (abfd=0x2f28160, section=0x2e51418, symbols=0x2f2c720, offset=77068, 
    filename_ptr=0x7fffffff9ab8, functionname_ptr=0x7fffffff9ab0, line_ptr=0x7fffffff9aac, discriminator_ptr=0x0)
    at elf.c:7626
        found = 0
#2  0x00002aaab00e925b in _bfd_elf_find_nearest_line (abfd=0x2f281c8, section=0xa27b835, symbols=0x4f3b020, 
    offset=49490768, filename_ptr=0x58, functionname_ptr=0x101010101010101, line_ptr=0x7fffffff9aac) at elf.c:7570
No locals.
#3  0x00002aaab01378a7 in Backtrace::FindAddressInSection (aBfd=0x2f28160, aSection=0x2e51418, aData=0x7fffffff9b50)
    at src/common/BacktraceSymbols.cpp:148
        lFindAddress = 0x7fffffff9b50
        vma = 117232
        lSize = 154760
        lFile = 0x625190 ""/opt/cactus/lib/libboost_python.so.1.48.0""
        lFunction = 0x0
        lLine = 0
        lStatus = 0
        lSize = 65536
        lDemangled = ""boost::python::objects::caller_py_function_impl<boost::python::detail::caller<void (*)(_object*, std::string const&), boost::python::default_call_policies, boost::mpl::vector3<void, _object*, std::str""...
#4  0x00002aaab00bdfdc in bfd_map_over_sections (abfd=0x2f281c8, 
    operation=0x2aaab01377e8 <Backtrace::FindAddressInSection(bfd*, asection*, void*)>, user_storage=0x7fffffff9b50)
---Type <return> to continue, or q <return> to quit---
    at section.c:1329
        sect = 0x2e51418
        i = 9
        __PRETTY_FUNCTION__ = ""bfd_map_over_sections""
#5  0x00002aaab0137753 in Backtrace::ProcessFiles (aFilename=0x625190 ""/opt/cactus/lib/libboost_python.so.1.48.0"", 
    aAddr=0x7fffffff9c18, aNaddr=1, aRet=...) at src/common/BacktraceSymbols.cpp:244
        lFindAddress = {pc = 194300, syms = 0x2f2c720, found = 0, tracepoint = {file = """", function = """", line = 0}}
        lBfd = 0x2f28160
        matching = 0x0
        lSize = 8
        lSymCount = 1305
#6  0x00002aaab0137ac2 in Backtrace::BacktraceSymbols (aBacktrace=std::vector of length 100, capacity 100 = {...})
    at src/common/BacktraceSymbols.cpp:321
        match = {lFile = 0x625190 ""/opt/cactus/lib/libboost_python.so.1.48.0"", address = 0x2aaaaf0b06fc, 
          base = 0x2aaaaf081000, hdr = 0x36c6290e00}
        aAddr = 194300
        lTracePoint = {file = """", function = """", line = 0}
        x = 0x2aaaaf0b06fc
        lLock = {m = @0x2aaab038cea0}
        lRet = std::vector of length 10, capacity 100 = {{file = 
    ""/build/cactus/trunk/cactuscore/uhal/log/src/common/BacktraceSymbols.cpp"", function = 
    ""Backtrace::Backtrace(std::vector<void*, std::allocator<void*> >&)"", line = 296}, {file = 
    ""/build/cactus/trunk/cactuscore/uhal/log/src/common/exception.cpp"", function = ""exception"", line = 61}, {file = 
    ""/build/cactus/trunk/cactuscore/uhal/uhal/include/uhal/Utilities.hpp"", function = ""UriListParsingError"", 
            line = 114}, {file = ""/build/cactus/trunk/cactuscore/uhal/uhal/src/common/Utilities.cpp"", function = 
    ""uhal::utilities::ParseSemicolonDelimitedUriList(std::string const&, std::vector<std::pair<std::string, std::string>, std::allocator<std::pair<std::string, std::string> > >&)"", line = 53}, {file = 
    ""/build/cactus/trunk/cactuscore/uhal/uhal/src/common/ConnectionManager.cpp"", function = ""ConnectionManager"", 
---Type <return> to continue, or q <return> to quit---
            line = 111}, {file = 
    ""/build/cactus/trunk/cactuscore/uhal/pycohal/../../../cactuscore/extern/boost/RPMBUILD/SOURCES/include/boost/python/object/value_holder.hpp"", function = ""value_holder<boost::python::objects::reference_to_value<const std::string&> >"", 
            line = 139}, {file = 
    ""/build/cactus/trunk/cactuscore/uhal/pycohal/../../../cactuscore/extern/boost/RPMBUILD/SOURCES/include/boost/python/object/make_holder.hpp"", function = 
    ""boost::python::objects::make_holder<1>::apply<boost::python::objects::value_holder<uhal::ConnectionManager>, boost::mpl::vector1<std::string const&> >::execute(_object*, std::string const&)"", line = 94}, {file = 
    ""/build/cactus/trunk/cactuscore/uhal/pycohal/../../../cactuscore/extern/boost/RPMBUILD/SOURCES/include/boost/python/detail/invoke.hpp"", function = 
    ""_object* boost::python::detail::invoke<int, void (*)(_object*, std::string const&), boost::python::arg_from_python<_object*>, boost::python::arg_from_python<std::string const&> >(boost::python::detail""..., line = 82}, {file = 
    ""/build/cactus/trunk/cactuscore/uhal/pycohal/../../../cactuscore/extern/boost/RPMBUILD/SOURCES/include/boost/python/detail/caller.hpp"", function = 
    ""boost::python::detail::caller_arity<2u>::impl<void (*)(_object*, std::string const&), boost::python::default_call_policies, boost::mpl::vector3<void, _object*, std::string const&> >::operator()(_objec""..., line = 223}, {file = 
    ""/build/cactus/trunk/cactuscore/uhal/pycohal/../../../cactuscore/extern/boost/RPMBUILD/SOURCES/include/boost/python/object/py_function.hpp"", function = 
    ""boost::python::objects::caller_py_function_impl<boost::python::detail::caller<void (*)(_object*, std::string const&), boost::python::default_call_policies, boost::mpl::vector3<void, _object*, std::str""..., line = 38}}
#7  0x00002aaab0134755 in uhal::exception::exception::what (this=0x2df7c30) at src/common/exception.cpp:137
        lTime = {tv_sec = 1374654537, tv_usec = 968214}
        lStr = <incomplete type>
        lStatus = 0
        lSize = 1024
        lDemangled = 0x7fffffff9c70 ""uhal::exception::UriListParsingError""
        lThreadId = {thread_data = {px = 0x667610, pn = {pi_ = 0x6677a0}}}
        tmbuf = ""2013-07-24 10:28:57"", '\000' <repeats 14 times>""\243, \377\377\377\177\000\000\370\021i\000\000\000\000\0---Type <return> to continue, or q <return> to quit---
00`\020i\000\000\000\000\000\020\243\377\377\377\177\000""
        lBacktrace = std::vector of length 10, capacity 100 = {{file = 
    ""/build/cactus/trunk/cactuscore/uhal/log/src/common/BacktraceSymbols.cpp"", function = 
    ""Backtrace::Backtrace(std::vector<void*, std::allocator<void*> >&)"", line = 296}, {file = 
    ""/build/cactus/trunk/cactuscore/uhal/log/src/common/exception.cpp"", function = ""exception"", line = 61}, {file = 
    ""/build/cactus/trunk/cactuscore/uhal/uhal/include/uhal/Utilities.hpp"", function = ""UriListParsingError"", 
            line = 114}, {file = ""/build/cactus/trunk/cactuscore/uhal/uhal/src/common/Utilities.cpp"", function = 
    ""uhal::utilities::ParseSemicolonDelimitedUriList(std::string const&, std::vector<std::pair<std::string, std::string>, std::allocator<std::pair<std::string, std::string> > >&)"", line = 53}, {file = 
    ""/build/cactus/trunk/cactuscore/uhal/uhal/src/common/ConnectionManager.cpp"", function = ""ConnectionManager"", 
            line = 111}, {file = 
    ""/build/cactus/trunk/cactuscore/uhal/pycohal/../../../cactuscore/extern/boost/RPMBUILD/SOURCES/include/boost/python/object/value_holder.hpp"", function = ""value_holder<boost::python::objects::reference_to_value<const std::string&> >"", 
            line = 139}, {file = 
    ""/build/cactus/trunk/cactuscore/uhal/pycohal/../../../cactuscore/extern/boost/RPMBUILD/SOURCES/include/boost/python/object/make_holder.hpp"", function = 
    ""boost::python::objects::make_holder<1>::apply<boost::python::objects::value_holder<uhal::ConnectionManager>, boost::mpl::vector1<std::string const&> >::execute(_object*, std::string const&)"", line = 94}, {file = 
    ""/build/cactus/trunk/cactuscore/uhal/pycohal/../../../cactuscore/extern/boost/RPMBUILD/SOURCES/include/boost/python/detail/invoke.hpp"", function = 
    ""_object* boost::python::detail::invoke<int, void (*)(_object*, std::string const&), boost::python::arg_from_python<_object*>, boost::python::arg_from_python<std::string const&> >(boost::python::detail""..., line = 82}, {file = 
    ""/build/cactus/trunk/cactuscore/uhal/pycohal/../../../cactuscore/extern/boost/RPMBUILD/SOURCES/include/boost/python/detail/caller.hpp"", function = 
    ""boost::python::detail::caller_arity<2u>::impl<void (*)(_object*, std::string const&), boost::python::default_call_policies, boost::mpl::vector3<void, _object*, std::string const&> >::operator()(_objec""..., line = 223}, {file = 
    ""/build/cactus/trunk/cactuscore/uhal/pycohal/../../../cactuscore/extern/boost/RPMBUILD/SOURCES/include/boost/python/object/py_function.hpp"", function = 
---Type <return> to continue, or q <return> to quit---
    ""boost::python::objects::caller_py_function_impl<boost::python::detail::caller<void (*)(_object*, std::string const&), boost::python::default_call_policies, boost::mpl::vector3<void, _object*, std::str""..., line = 38}}
        lCounter = 10922
        lOutputCleaner = {_vptr.GccOutputCleaner = 0x691070, 
          mTypes = std::vector of length 11728115457575, capacity 368 = {Traceback (most recent call last):
  File ""/usr/share/gdb/python/libstdcxx/v6/printers.py"", line 469, in to_string
    return self.val['_M_dataplus']['_M_p'].string (encoding, length = len)
RuntimeError: Cannot access memory at address 0x55ebc44589c0b5f7
, Traceback (most recent call last):
  File ""/usr/share/gdb/python/libstdcxx/v6/printers.py"", line 469, in to_string
    return self.val['_M_dataplus']['_M_p'].string (encoding, length = len)
...(GDB internal errors)
UnicodeDecodeError: 'utf8' codec can't decode bytes in position 24-25: invalid data
, mStyling = 0x691070}
#8  0x00002aaaaec0ae5f in pycohal::ExceptionTranslator<uhal::exception::exception>::operator() (this=0x691040, e=...)
---Type <return> to continue, or q <return> to quit---
    at include/uhal/pycohal/converters_exceptions.hpp:109
        pyException = {<boost::python::api::object_base> = {<boost::python::api::object_operators<boost::python::api::object>> = {<boost::python::def_visitor<boost::python::api::object>> = {<No data fields>}, <No data fields>}, 
            m_ptr = 0x2aaaae2310b0}, <No data fields>}
#9  0x00002aaaaec0af71 in boost::python::detail::translate_exception<uhal::exception::exception, pycohal::ExceptionTranslator<uhal::exception::exception> >::operator() (this=0x691038, handler=..., f=..., translate=...)
    at /build/cactus/trunk/cactuscore/uhal/pycohal/../../../cactuscore/extern/boost/RPMBUILD/SOURCES/include/boost/python/detail/translate_exception.hpp:61
        e = @0x2df7c30
#10 0x00002aaaaec0b016 in boost::_bi::list3<boost::arg<1>, boost::arg<2>, boost::_bi::value<pycohal::ExceptionTranslator<uhal::exception::exception> > >::operator()<bool, boost::python::detail::translate_exception<uhal::exception::exception, pycohal::ExceptionTranslator<uhal::exception::exception> >, boost::_bi::list2<boost::python::detail::exception_handler const&, boost::function0<void> const&> > (this=0x691040, f=..., a=...)
    at /build/cactus/trunk/cactuscore/uhal/pycohal/../../../cactuscore/extern/boost/RPMBUILD/SOURCES/include/boost/bind/bind.hpp:382
No locals.
#11 0x00002aaaaec0b06a in boost::_bi::bind_t<bool, boost::python::detail::translate_exception<uhal::exception::exception, pycohal::ExceptionTranslator<uhal::exception::exception> >, boost::_bi::list3<boost::arg<1>, boost::arg<2>, boost::_bi::value<pycohal::ExceptionTranslator<uhal::exception::exception> > > >::operator()<boost::python::detail::exception_handler, boost::function0<void> > (this=0x691038, a1=..., a2=...)
    at /build/cactus/trunk/cactuscore/uhal/pycohal/../../../cactuscore/extern/boost/RPMBUILD/SOURCES/include/boost/bind/bind_template.hpp:102
        a = {<boost::_bi::storage2<boost::python::detail::exception_handler const&, boost::function0<void> const&>> = {<boost::_bi::storage1<boost::python::detail::exception_handler const&>> = {a1_ = @0x691030}, 
            a2_ = @0x7fffffffa630}, <No data fields>}
#12 0x00002aaaaec0b09d in boost::detail::function::function_obj_invoker2<boost::_bi::bind_t<bool, boost::python::detail::translate_exception<uhal::exception::exception, pycohal::ExceptionTranslator<uhal::exception::exception> >, boost::_bi::list3<boost::arg<1>, boost::arg<2>, boost::_bi::value<pycohal::ExceptionTranslator<uhal::exception::exception> > > >, bool, b---Type <return> to continue, or q <return> to quit---
oost::python::detail::exception_handler const&, boost::function0<void> const&>::invoke (function_obj_ptr=..., a0=..., 
    a1=...)
    at /build/cactus/trunk/cactuscore/uhal/pycohal/../../../cactuscore/extern/boost/RPMBUILD/SOURCES/include/boost/function/function_template.hpp:132
        f = 0x691038
#13 0x00002aaaaf0b7b33 in boost::python::handle_exception_impl(boost::function0<void>) ()
   from /opt/cactus/lib/libboost_python.so.1.48.0
No symbol table info available.
#14 0x00002aaaaf0ad94f in function_call () from /opt/cactus/lib/libboost_python.so.1.48.0
No symbol table info available.
#15 0x00000036d3c367e0 in PyObject_Call () from /usr/lib64/libpython2.4.so.1.0
No symbol table info available.
#16 0x00000036d3c3c90f in ?? () from /usr/lib64/libpython2.4.so.1.0
No symbol table info available.
#17 0x00000036d3c367e0 in PyObject_Call () from /usr/lib64/libpython2.4.so.1.0
No symbol table info available.
#18 0x00000036d3c74fbc in ?? () from /usr/lib64/libpython2.4.so.1.0
No symbol table info available.
#19 0x00000036d3c70f98 in ?? () from /usr/lib64/libpython2.4.so.1.0
No symbol table info available.
#20 0x00000036d3c367e0 in PyObject_Call () from /usr/lib64/libpython2.4.so.1.0
No symbol table info available.
#21 0x00000036d3c94c1c in PyEval_EvalFrame () from /usr/lib64/libpython2.4.so.1.0
No symbol table info available.
#22 0x00000036d3c976d5 in PyEval_EvalCodeEx () from /usr/lib64/libpython2.4.so.1.0
No symbol table info available.
#23 0x00000036d3c95e2f in PyEval_EvalFrame () from /usr/lib64/libpython2.4.so.1.0
No symbol table info available.
---Type <return> to continue, or q <return> to quit---
#24 0x00000036d3c96256 in PyEval_EvalFrame () from /usr/lib64/libpython2.4.so.1.0
No symbol table info available.
#25 0x00000036d3c976d5 in PyEval_EvalCodeEx () from /usr/lib64/libpython2.4.so.1.0
No symbol table info available.
#26 0x00000036d3c4cb9a in ?? () from /usr/lib64/libpython2.4.so.1.0
No symbol table info available.
#27 0x00000036d3c367e0 in PyObject_Call () from /usr/lib64/libpython2.4.so.1.0
No symbol table info available.
#28 0x00000036d3c94c1c in PyEval_EvalFrame () from /usr/lib64/libpython2.4.so.1.0
No symbol table info available.
#29 0x00000036d3c976d5 in PyEval_EvalCodeEx () from /usr/lib64/libpython2.4.so.1.0
No symbol table info available.
#30 0x00000036d3c4caa7 in ?? () from /usr/lib64/libpython2.4.so.1.0
No symbol table info available.
#31 0x00000036d3c367e0 in PyObject_Call () from /usr/lib64/libpython2.4.so.1.0
No symbol table info available.
#32 0x00000036d3c3c90f in ?? () from /usr/lib64/libpython2.4.so.1.0
No symbol table info available.
#33 0x00000036d3c367e0 in PyObject_Call () from /usr/lib64/libpython2.4.so.1.0
No symbol table info available.
#34 0x00000036d3c7539a in ?? () from /usr/lib64/libpython2.4.so.1.0
No symbol table info available.
#35 0x00000036d3c367e0 in PyObject_Call () from /usr/lib64/libpython2.4.so.1.0
No symbol table info available.
#36 0x00000036d3c93fbe in PyEval_EvalFrame () from /usr/lib64/libpython2.4.so.1.0
No symbol table info available.
#37 0x00000036d3c976d5 in PyEval_EvalCodeEx () from /usr/lib64/libpython2.4.so.1.0
No symbol table info available.
---Type <return> to continue, or q <return> to quit---
#38 0x00000036d3c4cb9a in ?? () from /usr/lib64/libpython2.4.so.1.0
No symbol table info available.
#39 0x00000036d3c367e0 in PyObject_Call () from /usr/lib64/libpython2.4.so.1.0
No symbol table info available.
#40 0x00000036d3c94c1c in PyEval_EvalFrame () from /usr/lib64/libpython2.4.so.1.0
No symbol table info available.
#41 0x00000036d3c976d5 in PyEval_EvalCodeEx () from /usr/lib64/libpython2.4.so.1.0
No symbol table info available.
#42 0x00000036d3c4caa7 in ?? () from /usr/lib64/libpython2.4.so.1.0
No symbol table info available.
#43 0x00000036d3c367e0 in PyObject_Call () from /usr/lib64/libpython2.4.so.1.0
No symbol table info available.
#44 0x00000036d3c3c90f in ?? () from /usr/lib64/libpython2.4.so.1.0
No symbol table info available.
#45 0x00000036d3c367e0 in PyObject_Call () from /usr/lib64/libpython2.4.so.1.0
No symbol table info available.
#46 0x00000036d3c7539a in ?? () from /usr/lib64/libpython2.4.so.1.0
No symbol table info available.
#47 0x00000036d3c367e0 in PyObject_Call () from /usr/lib64/libpython2.4.so.1.0
No symbol table info available.
#48 0x00000036d3c93fbe in PyEval_EvalFrame () from /usr/lib64/libpython2.4.so.1.0
No symbol table info available.
#49 0x00000036d3c976d5 in PyEval_EvalCodeEx () from /usr/lib64/libpython2.4.so.1.0
No symbol table info available.
#50 0x00000036d3c4cb9a in ?? () from /usr/lib64/libpython2.4.so.1.0
No symbol table info available.
#51 0x00000036d3c367e0 in PyObject_Call () from /usr/lib64/libpython2.4.so.1.0
No symbol table info available.
---Type <return> to continue, or q <return> to quit---
#52 0x00000036d3c94c1c in PyEval_EvalFrame () from /usr/lib64/libpython2.4.so.1.0
No symbol table info available.
#53 0x00000036d3c976d5 in PyEval_EvalCodeEx () from /usr/lib64/libpython2.4.so.1.0
No symbol table info available.
#54 0x00000036d3c4caa7 in ?? () from /usr/lib64/libpython2.4.so.1.0
No symbol table info available.
#55 0x00000036d3c367e0 in PyObject_Call () from /usr/lib64/libpython2.4.so.1.0
No symbol table info available.
#56 0x00000036d3c3c90f in ?? () from /usr/lib64/libpython2.4.so.1.0
No symbol table info available.
#57 0x00000036d3c367e0 in PyObject_Call () from /usr/lib64/libpython2.4.so.1.0
No symbol table info available.
#58 0x00000036d3c7539a in ?? () from /usr/lib64/libpython2.4.so.1.0
No symbol table info available.
#59 0x00000036d3c367e0 in PyObject_Call () from /usr/lib64/libpython2.4.so.1.0
No symbol table info available.
#60 0x00000036d3c93fbe in PyEval_EvalFrame () from /usr/lib64/libpython2.4.so.1.0
No symbol table info available.
#61 0x00000036d3c96256 in PyEval_EvalFrame () from /usr/lib64/libpython2.4.so.1.0
No symbol table info available.
#62 0x00000036d3c96256 in PyEval_EvalFrame () from /usr/lib64/libpython2.4.so.1.0
No symbol table info available.
#63 0x00000036d3c976d5 in PyEval_EvalCodeEx () from /usr/lib64/libpython2.4.so.1.0
No symbol table info available.
#64 0x00000036d3c4caa7 in ?? () from /usr/lib64/libpython2.4.so.1.0
No symbol table info available.
#65 0x00000036d3c367e0 in PyObject_Call () from /usr/lib64/libpython2.4.so.1.0
No symbol table info available.
---Type <return> to continue, or q <return> to quit---
#66 0x00000036d3c3c90f in ?? () from /usr/lib64/libpython2.4.so.1.0
No symbol table info available.
#67 0x00000036d3c367e0 in PyObject_Call () from /usr/lib64/libpython2.4.so.1.0
No symbol table info available.
#68 0x00000036d3c74fbc in ?? () from /usr/lib64/libpython2.4.so.1.0
No symbol table info available.
#69 0x00000036d3c70f98 in ?? () from /usr/lib64/libpython2.4.so.1.0
No symbol table info available.
#70 0x00000036d3c367e0 in PyObject_Call () from /usr/lib64/libpython2.4.so.1.0
No symbol table info available.
#71 0x00000036d3c93fbe in PyEval_EvalFrame () from /usr/lib64/libpython2.4.so.1.0
No symbol table info available.
#72 0x00000036d3c976d5 in PyEval_EvalCodeEx () from /usr/lib64/libpython2.4.so.1.0
No symbol table info available.
#73 0x00000036d3c97722 in PyEval_EvalCode () from /usr/lib64/libpython2.4.so.1.0
No symbol table info available.
#74 0x00000036d3cb4059 in ?? () from /usr/lib64/libpython2.4.so.1.0
No symbol table info available.
#75 0x00000036d3cb5508 in PyRun_SimpleFileExFlags () from /usr/lib64/libpython2.4.so.1.0
No symbol table info available.
#76 0x00000036d3cbbdc9 in Py_Main () from /usr/lib64/libpython2.4.so.1.0
No symbol table info available.
#77 0x00000036c021d9c4 in __libc_start_main () from /lib64/libc.so.6
No symbol table info available.
#78 0x0000000000400629 in _start ()
No symbol table info available.

}}}

I would suggest to first fix #337, and then try to reproduce this error again.

Cheers,
marc
",defect,new,minor,IPbus software - FUTURE releases,pycohal,nightly build,,,arose
