﻿id,summary,reporter,owner,description,type,status,priority,milestone,component,version,resolution,keywords,cc
186,Versioning of nightlies,jhegeman,marc,"Would it be possible/a good idea to give the RPMs in the nightly builds a build number? That way one could ensure to automatically use the latest and greatest nightly using 'yum update.'

Or is this unwanted? It may be a better idea not to update automatically for nightly builds. Maybe... But still I'd say a build number would be nice.

Cheers,
Jeroen",enhancement,closed,minor,,nightlies,nightly build,wontfix,build version,
