﻿id,summary,reporter,owner,description,type,status,priority,milestone,component,version,resolution,keywords,cc
2259,MP7 software : Update config subdirectory to match calol2/config,tsw,tsw thea,"Related to corresponding calo layer 2 ticket, #2253, and SWATCH ticket #2251. 

Reasons:
 1. Incorporate various useful additions that were added to `calol2/config` and `swatch/config` over the past several months. E.g:
   * Creation of `debuginfo` RPMs
   * Use of `-std=c++11` rather than `-std=c++0x` g++ compiler flag
 2. Make `mp7/config` identical to `calol2/config` and `swatch/config`",enhancement,new,minor,mp7sw - FUTURE,mp7 software,,,,
