﻿id,summary,reporter,owner,description,type,status,priority,milestone,component,version,resolution,keywords,cc
2356,Prescale column cell commands,garadi,arnold garadi,"Two cell commands should be added to the uGT cell.

* GetCurrentPrescaleColumn
   * Returns the currently applied prescale column and otf flag (otf flag indicates whether production prescales have been changed or not)
       {
         ""index"": <prescaleColumnIndex>
         ""label"": <prescaleColumnLabel>
         ""otf"":   <true | false>
       }
   * or empty json (when not in configured so far)
  

* GetCurrentPrescaleColumnList
   * Returns the current list of prescale columns
       [
         {
           ""index"": <prescaleColumnIndex0>
           ""label:"" <prescaleColumnLabel0>
         },
         { 
           ""index"": <prescaleColumnIndex1>
           ""label:"" <prescaleColumnLabel1>
         },
         ...
       ]
   * or empty json (when not in configured so far)",task,closed,minor,ugt v0.22.X/v0.23.X,ugt,,fixed,,hephy-cms-trigger@…
