﻿id,summary,reporter,owner,description,type,status,priority,milestone,component,version,resolution,keywords,cc
2237,two type of input ports for emtf,batinkov,gcodispo,"Hi everyone,

Emtf needs to add a new type of input ports that corresponds to the fibers from the RPCs. These ports are very different from the one we currently have so we need a new class. I have an idea of how to implement it but I wanted to talk to you first. I think to create a new class that inherits from swatch::processor::InputPort and to use a factory in the place where I create the ports (https://svnweb.cern.ch/trac/cactus/browser/trunk/cactusprojects/emtf/ts/cell/src/common/Mtf7Processor.cpp#L93). Then based on the name of the input port that factory will create either CSC or RPC input port class. What do you think about that? And also do you think there might be some problems in the GUI if we have different types of ports with different metrics.

All the best,
Atanas
",task,closed,major,,emtf,,fixed,,batinkov kkotov llazarid gdirkx tsw thea
