﻿id,summary,reporter,owner,description,type,status,priority,milestone,component,version,resolution,keywords,cc
1826,Loading a new System does not trigger a details refresh,sbologna,sbologna,"In the New Setup Panel if a new system is loaded the component detail is not refreshed. 
It is better to blank out that space.",defect,closed,minor,SWATCH suite v0.8.0,swatch,,fixed,,
