﻿id,summary,reporter,owner,description,type,status,priority,milestone,component,version,resolution,keywords,cc
2289,optical switch experience,juskoa,,"A prototype ipbus board was tested with metallic ethernet SFP module AVAGO ABCU-5740ARZ, which we intend to change for the optical one (AVAGO AFBR-709DMZ).
Does anybody has experience with an optical ethernet switch
(e.g. GSW-3420FM seems is what we will buy) for ipbus connections?",support,new,minor,,ipbus F/W,ipbus sw 2.4,,optical switch,
