﻿id,summary,reporter,owner,description,type,status,priority,milestone,component,version,resolution,keywords,cc
565,ts.py: erase job control cron.d jobs,cghabrou,cghabrou,"I have noticed that I receive in my CERN email account a message from every nightly virtual machine where a XaaS setup is installed every minute, which is quite annoying. 

The messages are:
{{{
Cron <root@cactus-worker-5> /etc/xdaq.d/autorestart gtgmttest jobcontrol http://cactus-worker-5.cern.ch:5013

cat: /var/run/gtgmttest.jobcontrol.pid: No such file or directory
}}}


After digging a bit into the XaaS setups, it seems that by default the status of the services managed by the setup are checked every minute and are tried to be restarted if they are not alive. 
Apparently the job control service for the l1test and gtgmttest setups must be in a not very good shape. 

For the moment, and in order to avoid my email being continuously full with crap, I will add a couple of lines in the ts.py file to erase the cron.d files that the setup deploys.

Then, in order to make things cleaner, I am wondering whether jobcontrol is needed for either of the setups (to my knowledge, GT has never used it). 


",task,closed,minor,,nightlies,nightly build,fixed,,thea clazarid
