﻿id,summary,reporter,owner,description,type,status,priority,milestone,component,version,resolution,keywords,cc
1737,Update SWATH amc13 ConfigureTTCCommand,thea,thea,"To use 

`AMC13::setOcrCommand`
and
`AMC13::setResyncCommand`

that became available in `amc13` v1.1.6",task,closed,minor,SWATCH suite v0.7.0,swatch,,fixed,,
