﻿id,summary,reporter,owner,description,type,status,priority,milestone,component,version,resolution,keywords,cc
2359,calo layer 2 : Rebuild driver and cell against MP7 SW v2.4.1 & SWATCH v1.2.0,tsw,arose thea tsw,"As described in title. Should only need to ...
 * update name of pugixml library that am linking against; then
 * update version numbers of driver & cell",task,new,minor,,calol2,,,,
