﻿id,summary,reporter,owner,description,type,status,priority,milestone,component,version,resolution,keywords,cc
30,class attriute in uhal_address_table.xml example,marc,arose,"Dear Andrew,

I have noticed that there is a ""class"" attribute in the [https://svnweb.cern.ch/trac/cactus/browser/trunk/uhal/tests/addr/connections.xml uhal_address_table.xml]:
{{{
<node id=""SOURCE_CARD"">
  <node id=""RECEIVER"" class=""receiver"" >
}}}

Is this just a typo or the attribute has some meaning?

Thanks,
marc

 ",support,closed,minor,,uhal,,fixed,,frazier
