﻿id,summary,reporter,owner,description,type,status,priority,milestone,component,version,resolution,keywords,cc
655,"Access ritghts for users adbyszuk, pozniak, madorsky, wzab",kbunkow,cghabrou clazarid thea,"Dears
Could you please grant the commit rights to the Cactus repository for the following users (Muon Track Finer firmware developers):
adbyszuk - Adrian Byszuk 
pozniak - Krzysztof Pozniak
madorsky - Alexander Madorsky
wzab - Wojciech Zabolotny

Regards
Karol",task,closed,minor,,unknown,,fixed,,thea clazarid adbyszuk pozniak madorsky wzab
