﻿id,summary,reporter,owner,description,type,status,priority,milestone,component,version,resolution,keywords,cc
856,new dtsc rpm,gcodispo,clazarid,"Hi,

I would need a new puppet snapshot including the dtsc rpms you can find in:

/nfshome0/gcodispo/cms_trigger_pro_slc6_64

Cheers,
   Giuseppe",task,closed,minor,,dtsc,,fixed,,
