﻿id,summary,reporter,owner,description,type,status,priority,milestone,component,version,resolution,keywords,cc
1282,Change of orbit and event counters to 32b in MP7 core firmware,newbold,newbold,"Change of orbit and event counters to 32b in MP7 core firmware.

Implies change of register content in mp7_ttc, and various changes throughout the code. Note that in the history buffers, there is no room for 32b, so 24b is still used.

Note also that we only actually send 16b to AMC13...
",enhancement,new,minor,mp7fw - v1.8.x releases,mp7 firmware,,,,
