﻿id,summary,reporter,owner,description,type,status,priority,milestone,component,version,resolution,keywords,cc
741,Possible link issue with MP7-R1 v1.4.0 fw/sw & AMC13,giles,thea arose bundocka harder,"Links do not seem to align when using MP7 in ""--clksrc=external"" mode and sw/fw 1.4.0 at HEPHY, Vienna.  Need to confirm issue in B14.

fw from https://twiki.cern.ch/twiki/pub/CMS/MP7TagsAndBitfiles/mp7fw_v1_4_0_pre0_r1_null_algo.tgz

",defect,closed,minor,,mp7 software,,fixed,MP7 1.4.0 AMC13,rahbaran
