﻿id,summary,reporter,owner,description,type,status,priority,milestone,component,version,resolution,keywords,cc
1049,Standardize way to retrieve configured subsystem list from the Central Cell,clazarid,thea,"Currently, the L1 page gets the list of subsystems by parsing the reply payload of the configuration operation. This has the consequence of being sensitive to changes in the format of this reply.

A new command will be added in the Central Cell that will return in a standard format the list of included subsystems to avoid such problems.",enhancement,closed,minor,,trgfm,,fixed,,
