﻿id,summary,reporter,owner,description,type,status,priority,milestone,component,version,resolution,keywords,cc
1541,"In case of malformed frame ids, BoardDataReader stops parsing w/o issuing an error message.",thea,,"For instance, parsing stops at frame `0009` then the following file is loaded
{{{
Board MP7_TEST Event1
 Quad/Chan :    q0c0
      Link :     0
Frame 0000 : 1v035E2FAE
Frame 0001 : 1v820FFFE6
Frame 0002 : 1v035E2FAE
Frame 0003 : 1v8217FFE6
Frame 0004 : 1v035E2FAE
Frame 0005 : 1v821FFFE6
Frame 0006 : 1v035E2FAE
Frame 0007 : 1v8227FFE6
Frame 0008 : 1v035E2FAE
Frame 0009 : 1vFFFFFFFF
Frame 000A : 1vDEADBEEF
Frame 000B : 1vFFFFFFFF
Frame 000C : 1vDEADBEEF
Frame 000D : 1vFFFFFFFF
}}}",defect,new,minor,mp7sw - v1.9.x releases,mp7 software,,,,
