﻿id,summary,reporter,owner,description,type,status,priority,milestone,component,version,resolution,keywords,cc
2036,SWATCH Cell: Delete dojo State Machine Panel from SWATCH Cell,sbologna,sbologna,"Since we have not received any bug report on the Polymer one we will remove the dojo State Machine Panel

R.I.P. we will miss you",enhancement,closed,minor,SWATCH suite v0.10.0,swatch,,fixed,,
