﻿id,summary,reporter,owner,description,type,status,priority,milestone,component,version,resolution,keywords,cc
1271,L1Page: reduce the memory threshold to trigger alarms,cghabrou,cghabrou,"Currently is set to a very high threshold ( ~ 19 GB for the virtual memory ). By taking a look to the central cell's l1ts_cell flashlist, I have seen that the most memory hungry apps take less than 3 GB. 
I'll set the limit to 4.5 GB (50 % more, just in case). 

",defect,closed,minor,L1Page 1.9.16,l1page,,fixed,,
