﻿id,summary,reporter,owner,description,type,status,priority,milestone,component,version,resolution,keywords,cc
1229,GT: GT_GTL_ALGO_BC_MASKS key is sticky,cghabrou,cghabrou,"It was noticed during the last VdM scans that the GTL_ALGO_BC_MASKS key is sticky: the values set in the GTL board would remain there unless the processes are restarted and the crate power cycled. 

After talking to Manfred, we have decided to prevent the GT from configuring unless this key is set. ",defect,closed,major,GT/GMT v1.1.1,gt/gmt,TS 2.0,fixed,,
