﻿id,summary,reporter,owner,description,type,status,priority,milestone,component,version,resolution,keywords,cc
725,Nightly scripts: add gd-devel to dependencies,cghabrou,cghabrou,"Nightlies are failing (in GMT) because the packages gd-devel is not deployed in the VM machines. 

",defect,closed,minor,,nightlies,nightly build,fixed,,
