﻿id,summary,reporter,owner,description,type,status,priority,milestone,component,version,resolution,keywords,cc
1000,Review MGTRegionNode interface,thea,thea arose bundocka harder tsw,"`MGTRegionNode` interface has grown with no direction over months and integration tests. It's time to clean it up.

At the moment the interface presents:
 * A number of global methods (`softReset`, `resetFSM`etc.)
 * Methods that operate on a single channel (`enableLoopback`, `enableOrbitTag`)
 * A few methods that operate on a list of channels (`check`)

This is all very confusing, event to the author. There must be a few guidelines that define what functionalities the interface should offer, that take into account how the mgts are usually configured and monitored. Here are some ideas for the guidelines:

 * Differentiate between Tx and Rx channels. It must be possible to reset/check/configure them separately.
 * All channels related methods take a channel list as last argument (defaulting to `kChanIds`). This should cover 99% of the use cases: access to single channel, multiple channels, all channels.
 * Global methods (i.e. working on global MGT registers) are the only ones not taking a channels id list.
 * Existing methods acting on a single channel are dropped

`checkRx` and `checkTx` don't fit in the picture quite so nicely. This is because, until now, the overall channel status was monitored. The links were mostly operated in loopback, and it made a lot of sense to check rx and tx close together. This is not the case anymore. More and more rx and tx are considered independent entities. So I think it's OK to split them everywhere, until a specific need arises.


'''TODOS'''
 * Add a `validateIDs` method to ensure the channel ids are within range
 * Convert
  * `enableLoopback`
  * `enableOrbitTag`
  * `clearCRCs`
  * `resetTxFSM`,`resetRxFSM`
  * `waitTxFMSResetDone`,`waitRxFMSResetDone`
  * `checkRx`,`checkTx`
 * Drop
  * `resetFSMs`
  * `clear`

That should be all for now...",defect,closed,major,mp7sw - v1.5.x releases,mp7 software,,fixed,,
