﻿id,summary,reporter,owner,description,type,status,priority,milestone,component,version,resolution,keywords,cc
2169,Migration to CC7,garadi,arnold garadi,"To keep track of changes related to the migration to CC7.

",task,closed,minor,ugt v0.10.X,ugt,,fixed,,hephy-cms-trigger@…
