﻿id,summary,reporter,owner,description,type,status,priority,milestone,component,version,resolution,keywords,cc
2241,SWATCH Cell: Command panel doesn't correctly escape object ids in querySelector calls.,thea,thea,"Problem tracked down to the use of querySelector with non-escaped id.

{{{
 setProgressClass: function (item, deviceID) {

    var statusBarID = this.getProgressID(deviceID);

    if (Polymer.dom(this.root).querySelector(""#"" + statusBarID) == null) return item;
}}}

in `command-panel.js:150`.

from https://mathiasbynens.be/notes/css-escapes

'''Special characters in CSS
'''
Any character that is not a hexadecimal digit, line feed, carriage return, or form feed can be escaped with a backslash to remove its special meaning.

The following characters have a special meaning in CSS: !, "", #, $, %, &, ', (, ), *, +, ,, -, ., /, :, ;, <, =, >, ?, @, [, \, ], ^, `, {, |, }, and ~.

There are two options if you want to use them. Either you use the Unicode code point — for example, the plus sign (+) is U+002B, so if you would want to use it in a CSS selector, you would escape it into \2b (note the space character at the end) or \00002b (using exactly six hexadecimal digits).

The second option is far more elegant though: just escape the character using a backslash (\), e.g. + would escape into \+.

Theoretically, the : character can be escaped as \:, but IE < 8 doesn’t recognize that escape sequence correctly. A workaround is to use \3A instead.",defect,closed,minor,SWATCH suite v1.0.0,swatch,,fixed,,
