﻿id,summary,reporter,owner,description,type,status,priority,milestone,component,version,resolution,keywords,cc
1651,SWATCH Processor missing metrics and bugfixes,thea,,"'''TTC'''
 * Rename `eventCounter` with `l1aCount` as the former usually refers to readout events.

'''Readout'''
 * `nEvents`: number of events sent out

'''MP7RxPorts'''
 * `isAligned`: doesn't take into account whether the alignment marker was ever received.
 * Add a metric that uses `crc_checked`
 * Add alignment's `bx`, `cycle`",defect,closed,minor,SWATCH suite v0.5.1,swatch,,fixed,,
