﻿id,summary,reporter,owner,description,type,status,priority,milestone,component,version,resolution,keywords,cc
1029,Hiding obsolete information in gtcell panels,arnold,arnold,"A bunch of status information in the gtcell's panels are obsolete while running with the TCDS setup now. Some of this obsolete information can unsettle trigger shifters so it was discussed with Manfred to hide this parts of the panels at default.

For backwards compatibility (testing in non-production non-TCDS environments) it was decided to not remove this parts but to introduce an AJAX ""TCS view mode"" check-box for experts users to inspect the hidden counters (alongside ""TCS mode"" switch in configuration panel).

This changes will following panels affect:
 * 1 GT Partitioning
  * hiding ""FMM Status"", ""Force READY *"", ""DAQ Status"", ""Time Slots""
  * adding ""TCS view mode"" check-box
 * 3 GT Trigger Monitor
  * hiding ""GT Partition""
  * renaming ""RateHz"" to ""TCS RateHz"" in ""Live"" group box
  * hiding ""Trigger"", ""Events"", ""Resets"", ""BC Errors"" in ""Live"" group box
  * hiding all ""L1As*"" and ""Deadtime*"" rows in ""Recent Lumi Sections - Trigger & Deadtime Scalers"" group box
  * adding ""TCS view mode"" check-box",defect,closed,minor,GT/GMT - FUTURE,gt/gmt,,fixed,,tmatsush mjeitler cghabrou hbergaue rahbaran wulz
