﻿id,summary,reporter,owner,description,type,status,priority,milestone,component,version,resolution,keywords,cc
2196,The battle of the controlhubs?,jhegeman,,"Hi Tom, 

As promised: some more info attached to a ticket.

The basic story is: while migrating from SLC6 to CC7 we tried to transparently change over the controlhub, which seems to have led to some conflict between the two controlhubs while both were active. Below is some more information.

Procedure:
- The SLC6 controlhub was running and functioning perfectly.
- We installed a new machine with CC7 and the controlhub, and started the machine and the service.
- We changed all DNS aliases to point to the CC7 machine instead of the SLC6 machine.
- Almost everything just continued to work perfectly, apart from a few registers on two ipbus endpoints (i.e., boards, in this case).
- The symptoms were steady 'controlhub error 4' (timeout) for these boards. The most interesting thing was that even after several reboots of one of these boards (I only really debugged one of the two), most of the register accesses seemed to work, apart from one particular one. Accesses to that register would _always_ fail.

Details:
- The ipbus endpoint that was affected was at IP 10.176.128.130.
- The controlhub RPM installed on the SLC6 machine is cactuscore-controlhub-2.4.1-0.slc6.x86_64.
- The controlhub RPM installed on the CC7 machine is cactuscore-controlhub-2.5.0-1.centos7.x86_64.

The SLC6 controlhub log shows only timeouts, reallly:
{{{
ctrl-s2c16-06-01 controlhub[3560]:   2017-03-14 12:09:34.207 [error] <0.29931.383> - Device(?????-10.176.128.130:50001) - IRRECOVERABLE TIMEOUT when waiting for control response packet from board.
ctrl-s2c16-06-01 controlhub[3560]:   2017-03-14 12:09:35.207 [error] <0.7220.384> - Device(?????-10.176.128.130:50001) - IRRECOVERABLE TIMEOUT when waiting for control response packet from board.
ctrl-s2c16-06-01 controlhub[3560]:   2017-03-14 12:09:36.207 [error] <0.7064.384> - Device(?????-10.176.128.130:50001) - IRRECOVERABLE TIMEOUT when waiting for control response packet from board.
ctrl-s2c16-06-01 controlhub[3560]:   2017-03-14 12:09:37.207 [error] <0.7210.384> - Device(?????-10.176.128.130:50001) - IRRECOVERABLE TIMEOUT when waiting for control response packet from board.
ctrl-s2c16-06-01 controlhub[3560]:   2017-03-14 12:09:38.207 [error] <0.7160.384> - Device(?????-10.176.128.130:50001) - IRRECOVERABLE TIMEOUT when waiting for control response packet from board.
ctrl-s2c16-06-01 controlhub[3560]:   2017-03-14 12:09:39.207 [error] <0.7192.384> - Device(?????-10.176.128.130:50001) - IRRECOVERABLE TIMEOUT when waiting for control response packet from board.
ctrl-s2c16-06-01 controlhub[3560]:   2017-03-14 12:09:40.207 [error] <0.7208.384> - Device(?????-10.176.128.130:50001) - IRRECOVERABLE TIMEOUT when waiting for control response packet from board.
}}}

The CC7 controlhub log shows sequences that look very much like the following (where the timeouts by far dominate):
{{{
ctrl-s2c16-22-01 controlhub[1288]:   2017-03-14 12:09:34.102 [error] <0.1695.0> - Device(?????-10.176.128.130:50001) - Not expecting any response from board, but received: <<240,71,211,32,0,1,0,32,32,55,67,70>>
ctrl-s2c16-22-01 controlhub[1288]:   2017-03-14 12:09:34.123 [error] <0.1695.0> - Device(?????-10.176.128.130:50001) - Not expecting any response from board, but received: <<240,71,211,32,0,1,0,32,32,55,67,70>>
ctrl-s2c16-22-01 controlhub[1288]:   2017-03-14 12:09:34.144 [error] <0.1695.0> - Device(?????-10.176.128.130:50001) - Not expecting any response from board, but received: <<240,71,211,32,0,1,0,32,32,55,67,70>>
ctrl-s2c16-22-01 controlhub[1288]:   2017-03-14 12:09:34.165 [error] <0.1695.0> - Device(?????-10.176.128.130:50001) - Not expecting any response from board, but received: <<240,71,211,32,0,1,0,32,32,55,67,70>>
ctrl-s2c16-22-01 controlhub[1288]:   2017-03-14 12:09:34.186 [error] <0.1695.0> - Device(?????-10.176.128.130:50001) - Not expecting any response from board, but received: <<240,71,211,32,0,1,0,32,32,55,67,70>>
ctrl-s2c16-22-01 controlhub[1288]:   2017-03-14 12:09:34.961 [error] <0.1695.0> - Device(?????-10.176.128.130:50001) - IRRECOVERABLE TIMEOUT when waiting for control response packet from board.
ctrl-s2c16-22-01 controlhub[1288]:   2017-03-14 12:09:35.335 [error] <0.1699.0> - Device(?????-10.176.128.130:50001) - IRRECOVERABLE TIMEOUT when waiting for control response packet from board.
ctrl-s2c16-22-01 controlhub[1288]:   2017-03-14 12:09:36.647 [error] <0.1703.0> - Device(?????-10.176.128.130:50001) - IRRECOVERABLE TIMEOUT when waiting for control response packet from board.
ctrl-s2c16-22-01 controlhub[1288]:   2017-03-14 12:09:37.647 [error] <0.1707.0> - Device(?????-10.176.128.130:50001) - IRRECOVERABLE TIMEOUT when waiting for control response packet from board.
ctrl-s2c16-22-01 controlhub[1288]:   2017-03-14 12:09:38.376 [error] <0.1711.0> - Device(?????-10.176.128.130:50001) - IRRECOVERABLE TIMEOUT when waiting for control response packet from board.
}}}

I will attach the full logs as well, but they do look like 'more of the same.'
",support,new,minor,,controlhub,,,,
