﻿id,summary,reporter,owner,description,type,status,priority,milestone,component,version,resolution,keywords,cc
1646,SWATCH: Remove notice-level log messages from common plugins,tsw,tsw,"Currently, the common AMC13 manager and MP7 processor log the board's firmware versions, at notice level, via the `swatch::logger` API.

However, by default, `log4cplus` doesn't have a notice level; so these messages should be moved to the info level (and preferably performed using the `log4cplus` macros).

At the same time, we should take the opportunity to look for any other use of the notice level in swatch.
",defect,closed,minor,SWATCH suite v0.5.1,swatch,,fixed,,
