﻿id,summary,reporter,owner,description,type,status,priority,milestone,component,version,resolution,keywords,cc
699,l1ts setup v. 1.12.69,clazarid,clazarid,"New 11ts setup version requested for deployment at CMS in order to add the TCDS-iCI cell in all level-1 subsystems : 

https://savannah.cern.ch/support/?143817",task,closed,minor,l1ts 1.12.69,tcds,TS 1.12.8,duplicate,,
