﻿id,summary,reporter,owner,description,type,status,priority,milestone,component,version,resolution,keywords,cc
2004,SWATCH : System-level analysis of failed FSM transitions,tsw,tsw,"It would be useful for subsystems to be able to run a subsystem-specific analysis after a system-level transition fails or returns warning, in order to provide an interpretation of the source of the error/warning based on correlations between errors encountered by different processors/AMC13s.

Concrete example: In calo layer 1, if the input port configuration/alignment fails, it would be useful to be able to:
 1. Automatically run a function that inspects which ports that fail across all of the processors, and determine if they all correspond to the same FED number (or identify other multi-board patterns) 
 2. Print a short message summarising this analysis in the subsystem/central cell's run control operation panels, and send that message to the DAQ shifter (i.e. L0 FM)

We should be able to incorportate this into the SWATCH API by adding a status/result message to the `SystemTransitionSnapshot`, and allowing the subsystems to register a `SystemTransition` callback method of signature `std::string analyseDetails(const SystemTransitionSnapshot)` which will be called in case the `SystemTransition` ends in a warning/error.",enhancement,closed,minor,SWATCH suite v0.10.0,swatch,,fixed,,
