﻿id,summary,reporter,owner,description,type,status,priority,milestone,component,version,resolution,keywords,cc
1104,Error when compiling uhal_2_4_0 on CentOS 7,wzab,tsw arose cghabrou clazarid thea harder,"I tried to compile uhal_2_4_0 on CentOS 7 machine. After :
{{{
$ svn co https://svn.cern.ch/reps/cactus/tags/ipbus_sw/uhal_2_4_0
$ cd uhal_2_4_0
$ make Set=uhal
}}}
I finally get the following error:
{{{
make  -C cactuscore/controlhub 
OS Detected: ""unknown.os""
make[1]: Entering directory `/home/wzab/uhal/uhal_2_4_0/cactuscore/controlhub'
/home/wzab/uhal/uhal_2_4_0/cactuscore/controlhub/erlang/bin/escript ./rebar get-deps compile
Uncaught error in rebar_core: {'EXIT',
                               {undef,
                                [{crypto,start,[],[]},
                                 {rebar,run_aux,2,[]},
                                 {rebar,main,1,[]},
                                 {escript,run,2,
                                  [{file,""escript.erl""},{line,747}]},
                                 {escript,start,1,
                                  [{file,""escript.erl""},{line,277}]},
                make  -C cactuscore/controlhub 
OS Detected: ""unknown.os""
make[1]: Entering directory `/home/wzab/uhal/uhal_2_4_0/cactuscore/controlhub'
/home/wzab/uhal/uhal_2_4_0/cactuscore/controlhub/erlang/bin/escript ./rebar get-deps compile
Uncaught error in rebar_core: {'EXIT',
                               {undef,
                                [{crypto,start,[],[]},
                                 {rebar,run_aux,2,[]},
                                 {rebar,main,1,[]},
                                 {escript,run,2,
                                  [{file,""escript.erl""},{line,747}]},
                                 {escript,start,1,
                                  [{file,""escript.erl""},{line,277}]},
                                 {init,start_it,1,[]},
                                 {init,start_em,1,[]}]}}
make[1]: *** [_all] Error 1
make[1]: Leaving directory `/home/wzab/uhal/uhal_2_4_0/cactuscore/controlhub'
make: *** [cactuscore/controlhub/.virtual.Makefile] Error 2
                 {init,start_it,1,[]},
                                 {init,start_em,1,[]}]}}
make[1]: *** [_all] Error 1
make[1]: Leaving directory `/home/wzab/uhal/uhal_2_4_0/cactuscore/controlhub'
make: *** [cactuscore/controlhub/.virtual.Makefile] Error 2
}}}
With best regards, Wojtek
",support,closed,minor,,uhal,ipbus sw 2.4,fixed,,
