﻿id,summary,reporter,owner,description,type,status,priority,milestone,component,version,resolution,keywords,cc
1322,Moving trunk to Vivado 2015.2,newbold,newbold,"Due to non-backward-compatible changes to IP core interfaces, this will break compatibility with 2014.4 and previous Vivado versions. Thanks, Xilinx.
",enhancement,new,major,mp7fw - FUTURE,mp7 firmware,,,,
