﻿id,summary,reporter,owner,description,type,status,priority,milestone,component,version,resolution,keywords,cc
193,GT/GMT: Migration from CVS to SVN,marc,cghabrou,"Dear Carlos and Bernhard,

I have performed the initial steps for the migration of the GT and GMT code to SVN. This is migration of the history and adaptation of the Makefiles.

The snapshot is from 2013.02.26

In order to check out the CSCTF code you have to:
{{{
 svn co svn+ssh://svn.cern.ch/reps/cactus/trunk/cactusprojects
}}}

Now, I would need that you provide some information and perform some tasks:

0) This task only involves the ""legacy"" code. We need to discuss the repo structure for the upgrade.

1) Stop using Savannah and start using this ticket system. I have created the gt/gmt component in the tracking system with the following responsibles: rahbaran, arnold, cghabrou,mjeitler,hbergaue, imikulec.

Notice that I didn't include Dyniar or Joshka in that list. I consider them part of the uGMT team but not liable for the maintenance of the legacy GMT code. If you think otherwise, let me know.

2) Install and test the GT and GMT online code from SVN in Vienna and .cern.ch test benches

2) Install and test the GT and GMT online code from SVN at 904

3) Install and test the GT and GMT online code from SVN at P5

4) Move the gtts setup to XaaS. You can see the l1test example at https://svnweb.cern.ch/trac/cmsos/browser/branches/l1_xaas/slim/l1test

This task will be closed once the above issues are done.

 Cheers,
 marc

 PS: CC to the relevant CSCTF members.
",defect,closed,major,GT/GMT v1.0.6,gt/gmt,nightly build,fixed,,dyniar hsakulin imikulec hbergaue rahbaran arnold cghabrou mjeitler ghete
