﻿id,summary,reporter,owner,description,type,status,priority,milestone,component,version,resolution,keywords,cc
1087,l1ts-central and l1page machines power status cannot be controlled via ipmi,thea,cghabrou clazarid thea,"Major issue in case the pc shuts down. The trigger online experts don't have the means to reboot the 2 machines neither via network nor manually, as they are installed in the cDAQ room.

To be fixed ASAP

-a",defect,closed,critical,,unknown,,fixed,,
