﻿id,summary,reporter,owner,description,type,status,priority,milestone,component,version,resolution,keywords,cc
218,SegFault in,hwolfe,carlo,"There was a segfault in 6_2, which was sidestepped by S. Dutta commenting out all the L1T workflows.  I tried to debug it as described below, but in the end just removed the offending sequence, because It was never used for monitoring.

See https://savannah.cern.ch/task/?40402

When running the matrix WF 4.24, a seg fault occurs which starts here: http://cmslxr.fnal.gov/lxr/source/L1TriggerConfig/DTTPGConfig/src/DTConfigManager.cc#232

This file has not changed since 2010.

This section code executes successfully on the first run of the WF, and then after endRun, and beginRun, then my_btimap.size()==0 and the first assignment call causes the segfault.

What happens is the first key value to my_btimap[chambid] gets resolved, leading to a template call to DetId::operator<(DetId), in which *this is somehow corrupt. I've checked and the address of my_btimap does not change over the two runs. I checked by attempting to insert a well-formed, dummy std::pair. This causes the same crash, but only after endRun/beginRun is called. 

With tagset 130352, I've removed only l1EmulatorDttpgQualityTests, by commenting out the relevant lines to 

DQM/L1TMonitorClient/python/L1EmulatorQualityTests_cff.py
DQMOffline/L1Trigger/python/L1EmulatorQualityTestsOffline_cff.py

and removing the commented-out line in 

DQMOffline/Configuration/python/DQMOffline_cff.py

Where all of l1dqm was removed from the workflow.  I opened this ticket because the cause of the segfault should still be determined.",defect,closed,major,,dttf,,invalid,,carlo
