﻿id,summary,reporter,owner,description,type,status,priority,milestone,component,version,resolution,keywords,cc
1606,Implement SWATCH object dynamic disabling and masking,thea,thea,"SWATCH Systems need to disable processors/amc13s and apply additional masks based on the FEDMap.
This requires adding new logic that can disable/mask objects taking into account the FEDMap content.

The dynamic masking code will be developed independently from the current masking logic in `SyatemStateMachine::enable/reset` and reintegrated at a later stage.

Available methods:
 * `GateKeeper::isEnabled`
 * `MaskableObject::setMask`
 * `ActionableObject::resetAndApplyMasks`
   * which in turn uses `GateKeeper::getMask`

Missing
 * `ActionableObject::enable/disable`

Possible disabling/masking sequence
 1. Reset mask and enable flags.
 1. Disable processors/amc13 from gatekeeper.
 1. Disable amc13s based on FEDMap
 1. Disable processors in crates with disabled AMC13s
 1. Mask amc13 ports corresponding to disabled processors/empty slots
 1. Apply gatekeeper masks
 1. Mask rx ports of internal links where the transmitting processor is disabled
 1. Mask external rx ports connected to systems disabled according to FEDMap",enhancement,closed,major,SWATCH suite v0.5,swatch,,fixed,,
