﻿id,summary,reporter,owner,description,type,status,priority,milestone,component,version,resolution,keywords,cc
277,cactus nightly tests fail for TTC applications,hartl,hartl,"See

http://cactus.web.cern.ch/cactus/nightly/Linux-2.6.18-308.16.1.el5-x86_64-with-redhat-5.9-Boron/nightly.log.html#log_38494

and

http://cactus.web.cern.ch/cactus/nightly/Linux-2.6.18-308.16.1.el5-x86_64-with-redhat-5.9-Boron/logs/
.

From the nighly test log:

{{{
 TEST FAILED, 0b TTCmi Cell Configuration, failed after 0.282589 sec
 TEST FAILED, 1b TTCmi BOBR ParameterSetGet, failed after 0.003788 sec
 TEST FAILED, 1c TTCmi RFRXD Configuration, failed after 0.010396 sec
 TEST FAILED, 1d TTCmi RFRXD ParameterSetGet, failed after 0.003426 sec
 TEST FAILED, 1e TTCmi RF2TTC Configuration, failed after 0.025934 sec
 TEST FAILED, 1f TTCmi RF2TTC ParameterSetGet, failed after 0.003784 sec
 TEST FAILED, 2a TTCci Cell Configuration, failed after 1.412232 sec
 TEST FAILED, 3a TTCci Configuration, failed after 0.011426 sec
 TEST FAILED, 3b TTCci ParameterSetGet, failed after 0.003632 sec
 TEST FAILED, 3c TTCci UserCommand, failed after 0.002422 sec
 TEST FAILED, 3d TTCci UserCommandExecuteSequenceImplicit, failed after 0.007813 sec
 TEST FAILED, 3e TTCci UserCommandExecuteSequence, failed after 0.008254 sec
 TEST FAILED, 3f TTCci UserCommandOldStyle, failed after 0.002307 sec
 TEST FAILED, 3g TTCci UserCommandOldStyleExecuteSequenceImplicit, failed after 0.007466 sec
 TEST FAILED, 3h TTCci UserCommandOldStyleExecuteSequence, failed after 0.007605 sec
 TEST FAILED, 3i TTCci ExecuteSequence, failed after 0.008238 sec
 TEST FAILED, 3j TTCci UserSequence, failed after 0.002321 sec
 TEST FAILED, 4a LTC Configuration, failed after 0.011544 sec
 TEST FAILED, 4b LTC ParameterSetGet, failed after 0.003649 sec
 TEST FAILED, 4c LTC Commands, failed after 0.002442 sec
}}}
",task,closed,minor,,ttc,nightly build,fixed,"L1 setup, TTC applications",marc
