﻿id,summary,reporter,owner,description,type,status,priority,milestone,component,version,resolution,keywords,cc
1353,"SWATCH cell, generic monitoring panels : First user-friendly improvements",tsw,tsw,"Joschka has made some nice improvements to the monitoring ""processors"" sub-panel, which will be included in the trunk.

Also, we should maybe have another sub-panel that displays all child metrics and stub info for any individual processor, processor sub-composnent, or daqttcmanager. 

Finally, I'm sure there'll be more thoughts over the next few weeks ...

",enhancement,closed,major,SWATCH suite v0.2,swatch,,fixed,,
