﻿id,summary,reporter,owner,description,type,status,priority,milestone,component,version,resolution,keywords,cc
1112,Central cell rules & Stage1,thea,cghabrou clazarid thea,"Hi Christos,

I have a couple of Stage1 related requests

- Can you update the Central Cell ttc map and rules in trunk with the ones used by the Central Cell now? I've updated them yesterday

- Yesterday before leaving the Control Room, I enabled the Stage1 FED in the L0, to test whether the Central Cell would send Configure to the Stage1 Cell.
Unfortunately not, the Configure command failed with...
{{{
S1CALOL2 *MUST* be in the TSC_KEY when enabled in the DAQ! (remove S1CALOL2 from the DAQ if you want to run without)
}}}

",defect,closed,major,,central,,fixed,,
