﻿id,summary,reporter,owner,description,type,status,priority,milestone,component,version,resolution,keywords,cc
233,New IPbus Software Suite v2.0 exceptions,chhill,tsw,"Hello uHAL team,

I have installed the new IPbus suite, following the instructions here:  

https://svnweb.cern.ch/trac/cactus/wiki/uhalQuickTutorial#HowtoInstalltheIPbusSuite

After finishing the installation, I found that in order to recompile my C++ code (using the same old ""uhal.hpp"" header file), I needed to change the scope of my uHAL excetptions from 

{{{ 
uhal::exception --> uhal::exception::exception 
}}}

I made this correction based on what I found in the Doxygen API.

After making this change, I was indeed able to compile my code.  However, I no longer get uHAL exceptions upon a failed IPbus transaction, but instead I get the following std::exception:

{{{
terminate called after throwing an instance of 'std::exception'
   what():  St9exception
}}}

Can you help me understand what is happening here?

Thanks for your time, as always!
Charlie",defect,closed,minor,IPbus software - FUTURE releases,uhal,ipbus sw 2.0,fixed,,
