﻿id,summary,reporter,owner,description,type,status,priority,milestone,component,version,resolution,keywords,cc
2157,New tag (v1_2_1) of AMC13 rpms need to be added to the repo,darcaro,,"A new tag for the AMC13 software was added.

The corresponding rpms are located here:

http://ohm.bu.edu/~djarcaro/AMC13_rpms/cactusboards-amc13-amc13-1.2.1-0.unknown.os.x86_64.rpm

http://ohm.bu.edu/~djarcaro/AMC13_rpms/cactusboards-amc13-python-1.2.1-0.unknown.os.python2.7.x86_64.rpm

http://ohm.bu.edu/~djarcaro/AMC13_rpms/cactusboards-amc13-python-debuginfo-1.2.1-0.unknown.os.python2.7.x86_64.rpm

http://ohm.bu.edu/~djarcaro/AMC13_rpms/cactusboards-amc13-tools-1.2.1-0.unknown.os.x86_64.rpm",task,closed,minor,,amc13,,fixed,rpms,djarcaro@… dgastler@…
