﻿id,summary,reporter,owner,description,type,status,priority,milestone,component,version,resolution,keywords,cc
1987,Autorefresh widget not appearing in commands,clazarid,clazarid,"Due to the lazy loading mechanism the autorefresh widget on commands does not appear unless it's loaded first explicitly from a panel.

The addition of the import explicitly in the command .html code fixes this.",defect,closed,minor,Trigger Supervisor 3.6.0,triggersupervisor,,fixed,,
