﻿id,summary,reporter,owner,description,type,status,priority,milestone,component,version,resolution,keywords,cc
706,Request for additional uHAL debugging information on error,newbold,tsw arose cghabrou clazarid thea harder,"Error messages like this (below) are useful, but would be infinitely more useful if the address of the target in play could also be printed out...

10-08-14 21:24:49.278213 [7faa0f7e7700] ERROR - Returned Header, 0x20810046 ( transaction id = 0x00000081, transaction type = 0x00, word count = 0 ) had response field = 0x06 indicating an error (1 bytes into IPbus reply payload)
",defect,closed,minor,IPbus software - v2.4.0 release,uhal,ipbus sw 2.3,fixed,,
