﻿id,summary,reporter,owner,description,type,status,priority,milestone,component,version,resolution,keywords,cc
293,uhal: test_block.cxx shows deadlock,marc,arose,"While using the control hub on IPbus 1.3. I have noticed that the test_dummy.exe causes a deadlock. 

Command:
{{{
/opt/cactus/bin/uhal/tests/test_dummy_block.exe -c file:///opt/cactus/etc/uhal/tests/dummy_connections.xml -d dummy.udp
}}}

Back trace 
{{{
Thread 2 (Thread 0x2ab784d5b940 (LWP 22534)):
#0  0x00000036c02d5378 in epoll_wait () from /lib64/libc.so.6
#1  0x00002ab78081f763 in boost::asio::detail::epoll_reactor::run (this=0xe3c5f0, block=true, ops=...)
    at /build/cactus/trunk/cactuscore/uhal/uhal/../../../cactuscore/extern/boost/RPMBUILD/SOURCES/include/boost/asio/detail/impl/epoll_reactor.ipp:397
#2  0x00002ab78081fa28 in boost::asio::detail::task_io_service::do_run_one (this=0xe574e0, lock=..., this_thread=..., 
    private_op_queue=..., ec=...)
    at /build/cactus/trunk/cactuscore/uhal/uhal/../../../cactuscore/extern/boost/RPMBUILD/SOURCES/include/boost/asio/detail/impl/task_io_service.ipp:350
#3  0x00002ab78081fd38 in boost::asio::detail::task_io_service::run (this=0xe574e0, ec=...)
    at /build/cactus/trunk/cactuscore/uhal/uhal/../../../cactuscore/extern/boost/RPMBUILD/SOURCES/include/boost/asio/detail/impl/task_io_service.ipp:146
#4  0x00002ab78081fe30 in boost::asio::io_service::run (this=0xe57020)
    at /build/cactus/trunk/cactuscore/uhal/uhal/../../../cactuscore/extern/boost/RPMBUILD/SOURCES/include/boost/asio/impl/io_service.ipp:59
#5  0x00002ab7807ea746 in boost::_mfi::mf0<unsigned long, boost::asio::io_service>::operator() (this=0xe50fc8, 
    p=0xe57020)
    at /build/cactus/trunk/cactuscore/uhal/uhal/../../../cactuscore/extern/boost/RPMBUILD/SOURCES/include/boost/bind/mem_fn_template.hpp:49
#6  0x00002ab7807eac62 in boost::_bi::list1<boost::_bi::value<boost::asio::io_service*> >::operator()<unsigned long, boost::_mfi::mf0<unsigned long, boost::asio::io_service>, boost::_bi::list0> (this=0xe50fd8, f=..., a=...)
    at /build/cactus/trunk/cactuscore/uhal/uhal/../../../cactuscore/extern/boost/RPMBUILD/SOURCES/include/boost/bind/bind.hpp:243
#7  0x00002ab7807eaca0 in boost::_bi::bind_t<unsigned long, boost::_mfi::mf0<unsigned long, boost::asio::io_service>, boost::_bi::list1<boost::_bi::value<boost::asio::io_service*> > >::operator() (this=0xe50fc8)
    at /build/cactus/trunk/cactuscore/uhal/uhal/../../../cactuscore/extern/boost/RPMBUILD/SOURCES/include/boost/bind/bind_template.hpp:20
#8  0x00002ab7807eacbe in boost::detail::thread_data<boost::_bi::bind_t<unsigned long, boost::_mfi::mf0<unsigned long, boost::asio::io_service>, boost::_bi::list1<boost::_bi::value<boost::asio::io_service*> > > >::run (this=0xe50e40)
    at /build/cactus/trunk/cactuscore/uhal/uhal/../../../cactuscore/extern/boost/RPMBUILD/SOURCES/include/boost/thread/detail/thread.hpp:61
#9  0x00002ab77f0fcd34 in thread_proxy () from /opt/cactus/lib/libboost_thread.so.1.48.0
#10 0x00000036c120683d in start_thread () from /lib64/libpthread.so.0
---Type <return> to continue, or q <return> to quit---
#11 0x00000036c02d4f8d in clone () from /lib64/libc.so.6

Thread 1 (Thread 0x2ab780d48030 (LWP 22530)):
#0  0x00002ab7807c73a0 in std::_Deque_iterator<uhal::Buffers*, uhal::Buffers*&, uhal::Buffers**>::operator* ()
   from /opt/cactus/lib/libcactus_uhal_uhal.so
#1  0x00002ab7807eae3e in std::deque<uhal::Buffers*, std::allocator<uhal::Buffers*> >::front (this=0xe56f10)
    at /usr/lib/gcc/x86_64-redhat-linux/4.1.2/../../../../include/c++/4.1.2/bits/stl_deque.h:970
#2  0x00002ab780826ac0 in uhal::ClientInterface::NextFillingBuffer (this=0xe56e70) at src/common/ClientInterface.cpp:279
#3  0x00002ab780826c05 in uhal::ClientInterface::unflushedDispatch (this=0xe56e70) at src/common/ClientInterface.cpp:171
#4  0x00002ab7808883af in uhal::IPbusCore::checkBufferSpace (this=0xe56e70, aRequestedSendSize=@0x7fffc1baf6c0, 
    aRequestedReplySize=@0x7fffc1baf67c, aAvailableSendSize=@0x7fffc1baf678, aAvailableReplySize=@0x7fffc1baf674)
    at src/common/ProtocolIPbusCore.cpp:483
#5  0x00002ab7808896c1 in uhal::IPbusCore::implementWriteBlock (this=0xe56e70, aAddr=@0xe3b4dc, 
    aSource=std::vector of length 26214400, capacity 26214400 = {...}, aMode=@0xe3b4e8)
    at src/common/ProtocolIPbusCore.cpp:282
#6  0x00002ab7808256a3 in uhal::ClientInterface::writeBlock (this=0xe56e70, aAddr=@0xe3b4dc, 
    aSource=std::vector of length 26214400, capacity 26214400 = {...}, aMode=@0xe3b4e8)
    at src/common/ClientInterface.cpp:357
#7  0x00002ab7808561ed in uhal::Node::writeBlock (this=0xe3b4c0, 
    aValues=std::vector of length 26214400, capacity 26214400 = {...}) at src/common/Node.cpp:439
#8  0x0000000000415125 in block_write_read(unsigned long, std::basic_string<char, std::char_traits<char>, std::allocator<char> > const&, std::basic_string<char, std::char_traits<char>, std::allocator<char> > const&) ()
#9  0x0000000000416cf9 in main ()

}}}

Cheers,
marc

PS: while checking the issue, I have also cleaned a bit the test_dummy_block.cxx example.
",defect,closed,major,IPbus software: v2.1.0 release,uhal,nightly build,fixed,,tsw
