﻿id,summary,reporter,owner,description,type,status,priority,milestone,component,version,resolution,keywords,cc
2319,Sort algos in dialog by index (PreviewPanel),garadi,arnold garadi,"The dialog window displaying the customized set of prescales (preview prescaling on the fly) should be sorted by index instead of name.
Additionally, the algo index should be added to the description field displayed.",enhancement,closed,minor,ugt v0.17.X,ugt,,fixed,,hephy-cms-trigger@…
