﻿id,summary,reporter,owner,description,type,status,priority,milestone,component,version,resolution,keywords,cc
1904,uGT custom panel for prescale change,tmatsush,garadi,"Prepare a custom panel for prescale change:
1) display currently available prescale column index and its value for each algorithm bit
2) add button to select and apply prescales corresponding to a prescale column index

This ticket supersedes #1749

Polymer instruction at
http://cactus.web.cern.ch/cactus/tsdocs/

Example to retrieve masks/prescales from Gatekeeper at;
https://svnweb.cern.ch/trac/cactus/browser/trunk/cactusprojects/ugt/ts/cell/src/common/Cell.cc#L233

Example to loop over uGT boards in a crate at;
https://svnweb.cern.ch/trac/cactus/browser/trunk/cactusprojects/ugt/ts/cell/src/common/Cell.cc?rev=44871#L188",enhancement,closed,major,,ugt,,fixed,uGT prescale,hephy-cms-trigger@…
