﻿id,summary,reporter,owner,description,type,status,priority,milestone,component,version,resolution,keywords,cc
1062,DTSC and DTTF in the process controller,gcodispo,cghabrou,"Dear colleagues,

I write this to suggest a re-organization of the Process Controller for DTSC and DTTF.
As you know, the DTSC-OptoRx workers run in the same pc as the DTTF-WedgeCrate cells and they are also configured through them.
So they DTSC-OptoRx and DTTF-WedgeCrate are logically bounded and every time there is a problem in one of the two the other is affected.
However the Process Controller restarts the OptoRx with the DTSC and not with the DTTF.
To give you an example: if there is a problem in a DTTF pc, the DTSC is red and the shifter tries continuously to restart it without success, so many times leaves both DTSC and DTTF not running. It happened at least twice in the last month.
In general this situation is making a lot of confusion in the online crew operations and in the offline debugging of problems.

Provided that the OptoRx development and fixes are DT responsibility, I would suggest the following:
- move the OptoRx under DTTF just for the sake of the process controller

What do you think?

Cheers,

Giuseppe",defect,closed,major,l1page 1.9.14,l1page,,fixed,,jorge.troconiz@… dermot.anthony.moran@…
