﻿id,summary,reporter,owner,description,type,status,priority,milestone,component,version,resolution,keywords,cc
240,IPbus 2.0 problems with parsing XML files,jmans,marc tsw arose cghabrou,"IPbus 2.0 is miscalculating addresses from the attached table.  This gives collisions which should not exist, but may also be assigning items to random addresses -- the behavior does not appear to be well defined.  This a blocker for HCAL to proceed with the switch IPbus 2.0 for our online software.

",defect,closed,critical,IPbus suite v2.0.2 release,uhal,ipbus sw 2.0,fixed,,
