﻿id,summary,reporter,owner,description,type,status,priority,milestone,component,version,resolution,keywords,cc
2269,SWATCH: improve top Makefile support for parallelism,thea,thea,"By splitting compilation from linking in sub-packages:
 1. introduce an intermediate package target, `objects` that builds intermediate objects only
 1. introduce inter-package dependencies at the linking stage

",enhancement,closed,minor,SWATCH suite v1.0.0,swatch,,fixed,,
