﻿id,summary,reporter,owner,description,type,status,priority,milestone,component,version,resolution,keywords,cc
2364,Error when building example MP7 with 2.4.1 fw,giles,newbold giles arose thea harder,"I was just trying to build uGMT with mp7fw 2.4.1 and ipbb (unsupported, I know). Doing that I got the following error: 

ERROR: [Vivado 12-4739] set_false_path:No valid object(s) found for '-to [get_pins {datapath/rgen[*].region/mgt_gen_gth_10g.quad/quad/gth_stdlat.quad_wrapper_inst/gth_quad_i/g_gt_instances[*].gth_transceiver_i/gthe2_i/TXELECIDLE}]'. [/afs/cern.ch/user/d/dinyar/workspace/uGMTfirmware/build/ugmt/src/cactusupgrades/components/mp7_links/firmware/ucf/mp7_links.tcl:1]

I checked in the repo and this tcl file was introduced for the std_latency buffers if I understand correctly. Would it be possible to somehow exclude it when building for the low latency links?",defect,closed,minor,mp7fw - v2.4.x releases,mp7 firmware,,fixed,2.4.1 mp7,
