﻿id,summary,reporter,owner,description,type,status,priority,milestone,component,version,resolution,keywords,cc
1431,CCU errors causing the RPC LB workers to crash,kbunkow,kbunkow,"The reason of the the crashes of the LB workers is the not handled CCU errors in the FecManagerImpl::StdLinkBoxAccessImpl::piaWrite:
 
{{{
#6 0x00000033ffe10323 in ?? () from /lib64/libgcc_s.so.1 
#7 0x00000033ffe103f7 in _Unwind_Resume () from /lib64/libgcc_s.so.1 
#8 0x00007fcae3ad6fdb in rpct::FecManagerImpl::StdLinkBoxAccessImpl::memoryWrite (this=, address=, data=) at /nfshome0/rpcpro/TriDAS/rpct/lboxAccess/src/common/FecManagerImpl.cc:626 
#9 0x00007fcae3ad6452 in rpct::FecManagerImpl::StdLinkBoxAccessImpl::piaWrite (this=0x14f1310, channel=1, value=199 '\307') at /nfshome0/rpcpro/TriDAS/rpct/lboxAccess/src/common/FecManagerImpl.cc:1406 
#10 0x00007fcae480de47 in rpct::HalfBox::finaliseAccess (this=0x14f1a80) at /nfshome0/rpcpro/TriDAS/rpct/devices/src/common/LinkBox.cpp:109 
#11 0x00007fcae480e919 in rpct::HalfBox::monitor (this=0x14f1a80, stop=0x12890a9) at /nfshome0/rpcpro/TriDAS/rpct/devices/src/common/LinkBox.cpp:155 
#12 0x00007fcb14444964 in rpct::MonitorablesWidget::monitorHardware (this=0x1288070, stop=0x12890a9) at /nfshome0/rpcpro/TriDAS/trigger/rpct/ts/xworker/src/common/panels/MonitorablesWidget.cc:549 
#13 0x00007fcb144409d3 in rpcttspanels::HistogramsWidget::histoMonitorJob (this=0x1288f80, wl=) at /nfshome0/rpcpro/TriDAS/trigger/rpct/ts/xworker/src/common/panels/HistogramsWidget.cc:151 
#14 0x00007fcb1d83b0f2 in toolbox::task::WaitingWorkLoop::process() () from /opt/xdaq/lib/libtoolbox.so 
#15 0x00007fcb1d83731a in toolbox::task::WorkLoop::run() () from /opt/xdaq/lib/libtoolbox.so 
#16 0x00007fcb1d837757 in toolbox::task::thread_func(void*) () from /opt/xdaq/lib/libtoolbox.so 
#17 0x00000033fe607851 in start_thread () from /lib64/libpthread.so.0 
#18 0x00000033fe2e890d in clone () from /lib64/libc.so.6 

}}}
I added the FEC reset in this function.
A wired thing is that the CCUExceptions were not caught in the HistogramsWidget::histoMonitorJob, even thought the std::exception is caught there. Therefore I added additional catch (rpct::CCUException& e) and catch (...)",defect,new,major,,rpc,,,LB worker,
