﻿id,summary,reporter,owner,description,type,status,priority,milestone,component,version,resolution,keywords,cc
1805,Improve logging capability of MP7 channel commands,thea,thea,"MP7 Commands acting on channels don't have access to the list of `Port` objects they act upon, only the the list of hardware channels.
In terms of logging and error reporting the `Port` id is the most useful information.

In order to circumvent the problem, a new class will be introduced,  a wrapper to `ChannelManager` which holds the obj id to hardware id map.",defect,closed,minor,SWATCH suite v0.8.0,swatch,,fixed,,
