﻿id,summary,reporter,owner,description,type,status,priority,milestone,component,version,resolution,keywords,cc
617,GT/GMT: release compatible with uHAL 2.3,cghabrou,cghabrou,"I have built another version of GT/GMT for SLC5 (and will also for SLC6) compatible with uHAL 2.3, reason being uHAL 2.3 introduced a new version of the boost libraries, which are used by GT/GMT. 

This version has already been deployed @904 (SLC5), but I will wait to deploy it @P5 (SLC6) until the GT/GMT PCs have been replaced by the new ones. ",task,closed,minor,GT/GMT v1.0.9,gt/gmt,,fixed,,thea clazarid
