﻿id,summary,reporter,owner,description,type,status,priority,milestone,component,version,resolution,keywords,cc
1517,Level-1 trigger menu based monitoring of uGT,tmatsush,tmatsush,"Mask/prescale/rate monitoring of uGT has been updated to use menu information stored in an xml file.

As discussed previously with Tom, each 'algorithm' (uGtTriggerAlgorithmMonitor) pulls information from 'menu' (uGtTriggerMenu).  [was 'menu' pushing information to 'algorithm']

'menu':: retrieveMetricValues() should be called before 'algorithm'::retrieveMetricValues() to get consistent monitoring information.",task,closed,major,,ugt,,fixed,,tsw thea jwittman bernhard garadi hbergaue
