﻿id,summary,reporter,owner,description,type,status,priority,milestone,component,version,resolution,keywords,cc
1973,SWATCH cell : Add the creation timestamp & source for the current gatekeeper & system,tsw,tsw,"As it says in title; this will correspond to four new methods in `CellContext`:
 * `const TimePoint_t& getGateKeeperCreationTime() const`
 * `const TimePoint_t& getSystemCreationTime() const`
 * `const std::string& getGateKeeperSource() const`
 * `const std::string& getSystemSource() const`
where `CellContext::TimePoint_t` will be the typedef:
{{{
typedef boost::chrono::system_clock::time_point TimePoint_t
}}}

This new information will be useful both to display in the ""SWATCH setup"" panel, and in order to check if the gatekeeper/system has been re-created since the last time some logic was run",enhancement,closed,minor,SWATCH suite v0.9.1,swatch,,fixed,,
