﻿id,summary,reporter,owner,description,type,status,priority,milestone,component,version,resolution,keywords,cc
67,uHAL packetisation/chunking is ~3 times too small,frazier,arose,"Hi Andy,

From running tests, it seems that uHAL is not making best use of available UDP round-trip bandwidth.  This is adversely affecting the performance.

Currently, when I send, say, a 340 deep block read, I see three request packets emerge when I'd expect a single packet to suffice.  The request packets I see are:

 1. BlockRead (size 118)
 1. BlockRead (size 118)
 1. BlockRead (size 104)

You can safely increase the minimum read ""chunk"" to at least 355 in size, without risk of going over max UDP packet size.  The maximum IPbus payload you can fit in a UDP packet is 368 words (1472 Bytes).  With an 8 byte UDP header, and a 20 Byte IP header, that brings you up to the 1500 standard-frame payload limit.

This change should triple the bandwidth performance numbers, which would be very welcome given my uHAL application for the pixel test beam :-D

Cheers,

Rob

",enhancement,closed,minor,IPbus 1.3 suite,uhal,,fixed,,
