﻿id,summary,reporter,owner,description,type,status,priority,milestone,component,version,resolution,keywords,cc
656,Access ritghts for user mmisiura,kbunkow,cghabrou clazarid thea,"Dears
Could you please grant the commit rights to the Cactus repository for the user mmisiura (RPC PAC Trigger software developer).

Regards

Karol

",support,closed,minor,,unknown,,fixed,,thea clazarid mmisiura
