﻿id,summary,reporter,owner,description,type,status,priority,milestone,component,version,resolution,keywords,cc
1212,gt-test-cell :  XMLHttpTransport Error / SOAP InfoSpace exception / after migration (?),arnold,cghabrou,"So at the end it seems that the GT TestCell has some problem related to the ITF test execution panel, probably at retrieving the list of available test. When klicking on the ITExecution panel link, the service quits, yellow banner:
{{{
Error Trying to communicate with resource /urn:xdaq-application:lid=13/Default?_sessionid_=0x7fc09c06e3f0&_eventType_=OnClick&_id_=tsgui_tree_panel_ITExecution&tsgui_tree_panel_ITExecution=ITExecution

XMLHttpTransport Error: 0 
}}}
gtgmt-test-cell.log:
{{{
27 May 2015 16:20:28.974 [140466107025472] ERROR l1ts904.cms904.l1ts-gt.p:3838 <> - Parameter set failed: Caught exception: xdaq::exception::ParameterSetFailed 'set default values failed' raised at setDefaultValues(/usr/local/src/xdaq/baseline12/daq/xdaq/src/common/Application.cc:101);
	originated by xdata::exception::Exception 'Infospace member 'settings' not found in imported tag <properties>' raised at import(/usr/local/src/xdaq/baseline12/daq/xdata/src/common/soap/InfoSpaceSerializer.cc:144)

}}}
Seems to occur the same way at 904 and Vienna lab since migration to TS 2.0.0 (?). Any ideas?

cheers,
Bernhard",defect,closed,minor,,gt/gmt,,wontfix,,tmatsush cghabrou clazarid thea jeitler
