﻿id,summary,reporter,owner,description,type,status,priority,milestone,component,version,resolution,keywords,cc
1020,L1-TME: importing a correlation condition from OMDS crashes TME,ghete,tmatsush,"When I try to import a correlation condition from database, TME is crashing.

How to reproduce:

- start TME

- create a new menu (e.g. with latest scales L1T_Scales_20141121)

- load DB

- import condition e.g. Corr_CenJet_ForJet_0x09_NWdPhi6

TME crashes.

Not dependent of the chip to import condition, not dependent of the objects in the correlation condition..

Vasile",defect,closed,major,,L1 TME,,fixed,,wulz mjeitler ghete rahbaran
