﻿id,summary,reporter,owner,description,type,status,priority,milestone,component,version,resolution,keywords,cc
1519,SWATCH : xdata Serialiser for parameters in XML gatekeeper,tsw,kreczko,"Currently:
 * In the XML configuration files, one can specify parameters of the following types:
   * `xdata::Integer`
   * `xdata::UnsignedInteger`
   * `xdata::Boolean`
   * `xdata::Float`
   * `xdata::String`
 * The `XMLGateKeeper`  uses the pure virtual `xdata::Serialisable::fromString` method in order to set the values of parameters

We want to add the ability to specify look up tables - e.g. vectors of unsigned integers, and maybe 2-D collections (maybe `xdata::Table`s). However, `fromString` isn't implemented for `xdata::Vector` types, and the format expected by the `xdata::Table::fromString` method might not be optimal for our use case.

So, the implementation of `XmlGateKeeper::CreateParameter(pugi::xml_node& aEntry)` should be updated to use a custom `xdata::Serializer`, following a similar pattern as is used by XDAQ for serialiation of xdata to/from SOAP and binary formats. Unfortunately I'm not aware of any easy ""how to guide"" on how to implement a custom serialiser, but the known examples can be found at:
 * SOAP: https://svnweb.cern.ch/trac/cmsos/browser/trunk/daq/xdata/include/xdata/soap/Serializer.h
 * Binary: https://svnweb.cern.ch/trac/cmsos/browser/trunk/daq/xdata/include/xdata/exdr/Serializer.h

Essentially, in this ticket, we need to:
 * Create a class (maybe `swatch::core::XMLSerializer`) that inherits from `xdata::Serializer`
 * Define a `XMLSerializer` method that returns a heap-allocated serialisable when given a pugi xml node, e.g:
   * `const xdata::Serializable* xdata::Serializer::import(const pugi_xml::node&)`
 * For each output data type (i.e. integer, unsigned, bool, float, string), define a separate class that inherits from `xdata::ObjectSerializer`
   * Interpretation of the pugi xml node for each separate data type will be delegated to a method of the corresponding `ObjectSerializer`-derived class (e.g. as is done in the `xdata::soap::Serializer::import` method)
 * Create a serializer class for vector of unsigned intergers, that parses the following XML tags of the following format:
{{{
<entry id=""exampleParameter"" type=""vector:uint> 5, 3, 42, 600 </entry>
}}}",enhancement,closed,minor,SWATCH suite v0.4,swatch,,fixed,,
