﻿id,summary,reporter,owner,description,type,status,priority,milestone,component,version,resolution,keywords,cc
1052,Updates in Central Cell configuration operation,clazarid,clazarid,"The configuration operation needs some updates... this ticket is to keep track of the following :

 - removal of ReTRI configuration
 - removal of MI_KEY
 - addition of FEDMap to use in TCDS configuration (FEDVector to be deprecated)
 - addition of S1CALOL2/GTTest cells ",enhancement,closed,major,Trigger Supervisor 1.14.0,triggersupervisor,,fixed,,
