﻿id,summary,reporter,owner,description,type,status,priority,milestone,component,version,resolution,keywords,cc
1302,Remove CSCTF TCDS cells from L1Page,clazarid,cghabrou,"The CSCTF TCDS cells should be removed from L1Page, they are not in use.

Interestingly, the old cells were running since April so nobody noticed :)",enhancement,closed,minor,L1Page 1.9.16,l1page,,fixed,,
