﻿id,summary,reporter,owner,description,type,status,priority,milestone,component,version,resolution,keywords,cc
704,GT/GMT: v1.0.10,cghabrou,cghabrou,"TODO: 
 * update Makefile and version.h files
 * ticket #675
 * ticket #661

",task,closed,major,GT/GMT v1.0.10,gt/gmt,TS 1.12.8,fixed,,tmatsush
