﻿id,summary,reporter,owner,description,type,status,priority,milestone,component,version,resolution,keywords,cc
1956,Addition of BMTF in nightly builds,clazarid,clazarid eparadas,"Hi Vangeli,

We started a review of the subsystem code and adding all subsystems to the central nightly builds in order to provide automated testing and RPM building as well. 

This ticket is created to monitor BMTF process and will be closed once your subsystem has been fully integrated.

The first build attempt failed because there is still a declared dependency on ITF - a library that has been deprecated but for historical reasons still available at P5:

{{{
/build/cactus/cactus/trunk/cactusprojects/bmtf/ts/cell/src/common/Cell.cc:10:35: error: ts/itf/ItGuiExecution.h: No such file or directory
}}}

To remedy this, you should remove the above include and the {{{tsitf}}} reference from the DependentLibraries section of {{{bmtf/ts/cell/Makefile}}}. Please refer the commit to this ticket so that I track when it's fixed.

cheers,
  Christos.

",enhancement,closed,minor,,bmtf,,fixed,,evangelos.paradas@…
