﻿id,summary,reporter,owner,description,type,status,priority,milestone,component,version,resolution,keywords,cc
2315,C++11/14 support for uhal,jhegeman,,"Dear cacti,

In the DAQ group we have recently started looking into switching to a compiler that is newer than the one provided in the default OS used at CMS (i.e., CC7). The main aim is to be able to support the requests for support of C++11/14 features. The compiler we are using so far is GCC 7.2.1, which is available in the CentOS software collections.

The question to you would be: have you tested newer compilers (than the stock GCC 4.8.5)? And is/will be uhal and the rest of cactus supported for C++11/14? 

Best regards,
Jeroen",support,closed,major,,uhal,,fixed,,frans.meijers@… luciano.orsini@… marc.dobson@… Dainius.Simelevicius@…
