﻿id,summary,reporter,owner,description,type,status,priority,milestone,component,version,resolution,keywords,cc
226,uhal : SLC6 / gcc4.4.7 compilation warnings (hash_map deprication,tsw,arose marc tsw,"Just posting this as ""information"" - probably no need to act on it for a long while ...

When compiling uhal in SLC6 (gcc 4.4.7), the same `hash_map` deprication message is shown for pretty much each `g++` call - e.g. for `HwInterface.o`:
{{{
In file included from /usr/lib/gcc/x86_64-redhat-linux/4.4.7/../../../../include/c++/4.4.7/ext/hash_map:60,
                 from include/uhal/Utilities.hpp:76,
                 from include/uhal/Node.hpp:46,
                 from include/uhal/HwInterface.hpp:42,
                 from src/common/HwInterface.cpp:34:
/usr/lib/gcc/x86_64-redhat-linux/4.4.7/../../../../include/c++/4.4.7/backward/backward_warning.h:28:2: warning: #warning This file includes at least one deprecated or antiquated header which may be removed without further notice at a future date. Please use a non-deprecated interface with equivalent functionality instead. For a listing of replacement headers and interfaces, consult the file backward_warning.h. To disable this warning use -Wno-deprecated.
mkdir -p {lib,obj}
}}}

Consulting the backward_warning.h file as suggested ... it says the following:
{{{
  Use:                                  Instead of:
  <sstream>, basic_stringbuf            <strstream>, strstreambuf
  <sstream>, basic_istringstream        <strstream>, istrstream
  <sstream>, basic_ostringstream        <strstream>, ostrstream
  <sstream>, basic_stringstream         <strstream>, strstream
  <unordered_set>, unordered_set        <ext/hash_set>, hash_set
  <unordered_set>, unordered_multiset   <ext/hash_set>, hash_multiset
  <unordered_map>, unordered_map        <ext/hash_map>, hash_map
  <unordered_map>, unordered_multimap   <ext/hash_map>, hash_multimap
  <functional>, bind                    <functional>, binder1st
  <functional>, bind                    <functional>, binder2nd
  <functional>, bind                    <functional>, bind1st
  <functional>, bind                    <functional>, bind2nd
  <memory>, unique_ptr                  <memory>, auto_ptr
}}}
",task,closed,minor,IPbus software: v2.1.0 release,uhal,,fixed,,
