﻿id,summary,reporter,owner,description,type,status,priority,milestone,component,version,resolution,keywords,cc
1848,Possible bug in ipbus_ported_dpram36.vhd ipbus interface.,giles,,"
Bug found when simulating ipbus interface of ipbus_ported_dpram36.vhd (write failure on single writes).   Fixed in sim, but yet to test on a card.    Odd given that the code used has been used exensively in the MP7 core firmwae, hence a bit cautious to making change to trunk.",defect,closed,minor,mp7fw 2.1.2 release,mp7 firmware,,fixed,buffers mp7,Dave.Newbold@…
