﻿id,summary,reporter,owner,description,type,status,priority,milestone,component,version,resolution,keywords,cc
1304,XDAQ general_worksuite error with CSCTF,dcurry,cghabrou clazarid thea,"HEllo,

I am attempting to install the xdaq general worksuite with the command:
sudo yum -y groupinstall general_worksuite

I get the following error:
Warning: Group general_worksuite does not exist.
No packages in any requested group available to install or update

Is there another method to perform this install?  I'm looking to install specific libraries related to jobControl, such as jobcontrol.so

Thanks,
",support,closed,minor,,unknown,,invalid,,
