﻿id,summary,reporter,owner,description,type,status,priority,milestone,component,version,resolution,keywords,cc
10,microHAL example code,marc,arose frazier,"(Tom Gorski is asking about simple C++ examples for the current microHAL release)
Hi Marc,

I a grad student at U of Wisconsin working with Prof. Smith and Tom Gorski. I have just installed microHAL on my machine and would like to start using it in our system. I am looking for some example codes doing some sort of soak-test and error logging. I was wondering if you could send me a microHAL example code.

I have already contacted Rob Frazier, but I am not sure you guys work together or not.

Thanks for your help,
Amin",support,closed,minor,,uhal,,fixed,,tgorski@… aminfar@… Dave.Newbold@…
