﻿id,summary,reporter,owner,description,type,status,priority,milestone,component,version,resolution,keywords,cc
377,l1page: l1page-1.9.4@P5 does not show the main page,marc,cghabrou,"Hi Carlos,

After the Quattor update today, the l1paged daemon stopped. I have restart the daemon, but  I'm not able to see the http://l1page.cms web page.

The RPMs installed are:
{{{
[marc@srv-C2D05-20 ~]$ rpm -qa | grep l1page
cactusprojects-l1page-webapps-1.9.4-0
cactusprojects-l1page-tomcat-1.9.4-0
}}}

Could you please take a look?

Cheers,
marc
",defect,closed,minor,L1Page 1.9.5,l1page,TS 1.12.5,fixed,,
