﻿id,summary,reporter,owner,description,type,status,priority,milestone,component,version,resolution,keywords,cc
1439,Add AMC13Manager commands and monitorable interfaces,thea,thea,"Initial shopping list
Commands
 * reboot
 * reset
 * configure TTC
 * configure DAQ
 
Monitorables
 * `TTC`: aggregating the existing TTC monitorables
 * `AMC13Link`: AMC->AMC13 backplane link status 
 * `SLink` (or DAQ): Slink express registers
 * Event builder / general monitorables: not yet defined",enhancement,closed,major,SWATCH suite v0.3,swatch,,fixed,,
