﻿id,summary,reporter,owner,description,type,status,priority,milestone,component,version,resolution,keywords,cc
1940,SWATCH Cell: Link names not displayed in the Monitoring page,batinkov,sbologna,"If you go to EMTF cell
http://l1ts-emtf.cms:3333/urn:xdaq-application:lid=13/

and then to
Control Panels -> SWATCH Monitoring -> Ports

and then you hover the mouse over the links of the following processors:
EMTF+1, EMTF+2, EMTF+3, EMTF+4, EMTF+5, EMTF+6

you won't see the port names displayed. Interestingly the port names are displayed for the rest of the processors we have.

I also check the uGMT and Calol1 page and they seems to be working. I believe the problem occurred after version 0.9 was deployed.
",defect,closed,major,SWATCH suite v0.9.1,swatch,,fixed,,madorsky batinkov
