﻿id,summary,reporter,owner,description,type,status,priority,milestone,component,version,resolution,keywords,cc
146,uhal: exception handling,marc,arose,"Hi,

While taking a look to the solution to ticket #145, I have realized that the exception handling could be improved...

For example, in the following piece of code:
{{{
116	      if ( ! mSocket->is_open() )
117	      {
118	        log ( Info() , ""Attempting to create TCP connection to '"" , ( **mEndpoint ).host_name() , ""' port "" , ( **mEndpoint ).service_name() , ""."" );
119	        mDeadlineTimer.expires_from_now ( mTcpTransportProtocol.getTimeoutPeriod() );
120	        mErrorCode = boost::asio::error::would_block;
121	        boost::asio::async_connect ( *mSocket , *mEndpoint , boost::lambda::var ( mErrorCode ) = boost::lambda::_1 );
122	
123	        do
124	        {
125	          mIOservice->run_one();
126	        }
127	        while ( mErrorCode == boost::asio::error::would_block );
128	
129	        if ( mErrorCode )
130	        {
131	          if ( mDeadlineTimer.expires_at () == boost::posix_time::pos_infin )
132	          {
133	            log ( Error() , ""ASIO reported a Timeout in TCP callback"" );
134	            ErrorInTcpCallback().throwFrom ( ThisLocation() );
135	          }
136	
137	          log ( Error() , ""ASIO reported an error: "" , mErrorCode.message() );
138	          ErrorInTcpCallback().throwFrom ( ThisLocation() );
139	        }
140	
141	        mSocket->set_option ( boost::asio::ip::tcp::no_delay ( true ) );
142	        log ( Info() , ""TCP connection succeeded"" );
143	      }
144	
}}}

1) In case of timeout it will be better to throw a Timeout exception with the string showing the current timeout

2) In the case of a different error, it would be good if the mErrorCode.message() could be read from the exception what() method. 

I think that the second issue is quite generic, and it would be good to fix.

Cheers,
marc
",enhancement,closed,minor,IPbus software: v2.1.0 release,uhal,nightly build,duplicate,,
