﻿id,summary,reporter,owner,description,type,status,priority,milestone,component,version,resolution,keywords,cc
1975,"SWATCH MP7 - Channel commands, improve error handling",thea,thea," * Report port ids of ports failing alignment
 * Simplify checks on orbit point parameters",enhancement,closed,minor,,swatch,,fixed,,
