﻿id,summary,reporter,owner,description,type,status,priority,milestone,component,version,resolution,keywords,cc
309,uhal: SLC5 and SLC6 RPMs can not be distinguished,marc,marc,"Today I have realized that the RPMs for SLC5 and SLC6 can not be distinguished.

for example:
{{{
[15:41:39][cactus@cactus-worker-6] ~/www/release/2.0/slc6_x86_64/base/RPMS> ls ~/www/release/2.0/slc6_x86_64/base/RPMS
cactuscore-controlhub-2.0.0-0.x86_64.rpm      cactuscore-uhal-pycohal-2.0.0_python2.6.6-0.x86_64.rpm
cactuscore-extern-boost-1.48.0-3.x86_64.rpm   cactuscore-uhal-tests-2.0.0-0.x86_64.rpm
cactuscore-extern-erlang-R15B01-2.x86_64.rpm  cactuscore-uhal-tools-2.0.0_python2.6-0.noarch.rpm
cactuscore-extern-pugixml-1.0-1.x86_64.rpm    cactuscore-uhal-uhal-2.0.0-0.x86_64.rpm
cactuscore-uhal-grammars-2.0.0-0.x86_64.rpm   repodata
cactuscore-uhal-log-2.0.0-0.x86_64.rpm        yumgroups.xml
[15:43:09][cactus@cactus-worker-6] ~/www/release/2.0/slc6_x86_64/base/RPMS> ls ~/www/release/2.0/slc5_x86_64/base/RPMS
cactuscore-controlhub-2.0.0-0.x86_64.rpm      cactuscore-uhal-pycohal-2.0.0_python2.4.3-0.x86_64.rpm
cactuscore-extern-boost-1.48.0-3.x86_64.rpm   cactuscore-uhal-tests-2.0.0-0.x86_64.rpm
cactuscore-extern-erlang-R15B01-2.x86_64.rpm  cactuscore-uhal-tools-2.0.0_python2.4-0.noarch.rpm
cactuscore-extern-pugixml-1.0-1.x86_64.rpm    cactuscore-uhal-uhal-2.0.0-0.x86_64.rpm
cactuscore-uhal-grammars-2.0.0-0.x86_64.rpm   repodata
cactuscore-uhal-log-2.0.0-0.x86_64.rpm        yumgroups.xml
}}}

This will likely cause a problem.

The issue has to be fixed before the next uhal release!",defect,closed,critical,IPbus software: v2.1.0 release,uhal,nightly build,fixed,,tsw
