﻿id,summary,reporter,owner,description,type,status,priority,milestone,component,version,resolution,keywords,cc
1301,RPM update for s1calol2,mguilbau,christos.lazaridis@… Alessandro.Thea@… m.guilbaud@… marcelo.vicente@…,"Hi,
Could you please update the puppet with rpm in /nfshome0/mguilbau at P5

Cheers

Maxime",task,closed,minor,Trigger Supervisor 2.1,calol2,TS 2.1,fixed,,
