﻿id,summary,reporter,owner,description,type,status,priority,milestone,component,version,resolution,keywords,cc
1825,Central Cell: Send configuration failure reports,clazarid,clazarid,"The CC should send reports to the Central SW team of configuration failures in order to keep track of possible problems.

The full CC output plus configuration parameters should be included.",enhancement,closed,minor,Trigger Supervisor 3.5.0,central,,fixed,,
