﻿id,summary,reporter,owner,description,type,status,priority,milestone,component,version,resolution,keywords,cc
995,"Move ""About"" TS panel",clazarid,eparadas,"The ""About"" control panel is quite useful mostly because it provides immediate access to the latest core dumps without need to go through the console.

The code  is located currently under ITF in the ITGuiAbout class. We should move this functionality in the framework and disentangle it completely from the ITF. ",enhancement,closed,minor,Trigger Supervisor 1.14.0,triggersupervisor,,duplicate,,
