﻿id,summary,reporter,owner,description,type,status,priority,milestone,component,version,resolution,keywords,cc
825,Add new column to table CMS_L1_HLT.L1_HLT_CONF and related views,cghabrou,cghabrou,"It was requested by HLT to add a new column to the L1_HLT_CONF table to represent the HTL SW architectures and releases. This was implemented and successfully tested in the development database some months ago, and as requested by Hannes and Sandro, in production this morning. 

Just for the record, the script I used:
{{{
-- First alter the table adding the new column
alter table
  L1_HLT_CONF
add
(
HLT_SW_ARCH varchar2(256) constraint FK_L1HLTCONF_HLTSWARCH references CMS_HLT_GDR.V_HLT_SWREL_ARCH(HLT_SW_ARCH) disable novalidate
);

-- populate the column with the default value
update
  l1_hlt_conf
set
  hlt_sw_arch = 'none none';

-- replace views

create or replace view L1_HLT_CONF_VALID_VIEW as
	select * from L1_HLT_CONF
	where
	  L1_HLT_MODE not in (select INVALID_KEY from L1_HLT_MODES_DEPR ) and
	  ID not in (select INVALID_KEY from L1_HLT_CONF_DEPR) and
	  TSC_KEY is not null and
	  GT_RS_KEY is not null and
	  HLT_KEY is not null and
	  TSC_KEY in (select TS_KEY from CMS_TRG_L1_CONF.VALID_TSCKEY) and
	  GT_RS_KEY not in (select INVALID_KEY from CMS_GT.GT_RUN_SETTINGS_DEPR) and
	  HLT_KEY not in (select INVALID_KEY from V_HLT_CONF_DEPR) and
    HLT_SW_ARCH is not null;
    
grant select on L1_HLT_CONF_VALID_VIEW to CMS_TRG_R;
grant select on L1_HLT_CONF_VALID_VIEW to CMS_RUN_MODE with grant option;




create or replace view L1_HLT_CONF_LATEST_VALID_VIEW as
	select valid.*
	from
	  (select * from L1_HLT_CONF_VALID_VIEW) valid,
      (select L1_HLT_MODE, max(CREATION_DATE) MAX_CREATION_DATE from L1_HLT_CONF_VALID_VIEW group by L1_HLT_MODE) latest
	where
	  valid.L1_HLT_MODE = latest.L1_HLT_MODE and
	  valid.CREATION_DATE = latest.MAX_CREATION_DATE
	order by
	  valid.L1_HLT_MODE;
	
	grant select on L1_HLT_CONF_LATEST_VALID_VIEW to CMS_TRG_R, CMS_WBM, CMS_WBM_R, CMS_RUNTIME_LOGGER_W, PUBLIC;
}}}


This doesn't require any change on the L1CE, just the database. 

",task,closed,minor,,l1ce,TS 1.12.8,fixed,,sandrov@… hannes.sakulin@…
