﻿id,summary,reporter,owner,description,type,status,priority,milestone,component,version,resolution,keywords,cc
2091,Set input masks for FinOR AMC502,arnold,arnold garadi,"For automated masking of unused LEMO inputs of the FinOR AMC502 module the number of used uGT modules can be fetched from the loaded L1 menu gatekeeper table.

Proposal:
 * adding {{{uGtFinorCommands.h/.cc}}}
 * adding command {{{uGtFinorInputMask}}} taking a single parameter {{{l1menu}}} and fetch number of used modules from the table, write to item

Updated address table for FinOR AMC502 will be provided.",task,closed,minor,ugt v0.8.0,ugt,,fixed,,hephy-cms-trigger@…
