﻿id,summary,reporter,owner,description,type,status,priority,milestone,component,version,resolution,keywords,cc
1319,Integration of core firmware from branch giles_mp7_v1_8_X-calol2 for tag mp7fw_v1.8.0,bundocka,bundocka,"Various bug fixes and patches in preparation for integration into v1.8.0:

- top_decl.vhd: REGION_CONF array reverted to remove undeclared variables
- Greg's orbittag fix into mp7_formatter_tdrproto.vhd  (from trunk)
- Added IP core ""multiplier9Ux10U/"" to algorithm_components (from trunk)
- ""tmt_sync: in tmt_sync_t;"" in mp7_formatter_tdrproto.vhd commented out for now (from trunk)

Branch already included before this commit (from stageOne branch):
- Timing constraint relaxed (TTC L1A -> readout control path)",task,new,minor,mp7fw - FUTURE,mp7 firmware,,,"mp7fw_v1_8_0, mp7fw, 1.8.0",
