﻿id,summary,reporter,owner,description,type,status,priority,milestone,component,version,resolution,keywords,cc
219,ControlHub : Add in multiple packets in flight functionality,tsw,tsw,"This needs to be done once the firmware has this functionality. It will involve changes to both the `device_client` and `transaction_manager` modules.

In the process, it will also be useful to consolidate the `device_client` logic so that `get_device_status` determines whether a board speaks `IPbus 1.3` or `IPbus 2.0`. That can then be stored in the device client's state until any irrecoverable timeout, or when it's been a long time since packets have been sent to the board. Can then also enforce that device clients only send packets of the correct protocol to the board.

",enhancement,closed,major,IPbus software: v2.1.0 release,controlhub,ipbus sw 2.0,fixed,,
