﻿id,summary,reporter,owner,description,type,status,priority,milestone,component,version,resolution,keywords,cc
2054,SWATCH cell : Fix command index bug in run control operation's error report,tsw,tsw,"Since the SWATCH v0.10.0 release, if an error occurs in a SWATCH FSM transition that's run as part of the ""run control"" operation, the resulting error report prints negative indices for the offending command. E.g:

{{{
@CALOL2 : An error occurred in 7 single-object transitions, during step 2 of system transition 'setup'.
Details of commands causing the error: 
   Transition 'calol2.MP3.runControl.Halted.setup', 'calol2.MP3.resetBoard' (-3 out of 5 commands)
      Progress = 0, last status message: Reset failed: Exception class to handle failure of BC0 lock
   Transition 'calol2.MP4.runControl.Halted.setup', 'calol2.MP4.resetBoard' (-3 out of 5 commands)
      Progress = 0, last status message: Reset failed: Exception class to handle failure of BC0 lock
   Transition 'calol2.MP5.runControl.Halted.setup', 'calol2.MP5.resetBoard' (-3 out of 5 commands)
      Progress = 0, last status message: Reset failed: Exception class to handle failure of BC0 lock
   Transition 'calol2.MP6.runControl.Halted.setup', 'calol2.MP6.resetBoard' (-3 out of 5 commands)
      Progress = 0, last status message: Reset failed: Exception class to handle failure of BC0 lock
   Transition 'calol2.MP7.runControl.Halted.setup', 'calol2.MP7.resetBoard' (-3 out of 5 commands)
      Progress = 0, last status message: Reset failed: Exception class to handle failure of BC0 lock
   Transition 'calol2.MP8.runControl.Halted.setup', 'calol2.MP8.resetBoard' (-3 out of 5 commands)
      Progress = 0, last status message: Reset failed: Exception class to handle failure of BC0 lock
   Transition 'calol2.DEMUX.runControl.Halted.setup', 'calol2.DEMUX.resetBoard' (-2 out of 3 commands)
      Progress = 0, last status message: Reset failed: Exception class to handle failure of BC0 lock
}}}",defect,closed,minor,SWATCH suite v0.10.2,swatch,,fixed,,
