﻿id,summary,reporter,owner,description,type,status,priority,milestone,component,version,resolution,keywords,cc
528,uhal externs : Update boost and pugixml version,tsw,tsw,"The situation ...
 * Current uhal external packages: 
   * boost 1.48
   * pugixml 1.0
 * pugixml version 1.2 is needed for compiling uhal on OS X
   * See ticket #399
   * v1.2 fixes compile-time errors spotted by newer, stricter compilers
 * Boost version >= 1.50 is needed for newer gcc version
   * based on Andy trying out uhal on Windows, using MinGW
 * It would be nice to have uhal compile ""out of the box"" on non-SLC systems
 * In general, it's good to use more recent versions of libraries if possible, especially if you won't be able to change them for the next few years during run 2.

Using a newer boost and pugixml version has been discussed in an email thread with Christoph ...
 * No objections in principle to using the newer versions
 * Remi from the DAQ group tested the EventBuilder and rubuilder from XDAQ12 against boost 1.53. Both compiled and passed standalone tests with minor changes.

",task,closed,major,IPbus software - v2.3.0 release,uhal,ipbus sw 2.2,fixed,,thea
