﻿id,summary,reporter,owner,description,type,status,priority,milestone,component,version,resolution,keywords,cc
1111,CANDELA: clean up before release #1,cghabrou,cghabrou,"Now that the select, insert and delete capabilities are there, I think it's time to officially release the library. There are a few things though, that I would like to do before:
 * rename Query class to QueryResult
 * update version files 
 * clean up code: unused commented code, logs, unnecessary friendship between classes...
 * review API in general
 * re-write the test file (can be used as documentation)
 ",enhancement,closed,major,CANDELA future,candela,,fixed,,
