﻿id,summary,reporter,owner,description,type,status,priority,milestone,component,version,resolution,keywords,cc
109,YUM repo file unsafe,jmans,marc frazier arose cghabrou,"The yum repo should not have the titles
[base] and (especially) [upgrades].

For some distributions (e.g. Fedora 17), [upgrades] is the base OS upgrades and this behavior disables all base os upgrades. 

Using names [cactus-base] and [cactus-upgrades] is safe and the appropriate solution.
",defect,closed,major,,uhal,,fixed,,
