﻿id,summary,reporter,owner,description,type,status,priority,milestone,component,version,resolution,keywords,cc
51,Performance of uHAL + ControlHub with real hardware,frazier,frazier,"Hi Andy, Marc,

I'm seeing very poor performance when using uHAL and the ControlHub with real hardware - maybe 100x slower than I'd expect.  About 800 kbit/s.  I haven't fully got to the bottom of it yet, but all evidence so far points towards the problem being the pre-emptive uHAL multi-threaded dispatch, or whatever you want to call it.

Is there any way of turning off this feature and just getting uHAL to transfer the entire queue with a single TCP send?  I think the pre-emptive dispatch is causing a lot of complete uHAL -> ControlHub -> Hardware round-trips, which is bad for performance.  So, I'd like to test without the pre-emptive dispatch so I can rule out if this is the problem or not.  In short, since I wasn't expecting uHAL to work this way, the Control Hub is not at all optimised for this behaviour.

Also, what is the uHAL UDP ""chunking"" size currently?

Cheers,

Rob",defect,closed,minor,IPbus 1.3 suite,uhal,ipbus sw 1.0,fixed,,arose marc
