﻿id,summary,reporter,owner,description,type,status,priority,milestone,component,version,resolution,keywords,cc
2152,Rate panel improvements,garadi,arnold garadi,"Various improvements related to the rate panel should be implemented

* Show bx mask
   * in general: active=bx mask is set, inactive=bx mask is not set
   * in detail: show applied mask range as alt-text or in polymer element
* Add panel headline
* Correct switch behavior
   * show ""only active algos"" when mask=1 and prescale>0 
* Use swatch-styles

",enhancement,closed,minor,ugt v0.11.0,ugt,,fixed,,hephy-cms-trigger@…
