﻿id,summary,reporter,owner,description,type,status,priority,milestone,component,version,resolution,keywords,cc
460,GMT address file missing,jeitler,cghabrou,"For some reason a file needed for expert interventions on GMT is only available on gtts but not on gtpro. It is needed for preparing the switch to Trigger-Over-TIM for GT. 

Here follows the problem encountered:

[gtpro@vmepcS2G17-02 gtpro]$ gmt

==============================================
GMT Tester, Revision: 1.21
==============================================


Choose bus adapter:

 2) CAEN_VME64x
 3) DUMMY_VME64x
Enter option: 2
*****GTSBS is NOT set
*****GTCAEN is set
used controller: CAEN


List of mapped items (ordered by address space size) :

ffffffff ---------------------------------------------------------------------
| |
        |             type : GMT_Board      serial : GMT                     |
| |
        |                      slot ID : 12                                  |
        |                     function : 00                                  |
        |                       map ID : 00                                  |
        |                           AM : 09                                  |
| |
fe000000 ---------------------------------------------------------------------
fdffffff ---------------------------------------------------------------------
| |
        |             type : GTFE_Board      serial : GTFE                   |
| |
        |                      slot ID : 11                                  |
        |                     function : 00                                  |
        |                       map ID : 00                                  |
        |                           AM : 09                                  |
| |
fc000000 ---------------------------------------------------------------------
fbffffff ---------------------------------------------------------------------
| |
        |             type : TIM6UV2_Board      serial : TIM_V2              |
| |
        |                      slot ID : 10                                  |
        |                     function : 00                                  |
        |                       map ID : 00                                  |
        |                           AM : 09                                  |
| |
fa000000 ---------------------------------------------------------------------
f9ffffff ---------------------------------------------------------------------
| |
        |             type : PSB_Board      serial : PSB_V211                |
| |
        |                      slot ID : 0f                                  |
        |                     function : 00                                  |
        |                       map ID : 00                                  |
        |                           AM : 09                                  |
| |
f8000000 ---------------------------------------------------------------------
f7ffffff ---------------------------------------------------------------------
| |
        |             type : PSBOgti_Board      serial : PSB_OP02            |
| |
        |                      slot ID : 0e                                  |
        |                     function : 00                                  |
        |                       map ID : 00                                  |
        |                           AM : 09                                  |
| |
f6000000 ---------------------------------------------------------------------
f5ffffff ---------------------------------------------------------------------
| |
        |             type : PSBOgti_Board      serial : PSB_OP03            |
| |
        |                      slot ID : 0d                                  |
        |                     function : 00                                  |
        |                       map ID : 00                                  |
        |                           AM : 09                                  |
| |
f4000000 ---------------------------------------------------------------------
f3ffffff ---------------------------------------------------------------------
| |
        |             type : GTL_Board      serial : GTL01                   |
| |
        |                      slot ID : 0b                                  |
        |                     function : 01                                  |
        |                       map ID : 01                                  |
        |                           AM : 0b                                  |
| |
f2000000 ---------------------------------------------------------------------
f1ffffff ---------------------------------------------------------------------
| |
        |             type : GTL_Board      serial : GTL01                   |
| |
        |                      slot ID : 0b                                  |
        |                     function : 00                                  |
        |                       map ID : 00                                  |
        |                           AM : 09                                  |
| |
f0000000 ---------------------------------------------------------------------
efffffff ---------------------------------------------------------------------
| |
        |             type : FDL_Board      serial : FDL                     |
| |
        |                      slot ID : 0a                                  |
        |                     function : 00                                  |
        |                       map ID : 00                                  |
        |                           AM : 09                                  |
| |
ee000000 ---------------------------------------------------------------------
edffffff ---------------------------------------------------------------------
| |
        |             type : PSB_Board      serial : PSB_V208                |
| |
        |                      slot ID : 09                                  |
        |                     function : 00                                  |
        |                       map ID : 00                                  |
        |                           AM : 09                                  |
| |
ec000000 ---------------------------------------------------------------------
ebffffff ---------------------------------------------------------------------
| |
        |             type : TCS_Board      serial : TCS_V201                |
| |
        |                      slot ID : 07                                  |
        |                     function : 00                                  |
        |                       map ID : 00                                  |
        |                           AM : 09                                  |
| |
ea000000 ---------------------------------------------------------------------
00ffffff ---------------------------------------------------------------------
| |
        |             type : TIM6UV2_Board      serial : TIM_V2              |
| |
        |                      slot ID : 10                                  |
        |                     function : 01                                  |
        |                       map ID : 01                                  |
        |                           AM : 3a                                  |
| |
00fc0000 ---------------------------------------------------------------------



====================================================
GMT Tester main menu
====================================================

1 ... dump chip IDs
2 ... test register rw
3 ... send NPROG pulse
4 ... send reset_DCM pulse
5 ... send reset pulse

6 ... load a LUT
7 ... verify a LUT

8 ... sequence an SVF file (load/verify firmware)

9 ... configure GMT (load all LUTs and Configuration Registers, not including synchronization setup)
a ... verify GMT configuration (verify all LUTs and Configuration Registers, not including synchronization setup)

r ... read a register
w ... write a register
l ... loop forever write a register
f ... fill a MEMory
d ... dump a MEMory

s ... run all self tests
t ... run a specific self test

c ... check synchronization
y ... setup synchronization

v ... set Verbosity Level
i ... load pattern into input chip memories and start transfer

u ... read rate counters and luminosity-segment-period/number

z ... dump all readable vme registers

q ... quit

what can I do for you ? r

READ: Chip Name (INF, INC, IND, INB, AUF, AUB, LFF, LFB, SRT, ROP) : ROP


*** getItems(): Unable to open file ""/nfshome0/gtpro/trunk/trigger/gmt/GMT/xml/GMT_ADDRESSES.txt""!


Enter character to continue:

-- 
Bergauer Herbert
Institut für Hochenergiephysik
Nikolsdorfergasse 18
A-1050 Wien, Austria

email: Herbert.Bergauer@oeaw.ac.at

",defect,closed,major,GT/GMT v1.0.7,gt/gmt,,fixed,,carlos.ghabrous@… hbergauer Bergauer <Herbert.Bergauer@…>
