﻿id,summary,reporter,owner,description,type,status,priority,milestone,component,version,resolution,keywords,cc
2168,SWATCH : v0.12.0 release,tsw,tsw,"New minor release, main change is  migration to CC7

N.B. mp7 & amc13 versions to build against (all differ from v0.11.x releases)
 * uHAL: v2.5.0
 * amc13: v1.2.2
 * MP7: v2.2.3
 * TS: v4.0

TODO:
 * Update version numbers of swatch & swatchcell packages to 0.12.0
   * Make tag - `tags/swatch/swatch_0_12_0`
 * Validate tag by re-running nightly
 * Create YUM repo - under `release/swatch/0.12`
 * Generate API documentation
 * Update URL of `swatch.centos7.x86_64.repo` under `trunk/scripts/release`
 * Documentation:
   * Migration instructions for subsystems
   * Update installation instructions on SWATCH user's guide 
 * Announcement on hypernews
 * Deploy at Point 5 

",task,closed,minor,SWATCH suite v0.12.0,swatch,,fixed,,
