﻿id,summary,reporter,owner,description,type,status,priority,milestone,component,version,resolution,keywords,cc
776,Moving to XDAQ12 at P5,bortigno,cghabrou,"Hello, 
can you explain me (or point me to some twiki) the procedure to move to XDAQ12 at P5?
Thank you
Pier",support,closed,major,,csctf,,fixed,,banicz@…
