﻿id,summary,reporter,owner,description,type,status,priority,milestone,component,version,resolution,keywords,cc
2219,SWATCH metrics: improve the naming convention,thea,thea,"Simply by doing

* `BaseMetric` -> `Metric`
* `Metric` -> `SimpleMetric`",enhancement,closed,minor,SWATCH suite v1.0.0,swatch,,fixed,,
