﻿id,summary,reporter,owner,description,type,status,priority,milestone,component,version,resolution,keywords,cc
1175,L1Page: throw away MI/TTC last references,cghabrou,cghabrou,"I hope. 
At least I grep all over the place and it seems clean now. 
This should also solve the bug reported by Giuseppe, who pointed out that the l1page is not displaying the DT in the main page anymore. ",defect,closed,major,l1page 1.9.14,l1page,,fixed,,
