﻿id,summary,reporter,owner,description,type,status,priority,milestone,component,version,resolution,keywords,cc
1816,MP7 readout BX not aligned with TTC history,thea,,"The bunch counter value reported in the MP7 AMC headers is 1 value behind whar reported by TTC history.

This behaviour is visible in simulation when comparing the `bunch_ctr` and `bunch_ctr_i` in `mp7_readout.hdl`, the bunch counter input signal and the signal which is propagated to `readout_ctrl` after bunch counter offset, respectively.

Looking at the code the reason seems the bunch crossing offset logic, which introduces 1 TTC clock cycle delay between.
`bunch_ctr` and `bunch_ctr_i`.
 
{{{
	bunch_ctr_s <= unsigned('0' & bunch_ctr) + unsigned('0' & ctrl(0)(15 downto 4));
	bunch_ctr_wrap <= bunch_ctr_s - LHC_BUNCH_COUNT;

	process(ttc_clk)
	begin
		if rising_edge(ttc_clk) then
			if bunch_ctr_s >= LHC_BUNCH_COUNT then
				bunch_ctr_i <= std_logic_vector(bunch_ctr_wrap(11 downto 0));
			else
				bunch_ctr_i <= std_logic_vector(bunch_ctr_s(11 downto 0));
			end if;
		end if;
	end process;
}}}

A possible fix could be to increase by 1 `bunch_ctr_s`, to compensate for the clock cycle loss

{{{
	bunch_ctr_s <= unsigned('0' & bunch_ctr) + unsigned('0' & ctrl(0)(15 downto 4))+1;
}}}",defect,new,minor,mp7fw - FUTURE,mp7 firmware,,,,
