﻿id,summary,reporter,owner,description,type,status,priority,milestone,component,version,resolution,keywords,cc
1068,L1Key retrieve configuration rules from file,cghabrou,eparadas,"Hi Vangelis, 

about the changes you introduced in the L1Key class to retrieve the configuration rules from a file:

* what happens if the file is not there? I guess this is quite unlikely, but wouldn't it be better to check it and raise an exception with an informative message in case it is not there or can't be opened? Something like:
{{{
ifstream configRulesFile(""route/to/my/file""); 
if ( ! configRulesFile.is_open() )
{
// raise an exception using macro XCEPT_RAISE();
}

string line; 
while ( getLine(configRulesFile, line) )
{
// process line
}

}}}

 * also, I noticed that you don't close the file after using it, which is not good at all. ",defect,closed,major,Trigger Supervisor 1.14.0,triggersupervisor,TS 1.13.3,fixed,,
