﻿id,summary,reporter,owner,description,type,status,priority,milestone,component,version,resolution,keywords,cc
382,What is the device id used for when not using a connections file?,jhegeman,marc tsw arose cghabrou,"Hi,

If I use uhal to connect to a device without going through a connections file, i.e.,
{{{
HwInterface hw=ConnectionManager::getDevice ( id, uri,address_file );
}}}
what is the 'id' used for?

More concretely:
   * If I use the above call twice, with the same id but with a different uri or address_file, will I get the same device or a different one?
   * If I use the above call twice, with the same uri and address_file but with a different id, will I get the same device or a different one?

Judging from a quick look at the code it appears this id is not actually used in this situation, right?

Thanks,
Jeroen
",support,closed,minor,,uhal,ipbus sw 2.0,fixed,,
