﻿id,summary,reporter,owner,description,type,status,priority,milestone,component,version,resolution,keywords,cc
812,Finding The Car You Want Within Your Budget,tammie_lovelace@…,clucas giles newbold arose thea,"You should have the hottest deal when you are evaluating an automobile, and you haven't possessed the proper good fortune previously. Even so, you are able to alter everything that. This information is filled up with ideas that will assist you pick the right vehicle.

When you will purchase a automobile, you must know beforehand which functions are very important for yourself in a vehicle. Have a clear image of what you would like, so you can search for the right selling price plus the appropriate vehicle to meet your needs.

Possess a very clear comprehension of what all those enhancements can cost you. Purchasing the expensive stereo, leather material car seats and Digital video disc person could possibly be desirable, but these alternatives could add an important figure to the cost of your vehicle. Take some time to take into account just how much you really want the upgrades, and only get the kinds you will make use of the most.

When you're vehicle buying, expect to attend the car dealership a while. You must not buy a vehicle if you are hurried and do not have plenty of time to take into account your choice. You should let on your own have a few hours to make a decision. If something arises that you have to deal with, don't be reluctant to go out of and come back later.

Find out about the different warranties that exist. You do not would like to commit a couple of 1000 bucks on the guarantee that is certainly not likely to include the fixes that generally occur. Instead, shop away from the car dealership to locate one that will take care of the fixes in a better price.

Don't forget about to look into the cost of parts to get a motor vehicle before buying it. Some cars, specifically imports, expense significantly more to maintain than others. Investigate the fee for parts that degrade regularly, including car tires, braking systems, and windscreen wiper cutting blades. Study the expense of alternators, ignite plugs, and other motor elements, also.

Hold out until you have an agreement about the vehicle of your choice just before discussing industry-ins, benefits or downward monthly payments. These financial exchanges need to lessen your price. You will likely get a much better value if you start by negotiating and after that refer to these extra special discounts.

Read through all of the fine print that is in the agreement for the car you want to buy. Although you may think the auto salesman has been completely truthful together with you about every thing engaged, you need to ensure you will be not signing anything that you will have regrets about later.

Usually do not tip a vehicle out as it is missing a number of functions you need. As an illustration, should you not such as the speakers from the vehicle, it may continually be altered. It can be difficult to find an automobile which includes almost everything particularly how you want it just always keep a wide open brain and remember you could make these modifications as soon as the vehicle is your own!

When looking for a second hand car, it would be smart to stay with licensed pre-possessed cars as this greatly reduces the probability that you'll get a auto that may be in inadequate issue. Just be certain the certification if provided by the auto manufacturer as opposed to the car dealership.

When negotiating an arrangement in your new vehicle, have on the internet details at hand. There are numerous web sites that will provide you with things such as invoice prices and bonuses, and this details can demonstrate useful while you make a deal your price. Print out it all out and provide it on the auto dealer, so there is absolutely no concern regarding the accuracy and reliability of what you will be saying.

Be sure that while you are automobile buying that you know what you're looking for very first. Get in touch with around to some of the dealerships and see if they have anything you'd be curious about. You may even manage to find their webpage and look for the cars prior to passing time going up there.

Will not bottom your vehicle decision exclusively on value. Whilst price is definitely significant, so is definitely the reputation of the dealership. You wish to get a spot that is acknowledged for fantastic customer satisfaction and standing up right behind the vehicles they offer when you have any difficulties down the line.

When investing within your vehicle, bring it into a number of car dealerships and inquire them each what they'll give you for it. You may be amazed through the difference between the values provided at every lot. In the end, assess the price of the auto you wish with the offer for the greatest good deal to meet your needs.

When buying an auto, it is vital that you continue security at heart. ""Unaggressive Security"" involves the functions the automobile needs to maintain everybody within it risk-free. Including trustworthy seat belts, air luggage, energy-taking  [http://www.fit2dmax.com/fitcommunity/groups/purchase-a-vehicle-you-are-going-to-appreciate-with-these-suggestions/ Maryland Vehicle Wraps] in crumple areas and mind safeguarding advice. Seek out these functions when searching for a car.

Given that you've considered all of this knowledge in, do you know what you need to do up coming. Method that car whole lot with certainty everbody knows you will have the advice would have to be profitable. Once you appear, you'll take control of the specific situation and are available on leading within the greatest auto at any time.",support,closed,minor,,unknown,,spam,,
