﻿id,summary,reporter,owner,description,type,status,priority,milestone,component,version,resolution,keywords,cc
2253,calo layer 2 software : Update config subdirectory with parts of swatch/config,tsw,tsw,"... in order to:
 1. Incorporate a couple of useful additions that were added to `swatch/config` over the past few months. Specifically:
  * Use of `-std=c++11` rather than `-std=c++0x` g++ compiler flag
  * Clear error message in case the path to the checked-out sources is too short for the debuginfo RPM to be created
  * Installation of binaries and scripts under subdirectory of `/opt/cactus/bin` (exact subdirectory specified in `Makefile` using environment variable `Project`)
 2. Make `calol2/config` and `swatch/config` identical

",enhancement,new,minor,,calol2,,,,thea
