﻿id,summary,reporter,owner,description,type,status,priority,milestone,component,version,resolution,keywords,cc
1267,New MP7 SW tag required with readFwRevision() and readAlgoRevision(),mguilbau,thea@…,"We need a new mp7sw tag that include the following method present into the trunk:
* readFwRevision()
* readAlgoRevision()

These method are needed to check FW and Algo version in the S1calol2 SW.

",enhancement,closed,minor,mp7sw - FUTURE,mp7 software,,fixed,,marcelo.vicente@… t.williams@…
