﻿id,summary,reporter,owner,description,type,status,priority,milestone,component,version,resolution,keywords,cc
1308,Global TMT sync signals added to design,newbold,newbold,"The TTC block now produces the global TMT sync signals correctly.

There are two signals:

- The L1A flag, which when asserted indicates that a coincident L1A signal from TTC is on an 'active' BX for this board. Used by the readout controller.

- The packet flag, which when asserted indicates that the first word of an incoming TMT packet should lie on this BX. Distributed around the timing chain and used by the formatter. Note that this signal is high for a whole 40MHz period, but since the alignment block checks the packet alignment wrt 240MHz clock already, then there should be no ambiguity.

The control registers, within the TTC block, look like:

	<node id=""tmt"" address=""0x18"" description=""TMT cycle control"" fwinfo=""endpoint;width=0"">
		<node id=""max_phase"" mask=""0xf""/>
		<node id=""phase"" mask=""0xf0""/>
		<node id=""l1a_offset"" mask=""0xf00""/>
		<node id=""pkt_offset"" mask=""0xf000""/>
	</node> 

- max_phase specified the TMT period; e.g. for a TMT period of 9BX, set this to 8.
- phase indicates the phase alignment of this board; e.g. for TMT period of 9BX, set to a number between 0 and 8
- l1a_offset compensates for the relative delay of l1a w.r.t. data emerging from buffers. Needs to be set 'by hand' globally for all boards in the system.
- pkt_offset compensates for the relative delay of incoming data w.r.t the local bunch counter. Needs to be set 'by hand' globally for all boards in the system.

Once the offsets are determined, the only register that should differ between boards is the phase.
",enhancement,closed,major,mp7fw - v1.9.x releases,mp7 firmware,,fixed,,
