﻿id,summary,reporter,owner,description,type,status,priority,milestone,component,version,resolution,keywords,cc
1156,Importing the AMC502 based on mp7v1_4_0 in to cactus,nloukas,newbold giles arose thea harder,"The amc502 base fw is based on the v1_4_0 version of the mp7 firmware and will be imported in the cactusupgrades/boards/amc502 area. 
The structure of the area will be identical to the corresponding mp7 area. The goal is to be able to build the firmware straight from the repo using the mp7 build script.",defect,closed,major,mp7fw - FUTURE,mp7 firmware,,fixed,"amc502,mp7",
