﻿id,summary,reporter,owner,description,type,status,priority,milestone,component,version,resolution,keywords,cc
120,Register Address Access,chhill,marc frazier arose cghabrou,"Hello uHAL team, 

I need to be able to access registers via their addresses. However, it is not immediately obvious to me how this might be accomplished. There does not seem to be a 'node' class constructor which takes anything other than the xml path.  Any hints on how to access addresses with no knowledge of their id's in the address table? Is there a function for this (that I am missing) or do I need to get creative?:)

Thanks, as always!

Charlie",support,closed,minor,,uhal,,fixed,,
