﻿id,summary,reporter,owner,description,type,status,priority,milestone,component,version,resolution,keywords,cc
643,xdaq12 machine,cghabrou,clazarid,"Hi Christos, 

since XDAQ12  baseline release is ready, could you please verify the cactus-xdaq12 machine has the latest RPMs? 

It will also be necessary to produce the TS baseline release for XDAQ12. 

Thanks, 
Carlos. ",task,closed,major,,nightlies,,fixed,,thea clazarid
