﻿id,summary,reporter,owner,description,type,status,priority,milestone,component,version,resolution,keywords,cc
1700,Re-add support for 10g std latency links,thea,,"Low latency links are the default in v2.0. 
The legacy 10g links are now identified by id `0x6`.

The mgt enumerator and its streamer must be extended, `MP7CoreController::identify` extended",defect,closed,minor,mp7sw - v2.0.x releases,mp7 software,,fixed,,
