﻿id,summary,reporter,owner,description,type,status,priority,milestone,component,version,resolution,keywords,cc
800,L1Page: clean up not used TTC applications; replace them by TCDS's,cghabrou,cghabrou,"As the TCDS system kicked in into P5, the l1page should not monitor anymore TTC applications that are no longer used. 
We should: 
 * make sure everything TTC-ish the l1page monitors is no longer used (I see most of these applications are still up and running, but likely not connected to any HW)
 * remove TTC applications from the l1page configuration file
 * include the TCDS applications instead 

Christos, 
I will poll subsystem experts first about the TTC applications, then I will tell you how to include the TCDS ones. Does that sound OK? ",task,closed,major,l1page 1.9.14,l1page,TS 1.12.8,fixed,,clazarid
