﻿id,summary,reporter,owner,description,type,status,priority,milestone,component,version,resolution,keywords,cc
881,Make individual channel clock measurement faster,bundocka,giles ale newbold,"When validating firmware or testing new boards, the clock for each channel is checked a number of times. If possible, it is desirable to reduce the amount of time this takes as it will speed up batch testing of boards significantly.

Someone I spoke to before (Greg/Dave?) said if you reduce the precision of clock frequency measurement then it will return the channel clock frequencies quicker, this would be useful.",enhancement,closed,minor,mp7fw - FUTURE,mp7 firmware,,fixed,,
