﻿id,summary,reporter,owner,description,type,status,priority,milestone,component,version,resolution,keywords,cc
1317,Fixing clock constraints for MP7,newbold,newbold,"A small error in the clock constraints for MP7 was found by Dinyar. The free-running 125MHz clk and the ipbus clock should have been declared asynchronous, but were not. Now fixed.

",defect,closed,minor,mp7fw - FUTURE,mp7 firmware,,fixed,,
