﻿id,summary,reporter,owner,description,type,status,priority,milestone,component,version,resolution,keywords,cc
1294,Error in csctf-store,bmichlin,cghabrou clazarid thea,"Hello,

Last night the CSCTF store went in error.  A similar error had been seen last week from the TF at B904.  Restarting the CSCTF solved the problem, but I wanted to have a record of it here for future reference.",defect,closed,minor,,unknown,,fixed,,
