﻿id,summary,reporter,owner,description,type,status,priority,milestone,component,version,resolution,keywords,cc
630,VM to provide to subsystems for XDAQ12 development,clazarid,clazarid,"In order to facilitate subsystem migration, a new VM was created under the hostname cactus-xdaq12. It has exactly the same configuration as cactus-worker-6 and subsystems can use it to compile their code against XDAQ12 and Trigger Supervisor.

Local accounts can be provided to subsystems on request. CSCTF has already asked for a local account.",task,closed,minor,,unknown,,fixed,,thea clazarid
