﻿id,summary,reporter,owner,description,type,status,priority,milestone,component,version,resolution,keywords,cc
659,Create calol2/firmware folder,thea,arose thea,"The firmware related folders present in `calol2` should be moved into a new `calol2/firmware` directory.
The goal is to prepare for the addition of 
 * a software directory `calol2/software`
 * a TS Cell directory `calol2/ts`

Alessandro ",defect,closed,minor,,calol2,,wontfix,,thea clazarid
