﻿id,summary,reporter,owner,description,type,status,priority,milestone,component,version,resolution,keywords,cc
660,L1Page: update host names in DTSC process controller script,cghabrou,cghabrou,"The DTSC process controller script contains wrong host names. 
I will correct them and deploy a new version of the l1page. ",defect,closed,critical,L1Page 1.9.8,l1page,TS 1.12.7,fixed,,thea clazarid gcodispo
