﻿id,summary,reporter,owner,description,type,status,priority,milestone,component,version,resolution,keywords,cc
203,GT: cms run number,marc,cghabrou,"Hi Marc,
  I'm reading a writeup about lumidaq implementation. This paperi s quite old. It says lumidaq gets the cms run number from ""accessing monitoring information from the trigger supervisor"". Is it (still) true?? I don't see any xmas etc configurations...

thanks,
Zhen ",support,closed,minor,,gt/gmt,,fixed,,xiezhen
