﻿id,summary,reporter,owner,description,type,status,priority,milestone,component,version,resolution,keywords,cc
1533,SWATCH : Object should be non-copyable,tsw,tsw,"`swatch::core::Object` contains a map of pointers to child objects that it owns; it deletes these children in its destructor. 

Hence, the default copy constructor that's implemented by the compiler would cause double deletion when an instance of any class derived from the `Object` were copied, if that instance has children.

Therefore, `Object` will now inherit from `boost::noncopyable` in order to make sure that there's no copy or assignment operator.",defect,closed,minor,SWATCH suite v0.4,swatch,,fixed,,
