﻿id,summary,reporter,owner,description,type,status,priority,milestone,component,version,resolution,keywords,cc
2346,New tag v1_2_7 of AMC13 rpms need to be added to the repo.,darcaro,ehazen dgastler dzou,"A new tag for the AMC13 software was added.
The corresponding rpms are located here:

SLC6:
http://ohm.bu.edu/~djarcaro/AMC13_rpms/cactusboards-amc13-amc13-1.2.7-0.slc6.x86_64.rpm
http://ohm.bu.edu/~djarcaro/AMC13_rpms/cactusboards-amc13-python-1.2.7-0.slc6.python2.6.x86_64.rpm
http://ohm.bu.edu/~djarcaro/AMC13_rpms/cactusboards-amc13-python-debuginfo-1.2.7-0.slc6.python2.6.x86_64.rpm
http://ohm.bu.edu/~djarcaro/AMC13_rpms/cactusboards-amc13-tools-1.2.7-0.slc6.x86_64.rpm

CC7:
http://ohm.bu.edu/~djarcaro/AMC13_rpms/cactusboards-amc13-amc13-1.2.7-0.centos7.x86_64.rpm
http://ohm.bu.edu/~djarcaro/AMC13_rpms/cactusboards-amc13-python-1.2.7-0.centos7.python2.7.x86_64.rpm
http://ohm.bu.edu/~djarcaro/AMC13_rpms/cactusboards-amc13-python-debuginfo-1.2.7-0.centos7.python2.7.x86_64.rpm
http://ohm.bu.edu/~djarcaro/AMC13_rpms/cactusboards-amc13-tools-1.2.7-0.centos7.x86_64.rpm


",task,closed,minor,,amc13,,fixed,rpms,dgastler@…
