﻿id,summary,reporter,owner,description,type,status,priority,milestone,component,version,resolution,keywords,cc
1891,SWATCH : v0.8.2 release,tsw,tsw,"New ABI-incompatible patch release containing ...
 * Improvements to APIs in swatch cell for consolidation of uGT rate monitoring
 * Some corresponding cleanup of metric API (values are held by data type in metric snapshot, not just string)
 * A couple of new MP7 commands
 * And, as usual, lots of cool new features in the panels

----

N.B. mp7 & amc13 versions to build against (same as last release)
 * MP7: v2.0.1
 * amc13: v1.1.8 

TODO:
 * Update version numbers of swatchcell packages to 0.8.2
   * Make tag - `tags/swatch/swatch_0_8_2`
 * Validate tag by re-running nightly
 * Update YUM repo - under `release/swatch/0.8`
 * Generate API documentation
 * Documentation:
   * Release notes
 * Deploy at Point 5 

",task,closed,minor,SWATCH suite v0.8.2,swatch,,fixed,,
