﻿id,summary,reporter,owner,description,type,status,priority,milestone,component,version,resolution,keywords,cc
604,CACTUS repository for uHAL/TS and puppet profile management,clazarid,clazarid,"Hi all,

I open this ticket to keep track of the discussion regarding the creation of the L1T puppet profiles, as the emails can get hard to keep track of. 

We chatted briefly with Aymeric today and he suggested that a single repo with snapshots would work for either machines needing µHAL or µHAL + TS.

The idea is to create a ""permanent"" CACTUS repo, which would contain symbolic links to all RPMs of all CACTUS releases. Whenever we want to make a snapshot we request the sysadmins to take a snapshot of that directory. The different puppet profiles will pull only the RPMs that they need. 

The current proposal was to name the snapshots with the date; but Aymeric will check if they can be named with something more descriptive.

to be continued...

cheers,
  Christos.",task,closed,major,,.cms admin,,fixed,,thea clazarid aymeric.dupont@… Marc.Dobson@… gdarlea@…
