﻿id,summary,reporter,owner,description,type,status,priority,milestone,component,version,resolution,keywords,cc
838,Buildsystem work,arose,arose,"Hi all,

Just a log of what I am doing on the buildsystem.

Working branch is:
[https://svnweb.cern.ch/trac/cactus/browser/branches/arose_buildsys_dev2 arose_buildsys_dev2]",task,new,minor,,unknown,,,,newbold giles thea
