﻿id,summary,reporter,owner,description,type,status,priority,milestone,component,version,resolution,keywords,cc
213,Integrating IPbus ConnectionManager with ATLAS TDAQ database,landon,marc tsw arose cghabrou,"Hi,

I have been looking more at the issues of integrating IPbus with the existing ATLAS TDAQ software.

In particular, the ATLAS TDAQ software uses a database to describe all components of the online system including hardware modules. All our future ATCA modules will need to be included in this database as that is the standard place where components of the system can be enabled or disabled as necessary.

With IPbus, the modules would also need to be described in connection manager XML file. This means that maintenance would need to be done in two places.

So I wondered if I could initialise a ConnectionManager using information gathered from the ATLAS TDAQ database. However the ConnectionManager API does not have any member methods to add new HwInterface objects to an existing ConnectionManager.

Would it be possible to add such methods or would that be too contrary to the IPbus design or implementation?

The kind if integration I had in mind was:
- read ATLAS TDAQ database to find our ATCA modules
- create an empty ConnectionManager
- add HwInterfaces to it for our ATCA modules
- pass an updated ConnectionManager to classes configuring modules

An alternative would be to use the ATLAS TDAQ database to write a temporary XML file on the fly for the ConnectionManager to read, but that seems less attractive and might need maintenance if the XML file format changed.

Cheers, Murrough.
",enhancement,closed,minor,,uhal,,worksforme,connection manager,
