﻿id,summary,reporter,owner,description,type,status,priority,milestone,component,version,resolution,keywords,cc
1093,Update pupet with 1_3_1 s1calol2 sw cell,mguilbau,clazarid,"Could you update the puppet with the last tag of the s1calol2 cell sw please?

This version should be compatible with TS 1.14

rpm can be found here: /nfshome0/mguilbau/*.rpm at P5",task,closed,minor,Trigger Supervisor 1.14.0,calol2,,fixed,,Alessandro.Thea@…
