﻿id,summary,reporter,owner,description,type,status,priority,milestone,component,version,resolution,keywords,cc
343,Block reads/writes of zero size,jhegeman,newbold,"Dear cacti,

I just tracked down a feature in my code that completely locks up the IPbus communication: trying a zero-length block read.

This is with uhal 2.0.2 on SLC6 (both from Python and from C++) talking to a GLIB-based setup.

Of course this could easily be avoided in software, but I was wondering if this was supposed to work or not. I know for certain that this used to work with the same board with IPbus 1.3. Now we moved to IPbus 2.0 and it completely locks up the communication.

So the question is whether this is something to be avoided in software (and maybe protected against by throwing an exception in uhal), avoided by returning an empty vector in uhal, or made to work in the firmware.

Cheers,
Jeroen",defect,closed,minor,IPbus software: v2.1.0 release,uhal,ipbus sw 2.0,fixed,,
