master=/trunk/cactusupgrades/boards/amc13/software/amc13
aguldemo_amc13_Status=/branches/aguldemo_amc13_Status
dmn_amc13_test=/branches/dmn_amc13_test/cactusupgrades/boards/amc13/software
hazen_14Sep15_amc13=/branches/hazen_14Sep15_amc13
tsw_amc13_950=/branches/tsw_amc13/950/amc13
tsw_amc13_v1_2_1_extraChangesForCC7=/branches/tsw_amc13/amc13_v1_2_1_extraChangesForCC7
tags/1.0.0=/tags/amc13/amc13_v1_0_0
tags/1.0.1=/tags/amc13/amc13_v1_0_1
tags/1.0.2=/tags/amc13/amc13_v1_0_2
tags/1.0.3=/tags/amc13/amc13_v1_0_3
tags/1.0.4=/tags/amc13/amc13_v1_0_4
tags/1.0.5=/tags/amc13/amc13_v1_0_5
tags/1.0.6=/tags/amc13/amc13_v1_0_6
tags/1.0.7=/tags/amc13/amc13_v1_0_7
tags/1.0.8=/tags/amc13/amc13_v1_0_8
tags/1.0.9=/tags/amc13/amc13_v1_0_9
tags/1.1.0=/tags/amc13/amc13_v1_1_0
tags/1.1.1=/tags/amc13/amc13_v1_1_1
tags/1.1.10=/tags/amc13/amc13_v1_1_10
tags/1.1.11=/tags/amc13/amc13_v1_1_11
tags/1.1.2=/tags/amc13/amc13_v1_1_2
tags/1.1.3=/tags/amc13/amc13_v1_1_3
tags/1.1.4=/tags/amc13/amc13_v1_1_4
tags/1.1.5=/tags/amc13/amc13_v1_1_5
tags/1.1.6=/tags/amc13/amc13_v1_1_6
tags/1.1.7=/tags/amc13/amc13_v1_1_7
tags/1.1.8=/tags/amc13/amc13_v1_1_8
tags/1.1.9=/tags/amc13/amc13_v1_1_9
tags/1.2.0=/tags/amc13/amc13_v1_2_0
tags/1.2.1=/tags/amc13/amc13_v1_2_1
tags/1.2.10=/tags/amc13/amc13_v1_2_10
tags/1.2.11=/tags/amc13/amc13_v1_2_11
tags/1.2.12=/tags/amc13/amc13_v1_2_12
tags/1.2.13=/tags/amc13/amc13_v1_2_13
tags/1.2.2=/tags/amc13/amc13_v1_2_2
tags/1.2.3=/tags/amc13/amc13_v1_2_3
tags/1.2.4=/tags/amc13/amc13_v1_2_4
tags/1.2.5=/tags/amc13/amc13_v1_2_5
tags/1.2.7=/tags/amc13/amc13_v1_2_7
tags/1.2.8=/tags/amc13/amc13_v1_2_8
tags/1.2.9=/tags/amc13/amc13_v1_2_9
