﻿id,summary,reporter,owner,description,type,status,priority,milestone,component,version,resolution,keywords,cc
190,xdaq: XDAQ/XMAS monitoring links,marc,marc,"Zhen asked for information regarding the XDAQ monitoring. She would like to use it for the Lumi system at P5.

I create the ticket to allow people to search for these issues in the future.

You can check this information:
 * Remember to send a ticket to Luciano and Andrea asking to create a new XaaS zone for Lumi at P5: https://svnweb.cern.ch/trac/cmsos/newticket
 * XDAQ developer guide (ch11 contains information about flashlists and infospaces): https://edms.cern.ch/file/998717/1.0/CMSOSDM_D_V1.7.docx
 * XaaS example (configuration files): https://svnweb.cern.ch/trac/cmsos/browser/branches/l1_xaas/slim/l1test
 * XDAQ example (for the above XaaS files):   https://svnweb.cern.ch/trac/cactus/browser/trunk/cactusprojects/subsystem

Cheers,
marc
",support,closed,minor,,unknown,nightly build,fixed,,xiezhen
