﻿id,summary,reporter,owner,description,type,status,priority,milestone,component,version,resolution,keywords,cc
2203,utm - slice cut for object collections,arnold,arnold aradi,"Introducing SLICE cuts for object requirements to provide cuts on a subset (slice) of the original object collection.

eg. 
    {{{JET-SLICE_LEAD}}} (0, 0) the leading object (highest pt)
    {{{JET-SLICE_0to3}}} (0, 3) four best objects, sorted by et
    {{{JET-SLICE_4to7}}} (4, 7) 4th up to 7th best objects, sorted by et

**Providing new cuts:**

 * {{{MU-SLICE}}}
 * {{{EG-SLICE}}}
 * {{{TAU-SLICE}}}
 * {{{JET-SLICE}}}",enhancement,closed,minor,utm - v0.5.x releases,ugt,,fixed,,hephy-cms-trigger@…
