﻿id,summary,reporter,owner,description,type,status,priority,milestone,component,version,resolution,keywords,cc
556,MP7 690es build broken,arose,newbold giles sudasgup arose thea harder,"Hi Dave, Greg,

I tried building the `MP7_690es` with `NQUAD` set to 18 and all September Integration Test algorithms. It passes `synthesis` but fails `map`:

Any thoughts?

AR",defect,closed,major,,mp7 firmware,,fixed,,newbold giles
