﻿id,summary,reporter,owner,description,type,status,priority,milestone,component,version,resolution,keywords,cc
396,TS: dojo and icons packages do not contain the OS,marc,marc,"As noticed by the CMS sysadmins, the RPMs for dojo and icons do not have the OS on it: https://savannah.cern.ch/support/?139122

I will add the OS, create an RPM for SLC6, add just in the YUM repo, and tell to the sysadmin.

On the next release everything will be fixed automatically.",defect,closed,minor,Trigger Supervisor 1.12.6,triggersupervisor,TS 1.12.5,fixed,,
