﻿id,summary,reporter,owner,description,type,status,priority,milestone,component,version,resolution,keywords,cc
1964,Release Trigger Supervisor v3.5.0,clazarid,clazarid,"This ticket will monitor the release of TS 3.5.0

TODOs:
* Check out code, update version numbers & rebuild RPMs
* Test
* Commit code & tag release
* Validate tag by re-running tests
* Update development repository
* Announce release
* Update production repository
* Add RPMs to production pool & create snapshot
* Deploy at P5",task,closed,minor,Trigger Supervisor 3.5.0,triggersupervisor,,fixed,,
