﻿id,summary,reporter,owner,description,type,status,priority,milestone,component,version,resolution,keywords,cc
127,Install Cactus on not SLC5,chhill,marc frazier arose cghabrou,"Hey uHAL team,

I can see that the wiki points me to the developer notes for a non-SLC build, but I am having trouble finding anything helpful for this task.  Could you perhaps point me to where these instructions lie?  In the meantime, I will try and open my eyes.  I really am sorry if I am missing the obvious.  

Thanks for your help!

Charlie",support,closed,minor,,uhal,,wontfix,,
