﻿id,summary,reporter,owner,description,type,status,priority,milestone,component,version,resolution,keywords,cc
355,Dispatch on empty queue behaves badly,jhegeman,marc tsw arose cghabrou,"Hi,

It appears that uhal does not like a dispatch() call without any queued requests. Testing from Python, I can reproduce two kinds of behaviour:
 * A segfault
 * A TCP timeout

When performing a call to dispatch() immediately after setting up the connection, a segfault occurs. When performing a call to dispatch() after at least one successful dispatch() but with an empty request queue, a TCP timeout occurs.

I have attached a little Python script and address table that show the problem.

Cheers,
Jeroen",defect,closed,major,IPbus software: v2.1.0 release,uhal,ipbus sw 2.0,fixed,,
