﻿id,summary,reporter,owner,description,type,status,priority,milestone,component,version,resolution,keywords,cc
2279,BMTF migration to SWATCH 1.0.0,pyannis,pyannis,"BMTF migration to SWATCH 1.0.0
The cell has been tested with new keys
and the BMTF code will be committed to the trunk.
Had to go back to mp7 address tables 2.2.0.",enhancement,closed,critical,SWATCH suite v1.0.0,bmtf,,fixed,,
