﻿id,summary,reporter,owner,description,type,status,priority,milestone,component,version,resolution,keywords,cc
993,Method to get the address file used to create HwInterface?,landon,tsw arose cghabrou clazarid thea harder,"I was hoping to find a way to get hold of the address file used to create a device (HwInterface) - ie the one specified in the connection file.

If the HwInterface has some top level leaf nodes one can find the address file from them, but if the device only has children with their own address files then it does not seem possible to get the address file for the HwInterface.

Did I miss something? If not, could such a method be added to HwInterface for completeness?

(I actually wanted it in pycohal for a little debugging GUI).
",enhancement,new,minor,,uhal,ipbus sw 2.3,,,
