﻿id,summary,reporter,owner,description,type,status,priority,milestone,component,version,resolution,keywords,cc
48,size atribute is meaningful for non-incremental access?,marc,marc,"Dear Andrew,

While writing the documentation and discussing the uHAL GUI I have realized that the ""size"" attribute does not have meaning in the non-incremental case.

It is theoretically possible that the amount of data you can get from a FIFO is ""infinite"", as it could be just a stream of words.

Therefore, I would made the size attribute only mandatory for the incremental case, and disallow it for all the other cases.

Cheers,
marc
",enhancement,closed,minor,IPbus 1.3 suite,uhal,ipbus sw 1.0,fixed,,frazier
