ecalic>=1.0.4
numpy>=1.22.4,<2
pandas>=1.1.1
ray>=1.0.1
h5py>=2.10.0
matplotlib>=3.6.3
mplhep>=0.3.29
scipy>=1.10.1
numba>=0.56.4
setuptools>=44.1.0,<71
uproot>=4.0.0,<5
awkward>=1.8.0,<2
ConfigArgParse~=1.2.3
Pillow>=7.2.0
tqdm>=4.46.1
tables>=3.6.1
tabulate>=0.9.0
influxdb
dbs3-client>=4.0.19
