GEMDAQ_GTX0_Fri_Oct_23_02-11-59_2015.dat
GEMDAQ_GTX0_Fri_Oct_23_02-13-53_2015.dat
GEMDAQ_GTX0_Fri_Oct_23_03-20-22_2015.dat
GEMDAQ_GTX0_Fri_Oct_23_13-41-06_2015.dat
GEMDAQ_GTX0_Fri_Oct_23_14-02-21_2015.dat
GEMDAQ_GTX0_Fri_Oct_23_16-47-33_2015.dat
GEMDAQ_GTX0_Fri_Oct_23_17-13-42_2015.dat
GEMDAQ_GTX0_Fri_Oct_23_22-21-57_2015.dat
GEMDAQ_GTX0_Mon_Nov__2_00-12-45_2015.dat
GEMDAQ_GTX0_Mon_Nov__2_00-15-11_2015.dat
GEMDAQ_GTX0_Mon_Nov__2_00-21-17_2015.dat
GEMDAQ_GTX0_Mon_Nov__2_00-39-04_2015.dat
GEMDAQ_GTX0_Mon_Nov__2_00-56-12_2015.dat
GEMDAQ_GTX0_Mon_Nov__2_01-00-50_2015.dat
GEMDAQ_GTX0_Mon_Nov__2_01-17-23_2015.dat
GEMDAQ_GTX0_Mon_Nov__2_01-33-03_2015.dat
GEMDAQ_GTX0_Mon_Nov__2_01-55-27_2015.dat
GEMDAQ_GTX0_Mon_Nov__2_02-07-22_2015.dat
GEMDAQ_GTX0_Mon_Nov__2_02-24-25_2015.dat
GEMDAQ_GTX0_Mon_Nov__2_02-43-20_2015.dat
GEMDAQ_GTX0_Mon_Nov__2_03-08-13_2015.dat
GEMDAQ_GTX0_Mon_Nov__2_03-48-51_2015.dat
GEMDAQ_GTX0_Mon_Nov__2_04-18-48_2015.dat
GEMDAQ_GTX0_Mon_Nov__2_04-26-18_2015.dat
GEMDAQ_GTX0_Mon_Nov__2_04-33-42_2015.dat
GEMDAQ_GTX0_Mon_Nov__2_04-41-59_2015.dat
GEMDAQ_GTX0_Mon_Nov__2_04-48-25_2015.dat
GEMDAQ_GTX0_Mon_Nov__2_04-56-24_2015.dat
GEMDAQ_GTX0_Mon_Nov__2_05-01-43_2015.dat
GEMDAQ_GTX0_Mon_Nov__2_05-08-23_2015.dat
GEMDAQ_GTX0_Mon_Nov__2_05-24-50_2015.dat
GEMDAQ_GTX0_Mon_Nov__2_05-32-08_2015.dat
GEMDAQ_GTX0_Mon_Nov__2_05-37-04_2015.dat
GEMDAQ_GTX0_Mon_Nov__2_05-44-31_2015.dat
GEMDAQ_GTX0_Mon_Nov__2_05-48-04_2015.dat
GEMDAQ_GTX0_Mon_Nov__2_05-53-13_2015.dat
GEMDAQ_GTX0_Mon_Nov__2_05-57-59_2015.dat
GEMDAQ_GTX0_Mon_Nov__2_06-01-54_2015.dat
GEMDAQ_GTX0_Mon_Nov__2_06-07-49_2015.dat
GEMDAQ_GTX0_Mon_Nov__2_06-13-03_2015.dat
GEMDAQ_GTX0_Mon_Oct_26_02-01-14_2015.dat
GEMDAQ_GTX0_Mon_Oct_26_02-56-38_2015.dat
GEMDAQ_GTX0_Mon_Oct_26_03-38-58_2015.dat
GEMDAQ_GTX0_Mon_Oct_26_07-18-13_2015.dat
GEMDAQ_GTX0_Mon_Oct_26_10-28-57_2015.dat
GEMDAQ_GTX0_Mon_Oct_26_12-20-11_2015.dat
GEMDAQ_GTX0_Mon_Oct_26_13-50-46_2015.dat
GEMDAQ_GTX0_Mon_Oct_26_13-58-21_2015.dat
GEMDAQ_GTX0_Mon_Oct_26_18-26-07_2015.dat
GEMDAQ_GTX0_Mon_Oct_26_20-22-21_2015.dat
GEMDAQ_GTX0_Mon_Oct_26_____PION_2015.dat
GEMDAQ_GTX0_Sat_Oct_24_13-24-05_2015.dat
GEMDAQ_GTX0_Sat_Oct_24_13-47-59_2015.dat
GEMDAQ_GTX0_Sat_Oct_31_05-36-53_2015.dat
GEMDAQ_GTX0_Sat_Oct_31_05-38-03_2015.dat
GEMDAQ_GTX0_Sat_Oct_31_05-39-55_2015.dat
GEMDAQ_GTX0_Sat_Oct_31_05-42-16_2015.dat
GEMDAQ_GTX0_Sat_Oct_31_05-43-21_2015.dat
GEMDAQ_GTX0_Sat_Oct_31_06-06-31_2015.dat
GEMDAQ_GTX0_Sat_Oct_31_08-23-23_2015.dat
GEMDAQ_GTX0_Sat_Oct_31_09-03-53_2015.dat
GEMDAQ_GTX0_Sat_Oct_31_09-31-38_2015.dat
GEMDAQ_GTX0_Sun_Nov__1_06-21-23_2015.dat
GEMDAQ_GTX0_Sun_Nov__1_09-20-56_2015.dat
GEMDAQ_GTX0_Sun_Nov__1_10-08-51_2015.dat
GEMDAQ_GTX0_Sun_Nov__1_10-10-22_2015.dat
GEMDAQ_GTX0_Sun_Nov__1_10-12-01_2015.dat
GEMDAQ_GTX0_Sun_Nov__1_10-16-56_2015.dat
GEMDAQ_GTX0_Sun_Nov__1_10-18-44_2015.dat
GEMDAQ_GTX0_Sun_Nov__1_10-57-58_2015.dat
GEMDAQ_GTX0_Sun_Nov__1_11-27-27_2015.dat
GEMDAQ_GTX0_Sun_Nov__1_12-13-42_2015.dat
GEMDAQ_GTX0_Sun_Nov__1_12-43-32_2015.dat
GEMDAQ_GTX0_Sun_Nov__1_13-10-54_2015.dat
GEMDAQ_GTX0_Sun_Nov__1_13-48-29_2015.dat
GEMDAQ_GTX0_Sun_Nov__1_13-51-22_2015.dat
GEMDAQ_GTX0_Sun_Nov__1_14-19-54_2015.dat
GEMDAQ_GTX0_Sun_Nov__1_14-47-55_2015.dat
GEMDAQ_GTX0_Sun_Nov__1_15-05-43_2015.dat
GEMDAQ_GTX0_Sun_Nov__1_15-10-34_2015.dat
GEMDAQ_GTX0_Sun_Nov__1_15-13-05_2015.dat
GEMDAQ_GTX0_Sun_Nov__1_15-20-39_2015.dat
GEMDAQ_GTX0_Sun_Nov__1_16-00-38_2015.dat
GEMDAQ_GTX0_Sun_Nov__1_19-23-22_2015.dat
GEMDAQ_GTX0_Sun_Oct_25_15-59-53_2015.dat
GEMDAQ_GTX0_Sun_Oct_25_20-06-29_2015.dat
GEMDAQ_GTX0_Sun_Oct_25_20-26-37_2015.dat
GEMDAQ_GTX0_Sun_Oct_25_20-46-06_2015.dat
GEMDAQ_GTX0_Sun_Oct_25_21-31-35_2015.dat
GEMDAQ_GTX0_Sun_Oct_25_22-04-12_2015.dat
GEMDAQ_GTX0_Sun_Oct_25_22-32-14_2015.dat
GEMDAQ_GTX0_Sun_Oct_25_22-51-18_2015.dat
GEMDAQ_GTX0_Sun_Oct_25_22-55-15_2015.dat
GEMDAQ_GTX0_Sun_Oct_25_23-12-12_2015.dat
GEMDAQ_GTX0_Thu_Oct_22_13-08-50_2015.dat
GEMDAQ_GTX0_Thu_Oct_22_13-17-46_2015.dat
GEMDAQ_GTX0_Thu_Oct_22_13-23-40_2015.dat
GEMDAQ_GTX0_Thu_Oct_22_20-04-49_2015.dat
GEMDAQ_GTX0_Thu_Oct_22_20-09-34_2015.dat
GEMDAQ_GTX0_Thu_Oct_22_20-33-10_2015.dat
GEMDAQ_GTX0_Thu_Oct_29_00-01-02_2015.dat
GEMDAQ_GTX0_Thu_Oct_29_00-43-43_2015.dat
GEMDAQ_GTX0_Thu_Oct_29_00-59-32_2015.dat
GEMDAQ_GTX0_Thu_Oct_29_01-16-30_2015.dat
GEMDAQ_GTX0_Thu_Oct_29_03-28-04_2015.dat
GEMDAQ_GTX0_Thu_Oct_29_04-10-57_2015.dat
GEMDAQ_GTX0_Thu_Oct_29_04-32-27_2015.dat
GEMDAQ_GTX0_Thu_Oct_29_04-33-52_2015.dat
GEMDAQ_GTX0_Thu_Oct_29_04-34-50_2015.dat
GEMDAQ_GTX0_Thu_Oct_29_04-48-41_2015.dat
GEMDAQ_GTX0_Thu_Oct_29_05-11-14_2015.dat
GEMDAQ_GTX0_Thu_Oct_29_05-24-22_2015.dat
GEMDAQ_GTX0_Thu_Oct_29_05-27-36_2015.dat
GEMDAQ_GTX0_Thu_Oct_29_05-34-34_2015.dat
GEMDAQ_GTX0_Thu_Oct_29_05-46-10_2015.dat
GEMDAQ_GTX0_Thu_Oct_29_06-11-44_2015.dat
GEMDAQ_GTX0_Thu_Oct_29_06-27-53_2015.dat
GEMDAQ_GTX0_Thu_Oct_29_09-37-07_2015.dat
GEMDAQ_GTX0_Thu_Oct_29_09-38-58_2015.dat
GEMDAQ_GTX0_Thu_Oct_29_10-46-25_2015.dat
GEMDAQ_GTX0_Thu_Oct_29_11-06-36_2015.dat
GEMDAQ_GTX0_Thu_Oct_29_11-35-27_2015.dat
GEMDAQ_GTX0_Thu_Oct_29_11-55-59_2015.dat
GEMDAQ_GTX0_Thu_Oct_29_13-07-13_2015.dat
GEMDAQ_GTX0_Tue_Nov__3_17-58-10_2015.dat
GEMDAQ_GTX0_Tue_Nov__3_18-10-33_2015.dat
GEMDAQ_GTX0_Tue_Nov__3_18-14-05_2015.dat
GEMDAQ_GTX0_Tue_Nov__3_18-18-10_2015.dat
GEMDAQ_GTX0_Tue_Nov__3_18-20-35_2015.dat
GEMDAQ_GTX0_Tue_Oct_27_01-46-29_2015.dat
GEMDAQ_GTX0_Tue_Oct_27_02-48-55_2015.dat
GEMDAQ_GTX0_Tue_Oct_27_07-46-45_2015.dat
GEMDAQ_GTX0_Tue_Oct_27_08-33-20_2015.dat
GEMDAQ_GTX0_Tue_Oct_27_12-28-03_2015.dat
GEMDAQ_GTX0_Tue_Oct_27_13-13-39_2015.dat
GEMDAQ_GTX0_Tue_Oct_27_16-26-02_2015.dat
GEMDAQ_GTX0_Tue_Oct_27_17-35-05_2015.dat
GEMDAQ_GTX0_Tue_Oct_27_18-41-49_2015.dat
GEMDAQ_GTX0_Tue_Oct_27_19-23-28_2015.dat
GEMDAQ_GTX0_Tue_Oct_27_19-31-18_2015.dat
GEMDAQ_GTX0_Tue_Oct_27_20-04-28_2015.dat
GEMDAQ_GTX0_Tue_Oct_27_22-27-42_2015.dat
GEMDAQ_GTX0_Tue_Oct_27_23-51-12_2015.dat
GEMDAQ_GTX0_Wed_Nov__4_01-45-13_2015.dat
GEMDAQ_GTX0_Wed_Nov__4_02-07-42_2015.dat
GEMDAQ_GTX0_Wed_Nov__4_02-51-49_2015.dat
GEMDAQ_GTX0_Wed_Nov__4_02-52-44_2015.dat
GEMDAQ_GTX0_Wed_Nov__4_03-33-15_2015.dat
GEMDAQ_GTX0_Wed_Nov__4_03-55-49_2015.dat
GEMDAQ_GTX0_Wed_Nov__4_04-27-25_2015.dat
GEMDAQ_GTX0_Wed_Nov__4_04-36-34_2015.dat
GEMDAQ_GTX0_Wed_Nov__4_04-42-06_2015.dat
GEMDAQ_GTX0_Wed_Nov__4_04-46-37_2015.dat
GEMDAQ_GTX0_Wed_Oct_28_01-14-17_2015.dat
GEMDAQ_GTX0_Wed_Oct_28_02-49-54_2015.dat
GEMDAQ_GTX0_Wed_Oct_28_17-12-58_2015.dat
GEMDAQ_GTX0_Wed_Oct_28_17-16-06_2015.dat
GEMDAQ_GTX0_Wed_Oct_28_17-16-30_2015.dat
GEMDAQ_GTX0_Wed_Oct_28_17-17-48_2015.dat
GEMDAQ_GTX0_Wed_Oct_28_19-55-24_2015.dat
GEMDAQ_GTX0_Wed_Oct_28_19-57-30_2015.dat
GEMDAQ_GTX0_Wed_Oct_28_20-00-02_2015.dat
GEMDAQ_GTX0_Wed_Oct_28_20-08-26_2015.dat
GEMDAQ_GTX0_Wed_Oct_28_20-29-54_2015.dat
GEMDAQ_GTX0_Wed_Oct_28_20-50-22_2015.dat
GEMDAQ_GTX0_Wed_Oct_28_21-51-01_2015.dat
GEMDAQ_GTX0_Wed_Oct_28_21-53-09_2015.dat
GEMDAQ_GTX0_Wed_Oct_28_21-57-06_2015.dat
GEMDAQ_GTX0_Wed_Oct_28_21-59-10_2015.dat
GEMDAQ_GTX0_Wed_Oct_28_22-22-13_2015.dat
GEMDAQ_GTX0_Wed_Oct_28_22-27-54_2015.dat
GEMDAQ_GTX0_Wed_Oct_28_23-22-45_2015.dat
