added closing )

15 jobs for fix_m26pivot in 4 minutes and 10 seconds (queued for 3 seconds)
Status Name Job ID Coverage
  Compilation
failed cmp:cc7-docker #15260121
docker

00:03:59

failed cmp:cc7-gcc #15260119
docker

00:02:17

failed cmp:cc7-llvm #15260122
docker

00:02:36

failed cmp:cc8-gcc #15260118
docker

00:03:02

failed cmp:lxplus-gcc #15260120
docker

00:02:30

failed cmp:mac1015-clang #15260123
mac

00:03:14

 
  Testing
canceled tst:align #15260125
docker

skipped tst:io #15260126
docker
skipped tst:sim #15260127
docker
canceled tst:tracking #15260124
docker

 
  Formatting
canceled fmt:cc7-llvm-lint #15260129
docker

00:04:09

passed fmt:centos7-llvm-format #15260128
docker

00:00:21

failed fmt:codespell #15260130
docker

00:00:22

 
  Documentation
passed cmp:doxygen #15260131
docker

00:00:20

passed cmp:usermanual #15260132
docker

00:00:45

 
Name Stage Failure
failed
fmt:codespell Formatting
$ pip install --trusted-host=pypi.org --user codespell
Collecting codespell
Downloading https://files.pythonhosted.org/packages/e0/f2/c3a9dbd0e920ac9e3d995057f06f256d748bd7f4f7366ec86e7dec8ff1af/codespell-2.1.0-py3-none-any.whl (177kB)
Installing collected packages: codespell
Successfully installed codespell-2.1.0
$ codespell --ignore-words .gitlab/ci/codespell_ignored_words.txt --quiet-level 2 --skip ".git,.gitlab,cmake,3rdparty,*.svg"
./src/modules/EventDefinitionM26/EventDefinitionM26.cpp:119: privious ==> previous
Cleaning up file based variables
ERROR: Job failed: exit code 1
failed
cmp:cc7-llvm Compilation
[148/155] Building CXX object src/exec/CMakeFiles/corry.dir/corry.cpp.o
[149/155] Linking CXX shared library src/modules/TreeWriterDUT/libCorryvreckanModuleTreeWriterDUT.so
[150/155] Building CXX object src/modules/TrackingSpatial/CMakeFiles/CorryvreckanModuleTrackingSpatial.dir/TrackingSpatial.cpp.o
[151/155] Linking CXX shared library src/modules/TrackingSpatial/libCorryvreckanModuleTrackingSpatial.so
[152/155] Building CXX object src/modules/TrackingMultiplet/CMakeFiles/CorryvreckanModuleTrackingMultiplet.dir/TrackingMultiplet.cpp.o
[153/155] Linking CXX shared library src/modules/TrackingMultiplet/libCorryvreckanModuleTrackingMultiplet.so
ninja: build stopped: cannot make progress due to previous errors.
Cleaning up file based variables
ERROR: Job failed: exit code 1
failed
cmp:lxplus-gcc Compilation
[148/155] Linking CXX shared library src/modules/TrackingSpatial/libCorryvreckanModuleTrackingSpatial.so
[149/155] Building CXX object src/modules/TreeWriterDUT/CMakeFiles/CorryvreckanModuleTreeWriterDUT.dir/TreeWriterDUT.cpp.o
[150/155] Linking CXX shared library src/modules/TreeWriterDUT/libCorryvreckanModuleTreeWriterDUT.so
[151/155] Building CXX object src/exec/CMakeFiles/corry.dir/corry.cpp.o
[152/155] Building CXX object src/modules/TrackingMultiplet/CMakeFiles/CorryvreckanModuleTrackingMultiplet.dir/TrackingMultiplet.cpp.o
[153/155] Linking CXX shared library src/modules/TrackingMultiplet/libCorryvreckanModuleTrackingMultiplet.so
ninja: build stopped: cannot make progress due to previous errors.
Cleaning up file based variables
ERROR: Job failed: exit code 1
failed
cmp:cc7-gcc Compilation
[148/155] Linking CXX shared library src/modules/TreeWriterDUT/libCorryvreckanModuleTreeWriterDUT.so
[149/155] Building CXX object src/modules/TrackingSpatial/CMakeFiles/CorryvreckanModuleTrackingSpatial.dir/TrackingSpatial.cpp.o
[150/155] Linking CXX shared library src/modules/TrackingSpatial/libCorryvreckanModuleTrackingSpatial.so
[151/155] Building CXX object src/modules/TrackingMultiplet/CMakeFiles/CorryvreckanModuleTrackingMultiplet.dir/TrackingMultiplet.cpp.o
[152/155] Linking CXX shared library src/modules/TrackingMultiplet/libCorryvreckanModuleTrackingMultiplet.so
[153/155] Building CXX object src/exec/CMakeFiles/corry.dir/corry.cpp.o
ninja: build stopped: cannot make progress due to previous errors.
Cleaning up file based variables
ERROR: Job failed: exit code 1
failed
cmp:cc7-docker Compilation
/builds/corryvreckan/corryvreckan/src/modules/EventDefinitionM26/EventDefinitionM26.cpp:123:77: error: unused parameter 'clipboard' [-Werror=unused-parameter]
void EventDefinitionM26::finalize(const std::shared_ptr<ReadonlyClipboard>& clipboard) {
~~~~~~~~~~~~~~~~~~~~~~~~~~~~~~~~~~~~~~~~~~^~~~~~~~~
cc1plus: all warnings being treated as errors
make[2]: *** [src/modules/EventDefinitionM26/CMakeFiles/CorryvreckanModuleEventDefinitionM26.dir/build.make:97: src/modules/EventDefinitionM26/CMakeFiles/CorryvreckanModuleEventDefinitionM26.dir/EventDefinitionM26.cpp.o] Error 1
make[1]: *** [CMakeFiles/Makefile2:1783: src/modules/EventDefinitionM26/CMakeFiles/CorryvreckanModuleEventDefinitionM26.dir/all] Error 2
make: *** [Makefile:183: all] Error 2
Cleaning up file based variables
ERROR: Job failed: exit code 1
failed
cmp:mac1015-clang Compilation
[148/155] Linking CXX shared library src/modules/TreeWriterDUT/libCorryvreckanModuleTreeWriterDUT.dylib
[149/155] Building CXX object src/exec/CMakeFiles/corry.dir/corry.cpp.o
[150/155] Building CXX object src/modules/TrackingSpatial/CMakeFiles/CorryvreckanModuleTrackingSpatial.dir/TrackingSpatial.cpp.o
[151/155] Linking CXX shared library src/modules/TrackingSpatial/libCorryvreckanModuleTrackingSpatial.dylib
[152/155] Building CXX object src/modules/TrackingMultiplet/CMakeFiles/CorryvreckanModuleTrackingMultiplet.dir/TrackingMultiplet.cpp.o
[153/155] Linking CXX shared library src/modules/TrackingMultiplet/libCorryvreckanModuleTrackingMultiplet.dylib
ninja: build stopped: cannot make progress due to previous errors.
Cleaning up file based variables
ERROR: Job failed: exit status 1
failed
cmp:cc8-gcc Compilation
[148/155] Linking CXX shared library src/modules/TrackingMultiplet/libCorryvreckanModuleTrackingMultiplet.so
[149/155] Building CXX object src/modules/TreeWriterDUT/CMakeFiles/CorryvreckanModuleTreeWriterDUT.dir/TreeWriterDUT.cpp.o
[150/155] Building CXX object src/exec/CMakeFiles/corry.dir/corry.cpp.o
[151/155] Linking CXX shared library src/modules/TreeWriterDUT/libCorryvreckanModuleTreeWriterDUT.so
[152/155] Building CXX object src/modules/TrackingSpatial/CMakeFiles/CorryvreckanModuleTrackingSpatial.dir/TrackingSpatial.cpp.o
[153/155] Linking CXX shared library src/modules/TrackingSpatial/libCorryvreckanModuleTrackingSpatial.so
ninja: build stopped: cannot make progress due to previous errors.
Cleaning up file based variables
ERROR: Job failed: exit code 1