Merge branch 'master' of https://gitlab.cern.ch/eos/quarkdb

11 jobs for master in 83 minutes and 15 seconds (queued for 1 second)
latest
Status Name Job ID Coverage
  Koji
manual cc7-koji-scratch #8012992
allowed to fail manual
 
  Build
passed c8 #8012994

00:20:06

passed cc7 #8012995

00:23:13

passed fedora #8012996

00:20:24

passed fedora-tsan #8012997

00:22:31

passed make-docs #8012993

00:02:02

 
  Test
passed c8-test #8013000

00:06:56

failed cc7-test #8012999

00:02:00

passed fedora-test #8013001

00:06:53

failed fedora-tsan-test #8013002

01:00:01

passed ubuntu-asan #8012998

00:35:24

 
Name Stage Failure
failed
fedora-tsan-test Test The script exceeded the maximum execution time set for the job
[1587100092379] WARNING: My commit index is 50746 entries behind that of the leader.
[1587100102678] WARNING: My commit index is 34362 entries behind that of the leader.
[1587100112930] WARNING: My commit index is 17466 entries behind that of the leader.
[1587100117390] INFO: No longer lagging significantly behind the leader. (9786 entries)
[1587100123369] INFO: Achieved full consensus with journal size 1000001
[1587100123369] INFO: Condition 'checkFullConsensus(0, 1, 2)' is true after 57844 attempts
[1587100123369] INFO: Cross-checking journals from entry #0 to #1000001
Pulling docker image gitlab/gitlab-runner-helper:x86_64-1b659122 ...
ERROR: Job failed: execution took longer than 1h0m0s seconds
failed
cc7-test Test
[1587097114926] INFO: Closing state machine '/tmp/quarkdb-tests/server4-23460/current/state-machine'
[1587097114928] INFO: Closing raft journal '/tmp/quarkdb-tests/server4-23460/current/raft-journal'
[==========] 325 tests from 98 test cases ran. (17669 ms total)
[ PASSED ] 324 tests.
[ FAILED ] 1 test, listed below:
[ FAILED ] Raft_e2e.coup

1 FAILED TEST
ERROR: Job failed: exit code 1