module gitlab.cern.ch/drupal/paas/drupalsite-operator

go 1.21

require (
	github.com/asaskevich/govalidator v0.0.0-20190424111038-f61b66f89f4a
	github.com/go-logr/logr v0.4.0
	github.com/google/go-containerregistry v0.7.0
	github.com/onsi/ginkgo v1.16.4
	github.com/onsi/gomega v1.13.0
	github.com/openshift/api v0.0.0-20210127195806-54e5e88cf848
	github.com/operator-framework/operator-lib v0.1.0
	github.com/tektoncd/pipeline v0.26.0
	github.com/vmware-tanzu/velero v1.6.1
	gitlab.cern.ch/drupal/paas/dbod-operator v0.0.0-20210525082629-c9e903df3b0e
	gitlab.cern.ch/paas-tools/operators/authz-operator v0.0.0-20210512233547-21c01c7dd5e5
	k8s.io/api v0.21.2
	k8s.io/apimachinery v0.21.2
	k8s.io/client-go v0.21.2
	k8s.io/utils v0.0.0-20210527160623-6fdb442a123b
	knative.dev/pkg v0.0.0-20210510175900-4564797bf3b7
	sigs.k8s.io/controller-runtime v0.9.2
)

require (
	cloud.google.com/go v0.99.0 // indirect
	cloud.google.com/go/container v1.0.0 // indirect
	cloud.google.com/go/monitoring v1.2.0 // indirect
	cloud.google.com/go/trace v1.0.0 // indirect
	github.com/Azure/go-autorest v14.2.0+incompatible // indirect
	github.com/Azure/go-autorest/autorest v0.11.12 // indirect
	github.com/Azure/go-autorest/autorest/adal v0.9.5 // indirect
	github.com/Azure/go-autorest/autorest/date v0.3.0 // indirect
	github.com/Azure/go-autorest/logger v0.2.0 // indirect
	github.com/Azure/go-autorest/tracing v0.6.0 // indirect
	github.com/PuerkitoBio/purell v1.1.1 // indirect
	github.com/PuerkitoBio/urlesc v0.0.0-20170810143723-de5bf2ad4578 // indirect
	github.com/beorn7/perks v1.0.1 // indirect
	github.com/cespare/xxhash/v2 v2.1.1 // indirect
	github.com/containerd/stargz-snapshotter/estargz v0.10.0 // indirect
	github.com/davecgh/go-spew v1.1.1 // indirect
	github.com/docker/cli v20.10.10+incompatible // indirect
	github.com/docker/distribution v2.7.1+incompatible // indirect
	github.com/docker/docker v20.10.10+incompatible // indirect
	github.com/docker/docker-credential-helpers v0.6.4 // indirect
	github.com/emicklei/go-restful v2.15.0+incompatible // indirect
	github.com/evanphx/json-patch v4.11.0+incompatible // indirect
	github.com/form3tech-oss/jwt-go v3.2.2+incompatible // indirect
	github.com/fsnotify/fsnotify v1.4.9 // indirect
	github.com/ghodss/yaml v1.0.0 // indirect
	github.com/go-logr/zapr v0.4.0 // indirect
	github.com/go-openapi/jsonpointer v0.19.5 // indirect
	github.com/go-openapi/jsonreference v0.19.5 // indirect
	github.com/go-openapi/spec v0.20.2 // indirect
	github.com/go-openapi/swag v0.19.13 // indirect
	github.com/gogo/protobuf v1.3.2 // indirect
	github.com/golang/groupcache v0.0.0-20200121045136-8c9f03a8e57e // indirect
	github.com/golang/protobuf v1.5.2 // indirect
	github.com/google/go-cmp v0.5.6 // indirect
	github.com/google/gofuzz v1.2.0 // indirect
	github.com/google/uuid v1.2.0 // indirect
	github.com/googleapis/gnostic v0.5.5 // indirect
	github.com/hashicorp/golang-lru v0.5.4 // indirect
	github.com/imdario/mergo v0.3.12 // indirect
	github.com/josharian/intern v1.0.0 // indirect
	github.com/json-iterator/go v1.1.11 // indirect
	github.com/klauspost/compress v1.13.6 // indirect
	github.com/mailru/easyjson v0.7.6 // indirect
	github.com/matttproud/golang_protobuf_extensions v1.0.2-0.20181231171920-c182affec369 // indirect
	github.com/moby/spdystream v0.2.0 // indirect
	github.com/modern-go/concurrent v0.0.0-20180306012644-bacd9c7ef1dd // indirect
	github.com/modern-go/reflect2 v1.0.1 // indirect
	github.com/nxadm/tail v1.4.8 // indirect
	github.com/opencontainers/go-digest v1.0.0 // indirect
	github.com/opencontainers/image-spec v1.0.2-0.20210730191737-8e42a01fb1b7 // indirect
	github.com/pkg/errors v0.9.1 // indirect
	github.com/prometheus/client_golang v1.11.0 // indirect
	github.com/prometheus/client_model v0.2.0 // indirect
	github.com/prometheus/common v0.26.0 // indirect
	github.com/prometheus/procfs v0.6.0 // indirect
	github.com/sirupsen/logrus v1.8.1 // indirect
	github.com/spf13/pflag v1.0.5 // indirect
	github.com/vbatts/tar-split v0.11.2 // indirect
	go.uber.org/atomic v1.7.0 // indirect
	go.uber.org/multierr v1.6.0 // indirect
	go.uber.org/zap v1.17.0 // indirect
	golang.org/x/crypto v0.0.0-20210415154028-4f45737414dc // indirect
	golang.org/x/net v0.0.0-20211111160137-58aab5ef257a // indirect
	golang.org/x/oauth2 v0.0.0-20211104180415-d3ed0bb246c8 // indirect
	golang.org/x/sync v0.0.0-20210220032951-036812b2e83c // indirect
	golang.org/x/sys v0.0.0-20211210111614-af8b64212486 // indirect
	golang.org/x/term v0.0.0-20210220032956-6a3ed077a48d // indirect
	golang.org/x/text v0.3.6 // indirect
	golang.org/x/time v0.0.0-20210611083556-38a9dc6acbc6 // indirect
	gomodules.xyz/jsonpatch/v2 v2.2.0 // indirect
	google.golang.org/api v0.63.0 // indirect
	google.golang.org/appengine v1.6.7 // indirect
	google.golang.org/protobuf v1.27.1 // indirect
	gopkg.in/evanphx/json-patch.v4 v4.9.0 // indirect
	gopkg.in/inf.v0 v0.9.1 // indirect
	gopkg.in/tomb.v1 v1.0.0-20141024135613-dd632973f1e7 // indirect
	gopkg.in/yaml.v2 v2.4.0 // indirect
	gopkg.in/yaml.v3 v3.0.0-20210107192922-496545a6307b // indirect
	k8s.io/apiextensions-apiserver v0.21.2 // indirect
	k8s.io/component-base v0.21.2 // indirect
	k8s.io/klog/v2 v2.8.0 // indirect
	k8s.io/kube-openapi v0.0.0-20210305001622-591a79e4bda7 // indirect
	sigs.k8s.io/structured-merge-diff/v4 v4.1.0 // indirect
	sigs.k8s.io/yaml v1.2.0 // indirect
)
