1089	29000	47.869
874	28000	46.930
658	27000	45.964
443	26000	44.976
228	25000	43.971
0	23988	42.941
-200	23084	42.013
-400	22155	41.054
-600	21220	40.085
-800	20282	39.109
-1000	19347	38.136
-1200	18407	37.157
-1400	17470	36.181
-1600	16532	35.205
-1800	15597	34.233
-2000	14657	33.256
-2200	13724	32.288
-2400	12787	31.316
-2600	11857	30.353
-2800	10920	29.382
-3000	9991	28.420
-3200	9055	27.451
-3400	8126	26.488
-3600	7192	25.521
-3800	6265	24.559
-4000	5329	23.588
-4200	4400	22.623
-4400	3466	21.651
-4600	2541	20.688
-4800	1609	19.717
-5000	687	18.755
-5200	-242	17.786
-5400	-1166	16.822
-5600	-2096	15.850
-5800	-3018	14.886
-6000	-3948	13.914
-6200	-4869	12.951
-6400	-5796	11.982
-6600	-6717	11.019
-6800	-7645	10.048
-7000	-8565	9.085
-7200	-9489	8.116
-7400	-10404	7.155
-7600	-11326	6.184
-7800	-12243	5.215
-8000	-13165	4.235
-8200	-14081	3.254
-8400	-15005	2.256
-8600	-15921	1.254
-8700	-16386	0.740
-8800	-16847	0.227
-8900	-17308	-0.291
-9000	-17764	-0.809
-9036	-18000	-1.079
-9251	-19000	-2.242
-9466	-20000	-3.440
-9682	-21000	-4.679
-9897	-22000	-5.969
-10113	-23000	-7.319