-1	29000	47.703
-1	28000	46.668
-1	27000	45.649
-1	26000	44.645
-1	25000	43.652
-1	24000	42.669
-200	22815	41.514
-400	21806	40.538
-600	20789	39.560
-800	19771	38.585
-1000	18754	37.614
-1200	17736	36.645
-1400	16711	35.671
-1600	15698	34.709
-1800	14669	33.732
-2000	13654	32.769
-2200	12634	31.801
-2400	11614	30.833
-2600	10587	29.858
-2800	9573	28.894
-3000	8551	27.922
-3200	7539	26.959
-3400	6519	25.988
-3600	5505	25.022
-3800	4486	24.051
-4000	3475	23.087
-4200	2458	22.117
-4400	1443	21.149
-4600	426	20.180
-4800	-587	19.214
-5000	-1604	18.244
-5200	-2618	17.277
-5400	-3636	16.307
-5600	-4650	15.341
-5800	-5670	14.369
-6000	-6681	13.407
-6200	-7698	12.438
-6400	-8713	11.472
-6600	-9727	10.506
-6800	-10740	9.541
-7000	-11756	8.573
-7200	-12768	7.608
-7400	-13784	6.638
-7600	-14803	5.664
-7800	-15816	4.694
-8000	-16830	3.721
-8200	-17852	2.739
-8400	-18867	1.760
-8500	-19383	1.261
-8600	-19886	0.775
-8700	-20397	0.279
-8800	-20905	-0.214
-8900	-21415	-0.711
-9000	-21921	-1.204
-9100	-22435	-1.706
-9120	-22535	-1.804
-1	-23000	-2.260
-1	-24000	-3.243
-1	-25000	-4.231
-1	-26000	-5.224
-1	-27000	-6.222
-1	-28000	-7.227
