1347	33000	47.324
955	31000	45.389
563	29000	43.462
367	28000	42.502
170	27000	41.543
0	26090	40.671
-200	25116	39.739
-400	24115	38.783
-600	23097	37.811
-800	22081	36.842
-1000	21054	35.863
-1200	20037	34.894
-1400	19006	33.911
-1600	17985	32.939
-1800	16956	31.959
-2000	15941	30.991
-2200	14909	30.009
-2400	13894	29.042
-2600	12874	28.069
-2800	11853	27.096
-3000	10830	26.121
-3200	9822	25.160
-3400	8793	24.178
-3600	7779	23.211
-3800	6753	22.232
-4000	5737	21.262
-4200	4718	20.289
-4400	3705	19.323
-4600	2666	18.332
-4800	1654	17.366
-5000	632	16.392
-5200	-387	15.420
-5400	-1410	14.445
-5600	-2432	13.470
-5800	-3456	12.494
-6000	-4472	11.527
-6200	-5497	10.550
-6400	-6508	9.586
-6600	-7534	8.607
-6800	-8551	7.637
-7000	-9572	6.661
-7200	-10590	5.688
-7400	-11609	4.711
-7600	-12622	3.739
-7700	-13130	3.250
-7800	-13639	2.758
-7900	-14147	2.268
-8000	-14651	1.780
-8100	-15158	1.288
-8200	-15667	0.793
-8300	-16174	0.298
-8400	-16677	-0.194
-8500	-17182	-0.690
-8600	-17690	-1.190
-8700	-18169	-1.663
-8800	-18701	-2.192
-8900	-19209	-2.698
-9049	-20000	-3.492
-9245	-21000	-4.504
-9441	-22000	-5.529
-9638	-23000	-6.568
-9834	-24000	-7.623