-1	31000	45.400
-1	30000	44.442
-1	29000	43.485
-1	28000	42.528
-1	27000	41.571
-1	26000	40.615
-200	25087	39.743
-400	24078	38.779
-600	23062	37.809
-800	22053	36.846
-1000	21022	35.863
-1200	20002	34.890
-1400	18976	33.912
-1600	17961	32.944
-1800	16925	31.957
-2000	15908	30.988
-2200	14886	30.014
-2400	13865	29.041
-2600	12841	28.064
-2800	11831	27.101
-3000	10803	26.121
-3200	9791	25.156
-3400	8769	24.181
-3600	7749	23.208
-3800	6722	22.228
-4000	5713	21.265
-4200	4692	20.290
-4400	3677	19.322
-4600	2640	18.332
-4800	1628	17.366
-5000	606	16.391
-5200	-411	15.421
-5400	-1431	14.448
-5600	-2455	13.471
-5800	-3479	12.494
-6000	-4492	11.528
-6200	-5517	10.551
-6400	-6532	9.583
-6600	-7554	8.607
-6800	-8572	7.636
-7000	-9593	6.660
-7200	-10609	5.688
-7400	-11629	4.710
-7600	-12641	3.738
-7700	-13149	3.249
-7800	-13658	2.758
-7900	-14165	2.269
-8000	-14669	1.781
-8100	-15176	1.289
-8200	-15686	0.793
-8300	-16190	0.301
-8400	-16693	-0.191
-8500	-17200	-0.688
-8600	-17705	-1.185
-8700	-18210	-1.685
-8800	-18716	-2.187
-8900	-19224	-2.693
-1	-20000	-3.472
-1	-21000	-4.486
-1	-22000	-5.512
-1	-23000	-6.552
-1	-24000	-7.609
