738	26000	45.544
541	25000	44.576
343	24000	43.606
147	23000	42.635
0	22239	41.894
-400	20245	39.953
-800	18217	37.973
-1200	16190	35.991
-1600	14165	34.007
-2000	12140	32.021
-2400	10114	30.029
-2800	8088	28.037
-3200	6065	26.045
-3600	4047	24.056
-4000	2029	22.068
-4400	17	20.084
-4800	-1993	18.101
-5200	-4011	16.112
-5600	-6027	14.124
-6000	-8053	12.128
-6400	-10079	10.133
-6800	-12115	8.131
-7200	-14150	6.131
-7600	-16179	4.140
-8000	-18210	2.151
-8200	-19213	1.170
-8400	-20236	0.170
-8600	-21241	-0.811
-8800	-22264	-1.808
-9000	-23271	-2.789
-9041	-23484	-2.996
-9141	-24000	-3.499
-9338	-25000	-4.471
-9534	-26000	-5.442
-9730	-27000	-6.411