%TF.GenerationSoftware,Altium Limited,Altium Designer,19.1.5 (86)*%
G04 Layer_Physical_Order=4*
G04 Layer_Color=16711680*
%FSLAX26Y26*%
%MOIN*%
%TF.FileFunction,Copper,L4,Bot,Signal*%
%TF.Part,Single*%
G01*
G75*
%TA.AperFunction,Conductor*%
%ADD16C,0.050000*%
%ADD17C,0.010000*%
%TA.AperFunction,ComponentPad*%
%ADD18C,0.066929*%
%ADD19C,0.062992*%
%ADD20C,0.181102*%
%ADD21C,0.078740*%
%ADD22R,0.059055X0.059055*%
%ADD23C,0.059055*%
%ADD25C,0.149606*%
%TA.AperFunction,ViaPad*%
%ADD26C,0.175197*%
%ADD27C,0.047244*%
%ADD28C,0.039370*%
%TA.AperFunction,ComponentPad*%
%ADD29C,0.200787*%
G36*
X595000Y2702333D02*
X542563D01*
X540097Y2707333D01*
X544892Y2713582D01*
X549494Y2724692D01*
X551063Y2736614D01*
X549494Y2748536D01*
X544892Y2759646D01*
X537572Y2769186D01*
X528032Y2776506D01*
X516922Y2781108D01*
X505000Y2782677D01*
X493078Y2781108D01*
X481969Y2776506D01*
X472428Y2769186D01*
X465108Y2759646D01*
X460507Y2748536D01*
X458937Y2736614D01*
X460507Y2724692D01*
X465108Y2713582D01*
X472428Y2704042D01*
X473897Y2702915D01*
X473734Y2697918D01*
X472744Y2697256D01*
X455546Y2680059D01*
X452432Y2681595D01*
X451021Y2682605D01*
X449494Y2694206D01*
X444892Y2705315D01*
X437572Y2714855D01*
X428032Y2722175D01*
X416922Y2726777D01*
X405000Y2728347D01*
X393078Y2726777D01*
X381969Y2722175D01*
X372428Y2714855D01*
X365108Y2705315D01*
X360506Y2694206D01*
X358937Y2682284D01*
X360506Y2670361D01*
X365108Y2659252D01*
X371988Y2650286D01*
X370856Y2645286D01*
X347252D01*
X344892Y2650984D01*
X337572Y2660524D01*
X328032Y2667845D01*
X316922Y2672447D01*
X305000Y2674016D01*
X293078Y2672447D01*
X281968Y2667845D01*
X272428Y2660524D01*
X265108Y2650984D01*
X260506Y2639875D01*
X258937Y2627953D01*
X260506Y2616031D01*
X265108Y2604921D01*
X272428Y2595381D01*
X281968Y2588061D01*
X293078Y2583459D01*
X305000Y2581890D01*
X316922Y2583459D01*
X328032Y2588061D01*
X337572Y2595381D01*
X344892Y2604921D01*
X347252Y2610620D01*
X370856D01*
X371988Y2605620D01*
X365108Y2596654D01*
X360506Y2585544D01*
X358937Y2573622D01*
X360506Y2561700D01*
X365108Y2550590D01*
X372428Y2541050D01*
X381969Y2533730D01*
X393078Y2529128D01*
X405000Y2527559D01*
X416922Y2529128D01*
X428032Y2533730D01*
X437572Y2541050D01*
X444892Y2550590D01*
X449494Y2561700D01*
X451063Y2573622D01*
X449494Y2585544D01*
X444892Y2596654D01*
X437572Y2606194D01*
X435885Y2607488D01*
X436570Y2613265D01*
X440209Y2615697D01*
X454603Y2630090D01*
X456209Y2629298D01*
X459007Y2627423D01*
X460507Y2616030D01*
X465108Y2604921D01*
X472428Y2595381D01*
X481969Y2588061D01*
X493078Y2583459D01*
X505000Y2581889D01*
X516922Y2583459D01*
X528032Y2588061D01*
X537572Y2595381D01*
X544892Y2604921D01*
X549494Y2616030D01*
X551063Y2627953D01*
X549494Y2639875D01*
X544892Y2650984D01*
X537572Y2660524D01*
X534434Y2662932D01*
X536041Y2667667D01*
X595000D01*
Y2482333D01*
X539213D01*
X538043Y2487333D01*
X544892Y2496260D01*
X549494Y2507369D01*
X551063Y2519291D01*
X549494Y2531213D01*
X544892Y2542323D01*
X537572Y2551863D01*
X528032Y2559183D01*
X516922Y2563785D01*
X505000Y2565354D01*
X493078Y2563785D01*
X481969Y2559183D01*
X472428Y2551863D01*
X465108Y2542323D01*
X460507Y2531213D01*
X458937Y2519291D01*
X460507Y2507369D01*
X465108Y2496260D01*
X472428Y2486720D01*
X473652Y2485780D01*
X472450Y2480401D01*
X467744Y2477256D01*
X455991Y2465504D01*
X450751Y2467335D01*
X449494Y2476883D01*
X444892Y2487992D01*
X437572Y2497532D01*
X428032Y2504853D01*
X416922Y2509454D01*
X405000Y2511024D01*
X393078Y2509454D01*
X381969Y2504853D01*
X372428Y2497532D01*
X365108Y2487992D01*
X360506Y2476883D01*
X358937Y2464961D01*
X360506Y2453039D01*
X365108Y2441929D01*
X371988Y2432963D01*
X370856Y2427963D01*
X347252D01*
X344892Y2433661D01*
X337572Y2443201D01*
X328032Y2450522D01*
X316922Y2455123D01*
X305000Y2456693D01*
X293078Y2455123D01*
X281968Y2450522D01*
X272428Y2443201D01*
X265108Y2433661D01*
X260506Y2422552D01*
X258937Y2410630D01*
X260506Y2398707D01*
X265108Y2387598D01*
X272428Y2378058D01*
X281968Y2370738D01*
X293078Y2366136D01*
X305000Y2364566D01*
X316922Y2366136D01*
X328032Y2370738D01*
X337572Y2378058D01*
X344892Y2387598D01*
X347252Y2393297D01*
X370855D01*
X371988Y2388297D01*
X365108Y2379331D01*
X360506Y2368221D01*
X358937Y2356299D01*
X360506Y2344377D01*
X365108Y2333267D01*
X372428Y2323727D01*
X381969Y2316407D01*
X393078Y2311805D01*
X405000Y2310236D01*
X416922Y2311805D01*
X428032Y2316407D01*
X437572Y2323727D01*
X444892Y2333267D01*
X449494Y2344377D01*
X451063Y2356299D01*
X449494Y2368221D01*
X444892Y2379331D01*
X437572Y2388871D01*
X435288Y2390624D01*
X435489Y2396772D01*
X437886Y2398373D01*
X454771Y2415258D01*
X459255Y2413047D01*
X458937Y2410630D01*
X460507Y2398708D01*
X465108Y2387598D01*
X472428Y2378058D01*
X481969Y2370738D01*
X493078Y2366136D01*
X505000Y2364566D01*
X516922Y2366136D01*
X528032Y2370738D01*
X537572Y2378058D01*
X544892Y2387598D01*
X549494Y2398708D01*
X551063Y2410630D01*
X549494Y2422552D01*
X544892Y2433661D01*
X537982Y2442667D01*
X539055Y2447572D01*
X539088Y2447667D01*
X595000D01*
Y2262333D01*
X536144D01*
X534537Y2267068D01*
X537572Y2269397D01*
X544892Y2278937D01*
X549494Y2290046D01*
X551063Y2301968D01*
X549494Y2313890D01*
X544892Y2325000D01*
X537572Y2334540D01*
X528032Y2341860D01*
X516922Y2346462D01*
X505000Y2348032D01*
X493078Y2346462D01*
X481969Y2341860D01*
X472428Y2334540D01*
X465108Y2325000D01*
X460507Y2313890D01*
X458937Y2301968D01*
X460507Y2290046D01*
X465108Y2278937D01*
X472428Y2269397D01*
X476022Y2266640D01*
X474775Y2261294D01*
X473367Y2261014D01*
X467744Y2257256D01*
X455492Y2245005D01*
X451008Y2247216D01*
X451063Y2247638D01*
X449494Y2259560D01*
X444892Y2270669D01*
X437572Y2280209D01*
X428032Y2287530D01*
X416922Y2292131D01*
X405000Y2293701D01*
X393078Y2292131D01*
X381969Y2287530D01*
X372428Y2280209D01*
X365108Y2270669D01*
X360506Y2259560D01*
X358937Y2247638D01*
X360506Y2235716D01*
X365108Y2224606D01*
X371988Y2215640D01*
X370856Y2210640D01*
X347252D01*
X344892Y2216338D01*
X337572Y2225878D01*
X328032Y2233199D01*
X316922Y2237800D01*
X305000Y2239370D01*
X293078Y2237800D01*
X281968Y2233199D01*
X272428Y2225878D01*
X265108Y2216338D01*
X260506Y2205229D01*
X258937Y2193307D01*
X260506Y2181385D01*
X265108Y2170275D01*
X272428Y2160735D01*
X281968Y2153415D01*
X293078Y2148813D01*
X305000Y2147244D01*
X316922Y2148813D01*
X328032Y2153415D01*
X337572Y2160735D01*
X344892Y2170275D01*
X347252Y2175974D01*
X370855D01*
X371988Y2170974D01*
X365108Y2162008D01*
X360506Y2150898D01*
X358937Y2138976D01*
X360506Y2127054D01*
X365108Y2115945D01*
X372428Y2106405D01*
X381969Y2099084D01*
X393078Y2094483D01*
X405000Y2092913D01*
X416922Y2094483D01*
X428032Y2099084D01*
X437572Y2106405D01*
X444892Y2115945D01*
X449494Y2127054D01*
X451063Y2138976D01*
X449494Y2150898D01*
X444892Y2162008D01*
X437572Y2171548D01*
X435959Y2172786D01*
X436735Y2178493D01*
X440563Y2181050D01*
X454643Y2195131D01*
X459048Y2192464D01*
X460507Y2181385D01*
X465108Y2170275D01*
X472428Y2160735D01*
X481969Y2153415D01*
X493078Y2148813D01*
X505000Y2147244D01*
X516922Y2148813D01*
X528032Y2153415D01*
X537572Y2160735D01*
X544892Y2170275D01*
X549494Y2181385D01*
X551063Y2193307D01*
X549494Y2205229D01*
X544892Y2216339D01*
X540036Y2222667D01*
X542502Y2227667D01*
X595000D01*
Y2064513D01*
X577820Y2047333D01*
X539171D01*
X538054Y2050624D01*
X537771Y2052333D01*
X544892Y2061614D01*
X549494Y2072724D01*
X551063Y2084646D01*
X549494Y2096568D01*
X544892Y2107677D01*
X537572Y2117217D01*
X528032Y2124538D01*
X516922Y2129139D01*
X505000Y2130709D01*
X493078Y2129139D01*
X481969Y2124538D01*
X472428Y2117217D01*
X465108Y2107677D01*
X460507Y2096568D01*
X458937Y2084646D01*
X460507Y2072724D01*
X465108Y2061614D01*
X472428Y2052074D01*
X474019Y2050853D01*
X472697Y2045566D01*
X467744Y2042256D01*
X467743Y2042256D01*
X455862Y2030374D01*
X450792Y2032376D01*
X449494Y2042237D01*
X444892Y2053347D01*
X437572Y2062887D01*
X428032Y2070207D01*
X416922Y2074809D01*
X405000Y2076378D01*
X393078Y2074809D01*
X381969Y2070207D01*
X372428Y2062887D01*
X365108Y2053347D01*
X360506Y2042237D01*
X358937Y2030315D01*
X360506Y2018393D01*
X365108Y2007283D01*
X371988Y1998317D01*
X370856Y1993317D01*
X347252D01*
X344892Y1999016D01*
X337572Y2008556D01*
X328032Y2015876D01*
X316922Y2020478D01*
X305000Y2022047D01*
X293078Y2020478D01*
X281968Y2015876D01*
X272428Y2008556D01*
X265108Y1999016D01*
X260506Y1987906D01*
X258937Y1975984D01*
X260506Y1964062D01*
X265108Y1952952D01*
X272428Y1943412D01*
X281968Y1936092D01*
X293078Y1931490D01*
X305000Y1929921D01*
X316922Y1931490D01*
X328032Y1936092D01*
X337572Y1943412D01*
X344892Y1952952D01*
X347252Y1958651D01*
X370855D01*
X371988Y1953651D01*
X365108Y1944685D01*
X360506Y1933576D01*
X358937Y1921653D01*
X360506Y1909731D01*
X365108Y1898622D01*
X372428Y1889082D01*
X381969Y1881762D01*
X393078Y1877160D01*
X405000Y1875590D01*
X416922Y1877160D01*
X428032Y1881762D01*
X437572Y1889082D01*
X444892Y1898622D01*
X449494Y1909731D01*
X451063Y1921653D01*
X449494Y1933576D01*
X444892Y1944685D01*
X437572Y1954225D01*
X435680Y1955677D01*
X435881Y1961825D01*
X437256Y1962744D01*
X454717Y1980204D01*
X459201Y1977993D01*
X458937Y1975984D01*
X460507Y1964062D01*
X465108Y1952953D01*
X472428Y1943412D01*
X481969Y1936092D01*
X493078Y1931490D01*
X505000Y1929921D01*
X516922Y1931490D01*
X528032Y1936092D01*
X537572Y1943412D01*
X544892Y1952953D01*
X549494Y1964062D01*
X551063Y1975984D01*
X549494Y1987906D01*
X544892Y1999016D01*
X538254Y2007667D01*
X539690Y2012667D01*
X585000D01*
X590000Y2013661D01*
X595000Y2010680D01*
Y1832333D01*
X542019D01*
X539553Y1837333D01*
X544892Y1844291D01*
X549494Y1855401D01*
X551063Y1867323D01*
X549494Y1879245D01*
X544892Y1890354D01*
X537572Y1899894D01*
X528032Y1907215D01*
X516922Y1911816D01*
X505000Y1913386D01*
X493078Y1911816D01*
X481969Y1907215D01*
X472428Y1899894D01*
X465108Y1890354D01*
X460507Y1879245D01*
X458937Y1867323D01*
X460507Y1855401D01*
X465108Y1844291D01*
X471470Y1836000D01*
X471604Y1834816D01*
X471127Y1831589D01*
X470457Y1829961D01*
X466409Y1827256D01*
X455646Y1816493D01*
X450367Y1818285D01*
X449494Y1824914D01*
X444892Y1836024D01*
X437572Y1845564D01*
X428032Y1852884D01*
X416922Y1857486D01*
X405000Y1859055D01*
X393078Y1857486D01*
X381969Y1852884D01*
X372428Y1845564D01*
X365108Y1836024D01*
X360506Y1824914D01*
X358937Y1812992D01*
X360506Y1801070D01*
X365108Y1789960D01*
X371988Y1780994D01*
X370856Y1775994D01*
X347252D01*
X344892Y1781693D01*
X337572Y1791233D01*
X328032Y1798553D01*
X316922Y1803155D01*
X305000Y1804725D01*
X293078Y1803155D01*
X281968Y1798553D01*
X272428Y1791233D01*
X265108Y1781693D01*
X260506Y1770583D01*
X258937Y1758661D01*
X260506Y1746739D01*
X265108Y1735630D01*
X272428Y1726090D01*
X281968Y1718769D01*
X293078Y1714168D01*
X305000Y1712598D01*
X316922Y1714168D01*
X328032Y1718769D01*
X337572Y1726090D01*
X344892Y1735630D01*
X347252Y1741328D01*
X370855D01*
X371988Y1736328D01*
X365108Y1727362D01*
X360506Y1716253D01*
X358937Y1704331D01*
X360506Y1692409D01*
X365108Y1681299D01*
X372428Y1671759D01*
X381969Y1664439D01*
X393078Y1659837D01*
X405000Y1658267D01*
X416922Y1659837D01*
X428032Y1664439D01*
X437572Y1671759D01*
X444892Y1681299D01*
X449494Y1692409D01*
X451063Y1704331D01*
X449494Y1716253D01*
X444892Y1727362D01*
X437572Y1736902D01*
X432966Y1740437D01*
X433130Y1745434D01*
X434583Y1746405D01*
X454963Y1766785D01*
X459699Y1764450D01*
X458937Y1758661D01*
X460507Y1746739D01*
X465108Y1735630D01*
X472428Y1726090D01*
X481969Y1718769D01*
X493078Y1714168D01*
X505000Y1712598D01*
X516922Y1714168D01*
X528032Y1718769D01*
X537572Y1726090D01*
X544892Y1735630D01*
X549494Y1746739D01*
X551063Y1758661D01*
X549494Y1770583D01*
X544892Y1781693D01*
X537572Y1791233D01*
X535357Y1792932D01*
X536965Y1797667D01*
X595000D01*
Y1612333D01*
X538709D01*
X537102Y1617068D01*
X537572Y1617428D01*
X544892Y1626968D01*
X549494Y1638078D01*
X551063Y1650000D01*
X549494Y1661922D01*
X544892Y1673032D01*
X537572Y1682572D01*
X528032Y1689892D01*
X516922Y1694494D01*
X505000Y1696063D01*
X493078Y1694494D01*
X481969Y1689892D01*
X472428Y1682572D01*
X465108Y1673032D01*
X460507Y1661922D01*
X458937Y1650000D01*
X460507Y1638078D01*
X465108Y1626968D01*
X472428Y1617428D01*
X473158Y1616868D01*
X471912Y1611522D01*
X469355Y1611014D01*
X463732Y1607256D01*
X455646Y1599170D01*
X450367Y1600962D01*
X449494Y1607591D01*
X444892Y1618701D01*
X437572Y1628241D01*
X428032Y1635561D01*
X416922Y1640163D01*
X405000Y1641733D01*
X393078Y1640163D01*
X381969Y1635561D01*
X372428Y1628241D01*
X365108Y1618701D01*
X360506Y1607591D01*
X358937Y1595669D01*
X360506Y1583747D01*
X365108Y1572638D01*
X371988Y1563671D01*
X370856Y1558671D01*
X347252D01*
X344892Y1564370D01*
X337572Y1573910D01*
X328032Y1581230D01*
X316922Y1585832D01*
X305000Y1587402D01*
X293078Y1585832D01*
X281968Y1581230D01*
X272428Y1573910D01*
X265108Y1564370D01*
X260506Y1553261D01*
X258937Y1541338D01*
X260506Y1529416D01*
X265108Y1518307D01*
X272428Y1508767D01*
X281968Y1501446D01*
X293078Y1496845D01*
X305000Y1495275D01*
X316922Y1496845D01*
X328032Y1501446D01*
X337572Y1508767D01*
X344892Y1518307D01*
X347252Y1524005D01*
X370855D01*
X371988Y1519005D01*
X365108Y1510040D01*
X360506Y1498930D01*
X358937Y1487008D01*
X360506Y1475086D01*
X365108Y1463976D01*
X372428Y1454436D01*
X381969Y1447116D01*
X393078Y1442514D01*
X405000Y1440945D01*
X416922Y1442514D01*
X428032Y1447116D01*
X437572Y1454436D01*
X444892Y1463976D01*
X449494Y1475086D01*
X451063Y1487008D01*
X449494Y1498930D01*
X444892Y1510040D01*
X437572Y1519580D01*
X432966Y1523114D01*
X433130Y1528111D01*
X434583Y1529082D01*
X454963Y1549463D01*
X459699Y1547127D01*
X458937Y1541338D01*
X460507Y1529416D01*
X465108Y1518307D01*
X472428Y1508767D01*
X481969Y1501446D01*
X493078Y1496845D01*
X505000Y1495275D01*
X516922Y1496845D01*
X528032Y1501446D01*
X537572Y1508767D01*
X544892Y1518307D01*
X549494Y1529416D01*
X551063Y1541338D01*
X549494Y1553261D01*
X544892Y1564370D01*
X538526Y1572667D01*
X540304Y1577667D01*
X595000D01*
Y1409513D01*
X582820Y1397333D01*
X541747D01*
X539281Y1402333D01*
X544892Y1409645D01*
X549494Y1420755D01*
X551063Y1432677D01*
X549494Y1444599D01*
X544892Y1455709D01*
X537572Y1465249D01*
X528032Y1472569D01*
X516922Y1477171D01*
X505000Y1478740D01*
X493078Y1477171D01*
X481969Y1472569D01*
X472428Y1465249D01*
X465108Y1455709D01*
X460507Y1444599D01*
X458937Y1432677D01*
X460507Y1420755D01*
X465108Y1409645D01*
X471659Y1401108D01*
X471666Y1399301D01*
X471312Y1397239D01*
X470539Y1395253D01*
X466055Y1392256D01*
X455646Y1381848D01*
X450367Y1383639D01*
X449494Y1390269D01*
X444892Y1401378D01*
X437572Y1410918D01*
X428032Y1418238D01*
X416922Y1422840D01*
X405000Y1424410D01*
X393078Y1422840D01*
X381969Y1418238D01*
X372428Y1410918D01*
X365108Y1401378D01*
X360506Y1390269D01*
X358937Y1378347D01*
X360506Y1366424D01*
X365108Y1355315D01*
X371988Y1346349D01*
X370856Y1341349D01*
X347252D01*
X344892Y1347047D01*
X337572Y1356587D01*
X328032Y1363908D01*
X316922Y1368509D01*
X305000Y1370079D01*
X293078Y1368509D01*
X281968Y1363908D01*
X272428Y1356587D01*
X265108Y1347047D01*
X260506Y1335938D01*
X258937Y1324016D01*
X260506Y1312093D01*
X265108Y1300984D01*
X272428Y1291444D01*
X281968Y1284124D01*
X293078Y1279522D01*
X305000Y1277952D01*
X316922Y1279522D01*
X328032Y1284124D01*
X337572Y1291444D01*
X344892Y1300984D01*
X347252Y1306683D01*
X370855D01*
X371988Y1301683D01*
X365108Y1292717D01*
X360506Y1281607D01*
X358937Y1269685D01*
X360506Y1257763D01*
X365108Y1246653D01*
X372428Y1237113D01*
X381969Y1229793D01*
X393078Y1225191D01*
X405000Y1223622D01*
X416922Y1225191D01*
X428032Y1229793D01*
X437572Y1237113D01*
X444892Y1246653D01*
X449494Y1257763D01*
X451063Y1269685D01*
X449494Y1281607D01*
X444892Y1292717D01*
X437572Y1302257D01*
X432966Y1305791D01*
X433130Y1310788D01*
X434583Y1311759D01*
X454963Y1332140D01*
X459699Y1329804D01*
X458937Y1324016D01*
X460507Y1312093D01*
X465108Y1300984D01*
X472428Y1291444D01*
X481969Y1284124D01*
X493078Y1279522D01*
X505000Y1277952D01*
X516922Y1279522D01*
X528032Y1284124D01*
X537572Y1291444D01*
X544892Y1300984D01*
X549494Y1312093D01*
X551063Y1324016D01*
X549494Y1335938D01*
X544892Y1347047D01*
X537572Y1356587D01*
X535819Y1357932D01*
X537426Y1362667D01*
X590000D01*
X591135Y1362893D01*
X595000Y1359721D01*
Y1189513D01*
X582820Y1177333D01*
X538247D01*
X536640Y1182068D01*
X537572Y1182783D01*
X544892Y1192323D01*
X549494Y1203432D01*
X551063Y1215354D01*
X549494Y1227276D01*
X544892Y1238386D01*
X537572Y1247926D01*
X528032Y1255246D01*
X516922Y1259848D01*
X505000Y1261418D01*
X493078Y1259848D01*
X481969Y1255246D01*
X472428Y1247926D01*
X465108Y1238386D01*
X460507Y1227276D01*
X458937Y1215354D01*
X460507Y1203432D01*
X465108Y1192323D01*
X472428Y1182783D01*
X473452Y1181997D01*
X472205Y1176651D01*
X469001Y1176014D01*
X463377Y1172256D01*
X455646Y1164524D01*
X450367Y1166316D01*
X449494Y1172946D01*
X444892Y1184055D01*
X437572Y1193595D01*
X428032Y1200916D01*
X416922Y1205517D01*
X405000Y1207087D01*
X393078Y1205517D01*
X381969Y1200916D01*
X372428Y1193595D01*
X365108Y1184055D01*
X360506Y1172946D01*
X358937Y1161024D01*
X360506Y1149101D01*
X365108Y1137992D01*
X371988Y1129026D01*
X370856Y1124026D01*
X347252D01*
X344892Y1129724D01*
X337572Y1139264D01*
X328032Y1146585D01*
X316922Y1151187D01*
X305000Y1152756D01*
X293078Y1151187D01*
X281968Y1146585D01*
X272428Y1139264D01*
X265108Y1129724D01*
X260506Y1118615D01*
X258937Y1106693D01*
X260506Y1094771D01*
X265108Y1083661D01*
X272428Y1074121D01*
X281968Y1066801D01*
X293078Y1062199D01*
X305000Y1060630D01*
X316922Y1062199D01*
X328032Y1066801D01*
X337572Y1074121D01*
X344892Y1083661D01*
X347252Y1089360D01*
X422327D01*
X428960Y1090679D01*
X434583Y1094437D01*
X454963Y1114817D01*
X459699Y1112482D01*
X458937Y1106693D01*
X460507Y1094771D01*
X465108Y1083661D01*
X472428Y1074121D01*
X481969Y1066801D01*
X493078Y1062199D01*
X505000Y1060630D01*
X516922Y1062199D01*
X528032Y1066801D01*
X537572Y1074121D01*
X544892Y1083661D01*
X549494Y1094771D01*
X551063Y1106693D01*
X549494Y1118615D01*
X544892Y1129724D01*
X538798Y1137667D01*
X540917Y1142667D01*
X590000D01*
X591135Y1142893D01*
X595000Y1139721D01*
Y40000D01*
X35000D01*
Y3905000D01*
X595000D01*
Y2702333D01*
D02*
G37*
%LPC*%
G36*
X305000Y2891339D02*
X293078Y2889769D01*
X281968Y2885168D01*
X272428Y2877847D01*
X265108Y2868307D01*
X260506Y2857198D01*
X258937Y2845276D01*
X260506Y2833354D01*
X265108Y2822244D01*
X272428Y2812704D01*
X281968Y2805384D01*
X293078Y2800782D01*
X305000Y2799212D01*
X316922Y2800782D01*
X328032Y2805384D01*
X337572Y2812704D01*
X344892Y2822244D01*
X349494Y2833354D01*
X351063Y2845276D01*
X349494Y2857198D01*
X344892Y2868307D01*
X337572Y2877847D01*
X328032Y2885168D01*
X316922Y2889769D01*
X305000Y2891339D01*
D02*
G37*
G36*
X505000Y2891339D02*
X493078Y2889769D01*
X481969Y2885167D01*
X472428Y2877847D01*
X465108Y2868307D01*
X460507Y2857198D01*
X458937Y2845275D01*
X460507Y2833353D01*
X465108Y2822244D01*
X472428Y2812704D01*
X481969Y2805383D01*
X493078Y2800782D01*
X505000Y2799212D01*
X516922Y2800782D01*
X528032Y2805383D01*
X537572Y2812704D01*
X544892Y2822244D01*
X549494Y2833353D01*
X551063Y2845275D01*
X549494Y2857198D01*
X544892Y2868307D01*
X537572Y2877847D01*
X528032Y2885167D01*
X516922Y2889769D01*
X505000Y2891339D01*
D02*
G37*
G36*
X405000Y2837008D02*
X393078Y2835438D01*
X381969Y2830837D01*
X372428Y2823516D01*
X365108Y2813976D01*
X360506Y2802867D01*
X358937Y2790945D01*
X360506Y2779023D01*
X365108Y2767913D01*
X372428Y2758373D01*
X381969Y2751053D01*
X393078Y2746451D01*
X405000Y2744881D01*
X416922Y2746451D01*
X428032Y2751053D01*
X437572Y2758373D01*
X444892Y2767913D01*
X449494Y2779023D01*
X451063Y2790945D01*
X449494Y2802867D01*
X444892Y2813976D01*
X437572Y2823516D01*
X428032Y2830837D01*
X416922Y2835438D01*
X405000Y2837008D01*
D02*
G37*
G36*
X305000Y2782677D02*
X293078Y2781108D01*
X281968Y2776506D01*
X272428Y2769186D01*
X265108Y2759646D01*
X260506Y2748536D01*
X258937Y2736614D01*
X260506Y2724692D01*
X265108Y2713582D01*
X272428Y2704042D01*
X281968Y2696722D01*
X293078Y2692120D01*
X305000Y2690551D01*
X316922Y2692120D01*
X328032Y2696722D01*
X337572Y2704042D01*
X344892Y2713582D01*
X349494Y2724692D01*
X351063Y2736614D01*
X349494Y2748536D01*
X344892Y2759646D01*
X337572Y2769186D01*
X328032Y2776506D01*
X316922Y2781108D01*
X305000Y2782677D01*
D02*
G37*
G36*
Y2565354D02*
X293078Y2563785D01*
X281968Y2559183D01*
X272428Y2551863D01*
X265108Y2542323D01*
X260506Y2531213D01*
X258937Y2519291D01*
X260506Y2507369D01*
X265108Y2496260D01*
X272428Y2486720D01*
X281968Y2479399D01*
X293078Y2474798D01*
X305000Y2473228D01*
X316922Y2474798D01*
X328032Y2479399D01*
X337572Y2486720D01*
X344892Y2496260D01*
X349494Y2507369D01*
X351063Y2519291D01*
X349494Y2531213D01*
X344892Y2542323D01*
X337572Y2551863D01*
X328032Y2559183D01*
X316922Y2563785D01*
X305000Y2565354D01*
D02*
G37*
G36*
Y2348032D02*
X293078Y2346462D01*
X281968Y2341860D01*
X272428Y2334540D01*
X265108Y2325000D01*
X260506Y2313890D01*
X258937Y2301968D01*
X260506Y2290046D01*
X265108Y2278937D01*
X272428Y2269397D01*
X281968Y2262076D01*
X293078Y2257475D01*
X305000Y2255905D01*
X316922Y2257475D01*
X328032Y2262076D01*
X337572Y2269397D01*
X344892Y2278937D01*
X349494Y2290046D01*
X351063Y2301968D01*
X349494Y2313890D01*
X344892Y2325000D01*
X337572Y2334540D01*
X328032Y2341860D01*
X316922Y2346462D01*
X305000Y2348032D01*
D02*
G37*
G36*
Y2130709D02*
X293078Y2129139D01*
X281968Y2124538D01*
X272428Y2117217D01*
X265108Y2107677D01*
X260506Y2096568D01*
X258937Y2084646D01*
X260506Y2072724D01*
X265108Y2061614D01*
X272428Y2052074D01*
X281968Y2044754D01*
X293078Y2040152D01*
X305000Y2038582D01*
X316922Y2040152D01*
X328032Y2044754D01*
X337572Y2052074D01*
X344892Y2061614D01*
X349494Y2072724D01*
X351063Y2084646D01*
X349494Y2096568D01*
X344892Y2107677D01*
X337572Y2117217D01*
X328032Y2124538D01*
X316922Y2129139D01*
X305000Y2130709D01*
D02*
G37*
G36*
Y1913386D02*
X293078Y1911816D01*
X281968Y1907215D01*
X272428Y1899895D01*
X265108Y1890354D01*
X260506Y1879245D01*
X258937Y1867323D01*
X260506Y1855401D01*
X265108Y1844291D01*
X272428Y1834751D01*
X281968Y1827431D01*
X293078Y1822829D01*
X305000Y1821259D01*
X316922Y1822829D01*
X328032Y1827431D01*
X337572Y1834751D01*
X344892Y1844291D01*
X349494Y1855401D01*
X351063Y1867323D01*
X349494Y1879245D01*
X344892Y1890354D01*
X337572Y1899895D01*
X328032Y1907215D01*
X316922Y1911816D01*
X305000Y1913386D01*
D02*
G37*
G36*
Y1696063D02*
X293078Y1694494D01*
X281968Y1689892D01*
X272428Y1682572D01*
X265108Y1673032D01*
X260506Y1661922D01*
X258937Y1650000D01*
X260506Y1638078D01*
X265108Y1626968D01*
X272428Y1617428D01*
X281968Y1610108D01*
X293078Y1605506D01*
X305000Y1603937D01*
X316922Y1605506D01*
X328032Y1610108D01*
X337572Y1617428D01*
X344892Y1626968D01*
X349494Y1638078D01*
X351063Y1650000D01*
X349494Y1661922D01*
X344892Y1673032D01*
X337572Y1682572D01*
X328032Y1689892D01*
X316922Y1694494D01*
X305000Y1696063D01*
D02*
G37*
G36*
Y1478741D02*
X293078Y1477171D01*
X281968Y1472569D01*
X272428Y1465249D01*
X265108Y1455709D01*
X260506Y1444599D01*
X258937Y1432677D01*
X260506Y1420755D01*
X265108Y1409646D01*
X272428Y1400105D01*
X281968Y1392785D01*
X293078Y1388184D01*
X305000Y1386614D01*
X316922Y1388184D01*
X328032Y1392785D01*
X337572Y1400105D01*
X344892Y1409646D01*
X349494Y1420755D01*
X351063Y1432677D01*
X349494Y1444599D01*
X344892Y1455709D01*
X337572Y1465249D01*
X328032Y1472569D01*
X316922Y1477171D01*
X305000Y1478741D01*
D02*
G37*
G36*
Y1261417D02*
X293078Y1259848D01*
X281968Y1255246D01*
X272428Y1247926D01*
X265108Y1238386D01*
X260506Y1227276D01*
X258937Y1215354D01*
X260506Y1203432D01*
X265108Y1192322D01*
X272428Y1182782D01*
X281968Y1175462D01*
X293078Y1170860D01*
X305000Y1169291D01*
X316922Y1170860D01*
X328032Y1175462D01*
X337572Y1182782D01*
X344892Y1192322D01*
X349494Y1203432D01*
X351063Y1215354D01*
X349494Y1227276D01*
X344892Y1238386D01*
X337572Y1247926D01*
X328032Y1255246D01*
X316922Y1259848D01*
X305000Y1261417D01*
D02*
G37*
%LPD*%
D16*
X6100000Y570000D02*
X6210000Y680000D01*
X6100000Y518898D02*
Y570000D01*
Y790000D02*
Y840000D01*
Y790000D02*
X6210000Y680000D01*
X6900000D01*
X7050000Y530000D01*
Y420000D02*
Y530000D01*
X7150000Y420000D02*
Y750000D01*
X6939151Y960849D02*
X7150000Y750000D01*
X6611800Y960849D02*
X6939151D01*
X6612649Y420000D02*
X6950000D01*
X8350000Y620000D02*
X8450000D01*
X8349151Y620849D02*
X8350000Y620000D01*
X8111800Y620849D02*
X8349151D01*
X8350000Y420000D02*
X8450000D01*
X7650000D02*
X8350000D01*
X7629151Y619151D02*
X7888200D01*
X7550000Y540000D02*
X7629151Y619151D01*
X7550000Y420000D02*
Y540000D01*
D17*
X6611800Y420849D02*
X6612649Y420000D01*
X675000Y1585000D02*
X1488799Y2398799D01*
X675000Y1465000D02*
Y1585000D01*
X590000Y1380000D02*
X675000Y1465000D01*
X700000Y1575000D02*
X1421201Y2296202D01*
X700000Y1270000D02*
Y1575000D01*
X590000Y1160000D02*
X700000Y1270000D01*
X1623799Y2598799D02*
X2001299D01*
X1546004Y2521004D02*
X1623799Y2598799D01*
X1544602Y2521004D02*
X1546004D01*
X838598Y1815000D02*
X1544602Y2521004D01*
X478665Y1815000D02*
X838598D01*
X1553799Y2498799D02*
X2001299D01*
X650000Y1595000D02*
X1553799Y2498799D01*
X475988Y1595000D02*
X650000D01*
X1488799Y2398799D02*
X2001299D01*
X1421201Y2296202D02*
X1998701D01*
X1458799Y2998799D02*
X2001299D01*
X1378406Y2918405D02*
X1458799Y2998799D01*
X1377003Y2918405D02*
X1378406D01*
X1143598Y2685000D02*
X1377003Y2918405D01*
X485000Y2685000D02*
X1143598D01*
X1386201Y2896201D02*
X1998701D01*
X955000Y2465000D02*
X1386201Y2896201D01*
X480000Y2465000D02*
X955000D01*
X1323799Y2798799D02*
X2001299D01*
X1243406Y2718405D02*
X1323799Y2798799D01*
X1242003Y2718405D02*
X1243406D01*
X768598Y2245000D02*
X1242003Y2718405D01*
X480000Y2245000D02*
X768598D01*
X1251201Y2696201D02*
X1998701D01*
X585000Y2030000D02*
X1251201Y2696201D01*
X1998701Y2296202D02*
X2050000Y2347500D01*
X2001299Y2398799D02*
X2050000Y2447500D01*
X1998701Y2696201D02*
X2050000Y2747500D01*
X1998701Y2896201D02*
X2050000Y2947500D01*
X2001299Y2598799D02*
X2050000Y2647500D01*
X2001299Y2498799D02*
X2050000Y2547500D01*
X2001299Y2998799D02*
X2050000Y3047500D01*
X2001299Y2798799D02*
X2050000Y2847500D01*
X2410000Y990000D02*
Y2875000D01*
X2167500Y747500D02*
X2410000Y990000D01*
X2050000Y747500D02*
X2167500D01*
X2343386Y1218386D02*
Y2902592D01*
X2172500Y1047500D02*
X2343386Y1218386D01*
X2050000Y1047500D02*
X2172500D01*
X2365591Y1140591D02*
Y2893395D01*
X2172500Y947500D02*
X2365591Y1140591D01*
X2050000Y947500D02*
X2172500D01*
X2387795Y1067795D02*
Y2884197D01*
X2167500Y847500D02*
X2387795Y1067795D01*
X2050000Y847500D02*
X2167500D01*
X2343386Y2902592D02*
X2467408Y3026614D01*
X2365591Y2893395D02*
X2476605Y3004409D01*
X2387795Y2884197D02*
X2485803Y2982205D01*
X2410000Y2875000D02*
X2495000Y2960000D01*
X2467408Y3026614D02*
X2902383D01*
X2476605Y3004409D02*
X2914409D01*
X2485803Y2982205D02*
X2927205D01*
X2495000Y2960000D02*
X3050000D01*
X427953Y2627953D02*
X485000Y2685000D01*
X425630Y2410630D02*
X480000Y2465000D01*
X305000Y2410630D02*
X425630D01*
X428307Y2193307D02*
X480000Y2245000D01*
X305000Y2193307D02*
X428307D01*
X480000Y2030000D02*
X585000D01*
X425000Y1975000D02*
X480000Y2030000D01*
X424016Y1975984D02*
X425000Y1975000D01*
X305000Y1975984D02*
X424016D01*
X3220000Y3285000D02*
X3355000Y3420000D01*
X2902383Y3026614D02*
X3160769Y3285000D01*
X3220000D01*
X3355000Y3420000D02*
X3760000D01*
X3232110Y3187890D02*
X3410000Y3010000D01*
X2914409Y3004409D02*
X3097890Y3187890D01*
X3232110D01*
X2970000Y3025000D02*
X3000000D01*
X2927205Y2982205D02*
X2970000Y3025000D01*
X3050000Y2960000D02*
X3175000Y3085000D01*
Y3150000D01*
X475634Y1160000D02*
X590000D01*
X478311Y1380000D02*
X590000D01*
X422326Y1758661D02*
X478665Y1815000D01*
X422326Y1541338D02*
X475988Y1595000D01*
X422326Y1324016D02*
X478311Y1380000D01*
X422327Y1106693D02*
X475634Y1160000D01*
X305000Y2627953D02*
X427953D01*
X305000Y1758661D02*
X422326D01*
X305000Y1541338D02*
X422326D01*
X305000Y1324016D02*
X422326D01*
X305000Y1106693D02*
X422327D01*
D18*
X7650000Y420000D02*
D03*
X7550000D02*
D03*
X7450000D02*
D03*
X7250000D02*
D03*
X7150000D02*
D03*
X7050000D02*
D03*
X6950000D02*
D03*
X505000Y1324016D02*
D03*
X8450000Y3520000D02*
D03*
Y3420000D02*
D03*
Y3320000D02*
D03*
Y3220000D02*
D03*
Y3120000D02*
D03*
Y3020000D02*
D03*
Y2920000D02*
D03*
Y2820000D02*
D03*
Y2020000D02*
D03*
Y2120000D02*
D03*
Y2220000D02*
D03*
Y2320000D02*
D03*
Y2420000D02*
D03*
Y2520000D02*
D03*
Y2620000D02*
D03*
Y2720000D02*
D03*
Y1220000D02*
D03*
Y1320000D02*
D03*
Y1420000D02*
D03*
Y1520000D02*
D03*
Y1620000D02*
D03*
Y1720000D02*
D03*
Y1820000D02*
D03*
Y1920000D02*
D03*
Y420000D02*
D03*
Y520000D02*
D03*
Y620000D02*
D03*
Y720000D02*
D03*
Y820000D02*
D03*
Y920000D02*
D03*
Y1020000D02*
D03*
Y1120000D02*
D03*
X8350000D02*
D03*
Y1020000D02*
D03*
Y920000D02*
D03*
Y820000D02*
D03*
Y720000D02*
D03*
Y620000D02*
D03*
Y520000D02*
D03*
Y420000D02*
D03*
Y1920000D02*
D03*
Y1820000D02*
D03*
Y1720000D02*
D03*
Y1620000D02*
D03*
Y1520000D02*
D03*
Y1420000D02*
D03*
Y1320000D02*
D03*
Y1220000D02*
D03*
Y2720000D02*
D03*
Y2620000D02*
D03*
Y2520000D02*
D03*
Y2420000D02*
D03*
Y2320000D02*
D03*
Y2220000D02*
D03*
Y2120000D02*
D03*
Y2020000D02*
D03*
Y2820000D02*
D03*
Y2920000D02*
D03*
Y3020000D02*
D03*
Y3120000D02*
D03*
Y3220000D02*
D03*
Y3320000D02*
D03*
Y3420000D02*
D03*
Y3520000D02*
D03*
X305000Y1106693D02*
D03*
Y1215354D02*
D03*
Y1324016D02*
D03*
Y1432677D02*
D03*
Y1541338D02*
D03*
Y1650000D02*
D03*
Y1758661D02*
D03*
Y1867323D02*
D03*
Y1975984D02*
D03*
Y2084646D02*
D03*
Y2193307D02*
D03*
Y2301968D02*
D03*
Y2410630D02*
D03*
Y2519291D02*
D03*
Y2627953D02*
D03*
Y2736614D02*
D03*
Y2845276D02*
D03*
X405000Y1161024D02*
D03*
Y1269685D02*
D03*
Y1378347D02*
D03*
Y1487008D02*
D03*
Y1595669D02*
D03*
Y1704331D02*
D03*
Y1812992D02*
D03*
Y1921653D02*
D03*
Y2030315D02*
D03*
Y2138976D02*
D03*
Y2247638D02*
D03*
Y2356299D02*
D03*
Y2464961D02*
D03*
Y2573622D02*
D03*
Y2682284D02*
D03*
Y2790945D02*
D03*
X505000Y1106693D02*
D03*
Y1215354D02*
D03*
Y1432677D02*
D03*
Y1541338D02*
D03*
Y1650000D02*
D03*
Y1758661D02*
D03*
Y1867323D02*
D03*
Y1975984D02*
D03*
Y2084646D02*
D03*
Y2193307D02*
D03*
Y2301968D02*
D03*
Y2410630D02*
D03*
Y2519291D02*
D03*
Y2627953D02*
D03*
Y2736614D02*
D03*
Y2845275D02*
D03*
D19*
X1950000Y2647500D02*
D03*
X2050000D02*
D03*
X1950000Y2547500D02*
D03*
X2050000D02*
D03*
X1950000Y2447500D02*
D03*
X2050000D02*
D03*
X1950000Y2347500D02*
D03*
X2050000D02*
D03*
X1950000Y2747500D02*
D03*
X2050000D02*
D03*
X1950000Y2847500D02*
D03*
X2050000D02*
D03*
X1950000Y2947500D02*
D03*
X2050000D02*
D03*
X1950000Y3047500D02*
D03*
X2050000D02*
D03*
X1950000Y1347500D02*
D03*
X2050000D02*
D03*
X1950000Y1247500D02*
D03*
X2050000D02*
D03*
Y947500D02*
D03*
Y1147500D02*
D03*
X1950000D02*
D03*
Y1047500D02*
D03*
X2050000D02*
D03*
X1950000Y947500D02*
D03*
Y847500D02*
D03*
X2050000D02*
D03*
X1950000Y747500D02*
D03*
X2050000D02*
D03*
Y1447500D02*
D03*
X1950000D02*
D03*
X2050000Y1547500D02*
D03*
X1950000D02*
D03*
X2050000Y1647500D02*
D03*
X1950000D02*
D03*
Y1747500D02*
D03*
X2050000Y1847500D02*
D03*
X1950000D02*
D03*
Y1947500D02*
D03*
X2050000D02*
D03*
Y1747500D02*
D03*
Y2047501D02*
D03*
X1950000D02*
D03*
X2050000Y2147501D02*
D03*
X1950000D02*
D03*
Y2247501D02*
D03*
X2050000Y3147500D02*
D03*
X1950000D02*
D03*
X2050000Y2247501D02*
D03*
D20*
X2010000Y395000D02*
D03*
Y3500000D02*
D03*
D21*
X8111800Y620849D02*
D03*
X7888200Y619151D02*
D03*
X6388200Y959151D02*
D03*
X6611800Y960849D02*
D03*
X6388200Y419151D02*
D03*
X6611800Y420849D02*
D03*
D22*
X6100000Y518898D02*
D03*
Y977795D02*
D03*
D23*
Y381102D02*
D03*
Y840000D02*
D03*
D25*
X405000Y3178741D02*
D03*
Y773228D02*
D03*
D26*
X140547Y218496D02*
D03*
Y3718496D02*
D03*
D27*
X6650000Y2090000D02*
D03*
X4850748Y3189252D02*
D03*
X3385000Y3140000D02*
D03*
X3395000Y1660000D02*
D03*
X2560000Y2835000D02*
D03*
X3350000Y2830000D02*
D03*
Y3300000D02*
D03*
X2985000Y3170000D02*
D03*
X2575000Y3435000D02*
D03*
X2555000Y1815000D02*
D03*
X2575000Y1485000D02*
D03*
X2985000Y1660000D02*
D03*
X3340000Y1820000D02*
D03*
X3415000Y1370000D02*
D03*
X4425000Y2880000D02*
D03*
X5200000Y3350000D02*
D03*
X5205000Y2885000D02*
D03*
X5235000Y3070000D02*
D03*
X4425000Y3440000D02*
D03*
X4835000Y1715000D02*
D03*
X4410000Y1540000D02*
D03*
X4415000Y1990000D02*
D03*
X5200000Y1880000D02*
D03*
X5235000Y1715000D02*
D03*
X5250000Y1445000D02*
D03*
X6690000Y3210000D02*
D03*
X6250000Y2905000D02*
D03*
Y3315000D02*
D03*
X7045000Y2930000D02*
D03*
X7080000Y3085000D02*
D03*
X7050000Y3380000D02*
D03*
X7100000Y1460000D02*
D03*
X6685000Y1730000D02*
D03*
X6250000Y1565000D02*
D03*
X6255000Y2015000D02*
D03*
X7050000Y1950000D02*
D03*
X7080000Y1745000D02*
D03*
X5090000Y750000D02*
D03*
Y475000D02*
D03*
D28*
X3050000Y1940000D02*
D03*
X3220000Y1575000D02*
D03*
X3000000Y3025000D02*
D03*
X3220000Y3285000D02*
D03*
X5080000Y1995000D02*
D03*
X7470000Y3040000D02*
D03*
X7495000Y2085000D02*
D03*
X5622500Y1995000D02*
D03*
X5615000Y1605000D02*
D03*
X5010000Y1635000D02*
D03*
X5070000D02*
D03*
X5065000Y3115000D02*
D03*
X5005000Y3060000D02*
D03*
X5600000Y3040000D02*
D03*
X5590000Y3465000D02*
D03*
X3755000Y1550000D02*
D03*
X3750000Y1925000D02*
D03*
X3175000Y3150000D02*
D03*
X6925000Y2100000D02*
D03*
X7485000Y1620000D02*
D03*
X6925000Y1645000D02*
D03*
X6845000D02*
D03*
X6850000Y3045000D02*
D03*
X6675000Y3095000D02*
D03*
X6920000Y3100000D02*
D03*
X7490000Y3480000D02*
D03*
X7095000Y3220000D02*
D03*
X4900000Y1995000D02*
D03*
X5235000Y3210000D02*
D03*
X4815000Y3070000D02*
D03*
X3235000Y1925000D02*
D03*
X3160000Y1575000D02*
D03*
X3410000Y3010000D02*
D03*
X3760000Y3420000D02*
D03*
D29*
X8550000Y3720000D02*
D03*
Y220000D02*
D03*
%TF.MD5,a8b959c4c1058e59ac2433a408fc7263*%
M02*
