%TF.GenerationSoftware,Altium Limited,Altium Designer,19.1.5 (86)*%
G04 Layer_Color=32896*
%FSLAX26Y26*%
%MOIN*%
%TF.FileFunction,Other,Notvisible*%
%TF.Part,Single*%
G01*
G75*
%TA.AperFunction,NonConductor*%
%ADD36C,0.006000*%
%ADD37C,0.005000*%
%ADD39C,0.003937*%
%ADD40C,0.004724*%
%ADD41C,0.001968*%
%ADD42C,0.001000*%
D36*
X8477752Y3568480D02*
X8487749Y3578477D01*
X8507742D01*
X8517739Y3568480D01*
Y3558483D01*
X8507742Y3548486D01*
X8517739Y3538490D01*
Y3528493D01*
X8507742Y3518496D01*
X8487749D01*
X8477752Y3528493D01*
Y3538490D01*
X8487749Y3548486D01*
X8477752Y3558483D01*
Y3568480D01*
X8487749Y3548486D02*
X8507742D01*
X8567723Y3518496D02*
Y3578477D01*
X8537733Y3548486D01*
X8577720D01*
X8637700Y3578477D02*
X8597713D01*
Y3548486D01*
X8617707Y3558483D01*
X8627703D01*
X8637700Y3548486D01*
Y3528493D01*
X8627703Y3518496D01*
X8607710D01*
X8597713Y3528493D01*
X8697681Y3518496D02*
X8657694D01*
X8697681Y3558483D01*
Y3568480D01*
X8687684Y3578477D01*
X8667691D01*
X8657694Y3568480D01*
X8717674Y3518496D02*
Y3528493D01*
X8727671D01*
Y3518496D01*
X8717674D01*
X8767658Y3578477D02*
X8807645D01*
Y3568480D01*
X8767658Y3528493D01*
Y3518496D01*
X8867626Y3578477D02*
X8827639D01*
Y3548486D01*
X8847632Y3558483D01*
X8857629D01*
X8867626Y3548486D01*
Y3528493D01*
X8857629Y3518496D01*
X8837636D01*
X8827639Y3528493D01*
X8927606Y3518496D02*
X8887619D01*
X8927606Y3558483D01*
Y3568480D01*
X8917610Y3578477D01*
X8897616D01*
X8887619Y3568480D01*
X8957597Y3508499D02*
X8967594Y3518496D01*
Y3528493D01*
X8957597D01*
Y3518496D01*
X8967594D01*
X8957597Y3508499D01*
X8947600Y3498503D01*
X9007581Y3568480D02*
X9017577Y3578477D01*
X9037571D01*
X9047568Y3568480D01*
Y3558483D01*
X9037571Y3548486D01*
X9027574D01*
X9037571D01*
X9047568Y3538490D01*
Y3528493D01*
X9037571Y3518496D01*
X9017577D01*
X9007581Y3528493D01*
X9107548Y3578477D02*
X9067561D01*
Y3548486D01*
X9087555Y3558483D01*
X9097551D01*
X9107548Y3548486D01*
Y3528493D01*
X9097551Y3518496D01*
X9077558D01*
X9067561Y3528493D01*
X9127542Y3518496D02*
X9147535D01*
X9137539D01*
Y3578477D01*
X9127542Y3568480D01*
X9177526D02*
X9187522Y3578477D01*
X9207516D01*
X9217513Y3568480D01*
Y3558483D01*
X9207516Y3548486D01*
X9217513Y3538490D01*
Y3528493D01*
X9207516Y3518496D01*
X9187522D01*
X9177526Y3528493D01*
Y3538490D01*
X9187522Y3548486D01*
X9177526Y3558483D01*
Y3568480D01*
X9187522Y3548486D02*
X9207516D01*
X9237506Y3518496D02*
Y3528493D01*
X9247503D01*
Y3518496D01*
X9237506D01*
X9317480D02*
Y3578477D01*
X9287490Y3548486D01*
X9327477D01*
X9347471Y3528493D02*
X9357467Y3518496D01*
X9377461D01*
X9387458Y3528493D01*
Y3568480D01*
X9377461Y3578477D01*
X9357467D01*
X9347471Y3568480D01*
Y3558483D01*
X9357467Y3548486D01*
X9387458D01*
X9447438Y3578477D02*
X9427445Y3568480D01*
X9407451Y3548486D01*
Y3528493D01*
X9417448Y3518496D01*
X9437442D01*
X9447438Y3528493D01*
Y3538490D01*
X9437442Y3548486D01*
X9407451D01*
X9547406Y3518496D02*
X9527412Y3538490D01*
Y3558483D01*
X9547406Y3578477D01*
X9577396Y3518496D02*
Y3558483D01*
X9587393D01*
X9597390Y3548486D01*
Y3518496D01*
Y3548486D01*
X9607387Y3558483D01*
X9617383Y3548486D01*
Y3518496D01*
X9637377D02*
X9657370D01*
X9647374D01*
Y3558483D01*
X9637377D01*
X9687361Y3518496D02*
X9707354D01*
X9697357D01*
Y3578477D01*
X9687361D01*
X9737344Y3518496D02*
X9757338Y3538490D01*
Y3558483D01*
X9737344Y3578477D01*
X8577752Y2018480D02*
X8587749Y2028477D01*
X8607742D01*
X8617739Y2018480D01*
Y2008483D01*
X8607742Y1998486D01*
X8617739Y1988490D01*
Y1978493D01*
X8607742Y1968496D01*
X8587749D01*
X8577752Y1978493D01*
Y1988490D01*
X8587749Y1998486D01*
X8577752Y2008483D01*
Y2018480D01*
X8587749Y1998486D02*
X8607742D01*
X8677720Y2028477D02*
X8637733D01*
Y1998486D01*
X8657726Y2008483D01*
X8667723D01*
X8677720Y1998486D01*
Y1978493D01*
X8667723Y1968496D01*
X8647729D01*
X8637733Y1978493D01*
X8737700Y2028477D02*
X8697713D01*
Y1998486D01*
X8717707Y2008483D01*
X8727703D01*
X8737700Y1998486D01*
Y1978493D01*
X8727703Y1968496D01*
X8707710D01*
X8697713Y1978493D01*
X8797681Y1968496D02*
X8757694D01*
X8797681Y2008483D01*
Y2018480D01*
X8787684Y2028477D01*
X8767691D01*
X8757694Y2018480D01*
X8817674Y1968496D02*
Y1978493D01*
X8827671D01*
Y1968496D01*
X8817674D01*
X8867658Y2028477D02*
X8907645D01*
Y2018480D01*
X8867658Y1978493D01*
Y1968496D01*
X8967626Y2028477D02*
X8927639D01*
Y1998486D01*
X8947632Y2008483D01*
X8957629D01*
X8967626Y1998486D01*
Y1978493D01*
X8957629Y1968496D01*
X8937636D01*
X8927639Y1978493D01*
X9027606Y1968496D02*
X8987619D01*
X9027606Y2008483D01*
Y2018480D01*
X9017610Y2028477D01*
X8997616D01*
X8987619Y2018480D01*
X9057597Y1958499D02*
X9067594Y1968496D01*
Y1978493D01*
X9057597D01*
Y1968496D01*
X9067594D01*
X9057597Y1958499D01*
X9047600Y1948503D01*
X9107581Y1968496D02*
X9127574D01*
X9117577D01*
Y2028477D01*
X9107581Y2018480D01*
X9157564Y1978493D02*
X9167561Y1968496D01*
X9187555D01*
X9197551Y1978493D01*
Y2018480D01*
X9187555Y2028477D01*
X9167561D01*
X9157564Y2018480D01*
Y2008483D01*
X9167561Y1998486D01*
X9197551D01*
X9257532Y2028477D02*
X9237539Y2018480D01*
X9217545Y1998486D01*
Y1978493D01*
X9227542Y1968496D01*
X9247535D01*
X9257532Y1978493D01*
Y1988490D01*
X9247535Y1998486D01*
X9217545D01*
X9277526Y2018480D02*
X9287522Y2028477D01*
X9307516D01*
X9317513Y2018480D01*
Y2008483D01*
X9307516Y1998486D01*
X9317513Y1988490D01*
Y1978493D01*
X9307516Y1968496D01*
X9287522D01*
X9277526Y1978493D01*
Y1988490D01*
X9287522Y1998486D01*
X9277526Y2008483D01*
Y2018480D01*
X9287522Y1998486D02*
X9307516D01*
X9337506Y1968496D02*
Y1978493D01*
X9347503D01*
Y1968496D01*
X9337506D01*
X9417480D02*
Y2028477D01*
X9387490Y1998486D01*
X9427477D01*
X9447471Y1978493D02*
X9457467Y1968496D01*
X9477461D01*
X9487458Y1978493D01*
Y2018480D01*
X9477461Y2028477D01*
X9457467D01*
X9447471Y2018480D01*
Y2008483D01*
X9457467Y1998486D01*
X9487458D01*
X9547438Y2028477D02*
X9527445Y2018480D01*
X9507451Y1998486D01*
Y1978493D01*
X9517448Y1968496D01*
X9537442D01*
X9547438Y1978493D01*
Y1988490D01*
X9537442Y1998486D01*
X9507451D01*
X9647406Y1968496D02*
X9627412Y1988490D01*
Y2008483D01*
X9647406Y2028477D01*
X9677396Y1968496D02*
Y2008483D01*
X9687393D01*
X9697390Y1998486D01*
Y1968496D01*
Y1998486D01*
X9707387Y2008483D01*
X9717383Y1998486D01*
Y1968496D01*
X9737377D02*
X9757370D01*
X9747374D01*
Y2008483D01*
X9737377D01*
X9787361Y1968496D02*
X9807354D01*
X9797357D01*
Y2028477D01*
X9787361D01*
X9837344Y1968496D02*
X9857338Y1988490D01*
Y2008483D01*
X9837344Y2028477D01*
D37*
X8162594Y3518497D02*
G03*
X8162594Y3518497I-9842J0D01*
G01*
X8262594D02*
G03*
X8262594Y3518497I-9842J0D01*
G01*
X8362594D02*
G03*
X8362594Y3518497I-9842J0D01*
G01*
X8462594D02*
G03*
X8462594Y3518497I-9842J0D01*
G01*
X8562594D02*
G03*
X8562594Y3518497I-9842J0D01*
G01*
X8162594Y3418497D02*
G03*
X8162594Y3418497I-9842J0D01*
G01*
X8262594D02*
G03*
X8262594Y3418497I-9842J0D01*
G01*
X8362594D02*
G03*
X8362594Y3418497I-9842J0D01*
G01*
X8462594D02*
G03*
X8462594Y3418497I-9842J0D01*
G01*
X8562594D02*
G03*
X8562594Y3418497I-9842J0D01*
G01*
X8162594Y3318497D02*
G03*
X8162594Y3318497I-9842J0D01*
G01*
X8262594D02*
G03*
X8262594Y3318497I-9842J0D01*
G01*
X8362594D02*
G03*
X8362594Y3318497I-9842J0D01*
G01*
X8462594D02*
G03*
X8462594Y3318497I-9842J0D01*
G01*
X8562594D02*
G03*
X8562594Y3318497I-9842J0D01*
G01*
X8162594Y3218497D02*
G03*
X8162594Y3218497I-9842J0D01*
G01*
X8262594D02*
G03*
X8262594Y3218497I-9842J0D01*
G01*
X8362594D02*
G03*
X8362594Y3218497I-9842J0D01*
G01*
X8462594D02*
G03*
X8462594Y3218497I-9842J0D01*
G01*
X8562594D02*
G03*
X8562594Y3218497I-9842J0D01*
G01*
X8162594Y3118497D02*
G03*
X8162594Y3118497I-9842J0D01*
G01*
X8262594D02*
G03*
X8262594Y3118497I-9842J0D01*
G01*
X8362594D02*
G03*
X8362594Y3118497I-9842J0D01*
G01*
X8462594D02*
G03*
X8462594Y3118497I-9842J0D01*
G01*
X8562594D02*
G03*
X8562594Y3118497I-9842J0D01*
G01*
X8162594Y3018497D02*
G03*
X8162594Y3018497I-9842J0D01*
G01*
X8262594D02*
G03*
X8262594Y3018497I-9842J0D01*
G01*
X8362594D02*
G03*
X8362594Y3018497I-9842J0D01*
G01*
X8462594D02*
G03*
X8462594Y3018497I-9842J0D01*
G01*
X8562594D02*
G03*
X8562594Y3018497I-9842J0D01*
G01*
X8162594Y2918497D02*
G03*
X8162594Y2918497I-9842J0D01*
G01*
X8262594D02*
G03*
X8262594Y2918497I-9842J0D01*
G01*
X8362594D02*
G03*
X8362594Y2918497I-9842J0D01*
G01*
X8462594D02*
G03*
X8462594Y2918497I-9842J0D01*
G01*
X8562594D02*
G03*
X8562594Y2918497I-9842J0D01*
G01*
X8162594Y2818497D02*
G03*
X8162594Y2818497I-9842J0D01*
G01*
X8262594D02*
G03*
X8262594Y2818497I-9842J0D01*
G01*
X8362594D02*
G03*
X8362594Y2818497I-9842J0D01*
G01*
X8462594D02*
G03*
X8462594Y2818497I-9842J0D01*
G01*
X8562594D02*
G03*
X8562594Y2818497I-9842J0D01*
G01*
X8162594Y2718497D02*
G03*
X8162594Y2718497I-9842J0D01*
G01*
X8262594D02*
G03*
X8262594Y2718497I-9842J0D01*
G01*
X8362594D02*
G03*
X8362594Y2718497I-9842J0D01*
G01*
X8462594D02*
G03*
X8462594Y2718497I-9842J0D01*
G01*
X8562594D02*
G03*
X8562594Y2718497I-9842J0D01*
G01*
X8162594Y2618497D02*
G03*
X8162594Y2618497I-9842J0D01*
G01*
X8262594D02*
G03*
X8262594Y2618497I-9842J0D01*
G01*
X8362594D02*
G03*
X8362594Y2618497I-9842J0D01*
G01*
X8462594D02*
G03*
X8462594Y2618497I-9842J0D01*
G01*
X8562594D02*
G03*
X8562594Y2618497I-9842J0D01*
G01*
X8162594Y2518496D02*
G03*
X8162594Y2518496I-9842J0D01*
G01*
X8262594D02*
G03*
X8262594Y2518496I-9842J0D01*
G01*
X8362594D02*
G03*
X8362594Y2518496I-9842J0D01*
G01*
X8462594D02*
G03*
X8462594Y2518496I-9842J0D01*
G01*
X8562594D02*
G03*
X8562594Y2518496I-9842J0D01*
G01*
X8162594Y2418496D02*
G03*
X8162594Y2418496I-9842J0D01*
G01*
X8262594D02*
G03*
X8262594Y2418496I-9842J0D01*
G01*
X8362594D02*
G03*
X8362594Y2418496I-9842J0D01*
G01*
X8462594D02*
G03*
X8462594Y2418496I-9842J0D01*
G01*
X8562594D02*
G03*
X8562594Y2418496I-9842J0D01*
G01*
X8162594Y2318496D02*
G03*
X8162594Y2318496I-9842J0D01*
G01*
X8262594D02*
G03*
X8262594Y2318496I-9842J0D01*
G01*
X8362594D02*
G03*
X8362594Y2318496I-9842J0D01*
G01*
X8462594D02*
G03*
X8462594Y2318496I-9842J0D01*
G01*
X8562594D02*
G03*
X8562594Y2318496I-9842J0D01*
G01*
X8162594Y2218496D02*
G03*
X8162594Y2218496I-9842J0D01*
G01*
X8262594D02*
G03*
X8262594Y2218496I-9842J0D01*
G01*
X8362594D02*
G03*
X8362594Y2218496I-9842J0D01*
G01*
X8462594D02*
G03*
X8462594Y2218496I-9842J0D01*
G01*
X8562594D02*
G03*
X8562594Y2218496I-9842J0D01*
G01*
X8162594Y2118496D02*
G03*
X8162594Y2118496I-9842J0D01*
G01*
X8262594D02*
G03*
X8262594Y2118496I-9842J0D01*
G01*
X8362594D02*
G03*
X8362594Y2118496I-9842J0D01*
G01*
X8462594D02*
G03*
X8462594Y2118496I-9842J0D01*
G01*
X8562594D02*
G03*
X8562594Y2118496I-9842J0D01*
G01*
X8162594Y2018496D02*
G03*
X8162594Y2018496I-9842J0D01*
G01*
X8262594D02*
G03*
X8262594Y2018496I-9842J0D01*
G01*
X8362594D02*
G03*
X8362594Y2018496I-9842J0D01*
G01*
X8462594D02*
G03*
X8462594Y2018496I-9842J0D01*
G01*
X8562594D02*
G03*
X8562594Y2018496I-9842J0D01*
G01*
X8162594Y1918496D02*
G03*
X8162594Y1918496I-9842J0D01*
G01*
X8262594D02*
G03*
X8262594Y1918496I-9842J0D01*
G01*
X8362594D02*
G03*
X8362594Y1918496I-9842J0D01*
G01*
X8462594D02*
G03*
X8462594Y1918496I-9842J0D01*
G01*
X8562594D02*
G03*
X8562594Y1918496I-9842J0D01*
G01*
X8162594Y1818496D02*
G03*
X8162594Y1818496I-9842J0D01*
G01*
X8262594D02*
G03*
X8262594Y1818496I-9842J0D01*
G01*
X8362594D02*
G03*
X8362594Y1818496I-9842J0D01*
G01*
X8462594D02*
G03*
X8462594Y1818496I-9842J0D01*
G01*
X8562594D02*
G03*
X8562594Y1818496I-9842J0D01*
G01*
X8162594Y1718496D02*
G03*
X8162594Y1718496I-9842J0D01*
G01*
X8262594D02*
G03*
X8262594Y1718496I-9842J0D01*
G01*
X8362594D02*
G03*
X8362594Y1718496I-9842J0D01*
G01*
X8462594D02*
G03*
X8462594Y1718496I-9842J0D01*
G01*
X8562594D02*
G03*
X8562594Y1718496I-9842J0D01*
G01*
X8162594Y1618496D02*
G03*
X8162594Y1618496I-9842J0D01*
G01*
X8262594D02*
G03*
X8262594Y1618496I-9842J0D01*
G01*
X8362594D02*
G03*
X8362594Y1618496I-9842J0D01*
G01*
X8462594D02*
G03*
X8462594Y1618496I-9842J0D01*
G01*
X8562594D02*
G03*
X8562594Y1618496I-9842J0D01*
G01*
X8162594Y1518496D02*
G03*
X8162594Y1518496I-9842J0D01*
G01*
X8262594D02*
G03*
X8262594Y1518496I-9842J0D01*
G01*
X8362594D02*
G03*
X8362594Y1518496I-9842J0D01*
G01*
X8462594D02*
G03*
X8462594Y1518496I-9842J0D01*
G01*
X8562594D02*
G03*
X8562594Y1518496I-9842J0D01*
G01*
X8162594Y1418496D02*
G03*
X8162594Y1418496I-9842J0D01*
G01*
X8262594D02*
G03*
X8262594Y1418496I-9842J0D01*
G01*
X8362594D02*
G03*
X8362594Y1418496I-9842J0D01*
G01*
X8462594D02*
G03*
X8462594Y1418496I-9842J0D01*
G01*
X8562594D02*
G03*
X8562594Y1418496I-9842J0D01*
G01*
X8162594Y1318496D02*
G03*
X8162594Y1318496I-9842J0D01*
G01*
X8262594D02*
G03*
X8262594Y1318496I-9842J0D01*
G01*
X8362594D02*
G03*
X8362594Y1318496I-9842J0D01*
G01*
X8462594D02*
G03*
X8462594Y1318496I-9842J0D01*
G01*
X8562594D02*
G03*
X8562594Y1318496I-9842J0D01*
G01*
X8162594Y1218496D02*
G03*
X8162594Y1218496I-9842J0D01*
G01*
X8262594D02*
G03*
X8262594Y1218496I-9842J0D01*
G01*
X8362594D02*
G03*
X8362594Y1218496I-9842J0D01*
G01*
X8462594D02*
G03*
X8462594Y1218496I-9842J0D01*
G01*
X8562594D02*
G03*
X8562594Y1218496I-9842J0D01*
G01*
X8162594Y1118496D02*
G03*
X8162594Y1118496I-9842J0D01*
G01*
X8262594D02*
G03*
X8262594Y1118496I-9842J0D01*
G01*
X8362594D02*
G03*
X8362594Y1118496I-9842J0D01*
G01*
X8462594D02*
G03*
X8462594Y1118496I-9842J0D01*
G01*
X8562594D02*
G03*
X8562594Y1118496I-9842J0D01*
G01*
X8162594Y1018496D02*
G03*
X8162594Y1018496I-9842J0D01*
G01*
X8262594D02*
G03*
X8262594Y1018496I-9842J0D01*
G01*
X8362594D02*
G03*
X8362594Y1018496I-9842J0D01*
G01*
X8462594D02*
G03*
X8462594Y1018496I-9842J0D01*
G01*
X8562594D02*
G03*
X8562594Y1018496I-9842J0D01*
G01*
X8162594Y918495D02*
G03*
X8162594Y918495I-9842J0D01*
G01*
X8262594D02*
G03*
X8262594Y918495I-9842J0D01*
G01*
X8362594D02*
G03*
X8362594Y918495I-9842J0D01*
G01*
X8462594D02*
G03*
X8462594Y918495I-9842J0D01*
G01*
X8562594D02*
G03*
X8562594Y918495I-9842J0D01*
G01*
X8162594Y818495D02*
G03*
X8162594Y818495I-9842J0D01*
G01*
X8262594D02*
G03*
X8262594Y818495I-9842J0D01*
G01*
X8362594D02*
G03*
X8362594Y818495I-9842J0D01*
G01*
X8462594D02*
G03*
X8462594Y818495I-9842J0D01*
G01*
X8562594D02*
G03*
X8562594Y818495I-9842J0D01*
G01*
X8162594Y718495D02*
G03*
X8162594Y718495I-9842J0D01*
G01*
X8262594D02*
G03*
X8262594Y718495I-9842J0D01*
G01*
X8362594D02*
G03*
X8362594Y718495I-9842J0D01*
G01*
X8462594D02*
G03*
X8462594Y718495I-9842J0D01*
G01*
X8562594D02*
G03*
X8562594Y718495I-9842J0D01*
G01*
X8162594Y618495D02*
G03*
X8162594Y618495I-9842J0D01*
G01*
X8262594D02*
G03*
X8262594Y618495I-9842J0D01*
G01*
X8362594D02*
G03*
X8362594Y618495I-9842J0D01*
G01*
X8462594D02*
G03*
X8462594Y618495I-9842J0D01*
G01*
X8562594D02*
G03*
X8562594Y618495I-9842J0D01*
G01*
X8162594Y518495D02*
G03*
X8162594Y518495I-9842J0D01*
G01*
X8262594D02*
G03*
X8262594Y518495I-9842J0D01*
G01*
X8362594D02*
G03*
X8362594Y518495I-9842J0D01*
G01*
X8462594D02*
G03*
X8462594Y518495I-9842J0D01*
G01*
X8562594D02*
G03*
X8562594Y518495I-9842J0D01*
G01*
X8162594Y418495D02*
G03*
X8162594Y418495I-9842J0D01*
G01*
X8262594D02*
G03*
X8262594Y418495I-9842J0D01*
G01*
X8362594D02*
G03*
X8362594Y418495I-9842J0D01*
G01*
X8462594D02*
G03*
X8462594Y418495I-9842J0D01*
G01*
X8562594D02*
G03*
X8562594Y418495I-9842J0D01*
G01*
X8605902Y3718497D02*
G03*
X8605902Y3718497I-53150J0D01*
G01*
Y218495D02*
G03*
X8605902Y218495I-53150J0D01*
G01*
X8602752Y1968496D02*
G03*
X8602752Y1968496I-50000J0D01*
G01*
X193694Y218495D02*
G03*
X193694Y218495I-53150J0D01*
G01*
Y3718497D02*
G03*
X193694Y3718497I-53150J0D01*
G01*
X5390389Y1973496D02*
G03*
X5390389Y1973496I-19685J0D01*
G01*
X8152752Y418495D02*
X8552752D01*
X8152752Y3518497D02*
X8552752D01*
X8152752Y418495D02*
Y3518497D01*
X8552752Y418495D02*
Y3518497D01*
X8517397Y1933141D02*
X8552752Y1968496D01*
X8588107Y1933141D01*
X8517397Y2003851D02*
X8552752Y1968496D01*
X8588107Y2003851D01*
X140544Y218495D02*
X178126Y180913D01*
X102962Y3680915D02*
X140544Y3718497D01*
X102962Y180913D02*
X140544Y218495D01*
Y3718497D02*
X178126Y3680915D01*
X8552752Y3669284D02*
Y3718497D01*
X8601965D01*
X8552752Y169282D02*
Y218495D01*
X8601965D01*
X8641730Y3838576D02*
Y3897631D01*
X2755900Y3838576D02*
Y3897631D01*
X8641730D01*
X2755900Y98416D02*
X8641730Y98416D01*
X2755900Y3838576D02*
X8641730D01*
Y39361D02*
Y98416D01*
X2755900Y39361D02*
Y98416D01*
Y39361D02*
X8641730D01*
X5020704Y4991D02*
Y1973496D01*
X1389993Y4991D02*
X5720704Y1973496D01*
X5020704D02*
X9351415Y4991D01*
X5020704Y1973496D02*
X9351415Y3942001D01*
X5020704Y1973496D02*
Y3942001D01*
X-7Y3838576D02*
X8661415D01*
X-7Y98416D02*
X8661415D01*
X5020704Y1973496D02*
X9351415D01*
X8042909Y3530676D02*
X8046658Y3532550D01*
X8052281Y3538174D01*
Y3498812D01*
X8027759Y437999D02*
X8048377D01*
X8037131Y423004D01*
X8042754D01*
X8046503Y421130D01*
X8048377Y419255D01*
X8050252Y413632D01*
Y409884D01*
X8048377Y404261D01*
X8044628Y400512D01*
X8039005Y398637D01*
X8033382D01*
X8027759Y400512D01*
X8025885Y402386D01*
X8024010Y406135D01*
X8060935Y428627D02*
Y430502D01*
X8062810Y434250D01*
X8064684Y436125D01*
X8068433Y437999D01*
X8075930D01*
X8079679Y436125D01*
X8081553Y434250D01*
X8083428Y430502D01*
Y426753D01*
X8081553Y423004D01*
X8077805Y417381D01*
X8059061Y398637D01*
X8085302D01*
X8559591Y3580959D02*
X8538972Y3554717D01*
Y3580959D02*
X8559591D01*
X8538972Y3554717D02*
X8559591D01*
X8460751Y3580245D02*
Y3554004D01*
Y3574622D02*
X8457003Y3578371D01*
X8453254Y3580245D01*
X8447631D01*
X8443882Y3578371D01*
X8440133Y3574622D01*
X8438259Y3568999D01*
Y3565250D01*
X8440133Y3559627D01*
X8443882Y3555878D01*
X8447631Y3554004D01*
X8453254D01*
X8457003Y3555878D01*
X8460751Y3559627D01*
X8338259Y3588887D02*
Y3549525D01*
Y3570143D02*
X8342008Y3573892D01*
X8345756Y3575767D01*
X8351379D01*
X8355128Y3573892D01*
X8358877Y3570143D01*
X8360751Y3564520D01*
Y3560772D01*
X8358877Y3555148D01*
X8355128Y3551400D01*
X8351379Y3549525D01*
X8345756D01*
X8342008Y3551400D01*
X8338259Y3555148D01*
X8264147Y3575335D02*
X8260398Y3579084D01*
X8256649Y3580959D01*
X8251026D01*
X8247277Y3579084D01*
X8243529Y3575335D01*
X8241654Y3569712D01*
Y3565964D01*
X8243529Y3560340D01*
X8247277Y3556592D01*
X8251026Y3554717D01*
X8256649D01*
X8260398Y3556592D01*
X8264147Y3560340D01*
X8162178Y3588887D02*
Y3549525D01*
Y3570143D02*
X8158429Y3573892D01*
X8154681Y3575767D01*
X8149057D01*
X8145309Y3573892D01*
X8141560Y3570143D01*
X8139686Y3564520D01*
Y3560772D01*
X8141560Y3555148D01*
X8145309Y3551400D01*
X8149057Y3549525D01*
X8154681D01*
X8158429Y3551400D01*
X8162178Y3555148D01*
X8808983Y2128476D02*
X8805234Y2135973D01*
X8797737Y2143471D01*
X8790239Y2147219D01*
X8775244D01*
X8767747Y2143471D01*
X8760249Y2135973D01*
X8756501Y2128476D01*
X8752752Y2117230D01*
Y2098486D01*
X8756501Y2087240D01*
X8760249Y2079742D01*
X8767747Y2072245D01*
X8775244Y2068496D01*
X8790239D01*
X8797737Y2072245D01*
X8805234Y2079742D01*
X8808983Y2087240D01*
Y2098486D01*
X8790239D02*
X8808983D01*
X8826977Y2147219D02*
Y2068496D01*
Y2147219D02*
X8860716D01*
X8871962Y2143471D01*
X8875710Y2139722D01*
X8879459Y2132224D01*
Y2124727D01*
X8875710Y2117230D01*
X8871962Y2113481D01*
X8860716Y2109732D01*
X8826977D01*
X8853218D02*
X8879459Y2068496D01*
X8897078Y2147219D02*
Y2068496D01*
X8913573Y2147219D02*
Y2068496D01*
Y2147219D02*
X8939814D01*
X8951060Y2143471D01*
X8958557Y2135973D01*
X8962306Y2128476D01*
X8966055Y2117230D01*
Y2098486D01*
X8962306Y2087240D01*
X8958557Y2079742D01*
X8951060Y2072245D01*
X8939814Y2068496D01*
X8913573D01*
X9068020Y2147219D02*
X9060523Y2143471D01*
X9053025Y2135973D01*
X9049277Y2128476D01*
X9045528Y2117230D01*
Y2098486D01*
X9049277Y2087240D01*
X9053025Y2079742D01*
X9060523Y2072245D01*
X9068020Y2068496D01*
X9083015D01*
X9090513Y2072245D01*
X9098010Y2079742D01*
X9101759Y2087240D01*
X9105508Y2098486D01*
Y2117230D01*
X9101759Y2128476D01*
X9098010Y2135973D01*
X9090513Y2143471D01*
X9083015Y2147219D01*
X9068020D01*
X9123876D02*
Y2068496D01*
Y2147219D02*
X9157615D01*
X9168861Y2143471D01*
X9172610Y2139722D01*
X9176359Y2132224D01*
Y2124727D01*
X9172610Y2117230D01*
X9168861Y2113481D01*
X9157615Y2109732D01*
X9123876D01*
X9150118D02*
X9176359Y2068496D01*
X9250209Y2128476D02*
X9246460Y2135973D01*
X9238962Y2143471D01*
X9231465Y2147219D01*
X9216470D01*
X9208973Y2143471D01*
X9201475Y2135973D01*
X9197726Y2128476D01*
X9193978Y2117230D01*
Y2098486D01*
X9197726Y2087240D01*
X9201475Y2079742D01*
X9208973Y2072245D01*
X9216470Y2068496D01*
X9231465D01*
X9238962Y2072245D01*
X9246460Y2079742D01*
X9250209Y2087240D01*
Y2098486D01*
X9231465D02*
X9250209D01*
D39*
X6108858Y381102D02*
G03*
X6108858Y381102I-8858J0D01*
G01*
Y518898D02*
G03*
X6108858Y518898I-8858J0D01*
G01*
Y840000D02*
G03*
X6108858Y840000I-8858J0D01*
G01*
Y977795D02*
G03*
X6108858Y977795I-8858J0D01*
G01*
X7300002Y475118D02*
Y494803D01*
Y475118D02*
X7319686D01*
X7300002Y455433D02*
Y475118D01*
X7280316D02*
X7300002D01*
X6950002Y420000D02*
Y439685D01*
Y420000D02*
X6969686D01*
X6950002Y400315D02*
Y420000D01*
X6930316D02*
X6950002D01*
X7050002D02*
Y439685D01*
Y420000D02*
X7069686D01*
X7050002Y400315D02*
Y420000D01*
X7030316D02*
X7050002D01*
X7150002D02*
Y439685D01*
Y420000D02*
X7169686D01*
X7150002Y400315D02*
Y420000D01*
X7130316D02*
X7150002D01*
X7250002D02*
Y439685D01*
Y420000D02*
X7269686D01*
X7250002Y400315D02*
Y420000D01*
X7230316D02*
X7250002D01*
X7450002D02*
Y439685D01*
Y420000D02*
X7469686D01*
X7450002Y400315D02*
Y420000D01*
X7430316D02*
X7450002D01*
X7550002D02*
Y439685D01*
Y420000D02*
X7569686D01*
X7550002Y400315D02*
Y420000D01*
X7530316D02*
X7550002D01*
X7650002D02*
Y439685D01*
Y420000D02*
X7669686D01*
X7650002Y400315D02*
Y420000D01*
X7630316D02*
X7650002D01*
X8000000Y620000D02*
X8039370D01*
X7960630D02*
X8000000D01*
Y580630D02*
Y620000D01*
Y659370D01*
X7853121Y601278D02*
X7888200Y619151D01*
X7923279Y637025D01*
X7870326Y654230D02*
X7888200Y619151D01*
X7906073Y584072D01*
X8076721Y602975D02*
X8111800Y620849D01*
X8146879Y638722D01*
X8093927Y655928D02*
X8111800Y620849D01*
X8129674Y585770D01*
X6100000Y518898D02*
Y527756D01*
X6091142Y518898D02*
X6100000D01*
X6091142Y381102D02*
X6100000D01*
Y389961D01*
X8250000Y1969999D02*
X8947638Y1970000D01*
X8658662Y122362D02*
Y3815276D01*
X6460630Y960000D02*
X6500000D01*
X6539370D01*
X6500000D02*
Y999370D01*
Y920630D02*
Y960000D01*
X6611800Y960849D02*
X6646879Y978722D01*
X6576721Y942975D02*
X6611800Y960849D01*
X6629674Y925770D01*
X6593927Y995928D02*
X6611800Y960849D01*
X6388200Y959151D02*
X6423279Y977025D01*
X6353121Y941278D02*
X6388200Y959151D01*
X6406073Y924072D01*
X6370326Y994230D02*
X6388200Y959151D01*
X6100000Y977795D02*
Y986654D01*
X6091142Y977795D02*
X6100000D01*
X6091142Y840000D02*
X6100000D01*
Y848858D01*
X6460630Y420000D02*
X6500000D01*
X6539370D01*
X6500000D02*
Y459370D01*
Y380630D02*
Y420000D01*
X6611800Y420849D02*
X6646879Y438722D01*
X6576721Y402975D02*
X6611800Y420849D01*
X6629674Y385770D01*
X6593927Y455928D02*
X6611800Y420849D01*
X6388200Y419151D02*
X6423279Y437025D01*
X6353121Y401278D02*
X6388200Y419151D01*
X6406073Y384072D01*
X6370326Y454230D02*
X6388200Y419151D01*
X391081Y1962065D02*
X405000Y1975985D01*
X391081Y1989904D02*
X405000Y1975985D01*
X418920Y1989904D01*
X405000Y1975985D02*
X418920Y1962065D01*
X385315Y773228D02*
X405000D01*
Y792913D01*
Y773228D02*
X424685D01*
X405000Y753543D02*
Y773228D01*
X385315Y3178741D02*
X405000D01*
Y3198426D01*
Y3178741D02*
X424685D01*
X405000Y3159056D02*
Y3178741D01*
X385315Y1161024D02*
X405000D01*
Y1180709D01*
Y1161024D02*
X424685D01*
X405000Y1141339D02*
Y1161024D01*
X385315Y1269685D02*
X405000D01*
Y1289370D01*
Y1269685D02*
X424685D01*
X405000Y1250000D02*
Y1269685D01*
X385315Y1378347D02*
X405000D01*
Y1398032D01*
Y1378347D02*
X424685D01*
X405000Y1358661D02*
Y1378347D01*
X385315Y1487008D02*
X405000D01*
Y1506693D01*
Y1487008D02*
X424685D01*
X405000Y1467323D02*
Y1487008D01*
X385315Y1595669D02*
X405000D01*
Y1615354D01*
Y1595669D02*
X424685D01*
X405000Y1575984D02*
Y1595669D01*
X385315Y1704331D02*
X405000D01*
Y1724016D01*
Y1704331D02*
X424685D01*
X405000Y1684646D02*
Y1704331D01*
X385315Y1812992D02*
X405000D01*
Y1832677D01*
Y1812992D02*
X424685D01*
X405000Y1793307D02*
Y1812992D01*
X385315Y1921654D02*
X405000D01*
Y1941339D01*
Y1921654D02*
X424685D01*
X405000Y1901969D02*
Y1921654D01*
X385315Y2030315D02*
X405000D01*
Y2050000D01*
Y2030315D02*
X424685D01*
X405000Y2010630D02*
Y2030315D01*
X385315Y2138977D02*
X405000D01*
Y2158662D01*
Y2138977D02*
X424685D01*
X405000Y2119292D02*
Y2138977D01*
X385315Y2247638D02*
X405000D01*
Y2267323D01*
Y2247638D02*
X424685D01*
X405000Y2227953D02*
Y2247638D01*
X385315Y2356300D02*
X405000D01*
Y2375985D01*
Y2356300D02*
X424685D01*
X405000Y2336615D02*
Y2356300D01*
X385315Y2464961D02*
X405000D01*
Y2484646D01*
Y2464961D02*
X424685D01*
X405000Y2445276D02*
Y2464961D01*
X385315Y2573623D02*
X405000D01*
Y2593308D01*
Y2573623D02*
X424685D01*
X405000Y2553938D02*
Y2573623D01*
X385315Y2682284D02*
X405000D01*
Y2701969D01*
Y2682284D02*
X424685D01*
X405000Y2662599D02*
Y2682284D01*
X385315Y2790946D02*
X405000D01*
Y2810631D01*
Y2790946D02*
X424685D01*
X405000Y2771261D02*
Y2790946D01*
X285315Y1106693D02*
X305000D01*
Y1126378D01*
Y1106693D02*
X324685D01*
X305000Y1087008D02*
Y1106693D01*
X285315Y1215354D02*
X305000D01*
Y1235039D01*
Y1215354D02*
X324685D01*
X305000Y1195669D02*
Y1215354D01*
X285315Y1324016D02*
X305000D01*
Y1343701D01*
Y1324016D02*
X324685D01*
X305000Y1304331D02*
Y1324016D01*
X285315Y1432677D02*
X305000D01*
Y1452362D01*
Y1432677D02*
X324685D01*
X305000Y1412992D02*
Y1432677D01*
X285315Y1541339D02*
X305000D01*
Y1561024D01*
Y1541339D02*
X324685D01*
X305000Y1521654D02*
Y1541339D01*
X285315Y1650000D02*
X305000D01*
Y1669685D01*
Y1650000D02*
X324685D01*
X305000Y1630315D02*
Y1650000D01*
X285315Y1758662D02*
X305000D01*
Y1778347D01*
Y1758662D02*
X324685D01*
X305000Y1738977D02*
Y1758662D01*
X285315Y1867323D02*
X305000D01*
Y1887008D01*
Y1867323D02*
X324685D01*
X305000Y1847638D02*
Y1867323D01*
X285315Y1975985D02*
X305000D01*
Y1995670D01*
Y1975985D02*
X324685D01*
X305000Y1956300D02*
Y1975985D01*
X285315Y2084646D02*
X305000D01*
Y2104331D01*
Y2084646D02*
X324685D01*
X305000Y2064961D02*
Y2084646D01*
X285315Y2193308D02*
X305000D01*
Y2212993D01*
Y2193308D02*
X324685D01*
X305000Y2173622D02*
Y2193308D01*
X285315Y2301969D02*
X305000D01*
Y2321654D01*
Y2301969D02*
X324685D01*
X305000Y2282284D02*
Y2301969D01*
X285315Y2410631D02*
X305000D01*
Y2430316D01*
Y2410631D02*
X324685D01*
X305000Y2390945D02*
Y2410631D01*
X285315Y2519292D02*
X305000D01*
Y2538977D01*
Y2519292D02*
X324685D01*
X305000Y2499607D02*
Y2519292D01*
X285315Y2627954D02*
X305000D01*
Y2647639D01*
Y2627954D02*
X324685D01*
X305000Y2608268D02*
Y2627954D01*
X285315Y2736615D02*
X305000D01*
Y2756300D01*
Y2736615D02*
X324685D01*
X305000Y2716930D02*
Y2736615D01*
X485315Y1106693D02*
X505000D01*
Y1126378D01*
Y1106693D02*
X524685D01*
X505000Y1087008D02*
Y1106693D01*
X485315Y1215354D02*
X505000D01*
Y1235039D01*
Y1215354D02*
X524685D01*
X505000Y1195669D02*
Y1215354D01*
X485315Y1324016D02*
X505000D01*
Y1343701D01*
Y1324016D02*
X524685D01*
X505000Y1304331D02*
Y1324016D01*
X485315Y1432677D02*
X505000D01*
Y1452362D01*
Y1432677D02*
X524685D01*
X505000Y1412992D02*
Y1432677D01*
X485315Y1541339D02*
X505000D01*
Y1561024D01*
Y1541339D02*
X524685D01*
X505000Y1521654D02*
Y1541339D01*
X485315Y1650000D02*
X505000D01*
Y1669685D01*
Y1650000D02*
X524685D01*
X505000Y1630315D02*
Y1650000D01*
X485315Y1758662D02*
X505000D01*
Y1778347D01*
Y1758662D02*
X524685D01*
X505000Y1738977D02*
Y1758662D01*
X485315Y1867323D02*
X505000D01*
Y1887008D01*
Y1867323D02*
X524685D01*
X505000Y1847638D02*
Y1867323D01*
X485315Y1975985D02*
X505000D01*
Y1995670D01*
Y1975985D02*
X524685D01*
X505000Y1956300D02*
Y1975985D01*
X485315Y2084646D02*
X505000D01*
Y2104331D01*
Y2084646D02*
X524685D01*
X505000Y2064961D02*
Y2084646D01*
X485315Y2193308D02*
X505000D01*
Y2212993D01*
Y2193308D02*
X524685D01*
X505000Y2173622D02*
Y2193308D01*
X485315Y2301969D02*
X505000D01*
Y2321654D01*
Y2301969D02*
X524685D01*
X505000Y2282284D02*
Y2301969D01*
X485315Y2410631D02*
X505000D01*
Y2430316D01*
Y2410631D02*
X524685D01*
X505000Y2390945D02*
Y2410631D01*
X485315Y2519292D02*
X505000D01*
Y2538977D01*
Y2519292D02*
X524685D01*
X505000Y2499607D02*
Y2519292D01*
X485315Y2627954D02*
X505000D01*
Y2647639D01*
Y2627954D02*
X524685D01*
X505000Y2608268D02*
Y2627954D01*
X485315Y2736615D02*
X505000D01*
Y2756300D01*
Y2736615D02*
X524685D01*
X505000Y2716930D02*
Y2736615D01*
X285315Y2845276D02*
X305000D01*
Y2864961D01*
Y2845276D02*
X324685D01*
X305000Y2825591D02*
Y2845276D01*
X485315D02*
X505000D01*
Y2864961D01*
Y2845276D02*
X524685D01*
X505000Y2825591D02*
Y2845276D01*
D40*
X8650000Y1895000D02*
X8602771D01*
Y1918614D01*
X8610643Y1926486D01*
X8626386D01*
X8634257Y1918614D01*
Y1895000D01*
X8610643Y1973715D02*
X8602771Y1965843D01*
Y1950100D01*
X8610643Y1942229D01*
X8642129D01*
X8650000Y1950100D01*
Y1965843D01*
X8642129Y1973715D01*
X8602771Y1989458D02*
X8650000D01*
Y2013072D01*
X8642129Y2020944D01*
X8634257D01*
X8626386Y2013072D01*
Y1989458D01*
Y2013072D01*
X8618514Y2020944D01*
X8610643D01*
X8602771Y2013072D01*
Y1989458D01*
D41*
X1910630Y2447500D02*
X1950000D01*
X1960630Y1947500D02*
X2000000D01*
X2039370D01*
X2000000D02*
Y1986870D01*
Y1908130D02*
Y1947500D01*
X2010630Y2947500D02*
X2050000D01*
X2089370D01*
X2050000D02*
Y2986870D01*
Y2908130D02*
Y2947500D01*
X1910630D02*
X1950000D01*
X1989370D01*
X1950000D02*
Y2986870D01*
Y2908130D02*
Y2947500D01*
X2010630Y3047500D02*
X2050000D01*
X2089370D01*
X2050000D02*
Y3086870D01*
Y3008130D02*
Y3047500D01*
X1910630D02*
X1950000D01*
X1989370D01*
X1950000D02*
Y3086870D01*
Y3008130D02*
Y3047500D01*
X2010630Y3147500D02*
X2050000D01*
X2089370D01*
X2050000D02*
Y3186870D01*
Y3108130D02*
Y3147500D01*
X1910630D02*
X1950000D01*
X1989370D01*
X1950000D02*
Y3186870D01*
Y3108130D02*
Y3147500D01*
X2010630Y747500D02*
X2050000D01*
X2089370D01*
X2050000D02*
Y786870D01*
Y708130D02*
Y747500D01*
X1910630D02*
X1950000D01*
X1989370D01*
X1950000D02*
Y786870D01*
Y708130D02*
Y747500D01*
X2010630Y847500D02*
X2050000D01*
X2089370D01*
X2050000D02*
Y886870D01*
Y808130D02*
Y847500D01*
X1910630D02*
X1950000D01*
X1989370D01*
X1950000D02*
Y886870D01*
Y808130D02*
Y847500D01*
X2010630Y947500D02*
X2050000D01*
X2089370D01*
X2050000D02*
Y986870D01*
Y908130D02*
Y947500D01*
X1910630D02*
X1950000D01*
X1989370D01*
X1950000D02*
Y986870D01*
Y908130D02*
Y947500D01*
X2010630Y1047500D02*
X2050000D01*
X2089370D01*
X2050000D02*
Y1086870D01*
Y1008130D02*
Y1047500D01*
X1910630D02*
X1950000D01*
X1989370D01*
X1950000D02*
Y1086870D01*
Y1008130D02*
Y1047500D01*
X2010630Y1547500D02*
X2050000D01*
X2089370D01*
X2050000D02*
Y1586870D01*
Y1508130D02*
Y1547500D01*
X1910630D02*
X1950000D01*
X1989370D01*
X1950000D02*
Y1586870D01*
Y1508130D02*
Y1547500D01*
X2010630Y1647500D02*
X2050000D01*
X2089370D01*
X2050000D02*
Y1686870D01*
Y1608130D02*
Y1647500D01*
X1910630D02*
X1950000D01*
X1989370D01*
X1950000D02*
Y1686870D01*
Y1608130D02*
Y1647500D01*
X2010630Y1747500D02*
X2050000D01*
X2089370D01*
X2050000D02*
Y1786870D01*
Y1708130D02*
Y1747500D01*
X1910630D02*
X1950000D01*
X1989370D01*
X1950000D02*
Y1786870D01*
Y1708130D02*
Y1747500D01*
X2010630Y1847500D02*
X2050000D01*
X2089370D01*
X2050000D02*
Y1886870D01*
Y1808130D02*
Y1847500D01*
X1910630D02*
X1950000D01*
X1989370D01*
X1950000D02*
Y1886870D01*
Y1808130D02*
Y1847500D01*
X2010630Y1947500D02*
X2050000D01*
X2089370D01*
X2050000D02*
Y1986870D01*
Y1908130D02*
Y1947500D01*
X1910630D02*
X1950000D01*
X1989370D01*
X1950000D02*
Y1986870D01*
Y1908130D02*
Y1947500D01*
X2010630Y2047500D02*
X2050000D01*
X2089370D01*
X2050000D02*
Y2086870D01*
Y2008130D02*
Y2047500D01*
X1910630D02*
X1950000D01*
X1989370D01*
X1950000D02*
Y2086870D01*
Y2008130D02*
Y2047500D01*
X2010630Y2147500D02*
X2050000D01*
X2089370D01*
X2050000D02*
Y2186870D01*
Y2108130D02*
Y2147500D01*
X1910630D02*
X1950000D01*
X1989370D01*
X1950000D02*
Y2186870D01*
Y2108130D02*
Y2147500D01*
X2010630Y2247500D02*
X2050000D01*
X2089370D01*
X2050000D02*
Y2286870D01*
Y2208130D02*
Y2247500D01*
X1910630D02*
X1950000D01*
X1989370D01*
X1950000D02*
Y2286870D01*
Y2208130D02*
Y2247500D01*
X2010630Y2347500D02*
X2050000D01*
X2089370D01*
X2050000D02*
Y2386870D01*
Y2308130D02*
Y2347500D01*
X1910630D02*
X1950000D01*
X1989370D01*
X1950000D02*
Y2386870D01*
Y2308130D02*
Y2347500D01*
X2010630Y2847500D02*
X2050000D01*
X2089370D01*
X2050000D02*
Y2886870D01*
Y2808130D02*
Y2847500D01*
X1910630D02*
X1950000D01*
X1989370D01*
X1950000D02*
Y2886870D01*
Y2808130D02*
Y2847500D01*
X2010630Y1147500D02*
X2050000D01*
X2089370D01*
X2050000D02*
Y1186870D01*
Y1108130D02*
Y1147500D01*
X1910630D02*
X1950000D01*
X1989370D01*
X1950000D02*
Y1186870D01*
Y1108130D02*
Y1147500D01*
X2010630Y1247500D02*
X2050000D01*
X2089370D01*
X2050000D02*
Y1286870D01*
Y1208130D02*
Y1247500D01*
X1910630D02*
X1950000D01*
X1989370D01*
X1950000D02*
Y1286870D01*
Y1208130D02*
Y1247500D01*
X2010630Y1347500D02*
X2050000D01*
X2089370D01*
X2050000D02*
Y1386870D01*
Y1308130D02*
Y1347500D01*
X1910630D02*
X1950000D01*
X1989370D01*
X1950000D02*
Y1386870D01*
Y1308130D02*
Y1347500D01*
X2010630Y1447500D02*
X2050000D01*
X2089370D01*
X2050000D02*
Y1486870D01*
Y1408130D02*
Y1447500D01*
X1910630D02*
X1950000D01*
X1989370D01*
X1950000D02*
Y1486870D01*
Y1408130D02*
Y1447500D01*
X2010630Y2447500D02*
X2050000D01*
X2089370D01*
X2050000D02*
Y2486870D01*
Y2408130D02*
Y2447500D01*
X1950000D02*
X1989370D01*
X1950000D02*
Y2486870D01*
Y2408130D02*
Y2447500D01*
X2010630Y2547500D02*
X2050000D01*
X2089370D01*
X2050000D02*
Y2586870D01*
Y2508130D02*
Y2547500D01*
X1910630D02*
X1950000D01*
X1989370D01*
X1950000D02*
Y2586870D01*
Y2508130D02*
Y2547500D01*
X2010630Y2647500D02*
X2050000D01*
X2089370D01*
X2050000D02*
Y2686870D01*
Y2608130D02*
Y2647500D01*
X1910630D02*
X1950000D01*
X1989370D01*
X1950000D02*
Y2686870D01*
Y2608130D02*
Y2647500D01*
X2010630Y2747500D02*
X2050000D01*
X2089370D01*
X2050000D02*
Y2786870D01*
Y2708130D02*
Y2747500D01*
X1910630D02*
X1950000D01*
X1989370D01*
X1950000D02*
Y2786870D01*
Y2708130D02*
Y2747500D01*
D42*
X8427752Y3518496D02*
X8477752D01*
X8452752Y3493496D02*
Y3543496D01*
X8527752Y1968496D02*
X8577752D01*
X8552752Y1943496D02*
Y1993496D01*
%TF.MD5,3215b14ee3147807299a378362ebd03c*%
M02*
