/* XPM */
static char* windowTree[] = {
"47 40 84 1",
"  c #000000",
"! c #C0C0C0",
"# c #C0DCC0",
"$ c #F0CAA6",
"% c #040404",
"& c #080808",
"' c #0C0C0C",
"( c #111111",
") c #161616",
"* c #1C1C1C",
"+ c #222222",
", c #292929",
"- c #555555",
". c #4D4D4D",
"/ c #424242",
"0 c #393939",
"1 c #818181",
"2 c #003300",
"3 c #003333",
"4 c #006600",
"5 c #330000",
"6 c #333300",
"7 c #333333",
"8 c #336600",
"9 c #336633",
": c #336666",
"; c #339933",
"< c #33CC66",
"= c #660000",
"> c #660033",
"? c #663333",
"@ c #663366",
"A c #666600",
"B c #666633",
"C c #666666",
"D c #669933",
"E c #669966",
"F c #669999",
"G c #990000",
"H c #993333",
"I c #996633",
"J c #993366",
"K c #999966",
"L c #999999",
"M c #99CC99",
"N c #99CCCC",
"O c #99CC66",
"P c #99FF99",
"Q c #99FFCC",
"R c #CC0000",
"S c #993300",
"T c #CC3333",
"U c #CC6633",
"V c #996666",
"W c #CC6699",
"X c #CC9966",
"Y c #CC9999",
"Z c #CCCC66",
"[ c #CCCC99",
"\ c #CCCCCC",
"] c #CCFF99",
"^ c #CCFFFF",
"_ c #CC3300",
"` c #CC6666",
"a c #FFCCCC",
"b c #FFFF99",
"c c #FFFFCC",
"d c #C1C1C1",
"e c #5F5F5F",
"f c #777777",
"g c #868686",
"h c #969696",
"i c none",
"j c #B2B2B2",
"k c #D7D7D7",
"l c #DDDDDD",
"m c #E3E3E3",
"n c #EAEAEA",
"o c #F1F1F1",
"p c #F8F8F8",
"q c #F0FBFF",
"r c #A4A0A0",
"s c #808080",
"t c #FFFFFF",
"iiiiiiiiiiiiiiiih--e-eee!!CVeVVeHVVHVVVVVVVVfff",
"iiiiiiiiiiiiiiiie,CCC:.'g`==============?=????0",
"iiiiiiiiiiiiiiiiee^n^kr*VYHHHHHHTHTHTHHTHHHJH?0",
"iiiiiiiiiiiiiiiiee^jjN#7V`SHGG_R_RG_R_T_HTTUH??",
"iiiiiiiiiiiiiiiiCC^!N!\,V`HG_HSGH__G_HGTHHHHH?0",
"iiiiiiiiiiiiiiiiC:#\#k#,fYX`X``````````X``YXhV7",
"iiiiiiiiiiiiiiiie/FjNNr3CtttttttttttttttttttiV/",
"iiiiiiiiiiiiiiiie2'''((&fttttttttttttttttttt\g7",
"iiiiiiiiiiiiiiii!Lgh00hFrttttttttttttttttttt\g7",
"iiiiiiiiiiiiiiii!Ltle:!kkj1sssff1jttttttttttkg7",
"iiiiiiiiiiiiiiiieetqC.!ttr(0/000)etttttttttt\g7",
"iiiiiiiiiiiiiiiie-tte/!ptL7$cbc[B.\ttttttttt\g7",
"iiiiiiiiiiiiiiiieette',70++[]$]K7B!tttttttttkg7",
"iiiiiiiiiiiiiiiie-ttjfCeC.+]c$ZD6.!tttttttttig7",
"iiiiiiiiiiiiiiiieettttkdkg*[[ZOI6.!pttttttttig,",
"iiiiiiiiiiiiiiii-etttptttL*[KABD79#pttttttttig,",
"iiiiiiiiiiiiiiiieettttttpr*+))2*2/Mttttttpttig7",
"iiiiiiiiiiiiiiiieetttttttkhffB(eEK!tttpttttt!F,",
"i(iiiii%iiiii iiCetttptpttttt1)h#\#rrrrrrrjq\g,",
"i(iiii%i iiii iieettttttttpttL*rttk+2+,,,39t\g7",
"ii'iii i%iii iiie-tttttttttttL+jptk,E#PPME7t!g,",
"ii'iii%i iii iiieetttttpttpttL(.ee.2gQMME97t!17",
"ii(iii \ iii iiieettttttttttpL5.@-/(gPD<;89p!g7",
"i\i&i%iii%i iiiieetttttttptttL+Yiar+EM;;;97t!g7",
"iii&i%ii\ i iiiie-tttttttttttr5Yptk,EE;8990t!s7",
"iii&i%i\i i%iiiieetttttttptttL6rttk3,342960t!g7",
"iiii%iiiii iiiiieettttttttttpL+rttmgE-CCeeft!g7",
"iiii%iiiii%iiiiie-ttttttttpttr+rttttqttttttt!g7",
"iiiiiiiiiiiiiiiieetttttttttttL*rptk+'))5,7?t\g7",
"iiiiiiiiiiiiiiiieetttptttttttL)Ltt\+fjYYV??qdg7",
"iiiiiiiiiiiiiiiieettttttttttpr5.Csf(hiWYV??qdg7",
"iiiiiiiiiiiiiii\eetttttttttttj00777'hYH?>??q!g7",
"iiiiiiiiiiiiiii\eetttttttttpttLLLLL*KY@H??0t!1,",
"iiiiiiiiiiiiiiiieetttttttttttttttt\+.@??>7?p!17",
"iiiiiiiiiiiiiii\eettttttttttttttttk+655>6>7t!17",
"iiiiiiiiiiiiii\ieettttttttttttttptle..?@?eVo!g7",
"iiiiiiiiiiiiiiiieettttttttttttttttttttttttpt!17",
"iiiiiiiiiiiiiiiiC.!dd!!ddd!diid!ddd!dddddd!!!g7",
"iiiiiiiiiiiiiiiie+..../.-....--...----?eCV-CC-,",
"iiiiiiiiiiiiiiiihee-e--eeeeee@Ce-eeeeeCCVCCffff"};