%TF.GenerationSoftware,Altium Limited,Altium Designer,19.1.5 (86)*%
G04 Layer_Color=255*
%FSLAX26Y26*%
%MOIN*%
%TF.FileFunction,Pads,Bot*%
%TF.Part,Single*%
G01*
G75*
%TA.AperFunction,ComponentPad*%
%ADD16C,0.062992*%
%ADD17C,0.181102*%
%ADD18C,0.066929*%
%ADD20C,0.098425*%
%ADD22C,0.200787*%
D16*
X18750000Y7049998D02*
D03*
X18650000D02*
D03*
X18750000Y6949998D02*
D03*
X18650000D02*
D03*
Y6849998D02*
D03*
X18750000Y6749998D02*
D03*
X18650000D02*
D03*
Y6649998D02*
D03*
X18750000D02*
D03*
Y6849998D02*
D03*
Y6549998D02*
D03*
X18650000D02*
D03*
X18750000Y6449998D02*
D03*
X18650000D02*
D03*
X11980000Y5050000D02*
D03*
X12080000D02*
D03*
X11980000Y5150000D02*
D03*
X12080000D02*
D03*
X11980000Y5250000D02*
D03*
X12080000D02*
D03*
Y5950000D02*
D03*
X11980000D02*
D03*
X12080000Y5850000D02*
D03*
X11980000D02*
D03*
Y5750000D02*
D03*
X12080000Y5650000D02*
D03*
X11980000D02*
D03*
Y5550000D02*
D03*
X12080000D02*
D03*
Y5750000D02*
D03*
Y5450000D02*
D03*
X11980000D02*
D03*
X12080000Y5350000D02*
D03*
X11980000D02*
D03*
X10500000Y5950000D02*
D03*
X10400000D02*
D03*
X10500000Y5850000D02*
D03*
X10400000D02*
D03*
X10500000Y5750000D02*
D03*
X10400000D02*
D03*
Y5050000D02*
D03*
X10500000D02*
D03*
X10400000Y5150000D02*
D03*
X10500000D02*
D03*
Y5250000D02*
D03*
X10400000Y5350000D02*
D03*
X10500000D02*
D03*
Y5450000D02*
D03*
X10400000D02*
D03*
Y5250000D02*
D03*
Y5550000D02*
D03*
X10500000D02*
D03*
X10400000Y5650000D02*
D03*
X10500000D02*
D03*
D17*
X18709843Y7401967D02*
D03*
Y6098029D02*
D03*
X12040000Y4697500D02*
D03*
Y6302500D02*
D03*
X10440000D02*
D03*
Y4697500D02*
D03*
D18*
X8100000Y7100000D02*
D03*
Y7000000D02*
D03*
Y6900000D02*
D03*
Y6800000D02*
D03*
Y6700000D02*
D03*
Y6600000D02*
D03*
Y6500000D02*
D03*
Y6400000D02*
D03*
Y5600000D02*
D03*
Y5700000D02*
D03*
Y5800000D02*
D03*
Y5900000D02*
D03*
Y6000000D02*
D03*
Y6100000D02*
D03*
Y6200000D02*
D03*
Y6300000D02*
D03*
Y4800000D02*
D03*
Y4900000D02*
D03*
Y5000000D02*
D03*
Y5100000D02*
D03*
Y5200000D02*
D03*
Y5300000D02*
D03*
Y5400000D02*
D03*
Y5500000D02*
D03*
Y4000000D02*
D03*
Y4100000D02*
D03*
Y4200000D02*
D03*
Y4300000D02*
D03*
Y4400000D02*
D03*
Y4500000D02*
D03*
Y4600000D02*
D03*
Y4700000D02*
D03*
X8000000Y7100000D02*
D03*
Y7000000D02*
D03*
Y6900000D02*
D03*
Y6800000D02*
D03*
Y6700000D02*
D03*
Y6600000D02*
D03*
Y6500000D02*
D03*
Y6400000D02*
D03*
Y5600000D02*
D03*
Y5700000D02*
D03*
Y5800000D02*
D03*
Y5900000D02*
D03*
Y6000000D02*
D03*
Y6100000D02*
D03*
Y6200000D02*
D03*
Y6300000D02*
D03*
Y4800000D02*
D03*
Y4900000D02*
D03*
Y5000000D02*
D03*
Y5100000D02*
D03*
Y5200000D02*
D03*
Y5300000D02*
D03*
Y5400000D02*
D03*
Y5500000D02*
D03*
Y4000000D02*
D03*
Y4100000D02*
D03*
Y4200000D02*
D03*
Y4300000D02*
D03*
Y4400000D02*
D03*
Y4500000D02*
D03*
Y4600000D02*
D03*
Y4700000D02*
D03*
X17700001Y7100000D02*
D03*
Y7000000D02*
D03*
Y6900000D02*
D03*
Y6800000D02*
D03*
Y6700000D02*
D03*
Y6600000D02*
D03*
Y6500000D02*
D03*
Y6400000D02*
D03*
Y5600000D02*
D03*
Y5700000D02*
D03*
Y5800000D02*
D03*
Y5900000D02*
D03*
Y6000000D02*
D03*
Y6100000D02*
D03*
Y6200000D02*
D03*
Y6300000D02*
D03*
Y4800000D02*
D03*
Y4900000D02*
D03*
Y5000000D02*
D03*
Y5100000D02*
D03*
Y5200000D02*
D03*
Y5300000D02*
D03*
Y5400000D02*
D03*
Y5500000D02*
D03*
Y4000000D02*
D03*
Y4100000D02*
D03*
Y4200000D02*
D03*
Y4300000D02*
D03*
Y4400000D02*
D03*
Y4500000D02*
D03*
Y4600000D02*
D03*
Y4700000D02*
D03*
X17600000Y7100000D02*
D03*
Y7000000D02*
D03*
Y6900000D02*
D03*
Y6800000D02*
D03*
Y6700000D02*
D03*
Y6600000D02*
D03*
Y6500000D02*
D03*
Y6400000D02*
D03*
Y5600000D02*
D03*
Y5700000D02*
D03*
Y5800000D02*
D03*
Y5900000D02*
D03*
Y6000000D02*
D03*
Y6100000D02*
D03*
Y6200000D02*
D03*
Y6300000D02*
D03*
Y4800000D02*
D03*
Y4900000D02*
D03*
Y5000000D02*
D03*
Y5100000D02*
D03*
Y5200000D02*
D03*
Y5300000D02*
D03*
Y5400000D02*
D03*
Y5500000D02*
D03*
Y4000000D02*
D03*
Y4100000D02*
D03*
Y4200000D02*
D03*
Y4300000D02*
D03*
Y4400000D02*
D03*
Y4500000D02*
D03*
Y4600000D02*
D03*
Y4700000D02*
D03*
X16100000Y7100000D02*
D03*
Y7000000D02*
D03*
Y6900000D02*
D03*
Y6800000D02*
D03*
Y6700000D02*
D03*
Y6600000D02*
D03*
Y6500000D02*
D03*
Y6400000D02*
D03*
Y5600000D02*
D03*
Y5700000D02*
D03*
Y5800000D02*
D03*
Y5900000D02*
D03*
Y6000000D02*
D03*
Y6100000D02*
D03*
Y6200000D02*
D03*
Y6300000D02*
D03*
Y4800000D02*
D03*
Y4900000D02*
D03*
Y5000000D02*
D03*
Y5100000D02*
D03*
Y5200000D02*
D03*
Y5300000D02*
D03*
Y5400000D02*
D03*
Y5500000D02*
D03*
Y4000000D02*
D03*
Y4100000D02*
D03*
Y4200000D02*
D03*
Y4300000D02*
D03*
Y4400000D02*
D03*
Y4500000D02*
D03*
Y4600000D02*
D03*
Y4700000D02*
D03*
X16000000Y7100000D02*
D03*
Y7000000D02*
D03*
Y6900000D02*
D03*
Y6800000D02*
D03*
Y6700000D02*
D03*
Y6600000D02*
D03*
Y6500000D02*
D03*
Y6400000D02*
D03*
Y5600000D02*
D03*
Y5700000D02*
D03*
Y5800000D02*
D03*
Y5900000D02*
D03*
Y6000000D02*
D03*
Y6100000D02*
D03*
Y6200000D02*
D03*
Y6300000D02*
D03*
Y4800000D02*
D03*
Y4900000D02*
D03*
Y5000000D02*
D03*
Y5100000D02*
D03*
Y5200000D02*
D03*
Y5300000D02*
D03*
Y5400000D02*
D03*
Y5500000D02*
D03*
Y4000000D02*
D03*
Y4100000D02*
D03*
Y4200000D02*
D03*
Y4300000D02*
D03*
Y4400000D02*
D03*
Y4500000D02*
D03*
Y4600000D02*
D03*
Y4700000D02*
D03*
X14500000Y7100000D02*
D03*
Y7000000D02*
D03*
Y6900000D02*
D03*
Y6800000D02*
D03*
Y6700000D02*
D03*
Y6600000D02*
D03*
Y6500000D02*
D03*
Y6400000D02*
D03*
Y5600000D02*
D03*
Y5700000D02*
D03*
Y5800000D02*
D03*
Y5900000D02*
D03*
Y6000000D02*
D03*
Y6100000D02*
D03*
Y6200000D02*
D03*
Y6300000D02*
D03*
Y4800000D02*
D03*
Y4900000D02*
D03*
Y5000000D02*
D03*
Y5100000D02*
D03*
Y5200000D02*
D03*
Y5300000D02*
D03*
Y5400000D02*
D03*
Y5500000D02*
D03*
Y4000000D02*
D03*
Y4100000D02*
D03*
Y4200000D02*
D03*
Y4300000D02*
D03*
Y4400000D02*
D03*
Y4500000D02*
D03*
Y4600000D02*
D03*
Y4700000D02*
D03*
X14400000Y7100000D02*
D03*
Y7000000D02*
D03*
Y6900000D02*
D03*
Y6800000D02*
D03*
Y6700000D02*
D03*
Y6600000D02*
D03*
Y6500000D02*
D03*
Y6400000D02*
D03*
Y5600000D02*
D03*
Y5700000D02*
D03*
Y5800000D02*
D03*
Y5900000D02*
D03*
Y6000000D02*
D03*
Y6100000D02*
D03*
Y6200000D02*
D03*
Y6300000D02*
D03*
Y4800000D02*
D03*
Y4900000D02*
D03*
Y5000000D02*
D03*
Y5100000D02*
D03*
Y5200000D02*
D03*
Y5300000D02*
D03*
Y5400000D02*
D03*
Y5500000D02*
D03*
Y4000000D02*
D03*
Y4100000D02*
D03*
Y4200000D02*
D03*
Y4300000D02*
D03*
Y4400000D02*
D03*
Y4500000D02*
D03*
Y4600000D02*
D03*
Y4700000D02*
D03*
X12900000Y7100000D02*
D03*
Y7000000D02*
D03*
Y6900000D02*
D03*
Y6800000D02*
D03*
Y6700000D02*
D03*
Y6600000D02*
D03*
Y6500000D02*
D03*
Y6400000D02*
D03*
Y5600000D02*
D03*
Y5700000D02*
D03*
Y5800000D02*
D03*
Y5900000D02*
D03*
Y6000000D02*
D03*
Y6100000D02*
D03*
Y6200000D02*
D03*
Y6300000D02*
D03*
Y4800000D02*
D03*
Y4900000D02*
D03*
Y5000000D02*
D03*
Y5100000D02*
D03*
Y5200000D02*
D03*
Y5300000D02*
D03*
Y5400000D02*
D03*
Y5500000D02*
D03*
Y4000000D02*
D03*
Y4100000D02*
D03*
Y4200000D02*
D03*
Y4300000D02*
D03*
Y4400000D02*
D03*
Y4500000D02*
D03*
Y4600000D02*
D03*
Y4700000D02*
D03*
X12800000Y7100000D02*
D03*
Y7000000D02*
D03*
Y6900000D02*
D03*
Y6800000D02*
D03*
Y6700000D02*
D03*
Y6600000D02*
D03*
Y6500000D02*
D03*
Y6400000D02*
D03*
Y5600000D02*
D03*
Y5700000D02*
D03*
Y5800000D02*
D03*
Y5900000D02*
D03*
Y6000000D02*
D03*
Y6100000D02*
D03*
Y6200000D02*
D03*
Y6300000D02*
D03*
Y4800000D02*
D03*
Y4900000D02*
D03*
Y5000000D02*
D03*
Y5100000D02*
D03*
Y5200000D02*
D03*
Y5300000D02*
D03*
Y5400000D02*
D03*
Y5500000D02*
D03*
Y4000000D02*
D03*
Y4100000D02*
D03*
Y4200000D02*
D03*
Y4300000D02*
D03*
Y4400000D02*
D03*
Y4500000D02*
D03*
Y4600000D02*
D03*
Y4700000D02*
D03*
X11300000Y7100000D02*
D03*
Y7000000D02*
D03*
Y6900000D02*
D03*
Y6800000D02*
D03*
Y6700000D02*
D03*
Y6600000D02*
D03*
Y6500000D02*
D03*
Y6400000D02*
D03*
Y5600000D02*
D03*
Y5700000D02*
D03*
Y5800000D02*
D03*
Y5900000D02*
D03*
Y6000000D02*
D03*
Y6100000D02*
D03*
Y6200000D02*
D03*
Y6300000D02*
D03*
Y4800000D02*
D03*
Y4900000D02*
D03*
Y5000000D02*
D03*
Y5100000D02*
D03*
Y5200000D02*
D03*
Y5300000D02*
D03*
Y5400000D02*
D03*
Y5500000D02*
D03*
Y4000000D02*
D03*
Y4100000D02*
D03*
Y4200000D02*
D03*
Y4300000D02*
D03*
Y4400000D02*
D03*
Y4500000D02*
D03*
Y4600000D02*
D03*
Y4700000D02*
D03*
X11200000Y7100000D02*
D03*
Y7000000D02*
D03*
Y6900000D02*
D03*
Y6800000D02*
D03*
Y6700000D02*
D03*
Y6600000D02*
D03*
Y6500000D02*
D03*
Y6400000D02*
D03*
Y5600000D02*
D03*
Y5700000D02*
D03*
Y5800000D02*
D03*
Y5900000D02*
D03*
Y6000000D02*
D03*
Y6100000D02*
D03*
Y6200000D02*
D03*
Y6300000D02*
D03*
Y4800000D02*
D03*
Y4900000D02*
D03*
Y5000000D02*
D03*
Y5100000D02*
D03*
Y5200000D02*
D03*
Y5300000D02*
D03*
Y5400000D02*
D03*
Y5500000D02*
D03*
Y4000000D02*
D03*
Y4100000D02*
D03*
Y4200000D02*
D03*
Y4300000D02*
D03*
Y4400000D02*
D03*
Y4500000D02*
D03*
Y4600000D02*
D03*
Y4700000D02*
D03*
X9700000Y7100000D02*
D03*
Y7000000D02*
D03*
Y6900000D02*
D03*
Y6800000D02*
D03*
Y6700000D02*
D03*
Y6600000D02*
D03*
Y6500000D02*
D03*
Y6400000D02*
D03*
Y5600000D02*
D03*
Y5700000D02*
D03*
Y5800000D02*
D03*
Y5900000D02*
D03*
Y6000000D02*
D03*
Y6100000D02*
D03*
Y6200000D02*
D03*
Y6300000D02*
D03*
Y4800000D02*
D03*
Y4900000D02*
D03*
Y5000000D02*
D03*
Y5100000D02*
D03*
Y5200000D02*
D03*
Y5300000D02*
D03*
Y5400000D02*
D03*
Y5500000D02*
D03*
Y4000000D02*
D03*
Y4100000D02*
D03*
Y4200000D02*
D03*
Y4300000D02*
D03*
Y4400000D02*
D03*
Y4500000D02*
D03*
Y4600000D02*
D03*
Y4700000D02*
D03*
X9600000Y7100000D02*
D03*
Y7000000D02*
D03*
Y6900000D02*
D03*
Y6800000D02*
D03*
Y6700000D02*
D03*
Y6600000D02*
D03*
Y6500000D02*
D03*
Y6400000D02*
D03*
Y5600000D02*
D03*
Y5700000D02*
D03*
Y5800000D02*
D03*
Y5900000D02*
D03*
Y6000000D02*
D03*
Y6100000D02*
D03*
Y6200000D02*
D03*
Y6300000D02*
D03*
Y4800000D02*
D03*
Y4900000D02*
D03*
Y5000000D02*
D03*
Y5100000D02*
D03*
Y5200000D02*
D03*
Y5300000D02*
D03*
Y5400000D02*
D03*
Y5500000D02*
D03*
Y4000000D02*
D03*
Y4100000D02*
D03*
Y4200000D02*
D03*
Y4300000D02*
D03*
Y4400000D02*
D03*
Y4500000D02*
D03*
Y4600000D02*
D03*
Y4700000D02*
D03*
X6500000Y7100000D02*
D03*
Y7000000D02*
D03*
Y6900000D02*
D03*
Y6800000D02*
D03*
Y6700000D02*
D03*
Y6600000D02*
D03*
Y6500000D02*
D03*
Y6400000D02*
D03*
Y5600000D02*
D03*
Y5700000D02*
D03*
Y5800000D02*
D03*
Y5900000D02*
D03*
Y6000000D02*
D03*
Y6100000D02*
D03*
Y6200000D02*
D03*
Y6300000D02*
D03*
Y4800000D02*
D03*
Y4900000D02*
D03*
Y5000000D02*
D03*
Y5100000D02*
D03*
Y5200000D02*
D03*
Y5300000D02*
D03*
Y5400000D02*
D03*
Y5500000D02*
D03*
Y4000000D02*
D03*
Y4100000D02*
D03*
Y4200000D02*
D03*
Y4300000D02*
D03*
Y4400000D02*
D03*
Y4500000D02*
D03*
Y4600000D02*
D03*
Y4700000D02*
D03*
X6400000Y7100000D02*
D03*
Y7000000D02*
D03*
Y6900000D02*
D03*
Y6800000D02*
D03*
Y6700000D02*
D03*
Y6600000D02*
D03*
Y6500000D02*
D03*
Y6400000D02*
D03*
Y5600000D02*
D03*
Y5700000D02*
D03*
Y5800000D02*
D03*
Y5900000D02*
D03*
Y6000000D02*
D03*
Y6100000D02*
D03*
Y6200000D02*
D03*
Y6300000D02*
D03*
Y4800000D02*
D03*
Y4900000D02*
D03*
Y5000000D02*
D03*
Y5100000D02*
D03*
Y5200000D02*
D03*
Y5300000D02*
D03*
Y5400000D02*
D03*
Y5500000D02*
D03*
Y4000000D02*
D03*
Y4100000D02*
D03*
Y4200000D02*
D03*
Y4300000D02*
D03*
Y4400000D02*
D03*
Y4500000D02*
D03*
Y4600000D02*
D03*
Y4700000D02*
D03*
X4900000Y7100000D02*
D03*
Y7000000D02*
D03*
Y6900000D02*
D03*
Y6800000D02*
D03*
Y6700000D02*
D03*
Y6600000D02*
D03*
Y6500000D02*
D03*
Y6400000D02*
D03*
Y5600000D02*
D03*
Y5700000D02*
D03*
Y5800000D02*
D03*
Y5900000D02*
D03*
Y6000000D02*
D03*
Y6100000D02*
D03*
Y6200000D02*
D03*
Y6300000D02*
D03*
Y4800000D02*
D03*
Y4900000D02*
D03*
Y5000000D02*
D03*
Y5100000D02*
D03*
Y5200000D02*
D03*
Y5300000D02*
D03*
Y5400000D02*
D03*
Y5500000D02*
D03*
Y4000000D02*
D03*
Y4100000D02*
D03*
Y4200000D02*
D03*
Y4300000D02*
D03*
Y4400000D02*
D03*
Y4500000D02*
D03*
Y4600000D02*
D03*
Y4700000D02*
D03*
X4800000Y7100000D02*
D03*
Y7000000D02*
D03*
Y6900000D02*
D03*
Y6800000D02*
D03*
Y6700000D02*
D03*
Y6600000D02*
D03*
Y6500000D02*
D03*
Y6400000D02*
D03*
Y5600000D02*
D03*
Y5700000D02*
D03*
Y5800000D02*
D03*
Y5900000D02*
D03*
Y6000000D02*
D03*
Y6100000D02*
D03*
Y6200000D02*
D03*
Y6300000D02*
D03*
Y4800000D02*
D03*
Y4900000D02*
D03*
Y5000000D02*
D03*
Y5100000D02*
D03*
Y5200000D02*
D03*
Y5300000D02*
D03*
Y5400000D02*
D03*
Y5500000D02*
D03*
Y4000000D02*
D03*
Y4100000D02*
D03*
Y4200000D02*
D03*
Y4300000D02*
D03*
Y4400000D02*
D03*
Y4500000D02*
D03*
Y4600000D02*
D03*
Y4700000D02*
D03*
X3300000Y7100000D02*
D03*
Y7000000D02*
D03*
Y6900000D02*
D03*
Y6800000D02*
D03*
Y6700000D02*
D03*
Y6600000D02*
D03*
Y6500000D02*
D03*
Y6400000D02*
D03*
Y5600000D02*
D03*
Y5700000D02*
D03*
Y5800000D02*
D03*
Y5900000D02*
D03*
Y6000000D02*
D03*
Y6100000D02*
D03*
Y6200000D02*
D03*
Y6300000D02*
D03*
Y4800000D02*
D03*
Y4900000D02*
D03*
Y5000000D02*
D03*
Y5100000D02*
D03*
Y5200000D02*
D03*
Y5300000D02*
D03*
Y5400000D02*
D03*
Y5500000D02*
D03*
Y4000000D02*
D03*
Y4100000D02*
D03*
Y4200000D02*
D03*
Y4300000D02*
D03*
Y4400000D02*
D03*
Y4500000D02*
D03*
Y4600000D02*
D03*
Y4700000D02*
D03*
X3200000Y7100000D02*
D03*
Y7000000D02*
D03*
Y6900000D02*
D03*
Y6800000D02*
D03*
Y6700000D02*
D03*
Y6600000D02*
D03*
Y6500000D02*
D03*
Y6400000D02*
D03*
Y5600000D02*
D03*
Y5700000D02*
D03*
Y5800000D02*
D03*
Y5900000D02*
D03*
Y6000000D02*
D03*
Y6100000D02*
D03*
Y6200000D02*
D03*
Y6300000D02*
D03*
Y4800000D02*
D03*
Y4900000D02*
D03*
Y5000000D02*
D03*
Y5100000D02*
D03*
Y5200000D02*
D03*
Y5300000D02*
D03*
Y5400000D02*
D03*
Y5500000D02*
D03*
Y4000000D02*
D03*
Y4100000D02*
D03*
Y4200000D02*
D03*
Y4300000D02*
D03*
Y4400000D02*
D03*
Y4500000D02*
D03*
Y4600000D02*
D03*
Y4700000D02*
D03*
D20*
X18760000Y3955000D02*
D03*
Y4205000D02*
D03*
D22*
X8088189Y3778345D02*
D03*
Y7321654D02*
D03*
X17688189Y3778345D02*
D03*
Y7321654D02*
D03*
X16088188Y3778345D02*
D03*
Y7321654D02*
D03*
X14488189Y3778345D02*
D03*
Y7321654D02*
D03*
X12888189Y3778345D02*
D03*
Y7321654D02*
D03*
X11288189Y3778345D02*
D03*
Y7321654D02*
D03*
X9688189Y3778345D02*
D03*
Y7321654D02*
D03*
X6488189Y3778345D02*
D03*
Y7321654D02*
D03*
X4888189Y3778345D02*
D03*
Y7321654D02*
D03*
X3288189Y3778345D02*
D03*
Y7321654D02*
D03*
%TF.MD5,a6e75a676c9e6011580631634388cf67*%
M02*
