Removed Pin From Net: NetName=+24VCC Pin=FH?-1
Removed Pin From Net: NetName=AA1 Pin=J?-a1
Removed Pin From Net: NetName=AA3 Pin=J?-a2
Removed Pin From Net: NetName=AA5 Pin=J?-a3
Removed Pin From Net: NetName=AA7 Pin=J?-a4
Removed Pin From Net: NetName=AA9 Pin=J?-a5
Removed Pin From Net: NetName=PLC_GND Pin=J?-a7
Removed Pin From Net: NetName=0VCC Pin=J?-a32
Removed Pin From Net: NetName=AA0 Pin=J?-b1
Removed Pin From Net: NetName=AA2 Pin=J?-b2
Removed Pin From Net: NetName=AA4 Pin=J?-b3
Removed Pin From Net: NetName=AA6 Pin=J?-b4
Removed Pin From Net: NetName=AA8 Pin=J?-b5
Removed Pin From Net: NetName=PLC_GND Pin=J?-b7
Removed Pin From Net: NetName=0VCC Pin=J?-b32
Removed Member From Class: ClassName=Flowcells Backplane V0 Member=F?
Removed Member From Class: ClassName=Overlapping Member=F?
Removed Member From Class: ClassName=Flowcells Backplane V0 Member=FH?
Removed Member From Class: ClassName=Overlapping Member=FH?
Change Component Footprint: Designator=J? Old Footprint=HARTING_09 02 164 2921 New Footprint=3M_N3428-6202RB
Change Component Comment : Designator=J? Old Comment=DIN 41612 Type B New Comment=Header 20
Change Component Designator: OldDesignator=J23 NewDesignator=J20
Change component parameters: Designator = "J?"; Footprint = "3M_N3428-6202RB"; UniqueID = "\ATMAHOPM"
Change component parameters. Clean all parameters for all variants
Change component parameters (AddParameter): Name = "Author"; Value = "CERN DEM JMW"; VariantName = "[No Variations]"
Change component parameters (AddParameter): Name = "ComponentHeight"; Value = "24.6mm"; VariantName = "[No Variations]"
Change component parameters (AddParameter): Name = "Component Type"; Value = "Standard"; VariantName = "[No Variations]"
Change component parameters (AddParameter): Name = "CreateDate"; Value = "22/04/2009"; VariantName = "[No Variations]"
Change component parameters (AddParameter): Name = "Family"; Value = "Header 20"; VariantName = "[No Variations]"
Change component parameters (AddParameter): Name = "HelpURL"; Value = "\\cern.ch\dfs\Applications\Altium\Datasheets\3M_N3428-6202RB.pdf"; VariantName = "[No Variations]"
Change component parameters (AddParameter): Name = "LatestRevisionDate"; Value = "09/12/2015"; VariantName = "[No Variations]"
Change component parameters (AddParameter): Name = "Manufacturer"; Value = "3M"; VariantName = "[No Variations]"
Change component parameters (AddParameter): Name = "Manufacturer Part Number"; Value = "N3428-6202RB"; VariantName = "[No Variations]"
Change component parameters (AddParameter): Name = "Mounted"; Value = "Yes"; VariantName = "[No Variations]"
Change component parameters (AddParameter): Name = "Part Description"; Value = "20 Contacts - Straight .100'' x .100'' Low Profile Black Four-Wall Header (Short Roll Pin Latch/Ejectors), 3000 Series"; VariantName = "[No Variations]"
Change component parameters (AddParameter): Name = "Part Number"; Value = "3M_N3428-6202RB"; VariantName = "[No Variations]"
Change component parameters (AddParameter): Name = "Pin Count"; Value = "20"; VariantName = "[No Variations]"
Change component parameters (AddParameter): Name = "PressFit"; Value = "No"; VariantName = "[No Variations]"
Change component parameters (AddParameter): Name = "Sense"; Value = "No"; VariantName = "[No Variations]"
Change component parameters (AddParameter): Name = "SMD"; Value = "No"; VariantName = "[No Variations]"
Change component parameters (AddParameter): Name = "Socket"; Value = "No"; VariantName = "[No Variations]"
Change component parameters (AddParameter): Name = "Status"; Value = "None"; VariantName = "[No Variations]"
Added Pin To Net: NetName=+24VCC Pin=J1-a30
Added Pin To Net: NetName=0VCC Pin=J1-a32
Added Pin To Net: NetName=+24VCC Pin=J1-b30
Added Pin To Net: NetName=0VCC Pin=J1-b32
Added Pin To Net: NetName=+24VCC Pin=J2-a30
Added Pin To Net: NetName=0VCC Pin=J2-a32
Added Pin To Net: NetName=+24VCC Pin=J2-b30
Added Pin To Net: NetName=0VCC Pin=J2-b32
Added Pin To Net: NetName=+24VCC Pin=J3-a30
Added Pin To Net: NetName=0VCC Pin=J3-a32
Added Pin To Net: NetName=+24VCC Pin=J3-b30
Added Pin To Net: NetName=0VCC Pin=J3-b32
Added Pin To Net: NetName=+24VCC Pin=J4-a30
Added Pin To Net: NetName=0VCC Pin=J4-a32
Added Pin To Net: NetName=+24VCC Pin=J4-b30
Added Pin To Net: NetName=0VCC Pin=J4-b32
Added Pin To Net: NetName=+24VCC Pin=J5-a30
Added Pin To Net: NetName=0VCC Pin=J5-a32
Added Pin To Net: NetName=+24VCC Pin=J5-b30
Added Pin To Net: NetName=0VCC Pin=J5-b32
Added Pin To Net: NetName=+24VCC Pin=J6-a30
Added Pin To Net: NetName=0VCC Pin=J6-a32
Added Pin To Net: NetName=+24VCC Pin=J6-b30
Added Pin To Net: NetName=0VCC Pin=J6-b32
Added Pin To Net: NetName=+24VCC Pin=J7-a30
Added Pin To Net: NetName=0VCC Pin=J7-a32
Added Pin To Net: NetName=+24VCC Pin=J7-b30
Added Pin To Net: NetName=0VCC Pin=J7-b32
Added Pin To Net: NetName=+24VCC Pin=J8-a30
Added Pin To Net: NetName=0VCC Pin=J8-a32
Added Pin To Net: NetName=+24VCC Pin=J8-b30
Added Pin To Net: NetName=0VCC Pin=J8-b32
Added Pin To Net: NetName=+24VCC Pin=J9-a30
Added Pin To Net: NetName=0VCC Pin=J9-a32
Added Pin To Net: NetName=+24VCC Pin=J9-b30
Added Pin To Net: NetName=0VCC Pin=J9-b32
Added Pin To Net: NetName=+24VCC Pin=J10-a30
Added Pin To Net: NetName=0VCC Pin=J10-a32
Added Pin To Net: NetName=+24VCC Pin=J10-b30
Added Pin To Net: NetName=0VCC Pin=J10-b32
Added Pin To Net: NetName=+24VCC Pin=J20-1
Added Pin To Net: NetName=0VCC Pin=J20-2
Added Pin To Net: NetName=1DAA Pin=J1-a12
Added Net: Name=1DAA
Added Pin To Net: NetName=1DA Pin=J1-a10
Added Net: Name=1DA
Added Pin To Net: NetName=1DBB Pin=J1-b12
Added Net: Name=1DBB
Added Pin To Net: NetName=1DB Pin=J1-b10
Added Net: Name=1DB
Added Pin To Net: NetName=2DAA Pin=J2-a12
Added Net: Name=2DAA
Added Pin To Net: NetName=2DA Pin=J2-a10
Added Net: Name=2DA
Added Pin To Net: NetName=2DBB Pin=J2-b12
Added Net: Name=2DBB
Added Pin To Net: NetName=2DB Pin=J2-b10
Added Net: Name=2DB
Added Pin To Net: NetName=3DAA Pin=J3-a12
Added Net: Name=3DAA
Added Pin To Net: NetName=3DA Pin=J3-a10
Added Net: Name=3DA
Added Pin To Net: NetName=3DBB Pin=J3-b12
Added Net: Name=3DBB
Added Pin To Net: NetName=3DB Pin=J3-b10
Added Net: Name=3DB
Added Pin To Net: NetName=4DAA Pin=J4-a12
Added Net: Name=4DAA
Added Pin To Net: NetName=4DA Pin=J4-a10
Added Net: Name=4DA
Added Pin To Net: NetName=4DBB Pin=J4-b12
Added Net: Name=4DBB
Added Pin To Net: NetName=4DB Pin=J4-b10
Added Net: Name=4DB
Added Pin To Net: NetName=5DAA Pin=J5-a12
Added Net: Name=5DAA
Added Pin To Net: NetName=5DA Pin=J5-a10
Added Net: Name=5DA
Added Pin To Net: NetName=5DBB Pin=J5-b12
Added Net: Name=5DBB
Added Pin To Net: NetName=5DB Pin=J5-b10
Added Net: Name=5DB
Added Pin To Net: NetName=6DAA Pin=J6-a12
Added Net: Name=6DAA
Added Pin To Net: NetName=6DA Pin=J6-a10
Added Net: Name=6DA
Added Pin To Net: NetName=6DBB Pin=J6-b12
Added Net: Name=6DBB
Added Pin To Net: NetName=6DB Pin=J6-b10
Added Net: Name=6DB
Added Pin To Net: NetName=7DAA Pin=J7-a12
Added Net: Name=7DAA
Added Pin To Net: NetName=7DA Pin=J7-a10
Added Net: Name=7DA
Added Pin To Net: NetName=7DBB Pin=J7-b12
Added Net: Name=7DBB
Added Pin To Net: NetName=7DB Pin=J7-b10
Added Net: Name=7DB
Added Pin To Net: NetName=8DAA Pin=J8-a12
Added Net: Name=8DAA
Added Pin To Net: NetName=8DA Pin=J8-a10
Added Net: Name=8DA
Added Pin To Net: NetName=8DBB Pin=J8-b12
Added Net: Name=8DBB
Added Pin To Net: NetName=8DB Pin=J8-b10
Added Net: Name=8DB
Added Pin To Net: NetName=9DAA Pin=J9-a12
Added Net: Name=9DAA
Added Pin To Net: NetName=9DA Pin=J9-a10
Added Net: Name=9DA
Added Pin To Net: NetName=9DBB Pin=J9-b12
Added Net: Name=9DBB
Added Pin To Net: NetName=9DB Pin=J9-b10
Added Net: Name=9DB
Added Pin To Net: NetName=10DAA Pin=J10-a12
Added Net: Name=10DAA
Added Pin To Net: NetName=10DA Pin=J10-a10
Added Net: Name=10DA
Added Pin To Net: NetName=10DBB Pin=J10-b12
Added Net: Name=10DBB
Added Pin To Net: NetName=10DB Pin=J10-b10
Added Net: Name=10DB
