Removed Member From Class: ClassName=Overlapping Member=J4
Change Component DesignItemId : Designator=J4 Old DesignItemId=HARTING_09 03 264 6850 New DesignItemId=HARTING_09 02 264 6825
Change Component Footprint: Designator=J4 Old Footprint=HARTING_09 03 264 6850 New Footprint=HARTING_09 02 264 6825
Change Component Comment : Designator=J4 Old Comment=DIN 41612 Type C New Comment=DIN 41612 Type B
Change Component Description : Designator=J4 Old Description=Connector 64ac Female (2x32) New Description=Connector 64ab Female (2x32)
Change component parameters: Designator = "J4"; Footprint = "HARTING_09 02 264 6825"; UniqueID = "\KYNJAJEG"
Change component parameters. Clean all parameters for all variants
Change component parameters (AddParameter): Name = "Author"; Value = "CERN DEM JLC"; VariantName = "[No Variations]"
Change component parameters (AddParameter): Name = "ComponentHeight"; Value = "11.6mm"; VariantName = "[No Variations]"
Change component parameters (AddParameter): Name = "Component Type"; Value = "Standard"; VariantName = "[No Variations]"
Change component parameters (AddParameter): Name = "CreateDate"; Value = "09/02/2009"; VariantName = "[No Variations]"
Change component parameters (AddParameter): Name = "Family"; Value = "DIN 41612 Type B"; VariantName = "[No Variations]"
Change component parameters (AddParameter): Name = "HelpURL"; Value = "\\cern.ch\dfs\Applications\Altium\Datasheets\HARTING_09 02 264 6825.pdf"; VariantName = "[No Variations]"
Change component parameters (AddParameter): Name = "LatestRevisionDate"; Value = "15/02/2012"; VariantName = "[No Variations]"
Change component parameters (AddParameter): Name = "Manufacturer"; Value = "HARTING"; VariantName = "[No Variations]"
Change component parameters (AddParameter): Name = "Manufacturer Part Number"; Value = "09 02 264 6825"; VariantName = "[No Variations]"
Change component parameters (AddParameter): Name = "Mounted"; Value = "Yes"; VariantName = "[No Variations]"
Change component parameters (AddParameter): Name = "Part Description"; Value = "DIN 41612, Type B, Thru-Hole; Rows a+b, 64 Position, Straight Female Connector"; VariantName = "[No Variations]"
Change component parameters (AddParameter): Name = "Part Number"; Value = "HARTING_09 02 264 6825"; VariantName = "[No Variations]"
Change component parameters (AddParameter): Name = "Pin Count"; Value = "66"; VariantName = "[No Variations]"
Change component parameters (AddParameter): Name = "PressFit"; Value = "No"; VariantName = "[No Variations]"
Change component parameters (AddParameter): Name = "SCEM"; Value = "09.61.30.610.5"; VariantName = "[No Variations]"
Change component parameters (AddParameter): Name = "Sense"; Value = "No"; VariantName = "[No Variations]"
Change component parameters (AddParameter): Name = "SMD"; Value = "No"; VariantName = "[No Variations]"
Change component parameters (AddParameter): Name = "Socket"; Value = "No"; VariantName = "[No Variations]"
Change component parameters (AddParameter): Name = "Status"; Value = "None"; VariantName = "[No Variations]"
Added Member To Class: ClassName=Flowcells Backplane V0 Member=Component SCREW? M2.5x10
Added Member To Class: ClassName=Flowcells Backplane V0 Member=Component SCREW? M2.5x10
Added Member To Class: ClassName=Flowcells Backplane V0 Member=Component SCREW? M2.5x10
Added Member To Class: ClassName=Overlapping Member=Component SCREW? M2.5x10
Added Member To Class: ClassName=Overlapping Member=Component SCREW? M2.5x10
Added Member To Class: ClassName=Overlapping Member=Component SCREW? M2.5x10
Added Member To Class: ClassName=Flowcells Backplane V0 Member=Component WASHER? D5xd2.7
Added Member To Class: ClassName=Flowcells Backplane V0 Member=Component WASHER? D5xd2.7
Added Member To Class: ClassName=Flowcells Backplane V0 Member=Component WASHER? D5xd2.7
Added Member To Class: ClassName=Overlapping Member=Component WASHER? D5xd2.7
Added Member To Class: ClassName=Overlapping Member=Component WASHER? D5xd2.7
Added Member To Class: ClassName=Overlapping Member=Component WASHER? D5xd2.7
