M48
;Layer_Color=9474304
;FILE_FORMAT=4:4
METRIC,LZ
;TYPE=PLATED
T1F00S00C0.9000
T2F00S00C1.0000
T3F00S00C1.3000
T4F00S00C1.8000
T5F00S00C2.7000
T6F00S00C3.1000
T7F00S00C3.2000
%
T01
X001058Y001907
Y002184
Y002461
Y002738
Y003015
Y003292
Y003569
Y003846
X001342Y0037075
Y0039845
Y0034305
Y0031535
Y0028765
Y0025995
Y0023225
Y0020455
X004258Y001907
Y002184
Y002461
Y002738
Y003015
Y003292
Y003569
Y003846
X004542Y0037075
Y0039845
Y0034305
Y0031535
Y0028765
Y0025995
Y0023225
Y0020455
X007458Y001907
Y002184
Y002461
Y002738
Y003015
Y003292
Y003569
Y003846
X007742Y0037075
Y0039845
Y0034305
Y0031535
Y0028765
Y0025995
Y0023225
Y0020455
X010658Y001907
Y002184
Y002461
Y002738
Y003015
Y003292
Y003569
Y003846
X010942Y0037075
Y0039845
Y0034305
Y0031535
Y0028765
Y0025995
Y0023225
Y0020455
X013858Y001907
Y002184
Y002461
Y002738
Y003015
Y003292
Y003569
Y003846
X014142Y0037075
Y0039845
Y0034305
Y0031535
Y0028765
Y0025995
Y0023225
Y0020455
X017058Y001907
Y002184
Y002461
Y002738
Y003015
Y003292
Y003569
Y003846
X017342Y0037075
Y0039845
Y0034305
Y0031535
Y0028765
Y0025995
Y0023225
Y0020455
X020258Y001907
Y002184
Y002461
Y002738
Y003015
Y003292
Y003569
Y003846
X020542Y0037075
Y0039845
Y0034305
Y0031535
Y0028765
Y0025995
Y0023225
Y0020455
X023458Y001907
Y002184
Y002461
Y002738
Y003015
Y003292
Y003569
Y003846
X023742Y0037075
Y0039845
Y0034305
Y0031535
Y0028765
Y0025995
Y0023225
Y0020455
X026658Y001907
Y002184
Y002461
Y002738
Y003015
Y003292
Y003569
Y003846
X026942Y0037075
Y0039845
Y0034305
Y0031535
Y0028765
Y0025995
Y0023225
Y0020455
X029858Y001907
Y002184
Y002461
Y002738
Y003015
Y003292
Y003569
Y003846
X030142Y0037075
Y0039845
Y0034305
Y0031535
Y0028765
Y0025995
Y0023225
Y0020455
X033058Y001907
Y002184
Y002461
Y002738
Y003015
Y003292
Y003569
Y003846
X033342Y0037075
Y0039845
Y0034305
Y0031535
Y0028765
Y0025995
Y0023225
Y0020455
X036258Y001907
Y002184
Y002461
Y002738
Y003015
Y003292
Y003569
Y003846
X036542Y0037075
Y0039845
Y0034305
Y0031535
Y0028765
Y0025995
Y0023225
Y0020455
Y0042615
Y0045385
Y0048155
Y0050925
Y0053695
Y0056465
Y0059235
Y0062005
Y0064775
Y0067545
X036258Y006893
Y006616
Y006339
Y006062
Y005785
Y005508
Y005231
Y004954
Y004677
Y0044
Y004123
X033342Y0042615
Y0045385
Y0048155
Y0050925
Y0053695
Y0056465
Y0059235
Y0062005
Y0064775
Y0067545
X033058Y006893
Y006616
Y006339
Y006062
Y005785
Y005508
Y005231
Y004954
Y004677
Y0044
Y004123
X030142Y0042615
Y0045385
Y0048155
Y0050925
Y0053695
Y0056465
Y0059235
Y0062005
Y0064775
Y0067545
X029858Y006893
Y006616
Y006339
Y006062
Y005785
Y005508
Y005231
Y004954
Y004677
Y0044
Y004123
X026942Y0042615
Y0045385
Y0048155
Y0050925
Y0053695
Y0056465
Y0059235
Y0062005
Y0064775
Y0067545
X026658Y006893
Y006616
Y006339
Y006062
Y005785
Y005508
Y005231
Y004954
Y004677
Y0044
Y004123
X023742Y0042615
Y0045385
Y0048155
Y0050925
Y0053695
Y0056465
Y0059235
Y0062005
Y0064775
Y0067545
X023458Y006893
Y006616
Y006339
Y006062
Y005785
Y005508
Y005231
Y004954
Y004677
Y0044
Y004123
X020542Y0042615
Y0045385
Y0048155
Y0050925
Y0053695
Y0056465
Y0059235
Y0062005
Y0064775
Y0067545
X020258Y006893
Y006616
Y006339
Y006062
Y005785
Y005508
Y005231
Y004954
Y004677
Y0044
Y004123
X017342Y0042615
Y0045385
Y0048155
Y0050925
Y0053695
Y0056465
Y0059235
Y0062005
Y0064775
Y0067545
X017058Y006893
Y006616
Y006339
Y006062
Y005785
Y005508
Y005231
Y004954
Y004677
Y0044
Y004123
X014142Y0042615
Y0045385
Y0048155
Y0050925
Y0053695
Y0056465
Y0059235
Y0062005
Y0064775
Y0067545
X013858Y006893
Y006616
Y006339
Y006062
Y005785
Y005508
Y005231
Y004954
Y004677
Y0044
Y004123
X010942Y0042615
Y0045385
Y0048155
Y0050925
Y0053695
Y0056465
Y0059235
Y0062005
Y0064775
Y0067545
X010658Y006893
Y006616
Y006339
Y006062
Y005785
Y005508
Y005231
Y004954
Y004677
Y0044
Y004123
X007742Y0042615
Y0045385
Y0048155
Y0050925
Y0053695
Y0056465
Y0059235
Y0062005
Y0064775
Y0067545
X007458Y006893
Y006616
Y006339
Y006062
Y005785
Y005508
Y005231
Y004954
Y004677
Y0044
Y004123
X004542Y0042615
Y0045385
Y0048155
Y0050925
Y0053695
Y0056465
Y0059235
Y0062005
Y0064775
Y0067545
X004258Y006893
Y006616
Y006339
Y006062
Y005785
Y005508
Y005231
Y004954
Y004677
Y0044
Y004123
X001342Y0042615
Y0045385
Y0048155
Y0050925
Y0053695
Y0056465
Y0059235
Y0062005
Y0064775
Y0067545
X001058Y006893
Y006616
Y006339
Y006062
Y005785
Y005508
Y005231
Y004954
Y004677
Y0044
Y004123
Y019307
Y019584
Y019861
X001342Y0197225
Y0194455
X004258Y019307
Y019584
Y019861
X004542Y0197225
Y0194455
X007458Y019307
Y019584
Y019861
X007742Y0197225
Y0194455
X010658Y019307
Y019584
Y019861
X010942Y0197225
Y0194455
X013858Y019307
Y019584
Y019861
X014142Y0197225
Y0194455
X017058Y019307
Y019584
Y019861
X017342Y0197225
Y0194455
X020258Y019584
Y019861
X020542Y0197225
Y0194455
X020258Y019307
X023458
Y019584
Y019861
X023742Y0197225
Y0194455
X026658Y019307
Y019584
Y019861
X026942Y0197225
Y0194455
X029858Y019307
Y019584
Y019861
X030142Y0197225
Y0194455
X033058Y019307
Y019584
Y019861
X033342Y0197225
Y0194455
X036258Y019307
Y019584
Y019861
X036542Y0197225
Y0194455
Y0199995
Y0202765
Y0205535
Y0208305
Y0211075
Y0213845
Y0216615
Y0219385
Y0222155
Y0224925
Y0227695
Y0230465
Y0233235
Y0236005
Y0238775
X036258Y023739
Y023462
Y023185
Y022908
Y022631
Y022354
Y022077
Y0218
Y021523
Y021246
Y020969
Y020692
Y020415
Y020138
X033342Y0202765
Y0205535
Y0208305
Y0211075
Y0213845
Y0216615
Y0219385
Y0222155
Y0224925
Y0227695
Y0230465
Y0233235
Y0236005
Y0238775
X033058Y023739
Y023462
Y023185
Y022908
Y022631
Y022354
Y022077
Y0218
Y021523
Y021246
Y020969
Y020692
Y020415
Y020138
X033342Y0199995
X030142
Y0202765
Y0205535
Y0208305
Y0211075
Y0213845
Y0216615
Y0219385
Y0222155
Y0224925
Y0227695
Y0230465
Y0233235
Y0236005
Y0238775
X029858Y023739
Y023462
Y023185
Y022908
Y022631
Y022354
Y022077
Y0218
Y021523
Y021246
Y020969
Y020692
Y020415
Y020138
X026942Y0202765
Y0205535
Y0208305
Y0211075
Y0213845
Y0216615
Y0219385
Y0222155
Y0224925
Y0227695
Y0230465
Y0233235
Y0236005
Y0238775
X026658Y023739
Y023462
Y023185
Y022908
Y022631
Y022354
Y022077
Y0218
Y021523
Y021246
Y020969
Y020692
Y020415
Y020138
X026942Y0199995
X023742
Y0202765
Y0205535
Y0208305
Y0211075
Y0213845
Y0216615
Y0219385
Y0222155
Y0224925
Y0227695
Y0230465
Y0233235
Y0236005
Y0238775
X023458Y023739
Y023462
Y023185
Y022908
Y022631
Y022354
Y022077
Y0218
Y021523
Y021246
Y020969
Y020692
Y020415
Y020138
X020542Y0199995
Y0202765
Y0205535
Y0208305
Y0211075
Y0213845
Y0216615
Y0219385
Y0222155
Y0224925
Y0227695
Y0230465
Y0233235
Y0236005
Y0238775
X020258Y023739
Y023462
Y023185
Y022908
Y022631
Y022354
Y022077
Y0218
Y021523
Y021246
Y020969
Y020692
Y020415
Y020138
X017342Y0202765
Y0205535
Y0208305
Y0211075
Y0213845
Y0216615
Y0219385
Y0222155
Y0224925
Y0227695
Y0230465
Y0233235
Y0236005
Y0238775
X017058Y023739
Y023462
Y023185
Y022908
Y022631
Y022354
Y022077
Y0218
Y021523
Y021246
Y020969
Y020692
Y020415
Y020138
X017342Y0199995
X014142
Y0202765
Y0205535
Y0208305
Y0211075
Y0213845
Y0216615
Y0219385
Y0222155
Y0224925
Y0227695
Y0230465
Y0233235
Y0236005
Y0238775
X013858Y023739
Y023462
Y023185
Y022908
Y022631
Y022354
Y022077
Y0218
Y021523
Y021246
Y020969
Y020692
Y020415
Y020138
X010942Y0202765
Y0205535
Y0208305
Y0211075
Y0213845
Y0216615
Y0219385
Y0222155
Y0224925
Y0227695
Y0230465
Y0233235
Y0236005
Y0238775
X010658Y023739
Y023462
Y023185
Y022908
Y022631
Y022354
Y022077
Y0218
Y021523
Y021246
Y020969
Y020692
Y020415
Y020138
X010942Y0199995
X007742
Y0202765
Y0205535
Y0208305
Y0211075
Y0213845
Y0216615
Y0219385
Y0222155
Y0224925
Y0227695
Y0230465
Y0233235
Y0236005
Y0238775
X007458Y023739
Y023462
Y023185
Y022908
Y022631
Y022354
Y022077
Y0218
Y021523
Y021246
Y020969
Y020692
Y020415
Y020138
X004542Y0202765
Y0205535
Y0208305
Y0211075
Y0213845
Y0216615
Y0219385
Y0222155
Y0224925
Y0227695
Y0230465
Y0233235
Y0236005
Y0238775
X004258Y023739
Y023462
Y023185
Y022908
Y022631
Y022354
Y022077
Y0218
Y021523
Y021246
Y020969
Y020692
Y020415
Y020138
X004542Y0199995
X001342
Y0202765
Y0205535
Y0208305
Y0211075
Y0213845
Y0216615
Y0219385
Y0222155
Y0224925
Y0227695
Y0230465
Y0233235
Y0236005
Y0238775
X001058Y023739
Y023462
Y023185
Y022908
Y022631
Y022354
Y022077
Y0218
Y021523
Y021246
Y020969
Y020692
Y020415
Y020138
Y024016
Y024293
X001342Y0241545
X004258Y024293
Y024016
X004542Y0241545
X007458Y024293
Y024016
X007742Y0241545
X010658Y024293
Y024016
X010942Y0241545
X013858Y024293
Y024016
X014142Y0241545
X017058Y024293
Y024016
X017342Y0241545
X020258Y024016
Y024293
X020542Y0241545
X023458Y024293
Y024016
X023742Y0241545
X026658Y024293
Y024016
X026942Y0241545
X029858Y024293
Y024016
X030142Y0241545
X033058Y024293
Y024016
X033342Y0241545
X036258Y024293
Y024016
X036542Y0241545
T02
X002566Y010892
Y011168
Y011444
Y01172
Y011996
X00285Y011858
Y011582
Y011306
Y01103
X003134Y011168
Y011444
Y01172
Y011996
Y010892
X005766Y010892
Y011168
Y011444
Y01172
Y011996
X00605Y011858
Y011582
Y011306
Y01103
X006334Y011168
Y011444
Y01172
Y011996
Y010892
X008966Y010892
Y011168
Y011444
Y01172
Y011996
X00925Y011858
Y011582
Y011306
Y01103
X009534Y011168
Y011444
Y01172
Y011996
Y010892
X012166Y010892
Y011168
Y011444
Y01172
Y011996
X01245Y011858
Y011582
Y011306
Y01103
X012734Y011168
Y011444
Y01172
Y011996
Y010892
X015366Y010892
Y011168
Y011444
Y01172
Y011996
X01565Y011858
Y011582
Y011306
Y01103
X015934Y011168
Y011444
Y01172
Y011996
Y010892
X018566Y010892
Y011168
Y011444
Y01172
Y011996
X01885Y011858
Y011582
Y011306
Y01103
X019134Y011168
Y011444
Y01172
Y011996
Y010892
X021766Y010892
Y011168
Y011444
Y01172
Y011996
X02205Y011858
Y011582
Y011306
Y01103
X022334Y011168
Y011444
Y01172
Y011996
Y010892
X024966Y010892
Y011168
Y011444
Y01172
Y011996
X02525Y011858
Y011582
Y011306
Y01103
X025534Y011168
Y011444
Y01172
Y011996
Y010892
X028166Y010892
Y011168
Y011444
Y01172
Y011996
X02845Y011858
Y011582
Y011306
Y01103
X028734Y011168
Y011444
Y01172
Y011996
Y010892
X031366Y010892
Y011168
Y011444
Y01172
Y011996
X03165Y011858
Y011582
Y011306
Y01103
X031934Y011168
Y011444
Y01172
Y011996
Y010892
X034566Y010892
Y011168
Y011444
Y01172
Y011996
X03485Y011858
Y011582
Y011306
Y01103
X035134Y011168
Y011444
Y01172
Y011996
Y010892
X037766Y010892
Y011168
Y011444
Y01172
Y011996
X03805Y011858
Y011582
Y011306
Y01103
X038334Y011168
Y011444
Y01172
Y011996
Y010892
Y012272
Y012548
Y012824
Y0131
Y013376
Y013652
Y013928
Y014204
Y01448
Y014756
Y015032
Y015308
X03805Y01517
Y014894
Y014618
Y014342
Y014066
Y01379
Y013514
Y013238
Y012962
Y012686
Y01241
Y012134
X037766Y012272
Y012548
Y012824
Y0131
Y013376
Y013652
Y013928
Y014204
Y01448
Y014756
Y015032
Y015308
X035134
Y015032
Y014756
Y01448
Y014204
Y013928
Y013652
Y013376
Y0131
Y012824
Y012548
Y012272
X03485Y01241
Y012686
Y012962
Y013238
Y013514
Y01379
Y014066
Y014342
Y014618
Y014894
Y01517
X034566Y015308
Y015032
Y014756
Y01448
Y014204
Y013928
Y013652
Y013376
Y0131
Y012824
Y012548
Y012272
X03485Y012134
X031934Y012272
Y012548
Y012824
Y0131
Y013376
Y013652
Y013928
Y014204
Y01448
Y014756
Y015032
Y015308
X03165Y01517
Y014894
Y014618
Y014342
Y014066
Y01379
Y013514
Y013238
Y012962
Y012686
Y01241
Y012134
X031366Y012272
Y012548
Y012824
Y0131
Y013376
Y013652
Y013928
Y014204
Y01448
Y014756
Y015032
Y015308
X028734
Y015032
Y014756
Y01448
Y014204
Y013928
Y013652
Y013376
Y0131
Y012824
Y012548
Y012272
X02845Y01241
Y012686
Y012962
Y013238
Y013514
Y01379
Y014066
Y014342
Y014618
Y014894
Y01517
X028166Y015308
Y015032
Y014756
Y01448
Y014204
Y013928
Y013652
Y013376
Y0131
Y012824
Y012548
Y012272
X02845Y012134
X025534Y012272
Y012548
Y012824
Y0131
Y013376
Y013652
Y013928
Y014204
Y01448
Y014756
Y015032
Y015308
X02525Y01517
Y014894
Y014618
Y014342
Y014066
Y01379
Y013514
Y013238
Y012962
Y012686
Y01241
Y012134
X024966Y012272
Y012548
Y012824
Y0131
Y013376
Y013652
Y013928
Y014204
Y01448
Y014756
Y015032
Y015308
X022334
Y015032
Y014756
Y01448
Y014204
Y013928
Y013652
Y013376
Y0131
Y012824
Y012548
Y012272
X02205Y01241
Y012686
Y012962
Y013238
Y013514
Y01379
Y014066
Y014342
Y014618
Y014894
Y01517
X021766Y015308
Y015032
Y014756
Y01448
Y014204
Y013928
Y013652
Y013376
Y0131
Y012824
Y012548
Y012272
X02205Y012134
X019134Y012272
Y012548
Y012824
Y0131
Y013376
Y013652
Y013928
Y014204
Y01448
Y014756
Y015032
Y015308
X01885Y01517
Y014894
Y014618
Y014342
Y014066
Y01379
Y013514
Y013238
Y012962
Y012686
Y01241
Y012134
X018566Y012272
Y012548
Y012824
Y0131
Y013376
Y013652
Y013928
Y014204
Y01448
Y014756
Y015032
Y015308
X015934
Y015032
Y014756
Y01448
Y014204
Y013928
Y013652
Y013376
Y0131
Y012824
Y012548
Y012272
X01565Y01241
Y012686
Y012962
Y013238
Y013514
Y01379
Y014066
Y014342
Y014618
Y014894
Y01517
X015366Y015308
Y015032
Y014756
Y01448
Y014204
Y013928
Y013652
Y013376
Y0131
Y012824
Y012548
Y012272
X01565Y012134
X012734Y012272
Y012548
Y012824
Y0131
Y013376
Y013652
Y013928
Y014204
Y01448
Y014756
Y015032
Y015308
X01245Y01517
Y014894
Y014618
Y014342
Y014066
Y01379
Y013514
Y013238
Y012962
Y012686
Y01241
Y012134
X012166Y012272
Y012548
Y012824
Y0131
Y013376
Y013652
Y013928
Y014204
Y01448
Y014756
Y015032
Y015308
X009534
Y015032
Y014756
Y01448
Y014204
Y013928
Y013652
Y013376
Y0131
Y012824
Y012548
Y012272
X00925Y01241
Y012686
Y012962
Y013238
Y013514
Y01379
Y014066
Y014342
Y014618
Y014894
Y01517
X008966Y015308
Y015032
Y014756
Y01448
Y014204
Y013928
Y013652
Y013376
Y0131
Y012824
Y012548
Y012272
X00925Y012134
X006334Y012272
Y012548
Y012824
Y0131
Y013376
Y013652
Y013928
Y014204
Y01448
Y014756
Y015032
Y015308
X00605Y01517
Y014894
Y014618
Y014342
Y014066
Y01379
Y013514
Y013238
Y012962
Y012686
Y01241
Y012134
X005766Y012272
Y012548
Y012824
Y0131
Y013376
Y013652
Y013928
Y014204
Y01448
Y014756
Y015032
Y015308
X003134
Y015032
Y014756
Y01448
Y014204
Y013928
Y013652
Y013376
Y0131
Y012824
Y012548
Y012272
X00285Y01241
Y012686
Y012962
Y013238
Y013514
Y01379
Y014066
Y014342
Y014618
Y014894
Y01517
X002566Y015308
Y015032
Y014756
Y01448
Y014204
Y013928
Y013652
Y013376
Y0131
Y012824
Y012548
Y012272
X00285Y012134
T03
X03785057Y00613194
X03728263Y00613626
Y00689826
X03785057Y00689394
X03468827
X03412033Y00689826
Y00613626
X03468827Y00613194
X03148787
X03091993Y00613626
Y00689826
X03148787Y00689394
X02828747
Y00609384
X02771953Y00609816
Y00689826
X02512517Y00689394
X02455723Y00689826
Y00609816
X02512517Y00609384
X02188667
X02131873Y00609816
Y00689826
X02188667Y00689394
X01868627
X01811833Y00689826
Y00606006
X01868627Y00605574
X01544777
X01487983Y00606006
Y00689826
X01544777Y00689394
X01228547Y00693204
Y00609384
X01171753Y00609816
Y00693636
X00908507Y00689394
X00851713Y00689826
Y00606006
X00908507Y00605574
X00584657
X00527863Y00606006
Y00689826
X00584657Y00689394
X00264617
X00207823Y00689826
Y00606006
X00264617Y00605574
X0383667Y0178689
Y0186309
X0391287
Y0178689
Y0200787
X0383667
Y0208407
X0391287
X03786327Y02351824
X03729533Y02352256
X03467557Y02354364
X03410763Y02354796
X03144977Y02348014
X03088183Y02348446
X02828747Y02350554
X02771953Y02350986
X02507437Y02349284
X02450643Y02349716
X02186127Y02349284
X02129333Y02349716
X01861007Y02348014
X01804213Y02348446
X01546047Y02350554
X01489253Y02350986
X01224737Y02351824
X01167943Y02352256
X00904697Y02350554
X00847903Y02350986
X00584657Y02349284
X00527863Y02349716
X00259537Y02348014
X00202743Y02348446
Y02428456
X00259537Y02428024
X00527863Y02429726
X00584657Y02429294
X00847903Y02430996
X00904697Y02430564
X01167943Y02432266
X01224737Y02431834
X01489253Y02430996
X01546047Y02430564
X01804213Y02428456
X01861007Y02428024
X02129333Y02429726
X02186127Y02429294
X02450643Y02429726
X02507437Y02429294
X02771953Y02430996
X02828747Y02430564
X03088183Y02428456
X03144977Y02428024
X03410763Y02430996
X03467557Y02430564
X03729533Y02428456
X03786327Y02428024
T04
X0390017Y0025273
Y0031623
Y0051943
Y0058293
T05
X0005Y0005
X02
X0394
X0299822Y0131
X011
X0005Y0257
X02
X0394
T06
X00285Y0100445
X00605
X00925
X01245
X01565
X01885
X02205
X02525
X02845
X03165
X03485
X03805
X00285Y0161555
X00605
X00925
X01245
X01565
X01885
X02205
X02525
X02845
X03165
X03485
X03805
T07
X0012Y001225
X0044
X0076
X0108
X014
X0172
X0204
X0236
X0268
X03
X0332
X0364
Y007575
X0332
X03
X0268
X0236
X0204
X0172
X014
X0108
X0076
X0044
X0012
Y018625
X0044
X0076
X0108
X014
X0172
X0204
X0236
X0268
X03
X0332
X0364
X0012Y024975
X0044
X0076
X0108
X014
X0172
X0204
X0236
X0268
X03
X0332
X0364
M30
