%TF.GenerationSoftware,Altium Limited,Altium Designer,19.1.5 (86)*%
G04 Layer_Color=8421504*
%FSLAX26Y26*%
%MOIN*%
%TF.FileFunction,Paste,Top*%
%TF.Part,Single*%
G01*
G75*
%TA.AperFunction,SMDPad,CuDef*%
%ADD10R,0.045276X0.070866*%
%ADD11R,0.127953X0.084646*%
%ADD12R,0.037402X0.084646*%
%ADD13O,0.061024X0.013780*%
%ADD14R,0.106299X0.045276*%
%ADD15R,0.070866X0.045276*%
%ADD16R,0.066929X0.110236*%
%ADD17R,0.039370X0.037402*%
%ADD18R,0.037402X0.039370*%
%ADD19R,0.061024X0.023622*%
%ADD20R,0.039370X0.068898*%
%ADD21R,0.057087X0.017716*%
%ADD22R,0.066929X0.023622*%
%ADD23R,0.061024X0.021654*%
D10*
X3662913Y7550000D02*
D03*
X3777087D02*
D03*
X4657913Y4915000D02*
D03*
X4772087D02*
D03*
X4657913Y5700000D02*
D03*
X4772087D02*
D03*
X4657913Y6490000D02*
D03*
X4772087D02*
D03*
X8282087Y5950000D02*
D03*
X8167913D02*
D03*
X8282087Y5850000D02*
D03*
X8167913D02*
D03*
X8282087Y5750000D02*
D03*
X8167913D02*
D03*
X8282087Y5650000D02*
D03*
X8167913D02*
D03*
X8282087Y6750000D02*
D03*
X8167913D02*
D03*
X8282087Y6650000D02*
D03*
X8167913D02*
D03*
X8282087Y6550000D02*
D03*
X8167913D02*
D03*
X8282087Y6450000D02*
D03*
X8167913D02*
D03*
X8282087Y7575000D02*
D03*
X8167913D02*
D03*
X8282087Y7475000D02*
D03*
X8167913D02*
D03*
X8282087Y7375000D02*
D03*
X8167913D02*
D03*
X8282087Y7275000D02*
D03*
X8167913D02*
D03*
X8282087Y6875000D02*
D03*
X8167913D02*
D03*
X8282087Y6975000D02*
D03*
X8167913D02*
D03*
X8282087Y7075000D02*
D03*
X8167913D02*
D03*
X8282087Y7175000D02*
D03*
X8167913D02*
D03*
X7607087Y7100000D02*
D03*
X7492913D02*
D03*
X7607087Y7200000D02*
D03*
X7492913D02*
D03*
X7607087Y7300000D02*
D03*
X7492913D02*
D03*
X7607087Y7400000D02*
D03*
X7492913D02*
D03*
X8282087Y6050000D02*
D03*
X8167913D02*
D03*
X8282087Y6150000D02*
D03*
X8167913D02*
D03*
X8282087Y6250000D02*
D03*
X8167913D02*
D03*
X8282087Y6350000D02*
D03*
X8167913D02*
D03*
X7582087Y6275000D02*
D03*
X7467913D02*
D03*
X7582087Y6375000D02*
D03*
X7467913D02*
D03*
X7582087Y6475000D02*
D03*
X7467913D02*
D03*
X7582087Y6575000D02*
D03*
X7467913D02*
D03*
X8282087Y5250000D02*
D03*
X8167913D02*
D03*
X8282087Y5350000D02*
D03*
X8167913D02*
D03*
X8282087Y5450000D02*
D03*
X8167913D02*
D03*
X8282087Y5550000D02*
D03*
X8167913D02*
D03*
X7582087Y5500000D02*
D03*
X7467913D02*
D03*
X7582087Y5600000D02*
D03*
X7467913D02*
D03*
X7582087Y5700000D02*
D03*
X7467913D02*
D03*
X7582087Y5800000D02*
D03*
X7467913D02*
D03*
X7282087Y9235000D02*
D03*
X7167913D02*
D03*
X7282087Y9725000D02*
D03*
X7167913D02*
D03*
X7282087Y9625000D02*
D03*
X7167913D02*
D03*
X7282087Y9525000D02*
D03*
X7167913D02*
D03*
X4752087Y10700000D02*
D03*
X4637913D02*
D03*
X4727087Y9935000D02*
D03*
X4612913D02*
D03*
X4787087Y9050000D02*
D03*
X4672913D02*
D03*
D11*
X7010000Y3490827D02*
D03*
D12*
X6919449Y3719173D02*
D03*
X7010000D02*
D03*
X7100551D02*
D03*
D13*
X4313189Y9483661D02*
D03*
Y9509252D02*
D03*
Y9534843D02*
D03*
Y9560433D02*
D03*
Y9586024D02*
D03*
Y9611614D02*
D03*
Y9637205D02*
D03*
Y9662795D02*
D03*
Y9688386D02*
D03*
Y9713976D02*
D03*
Y9739567D02*
D03*
Y9765157D02*
D03*
Y9790748D02*
D03*
Y9816339D02*
D03*
X4086811Y9483661D02*
D03*
Y9509252D02*
D03*
Y9534843D02*
D03*
Y9560433D02*
D03*
Y9586024D02*
D03*
Y9611614D02*
D03*
Y9637205D02*
D03*
Y9662795D02*
D03*
Y9688386D02*
D03*
Y9713976D02*
D03*
Y9739567D02*
D03*
Y9765157D02*
D03*
Y9790748D02*
D03*
Y9816339D02*
D03*
Y4866339D02*
D03*
Y4840748D02*
D03*
Y4815158D02*
D03*
Y4789567D02*
D03*
Y4763976D02*
D03*
Y4738386D02*
D03*
Y4712795D02*
D03*
Y4687205D02*
D03*
Y4661614D02*
D03*
Y4636024D02*
D03*
Y4610433D02*
D03*
Y4584842D02*
D03*
Y4559252D02*
D03*
Y4533661D02*
D03*
X4313189Y4866339D02*
D03*
Y4840748D02*
D03*
Y4815158D02*
D03*
Y4789567D02*
D03*
Y4763976D02*
D03*
Y4738386D02*
D03*
Y4712795D02*
D03*
Y4687205D02*
D03*
Y4661614D02*
D03*
Y4636024D02*
D03*
Y4610433D02*
D03*
Y4584842D02*
D03*
Y4559252D02*
D03*
Y4533661D02*
D03*
X4086811Y5666339D02*
D03*
Y5640748D02*
D03*
Y5615158D02*
D03*
Y5589567D02*
D03*
Y5563976D02*
D03*
Y5538386D02*
D03*
Y5512795D02*
D03*
Y5487205D02*
D03*
Y5461614D02*
D03*
Y5436024D02*
D03*
Y5410433D02*
D03*
Y5384842D02*
D03*
Y5359252D02*
D03*
Y5333661D02*
D03*
X4313189Y5666339D02*
D03*
Y5640748D02*
D03*
Y5615158D02*
D03*
Y5589567D02*
D03*
Y5563976D02*
D03*
Y5538386D02*
D03*
Y5512795D02*
D03*
Y5487205D02*
D03*
Y5461614D02*
D03*
Y5436024D02*
D03*
Y5410433D02*
D03*
Y5384842D02*
D03*
Y5359252D02*
D03*
Y5333661D02*
D03*
X4086811Y9016339D02*
D03*
Y8990748D02*
D03*
Y8965157D02*
D03*
Y8939567D02*
D03*
Y8913976D02*
D03*
Y8888386D02*
D03*
Y8862795D02*
D03*
Y8837205D02*
D03*
Y8811614D02*
D03*
Y8786024D02*
D03*
Y8760433D02*
D03*
Y8734843D02*
D03*
Y8709252D02*
D03*
Y8683661D02*
D03*
X4313189Y9016339D02*
D03*
Y8990748D02*
D03*
Y8965157D02*
D03*
Y8939567D02*
D03*
Y8913976D02*
D03*
Y8888386D02*
D03*
Y8862795D02*
D03*
Y8837205D02*
D03*
Y8811614D02*
D03*
Y8786024D02*
D03*
Y8760433D02*
D03*
Y8734843D02*
D03*
Y8709252D02*
D03*
Y8683661D02*
D03*
Y6138661D02*
D03*
Y6164252D02*
D03*
Y6189842D02*
D03*
Y6215433D02*
D03*
Y6241024D02*
D03*
Y6266614D02*
D03*
Y6292205D02*
D03*
Y6317795D02*
D03*
Y6343386D02*
D03*
Y6368976D02*
D03*
Y6394567D02*
D03*
Y6420158D02*
D03*
Y6445748D02*
D03*
Y6471339D02*
D03*
X4086811Y6138661D02*
D03*
Y6164252D02*
D03*
Y6189842D02*
D03*
Y6215433D02*
D03*
Y6241024D02*
D03*
Y6266614D02*
D03*
Y6292205D02*
D03*
Y6317795D02*
D03*
Y6343386D02*
D03*
Y6368976D02*
D03*
Y6394567D02*
D03*
Y6420158D02*
D03*
Y6445748D02*
D03*
Y6471339D02*
D03*
Y10616339D02*
D03*
Y10590748D02*
D03*
Y10565157D02*
D03*
Y10539567D02*
D03*
Y10513976D02*
D03*
Y10488386D02*
D03*
Y10462795D02*
D03*
Y10437205D02*
D03*
Y10411614D02*
D03*
Y10386024D02*
D03*
Y10360433D02*
D03*
Y10334843D02*
D03*
Y10309252D02*
D03*
Y10283661D02*
D03*
X4313189Y10616339D02*
D03*
Y10590748D02*
D03*
Y10565157D02*
D03*
Y10539567D02*
D03*
Y10513976D02*
D03*
Y10488386D02*
D03*
Y10462795D02*
D03*
Y10437205D02*
D03*
Y10411614D02*
D03*
Y10386024D02*
D03*
Y10360433D02*
D03*
Y10334843D02*
D03*
Y10309252D02*
D03*
Y10283661D02*
D03*
D14*
X7225000Y3839055D02*
D03*
Y3720945D02*
D03*
X8160000Y3340945D02*
D03*
Y3459055D02*
D03*
X8315000Y3340945D02*
D03*
Y3459055D02*
D03*
D15*
X6920000Y3939055D02*
D03*
Y3820945D02*
D03*
X8160000Y3950945D02*
D03*
Y4069055D02*
D03*
X7560000Y3530945D02*
D03*
Y3649055D02*
D03*
D16*
X8311772Y3625000D02*
D03*
X8158228D02*
D03*
D17*
X5590000Y5171496D02*
D03*
Y5108504D02*
D03*
X4250000Y4456496D02*
D03*
Y4393504D02*
D03*
X4315000Y4456496D02*
D03*
Y4393504D02*
D03*
X4250000Y5251496D02*
D03*
Y5188504D02*
D03*
X4315000Y5251496D02*
D03*
Y5188504D02*
D03*
X4250000Y6051496D02*
D03*
Y5988504D02*
D03*
X4315000Y6051496D02*
D03*
Y5988504D02*
D03*
X4250000Y8606496D02*
D03*
Y8543504D02*
D03*
X4315000Y8606496D02*
D03*
Y8543504D02*
D03*
X4250000Y9406496D02*
D03*
Y9343504D02*
D03*
X4315000Y9406496D02*
D03*
Y9343504D02*
D03*
X4250000Y10206496D02*
D03*
Y10143504D02*
D03*
X4315000Y10206496D02*
D03*
Y10143504D02*
D03*
X5805000Y9498504D02*
D03*
Y9561496D02*
D03*
Y10153504D02*
D03*
Y10216496D02*
D03*
D18*
X5888504Y5340000D02*
D03*
X5951496D02*
D03*
D19*
X5588701Y5390000D02*
D03*
Y5340000D02*
D03*
Y5290000D02*
D03*
Y5240000D02*
D03*
X5801299Y5390000D02*
D03*
Y5340000D02*
D03*
Y5290000D02*
D03*
Y5240000D02*
D03*
X5806299Y9425000D02*
D03*
Y9375000D02*
D03*
X5593701Y9075000D02*
D03*
X5806299D02*
D03*
Y9125000D02*
D03*
Y9175000D02*
D03*
Y9225000D02*
D03*
Y9275000D02*
D03*
Y9325000D02*
D03*
X5593701Y9125000D02*
D03*
Y9175000D02*
D03*
Y9225000D02*
D03*
Y9275000D02*
D03*
Y9325000D02*
D03*
Y9375000D02*
D03*
Y9425000D02*
D03*
X5806299Y10075000D02*
D03*
Y10025000D02*
D03*
X5593701Y9725000D02*
D03*
X5806299D02*
D03*
Y9775000D02*
D03*
Y9825000D02*
D03*
Y9875000D02*
D03*
Y9925000D02*
D03*
Y9975000D02*
D03*
X5593701Y9775000D02*
D03*
Y9825000D02*
D03*
Y9875000D02*
D03*
Y9925000D02*
D03*
Y9975000D02*
D03*
Y10025000D02*
D03*
Y10075000D02*
D03*
D20*
X4465945Y4915000D02*
D03*
X4584055D02*
D03*
X4465945Y5700000D02*
D03*
X4584055D02*
D03*
X4465945Y6490945D02*
D03*
X4584055D02*
D03*
X7084055Y9235000D02*
D03*
X6965945D02*
D03*
X7084055Y9725000D02*
D03*
X6965945D02*
D03*
X7084055Y9625000D02*
D03*
X6965945D02*
D03*
X7084055Y9525000D02*
D03*
X6965945D02*
D03*
X4544055Y10700000D02*
D03*
X4425945D02*
D03*
X4539055Y9935000D02*
D03*
X4420945D02*
D03*
X4584055Y9050000D02*
D03*
X4465945D02*
D03*
D21*
X6531142Y8920433D02*
D03*
Y8946024D02*
D03*
Y8971614D02*
D03*
Y8997205D02*
D03*
Y9022795D02*
D03*
Y9048386D02*
D03*
Y9073976D02*
D03*
Y9099567D02*
D03*
X6298858Y8920433D02*
D03*
Y8946024D02*
D03*
Y8971614D02*
D03*
Y8997205D02*
D03*
Y9022795D02*
D03*
Y9048386D02*
D03*
Y9073976D02*
D03*
Y9099567D02*
D03*
Y9389567D02*
D03*
Y9363976D02*
D03*
Y9338386D02*
D03*
Y9312795D02*
D03*
Y9287205D02*
D03*
Y9261614D02*
D03*
Y9236024D02*
D03*
Y9210433D02*
D03*
X6531142Y9389567D02*
D03*
Y9363976D02*
D03*
Y9338386D02*
D03*
Y9312795D02*
D03*
Y9287205D02*
D03*
Y9261614D02*
D03*
Y9236024D02*
D03*
Y9210433D02*
D03*
D22*
X7995079Y5450000D02*
D03*
Y5500000D02*
D03*
Y5550000D02*
D03*
Y5600000D02*
D03*
Y5650000D02*
D03*
Y5700000D02*
D03*
Y5750000D02*
D03*
Y5800000D02*
D03*
X7754921D02*
D03*
Y5750000D02*
D03*
Y5700000D02*
D03*
Y5650000D02*
D03*
Y5600000D02*
D03*
Y5550000D02*
D03*
Y5500000D02*
D03*
Y5450000D02*
D03*
X7995079Y7050000D02*
D03*
Y7100000D02*
D03*
Y7150000D02*
D03*
Y7200000D02*
D03*
Y7250000D02*
D03*
Y7300000D02*
D03*
Y7350000D02*
D03*
Y7400000D02*
D03*
X7754921D02*
D03*
Y7350000D02*
D03*
Y7300000D02*
D03*
Y7250000D02*
D03*
Y7200000D02*
D03*
Y7150000D02*
D03*
Y7100000D02*
D03*
Y7050000D02*
D03*
X7995079Y6225000D02*
D03*
Y6275000D02*
D03*
Y6325000D02*
D03*
Y6375000D02*
D03*
Y6425000D02*
D03*
Y6475000D02*
D03*
Y6525000D02*
D03*
Y6575000D02*
D03*
X7754921D02*
D03*
Y6525000D02*
D03*
Y6475000D02*
D03*
Y6425000D02*
D03*
Y6375000D02*
D03*
Y6325000D02*
D03*
Y6275000D02*
D03*
Y6225000D02*
D03*
D23*
X6274606Y10025000D02*
D03*
Y9975000D02*
D03*
Y9925000D02*
D03*
Y9875000D02*
D03*
Y9825000D02*
D03*
Y9775000D02*
D03*
Y9725000D02*
D03*
Y9675000D02*
D03*
X5975394D02*
D03*
Y9725000D02*
D03*
Y9775000D02*
D03*
Y9825000D02*
D03*
Y9875000D02*
D03*
Y9925000D02*
D03*
Y9975000D02*
D03*
Y10025000D02*
D03*
%TF.MD5,3d895008fce2cfb59a4909ffba303987*%
M02*
