%TF.GenerationSoftware,Altium Limited,Altium Designer,19.1.5 (86)*%
G04 Layer_Color=0*
%FSLAX26Y26*%
%MOIN*%
%TF.FileFunction,Profile,NP*%
%TF.Part,Single*%
G01*
G75*
%TA.AperFunction,Profile*%
%ADD57C,0.001000*%
D57*
X3009445Y3006494D02*
X9308662D01*
Y12193506D01*
X3009445D01*
Y3006494D01*
%TF.MD5,f5ae3e8cd89e6e7db35619ddce7e3e42*%
M02*
