%TF.GenerationSoftware,Altium Limited,Altium Designer,19.1.5 (86)*%
G04 Layer_Color=255*
%FSLAX26Y26*%
%MOIN*%
%TF.FileFunction,Pads,Top*%
%TF.Part,Single*%
G01*
G75*
%TA.AperFunction,SMDPad,CuDef*%
%ADD10R,0.061024X0.021654*%
%ADD11R,0.127953X0.084646*%
%ADD12R,0.037402X0.084646*%
%ADD13R,0.057087X0.017716*%
%ADD14R,0.066929X0.023622*%
%ADD15R,0.061024X0.023622*%
%ADD16R,0.045276X0.070866*%
%ADD17R,0.039370X0.068898*%
%ADD18R,0.066929X0.110236*%
%ADD19R,0.106299X0.045276*%
%ADD20R,0.070866X0.045276*%
%ADD21R,0.039370X0.037402*%
%ADD22O,0.061024X0.013780*%
%ADD23R,0.037402X0.039370*%
%TA.AperFunction,ComponentPad*%
%ADD30C,0.059055*%
%ADD31C,0.019685*%
%ADD32C,0.066929*%
%ADD33C,0.149606*%
%ADD34C,0.137795*%
%ADD35C,0.078740*%
%TA.AperFunction,ViaPad*%
%ADD36C,0.175197*%
D10*
X5975394Y10025000D02*
D03*
Y9975000D02*
D03*
Y9925000D02*
D03*
Y9875000D02*
D03*
Y9825000D02*
D03*
Y9775000D02*
D03*
Y9725000D02*
D03*
Y9675000D02*
D03*
X6274606D02*
D03*
Y9725000D02*
D03*
Y9775000D02*
D03*
Y9825000D02*
D03*
Y9875000D02*
D03*
Y9925000D02*
D03*
Y9975000D02*
D03*
Y10025000D02*
D03*
D11*
X7010000Y3490827D02*
D03*
D12*
X6919449Y3719173D02*
D03*
X7010000D02*
D03*
X7100551D02*
D03*
D13*
X6298858Y9099567D02*
D03*
Y9073976D02*
D03*
Y9048386D02*
D03*
Y9022795D02*
D03*
Y8997205D02*
D03*
Y8971614D02*
D03*
Y8946024D02*
D03*
Y8920433D02*
D03*
X6531142Y9099567D02*
D03*
Y9073976D02*
D03*
Y9048386D02*
D03*
Y9022795D02*
D03*
Y8997205D02*
D03*
Y8971614D02*
D03*
Y8946024D02*
D03*
Y8920433D02*
D03*
Y9210433D02*
D03*
Y9236024D02*
D03*
Y9261614D02*
D03*
Y9287205D02*
D03*
Y9312795D02*
D03*
Y9338386D02*
D03*
Y9363976D02*
D03*
Y9389567D02*
D03*
X6298858Y9210433D02*
D03*
Y9236024D02*
D03*
Y9261614D02*
D03*
Y9287205D02*
D03*
Y9312795D02*
D03*
Y9338386D02*
D03*
Y9363976D02*
D03*
Y9389567D02*
D03*
D14*
X7754921Y5450000D02*
D03*
Y5500000D02*
D03*
Y5550000D02*
D03*
Y5600000D02*
D03*
Y5650000D02*
D03*
Y5700000D02*
D03*
Y5750000D02*
D03*
Y5800000D02*
D03*
X7995079D02*
D03*
Y5750000D02*
D03*
Y5700000D02*
D03*
Y5650000D02*
D03*
Y5600000D02*
D03*
Y5550000D02*
D03*
Y5500000D02*
D03*
Y5450000D02*
D03*
X7754921Y7050000D02*
D03*
Y7100000D02*
D03*
Y7150000D02*
D03*
Y7200000D02*
D03*
Y7250000D02*
D03*
Y7300000D02*
D03*
Y7350000D02*
D03*
Y7400000D02*
D03*
X7995079D02*
D03*
Y7350000D02*
D03*
Y7300000D02*
D03*
Y7250000D02*
D03*
Y7200000D02*
D03*
Y7150000D02*
D03*
Y7100000D02*
D03*
Y7050000D02*
D03*
X7754921Y6225000D02*
D03*
Y6275000D02*
D03*
Y6325000D02*
D03*
Y6375000D02*
D03*
Y6425000D02*
D03*
Y6475000D02*
D03*
Y6525000D02*
D03*
Y6575000D02*
D03*
X7995079D02*
D03*
Y6525000D02*
D03*
Y6475000D02*
D03*
Y6425000D02*
D03*
Y6375000D02*
D03*
Y6325000D02*
D03*
Y6275000D02*
D03*
Y6225000D02*
D03*
D15*
X5801299Y5240000D02*
D03*
Y5290000D02*
D03*
Y5340000D02*
D03*
Y5390000D02*
D03*
X5588701Y5240000D02*
D03*
Y5290000D02*
D03*
Y5340000D02*
D03*
Y5390000D02*
D03*
X5593701Y9425000D02*
D03*
Y9375000D02*
D03*
Y9325000D02*
D03*
Y9275000D02*
D03*
Y9225000D02*
D03*
Y9175000D02*
D03*
Y9125000D02*
D03*
X5806299Y9325000D02*
D03*
Y9275000D02*
D03*
Y9225000D02*
D03*
Y9175000D02*
D03*
Y9125000D02*
D03*
Y9075000D02*
D03*
X5593701D02*
D03*
X5806299Y9375000D02*
D03*
Y9425000D02*
D03*
X5593701Y10075000D02*
D03*
Y10025000D02*
D03*
Y9975000D02*
D03*
Y9925000D02*
D03*
Y9875000D02*
D03*
Y9825000D02*
D03*
Y9775000D02*
D03*
X5806299Y9975000D02*
D03*
Y9925000D02*
D03*
Y9875000D02*
D03*
Y9825000D02*
D03*
Y9775000D02*
D03*
Y9725000D02*
D03*
X5593701D02*
D03*
X5806299Y10025000D02*
D03*
Y10075000D02*
D03*
D16*
X3662913Y7550000D02*
D03*
X3777087D02*
D03*
X8167913Y5950000D02*
D03*
X8282087D02*
D03*
X8167913Y5850000D02*
D03*
X8282087D02*
D03*
X8167913Y5750000D02*
D03*
X8282087D02*
D03*
X8167913Y5650000D02*
D03*
X8282087D02*
D03*
X8167913Y6750000D02*
D03*
X8282087D02*
D03*
X8167913Y6650000D02*
D03*
X8282087D02*
D03*
X8167913Y6550000D02*
D03*
X8282087D02*
D03*
X8167913Y6450000D02*
D03*
X8282087D02*
D03*
X8167913Y7575000D02*
D03*
X8282087D02*
D03*
X8167913Y7475000D02*
D03*
X8282087D02*
D03*
X8167913Y7375000D02*
D03*
X8282087D02*
D03*
X8167913Y7275000D02*
D03*
X8282087D02*
D03*
X8167913Y6875000D02*
D03*
X8282087D02*
D03*
X8167913Y6975000D02*
D03*
X8282087D02*
D03*
X8167913Y7075000D02*
D03*
X8282087D02*
D03*
X8167913Y7175000D02*
D03*
X8282087D02*
D03*
X7492913Y7100000D02*
D03*
X7607087D02*
D03*
X7492913Y7200000D02*
D03*
X7607087D02*
D03*
X7492913Y7300000D02*
D03*
X7607087D02*
D03*
X7492913Y7400000D02*
D03*
X7607087D02*
D03*
X8167913Y6050000D02*
D03*
X8282087D02*
D03*
X8167913Y6150000D02*
D03*
X8282087D02*
D03*
X8167913Y6250000D02*
D03*
X8282087D02*
D03*
X8167913Y6350000D02*
D03*
X8282087D02*
D03*
X7467913Y6275000D02*
D03*
X7582087D02*
D03*
X7467913Y6375000D02*
D03*
X7582087D02*
D03*
X7467913Y6475000D02*
D03*
X7582087D02*
D03*
X7467913Y6575000D02*
D03*
X7582087D02*
D03*
X8167913Y5250000D02*
D03*
X8282087D02*
D03*
X8167913Y5350000D02*
D03*
X8282087D02*
D03*
X8167913Y5450000D02*
D03*
X8282087D02*
D03*
X8167913Y5550000D02*
D03*
X8282087D02*
D03*
X7467913Y5500000D02*
D03*
X7582087D02*
D03*
X7467913Y5600000D02*
D03*
X7582087D02*
D03*
X7467913Y5700000D02*
D03*
X7582087D02*
D03*
X7467913Y5800000D02*
D03*
X7582087D02*
D03*
X7167913Y9235000D02*
D03*
X7282087D02*
D03*
X7167913Y9725000D02*
D03*
X7282087D02*
D03*
X7167913Y9625000D02*
D03*
X7282087D02*
D03*
X7167913Y9525000D02*
D03*
X7282087D02*
D03*
X4637913Y10700000D02*
D03*
X4752087D02*
D03*
X4612913Y9935000D02*
D03*
X4727087D02*
D03*
X4672913Y9050000D02*
D03*
X4787087D02*
D03*
X4772087Y6490000D02*
D03*
X4657913D02*
D03*
X4772087Y5700000D02*
D03*
X4657913D02*
D03*
X4772087Y4915000D02*
D03*
X4657913D02*
D03*
D17*
X4584055D02*
D03*
X4465945D02*
D03*
X6965945Y9725000D02*
D03*
X7084055D02*
D03*
X6965945Y9625000D02*
D03*
X7084055D02*
D03*
X6965945Y9525000D02*
D03*
X7084055D02*
D03*
X4425945Y10700000D02*
D03*
X4544055D02*
D03*
X4420945Y9935000D02*
D03*
X4539055D02*
D03*
X4465945Y9050000D02*
D03*
X4584055D02*
D03*
X6965945Y9235000D02*
D03*
X7084055D02*
D03*
X4584055Y6490945D02*
D03*
X4465945D02*
D03*
X4584055Y5700000D02*
D03*
X4465945D02*
D03*
D18*
X8158228Y3625000D02*
D03*
X8311772D02*
D03*
D19*
X7225000Y3720945D02*
D03*
Y3839055D02*
D03*
X8315000Y3459055D02*
D03*
Y3340945D02*
D03*
X8160000Y3459055D02*
D03*
Y3340945D02*
D03*
D20*
X6920000Y3820945D02*
D03*
Y3939055D02*
D03*
X7560000Y3649055D02*
D03*
Y3530945D02*
D03*
X8160000Y4069055D02*
D03*
Y3950945D02*
D03*
D21*
X5590000Y5108504D02*
D03*
Y5171496D02*
D03*
X4250000Y5988504D02*
D03*
Y6051496D02*
D03*
X4315000Y5988504D02*
D03*
Y6051496D02*
D03*
X5805000Y10216496D02*
D03*
Y10153504D02*
D03*
Y9561496D02*
D03*
Y9498504D02*
D03*
X4315000Y10143504D02*
D03*
Y10206496D02*
D03*
X4250000Y10143504D02*
D03*
Y10206496D02*
D03*
X4315000Y9343504D02*
D03*
Y9406496D02*
D03*
X4250000Y9343504D02*
D03*
Y9406496D02*
D03*
X4315000Y8543504D02*
D03*
Y8606496D02*
D03*
X4250000Y8543504D02*
D03*
Y8606496D02*
D03*
X4315000Y5188504D02*
D03*
Y5251496D02*
D03*
X4250000Y5188504D02*
D03*
Y5251496D02*
D03*
X4315000Y4393504D02*
D03*
Y4456496D02*
D03*
X4250000Y4393504D02*
D03*
Y4456496D02*
D03*
D22*
X4313189Y9483661D02*
D03*
Y9509252D02*
D03*
Y9534843D02*
D03*
Y9560433D02*
D03*
Y9586024D02*
D03*
Y9611614D02*
D03*
Y9637205D02*
D03*
Y9662795D02*
D03*
Y9688386D02*
D03*
Y9713976D02*
D03*
Y9739567D02*
D03*
Y9765157D02*
D03*
Y9790748D02*
D03*
Y9816339D02*
D03*
X4086811Y9483661D02*
D03*
Y9509252D02*
D03*
Y9534843D02*
D03*
Y9560433D02*
D03*
Y9586024D02*
D03*
Y9611614D02*
D03*
Y9637205D02*
D03*
Y9662795D02*
D03*
Y9688386D02*
D03*
Y9713976D02*
D03*
Y9739567D02*
D03*
Y9765157D02*
D03*
Y9790748D02*
D03*
Y9816339D02*
D03*
Y6471339D02*
D03*
Y6445748D02*
D03*
Y6420158D02*
D03*
Y6394567D02*
D03*
Y6368976D02*
D03*
Y6343386D02*
D03*
Y6317795D02*
D03*
Y6292205D02*
D03*
Y6266614D02*
D03*
Y6241024D02*
D03*
Y6215433D02*
D03*
Y6189842D02*
D03*
Y6164252D02*
D03*
Y6138661D02*
D03*
X4313189Y6471339D02*
D03*
Y6445748D02*
D03*
Y6420158D02*
D03*
Y6394567D02*
D03*
Y6368976D02*
D03*
Y6343386D02*
D03*
Y6317795D02*
D03*
Y6292205D02*
D03*
Y6266614D02*
D03*
Y6241024D02*
D03*
Y6215433D02*
D03*
Y6189842D02*
D03*
Y6164252D02*
D03*
Y6138661D02*
D03*
Y10283661D02*
D03*
Y10309252D02*
D03*
Y10334843D02*
D03*
Y10360433D02*
D03*
Y10386024D02*
D03*
Y10411614D02*
D03*
Y10437205D02*
D03*
Y10462795D02*
D03*
Y10488386D02*
D03*
Y10513976D02*
D03*
Y10539567D02*
D03*
Y10565157D02*
D03*
Y10590748D02*
D03*
Y10616339D02*
D03*
X4086811Y10283661D02*
D03*
Y10309252D02*
D03*
Y10334843D02*
D03*
Y10360433D02*
D03*
Y10386024D02*
D03*
Y10411614D02*
D03*
Y10437205D02*
D03*
Y10462795D02*
D03*
Y10488386D02*
D03*
Y10513976D02*
D03*
Y10539567D02*
D03*
Y10565157D02*
D03*
Y10590748D02*
D03*
Y10616339D02*
D03*
X4313189Y8683661D02*
D03*
Y8709252D02*
D03*
Y8734843D02*
D03*
Y8760433D02*
D03*
Y8786024D02*
D03*
Y8811614D02*
D03*
Y8837205D02*
D03*
Y8862795D02*
D03*
Y8888386D02*
D03*
Y8913976D02*
D03*
Y8939567D02*
D03*
Y8965157D02*
D03*
Y8990748D02*
D03*
Y9016339D02*
D03*
X4086811Y8683661D02*
D03*
Y8709252D02*
D03*
Y8734843D02*
D03*
Y8760433D02*
D03*
Y8786024D02*
D03*
Y8811614D02*
D03*
Y8837205D02*
D03*
Y8862795D02*
D03*
Y8888386D02*
D03*
Y8913976D02*
D03*
Y8939567D02*
D03*
Y8965157D02*
D03*
Y8990748D02*
D03*
Y9016339D02*
D03*
X4313189Y5333661D02*
D03*
Y5359252D02*
D03*
Y5384842D02*
D03*
Y5410433D02*
D03*
Y5436024D02*
D03*
Y5461614D02*
D03*
Y5487205D02*
D03*
Y5512795D02*
D03*
Y5538386D02*
D03*
Y5563976D02*
D03*
Y5589567D02*
D03*
Y5615158D02*
D03*
Y5640748D02*
D03*
Y5666339D02*
D03*
X4086811Y5333661D02*
D03*
Y5359252D02*
D03*
Y5384842D02*
D03*
Y5410433D02*
D03*
Y5436024D02*
D03*
Y5461614D02*
D03*
Y5487205D02*
D03*
Y5512795D02*
D03*
Y5538386D02*
D03*
Y5563976D02*
D03*
Y5589567D02*
D03*
Y5615158D02*
D03*
Y5640748D02*
D03*
Y5666339D02*
D03*
X4313189Y4533661D02*
D03*
Y4559252D02*
D03*
Y4584842D02*
D03*
Y4610433D02*
D03*
Y4636024D02*
D03*
Y4661614D02*
D03*
Y4687205D02*
D03*
Y4712795D02*
D03*
Y4738386D02*
D03*
Y4763976D02*
D03*
Y4789567D02*
D03*
Y4815158D02*
D03*
Y4840748D02*
D03*
Y4866339D02*
D03*
X4086811Y4533661D02*
D03*
Y4559252D02*
D03*
Y4584842D02*
D03*
Y4610433D02*
D03*
Y4636024D02*
D03*
Y4661614D02*
D03*
Y4687205D02*
D03*
Y4712795D02*
D03*
Y4738386D02*
D03*
Y4763976D02*
D03*
Y4789567D02*
D03*
Y4815158D02*
D03*
Y4840748D02*
D03*
Y4866339D02*
D03*
D23*
X5951496Y5340000D02*
D03*
X5888504D02*
D03*
D30*
X3285000Y7550000D02*
D03*
Y7650000D02*
D03*
X7775000Y4070000D02*
D03*
Y3970000D02*
D03*
Y3870000D02*
D03*
Y3570000D02*
D03*
Y3470000D02*
D03*
Y3370000D02*
D03*
D31*
X3185000Y7600000D02*
D03*
D32*
X3525000Y4630708D02*
D03*
Y4739369D02*
D03*
Y4848031D02*
D03*
Y4956692D02*
D03*
Y5065354D02*
D03*
Y5174015D02*
D03*
Y5282677D02*
D03*
Y5391338D02*
D03*
Y5499999D02*
D03*
Y5608661D02*
D03*
Y5717322D02*
D03*
Y5825984D02*
D03*
Y5934645D02*
D03*
Y6043307D02*
D03*
Y6151968D02*
D03*
Y6260629D02*
D03*
Y6369291D02*
D03*
X3425000Y4685039D02*
D03*
Y4793700D02*
D03*
Y4902361D02*
D03*
Y5011023D02*
D03*
Y5119685D02*
D03*
Y5228346D02*
D03*
Y5337007D02*
D03*
Y5445669D02*
D03*
Y5554330D02*
D03*
Y5662992D02*
D03*
Y5771653D02*
D03*
Y5880314D02*
D03*
Y5988976D02*
D03*
Y6097637D02*
D03*
Y6206298D02*
D03*
Y6314960D02*
D03*
X3325000Y4630708D02*
D03*
Y4739370D02*
D03*
Y4848031D02*
D03*
Y4956693D02*
D03*
Y5065354D02*
D03*
Y5174015D02*
D03*
Y5282677D02*
D03*
Y5391338D02*
D03*
Y5500000D02*
D03*
Y5608661D02*
D03*
Y5717323D02*
D03*
Y5825984D02*
D03*
Y5934645D02*
D03*
Y6043307D02*
D03*
Y6151968D02*
D03*
Y6260630D02*
D03*
Y6369291D02*
D03*
X9100000Y6525000D02*
D03*
Y6425000D02*
D03*
Y6325000D02*
D03*
Y6225000D02*
D03*
Y6125000D02*
D03*
Y6025000D02*
D03*
Y5925000D02*
D03*
Y5825000D02*
D03*
Y5025000D02*
D03*
Y5125000D02*
D03*
Y5225000D02*
D03*
Y5325000D02*
D03*
Y5425000D02*
D03*
Y5525000D02*
D03*
Y5625000D02*
D03*
Y5725000D02*
D03*
Y4225000D02*
D03*
Y4325000D02*
D03*
Y4425000D02*
D03*
Y4525000D02*
D03*
Y4625000D02*
D03*
Y4725000D02*
D03*
Y4825000D02*
D03*
Y4925000D02*
D03*
Y3425000D02*
D03*
Y3525000D02*
D03*
Y3625000D02*
D03*
Y3725000D02*
D03*
Y3825000D02*
D03*
Y3925000D02*
D03*
Y4025000D02*
D03*
Y4125000D02*
D03*
X9000000D02*
D03*
Y4025000D02*
D03*
Y3925000D02*
D03*
Y3825000D02*
D03*
Y3725000D02*
D03*
Y3625000D02*
D03*
Y3525000D02*
D03*
Y3425000D02*
D03*
Y4925000D02*
D03*
Y4825000D02*
D03*
Y4725000D02*
D03*
Y4625000D02*
D03*
Y4525000D02*
D03*
Y4425000D02*
D03*
Y4325000D02*
D03*
Y4225000D02*
D03*
Y5725000D02*
D03*
Y5625000D02*
D03*
Y5525000D02*
D03*
Y5425000D02*
D03*
Y5325000D02*
D03*
Y5225000D02*
D03*
Y5125000D02*
D03*
Y5025000D02*
D03*
Y5825000D02*
D03*
Y5925000D02*
D03*
Y6025000D02*
D03*
Y6125000D02*
D03*
Y6225000D02*
D03*
Y6325000D02*
D03*
Y6425000D02*
D03*
Y6525000D02*
D03*
X3525000Y8840708D02*
D03*
Y8949370D02*
D03*
Y9058031D02*
D03*
Y9166692D02*
D03*
Y9275354D02*
D03*
Y9384015D02*
D03*
Y9492677D02*
D03*
Y9601338D02*
D03*
Y9709999D02*
D03*
Y9818661D02*
D03*
Y9927322D02*
D03*
Y10035984D02*
D03*
Y10144645D02*
D03*
Y10253307D02*
D03*
Y10361968D02*
D03*
Y10470629D02*
D03*
Y10579291D02*
D03*
X3425000Y8895039D02*
D03*
Y9003700D02*
D03*
Y9112362D02*
D03*
Y9221023D02*
D03*
Y9329684D02*
D03*
Y9438346D02*
D03*
Y9547007D02*
D03*
Y9655669D02*
D03*
Y9764330D02*
D03*
Y9872992D02*
D03*
Y9981653D02*
D03*
Y10090314D02*
D03*
Y10198976D02*
D03*
Y10307637D02*
D03*
Y10416299D02*
D03*
Y10524960D02*
D03*
X3325000Y8840708D02*
D03*
Y8949370D02*
D03*
Y9058031D02*
D03*
Y9166693D02*
D03*
Y9275354D02*
D03*
Y9384015D02*
D03*
Y9492677D02*
D03*
Y9601338D02*
D03*
Y9710000D02*
D03*
Y9818661D02*
D03*
Y9927323D02*
D03*
Y10035984D02*
D03*
Y10144645D02*
D03*
Y10253307D02*
D03*
Y10361968D02*
D03*
Y10470630D02*
D03*
Y10579291D02*
D03*
D33*
X3425000Y6702757D02*
D03*
Y4297243D02*
D03*
Y10912757D02*
D03*
Y8507243D02*
D03*
D34*
X9200000Y6725000D02*
D03*
Y3225000D02*
D03*
D35*
X8528200Y3619151D02*
D03*
X8751800Y3620849D02*
D03*
X8018097Y3511732D02*
D03*
X7640144Y3929055D02*
D03*
D36*
X3149997Y3224998D02*
D03*
Y11975002D02*
D03*
%TF.MD5,5cf192ad72f933de8ed61b55f889c164*%
M02*
