G04*
G04 #@! TF.GenerationSoftware,Altium Limited,Altium Designer,19.0.12 (326)*
G04*
G04 Layer_Physical_Order=1*
G04 Layer_Color=255*
%FSLAX44Y44*%
%MOMM*%
G71*
G01*
G75*
%ADD13C,0.6350*%
%ADD14R,1.2000X1.8000*%
%ADD15R,0.6000X1.5500*%
%ADD22C,0.3810*%
%ADD23C,0.3048*%
%ADD24C,3.2000*%
%ADD25C,1.5000*%
%ADD26R,1.5000X1.5000*%
%ADD27C,1.6000*%
D13*
X0Y0D02*
Y350000D01*
X1630000D01*
X1630000Y0D01*
X0D02*
X1630000D01*
D14*
X774700Y10821D02*
D03*
X728700D02*
D03*
X666972D02*
D03*
X620972D02*
D03*
X557772D02*
D03*
X511772D02*
D03*
X447320Y12180D02*
D03*
X401320D02*
D03*
X340500D02*
D03*
X294500D02*
D03*
X226200D02*
D03*
X180200D02*
D03*
X1456152Y10821D02*
D03*
X1410152D02*
D03*
X1337772D02*
D03*
X1291772D02*
D03*
X1227772D02*
D03*
X1181772D02*
D03*
X1110120D02*
D03*
X1064120D02*
D03*
X993440D02*
D03*
X947440D02*
D03*
X883920D02*
D03*
X837920D02*
D03*
D15*
X751700Y41821D02*
D03*
X761700D02*
D03*
X741700D02*
D03*
X643972D02*
D03*
X653972D02*
D03*
X633972D02*
D03*
X534772D02*
D03*
X544772D02*
D03*
X524772D02*
D03*
X424320Y43180D02*
D03*
X434320D02*
D03*
X414320D02*
D03*
X317500D02*
D03*
X327500D02*
D03*
X307500D02*
D03*
X203200D02*
D03*
X213200D02*
D03*
X193200D02*
D03*
X1433152Y41821D02*
D03*
X1443152D02*
D03*
X1423152D02*
D03*
X1314772D02*
D03*
X1324772D02*
D03*
X1304772D02*
D03*
X1204772D02*
D03*
X1214772D02*
D03*
X1194772D02*
D03*
X1087120D02*
D03*
X1097120D02*
D03*
X1077120D02*
D03*
X970440D02*
D03*
X980440D02*
D03*
X960440D02*
D03*
X860920D02*
D03*
X870920D02*
D03*
X850920D02*
D03*
D22*
X406400Y279400D02*
X444500D01*
X380000Y268301D02*
X391099Y279400D01*
X406400D01*
X380000Y96200D02*
Y268301D01*
Y96200D02*
X414320Y61880D01*
Y43180D02*
Y61880D01*
X337820Y240000D02*
Y254000D01*
X335280Y237460D02*
X337820Y240000D01*
X335280Y210820D02*
Y237460D01*
X304800Y210820D02*
Y240000D01*
X301861Y242939D02*
X304800Y240000D01*
X301861Y242939D02*
Y251859D01*
X299720Y254000D02*
X301861Y251859D01*
X1452880Y210820D02*
Y231140D01*
X1455420Y233680D01*
Y254000D01*
X1417320Y238760D02*
Y254000D01*
Y238760D02*
X1423152Y232928D01*
Y210201D02*
Y232928D01*
X1336040Y231140D02*
Y254000D01*
X1333500Y228600D02*
X1336040Y231140D01*
X1333500Y210820D02*
Y228600D01*
X1302992Y210201D02*
Y234128D01*
X1297940Y239180D02*
X1302992Y234128D01*
X1297940Y239180D02*
Y254000D01*
X1417320Y279400D02*
X1455420D01*
X1399540Y274320D02*
X1412240D01*
X1417320Y279400D01*
X1389380Y264160D02*
X1399540Y274320D01*
X1389380Y101628D02*
Y264160D01*
Y101628D02*
X1423152Y67856D01*
Y41821D02*
Y67856D01*
X1422400Y83820D02*
Y107848D01*
X1423152Y108601D01*
X1422400Y83820D02*
X1433152Y73068D01*
Y41821D02*
Y73068D01*
X1452880Y86360D02*
Y109220D01*
X1443152Y76632D02*
X1452880Y86360D01*
X1443152Y41821D02*
Y76632D01*
X1282700Y279400D02*
X1297940D01*
X1272540Y269240D02*
X1282700Y279400D01*
X1272540Y101600D02*
Y269240D01*
X1297940Y279400D02*
X1336040D01*
X1272540Y101600D02*
X1304772Y69368D01*
Y41821D02*
Y69368D01*
X1324772Y77632D02*
X1333500Y86360D01*
Y109220D01*
X1324772Y41821D02*
Y77632D01*
X1302992Y88928D02*
Y108601D01*
Y88928D02*
X1314772Y77148D01*
Y41821D02*
Y77148D01*
X1224280Y236668D02*
Y254000D01*
X1221740Y234128D02*
X1224280Y236668D01*
X1221740Y210820D02*
Y234128D01*
X1191260Y211008D02*
Y233528D01*
X1190452Y210201D02*
X1191260Y211008D01*
X1186180Y238608D02*
X1191260Y233528D01*
X1186180Y238608D02*
Y254000D01*
X1160780Y273221D02*
X1166959Y279400D01*
X1160780Y104140D02*
Y273221D01*
Y104140D02*
X1194772Y70148D01*
X1186180Y279400D02*
X1224280D01*
X1166959D02*
X1186180D01*
X1194772Y41821D02*
Y70148D01*
X1190452Y88900D02*
Y108601D01*
Y88900D02*
X1204772Y74580D01*
Y41821D02*
Y74580D01*
X1221740Y83820D02*
Y109220D01*
X1214772Y76852D02*
X1221740Y83820D01*
X1214772Y41821D02*
Y76852D01*
X1099972Y231140D02*
X1102360Y233528D01*
Y254000D01*
X1099972Y210201D02*
Y231140D01*
X1069340Y210820D02*
Y233680D01*
X1064260Y238760D02*
X1069340Y233680D01*
X1064260Y238760D02*
Y254000D01*
X985520Y229048D02*
X990600Y234128D01*
Y254000D01*
X985520Y210820D02*
Y229048D01*
X955372Y210201D02*
Y231140D01*
X952832Y233680D02*
X955372Y231140D01*
X952832Y233680D02*
Y254000D01*
X1064260Y279400D02*
X1102360D01*
X1036320Y266700D02*
X1049020Y279400D01*
X1064260D01*
X1036320Y104140D02*
Y266700D01*
Y104140D02*
X1077120Y63340D01*
Y41821D02*
Y63340D01*
X1099820Y78740D02*
Y108448D01*
X1097120Y76040D02*
X1099820Y78740D01*
X1097120Y41821D02*
Y76040D01*
X1087120Y41821D02*
Y73660D01*
X1069340Y91440D02*
X1087120Y73660D01*
X1069340Y91440D02*
Y109220D01*
X1099820Y108448D02*
X1099972Y108601D01*
X960120Y42141D02*
Y71120D01*
X929640Y101600D02*
X960120Y71120D01*
X929640Y101600D02*
Y271780D01*
X937260Y279400D02*
X952832D01*
X929640Y271780D02*
X937260Y279400D01*
X952832D02*
X990600D01*
X960120Y42141D02*
X960440Y41821D01*
X955372Y92556D02*
Y108601D01*
Y92556D02*
X970440Y77488D01*
Y41821D02*
Y77488D01*
X980440Y78740D02*
X985520Y83820D01*
Y109220D01*
X980440Y41821D02*
Y78740D01*
X870920Y75900D02*
X881380Y86360D01*
X870920Y41821D02*
Y75900D01*
X850452Y85268D02*
X860920Y74800D01*
Y41821D02*
Y74800D01*
X820420Y102940D02*
X850920Y72440D01*
Y41821D02*
Y72440D01*
X769620Y86968D02*
Y109220D01*
X761700Y79048D02*
X769620Y86968D01*
X761700Y41821D02*
Y79048D01*
X738933Y92859D02*
X751700Y80092D01*
Y41821D02*
Y80092D01*
X706120Y99060D02*
X741700Y63480D01*
Y41821D02*
Y63480D01*
X881380Y229048D02*
X883920Y231588D01*
X881380Y210820D02*
Y229048D01*
X883920Y231588D02*
Y252901D01*
X850452Y210201D02*
Y231588D01*
X845823Y236217D02*
X850452Y231588D01*
X845823Y236217D02*
Y252901D01*
Y278301D02*
X883920D01*
X829481D02*
X845823D01*
X820420Y269240D02*
X829481Y278301D01*
X820420Y102940D02*
Y269240D01*
X850452Y85268D02*
Y108601D01*
X881380Y86360D02*
Y109220D01*
X738933Y92859D02*
Y108601D01*
X774700Y238760D02*
Y254000D01*
X769620Y233680D02*
X774700Y238760D01*
X769620Y210820D02*
Y233680D01*
X736393Y238967D02*
X740632Y234727D01*
Y211900D02*
Y234727D01*
X738933Y210201D02*
X740632Y211900D01*
X736393Y238967D02*
Y254000D01*
X721360Y279400D02*
X736393D01*
X706120Y264160D02*
X721360Y279400D01*
X706120Y99060D02*
Y264160D01*
X736393Y279400D02*
X774700D01*
X662940Y228600D02*
X665480Y231140D01*
Y254000D01*
X662940Y210820D02*
Y228600D01*
X632460Y210820D02*
Y238760D01*
X629521Y241699D02*
X632460Y238760D01*
X629521Y241699D02*
Y251859D01*
X627380Y254000D02*
X629521Y251859D01*
X662940Y86360D02*
Y109220D01*
X653972Y77392D02*
X662940Y86360D01*
X653972Y41821D02*
Y77392D01*
X643972Y41821D02*
Y77388D01*
X632460Y88900D02*
X643972Y77388D01*
X632460Y88900D02*
Y109220D01*
X627380Y279400D02*
X665480D01*
X601980Y269240D02*
X612140Y279400D01*
X627380D01*
X601980Y93980D02*
Y269240D01*
Y93980D02*
X633972Y61988D01*
Y41821D02*
Y61988D01*
X551180Y228600D02*
X553720Y231140D01*
Y254000D01*
X551180Y210820D02*
Y228600D01*
X520700Y210820D02*
Y231140D01*
X515620Y236220D02*
X520700Y231140D01*
X515620Y236220D02*
Y254000D01*
X444500Y228600D02*
Y254000D01*
X441960Y226060D02*
X444500Y228600D01*
X441960Y210820D02*
Y226060D01*
X411480Y210820D02*
Y231140D01*
X406400Y236220D02*
X411480Y231140D01*
X406400Y236220D02*
Y254000D01*
X502920Y279400D02*
X515620D01*
X492760Y269240D02*
X502920Y279400D01*
X492760Y93820D02*
Y269240D01*
X515620Y279400D02*
X553720D01*
X492760Y93820D02*
X524772Y61808D01*
Y41821D02*
Y61808D01*
X534772Y41821D02*
Y84988D01*
X520700Y99060D02*
X534772Y84988D01*
X520700Y99060D02*
Y109220D01*
X544772Y85032D02*
X551180Y91440D01*
Y109220D01*
X544772Y41821D02*
Y85032D01*
X434320Y81260D02*
X441960Y88900D01*
X434320Y43180D02*
Y81260D01*
X441960Y88900D02*
Y109220D01*
X424320Y43180D02*
Y78600D01*
X411480Y91440D02*
X424320Y78600D01*
X411480Y91440D02*
Y109220D01*
X299720Y279400D02*
X337820D01*
X274320Y274320D02*
X279400Y279400D01*
X299720D01*
X274320Y106680D02*
Y274320D01*
Y106680D02*
X304800Y76200D01*
X305108D01*
X307340Y73968D01*
Y43340D02*
Y73968D01*
Y43340D02*
X307500Y43180D01*
X327500Y81120D02*
X335280Y88900D01*
Y109220D01*
X327500Y43180D02*
Y81120D01*
X317500Y43180D02*
Y81280D01*
X304800Y93980D02*
X317500Y81280D01*
X304800Y93980D02*
Y109220D01*
X162560Y274320D02*
X167640Y279400D01*
X162560Y101600D02*
Y274320D01*
Y101600D02*
X193200Y70960D01*
X220000Y105700D02*
Y109200D01*
X213200Y98900D02*
X220000Y105700D01*
X213200Y43180D02*
Y98900D01*
X220000Y210800D02*
Y228600D01*
X223520Y232120D01*
Y254000D01*
X190000Y210800D02*
Y224020D01*
X185420Y228600D02*
X190000Y224020D01*
X185420Y228600D02*
Y254000D01*
Y279400D02*
X223520D01*
X167640D02*
X185420D01*
X193200Y43180D02*
Y70960D01*
D23*
X203200Y43180D02*
Y99060D01*
X193060Y109200D02*
X203200Y99060D01*
X190000Y109200D02*
X193060D01*
D24*
X1600000Y320000D02*
D03*
Y30000D02*
D03*
X30000Y320000D02*
D03*
Y30000D02*
D03*
D25*
X1455420Y254000D02*
D03*
X1417320D02*
D03*
X1336040D02*
D03*
X1297940D02*
D03*
X1224280D02*
D03*
X1186180D02*
D03*
X1064260D02*
D03*
X1102360D02*
D03*
X990600D02*
D03*
X952832D02*
D03*
X883920Y252901D02*
D03*
X845823D02*
D03*
X774700Y254000D02*
D03*
X736393D02*
D03*
X665480D02*
D03*
X627380D02*
D03*
X553720D02*
D03*
X515620D02*
D03*
X406400D02*
D03*
X444500D02*
D03*
X337820D02*
D03*
X299720D02*
D03*
X223520D02*
D03*
X185420D02*
D03*
D26*
X1455420Y279400D02*
D03*
X1417320D02*
D03*
X1336040D02*
D03*
X1297940D02*
D03*
X1224280D02*
D03*
X1186180D02*
D03*
X1064260D02*
D03*
X1102360D02*
D03*
X990600D02*
D03*
X952832D02*
D03*
X883920Y278301D02*
D03*
X845823D02*
D03*
X774700Y279400D02*
D03*
X736393D02*
D03*
X665480D02*
D03*
X627380D02*
D03*
X553720D02*
D03*
X515620D02*
D03*
X406400D02*
D03*
X444500D02*
D03*
X337820D02*
D03*
X299720D02*
D03*
X223520D02*
D03*
X185420D02*
D03*
D27*
X1423152Y210201D02*
D03*
Y108601D02*
D03*
X1452880Y210820D02*
D03*
Y109220D02*
D03*
X1302992Y210201D02*
D03*
Y108601D02*
D03*
X1333500Y210820D02*
D03*
Y109220D02*
D03*
X1190452Y210201D02*
D03*
Y108601D02*
D03*
X1221740Y210820D02*
D03*
Y109220D02*
D03*
X1069340Y210820D02*
D03*
Y109220D02*
D03*
X1099972Y210201D02*
D03*
Y108601D02*
D03*
X955372Y210201D02*
D03*
Y108601D02*
D03*
X985520Y210820D02*
D03*
Y109220D02*
D03*
X850452Y210201D02*
D03*
Y108601D02*
D03*
X881380Y210820D02*
D03*
Y109220D02*
D03*
X769620Y210820D02*
D03*
Y109220D02*
D03*
X738933Y210201D02*
D03*
Y108601D02*
D03*
X632460Y210820D02*
D03*
Y109220D02*
D03*
X662940Y210820D02*
D03*
Y109220D02*
D03*
X520700Y210820D02*
D03*
Y109220D02*
D03*
X551180Y210820D02*
D03*
Y109220D02*
D03*
X411480D02*
D03*
Y210820D02*
D03*
X441960Y109220D02*
D03*
Y210820D02*
D03*
X335280Y109220D02*
D03*
Y210820D02*
D03*
X304800Y109220D02*
D03*
Y210820D02*
D03*
X190000Y109200D02*
D03*
Y210800D02*
D03*
X220000Y109200D02*
D03*
Y210800D02*
D03*
M02*
