%TF.GenerationSoftware,Altium Limited,Altium Designer,19.1.5 (86)*%
G04 Layer_Color=16711935*
%FSLAX45Y45*%
%MOMM*%
%TF.FileFunction,Soldermask,Bot*%
%TF.Part,Single*%
G01*
G75*
%TA.AperFunction,ComponentPad*%
%ADD33C,1.80200*%
%ADD34C,4.10200*%
%ADD35C,1.90200*%
%ADD36C,5.70200*%
%ADD37C,2.00200*%
%ADD38C,2.20200*%
%ADD39C,4.00200*%
%TA.AperFunction,WasherPad*%
%ADD40C,3.40200*%
%TA.AperFunction,ViaPad*%
%ADD41C,1.20200*%
D33*
X7404098Y10541015D02*
D03*
Y10795015D02*
D03*
X7150098Y10541015D02*
D03*
Y10795015D02*
D03*
X6896098Y10541015D02*
D03*
Y10795015D02*
D03*
X6642098D02*
D03*
Y10541015D02*
D03*
X6388098Y10795015D02*
D03*
Y10541015D02*
D03*
X7912098Y10795015D02*
D03*
Y10541015D02*
D03*
X7658098Y10795015D02*
D03*
Y10541015D02*
D03*
X5589999Y13716000D02*
D03*
X5866999D02*
D03*
X6143999D02*
D03*
X6421000D02*
D03*
X6698000D02*
D03*
X6975000D02*
D03*
X7252000D02*
D03*
X7529000D02*
D03*
X7806000D02*
D03*
X8083001D02*
D03*
X8360001D02*
D03*
X8637001D02*
D03*
X5449999Y13462000D02*
D03*
X5726999D02*
D03*
X6003999D02*
D03*
X6281000D02*
D03*
X7389000D02*
D03*
X7112000D02*
D03*
X6558000D02*
D03*
X7666000D02*
D03*
X7943000D02*
D03*
X8220001D02*
D03*
X8497001D02*
D03*
X8774001D02*
D03*
X6835000D02*
D03*
D34*
X10526000Y13588998D02*
D03*
X13857999D02*
D03*
D35*
X13150999Y13461998D02*
D03*
X12876999D02*
D03*
X12602999D02*
D03*
X12328999D02*
D03*
X12054999D02*
D03*
X11780999D02*
D03*
X11506999D02*
D03*
X11232999D02*
D03*
X11370002Y13715997D02*
D03*
X11644002D02*
D03*
X11918002D02*
D03*
X12192002D02*
D03*
X12466001D02*
D03*
X12740001D02*
D03*
X13014001D02*
D03*
X8681865Y1270000D02*
D03*
X8957866D02*
D03*
X9233862D02*
D03*
X9509864D02*
D03*
X9785865D02*
D03*
X10061862D02*
D03*
X10337863D02*
D03*
X10613865D02*
D03*
X10889866D02*
D03*
X11165863D02*
D03*
X11441864D02*
D03*
X11717866D02*
D03*
X11993862D02*
D03*
X12269863D02*
D03*
X12545865D02*
D03*
X12821866D02*
D03*
X13097862D02*
D03*
X8819863Y1016000D02*
D03*
X9095864D02*
D03*
X9371866D02*
D03*
X9647862D02*
D03*
X9923864D02*
D03*
X10199865D02*
D03*
X10475861D02*
D03*
X10751863D02*
D03*
X11027864D02*
D03*
X11303866D02*
D03*
X11579862D02*
D03*
X11855864D02*
D03*
X12131865D02*
D03*
X12407862D02*
D03*
X12683863D02*
D03*
X12959865D02*
D03*
X8681865Y762000D02*
D03*
X8957866D02*
D03*
X9233862D02*
D03*
X9509864D02*
D03*
X9785865D02*
D03*
X10061862D02*
D03*
X10337863D02*
D03*
X10613865D02*
D03*
X10889866D02*
D03*
X11165863D02*
D03*
X11441864D02*
D03*
X11717866D02*
D03*
X11993862D02*
D03*
X12269863D02*
D03*
X12545865D02*
D03*
X12821866D02*
D03*
X13097862D02*
D03*
X1500398Y1270000D02*
D03*
X1776400D02*
D03*
X2052401D02*
D03*
X2328398D02*
D03*
X2604399D02*
D03*
X2880401D02*
D03*
X3156402D02*
D03*
X3432399D02*
D03*
X3708400D02*
D03*
X3984401D02*
D03*
X4260398D02*
D03*
X4536399D02*
D03*
X4812401D02*
D03*
X5088402D02*
D03*
X5364399D02*
D03*
X5640400D02*
D03*
X5916402D02*
D03*
X1638402Y1016000D02*
D03*
X1914398D02*
D03*
X2190399D02*
D03*
X2466401D02*
D03*
X2742397D02*
D03*
X3018399D02*
D03*
X3294400D02*
D03*
X3570402D02*
D03*
X3846398D02*
D03*
X4122400D02*
D03*
X4398401D02*
D03*
X4674398D02*
D03*
X4950399D02*
D03*
X5226401D02*
D03*
X5502397D02*
D03*
X5778398D02*
D03*
X1500398Y762000D02*
D03*
X1776400D02*
D03*
X2052401D02*
D03*
X2328398D02*
D03*
X2604399D02*
D03*
X2880401D02*
D03*
X3156402D02*
D03*
X3432399D02*
D03*
X3708400D02*
D03*
X3984401D02*
D03*
X4260398D02*
D03*
X4536399D02*
D03*
X4812401D02*
D03*
X5088397D02*
D03*
X5364399D02*
D03*
X5640400D02*
D03*
X5916402D02*
D03*
D36*
X4761999Y13589000D02*
D03*
X9462001D02*
D03*
D37*
X8318500Y1958994D02*
D03*
Y4898996D02*
D03*
X13525500Y1958994D02*
D03*
Y4898996D02*
D03*
X8839200Y1958994D02*
D03*
Y4898996D02*
D03*
X1054100Y1793894D02*
D03*
Y4733896D02*
D03*
X6350000Y1958994D02*
D03*
Y4898996D02*
D03*
X1498600Y1793894D02*
D03*
Y4733896D02*
D03*
D38*
X3556000Y13322301D02*
D03*
X2794000D02*
D03*
X3556000Y14084300D02*
D03*
X2794000D02*
D03*
X11173844Y4513070D02*
D03*
X11178157Y3945126D02*
D03*
X2186554Y3932428D02*
D03*
X2182246Y4500372D02*
D03*
X5636646Y4513072D02*
D03*
X5640954Y3945128D02*
D03*
X3972946Y4513072D02*
D03*
X3977254Y3945128D02*
D03*
X9387454Y3945126D02*
D03*
X9383146Y4513070D02*
D03*
X12824843D02*
D03*
X12829156Y3945126D02*
D03*
X1651000Y13322301D02*
D03*
X889000D02*
D03*
X1651000Y14084300D02*
D03*
X889000D02*
D03*
D39*
X13944865Y1016000D02*
D03*
X7834861D02*
D03*
X6763400D02*
D03*
X653395D02*
D03*
D40*
X6800000Y3800000D02*
D03*
X14100000Y2000001D02*
D03*
X500000D02*
D03*
X14100000Y12500000D02*
D03*
X499999D02*
D03*
D41*
X7289800Y7607300D02*
D03*
X7045200D02*
D03*
X6720045Y7329645D02*
D03*
X7861300Y7073900D02*
D03*
X9131300Y7543800D02*
D03*
X8775700Y7280275D02*
D03*
X8940800Y7416800D02*
D03*
X9310845Y8675845D02*
D03*
X9423400Y9131300D02*
D03*
X9042400Y8445500D02*
D03*
X10931525Y8556625D02*
D03*
X8214687Y11861800D02*
D03*
X8191500Y8089900D02*
D03*
X6858000Y8743951D02*
D03*
X6680200Y8407400D02*
D03*
X7277100Y8128000D02*
D03*
X8362550Y9912750D02*
D03*
X8559800Y9702800D02*
D03*
X8172405Y10045700D02*
D03*
X7962900Y9732303D02*
D03*
X8048369Y7124700D02*
D03*
X6604000Y12702400D02*
D03*
X6781800Y6178553D02*
D03*
X7233920Y6451600D02*
D03*
X6477000Y6178553D02*
D03*
X6908800Y6451600D02*
D03*
X7391400Y5419696D02*
D03*
X6680200Y6051553D02*
D03*
X5803900Y8966200D02*
D03*
X5689600Y8763000D02*
D03*
X10490200Y9029700D02*
D03*
X11016200Y11226800D02*
D03*
X9956167Y6503035D02*
D03*
X8321675Y7400925D02*
D03*
X4140200Y9232900D02*
D03*
X4422775Y8988423D02*
D03*
X3873501Y9677400D02*
D03*
X8432800Y9001381D02*
D03*
X9652000Y9469120D02*
D03*
X9537700Y8870950D02*
D03*
X9829800Y9245600D02*
D03*
X9693592Y8553450D02*
D03*
X9944100Y8991600D02*
D03*
X9207500Y8853640D02*
D03*
X7962900Y8763000D02*
D03*
X11506200Y8608969D02*
D03*
X10731500Y8775700D02*
D03*
X10791662Y8229600D02*
D03*
X5613412Y5334000D02*
D03*
X8102600Y5537200D02*
D03*
X8001000Y5334000D02*
D03*
X7594600Y5295900D02*
D03*
X7861300Y5419696D02*
D03*
X7753347Y5588000D02*
D03*
X7585201Y5702300D02*
D03*
X7861300Y9271000D02*
D03*
X12306300Y2298700D02*
D03*
X11684000Y2120900D02*
D03*
X11671300Y2286000D02*
D03*
X10680700Y1841500D02*
D03*
X11442700Y2501900D02*
D03*
X4343400Y2019300D02*
D03*
X4445000Y2273300D02*
D03*
X4191000Y2511897D02*
D03*
X6800000Y5917240D02*
D03*
X12573000Y9525000D02*
D03*
X7861300Y6705600D02*
D03*
X5308601Y2108200D02*
D03*
X5508747Y8648700D02*
D03*
X4953000Y8280400D02*
D03*
X5305692Y8350365D02*
D03*
X5508747Y8352802D02*
D03*
X6832600Y7140890D02*
D03*
X11874500Y12420600D02*
D03*
X11988800Y12306300D02*
D03*
X12090400Y12192000D02*
D03*
X12217400Y11899900D02*
D03*
X10883900Y8921750D02*
D03*
X7302500Y12700000D02*
D03*
X6833725Y12317800D02*
D03*
X7112000Y12598400D02*
D03*
X6975000Y12471400D02*
D03*
X8774001Y10718800D02*
D03*
X5527796Y7416800D02*
D03*
X5892801Y7734300D02*
D03*
X12547600Y2679700D02*
D03*
X10998200Y8229600D02*
D03*
X7916704Y6231096D02*
D03*
X7846060Y6369050D02*
D03*
X11275000Y11300000D02*
D03*
X11760200Y9525000D02*
D03*
X11480800Y9220200D02*
D03*
X10972800Y9710200D02*
D03*
X7861300Y8352802D02*
D03*
X7583549Y8231249D02*
D03*
X7584819Y9001381D02*
D03*
X6629400Y9169400D02*
D03*
X4257676Y8550276D02*
D03*
X5108699Y8991599D02*
D03*
X5419411Y7273611D02*
D03*
X5062500Y7607300D02*
D03*
X4102100Y7461707D02*
D03*
Y7208200D02*
D03*
X4250000Y7033200D02*
D03*
X5407660Y6728460D02*
D03*
X5134101Y6861301D02*
D03*
X4337500Y5895700D02*
D03*
X4087500Y5945700D02*
D03*
X3925000Y5695700D02*
D03*
X4175000Y6233200D02*
D03*
X3972946Y6395700D02*
D03*
X4562500D02*
D03*
X5842000Y5803900D02*
D03*
X5702300Y6108700D02*
D03*
X5525000Y5820700D02*
D03*
X5105400Y6395720D02*
D03*
X5107940Y5707094D02*
D03*
X5359400Y5537200D02*
D03*
X5200000Y5558200D02*
D03*
X8191500Y7277100D02*
D03*
X7581900Y6845300D02*
D03*
X7584440Y7607300D02*
D03*
X6837500Y7483200D02*
D03*
X10947400Y5549900D02*
D03*
X10794263Y5333200D02*
D03*
X10668000Y5715000D02*
D03*
X10477500Y5702300D02*
D03*
X11023600Y5835653D02*
D03*
X10922000Y6002609D02*
D03*
X10791662Y6172200D02*
D03*
X10380980Y6499860D02*
D03*
X9194800Y5499100D02*
D03*
X9347200Y5397500D02*
D03*
X9568180Y5357146D02*
D03*
X9677400Y5842000D02*
D03*
X9520001Y6121400D02*
D03*
X9677400Y6375400D02*
D03*
X5207000Y1676196D02*
D03*
%TF.MD5,13fab12a5873c2ac6eb6f694b4390668*%
M02*
