%TF.GenerationSoftware,Altium Limited,Altium Designer,19.1.5 (86)*%
G04 Layer_Color=32896*
%FSLAX45Y45*%
%MOMM*%
%TF.FileFunction,Other,Mechanical_8*%
%TF.Part,Single*%
G01*
G75*
%TA.AperFunction,NonConductor*%
%ADD62C,0.10000*%
%ADD63C,0.05000*%
D62*
X10716000Y13589000D02*
G03*
X10716000Y13589000I-190000J0D01*
G01*
X10681000D02*
G03*
X10681000Y13589000I-155000J0D01*
G01*
X14048000D02*
G03*
X14048000Y13589000I-190000J0D01*
G01*
X14013000D02*
G03*
X14013000Y13589000I-155000J0D01*
G01*
X11313000Y13462000D02*
G03*
X11313000Y13462000I-80000J0D01*
G01*
X11278000D02*
G03*
X11278000Y13462000I-45000J0D01*
G01*
X11450000Y13716000D02*
G03*
X11450000Y13716000I-80000J0D01*
G01*
X11415000D02*
G03*
X11415000Y13716000I-45000J0D01*
G01*
X11587000Y13462000D02*
G03*
X11587000Y13462000I-80000J0D01*
G01*
X11552000D02*
G03*
X11552000Y13462000I-45000J0D01*
G01*
X11724000Y13716000D02*
G03*
X11724000Y13716000I-80000J0D01*
G01*
X11689000D02*
G03*
X11689000Y13716000I-45000J0D01*
G01*
X11861000Y13462000D02*
G03*
X11861000Y13462000I-80000J0D01*
G01*
X11826000D02*
G03*
X11826000Y13462000I-45000J0D01*
G01*
X11998000Y13716000D02*
G03*
X11998000Y13716000I-80000J0D01*
G01*
X11963000D02*
G03*
X11963000Y13716000I-45000J0D01*
G01*
X12135000Y13462000D02*
G03*
X12135000Y13462000I-80000J0D01*
G01*
X12100000D02*
G03*
X12100000Y13462000I-45000J0D01*
G01*
X12272000Y13716000D02*
G03*
X12272000Y13716000I-80000J0D01*
G01*
X12237000D02*
G03*
X12237000Y13716000I-45000J0D01*
G01*
X12409000Y13462000D02*
G03*
X12409000Y13462000I-80000J0D01*
G01*
X12374000D02*
G03*
X12374000Y13462000I-45000J0D01*
G01*
X12546000Y13716000D02*
G03*
X12546000Y13716000I-80000J0D01*
G01*
X12511000D02*
G03*
X12511000Y13716000I-45000J0D01*
G01*
X12683000Y13462000D02*
G03*
X12683000Y13462000I-80000J0D01*
G01*
X12648000D02*
G03*
X12648000Y13462000I-45000J0D01*
G01*
X12820000Y13716000D02*
G03*
X12820000Y13716000I-80000J0D01*
G01*
X12785000D02*
G03*
X12785000Y13716000I-45000J0D01*
G01*
X12957001Y13462000D02*
G03*
X12957001Y13462000I-80000J0D01*
G01*
X12922000D02*
G03*
X12922000Y13462000I-45000J0D01*
G01*
X13094000Y13716000D02*
G03*
X13094000Y13716000I-80000J0D01*
G01*
X13059000D02*
G03*
X13059000Y13716000I-45000J0D01*
G01*
X13231000Y13462000D02*
G03*
X13231000Y13462000I-80000J0D01*
G01*
X13196001D02*
G03*
X13196001Y13462000I-45000J0D01*
G01*
X3656000Y14084300D02*
G03*
X3656000Y14084300I-100000J0D01*
G01*
X3621000D02*
G03*
X3621000Y14084300I-65000J0D01*
G01*
X2894000D02*
G03*
X2894000Y14084300I-100000J0D01*
G01*
X2859000D02*
G03*
X2859000Y14084300I-65000J0D01*
G01*
X2894000Y13322301D02*
G03*
X2894000Y13322301I-100000J0D01*
G01*
X2859000D02*
G03*
X2859000Y13322301I-65000J0D01*
G01*
X3656000D02*
G03*
X3656000Y13322301I-100000J0D01*
G01*
X3621000D02*
G03*
X3621000Y13322301I-65000J0D01*
G01*
X1751000Y14084300D02*
G03*
X1751000Y14084300I-100000J0D01*
G01*
X1716000D02*
G03*
X1716000Y14084300I-65000J0D01*
G01*
X989000D02*
G03*
X989000Y14084300I-100000J0D01*
G01*
X954000D02*
G03*
X954000Y14084300I-65000J0D01*
G01*
X989000Y13322301D02*
G03*
X989000Y13322301I-100000J0D01*
G01*
X954000D02*
G03*
X954000Y13322301I-65000J0D01*
G01*
X1751000D02*
G03*
X1751000Y13322301I-100000J0D01*
G01*
X1716000D02*
G03*
X1716000Y13322301I-65000J0D01*
G01*
X10526000Y13588998D02*
Y13639000D01*
X10475998Y13588998D02*
X10526000D01*
Y13539001D02*
Y13588998D01*
X10575998D01*
X13857999D02*
Y13639000D01*
X13808000Y13588998D02*
X13857999D01*
Y13539001D02*
Y13588998D01*
X13908000D01*
X11232999Y13461998D02*
Y13512000D01*
X11183002Y13461998D02*
X11232999D01*
Y13412001D02*
Y13461998D01*
X11283002D01*
X11370002Y13715997D02*
Y13766000D01*
X11319999Y13715997D02*
X11370002D01*
Y13666000D02*
Y13715997D01*
X11419999D01*
X11506999Y13461998D02*
Y13512000D01*
X11457002Y13461998D02*
X11506999D01*
Y13412001D02*
Y13461998D01*
X11557002D01*
X11644002Y13715997D02*
Y13766000D01*
X11593999Y13715997D02*
X11644002D01*
Y13666000D02*
Y13715997D01*
X11693999D01*
X11780999Y13461998D02*
Y13512000D01*
X11731002Y13461998D02*
X11780999D01*
Y13412001D02*
Y13461998D01*
X11831001D01*
X11918002Y13715997D02*
Y13766000D01*
X11867999Y13715997D02*
X11918002D01*
Y13666000D02*
Y13715997D01*
X11967999D01*
X12054999Y13461998D02*
Y13512000D01*
X12005002Y13461998D02*
X12054999D01*
Y13412001D02*
Y13461998D01*
X12105001D01*
X12192002Y13715997D02*
Y13766000D01*
X12141999Y13715997D02*
X12192002D01*
Y13666000D02*
Y13715997D01*
X12241999D01*
X12328999Y13461998D02*
Y13512000D01*
X12279002Y13461998D02*
X12328999D01*
Y13412001D02*
Y13461998D01*
X12379001D01*
X12466001Y13715997D02*
Y13766000D01*
X12415999Y13715997D02*
X12466001D01*
Y13666000D02*
Y13715997D01*
X12515999D01*
X12602999Y13461998D02*
Y13512000D01*
X12553002Y13461998D02*
X12602999D01*
Y13412001D02*
Y13461998D01*
X12653001D01*
X12740001Y13715997D02*
Y13766000D01*
X12689999Y13715997D02*
X12740001D01*
Y13666000D02*
Y13715997D01*
X12789999D01*
X12876999Y13461998D02*
Y13512000D01*
X12827002Y13461998D02*
X12876999D01*
Y13412001D02*
Y13461998D01*
X12927000D01*
X13014001Y13715997D02*
Y13766000D01*
X12963998Y13715997D02*
X13014001D01*
Y13666000D02*
Y13715997D01*
X13063998D01*
X13150999Y13461998D02*
Y13512000D01*
X13101001Y13461998D02*
X13150999D01*
Y13412001D02*
Y13461998D01*
X13201001D01*
X12192002Y13588998D02*
Y13639000D01*
X12141999Y13588998D02*
X12192002D01*
Y13539001D02*
Y13588998D01*
X12241999D01*
X7012000Y13589000D02*
X7112000D01*
X7212000D01*
X7112000D02*
Y13689000D01*
Y13489000D02*
Y13589000D01*
X7012000D02*
X7112000D01*
X7212000D01*
X7112000D02*
Y13689000D01*
Y13489000D02*
Y13589000D01*
X4661999D02*
X4761999D01*
X4861999D01*
X4761999D02*
Y13689000D01*
Y13489000D02*
Y13589000D01*
X9362001D02*
X9462001D01*
X9562001D01*
X9462001D02*
Y13689000D01*
Y13489000D02*
Y13589000D01*
X8674001Y13462000D02*
X8774001D01*
X8874001D01*
X8774001D02*
Y13562000D01*
Y13362000D02*
Y13462000D01*
X8397001D02*
X8497001D01*
X8597001D01*
X8497001D02*
Y13562000D01*
Y13362000D02*
Y13462000D01*
X8120001D02*
X8220001D01*
X8320001D01*
X8220001D02*
Y13562000D01*
Y13362000D02*
Y13462000D01*
X7843000D02*
X7943000D01*
X8043000D01*
X7943000D02*
Y13562000D01*
Y13362000D02*
Y13462000D01*
X7566000D02*
X7666000D01*
X7766000D01*
X7666000D02*
Y13562000D01*
Y13362000D02*
Y13462000D01*
X7289000D02*
X7389000D01*
X7489000D01*
X7389000D02*
Y13562000D01*
Y13362000D02*
Y13462000D01*
X7012000D02*
X7112000D01*
X7212000D01*
X7112000D02*
Y13562000D01*
Y13362000D02*
Y13462000D01*
X6735000D02*
X6835000D01*
X6935000D01*
X6835000D02*
Y13562000D01*
Y13362000D02*
Y13462000D01*
X6458000D02*
X6558000D01*
X6658000D01*
X6558000D02*
Y13562000D01*
Y13362000D02*
Y13462000D01*
X6181000D02*
X6281000D01*
X6381000D01*
X6281000D02*
Y13562000D01*
Y13362000D02*
Y13462000D01*
X5903999D02*
X6003999D01*
X6103999D01*
X6003999D02*
Y13562000D01*
Y13362000D02*
Y13462000D01*
X5626999D02*
X5726999D01*
X5826999D01*
X5726999D02*
Y13562000D01*
Y13362000D02*
Y13462000D01*
X5489999Y13716000D02*
X5589999D01*
X5689999D01*
X5589999D02*
Y13816000D01*
Y13616000D02*
Y13716000D01*
X5766999D02*
X5866999D01*
X5966999D01*
X5866999D02*
Y13816000D01*
Y13616000D02*
Y13716000D01*
X6043999D02*
X6143999D01*
X6243999D01*
X6143999D02*
Y13816000D01*
Y13616000D02*
Y13716000D01*
X6321000D02*
X6421000D01*
X6521000D01*
X6421000D02*
Y13816000D01*
Y13616000D02*
Y13716000D01*
X6598000D02*
X6698000D01*
X6798000D01*
X6698000D02*
Y13816000D01*
Y13616000D02*
Y13716000D01*
X6875000D02*
X6975000D01*
X7075000D01*
X6975000D02*
Y13816000D01*
Y13616000D02*
Y13716000D01*
X7152000D02*
X7252000D01*
X7352000D01*
X7252000D02*
Y13816000D01*
Y13616000D02*
Y13716000D01*
X7429000D02*
X7529000D01*
X7629000D01*
X7529000D02*
Y13816000D01*
Y13616000D02*
Y13716000D01*
X7706000D02*
X7806000D01*
X7906000D01*
X7806000D02*
Y13816000D01*
Y13616000D02*
Y13716000D01*
X7983001D02*
X8083001D01*
X8183001D01*
X8083001D02*
Y13816000D01*
Y13616000D02*
Y13716000D01*
X8260000D02*
X8360001D01*
X8460001D01*
X8360001D02*
Y13816000D01*
Y13616000D02*
Y13716000D01*
X8537001D02*
X8637001D01*
X8737001D01*
X8637001D02*
Y13816000D01*
Y13616000D02*
Y13716000D01*
X5349999Y13462000D02*
X5449999D01*
X5549999D01*
X5449999D02*
Y13562000D01*
Y13362000D02*
Y13462000D01*
X4401999Y13246001D02*
Y14506000D01*
Y13246001D02*
X5121999D01*
Y14506000D01*
X4401999D02*
X5121999D01*
X9102001Y13246001D02*
Y14506000D01*
Y13246001D02*
X9822001D01*
Y14506000D01*
X9102001D02*
X9822001D01*
X8318500Y1908994D02*
Y1958994D01*
X8368500D01*
X8268500D02*
X8318500D01*
Y2008994D01*
Y4898996D02*
Y4948996D01*
Y4898996D02*
X8368500D01*
X8268500D02*
X8318500D01*
Y4848996D02*
Y4898996D01*
Y3428995D02*
Y3478995D01*
Y3428995D02*
X8368500D01*
X8268500D02*
X8318500D01*
Y3378995D02*
Y3428995D01*
X7250000Y12433400D02*
Y12509400D01*
X7990000Y12433400D02*
Y12509400D01*
X7865000Y12433400D02*
Y12509400D01*
X7990000D01*
X7375000Y12433400D02*
Y12509400D01*
X7250000D02*
X7375000D01*
X7865000Y12433400D02*
X7990000D01*
X7250000D02*
X7375000D01*
X7877500Y12471400D02*
X7927500D01*
Y12421400D02*
Y12471400D01*
X7977500D01*
X7927500D02*
Y12521400D01*
X7262500Y12471400D02*
X7312500D01*
Y12421400D02*
Y12471400D01*
X7362500D01*
X7312500D02*
Y12521400D01*
X7250000Y12306400D02*
Y12382400D01*
X7990000Y12306400D02*
Y12382400D01*
X7865000Y12306400D02*
Y12382400D01*
X7990000D01*
X7375000Y12306400D02*
Y12382400D01*
X7250000D02*
X7375000D01*
X7865000Y12306400D02*
X7990000D01*
X7250000D02*
X7375000D01*
X7877500Y12344400D02*
X7927500D01*
Y12294400D02*
Y12344400D01*
X7977500D01*
X7927500D02*
Y12394400D01*
X7262500Y12344400D02*
X7312500D01*
Y12294400D02*
Y12344400D01*
X7362500D01*
X7312500D02*
Y12394400D01*
X7250000Y12179400D02*
Y12255400D01*
X7990000Y12179400D02*
Y12255400D01*
X7865000Y12179400D02*
Y12255400D01*
X7990000D01*
X7375000Y12179400D02*
Y12255400D01*
X7250000D02*
X7375000D01*
X7865000Y12179400D02*
X7990000D01*
X7250000D02*
X7375000D01*
X7877500Y12217400D02*
X7927500D01*
Y12167400D02*
Y12217400D01*
X7977500D01*
X7927500D02*
Y12267400D01*
X7262500Y12217400D02*
X7312500D01*
Y12167400D02*
Y12217400D01*
X7362500D01*
X7312500D02*
Y12267400D01*
X7250000Y12052400D02*
Y12128400D01*
X7990000Y12052400D02*
Y12128400D01*
X7865000Y12052400D02*
Y12128400D01*
X7990000D01*
X7375000Y12052400D02*
Y12128400D01*
X7250000D02*
X7375000D01*
X7865000Y12052400D02*
X7990000D01*
X7250000D02*
X7375000D01*
X7877500Y12090400D02*
X7927500D01*
Y12040400D02*
Y12090400D01*
X7977500D01*
X7927500D02*
Y12140400D01*
X7262500Y12090400D02*
X7312500D01*
Y12040400D02*
Y12090400D01*
X7362500D01*
X7312500D02*
Y12140400D01*
X7250000Y11925400D02*
Y12001400D01*
X7990000Y11925400D02*
Y12001400D01*
X7865000Y11925400D02*
Y12001400D01*
X7990000D01*
X7375000Y11925400D02*
Y12001400D01*
X7250000D02*
X7375000D01*
X7865000Y11925400D02*
X7990000D01*
X7250000D02*
X7375000D01*
X7877500Y11963400D02*
X7927500D01*
Y11913400D02*
Y11963400D01*
X7977500D01*
X7927500D02*
Y12013400D01*
X7262500Y11963400D02*
X7312500D01*
Y11913400D02*
Y11963400D01*
X7362500D01*
X7312500D02*
Y12013400D01*
X7250000Y11798400D02*
Y11874400D01*
X7990000Y11798400D02*
Y11874400D01*
X7865000Y11798400D02*
Y11874400D01*
X7990000D01*
X7375000Y11798400D02*
Y11874400D01*
X7250000D02*
X7375000D01*
X7865000Y11798400D02*
X7990000D01*
X7250000D02*
X7375000D01*
X7877500Y11836400D02*
X7927500D01*
Y11786400D02*
Y11836400D01*
X7977500D01*
X7927500D02*
Y11886400D01*
X7262500Y11836400D02*
X7312500D01*
Y11786400D02*
Y11836400D01*
X7362500D01*
X7312500D02*
Y11886400D01*
X7620000Y12153900D02*
X7670000D01*
X7620000D02*
Y12203900D01*
X7570000Y12153900D02*
X7620000D01*
Y12103900D02*
Y12153900D01*
X7927500Y12421400D02*
Y12471400D01*
X7877500D02*
X7927500D01*
Y12521400D01*
Y12471400D02*
X7977500D01*
X7312500Y12421400D02*
Y12471400D01*
X7262500D02*
X7312500D01*
Y12521400D01*
Y12471400D02*
X7362500D01*
X7865000Y12509400D02*
X7990000D01*
X7250000D02*
X7375000D01*
X7865000Y12433400D02*
X7990000D01*
X7865000Y12509400D02*
X7865000Y12433400D01*
X7250000D02*
X7375000D01*
X7375000Y12509400D01*
X7250000Y12433400D02*
Y12509400D01*
X7990000Y12433400D02*
Y12509400D01*
X7927500Y12344400D02*
X7927500Y12294400D01*
X7877500Y12344400D02*
X7927500D01*
X7927500Y12394400D01*
X7927500Y12344400D02*
X7977500D01*
X7312500Y12294400D02*
X7312500Y12344400D01*
X7262500D02*
X7312500D01*
X7312500Y12394400D02*
X7312500Y12344400D01*
X7362500D01*
X7865000Y12382400D02*
X7990000D01*
X7250000D02*
X7375000D01*
X7865000Y12306400D02*
X7990000D01*
X7865000D02*
Y12382400D01*
X7250000Y12306400D02*
X7375000D01*
Y12382400D01*
X7250000Y12306400D02*
Y12382400D01*
X7990000Y12306400D02*
Y12382400D01*
X7927500Y12167400D02*
Y12217400D01*
X7877500D02*
X7927500D01*
Y12267400D01*
Y12217400D02*
X7977500D01*
X7312500Y12167400D02*
Y12217400D01*
X7262500D02*
X7312500D01*
Y12267400D01*
Y12217400D02*
X7362500D01*
X7865000Y12255400D02*
X7990000D01*
X7250000D02*
X7375000D01*
X7865000Y12179400D02*
X7990000D01*
X7865000D02*
Y12255400D01*
X7250000Y12179400D02*
X7375000D01*
Y12255400D01*
X7250000Y12179400D02*
Y12255400D01*
X7990000Y12179400D02*
Y12255400D01*
X7927500Y12040400D02*
Y12090400D01*
X7877500D02*
X7927500D01*
Y12140400D01*
Y12090400D02*
X7977500D01*
X7312500Y12040400D02*
Y12090400D01*
X7262500D02*
X7312500D01*
Y12140400D01*
Y12090400D02*
X7362500D01*
X7865000Y12128400D02*
X7990000D01*
X7250000D02*
X7375000D01*
X7865000Y12052400D02*
X7990000D01*
X7865000D02*
Y12128400D01*
X7250000Y12052400D02*
X7375000D01*
Y12128400D01*
X7250000Y12052400D02*
Y12128400D01*
X7990000Y12052400D02*
Y12128400D01*
X7927500Y11963400D02*
X7927500Y11913400D01*
X7877500Y11963400D02*
X7927500D01*
X7927500Y12013400D01*
X7927500Y11963400D02*
X7977500D01*
X7312500Y11913400D02*
X7312500Y11963400D01*
X7262500D02*
X7312500D01*
X7312500Y12013400D02*
X7312500Y11963400D01*
X7362500D01*
X7865000Y12001400D02*
X7990000D01*
X7250000D02*
X7375000D01*
X7865000Y11925400D02*
X7990000D01*
X7865000D02*
Y12001400D01*
X7250000Y11925400D02*
X7375000D01*
Y12001400D01*
X7250000Y11925400D02*
Y12001400D01*
X7990000Y11925400D02*
Y12001400D01*
X7927500Y11786400D02*
Y11836400D01*
X7877500D02*
X7927500D01*
Y11886400D01*
Y11836400D02*
X7977500D01*
X7312500Y11786400D02*
Y11836400D01*
X7262500D02*
X7312500D01*
Y11886400D01*
Y11836400D02*
X7362500D01*
X7865000Y11874400D02*
X7990000D01*
X7250000D02*
X7375000D01*
X7865000Y11798400D02*
X7990000D01*
X7865000D02*
X7865000Y11874400D01*
X7250000Y11798400D02*
X7375000D01*
X7375000Y11874400D02*
X7375000Y11798400D01*
X7250000D02*
Y11874400D01*
X7990000Y11798400D02*
Y11874400D01*
X7620000Y12103900D02*
Y12153900D01*
X7570000D02*
X7620000D01*
Y12203900D01*
Y12153900D02*
X7670000D01*
X13525500Y1908994D02*
Y1958994D01*
X13575500D01*
X13475500D02*
X13525500D01*
Y2008994D01*
Y4898996D02*
Y4948996D01*
Y4898996D02*
X13575500D01*
X13475500D02*
X13525500D01*
Y4848996D02*
Y4898996D01*
Y3428995D02*
Y3478995D01*
Y3428995D02*
X13575500D01*
X13475500D02*
X13525500D01*
Y3378995D02*
Y3428995D01*
X8839200Y1908994D02*
Y1958994D01*
X8889200D01*
X8789200D02*
X8839200D01*
Y2008994D01*
Y4898996D02*
Y4948996D01*
Y4898996D02*
X8889200D01*
X8789200D02*
X8839200D01*
Y4848996D02*
Y4898996D01*
Y3428995D02*
Y3478995D01*
Y3428995D02*
X8889200D01*
X8789200D02*
X8839200D01*
Y3378995D02*
Y3428995D01*
X1054100Y1743894D02*
Y1793894D01*
X1104100D01*
X1004100D02*
X1054100D01*
Y1843894D01*
Y4733896D02*
Y4783896D01*
Y4733896D02*
X1104100D01*
X1004100D02*
X1054100D01*
Y4683896D02*
Y4733896D01*
Y3263895D02*
Y3313895D01*
Y3263895D02*
X1104100D01*
X1004100D02*
X1054100D01*
Y3213895D02*
Y3263895D01*
X6350000Y1908994D02*
Y1958994D01*
X6400000D01*
X6300000D02*
X6350000D01*
Y2008994D01*
Y4898996D02*
Y4948996D01*
Y4898996D02*
X6400000D01*
X6300000D02*
X6350000D01*
Y4848996D02*
Y4898996D01*
Y3428995D02*
Y3478995D01*
Y3428995D02*
X6400000D01*
X6300000D02*
X6350000D01*
Y3378995D02*
Y3428995D01*
X1498600Y1743894D02*
Y1793894D01*
X1548600D01*
X1448600D02*
X1498600D01*
Y1843894D01*
Y4733896D02*
Y4783896D01*
Y4733896D02*
X1548600D01*
X1448600D02*
X1498600D01*
Y4683896D02*
Y4733896D01*
Y3263895D02*
Y3313895D01*
Y3263895D02*
X1548600D01*
X1448600D02*
X1498600D01*
Y3213895D02*
Y3263895D01*
X12268302Y3189402D02*
X12344298D01*
X12268302Y2449398D02*
X12344298D01*
X12268302Y2574402D02*
X12344298D01*
Y2449398D02*
Y2574402D01*
X12268302Y3064398D02*
X12344298D01*
Y3189402D01*
X12268302Y2449398D02*
Y2574402D01*
Y3064398D02*
Y3189402D01*
X12306300Y2511903D02*
Y2561900D01*
X12256303Y2511903D02*
X12306300D01*
Y2461900D02*
Y2511903D01*
X12356302D01*
X12306300Y3126903D02*
Y3176900D01*
X12256303Y3126903D02*
X12306300D01*
Y3076900D02*
Y3126903D01*
X12356302D01*
X12141302Y3189402D02*
X12217298D01*
X12141302Y2449398D02*
X12217298D01*
X12141302Y2574402D02*
X12217298D01*
Y2449398D02*
Y2574402D01*
X12141302Y3064398D02*
X12217298D01*
Y3189402D01*
X12141302Y2449398D02*
Y2574402D01*
Y3064398D02*
Y3189402D01*
X12179300Y2511903D02*
Y2561900D01*
X12129303Y2511903D02*
X12179300D01*
Y2461900D02*
Y2511903D01*
X12229302D01*
X12179300Y3126903D02*
Y3176900D01*
X12129303Y3126903D02*
X12179300D01*
Y3076900D02*
Y3126903D01*
X12229302D01*
X12014302Y3189402D02*
X12090298D01*
X12014302Y2449398D02*
X12090298D01*
X12014302Y2574402D02*
X12090298D01*
Y2449398D02*
Y2574402D01*
X12014302Y3064398D02*
X12090298D01*
Y3189402D01*
X12014302Y2449398D02*
Y2574402D01*
Y3064398D02*
Y3189402D01*
X12052300Y2511903D02*
Y2561900D01*
X12002303Y2511903D02*
X12052300D01*
Y2461900D02*
Y2511903D01*
X12102302D01*
X12052300Y3126903D02*
Y3176900D01*
X12002303Y3126903D02*
X12052300D01*
Y3076900D02*
Y3126903D01*
X12102302D01*
X11887302Y3189402D02*
X11963298D01*
X11887302Y2449398D02*
X11963298D01*
X11887302Y2574402D02*
X11963298D01*
Y2449398D02*
Y2574402D01*
X11887302Y3064398D02*
X11963298D01*
Y3189402D01*
X11887302Y2449398D02*
Y2574402D01*
Y3064398D02*
Y3189402D01*
X11925300Y2511903D02*
Y2561900D01*
X11875303Y2511903D02*
X11925300D01*
Y2461900D02*
Y2511903D01*
X11975302D01*
X11925300Y3126903D02*
Y3176900D01*
X11875303Y3126903D02*
X11925300D01*
Y3076900D02*
Y3126903D01*
X11975302D01*
X11760302Y3189402D02*
X11836298D01*
X11760302Y2449398D02*
X11836298D01*
X11760302Y2574402D02*
X11836298D01*
Y2449398D02*
Y2574402D01*
X11760302Y3064398D02*
X11836298D01*
Y3189402D01*
X11760302Y2449398D02*
Y2574402D01*
Y3064398D02*
Y3189402D01*
X11798300Y2511903D02*
Y2561900D01*
X11748303Y2511903D02*
X11798300D01*
Y2461900D02*
Y2511903D01*
X11848302D01*
X11798300Y3126903D02*
Y3176900D01*
X11748303Y3126903D02*
X11798300D01*
Y3076900D02*
Y3126903D01*
X11848302D01*
X11633302Y3189402D02*
X11709298D01*
X11633302Y2449398D02*
X11709298D01*
X11633302Y2574402D02*
X11709298D01*
Y2449398D02*
Y2574402D01*
X11633302Y3064398D02*
X11709298D01*
Y3189402D01*
X11633302Y2449398D02*
Y2574402D01*
Y3064398D02*
Y3189402D01*
X11671300Y2511903D02*
Y2561900D01*
X11621303Y2511903D02*
X11671300D01*
Y2461900D02*
Y2511903D01*
X11721302D01*
X11671300Y3126903D02*
Y3176900D01*
X11621303Y3126903D02*
X11671300D01*
Y3076900D02*
Y3126903D01*
X11721302D01*
X11988800Y2769403D02*
Y2819400D01*
X12038802D01*
X11988800D02*
Y2869402D01*
X11938803Y2819400D02*
X11988800D01*
X12256303Y2511897D02*
X12306300D01*
Y2561900D01*
Y2511897D02*
X12356302D01*
X12306300Y2461900D02*
Y2511897D01*
X12256303Y3126903D02*
X12306300D01*
Y3176900D01*
Y3126903D02*
X12356302D01*
X12306300Y3076900D02*
Y3126903D01*
X12344298Y2449398D02*
Y2574402D01*
Y3064398D02*
Y3189402D01*
X12268302Y2449398D02*
Y2574402D01*
X12344298D01*
X12268302Y3064398D02*
Y3189402D01*
Y3064398D02*
X12344298D01*
X12268302Y3189402D02*
X12344298D01*
X12268302Y2449398D02*
X12344298D01*
X12129303Y2511897D02*
X12179300Y2511903D01*
Y2561900D01*
Y2511903D02*
X12229302Y2511897D01*
X12179300Y2461900D02*
Y2511903D01*
X12129303Y3126903D02*
X12179300D01*
Y3176900D01*
Y3126903D02*
X12229302D01*
X12179300Y3076900D02*
Y3126903D01*
X12217298Y2449398D02*
Y2574402D01*
Y3064398D02*
Y3189402D01*
X12141302Y2449398D02*
Y2574402D01*
X12217298D01*
X12141302Y3064398D02*
Y3189402D01*
Y3064398D02*
X12217298D01*
X12141302Y3189402D02*
X12217298D01*
X12141302Y2449398D02*
X12217298D01*
X12002303Y2511897D02*
X12052300D01*
Y2561900D01*
Y2511897D02*
X12102302D01*
X12052300Y2461900D02*
Y2511897D01*
X12002303Y3126903D02*
X12052300D01*
Y3176900D01*
Y3126903D02*
X12102302D01*
X12052300Y3076900D02*
Y3126903D01*
X12090298Y2449398D02*
Y2574402D01*
Y3064398D02*
Y3189402D01*
X12014302Y2449398D02*
Y2574402D01*
X12090298D01*
X12014302Y3064398D02*
Y3189402D01*
Y3064398D02*
X12090298D01*
X12014302Y3189402D02*
X12090298D01*
X12014302Y2449398D02*
X12090298D01*
X11875298Y2511897D02*
X11925300D01*
Y2561900D01*
Y2511897D02*
X11975302D01*
X11925300Y2461900D02*
Y2511897D01*
X11875298Y3126903D02*
X11925300D01*
Y3176900D01*
Y3126903D02*
X11975302D01*
X11925300Y3076900D02*
Y3126903D01*
X11963298Y2449398D02*
Y2574402D01*
Y3064398D02*
Y3189402D01*
X11887302Y2449398D02*
Y2574402D01*
X11963298D01*
X11887302Y3064398D02*
Y3189402D01*
Y3064398D02*
X11963298D01*
X11887302Y3189402D02*
X11963298D01*
X11887302Y2449398D02*
X11963298D01*
X11748298Y2511897D02*
X11798300Y2511903D01*
Y2561900D01*
Y2511903D02*
X11848297Y2511897D01*
X11798300Y2461900D02*
Y2511903D01*
X11748298Y3126903D02*
X11798300D01*
Y3176900D01*
Y3126903D02*
X11848297D01*
X11798300Y3076900D02*
Y3126903D01*
X11836298Y2449398D02*
Y2574402D01*
Y3064398D02*
Y3189402D01*
X11760302Y2449398D02*
Y2574402D01*
X11836298D01*
X11760302Y3064398D02*
Y3189402D01*
Y3064398D02*
X11836298D01*
X11760302Y3189402D02*
X11836298D01*
X11760302Y2449398D02*
X11836298D01*
X11621298Y2511897D02*
X11671300D01*
Y2561900D01*
Y2511897D02*
X11721302D01*
X11671300Y2461900D02*
Y2511897D01*
X11621298Y3126903D02*
X11671300D01*
Y3176900D01*
Y3126903D02*
X11721302D01*
X11671300Y3076900D02*
Y3126903D01*
X11709298Y2449398D02*
Y2574402D01*
Y3064398D02*
Y3189402D01*
X11633302Y2449398D02*
Y2574402D01*
X11709298D01*
X11633302Y3064398D02*
Y3189402D01*
Y3064398D02*
X11709298D01*
X11633302Y3189402D02*
X11709298D01*
X11633302Y2449398D02*
X11709298D01*
X11938798Y2819400D02*
X11988800D01*
Y2869402D01*
Y2819400D02*
X12038802D01*
X11988800Y2769398D02*
Y2819400D01*
X2794000Y14084300D02*
X2844000D01*
X2794000D02*
Y14134300D01*
X2744000Y14084300D02*
X2794000D01*
Y14034300D02*
Y14084300D01*
X3556000D02*
X3606000D01*
X3556000D02*
Y14134300D01*
X3506000Y14084300D02*
X3556000D01*
Y14034300D02*
Y14084300D01*
X2794000Y13322301D02*
X2844000D01*
X2794000D02*
Y13372301D01*
X2744000Y13322301D02*
X2794000D01*
Y13272301D02*
Y13322301D01*
X3556000D02*
X3606000D01*
X3556000D02*
Y13372301D01*
X3506000Y13322301D02*
X3556000D01*
Y13272301D02*
Y13322301D01*
X3175000Y13703300D02*
X3225000D01*
X3175000D02*
Y13753300D01*
X3125000Y13703300D02*
X3175000D01*
Y13653300D02*
Y13703300D01*
X8681859Y1270000D02*
X8731862D01*
X8681859D02*
Y1320002D01*
X8631862Y1270000D02*
X8681859D01*
Y1220003D02*
Y1270000D01*
Y762000D02*
X8731862D01*
X8681859D02*
Y812002D01*
X8631862Y762000D02*
X8681859D01*
Y711998D02*
Y762000D01*
X8957861Y1270000D02*
X9007863D01*
X8957861D02*
Y1320002D01*
X8907864Y1270000D02*
X8957861D01*
Y1220003D02*
Y1270000D01*
X9233862D02*
X9283860D01*
X9233862D02*
Y1320002D01*
X9183860Y1270000D02*
X9233862D01*
Y1220003D02*
Y1270000D01*
X9509864D02*
X9559861D01*
X9509864D02*
Y1320002D01*
X9459861Y1270000D02*
X9509864D01*
Y1220003D02*
Y1270000D01*
X9785860D02*
X9835863D01*
X9785860D02*
Y1320002D01*
X9735863Y1270000D02*
X9785860D01*
Y1220003D02*
Y1270000D01*
X10061862D02*
X10111864D01*
X10061862D02*
Y1320002D01*
X10011864Y1270000D02*
X10061862D01*
Y1220003D02*
Y1270000D01*
X10337863D02*
X10387861D01*
X10337863D02*
Y1320002D01*
X10287861Y1270000D02*
X10337863D01*
Y1220003D02*
Y1270000D01*
X10613865D02*
X10663862D01*
X10613865D02*
Y1320002D01*
X10563862Y1270000D02*
X10613865D01*
Y1220003D02*
Y1270000D01*
X10889861D02*
X10939864D01*
X10889861D02*
Y1320002D01*
X10839864Y1270000D02*
X10889861D01*
Y1220003D02*
Y1270000D01*
X11165863D02*
X11215865D01*
X11165863D02*
Y1320002D01*
X11115865Y1270000D02*
X11165863D01*
Y1220003D02*
Y1270000D01*
X11441864D02*
X11491861D01*
X11441864D02*
Y1320002D01*
X11391862Y1270000D02*
X11441864D01*
Y1220003D02*
Y1270000D01*
X11717866D02*
X11767863D01*
X11717866D02*
Y1320002D01*
X11667863Y1270000D02*
X11717866D01*
Y1220003D02*
Y1270000D01*
X11993862D02*
X12043864D01*
X11993862D02*
Y1320002D01*
X11943865Y1270000D02*
X11993862D01*
Y1220003D02*
Y1270000D01*
X12269863D02*
X12319866D01*
X12269863D02*
Y1320002D01*
X12219861Y1270000D02*
X12269863D01*
Y1220003D02*
Y1270000D01*
X12545865D02*
X12595862D01*
X12545865D02*
Y1320002D01*
X12495862Y1270000D02*
X12545865D01*
Y1220003D02*
Y1270000D01*
X12821861D02*
X12871864D01*
X12821861D02*
Y1320002D01*
X12771864Y1270000D02*
X12821861D01*
Y1220003D02*
Y1270000D01*
X13097862D02*
X13147865D01*
X13097862D02*
Y1320002D01*
X13047865Y1270000D02*
X13097862D01*
Y1220003D02*
Y1270000D01*
X8957861Y762000D02*
X9007863D01*
X8957861D02*
Y812002D01*
X8907864Y762000D02*
X8957861D01*
Y711998D02*
Y762000D01*
X9233862D02*
X9283860D01*
X9233862D02*
Y812002D01*
X9183860Y762000D02*
X9233862D01*
Y711998D02*
Y762000D01*
X9509864D02*
X9559861D01*
X9509864D02*
Y812002D01*
X9459861Y762000D02*
X9509864D01*
Y711998D02*
Y762000D01*
X9785860D02*
X9835863D01*
X9785860D02*
Y812002D01*
X9735863Y762000D02*
X9785860D01*
Y711998D02*
Y762000D01*
X10061862D02*
X10111864D01*
X10061862D02*
Y812002D01*
X10011864Y762000D02*
X10061862D01*
Y711998D02*
Y762000D01*
X10337863D02*
X10387861D01*
X10337863D02*
Y812002D01*
X10287861Y762000D02*
X10337863D01*
Y711998D02*
Y762000D01*
X10613865D02*
X10663862D01*
X10613865D02*
Y812002D01*
X10563862Y762000D02*
X10613865D01*
Y711998D02*
Y762000D01*
X10889861D02*
X10939864D01*
X10889861D02*
Y812002D01*
X10839864Y762000D02*
X10889861D01*
Y711998D02*
Y762000D01*
X11165863D02*
X11215865D01*
X11165863D02*
Y812002D01*
X11115865Y762000D02*
X11165863D01*
Y711998D02*
Y762000D01*
X11441864D02*
X11491861D01*
X11441864D02*
Y812002D01*
X11391862Y762000D02*
X11441864D01*
Y711998D02*
Y762000D01*
X11717866D02*
X11767863D01*
X11717866D02*
Y812002D01*
X11667863Y762000D02*
X11717866D01*
Y711998D02*
Y762000D01*
X11993862D02*
X12043864D01*
X11993862D02*
Y812002D01*
X11943865Y762000D02*
X11993862D01*
Y711998D02*
Y762000D01*
X12269863D02*
X12319866D01*
X12269863D02*
Y812002D01*
X12219861Y762000D02*
X12269863D01*
Y711998D02*
Y762000D01*
X12545865D02*
X12595862D01*
X12545865D02*
Y812002D01*
X12495862Y762000D02*
X12545865D01*
Y711998D02*
Y762000D01*
X12821861D02*
X12871864D01*
X12821861D02*
Y812002D01*
X12771864Y762000D02*
X12821861D01*
Y711998D02*
Y762000D01*
X13097862D02*
X13147865D01*
X13097862D02*
Y812002D01*
X13047865Y762000D02*
X13097862D01*
Y711998D02*
Y762000D01*
X8819863Y1016000D02*
X8869860D01*
X8819863D02*
Y1066002D01*
X8769860Y1016000D02*
X8819863D01*
Y965998D02*
Y1016000D01*
X9095864D02*
X9145862D01*
X9095864D02*
Y1066002D01*
X9045862Y1016000D02*
X9095864D01*
Y965998D02*
Y1016000D01*
X9371861D02*
X9421863D01*
X9371861D02*
Y1066002D01*
X9321863Y1016000D02*
X9371861D01*
Y965998D02*
Y1016000D01*
X9647862D02*
X9697865D01*
X9647862D02*
Y1066002D01*
X9597860Y1016000D02*
X9647862D01*
Y965998D02*
Y1016000D01*
X9923864D02*
X9973861D01*
X9923864D02*
Y1066002D01*
X9873861Y1016000D02*
X9923864D01*
Y965998D02*
Y1016000D01*
X10199860D02*
X10249862D01*
X10199860D02*
Y1066002D01*
X10149863Y1016000D02*
X10199860D01*
Y965998D02*
Y1016000D01*
X10475861D02*
X10525864D01*
X10475861D02*
Y1066002D01*
X10425864Y1016000D02*
X10475861D01*
Y965998D02*
Y1016000D01*
X10751863D02*
X10801860D01*
X10751863D02*
Y1066002D01*
X10701860Y1016000D02*
X10751863D01*
Y965998D02*
Y1016000D01*
X11027864D02*
X11077862D01*
X11027864D02*
Y1066002D01*
X10977862Y1016000D02*
X11027864D01*
Y965998D02*
Y1016000D01*
X11303861D02*
X11353863D01*
X11303861D02*
Y1066002D01*
X11253863Y1016000D02*
X11303861D01*
Y965998D02*
Y1016000D01*
X11579862D02*
X11629865D01*
X11579862D02*
Y1066002D01*
X11529865Y1016000D02*
X11579862D01*
Y965998D02*
Y1016000D01*
X11855864D02*
X11905861D01*
X11855864D02*
Y1066002D01*
X11805861Y1016000D02*
X11855864D01*
Y965998D02*
Y1016000D01*
X12131865D02*
X12181863D01*
X12131865D02*
Y1066002D01*
X12081863Y1016000D02*
X12131865D01*
Y965998D02*
Y1016000D01*
X12407862D02*
X12457864D01*
X12407862D02*
Y1066002D01*
X12357864Y1016000D02*
X12407862D01*
Y965998D02*
Y1016000D01*
X12683863D02*
X12733866D01*
X12683863D02*
Y1066002D01*
X12633866Y1016000D02*
X12683863D01*
Y965998D02*
Y1016000D01*
X12959865D02*
X13009862D01*
X12959865D02*
Y1066002D01*
X12909862Y1016000D02*
X12959865D01*
Y965998D02*
Y1016000D01*
X7834861D02*
X7884863D01*
X7834861D02*
Y1066002D01*
X7784864Y1016000D02*
X7834861D01*
Y965998D02*
Y1016000D01*
X13944865D02*
X13994864D01*
X13944865D02*
Y1066002D01*
X13894864Y1016000D02*
X13944865D01*
Y965998D02*
Y1016000D01*
X10889861D02*
X10925218Y1051357D01*
X10854509D02*
X10889861Y1016000D01*
X10854509Y980643D02*
X10889861Y1016000D01*
X10925218Y980643D01*
X11089054Y3899726D02*
X11178157Y3945126D01*
X11267255Y3990526D01*
X11178157Y3945126D02*
X11223557Y3856028D01*
X11132757Y4034229D02*
X11178157Y3945126D01*
X11084746Y4467675D02*
X11173844Y4513070D01*
X11262947Y4558470D01*
X11173844Y4513070D02*
X11219244Y4423972D01*
X11128444Y4602173D02*
X11173844Y4513070D01*
X11175998Y4229098D02*
X11276003D01*
X11075998D02*
X11175998D01*
Y4329098D01*
Y4129098D02*
Y4229098D01*
X1500398Y1270000D02*
X1550396D01*
X1500398D02*
Y1320002D01*
X1450396Y1270000D02*
X1500398D01*
Y1220003D02*
Y1270000D01*
Y762000D02*
X1550396D01*
X1500398D02*
Y812002D01*
X1450396Y762000D02*
X1500398D01*
Y712003D02*
Y762000D01*
X1776400Y1270000D02*
X1826397D01*
X1776400D02*
Y1320002D01*
X1726397Y1270000D02*
X1776400D01*
Y1220003D02*
Y1270000D01*
X2052396D02*
X2102399D01*
X2052396D02*
Y1320002D01*
X2002399Y1270000D02*
X2052396D01*
Y1220003D02*
Y1270000D01*
X2328398D02*
X2378400D01*
X2328398D02*
Y1320002D01*
X2278400Y1270000D02*
X2328398D01*
Y1220003D02*
Y1270000D01*
X2604399D02*
X2654397D01*
X2604399D02*
Y1320002D01*
X2554397Y1270000D02*
X2604399D01*
Y1220003D02*
Y1270000D01*
X2880401D02*
X2930398D01*
X2880401D02*
Y1320002D01*
X2830398Y1270000D02*
X2880401D01*
Y1220003D02*
Y1270000D01*
X3156397D02*
X3206399D01*
X3156397D02*
Y1320002D01*
X3106400Y1270000D02*
X3156397D01*
Y1220003D02*
Y1270000D01*
X3432399D02*
X3482401D01*
X3432399D02*
Y1320002D01*
X3382396Y1270000D02*
X3432399D01*
Y1220003D02*
Y1270000D01*
X3708400D02*
X3758397D01*
X3708400D02*
Y1320002D01*
X3658398Y1270000D02*
X3708400D01*
Y1220003D02*
Y1270000D01*
X3984396D02*
X4034399D01*
X3984396D02*
Y1320002D01*
X3934399Y1270000D02*
X3984396D01*
Y1220003D02*
Y1270000D01*
X4260398D02*
X4310400D01*
X4260398D02*
Y1320002D01*
X4210401Y1270000D02*
X4260398D01*
Y1220003D02*
Y1270000D01*
X4536399D02*
X4586397D01*
X4536399D02*
Y1320002D01*
X4486397Y1270000D02*
X4536399D01*
Y1220003D02*
Y1270000D01*
X4812401D02*
X4862398D01*
X4812401D02*
Y1320002D01*
X4762398Y1270000D02*
X4812401D01*
Y1220003D02*
Y1270000D01*
X5088397D02*
X5138400D01*
X5088397D02*
Y1320002D01*
X5038400Y1270000D02*
X5088397D01*
Y1220003D02*
Y1270000D01*
X5364399D02*
X5414401D01*
X5364399D02*
Y1320002D01*
X5314401Y1270000D02*
X5364399D01*
Y1220003D02*
Y1270000D01*
X5640400D02*
X5690398D01*
X5640400D02*
Y1320002D01*
X5590398Y1270000D02*
X5640400D01*
Y1220003D02*
Y1270000D01*
X5916402D02*
X5966399D01*
X5916402D02*
Y1320002D01*
X5866399Y1270000D02*
X5916402D01*
Y1220003D02*
Y1270000D01*
X1776400Y762000D02*
X1826397D01*
X1776400D02*
Y812002D01*
X1726397Y762000D02*
X1776400D01*
Y712003D02*
Y762000D01*
X2052396D02*
X2102399D01*
X2052396D02*
Y812002D01*
X2002399Y762000D02*
X2052396D01*
Y712003D02*
Y762000D01*
X2328398D02*
X2378400D01*
X2328398D02*
Y812002D01*
X2278400Y762000D02*
X2328398D01*
Y712003D02*
Y762000D01*
X2604399D02*
X2654397D01*
X2604399D02*
Y812002D01*
X2554397Y762000D02*
X2604399D01*
Y712003D02*
Y762000D01*
X2880401D02*
X2930398D01*
X2880401D02*
Y812002D01*
X2830398Y762000D02*
X2880401D01*
Y712003D02*
Y762000D01*
X3156397D02*
X3206399D01*
X3156397D02*
Y812002D01*
X3106400Y762000D02*
X3156397D01*
Y712003D02*
Y762000D01*
X3432399D02*
X3482401D01*
X3432399D02*
Y812002D01*
X3382396Y762000D02*
X3432399D01*
Y712003D02*
Y762000D01*
X3708400D02*
X3758397D01*
X3708400D02*
Y812002D01*
X3658398Y762000D02*
X3708400D01*
Y712003D02*
Y762000D01*
X3984396D02*
X4034399D01*
X3984396D02*
Y812002D01*
X3934399Y762000D02*
X3984396D01*
Y712003D02*
Y762000D01*
X4260398D02*
X4310400D01*
X4260398D02*
Y812002D01*
X4210401Y762000D02*
X4260398D01*
Y712003D02*
Y762000D01*
X4536399D02*
X4586397D01*
X4536399D02*
Y812002D01*
X4486397Y762000D02*
X4536399D01*
Y712003D02*
Y762000D01*
X4812401D02*
X4862398D01*
X4812401D02*
Y812002D01*
X4762398Y762000D02*
X4812401D01*
Y712003D02*
Y762000D01*
X5088397D02*
X5138400D01*
X5088397D02*
Y812002D01*
X5038400Y762000D02*
X5088397D01*
Y712003D02*
Y762000D01*
X5364399D02*
X5414401D01*
X5364399D02*
Y812002D01*
X5314401Y762000D02*
X5364399D01*
Y712003D02*
Y762000D01*
X5640400D02*
X5690398D01*
X5640400D02*
Y812002D01*
X5590398Y762000D02*
X5640400D01*
Y712003D02*
Y762000D01*
X5916402D02*
X5966399D01*
X5916402D02*
Y812002D01*
X5866399Y762000D02*
X5916402D01*
Y712003D02*
Y762000D01*
X1638397Y1016000D02*
X1688399D01*
X1638397D02*
Y1066002D01*
X1588399Y1016000D02*
X1638397D01*
Y966003D02*
Y1016000D01*
X1914398D02*
X1964395D01*
X1914398D02*
Y1066002D01*
X1864396Y1016000D02*
X1914398D01*
Y966003D02*
Y1016000D01*
X2190399D02*
X2240397D01*
X2190399D02*
Y1066002D01*
X2140397Y1016000D02*
X2190399D01*
Y966003D02*
Y1016000D01*
X2466396D02*
X2516398D01*
X2466396D02*
Y1066002D01*
X2416399Y1016000D02*
X2466396D01*
Y966003D02*
Y1016000D01*
X2742397D02*
X2792400D01*
X2742397D02*
Y1066002D01*
X2692400Y1016000D02*
X2742397D01*
Y966003D02*
Y1016000D01*
X3018399D02*
X3068396D01*
X3018399D02*
Y1066002D01*
X2968396Y1016000D02*
X3018399D01*
Y966003D02*
Y1016000D01*
X3294400D02*
X3344398D01*
X3294400D02*
Y1066002D01*
X3244398Y1016000D02*
X3294400D01*
Y966003D02*
Y1016000D01*
X3570397D02*
X3620399D01*
X3570397D02*
Y1066002D01*
X3520399Y1016000D02*
X3570397D01*
Y966003D02*
Y1016000D01*
X3846398D02*
X3896401D01*
X3846398D02*
Y1066002D01*
X3796401Y1016000D02*
X3846398D01*
Y966003D02*
Y1016000D01*
X4122400D02*
X4172397D01*
X4122400D02*
Y1066002D01*
X4072397Y1016000D02*
X4122400D01*
Y966003D02*
Y1016000D01*
X4398401D02*
X4448399D01*
X4398401D02*
Y1066002D01*
X4348399Y1016000D02*
X4398401D01*
Y966003D02*
Y1016000D01*
X4674398D02*
X4724400D01*
X4674398D02*
Y1066002D01*
X4624400Y1016000D02*
X4674398D01*
Y966003D02*
Y1016000D01*
X4950399D02*
X5000401D01*
X4950399D02*
Y1066002D01*
X4900402Y1016000D02*
X4950399D01*
Y966003D02*
Y1016000D01*
X5226401D02*
X5276398D01*
X5226401D02*
Y1066002D01*
X5176398Y1016000D02*
X5226401D01*
Y966003D02*
Y1016000D01*
X5502402D02*
X5552399D01*
X5502402D02*
Y1066002D01*
X5452400Y1016000D02*
X5502402D01*
Y966003D02*
Y1016000D01*
X5778398D02*
X5828401D01*
X5778398D02*
Y1066002D01*
X5728401Y1016000D02*
X5778398D01*
Y966003D02*
Y1016000D01*
X653395D02*
X703397D01*
X653395D02*
Y1066002D01*
X603397Y1016000D02*
X653395D01*
Y966003D02*
Y1016000D01*
X6763400D02*
X6813403D01*
X6763400D02*
Y1066002D01*
X6713398Y1016000D02*
X6763400D01*
Y966003D02*
Y1016000D01*
X3708400D02*
X3743752Y1051357D01*
X3673043D02*
X3708400Y1016000D01*
X3673043Y980643D02*
X3708400Y1016000D01*
X3743752Y980643D01*
X2182246Y4500372D02*
X2271344Y4545772D01*
X2093143Y4454972D02*
X2182246Y4500372D01*
X2136846Y4589475D02*
X2182246Y4500372D01*
X2227641Y4411274D01*
X2186554Y3932428D02*
X2275657Y3977828D01*
X2097456Y3887028D02*
X2186554Y3932428D01*
X2141159Y4021526D02*
X2186554Y3932428D01*
X2231954Y3843325D01*
X2084400Y4216400D02*
X2184400D01*
X2284400D01*
X2184400Y4116400D02*
Y4216400D01*
Y4316400D01*
X5551856Y3899728D02*
X5640954Y3945128D01*
X5730057Y3990528D01*
X5640954Y3945128D02*
X5686354Y3856025D01*
X5595559Y4034226D02*
X5640954Y3945128D01*
X5547543Y4467672D02*
X5636646Y4513072D01*
X5725744Y4558472D01*
X5636646Y4513072D02*
X5682041Y4423974D01*
X5591246Y4602175D02*
X5636646Y4513072D01*
X5638800Y4229100D02*
X5738800D01*
X5538800D02*
X5638800D01*
Y4329100D01*
Y4129100D02*
Y4229100D01*
X3888156Y3899728D02*
X3977254Y3945128D01*
X4066357Y3990528D01*
X3977254Y3945128D02*
X4022654Y3856025D01*
X3931859Y4034226D02*
X3977254Y3945128D01*
X3883843Y4467672D02*
X3972946Y4513072D01*
X4062044Y4558472D01*
X3972946Y4513072D02*
X4018341Y4423974D01*
X3927546Y4602175D02*
X3972946Y4513072D01*
X3975100Y4229100D02*
X4075100D01*
X3875100D02*
X3975100D01*
Y4329100D01*
Y4129100D02*
Y4229100D01*
X9383146Y4513070D02*
X9472244Y4558470D01*
X9294043Y4467675D02*
X9383146Y4513070D01*
X9337746Y4602173D02*
X9383146Y4513070D01*
X9428546Y4423972D01*
X9387454Y3945126D02*
X9476557Y3990526D01*
X9298356Y3899726D02*
X9387454Y3945126D01*
X9342059Y4034229D02*
X9387454Y3945126D01*
X9432854Y3856028D01*
X9285300Y4229098D02*
X9385300D01*
X9485300D01*
X9385300Y4129098D02*
Y4229098D01*
Y4329098D01*
X12740058Y3899726D02*
X12829156Y3945126D01*
X12918259Y3990526D01*
X12829156Y3945126D02*
X12874556Y3856028D01*
X12783756Y4034229D02*
X12829156Y3945126D01*
X12735745Y4467675D02*
X12824843Y4513070D01*
X12913947Y4558470D01*
X12824843Y4513070D02*
X12870242Y4423972D01*
X12779443Y4602173D02*
X12824843Y4513070D01*
X12827002Y4229098D02*
X12927002D01*
X12727002D02*
X12827002D01*
Y4329098D01*
Y4129098D02*
Y4229098D01*
X5054701Y3189402D02*
X5130702D01*
X5054701Y2449398D02*
X5130702D01*
X5054701Y2574402D02*
X5130702D01*
Y2449398D02*
Y2574402D01*
X5054701Y3064398D02*
X5130702D01*
Y3189402D01*
X5054701Y2449398D02*
Y2574402D01*
Y3064398D02*
Y3189402D01*
X5092699Y2511903D02*
Y2561900D01*
X5042702Y2511903D02*
X5092699D01*
Y2461900D02*
Y2511903D01*
X5142701D01*
X5092699Y3126903D02*
Y3176900D01*
X5042702Y3126903D02*
X5092699D01*
Y3076900D02*
Y3126903D01*
X5142701D01*
X4927701Y3189402D02*
X5003702D01*
X4927701Y2449398D02*
X5003702D01*
X4927701Y2574402D02*
X5003702D01*
Y2449398D02*
Y2574402D01*
X4927701Y3064398D02*
X5003702D01*
Y3189402D01*
X4927701Y2449398D02*
Y2574402D01*
Y3064398D02*
Y3189402D01*
X4965699Y2511903D02*
Y2561900D01*
X4915702Y2511903D02*
X4965699D01*
Y2461900D02*
Y2511903D01*
X5015701D01*
X4965699Y3126903D02*
Y3176900D01*
X4915702Y3126903D02*
X4965699D01*
Y3076900D02*
Y3126903D01*
X5015701D01*
X4800701Y3189402D02*
X4876702D01*
X4800701Y2449398D02*
X4876702D01*
X4800701Y2574402D02*
X4876702D01*
Y2449398D02*
Y2574402D01*
X4800701Y3064398D02*
X4876702D01*
Y3189402D01*
X4800701Y2449398D02*
Y2574402D01*
Y3064398D02*
Y3189402D01*
X4838699Y2511903D02*
Y2561900D01*
X4788702Y2511903D02*
X4838699D01*
Y2461900D02*
Y2511903D01*
X4888701D01*
X4838699Y3126903D02*
Y3176900D01*
X4788702Y3126903D02*
X4838699D01*
Y3076900D02*
Y3126903D01*
X4888701D01*
X4673701Y3189402D02*
X4749702D01*
X4673701Y2449398D02*
X4749702D01*
X4673701Y2574402D02*
X4749702D01*
Y2449398D02*
Y2574402D01*
X4673701Y3064398D02*
X4749702D01*
Y3189402D01*
X4673701Y2449398D02*
Y2574402D01*
Y3064398D02*
Y3189402D01*
X4711699Y2511903D02*
Y2561900D01*
X4661702Y2511903D02*
X4711699D01*
Y2461900D02*
Y2511903D01*
X4761701D01*
X4711699Y3126903D02*
Y3176900D01*
X4661702Y3126903D02*
X4711699D01*
Y3076900D02*
Y3126903D01*
X4761701D01*
X4546701Y3189402D02*
X4622702D01*
X4546701Y2449398D02*
X4622702D01*
X4546701Y2574402D02*
X4622702D01*
Y2449398D02*
Y2574402D01*
X4546701Y3064398D02*
X4622702D01*
Y3189402D01*
X4546701Y2449398D02*
Y2574402D01*
Y3064398D02*
Y3189402D01*
X4584699Y2511903D02*
Y2561900D01*
X4534702Y2511903D02*
X4584699D01*
Y2461900D02*
Y2511903D01*
X4634701D01*
X4584699Y3126903D02*
Y3176900D01*
X4534702Y3126903D02*
X4584699D01*
Y3076900D02*
Y3126903D01*
X4634701D01*
X4419701Y3189402D02*
X4495702D01*
X4419701Y2449398D02*
X4495702D01*
X4419701Y2574402D02*
X4495702D01*
Y2449398D02*
Y2574402D01*
X4419701Y3064398D02*
X4495702D01*
Y3189402D01*
X4419701Y2449398D02*
Y2574402D01*
Y3064398D02*
Y3189402D01*
X4457699Y2511903D02*
Y2561900D01*
X4407702Y2511903D02*
X4457699D01*
Y2461900D02*
Y2511903D01*
X4507701D01*
X4457699Y3126903D02*
Y3176900D01*
X4407702Y3126903D02*
X4457699D01*
Y3076900D02*
Y3126903D01*
X4507701D01*
X4775199Y2769403D02*
Y2819400D01*
X4825201D01*
X4775199D02*
Y2869402D01*
X4725202Y2819400D02*
X4775199D01*
X5042702Y2511897D02*
X5092699D01*
Y2561900D01*
Y2511897D02*
X5142701D01*
X5092699Y2461900D02*
Y2511897D01*
X5042702Y3126903D02*
X5092699D01*
Y3176900D01*
Y3126903D02*
X5142701D01*
X5092699Y3076900D02*
Y3126903D01*
X5130702Y2449398D02*
Y2574402D01*
Y3064398D02*
Y3189402D01*
X5054701Y2449398D02*
Y2574402D01*
X5130702D01*
X5054701Y3064398D02*
Y3189402D01*
Y3064398D02*
X5130702D01*
X5054701Y3189402D02*
X5130702D01*
X5054701Y2449398D02*
X5130702D01*
X4915702Y2511897D02*
X4965699Y2511903D01*
Y2561900D01*
Y2511903D02*
X5015701Y2511897D01*
X4965699Y2461900D02*
Y2511903D01*
X4915702Y3126903D02*
X4965699D01*
Y3176900D01*
Y3126903D02*
X5015701D01*
X4965699Y3076900D02*
Y3126903D01*
X5003702Y2449398D02*
Y2574402D01*
Y3064398D02*
Y3189402D01*
X4927701Y2449398D02*
Y2574402D01*
X5003702D01*
X4927701Y3064398D02*
Y3189402D01*
Y3064398D02*
X5003702D01*
X4927701Y3189402D02*
X5003702D01*
X4927701Y2449398D02*
X5003702D01*
X4788702Y2511897D02*
X4838699D01*
Y2561900D01*
Y2511897D02*
X4888701D01*
X4838699Y2461900D02*
Y2511897D01*
X4788702Y3126903D02*
X4838699D01*
Y3176900D01*
Y3126903D02*
X4888701D01*
X4838699Y3076900D02*
Y3126903D01*
X4876702Y2449398D02*
Y2574402D01*
Y3064398D02*
Y3189402D01*
X4800701Y2449398D02*
Y2574402D01*
X4876702D01*
X4800701Y3064398D02*
Y3189402D01*
Y3064398D02*
X4876702D01*
X4800701Y3189402D02*
X4876702D01*
X4800701Y2449398D02*
X4876702D01*
X4661702Y2511897D02*
X4711699D01*
Y2561900D01*
Y2511897D02*
X4761701D01*
X4711699Y2461900D02*
Y2511897D01*
X4661702Y3126903D02*
X4711699D01*
Y3176900D01*
Y3126903D02*
X4761701D01*
X4711699Y3076900D02*
Y3126903D01*
X4749702Y2449398D02*
Y2574402D01*
Y3064398D02*
Y3189402D01*
X4673701Y2449398D02*
Y2574402D01*
X4749702D01*
X4673701Y3064398D02*
Y3189402D01*
Y3064398D02*
X4749702D01*
X4673701Y3189402D02*
X4749702D01*
X4673701Y2449398D02*
X4749702D01*
X4534702Y2511897D02*
X4584699Y2511903D01*
Y2561900D01*
Y2511903D02*
X4634701Y2511897D01*
X4584699Y2461900D02*
Y2511903D01*
X4534702Y3126903D02*
X4584699D01*
Y3176900D01*
Y3126903D02*
X4634701D01*
X4584699Y3076900D02*
Y3126903D01*
X4622702Y2449398D02*
Y2574402D01*
Y3064398D02*
Y3189402D01*
X4546701Y2449398D02*
Y2574402D01*
X4622702D01*
X4546701Y3064398D02*
Y3189402D01*
Y3064398D02*
X4622702D01*
X4546701Y3189402D02*
X4622702D01*
X4546701Y2449398D02*
X4622702D01*
X4407702Y2511897D02*
X4457699D01*
Y2561900D01*
Y2511897D02*
X4507701D01*
X4457699Y2461900D02*
Y2511897D01*
X4407702Y3126903D02*
X4457699D01*
Y3176900D01*
Y3126903D02*
X4507701D01*
X4457699Y3076900D02*
Y3126903D01*
X4495702Y2449398D02*
Y2574402D01*
Y3064398D02*
Y3189402D01*
X4419701Y2449398D02*
Y2574402D01*
X4495702D01*
X4419701Y3064398D02*
Y3189402D01*
Y3064398D02*
X4495702D01*
X4419701Y3189402D02*
X4495702D01*
X4419701Y2449398D02*
X4495702D01*
X4725202Y2819400D02*
X4775199D01*
Y2869402D01*
Y2819400D02*
X4825201D01*
X4775199Y2769398D02*
Y2819400D01*
X889000Y14084300D02*
X939000D01*
X889000D02*
Y14134300D01*
X839000Y14084300D02*
X889000D01*
Y14034300D02*
Y14084300D01*
X1651000D02*
X1701000D01*
X1651000D02*
Y14134300D01*
X1601000Y14084300D02*
X1651000D01*
Y14034300D02*
Y14084300D01*
X889000Y13322301D02*
X939000D01*
X889000D02*
Y13372301D01*
X839000Y13322301D02*
X889000D01*
Y13272301D02*
Y13322301D01*
X1651000D02*
X1701000D01*
X1651000D02*
Y13372301D01*
X1601000Y13322301D02*
X1651000D01*
Y13272301D02*
Y13322301D01*
X1270000Y13703300D02*
X1320000D01*
X1270000D02*
Y13753300D01*
X1220000Y13703300D02*
X1270000D01*
Y13653300D02*
Y13703300D01*
D63*
X11420900Y11227600D02*
X11443401Y11300100D01*
X11465901Y11227600D01*
X11420900D02*
X11465901D01*
X11420900D02*
Y11372600D01*
X11465901D01*
Y11227600D02*
Y11372600D01*
X11485901Y11227600D02*
X11508400Y11300100D01*
X11530900Y11227600D01*
X11485901D02*
X11530900D01*
X11485901D02*
Y11372600D01*
X11530900D01*
Y11227600D02*
Y11372600D01*
X11550900Y11227600D02*
X11573401Y11300100D01*
X11595901Y11227600D01*
X11550900D02*
X11595901D01*
X11550900D02*
Y11372600D01*
X11595901D01*
Y11227600D02*
Y11372600D01*
X11615901Y11227600D02*
X11638400Y11300100D01*
X11660900Y11227600D01*
X11615901D02*
X11660900D01*
X11615901D02*
Y11372600D01*
X11660900D01*
Y11227600D02*
Y11372600D01*
X11680900Y11227600D02*
X11703401Y11300100D01*
X11725901Y11227600D01*
X11680900D02*
X11725901D01*
X11680900D02*
Y11372600D01*
X11725901D01*
Y11227600D02*
Y11372600D01*
X11745901Y11227600D02*
X11768401Y11300100D01*
X11790900Y11227600D01*
X11745901D02*
X11790900D01*
X11745901D02*
Y11372600D01*
X11790900D01*
Y11227600D02*
Y11372600D01*
X11810900Y11227600D02*
X11833401Y11300100D01*
X11855901Y11227600D01*
X11810900D02*
X11855901D01*
X11810900D02*
Y11372600D01*
X11855901D01*
Y11227600D02*
Y11372600D01*
X11875901Y11227600D02*
X11898401Y11300100D01*
X11920900Y11227600D01*
X11875901D02*
X11920900D01*
X11875901D02*
Y11372600D01*
X11920900D01*
Y11227600D02*
Y11372600D01*
X11940900Y11227600D02*
X11963401Y11300100D01*
X11985901Y11227600D01*
X11940900D02*
X11985901D01*
X11940900D02*
Y11372600D01*
X11985901D01*
Y11227600D02*
Y11372600D01*
X11420900Y11962600D02*
X11443401Y11890100D01*
X11465901Y11962600D01*
X11420900D02*
X11465901D01*
X11420900Y11817600D02*
Y11962600D01*
Y11817600D02*
X11465901D01*
Y11962600D01*
X11485901D02*
X11508400Y11890100D01*
X11530900Y11962600D01*
X11485901D02*
X11530900D01*
X11485901Y11817600D02*
Y11962600D01*
Y11817600D02*
X11530900D01*
Y11962600D01*
X11550900D02*
X11573401Y11890100D01*
X11595901Y11962600D01*
X11550900D02*
X11595901D01*
X11550900Y11817600D02*
Y11962600D01*
Y11817600D02*
X11595901D01*
Y11962600D01*
X11615901D02*
X11638400Y11890100D01*
X11660900Y11962600D01*
X11615901D02*
X11660900D01*
X11615901Y11817600D02*
Y11962600D01*
Y11817600D02*
X11660900D01*
Y11962600D01*
X11680900D02*
X11703401Y11890100D01*
X11725901Y11962600D01*
X11680900D02*
X11725901D01*
X11680900Y11817600D02*
Y11962600D01*
Y11817600D02*
X11725901D01*
Y11962600D01*
X11745901D02*
X11768401Y11890100D01*
X11790900Y11962600D01*
X11745901D02*
X11790900D01*
X11745901Y11817600D02*
Y11962600D01*
Y11817600D02*
X11790900D01*
Y11962600D01*
X11810900D02*
X11833401Y11890100D01*
X11855901Y11962600D01*
X11810900D02*
X11855901D01*
X11810900Y11817600D02*
Y11962600D01*
Y11817600D02*
X11855901D01*
Y11962600D01*
X11875901D02*
X11898401Y11890100D01*
X11920900Y11962600D01*
X11875901D02*
X11920900D01*
X11875901Y11817600D02*
Y11962600D01*
Y11817600D02*
X11920900D01*
Y11962600D01*
X11940900D02*
X11963401Y11890100D01*
X11985901Y11962600D01*
X11940900D02*
X11985901D01*
X11940900Y11817600D02*
Y11962600D01*
Y11817600D02*
X11985901D01*
Y11962600D01*
X11703401Y11545100D02*
Y11595100D01*
X11653401D02*
X11703401D01*
X11753400D01*
X11703401D02*
Y11645100D01*
%TF.MD5,dd6212d87c812eebdfc0c70dc03105fb*%
M02*
