%TF.GenerationSoftware,Altium Limited,Altium Designer,19.1.5 (86)*%
G04 Layer_Color=16711935*
%FSLAX45Y45*%
%MOMM*%
%TF.FileFunction,Other,Mechanical_1*%
%TF.Part,Single*%
G01*
G75*
%TA.AperFunction,NonConductor*%
%ADD64C,0.63500*%
D64*
X14500000Y0D02*
Y14600000D01*
X0Y14600002D02*
X14500000D01*
X0Y0D02*
Y14600002D01*
Y0D02*
X14500000D01*
%TF.MD5,41d4dff8ee85797a5c48cb7971b919a9*%
M02*
