%TF.GenerationSoftware,Altium Limited,Altium Designer,19.1.5 (86)*%
G04 Layer_Color=16711935*
%FSLAX45Y45*%
%MOMM*%
%TF.FileFunction,Other,Mechanical_13*%
%TF.Part,Single*%
G01*
G75*
%TA.AperFunction,NonConductor*%
%ADD62C,0.10000*%
D62*
X3923501Y9439900D02*
X4018501Y9344900D01*
X3728501Y9439900D02*
X4018501D01*
X3728501Y9279900D02*
Y9439900D01*
Y9279900D02*
X4018501D01*
Y9439900D01*
%TF.MD5,8615f724cbc3816f249f30f275899fb7*%
M02*
