%TF.GenerationSoftware,Altium Limited,Altium Designer,19.1.5 (86)*%
G04 Layer_Color=8388736*
%FSLAX45Y45*%
%MOMM*%
%TF.FileFunction,Other,Mechanical_14*%
%TF.Part,Single*%
G01*
G75*
%TA.AperFunction,NonConductor*%
%ADD45C,0.20000*%
%ADD48C,0.12700*%
%ADD49C,0.15000*%
%ADD50R,0.90002X0.89997*%
%ADD62C,0.10000*%
D45*
X11569500Y14006122D02*
X11580926Y14011835D01*
X11598065Y14028973D01*
Y13909000D01*
X11726038Y14028973D02*
X11668908D01*
X11663194Y13977557D01*
X11668908Y13983270D01*
X11686047Y13988983D01*
X11703186D01*
X11720325Y13983270D01*
X11731751Y13971844D01*
X11737464Y13954704D01*
Y13943279D01*
X11731751Y13926138D01*
X11720325Y13914713D01*
X11703186Y13909000D01*
X11686047D01*
X11668908Y13914713D01*
X11663194Y13920425D01*
X11657481Y13931853D01*
X11858581Y14028973D02*
Y13909000D01*
Y14028973D02*
X11898573D01*
X11915712Y14023260D01*
X11927138Y14011835D01*
X11932851Y14000409D01*
X11938564Y13983270D01*
Y13954704D01*
X11932851Y13937566D01*
X11927138Y13926138D01*
X11915712Y13914713D01*
X11898573Y13909000D01*
X11858581D01*
X11965415Y13960419D02*
X12068250D01*
X12183654Y14011835D02*
X12172228Y14023260D01*
X12155089Y14028973D01*
X12132237D01*
X12115097Y14023260D01*
X12103671Y14011835D01*
Y14000409D01*
X12109384Y13988983D01*
X12115097Y13983270D01*
X12126523Y13977557D01*
X12160802Y13966132D01*
X12172228Y13960419D01*
X12177941Y13954704D01*
X12183654Y13943279D01*
Y13926138D01*
X12172228Y13914713D01*
X12155089Y13909000D01*
X12132237D01*
X12115097Y13914713D01*
X12103671Y13926138D01*
X12210505Y13988983D02*
Y13931853D01*
X12216218Y13914713D01*
X12227645Y13909000D01*
X12244784D01*
X12256210Y13914713D01*
X12273349Y13931853D01*
Y13988983D02*
Y13909000D01*
X12304771Y14028973D02*
Y13909000D01*
Y13971844D02*
X12316197Y13983270D01*
X12327623Y13988983D01*
X12344762D01*
X12356188Y13983270D01*
X12367615Y13971844D01*
X12373328Y13954704D01*
Y13943279D01*
X12367615Y13926138D01*
X12356188Y13914713D01*
X12344762Y13909000D01*
X12327623D01*
X12316197Y13914713D01*
X12304771Y13926138D01*
X12493302Y14028973D02*
Y13909000D01*
Y14028973D02*
X12539006Y13909000D01*
X12584711Y14028973D02*
X12539006Y13909000D01*
X12584711Y14028973D02*
Y13909000D01*
X12687546Y13988983D02*
Y13909000D01*
Y13971844D02*
X12676120Y13983270D01*
X12664694Y13988983D01*
X12647555D01*
X12636128Y13983270D01*
X12624702Y13971844D01*
X12618989Y13954704D01*
Y13943279D01*
X12624702Y13926138D01*
X12636128Y13914713D01*
X12647555Y13909000D01*
X12664694D01*
X12676120Y13914713D01*
X12687546Y13926138D01*
X12719539Y14028973D02*
Y13909000D01*
X12744677Y13954704D02*
X12813232D01*
Y13966132D01*
X12807520Y13977557D01*
X12801807Y13983270D01*
X12790381Y13988983D01*
X12773242D01*
X12761816Y13983270D01*
X12750390Y13971844D01*
X12744677Y13954704D01*
Y13943279D01*
X12750390Y13926138D01*
X12761816Y13914713D01*
X12773242Y13909000D01*
X12790381D01*
X12801807Y13914713D01*
X12813232Y13926138D01*
X11052000Y13756122D02*
X11063426Y13761835D01*
X11080565Y13778973D01*
Y13659000D01*
X11208538Y13778973D02*
X11151407D01*
X11145694Y13727557D01*
X11151407Y13733270D01*
X11168547Y13738983D01*
X11185686D01*
X11202825Y13733270D01*
X11214251Y13721844D01*
X11219964Y13704704D01*
Y13693279D01*
X11214251Y13676138D01*
X11202825Y13664713D01*
X11185686Y13659000D01*
X11168547D01*
X11151407Y13664713D01*
X11145694Y13670425D01*
X11139981Y13681853D01*
X13302000Y13496123D02*
X13313426Y13501836D01*
X13330565Y13518974D01*
Y13399001D01*
X13236270Y13738983D02*
X13230557Y13721844D01*
X13219131Y13710419D01*
X13201991Y13704704D01*
X13196278D01*
X13179140Y13710419D01*
X13167712Y13721844D01*
X13162000Y13738983D01*
Y13744696D01*
X13167712Y13761835D01*
X13179140Y13773260D01*
X13196278Y13778973D01*
X13201991D01*
X13219131Y13773260D01*
X13230557Y13761835D01*
X13236270Y13738983D01*
Y13710419D01*
X13230557Y13681853D01*
X13219131Y13664713D01*
X13201991Y13659000D01*
X13190565D01*
X13173425Y13664713D01*
X13167712Y13676138D01*
X11040565Y13518974D02*
X11023426Y13513261D01*
X11017713Y13501836D01*
Y13490408D01*
X11023426Y13478983D01*
X11034852Y13473270D01*
X11057705Y13467557D01*
X11074844Y13461844D01*
X11086270Y13450418D01*
X11091983Y13438992D01*
Y13421852D01*
X11086270Y13410426D01*
X11080557Y13404713D01*
X11063418Y13399001D01*
X11040565D01*
X11023426Y13404713D01*
X11017713Y13410426D01*
X11012000Y13421852D01*
Y13438992D01*
X11017713Y13450418D01*
X11029139Y13461844D01*
X11046278Y13467557D01*
X11069131Y13473270D01*
X11080557Y13478983D01*
X11086270Y13490408D01*
Y13501836D01*
X11080557Y13513261D01*
X11063418Y13518974D01*
X11040565D01*
X4076080Y9026535D02*
X4071319Y9036056D01*
X4061797Y9045578D01*
X4052275Y9050339D01*
X4037993Y9055100D01*
X4014188D01*
X3999906Y9050339D01*
X3990384Y9045578D01*
X3980862Y9036056D01*
X3976101Y9026535D01*
Y9007491D01*
X3980862Y8997969D01*
X3990384Y8988448D01*
X3999906Y8983687D01*
X4014188Y8978926D01*
X4037993D01*
X4052275Y8983687D01*
X4061797Y8988448D01*
X4071319Y8997969D01*
X4076080Y9007491D01*
Y9026535D01*
Y8955598D02*
X3976101D01*
X4076080D02*
X3976101Y8888945D01*
X4076080D02*
X3976101D01*
X3696675Y8885239D02*
X3701436D01*
X3710958Y8880478D01*
X3715719Y8875717D01*
X3720480Y8866196D01*
Y8847152D01*
X3715719Y8837630D01*
X3710958Y8832869D01*
X3701436Y8828109D01*
X3691915D01*
X3682393Y8832869D01*
X3668110Y8842391D01*
X3620501Y8890000D01*
Y8823348D01*
X3701436Y9017000D02*
X3706197Y9007478D01*
X3720480Y8993196D01*
X3620501D01*
X8455709Y717225D02*
X8512839D01*
X8518552Y768643D01*
X8512839Y762930D01*
X8495700Y757217D01*
X8478561D01*
X8461421Y762930D01*
X8449995Y774356D01*
X8444282Y791495D01*
Y802921D01*
X8449995Y820061D01*
X8461421Y831487D01*
X8478561Y837200D01*
X8495700D01*
X8512839Y831487D01*
X8518552Y825774D01*
X8524265Y814348D01*
X8383153Y717225D02*
X8400292Y722939D01*
X8411718Y740078D01*
X8417431Y768643D01*
Y785782D01*
X8411718Y814348D01*
X8400292Y831487D01*
X8383153Y837200D01*
X8371726D01*
X8354587Y831487D01*
X8343161Y814348D01*
X8337448Y785782D01*
Y768643D01*
X8343161Y740078D01*
X8354587Y722939D01*
X8371726Y717225D01*
X8383153D01*
X8508338Y961226D02*
X8445494D01*
X8479773Y1006930D01*
X8462634D01*
X8451208Y1012643D01*
X8445494Y1018356D01*
X8439781Y1035496D01*
Y1046922D01*
X8445494Y1064061D01*
X8456921Y1075487D01*
X8474060Y1081200D01*
X8491199D01*
X8508338Y1075487D01*
X8514051Y1069774D01*
X8519764Y1058348D01*
X8401504Y961226D02*
X8338660D01*
X8372939Y1006930D01*
X8355799D01*
X8344373Y1012643D01*
X8338660Y1018356D01*
X8332947Y1035496D01*
Y1046922D01*
X8338660Y1064061D01*
X8350086Y1075487D01*
X8367226Y1081200D01*
X8384365D01*
X8401504Y1075487D01*
X8407217Y1069774D01*
X8412930Y1058348D01*
X13543962Y970578D02*
X13532536Y964865D01*
X13515398Y947726D01*
Y1067700D01*
X13427415Y947726D02*
X13444556Y953439D01*
X13450269Y964865D01*
Y976291D01*
X13444556Y987717D01*
X13433128Y993430D01*
X13410277Y999143D01*
X13393138Y1004856D01*
X13381711Y1016282D01*
X13375998Y1027708D01*
Y1044848D01*
X13381711Y1056274D01*
X13387425Y1061987D01*
X13404564Y1067700D01*
X13427415D01*
X13444556Y1061987D01*
X13450269Y1056274D01*
X13455981Y1044848D01*
Y1027708D01*
X13450269Y1016282D01*
X13438841Y1004856D01*
X13421703Y999143D01*
X13398851Y993430D01*
X13387425Y987717D01*
X13381711Y976291D01*
Y964865D01*
X13387425Y953439D01*
X13404564Y947726D01*
X13427415D01*
X8524263Y1248078D02*
X8512837Y1242365D01*
X8495698Y1225226D01*
Y1345200D01*
X8356299Y1225226D02*
X8413430Y1345200D01*
X8436282Y1225226D02*
X8356299D01*
X13547836Y696726D02*
X13484993D01*
X13519272Y742430D01*
X13502133D01*
X13490707Y748143D01*
X13484993Y753856D01*
X13479280Y770995D01*
Y782422D01*
X13484993Y799561D01*
X13496420Y810987D01*
X13513559Y816700D01*
X13530698D01*
X13547836Y810987D01*
X13553551Y805274D01*
X13559264Y793848D01*
X13395297Y696726D02*
X13452429Y776708D01*
X13366733D01*
X13395297Y696726D02*
Y816700D01*
X13398763Y1239578D02*
X13387337Y1233865D01*
X13370197Y1216726D01*
Y1336700D01*
X1274244Y717226D02*
X1331375D01*
X1337088Y768643D01*
X1331375Y762930D01*
X1314236Y757217D01*
X1297096D01*
X1279957Y762930D01*
X1268531Y774356D01*
X1262818Y791495D01*
Y802922D01*
X1268531Y820061D01*
X1279957Y831487D01*
X1297096Y837200D01*
X1314236D01*
X1331375Y831487D01*
X1337088Y825774D01*
X1342801Y814348D01*
X1201688Y717226D02*
X1218828Y722939D01*
X1230254Y740078D01*
X1235967Y768643D01*
Y785783D01*
X1230254Y814348D01*
X1218828Y831487D01*
X1201688Y837200D01*
X1190262D01*
X1173123Y831487D01*
X1161697Y814348D01*
X1155984Y785783D01*
Y768643D01*
X1161697Y740078D01*
X1173123Y722939D01*
X1190262Y717226D01*
X1201688D01*
X1326874Y961226D02*
X1264030D01*
X1298309Y1006930D01*
X1281169D01*
X1269743Y1012644D01*
X1264030Y1018357D01*
X1258317Y1035496D01*
Y1046922D01*
X1264030Y1064061D01*
X1275456Y1075487D01*
X1292596Y1081200D01*
X1309735D01*
X1326874Y1075487D01*
X1332587Y1069774D01*
X1338300Y1058348D01*
X1220040Y961226D02*
X1157196D01*
X1191474Y1006930D01*
X1174335D01*
X1162909Y1012644D01*
X1157196Y1018357D01*
X1151483Y1035496D01*
Y1046922D01*
X1157196Y1064061D01*
X1168622Y1075487D01*
X1185761Y1081200D01*
X1202901D01*
X1220040Y1075487D01*
X1225753Y1069774D01*
X1231466Y1058348D01*
X6362498Y970578D02*
X6351072Y964865D01*
X6333933Y947726D01*
Y1067700D01*
X6245952Y947726D02*
X6263091Y953439D01*
X6268804Y964865D01*
Y976291D01*
X6263091Y987717D01*
X6251665Y993430D01*
X6228813Y999144D01*
X6211673Y1004857D01*
X6200247Y1016283D01*
X6194534Y1027709D01*
Y1044848D01*
X6200247Y1056274D01*
X6205960Y1061987D01*
X6223100Y1067700D01*
X6245952D01*
X6263091Y1061987D01*
X6268804Y1056274D01*
X6274517Y1044848D01*
Y1027709D01*
X6268804Y1016283D01*
X6257378Y1004857D01*
X6240239Y999144D01*
X6217386Y993430D01*
X6205960Y987717D01*
X6200247Y976291D01*
Y964865D01*
X6205960Y953439D01*
X6223100Y947726D01*
X6245952D01*
X1342799Y1248079D02*
X1331373Y1242365D01*
X1314234Y1225226D01*
Y1345201D01*
X1174835Y1225226D02*
X1231966Y1345201D01*
X1254818Y1225226D02*
X1174835D01*
X6366373Y696726D02*
X6303529D01*
X6337807Y742430D01*
X6320668D01*
X6309242Y748144D01*
X6303529Y753857D01*
X6297816Y770996D01*
Y782422D01*
X6303529Y799561D01*
X6314955Y810987D01*
X6332095Y816700D01*
X6349234D01*
X6366373Y810987D01*
X6372086Y805274D01*
X6377799Y793848D01*
X6213834Y696726D02*
X6270965Y776709D01*
X6185269D01*
X6213834Y696726D02*
Y816700D01*
X6217298Y1239578D02*
X6205872Y1233865D01*
X6188733Y1216726D01*
Y1336700D01*
D48*
X7848597Y11016945D02*
X7858271Y11021782D01*
X7872783Y11036293D01*
Y10934715D01*
X7971459Y11036293D02*
X7923088Y10968574D01*
X7995644D01*
X7971459Y11036293D02*
Y10934715D01*
D49*
X3575000Y12992365D02*
X3565478Y12987604D01*
X3551196Y12973322D01*
Y13073300D01*
X1670000Y12992365D02*
X1660478Y12987604D01*
X1646196Y12973322D01*
Y13073300D01*
D50*
X3803102Y8996601D02*
D03*
Y8869601D02*
D03*
D62*
X7270200Y6228100D02*
G03*
X7270200Y6228100I-50000J0D01*
G01*
X6052819Y11074400D02*
G03*
X5961379Y11074400I-45720J0D01*
G01*
X8338821D02*
G03*
X8247381Y11074400I-45720J0D01*
G01*
X10236000Y13569000D02*
G03*
X10486000Y13319000I250000J0D01*
G01*
X10566000D02*
G03*
X10816000Y13569000I0J250000D01*
G01*
X13567999D02*
G03*
X13817999Y13319000I250000J0D01*
G01*
X13898000D02*
G03*
X14148000Y13568704I0J250000D01*
G01*
X10445207Y14164000D02*
G03*
X10465000Y14144000I19648J-350D01*
G01*
X10585000Y14144000D02*
G03*
X10605000Y14164000I0J20000D01*
G01*
X13778207D02*
G03*
X13798000Y14144000I19648J-350D01*
G01*
X13917999Y14144000D02*
G03*
X13938000Y14164000I0J20000D01*
G01*
X10814303Y14759000D02*
G03*
X10883240Y14828999I-536J69472D01*
G01*
X10932480Y15349001D02*
G03*
X10883240Y15231102I116003J-117680D01*
G01*
X13500760D02*
G03*
X13451520Y15349001I-165243J218D01*
G01*
X13500760Y14828999D02*
G03*
X13575500Y14759000I69769J-406D01*
G01*
X5166872Y15336002D02*
G03*
X5136872Y15306001I0J-30000D01*
G01*
X9087161D02*
G03*
X9057161Y15336002I-30000J0D01*
G01*
X9622002Y13589000D02*
G03*
X9622002Y13589000I-160000J0D01*
G01*
X9542001Y14109000D02*
G03*
X9542001Y14109000I-80000J0D01*
G01*
X4841999D02*
G03*
X4841999Y14109000I-80000J0D01*
G01*
X4921999Y13589000D02*
G03*
X4921999Y13589000I-160000J0D01*
G01*
X5686999Y13462000D02*
G03*
X5766999Y13462000I40000J0D01*
G01*
X5549999Y13716000D02*
G03*
X5629999Y13716000I40000J0D01*
G01*
X5964000Y13462000D02*
G03*
X6043999Y13462000I40000J0D01*
G01*
X5827000Y13716000D02*
G03*
X5906999Y13716000I40000J0D01*
G01*
X6241000Y13462000D02*
G03*
X6321000Y13462000I40000J0D01*
G01*
X6103999Y13716000D02*
G03*
X6183999Y13716000I40000J0D01*
G01*
X6518000Y13462000D02*
G03*
X6598000Y13462000I40000J0D01*
G01*
X6381000Y13716000D02*
G03*
X6461000Y13716000I40000J0D01*
G01*
X6795000Y13462000D02*
G03*
X6875000Y13462000I40000J0D01*
G01*
X6658000Y13716000D02*
G03*
X6738000Y13716000I40000J0D01*
G01*
X7072000Y13462000D02*
G03*
X7152000Y13462000I40000J0D01*
G01*
X6935000Y13716000D02*
G03*
X7015000Y13716000I40000J0D01*
G01*
X7349000Y13462000D02*
G03*
X7429000Y13462000I40000J0D01*
G01*
X7212000Y13716000D02*
G03*
X7292000Y13716000I40000J0D01*
G01*
X7626000Y13462000D02*
G03*
X7706000Y13462000I40000J0D01*
G01*
X7489000Y13716000D02*
G03*
X7569000Y13716000I40000J0D01*
G01*
X7903000Y13462000D02*
G03*
X7983000Y13462000I40000J0D01*
G01*
X7766000Y13716000D02*
G03*
X7846000Y13716000I40000J0D01*
G01*
X8180001Y13462000D02*
G03*
X8260000Y13462000I40000J0D01*
G01*
X8043001Y13716000D02*
G03*
X8123001Y13716000I40000J0D01*
G01*
X8457001Y13462000D02*
G03*
X8537001Y13462000I40000J0D01*
G01*
X8320001Y13716000D02*
G03*
X8400000Y13716000I40000J0D01*
G01*
X8734001Y13462000D02*
G03*
X8814001Y13462000I40000J0D01*
G01*
X8597001Y13716000D02*
G03*
X8677001Y13716000I40000J0D01*
G01*
X5409999Y13462000D02*
G03*
X5489999Y13462000I40000J0D01*
G01*
X8277900Y1959052D02*
G03*
X8359100Y1958994I40600J-58D01*
G01*
Y4898996D02*
G03*
X8277900Y4898938I-40600J0D01*
G01*
X10165800Y8793500D02*
G03*
X10165800Y8793500I-50000J0D01*
G01*
X13484900Y1959052D02*
G03*
X13566100Y1958994I40600J-58D01*
G01*
Y4898996D02*
G03*
X13484900Y4898938I-40600J0D01*
G01*
X8798600Y1959052D02*
G03*
X8879800Y1958994I40600J-58D01*
G01*
Y4898996D02*
G03*
X8798600Y4898938I-40600J0D01*
G01*
X1013500Y1793952D02*
G03*
X1094700Y1793894I40600J-58D01*
G01*
Y4733896D02*
G03*
X1013500Y4733838I-40600J0D01*
G01*
X6309400Y1959052D02*
G03*
X6390600Y1958994I40600J-58D01*
G01*
Y4898996D02*
G03*
X6309400Y4898938I-40600J0D01*
G01*
X1458000Y1793952D02*
G03*
X1539200Y1793894I40600J-58D01*
G01*
Y4733896D02*
G03*
X1458000Y4733838I-40600J0D01*
G01*
X11993400Y11715100D02*
G03*
X11993400Y11715100I-50000J0D01*
G01*
X4819100Y7383800D02*
G03*
X4819100Y7383800I-50000J0D01*
G01*
X2729192Y14428300D02*
G03*
X2858808Y14428300I64808J30000D01*
G01*
X3491192D02*
G03*
X3620808Y14428300I64808J30000D01*
G01*
X2495250Y13235698D02*
G03*
X2538000Y13255600I16742J19902D01*
G01*
Y14089000D02*
G03*
X2495250Y14108902I-26008J0D01*
G01*
X3854750D02*
G03*
X3812000Y14089000I-16742J-19902D01*
G01*
Y13255600D02*
G03*
X3854750Y13235698I26008J0D01*
G01*
X8264862Y-848001D02*
G03*
X8314862Y-898001I50000J0D01*
G01*
X13464864D02*
G03*
X13514864Y-848001I0J50000D01*
G01*
X12713864Y1016000D02*
G03*
X12653864Y1016000I-30000J0D01*
G01*
X8987862Y1270000D02*
G03*
X8927862Y1270000I-30000J0D01*
G01*
X9125862Y1016000D02*
G03*
X9065862Y1016000I-30000J0D01*
G01*
X9263862Y1270000D02*
G03*
X9203862Y1270000I-30000J0D01*
G01*
X9401862Y1016000D02*
G03*
X9341862Y1016000I-30000J0D01*
G01*
X9539862Y1270000D02*
G03*
X9479862Y1270000I-30000J0D01*
G01*
X9677862Y1016000D02*
G03*
X9617862Y1016000I-30000J0D01*
G01*
X9815862Y1270000D02*
G03*
X9755862Y1270000I-30000J0D01*
G01*
X9953862Y1016000D02*
G03*
X9893862Y1016000I-30000J0D01*
G01*
X10091862Y1270000D02*
G03*
X10031862Y1270000I-30000J0D01*
G01*
X10229862Y1016000D02*
G03*
X10169862Y1016000I-30000J0D01*
G01*
X10367862Y1270000D02*
G03*
X10307862Y1270000I-30000J0D01*
G01*
X10505862Y1016000D02*
G03*
X10445863Y1016000I-30000J0D01*
G01*
X10643862Y1270000D02*
G03*
X10583862Y1270000I-30000J0D01*
G01*
X10781863Y1016000D02*
G03*
X10721863Y1016000I-30000J0D01*
G01*
X10919863Y1270000D02*
G03*
X10859863Y1270000I-30000J0D01*
G01*
X11057863Y1016000D02*
G03*
X10997863Y1016000I-30000J0D01*
G01*
X11195863Y1270000D02*
G03*
X11135863Y1270000I-30000J0D01*
G01*
X11333863Y1016000D02*
G03*
X11273863Y1016000I-30000J0D01*
G01*
X11471863Y1270000D02*
G03*
X11411863Y1270000I-30000J0D01*
G01*
X11609863Y1016000D02*
G03*
X11549863Y1016000I-30000J0D01*
G01*
X11747863Y1270000D02*
G03*
X11687863Y1270000I-30000J0D01*
G01*
X11885863Y1016000D02*
G03*
X11825863Y1016000I-30000J0D01*
G01*
X12023863Y1270000D02*
G03*
X11963863Y1270000I-30000J0D01*
G01*
X12161863Y1016000D02*
G03*
X12101863Y1016000I-30000J0D01*
G01*
X12299863Y1270000D02*
G03*
X12239864Y1270000I-30000J0D01*
G01*
X12437863Y1016000D02*
G03*
X12377863Y1016000I-30000J0D01*
G01*
X12851865Y1270000D02*
G03*
X12791864Y1270000I-30000J0D01*
G01*
X12575864D02*
G03*
X12515864Y1270000I-30000J0D01*
G01*
X8711861D02*
G03*
X8651862Y1270000I-30000J0D01*
G01*
X8849861Y1016000D02*
G03*
X8789862Y1016000I-30000J0D01*
G01*
X12989864D02*
G03*
X12929865Y1016000I-30000J0D01*
G01*
X13127864Y1270000D02*
G03*
X13067863Y1270000I-30000J0D01*
G01*
X11221619Y3914894D02*
G03*
X11184883Y4546476I-45619J314206D01*
G01*
X11130381Y4543306D02*
G03*
X11167117Y3911724I45619J-314206D01*
G01*
X11089003Y4228136D02*
G03*
X11089003Y4228136I-40000J0D01*
G01*
X11342996Y4230064D02*
G03*
X11342996Y4230064I-40000J0D01*
G01*
X1083398Y-848001D02*
G03*
X1133398Y-898001I50000J0D01*
G01*
X6283399D02*
G03*
X6333399Y-848001I0J50000D01*
G01*
X5532399Y1016000D02*
G03*
X5472400Y1016000I-30000J0D01*
G01*
X1806397Y1270001D02*
G03*
X1746398Y1270001I-30000J0D01*
G01*
X1944397Y1016000D02*
G03*
X1884398Y1016000I-30000J0D01*
G01*
X2082397Y1270001D02*
G03*
X2022398Y1270001I-30000J0D01*
G01*
X2220398Y1016000D02*
G03*
X2160398Y1016000I-30000J0D01*
G01*
X2358398Y1270001D02*
G03*
X2298398Y1270001I-30000J0D01*
G01*
X2496398Y1016000D02*
G03*
X2436398Y1016000I-30000J0D01*
G01*
X2634398Y1270001D02*
G03*
X2574398Y1270001I-30000J0D01*
G01*
X2772398Y1016000D02*
G03*
X2712398Y1016000I-30000J0D01*
G01*
X2910398Y1270001D02*
G03*
X2850398Y1270001I-30000J0D01*
G01*
X3048398Y1016000D02*
G03*
X2988398Y1016000I-30000J0D01*
G01*
X3186398Y1270001D02*
G03*
X3126398Y1270001I-30000J0D01*
G01*
X3324398Y1016000D02*
G03*
X3264398Y1016000I-30000J0D01*
G01*
X3462398Y1270001D02*
G03*
X3402398Y1270001I-30000J0D01*
G01*
X3600398Y1016000D02*
G03*
X3540399Y1016000I-30000J0D01*
G01*
X3738398Y1270001D02*
G03*
X3678399Y1270001I-30000J0D01*
G01*
X3876398Y1016000D02*
G03*
X3816399Y1016000I-30000J0D01*
G01*
X4014399Y1270001D02*
G03*
X3954399Y1270001I-30000J0D01*
G01*
X4152399Y1016000D02*
G03*
X4092399Y1016000I-30000J0D01*
G01*
X4290399Y1270001D02*
G03*
X4230399Y1270001I-30000J0D01*
G01*
X4428399Y1016000D02*
G03*
X4368399Y1016000I-30000J0D01*
G01*
X4566399Y1270001D02*
G03*
X4506399Y1270001I-30000J0D01*
G01*
X4704399Y1016000D02*
G03*
X4644399Y1016000I-30000J0D01*
G01*
X4842399Y1270001D02*
G03*
X4782399Y1270001I-30000J0D01*
G01*
X4980399Y1016000D02*
G03*
X4920399Y1016000I-30000J0D01*
G01*
X5118399Y1270001D02*
G03*
X5058399Y1270001I-30000J0D01*
G01*
X5256399Y1016000D02*
G03*
X5196399Y1016000I-30000J0D01*
G01*
X5670399Y1270001D02*
G03*
X5610399Y1270001I-30000J0D01*
G01*
X5394399D02*
G03*
X5334400Y1270001I-30000J0D01*
G01*
X1530397D02*
G03*
X1470397Y1270001I-30000J0D01*
G01*
X1668397Y1016000D02*
G03*
X1608397Y1016000I-30000J0D01*
G01*
X5808400D02*
G03*
X5748400Y1016000I-30000J0D01*
G01*
X5946400Y1270001D02*
G03*
X5886400Y1270001I-30000J0D01*
G01*
X2506554Y4216400D02*
G03*
X2506554Y4216400I-320000J0D01*
G01*
X5960400Y4229100D02*
G03*
X5960400Y4229100I-320000J0D01*
G01*
X4307800Y4216400D02*
G03*
X4307800Y4216400I-320000J0D01*
G01*
X9707454Y4229100D02*
G03*
X9707454Y4229100I-320000J0D01*
G01*
X13144843D02*
G03*
X13144843Y4229100I-320000J0D01*
G01*
X11496000D02*
G03*
X11496000Y4229100I-320000J0D01*
G01*
X2138781Y4530606D02*
G03*
X2175517Y3899024I45619J-314206D01*
G01*
X2230019Y3902194D02*
G03*
X2193283Y4533776I-45619J314206D01*
G01*
X2351396Y4217364D02*
G03*
X2351396Y4217364I-40000J0D01*
G01*
X2097403Y4215436D02*
G03*
X2097403Y4215436I-40000J0D01*
G01*
X5684419Y3914894D02*
G03*
X5647683Y4546476I-45619J314206D01*
G01*
X5593181Y4543306D02*
G03*
X5629917Y3911724I45619J-314206D01*
G01*
X5551803Y4228136D02*
G03*
X5551803Y4228136I-40000J0D01*
G01*
X5805796Y4230064D02*
G03*
X5805796Y4230064I-40000J0D01*
G01*
X4020719Y3914894D02*
G03*
X3983983Y4546476I-45619J314206D01*
G01*
X3929481Y4543306D02*
G03*
X3966217Y3911724I45619J-314206D01*
G01*
X3888103Y4228136D02*
G03*
X3888103Y4228136I-40000J0D01*
G01*
X4142096Y4230064D02*
G03*
X4142096Y4230064I-40000J0D01*
G01*
X9339681Y4543306D02*
G03*
X9376417Y3911724I45619J-314206D01*
G01*
X9430919Y3914894D02*
G03*
X9394183Y4546476I-45619J314206D01*
G01*
X9552296Y4230064D02*
G03*
X9552296Y4230064I-40000J0D01*
G01*
X9298303Y4228136D02*
G03*
X9298303Y4228136I-40000J0D01*
G01*
X12872620Y3914894D02*
G03*
X12835883Y4546476I-45619J314206D01*
G01*
X12781381Y4543306D02*
G03*
X12818117Y3911724I45619J-314206D01*
G01*
X12740003Y4228136D02*
G03*
X12740003Y4228136I-40000J0D01*
G01*
X12993996Y4230064D02*
G03*
X12993996Y4230064I-40000J0D01*
G01*
X4793699Y6202700D02*
G03*
X4793699Y6202700I-50000J0D01*
G01*
X10165800Y6228100D02*
G03*
X10165800Y6228100I-50000J0D01*
G01*
X7270200Y7383800D02*
G03*
X7270200Y7383800I-50000J0D01*
G01*
X4793700Y8793500D02*
G03*
X4793700Y8793500I-50000J0D01*
G01*
X7270200D02*
G03*
X7270200Y8793500I-50000J0D01*
G01*
X824192Y14428300D02*
G03*
X953808Y14428300I64808J30000D01*
G01*
X1586192D02*
G03*
X1715808Y14428300I64808J30000D01*
G01*
X590250Y13235698D02*
G03*
X633000Y13255600I16742J19902D01*
G01*
Y14089000D02*
G03*
X590250Y14108902I-26008J0D01*
G01*
X1949750D02*
G03*
X1907000Y14089000I-16742J-19902D01*
G01*
Y13255600D02*
G03*
X1949750Y13235698I26008J0D01*
G01*
X7120198Y5838502D02*
Y6328103D01*
X7510200D01*
Y5838502D02*
Y6328103D01*
X7120198Y5838502D02*
X7510200D01*
X6088400Y12480300D02*
Y12640300D01*
Y12480300D02*
X6408400D01*
Y12640300D01*
X6088400D02*
X6408400D01*
X6940548Y10452100D02*
X7359648D01*
X6388098Y10347960D02*
X6474458Y10261600D01*
X6301738D02*
X6388098Y10347960D01*
X7889238Y10284460D02*
Y10347960D01*
X7680958Y10284460D02*
Y10347960D01*
X5996938Y10507685D02*
X6238238D01*
X5996938Y10828314D02*
X6238238D01*
X5966458Y10515600D02*
X5996938D01*
X5966458D02*
Y10820400D01*
X5996938D01*
X8061963Y10507685D02*
X8303263D01*
X8061963Y10828314D02*
X8303263D01*
Y10820400D02*
X8333743D01*
X8303263Y10515600D02*
X8333743D01*
Y10820400D01*
X8061963Y10507685D02*
Y10828314D01*
X7581898Y10284460D02*
X7988303D01*
X6902448Y10982960D02*
X7397748D01*
Y10883900D02*
Y11074400D01*
Y10883900D02*
X7816848D01*
Y11074400D01*
X8026398Y10982960D02*
X8303263D01*
Y10347960D02*
Y10982960D01*
X7359648Y10347960D02*
X8303263D01*
X6238238Y10507685D02*
Y10828314D01*
X7359648Y10261600D02*
Y10452100D01*
X6940548Y10261600D02*
Y10452100D01*
X5996938Y10347960D02*
X6940548D01*
X5996938D02*
Y10982960D01*
X6483348D01*
X6902448Y10883900D02*
Y11074400D01*
X6483348Y10883900D02*
X6902448D01*
X6483348D02*
Y11074400D01*
X8338823D02*
X8404863D01*
X6052818D02*
X8247383D01*
X5895338D02*
X5961378D01*
X5895338Y10261600D02*
Y11074400D01*
Y10261600D02*
X7581898D01*
Y10284460D01*
X7988303Y10261600D02*
Y10284460D01*
Y10261600D02*
X8404863D01*
Y11074400D01*
X10961200Y11718300D02*
Y11878300D01*
X10971200Y11718300D02*
Y11878300D01*
X10981200Y11718300D02*
Y11878300D01*
X10991200Y11718300D02*
Y11878300D01*
X11001200Y11718300D02*
Y11878300D01*
X11011200Y11718300D02*
Y11878300D01*
X11021200Y11718300D02*
Y11878300D01*
X11031200Y11718300D02*
Y11878300D01*
X10711200Y11718300D02*
X11031200D01*
X10711200D02*
Y11878300D01*
X11031200D01*
X10711200Y11510000D02*
X11031200D01*
Y11350000D02*
Y11510000D01*
X10711200Y11350000D02*
X11031200D01*
X10711200D02*
Y11510000D01*
X10235003Y14709001D02*
X10422003D01*
X11766999D02*
X12616999D01*
X12967001D02*
X13751997D01*
X10632000D02*
X11417002D01*
X13751997Y14549001D02*
Y14758998D01*
Y14549001D02*
X13778795Y14449001D01*
X13935204D01*
X13962001Y14549001D01*
Y14758998D01*
X10411990Y14414000D02*
X10412000Y14709001D01*
X10642002Y14414000D02*
Y14709001D01*
X10632000Y14549001D02*
Y14758998D01*
X10605208Y14449001D02*
X10632000Y14549001D01*
X10448794Y14449001D02*
X10605208D01*
X10422003Y14549001D02*
X10448794Y14449001D01*
X10422003Y14549001D02*
Y14758998D01*
Y14689001D02*
X10632000D01*
X11417002D02*
X11766999D01*
X12616999D02*
X12967001D01*
X13742001Y14414000D02*
Y14709001D01*
X13971999Y14414000D02*
Y14709001D01*
X13751997Y14689001D02*
X13962001D01*
X10816002Y13568999D02*
Y14414000D01*
X10486000Y13319000D02*
X10566000D01*
X10465000Y14143999D02*
X10584999D01*
X10425000Y14163998D02*
Y14383998D01*
Y14163998D02*
X10624999D01*
Y14383998D01*
X10235003D02*
X10815001D01*
X13797998Y14143999D02*
X13918002D01*
X13757999Y14163998D02*
Y14383998D01*
Y14163998D02*
X13958003D01*
Y14383998D01*
X13568001D02*
X14148000D01*
X13568001Y13568999D02*
Y14414000D01*
X13817998Y13319000D02*
X13897998D01*
X10814306Y14758998D02*
X13575499D01*
X10301002Y15073999D02*
X10750999D01*
X10321002Y15053999D02*
X10730999D01*
X10301002Y15034000D02*
X10750999D01*
X10301002Y14758998D02*
Y15034000D01*
X10321002Y15053999D01*
X10301002Y15073999D02*
X10321002Y15053999D01*
X10301002Y15073999D02*
Y15324001D01*
X10750999Y14758998D02*
Y15034000D01*
X10730999Y15053999D02*
X10750999Y15034000D01*
X10730999Y15053999D02*
X10750999Y15073999D01*
Y15324001D01*
X10701001Y15373997D02*
X10750999Y15324001D01*
X10301002D02*
X10750999D01*
X10301002D02*
X10350999Y15373997D01*
X10701001D01*
X13632999Y15324001D02*
X14083002D01*
X13632999Y15073999D02*
X14083002D01*
X13632999Y15034000D02*
X14083002D01*
X13652998Y15053999D02*
X14063000D01*
X13632999Y14758998D02*
Y15034000D01*
X13652998Y15053999D01*
X13632999Y15073999D02*
X13652998Y15053999D01*
X13632999Y15073999D02*
Y15324001D01*
X13683002Y15373997D01*
X14032999D01*
X14083002Y15324001D01*
Y15073999D02*
Y15324001D01*
X14063000Y15053999D02*
X14083002Y15073999D01*
X14063000Y15053999D02*
X14083002Y15034000D01*
Y14758998D02*
Y15034000D01*
X12967001Y14549001D02*
Y14758998D01*
X12926808Y14398999D02*
X12967001Y14549001D01*
X12657192Y14398999D02*
X12926808D01*
X12616999Y14549001D02*
X12657192Y14398999D01*
X12616999Y14549001D02*
Y14758998D01*
X12592001Y14414000D02*
Y14709001D01*
X12972000Y14414000D02*
Y14709001D01*
X10933000Y14509001D02*
X11411998D01*
X11792002D02*
X12592001D01*
X12972000D02*
X13450998D01*
X11411998Y14414000D02*
Y14709001D01*
X11417002Y14549001D02*
Y14758998D01*
Y14549001D02*
X11457195Y14398999D01*
X11726806D01*
X11766999Y14549001D01*
Y14758998D01*
X13962001Y14709001D02*
X14148950D01*
X11792002Y14414000D02*
Y14709001D01*
X10933000Y13284000D02*
Y14509001D01*
X10235003Y14414000D02*
X14149001D01*
X13450998Y13284000D02*
Y14509001D01*
X10235003Y13284000D02*
Y14758998D01*
X10814306D01*
X10883241Y14829001D02*
Y15231104D01*
X10932482Y15349001D02*
X13451521D01*
X13500761Y14829001D02*
Y15231104D01*
X13575499Y14758998D02*
X14149001D01*
Y13284000D02*
Y14758998D01*
X10235003Y13284000D02*
X14149001D01*
X4511999Y15266000D02*
X5011999D01*
Y14746001D02*
Y15266000D01*
X4476999Y14746001D02*
X9747001D01*
Y14656001D02*
Y14746001D01*
X4451998Y14656001D02*
X9772002D01*
X4451998Y14556001D02*
X5058087D01*
X5011999Y14506000D02*
Y14556001D01*
X4511999Y14506000D02*
X5011999D01*
X4511999D02*
Y14556001D01*
X9212001Y15266000D02*
X9712001D01*
Y14746001D02*
Y15266000D01*
X4511999Y14746001D02*
Y15266000D01*
X9212001Y14746001D02*
Y15266000D01*
X9772002Y13296001D02*
Y14656001D01*
X9152001Y13296001D02*
X9772002D01*
X9152001D02*
Y14656001D01*
X4451998Y13296001D02*
Y14656001D01*
Y13296001D02*
X5071999D01*
Y14656001D01*
X4451998Y14556001D02*
X5071999D01*
X9212001Y14506000D02*
X9712001D01*
X9212001D02*
Y14556001D01*
X9152001D02*
X9772002D01*
X4476999Y14656001D02*
Y14746001D01*
X9712001Y14506000D02*
Y14556001D01*
X5136872Y14746001D02*
Y15306001D01*
X5166872Y15336002D02*
X9057161D01*
X9087161Y14746001D02*
Y15306001D01*
X5071999Y14306000D02*
X9152001D01*
X5255049Y14206000D02*
X8968984D01*
Y14306000D01*
X5255049Y14206000D02*
Y14306000D01*
X5686999Y13462000D02*
Y14206000D01*
X5766999Y13462000D02*
Y14206000D01*
X5549999Y13716000D02*
Y14206000D01*
X5629999Y13716000D02*
Y14206000D01*
X5964000Y13462000D02*
Y14206000D01*
X6043999Y13462000D02*
Y14206000D01*
X5826999Y13716000D02*
Y14206000D01*
X5906999Y13716000D02*
Y14206000D01*
X6240999Y13462000D02*
Y14206000D01*
X6321000Y13462000D02*
Y14206000D01*
X6103999Y13716000D02*
Y14206000D01*
X6184000Y13716000D02*
Y14206000D01*
X6518000Y13462000D02*
Y14206000D01*
X6598000Y13462000D02*
Y14206000D01*
X6381000Y13716000D02*
Y14206000D01*
X6461000Y13716000D02*
Y14206000D01*
X6795000Y13462000D02*
Y14206000D01*
X6875000Y13462000D02*
Y14206000D01*
X6658000Y13716000D02*
Y14206000D01*
X6738000Y13716000D02*
Y14206000D01*
X7072000Y13462000D02*
Y14206000D01*
X7152000Y13462000D02*
Y14206000D01*
X6935000Y13716000D02*
Y14206000D01*
X7015000Y13716000D02*
Y14206000D01*
X7349000Y13462000D02*
Y14206000D01*
X7429000Y13462000D02*
Y14206000D01*
X7212000Y13716000D02*
Y14206000D01*
X7292000Y13716000D02*
Y14206000D01*
X7626000Y13462000D02*
Y14206000D01*
X7706000Y13462000D02*
Y14206000D01*
X7489000Y13716000D02*
Y14206000D01*
X7569000Y13716000D02*
Y14206000D01*
X7903000Y13462000D02*
Y14206000D01*
X7983001Y13462000D02*
Y14206000D01*
X7766000Y13716000D02*
Y14206000D01*
X7846000Y13716000D02*
Y14206000D01*
X8180001Y13462000D02*
Y14206000D01*
X8260000Y13462000D02*
Y14206000D01*
X8043000Y13716000D02*
Y14206000D01*
X8123001Y13716000D02*
Y14206000D01*
X8457001Y13462000D02*
Y14206000D01*
X8537001Y13462000D02*
Y14206000D01*
X8320001Y13716000D02*
Y14206000D01*
X8400001Y13716000D02*
Y14206000D01*
X8734001Y13462000D02*
Y14206000D01*
X8814001Y13462000D02*
Y14206000D01*
X8597001Y13716000D02*
Y14206000D01*
X8677001Y13716000D02*
Y14206000D01*
X5409999Y13462000D02*
Y14206000D01*
X5489999Y13462000D02*
Y14206000D01*
X9212001Y14506000D02*
X9712001D01*
X8277900Y1959052D02*
X8278255Y2898995D01*
X8359100Y1958994D02*
Y2898995D01*
X8453500D02*
Y3958995D01*
X8183500D02*
X8453500D01*
X8183500Y2898995D02*
Y3958995D01*
Y2898995D02*
X8453500D01*
X8277900Y4898938D02*
X8278255Y3958995D01*
X8359100D02*
Y4898996D01*
X10015800Y8403900D02*
X10405800D01*
Y8893500D01*
X10015800D02*
X10405800D01*
X10015800Y8403900D02*
Y8893500D01*
X7515000Y12521400D02*
X7725000D01*
X7515000Y12421400D02*
Y12521400D01*
Y12421400D02*
X7725000D01*
Y12521400D01*
X7515000Y12267400D02*
X7725000D01*
X7515000Y12167400D02*
Y12267400D01*
Y12167400D02*
X7725000D01*
Y12267400D01*
X7515000Y12013400D02*
X7725000D01*
X7515000Y11913400D02*
Y12013400D01*
Y11913400D02*
X7725000D01*
Y12013400D01*
X7395000Y11711400D02*
Y12596400D01*
X7845000D01*
Y11711400D02*
Y12596400D01*
X7395000Y11711400D02*
X7845000D01*
X7515000Y11886400D02*
X7725000D01*
X7515000Y11786400D02*
Y11886400D01*
Y11786400D02*
X7725000D01*
Y11886400D01*
X7515000Y12140400D02*
X7725000D01*
X7515000Y12040400D02*
Y12140400D01*
Y12040400D02*
X7725000D01*
Y12140400D01*
X7515000Y12394400D02*
X7725000D01*
X7515000Y12294400D02*
Y12394400D01*
Y12294400D02*
X7725000D01*
Y12394400D01*
X7640000Y12294400D02*
Y12394400D01*
Y12421400D02*
Y12521400D01*
Y11913400D02*
Y12013400D01*
Y11786400D02*
Y11886400D01*
Y12040400D02*
Y12140400D01*
Y12167400D02*
Y12267400D01*
X7907000Y12451400D02*
Y12491400D01*
X7845000D02*
X7907000D01*
X7845000Y12451400D02*
X7907000D01*
Y11816400D02*
Y11856400D01*
X7845000Y11816400D02*
X7907000D01*
X7845000Y11856400D02*
X7907000D01*
Y12324400D02*
Y12364400D01*
X7845000D02*
X7907000D01*
X7845000Y12324400D02*
X7907000D01*
Y12070400D02*
Y12110400D01*
X7845000Y12070400D02*
X7907000D01*
X7845000Y12110400D02*
X7907000D01*
Y11943400D02*
Y11983400D01*
X7845000Y11943400D02*
X7907000D01*
X7845000Y11983400D02*
X7907000D01*
Y12197400D02*
Y12237400D01*
X7845000D02*
X7907000D01*
X7845000Y12197400D02*
X7907000D01*
X7333000Y12324400D02*
Y12364400D01*
X7395000D01*
X7333000Y12324400D02*
X7395000D01*
X7333000Y12197400D02*
X7395000D01*
X7333000D02*
Y12237400D01*
X7395000D01*
X7333000Y12070400D02*
X7395000D01*
X7333000D02*
Y12110400D01*
X7395000D01*
X7333000Y11943400D02*
Y11983400D01*
X7395000D01*
X7333000Y11943400D02*
X7395000D01*
X7333000Y11816400D02*
X7395000D01*
X7333000D02*
Y11856400D01*
X7395000D01*
X7333000Y12451400D02*
Y12491400D01*
X7395000D01*
X7333000Y12451400D02*
X7395000D01*
X7955000Y12197400D02*
Y12237400D01*
X7907000D02*
X7955000D01*
X7907000Y12197400D02*
X7955000D01*
Y12324400D02*
Y12364400D01*
X7907000D02*
X7955000D01*
X7907000Y12324400D02*
X7955000D01*
Y12451400D02*
Y12491400D01*
X7907000D02*
X7955000D01*
X7907000Y12451400D02*
X7955000D01*
Y11816400D02*
Y11856400D01*
X7907000Y11816400D02*
X7955000D01*
X7907000Y11856400D02*
X7955000D01*
Y11943400D02*
Y11983400D01*
X7907000Y11943400D02*
X7955000D01*
X7907000Y11983400D02*
X7955000D01*
Y12070400D02*
Y12110400D01*
X7907000Y12070400D02*
X7955000D01*
X7907000Y12110400D02*
X7955000D01*
X7285000Y12324400D02*
Y12364400D01*
X7333000D01*
X7285000Y12324400D02*
X7333000D01*
X7285000Y12451400D02*
Y12491400D01*
X7333000D01*
X7285000Y12451400D02*
X7333000D01*
X7285000Y12070400D02*
Y12110400D01*
Y12070400D02*
X7333000D01*
X7285000Y12110400D02*
X7333000D01*
X7285000Y11943400D02*
Y11983400D01*
X7333000D01*
X7285000Y11943400D02*
X7333000D01*
X7285000Y12197400D02*
Y12237400D01*
Y12197400D02*
X7333000D01*
X7285000Y12237400D02*
X7333000D01*
X7285000Y11816400D02*
Y11856400D01*
Y11816400D02*
X7333000D01*
X7285000Y11856400D02*
X7333000D01*
X7650000Y12294400D02*
Y12394400D01*
Y12421400D02*
Y12521400D01*
Y11913400D02*
Y12013400D01*
Y11786400D02*
Y11886400D01*
Y12040400D02*
Y12140400D01*
Y12167400D02*
Y12267400D01*
X7660000Y12294400D02*
Y12394400D01*
Y12421400D02*
Y12521400D01*
Y11913400D02*
Y12013400D01*
Y11786400D02*
Y11886400D01*
Y12040400D02*
Y12140400D01*
Y12167400D02*
Y12267400D01*
X7670000Y12294400D02*
Y12394400D01*
Y12421400D02*
Y12521400D01*
Y11913400D02*
Y12013400D01*
Y11786400D02*
Y11886400D01*
Y12040400D02*
Y12140400D01*
Y12167400D02*
Y12267400D01*
X7680000Y12294400D02*
Y12394400D01*
Y12421400D02*
Y12521400D01*
Y11913400D02*
Y12013400D01*
Y11786400D02*
Y11886400D01*
Y12040400D02*
Y12140400D01*
Y12167400D02*
Y12267400D01*
X7690000Y12294400D02*
Y12394400D01*
Y12421400D02*
Y12521400D01*
Y11913400D02*
Y12013400D01*
Y11786400D02*
Y11886400D01*
Y12040400D02*
Y12140400D01*
Y12167400D02*
Y12267400D01*
X7700000Y12294400D02*
Y12394400D01*
Y12421400D02*
Y12521400D01*
Y11913400D02*
Y12013400D01*
Y11786400D02*
Y11886400D01*
Y12040400D02*
Y12140400D01*
Y12167400D02*
Y12267400D01*
X7710000Y12294400D02*
Y12394400D01*
Y12421400D02*
Y12521400D01*
Y11913400D02*
Y12013400D01*
Y11786400D02*
Y11886400D01*
Y12040400D02*
Y12140400D01*
Y12167400D02*
Y12267400D01*
X7720000Y12294400D02*
Y12394400D01*
Y12421400D02*
Y12521400D01*
Y11913400D02*
Y12013400D01*
Y11786400D02*
Y11886400D01*
Y12040400D02*
Y12140400D01*
Y12167400D02*
Y12267400D01*
X13484900Y1959052D02*
X13485255Y2898995D01*
X13566100Y1958994D02*
Y2898995D01*
X13660500D02*
Y3958995D01*
X13390500D02*
X13660500D01*
X13390500Y2898995D02*
Y3958995D01*
Y2898995D02*
X13660500D01*
X13484900Y4898938D02*
X13485255Y3958995D01*
X13566100D02*
Y4898996D01*
X8798600Y1959052D02*
X8798955Y2898995D01*
X8879800Y1958994D02*
Y2898995D01*
X8974200D02*
Y3958995D01*
X8704200D02*
X8974200D01*
X8704200Y2898995D02*
Y3958995D01*
Y2898995D02*
X8974200D01*
X8798600Y4898938D02*
X8798955Y3958995D01*
X8879800D02*
Y4898996D01*
X1013500Y1793952D02*
X1013855Y2733895D01*
X1094700Y1793894D02*
Y2733895D01*
X1189100D02*
Y3793895D01*
X919100D02*
X1189100D01*
X919100Y2733895D02*
Y3793895D01*
Y2733895D02*
X1189100D01*
X1013500Y4733838D02*
X1013855Y3793895D01*
X1094700D02*
Y4733896D01*
X6309400Y1959052D02*
X6309755Y2898995D01*
X6390600Y1958994D02*
Y2898995D01*
X6485000D02*
Y3958995D01*
X6215000D02*
X6485000D01*
X6215000Y2898995D02*
Y3958995D01*
Y2898995D02*
X6485000D01*
X6309400Y4898938D02*
X6309755Y3958995D01*
X6390600D02*
Y4898996D01*
X1458000Y1793952D02*
X1458355Y2733895D01*
X1539200Y1793894D02*
Y2733895D01*
X1633600D02*
Y3793895D01*
X1363600D02*
X1633600D01*
X1363600Y2733895D02*
Y3793895D01*
Y2733895D02*
X1633600D01*
X1458000Y4733838D02*
X1458355Y3793895D01*
X1539200D02*
Y4733896D01*
X3938100Y8951602D02*
Y9041600D01*
X3758100D02*
X3938100D01*
X3758100Y8951602D02*
Y9041600D01*
Y8951602D02*
X3938100D01*
Y8824602D02*
Y8914600D01*
X3758100D02*
X3938100D01*
X3758100Y8824602D02*
Y8914600D01*
Y8824602D02*
X3938100D01*
X3538101Y8745100D02*
Y9111099D01*
X4158100D01*
Y8745100D02*
Y9111099D01*
X3538101Y8745100D02*
X4158100D01*
X12356302Y2714401D02*
Y2924399D01*
X12256303D02*
X12356302D01*
X12256303Y2714401D02*
Y2924399D01*
Y2714401D02*
X12356302D01*
X12102302D02*
Y2924399D01*
X12002303D02*
X12102302D01*
X12002303Y2714401D02*
Y2924399D01*
Y2714401D02*
X12102302D01*
X11848302D02*
Y2924399D01*
X11748303D02*
X11848302D01*
X11748303Y2714401D02*
Y2924399D01*
Y2714401D02*
X11848302D01*
X11546302Y3044398D02*
X12431298D01*
Y2594402D02*
Y3044398D01*
X11546302Y2594402D02*
X12431298D01*
X11546302D02*
Y3044398D01*
X11721302Y2714401D02*
Y2924399D01*
X11621303D02*
X11721302D01*
X11621303Y2714401D02*
Y2924399D01*
Y2714401D02*
X11721302D01*
X11975302D02*
Y2924399D01*
X11875303D02*
X11975302D01*
X11875303Y2714401D02*
Y2924399D01*
Y2714401D02*
X11975302D01*
X12229302D02*
Y2924399D01*
X12129303D02*
X12229302D01*
X12129303Y2714401D02*
Y2924399D01*
Y2714401D02*
X12229302D01*
X12129303Y2799400D02*
X12229302D01*
X12256303D02*
X12356302D01*
X11748303D02*
X11848302D01*
X11621303D02*
X11721302D01*
X11875303D02*
X11975302D01*
X12002303D02*
X12102302D01*
X12286300Y2532400D02*
X12326300D01*
Y2594402D01*
X12286300Y2532400D02*
Y2594402D01*
X11651300Y2532400D02*
X11691300D01*
X11651300D02*
Y2594402D01*
X11691300Y2532400D02*
Y2594402D01*
X12159300Y2532400D02*
X12199300D01*
Y2594402D01*
X12159300Y2532400D02*
Y2594402D01*
X11905300Y2532400D02*
X11945300D01*
X11905300D02*
Y2594402D01*
X11945300Y2532400D02*
Y2594402D01*
X11778300Y2532400D02*
X11818300D01*
X11778300D02*
Y2594402D01*
X11818300Y2532400D02*
Y2594402D01*
X12032300Y2532400D02*
X12072300D01*
Y2594402D01*
X12032300Y2532400D02*
Y2594402D01*
X12159300Y3106400D02*
X12199300D01*
Y3044398D02*
Y3106400D01*
X12159300Y3044398D02*
Y3106400D01*
X12032300Y3044398D02*
Y3106400D01*
X12072300D01*
Y3044398D02*
Y3106400D01*
X11905300Y3044398D02*
Y3106400D01*
X11945300D01*
Y3044398D02*
Y3106400D01*
X11778300D02*
X11818300D01*
Y3044398D02*
Y3106400D01*
X11778300Y3044398D02*
Y3106400D01*
X11651300Y3044398D02*
Y3106400D01*
X11691300D01*
Y3044398D02*
Y3106400D01*
X12286300D02*
X12326300D01*
Y3044398D02*
Y3106400D01*
X12286300Y3044398D02*
Y3106400D01*
X12032300Y2484399D02*
X12072300D01*
Y2532400D01*
X12032300Y2484399D02*
Y2532400D01*
X12159300Y2484399D02*
X12199300D01*
Y2532400D01*
X12159300Y2484399D02*
Y2532400D01*
X12286300Y2484399D02*
X12326300D01*
Y2532400D01*
X12286300Y2484399D02*
Y2532400D01*
X11651300Y2484399D02*
X11691300D01*
X11651300D02*
Y2532400D01*
X11691300Y2484399D02*
Y2532400D01*
X11778300Y2484399D02*
X11818300D01*
X11778300D02*
Y2532400D01*
X11818300Y2484399D02*
Y2532400D01*
X11905300Y2484399D02*
X11945300D01*
X11905300D02*
Y2532400D01*
X11945300Y2484399D02*
Y2532400D01*
X12159300Y3154401D02*
X12199300D01*
Y3106400D02*
Y3154401D01*
X12159300Y3106400D02*
Y3154401D01*
X12286300D02*
X12326300D01*
Y3106400D02*
Y3154401D01*
X12286300Y3106400D02*
Y3154401D01*
X11905300D02*
X11945300D01*
X11905300Y3106400D02*
Y3154401D01*
X11945300Y3106400D02*
Y3154401D01*
X11778300D02*
X11818300D01*
Y3106400D02*
Y3154401D01*
X11778300Y3106400D02*
Y3154401D01*
X12032300D02*
X12072300D01*
X12032300Y3106400D02*
Y3154401D01*
X12072300Y3106400D02*
Y3154401D01*
X11651300D02*
X11691300D01*
X11651300Y3106400D02*
Y3154401D01*
X11691300Y3106400D02*
Y3154401D01*
X12129303Y2789403D02*
X12229302D01*
X12256303D02*
X12356302D01*
X11748303D02*
X11848302D01*
X11621303D02*
X11721302D01*
X11875303D02*
X11975302D01*
X12002303D02*
X12102302D01*
X12129303Y2779400D02*
X12229302D01*
X12256303D02*
X12356302D01*
X11748303D02*
X11848302D01*
X11621303D02*
X11721302D01*
X11875303D02*
X11975302D01*
X12002303D02*
X12102302D01*
X12129303Y2769403D02*
X12229302D01*
X12256303D02*
X12356302D01*
X11748303D02*
X11848302D01*
X11621303D02*
X11721302D01*
X11875303D02*
X11975302D01*
X12002303D02*
X12102302D01*
X12129303Y2759400D02*
X12229302D01*
X12256303D02*
X12356302D01*
X11748303D02*
X11848302D01*
X11621303D02*
X11721302D01*
X11875303D02*
X11975302D01*
X12002303D02*
X12102302D01*
X12129303Y2749398D02*
X12229302D01*
X12256303D02*
X12356302D01*
X11748303D02*
X11848302D01*
X11621303D02*
X11721302D01*
X11875303D02*
X11975302D01*
X12002303D02*
X12102302D01*
X12129303Y2739400D02*
X12229302D01*
X12256303D02*
X12356302D01*
X11748303D02*
X11848302D01*
X11621303D02*
X11721302D01*
X11875303D02*
X11975302D01*
X12002303D02*
X12102302D01*
X12129303Y2729398D02*
X12229302D01*
X12256303D02*
X12356302D01*
X11748303D02*
X11848302D01*
X11621303D02*
X11721302D01*
X11875303D02*
X11975302D01*
X12002303D02*
X12102302D01*
X12129303Y2719400D02*
X12229302D01*
X12256303D02*
X12356302D01*
X11748303D02*
X11848302D01*
X11621303D02*
X11721302D01*
X11875303D02*
X11975302D01*
X12002303D02*
X12102302D01*
X11363400Y11820100D02*
X12043401D01*
X11363400Y11367535D02*
Y11820100D01*
Y11367535D02*
X12043401Y11370100D01*
Y11820100D01*
X4669098Y6994200D02*
X5059100D01*
Y7483801D01*
X4669098D02*
X5059100D01*
X4669098Y6994200D02*
Y7483801D01*
X11281400Y9695200D02*
Y10015200D01*
X11121400Y9695200D02*
X11281400D01*
X11121400D02*
Y10015200D01*
X11281400D01*
X5827802Y6984702D02*
X5957800D01*
X5827802D02*
Y7264701D01*
X5957800D01*
Y6984702D02*
Y7264701D01*
X3154904Y15947301D02*
X3195096D01*
X3154904D02*
X3175000Y16022301D01*
X3195096Y15947301D01*
X3900518Y14070399D02*
X3936000D01*
X3854750Y14108902D02*
X3900518Y14070399D01*
X3812000Y13255600D02*
Y14089000D01*
X3854750Y13235698D02*
X3900518Y13274200D01*
X3936000D01*
X2414000D02*
X2449482D01*
X2495250Y13235698D01*
X2538000Y13255600D02*
Y14089000D01*
X2449482Y14070399D02*
X2495250Y14108902D01*
X2414000Y14070399D02*
X2449482D01*
X2412861Y14122301D02*
X2741265D01*
X2846735Y14121442D02*
X3503265D01*
X3608401Y14122301D02*
X3936000D01*
X2414000Y14428300D02*
X2729193D01*
X2858807D02*
X3491193D01*
X3620807D02*
X3936000D01*
X2414000Y14162300D02*
X3936000D01*
X2414000Y14502299D02*
X3936000D01*
X2414000Y15722301D02*
X3936000D01*
X2414000Y15747301D02*
X3936000D01*
Y13122301D02*
Y16022301D01*
X2414000Y13122301D02*
X3936000D01*
X2414000D02*
Y16022301D01*
X3936000D01*
X11121400Y10453200D02*
X11281400D01*
X11121400Y10463200D02*
X11281400D01*
X11121400Y10473200D02*
X11281400D01*
X11121400Y10483200D02*
X11281400D01*
X11121400Y10493200D02*
X11281400D01*
X11121400Y10503200D02*
X11281400D01*
X11121400Y10513200D02*
X11281400D01*
X11121400Y10523200D02*
X11281400D01*
Y10203200D02*
Y10523200D01*
X11121400Y10203200D02*
X11281400D01*
X11121400D02*
Y10523200D01*
X7801993Y1227069D02*
X7932636Y1151641D01*
X7760744Y1155624D02*
X7801993Y1227069D01*
X7760744Y1155624D02*
X7891386Y1080196D01*
X7932636Y1151641D01*
X7778336Y983803D02*
X7908978Y908380D01*
X7737086Y912358D02*
X7778336Y983803D01*
X7737086Y912358D02*
X7867728Y836930D01*
X7908978Y908380D01*
X13977734Y1227069D02*
X14018983Y1155624D01*
X13847325Y1151240D02*
X13977734Y1227069D01*
X13847325Y1151240D02*
X13888341Y1080196D01*
X14018983Y1155624D01*
X14001387Y983803D02*
X14042636Y912358D01*
X13911993Y836930D02*
X14042636Y912358D01*
X13870744Y908380D02*
X13911993Y836930D01*
X13870744Y908380D02*
X14001387Y983803D01*
X8711862Y622000D02*
X8789860D01*
X8849855D02*
X8927864D01*
X8987863D02*
X9065862D01*
X9125862D02*
X9203860D01*
X9263860D02*
X9341863D01*
X9401863D02*
X9479861D01*
X9539861D02*
X9617860D01*
X9677865D02*
X9755863D01*
X9815863D02*
X9893861D01*
X9953861D02*
X10031864D01*
X10091864D02*
X10169863D01*
X10229862D02*
X10307861D01*
X10367861D02*
X10445864D01*
X10505864D02*
X10583862D01*
X10643862D02*
X10721860D01*
X10781860D02*
X10859864D01*
X10919864D02*
X10997862D01*
X11057862D02*
X11135865D01*
X11195865D02*
X11273863D01*
X11333863D02*
X11411862D01*
X11471861D02*
X11549865D01*
X11609865D02*
X11687863D01*
X11747863D02*
X11825861D01*
X11885861D02*
X11963865D01*
X12023864D02*
X12101863D01*
X12161863D02*
X12239866D01*
X12299866D02*
X12377864D01*
X12437864D02*
X12515862D01*
X12575862D02*
X12653866D01*
X12713866D02*
X12791864D01*
X12851865D02*
X12929861D01*
X12989862D02*
X13067865D01*
X13127866D02*
X13239864D01*
X12653866Y331998D02*
Y1016000D01*
X12713866Y331998D02*
Y1016000D01*
X8927864Y331998D02*
Y1270000D01*
X8987863Y331998D02*
Y1270000D01*
X9065862Y331998D02*
Y1016000D01*
X9125862Y331998D02*
Y1016000D01*
X9203860Y331998D02*
Y1270000D01*
X9263860Y331998D02*
Y1270000D01*
X9341863Y331998D02*
Y1016000D01*
X9401863Y331998D02*
Y1016000D01*
X9479861Y331998D02*
Y1270000D01*
X9539861Y331998D02*
Y1270000D01*
X9617860Y331998D02*
Y1016000D01*
X9677865Y331998D02*
Y1016000D01*
X9755863Y331998D02*
Y1270000D01*
X9815863Y331998D02*
Y1270000D01*
X9893861Y331998D02*
Y1016000D01*
X9953861Y331998D02*
Y1016000D01*
X10031864Y331998D02*
Y1270000D01*
X10091864Y331998D02*
Y1270000D01*
X10169863Y331998D02*
Y1016000D01*
X10229862Y331998D02*
Y1016000D01*
X10307861Y331998D02*
Y1270000D01*
X10367861Y331998D02*
Y1270000D01*
X10445864Y331998D02*
Y1016000D01*
X10505864Y331998D02*
Y1016000D01*
X10583862Y331998D02*
Y1270000D01*
X10643862Y331998D02*
Y1270000D01*
X10721860Y331998D02*
Y1016000D01*
X10781860Y331998D02*
Y1016000D01*
X10859864Y331998D02*
Y1270000D01*
X10919864Y331998D02*
Y1270000D01*
X10997862Y331998D02*
Y1016000D01*
X11057862Y331998D02*
Y1016000D01*
X11135865Y331998D02*
Y1270000D01*
X11195865Y331998D02*
Y1270000D01*
X11273863Y331998D02*
Y1016000D01*
X11333863Y331998D02*
Y1016000D01*
X11411862Y331998D02*
Y1270000D01*
X11471861Y331998D02*
Y1270000D01*
X11549865Y331998D02*
Y1016000D01*
X11609865Y331998D02*
Y1016000D01*
X11687863Y331998D02*
Y1270000D01*
X11747863Y331998D02*
Y1270000D01*
X11825861Y331998D02*
Y1016000D01*
X11885861Y331998D02*
Y1016000D01*
X11963865Y331998D02*
Y1270000D01*
X12023864Y331998D02*
Y1270000D01*
X12101863Y331998D02*
Y1016000D01*
X12161863Y331998D02*
Y1016000D01*
X12239866Y331998D02*
Y1270000D01*
X12299866Y331998D02*
Y1270000D01*
X12377864Y331998D02*
Y1016000D01*
X12437864Y331998D02*
Y1016000D01*
X12791864Y331998D02*
Y1270000D01*
X12851865Y331998D02*
Y1270000D01*
X12515862Y331998D02*
Y1270000D01*
X12575862Y331998D02*
Y1270000D01*
X8651862Y331998D02*
Y1270000D01*
X8711862Y331998D02*
Y1270000D01*
X8789860Y331998D02*
Y1016000D01*
X8849850Y331998D02*
X8849860Y1016000D01*
X12929861Y331998D02*
Y1016000D01*
X12989862Y331998D02*
Y1016000D01*
X13067865Y331998D02*
Y1270000D01*
X13127866Y331998D02*
Y1270000D01*
X8264863Y-847999D02*
Y-278003D01*
X13514865Y-847999D02*
Y-278003D01*
X8314865Y-898002D02*
X13464862D01*
X13239864Y331998D02*
Y1472001D01*
X8239859Y622000D02*
X8651862D01*
X8239864Y331998D02*
Y1472001D01*
X8176435Y171999D02*
X8179859Y331998D01*
X13599863D01*
Y171999D02*
Y331998D01*
X7539860Y171999D02*
X14239867D01*
X7539860Y-228001D02*
X14239867D01*
X7539860Y1472001D02*
X14239867D01*
X7539860Y-278003D02*
Y1472001D01*
Y-278003D02*
X14239867D01*
Y1472001D01*
X11125238Y4553400D02*
X11169790Y4576103D01*
X11129551Y3985456D02*
X11182211Y3882099D01*
X11226762Y3904801D01*
X11174098Y4008154D02*
X11226762Y3904801D01*
X11129551Y3985456D02*
X11174098Y4008154D01*
X11125238Y4553400D02*
X11177903Y4450043D01*
X11222449Y4472745D01*
X11169790Y4576103D02*
X11222449Y4472745D01*
X620527Y1227069D02*
X751169Y1151641D01*
X579277Y1155624D02*
X620527Y1227069D01*
X579277Y1155624D02*
X709920Y1080196D01*
X751169Y1151641D01*
X596875Y983803D02*
X727517Y908380D01*
X555625Y912358D02*
X596875Y983803D01*
X555625Y912358D02*
X686267Y836930D01*
X727517Y908380D01*
X6796268Y1227069D02*
X6837517Y1155624D01*
X6665859Y1151240D02*
X6796268Y1227069D01*
X6665859Y1151240D02*
X6706875Y1080196D01*
X6837517Y1155624D01*
X6819925Y983803D02*
X6861175Y912358D01*
X6730533Y836930D02*
X6861175Y912358D01*
X6689283Y908380D02*
X6730533Y836930D01*
X6689283Y908380D02*
X6819925Y983803D01*
X1530396Y622000D02*
X1608399D01*
X1668389D02*
X1746397D01*
X1806397D02*
X1884396D01*
X1944395D02*
X2022399D01*
X2082399D02*
X2160397D01*
X2220397D02*
X2298400D01*
X2358400D02*
X2436398D01*
X2496398D02*
X2574397D01*
X2634397D02*
X2712400D01*
X2772400D02*
X2850398D01*
X2910398D02*
X2988396D01*
X3048396D02*
X3126400D01*
X3186400D02*
X3264398D01*
X3324398D02*
X3402396D01*
X3462401D02*
X3540399D01*
X3600399D02*
X3678398D01*
X3738397D02*
X3816401D01*
X3876401D02*
X3954399D01*
X4014399D02*
X4092397D01*
X4152397D02*
X4230400D01*
X4290400D02*
X4368399D01*
X4428399D02*
X4506397D01*
X4566397D02*
X4644400D01*
X4704400D02*
X4782398D01*
X4842398D02*
X4920402D01*
X4980402D02*
X5058400D01*
X5118400D02*
X5196398D01*
X5256398D02*
X5334401D01*
X5394401D02*
X5472400D01*
X5532399D02*
X5610398D01*
X5670398D02*
X5748401D01*
X5808401D02*
X5886399D01*
X5946399D02*
X6058398D01*
X5472400Y331998D02*
Y1016000D01*
X5532399Y331998D02*
Y1016000D01*
X1746397Y331998D02*
Y1270000D01*
X1806397Y331998D02*
Y1270000D01*
X1884396Y331998D02*
Y1016000D01*
X1944395Y331998D02*
Y1016000D01*
X2022399Y331998D02*
Y1270000D01*
X2082399Y331998D02*
Y1270000D01*
X2160397Y331998D02*
Y1016000D01*
X2220397Y331998D02*
Y1016000D01*
X2298400Y331998D02*
Y1270000D01*
X2358400Y331998D02*
Y1270000D01*
X2436398Y331998D02*
Y1016000D01*
X2496398Y331998D02*
Y1016000D01*
X2574397Y331998D02*
Y1270000D01*
X2634397Y331998D02*
Y1270000D01*
X2712400Y331998D02*
Y1016000D01*
X2772400Y331998D02*
Y1016000D01*
X2850398Y331998D02*
Y1270000D01*
X2910398Y331998D02*
Y1270000D01*
X2988396Y331998D02*
Y1016000D01*
X3048396Y331998D02*
Y1016000D01*
X3126400Y331998D02*
Y1270000D01*
X3186400Y331998D02*
Y1270000D01*
X3264398Y331998D02*
Y1016000D01*
X3324398Y331998D02*
Y1016000D01*
X3402396Y331998D02*
Y1270000D01*
X3462401Y331998D02*
Y1270000D01*
X3540399Y331998D02*
Y1016000D01*
X3600399Y331998D02*
Y1016000D01*
X3678398Y331998D02*
Y1270000D01*
X3738397Y331998D02*
Y1270000D01*
X3816401Y331998D02*
Y1016000D01*
X3876401Y331998D02*
Y1016000D01*
X3954399Y331998D02*
Y1270000D01*
X4014399Y331998D02*
Y1270000D01*
X4092397Y331998D02*
Y1016000D01*
X4152397Y331998D02*
Y1016000D01*
X4230400Y331998D02*
Y1270000D01*
X4290400Y331998D02*
Y1270000D01*
X4368399Y331998D02*
Y1016000D01*
X4428399Y331998D02*
Y1016000D01*
X4506397Y331998D02*
Y1270000D01*
X4566397Y331998D02*
Y1270000D01*
X4644400Y331998D02*
Y1016000D01*
X4704400Y331998D02*
Y1016000D01*
X4782398Y331998D02*
Y1270000D01*
X4842398Y331998D02*
Y1270000D01*
X4920402Y331998D02*
Y1016000D01*
X4980402Y331998D02*
Y1016000D01*
X5058400Y331998D02*
Y1270000D01*
X5118400Y331998D02*
Y1270000D01*
X5196398Y331998D02*
Y1016000D01*
X5256398Y331998D02*
Y1016000D01*
X5610398Y331998D02*
Y1270000D01*
X5670398Y331998D02*
Y1270000D01*
X5334401Y331998D02*
Y1270000D01*
X5394401Y331998D02*
Y1270000D01*
X1470396Y331998D02*
Y1270000D01*
X1530396Y331998D02*
Y1270000D01*
X1608399Y331998D02*
Y1016000D01*
X1668384Y331998D02*
X1668399Y1016000D01*
X5748401Y331998D02*
Y1016000D01*
X5808401Y331998D02*
Y1016000D01*
X5886399Y331998D02*
Y1270000D01*
X5946399Y331998D02*
Y1270000D01*
X1083396Y-847999D02*
Y-277998D01*
X6333399Y-847999D02*
Y-277998D01*
X1133399Y-898002D02*
X6283401D01*
X6058398Y331998D02*
Y1472001D01*
X1058398Y622000D02*
X1470396D01*
X1058398Y331998D02*
Y1472001D01*
X994974Y171999D02*
X998398Y331998D01*
X6418402D01*
Y171999D02*
Y331998D01*
X358399Y171999D02*
X7058401D01*
X358399Y-228001D02*
X7058401D01*
X358399Y1472001D02*
X7058401D01*
X358399Y-277998D02*
Y1472001D01*
Y-277998D02*
X7058401D01*
Y1472001D01*
X2190613Y3869400D02*
X2235164Y3892098D01*
X2178187Y4563400D02*
X2230852Y4460042D01*
X2133636Y4540702D02*
X2178187Y4563400D01*
X2133636Y4540702D02*
X2186300Y4437344D01*
X2230852Y4460042D01*
X2182500Y3995456D02*
X2235164Y3892098D01*
X2137948Y3972758D02*
X2182500Y3995456D01*
X2137948Y3972758D02*
X2190613Y3869400D01*
X5588036Y4553402D02*
X5632587Y4576100D01*
X5592348Y3985458D02*
X5645013Y3882100D01*
X5689564Y3904798D01*
X5636900Y4008156D02*
X5689564Y3904798D01*
X5592348Y3985458D02*
X5636900Y4008156D01*
X5588036Y4553402D02*
X5640700Y4450044D01*
X5685252Y4472742D01*
X5632587Y4576100D02*
X5685252Y4472742D01*
X3924336Y4553402D02*
X3968887Y4576100D01*
X3928648Y3985458D02*
X3981313Y3882100D01*
X4025864Y3904798D01*
X3973200Y4008156D02*
X4025864Y3904798D01*
X3928648Y3985458D02*
X3973200Y4008156D01*
X3924336Y4553402D02*
X3977000Y4450044D01*
X4021552Y4472742D01*
X3968887Y4576100D02*
X4021552Y4472742D01*
X9391513Y3882099D02*
X9436064Y3904801D01*
X9379087Y4576103D02*
X9431751Y4472745D01*
X9334535Y4553400D02*
X9379087Y4576103D01*
X9334535Y4553400D02*
X9387200Y4450043D01*
X9431751Y4472745D01*
X9383400Y4008154D02*
X9436064Y3904801D01*
X9338848Y3985456D02*
X9383400Y4008154D01*
X9338848Y3985456D02*
X9391513Y3882099D01*
X12776237Y4553400D02*
X12820789Y4576103D01*
X12780550Y3985456D02*
X12833215Y3882099D01*
X12877760Y3904801D01*
X12825102Y4008154D02*
X12877760Y3904801D01*
X12780550Y3985456D02*
X12825102Y4008154D01*
X12776237Y4553400D02*
X12828902Y4450043D01*
X12873453Y4472745D01*
X12820789Y4576103D02*
X12873453Y4472745D01*
X5142701Y2714401D02*
Y2924399D01*
X5042702D02*
X5142701D01*
X5042702Y2714401D02*
Y2924399D01*
Y2714401D02*
X5142701D01*
X4888701D02*
Y2924399D01*
X4788702D02*
X4888701D01*
X4788702Y2714401D02*
Y2924399D01*
Y2714401D02*
X4888701D01*
X4634701D02*
Y2924399D01*
X4534702D02*
X4634701D01*
X4534702Y2714401D02*
Y2924399D01*
Y2714401D02*
X4634701D01*
X4332701Y3044398D02*
X5217703D01*
Y2594402D02*
Y3044398D01*
X4332701Y2594402D02*
X5217703D01*
X4332701D02*
Y3044398D01*
X4507701Y2714401D02*
Y2924399D01*
X4407702D02*
X4507701D01*
X4407702Y2714401D02*
Y2924399D01*
Y2714401D02*
X4507701D01*
X4761701D02*
Y2924399D01*
X4661702D02*
X4761701D01*
X4661702Y2714401D02*
Y2924399D01*
Y2714401D02*
X4761701D01*
X5015701D02*
Y2924399D01*
X4915702D02*
X5015701D01*
X4915702Y2714401D02*
Y2924399D01*
Y2714401D02*
X5015701D01*
X4915702Y2799400D02*
X5015701D01*
X5042702D02*
X5142701D01*
X4534702D02*
X4634701D01*
X4407702D02*
X4507701D01*
X4661702D02*
X4761701D01*
X4788702D02*
X4888701D01*
X5072699Y2532400D02*
X5112699D01*
Y2594402D01*
X5072699Y2532400D02*
Y2594402D01*
X4437699Y2532400D02*
X4477699D01*
X4437699D02*
Y2594402D01*
X4477699Y2532400D02*
Y2594402D01*
X4945699Y2532400D02*
X4985699D01*
Y2594402D01*
X4945699Y2532400D02*
Y2594402D01*
X4691699Y2532400D02*
X4731699D01*
X4691699D02*
Y2594402D01*
X4731699Y2532400D02*
Y2594402D01*
X4564699Y2532400D02*
X4604699D01*
X4564699D02*
Y2594402D01*
X4604699Y2532400D02*
Y2594402D01*
X4818699Y2532400D02*
X4858699D01*
Y2594402D01*
X4818699Y2532400D02*
Y2594402D01*
X4945699Y3106400D02*
X4985699D01*
Y3044398D02*
Y3106400D01*
X4945699Y3044398D02*
Y3106400D01*
X4818699Y3044398D02*
Y3106400D01*
X4858699D01*
Y3044398D02*
Y3106400D01*
X4691699Y3044398D02*
Y3106400D01*
X4731699D01*
Y3044398D02*
Y3106400D01*
X4564699D02*
X4604699D01*
Y3044398D02*
Y3106400D01*
X4564699Y3044398D02*
Y3106400D01*
X4437699Y3044398D02*
Y3106400D01*
X4477699D01*
Y3044398D02*
Y3106400D01*
X5072699D02*
X5112699D01*
Y3044398D02*
Y3106400D01*
X5072699Y3044398D02*
Y3106400D01*
X4818699Y2484399D02*
X4858699D01*
Y2532400D01*
X4818699Y2484399D02*
Y2532400D01*
X4945699Y2484399D02*
X4985699D01*
Y2532400D01*
X4945699Y2484399D02*
Y2532400D01*
X5072699Y2484399D02*
X5112699D01*
Y2532400D01*
X5072699Y2484399D02*
Y2532400D01*
X4437699Y2484399D02*
X4477699D01*
X4437699D02*
Y2532400D01*
X4477699Y2484399D02*
Y2532400D01*
X4564699Y2484399D02*
X4604699D01*
X4564699D02*
Y2532400D01*
X4604699Y2484399D02*
Y2532400D01*
X4691699Y2484399D02*
X4731699D01*
X4691699D02*
Y2532400D01*
X4731699Y2484399D02*
Y2532400D01*
X4945699Y3154401D02*
X4985699D01*
Y3106400D02*
Y3154401D01*
X4945699Y3106400D02*
Y3154401D01*
X5072699D02*
X5112699D01*
Y3106400D02*
Y3154401D01*
X5072699Y3106400D02*
Y3154401D01*
X4691699D02*
X4731699D01*
X4691699Y3106400D02*
Y3154401D01*
X4731699Y3106400D02*
Y3154401D01*
X4564699D02*
X4604699D01*
Y3106400D02*
Y3154401D01*
X4564699Y3106400D02*
Y3154401D01*
X4818699D02*
X4858699D01*
X4818699Y3106400D02*
Y3154401D01*
X4858699Y3106400D02*
Y3154401D01*
X4437699D02*
X4477699D01*
X4437699Y3106400D02*
Y3154401D01*
X4477699Y3106400D02*
Y3154401D01*
X4915702Y2789403D02*
X5015701D01*
X5042702D02*
X5142701D01*
X4534702D02*
X4634701D01*
X4407702D02*
X4507701D01*
X4661702D02*
X4761701D01*
X4788702D02*
X4888701D01*
X4915702Y2779400D02*
X5015701D01*
X5042702D02*
X5142701D01*
X4534702D02*
X4634701D01*
X4407702D02*
X4507701D01*
X4661702D02*
X4761701D01*
X4788702D02*
X4888701D01*
X4915702Y2769403D02*
X5015701D01*
X5042702D02*
X5142701D01*
X4534702D02*
X4634701D01*
X4407702D02*
X4507701D01*
X4661702D02*
X4761701D01*
X4788702D02*
X4888701D01*
X4915702Y2759400D02*
X5015701D01*
X5042702D02*
X5142701D01*
X4534702D02*
X4634701D01*
X4407702D02*
X4507701D01*
X4661702D02*
X4761701D01*
X4788702D02*
X4888701D01*
X4915702Y2749398D02*
X5015701D01*
X5042702D02*
X5142701D01*
X4534702D02*
X4634701D01*
X4407702D02*
X4507701D01*
X4661702D02*
X4761701D01*
X4788702D02*
X4888701D01*
X4915702Y2739400D02*
X5015701D01*
X5042702D02*
X5142701D01*
X4534702D02*
X4634701D01*
X4407702D02*
X4507701D01*
X4661702D02*
X4761701D01*
X4788702D02*
X4888701D01*
X4915702Y2729398D02*
X5015701D01*
X5042702D02*
X5142701D01*
X4534702D02*
X4634701D01*
X4407702D02*
X4507701D01*
X4661702D02*
X4761701D01*
X4788702D02*
X4888701D01*
X4915702Y2719400D02*
X5015701D01*
X5042702D02*
X5142701D01*
X4534702D02*
X4634701D01*
X4407702D02*
X4507701D01*
X4661702D02*
X4761701D01*
X4788702D02*
X4888701D01*
X4643700Y5813102D02*
X5033697D01*
Y6302703D01*
X4643700D02*
X5033697D01*
X4643700Y5813102D02*
Y6302703D01*
X10015801Y5838502D02*
X10405802D01*
Y6328103D01*
X10015801D02*
X10405802D01*
X10015801Y5838502D02*
Y6328103D01*
X7120201Y6994200D02*
Y7483801D01*
X7510202D01*
Y6994200D02*
Y7483801D01*
X7120201Y6994200D02*
X7510202D01*
X4643698Y8403901D02*
X5033699D01*
Y8893501D01*
X4643698D02*
X5033699D01*
X4643698Y8403901D02*
Y8893501D01*
X7120200Y8403900D02*
X7510202D01*
Y8893501D01*
X7120200D02*
X7510202D01*
X7120200Y8403900D02*
Y8893501D01*
X5827802Y7314902D02*
X5957799D01*
X5827802D02*
Y7594901D01*
X5957799D01*
Y7314902D02*
Y7594901D01*
X1249904Y15947301D02*
X1290096D01*
X1249904D02*
X1270000Y16022301D01*
X1290096Y15947301D01*
X1995518Y14070399D02*
X2031000D01*
X1949750Y14108902D02*
X1995518Y14070399D01*
X1907000Y13255600D02*
Y14089000D01*
X1949750Y13235698D02*
X1995518Y13274200D01*
X2031000D01*
X509000D02*
X544482D01*
X590250Y13235698D01*
X633000Y13255600D02*
Y14089000D01*
X544482Y14070399D02*
X590250Y14108902D01*
X509000Y14070399D02*
X544482D01*
X507861Y14122301D02*
X836265D01*
X941735Y14121442D02*
X1598265D01*
X1703401Y14122301D02*
X2031000D01*
X509000Y14428300D02*
X824193D01*
X953807D02*
X1586193D01*
X1715807D02*
X2031000D01*
X509000Y14162300D02*
X2031000D01*
X509000Y14502299D02*
X2031000D01*
X509000Y15722301D02*
X2031000D01*
X509000Y15747301D02*
X2031000D01*
Y13122301D02*
Y16022301D01*
X509000Y13122301D02*
X2031000D01*
X509000D02*
Y16022301D01*
X2031000D01*
X12493000Y10453200D02*
X12653000D01*
X12493000Y10463200D02*
X12653000D01*
X12493000Y10473200D02*
X12653000D01*
X12493000Y10483200D02*
X12653000D01*
X12493000Y10493200D02*
X12653000D01*
X12493000Y10503200D02*
X12653000D01*
X12493000Y10513200D02*
X12653000D01*
X12493000Y10523200D02*
X12653000D01*
Y10203200D02*
Y10523200D01*
X12493000Y10203200D02*
X12653000D01*
X12493000D02*
Y10523200D01*
X12213600Y10453200D02*
X12373600D01*
X12213600Y10463200D02*
X12373600D01*
X12213600Y10473200D02*
X12373600D01*
X12213600Y10483200D02*
X12373600D01*
X12213600Y10493200D02*
X12373600D01*
X12213600Y10503200D02*
X12373600D01*
X12213600Y10513200D02*
X12373600D01*
X12213600Y10523200D02*
X12373600D01*
Y10203200D02*
Y10523200D01*
X12213600Y10203200D02*
X12373600D01*
X12213600D02*
Y10523200D01*
X11946900Y10453200D02*
X12106900D01*
X11946900Y10463200D02*
X12106900D01*
X11946900Y10473200D02*
X12106900D01*
X11946900Y10483200D02*
X12106900D01*
X11946900Y10493200D02*
X12106900D01*
X11946900Y10503200D02*
X12106900D01*
X11946900Y10513200D02*
X12106900D01*
X11946900Y10523200D02*
X12106900D01*
Y10203200D02*
Y10523200D01*
X11946900Y10203200D02*
X12106900D01*
X11946900D02*
Y10523200D01*
X11680200Y10453200D02*
X11840200D01*
X11680200Y10463200D02*
X11840200D01*
X11680200Y10473200D02*
X11840200D01*
X11680200Y10483200D02*
X11840200D01*
X11680200Y10493200D02*
X11840200D01*
X11680200Y10503200D02*
X11840200D01*
X11680200Y10513200D02*
X11840200D01*
X11680200Y10523200D02*
X11840200D01*
Y10203200D02*
Y10523200D01*
X11680200Y10203200D02*
X11840200D01*
X11680200D02*
Y10523200D01*
X11400800Y10453200D02*
X11560800D01*
X11400800Y10463200D02*
X11560800D01*
X11400800Y10473200D02*
X11560800D01*
X11400800Y10483200D02*
X11560800D01*
X11400800Y10493200D02*
X11560800D01*
X11400800Y10503200D02*
X11560800D01*
X11400800Y10513200D02*
X11560800D01*
X11400800Y10523200D02*
X11560800D01*
Y10203200D02*
Y10523200D01*
X11400800Y10203200D02*
X11560800D01*
X11400800D02*
Y10523200D01*
X12653000Y9695200D02*
Y10015200D01*
X12493000Y9695200D02*
X12653000D01*
X12493000D02*
Y10015200D01*
X12653000D01*
X12373600Y9695200D02*
Y10015200D01*
X12213600Y9695200D02*
X12373600D01*
X12213600D02*
Y10015200D01*
X12373600D01*
X12106900Y9695200D02*
Y10015200D01*
X11946900Y9695200D02*
X12106900D01*
X11946900D02*
Y10015200D01*
X12106900D01*
X11840200Y9689900D02*
Y10009900D01*
X11680200Y9689900D02*
X11840200D01*
X11680200D02*
Y10009900D01*
X11840200D01*
X11560800Y9689900D02*
Y10009900D01*
X11400800Y9689900D02*
X11560800D01*
X11400800D02*
Y10009900D01*
X11560800D01*
%TF.MD5,fb3b80faa74ed3b2e6056e60fc738a95*%
M02*
