%TF.GenerationSoftware,Altium Limited,Altium Designer,19.1.5 (86)*%
G04 Layer_Color=255*
%FSLAX45Y45*%
%MOMM*%
%TF.FileFunction,Pads,Bot*%
%TF.Part,Single*%
G01*
G75*
%TA.AperFunction,ComponentPad*%
%ADD24C,1.60000*%
%ADD25C,3.90000*%
%ADD26C,1.70000*%
%ADD27C,5.50000*%
%ADD28C,1.80000*%
%ADD29C,2.00000*%
%ADD30C,3.80000*%
%TA.AperFunction,WasherPad*%
%ADD31C,3.20000*%
D24*
X7404098Y10541015D02*
D03*
Y10795015D02*
D03*
X7150098Y10541015D02*
D03*
Y10795015D02*
D03*
X6896098Y10541015D02*
D03*
Y10795015D02*
D03*
X6642098D02*
D03*
Y10541015D02*
D03*
X6388098Y10795015D02*
D03*
Y10541015D02*
D03*
X7912098Y10795015D02*
D03*
Y10541015D02*
D03*
X7658098Y10795015D02*
D03*
Y10541015D02*
D03*
X5589999Y13716000D02*
D03*
X5866999D02*
D03*
X6143999D02*
D03*
X6421000D02*
D03*
X6698000D02*
D03*
X6975000D02*
D03*
X7252000D02*
D03*
X7529000D02*
D03*
X7806000D02*
D03*
X8083001D02*
D03*
X8360001D02*
D03*
X8637001D02*
D03*
X5449999Y13462000D02*
D03*
X5726999D02*
D03*
X6003999D02*
D03*
X6281000D02*
D03*
X7389000D02*
D03*
X7112000D02*
D03*
X6558000D02*
D03*
X7666000D02*
D03*
X7943000D02*
D03*
X8220001D02*
D03*
X8497001D02*
D03*
X8774001D02*
D03*
X6835000D02*
D03*
D25*
X10526000Y13588998D02*
D03*
X13857999D02*
D03*
D26*
X13150999Y13461998D02*
D03*
X12876999D02*
D03*
X12602999D02*
D03*
X12328999D02*
D03*
X12054999D02*
D03*
X11780999D02*
D03*
X11506999D02*
D03*
X11232999D02*
D03*
X11370002Y13715997D02*
D03*
X11644002D02*
D03*
X11918002D02*
D03*
X12192002D02*
D03*
X12466001D02*
D03*
X12740001D02*
D03*
X13014001D02*
D03*
X8681865Y1270000D02*
D03*
X8957866D02*
D03*
X9233862D02*
D03*
X9509864D02*
D03*
X9785865D02*
D03*
X10061862D02*
D03*
X10337863D02*
D03*
X10613865D02*
D03*
X10889866D02*
D03*
X11165863D02*
D03*
X11441864D02*
D03*
X11717866D02*
D03*
X11993862D02*
D03*
X12269863D02*
D03*
X12545865D02*
D03*
X12821866D02*
D03*
X13097862D02*
D03*
X8819863Y1016000D02*
D03*
X9095864D02*
D03*
X9371866D02*
D03*
X9647862D02*
D03*
X9923864D02*
D03*
X10199865D02*
D03*
X10475861D02*
D03*
X10751863D02*
D03*
X11027864D02*
D03*
X11303866D02*
D03*
X11579862D02*
D03*
X11855864D02*
D03*
X12131865D02*
D03*
X12407862D02*
D03*
X12683863D02*
D03*
X12959865D02*
D03*
X8681865Y762000D02*
D03*
X8957866D02*
D03*
X9233862D02*
D03*
X9509864D02*
D03*
X9785865D02*
D03*
X10061862D02*
D03*
X10337863D02*
D03*
X10613865D02*
D03*
X10889866D02*
D03*
X11165863D02*
D03*
X11441864D02*
D03*
X11717866D02*
D03*
X11993862D02*
D03*
X12269863D02*
D03*
X12545865D02*
D03*
X12821866D02*
D03*
X13097862D02*
D03*
X1500398Y1270000D02*
D03*
X1776400D02*
D03*
X2052401D02*
D03*
X2328398D02*
D03*
X2604399D02*
D03*
X2880401D02*
D03*
X3156402D02*
D03*
X3432399D02*
D03*
X3708400D02*
D03*
X3984401D02*
D03*
X4260398D02*
D03*
X4536399D02*
D03*
X4812401D02*
D03*
X5088402D02*
D03*
X5364399D02*
D03*
X5640400D02*
D03*
X5916402D02*
D03*
X1638402Y1016000D02*
D03*
X1914398D02*
D03*
X2190399D02*
D03*
X2466401D02*
D03*
X2742397D02*
D03*
X3018399D02*
D03*
X3294400D02*
D03*
X3570402D02*
D03*
X3846398D02*
D03*
X4122400D02*
D03*
X4398401D02*
D03*
X4674398D02*
D03*
X4950399D02*
D03*
X5226401D02*
D03*
X5502397D02*
D03*
X5778398D02*
D03*
X1500398Y762000D02*
D03*
X1776400D02*
D03*
X2052401D02*
D03*
X2328398D02*
D03*
X2604399D02*
D03*
X2880401D02*
D03*
X3156402D02*
D03*
X3432399D02*
D03*
X3708400D02*
D03*
X3984401D02*
D03*
X4260398D02*
D03*
X4536399D02*
D03*
X4812401D02*
D03*
X5088397D02*
D03*
X5364399D02*
D03*
X5640400D02*
D03*
X5916402D02*
D03*
D27*
X4761999Y13589000D02*
D03*
X9462001D02*
D03*
D28*
X8318500Y1958994D02*
D03*
Y4898996D02*
D03*
X13525500Y1958994D02*
D03*
Y4898996D02*
D03*
X8839200Y1958994D02*
D03*
Y4898996D02*
D03*
X1054100Y1793894D02*
D03*
Y4733896D02*
D03*
X6350000Y1958994D02*
D03*
Y4898996D02*
D03*
X1498600Y1793894D02*
D03*
Y4733896D02*
D03*
D29*
X3556000Y13322301D02*
D03*
X2794000D02*
D03*
X3556000Y14084300D02*
D03*
X2794000D02*
D03*
X11173844Y4513070D02*
D03*
X11178157Y3945126D02*
D03*
X2186554Y3932428D02*
D03*
X2182246Y4500372D02*
D03*
X5636646Y4513072D02*
D03*
X5640954Y3945128D02*
D03*
X3972946Y4513072D02*
D03*
X3977254Y3945128D02*
D03*
X9387454Y3945126D02*
D03*
X9383146Y4513070D02*
D03*
X12824843D02*
D03*
X12829156Y3945126D02*
D03*
X1651000Y13322301D02*
D03*
X889000D02*
D03*
X1651000Y14084300D02*
D03*
X889000D02*
D03*
D30*
X13944865Y1016000D02*
D03*
X7834861D02*
D03*
X6763400D02*
D03*
X653395D02*
D03*
D31*
X6800000Y3800000D02*
D03*
X14100000Y2000001D02*
D03*
X500000D02*
D03*
X14100000Y12500000D02*
D03*
X499999D02*
D03*
%TF.MD5,9e2622762592d67ef14c2c37d364a903*%
M02*
