%TF.GenerationSoftware,Altium Limited,Altium Designer,19.1.5 (86)*%
G04 Layer_Color=255*
%FSLAX45Y45*%
%MOMM*%
%TF.FileFunction,Pads,Top*%
%TF.Part,Single*%
G01*
G75*
%TA.AperFunction,SMDPad,CuDef*%
%ADD10R,1.55000X0.40000*%
%ADD11R,1.15000X1.80000*%
%ADD12R,1.00000X1.75000*%
%ADD13R,1.25000X0.76000*%
%ADD14R,1.55000X0.55000*%
%ADD15R,0.76000X1.25000*%
%ADD16R,0.60000X1.20000*%
%ADD17R,0.45000X1.45000*%
%ADD18R,1.80000X1.15000*%
%ADD19R,1.00000X0.90000*%
%ADD20R,1.75000X1.00000*%
%TA.AperFunction,ComponentPad*%
%ADD24C,1.60000*%
%ADD25C,3.90000*%
%ADD26C,1.70000*%
%ADD27C,5.50000*%
%ADD28C,1.80000*%
%ADD29C,2.00000*%
%ADD30C,3.80000*%
%TA.AperFunction,WasherPad*%
%ADD31C,3.20000*%
D10*
X7585201Y6305553D02*
D03*
Y6242053D02*
D03*
Y6178553D02*
D03*
Y6115053D02*
D03*
Y6051553D02*
D03*
Y5988053D02*
D03*
Y5924553D02*
D03*
Y5861053D02*
D03*
X7045202D02*
D03*
Y5924553D02*
D03*
Y5988053D02*
D03*
Y6051553D02*
D03*
Y6115053D02*
D03*
Y6178553D02*
D03*
Y6242053D02*
D03*
Y6305553D02*
D03*
X9940800Y8870950D02*
D03*
Y8807450D02*
D03*
Y8743950D02*
D03*
Y8680450D02*
D03*
Y8616950D02*
D03*
Y8553450D02*
D03*
Y8489950D02*
D03*
Y8426450D02*
D03*
X10480800D02*
D03*
Y8489950D02*
D03*
Y8553450D02*
D03*
Y8616950D02*
D03*
Y8680450D02*
D03*
Y8743950D02*
D03*
Y8807450D02*
D03*
Y8870950D02*
D03*
X4594102Y7461251D02*
D03*
Y7397751D02*
D03*
Y7334251D02*
D03*
Y7270751D02*
D03*
Y7207251D02*
D03*
Y7143751D02*
D03*
Y7080251D02*
D03*
Y7016751D02*
D03*
X5134101D02*
D03*
Y7080251D02*
D03*
Y7143751D02*
D03*
Y7207251D02*
D03*
Y7270751D02*
D03*
Y7334251D02*
D03*
Y7397751D02*
D03*
Y7461251D02*
D03*
X4568699Y6280153D02*
D03*
Y6216653D02*
D03*
Y6153153D02*
D03*
Y6089653D02*
D03*
Y6026153D02*
D03*
Y5962653D02*
D03*
Y5899153D02*
D03*
Y5835653D02*
D03*
X5108698D02*
D03*
Y5899153D02*
D03*
Y5962653D02*
D03*
Y6026153D02*
D03*
Y6089653D02*
D03*
Y6153153D02*
D03*
Y6216653D02*
D03*
Y6280153D02*
D03*
X9940800Y6305553D02*
D03*
Y6242053D02*
D03*
Y6178553D02*
D03*
Y6115053D02*
D03*
Y6051553D02*
D03*
Y5988053D02*
D03*
Y5924553D02*
D03*
Y5861053D02*
D03*
X10480798D02*
D03*
Y5924553D02*
D03*
Y5988053D02*
D03*
Y6051553D02*
D03*
Y6115053D02*
D03*
Y6178553D02*
D03*
Y6242053D02*
D03*
Y6305553D02*
D03*
X7585198Y7461251D02*
D03*
Y7397751D02*
D03*
Y7334251D02*
D03*
Y7270751D02*
D03*
Y7207251D02*
D03*
Y7143751D02*
D03*
Y7080251D02*
D03*
Y7016751D02*
D03*
X7045200D02*
D03*
Y7080251D02*
D03*
Y7143751D02*
D03*
Y7207251D02*
D03*
Y7270751D02*
D03*
Y7334251D02*
D03*
Y7397751D02*
D03*
Y7461251D02*
D03*
X4568702Y8870951D02*
D03*
Y8807451D02*
D03*
Y8743951D02*
D03*
Y8680451D02*
D03*
Y8616951D02*
D03*
Y8553451D02*
D03*
Y8489951D02*
D03*
Y8426451D02*
D03*
X5108700D02*
D03*
Y8489951D02*
D03*
Y8553451D02*
D03*
Y8616951D02*
D03*
Y8680451D02*
D03*
Y8743951D02*
D03*
Y8807451D02*
D03*
Y8870951D02*
D03*
X7045199Y8870951D02*
D03*
Y8807451D02*
D03*
Y8743951D02*
D03*
Y8680451D02*
D03*
Y8616951D02*
D03*
Y8553451D02*
D03*
Y8489951D02*
D03*
Y8426451D02*
D03*
X7585198D02*
D03*
Y8489951D02*
D03*
Y8553451D02*
D03*
Y8616951D02*
D03*
Y8680451D02*
D03*
Y8743951D02*
D03*
Y8807451D02*
D03*
Y8870951D02*
D03*
D11*
X6103400Y12560300D02*
D03*
X6393400D02*
D03*
X11016200Y11430000D02*
D03*
X10726200D02*
D03*
D12*
X11021200Y11798300D02*
D03*
X10721200D02*
D03*
D13*
X7312500Y12344400D02*
D03*
Y12471400D02*
D03*
X7312500Y12217400D02*
D03*
X7312500Y12090400D02*
D03*
Y11963400D02*
D03*
X7312500Y11836400D02*
D03*
X7927500D02*
D03*
Y11963400D02*
D03*
X7927500Y12090400D02*
D03*
Y12217400D02*
D03*
X7927500Y12344400D02*
D03*
X7927500Y12471400D02*
D03*
D14*
X3468104Y8991602D02*
D03*
Y8864602D02*
D03*
X4228102D02*
D03*
Y8991602D02*
D03*
D15*
X12179300Y3126903D02*
D03*
X12306300D02*
D03*
X12052300D02*
D03*
X11925300D02*
D03*
X11798300D02*
D03*
X11671300D02*
D03*
Y2511903D02*
D03*
X11798300D02*
D03*
X11925300Y2511897D02*
D03*
X12052300D02*
D03*
X12179300Y2511903D02*
D03*
X12306300Y2511897D02*
D03*
X4965699Y3126903D02*
D03*
X5092699D02*
D03*
X4838699D02*
D03*
X4711699D02*
D03*
X4584699D02*
D03*
X4457699D02*
D03*
Y2511903D02*
D03*
X4584699D02*
D03*
X4711699Y2511897D02*
D03*
X4838699D02*
D03*
X4965699Y2511903D02*
D03*
X5092699Y2511897D02*
D03*
D16*
X3968501Y9234900D02*
D03*
X3778501D02*
D03*
Y9484900D02*
D03*
X3873501D02*
D03*
X3968501D02*
D03*
D17*
X11443401Y11890100D02*
D03*
Y11300100D02*
D03*
X11508400D02*
D03*
X11573401D02*
D03*
X11638400D02*
D03*
X11703401D02*
D03*
X11768401D02*
D03*
X11833401D02*
D03*
X11508400Y11890100D02*
D03*
X11573401D02*
D03*
X11638400D02*
D03*
X11703401D02*
D03*
X11768401D02*
D03*
X11833401D02*
D03*
X11898401D02*
D03*
X11963401D02*
D03*
X11898401Y11300100D02*
D03*
X11963401D02*
D03*
D18*
X11201400Y9710200D02*
D03*
Y10000200D02*
D03*
X12573000Y9710200D02*
D03*
Y10000200D02*
D03*
X12293600Y9710200D02*
D03*
Y10000200D02*
D03*
X12026900Y9710200D02*
D03*
Y10000200D02*
D03*
X11760200Y9704900D02*
D03*
Y9994900D02*
D03*
X11480800Y9704900D02*
D03*
Y9994900D02*
D03*
D19*
X5892801Y7204701D02*
D03*
Y7044702D02*
D03*
X5892801Y7534901D02*
D03*
Y7374902D02*
D03*
D20*
X11201400Y10513200D02*
D03*
Y10213200D02*
D03*
X12573000Y10513200D02*
D03*
Y10213200D02*
D03*
X12293600Y10513200D02*
D03*
Y10213200D02*
D03*
X12026900Y10513200D02*
D03*
Y10213200D02*
D03*
X11760200Y10513200D02*
D03*
Y10213200D02*
D03*
X11480800Y10513200D02*
D03*
Y10213200D02*
D03*
D24*
X7404098Y10541015D02*
D03*
Y10795015D02*
D03*
X7150098Y10541015D02*
D03*
Y10795015D02*
D03*
X6896098Y10541015D02*
D03*
Y10795015D02*
D03*
X6642098D02*
D03*
Y10541015D02*
D03*
X6388098Y10795015D02*
D03*
Y10541015D02*
D03*
X7912098Y10795015D02*
D03*
Y10541015D02*
D03*
X7658098Y10795015D02*
D03*
Y10541015D02*
D03*
X5589999Y13716000D02*
D03*
X5866999D02*
D03*
X6143999D02*
D03*
X6421000D02*
D03*
X6698000D02*
D03*
X6975000D02*
D03*
X7252000D02*
D03*
X7529000D02*
D03*
X7806000D02*
D03*
X8083001D02*
D03*
X8360001D02*
D03*
X8637001D02*
D03*
X5449999Y13462000D02*
D03*
X5726999D02*
D03*
X6003999D02*
D03*
X6281000D02*
D03*
X7389000D02*
D03*
X7112000D02*
D03*
X6558000D02*
D03*
X7666000D02*
D03*
X7943000D02*
D03*
X8220001D02*
D03*
X8497001D02*
D03*
X8774001D02*
D03*
X6835000D02*
D03*
D25*
X10526000Y13588998D02*
D03*
X13857999D02*
D03*
D26*
X13150999Y13461998D02*
D03*
X12876999D02*
D03*
X12602999D02*
D03*
X12328999D02*
D03*
X12054999D02*
D03*
X11780999D02*
D03*
X11506999D02*
D03*
X11232999D02*
D03*
X11370002Y13715997D02*
D03*
X11644002D02*
D03*
X11918002D02*
D03*
X12192002D02*
D03*
X12466001D02*
D03*
X12740001D02*
D03*
X13014001D02*
D03*
X8681865Y1270000D02*
D03*
X8957866D02*
D03*
X9233862D02*
D03*
X9509864D02*
D03*
X9785865D02*
D03*
X10061862D02*
D03*
X10337863D02*
D03*
X10613865D02*
D03*
X10889866D02*
D03*
X11165863D02*
D03*
X11441864D02*
D03*
X11717866D02*
D03*
X11993862D02*
D03*
X12269863D02*
D03*
X12545865D02*
D03*
X12821866D02*
D03*
X13097862D02*
D03*
X8819863Y1016000D02*
D03*
X9095864D02*
D03*
X9371866D02*
D03*
X9647862D02*
D03*
X9923864D02*
D03*
X10199865D02*
D03*
X10475861D02*
D03*
X10751863D02*
D03*
X11027864D02*
D03*
X11303866D02*
D03*
X11579862D02*
D03*
X11855864D02*
D03*
X12131865D02*
D03*
X12407862D02*
D03*
X12683863D02*
D03*
X12959865D02*
D03*
X8681865Y762000D02*
D03*
X8957866D02*
D03*
X9233862D02*
D03*
X9509864D02*
D03*
X9785865D02*
D03*
X10061862D02*
D03*
X10337863D02*
D03*
X10613865D02*
D03*
X10889866D02*
D03*
X11165863D02*
D03*
X11441864D02*
D03*
X11717866D02*
D03*
X11993862D02*
D03*
X12269863D02*
D03*
X12545865D02*
D03*
X12821866D02*
D03*
X13097862D02*
D03*
X1500398Y1270000D02*
D03*
X1776400D02*
D03*
X2052401D02*
D03*
X2328398D02*
D03*
X2604399D02*
D03*
X2880401D02*
D03*
X3156402D02*
D03*
X3432399D02*
D03*
X3708400D02*
D03*
X3984401D02*
D03*
X4260398D02*
D03*
X4536399D02*
D03*
X4812401D02*
D03*
X5088402D02*
D03*
X5364399D02*
D03*
X5640400D02*
D03*
X5916402D02*
D03*
X1638402Y1016000D02*
D03*
X1914398D02*
D03*
X2190399D02*
D03*
X2466401D02*
D03*
X2742397D02*
D03*
X3018399D02*
D03*
X3294400D02*
D03*
X3570402D02*
D03*
X3846398D02*
D03*
X4122400D02*
D03*
X4398401D02*
D03*
X4674398D02*
D03*
X4950399D02*
D03*
X5226401D02*
D03*
X5502397D02*
D03*
X5778398D02*
D03*
X1500398Y762000D02*
D03*
X1776400D02*
D03*
X2052401D02*
D03*
X2328398D02*
D03*
X2604399D02*
D03*
X2880401D02*
D03*
X3156402D02*
D03*
X3432399D02*
D03*
X3708400D02*
D03*
X3984401D02*
D03*
X4260398D02*
D03*
X4536399D02*
D03*
X4812401D02*
D03*
X5088397D02*
D03*
X5364399D02*
D03*
X5640400D02*
D03*
X5916402D02*
D03*
D27*
X4761999Y13589000D02*
D03*
X9462001D02*
D03*
D28*
X8318500Y1958994D02*
D03*
Y4898996D02*
D03*
X13525500Y1958994D02*
D03*
Y4898996D02*
D03*
X8839200Y1958994D02*
D03*
Y4898996D02*
D03*
X1054100Y1793894D02*
D03*
Y4733896D02*
D03*
X6350000Y1958994D02*
D03*
Y4898996D02*
D03*
X1498600Y1793894D02*
D03*
Y4733896D02*
D03*
D29*
X3556000Y13322301D02*
D03*
X2794000D02*
D03*
X3556000Y14084300D02*
D03*
X2794000D02*
D03*
X11173844Y4513070D02*
D03*
X11178157Y3945126D02*
D03*
X2186554Y3932428D02*
D03*
X2182246Y4500372D02*
D03*
X5636646Y4513072D02*
D03*
X5640954Y3945128D02*
D03*
X3972946Y4513072D02*
D03*
X3977254Y3945128D02*
D03*
X9387454Y3945126D02*
D03*
X9383146Y4513070D02*
D03*
X12824843D02*
D03*
X12829156Y3945126D02*
D03*
X1651000Y13322301D02*
D03*
X889000D02*
D03*
X1651000Y14084300D02*
D03*
X889000D02*
D03*
D30*
X13944865Y1016000D02*
D03*
X7834861D02*
D03*
X6763400D02*
D03*
X653395D02*
D03*
D31*
X6800000Y3800000D02*
D03*
X14100000Y2000001D02*
D03*
X500000D02*
D03*
X14100000Y12500000D02*
D03*
X499999D02*
D03*
%TF.MD5,cf3b108fd2dde6e5e6228b796904b25c*%
M02*
