M48
;Layer_Color=9474304
;FILE_FORMAT=4:4
METRIC,LZ
;TYPE=PLATED
T1F00S00C0.5000
T2F00S00C0.9000
T3F00S00C1.0000
T4F00S00C1.1000
T5F00S00C1.3000
T6F00S00C3.1000
T7F00S00C3.2000
;TYPE=NON_PLATED
T8F00S00C3.2000
%
T01
X0106807Y0018415
X011684Y0021209
X0116713Y002286
X0114427Y0025019
X0123063Y0022987
X0125476Y0026797
X0053086Y0021082
X005207Y0016762
X0043434Y0020193
X004445Y0022733
X004191Y0025119
X003925Y0056957
X0040875Y0059457
X0043375Y0058957
X004175Y0062332
X00397295Y0063957
X0045625
X00425Y0070332
X0041021Y0072082
Y00746171
X0050625Y0076073
X004953Y0082804
X00425768Y00855028
X00442277Y00898842
X0041402Y0092329
X0051087Y0089916
X0058039Y0089662
X0056896Y008763
X00550875Y0086487
Y0083528
X00530569Y00835036
X0055278Y0074168
X00541941Y00727361
X00540766Y00672846
X0051341Y0068613
X0051054Y00639572
X00510794Y00570709
X0052Y0055582
X0053594Y0055372
X005525Y0058207
X005842Y0058039
X0057023Y0061087
X006477Y00617855
X0067818
X0066802Y00605155
X0068Y00591724
X0069088Y0064516
X00723392
X00784606Y00636905
X0079167Y0062311
X0078613Y0067056
Y0070739
X00804837Y0071247
X0081915Y0072771
X00832168Y00740092
X0087757Y00728027
X0089408Y0074168
X0090424Y0084455
X0084328Y00900138
X0079629Y008763
X0078613Y0083528
X00758355Y00823125
X0072771Y008128
X0072898Y0076073
X0070452
X0068375Y0074832
X00672004Y00732964
X0068326Y00714089
X0075819Y0068453
X00758444Y0076073
X0081915Y0080899
X00758482Y00900138
X006858Y00874395
X0066802Y0084074
X0066294Y0091694
X0058928Y0077343
X00561341Y005334
X0073914Y0054197
X0075946Y0052959
X0078613Y0054197
X008001Y005334
X0081026Y0055372
X00775335Y005588
X0075852Y0057023
X0091948Y0054991
X0093472Y0053975
X00956818Y00535715
X0096774Y005842
X00952Y0061214
X0096774Y0063754
X00995617Y00650303
X01038098Y00649986
X01079166Y0061722
X010922Y00600261
X0110236Y00583565
X0109474Y0055499
X01079426Y0053332
X010668Y005715
X0104775Y0057023
X01079166Y0082296
X0109982
X01093152Y00855663
X0108839Y00892175
X0107315Y0087757
X0104902Y0090297
X0099441Y0089916
X0098298Y0092456
X0094234Y0091313
X0095377Y00887095
X0092075Y00885364
X00931085Y00867585
X00969359Y00855345
X0091313Y0075438
X0115062Y00860897
X0114808Y0092202
X0117602Y009525
X012573
X0109728Y0097102
X0110162Y0112268
X011275Y0113
X0122174Y0118999
X0120904Y012192
X0119888Y0123063
X0118745Y0124206
X009652Y00946912
X0085598Y0097028
X00836255Y00991275
X00817241Y0100457
X0079629Y0097323
X0078613Y009271
X008774Y0107188
X00821469Y0118618
X0073025Y0127
X007112Y0125984
X006975Y0124714
X00683372Y0123178
X006604Y0127024
X0038735Y0096774
T02
X00545Y013462
X005727
X006004
X006281
X006558
X006835
X007112
X007389
X007666
X007943
X00822
X008497
X008774
X008637Y013716
X00836
X008083
X007806
X007529
X007252
X006975
X006698
X006421
X006144
X005867
X00559
T03
X0015004Y000762
X0017764
X0020524
X0023284
X0026044
X0028804
X0031564
X0034324
X0037084
X0039844
X0042604
X0045364
X0048124
X0050884
X0049504Y001016
X0046744
X0043984
X0041224
X0038464
X0035704
X0032944
X0030184
X0027424
X0024664
X0021904
X0019144
X0016384
X0017764Y00127
X0015004
X0020524
X0023284
X0026044
X0028804
X0031564
X0034324
X0037084
X0039844
X0042604
X0045364
X0048124
X0050884
X0053644
X0056404
X0059164
X0057784Y001016
X0055024
X0052264
X0053644Y000762
X0056404
X0059164
X00868186
X00895787
X00881986Y001016
X00868186Y00127
X00895787
X00923386
X00950986
X00978587
X01006186
X01033786
X01061386
X01088987
X01116586
X01144186
X01171787
X01199386
X01226986
X01254586
X01282187
X01295986Y001016
X01268386
X01240786
X01213186
X01185586
X01157986
X01130387
X01102786
X01075186
X01047586
X01019986
X00992386
X00964786
X00937187
X00909586
X00923386Y000762
X00950986
X00978587
X01006186
X01033786
X01061386
X01088987
X01116586
X01144186
X01171787
X01199386
X01226986
X01254586
X01282187
X01309786
Y00127
X0079121Y01054101
Y01079501
X0076581
X0074041
Y01054101
X0071501
Y01079501
X0068961
Y01054101
X0066421
Y01079501
X0063881
Y01054101
X0076581
X011233Y013462
X011507
X011781
X012055
X012329
X012603
X012877
X01274Y013716
X012466
X012192
X011918
X011644
X01137
X013014
X013151Y013462
T04
X0135255Y00195899
Y004899
X0088392
X0083185
X00635
Y00195899
X0083185
X0088392
X0014986Y00179389
Y0047339
X0010541
Y00179389
T05
X00938745Y00394513
X00938315Y00451307
X01117384
X01117816Y00394513
X01282916
X01282484Y00451307
X00563665Y00451307
X00564095Y00394513
X00397725
X00397295Y00451307
X00218225Y00450037
X00218655Y00393243
X000889Y0133223
Y0140843
X001651
Y0133223
X002794
X003556
Y0140843
X002794
T06
X00065339Y001016
X0067634
X00783486
X01394487
T07
X004762Y013589
X009462
X010526Y013589
X013858
T08
X0141Y002
X0068Y0038
X0005Y002
X0141Y0125
X0005
M30
