Altium Designer Pick and Place Locations
G:\Departments\PH\Groups\TA1\Atlas_trt\Xavier\Xavi\LHCb\SciFi\PCB\Mux_Master_V2\ProjectOutputs\Pick Place for Mux_Master_V2.csv

========================================================================================================================
File Design Information:

Date:       11/11/20
Time:       13:26
Revision:   Not in VersionControl
Variant:    No variations
Units used: mil

"Designator","Comment","Layer","Footprint","Center-X(mil)","Center-Y(mil)","Rotation","Description","Manufacturer","Manufacturer Part Number","Mounted","SMD"
"SW152","Switch","TopLayer","JUMPSMD0805_G50","5470.000mil","4453.976mil","180","2 SMD Pads for Bound by Solder  Drop","None","None","No","Yes"
"SW151","Switch","TopLayer","JUMPSMD0805_G50","6195.590mil","4462.834mil","0","2 SMD Pads for Bound by Solder  Drop","None","None","No","Yes"
"SW153","Switch","TopLayer","JUMPSMD0805_G50","5470.000mil","4370.000mil","180","2 SMD Pads for Bound by Solder  Drop","None","None","No","Yes"
"IC160","LMC6064","TopLayer","SOIC127P600X175-14N","5831.614mil","4520.000mil","180","Quad Operational Amplifier","NATIONAL SEMICONDUCTOR","LMC6464AIM","Yes","Yes"
"J7","Header 14","TopLayer","3M_N2514-6002RB","3086.293mil","1510.629mil","90","Connector 14 Male","3M","N2514-6002RB","Yes","No"
"R27","100","TopLayer","RESC3216X65N","4906.299mil","740.630mil","270","Resistor - 1%","GENERIC","R1206_100R_1%_0.25W_100PPM","Yes","Yes"
"R26","300","TopLayer","RESC3216X65N","4614.567mil","4755.000mil","0","Resistor - 1%","GENERIC","R1206_300R_1%_0.25W_100PPM","Yes","Yes"
"LD26","Green","TopLayer","LED_OSRAM_LGN971","4614.567mil","4645.630mil","180","LED Green 1C 2A","OSRAM","LGN971","Yes","Yes"
"IC11","MAX4582CEE+","TopLayer","SOP63P600X175-16N","6106.299mil","3105.130mil","0","Low-Voltage, CMOS Analog Multiplexers/Switches (2x 4 Normally Open)","MAXIM","MAX4582CEE+","Yes","Yes"
"U142","NC7S14M5X","TopLayer","SOT95P280X140-5N","6583.898mil","3910.630mil","270","Undefined or Miscellaneous","","","",""
"U141","NC7S14M5X","TopLayer","SOT95P280X140-5N","6731.299mil","3910.630mil","270","Undefined or Miscellaneous","","","",""
"U132","NC7S14M5X","TopLayer","SOT95P280X140-5N","7056.299mil","3910.630mil","270","Undefined or Miscellaneous","","","",""
"U131","NC7S14M5X","TopLayer","SOT95P280X140-5N","7206.299mil","3910.630mil","270","Undefined or Miscellaneous","","","",""
"U122","NC7S14M5X","TopLayer","SOT95P280X140-5N","7551.299mil","3920.630mil","270","Undefined or Miscellaneous","","","",""
"U121","NC7S14M5X","TopLayer","SOT95P280X140-5N","7706.299mil","3920.630mil","270","Undefined or Miscellaneous","","","",""
"SW150","Switch","TopLayer","JUMPSMD0805_G50","6194.409mil","4370.315mil","0","2 SMD Pads for Bound by Solder  Drop","None","None","No","Yes"
"R145","6k8","TopLayer","RESC1608X55N","6471.299mil","3990.630mil","270","Resistor - 1%","GENERIC","R0603_6K8_1%_0.1W_100PPM","Yes","Yes"
"R143","1k2","TopLayer","RESC3216X65N","6666.299mil","4730.630mil","270","Resistor - 1%","GENERIC","R1206_1K2_1%_0.25W_100PPM","Yes","Yes"
"R142","1k2","TopLayer","RESC3216X65N","6566.299mil","4730.630mil","270","Resistor - 1%","GENERIC","R1206_1K2_1%_0.25W_100PPM","Yes","Yes"
"R141","1k2","TopLayer","RESC3216X65N","6766.299mil","4730.630mil","270","Resistor - 1%","GENERIC","R1206_1K2_1%_0.25W_100PPM","Yes","Yes"
"R140","1k2","TopLayer","RESC3216X65N","6866.299mil","4730.630mil","270","Resistor - 1%","GENERIC","R1206_1K2_1%_0.25W_100PPM","Yes","Yes"
"R144","6k8","TopLayer","RESC1608X55N","6841.299mil","3990.630mil","270","Resistor - 1%","GENERIC","R0603_6K8_1%_0.1W_100PPM","Yes","Yes"
"R135","6k8","TopLayer","RESC1608X55N","6948.347mil","3990.630mil","270","Resistor - 1%","GENERIC","R0603_6K8_1%_0.1W_100PPM","Yes","Yes"
"R134","6k8","TopLayer","RESC1608X55N","7316.299mil","3990.630mil","270","Resistor - 1%","GENERIC","R0603_6K8_1%_0.1W_100PPM","Yes","Yes"
"R133","1k2","TopLayer","RESC3216X65N","7096.299mil","4730.630mil","270","Resistor - 1%","GENERIC","R1206_1K2_1%_0.25W_100PPM","Yes","Yes"
"R132","1k2","TopLayer","RESC3216X65N","6993.465mil","4730.630mil","270","Resistor - 1%","GENERIC","R1206_1K2_1%_0.25W_100PPM","Yes","Yes"
"R131","1k2","TopLayer","RESC3216X65N","7196.299mil","4730.630mil","270","Resistor - 1%","GENERIC","R1206_1K2_1%_0.25W_100PPM","Yes","Yes"
"R130","1k2","TopLayer","RESC3216X65N","7296.299mil","4730.630mil","270","Resistor - 1%","GENERIC","R1206_1K2_1%_0.25W_100PPM","Yes","Yes"
"R125","6k8","TopLayer","RESC1608X55N","7439.685mil","3990.630mil","270","Resistor - 1%","GENERIC","R0603_6K8_1%_0.1W_100PPM","Yes","Yes"
"R124","6k8","TopLayer","RESC1608X55N","7816.299mil","3990.630mil","270","Resistor - 1%","GENERIC","R0603_6K8_1%_0.1W_100PPM","Yes","Yes"
"R123","1k2","TopLayer","RESC3216X65N","7526.299mil","4730.630mil","270","Resistor - 1%","GENERIC","R1206_1K2_1%_0.25W_100PPM","Yes","Yes"
"R122","1k2","TopLayer","RESC3216X65N","7426.299mil","4730.630mil","270","Resistor - 1%","GENERIC","R1206_1K2_1%_0.25W_100PPM","Yes","Yes"
"R121","1k2","TopLayer","RESC3216X65N","7626.299mil","4730.630mil","270","Resistor - 1%","GENERIC","R1206_1K2_1%_0.25W_100PPM","Yes","Yes"
"R120","1k2","TopLayer","RESC3216X65N","7726.299mil","4730.630mil","270","Resistor - 1%","GENERIC","R1206_1K2_1%_0.25W_100PPM","Yes","Yes"
"J8.","D-Sub","TopLayer","AMPHENOL_L717DFB25P1ATN","6670.000mil","5325.000mil","0","Connector D-sub 25 Male","AMPHENOL","L717DFB25P1ATN","Yes","No"
"J5","D-Sub","TopLayer","AMPHENOL_L717DFA15S1ATN","6889.764mil","270.630mil","180","Connector D-sub 15 Female","AMPHENOL","L717DFA15S1ATN","Yes","No"
"J4","D-Sub","TopLayer","AMPHENOL_L717DFA15S1ATN","4600.000mil","5325.000mil","0","Connector D-sub 15 Female","AMPHENOL","L717DFA15S1ATN","Yes","No"
"IC140","HCPL-0731-000E","TopLayer","SOIC127P600X330-8N","6706.299mil","4350.630mil","270","Dual Photodarlington Optocouplers","AVAGO TECHNOLOGIES","HCPL-0731-000E","Yes","Yes"
"IC130","HCPL-0731-000E","TopLayer","SOIC127P600X330-8N","7146.299mil","4350.630mil","270","Dual Photodarlington Optocouplers","AVAGO TECHNOLOGIES","HCPL-0731-000E","Yes","Yes"
"IC120","HCPL-0731-000E","TopLayer","SOIC127P600X330-8N","7576.299mil","4350.630mil","270","Dual Photodarlington Optocouplers","AVAGO TECHNOLOGIES","HCPL-0731-000E","Yes","Yes"
"IC10","MAX4582CEE+","TopLayer","SOP63P600X175-16N","5376.299mil","3105.130mil","0","Low-Voltage, CMOS Analog Multiplexers/Switches (2x 4 Normally Open)","MAXIM","MAX4582CEE+","Yes","Yes"
"C150","100nF","TopLayer","CAPC3216X140N","6070.787mil","4726.693mil","90","Non-polarised capacitor","GENERIC","CC1206_100NF_50V_10%_X7R","Yes","Yes"
"R25","300","TopLayer","RESC3216X65N","6850.785mil","2610.630mil","270","Resistor - 1%","GENERIC","R1206_300R_1%_0.25W_100PPM","Yes","Yes"
"R24","300","TopLayer","RESC3216X65N","6960.785mil","2608.543mil","270","Resistor - 1%","GENERIC","R1206_300R_1%_0.25W_100PPM","Yes","Yes"
"R23","300","TopLayer","RESC3216X65N","7070.785mil","2608.543mil","270","Resistor - 1%","GENERIC","R1206_300R_1%_0.25W_100PPM","Yes","Yes"
"R22","300","TopLayer","RESC3216X65N","7175.785mil","2610.630mil","270","Resistor - 1%","GENERIC","R1206_300R_1%_0.25W_100PPM","Yes","Yes"
"R21","300","TopLayer","RESC3216X65N","7280.785mil","2610.630mil","270","Resistor - 1%","GENERIC","R1206_300R_1%_0.25W_100PPM","Yes","Yes"
"R20","300","TopLayer","RESC3216X65N","7390.785mil","2610.630mil","270","Resistor - 1%","GENERIC","R1206_300R_1%_0.25W_100PPM","Yes","Yes"
"LD25","Green","TopLayer","LED_OSRAM_LGN971","6850.785mil","2810.630mil","270","LED Green 1C 2A","OSRAM","LGN971","Yes","Yes"
"LD24","Green","TopLayer","LED_OSRAM_LGN971","6960.785mil","2810.630mil","270","LED Green 1C 2A","OSRAM","LGN971","Yes","Yes"
"LD23","Green","TopLayer","LED_OSRAM_LGN971","7070.785mil","2810.630mil","270","LED Green 1C 2A","OSRAM","LGN971","Yes","Yes"
"LD22","Green","TopLayer","LED_OSRAM_LGN971","7175.785mil","2810.630mil","270","LED Green 1C 2A","OSRAM","LGN971","Yes","Yes"
"LD21","Green","TopLayer","LED_OSRAM_LGN971","7280.785mil","2810.630mil","270","LED Green 1C 2A","OSRAM","LGN971","Yes","Yes"
"LD20","Green","TopLayer","LED_OSRAM_LGN971","7390.785mil","2810.630mil","270","LED Green 1C 2A","OSRAM","LGN971","Yes","Yes"
"IC9","TBD62083AFNG","TopLayer","SOP65P640X155-18N","7048.423mil","3295.630mil","270","8 Channel Sink Type DMOS Transistor Array","TOSHIBA","TBD62083AFNG","Yes","Yes"
"U8","NC7S14M5X","TopLayer","SOT95P280X140-5N","1725.000mil","3975.000mil","270","Undefined or Miscellaneous","","","",""
"J8","=Family","TopLayer","PHOENIX_1804797","1500.000mil","5355.630mil","180","Connector 2 Male","PHOENIX CONTACT","1804797 (PC 4/ 2-G-7,62)","Yes","No"
"J6","=Family","TopLayer","PHOENIX_1804797","750.000mil","5355.630mil","180","Connector 2 Male","PHOENIX CONTACT","1804797 (PC 4/ 2-G-7,62)","Yes","No"
"R15","220","TopLayer","RESC1608X55N","1816.897mil","3131.626mil","90","Resistor - 1%","GENERIC","R0603_220R_1%_0.1W_100PPM","Yes","Yes"
"R14","10k","TopLayer","RESC1608X55N","1816.897mil","3266.626mil","90","Resistor - 1%","GENERIC","R0603_10K_1%_0.1W_100PPM","Yes","Yes"
"IC7","MAX4582CEE+","TopLayer","SOP63P600X175-16N","1521.898mil","3105.130mil","0","Low-Voltage, CMOS Analog Multiplexers/Switches (2x 4 Normally Open)","MAXIM","MAX4582CEE+","Yes","Yes"
"IC6","MAX4582CEE+","TopLayer","SOP63P600X175-16N","2486.896mil","3660.130mil","0","Low-Voltage, CMOS Analog Multiplexers/Switches (2x 4 Normally Open)","MAXIM","MAX4582CEE+","Yes","Yes"
"IC5","MAX4582CEE+","TopLayer","SOP63P600X175-16N","1511.898mil","3660.130mil","0","Low-Voltage, CMOS Analog Multiplexers/Switches (2x 4 Normally Open)","MAXIM","MAX4582CEE+","Yes","Yes"
"IC4","MAX4582CEE+","TopLayer","SOP63P600X175-16N","2486.897mil","3105.130mil","0","Low-Voltage, CMOS Analog Multiplexers/Switches (2x 4 Normally Open)","MAXIM","MAX4582CEE+","Yes","Yes"
"IC3","MAX4582CEE+","TopLayer","SOP63P600X175-16N","3626.897mil","2650.131mil","0","Low-Voltage, CMOS Analog Multiplexers/Switches (2x 4 Normally Open)","MAXIM","MAX4582CEE+","Yes","Yes"
"IC2","MAX4582CEE+","TopLayer","SOP63P600X175-16N","2486.898mil","2650.131mil","0","Low-Voltage, CMOS Analog Multiplexers/Switches (2x 4 Normally Open)","MAXIM","MAX4582CEE+","Yes","Yes"
"IC1","MAX4582CEE+","TopLayer","SOP63P600X175-16N","1511.897mil","2640.131mil","0","Low-Voltage, CMOS Analog Multiplexers/Switches (2x 4 Normally Open)","MAXIM","MAX4582CEE+","Yes","Yes"
"SW6","Switch","TopLayer","SW_OMRON_A6H-6102","5032.398mil","1075.630mil","270","6 Ways SPST DIP Switch","OMRON","A6H-6102","Yes","Yes"
"SW5","Switch","TopLayer","SW_OMRON_A6H-6102","1987.397mil","1080.081mil","270","6 Ways SPST DIP Switch","OMRON","A6H-6102","Yes","Yes"
"SW4","Switch","TopLayer","SW_TYCO_1571983-1","1429.999mil","3899.999mil","180","2 Ways SPST DIP Switch","TYCO","1571983-1 or GDH02S04","Yes","Yes"
"R6","0R05","TopLayer","RES_OHMITE_12","4388.299mil","1500.628mil","270","Resistor - 1%","OHMITE","12FR020E","Yes","No"
"R5","0R05","TopLayer","RES_OHMITE_12","5356.299mil","1500.628mil","270","Resistor - 1%","OHMITE","12FR020E","Yes","No"
"R4","0R05","TopLayer","RES_OHMITE_12","3791.299mil","1500.628mil","270","Resistor - 1%","OHMITE","12FR020E","Yes","No"
"R3","0R05","TopLayer","RES_OHMITE_12","1388.299mil","1500.628mil","270","Resistor - 1%","OHMITE","12FR020E","Yes","No"
"R2","0R05","TopLayer","RES_OHMITE_12","2306.299mil","1500.628mil","270","Resistor - 1%","OHMITE","12FR020E","Yes","No"
"R1","0R05","TopLayer","RES_OHMITE_12","935.000mil","1500.628mil","270","Resistor - 1%","OHMITE","12FR020E","Yes","No"
"J3","D-Sub","TopLayer","AMPHENOL_L717DFA15S1ATN","2800.000mil","5325.000mil","0","Connector D-sub 15 Female","AMPHENOL","L717DFA15S1ATN","Yes","No"
"FH6","Fuse Holder","TopLayer","FUSH_LITTELFUSE_281005","4716.299mil","1620.629mil","0","Fuse Holder","LITTELFUSE","281005","Yes","No"
"FH5","Fuse Holder","TopLayer","FUSH_LITTELFUSE_281005","5626.930mil","1620.629mil","0","Fuse Holder","LITTELFUSE","281005","Yes","No"
"FH4","Fuse Holder","TopLayer","FUSH_LITTELFUSE_281005","4006.848mil","1625.629mil","180","Fuse Holder","LITTELFUSE","281005","Yes","No"
"FH3","Fuse Holder","TopLayer","FUSH_LITTELFUSE_281005","1719.093mil","1625.630mil","0","Fuse Holder","LITTELFUSE","281005","Yes","No"
"FH2","Fuse Holder","TopLayer","FUSH_LITTELFUSE_281005","2644.793mil","1625.630mil","0","Fuse Holder","LITTELFUSE","281005","Yes","No"
"FH1","Fuse Holder","TopLayer","FUSH_LITTELFUSE_281005","1152.000mil","1620.630mil","180","Fuse Holder","LITTELFUSE","281005","Yes","No"
"F6","2A-125V","TopLayer","FUSE_SCHURTER_MSF125_v","-4638.701mil","-4209.370mil","0","Fuse","SCHURTER","0034.4254","Yes","No"
"F5","2A-125V","TopLayer","FUSE_SCHURTER_MSF125_v","-4638.701mil","-4209.370mil","0","Fuse","SCHURTER","0034.4254","Yes","No"
"F4","2A-125V","TopLayer","FUSE_SCHURTER_MSF125_v","-4638.701mil","-4209.370mil","0","Fuse","SCHURTER","0034.4254","Yes","No"
"F3","2A-125V","TopLayer","FUSE_SCHURTER_MSF125_v","-4638.701mil","-4209.370mil","0","Fuse","SCHURTER","0034.4254","Yes","No"
"F2","2A-125V","TopLayer","FUSE_SCHURTER_MSF125_v","-4638.701mil","-4209.370mil","0","Fuse","SCHURTER","0034.4254","Yes","No"
"F1","2A-125V","TopLayer","FUSE_SCHURTER_MSF125_v","-4638.701mil","-4209.370mil","0","Fuse","SCHURTER","0034.4254","Yes","No"
"J2","D-Sub 50F","TopLayer","HARTING_09_66_552_7611","4606.300mil","360.630mil","180","Connector D-sub 50 Female","HARTING","09 66 552 7611","Yes","No"
"J1","D-Sub 50F","TopLayer","HARTING_09_66_552_7611","1750.000mil","360.630mil","180","Connector D-sub 50 Female","HARTING","09 66 552 7611","Yes","No"
