Change Net Name : Old Net Name=1/AI1+ New Net Name=1/U0+
Change Net Name : Old Net Name=1/AI1- New Net Name=1/U0-
Change Net Name : Old Net Name=1/AI2+ New Net Name=1/U1+
Change Net Name : Old Net Name=1/AI2- New Net Name=1/U1-
