%TF.GenerationSoftware,Altium Limited,Altium Designer,19.1.5 (86)*%
G04 Layer_Color=32896*
%FSLAX26Y26*%
%MOIN*%
%TF.FileFunction,Legend,Bot*%
%TF.Part,Single*%
G01*
G75*
%TA.AperFunction,NonConductor*%
%ADD12C,0.007000*%
D12*
X4190555Y-456511D02*
Y-531495D01*
Y-456511D02*
X4158418D01*
X4147707Y-460082D01*
X4144136Y-463652D01*
X4140565Y-470794D01*
Y-477935D01*
X4144136Y-485076D01*
X4147707Y-488647D01*
X4158418Y-492218D01*
X4190555D02*
X4158418D01*
X4147707Y-495788D01*
X4144136Y-499359D01*
X4140565Y-506500D01*
Y-517212D01*
X4144136Y-524354D01*
X4147707Y-527924D01*
X4158418Y-531495D01*
X4190555D01*
X4105930Y-481506D02*
X4113071Y-485076D01*
X4120212Y-492218D01*
X4123783Y-502930D01*
Y-510071D01*
X4120212Y-520783D01*
X4113071Y-527924D01*
X4105930Y-531495D01*
X4095218D01*
X4088077Y-527924D01*
X4080935Y-520783D01*
X4077365Y-510071D01*
Y-502930D01*
X4080935Y-492218D01*
X4088077Y-485076D01*
X4095218Y-481506D01*
X4105930D01*
X4050227Y-456511D02*
Y-517212D01*
X4046657Y-527924D01*
X4039515Y-531495D01*
X4032374D01*
X4060939Y-481506D02*
X4035945D01*
X4010950Y-456511D02*
Y-517212D01*
X4007379Y-527924D01*
X4000238Y-531495D01*
X3993097D01*
X4021662Y-481506D02*
X3996668D01*
X3964532D02*
X3971673Y-485076D01*
X3978814Y-492218D01*
X3982385Y-502930D01*
Y-510071D01*
X3978814Y-520783D01*
X3971673Y-527924D01*
X3964532Y-531495D01*
X3953820D01*
X3946678Y-527924D01*
X3939537Y-520783D01*
X3935966Y-510071D01*
Y-502930D01*
X3939537Y-492218D01*
X3946678Y-485076D01*
X3953820Y-481506D01*
X3964532D01*
X3919541D02*
Y-531495D01*
Y-495788D02*
X3908829Y-485076D01*
X3901688Y-481506D01*
X3890976D01*
X3883834Y-485076D01*
X3880264Y-495788D01*
Y-531495D01*
Y-495788D02*
X3869552Y-485076D01*
X3862410Y-481506D01*
X3851698D01*
X3844557Y-485076D01*
X3840986Y-495788D01*
Y-531495D01*
X3737080Y-456511D02*
X3744222Y-460082D01*
X3751363Y-467223D01*
X3754934Y-474364D01*
X3758504Y-485076D01*
Y-502930D01*
X3754934Y-513642D01*
X3751363Y-520783D01*
X3744222Y-527924D01*
X3737080Y-531495D01*
X3722798D01*
X3715656Y-527924D01*
X3708515Y-520783D01*
X3704944Y-513642D01*
X3701374Y-502930D01*
Y-485076D01*
X3704944Y-474364D01*
X3708515Y-467223D01*
X3715656Y-460082D01*
X3722798Y-456511D01*
X3737080D01*
X3683877Y-481506D02*
X3662453Y-531495D01*
X3641029Y-481506D02*
X3662453Y-531495D01*
X3628889Y-502930D02*
X3586041D01*
Y-495788D01*
X3589612Y-488647D01*
X3593182Y-485076D01*
X3600324Y-481506D01*
X3611036D01*
X3618177Y-485076D01*
X3625318Y-492218D01*
X3628889Y-502930D01*
Y-510071D01*
X3625318Y-520783D01*
X3618177Y-527924D01*
X3611036Y-531495D01*
X3600324D01*
X3593182Y-527924D01*
X3586041Y-520783D01*
X3569973Y-481506D02*
Y-531495D01*
Y-502930D02*
X3566403Y-492218D01*
X3559261Y-485076D01*
X3552120Y-481506D01*
X3541408D01*
X3534624Y-456511D02*
Y-531495D01*
X3476065Y-481506D02*
Y-531495D01*
Y-492218D02*
X3483206Y-485076D01*
X3490347Y-481506D01*
X3501059D01*
X3508201Y-485076D01*
X3515342Y-492218D01*
X3518913Y-502930D01*
Y-510071D01*
X3515342Y-520783D01*
X3508201Y-527924D01*
X3501059Y-531495D01*
X3490347D01*
X3483206Y-527924D01*
X3476065Y-520783D01*
X3452498Y-481506D02*
X3431074Y-531495D01*
X3409650Y-481506D02*
X3431074Y-531495D01*
X3438216Y-545778D01*
X3445357Y-552919D01*
X3452498Y-556490D01*
X3456069D01*
%TF.MD5,58ea66fed27570952b0e51353c7c07ee*%
M02*
