%TF.GenerationSoftware,Altium Limited,Altium Designer,19.1.5 (86)*%
G04 Layer_Color=32896*
%FSLAX26Y26*%
%MOIN*%
%TF.FileFunction,Other,Notvisible*%
%TF.Part,Single*%
G01*
G75*
%TA.AperFunction,NonConductor*%
%ADD32C,0.005000*%
%ADD34C,0.003937*%
%ADD35C,0.004724*%
%ADD36C,0.001000*%
%ADD37C,0.006000*%
D32*
X8162594Y3518497D02*
G03*
X8162594Y3518497I-9842J0D01*
G01*
X8262594D02*
G03*
X8262594Y3518497I-9842J0D01*
G01*
X8362594D02*
G03*
X8362594Y3518497I-9842J0D01*
G01*
X8462594D02*
G03*
X8462594Y3518497I-9842J0D01*
G01*
X8562594D02*
G03*
X8562594Y3518497I-9842J0D01*
G01*
X8162594Y3418497D02*
G03*
X8162594Y3418497I-9842J0D01*
G01*
X8262594D02*
G03*
X8262594Y3418497I-9842J0D01*
G01*
X8362594D02*
G03*
X8362594Y3418497I-9842J0D01*
G01*
X8462594D02*
G03*
X8462594Y3418497I-9842J0D01*
G01*
X8562594D02*
G03*
X8562594Y3418497I-9842J0D01*
G01*
X8162594Y3318497D02*
G03*
X8162594Y3318497I-9842J0D01*
G01*
X8262594D02*
G03*
X8262594Y3318497I-9842J0D01*
G01*
X8362594D02*
G03*
X8362594Y3318497I-9842J0D01*
G01*
X8462594D02*
G03*
X8462594Y3318497I-9842J0D01*
G01*
X8562594D02*
G03*
X8562594Y3318497I-9842J0D01*
G01*
X8162594Y3218497D02*
G03*
X8162594Y3218497I-9842J0D01*
G01*
X8262594D02*
G03*
X8262594Y3218497I-9842J0D01*
G01*
X8362594D02*
G03*
X8362594Y3218497I-9842J0D01*
G01*
X8462594D02*
G03*
X8462594Y3218497I-9842J0D01*
G01*
X8562594D02*
G03*
X8562594Y3218497I-9842J0D01*
G01*
X8162594Y3118497D02*
G03*
X8162594Y3118497I-9842J0D01*
G01*
X8262594D02*
G03*
X8262594Y3118497I-9842J0D01*
G01*
X8362594D02*
G03*
X8362594Y3118497I-9842J0D01*
G01*
X8462594D02*
G03*
X8462594Y3118497I-9842J0D01*
G01*
X8562594D02*
G03*
X8562594Y3118497I-9842J0D01*
G01*
X8162594Y3018497D02*
G03*
X8162594Y3018497I-9842J0D01*
G01*
X8262594D02*
G03*
X8262594Y3018497I-9842J0D01*
G01*
X8362594D02*
G03*
X8362594Y3018497I-9842J0D01*
G01*
X8462594D02*
G03*
X8462594Y3018497I-9842J0D01*
G01*
X8562594D02*
G03*
X8562594Y3018497I-9842J0D01*
G01*
X8162594Y2918497D02*
G03*
X8162594Y2918497I-9842J0D01*
G01*
X8262594D02*
G03*
X8262594Y2918497I-9842J0D01*
G01*
X8362594D02*
G03*
X8362594Y2918497I-9842J0D01*
G01*
X8462594D02*
G03*
X8462594Y2918497I-9842J0D01*
G01*
X8562594D02*
G03*
X8562594Y2918497I-9842J0D01*
G01*
X8162594Y2818497D02*
G03*
X8162594Y2818497I-9842J0D01*
G01*
X8262594D02*
G03*
X8262594Y2818497I-9842J0D01*
G01*
X8362594D02*
G03*
X8362594Y2818497I-9842J0D01*
G01*
X8462594D02*
G03*
X8462594Y2818497I-9842J0D01*
G01*
X8562594D02*
G03*
X8562594Y2818497I-9842J0D01*
G01*
X8162594Y2718497D02*
G03*
X8162594Y2718497I-9842J0D01*
G01*
X8262594D02*
G03*
X8262594Y2718497I-9842J0D01*
G01*
X8362594D02*
G03*
X8362594Y2718497I-9842J0D01*
G01*
X8462594D02*
G03*
X8462594Y2718497I-9842J0D01*
G01*
X8562594D02*
G03*
X8562594Y2718497I-9842J0D01*
G01*
X8162594Y2618497D02*
G03*
X8162594Y2618497I-9842J0D01*
G01*
X8262594D02*
G03*
X8262594Y2618497I-9842J0D01*
G01*
X8362594D02*
G03*
X8362594Y2618497I-9842J0D01*
G01*
X8462594D02*
G03*
X8462594Y2618497I-9842J0D01*
G01*
X8562594D02*
G03*
X8562594Y2618497I-9842J0D01*
G01*
X8162594Y2518496D02*
G03*
X8162594Y2518496I-9842J0D01*
G01*
X8262594D02*
G03*
X8262594Y2518496I-9842J0D01*
G01*
X8362594D02*
G03*
X8362594Y2518496I-9842J0D01*
G01*
X8462594D02*
G03*
X8462594Y2518496I-9842J0D01*
G01*
X8562594D02*
G03*
X8562594Y2518496I-9842J0D01*
G01*
X8162594Y2418496D02*
G03*
X8162594Y2418496I-9842J0D01*
G01*
X8262594D02*
G03*
X8262594Y2418496I-9842J0D01*
G01*
X8362594D02*
G03*
X8362594Y2418496I-9842J0D01*
G01*
X8462594D02*
G03*
X8462594Y2418496I-9842J0D01*
G01*
X8562594D02*
G03*
X8562594Y2418496I-9842J0D01*
G01*
X8162594Y2318496D02*
G03*
X8162594Y2318496I-9842J0D01*
G01*
X8262594D02*
G03*
X8262594Y2318496I-9842J0D01*
G01*
X8362594D02*
G03*
X8362594Y2318496I-9842J0D01*
G01*
X8462594D02*
G03*
X8462594Y2318496I-9842J0D01*
G01*
X8562594D02*
G03*
X8562594Y2318496I-9842J0D01*
G01*
X8162594Y2218496D02*
G03*
X8162594Y2218496I-9842J0D01*
G01*
X8262594D02*
G03*
X8262594Y2218496I-9842J0D01*
G01*
X8362594D02*
G03*
X8362594Y2218496I-9842J0D01*
G01*
X8462594D02*
G03*
X8462594Y2218496I-9842J0D01*
G01*
X8562594D02*
G03*
X8562594Y2218496I-9842J0D01*
G01*
X8162594Y2118496D02*
G03*
X8162594Y2118496I-9842J0D01*
G01*
X8262594D02*
G03*
X8262594Y2118496I-9842J0D01*
G01*
X8362594D02*
G03*
X8362594Y2118496I-9842J0D01*
G01*
X8462594D02*
G03*
X8462594Y2118496I-9842J0D01*
G01*
X8562594D02*
G03*
X8562594Y2118496I-9842J0D01*
G01*
X8162594Y2018496D02*
G03*
X8162594Y2018496I-9842J0D01*
G01*
X8262594D02*
G03*
X8262594Y2018496I-9842J0D01*
G01*
X8362594D02*
G03*
X8362594Y2018496I-9842J0D01*
G01*
X8462594D02*
G03*
X8462594Y2018496I-9842J0D01*
G01*
X8562594D02*
G03*
X8562594Y2018496I-9842J0D01*
G01*
X8162594Y1918496D02*
G03*
X8162594Y1918496I-9842J0D01*
G01*
X8262594D02*
G03*
X8262594Y1918496I-9842J0D01*
G01*
X8362594D02*
G03*
X8362594Y1918496I-9842J0D01*
G01*
X8462594D02*
G03*
X8462594Y1918496I-9842J0D01*
G01*
X8562594D02*
G03*
X8562594Y1918496I-9842J0D01*
G01*
X8162594Y1818496D02*
G03*
X8162594Y1818496I-9842J0D01*
G01*
X8262594D02*
G03*
X8262594Y1818496I-9842J0D01*
G01*
X8362594D02*
G03*
X8362594Y1818496I-9842J0D01*
G01*
X8462594D02*
G03*
X8462594Y1818496I-9842J0D01*
G01*
X8562594D02*
G03*
X8562594Y1818496I-9842J0D01*
G01*
X8162594Y1718496D02*
G03*
X8162594Y1718496I-9842J0D01*
G01*
X8262594D02*
G03*
X8262594Y1718496I-9842J0D01*
G01*
X8362594D02*
G03*
X8362594Y1718496I-9842J0D01*
G01*
X8462594D02*
G03*
X8462594Y1718496I-9842J0D01*
G01*
X8562594D02*
G03*
X8562594Y1718496I-9842J0D01*
G01*
X8162594Y1618496D02*
G03*
X8162594Y1618496I-9842J0D01*
G01*
X8262594D02*
G03*
X8262594Y1618496I-9842J0D01*
G01*
X8362594D02*
G03*
X8362594Y1618496I-9842J0D01*
G01*
X8462594D02*
G03*
X8462594Y1618496I-9842J0D01*
G01*
X8562594D02*
G03*
X8562594Y1618496I-9842J0D01*
G01*
X8162594Y1518496D02*
G03*
X8162594Y1518496I-9842J0D01*
G01*
X8262594D02*
G03*
X8262594Y1518496I-9842J0D01*
G01*
X8362594D02*
G03*
X8362594Y1518496I-9842J0D01*
G01*
X8462594D02*
G03*
X8462594Y1518496I-9842J0D01*
G01*
X8562594D02*
G03*
X8562594Y1518496I-9842J0D01*
G01*
X8162594Y1418496D02*
G03*
X8162594Y1418496I-9842J0D01*
G01*
X8262594D02*
G03*
X8262594Y1418496I-9842J0D01*
G01*
X8362594D02*
G03*
X8362594Y1418496I-9842J0D01*
G01*
X8462594D02*
G03*
X8462594Y1418496I-9842J0D01*
G01*
X8562594D02*
G03*
X8562594Y1418496I-9842J0D01*
G01*
X8162594Y1318496D02*
G03*
X8162594Y1318496I-9842J0D01*
G01*
X8262594D02*
G03*
X8262594Y1318496I-9842J0D01*
G01*
X8362594D02*
G03*
X8362594Y1318496I-9842J0D01*
G01*
X8462594D02*
G03*
X8462594Y1318496I-9842J0D01*
G01*
X8562594D02*
G03*
X8562594Y1318496I-9842J0D01*
G01*
X8162594Y1218496D02*
G03*
X8162594Y1218496I-9842J0D01*
G01*
X8262594D02*
G03*
X8262594Y1218496I-9842J0D01*
G01*
X8362594D02*
G03*
X8362594Y1218496I-9842J0D01*
G01*
X8462594D02*
G03*
X8462594Y1218496I-9842J0D01*
G01*
X8562594D02*
G03*
X8562594Y1218496I-9842J0D01*
G01*
X8162594Y1118496D02*
G03*
X8162594Y1118496I-9842J0D01*
G01*
X8262594D02*
G03*
X8262594Y1118496I-9842J0D01*
G01*
X8362594D02*
G03*
X8362594Y1118496I-9842J0D01*
G01*
X8462594D02*
G03*
X8462594Y1118496I-9842J0D01*
G01*
X8562594D02*
G03*
X8562594Y1118496I-9842J0D01*
G01*
X8162594Y1018496D02*
G03*
X8162594Y1018496I-9842J0D01*
G01*
X8262594D02*
G03*
X8262594Y1018496I-9842J0D01*
G01*
X8362594D02*
G03*
X8362594Y1018496I-9842J0D01*
G01*
X8462594D02*
G03*
X8462594Y1018496I-9842J0D01*
G01*
X8562594D02*
G03*
X8562594Y1018496I-9842J0D01*
G01*
X8162594Y918495D02*
G03*
X8162594Y918495I-9842J0D01*
G01*
X8262594D02*
G03*
X8262594Y918495I-9842J0D01*
G01*
X8362594D02*
G03*
X8362594Y918495I-9842J0D01*
G01*
X8462594D02*
G03*
X8462594Y918495I-9842J0D01*
G01*
X8562594D02*
G03*
X8562594Y918495I-9842J0D01*
G01*
X8162594Y818495D02*
G03*
X8162594Y818495I-9842J0D01*
G01*
X8262594D02*
G03*
X8262594Y818495I-9842J0D01*
G01*
X8362594D02*
G03*
X8362594Y818495I-9842J0D01*
G01*
X8462594D02*
G03*
X8462594Y818495I-9842J0D01*
G01*
X8562594D02*
G03*
X8562594Y818495I-9842J0D01*
G01*
X8162594Y718495D02*
G03*
X8162594Y718495I-9842J0D01*
G01*
X8262594D02*
G03*
X8262594Y718495I-9842J0D01*
G01*
X8362594D02*
G03*
X8362594Y718495I-9842J0D01*
G01*
X8462594D02*
G03*
X8462594Y718495I-9842J0D01*
G01*
X8562594D02*
G03*
X8562594Y718495I-9842J0D01*
G01*
X8162594Y618495D02*
G03*
X8162594Y618495I-9842J0D01*
G01*
X8262594D02*
G03*
X8262594Y618495I-9842J0D01*
G01*
X8362594D02*
G03*
X8362594Y618495I-9842J0D01*
G01*
X8462594D02*
G03*
X8462594Y618495I-9842J0D01*
G01*
X8562594D02*
G03*
X8562594Y618495I-9842J0D01*
G01*
X8162594Y518495D02*
G03*
X8162594Y518495I-9842J0D01*
G01*
X8262594D02*
G03*
X8262594Y518495I-9842J0D01*
G01*
X8362594D02*
G03*
X8362594Y518495I-9842J0D01*
G01*
X8462594D02*
G03*
X8462594Y518495I-9842J0D01*
G01*
X8562594D02*
G03*
X8562594Y518495I-9842J0D01*
G01*
X8162594Y418495D02*
G03*
X8162594Y418495I-9842J0D01*
G01*
X8262594D02*
G03*
X8262594Y418495I-9842J0D01*
G01*
X8362594D02*
G03*
X8362594Y418495I-9842J0D01*
G01*
X8462594D02*
G03*
X8462594Y418495I-9842J0D01*
G01*
X8562594D02*
G03*
X8562594Y418495I-9842J0D01*
G01*
X8605902Y3718497D02*
G03*
X8605902Y3718497I-53150J0D01*
G01*
Y218495D02*
G03*
X8605902Y218495I-53150J0D01*
G01*
X8602752Y1968496D02*
G03*
X8602752Y1968496I-50000J0D01*
G01*
X193694Y218495D02*
G03*
X193694Y218495I-53150J0D01*
G01*
Y3718497D02*
G03*
X193694Y3718497I-53150J0D01*
G01*
X4350389Y1968496D02*
G03*
X4350389Y1968496I-19685J0D01*
G01*
X8152752Y418495D02*
X8552752D01*
X8152752Y3518497D02*
X8552752D01*
X8152752Y418495D02*
Y3518497D01*
X8552752Y418495D02*
Y3518497D01*
X8517397Y1933141D02*
X8552752Y1968496D01*
X8588107Y1933141D01*
X8517397Y2003851D02*
X8552752Y1968496D01*
X8588107Y2003851D01*
X140544Y218495D02*
X178126Y180913D01*
X102962Y3680915D02*
X140544Y3718497D01*
X102962Y180913D02*
X140544Y218495D01*
Y3718497D02*
X178126Y3680915D01*
X8552752Y3669284D02*
Y3718497D01*
X8601965D01*
X8552752Y169282D02*
Y218495D01*
X8601965D01*
X-7Y3937001D02*
X4330704Y1968496D01*
X8641730Y3838576D02*
Y3897631D01*
X2755900Y3838576D02*
Y3897631D01*
X8641730D01*
X2755900Y98416D02*
X8641730Y98416D01*
X2755900Y3838576D02*
X8641730D01*
Y39361D02*
Y98416D01*
X2755900Y39361D02*
Y98416D01*
Y39361D02*
X8641730D01*
X4330704Y-9D02*
Y1968496D01*
X-7Y-9D02*
X4330704Y1968496D01*
X-7D02*
X4330704D01*
X8661415Y-9D01*
X4330704Y1968496D02*
X8661415Y3937001D01*
X4330704Y1968496D02*
Y3937001D01*
X-7Y3838576D02*
X8661415D01*
X-7Y98416D02*
X8661415D01*
X4330704Y1968496D02*
X8661415D01*
X8042909Y3530676D02*
X8046658Y3532550D01*
X8052281Y3538174D01*
Y3498812D01*
X8027759Y437999D02*
X8048377D01*
X8037131Y423004D01*
X8042754D01*
X8046503Y421130D01*
X8048377Y419255D01*
X8050252Y413632D01*
Y409884D01*
X8048377Y404261D01*
X8044628Y400512D01*
X8039005Y398637D01*
X8033382D01*
X8027759Y400512D01*
X8025885Y402386D01*
X8024010Y406135D01*
X8060935Y428627D02*
Y430502D01*
X8062810Y434250D01*
X8064684Y436125D01*
X8068433Y437999D01*
X8075930D01*
X8079679Y436125D01*
X8081553Y434250D01*
X8083428Y430502D01*
Y426753D01*
X8081553Y423004D01*
X8077805Y417381D01*
X8059061Y398637D01*
X8085302D01*
X8559591Y3580959D02*
X8538972Y3554717D01*
Y3580959D02*
X8559591D01*
X8538972Y3554717D02*
X8559591D01*
X8460751Y3580245D02*
Y3554004D01*
Y3574622D02*
X8457003Y3578371D01*
X8453254Y3580245D01*
X8447631D01*
X8443882Y3578371D01*
X8440133Y3574622D01*
X8438259Y3568999D01*
Y3565250D01*
X8440133Y3559627D01*
X8443882Y3555878D01*
X8447631Y3554004D01*
X8453254D01*
X8457003Y3555878D01*
X8460751Y3559627D01*
X8338259Y3588887D02*
Y3549525D01*
Y3570143D02*
X8342008Y3573892D01*
X8345756Y3575767D01*
X8351379D01*
X8355128Y3573892D01*
X8358877Y3570143D01*
X8360751Y3564520D01*
Y3560772D01*
X8358877Y3555148D01*
X8355128Y3551400D01*
X8351379Y3549525D01*
X8345756D01*
X8342008Y3551400D01*
X8338259Y3555148D01*
X8264147Y3575335D02*
X8260398Y3579084D01*
X8256649Y3580959D01*
X8251026D01*
X8247277Y3579084D01*
X8243529Y3575335D01*
X8241654Y3569712D01*
Y3565964D01*
X8243529Y3560340D01*
X8247277Y3556592D01*
X8251026Y3554717D01*
X8256649D01*
X8260398Y3556592D01*
X8264147Y3560340D01*
X8162178Y3588887D02*
Y3549525D01*
Y3570143D02*
X8158429Y3573892D01*
X8154681Y3575767D01*
X8149057D01*
X8145309Y3573892D01*
X8141560Y3570143D01*
X8139686Y3564520D01*
Y3560772D01*
X8141560Y3555148D01*
X8145309Y3551400D01*
X8149057Y3549525D01*
X8154681D01*
X8158429Y3551400D01*
X8162178Y3555148D01*
X8808983Y2128476D02*
X8805234Y2135973D01*
X8797737Y2143471D01*
X8790239Y2147219D01*
X8775244D01*
X8767747Y2143471D01*
X8760249Y2135973D01*
X8756501Y2128476D01*
X8752752Y2117230D01*
Y2098486D01*
X8756501Y2087240D01*
X8760249Y2079742D01*
X8767747Y2072245D01*
X8775244Y2068496D01*
X8790239D01*
X8797737Y2072245D01*
X8805234Y2079742D01*
X8808983Y2087240D01*
Y2098486D01*
X8790239D02*
X8808983D01*
X8826977Y2147219D02*
Y2068496D01*
Y2147219D02*
X8860716D01*
X8871962Y2143471D01*
X8875710Y2139722D01*
X8879459Y2132224D01*
Y2124727D01*
X8875710Y2117230D01*
X8871962Y2113481D01*
X8860716Y2109732D01*
X8826977D01*
X8853218D02*
X8879459Y2068496D01*
X8897078Y2147219D02*
Y2068496D01*
X8913573Y2147219D02*
Y2068496D01*
Y2147219D02*
X8939814D01*
X8951060Y2143471D01*
X8958557Y2135973D01*
X8962306Y2128476D01*
X8966055Y2117230D01*
Y2098486D01*
X8962306Y2087240D01*
X8958557Y2079742D01*
X8951060Y2072245D01*
X8939814Y2068496D01*
X8913573D01*
X9068020Y2147219D02*
X9060523Y2143471D01*
X9053025Y2135973D01*
X9049277Y2128476D01*
X9045528Y2117230D01*
Y2098486D01*
X9049277Y2087240D01*
X9053025Y2079742D01*
X9060523Y2072245D01*
X9068020Y2068496D01*
X9083015D01*
X9090513Y2072245D01*
X9098010Y2079742D01*
X9101759Y2087240D01*
X9105508Y2098486D01*
Y2117230D01*
X9101759Y2128476D01*
X9098010Y2135973D01*
X9090513Y2143471D01*
X9083015Y2147219D01*
X9068020D01*
X9123876D02*
Y2068496D01*
Y2147219D02*
X9157615D01*
X9168861Y2143471D01*
X9172610Y2139722D01*
X9176359Y2132224D01*
Y2124727D01*
X9172610Y2117230D01*
X9168861Y2113481D01*
X9157615Y2109732D01*
X9123876D01*
X9150118D02*
X9176359Y2068496D01*
X9250209Y2128476D02*
X9246460Y2135973D01*
X9238962Y2143471D01*
X9231465Y2147219D01*
X9216470D01*
X9208973Y2143471D01*
X9201475Y2135973D01*
X9197726Y2128476D01*
X9193978Y2117230D01*
Y2098486D01*
X9197726Y2087240D01*
X9201475Y2079742D01*
X9208973Y2072245D01*
X9216470Y2068496D01*
X9231465D01*
X9238962Y2072245D01*
X9246460Y2079742D01*
X9250209Y2087240D01*
Y2098486D01*
X9231465D02*
X9250209D01*
D34*
X7408858Y381102D02*
G03*
X7408858Y381102I-8858J0D01*
G01*
Y518898D02*
G03*
X7408858Y518898I-8858J0D01*
G01*
Y840000D02*
G03*
X7408858Y840000I-8858J0D01*
G01*
Y977795D02*
G03*
X7408858Y977795I-8858J0D01*
G01*
X7400000Y518898D02*
Y527756D01*
X7391142Y518898D02*
X7400000D01*
X7391142Y381102D02*
X7400000D01*
Y389961D01*
X8250000Y1969999D02*
X8947638Y1970000D01*
X8658662Y122362D02*
Y3815276D01*
X7760630Y960000D02*
X7800000D01*
X7839370D01*
X7800000D02*
Y999370D01*
Y920630D02*
Y960000D01*
X7911800Y960849D02*
X7946879Y978722D01*
X7876721Y942975D02*
X7911800Y960849D01*
X7929674Y925770D01*
X7893927Y995928D02*
X7911800Y960849D01*
X7688200Y959151D02*
X7723279Y977025D01*
X7653121Y941278D02*
X7688200Y959151D01*
X7706073Y924072D01*
X7670326Y994230D02*
X7688200Y959151D01*
X7400000Y977795D02*
Y986654D01*
X7391142Y977795D02*
X7400000D01*
X7391142Y840000D02*
X7400000D01*
Y848858D01*
X7760630Y420000D02*
X7800000D01*
X7839370D01*
X7800000D02*
Y459370D01*
Y380630D02*
Y420000D01*
X7911800Y420849D02*
X7946879Y438722D01*
X7876721Y402975D02*
X7911800Y420849D01*
X7929674Y385770D01*
X7893927Y455928D02*
X7911800Y420849D01*
X7688200Y419151D02*
X7723279Y437025D01*
X7653121Y401278D02*
X7688200Y419151D01*
X7706073Y384072D01*
X7670326Y454230D02*
X7688200Y419151D01*
X391081Y1962065D02*
X405000Y1975985D01*
X391081Y1989904D02*
X405000Y1975985D01*
X418920Y1989904D01*
X405000Y1975985D02*
X418920Y1962065D01*
X385315Y773228D02*
X405000D01*
Y792913D01*
Y773228D02*
X424685D01*
X405000Y753543D02*
Y773228D01*
X385315Y3178741D02*
X405000D01*
Y3198426D01*
Y3178741D02*
X424685D01*
X405000Y3159056D02*
Y3178741D01*
X385315Y1161024D02*
X405000D01*
Y1180709D01*
Y1161024D02*
X424685D01*
X405000Y1141339D02*
Y1161024D01*
X385315Y1269685D02*
X405000D01*
Y1289370D01*
Y1269685D02*
X424685D01*
X405000Y1250000D02*
Y1269685D01*
X385315Y1378347D02*
X405000D01*
Y1398032D01*
Y1378347D02*
X424685D01*
X405000Y1358661D02*
Y1378347D01*
X385315Y1487008D02*
X405000D01*
Y1506693D01*
Y1487008D02*
X424685D01*
X405000Y1467323D02*
Y1487008D01*
X385315Y1595669D02*
X405000D01*
Y1615354D01*
Y1595669D02*
X424685D01*
X405000Y1575984D02*
Y1595669D01*
X385315Y1704331D02*
X405000D01*
Y1724016D01*
Y1704331D02*
X424685D01*
X405000Y1684646D02*
Y1704331D01*
X385315Y1812992D02*
X405000D01*
Y1832677D01*
Y1812992D02*
X424685D01*
X405000Y1793307D02*
Y1812992D01*
X385315Y1921654D02*
X405000D01*
Y1941339D01*
Y1921654D02*
X424685D01*
X405000Y1901969D02*
Y1921654D01*
X385315Y2030315D02*
X405000D01*
Y2050000D01*
Y2030315D02*
X424685D01*
X405000Y2010630D02*
Y2030315D01*
X385315Y2138977D02*
X405000D01*
Y2158662D01*
Y2138977D02*
X424685D01*
X405000Y2119292D02*
Y2138977D01*
X385315Y2247638D02*
X405000D01*
Y2267323D01*
Y2247638D02*
X424685D01*
X405000Y2227953D02*
Y2247638D01*
X385315Y2356300D02*
X405000D01*
Y2375985D01*
Y2356300D02*
X424685D01*
X405000Y2336615D02*
Y2356300D01*
X385315Y2464961D02*
X405000D01*
Y2484646D01*
Y2464961D02*
X424685D01*
X405000Y2445276D02*
Y2464961D01*
X385315Y2573623D02*
X405000D01*
Y2593308D01*
Y2573623D02*
X424685D01*
X405000Y2553938D02*
Y2573623D01*
X385315Y2682284D02*
X405000D01*
Y2701969D01*
Y2682284D02*
X424685D01*
X405000Y2662599D02*
Y2682284D01*
X385315Y2790946D02*
X405000D01*
Y2810631D01*
Y2790946D02*
X424685D01*
X405000Y2771261D02*
Y2790946D01*
X285315Y1106693D02*
X305000D01*
Y1126378D01*
Y1106693D02*
X324685D01*
X305000Y1087008D02*
Y1106693D01*
X285315Y1215354D02*
X305000D01*
Y1235039D01*
Y1215354D02*
X324685D01*
X305000Y1195669D02*
Y1215354D01*
X285315Y1324016D02*
X305000D01*
Y1343701D01*
Y1324016D02*
X324685D01*
X305000Y1304331D02*
Y1324016D01*
X285315Y1432677D02*
X305000D01*
Y1452362D01*
Y1432677D02*
X324685D01*
X305000Y1412992D02*
Y1432677D01*
X285315Y1541339D02*
X305000D01*
Y1561024D01*
Y1541339D02*
X324685D01*
X305000Y1521654D02*
Y1541339D01*
X285315Y1650000D02*
X305000D01*
Y1669685D01*
Y1650000D02*
X324685D01*
X305000Y1630315D02*
Y1650000D01*
X285315Y1758662D02*
X305000D01*
Y1778347D01*
Y1758662D02*
X324685D01*
X305000Y1738977D02*
Y1758662D01*
X285315Y1867323D02*
X305000D01*
Y1887008D01*
Y1867323D02*
X324685D01*
X305000Y1847638D02*
Y1867323D01*
X285315Y1975985D02*
X305000D01*
Y1995670D01*
Y1975985D02*
X324685D01*
X305000Y1956300D02*
Y1975985D01*
X285315Y2084646D02*
X305000D01*
Y2104331D01*
Y2084646D02*
X324685D01*
X305000Y2064961D02*
Y2084646D01*
X285315Y2193308D02*
X305000D01*
Y2212993D01*
Y2193308D02*
X324685D01*
X305000Y2173622D02*
Y2193308D01*
X285315Y2301969D02*
X305000D01*
Y2321654D01*
Y2301969D02*
X324685D01*
X305000Y2282284D02*
Y2301969D01*
X285315Y2410631D02*
X305000D01*
Y2430316D01*
Y2410631D02*
X324685D01*
X305000Y2390945D02*
Y2410631D01*
X285315Y2519292D02*
X305000D01*
Y2538977D01*
Y2519292D02*
X324685D01*
X305000Y2499607D02*
Y2519292D01*
X285315Y2627954D02*
X305000D01*
Y2647639D01*
Y2627954D02*
X324685D01*
X305000Y2608268D02*
Y2627954D01*
X285315Y2736615D02*
X305000D01*
Y2756300D01*
Y2736615D02*
X324685D01*
X305000Y2716930D02*
Y2736615D01*
X485315Y1106693D02*
X505000D01*
Y1126378D01*
Y1106693D02*
X524685D01*
X505000Y1087008D02*
Y1106693D01*
X485315Y1215354D02*
X505000D01*
Y1235039D01*
Y1215354D02*
X524685D01*
X505000Y1195669D02*
Y1215354D01*
X485315Y1324016D02*
X505000D01*
Y1343701D01*
Y1324016D02*
X524685D01*
X505000Y1304331D02*
Y1324016D01*
X485315Y1432677D02*
X505000D01*
Y1452362D01*
Y1432677D02*
X524685D01*
X505000Y1412992D02*
Y1432677D01*
X485315Y1541339D02*
X505000D01*
Y1561024D01*
Y1541339D02*
X524685D01*
X505000Y1521654D02*
Y1541339D01*
X485315Y1650000D02*
X505000D01*
Y1669685D01*
Y1650000D02*
X524685D01*
X505000Y1630315D02*
Y1650000D01*
X485315Y1758662D02*
X505000D01*
Y1778347D01*
Y1758662D02*
X524685D01*
X505000Y1738977D02*
Y1758662D01*
X485315Y1867323D02*
X505000D01*
Y1887008D01*
Y1867323D02*
X524685D01*
X505000Y1847638D02*
Y1867323D01*
X485315Y1975985D02*
X505000D01*
Y1995670D01*
Y1975985D02*
X524685D01*
X505000Y1956300D02*
Y1975985D01*
X485315Y2084646D02*
X505000D01*
Y2104331D01*
Y2084646D02*
X524685D01*
X505000Y2064961D02*
Y2084646D01*
X485315Y2193308D02*
X505000D01*
Y2212993D01*
Y2193308D02*
X524685D01*
X505000Y2173622D02*
Y2193308D01*
X485315Y2301969D02*
X505000D01*
Y2321654D01*
Y2301969D02*
X524685D01*
X505000Y2282284D02*
Y2301969D01*
X485315Y2410631D02*
X505000D01*
Y2430316D01*
Y2410631D02*
X524685D01*
X505000Y2390945D02*
Y2410631D01*
X485315Y2519292D02*
X505000D01*
Y2538977D01*
Y2519292D02*
X524685D01*
X505000Y2499607D02*
Y2519292D01*
X485315Y2627954D02*
X505000D01*
Y2647639D01*
Y2627954D02*
X524685D01*
X505000Y2608268D02*
Y2627954D01*
X485315Y2736615D02*
X505000D01*
Y2756300D01*
Y2736615D02*
X524685D01*
X505000Y2716930D02*
Y2736615D01*
X285315Y2845276D02*
X305000D01*
Y2864961D01*
Y2845276D02*
X324685D01*
X305000Y2825591D02*
Y2845276D01*
X485315D02*
X505000D01*
Y2864961D01*
Y2845276D02*
X524685D01*
X505000Y2825591D02*
Y2845276D01*
D35*
X8650000Y1895000D02*
X8602771D01*
Y1918614D01*
X8610643Y1926486D01*
X8626386D01*
X8634257Y1918614D01*
Y1895000D01*
X8610643Y1973715D02*
X8602771Y1965843D01*
Y1950100D01*
X8610643Y1942229D01*
X8642129D01*
X8650000Y1950100D01*
Y1965843D01*
X8642129Y1973715D01*
X8602771Y1989458D02*
X8650000D01*
Y2013072D01*
X8642129Y2020944D01*
X8634257D01*
X8626386Y2013072D01*
Y1989458D01*
Y2013072D01*
X8618514Y2020944D01*
X8610643D01*
X8602771Y2013072D01*
Y1989458D01*
D36*
X8427752Y3518496D02*
X8477752D01*
X8452752Y3493496D02*
Y3543496D01*
X8527752Y1968496D02*
X8577752D01*
X8552752Y1943496D02*
Y1993496D01*
D37*
X8517739Y3518496D02*
X8477752D01*
X8517739Y3558483D01*
Y3568480D01*
X8507742Y3578477D01*
X8487749D01*
X8477752Y3568480D01*
X8537733Y3518496D02*
X8557726D01*
X8547729D01*
Y3578477D01*
X8537733Y3568480D01*
X8617707Y3518496D02*
Y3578477D01*
X8587716Y3548486D01*
X8627703D01*
X8647697Y3518496D02*
Y3528493D01*
X8657694D01*
Y3518496D01*
X8647697D01*
X8697681Y3578477D02*
X8737668D01*
Y3568480D01*
X8697681Y3528493D01*
Y3518496D01*
X8767658Y3508499D02*
X8777655Y3518496D01*
Y3528493D01*
X8767658D01*
Y3518496D01*
X8777655D01*
X8767658Y3508499D01*
X8757661Y3498503D01*
X8817642Y3568480D02*
X8827639Y3578477D01*
X8847632D01*
X8857629Y3568480D01*
Y3558483D01*
X8847632Y3548486D01*
X8857629Y3538490D01*
Y3528493D01*
X8847632Y3518496D01*
X8827639D01*
X8817642Y3528493D01*
Y3538490D01*
X8827639Y3548486D01*
X8817642Y3558483D01*
Y3568480D01*
X8827639Y3548486D02*
X8847632D01*
X8877623Y3528493D02*
X8887619Y3518496D01*
X8907613D01*
X8917610Y3528493D01*
Y3568480D01*
X8907613Y3578477D01*
X8887619D01*
X8877623Y3568480D01*
Y3558483D01*
X8887619Y3548486D01*
X8917610D01*
X8937603Y3518496D02*
Y3528493D01*
X8947600D01*
Y3518496D01*
X8937603D01*
X8987587Y3568480D02*
X8997584Y3578477D01*
X9017577D01*
X9027574Y3568480D01*
Y3558483D01*
X9017577Y3548486D01*
X9007581D01*
X9017577D01*
X9027574Y3538490D01*
Y3528493D01*
X9017577Y3518496D01*
X8997584D01*
X8987587Y3528493D01*
X9047568Y3578477D02*
X9087555D01*
Y3568480D01*
X9047568Y3528493D01*
Y3518496D01*
X9187522D02*
X9167529Y3538490D01*
Y3558483D01*
X9187522Y3578477D01*
X9217513Y3518496D02*
Y3558483D01*
X9227509D01*
X9237506Y3548486D01*
Y3518496D01*
Y3548486D01*
X9247503Y3558483D01*
X9257500Y3548486D01*
Y3518496D01*
X9277493D02*
Y3558483D01*
X9287490D01*
X9297487Y3548486D01*
Y3518496D01*
Y3548486D01*
X9307484Y3558483D01*
X9317480Y3548486D01*
Y3518496D01*
X9337474D02*
X9357467Y3538490D01*
Y3558483D01*
X9337474Y3578477D01*
X8617739Y1968496D02*
X8577752D01*
X8617739Y2008483D01*
Y2018480D01*
X8607742Y2028477D01*
X8587749D01*
X8577752Y2018480D01*
X8637733Y1968496D02*
X8657726D01*
X8647729D01*
Y2028477D01*
X8637733Y2018480D01*
X8687716Y2028477D02*
X8727703D01*
Y2018480D01*
X8687716Y1978493D01*
Y1968496D01*
X8747697D02*
Y1978493D01*
X8757694D01*
Y1968496D01*
X8747697D01*
X8837668D02*
X8797681D01*
X8837668Y2008483D01*
Y2018480D01*
X8827671Y2028477D01*
X8807678D01*
X8797681Y2018480D01*
X8887652Y1968496D02*
Y2028477D01*
X8857661Y1998486D01*
X8897648D01*
X8927639Y1958499D02*
X8937636Y1968496D01*
Y1978493D01*
X8927639D01*
Y1968496D01*
X8937636D01*
X8927639Y1958499D01*
X8917642Y1948503D01*
X9017610Y2028477D02*
X8977623D01*
Y1998486D01*
X8997616Y2008483D01*
X9007613D01*
X9017610Y1998486D01*
Y1978493D01*
X9007613Y1968496D01*
X8987619D01*
X8977623Y1978493D01*
X9037603Y2018480D02*
X9047600Y2028477D01*
X9067594D01*
X9077590Y2018480D01*
Y1978493D01*
X9067594Y1968496D01*
X9047600D01*
X9037603Y1978493D01*
Y2018480D01*
X9177558Y1968496D02*
X9157564Y1988490D01*
Y2008483D01*
X9177558Y2028477D01*
X9207548Y1968496D02*
Y2008483D01*
X9217545D01*
X9227542Y1998486D01*
Y1968496D01*
Y1998486D01*
X9237539Y2008483D01*
X9247535Y1998486D01*
Y1968496D01*
X9267529D02*
Y2008483D01*
X9277526D01*
X9287522Y1998486D01*
Y1968496D01*
Y1998486D01*
X9297519Y2008483D01*
X9307516Y1998486D01*
Y1968496D01*
X9327509D02*
X9347503Y1988490D01*
Y2008483D01*
X9327509Y2028477D01*
%TF.MD5,7f99fb0e26f3b00635c1cacdafdeaa3f*%
M02*
