%TF.GenerationSoftware,Altium Limited,Altium Designer,19.1.5 (86)*%
G04 Layer_Color=255*
%FSLAX26Y26*%
%MOIN*%
%TF.FileFunction,Pads,Bot*%
%TF.Part,Single*%
G01*
G75*
%TA.AperFunction,ComponentPad*%
%ADD17R,0.059055X0.059055*%
%ADD18C,0.059055*%
%ADD19C,0.066929*%
%ADD21C,0.078740*%
%ADD22C,0.149606*%
%TA.AperFunction,ViaPad*%
%ADD23C,0.175197*%
%TA.AperFunction,ComponentPad*%
%ADD26C,0.200787*%
D17*
X7400000Y518898D02*
D03*
Y977795D02*
D03*
D18*
Y381102D02*
D03*
Y840000D02*
D03*
D19*
X8450000Y3520000D02*
D03*
Y3420000D02*
D03*
Y3320000D02*
D03*
Y3220000D02*
D03*
Y3120000D02*
D03*
Y3020000D02*
D03*
Y2920000D02*
D03*
Y2820000D02*
D03*
Y2020000D02*
D03*
Y2120000D02*
D03*
Y2220000D02*
D03*
Y2320000D02*
D03*
Y2420000D02*
D03*
Y2520000D02*
D03*
Y2620000D02*
D03*
Y2720000D02*
D03*
Y1220000D02*
D03*
Y1320000D02*
D03*
Y1420000D02*
D03*
Y1520000D02*
D03*
Y1620000D02*
D03*
Y1720000D02*
D03*
Y1820000D02*
D03*
Y1920000D02*
D03*
Y420000D02*
D03*
Y520000D02*
D03*
Y620000D02*
D03*
Y720000D02*
D03*
Y820000D02*
D03*
Y920000D02*
D03*
Y1020000D02*
D03*
Y1120000D02*
D03*
X8350000D02*
D03*
Y1020000D02*
D03*
Y920000D02*
D03*
Y820000D02*
D03*
Y720000D02*
D03*
Y620000D02*
D03*
Y520000D02*
D03*
Y420000D02*
D03*
Y1920000D02*
D03*
Y1820000D02*
D03*
Y1720000D02*
D03*
Y1620000D02*
D03*
Y1520000D02*
D03*
Y1420000D02*
D03*
Y1320000D02*
D03*
Y1220000D02*
D03*
Y2720000D02*
D03*
Y2620000D02*
D03*
Y2520000D02*
D03*
Y2420000D02*
D03*
Y2320000D02*
D03*
Y2220000D02*
D03*
Y2120000D02*
D03*
Y2020000D02*
D03*
Y2820000D02*
D03*
Y2920000D02*
D03*
Y3020000D02*
D03*
Y3120000D02*
D03*
Y3220000D02*
D03*
Y3320000D02*
D03*
Y3420000D02*
D03*
Y3520000D02*
D03*
X305000Y1106693D02*
D03*
Y1215354D02*
D03*
Y1324016D02*
D03*
Y1432677D02*
D03*
Y1541338D02*
D03*
Y1650000D02*
D03*
Y1758661D02*
D03*
Y1867323D02*
D03*
Y1975984D02*
D03*
Y2084646D02*
D03*
Y2193307D02*
D03*
Y2301968D02*
D03*
Y2410630D02*
D03*
Y2519291D02*
D03*
Y2627953D02*
D03*
Y2736614D02*
D03*
Y2845276D02*
D03*
X405000Y1161024D02*
D03*
Y1269685D02*
D03*
Y1378347D02*
D03*
Y1487008D02*
D03*
Y1595669D02*
D03*
Y1704331D02*
D03*
Y1812992D02*
D03*
Y1921653D02*
D03*
Y2030315D02*
D03*
Y2138976D02*
D03*
Y2247638D02*
D03*
Y2356299D02*
D03*
Y2464961D02*
D03*
Y2573622D02*
D03*
Y2682284D02*
D03*
Y2790945D02*
D03*
X505000Y1106693D02*
D03*
Y1215354D02*
D03*
Y1324016D02*
D03*
Y1432677D02*
D03*
Y1541338D02*
D03*
Y1650000D02*
D03*
Y1758661D02*
D03*
Y1867323D02*
D03*
Y1975984D02*
D03*
Y2084646D02*
D03*
Y2193307D02*
D03*
Y2301968D02*
D03*
Y2410630D02*
D03*
Y2519291D02*
D03*
Y2627953D02*
D03*
Y2736614D02*
D03*
Y2845275D02*
D03*
D21*
X7688200Y959151D02*
D03*
X7911800Y960849D02*
D03*
X7688200Y419151D02*
D03*
X7911800Y420849D02*
D03*
D22*
X405000Y3178741D02*
D03*
Y773228D02*
D03*
D23*
X140547Y218496D02*
D03*
Y3718496D02*
D03*
D26*
X8550000Y3720000D02*
D03*
Y220000D02*
D03*
%TF.MD5,06e06c627c66ec83494f1387ec43b29c*%
M02*
