Altium Designer Pick and Place Locations
G:\Departments\PH\Groups\TA1\Atlas_trt\Xavier\Xavi\LHCb\SciFi\PCB\Heat Current Source V1\Project Outputs for EDA-0xxxx-V2-0_project\Pick Place for Heat Current Source V1.csv

========================================================================================================================
File Design Information:

Date:       11/11/20
Time:       13:29
Revision:   Not in VersionControl
Variant:    No variations
Units used: mil

"Designator","Comment","Layer","Footprint","Center-X(mil)","Center-Y(mil)","Rotation","Description","Manufacturer","Manufacturer Part Number","Mounted","Pin Count","SMD"
"R9","510","TopLayer","RESC3216X65N","6470.000mil","420.000mil","270","Resistor - 1%","GENERIC","R1206_510R_1%_0.25W_100PPM","Yes","2","Yes"
"R8","510","TopLayer","RESC3216X65N","6690.000mil","420.000mil","270","Resistor - 1%","GENERIC","R1206_510R_1%_0.25W_100PPM","Yes","2","Yes"
"R7","510","TopLayer","RESC3216X65N","6690.000mil","810.000mil","270","Resistor - 1%","GENERIC","R1206_510R_1%_0.25W_100PPM","Yes","2","Yes"
"R6","510","TopLayer","RESC3216X65N","6470.000mil","810.000mil","270","Resistor - 1%","GENERIC","R1206_510R_1%_0.25W_100PPM","Yes","2","Yes"
"P1","DIN 41612 Type B","TopLayer","HARTING_09_02_164_2921","8450.000mil","1970.000mil","0","Connector 64ab male (2x32)","HARTING","09 02 164 2921","Yes","66","No"
"LD2","Green","TopLayer","LED_OSRAM_LGN971","6580.000mil","420.000mil","90","LED Green 1C 2A","OSRAM","LGN971","Yes","2","Yes"
"LD1","Green","TopLayer","LED_OSRAM_LGN971","6580.000mil","810.000mil","90","LED Green 1C 2A","OSRAM","LGN971","Yes","2","Yes"
"FH2","Fuse Holder","TopLayer","FUSH_LITTELFUSE_281005","7800.000mil","420.000mil","270","Fuse Holder","LITTELFUSE","281005","Yes","2","No"
"FH1","Fuse Holder","TopLayer","FUSH_LITTELFUSE_281005","7800.000mil","960.000mil","270","Fuse Holder","LITTELFUSE","281005","Yes","2","No"
"F2","2A-125V","TopLayer","FUSE_SCHURTER_MSF125_v","-3047.248mil","-3031.504mil","0","Fuse","SCHURTER","0034.4254","Yes","0","No"
"F1","2A-125V","TopLayer","FUSE_SCHURTER_MSF125_v","-3047.248mil","-3031.504mil","0","Fuse","SCHURTER","0034.4254","Yes","0","No"
"C7","100uF","TopLayer","CAPPR350-850X800","7400.000mil","450.000mil","270","Polarised capacitor","RUBYCON","25ML100M8X7","Yes","2","No"
"C6","100uF","TopLayer","CAPPR350-850X800","7400.000mil","908.898mil","270","Polarised capacitor","RUBYCON","25ML100M8X7","Yes","2","No"
"R230","10k","TopLayer","RESC3216X65N","6820.000mil","1955.000mil","90","Resistor - 1%","GENERIC","R1206_10K_1%_0.25W_100PPM","Yes","2","Yes"
"R220","10k","TopLayer","RESC3216X65N","6820.000mil","1500.000mil","90","Resistor - 1%","GENERIC","R1206_10K_1%_0.25W_100PPM","Yes","2","Yes"
"R210","10k","TopLayer","RESC3216X65N","5960.000mil","1505.000mil","90","Resistor - 1%","GENERIC","R1206_10K_1%_0.25W_100PPM","Yes","2","Yes"
"R200","10k","TopLayer","RESC3216X65N","5960.000mil","1955.000mil","90","Resistor - 1%","GENERIC","R1206_10K_1%_0.25W_100PPM","Yes","2","Yes"
"R190","10k","TopLayer","RESC3216X65N","6820.000mil","3355.000mil","90","Resistor - 1%","GENERIC","R1206_10K_1%_0.25W_100PPM","Yes","2","Yes"
"R180","10k","TopLayer","RESC3216X65N","6820.000mil","2910.000mil","90","Resistor - 1%","GENERIC","R1206_10K_1%_0.25W_100PPM","Yes","2","Yes"
"R170","10k","TopLayer","RESC3216X65N","5960.000mil","2975.000mil","90","Resistor - 1%","GENERIC","R1206_10K_1%_0.25W_100PPM","Yes","2","Yes"
"R160","10k","TopLayer","RESC3216X65N","5960.000mil","3380.000mil","90","Resistor - 1%","GENERIC","R1206_10K_1%_0.25W_100PPM","Yes","2","Yes"
"R150","10k","TopLayer","RESC3216X65N","4620.000mil","1877.087mil","90","Resistor - 1%","GENERIC","R1206_10K_1%_0.25W_100PPM","Yes","2","Yes"
"R140","10k","TopLayer","RESC3216X65N","4625.000mil","1505.000mil","90","Resistor - 1%","GENERIC","R1206_10K_1%_0.25W_100PPM","Yes","2","Yes"
"R130","10k","TopLayer","RESC3216X65N","3780.000mil","1505.000mil","90","Resistor - 1%","GENERIC","R1206_10K_1%_0.25W_100PPM","Yes","2","Yes"
"R120","10k","TopLayer","RESC3216X65N","3780.000mil","1955.000mil","90","Resistor - 1%","GENERIC","R1206_10K_1%_0.25W_100PPM","Yes","2","Yes"
"R110","10k","TopLayer","RESC3216X65N","4630.000mil","3350.000mil","90","Resistor - 1%","GENERIC","R1206_10K_1%_0.25W_100PPM","Yes","2","Yes"
"R100","10k","TopLayer","RESC3216X65N","4630.000mil","2905.000mil","90","Resistor - 1%","GENERIC","R1206_10K_1%_0.25W_100PPM","Yes","2","Yes"
"R90","10k","TopLayer","RESC3216X65N","3775.000mil","2970.000mil","90","Resistor - 1%","GENERIC","R1206_10K_1%_0.25W_100PPM","Yes","2","Yes"
"R80","10k","TopLayer","RESC3216X65N","3780.000mil","3395.000mil","90","Resistor - 1%","GENERIC","R1206_10K_1%_0.25W_100PPM","Yes","2","Yes"
"R70","10k","TopLayer","RESC3216X65N","2430.000mil","1875.000mil","90","Resistor - 1%","GENERIC","R1206_10K_1%_0.25W_100PPM","Yes","2","Yes"
"R60","10k","TopLayer","RESC3216X65N","2430.000mil","1500.000mil","90","Resistor - 1%","GENERIC","R1206_10K_1%_0.25W_100PPM","Yes","2","Yes"
"R50","10k","TopLayer","RESC3216X65N","1580.000mil","1505.000mil","90","Resistor - 1%","GENERIC","R1206_10K_1%_0.25W_100PPM","Yes","2","Yes"
"R40","10k","TopLayer","RESC3216X65N","1580.000mil","1955.000mil","90","Resistor - 1%","GENERIC","R1206_10K_1%_0.25W_100PPM","Yes","2","Yes"
"R30","10k","TopLayer","RESC3216X65N","2430.000mil","3355.000mil","90","Resistor - 1%","GENERIC","R1206_10K_1%_0.25W_100PPM","Yes","2","Yes"
"R20","10k","TopLayer","RESC3216X65N","2425.000mil","2905.000mil","90","Resistor - 1%","GENERIC","R1206_10K_1%_0.25W_100PPM","Yes","2","Yes"
"R10","10k","TopLayer","RESC3216X65N","1580.000mil","2975.000mil","90","Resistor - 1%","GENERIC","R1206_10K_1%_0.25W_100PPM","Yes","2","Yes"
"IC231","REF102AU","TopLayer","SOIC127P600X175-8N","6610.000mil","1920.000mil","0","Precision Voltage Reference","TEXAS INSTRUMENTS","REF102AU","Yes","8","Yes"
"IC221","REF102AU","TopLayer","SOIC127P600X175-8N","6610.000mil","1470.000mil","0","Precision Voltage Reference","TEXAS INSTRUMENTS","REF102AU","Yes","8","Yes"
"IC211","REF102AU","TopLayer","SOIC127P600X175-8N","5750.000mil","1470.000mil","0","Precision Voltage Reference","TEXAS INSTRUMENTS","REF102AU","Yes","8","Yes"
"IC201","REF102AU","TopLayer","SOIC127P600X175-8N","5750.000mil","1920.000mil","0","Precision Voltage Reference","TEXAS INSTRUMENTS","REF102AU","Yes","8","Yes"
"IC200","OPA4277UA","TopLayer","SOIC127P600X175-14N","6195.000mil","1670.000mil","0","Quad Operational Amplifier","TEXAS INSTRUMENTS","OPA4277UA","Yes","14","Yes"
"IC191","REF102AU","TopLayer","SOIC127P600X175-8N","6610.000mil","3320.000mil","0","Precision Voltage Reference","TEXAS INSTRUMENTS","REF102AU","Yes","8","Yes"
"IC181","REF102AU","TopLayer","SOIC127P600X175-8N","6610.000mil","2875.000mil","0","Precision Voltage Reference","TEXAS INSTRUMENTS","REF102AU","Yes","8","Yes"
"IC171","REF102AU","TopLayer","SOIC127P600X175-8N","5750.000mil","2940.000mil","0","Precision Voltage Reference","TEXAS INSTRUMENTS","REF102AU","Yes","8","Yes"
"IC161","REF102AU","TopLayer","SOIC127P600X175-8N","5750.000mil","3345.000mil","0","Precision Voltage Reference","TEXAS INSTRUMENTS","REF102AU","Yes","8","Yes"
"IC160","OPA4277UA","TopLayer","SOIC127P600X175-14N","6195.000mil","3145.000mil","0","Quad Operational Amplifier","TEXAS INSTRUMENTS","OPA4277UA","Yes","14","Yes"
"IC151","REF102AU","TopLayer","SOIC127P600X175-8N","4410.000mil","1845.000mil","0","Precision Voltage Reference","TEXAS INSTRUMENTS","REF102AU","Yes","8","Yes"
"IC141","REF102AU","TopLayer","SOIC127P600X175-8N","4415.000mil","1470.000mil","0","Precision Voltage Reference","TEXAS INSTRUMENTS","REF102AU","Yes","8","Yes"
"IC131","REF102AU","TopLayer","SOIC127P600X175-8N","3570.000mil","1470.000mil","0","Precision Voltage Reference","TEXAS INSTRUMENTS","REF102AU","Yes","8","Yes"
"IC121","REF102AU","TopLayer","SOIC127P600X175-8N","3570.000mil","1920.000mil","0","Precision Voltage Reference","TEXAS INSTRUMENTS","REF102AU","Yes","8","Yes"
"IC120","OPA4277UA","TopLayer","SOIC127P600X175-14N","4000.000mil","1670.000mil","0","Quad Operational Amplifier","TEXAS INSTRUMENTS","OPA4277UA","Yes","14","Yes"
"IC111","REF102AU","TopLayer","SOIC127P600X175-8N","4415.000mil","3320.000mil","0","Precision Voltage Reference","TEXAS INSTRUMENTS","REF102AU","Yes","8","Yes"
"IC101","REF102AU","TopLayer","SOIC127P600X175-8N","4415.000mil","2875.000mil","0","Precision Voltage Reference","TEXAS INSTRUMENTS","REF102AU","Yes","8","Yes"
"IC91","REF102AU","TopLayer","SOIC127P600X175-8N","3570.000mil","2940.000mil","0","Precision Voltage Reference","TEXAS INSTRUMENTS","REF102AU","Yes","8","Yes"
"IC81","REF102AU","TopLayer","SOIC127P600X175-8N","3570.000mil","3365.000mil","0","Precision Voltage Reference","TEXAS INSTRUMENTS","REF102AU","Yes","8","Yes"
"IC80","OPA4277UA","TopLayer","SOIC127P600X175-14N","4000.000mil","3145.000mil","0","Quad Operational Amplifier","TEXAS INSTRUMENTS","OPA4277UA","Yes","14","Yes"
"IC71","REF102AU","TopLayer","SOIC127P600X175-8N","2215.000mil","1845.000mil","0","Precision Voltage Reference","TEXAS INSTRUMENTS","REF102AU","Yes","8","Yes"
"IC61","REF102AU","TopLayer","SOIC127P600X175-8N","2215.000mil","1470.000mil","0","Precision Voltage Reference","TEXAS INSTRUMENTS","REF102AU","Yes","8","Yes"
"IC51","REF102AU","TopLayer","SOIC127P600X175-8N","1365.000mil","1470.000mil","0","Precision Voltage Reference","TEXAS INSTRUMENTS","REF102AU","Yes","8","Yes"
"IC41","REF102AU","TopLayer","SOIC127P600X175-8N","1365.000mil","1920.000mil","0","Precision Voltage Reference","TEXAS INSTRUMENTS","REF102AU","Yes","8","Yes"
"IC40","OPA4277UA","TopLayer","SOIC127P600X175-14N","1805.000mil","1670.000mil","0","Quad Operational Amplifier","TEXAS INSTRUMENTS","OPA4277UA","Yes","14","Yes"
"IC31","REF102AU","TopLayer","SOIC127P600X175-8N","2215.000mil","3320.000mil","0","Precision Voltage Reference","TEXAS INSTRUMENTS","REF102AU","Yes","8","Yes"
"IC21","REF102AU","TopLayer","SOIC127P600X175-8N","2215.000mil","2875.000mil","0","Precision Voltage Reference","TEXAS INSTRUMENTS","REF102AU","Yes","8","Yes"
"IC11","REF102AU","TopLayer","SOIC127P600X175-8N","1365.000mil","2940.000mil","0","Precision Voltage Reference","TEXAS INSTRUMENTS","REF102AU","Yes","8","Yes"
"C232","100nF","TopLayer","CAPC1608X87N","6420.000mil","1980.000mil","90","Non-polarised capacitor","GENERIC","CC0603_100NF_50V_10%_X7R","Yes","2","Yes"
"C222","100nF","TopLayer","CAPC1608X87N","6410.000mil","1555.000mil","90","Non-polarised capacitor","GENERIC","CC0603_100NF_50V_10%_X7R","Yes","2","Yes"
"C212","100nF","TopLayer","CAPC1608X87N","5525.000mil","1495.000mil","180","Non-polarised capacitor","GENERIC","CC0603_100NF_50V_10%_X7R","Yes","2","Yes"
"C202","100nF","TopLayer","CAPC1608X87N","5530.000mil","1945.000mil","180","Non-polarised capacitor","GENERIC","CC0603_100NF_50V_10%_X7R","Yes","2","Yes"
"C201","100nF","TopLayer","CAPC1608X87N","6420.000mil","1670.000mil","0","Non-polarised capacitor","GENERIC","CC0603_100NF_50V_10%_X7R","Yes","2","Yes"
"C200","100nF","TopLayer","CAPC1608X87N","5965.000mil","1670.000mil","0","Non-polarised capacitor","GENERIC","CC0603_100NF_50V_10%_X7R","Yes","2","Yes"
"C192","100nF","TopLayer","CAPC1608X87N","6420.000mil","3375.000mil","90","Non-polarised capacitor","GENERIC","CC0603_100NF_50V_10%_X7R","Yes","2","Yes"
"C182","100nF","TopLayer","CAPC1608X87N","6420.000mil","2930.000mil","90","Non-polarised capacitor","GENERIC","CC0603_100NF_50V_10%_X7R","Yes","2","Yes"
"C172","100nF","TopLayer","CAPC1608X87N","5530.000mil","2965.000mil","180","Non-polarised capacitor","GENERIC","CC0603_100NF_50V_10%_X7R","Yes","2","Yes"
"C162","100nF","TopLayer","CAPC1608X87N","5530.000mil","3370.000mil","180","Non-polarised capacitor","GENERIC","CC0603_100NF_50V_10%_X7R","Yes","2","Yes"
"C161","100nF","TopLayer","CAPC1608X87N","6420.000mil","3145.000mil","0","Non-polarised capacitor","GENERIC","CC0603_100NF_50V_10%_X7R","Yes","2","Yes"
"C160","100nF","TopLayer","CAPC1608X87N","5970.000mil","3145.000mil","0","Non-polarised capacitor","GENERIC","CC0603_100NF_50V_10%_X7R","Yes","2","Yes"
"C152","100nF","TopLayer","CAPC1608X87N","4210.000mil","1555.000mil","90","Non-polarised capacitor","GENERIC","CC0603_100NF_50V_10%_X7R","Yes","2","Yes"
"C142","100nF","TopLayer","CAPC1608X87N","4225.000mil","1900.000mil","90","Non-polarised capacitor","GENERIC","CC0603_100NF_50V_10%_X7R","Yes","2","Yes"
"C132","100nF","TopLayer","CAPC1608X87N","3340.000mil","1495.000mil","180","Non-polarised capacitor","GENERIC","CC0603_100NF_50V_10%_X7R","Yes","2","Yes"
"C122","100nF","TopLayer","CAPC1608X87N","3345.000mil","1945.000mil","180","Non-polarised capacitor","GENERIC","CC0603_100NF_50V_10%_X7R","Yes","2","Yes"
"C121","100nF","TopLayer","CAPC1608X87N","4225.000mil","1670.000mil","0","Non-polarised capacitor","GENERIC","CC0603_100NF_50V_10%_X7R","Yes","2","Yes"
"C120","100nF","TopLayer","CAPC1608X87N","3765.000mil","1670.000mil","0","Non-polarised capacitor","GENERIC","CC0603_100NF_50V_10%_X7R","Yes","2","Yes"
"C112","100nF","TopLayer","CAPC1608X87N","4225.000mil","2930.000mil","90","Non-polarised capacitor","GENERIC","CC0603_100NF_50V_10%_X7R","Yes","2","Yes"
"C102","100nF","TopLayer","CAPC1608X87N","4225.000mil","3375.000mil","90","Non-polarised capacitor","GENERIC","CC0603_100NF_50V_10%_X7R","Yes","2","Yes"
"C92","100nF","TopLayer","CAPC1608X87N","3355.000mil","2965.000mil","180","Non-polarised capacitor","GENERIC","CC0603_100NF_50V_10%_X7R","Yes","2","Yes"
"C82","100nF","TopLayer","CAPC1608X87N","3350.000mil","3390.000mil","180","Non-polarised capacitor","GENERIC","CC0603_100NF_50V_10%_X7R","Yes","2","Yes"
"C81","100nF","TopLayer","CAPC1608X87N","4225.000mil","3145.000mil","0","Non-polarised capacitor","GENERIC","CC0603_100NF_50V_10%_X7R","Yes","2","Yes"
"C80","100nF","TopLayer","CAPC1608X87N","3780.000mil","3145.000mil","0","Non-polarised capacitor","GENERIC","CC0603_100NF_50V_10%_X7R","Yes","2","Yes"
"C72","100nF","TopLayer","CAPC1608X87N","2020.000mil","1900.000mil","90","Non-polarised capacitor","GENERIC","CC0603_100NF_50V_10%_X7R","Yes","2","Yes"
"C62","100nF","TopLayer","CAPC1608X87N","2025.000mil","1530.000mil","90","Non-polarised capacitor","GENERIC","CC0603_100NF_50V_10%_X7R","Yes","2","Yes"
"C52","100nF","TopLayer","CAPC1608X87N","1150.000mil","1495.000mil","180","Non-polarised capacitor","GENERIC","CC0603_100NF_50V_10%_X7R","Yes","2","Yes"
"C42","100nF","TopLayer","CAPC1608X87N","1135.000mil","1945.000mil","180","Non-polarised capacitor","GENERIC","CC0603_100NF_50V_10%_X7R","Yes","2","Yes"
"C41","100nF","TopLayer","CAPC1608X87N","2035.000mil","1670.000mil","0","Non-polarised capacitor","GENERIC","CC0603_100NF_50V_10%_X7R","Yes","2","Yes"
"C40","100nF","TopLayer","CAPC1608X87N","1565.000mil","1670.000mil","0","Non-polarised capacitor","GENERIC","CC0603_100NF_50V_10%_X7R","Yes","2","Yes"
"C32","100nF","TopLayer","CAPC1608X87N","2025.000mil","3375.000mil","90","Non-polarised capacitor","GENERIC","CC0603_100NF_50V_10%_X7R","Yes","2","Yes"
"C22","100nF","TopLayer","CAPC1608X87N","2025.000mil","2930.000mil","90","Non-polarised capacitor","GENERIC","CC0603_100NF_50V_10%_X7R","Yes","2","Yes"
"C12","100nF","TopLayer","CAPC1608X87N","1140.000mil","2965.000mil","180","Non-polarised capacitor","GENERIC","CC0603_100NF_50V_10%_X7R","Yes","2","Yes"
"J1","D-Sub 50F","TopLayer","HARTING_09_66_552_7611","405.000mil","1975.985mil","90","Connector D-sub 50 Female","HARTING","09 66 552 7611","Yes","52","No"
"R1","10k","TopLayer","RESC3216X65N","1590.000mil","3452.087mil","90","Resistor - 1%","GENERIC","R1206_10K_1%_0.25W_100PPM","Yes","2","Yes"
"IC2","REF102AU","TopLayer","SOIC127P600X175-8N","1370.000mil","3420.000mil","0","Precision Voltage Reference","TEXAS INSTRUMENTS","REF102AU","Yes","8","Yes"
"IC1","OPA4277UA","TopLayer","SOIC127P600X175-14N","1805.000mil","3145.000mil","0","Quad Operational Amplifier","TEXAS INSTRUMENTS","OPA4277UA","Yes","14","Yes"
"C3","100nF","TopLayer","CAPC1608X87N","1155.000mil","3445.000mil","180","Non-polarised capacitor","GENERIC","CC0603_100NF_50V_10%_X7R","Yes","2","Yes"
"C2","100nF","TopLayer","CAPC1608X87N","2025.000mil","3145.000mil","0","Non-polarised capacitor","GENERIC","CC0603_100NF_50V_10%_X7R","Yes","2","Yes"
"C1","100nF","TopLayer","CAPC1608X87N","1565.000mil","3170.000mil","0","Non-polarised capacitor","GENERIC","CC0603_100NF_50V_10%_X7R","Yes","2","Yes"
