%TF.GenerationSoftware,Altium Limited,Altium Designer,19.1.5 (86)*%
G04 Layer_Physical_Order=4*
G04 Layer_Color=16711680*
%FSLAX26Y26*%
%MOIN*%
%TF.FileFunction,Copper,L4,Bot,Signal*%
%TF.Part,Single*%
G01*
G75*
%TA.AperFunction,Conductor*%
%ADD15C,0.012000*%
%ADD16C,0.030000*%
%TA.AperFunction,ComponentPad*%
%ADD17R,0.059055X0.059055*%
%ADD18C,0.059055*%
%ADD19C,0.066929*%
%ADD21C,0.078740*%
%ADD22C,0.149606*%
%TA.AperFunction,ViaPad*%
%ADD23C,0.175197*%
%ADD24C,0.047244*%
%ADD25C,0.039370*%
%TA.AperFunction,ComponentPad*%
%ADD26C,0.200787*%
G36*
X595000Y2590769D02*
X590000Y2587567D01*
X585000Y2588561D01*
X536898D01*
X535201Y2593561D01*
X537572Y2595381D01*
X544892Y2604921D01*
X549494Y2616030D01*
X551063Y2627953D01*
X549494Y2639875D01*
X544892Y2650984D01*
X537572Y2660524D01*
X528032Y2667845D01*
X516922Y2672446D01*
X505000Y2674016D01*
X493078Y2672446D01*
X481969Y2667845D01*
X472428Y2660524D01*
X465108Y2650984D01*
X460507Y2639875D01*
X458937Y2627953D01*
X459278Y2625361D01*
X454794Y2623150D01*
X439527Y2638416D01*
X435004Y2641439D01*
X434236Y2646103D01*
X434483Y2647342D01*
X437572Y2649712D01*
X444892Y2659252D01*
X449494Y2670361D01*
X451063Y2682284D01*
X449494Y2694206D01*
X444892Y2705315D01*
X437572Y2714855D01*
X428032Y2722175D01*
X416922Y2726777D01*
X405000Y2728347D01*
X393078Y2726777D01*
X381969Y2722175D01*
X372428Y2714855D01*
X365108Y2705315D01*
X360506Y2694206D01*
X358937Y2682284D01*
X360506Y2670361D01*
X365108Y2659252D01*
X371045Y2651514D01*
X368728Y2646514D01*
X346744D01*
X344892Y2650984D01*
X337572Y2660524D01*
X328032Y2667845D01*
X316922Y2672447D01*
X305000Y2674016D01*
X293078Y2672447D01*
X281968Y2667845D01*
X272428Y2660524D01*
X265108Y2650984D01*
X260506Y2639875D01*
X258937Y2627953D01*
X260506Y2616031D01*
X265108Y2604921D01*
X272428Y2595381D01*
X281968Y2588061D01*
X293078Y2583459D01*
X305000Y2581890D01*
X316922Y2583459D01*
X328032Y2588061D01*
X337572Y2595381D01*
X344892Y2604921D01*
X346744Y2609391D01*
X368728D01*
X371045Y2604391D01*
X365108Y2596654D01*
X360506Y2585544D01*
X358937Y2573622D01*
X360506Y2561700D01*
X365108Y2550590D01*
X372428Y2541050D01*
X381969Y2533730D01*
X393078Y2529128D01*
X405000Y2527559D01*
X416922Y2529128D01*
X428032Y2533730D01*
X437572Y2541050D01*
X444892Y2550590D01*
X449494Y2561700D01*
X450329Y2568044D01*
X455608Y2569836D01*
X467608Y2557836D01*
X469955Y2556267D01*
X470389Y2555495D01*
X470774Y2549707D01*
X465108Y2542323D01*
X460507Y2531213D01*
X458937Y2519291D01*
X460507Y2507369D01*
X465108Y2496260D01*
X472428Y2486720D01*
X481969Y2479399D01*
X493078Y2474798D01*
X505000Y2473228D01*
X516922Y2474798D01*
X528032Y2479399D01*
X537572Y2486720D01*
X544892Y2496260D01*
X549494Y2507369D01*
X551063Y2519291D01*
X549494Y2531213D01*
X544892Y2542323D01*
X541338Y2546954D01*
X543550Y2551439D01*
X577312D01*
X595000Y2533750D01*
Y2372199D01*
X537714D01*
X536107Y2376934D01*
X537572Y2378058D01*
X544892Y2387598D01*
X549494Y2398708D01*
X551063Y2410630D01*
X549494Y2422552D01*
X544892Y2433661D01*
X537572Y2443202D01*
X528032Y2450522D01*
X516922Y2455124D01*
X505000Y2456693D01*
X493078Y2455124D01*
X481969Y2450522D01*
X472428Y2443202D01*
X465108Y2433661D01*
X460507Y2422552D01*
X459671Y2416208D01*
X454392Y2414416D01*
X445054Y2423755D01*
X439430Y2427512D01*
X438683Y2429108D01*
X438089Y2433064D01*
X444892Y2441929D01*
X449494Y2453039D01*
X451063Y2464961D01*
X449494Y2476883D01*
X444892Y2487992D01*
X437572Y2497532D01*
X428032Y2504853D01*
X416922Y2509454D01*
X405000Y2511024D01*
X393078Y2509454D01*
X381969Y2504853D01*
X372428Y2497532D01*
X365108Y2487992D01*
X360506Y2476883D01*
X358937Y2464961D01*
X360506Y2453039D01*
X365108Y2441929D01*
X371046Y2434191D01*
X368729Y2429191D01*
X346744D01*
X344892Y2433661D01*
X337572Y2443201D01*
X328032Y2450522D01*
X316922Y2455123D01*
X305000Y2456693D01*
X293078Y2455123D01*
X281968Y2450522D01*
X272428Y2443201D01*
X265108Y2433661D01*
X260506Y2422552D01*
X258937Y2410630D01*
X260506Y2398707D01*
X265108Y2387598D01*
X272428Y2378058D01*
X281968Y2370738D01*
X293078Y2366136D01*
X305000Y2364566D01*
X316922Y2366136D01*
X328032Y2370738D01*
X337572Y2378058D01*
X344892Y2387598D01*
X346744Y2392068D01*
X368728D01*
X371045Y2387068D01*
X365108Y2379331D01*
X360506Y2368221D01*
X358937Y2356299D01*
X360506Y2344377D01*
X365108Y2333267D01*
X372428Y2323727D01*
X381969Y2316407D01*
X393078Y2311805D01*
X405000Y2310236D01*
X416922Y2311805D01*
X428032Y2316407D01*
X437572Y2323727D01*
X444892Y2333267D01*
X449494Y2344377D01*
X451063Y2356299D01*
X450722Y2358891D01*
X455207Y2361102D01*
X474147Y2342161D01*
X474432Y2336078D01*
X472428Y2334540D01*
X465108Y2325000D01*
X460507Y2313890D01*
X458937Y2301968D01*
X460507Y2290046D01*
X465108Y2278937D01*
X470774Y2271553D01*
X470389Y2265765D01*
X469955Y2264992D01*
X467608Y2263424D01*
X455608Y2251424D01*
X450329Y2253216D01*
X449494Y2259560D01*
X444892Y2270669D01*
X437572Y2280209D01*
X428032Y2287530D01*
X416922Y2292131D01*
X405000Y2293701D01*
X393078Y2292131D01*
X381969Y2287530D01*
X372428Y2280209D01*
X365108Y2270669D01*
X360506Y2259560D01*
X358937Y2247638D01*
X360506Y2235716D01*
X365108Y2224606D01*
X371046Y2216868D01*
X368728Y2211868D01*
X346744D01*
X344892Y2216338D01*
X337572Y2225878D01*
X328032Y2233199D01*
X316922Y2237800D01*
X305000Y2239370D01*
X293078Y2237800D01*
X281968Y2233199D01*
X272428Y2225878D01*
X265108Y2216338D01*
X260506Y2205229D01*
X258937Y2193307D01*
X260506Y2181385D01*
X265108Y2170275D01*
X272428Y2160735D01*
X281968Y2153415D01*
X293078Y2148813D01*
X305000Y2147244D01*
X316922Y2148813D01*
X328032Y2153415D01*
X337572Y2160735D01*
X344892Y2170275D01*
X346744Y2174745D01*
X368728D01*
X371045Y2169745D01*
X365108Y2162008D01*
X360506Y2150898D01*
X358937Y2138976D01*
X360506Y2127054D01*
X365108Y2115945D01*
X372428Y2106405D01*
X381969Y2099084D01*
X393078Y2094483D01*
X405000Y2092913D01*
X416922Y2094483D01*
X428032Y2099084D01*
X437572Y2106405D01*
X444892Y2115945D01*
X449494Y2127054D01*
X451063Y2138976D01*
X449494Y2150898D01*
X444892Y2162008D01*
X437572Y2171548D01*
X434634Y2173802D01*
X434797Y2178800D01*
X436865Y2180182D01*
X454794Y2198110D01*
X459278Y2195899D01*
X458937Y2193307D01*
X460507Y2181385D01*
X465108Y2170275D01*
X472428Y2160735D01*
X481969Y2153415D01*
X493078Y2148813D01*
X505000Y2147244D01*
X516922Y2148813D01*
X528032Y2153415D01*
X537572Y2160735D01*
X544892Y2170275D01*
X549494Y2181385D01*
X551063Y2193307D01*
X549494Y2205229D01*
X544892Y2216339D01*
X537572Y2225879D01*
X536107Y2227003D01*
X537714Y2231738D01*
X585299D01*
X590000Y2232673D01*
X595000Y2229331D01*
Y2048561D01*
X540727D01*
X538713Y2053561D01*
X544892Y2061614D01*
X549494Y2072724D01*
X551063Y2084646D01*
X549494Y2096568D01*
X544892Y2107677D01*
X537572Y2117217D01*
X528032Y2124538D01*
X516922Y2129139D01*
X505000Y2130709D01*
X493078Y2129139D01*
X481969Y2124538D01*
X472428Y2117217D01*
X465108Y2107677D01*
X460507Y2096568D01*
X458937Y2084646D01*
X460507Y2072724D01*
X465108Y2061614D01*
X472079Y2052530D01*
X471587Y2048467D01*
X471310Y2047279D01*
X470654Y2047149D01*
X464632Y2043125D01*
X455608Y2034101D01*
X450329Y2035893D01*
X449494Y2042237D01*
X444892Y2053347D01*
X437572Y2062887D01*
X428032Y2070207D01*
X416922Y2074809D01*
X405000Y2076378D01*
X393078Y2074809D01*
X381969Y2070207D01*
X372428Y2062887D01*
X365108Y2053347D01*
X360506Y2042237D01*
X358937Y2030315D01*
X360506Y2018393D01*
X365108Y2007283D01*
X371046Y1999545D01*
X368728Y1994545D01*
X346744D01*
X344892Y1999016D01*
X337572Y2008556D01*
X328032Y2015876D01*
X316922Y2020478D01*
X305000Y2022047D01*
X293078Y2020478D01*
X281968Y2015876D01*
X272428Y2008556D01*
X265108Y1999016D01*
X260506Y1987906D01*
X258937Y1975984D01*
X260506Y1964062D01*
X265108Y1952952D01*
X272428Y1943412D01*
X281968Y1936092D01*
X293078Y1931490D01*
X305000Y1929921D01*
X316922Y1931490D01*
X328032Y1936092D01*
X337572Y1943412D01*
X344892Y1952952D01*
X346744Y1957423D01*
X368728D01*
X371045Y1952423D01*
X365108Y1944685D01*
X360506Y1933576D01*
X358937Y1921653D01*
X360506Y1909731D01*
X365108Y1898622D01*
X372428Y1889082D01*
X381969Y1881762D01*
X393078Y1877160D01*
X405000Y1875590D01*
X416922Y1877160D01*
X428032Y1881762D01*
X437572Y1889082D01*
X444892Y1898622D01*
X449494Y1909731D01*
X451063Y1921653D01*
X449494Y1933576D01*
X444892Y1944685D01*
X437572Y1954225D01*
X434634Y1956480D01*
X434797Y1961477D01*
X436865Y1962859D01*
X454794Y1980787D01*
X459278Y1978576D01*
X458937Y1975984D01*
X460507Y1964062D01*
X465108Y1952953D01*
X472428Y1943412D01*
X481969Y1936092D01*
X493078Y1931490D01*
X505000Y1929921D01*
X516922Y1931490D01*
X528032Y1936092D01*
X537572Y1943412D01*
X544892Y1952953D01*
X549494Y1964062D01*
X551063Y1975984D01*
X549494Y1987906D01*
X544892Y1999016D01*
X539197Y2006439D01*
X541662Y2011439D01*
X595000D01*
Y1722886D01*
X590000Y1720213D01*
X587103Y1722149D01*
X580000Y1723561D01*
X541934D01*
X539469Y1728561D01*
X544892Y1735630D01*
X549494Y1746739D01*
X551063Y1758661D01*
X549494Y1770583D01*
X544892Y1781693D01*
X537572Y1791233D01*
X528032Y1798553D01*
X516922Y1803155D01*
X505000Y1804725D01*
X493078Y1803155D01*
X481969Y1798553D01*
X472428Y1791233D01*
X465108Y1781693D01*
X460507Y1770583D01*
X458937Y1758661D01*
X459278Y1756070D01*
X454794Y1753858D01*
X436866Y1771786D01*
X434797Y1773168D01*
X434634Y1778166D01*
X437572Y1780420D01*
X444892Y1789960D01*
X449494Y1801070D01*
X451063Y1812992D01*
X449494Y1824914D01*
X444892Y1836024D01*
X437572Y1845564D01*
X428032Y1852884D01*
X416922Y1857486D01*
X405000Y1859055D01*
X393078Y1857486D01*
X381969Y1852884D01*
X372428Y1845564D01*
X365108Y1836024D01*
X360506Y1824914D01*
X358937Y1812992D01*
X360506Y1801070D01*
X365108Y1789960D01*
X371046Y1782223D01*
X368728Y1777223D01*
X346744D01*
X344892Y1781693D01*
X337572Y1791233D01*
X328032Y1798553D01*
X316922Y1803155D01*
X305000Y1804725D01*
X293078Y1803155D01*
X281968Y1798553D01*
X272428Y1791233D01*
X265108Y1781693D01*
X260506Y1770583D01*
X258937Y1758661D01*
X260506Y1746739D01*
X265108Y1735630D01*
X272428Y1726090D01*
X281968Y1718769D01*
X293078Y1714168D01*
X305000Y1712598D01*
X316922Y1714168D01*
X328032Y1718769D01*
X337572Y1726090D01*
X344892Y1735630D01*
X346744Y1740100D01*
X368728D01*
X371045Y1735100D01*
X365108Y1727362D01*
X360506Y1716253D01*
X358937Y1704331D01*
X360506Y1692409D01*
X365108Y1681299D01*
X372428Y1671759D01*
X381969Y1664439D01*
X393078Y1659837D01*
X405000Y1658267D01*
X416922Y1659837D01*
X428032Y1664439D01*
X437572Y1671759D01*
X444892Y1681299D01*
X449494Y1692409D01*
X450329Y1698752D01*
X455608Y1700544D01*
X462285Y1693867D01*
X468307Y1689843D01*
X472583Y1688993D01*
X473830Y1683647D01*
X472428Y1682572D01*
X465108Y1673032D01*
X460507Y1661922D01*
X458937Y1650000D01*
X460507Y1638078D01*
X465108Y1626968D01*
X472428Y1617428D01*
X481969Y1610108D01*
X493078Y1605506D01*
X505000Y1603937D01*
X516922Y1605506D01*
X528032Y1610108D01*
X537572Y1617428D01*
X544892Y1626968D01*
X549494Y1638078D01*
X551063Y1650000D01*
X549494Y1661922D01*
X544892Y1673032D01*
X538441Y1681439D01*
X540113Y1686439D01*
X572312D01*
X595000Y1663750D01*
Y1472783D01*
X590381Y1470869D01*
X563779Y1497471D01*
X557757Y1501495D01*
X550654Y1502908D01*
X537714D01*
X536107Y1507642D01*
X537572Y1508767D01*
X544892Y1518307D01*
X549494Y1529416D01*
X551063Y1541338D01*
X549494Y1553261D01*
X544892Y1564370D01*
X537572Y1573910D01*
X528032Y1581230D01*
X516922Y1585832D01*
X505000Y1587402D01*
X493078Y1585832D01*
X481969Y1581230D01*
X472428Y1573910D01*
X465108Y1564370D01*
X460507Y1553261D01*
X458937Y1541338D01*
X459278Y1538747D01*
X454794Y1536535D01*
X436866Y1554463D01*
X434797Y1555846D01*
X434634Y1560843D01*
X437572Y1563098D01*
X444892Y1572638D01*
X449494Y1583747D01*
X451063Y1595669D01*
X449494Y1607591D01*
X444892Y1618701D01*
X437572Y1628241D01*
X428032Y1635561D01*
X416922Y1640163D01*
X405000Y1641733D01*
X393078Y1640163D01*
X381969Y1635561D01*
X372428Y1628241D01*
X365108Y1618701D01*
X360506Y1607591D01*
X358937Y1595669D01*
X360506Y1583747D01*
X365108Y1572638D01*
X371046Y1564900D01*
X368728Y1559900D01*
X346744D01*
X344892Y1564370D01*
X337572Y1573910D01*
X328032Y1581230D01*
X316922Y1585832D01*
X305000Y1587402D01*
X293078Y1585832D01*
X281968Y1581230D01*
X272428Y1573910D01*
X265108Y1564370D01*
X260506Y1553261D01*
X258937Y1541338D01*
X260506Y1529416D01*
X265108Y1518307D01*
X272428Y1508767D01*
X281968Y1501446D01*
X293078Y1496845D01*
X305000Y1495275D01*
X316922Y1496845D01*
X328032Y1501446D01*
X337572Y1508767D01*
X344892Y1518307D01*
X346744Y1522777D01*
X368728D01*
X371045Y1517777D01*
X365108Y1510040D01*
X360506Y1498930D01*
X358937Y1487008D01*
X360506Y1475086D01*
X365108Y1463976D01*
X372428Y1454436D01*
X381969Y1447116D01*
X393078Y1442514D01*
X405000Y1440945D01*
X416922Y1442514D01*
X428032Y1447116D01*
X437572Y1454436D01*
X444892Y1463976D01*
X449494Y1475086D01*
X450329Y1481429D01*
X455608Y1483222D01*
X467608Y1471221D01*
X469955Y1469653D01*
X470389Y1468881D01*
X470774Y1463092D01*
X465108Y1455709D01*
X460507Y1444599D01*
X458937Y1432677D01*
X460507Y1420755D01*
X465108Y1409645D01*
X472428Y1400105D01*
X481969Y1392785D01*
X493078Y1388183D01*
X505000Y1386614D01*
X516922Y1388183D01*
X528032Y1392785D01*
X537572Y1400105D01*
X544892Y1409645D01*
X549494Y1420755D01*
X551063Y1432677D01*
X549494Y1444599D01*
X544892Y1455709D01*
X541336Y1460343D01*
X545104Y1463647D01*
X595000Y1413750D01*
Y1277783D01*
X590381Y1275869D01*
X580779Y1285471D01*
X574757Y1289495D01*
X567654Y1290908D01*
X543463D01*
X540997Y1295908D01*
X544892Y1300984D01*
X549494Y1312093D01*
X551063Y1324016D01*
X549494Y1335938D01*
X544892Y1347047D01*
X537572Y1356587D01*
X528032Y1363908D01*
X516922Y1368509D01*
X505000Y1370079D01*
X493078Y1368509D01*
X481969Y1363908D01*
X472428Y1356587D01*
X465108Y1347047D01*
X460507Y1335938D01*
X459671Y1329594D01*
X454392Y1327802D01*
X445054Y1337140D01*
X439430Y1340898D01*
X438682Y1342498D01*
X438090Y1346450D01*
X444892Y1355315D01*
X449494Y1366424D01*
X451063Y1378347D01*
X449494Y1390269D01*
X444892Y1401378D01*
X437572Y1410918D01*
X428032Y1418238D01*
X416922Y1422840D01*
X405000Y1424410D01*
X393078Y1422840D01*
X381969Y1418238D01*
X372428Y1410918D01*
X365108Y1401378D01*
X360506Y1390269D01*
X358937Y1378347D01*
X360506Y1366424D01*
X365108Y1355315D01*
X371046Y1347577D01*
X368728Y1342577D01*
X346744D01*
X344892Y1347047D01*
X337572Y1356587D01*
X328032Y1363908D01*
X316922Y1368509D01*
X305000Y1370079D01*
X293078Y1368509D01*
X281968Y1363908D01*
X272428Y1356587D01*
X265108Y1347047D01*
X260506Y1335938D01*
X258937Y1324016D01*
X260506Y1312093D01*
X265108Y1300984D01*
X272428Y1291444D01*
X281968Y1284124D01*
X293078Y1279522D01*
X305000Y1277952D01*
X316922Y1279522D01*
X328032Y1284124D01*
X337572Y1291444D01*
X344892Y1300984D01*
X346744Y1305454D01*
X368728D01*
X371045Y1300454D01*
X365108Y1292717D01*
X360506Y1281607D01*
X358937Y1269685D01*
X360506Y1257763D01*
X365108Y1246653D01*
X372428Y1237113D01*
X381969Y1229793D01*
X393078Y1225191D01*
X405000Y1223622D01*
X416922Y1225191D01*
X428032Y1229793D01*
X437572Y1237113D01*
X444892Y1246653D01*
X449494Y1257763D01*
X451063Y1269685D01*
X450722Y1272276D01*
X455207Y1274488D01*
X470473Y1259221D01*
X474997Y1256199D01*
X475917Y1250603D01*
X472428Y1247926D01*
X465108Y1238386D01*
X460507Y1227276D01*
X458937Y1215354D01*
X460507Y1203432D01*
X465108Y1192323D01*
X472428Y1182783D01*
X481969Y1175462D01*
X493078Y1170861D01*
X505000Y1169291D01*
X516922Y1170861D01*
X528032Y1175462D01*
X537572Y1182783D01*
X544892Y1192323D01*
X549494Y1203432D01*
X551063Y1215354D01*
X549494Y1227276D01*
X544892Y1238386D01*
X537572Y1247926D01*
X536107Y1249050D01*
X537714Y1253785D01*
X559965D01*
X595000Y1218750D01*
Y1023561D01*
X414381D01*
X347642Y1090301D01*
X349494Y1094771D01*
X351063Y1106693D01*
X349494Y1118615D01*
X344892Y1129724D01*
X337572Y1139264D01*
X328032Y1146585D01*
X316922Y1151187D01*
X305000Y1152756D01*
X293078Y1151187D01*
X281968Y1146585D01*
X272428Y1139264D01*
X265108Y1129724D01*
X260506Y1118615D01*
X258937Y1106693D01*
X260506Y1094771D01*
X265108Y1083661D01*
X272428Y1074121D01*
X281968Y1066801D01*
X293078Y1062199D01*
X305000Y1060630D01*
X316922Y1062199D01*
X321392Y1064051D01*
X393568Y991875D01*
X399590Y987851D01*
X406693Y986439D01*
X595000D01*
Y40000D01*
X35000D01*
Y3905000D01*
X595000D01*
Y2590769D01*
D02*
G37*
%LPC*%
G36*
X305000Y2891339D02*
X293078Y2889769D01*
X281968Y2885168D01*
X272428Y2877847D01*
X265108Y2868307D01*
X260506Y2857198D01*
X258937Y2845276D01*
X260506Y2833354D01*
X265108Y2822244D01*
X272428Y2812704D01*
X281968Y2805384D01*
X293078Y2800782D01*
X305000Y2799212D01*
X316922Y2800782D01*
X328032Y2805384D01*
X337572Y2812704D01*
X344892Y2822244D01*
X349494Y2833354D01*
X351063Y2845276D01*
X349494Y2857198D01*
X344892Y2868307D01*
X337572Y2877847D01*
X328032Y2885168D01*
X316922Y2889769D01*
X305000Y2891339D01*
D02*
G37*
G36*
X505000Y2891339D02*
X493078Y2889769D01*
X481969Y2885167D01*
X472428Y2877847D01*
X465108Y2868307D01*
X460507Y2857198D01*
X458937Y2845275D01*
X460507Y2833353D01*
X465108Y2822244D01*
X472428Y2812704D01*
X481969Y2805383D01*
X493078Y2800782D01*
X505000Y2799212D01*
X516922Y2800782D01*
X528032Y2805383D01*
X537572Y2812704D01*
X544892Y2822244D01*
X549494Y2833353D01*
X551063Y2845275D01*
X549494Y2857198D01*
X544892Y2868307D01*
X537572Y2877847D01*
X528032Y2885167D01*
X516922Y2889769D01*
X505000Y2891339D01*
D02*
G37*
G36*
X405000Y2837008D02*
X393078Y2835438D01*
X381969Y2830837D01*
X372428Y2823516D01*
X365108Y2813976D01*
X360506Y2802867D01*
X358937Y2790945D01*
X360506Y2779023D01*
X365108Y2767913D01*
X372428Y2758373D01*
X381969Y2751053D01*
X393078Y2746451D01*
X405000Y2744881D01*
X416922Y2746451D01*
X428032Y2751053D01*
X437572Y2758373D01*
X444892Y2767913D01*
X449494Y2779023D01*
X451063Y2790945D01*
X449494Y2802867D01*
X444892Y2813976D01*
X437572Y2823516D01*
X428032Y2830837D01*
X416922Y2835438D01*
X405000Y2837008D01*
D02*
G37*
G36*
X505000Y2782677D02*
X493078Y2781108D01*
X481969Y2776506D01*
X472428Y2769186D01*
X465108Y2759646D01*
X460507Y2748536D01*
X458937Y2736614D01*
X460507Y2724692D01*
X465108Y2713582D01*
X472428Y2704042D01*
X481969Y2696722D01*
X493078Y2692120D01*
X505000Y2690551D01*
X516922Y2692120D01*
X528032Y2696722D01*
X537572Y2704042D01*
X544892Y2713582D01*
X549494Y2724692D01*
X551063Y2736614D01*
X549494Y2748536D01*
X544892Y2759646D01*
X537572Y2769186D01*
X528032Y2776506D01*
X516922Y2781108D01*
X505000Y2782677D01*
D02*
G37*
G36*
X305000Y2782677D02*
X293078Y2781108D01*
X281968Y2776506D01*
X272428Y2769186D01*
X265108Y2759646D01*
X260506Y2748536D01*
X258937Y2736614D01*
X260506Y2724692D01*
X265108Y2713582D01*
X272428Y2704042D01*
X281968Y2696722D01*
X293078Y2692120D01*
X305000Y2690551D01*
X316922Y2692120D01*
X328032Y2696722D01*
X337572Y2704042D01*
X344892Y2713582D01*
X349494Y2724692D01*
X351063Y2736614D01*
X349494Y2748536D01*
X344892Y2759646D01*
X337572Y2769186D01*
X328032Y2776506D01*
X316922Y2781108D01*
X305000Y2782677D01*
D02*
G37*
G36*
Y2565354D02*
X293078Y2563785D01*
X281968Y2559183D01*
X272428Y2551863D01*
X265108Y2542323D01*
X260506Y2531213D01*
X258937Y2519291D01*
X260506Y2507369D01*
X265108Y2496260D01*
X272428Y2486720D01*
X281968Y2479399D01*
X293078Y2474798D01*
X305000Y2473228D01*
X316922Y2474798D01*
X328032Y2479399D01*
X337572Y2486720D01*
X344892Y2496260D01*
X349494Y2507369D01*
X351063Y2519291D01*
X349494Y2531213D01*
X344892Y2542323D01*
X337572Y2551863D01*
X328032Y2559183D01*
X316922Y2563785D01*
X305000Y2565354D01*
D02*
G37*
G36*
Y2348032D02*
X293078Y2346462D01*
X281968Y2341860D01*
X272428Y2334540D01*
X265108Y2325000D01*
X260506Y2313890D01*
X258937Y2301968D01*
X260506Y2290046D01*
X265108Y2278937D01*
X272428Y2269397D01*
X281968Y2262076D01*
X293078Y2257475D01*
X305000Y2255905D01*
X316922Y2257475D01*
X328032Y2262076D01*
X337572Y2269397D01*
X344892Y2278937D01*
X349494Y2290046D01*
X351063Y2301968D01*
X349494Y2313890D01*
X344892Y2325000D01*
X337572Y2334540D01*
X328032Y2341860D01*
X316922Y2346462D01*
X305000Y2348032D01*
D02*
G37*
G36*
Y2130709D02*
X293078Y2129139D01*
X281968Y2124538D01*
X272428Y2117217D01*
X265108Y2107677D01*
X260506Y2096568D01*
X258937Y2084646D01*
X260506Y2072724D01*
X265108Y2061614D01*
X272428Y2052074D01*
X281968Y2044754D01*
X293078Y2040152D01*
X305000Y2038582D01*
X316922Y2040152D01*
X328032Y2044754D01*
X337572Y2052074D01*
X344892Y2061614D01*
X349494Y2072724D01*
X351063Y2084646D01*
X349494Y2096568D01*
X344892Y2107677D01*
X337572Y2117217D01*
X328032Y2124538D01*
X316922Y2129139D01*
X305000Y2130709D01*
D02*
G37*
G36*
Y1913386D02*
X293078Y1911816D01*
X281968Y1907215D01*
X272428Y1899895D01*
X265108Y1890354D01*
X260506Y1879245D01*
X258937Y1867323D01*
X260506Y1855401D01*
X265108Y1844291D01*
X272428Y1834751D01*
X281968Y1827431D01*
X293078Y1822829D01*
X305000Y1821259D01*
X316922Y1822829D01*
X328032Y1827431D01*
X337572Y1834751D01*
X344892Y1844291D01*
X349494Y1855401D01*
X351063Y1867323D01*
X349494Y1879245D01*
X344892Y1890354D01*
X337572Y1899895D01*
X328032Y1907215D01*
X316922Y1911816D01*
X305000Y1913386D01*
D02*
G37*
G36*
X505000Y1913386D02*
X493078Y1911816D01*
X481969Y1907215D01*
X472428Y1899894D01*
X465108Y1890354D01*
X460507Y1879245D01*
X458937Y1867323D01*
X460507Y1855401D01*
X465108Y1844291D01*
X472428Y1834751D01*
X481969Y1827431D01*
X493078Y1822829D01*
X505000Y1821259D01*
X516922Y1822829D01*
X528032Y1827431D01*
X537572Y1834751D01*
X544892Y1844291D01*
X549494Y1855401D01*
X551063Y1867323D01*
X549494Y1879245D01*
X544892Y1890354D01*
X537572Y1899894D01*
X528032Y1907215D01*
X516922Y1911816D01*
X505000Y1913386D01*
D02*
G37*
G36*
X305000Y1696063D02*
X293078Y1694494D01*
X281968Y1689892D01*
X272428Y1682572D01*
X265108Y1673032D01*
X260506Y1661922D01*
X258937Y1650000D01*
X260506Y1638078D01*
X265108Y1626968D01*
X272428Y1617428D01*
X281968Y1610108D01*
X293078Y1605506D01*
X305000Y1603937D01*
X316922Y1605506D01*
X328032Y1610108D01*
X337572Y1617428D01*
X344892Y1626968D01*
X349494Y1638078D01*
X351063Y1650000D01*
X349494Y1661922D01*
X344892Y1673032D01*
X337572Y1682572D01*
X328032Y1689892D01*
X316922Y1694494D01*
X305000Y1696063D01*
D02*
G37*
G36*
Y1478741D02*
X293078Y1477171D01*
X281968Y1472569D01*
X272428Y1465249D01*
X265108Y1455709D01*
X260506Y1444599D01*
X258937Y1432677D01*
X260506Y1420755D01*
X265108Y1409646D01*
X272428Y1400105D01*
X281968Y1392785D01*
X293078Y1388184D01*
X305000Y1386614D01*
X316922Y1388184D01*
X328032Y1392785D01*
X337572Y1400105D01*
X344892Y1409646D01*
X349494Y1420755D01*
X351063Y1432677D01*
X349494Y1444599D01*
X344892Y1455709D01*
X337572Y1465249D01*
X328032Y1472569D01*
X316922Y1477171D01*
X305000Y1478741D01*
D02*
G37*
G36*
Y1261417D02*
X293078Y1259848D01*
X281968Y1255246D01*
X272428Y1247926D01*
X265108Y1238386D01*
X260506Y1227276D01*
X258937Y1215354D01*
X260506Y1203432D01*
X265108Y1192322D01*
X272428Y1182782D01*
X281968Y1175462D01*
X293078Y1170860D01*
X305000Y1169291D01*
X316922Y1170860D01*
X328032Y1175462D01*
X337572Y1182782D01*
X344892Y1192322D01*
X349494Y1203432D01*
X351063Y1215354D01*
X349494Y1227276D01*
X344892Y1238386D01*
X337572Y1247926D01*
X328032Y1255246D01*
X316922Y1259848D01*
X305000Y1261417D01*
D02*
G37*
G36*
X405000Y1207087D02*
X393078Y1205517D01*
X381969Y1200916D01*
X372428Y1193595D01*
X365108Y1184055D01*
X360506Y1172946D01*
X358937Y1161024D01*
X360506Y1149101D01*
X365108Y1137992D01*
X372428Y1128452D01*
X381969Y1121131D01*
X393078Y1116530D01*
X405000Y1114960D01*
X416922Y1116530D01*
X428032Y1121131D01*
X437572Y1128452D01*
X444892Y1137992D01*
X449494Y1149101D01*
X451063Y1161024D01*
X449494Y1172946D01*
X444892Y1184055D01*
X437572Y1193595D01*
X428032Y1200916D01*
X416922Y1205517D01*
X405000Y1207087D01*
D02*
G37*
G36*
X505000Y1152756D02*
X493078Y1151187D01*
X481969Y1146585D01*
X472428Y1139264D01*
X465108Y1129724D01*
X460507Y1118615D01*
X458937Y1106693D01*
X460507Y1094771D01*
X465108Y1083661D01*
X472428Y1074121D01*
X481969Y1066801D01*
X493078Y1062199D01*
X505000Y1060630D01*
X516922Y1062199D01*
X528032Y1066801D01*
X537572Y1074121D01*
X544892Y1083661D01*
X549494Y1094771D01*
X551063Y1106693D01*
X549494Y1118615D01*
X544892Y1129724D01*
X537572Y1139264D01*
X528032Y1146585D01*
X516922Y1151187D01*
X505000Y1152756D01*
D02*
G37*
%LPD*%
D15*
X1020000Y2030000D02*
X1200000Y2210000D01*
X477757Y2030000D02*
X1020000D01*
X1055470Y2250299D02*
X1145299D01*
X1012273Y2293496D02*
X1055470Y2250299D01*
X628496Y2293496D02*
X1012273D01*
X1040000Y2300000D02*
X1105000D01*
X1021504Y2318496D02*
X1040000Y2300000D01*
X781650Y2318496D02*
X1021504D01*
X1145299Y2250299D02*
X1150000Y2255000D01*
X639974Y2320795D02*
X779350D01*
X607132Y2353638D02*
X639974Y2320795D01*
X488921Y2353638D02*
X607132D01*
X585000Y2570000D02*
X615000Y2540000D01*
Y2380000D02*
Y2540000D01*
Y2380000D02*
X650000Y2345000D01*
X585299Y2250299D02*
X628496Y2293496D01*
X480733Y2250299D02*
X585299D01*
X779350Y2320795D02*
X781650Y2318496D01*
X1105000Y2300000D02*
X1110000Y2305000D01*
X1060000Y2345000D02*
X1063750Y2348750D01*
X1065000Y2350000D01*
X650000Y2345000D02*
X1060000D01*
X423741Y2193307D02*
X480733Y2250299D01*
X527363Y2570000D02*
X585000D01*
X526402Y2570961D02*
X527363Y2570000D01*
X480733Y2570961D02*
X526402D01*
X426402Y2625291D02*
X480733Y2570961D01*
X425000Y2625291D02*
X426402D01*
X422339Y2627953D02*
X425000Y2625291D01*
X305000Y2627953D02*
X422339D01*
X431929Y2410630D02*
X488921Y2353638D01*
X305000Y2410630D02*
X431929D01*
X305000Y2193307D02*
X423741D01*
Y1975984D02*
X477757Y2030000D01*
X305000Y1975984D02*
X423741D01*
X580000Y1705000D02*
X639205Y1645795D01*
Y1269256D02*
Y1645795D01*
Y1269256D02*
X785571Y1122890D01*
X966341D01*
X789231Y1085000D02*
X920000D01*
X615000Y1259231D02*
X789231Y1085000D01*
X615000Y1259231D02*
Y1420000D01*
X966341Y1122890D02*
X969231Y1120000D01*
X550654Y1484346D02*
X615000Y1420000D01*
X480733Y1484346D02*
X550654D01*
X406693Y1005000D02*
X835000D01*
X305000Y1106693D02*
X406693Y1005000D01*
X795000Y1045000D02*
X875000D01*
X567654Y1272346D02*
X795000Y1045000D01*
X483598Y1272346D02*
X567654D01*
X423741Y1541338D02*
X480733Y1484346D01*
X526992Y1705000D02*
X580000D01*
X525000Y1706992D02*
X526992Y1705000D01*
X475410Y1706992D02*
X525000D01*
X423741Y1758661D02*
X475410Y1706992D01*
X305000Y1758661D02*
X423741D01*
X305000Y1541338D02*
X423741D01*
X305000Y1324016D02*
X431929D01*
X483598Y1272346D01*
D16*
X7911800Y420849D02*
X7912225Y420424D01*
X8349576D01*
X8350000Y420000D01*
X8450000D01*
X7911800Y960849D02*
X7994151D01*
X8135000Y820000D01*
X8350000D01*
X8450000D01*
D17*
X7400000Y518898D02*
D03*
Y977795D02*
D03*
D18*
Y381102D02*
D03*
Y840000D02*
D03*
D19*
X8450000Y3520000D02*
D03*
Y3420000D02*
D03*
Y3320000D02*
D03*
Y3220000D02*
D03*
Y3120000D02*
D03*
Y3020000D02*
D03*
Y2920000D02*
D03*
Y2820000D02*
D03*
Y2020000D02*
D03*
Y2120000D02*
D03*
Y2220000D02*
D03*
Y2320000D02*
D03*
Y2420000D02*
D03*
Y2520000D02*
D03*
Y2620000D02*
D03*
Y2720000D02*
D03*
Y1220000D02*
D03*
Y1320000D02*
D03*
Y1420000D02*
D03*
Y1520000D02*
D03*
Y1620000D02*
D03*
Y1720000D02*
D03*
Y1820000D02*
D03*
Y1920000D02*
D03*
Y420000D02*
D03*
Y520000D02*
D03*
Y620000D02*
D03*
Y720000D02*
D03*
Y820000D02*
D03*
Y920000D02*
D03*
Y1020000D02*
D03*
Y1120000D02*
D03*
X8350000D02*
D03*
Y1020000D02*
D03*
Y920000D02*
D03*
Y820000D02*
D03*
Y720000D02*
D03*
Y620000D02*
D03*
Y520000D02*
D03*
Y420000D02*
D03*
Y1920000D02*
D03*
Y1820000D02*
D03*
Y1720000D02*
D03*
Y1620000D02*
D03*
Y1520000D02*
D03*
Y1420000D02*
D03*
Y1320000D02*
D03*
Y1220000D02*
D03*
Y2720000D02*
D03*
Y2620000D02*
D03*
Y2520000D02*
D03*
Y2420000D02*
D03*
Y2320000D02*
D03*
Y2220000D02*
D03*
Y2120000D02*
D03*
Y2020000D02*
D03*
Y2820000D02*
D03*
Y2920000D02*
D03*
Y3020000D02*
D03*
Y3120000D02*
D03*
Y3220000D02*
D03*
Y3320000D02*
D03*
Y3420000D02*
D03*
Y3520000D02*
D03*
X305000Y1106693D02*
D03*
Y1215354D02*
D03*
Y1324016D02*
D03*
Y1432677D02*
D03*
Y1541338D02*
D03*
Y1650000D02*
D03*
Y1758661D02*
D03*
Y1867323D02*
D03*
Y1975984D02*
D03*
Y2084646D02*
D03*
Y2193307D02*
D03*
Y2301968D02*
D03*
Y2410630D02*
D03*
Y2519291D02*
D03*
Y2627953D02*
D03*
Y2736614D02*
D03*
Y2845276D02*
D03*
X405000Y1161024D02*
D03*
Y1269685D02*
D03*
Y1378347D02*
D03*
Y1487008D02*
D03*
Y1595669D02*
D03*
Y1704331D02*
D03*
Y1812992D02*
D03*
Y1921653D02*
D03*
Y2030315D02*
D03*
Y2138976D02*
D03*
Y2247638D02*
D03*
Y2356299D02*
D03*
Y2464961D02*
D03*
Y2573622D02*
D03*
Y2682284D02*
D03*
Y2790945D02*
D03*
X505000Y1106693D02*
D03*
Y1215354D02*
D03*
Y1324016D02*
D03*
Y1432677D02*
D03*
Y1541338D02*
D03*
Y1650000D02*
D03*
Y1758661D02*
D03*
Y1867323D02*
D03*
Y1975984D02*
D03*
Y2084646D02*
D03*
Y2193307D02*
D03*
Y2301968D02*
D03*
Y2410630D02*
D03*
Y2519291D02*
D03*
Y2627953D02*
D03*
Y2736614D02*
D03*
Y2845275D02*
D03*
D21*
X7688200Y959151D02*
D03*
X7911800Y960849D02*
D03*
X7688200Y419151D02*
D03*
X7911800Y420849D02*
D03*
D22*
X405000Y3178741D02*
D03*
Y773228D02*
D03*
D23*
X140547Y218496D02*
D03*
Y3718496D02*
D03*
D24*
X3810748Y3204252D02*
D03*
X1995000Y3210000D02*
D03*
X2005000Y1730000D02*
D03*
X1170000Y2905000D02*
D03*
X1960000Y2900000D02*
D03*
Y3370000D02*
D03*
X1595000Y3240000D02*
D03*
X1185000Y3505000D02*
D03*
X1165000Y1885000D02*
D03*
X1185000Y1555000D02*
D03*
X1595000Y1730000D02*
D03*
X1950000Y1890000D02*
D03*
X2025000Y1440000D02*
D03*
X3385000Y2895000D02*
D03*
X4160000Y3365000D02*
D03*
X4165000Y2900000D02*
D03*
X4195000Y3085000D02*
D03*
X3385000Y3455000D02*
D03*
X3795000Y1730000D02*
D03*
X3370000Y1555000D02*
D03*
X3375000Y2005000D02*
D03*
X4160000Y1895000D02*
D03*
X4195000Y1730000D02*
D03*
X4210000Y1460000D02*
D03*
X6000000Y3205000D02*
D03*
X5560000Y2900000D02*
D03*
Y3310000D02*
D03*
X6355000Y2925000D02*
D03*
X6390000Y3080000D02*
D03*
X6360000Y3375000D02*
D03*
X6410000Y1455000D02*
D03*
X5995000Y1725000D02*
D03*
X5560000Y1560000D02*
D03*
X5565000Y2010000D02*
D03*
X6360000Y1945000D02*
D03*
X6390000Y1740000D02*
D03*
Y750000D02*
D03*
Y475000D02*
D03*
D25*
X1830000Y3355000D02*
D03*
X4040000Y2010000D02*
D03*
X6780000Y3035000D02*
D03*
X6805000Y2080000D02*
D03*
X4582500Y2010000D02*
D03*
X4575000Y1620000D02*
D03*
X3970000Y1650000D02*
D03*
X4030000D02*
D03*
X4025000Y3130000D02*
D03*
X3965000Y3075000D02*
D03*
X4560000Y3055000D02*
D03*
X4550000Y3480000D02*
D03*
X2365000Y1620000D02*
D03*
X1830000Y1645000D02*
D03*
X2360000Y1995000D02*
D03*
X1610000Y3095000D02*
D03*
X1785000Y3220000D02*
D03*
X825000Y2145000D02*
D03*
X785000Y2095000D02*
D03*
Y2190000D02*
D03*
X6235000Y2095000D02*
D03*
X6795000Y1615000D02*
D03*
X6235000Y1640000D02*
D03*
X6155000D02*
D03*
X6080000Y2010000D02*
D03*
X1150000Y2255000D02*
D03*
X1200000Y2210000D02*
D03*
X1063750Y2348750D02*
D03*
X1110000Y2305000D02*
D03*
X740000Y2680000D02*
D03*
X6160000Y3040000D02*
D03*
X5985000Y3090000D02*
D03*
X6230000Y3095000D02*
D03*
X6800000Y3475000D02*
D03*
X6405000Y3215000D02*
D03*
X835000Y1005000D02*
D03*
X875000Y1045000D02*
D03*
X920000Y1085000D02*
D03*
X969231Y1120000D02*
D03*
X3860000Y2010000D02*
D03*
X4195000Y3225000D02*
D03*
X3775000Y3085000D02*
D03*
X1845000Y1995000D02*
D03*
X1770000Y1645000D02*
D03*
X1660000Y2010000D02*
D03*
X2020000Y3080000D02*
D03*
X2370000Y3490000D02*
D03*
D26*
X8550000Y3720000D02*
D03*
Y220000D02*
D03*
%TF.MD5,94fd3a3d6a6b1e9d2f2a781256aec61d*%
M02*
