%TF.GenerationSoftware,Altium Limited,Altium Designer,19.1.5 (86)*%
G04 Layer_Color=8388736*
%FSLAX26Y26*%
%MOIN*%
%TF.FileFunction,Other,Mechanical_14*%
%TF.Part,Single*%
G01*
G75*
%TA.AperFunction,NonConductor*%
%ADD19C,0.007874*%
%ADD24C,0.003937*%
D19*
X15909445Y997160D02*
X15907196D01*
X15902698Y994911D01*
X15900448Y992662D01*
X15898199Y988163D01*
Y979166D01*
X15900448Y974668D01*
X15902698Y972419D01*
X15907196Y970169D01*
X15911694D01*
X15916193Y972419D01*
X15922941Y976917D01*
X15945433Y999409D01*
Y967920D01*
X15907196Y1188583D02*
X15904947Y1184084D01*
X15898199Y1177336D01*
X15945433D01*
X13421142Y527559D02*
X13436885D01*
X13429013D01*
Y574788D01*
X13421142Y566917D01*
X15251850Y449791D02*
X15259722Y457662D01*
X15275465D01*
X15283336Y449791D01*
Y441919D01*
X15275465Y434048D01*
X15267593D01*
X15275465D01*
X15283336Y426176D01*
Y418305D01*
X15275465Y410433D01*
X15259722D01*
X15251850Y418305D01*
X15299079Y449791D02*
X15306951Y457662D01*
X15322694D01*
X15330565Y449791D01*
Y441919D01*
X15322694Y434048D01*
X15314822D01*
X15322694D01*
X15330565Y426176D01*
Y418305D01*
X15322694Y410433D01*
X15306951D01*
X15299079Y418305D01*
X15335502Y344473D02*
X15304016D01*
Y320858D01*
X15319759Y328730D01*
X15327630D01*
X15335502Y320858D01*
Y305116D01*
X15327630Y297244D01*
X15311887D01*
X15304016Y305116D01*
X15351245Y336601D02*
X15359116Y344473D01*
X15374859D01*
X15382730Y336601D01*
Y305116D01*
X15374859Y297244D01*
X15359116D01*
X15351245Y305116D01*
Y336601D01*
X13370354Y332271D02*
X13378226Y340142D01*
X13393969D01*
X13401840Y332271D01*
Y324399D01*
X13393969Y316528D01*
X13386097D01*
X13393969D01*
X13401840Y308656D01*
Y300785D01*
X13393969Y292913D01*
X13378226D01*
X13370354Y300785D01*
X13441198Y292913D02*
Y340142D01*
X13417583Y316528D01*
X13449069D01*
X13384724Y411417D02*
X13400467D01*
X13392596D01*
Y458646D01*
X13384724Y450775D01*
X13424082D02*
X13431953Y458646D01*
X13447696D01*
X13455568Y450775D01*
Y442903D01*
X13447696Y435032D01*
X13455568Y427160D01*
Y419289D01*
X13447696Y411417D01*
X13431953D01*
X13424082Y419289D01*
Y427160D01*
X13431953Y435032D01*
X13424082Y442903D01*
Y450775D01*
X13431953Y435032D02*
X13447696D01*
X14084826Y726250D02*
X14062333D01*
X14060084Y706006D01*
X14062333Y708256D01*
X14069081Y710505D01*
X14075829D01*
X14082576Y708256D01*
X14087075Y703757D01*
X14089324Y697010D01*
Y692511D01*
X14087075Y685763D01*
X14082576Y681265D01*
X14075829Y679016D01*
X14069081D01*
X14062333Y681265D01*
X14060084Y683514D01*
X14057835Y688013D01*
X14113391Y726250D02*
X14106643Y724000D01*
X14102145Y717253D01*
X14099895Y706006D01*
Y699259D01*
X14102145Y688013D01*
X14106643Y681265D01*
X14113391Y679016D01*
X14117889D01*
X14124637Y681265D01*
X14129136Y688013D01*
X14131385Y699259D01*
Y706006D01*
X14129136Y717253D01*
X14124637Y724000D01*
X14117889Y726250D01*
X14113391D01*
X14179068D02*
Y679016D01*
Y726250D02*
X14194813D01*
X14201561Y724000D01*
X14206059Y719502D01*
X14208309Y715004D01*
X14210558Y708256D01*
Y697010D01*
X14208309Y690262D01*
X14206059Y685763D01*
X14201561Y681265D01*
X14194813Y679016D01*
X14179068D01*
X14221129Y699259D02*
X14261615D01*
X14307050Y719502D02*
X14302551Y724000D01*
X14295804Y726250D01*
X14286807D01*
X14280059Y724000D01*
X14275561Y719502D01*
Y715004D01*
X14277810Y710505D01*
X14280059Y708256D01*
X14284558Y706006D01*
X14298053Y701508D01*
X14302551Y699259D01*
X14304801Y697010D01*
X14307050Y692511D01*
Y685763D01*
X14302551Y681265D01*
X14295804Y679016D01*
X14286807D01*
X14280059Y681265D01*
X14275561Y685763D01*
X14317621Y710505D02*
Y688013D01*
X14319871Y681265D01*
X14324369Y679016D01*
X14331117D01*
X14335615Y681265D01*
X14342363Y688013D01*
Y710505D02*
Y679016D01*
X14354734Y726250D02*
Y679016D01*
Y703757D02*
X14359232Y708256D01*
X14363731Y710505D01*
X14370478D01*
X14374977Y708256D01*
X14379475Y703757D01*
X14381725Y697010D01*
Y692511D01*
X14379475Y685763D01*
X14374977Y681265D01*
X14370478Y679016D01*
X14363731D01*
X14359232Y681265D01*
X14354734Y685763D01*
X14428959Y726250D02*
Y679016D01*
Y726250D02*
X14446952Y679016D01*
X14464946Y726250D02*
X14446952Y679016D01*
X14464946Y726250D02*
Y679016D01*
X14505433Y710505D02*
Y679016D01*
Y703757D02*
X14500934Y708256D01*
X14496436Y710505D01*
X14489688D01*
X14485190Y708256D01*
X14480691Y703757D01*
X14478442Y697010D01*
Y692511D01*
X14480691Y685763D01*
X14485190Y681265D01*
X14489688Y679016D01*
X14496436D01*
X14500934Y681265D01*
X14505433Y685763D01*
X14518028Y726250D02*
Y679016D01*
X14527925Y697010D02*
X14554916D01*
Y701508D01*
X14552667Y706006D01*
X14550417Y708256D01*
X14545919Y710505D01*
X14539171D01*
X14534673Y708256D01*
X14530174Y703757D01*
X14527925Y697010D01*
Y692511D01*
X14530174Y685763D01*
X14534673Y681265D01*
X14539171Y679016D01*
X14545919D01*
X14550417Y681265D01*
X14554916Y685763D01*
X15307362Y521654D02*
X15323105D01*
X15315234D01*
Y568882D01*
X15307362Y561011D01*
X15346720Y568882D02*
X15378206D01*
Y561011D01*
X15346720Y529525D01*
Y521654D01*
X10186147Y1039807D02*
Y1042056D01*
X10188396Y1046554D01*
X10190645Y1048804D01*
X10195144Y1051053D01*
X10204141D01*
X10208639Y1048804D01*
X10210888Y1046554D01*
X10213138Y1042056D01*
Y1037557D01*
X10210888Y1033059D01*
X10206390Y1026311D01*
X10183898Y1003819D01*
X10215387D01*
X10252949Y1051053D02*
X10230457D01*
X10228208Y1030810D01*
X10230457Y1033059D01*
X10237205Y1035308D01*
X10243952D01*
X10250700Y1033059D01*
X10255199Y1028561D01*
X10257448Y1021813D01*
Y1017314D01*
X10255199Y1010567D01*
X10250700Y1006068D01*
X10243952Y1003819D01*
X10237205D01*
X10230457Y1006068D01*
X10228208Y1008317D01*
X10225958Y1012816D01*
X10305131Y1051053D02*
Y1003819D01*
Y1051053D02*
X10320876D01*
X10327624Y1048804D01*
X10332122Y1044305D01*
X10334372Y1039807D01*
X10336621Y1033059D01*
Y1021813D01*
X10334372Y1015065D01*
X10332122Y1010567D01*
X10327624Y1006068D01*
X10320876Y1003819D01*
X10305131D01*
X10347192Y1024062D02*
X10387678D01*
X10433113Y1044305D02*
X10428614Y1048804D01*
X10421867Y1051053D01*
X10412870D01*
X10406122Y1048804D01*
X10401624Y1044305D01*
Y1039807D01*
X10403873Y1035308D01*
X10406122Y1033059D01*
X10410621Y1030810D01*
X10424116Y1026311D01*
X10428614Y1024062D01*
X10430864Y1021813D01*
X10433113Y1017314D01*
Y1010567D01*
X10428614Y1006068D01*
X10421867Y1003819D01*
X10412870D01*
X10406122Y1006068D01*
X10401624Y1010567D01*
X10443684Y1035308D02*
Y1012816D01*
X10445934Y1006068D01*
X10450432Y1003819D01*
X10457180D01*
X10461678Y1006068D01*
X10468426Y1012816D01*
Y1035308D02*
Y1003819D01*
X10480797Y1051053D02*
Y1003819D01*
Y1028561D02*
X10485295Y1033059D01*
X10489794Y1035308D01*
X10496541D01*
X10501040Y1033059D01*
X10505538Y1028561D01*
X10507788Y1021813D01*
Y1017314D01*
X10505538Y1010567D01*
X10501040Y1006068D01*
X10496541Y1003819D01*
X10489794D01*
X10485295Y1006068D01*
X10480797Y1010567D01*
X10555022Y1051053D02*
Y1003819D01*
Y1051053D02*
X10584262D01*
X10555022Y1028561D02*
X10573015D01*
X10589660Y1021813D02*
X10616651D01*
Y1026311D01*
X10614401Y1030810D01*
X10612152Y1033059D01*
X10607654Y1035308D01*
X10600906D01*
X10596408Y1033059D01*
X10591909Y1028561D01*
X10589660Y1021813D01*
Y1017314D01*
X10591909Y1010567D01*
X10596408Y1006068D01*
X10600906Y1003819D01*
X10607654D01*
X10612152Y1006068D01*
X10616651Y1010567D01*
X10626772Y1035308D02*
Y1003819D01*
Y1026311D02*
X10633520Y1033059D01*
X10638019Y1035308D01*
X10644766D01*
X10649265Y1033059D01*
X10651514Y1026311D01*
Y1003819D01*
Y1026311D02*
X10658262Y1033059D01*
X10662760Y1035308D01*
X10669508D01*
X10674006Y1033059D01*
X10676255Y1026311D01*
Y1003819D01*
X10718091Y1035308D02*
Y1003819D01*
Y1028561D02*
X10713593Y1033059D01*
X10709094Y1035308D01*
X10702347D01*
X10697848Y1033059D01*
X10693350Y1028561D01*
X10691101Y1021813D01*
Y1017314D01*
X10693350Y1010567D01*
X10697848Y1006068D01*
X10702347Y1003819D01*
X10709094D01*
X10713593Y1006068D01*
X10718091Y1010567D01*
X10730687Y1051053D02*
Y1003819D01*
X10740584Y1021813D02*
X10767575D01*
Y1026311D01*
X10765325Y1030810D01*
X10763076Y1033059D01*
X10758578Y1035308D01*
X10751830D01*
X10747331Y1033059D01*
X10742833Y1028561D01*
X10740584Y1021813D01*
Y1017314D01*
X10742833Y1010567D01*
X10747331Y1006068D01*
X10751830Y1003819D01*
X10758578D01*
X10763076Y1006068D01*
X10767575Y1010567D01*
X9604572Y701342D02*
Y703591D01*
X9606821Y708090D01*
X9609070Y710339D01*
X9613569Y712588D01*
X9622566D01*
X9627064Y710339D01*
X9629314Y708090D01*
X9631563Y703591D01*
Y699093D01*
X9629314Y694595D01*
X9624815Y687847D01*
X9602323Y665354D01*
X9633812D01*
X9671374Y712588D02*
X9648882D01*
X9646633Y692345D01*
X9648882Y694595D01*
X9655630Y696844D01*
X9662377D01*
X9669125Y694595D01*
X9673624Y690096D01*
X9675873Y683348D01*
Y678850D01*
X9673624Y672102D01*
X9669125Y667604D01*
X9662377Y665354D01*
X9655630D01*
X9648882Y667604D01*
X9646633Y669853D01*
X9644383Y674351D01*
X11188937Y717371D02*
X11193435Y719620D01*
X11200183Y726368D01*
Y679134D01*
X11246068Y726368D02*
X11223575Y694879D01*
X11257314D01*
X11246068Y726368D02*
Y679134D01*
X11211575Y987056D02*
X11216073Y989305D01*
X11222821Y996053D01*
Y948819D01*
X9597402Y988040D02*
X9601900Y990289D01*
X9608648Y997037D01*
Y949803D01*
X9636538Y997037D02*
X9661280D01*
X9647785Y979043D01*
X9654532D01*
X9659031Y976794D01*
X9661280Y974545D01*
X9663529Y967797D01*
Y963299D01*
X9661280Y956551D01*
X9656781Y952052D01*
X9650034Y949803D01*
X9643286D01*
X9636538Y952052D01*
X9634289Y954302D01*
X9632040Y958800D01*
X1131029Y4110673D02*
Y4112922D01*
X1133278Y4117421D01*
X1135527Y4119670D01*
X1140026Y4121919D01*
X1149023D01*
X1153521Y4119670D01*
X1155770Y4117421D01*
X1158020Y4112922D01*
Y4108424D01*
X1155770Y4103925D01*
X1151272Y4097177D01*
X1128780Y4074685D01*
X1160269D01*
X1197831Y4121919D02*
X1175339D01*
X1173089Y4101676D01*
X1175339Y4103925D01*
X1182086Y4106174D01*
X1188834D01*
X1195582Y4103925D01*
X1200080Y4099427D01*
X1202330Y4092679D01*
Y4088180D01*
X1200080Y4081433D01*
X1195582Y4076934D01*
X1188834Y4074685D01*
X1182086D01*
X1175339Y4076934D01*
X1173089Y4079184D01*
X1170840Y4083682D01*
X1250013Y4121919D02*
Y4074685D01*
Y4121919D02*
X1265758D01*
X1272506Y4119670D01*
X1277004Y4115171D01*
X1279253Y4110673D01*
X1281503Y4103925D01*
Y4092679D01*
X1279253Y4085931D01*
X1277004Y4081433D01*
X1272506Y4076934D01*
X1265758Y4074685D01*
X1250013D01*
X1292074Y4094928D02*
X1332560D01*
X1377995Y4115171D02*
X1373496Y4119670D01*
X1366749Y4121919D01*
X1357752D01*
X1351004Y4119670D01*
X1346505Y4115171D01*
Y4110673D01*
X1348755Y4106174D01*
X1351004Y4103925D01*
X1355502Y4101676D01*
X1368998Y4097177D01*
X1373496Y4094928D01*
X1375746Y4092679D01*
X1377995Y4088180D01*
Y4081433D01*
X1373496Y4076934D01*
X1366749Y4074685D01*
X1357752D01*
X1351004Y4076934D01*
X1346505Y4081433D01*
X1388566Y4106174D02*
Y4083682D01*
X1390815Y4076934D01*
X1395314Y4074685D01*
X1402062D01*
X1406560Y4076934D01*
X1413308Y4083682D01*
Y4106174D02*
Y4074685D01*
X1425679Y4121919D02*
Y4074685D01*
Y4099427D02*
X1430177Y4103925D01*
X1434676Y4106174D01*
X1441423D01*
X1445922Y4103925D01*
X1450420Y4099427D01*
X1452669Y4092679D01*
Y4088180D01*
X1450420Y4081433D01*
X1445922Y4076934D01*
X1441423Y4074685D01*
X1434676D01*
X1430177Y4076934D01*
X1425679Y4081433D01*
X1499903Y4121919D02*
Y4074685D01*
Y4121919D02*
X1529143D01*
X1499903Y4099427D02*
X1517897D01*
X1534542Y4092679D02*
X1561533D01*
Y4097177D01*
X1559283Y4101676D01*
X1557034Y4103925D01*
X1552536Y4106174D01*
X1545788D01*
X1541289Y4103925D01*
X1536791Y4099427D01*
X1534542Y4092679D01*
Y4088180D01*
X1536791Y4081433D01*
X1541289Y4076934D01*
X1545788Y4074685D01*
X1552536D01*
X1557034Y4076934D01*
X1561533Y4081433D01*
X1571654Y4106174D02*
Y4074685D01*
Y4097177D02*
X1578402Y4103925D01*
X1582900Y4106174D01*
X1589648D01*
X1594147Y4103925D01*
X1596396Y4097177D01*
Y4074685D01*
Y4097177D02*
X1603143Y4103925D01*
X1607642Y4106174D01*
X1614390D01*
X1618888Y4103925D01*
X1621137Y4097177D01*
Y4074685D01*
X1662973Y4106174D02*
Y4074685D01*
Y4099427D02*
X1658475Y4103925D01*
X1653976Y4106174D01*
X1647228D01*
X1642730Y4103925D01*
X1638232Y4099427D01*
X1635982Y4092679D01*
Y4088180D01*
X1638232Y4081433D01*
X1642730Y4076934D01*
X1647228Y4074685D01*
X1653976D01*
X1658475Y4076934D01*
X1662973Y4081433D01*
X1675569Y4121919D02*
Y4074685D01*
X1685466Y4092679D02*
X1712456D01*
Y4097177D01*
X1710207Y4101676D01*
X1707958Y4103925D01*
X1703459Y4106174D01*
X1696712D01*
X1692213Y4103925D01*
X1687715Y4099427D01*
X1685466Y4092679D01*
Y4088180D01*
X1687715Y4081433D01*
X1692213Y4076934D01*
X1696712Y4074685D01*
X1703459D01*
X1707958Y4076934D01*
X1712456Y4081433D01*
X549454Y3772208D02*
Y3774457D01*
X551703Y3778956D01*
X553952Y3781205D01*
X558451Y3783454D01*
X567448D01*
X571946Y3781205D01*
X574195Y3778956D01*
X576445Y3774457D01*
Y3769959D01*
X574195Y3765461D01*
X569697Y3758713D01*
X547205Y3736220D01*
X578694D01*
X616256Y3783454D02*
X593764D01*
X591514Y3763211D01*
X593764Y3765461D01*
X600511Y3767710D01*
X607259D01*
X614007Y3765461D01*
X618505Y3760962D01*
X620755Y3754214D01*
Y3749716D01*
X618505Y3742968D01*
X614007Y3738470D01*
X607259Y3736220D01*
X600511D01*
X593764Y3738470D01*
X591514Y3740719D01*
X589265Y3745217D01*
X2133819Y3788237D02*
X2138317Y3790486D01*
X2145065Y3797234D01*
Y3750000D01*
X2190950Y3797234D02*
X2168457Y3765745D01*
X2202196D01*
X2190950Y3797234D02*
Y3750000D01*
X2156457Y4057922D02*
X2160955Y4060171D01*
X2167703Y4066919D01*
Y4019685D01*
X542283Y4058906D02*
X546782Y4061156D01*
X553530Y4067903D01*
Y4020669D01*
X581420Y4067903D02*
X606162D01*
X592666Y4049909D01*
X599414D01*
X603913Y4047660D01*
X606162Y4045411D01*
X608411Y4038663D01*
Y4034165D01*
X606162Y4027417D01*
X601663Y4022919D01*
X594916Y4020669D01*
X588168D01*
X581420Y4022919D01*
X579171Y4025168D01*
X576922Y4029666D01*
X1131029Y2575240D02*
Y2577489D01*
X1133278Y2581987D01*
X1135527Y2584237D01*
X1140026Y2586486D01*
X1149023D01*
X1153521Y2584237D01*
X1155770Y2581987D01*
X1158020Y2577489D01*
Y2572990D01*
X1155770Y2568492D01*
X1151272Y2561744D01*
X1128780Y2539252D01*
X1160269D01*
X1197831Y2586486D02*
X1175339D01*
X1173089Y2566243D01*
X1175339Y2568492D01*
X1182086Y2570741D01*
X1188834D01*
X1195582Y2568492D01*
X1200080Y2563994D01*
X1202330Y2557246D01*
Y2552747D01*
X1200080Y2546000D01*
X1195582Y2541501D01*
X1188834Y2539252D01*
X1182086D01*
X1175339Y2541501D01*
X1173089Y2543750D01*
X1170840Y2548249D01*
X1250013Y2586486D02*
Y2539252D01*
Y2586486D02*
X1265758D01*
X1272506Y2584237D01*
X1277004Y2579738D01*
X1279253Y2575240D01*
X1281503Y2568492D01*
Y2557246D01*
X1279253Y2550498D01*
X1277004Y2546000D01*
X1272506Y2541501D01*
X1265758Y2539252D01*
X1250013D01*
X1292074Y2559495D02*
X1332560D01*
X1377995Y2579738D02*
X1373496Y2584237D01*
X1366749Y2586486D01*
X1357752D01*
X1351004Y2584237D01*
X1346505Y2579738D01*
Y2575240D01*
X1348755Y2570741D01*
X1351004Y2568492D01*
X1355502Y2566243D01*
X1368998Y2561744D01*
X1373496Y2559495D01*
X1375746Y2557246D01*
X1377995Y2552747D01*
Y2546000D01*
X1373496Y2541501D01*
X1366749Y2539252D01*
X1357752D01*
X1351004Y2541501D01*
X1346505Y2546000D01*
X1388566Y2570741D02*
Y2548249D01*
X1390815Y2541501D01*
X1395314Y2539252D01*
X1402062D01*
X1406560Y2541501D01*
X1413308Y2548249D01*
Y2570741D02*
Y2539252D01*
X1425679Y2586486D02*
Y2539252D01*
Y2563994D02*
X1430177Y2568492D01*
X1434676Y2570741D01*
X1441423D01*
X1445922Y2568492D01*
X1450420Y2563994D01*
X1452669Y2557246D01*
Y2552747D01*
X1450420Y2546000D01*
X1445922Y2541501D01*
X1441423Y2539252D01*
X1434676D01*
X1430177Y2541501D01*
X1425679Y2546000D01*
X1499903Y2586486D02*
Y2539252D01*
Y2586486D02*
X1529143D01*
X1499903Y2563994D02*
X1517897D01*
X1534542Y2557246D02*
X1561533D01*
Y2561744D01*
X1559283Y2566243D01*
X1557034Y2568492D01*
X1552536Y2570741D01*
X1545788D01*
X1541289Y2568492D01*
X1536791Y2563994D01*
X1534542Y2557246D01*
Y2552747D01*
X1536791Y2546000D01*
X1541289Y2541501D01*
X1545788Y2539252D01*
X1552536D01*
X1557034Y2541501D01*
X1561533Y2546000D01*
X1571654Y2570741D02*
Y2539252D01*
Y2561744D02*
X1578402Y2568492D01*
X1582900Y2570741D01*
X1589648D01*
X1594147Y2568492D01*
X1596396Y2561744D01*
Y2539252D01*
Y2561744D02*
X1603143Y2568492D01*
X1607642Y2570741D01*
X1614390D01*
X1618888Y2568492D01*
X1621137Y2561744D01*
Y2539252D01*
X1662973Y2570741D02*
Y2539252D01*
Y2563994D02*
X1658475Y2568492D01*
X1653976Y2570741D01*
X1647228D01*
X1642730Y2568492D01*
X1638232Y2563994D01*
X1635982Y2557246D01*
Y2552747D01*
X1638232Y2546000D01*
X1642730Y2541501D01*
X1647228Y2539252D01*
X1653976D01*
X1658475Y2541501D01*
X1662973Y2546000D01*
X1675569Y2586486D02*
Y2539252D01*
X1685466Y2557246D02*
X1712456D01*
Y2561744D01*
X1710207Y2566243D01*
X1707958Y2568492D01*
X1703459Y2570741D01*
X1696712D01*
X1692213Y2568492D01*
X1687715Y2563994D01*
X1685466Y2557246D01*
Y2552747D01*
X1687715Y2546000D01*
X1692213Y2541501D01*
X1696712Y2539252D01*
X1703459D01*
X1707958Y2541501D01*
X1712456Y2546000D01*
X549454Y2236775D02*
Y2239024D01*
X551703Y2243523D01*
X553952Y2245772D01*
X558451Y2248021D01*
X567448D01*
X571946Y2245772D01*
X574195Y2243523D01*
X576445Y2239024D01*
Y2234526D01*
X574195Y2230028D01*
X569697Y2223280D01*
X547205Y2200787D01*
X578694D01*
X616256Y2248021D02*
X593764D01*
X591514Y2227778D01*
X593764Y2230028D01*
X600511Y2232277D01*
X607259D01*
X614007Y2230028D01*
X618505Y2225529D01*
X620755Y2218781D01*
Y2214283D01*
X618505Y2207535D01*
X614007Y2203037D01*
X607259Y2200787D01*
X600511D01*
X593764Y2203037D01*
X591514Y2205286D01*
X589265Y2209784D01*
X2133819Y2252804D02*
X2138317Y2255053D01*
X2145065Y2261801D01*
Y2214567D01*
X2190950Y2261801D02*
X2168457Y2230312D01*
X2202196D01*
X2190950Y2261801D02*
Y2214567D01*
X2156457Y2522489D02*
X2160955Y2524738D01*
X2167703Y2531486D01*
Y2484252D01*
X542283Y2523473D02*
X546782Y2525722D01*
X553530Y2532470D01*
Y2485236D01*
X581420Y2532470D02*
X606162D01*
X592666Y2514476D01*
X599414D01*
X603913Y2512227D01*
X606162Y2509978D01*
X608411Y2503230D01*
Y2498732D01*
X606162Y2491984D01*
X601663Y2487485D01*
X594916Y2485236D01*
X588168D01*
X581420Y2487485D01*
X579171Y2489735D01*
X576922Y2494233D01*
X1131029Y1039807D02*
Y1042056D01*
X1133278Y1046554D01*
X1135527Y1048804D01*
X1140026Y1051053D01*
X1149023D01*
X1153521Y1048804D01*
X1155770Y1046554D01*
X1158020Y1042056D01*
Y1037557D01*
X1155770Y1033059D01*
X1151272Y1026311D01*
X1128780Y1003819D01*
X1160269D01*
X1197831Y1051053D02*
X1175339D01*
X1173089Y1030810D01*
X1175339Y1033059D01*
X1182086Y1035308D01*
X1188834D01*
X1195582Y1033059D01*
X1200080Y1028561D01*
X1202330Y1021813D01*
Y1017314D01*
X1200080Y1010567D01*
X1195582Y1006068D01*
X1188834Y1003819D01*
X1182086D01*
X1175339Y1006068D01*
X1173089Y1008317D01*
X1170840Y1012816D01*
X1250013Y1051053D02*
Y1003819D01*
Y1051053D02*
X1265758D01*
X1272506Y1048804D01*
X1277004Y1044305D01*
X1279253Y1039807D01*
X1281503Y1033059D01*
Y1021813D01*
X1279253Y1015065D01*
X1277004Y1010567D01*
X1272506Y1006068D01*
X1265758Y1003819D01*
X1250013D01*
X1292074Y1024062D02*
X1332560D01*
X1377995Y1044305D02*
X1373496Y1048804D01*
X1366749Y1051053D01*
X1357752D01*
X1351004Y1048804D01*
X1346505Y1044305D01*
Y1039807D01*
X1348755Y1035308D01*
X1351004Y1033059D01*
X1355502Y1030810D01*
X1368998Y1026311D01*
X1373496Y1024062D01*
X1375746Y1021813D01*
X1377995Y1017314D01*
Y1010567D01*
X1373496Y1006068D01*
X1366749Y1003819D01*
X1357752D01*
X1351004Y1006068D01*
X1346505Y1010567D01*
X1388566Y1035308D02*
Y1012816D01*
X1390815Y1006068D01*
X1395314Y1003819D01*
X1402062D01*
X1406560Y1006068D01*
X1413308Y1012816D01*
Y1035308D02*
Y1003819D01*
X1425679Y1051053D02*
Y1003819D01*
Y1028561D02*
X1430177Y1033059D01*
X1434676Y1035308D01*
X1441423D01*
X1445922Y1033059D01*
X1450420Y1028561D01*
X1452669Y1021813D01*
Y1017314D01*
X1450420Y1010567D01*
X1445922Y1006068D01*
X1441423Y1003819D01*
X1434676D01*
X1430177Y1006068D01*
X1425679Y1010567D01*
X1499903Y1051053D02*
Y1003819D01*
Y1051053D02*
X1529143D01*
X1499903Y1028561D02*
X1517897D01*
X1534542Y1021813D02*
X1561533D01*
Y1026311D01*
X1559283Y1030810D01*
X1557034Y1033059D01*
X1552536Y1035308D01*
X1545788D01*
X1541289Y1033059D01*
X1536791Y1028561D01*
X1534542Y1021813D01*
Y1017314D01*
X1536791Y1010567D01*
X1541289Y1006068D01*
X1545788Y1003819D01*
X1552536D01*
X1557034Y1006068D01*
X1561533Y1010567D01*
X1571654Y1035308D02*
Y1003819D01*
Y1026311D02*
X1578402Y1033059D01*
X1582900Y1035308D01*
X1589648D01*
X1594147Y1033059D01*
X1596396Y1026311D01*
Y1003819D01*
Y1026311D02*
X1603143Y1033059D01*
X1607642Y1035308D01*
X1614390D01*
X1618888Y1033059D01*
X1621137Y1026311D01*
Y1003819D01*
X1662973Y1035308D02*
Y1003819D01*
Y1028561D02*
X1658475Y1033059D01*
X1653976Y1035308D01*
X1647228D01*
X1642730Y1033059D01*
X1638232Y1028561D01*
X1635982Y1021813D01*
Y1017314D01*
X1638232Y1010567D01*
X1642730Y1006068D01*
X1647228Y1003819D01*
X1653976D01*
X1658475Y1006068D01*
X1662973Y1010567D01*
X1675569Y1051053D02*
Y1003819D01*
X1685466Y1021813D02*
X1712456D01*
Y1026311D01*
X1710207Y1030810D01*
X1707958Y1033059D01*
X1703459Y1035308D01*
X1696712D01*
X1692213Y1033059D01*
X1687715Y1028561D01*
X1685466Y1021813D01*
Y1017314D01*
X1687715Y1010567D01*
X1692213Y1006068D01*
X1696712Y1003819D01*
X1703459D01*
X1707958Y1006068D01*
X1712456Y1010567D01*
X549454Y701342D02*
Y703591D01*
X551703Y708090D01*
X553952Y710339D01*
X558451Y712588D01*
X567448D01*
X571946Y710339D01*
X574195Y708090D01*
X576445Y703591D01*
Y699093D01*
X574195Y694595D01*
X569697Y687847D01*
X547205Y665354D01*
X578694D01*
X616256Y712588D02*
X593764D01*
X591514Y692345D01*
X593764Y694595D01*
X600511Y696844D01*
X607259D01*
X614007Y694595D01*
X618505Y690096D01*
X620755Y683348D01*
Y678850D01*
X618505Y672102D01*
X614007Y667604D01*
X607259Y665354D01*
X600511D01*
X593764Y667604D01*
X591514Y669853D01*
X589265Y674351D01*
X2133819Y717371D02*
X2138317Y719620D01*
X2145065Y726368D01*
Y679134D01*
X2190950Y726368D02*
X2168457Y694879D01*
X2202196D01*
X2190950Y726368D02*
Y679134D01*
X2156457Y987056D02*
X2160955Y989305D01*
X2167703Y996053D01*
Y948819D01*
X542283Y988040D02*
X546782Y990289D01*
X553530Y997037D01*
Y949803D01*
X581420Y997037D02*
X606162D01*
X592666Y979043D01*
X599414D01*
X603913Y976794D01*
X606162Y974545D01*
X608411Y967797D01*
Y963299D01*
X606162Y956551D01*
X601663Y952052D01*
X594916Y949803D01*
X588168D01*
X581420Y952052D01*
X579171Y954302D01*
X576922Y958800D01*
X3886934Y4110673D02*
Y4112922D01*
X3889184Y4117421D01*
X3891433Y4119670D01*
X3895931Y4121919D01*
X3904928D01*
X3909427Y4119670D01*
X3911676Y4117421D01*
X3913925Y4112922D01*
Y4108424D01*
X3911676Y4103925D01*
X3907177Y4097177D01*
X3884685Y4074685D01*
X3916174D01*
X3953737Y4121919D02*
X3931244D01*
X3928995Y4101676D01*
X3931244Y4103925D01*
X3937992Y4106174D01*
X3944740D01*
X3951487Y4103925D01*
X3955986Y4099427D01*
X3958235Y4092679D01*
Y4088180D01*
X3955986Y4081433D01*
X3951487Y4076934D01*
X3944740Y4074685D01*
X3937992D01*
X3931244Y4076934D01*
X3928995Y4079184D01*
X3926746Y4083682D01*
X4005919Y4121919D02*
Y4074685D01*
Y4121919D02*
X4021664D01*
X4028411Y4119670D01*
X4032910Y4115171D01*
X4035159Y4110673D01*
X4037408Y4103925D01*
Y4092679D01*
X4035159Y4085931D01*
X4032910Y4081433D01*
X4028411Y4076934D01*
X4021664Y4074685D01*
X4005919D01*
X4047980Y4094928D02*
X4088466D01*
X4133900Y4115171D02*
X4129402Y4119670D01*
X4122654Y4121919D01*
X4113657D01*
X4106910Y4119670D01*
X4102411Y4115171D01*
Y4110673D01*
X4104660Y4106174D01*
X4106910Y4103925D01*
X4111408Y4101676D01*
X4124904Y4097177D01*
X4129402Y4094928D01*
X4131651Y4092679D01*
X4133900Y4088180D01*
Y4081433D01*
X4129402Y4076934D01*
X4122654Y4074685D01*
X4113657D01*
X4106910Y4076934D01*
X4102411Y4081433D01*
X4144472Y4106174D02*
Y4083682D01*
X4146721Y4076934D01*
X4151220Y4074685D01*
X4157967D01*
X4162466Y4076934D01*
X4169213Y4083682D01*
Y4106174D02*
Y4074685D01*
X4181584Y4121919D02*
Y4074685D01*
Y4099427D02*
X4186083Y4103925D01*
X4190581Y4106174D01*
X4197329D01*
X4201827Y4103925D01*
X4206326Y4099427D01*
X4208575Y4092679D01*
Y4088180D01*
X4206326Y4081433D01*
X4201827Y4076934D01*
X4197329Y4074685D01*
X4190581D01*
X4186083Y4076934D01*
X4181584Y4081433D01*
X4255809Y4121919D02*
Y4074685D01*
Y4121919D02*
X4285049D01*
X4255809Y4099427D02*
X4273803D01*
X4290447Y4092679D02*
X4317438D01*
Y4097177D01*
X4315189Y4101676D01*
X4312940Y4103925D01*
X4308441Y4106174D01*
X4301694D01*
X4297195Y4103925D01*
X4292697Y4099427D01*
X4290447Y4092679D01*
Y4088180D01*
X4292697Y4081433D01*
X4297195Y4076934D01*
X4301694Y4074685D01*
X4308441D01*
X4312940Y4076934D01*
X4317438Y4081433D01*
X4327560Y4106174D02*
Y4074685D01*
Y4097177D02*
X4334307Y4103925D01*
X4338806Y4106174D01*
X4345554D01*
X4350052Y4103925D01*
X4352301Y4097177D01*
Y4074685D01*
Y4097177D02*
X4359049Y4103925D01*
X4363547Y4106174D01*
X4370295D01*
X4374794Y4103925D01*
X4377043Y4097177D01*
Y4074685D01*
X4418879Y4106174D02*
Y4074685D01*
Y4099427D02*
X4414380Y4103925D01*
X4409882Y4106174D01*
X4403134D01*
X4398636Y4103925D01*
X4394137Y4099427D01*
X4391888Y4092679D01*
Y4088180D01*
X4394137Y4081433D01*
X4398636Y4076934D01*
X4403134Y4074685D01*
X4409882D01*
X4414380Y4076934D01*
X4418879Y4081433D01*
X4431475Y4121919D02*
Y4074685D01*
X4441371Y4092679D02*
X4468362D01*
Y4097177D01*
X4466113Y4101676D01*
X4463864Y4103925D01*
X4459365Y4106174D01*
X4452617D01*
X4448119Y4103925D01*
X4443620Y4099427D01*
X4441371Y4092679D01*
Y4088180D01*
X4443620Y4081433D01*
X4448119Y4076934D01*
X4452617Y4074685D01*
X4459365D01*
X4463864Y4076934D01*
X4468362Y4081433D01*
X3305359Y3772208D02*
Y3774457D01*
X3307609Y3778956D01*
X3309858Y3781205D01*
X3314356Y3783454D01*
X3323353D01*
X3327852Y3781205D01*
X3330101Y3778956D01*
X3332350Y3774457D01*
Y3769959D01*
X3330101Y3765461D01*
X3325603Y3758713D01*
X3303110Y3736220D01*
X3334599D01*
X3372162Y3783454D02*
X3349669D01*
X3347420Y3763211D01*
X3349669Y3765461D01*
X3356417Y3767710D01*
X3363165D01*
X3369912Y3765461D01*
X3374411Y3760962D01*
X3376660Y3754214D01*
Y3749716D01*
X3374411Y3742968D01*
X3369912Y3738470D01*
X3363165Y3736220D01*
X3356417D01*
X3349669Y3738470D01*
X3347420Y3740719D01*
X3345171Y3745217D01*
X4889724Y3788237D02*
X4894223Y3790486D01*
X4900971Y3797234D01*
Y3750000D01*
X4946855Y3797234D02*
X4924363Y3765745D01*
X4958101D01*
X4946855Y3797234D02*
Y3750000D01*
X4912362Y4057922D02*
X4916861Y4060171D01*
X4923608Y4066919D01*
Y4019685D01*
X3298189Y4058906D02*
X3302688Y4061156D01*
X3309435Y4067903D01*
Y4020669D01*
X3337326Y4067903D02*
X3362067D01*
X3348572Y4049909D01*
X3355320D01*
X3359818Y4047660D01*
X3362067Y4045411D01*
X3364317Y4038663D01*
Y4034165D01*
X3362067Y4027417D01*
X3357569Y4022919D01*
X3350821Y4020669D01*
X3344073D01*
X3337326Y4022919D01*
X3335077Y4025168D01*
X3332827Y4029666D01*
X3886934Y2575240D02*
Y2577489D01*
X3889184Y2581987D01*
X3891433Y2584237D01*
X3895931Y2586486D01*
X3904928D01*
X3909427Y2584237D01*
X3911676Y2581987D01*
X3913925Y2577489D01*
Y2572990D01*
X3911676Y2568492D01*
X3907177Y2561744D01*
X3884685Y2539252D01*
X3916174D01*
X3953737Y2586486D02*
X3931244D01*
X3928995Y2566243D01*
X3931244Y2568492D01*
X3937992Y2570741D01*
X3944740D01*
X3951487Y2568492D01*
X3955986Y2563994D01*
X3958235Y2557246D01*
Y2552747D01*
X3955986Y2546000D01*
X3951487Y2541501D01*
X3944740Y2539252D01*
X3937992D01*
X3931244Y2541501D01*
X3928995Y2543750D01*
X3926746Y2548249D01*
X4005919Y2586486D02*
Y2539252D01*
Y2586486D02*
X4021664D01*
X4028411Y2584237D01*
X4032910Y2579738D01*
X4035159Y2575240D01*
X4037408Y2568492D01*
Y2557246D01*
X4035159Y2550498D01*
X4032910Y2546000D01*
X4028411Y2541501D01*
X4021664Y2539252D01*
X4005919D01*
X4047980Y2559495D02*
X4088466D01*
X4133900Y2579738D02*
X4129402Y2584237D01*
X4122654Y2586486D01*
X4113657D01*
X4106910Y2584237D01*
X4102411Y2579738D01*
Y2575240D01*
X4104660Y2570741D01*
X4106910Y2568492D01*
X4111408Y2566243D01*
X4124904Y2561744D01*
X4129402Y2559495D01*
X4131651Y2557246D01*
X4133900Y2552747D01*
Y2546000D01*
X4129402Y2541501D01*
X4122654Y2539252D01*
X4113657D01*
X4106910Y2541501D01*
X4102411Y2546000D01*
X4144472Y2570741D02*
Y2548249D01*
X4146721Y2541501D01*
X4151220Y2539252D01*
X4157967D01*
X4162466Y2541501D01*
X4169213Y2548249D01*
Y2570741D02*
Y2539252D01*
X4181584Y2586486D02*
Y2539252D01*
Y2563994D02*
X4186083Y2568492D01*
X4190581Y2570741D01*
X4197329D01*
X4201827Y2568492D01*
X4206326Y2563994D01*
X4208575Y2557246D01*
Y2552747D01*
X4206326Y2546000D01*
X4201827Y2541501D01*
X4197329Y2539252D01*
X4190581D01*
X4186083Y2541501D01*
X4181584Y2546000D01*
X4255809Y2586486D02*
Y2539252D01*
Y2586486D02*
X4285049D01*
X4255809Y2563994D02*
X4273803D01*
X4290447Y2557246D02*
X4317438D01*
Y2561744D01*
X4315189Y2566243D01*
X4312940Y2568492D01*
X4308441Y2570741D01*
X4301694D01*
X4297195Y2568492D01*
X4292697Y2563994D01*
X4290447Y2557246D01*
Y2552747D01*
X4292697Y2546000D01*
X4297195Y2541501D01*
X4301694Y2539252D01*
X4308441D01*
X4312940Y2541501D01*
X4317438Y2546000D01*
X4327560Y2570741D02*
Y2539252D01*
Y2561744D02*
X4334307Y2568492D01*
X4338806Y2570741D01*
X4345554D01*
X4350052Y2568492D01*
X4352301Y2561744D01*
Y2539252D01*
Y2561744D02*
X4359049Y2568492D01*
X4363547Y2570741D01*
X4370295D01*
X4374794Y2568492D01*
X4377043Y2561744D01*
Y2539252D01*
X4418879Y2570741D02*
Y2539252D01*
Y2563994D02*
X4414380Y2568492D01*
X4409882Y2570741D01*
X4403134D01*
X4398636Y2568492D01*
X4394137Y2563994D01*
X4391888Y2557246D01*
Y2552747D01*
X4394137Y2546000D01*
X4398636Y2541501D01*
X4403134Y2539252D01*
X4409882D01*
X4414380Y2541501D01*
X4418879Y2546000D01*
X4431475Y2586486D02*
Y2539252D01*
X4441371Y2557246D02*
X4468362D01*
Y2561744D01*
X4466113Y2566243D01*
X4463864Y2568492D01*
X4459365Y2570741D01*
X4452617D01*
X4448119Y2568492D01*
X4443620Y2563994D01*
X4441371Y2557246D01*
Y2552747D01*
X4443620Y2546000D01*
X4448119Y2541501D01*
X4452617Y2539252D01*
X4459365D01*
X4463864Y2541501D01*
X4468362Y2546000D01*
X3305359Y2236775D02*
Y2239024D01*
X3307609Y2243523D01*
X3309858Y2245772D01*
X3314356Y2248021D01*
X3323353D01*
X3327852Y2245772D01*
X3330101Y2243523D01*
X3332350Y2239024D01*
Y2234526D01*
X3330101Y2230028D01*
X3325603Y2223280D01*
X3303110Y2200787D01*
X3334599D01*
X3372162Y2248021D02*
X3349669D01*
X3347420Y2227778D01*
X3349669Y2230028D01*
X3356417Y2232277D01*
X3363165D01*
X3369912Y2230028D01*
X3374411Y2225529D01*
X3376660Y2218781D01*
Y2214283D01*
X3374411Y2207535D01*
X3369912Y2203037D01*
X3363165Y2200787D01*
X3356417D01*
X3349669Y2203037D01*
X3347420Y2205286D01*
X3345171Y2209784D01*
X4889724Y2252804D02*
X4894223Y2255053D01*
X4900971Y2261801D01*
Y2214567D01*
X4946855Y2261801D02*
X4924363Y2230312D01*
X4958101D01*
X4946855Y2261801D02*
Y2214567D01*
X4912362Y2522489D02*
X4916861Y2524738D01*
X4923608Y2531486D01*
Y2484252D01*
X3298189Y2523473D02*
X3302688Y2525722D01*
X3309435Y2532470D01*
Y2485236D01*
X3337326Y2532470D02*
X3362067D01*
X3348572Y2514476D01*
X3355320D01*
X3359818Y2512227D01*
X3362067Y2509978D01*
X3364317Y2503230D01*
Y2498732D01*
X3362067Y2491984D01*
X3357569Y2487485D01*
X3350821Y2485236D01*
X3344073D01*
X3337326Y2487485D01*
X3335077Y2489735D01*
X3332827Y2494233D01*
X3886934Y1039807D02*
Y1042056D01*
X3889184Y1046554D01*
X3891433Y1048804D01*
X3895931Y1051053D01*
X3904928D01*
X3909427Y1048804D01*
X3911676Y1046554D01*
X3913925Y1042056D01*
Y1037557D01*
X3911676Y1033059D01*
X3907177Y1026311D01*
X3884685Y1003819D01*
X3916174D01*
X3953737Y1051053D02*
X3931244D01*
X3928995Y1030810D01*
X3931244Y1033059D01*
X3937992Y1035308D01*
X3944740D01*
X3951487Y1033059D01*
X3955986Y1028561D01*
X3958235Y1021813D01*
Y1017314D01*
X3955986Y1010567D01*
X3951487Y1006068D01*
X3944740Y1003819D01*
X3937992D01*
X3931244Y1006068D01*
X3928995Y1008317D01*
X3926746Y1012816D01*
X4005919Y1051053D02*
Y1003819D01*
Y1051053D02*
X4021664D01*
X4028411Y1048804D01*
X4032910Y1044305D01*
X4035159Y1039807D01*
X4037408Y1033059D01*
Y1021813D01*
X4035159Y1015065D01*
X4032910Y1010567D01*
X4028411Y1006068D01*
X4021664Y1003819D01*
X4005919D01*
X4047980Y1024062D02*
X4088466D01*
X4133900Y1044305D02*
X4129402Y1048804D01*
X4122654Y1051053D01*
X4113657D01*
X4106910Y1048804D01*
X4102411Y1044305D01*
Y1039807D01*
X4104660Y1035308D01*
X4106910Y1033059D01*
X4111408Y1030810D01*
X4124904Y1026311D01*
X4129402Y1024062D01*
X4131651Y1021813D01*
X4133900Y1017314D01*
Y1010567D01*
X4129402Y1006068D01*
X4122654Y1003819D01*
X4113657D01*
X4106910Y1006068D01*
X4102411Y1010567D01*
X4144472Y1035308D02*
Y1012816D01*
X4146721Y1006068D01*
X4151220Y1003819D01*
X4157967D01*
X4162466Y1006068D01*
X4169213Y1012816D01*
Y1035308D02*
Y1003819D01*
X4181584Y1051053D02*
Y1003819D01*
Y1028561D02*
X4186083Y1033059D01*
X4190581Y1035308D01*
X4197329D01*
X4201827Y1033059D01*
X4206326Y1028561D01*
X4208575Y1021813D01*
Y1017314D01*
X4206326Y1010567D01*
X4201827Y1006068D01*
X4197329Y1003819D01*
X4190581D01*
X4186083Y1006068D01*
X4181584Y1010567D01*
X4255809Y1051053D02*
Y1003819D01*
Y1051053D02*
X4285049D01*
X4255809Y1028561D02*
X4273803D01*
X4290447Y1021813D02*
X4317438D01*
Y1026311D01*
X4315189Y1030810D01*
X4312940Y1033059D01*
X4308441Y1035308D01*
X4301694D01*
X4297195Y1033059D01*
X4292697Y1028561D01*
X4290447Y1021813D01*
Y1017314D01*
X4292697Y1010567D01*
X4297195Y1006068D01*
X4301694Y1003819D01*
X4308441D01*
X4312940Y1006068D01*
X4317438Y1010567D01*
X4327560Y1035308D02*
Y1003819D01*
Y1026311D02*
X4334307Y1033059D01*
X4338806Y1035308D01*
X4345554D01*
X4350052Y1033059D01*
X4352301Y1026311D01*
Y1003819D01*
Y1026311D02*
X4359049Y1033059D01*
X4363547Y1035308D01*
X4370295D01*
X4374794Y1033059D01*
X4377043Y1026311D01*
Y1003819D01*
X4418879Y1035308D02*
Y1003819D01*
Y1028561D02*
X4414380Y1033059D01*
X4409882Y1035308D01*
X4403134D01*
X4398636Y1033059D01*
X4394137Y1028561D01*
X4391888Y1021813D01*
Y1017314D01*
X4394137Y1010567D01*
X4398636Y1006068D01*
X4403134Y1003819D01*
X4409882D01*
X4414380Y1006068D01*
X4418879Y1010567D01*
X4431475Y1051053D02*
Y1003819D01*
X4441371Y1021813D02*
X4468362D01*
Y1026311D01*
X4466113Y1030810D01*
X4463864Y1033059D01*
X4459365Y1035308D01*
X4452617D01*
X4448119Y1033059D01*
X4443620Y1028561D01*
X4441371Y1021813D01*
Y1017314D01*
X4443620Y1010567D01*
X4448119Y1006068D01*
X4452617Y1003819D01*
X4459365D01*
X4463864Y1006068D01*
X4468362Y1010567D01*
X3305359Y701342D02*
Y703591D01*
X3307609Y708090D01*
X3309858Y710339D01*
X3314356Y712588D01*
X3323353D01*
X3327852Y710339D01*
X3330101Y708090D01*
X3332350Y703591D01*
Y699093D01*
X3330101Y694595D01*
X3325603Y687847D01*
X3303110Y665354D01*
X3334599D01*
X3372162Y712588D02*
X3349669D01*
X3347420Y692345D01*
X3349669Y694595D01*
X3356417Y696844D01*
X3363165D01*
X3369912Y694595D01*
X3374411Y690096D01*
X3376660Y683348D01*
Y678850D01*
X3374411Y672102D01*
X3369912Y667604D01*
X3363165Y665354D01*
X3356417D01*
X3349669Y667604D01*
X3347420Y669853D01*
X3345171Y674351D01*
X4889724Y717371D02*
X4894223Y719620D01*
X4900971Y726368D01*
Y679134D01*
X4946855Y726368D02*
X4924363Y694879D01*
X4958101D01*
X4946855Y726368D02*
Y679134D01*
X4912362Y987056D02*
X4916861Y989305D01*
X4923608Y996053D01*
Y948819D01*
X3298189Y988040D02*
X3302688Y990289D01*
X3309435Y997037D01*
Y949803D01*
X3337326Y997037D02*
X3362067D01*
X3348572Y979043D01*
X3355320D01*
X3359818Y976794D01*
X3362067Y974545D01*
X3364317Y967797D01*
Y963299D01*
X3362067Y956551D01*
X3357569Y952052D01*
X3350821Y949803D01*
X3344073D01*
X3337326Y952052D01*
X3335077Y954302D01*
X3332827Y958800D01*
X7430241Y4110673D02*
Y4112922D01*
X7432491Y4117421D01*
X7434740Y4119670D01*
X7439238Y4121919D01*
X7448235D01*
X7452734Y4119670D01*
X7454983Y4117421D01*
X7457232Y4112922D01*
Y4108424D01*
X7454983Y4103925D01*
X7450484Y4097177D01*
X7427992Y4074685D01*
X7459481D01*
X7497044Y4121919D02*
X7474551D01*
X7472302Y4101676D01*
X7474551Y4103925D01*
X7481299Y4106174D01*
X7488047D01*
X7494794Y4103925D01*
X7499293Y4099427D01*
X7501542Y4092679D01*
Y4088180D01*
X7499293Y4081433D01*
X7494794Y4076934D01*
X7488047Y4074685D01*
X7481299D01*
X7474551Y4076934D01*
X7472302Y4079184D01*
X7470053Y4083682D01*
X7549226Y4121919D02*
Y4074685D01*
Y4121919D02*
X7564971D01*
X7571718Y4119670D01*
X7576217Y4115171D01*
X7578466Y4110673D01*
X7580715Y4103925D01*
Y4092679D01*
X7578466Y4085931D01*
X7576217Y4081433D01*
X7571718Y4076934D01*
X7564971Y4074685D01*
X7549226D01*
X7591287Y4094928D02*
X7631773D01*
X7677207Y4115171D02*
X7672709Y4119670D01*
X7665961Y4121919D01*
X7656964D01*
X7650217Y4119670D01*
X7645718Y4115171D01*
Y4110673D01*
X7647967Y4106174D01*
X7650217Y4103925D01*
X7654715Y4101676D01*
X7668211Y4097177D01*
X7672709Y4094928D01*
X7674958Y4092679D01*
X7677207Y4088180D01*
Y4081433D01*
X7672709Y4076934D01*
X7665961Y4074685D01*
X7656964D01*
X7650217Y4076934D01*
X7645718Y4081433D01*
X7687779Y4106174D02*
Y4083682D01*
X7690028Y4076934D01*
X7694526Y4074685D01*
X7701274D01*
X7705773Y4076934D01*
X7712520Y4083682D01*
Y4106174D02*
Y4074685D01*
X7724891Y4121919D02*
Y4074685D01*
Y4099427D02*
X7729390Y4103925D01*
X7733888Y4106174D01*
X7740636D01*
X7745134Y4103925D01*
X7749633Y4099427D01*
X7751882Y4092679D01*
Y4088180D01*
X7749633Y4081433D01*
X7745134Y4076934D01*
X7740636Y4074685D01*
X7733888D01*
X7729390Y4076934D01*
X7724891Y4081433D01*
X7799116Y4121919D02*
Y4074685D01*
Y4121919D02*
X7828356D01*
X7799116Y4099427D02*
X7817110D01*
X7833754Y4092679D02*
X7860745D01*
Y4097177D01*
X7858496Y4101676D01*
X7856247Y4103925D01*
X7851748Y4106174D01*
X7845001D01*
X7840502Y4103925D01*
X7836003Y4099427D01*
X7833754Y4092679D01*
Y4088180D01*
X7836003Y4081433D01*
X7840502Y4076934D01*
X7845001Y4074685D01*
X7851748D01*
X7856247Y4076934D01*
X7860745Y4081433D01*
X7870867Y4106174D02*
Y4074685D01*
Y4097177D02*
X7877614Y4103925D01*
X7882113Y4106174D01*
X7888861D01*
X7893359Y4103925D01*
X7895608Y4097177D01*
Y4074685D01*
Y4097177D02*
X7902356Y4103925D01*
X7906855Y4106174D01*
X7913602D01*
X7918101Y4103925D01*
X7920350Y4097177D01*
Y4074685D01*
X7962186Y4106174D02*
Y4074685D01*
Y4099427D02*
X7957687Y4103925D01*
X7953189Y4106174D01*
X7946441D01*
X7941943Y4103925D01*
X7937444Y4099427D01*
X7935195Y4092679D01*
Y4088180D01*
X7937444Y4081433D01*
X7941943Y4076934D01*
X7946441Y4074685D01*
X7953189D01*
X7957687Y4076934D01*
X7962186Y4081433D01*
X7974782Y4121919D02*
Y4074685D01*
X7984678Y4092679D02*
X8011669D01*
Y4097177D01*
X8009420Y4101676D01*
X8007171Y4103925D01*
X8002672Y4106174D01*
X7995924D01*
X7991426Y4103925D01*
X7986927Y4099427D01*
X7984678Y4092679D01*
Y4088180D01*
X7986927Y4081433D01*
X7991426Y4076934D01*
X7995924Y4074685D01*
X8002672D01*
X8007171Y4076934D01*
X8011669Y4081433D01*
X6848666Y3772208D02*
Y3774457D01*
X6850916Y3778956D01*
X6853165Y3781205D01*
X6857663Y3783454D01*
X6866660D01*
X6871159Y3781205D01*
X6873408Y3778956D01*
X6875657Y3774457D01*
Y3769959D01*
X6873408Y3765461D01*
X6868910Y3758713D01*
X6846417Y3736220D01*
X6877907D01*
X6915469Y3783454D02*
X6892976D01*
X6890727Y3763211D01*
X6892976Y3765461D01*
X6899724Y3767710D01*
X6906472D01*
X6913220Y3765461D01*
X6917718Y3760962D01*
X6919967Y3754214D01*
Y3749716D01*
X6917718Y3742968D01*
X6913220Y3738470D01*
X6906472Y3736220D01*
X6899724D01*
X6892976Y3738470D01*
X6890727Y3740719D01*
X6888478Y3745217D01*
X8433031Y3788237D02*
X8437530Y3790486D01*
X8444278Y3797234D01*
Y3750000D01*
X8490162Y3797234D02*
X8467670Y3765745D01*
X8501408D01*
X8490162Y3797234D02*
Y3750000D01*
X8455669Y4057922D02*
X8460168Y4060171D01*
X8466915Y4066919D01*
Y4019685D01*
X6841496Y4058906D02*
X6845994Y4061156D01*
X6852742Y4067903D01*
Y4020669D01*
X6880633Y4067903D02*
X6905374D01*
X6891879Y4049909D01*
X6898627D01*
X6903125Y4047660D01*
X6905374Y4045411D01*
X6907624Y4038663D01*
Y4034165D01*
X6905374Y4027417D01*
X6900876Y4022919D01*
X6894128Y4020669D01*
X6887381D01*
X6880633Y4022919D01*
X6878383Y4025168D01*
X6876134Y4029666D01*
X7430241Y2575240D02*
Y2577489D01*
X7432491Y2581987D01*
X7434740Y2584237D01*
X7439238Y2586486D01*
X7448235D01*
X7452734Y2584237D01*
X7454983Y2581987D01*
X7457232Y2577489D01*
Y2572990D01*
X7454983Y2568492D01*
X7450484Y2561744D01*
X7427992Y2539252D01*
X7459481D01*
X7497044Y2586486D02*
X7474551D01*
X7472302Y2566243D01*
X7474551Y2568492D01*
X7481299Y2570741D01*
X7488047D01*
X7494794Y2568492D01*
X7499293Y2563994D01*
X7501542Y2557246D01*
Y2552747D01*
X7499293Y2546000D01*
X7494794Y2541501D01*
X7488047Y2539252D01*
X7481299D01*
X7474551Y2541501D01*
X7472302Y2543750D01*
X7470053Y2548249D01*
X7549226Y2586486D02*
Y2539252D01*
Y2586486D02*
X7564971D01*
X7571718Y2584237D01*
X7576217Y2579738D01*
X7578466Y2575240D01*
X7580715Y2568492D01*
Y2557246D01*
X7578466Y2550498D01*
X7576217Y2546000D01*
X7571718Y2541501D01*
X7564971Y2539252D01*
X7549226D01*
X7591287Y2559495D02*
X7631773D01*
X7677207Y2579738D02*
X7672709Y2584237D01*
X7665961Y2586486D01*
X7656964D01*
X7650217Y2584237D01*
X7645718Y2579738D01*
Y2575240D01*
X7647967Y2570741D01*
X7650217Y2568492D01*
X7654715Y2566243D01*
X7668211Y2561744D01*
X7672709Y2559495D01*
X7674958Y2557246D01*
X7677207Y2552747D01*
Y2546000D01*
X7672709Y2541501D01*
X7665961Y2539252D01*
X7656964D01*
X7650217Y2541501D01*
X7645718Y2546000D01*
X7687779Y2570741D02*
Y2548249D01*
X7690028Y2541501D01*
X7694526Y2539252D01*
X7701274D01*
X7705773Y2541501D01*
X7712520Y2548249D01*
Y2570741D02*
Y2539252D01*
X7724891Y2586486D02*
Y2539252D01*
Y2563994D02*
X7729390Y2568492D01*
X7733888Y2570741D01*
X7740636D01*
X7745134Y2568492D01*
X7749633Y2563994D01*
X7751882Y2557246D01*
Y2552747D01*
X7749633Y2546000D01*
X7745134Y2541501D01*
X7740636Y2539252D01*
X7733888D01*
X7729390Y2541501D01*
X7724891Y2546000D01*
X7799116Y2586486D02*
Y2539252D01*
Y2586486D02*
X7828356D01*
X7799116Y2563994D02*
X7817110D01*
X7833754Y2557246D02*
X7860745D01*
Y2561744D01*
X7858496Y2566243D01*
X7856247Y2568492D01*
X7851748Y2570741D01*
X7845001D01*
X7840502Y2568492D01*
X7836003Y2563994D01*
X7833754Y2557246D01*
Y2552747D01*
X7836003Y2546000D01*
X7840502Y2541501D01*
X7845001Y2539252D01*
X7851748D01*
X7856247Y2541501D01*
X7860745Y2546000D01*
X7870867Y2570741D02*
Y2539252D01*
Y2561744D02*
X7877614Y2568492D01*
X7882113Y2570741D01*
X7888861D01*
X7893359Y2568492D01*
X7895608Y2561744D01*
Y2539252D01*
Y2561744D02*
X7902356Y2568492D01*
X7906855Y2570741D01*
X7913602D01*
X7918101Y2568492D01*
X7920350Y2561744D01*
Y2539252D01*
X7962186Y2570741D02*
Y2539252D01*
Y2563994D02*
X7957687Y2568492D01*
X7953189Y2570741D01*
X7946441D01*
X7941943Y2568492D01*
X7937444Y2563994D01*
X7935195Y2557246D01*
Y2552747D01*
X7937444Y2546000D01*
X7941943Y2541501D01*
X7946441Y2539252D01*
X7953189D01*
X7957687Y2541501D01*
X7962186Y2546000D01*
X7974782Y2586486D02*
Y2539252D01*
X7984678Y2557246D02*
X8011669D01*
Y2561744D01*
X8009420Y2566243D01*
X8007171Y2568492D01*
X8002672Y2570741D01*
X7995924D01*
X7991426Y2568492D01*
X7986927Y2563994D01*
X7984678Y2557246D01*
Y2552747D01*
X7986927Y2546000D01*
X7991426Y2541501D01*
X7995924Y2539252D01*
X8002672D01*
X8007171Y2541501D01*
X8011669Y2546000D01*
X6848666Y2236775D02*
Y2239024D01*
X6850916Y2243523D01*
X6853165Y2245772D01*
X6857663Y2248021D01*
X6866660D01*
X6871159Y2245772D01*
X6873408Y2243523D01*
X6875657Y2239024D01*
Y2234526D01*
X6873408Y2230028D01*
X6868910Y2223280D01*
X6846417Y2200787D01*
X6877907D01*
X6915469Y2248021D02*
X6892976D01*
X6890727Y2227778D01*
X6892976Y2230028D01*
X6899724Y2232277D01*
X6906472D01*
X6913220Y2230028D01*
X6917718Y2225529D01*
X6919967Y2218781D01*
Y2214283D01*
X6917718Y2207535D01*
X6913220Y2203037D01*
X6906472Y2200787D01*
X6899724D01*
X6892976Y2203037D01*
X6890727Y2205286D01*
X6888478Y2209784D01*
X8433031Y2252804D02*
X8437530Y2255053D01*
X8444278Y2261801D01*
Y2214567D01*
X8490162Y2261801D02*
X8467670Y2230312D01*
X8501408D01*
X8490162Y2261801D02*
Y2214567D01*
X8455669Y2522489D02*
X8460168Y2524738D01*
X8466915Y2531486D01*
Y2484252D01*
X6841496Y2523473D02*
X6845994Y2525722D01*
X6852742Y2532470D01*
Y2485236D01*
X6880633Y2532470D02*
X6905374D01*
X6891879Y2514476D01*
X6898627D01*
X6903125Y2512227D01*
X6905374Y2509978D01*
X6907624Y2503230D01*
Y2498732D01*
X6905374Y2491984D01*
X6900876Y2487485D01*
X6894128Y2485236D01*
X6887381D01*
X6880633Y2487485D01*
X6878383Y2489735D01*
X6876134Y2494233D01*
X7430241Y1039807D02*
Y1042056D01*
X7432491Y1046554D01*
X7434740Y1048804D01*
X7439238Y1051053D01*
X7448235D01*
X7452734Y1048804D01*
X7454983Y1046554D01*
X7457232Y1042056D01*
Y1037557D01*
X7454983Y1033059D01*
X7450484Y1026311D01*
X7427992Y1003819D01*
X7459481D01*
X7497044Y1051053D02*
X7474551D01*
X7472302Y1030810D01*
X7474551Y1033059D01*
X7481299Y1035308D01*
X7488047D01*
X7494794Y1033059D01*
X7499293Y1028561D01*
X7501542Y1021813D01*
Y1017314D01*
X7499293Y1010567D01*
X7494794Y1006068D01*
X7488047Y1003819D01*
X7481299D01*
X7474551Y1006068D01*
X7472302Y1008317D01*
X7470053Y1012816D01*
X7549226Y1051053D02*
Y1003819D01*
Y1051053D02*
X7564971D01*
X7571718Y1048804D01*
X7576217Y1044305D01*
X7578466Y1039807D01*
X7580715Y1033059D01*
Y1021813D01*
X7578466Y1015065D01*
X7576217Y1010567D01*
X7571718Y1006068D01*
X7564971Y1003819D01*
X7549226D01*
X7591287Y1024062D02*
X7631773D01*
X7677207Y1044305D02*
X7672709Y1048804D01*
X7665961Y1051053D01*
X7656964D01*
X7650217Y1048804D01*
X7645718Y1044305D01*
Y1039807D01*
X7647967Y1035308D01*
X7650217Y1033059D01*
X7654715Y1030810D01*
X7668211Y1026311D01*
X7672709Y1024062D01*
X7674958Y1021813D01*
X7677207Y1017314D01*
Y1010567D01*
X7672709Y1006068D01*
X7665961Y1003819D01*
X7656964D01*
X7650217Y1006068D01*
X7645718Y1010567D01*
X7687779Y1035308D02*
Y1012816D01*
X7690028Y1006068D01*
X7694526Y1003819D01*
X7701274D01*
X7705773Y1006068D01*
X7712520Y1012816D01*
Y1035308D02*
Y1003819D01*
X7724891Y1051053D02*
Y1003819D01*
Y1028561D02*
X7729390Y1033059D01*
X7733888Y1035308D01*
X7740636D01*
X7745134Y1033059D01*
X7749633Y1028561D01*
X7751882Y1021813D01*
Y1017314D01*
X7749633Y1010567D01*
X7745134Y1006068D01*
X7740636Y1003819D01*
X7733888D01*
X7729390Y1006068D01*
X7724891Y1010567D01*
X7799116Y1051053D02*
Y1003819D01*
Y1051053D02*
X7828356D01*
X7799116Y1028561D02*
X7817110D01*
X7833754Y1021813D02*
X7860745D01*
Y1026311D01*
X7858496Y1030810D01*
X7856247Y1033059D01*
X7851748Y1035308D01*
X7845001D01*
X7840502Y1033059D01*
X7836003Y1028561D01*
X7833754Y1021813D01*
Y1017314D01*
X7836003Y1010567D01*
X7840502Y1006068D01*
X7845001Y1003819D01*
X7851748D01*
X7856247Y1006068D01*
X7860745Y1010567D01*
X7870867Y1035308D02*
Y1003819D01*
Y1026311D02*
X7877614Y1033059D01*
X7882113Y1035308D01*
X7888861D01*
X7893359Y1033059D01*
X7895608Y1026311D01*
Y1003819D01*
Y1026311D02*
X7902356Y1033059D01*
X7906855Y1035308D01*
X7913602D01*
X7918101Y1033059D01*
X7920350Y1026311D01*
Y1003819D01*
X7962186Y1035308D02*
Y1003819D01*
Y1028561D02*
X7957687Y1033059D01*
X7953189Y1035308D01*
X7946441D01*
X7941943Y1033059D01*
X7937444Y1028561D01*
X7935195Y1021813D01*
Y1017314D01*
X7937444Y1010567D01*
X7941943Y1006068D01*
X7946441Y1003819D01*
X7953189D01*
X7957687Y1006068D01*
X7962186Y1010567D01*
X7974782Y1051053D02*
Y1003819D01*
X7984678Y1021813D02*
X8011669D01*
Y1026311D01*
X8009420Y1030810D01*
X8007171Y1033059D01*
X8002672Y1035308D01*
X7995924D01*
X7991426Y1033059D01*
X7986927Y1028561D01*
X7984678Y1021813D01*
Y1017314D01*
X7986927Y1010567D01*
X7991426Y1006068D01*
X7995924Y1003819D01*
X8002672D01*
X8007171Y1006068D01*
X8011669Y1010567D01*
X6848666Y701342D02*
Y703591D01*
X6850916Y708090D01*
X6853165Y710339D01*
X6857663Y712588D01*
X6866660D01*
X6871159Y710339D01*
X6873408Y708090D01*
X6875657Y703591D01*
Y699093D01*
X6873408Y694595D01*
X6868910Y687847D01*
X6846417Y665354D01*
X6877907D01*
X6915469Y712588D02*
X6892976D01*
X6890727Y692345D01*
X6892976Y694595D01*
X6899724Y696844D01*
X6906472D01*
X6913220Y694595D01*
X6917718Y690096D01*
X6919967Y683348D01*
Y678850D01*
X6917718Y672102D01*
X6913220Y667604D01*
X6906472Y665354D01*
X6899724D01*
X6892976Y667604D01*
X6890727Y669853D01*
X6888478Y674351D01*
X8433031Y717371D02*
X8437530Y719620D01*
X8444278Y726368D01*
Y679134D01*
X8490162Y726368D02*
X8467670Y694879D01*
X8501408D01*
X8490162Y726368D02*
Y679134D01*
X8455669Y987056D02*
X8460168Y989305D01*
X8466915Y996053D01*
Y948819D01*
X6841496Y988040D02*
X6845994Y990289D01*
X6852742Y997037D01*
Y949803D01*
X6880633Y997037D02*
X6905374D01*
X6891879Y979043D01*
X6898627D01*
X6903125Y976794D01*
X6905374Y974545D01*
X6907624Y967797D01*
Y963299D01*
X6905374Y956551D01*
X6900876Y952052D01*
X6894128Y949803D01*
X6887381D01*
X6880633Y952052D01*
X6878383Y954302D01*
X6876134Y958800D01*
X10186147Y4110673D02*
Y4112922D01*
X10188396Y4117421D01*
X10190645Y4119670D01*
X10195144Y4121919D01*
X10204141D01*
X10208639Y4119670D01*
X10210888Y4117421D01*
X10213138Y4112922D01*
Y4108424D01*
X10210888Y4103925D01*
X10206390Y4097177D01*
X10183898Y4074685D01*
X10215387D01*
X10252949Y4121919D02*
X10230457D01*
X10228208Y4101676D01*
X10230457Y4103925D01*
X10237205Y4106174D01*
X10243952D01*
X10250700Y4103925D01*
X10255199Y4099427D01*
X10257448Y4092679D01*
Y4088180D01*
X10255199Y4081433D01*
X10250700Y4076934D01*
X10243952Y4074685D01*
X10237205D01*
X10230457Y4076934D01*
X10228208Y4079184D01*
X10225958Y4083682D01*
X10305131Y4121919D02*
Y4074685D01*
Y4121919D02*
X10320876D01*
X10327624Y4119670D01*
X10332122Y4115171D01*
X10334372Y4110673D01*
X10336621Y4103925D01*
Y4092679D01*
X10334372Y4085931D01*
X10332122Y4081433D01*
X10327624Y4076934D01*
X10320876Y4074685D01*
X10305131D01*
X10347192Y4094928D02*
X10387678D01*
X10433113Y4115171D02*
X10428614Y4119670D01*
X10421867Y4121919D01*
X10412870D01*
X10406122Y4119670D01*
X10401624Y4115171D01*
Y4110673D01*
X10403873Y4106174D01*
X10406122Y4103925D01*
X10410621Y4101676D01*
X10424116Y4097177D01*
X10428614Y4094928D01*
X10430864Y4092679D01*
X10433113Y4088180D01*
Y4081433D01*
X10428614Y4076934D01*
X10421867Y4074685D01*
X10412870D01*
X10406122Y4076934D01*
X10401624Y4081433D01*
X10443684Y4106174D02*
Y4083682D01*
X10445934Y4076934D01*
X10450432Y4074685D01*
X10457180D01*
X10461678Y4076934D01*
X10468426Y4083682D01*
Y4106174D02*
Y4074685D01*
X10480797Y4121919D02*
Y4074685D01*
Y4099427D02*
X10485295Y4103925D01*
X10489794Y4106174D01*
X10496541D01*
X10501040Y4103925D01*
X10505538Y4099427D01*
X10507788Y4092679D01*
Y4088180D01*
X10505538Y4081433D01*
X10501040Y4076934D01*
X10496541Y4074685D01*
X10489794D01*
X10485295Y4076934D01*
X10480797Y4081433D01*
X10555022Y4121919D02*
Y4074685D01*
Y4121919D02*
X10584262D01*
X10555022Y4099427D02*
X10573015D01*
X10589660Y4092679D02*
X10616651D01*
Y4097177D01*
X10614401Y4101676D01*
X10612152Y4103925D01*
X10607654Y4106174D01*
X10600906D01*
X10596408Y4103925D01*
X10591909Y4099427D01*
X10589660Y4092679D01*
Y4088180D01*
X10591909Y4081433D01*
X10596408Y4076934D01*
X10600906Y4074685D01*
X10607654D01*
X10612152Y4076934D01*
X10616651Y4081433D01*
X10626772Y4106174D02*
Y4074685D01*
Y4097177D02*
X10633520Y4103925D01*
X10638019Y4106174D01*
X10644766D01*
X10649265Y4103925D01*
X10651514Y4097177D01*
Y4074685D01*
Y4097177D02*
X10658262Y4103925D01*
X10662760Y4106174D01*
X10669508D01*
X10674006Y4103925D01*
X10676255Y4097177D01*
Y4074685D01*
X10718091Y4106174D02*
Y4074685D01*
Y4099427D02*
X10713593Y4103925D01*
X10709094Y4106174D01*
X10702347D01*
X10697848Y4103925D01*
X10693350Y4099427D01*
X10691101Y4092679D01*
Y4088180D01*
X10693350Y4081433D01*
X10697848Y4076934D01*
X10702347Y4074685D01*
X10709094D01*
X10713593Y4076934D01*
X10718091Y4081433D01*
X10730687Y4121919D02*
Y4074685D01*
X10740584Y4092679D02*
X10767575D01*
Y4097177D01*
X10765325Y4101676D01*
X10763076Y4103925D01*
X10758578Y4106174D01*
X10751830D01*
X10747331Y4103925D01*
X10742833Y4099427D01*
X10740584Y4092679D01*
Y4088180D01*
X10742833Y4081433D01*
X10747331Y4076934D01*
X10751830Y4074685D01*
X10758578D01*
X10763076Y4076934D01*
X10767575Y4081433D01*
X9604572Y3772208D02*
Y3774457D01*
X9606821Y3778956D01*
X9609070Y3781205D01*
X9613569Y3783454D01*
X9622566D01*
X9627064Y3781205D01*
X9629314Y3778956D01*
X9631563Y3774457D01*
Y3769959D01*
X9629314Y3765461D01*
X9624815Y3758713D01*
X9602323Y3736220D01*
X9633812D01*
X9671374Y3783454D02*
X9648882D01*
X9646633Y3763211D01*
X9648882Y3765461D01*
X9655630Y3767710D01*
X9662377D01*
X9669125Y3765461D01*
X9673624Y3760962D01*
X9675873Y3754214D01*
Y3749716D01*
X9673624Y3742968D01*
X9669125Y3738470D01*
X9662377Y3736220D01*
X9655630D01*
X9648882Y3738470D01*
X9646633Y3740719D01*
X9644383Y3745217D01*
X11188937Y3788237D02*
X11193435Y3790486D01*
X11200183Y3797234D01*
Y3750000D01*
X11246068Y3797234D02*
X11223575Y3765745D01*
X11257314D01*
X11246068Y3797234D02*
Y3750000D01*
X11211575Y4057922D02*
X11216073Y4060171D01*
X11222821Y4066919D01*
Y4019685D01*
X9597402Y4058906D02*
X9601900Y4061156D01*
X9608648Y4067903D01*
Y4020669D01*
X9636538Y4067903D02*
X9661280D01*
X9647785Y4049909D01*
X9654532D01*
X9659031Y4047660D01*
X9661280Y4045411D01*
X9663529Y4038663D01*
Y4034165D01*
X9661280Y4027417D01*
X9656781Y4022919D01*
X9650034Y4020669D01*
X9643286D01*
X9636538Y4022919D01*
X9634289Y4025168D01*
X9632040Y4029666D01*
X10186147Y2575240D02*
Y2577489D01*
X10188396Y2581987D01*
X10190645Y2584237D01*
X10195144Y2586486D01*
X10204141D01*
X10208639Y2584237D01*
X10210888Y2581987D01*
X10213138Y2577489D01*
Y2572990D01*
X10210888Y2568492D01*
X10206390Y2561744D01*
X10183898Y2539252D01*
X10215387D01*
X10252949Y2586486D02*
X10230457D01*
X10228208Y2566243D01*
X10230457Y2568492D01*
X10237205Y2570741D01*
X10243952D01*
X10250700Y2568492D01*
X10255199Y2563994D01*
X10257448Y2557246D01*
Y2552747D01*
X10255199Y2546000D01*
X10250700Y2541501D01*
X10243952Y2539252D01*
X10237205D01*
X10230457Y2541501D01*
X10228208Y2543750D01*
X10225958Y2548249D01*
X10305131Y2586486D02*
Y2539252D01*
Y2586486D02*
X10320876D01*
X10327624Y2584237D01*
X10332122Y2579738D01*
X10334372Y2575240D01*
X10336621Y2568492D01*
Y2557246D01*
X10334372Y2550498D01*
X10332122Y2546000D01*
X10327624Y2541501D01*
X10320876Y2539252D01*
X10305131D01*
X10347192Y2559495D02*
X10387678D01*
X10433113Y2579738D02*
X10428614Y2584237D01*
X10421867Y2586486D01*
X10412870D01*
X10406122Y2584237D01*
X10401624Y2579738D01*
Y2575240D01*
X10403873Y2570741D01*
X10406122Y2568492D01*
X10410621Y2566243D01*
X10424116Y2561744D01*
X10428614Y2559495D01*
X10430864Y2557246D01*
X10433113Y2552747D01*
Y2546000D01*
X10428614Y2541501D01*
X10421867Y2539252D01*
X10412870D01*
X10406122Y2541501D01*
X10401624Y2546000D01*
X10443684Y2570741D02*
Y2548249D01*
X10445934Y2541501D01*
X10450432Y2539252D01*
X10457180D01*
X10461678Y2541501D01*
X10468426Y2548249D01*
Y2570741D02*
Y2539252D01*
X10480797Y2586486D02*
Y2539252D01*
Y2563994D02*
X10485295Y2568492D01*
X10489794Y2570741D01*
X10496541D01*
X10501040Y2568492D01*
X10505538Y2563994D01*
X10507788Y2557246D01*
Y2552747D01*
X10505538Y2546000D01*
X10501040Y2541501D01*
X10496541Y2539252D01*
X10489794D01*
X10485295Y2541501D01*
X10480797Y2546000D01*
X10555022Y2586486D02*
Y2539252D01*
Y2586486D02*
X10584262D01*
X10555022Y2563994D02*
X10573015D01*
X10589660Y2557246D02*
X10616651D01*
Y2561744D01*
X10614401Y2566243D01*
X10612152Y2568492D01*
X10607654Y2570741D01*
X10600906D01*
X10596408Y2568492D01*
X10591909Y2563994D01*
X10589660Y2557246D01*
Y2552747D01*
X10591909Y2546000D01*
X10596408Y2541501D01*
X10600906Y2539252D01*
X10607654D01*
X10612152Y2541501D01*
X10616651Y2546000D01*
X10626772Y2570741D02*
Y2539252D01*
Y2561744D02*
X10633520Y2568492D01*
X10638019Y2570741D01*
X10644766D01*
X10649265Y2568492D01*
X10651514Y2561744D01*
Y2539252D01*
Y2561744D02*
X10658262Y2568492D01*
X10662760Y2570741D01*
X10669508D01*
X10674006Y2568492D01*
X10676255Y2561744D01*
Y2539252D01*
X10718091Y2570741D02*
Y2539252D01*
Y2563994D02*
X10713593Y2568492D01*
X10709094Y2570741D01*
X10702347D01*
X10697848Y2568492D01*
X10693350Y2563994D01*
X10691101Y2557246D01*
Y2552747D01*
X10693350Y2546000D01*
X10697848Y2541501D01*
X10702347Y2539252D01*
X10709094D01*
X10713593Y2541501D01*
X10718091Y2546000D01*
X10730687Y2586486D02*
Y2539252D01*
X10740584Y2557246D02*
X10767575D01*
Y2561744D01*
X10765325Y2566243D01*
X10763076Y2568492D01*
X10758578Y2570741D01*
X10751830D01*
X10747331Y2568492D01*
X10742833Y2563994D01*
X10740584Y2557246D01*
Y2552747D01*
X10742833Y2546000D01*
X10747331Y2541501D01*
X10751830Y2539252D01*
X10758578D01*
X10763076Y2541501D01*
X10767575Y2546000D01*
X9604572Y2236775D02*
Y2239024D01*
X9606821Y2243523D01*
X9609070Y2245772D01*
X9613569Y2248021D01*
X9622566D01*
X9627064Y2245772D01*
X9629314Y2243523D01*
X9631563Y2239024D01*
Y2234526D01*
X9629314Y2230028D01*
X9624815Y2223280D01*
X9602323Y2200787D01*
X9633812D01*
X9671374Y2248021D02*
X9648882D01*
X9646633Y2227778D01*
X9648882Y2230028D01*
X9655630Y2232277D01*
X9662377D01*
X9669125Y2230028D01*
X9673624Y2225529D01*
X9675873Y2218781D01*
Y2214283D01*
X9673624Y2207535D01*
X9669125Y2203037D01*
X9662377Y2200787D01*
X9655630D01*
X9648882Y2203037D01*
X9646633Y2205286D01*
X9644383Y2209784D01*
X11188937Y2252804D02*
X11193435Y2255053D01*
X11200183Y2261801D01*
Y2214567D01*
X11246068Y2261801D02*
X11223575Y2230312D01*
X11257314D01*
X11246068Y2261801D02*
Y2214567D01*
X11211575Y2522489D02*
X11216073Y2524738D01*
X11222821Y2531486D01*
Y2484252D01*
X9597402Y2523473D02*
X9601900Y2525722D01*
X9608648Y2532470D01*
Y2485236D01*
X9636538Y2532470D02*
X9661280D01*
X9647785Y2514476D01*
X9654532D01*
X9659031Y2512227D01*
X9661280Y2509978D01*
X9663529Y2503230D01*
Y2498732D01*
X9661280Y2491984D01*
X9656781Y2487485D01*
X9650034Y2485236D01*
X9643286D01*
X9636538Y2487485D01*
X9634289Y2489735D01*
X9632040Y2494233D01*
X13421141Y4267717D02*
X13436883D01*
X13429012D01*
Y4314945D01*
X13421141Y4307074D01*
X15251849Y4189948D02*
X15259721Y4197819D01*
X15275464D01*
X15283335Y4189948D01*
Y4182077D01*
X15275464Y4174205D01*
X15267592D01*
X15275464D01*
X15283335Y4166333D01*
Y4158462D01*
X15275464Y4150591D01*
X15259721D01*
X15251849Y4158462D01*
X15299078Y4189948D02*
X15306950Y4197819D01*
X15322692D01*
X15330564Y4189948D01*
Y4182077D01*
X15322692Y4174205D01*
X15314821D01*
X15322692D01*
X15330564Y4166333D01*
Y4158462D01*
X15322692Y4150591D01*
X15306950D01*
X15299078Y4158462D01*
X15335501Y4084630D02*
X15304015D01*
Y4061016D01*
X15319757Y4068887D01*
X15327629D01*
X15335501Y4061016D01*
Y4045273D01*
X15327629Y4037402D01*
X15311886D01*
X15304015Y4045273D01*
X15351243Y4076759D02*
X15359115Y4084630D01*
X15374858D01*
X15382729Y4076759D01*
Y4045273D01*
X15374858Y4037402D01*
X15359115D01*
X15351243Y4045273D01*
Y4076759D01*
X13370353Y4072428D02*
X13378225Y4080300D01*
X13393968D01*
X13401839Y4072428D01*
Y4064557D01*
X13393968Y4056685D01*
X13386096D01*
X13393968D01*
X13401839Y4048814D01*
Y4040942D01*
X13393968Y4033071D01*
X13378225D01*
X13370353Y4040942D01*
X13441196Y4033071D02*
Y4080300D01*
X13417582Y4056685D01*
X13449068D01*
X13384723Y4151575D02*
X13400466D01*
X13392595D01*
Y4198804D01*
X13384723Y4190932D01*
X13424081D02*
X13431952Y4198804D01*
X13447695D01*
X13455567Y4190932D01*
Y4183061D01*
X13447695Y4175189D01*
X13455567Y4167318D01*
Y4159446D01*
X13447695Y4151575D01*
X13431952D01*
X13424081Y4159446D01*
Y4167318D01*
X13431952Y4175189D01*
X13424081Y4183061D01*
Y4190932D01*
X13431952Y4175189D02*
X13447695D01*
X14084824Y4466407D02*
X14062332D01*
X14060083Y4446164D01*
X14062332Y4448413D01*
X14069080Y4450663D01*
X14075827D01*
X14082575Y4448413D01*
X14087074Y4443915D01*
X14089323Y4437167D01*
Y4432669D01*
X14087074Y4425921D01*
X14082575Y4421422D01*
X14075827Y4419173D01*
X14069080D01*
X14062332Y4421422D01*
X14060083Y4423672D01*
X14057834Y4428170D01*
X14113390Y4466407D02*
X14106642Y4464158D01*
X14102144Y4457410D01*
X14099894Y4446164D01*
Y4439416D01*
X14102144Y4428170D01*
X14106642Y4421422D01*
X14113390Y4419173D01*
X14117888D01*
X14124636Y4421422D01*
X14129134Y4428170D01*
X14131384Y4439416D01*
Y4446164D01*
X14129134Y4457410D01*
X14124636Y4464158D01*
X14117888Y4466407D01*
X14113390D01*
X14179067D02*
Y4419173D01*
Y4466407D02*
X14194812D01*
X14201560Y4464158D01*
X14206058Y4459659D01*
X14208308Y4455161D01*
X14210557Y4448413D01*
Y4437167D01*
X14208308Y4430419D01*
X14206058Y4425921D01*
X14201560Y4421422D01*
X14194812Y4419173D01*
X14179067D01*
X14221128Y4439416D02*
X14261614D01*
X14307049Y4459659D02*
X14302550Y4464158D01*
X14295803Y4466407D01*
X14286806D01*
X14280058Y4464158D01*
X14275560Y4459659D01*
Y4455161D01*
X14277809Y4450663D01*
X14280058Y4448413D01*
X14284557Y4446164D01*
X14298052Y4441666D01*
X14302550Y4439416D01*
X14304800Y4437167D01*
X14307049Y4432669D01*
Y4425921D01*
X14302550Y4421422D01*
X14295803Y4419173D01*
X14286806D01*
X14280058Y4421422D01*
X14275560Y4425921D01*
X14317620Y4450663D02*
Y4428170D01*
X14319870Y4421422D01*
X14324368Y4419173D01*
X14331116D01*
X14335614Y4421422D01*
X14342362Y4428170D01*
Y4450663D02*
Y4419173D01*
X14354733Y4466407D02*
Y4419173D01*
Y4443915D02*
X14359231Y4448413D01*
X14363730Y4450663D01*
X14370477D01*
X14374976Y4448413D01*
X14379474Y4443915D01*
X14381724Y4437167D01*
Y4432669D01*
X14379474Y4425921D01*
X14374976Y4421422D01*
X14370477Y4419173D01*
X14363730D01*
X14359231Y4421422D01*
X14354733Y4425921D01*
X14428958Y4466407D02*
Y4419173D01*
Y4466407D02*
X14446951Y4419173D01*
X14464945Y4466407D02*
X14446951Y4419173D01*
X14464945Y4466407D02*
Y4419173D01*
X14505432Y4450663D02*
Y4419173D01*
Y4443915D02*
X14500933Y4448413D01*
X14496435Y4450663D01*
X14489687D01*
X14485188Y4448413D01*
X14480690Y4443915D01*
X14478441Y4437167D01*
Y4432669D01*
X14480690Y4425921D01*
X14485188Y4421422D01*
X14489687Y4419173D01*
X14496435D01*
X14500933Y4421422D01*
X14505432Y4425921D01*
X14518027Y4466407D02*
Y4419173D01*
X14527924Y4437167D02*
X14554915D01*
Y4441666D01*
X14552665Y4446164D01*
X14550416Y4448413D01*
X14545918Y4450663D01*
X14539170D01*
X14534672Y4448413D01*
X14530173Y4443915D01*
X14527924Y4437167D01*
Y4432669D01*
X14530173Y4425921D01*
X14534672Y4421422D01*
X14539170Y4419173D01*
X14545918D01*
X14550416Y4421422D01*
X14554915Y4425921D01*
X15307361Y4261811D02*
X15323104D01*
X15315233D01*
Y4309040D01*
X15307361Y4301168D01*
X15346719Y4309040D02*
X15378204D01*
Y4301168D01*
X15346719Y4269682D01*
Y4261811D01*
X13421142Y1787402D02*
X13436885D01*
X13429013D01*
Y1834630D01*
X13421142Y1826759D01*
X15251850Y1709633D02*
X15259722Y1717504D01*
X15275465D01*
X15283336Y1709633D01*
Y1701762D01*
X15275465Y1693890D01*
X15267593D01*
X15275465D01*
X15283336Y1686018D01*
Y1678147D01*
X15275465Y1670276D01*
X15259722D01*
X15251850Y1678147D01*
X15299079Y1709633D02*
X15306951Y1717504D01*
X15322694D01*
X15330565Y1709633D01*
Y1701762D01*
X15322694Y1693890D01*
X15314822D01*
X15322694D01*
X15330565Y1686018D01*
Y1678147D01*
X15322694Y1670276D01*
X15306951D01*
X15299079Y1678147D01*
X15335502Y1604315D02*
X15304016D01*
Y1580701D01*
X15319759Y1588572D01*
X15327630D01*
X15335502Y1580701D01*
Y1564958D01*
X15327630Y1557087D01*
X15311887D01*
X15304016Y1564958D01*
X15351245Y1596444D02*
X15359116Y1604315D01*
X15374859D01*
X15382730Y1596444D01*
Y1564958D01*
X15374859Y1557087D01*
X15359116D01*
X15351245Y1564958D01*
Y1596444D01*
X13370354Y1592113D02*
X13378226Y1599985D01*
X13393969D01*
X13401840Y1592113D01*
Y1584242D01*
X13393969Y1576370D01*
X13386097D01*
X13393969D01*
X13401840Y1568499D01*
Y1560627D01*
X13393969Y1552756D01*
X13378226D01*
X13370354Y1560627D01*
X13441198Y1552756D02*
Y1599985D01*
X13417583Y1576370D01*
X13449069D01*
X13384724Y1671260D02*
X13400467D01*
X13392596D01*
Y1718489D01*
X13384724Y1710617D01*
X13424082D02*
X13431953Y1718489D01*
X13447696D01*
X13455568Y1710617D01*
Y1702746D01*
X13447696Y1694874D01*
X13455568Y1687003D01*
Y1679131D01*
X13447696Y1671260D01*
X13431953D01*
X13424082Y1679131D01*
Y1687003D01*
X13431953Y1694874D01*
X13424082Y1702746D01*
Y1710617D01*
X13431953Y1694874D02*
X13447696D01*
X14084826Y1986092D02*
X14062333D01*
X14060084Y1965849D01*
X14062333Y1968098D01*
X14069081Y1970348D01*
X14075829D01*
X14082576Y1968098D01*
X14087075Y1963600D01*
X14089324Y1956852D01*
Y1952354D01*
X14087075Y1945606D01*
X14082576Y1941107D01*
X14075829Y1938858D01*
X14069081D01*
X14062333Y1941107D01*
X14060084Y1943357D01*
X14057835Y1947855D01*
X14113391Y1986092D02*
X14106643Y1983843D01*
X14102145Y1977095D01*
X14099895Y1965849D01*
Y1959101D01*
X14102145Y1947855D01*
X14106643Y1941107D01*
X14113391Y1938858D01*
X14117889D01*
X14124637Y1941107D01*
X14129136Y1947855D01*
X14131385Y1959101D01*
Y1965849D01*
X14129136Y1977095D01*
X14124637Y1983843D01*
X14117889Y1986092D01*
X14113391D01*
X14179068D02*
Y1938858D01*
Y1986092D02*
X14194813D01*
X14201561Y1983843D01*
X14206059Y1979344D01*
X14208309Y1974846D01*
X14210558Y1968098D01*
Y1956852D01*
X14208309Y1950104D01*
X14206059Y1945606D01*
X14201561Y1941107D01*
X14194813Y1938858D01*
X14179068D01*
X14221129Y1959101D02*
X14261615D01*
X14307050Y1979344D02*
X14302551Y1983843D01*
X14295804Y1986092D01*
X14286807D01*
X14280059Y1983843D01*
X14275561Y1979344D01*
Y1974846D01*
X14277810Y1970348D01*
X14280059Y1968098D01*
X14284558Y1965849D01*
X14298053Y1961351D01*
X14302551Y1959101D01*
X14304801Y1956852D01*
X14307050Y1952354D01*
Y1945606D01*
X14302551Y1941107D01*
X14295804Y1938858D01*
X14286807D01*
X14280059Y1941107D01*
X14275561Y1945606D01*
X14317621Y1970348D02*
Y1947855D01*
X14319871Y1941107D01*
X14324369Y1938858D01*
X14331117D01*
X14335615Y1941107D01*
X14342363Y1947855D01*
Y1970348D02*
Y1938858D01*
X14354734Y1986092D02*
Y1938858D01*
Y1963600D02*
X14359232Y1968098D01*
X14363731Y1970348D01*
X14370478D01*
X14374977Y1968098D01*
X14379475Y1963600D01*
X14381725Y1956852D01*
Y1952354D01*
X14379475Y1945606D01*
X14374977Y1941107D01*
X14370478Y1938858D01*
X14363731D01*
X14359232Y1941107D01*
X14354734Y1945606D01*
X14428959Y1986092D02*
Y1938858D01*
Y1986092D02*
X14446952Y1938858D01*
X14464946Y1986092D02*
X14446952Y1938858D01*
X14464946Y1986092D02*
Y1938858D01*
X14505433Y1970348D02*
Y1938858D01*
Y1963600D02*
X14500934Y1968098D01*
X14496436Y1970348D01*
X14489688D01*
X14485190Y1968098D01*
X14480691Y1963600D01*
X14478442Y1956852D01*
Y1952354D01*
X14480691Y1945606D01*
X14485190Y1941107D01*
X14489688Y1938858D01*
X14496436D01*
X14500934Y1941107D01*
X14505433Y1945606D01*
X14518028Y1986092D02*
Y1938858D01*
X14527925Y1956852D02*
X14554916D01*
Y1961351D01*
X14552667Y1965849D01*
X14550417Y1968098D01*
X14545919Y1970348D01*
X14539171D01*
X14534673Y1968098D01*
X14530174Y1963600D01*
X14527925Y1956852D01*
Y1952354D01*
X14530174Y1945606D01*
X14534673Y1941107D01*
X14539171Y1938858D01*
X14545919D01*
X14550417Y1941107D01*
X14554916Y1945606D01*
X15307362Y1781496D02*
X15323105D01*
X15315234D01*
Y1828725D01*
X15307362Y1820853D01*
X15346720Y1828725D02*
X15378206D01*
Y1820853D01*
X15346720Y1789368D01*
Y1781496D01*
X13421142Y3047244D02*
X13436885D01*
X13429013D01*
Y3094473D01*
X13421142Y3086602D01*
X15251850Y2969476D02*
X15259722Y2977347D01*
X15275465D01*
X15283336Y2969476D01*
Y2961604D01*
X15275465Y2953733D01*
X15267593D01*
X15275465D01*
X15283336Y2945861D01*
Y2937990D01*
X15275465Y2930118D01*
X15259722D01*
X15251850Y2937990D01*
X15299079Y2969476D02*
X15306951Y2977347D01*
X15322694D01*
X15330565Y2969476D01*
Y2961604D01*
X15322694Y2953733D01*
X15314822D01*
X15322694D01*
X15330565Y2945861D01*
Y2937990D01*
X15322694Y2930118D01*
X15306951D01*
X15299079Y2937990D01*
X15335502Y2864158D02*
X15304016D01*
Y2840544D01*
X15319759Y2848415D01*
X15327630D01*
X15335502Y2840544D01*
Y2824801D01*
X15327630Y2816929D01*
X15311887D01*
X15304016Y2824801D01*
X15351245Y2856287D02*
X15359116Y2864158D01*
X15374859D01*
X15382730Y2856287D01*
Y2824801D01*
X15374859Y2816929D01*
X15359116D01*
X15351245Y2824801D01*
Y2856287D01*
X13370354Y2851956D02*
X13378226Y2859827D01*
X13393969D01*
X13401840Y2851956D01*
Y2844084D01*
X13393969Y2836213D01*
X13386097D01*
X13393969D01*
X13401840Y2828341D01*
Y2820470D01*
X13393969Y2812598D01*
X13378226D01*
X13370354Y2820470D01*
X13441198Y2812598D02*
Y2859827D01*
X13417583Y2836213D01*
X13449069D01*
X13384724Y2931102D02*
X13400467D01*
X13392596D01*
Y2978331D01*
X13384724Y2970460D01*
X13424082D02*
X13431953Y2978331D01*
X13447696D01*
X13455568Y2970460D01*
Y2962588D01*
X13447696Y2954717D01*
X13455568Y2946845D01*
Y2938974D01*
X13447696Y2931102D01*
X13431953D01*
X13424082Y2938974D01*
Y2946845D01*
X13431953Y2954717D01*
X13424082Y2962588D01*
Y2970460D01*
X13431953Y2954717D02*
X13447696D01*
X14084826Y3245935D02*
X14062333D01*
X14060084Y3225691D01*
X14062333Y3227941D01*
X14069081Y3230190D01*
X14075829D01*
X14082576Y3227941D01*
X14087075Y3223442D01*
X14089324Y3216695D01*
Y3212196D01*
X14087075Y3205448D01*
X14082576Y3200950D01*
X14075829Y3198701D01*
X14069081D01*
X14062333Y3200950D01*
X14060084Y3203199D01*
X14057835Y3207698D01*
X14113391Y3245935D02*
X14106643Y3243685D01*
X14102145Y3236938D01*
X14099895Y3225691D01*
Y3218944D01*
X14102145Y3207698D01*
X14106643Y3200950D01*
X14113391Y3198701D01*
X14117889D01*
X14124637Y3200950D01*
X14129136Y3207698D01*
X14131385Y3218944D01*
Y3225691D01*
X14129136Y3236938D01*
X14124637Y3243685D01*
X14117889Y3245935D01*
X14113391D01*
X14179068D02*
Y3198701D01*
Y3245935D02*
X14194813D01*
X14201561Y3243685D01*
X14206059Y3239187D01*
X14208309Y3234689D01*
X14210558Y3227941D01*
Y3216695D01*
X14208309Y3209947D01*
X14206059Y3205448D01*
X14201561Y3200950D01*
X14194813Y3198701D01*
X14179068D01*
X14221129Y3218944D02*
X14261615D01*
X14307050Y3239187D02*
X14302551Y3243685D01*
X14295804Y3245935D01*
X14286807D01*
X14280059Y3243685D01*
X14275561Y3239187D01*
Y3234689D01*
X14277810Y3230190D01*
X14280059Y3227941D01*
X14284558Y3225691D01*
X14298053Y3221193D01*
X14302551Y3218944D01*
X14304801Y3216695D01*
X14307050Y3212196D01*
Y3205448D01*
X14302551Y3200950D01*
X14295804Y3198701D01*
X14286807D01*
X14280059Y3200950D01*
X14275561Y3205448D01*
X14317621Y3230190D02*
Y3207698D01*
X14319871Y3200950D01*
X14324369Y3198701D01*
X14331117D01*
X14335615Y3200950D01*
X14342363Y3207698D01*
Y3230190D02*
Y3198701D01*
X14354734Y3245935D02*
Y3198701D01*
Y3223442D02*
X14359232Y3227941D01*
X14363731Y3230190D01*
X14370478D01*
X14374977Y3227941D01*
X14379475Y3223442D01*
X14381725Y3216695D01*
Y3212196D01*
X14379475Y3205448D01*
X14374977Y3200950D01*
X14370478Y3198701D01*
X14363731D01*
X14359232Y3200950D01*
X14354734Y3205448D01*
X14428959Y3245935D02*
Y3198701D01*
Y3245935D02*
X14446952Y3198701D01*
X14464946Y3245935D02*
X14446952Y3198701D01*
X14464946Y3245935D02*
Y3198701D01*
X14505433Y3230190D02*
Y3198701D01*
Y3223442D02*
X14500934Y3227941D01*
X14496436Y3230190D01*
X14489688D01*
X14485190Y3227941D01*
X14480691Y3223442D01*
X14478442Y3216695D01*
Y3212196D01*
X14480691Y3205448D01*
X14485190Y3200950D01*
X14489688Y3198701D01*
X14496436D01*
X14500934Y3200950D01*
X14505433Y3205448D01*
X14518028Y3245935D02*
Y3198701D01*
X14527925Y3216695D02*
X14554916D01*
Y3221193D01*
X14552667Y3225691D01*
X14550417Y3227941D01*
X14545919Y3230190D01*
X14539171D01*
X14534673Y3227941D01*
X14530174Y3223442D01*
X14527925Y3216695D01*
Y3212196D01*
X14530174Y3205448D01*
X14534673Y3200950D01*
X14539171Y3198701D01*
X14545919D01*
X14550417Y3200950D01*
X14554916Y3205448D01*
X15307362Y3041338D02*
X15323105D01*
X15315234D01*
Y3088567D01*
X15307362Y3080696D01*
X15346720Y3088567D02*
X15378206D01*
Y3080696D01*
X15346720Y3049210D01*
Y3041338D01*
D24*
X16089134Y1103953D02*
G03*
X16089134Y1264552I-86534J80300D01*
G01*
X16100960Y1099440D02*
G03*
X16100945Y1269058I-98473J84800D01*
G01*
X16089134Y903952D02*
G03*
X16089134Y1064552I-86534J80300D01*
G01*
X16100945Y899446D02*
G03*
X16100960Y1069064I-98457J84818D01*
G01*
X15957542Y1211811D02*
G03*
X16053009Y1211811I47734J-27559D01*
G01*
X16060394Y984252D02*
G03*
X16060394Y984252I-55118J0D01*
G01*
X15640827Y128740D02*
G03*
X15699883Y187795I0J59055D01*
G01*
X15699883Y678347D02*
G03*
X15640827Y737402I-59055J0D01*
G01*
X13108936Y737402D02*
G03*
X13049881Y678347I0J-59055D01*
G01*
X13049881Y187795D02*
G03*
X13108936Y128740I59055J0D01*
G01*
X13260708Y433071D02*
G03*
X13260708Y433071I-88583J0D01*
G01*
X15666221D02*
G03*
X15666221Y433071I-88583J0D01*
G01*
X15432280Y527429D02*
G03*
X15312087Y670669I-120193J21193D01*
G01*
X15271337Y195472D02*
G03*
X15391531Y296326I0J122047D01*
G01*
X13437677Y670669D02*
G03*
X13317484Y527429I0J-122047D01*
G01*
X13358233Y296326D02*
G03*
X13478426Y195472I120193J21193D01*
G01*
X15271337Y215157D02*
G03*
X15372145Y299745I0J102362D01*
G01*
X13377619D02*
G03*
X13478426Y215157I100807J17775D01*
G01*
X13437677Y650984D02*
G03*
X13336870Y530847I0J-102362D01*
G01*
X15412894D02*
G03*
X15312087Y650984I-100807J17775D01*
G01*
X11186458Y866570D02*
G03*
X11089528Y982087I-96930J17091D01*
G01*
X11069466Y671457D02*
G03*
X11166396Y752790I0J98425D01*
G01*
X9699667D02*
G03*
X9796597Y671457I96930J17091D01*
G01*
X9776535Y982087D02*
G03*
X9679605Y866570I0J-98425D01*
G01*
X11447599Y826772D02*
G03*
X11447599Y826772I-88583J0D01*
G01*
X9595629D02*
G03*
X9595629Y826772I-88583J0D01*
G01*
X9734169Y758943D02*
G03*
X9796204Y706890I62035J10938D01*
G01*
X11069859D02*
G03*
X11131894Y758943I0J62992D01*
G01*
X11151957Y872723D02*
G03*
X11089922Y946654I-62035J10938D01*
G01*
X9776141D02*
G03*
X9714106Y872723I0J-62992D01*
G01*
X9381653Y639764D02*
G03*
X9444645Y576771I62992J0D01*
G01*
X11421418D02*
G03*
X11484410Y639764I0J62992D01*
G01*
Y1013780D02*
G03*
X11421418Y1076772I-62992J0D01*
G01*
X9444645D02*
G03*
X9381653Y1013780I0J-62992D01*
G01*
X2131340Y3937436D02*
G03*
X2034410Y4052953I-96930J17091D01*
G01*
X2014347Y3742323D02*
G03*
X2111277Y3823657I0J98425D01*
G01*
X644549D02*
G03*
X741479Y3742323I96930J17091D01*
G01*
X721417Y4052953D02*
G03*
X624487Y3937436I0J-98425D01*
G01*
X2392481Y3897638D02*
G03*
X2392481Y3897638I-88583J0D01*
G01*
X540511D02*
G03*
X540511Y3897638I-88583J0D01*
G01*
X679050Y3829809D02*
G03*
X741086Y3777756I62035J10938D01*
G01*
X2014741D02*
G03*
X2076776Y3829809I0J62992D01*
G01*
X2096839Y3943589D02*
G03*
X2034803Y4017520I-62035J10938D01*
G01*
X721023D02*
G03*
X658988Y3943589I0J-62992D01*
G01*
X326535Y3710630D02*
G03*
X389527Y3647638I62992J0D01*
G01*
X2366300D02*
G03*
X2429292Y3710630I0J62992D01*
G01*
Y4084646D02*
G03*
X2366300Y4147638I-62992J0D01*
G01*
X389527D02*
G03*
X326535Y4084646I0J-62992D01*
G01*
X2131340Y2402003D02*
G03*
X2034410Y2517520I-96930J17091D01*
G01*
X2014347Y2206890D02*
G03*
X2111277Y2288224I0J98425D01*
G01*
X644549D02*
G03*
X741479Y2206890I96930J17091D01*
G01*
X721417Y2517520D02*
G03*
X624487Y2402003I0J-98425D01*
G01*
X2392481Y2362205D02*
G03*
X2392481Y2362205I-88583J0D01*
G01*
X540511D02*
G03*
X540511Y2362205I-88583J0D01*
G01*
X679050Y2294376D02*
G03*
X741086Y2242323I62035J10938D01*
G01*
X2014741D02*
G03*
X2076776Y2294376I0J62992D01*
G01*
X2096839Y2408156D02*
G03*
X2034803Y2482087I-62035J10938D01*
G01*
X721023D02*
G03*
X658988Y2408156I0J-62992D01*
G01*
X326535Y2175197D02*
G03*
X389527Y2112204I62992J0D01*
G01*
X2366300D02*
G03*
X2429292Y2175197I0J62992D01*
G01*
Y2549213D02*
G03*
X2366300Y2612205I-62992J0D01*
G01*
X389527D02*
G03*
X326535Y2549213I0J-62992D01*
G01*
X2131340Y866570D02*
G03*
X2034410Y982087I-96930J17091D01*
G01*
X2014347Y671457D02*
G03*
X2111277Y752790I0J98425D01*
G01*
X644549D02*
G03*
X741479Y671457I96930J17091D01*
G01*
X721417Y982087D02*
G03*
X624487Y866570I0J-98425D01*
G01*
X2392481Y826772D02*
G03*
X2392481Y826772I-88583J0D01*
G01*
X540511D02*
G03*
X540511Y826772I-88583J0D01*
G01*
X679050Y758943D02*
G03*
X741086Y706890I62035J10938D01*
G01*
X2014741D02*
G03*
X2076776Y758943I0J62992D01*
G01*
X2096839Y872723D02*
G03*
X2034803Y946654I-62035J10938D01*
G01*
X721023D02*
G03*
X658988Y872723I0J-62992D01*
G01*
X326535Y639764D02*
G03*
X389527Y576771I62992J0D01*
G01*
X2366300D02*
G03*
X2429292Y639764I0J62992D01*
G01*
Y1013780D02*
G03*
X2366300Y1076772I-62992J0D01*
G01*
X389527D02*
G03*
X326535Y1013780I0J-62992D01*
G01*
X4887245Y3937436D02*
G03*
X4790315Y4052953I-96930J17091D01*
G01*
X4770253Y3742323D02*
G03*
X4867183Y3823657I0J98425D01*
G01*
X3400455D02*
G03*
X3497385Y3742323I96930J17091D01*
G01*
X3477323Y4052953D02*
G03*
X3380392Y3937436I0J-98425D01*
G01*
X5148386Y3897638D02*
G03*
X5148386Y3897638I-88583J0D01*
G01*
X3296417D02*
G03*
X3296417Y3897638I-88583J0D01*
G01*
X3434956Y3829809D02*
G03*
X3496991Y3777756I62035J10938D01*
G01*
X4770647D02*
G03*
X4832682Y3829809I0J62992D01*
G01*
X4852744Y3943589D02*
G03*
X4790709Y4017520I-62035J10938D01*
G01*
X3476929D02*
G03*
X3414894Y3943589I0J-62992D01*
G01*
X3082440Y3710630D02*
G03*
X3145432Y3647638I62992J0D01*
G01*
X5122205D02*
G03*
X5185198Y3710630I0J62992D01*
G01*
Y4084646D02*
G03*
X5122205Y4147638I-62992J0D01*
G01*
X3145432D02*
G03*
X3082440Y4084646I0J-62992D01*
G01*
X4887245Y2402003D02*
G03*
X4790315Y2517520I-96930J17091D01*
G01*
X4770253Y2206890D02*
G03*
X4867183Y2288224I0J98425D01*
G01*
X3400455D02*
G03*
X3497385Y2206890I96930J17091D01*
G01*
X3477323Y2517520D02*
G03*
X3380392Y2402003I0J-98425D01*
G01*
X5148386Y2362205D02*
G03*
X5148386Y2362205I-88583J0D01*
G01*
X3296417D02*
G03*
X3296417Y2362205I-88583J0D01*
G01*
X3434956Y2294376D02*
G03*
X3496991Y2242323I62035J10938D01*
G01*
X4770647D02*
G03*
X4832682Y2294376I0J62992D01*
G01*
X4852744Y2408156D02*
G03*
X4790709Y2482087I-62035J10938D01*
G01*
X3476929D02*
G03*
X3414894Y2408156I0J-62992D01*
G01*
X3082440Y2175197D02*
G03*
X3145432Y2112204I62992J0D01*
G01*
X5122205D02*
G03*
X5185198Y2175197I0J62992D01*
G01*
Y2549213D02*
G03*
X5122205Y2612205I-62992J0D01*
G01*
X3145432D02*
G03*
X3082440Y2549213I0J-62992D01*
G01*
X4887245Y866570D02*
G03*
X4790315Y982087I-96930J17091D01*
G01*
X4770253Y671457D02*
G03*
X4867183Y752790I0J98425D01*
G01*
X3400455D02*
G03*
X3497385Y671457I96930J17091D01*
G01*
X3477323Y982087D02*
G03*
X3380392Y866570I0J-98425D01*
G01*
X5148386Y826772D02*
G03*
X5148386Y826772I-88583J0D01*
G01*
X3296417D02*
G03*
X3296417Y826772I-88583J0D01*
G01*
X3434956Y758943D02*
G03*
X3496991Y706890I62035J10938D01*
G01*
X4770647D02*
G03*
X4832682Y758943I0J62992D01*
G01*
X4852744Y872723D02*
G03*
X4790709Y946654I-62035J10938D01*
G01*
X3476929D02*
G03*
X3414894Y872723I0J-62992D01*
G01*
X3082440Y639764D02*
G03*
X3145432Y576771I62992J0D01*
G01*
X5122205D02*
G03*
X5185198Y639764I0J62992D01*
G01*
Y1013780D02*
G03*
X5122205Y1076772I-62992J0D01*
G01*
X3145432D02*
G03*
X3082440Y1013780I0J-62992D01*
G01*
X8430552Y3937436D02*
G03*
X8333622Y4052953I-96930J17091D01*
G01*
X8313560Y3742323D02*
G03*
X8410490Y3823657I0J98425D01*
G01*
X6943762D02*
G03*
X7040692Y3742323I96930J17091D01*
G01*
X7020630Y4052953D02*
G03*
X6923699Y3937436I0J-98425D01*
G01*
X8691693Y3897638D02*
G03*
X8691693Y3897638I-88583J0D01*
G01*
X6839724D02*
G03*
X6839724Y3897638I-88583J0D01*
G01*
X6978263Y3829809D02*
G03*
X7040298Y3777756I62035J10938D01*
G01*
X8313954D02*
G03*
X8375989Y3829809I0J62992D01*
G01*
X8396051Y3943589D02*
G03*
X8334016Y4017520I-62035J10938D01*
G01*
X7020236D02*
G03*
X6958201Y3943589I0J-62992D01*
G01*
X6625747Y3710630D02*
G03*
X6688739Y3647638I62992J0D01*
G01*
X8665512D02*
G03*
X8728504Y3710630I0J62992D01*
G01*
Y4084646D02*
G03*
X8665512Y4147638I-62992J0D01*
G01*
X6688739D02*
G03*
X6625747Y4084646I0J-62992D01*
G01*
X8430552Y2402003D02*
G03*
X8333622Y2517520I-96930J17091D01*
G01*
X8313560Y2206890D02*
G03*
X8410490Y2288224I0J98425D01*
G01*
X6943762D02*
G03*
X7040692Y2206890I96930J17091D01*
G01*
X7020630Y2517520D02*
G03*
X6923699Y2402003I0J-98425D01*
G01*
X8691693Y2362205D02*
G03*
X8691693Y2362205I-88583J0D01*
G01*
X6839724D02*
G03*
X6839724Y2362205I-88583J0D01*
G01*
X6978263Y2294376D02*
G03*
X7040298Y2242323I62035J10938D01*
G01*
X8313954D02*
G03*
X8375989Y2294376I0J62992D01*
G01*
X8396051Y2408156D02*
G03*
X8334016Y2482087I-62035J10938D01*
G01*
X7020236D02*
G03*
X6958201Y2408156I0J-62992D01*
G01*
X6625747Y2175197D02*
G03*
X6688739Y2112204I62992J0D01*
G01*
X8665512D02*
G03*
X8728504Y2175197I0J62992D01*
G01*
Y2549213D02*
G03*
X8665512Y2612205I-62992J0D01*
G01*
X6688739D02*
G03*
X6625747Y2549213I0J-62992D01*
G01*
X8430552Y866570D02*
G03*
X8333622Y982087I-96930J17091D01*
G01*
X8313560Y671457D02*
G03*
X8410490Y752790I0J98425D01*
G01*
X6943762D02*
G03*
X7040692Y671457I96930J17091D01*
G01*
X7020630Y982087D02*
G03*
X6923699Y866570I0J-98425D01*
G01*
X8691693Y826772D02*
G03*
X8691693Y826772I-88583J0D01*
G01*
X6839724D02*
G03*
X6839724Y826772I-88583J0D01*
G01*
X6978263Y758943D02*
G03*
X7040298Y706890I62035J10938D01*
G01*
X8313954D02*
G03*
X8375989Y758943I0J62992D01*
G01*
X8396051Y872723D02*
G03*
X8334016Y946654I-62035J10938D01*
G01*
X7020236D02*
G03*
X6958201Y872723I0J-62992D01*
G01*
X6625747Y639764D02*
G03*
X6688739Y576771I62992J0D01*
G01*
X8665512D02*
G03*
X8728504Y639764I0J62992D01*
G01*
Y1013780D02*
G03*
X8665512Y1076772I-62992J0D01*
G01*
X6688739D02*
G03*
X6625747Y1013780I0J-62992D01*
G01*
X11186458Y3937436D02*
G03*
X11089528Y4052953I-96930J17091D01*
G01*
X11069466Y3742323D02*
G03*
X11166396Y3823657I0J98425D01*
G01*
X9699667D02*
G03*
X9796597Y3742323I96930J17091D01*
G01*
X9776535Y4052953D02*
G03*
X9679605Y3937436I0J-98425D01*
G01*
X11447599Y3897638D02*
G03*
X11447599Y3897638I-88583J0D01*
G01*
X9595629D02*
G03*
X9595629Y3897638I-88583J0D01*
G01*
X9734169Y3829809D02*
G03*
X9796204Y3777756I62035J10938D01*
G01*
X11069859D02*
G03*
X11131894Y3829809I0J62992D01*
G01*
X11151957Y3943589D02*
G03*
X11089922Y4017520I-62035J10938D01*
G01*
X9776141D02*
G03*
X9714106Y3943589I0J-62992D01*
G01*
X9381653Y3710630D02*
G03*
X9444645Y3647638I62992J0D01*
G01*
X11421418D02*
G03*
X11484410Y3710630I0J62992D01*
G01*
Y4084646D02*
G03*
X11421418Y4147638I-62992J0D01*
G01*
X9444645D02*
G03*
X9381653Y4084646I0J-62992D01*
G01*
X11186458Y2402003D02*
G03*
X11089528Y2517520I-96930J17091D01*
G01*
X11069466Y2206890D02*
G03*
X11166396Y2288224I0J98425D01*
G01*
X9699667D02*
G03*
X9796597Y2206890I96930J17091D01*
G01*
X9776535Y2517520D02*
G03*
X9679605Y2402003I0J-98425D01*
G01*
X11447599Y2362205D02*
G03*
X11447599Y2362205I-88583J0D01*
G01*
X9595629D02*
G03*
X9595629Y2362205I-88583J0D01*
G01*
X9734169Y2294376D02*
G03*
X9796204Y2242323I62035J10938D01*
G01*
X11069859D02*
G03*
X11131894Y2294376I0J62992D01*
G01*
X11151957Y2408156D02*
G03*
X11089922Y2482087I-62035J10938D01*
G01*
X9776141D02*
G03*
X9714106Y2408156I0J-62992D01*
G01*
X9381653Y2175197D02*
G03*
X9444645Y2112204I62992J0D01*
G01*
X11421418D02*
G03*
X11484410Y2175197I0J62992D01*
G01*
Y2549213D02*
G03*
X11421418Y2612205I-62992J0D01*
G01*
X9444645D02*
G03*
X9381653Y2549213I0J-62992D01*
G01*
X15640826Y3868898D02*
G03*
X15699881Y3927953I0J59055D01*
G01*
X15699882Y4418504D02*
G03*
X15640826Y4477559I-59055J0D01*
G01*
X13108935Y4477559D02*
G03*
X13049880Y4418504I0J-59055D01*
G01*
X13049880Y3927953D02*
G03*
X13108935Y3868898I59055J0D01*
G01*
X13260707Y4173228D02*
G03*
X13260707Y4173228I-88583J0D01*
G01*
X15666220D02*
G03*
X15666220Y4173228I-88583J0D01*
G01*
X15432279Y4267586D02*
G03*
X15312086Y4410827I-120193J21193D01*
G01*
X15271336Y3935630D02*
G03*
X15391530Y4036484I0J122047D01*
G01*
X13437676Y4410827D02*
G03*
X13317483Y4267586I0J-122047D01*
G01*
X13358232Y4036484D02*
G03*
X13478425Y3935630I120193J21193D01*
G01*
X15271336Y3955315D02*
G03*
X15372144Y4039902I0J102362D01*
G01*
X13377618D02*
G03*
X13478425Y3955315I100807J17775D01*
G01*
X13437676Y4391142D02*
G03*
X13336868Y4271005I0J-102362D01*
G01*
X15412893D02*
G03*
X15312086Y4391142I-100807J17775D01*
G01*
X15640827Y1388583D02*
G03*
X15699883Y1447638I0J59055D01*
G01*
X15699883Y1938189D02*
G03*
X15640827Y1997244I-59055J0D01*
G01*
X13108936Y1997244D02*
G03*
X13049881Y1938189I0J-59055D01*
G01*
X13049881Y1447638D02*
G03*
X13108936Y1388582I59055J0D01*
G01*
X13260708Y1692913D02*
G03*
X13260708Y1692913I-88583J0D01*
G01*
X15666221D02*
G03*
X15666221Y1692913I-88583J0D01*
G01*
X15432280Y1787271D02*
G03*
X15312087Y1930512I-120193J21193D01*
G01*
X15271337Y1455315D02*
G03*
X15391531Y1556169I0J122047D01*
G01*
X13437677Y1930512D02*
G03*
X13317484Y1787271I0J-122047D01*
G01*
X13358233Y1556169D02*
G03*
X13478426Y1455315I120193J21193D01*
G01*
X15271337Y1475000D02*
G03*
X15372145Y1559587I0J102362D01*
G01*
X13377619D02*
G03*
X13478426Y1475000I100807J17775D01*
G01*
X13437677Y1910827D02*
G03*
X13336870Y1790690I0J-102362D01*
G01*
X15412894D02*
G03*
X15312087Y1910827I-100807J17775D01*
G01*
X15640827Y2648425D02*
G03*
X15699883Y2707480I0J59055D01*
G01*
X15699883Y3198032D02*
G03*
X15640827Y3257087I-59055J0D01*
G01*
X13108936Y3257087D02*
G03*
X13049881Y3198032I0J-59055D01*
G01*
X13049881Y2707480D02*
G03*
X13108936Y2648425I59055J0D01*
G01*
X13260708Y2952756D02*
G03*
X13260708Y2952756I-88583J0D01*
G01*
X15666221D02*
G03*
X15666221Y2952756I-88583J0D01*
G01*
X15432280Y3047114D02*
G03*
X15312087Y3190354I-120193J21193D01*
G01*
X15271337Y2715157D02*
G03*
X15391531Y2816011I0J122047D01*
G01*
X13437677Y3190354D02*
G03*
X13317484Y3047114I0J-122047D01*
G01*
X13358233Y2816011D02*
G03*
X13478426Y2715157I120193J21193D01*
G01*
X15271337Y2734842D02*
G03*
X15372145Y2819430I0J102362D01*
G01*
X13377619D02*
G03*
X13478426Y2734842I100807J17775D01*
G01*
X13437677Y3170669D02*
G03*
X13336870Y3050532I0J-102362D01*
G01*
X15412894D02*
G03*
X15312087Y3170669I-100807J17775D01*
G01*
X15816299Y844882D02*
Y1323622D01*
Y844882D02*
X16154882D01*
Y1323622D01*
X15816299D02*
X16154882D01*
X15835984Y1222638D02*
Y1323622D01*
Y1222638D02*
X15868465D01*
Y1284252D01*
X16100945D01*
Y1269058D02*
Y1284252D01*
X16089134Y1264552D02*
Y1284252D01*
Y1264552D02*
X16100945Y1269058D01*
X16089134Y1103953D02*
X16100945Y1099446D01*
X16089134Y1064552D02*
Y1103953D01*
Y1064552D02*
X16100945Y1069058D01*
X16100960Y1099440D01*
X16089134Y884252D02*
Y903952D01*
X16100945Y899446D01*
Y884252D02*
Y899446D01*
X15868465Y884252D02*
X16100945D01*
X15868465D02*
Y945866D01*
X15835984D02*
X15868465D01*
X15835984Y844882D02*
Y945866D01*
X15817356Y960433D02*
X15835984Y945866D01*
X15817356Y960433D02*
Y1008071D01*
X15835984Y1022638D01*
Y1145866D01*
X15817356Y1160433D02*
X15835984Y1145866D01*
X15817356Y1160433D02*
Y1208071D01*
X15835984Y1222638D01*
X15817356Y1208071D02*
X15880733D01*
X15868465Y1222638D02*
X15880733Y1209607D01*
Y1158897D02*
Y1209607D01*
X15868465Y1145866D02*
X15880733Y1158897D01*
X15868465Y1022638D02*
Y1145866D01*
Y1022638D02*
X15880733Y1009607D01*
Y958897D02*
Y1009607D01*
X15868465Y945866D02*
X15880733Y958897D01*
X15817356Y960433D02*
X15880733D01*
X15817356Y1008071D02*
X15880733D01*
X15835984Y1022638D02*
X15868465D01*
X15835984Y1145866D02*
X15868465D01*
X15817356Y1160433D02*
X15880733D01*
Y884252D02*
Y1284252D01*
X15957542Y1211811D02*
X16053009D01*
X15985591Y1164567D02*
Y1203937D01*
Y1164567D02*
X16024963Y1164565D01*
Y1203937D01*
X15985593Y1203935D02*
X16024963Y1203937D01*
X15985593Y1203935D02*
X15996142Y1193386D01*
Y1175118D02*
Y1193386D01*
X15985593Y1164565D02*
X15996142Y1175118D01*
X16014412Y1193384D02*
X16024963Y1203935D01*
X16014408Y1175118D02*
X16014412Y1193384D01*
X16014408Y1175118D02*
X16024963Y1164565D01*
X15996144Y1175116D02*
X16014412D01*
X15996144Y1193384D02*
X16014412D01*
X15985591Y964567D02*
Y1003937D01*
Y964567D02*
X16024963Y964565D01*
Y1003937D01*
X15985593Y1003935D02*
X16024963Y1003937D01*
X15985593Y1003935D02*
X15996142Y993386D01*
Y975118D02*
Y993386D01*
X15985593Y964565D02*
X15996142Y975118D01*
X16014412Y993384D02*
X16024963Y1003935D01*
X16014408Y975118D02*
X16014412Y993384D01*
X16014408Y975118D02*
X16024963Y964565D01*
X15996144Y975116D02*
X16014412D01*
X15996144Y993384D02*
X16014412D01*
X13108936Y128740D02*
X15640827D01*
X13049881Y187795D02*
Y678347D01*
X13108936Y737402D02*
X15640827D01*
X15699883Y187795D02*
Y678347D01*
X13478426Y195472D02*
X15271337D01*
X15391531Y296326D02*
X15432280Y527429D01*
X13437677Y670669D02*
X15312087D01*
X13478426Y215157D02*
X15271337D01*
X13336870Y530847D02*
X13377619Y299745D01*
X13437677Y650985D02*
X15312087D01*
X15372145Y299745D02*
X15412894Y530847D01*
X13317484Y527429D02*
X13358233Y296326D01*
X9796597Y671457D02*
X11069466D01*
X9796204Y706890D02*
X11069859D01*
X9679605Y866570D02*
X9699667Y752790D01*
X9714106Y872723D02*
X9734169Y758943D01*
X9776535Y982087D02*
X11089528D01*
X11166396Y752790D02*
X11186458Y866570D01*
X11131894Y758943D02*
X11151957Y872723D01*
X9776141Y946654D02*
X11089922D01*
X9381653Y639764D02*
Y1013780D01*
X9444645Y1076772D02*
X11421418D01*
X11484410Y639764D02*
Y1013780D01*
X9444645Y576772D02*
X11421418D01*
X741479Y3742323D02*
X2014347D01*
X741086Y3777756D02*
X2014741D01*
X624487Y3937436D02*
X644549Y3823657D01*
X658988Y3943589D02*
X679050Y3829809D01*
X721417Y4052953D02*
X2034410D01*
X2111277Y3823657D02*
X2131340Y3937436D01*
X2076776Y3829809D02*
X2096839Y3943589D01*
X721023Y4017520D02*
X2034803D01*
X326535Y3710630D02*
Y4084646D01*
X389527Y4147638D02*
X2366300D01*
X2429292Y3710630D02*
Y4084646D01*
X389527Y3647638D02*
X2366300D01*
X741479Y2206890D02*
X2014347D01*
X741086Y2242323D02*
X2014741D01*
X624487Y2402003D02*
X644549Y2288224D01*
X658988Y2408156D02*
X679050Y2294376D01*
X721417Y2517520D02*
X2034410D01*
X2111277Y2288224D02*
X2131340Y2402003D01*
X2076776Y2294376D02*
X2096839Y2408156D01*
X721023Y2482087D02*
X2034803D01*
X326535Y2175197D02*
Y2549213D01*
X389527Y2612205D02*
X2366300D01*
X2429292Y2175197D02*
Y2549213D01*
X389527Y2112205D02*
X2366300D01*
X741479Y671457D02*
X2014347D01*
X741086Y706890D02*
X2014741D01*
X624487Y866570D02*
X644549Y752790D01*
X658988Y872723D02*
X679050Y758943D01*
X721417Y982087D02*
X2034410D01*
X2111277Y752790D02*
X2131340Y866570D01*
X2076776Y758943D02*
X2096839Y872723D01*
X721023Y946654D02*
X2034803D01*
X326535Y639764D02*
Y1013780D01*
X389527Y1076772D02*
X2366300D01*
X2429292Y639764D02*
Y1013780D01*
X389527Y576772D02*
X2366300D01*
X3497385Y3742323D02*
X4770253D01*
X3496991Y3777756D02*
X4770647D01*
X3380392Y3937436D02*
X3400455Y3823657D01*
X3414894Y3943589D02*
X3434956Y3829809D01*
X3477323Y4052953D02*
X4790315D01*
X4867183Y3823657D02*
X4887245Y3937436D01*
X4832682Y3829809D02*
X4852744Y3943589D01*
X3476929Y4017520D02*
X4790709D01*
X3082440Y3710630D02*
Y4084646D01*
X3145432Y4147638D02*
X5122205D01*
X5185197Y3710630D02*
Y4084646D01*
X3145432Y3647638D02*
X5122205D01*
X3497385Y2206890D02*
X4770253D01*
X3496991Y2242323D02*
X4770647D01*
X3380392Y2402003D02*
X3400455Y2288224D01*
X3414894Y2408156D02*
X3434956Y2294376D01*
X3477323Y2517520D02*
X4790315D01*
X4867183Y2288224D02*
X4887245Y2402003D01*
X4832682Y2294376D02*
X4852744Y2408156D01*
X3476929Y2482087D02*
X4790709D01*
X3082440Y2175197D02*
Y2549213D01*
X3145432Y2612205D02*
X5122205D01*
X5185197Y2175197D02*
Y2549213D01*
X3145432Y2112205D02*
X5122205D01*
X3497385Y671457D02*
X4770253D01*
X3496991Y706890D02*
X4770647D01*
X3380392Y866570D02*
X3400455Y752790D01*
X3414894Y872723D02*
X3434956Y758943D01*
X3477323Y982087D02*
X4790315D01*
X4867183Y752790D02*
X4887245Y866570D01*
X4832682Y758943D02*
X4852744Y872723D01*
X3476929Y946654D02*
X4790709D01*
X3082440Y639764D02*
Y1013780D01*
X3145432Y1076772D02*
X5122205D01*
X5185197Y639764D02*
Y1013780D01*
X3145432Y576772D02*
X5122205D01*
X7040692Y3742323D02*
X8313560D01*
X7040298Y3777756D02*
X8313954D01*
X6923699Y3937436D02*
X6943762Y3823657D01*
X6958201Y3943589D02*
X6978263Y3829809D01*
X7020630Y4052953D02*
X8333622D01*
X8410490Y3823657D02*
X8430552Y3937436D01*
X8375989Y3829809D02*
X8396051Y3943589D01*
X7020236Y4017520D02*
X8334016D01*
X6625747Y3710630D02*
Y4084646D01*
X6688739Y4147638D02*
X8665512D01*
X8728504Y3710630D02*
Y4084646D01*
X6688739Y3647638D02*
X8665512D01*
X7040692Y2206890D02*
X8313560D01*
X7040298Y2242323D02*
X8313954D01*
X6923699Y2402003D02*
X6943762Y2288224D01*
X6958201Y2408156D02*
X6978263Y2294376D01*
X7020630Y2517520D02*
X8333622D01*
X8410490Y2288224D02*
X8430552Y2402003D01*
X8375989Y2294376D02*
X8396051Y2408156D01*
X7020236Y2482087D02*
X8334016D01*
X6625747Y2175197D02*
Y2549213D01*
X6688739Y2612205D02*
X8665512D01*
X8728504Y2175197D02*
Y2549213D01*
X6688739Y2112205D02*
X8665512D01*
X7040692Y671457D02*
X8313560D01*
X7040298Y706890D02*
X8313954D01*
X6923699Y866570D02*
X6943762Y752790D01*
X6958201Y872723D02*
X6978263Y758943D01*
X7020630Y982087D02*
X8333622D01*
X8410490Y752790D02*
X8430552Y866570D01*
X8375989Y758943D02*
X8396051Y872723D01*
X7020236Y946654D02*
X8334016D01*
X6625747Y639764D02*
Y1013780D01*
X6688739Y1076772D02*
X8665512D01*
X8728504Y639764D02*
Y1013780D01*
X6688739Y576772D02*
X8665512D01*
X9796597Y3742323D02*
X11069466D01*
X9796204Y3777756D02*
X11069859D01*
X9679605Y3937436D02*
X9699667Y3823657D01*
X9714106Y3943589D02*
X9734169Y3829809D01*
X9776535Y4052953D02*
X11089528D01*
X11166396Y3823657D02*
X11186458Y3937436D01*
X11131894Y3829809D02*
X11151957Y3943589D01*
X9776141Y4017520D02*
X11089922D01*
X9381653Y3710630D02*
Y4084646D01*
X9444645Y4147638D02*
X11421418D01*
X11484410Y3710630D02*
Y4084646D01*
X9444645Y3647638D02*
X11421418D01*
X9796597Y2206890D02*
X11069466D01*
X9796204Y2242323D02*
X11069859D01*
X9679605Y2402003D02*
X9699667Y2288224D01*
X9714106Y2408156D02*
X9734169Y2294376D01*
X9776535Y2517520D02*
X11089528D01*
X11166396Y2288224D02*
X11186458Y2402003D01*
X11131894Y2294376D02*
X11151957Y2408156D01*
X9776141Y2482087D02*
X11089922D01*
X9381653Y2175197D02*
Y2549213D01*
X9444645Y2612205D02*
X11421418D01*
X11484410Y2175197D02*
Y2549213D01*
X9444645Y2112205D02*
X11421418D01*
X13108935Y3868898D02*
X15640826D01*
X13049880Y3927953D02*
Y4418504D01*
X13108935Y4477559D02*
X15640826D01*
X15699881Y3927953D02*
Y4418504D01*
X13478425Y3935630D02*
X15271336D01*
X15391530Y4036484D02*
X15432279Y4267586D01*
X13437676Y4410827D02*
X15312086D01*
X13478425Y3955315D02*
X15271336D01*
X13336868Y4271005D02*
X13377618Y4039902D01*
X13437676Y4391142D02*
X15312086D01*
X15372144Y4039902D02*
X15412893Y4271005D01*
X13317482Y4267586D02*
X13358232Y4036484D01*
X13108936Y1388582D02*
X15640827D01*
X13049881Y1447638D02*
Y1938189D01*
X13108936Y1997244D02*
X15640827D01*
X15699883Y1447638D02*
Y1938189D01*
X13478426Y1455315D02*
X15271337D01*
X15391531Y1556169D02*
X15432280Y1787271D01*
X13437677Y1930512D02*
X15312087D01*
X13478426Y1475000D02*
X15271337D01*
X13336870Y1790690D02*
X13377619Y1559587D01*
X13437677Y1910827D02*
X15312087D01*
X15372145Y1559587D02*
X15412894Y1790690D01*
X13317484Y1787271D02*
X13358233Y1556169D01*
X13108936Y2648425D02*
X15640827D01*
X13049881Y2707480D02*
Y3198032D01*
X13108936Y3257087D02*
X15640827D01*
X15699883Y2707480D02*
Y3198032D01*
X13478426Y2715157D02*
X15271337D01*
X15391531Y2816011D02*
X15432280Y3047114D01*
X13437677Y3190354D02*
X15312087D01*
X13478426Y2734842D02*
X15271337D01*
X13336870Y3050532D02*
X13377619Y2819430D01*
X13437677Y3170669D02*
X15312087D01*
X15372145Y2819430D02*
X15412894Y3050532D01*
X13317484Y3047114D02*
X13358233Y2816011D01*
%TF.MD5,e3cac0fc155f0ab8a24b5f480bb5f3f8*%
M02*
