ISO-10303-21;
HEADER;
/* Generated by software containing ST-Developer
 * from STEP Tools, Inc. (www.steptools.com) 
 */
/* OPTION: using custom schema-name function */

FILE_DESCRIPTION(
/* description */ (''),
/* implementation_level */ '2;1');

FILE_NAME(
/* name */ '014944_C.stp',
/* time_stamp */ '2018-02-22T08:43:08+01:00',
/* author */ (''),
/* organization */ (''),
/* preprocessor_version */ 'ST-DEVELOPER v16',
/* originating_system */ 'SIEMENS PLM Software NX 10.0',
/* authorisation */ '');

FILE_SCHEMA (('AUTOMOTIVE_DESIGN { 1 0 10303 214 3 1 1 1 }'));
ENDSEC;

DATA;
#10=SHAPE_REPRESENTATION_RELATIONSHIP('None',
'relationship between 014944_C-None and 014944_C-None',#22,#11);
#11=ADVANCED_BREP_SHAPE_REPRESENTATION('014944_C-None',(#32),#279);
#12=SHAPE_DEFINITION_REPRESENTATION(#13,#22);
#13=PRODUCT_DEFINITION_SHAPE('','',#14);
#14=PRODUCT_DEFINITION(' ','',#16,#15);
#15=PRODUCT_DEFINITION_CONTEXT('part definition',#21,'design');
#16=PRODUCT_DEFINITION_FORMATION_WITH_SPECIFIED_SOURCE(' ',' ',#18,
 .NOT_KNOWN.);
#17=PRODUCT_RELATED_PRODUCT_CATEGORY('part','',(#18));
#18=PRODUCT('014944_C','014944_C',' ',(#19));
#19=PRODUCT_CONTEXT(' ',#21,'mechanical');
#20=APPLICATION_PROTOCOL_DEFINITION('international standard',
'automotive_design',2010,#21);
#21=APPLICATION_CONTEXT(
'core data for automotive mechanical design processes');
#22=SHAPE_REPRESENTATION('014944_C-None',(#166),#279);
#23=PRESENTATION_LAYER_ASSIGNMENT('1','Layer 1',(#32));
#24=STYLED_ITEM('',(#25),#32);
#25=PRESENTATION_STYLE_ASSIGNMENT((#26));
#26=SURFACE_STYLE_USAGE(.BOTH.,#27);
#27=SURFACE_SIDE_STYLE('',(#28));
#28=SURFACE_STYLE_FILL_AREA(#29);
#29=FILL_AREA_STYLE('',(#30));
#30=FILL_AREA_STYLE_COLOUR('',#31);
#31=COLOUR_RGB('Medium Steel',0.596063172350652,0.666666666666667,0.686259250782025);
#32=MANIFOLD_SOLID_BREP('',#33);
#33=CLOSED_SHELL('',(#40,#41,#42,#43,#44,#45,#46,#47,#48,#49,#50,#51));
#34=PLANE('',#189);
#35=PLANE('',#190);
#36=TOROIDAL_SURFACE('',#174,319.999999999999,11.5);
#37=TOROIDAL_SURFACE('',#176,319.999999999999,8.15);
#38=TOROIDAL_SURFACE('',#182,150.,11.5);
#39=TOROIDAL_SURFACE('',#184,150.,8.15);
#40=ADVANCED_FACE('',(#58,#59),#52,.T.);
#41=ADVANCED_FACE('',(#60,#61),#53,.F.);
#42=ADVANCED_FACE('',(#62,#63),#36,.T.);
#43=ADVANCED_FACE('',(#64,#65),#37,.F.);
#44=ADVANCED_FACE('',(#66,#67),#54,.T.);
#45=ADVANCED_FACE('',(#68,#69),#55,.F.);
#46=ADVANCED_FACE('',(#70,#71),#38,.T.);
#47=ADVANCED_FACE('',(#72,#73),#39,.F.);
#48=ADVANCED_FACE('',(#74,#75),#56,.F.);
#49=ADVANCED_FACE('',(#76,#77),#57,.T.);
#50=ADVANCED_FACE('',(#78,#79),#34,.T.);
#51=ADVANCED_FACE('',(#80,#81),#35,.F.);
#52=CYLINDRICAL_SURFACE('',#169,11.5);
#53=CYLINDRICAL_SURFACE('',#172,8.15);
#54=CYLINDRICAL_SURFACE('',#178,11.5);
#55=CYLINDRICAL_SURFACE('',#180,8.15);
#56=CYLINDRICAL_SURFACE('',#186,8.15);
#57=CYLINDRICAL_SURFACE('',#188,11.5);
#58=FACE_BOUND('',#82,.T.);
#59=FACE_BOUND('',#83,.T.);
#60=FACE_BOUND('',#84,.T.);
#61=FACE_BOUND('',#85,.T.);
#62=FACE_BOUND('',#86,.T.);
#63=FACE_BOUND('',#87,.T.);
#64=FACE_BOUND('',#88,.T.);
#65=FACE_BOUND('',#89,.T.);
#66=FACE_BOUND('',#90,.T.);
#67=FACE_BOUND('',#91,.T.);
#68=FACE_BOUND('',#92,.T.);
#69=FACE_BOUND('',#93,.T.);
#70=FACE_BOUND('',#94,.T.);
#71=FACE_BOUND('',#95,.T.);
#72=FACE_BOUND('',#96,.T.);
#73=FACE_BOUND('',#97,.T.);
#74=FACE_BOUND('',#98,.T.);
#75=FACE_BOUND('',#99,.T.);
#76=FACE_BOUND('',#100,.T.);
#77=FACE_BOUND('',#101,.T.);
#78=FACE_BOUND('',#102,.T.);
#79=FACE_BOUND('',#103,.T.);
#80=FACE_BOUND('',#104,.T.);
#81=FACE_BOUND('',#105,.T.);
#82=EDGE_LOOP('',(#106));
#83=EDGE_LOOP('',(#107));
#84=EDGE_LOOP('',(#108));
#85=EDGE_LOOP('',(#109));
#86=EDGE_LOOP('',(#110));
#87=EDGE_LOOP('',(#111));
#88=EDGE_LOOP('',(#112));
#89=EDGE_LOOP('',(#113));
#90=EDGE_LOOP('',(#114));
#91=EDGE_LOOP('',(#115));
#92=EDGE_LOOP('',(#116));
#93=EDGE_LOOP('',(#117));
#94=EDGE_LOOP('',(#118));
#95=EDGE_LOOP('',(#119));
#96=EDGE_LOOP('',(#120));
#97=EDGE_LOOP('',(#121));
#98=EDGE_LOOP('',(#122));
#99=EDGE_LOOP('',(#123));
#100=EDGE_LOOP('',(#124));
#101=EDGE_LOOP('',(#125));
#102=EDGE_LOOP('',(#126));
#103=EDGE_LOOP('',(#127));
#104=EDGE_LOOP('',(#128));
#105=EDGE_LOOP('',(#129));
#106=ORIENTED_EDGE('',*,*,#142,.T.);
#107=ORIENTED_EDGE('',*,*,#143,.F.);
#108=ORIENTED_EDGE('',*,*,#144,.F.);
#109=ORIENTED_EDGE('',*,*,#145,.T.);
#110=ORIENTED_EDGE('',*,*,#146,.T.);
#111=ORIENTED_EDGE('',*,*,#142,.F.);
#112=ORIENTED_EDGE('',*,*,#147,.F.);
#113=ORIENTED_EDGE('',*,*,#144,.T.);
#114=ORIENTED_EDGE('',*,*,#148,.T.);
#115=ORIENTED_EDGE('',*,*,#146,.F.);
#116=ORIENTED_EDGE('',*,*,#149,.F.);
#117=ORIENTED_EDGE('',*,*,#147,.T.);
#118=ORIENTED_EDGE('',*,*,#150,.T.);
#119=ORIENTED_EDGE('',*,*,#148,.F.);
#120=ORIENTED_EDGE('',*,*,#151,.F.);
#121=ORIENTED_EDGE('',*,*,#149,.T.);
#122=ORIENTED_EDGE('',*,*,#151,.T.);
#123=ORIENTED_EDGE('',*,*,#152,.F.);
#124=ORIENTED_EDGE('',*,*,#150,.F.);
#125=ORIENTED_EDGE('',*,*,#153,.T.);
#126=ORIENTED_EDGE('',*,*,#145,.F.);
#127=ORIENTED_EDGE('',*,*,#143,.T.);
#128=ORIENTED_EDGE('',*,*,#152,.T.);
#129=ORIENTED_EDGE('',*,*,#153,.F.);
#130=VERTEX_POINT('',#243);
#131=VERTEX_POINT('',#245);
#132=VERTEX_POINT('',#248);
#133=VERTEX_POINT('',#250);
#134=VERTEX_POINT('',#253);
#135=VERTEX_POINT('',#256);
#136=VERTEX_POINT('',#259);
#137=VERTEX_POINT('',#262);
#138=VERTEX_POINT('',#265);
#139=VERTEX_POINT('',#268);
#140=VERTEX_POINT('',#271);
#141=VERTEX_POINT('',#274);
#142=EDGE_CURVE('',#130,#130,#154,.T.);
#143=EDGE_CURVE('',#131,#131,#155,.T.);
#144=EDGE_CURVE('',#132,#132,#156,.T.);
#145=EDGE_CURVE('',#133,#133,#157,.T.);
#146=EDGE_CURVE('',#134,#134,#158,.T.);
#147=EDGE_CURVE('',#135,#135,#159,.T.);
#148=EDGE_CURVE('',#136,#136,#160,.T.);
#149=EDGE_CURVE('',#137,#137,#161,.T.);
#150=EDGE_CURVE('',#138,#138,#162,.T.);
#151=EDGE_CURVE('',#139,#139,#163,.T.);
#152=EDGE_CURVE('',#140,#140,#164,.T.);
#153=EDGE_CURVE('',#141,#141,#165,.T.);
#154=CIRCLE('',#167,11.5);
#155=CIRCLE('',#168,11.5);
#156=CIRCLE('',#170,8.15);
#157=CIRCLE('',#171,8.15);
#158=CIRCLE('',#173,11.5);
#159=CIRCLE('',#175,8.15);
#160=CIRCLE('',#177,11.5);
#161=CIRCLE('',#179,8.15);
#162=CIRCLE('',#181,11.5);
#163=CIRCLE('',#183,8.15);
#164=CIRCLE('',#185,8.15);
#165=CIRCLE('',#187,11.5);
#166=AXIS2_PLACEMENT_3D('',#241,#191,#192);
#167=AXIS2_PLACEMENT_3D('',#242,#193,#194);
#168=AXIS2_PLACEMENT_3D('',#244,#195,#196);
#169=AXIS2_PLACEMENT_3D('',#246,#197,#198);
#170=AXIS2_PLACEMENT_3D('',#247,#199,#200);
#171=AXIS2_PLACEMENT_3D('',#249,#201,#202);
#172=AXIS2_PLACEMENT_3D('',#251,#203,#204);
#173=AXIS2_PLACEMENT_3D('',#252,#205,#206);
#174=AXIS2_PLACEMENT_3D('',#254,#207,#208);
#175=AXIS2_PLACEMENT_3D('',#255,#209,#210);
#176=AXIS2_PLACEMENT_3D('',#257,#211,#212);
#177=AXIS2_PLACEMENT_3D('',#258,#213,#214);
#178=AXIS2_PLACEMENT_3D('',#260,#215,#216);
#179=AXIS2_PLACEMENT_3D('',#261,#217,#218);
#180=AXIS2_PLACEMENT_3D('',#263,#219,#220);
#181=AXIS2_PLACEMENT_3D('',#264,#221,#222);
#182=AXIS2_PLACEMENT_3D('',#266,#223,#224);
#183=AXIS2_PLACEMENT_3D('',#267,#225,#226);
#184=AXIS2_PLACEMENT_3D('',#269,#227,#228);
#185=AXIS2_PLACEMENT_3D('',#270,#229,#230);
#186=AXIS2_PLACEMENT_3D('',#272,#231,#232);
#187=AXIS2_PLACEMENT_3D('',#273,#233,#234);
#188=AXIS2_PLACEMENT_3D('',#275,#235,#236);
#189=AXIS2_PLACEMENT_3D('',#276,#237,#238);
#190=AXIS2_PLACEMENT_3D('',#277,#239,#240);
#191=DIRECTION('',(0.,0.,1.));
#192=DIRECTION('',(1.,0.,0.));
#193=DIRECTION('',(1.,0.,-5.0532154980743E-16));
#194=DIRECTION('',(0.,0.,-1.));
#195=DIRECTION('',(1.,0.,-5.0532154980743E-16));
#196=DIRECTION('',(0.,0.,-1.));
#197=DIRECTION('',(1.,0.,-1.38385088303651E-18));
#198=DIRECTION('',(0.,0.,-1.));
#199=DIRECTION('',(1.,0.,-5.0532154980743E-16));
#200=DIRECTION('',(0.,0.,-1.));
#201=DIRECTION('',(1.,0.,-5.0532154980743E-16));
#202=DIRECTION('',(0.,0.,-1.));
#203=DIRECTION('',(1.,0.,-1.38385088303651E-18));
#204=DIRECTION('',(0.,0.,-1.));
#205=DIRECTION('',(-1.,0.,-5.0532154980743E-16));
#206=DIRECTION('',(0.,0.,0.999999999999996));
#207=DIRECTION('',(0.,-1.,0.));
#208=DIRECTION('',(0.,0.,-1.));
#209=DIRECTION('',(-1.,0.,-5.0532154980743E-16));
#210=DIRECTION('',(0.,0.,0.999999999999999));
#211=DIRECTION('',(0.,-1.,0.));
#212=DIRECTION('',(0.,0.,-1.));
#213=DIRECTION('',(-1.,0.,-5.0532154980743E-16));
#214=DIRECTION('',(0.,0.,0.999999999999996));
#215=DIRECTION('',(-1.,0.,0.));
#216=DIRECTION('',(0.,0.,0.999999999999996));
#217=DIRECTION('',(-1.,0.,-5.0532154980743E-16));
#218=DIRECTION('',(0.,0.,0.999999999999999));
#219=DIRECTION('',(-1.,0.,0.));
#220=DIRECTION('',(0.,0.,0.999999999999999));
#221=DIRECTION('',(0.,0.,-1.));
#222=DIRECTION('',(-0.999999999999986,0.,0.));
#223=DIRECTION('',(0.,1.,0.));
#224=DIRECTION('',(0.,0.,1.));
#225=DIRECTION('',(0.,0.,-1.));
#226=DIRECTION('',(-0.999999999999958,0.,0.));
#227=DIRECTION('',(0.,1.,0.));
#228=DIRECTION('',(0.,0.,1.));
#229=DIRECTION('',(0.,0.,-1.));
#230=DIRECTION('',(-0.999999999999958,0.,0.));
#231=DIRECTION('',(0.,0.,1.));
#232=DIRECTION('',(0.999999999999958,0.,0.));
#233=DIRECTION('',(0.,0.,-1.));
#234=DIRECTION('',(-0.999999999999986,0.,0.));
#235=DIRECTION('',(0.,0.,1.));
#236=DIRECTION('',(0.999999999999986,0.,0.));
#237=DIRECTION('',(1.,0.,-5.0532154980743E-16));
#238=DIRECTION('',(-4.9960036108132E-16,0.,-1.));
#239=DIRECTION('',(0.,0.,-1.));
#240=DIRECTION('',(-1.,0.,0.));
#241=CARTESIAN_POINT('',(0.,0.,0.));
#242=CARTESIAN_POINT('',(-5000.,0.,6.66133814775094E-13));
#243=CARTESIAN_POINT('',(-5000.,0.,-11.4999999999993));
#244=CARTESIAN_POINT('',(140.599999999998,0.,6.59214560359911E-13));
#245=CARTESIAN_POINT('',(140.599999999998,0.,-11.4999999999993));
#246=CARTESIAN_POINT('',(-5000.,0.,6.66133814775094E-13));
#247=CARTESIAN_POINT('',(-5000.,0.,6.66133814775094E-13));
#248=CARTESIAN_POINT('',(-5000.,0.,-8.14999999999933));
#249=CARTESIAN_POINT('',(140.599999999998,0.,6.59214560359911E-13));
#250=CARTESIAN_POINT('',(140.599999999998,0.,-8.14999999999934));
#251=CARTESIAN_POINT('',(-5000.,0.,6.66133814775094E-13));
#252=CARTESIAN_POINT('',(-5000.,0.,639.999999999999));
#253=CARTESIAN_POINT('',(-5000.,0.,651.499999999999));
#254=CARTESIAN_POINT('',(-5000.,0.,320.));
#255=CARTESIAN_POINT('',(-5000.,0.,639.999999999999));
#256=CARTESIAN_POINT('',(-5000.,0.,648.149999999999));
#257=CARTESIAN_POINT('',(-5000.,0.,320.));
#258=CARTESIAN_POINT('',(-4197.,0.,639.999999999999));
#259=CARTESIAN_POINT('',(-4197.,0.,651.499999999999));
#260=CARTESIAN_POINT('',(-4197.,0.,639.999999999999));
#261=CARTESIAN_POINT('',(-4197.,0.,639.999999999999));
#262=CARTESIAN_POINT('',(-4197.,0.,648.149999999999));
#263=CARTESIAN_POINT('',(-4197.,0.,639.999999999999));
#264=CARTESIAN_POINT('',(-4047.,0.,790.));
#265=CARTESIAN_POINT('',(-4058.5,0.,790.));
#266=CARTESIAN_POINT('',(-4197.,0.,790.));
#267=CARTESIAN_POINT('',(-4047.,0.,790.));
#268=CARTESIAN_POINT('',(-4055.15,0.,790.));
#269=CARTESIAN_POINT('',(-4197.,0.,790.));
#270=CARTESIAN_POINT('',(-4047.,0.,797.));
#271=CARTESIAN_POINT('',(-4055.15,0.,797.));
#272=CARTESIAN_POINT('',(-4047.,0.,790.));
#273=CARTESIAN_POINT('',(-4047.,0.,797.));
#274=CARTESIAN_POINT('',(-4058.5,0.,797.));
#275=CARTESIAN_POINT('',(-4047.,0.,790.));
#276=CARTESIAN_POINT('',(140.599999999998,0.,6.59214560359911E-13));
#277=CARTESIAN_POINT('',(-4047.,0.,797.));
#278=MECHANICAL_DESIGN_GEOMETRIC_PRESENTATION_REPRESENTATION('',(#24),#279);
#279=(
GEOMETRIC_REPRESENTATION_CONTEXT(3)
GLOBAL_UNCERTAINTY_ASSIGNED_CONTEXT((#280))
GLOBAL_UNIT_ASSIGNED_CONTEXT((#286,#282,#281))
REPRESENTATION_CONTEXT('014944_C','TOP_LEVEL_ASSEMBLY_PART')
);
#280=UNCERTAINTY_MEASURE_WITH_UNIT(LENGTH_MEASURE(2.E-5),#286,
'DISTANCE_ACCURACY_VALUE','Maximum Tolerance applied to model');
#281=(
NAMED_UNIT(*)
SI_UNIT($,.STERADIAN.)
SOLID_ANGLE_UNIT()
);
#282=(
CONVERSION_BASED_UNIT('DEGREE',#284)
NAMED_UNIT(#283)
PLANE_ANGLE_UNIT()
);
#283=DIMENSIONAL_EXPONENTS(0.,0.,0.,0.,0.,0.,0.);
#284=PLANE_ANGLE_MEASURE_WITH_UNIT(PLANE_ANGLE_MEASURE(0.0174532925),#285);
#285=(
NAMED_UNIT(*)
PLANE_ANGLE_UNIT()
SI_UNIT($,.RADIAN.)
);
#286=(
LENGTH_UNIT()
NAMED_UNIT(*)
SI_UNIT(.MILLI.,.METRE.)
);
ENDSEC;
END-ISO-10303-21;
